{
  "workshops": [
    {
      "language": ["de","en"],
      "title": "Docker",
      "short": "Docker ist ein Softwareprojekt zur Betriebssystemvirtualisierung und seit ein paar Jahren in der Software-Entwicklung ein Thema, an dem nur die wenige vorbeikommen. Aber was ist das eigentlich? Und viel wichtiger: Wie benutze ich es so, dass es mich auch voran bringt? Diesen und vielen weiteren Fragen wollen wir uns in diesem Hands-On Workshop widmen. Die Gestaltung der Inhalte wird sich stark an den Bedürfnissen und dem Kenntnisstand der Teilnehmer orientieren und ist nicht streng durchgetaktet. Ziel des Workshops ist es, die Teilnehmer von den absoluten Grundlagen bis hin zu einer funktionieren Deployment Pipeline für moderne Software-Projekte zu begleiten und auf dem Weg dorthin viel interessantes aus dem Docker Ökosystem kennenzulernen. Da es ein Hand-On Workshop ist, ist es sinnvoll, ein eigenes Laptop mit installiertem Linux mitzubringen, es gibt Docker auch für Windows und MacOS. Die Teilnehmer die letztere Betriebssysteme benutzen wollen, sollten sich aber darauf einstellen, dass sich ihre Systeme an einigen Stellen etwas merkwürdig verhalten. Besondere Hardware-Anforderungen gibt es nicht, 1GB freien RAM und ein paar Gigabyte freien Plattenplatz sollte das Gerät aber zur Verfügung haben.<br/>Grober Ablauf mit fließenden Übergängen:<ul><li><span class=\"text-mono\">13:00-15:00</span>: Praktische Einführung in Docker (Arbeiten mit dem Docker Hub und Erstellen eigener Images)</li><li><span class=\"text-mono\">15:00-17:00</span>: Multi-Host Docker, Docker Networking, Orchestrierung</li><li><span class=\"text-mono\">17:00-19:00</span>: Aufbau einer kompletten Continuous Development/Deployment Pipeline für die Software-Entwicklung</li></ul>",
      "author": "Mathias Velten",
      "times": [{
          "datetime": "2017/05/20 13:00",
          "duration": 360
      }],
      "room": "0.101"
    }
  ]
}
