{
  "2019/05/24": [
    { "time": "14:30", "presentation": "greeting", "room": "MN14 (GZG)" },
    { "time": "15:00", "presentation": "Kopano im Einsatz beim CERN", "room": "MN14 (GZG)" },
    { "time": "16:00", "presentation": "Studip: Gemeinsam gegen Alle", "room": "MN14 (GZG)" },
    { "time": "17:00", "presentation": "Kollidierende Anforderungen an die IT-Sicherheit", "room": "MN14 (GZG)" },
    { "time": "18:00", "presentation": "irgendwas von Flavia", "room": "MN14 (GZG)" },
    { "time": "18:30", "presentation": "social", "room": "draußen" },
    { "time": "20:00", "presentation": "jeopardy", "room": "MN14 (GZG)" },
    { "time": "21:00", "presentation": "social2", "room": "0.101 Ifi" }
  ],
  "2019/05/25": [
    { "time": "13:00", "presentation": "Geschlecht ist kein boolean", "room": "MN14 (GZG)" },
    { "time": "14:00", "presentation": "Der Studienausweis", "room": "MN14 (GZG)" },
    { "time": "15:00", "presentation": "Wissenschaftskommunikation in der Gesellschaft", "room": "MN14 (GZG)" },
    { "time": "15:00", "presentation": "Infrastructure as Code", "room": "0.101 Ifi" },
    { "time": "16:00", "presentation": "RE: Speichersicherheit", "room": "MN14 (GZG)" },
    { "time": "17:00", "presentation": "Optimization problems in Python", "room": "MN14 (GZG)" },
    { "time": "18:00", "presentation": "KI Fails", "room": "MN14 (GZG)" },
    { "time": "18:30", "presentation": "social", "room": "draußen" },
    { "time": "20:00", "presentation": "Das sIT Famillienduell", "room": "MN14 (GZG)" },
    { "time": "21:00", "presentation": "social2", "room": "0.101 Ifi" }
  ],
  "2019/05/26": [
    { "time": "10:00", "presentation": "wahl"},
    { "time": "12:00", "presentation": "challenge", "room": "-1.101 (IfI)" },
    { "time": "13:00", "presentation": "calliope", "room": "-1.110 (IfI)" },
    { "time": "14:00", "presentation": "social2", "room": "0.101 Ifi" }
  ]
}
