{
  "workshops": [
    {
      "language": ["de"],
      "title": "Rust",
      "short": "<a href=\"https://www.rust-lang.org/\" target=\"_blank\">Rust</a> ist eine moderne Sprache mit einem Fokus auf Performanz, Zuverlässlichkeit und Produktivität. In diesem Workshop erfahrt ihr, warum wir Rust so cool finden, dass wir uns in unserer Freizeit damit beschäftigen. Ihr bekommt einen Einblick in die Grundlagen der Sprache und könnt das Gelernte direkt in praktischen Aufgaben ausprobieren.<br>Dieser Workshop richtet sich an Personen, die Informatik I gehört oder vergleichbare Programmiererfahrung in einer beliebigen Sprache haben.<br>Ihr könnt euren eigenen Laptop mitbringen oder an einem Unirechner arbeiten (vermutlich gibt es Gastaccounts).",
      "times": [
        {
          "datetime": "2021/09/04 11:00",
          "duration": 180
        }
      ],
      "author": ["Robin<robin-codes@posteo.de>", "Niklas"],
      "details": "<br><br><a href=\"https://lageplan.uni-goettingen.de/?ident=1487_1_EG_0.103\">Raum 0.102 Ifi-Provisorium</a>"
    },
    {
      "language": ["de"],
      "title": "Redis",
      "short": "Einstieg in das etwas andere Datenbanksystem Redis",
      "times": [
        {
          "datetime": "2021/09/03 16:30",
          "duration": 60
        }
      ],
      "author": "Jake",
      "details": "<br><br><a href=\"https://lageplan.uni-goettingen.de/?ident=1487_1_EG_0.103\">Raum 0.102 Ifi-Provisorium</a>"
    },
    {
      "language": ["de"],
      "title": "Datenauskunftsgesuche",
      "short": "Wir wollen gemeinsam Datenauskunftsgesuche stellen und uns über Erfahrungen austauschen.",
      "times": [
        {
          "datetime": "2021/09/05 12:00",
          "duration": 60
        }
      ],
      "author": "Sergio",
      "details": "<br><br><a href=\"https://lageplan.uni-goettingen.de/?ident=1487_1_EG_0.103\">Raum 0.102 Ifi-Provisorium</a>"
    },
    {
      "language": ["de", "en"],
      "title": "Sonic Pi",
      "short": "<a href=\"https://sonic-pi.net/\">Sonic Pi</a> ist eine live Umgebung um Musik zu programmieren. Wir gehen ein paar Grundlagen durch und werden dann schauen was wir an Musik programmiert bekommen. Am besten habt ihr euch Sonic Pi schon installiert, aber wenn es dabei Probleme gibt können wir die bestimmt auch dann noch fixen.\nUnd bringt auf jeden Fall auch Kopfhörer mit.",
      "times": [
        {
          "datetime": "2021/09/05 15:00",
          "duration": 120
        }
      ],
      "author": "friedz",
      "details": "<br><br><a href=\"https://lageplan.uni-goettingen.de/?ident=1487_1_EG_0.103\">Raum 0.102 Ifi-Provisorium</a>"
    },
    {
      "language": ["de"],
      "title": "HTML Mail Newsletter selber bauen",
      "short": "Ich baue seit einem Jahr unfreiwillig Newsletter als HTML-Mail für den AStA.",
      "details": "Da ich nicht jeden Newsletter einzeln von vorne neu bauen wollte, habe ich mir ein paar Scripte gebaut. Die sind inzwischen so ausgereift, dass andere Interessierte sie als Grundlage für eigene nicht freiwillige HTML Mail Newsletter nutzen könne.<br>Warum ist das so besonders und unfreiwillig? HTML Mails sind nicht standadisiert, aber es soll ja bei allen funktionieren. Das führt unter anderem zur Notwendigkeit von inline-css, Verzicht auf quasi alle html-Tags und Begrenzung auf 'ne Hand voll CSS-Properties.<br>Daher wird der Workshop mit einem 10-Minütigen Rant über diese 'Technologie' beginnen.<br><br>In Raum 0.101 IfI (nicht Provisorium).",
      "times": [
        {
          "datetime": "2021/09/05 12:13",
          "duration": 90
        }
      ],
      "author": "Asterix<feconi@posteo.de>"
    }
  ]
}
