{
    "0": {
        "title": "TODO",
        "author": "[MN09]&nbsp;&nbsp;&nbsp;&nbsp;&nbsp;Orga-Team",
        "language": [
            "en"
        ],
        "short": "",
        "details": "",
        "type": "talk",
        "icon": "comment",
        "color": "success",
        "room": "MN09",
        "duration": 30,
        "date": "2022/06/24",
        "time": "13:00",
        "translate": {
            "de": {
                "title": "Begrüßung"
            },
            "en": {
                "title": "Welcome"
            }
        }
    },
    "1": {
        "title": "Energieinformatik - Netzausbauplanung am Computer",
        "author": "[MN09]&nbsp;&nbsp;&nbsp;&nbsp;&nbsp;Mike",
        "language": [
            "de"
        ],
        "short": "",
        "details": "Elektrische Netze sind immer für den Worst-case-Fall ausgelegt, dennoch wird bei Überschreitung der Leitungskapazität Erneuerbare Energien abgeregelt. Ein solches Einspeisemanagement (EinsMan) unterliegt gewissen gesetzlichen und regulatorischen Rahmenbedingungen und führte bisher immer direkt zu einer kostspieligen Netzausbaupflicht.\n\nSpitzenkappung, d.h. das strategische Abregeln von bis zu 3% der Jahresenergie, ist ein weiteres Tool zur Netzausbauplanung:\nIn diesem Vortrag wird ein Werkzeug präsentiert, dass versucht Netzausbau zu vereinfachen und mehr planerische Sicherheit zu erzeugen. Es wird einen Querschnitt durch viele Themen der Energie Versorgung, Netzplanung und High Perfomance Computing geben und wie das alles mit Informatik übersichtlich und ansprechend gelöst werden kann.\n",
        "type": "talk",
        "icon": "comment",
        "color": "info",
        "room": "MN09",
        "duration": 45,
        "date": "2022/06/24",
        "time": "13:30",
        "company": "Frauenhofer IEE"
    },
    "2": {
        "title": "TODO",
        "author": "[Foyer in front of MN09]&nbsp;&nbsp;&nbsp;&nbsp;&nbsp;CIDAS [Campus Institute Data Science]",
        "language": [
            "de",
            "en"
        ],
        "short": "",
        "details": "",
        "type": "talk",
        "icon": "comment",
        "color": "info",
        "room": "Foyer in front of MN09",
        "duration": 150,
        "date": "2022/06/24",
        "time": "13:30",
        "translate": {
            "de": {
                "title": "CIDAS Marktplatz für Abschlussarbeiten",
                "short": "Suchst du ein Thema für deine Abschlussarbeit oder ein Projekt?",
                "details": "\n\nDas Campus Institute Data Science (CIDAS) veranstaltet wieder einen Marktplatz für Abschluss- und Projektarbeiten - jetzt zum ersten Mal in Präsenz! Studierende aller Fächer mit Interesse an Data Science und Datenanalyse sind hier herzlich willkommen, insbesondere also auch Studierende der Informatik und Data Science. \n\nWissenschafter:innen unterschiedlichster Disziplinen werden ihre Forschung vorstellen sowie konkrete Themenvorschläge für Abschlussarbeiten mit Bezug zur Data Science und Informatik. Ihr habt die Möglichkeit, mit ihnen ins Gespräch zu kommen und bekommt nebenbei auch einen interessanten Einblick in die Forschungsvielfalt am Campus.\n\nKekse, Kaffee sowie weitere Snacks und Getränke werden auch vorhanden sein :)"
            },
            "en": {
                "title": "CIDAS Marketplace for Theses",
                "short": "Are you looking for a topic for your thesis or a project?",
                "details": "\n\nThe Campus Institute Data Science (CIDAS) is once again hosting a marketplace for theses and projects - now for the first time on-site! Students of all programs with an interest in data science and data analysis are welcome here. \n\nScientists from different disciplines will present their research as well as concrete topics for theses related to data science and computer science. You will have the opportunity to talk to them and get an interesting overview of the diverse research on campus.\n\nCookies, coffee as well as other snacks and drinks will also be provided :)"
            }
        }
    },
    "3": {
        "title": "Psychologie vs. Code",
        "author": "[MN09]&nbsp;&nbsp;&nbsp;&nbsp;&nbsp;Isabelle Rotter",
        "language": [
            "de"
        ],
        "short": "Kommunikation mit Menschen, die nicht viel Ahnung von Entwicklung haben kann schwer sein.",
        "details": "Oft fehlt es an einer klaren Vorstellung, was wichtig und sinnvoll ist oder wie schnell es fertig wird. Viel Code landet auf dem Friedhof, weil es sich jemand anders überlegt. Manchmal verstehen sie es einfach nicht, aber wir können eine Menge tun um das Problem zu verringern.\n\nWie Pattern im Code hat auch unser Hirn Netzwerke und Entscheidungszweige, Biases, die wir gezielt ansprechen und verändern können, um uns selbst verständlicher auszudrücken. Wir können schon vor der ersten Zeile das eigentliche Problem identifizieren und konstruktiv zusammen arbeiten, um keine verlorenen Stunden selbst zu tragen. In diesem Vortrag kriegst du ein paar hilfreiche Tipps für das passende Mindset um die Kommunikation mit nicht IT-ler zu vereinfachen.",
        "type": "talk",
        "icon": "comment",
        "color": "info",
        "room": "MN09",
        "duration": 45,
        "date": "2022/06/24",
        "time": "14:30",
        "company": "Flavia IT (https://www.flavia-it.de/)"
    },
    "4": {
        "title": "TODO",
        "author": "[draußen]&nbsp;&nbsp;&nbsp;&nbsp;&nbsp;Everyone",
        "language": [
            "de",
            "en"
        ],
        "short": "",
        "details": "",
        "type": "talk",
        "icon": "users",
        "color": "success",
        "room": "draußen",
        "duration": 420,
        "date": "2022/06/24",
        "time": "15:00",
        "translate": {
            "de": {
                "title": "Sommerfest"
            },
            "en": {
                "title": "Summer party"
            }
        }
    },
    "5": {
        "title": "TODO",
        "author": "[MN09]&nbsp;&nbsp;&nbsp;&nbsp;&nbsp;Orga",
        "language": [
            "de"
        ],
        "short": "",
        "details": "",
        "type": "talk",
        "icon": "cutlery",
        "color": "success",
        "room": "MN09",
        "duration": 120,
        "date": "2022/06/24",
        "time": "18:00",
        "translate": {
            "de": {
                "title": "Abendessen",
                "short": "Grillen"
            },
            "en": {
                "title": "Dinner",
                "short": "Barbecue"
            }
        }
    },
    "6": {
        "title": "APP Helpdesk & Coworking",
        "author": "[2.101]&nbsp;&nbsp;&nbsp;&nbsp;&nbsp;Jake & mehr",
        "language": [
            "de"
        ],
        "short": "Wenn du als Studi gerade das APP hörst",
        "details": "(Allgemeines Programmierpraktikum), dann bist du hier genau richtig: Du kannst dir einen kleinen Vorsprung erarbeiten, indem du am Projekt arbeitest - optimalerweise so, dass du den Rest des Wochenendes die Veranstaltung ohne schlechtes Gewissen genießen kannst. Außerdem gibt es die einmalige Gelegenheit dem Autor des Presets Löcher in den Bauch zu fragen.",
        "type": "talk",
        "icon": "commenting",
        "color": "warning",
        "room": "2.101",
        "duration": 180,
        "date": "2022/06/25",
        "time": "11:00"
    },
    "7": {
        "title": "GitLab Einführung",
        "author": "[2.101]&nbsp;&nbsp;&nbsp;&nbsp;&nbsp;Anna",
        "language": [
            "de"
        ],
        "short": "Einführung zu GitLab. Zum Anfang vom APP Helpdesk.",
        "details": "",
        "type": "talk",
        "icon": "comment",
        "color": "info",
        "room": "2.101",
        "duration": 30,
        "date": "2022/06/25",
        "time": "11:15"
    },
    "8": {
        "title": "TODO",
        "author": "[MN09]&nbsp;&nbsp;&nbsp;&nbsp;&nbsp;Orga",
        "language": [
            "de"
        ],
        "short": "",
        "details": "",
        "type": "talk",
        "icon": "cutlery",
        "color": "success",
        "room": "MN09",
        "duration": 120,
        "date": "2022/06/25",
        "time": "12:00",
        "translate": {
            "de": {
                "title": "Mittagessen",
                "short": "Indisches Linsencurry (Dal)"
            },
            "en": {
                "title": "Lunch",
                "short": "Indian lentil curry (dal)"
            }
        }
    },
    "9": {
        "title": "PinePhone",
        "author": "[MN09]&nbsp;&nbsp;&nbsp;&nbsp;&nbsp;Valeria, Maxim",
        "language": [
            "en"
        ],
        "short": "",
        "details": "The PinePhone is a Smartphone which can run \"normal\" linux.",
        "type": "talk",
        "icon": "comment",
        "color": "info",
        "room": "MN09",
        "duration": 45,
        "date": "2022/06/25",
        "time": "13:00"
    },
    "10": {
        "title": "Eduroam",
        "author": "[MN09]&nbsp;&nbsp;&nbsp;&nbsp;&nbsp;Janfred",
        "language": [
            "de"
        ],
        "short": "Alle Studis kennen es, oft wird darüber geflucht: eduroam",
        "details": ". An fast jeder Uni oder Hochschule in Deutschland kommen Forscher:innen und Studierende damit ins Internet. Aber wie funktioniert das ganze eigentlich? In diesem Vortrag werden die Konzepte hinter eduroam vorgestellt, wir machen einen Ausflug in die technischen Details der Umsetzung, die genutzen Protokolle, aktuelle Entwicklungen im Bereich der Sicherheit und schauen uns an, wohin die Reise gehen könnte.",
        "type": "talk",
        "icon": "comment",
        "color": "info",
        "room": "MN09",
        "duration": 45,
        "date": "2022/06/25",
        "time": "14:00"
    },
    "11": {
        "title": "Study Quality - An Introduction",
        "author": "[MN09]&nbsp;&nbsp;&nbsp;&nbsp;&nbsp;Sterni",
        "language": [
            "en",
            "de"
        ],
        "short": "The enhancement of Study Quality can best be achieved via an iterative development of a curriculum and its surroundings.",
        "details": "In this talk, luft will provide\n(1) an overview about some of the conceptional ideas of the Bologna reforms, shifting the whole German higher education system away from the Diploma,\n(2) a brief introduction to Quality Assurance and Accreditation, how these terms are applied to study programmes and what they encompass on a broad level,\n(3) basic information about the system at the Institute for Computer Science, such that every student will be able to improve Study Quality and  participate in its evolvement. You will also be able to provide your ideas about the improvement of the status quo during this talk.\n\n<!-- Even though these topics are often perceived as dry, there is a lot of depth and thought that can be put into them from very different angles. -->\nThe talk will be provided in English if there should be demand, otherwise it will be held in German.\n",
        "type": "talk",
        "icon": "comment",
        "color": "info",
        "room": "MN09",
        "duration": 45,
        "date": "2022/06/25",
        "time": "15:00"
    },
    "12": {
        "title": "<s>Sichere Kommunikation</s> - fällt aus!",
        "author": "[MN09]&nbsp;&nbsp;&nbsp;&nbsp;&nbsp;TorOnCampus",
        "language": [
            "de"
        ],
        "short": "WARNING: This Workshop is cancelled. / Dieser Workshop wurde abgesagt.",
        "details": "",
        "type": "talk",
        "icon": "commenting",
        "color": "warning",
        "room": "MN09",
        "duration": 120,
        "date": "2022/06/25",
        "time": "15:00"
    },
    "13": {
        "title": "Learning (Network) Protocols: The hands-on way",
        "author": "[MN09]&nbsp;&nbsp;&nbsp;&nbsp;&nbsp;Pascal Drude",
        "language": [
            "en"
        ],
        "short": "In this talk you will learn what protocols",
        "details": "are and why you can find them everywhere. On the example of network protocols we will explore how you can learn those the hands-on way with tools like wireshark instead of just reading lengthy and dry documentation.",
        "type": "talk",
        "icon": "comment",
        "color": "info",
        "room": "MN09",
        "duration": 45,
        "date": "2022/06/25",
        "time": "16:00"
    },
    "14": {
        "title": "Zig - low-level kann auch nett sein",
        "author": "[MN09]&nbsp;&nbsp;&nbsp;&nbsp;&nbsp;Leon Henrik Plickat",
        "language": [
            "de"
        ],
        "short": "Interesse an low-level Programmierung, aber keine Lust auf C? In diesem Vortrag",
        "details": " wird mit Zig eine Alternative nicht nur zu C selbst sondern auch zur typischen C Toolchain vorgestellt. Zig bietet sich nicht nur als Basis für neue Projekte an, sondern kann auch das Maintainen alter C Projekte vereinfachen.",
        "type": "talk",
        "icon": "comment",
        "color": "info",
        "room": "MN09",
        "duration": 45,
        "date": "2022/06/25",
        "time": "17:00"
    },
    "15": {
        "title": "TODO",
        "author": "[MN09]&nbsp;&nbsp;&nbsp;&nbsp;&nbsp;Orga",
        "language": [
            "de"
        ],
        "short": "",
        "details": "",
        "type": "talk",
        "icon": "cutlery",
        "color": "success",
        "room": "MN09",
        "duration": 120,
        "date": "2022/06/25",
        "time": "18:00",
        "translate": {
            "de": {
                "title": "Abendessen",
                "short": "Reispfanne mit Gemüse"
            },
            "en": {
                "title": "Dinner",
                "short": "Rice pan with vegetables"
            }
        }
    },
    "16": {
        "title": "TODO",
        "author": "[Computer pools]&nbsp;&nbsp;&nbsp;&nbsp;&nbsp;Everyone",
        "language": [
            "de",
            "en"
        ],
        "short": "Tragt eure Teams hier ein/Register your teams here: <a href=\"https://pad.gwdg.de/mariokart\">https://pad.gwdg.de/mariokart</a>",
        "details": "",
        "type": "talk",
        "icon": "users",
        "color": "success",
        "room": "Computer pools",
        "duration": 120,
        "date": "2022/06/25",
        "time": "19:00",
        "translate": {
            "de": {
                "title": "Mario Kart Turnier"
            },
            "en": {
                "title": "Mario Kart Tournament"
            }
        }
    },
    "17": {
        "title": "Workshop: Gitlab CI/CD Pipelines",
        "author": "[2.101]&nbsp;&nbsp;&nbsp;&nbsp;&nbsp;Lorenz Glißmann",
        "language": [
            "de",
            "en"
        ],
        "short": "",
        "details": "",
        "type": "talk",
        "icon": "commenting",
        "color": "warning",
        "room": "2.101",
        "duration": 120,
        "date": "2022/06/26",
        "time": "11:00",
        "translate": {
            "de": {
                "short": "Die CI/CD Pipelines in Gitlab sind ein mächtiges Automatisierungswerkzeug,",
                "details": "nicht nur für Entwicklung- und Betrieb von Software. In diesem Workshop lernt ihr, wie ihr damit unter Anderem: eine Software kompiliert & packt,Statische Websites (Gitlab Pages) erstellt, eine WebApp live deployt und eine Datenauswertungspipeline betreibt."
            },
            "en": {
                "short": "The CI/CD pipelines in Gitlab are a powerful automation tool,",
                "details": "not only for development and operation of software. In this workshop you will learn how to: compile & package software, create static websites (Gitlab Pages), deploy a WebApp live and run a data analysis pipeline."
            }
        }
    },
    "18": {
        "title": "TODO",
        "author": "[MN09]&nbsp;&nbsp;&nbsp;&nbsp;&nbsp;Orga",
        "language": [
            "de"
        ],
        "short": "",
        "details": "",
        "type": "talk",
        "icon": "cutlery",
        "color": "success",
        "room": "MN09",
        "duration": 120,
        "date": "2022/06/26",
        "time": "12:00",
        "translate": {
            "de": {
                "title": "Mittagessen",
                "short": "Restegrillen - nur solange der Vorrrat reicht"
            },
            "en": {
                "title": "Lunch",
                "short": "Leftover barbecue - only while supplies last"
            }
        }
    },
    "19": {
        "title": "Between bikes and bitterballen: my master in Amsterdam",
        "author": "[MN09]&nbsp;&nbsp;&nbsp;&nbsp;&nbsp;Linus Wagner",
        "language": [
            "en"
        ],
        "short": "Towards the end of my bachelor's degree, I knew that I wanted to do my master's degree at a different university",
        "details": ". I'm taking you with me on the journey of how I ended up in the capital of the Netherlands, Amsterdam, and talk about living there.",
        "type": "talk",
        "icon": "comment",
        "color": "info",
        "room": "MN09",
        "duration": 45,
        "date": "2022/06/26",
        "time": "12:00"
    },
    "20": {
        "title": "Workshop: Klimagerechtigkeit und Informatik",
        "author": "[0.101]&nbsp;&nbsp;&nbsp;&nbsp;&nbsp;Nele Hübscher",
        "language": [
            "de",
            "en"
        ],
        "short": "",
        "details": "",
        "type": "talk",
        "icon": "commenting",
        "color": "warning",
        "room": "0.101",
        "duration": 120,
        "date": "2022/06/26",
        "time": "12:00",
        "translate": {
            "de": {
                "short": "Offener Arbeitskreis zu Klimagerechtigkeit im Kontext von Informatik: ",
                "details": "Auf der letzten KIF (Konferenz für Informatikfachschaften) wurde eine Reso verabschiedet zu mehr Nachhaltigkeitsaspekten in der Lehre im Info-Studium. Jetzt gehts an die Umsetzung! Wie bringen wir mehr Klimagerechtigkeit in das Info-Studium in Göttingen? Warum ist das wichtig, und was ist die Verbindung zwischen Informatik und Klimagerechtigkeit? Was denkt ihr dazu?"
            },
            "en": {
                "short": "At the last KIF a reso was passed for more sustainability aspects in the teaching of computer science studies. ",
                "details": "Now it's time for the implementation! How do we bring more climate justice into the computer science studies in Göttingen? Why is this important, and what is the connection between computer science and climate justice? What do you think?\"\n\nEine offene Runde, in der wir einfach ein bisschen zusammensitzen und gemeinsam planen und überlegen können, alle sind willkommen!\n"
            }
        }
    },
    "21": {
        "title": "Einen offline Minecraft launcher schreiben",
        "author": "[MN09]&nbsp;&nbsp;&nbsp;&nbsp;&nbsp;Jake",
        "language": [
            "de"
        ],
        "short": "Seit dem 10. März 2022 erzwingt Mojang zum Minecraft Spielen einen Microsoft Account",
        "details": "und das ist ziemlich doof. Falls du Minecraft weiter ohne Microsoft Account spielen willst oder einfach nur daran interessiert bist wie ein Minecraft Launcher intern funktioniert, ist dieser Talk etwas für dich. Ich erkläre wie man einen eigenen Offline Minecraft Launcher schreiben kann. Und warum du dies auch tun solltest!",
        "type": "talk",
        "icon": "comment",
        "color": "info",
        "room": "MN09",
        "duration": 45,
        "date": "2022/06/26",
        "time": "13:00"
    },
    "22": {
        "title": "Persönliche Autonomie im Digitalen Leben - Bin ich noch frei zu wollen was ich will?",
        "author": "[MN09]&nbsp;&nbsp;&nbsp;&nbsp;&nbsp;Lea von Dömming",
        "language": [
            "de"
        ],
        "short": "Wir betreten ein metaphorisches Labor, ",
        "details": "das der Frage nachgeht, welche Gefahr unser tägliches Leben in der digitalen Welt für die persönliche Freiheit birgt. Ich zeige, wie man Intuitionen verfolgen und philosophische Fragen interdisziplinär beantworten kann. Wir werden halbgare Argumente testen und dabei gemeinsam denken und diskutieren, denn Philosophie braucht Zusammenarbeit.\"",
        "type": "talk",
        "icon": "comment",
        "color": "info",
        "room": "MN09",
        "duration": 45,
        "date": "2022/06/26",
        "time": "14:00"
    },
    "23": {
        "title": "Generative Computergrafik heute: Ein Primer",
        "author": "[MN09]&nbsp;&nbsp;&nbsp;&nbsp;&nbsp;Fabian Winter",
        "language": [
            "de"
        ],
        "short": "Komplexe dreidimensionale Szenen können heute durch Hardware beschleunigt gerendert werden.",
        "details": "In diesem Vortrag werden die Grundlagen der Darstellung von dreidimensionalen Szenen betrachtet und die Exposition der Hardwarebeschleunigung durch OpenGL präsentiert.",
        "type": "talk",
        "icon": "comment",
        "color": "info",
        "room": "MN09",
        "duration": 45,
        "date": "2022/06/26",
        "time": "15:00"
    },
    "24": {
        "title": "Workshop: Introduction to Network Traffic Analysis with Wireshark",
        "author": "[2.101]&nbsp;&nbsp;&nbsp;&nbsp;&nbsp;Pascal Drude",
        "language": [
            "en"
        ],
        "short": "In this interactive workshop you will learn how to capture network traffic and analyze it with wireshark.",
        "details": "Following an overview of the wireshark UI and functionality we will look at plenty of different scenarios and examples to learn how we can apply filters to analyze the traffic or learn how network protocols actually work.\n\n(You don't need good knowledge of network protocols! Bring a Laptop.)",
        "type": "talk",
        "icon": "commenting",
        "color": "warning",
        "room": "2.101",
        "duration": 120,
        "date": "2022/06/26",
        "time": "15:00"
    },
    "25": {
        "title": "Ins Auslandssemester starten",
        "author": "[MN09]&nbsp;&nbsp;&nbsp;&nbsp;&nbsp;Nele Hübscher",
        "language": [
            "en"
        ],
        "short": "Wie kann ich mein Auslandssemester als Informatiker:in planen?",
        "details": "Welche Möglichkeiten gibts an der Uni Göttingen? Und wie finanziere ich das ganze?\nIch war im letzten Wintersemester in Helsinki im Auslandssemester und werde ein paar Erfahrungen teilen und hoffentlich ein paar Menschen dafür begeistern, selbst ein Auslandssemester zu machen - es lohnt sich!",
        "type": "talk",
        "icon": "comment",
        "color": "info",
        "room": "MN09",
        "duration": 45,
        "date": "2022/06/26",
        "time": "16:00"
    }
}