{
    "0": {
        "title": "TODO",
        "author": "[Foyer in front of MN09]&nbsp;&nbsp;&nbsp;&nbsp;&nbsp;CIDAS [Campus Institute Data Science]",
        "language": [
            "de",
            "en"
        ],
        "short": "",
        "details": "",
        "type": "talk",
        "icon": "comment",
        "color": "info",
        "room": "Foyer in front of MN09",
        "duration": 120,
        "date": "2023/06/09",
        "time": "13:00",
        "translate": {
            "de": {
                "title": "CIDAS Marktplatz für Abschlussarbeiten",
                "short": "Suchst du ein Thema für deine Abschlussarbeit oder ein Projekt?",
                "details": "\nDas Campus Institute Data Science (CIDAS) veranstaltet wieder einen Marktplatz für Abschluss- und Projektarbeiten - jetzt zum ersten Mal in Präsenz! Studierende aller Fächer mit Interesse an Data Science und Datenanalyse sind hier herzlich willkommen, insbesondere also auch Studierende der Informatik und Data Science. \n\nWissenschafter:innen unterschiedlichster Disziplinen werden ihre Forschung vorstellen sowie konkrete Themenvorschläge für Abschlussarbeiten mit Bezug zur Data Science und Informatik. Ihr habt die Möglichkeit, mit ihnen ins Gespräch zu kommen und bekommt nebenbei auch einen interessanten Einblick in die Forschungsvielfalt am Campus.\n\nKekse, Kaffee sowie weitere Snacks und Getränke werden auch vorhanden sein :)\n"
            },
            "en": {
                "title": "CIDAS Marketplace for Theses",
                "short": "Are you looking for a topic for your thesis or a project?",
                "details": "\n\nThe Campus Institute Data Science (CIDAS) is once again hosting a marketplace for theses and projects - now for the first time on-site! Students of all programs with an interest in data science and data analysis are welcome here. \n\nScientists from different disciplines will present their research as well as concrete topics for theses related to data science and computer science. You will have the opportunity to talk to them and get an interesting overview of the diverse research on campus.\n\nCookies, coffee as well as other snacks and drinks will also be provided :)"
            }
        }
    },
    "1": {
        "title": "Virtueller Prototyp? Digitaler Zwilling? Was denn nun? Und wofür?",
        "author": "[MN09]&nbsp;&nbsp;&nbsp;&nbsp;&nbsp;Patrick Harms",
        "language": [
            "de"
        ],
        "short": "Ein Vortrag über Virtual Reality / Augmented Reality.\n",
        "details": "",
        "type": "talk",
        "icon": "comment",
        "color": "info",
        "room": "MN09",
        "duration": 45,
        "date": "2023/06/09",
        "time": "15:00"
    },
    "2": {
        "title": "Frag den Frosch - Einblicke in Softwareentwicklung und Arbeitsweise bei ATRUVIA",
        "author": "[MN09]&nbsp;&nbsp;&nbsp;&nbsp;&nbsp;Eva-Maria Csury",
        "language": [
            "de"
        ],
        "short": "Ein Vortrag aus der Berufspraxis.\n",
        "details": "",
        "type": "talk",
        "icon": "comment",
        "color": "info",
        "room": "MN09",
        "duration": 45,
        "date": "2023/06/09",
        "time": "16:00"
    },
    "3": {
        "title": "Scanning for Network Vulnerabilities (Deutsch)",
        "author": "[MN09]&nbsp;&nbsp;&nbsp;&nbsp;&nbsp;Jan-Oliver Wagner",
        "language": [
            "de"
        ],
        "short": "Ein Vortrag aus der Berufspraxis.\n",
        "details": "",
        "type": "talk",
        "icon": "comment",
        "color": "info",
        "room": "MN09",
        "duration": 45,
        "date": "2023/06/09",
        "time": "17:00"
    },
    "4": {
        "title": "TODO",
        "author": "[outside]&nbsp;&nbsp;&nbsp;&nbsp;&nbsp;Orga",
        "language": [
            "de"
        ],
        "short": "",
        "details": "",
        "type": "talk",
        "icon": "cutlery",
        "color": "success",
        "room": "outside",
        "duration": 120,
        "date": "2023/06/09",
        "time": "18:00",
        "translate": {
            "de": {
                "title": "Abendessen",
                "short": "Grillen"
            },
            "en": {
                "title": "Dinner",
                "short": "Barbecue"
            }
        }
    },
    "5": {
        "title": "Abendprogramm",
        "author": "[Outdoors]&nbsp;&nbsp;&nbsp;&nbsp;&nbsp;Alle",
        "language": [
            "de"
        ],
        "short": "Alles von Kurzvorträgen, zu APP-Speed Dating, bis Powerpoint Karaoke. Zum mitmachen!\n",
        "details": "",
        "type": "talk",
        "icon": "comment",
        "color": "info",
        "room": "Outdoors",
        "duration": 45,
        "date": "2023/06/09",
        "time": "20:00"
    },
    "6": {
        "title": "Wayland: Protokoll Design und der Weg zum eigenem Fenster",
        "author": "[MN09]&nbsp;&nbsp;&nbsp;&nbsp;&nbsp;Leon Henrik Plickat",
        "language": [
            "de"
        ],
        "short": "Einführung in Wayland und bekannte Extensions, in den Prozess des Protokoll Designs und alles was man braucht, um ein Fenster auf dem Desktop erscheinen zu lassen.",
        "details": "",
        "type": "talk",
        "icon": "comment",
        "color": "info",
        "room": "MN09",
        "duration": 45,
        "date": "2023/06/10",
        "time": "12:00"
    },
    "7": {
        "title": "TODO",
        "author": "[outside]&nbsp;&nbsp;&nbsp;&nbsp;&nbsp;Orga",
        "language": [
            "de"
        ],
        "short": "",
        "details": "",
        "type": "talk",
        "icon": "cutlery",
        "color": "success",
        "room": "outside",
        "duration": 120,
        "date": "2023/06/10",
        "time": "12:00",
        "translate": {
            "de": {
                "title": "Mittagessen",
                "short": "Reispfanne mit Gemüse"
            },
            "en": {
                "title": "Lunch",
                "short": "Rice pan with vegetables"
            }
        }
    },
    "8": {
        "title": "Variable Klimasimulation mit Deep Learning",
        "author": "[MN09]&nbsp;&nbsp;&nbsp;&nbsp;&nbsp;Lilly Schwarz",
        "language": [
            "de"
        ],
        "short": "Der Klimawandel wird uns in Zukunft vor immer größere gesellschaftliche und politische Probleme stellen.",
        "details": "Da ich von diesen Auswirkungen betroffen sein werde, will ich etwas zu der Entwicklung von Klimasimulationen und damit der Bekämpfung des Klimawandels beitragen. Mein Projekt simuliert den globalen mittleren Meeresspiegel und die globale mittlere Lufttemperatur in variablen Szenarien. Variable Klimasimulationen sind mit den herkömmlichen Simulationen aktuell noch nicht möglich, so werden bei diesen Tage und Wochen für ein Szenario benötigt, wobei meine variable Klimasimulation nur wenige Sekunden braucht und lediglich im Trainingsprozess viel Rechenleistung benötigt. Diese Szenarien können sowohl durch theoretische Veränderung (prozentuale Änderung der Emissionen), als auch durch reale Maßnahmen (prozentuale Änderung der Quantität bzw. Nutzung von z.B. PKW-Verkehr) vorgegeben werden.vMeine Simulation basiert dabei auf dem Zusammenspiel von drei neuronalen Netzwerken und zwei Algorithmen, mit dem Ziel die Dynamik des Klimasystems der Erde zu lernen und zu modellieren. Dazu wurden Techniken des Deep Learning und der klimawissenschaftlichen Algorithmik mit historischen Wetter- und Klimadaten kombiniert. Im Vergleich mit realen Daten und mit dem IPCC, deren Trend im Rahmen des angegebenen Fehlers reproduziert werden konnte, zeigte sich eine deutliche Übereinstimmung. Somit konnte ich zeigen, dass variable Klimasimulationen ein enormes Hilfsmittel bei der Einschätzung verschiedener Maßnahmen gegen den Klimawandel sein können.",
        "type": "talk",
        "icon": "comment",
        "color": "info",
        "room": "MN09",
        "duration": 45,
        "date": "2023/06/10",
        "time": "13:00"
    },
    "9": {
        "title": "Textilien bemalen",
        "author": "[MN09]&nbsp;&nbsp;&nbsp;&nbsp;&nbsp;Selina",
        "language": [
            "de"
        ],
        "short": "Wir haben alles dafür da, komm vorbei!",
        "details": "",
        "type": "talk",
        "icon": "comment",
        "color": "info",
        "room": "MN09",
        "duration": 300,
        "date": "2023/06/10",
        "time": "14:00"
    },
    "10": {
        "title": "Angewandte Optimierung - Als Studi bei Fraunhofer",
        "author": "[MN09]&nbsp;&nbsp;&nbsp;&nbsp;&nbsp;Daniel Ackermann",
        "language": [
            "de"
        ],
        "short": "",
        "details": "",
        "type": "talk",
        "icon": "comment",
        "color": "info",
        "room": "MN09",
        "duration": 45,
        "date": "2023/06/10",
        "time": "14:00"
    },
    "11": {
        "title": "Bartwuchsmittel und Haidschnuckenfelle. Wie digitalisiert man historische Werbeanzeigen?",
        "author": "[MN09]&nbsp;&nbsp;&nbsp;&nbsp;&nbsp;Johanna Störiko",
        "language": [
            "de"
        ],
        "short": "",
        "details": "",
        "type": "talk",
        "icon": "comment",
        "color": "info",
        "room": "MN09",
        "duration": 45,
        "date": "2023/06/10",
        "time": "15:00"
    },
    "12": {
        "title": "APP Helpdesk",
        "author": "[MN09]&nbsp;&nbsp;&nbsp;&nbsp;&nbsp;Jake",
        "language": [
            "de"
        ],
        "short": "",
        "details": "TBA\n",
        "type": "talk",
        "icon": "comment",
        "color": "info",
        "room": "MN09",
        "duration": 45,
        "date": "2023/06/10",
        "time": "16:00"
    },
    "13": {
        "title": "Netzwerkautomatisierung im RZ der GWDG - DevOps in der Infrastruktur",
        "author": "[MN09]&nbsp;&nbsp;&nbsp;&nbsp;&nbsp;Steffen Klemer",
        "language": [
            "de"
        ],
        "short": "Im letzten Jahr wurde das neue Rechenzentrum der GWDG bezogen",
        "details": ". Wir haben mit möglichst einfachen Mitteln, möglichst viel offenem Code und basierend auf Standardverfahren aus der Softwareentwicklung und Serverbetreuung die Konfiguration des Netzes weitestmöglich automatisiert und speisen sie aus einer zentralen, grafischen Datenbank. Wie das am Ende aussieht und die Stolpersteine auf dem Weg, soll der Vortrag genauso beleuchten wie die Frage, was das eigentlich mit Buzzwords wie Blockchain, SDN und Infrastructure-as-Code zu tun hat.",
        "type": "talk",
        "icon": "comment",
        "color": "info",
        "room": "MN09",
        "duration": 45,
        "date": "2023/06/10",
        "time": "17:00"
    },
    "14": {
        "title": "TODO",
        "author": "[MN09]&nbsp;&nbsp;&nbsp;&nbsp;&nbsp;Orga",
        "language": [
            "de"
        ],
        "short": "",
        "details": "",
        "type": "talk",
        "icon": "cutlery",
        "color": "success",
        "room": "MN09",
        "duration": 120,
        "date": "2023/06/10",
        "time": "18:00",
        "translate": {
            "de": {
                "title": "Abendessen",
                "short": "Grillen"
            },
            "en": {
                "title": "Dinner",
                "short": "Barbecue"
            }
        }
    },
    "15": {
        "title": "TODO",
        "author": "[MN09]&nbsp;&nbsp;&nbsp;&nbsp;&nbsp;Jan-Phillip",
        "language": [
            "de"
        ],
        "short": "Kennst du Bierpong? Das ist doch langweilig! Lass uns lieber um die Wette programmieren!\n",
        "details": "",
        "type": "talk",
        "icon": "trophy",
        "color": "success",
        "room": "MN09",
        "duration": 180,
        "date": "2023/06/10",
        "time": "20:00",
        "translate": {
            "de": {
                "title": "Code-Pong",
                "short": "Code-Pong Turnier."
            },
            "en": {
                "title": "Code-Pong",
                "short": "Code-Pong tournament."
            }
        }
    },
    "16": {
        "title": "Vim und Bash totkonfigurieren",
        "author": "[MN09]&nbsp;&nbsp;&nbsp;&nbsp;&nbsp;Jake",
        "language": [
            "de"
        ],
        "short": "Linux Tools wie vim und bash haben viele Konfigurationsmöglichkeiten.",
        "details": " In diesem Vortrag gucken wir uns an, wie weit man diese Konfigurationen strecken kann, um sich ein möglichst featurereiches System zu konfigurieren.",
        "type": "talk",
        "icon": "comment",
        "color": "info",
        "room": "MN09",
        "duration": 45,
        "date": "2023/06/11",
        "time": "11:00"
    },
    "17": {
        "title": "Über die Usability des Terminals",
        "author": "[MN09]&nbsp;&nbsp;&nbsp;&nbsp;&nbsp;Lorenz",
        "language": [
            "de"
        ],
        "short": "Unter Informatiker*innen ist das Terminal sehr beliebt.",
        "details": " Über IT hinaus allerdings nicht so sehr. Terminalanwendungen besitzen keinen besonders guten Ruf in Bezug auf Einstiegsfreundlichkeit und Benutzbarkeit. In diesem Vortrag gucken wir uns dieses Problem näher an, wie es entstanden ist und was man tun könnte, um die Benutzbarkeit zu verbessern.",
        "type": "talk",
        "icon": "comment",
        "color": "info",
        "room": "MN09",
        "duration": 45,
        "date": "2023/06/11",
        "time": "12:00"
    },
    "18": {
        "title": "TODO",
        "author": "[MN09]&nbsp;&nbsp;&nbsp;&nbsp;&nbsp;Orga",
        "language": [
            "de"
        ],
        "short": "",
        "details": "",
        "type": "talk",
        "icon": "cutlery",
        "color": "success",
        "room": "MN09",
        "duration": 120,
        "date": "2023/06/11",
        "time": "12:00",
        "translate": {
            "de": {
                "title": "Mittagessen",
                "short": "Restegrillen - nur solange der Vorrrat reicht"
            },
            "en": {
                "title": "Lunch",
                "short": "Leftover barbecue - only while supplies last"
            }
        }
    },
    "19": {
        "title": "Ein Blick hinter die Kulissen von Lifi",
        "author": "[MN09]&nbsp;&nbsp;&nbsp;&nbsp;&nbsp;Jake",
        "language": [
            "de"
        ],
        "short": "Lifi ist eine ubuntu-basierte VM fürs ganze Informatikstudium.",
        "details": "In diesem Vortrag gucken wir uns an, wie Lifi entstanden ist, wie es funktioniert und welche Probleme beim entwickeln der VM so aufgetreten sind.\n",
        "type": "talk",
        "icon": "comment",
        "color": "info",
        "room": "MN09",
        "duration": 45,
        "date": "2023/06/11",
        "time": "13:00"
    },
    "20": {
        "title": "Dezentrale Soziale Netzwerke",
        "author": "[MN09]&nbsp;&nbsp;&nbsp;&nbsp;&nbsp;Ole Umlauft",
        "language": [
            "de"
        ],
        "short": "",
        "details": "",
        "type": "talk",
        "icon": "comment",
        "color": "info",
        "room": "MN09",
        "duration": 45,
        "date": "2023/06/11",
        "time": "14:00"
    },
    "21": {
        "title": "TODO",
        "author": "[Computer pools]&nbsp;&nbsp;&nbsp;&nbsp;&nbsp;TODO",
        "language": [
            "de"
        ],
        "short": "TODO",
        "details": "",
        "type": "talk",
        "icon": "users",
        "color": "success",
        "room": "Computer pools",
        "duration": 120,
        "date": "2023/06/11",
        "time": "15:00",
        "translate": {
            "de": {
                "title": "Mario Kart Turnier"
            }
        }
    }
}