%!PS-Adobe-3.0 EPSF-3.0
%%BoundingBox: -28.3465 -28.3465 283.4646 283.4646
%%Title: parabola-6784-188.euk
%%Creator: eukleides
%%EndComments
gsave 28.3464566929 dup scale
 0.0176 setlinewidth 1 setlinecap 1 setlinejoin
-1.0000  0.0000 moveto 10.0000  0.0000 lineto stroke
 0.0000 -1.0000 moveto  0.0000 10.0000 lineto stroke
/Dot {0 360 arc fill} bind def
 4.0000  0.0000  0.0500 Dot
 2.0000  8.0000  0.0500 Dot
11.6619  8.7918 10.4342  8.2143  9.4029  7.6957  8.5284  7.2268
 7.7806  6.8004  7.1364  6.4103  6.5777  6.0516  6.0901  5.7202
 5.6623  5.4128  5.2850  5.1264  4.9507  4.8586  4.6534  4.6073
 4.3879  4.3707  4.1500  4.1473  3.9362  3.9357  3.7435  3.7347
 3.5694  3.5434  3.4118  3.3607  3.2687  3.1858  3.1386  3.0181
 3.0203  2.8569  2.9124  2.7017  2.8140  2.5518  2.7241  2.4068
 2.6421  2.2664  2.5671  2.1300  2.4987  1.9975  2.4363  1.8683
 2.3794  1.7422  2.3277  1.6190  2.2806  1.4984  2.2381  1.3801
 2.1997  1.2639  2.1652  1.1497  2.1345  1.0371  2.1072  0.9261
 2.0833  0.8164  2.0626  0.7079  2.0451  0.6004  2.0305  0.4937
 2.0188  0.3877  2.0100  0.2822  2.0039  0.1772  2.0007  0.0723
moveto 43 {lineto} repeat stroke
[.3 .2] 0 setdash
 2.0000  0.0000  2.0000  8.0000 moveto
lineto stroke
[] 0 setdash
 4.0000  0.0000  4.0000  4.0000 moveto
lineto stroke
 2.6667  0.0000  2.6667  2.3094 moveto
lineto stroke
 4.0000  4.0000  0.0500 Dot
 2.6667  2.3094  0.0500 Dot
 2.6667  2.3094  4.0000  0.0000 moveto
lineto stroke
/Georgia-Italic findfont 0.388056 scalefont setfont
/Print {gsave translate dup 0 0 moveto false charpath flattenpath pathbbox -2 div 4 1 roll -2 div 4 1 roll pop pop moveto show grestore} bind def
(a)  4.0000 -0.3300 Print
(b)  2.0000 -0.3000 Print
(c)  2.6667 -0.3300 Print
(o) -0.2121 -0.2121 Print
(x)  1.7000  8.0000 Print
(g)  4.0000  4.3000 Print
(d)  2.6667  2.6094 Print
showpage grestore
%%EOF
