<?xml version="1.0" encoding="UTF-8" standalone="no"?>
<graphml xmlns="http://graphml.graphdrawing.org/xmlns" xmlns:xsi="http://www.w3.org/2001/XMLSchema-instance" xmlns:y="http://www.yworks.com/xml/graphml" xmlns:yed="http://www.yworks.com/xml/yed/3" xsi:schemaLocation="http://graphml.graphdrawing.org/xmlns http://www.yworks.com/xml/schema/graphml/1.1/ygraphml.xsd">
  <!--Created by yFiles for Java 2.11-->
  <key for="graphml" id="d0" yfiles.type="resources"/>
  <key for="port" id="d1" yfiles.type="portgraphics"/>
  <key for="port" id="d2" yfiles.type="portgeometry"/>
  <key for="port" id="d3" yfiles.type="portuserdata"/>
  <key attr.name="gndurl" attr.type="string" for="node" id="d4"/>
  <key attr.name="viafurl" attr.type="string" for="node" id="d5"/>
  <key attr.name="lccnurl" attr.type="string" for="node" id="d6"/>
  <key attr.name="url" attr.type="string" for="node" id="d7"/>
  <key attr.name="description" attr.type="string" for="node" id="d8"/>
  <key for="node" id="d9" yfiles.type="nodegraphics"/>
  <key attr.name="Description" attr.type="string" for="graph" id="d10"/>
  <key attr.name="url" attr.type="string" for="edge" id="d11"/>
  <key attr.name="description" attr.type="string" for="edge" id="d12"/>
  <key for="edge" id="d13" yfiles.type="edgegraphics"/>
  <graph edgedefault="directed" id="G">
    <data key="d10"/>
    <node id="n0" yfiles.foldertype="group">
      <data key="d4"/>
      <data key="d5"/>
      <data key="d6"/>
      <data key="d7"/>
      <data key="d9">
        <y:ProxyAutoBoundsNode>
          <y:Realizers active="0">
            <y:GroupNode>
              <y:Geometry height="138.0" width="266.0" x="119.0" y="-251.0"/>
              <y:Fill color="#F5F5F5" transparent="false"/>
              <y:BorderStyle color="#800080" type="line" width="1.0"/>
              <y:NodeLabel alignment="left" autoSizePolicy="node_width" backgroundColor="#EBEBEB" borderDistance="0.0" fontFamily="Helvetica" fontSize="15" fontStyle="plain" hasLineColor="false" height="19.0" modelName="internal" modelPosition="t" textColor="#000000" visible="true" width="266.0" x="0.0" y="0.0">Bacon</y:NodeLabel>
              <y:Shape type="roundrectangle"/>
              <y:State closed="false" closedHeight="50.0" closedWidth="50.0" innerGraphDisplayEnabled="false"/>
              <y:Insets bottom="15" bottomF="15.0" left="15" leftF="15.0" right="15" rightF="15.0" top="15" topF="15.0"/>
              <y:BorderInsets bottom="0" bottomF="0.0" left="0" leftF="0.0" right="0" rightF="0.0" top="0" topF="0.0"/>
            </y:GroupNode>
            <y:GroupNode>
              <y:Geometry height="50.0" width="50.0" x="0.0" y="60.0"/>
              <y:Fill color="#F5F5F5" transparent="false"/>
              <y:BorderStyle color="#000000" type="dashed" width="1.0"/>
              <y:NodeLabel alignment="right" autoSizePolicy="node_width" backgroundColor="#EBEBEB" borderDistance="0.0" fontFamily="Helvetica" fontSize="15" fontStyle="plain" hasLineColor="false" height="19.0" modelName="internal" modelPosition="t" textColor="#000000" visible="true" width="59.02685546875" x="-4.513427734375" y="0.0">Folder 1</y:NodeLabel>
              <y:Shape type="roundrectangle"/>
              <y:State closed="true" closedHeight="50.0" closedWidth="50.0" innerGraphDisplayEnabled="false"/>
              <y:Insets bottom="5" bottomF="5.0" left="5" leftF="5.0" right="5" rightF="5.0" top="5" topF="5.0"/>
              <y:BorderInsets bottom="0" bottomF="0.0" left="0" leftF="0.0" right="0" rightF="0.0" top="0" topF="0.0"/>
            </y:GroupNode>
          </y:Realizers>
        </y:ProxyAutoBoundsNode>
      </data>
      <graph edgedefault="directed" id="n0:">
        <node id="n0::n0">
          <data key="d4"/>
          <data key="d5"/>
          <data key="d6"/>
          <data key="d7"><![CDATA[http://echo.mpiwg-berlin.mpg.de/ECHOdocuView?url=/mpiwg/online/permanent/library/N9KD9BFM/pageimg&start=70&viewMode=image&pn=79&mode=imagepath]]></data>
          <data key="d9">
            <y:ShapeNode>
              <y:Geometry height="89.0" width="63.0" x="134.0" y="-217.0"/>
              <y:Fill color="#FFFFFF" transparent="false"/>
              <y:BorderStyle color="#000000" type="line" width="1.0"/>
              <y:NodeLabel alignment="center" autoSizePolicy="content" fontFamily="Helvetica" fontSize="12" fontStyle="plain" hasBackgroundColor="false" hasLineColor="false" height="40.0" modelName="custom" textColor="#000000" visible="true" width="52.662109375" x="5.1689453125" y="24.5">HMC MS
241.iv
f. 31<y:LabelModel>
                  <y:SmartNodeLabelModel distance="4.0"/>
                </y:LabelModel>
                <y:ModelParameter>
                  <y:SmartNodeLabelModelParameter labelRatioX="0.0" labelRatioY="0.0" nodeRatioX="0.0" nodeRatioY="0.0" offsetX="0.0" offsetY="0.0" upX="0.0" upY="-1.0"/>
                </y:ModelParameter>
              </y:NodeLabel>
              <y:Shape type="rectangle"/>
            </y:ShapeNode>
          </data>
        </node>
        <node id="n0::n1">
          <data key="d4"/>
          <data key="d5"/>
          <data key="d6"/>
          <data key="d7"><![CDATA[http://echo.mpiwg-berlin.mpg.de/ECHOdocuView?url=/mpiwg/online/permanent/library/N9KD9BFM/pageimg&start=80&viewMode=image&pn=81&mode=imagepath]]></data>
          <data key="d9">
            <y:ShapeNode>
              <y:Geometry height="89.0" width="63.0" x="220.5" y="-217.0"/>
              <y:Fill color="#FFFFFF" transparent="false"/>
              <y:BorderStyle color="#000000" type="line" width="1.0"/>
              <y:NodeLabel alignment="center" autoSizePolicy="content" fontFamily="Helvetica" fontSize="12" fontStyle="plain" hasBackgroundColor="false" hasLineColor="false" height="40.0" modelName="custom" textColor="#000000" visible="true" width="52.662109375" x="5.1689453125" y="24.5">HMC MS
241.iv
f. 32a<y:LabelModel>
                  <y:SmartNodeLabelModel distance="4.0"/>
                </y:LabelModel>
                <y:ModelParameter>
                  <y:SmartNodeLabelModelParameter labelRatioX="0.0" labelRatioY="0.0" nodeRatioX="0.0" nodeRatioY="0.0" offsetX="0.0" offsetY="0.0" upX="0.0" upY="-1.0"/>
                </y:ModelParameter>
              </y:NodeLabel>
              <y:Shape type="rectangle"/>
            </y:ShapeNode>
          </data>
        </node>
        <node id="n0::n2">
          <data key="d4"/>
          <data key="d5"/>
          <data key="d6"/>
          <data key="d7"><![CDATA[http://echo.mpiwg-berlin.mpg.de/ECHOdocuView?url=/mpiwg/online/permanent/library/N9KD9BFM/pageimg&start=80&viewMode=image&pn=84&mode=imagepath]]></data>
          <data key="d9">
            <y:ShapeNode>
              <y:Geometry height="89.0" width="63.0" x="307.0" y="-217.0"/>
              <y:Fill color="#FFFFFF" transparent="false"/>
              <y:BorderStyle color="#000000" type="line" width="1.0"/>
              <y:NodeLabel alignment="center" autoSizePolicy="content" fontFamily="Helvetica" fontSize="12" fontStyle="plain" hasBackgroundColor="false" hasLineColor="false" height="40.0" modelName="custom" textColor="#000000" visible="true" width="52.662109375" x="5.1689453125" y="24.5">HMC MS
241.iv
f. 32bv<y:LabelModel>
                  <y:SmartNodeLabelModel distance="4.0"/>
                </y:LabelModel>
                <y:ModelParameter>
                  <y:SmartNodeLabelModelParameter labelRatioX="0.0" labelRatioY="0.0" nodeRatioX="0.0" nodeRatioY="0.0" offsetX="0.0" offsetY="0.0" upX="0.0" upY="-1.0"/>
                </y:ModelParameter>
              </y:NodeLabel>
              <y:Shape type="rectangle"/>
            </y:ShapeNode>
          </data>
        </node>
      </graph>
    </node>
    <node id="n1">
      <data key="d4"><![CDATA[http://d-nb.info/gnd/103100229]]></data>
      <data key="d5"/>
      <data key="d6"/>
      <data key="d7"><![CDATA[http://en.wikipedia.org/wiki/Roger_Bacon]]></data>
      <data key="d9">
        <y:GenericNode configuration="com.yworks.bpmn.Activity">
          <y:Geometry height="61.0" width="116.0" x="114.0" y="-320.0"/>
          <y:Fill color="#FFFFFF" transparent="false"/>
          <y:BorderStyle color="#FFFFFF" type="line" width="1.0"/>
          <y:NodeLabel alignment="left" autoSizePolicy="content" fontFamily="Helvetica" fontSize="18" fontStyle="plain" hasBackgroundColor="false" hasLineColor="false" height="40.0" modelName="custom" textColor="#000000" visible="true" width="109.064453125" x="3.4677734375" y="10.5">Roger Bacon
(1214–1294)<y:LabelModel>
              <y:SmartNodeLabelModel distance="4.0"/>
            </y:LabelModel>
            <y:ModelParameter>
              <y:SmartNodeLabelModelParameter labelRatioX="0.0" labelRatioY="0.0" nodeRatioX="0.0" nodeRatioY="0.0" offsetX="0.0" offsetY="0.0" upX="0.0" upY="-1.0"/>
            </y:ModelParameter>
          </y:NodeLabel>
          <y:StyleProperties>
            <y:Property class="com.yworks.yfiles.bpmn.view.BPMNTypeEnum" name="com.yworks.bpmn.type" value="ACTIVITY_TYPE"/>
            <y:Property class="java.awt.Color" name="com.yworks.bpmn.icon.line.color" value="#000000"/>
            <y:Property class="java.awt.Color" name="com.yworks.bpmn.icon.fill" value="#ffffff"/>
            <y:Property class="java.awt.Color" name="com.yworks.bpmn.icon.fill2" value="#d4d4d4"/>
            <y:Property name="com.yworks.bpmn.marker2"/>
            <y:Property name="com.yworks.bpmn.marker1"/>
            <y:Property name="com.yworks.bpmn.marker4"/>
            <y:Property name="com.yworks.bpmn.marker3"/>
          </y:StyleProperties>
        </y:GenericNode>
      </data>
    </node>
    <node id="n2">
      <data key="d4"/>
      <data key="d5"/>
      <data key="d6"/>
      <data key="d7"><![CDATA[./0_TOPICS.graphml]]></data>
      <data key="d9">
        <y:GenericNode configuration="com.yworks.bpmn.Activity">
          <y:Geometry height="14.956582633053273" width="104.0" x="114.0" y="-375.8911819825531"/>
          <y:Fill color="#FFFFFF" transparent="false"/>
          <y:BorderStyle color="#FFFFFF" type="line" width="1.0"/>
          <y:NodeLabel alignment="center" autoSizePolicy="content" fontFamily="Helvetica" fontSize="12" fontStyle="plain" hasBackgroundColor="false" hasLineColor="false" height="16.0" modelName="custom" textColor="#000000" visible="true" width="101.365234375" x="1.3173828125" y="-0.5217086834733777">Return to TOPICS<y:LabelModel>
              <y:SmartNodeLabelModel distance="4.0"/>
            </y:LabelModel>
            <y:ModelParameter>
              <y:SmartNodeLabelModelParameter labelRatioX="0.0" labelRatioY="0.0" nodeRatioX="0.0" nodeRatioY="0.0" offsetX="0.0" offsetY="0.0" upX="0.0" upY="-1.0"/>
            </y:ModelParameter>
          </y:NodeLabel>
          <y:StyleProperties>
            <y:Property class="com.yworks.yfiles.bpmn.view.BPMNTypeEnum" name="com.yworks.bpmn.type" value="ACTIVITY_TYPE"/>
            <y:Property class="java.awt.Color" name="com.yworks.bpmn.icon.line.color" value="#000000"/>
            <y:Property class="java.awt.Color" name="com.yworks.bpmn.icon.fill" value="#ffffff"/>
            <y:Property class="java.awt.Color" name="com.yworks.bpmn.icon.fill2" value="#d4d4d4"/>
            <y:Property name="com.yworks.bpmn.marker2"/>
            <y:Property name="com.yworks.bpmn.marker1"/>
            <y:Property name="com.yworks.bpmn.marker4"/>
            <y:Property name="com.yworks.bpmn.marker3"/>
          </y:StyleProperties>
        </y:GenericNode>
      </data>
    </node>
    <node id="n3">
      <data key="d4"/>
      <data key="d5"/>
      <data key="d6"/>
      <data key="d7"><![CDATA[./2.3_Medieval.graphml]]></data>
      <data key="d9">
        <y:GenericNode configuration="com.yworks.bpmn.Activity">
          <y:Geometry height="14.956582633053273" width="132.0" x="114.0" y="-352.8694732990798"/>
          <y:Fill color="#FFFFFF" transparent="false"/>
          <y:BorderStyle color="#FFFFFF" type="line" width="1.0"/>
          <y:NodeLabel alignment="center" autoSizePolicy="content" fontFamily="Helvetica" fontSize="12" fontStyle="plain" hasBackgroundColor="false" hasLineColor="false" height="16.0" modelName="custom" textColor="#000000" visible="true" width="130.064453125" x="0.9677734375" y="-0.5217086834733777">Return to previous level<y:LabelModel>
              <y:SmartNodeLabelModel distance="4.0"/>
            </y:LabelModel>
            <y:ModelParameter>
              <y:SmartNodeLabelModelParameter labelRatioX="0.0" labelRatioY="0.0" nodeRatioX="0.0" nodeRatioY="0.0" offsetX="0.0" offsetY="0.0" upX="0.0" upY="-1.0"/>
            </y:ModelParameter>
          </y:NodeLabel>
          <y:StyleProperties>
            <y:Property class="com.yworks.yfiles.bpmn.view.BPMNTypeEnum" name="com.yworks.bpmn.type" value="ACTIVITY_TYPE"/>
            <y:Property class="java.awt.Color" name="com.yworks.bpmn.icon.line.color" value="#000000"/>
            <y:Property class="java.awt.Color" name="com.yworks.bpmn.icon.fill" value="#ffffff"/>
            <y:Property class="java.awt.Color" name="com.yworks.bpmn.icon.fill2" value="#d4d4d4"/>
            <y:Property name="com.yworks.bpmn.marker2"/>
            <y:Property name="com.yworks.bpmn.marker1"/>
            <y:Property name="com.yworks.bpmn.marker4"/>
            <y:Property name="com.yworks.bpmn.marker3"/>
          </y:StyleProperties>
        </y:GenericNode>
      </data>
    </node>
    <edge id="n0::e0" source="n0::n0" target="n0::n1">
      <data key="d13">
        <y:GenericEdge configuration="com.yworks.bpmn.Connection">
          <y:Path sx="0.0" sy="0.0" tx="0.0" ty="0.0"/>
          <y:LineStyle color="#000000" type="dotted" width="2.0"/>
          <y:Arrows source="none" target="standard"/>
          <y:EdgeLabel alignment="center" distance="2.0" fontFamily="Helvetica" fontSize="12" fontStyle="plain" hasBackgroundColor="false" hasLineColor="false" hasText="false" height="4.0" modelName="custom" preferredPlacement="anywhere" ratio="0.5" textColor="#000000" visible="true" width="4.0" x="9.75" y="28.0">
            <y:LabelModel>
              <y:SmartEdgeLabelModel autoRotationEnabled="false" defaultAngle="0.0" defaultDistance="10.0"/>
            </y:LabelModel>
            <y:ModelParameter>
              <y:SmartEdgeLabelModelParameter angle="0.0" distance="30.0" distanceToCenter="true" position="right" ratio="0.5" segment="0"/>
            </y:ModelParameter>
            <y:PreferredPlacementDescriptor angle="0.0" angleOffsetOnRightSide="0" angleReference="absolute" angleRotationOnRightSide="co" distance="-1.0" frozen="true" placement="anywhere" side="anywhere" sideReference="relative_to_edge_flow"/>
          </y:EdgeLabel>
          <y:StyleProperties>
            <y:Property class="com.yworks.yfiles.bpmn.view.BPMNTypeEnum" name="com.yworks.bpmn.type" value="CONNECTION_TYPE_DIRECTED_ASSOCIATION"/>
          </y:StyleProperties>
        </y:GenericEdge>
      </data>
    </edge>
    <edge id="n0::e1" source="n0::n1" target="n0::n2">
      <data key="d13">
        <y:GenericEdge configuration="com.yworks.bpmn.Connection">
          <y:Path sx="0.0" sy="0.0" tx="0.0" ty="0.0"/>
          <y:LineStyle color="#000000" type="dotted" width="2.0"/>
          <y:Arrows source="none" target="standard"/>
          <y:EdgeLabel alignment="center" distance="2.0" fontFamily="Helvetica" fontSize="12" fontStyle="plain" hasBackgroundColor="false" hasLineColor="false" hasText="false" height="4.0" modelName="custom" preferredPlacement="anywhere" ratio="0.5" textColor="#000000" visible="true" width="4.0" x="9.75" y="28.0">
            <y:LabelModel>
              <y:SmartEdgeLabelModel autoRotationEnabled="false" defaultAngle="0.0" defaultDistance="10.0"/>
            </y:LabelModel>
            <y:ModelParameter>
              <y:SmartEdgeLabelModelParameter angle="0.0" distance="30.0" distanceToCenter="true" position="right" ratio="0.5" segment="0"/>
            </y:ModelParameter>
            <y:PreferredPlacementDescriptor angle="0.0" angleOffsetOnRightSide="0" angleReference="absolute" angleRotationOnRightSide="co" distance="-1.0" frozen="true" placement="anywhere" side="anywhere" sideReference="relative_to_edge_flow"/>
          </y:EdgeLabel>
          <y:StyleProperties>
            <y:Property class="com.yworks.yfiles.bpmn.view.BPMNTypeEnum" name="com.yworks.bpmn.type" value="CONNECTION_TYPE_DIRECTED_ASSOCIATION"/>
          </y:StyleProperties>
        </y:GenericEdge>
      </data>
    </edge>
  </graph>
  <data key="d0">
    <y:Resources/>
  </data>
</graphml>
