<?xml version="1.0" encoding="UTF-8" standalone="no"?>
<graphml xmlns="http://graphml.graphdrawing.org/xmlns" xmlns:xsi="http://www.w3.org/2001/XMLSchema-instance" xmlns:y="http://www.yworks.com/xml/graphml" xmlns:yed="http://www.yworks.com/xml/yed/3" xsi:schemaLocation="http://graphml.graphdrawing.org/xmlns http://www.yworks.com/xml/schema/graphml/1.1/ygraphml.xsd">
  <!--Created by yFiles for Java 2.11-->
  <key for="graphml" id="d0" yfiles.type="resources"/>
  <key for="port" id="d1" yfiles.type="portgraphics"/>
  <key for="port" id="d2" yfiles.type="portgeometry"/>
  <key for="port" id="d3" yfiles.type="portuserdata"/>
  <key attr.name="gndurl" attr.type="string" for="node" id="d4"/>
  <key attr.name="viafurl" attr.type="string" for="node" id="d5"/>
  <key attr.name="lccnurl" attr.type="string" for="node" id="d6"/>
  <key attr.name="url" attr.type="string" for="node" id="d7"/>
  <key attr.name="description" attr.type="string" for="node" id="d8"/>
  <key for="node" id="d9" yfiles.type="nodegraphics"/>
  <key attr.name="Description" attr.type="string" for="graph" id="d10"/>
  <key attr.name="url" attr.type="string" for="edge" id="d11"/>
  <key attr.name="description" attr.type="string" for="edge" id="d12"/>
  <key for="edge" id="d13" yfiles.type="edgegraphics"/>
  <graph edgedefault="directed" id="G">
    <data key="d10"/>
    <node id="n0">
      <data key="d4"/>
      <data key="d5"/>
      <data key="d6"/>
      <data key="d7"><![CDATA[./0_TOPICS.graphml]]></data>
      <data key="d9">
        <y:GenericNode configuration="com.yworks.bpmn.Activity">
          <y:Geometry height="36.0" width="185.0" x="-168.0" y="-320.0"/>
          <y:Fill color="#FFFFFF" transparent="false"/>
          <y:BorderStyle color="#FFFFFF" type="line" width="1.0"/>
          <y:NodeLabel alignment="left" autoSizePolicy="content" fontFamily="Helvetica" fontSize="18" fontStyle="plain" hasBackgroundColor="false" hasLineColor="false" height="22.0" modelName="custom" textColor="#000000" visible="true" width="194.458984375" x="-4.7294921875" y="7.0">HARRIOT'S SOURCES<y:LabelModel>
              <y:SmartNodeLabelModel distance="4.0"/>
            </y:LabelModel>
            <y:ModelParameter>
              <y:SmartNodeLabelModelParameter labelRatioX="0.0" labelRatioY="0.0" nodeRatioX="0.0" nodeRatioY="0.0" offsetX="0.0" offsetY="0.0" upX="0.0" upY="-1.0"/>
            </y:ModelParameter>
          </y:NodeLabel>
          <y:StyleProperties>
            <y:Property class="com.yworks.yfiles.bpmn.view.BPMNTypeEnum" name="com.yworks.bpmn.type" value="ACTIVITY_TYPE"/>
            <y:Property class="java.awt.Color" name="com.yworks.bpmn.icon.line.color" value="#000000"/>
            <y:Property class="java.awt.Color" name="com.yworks.bpmn.icon.fill" value="#ffffff"/>
            <y:Property class="java.awt.Color" name="com.yworks.bpmn.icon.fill2" value="#d4d4d4"/>
            <y:Property name="com.yworks.bpmn.marker2"/>
            <y:Property name="com.yworks.bpmn.marker1"/>
            <y:Property name="com.yworks.bpmn.marker4"/>
            <y:Property name="com.yworks.bpmn.marker3"/>
          </y:StyleProperties>
        </y:GenericNode>
      </data>
    </node>
    <node id="n1">
      <data key="d4"/>
      <data key="d5"/>
      <data key="d6"/>
      <data key="d7"><![CDATA[./2.1_Ancient.graphml]]></data>
      <data key="d9">
        <y:GenericNode configuration="com.yworks.bpmn.Activity.withShadow">
          <y:Geometry height="89.0" width="126.0" x="-168.0" y="-211.0"/>
          <y:Fill color="#FFFFFF" transparent="false"/>
          <y:BorderStyle color="#000000" type="line" width="1.0"/>
          <y:NodeLabel alignment="center" autoSizePolicy="content" fontFamily="Helvetica" fontSize="12" fontStyle="plain" hasBackgroundColor="false" hasLineColor="false" height="16.0" modelName="custom" textColor="#000000" visible="true" width="44.025390625" x="40.9873046875" y="36.5">Ancient<y:LabelModel>
              <y:SmartNodeLabelModel distance="4.0"/>
            </y:LabelModel>
            <y:ModelParameter>
              <y:SmartNodeLabelModelParameter labelRatioX="0.0" labelRatioY="0.0" nodeRatioX="0.0" nodeRatioY="0.0" offsetX="0.0" offsetY="0.0" upX="0.0" upY="-1.0"/>
            </y:ModelParameter>
          </y:NodeLabel>
          <y:StyleProperties>
            <y:Property class="com.yworks.yfiles.bpmn.view.BPMNTypeEnum" name="com.yworks.bpmn.type" value="ACTIVITY_TYPE"/>
            <y:Property class="java.awt.Color" name="com.yworks.bpmn.icon.line.color" value="#000000"/>
            <y:Property class="java.awt.Color" name="com.yworks.bpmn.icon.fill" value="#ffffff"/>
            <y:Property class="java.awt.Color" name="com.yworks.bpmn.icon.fill2" value="#d4d4d4"/>
            <y:Property name="com.yworks.bpmn.marker2"/>
            <y:Property name="com.yworks.bpmn.marker1"/>
            <y:Property name="com.yworks.bpmn.marker4"/>
            <y:Property name="com.yworks.bpmn.marker3"/>
          </y:StyleProperties>
        </y:GenericNode>
      </data>
    </node>
    <node id="n2">
      <data key="d4"/>
      <data key="d5"/>
      <data key="d6"/>
      <data key="d7"><![CDATA[./2.2_Islamic.graphml]]></data>
      <data key="d9">
        <y:GenericNode configuration="com.yworks.bpmn.Activity.withShadow">
          <y:Geometry height="89.0" width="126.0" x="18.333333333333343" y="-211.0"/>
          <y:Fill color="#FFFFFF" transparent="false"/>
          <y:BorderStyle color="#000000" type="line" width="1.0"/>
          <y:NodeLabel alignment="center" autoSizePolicy="content" fontFamily="Helvetica" fontSize="12" fontStyle="plain" hasBackgroundColor="false" hasLineColor="false" height="16.0" modelName="custom" textColor="#000000" visible="true" width="41.3359375" x="42.33203125" y="36.5">Islamic<y:LabelModel>
              <y:SmartNodeLabelModel distance="4.0"/>
            </y:LabelModel>
            <y:ModelParameter>
              <y:SmartNodeLabelModelParameter labelRatioX="0.0" labelRatioY="0.0" nodeRatioX="0.0" nodeRatioY="0.0" offsetX="0.0" offsetY="0.0" upX="0.0" upY="-1.0"/>
            </y:ModelParameter>
          </y:NodeLabel>
          <y:StyleProperties>
            <y:Property class="com.yworks.yfiles.bpmn.view.BPMNTypeEnum" name="com.yworks.bpmn.type" value="ACTIVITY_TYPE"/>
            <y:Property class="java.awt.Color" name="com.yworks.bpmn.icon.line.color" value="#000000"/>
            <y:Property class="java.awt.Color" name="com.yworks.bpmn.icon.fill" value="#ffffff"/>
            <y:Property class="java.awt.Color" name="com.yworks.bpmn.icon.fill2" value="#d4d4d4"/>
            <y:Property name="com.yworks.bpmn.marker2"/>
            <y:Property name="com.yworks.bpmn.marker1"/>
            <y:Property name="com.yworks.bpmn.marker4"/>
            <y:Property name="com.yworks.bpmn.marker3"/>
          </y:StyleProperties>
        </y:GenericNode>
      </data>
    </node>
    <node id="n3">
      <data key="d4"/>
      <data key="d5"/>
      <data key="d6"/>
      <data key="d7"><![CDATA[./2.3_Medieval.graphml]]></data>
      <data key="d9">
        <y:GenericNode configuration="com.yworks.bpmn.Activity.withShadow">
          <y:Geometry height="89.0" width="126.0" x="204.66666666666669" y="-211.0"/>
          <y:Fill color="#FFFFFF" transparent="false"/>
          <y:BorderStyle color="#000000" type="line" width="1.0"/>
          <y:NodeLabel alignment="center" autoSizePolicy="content" fontFamily="Helvetica" fontSize="12" fontStyle="plain" hasBackgroundColor="false" hasLineColor="false" height="16.0" modelName="custom" textColor="#000000" visible="true" width="52.0234375" x="36.98828125" y="36.5">Medieval<y:LabelModel>
              <y:SmartNodeLabelModel distance="4.0"/>
            </y:LabelModel>
            <y:ModelParameter>
              <y:SmartNodeLabelModelParameter labelRatioX="0.0" labelRatioY="0.0" nodeRatioX="0.0" nodeRatioY="0.0" offsetX="0.0" offsetY="0.0" upX="0.0" upY="-1.0"/>
            </y:ModelParameter>
          </y:NodeLabel>
          <y:StyleProperties>
            <y:Property class="com.yworks.yfiles.bpmn.view.BPMNTypeEnum" name="com.yworks.bpmn.type" value="ACTIVITY_TYPE"/>
            <y:Property class="java.awt.Color" name="com.yworks.bpmn.icon.line.color" value="#000000"/>
            <y:Property class="java.awt.Color" name="com.yworks.bpmn.icon.fill" value="#ffffff"/>
            <y:Property class="java.awt.Color" name="com.yworks.bpmn.icon.fill2" value="#d4d4d4"/>
            <y:Property name="com.yworks.bpmn.marker2"/>
            <y:Property name="com.yworks.bpmn.marker1"/>
            <y:Property name="com.yworks.bpmn.marker4"/>
            <y:Property name="com.yworks.bpmn.marker3"/>
          </y:StyleProperties>
        </y:GenericNode>
      </data>
    </node>
    <node id="n4">
      <data key="d4"/>
      <data key="d5"/>
      <data key="d6"/>
      <data key="d7"><![CDATA[./2.4_Renaissance.graphml]]></data>
      <data key="d9">
        <y:GenericNode configuration="com.yworks.bpmn.Activity.withShadow">
          <y:Geometry height="89.0" width="126.0" x="391.0" y="-211.0"/>
          <y:Fill color="#FFFFFF" transparent="false"/>
          <y:BorderStyle color="#000000" type="line" width="1.0"/>
          <y:NodeLabel alignment="center" autoSizePolicy="content" fontFamily="Helvetica" fontSize="12" fontStyle="plain" hasBackgroundColor="false" hasLineColor="false" height="16.0" modelName="custom" textColor="#000000" visible="true" width="73.375" x="26.3125" y="36.5">Renaissance<y:LabelModel>
              <y:SmartNodeLabelModel distance="4.0"/>
            </y:LabelModel>
            <y:ModelParameter>
              <y:SmartNodeLabelModelParameter labelRatioX="0.0" labelRatioY="0.0" nodeRatioX="0.0" nodeRatioY="0.0" offsetX="0.0" offsetY="0.0" upX="0.0" upY="-1.0"/>
            </y:ModelParameter>
          </y:NodeLabel>
          <y:StyleProperties>
            <y:Property class="com.yworks.yfiles.bpmn.view.BPMNTypeEnum" name="com.yworks.bpmn.type" value="ACTIVITY_TYPE"/>
            <y:Property class="java.awt.Color" name="com.yworks.bpmn.icon.line.color" value="#000000"/>
            <y:Property class="java.awt.Color" name="com.yworks.bpmn.icon.fill" value="#ffffff"/>
            <y:Property class="java.awt.Color" name="com.yworks.bpmn.icon.fill2" value="#d4d4d4"/>
            <y:Property name="com.yworks.bpmn.marker2"/>
            <y:Property name="com.yworks.bpmn.marker1"/>
            <y:Property name="com.yworks.bpmn.marker4"/>
            <y:Property name="com.yworks.bpmn.marker3"/>
          </y:StyleProperties>
        </y:GenericNode>
      </data>
    </node>
    <node id="n5">
      <data key="d4"/>
      <data key="d5"/>
      <data key="d6"/>
      <data key="d7"><![CDATA[./0_TOPICS.graphml]]></data>
      <data key="d9">
        <y:GenericNode configuration="com.yworks.bpmn.Activity">
          <y:Geometry height="14.956582633053273" width="104.0" x="-173.0" y="-364.95658263305324"/>
          <y:Fill color="#FFFFFF" transparent="false"/>
          <y:BorderStyle color="#FFFFFF" type="line" width="1.0"/>
          <y:NodeLabel alignment="center" autoSizePolicy="content" fontFamily="Helvetica" fontSize="12" fontStyle="plain" hasBackgroundColor="false" hasLineColor="false" height="16.0" modelName="custom" textColor="#000000" visible="true" width="101.365234375" x="1.3173828125" y="-0.5217086834733777">Return to TOPICS<y:LabelModel>
              <y:SmartNodeLabelModel distance="4.0"/>
            </y:LabelModel>
            <y:ModelParameter>
              <y:SmartNodeLabelModelParameter labelRatioX="0.0" labelRatioY="0.0" nodeRatioX="0.0" nodeRatioY="0.0" offsetX="0.0" offsetY="0.0" upX="0.0" upY="-1.0"/>
            </y:ModelParameter>
          </y:NodeLabel>
          <y:StyleProperties>
            <y:Property class="com.yworks.yfiles.bpmn.view.BPMNTypeEnum" name="com.yworks.bpmn.type" value="ACTIVITY_TYPE"/>
            <y:Property class="java.awt.Color" name="com.yworks.bpmn.icon.line.color" value="#000000"/>
            <y:Property class="java.awt.Color" name="com.yworks.bpmn.icon.fill" value="#ffffff"/>
            <y:Property class="java.awt.Color" name="com.yworks.bpmn.icon.fill2" value="#d4d4d4"/>
            <y:Property name="com.yworks.bpmn.marker2"/>
            <y:Property name="com.yworks.bpmn.marker1"/>
            <y:Property name="com.yworks.bpmn.marker4"/>
            <y:Property name="com.yworks.bpmn.marker3"/>
          </y:StyleProperties>
        </y:GenericNode>
      </data>
    </node>
  </graph>
  <data key="d0">
    <y:Resources/>
  </data>
</graphml>
