<?xml version="1.0" encoding="UTF-8" standalone="no"?>
<graphml xmlns="http://graphml.graphdrawing.org/xmlns" xmlns:xsi="http://www.w3.org/2001/XMLSchema-instance" xmlns:y="http://www.yworks.com/xml/graphml" xmlns:yed="http://www.yworks.com/xml/yed/3" xsi:schemaLocation="http://graphml.graphdrawing.org/xmlns http://www.yworks.com/xml/schema/graphml/1.1/ygraphml.xsd">
  <!--Created by yFiles for Java 2.11-->
  <key for="graphml" id="d0" yfiles.type="resources"/>
  <key for="port" id="d1" yfiles.type="portgraphics"/>
  <key for="port" id="d2" yfiles.type="portgeometry"/>
  <key for="port" id="d3" yfiles.type="portuserdata"/>
  <key attr.name="url" attr.type="string" for="node" id="d4"/>
  <key attr.name="description" attr.type="string" for="node" id="d5"/>
  <key for="node" id="d6" yfiles.type="nodegraphics"/>
  <key attr.name="Description" attr.type="string" for="graph" id="d7"/>
  <key attr.name="url" attr.type="string" for="edge" id="d8"/>
  <key attr.name="description" attr.type="string" for="edge" id="d9"/>
  <key for="edge" id="d10" yfiles.type="edgegraphics"/>
  <graph edgedefault="directed" id="G">
    <data key="d7"/>
    <node id="n0">
      <data key="d4"><![CDATA[./2_SOURCES.graphml]]></data>
      <data key="d6">
        <y:GenericNode configuration="com.yworks.bpmn.Activity">
          <y:Geometry height="39.5" width="207.25" x="-134.25" y="-338.0"/>
          <y:Fill color="#FFFFFF" transparent="false"/>
          <y:BorderStyle color="#FFFFFF" type="line" width="1.0"/>
          <y:NodeLabel alignment="center" autoSizePolicy="content" fontFamily="Helvetica" fontSize="18" fontStyle="plain" hasBackgroundColor="false" hasLineColor="false" height="22.0" modelName="custom" textColor="#000000" visible="true" width="204.478515625" x="1.3857421875" y="8.75">Harriot's sources: Islamic<y:LabelModel>
              <y:SmartNodeLabelModel distance="4.0"/>
            </y:LabelModel>
            <y:ModelParameter>
              <y:SmartNodeLabelModelParameter labelRatioX="0.0" labelRatioY="0.0" nodeRatioX="0.0" nodeRatioY="0.0" offsetX="0.0" offsetY="0.0" upX="0.0" upY="-1.0"/>
            </y:ModelParameter>
          </y:NodeLabel>
          <y:StyleProperties>
            <y:Property class="com.yworks.yfiles.bpmn.view.BPMNTypeEnum" name="com.yworks.bpmn.type" value="ACTIVITY_TYPE"/>
            <y:Property class="java.awt.Color" name="com.yworks.bpmn.icon.line.color" value="#000000"/>
            <y:Property class="java.awt.Color" name="com.yworks.bpmn.icon.fill" value="#ffffff"/>
            <y:Property class="java.awt.Color" name="com.yworks.bpmn.icon.fill2" value="#d4d4d4"/>
            <y:Property name="com.yworks.bpmn.marker2"/>
            <y:Property name="com.yworks.bpmn.marker1"/>
            <y:Property name="com.yworks.bpmn.marker4"/>
            <y:Property name="com.yworks.bpmn.marker3"/>
          </y:StyleProperties>
        </y:GenericNode>
      </data>
    </node>
    <node id="n1">
      <data key="d4"><![CDATA[./2.2.3_thabit.graphml]]></data>
      <data key="d6">
        <y:GenericNode configuration="com.yworks.bpmn.Activity.withShadow">
          <y:Geometry height="83.25" width="137.75" x="241.375" y="-233.75"/>
          <y:Fill color="#FFFFFF" transparent="false"/>
          <y:BorderStyle color="#000000" type="line" width="1.0"/>
          <y:NodeLabel alignment="center" autoSizePolicy="content" fontFamily="Helvetica" fontSize="12" fontStyle="plain" hasBackgroundColor="false" hasLineColor="false" height="16.0" modelName="custom" textColor="#000000" visible="true" width="90.70703125" x="23.521484375" y="33.625">Thabit ibn Qurra<y:LabelModel>
              <y:SmartNodeLabelModel distance="4.0"/>
            </y:LabelModel>
            <y:ModelParameter>
              <y:SmartNodeLabelModelParameter labelRatioX="0.0" labelRatioY="0.0" nodeRatioX="0.0" nodeRatioY="0.0" offsetX="0.0" offsetY="0.0" upX="0.0" upY="-1.0"/>
            </y:ModelParameter>
          </y:NodeLabel>
          <y:StyleProperties>
            <y:Property class="com.yworks.yfiles.bpmn.view.BPMNTypeEnum" name="com.yworks.bpmn.type" value="ACTIVITY_TYPE"/>
            <y:Property class="java.awt.Color" name="com.yworks.bpmn.icon.line.color" value="#000000"/>
            <y:Property class="java.awt.Color" name="com.yworks.bpmn.icon.fill" value="#ffffff"/>
            <y:Property class="java.awt.Color" name="com.yworks.bpmn.icon.fill2" value="#d4d4d4"/>
            <y:Property name="com.yworks.bpmn.marker2"/>
            <y:Property name="com.yworks.bpmn.marker1"/>
            <y:Property name="com.yworks.bpmn.marker4"/>
            <y:Property name="com.yworks.bpmn.marker3"/>
          </y:StyleProperties>
        </y:GenericNode>
      </data>
    </node>
    <node id="n2">
      <data key="d4"><![CDATA[./2.2.2_alhazen.graphml]]></data>
      <data key="d6">
        <y:GenericNode configuration="com.yworks.bpmn.Activity.withShadow">
          <y:Geometry height="83.25" width="137.75" x="53.5625" y="-233.75"/>
          <y:Fill color="#FFFFFF" transparent="false"/>
          <y:BorderStyle color="#000000" type="line" width="1.0"/>
          <y:NodeLabel alignment="center" autoSizePolicy="content" fontFamily="Helvetica" fontSize="12" fontStyle="plain" hasBackgroundColor="false" hasLineColor="false" height="16.0" modelName="custom" textColor="#000000" visible="true" width="47.365234375" x="45.1923828125" y="33.625">Alhazen<y:LabelModel>
              <y:SmartNodeLabelModel distance="4.0"/>
            </y:LabelModel>
            <y:ModelParameter>
              <y:SmartNodeLabelModelParameter labelRatioX="0.0" labelRatioY="0.0" nodeRatioX="0.0" nodeRatioY="0.0" offsetX="0.0" offsetY="0.0" upX="0.0" upY="-1.0"/>
            </y:ModelParameter>
          </y:NodeLabel>
          <y:StyleProperties>
            <y:Property class="com.yworks.yfiles.bpmn.view.BPMNTypeEnum" name="com.yworks.bpmn.type" value="ACTIVITY_TYPE"/>
            <y:Property class="java.awt.Color" name="com.yworks.bpmn.icon.line.color" value="#000000"/>
            <y:Property class="java.awt.Color" name="com.yworks.bpmn.icon.fill" value="#ffffff"/>
            <y:Property class="java.awt.Color" name="com.yworks.bpmn.icon.fill2" value="#d4d4d4"/>
            <y:Property name="com.yworks.bpmn.marker2"/>
            <y:Property name="com.yworks.bpmn.marker1"/>
            <y:Property name="com.yworks.bpmn.marker4"/>
            <y:Property name="com.yworks.bpmn.marker3"/>
          </y:StyleProperties>
        </y:GenericNode>
      </data>
    </node>
    <node id="n3">
      <data key="d4"><![CDATA[./2.2.1_albattani.graphml]]></data>
      <data key="d6">
        <y:GenericNode configuration="com.yworks.bpmn.Activity.withShadow">
          <y:Geometry height="83.25" width="137.75" x="-134.25" y="-233.75"/>
          <y:Fill color="#FFFFFF" transparent="false"/>
          <y:BorderStyle color="#000000" type="line" width="1.0"/>
          <y:NodeLabel alignment="center" autoSizePolicy="content" fontFamily="Helvetica" fontSize="12" fontStyle="plain" hasBackgroundColor="false" hasLineColor="false" height="16.0" modelName="custom" textColor="#000000" visible="true" width="54.6953125" x="41.52734375" y="33.625">al-Battani<y:LabelModel>
              <y:SmartNodeLabelModel distance="4.0"/>
            </y:LabelModel>
            <y:ModelParameter>
              <y:SmartNodeLabelModelParameter labelRatioX="0.0" labelRatioY="0.0" nodeRatioX="0.0" nodeRatioY="0.0" offsetX="0.0" offsetY="0.0" upX="0.0" upY="-1.0"/>
            </y:ModelParameter>
          </y:NodeLabel>
          <y:StyleProperties>
            <y:Property class="com.yworks.yfiles.bpmn.view.BPMNTypeEnum" name="com.yworks.bpmn.type" value="ACTIVITY_TYPE"/>
            <y:Property class="java.awt.Color" name="com.yworks.bpmn.icon.line.color" value="#000000"/>
            <y:Property class="java.awt.Color" name="com.yworks.bpmn.icon.fill" value="#ffffff"/>
            <y:Property class="java.awt.Color" name="com.yworks.bpmn.icon.fill2" value="#d4d4d4"/>
            <y:Property name="com.yworks.bpmn.marker2"/>
            <y:Property name="com.yworks.bpmn.marker1"/>
            <y:Property name="com.yworks.bpmn.marker4"/>
            <y:Property name="com.yworks.bpmn.marker3"/>
          </y:StyleProperties>
        </y:GenericNode>
      </data>
    </node>
    <node id="n4">
      <data key="d4"><![CDATA[./0_TOPICS.graphml]]></data>
      <data key="d6">
        <y:GenericNode configuration="com.yworks.bpmn.Activity">
          <y:Geometry height="14.956582633053273" width="104.0" x="-134.25" y="-390.49999999999994"/>
          <y:Fill color="#FFFFFF" transparent="false"/>
          <y:BorderStyle color="#FFFFFF" type="line" width="1.0"/>
          <y:NodeLabel alignment="center" autoSizePolicy="content" fontFamily="Helvetica" fontSize="12" fontStyle="plain" hasBackgroundColor="false" hasLineColor="false" height="16.0" modelName="custom" textColor="#000000" visible="true" width="101.365234375" x="1.3173828125" y="-0.5217086834733777">Return to TOPICS<y:LabelModel>
              <y:SmartNodeLabelModel distance="4.0"/>
            </y:LabelModel>
            <y:ModelParameter>
              <y:SmartNodeLabelModelParameter labelRatioX="0.0" labelRatioY="0.0" nodeRatioX="0.0" nodeRatioY="0.0" offsetX="0.0" offsetY="0.0" upX="0.0" upY="-1.0"/>
            </y:ModelParameter>
          </y:NodeLabel>
          <y:StyleProperties>
            <y:Property class="com.yworks.yfiles.bpmn.view.BPMNTypeEnum" name="com.yworks.bpmn.type" value="ACTIVITY_TYPE"/>
            <y:Property class="java.awt.Color" name="com.yworks.bpmn.icon.line.color" value="#000000"/>
            <y:Property class="java.awt.Color" name="com.yworks.bpmn.icon.fill" value="#ffffff"/>
            <y:Property class="java.awt.Color" name="com.yworks.bpmn.icon.fill2" value="#d4d4d4"/>
            <y:Property name="com.yworks.bpmn.marker2"/>
            <y:Property name="com.yworks.bpmn.marker1"/>
            <y:Property name="com.yworks.bpmn.marker4"/>
            <y:Property name="com.yworks.bpmn.marker3"/>
          </y:StyleProperties>
        </y:GenericNode>
      </data>
    </node>
    <node id="n5">
      <data key="d4"><![CDATA[./2_SOURCES.graphml]]></data>
      <data key="d6">
        <y:GenericNode configuration="com.yworks.bpmn.Activity">
          <y:Geometry height="14.956582633053273" width="132.0" x="-134.25" y="-367.4782913165266"/>
          <y:Fill color="#FFFFFF" transparent="false"/>
          <y:BorderStyle color="#FFFFFF" type="line" width="1.0"/>
          <y:NodeLabel alignment="center" autoSizePolicy="content" fontFamily="Helvetica" fontSize="12" fontStyle="plain" hasBackgroundColor="false" hasLineColor="false" height="16.0" modelName="custom" textColor="#000000" visible="true" width="130.064453125" x="0.9677734375" y="-0.5217086834733777">Return to previous level<y:LabelModel>
              <y:SmartNodeLabelModel distance="4.0"/>
            </y:LabelModel>
            <y:ModelParameter>
              <y:SmartNodeLabelModelParameter labelRatioX="0.0" labelRatioY="0.0" nodeRatioX="0.0" nodeRatioY="0.0" offsetX="0.0" offsetY="0.0" upX="0.0" upY="-1.0"/>
            </y:ModelParameter>
          </y:NodeLabel>
          <y:StyleProperties>
            <y:Property class="com.yworks.yfiles.bpmn.view.BPMNTypeEnum" name="com.yworks.bpmn.type" value="ACTIVITY_TYPE"/>
            <y:Property class="java.awt.Color" name="com.yworks.bpmn.icon.line.color" value="#000000"/>
            <y:Property class="java.awt.Color" name="com.yworks.bpmn.icon.fill" value="#ffffff"/>
            <y:Property class="java.awt.Color" name="com.yworks.bpmn.icon.fill2" value="#d4d4d4"/>
            <y:Property name="com.yworks.bpmn.marker2"/>
            <y:Property name="com.yworks.bpmn.marker1"/>
            <y:Property name="com.yworks.bpmn.marker4"/>
            <y:Property name="com.yworks.bpmn.marker3"/>
          </y:StyleProperties>
        </y:GenericNode>
      </data>
    </node>
  </graph>
  <data key="d0">
    <y:Resources/>
  </data>
</graphml>
