,sourceID,sourceYear,targetID,targetYear,kindOfEdgeLabel,edgeParameter,source_book_location,target_book_location,source_book_format,target_book_format
0,1856,1566,1730,1573,se17_annotatedSameAdaption,937,Antwerp,Antwerp,Octavo,Octavo
1,1856,1566,1855,1578,se17_annotatedSameAdaption,937,Antwerp,Lyon,Octavo,Octavo
2,1856,1566,1959,1594,se17_annotatedSameAdaption,937,Antwerp,Cologne,Octavo,Octavo
3,1856,1566,1960,1581,se17_annotatedSameAdaption,937,Antwerp,Cologne,Octavo,Octavo
4,1856,1566,1911,1572,se17_annotatedSameAdaption,937,Antwerp,Paris,Octavo,Octavo
5,1856,1566,1961,1591,se17_annotatedSameAdaption,937,Antwerp,Cologne,Octavo,Octavo
6,1856,1566,1974,1569,se17_annotatedSameAdaption,937,Antwerp,Paris,Octavo,Octavo
7,1856,1566,1970,1577,se17_annotatedSameAdaption,937,Antwerp,Paris,Octavo,Octavo
8,1690,1545,1688,1545,se17_annotatedSameAdaption,888,Wittenberg,Paris,Octavo,Octavo
9,1968,1567,1730,1573,se17_annotatedSameAdaption,937,Lyon,Antwerp,Octavo,Octavo
10,1968,1567,1855,1578,se17_annotatedSameAdaption,937,Lyon,Lyon,Octavo,Octavo
11,1968,1567,1959,1594,se17_annotatedSameAdaption,937,Lyon,Cologne,Octavo,Octavo
12,1968,1567,1960,1581,se17_annotatedSameAdaption,937,Lyon,Cologne,Octavo,Octavo
13,1968,1567,1911,1572,se17_annotatedSameAdaption,937,Lyon,Paris,Octavo,Octavo
14,1968,1567,1961,1591,se17_annotatedSameAdaption,937,Lyon,Cologne,Octavo,Octavo
15,1968,1567,1974,1569,se17_annotatedSameAdaption,937,Lyon,Paris,Octavo,Octavo
16,1968,1567,1970,1577,se17_annotatedSameAdaption,937,Lyon,Paris,Octavo,Octavo
17,1730,1573,1820,1601,se17_annotatedSameAdaption,313,Antwerp,Cologne,Octavo,Octavo
18,1730,1573,1958,1582,se17_annotatedSameAdaption,313,Antwerp,Antwerp,Octavo,Octavo
19,1730,1573,2281,1582,se17_annotatedSameAdaption,313,Antwerp,Antwerp,Octavo,Octavo
20,1730,1573,1959,1594,se17_annotatedSameAdaption,937,Antwerp,Cologne,Octavo,Octavo
21,1730,1573,1960,1581,se17_annotatedSameAdaption,937,Antwerp,Cologne,Octavo,Octavo
22,1730,1573,1961,1591,se17_annotatedSameAdaption,937,Antwerp,Cologne,Octavo,Octavo
23,1958,1582,1820,1601,se17_annotatedSameAdaption,273,Antwerp,Cologne,Octavo,Octavo
24,1958,1582,1820,1601,se17_annotatedSameAdaption,313,Antwerp,Cologne,Octavo,Octavo
25,1958,1582,1963,1608,se17_annotatedSameAdaption,938,Antwerp,Paris,Octavo,Octavo
26,1958,1582,1741,1584,se17_annotatedSameAdaption,938,Antwerp,Paris,Octavo,Octavo
27,1958,1582,1957,1610,se17_annotatedSameAdaption,938,Antwerp,Cologne,Octavo,Octavo
28,1958,1582,1872,1617,se17_annotatedSameAdaption,938,Antwerp,Lyon,Octavo,Octavo
29,1958,1582,1962,1619,se17_annotatedSameAdaption,938,Antwerp,Paris,Octavo,Octavo
30,1958,1582,1967,1606,se17_annotatedSameAdaption,938,Antwerp,Lyon,Octavo,Octavo
31,1851,1577,2190,1583,se17_annotatedSameAdaption,276,Lyon,Lyon,Octavo,Folio
32,1851,1577,1852,1578,se17_annotatedSameAdaption,276,Lyon,Lyon,Octavo,Octavo
33,1851,1577,2258,1581,se17_annotatedSameAdaption,276,Lyon,Lyon,Octavo,Folio
34,1851,1577,2203,1577,se17_annotatedSameAdaption,276,Lyon,Lyon,Octavo,Octavo
35,1857,1566,1730,1573,se17_annotatedSameAdaption,937,Antwerp,Antwerp,Octavo,Octavo
36,1857,1566,1855,1578,se17_annotatedSameAdaption,937,Antwerp,Lyon,Octavo,Octavo
37,1857,1566,1959,1594,se17_annotatedSameAdaption,937,Antwerp,Cologne,Octavo,Octavo
38,1857,1566,1960,1581,se17_annotatedSameAdaption,937,Antwerp,Cologne,Octavo,Octavo
39,1857,1566,1911,1572,se17_annotatedSameAdaption,937,Antwerp,Paris,Octavo,Octavo
40,1857,1566,1961,1591,se17_annotatedSameAdaption,937,Antwerp,Cologne,Octavo,Octavo
41,1857,1566,1974,1569,se17_annotatedSameAdaption,937,Antwerp,Paris,Octavo,Octavo
42,1857,1566,1970,1577,se17_annotatedSameAdaption,937,Antwerp,Paris,Octavo,Octavo
43,1852,1578,2190,1583,se17_annotatedSameAdaption,276,Lyon,Lyon,Octavo,Folio
44,1852,1578,2258,1581,se17_annotatedSameAdaption,276,Lyon,Lyon,Octavo,Folio
45,1963,1608,1957,1610,se17_annotatedSameAdaption,938,Paris,Cologne,Octavo,Octavo
46,2258,1581,2190,1583,se17_annotatedSameAdaption,276,Lyon,Lyon,Folio,Folio
47,2258,1581,2190,1583,se17_annotatedSameAdaption,276,Lyon,Lyon,Folio,Folio
48,1912,1564,1730,1573,se17_annotatedSameAdaption,937,Lyon,Antwerp,Octavo,Octavo
49,1912,1564,1855,1578,se17_annotatedSameAdaption,937,Lyon,Lyon,Octavo,Octavo
50,1912,1564,1959,1594,se17_annotatedSameAdaption,937,Lyon,Cologne,Octavo,Octavo
51,1912,1564,1960,1581,se17_annotatedSameAdaption,937,Lyon,Cologne,Octavo,Octavo
52,1912,1564,1911,1572,se17_annotatedSameAdaption,937,Lyon,Paris,Octavo,Octavo
53,1912,1564,1961,1591,se17_annotatedSameAdaption,937,Lyon,Cologne,Octavo,Octavo
54,1912,1564,1974,1569,se17_annotatedSameAdaption,937,Lyon,Paris,Octavo,Octavo
55,1912,1564,1970,1577,se17_annotatedSameAdaption,937,Lyon,Paris,Octavo,Octavo
56,1888,1543,1688,1545,se17_annotatedSameAdaption,888,Wittenberg,Paris,Octavo,Octavo
57,1855,1578,1959,1594,se17_annotatedSameAdaption,937,Lyon,Cologne,Octavo,Octavo
58,1855,1578,1960,1581,se17_annotatedSameAdaption,937,Lyon,Cologne,Octavo,Octavo
59,1855,1578,1961,1591,se17_annotatedSameAdaption,937,Lyon,Cologne,Octavo,Octavo
60,2203,1577,2190,1583,se17_annotatedSameAdaption,276,Lyon,Lyon,Octavo,Folio
61,2203,1577,1851,1577,se17_annotatedSameAdaption,276,Lyon,Lyon,Octavo,Octavo
62,2203,1577,2258,1581,se17_annotatedSameAdaption,276,Lyon,Lyon,Octavo,Folio
63,1741,1584,1957,1610,se17_annotatedSameAdaption,938,Paris,Cologne,Octavo,Octavo
64,2281,1582,1820,1601,se17_annotatedSameAdaption,313,Antwerp,Cologne,Octavo,Octavo
65,2281,1582,1820,1601,se17_annotatedSameAdaption,273,Antwerp,Cologne,Octavo,Octavo
66,2281,1582,1963,1608,se17_annotatedSameAdaption,938,Antwerp,Paris,Octavo,Octavo
67,2281,1582,1741,1584,se17_annotatedSameAdaption,938,Antwerp,Paris,Octavo,Octavo
68,2281,1582,1957,1610,se17_annotatedSameAdaption,938,Antwerp,Cologne,Octavo,Octavo
69,2281,1582,1872,1617,se17_annotatedSameAdaption,938,Antwerp,Lyon,Octavo,Octavo
70,2281,1582,1962,1619,se17_annotatedSameAdaption,938,Antwerp,Paris,Octavo,Octavo
71,2281,1582,1967,1606,se17_annotatedSameAdaption,938,Antwerp,Lyon,Octavo,Octavo
72,1957,1610,1763,1629,se17_annotatedSameAdaption,428,Cologne,Salamanca,Octavo,Octavo
73,1957,1610,1872,1617,se17_annotatedSameAdaption,938,Cologne,Lyon,Octavo,Octavo
74,1957,1610,1962,1619,se17_annotatedSameAdaption,938,Cologne,Paris,Octavo,Octavo
75,1911,1572,1959,1594,se17_annotatedSameAdaption,937,Paris,Cologne,Octavo,Octavo
76,1911,1572,1960,1581,se17_annotatedSameAdaption,937,Paris,Cologne,Octavo,Octavo
77,1911,1572,1961,1591,se17_annotatedSameAdaption,937,Paris,Cologne,Octavo,Octavo
78,1688,1545,1896,1568,se17_annotatedSameAdaption,888,Paris,Wittenberg,Octavo,Octavo
79,1688,1545,1690,1545,se17_annotatedSameAdaption,888,Paris,Wittenberg,Octavo,Octavo
80,1688,1545,1903,1561,se17_annotatedSameAdaption,888,Paris,Wittenberg,Octavo,Octavo
81,1688,1545,1897,1574,se17_annotatedSameAdaption,888,Paris,Wittenberg,Octavo,Octavo
82,1688,1545,1899,1629,se17_annotatedSameAdaption,888,Paris,Wittenberg,Octavo,Octavo
83,1688,1545,1904,1563,se17_annotatedSameAdaption,888,Paris,Wittenberg,Octavo,Octavo
84,1688,1545,1900,1553,se17_annotatedSameAdaption,888,Paris,Wittenberg,Octavo,Octavo
85,1688,1545,1891,1558,se17_annotatedSameAdaption,888,Paris,Wittenberg,Octavo,Octavo
86,1688,1545,1894,1549,se17_annotatedSameAdaption,888,Paris,Wittenberg,Octavo,Octavo
87,1688,1545,1753,1601,se17_annotatedSameAdaption,888,Paris,Wittenberg,Octavo,Octavo
88,1688,1545,1895,1550,se17_annotatedSameAdaption,888,Paris,Wittenberg,Octavo,Octavo
89,1688,1545,1898,1578,se17_annotatedSameAdaption,888,Paris,Wittenberg,Octavo,Octavo
90,1974,1569,1959,1594,se17_annotatedSameAdaption,937,Paris,Cologne,Octavo,Octavo
91,1974,1569,1960,1581,se17_annotatedSameAdaption,937,Paris,Cologne,Octavo,Octavo
92,1974,1569,1961,1591,se17_annotatedSameAdaption,937,Paris,Cologne,Octavo,Octavo
93,1967,1606,1957,1610,se17_annotatedSameAdaption,938,Lyon,Cologne,Octavo,Octavo
94,1970,1577,1959,1594,se17_annotatedSameAdaption,937,Paris,Cologne,Octavo,Octavo
95,1970,1577,1960,1581,se17_annotatedSameAdaption,937,Paris,Cologne,Octavo,Octavo
96,1970,1577,1961,1591,se17_annotatedSameAdaption,937,Paris,Cologne,Octavo,Octavo
