{"sourceID":1856,"sourceYear":1566,"targetID":1730,"targetYear":1573,"kindOfEdgeLabel":"se17_annotatedSameAdaption","edgeParameter":937,"source_book_location":"Antwerp","target_book_location":"Antwerp","source_book_format":"Octavo","target_book_format":"Octavo"}
{"sourceID":1856,"sourceYear":1566,"targetID":1855,"targetYear":1578,"kindOfEdgeLabel":"se17_annotatedSameAdaption","edgeParameter":937,"source_book_location":"Antwerp","target_book_location":"Lyon","source_book_format":"Octavo","target_book_format":"Octavo"}
{"sourceID":1856,"sourceYear":1566,"targetID":1959,"targetYear":1594,"kindOfEdgeLabel":"se17_annotatedSameAdaption","edgeParameter":937,"source_book_location":"Antwerp","target_book_location":"Cologne","source_book_format":"Octavo","target_book_format":"Octavo"}
{"sourceID":1856,"sourceYear":1566,"targetID":1960,"targetYear":1581,"kindOfEdgeLabel":"se17_annotatedSameAdaption","edgeParameter":937,"source_book_location":"Antwerp","target_book_location":"Cologne","source_book_format":"Octavo","target_book_format":"Octavo"}
{"sourceID":1856,"sourceYear":1566,"targetID":1911,"targetYear":1572,"kindOfEdgeLabel":"se17_annotatedSameAdaption","edgeParameter":937,"source_book_location":"Antwerp","target_book_location":"Paris","source_book_format":"Octavo","target_book_format":"Octavo"}
{"sourceID":1856,"sourceYear":1566,"targetID":1961,"targetYear":1591,"kindOfEdgeLabel":"se17_annotatedSameAdaption","edgeParameter":937,"source_book_location":"Antwerp","target_book_location":"Cologne","source_book_format":"Octavo","target_book_format":"Octavo"}
{"sourceID":1856,"sourceYear":1566,"targetID":1974,"targetYear":1569,"kindOfEdgeLabel":"se17_annotatedSameAdaption","edgeParameter":937,"source_book_location":"Antwerp","target_book_location":"Paris","source_book_format":"Octavo","target_book_format":"Octavo"}
{"sourceID":1856,"sourceYear":1566,"targetID":1970,"targetYear":1577,"kindOfEdgeLabel":"se17_annotatedSameAdaption","edgeParameter":937,"source_book_location":"Antwerp","target_book_location":"Paris","source_book_format":"Octavo","target_book_format":"Octavo"}
{"sourceID":1690,"sourceYear":1545,"targetID":1688,"targetYear":1545,"kindOfEdgeLabel":"se17_annotatedSameAdaption","edgeParameter":888,"source_book_location":"Wittenberg","target_book_location":"Paris","source_book_format":"Octavo","target_book_format":"Octavo"}
{"sourceID":1968,"sourceYear":1567,"targetID":1730,"targetYear":1573,"kindOfEdgeLabel":"se17_annotatedSameAdaption","edgeParameter":937,"source_book_location":"Lyon","target_book_location":"Antwerp","source_book_format":"Octavo","target_book_format":"Octavo"}
{"sourceID":1968,"sourceYear":1567,"targetID":1855,"targetYear":1578,"kindOfEdgeLabel":"se17_annotatedSameAdaption","edgeParameter":937,"source_book_location":"Lyon","target_book_location":"Lyon","source_book_format":"Octavo","target_book_format":"Octavo"}
{"sourceID":1968,"sourceYear":1567,"targetID":1959,"targetYear":1594,"kindOfEdgeLabel":"se17_annotatedSameAdaption","edgeParameter":937,"source_book_location":"Lyon","target_book_location":"Cologne","source_book_format":"Octavo","target_book_format":"Octavo"}
{"sourceID":1968,"sourceYear":1567,"targetID":1960,"targetYear":1581,"kindOfEdgeLabel":"se17_annotatedSameAdaption","edgeParameter":937,"source_book_location":"Lyon","target_book_location":"Cologne","source_book_format":"Octavo","target_book_format":"Octavo"}
{"sourceID":1968,"sourceYear":1567,"targetID":1911,"targetYear":1572,"kindOfEdgeLabel":"se17_annotatedSameAdaption","edgeParameter":937,"source_book_location":"Lyon","target_book_location":"Paris","source_book_format":"Octavo","target_book_format":"Octavo"}
{"sourceID":1968,"sourceYear":1567,"targetID":1961,"targetYear":1591,"kindOfEdgeLabel":"se17_annotatedSameAdaption","edgeParameter":937,"source_book_location":"Lyon","target_book_location":"Cologne","source_book_format":"Octavo","target_book_format":"Octavo"}
{"sourceID":1968,"sourceYear":1567,"targetID":1974,"targetYear":1569,"kindOfEdgeLabel":"se17_annotatedSameAdaption","edgeParameter":937,"source_book_location":"Lyon","target_book_location":"Paris","source_book_format":"Octavo","target_book_format":"Octavo"}
{"sourceID":1968,"sourceYear":1567,"targetID":1970,"targetYear":1577,"kindOfEdgeLabel":"se17_annotatedSameAdaption","edgeParameter":937,"source_book_location":"Lyon","target_book_location":"Paris","source_book_format":"Octavo","target_book_format":"Octavo"}
{"sourceID":1730,"sourceYear":1573,"targetID":1820,"targetYear":1601,"kindOfEdgeLabel":"se17_annotatedSameAdaption","edgeParameter":313,"source_book_location":"Antwerp","target_book_location":"Cologne","source_book_format":"Octavo","target_book_format":"Octavo"}
{"sourceID":1730,"sourceYear":1573,"targetID":1958,"targetYear":1582,"kindOfEdgeLabel":"se17_annotatedSameAdaption","edgeParameter":313,"source_book_location":"Antwerp","target_book_location":"Antwerp","source_book_format":"Octavo","target_book_format":"Octavo"}
{"sourceID":1730,"sourceYear":1573,"targetID":2281,"targetYear":1582,"kindOfEdgeLabel":"se17_annotatedSameAdaption","edgeParameter":313,"source_book_location":"Antwerp","target_book_location":"Antwerp","source_book_format":"Octavo","target_book_format":"Octavo"}
{"sourceID":1730,"sourceYear":1573,"targetID":1959,"targetYear":1594,"kindOfEdgeLabel":"se17_annotatedSameAdaption","edgeParameter":937,"source_book_location":"Antwerp","target_book_location":"Cologne","source_book_format":"Octavo","target_book_format":"Octavo"}
{"sourceID":1730,"sourceYear":1573,"targetID":1960,"targetYear":1581,"kindOfEdgeLabel":"se17_annotatedSameAdaption","edgeParameter":937,"source_book_location":"Antwerp","target_book_location":"Cologne","source_book_format":"Octavo","target_book_format":"Octavo"}
{"sourceID":1730,"sourceYear":1573,"targetID":1961,"targetYear":1591,"kindOfEdgeLabel":"se17_annotatedSameAdaption","edgeParameter":937,"source_book_location":"Antwerp","target_book_location":"Cologne","source_book_format":"Octavo","target_book_format":"Octavo"}
{"sourceID":1958,"sourceYear":1582,"targetID":1820,"targetYear":1601,"kindOfEdgeLabel":"se17_annotatedSameAdaption","edgeParameter":273,"source_book_location":"Antwerp","target_book_location":"Cologne","source_book_format":"Octavo","target_book_format":"Octavo"}
{"sourceID":1958,"sourceYear":1582,"targetID":1820,"targetYear":1601,"kindOfEdgeLabel":"se17_annotatedSameAdaption","edgeParameter":313,"source_book_location":"Antwerp","target_book_location":"Cologne","source_book_format":"Octavo","target_book_format":"Octavo"}
{"sourceID":1958,"sourceYear":1582,"targetID":1963,"targetYear":1608,"kindOfEdgeLabel":"se17_annotatedSameAdaption","edgeParameter":938,"source_book_location":"Antwerp","target_book_location":"Paris","source_book_format":"Octavo","target_book_format":"Octavo"}
{"sourceID":1958,"sourceYear":1582,"targetID":1741,"targetYear":1584,"kindOfEdgeLabel":"se17_annotatedSameAdaption","edgeParameter":938,"source_book_location":"Antwerp","target_book_location":"Paris","source_book_format":"Octavo","target_book_format":"Octavo"}
{"sourceID":1958,"sourceYear":1582,"targetID":1957,"targetYear":1610,"kindOfEdgeLabel":"se17_annotatedSameAdaption","edgeParameter":938,"source_book_location":"Antwerp","target_book_location":"Cologne","source_book_format":"Octavo","target_book_format":"Octavo"}
{"sourceID":1958,"sourceYear":1582,"targetID":1872,"targetYear":1617,"kindOfEdgeLabel":"se17_annotatedSameAdaption","edgeParameter":938,"source_book_location":"Antwerp","target_book_location":"Lyon","source_book_format":"Octavo","target_book_format":"Octavo"}
{"sourceID":1958,"sourceYear":1582,"targetID":1962,"targetYear":1619,"kindOfEdgeLabel":"se17_annotatedSameAdaption","edgeParameter":938,"source_book_location":"Antwerp","target_book_location":"Paris","source_book_format":"Octavo","target_book_format":"Octavo"}
{"sourceID":1958,"sourceYear":1582,"targetID":1967,"targetYear":1606,"kindOfEdgeLabel":"se17_annotatedSameAdaption","edgeParameter":938,"source_book_location":"Antwerp","target_book_location":"Lyon","source_book_format":"Octavo","target_book_format":"Octavo"}
{"sourceID":1851,"sourceYear":1577,"targetID":2190,"targetYear":1583,"kindOfEdgeLabel":"se17_annotatedSameAdaption","edgeParameter":276,"source_book_location":"Lyon","target_book_location":"Lyon","source_book_format":"Octavo","target_book_format":"Folio"}
{"sourceID":1851,"sourceYear":1577,"targetID":1852,"targetYear":1578,"kindOfEdgeLabel":"se17_annotatedSameAdaption","edgeParameter":276,"source_book_location":"Lyon","target_book_location":"Lyon","source_book_format":"Octavo","target_book_format":"Octavo"}
{"sourceID":1851,"sourceYear":1577,"targetID":2258,"targetYear":1581,"kindOfEdgeLabel":"se17_annotatedSameAdaption","edgeParameter":276,"source_book_location":"Lyon","target_book_location":"Lyon","source_book_format":"Octavo","target_book_format":"Folio"}
{"sourceID":1851,"sourceYear":1577,"targetID":2203,"targetYear":1577,"kindOfEdgeLabel":"se17_annotatedSameAdaption","edgeParameter":276,"source_book_location":"Lyon","target_book_location":"Lyon","source_book_format":"Octavo","target_book_format":"Octavo"}
{"sourceID":1857,"sourceYear":1566,"targetID":1730,"targetYear":1573,"kindOfEdgeLabel":"se17_annotatedSameAdaption","edgeParameter":937,"source_book_location":"Antwerp","target_book_location":"Antwerp","source_book_format":"Octavo","target_book_format":"Octavo"}
{"sourceID":1857,"sourceYear":1566,"targetID":1855,"targetYear":1578,"kindOfEdgeLabel":"se17_annotatedSameAdaption","edgeParameter":937,"source_book_location":"Antwerp","target_book_location":"Lyon","source_book_format":"Octavo","target_book_format":"Octavo"}
{"sourceID":1857,"sourceYear":1566,"targetID":1959,"targetYear":1594,"kindOfEdgeLabel":"se17_annotatedSameAdaption","edgeParameter":937,"source_book_location":"Antwerp","target_book_location":"Cologne","source_book_format":"Octavo","target_book_format":"Octavo"}
{"sourceID":1857,"sourceYear":1566,"targetID":1960,"targetYear":1581,"kindOfEdgeLabel":"se17_annotatedSameAdaption","edgeParameter":937,"source_book_location":"Antwerp","target_book_location":"Cologne","source_book_format":"Octavo","target_book_format":"Octavo"}
{"sourceID":1857,"sourceYear":1566,"targetID":1911,"targetYear":1572,"kindOfEdgeLabel":"se17_annotatedSameAdaption","edgeParameter":937,"source_book_location":"Antwerp","target_book_location":"Paris","source_book_format":"Octavo","target_book_format":"Octavo"}
{"sourceID":1857,"sourceYear":1566,"targetID":1961,"targetYear":1591,"kindOfEdgeLabel":"se17_annotatedSameAdaption","edgeParameter":937,"source_book_location":"Antwerp","target_book_location":"Cologne","source_book_format":"Octavo","target_book_format":"Octavo"}
{"sourceID":1857,"sourceYear":1566,"targetID":1974,"targetYear":1569,"kindOfEdgeLabel":"se17_annotatedSameAdaption","edgeParameter":937,"source_book_location":"Antwerp","target_book_location":"Paris","source_book_format":"Octavo","target_book_format":"Octavo"}
{"sourceID":1857,"sourceYear":1566,"targetID":1970,"targetYear":1577,"kindOfEdgeLabel":"se17_annotatedSameAdaption","edgeParameter":937,"source_book_location":"Antwerp","target_book_location":"Paris","source_book_format":"Octavo","target_book_format":"Octavo"}
{"sourceID":1852,"sourceYear":1578,"targetID":2190,"targetYear":1583,"kindOfEdgeLabel":"se17_annotatedSameAdaption","edgeParameter":276,"source_book_location":"Lyon","target_book_location":"Lyon","source_book_format":"Octavo","target_book_format":"Folio"}
{"sourceID":1852,"sourceYear":1578,"targetID":2258,"targetYear":1581,"kindOfEdgeLabel":"se17_annotatedSameAdaption","edgeParameter":276,"source_book_location":"Lyon","target_book_location":"Lyon","source_book_format":"Octavo","target_book_format":"Folio"}
{"sourceID":1963,"sourceYear":1608,"targetID":1957,"targetYear":1610,"kindOfEdgeLabel":"se17_annotatedSameAdaption","edgeParameter":938,"source_book_location":"Paris","target_book_location":"Cologne","source_book_format":"Octavo","target_book_format":"Octavo"}
{"sourceID":2258,"sourceYear":1581,"targetID":2190,"targetYear":1583,"kindOfEdgeLabel":"se17_annotatedSameAdaption","edgeParameter":276,"source_book_location":"Lyon","target_book_location":"Lyon","source_book_format":"Folio","target_book_format":"Folio"}
{"sourceID":2258,"sourceYear":1581,"targetID":2190,"targetYear":1583,"kindOfEdgeLabel":"se17_annotatedSameAdaption","edgeParameter":276,"source_book_location":"Lyon","target_book_location":"Lyon","source_book_format":"Folio","target_book_format":"Folio"}
{"sourceID":1912,"sourceYear":1564,"targetID":1730,"targetYear":1573,"kindOfEdgeLabel":"se17_annotatedSameAdaption","edgeParameter":937,"source_book_location":"Lyon","target_book_location":"Antwerp","source_book_format":"Octavo","target_book_format":"Octavo"}
{"sourceID":1912,"sourceYear":1564,"targetID":1855,"targetYear":1578,"kindOfEdgeLabel":"se17_annotatedSameAdaption","edgeParameter":937,"source_book_location":"Lyon","target_book_location":"Lyon","source_book_format":"Octavo","target_book_format":"Octavo"}
{"sourceID":1912,"sourceYear":1564,"targetID":1959,"targetYear":1594,"kindOfEdgeLabel":"se17_annotatedSameAdaption","edgeParameter":937,"source_book_location":"Lyon","target_book_location":"Cologne","source_book_format":"Octavo","target_book_format":"Octavo"}
{"sourceID":1912,"sourceYear":1564,"targetID":1960,"targetYear":1581,"kindOfEdgeLabel":"se17_annotatedSameAdaption","edgeParameter":937,"source_book_location":"Lyon","target_book_location":"Cologne","source_book_format":"Octavo","target_book_format":"Octavo"}
{"sourceID":1912,"sourceYear":1564,"targetID":1911,"targetYear":1572,"kindOfEdgeLabel":"se17_annotatedSameAdaption","edgeParameter":937,"source_book_location":"Lyon","target_book_location":"Paris","source_book_format":"Octavo","target_book_format":"Octavo"}
{"sourceID":1912,"sourceYear":1564,"targetID":1961,"targetYear":1591,"kindOfEdgeLabel":"se17_annotatedSameAdaption","edgeParameter":937,"source_book_location":"Lyon","target_book_location":"Cologne","source_book_format":"Octavo","target_book_format":"Octavo"}
{"sourceID":1912,"sourceYear":1564,"targetID":1974,"targetYear":1569,"kindOfEdgeLabel":"se17_annotatedSameAdaption","edgeParameter":937,"source_book_location":"Lyon","target_book_location":"Paris","source_book_format":"Octavo","target_book_format":"Octavo"}
{"sourceID":1912,"sourceYear":1564,"targetID":1970,"targetYear":1577,"kindOfEdgeLabel":"se17_annotatedSameAdaption","edgeParameter":937,"source_book_location":"Lyon","target_book_location":"Paris","source_book_format":"Octavo","target_book_format":"Octavo"}
{"sourceID":1888,"sourceYear":1543,"targetID":1688,"targetYear":1545,"kindOfEdgeLabel":"se17_annotatedSameAdaption","edgeParameter":888,"source_book_location":"Wittenberg","target_book_location":"Paris","source_book_format":"Octavo","target_book_format":"Octavo"}
{"sourceID":1855,"sourceYear":1578,"targetID":1959,"targetYear":1594,"kindOfEdgeLabel":"se17_annotatedSameAdaption","edgeParameter":937,"source_book_location":"Lyon","target_book_location":"Cologne","source_book_format":"Octavo","target_book_format":"Octavo"}
{"sourceID":1855,"sourceYear":1578,"targetID":1960,"targetYear":1581,"kindOfEdgeLabel":"se17_annotatedSameAdaption","edgeParameter":937,"source_book_location":"Lyon","target_book_location":"Cologne","source_book_format":"Octavo","target_book_format":"Octavo"}
{"sourceID":1855,"sourceYear":1578,"targetID":1961,"targetYear":1591,"kindOfEdgeLabel":"se17_annotatedSameAdaption","edgeParameter":937,"source_book_location":"Lyon","target_book_location":"Cologne","source_book_format":"Octavo","target_book_format":"Octavo"}
{"sourceID":2203,"sourceYear":1577,"targetID":2190,"targetYear":1583,"kindOfEdgeLabel":"se17_annotatedSameAdaption","edgeParameter":276,"source_book_location":"Lyon","target_book_location":"Lyon","source_book_format":"Octavo","target_book_format":"Folio"}
{"sourceID":2203,"sourceYear":1577,"targetID":1851,"targetYear":1577,"kindOfEdgeLabel":"se17_annotatedSameAdaption","edgeParameter":276,"source_book_location":"Lyon","target_book_location":"Lyon","source_book_format":"Octavo","target_book_format":"Octavo"}
{"sourceID":2203,"sourceYear":1577,"targetID":2258,"targetYear":1581,"kindOfEdgeLabel":"se17_annotatedSameAdaption","edgeParameter":276,"source_book_location":"Lyon","target_book_location":"Lyon","source_book_format":"Octavo","target_book_format":"Folio"}
{"sourceID":1741,"sourceYear":1584,"targetID":1957,"targetYear":1610,"kindOfEdgeLabel":"se17_annotatedSameAdaption","edgeParameter":938,"source_book_location":"Paris","target_book_location":"Cologne","source_book_format":"Octavo","target_book_format":"Octavo"}
{"sourceID":2281,"sourceYear":1582,"targetID":1820,"targetYear":1601,"kindOfEdgeLabel":"se17_annotatedSameAdaption","edgeParameter":313,"source_book_location":"Antwerp","target_book_location":"Cologne","source_book_format":"Octavo","target_book_format":"Octavo"}
{"sourceID":2281,"sourceYear":1582,"targetID":1820,"targetYear":1601,"kindOfEdgeLabel":"se17_annotatedSameAdaption","edgeParameter":273,"source_book_location":"Antwerp","target_book_location":"Cologne","source_book_format":"Octavo","target_book_format":"Octavo"}
{"sourceID":2281,"sourceYear":1582,"targetID":1963,"targetYear":1608,"kindOfEdgeLabel":"se17_annotatedSameAdaption","edgeParameter":938,"source_book_location":"Antwerp","target_book_location":"Paris","source_book_format":"Octavo","target_book_format":"Octavo"}
{"sourceID":2281,"sourceYear":1582,"targetID":1741,"targetYear":1584,"kindOfEdgeLabel":"se17_annotatedSameAdaption","edgeParameter":938,"source_book_location":"Antwerp","target_book_location":"Paris","source_book_format":"Octavo","target_book_format":"Octavo"}
{"sourceID":2281,"sourceYear":1582,"targetID":1957,"targetYear":1610,"kindOfEdgeLabel":"se17_annotatedSameAdaption","edgeParameter":938,"source_book_location":"Antwerp","target_book_location":"Cologne","source_book_format":"Octavo","target_book_format":"Octavo"}
{"sourceID":2281,"sourceYear":1582,"targetID":1872,"targetYear":1617,"kindOfEdgeLabel":"se17_annotatedSameAdaption","edgeParameter":938,"source_book_location":"Antwerp","target_book_location":"Lyon","source_book_format":"Octavo","target_book_format":"Octavo"}
{"sourceID":2281,"sourceYear":1582,"targetID":1962,"targetYear":1619,"kindOfEdgeLabel":"se17_annotatedSameAdaption","edgeParameter":938,"source_book_location":"Antwerp","target_book_location":"Paris","source_book_format":"Octavo","target_book_format":"Octavo"}
{"sourceID":2281,"sourceYear":1582,"targetID":1967,"targetYear":1606,"kindOfEdgeLabel":"se17_annotatedSameAdaption","edgeParameter":938,"source_book_location":"Antwerp","target_book_location":"Lyon","source_book_format":"Octavo","target_book_format":"Octavo"}
{"sourceID":1957,"sourceYear":1610,"targetID":1763,"targetYear":1629,"kindOfEdgeLabel":"se17_annotatedSameAdaption","edgeParameter":428,"source_book_location":"Cologne","target_book_location":"Salamanca","source_book_format":"Octavo","target_book_format":"Octavo"}
{"sourceID":1957,"sourceYear":1610,"targetID":1872,"targetYear":1617,"kindOfEdgeLabel":"se17_annotatedSameAdaption","edgeParameter":938,"source_book_location":"Cologne","target_book_location":"Lyon","source_book_format":"Octavo","target_book_format":"Octavo"}
{"sourceID":1957,"sourceYear":1610,"targetID":1962,"targetYear":1619,"kindOfEdgeLabel":"se17_annotatedSameAdaption","edgeParameter":938,"source_book_location":"Cologne","target_book_location":"Paris","source_book_format":"Octavo","target_book_format":"Octavo"}
{"sourceID":1911,"sourceYear":1572,"targetID":1959,"targetYear":1594,"kindOfEdgeLabel":"se17_annotatedSameAdaption","edgeParameter":937,"source_book_location":"Paris","target_book_location":"Cologne","source_book_format":"Octavo","target_book_format":"Octavo"}
{"sourceID":1911,"sourceYear":1572,"targetID":1960,"targetYear":1581,"kindOfEdgeLabel":"se17_annotatedSameAdaption","edgeParameter":937,"source_book_location":"Paris","target_book_location":"Cologne","source_book_format":"Octavo","target_book_format":"Octavo"}
{"sourceID":1911,"sourceYear":1572,"targetID":1961,"targetYear":1591,"kindOfEdgeLabel":"se17_annotatedSameAdaption","edgeParameter":937,"source_book_location":"Paris","target_book_location":"Cologne","source_book_format":"Octavo","target_book_format":"Octavo"}
{"sourceID":1688,"sourceYear":1545,"targetID":1896,"targetYear":1568,"kindOfEdgeLabel":"se17_annotatedSameAdaption","edgeParameter":888,"source_book_location":"Paris","target_book_location":"Wittenberg","source_book_format":"Octavo","target_book_format":"Octavo"}
{"sourceID":1688,"sourceYear":1545,"targetID":1690,"targetYear":1545,"kindOfEdgeLabel":"se17_annotatedSameAdaption","edgeParameter":888,"source_book_location":"Paris","target_book_location":"Wittenberg","source_book_format":"Octavo","target_book_format":"Octavo"}
{"sourceID":1688,"sourceYear":1545,"targetID":1903,"targetYear":1561,"kindOfEdgeLabel":"se17_annotatedSameAdaption","edgeParameter":888,"source_book_location":"Paris","target_book_location":"Wittenberg","source_book_format":"Octavo","target_book_format":"Octavo"}
{"sourceID":1688,"sourceYear":1545,"targetID":1897,"targetYear":1574,"kindOfEdgeLabel":"se17_annotatedSameAdaption","edgeParameter":888,"source_book_location":"Paris","target_book_location":"Wittenberg","source_book_format":"Octavo","target_book_format":"Octavo"}
{"sourceID":1688,"sourceYear":1545,"targetID":1899,"targetYear":1629,"kindOfEdgeLabel":"se17_annotatedSameAdaption","edgeParameter":888,"source_book_location":"Paris","target_book_location":"Wittenberg","source_book_format":"Octavo","target_book_format":"Octavo"}
{"sourceID":1688,"sourceYear":1545,"targetID":1904,"targetYear":1563,"kindOfEdgeLabel":"se17_annotatedSameAdaption","edgeParameter":888,"source_book_location":"Paris","target_book_location":"Wittenberg","source_book_format":"Octavo","target_book_format":"Octavo"}
{"sourceID":1688,"sourceYear":1545,"targetID":1900,"targetYear":1553,"kindOfEdgeLabel":"se17_annotatedSameAdaption","edgeParameter":888,"source_book_location":"Paris","target_book_location":"Wittenberg","source_book_format":"Octavo","target_book_format":"Octavo"}
{"sourceID":1688,"sourceYear":1545,"targetID":1891,"targetYear":1558,"kindOfEdgeLabel":"se17_annotatedSameAdaption","edgeParameter":888,"source_book_location":"Paris","target_book_location":"Wittenberg","source_book_format":"Octavo","target_book_format":"Octavo"}
{"sourceID":1688,"sourceYear":1545,"targetID":1894,"targetYear":1549,"kindOfEdgeLabel":"se17_annotatedSameAdaption","edgeParameter":888,"source_book_location":"Paris","target_book_location":"Wittenberg","source_book_format":"Octavo","target_book_format":"Octavo"}
{"sourceID":1688,"sourceYear":1545,"targetID":1753,"targetYear":1601,"kindOfEdgeLabel":"se17_annotatedSameAdaption","edgeParameter":888,"source_book_location":"Paris","target_book_location":"Wittenberg","source_book_format":"Octavo","target_book_format":"Octavo"}
{"sourceID":1688,"sourceYear":1545,"targetID":1895,"targetYear":1550,"kindOfEdgeLabel":"se17_annotatedSameAdaption","edgeParameter":888,"source_book_location":"Paris","target_book_location":"Wittenberg","source_book_format":"Octavo","target_book_format":"Octavo"}
{"sourceID":1688,"sourceYear":1545,"targetID":1898,"targetYear":1578,"kindOfEdgeLabel":"se17_annotatedSameAdaption","edgeParameter":888,"source_book_location":"Paris","target_book_location":"Wittenberg","source_book_format":"Octavo","target_book_format":"Octavo"}
{"sourceID":1974,"sourceYear":1569,"targetID":1959,"targetYear":1594,"kindOfEdgeLabel":"se17_annotatedSameAdaption","edgeParameter":937,"source_book_location":"Paris","target_book_location":"Cologne","source_book_format":"Octavo","target_book_format":"Octavo"}
{"sourceID":1974,"sourceYear":1569,"targetID":1960,"targetYear":1581,"kindOfEdgeLabel":"se17_annotatedSameAdaption","edgeParameter":937,"source_book_location":"Paris","target_book_location":"Cologne","source_book_format":"Octavo","target_book_format":"Octavo"}
{"sourceID":1974,"sourceYear":1569,"targetID":1961,"targetYear":1591,"kindOfEdgeLabel":"se17_annotatedSameAdaption","edgeParameter":937,"source_book_location":"Paris","target_book_location":"Cologne","source_book_format":"Octavo","target_book_format":"Octavo"}
{"sourceID":1967,"sourceYear":1606,"targetID":1957,"targetYear":1610,"kindOfEdgeLabel":"se17_annotatedSameAdaption","edgeParameter":938,"source_book_location":"Lyon","target_book_location":"Cologne","source_book_format":"Octavo","target_book_format":"Octavo"}
{"sourceID":1970,"sourceYear":1577,"targetID":1959,"targetYear":1594,"kindOfEdgeLabel":"se17_annotatedSameAdaption","edgeParameter":937,"source_book_location":"Paris","target_book_location":"Cologne","source_book_format":"Octavo","target_book_format":"Octavo"}
{"sourceID":1970,"sourceYear":1577,"targetID":1960,"targetYear":1581,"kindOfEdgeLabel":"se17_annotatedSameAdaption","edgeParameter":937,"source_book_location":"Paris","target_book_location":"Cologne","source_book_format":"Octavo","target_book_format":"Octavo"}
{"sourceID":1970,"sourceYear":1577,"targetID":1961,"targetYear":1591,"kindOfEdgeLabel":"se17_annotatedSameAdaption","edgeParameter":937,"source_book_location":"Paris","target_book_location":"Cologne","source_book_format":"Octavo","target_book_format":"Octavo"}
