2262
1933
2268
2244
2178
2181
2171
2232
2179
1980
2272
2173
1840
2163
2176
2183
2249
1778
2115
1979
1777
2159
2237
2067
2069
2177
2182
2276
2261
2175
2164
1775
2062
2169
2170
1850
2234
2271
1697
2161
2063
2257
2253
2233
2235
2240
2208
2236
2248
2180
2172
2221
2162
2165
1699
2073
2157
2167
2252
2158
2245
2168
1919
2077
2160
1597
2273
2246
2166
2267
2241
2274
2242
2231
1720
2064
2066
2068
2071
1718
2070
2247
2251
2265
2250
