1684
1688
1690
1692
1694
1708
1711
1712
1716
1728
1730
1741
1753
1851
1872
1885
1886
1888
1890
1891
1892
1894
1895
1896
1897
1898
1899
1900
1902
1903
1904
1911
1934
1951
1952
1953
1955
1962
1963
1964
1965
1967
1969
1970
1971
1972
1973
1974
2087
2190
2198
2258
