source_ID,sourceYear,target_ID,targetYear,kindOfEdgeLabel,edgeParameter,personType,sourcePrinterPublisher,sourcePrinterPublisherYear,targetPrinters,targetPublishers
1963,1608,1962,1619,aw3_fingerprintPrintersPublishers,FP Chain 10,publisher_to_printerpublisher,Widow of Guillaume Cavellat (Denise de Marnef),1626,"Quesnel, Jacques","Quesnel, Jacques"
1880,1534,1690,1545,aw3_fingerprintPrintersPublishers,FP Chain 13,printerpublisher_to_printerpublisher,"Klug, Joseph",1552,"Kreutzer, Veit","Kreutzer, Veit"
1880,1534,1894,1549,aw3_fingerprintPrintersPublishers,FP Chain 13,printerpublisher_to_printerpublisher,"Klug, Joseph",1552,"Kreutzer, Veit","Kreutzer, Veit"
1880,1534,1888,1543,aw3_fingerprintPrintersPublishers,FP Chain 13,printerpublisher_to_printerpublisher,"Klug, Joseph",1552,"Seitz, Peter I.","Seitz, Peter I."
1880,1534,1684,1543,aw3_fingerprintPrintersPublishers,FP Chain 13,printerpublisher_to_printerpublisher,"Klug, Joseph",1552,"Richard, Jean","Richard, Jean"
1880,1534,1887,1542,aw3_fingerprintPrintersPublishers,FP Chain 13,printerpublisher_to_printerpublisher,"Klug, Joseph",1552,"Loys, Jean","Loys, Jean"
1880,1534,1688,1545,aw3_fingerprintPrintersPublishers,FP Chain 13,printerpublisher_to_printer,"Klug, Joseph",1552,"Loys, Jean","Richard, Guillaume"
1880,1534,1688,1545,aw3_fingerprintPrintersPublishers,FP Chain 13,printerpublisher_to_publisher,"Klug, Joseph",1552,"Loys, Jean","Richard, Guillaume"
1880,1534,1895,1550,aw3_fingerprintPrintersPublishers,FP Chain 13,printerpublisher_to_printerpublisher,"Klug, Joseph",1552,"Krafft the Elder, Johann","Krafft the Elder, Johann"
1882,1536,1690,1545,aw3_fingerprintPrintersPublishers,FP Chain 13,printerpublisher_to_printerpublisher,"Klug, Joseph",1552,"Kreutzer, Veit","Kreutzer, Veit"
1882,1536,1894,1549,aw3_fingerprintPrintersPublishers,FP Chain 13,printerpublisher_to_printerpublisher,"Klug, Joseph",1552,"Kreutzer, Veit","Kreutzer, Veit"
1882,1536,1888,1543,aw3_fingerprintPrintersPublishers,FP Chain 13,printerpublisher_to_printerpublisher,"Klug, Joseph",1552,"Seitz, Peter I.","Seitz, Peter I."
1882,1536,1684,1543,aw3_fingerprintPrintersPublishers,FP Chain 13,printerpublisher_to_printerpublisher,"Klug, Joseph",1552,"Richard, Jean","Richard, Jean"
1882,1536,1887,1542,aw3_fingerprintPrintersPublishers,FP Chain 13,printerpublisher_to_printerpublisher,"Klug, Joseph",1552,"Loys, Jean","Loys, Jean"
1882,1536,1688,1545,aw3_fingerprintPrintersPublishers,FP Chain 13,printerpublisher_to_printer,"Klug, Joseph",1552,"Loys, Jean","Richard, Guillaume"
1882,1536,1688,1545,aw3_fingerprintPrintersPublishers,FP Chain 13,printerpublisher_to_publisher,"Klug, Joseph",1552,"Loys, Jean","Richard, Guillaume"
1882,1536,1895,1550,aw3_fingerprintPrintersPublishers,FP Chain 13,printerpublisher_to_printerpublisher,"Klug, Joseph",1552,"Krafft the Elder, Johann","Krafft the Elder, Johann"
1885,1538,1690,1545,aw3_fingerprintPrintersPublishers,FP Chain 13,printerpublisher_to_printerpublisher,"Klug, Joseph",1552,"Kreutzer, Veit","Kreutzer, Veit"
1885,1538,1894,1549,aw3_fingerprintPrintersPublishers,FP Chain 13,printerpublisher_to_printerpublisher,"Klug, Joseph",1552,"Kreutzer, Veit","Kreutzer, Veit"
1885,1538,1888,1543,aw3_fingerprintPrintersPublishers,FP Chain 13,printerpublisher_to_printerpublisher,"Klug, Joseph",1552,"Seitz, Peter I.","Seitz, Peter I."
1885,1538,1684,1543,aw3_fingerprintPrintersPublishers,FP Chain 13,printerpublisher_to_printerpublisher,"Klug, Joseph",1552,"Richard, Jean","Richard, Jean"
1885,1538,1887,1542,aw3_fingerprintPrintersPublishers,FP Chain 13,printerpublisher_to_printerpublisher,"Klug, Joseph",1552,"Loys, Jean","Loys, Jean"
1885,1538,1688,1545,aw3_fingerprintPrintersPublishers,FP Chain 13,printerpublisher_to_printer,"Klug, Joseph",1552,"Loys, Jean","Richard, Guillaume"
1885,1538,1688,1545,aw3_fingerprintPrintersPublishers,FP Chain 13,printerpublisher_to_publisher,"Klug, Joseph",1552,"Loys, Jean","Richard, Guillaume"
1885,1538,1895,1550,aw3_fingerprintPrintersPublishers,FP Chain 13,printerpublisher_to_printerpublisher,"Klug, Joseph",1552,"Krafft the Elder, Johann","Krafft the Elder, Johann"
1886,1540,1690,1545,aw3_fingerprintPrintersPublishers,FP Chain 13,printerpublisher_to_printerpublisher,"Klug, Joseph",1552,"Kreutzer, Veit","Kreutzer, Veit"
1886,1540,1894,1549,aw3_fingerprintPrintersPublishers,FP Chain 13,printerpublisher_to_printerpublisher,"Klug, Joseph",1552,"Kreutzer, Veit","Kreutzer, Veit"
1886,1540,1888,1543,aw3_fingerprintPrintersPublishers,FP Chain 13,printerpublisher_to_printerpublisher,"Klug, Joseph",1552,"Seitz, Peter I.","Seitz, Peter I."
1886,1540,1684,1543,aw3_fingerprintPrintersPublishers,FP Chain 13,printerpublisher_to_printerpublisher,"Klug, Joseph",1552,"Richard, Jean","Richard, Jean"
1886,1540,1887,1542,aw3_fingerprintPrintersPublishers,FP Chain 13,printerpublisher_to_printerpublisher,"Klug, Joseph",1552,"Loys, Jean","Loys, Jean"
1886,1540,1688,1545,aw3_fingerprintPrintersPublishers,FP Chain 13,printerpublisher_to_printer,"Klug, Joseph",1552,"Loys, Jean","Richard, Guillaume"
1886,1540,1688,1545,aw3_fingerprintPrintersPublishers,FP Chain 13,printerpublisher_to_publisher,"Klug, Joseph",1552,"Loys, Jean","Richard, Guillaume"
1886,1540,1895,1550,aw3_fingerprintPrintersPublishers,FP Chain 13,printerpublisher_to_printerpublisher,"Klug, Joseph",1552,"Krafft the Elder, Johann","Krafft the Elder, Johann"
1887,1542,1690,1545,aw3_fingerprintPrintersPublishers,FP Chain 13,printerpublisher_to_printerpublisher,"Loys, Jean",1547,"Kreutzer, Veit","Kreutzer, Veit"
1887,1542,1888,1543,aw3_fingerprintPrintersPublishers,FP Chain 13,printerpublisher_to_printerpublisher,"Loys, Jean",1547,"Seitz, Peter I.","Seitz, Peter I."
1887,1542,1684,1543,aw3_fingerprintPrintersPublishers,FP Chain 13,printerpublisher_to_printerpublisher,"Loys, Jean",1547,"Richard, Jean","Richard, Jean"
1887,1542,1688,1545,aw3_fingerprintPrintersPublishers,FP Chain 13,printerpublisher_to_publisher,"Loys, Jean",1547,"Loys, Jean","Richard, Guillaume"
1684,1543,1896,1568,aw3_fingerprintPrintersPublishers,FP Chain 13,printerpublisher_to_printerpublisher,"Richard, Jean",1573,"Krafft the Elder, Johann","Krafft the Elder, Johann"
1684,1543,1690,1545,aw3_fingerprintPrintersPublishers,FP Chain 13,printerpublisher_to_printerpublisher,"Richard, Jean",1573,"Kreutzer, Veit","Kreutzer, Veit"
1684,1543,1903,1561,aw3_fingerprintPrintersPublishers,FP Chain 13,printerpublisher_to_printerpublisher,"Richard, Jean",1573,"Krafft the Elder, Johann","Krafft the Elder, Johann"
1684,1543,1904,1563,aw3_fingerprintPrintersPublishers,FP Chain 13,printerpublisher_to_printerpublisher,"Richard, Jean",1573,"Krafft the Elder, Johann","Krafft the Elder, Johann"
1684,1543,1900,1553,aw3_fingerprintPrintersPublishers,FP Chain 13,printerpublisher_to_printerpublisher,"Richard, Jean",1573,"Krafft the Elder, Johann","Krafft the Elder, Johann"
1684,1543,1891,1558,aw3_fingerprintPrintersPublishers,FP Chain 13,printerpublisher_to_printerpublisher,"Richard, Jean",1573,"Krafft the Elder, Johann","Krafft the Elder, Johann"
1684,1543,1894,1549,aw3_fingerprintPrintersPublishers,FP Chain 13,printerpublisher_to_printerpublisher,"Richard, Jean",1573,"Kreutzer, Veit","Kreutzer, Veit"
1684,1543,1688,1545,aw3_fingerprintPrintersPublishers,FP Chain 13,printerpublisher_to_printer,"Richard, Jean",1573,"Loys, Jean","Richard, Guillaume"
1684,1543,1688,1545,aw3_fingerprintPrintersPublishers,FP Chain 13,printerpublisher_to_publisher,"Richard, Jean",1573,"Loys, Jean","Richard, Guillaume"
1684,1543,1895,1550,aw3_fingerprintPrintersPublishers,FP Chain 13,printerpublisher_to_printerpublisher,"Richard, Jean",1573,"Krafft the Elder, Johann","Krafft the Elder, Johann"
1888,1543,1896,1568,aw3_fingerprintPrintersPublishers,FP Chain 13,printerpublisher_to_printerpublisher,"Seitz, Peter I.",1584,"Krafft the Elder, Johann","Krafft the Elder, Johann"
1888,1543,1690,1545,aw3_fingerprintPrintersPublishers,FP Chain 13,printerpublisher_to_printerpublisher,"Seitz, Peter I.",1584,"Kreutzer, Veit","Kreutzer, Veit"
1888,1543,1903,1561,aw3_fingerprintPrintersPublishers,FP Chain 13,printerpublisher_to_printerpublisher,"Seitz, Peter I.",1584,"Krafft the Elder, Johann","Krafft the Elder, Johann"
1888,1543,1897,1574,aw3_fingerprintPrintersPublishers,FP Chain 13,printerpublisher_to_printerpublisher,"Seitz, Peter I.",1584,Heirs of Peter I. Seitz,Heirs of Peter I. Seitz
1888,1543,1904,1563,aw3_fingerprintPrintersPublishers,FP Chain 13,printerpublisher_to_printerpublisher,"Seitz, Peter I.",1584,"Krafft the Elder, Johann","Krafft the Elder, Johann"
1888,1543,1900,1553,aw3_fingerprintPrintersPublishers,FP Chain 13,printerpublisher_to_printerpublisher,"Seitz, Peter I.",1584,"Krafft the Elder, Johann","Krafft the Elder, Johann"
1888,1543,1891,1558,aw3_fingerprintPrintersPublishers,FP Chain 13,printerpublisher_to_printerpublisher,"Seitz, Peter I.",1584,"Krafft the Elder, Johann","Krafft the Elder, Johann"
1888,1543,1894,1549,aw3_fingerprintPrintersPublishers,FP Chain 13,printerpublisher_to_printerpublisher,"Seitz, Peter I.",1584,"Kreutzer, Veit","Kreutzer, Veit"
1888,1543,1688,1545,aw3_fingerprintPrintersPublishers,FP Chain 13,printerpublisher_to_printer,"Seitz, Peter I.",1584,"Loys, Jean","Richard, Guillaume"
1888,1543,1688,1545,aw3_fingerprintPrintersPublishers,FP Chain 13,printerpublisher_to_publisher,"Seitz, Peter I.",1584,"Loys, Jean","Richard, Guillaume"
1888,1543,1895,1550,aw3_fingerprintPrintersPublishers,FP Chain 13,printerpublisher_to_printerpublisher,"Seitz, Peter I.",1584,"Krafft the Elder, Johann","Krafft the Elder, Johann"
1888,1543,1898,1578,aw3_fingerprintPrintersPublishers,FP Chain 13,printerpublisher_to_printerpublisher,"Seitz, Peter I.",1584,Heirs of Peter I. Seitz,Heirs of Peter I. Seitz
1690,1545,1896,1568,aw3_fingerprintPrintersPublishers,FP Chain 13,printerpublisher_to_printerpublisher,"Kreutzer, Veit",1573,"Krafft the Elder, Johann","Krafft the Elder, Johann"
1690,1545,1903,1561,aw3_fingerprintPrintersPublishers,FP Chain 13,printerpublisher_to_printerpublisher,"Kreutzer, Veit",1573,"Krafft the Elder, Johann","Krafft the Elder, Johann"
1690,1545,1904,1563,aw3_fingerprintPrintersPublishers,FP Chain 13,printerpublisher_to_printerpublisher,"Kreutzer, Veit",1573,"Krafft the Elder, Johann","Krafft the Elder, Johann"
1690,1545,1900,1553,aw3_fingerprintPrintersPublishers,FP Chain 13,printerpublisher_to_printerpublisher,"Kreutzer, Veit",1573,"Krafft the Elder, Johann","Krafft the Elder, Johann"
1690,1545,1891,1558,aw3_fingerprintPrintersPublishers,FP Chain 13,printerpublisher_to_printerpublisher,"Kreutzer, Veit",1573,"Krafft the Elder, Johann","Krafft the Elder, Johann"
1690,1545,1895,1550,aw3_fingerprintPrintersPublishers,FP Chain 13,printerpublisher_to_printerpublisher,"Kreutzer, Veit",1573,"Krafft the Elder, Johann","Krafft the Elder, Johann"
1894,1549,1896,1568,aw3_fingerprintPrintersPublishers,FP Chain 13,printerpublisher_to_printerpublisher,"Kreutzer, Veit",1573,"Krafft the Elder, Johann","Krafft the Elder, Johann"
1894,1549,1903,1561,aw3_fingerprintPrintersPublishers,FP Chain 13,printerpublisher_to_printerpublisher,"Kreutzer, Veit",1573,"Krafft the Elder, Johann","Krafft the Elder, Johann"
1894,1549,1904,1563,aw3_fingerprintPrintersPublishers,FP Chain 13,printerpublisher_to_printerpublisher,"Kreutzer, Veit",1573,"Krafft the Elder, Johann","Krafft the Elder, Johann"
1894,1549,1900,1553,aw3_fingerprintPrintersPublishers,FP Chain 13,printerpublisher_to_printerpublisher,"Kreutzer, Veit",1573,"Krafft the Elder, Johann","Krafft the Elder, Johann"
1894,1549,1891,1558,aw3_fingerprintPrintersPublishers,FP Chain 13,printerpublisher_to_printerpublisher,"Kreutzer, Veit",1573,"Krafft the Elder, Johann","Krafft the Elder, Johann"
1894,1549,1895,1550,aw3_fingerprintPrintersPublishers,FP Chain 13,printerpublisher_to_printerpublisher,"Kreutzer, Veit",1573,"Krafft the Elder, Johann","Krafft the Elder, Johann"
1895,1550,1897,1574,aw3_fingerprintPrintersPublishers,FP Chain 13,printerpublisher_to_printerpublisher,"Krafft the Elder, Johann",1578,Heirs of Peter I. Seitz,Heirs of Peter I. Seitz
1900,1553,1897,1574,aw3_fingerprintPrintersPublishers,FP Chain 13,printerpublisher_to_printerpublisher,"Krafft the Elder, Johann",1578,Heirs of Peter I. Seitz,Heirs of Peter I. Seitz
1891,1558,1897,1574,aw3_fingerprintPrintersPublishers,FP Chain 13,printerpublisher_to_printerpublisher,"Krafft the Elder, Johann",1578,Heirs of Peter I. Seitz,Heirs of Peter I. Seitz
1903,1561,1897,1574,aw3_fingerprintPrintersPublishers,FP Chain 13,printerpublisher_to_printerpublisher,"Krafft the Elder, Johann",1578,Heirs of Peter I. Seitz,Heirs of Peter I. Seitz
1904,1563,1897,1574,aw3_fingerprintPrintersPublishers,FP Chain 13,printerpublisher_to_printerpublisher,"Krafft the Elder, Johann",1578,Heirs of Peter I. Seitz,Heirs of Peter I. Seitz
1896,1568,1897,1574,aw3_fingerprintPrintersPublishers,FP Chain 13,printerpublisher_to_printerpublisher,"Krafft the Elder, Johann",1578,Heirs of Peter I. Seitz,Heirs of Peter I. Seitz
2254,1600,1753,1601,aw3_fingerprintPrintersPublishers,FP Chain 13,printer_to_printer,"Palthenius, Zacharias",1614,"Krafft, Johann",Zacharias Schürer & partners
2254,1600,1753,1601,aw3_fingerprintPrintersPublishers,FP Chain 13,printer_to_publisher,"Palthenius, Zacharias",1614,"Krafft, Johann",Zacharias Schürer & partners
2254,1600,1899,1629,aw3_fingerprintPrintersPublishers,FP Chain 13,publisher_to_printerpublisher,"Rosa, Jonas",1630,Widow & heirs of Zacharias I. Schürer,Widow & heirs of Zacharias I. Schürer
2254,1600,1753,1601,aw3_fingerprintPrintersPublishers,FP Chain 13,publisher_to_printer,"Rosa, Jonas",1630,"Krafft, Johann",Zacharias Schürer & partners
2254,1600,1753,1601,aw3_fingerprintPrintersPublishers,FP Chain 13,publisher_to_publisher,"Rosa, Jonas",1630,"Krafft, Johann",Zacharias Schürer & partners
2178,1582,2179,1611,aw3_fingerprintPrintersPublishers,FP Chain 14,printerpublisher_to_printer,"Krafft, Johann",1624,"Säuberlich, Lorenz","Seelfisch, Samuel"
2178,1582,2179,1611,aw3_fingerprintPrintersPublishers,FP Chain 14,printerpublisher_to_publisher,"Krafft, Johann",1624,"Säuberlich, Lorenz","Seelfisch, Samuel"
2178,1582,2176,1588,aw3_fingerprintPrintersPublishers,FP Chain 14,printerpublisher_to_printerpublisher,"Krafft, Johann",1624,"Welack, Matthaeus","Welack, Matthaeus"
2178,1582,2183,1616,aw3_fingerprintPrintersPublishers,FP Chain 14,printerpublisher_to_printer,"Krafft, Johann",1624,Heirs of Andreas Kelner,Heirs of Samuel Selfisch
2178,1582,2183,1616,aw3_fingerprintPrintersPublishers,FP Chain 14,printerpublisher_to_publisher,"Krafft, Johann",1624,Heirs of Andreas Kelner,Heirs of Samuel Selfisch
2178,1582,2175,1598,aw3_fingerprintPrintersPublishers,FP Chain 14,printerpublisher_to_printerpublisher,"Krafft, Johann",1624,Anonymous_1598,Anonymous_1598
2176,1588,2177,1590,aw3_fingerprintPrintersPublishers,FP Chain 14,printerpublisher_to_printerpublisher,"Welack, Matthaeus",1593,"Krafft, Johann","Krafft, Johann"
2177,1590,2179,1611,aw3_fingerprintPrintersPublishers,FP Chain 14,printerpublisher_to_printer,"Krafft, Johann",1624,"Säuberlich, Lorenz","Seelfisch, Samuel"
2177,1590,2179,1611,aw3_fingerprintPrintersPublishers,FP Chain 14,printerpublisher_to_publisher,"Krafft, Johann",1624,"Säuberlich, Lorenz","Seelfisch, Samuel"
2177,1590,2183,1616,aw3_fingerprintPrintersPublishers,FP Chain 14,printerpublisher_to_printer,"Krafft, Johann",1624,Heirs of Andreas Kelner,Heirs of Samuel Selfisch
2177,1590,2183,1616,aw3_fingerprintPrintersPublishers,FP Chain 14,printerpublisher_to_publisher,"Krafft, Johann",1624,Heirs of Andreas Kelner,Heirs of Samuel Selfisch
2177,1590,2175,1598,aw3_fingerprintPrintersPublishers,FP Chain 14,printerpublisher_to_printerpublisher,"Krafft, Johann",1624,Anonymous_1598,Anonymous_1598
2181,1595,2179,1611,aw3_fingerprintPrintersPublishers,FP Chain 14,printerpublisher_to_printer,"Krafft, Johann",1624,"Säuberlich, Lorenz","Seelfisch, Samuel"
2181,1595,2179,1611,aw3_fingerprintPrintersPublishers,FP Chain 14,printerpublisher_to_publisher,"Krafft, Johann",1624,"Säuberlich, Lorenz","Seelfisch, Samuel"
2181,1595,2183,1616,aw3_fingerprintPrintersPublishers,FP Chain 14,printerpublisher_to_printer,"Krafft, Johann",1624,Heirs of Andreas Kelner,Heirs of Samuel Selfisch
2181,1595,2183,1616,aw3_fingerprintPrintersPublishers,FP Chain 14,printerpublisher_to_publisher,"Krafft, Johann",1624,Heirs of Andreas Kelner,Heirs of Samuel Selfisch
2181,1595,2175,1598,aw3_fingerprintPrintersPublishers,FP Chain 14,printerpublisher_to_printerpublisher,"Krafft, Johann",1624,Anonymous_1598,Anonymous_1598
2175,1598,2179,1611,aw3_fingerprintPrintersPublishers,FP Chain 14,printerpublisher_to_printer,Anonymous_1598,1618,"Säuberlich, Lorenz","Seelfisch, Samuel"
2175,1598,2179,1611,aw3_fingerprintPrintersPublishers,FP Chain 14,printerpublisher_to_publisher,Anonymous_1598,1618,"Säuberlich, Lorenz","Seelfisch, Samuel"
2175,1598,2183,1616,aw3_fingerprintPrintersPublishers,FP Chain 14,printerpublisher_to_printer,Anonymous_1598,1618,Heirs of Andreas Kelner,Heirs of Samuel Selfisch
2175,1598,2183,1616,aw3_fingerprintPrintersPublishers,FP Chain 14,printerpublisher_to_publisher,Anonymous_1598,1618,Heirs of Andreas Kelner,Heirs of Samuel Selfisch
2175,1598,2182,1603,aw3_fingerprintPrintersPublishers,FP Chain 14,printerpublisher_to_printerpublisher,Anonymous_1598,1618,"Krafft, Johann","Krafft, Johann"
2182,1603,2179,1611,aw3_fingerprintPrintersPublishers,FP Chain 14,printerpublisher_to_printer,"Krafft, Johann",1624,"Säuberlich, Lorenz","Seelfisch, Samuel"
2182,1603,2179,1611,aw3_fingerprintPrintersPublishers,FP Chain 14,printerpublisher_to_publisher,"Krafft, Johann",1624,"Säuberlich, Lorenz","Seelfisch, Samuel"
2182,1603,2183,1616,aw3_fingerprintPrintersPublishers,FP Chain 14,printerpublisher_to_printer,"Krafft, Johann",1624,Heirs of Andreas Kelner,Heirs of Samuel Selfisch
2182,1603,2183,1616,aw3_fingerprintPrintersPublishers,FP Chain 14,printerpublisher_to_publisher,"Krafft, Johann",1624,Heirs of Andreas Kelner,Heirs of Samuel Selfisch
2179,1611,2183,1616,aw3_fingerprintPrintersPublishers,FP Chain 14,printer_to_printer,"Säuberlich, Lorenz",1623,Heirs of Andreas Kelner,Heirs of Samuel Selfisch
2179,1611,2183,1616,aw3_fingerprintPrintersPublishers,FP Chain 14,printer_to_publisher,"Säuberlich, Lorenz",1623,Heirs of Andreas Kelner,Heirs of Samuel Selfisch
2183,1616,2115,1629,aw3_fingerprintPrintersPublishers,FP Chain 14,publisher_to_printer,Heirs of Samuel Selfisch,1673,"Fincelius, Hiob Wilhelm",Heirs of Samuel Selfisch
2063,1566,2067,1595,aw3_fingerprintPrintersPublishers,FP Chain 15,printerpublisher_to_printerpublisher,Giovanni Varisco & company,1600,Heir of Giovanni Varisco  (Giorgio),Heir of Giovanni Varisco  (Giorgio)
2063,1566,2069,1584,aw3_fingerprintPrintersPublishers,FP Chain 15,printerpublisher_to_printerpublisher,Giovanni Varisco & company,1600,"Varisco, Giovanni & Paganini, Paganino","Varisco, Giovanni & Paganini, Paganino"
2073,1573,2067,1595,aw3_fingerprintPrintersPublishers,FP Chain 15,printerpublisher_to_printerpublisher,Giovanni Varisco & company,1600,Heir of Giovanni Varisco  (Giorgio),Heir of Giovanni Varisco  (Giorgio)
2073,1573,2069,1584,aw3_fingerprintPrintersPublishers,FP Chain 15,printerpublisher_to_printerpublisher,Giovanni Varisco & company,1600,"Varisco, Giovanni & Paganini, Paganino","Varisco, Giovanni & Paganini, Paganino"
1919,1579,2067,1595,aw3_fingerprintPrintersPublishers,FP Chain 15,printerpublisher_to_printerpublisher,Giovanni Varisco & company,1600,Heir of Giovanni Varisco  (Giorgio),Heir of Giovanni Varisco  (Giorgio)
1919,1579,2069,1584,aw3_fingerprintPrintersPublishers,FP Chain 15,printerpublisher_to_printerpublisher,Giovanni Varisco & company,1600,"Varisco, Giovanni & Paganini, Paganino","Varisco, Giovanni & Paganini, Paganino"
2069,1584,2067,1595,aw3_fingerprintPrintersPublishers,FP Chain 15,printerpublisher_to_printerpublisher,"Varisco, Giovanni & Paganini, Paganino",1600,Heir of Giovanni Varisco  (Giorgio),Heir of Giovanni Varisco  (Giorgio)
2160,1564,2161,1573,aw3_fingerprintPrintersPublishers,FP Chain 16,printerpublisher_to_printerpublisher,"Krafft the Elder, Johann",1578,"Schöne, Anton","Schöne, Anton"
2160,1564,2161,1573,aw3_fingerprintPrintersPublishers,FP Chain 16,printerpublisher_to_printerpublisher,"Krafft the Elder, Johann",1578,"Schleich, Clemens","Schleich, Clemens"
2158,1567,2161,1573,aw3_fingerprintPrintersPublishers,FP Chain 16,printerpublisher_to_printerpublisher,"Krafft the Elder, Johann",1578,"Schöne, Anton","Schöne, Anton"
2158,1567,2161,1573,aw3_fingerprintPrintersPublishers,FP Chain 16,printerpublisher_to_printerpublisher,"Krafft the Elder, Johann",1578,"Schleich, Clemens","Schleich, Clemens"
2157,1570,2161,1573,aw3_fingerprintPrintersPublishers,FP Chain 16,printerpublisher_to_printerpublisher,"Krafft the Elder, Johann",1578,"Schöne, Anton","Schöne, Anton"
2157,1570,2161,1573,aw3_fingerprintPrintersPublishers,FP Chain 16,printerpublisher_to_printerpublisher,"Krafft the Elder, Johann",1578,"Schleich, Clemens","Schleich, Clemens"
2161,1573,2162,1578,aw3_fingerprintPrintersPublishers,FP Chain 16,printerpublisher_to_printerpublisher,"Schöne, Anton",1585,"Krafft the Elder, Johann","Krafft the Elder, Johann"
2161,1573,2159,1583,aw3_fingerprintPrintersPublishers,FP Chain 16,printerpublisher_to_printerpublisher,"Schöne, Anton",1585,"Welack, Matthaeus","Welack, Matthaeus"
2161,1573,2162,1578,aw3_fingerprintPrintersPublishers,FP Chain 16,printerpublisher_to_printerpublisher,"Schleich, Clemens",1588,"Krafft the Elder, Johann","Krafft the Elder, Johann"
2161,1573,2159,1583,aw3_fingerprintPrintersPublishers,FP Chain 16,printerpublisher_to_printerpublisher,"Schleich, Clemens",1588,"Welack, Matthaeus","Welack, Matthaeus"
2258,1581,2190,1583,aw3_fingerprintPrintersPublishers,FP Chain 17,publisher_to_printer,"Béraud, Symphorien",1596,"Tinghi, Philippe","Béraud, Symphorien"
1616,1486,2201,1489,aw3_fingerprintPrintersPublishers,FP Chain 18,printerpublisher_to_printerpublisher,"Landsberg, Martin",1523,"Kachelofen, Konrad","Kachelofen, Konrad"
1616,1486,2200,1489,aw3_fingerprintPrintersPublishers,FP Chain 18,printerpublisher_to_printerpublisher,"Landsberg, Martin",1523,"Kachelofen, Konrad","Kachelofen, Konrad"
1624,1494,1833,1507,aw3_fingerprintPrintersPublishers,FP Chain 19,printerpublisher_to_printerpublisher,"Hopyl, Wolfgang",1533,"Estienne I., Henri","Estienne I., Henri"
1624,1494,1829,1511,aw3_fingerprintPrintersPublishers,FP Chain 19,printerpublisher_to_printerpublisher,"Hopyl, Wolfgang",1533,"Estienne I., Henri","Estienne I., Henri"
1624,1494,1828,1516,aw3_fingerprintPrintersPublishers,FP Chain 19,printerpublisher_to_printerpublisher,"Hopyl, Wolfgang",1533,"Estienne I., Henri","Estienne I., Henri"
1830,1500,1833,1507,aw3_fingerprintPrintersPublishers,FP Chain 19,printerpublisher_to_printerpublisher,"Hopyl, Wolfgang",1533,"Estienne I., Henri","Estienne I., Henri"
1830,1500,1829,1511,aw3_fingerprintPrintersPublishers,FP Chain 19,printerpublisher_to_printerpublisher,"Hopyl, Wolfgang",1533,"Estienne I., Henri","Estienne I., Henri"
1830,1500,1828,1516,aw3_fingerprintPrintersPublishers,FP Chain 19,printerpublisher_to_printerpublisher,"Hopyl, Wolfgang",1533,"Estienne I., Henri","Estienne I., Henri"
1626,1494,1632,1498,aw3_fingerprintPrintersPublishers,FP Chain 20,printerpublisher_to_printerpublisher,"Landsberg, Martin",1523,"Stöckel, Wolfgang","Stöckel, Wolfgang"
1655,1516,1877,1519,aw3_fingerprintPrintersPublishers,FP Chain 23,printerpublisher_to_printerpublisher,"Gutknecht, Jobst",1542,"Aich, Arnd von","Aich, Arnd von"
1761,1619,1764,1633,aw3_fingerprintPrintersPublishers,FP Chain 25,printer_to_printerpublisher,"Guyot, Claude",1638,"Spirinx, Nicolas","Spirinx, Nicolas"
1761,1619,1764,1633,aw3_fingerprintPrintersPublishers,FP Chain 25,publisher_to_printerpublisher,"Guyot, Claude",1638,"Spirinx, Nicolas","Spirinx, Nicolas"
1670,1527,1679,1534,aw3_fingerprintPrintersPublishers,FP Chain 26,printerpublisher_to_printer,"Chaudière, Regnault",1564,"Vidoue, Pierre","Chaudière, Regnault"
2070,1548,1718,1561,aw3_fingerprintPrintersPublishers,FP Chain 29,printerpublisher_to_printerpublisher,"Bascarini, Niccolò",1564,"Bevilacqua, Niccolò","Bevilacqua, Niccolò"
1925,1490,1926,1491,aw3_fingerprintPrintersPublishers,FP Chain 3,printerpublisher_to_printerpublisher,"Scoto I., Ottaviano",1508,"Trino, Guglielmo da","Trino, Guglielmo da"
1925,1490,1930,1501,aw3_fingerprintPrintersPublishers,FP Chain 3,printerpublisher_to_printerpublisher,"Scoto I., Ottaviano",1508,"Sessa I., Giovanni Battista","Sessa I., Giovanni Battista"
1926,1491,1930,1501,aw3_fingerprintPrintersPublishers,FP Chain 3,printerpublisher_to_printerpublisher,"Trino, Guglielmo da",1509,"Sessa I., Giovanni Battista","Sessa I., Giovanni Battista"
1930,1501,1650,1513,aw3_fingerprintPrintersPublishers,FP Chain 3,printerpublisher_to_printerpublisher,"Sessa I., Giovanni Battista",1519,"Sessa I., Melchiorre","Sessa I., Melchiorre"
1650,1513,1884,1537,aw3_fingerprintPrintersPublishers,FP Chain 3,printerpublisher_to_printer,"Sessa I., Melchiorre",1565,"Nicolini da Sabbio, Giovanni Antonio","Sessa I., Melchiorre"
1650,1513,1942,1519,aw3_fingerprintPrintersPublishers,FP Chain 3,printerpublisher_to_printerpublisher,"Sessa I., Melchiorre",1565,"Penzio, Giacomo","Penzio, Giacomo"
1650,1513,1883,1537,aw3_fingerprintPrintersPublishers,FP Chain 3,printerpublisher_to_printerpublisher,"Sessa I., Melchiorre",1565,"Bindoni I., Francesco","Bindoni I., Francesco"
1650,1513,1883,1537,aw3_fingerprintPrintersPublishers,FP Chain 3,printerpublisher_to_printerpublisher,"Sessa I., Melchiorre",1565,"Pasini, Maffeo","Pasini, Maffeo"
1650,1513,1682,1541,aw3_fingerprintPrintersPublishers,FP Chain 3,printerpublisher_to_printerpublisher,"Sessa I., Melchiorre",1565,"Bindoni I., Francesco","Bindoni I., Francesco"
1650,1513,1682,1541,aw3_fingerprintPrintersPublishers,FP Chain 3,printerpublisher_to_printerpublisher,"Sessa I., Melchiorre",1565,"Pasini, Maffeo","Pasini, Maffeo"
1650,1513,1687,1545,aw3_fingerprintPrintersPublishers,FP Chain 3,printerpublisher_to_printer,"Sessa I., Melchiorre",1565,Giovanni Antonio Nicolini da Sabbio & brothers,"Sessa I., Melchiorre"
1884,1537,1682,1541,aw3_fingerprintPrintersPublishers,FP Chain 3,printer_to_printerpublisher,"Nicolini da Sabbio, Giovanni Antonio",1560,"Bindoni I., Francesco","Bindoni I., Francesco"
1884,1537,1682,1541,aw3_fingerprintPrintersPublishers,FP Chain 3,printer_to_printerpublisher,"Nicolini da Sabbio, Giovanni Antonio",1560,"Pasini, Maffeo","Pasini, Maffeo"
1884,1537,1687,1545,aw3_fingerprintPrintersPublishers,FP Chain 3,printer_to_printer,"Nicolini da Sabbio, Giovanni Antonio",1560,Giovanni Antonio Nicolini da Sabbio & brothers,"Sessa I., Melchiorre"
1884,1537,1687,1545,aw3_fingerprintPrintersPublishers,FP Chain 3,printer_to_publisher,"Nicolini da Sabbio, Giovanni Antonio",1560,Giovanni Antonio Nicolini da Sabbio & brothers,"Sessa I., Melchiorre"
1884,1537,1682,1541,aw3_fingerprintPrintersPublishers,FP Chain 3,publisher_to_printerpublisher,"Sessa I., Melchiorre",1565,"Bindoni I., Francesco","Bindoni I., Francesco"
1884,1537,1682,1541,aw3_fingerprintPrintersPublishers,FP Chain 3,publisher_to_printerpublisher,"Sessa I., Melchiorre",1565,"Pasini, Maffeo","Pasini, Maffeo"
1884,1537,1687,1545,aw3_fingerprintPrintersPublishers,FP Chain 3,publisher_to_printer,"Sessa I., Melchiorre",1565,Giovanni Antonio Nicolini da Sabbio & brothers,"Sessa I., Melchiorre"
1883,1537,1682,1541,aw3_fingerprintPrintersPublishers,FP Chain 3,printerpublisher_to_printerpublisher,"Bindoni I., Francesco",1567,"Pasini, Maffeo","Pasini, Maffeo"
1883,1537,1687,1545,aw3_fingerprintPrintersPublishers,FP Chain 3,printerpublisher_to_printer,"Bindoni I., Francesco",1567,Giovanni Antonio Nicolini da Sabbio & brothers,"Sessa I., Melchiorre"
1883,1537,1687,1545,aw3_fingerprintPrintersPublishers,FP Chain 3,printerpublisher_to_publisher,"Bindoni I., Francesco",1567,Giovanni Antonio Nicolini da Sabbio & brothers,"Sessa I., Melchiorre"
1883,1537,1682,1541,aw3_fingerprintPrintersPublishers,FP Chain 3,printerpublisher_to_printerpublisher,"Pasini, Maffeo",1551,"Bindoni I., Francesco","Bindoni I., Francesco"
1883,1537,1687,1545,aw3_fingerprintPrintersPublishers,FP Chain 3,printerpublisher_to_printer,"Pasini, Maffeo",1551,Giovanni Antonio Nicolini da Sabbio & brothers,"Sessa I., Melchiorre"
1883,1537,1687,1545,aw3_fingerprintPrintersPublishers,FP Chain 3,printerpublisher_to_publisher,"Pasini, Maffeo",1551,Giovanni Antonio Nicolini da Sabbio & brothers,"Sessa I., Melchiorre"
1682,1541,1687,1545,aw3_fingerprintPrintersPublishers,FP Chain 3,printerpublisher_to_printer,"Bindoni I., Francesco",1567,Giovanni Antonio Nicolini da Sabbio & brothers,"Sessa I., Melchiorre"
1682,1541,1687,1545,aw3_fingerprintPrintersPublishers,FP Chain 3,printerpublisher_to_publisher,"Bindoni I., Francesco",1567,Giovanni Antonio Nicolini da Sabbio & brothers,"Sessa I., Melchiorre"
1682,1541,1687,1545,aw3_fingerprintPrintersPublishers,FP Chain 3,printerpublisher_to_printer,"Pasini, Maffeo",1551,Giovanni Antonio Nicolini da Sabbio & brothers,"Sessa I., Melchiorre"
1682,1541,1687,1545,aw3_fingerprintPrintersPublishers,FP Chain 3,printerpublisher_to_publisher,"Pasini, Maffeo",1551,Giovanni Antonio Nicolini da Sabbio & brothers,"Sessa I., Melchiorre"
1779,1549,1594,1550,aw3_fingerprintPrintersPublishers,FP Chain 30,printerpublisher_to_printerpublisher,"Braubach, Peter",1567,Heirs of Peter I. Seitz,Heirs of Peter I. Seitz
2064,1552,2068,1553,aw3_fingerprintPrintersPublishers,FP Chain 35,printerpublisher_to_printerpublisher,"Bascarini, Niccolò",1564,"Cesano, Bartolomeo","Cesano, Bartolomeo"
2165,1553,2166,1563,aw3_fingerprintPrintersPublishers,FP Chain 36,printerpublisher_to_printerpublisher,"Krafft the Elder, Johann",1578,"Lufft, Hans","Lufft, Hans"
2172,1554,2166,1563,aw3_fingerprintPrintersPublishers,FP Chain 36,printerpublisher_to_printerpublisher,"Krafft the Elder, Johann",1578,"Lufft, Hans","Lufft, Hans"
2168,1558,2166,1563,aw3_fingerprintPrintersPublishers,FP Chain 36,printerpublisher_to_printerpublisher,"Krafft the Elder, Johann",1578,"Lufft, Hans","Lufft, Hans"
2166,1563,2169,1576,aw3_fingerprintPrintersPublishers,FP Chain 36,printerpublisher_to_printerpublisher,"Lufft, Hans",1584,"Krafft the Elder, Johann","Krafft the Elder, Johann"
2166,1563,2167,1569,aw3_fingerprintPrintersPublishers,FP Chain 36,printerpublisher_to_printerpublisher,"Lufft, Hans",1584,"Krafft the Elder, Johann","Krafft the Elder, Johann"
2171,1587,2173,1601,aw3_fingerprintPrintersPublishers,FP Chain 36,printerpublisher_to_printer,"Gronenberg, Simon",1612,"Lehmann, Zacharias","Seelfisch, Samuel"
2171,1587,2173,1601,aw3_fingerprintPrintersPublishers,FP Chain 36,printerpublisher_to_publisher,"Gronenberg, Simon",1612,"Lehmann, Zacharias","Seelfisch, Samuel"
1708,1556,1728,1569,aw3_fingerprintPrintersPublishers,FP Chain 38,printerpublisher_to_printerpublisher,"Cavellat, Guillaume",1576,"Scoto, Girolamo","Scoto, Girolamo"
1711,1557,1728,1569,aw3_fingerprintPrintersPublishers,FP Chain 38,printerpublisher_to_printerpublisher,"Cavellat, Guillaume",1576,"Scoto, Girolamo","Scoto, Girolamo"
1964,1558,1728,1569,aw3_fingerprintPrintersPublishers,FP Chain 38,printerpublisher_to_printerpublisher,"Cavellat, Guillaume",1576,"Scoto, Girolamo","Scoto, Girolamo"
1955,1561,1728,1569,aw3_fingerprintPrintersPublishers,FP Chain 38,printerpublisher_to_printerpublisher,"Cavellat, Guillaume",1576,"Scoto, Girolamo","Scoto, Girolamo"
1969,1562,1728,1569,aw3_fingerprintPrintersPublishers,FP Chain 38,printerpublisher_to_printerpublisher,"Cavellat, Guillaume",1576,"Scoto, Girolamo","Scoto, Girolamo"
1973,1564,1728,1569,aw3_fingerprintPrintersPublishers,FP Chain 38,printerpublisher_to_printerpublisher,"Cavellat, Guillaume",1576,"Scoto, Girolamo","Scoto, Girolamo"
1912,1564,1968,1567,aw3_fingerprintPrintersPublishers,FP Chain 40,printer_to_publisher,"Barbier, Symphorien",1584,"Barbier, Symphorien",Heirs of Jacopo Giunta
1912,1564,1968,1567,aw3_fingerprintPrintersPublishers,FP Chain 40,publisher_to_printer,Heirs of Jacopo Giunta,1609,"Barbier, Symphorien",Heirs of Jacopo Giunta
1727,1567,2197,1568,aw3_fingerprintPrintersPublishers,FP Chain 42,printerpublisher_to_publisher,"Ghemart, Adrián",1583,"Ghemart, Adrián","Corcuera, Pedro de"
1974,1569,1741,1584,aw3_fingerprintPrintersPublishers,FP Chain 43,printerpublisher_to_printerpublisher,"Marnef, Jérôme de",1595,Widow of Guillaume Cavellat (Denise de Marnef),Widow of Guillaume Cavellat (Denise de Marnef)
1974,1569,1911,1572,aw3_fingerprintPrintersPublishers,FP Chain 43,printerpublisher_to_printerpublisher,"Marnef, Jérôme de",1595,"Cavellat, Guillaume","Cavellat, Guillaume"
1974,1569,1970,1577,aw3_fingerprintPrintersPublishers,FP Chain 43,printerpublisher_to_printerpublisher,"Marnef, Jérôme de",1595,Widow of Guillaume Cavellat (Denise de Marnef),Widow of Guillaume Cavellat (Denise de Marnef)
1974,1569,1911,1572,aw3_fingerprintPrintersPublishers,FP Chain 43,printerpublisher_to_printerpublisher,"Cavellat, Guillaume",1576,"Marnef, Jérôme de","Marnef, Jérôme de"
1911,1572,1741,1584,aw3_fingerprintPrintersPublishers,FP Chain 43,printerpublisher_to_printerpublisher,"Marnef, Jérôme de",1595,Widow of Guillaume Cavellat (Denise de Marnef),Widow of Guillaume Cavellat (Denise de Marnef)
1911,1572,1970,1577,aw3_fingerprintPrintersPublishers,FP Chain 43,printerpublisher_to_printerpublisher,"Marnef, Jérôme de",1595,Widow of Guillaume Cavellat (Denise de Marnef),Widow of Guillaume Cavellat (Denise de Marnef)
1970,1577,1741,1584,aw3_fingerprintPrintersPublishers,FP Chain 43,printerpublisher_to_printerpublisher,"Marnef, Jérôme de",1595,Widow of Guillaume Cavellat (Denise de Marnef),Widow of Guillaume Cavellat (Denise de Marnef)
1970,1577,1741,1584,aw3_fingerprintPrintersPublishers,FP Chain 43,printerpublisher_to_printerpublisher,Widow of Guillaume Cavellat (Denise de Marnef),1626,"Marnef, Jérôme de","Marnef, Jérôme de"
1730,1573,1958,1582,aw3_fingerprintPrintersPublishers,FP Chain 44,printer_to_printerpublisher,"Rade, Gilles van den",1615,"Bellère I., Pierre","Bellère I., Pierre"
1730,1573,2281,1582,aw3_fingerprintPrintersPublishers,FP Chain 44,printer_to_printerpublisher,"Rade, Gilles van den",1615,"Bellère, Jean","Bellère, Jean"
1730,1573,1958,1582,aw3_fingerprintPrintersPublishers,FP Chain 44,publisher_to_printerpublisher,"Bellère, Jean",1595,"Bellère I., Pierre","Bellère I., Pierre"
1733,1576,1739,1584,aw3_fingerprintPrintersPublishers,FP Chain 48,printerpublisher_to_printerpublisher,"Marnef, Jérôme de",1595,Widow of Guillaume Cavellat (Denise de Marnef),Widow of Guillaume Cavellat (Denise de Marnef)
2229,1609,2222,1615,aw3_fingerprintPrintersPublishers,FP Chain 54,printer_to_printer,"Windet, John",1621,"Stansby, William","Tapp, John"
2229,1609,2222,1615,aw3_fingerprintPrintersPublishers,FP Chain 54,printer_to_publisher,"Windet, John",1621,"Stansby, William","Tapp, John"
2229,1609,2228,1630,aw3_fingerprintPrintersPublishers,FP Chain 54,publisher_to_printer,"Tapp, John",1631,"Alsop, Bernard","Tapp, John"
2229,1609,2228,1630,aw3_fingerprintPrintersPublishers,FP Chain 54,publisher_to_printer,"Tapp, John",1631,"Fawcett, Thomas","Tapp, John"
2229,1609,2222,1615,aw3_fingerprintPrintersPublishers,FP Chain 54,publisher_to_printer,"Tapp, John",1631,"Stansby, William","Tapp, John"
2222,1615,2228,1630,aw3_fingerprintPrintersPublishers,FP Chain 54,printer_to_printer,"Stansby, William",1638,"Alsop, Bernard","Tapp, John"
2222,1615,2228,1630,aw3_fingerprintPrintersPublishers,FP Chain 54,printer_to_printer,"Stansby, William",1638,"Fawcett, Thomas","Tapp, John"
2222,1615,2228,1630,aw3_fingerprintPrintersPublishers,FP Chain 54,printer_to_publisher,"Stansby, William",1638,"Alsop, Bernard;Fawcett, Thomas","Tapp, John"
2222,1615,2228,1630,aw3_fingerprintPrintersPublishers,FP Chain 54,publisher_to_printer,"Tapp, John",1631,"Alsop, Bernard","Tapp, John"
2222,1615,2228,1630,aw3_fingerprintPrintersPublishers,FP Chain 54,publisher_to_printer,"Tapp, John",1631,"Fawcett, Thomas","Tapp, John"
2261,1614,1980,1622,aw3_fingerprintPrintersPublishers,FP Chain 55,printer_to_printer,"Hermann, Johann",1632,"Jansonius, Justus","Grosse, Henning II."
2261,1614,1980,1622,aw3_fingerprintPrintersPublishers,FP Chain 55,printer_to_publisher,"Hermann, Johann",1632,"Jansonius, Justus","Grosse, Henning II."
1979,1614,1980,1622,aw3_fingerprintPrintersPublishers,FP Chain 55,printer_to_printer,"Hermann, Johann",1632,"Jansonius, Justus","Grosse, Henning II."
1979,1614,1980,1622,aw3_fingerprintPrintersPublishers,FP Chain 55,printer_to_publisher,"Hermann, Johann",1632,"Jansonius, Justus","Grosse, Henning II."
1758,1616,1760,1619,aw3_fingerprintPrintersPublishers,FP Chain 56,printerpublisher_to_printerpublisher,Widow of Guillaume Cavellat (Denise de Marnef),1626,"Quesnel, Jacques","Quesnel, Jacques"
1879,1532,1710,1557,aw3_fingerprintPrintersPublishers,FP Chain 6,printer_to_printer,Giovanni Antonio Nicolini da Sabbio & brothers,1560,Heirs of Giovanni Padovani,"Sessa I., Melchiorre"
1879,1532,1710,1557,aw3_fingerprintPrintersPublishers,FP Chain 6,printer_to_publisher,Giovanni Antonio Nicolini da Sabbio & brothers,1560,Heirs of Giovanni Padovani,"Sessa I., Melchiorre"
1879,1532,1707,1554,aw3_fingerprintPrintersPublishers,FP Chain 6,printer_to_printer,Giovanni Antonio Nicolini da Sabbio & brothers,1560,"Rampazetto, Francesco","Sessa I., Melchiorre"
1879,1532,1707,1554,aw3_fingerprintPrintersPublishers,FP Chain 6,printer_to_publisher,Giovanni Antonio Nicolini da Sabbio & brothers,1560,"Rampazetto, Francesco","Sessa I., Melchiorre"
1879,1532,2219,1552,aw3_fingerprintPrintersPublishers,FP Chain 6,printer_to_printer,Giovanni Antonio Nicolini da Sabbio & brothers,1560,"Nicolini da Sabbio, Cornelio","Sessa I., Melchiorre"
1879,1532,2219,1552,aw3_fingerprintPrintersPublishers,FP Chain 6,printer_to_publisher,Giovanni Antonio Nicolini da Sabbio & brothers,1560,"Nicolini da Sabbio, Cornelio","Sessa I., Melchiorre"
1879,1532,1701,1550,aw3_fingerprintPrintersPublishers,FP Chain 6,printer_to_printer,Giovanni Antonio Nicolini da Sabbio & brothers,1560,"Nicolini da Sabbio, Pietro","Sessa I., Melchiorre"
1879,1532,1701,1550,aw3_fingerprintPrintersPublishers,FP Chain 6,printer_to_publisher,Giovanni Antonio Nicolini da Sabbio & brothers,1560,"Nicolini da Sabbio, Pietro","Sessa I., Melchiorre"
1879,1532,1881,1534,aw3_fingerprintPrintersPublishers,FP Chain 6,printer_to_publisher,Giovanni Antonio Nicolini da Sabbio & brothers,1560,Giovanni Antonio Nicolini da Sabbio & brothers,"Sessa I., Melchiorre"
1879,1532,1695,1548,aw3_fingerprintPrintersPublishers,FP Chain 6,printer_to_printer,Giovanni Antonio Nicolini da Sabbio & brothers,1560,"Nicolini da Sabbio, Pietro","Sessa I., Melchiorre"
1879,1532,1695,1548,aw3_fingerprintPrintersPublishers,FP Chain 6,printer_to_publisher,Giovanni Antonio Nicolini da Sabbio & brothers,1560,"Nicolini da Sabbio, Pietro","Sessa I., Melchiorre"
1879,1532,1722,1564,aw3_fingerprintPrintersPublishers,FP Chain 6,publisher_to_printerpublisher,"Sessa I., Melchiorre",1565,"Rampazetto, Francesco","Rampazetto, Francesco"
1879,1532,1710,1557,aw3_fingerprintPrintersPublishers,FP Chain 6,publisher_to_printer,"Sessa I., Melchiorre",1565,Heirs of Giovanni Padovani,"Sessa I., Melchiorre"
1879,1532,1707,1554,aw3_fingerprintPrintersPublishers,FP Chain 6,publisher_to_printer,"Sessa I., Melchiorre",1565,"Rampazetto, Francesco","Sessa I., Melchiorre"
1879,1532,1715,1561,aw3_fingerprintPrintersPublishers,FP Chain 6,publisher_to_printerpublisher,"Sessa I., Melchiorre",1565,"Rampazetto, Francesco","Rampazetto, Francesco"
1879,1532,2106,1561,aw3_fingerprintPrintersPublishers,FP Chain 6,publisher_to_printerpublisher,"Sessa I., Melchiorre",1565,Heirs of Melchiorre Sessa I.,Heirs of Melchiorre Sessa I.
1879,1532,2219,1552,aw3_fingerprintPrintersPublishers,FP Chain 6,publisher_to_printer,"Sessa I., Melchiorre",1565,"Nicolini da Sabbio, Cornelio","Sessa I., Melchiorre"
1879,1532,1701,1550,aw3_fingerprintPrintersPublishers,FP Chain 6,publisher_to_printer,"Sessa I., Melchiorre",1565,"Nicolini da Sabbio, Pietro","Sessa I., Melchiorre"
1879,1532,1881,1534,aw3_fingerprintPrintersPublishers,FP Chain 6,publisher_to_printer,"Sessa I., Melchiorre",1565,Giovanni Antonio Nicolini da Sabbio & brothers,"Sessa I., Melchiorre"
1879,1532,1695,1548,aw3_fingerprintPrintersPublishers,FP Chain 6,publisher_to_printer,"Sessa I., Melchiorre",1565,"Nicolini da Sabbio, Pietro","Sessa I., Melchiorre"
1881,1534,1710,1557,aw3_fingerprintPrintersPublishers,FP Chain 6,printer_to_printer,Giovanni Antonio Nicolini da Sabbio & brothers,1560,Heirs of Giovanni Padovani,"Sessa I., Melchiorre"
1881,1534,1710,1557,aw3_fingerprintPrintersPublishers,FP Chain 6,printer_to_publisher,Giovanni Antonio Nicolini da Sabbio & brothers,1560,Heirs of Giovanni Padovani,"Sessa I., Melchiorre"
1881,1534,1707,1554,aw3_fingerprintPrintersPublishers,FP Chain 6,printer_to_printer,Giovanni Antonio Nicolini da Sabbio & brothers,1560,"Rampazetto, Francesco","Sessa I., Melchiorre"
1881,1534,1707,1554,aw3_fingerprintPrintersPublishers,FP Chain 6,printer_to_publisher,Giovanni Antonio Nicolini da Sabbio & brothers,1560,"Rampazetto, Francesco","Sessa I., Melchiorre"
1881,1534,2219,1552,aw3_fingerprintPrintersPublishers,FP Chain 6,printer_to_printer,Giovanni Antonio Nicolini da Sabbio & brothers,1560,"Nicolini da Sabbio, Cornelio","Sessa I., Melchiorre"
1881,1534,2219,1552,aw3_fingerprintPrintersPublishers,FP Chain 6,printer_to_publisher,Giovanni Antonio Nicolini da Sabbio & brothers,1560,"Nicolini da Sabbio, Cornelio","Sessa I., Melchiorre"
1881,1534,1701,1550,aw3_fingerprintPrintersPublishers,FP Chain 6,printer_to_printer,Giovanni Antonio Nicolini da Sabbio & brothers,1560,"Nicolini da Sabbio, Pietro","Sessa I., Melchiorre"
1881,1534,1701,1550,aw3_fingerprintPrintersPublishers,FP Chain 6,printer_to_publisher,Giovanni Antonio Nicolini da Sabbio & brothers,1560,"Nicolini da Sabbio, Pietro","Sessa I., Melchiorre"
1881,1534,1695,1548,aw3_fingerprintPrintersPublishers,FP Chain 6,printer_to_printer,Giovanni Antonio Nicolini da Sabbio & brothers,1560,"Nicolini da Sabbio, Pietro","Sessa I., Melchiorre"
1881,1534,1695,1548,aw3_fingerprintPrintersPublishers,FP Chain 6,printer_to_publisher,Giovanni Antonio Nicolini da Sabbio & brothers,1560,"Nicolini da Sabbio, Pietro","Sessa I., Melchiorre"
1881,1534,1722,1564,aw3_fingerprintPrintersPublishers,FP Chain 6,publisher_to_printerpublisher,"Sessa I., Melchiorre",1565,"Rampazetto, Francesco","Rampazetto, Francesco"
1881,1534,1710,1557,aw3_fingerprintPrintersPublishers,FP Chain 6,publisher_to_printer,"Sessa I., Melchiorre",1565,Heirs of Giovanni Padovani,"Sessa I., Melchiorre"
1881,1534,1707,1554,aw3_fingerprintPrintersPublishers,FP Chain 6,publisher_to_printer,"Sessa I., Melchiorre",1565,"Rampazetto, Francesco","Sessa I., Melchiorre"
1881,1534,1715,1561,aw3_fingerprintPrintersPublishers,FP Chain 6,publisher_to_printerpublisher,"Sessa I., Melchiorre",1565,"Rampazetto, Francesco","Rampazetto, Francesco"
1881,1534,2106,1561,aw3_fingerprintPrintersPublishers,FP Chain 6,publisher_to_printerpublisher,"Sessa I., Melchiorre",1565,Heirs of Melchiorre Sessa I.,Heirs of Melchiorre Sessa I.
1881,1534,2219,1552,aw3_fingerprintPrintersPublishers,FP Chain 6,publisher_to_printer,"Sessa I., Melchiorre",1565,"Nicolini da Sabbio, Cornelio","Sessa I., Melchiorre"
1881,1534,1701,1550,aw3_fingerprintPrintersPublishers,FP Chain 6,publisher_to_printer,"Sessa I., Melchiorre",1565,"Nicolini da Sabbio, Pietro","Sessa I., Melchiorre"
1881,1534,1695,1548,aw3_fingerprintPrintersPublishers,FP Chain 6,publisher_to_printer,"Sessa I., Melchiorre",1565,"Nicolini da Sabbio, Pietro","Sessa I., Melchiorre"
1695,1548,1722,1564,aw3_fingerprintPrintersPublishers,FP Chain 6,publisher_to_printerpublisher,"Sessa I., Melchiorre",1565,"Rampazetto, Francesco","Rampazetto, Francesco"
1695,1548,1710,1557,aw3_fingerprintPrintersPublishers,FP Chain 6,publisher_to_printer,"Sessa I., Melchiorre",1565,Heirs of Giovanni Padovani,"Sessa I., Melchiorre"
1695,1548,1707,1554,aw3_fingerprintPrintersPublishers,FP Chain 6,publisher_to_printer,"Sessa I., Melchiorre",1565,"Rampazetto, Francesco","Sessa I., Melchiorre"
1695,1548,1715,1561,aw3_fingerprintPrintersPublishers,FP Chain 6,publisher_to_printerpublisher,"Sessa I., Melchiorre",1565,"Rampazetto, Francesco","Rampazetto, Francesco"
1695,1548,2106,1561,aw3_fingerprintPrintersPublishers,FP Chain 6,publisher_to_printerpublisher,"Sessa I., Melchiorre",1565,Heirs of Melchiorre Sessa I.,Heirs of Melchiorre Sessa I.
1695,1548,2219,1552,aw3_fingerprintPrintersPublishers,FP Chain 6,publisher_to_printer,"Sessa I., Melchiorre",1565,"Nicolini da Sabbio, Cornelio","Sessa I., Melchiorre"
1695,1548,1701,1550,aw3_fingerprintPrintersPublishers,FP Chain 6,publisher_to_printer,"Sessa I., Melchiorre",1565,"Nicolini da Sabbio, Pietro","Sessa I., Melchiorre"
1701,1550,1722,1564,aw3_fingerprintPrintersPublishers,FP Chain 6,publisher_to_printerpublisher,"Sessa I., Melchiorre",1565,"Rampazetto, Francesco","Rampazetto, Francesco"
1701,1550,1710,1557,aw3_fingerprintPrintersPublishers,FP Chain 6,publisher_to_printer,"Sessa I., Melchiorre",1565,Heirs of Giovanni Padovani,"Sessa I., Melchiorre"
1701,1550,1707,1554,aw3_fingerprintPrintersPublishers,FP Chain 6,publisher_to_printer,"Sessa I., Melchiorre",1565,"Rampazetto, Francesco","Sessa I., Melchiorre"
1701,1550,1715,1561,aw3_fingerprintPrintersPublishers,FP Chain 6,publisher_to_printerpublisher,"Sessa I., Melchiorre",1565,"Rampazetto, Francesco","Rampazetto, Francesco"
1701,1550,2106,1561,aw3_fingerprintPrintersPublishers,FP Chain 6,publisher_to_printerpublisher,"Sessa I., Melchiorre",1565,Heirs of Melchiorre Sessa I.,Heirs of Melchiorre Sessa I.
1701,1550,2219,1552,aw3_fingerprintPrintersPublishers,FP Chain 6,publisher_to_printer,"Sessa I., Melchiorre",1565,"Nicolini da Sabbio, Cornelio","Sessa I., Melchiorre"
2219,1552,1710,1557,aw3_fingerprintPrintersPublishers,FP Chain 6,printer_to_printer,"Nicolini da Sabbio, Cornelio",1560,Heirs of Giovanni Padovani,"Sessa I., Melchiorre"
2219,1552,1710,1557,aw3_fingerprintPrintersPublishers,FP Chain 6,printer_to_publisher,"Nicolini da Sabbio, Cornelio",1560,Heirs of Giovanni Padovani,"Sessa I., Melchiorre"
2219,1552,1707,1554,aw3_fingerprintPrintersPublishers,FP Chain 6,printer_to_printer,"Nicolini da Sabbio, Cornelio",1560,"Rampazetto, Francesco","Sessa I., Melchiorre"
2219,1552,1707,1554,aw3_fingerprintPrintersPublishers,FP Chain 6,printer_to_publisher,"Nicolini da Sabbio, Cornelio",1560,"Rampazetto, Francesco","Sessa I., Melchiorre"
2219,1552,1722,1564,aw3_fingerprintPrintersPublishers,FP Chain 6,publisher_to_printerpublisher,"Sessa I., Melchiorre",1565,"Rampazetto, Francesco","Rampazetto, Francesco"
2219,1552,1710,1557,aw3_fingerprintPrintersPublishers,FP Chain 6,publisher_to_printer,"Sessa I., Melchiorre",1565,Heirs of Giovanni Padovani,"Sessa I., Melchiorre"
2219,1552,1707,1554,aw3_fingerprintPrintersPublishers,FP Chain 6,publisher_to_printer,"Sessa I., Melchiorre",1565,"Rampazetto, Francesco","Sessa I., Melchiorre"
2219,1552,1715,1561,aw3_fingerprintPrintersPublishers,FP Chain 6,publisher_to_printerpublisher,"Sessa I., Melchiorre",1565,"Rampazetto, Francesco","Rampazetto, Francesco"
2219,1552,2106,1561,aw3_fingerprintPrintersPublishers,FP Chain 6,publisher_to_printerpublisher,"Sessa I., Melchiorre",1565,Heirs of Melchiorre Sessa I.,Heirs of Melchiorre Sessa I.
1707,1554,1710,1557,aw3_fingerprintPrintersPublishers,FP Chain 6,printer_to_printer,"Rampazetto, Francesco",1586,Heirs of Giovanni Padovani,"Sessa I., Melchiorre"
1707,1554,1710,1557,aw3_fingerprintPrintersPublishers,FP Chain 6,printer_to_publisher,"Rampazetto, Francesco",1586,Heirs of Giovanni Padovani,"Sessa I., Melchiorre"
1707,1554,2106,1561,aw3_fingerprintPrintersPublishers,FP Chain 6,printer_to_printerpublisher,"Rampazetto, Francesco",1586,Heirs of Melchiorre Sessa I.,Heirs of Melchiorre Sessa I.
1707,1554,1729,1572,aw3_fingerprintPrintersPublishers,FP Chain 6,printer_to_printerpublisher,"Rampazetto, Francesco",1586,Heirs of Melchiorre Sessa I.,Heirs of Melchiorre Sessa I.
1707,1554,1722,1564,aw3_fingerprintPrintersPublishers,FP Chain 6,publisher_to_printerpublisher,"Sessa I., Melchiorre",1565,"Rampazetto, Francesco","Rampazetto, Francesco"
1707,1554,1710,1557,aw3_fingerprintPrintersPublishers,FP Chain 6,publisher_to_printer,"Sessa I., Melchiorre",1565,Heirs of Giovanni Padovani,"Sessa I., Melchiorre"
1707,1554,1715,1561,aw3_fingerprintPrintersPublishers,FP Chain 6,publisher_to_printerpublisher,"Sessa I., Melchiorre",1565,"Rampazetto, Francesco","Rampazetto, Francesco"
1707,1554,2106,1561,aw3_fingerprintPrintersPublishers,FP Chain 6,publisher_to_printerpublisher,"Sessa I., Melchiorre",1565,Heirs of Melchiorre Sessa I.,Heirs of Melchiorre Sessa I.
1710,1557,1722,1564,aw3_fingerprintPrintersPublishers,FP Chain 6,printer_to_printerpublisher,Heirs of Giovanni Padovani,1568,"Rampazetto, Francesco","Rampazetto, Francesco"
1710,1557,1715,1561,aw3_fingerprintPrintersPublishers,FP Chain 6,printer_to_printerpublisher,Heirs of Giovanni Padovani,1568,"Rampazetto, Francesco","Rampazetto, Francesco"
1710,1557,2106,1561,aw3_fingerprintPrintersPublishers,FP Chain 6,printer_to_printerpublisher,Heirs of Giovanni Padovani,1568,Heirs of Melchiorre Sessa I.,Heirs of Melchiorre Sessa I.
1710,1557,1722,1564,aw3_fingerprintPrintersPublishers,FP Chain 6,publisher_to_printerpublisher,"Sessa I., Melchiorre",1565,"Rampazetto, Francesco","Rampazetto, Francesco"
1710,1557,1715,1561,aw3_fingerprintPrintersPublishers,FP Chain 6,publisher_to_printerpublisher,"Sessa I., Melchiorre",1565,"Rampazetto, Francesco","Rampazetto, Francesco"
1710,1557,2106,1561,aw3_fingerprintPrintersPublishers,FP Chain 6,publisher_to_printerpublisher,"Sessa I., Melchiorre",1565,Heirs of Melchiorre Sessa I.,Heirs of Melchiorre Sessa I.
2106,1561,1722,1564,aw3_fingerprintPrintersPublishers,FP Chain 6,printerpublisher_to_printerpublisher,Heirs of Melchiorre Sessa I.,1611,"Rampazetto, Francesco","Rampazetto, Francesco"
1715,1561,1729,1572,aw3_fingerprintPrintersPublishers,FP Chain 6,printerpublisher_to_printerpublisher,"Rampazetto, Francesco",1586,Heirs of Melchiorre Sessa I.,Heirs of Melchiorre Sessa I.
1722,1564,1729,1572,aw3_fingerprintPrintersPublishers,FP Chain 6,printerpublisher_to_printerpublisher,"Rampazetto, Francesco",1586,Heirs of Melchiorre Sessa I.,Heirs of Melchiorre Sessa I.
1807,1581,1808,1585,aw3_fingerprintPrintersPublishers,FP Chain 7,printerpublisher_to_printerpublisher,"Zanetti, Francesco",1591,"Basa, Domenico","Basa, Domenico"
1807,1581,1810,1594,aw3_fingerprintPrintersPublishers,FP Chain 7,printerpublisher_to_printer,"Basa, Domenico",1596,"Julliéron, Guichard",Brothers Gabiano
1807,1581,1810,1594,aw3_fingerprintPrintersPublishers,FP Chain 7,printerpublisher_to_publisher,"Basa, Domenico",1596,"Julliéron, Guichard",Brothers Gabiano
1807,1581,1809,1591,aw3_fingerprintPrintersPublishers,FP Chain 7,printerpublisher_to_printerpublisher,"Basa, Domenico",1596,"Ciotti, Giovanni Battista","Ciotti, Giovanni Battista"
1807,1581,1746,1593,aw3_fingerprintPrintersPublishers,FP Chain 7,printerpublisher_to_printer,"Basa, Domenico",1596,"Julliéron, Guichard",Brothers Gabiano
1807,1581,1746,1593,aw3_fingerprintPrintersPublishers,FP Chain 7,printerpublisher_to_publisher,"Basa, Domenico",1596,"Julliéron, Guichard",Brothers Gabiano
1808,1585,1810,1594,aw3_fingerprintPrintersPublishers,FP Chain 7,printerpublisher_to_printer,"Basa, Domenico",1596,"Julliéron, Guichard",Brothers Gabiano
1808,1585,1810,1594,aw3_fingerprintPrintersPublishers,FP Chain 7,printerpublisher_to_publisher,"Basa, Domenico",1596,"Julliéron, Guichard",Brothers Gabiano
1808,1585,1809,1591,aw3_fingerprintPrintersPublishers,FP Chain 7,printerpublisher_to_printerpublisher,"Basa, Domenico",1596,"Ciotti, Giovanni Battista","Ciotti, Giovanni Battista"
1808,1585,1746,1593,aw3_fingerprintPrintersPublishers,FP Chain 7,printerpublisher_to_printer,"Basa, Domenico",1596,"Julliéron, Guichard",Brothers Gabiano
1808,1585,1746,1593,aw3_fingerprintPrintersPublishers,FP Chain 7,printerpublisher_to_publisher,"Basa, Domenico",1596,"Julliéron, Guichard",Brothers Gabiano
1809,1591,1810,1594,aw3_fingerprintPrintersPublishers,FP Chain 7,printerpublisher_to_printer,"Ciotti, Giovanni Battista",1635,"Julliéron, Guichard",Brothers Gabiano
1809,1591,1810,1594,aw3_fingerprintPrintersPublishers,FP Chain 7,printerpublisher_to_publisher,"Ciotti, Giovanni Battista",1635,"Julliéron, Guichard",Brothers Gabiano
1809,1591,1815,1606,aw3_fingerprintPrintersPublishers,FP Chain 7,printerpublisher_to_printer,"Ciotti, Giovanni Battista",1635,"Zanetti, Luigi","Gelli, Giovanni Paolo"
1809,1591,1815,1606,aw3_fingerprintPrintersPublishers,FP Chain 7,printerpublisher_to_publisher,"Ciotti, Giovanni Battista",1635,"Zanetti, Luigi","Gelli, Giovanni Paolo"
1809,1591,1755,1607,aw3_fingerprintPrintersPublishers,FP Chain 7,printerpublisher_to_printerpublisher,"Ciotti, Giovanni Battista",1635,"Crispin, Samuel","Crispin, Samuel"
1809,1591,1812,1601,aw3_fingerprintPrintersPublishers,FP Chain 7,printerpublisher_to_publisher,"Ciotti, Giovanni Battista",1635,"Ciotti, Giovanni Battista","Basa, Isabetta"
1809,1591,1813,1602,aw3_fingerprintPrintersPublishers,FP Chain 7,printerpublisher_to_printerpublisher,"Ciotti, Giovanni Battista",1635,"Gabiano, Jean de","Gabiano, Jean de"
1809,1591,1821,1602,aw3_fingerprintPrintersPublishers,FP Chain 7,printerpublisher_to_printerpublisher,"Ciotti, Giovanni Battista",1635,"Crispin, Samuel","Crispin, Samuel"
1809,1591,1817,1607,aw3_fingerprintPrintersPublishers,FP Chain 7,printerpublisher_to_printer,"Ciotti, Giovanni Battista",1635,"Zanetti, Luigi","Gelli, Giovanni Paolo"
1809,1591,1817,1607,aw3_fingerprintPrintersPublishers,FP Chain 7,printerpublisher_to_publisher,"Ciotti, Giovanni Battista",1635,"Zanetti, Luigi","Gelli, Giovanni Paolo"
1809,1591,1818,1608,aw3_fingerprintPrintersPublishers,FP Chain 7,printerpublisher_to_printerpublisher,"Ciotti, Giovanni Battista",1635,"Crispin, Samuel","Crispin, Samuel"
1809,1591,1811,1596,aw3_fingerprintPrintersPublishers,FP Chain 7,printerpublisher_to_printerpublisher,"Ciotti, Giovanni Battista",1635,"Basa, Bernardo","Basa, Bernardo"
1809,1591,1822,1618,aw3_fingerprintPrintersPublishers,FP Chain 7,printerpublisher_to_printer,"Ciotti, Giovanni Battista",1635,"Polère, Amédée","Rigaud, Pierre"
1809,1591,1822,1618,aw3_fingerprintPrintersPublishers,FP Chain 7,printerpublisher_to_publisher,"Ciotti, Giovanni Battista",1635,"Polère, Amédée","Rigaud, Pierre"
1809,1591,2151,1607,aw3_fingerprintPrintersPublishers,FP Chain 7,printerpublisher_to_printerpublisher,"Ciotti, Giovanni Battista",1635,"Crispin, Samuel","Crispin, Samuel"
1809,1591,1746,1593,aw3_fingerprintPrintersPublishers,FP Chain 7,printerpublisher_to_printer,"Ciotti, Giovanni Battista",1635,"Julliéron, Guichard",Brothers Gabiano
1809,1591,1746,1593,aw3_fingerprintPrintersPublishers,FP Chain 7,printerpublisher_to_publisher,"Ciotti, Giovanni Battista",1635,"Julliéron, Guichard",Brothers Gabiano
1809,1591,1816,1607,aw3_fingerprintPrintersPublishers,FP Chain 7,printerpublisher_to_printer,"Ciotti, Giovanni Battista",1635,Jacques du Creux a.k.a. Molliard,"Gabiano, Jean de"
1809,1591,1816,1607,aw3_fingerprintPrintersPublishers,FP Chain 7,printerpublisher_to_publisher,"Ciotti, Giovanni Battista",1635,Jacques du Creux a.k.a. Molliard,"Gabiano, Jean de"
1746,1593,1810,1594,aw3_fingerprintPrintersPublishers,FP Chain 7,printer_to_publisher,"Julliéron, Guichard",1624,"Julliéron, Guichard",Brothers Gabiano
1746,1593,1815,1606,aw3_fingerprintPrintersPublishers,FP Chain 7,printer_to_printer,"Julliéron, Guichard",1624,"Zanetti, Luigi","Gelli, Giovanni Paolo"
1746,1593,1815,1606,aw3_fingerprintPrintersPublishers,FP Chain 7,printer_to_publisher,"Julliéron, Guichard",1624,"Zanetti, Luigi","Gelli, Giovanni Paolo"
1746,1593,1814,1603,aw3_fingerprintPrintersPublishers,FP Chain 7,printer_to_printerpublisher,"Julliéron, Guichard",1624,"Ciotti, Giovanni Battista","Ciotti, Giovanni Battista"
1746,1593,1755,1607,aw3_fingerprintPrintersPublishers,FP Chain 7,printer_to_printerpublisher,"Julliéron, Guichard",1624,"Crispin, Samuel","Crispin, Samuel"
1746,1593,1812,1601,aw3_fingerprintPrintersPublishers,FP Chain 7,printer_to_printer,"Julliéron, Guichard",1624,"Ciotti, Giovanni Battista","Basa, Isabetta"
1746,1593,1812,1601,aw3_fingerprintPrintersPublishers,FP Chain 7,printer_to_publisher,"Julliéron, Guichard",1624,"Ciotti, Giovanni Battista","Basa, Isabetta"
1746,1593,1813,1602,aw3_fingerprintPrintersPublishers,FP Chain 7,printer_to_printerpublisher,"Julliéron, Guichard",1624,"Gabiano, Jean de","Gabiano, Jean de"
1746,1593,1821,1602,aw3_fingerprintPrintersPublishers,FP Chain 7,printer_to_printerpublisher,"Julliéron, Guichard",1624,"Crispin, Samuel","Crispin, Samuel"
1746,1593,1817,1607,aw3_fingerprintPrintersPublishers,FP Chain 7,printer_to_printer,"Julliéron, Guichard",1624,"Zanetti, Luigi","Gelli, Giovanni Paolo"
1746,1593,1817,1607,aw3_fingerprintPrintersPublishers,FP Chain 7,printer_to_publisher,"Julliéron, Guichard",1624,"Zanetti, Luigi","Gelli, Giovanni Paolo"
1746,1593,1818,1608,aw3_fingerprintPrintersPublishers,FP Chain 7,printer_to_printerpublisher,"Julliéron, Guichard",1624,"Crispin, Samuel","Crispin, Samuel"
1746,1593,1811,1596,aw3_fingerprintPrintersPublishers,FP Chain 7,printer_to_printerpublisher,"Julliéron, Guichard",1624,"Basa, Bernardo","Basa, Bernardo"
1746,1593,1822,1618,aw3_fingerprintPrintersPublishers,FP Chain 7,printer_to_printer,"Julliéron, Guichard",1624,"Polère, Amédée","Rigaud, Pierre"
1746,1593,1822,1618,aw3_fingerprintPrintersPublishers,FP Chain 7,printer_to_publisher,"Julliéron, Guichard",1624,"Polère, Amédée","Rigaud, Pierre"
1746,1593,2278,1601,aw3_fingerprintPrintersPublishers,FP Chain 7,printer_to_printerpublisher,"Julliéron, Guichard",1624,"Ciotti, Giovanni Battista","Ciotti, Giovanni Battista"
1746,1593,2151,1607,aw3_fingerprintPrintersPublishers,FP Chain 7,printer_to_printerpublisher,"Julliéron, Guichard",1624,"Crispin, Samuel","Crispin, Samuel"
1746,1593,1816,1607,aw3_fingerprintPrintersPublishers,FP Chain 7,printer_to_printer,"Julliéron, Guichard",1624,Jacques du Creux a.k.a. Molliard,"Gabiano, Jean de"
1746,1593,1816,1607,aw3_fingerprintPrintersPublishers,FP Chain 7,printer_to_publisher,"Julliéron, Guichard",1624,Jacques du Creux a.k.a. Molliard,"Gabiano, Jean de"
1746,1593,1810,1594,aw3_fingerprintPrintersPublishers,FP Chain 7,publisher_to_printer,Brothers Gabiano,1628,"Julliéron, Guichard",Brothers Gabiano
1746,1593,1815,1606,aw3_fingerprintPrintersPublishers,FP Chain 7,publisher_to_printer,Brothers Gabiano,1628,"Zanetti, Luigi","Gelli, Giovanni Paolo"
1746,1593,1815,1606,aw3_fingerprintPrintersPublishers,FP Chain 7,publisher_to_publisher,Brothers Gabiano,1628,"Zanetti, Luigi","Gelli, Giovanni Paolo"
1746,1593,1814,1603,aw3_fingerprintPrintersPublishers,FP Chain 7,publisher_to_printerpublisher,Brothers Gabiano,1628,"Ciotti, Giovanni Battista","Ciotti, Giovanni Battista"
1746,1593,1755,1607,aw3_fingerprintPrintersPublishers,FP Chain 7,publisher_to_printerpublisher,Brothers Gabiano,1628,"Crispin, Samuel","Crispin, Samuel"
1746,1593,1812,1601,aw3_fingerprintPrintersPublishers,FP Chain 7,publisher_to_printer,Brothers Gabiano,1628,"Ciotti, Giovanni Battista","Basa, Isabetta"
1746,1593,1812,1601,aw3_fingerprintPrintersPublishers,FP Chain 7,publisher_to_publisher,Brothers Gabiano,1628,"Ciotti, Giovanni Battista","Basa, Isabetta"
1746,1593,1813,1602,aw3_fingerprintPrintersPublishers,FP Chain 7,publisher_to_printerpublisher,Brothers Gabiano,1628,"Gabiano, Jean de","Gabiano, Jean de"
1746,1593,1821,1602,aw3_fingerprintPrintersPublishers,FP Chain 7,publisher_to_printerpublisher,Brothers Gabiano,1628,"Crispin, Samuel","Crispin, Samuel"
1746,1593,1817,1607,aw3_fingerprintPrintersPublishers,FP Chain 7,publisher_to_printer,Brothers Gabiano,1628,"Zanetti, Luigi","Gelli, Giovanni Paolo"
1746,1593,1817,1607,aw3_fingerprintPrintersPublishers,FP Chain 7,publisher_to_publisher,Brothers Gabiano,1628,"Zanetti, Luigi","Gelli, Giovanni Paolo"
1746,1593,1818,1608,aw3_fingerprintPrintersPublishers,FP Chain 7,publisher_to_printerpublisher,Brothers Gabiano,1628,"Crispin, Samuel","Crispin, Samuel"
1746,1593,1811,1596,aw3_fingerprintPrintersPublishers,FP Chain 7,publisher_to_printerpublisher,Brothers Gabiano,1628,"Basa, Bernardo","Basa, Bernardo"
1746,1593,1822,1618,aw3_fingerprintPrintersPublishers,FP Chain 7,publisher_to_printer,Brothers Gabiano,1628,"Polère, Amédée","Rigaud, Pierre"
1746,1593,1822,1618,aw3_fingerprintPrintersPublishers,FP Chain 7,publisher_to_publisher,Brothers Gabiano,1628,"Polère, Amédée","Rigaud, Pierre"
1746,1593,2278,1601,aw3_fingerprintPrintersPublishers,FP Chain 7,publisher_to_printerpublisher,Brothers Gabiano,1628,"Ciotti, Giovanni Battista","Ciotti, Giovanni Battista"
1746,1593,2151,1607,aw3_fingerprintPrintersPublishers,FP Chain 7,publisher_to_printerpublisher,Brothers Gabiano,1628,"Crispin, Samuel","Crispin, Samuel"
1746,1593,1816,1607,aw3_fingerprintPrintersPublishers,FP Chain 7,publisher_to_printer,Brothers Gabiano,1628,Jacques du Creux a.k.a. Molliard,"Gabiano, Jean de"
1746,1593,1816,1607,aw3_fingerprintPrintersPublishers,FP Chain 7,publisher_to_publisher,Brothers Gabiano,1628,Jacques du Creux a.k.a. Molliard,"Gabiano, Jean de"
1810,1594,1815,1606,aw3_fingerprintPrintersPublishers,FP Chain 7,printer_to_printer,"Julliéron, Guichard",1624,"Zanetti, Luigi","Gelli, Giovanni Paolo"
1810,1594,1815,1606,aw3_fingerprintPrintersPublishers,FP Chain 7,printer_to_publisher,"Julliéron, Guichard",1624,"Zanetti, Luigi","Gelli, Giovanni Paolo"
1810,1594,1814,1603,aw3_fingerprintPrintersPublishers,FP Chain 7,printer_to_printerpublisher,"Julliéron, Guichard",1624,"Ciotti, Giovanni Battista","Ciotti, Giovanni Battista"
1810,1594,1755,1607,aw3_fingerprintPrintersPublishers,FP Chain 7,printer_to_printerpublisher,"Julliéron, Guichard",1624,"Crispin, Samuel","Crispin, Samuel"
1810,1594,1812,1601,aw3_fingerprintPrintersPublishers,FP Chain 7,printer_to_printer,"Julliéron, Guichard",1624,"Ciotti, Giovanni Battista","Basa, Isabetta"
1810,1594,1812,1601,aw3_fingerprintPrintersPublishers,FP Chain 7,printer_to_publisher,"Julliéron, Guichard",1624,"Ciotti, Giovanni Battista","Basa, Isabetta"
1810,1594,1813,1602,aw3_fingerprintPrintersPublishers,FP Chain 7,printer_to_printerpublisher,"Julliéron, Guichard",1624,"Gabiano, Jean de","Gabiano, Jean de"
1810,1594,1821,1602,aw3_fingerprintPrintersPublishers,FP Chain 7,printer_to_printerpublisher,"Julliéron, Guichard",1624,"Crispin, Samuel","Crispin, Samuel"
1810,1594,1817,1607,aw3_fingerprintPrintersPublishers,FP Chain 7,printer_to_printer,"Julliéron, Guichard",1624,"Zanetti, Luigi","Gelli, Giovanni Paolo"
1810,1594,1817,1607,aw3_fingerprintPrintersPublishers,FP Chain 7,printer_to_publisher,"Julliéron, Guichard",1624,"Zanetti, Luigi","Gelli, Giovanni Paolo"
1810,1594,1818,1608,aw3_fingerprintPrintersPublishers,FP Chain 7,printer_to_printerpublisher,"Julliéron, Guichard",1624,"Crispin, Samuel","Crispin, Samuel"
1810,1594,1811,1596,aw3_fingerprintPrintersPublishers,FP Chain 7,printer_to_printerpublisher,"Julliéron, Guichard",1624,"Basa, Bernardo","Basa, Bernardo"
1810,1594,1822,1618,aw3_fingerprintPrintersPublishers,FP Chain 7,printer_to_printer,"Julliéron, Guichard",1624,"Polère, Amédée","Rigaud, Pierre"
1810,1594,1822,1618,aw3_fingerprintPrintersPublishers,FP Chain 7,printer_to_publisher,"Julliéron, Guichard",1624,"Polère, Amédée","Rigaud, Pierre"
1810,1594,2278,1601,aw3_fingerprintPrintersPublishers,FP Chain 7,printer_to_printerpublisher,"Julliéron, Guichard",1624,"Ciotti, Giovanni Battista","Ciotti, Giovanni Battista"
1810,1594,2151,1607,aw3_fingerprintPrintersPublishers,FP Chain 7,printer_to_printerpublisher,"Julliéron, Guichard",1624,"Crispin, Samuel","Crispin, Samuel"
1810,1594,1816,1607,aw3_fingerprintPrintersPublishers,FP Chain 7,printer_to_printer,"Julliéron, Guichard",1624,Jacques du Creux a.k.a. Molliard,"Gabiano, Jean de"
1810,1594,1816,1607,aw3_fingerprintPrintersPublishers,FP Chain 7,printer_to_publisher,"Julliéron, Guichard",1624,Jacques du Creux a.k.a. Molliard,"Gabiano, Jean de"
1810,1594,1815,1606,aw3_fingerprintPrintersPublishers,FP Chain 7,publisher_to_printer,Brothers Gabiano,1628,"Zanetti, Luigi","Gelli, Giovanni Paolo"
1810,1594,1815,1606,aw3_fingerprintPrintersPublishers,FP Chain 7,publisher_to_publisher,Brothers Gabiano,1628,"Zanetti, Luigi","Gelli, Giovanni Paolo"
1810,1594,1814,1603,aw3_fingerprintPrintersPublishers,FP Chain 7,publisher_to_printerpublisher,Brothers Gabiano,1628,"Ciotti, Giovanni Battista","Ciotti, Giovanni Battista"
1810,1594,1755,1607,aw3_fingerprintPrintersPublishers,FP Chain 7,publisher_to_printerpublisher,Brothers Gabiano,1628,"Crispin, Samuel","Crispin, Samuel"
1810,1594,1812,1601,aw3_fingerprintPrintersPublishers,FP Chain 7,publisher_to_printer,Brothers Gabiano,1628,"Ciotti, Giovanni Battista","Basa, Isabetta"
1810,1594,1812,1601,aw3_fingerprintPrintersPublishers,FP Chain 7,publisher_to_publisher,Brothers Gabiano,1628,"Ciotti, Giovanni Battista","Basa, Isabetta"
1810,1594,1813,1602,aw3_fingerprintPrintersPublishers,FP Chain 7,publisher_to_printerpublisher,Brothers Gabiano,1628,"Gabiano, Jean de","Gabiano, Jean de"
1810,1594,1821,1602,aw3_fingerprintPrintersPublishers,FP Chain 7,publisher_to_printerpublisher,Brothers Gabiano,1628,"Crispin, Samuel","Crispin, Samuel"
1810,1594,1817,1607,aw3_fingerprintPrintersPublishers,FP Chain 7,publisher_to_printer,Brothers Gabiano,1628,"Zanetti, Luigi","Gelli, Giovanni Paolo"
1810,1594,1817,1607,aw3_fingerprintPrintersPublishers,FP Chain 7,publisher_to_publisher,Brothers Gabiano,1628,"Zanetti, Luigi","Gelli, Giovanni Paolo"
1810,1594,1818,1608,aw3_fingerprintPrintersPublishers,FP Chain 7,publisher_to_printerpublisher,Brothers Gabiano,1628,"Crispin, Samuel","Crispin, Samuel"
1810,1594,1811,1596,aw3_fingerprintPrintersPublishers,FP Chain 7,publisher_to_printerpublisher,Brothers Gabiano,1628,"Basa, Bernardo","Basa, Bernardo"
1810,1594,1822,1618,aw3_fingerprintPrintersPublishers,FP Chain 7,publisher_to_printer,Brothers Gabiano,1628,"Polère, Amédée","Rigaud, Pierre"
1810,1594,1822,1618,aw3_fingerprintPrintersPublishers,FP Chain 7,publisher_to_publisher,Brothers Gabiano,1628,"Polère, Amédée","Rigaud, Pierre"
1810,1594,2278,1601,aw3_fingerprintPrintersPublishers,FP Chain 7,publisher_to_printerpublisher,Brothers Gabiano,1628,"Ciotti, Giovanni Battista","Ciotti, Giovanni Battista"
1810,1594,2151,1607,aw3_fingerprintPrintersPublishers,FP Chain 7,publisher_to_printerpublisher,Brothers Gabiano,1628,"Crispin, Samuel","Crispin, Samuel"
1810,1594,1816,1607,aw3_fingerprintPrintersPublishers,FP Chain 7,publisher_to_printer,Brothers Gabiano,1628,Jacques du Creux a.k.a. Molliard,"Gabiano, Jean de"
1810,1594,1816,1607,aw3_fingerprintPrintersPublishers,FP Chain 7,publisher_to_publisher,Brothers Gabiano,1628,Jacques du Creux a.k.a. Molliard,"Gabiano, Jean de"
1811,1596,1815,1606,aw3_fingerprintPrintersPublishers,FP Chain 7,printerpublisher_to_printer,"Basa, Bernardo",1609,"Zanetti, Luigi","Gelli, Giovanni Paolo"
1811,1596,1815,1606,aw3_fingerprintPrintersPublishers,FP Chain 7,printerpublisher_to_publisher,"Basa, Bernardo",1609,"Zanetti, Luigi","Gelli, Giovanni Paolo"
1811,1596,1814,1603,aw3_fingerprintPrintersPublishers,FP Chain 7,printerpublisher_to_printerpublisher,"Basa, Bernardo",1609,"Ciotti, Giovanni Battista","Ciotti, Giovanni Battista"
1811,1596,1755,1607,aw3_fingerprintPrintersPublishers,FP Chain 7,printerpublisher_to_printerpublisher,"Basa, Bernardo",1609,"Crispin, Samuel","Crispin, Samuel"
1811,1596,1812,1601,aw3_fingerprintPrintersPublishers,FP Chain 7,printerpublisher_to_printer,"Basa, Bernardo",1609,"Ciotti, Giovanni Battista","Basa, Isabetta"
1811,1596,1812,1601,aw3_fingerprintPrintersPublishers,FP Chain 7,printerpublisher_to_publisher,"Basa, Bernardo",1609,"Ciotti, Giovanni Battista","Basa, Isabetta"
1811,1596,1813,1602,aw3_fingerprintPrintersPublishers,FP Chain 7,printerpublisher_to_printerpublisher,"Basa, Bernardo",1609,"Gabiano, Jean de","Gabiano, Jean de"
1811,1596,1821,1602,aw3_fingerprintPrintersPublishers,FP Chain 7,printerpublisher_to_printerpublisher,"Basa, Bernardo",1609,"Crispin, Samuel","Crispin, Samuel"
1811,1596,1817,1607,aw3_fingerprintPrintersPublishers,FP Chain 7,printerpublisher_to_printer,"Basa, Bernardo",1609,"Zanetti, Luigi","Gelli, Giovanni Paolo"
1811,1596,1817,1607,aw3_fingerprintPrintersPublishers,FP Chain 7,printerpublisher_to_publisher,"Basa, Bernardo",1609,"Zanetti, Luigi","Gelli, Giovanni Paolo"
1811,1596,1818,1608,aw3_fingerprintPrintersPublishers,FP Chain 7,printerpublisher_to_printerpublisher,"Basa, Bernardo",1609,"Crispin, Samuel","Crispin, Samuel"
1811,1596,2278,1601,aw3_fingerprintPrintersPublishers,FP Chain 7,printerpublisher_to_printerpublisher,"Basa, Bernardo",1609,"Ciotti, Giovanni Battista","Ciotti, Giovanni Battista"
1811,1596,2151,1607,aw3_fingerprintPrintersPublishers,FP Chain 7,printerpublisher_to_printerpublisher,"Basa, Bernardo",1609,"Crispin, Samuel","Crispin, Samuel"
1811,1596,1816,1607,aw3_fingerprintPrintersPublishers,FP Chain 7,printerpublisher_to_printer,"Basa, Bernardo",1609,Jacques du Creux a.k.a. Molliard,"Gabiano, Jean de"
1811,1596,1816,1607,aw3_fingerprintPrintersPublishers,FP Chain 7,printerpublisher_to_publisher,"Basa, Bernardo",1609,Jacques du Creux a.k.a. Molliard,"Gabiano, Jean de"
1812,1601,1815,1606,aw3_fingerprintPrintersPublishers,FP Chain 7,printer_to_printer,"Ciotti, Giovanni Battista",1635,"Zanetti, Luigi","Gelli, Giovanni Paolo"
1812,1601,1815,1606,aw3_fingerprintPrintersPublishers,FP Chain 7,printer_to_publisher,"Ciotti, Giovanni Battista",1635,"Zanetti, Luigi","Gelli, Giovanni Paolo"
1812,1601,1755,1607,aw3_fingerprintPrintersPublishers,FP Chain 7,printer_to_printerpublisher,"Ciotti, Giovanni Battista",1635,"Crispin, Samuel","Crispin, Samuel"
1812,1601,1813,1602,aw3_fingerprintPrintersPublishers,FP Chain 7,printer_to_printerpublisher,"Ciotti, Giovanni Battista",1635,"Gabiano, Jean de","Gabiano, Jean de"
1812,1601,1821,1602,aw3_fingerprintPrintersPublishers,FP Chain 7,printer_to_printerpublisher,"Ciotti, Giovanni Battista",1635,"Crispin, Samuel","Crispin, Samuel"
1812,1601,1817,1607,aw3_fingerprintPrintersPublishers,FP Chain 7,printer_to_printer,"Ciotti, Giovanni Battista",1635,"Zanetti, Luigi","Gelli, Giovanni Paolo"
1812,1601,1817,1607,aw3_fingerprintPrintersPublishers,FP Chain 7,printer_to_publisher,"Ciotti, Giovanni Battista",1635,"Zanetti, Luigi","Gelli, Giovanni Paolo"
1812,1601,1818,1608,aw3_fingerprintPrintersPublishers,FP Chain 7,printer_to_printerpublisher,"Ciotti, Giovanni Battista",1635,"Crispin, Samuel","Crispin, Samuel"
1812,1601,1822,1618,aw3_fingerprintPrintersPublishers,FP Chain 7,printer_to_printer,"Ciotti, Giovanni Battista",1635,"Polère, Amédée","Rigaud, Pierre"
1812,1601,1822,1618,aw3_fingerprintPrintersPublishers,FP Chain 7,printer_to_publisher,"Ciotti, Giovanni Battista",1635,"Polère, Amédée","Rigaud, Pierre"
1812,1601,2151,1607,aw3_fingerprintPrintersPublishers,FP Chain 7,printer_to_printerpublisher,"Ciotti, Giovanni Battista",1635,"Crispin, Samuel","Crispin, Samuel"
1812,1601,1816,1607,aw3_fingerprintPrintersPublishers,FP Chain 7,printer_to_printer,"Ciotti, Giovanni Battista",1635,Jacques du Creux a.k.a. Molliard,"Gabiano, Jean de"
1812,1601,1816,1607,aw3_fingerprintPrintersPublishers,FP Chain 7,printer_to_publisher,"Ciotti, Giovanni Battista",1635,Jacques du Creux a.k.a. Molliard,"Gabiano, Jean de"
1812,1601,1815,1606,aw3_fingerprintPrintersPublishers,FP Chain 7,publisher_to_printer,"Basa, Isabetta",1611,"Zanetti, Luigi","Gelli, Giovanni Paolo"
1812,1601,1815,1606,aw3_fingerprintPrintersPublishers,FP Chain 7,publisher_to_publisher,"Basa, Isabetta",1611,"Zanetti, Luigi","Gelli, Giovanni Paolo"
1812,1601,1814,1603,aw3_fingerprintPrintersPublishers,FP Chain 7,publisher_to_printerpublisher,"Basa, Isabetta",1611,"Ciotti, Giovanni Battista","Ciotti, Giovanni Battista"
1812,1601,1755,1607,aw3_fingerprintPrintersPublishers,FP Chain 7,publisher_to_printerpublisher,"Basa, Isabetta",1611,"Crispin, Samuel","Crispin, Samuel"
1812,1601,1813,1602,aw3_fingerprintPrintersPublishers,FP Chain 7,publisher_to_printerpublisher,"Basa, Isabetta",1611,"Gabiano, Jean de","Gabiano, Jean de"
1812,1601,1821,1602,aw3_fingerprintPrintersPublishers,FP Chain 7,publisher_to_printerpublisher,"Basa, Isabetta",1611,"Crispin, Samuel","Crispin, Samuel"
1812,1601,1817,1607,aw3_fingerprintPrintersPublishers,FP Chain 7,publisher_to_printer,"Basa, Isabetta",1611,"Zanetti, Luigi","Gelli, Giovanni Paolo"
1812,1601,1817,1607,aw3_fingerprintPrintersPublishers,FP Chain 7,publisher_to_publisher,"Basa, Isabetta",1611,"Zanetti, Luigi","Gelli, Giovanni Paolo"
1812,1601,1818,1608,aw3_fingerprintPrintersPublishers,FP Chain 7,publisher_to_printerpublisher,"Basa, Isabetta",1611,"Crispin, Samuel","Crispin, Samuel"
1812,1601,2151,1607,aw3_fingerprintPrintersPublishers,FP Chain 7,publisher_to_printerpublisher,"Basa, Isabetta",1611,"Crispin, Samuel","Crispin, Samuel"
1812,1601,1816,1607,aw3_fingerprintPrintersPublishers,FP Chain 7,publisher_to_printer,"Basa, Isabetta",1611,Jacques du Creux a.k.a. Molliard,"Gabiano, Jean de"
1812,1601,1816,1607,aw3_fingerprintPrintersPublishers,FP Chain 7,publisher_to_publisher,"Basa, Isabetta",1611,Jacques du Creux a.k.a. Molliard,"Gabiano, Jean de"
2278,1601,1815,1606,aw3_fingerprintPrintersPublishers,FP Chain 7,printerpublisher_to_printer,"Ciotti, Giovanni Battista",1635,"Zanetti, Luigi","Gelli, Giovanni Paolo"
2278,1601,1815,1606,aw3_fingerprintPrintersPublishers,FP Chain 7,printerpublisher_to_publisher,"Ciotti, Giovanni Battista",1635,"Zanetti, Luigi","Gelli, Giovanni Paolo"
2278,1601,1755,1607,aw3_fingerprintPrintersPublishers,FP Chain 7,printerpublisher_to_printerpublisher,"Ciotti, Giovanni Battista",1635,"Crispin, Samuel","Crispin, Samuel"
2278,1601,1813,1602,aw3_fingerprintPrintersPublishers,FP Chain 7,printerpublisher_to_printerpublisher,"Ciotti, Giovanni Battista",1635,"Gabiano, Jean de","Gabiano, Jean de"
2278,1601,1821,1602,aw3_fingerprintPrintersPublishers,FP Chain 7,printerpublisher_to_printerpublisher,"Ciotti, Giovanni Battista",1635,"Crispin, Samuel","Crispin, Samuel"
2278,1601,1817,1607,aw3_fingerprintPrintersPublishers,FP Chain 7,printerpublisher_to_printer,"Ciotti, Giovanni Battista",1635,"Zanetti, Luigi","Gelli, Giovanni Paolo"
2278,1601,1817,1607,aw3_fingerprintPrintersPublishers,FP Chain 7,printerpublisher_to_publisher,"Ciotti, Giovanni Battista",1635,"Zanetti, Luigi","Gelli, Giovanni Paolo"
2278,1601,1818,1608,aw3_fingerprintPrintersPublishers,FP Chain 7,printerpublisher_to_printerpublisher,"Ciotti, Giovanni Battista",1635,"Crispin, Samuel","Crispin, Samuel"
2278,1601,1822,1618,aw3_fingerprintPrintersPublishers,FP Chain 7,printerpublisher_to_printer,"Ciotti, Giovanni Battista",1635,"Polère, Amédée","Rigaud, Pierre"
2278,1601,1822,1618,aw3_fingerprintPrintersPublishers,FP Chain 7,printerpublisher_to_publisher,"Ciotti, Giovanni Battista",1635,"Polère, Amédée","Rigaud, Pierre"
2278,1601,2151,1607,aw3_fingerprintPrintersPublishers,FP Chain 7,printerpublisher_to_printerpublisher,"Ciotti, Giovanni Battista",1635,"Crispin, Samuel","Crispin, Samuel"
2278,1601,1816,1607,aw3_fingerprintPrintersPublishers,FP Chain 7,printerpublisher_to_printer,"Ciotti, Giovanni Battista",1635,Jacques du Creux a.k.a. Molliard,"Gabiano, Jean de"
2278,1601,1816,1607,aw3_fingerprintPrintersPublishers,FP Chain 7,printerpublisher_to_publisher,"Ciotti, Giovanni Battista",1635,Jacques du Creux a.k.a. Molliard,"Gabiano, Jean de"
1813,1602,1815,1606,aw3_fingerprintPrintersPublishers,FP Chain 7,printerpublisher_to_printer,"Gabiano, Jean de",1618,"Zanetti, Luigi","Gelli, Giovanni Paolo"
1813,1602,1815,1606,aw3_fingerprintPrintersPublishers,FP Chain 7,printerpublisher_to_publisher,"Gabiano, Jean de",1618,"Zanetti, Luigi","Gelli, Giovanni Paolo"
1813,1602,1814,1603,aw3_fingerprintPrintersPublishers,FP Chain 7,printerpublisher_to_printerpublisher,"Gabiano, Jean de",1618,"Ciotti, Giovanni Battista","Ciotti, Giovanni Battista"
1813,1602,1755,1607,aw3_fingerprintPrintersPublishers,FP Chain 7,printerpublisher_to_printerpublisher,"Gabiano, Jean de",1618,"Crispin, Samuel","Crispin, Samuel"
1813,1602,1817,1607,aw3_fingerprintPrintersPublishers,FP Chain 7,printerpublisher_to_printer,"Gabiano, Jean de",1618,"Zanetti, Luigi","Gelli, Giovanni Paolo"
1813,1602,1817,1607,aw3_fingerprintPrintersPublishers,FP Chain 7,printerpublisher_to_publisher,"Gabiano, Jean de",1618,"Zanetti, Luigi","Gelli, Giovanni Paolo"
1813,1602,1818,1608,aw3_fingerprintPrintersPublishers,FP Chain 7,printerpublisher_to_printerpublisher,"Gabiano, Jean de",1618,"Crispin, Samuel","Crispin, Samuel"
1813,1602,2151,1607,aw3_fingerprintPrintersPublishers,FP Chain 7,printerpublisher_to_printerpublisher,"Gabiano, Jean de",1618,"Crispin, Samuel","Crispin, Samuel"
1813,1602,1816,1607,aw3_fingerprintPrintersPublishers,FP Chain 7,printerpublisher_to_printer,"Gabiano, Jean de",1618,Jacques du Creux a.k.a. Molliard,"Gabiano, Jean de"
1821,1602,1815,1606,aw3_fingerprintPrintersPublishers,FP Chain 7,printerpublisher_to_printer,"Crispin, Samuel",1658,"Zanetti, Luigi","Gelli, Giovanni Paolo"
1821,1602,1815,1606,aw3_fingerprintPrintersPublishers,FP Chain 7,printerpublisher_to_publisher,"Crispin, Samuel",1658,"Zanetti, Luigi","Gelli, Giovanni Paolo"
1821,1602,1814,1603,aw3_fingerprintPrintersPublishers,FP Chain 7,printerpublisher_to_printerpublisher,"Crispin, Samuel",1658,"Ciotti, Giovanni Battista","Ciotti, Giovanni Battista"
1821,1602,1817,1607,aw3_fingerprintPrintersPublishers,FP Chain 7,printerpublisher_to_printer,"Crispin, Samuel",1658,"Zanetti, Luigi","Gelli, Giovanni Paolo"
1821,1602,1817,1607,aw3_fingerprintPrintersPublishers,FP Chain 7,printerpublisher_to_publisher,"Crispin, Samuel",1658,"Zanetti, Luigi","Gelli, Giovanni Paolo"
1821,1602,1822,1618,aw3_fingerprintPrintersPublishers,FP Chain 7,printerpublisher_to_printer,"Crispin, Samuel",1658,"Polère, Amédée","Rigaud, Pierre"
1821,1602,1822,1618,aw3_fingerprintPrintersPublishers,FP Chain 7,printerpublisher_to_publisher,"Crispin, Samuel",1658,"Polère, Amédée","Rigaud, Pierre"
1821,1602,1816,1607,aw3_fingerprintPrintersPublishers,FP Chain 7,printerpublisher_to_printer,"Crispin, Samuel",1658,Jacques du Creux a.k.a. Molliard,"Gabiano, Jean de"
1821,1602,1816,1607,aw3_fingerprintPrintersPublishers,FP Chain 7,printerpublisher_to_publisher,"Crispin, Samuel",1658,Jacques du Creux a.k.a. Molliard,"Gabiano, Jean de"
1814,1603,1815,1606,aw3_fingerprintPrintersPublishers,FP Chain 7,printerpublisher_to_printer,"Ciotti, Giovanni Battista",1635,"Zanetti, Luigi","Gelli, Giovanni Paolo"
1814,1603,1815,1606,aw3_fingerprintPrintersPublishers,FP Chain 7,printerpublisher_to_publisher,"Ciotti, Giovanni Battista",1635,"Zanetti, Luigi","Gelli, Giovanni Paolo"
1814,1603,1755,1607,aw3_fingerprintPrintersPublishers,FP Chain 7,printerpublisher_to_printerpublisher,"Ciotti, Giovanni Battista",1635,"Crispin, Samuel","Crispin, Samuel"
1814,1603,1817,1607,aw3_fingerprintPrintersPublishers,FP Chain 7,printerpublisher_to_printer,"Ciotti, Giovanni Battista",1635,"Zanetti, Luigi","Gelli, Giovanni Paolo"
1814,1603,1817,1607,aw3_fingerprintPrintersPublishers,FP Chain 7,printerpublisher_to_publisher,"Ciotti, Giovanni Battista",1635,"Zanetti, Luigi","Gelli, Giovanni Paolo"
1814,1603,1818,1608,aw3_fingerprintPrintersPublishers,FP Chain 7,printerpublisher_to_printerpublisher,"Ciotti, Giovanni Battista",1635,"Crispin, Samuel","Crispin, Samuel"
1814,1603,1822,1618,aw3_fingerprintPrintersPublishers,FP Chain 7,printerpublisher_to_printer,"Ciotti, Giovanni Battista",1635,"Polère, Amédée","Rigaud, Pierre"
1814,1603,1822,1618,aw3_fingerprintPrintersPublishers,FP Chain 7,printerpublisher_to_publisher,"Ciotti, Giovanni Battista",1635,"Polère, Amédée","Rigaud, Pierre"
1814,1603,2151,1607,aw3_fingerprintPrintersPublishers,FP Chain 7,printerpublisher_to_printerpublisher,"Ciotti, Giovanni Battista",1635,"Crispin, Samuel","Crispin, Samuel"
1814,1603,1816,1607,aw3_fingerprintPrintersPublishers,FP Chain 7,printerpublisher_to_printer,"Ciotti, Giovanni Battista",1635,Jacques du Creux a.k.a. Molliard,"Gabiano, Jean de"
1814,1603,1816,1607,aw3_fingerprintPrintersPublishers,FP Chain 7,printerpublisher_to_publisher,"Ciotti, Giovanni Battista",1635,Jacques du Creux a.k.a. Molliard,"Gabiano, Jean de"
1815,1606,1755,1607,aw3_fingerprintPrintersPublishers,FP Chain 7,printer_to_printerpublisher,"Zanetti, Luigi",1611,"Crispin, Samuel","Crispin, Samuel"
1815,1606,1817,1607,aw3_fingerprintPrintersPublishers,FP Chain 7,printer_to_publisher,"Zanetti, Luigi",1611,"Zanetti, Luigi","Gelli, Giovanni Paolo"
1815,1606,1818,1608,aw3_fingerprintPrintersPublishers,FP Chain 7,printer_to_printerpublisher,"Zanetti, Luigi",1611,"Crispin, Samuel","Crispin, Samuel"
1815,1606,2151,1607,aw3_fingerprintPrintersPublishers,FP Chain 7,printer_to_printerpublisher,"Zanetti, Luigi",1611,"Crispin, Samuel","Crispin, Samuel"
1815,1606,1816,1607,aw3_fingerprintPrintersPublishers,FP Chain 7,printer_to_printer,"Zanetti, Luigi",1611,Jacques du Creux a.k.a. Molliard,"Gabiano, Jean de"
1815,1606,1816,1607,aw3_fingerprintPrintersPublishers,FP Chain 7,printer_to_publisher,"Zanetti, Luigi",1611,Jacques du Creux a.k.a. Molliard,"Gabiano, Jean de"
1815,1606,1755,1607,aw3_fingerprintPrintersPublishers,FP Chain 7,publisher_to_printerpublisher,"Gelli, Giovanni Paolo",1639,"Crispin, Samuel","Crispin, Samuel"
1815,1606,1817,1607,aw3_fingerprintPrintersPublishers,FP Chain 7,publisher_to_printer,"Gelli, Giovanni Paolo",1639,"Zanetti, Luigi","Gelli, Giovanni Paolo"
1815,1606,1818,1608,aw3_fingerprintPrintersPublishers,FP Chain 7,publisher_to_printerpublisher,"Gelli, Giovanni Paolo",1639,"Crispin, Samuel","Crispin, Samuel"
1815,1606,1822,1618,aw3_fingerprintPrintersPublishers,FP Chain 7,publisher_to_printer,"Gelli, Giovanni Paolo",1639,"Polère, Amédée","Rigaud, Pierre"
1815,1606,1822,1618,aw3_fingerprintPrintersPublishers,FP Chain 7,publisher_to_publisher,"Gelli, Giovanni Paolo",1639,"Polère, Amédée","Rigaud, Pierre"
1815,1606,2151,1607,aw3_fingerprintPrintersPublishers,FP Chain 7,publisher_to_printerpublisher,"Gelli, Giovanni Paolo",1639,"Crispin, Samuel","Crispin, Samuel"
1815,1606,1816,1607,aw3_fingerprintPrintersPublishers,FP Chain 7,publisher_to_printer,"Gelli, Giovanni Paolo",1639,Jacques du Creux a.k.a. Molliard,"Gabiano, Jean de"
1815,1606,1816,1607,aw3_fingerprintPrintersPublishers,FP Chain 7,publisher_to_publisher,"Gelli, Giovanni Paolo",1639,Jacques du Creux a.k.a. Molliard,"Gabiano, Jean de"
1755,1607,1822,1618,aw3_fingerprintPrintersPublishers,FP Chain 7,printerpublisher_to_printer,"Crispin, Samuel",1658,"Polère, Amédée","Rigaud, Pierre"
1755,1607,1822,1618,aw3_fingerprintPrintersPublishers,FP Chain 7,printerpublisher_to_publisher,"Crispin, Samuel",1658,"Polère, Amédée","Rigaud, Pierre"
2151,1607,1822,1618,aw3_fingerprintPrintersPublishers,FP Chain 7,printerpublisher_to_printer,"Crispin, Samuel",1658,"Polère, Amédée","Rigaud, Pierre"
2151,1607,1822,1618,aw3_fingerprintPrintersPublishers,FP Chain 7,printerpublisher_to_publisher,"Crispin, Samuel",1658,"Polère, Amédée","Rigaud, Pierre"
1816,1607,1818,1608,aw3_fingerprintPrintersPublishers,FP Chain 7,printer_to_printerpublisher,Jacques du Creux a.k.a. Molliard,1662,"Crispin, Samuel","Crispin, Samuel"
1816,1607,1822,1618,aw3_fingerprintPrintersPublishers,FP Chain 7,printer_to_printer,Jacques du Creux a.k.a. Molliard,1662,"Polère, Amédée","Rigaud, Pierre"
1816,1607,1822,1618,aw3_fingerprintPrintersPublishers,FP Chain 7,printer_to_publisher,Jacques du Creux a.k.a. Molliard,1662,"Polère, Amédée","Rigaud, Pierre"
1816,1607,1818,1608,aw3_fingerprintPrintersPublishers,FP Chain 7,publisher_to_printerpublisher,"Gabiano, Jean de",1618,"Crispin, Samuel","Crispin, Samuel"
1817,1607,1818,1608,aw3_fingerprintPrintersPublishers,FP Chain 7,printer_to_printerpublisher,"Zanetti, Luigi",1611,"Crispin, Samuel","Crispin, Samuel"
1817,1607,1818,1608,aw3_fingerprintPrintersPublishers,FP Chain 7,publisher_to_printerpublisher,"Gelli, Giovanni Paolo",1639,"Crispin, Samuel","Crispin, Samuel"
1817,1607,1822,1618,aw3_fingerprintPrintersPublishers,FP Chain 7,publisher_to_printer,"Gelli, Giovanni Paolo",1639,"Polère, Amédée","Rigaud, Pierre"
1817,1607,1822,1618,aw3_fingerprintPrintersPublishers,FP Chain 7,publisher_to_publisher,"Gelli, Giovanni Paolo",1639,"Polère, Amédée","Rigaud, Pierre"
1818,1608,1822,1618,aw3_fingerprintPrintersPublishers,FP Chain 7,printerpublisher_to_printer,"Crispin, Samuel",1658,"Polère, Amédée","Rigaud, Pierre"
1818,1608,1822,1618,aw3_fingerprintPrintersPublishers,FP Chain 7,printerpublisher_to_publisher,"Crispin, Samuel",1658,"Polère, Amédée","Rigaud, Pierre"
1692,1547,1934,1551,aw3_fingerprintPrintersPublishers,FP Chain 8,printer_to_printerpublisher,"Nutius I., Martinus",1558,"Richard, Jean","Richard, Jean"
1692,1547,1716,1561,aw3_fingerprintPrintersPublishers,FP Chain 8,publisher_to_printerpublisher,"Waen, Jan",1570,"Richard, Jean","Richard, Jean"
1692,1547,1712,1559,aw3_fingerprintPrintersPublishers,FP Chain 8,publisher_to_printerpublisher,"Waen, Jan",1570,"Richard, Jean","Richard, Jean"
1692,1547,1934,1551,aw3_fingerprintPrintersPublishers,FP Chain 8,publisher_to_printerpublisher,"Waen, Jan",1570,"Richard, Jean","Richard, Jean"
2198,1547,1934,1551,aw3_fingerprintPrintersPublishers,FP Chain 8,printer_to_printerpublisher,"Nutius I., Martinus",1558,"Richard, Jean","Richard, Jean"
