,type,id,chain,printer,publisher,city,year,title,author
0,Source,1692,,"Nutius I., Martinus","Waen, Jan",Leuven,1547-01-01,Sphæra Iohannis de Sacrobosco,"Sacrobosco, Johannes de"
1,Source,1694,,"Richard, Jean","Richard, Jean",Antwerp,1547-01-01,Sphaera Iohannis De Sacrobosco,"Sacrobosco, Johannes de"
2,Source,2198,,"Nutius I., Martinus","Richard, Jean",Antwerp,1547-01-01,Sphaera Iohannis De Sacrobosco,"Sacrobosco, Johannes de"
3,Target,1716,,"Richard, Jean","Richard, Jean",Antwerp,1561-01-01,Sphæra Ioannis de Sacrobosco,"Sacrobosco, Johannes de"
4,Target,1712,,"Richard, Jean","Richard, Jean",Antwerp,1559-01-01,Sphaera Ioannis de Sacrobosco,"Sacrobosco, Johannes de"
5,Chain,1694,emim osn- ete- asre (C) 1547 (A),"Richard, Jean","Richard, Jean",Antwerp,1547-01-01,Sphaera Iohannis De Sacrobosco,"Sacrobosco, Johannes de"
6,Chain,2198,uio- osa* ete- asre (C) 1547 (A),"Nutius I., Martinus","Richard, Jean",Antwerp,1547-01-01,Sphaera Iohannis De Sacrobosco,"Sacrobosco, Johannes de"
7,Chain,1692,uio- osan ete- asre (C) 1547 (A),"Nutius I., Martinus","Waen, Jan",Leuven,1547-01-01,Sphæra Iohannis de Sacrobosco,"Sacrobosco, Johannes de"
8,Chain,1934,s-e- osan ete- asre (C) 1551 (A),"Richard, Jean","Richard, Jean",Antwerp,1551-01-01,Sphaera Ioannis de Sacrobosco,"Sacrobosco, Johannes de"
9,Chain,1712,s-e- osn- iei- asre (C) 1559 (A),"Richard, Jean","Richard, Jean",Antwerp,1559-01-01,Sphaera Ioannis de Sacrobosco,"Sacrobosco, Johannes de"
10,Chain,1716,s-e- osn- iei- asre (C) 1561 (A),"Richard, Jean","Richard, Jean",Antwerp,1561-01-01,Sphæra Ioannis de Sacrobosco,"Sacrobosco, Johannes de"
11,,,,,,,,,
12,Source,1695,,"Nicolini da Sabbio, Pietro","Sessa I., Melchiorre",Venice,1548-01-01,Sphaera Ioannis de Sacrobusto,"Sacrobosco, Johannes de"
13,Source,2265,,Anonymous_Portugal_[1526],Anonymous_Portugal_[1526],Sine loco,1521-01-01,Astronomici introductorii de spaera epitome per Petrum Nonium Salaciensem,"Nunes, Pedro"
14,Target,1729,,Heirs of Melchiorre Sessa I.,Heirs of Melchiorre Sessa I.,Venice,1572-01-01,Sphaera Ioannis de Sacrobusto,"Sacrobosco, Johannes de"
15,Chain,2265,r.er cele iaem mere (S) 1526 (Q),Anonymous_Portugal_[1526],Anonymous_Portugal_[1526],Sine loco,1521-01-01,Astronomici introductorii de spaera epitome per Petrum Nonium Salaciensem,"Nunes, Pedro"
16,Chain,1695,t.li n-i- s.s- plap (C) 1548 (R),"Nicolini da Sabbio, Pietro","Sessa I., Melchiorre",Venice,1548-01-01,Sphaera Ioannis de Sacrobusto,"Sacrobosco, Johannes de"
17,Chain,1701,r.is n-i- s.re plap (C) 1550 (R),"Nicolini da Sabbio, Pietro","Sessa I., Melchiorre",Venice,1550-01-01,Sphaera Ioannis de Sacrobusto,"Sacrobosco, Johannes de"
18,Chain,2219,r.el n-i- etne HPFP (3) 1552 (R),"Nicolini da Sabbio, Cornelio","Sessa I., Melchiorre",Venice,1552-01-01,Sphaera Ioannis de Sacrobusto,"Sacrobosco, Johannes de"
19,Chain,1707,r.is n-i- s.em plap (C) 1554 (R),"Rampazetto, Francesco","Sessa I., Melchiorre",Venice,1554-01-01,Sphaera Ioannis de Sacrobusto,"Sacrobosco, Johannes de"
20,Chain,1710,r.*l n-i- s.em plap (C) 1557 (R),Heirs of Giovanni Padovani,"Sessa I., Melchiorre",Venice,1557-01-01,Sphaera Ioannis De Sacrobusto,"Sacrobosco, Johannes de"
21,Chain,1715,r.** n-i- s.o- nura (C) 1561 (R),"Rampazetto, Francesco","Rampazetto, Francesco",Venice,1561-01-01,Sphaera Ioannis de Sacrobusto,"Sacrobosco, Johannes de"
22,Chain,2106,r.er r.n- s.em plap (C) 1561 (R),Heirs of Melchiorre Sessa I.,Heirs of Melchiorre Sessa I.,Venice,1561-01-01,Sphaera Ioannis de Sacrobvsto,"Sacrobosco, Johannes de"
23,Chain,1722,"r.is n-i- s.m, plap (C) 1564 (R)","Rampazetto, Francesco","Rampazetto, Francesco",Venice,1564-01-01,Sphaera Ioannis de Sacrobusto,"Sacrobosco, Johannes de"
24,Chain,1729,s.is r.n- s.a- plap (C) 1572 (R),Heirs of Melchiorre Sessa I.,Heirs of Melchiorre Sessa I.,Venice,1572-01-01,Sphaera Ioannis de Sacrobusto,"Sacrobosco, Johannes de"
25,,,,,,,,,
26,Source,1781,,"Braubach, Peter","Braubach, Peter",Frankfurt (Main),1552-01-01,Quaestiones in libellum De sphaera Ioannis de Sacro Busto,"['Sacrobosco, Johannes de', 'Sacrobosco, Johannes de', 'Beyer, Hartmann']"
27,Source,1883,,"Pasini, Maffeo","Pasini, Maffeo",Venice,1537-01-01,Liber Ioannis de Sacro Busto de sphaera,"['Sacrobosco, Johannes de', 'Sacrobosco, Johannes de', 'Melanchthon, Philipp', 'Sacrobosco, Johannes de', 'Melanchthon, Philipp', 'Sacrobosco, Johannes de', 'Melanchthon, Philipp', 'Sacrobosco, Johannes de', 'Melanchthon, Philipp', 'Sacrobosco, Johannes de', 'Melanchthon, Philipp', 'Sacrobosco, Johannes de', 'Melanchthon, Philipp', 'Sacrobosco, Johannes de', 'Melanchthon, Philipp']"
28,Source,1884,,"Nicolini da Sabbio, Giovanni Antonio","Sessa I., Melchiorre",Venice,1537-01-01,Liber Ioannis De Sacro Busto De Sphaera,"['Sacrobosco, Johannes de', 'Sacrobosco, Johannes de', 'Melanchthon, Philipp']"
29,Target,1687,,Giovanni Antonio Nicolini da Sabbio & brothers,"Sessa I., Melchiorre",Venice,1545-01-01,Liber Ioannis de Sacrobusto de sphaera,"['Sacrobosco, Johannes de', 'Sacrobosco, Johannes de', 'Melanchthon, Philipp']"
30,Target,1790,,Heirs of Peter Braubach,Heirs of Peter Braubach,Frankfurt (Main),1571-01-01,"Quaestiones, in libellum De sphaera Ioannis de Sacro Busto","['Sacrobosco, Johannes de', 'Sacrobosco, Johannes de', 'Beyer, Hartmann']"
31,Chain,1883,++++ m.ru s.am nute (C) 1537 (R),"Pasini, Maffeo","Pasini, Maffeo",Venice,1537-01-01,Liber Ioannis de Sacro Busto de sphaera,"['Sacrobosco, Johannes de', 'Sacrobosco, Johannes de', 'Melanchthon, Philipp', 'Sacrobosco, Johannes de', 'Melanchthon, Philipp', 'Sacrobosco, Johannes de', 'Melanchthon, Philipp', 'Sacrobosco, Johannes de', 'Melanchthon, Philipp', 'Sacrobosco, Johannes de', 'Melanchthon, Philipp', 'Sacrobosco, Johannes de', 'Melanchthon, Philipp', 'Sacrobosco, Johannes de', 'Melanchthon, Philipp']"
32,Chain,1884,o-et m.a- s.am nute (C) 1537 (R),"Nicolini da Sabbio, Giovanni Antonio","Sessa I., Melchiorre",Venice,1537-01-01,Liber Ioannis De Sacro Busto De Sphaera,"['Sacrobosco, Johannes de', 'Sacrobosco, Johannes de', 'Melanchthon, Philipp']"
33,Chain,1682,o-et m.um s.am nute (C) 1541 (R),"Pasini, Maffeo","Pasini, Maffeo",Venice,1541-01-01,Liber Ioannis de Sacro Busto de sphaera,"['Sacrobosco, Johannes de', 'Sacrobosco, Johannes de', 'Melanchthon, Philipp', 'Sacrobosco, Johannes de', 'Melanchthon, Philipp', 'Sacrobosco, Johannes de', 'Melanchthon, Philipp', 'Sacrobosco, Johannes de', 'Melanchthon, Philipp', 'Sacrobosco, Johannes de', 'Melanchthon, Philipp', 'Sacrobosco, Johannes de', 'Melanchthon, Philipp', 'Sacrobosco, Johannes de', 'Melanchthon, Philipp']"
34,Chain,1687,o-et m.de s.um nute (C) 1545 (R),Giovanni Antonio Nicolini da Sabbio & brothers,"Sessa I., Melchiorre",Venice,1545-01-01,Liber Ioannis de Sacrobusto de sphaera,"['Sacrobosco, Johannes de', 'Sacrobosco, Johannes de', 'Melanchthon, Philipp']"
35,Chain,1781,t.s? a-em s.i- quui (3) 1552 (A),"Braubach, Peter","Braubach, Peter",Frankfurt (Main),1552-01-01,Quaestiones in libellum De sphaera Ioannis de Sacro Busto,"['Sacrobosco, Johannes de', 'Sacrobosco, Johannes de', 'Beyer, Hartmann']"
36,Chain,2104,t.s* i-is s.b- inqu (3) 1556 (A),"Braubach, Peter","Braubach, Peter",Frankfurt (Main),1556-01-01,Qvaestiones in libellum de sphaera Ioannis de Sacro Busto,"['Sacrobosco, Johannes de', 'Sacrobosco, Johannes de', 'Beyer, Hartmann']"
37,Chain,2105,t.s? **eu s.am inqu (3) 1560 (A),"Braubach, Peter","Braubach, Peter",Frankfurt (Main),1560-01-01,Quaestiones in libellum de sphaera Ioannis de Sacro Busto,"['Sacrobosco, Johannes de', 'Sacrobosco, Johannes de', 'Beyer, Hartmann']"
38,Chain,2148,t.s? o*eu s.am inqu (3) 1560 (R),"Braubach, Peter","Braubach, Peter",Frankfurt (Main),1560-01-01,Quaestiones in libellum de sphaera Ioannis de Sacro Busto,"['Sacrobosco, Johannes de', 'Sacrobosco, Johannes de', 'Beyer, Hartmann']"
39,Chain,1784,"o-,& ,&t. s.am inqu (3) 1561 (A)","Braubach, Peter","Braubach, Peter",Frankfurt (Main),1561-01-01,Quaestiones in libellum de sphaera Ioannis de Sacro Busto,"['Sacrobosco, Johannes de', 'Sacrobosco, Johannes de', 'Beyer, Hartmann']"
40,Chain,1862,i-i- o-e- s.i- inqu (3) 1563 (A),"Braubach, Peter","Braubach, Peter",Frankfurt (Main),1563-01-01,Quaestiones in libellum de sphaera Ioannis de Sacro Busto,"['Sacrobosco, Johannes de', 'Sacrobosco, Johannes de', 'Beyer, Hartmann']"
41,Chain,1790,umem n-ro s.am inqu (3) 1571 (R),Heirs of Peter Braubach,Heirs of Peter Braubach,Frankfurt (Main),1571-01-01,"Quaestiones, in libellum De sphaera Ioannis de Sacro Busto","['Sacrobosco, Johannes de', 'Sacrobosco, Johannes de', 'Beyer, Hartmann']"
42,,,,,,,,,
43,Source,1856,,"Richard, Jean","Richard, Jean",Antwerp,1566-01-01,Sphaera Ioannis de Sacro Bosco,"['Sacrobosco, Johannes de', 'Nunes, Pedro', 'Giuntini, Francesco', 'Sacrobosco, Johannes de', 'Vinet, Élie', 'Nunes, Pedro', 'Giuntini, Francesco', 'Sacrobosco, Johannes de', 'Vinet, Élie', 'Nunes, Pedro', 'Giuntini, Francesco', 'Sacrobosco, Johannes de', 'Vinet, Élie', 'Nunes, Pedro', 'Giuntini, Francesco']"
44,Source,1857,,Heirs of Arnold Birckmann,Heirs of Arnold Birckmann,Antwerp,1566-01-01,Sphaera Ioannis de Sacro Bosco,"['Sacrobosco, Johannes de', 'Vinet, Élie', 'Nunes, Pedro', 'Giuntini, Francesco', 'Sacrobosco, Johannes de', 'Vinet, Élie', 'Vinet, Élie', 'Nunes, Pedro', 'Giuntini, Francesco', 'Sacrobosco, Johannes de', 'Vinet, Élie', 'Vinet, Élie', 'Nunes, Pedro', 'Giuntini, Francesco', 'Sacrobosco, Johannes de', 'Vinet, Élie', 'Vinet, Élie', 'Nunes, Pedro', 'Giuntini, Francesco', 'Sacrobosco, Johannes de', 'Vinet, Élie', 'Vinet, Élie', 'Nunes, Pedro', 'Giuntini, Francesco']"
45,Target,2271,,"Welack, Matthaeus","Welack, Matthaeus",Wittenberg,1576-01-01,De sphaera et primis astronomiae rudimentis,"Blebel, Thomas"
46,Target,2180,,"Welack, Matthaeus","Welack, Matthaeus",Wittenberg,1576-01-01,De sphaera et primis astronomiae rudimentis,"Blebel, Thomas"
47,Chain,1856,"s,e- s.ie i-i- tuve (3) 1566 (A)","Richard, Jean","Richard, Jean",Antwerp,1566-01-01,Sphaera Ioannis de Sacro Bosco,"['Sacrobosco, Johannes de', 'Nunes, Pedro', 'Giuntini, Francesco', 'Sacrobosco, Johannes de', 'Vinet, Élie', 'Nunes, Pedro', 'Giuntini, Francesco', 'Sacrobosco, Johannes de', 'Vinet, Élie', 'Nunes, Pedro', 'Giuntini, Francesco', 'Sacrobosco, Johannes de', 'Vinet, Élie', 'Nunes, Pedro', 'Giuntini, Francesco']"
48,Chain,1857,"s,e- s.ie i-i- tuve (3) 1566 (A)",Heirs of Arnold Birckmann,Heirs of Arnold Birckmann,Antwerp,1566-01-01,Sphaera Ioannis de Sacro Bosco,"['Sacrobosco, Johannes de', 'Vinet, Élie', 'Nunes, Pedro', 'Giuntini, Francesco', 'Sacrobosco, Johannes de', 'Vinet, Élie', 'Vinet, Élie', 'Nunes, Pedro', 'Giuntini, Francesco', 'Sacrobosco, Johannes de', 'Vinet, Élie', 'Vinet, Élie', 'Nunes, Pedro', 'Giuntini, Francesco', 'Sacrobosco, Johannes de', 'Vinet, Élie', 'Vinet, Élie', 'Nunes, Pedro', 'Giuntini, Francesco', 'Sacrobosco, Johannes de', 'Vinet, Élie', 'Vinet, Élie', 'Nunes, Pedro', 'Giuntini, Francesco']"
49,Chain,2180,"t,a- i-um i-i- etla (C) 1576 (R)","Welack, Matthaeus","Welack, Matthaeus",Wittenberg,1576-01-01,De sphaera et primis astronomiae rudimentis,"Blebel, Thomas"
50,Chain,2271,"t,a- i-um i-i- etla (C) 1577 (R)","Welack, Matthaeus","Welack, Matthaeus",Wittenberg,1576-01-01,De sphaera et primis astronomiae rudimentis,"Blebel, Thomas"
51,,,,,,,,,
52,Source,1869,,,"Colines, Simon de",Paris,1527-01-01,Textus de sphaera Ioannis de Sacrobosco,"['Sacrobosco, Johannes de', 'Lattes, Bonet de', 'Sacrobosco, Johannes de', 'Euclid', 'Lattes, Bonet de', 'Sacrobosco, Johannes de', 'Euclid', 'Lattes, Bonet de']"
53,Source,1870,,"Colines, Simon de","Colines, Simon de",Paris,1521-01-01,Textus de sphaera Ioannis de Sacrobosco,"['Sacrobosco, Johannes de', 'Lattes, Bonet de', 'Sacrobosco, Johannes de', 'Euclid', 'Lattes, Bonet de', 'Sacrobosco, Johannes de', 'Euclid', 'Lattes, Bonet de']"
54,Target,1843,,"Colines, Simon de","Colines, Simon de",Paris,1538-01-01,Textus de Sphaera Ioannis de Sacrobosco,"['Sacrobosco, Johannes de', 'Lattes, Bonet de', 'Sacrobosco, Johannes de', 'Euclid', 'Lattes, Bonet de', 'Sacrobosco, Johannes de', 'Euclid', 'Lattes, Bonet de']"
55,Chain,1870,a1a. enon 6142 polu (3) 1521 (A),"Colines, Simon de","Colines, Simon de",Paris,1521-01-01,Textus de sphaera Ioannis de Sacrobosco,"['Sacrobosco, Johannes de', 'Lattes, Bonet de', 'Sacrobosco, Johannes de', 'Euclid', 'Lattes, Bonet de', 'Sacrobosco, Johannes de', 'Euclid', 'Lattes, Bonet de']"
56,Chain,1869,a1a. sate 6142 stta (3) 1527 (A),,"Colines, Simon de",Paris,1527-01-01,Textus de sphaera Ioannis de Sacrobosco,"['Sacrobosco, Johannes de', 'Lattes, Bonet de', 'Sacrobosco, Johannes de', 'Euclid', 'Lattes, Bonet de', 'Sacrobosco, Johannes de', 'Euclid', 'Lattes, Bonet de']"
57,Chain,1832,.1a. sate 6142 stta (3) 1531 (A),"Colines, Simon de","Colines, Simon de",Paris,1531-01-01,Textus de sphaera Ioannis de Sacrobosco,"['Sacrobosco, Johannes de', 'Lattes, Bonet de', 'Sacrobosco, Johannes de', 'Euclid', 'Lattes, Bonet de', 'Sacrobosco, Johannes de', 'Euclid', 'Lattes, Bonet de']"
58,Chain,1831,.1a. sate 6142 stta (3) 1534 (A),"Colines, Simon de","Colines, Simon de",Paris,1534-01-01,Textus de sphaera Ioannis de Sacrobosco,"['Sacrobosco, Johannes de', 'Lattes, Bonet de', 'Sacrobosco, Johannes de', 'Euclid', 'Lattes, Bonet de', 'Sacrobosco, Johannes de', 'Euclid', 'Lattes, Bonet de']"
59,Chain,1843,".1a. ine, 6142 sota (3) 1538 (A)","Colines, Simon de","Colines, Simon de",Paris,1538-01-01,Textus de Sphaera Ioannis de Sacrobosco,"['Sacrobosco, Johannes de', 'Lattes, Bonet de', 'Sacrobosco, Johannes de', 'Euclid', 'Lattes, Bonet de', 'Sacrobosco, Johannes de', 'Euclid', 'Lattes, Bonet de']"
60,,,,,,,,,
61,Source,1919,,Giovanni Varisco & company,Giovanni Varisco & company,Venice,1579-01-01,La sfera del mondo di M. Alessandro Piccolomini,"Piccolòmini, Alessandro"
62,Source,2073,,Giovanni Varisco & company,Giovanni Varisco & company,Venice,1573-01-01,La sfera del mondo di M. Alessandro Piccolomini,"Piccolòmini, Alessandro"
63,Target,2067,,Heir of Giovanni Varisco  (Giorgio),Heir of Giovanni Varisco  (Giorgio),Venice,1595-01-01,La Sfera del Mondo di M. Alessandro Piccolomini,"Piccolòmini, Alessandro"
64,Target,2069,,"Varisco, Giovanni & Paganini, Paganino","Varisco, Giovanni & Paganini, Paganino",Venice,1584-01-01,La sfera del mondo di M. Alessandro Piccolomini,"Piccolòmini, Alessandro"
65,Chain,2073,"l-in 2.a. ,&o: noEt (3) 1573 (R)",Giovanni Varisco & company,Giovanni Varisco & company,Venice,1573-01-01,La sfera del mondo di M. Alessandro Piccolomini,"Piccolòmini, Alessandro"
66,Chain,1919,"l-in 2.a. ,&o: noEt (3) 1579 (A)",Giovanni Varisco & company,Giovanni Varisco & company,Venice,1579-01-01,La sfera del mondo di M. Alessandro Piccolomini,"Piccolòmini, Alessandro"
67,Chain,2069,"l-in 42a. ,&o: noEt (3) 1589 (Q)","Varisco, Giovanni & Paganini, Paganino","Varisco, Giovanni & Paganini, Paganino",Venice,1584-01-01,La sfera del mondo di M. Alessandro Piccolomini,"Piccolòmini, Alessandro"
68,Chain,2067,"l-in 42a. ,&o: noEt (3) 1595 (R)",Heir of Giovanni Varisco  (Giorgio),Heir of Giovanni Varisco  (Giorgio),Venice,1595-01-01,La Sfera del Mondo di M. Alessandro Piccolomini,"Piccolòmini, Alessandro"
69,,,,,,,,,
70,Source,2160,,"Krafft the Elder, Johann","Krafft the Elder, Johann",Wittenberg,1564-01-01,Novae quaestiones sphaerae,"Dietrich, Sebastian"
71,Source,2177,,"Krafft, Johann","Krafft, Johann",Wittenberg,1590-01-01,"De Sphaera, et primis astronomiae rudimentis","Blebel, Thomas"
72,Source,2178,,"Krafft, Johann","Krafft, Johann",Wittenberg,1582-01-01,De sphaera et primis astronomiae rudimentis,"Blebel, Thomas"
73,Source,2217,,Valerio Meda & brothers,Valerio Meda & brothers,Milan,1550-01-01,Trattato della sphera,"Sacrobosco, Johannes de"
74,Target,2183,,Heirs of Andreas Kelner,Heirs of Samuel Selfisch,Wittenberg,1616-01-01,"De sphaera, seu primi mobilis rudimentis libellus","['Regiomontanus, Johannes', 'Regiomontanus, Johannes', 'Blebel, Thomas']"
75,Target,2115,,"Fincelius, Hiob Wilhelm",Heirs of Samuel Selfisch,Wittenberg,1629-01-01,"De sphaera, seu primi mobilis rudimentis libellus","['Regiomontanus, Johannes', 'Regiomontanus, Johannes', 'Blebel, Thomas']"
76,Target,2159,,"Welack, Matthaeus","Welack, Matthaeus",Wittenberg,1583-01-01,Novae quaestiones sphaericae,"Dietrich, Sebastian"
77,Target,2164,,"Säuberlich, Lorenz","Seelfisch, Samuel",Wittenberg,1605-01-01,Novae quaestiones sphaericae,"Dietrich, Sebastian"
78,Chain,2217,i-m- o-em erlo trtr (3) 1550 (Q),Valerio Meda & brothers,Valerio Meda & brothers,Milan,1550-01-01,Trattato della sphera,"Sacrobosco, Johannes de"
79,Chain,2160,"u-a, ,&i- o-i- EsQu (3) 1564 (R)","Krafft the Elder, Johann","Krafft the Elder, Johann",Wittenberg,1564-01-01,Novae quaestiones sphaerae,"Dietrich, Sebastian"
80,Chain,2158,"u-a, eti- o-ui EsQu (3) 1567 (R)","Krafft the Elder, Johann","Krafft the Elder, Johann",Wittenberg,1567-01-01,Novae quaestiones sphaerae,"Dietrich, Sebastian"
81,Chain,2157,"a-ad m,a- o-i- EsQu (3) 1570 (R)","Krafft the Elder, Johann","Krafft the Elder, Johann",Wittenberg,1570-01-01,Novae quaestiones sphaerae,"Dietrich, Sebastian"
82,Chain,2161,"a-ad m,a- o-i- EsQu (3) 1573 (R)","Schöne, Anton","Schöne, Anton",Wittenberg,1573-01-01,Novae quaestiones sphaerae,"['Dietrich, Sebastian', 'Dietrich, Sebastian', 'Dietrich, Sebastian']"
83,Chain,2162,"a-ad m,a- o-i- EsQu (3) 1578 (R)","Krafft the Elder, Johann","Krafft the Elder, Johann",Wittenberg,1578-01-01,Novae quaestiones sphaerae,"Dietrich, Sebastian"
84,Chain,2178,eme- o-uè n-a- ctTe (3) 1582 (R),"Krafft, Johann","Krafft, Johann",Wittenberg,1582-01-01,De sphaera et primis astronomiae rudimentis,"Blebel, Thomas"
85,Chain,2159,"a-ad m,i- o-i- EsQu (3) 1583 (R)","Welack, Matthaeus","Welack, Matthaeus",Wittenberg,1583-01-01,Novae quaestiones sphaericae,"Dietrich, Sebastian"
86,Chain,2176,i-m- o-a- n-a- ctTe (3) 1588 (R),"Welack, Matthaeus","Welack, Matthaeus",Wittenberg,1588-01-01,De Sphaera et primis astronomiae rudimentis,"Blebel, Thomas"
87,Chain,2177,aro- umam n-a- diva (3) 1590 (R),"Krafft, Johann","Krafft, Johann",Wittenberg,1590-01-01,"De Sphaera, et primis astronomiae rudimentis","Blebel, Thomas"
88,Chain,2163,a&o- usus o-i- EsQu (3) 1591 (R),"Welack, Matthaeus","Welack, Matthaeus",Wittenberg,1591-01-01,Novae quaestiones sphaericae,"Dietrich, Sebastian"
89,Chain,2181,"aro- umm, o-i- diie (3) 1595 (R)","Krafft, Johann","Krafft, Johann",Wittenberg,1595-01-01,"De Sphaera, et primis astronomiae rudimentis","Blebel, Thomas"
90,Chain,2175,i-m- t.PI o-i- cite (3) 1598 (R),Anonymous_1598,Anonymous_1598,Sine loco,1598-01-01,De Sphaera et primis astronomiae rudimentis,"Blebel, Thomas"
91,Chain,2182,ròi- t.P- o-i- cite (3) 1603 (R),"Krafft, Johann","Krafft, Johann",Wittenberg,1603-01-01,"De sphaera, et primis astronomiae rudimentis","Blebel, Thomas"
92,Chain,2164,"a-ad m,i- o-i- EsQu (3) 1605 (A)","Säuberlich, Lorenz","Seelfisch, Samuel",Wittenberg,1605-01-01,Novae quaestiones sphaericae,"Dietrich, Sebastian"
93,Chain,2179,"e-,& t.PI o-i- dite (3) 1611 (R)","Säuberlich, Lorenz","Seelfisch, Samuel",Wittenberg,1611-01-01,"De Sphaera, et primis astronomiae rudimentis","Blebel, Thomas"
94,Chain,2183,"e-r, i-i- o-s. dite (3) 1616 (R)",Heirs of Andreas Kelner,Heirs of Samuel Selfisch,Wittenberg,1616-01-01,"De sphaera, seu primi mobilis rudimentis libellus","['Regiomontanus, Johannes', 'Regiomontanus, Johannes', 'Blebel, Thomas']"
95,Chain,2115,n-m- amu- o-s. dite (3) 1629 (R),"Fincelius, Hiob Wilhelm",Heirs of Samuel Selfisch,Wittenberg,1629-01-01,"De sphaera, seu primi mobilis rudimentis libellus","['Regiomontanus, Johannes', 'Regiomontanus, Johannes', 'Blebel, Thomas']"
96,,,,,,,,,
97,Source,1616,,"Landsberg, Martin","Landsberg, Martin",Leipzig,1486-01-01,Johannis de sacro busto spericum opusculum,"Sacrobosco, Johannes de"
98,Target,2200,,"Kachelofen, Konrad","Kachelofen, Konrad",Leipzig,1489-01-01,Iohannis de sacro busto spericum opusculum,"Sacrobosco, Johannes de"
99,Chain,1616,m.la e*ib ibin titi (C) 1489 (Q),"Landsberg, Martin","Landsberg, Martin",Leipzig,1486-01-01,Johannis de sacro busto spericum opusculum,"Sacrobosco, Johannes de"
100,Chain,2200,uma- etie b*in titi (C) 1490 (Q),"Kachelofen, Konrad","Kachelofen, Konrad",Leipzig,1489-01-01,Iohannis de sacro busto spericum opusculum,"Sacrobosco, Johannes de"
101,,,,,,,,,
102,Source,2201,,"Kachelofen, Konrad","Kachelofen, Konrad",Leipzig,1489-01-01,Iohannis de sacro busto spericum opusculum,"Sacrobosco, Johannes de"
103,Target,2200,,"Kachelofen, Konrad","Kachelofen, Konrad",Leipzig,1489-01-01,Iohannis de sacro busto spericum opusculum,"Sacrobosco, Johannes de"
104,Chain,2200,uma- etie b*in titi (C) 1490 (Q),"Kachelofen, Konrad","Kachelofen, Konrad",Leipzig,1489-01-01,Iohannis de sacro busto spericum opusculum,"Sacrobosco, Johannes de"
105,Chain,2201,ummo *&ie b*in tica (C) 1489 (Q),"Kachelofen, Konrad","Kachelofen, Konrad",Leipzig,1489-01-01,Iohannis de sacro busto spericum opusculum,"Sacrobosco, Johannes de"
106,,,,,,,,,
107,Source,1925,,"Scoto I., Ottaviano","Scoto I., Ottaviano",Venice,1490-01-01,Sphaerae mundi compendium foeliciter inchoat,"['Sacrobosco, Johannes de', 'Regiomontanus, Johannes', 'Sacrobosco, Johannes de', 'Peuerbach, Georg von', 'Regiomontanus, Johannes', 'Sacrobosco, Johannes de', 'Peuerbach, Georg von', 'Regiomontanus, Johannes']"
108,Target,2254,,"Palthenius, Zacharias","Rosa, Jonas",Frankfurt (Main),1600-01-01,Isagoge sphaerica,"Scribonius, Wilhelm Adolf"
109,Target,1930,,"Sessa I., Giovanni Battista","Sessa I., Giovanni Battista",Venice,1501-01-01,Sphaera mundi,"['Sacrobosco, Johannes de', 'Regiomontanus, Johannes', 'Sacrobosco, Johannes de', 'Peuerbach, Georg von', 'Regiomontanus, Johannes', 'Sacrobosco, Johannes de', 'Peuerbach, Georg von', 'Regiomontanus, Johannes']"
110,Chain,1925,aqta m.um ece- leli (C) 1490 (R),"Scoto I., Ottaviano","Scoto I., Ottaviano",Venice,1490-01-01,Sphaerae mundi compendium foeliciter inchoat,"['Sacrobosco, Johannes de', 'Regiomontanus, Johannes', 'Sacrobosco, Johannes de', 'Peuerbach, Georg von', 'Regiomontanus, Johannes', 'Sacrobosco, Johannes de', 'Peuerbach, Georg von', 'Regiomontanus, Johannes']"
111,Chain,1926,aqta m.n- ece- asua (C) 1491 (R),"Trino, Guglielmo da","Trino, Guglielmo da",Venice,1491-01-01,Sphaera mundi,"['Sacrobosco, Johannes de', 'Regiomontanus, Johannes', 'Sacrobosco, Johannes de', 'Peuerbach, Georg von', 'Regiomontanus, Johannes', 'Sacrobosco, Johannes de', 'Peuerbach, Georg von', 'Regiomontanus, Johannes']"
112,Chain,1930,aqta m.o- eris tain (3) 1501 (A),"Sessa I., Giovanni Battista","Sessa I., Giovanni Battista",Venice,1501-01-01,Sphaera mundi,"['Sacrobosco, Johannes de', 'Regiomontanus, Johannes', 'Sacrobosco, Johannes de', 'Peuerbach, Georg von', 'Regiomontanus, Johannes', 'Sacrobosco, Johannes de', 'Peuerbach, Georg von', 'Regiomontanus, Johannes']"
113,Chain,2254,e-a- m.um r.e- paci (C) 1600 (A),"Palthenius, Zacharias","Rosa, Jonas",Frankfurt (Main),1600-01-01,Isagoge sphaerica,"Scribonius, Wilhelm Adolf"
114,,,,,,,,,
115,Source,1626,,"Landsberg, Martin","Landsberg, Martin",Leipzig,1494-01-01,Opusculum Iohannis de Sacro Busto spericum,"Sacrobosco, Johannes de"
116,Target,1638,,"Landsberg, Martin","Landsberg, Martin",Leipzig,1498-01-01,Opusculum Johannis de sacrobusto spericum,"Sacrobosco, Johannes de"
117,Chain,1626,i-it e*te r.ur teri (C) 1494 (Q),"Landsberg, Martin","Landsberg, Martin",Leipzig,1494-01-01,Opusculum Iohannis de Sacro Busto spericum,"Sacrobosco, Johannes de"
118,Chain,1638,i-ur tete r.ur teri (C) 1510 (Q),"Landsberg, Martin","Landsberg, Martin",Leipzig,1498-01-01,Opusculum Johannis de sacrobusto spericum,"Sacrobosco, Johannes de"
119,,,,,,,,,
120,Source,1844,,"Landsberg, Martin","Landsberg, Martin",Leipzig,1495-01-01,Opusculum Johannis de sacro busto spericum,"Sacrobosco, Johannes de"
121,Target,1846,,"Landsberg, Martin","Landsberg, Martin",Leipzig,1520-01-01,Opusculum Ioannis de Sacro Busto Spericum,"['Faber, Wenzel', 'Faber, Wenzel', 'Sacrobosco, Johannes de']"
122,Target,2194,,"Landsberg, Martin","Landsberg, Martin",Leipzig,1517-01-01,Opusculum Iohannis de sacro busto spericum,"['Faber, Wenzel', 'Faber, Wenzel', 'Sacrobosco, Johannes de']"
123,Chain,1844,erre rie- umio legi (C) 1495 (Q),"Landsberg, Martin","Landsberg, Martin",Leipzig,1495-01-01,Opusculum Johannis de sacro busto spericum,"Sacrobosco, Johannes de"
124,Chain,2194,r-re i-re u*io legi (C) 1520 (Q),"Landsberg, Martin","Landsberg, Martin",Leipzig,1517-01-01,Opusculum Iohannis de sacro busto spericum,"['Faber, Wenzel', 'Faber, Wenzel', 'Sacrobosco, Johannes de']"
125,Chain,1846,r-re i-e- umio legi (C) 1520 (Q),"Landsberg, Martin","Landsberg, Martin",Leipzig,1520-01-01,Opusculum Ioannis de Sacro Busto Spericum,"['Faber, Wenzel', 'Faber, Wenzel', 'Sacrobosco, Johannes de']"
126,,,,,,,,,
127,Source,1805,,"Petit I., Jean","Petit I., Jean",Paris,1508-01-01,Uberrimum sphere mundi commentum,"d'Ailly, Pierre"
128,Target,1824,,"Petit I., Jean","Petit I., Jean",Paris,1515-01-01,Habes lector Iohannis de sacro busto sphere textum una,"['Sacrobosco, Johannes de', 'Ciruelo, Pedro', 'Sacrobosco, Johannes de', ""d'Ailly, Pierre"", 'Ciruelo, Pedro', 'Sacrobosco, Johannes de', ""d'Ailly, Pierre"", 'Ciruelo, Pedro']"
129,Chain,1805,s.i. maas nar- p*te (C) 1508 (Q),"Petit I., Jean","Petit I., Jean",Paris,1508-01-01,Uberrimum sphere mundi commentum,"d'Ailly, Pierre"
130,Chain,1824,s.t. maas ore- nisu (3) 1515 (A),"Petit I., Jean","Petit I., Jean",Paris,1515-01-01,Habes lector Iohannis de sacro busto sphere textum una,"['Sacrobosco, Johannes de', 'Ciruelo, Pedro', 'Sacrobosco, Johannes de', ""d'Ailly, Pierre"", 'Ciruelo, Pedro', 'Sacrobosco, Johannes de', ""d'Ailly, Pierre"", 'Ciruelo, Pedro']"
131,,,,,,,,,
132,Source,1650,,"Sessa I., Melchiorre","Sessa I., Melchiorre",Venice,1513-01-01,Spherae Mundi,"['Sacrobosco, Johannes de', 'Regiomontanus, Johannes', 'Sacrobosco, Johannes de', 'Peuerbach, Georg von', 'Regiomontanus, Johannes', 'Sacrobosco, Johannes de', 'Peuerbach, Georg von', 'Regiomontanus, Johannes']"
133,Target,1942,,"Penzio, Giacomo","Penzio, Giacomo",Venice,1519-01-01,Spherae Mundi,"['Sacrobosco, Johannes de', 'Regiomontanus, Johannes', 'Sacrobosco, Johannes de', 'Peuerbach, Georg von', 'Regiomontanus, Johannes', 'Sacrobosco, Johannes de', 'Peuerbach, Georg von', 'Regiomontanus, Johannes']"
134,Chain,1650,exre m.ru upst ta&i (3) 1513 (R),"Sessa I., Melchiorre","Sessa I., Melchiorre",Venice,1513-01-01,Spherae Mundi,"['Sacrobosco, Johannes de', 'Regiomontanus, Johannes', 'Sacrobosco, Johannes de', 'Peuerbach, Georg von', 'Regiomontanus, Johannes', 'Sacrobosco, Johannes de', 'Peuerbach, Georg von', 'Regiomontanus, Johannes']"
135,Chain,1942,exre m.ru upse ta&i (3) 1519 (R),"Penzio, Giacomo","Penzio, Giacomo",Venice,1519-01-01,Spherae Mundi,"['Sacrobosco, Johannes de', 'Regiomontanus, Johannes', 'Sacrobosco, Johannes de', 'Peuerbach, Georg von', 'Regiomontanus, Johannes', 'Sacrobosco, Johannes de', 'Peuerbach, Georg von', 'Regiomontanus, Johannes']"
136,,,,,,,,,
137,Source,1655,,"Gutknecht, Jobst","Gutknecht, Jobst",Nuremberg,1516-01-01,Sphera materialis,"['Sacrobosco, Johannes de', 'Sacrobosco, Johannes de', 'Heinfogel, Konrad']"
138,Target,1877,,"Aich, Arnd von","Aich, Arnd von",Cologne,1519-01-01,Sphera materialis,"['Sacrobosco, Johannes de', 'Sacrobosco, Johannes de', 'Heinfogel, Konrad']"
139,Chain,1655,erde n-r/ n.t- br*I (C) 1516 (R),"Gutknecht, Jobst","Gutknecht, Jobst",Nuremberg,1516-01-01,Sphera materialis,"['Sacrobosco, Johannes de', 'Sacrobosco, Johannes de', 'Heinfogel, Konrad']"
140,Chain,1877,erde enr. n.y- br*I (C) 1519 (R),"Aich, Arnd von","Aich, Arnd von",Cologne,1519-01-01,Sphera materialis,"['Sacrobosco, Johannes de', 'Sacrobosco, Johannes de', 'Heinfogel, Konrad']"
141,,,,,,,,,
142,Source,1664,,"Chaudière, Regnault","Chaudière, Regnault",Paris,1519-01-01,Mundialis Sphere opusculum Ioannis de sacro busco,"Sacrobosco, Johannes de"
143,Target,1667,,"Chaudière, Regnault","Chaudière, Regnault",Paris,1524-01-01,Mundialis Sphere opusculum Joannis de sacro busto,"Sacrobosco, Johannes de"
144,Chain,1664,r.ma ereq r.de qubu (C) 1519 (A),"Chaudière, Regnault","Chaudière, Regnault",Paris,1519-01-01,Mundialis Sphere opusculum Ioannis de sacro busco,"Sacrobosco, Johannes de"
145,Chain,1667,r.** *tmq r.de qubu (C) 1524 (A),"Chaudière, Regnault","Chaudière, Regnault",Paris,1524-01-01,Mundialis Sphere opusculum Joannis de sacro busto,"Sacrobosco, Johannes de"
146,,,,,,,,,
147,Source,1670,,"Chaudière, Regnault","Chaudière, Regnault",Paris,1527-01-01,Mundialis sphere opusculum Ioannis de sacro busto,"Sacrobosco, Johannes de"
148,Target,1679,,"Vidoue, Pierre","Chaudière, Regnault",Paris,1534-01-01,Ioannis de Sacro Busto Sphaera Mundialis,"Sacrobosco, Johannes de"
149,Chain,1670,r.on ernt e.ue si&q (C) 1527 (R),"Chaudière, Regnault","Chaudière, Regnault",Paris,1527-01-01,Mundialis sphere opusculum Ioannis de sacro busto,"Sacrobosco, Johannes de"
150,Chain,1679,"r,ae era, e.ue si&q (C) 1534 (A)","Vidoue, Pierre","Chaudière, Regnault",Paris,1534-01-01,Ioannis de Sacro Busto Sphaera Mundialis,"Sacrobosco, Johannes de"
151,,,,,,,,,
152,Source,1864,,"Cammerlander, Jacob","Cammerlander, Jacob",Strasbourg,1533-01-01,Sphera materialis,"['Sacrobosco, Johannes de', 'Heinfogel, Konrad', 'Sacrobosco, Johannes de', 'Cammerlander, Jacob', 'Heinfogel, Konrad', 'Sacrobosco, Johannes de', 'Cammerlander, Jacob', 'Heinfogel, Konrad']"
153,Target,1865,,"Cammerlander, Jacob","Cammerlander, Jacob",Strasbourg,1539-01-01,Sphaera Mundi,"['Sacrobosco, Johannes de', 'Sacrobosco, Johannes de', 'Heinfogel, Konrad']"
154,Chain,1864,ß.ß. imun umor gein (C) 1533 (A),"Cammerlander, Jacob","Cammerlander, Jacob",Strasbourg,1533-01-01,Sphera materialis,"['Sacrobosco, Johannes de', 'Heinfogel, Konrad', 'Sacrobosco, Johannes de', 'Cammerlander, Jacob', 'Heinfogel, Konrad', 'Sacrobosco, Johannes de', 'Cammerlander, Jacob', 'Heinfogel, Konrad']"
155,Chain,1865,ß.ß. imn- umor gein (C) 1539 (R),"Cammerlander, Jacob","Cammerlander, Jacob",Strasbourg,1539-01-01,Sphaera Mundi,"['Sacrobosco, Johannes de', 'Sacrobosco, Johannes de', 'Heinfogel, Konrad']"
156,,,,,,,,,
157,Source,1880,,"Klug, Joseph","Klug, Joseph",Wittenberg,1534-01-01,"Liber Iohannis de Sacro Busto, de Sphera","['Sacrobosco, Johannes de', 'Sacrobosco, Johannes de', 'Melanchthon, Philipp']"
158,Target,1753,,"Krafft, Johann",Zacharias Schürer & partners,Wittenberg,1601-01-01,Libellus de Sphaera Iohannis de Sacro Busto,"['Sacrobosco, Johannes de', 'Sacrobosco, Johannes de', 'Melanchthon, Philipp']"
159,Chain,1880,isus ioer r.u- abfi (C) 1534 (R),"Klug, Joseph","Klug, Joseph",Wittenberg,1534-01-01,"Liber Iohannis de Sacro Busto, de Sphera","['Sacrobosco, Johannes de', 'Sacrobosco, Johannes de', 'Melanchthon, Philipp']"
160,Chain,1882,isge ioer r.u- dein (C) 1536 (R),"Klug, Joseph","Klug, Joseph",Wittenberg,1536-01-01,"Liber Ioannis de Sacro Busto, de sphaera","['Sacrobosco, Johannes de', 'Sacrobosco, Johannes de', 'Melanchthon, Philipp']"
161,Chain,1753,"iti* a.s, r.u- stsp (C) 1601 (A)","Krafft, Johann",Zacharias Schürer & partners,Wittenberg,1601-01-01,Libellus de Sphaera Iohannis de Sacro Busto,"['Sacrobosco, Johannes de', 'Sacrobosco, Johannes de', 'Melanchthon, Philipp']"
162,,,,,,,,,
163,Source,1885,,"Klug, Joseph","Klug, Joseph",Wittenberg,1538-01-01,"Ioannis de Sacro Busto libellus, De sphæra","['Sacrobosco, Johannes de', 'Sacrobosco, Johannes de', 'Melanchthon, Philipp']"
164,Target,1888,,"Seitz, Peter I.","Seitz, Peter I.",Wittenberg,1543-01-01,Ioannis de Sacro Busto libellus de sphaera,"['Sacrobosco, Johannes de', 'Sacrobosco, Johannes de', 'Melanchthon, Philipp']"
165,Target,1887,,"Loys, Jean","Loys, Jean",Paris,1542-01-01,Ioannis de Sacrobusto de sphaera liber,"['Sacrobosco, Johannes de', 'Sacrobosco, Johannes de', 'Melanchthon, Philipp']"
166,Target,1688,,"Loys, Jean","Richard, Guillaume",Paris,1545-01-01,Sphaera Ioannis de Sacrobosco,"['Sacrobosco, Johannes de', 'Sacrobosco, Johannes de', 'Melanchthon, Philipp']"
167,Chain,1885,++++ ++++ r.n- seFI (C) 1538 (R),"Klug, Joseph","Klug, Joseph",Wittenberg,1538-01-01,"Ioannis de Sacro Busto libellus, De sphæra","['Sacrobosco, Johannes de', 'Sacrobosco, Johannes de', 'Melanchthon, Philipp']"
168,Chain,1886,edus inam r.ra seFI (C) 1540 (R),"Klug, Joseph","Klug, Joseph",Wittenberg,1540-01-01,"Ioannis de Sacro-Busto libellus, de sphaera","['Sacrobosco, Johannes de', 'Sacrobosco, Johannes de', 'Melanchthon, Philipp']"
169,Chain,1887,edus inam r.rò muFI (C) 1543 (A),"Loys, Jean","Loys, Jean",Paris,1542-01-01,Ioannis de Sacrobusto de sphaera liber,"['Sacrobosco, Johannes de', 'Sacrobosco, Johannes de', 'Melanchthon, Philipp']"
170,Chain,1888,edus inam r.i- runu (C) 1543 (A),"Seitz, Peter I.","Seitz, Peter I.",Wittenberg,1543-01-01,Ioannis de Sacro Busto libellus de sphaera,"['Sacrobosco, Johannes de', 'Sacrobosco, Johannes de', 'Melanchthon, Philipp']"
171,Chain,1684,edus inam r.ne suFi (C) 1543 (A),"Richard, Jean","Richard, Jean",Antwerp,1543-01-01,Ioannis de sacro busto Libellus de Sphaera,"['Sacrobosco, Johannes de', 'Sacrobosco, Johannes de', 'Melanchthon, Philipp']"
172,Chain,1688,"edus inam m.t, seui (C) 1545 (A)","Loys, Jean","Richard, Guillaume",Paris,1545-01-01,Sphaera Ioannis de Sacrobosco,"['Sacrobosco, Johannes de', 'Sacrobosco, Johannes de', 'Melanchthon, Philipp']"
173,,,,,,,,,
174,Source,1690,,"Kreutzer, Veit","Kreutzer, Veit",Wittenberg,1545-01-01,Ioannis de Sacro Busto libellus de sphaera,"['Sacrobosco, Johannes de', 'Sacrobosco, Johannes de', 'Melanchthon, Philipp']"
175,Target,1753,,"Krafft, Johann",Zacharias Schürer & partners,Wittenberg,1601-01-01,Libellus de Sphaera Iohannis de Sacro Busto,"['Sacrobosco, Johannes de', 'Sacrobosco, Johannes de', 'Melanchthon, Philipp']"
176,Target,1899,,Widow & heirs of Zacharias I. Schürer,Widow & heirs of Zacharias I. Schürer,Wittenberg,1629-01-01,Libellus de Sphaera Johannis de Sacro Busto,"['Sacrobosco, Johannes de', 'Sacrobosco, Johannes de', 'Melanchthon, Philipp']"
177,Target,1897,,Heirs of Peter I. Seitz,Heirs of Peter I. Seitz,Wittenberg,1574-01-01,Ioannis de Sacro Bvsto Libellvs de sphæra,"['Sacrobosco, Johannes de', 'Sacrobosco, Johannes de', 'Melanchthon, Philipp']"
178,Target,1898,,Heirs of Peter I. Seitz,Heirs of Peter I. Seitz,Wittenberg,1578-01-01,Iohannis de Sacro Busto libellus de sphaera,"['Sacrobosco, Johannes de', 'Sacrobosco, Johannes de', 'Melanchthon, Philipp']"
179,Chain,1690,n-re a.am r.n- stsp (C) 1545 (R),"Kreutzer, Veit","Kreutzer, Veit",Wittenberg,1545-01-01,Ioannis de Sacro Busto libellus de sphaera,"['Sacrobosco, Johannes de', 'Sacrobosco, Johannes de', 'Melanchthon, Philipp']"
180,Chain,1894,n-re a.es r.i- stsp (C) 1549 (R),"Kreutzer, Veit","Kreutzer, Veit",Wittenberg,1549-01-01,Ioannis de Sacrobusto libellus de sphæra,"['Sacrobosco, Johannes de', 'Sacrobosco, Johannes de', 'Melanchthon, Philipp']"
181,Chain,1895,n-re a.a- r.e- stsp (C) 1550 (R),"Krafft the Elder, Johann","Krafft the Elder, Johann",Wittenberg,1550-01-01,Ioannis de Sacrobusto libellus de sphaera,"['Sacrobosco, Johannes de', 'Sacrobosco, Johannes de', 'Melanchthon, Philipp']"
182,Chain,1900,n-re a.ua r.ro stra (C) 1553 (R),"Krafft the Elder, Johann","Krafft the Elder, Johann",Wittenberg,1553-01-01,Ioannis de Sacro Busto Libellus de Sphaera,"['Sacrobosco, Johannes de', 'Sacrobosco, Johannes de', 'Melanchthon, Philipp']"
183,Chain,1891,"n-e, a.ua r.i- umra (C) 1558 (R)","Krafft the Elder, Johann","Krafft the Elder, Johann",Wittenberg,1558-01-01,Iohannis de Sacro Busto Libellus de sphaera,"['Sacrobosco, Johannes de', 'Sacrobosco, Johannes de', 'Melanchthon, Philipp']"
184,Chain,1903,"n-e, a.s, r.mi umra (C) 1561 (R)","Krafft the Elder, Johann","Krafft the Elder, Johann",Wittenberg,1561-01-01,Iohannis de Sacro Busto Libellvs de sphaera,"['Sacrobosco, Johannes de', 'Sacrobosco, Johannes de', 'Melanchthon, Philipp']"
185,Chain,1904,"n-e, a.a- r.mi umra (C) 1563 (R)","Krafft the Elder, Johann","Krafft the Elder, Johann",Wittenberg,1563-01-01,Iohannis de Sacro Busto libellus de sphæra,"['Sacrobosco, Johannes de', 'Sacrobosco, Johannes de', 'Melanchthon, Philipp']"
186,Chain,1896,n-re a.a- r.i- umra (C) 1568 (R),"Krafft the Elder, Johann","Krafft the Elder, Johann",Wittenberg,1568-01-01,Iohannis de Sacro Busto Libellus de sphaera,"['Sacrobosco, Johannes de', 'Sacrobosco, Johannes de', 'Melanchthon, Philipp']"
187,Chain,1897,n-r* 𝜈.ί- umam 𝜎𝜒𝜏𝛼 (C) 1574 (R),Heirs of Peter I. Seitz,Heirs of Peter I. Seitz,Wittenberg,1574-01-01,Ioannis de Sacro Bvsto Libellvs de sphæra,"['Sacrobosco, Johannes de', 'Sacrobosco, Johannes de', 'Melanchthon, Philipp']"
188,Chain,1898,"n-e, a.a- r.a, stra (C) 1578 (R)",Heirs of Peter I. Seitz,Heirs of Peter I. Seitz,Wittenberg,1578-01-01,Iohannis de Sacro Busto libellus de sphaera,"['Sacrobosco, Johannes de', 'Sacrobosco, Johannes de', 'Melanchthon, Philipp']"
189,Chain,1753,"iti* a.s, r.u- stsp (C) 1601 (A)","Krafft, Johann",Zacharias Schürer & partners,Wittenberg,1601-01-01,Libellus de Sphaera Iohannis de Sacro Busto,"['Sacrobosco, Johannes de', 'Sacrobosco, Johannes de', 'Melanchthon, Philipp']"
190,Chain,1899,"itit a.s, r.u- stsp (C) 1629 (R)",Widow & heirs of Zacharias I. Schürer,Widow & heirs of Zacharias I. Schürer,Wittenberg,1629-01-01,Libellus de Sphaera Johannis de Sacro Busto,"['Sacrobosco, Johannes de', 'Sacrobosco, Johannes de', 'Melanchthon, Philipp']"
191,,,,,,,,,
192,Source,2240,,"Loe, Jan vander","Loe, Jan vander",Antwerp,1548-01-01,Cosmographica in astronomiam et geographiam isagoge,"Dodoens, Rembert"
193,Target,1729,,Heirs of Melchiorre Sessa I.,Heirs of Melchiorre Sessa I.,Venice,1572-01-01,Sphaera Ioannis de Sacrobusto,"Sacrobosco, Johannes de"
194,Chain,2240,s.rò I.s. s.a- rato (C) 1548 (R),"Loe, Jan vander","Loe, Jan vander",Antwerp,1548-01-01,Cosmographica in astronomiam et geographiam isagoge,"Dodoens, Rembert"
195,Chain,1729,s.is r.n- s.a- plap (C) 1572 (R),Heirs of Melchiorre Sessa I.,Heirs of Melchiorre Sessa I.,Venice,1572-01-01,Sphaera Ioannis de Sacrobusto,"Sacrobosco, Johannes de"
196,,,,,,,,,
197,Source,2070,,"Bascarini, Niccolò","Bascarini, Niccolò",Venice,1548-01-01,De la sfera del mondo,"Piccolòmini, Alessandro"
198,Target,1718,,"Bevilacqua, Niccolò","Bevilacqua, Niccolò",Venice,1561-01-01,Della Sfera Del Mondo,"Piccolòmini, Alessandro"
199,Chain,2070,o-fa i.o. o.m- Fiad (3) 1548 (R),"Bascarini, Niccolò","Bascarini, Niccolò",Venice,1548-01-01,De la sfera del mondo,"Piccolòmini, Alessandro"
200,Chain,1718,"elt- i.o. o.o, DEFI (3) 1561 (R)","Bevilacqua, Niccolò","Bevilacqua, Niccolò",Venice,1561-01-01,Della Sfera Del Mondo,"Piccolòmini, Alessandro"
201,,,,,,,,,
202,Source,1779,,"Braubach, Peter","Braubach, Peter",Frankfurt (Main),1549-01-01,"Quaestiones novae, in libellum de Sphaera Iohannis de Sacro Busto","['Sacrobosco, Johannes de', 'Sacrobosco, Johannes de', 'Beyer, Hartmann']"
203,Target,1594,,Heirs of Peter I. Seitz,Heirs of Peter I. Seitz,Wittenberg,1550-01-01,Quaestiones novae in libellum de sphaera Johannis de Sacro Bosco,"['Sacrobosco, Johannes de', 'Sacrobosco, Johannes de', 'Beyer, Hartmann']"
204,Chain,1779,1.gi ume& inte **es (3) 1549 (A),"Braubach, Peter","Braubach, Peter",Frankfurt (Main),1549-01-01,"Quaestiones novae, in libellum de Sphaera Iohannis de Sacro Busto","['Sacrobosco, Johannes de', 'Sacrobosco, Johannes de', 'Beyer, Hartmann']"
205,Chain,1594,dii- umy- inte prdu (3) 1550 (A),Heirs of Peter I. Seitz,Heirs of Peter I. Seitz,Wittenberg,1550-01-01,Quaestiones novae in libellum de sphaera Johannis de Sacro Bosco,"['Sacrobosco, Johannes de', 'Sacrobosco, Johannes de', 'Beyer, Hartmann']"
206,,,,,,,,,
207,Source,1780,,"Cavellat, Guillaume","Cavellat, Guillaume",Paris,1551-01-01,Qvaestiones Novae In Libellum De Sphaera Ioannis de Sacro Bosco,"['Sacrobosco, Johannes de', 'Sacrobosco, Johannes de', 'Beyer, Hartmann']"
208,Target,2235,,"Plantin, Christophe","Plantin, Christophe",Antwerp,1568-01-01,"De sphaera, et primis astronomiae rudimentis","Valerius, Cornelius"
209,Chain,1780,usa- a-u- a.a? Ingi (3) 1551 (A),"Cavellat, Guillaume","Cavellat, Guillaume",Paris,1551-01-01,Qvaestiones Novae In Libellum De Sphaera Ioannis de Sacro Bosco,"['Sacrobosco, Johannes de', 'Sacrobosco, Johannes de', 'Beyer, Hartmann']"
210,Chain,2235,usa- adi- s:li so24 (3) 1568 (R),"Plantin, Christophe","Plantin, Christophe",Antwerp,1568-01-01,"De sphaera, et primis astronomiae rudimentis","Valerius, Cornelius"
211,,,,,,,,,
212,Source,2077,,"Alvares, António","Alvares, António",Seville,1551-01-01,Breve compendio de la sphera y de la arte de navegar,Martin Cortés
213,Target,2280,,"Alvares, António","Alvares, António",Seville,1556-01-01,Breve compendio de la sphera y de la arte de navegar,Martin Cortés
214,Chain,2077,oss: a.x. ioey guAn (3) 1551 (A),"Alvares, António","Alvares, António",Seville,1551-01-01,Breve compendio de la sphera y de la arte de navegar,Martin Cortés
215,Chain,2280,oss: x.aq ioey geAn (3) 1556 (A),"Alvares, António","Alvares, António",Seville,1556-01-01,Breve compendio de la sphera y de la arte de navegar,Martin Cortés
216,,,,,,,,,
217,Source,1782,,"Cavellat, Guillaume","Cavellat, Guillaume",Paris,1552-01-01,Quaestiones novae in libellum de sphaera Ioannis de Sacro Bosco,"['Sacrobosco, Johannes de', 'Sacrobosco, Johannes de', 'Beyer, Hartmann']"
218,Target,2235,,"Plantin, Christophe","Plantin, Christophe",Antwerp,1568-01-01,"De sphaera, et primis astronomiae rudimentis","Valerius, Cornelius"
219,Chain,1782,usa- a-u- a.a? Ingi (3) 1552 (A),"Cavellat, Guillaume","Cavellat, Guillaume",Paris,1552-01-01,Quaestiones novae in libellum de sphaera Ioannis de Sacro Bosco,"['Sacrobosco, Johannes de', 'Sacrobosco, Johannes de', 'Beyer, Hartmann']"
220,Chain,2235,usa- adi- s:li so24 (3) 1568 (R),"Plantin, Christophe","Plantin, Christophe",Antwerp,1568-01-01,"De sphaera, et primis astronomiae rudimentis","Valerius, Cornelius"
221,,,,,,,,,
222,Source,1708,,"Cavellat, Guillaume","Cavellat, Guillaume",Paris,1556-01-01,Sphaera Ioannis de Sacro Bosco,"['Sacrobosco, Johannes de', 'Vinet, Élie', 'Nunes, Pedro', 'Valeriano, Pierio', 'Sacrobosco, Johannes de', 'Vinet, Élie', 'Vinet, Élie', 'Nunes, Pedro', 'Valeriano, Pierio', 'Sacrobosco, Johannes de', 'Vinet, Élie', 'Vinet, Élie', 'Nunes, Pedro', 'Valeriano, Pierio', 'Sacrobosco, Johannes de', 'Vinet, Élie', 'Vinet, Élie', 'Nunes, Pedro', 'Valeriano, Pierio', 'Sacrobosco, Johannes de', 'Vinet, Élie', 'Vinet, Élie', 'Nunes, Pedro', 'Valeriano, Pierio']"
223,Target,1964,,"Cavellat, Guillaume","Cavellat, Guillaume",Paris,1558-01-01,Sphaera Ioannis de Sacro Bosco,"['Sacrobosco, Johannes de', 'Vinet, Élie', 'Nunes, Pedro', 'Valeriano, Pierio', 'Sacrobosco, Johannes de', 'Vinet, Élie', 'Vinet, Élie', 'Nunes, Pedro', 'Valeriano, Pierio', 'Sacrobosco, Johannes de', 'Vinet, Élie', 'Vinet, Élie', 'Nunes, Pedro', 'Valeriano, Pierio', 'Sacrobosco, Johannes de', 'Vinet, Élie', 'Vinet, Élie', 'Nunes, Pedro', 'Valeriano, Pierio', 'Sacrobosco, Johannes de', 'Vinet, Élie', 'Vinet, Élie', 'Nunes, Pedro', 'Valeriano, Pierio']"
224,Chain,1708,a-u- ero- m.c- mafo (3) 1556 (A),"Cavellat, Guillaume","Cavellat, Guillaume",Paris,1556-01-01,Sphaera Ioannis de Sacro Bosco,"['Sacrobosco, Johannes de', 'Vinet, Élie', 'Nunes, Pedro', 'Valeriano, Pierio', 'Sacrobosco, Johannes de', 'Vinet, Élie', 'Vinet, Élie', 'Nunes, Pedro', 'Valeriano, Pierio', 'Sacrobosco, Johannes de', 'Vinet, Élie', 'Vinet, Élie', 'Nunes, Pedro', 'Valeriano, Pierio', 'Sacrobosco, Johannes de', 'Vinet, Élie', 'Vinet, Élie', 'Nunes, Pedro', 'Valeriano, Pierio', 'Sacrobosco, Johannes de', 'Vinet, Élie', 'Vinet, Élie', 'Nunes, Pedro', 'Valeriano, Pierio']"
225,Chain,1964,ita. ero- m.c- igfo (3) 1558 (A),"Cavellat, Guillaume","Cavellat, Guillaume",Paris,1558-01-01,Sphaera Ioannis de Sacro Bosco,"['Sacrobosco, Johannes de', 'Vinet, Élie', 'Nunes, Pedro', 'Valeriano, Pierio', 'Sacrobosco, Johannes de', 'Vinet, Élie', 'Vinet, Élie', 'Nunes, Pedro', 'Valeriano, Pierio', 'Sacrobosco, Johannes de', 'Vinet, Élie', 'Vinet, Élie', 'Nunes, Pedro', 'Valeriano, Pierio', 'Sacrobosco, Johannes de', 'Vinet, Élie', 'Vinet, Élie', 'Nunes, Pedro', 'Valeriano, Pierio', 'Sacrobosco, Johannes de', 'Vinet, Élie', 'Vinet, Élie', 'Nunes, Pedro', 'Valeriano, Pierio']"
226,,,,,,,,,
227,Source,1711,,"Cavellat, Guillaume","Cavellat, Guillaume",Paris,1557-01-01,Sphaera Ioannis de Sacro Bosco,"['Sacrobosco, Johannes de', 'Vinet, Élie', 'Nunes, Pedro', 'Valeriano, Pierio', 'Sacrobosco, Johannes de', 'Vinet, Élie', 'Vinet, Élie', 'Nunes, Pedro', 'Valeriano, Pierio', 'Sacrobosco, Johannes de', 'Vinet, Élie', 'Vinet, Élie', 'Nunes, Pedro', 'Valeriano, Pierio', 'Sacrobosco, Johannes de', 'Vinet, Élie', 'Vinet, Élie', 'Nunes, Pedro', 'Valeriano, Pierio', 'Sacrobosco, Johannes de', 'Vinet, Élie', 'Vinet, Élie', 'Nunes, Pedro', 'Valeriano, Pierio']"
228,Target,1964,,"Cavellat, Guillaume","Cavellat, Guillaume",Paris,1558-01-01,Sphaera Ioannis de Sacro Bosco,"['Sacrobosco, Johannes de', 'Vinet, Élie', 'Nunes, Pedro', 'Valeriano, Pierio', 'Sacrobosco, Johannes de', 'Vinet, Élie', 'Vinet, Élie', 'Nunes, Pedro', 'Valeriano, Pierio', 'Sacrobosco, Johannes de', 'Vinet, Élie', 'Vinet, Élie', 'Nunes, Pedro', 'Valeriano, Pierio', 'Sacrobosco, Johannes de', 'Vinet, Élie', 'Vinet, Élie', 'Nunes, Pedro', 'Valeriano, Pierio', 'Sacrobosco, Johannes de', 'Vinet, Élie', 'Vinet, Élie', 'Nunes, Pedro', 'Valeriano, Pierio']"
229,Chain,1711,a-u- ++++ m.c- mafo (3) 1557 (A),"Cavellat, Guillaume","Cavellat, Guillaume",Paris,1557-01-01,Sphaera Ioannis de Sacro Bosco,"['Sacrobosco, Johannes de', 'Vinet, Élie', 'Nunes, Pedro', 'Valeriano, Pierio', 'Sacrobosco, Johannes de', 'Vinet, Élie', 'Vinet, Élie', 'Nunes, Pedro', 'Valeriano, Pierio', 'Sacrobosco, Johannes de', 'Vinet, Élie', 'Vinet, Élie', 'Nunes, Pedro', 'Valeriano, Pierio', 'Sacrobosco, Johannes de', 'Vinet, Élie', 'Vinet, Élie', 'Nunes, Pedro', 'Valeriano, Pierio', 'Sacrobosco, Johannes de', 'Vinet, Élie', 'Vinet, Élie', 'Nunes, Pedro', 'Valeriano, Pierio']"
230,Chain,1964,ita. ero- m.c- igfo (3) 1558 (A),"Cavellat, Guillaume","Cavellat, Guillaume",Paris,1558-01-01,Sphaera Ioannis de Sacro Bosco,"['Sacrobosco, Johannes de', 'Vinet, Élie', 'Nunes, Pedro', 'Valeriano, Pierio', 'Sacrobosco, Johannes de', 'Vinet, Élie', 'Vinet, Élie', 'Nunes, Pedro', 'Valeriano, Pierio', 'Sacrobosco, Johannes de', 'Vinet, Élie', 'Vinet, Élie', 'Nunes, Pedro', 'Valeriano, Pierio', 'Sacrobosco, Johannes de', 'Vinet, Élie', 'Vinet, Élie', 'Nunes, Pedro', 'Valeriano, Pierio', 'Sacrobosco, Johannes de', 'Vinet, Élie', 'Vinet, Élie', 'Nunes, Pedro', 'Valeriano, Pierio']"
231,,,,,,,,,
232,Source,2168,,"Krafft the Elder, Johann","Krafft the Elder, Johann",Wittenberg,1558-01-01,"Elementa doctrinae de circulis coelestibus, et primo motu","Peucer, Kaspar"
233,Target,1778,,"Percacino, Grazioso","Percacino, Grazioso",Venice,1598-01-01,Cosmographia in quatuor libros distributa,"Barozzi, Francesco"
234,Target,1777,,"Percacino, Grazioso","Percacino, Grazioso",Venice,1585-01-01,Cosmographia in quatuor libros distributa,"Barozzi, Francesco"
235,Target,2173,,"Lehmann, Zacharias","Seelfisch, Samuel",Wittenberg,1601-01-01,"Elementa doctrinae de circulis coelestibus, et primo motu","Peucer, Kaspar"
236,Chain,2168,"s,in um,& s.n. rusu (C) 1558 (R)","Krafft the Elder, Johann","Krafft the Elder, Johann",Wittenberg,1558-01-01,"Elementa doctrinae de circulis coelestibus, et primo motu","Peucer, Kaspar"
237,Chain,2166,"s,si um,& s.n. rusu (C) 1563 (A)","Lufft, Hans","Lufft, Hans",Wittenberg,1563-01-01,"Elementa doctrinae de circulis coelestibus, & primo motu","Peucer, Kaspar"
238,Chain,2167,"s,in um,& s.0. Vida (3) 1569 (R)","Krafft the Elder, Johann","Krafft the Elder, Johann",Wittenberg,1569-01-01,"Elementa doctrinae de circulis coelestibus, et primo motu","Peucer, Kaspar"
239,Chain,2169,"s,in um,& s.n. rusu (3) 1576 (R)","Krafft the Elder, Johann","Krafft the Elder, Johann",Wittenberg,1576-01-01,"Elementa doctrinae de circulis coelestibus, et primo motu","Peucer, Kaspar"
240,Chain,1777,"a-e, um,& i.t. trSe (3) 1585 (R)","Percacino, Grazioso","Percacino, Grazioso",Venice,1585-01-01,Cosmographia in quatuor libros distributa,"Barozzi, Francesco"
241,Chain,2171,"s,is a-de s.0. Vida (3) 1587 (R)","Gronenberg, Simon","Gronenberg, Simon",Wittenberg,1587-01-01,"Elementa doctrinae de circulis coelestibus, et primo motu","Peucer, Kaspar"
242,Chain,1778,"ear- um,& itrò Cusc (3) 1598 (A)","Percacino, Grazioso","Percacino, Grazioso",Venice,1598-01-01,Cosmographia in quatuor libros distributa,"Barozzi, Francesco"
243,Chain,2173,"e-E- iot, s.0. Vive (3) 1601 (A)","Lehmann, Zacharias","Seelfisch, Samuel",Wittenberg,1601-01-01,"Elementa doctrinae de circulis coelestibus, et primo motu","Peucer, Kaspar"
244,,,,,,,,,
245,Source,1955,,"Cavellat, Guillaume","Cavellat, Guillaume",Paris,1561-01-01,Sphaera Ioannis de Sacro Bosco,"['Sacrobosco, Johannes de', 'Vinet, Élie', 'Nunes, Pedro', 'Valeriano, Pierio', 'Sacrobosco, Johannes de', 'Vinet, Élie', 'Vinet, Élie', 'Nunes, Pedro', 'Valeriano, Pierio', 'Sacrobosco, Johannes de', 'Vinet, Élie', 'Vinet, Élie', 'Nunes, Pedro', 'Valeriano, Pierio', 'Sacrobosco, Johannes de', 'Vinet, Élie', 'Vinet, Élie', 'Nunes, Pedro', 'Valeriano, Pierio', 'Sacrobosco, Johannes de', 'Vinet, Élie', 'Vinet, Élie', 'Nunes, Pedro', 'Valeriano, Pierio']"
246,Target,1973,,"Cavellat, Guillaume","Cavellat, Guillaume",Paris,1564-01-01,Sphaera Ioannis de Sacro Bosco,"['Sacrobosco, Johannes de', 'Vinet, Élie', 'Nunes, Pedro', 'Valeriano, Pierio', 'Sacrobosco, Johannes de', 'Vinet, Élie', 'Vinet, Élie', 'Nunes, Pedro', 'Valeriano, Pierio', 'Sacrobosco, Johannes de', 'Vinet, Élie', 'Vinet, Élie', 'Nunes, Pedro', 'Valeriano, Pierio', 'Sacrobosco, Johannes de', 'Vinet, Élie', 'Vinet, Élie', 'Nunes, Pedro', 'Valeriano, Pierio', 'Sacrobosco, Johannes de', 'Vinet, Élie', 'Vinet, Élie', 'Nunes, Pedro', 'Valeriano, Pierio']"
247,Target,1969,,"Cavellat, Guillaume","Cavellat, Guillaume",Paris,1562-01-01,Sphaera Ioannis de Sacro Bosco,"['Sacrobosco, Johannes de', 'Vinet, Élie', 'Nunes, Pedro', 'Valeriano, Pierio', 'Sacrobosco, Johannes de', 'Vinet, Élie', 'Vinet, Élie', 'Nunes, Pedro', 'Valeriano, Pierio', 'Sacrobosco, Johannes de', 'Vinet, Élie', 'Vinet, Élie', 'Nunes, Pedro', 'Valeriano, Pierio', 'Sacrobosco, Johannes de', 'Vinet, Élie', 'Vinet, Élie', 'Nunes, Pedro', 'Valeriano, Pierio', 'Sacrobosco, Johannes de', 'Vinet, Élie', 'Vinet, Élie', 'Nunes, Pedro', 'Valeriano, Pierio']"
248,Chain,1955,"ita. t,rè m.c- niet (3) 1561 (A)","Cavellat, Guillaume","Cavellat, Guillaume",Paris,1561-01-01,Sphaera Ioannis de Sacro Bosco,"['Sacrobosco, Johannes de', 'Vinet, Élie', 'Nunes, Pedro', 'Valeriano, Pierio', 'Sacrobosco, Johannes de', 'Vinet, Élie', 'Vinet, Élie', 'Nunes, Pedro', 'Valeriano, Pierio', 'Sacrobosco, Johannes de', 'Vinet, Élie', 'Vinet, Élie', 'Nunes, Pedro', 'Valeriano, Pierio', 'Sacrobosco, Johannes de', 'Vinet, Élie', 'Vinet, Élie', 'Nunes, Pedro', 'Valeriano, Pierio', 'Sacrobosco, Johannes de', 'Vinet, Élie', 'Vinet, Élie', 'Nunes, Pedro', 'Valeriano, Pierio']"
249,Chain,1969,ita. t:rè m.c- niti (3) 1562 (A),"Cavellat, Guillaume","Cavellat, Guillaume",Paris,1562-01-01,Sphaera Ioannis de Sacro Bosco,"['Sacrobosco, Johannes de', 'Vinet, Élie', 'Nunes, Pedro', 'Valeriano, Pierio', 'Sacrobosco, Johannes de', 'Vinet, Élie', 'Vinet, Élie', 'Nunes, Pedro', 'Valeriano, Pierio', 'Sacrobosco, Johannes de', 'Vinet, Élie', 'Vinet, Élie', 'Nunes, Pedro', 'Valeriano, Pierio', 'Sacrobosco, Johannes de', 'Vinet, Élie', 'Vinet, Élie', 'Nunes, Pedro', 'Valeriano, Pierio', 'Sacrobosco, Johannes de', 'Vinet, Élie', 'Vinet, Élie', 'Nunes, Pedro', 'Valeriano, Pierio']"
250,Chain,1973,ita. t:rè m.c- niti (3) 1564 (A),"Cavellat, Guillaume","Cavellat, Guillaume",Paris,1564-01-01,Sphaera Ioannis de Sacro Bosco,"['Sacrobosco, Johannes de', 'Vinet, Élie', 'Nunes, Pedro', 'Valeriano, Pierio', 'Sacrobosco, Johannes de', 'Vinet, Élie', 'Vinet, Élie', 'Nunes, Pedro', 'Valeriano, Pierio', 'Sacrobosco, Johannes de', 'Vinet, Élie', 'Vinet, Élie', 'Nunes, Pedro', 'Valeriano, Pierio', 'Sacrobosco, Johannes de', 'Vinet, Élie', 'Vinet, Élie', 'Nunes, Pedro', 'Valeriano, Pierio', 'Sacrobosco, Johannes de', 'Vinet, Élie', 'Vinet, Élie', 'Nunes, Pedro', 'Valeriano, Pierio']"
251,,,,,,,,,
252,Source,1727,,"Ghemart, Adrián","Ghemart, Adrián",Valladolid,1567-01-01,La sphera de Iuã de Sacro Bosco,"['Sacrobosco, Johannes de', 'Sáenz de Santayana y Espinosa, Rodrigo', 'Sacrobosco, Johannes de', 'Sáenz de Santayana y Espinosa, Rodrigo', 'Sáenz de Santayana y Espinosa, Rodrigo', 'Sacrobosco, Johannes de', 'Sáenz de Santayana y Espinosa, Rodrigo', 'Sáenz de Santayana y Espinosa, Rodrigo']"
253,Target,2197,,"Ghemart, Adrián","Corcuera, Pedro de",Valladolid,1568-01-01,La Sphera de Iuan de Sacrobosco,"['Sacrobosco, Johannes de', 'Sáenz de Santayana y Espinosa, Rodrigo', 'Sacrobosco, Johannes de', 'Sáenz de Santayana y Espinosa, Rodrigo', 'Sáenz de Santayana y Espinosa, Rodrigo', 'Sacrobosco, Johannes de', 'Sáenz de Santayana y Espinosa, Rodrigo', 'Sáenz de Santayana y Espinosa, Rodrigo']"
254,Chain,1727,o.d. noia TOos brno (3) 1567 (R),"Ghemart, Adrián","Ghemart, Adrián",Valladolid,1567-01-01,La sphera de Iuã de Sacro Bosco,"['Sacrobosco, Johannes de', 'Sáenz de Santayana y Espinosa, Rodrigo', 'Sacrobosco, Johannes de', 'Sáenz de Santayana y Espinosa, Rodrigo', 'Sáenz de Santayana y Espinosa, Rodrigo', 'Sacrobosco, Johannes de', 'Sáenz de Santayana y Espinosa, Rodrigo', 'Sáenz de Santayana y Espinosa, Rodrigo']"
255,Chain,2197,o.ad noia TOos brno (3) 1568 (R),"Ghemart, Adrián","Corcuera, Pedro de",Valladolid,1568-01-01,La Sphera de Iuan de Sacrobosco,"['Sacrobosco, Johannes de', 'Sáenz de Santayana y Espinosa, Rodrigo', 'Sacrobosco, Johannes de', 'Sáenz de Santayana y Espinosa, Rodrigo', 'Sáenz de Santayana y Espinosa, Rodrigo', 'Sacrobosco, Johannes de', 'Sáenz de Santayana y Espinosa, Rodrigo', 'Sáenz de Santayana y Espinosa, Rodrigo']"
256,,,,,,,,,
257,Source,1974,,"Cavellat, Guillaume","Cavellat, Guillaume",Paris,1569-01-01,Sphæra Ioannis de Sacro Bosco,"['Sacrobosco, Johannes de', 'Nunes, Pedro', 'Valeriano, Pierio', 'Sacrobosco, Johannes de', 'Vinet, Élie', 'Nunes, Pedro', 'Valeriano, Pierio', 'Sacrobosco, Johannes de', 'Vinet, Élie', 'Nunes, Pedro', 'Valeriano, Pierio', 'Sacrobosco, Johannes de', 'Vinet, Élie', 'Nunes, Pedro', 'Valeriano, Pierio', 'Sacrobosco, Johannes de', 'Vinet, Élie', 'Nunes, Pedro', 'Valeriano, Pierio', 'Sacrobosco, Johannes de', 'Vinet, Élie', 'Nunes, Pedro', 'Valeriano, Pierio', 'Sacrobosco, Johannes de', 'Vinet, Élie', 'Nunes, Pedro', 'Valeriano, Pierio', 'Sacrobosco, Johannes de', 'Vinet, Élie', 'Nunes, Pedro', 'Valeriano, Pierio', 'Sacrobosco, Johannes de', 'Vinet, Élie', 'Nunes, Pedro', 'Valeriano, Pierio', 'Sacrobosco, Johannes de', 'Vinet, Élie', 'Nunes, Pedro', 'Valeriano, Pierio', 'Sacrobosco, Johannes de', 'Vinet, Élie', 'Nunes, Pedro', 'Valeriano, Pierio', 'Sacrobosco, Johannes de', 'Vinet, Élie', 'Nunes, Pedro', 'Valeriano, Pierio', 'Sacrobosco, Johannes de', 'Vinet, Élie', 'Nunes, Pedro', 'Valeriano, Pierio', 'Sacrobosco, Johannes de', 'Vinet, Élie', 'Nunes, Pedro', 'Valeriano, Pierio', 'Sacrobosco, Johannes de', 'Vinet, Élie', 'Nunes, Pedro', 'Valeriano, Pierio', 'Sacrobosco, Johannes de', 'Vinet, Élie', 'Nunes, Pedro', 'Valeriano, Pierio']"
258,Target,1970,,Widow of Guillaume Cavellat (Denise de Marnef),Widow of Guillaume Cavellat (Denise de Marnef),Paris,1577-01-01,Sphaera Ioannis de Sacrobosco,"['Sacrobosco, Johannes de', 'Vinet, Élie', 'Nunes, Pedro', 'Valeriano, Pierio', 'Sacrobosco, Johannes de', 'Vinet, Élie', 'Vinet, Élie', 'Nunes, Pedro', 'Valeriano, Pierio', 'Sacrobosco, Johannes de', 'Vinet, Élie', 'Vinet, Élie', 'Nunes, Pedro', 'Valeriano, Pierio', 'Sacrobosco, Johannes de', 'Vinet, Élie', 'Vinet, Élie', 'Nunes, Pedro', 'Valeriano, Pierio', 'Sacrobosco, Johannes de', 'Vinet, Élie', 'Vinet, Élie', 'Nunes, Pedro', 'Valeriano, Pierio', 'Sacrobosco, Johannes de', 'Vinet, Élie', 'Vinet, Élie', 'Nunes, Pedro', 'Valeriano, Pierio', 'Sacrobosco, Johannes de', 'Vinet, Élie', 'Vinet, Élie', 'Nunes, Pedro', 'Valeriano, Pierio', 'Sacrobosco, Johannes de', 'Vinet, Élie', 'Vinet, Élie', 'Nunes, Pedro', 'Valeriano, Pierio', 'Sacrobosco, Johannes de', 'Vinet, Élie', 'Vinet, Élie', 'Nunes, Pedro', 'Valeriano, Pierio', 'Sacrobosco, Johannes de', 'Vinet, Élie', 'Vinet, Élie', 'Nunes, Pedro', 'Valeriano, Pierio', 'Sacrobosco, Johannes de', 'Vinet, Élie', 'Vinet, Élie', 'Nunes, Pedro', 'Valeriano, Pierio', 'Sacrobosco, Johannes de', 'Vinet, Élie', 'Vinet, Élie', 'Nunes, Pedro', 'Valeriano, Pierio', 'Sacrobosco, Johannes de', 'Vinet, Élie', 'Vinet, Élie', 'Nunes, Pedro', 'Valeriano, Pierio', 'Sacrobosco, Johannes de', 'Vinet, Élie', 'Vinet, Élie', 'Nunes, Pedro', 'Valeriano, Pierio', 'Sacrobosco, Johannes de', 'Vinet, Élie', 'Vinet, Élie', 'Nunes, Pedro', 'Valeriano, Pierio', 'Sacrobosco, Johannes de', 'Vinet, Élie', 'Vinet, Élie', 'Nunes, Pedro', 'Valeriano, Pierio', 'Sacrobosco, Johannes de', 'Vinet, Élie', 'Vinet, Élie', 'Nunes, Pedro', 'Valeriano, Pierio', 'Sacrobosco, Johannes de', 'Vinet, Élie', 'Vinet, Élie', 'Nunes, Pedro', 'Valeriano, Pierio', 'Sacrobosco, Johannes de', 'Vinet, Élie', 'Vinet, Élie', 'Nunes, Pedro', 'Valeriano, Pierio', 'Sacrobosco, Johannes de', 'Vinet, Élie', 'Vinet, Élie', 'Nunes, Pedro', 'Valeriano, Pierio']"
259,Chain,1974,"a:i, imte t.ui stma (3) 1569 (A)","Cavellat, Guillaume","Cavellat, Guillaume",Paris,1569-01-01,Sphæra Ioannis de Sacro Bosco,"['Sacrobosco, Johannes de', 'Nunes, Pedro', 'Valeriano, Pierio', 'Sacrobosco, Johannes de', 'Vinet, Élie', 'Nunes, Pedro', 'Valeriano, Pierio', 'Sacrobosco, Johannes de', 'Vinet, Élie', 'Nunes, Pedro', 'Valeriano, Pierio', 'Sacrobosco, Johannes de', 'Vinet, Élie', 'Nunes, Pedro', 'Valeriano, Pierio', 'Sacrobosco, Johannes de', 'Vinet, Élie', 'Nunes, Pedro', 'Valeriano, Pierio', 'Sacrobosco, Johannes de', 'Vinet, Élie', 'Nunes, Pedro', 'Valeriano, Pierio', 'Sacrobosco, Johannes de', 'Vinet, Élie', 'Nunes, Pedro', 'Valeriano, Pierio', 'Sacrobosco, Johannes de', 'Vinet, Élie', 'Nunes, Pedro', 'Valeriano, Pierio', 'Sacrobosco, Johannes de', 'Vinet, Élie', 'Nunes, Pedro', 'Valeriano, Pierio', 'Sacrobosco, Johannes de', 'Vinet, Élie', 'Nunes, Pedro', 'Valeriano, Pierio', 'Sacrobosco, Johannes de', 'Vinet, Élie', 'Nunes, Pedro', 'Valeriano, Pierio', 'Sacrobosco, Johannes de', 'Vinet, Élie', 'Nunes, Pedro', 'Valeriano, Pierio', 'Sacrobosco, Johannes de', 'Vinet, Élie', 'Nunes, Pedro', 'Valeriano, Pierio', 'Sacrobosco, Johannes de', 'Vinet, Élie', 'Nunes, Pedro', 'Valeriano, Pierio', 'Sacrobosco, Johannes de', 'Vinet, Élie', 'Nunes, Pedro', 'Valeriano, Pierio', 'Sacrobosco, Johannes de', 'Vinet, Élie', 'Nunes, Pedro', 'Valeriano, Pierio']"
260,Chain,1970,"a:i, imte t.t, stma (3) 1577 (A)",Widow of Guillaume Cavellat (Denise de Marnef),Widow of Guillaume Cavellat (Denise de Marnef),Paris,1577-01-01,Sphaera Ioannis de Sacrobosco,"['Sacrobosco, Johannes de', 'Vinet, Élie', 'Nunes, Pedro', 'Valeriano, Pierio', 'Sacrobosco, Johannes de', 'Vinet, Élie', 'Vinet, Élie', 'Nunes, Pedro', 'Valeriano, Pierio', 'Sacrobosco, Johannes de', 'Vinet, Élie', 'Vinet, Élie', 'Nunes, Pedro', 'Valeriano, Pierio', 'Sacrobosco, Johannes de', 'Vinet, Élie', 'Vinet, Élie', 'Nunes, Pedro', 'Valeriano, Pierio', 'Sacrobosco, Johannes de', 'Vinet, Élie', 'Vinet, Élie', 'Nunes, Pedro', 'Valeriano, Pierio', 'Sacrobosco, Johannes de', 'Vinet, Élie', 'Vinet, Élie', 'Nunes, Pedro', 'Valeriano, Pierio', 'Sacrobosco, Johannes de', 'Vinet, Élie', 'Vinet, Élie', 'Nunes, Pedro', 'Valeriano, Pierio', 'Sacrobosco, Johannes de', 'Vinet, Élie', 'Vinet, Élie', 'Nunes, Pedro', 'Valeriano, Pierio', 'Sacrobosco, Johannes de', 'Vinet, Élie', 'Vinet, Élie', 'Nunes, Pedro', 'Valeriano, Pierio', 'Sacrobosco, Johannes de', 'Vinet, Élie', 'Vinet, Élie', 'Nunes, Pedro', 'Valeriano, Pierio', 'Sacrobosco, Johannes de', 'Vinet, Élie', 'Vinet, Élie', 'Nunes, Pedro', 'Valeriano, Pierio', 'Sacrobosco, Johannes de', 'Vinet, Élie', 'Vinet, Élie', 'Nunes, Pedro', 'Valeriano, Pierio', 'Sacrobosco, Johannes de', 'Vinet, Élie', 'Vinet, Élie', 'Nunes, Pedro', 'Valeriano, Pierio', 'Sacrobosco, Johannes de', 'Vinet, Élie', 'Vinet, Élie', 'Nunes, Pedro', 'Valeriano, Pierio', 'Sacrobosco, Johannes de', 'Vinet, Élie', 'Vinet, Élie', 'Nunes, Pedro', 'Valeriano, Pierio', 'Sacrobosco, Johannes de', 'Vinet, Élie', 'Vinet, Élie', 'Nunes, Pedro', 'Valeriano, Pierio', 'Sacrobosco, Johannes de', 'Vinet, Élie', 'Vinet, Élie', 'Nunes, Pedro', 'Valeriano, Pierio', 'Sacrobosco, Johannes de', 'Vinet, Élie', 'Vinet, Élie', 'Nunes, Pedro', 'Valeriano, Pierio', 'Sacrobosco, Johannes de', 'Vinet, Élie', 'Vinet, Élie', 'Nunes, Pedro', 'Valeriano, Pierio', 'Sacrobosco, Johannes de', 'Vinet, Élie', 'Vinet, Élie', 'Nunes, Pedro', 'Valeriano, Pierio']"
261,,,,,,,,,
262,Source,1911,,"Cavellat, Guillaume","Cavellat, Guillaume",Paris,1572-01-01,Sphaera Ioannis de Sacro Bosco,"['Sacrobosco, Johannes de', 'Vinet, Élie', 'Nunes, Pedro', 'Valeriano, Pierio', 'Sacrobosco, Johannes de', 'Vinet, Élie', 'Vinet, Élie', 'Nunes, Pedro', 'Valeriano, Pierio', 'Sacrobosco, Johannes de', 'Vinet, Élie', 'Vinet, Élie', 'Nunes, Pedro', 'Valeriano, Pierio', 'Sacrobosco, Johannes de', 'Vinet, Élie', 'Vinet, Élie', 'Nunes, Pedro', 'Valeriano, Pierio', 'Sacrobosco, Johannes de', 'Vinet, Élie', 'Vinet, Élie', 'Nunes, Pedro', 'Valeriano, Pierio', 'Sacrobosco, Johannes de', 'Vinet, Élie', 'Vinet, Élie', 'Nunes, Pedro', 'Valeriano, Pierio', 'Sacrobosco, Johannes de', 'Vinet, Élie', 'Vinet, Élie', 'Nunes, Pedro', 'Valeriano, Pierio', 'Sacrobosco, Johannes de', 'Vinet, Élie', 'Vinet, Élie', 'Nunes, Pedro', 'Valeriano, Pierio', 'Sacrobosco, Johannes de', 'Vinet, Élie', 'Vinet, Élie', 'Nunes, Pedro', 'Valeriano, Pierio', 'Sacrobosco, Johannes de', 'Vinet, Élie', 'Vinet, Élie', 'Nunes, Pedro', 'Valeriano, Pierio', 'Sacrobosco, Johannes de', 'Vinet, Élie', 'Vinet, Élie', 'Nunes, Pedro', 'Valeriano, Pierio', 'Sacrobosco, Johannes de', 'Vinet, Élie', 'Vinet, Élie', 'Nunes, Pedro', 'Valeriano, Pierio', 'Sacrobosco, Johannes de', 'Vinet, Élie', 'Vinet, Élie', 'Nunes, Pedro', 'Valeriano, Pierio', 'Sacrobosco, Johannes de', 'Vinet, Élie', 'Vinet, Élie', 'Nunes, Pedro', 'Valeriano, Pierio', 'Sacrobosco, Johannes de', 'Vinet, Élie', 'Vinet, Élie', 'Nunes, Pedro', 'Valeriano, Pierio', 'Sacrobosco, Johannes de', 'Vinet, Élie', 'Vinet, Élie', 'Nunes, Pedro', 'Valeriano, Pierio', 'Sacrobosco, Johannes de', 'Vinet, Élie', 'Vinet, Élie', 'Nunes, Pedro', 'Valeriano, Pierio', 'Sacrobosco, Johannes de', 'Vinet, Élie', 'Vinet, Élie', 'Nunes, Pedro', 'Valeriano, Pierio', 'Sacrobosco, Johannes de', 'Vinet, Élie', 'Vinet, Élie', 'Nunes, Pedro', 'Valeriano, Pierio', 'Sacrobosco, Johannes de', 'Vinet, Élie', 'Vinet, Élie', 'Nunes, Pedro', 'Valeriano, Pierio']"
263,Target,1970,,Widow of Guillaume Cavellat (Denise de Marnef),Widow of Guillaume Cavellat (Denise de Marnef),Paris,1577-01-01,Sphaera Ioannis de Sacrobosco,"['Sacrobosco, Johannes de', 'Vinet, Élie', 'Nunes, Pedro', 'Valeriano, Pierio', 'Sacrobosco, Johannes de', 'Vinet, Élie', 'Vinet, Élie', 'Nunes, Pedro', 'Valeriano, Pierio', 'Sacrobosco, Johannes de', 'Vinet, Élie', 'Vinet, Élie', 'Nunes, Pedro', 'Valeriano, Pierio', 'Sacrobosco, Johannes de', 'Vinet, Élie', 'Vinet, Élie', 'Nunes, Pedro', 'Valeriano, Pierio', 'Sacrobosco, Johannes de', 'Vinet, Élie', 'Vinet, Élie', 'Nunes, Pedro', 'Valeriano, Pierio', 'Sacrobosco, Johannes de', 'Vinet, Élie', 'Vinet, Élie', 'Nunes, Pedro', 'Valeriano, Pierio', 'Sacrobosco, Johannes de', 'Vinet, Élie', 'Vinet, Élie', 'Nunes, Pedro', 'Valeriano, Pierio', 'Sacrobosco, Johannes de', 'Vinet, Élie', 'Vinet, Élie', 'Nunes, Pedro', 'Valeriano, Pierio', 'Sacrobosco, Johannes de', 'Vinet, Élie', 'Vinet, Élie', 'Nunes, Pedro', 'Valeriano, Pierio', 'Sacrobosco, Johannes de', 'Vinet, Élie', 'Vinet, Élie', 'Nunes, Pedro', 'Valeriano, Pierio', 'Sacrobosco, Johannes de', 'Vinet, Élie', 'Vinet, Élie', 'Nunes, Pedro', 'Valeriano, Pierio', 'Sacrobosco, Johannes de', 'Vinet, Élie', 'Vinet, Élie', 'Nunes, Pedro', 'Valeriano, Pierio', 'Sacrobosco, Johannes de', 'Vinet, Élie', 'Vinet, Élie', 'Nunes, Pedro', 'Valeriano, Pierio', 'Sacrobosco, Johannes de', 'Vinet, Élie', 'Vinet, Élie', 'Nunes, Pedro', 'Valeriano, Pierio', 'Sacrobosco, Johannes de', 'Vinet, Élie', 'Vinet, Élie', 'Nunes, Pedro', 'Valeriano, Pierio', 'Sacrobosco, Johannes de', 'Vinet, Élie', 'Vinet, Élie', 'Nunes, Pedro', 'Valeriano, Pierio', 'Sacrobosco, Johannes de', 'Vinet, Élie', 'Vinet, Élie', 'Nunes, Pedro', 'Valeriano, Pierio', 'Sacrobosco, Johannes de', 'Vinet, Élie', 'Vinet, Élie', 'Nunes, Pedro', 'Valeriano, Pierio', 'Sacrobosco, Johannes de', 'Vinet, Élie', 'Vinet, Élie', 'Nunes, Pedro', 'Valeriano, Pierio', 'Sacrobosco, Johannes de', 'Vinet, Élie', 'Vinet, Élie', 'Nunes, Pedro', 'Valeriano, Pierio']"
264,Chain,1911,"a:i, imte t.ui stma (3) 1572 (A)","Cavellat, Guillaume","Cavellat, Guillaume",Paris,1572-01-01,Sphaera Ioannis de Sacro Bosco,"['Sacrobosco, Johannes de', 'Vinet, Élie', 'Nunes, Pedro', 'Valeriano, Pierio', 'Sacrobosco, Johannes de', 'Vinet, Élie', 'Vinet, Élie', 'Nunes, Pedro', 'Valeriano, Pierio', 'Sacrobosco, Johannes de', 'Vinet, Élie', 'Vinet, Élie', 'Nunes, Pedro', 'Valeriano, Pierio', 'Sacrobosco, Johannes de', 'Vinet, Élie', 'Vinet, Élie', 'Nunes, Pedro', 'Valeriano, Pierio', 'Sacrobosco, Johannes de', 'Vinet, Élie', 'Vinet, Élie', 'Nunes, Pedro', 'Valeriano, Pierio', 'Sacrobosco, Johannes de', 'Vinet, Élie', 'Vinet, Élie', 'Nunes, Pedro', 'Valeriano, Pierio', 'Sacrobosco, Johannes de', 'Vinet, Élie', 'Vinet, Élie', 'Nunes, Pedro', 'Valeriano, Pierio', 'Sacrobosco, Johannes de', 'Vinet, Élie', 'Vinet, Élie', 'Nunes, Pedro', 'Valeriano, Pierio', 'Sacrobosco, Johannes de', 'Vinet, Élie', 'Vinet, Élie', 'Nunes, Pedro', 'Valeriano, Pierio', 'Sacrobosco, Johannes de', 'Vinet, Élie', 'Vinet, Élie', 'Nunes, Pedro', 'Valeriano, Pierio', 'Sacrobosco, Johannes de', 'Vinet, Élie', 'Vinet, Élie', 'Nunes, Pedro', 'Valeriano, Pierio', 'Sacrobosco, Johannes de', 'Vinet, Élie', 'Vinet, Élie', 'Nunes, Pedro', 'Valeriano, Pierio', 'Sacrobosco, Johannes de', 'Vinet, Élie', 'Vinet, Élie', 'Nunes, Pedro', 'Valeriano, Pierio', 'Sacrobosco, Johannes de', 'Vinet, Élie', 'Vinet, Élie', 'Nunes, Pedro', 'Valeriano, Pierio', 'Sacrobosco, Johannes de', 'Vinet, Élie', 'Vinet, Élie', 'Nunes, Pedro', 'Valeriano, Pierio', 'Sacrobosco, Johannes de', 'Vinet, Élie', 'Vinet, Élie', 'Nunes, Pedro', 'Valeriano, Pierio', 'Sacrobosco, Johannes de', 'Vinet, Élie', 'Vinet, Élie', 'Nunes, Pedro', 'Valeriano, Pierio', 'Sacrobosco, Johannes de', 'Vinet, Élie', 'Vinet, Élie', 'Nunes, Pedro', 'Valeriano, Pierio', 'Sacrobosco, Johannes de', 'Vinet, Élie', 'Vinet, Élie', 'Nunes, Pedro', 'Valeriano, Pierio', 'Sacrobosco, Johannes de', 'Vinet, Élie', 'Vinet, Élie', 'Nunes, Pedro', 'Valeriano, Pierio']"
265,Chain,1970,"a:i, imte t.t, stma (3) 1577 (A)",Widow of Guillaume Cavellat (Denise de Marnef),Widow of Guillaume Cavellat (Denise de Marnef),Paris,1577-01-01,Sphaera Ioannis de Sacrobosco,"['Sacrobosco, Johannes de', 'Vinet, Élie', 'Nunes, Pedro', 'Valeriano, Pierio', 'Sacrobosco, Johannes de', 'Vinet, Élie', 'Vinet, Élie', 'Nunes, Pedro', 'Valeriano, Pierio', 'Sacrobosco, Johannes de', 'Vinet, Élie', 'Vinet, Élie', 'Nunes, Pedro', 'Valeriano, Pierio', 'Sacrobosco, Johannes de', 'Vinet, Élie', 'Vinet, Élie', 'Nunes, Pedro', 'Valeriano, Pierio', 'Sacrobosco, Johannes de', 'Vinet, Élie', 'Vinet, Élie', 'Nunes, Pedro', 'Valeriano, Pierio', 'Sacrobosco, Johannes de', 'Vinet, Élie', 'Vinet, Élie', 'Nunes, Pedro', 'Valeriano, Pierio', 'Sacrobosco, Johannes de', 'Vinet, Élie', 'Vinet, Élie', 'Nunes, Pedro', 'Valeriano, Pierio', 'Sacrobosco, Johannes de', 'Vinet, Élie', 'Vinet, Élie', 'Nunes, Pedro', 'Valeriano, Pierio', 'Sacrobosco, Johannes de', 'Vinet, Élie', 'Vinet, Élie', 'Nunes, Pedro', 'Valeriano, Pierio', 'Sacrobosco, Johannes de', 'Vinet, Élie', 'Vinet, Élie', 'Nunes, Pedro', 'Valeriano, Pierio', 'Sacrobosco, Johannes de', 'Vinet, Élie', 'Vinet, Élie', 'Nunes, Pedro', 'Valeriano, Pierio', 'Sacrobosco, Johannes de', 'Vinet, Élie', 'Vinet, Élie', 'Nunes, Pedro', 'Valeriano, Pierio', 'Sacrobosco, Johannes de', 'Vinet, Élie', 'Vinet, Élie', 'Nunes, Pedro', 'Valeriano, Pierio', 'Sacrobosco, Johannes de', 'Vinet, Élie', 'Vinet, Élie', 'Nunes, Pedro', 'Valeriano, Pierio', 'Sacrobosco, Johannes de', 'Vinet, Élie', 'Vinet, Élie', 'Nunes, Pedro', 'Valeriano, Pierio', 'Sacrobosco, Johannes de', 'Vinet, Élie', 'Vinet, Élie', 'Nunes, Pedro', 'Valeriano, Pierio', 'Sacrobosco, Johannes de', 'Vinet, Élie', 'Vinet, Élie', 'Nunes, Pedro', 'Valeriano, Pierio', 'Sacrobosco, Johannes de', 'Vinet, Élie', 'Vinet, Élie', 'Nunes, Pedro', 'Valeriano, Pierio', 'Sacrobosco, Johannes de', 'Vinet, Élie', 'Vinet, Élie', 'Nunes, Pedro', 'Valeriano, Pierio', 'Sacrobosco, Johannes de', 'Vinet, Élie', 'Vinet, Élie', 'Nunes, Pedro', 'Valeriano, Pierio']"
266,,,,,,,,,
267,Source,1730,,"Rade, Gilles van den","Bellère, Jean",Antwerp,1573-01-01,Sphaera Ioannis de Sacro Bosco,"['Sacrobosco, Johannes de', 'Giuntini, Francesco', 'Sacrobosco, Johannes de', 'Vinet, Élie', 'Giuntini, Francesco', 'Sacrobosco, Johannes de', 'Vinet, Élie', 'Giuntini, Francesco']"
268,Target,1958,,"Bellère I., Pierre","Bellère I., Pierre",Antwerp,1582-01-01,Sphaera Ioannis de Sacro Bosco emendata,"['Sacrobosco, Johannes de', 'Hero, Albertus', 'Giuntini, Francesco', 'Sacrobosco, Johannes de', 'Vinet, Élie', 'Hero, Albertus', 'Giuntini, Francesco', 'Sacrobosco, Johannes de', 'Vinet, Élie', 'Hero, Albertus', 'Giuntini, Francesco', 'Sacrobosco, Johannes de', 'Vinet, Élie', 'Hero, Albertus', 'Giuntini, Francesco']"
269,Target,2281,,"Bellère, Jean","Bellère, Jean",Antwerp,1582-01-01,Sphaera Ioannis de Sacro Bosco emendata,"['Sacrobosco, Johannes de', 'Hero, Albertus', 'Giuntini, Francesco', 'Sacrobosco, Johannes de', 'Vinet, Élie', 'Hero, Albertus', 'Giuntini, Francesco', 'Sacrobosco, Johannes de', 'Vinet, Élie', 'Hero, Albertus', 'Giuntini, Francesco', 'Sacrobosco, Johannes de', 'Vinet, Élie', 'Hero, Albertus', 'Giuntini, Francesco']"
270,Chain,1730,"n-ni umut o,io cequ (7) 1573 (R)","Rade, Gilles van den","Bellère, Jean",Antwerp,1573-01-01,Sphaera Ioannis de Sacro Bosco,"['Sacrobosco, Johannes de', 'Giuntini, Francesco', 'Sacrobosco, Johannes de', 'Vinet, Élie', 'Giuntini, Francesco', 'Sacrobosco, Johannes de', 'Vinet, Élie', 'Giuntini, Francesco']"
271,Chain,2281,"niri umut ine, artr (3) 1582 (R)","Bellère, Jean","Bellère, Jean",Antwerp,1582-01-01,Sphaera Ioannis de Sacro Bosco emendata,"['Sacrobosco, Johannes de', 'Hero, Albertus', 'Giuntini, Francesco', 'Sacrobosco, Johannes de', 'Vinet, Élie', 'Hero, Albertus', 'Giuntini, Francesco', 'Sacrobosco, Johannes de', 'Vinet, Élie', 'Hero, Albertus', 'Giuntini, Francesco', 'Sacrobosco, Johannes de', 'Vinet, Élie', 'Hero, Albertus', 'Giuntini, Francesco']"
272,Chain,1958,"niri umut ine, artr (3) 1582 (R)","Bellère I., Pierre","Bellère I., Pierre",Antwerp,1582-01-01,Sphaera Ioannis de Sacro Bosco emendata,"['Sacrobosco, Johannes de', 'Hero, Albertus', 'Giuntini, Francesco', 'Sacrobosco, Johannes de', 'Vinet, Élie', 'Hero, Albertus', 'Giuntini, Francesco', 'Sacrobosco, Johannes de', 'Vinet, Élie', 'Hero, Albertus', 'Giuntini, Francesco', 'Sacrobosco, Johannes de', 'Vinet, Élie', 'Hero, Albertus', 'Giuntini, Francesco']"
273,,,,,,,,,
274,Source,1965,,Heirs of Girolamo Scotto,Heirs of Girolamo Scotto,Venice,1574-01-01,Sphaera Ioannis de Sacro Bosco,"['Sacrobosco, Johannes de', 'Nunes, Pedro', 'Valeriano, Pierio', 'Sacrobosco, Johannes de', 'Vinet, Élie', 'Nunes, Pedro', 'Valeriano, Pierio', 'Sacrobosco, Johannes de', 'Vinet, Élie', 'Nunes, Pedro', 'Valeriano, Pierio', 'Sacrobosco, Johannes de', 'Vinet, Élie', 'Nunes, Pedro', 'Valeriano, Pierio']"
275,Target,1972,,Heirs of Girolamo Scotto,Heirs of Girolamo Scotto,Venice,1620-01-01,Sphaera Ioannis de Sacro Bosco,"['Sacrobosco, Johannes de', 'Vinet, Élie', 'Nunes, Pedro', 'Valeriano, Pierio', 'Sacrobosco, Johannes de', 'Vinet, Élie', 'Vinet, Élie', 'Nunes, Pedro', 'Valeriano, Pierio', 'Sacrobosco, Johannes de', 'Vinet, Élie', 'Vinet, Élie', 'Nunes, Pedro', 'Valeriano, Pierio', 'Sacrobosco, Johannes de', 'Vinet, Élie', 'Vinet, Élie', 'Nunes, Pedro', 'Valeriano, Pierio', 'Sacrobosco, Johannes de', 'Vinet, Élie', 'Vinet, Élie', 'Nunes, Pedro', 'Valeriano, Pierio']"
276,Chain,1965,e-a. raa- umo- lial (3) 1574 (R),Heirs of Girolamo Scotto,Heirs of Girolamo Scotto,Venice,1574-01-01,Sphaera Ioannis de Sacro Bosco,"['Sacrobosco, Johannes de', 'Nunes, Pedro', 'Valeriano, Pierio', 'Sacrobosco, Johannes de', 'Vinet, Élie', 'Nunes, Pedro', 'Valeriano, Pierio', 'Sacrobosco, Johannes de', 'Vinet, Élie', 'Nunes, Pedro', 'Valeriano, Pierio', 'Sacrobosco, Johannes de', 'Vinet, Élie', 'Nunes, Pedro', 'Valeriano, Pierio']"
277,Chain,1971,e-a. raet umo- lial (3) 1586 (R),Heirs of Girolamo Scotto,Heirs of Girolamo Scotto,Venice,1586-01-01,Sphaera Ioannis de Sacro Bosco,"['Sacrobosco, Johannes de', 'Nunes, Pedro', 'Valeriano, Pierio', 'Sacrobosco, Johannes de', 'Vinet, Élie', 'Nunes, Pedro', 'Valeriano, Pierio', 'Sacrobosco, Johannes de', 'Vinet, Élie', 'Nunes, Pedro', 'Valeriano, Pierio', 'Sacrobosco, Johannes de', 'Vinet, Élie', 'Nunes, Pedro', 'Valeriano, Pierio']"
278,Chain,1972,e-in m;ua umo- alnu (3) 1620 (R),Heirs of Girolamo Scotto,Heirs of Girolamo Scotto,Venice,1620-01-01,Sphaera Ioannis de Sacro Bosco,"['Sacrobosco, Johannes de', 'Vinet, Élie', 'Nunes, Pedro', 'Valeriano, Pierio', 'Sacrobosco, Johannes de', 'Vinet, Élie', 'Vinet, Élie', 'Nunes, Pedro', 'Valeriano, Pierio', 'Sacrobosco, Johannes de', 'Vinet, Élie', 'Vinet, Élie', 'Nunes, Pedro', 'Valeriano, Pierio', 'Sacrobosco, Johannes de', 'Vinet, Élie', 'Vinet, Élie', 'Nunes, Pedro', 'Valeriano, Pierio', 'Sacrobosco, Johannes de', 'Vinet, Élie', 'Vinet, Élie', 'Nunes, Pedro', 'Valeriano, Pierio']"
279,,,,,,,,,
280,Source,1733,,"Cavellat, Guillaume","Cavellat, Guillaume",Paris,1576-01-01,La sphere de Iean de Sacrobosco,"['Sacrobosco, Johannes de', 'Sacrobosco, Johannes de', 'Des Bordes, Guillaume', 'Sacrobosco, Johannes de', 'Des Bordes, Guillaume', 'Sacrobosco, Johannes de', 'Des Bordes, Guillaume', 'Sacrobosco, Johannes de', 'Des Bordes, Guillaume', 'Sacrobosco, Johannes de', 'Des Bordes, Guillaume', 'Sacrobosco, Johannes de', 'Des Bordes, Guillaume', 'Sacrobosco, Johannes de', 'Des Bordes, Guillaume']"
281,Target,1739,,Widow of Guillaume Cavellat (Denise de Marnef),Widow of Guillaume Cavellat (Denise de Marnef),Paris,1584-01-01,La Sphere de Iean de Sacrobosco,"['Sacrobosco, Johannes de', 'Sacrobosco, Johannes de', 'Des Bordes, Guillaume', 'Sacrobosco, Johannes de', 'Des Bordes, Guillaume', 'Sacrobosco, Johannes de', 'Des Bordes, Guillaume', 'Sacrobosco, Johannes de', 'Des Bordes, Guillaume', 'Sacrobosco, Johannes de', 'Des Bordes, Guillaume', 'Sacrobosco, Johannes de', 'Des Bordes, Guillaume', 'Sacrobosco, Johannes de', 'Des Bordes, Guillaume']"
282,Chain,1733,"seun aol, mee, FIpr (3) 1576 (A)","Cavellat, Guillaume","Cavellat, Guillaume",Paris,1576-01-01,La sphere de Iean de Sacrobosco,"['Sacrobosco, Johannes de', 'Sacrobosco, Johannes de', 'Des Bordes, Guillaume', 'Sacrobosco, Johannes de', 'Des Bordes, Guillaume', 'Sacrobosco, Johannes de', 'Des Bordes, Guillaume', 'Sacrobosco, Johannes de', 'Des Bordes, Guillaume', 'Sacrobosco, Johannes de', 'Des Bordes, Guillaume', 'Sacrobosco, Johannes de', 'Des Bordes, Guillaume', 'Sacrobosco, Johannes de', 'Des Bordes, Guillaume']"
283,Chain,1739,"o-ui aol, mee, FIge (3) 1584 (A)",Widow of Guillaume Cavellat (Denise de Marnef),Widow of Guillaume Cavellat (Denise de Marnef),Paris,1584-01-01,La Sphere de Iean de Sacrobosco,"['Sacrobosco, Johannes de', 'Sacrobosco, Johannes de', 'Des Bordes, Guillaume', 'Sacrobosco, Johannes de', 'Des Bordes, Guillaume', 'Sacrobosco, Johannes de', 'Des Bordes, Guillaume', 'Sacrobosco, Johannes de', 'Des Bordes, Guillaume', 'Sacrobosco, Johannes de', 'Des Bordes, Guillaume', 'Sacrobosco, Johannes de', 'Des Bordes, Guillaume', 'Sacrobosco, Johannes de', 'Des Bordes, Guillaume']"
284,,,,,,,,,
285,Source,1734,,Heirs of Melchiorre Sessa I.,Heirs of Melchiorre Sessa I.,Venice,1577-01-01,Sphaera Ioannis de Sacrobusto,"Sacrobosco, Johannes de"
286,Target,1752,,Heirs of Melchiorre Sessa I.,Heirs of Melchiorre Sessa I.,Venice,1601-01-01,Sphaera Ioannis de Sacrobusto,"Sacrobosco, Johannes de"
287,Chain,1734,"r.i- e,n- s,ri Quas (3) 1577 (A)",Heirs of Melchiorre Sessa I.,Heirs of Melchiorre Sessa I.,Venice,1577-01-01,Sphaera Ioannis de Sacrobusto,"Sacrobosco, Johannes de"
288,Chain,1752,"r.a- ++++ s,i- Quas (3) 1601 (R)",Heirs of Melchiorre Sessa I.,Heirs of Melchiorre Sessa I.,Venice,1601-01-01,Sphaera Ioannis de Sacrobusto,"Sacrobosco, Johannes de"
289,,,,,,,,,
290,Source,1737,,Heirs of Melchiorre Sessa I.,Heirs of Melchiorre Sessa I.,Venice,1580-01-01,Sphaera Ioannis de Sacrobusto,"Sacrobosco, Johannes de"
291,Target,1752,,Heirs of Melchiorre Sessa I.,Heirs of Melchiorre Sessa I.,Venice,1601-01-01,Sphaera Ioannis de Sacrobusto,"Sacrobosco, Johannes de"
292,Chain,1737,"r.i- e,n- s,ri Quas (3) 1580 (R)",Heirs of Melchiorre Sessa I.,Heirs of Melchiorre Sessa I.,Venice,1580-01-01,Sphaera Ioannis de Sacrobusto,"Sacrobosco, Johannes de"
293,Chain,1752,"r.a- ++++ s,i- Quas (3) 1601 (R)",Heirs of Melchiorre Sessa I.,Heirs of Melchiorre Sessa I.,Venice,1601-01-01,Sphaera Ioannis de Sacrobusto,"Sacrobosco, Johannes de"
294,,,,,,,,,
295,Source,1807,,"Zanetti, Francesco","Zanetti, Francesco",Rome,1581-01-01,In Sphaeram Ioannis de Sacro Bosco commentarius,"['Sacrobosco, Johannes de', 'Sacrobosco, Johannes de', 'Clavius, Christoph', 'Sacrobosco, Johannes de', 'Clavius, Christoph', 'Sacrobosco, Johannes de', 'Clavius, Christoph', 'Sacrobosco, Johannes de', 'Clavius, Christoph', 'Sacrobosco, Johannes de', 'Clavius, Christoph', 'Sacrobosco, Johannes de', 'Clavius, Christoph', 'Sacrobosco, Johannes de', 'Clavius, Christoph']"
296,Target,1755,,"Crispin, Samuel","Crispin, Samuel",Saint Gervais,1607-01-01,"In Sphaeram Ioannis de Sacro Bosco, commentarius","['Sacrobosco, Johannes de', 'Sacrobosco, Johannes de', 'Clavius, Christoph']"
297,Target,1818,,"Crispin, Samuel","Crispin, Samuel",Saint Gervais,1608-01-01,"In Sphaeram Ioannis de Sacro Bosco, commentarius","['Sacrobosco, Johannes de', 'Sacrobosco, Johannes de', 'Clavius, Christoph']"
298,Target,2151,,"Crispin, Samuel","Crispin, Samuel",Geneva,1607-01-01,"In Sphaeram Ioannis de Sacro Bosco, commentarius","['Sacrobosco, Johannes de', 'Sacrobosco, Johannes de', 'Clavius, Christoph']"
299,Target,1822,,"Polère, Amédée","Rigaud, Pierre",Lyon,1618-01-01,"In Sphaeram Ioannis de Sacro Bosco, Commentarius","['Sacrobosco, Johannes de', 'Sacrobosco, Johannes de', 'Clavius, Christoph']"
300,Chain,1807,m-us o-66 e-en suta (3) 1581 (R),"Zanetti, Francesco","Zanetti, Francesco",Rome,1581-01-01,In Sphaeram Ioannis de Sacro Bosco commentarius,"['Sacrobosco, Johannes de', 'Sacrobosco, Johannes de', 'Clavius, Christoph', 'Sacrobosco, Johannes de', 'Clavius, Christoph', 'Sacrobosco, Johannes de', 'Clavius, Christoph', 'Sacrobosco, Johannes de', 'Clavius, Christoph', 'Sacrobosco, Johannes de', 'Clavius, Christoph', 'Sacrobosco, Johannes de', 'Clavius, Christoph', 'Sacrobosco, Johannes de', 'Clavius, Christoph']"
301,Chain,1808,m-us a-37 e-en suxt (3) 1585 (R),"Basa, Domenico","Basa, Domenico",Rome,1585-01-01,In Sphaeram Ioannis de Sacro Bosco commentarius,"['Sacrobosco, Johannes de', 'Sacrobosco, Johannes de', 'Clavius, Christoph']"
302,Chain,1809,gei- is37 e-en suta (3) 1591 (R),"Ciotti, Giovanni Battista","Ciotti, Giovanni Battista",Venice,1591-01-01,In Sphaeram Ioannis de Sacro Bosco commentarius,"['Sacrobosco, Johannes de', 'Sacrobosco, Johannes de', 'Clavius, Christoph']"
303,Chain,1746,o-ia e.i- e-en suta (3) 1593 (R),"Julliéron, Guichard",Brothers Gabiano,Lyon,1593-01-01,In Sphaeram Ioannis de Sacro Bosco. Commentarius,"['Sacrobosco, Johannes de', 'Sacrobosco, Johannes de', 'Clavius, Christoph']"
304,Chain,1810,o-ia e.i- e-en suta (3) 1594 (R),"Julliéron, Guichard",Brothers Gabiano,Lyon,1594-01-01,In Sphaeram Ioannis de Sacro Bosco. Commentarius,"['Sacrobosco, Johannes de', 'Sacrobosco, Johannes de', 'Clavius, Christoph']"
305,Chain,1811,n-e- is37 e-en suta (3) 1596 (A),"Basa, Bernardo","Basa, Bernardo",Venice,1596-01-01,In sphæram Ioannis de Sacro Bosco commentarius,"['Sacrobosco, Johannes de', 'Sacrobosco, Johannes de', 'Clavius, Christoph']"
306,Chain,1812,"m,e- is37 e-en suta (3) 1601 (R)","Ciotti, Giovanni Battista","Basa, Isabetta",Venice,1601-01-01,In Sphæram Ioannis de Sacro Bosco Commentarius,"['Sacrobosco, Johannes de', 'Sacrobosco, Johannes de', 'Clavius, Christoph']"
307,Chain,2278,"m,e- in48 e-en suta (3) 1601 (A)","Ciotti, Giovanni Battista","Ciotti, Giovanni Battista",Venice,1601-01-01,In Sphaeram Ioannis de Sacro Bosco Commentarius,"['Sacrobosco, Johannes de', 'Sacrobosco, Johannes de', 'Clavius, Christoph']"
308,Chain,1821,o-ia amm. e-en sune (3) 1602 (R),"Crispin, Samuel","Crispin, Samuel",Saint Gervais,1602-01-01,"In Sphaeram Ioannis de Sacro Bosco, commentarius","['Sacrobosco, Johannes de', 'Sacrobosco, Johannes de', 'Clavius, Christoph']"
309,Chain,1813,o-ia amm. e-en sune (3) 1602 (R),"Gabiano, Jean de","Gabiano, Jean de",Lyon,1602-01-01,"In Sphaeram Ioannis de Sacro Bosco, Commentarius","['Sacrobosco, Johannes de', 'Sacrobosco, Johannes de', 'Clavius, Christoph']"
310,Chain,1814,hius is37 e-en suta (3) 1603 (A),"Ciotti, Giovanni Battista","Ciotti, Giovanni Battista",Venice,1603-01-01,In Sphaeram Ioannis de Sacro Bosco Commentarius,"['Sacrobosco, Johannes de', 'Sacrobosco, Johannes de', 'Clavius, Christoph']"
311,Chain,1815,t.e- e.id e-en suta (3) 1606 (R),"Zanetti, Luigi","Gelli, Giovanni Paolo",Rome,1606-01-01,In Sphaeram Ioannis de Sacro Bosco. Commentarius,"['Sacrobosco, Johannes de', 'Sacrobosco, Johannes de', 'Clavius, Christoph']"
312,Chain,1755,o-ia amm. e-en sune (3) 1607 (R),"Crispin, Samuel","Crispin, Samuel",Saint Gervais,1607-01-01,"In Sphaeram Ioannis de Sacro Bosco, commentarius","['Sacrobosco, Johannes de', 'Sacrobosco, Johannes de', 'Clavius, Christoph']"
313,Chain,1816,t.e- e.id e-en maiu (3) 1607 (R),Jacques du Creux a.k.a. Molliard,"Gabiano, Jean de",Lyon,1607-01-01,In Sphaeram Ioannis de Sacro Bosco. Commentarius,"['Sacrobosco, Johannes de', 'Sacrobosco, Johannes de', 'Clavius, Christoph']"
314,Chain,1817,t.e- e.id e-en suta (3) 1607 (R),"Zanetti, Luigi","Gelli, Giovanni Paolo",Rome,1607-01-01,In Sphaeram Ioannis de Sacro Bosco. Commentarius,"['Sacrobosco, Johannes de', 'Sacrobosco, Johannes de', 'Clavius, Christoph']"
315,Chain,2151,o-ia amm. e-en sune (3) 1607 (R),"Crispin, Samuel","Crispin, Samuel",Geneva,1607-01-01,"In Sphaeram Ioannis de Sacro Bosco, commentarius","['Sacrobosco, Johannes de', 'Sacrobosco, Johannes de', 'Clavius, Christoph']"
316,Chain,1818,o-ia amm. e-en sune (3) 1608 (R),"Crispin, Samuel","Crispin, Samuel",Saint Gervais,1608-01-01,"In Sphaeram Ioannis de Sacro Bosco, commentarius","['Sacrobosco, Johannes de', 'Sacrobosco, Johannes de', 'Clavius, Christoph']"
317,Chain,1822,n-m- e.s- e-en maiu (3) 1618 (R),"Polère, Amédée","Rigaud, Pierre",Lyon,1618-01-01,"In Sphaeram Ioannis de Sacro Bosco, Commentarius","['Sacrobosco, Johannes de', 'Sacrobosco, Johannes de', 'Clavius, Christoph']"
318,,,,,,,,,
319,Source,1743,,Heirs of Melchiorre Sessa I.,Heirs of Melchiorre Sessa I.,Venice,1587-01-01,Sphaera Ioannis de Sacrobusto,"Sacrobosco, Johannes de"
320,Target,1752,,Heirs of Melchiorre Sessa I.,Heirs of Melchiorre Sessa I.,Venice,1601-01-01,Sphaera Ioannis de Sacrobusto,"Sacrobosco, Johannes de"
321,Chain,1743,"r.i- e,n- s,ri Quas (3) 1587 (R)",Heirs of Melchiorre Sessa I.,Heirs of Melchiorre Sessa I.,Venice,1587-01-01,Sphaera Ioannis de Sacrobusto,"Sacrobosco, Johannes de"
322,Chain,1752,"r.a- ++++ s,i- Quas (3) 1601 (R)",Heirs of Melchiorre Sessa I.,Heirs of Melchiorre Sessa I.,Venice,1601-01-01,Sphaera Ioannis de Sacrobusto,"Sacrobosco, Johannes de"
323,,,,,,,,,
324,Source,2245,,"Wechel, Johann","Wechel, Johann",Frankfurt (Main),1587-01-01,Isagoge sphaerica,"Scribonius, Wilhelm Adolf"
325,Target,2243,,"Wechel, Johann","Wechel, Johann",Frankfurt (Main),1593-01-01,Isagoge sphaerica,"['Scribonius, Wilhelm Adolf', 'Scribonius, Wilhelm Adolf', 'Palthenius, Zacharias']"
326,Chain,2245,p.do r.a- e*q: *tSu (C) 1587 (R),"Wechel, Johann","Wechel, Johann",Frankfurt (Main),1587-01-01,Isagoge sphaerica,"Scribonius, Wilhelm Adolf"
327,Chain,2243,emst r.es emq; stSu (C) 1593 (R),"Wechel, Johann","Wechel, Johann",Frankfurt (Main),1593-01-01,Isagoge sphaerica,"['Scribonius, Wilhelm Adolf', 'Scribonius, Wilhelm Adolf', 'Palthenius, Zacharias']"
328,,,,,,,,,
329,Source,1961,,"Cholinus, Goswin","Cholinus, Goswin",Cologne,1591-01-01,Sphaera Ioannis de Sacrobosco,"['Sacrobosco, Johannes de', 'Nunes, Pedro', 'Hero, Albertus', 'Valeriano, Pierio', 'Sacrobosco, Johannes de', 'Vinet, Élie', 'Nunes, Pedro', 'Hero, Albertus', 'Valeriano, Pierio', 'Sacrobosco, Johannes de', 'Vinet, Élie', 'Nunes, Pedro', 'Hero, Albertus', 'Valeriano, Pierio', 'Sacrobosco, Johannes de', 'Vinet, Élie', 'Nunes, Pedro', 'Hero, Albertus', 'Valeriano, Pierio', 'Sacrobosco, Johannes de', 'Vinet, Élie', 'Nunes, Pedro', 'Hero, Albertus', 'Valeriano, Pierio']"
330,Target,1959,,"Cholinus, Goswin","Cholinus, Goswin",Cologne,1594-01-01,Sphaera Ioannis de Sacrobosco,"['Sacrobosco, Johannes de', 'Vinet, Élie', 'Nunes, Pedro', 'Hero, Albertus', 'Valeriano, Pierio', 'Sacrobosco, Johannes de', 'Vinet, Élie', 'Vinet, Élie', 'Nunes, Pedro', 'Hero, Albertus', 'Valeriano, Pierio', 'Sacrobosco, Johannes de', 'Vinet, Élie', 'Vinet, Élie', 'Nunes, Pedro', 'Hero, Albertus', 'Valeriano, Pierio', 'Sacrobosco, Johannes de', 'Vinet, Élie', 'Vinet, Élie', 'Nunes, Pedro', 'Hero, Albertus', 'Valeriano, Pierio', 'Sacrobosco, Johannes de', 'Vinet, Élie', 'Vinet, Élie', 'Nunes, Pedro', 'Hero, Albertus', 'Valeriano, Pierio', 'Sacrobosco, Johannes de', 'Vinet, Élie', 'Vinet, Élie', 'Nunes, Pedro', 'Hero, Albertus', 'Valeriano, Pierio']"
331,Chain,1961,"i-t, o,o- isin made (3) 1591 (R)","Cholinus, Goswin","Cholinus, Goswin",Cologne,1591-01-01,Sphaera Ioannis de Sacrobosco,"['Sacrobosco, Johannes de', 'Nunes, Pedro', 'Hero, Albertus', 'Valeriano, Pierio', 'Sacrobosco, Johannes de', 'Vinet, Élie', 'Nunes, Pedro', 'Hero, Albertus', 'Valeriano, Pierio', 'Sacrobosco, Johannes de', 'Vinet, Élie', 'Nunes, Pedro', 'Hero, Albertus', 'Valeriano, Pierio', 'Sacrobosco, Johannes de', 'Vinet, Élie', 'Nunes, Pedro', 'Hero, Albertus', 'Valeriano, Pierio', 'Sacrobosco, Johannes de', 'Vinet, Élie', 'Nunes, Pedro', 'Hero, Albertus', 'Valeriano, Pierio']"
332,Chain,1959,"tit, o,o- L.o. nèma (C) 1594 (R)","Cholinus, Goswin","Cholinus, Goswin",Cologne,1594-01-01,Sphaera Ioannis de Sacrobosco,"['Sacrobosco, Johannes de', 'Vinet, Élie', 'Nunes, Pedro', 'Hero, Albertus', 'Valeriano, Pierio', 'Sacrobosco, Johannes de', 'Vinet, Élie', 'Vinet, Élie', 'Nunes, Pedro', 'Hero, Albertus', 'Valeriano, Pierio', 'Sacrobosco, Johannes de', 'Vinet, Élie', 'Vinet, Élie', 'Nunes, Pedro', 'Hero, Albertus', 'Valeriano, Pierio', 'Sacrobosco, Johannes de', 'Vinet, Élie', 'Vinet, Élie', 'Nunes, Pedro', 'Hero, Albertus', 'Valeriano, Pierio', 'Sacrobosco, Johannes de', 'Vinet, Élie', 'Vinet, Élie', 'Nunes, Pedro', 'Hero, Albertus', 'Valeriano, Pierio', 'Sacrobosco, Johannes de', 'Vinet, Élie', 'Vinet, Élie', 'Nunes, Pedro', 'Hero, Albertus', 'Valeriano, Pierio']"
333,,,,,,,,,
334,Source,1748,,Heirs of Melchiorre Sessa I.,Heirs of Melchiorre Sessa I.,Venice,1594-01-01,Sphaera Ioannis de Sacrobusto,"Sacrobosco, Johannes de"
335,Target,1752,,Heirs of Melchiorre Sessa I.,Heirs of Melchiorre Sessa I.,Venice,1601-01-01,Sphaera Ioannis de Sacrobusto,"Sacrobosco, Johannes de"
336,Chain,1748,"r.i- e,n- s,ri Quas (3) 1594 (R)",Heirs of Melchiorre Sessa I.,Heirs of Melchiorre Sessa I.,Venice,1594-01-01,Sphaera Ioannis de Sacrobusto,"Sacrobosco, Johannes de"
337,Chain,1752,"r.a- ++++ s,i- Quas (3) 1601 (R)",Heirs of Melchiorre Sessa I.,Heirs of Melchiorre Sessa I.,Venice,1601-01-01,Sphaera Ioannis de Sacrobusto,"Sacrobosco, Johannes de"
338,,,,,,,,,
339,Source,2229,,"Windet, John","Tapp, John",London,1609-01-01,The Arte of Navigation,"['Martin Cortés', 'Martin Cortés', 'Eden, Richard']"
340,Target,2228,,"Fawcett, Thomas","Tapp, John",London,1630-01-01,The Art of Navigation,"['Martin Cortés', 'Tapp, John', 'Martin Cortés', 'Eden, Richard', 'Tapp, John', 'Martin Cortés', 'Eden, Richard', 'Tapp, John', 'Martin Cortés', 'Eden, Richard', 'Tapp, John', 'Martin Cortés', 'Eden, Richard', 'Tapp, John', 'Martin Cortés', 'Eden, Richard', 'Tapp, John']"
341,Chain,2229,ofnd 6d2c g.re thTh (3) 1609 (A),"Windet, John","Tapp, John",London,1609-01-01,The Arte of Navigation,"['Martin Cortés', 'Martin Cortés', 'Eden, Richard']"
342,Chain,2222,sene *d** g.ly thTh (3) 1615 (A),"Stansby, William","Tapp, John",London,1615-01-01,The Arte of Navigation,"['Martin Cortés', 'Tapp, John', 'Martin Cortés', 'Eden, Richard', 'Tapp, John', 'Martin Cortés', 'Eden, Richard', 'Tapp, John']"
343,Chain,2228,"d,i- est- g.l- thTh (3) 1630 (A)","Fawcett, Thomas","Tapp, John",London,1630-01-01,The Art of Navigation,"['Martin Cortés', 'Tapp, John', 'Martin Cortés', 'Eden, Richard', 'Tapp, John', 'Martin Cortés', 'Eden, Richard', 'Tapp, John', 'Martin Cortés', 'Eden, Richard', 'Tapp, John', 'Martin Cortés', 'Eden, Richard', 'Tapp, John', 'Martin Cortés', 'Eden, Richard', 'Tapp, John']"
344,,,,,,,,,
345,Source,1872,,"Pillehotte, Antoine","Pillehotte, Antoine",Lyon,1617-01-01,Sphaera Ioannis de Sacrobosco,"['Sacrobosco, Johannes de', 'Nunes, Pedro', 'Valeriano, Pierio', 'Martin, Jacques', 'Sacrobosco, Johannes de', 'Vinet, Élie', 'Nunes, Pedro', 'Valeriano, Pierio', 'Martin, Jacques', 'Sacrobosco, Johannes de', 'Vinet, Élie', 'Nunes, Pedro', 'Valeriano, Pierio', 'Martin, Jacques', 'Sacrobosco, Johannes de', 'Vinet, Élie', 'Nunes, Pedro', 'Valeriano, Pierio', 'Martin, Jacques', 'Sacrobosco, Johannes de', 'Vinet, Élie', 'Nunes, Pedro', 'Valeriano, Pierio', 'Martin, Jacques']"
346,Target,1908,,"Weiß, Johann Friedrich","Marschall, Peter",Frankfurt (Main),1625-01-01,Bernardi Morisani Hiberni Derensis in Sphaeram Ioannis de S. Bosco commentarius,"['Sacrobosco, Johannes de', 'Sacrobosco, Johannes de', 'Morisanus, Bernardus']"
347,Chain,1872,a-as o-e- f-a- Dest (3) 1617 (A),"Pillehotte, Antoine","Pillehotte, Antoine",Lyon,1617-01-01,Sphaera Ioannis de Sacrobosco,"['Sacrobosco, Johannes de', 'Nunes, Pedro', 'Valeriano, Pierio', 'Martin, Jacques', 'Sacrobosco, Johannes de', 'Vinet, Élie', 'Nunes, Pedro', 'Valeriano, Pierio', 'Martin, Jacques', 'Sacrobosco, Johannes de', 'Vinet, Élie', 'Nunes, Pedro', 'Valeriano, Pierio', 'Martin, Jacques', 'Sacrobosco, Johannes de', 'Vinet, Élie', 'Nunes, Pedro', 'Valeriano, Pierio', 'Martin, Jacques', 'Sacrobosco, Johannes de', 'Vinet, Élie', 'Nunes, Pedro', 'Valeriano, Pierio', 'Martin, Jacques']"
348,Chain,1908,isme o-e- o-c- poPr (3) 1625 (R),"Weiß, Johann Friedrich","Marschall, Peter",Frankfurt (Main),1625-01-01,Bernardi Morisani Hiberni Derensis in Sphaeram Ioannis de S. Bosco commentarius,"['Sacrobosco, Johannes de', 'Sacrobosco, Johannes de', 'Morisanus, Bernardus']"
