Name;Birth;Death;Active from;Active until;Role;City
Windet, John;;;1584;1611;Printer;London
Tapp, John;1575;1631;1596;1630;Author;London
Stansby, William;1572;1638;1597;1638;Printer;London
Alsop, Bernard;;;1615;1652;Printer;London
Fawcett, Thomas;;;1625;1655;Printer;London
;;;;;;
Marnef, Jérôme de;1515;1595;1547;1608;Printer;Paris
Cavellat, Guillaume;1500;1576;;;Publisher & Printer;Paris
Widow of Guillaume Cavellat (Denise de Marnef);;;1567;1616;Publisher;Paris
Quesnel, Jacques;1590;1661;1618;1661;Publisher;Paris
Scoto, Girolamo;1505;1572;1539;1572;Publisher;Venice