[
    {
        "custom_identifier":1616,
        "t1":1486,
        "t2":1576
    },
    {
        "custom_identifier":2200,
        "t1":1489,
        "t2":1579
    },
    {
        "custom_identifier":2201,
        "t1":1489,
        "t2":1579
    },
    {
        "custom_identifier":1925,
        "t1":1490,
        "t2":1580
    },
    {
        "custom_identifier":1926,
        "t1":1491,
        "t2":1581
    },
    {
        "custom_identifier":1624,
        "t1":1494,
        "t2":1584
    },
    {
        "custom_identifier":1626,
        "t1":1494,
        "t2":1584
    },
    {
        "custom_identifier":1844,
        "t1":1495,
        "t2":1585
    },
    {
        "custom_identifier":2153,
        "t1":1498,
        "t2":1588
    },
    {
        "custom_identifier":1632,
        "t1":1498,
        "t2":1588
    },
    {
        "custom_identifier":1825,
        "t1":1498,
        "t2":1588
    },
    {
        "custom_identifier":1638,
        "t1":1498,
        "t2":1588
    },
    {
        "custom_identifier":1830,
        "t1":1500,
        "t2":1590
    },
    {
        "custom_identifier":1847,
        "t1":1500,
        "t2":1590
    },
    {
        "custom_identifier":1930,
        "t1":1501,
        "t2":1591
    },
    {
        "custom_identifier":2118,
        "t1":1503,
        "t2":1593
    },
    {
        "custom_identifier":1795,
        "t1":1505,
        "t2":1595
    },
    {
        "custom_identifier":1833,
        "t1":1507,
        "t2":1597
    },
    {
        "custom_identifier":1805,
        "t1":1508,
        "t2":1598
    },
    {
        "custom_identifier":1829,
        "t1":1511,
        "t2":1601
    },
    {
        "custom_identifier":1650,
        "t1":1513,
        "t2":1603
    },
    {
        "custom_identifier":1824,
        "t1":1515,
        "t2":1605
    },
    {
        "custom_identifier":1655,
        "t1":1516,
        "t2":1606
    },
    {
        "custom_identifier":1828,
        "t1":1516,
        "t2":1606
    },
    {
        "custom_identifier":2194,
        "t1":1517,
        "t2":1607
    },
    {
        "custom_identifier":1664,
        "t1":1519,
        "t2":1609
    },
    {
        "custom_identifier":1942,
        "t1":1519,
        "t2":1609
    },
    {
        "custom_identifier":1877,
        "t1":1519,
        "t2":1609
    },
    {
        "custom_identifier":1846,
        "t1":1520,
        "t2":1610
    },
    {
        "custom_identifier":1870,
        "t1":1521,
        "t2":1611
    },
    {
        "custom_identifier":1667,
        "t1":1524,
        "t2":1614
    },
    {
        "custom_identifier":1670,
        "t1":1527,
        "t2":1617
    },
    {
        "custom_identifier":1869,
        "t1":1527,
        "t2":1617
    },
    {
        "custom_identifier":1832,
        "t1":1531,
        "t2":1621
    },
    {
        "custom_identifier":1879,
        "t1":1532,
        "t2":1622
    },
    {
        "custom_identifier":1864,
        "t1":1533,
        "t2":1623
    },
    {
        "custom_identifier":1881,
        "t1":1534,
        "t2":1624
    },
    {
        "custom_identifier":1679,
        "t1":1534,
        "t2":1624
    },
    {
        "custom_identifier":1880,
        "t1":1534,
        "t2":1624
    },
    {
        "custom_identifier":1831,
        "t1":1534,
        "t2":1624
    },
    {
        "custom_identifier":1882,
        "t1":1536,
        "t2":1626
    },
    {
        "custom_identifier":1883,
        "t1":1537,
        "t2":1627
    },
    {
        "custom_identifier":1884,
        "t1":1537,
        "t2":1627
    },
    {
        "custom_identifier":1843,
        "t1":1538,
        "t2":1628
    },
    {
        "custom_identifier":1885,
        "t1":1538,
        "t2":1628
    },
    {
        "custom_identifier":1865,
        "t1":1539,
        "t2":1629
    },
    {
        "custom_identifier":1886,
        "t1":1540,
        "t2":1630
    },
    {
        "custom_identifier":1682,
        "t1":1541,
        "t2":1631
    },
    {
        "custom_identifier":1887,
        "t1":1542,
        "t2":1632
    },
    {
        "custom_identifier":1888,
        "t1":1543,
        "t2":1633
    },
    {
        "custom_identifier":1684,
        "t1":1543,
        "t2":1633
    },
    {
        "custom_identifier":1687,
        "t1":1545,
        "t2":1635
    },
    {
        "custom_identifier":1688,
        "t1":1545,
        "t2":1635
    },
    {
        "custom_identifier":1690,
        "t1":1545,
        "t2":1635
    },
    {
        "custom_identifier":1694,
        "t1":1547,
        "t2":1637
    },
    {
        "custom_identifier":2198,
        "t1":1547,
        "t2":1637
    },
    {
        "custom_identifier":1692,
        "t1":1547,
        "t2":1637
    },
    {
        "custom_identifier":1695,
        "t1":1548,
        "t2":1638
    },
    {
        "custom_identifier":2070,
        "t1":1548,
        "t2":1638
    },
    {
        "custom_identifier":1779,
        "t1":1549,
        "t2":1639
    },
    {
        "custom_identifier":1894,
        "t1":1549,
        "t2":1639
    },
    {
        "custom_identifier":1701,
        "t1":1550,
        "t2":1640
    },
    {
        "custom_identifier":1895,
        "t1":1550,
        "t2":1640
    },
    {
        "custom_identifier":1594,
        "t1":1550,
        "t2":1640
    },
    {
        "custom_identifier":2257,
        "t1":1551,
        "t2":1641
    },
    {
        "custom_identifier":1934,
        "t1":1551,
        "t2":1641
    },
    {
        "custom_identifier":2077,
        "t1":1551,
        "t2":1641
    },
    {
        "custom_identifier":2269,
        "t1":1551,
        "t2":1641
    },
    {
        "custom_identifier":1952,
        "t1":1551,
        "t2":1641
    },
    {
        "custom_identifier":1780,
        "t1":1551,
        "t2":1641
    },
    {
        "custom_identifier":2219,
        "t1":1552,
        "t2":1642
    },
    {
        "custom_identifier":2064,
        "t1":1552,
        "t2":1642
    },
    {
        "custom_identifier":1782,
        "t1":1552,
        "t2":1642
    },
    {
        "custom_identifier":1781,
        "t1":1552,
        "t2":1642
    },
    {
        "custom_identifier":2252,
        "t1":1552,
        "t2":1642
    },
    {
        "custom_identifier":2270,
        "t1":1552,
        "t2":1642
    },
    {
        "custom_identifier":1902,
        "t1":1552,
        "t2":1642
    },
    {
        "custom_identifier":2165,
        "t1":1553,
        "t2":1643
    },
    {
        "custom_identifier":2068,
        "t1":1553,
        "t2":1643
    },
    {
        "custom_identifier":1900,
        "t1":1553,
        "t2":1643
    },
    {
        "custom_identifier":2172,
        "t1":1554,
        "t2":1644
    },
    {
        "custom_identifier":1707,
        "t1":1554,
        "t2":1644
    },
    {
        "custom_identifier":2253,
        "t1":1555,
        "t2":1645
    },
    {
        "custom_identifier":1708,
        "t1":1556,
        "t2":1646
    },
    {
        "custom_identifier":2104,
        "t1":1556,
        "t2":1646
    },
    {
        "custom_identifier":2280,
        "t1":1556,
        "t2":1646
    },
    {
        "custom_identifier":1711,
        "t1":1557,
        "t2":1647
    },
    {
        "custom_identifier":1710,
        "t1":1557,
        "t2":1647
    },
    {
        "custom_identifier":2168,
        "t1":1558,
        "t2":1648
    },
    {
        "custom_identifier":1964,
        "t1":1558,
        "t2":1648
    },
    {
        "custom_identifier":1891,
        "t1":1558,
        "t2":1648
    },
    {
        "custom_identifier":1712,
        "t1":1559,
        "t2":1649
    },
    {
        "custom_identifier":2105,
        "t1":1560,
        "t2":1650
    },
    {
        "custom_identifier":2148,
        "t1":1560,
        "t2":1650
    },
    {
        "custom_identifier":1783,
        "t1":1560,
        "t2":1650
    },
    {
        "custom_identifier":2106,
        "t1":1561,
        "t2":1651
    },
    {
        "custom_identifier":1955,
        "t1":1561,
        "t2":1651
    },
    {
        "custom_identifier":1716,
        "t1":1561,
        "t2":1651
    },
    {
        "custom_identifier":1784,
        "t1":1561,
        "t2":1651
    },
    {
        "custom_identifier":1715,
        "t1":1561,
        "t2":1651
    },
    {
        "custom_identifier":1718,
        "t1":1561,
        "t2":1651
    },
    {
        "custom_identifier":1903,
        "t1":1561,
        "t2":1651
    },
    {
        "custom_identifier":1969,
        "t1":1562,
        "t2":1652
    },
    {
        "custom_identifier":1786,
        "t1":1562,
        "t2":1652
    },
    {
        "custom_identifier":1904,
        "t1":1563,
        "t2":1653
    },
    {
        "custom_identifier":1862,
        "t1":1563,
        "t2":1653
    },
    {
        "custom_identifier":2166,
        "t1":1563,
        "t2":1653
    },
    {
        "custom_identifier":1722,
        "t1":1564,
        "t2":1654
    },
    {
        "custom_identifier":2160,
        "t1":1564,
        "t2":1654
    },
    {
        "custom_identifier":1973,
        "t1":1564,
        "t2":1654
    },
    {
        "custom_identifier":1912,
        "t1":1564,
        "t2":1654
    },
    {
        "custom_identifier":1788,
        "t1":1565,
        "t2":1655
    },
    {
        "custom_identifier":2063,
        "t1":1566,
        "t2":1656
    },
    {
        "custom_identifier":1856,
        "t1":1566,
        "t2":1656
    },
    {
        "custom_identifier":1857,
        "t1":1566,
        "t2":1656
    },
    {
        "custom_identifier":1953,
        "t1":1566,
        "t2":1656
    },
    {
        "custom_identifier":1725,
        "t1":1566,
        "t2":1656
    },
    {
        "custom_identifier":1968,
        "t1":1567,
        "t2":1657
    },
    {
        "custom_identifier":2158,
        "t1":1567,
        "t2":1657
    },
    {
        "custom_identifier":1727,
        "t1":1567,
        "t2":1657
    },
    {
        "custom_identifier":2197,
        "t1":1568,
        "t2":1658
    },
    {
        "custom_identifier":1896,
        "t1":1568,
        "t2":1658
    },
    {
        "custom_identifier":1974,
        "t1":1569,
        "t2":1659
    },
    {
        "custom_identifier":2167,
        "t1":1569,
        "t2":1659
    },
    {
        "custom_identifier":1728,
        "t1":1569,
        "t2":1659
    },
    {
        "custom_identifier":1789,
        "t1":1569,
        "t2":1659
    },
    {
        "custom_identifier":2157,
        "t1":1570,
        "t2":1660
    },
    {
        "custom_identifier":1790,
        "t1":1571,
        "t2":1661
    },
    {
        "custom_identifier":1911,
        "t1":1572,
        "t2":1662
    },
    {
        "custom_identifier":1729,
        "t1":1572,
        "t2":1662
    },
    {
        "custom_identifier":2073,
        "t1":1573,
        "t2":1663
    },
    {
        "custom_identifier":1730,
        "t1":1573,
        "t2":1663
    },
    {
        "custom_identifier":2161,
        "t1":1573,
        "t2":1663
    },
    {
        "custom_identifier":2215,
        "t1":1574,
        "t2":1664
    },
    {
        "custom_identifier":1836,
        "t1":1574,
        "t2":1664
    },
    {
        "custom_identifier":1965,
        "t1":1574,
        "t2":1664
    },
    {
        "custom_identifier":1897,
        "t1":1574,
        "t2":1664
    },
    {
        "custom_identifier":2208,
        "t1":1575,
        "t2":1665
    },
    {
        "custom_identifier":2169,
        "t1":1576,
        "t2":1666
    },
    {
        "custom_identifier":2180,
        "t1":1576,
        "t2":1666
    },
    {
        "custom_identifier":1733,
        "t1":1576,
        "t2":1666
    },
    {
        "custom_identifier":2271,
        "t1":1576,
        "t2":1666
    },
    {
        "custom_identifier":1734,
        "t1":1577,
        "t2":1667
    },
    {
        "custom_identifier":2203,
        "t1":1577,
        "t2":1667
    },
    {
        "custom_identifier":1970,
        "t1":1577,
        "t2":1667
    },
    {
        "custom_identifier":1898,
        "t1":1578,
        "t2":1668
    },
    {
        "custom_identifier":2162,
        "t1":1578,
        "t2":1668
    },
    {
        "custom_identifier":1852,
        "t1":1578,
        "t2":1668
    },
    {
        "custom_identifier":1919,
        "t1":1579,
        "t2":1669
    },
    {
        "custom_identifier":2225,
        "t1":1579,
        "t2":1669
    },
    {
        "custom_identifier":2242,
        "t1":1580,
        "t2":1670
    },
    {
        "custom_identifier":1737,
        "t1":1580,
        "t2":1670
    },
    {
        "custom_identifier":1807,
        "t1":1581,
        "t2":1671
    },
    {
        "custom_identifier":1960,
        "t1":1581,
        "t2":1671
    },
    {
        "custom_identifier":2241,
        "t1":1581,
        "t2":1671
    },
    {
        "custom_identifier":2258,
        "t1":1581,
        "t2":1671
    },
    {
        "custom_identifier":2268,
        "t1":1581,
        "t2":1671
    },
    {
        "custom_identifier":2178,
        "t1":1582,
        "t2":1672
    },
    {
        "custom_identifier":2281,
        "t1":1582,
        "t2":1672
    },
    {
        "custom_identifier":1958,
        "t1":1582,
        "t2":1672
    },
    {
        "custom_identifier":2190,
        "t1":1583,
        "t2":1673
    },
    {
        "custom_identifier":2159,
        "t1":1583,
        "t2":1673
    },
    {
        "custom_identifier":2223,
        "t1":1584,
        "t2":1674
    },
    {
        "custom_identifier":1739,
        "t1":1584,
        "t2":1674
    },
    {
        "custom_identifier":1741,
        "t1":1584,
        "t2":1674
    },
    {
        "custom_identifier":2069,
        "t1":1584,
        "t2":1674
    },
    {
        "custom_identifier":1777,
        "t1":1585,
        "t2":1675
    },
    {
        "custom_identifier":1808,
        "t1":1585,
        "t2":1675
    },
    {
        "custom_identifier":2237,
        "t1":1585,
        "t2":1675
    },
    {
        "custom_identifier":1971,
        "t1":1586,
        "t2":1676
    },
    {
        "custom_identifier":1743,
        "t1":1587,
        "t2":1677
    },
    {
        "custom_identifier":2171,
        "t1":1587,
        "t2":1677
    },
    {
        "custom_identifier":2245,
        "t1":1587,
        "t2":1677
    },
    {
        "custom_identifier":2176,
        "t1":1588,
        "t2":1678
    },
    {
        "custom_identifier":2226,
        "t1":1589,
        "t2":1679
    },
    {
        "custom_identifier":2177,
        "t1":1590,
        "t2":1680
    },
    {
        "custom_identifier":1809,
        "t1":1591,
        "t2":1681
    },
    {
        "custom_identifier":2163,
        "t1":1591,
        "t2":1681
    },
    {
        "custom_identifier":1961,
        "t1":1591,
        "t2":1681
    },
    {
        "custom_identifier":1746,
        "t1":1593,
        "t2":1683
    },
    {
        "custom_identifier":2243,
        "t1":1593,
        "t2":1683
    },
    {
        "custom_identifier":1810,
        "t1":1594,
        "t2":1684
    },
    {
        "custom_identifier":1748,
        "t1":1594,
        "t2":1684
    },
    {
        "custom_identifier":1959,
        "t1":1594,
        "t2":1684
    },
    {
        "custom_identifier":2181,
        "t1":1595,
        "t2":1685
    },
    {
        "custom_identifier":2067,
        "t1":1595,
        "t2":1685
    },
    {
        "custom_identifier":1811,
        "t1":1596,
        "t2":1686
    },
    {
        "custom_identifier":1778,
        "t1":1598,
        "t2":1688
    },
    {
        "custom_identifier":2175,
        "t1":1598,
        "t2":1688
    },
    {
        "custom_identifier":2254,
        "t1":1600,
        "t2":1690
    },
    {
        "custom_identifier":1812,
        "t1":1601,
        "t2":1691
    },
    {
        "custom_identifier":1752,
        "t1":1601,
        "t2":1691
    },
    {
        "custom_identifier":2278,
        "t1":1601,
        "t2":1691
    },
    {
        "custom_identifier":1753,
        "t1":1601,
        "t2":1691
    },
    {
        "custom_identifier":2173,
        "t1":1601,
        "t2":1691
    },
    {
        "custom_identifier":1821,
        "t1":1602,
        "t2":1692
    },
    {
        "custom_identifier":1813,
        "t1":1602,
        "t2":1692
    },
    {
        "custom_identifier":1814,
        "t1":1603,
        "t2":1693
    },
    {
        "custom_identifier":2182,
        "t1":1603,
        "t2":1693
    },
    {
        "custom_identifier":2164,
        "t1":1605,
        "t2":1695
    },
    {
        "custom_identifier":1815,
        "t1":1606,
        "t2":1696
    },
    {
        "custom_identifier":1817,
        "t1":1607,
        "t2":1697
    },
    {
        "custom_identifier":2151,
        "t1":1607,
        "t2":1697
    },
    {
        "custom_identifier":1755,
        "t1":1607,
        "t2":1697
    },
    {
        "custom_identifier":1816,
        "t1":1607,
        "t2":1697
    },
    {
        "custom_identifier":1963,
        "t1":1608,
        "t2":1698
    },
    {
        "custom_identifier":1818,
        "t1":1608,
        "t2":1698
    },
    {
        "custom_identifier":2229,
        "t1":1609,
        "t2":1699
    },
    {
        "custom_identifier":2179,
        "t1":1611,
        "t2":1701
    },
    {
        "custom_identifier":1979,
        "t1":1614,
        "t2":1704
    },
    {
        "custom_identifier":2261,
        "t1":1614,
        "t2":1704
    },
    {
        "custom_identifier":2222,
        "t1":1615,
        "t2":1705
    },
    {
        "custom_identifier":1758,
        "t1":1616,
        "t2":1706
    },
    {
        "custom_identifier":2183,
        "t1":1616,
        "t2":1706
    },
    {
        "custom_identifier":1822,
        "t1":1618,
        "t2":1708
    },
    {
        "custom_identifier":1962,
        "t1":1619,
        "t2":1709
    },
    {
        "custom_identifier":1761,
        "t1":1619,
        "t2":1709
    },
    {
        "custom_identifier":1760,
        "t1":1619,
        "t2":1709
    },
    {
        "custom_identifier":1972,
        "t1":1620,
        "t2":1710
    },
    {
        "custom_identifier":1980,
        "t1":1622,
        "t2":1712
    },
    {
        "custom_identifier":1801,
        "t1":1626,
        "t2":1716
    },
    {
        "custom_identifier":2189,
        "t1":1626,
        "t2":1716
    },
    {
        "custom_identifier":2115,
        "t1":1629,
        "t2":1719
    },
    {
        "custom_identifier":1899,
        "t1":1629,
        "t2":1719
    },
    {
        "custom_identifier":2228,
        "t1":1630,
        "t2":1720
    },
    {
        "custom_identifier":1764,
        "t1":1633,
        "t2":1723
    },
    {
        "custom_identifier":1799,
        "t1":1639,
        "t2":1729
    },
    {
        "custom_identifier":1800,
        "t1":1647,
        "t2":1737
    }
]