[
    {
        "e1":1734,
        "e2":1737
    },
    {
        "e1":1737,
        "e2":1743
    },
    {
        "e1":1743,
        "e2":1748
    },
    {
        "e1":1748,
        "e2":1752
    }
]