  

 

Number

 

 

P

 

 

 

 

 

 

 

 

 

 

 

 

338
= N° of seconds | Number | Numbers of 2
‘6 à Instrument to which Mi- | of Mi- Times Triangular Error A? Remarks
= eroscopes read | croscopes| observed + ?
ee E20 1
Aa DES 12 #22 = 2 93 125 185 0,85 0,7225
15 do. 3 do. “41 08 78 0,75 0,5625 |
16 do. 2 dor ll 10 08 0,1444
AG do. 2 co 74 Vo ji 0,13 0,0169
18 DS 10 ne a2 a do. 75 74 134 0,9409
19 do. a do. 6 196 70 1,3689
20) Te S12) ne 20.3 2 do. | 92 66 90 0,3969
DI | ESS 12 me 1a. 2 5 do. (142 102 199 \ 042 0,1764
22 R&S. 12 eek = de‘ 68 183 56 0,1369
23 do. 2 do. Don 1 1,4641
»4 ES 12 nd a. 2 = do (bi 66 53 | 0,0324
25 DES le ne L | 3 do 51.48 58 | 0,56 93186 |
26 do. Ss do, | SI: 0 | 0,0009 |
27 do. 2 de oi 70 61 | O11 0,0121 |
28 do. | = dor 248 11 53, 0:69 | 0,4761 |
Series Great Salween.

1 T&S. 12" n° 3 = 2 63) 6357 0,69 0,4761
2 do. 3 do 64 65 7% 0,67 0,4489
3 do. a do 4 10 un 65 0,4356
4 do. a do. 77 68 63 0,26 0,0676
D GS 19/0 n 20.8 3 do. | 638 66 119 0,0144
6 do. a do. 65 109 67 0,0196
7 do. eo do. 60 128 69 0,24 0,0576
8 do. 3 do. | 60 56 68 0,2500
9 Mess. 12 n0 2 = do 7) 57 64 64 0,86 0,7396
10 do. 2 do, a 10 6° | 0,7225
V1 do. = do. | 64 70 64 0,38 0,1444
12 do. S do 053 68 WA 0,1444
13 do. = do. 1 Ol 85 0,95 0,9025
14 do. a do. | 70 69 64 0,0049
15 do. 4 do 2 62 75 0,22 0,0484
16 do. io 12 66 C0 0,0324

 

 

 

J slit

rd i A ek Bb

akku

ton!

I

nn eh pâte x Hélas 9

Dao sain Mil |
