 
   

 

~ 1, — Autriche-Hongrie.

 

- DIRECTEURS

  

}

 

 

  
  
   
   
  
 
   
   
     
  
 
 
  
 
  
  
  
   
  
  
 
  
 
    
   
 
 
  
 
  
 
 
 
 
  
  
 
 
  

 

   

uda Grizi.......
ise de Scutari ...

'erme Ouest.
ise de Scutari....

eee eee DOUCE ET OBSERVATEURS INSTRUMENTS | REMARQUES
....| 42°41' 14"| 35° 46! 15"|| 1870-71-81 | Gyurkovich, Lehrl. es n° let 4 de
100: N
ee 434128436 | 6 1870-81 id. ide >>
142 341) | 36 12 38 1869-81 Pott, Lehrl. À Reichenbach n° 2 de
2 . 12 p. et Starke n° 4
‘ as de 10 p.
= #2 2056180 3 9 1869 Pott. Reichenbach n° 2 de
; 12 p.
a 42 2 990 11.7 1869-71 Pott, Gyurkovich. Reichenbach n° 2 de
: : 12 p. et Starke n° 1
de 10.
ee: 122390913029 7 1869 Pott. Reichenbach n° 2 de
20.
a te te 22 19 a7) 36) 39 29 1869-71 Zezschwitz, Hartl. Starke pn. 1 eh 3de
: 10 :p.
1 0 15 #50 91 19 1869 _Zezschwitz. Starke n° 1 de 10 p.
20885 1:36 52 41 1869 id. id.
42.290,31. 041 1869 id. id.
42° 943 87/10 11 1869 Ganahl, Hartl. Starke -Un. de 10 p.
eune 3de 10 p.
2 010, 37.11.35 1869 Ganahl. Starke Un. de 10 p.
42 630 ,3713 18 1869 id. id.
terme Bst. : |
ee 12 154 37 15:32 1869 Zezschwitz. Starke u» 1 de 10 p. |
A Dl 50 537.950 1809. Pott. Reichenbach n° 1 de |
. = 12 p. |
ne 41:83 20 1.37 10 4 1869-70 Pott, Hartl. Reichenbach n° 2 de
+ jap ersvarke n°5
de 10 p. |
de Ate 054 97 520 1869 Sterneck, Pott.- ‘Starke Un. de 10 p. |
ue et Reichenbach n° 2
de >».
ek, 43822 37 19737 1869 Sterneck. Starke Un. de 10 p.
nn Al 724311015 1869 Kalmar. Reichenbach n° 2 de
: I22P.
ne aA 0.113.203 1869 id. : id. |
ee 10 54.20 | 37.13.50 1869 id. id. |
40 54 45 | 37 25 49 1869 Pott. Ertel:de:9. |
een Ay Au 353% 150 1869 Sterneck. Starke Un. de 10 p. |
er : 40 89 20 | 31 1] 35 1869 Kalmär. Reichenbach n® 2 de |
12 p. |
ern 40 29 47 | 36 56 30 || 1869-70-73 | Sterneck, Pott, Steffan. Starke Un. de 10 p., |
4 Reichenbach n° | de |
| 12 p. et Starken? 3 |
à : de 10: p- |
Au 22 4,3, 150 1870 Pott. Reichenbach n° 1 de |
In: |
Pe | 40.13 28 57 11 3 1869-70 id. Ertel de 9 p. et Rei- |)
à chenb, n° de 12p. |
| 50 50 80 31. 53 14 1873 | Sterneck. Starke n° 4 de 10 p. ||
BO Ad Aa 231732 21 | 1810-18 Pott, Steffan. Reichenbach n° | de |
| : 12 p. et Starke n° 3 |
Fe de 10 p. |
eh 304 7 | 37 22°39 | 1870-73 id. de |
= 20 367 38 | 37 27 20 1873 Sterneck. Starke n° 4 de 10 p. |
39 37 12 | 37 35 54 1873 id. |
an 49 19 51 | 36 552 1875-76 Gyurkovich, Trojan. Starke n’ I.de 10 p. |
Po | : 9. et n° 2 de 8 p. |
. | 40 499) 35 49.15 1883 Englisch. Starke n° 2 de 10 p. |
; 80, 20.07: 1883 eer ids id. |

 

 

 

 

ds

 

 

 

 

 

 

 

 

dslais

darin

Kia
N
N
R
