 

 

 

 

 

 

 

 

 

 

 

 

h 2
p a b @ d e
Meter. Kilom.
l 1.855589 | 4,1 0.909 ed
2, za 006, 106 1 |
3, 3409 1.0 | 1.000 ul
‚a 1234113 | 1500 0.069...)
5, 072006 | 06 1.662 0 l
6 0.0002 07 19 —4 1 |
7 280295 05.1. 2006) —ı |
8 | 0,37026 | 1,1 | 0,909 l |
| 6.050957 05 | 2000 | I |
0, 630000 0 3 2
41 |ı 0.084 | 01 | 10.000
13 | 0.3238 0,5 | 2:00 | |
| 3809 0,800 | A
| 020005) 3332| | l
|

 

 

 

 

 

 

 

Nach Fig. 1 bestehen 5 Bedingungsgleichungen, welche zu der gleichen Anzahl von

Widersprüchen führen. Die Zahlenwerthe derselben drücken wir ın

Millimetern aus.

Goefficient der Normalgleichungen.

 

 

aa ob] cc - [da :
2... = 0% 43 >= 1,0 +]-15 >12
a in = 05 e ıı [= m []=0 [7]=05
“ 5 | DB p_ p p
el bd : ce S ee 5
we, im [= 9 = _ u =, [= 1
P_ m p p
ad be
w—h,—h, ho — 071 5- >)--12
w=h, th, —Rhaohsth,= 2,79 = 0
NORMALGLEICHUNGEN AUFLÖSUNG
4A3k, + 1,1k, 009 =0 k, = — 0,17856
im rin Oh +06 Far od ri  aamzd
— 0,7k, + 15h, + 0,7Kk, — 0,60 = 0 k,=  0,92024
0,6% +12, +05, +0,75 = 0 KL, - 12

2, +0 ee db aa

no 1.

 

 

 
