+ 0'006
+ 0005

+ 000% Pende

+ 0.003

nn ee oe

— 0.001
— 0002
— 0.003
- 0'004
- 07005

— 0.006

 

+ 0/006

+ 0/005

 

+ 000%

+ 0.007

 

|
oO, |

— 0.001 à
— 0/002

— 0003

a AR

- 0.004
— 0/005

- 0.006

oh 1h al Bh 4h

ADR LP ET

vr

7

 
