 
    
 
   
   
  
 
   
  
  
 

 

 

   
   
  
  
  
  
   
 
 
  
 
  
 
  
 
  
  
 
  
 
  
 
  
  
 
  
 
 
 
 
  
 
  
 
  
  
 
  
 
  
 
 
  
 
 
 
   

 

 

 

 

 

 

 

NOMBRE
AUTEURS DES INSTRUMENTS LEUTDRD DORE DES |  ERRBURS |
: EMPLOYÉS a N DE CLOTURE
BT zen ae re | Ban A? REMARQUES
ee di 1 i TRIANGLE m EMARQUE
PDIAMÈTRE DU CERCLE nn ee OU DES CHAQUE ANGLE
os N MICROSCOPRS ' eh
i HORIZONTAL MICROSCOPE nn CHAQUE |
u à : 3 DIRECTION ae — |
‘Brauer D= = 10 p. angl, = 254% ee 2 6 6",88 | 47,3344 | Observations de 1883-
it 7 iQ id. id A 0, 2916 84-85 et 86.
tee id. id. id. id. 1.202 1, 1449
ee id. id. id. id. 5.01. 25.1001
+ id. id. id. id. 7,88 54, 4644
2.10. id. id. id. El Lao
Triangulation de la Crimée.
Brauer Dre 10 Donel: = - 254mm an 2 de 5 à 12 2" 15|. 4, 6225 | Observations de 1888.
id. id. id. id. 90,88 15, 0544
id. ide id. id. 1,92 | 2, 9104
id... id. id. id. 0,02 | 0,0004
; id. id. id. id. 1,20), 1,1641
a id. »- id. id. id. 1,61 2,5921
nz. id. id. id. 02 2, 6244
oe . ld. id. id. id. 2 37,220
ne id id. id. id. 3,44 | 11, 8336
a de id. id. id. 3,78 | 14,2884
a id, id. i id. id. 15 65 2 6069
Aie SS id. id. id. id. 4,16 | 17, 3056
we „nad. id. id. id. 0 , 89: 0, 7921
(oe id. id. id. id. 3,06 9, 3636
ide, ds id. id. 0,42 | 0,1764
x Sid. id. id. id. 4,89 | 23, 9121
id... id. id. id. 4,63 | 21, 4369
id: id. id. ids ie 48 | 0,2304
cid, id. id. id. 5,06 25, 6036
id. id. id. id. 0,26 | 0,0676
id. id. id. id. 2.18 7, 1284
ad: id. id. id. 3,57 | 12, 7449
id. id. id. id. 2,07 | 4,2849
id. id. id. id. 5,38 28, 9444
id. id, id. id. 4,61 | 21, 2021
id. id. ide id. 0,13 | 0,0169
id. id. dd id. 0,99 0, 9801
ie id: id. . id. id. 2555 6, 5025
ed id. id. id. 0,37 0, 1369
ld. id. id. id. 0,45 0, 2025
dk. dr id. id. Oy at 29, 9209
id. id. id. id. A 73: |. 22,3729
„id. id. id. id. 3,09 | 9,5481
id. id. id. id. 0,10 | 0,0100
id. id. id. id. 0,77 | ~0,5929
Id id. id. id. 3,40 | 11,5600
on ad id. id. id. 2.20 | 4, 8400
ie id. id. id. id. 0,15 0, 0225
or id. id. id. 4,64 21, 5296
nn id. id. id. id. ie 18, 2329
= tl id. id. id. 3 30 10, 8900

   

 

 

 

 

 

 

 

pets dada

dual
