 

}
H
|
i

i
|
i
|
|

 

 

 

STATION

53 Kiel. Point géodésique,

1887

54 Weper. Pointgéodésique.

| 55 Schneekoppe. Point géo-

désique

56 Tockenberg. Point géo-
desique

57 Kniel. Point géodésique.

58 Jerxheim. Point géodé-
sique .

 

 

DIRECTION

Azimut.

 

Hohenhorst. Point géo-
désique.

Tockenberg.

Gröditzberg. Point géo- |
désique.

Weper.

Jerxheim.

Kniel.

 

"

166 47 37,26

Pas encore
calculé.

1 34 48,24

Pas encore
calculé.

 

=

|
Erreur
probable.

2048

tz 0,08

 

   

OBSERVATEURS

Richter, Galle. || !

I

Low, Westphal. I |

Albrecht, Richter.

nr

Löw.

ne

IB
Sehnauder. |
|

 
