 

 

 

 

 

 

 

Non

 

 

|

|
| 690
| TLO

| F0
| 960
‚110
| 800

610

 

| FTO
| FLO
| 910

 

 

680
850086 ı

‘RIUBIVO eis Joy) 'UTJOSUTJ 91 SOA MUM monKoeTeo, Sue was mern Tom: IS N
josu] oy9sıaedır] | ITU IJIZIS [IL 1904911380 ‘Y

|| ud

DO)

'9T0'086 |

| 626 616

{

|

|
|
|

|
|

LEO" 086 |

|
|

| L66°6L6 |

 

+

A

i

Als

1

AB

1Q
==

a

au

+++++++

I

ie

960
rel
660

080
SIT
Jer
890
OgO

TS0° O86

Wo

°p

 

8681

il
L68T
s6sl
L681

a
S68I
LOST
6681

1681

6681
LO8T
6681
0061

1681

u

0061

gef |

 

 

| 968° 616
\ 270086

10

D ©

90086 |
| 996" 6L6

D

| 210-086

TopyoRgoog WI eYOH

 

 

GW

6:88

LY
Oe leis

|6°0¢
| G:TF
| 8:87
De

ea

AE
VV

(OPO

Gi À

‘ueIShyY pun ujpsuf usJaBquoBUeg puN uaıızis Jne uadunssaw

 

9SUB'T

 

BUIULIOBT,

®SSOJSENSUNT

COU OLLOJVAIOSSC

 

C

3

1Q

‘djv-jour viorw0zuey)

D

avert F

BAONUBUIYEN

BIDOU CUEAT

OIMETT ‘IN ‘U ‘OOUTTAL

e{susny

 

LDU9ong

 

VSNOBIIG

OUTTI8X

‘e addndyg

 

4

u

uarızıg

 

puerf

 

RIO,

27

8

 
