| m oe

NSP ANNE RENE |

eR

an AR

ol Re

Knivsbjerg.

4,2229196
4,4423115
4,4319151
4,3559643

4,4179929
4,1851100
4,4319151
4,4532672
4,1505198

4,3559643
4,1851100
4,3938858

4,3938838
4,4179929

0 ! i 6 I
Skamlingsbanke !. 3 a... ..\ 0 00 00,00 0 00 00,00
Dyrebanke a WEDER... 0 47 02 57,92 47 02 57,72
LeerbjergiY.. tn. Va 16.58 22,73 16 58 22,88
Lysabbel SE N 111197 54,17 | 2111 2% 53419
Leerbjerg.
Fakköbjerz. .- nu. ce 0 00 00,00 0 00 00,00
Lysabbel ..:  sanscysı. 2 67:31 27,49 67 381 2877
Knivsbjere} ...(aaeaqne a. «bh «4 124 35 08,35 124 35 08,33
Skamlingsbanke sascnsa. .L . ¢ 159.33 41,69 159 33 42,34
Dyrebanke....... sen 202 11 19,25 202 11 19,56
Lysabbel.
Knivsbjerg. 2.2.0082... 0 00 00,00 0 00 00,00
Leerbjere Isa... 00 0.0.0 88 26 54,47 88 26 52,87 |
Pakkenjers - 0 „166 04 42,45 | 166 04 42,06 |
Fakkebjerg.
Lysabbel 0 ken. 00 0 00 00,00 0 00 00,00
Leebjesn u. 2.200000 34 50 44,65 34 50 45,60
Zweite Abtheilumg.
Lysabbel.
a la
Fakkebiers oa. oe 0 00 00,00 4,3938858
SPÉRE Se 60 42 25,54 4,4133077
Fakkebjerg.
Bungsbere hee. ii At 0 00 00,00 4,4802326
Spienze |. 52 09 49,02 | 4,4086271
Lysabbel .....0. 113 59 49,71 | 4,3938858
Sprenge. |
Lysahbeliii.h . 2,1080 UM 0 00 00,00 | . 4,4133077
Fakkebjerzs..i... . . 20 ; 57. 2739,15 4,4086271
Bunssbeisst,.h.. 2240. Da Oe 130 55 06,60 4,3960872
Hehenlonsti,e... . - Sa ER 174 30 29,15 4,0757722

 
