 

259

ERRATA

Page 18, ajouter à la dernière ligne (siehe Beilage A. Il).
» 23, 6e ligne d’en bas, lire (siehe Beilage A. VZJ au lieu de A. Vi.
» 45, 12e ligne d’en haut, lire Hevr au lieu de Heer.
» 93, ajouter au deuxième alinéa : (Voir Annexe À. III).
» 103, dernière ligne, lire : Herr au lieu de Heer.

4 ‘SS

r
|
|
|
:
I

wi ml

In a wi

 
