 

 

PP POTTER 111

 

 

 

 

Ho RE

 

 

 

 

 

 

 

 

 

 

 

 

 

 

 

 

 

 

 

 

 

 

 

 

 

 

 

 

 

 

 

 

 

 

 

 

 

WME TT FT TTT TT Witt it wl een N ee !
| | |
SIC'E COSC, 980,8 981% 1866 LICE | 3956 | 8608 981°C 0F6 © | 1668 663° 0108 694° bIo:c 7 uean\
| I DS A eee ser he | ES bs
ae Se ee ne SEE 866 § | 7886 VLOS 989 8 068 G 686 & 7386 660°S S6L 6 6766 ood:
961s TLS 6508 OSLG 1686 VOLE | SEG | US OFL% 188% | STE 7066 | 0866 199'% 668 G “AON
LET'S LLY 9866 999°6 968°C COG | S076 | 1306 VVLG 6686 686 § 089° 6L0'S GOL 816 G PO
8868 8696 SONS L8G L966 906E | 669% | 80S VPLS 968°G 0868 LELG | 861LE 068 6 686 G Ades
SOS 199'% CLAIRE 8086 0966 66 SG | 06L'G EIS I93°% 166% || 396% 669 6 680°S PO8'G 96°C ony
1968 CIC Kl 9FS G 7666 || 89886 | 969% Gol E18 si || OIL tS 819% TOT'8 6686 1966 mp
TOT'E 019° | OLS F086 $566 BGG 1060 ce OLS LE8G $166 9668 8996 GSLOS 6086 856% Sun
866 8 S76 | OILS L68 G G86iG || 0965| 9690 | relic 898° 8866 GLI§ boro | some 8916 168% ev
ESS |. 819 | gaben] LOL TMOG | ASCE. | 00S | sols 608 6 S966 || GL6§ TONG | Ges S686 6166 qudy
CLGS | 689% | SOLS | 208% ae | SPSS | LLES 90T'S SSLG 666% CVS 6 POV G CUS | IC L666 YOTeIAL
61S | 8893 | 8662 OOLG 678% | 8666 | 8676 660 & 6840 886°C OLC & 087% | S966 OIG 608°G "au
808 8 | 889% srLE $986 OOO 1 See one GO 908 G 0466 0168 Sc, 1805 | 1946 9166 “uel
"VIHDDHAVLIAID £0 88OV5 ary,
| | :
180° LOP 1 S86 LEST 706 L sole | 189 1 | GGG'E S738 I OG6L || 8LLG 989 I 666 T S738 L ©66 | | UE
3 A 2 Sale |
SFO'G 066 L 888 L TPL T Hals: LS0'e | O0ST PSO TL POST 6,81 SLT 679 T 686'L GYS TL STGT 09
926 L OCP TL 1061 9LLT 888 L 6806.) OO 806 L OLE TL C8 L 7506 9691 Sool 6LL 968 L “AON
P96L | SLUT L88 TL SPL 1 cist 0606 | CLOT GGG L GIS TL LS8T 90TG LPL LT 666 L 698 TL ISO PO
6808 | 99TT L96°T 868 1 LOST 6906 | L99'T PVT GOST PLS T LOL G 168 1 L60'G S68 L 996 L dag
0C0 & GSLT SLG'T OES TL LO6'L OSG | SELL P96 TL 968 L S68 L 970% PLT SOON 608 T 688 L “OLY
001% YLLT 6106 LSS L PSO L 710% | SLT SLOG pcs L 966 L 7806 892 LE 010° 668 TL 66 L Amp
OLTS IST 180'% SL8T 6S6 T OG | Sia I 900° LIST IS6 TL SSL G SLT 990% 688 I POO TL oun
971% sell 020 & GOG TL L86T So | cO8 Lie [O0 LG TE 986 EL 860'% 9GL'T 60076 668 L 166 L sem
°60'% 809'T G66 I 668 L SEG) TE Im | © Slt 90’ LOG'T S86 TL 606 G PrL | 610 6 L161 866 L [md y
LOVG Lov T L60'G 068 L 8C6 I OVLG | SIT | 120% YIST sro L 7866 609'L 960°G [88 L 896 L UOTE
LELG 1990 996 L 98LT 98 T GEO | ST 6006 Syst SchL 090° SIT TL FSs’L VOLT POS L “Fou
1066 OSLT LL0°G 166 L 966 L CCGG | Seil | 860% OLST. 676.1 ae TS ey. See oe eee ue
| |
5 EE S ee a seul ea © = u SE == 5 BE; wn
ii. 2.21 2 | 22. 22. 0 2.2
rae =. © © “oO ea ee ee eo 5 © DE me = ® ee
ee 8 à ® 3 el ae cee © = 25 SE: 2 2 =
cOGE | TO6L COGY

 

 

 

 

 

"VINYLYQ 40 490V9 GI,

 

 

 
