 

 

126

 

 

 

9.191Yu0
9sBq BI ap 9feI0} orgqegqoud anadıı

SO TanoNe

sa9ansout 999 ‘JusaA NP 99UEJoTA op
oyıns ıwd ‘Juo suorgoes sonbjend)

"9067 U9

9A0IU9 IESIEF 9] UO HULLIOI *ure.LIog
9] Ins 9OLUUOTEI9,T % E9UOUNL UO
"uyF 9P SU0LI99S
"ouuskowm us moy,T % T6wyT

"9NLToPoPyI ne Juowsausıy'sporda.uarop
nor] ne [os 9] suBp S99U0JU9 xuald

money U9 99 uejd uU9 sourg.1Xxo

sı10ddns xnop so[ ıns gusıpe uegqn.ınp
now ne oueıppurnegur qıoddng

'O'uuf ® 97809 389
9.191Ju9 9seq e] ap arqegoad manuıo,T

d

"0GEL0WIOLZ
— jesseg ap [reredde]| 9948 gEgT

uo 9amsow 8 saıde,p ınonSuor]
“ « « _— (moyaı op) aımsow op
28239 18% SIy  (OITE,p) aansou sg
“ « « — (amoaı1 op) amsowW 9%

083.79 627 SIy  ‘(aorte,p) ansout a7

Telweyg % 707 +
‚sopegutg & zg FF
wuu

yıoddeı of saade,p
‘Juos SOJL}oF sSOUU9AOW S.ANa.LIDO SOT
*H 9p 9Ww.oJ U9 U0OI9S % 99
[oyoru aoT98 u9 450 adA4-aTogu ®T
u049q uo
saoıjıd sOp ms sPxy; Yuos uoleI9
9sgq BI 9p Sedo9so.mrw-o4.10d So]

-999 Yu9wsuuoloes ‘syurodde sap
eınsowm *ınento,] 9p TNaJeY

:s9Ye[od 9199,p yuwgLIou SITE

| (‘ra 2) 09700 +
726 OS ="

wur w

 

(Ta) 817000 + "q ung
| Be pa.) Y9AB Jınsoun
0676 en =, woc ap moyeıed

c SH ] -woI un 9ANO.LI 98
(Fra — 4) 2000 + | no “uogdurgsemn %

1,6 +08 = "EL |spaepurygzoneomg

uw w |

 

 

|

| T20 — FE = 787 U
| 820 — Fa = 187 ou
| geE0 + F2 = 087 „U
| 270 +72 = 628 U
| ww wu 3y0L |

op UOISU9} el snos 99

oSL 9p aanyeapdursr BI ®& | LI6L ug

:(9. 838.000 600 0-DI="T, RSF9A1g % SYUUOTLIY9
uol}EYE]IP 9p SITNWAO A | 939 Juo SIE so]

|
|
|

sado9so.daLu
DT -08="4 x sınayewwduoo op

7 OT

wur un

:JIn9J91g %

O0 Ed |

 

-194 9] INS Issne 49
| OT6T u0 £zE
\ ‘906T U9 COLT 2 FOL

 

| Seuuofel?,p

| uoryere]lq | 9P99014
| sopsaı sop suoryenb} uoste.tedunog OP
| 5 suofeIH
| :

 uokow ne 9gwyWwuUTE. |

AA9WOUL
, -wuÄp ne uor
-981] 9Pp SOJIY
cT snos Zuof
OP wg 9pP ABA
| -ur,p suegny

|@82. 79 187 087

"617 soU uFz
|op «eaur SI
‚olep Yerı
op feaeddy

&z& 20
| SOT "FOL sou
| zeaur sig €
| <OF ‘FOT sou
| u0g 9P
| goquedaeg

\TINSNFAT RO SBUUOTLIH EAUT SZ xnoq

 

s9Kojdıud
| spoweddy

‘

000002 _
1
| no |
TFT LIRETGTET
wuut u
-000°009°E
t |
T9°O | SIFZTIOLZ
ww in
| | T ‚op ouuoflou
opnyıyye 1%)
eo | 6z8ETT0L
un tu
| ‚000‘008'z |, (oseq uı
| 1 ‚9Pp 9uuakowu
| 9PTMaTE9 no opnymete
uoN 070 == a

|
| wu | au
|
|

| JALyıuop | ayuaredde

——

Joul e[
| op meanru

 

 

\ opgegoad meum |
\

)

)

9AIJEIO.L AN9LIT 49 n®B oYmpaıL

| onbrustuogey ı es late
o anon3uor

 

  

 

|
| oqnop |
606T |
mg Ss ıL | 'zaL "moyuers
onbıwauy,p
| | SIND-SLVLH
ussusf | |
ourendeg
“uosuwyof LI6T |
suregden) ‚(s107 g ansou)|
‘puegjouo]o,), veuy
MUVNANVA
|
9a | LI6T
ANOIIaUT | re4eseyYy
|
Den OT6T |
AnopaUuq sopewigd |
TIIHD
|
| sa.ınsouL
| PSRmON | sad np
s.moyeA1asgO & os
‚ ep op onbody woN
| aseq ®L
| ®P uoryeusısp(q,

 

 

 
