 

R= Os 53 51.0116

R= 53 31 01.2032

ne 5541909077

Kulsbjerg
Magleby .
Gjörslev .
Snoldelev
Petri .

Nicolai

Falsterbo

Kongsbjerg .

À — 55 36 2478962

Falsterbo
Nicolai

Bolmershöger .

x“ OD”

Kongsbjerg .
Store Möllehöi.

Nicolai
Malmö

Bolmershöger

p= BD.

Vigerlöse
Store Möllehöi
Kongsbjerg .

96

a2. Punktet Baursberg.
lt = + 2° 47° 209071

33. Punktet Niendorf.

= + 2° 37° 37.4925

54. Station Store Möllehöi.
2 ı 02 09.16.4880

Log.d.Entfern.
in Toisen,

91 41 21.78 4.3470820
192. Al: 50.37
145 05 25.56
itb 57 931.01 4.2552542
195 02 50.32 4.3256482
194 07 30.16 4.3257767
255 530 09.12 4.1263411
al 51 41.99 4.3098850

Azimuthe.

35. Station Malmö.
1 = —0° 25' 374951

29) 20 ol 28 4.1494413
106 54 26.21 4.1528529
336 25 21.93

36. Station Falsterbo.

23° 0174951 {= — 0° 14 260555

22° 591.209 .52 4.4139305

14..09,..39.99 4.1263411
155 46 03.37 4.2667113
209 18 17:07 4.1494413
243 02 34.66

5°. Station Kulsbjerg.

00 387138 = + 0° 34° 1171867

2 10: 05 5 42383255

217 26 54.92 4.3470820

218 45 18.12 4.2224604

  

u Ha 1 Ai

ru.

La nik ih

A aka man 11

A jis ee Aal ka

2. oee0uasttiones masses DA |

 
