 

  
   
      
     
    
   
   
   
 
       
   
   
     
 
     
   

20

 

 

 

73 Krummenort (point tri-
. gonométrique) .

74 Schleswig (point trigon. )

75 Handewitt (point trigon.)
76 Fingleff (point trigon.) .
77 Knivsberg (pointtrigon.)

78 Sophienhoi (point trigo-
nomerrique) .*. .

79 Golm (point astron.)-

80 Glienicke prés de Zossen
(point astronomique)

81 Eichberg (point astron.)
82 Hagelsberg (point astro-
nomique 1885) .

Hagelsberg (pointtrigon.
de V’Institut géodési.)

83 Hubertsberg (point tri-
gonométrique) .

84 Herzberg (point trigon.)

I man = = = Re a
Erreur
TAT ‚atitude. OBSERVATEUR.
STATION. Latitude broBabie,

 

 

Ss © / SE a“
54 20 55.89

54 31 46,39

54 45 39,99
54 56 54,82

bb à #69

OT
0

16 16,19

jt
ID

18 57,34

EX
à
x
uw
oO
On
~

ZT
wu
O0
©
eg

51 54 43,9

51 41 35,2

 

 

Werner.

Fischer.

Sadebeck, Albrecht.

 

À I
Hauteurs  circumméy, |
diennes. Instrument

universel.

   
     

|

   

  
   
