    

 

 

 

 

 

 

 

 

 

 

 

 

| 10
| ‘OMS DES PAYS | LONGUBURS | oe
| NOMS DES LAND. | NOMS os ee | PROBABLES | DÉSIGNATION
| DESIGNATION DE LA BASE u CALGULÉES = ie
| ET ANNÉE DE LA MESURE < "EURS BE ERREURS. sopannins nes . à
| a l OBSERVATE S, : TEE ILS ES BASES EMPLOYÉS. |
| SIMPLE OU DOUBLE. AU NIVEAU DE LA MER.| RELATIVES. A)
| '
N m
: 6. Base de Kranichsfeld De Rueber, 5697.3655 Non Appareil autrichien décrit M ‘
| (prés Marburg) Breymann, calculee. dans le volume Ie des Mh
| DI, = Trapschia, Voir note 3°. «Astronomisch-geodätische |A
1860. Walter. Arbeiten des K. K. militär M
l ; ae geographischen Institutes |
A > Si 5 , Y
| Mesurée deux foi in Wien >, ef dans a u
| lumelllder«Mittheilungen —
des K. K. militär-geogra- _
| phischen Institutes ». ||
|
| 7. Base de Josefstadt De Ganahl, 5257.1876 | » »
: Vaener, Ettner
1 Boheme). Wagner, Ei Ô À
| = ) Merkl, | 4
. 1862. de Hittnern. 4
i Mesurée deux fois. |
:
| 8.Base de Skutari De Ganahl, eure | » 2
il E ae à 2) ier ak VE !
| (Albanie). Tinter. Pric Klon,
q 1869 de Gyurkovic.
|
| Mesurée deux fois.
| 5
| 9. Base de Sign De Ganahl, 24754310 » »
a : ar
| (Dalmatie). Hartl,
i 870 Breymann, |
ij 1970. de Gyurkovic.
| Mesurée deux fois.
| 10.Base de Kleinmünchen De Ganahl, 3163.4126 | > »
{| x ss Hartl
près de Linz). Sin?
(I ) H. de Sterneck, |
| 1871. R. de Sterneck, |
| : | ee. |
| Mesurée deux fois. Randhartinger.
11. Base de Grossenhain De Ganahl, 1029,6320 | » » |
(près de Dresde). , „Hartl, | LA
R. de Sterneck, |
4 1372. à ee | |
| de Gyurkovic. | Bi
| Mesurée deux fois. | A|
1
|
| i
a 4
|
a
| .
| :
|
|

 
