ho

ZU Por

=

ESTER PERD PET TRIO CTP TENT IIT IE ER
’ ;

 

 

EN D ROMA

ION

DES POINTS.

Acklam Wold..... . |

Back Tor ..

Baconsthorpe, To-

CR.

Ballyereen..

Balsham Tower.... |

Barrow Hill

ee eu

Baurtregaum ......
Beachy Head ......

Beacon Hill

Beacon Hill, Tres-

cow......
Ben Cheilt .
Ben Cleugh.
Ben Clibrig.

Ben Corr...

Ben Heynish

Ben Hutig.

Ben Lawers
Ben Lomond

Ben Macdui.

Ben More, Mull ...
Ben More, S. Uist.

Ben Nevis..

Ben Tartevil......

Ben Wyvis .

Berkhampstead .... |

Black Comb

Bere see

 

 

LATITUDE.

56
55

F

57

19

42 5

13
12
44

hie

57
19

11

to OO
—I&

O9
oo

ArT

4
43

40

13
29

48
32

44

28

 

LONGITUDE, ||

16° 592 AB
16 2

15
15

14

Cr

b

Ou

 

 

ÉPOQUE.

1842

1800-43

1807-42

1843

1852

1801-14
1817-47
1792-1848
1801-42

1845
1831

1793-1845
1794-1849

1850
1819

1818-48

1839

1830
1822

1838

1841-50

1318

1847
1822

1840-51

1816
1822

1819

1823

1808-41

 

Vil: Grande Bretagne.

 

 

  

aa RE sss cS nee

DIRECTEURS
ET OBSERVATEURS.

Serg.-major J. Steel.

S. Wooleot, serg. Donelan.

Génér. T. F. Colby, capit. |

J. I. Pipon.

Serg. A. Bay.
Serg. W. Jenkins.
S. Woolcot, serg. A. Bay.

Gener. T.F.Colby,J.Gard-
ner, sero. W. Jenkins.

Gener. W. Müdge, serg.
Donelan.

Col W. Robinson, lieut. J.
B. Luyken, 8. Woolcot.

Serg. Donelan.

Major-gener.J.E.Portlock. |

Gener. Mudge, serg.-major
Steel, serg. Winzer.

Gener. Mudge, S. Wooleot,
serg. Donelan.

Capor. J. Wotherspoon.

Géner TP Colby, col.-h.
K. Dawson, lieut.-eol. A.
W. Robe.

Gener. T. F. Colby, J.Gard- |

het,*soro; ). Winzer.
Col. Robinson, capits. J. H.
Pipon,:P. J. Hornby.

| Géenér. J. BE. Portlock.

Col. R. K. Dawson, capit.
J. Vetch:

Génér. T. F. Colby, col. W.
Robinson, lieut.-col. A.
W. Robe.

Cap. P. ). EHoirnby, sero.
W. Jenkins:

Génér. TF. Colby, J.Gard- |

ner.

Serg. J. Winzer.

Gap: J. Vetch, col. R. K.
Dawson.

Col. W. Robinson, capit. P.
J. Hornby, serg. W. Jen-
kins.

Serg. J. Winzer.

Capit. J. Vetch, col R. K.
Dawson.

Gener. T. F. Colby, lieut.-
eol, A. W. Robe, col.
Dawson.

Capits, J. Veten, 1 Drum
mond.

Génér. T. F. Colby, lieut.

A Er Da Cor.

  

 

 

INSTRUMENTS.

Theod. de Ramsden

Théod. de Ramsden |
| Account of the ob-
| servations and cal-
| culations of the

id.

Théod. ed Trough-
ton de 2 p.
Théod. de Ramsden |

Théod. de Trough-
Théod. de Ramsden |,
dep. 1d. Gp:

Théod. de 3 p.

Ramsden de 3 p.

id.
id.
de
de
de
de
id.
id.

id.
id.

id,

id.
id.

id.
id.

id.
id.
id.

id.

id.

Ramsden de 3p. et
Tr 2
roughton de

 

REMARQUES.

{Publication du « Ord--
| nance trigonometri-

cal Survey of Great
3ritain and Ireland :

Principal Triangu-

|| lation; and of the

Figure, Dimension

|) and mean specific
| Gravity of the Earth

as derived there-

| from.» Londres1858. .

 
