   

| 428

 

 

 

 

 

 

 

5 : Erreur : M
STATION DIRECTION Azimut. OBSERVATEURS || _
; à probable. AE ES | trul
EEE
D.
32 Wendelstein. Pilier. . Rofan. 211:10 56,25 | #087 Oertel. PE
(a
(
ee
Li
|
| | B.
L
L
u
L
Te
ie
B. te
33 Wendelstein. Pilier. . Peissenberg. 278 35 13,41 | + 0,38 » |
34 Bogenhausen. Observa- Kampenwand. 127 24 15,09 | + 0,65 F la
mie. 2 2268, 2 8 is
{
a
| | |
35 Bogenhausen. Observa- Ismaning. | 29 38 20,68 | oc » |
toire . | ||
36 Bogenhausen. Observa- Baumkirchen. | 131 13 41,33 | + 0,58 » | |
toire . | | |
37 Bogenhausen. Observa- Wendelstein. 148 10 25,54 | + 0,42 Seeliger, Oertel. . |
toire . Aa ee |
38 Bogenhausen. Observa- Rauersdorf. 169 59 33,17 | + 0,5 Oertel. ar
toire . | |
Bes
| |
| | |
39 Bogenhausen. Observa- | München. 252 42 20,81 | + 0,48 » |
toire . |
40 Bogenhausen. Observa- Rauersdorf 169 56 31,23 | + 0,38 » |
toire. '
| : :
41 Bogenhausen. Observa- | Baumkirchen 131 13 44,30 | + 0,33 » |
toire . I
|

 
