&

33

1

 

 

 

 

(panıq oyaıs)

 

 

 

 

 

 

 

 

 

 

 

 

 

 

 

 

 

 

 

 

 

 

 

"go oulam |
== -ob[je nzasıy |
+ | 20808°6 « . 9€808‘6 | 778086 | zz |0 8 0% 1,3 |Kueperı -yodsna sgl
— 1.208086 « | zL208°6 018086 | Ca |8 °% 8’6h 27 | zyaung | 29V
— | 20808°6 erjlay £0808°6 | 31808°6 | 2% 0 17 64 27 | wsarauogayn | 991
— | 90808°6 « 10108°6 | 08108°6 | 7°% |0 7 Ger La | oe | g94
— | 608086 OUIIS A| LELOB6 | 8LLos‘6 | 7% |% GE ss 23 |" SUOZULIL | 79)
-F | 808086 « | 27808°6 | sg808°6 | z'z |0 98 81. 17 Dezoley £91
+ | 70808°6 ey || 08808'6 | 8E808°6 | 2'2 |0 7 Lu 49 |" 7sezsii) 9)
— | 80808°6 "T9U18IS "A| VELOSG | 99108°6 | FR |Lr eh egyLr r Seernz 19V
— | 80808°6 "erJLay 611.08°6 | 818086 | SIE 64 “9 29 | UOIOJuyoug 091
— | 80808°6 9UIaIS "a | @HL08°6 | 78208°6 | 72 | EZ 98 09 2 arg 68V
+ | 10808°6 esyjray 788086 | 69808°6 | &'z \0 98 gr 2a aRaueg sg1
— | 10808°6 « 08908°6 | e2L08‘6 | 72 | Sy 7% 2’gy 27 | Nonagqsuug 180
— | 00808°6 "NOUISIS "A| 87L08°6 | 88108°6 | E'z lo 9E sr 23 |" yOarıpıod 98%
-- | 00808'6 « 90808°6 | 81808'6 | 22 |0 L gr 27 | aolewln sc)
+ | 00808°6 ey 1 67808°6 | 89808°6 | z'z |0 8E 9‘7y LY Odueweunegg| yel
— | 66208°6 ‚190U11S "a | 16208°6 | 1r808'6 | 7° |zu + 7 TER, EA esy
+ | 862.08'6 “ep 1ay 81808°6 | 92808°6 | 2° |0 5 71 23 |'Senezsin-siy \uaedugn |zey
=r.11.6508°6 euygponiis’a GEBOS’6 | E7808°6 | E'z | 0 € sau 2% | Nlatn-oänenog | -U91A1ISEO | ycy
— | 16108'6 « | %6108°6 | @9808°6 | S'z |o 7% sau 27 | yoerımag | 081
| 962.08°6 « | 088086 | ze8086 | Sa | + 1% Eau 23 | neddad 67
-+ | 96208°6 "eyjlay 868086 | 77808°6 | 2 10 6 &h 17 BIOJBAIBA sHV
+ | £6L08°6 « | £7808'6 816086 | 9° |2C + 85 6.17 27. |" POUOS LyV
— | 86108°6 « | 28908 6 | 98208°6 | 9° |gr + 9% g°rr 2 | yosyeq 971
— | 66108°6 109g "a | EELOB'E | aLlos’e | € |6 + %7 vv 27 |" SurzuoN gay
+ | 86208°6 « 8E808'6 | 97808°6 | 2 |0 gE vv 27 | 1ou19AAdog 77)
+ | 76108°6 « 40808 6 | GE8o8°6 | Z'Z |0 gE or 23 |" spAuurg ey)
+ | 86208°6 « 11808'6 | 08808°6 | 8 10 61 8l or 27 |" Argyım-"zS arı
= | 86208°6 ei || 688086 | 07808°6 | 5° |0 81:02 | 01 29 |’ jolezg-ezsuf 571

&6L08°6 « 68908°6 | EELOB'E | 78 ar + 67 6 6:27 1° zuopnig | or

16108 6 « 871086 | 87808°6 | 8% |61 + OR | FR | AESSOUOBNT | 6£l

06108°6 « TELOS’6 | GE808°6 | Ga | + ko 8 27 |" uoduer El

06108°6 "NI9UIIIS "A || E9108°6 | 9G808°6 | S’z 1a + 97 0% SEHR. Uoayirng | LeV

06108°6 « 89808°6 | 88808°6 | 2% |0 se LU 8 27 |" POISOagA | geV

06L08°6 "ENJTay 07808°6 | 69808°6 | 2‘ |0 97 LU 8.27 | Wa ,pueuof | ser

wu u =D 0: Ei

oA I Q Q = n. a Be

ee e, a —= 2. Ce 3 © E "SUONEIS Sava zZ
S ze S "SINITRAADS = ©. By = ® = zaR . : l =
_ S 2.88 ANOLAIDSIO) Su A: = 8. 2:|2 ,8|e3 322 5

SEIN en. 28 =|% a &|S =|8 88% =o|s = 5 0 N S
za ge negaag en | or ins | Dee | 3 se 1, Ta lmguspen| Aawvı 8

= co ©> © nes © Ss les SE 5 =

ea 122 sa | I esse | >83 &

= Es Jesieale ii nn

 

 

 

 

 

 

 

 

 

lu]

 

 
