 

— 193 —

Erreurs de clöture des triangles desquels ont 6t6 mesures les trois angles.

 

  

 

 

 

 

 

 

 

N RT IL

 

 

 

 

 

 

 

 

 

 

 

 

 

 

 

 

 

 

 

 

: = i h LECTURE NOMBRE ERREURS
E rn DIN DoSmmarungs EN en DES OBSERVATIONS DE CLÖTURE
3 EMPLOYÄS DES EXECUTEES DE
5 un SECONDES a S
S \ ; VERNIERS POUR CHAQUE REMARQUES
n DIAMETRE DU OERCLE DD a OU DES CHAQUE ANGLE N
A U OU POUR
an MICROSCOPE AOL COERE CHAQUE DIRECTION
on | N ee
63 , Barrow 36" et Cary 16". : 59 34 35. 30 VENB: 0, 0324
64 id. = 5 3 27. 236 34 2.4 5,8081
65 id. S 58 2 25 98 07,2% | 0,0729
66 id. S 13 23. 23. 28 I 82 1, 7A2A
67 | Barrow 36" et Cary 16" et u 035 23, 29.26 1,02, 232104
Waush 24" n° 1. ©
68 | Waugh 24" n? 1 et Barrow 36". = 5 8 Ze 23 25 0,653, 07225
69 id. 2 55 A a 1,43 |) 2,0449
70 | Barrow 36" et Cary 16". & 53 24. 20 24 062 | 0,3844
7) id. = a3 2, 20, 24 0 ,40 0, 1600
2) id, 8 3 20, 2a, Mal ZN 4, 8841
73 | Barrow 36" et Cary 16" et » OD 24. 24. 24 0,19 0, 6241
Waugh 24' n? 1. =
74 id. 2 = 35 All, a0, all 0,44 | 0,1936
75 id. > 55 20 2), 2 04 1, 0816
76 | Cary 16" et Barrow 36", Waugh ® aa 5 5 u 2% | 3 1,7689
2a mol eb.n°2. 5 0, 1225
77 id. 5 555 22. 21. 20 0,35
78 | Barrow 36" et Waugh 24" n° 2. ” 55 20. 24 2A 1289, 239721
79 id. a 55 24. 24. 26 I ,19 1861
80. id. 2 55 25 24, 94 al 12821
Rahun Meridional.
1 | Waugh’s 24" n® 1. > 22 2. 20 VA 0, 0441
2 ; id. 5 20, 20, 2 0188 0, 3364
3 id. 5 20, 20. 21 07,54 0, 2916
4 id. 5 202 20, 21 0,42 0, 1764
5 id. 5 2 90% 0,79 084
6| id. e 5 2% 19, 31.4161
M id. = 5 20. 20. 20 0,63 0, 3969
8 id. S 5 Ar 20 ll 0 „44 0, 1936
9 id. ® 5 20. 20. 22 0,05 0, 0025
10 id. © D 21, 2, 20 1.08 1, 0609
kl id. = 5 21 20. 20 0703 0,0009
12 id. ® 5 20 23% ®,03 0.0009
13. id. a 5 203 0 ,30 0, 0900
id. S 5 2.2 2% 0,0 05041
ld. S 5 21 20. 20 02a 0, 0729
id. > 5 0. 20 0,02 | 0,0004
id. = ® 20, 225 2 Dal 0, 0961
id. © 5 2 2 2 0,| 0125
id. IR 5 a 24 0,02 | 0,0004
id. = 5 2202 28 0739 0 1521
„luglah S 5 21 2 2 0,08 0, 0009
id. = 5 = 2% 0,2 0.0529
id. = 5 20. 22, 20 0,56 1.0238
id. a 5 2. 21. 20 0,39 0, 9801
id. va 5 20, 221. 21 Vo 0, 0289
id. 5 2020) 20 0 ,44 0, 1936
id. 5 AU, 22 2 0,5 0, 2500
id. D 2221, 20 022 0, 1764
id. 5 a 2 590 0. 0,5476

sts icchh A u bh dh aa nr
