ne ant memes font ot trees + re

 

TE ET Te

 

 

 

 

Le |6L6°6L6] T+ [Sst : A Izeo-626| ces | seor | 12€ FoT—|9-0F 6e roatog |

 
 

 

 

 

LY 9F + | L90°086 | ETT"0S6 | O \FLL’086 H “ lott:ose|| €: | FT T 3. —| 884 88| S 9 QuoWurgseq | .

£a eile. ice, do oo) : | : legs | es | att | 0 cer | oospuRIT ung | u
“en | 86 ‚206 | 6 + 220°086| g68l  seBLoYo | ozo FE BSI GL TSI— FOS LE, woUMT Jung Toywe}G "ULL A

89 + | 29 +006 196, TE 1806 1681 | slooBmog | 296 9° | 08 e¢ 9, | 6°88 onroddntug | 1

| lice  |r+ 16 Issossr wnsoziogea|eoe | es | cia | ¢ ¢ sm “s108qQ “Bly 4

688 GOST | d Ho | Ore | Ger | ar ce SIOIATIO. 88P 109 | 3

| 88 | 1681 ; 889 9°& | gcc | Suyuegsuon) | .

&6 ore one GES | GES a 586 ee | ‘ | oF9 9°6 | 086 ey anys UPON | :
06 SE Etes jive | 1 + | 186 a : 602 98 | 189 IF 9 |8‘or 9e) unomegg pomg| :

LY ESG = | 808 IK | if 1298 66ST " | 69 9:3 | 166 #723 TG awysog :

Sy tm 7- (26h cere | 0 |ere + OLC 9 06e | ec 9 O'LF MOSEX UIV :

CUS nn loco he leon han | : 897 9:8:| 060 | OI 9 sued i

6g —| es — | SFL 1299 | EI | 60L 5 L¥G I) See cee gg ¢ one ge erBIueSI IT :

89 — 82 — 112  |+r9 | 0  |6ç9 1681 | sioofmog |219 Sie ler er Ce 6:09 FE BIST,

oF — | BI — | 629°626 109-626 0 lese-sı6l 1er | sesrogeq |oge-ers) os | ges | eue lire JenouSuT UOHOSIY

(SHBX ‘FUS ‘FOU)
99way,I op anbıydea30o93 J9TAdas sep uoSunssoy ‘eg oddnay

; 198 9 [00 0 = SUNUOIOISSNEZJON Op YaBu J8819Q UOMANPOITUOISAQ 10PD JOUIOUOISUQ ole IT ‘WOJSAG-/ IOUIBPSIOX ‘UHSUOIU)S 06

 

 

A not
© ean
GEG ah
ter
~ rs
Br ae
++t++4+4+4
8 x
© ©

 

 

 

 

 

 

 

 

 

 

iio lee 86 | co jo ol : | 6-086 | 19 |gozz |Z oc sr  ‘1xsqo ral :
ce 06 900 fee | — |16¢ ey à 81e er 70 — 19 UUSIAEO | 5
ge | LE — | 089 €8¢ I D: - : O8¢ el 08 seo seunog | ‘
ee Ol (109 168 | = feng 2 : 91g i 7 te 0 T0 (xnvaplog) OBIIOLT | :
Cire 19 06 88 ie = 1808 ” : L9G col eo _9% uogıg | :
06 — | 6 — | ¢8¢ 96 | = 1998 ® : | 894 Sa TT |) ce WOYIBoLY :
lo 08 =| Cle "086 | CFS‘ 086 | I | SF: 086 6067 l'en uosueposrp| OFG Mes co cer wosuey | yoroıyueıy
| | | | |
| | | |
WI g-07 | WO 5-01 | wo || wo wo un wo || ‚wo | a | w | | |
op | AE) Ye Ne OF) 15 —,6| wo) mee | xoeyyowqoeg | oroaqog aqoIq| eyoH | Aue | ayeaq | TONBIS | PUET
| | | | | . | En, | |
06E 'S TIA 91

 
