 

TE EEE En We rE er DUTY TT OP SANYO

Terre RETTET TY

 
 

 

 

 

 

 

 

 

 

 

 

 

 

 

 

 

 

 

 

0 0 On —— 77
| | | | | l
891 | OLL 0 1982 es | use | GL ET | @ | |G:68 GEI 17:98 | u
892 081 IO 062 9687 | pont lean 7S | 7  |e'68 681 19 ag | BUETONO X
FOL 989 = 189 1681 | uueumer |789 ee mice sm | 1
| =. (S08 gel PumT 00L pe le rucer [oir ve| o40Y
159 209 = 8681) sui1eg "A | 909 pe | & joe 6er | | i
Tre  |gec ze 9681 | ouoynn | ree GB | 8 0°39 681 : |
ie  |reo > oe set | yumr je | 2 le 10:09 cel | iyesusen = udu
657 667 0 667 968T | ouoynn |66F pre | o [ec rer |v'ic | GeuSueys) Sunsnm But)
TSF | Ter O |e? 668T | sujsroq ‘A | O87 oe, eo Laer | ar | 4 | a
Ich | Gey o | yest | apa A |rer  @ cd ler re L'ST | preg wog uaz Ag
Cy. VIE 0 srs gest | sufwq'a |OTE ve so lern | u | u
| GIF  |6ïr 0 (oe Lest | uuemmoyr | 817 ve 0 ec | | À | N
63 +| 82 + | SIF | err 0 m 5 y9uLo] | GT lp Sco IG! | Orr Ve |. 'ASO ‘TOMBXIZ guryg
FI —| FL —|918°626||Goe'6L6| O |808'6L6| G68T | umeany | 108" 6L6 @ r lee loss 6 zong | ueydiag
| o1 +|vt +|ies | 18 o jes |seet) mon | | 72 | et ose |cs «| eueqEE | JUY ‘19 EURO
| ce +| 78 + /68L |£c8 0 |¥é8 1691 | uoumen leds || VS | 9 miss | ce | est ‘
ver ee ı | 68h |z18 0 |818 g68T| urwidix À | 118 Lire | 9 Frs 88  |8°28 u}no]E) | UOIPUHOPIOA
| 7G —|8¢ —| SLL CTL ro on L68T | uuswmoH | 60 | we | 86 Op co | : | A
| eg —| oy — | Shh TEL 0 |sez 968T | 9uo}NIN na son es | À | N
Go| Gy ce SLL 0 |88L G68T N you | La | S& wor VIL er ce Reste Suogguoy eu
| (Hees+ | mes rt |GIL |, 996 = 00 T06T H100078 | 08 | 9° |9°14 LOT) 981 | A «
| er era Th ire | ET 968T | Yuoymm | ove | Ir le-re ueT— 181 | nnpouogt | "SUL-HOAPUES
| 38I+ | zeı + 989 me © er 868T | ToT PON. Ina nr Soc so 00 o8eyusg “JUV HD sang
| Do lt | © lero jessr|: means le) 9 gosan rise ea | 1
| 69 + | 89 + | TLe 6e |) — 0 gest | wer | God) op 687 cu Se ‘${O-848I00 ‘ÉEQUIOY | HOTPUHOPIO À
Pen eue loop a | o de rest |iemuopior'a lag | 8s | OL 62 ee | no #
Leg | 906 + | 97 te, O0 JL “ | yueproyey A 6IL | 8° | OL [8°62 Ve ioe | yuooury 39) ‘Sul ‘proadeyy
(Des +lie + |egr'euclorc 86] Oo [T79°SL6] L68T ) Teme |1gG-816| F°6 | GT 0:01.96 |0:97 OF | ‘Aras ‘unguey | UOPUHOQUEE
| | | | | | |
OO = at °6 6 5 206 ayep | zeyyoegoag |e1eMyog era ou | osueT | 9YOIT uonyeIg | puvy
| |

 

 

 

 

 

 
