 

239

€
€

1

 

 

 

 

 

 

 

 

   

 

 

 

 

 

 

 

 

en
TP PT

 

 

 

 

 

 

 

 

 

 

 

 

 

 

 

 

(yeux eqeis)
eo | 04 aujour
2 ST -objje NZ
98 0610 en |
L08°6 |£€ D | |
06 eae KR -yoouisig All 97808°6 | 798086 | 2° |
= 3L08'6 lzegyle el. 66 |
6 ran 5681 EYLINNORLIOIS A ae 16908°6 i 608086 5
16 rt - ee ee 168086 | 9% US 0 17 Nr aoyspunlen |
08 68208°6 E68 HI9U191S ‘A || ec pee © ezg0e'6 | oz 64808°6 n Ly | 299pueT
JE ES LOS 6 £684 : in ne. 821086 WZ 80L08 6 2 LY |: SoZSWM-070 À
I 88L08°6 2 es a GE808'6 | 6S 01708 6 17 UDMIEIO |
| 09 881 € 681 « oy :1908°6 | G9L08°6 co S8L08 6 ) yc Ê mS
34.0856 ERR | LeL0s‘6 | & > 0 9 & ee ) 1 = seejed
v L8LO ¢ E68 « He aes 08 6 £0808°6 ei 66708 6 Lb La ae |
L08 6 ER | 58 "6 > ç ? 66 : - a
V u. : eevee 968086 | &'& 08108°6 1 Ellen En
0€ 18208°% £681 « ane 0z808'6 | B's GROS 6 | > Lu |: 108900
69 | 982086 [68 ‘ shee 6 | E0808 6 | 68 GILOS 6 |BSE a m Too
ne oe sous "A || £ 91808°6 E6L08°6 .. pc ae
| ee 2 6 !E68 1 = 68908° ) Cc jte © © G N VI Sh a |e 5 ely
ce + | 697086 81 « @°6 | LSL08 6 || 9% G0808°6 |HEZ Lay |: uesneg-
: 8°6 lee 00808°6 6,9 ‚0808 6 108% 2 = EAE -peqez
ion —le bte ae _ BLM ei 91808 6 in 1308 6 0001 . LY en
49 + | 87086 gy) "Aou A || BEC 86 | £9808 6 19L08°6 |08 13 |" yoRule
de se 2681 PUNMOWIEIS “A 66908°6 | 781086 + IVLOR'G | | ¢ LY ent
> 8L08°6 166 ee | 87808°6 a ne se Sb y REIN
9€ ee © 0081 BJ | 87808 6 | E9808 ge 18708 !
&6 2 oe 68) eee || L6LOS 6 nn fe 18086 Ov is eae
QU + | 4 3,6 |L88h) ‘A9eu01S ie 9040 Gz ZELOR'6 re Ly |uropae au, mou
i V8L08 6 & 20 > à 0690 ee a 6 | @ I : | BMSSOI*) =
M = | GLLORG 268) [PWM AIUI9S's) gER pS 80808°6 | 9° 08208 6 Le Ku vs 7 RAE en
Ly + | 6zy 6 [8881 2901918 ‘A || 808 6 6L808°6 | Gz 16708 6 ce | 66 LY ‘pSoja.- = )
A un cOLOS'6 | @9L08°6 | zz 018086 lo...
OÙ = ae L88l er “A 96808'6 7£808°6 6% 12708°6 66 re so
oi do a eel ve L0808°6 ee
Le Heats 269) EWMM YUASA et ae : 69€08°6 de | Oe ae ote sueso
oy te ALL08 6 [8681 c0808°6 | © lee 86908°6 Wu |e Eule W
ne en 6681 nn 1808 6 nn an nee Gy oe - oe ee
1er a ae 888 “90U10]S oa 9/8086 a : 88108°6 Le | GG On oe
86 + | s2208°6 [e68t « 9908°6 | ZL08'6 | 2 | 8% ££LO8 6 a Lee fugsdor]
ë 12.108°6 [2681| mung 6: 8°6 ra cp op | pee 97 sp es"
D ns ss baat a
“Ids te a ÿ Gre < 5 € 4 V7 Ss JO |
66L208°6 | 12808°6 | &e 6 | L&L08 6 91 | GLG OF -paeqnon 1g
A > : 0YL08 6 Ce | ere oF Oe: pe 15
a u at 97 1019 9% an
x! | ioe | Be mda Bee Sols) w at ee ma
a> = ar @ i Ww
= 2 |®8 sunoyeasosq() Sal aes | ae pe 6 ee.
— SS = = = Oe | 2 + nm © Ouse ®
= om | ie as =s|&8|2 Si, size ee
o ¢ |e T 1498q094 5 | EE l> ol & an 2 "SUONEIS
Sur 29 es Bole ele = 5 22 los SS 20g : .
u | © Se Ds sms =o|B ae = SAVd 2
| sa | Bele. 2 22 58227, 2 uon =
: = = al bel so = 75 esse alt. Gi Le &
u = 2 = a 3 | & dg os ® = 1S J9P AUEN ANVT =
pon: : | : = 5 © =

 

 

 

 

  

  

 

   

 

 

 

 
