 

 

Karen ren er nn

TEE TI TTTn

 

 

 

 

 

 

 

 

 

 

 

 

 

 

 
 

 

 

 

 

 

 

            

 

 

 

 

 

 

 

| 3 || ZN Sc 5 me ) = an Bl
| | | |
| | |
| | |
| | | | | | |
| | | |
| | |
| |
| |
| | |
(maruıg ayats) | |
"gqaoy ou | |
se = -ofjje nzuaıy | |
It | 67988°6 [EOS < | vınag‘s | Bızzsic | 98 | — | onLzs% 8896 | 89 yı |" oeasoelg Lb
77988°6 6681 « erzes'e | TrLas’6 | 9% | — | InL28°6 LE LE |En | uneyom gr
69+ | : “> Osaplom |
VE | 70988°6 E6Rl { ı 9928°6 | L69E8'6 | 9% | — | 849886 E07 €2 | 2'07 oL |IEH)seraang | sl
17 7 | 06988°6 |E681 « | vegas‘o | 9E988°6 | 9% | — | 829286 G'97 6% so 0 39 m 7
0 7 | 98888°6 8681 « II F8ga8°6 | L8gas'e ı IS | — | BLERR6 | gr 3% | 89.69 |" ° ' doxessog El
VE | 99E28°6 8681 « g6828°6 | E0988°6 | 9° | — | 288886 LESE | 0769 |°° ° © OSwol] al
01 + | 91028°%6 ‘ sgoas'6 | 9a | — | Be6ı8'o| wort | 6°gE 19 |" Surddoy 1
81 > | 28618°6 « 066186 | IE | — | 976186 oo Tea or
6° + | 9E618°%6 « ga618‘6 | 8g618°6 | 9a | — | YUors'c| Be ao, Lea) Tossa | &
| | 9UBMUIOIS e
OL | 8gg18‘6 | « sg6n8‘6 | 09618‘6 | 9° | — | vearsiß Ile | gerOn 178 66 AD 8
| .. ‘q ‘5194
@L+ | vsgr8‘6 [2681 S ganıs‘6 | 69618‘6 | a | 7 | saoıs'6 |eeV | ©8701 |s’yg og | I sısed L
784 | sısıs‘6 |7681 < 66 | 2968 6 | 96 | | zueigen Tor: 0 Zen 9
98-4 | ersus‘6 |7681 « vo6rs'6 | 20618°6 | 9% | — | 66818,6 101 | 8% O1 | 9°6g gg | LIRASHILIpON] g
69-F | ersis‘o |7681 « cap Eis 90 - 086 1 me sans meumns | Y
26 + | E6L18°6 |7681 « sggr8'6 | ssgre'6 | 9°@ | — | 288186 12 Ss ae &
69 | 8gL18°6 17681 « Lv818°6 | 618186 | 98 | — | TI8I8 6 |LV | LSEI |@ 2 ss] ‚paoljogold | ®
877 | MiLıs'e 7681 Z1ST’0 Jord| 6Bzrs‘6 | o6zıs’e | 9a | — | zeige or GE 8 |ET ge" oO V
| = 0 0
|
ol > a u o 9] 6-6 n = = So: ee)
5sS En s ISg8|er| 6 H|I2S5 &| 23
ee Si = as: 2 5 8 a suoneig Z
ee ee ee .
12 =.)er een cr ‚uon 2
= = 28 ‚aogyoegoeg ı || & >|: a 3 I 2382 2 _ =. |-21g op ouren ANVTI 2
© © |2®8 5 es gs Felle 58 8 = :
ss. |, Ss Di 2 2... 35
ae ee nn

 

 

 

 

 

 

 

 

 

 

 

 

 

 

 

 

 

 

 

 

 

 

"XI >I94eL

 
