I NA 9
NO or

 

 

  

 

 

 

 

 

 

 

 

 

 

"TI I N :2IA BL ‘EO6T Juonıog
& 2 - wogsÄg dousıy Jne worsmpor] orloyeuasuy
: . \ |(worregg-zusrajoyy) |
= o 0  /816'086 | zer | T’9F 08 85 Sıngsseng ssest | #18
Euer or \ 8TO'I86 980 ee oO 916 S6L| FF 1:0 6 De er nr
(3 or a | 886 5 N 866 080 eo 0 76 986 #4 L |9:98 | uorunaweg SSESITT Fr
3 08 . s 786, &00 0,0 686 20% | 2:08 For | sueg-neogwug ® sı
le 5,0, #.1.016 nn & 886°086 £00 ec | 0 PE6 66 | LEI | CF szunorq | uosunmorg | LT
ge +ie + 1016 00 520 2% 0 196 808 | 6°18 er uogRz, ssesp | 9I
ge ee 1696 sr) DIogos D erum) 100186 80186 8 0 6 098 | LE | 19% Sanqaweg | uosurgorg | er
ee... 216 ı . 896 186 s| ı+ 886 Just vs 028 Stzyum So
8 „oo = . . 176 FEG 02 0 1906 sat giag Sa wroqSrddng 5 | er
7 :ı) 200 : 196 #66°086 96 | &+ 116 89% | I'LL a8 uosneypozym] & ai
oO cr 2 os ns } 196 0F0IS6 16 | €+ 978 98, | T’6 8:08 | uouog] = ii
an : =96 566°086 9% | #4 868 ore | GEL 1:88 JOaurıag 2 ot
+ + 006T | urSang 'n 1oypag <g6 800186 Go Ess 6228| 29 0'IE | sopeug x | 6
Dr 2a 4 5% | r F°6 816 or er 0968 c9% | Y'ST 20% |  apeysmorgpg
cc | cc | | | Tg zoo M &
Du 2 5 2166 s \ GG 196 6 m. 688 1,%8| 6'9L TIL nerogor = |
8 509. 1.086 086 FE£6 0% | 0 188, sıL | 81% | 9’ST | Ipegspropog 5
Den ee © | 5 Er 9,6 | 7 21198 T2E| #T1 6"FL yoayret 5
#9 +1lotr +16 & & 6%6 &66 so 200 068 %L FOL uosneuspopatc] :
ses +/6r + el © »E6 £°6 eo 3: 1018 She ae | Sroqsioskey “
Mo 8 e & 186 886 82 | %+ 0% 999) 27T 09 | voLgy toIq \ |
0700 F | 900°0— | 1061|) Pfogoy u 1oypog 506°086 086'086 0° 0 098086 | wor| aTeL v5 | Aeuo) SSesit
! | l | | L

‚Sngqsselgg UL OLIEMUINIG UONOLLIOSTEN] 1op uosunssom] "TA

  
 

 

   
          

wo | ud wo = ud RER NS Tee rer
| > zE = ea u Fi |
el Bee Ei |
Ko 06= Ze en a
Z © | eaar 5; ne ES en = © Ian 5 a rs
lu ne 2onjougoogf Sum11o], sop| Si S| 35 | Mag | monegapomen| 'aNVT |oN
| | “TOOL, 8 N or| = = Sa
© snuru d Gelaso = Bo
| = Bea 8 s = |

 

 

nıramdd. vum] m har Matiltäuaı uud uk

 

3 öhı. ca vorbei hd Madsen ana I ale abnmlen uı cn

 

 
