   

 

— 384 —

XV. — Roumanie.

 

N Saeumor tönen HPOQUE we
DES POINTS " . Q ET OBSERVATEURS BISIEUMENTS BEMARQUES

 

 

 

 

 

 

Triangulation de la Dobroudja. (Suite).

 

 

 

ICH... 44° 26' 25" | 26° 539"
Insiratele ......... 44 36 15 | 25 55 32
VIEL 00, 4456 9:1 2612 2
Jurilooka.......... 44 47 5 | 26 32 33
KalBlel......;;... AA 832 | 25 25 25
KaAnarar..o......, 44 16 39 | 26 11 28
Kuzsun......... 44, 7 18 | 25. 31 30
Kara-harman ...... 4428 22621 6
Kara-Omer ........ 43 49 22 | 25 53 39
Kara-Orman ....... 49, 92827 530
Kasap-Kioi ........ 44 36 40 | 26 19 58
Kallnova.:........ 4451817127 131 .
Kilia-veche ........ 45 21 33 | 26 58 4 =
Kioseler..........: 4415712544 8 Ss
Käsla-Vadani ...... 45 0 14 | 27 19 14 ©
Kopadin........... 4 323\ 255415 ı
Kogealak.......... 44 33 46 | 26 9 53 B
Kumarovya ......... 44 52 49 | 26 13 45 R
Kopukel........:... 43 50 59 | 26 5 26 2
Koslugea .......... A 849,213 16 ‚©
Kuiugiuk.......... AA 1.80: 25 820 =
Lunkavita......... 45 18 18 | 25 55 22 2 -
Malkoci ............ AO 11 37,20 34 20 Ss 2
Märleanu.......... 44 13 43 | 25 28 2 3 a
Male... 45 13 38. 27. 8 29 2 =
Mosorali........... 4510 19 | 27 17 52 BR) 3
Murfat-Kiueiuk..... 44 9 8) 3559 45 NZ ©
Mein... ... 44 40 31 | 25 46 22 °2 =
DIR. a... 44 11 13 | 25 21 48 Si EL S
DEllaa...0..2......;, 45 1713| 25468 8 T _ a
OStROV.. 0.0.0, 44 010|25 236 & 05 3
Picineaga ......... 44 59 51 | 25 49 37 = an 5
Periprava ......... Ana 07 73 58 =
Boyinan. ........., 44 58 25 | 26 38 53 o.= <=
Bold... 44 39 18 | 26 38 51 — 3
Kostl.ı.2....,,., AA 58.30 | 25 51 25 S -D
21000. ...»...... 45 14 44 | 25 52 27 Ö EB
Rämniku de sus...., 4439 0126 610 iR EM
Sariehlol.. ......... 44 42 56 | 26 11 13 =
Sapata-bazä........ 44 11 59 | 25 39 31 3
Seimeni-mari ....... 44 23 50 | 25 44 45 =
SUDORK 2... 45 16 18 | 26 45 52 =
Soda 0.0... 45 13 20 | 26 54 23 Ei
Delta. na. Aa 0 20 12 32 oO
Dopmal 0... 44 34 35 | 25 43 13 ©
Maloea 2... 45 116 | 26 29 34 =
Mnaala.........- 46 637 | 25 52 20 3
Turbencen.....:... 44.49.21 | 26 0.40 =
TnS1a HIT ......... 10798 2] | 26 14 50
Dusla le... AA 0 35 | 26 19 13
Vaearonl.......... 45 1053 | 25 50 51
Visternar........; AA Sl Bl ı 20 25 52
Faro Insula Serpilor | 45 15 28 | 27 52 24
Faru Constanta....| 44 10 32 | 26 20 7
Bis. Sf. Nicolae
Enloea .......... 45 10 47 | 26 28 20
Giamia Mangalia... 43 48 46 | 26 15 11
Vizir-tepe Ysaecen.| 45 16 3|26 9 3
Sf."GheorgheBraila, 45 16 46 | 25 38 9

 

 

 

 

 

 

 

 

 

 

 

in kann FE ETW PERS NERERETERTENRE

 
