Fe

mem > >Re

anal. VU

un

am

ja ı

[1 AAMT ARIAL Oa LE el

Mer

 

 

oo

 

 

 

 

 

NOMBRE
a: ig TD pe LECTURE 2 DES ERREURS’
5 AUTEURS DES Sum, en NOMBRE | nn en
is aoe DES EXÉCUTÉES :
Ss SECONDES ;
ET po veenror |. MERS 1 POUR CHAQUE A2 REMARQUES
2 DIAMÈTRE DU CERCLE ze OU DES CHAQUE ANGLE I Nun
4 OU DU CU POUR
HORIZONTAL -vroroscopy | MICROSCOPES on &
DIRECTION ate sta
50 | Pistor et Martins, 10 Zolli. 12 2 micr. 36 OF, 65 0, 422 | Voir" DasRhoinischo
Le tambour Be
des micr. est f
divisé en se-
condes. 2
51 id. id. id. 36 0,95 0, 902
52 10 Gs id. 36 1.05.84 | 0,106
53 id. id. ide 36 1,15 1522
54 id. id. a 36 M ie oe
55 id. id. id. 36 1,83 So
56 id. id. id. 36 12 1, 769
Sn id. id. id. 36 0 0
58 id. id. id. 36 070 0, 490
%
DAS HESSISCHE DREIECKSNETZ.
1 | Pistor et Martin, 10 Zoll. N 3 MICr., 36 0",95 0, 902 | Voir" Das Hessische:
/ Le tambour en moyenne. ii
des micr. est
divise en se-
condes.
2 id. id. id. id. 1,90 3, 610
> id. nde id. id. 225 1,562
4 id. id. id. id. 2, 50 5250
5 id. id. id. Kor 1,36 1, 850
6 id. id. id. id. 0,38 0, 144
a id. id. id. dl, 075 0,333
8 id. id. id. id. 1,10 20
9 id. id. id. id. 1,53) 234 -
10 id. id. id. id. 0,37 0.137
11 id. id. id. id. 2,33 5,522
12 id. id. id. id. 0,68 | 0,46
13 id. id. id. id. 4 1,19 1, 416
14 id. id. id. id. oa 0, 096
15 id. id. id. id. 0,04 0, 002
16 id. id. Tel id. Oni 0, 029
17 id. id. id. id. 220 5, 244
18 id. id. id. id. 1.28 1, 588
19 id. id. id. id. 1,93 3,7125
20 id. id. id. id. 0,64 0, 410
2] idR id. id. id. 0,48 0, 230

 

 

 

 

 

 

 

 

 

 

 

 

 

 

 

 

 

 
