 

, a
"SL Ben an. Teak "op  « 0067 «
8 n Ze = ATAX < 0007 <
Se ee Ol ee ed :PIAX « 0067 «
ee er re CI OT NE 0 «

'GL 29 209 09.07 mm Er Im SE LS 9% 76 058 © :w=om « ‘006L «

-worsäg aeuoı 86 "16 '88 ‘28 '98 '<8 78 '68 °18 ‘61 '8L ‘CL Wu N du aa 'E067 IuoLg 4

 

 

 

 

 

 

 

 

 

 

 

 

 

 

 

 

 

| | '18IS-Zue.19J9Y) J0][oyJEpUa
ee 60 = | 619086 srY'0s6 | 149086 77% 0 79086 | 85 |L0C er + sIcyr + a ee a UOLIIST «86
: | op. aypdueIses "aayısıng ? = :
SE a cs 8687 | < 168 868 6 0 1968 S |7L95 —|TESSCH uaaog ‘p aopfoyurom IEMYALy uposup-daus1Q 16
| | ‚uspoqulagg uam
ee 5a: | 28 8681 x 178 | 678 ‘ = 0 078 9 [8'869 —|%'77 8C + | apsnequaurgosen Kvmou1ogg uoprıgap 96
uopogzjog Lu aowmmız nn
zz tier +|x26s 8687 < 759 | 079 76 0 789 19 |0717 — eg recc+ | -wing, eıısıonun ‘Moser puepyoyaS | <6
sy9oq
| | | pugprogquunggaon 'p oyuN 'p
Ba eo 0... Ole 8681 < 958 | 832g 716 0 ISS 5 |Cı01 —escyc+ n “. ar TWzaN x 76
| | | uspoquteIs "qg9s4sauıR
69 E84 F | STE TS6 [86T | Urne &LF'T86 LLV'I86 76 0 |797186| & |78 7 250° +|-Ipeıs wr Due 'ngnowmklg pursug  £6
aznyaS sueyoeun lt
Y = |) = c09 8687 | < 968 86% 6 0° 1868 ST 10'8% &9 T| 0% 77 + |-10j9mouo.yg p Soploy ‘entre S 66
| | Kyıs |
Su 5 m. 1.06 8687| SIPoA 658 55% 7% ur ce 8E |LLGEL — 687 0% + -aontun-erqumop NOR-NON | estmewrpion | #16
Ch + 119 +) 290:086 [8687| Une) 867'086 681086 8°c| 0 |TTr086| T6 | SIT6 —e 7 gE+| vpeder ‘erıasqg “uogusst] _ Tednzıog 06
| | | | | 199]0 Y |
ı el + | 6€6 8687 z ei 996 996 0° | 0 |<96 CT ELEISITICSTLE-+|:H 'T umopog ss voroy | 68
ı SB]O.le | |
& ==. 908 8687 A doSıad| 108 808 Go 0 | 862 St (097 6ETH|9TPSEH+| Yunsıeaun 'p xorloyy ‘oryoL ueder „88
| | yeueyidey-uspegg wur ao
Tc00 + | T°0'0 +| 8E1'616 N yospogs| 681'616 681'616 | 6 0 [8826161 SE | 6E1 IE —IC TE FE — -wessnezsgom ‘oapraoruom Kendnın | 418
| |
wo ’ wo wo — | ws | wo er ee
| ® | ı ©8 |
(oc Z J = |#9808000075| 2 (on | |
06 0 0,6 i oo 3 SUTE.LIO], SOP 1oneuo3 100 =) Sr sIaug | -UOBIS Jap Omen "ANVT “N
4.10 MM a = oe} V y 3 zus |
| toatyL a S snurtu 06 Hart 1 )9=0n ; & ® | |
| 5 | > | |

 

 

1 tn eamshhh be a had pa u 1 mil ak ml " 1 N wurd. rm le MÄNTEL Maellähu ku) uud uk
