 

 

Beobach tete :
| | Schwere g (in Differenz
ORT | JAHR | 15!MONAT ‚| BEOBAGHTER | Metern) mine | + 27 700
| 'reduciertauf das) N Metern
| Meeres-Niveau
| roa | September Sterneck | 980671 | + 0,00002
Padua ios. | 1892 | Juli Lorenzoni! | 673 + 0,00012
189 | | April Per, | 685 | Be
Venedig ? \| 1891 | September Sterneck | 9,80665
een 1894 April Triulzi 664
: 1893 | October Lorenzoni 3 9,80363 I
TOM ye ee ou u ’ — 0,00002
189% | Juli Triulzi 361

rennen beit een False ti

— 0,00001

 

 

 

 

" Determinazione relativa della gravita terrestre negli osservazioni di Vienna, di Pari
G. Lorenzoni. Venezia, 1898.

Ad

gi edi Padova, ete.....di

3eide Messungen nicht am selben Punkte ausgeführt, die Punkte sind aber in Breite nur ‘/, kin. von einander eutfernt.
3 Delterminazione relativa dellu gravila terresive a Padova, &@ Milano ed a Roma,
1394,

Allé del R. Isiituto Veneto. Tomo V. Seria VII, 1892. (p. 293.)

da Giuseppe Lorenzoni. Venezia,

 

 

 

 

von KALMAR,

k. und k. Linienschiffs-Capitän.

 

repaire

 
