      
   

  

Pb RE EL FEN TE Te bal u
Phe PR Se cas Se PEL TE NU RES

€
fa

 

   
  

     

                                                  

+ ; NA
arbore 2: u et TR u E N En
> | RE She NETTE SSPE A No ere ee
=. age > EEE EB ae A ss Se DE AL R ey & = N : LIE: Ph Da
Ré ca: ae ae Tr a PLATE AT een ee en re FR = Sense er PEO N an
} . ig er st ee ae a EEE, nn pe as a KENT a Pe > EEE TORE nee nn TT dr So
LAS de Scene 5b A ES et >" watt = Earp 5 ng

    

ee Te een {
SEGEL 7
ee AIN PDT ANS Pons M PI Les ni : ra EN ee
. a nn ARE OX YE ee = Ms ot oe Le tp. TEE a ee m
4 des ge A GH fa tS ere £ DES en Sy
NET RE Re Rep ne LE LG LY Wr ag u U
nr, fr PS né oP et GP pO let San LE ne. tee Deut x
ee * | Fo Fe E = A ne 7 = 5 ae” ge ‘a é, ee” 4 2 E 7 a < é ai nao oa > me
NA? Ast ee SPL. CROP his ho T* with ae hanes u ee :
Of A oe ir - é BE ea “wt eee et fe rer

= ET eee aS PFOA ES i PT > pg & ae ee eh Behe er ie ht he
eS hE nm hel Gol GLANS Ce. OEE i, ted el I ERO TON EST AO ER
RNA RP IL AL PARAL ge me PO LPS LT ET Ni RE NR Ped
5 ZELL : | be ar 4 : 7 aa Of, A Ar Rn Pa 2 a “ ale SERIEN M A APE &

  
 

                   

       

                  

   

 

   

  
  

ee ae e x

  

: f ai ; = a ME Sa > : LE os Mn, 7 > Dr gr Tg Ga Er [7

u ET, tt EE PS RD St M he enn ees OE Me a ee ee wea 2

DE TS TE D RS een de PR PR Re TL NE RD Per oe 2 en ae eg ur
a A ARE GL RA a Dan, SE EL PE Tk OT RS TE tee ea bt Sak ie or rng vans

N RL rT ap RER TT RAR SLT TRI at eR re ar sa sei
Et LE HE Be Ls ge By thn RO PE EE tot re LS LR RER et PE er LOO an ine os poe Pest Nea gh “he

à a nh = EE > ne ln Fee ted AS ie + ANT = - LL hy, RE So L' 798 —
AP ET PPT APT D EEE u u TE reer es iP oD La ett LP Te eras rt u ra
4 ee Pa PL Pontet 7 ee 2 + ee TT, onto CNE D ET , 5 Poe TS CT PR = Miser Tite ’
fo DE RE Ls re RT ET Sr tu ESP Es Gl
EB . ao BS x og oe E a = = a i mat 6 ee ge "à u © ey À RP a Fi J ype’ mt ‚ A : T Sp
” ll PRG Se ike ER u ER OF ae à ao à Ge e& Ir -
ae à + s u ti ae ee ET ze he D, er es ee Ts ee a eo Rt en Us > - y

cé

 

RT TE
2 . i REN
ar: A) ‘ 1 peor
JAN NY, =
AAN BEZ
=

a?

 

HE DR

u

            

 

Wes
\

PH RL ee
Por Sl OE DIN |

: EN LEE d'un fre. AAA

  

ARR SN CE LEE

   

ER CE RD D RE Cr D Pa
ER D D en
een aS

SN RE earn

 
