 

 

Anhang.

Annexe.

Uebersicht der für die Europäischeil

 

 

Tableau des coordonnées géographiques lt

1. ee

 

 

 

 

: | Längendifferenz
Land. 5 Stationen Difförence de longit Beobachter.
Pays. a Stations. in Zeit | Wo FF, Observateurs.
Re = en temps. | E. Ps NE =
Baden. 1 Mannheim—Bonn . 5227.17 20.009 inch Le
2| Mannheim — Leipzig 15 43.48 +0.009 | desgl.
Baiern. 1) München—Leipzig . 3 7.74 +0.018| Seeliger, Weinek
| |
| 2) München— Wien | — —— Orff, Anton und Oppolzer
3) München—Padua — — Orff, Lorenzoni .
4| München—Strassburg — — Orff, Schur
5 München—Bregenz . — — Orff, Oppolzer
6 Miinchen—Prae (Dablitz) — — Orff, Anton
Belgien. 1 Bruxelles— Greenwich 177289 |. — Bouvy, Dunkin . .
2 Bruxelles- Berlin . 36 6.5 |+0°07 | Bruhns, E. Quetelet
|
| 3| Bruxelles—Leyde . 0 27.49 +0.027 | E. Quetelet, Kam
4| Bruxelles—Lommel — — en
5) Bruxelles—Nieuport | — —
6| Bruxelles—Hamipré | — — Se
Dänemark. | 1 Copenhague—Altona . | a — Peters
2| Copenhague — Christiania— Stockholm — — | Schjellerup, Fearnley, Lindhagen .
Frankreich. | 1; Paris—Brest (Tour St. u 127 18°50 | =
2; Paris—Biarritz . . | +15 34.48) — |
3| Paris—Nantes ein Sana =
4| Paris—Marennes | et tO 4d |
5, Paris—Greenwich . = 9 20.68| — | Faye, Dunkin
6| Paris —Havre Be
7| Paris—Dunkerque . oe
8| Paris—Berry-Boiiy . LU De Goes
9! Paris —Rodez Le D Pas = |
10) Paris— Carcassonne PO OR |
11) Paris— Lyon (Fourviöres) Dee
jParis—Talmay, par (Paris \ | |
12\ Ja parallèle de \ Bourges j a2...
13) Paris— Strasbourg (Münster) —21 89.05; — |
14) Paris—St. Martin du Tertre |— 0 241) —
15| Paris—Madrid | 424 6.08 =
16 Paris—Algerie — JUS SSSR
17) Paris— Vienne —56 0.22 +0:01 | Lowy, Oppolzer .
18} Paris—Bregenz . | | :

 

 

 

 

 

 

 

 

 

 

desgl.

pr ul
Aine?

. page
1 ial!

ed

. 5 Mai,

fi Mai
ih, Mai

> Ni Aug
* Mini
- uk,

«No
* (ap

Hip

 

 
