 

146
AUSGABEN.
Aus den kapitalisirten Einzahlungen entnommene a. ao MM

Kosten für den Ankauf von Staatspapieren .
Reservirter Kapital-Bestand vom 31. December 1889 .

6480,—
368,90
13124,97

 

~ 19973,87

Triennium 1890-1892.

I. Konto der Jahresverwaltungen.
EINNAHMEN.

Alena vom 31. December 189 . . . . . . . . . . M
Vertragsmässige Beiträge für 1890-92

Brlös aus den Verkäufen von Publicationen.

Beiträge zu den Kosten der Expedition nach Il ae kıle

Be Komel. Preuss Landesaufnahme . . . . . . M. 3000,—

 

 

Aus dem Miss Bruce-Fund . 2075,40 3073,40
75218,43
AUSGABEN.
Gehalt des ständigen Secretärs der Permanenten Commission . M. 15000, —
Kosten der Expedition nach Honolulu . 91915,02
Für die europäischen Polhöhenmessungen in den elle 1890,
Mund .... Bee 7420,—
Druckkosten fur Te ndloneeai nid Berichte. en 9442,84
son ne Unkosten (Porto, Bracht, .s.w.). . . . . . 178.12
: M. 55956,03
AKTIVA.
Rückständige Beiträge am 31. December 189 . . . . . M. 7331,90
% inebarer Bestand am 31. December 1892. . ! .. . 11930,50
ne de A >. ....... .N. 1962,40

 

75218,43

 

va Hand Ae dd

an

Lt

1 cn phn hag fy Alba a du à

 
