PARCS

CT LUI

(1 CT

LM LIE

IT AR

Ja

fai

=
=
x
=
z
x
=
>
>
à

NS DAT OF

Darserort
Vigerlöse
Stege.
Kulsbjerg

Store Möllehöi .
Falsterbo
Hiddensö.

k == 54° 35!

Darserort
Kongsbjerg .

À — 54: 28

Dietrichshagen.
Vigerlöse
Kongsbjerg .
Hiddensö

A— 54 42

Dietrichshagen.
Burg .
Kulsbjerg
Kongsbjerg .
Darserort

9

58. Station Kongsbjerg.
54"8608
Azimuthe.
O 02... 12) On
53 23 04.10
98 24 03.70
92 09. 58.48
172 01 538762

202 43 58.49
316 00 50.01

29. Station Hiddensö.
50"8417
i 22) O47
156 50 41.5

60. Station Darserort.
34"5391
49° 59° 44"86
124: 52 29.16

180 02 16 26
200) 52 17022

61. Station Vigerlöse.
41"5454
8° 44" 20733

Dt 03 12 29

169 ıL >. 2

292 54. 18.28

304 25 50.19

62. Station Dietrichshagen.

none

Hohen Schönberg
Bungsberg .
Burg‘,

Vigerlöse
Darserort

25.9910
72.22.19 14
100 03 44.78
134 54 40.13
183: 36: 30 ol
229.23 80.20)

l= + 0° 04’ 03"7439

Log. d. Entfern.
in Toisen.

4.4459605
4.3829896

a
a“

+

4.2224604
4.3098850
4.4139305
4.4634128 27

U 2 2810

43301383 24
44634198  .

= -+ 0° 04’ 05'7668

45130184 32
43182511 23
4.4459605 +
4.3301383 »

= 0 39 14/7415

4.5429922 3
44590312 22
4.2383255 —
4.3829896
4.3732511

1 — +.0° 48’ 43°8768

4.3737905 23
4.5484812 35
4.4265075 26
4.5429922 x
4.5130184 v

13

SN ©

G a

Q SS

Os

+ &

067,84

Gy}
À

ss
g, &o

ey

>

x

:

= S
{ a

wh
=

D
x

NL

~J

U
GS
5

Er

= U
DJ)
u. 6)
4) A)

 
