 

19

 

 

 

 

Berlin. A= —13 24
Datum. Jabr. Polhôhe. Paare. ae nn Differenz.
ı. Reihe. Marcuse.
1889 Jan. 9 1889.03 52° 30 17.19 62 —0710 =
Febr. 12 12 7737 33 0.02 an =
März 9 19 172313 61 +0.04 == on
I April r2 28 77.39 114 40.01 — ae
a Mai 16 37, 17.32 157 0.03 — =
iL Juni 16 46 17.35 133 0.06 = a
FE Juli ı9 55 17 47 Io —o.18 = —
i Aug. 24 65 17.91 83 0.22 — ==
| Sept. 5 68 17.44 34 AO LG = u
| Och 13 78 LS 86 40.22 _ ==
| Nov. 15 87 17.28 123 — 0.01 == =
| Dec. 28 99 77. 13 26 —0.16 — ==
‘i 1890 Jan. 14 1890.04 17.09 140 —0.20 — 0727 —+-0'07
i Febr. 16 13 17.07 104 —0.22 — 0.28 —+0.06
März 14 20 17.09 93 —0.20 —0.24 40.04
April 9 27 17.19 71 — 0.10 —0.17 40.07
Mai 14 37 17.109 120 7-0.10 —0.04 —0.06
Juni 13 45 17.31 42 40.02 +0.06 — 08.04
à Juli 16 54 17.47 96 +o.18 0.17 -+o.or
te Aug. 10 61 17.46 72 0.17 0.22 —0.05
= Sept. 5 68 17 50 40 +0.24 +0.24 0.00
= Oct 15 79 17.46 48 +0.17 0.16 +o.o1
1 Nov. 18 88 17-34 40 +0.05 +o.04 0.01
ll Dee 26 93 27.26 41 —0.03 —O.II +0.08
er 1891 Jan. 15 1891.04 17.09 34 —0.20 — 0.18 0.02
= Febr. ı9 13 16.94 54 —0.35 —0.25 —0.10
be 17.29 2019
F 2. Reihe. Barrermann.
1891 Febr. 15 1301.12 6230 1717 162 —0"21 — 07724 0703
Marz 19 21 17.06 101 — 0.32 0 27 — 0.05
F April 18 29 17.18 156 —0.20 oa; +0.05
Mai 16 37 17.28 225 —0.10 © 10 +0.06
Junt 15 45 17.35 187 0008 = 0.0 -10.02
Jule 15 5 17.52 99 40.14 Lo) ..07 0.07
Aug. 19 63 17.62 176 0.24 +0.20 +0.04
Sept. 16 yo 17.68 184 0.30 —-0.28 0.02
Och. 15 79 17.65 121 Ho.27 : —o.29 002
NOV: 12 86 17.63 92 40.25 0.25 0.00
Dec. 11 94 17.61 81 40.23 or —o.06
1892 Jan. 16 1892.04 17.39 58 0.01 0.04 —0.03
Febr. 18 13 17.20 140 8 —o.18 —0.09 —0.09
März ı7 21 17.14 199 ©, 24 0 10. — 0.05
April 14 28 1713 1902 —0.25 —0.23 -—0.02
Mai 19 38 17.09 284 —0.29 —0.25 —0.04
Jul 17 54 17.36 144 0 02 — 0.07 +-0.05
i Och 22 81 17.47 73 40.09 0.17 — 0.08
Noy. 23 90 17.44 75 +0.06 +o.16 — 0.10
Dee 10 96 17.0 à 89 —+0.12 =O p14. —0.02

 

 

ADN UE DT TTF PWT

Monatsmittel auf Grund erneuter und definitiver Reduction der Beobachtungen.

&

 
