m nnez

Ka m Tree een |

am unık

IRA RI

 

353

RUSSIA,

General Pomnrantzerr has been so good as to furnish the following valuable table
of results as to the mean sea-level at ten Russian ports. All the ports referred to are
connected by levelling of preeision. The results are stated in English inches and are re-
ferred to the zero of the net-work of Russian levels. This zero js above the »normal level”
of Berlin by 11.76 inches, and above the mean level of the North sea at Ymuiden and
Helder by 18.48 inches.

   
 

 

 

 

 

 

 

 

 

 

 

 

 

 

 

 

 

 

 

 

 

 

 

BE Rn:  f.JjJzem a
ae az 3 < ° 2. 2 S
isle le a zo

= Fe 28 98

FR | i | r

1847 118 | |
2134) 5] |
43 | -2 4.9 0.0 |
4 |+2.1| —3.1 |
45, 901 2 |
a6 a 29 |
ae
3 | 0) 39 |
Ale

se
Dee a | |
2a 54 |
Bag |
ee | !
DB
6 Ey 96
57 |—25| —61
58 3.5
Se | |

60 1 2,5 | |
6101| —35 | |
De | |
68 +65) +26
6200 a |
65 1—04| _40 | i —15 |
66440 For | E19, 0
67 | |
Ba "3950|
ca ie,

1870 | —2.4 —43 | —84 al) | a
a 0 8 Do, |
m i
3|+32| —33|ı -ı1ı {08 0000, vo.
74 | 60 +8 | 1
15 1—22| —45 | —59 | 69 =68 49-50 28
16 26 200% I a go
| +05| —02) 10 m a on
78 |+44| +34 | 42a 208 Io lo
914011 —16 +18 10 13 a como 0,

1880 | + 3.3 i6 ı 310,0, 9%, 0 ed

 

 

 

 

 

 

 
