GRAPHIQUES DE LA SOIREE DU 16 AVRIL 1906

Echelle: 2%» pour ı"
12

M! DRIENCOURT M° LAMOTTE

1° Serre 12° Serre

 

 

 

 

 

 

 

 

 

 

 

 

 

 

 

 

 

 

 

 

 

 

 

 

 

 

 

 

 

 
