 

 

 

 

 

 

 

 

 

 

 

 

 

 

 

 

 

 

 

 

  
 
   
       
    
 
   
     
   

  

 

    
      

 

     
       
    
      
   
     

 

 

 

 

 

 

 

 

 

 
   

  
    

 
 
   
    
  
   
    
   

     
 
   
  

     
   

 

 

 

   
   
     
   
  
 
  

 

 

 

   

 

     
   

 

, 60 64 3 ae z : : j
H 7 2 ; > % S
- = 72 76 80 84 88 92 96 100° 104
| | l kkerıkl, shi Kunjus
NR K2 , 28250
| I Hr Gasherbrum f /
OHERäA ; N Net" I y '
= N AI} ZISVNDS F 7 A370 , Karakoram /
ı! ° | X 8 | | 2 \\ \\ N Ai
\ un LNNÄNN/IS
| Y a //.\/ Y || ,
san ( Be INT nn
£ N \ NS u \V| ! N N GG
NAGAR\ W SEI IN NZSNE SS
FIVE IS L\L AAN
2 AH  AENSLZR ||
S AT, A Rn NY SLH — IA
[9 Ra LIT Ir R RL
\ x: N NEN
< . Nass E KANDAHAR. s 17 EA b Se
ei ATA BAD, 5 /| DS . a
| 84 Deotibba, /] \/ > R N
ee 20410 L N = )
| E OPT 1 2
m a
Bi
II
SS
I Rn
| m | om & I :
E 28 u \ ei
I | N r 28
| I L
; 2
a
U
\
| o er Dnenlagnı N
| \ I E
I TG X p 28658 {
| || IE 7 k 4 7 z „ Gosainthan I Kulha Kangri
x ” | ’ VG: N N Va \ fl Pauhunri 2
| | G VAN A AN L. = / — Mo ei = I 180 humalbari
| | N A A" inchinjun A 23930
| = A U N
% £ N / I, { A /%
5 AN 1”
.) Bias al nn
C N xt Y 2 /
| I Suse KL SR] MN I\ :
t j | \ Ta u s SEN —- I motiharı > y NV
F | Nr ut NN Sn BG:
= . A Re SSR
vh | || From Sep 5 > N BI £ ] j ' India Hills Sec. So:
KNS SS
AT Pa III 34

DEHRA DUN BASE

 
   

  
    
  
  
  
    

Lambatach Hr

K Sorr: a
} Ü —— Kıdarkanta Tidal nz dr CUTCH 72 > Tr
I | Sure “|
| | : S s =
a | N DT
| | N I
|
|

 
 
 
 
 
 
 

 
 
  
 
 

Jhittagong
Tidal Station,

 

 
 

Secondary Series

 
 

 
   
  
 
 
      

 

  

 

 

 

   
 

 

 
 
  
    

   

 

   
   

  

  
     
    
      

 

 

 

   
    
  

        
   
    
   
 
  

  

 

 

 

 

 
 
 
 
 

   
     
  

 
 

 

 

  
 

 

 

 

 

 

 

 

 

 

 

 

 

 

 

 

 

 

 

 

 

 

 

 

 

 

 

.ı 2
20|- £
| sz 7 m —R
i - y = pr
| B N Si o ‘ > S 5 5
SER
| 9 | Y
IP Deal) a 7 ——
| nn \ | SS >
N I Ze
Y N A R</
| , IX SEA
IRA
. ce
o|| SIE 7 \
E \ Tidal Statig 7 I 16
4 VEN ZN
= G > Ben, anradan NT | |
| \ N a y ) 7 n Tidal Station AN Ri
N L RL x > \Y
> N R N Tot U ) B2 & L /
DIR \ Ban U Di
SR an.
RT
SEN:
S BEN IE
N 7 IL %
A INDEX CHART es
NIS 2 \ ISSN
N 3 TO THE
LS
GREAT TRIGONOMETRICAL SURYET
Hm 15 dal Station :
INDIA e
ISLANDS
3 Q
SHOWING COLONEL LAMBTON’S NETWORK OF TRIANGULATION IN SOUTHERN INDIA, IR 2 )
| THE MERIDIONAL AND LONGITUDINAL CHAINS OF PRINCIPAL TRIANGLES, Nr
THE BASE LINES MEASURED WITH THE COLBY APPARATUS, 8 S en, y
THE LINES OF THE SPIRIT LEVELLING OPERATIONS, j
TiasegBore THE ASTRONOMICAL, PENDULUM AND TIDAL STATIONS, | 5
THE LONGITUDINAL ARCS (}
Negepalam AND THE SECONDARY TRIANGULATION TO FIX THE PEAKS OF 3
THE HIMALAYAN AND THE SULIMAN RANGES,
Tidaı saenan AND THE POSITIONS OF BANGKOK, KANDAHAR &C.
EN Scale 1 Inch = 96 Miles, or EEE) N
8 100 50 0 100 200 300 ne 2
$
„Minicoy... “Pr
Tidat Station‘ Neu REFERENCE. N La NICOBAR Be
The Principal triangulation done subsequent to the year 1830 is shown —
in thick blue lines..... N DEE SE : * \SLANDS
SEYrLoR The Principal triangulation done previous to that date and all secondary N
triangulation is shown in thin blue lines. .......... . ET.
The stations where an Azimuth has been observed astronomically.- A | The Longitude Arcs are shown Uhse en L
ED The pendulum stations are shown bhus...:.........nn..oceseceeneen p | The stations where the Latitude has been observed astronomically
Place where Standard Bench Marks have been connected.......... 4 ! shown thus nein
The course of Levelling operations shown by continuous red lines... . ..-......uenu nee een ee es DT
L = - The areas over which observations for Latitude and Azimuth on the Group System have been taken are shown thuüs................-..- ©
64 > 5 5 z 5 © o F
Ä e 72 76 84 88 92 96 | 100
Reg. No. 270D. September 1911,-8.1.-1000 3 : — — — — — ee . —— 2 ERRRER ONSTERERETEEN 5 re |
x Published under the direction of Colonel 8. G. Burrard, C.S.l., R.E., F.R.S., Surveyor General of India. Heliozincographed at the Survey of India Offices, Dehra Dun.

Reg. No. 183D. November 1912 S.I. 1000
1913

   
