203

7690 7 | TEETT— | T8:c0— RE ee SE
GN Mor
6820+ | soLL [7 > | #900
67 50+ | ©

lbodon |eewo se ser |or or 0) mL x
2222227 EEE ongeg |08°90 LT SIT |#9°9€ &0 1 302

Veh 272 nn99do,
IESUT| LL6OT SS 88% 9810 ie m)

en aan 68 IF 1051 0 0 222,2. oroduosrsg:
ojoduoowag |FE98 ze ası [89:07 68 11 Um en

UPIPUT

 

 

 

 

  

4690 5 Nooupeuom |egın JE ale |90'39 se &2 |os:og FL er |sFL u Uno
| | | | | "aord Asuen IS9M
u 0 Se lie NIT | 209g 28 ICE |sHYH 10 Tl |SWEC x 6 “Kaopeaaosqg) Paaren osprıquueg
15.60 a boy a 03 5 0868 98 8) |08'%5 Le I en
96°°0— I TONSOoMN | | 94 . LS FLL 0908 So 8ı ı61°SS 87 0% So SEnueng8o,
65 T0O+ | TILTT |SET0O - | 686% PB se Fe » 55 88T [TOT EL FL |°098 28 05 | A Vooeg

I ssonaunong
we ee
32,2 emoseosen en
en
©; uomels ymuwtze eunSuorg, 110,7

Re Re 9° VOSPLIUIT
a ao
_
SR Nareeeleeeneee 9A], yoragq ı0 MOrT
an
Be ee einen

ee emereke "OSBT OTPPIN eJueT IV

=

|Alee $7 #) |TWE0 6& 0F
6LlET 86 SL 0875 85 68

|
07 50+ FILLT— 6870 |egieg | Som uno ann IE
7004 |666UL- |18:00= ggg 2 gpoouddert F6'SE LT ZWE
le er A see »0 06 0FES 9€ 68
2300+ F802T— | 87°00— | LE IS oposeg noßeg | c1 Tg 08 968 | TECH ag 88 |acce 08.08
oO LET mV 8000| 2° 275° Ameg|oeso 6g one oo ©z 18 |IETT 68 #8
Be er 20 ss 6808 TR 08
96.907 | SOLL’ TI | 8980 | 19'895 |°"°°°"° qurog aepog | 98°65 69 EHI | 9886 10 88 985 ST 08
6080 + | WS68T— | TE LO— | TE'6R |" deorgsionorg | 89:06 89 Cyg | 20768 &0 18 |68°C7 70 2E
6.T0 5 [39881 19810 |08°61 |°°°°*°° 002° ao 90T BE 808 |EC°9E TE 98 | 18'8g EI ge
46.007 | WPLBL— 19900 | 98:68 |" °°°° 9° uopueag | 10:08 90 982 |99°00 IT 98 |sW 17 80 FE
De a a nee gF08 08 TE
On Or co. jonas © 0, u eos FEHE &R &E
Ze Mo go IL’SS pr ge
SIE0+ | BLBHT | 370 | #686 |°°°*" "ureyunom ouogg | KETE BB IE |EI'2E IT 8 m9 8

 

 

 

  

 

 

 

   

 

IT204 em 70 09)  oogeung |oure ve CHR \o,se 60 5 BT FE a...
le Lo eo ee ae 6T FE en ep

270 = Her | 6E0r
4L.00— | SIEH TI— |#8°00+
Ilse
08007 |8L080+ |66'00+ | F&'TO
0,107 | SLIF IT | 0610 — 2
9180 | 8688 | 98°C0+ | 69’E<4
68.00 | SI9SET | 68.00+ | KETTE
FT 107 |cIT80+ \07TO+ ke),

 

a
oO
-

0476 OL 0888 86 88 |6S FR IE FE
8T 198 |96. 66 #5 28 90'68 95 FE
00.9 9596 81 98 6897 a1 98 |
a seo Luce
SIDE ee clio la eo
oe Bro Tall sor0nseeeeene Bun
SE SET | @E6E IT 08 Se oo
ne on ce ler ee

Be ae

Doro
, 9seg] Ugnog “uourgarg |

Vo e 202 oaugauug)
ee

DEE ed YHDN UOUFQOAT
EN. SEEN

 

 

 

Euer "uuag |
"94100

a ofepng

 

oO
oo

 

 

 

 

 

 

LE'S0— | 8881.04 | T8'90— |E1'28 Be 2 yes 6% 9% 82 88 |8TT°°°°°°° uONegSs opnyıSuog “uogeag
| | osnofg | | |

FE'00— | 6683 T— | 08°70+ | 298 | FLÖTE Preis sppen SF CSe 00°ST 68 81 Lug DIL 000200022 Bwersy zoräueg,

ET20+ 6208°T— | E9’I0— | 0:98 |° "NXOJWog yurog man 88 PL 8685 TI 9L |SLH0 Fa 2E |9I1 in

8990 — | TSFET— I 1690+ | 29:80 |°°°°°°  puegs] poßsey FE GLT |8C8T Ss <y |T929 82 98 | STE‘ puejspgouy .pum qIoN

a es a nanes

7 ı 7 nr v < r

 

 

 

Chi) Se au | N | Syypanu opus | "opny | et
Dv 10 sog 2, u N -Tze o}oPoaN) | -UOT OTI9PoON) | -TYe] or4opoan) | oN Sallyıs
| sv | L 1 ı > !

 

"po9nu1uo/) — TVOLLYHA AWIAd NI SNOILOTTAHA

uud uam llae Hbdiaıdı Marllähunı |. dd ul

 

1 ht. nu aan Mb ne u dar! Lak tm Rn
