 

 

 

a

I. — Autriche-Hongrie.

Ve

ill. Gruppe. Croatien, Slavonien, Norddalmatien. ; ns Sn

   

15. Von der Kranichfelder Basis bis Dalmatien, 20. Slavonien und südl. Ungarn.
Anzahl der Dreiecke 53 14
hievon unter M 23 oder 0% 8 oder 58h
1 8» 3 bs 2»
2 — 3" 1l >> 21 1 » 1»
über 3 ol » 2» nn —_
Summe der Fehlerquadrate 126. 2850 22.6476
m = 0,89] 0.031 =
F Zusammen Anzahl der Dreiecke 67
i hievon unter 1 3l oder 48%
ii 2 a 133 :
IF 2 — 3" le, >» IM»
| über 3, | » 2»
Summe der Fehlerquadrate 148. 9326
m 20. 0

  

nn

Hg

IV. Gruper. Bosnien, Dalmatien, Albanien.

9%. Norddalmatien. 3. Süddalmatien und Albanien, 23. Bosnien und Süddalmatien
Anzahl der Dreiecke 23 40 60 a
hievon unter W 13 oder 57°) 17 oder 43% 29 oder 499,
= N Try 30 » 9 a 22». il 0» 182.
= 2 wi en 2 3,
& über 3 — — 2» 20» _ _
= Summe der Fehlerquadrate 41. 7612 179. 1174 151.3315
€ u Al: al. =0".917
E Zusammen Anzahl der Dreiecke 123
: hievon unter I2 og oder Arc
1-2" 227 » a)
2 — 3" 29». 22,
z über 3: 8.» 0
: Summe der Fehlerquadrate 372.2101
m — el. 004 .

V. Gruppe. Oestl. Mähren und Schlesien, Ungarn.

47. Oestl. Mähren und N. W. Ungarn.* 18. Mittelungarn. 19. Zwischen Budapest und Fünfkirchen.

Anzahl der Dreiecke 36 I, 437,

hievon unter 1 13. oder 306°, 4 oder 24°% 8 oder 528%

1—?2 11 » 30 » 4 » 24 » 3 »...2063

2 — 3" 10»... 28) 2 a 28 2» 14 »

über 3 2 » 6» 5 » 29 » 2 > 14»
Summe der Fehlerquadrate 106. 6826 152. 8792 50.8864
m = + 0".994 217] = 1".063-

® Ohne die Polygone Zopenik, Innovec, O'hmelova, Ftacnik.

IE ce ae en
