ne

———

    
 
 
 
 
 
  
  
  
  
     
  
   

    

  

 

 

 

 

STATION.

52 Grünten .

53 Grünten .

54 Grünten .

ESPAGNE

18 Reducto .

48 Peissenberg (pilier) .

49 Peissenberg (pilier) .

50 Peissenberg (pilier) .

51 Peissenberg (pilier) .

 

DIRECTION.

Andechs.

Benedictbeuern.

Heimgarten.

Kreuzspitze.

Peissenberg (pilier).

Peissenberg (tour).

Edelsberg.

Lobon.

 

 

Erreur
AZIMUT. OBSERVATEUR
probable. |
|
| +.
Bo 32 27 4,78.) 0,57 | Oertel.
| |
| |
B. 109 42 23,54] + 0,37 »
B. 136 37 7,09 ist 0.58 | »
B. 18.51.2078, #035 |
A. Pas encore caleule. | »
B. » |
B. » | D}
N » | »

 

uw
=
ce
oo
Oo
I
~!
©
Ber

 

+ die

 

Commandant Borres: |

 

 
 

 

 

ESTERS NEO à
pinot ARRET PRES
Sees ec

QS eee

 

ST ge |

 

 

Sea

 

 
