 

'-_ 908 mo 0100°0F JunyprojäsnezyoN op yoeu I3r1N9q uomynparwegsig Iop oyıoyoisuf) orepyu oIq 'wesig-d 1omepsIog 'usuoreIg IE

  

 

 

 
 
 

 

  
       

 

 

 

 

 

 

 

 

 

 

 

0 va 6 Rz yo e = | 86 ee) 19 |viee oe ls 09| onogels | a
oe+ .| 08-7 | 606 | — \686 T06I  Piskerstog. 886 I.(@:2).) G 0:61 08 ren8g en a u
ga+ | st+ |9e8 0 186 ı = a IL 261 08 €°97 69 OMONIN | S
Bee — sel nl f os aa) Br LT Te Te po1osnon | n
6L + | OL -+ |982 — «083 CO6L | & GL ea) | cs 8120 gs 9°e@ 1yOSMOIOgE 2
Co | Sn (ch = 808 TO6T = £&6L | eo) | 0g ser 98 |8'28 sG ‘Arosqo 'Yedıoq a
ee rz |87L & $ 889 ed Is TOT ee 18:80 epreMm “
den | en | ser z co! h ‚084 ed 87 9:08 88 10:67 MONSI 1
stt | 8I+ 982 Dee msaodıeg | LEL (a) BE IsT 98 1Lr 19 sneyänez EM :
0. 57 1e98 | 188 & | 8e2 ea | u |8'T Te rer &@ gg nNByoste ü
Kun a Er 21802 a L8T (ee) vıa |1'70 98 |g'80 Aadıyosıyog a
sSI+ | m u | = En # tel eo] FIs on 9E |Fer sany u
FIIR (28 | 825 H “ er (ee) | 1885 9:07 98 808 LAONA'NSIOUOSIUOSOTT “
re | Ti ers = 6681| = LT ed) | res jo:g ze |v'sE z9p0J04 1omougIg =
er. da. 108 => 006T | £ [291 (2) | 808 56% gg |7:08 | SINOWIANT s
Be m Es = u \g@1 (ee) | 808 |8:08 28 |7°ST | zapojoy Ardoft, a
set | 91T 88T : 5 7 \rer eo) | v8 |9:6g 28 |s’2T eynouglsnT u
ve+ | a0+ Ieuı 181 _ h # IT \(@a)| ges |ewr 18 |g°eI | 1oysusmey 'ugozem
So an ru 91 = 6681 x |FIL |@® ges |e He 18 981 aomyg 'apuwxaly 2
Oi m le. 2 { or eo) | ana Ivraı gear | welogo .
Ba ge, le ‚SET ee e a 680 eo) | Fes 6° 9E Ic T Ie ®IMOIOUOSIOM ne
+ | + |erı |ıe1 ses 3 & 007 (re) | 618 |T'8E 08 |T’cs xzolyt “
Da Se \6eT nn .coı | 2 ‚880 (ae) 878 |Ss’L 6T 987 ANOJOOISUOLOSL, e
ge+ | z1+ 181 sr = Oi 0061 | & | 20T eo) 808 |8:E 9E CH | omoleyoden .
ee. ne \ıe1 a: 'ecı Be = | L8O eo) IB 6:00 98 ‚eer oUOWOT ofag “
eo jet = ee a 5 | 90 ee) | ges ges Le LH Ku9[o109) 104UON | 2
Kae, [are 687186, — 641186 | 66ST | TOspmogpeilT 00T" 186 (@:3) | 061 |a;rr.98 \9;1r..oe | souumä] 'upee |  Pueigng

| | | | |
wo g-0T M uw 5-07 | wo wo mar 8-01 wo wo 1 | wu T | |
86 I MA b—,6B °%5 ayef  Aaojydwgqoag |eroRuosomotc ayoH eduwT onoig uoryeIg |

| | | |

rar 'S TA '@L

  

 

 

 
