| we mr ir rs

ee)

ve AT

LCL A

Lip li

(DLL RCI TU] RIT.

rl

=
m

1

29. Station Tise.

À == 57 19 220965

Jegerdalsh6i
Teglhöi .
Storskoven .

en 4B’ 356104

Log. d. Entfern,

Azimuthe. in Toisen,
O° 04 29108 4.3174015
220.553 25.0 4.1799418
290..45 11.22 4.1526573

30. Station Teglhöi.

A= 57 297 2175369
Tise |
Skagen .
Flade .
Storskoven .

= + 2° 26 163563

41° 09". 42:21 4.1799418
226 07 26.43 | 4.2981124
290 28 49.06 4.0346779
348 40 01.73 4,2258282

31. Station Flade.

R= OU 25 2e
Storskoven . :
Teehönr . 2... .
Meridianbuens Endepunkt .
Skagen

l= + 2° 06 31.1744

28° 35’ 00”42 4.1591936
110, 45.28.15, 4036019
199 35 19.08 42556405
193 38 55.45 4.2564305

32. Station Skagen.

A= 57 43° 460570

Flade .
Teglhöi

= +1 58 925
13° 45 5889 4.2564305
46 31 10.82 4.2981124

33. Station Knivsbjerg.

kee 95083109 8927
Skamlingsbanke
Dyrebanke .

Leerbjerg
Lysabbel .

1 = 4+ 3° 08 03.4088

195 542 1410 4.2229196
240 51 11.32 4.4423115
270 52 36.98 4.4319151
305. 22 0925

4.3559597

34. Station Leerbjerg.

À = 55.01. 29.4323
Lysabbel .
Knivsbjerg .
Skamlingsbanke
Dyrebanke .
Fakkebjerg .

= + 2° 18 29/8418

34° 29° 40'42 4.1851140
91.35 46.19 4.4319151
126.31 50.44 4.4532672
169 .09 27.95 4.1505198
326 58 11.36 4.4179919

 
