Te

RAM AHOHNL AU 3

Nu ABl

hd

Tinten

Tal

ia

Eee FAT RRTTARR TITHRINTGIL NE LLUTTERATT FRI TOT

 

 

gr

 

 

I. — Autriche-Hongrie.

 

21. Zwischen Mohäcs und Peterwardein.

Anzahl der Dreiecke 16
hievon unter Re I oden 090%
1— 2" 3 » 19 »
2-3 2 » 12»
über 3. = —
Summe der Fehlerquadrate 26. 8849
m — == VE 143
Zusammen Anzahl der Dreiecke 98
hievon unter M
1 ar DU
2 — 3"
über 34

22. Oestl. von Peterwardein.

14

6 oder 43°),

9 » 36 »

3 » 21»
85. 35974

0", 918

42 oder 43),

26
21
9

» 2%
» 2»
» 9»

Summe der Fehlerquadrate 372. 6905

a — 21.106

VI. Gruppe. Galizien und Bukowina.

24. West-Galizien.

Anzahl der Dreiecke 106
hievon unter I 83 oder 5903
1— 2" 3l » 29 »
2 — 3" 1% » I,
über 3. 2.9 5»
Summe der Fehlerquadrate 209. 1326
m =E 0,81]

Zusammen Anzahl der Dreiecke 159

hievon unter I
1 er Du

2 But a"

über 3,

rl
55
19

8

25, Ost-Galizien und Bukowina.

Summe der Fehlerquadrate 355. 7975

2 in = EU. 864

583
19 oder 350%),
24 » 45 >»
1 » 14 »
3 » 6»
146. 6649
= 0", 960
oder 49°),
>34»
» 12 »
» D»
Hartz
Oberstlieutenant

Leiter der geodätischen Gradmessungs- Arbeiten
des k. k. militär-geographischen Institutes.

 
