 

“s2104 SNJ 6
SAIT PT NE ON NOT IP PUBS TE AO OL, 5 :
SYD: uy en Eee ee fort]

 

 

be punt)

 

C |
IN

fl

|
N
Ur

        

   

UARYT '

 

 

 

 

uUlIIspues -uay)e MI BL AT

 

 

 

 

 

 

 
