ee | nn. ne

 

 

BEOBACHTUNGS STAZIONEN I. ORDNUNG.

|
| RESULTAT DER

 

 

 

Name ISTATIONS-ÄUSGLEICHUNG
Makriplaji
Kidarén 0 0 0.000
Patéra | 37. 128.300
Aiapöria | 122 30 35.116
Arachnäon | 169 15. 592658
Sköna | 208.28 312.676
Valtsa 239: =1:59..955
Paläovüna | 295 12 35.659

|

Megälo Vunö II

 

Artemission
Killini
Valtsa
Sköna
Arachnäon

6 0 0.000
105 59 49.730
157 59 52.510
220 24 19.250
268 12 49 .080

Aj. Ilias Levisi

 

Artemission
Kandreva

| Tetraji
Mindis Oros
Valtetsinikos
Killini

0 0 0.000
88 38 46.782
127 4 7.675
152 42 47,548
189 26 42.683
280 3 1.040

Malevön

 

Taijetos
Lik6dimon
I Iöömi
Tetraji
Kandréva
Parnon

 

 

0 0 0.000
72 26 41.475
113 8 46.668
150 59 29 .094
199 47 50.157
269 27 48.760

 

RESULTAT DER

 

 

 

 

 

NaME STATIONS-AUSGLEICHUNG
Té6mi
Teträji | 0 0 0.000
Malevön 86 19 4.000
Lik6dsimon 185 18 49 .955

Aja Varvara

260 10 14.095

 

 

Tetraji

 

Minéis Oros
Aj. Ilias Levidi
Kandréva
Malevön

16mi

Aja Varvara

| 0 0 0.000

96 19 31.370
| 131 40 36.405
| 183 9 57.190
| 239 0 12.498
| 278 32 19.743

 

Aja Varvära

 

Minis Oros

 

| 0 0 0.000

 

Tetraji 35-20 26 ..050
146mi 75: D6 99.62)
Likodimon 140 36. 35.515
Varnava
Pendelikön 0 0° 0.000
Pärnis 53 38.°.2:0:617
Ktipäs 105 37 37.788
Airfis 152 39 58.841
Oktonja 198 32 47 .704
Kliössi 273.2: 56:444

v6; oma un Whsnhlskänhshni A neun nn

 

 

MT I lk

viii me ery
ISBT) BE ERTS

rl
+

hi

ja

 
