 

BR di
18 2 1,05 #40 40 204 105
19 2 07 Ay Al L 2,55 = 115
| 20 + 0,47 1) 38 42 1 3.02 0)
| 21 + 0% 4 44 43 81a = 09
22 + 0,69 + 34 44 Bet 107
} Corrections Ges Coordonnées

Sommets a xX Gaye

RENCE Seal, 0,00 0,00

|

1h

|

;

| met met
|

©
4
=
2g

u a + 0,18 4 0,80
CU + 0,04 + 0,13

Duclamamte 4. — 0,15 — 0,02

   

Cemieneno 0. — 0,23 + 0,44
Maueo de Vinilla......... = OAT + 0,01
PA — 0,52 + 0,45
Da ee ae, — 0,91 -- 0.10

CHAR 2... .... N)

   

SEES ENTE

»lto da Buerto....... — 1,03 + 0,13
Mauco de Aconcagua.... — 1,13 — 0,13

Gala... 2... — 1,20 — 0,49

Terme, 2.0.00 oe — 1,34 — 0,29
Chacle tr — 1,40 2 0,51
kulmamen.. 2... — 1,52 — 0,42

Ba. 10 A

Semen tte à

  
