Sn 9. : sy € G L 0
au | nn

!

I

Y

RENDUS
CE GENERALE

zZ
=
ec
=
=
Zz,
©
=

SEANCES

ESIQUE INTERNATIONALE

MI
)

ÉOI

AMBOURG DU

\
J

\

IE AH

MPTES

C
[ATION ¢

|

DE LA DIX-SEPTII

1

td nd LA dd |

ho aie blll dA da à nanas

 
