 

 

 

 

— 286 —

   

 

 

 

 

 

 

 

 

 

 

 

 

 

 

 

 

 

 

 

 

 

Erreurs de clöture des triangles desquels ont et6 mesures les trois angles.
NOMBRE
. AUTEURS DES INSTRUMENTS SAUHUER NOMBRE DES a
a EMPLOYfis EI DES le a
2 SECONDES
© ET 0 yornn VERNIERS POUR CHAQUE a” REMARQUES
nn DIAMÜTRB DU CEROLE on 5 m ya
Zi OU DU OU POUR A
ROBTAONEL MICRoscors | MICROSCOPES CHAQUE
DIRECTION -- Ds
XV.
RESEAU DES ABRUZZES, MOLISE ET ROME.
Directions.
1 , Starke de 27 cm. -Repsold de 27 cm. 20 2M 36 86. 30.107, 182 0,6115
> id. id. id. 36 30 36 0”, 858| 0,7362
3 id. id. id. 30 30. 36 1 „2a 1,5401
4 Repsold de 27 cm. id. id. 30 36 32 |2 42] 5,8612
5 | Repsold de 27 cm. - Starke de 27 cm. id. id. 530 32 58 3,479, 12.0756
6 | Starke de 27 cm. id id. =0. 36 36 2,041) 4, 1657
7 id. id. id. 36 36 36 3 ,788| 14, 3489
8 | Starke de 27 cm. -Repsold de 27 cm. id. id. 26:26 26 0 ‚558 0,3114
I id. id. id. 2 50 57 2,108 5, 7985
10 | Repsold de 27 cm. id. id. 34 33 33 0 ,219| 0,0480
11 { id. id. id. BA 25 331,282 1, 6435
12, Starke de 27 cm. id. id. 36. 80 >06 1,025) 1.0506
18 ide id. 1d. ©0750 0 1 ‚401 1,9628
14 | Starke de 27 cm.-Repsold de 27 cm. id. id. so ou 37 0,018 0, 3819
15 id. id. id. 3031 37 2 ,642| 6,9802
16 | Repsold de 27 cm. id. id. 22.32 32.)4:.,06] 16, 4917
17 | Starke de 27 cm. id. id. 36 36 36 |2 „416 5,8371
18 id. id. id. 86 80 30 0,920) 0,8464
19 id. id. id. 56. 50.30 0,19% 0, 0388
20 id. id. id. 30 30 80 3 „3051| 11,2292
2 id. id, id. 36 36 30 | 1,652 2a
22 id. id. id. 323 35 34 2,914 8, 4914
28 id. id. id. 32 729 28 3,010) 13.0321
24 id. id. id. 34.32 34 |0 ,026 0, 0007
25 id. id. id. Sl 0, 1789
id. id. id. 33 36 36 10,304 0, 0924
27 id. id. id. 28 3 28 2.583 6, 4668
28 | Starke de 27 cm. -Repsold de 27 cm. id. id. 28 28 33 1,144 1,2410
29 id. id. id. 33 36 35 1 ,466| 2, 1492
30 | Starke de 27 cm. id. id. 4] 50 51 1 ‚956| 3,8259
‚31 | Starke de 27 cm. - Repsold de 27 em. id. id. 40 48 45 0,662] 0,4382
32 id. id. id. > 89 30 12,000 7, 0756
33 | Starke de 27 cm. id. id. 3] 28 28 299, 1,6854
a id. id. id. 30 26 26 1 ‚698| 2’ 8832
35 | Starke de 27 cm. - Repsold de 27 cm. id. id. 7 82 1,38 1,8036
36 id. id. id. 32 317 38 |2 ‚674 7,1503
3 id. id. id. 20,33 >06 07,802 0, 6432
ss id. id. id. 25 30 27 \0 ‚510 0,2601
>g id. id. id. Sl 32 23 1 ,614| 2,6050
Reichenbach de 32 cm. - Repsold de a AV,
27 cm.
40 | Starke de27 cm. - Repsold de 27 cm. - 27 2M 27 20. Sl 0/, 140) 9,0196
Pistor de 27 cm. ;
41 | Starke de 27 cm. -Repsold de 27 cm. | id. id. 33.88 38 3 „3l4| 10, 9826

er neda  nesLahhia

scene Ab 2 li a nr
