 

_ 408

Sur cette somme est depose:

aupres du „Kur- und Neumärkische Darlehns-

kasser a Berlm 0. - N. 622200
aupres du „Königliche loss re:

Staatsbank)a aiBerm 0 „0
dans la caisse du Bureau central pour I ats

daomımeitalion nano, , 1 500,00

Total: M. 58803,17

Les contributions arrierees etaient & la fin de
aunde. .Busunab na. Zeiten auf 418 Mi, 07.060,99

Le total des contributions annuelles monte
d’apres le tableau & la fin de cet art. & „ 71.400,00

Les depenses specifi6s pour le service des latitudes sont:

Pour les stations au nord de l’equateur.

Frais d’exploitation de la station & Oarloforte . . . .... M.
„ » Bw » Mizousawaı. 02 al a
bs » Bl »ullschardjou. ee ne
» » a0 0.0, Omeimnati.... 1;
> „ Ukiah du ler Juillet. 1913,

jusqu’a MH fin Ai mois de Jun old 0, e

Frais d’exploitation de la station de Gaithersburg du 1er Tuillet

LS, josqusa la tindu mois de, Jum 11a 2 2205,

Frais d’exploitation de la station de Turin 1913 . . 2... ,

Honoraires, pour les caleule a 2.0.0 ...0. 0.000,

Traıs) impression.. 0; Su ee

Erais denbureau: diverse ch di ee ee an en

Total: M.

Pour les stations au sud de l’equateur.

Frais d’exploitation de la station & Johannesburg 1913 . . . M.
" 5, Santiago (Chi) lala)y. ı ,
Elonoraszes paun lea caleule, 0 0.2... u... ey
Brass. de \bureau diverse 02 00 0000. 0 a oe
Total: M.

8 000,00
8 000,00
4 000,00
1 000,00

8.000,00

8.000,00
1.000,00
8 794,70
112,70
940,01
47 847,41

4.000,00
1.000,00
1 038,20

130,70
6 168,90

rbb un

 
