97

  

Anlage III.

UEBERSICHT

der Internationalen Erdmessung,

ission

von dem Dotations-Fonds der Permanenten Comm

 

nach dem Stande am I. Oktober 1837.

! "LIYINI4AH

: DunssaoaunpA UalDuorDU
-t0JU] op SNDaınqIDajuUad sap AOWAAT 19T

I88T I9TOPO 'T uap “umaog

-UOP.IOM IINJPSTOA
UOLIOLIHTISH(SIUNUYIAHY STE SUNUYI9ASIALEF UASISSPYUL
-SETNUPAIO IOP ISYIBUWEP uUopA9A pun KITAIOSSE neaang
-e1Ju9N) WI purs uodunyınd pun usdunstemuy ld

 

 

 

  

"YNIBW (SC 1887 014 asgayıag
ae (eE9gT „ırstpeprdey

-"U9PIOM UISITMIHUILU
Sunuy9easelygf AOp UT UapIoM UaqTes

-9Ip :purs JaynJosjne Jy9Tu doly sooenag |
|

uasızjol SOAUT MONSTONJSUNIEH dep und
om ayoram "Sf "pP IML ONE HOs sopurjs
-9J SEP UASUIZ IP YI9OU UHWLWMOM NZeA

 

 

 

 

 

 

 

 

 

 

 

 

 

 

 

 

 

 

 

age ; ZemumTe: Igeosun
=. Sue mo Eı ara 3
(ep I zemnog mr oa : 7 pe 7 |
GL 2 >: yoewoieg m |
SOB.NTOASUOLNLIOA a, 5
SD neue ITS vwung : owyeuurg |
9A T7q Tedweysfes 0 2a. no < ı 2. © Wormeds @j
| -[oM .nJ uodepsny | -ıog] '"osseyy-suoreösr] | 9 || O08T « a ao Aral
— 0088| 4887 Teliend 'o 'n 07 ‘ a uorspagl |EI
| [ o1d sunsmpegosun |) * = - aqened 2 0 << ı e ..  VoWewna \@i
098° wsoppmqapler > = og 7, I = 002 jeonnod ıl
dern 2 2 ., 7 388.108 ea N‘ US9POAUIS OT
« uodunfpuryno‘ >» 0705 den « 22 SBulguRd 6
ep in usjsosspnsg | : 2. : mikup 07% « “ s; 'opuellopein 8
nedunjgezsäefyosqy | non "yasıy old | E| OR «  . 3oqwoeyanM 4
au ae 7 oa > 2 > Zuouhnas 07% « "2  zianyossl
| "SHLLISTLIOUIN SOP 076 « ‘: ... wosypes 6
rejsun "udersontT |< | O%6 « i Scmauee 2
ge 28 98 uoN 07% « ‘Ipejsunteq-uossoH] 'g |
| : « uodunfpuryda‘ >» = A010, Mansun 00% « ne Uleoa le
| usp nz uoyieyy ang | "yostgde.15095- eh | L| 0081 benrg-suonmog| * ° °  Uossnodd |T
= ae we „za,
3a "AM | -pue]suodon) -195URJWF soN |) "SaeN | "Puejsuosen) ‚aojyezunn | oN
| E dv SAY | SNHVNNIH
Sem

 

 

 

   

 
