      

 

 

— 436 —

 

NOMBRE

 

 

 

ae Erreurs de clôture des triangles desquels ont été mesurés les trois angles.

 

 

 

    

 

 

 

 

 

 

 

 

 

| AUTEURS DES INSTRUMENTS LECTURE un DES ERREURS
: ne EN OBSERVATIONS DE CLOTURE
SECONDES DES EXÉCUTÉES DE
ET VERNIERS POUR CHAQUE A2 > E] m
© DIAMÈTRE DU CEROLE | om CHAQUE ANGLE TRIANGLE oe
J s ; OU POUR A
HORIZONTAL mmdRosvopm | Tn 0S00PES CHAQUE

? DIRECTION + | —
‘109 | Ertel 12 pouces. 2) 4 9 587 31, 0249
LU id. id. id. 9 0,16 0, 0256
À id. id. id. 9 2,39 5, 1121
id. id. id. 9 0.21 0,0441
Repsold 8 pouces. id. 2 9 0,44 | 0, 1936
id. id. id. 9 0,04 0, 0016
id. id. id. 9 3,44 | 11,8336
id. id. ich. 9 229 5, 2441
id. id. id. 9 224 5, 0176
id. id. id. 9 3,03 13, 1769
id. id. id. 9 2.02 6, 8644
id. id. id. 9 1 74 3, 0276
id. id. id. 9 0,74 0, 5476
id. id. 14, 9 2,15 4, 6225
id. id. id. 9 1,3] 1, 7161
id. id. id. 9 1,04 1, 0816
id. id. id. 9 0,8 0,6724
a i id. 9 0 , 30 0, 0900
id. id. id. 9 , 88 0, 7744
id, id. id. 9 1,51 2, 2801
id. id. id. 9 0,05 0, 0025
id. id. id. 9 0,21 0, 0441
id. id. id. 9 2,60 6, 7600
de oy id. 9 0,82 0, 6724
id. id. id. 9 0,24 0, 0576
id. id. id. 9 0.153 0, 0169
id. id. id. 9 0,74 0, 5476
id. id. id. 9 1,05 2, 4025
id. id. id. 9 0,92 0, 8464
id. id. id. 9 1.05 1, 1025
id.: id. id. 9 2,14 4,5796
= id. 9 0,91 0, 8281
id. id. id. 9 2,30 5, 2900
id. id. id. 9 1,16 1, 3456
I: a N 9 05275 0, 5625
id. id. id. 9 1,09 1, 1881
id. id. id. 9 2,18 4, 7524
id. id. id. 9 0,02 0, 0004
id. id. id. 9 0,29 0, 0841
id. id. id. 9 224 5, 0176
1% a id. 9 021 0, 0441
id. id. id. 9 ‚58 6, 6564
Littman 12 pouces. 4" 4 5 3,89 15, 1821
id. id. id. > 2,09 4,3681
id. id. id. 5 Oy Od. 11, 3569
id. id. id. 5 1.92 2, 4649
id. id. id. 5 0,85 0, 7225
id. id. id. 5 427 18, 2329
id. id. id. 5 1,46 2,1316
id. id. id. 5 281. 8, 2369
id. id. id. 5 2.88 5,5225
id. id. id. 5 0,94 0, 8836
id. id. id. 5 2,9 8, 8804
id. id. id. 5 171 2, 9241

in nad NE ET EE mn MELE

ideas

vevvaaahmll ls
