 

re pe ren er pen

TEE] N TEN

 

 

158

 

 

 

 

 

 

 

 

 

 

 

 

 

” I
"A — 06 uaopuos “OA — 9,6 Jyoru epsıyosıojun osorp PUIS CH-Fg ON ANA r

 

 

 

 

 

 

 

 

 

 

 

 

 

 

 

 

— | 7681 « ) | @e908°6 || uosuyoZ CH
= 7681 « | | Zvg08°6 | popsang 2
T 7681 { I | Er808°6 |) ° JeLUZIOYOSH ey
z es « ı 72908°6 | ; » 3eGmktezul] 6%
Voss 768) s |) 79708°6 | 223509) SULY. li
2a Fol « | g9E08°6 | " U9uHUISOOH \"IPIEUYOH IS | 0%
En a \ | 1SE08°6 '  NEUNOPUY (uOp aoqn our] 6£
— 7684 « | <7908°6 en 86
Sn 7681 « | 7EC08°6 ° PuEMYISIOYDOY E@
a 7681 « | L6808°6 | °  Z19quIoH gE
47 7681 & |! 79908°6 UONTISAJH GE
768) NTuIy9SIossom, | E0908°6 uoen) 9URS | | TE
= 16681 « 98908°6 |" uosumom \ |£€
= «68h x 07908°6 ı SL USSOLAE | zE
= cos! « G6808°6 |" Zungreug %° * * zeemuas | yE
— a6 « | TEROSG co N 0€
— 68 NTWYOSIOSSON (9°%) G1908°6 | ı AU 68
| | | |
ol > = 2 ur o = 6-6 w 5 & a
- 35 I =] —_ een Bee
= I > el, ko u = .

Ss SW re os 22 02, 5 -uon ee
< — SS] -oıpegoag | — 8 == geri75| $32|s853=-72| 8 S
- 55 |8€ re =: ses ri 2 221.5 < 2 2 ‚esepemuen dNYI 2

Se 138 5 sag) = >: jo 2.2 535 =

us 58 | Se Iiezase. 25... 25 5

 

 

 

 

 

analnZnang nun nun > immun un nes nano sn Un nun um nn nn

2 ac ame um e& neues u wis teen ac

 

 

 
