 

a
|
I
|

|

|
+
a
|

|

|

|

|

 

 

 

 

 

 

 

 

 

 

 

 

 

 

 

 

 

 

 

 

 

 

 

 

 

an
210223
2A 16
25.58
25.39
24.68
24.96
24.92
2
24.96

25053

25.80

24.38

215. LO

25008

24.77

25.12

DS yal

25.06

 

1892. a A ee ua I: Watierenin: ae ere En Polhôühe.
A Mes gig: aera. Schr, ae Declinationen, |Mikr. Ables. | Refract.
j oO on an 17 Se 17.070 I-H23° 7’ 51721 a 21° 16° 24:82
|
D Min us ter
4 ye ir on > ae + 6.526 13 7.94\-43 ee
5 n ee. ee en m cl 22 Go|) Ce
©] fee sale ei oath sa] ae] 16 36.06 10.79 0.04
|
VG Petal et ana] 0 sl te
|
er a eset 9-12] 1 se:s1+4 44.99 40.08
+ i ed a in — 1.650) 17 15.03|—o 49.63 —0.01
5] 2 sms storm onu) 2620010 4651 ove
+ cy eee la eae ee — 3.850 18.20.80 —I 55.81 —0.03
Eee 2420-86 à 02 0.04
2 N a a at a — 1.995 | 17 24.82) 1 0.01 —0.02|
i et be 2 à == 8.096 20 28.38 —4 3:35 —0.07|
Bra 5-22-63] 12:88] +0.08
| | |
re I io : ne I — 7 20 30-144 13.27|—0.07|
D mn D ie) raumatn 2.
D nd es) à m4 ser 0.0
release) 53 rèrts 16.39 10.05
| |
D no) > nés
te 6 een Er ae oe +3 os 14 29.07, 11 54 eo.
0 Na nl eh nes sm 15-76\—0.05
lese 1x sects str] tos
D M M dote) j'a rétooe 49,460.
3 Z 10.368 + 2.3 — 1.84 0.110.369 + > | fo, 276 oF be
€ © ce. 192.252.-— 22.9. 9.1 0.0|10.229 | |

 

La Abid di Ma tN da ee

denken

ra nensinnnn mus bleh |

 

 
