ne

UT) Raul al

in

TIRTTANAR ILL NgIN RL gem ll

MRir

 

xII.—Prusse, A, — Erreurs de

x
>

 

 

 

oa

clöture des triangles desquels ont et&e mesures les trois angles.

 

 

 

 

 

 

NOMBRE
: N ns LECTURE 2 DES ERREURS
5 AUTEURS De n NOmBER | nen en
= Pa oma DES EXKOUTERS DE w:
© ET ns rk ° VERNIERS “ POUR CHAQUE A2 REMARQUES
: DIAMÄTRE DU CERCLE en OU DES CHAQUE ANGLE me un
A OU DU CU POUR A
u “miorosodem | "  ROROOrES CHAQUE, En
DIRECTION = | —
50 ı Pistor et Martins, 10 Zoll. 17 2 micr. 36 0",65 0,422 | Voir" DasRheinische
Le tambour Dreiecksnetz HeftIl
des micr. est Berlin 1882.
divise en se-
condes. z
51 id. id. id. 36 0,95 0, 902
52 id. is id 36 07,84 | 0,106
53 id. id. Id 36 1.15 1,322
54 id. id. id. 36 kr, 1,232
55 id. id. id. 36 1,83 3,349
56 id. Id“ id. 36 88 1 169
57 id. id. id. 36 0 0
58 id. id. Ton 36 0,70 0, 490
%
DAS HESSISCHE DREIECKSNETZ.
1 | Pistor et Martin, 10 Zoll. I 3 MICr., 36 0", 95 0,902 | Voir “DasHessischo |
Le tambour en moyenne. De
des mier. est
divise en se-
condes.
2 dh id. id. dl. 1,90 3, 610
> id. id. id. id. 125 1,562
4 id. id. id. id. 2.50 | ‚0,20
> id. id. id. id. 1,36 1, 850
6 id. id. id. id. 0,38 0, 144
7, id. id. id. al, 075 0, 533
8 id. id. id. id. L,10 1,210
9 id. id. id. id. 1,8 2,341 -
10 id. id. id. id. 0,37 0.137
11 id. id. id. id. 2,22 2022
12 id. id. id. id. 0,68 0, 462
13 id. id. id. ıd. & 1:19 AO
14 id. id. id. id. oa 0, 096
15 id. id. id. 10% 0,04 0, 002
16 id. id. id: id. 0 0, 029
17 10% id. id. id. 2.29 5, 244
18 id. id. id. id. 1.28 1, 588
19 id. id. id. 10% 1,99 3.128
20 id. id. id. id. 0,64 0, 410
2] id. id. id. id. 0,48 0,230

 

 

 

 

 

 

 

 

 

 

 

 

 

 

 

 

 
