ge

VII. — Grande Bretagne.

 

INDICATION 5 DIRECTKEURS ıl <
LATITUDE. |LONGITUDE. EPOQUE. INSTRUMENTS. |) REMARQU 4
DES POINTS. ET OBSERVATEURS. ES, 7

nn

 

 

z

Geodetie connexion between Great Britain and the Continent.

Montlambert 50843, 1 ag at 1861 Col. Ularke, capt. Trench, Ramsden’s 18 inch. ||. 446 in Tr
serg. Harkin. | 2
St. Inglewert...... 50 52 14 ,1822 3 1861 2 Trench, sergs. Ma- , Troughton &.c. 2 foot. | N. 445 in Pranıe
dagan, Compton. | ie

Harlettes ..| 50 42 59 | 19 38 15 1861-62 Capt. Trench, serg. Har- Ramsden’s 18 inch. |. 44 in Fra A
kin. I Be

Gravelines 5) 59 12 | 19 47 23 1861 id. id. I a
Cassel 50.47 574 20 93 8 1861 Capt Trench, sergs. Ma- | Troughton & ce. 2foot. | N. 21 in Fran
z dagan, Compton. | 1 in Belgium
Dunkirk Du 9778302092793 1861 a Trench, serg. Har- | Ramsden’s 18 inch. | n.23 in France
In. x 10 in Bel ei
Hondschoote 50 58 54 | 20 14 59 en u
Mount Kemmel ....| 50 46 44 | 20 28 35 1861 % Trench, sergs. Ma- | Troughton & ce. 2 foot. || N. 12 in Be i
agan, Gompton. | a

 

 

 

 

 

 

 

 
