 

 

 

 

 

 

 

 

S © je je ae se a ji ci ; nn ee WAR BENT Ri besa as
Ore een er ES = : EN RE ERSTER EI SE RNIT NS TE uremia AUTANT ee Me « BER:
Be oS Oe wa DE a i t

ie
BE
|
ir
II.
= ;
{ x
h

   
