 

14

 

On ae

 

 

 

 

 

ERREUR || METHODE ET INSTRUMENT
OBSERVATEUR.
or AT FON. LATITUDE. en caren
|
13. Cerkov . 49° 22’ 59"05| =& 007 |v. Ganahl A. Instrument des passages
2 dans le premier vertical
à lunette brisée
B. Hauteurs circumméridien-
nes. Instrument universel
à lunette brisée de Star-
ke
14. Rapotic 49% 11; 2273 +01 do. | A. Instrument des passages
| brisé dans le premier
| vertical
| B. Hauteurs circumméridien-
nes. Instrument universel
15. Nördl. an bei Wiener-
Neustadt . As: 47801 0.1 v. Ganahl, v. Sterneck do.
16. Buschberg . 48 34 37.7 v. Sterneck | do.
17. Saseno . 40 29 49.1 oi do. 'Hauteurs  circumméridien-
nes -
18. Durazzo 41 19 55.0 a= 0.2 do. | do.
19. Monte Hum auf ‘Lissa 43 1 45.3 Ft v. Ganahl, Hartl | A. Instrument des passages
dans le premier vertical

24.
25.
26.
27.
28.
29.

Cor

. Sibenica

. Oestl. Basis-Endpunkt Klein-München

. Haunsberg (Neu)

Oestl. Basis- ann |
Kor . :

Przemysl

St. Martin.

Grzimalow .

Nördl. Basis-Endpunkt b. Kr anichsfeld

89 87 12.2

1

non calculée

do.

H

0.1

H

47 54 57.7 0.1

 

non calculée
do.
do.
do.
do.
46 28.107 | aE ORL

 

 

v.

 

 

do.

. Sterneck

do.

Ganahl

. Sterneck
. Ganahl, Hartl
. Ganahl, v. Kalmär

do.

. Sterneck
. Ganahl, Rehm

B. Hauteurs circumméridien-
nes

 

 

|
\|
Ay
|
|

| A. Instrument des passages
|| brisé dans le premier
| vertical

| B. Hauteurs circumméridien-

do.
I
| A. Instrument des passages
| brisé dans le premier
| ~ vertical
| B. Hauteurs circumméridien-
| nes. Instrument universel
| do.
do.
do.
do.
do.
do.

 

 

|
|
| nes. Instrument universel

 

 

 

 

 
