 

|
|

Fe ätig

ve AT er

a

mi

Pr TR I

llöhe über
N.N:.

[ix@esimgsder Brücke überdeNuda en 192,162
[1 Kilometerstein 43 bei Ob. Florstadt . . . . 0. Lod,
[] Strassengrenzstein vor der Post in Staden . 137,590

U] Gesims (Nordseite) der Brücke zwischen Staden und Nied. Mockstadt 125,950
U] Gesims (Südseite) der Brücke in Ober Mockstadi . . . a lo

D,Bahngrenzstein am Wären a 000 nn . 188,685
© Ranstadt, Betriebsgebäude der Bahn Giessen-Gelnhausen . . ua, 128 209

Lundstrasse Hessenbrücker Hummer-Laubach-Schotien-Gedern- Wenings-
Hitzkirchen- Wächtersbach.

U] Meilenstein 109, ca. 600m nördl. vom Hessenbrücker Hammer . > »208.120
® » Minen 198,506
EliBrückerüberädie, Lauten, 0.000 u. 3385
EP} Meilenstein d118. 1a... a 2 208,261
wi » Ba... 7% 203,945
Bolzenstein’an der Wetterhrücke m Eıbach ı 199,843
EI ’Südl.Kanalplatte vor Laubach sun 218,480
U] Südöstl. Ecke der Brücke am Kreuzpunkt der Str. n. Laubach und
Freienseen nn DBIIDIELE Dan san a, an
D[IMelenstm 436 aaa 2 215,988
DI] Brücke über die Wetter m we «a 997,459
[Meilenstein 10 u... u u 7% 289,543
Bolzentim.Ranalamdgerhus  ı 256,154
Bolzen’ander Horlofibrüce . . 281,794
EIMeilenstem 60. ... . .. 0. 311,061
= » 169 2 sea a  ı 379,927
[I’SoekekamBallthorhkaus . . .. 5 399,864
[I Meilenstein 170... 0e...abäbe he zo 361,016
oO » 172... sent EL osasimemeldo a... 839,697
U] Kanalplatte unterhalb Batzenrod unless... 3. Balliudesuee no an
[1 Meilenstein 176. ... ne. ı 325,157
bi Brückeiüberden Gersbach _ .. 0 5 309,235
U] Steinerne Bank am Kreuzpunkt der Strassen nach Laubach und Engelrod 314,067
©:'Sehoiten Schulhaus... u... 5 982,481
bi; BrückebeiSchotten.... eich. 1. 269,258
[U] Steinerne Bank zwischen den Meilensteinen 188 und 489 . . . 293,774
EJ-Kanal beüMeilenstein 1a. 00000 ı 315,536
[J’Meilensteim 4195. .. -.. . ai un rn 341,086

Entferng.
Kilom.

8,34
10,04
12,34
13,56
16,90
19,20
20,46

0,00
0,50
1,54
9,33
3:38
4,53
5,41

6,14

7,84

3,99
10,90
12,02
12,76
13,38
14,63
15,18
15,99
16,49
16,78
17,49
18,01
18,26
19,20
19,85
90,61
21,52
99,97

 
