 

 

 

STATION.

 

Espagne. Spanien.

1. Madrid .

. Llatias .

. Conjuros
Gomez .
Pefias

Palos 3.
. San Fernando

MI 91 BR Go bo

8. Chinchilla .

9. Lerida .
10. Roldan .
11. Montolar
12. Quintanilla
13. Javalon
14° Baro.

15. Desierto
16. Matadeon .
172 Betica -
18. Reducto

France.

1. Brest

2. Saligny le Vif

3. Saligny le Vif
4. Rodez 2

5. Carcassonne

50

 

 

 

 

 

 

Frankreich.

 

 

 

 

 

 

 

 

 

 

ERREUR |
DIRECTION. AZIMUT. | OBSERVATEUR.
PROBABLE. |
| | |
|
Hierro 154° 81’ 6785, + 0712 | Merino
Valnera 345 25 3.87) = 0.17 | Merino, Ventosa
Mulhacen 195 14 36.56 Æ 0,4. do.
Francia 10 15 32.76 + 0.25 | Merino
Gamonal 9 30 58.63 Æ 0 17 do.
. | Calderina 201 58 49.16 0.233 de
. | Gibalbin 208 38 41.47 + 0.14 | Pujazon, Pardo de Figueroa,
| Luanco
|
. | Molaton 1953 57 13.45| + 0.02 | Eugenio, Esteban
Monsech 1193 52 1:64: E CET | Eugenio
Tenerife 1200 38 52.71| == 0.28 || Esteban
Morés ro8 2 1228 Æ 0.26 | Eugenio
San Millan 268 55 19.6 + 0.26 | Esteban
Sierra Alta 152 47 48.7 + 0.14 | Eugenio
| Anduz 1.76 26-4326 + 0.22 |Esteban
| Pefiagolosa 1115 17 44.8 + 0.23 || Eugenio
San Vincente oe. 7.2 + 0.20 || Esteban
| Gigante . (214 57 68:4) 20.98 a
| Lobon | non calculé | Borrés
| |
Crozon 6: 9 8.1.) 01 Vis
| Fade eS |
| |
Bourges | 99 0 48.65; 0.37 | do.
| |
| |
Dun-le-Roi | 39 48 50.17 | do.
Maillebiau 1969 427.00 |. 20851 ©
| | |
| | |
Fanjeaux 81 81 30.9 | do.

$

 

 

 
