 

 

 

 

DARSTEL
3 BET «un

 

 

   
 

 

I

5 -k -3 -2
| |
| 7a ue
| | LA
| | | { 2
| | | J
| | |
| |

 

ons en el

| | ths l'Europe centrale.

 

 

Deviation negative

 

 

 

 

 

 

 

|

ee | | en
| LOLR AOA
| Larkesı 4 K agen

 

 

 

 

 
