Te Geng ttemeesie bE 4 de 4

RR PP "Ym eer |

EM VF

Ht | im!

ll

DE OUR MAR KUNA  UU 2 LL

 

 

I. Vergleichung der Mittelwasser.

er, RETTET TEE 4

 

 

 

 

 

 

Bo-
MEER ORT APPARAT | obachtungs-
zeit
| —
Ostsee Swinemünde | a
» Warnemiinde Einfacher Skalenpegel| 1856/81
» Wismar cea » 1849/31
2 Éinfacher Skalenpegel| 1855/86
3 Travemünde | Mado inte 5 hea
» Fredericia | Mareograph 1889/91
» Aarhus » 1888/91
Nordsee Esbjerg » 1889/94
à Cuxhaven Einfacher Skalenpegel | 1843/79
| » | Delfzij| Mareograph 1884/89
Nordsee-Zuidersee | Harlingen » | 1884/89
Zuidersee | Stavoren » | 1884/89
» Elburg » | 4884/89
» Nijkerk | » 1884/89
» Amsterdam Einfacher Skalenpegel 4704/1871
Nordsee Helder Mareograph | 4851/89
» IJmuiden » 1884/89
» Brouwershaven 1884/89
» Vlissingen » | 1884/89
» Ostende » | 4878/85
Canal Boulogne Einfacher Skalenpegel —
» Le Havre Mareograph | —
» | Cherbourg »
| Atlantischer Ocean Brest » a
| » Camaret Medimaremeter 1889/90
» Quiberon » 1889/90
» | Les Sables d'Olonne » 1889/90
» Biarritz » 1889/90
| » St- Jean-de-Luz » | 4889/90
| Atlantischer Ocean Santander Mareograph | 4876/85
| » Cadiz n | 4880/86
Mittelmeer Alicante 1 1874/86
» Port Vendres Medimaremeter | 1888/90
» Cette » | 1888/90
» Marseille Mareograph | 1885/90
» Nice Medimaremeter | 1888/90
» Savona Einfacher Skalenpegel| core
» Genova Mar Soc 1883/87
» Spezia | Einfacher Skalenpegel —
» Livorno Mareograph | 4857/58
Adriatisches Meer Ancona Einfacher Skalenpegel | —
» Fano » | ==
» Pesaro » | se
) Rimini » | =
» Porto Corsini Mareograph | 1874 (4 Tag)
» Venezia » | 1872/78
» Triest » | a
) Pola )) 4 873/78
» Fiume Einfacher Skalenpegel| 3 Jahre

 

 

 

 

 

   

 

 

 

 

 

Mittlerer a Be ~ | Dureh direkt.
Fehler Mittelwasserhöhe über dem | Nivellement
der Be- Mittelwasser in Amsterdam. |langsd.Küste
stim- | bestimmter

mung des | Héhenunter-

Mittel- | I. Aus— | IJ. Aus— | JIJ. Aus— | schied be—
Wassers slei- glei- glei- | nachbarter

in chung. chung. chung. | Mittelwasser.
mm m m m | m '
x Ba =

(ae 5 |+ 0,099 + 0,040, — | — 0,020

“+ AT |+ 0,072/-4 0.018) — |

lie à ie — 0,047

+ 20 |-+ 0.,023|— 0.034 | I 07003

+ 5 |+ 0,018|— 0,038 ae
Einige — 0,060 — 0,116 = |

( Geni 80077 00) © | Io

) meter __ 0,042)— 0,097) —

+ 20 + 0,073 —- 0,021 == \

911 0.023 2.0023 + 0,023

IE 10.21.0043) 0.009 20023

I 9 |+ 0,091, + 0,091 + 0.0915 — 0,046

I+ 8 J+ 0,100! + 0,100! 0.100

lim 39 | 0,082 + 0,082 ı 0,082

| Sl 0.000 0,006 0,000

le 7 — 0.043|— 0,043 — 0,043

ae 7 OF ONDE 0.009 2 92019

+ 6 — 0,050 — 0,050 — 0,050> — 0,146

fae 410) lege 0,036/— 0.036 — 0,036

| — | 0224 — 0,1461 — 0,146) | g 996

A oc

| 69 oT 0,009

a — 0,022 +- 0,143 4..0,035

yon — 1 %100, 88 0.035

| — |— 0,038) — + 0,119 O 116

| en 0,155 — I 0,004 ae 0 081

|; — |— 0,078 — + 00604 0.228

1 | 0,298 — I= + 0.287

— ou) = Rs

| —  |+ 0,037 — -- 0,230 9

+ 13 4+ 0,744, — oo ae

ae 7 ee 0,897 — i+ 4,097 a

+ 7 |+ 0,466 — —+ 0,666

IE :5 | 0100, 20 Po

E43 0,142) — [+ 0,066 a

E & |— 0,168]— 0,245/-+ 0,069} 9’

ene 7 Le 0.199 — 0,306)— 0,008 ce 0.05%

| — ae 0.422)-— 0,252 + 0,062 a 0 040

(ire 5 — 0,455 — 0,292, + 0 022 0.039

| 0,092 0,24) — | À os

| ae u). = a

| — |— 0,427|— 0,247 =

| (oo oes) =

— |— 0,248) — 0,368 — ts 0 100.
—  |— 0,148) — 0,268 — a 0.049

| — |— 0,457/— 0,276 — sr 0.007

I — |— 0,449 — 0,262 —- de 0 033

I 10 0006) 1 = + 0,049

ia 18 |— 0,047 — 0,148 — 0450

| mice 0,165|/— 0,265 — 2

 

 

 

 

 

 

 

 

 

 
