 

 

 

INDICATION

o
ab DES POINTS

 

Fee SA | DAD csc es «
POO M ABASDO 0...
36 | Ghorkar .:.:.....,
37 | Nagar berha......
38 | SONOTA), 05.5...
09 | Lansturi...:...,...

40 | Duramäri....... oi
41 | Akchalia......... À
42 | Harogaon..... we

43 | Häthimura........
44 | Jepkilabama ......
AO MAAN sia os at

 

VIL»® — Grande Bretagne (Inde).

LATITUDE ‚LONGITUDE

26° 0'45”
26 13 4
25 55 39
26 7 23
26 0 38

25 61 7

26 10 48
26 1 17
25 56. 22
26 10 30
25 56 22
26 5 48

90° 45' 0”
90 51 32
231 3
91 0 55
ol 750
91 12 59
91 18 59
O1 1950
91 25 46
2123 0
91 34 25
91 39 13

 

 

—

EPOQUE

  

1858
1858
1858
1858
1859
1859
1859
1859
1859
1859
1860
1860

188 —

DIRECTEURS
ET OBSERVATEURS

 

 

 
   

INSTRUMENTS REMARQUES

 

Lane.

id.
Lane, Rossenrode.

id.
Rossenrode.
Lane, Rossenrode.
Lane.
Lane, Rossenrode.
Lane.
Lane, Rossenrode.
Rossenrode.

id.

SSS

Barrow’s 24 inch.
id.
id.
id.
id.
Barrow's24inch.n°1,
id.
id.
id.
id.
id.
id.

 

 

Jim hits able

una dest

EEE ELITE
