WE

D) août.

cm +

 

Année et mois.

1878 juillet, |

1878 juillet,
aout.

881 juin,;
juillet.

1881 juillet,
aout.

 

1881 aoüt,
septembre.

1881 septeın-
bre, octo-
bre.

1882 juin,
Juillet.

1882 juillet.

1882 août,
septembre.

 

1882 juin.

Auwers,

 

| Sa
| Positions moyennes
des étoiles.

TITRE DE LA PUBLICATION

|

mentalcatalog.

»

»

 

höhen und

 

REMARQUES

 

Funda- | Veröffentlichung des Königlichen |
Preuss. veodät. Institutes. Pol-
Azimuthbestim-
mungen aus den Jahren 1878- |

1884. Berlin, 1889.

»

Publieation des

geod. Instituts.
Astr.-geod. Arb.

1881 und 1882.

»

Kol. Preuss.

in den Jahren

Veroffentlichung des Kéniglichen
Preuss. geodat. Institutes. Pol-

höhen und

Azimuthbestim-

mungen aus den Jahren 1878-
1884. Berlin, 1889.

|
|

|

 

 

Résultat d'après la méthode :
A. 54°12'25",70 4- 0,05
B. 54 12.25 .89 + 0 u

Résultat d'après la méthode :
a D4° 13"26",74 + DO UE
B. 54 18 26 ‚82 + 0 ,04

Résultat d'après la méthode :
A. .54°16'58’,03 + 0",09
B. 54 16 58 .68 + 0 ‚0%

Résultat d'après la méthode :
À. 55 11/0739 + 000
D, DS be 0 0

Résultat d’après la méthode:
A. 02-15 61,52 4 0009
B. 52 15 al 61-40 05

Résultat d’aprés la méthode :
Pr D 21! A my
A. 53°9'26" ,21 + 0”,07
Doo 926 23 0

Resultat d’apres la méthode :
A. 0175 427,24 0 10
Bo ol DAZ 3.2.08

 

 
