 

 

 

 

 

— 183 —

YIL’® — Grande Bretagne (Inde).

 

Te

 

 

 

 

 

 

 

 

 

 

 

 

 

 

 

 

 

 

 

 

 

 

 

 

 

5 INDICATION x DIRECTEURS N
No 1 A
N DES POINTS LATITUDE LONGITUDE EPOQUE ET OBSERVATEURS . INSTRUMENTS REMARQUES. .-
3 Bnd. 25027 5” 8ocHasar| 1846 | Walker en |
14 | Jargäon .......... 25 2723 | 86.4] 12 1846 id. e u, ne
15 Sinkanda ...... Do 24 81 323 1846 id. id |
16. : Maislaka... 25 36 40 | 86 49 44 1846 id. id.
Bun 25 36 37 |87 1 2 1846 u ni N
18 | Gangura . . .... 25 44 3 | 86 55 56 1846 id. id. |
19. Bars 350807 1846 id. id.
20. Diehr 2.22. 25.92 15 | 86 59 54 1846 id. id.
21  Mahanaı 0.0... 25 5444 |87 8 27 1846 id. id.
Rämnagar (N. E,
Longl. Series).....26 2 9:72.13 1846 id. id.
Manula(N.E. Longl. “
Series) 2 26 4 46 | 87 10 49 1846 id. id.
| Caleutta Meridional.
| Satten (Calceutta
| Longl. Series)....| 22°58'35”| 88014257) 1845 Peyton. Tess mL |
| Chinsurah (Caleutta
| Longl. Series).....| 22 52 56 | 88 24 11 1845 id. id.
| 1.5088 20... 23 8391| | 89.2432 1845 102 id.
' 2, Nah. 2.0.2. 23, 028 | 88 22, 1845 id. id.
3 | Jeodhära ......... 23 12 27 | 88 21 29 | 1845-46 id. id.
4 Bela. 2310 ID 88 29 54 1845-46 id. id.
5. Arbandi..... . 23 17 5] | 88 30.25 1846 id. id. a
6 | Anandbäs......... 23 21 19 | 88 2 39 1846 id. id. |
7 | Bahädurpur....... 23 945 ,8828 6 1846 id. id.
8 | Kedapära ......... 2329555 if 1846 id. id.
i 9 | Dogächha......... 23.33 51 | 88 2913 1846 id. id.
3 10) Gobipur 2... 23 39 13 | 88:23 12 1846 id. id.
= 11] Gobindpur .. ...... 2340 2 we 340 1846 id. id.
12 | Kistonagar........ 23 48 14 | 828 6 1846 id. ; id.
= 19 | Teragan. 2... 23.50.32. 88 30 37 1847 id. id.
= 14 | Madhupur......... 23 56 39 |8829 7 1846 id. id.
ea 0 20 ee 1847 id. id. >
16 | Imämnagar........ 24 300 | 8823 8 1847 id. id.
17... Itpur 2.0 2410 6, 883447 1847 id. id.
18. Chätrao . 2. 2A 1258 | 88 23 32 1847 id. id.
19 | Murcha. 24 19 4 | 88 30 50 1847 id. id.
20. | Debipur. - . 24 22 118821 3 1847 id. id.
2]  Sursunl. 32... 24 29 5 | 88 28 18 1847 id. id.
2.22 Madabpur... ... 24 29 46 |, 88 19 35 1847 id. id.
= 23. Khemr 2... 2236051 188 23 2 1847 Nicolson. id.
24 | Sundarpur ........: ZA 8 ea 1847 id. id.
25.1 Alsapur. 0... 24 44 20 | 821 O9 1847 id. : id.
25 | Dilalpur..... 2... 24 47 59 | 88 11 15 1847 id id.
27 | Charaldänga ...... 24 52 44 | 823 3 1847 Peyton. id.
281. Onall. 22... 24 5953 88 lo 21 1847 id. id.
29 ı Kisnapur.......... 25 239 | 8828 21 1847 id. id.
30 | Kamärdanga ...... 25 8 3 188 21058 1847 / IKol, id.
31 | Naksodal.......... 2013 9.88 29 5 1847-48 id. id.
32 >Sankeol...27.. 0. 2517 25.88 19 5 1847-48 id. id.
33 | Indar Näräyanpur..| 25 23 15 | 8831 6 1848 id. id.
34.1 Manglan 2... 23208 3188. 20%9 1848 id. id.
352 Chandol. 23 31 21 18831 50 1848 id. id.
306.1: Adgara. 202.2. 25 36 12 188 22 1 1848 id. id.
37 | Rämchandpur ..... 25 40 23 | 88 3231 1848 id. id.
38 | Chanduria........ .125 44 27.| 88 22106 1848 id. id.
39 | Mokandpur........ 25 49:28. 188 3113 1848 | id, | id.

IR ERRNAER IL hIRIHTN. m LJRENL Hm ML

nm ı

 
