 

62

 

 

 

ERREUR |
SAR ANT TO AN. | DIRECTION. AZIMUT. | OBSERVATEUR.
| PROBABLE. |
| |
35. Moschin | Schroda 95° 25’ 1793 at O22 | Albrecht, Richter

36. Schönsee | Culmsee 280 11 44.88] 0.1 | do.
|

37. Jauernick . | Lausche == 0.09 | do.

38. Kernsdorf .

Roumanie. Rumänien.

1. Constance (Kustendje)

Saxe. Sachsen.

1. Grossenhain

2. Fichtelberg

. | Signal

 

à | Collm

Pfaffenbere:

 

 

1212 56 46.84

 

 

 

 

non calculé
|

non calculé

 

|269 58 87.83) + 0.16

|
|
|
|
|

1339 3 N = 0.47

 

Löw, Werner

 

| Capitaneanu

|
|
Il
| Seeliger, Weinek
|

Valentiner, Bruhns

S |

1
{

   

LR
‚al
pa
mike
ib pl

Au ai
I se
ua |

| med
| Fil
Im in

lt
ma d
| pm
| Ange mtr

|| kam

}
{|
| |

‘| mm

uirenel

 

 
