  
 
 
 
 
 

 

Erreurs de clöture des triangles

 

  

 

   

are

 

 

 

 

desquels ont été mesurés les trois angles,

 

 

 

 

 

 

 

 

 

 

 

 

 

 

a ERREURS = ERREURS = ERREURS |
2 DE CLÔTURE Es DE CLÔTURE iB DE CLÔTURE |
. ae us = ee 2 om 2 a = BEMARQUES
= A > A 2 A
os cee 2 ||. :
re + | | we ares
2 0, 1849 07 47 | 0, 2209 119 07,10 | 0,0100
07 48 | 0,1849 0 ,64 | 0, 4096 120 1.20 1.6000
0 ,30 | 0,0900 Ls 1, 2769 121274 5, 9049 }
#9] | 24,108] 19,38 2, 4964 122 2,97 | 24, 1009
4 09 | 21 9024 2,15 | 4, 6225 128 1545 19225
4 ,20 | 17, 6400 3) | 5,3861 124 3 ,36 | 11,2896
4 ,02 | 16, 1604 0 ,43 | O,1849 1281,14 1, 2996
4 ,76 | 22, 6576 | Vierock. 0 ‚60 | 0,3600 126 3 , 86 | 14, 8996
0, 0400 018,10 5520 127 5 ,55 | 80, 8025
0 05) 0,0025 02 0 2401 128) 1 .08 I, 1236
8,4), 70 8641 ol ol 129 2,63 | 6,9169
0, 7396 129) 16641 1 130 2,9 | 56.4001
159, 4161 12,93 | 8,5849 2,03 4, 1209
12, 3904 ’ 3,46 11 9716 2,92 | 6,3504
Do) > 24640 1785 3, 4225 3.95 15, 6025
4 ‚74 | 22, 4676 4 ,22 | 17, 8084 025 0, 3025
3,6 | 14 1976 I 10 1, 9600 1851, 0 23 0, 0529
3,24 | 10, 4976 09 .0, 3025 1,59 2, 5281
097 0.1369 , 08 0, 0064 4 ,44 | 19, 7136
12, 7449 > 0, 1849 2 274 7, 5076
8, 0656 Vee | 1 74e4 0 58 0, 3364 |
0, 0441 , 66 0, 4356 0 ,31 | 0,0961 i
2, 0164 6 ,68 | 0, 4624 0 ,97 0, 9409 |
2,53 | 6,4009 oo, 7, 0756 3,43 | 11, 7649 j
1.8225 2,54 | 6,4516 185 1,8225 3
3, 1684 al 3, 1329 3.07 | 13, 4689 5
0,05 | 0,0025 > ,70 | 32, 4900 2 ,06 | 4,2486
1,22) 1,7494 1.24 1.5376 2,081 18.032]
eo), 0001 Op 0, 4489 3,80 | 14, 4400
0 ea | 0 7205 4 ,47 | 19, 9809 DIE 1, 3225
6,09 45 4981 OT 0, 0729 1,30, 28 8144
‚0.205184 la 0, 0169 0 , 48 0, 2304
1,30 1,8769 2,06 | 6, 5536 0 ,63 | 0,3969
3 ,24 | 10, 4976 08 1, 1664 ae 32, 8329
0, 9604 8 ,00 | 64, 0000 2.23 4, 9729
3 , 49 | 12, 1801 1,46. 2 1316 2) 16, 0801
5, 9049 0,0], 0,5041 4,16 | 22, 6516
1709, 2402 , 68 93, 1024 4.07 165649
0, 0289 wile 2, 9584 0,8 0, 6561
0, 2916 28 1,5129 De cs 8, 7616
0, 1296 3 ,42 | 11, 6964 OS 0, 6400
, 02 | 14,5924 2 ll) 14591 10 1, 0201
. 8, 5264 13,70 | 3. 2041 0.255 4 0,3025
4, 2436 als 1, 3924 0,14 | 0,0196
0, 0666 , 84 ; 3, 3856 2.90. 5, 2900
,86 | 0,7396 4 , 06 | 16, 4836 2.51, 0516
10, 9561 so, 3, 4596 Vs 0,1044
‚9 | 8,7025| Viereck. io 4, 6225 AS | 23, 7109
0, 8.1016 0 ‚06 | 0,0036 Ooo | 0 3481
‚06, 7.0756 O34 0; 1156 4 ,58-| 20, 9764
Fo? | 0 2481 0 ,02 | 0,0004 2 au 4, 4521
1, 2100 ‘2 0, 2704 ‚0,2. 0.0729
8, 9401 O74 0, 5476 1.64 2, 6896
3, 09 7844 Les 2, 2801 2,09, 4 3681
, 87 | 8,2369 2,32. D 020 2,15 7, 8625
32, 835264 2,38 5, 6644 2.0 4, 0804
0, 0289 0,67 | 0,4489 >20, 1,3400
‚83 | 0,6889 ol 18, 5761 0,0%). 0.0925
Al 5, 8081 148 0 ‚22 0, 0484 3 Ol | 15, 2881

 

 

 

 

 

 

 
