nn . .. =

 

 

  
   
      

 

 

 

 

 

  
   

 

 

 

ıl
ö “N + 5 ? .. [
LIGNE DE NVELLEMENT DE PAEGISION DANS LA REGION NO-BI,OU EUT LIEU LE GRAND. TREMBLEMENT DE TERRE DE1881.
I,
RIGı|
1.286000 |
La renon pemite en lorre de stenme est celle ou le trembilement de a Dre ann en an .36
vrre Jil de plus ınlense. | \ | >
| 2
bes courbes © @) sont les iime ou | mceleraton marıina alleugml v6S- | \ | we
preetivement 2000”” x 500°” (Sun-sai yobo chosa ku Hokokuno 23) S ll
les lines en biku ce Saal les Öimes ou des mivellements de ECStON | | f
main! CE effechus avant Ie bremblement de kerres les uffres vomams  \ Ä 0 nn
a auend Veurs UMErOS. Eon l fi R
las dujires en carmın sont Iks numeros des IOpeLCS de nwellment \
de PTECLSÜN. | S
| | |
{ |
| > Kozecht ® |
| Rh a |
aan DEN a : MEN
Aut Mitahe l
i Uramag N ypuch - ya Bi x 5
| ar “ twashtkatabırı N :
ur ar: Truyemd N. S \ >
oObashime | v7 l |
Koo3: Ülsubsuo x > ° je 2 Bi
danomaya S 2 Zapıma gi Vükayamır Wu
oo. Momake Na oe A
Fwakıra Ne BR: ar
Ha uıeN in) |
Äohaganıa 7 © Se r Ü en nn
DARAN 1 y. a.
CE je 3 a x
„gi >Donaaona/  £ E ae !
Tsushuma af y PR Y
o Obamba | If / MU
| \ Msuta | © MOUSURE e
| A Shinkaniy 174. 1\| U KL SUR as £
| I a J: Ageecı 2 o IMURDCL A
| f {
| |
| Eu!
| BI \ Okazaıı N A Be ee
\ En & 2)
A | > | N in Br
| > 0 Zökomaune \ DI are { |
{ | N N SL ( j
| Harıda 6) | N 72772
2 | N I Goyıı I !
; | | 2 am
| DR . ! us |
| PS Dass 3 Toyokawa £
RE Tonyohashı \
Toyohand Oo Sakımoshmu x ee
| 4 Tu45 e
| | TSL !
|
| |
| | Horikire
36 137

ee 0 NE ur a ü E a

 

 

 

 
