 

 

   

 

   

od

Ina erie meer

XV, == Romane.

 

 

 

 

 

 

 

 

 

 

 

 

oe INDICATION < a : 5 DIRECTEURS
N DES POINTS LATITUDE LONGITUDE) EPOQUE ET OBSERVATEURS INSTRUMENTS REMARQUES |
118 | Sérbilor........... 4497 3!| 4412 3" u
119 | prom. de 44 29 9 | 45 13 46 5,2 a
120 | Avert-iuk, 44 11 12 | 46 18 51 © à an
121 | Mijloew Basei...... 44 27 7 | 44 59 36 LÉ © à
122 | Rjüjük Ojük.... 44 12 33 | 46 10 6 os Te
13 | Buesti 44 32 42 | 44 52 53 Bo a
124 Cilianes, 45 40 6|44 3 56 us Le
125 | Yster-tépôe 44 26 25 | 46 5 39 z SG | a
. 126) Movila mare la a = à
# Goa. | 43 44 49 | 42 45 37 if So Bo
= 127 | Murvad-Ojuk ...... 44 9 8 | 45 59 45 = Se, pS
128 | Movila Neaksu..... 44 28 22 | 4445 5 on 28
129 | Portäriasa......... 45 24 46 | 42 37 29 BS ==
190 | Sleyata 44 13 37 | 44 22 13 aa Sg
131 | Pavlajak. à 14 5 60 | 16 15 40 es 2 8
132 | Virfu Peri | 45 12 33. | 438 45 1 BS & Aa |
133 | Virfa Urla........ 45 36 34 | 42 29 57 228 SE
134 | Gari 45 9 38 | 44 51 54 | a oF

 

Triangulation de la Dobroudja.

 

 

 

 

 

 

 

 

1} | Abdi =] | 44° 4' 10"| 29° 9 59" ||
2 | Adain-K}lise........ 44 6 Al 2537 108 |
3 | Aior-man.......... 44 56 51 | 25 56 3 &

= 4 | Alahbair.......... 44 30 3 | 25 53 22 3

= 5 | Hancearka......... As 0.541,20 220 Fes

= 6 | Fagarasul-nou...... 445) Ih) 25 54 39 A

z 7. Atmazen se 44 57 29 | 26 4 28 =

& 8 | Awert-uk - .. ... | 44 11 12) 26 18 21 3

= 9 | Bestepe........... 45 5 34 | 26 42 30 | ©

= 10, Bilmlar 23 4825 0 9552 5

: Ll bBugeak. 3... 2. 45 22 42>) 25 AT 52 =

[= 12 |CeamımlE 7 AA A A| 20, 14 42 :

= Io: Gineh 22... AS 132.26 1 0 Ss à

1 14 | Cerkez-Kioi........ 43 49 55 | 25 47 5 = =
15 | Cerna-voda........ Al WS WG | Bs) A BS | 5 ae
16 | Defeea-bazä........ 44 19 0 2550 18 >= 2
7 | Dokuzsiol 2.6.2. 4916 25.37 So c

= 18 | Doernari. 3°... 44 51 34 | 26 5 24 a2 à
19. | Dunst 45 1-21 | 26 53 17 a 5 © Si
20 | Farul-Katirlez..... 4&5) 5 | 2115 52 do Aa OB |
21 | Farul-Englez ...... AAAB 12) 26.4718 a ers ©

1 22 | Farul-Sulina....... 45 9 29 127-20 0 © = À =
3 Budule.... 0. Aly 2229,20 41.29 So 2
24 | 6argalik .......... 44 22 44 | 26 21 19 == =
25 | Kazil-Murad....... 43 55 43 | 25 48 18 Or =
26 | Gheringhik........ 43 54 44 | 26 8 27 = 2
27 | Giwvenli......::... 43 55. 17 | 25 54 37 = =
OS: |: @arlien 44 46 59 | 25 45 55 à
3 ca 45 10 47 | 25 57 23 = >
30 | Hairam-Kioi....... 43 56 34 | 22 37 27 | =
31, Hagllar I... ... 43 16-22 90 =

: 32 | Hagilar IH........ 5 5 023% S

= 38 Hazarlik 2 2: 2. 44 0 39 | 25 85 1 =

5 SA | Haärsovyar 0... AA AL 35. 29 35 on Ss

: 35 | Horozlar .......... 44 12 33 | 26 10 6 a

= 26.) tallies 45 0 19 | 25 58 58

= 87 | Idris-Kuiusn....... 44 7 49 | 25 47 55 Ss

z 30° | Nelitacs2 45 852,25 5, %0 &

= 30 LHantiks 00. | 43 44 29 | 26 14 54 A

A0 Tsacced 0 l 45 "15:95 | 20 229: | |

 

 
