Oldenburgische Dreiecke.

(siche pag 22 ff des Berichtes)
ee

|
|
t
5
af ang warden:
Sewenge a i oe |
~~ Bremerlehe
re
Aurich
| .
| en
20 ; 7 a
| yrs / ( a 7
| a.

 

. 2 à .
De EL
a 2 ve Lev en
\ S93 a

|

St tarder
ne,

rene Sn Pt
: N
&
N
RN
N
|
N 1
NS |
N
|
1
1
À
i

      
     

ld

 

 

"A
| tg

x 72
: /

17 N

: #Vornensteirr
Be a L
Doren rg

s
a
| /
2
:

 
