 

 

 

 

 

 

 

 

 

 

 

 

 

en er se + 109% 0061 = 78% 163 | 0 le G9 |IS9F IT |F0os 'S 'e Zmquarn 5 2
BB + 9 2 9 006L 2 8% PLS GG] i 1 12 886 /OLF OL |S 0s 9POIOSIUTS A = Or”
Coo + | SC r | Cye 006T n 818 OFS | Li on 689 098 OT 008 UT9ISUOTIEYOS os 68
ee | CP + | pre &OG6I . 98% 66S Ge | 0 QUE 79 |\PPL GL |C67 wesso(y 2 sel
pp +) se + | He 0061 = 686 886 eo le 0 698 9 |S'SG IT | 6 6Pr HEqUV ur uojmM = LET
eo +) 96 + | 2 1061 e 698 908 EG | 1 -+.| ¢0e 888186 OL | L'8P punin x 9eT
MM 31%, 2% LO6L ee L9G LIE “LG |) GS Hl 897 1898 OL | 38h neue}, Vy = Gel
SR or | eee TO6T = OFS 09% 9%] O 61% sel IE 01 6 PI97189 “ PSL
srt | 0 19% 6681 a TF6 69% &6 LE or 606 0'998 OT |S'LF Sınquoyueig 5 eel
ph + | ge + | or 0061 = 19% ee 9% | O0 991 OLVIGLE OL | ¢ OP eporosutq yy + eS
GS ee. TO6T = 898 TLS TE! O 978 68 |S’EE IL 16% uagajsıor9 x IST
SR D | Soo 006T = 68% 9% 9% 10 013 br os I Ki }po1SUTO NT 2 OST
GP | PL + | oc GO6T 2 08% G86 83} @+ | LST AIS |0°9S OL | LSP Yerqueyy Vy ” 661
Den eee 6681 = 81% ChE Goi te | Oe 6691066 OL | FSP Sraqseoipuy 4 : Ta
OF a G6 = | SG 1061 : 13% 18% Cor EL | onc Gee | PSL OL |S er 9POTISO 2 LGT 2
OF Sl à ce 6681 À 87% 183 Bo 0) £06 ¥S6/0PL IL | 0% FP9ISU9TTET : 96
um. ce = per 0061 = 198 GLE Fe. À 082 OS (On Tr Cr ‚Se uogalsıy = CGT
oF 4 C6 + | ese 0061 - 996 9/8 9%] 0 SIG SSL Vie Tl | Grr ¥p94s}}9H{ 194 Jpoysuony = FEL
09 a BE = | ee 006T i 696 £66 Lo re u GLS | SIG OL |6'IF AUOT > Sol
ms | eC | Gee 006T 658 OTS 88 | 0 LOT S8F | O'TS OT |S IF OPISFIOSSUTT = BEL
mo | 61 OF | 66s 8061 < 87% 966 so 0 0 S17) 06 OL | 88g u) : ToL
D | 4 | 866 0061 808 66% 88 | 0 D G6£ 98 IL |988 APOIOSZIUTT > 021
m ı 2: ee 1061 ; 6S 786 Le ı. Cr 966/986 OL |6'Lg S19q IO} Ney e GIT
Le ae Eb + | 666 6681 x G98 868 SiG 1 1. 96 0SG | SOT IL 978 erddt A < SIT
“= ı 2 1,86 0061 99% OLB Ve | 0 11% 6611166 IL |S'IS PT : LIT
Een) 8 2.08% 0061 ne 67% 9% €6 | 0 CIG GOT | SLT IT |F86 uISNEIOGUES x OTT
” 2% 6061 880 818 9 | D. {Lie GS SSE IL 18 uud - a
=. D 06 à | 0e 6681 : 088 iG ne 0 oe Fer OST IL |0%% UT Y se FLT
Oi | Gé I | 208 6681 . 88% 88% co | 0 88T 908 | 0'89 OT |0 88 uosneysIopuog 5 SIL
So al à cl 6681 . 106 088 co al 2ST 998 OL | 21 uossnarn à IL
eo ee Se + | [OL 6681 s 82% 80% 66 | 0 LST Ole 066 1 OC Bssory LUE
Cee ee) Ol | SIT 668T x 06L LI@ GG 0 GPL We er It er ct {poysiom Yo s OIT
LS +} 9 + | 8ST186 |] 6681 | UUeMeseeH] FIL'ITSE 6L 186 mo | 0 LOELS6| 70S |S: Il CC DC ployyorues yy uossnorg | GOL
i +| + — | $26 006T 2 086 CHG CG | 0 GLS 986 F'06 9T | GEL spt PRES won orertToysC) | «801
To 1 16 + | 019: 0061 2 169 969 To | 0 689 9F 108 86 19°66 spt BUIpOL], LOT
er = I] + | S/c 006T | Ssuxog 688 168 Fé | O ILS'O86 | 58 189 96 946 Fr+ SIN UOTUBUNA | 90T \
De | 88 | 816 1061 2 OST 106 „cc, | O00 ONG) O99) 6 ly 6 =) Gye Ort PLUpe TAL uoruedg 1.607
eh +1 #9 + | 290086 | TO6T 5 IST'086 OFT 086 VG | . ,e11.086| 16 LE Gase uogesst [eSnlog |=FOL
000 + | 000°0 808846 | IO6L | 12%90H 888 816 888'846 se) — |sIssiel Du er We Coen OITUBF 9P OT UOTISUIT | SOL

"n414su] OUISEPOILD) OUISISSNOIX ‘[PIUOY sep qoinp wesunssayy ‘PA
D ea ga ee ae
2 = a > PINCE
node a o6= | H98060000 + /| & g| a, 2 8 |
ng (OT nr = SUIVIIO,], Sop etes 200 we | ee le Be “oplolg “UOT}RIg OP SUWEN (NV oN
: We At & = WOT 199 VW Er à ae =
3 oc Op if Se = Si > ©
JOoUT, 2 3 snurur 06 He > 1) =06) pe | Sg] & = mg

 

 

Dore uns nee mass ai |

191798q09 949SFN9PPION

"A SITOQRI, A0D SunNZJeSJI0, x

Lak tb

Lu tu lu |

 

al

 

1 i dM MIRE 1/1 Mat dd call

 

“4

 
