 

 

— 254 —

 

Erreurs de clöture des triangles desquels ont &t6 mesur6s les trois angles.

 

 

 

 

 

 

 

 

 

 

 

 

=

 

 

 

 

anal,  Lnorune ERREURS
2 Sn EN ee DE CLÖTURE
un INSTRUMENTS
E LOYh SECONDES 2 2
2 SOMMETS DES TRIANGLES en VERNIERS CHAQUE 4° REMARQUES
a BT DU VERNIER en
a on nn en 2
HORIZonTAr |WIOROSCoPm
an 2
58 | Parnis- Megälö Vunö I-Ktipäs............. n 20 2 Micr. 1”,70 | 2,8900
09 | Tarnıis - Kopas Varmaya...........2.2..... id. id. 14,116 1, 3456
60, Narnavya- Bendelikön - Parnis................ id. id. 07,23 0, 0529
61 | Yarnava = Kliössi - Pendelikön................ 10, id. noch nicht alle drei
PB VYarmava- Oktonja-Altlis 2.0.2.2... id. id. Winkel beobachtet.
oo Namnıya Kamas-Arlıs »....2...2.2.0..... id. id. 1 ,82 | 3,3124
GL) Lupe FAEnS -Xiromoros.... 2.2.2... id. id. 2 ‚45 | 6, 0025
65 | Ktipas - Chlomön I- Xironöros............... id. id. 0,60 0, 3600
06 | Kupas- Kıdaron - Chlomon 1I=............... id. id. 0,63 0, 3969
67 | Chlomön I - Kidarön - Palaovüna.............. id. id. 220 4, 8400
68 | Kidarön - Makripläji - Palaovuna .............. id. id. 0,24 0,0576 |
69 | Parnassös - Chlomön I-Palaovüna ........... id. id. 1,79 | 3,2041 |
79 , Parnassös - Palaovuna - Vältsa...... ........ id. Ta. 20 4, 7089
7 | Barnassose Yalısa-Killmi 2.2.2... id. id. 0,29 | 0,0841
72 ı Parnassös - Killini - Panachaikön ............. id. id. 0-15 0, 0225
73 | Killini - Panachaikön - Eryman®os............ id. ide A 3, 0276
74 | Killini - Valtetsinikos - Eryman6os............ id. id. 0 ,53 | 0,2809
15 | Parnassos - Panachaikön - Gjöna.............. id. id. 2 ,20 | 4, 8400
76 | Parnassös - Gjöna - Kallidromon........ a id. id. 1 ol 2, 5921
. 77 | Parnassös - Kallidromon - Knimis............. id. id. I, 04 | 3,0276
753  Bamassos - Kuımıs - Chlomon 1............... : id. id. 0,40 0, 1600
“9 | Knmıs Chlomon I - Xironoros............... 5 id. id. 0,49 | 0,2401
&0., Knimis  Xironores - Chlomon U.............. & id. id. 1,64 2, 6896
81 | Knimis - Chlomön II -Ierakovüni............. a id. id. 1,12: 2,9581
82 , Knimis-lerakovüni-Kallidromon............ < id. id. 2.07 1, 1449
83 | Andinitsa -Ierakovüni - Kallidromon ......... 2 id. id. 1,98 | 3,9204
84 | Andınitsa - Kallidromon - Gjöna.............. © id. id. 1.10 1,2100
85 | Andinitsa - Gjöna - Timfristös ......... © id. id. 0,23 0, 0529
86 | Gjöna - Panatolikön - Timfristös....2.2000.... 5 id. id. 0 ,89 | 0,7921
87 | Gjöna - Panachaikön - Panalolikön............ = id. id. 0,8% 0, 7569
88 | Chlomön II-Xironorös- Makra Rächi........ I id. id. 0,26 0, 0676
89 | Chlomön II-Makra Rächi-Pilion.......... S id. id. 0 ,32 | 0, 1024
20.) Chlomon I Pilion- Saratsı............. = id. id. 0,24 0, 0576
|  Cllomon II lerakowuni- Saratsi............ > id. id. 0.20 0,0625
92. Kassidiaris - Saratsi-lerakovümi .....22...... 2 id. id. 107 1, 6129
93 , Kassidiäris - lerakovüni - Andinitsa........... S id. id. 103 1, 0609 °
94 | Kassidiaris - Andinitsa - Katäfloron............ u id. id. 0,29 0,0841
95 | Andinitsa - Timfristös - Katäfloron. ..... ..... id. id. 0 „44 0, 1936
96 , Timfristös - Katäfloron - Vutsikäkji........... id. id. 0,19 0, 0361
97 | Timfristös - Vutsikäkji - Gävrovon.. .......... id. id. 0,04 0, 0016
98 | Timfristös - Panatolikön - Gävrovon........... id. id. 18 1, 3924
99 | Vutsikäkji - Gavrovon - Tsumerka....... id.: id. 1,74 | 8,0276
100 , Vutsikäkji - Tsumerka - Kötsiakas............. id. id. 1,20 1,4400
101 | Vutsikakji - Kötsiakas - Aovrutsi. ......... id. id. 2 ‚20 | 4,8400
102 | Vutsikäkji - Aovrutsi- Katäfloron. ............ id. id. 0,52 0, 2704
103 | Kassidiäris - Katäfloron - Aovrutsi . 2.2.20... ide id. I. 82 1, 7424
104 | Kassidiäris - Aoyrutsi - Palaökastron.......... id. id. 1,97 | 21649
105 | Kassidiäris - Palaökastron -Saratsi........... id. id. 0 ,4l | 0,1681
106 | Mavrovüni - Saratsi - Palaökastron ........... id. id. 0 ‚22.| 0, 0484
107 | Mavrovüni - Pilion-Saratsi... ..... a id. id. 0 ,02 | 0,0004
108 | Mavrovüni - Palaökastron - Hassanbaliötiko id. id. 0,09 | 0,0081
109 | Hassanbaliötiko - Palaökastron - Aoyrutsi..... id. id. 0 ‚30 | 0, 0900
110 | Hassanbaliötiko - Aovrutsi-Godamän......... id. id. 0 05 0, 0025
111 | Hassanbaliötiko - Godamän - Ossa............. id. id. 1,22 \ 1,4884
112 | Hassanbaliötiko - Ossa - Mavrovüni........... id. id. 0,9 0, 9025
I, 0854 Godaman - Aoveutsi. ...2..22.2.2.2..0.000.. id. id. 0,8 0, 0009
I | Oxo Aoyrussi- Rötsiakas, 0.20.2020... id. id. 0,09 | 0,0081

el rasfuuhmsseie

ee nashenihil Ude 2 bh usa ha
