   
    
  
    
 
      
           
     
       
   
    
   
  
   
     
  
      
 

9

 

b
I. Mesures de degrés de latitude en Inde, dans le sud de l'Afrique et au Pérou.

 

 

 

| Latitude Observation | Obs.-Calcul.
= Noms des stations. | géographique - Calcul. | Cusbripme
= observée. Clarke tesa oe
: “| d’elements.
we . | 32.132106 36 168
De te 30 22 11,78 A
Kun _ 2.3. . :.,.29 302832 — 3,7 — 1,0
CR 2. 3.20...) 27 5530,02 + 1,9 on
& Kamor  . . 25 45 10,93 >» 0
ED Chop 2»... : : 24 7 10,79 Eth 2220
5 hi een 22 19377 + 2,9 + 3.5
Nasen. ne en 20 4421,27 — AS ay
2) Damasadas <9 ° sw Le are, 18h 482 > — 2.0
= Daun nus Lo sui 16 92049 — 4% — 5,8
onde A: ue une. 14 55 21,51 + 3,7 | +18
r Bansdore. ...... . ner 12 59 51,79 — 2,9 — 5,5
| RER Da me ei. 10 59 41,06 422 | —1,2
adulte, te. Si 8 12 10,4% + 3,1 — 1,3
Er pe Bot. ay vee SH 0.26 08 205
= PWG RODS | nue ie 34 13 32.13 —10 ea 0,7
2 Royal Observatory. . - 0. 33 56 3,20 40,6 | +09
3, Aleesenlogement dere. , : st sS 91 — 0,2 — 0,4
Ee North ind’) Sie et! Bi 65 27e) 20) A7,66) 4712 0,4 0
ee 0 2 31,39 = il |
seine ee 3 4 32,07 + 0,6 SEN

 

 

 

 

 

 

Ic. Mesures de degrés de longitude en Inde.

 

 

 

 

 

 

PE Longitude Os CAT O bservation-Caleul.
Noms des stations. | Latitude geogr. | geogr. ouest Quatriéme
observée. Clarke 1880. système d'éléments.
TTS |

a Bomb? -... | 185349 |— 4 6 44,00 + 4,1 + 4,4 | Cote
oe) Mamealore. =. 125214 |— 2 4 52,61 + 2,9 + 3,1 \ ouest

€ Bears | 45, 8.35 oo Fo + 0,1 |
= lBoneabo. on 1304 O39 [062 103 +03) ante:
a I iiydrabad.... ,.. r 720 1% 1 9529829 — 2,1 — 2,2 \ rieur
Soars... oe 210 0% — 4,5 — 4,7 | Cote

Vizagapatam .... . M ra HA.) 06 — 1,0 | est. |

 

 

 

 

 

 

  

RAPPORT HELM. — 2
