 

   

 

 

— 207 —

Erreurs de clöture des triangles desquels ont &t& mesures les trois angles.

 

I er

 

 

 

 

 

 

 

 

 

 

 

 

 

 

 

 

 

 

 

 

 

 

 

 

 

 

 

 

 

 

7 LECTURE NOMBRE ERREURS
AUTEURS DES INST
2 Bi EN SoanR DES OBSERVATIONS DE CLÖTURE
3 a a a a 10 A? Ä
= 3 POUR CHAQUE REMARQUES
= DIAMETRE DU CERCLE Du SEELE OU DES CHAQUE ANGLE TRIANGLE
HORIZONTAL N MICROSCOPES u ln S
MICROSCOPE CHAQUE DIRECTION
40 | Barrow 24" n 2 5 34. 40. 37 0", 04 0, 0016
> I a 2 =. 39 0,0, 0, 1600
2 ide 2 0 I 34 55 0",67 | 0,4489
43 Barzow 24" n°2etT.etS. 24" 5 32. 37 30 0,80 0, 0900
n 5 ;
44 id. & os 30 a, 91 0.25 0, 0625 |
45 | Barrow 24" ne 2. = 5 40. 36. 36 0,40 0, 2209
= 2 u = > 2 z . 0,27 | 0,0729
7 id. 9 od 0,16| 0.0256
48 a 2A N 2 eh T. eh. 240 2 5 oa 3894 0,49 | 0,2401
nz, © :
49 id. 3 5 30. 36. 30 0,01 | 0,0001
a 3 al 1,66 | 2,7556
52 | T. et . 24" n° ] et Barrow 24" 5 5 30. 30. 30 0.13, 0.0169
n R ‚S
53T. et 5 2 mr » 5 20.30. 30 0,02 | 0,0004
54 id. = 5 se >20 9 0,03 | 0,0009
55 id. a 5 3% 30. 3 © >01 0, 0001:
56 id. = 5 30. 3. Sl 0,18 0, 0324
57 id. © 5 30. 81 3 0,16 | 0, 0256:
58 id. S 5 3. 30. 32 0 ,06 | 0,0036
59 id. 5 5 32,33 5 0.18 0, 0324
= 60 id. 2 5 22 30 3l 0,31 0, 0961
T 6 id. a 5 30. 31.30 0,22 1.0.0441
= 62 id 5 30. 31. 50 0,36 0,1286
2 #8 id D 4 a > 0,18 0, 0324
64 id 5 30. 30. 30 0,05 0,0025.
= 65 id 5 3a. Ss, Sl 0,02 | 0,0004
= 66 id 5 a aD 0,18 | 0,0324
= 61 id 5 3... 8]. 32 0,14 | 0,019
S. E. Quadrilateral.
{ | Great Are Meridional Seetion 18° to 24°.
1 | T. et S. 36" .et Barrow's 360. a5 2 20 212 0”, 08 0, 0064.
2 id. : 5b 5 29 24 21 37,23 10, A320.
3 | Barrow's 36". © 5 24. 24. 24 1,0 3,0976
24 id. E 5 Sa 21 22 ee
5 id. 3 5 24 24 24 0,14 0.0196
6 id. 8 5 24, 24 4 0,15 1, 0,0255
7 id. er 5 24 94 24 0,31 0, 0961
8 id. 53 5 24, 24. 24 0,04 | 0,0016
9 id. Do 5 A. 34, 24 0,53 | 0,2809
10 id. 20 5 24, 24. 24 0.,42 | 0, 004
11 id. as 5 A A a1 0,49 | 0,2401
12 id. Hz 5 DA, 24, 24 0,44 | 0,1936
2.13 id. = 5 24. 00 21 0,051 0.0085,
. 4M id. a 5 24, 24.04 0,38 0,1444
= 15 id © 5 24. 24. 24 0,03 ..0,0009°
= 16 id 5 24 24 24 0 ,06 0, 0036
®

VRR |

a a)

 
