 

EE ne

   

     

 

 

 

 

 

 

  

À S
À
v A
Grundriss.
ı
\
| { \
| \
r = i F \ |
if CE N | 1
We 5) 4 +0
| 1 x / = 1
|
‘ /
/
t =
T /
\ |
\ 7
\
ï
|
|
EN]
Maasstab 1: 60. few ( IK Maasstab 1:60.
{ | L i L 2 1 5 lahlılulıl | l 1 eel | L L | | N a el
3 4 5 6 7 8 I 10 11 12 13 14. Yırss Dldenb._ 6 0 1 2 3 4 5 6 7 8 g 10 11 12 \ rare.
Bape
& El
El |
a |
D

Durchschnitt W_O |

 

Enitieourupäisehon

 

1866 |

 
