 

Tabelle T.

I

 

 

 

 

 

el ne

 

 

 

=.

 

 

 

Strich.

mm

10
20
30
40
50
60
70
80
90
100
140
120
130
140
150

Theilungsfehler.

Effective Länge.

 

 

 

160
170
180
190
200
210
220
230
240

 

 

 

 

 

fecti
Theilungsfehler. Anech v Strich.
Länge.

HM mm mm

0,0 u 0,0000 500
a 16 9,9963 510
a 19,9983 520
z m 0,74 29,9999 530
— 20 0,69 39,9684 540
rer 49,9674 550
— 44,9 0,69 99,9884 560
zo 0 69,991 0 570
nn 0 79,9987 580
— 2,8 0,76 89.9972 390
— 52° 0,18 99,9928 600
= 31 1,69 109,9963 610
— 7,3 ‚6 149,9927 620
— 42,8 141,6: 129,9872 630
—114,3 A 139,9877 640
— 7, 1 149,9929 650
080 186 159,9900 660
3 71%68 169,9902 670
ot 179,9907 680
Es 189,9950 690
zn ua 200,0018 700
=> 59 1,06 210,0059 710
10 1,06 220,.0040 720
Te 1508 230,0038 730
— 5,6 1.05 240,0056 740
>= 8% 4,08 250,.0034 750
-- 45 1.05 260,0045 760
907508 270,0059 770
22400. 106 280,0022 180
—+ 10,4 1,06 290,0404 790
ZB 300,0070 800
+ 7, 1,04 310,0074 810
— 6,6 1,04 320.0066 820
+ 9,8 1,04 330,0098 830
444,0 4,0% 340,0110 840
+ 5,8 1,04 350,0058 850
+ 5,1 1,04 360,0054 860
+ 2,7 4,04 370,0027 370
+ 6,6 4,0% 380,0066 880
+ 9.8 1,04 390,0098 890
25 400,0054 900
+ 5,5 4,10 440,0055 910
4 8,1 1,09 420,0084 920
4 13,4 4,09 430,013% 930
+ 12,1 1,08 440,0124 940
11,9 1,08 450,0119 950
= 1,08 - 460,0074 960
+ 74 1,09 470,0074 970
250 09 480.0080 980
+ 77 4,0 490,0077 990
_ 95 972 499,9995 1000

 

Br B

— 10,5 #10,72
93708
+ 1,& 0,95
+ 25 0,99
— 0,2 1,0%
— A415 AM
— 31 4,19
— 9341. 108
+ 0,0 1,39
= 16 1%
oo 2
+ 3,1, 0,88
+ 0,5° 0,90
+ 1,6 0,93
127. 20,98
— 52 4,03
— 41,8 4,10
02 7
— 0, 4,97
— 0,9 4,40
+53 0,7
290 076
+ 12,0 0,77
+ 883 0,78
+ 18 09
+ 86 0,81
+ 74 0,84
+ 9,0 0,86
+ 5,7 0,89
+ 34 0,96
+85 07
1 780.7
41.78.025
12 098
ey
— 25 0,79
+ 07 08
— 0,4 0,82
— 0,6 0,85
+ 10,9 0,89
+12,0 0,7
+ 14,8 0,84
.+16,3 0,82
+14,6 0,83
20,3 0,85
+ 16,6 0,88
+175 0,9
+ 17,6 0,94
+ 19,2 0,98
+25,0 1.06
+19,0 0,23

 

mm
499,9995
510.0097
520.001%
530,0023
539,9998
549.9985
559,9969
569,9969
380,0000
589, 9986
599,9999
6410,0034
620,0005
630,0016
639,9973
649,9948
659,9982
670,0002
679,9996
689,9991
700,0053
710,0080
720,0120
730,0088
740,0078
750,0086
760,0074
770,0090
780,0057
790,0034
800,0085
810,0075
820,0078
830,0012
839,9963
849,9975
860,0007
869,9999
879,999%
890,0109
900,0120
910,0148
920,0163
930,0146
940,0203
950,0466
960,0475
970,0476
980,0192
990,0250

1000,0190

RAPPORT D’AUTRICHE — 3

 

 

 

 

 

 
