 

 

Erreurs de clöture des triangles desquels ont ete mesures les trois angles.

 

er mbar» TRENNEN. Yı
|

MÜLL All

item

Maiden t ttattt
Tree Feng TRUTH RTTTNERRTT TER TTTTIT

 

 

 

 

 

 

 

i . LECTURE en -  NOMBRE ERREURS
B AUTEURS DES Souuı Ir NOMBRE De On Di eröTeen
© ET a VERNIERS POUR CHAQUE A? REMARQUES
= DIAMÄTRE DU CERCLE en OU DES CHAQUE ANGLE TRIANGLE
Z “ n OU POUR A
HORIZONTAL MICROscopm | TEROSCOPES a Dir annen
eb
| ; Directions. |
Ramsden, 3 feet. B.O Mieroscope. 3 la 2 312 n)
E id. R.S id. 5 2617 ‚ron en
2 id. R.S id. 5 & 2241229 | 0,01 0, 000
3 id. RS id. 5 14.9 23.192933 02,02) :0,000
id. B.O id. 3 1» .
| id. Be id. 5 39.19 31.92 | en
id. Ro. id. 5 Io. 9 = 8
> | Troughton and Simms, 2 feet. id. 5 ie 18 | 0,03| 0,001
6 | Ramsden, 3 feet. B.O. id. 8 10. 10.33.74 7.10 0,031 0.001
7 id. rs id. 5 6. 7,21.10. 23102,0,0 0, 001
id. R.S. id. 5 14. 14 26. 13
o | Troughton and Simms, 2 feet. id. > 16.12 0,03 0, 001
Ramsden, 3 feet. B. 0. id. 3 212
I | Ramsden, 18 inch. id. 3 21.21.1917 \ 0 ‚04 0,002
10 Ramsden, 3 feet. R.S. id. 5 15.92 .25.28 | 0,06 | 0,004
id. B.0, id. 3 24.36
Ramsden, 18 inch. id. 3 43.29, 2. 24
ı Troughton and Simms, 2 feet. id. D 34. 38 I 0, 004
12 Ramsden, 3 feet. R.S. id. 5 1928. 22% 0.07, 0005
id. 2.0, id. 3 22. 16
13 | Troughton and Simms, 2 feet. id. 3 IE 16 712 1916 0-07, 0,005
14 | Ramsden, 3 feet. B.O. id. 8 28:37 A159 >51 2 0,08 0,006
15 id. RS. id. 5 45.40 112.80 65.41 0,08| 0,006
16 ı Ramsden, 18 inch. id. 3 21.21 21.22 16.141 .0,09 0, 008
17 | Ramsden, 3 feet. B.O. id. ® larıı 2% .& 1216 0,10) 0010
18 id. B.O. id. B 3: 2.20.18 42.21 9,11. .0.012
19 id. Bo 1d. 3 + DD 5 1829 0 0,012
Troushton and Simms, 2 feet. id. 5 10. 14 a ea) 000°
Ramsden, 18 inch. id. 3 18. 1o \ : a
2: Ramsden, ateer. Res. id. 5 420 18.12 1211 | 0,2 0, 014
22 id. Bo. id. 8 4.25... 102.6 0,1: 007
id. 3.09. id. 3 33 oT
23 | id. RS. id. 5 16.21) n
24 | id. RS. id. a 21.19 0 16 0, 026
En id. B.0. id. 3 111,066
id. 20. id. 3 el2 11. 910 | (0 0, 029
id. B.-0; ic. 3 6.2 20.6.2100, 0, 029
id. BO. id. 3 20, 18 13: 15
| id. R.S. id. 5 9.11 u 0
\.R Ramsden, 18 inch. id. 3 14. 16 |
28 Ramsden, öfeet. R.S. Tal 5 ] 0,18 0,052
B.0. id. 3 27.12 \
se and Simms, 2 feet. id. 5 9.10 10, A) i
> Ramsden, 18 inch. id. 5 5. 8 oe 0
>0 | Trouehton and Simms, 2 feet. id. 5 2.5.2. 32 1,.19|)0,.18 0, 032
Ramsden, 3 feet. R. 5 id. > 10.19.70, 3% x
ee id. 3 5.8 nn
Ramsden, a tee, Re». id. 5 0 2429 \
32 | id. B.O. id. 3 23, 4, 0,20 20)
id. RS. id. » AT
33 | id. B.O. id 3 8.17 20. 4) 0,2 ul)
id. B.0. id. 3 >06 24.412 c
4 id. R.S. id. 5 38.19 ) 01,302
>| id. RS id. 5 0.1.41 101) 0,22 1..0,048
id. RS id. 5 19.19 ) :
36 | id. B.O. id. 3 aa nn

 

 

 

 

 

 

 
