 

ud cl nn À

ACC UH

QU HR

A A 11) RNB (144 EE Lp iL

RER SE SS ACTER

 

 

 

m

 

Erreurs de clöture des triangles desquels ont été mesurés les trois angles.

 

«O CO I © OT WW

 

NOMBRE

 

 

 

 

 

 

 

 

 

 

 

 

 

 

AUTEURS DES INSTRUMENTS CNE rn DES Peers
one EN OBSERVATIONS | DE CLOTURE
Ds DES EXÉCUTÉES DE
ET VERNIERS POUR | CHAQUE A? REMARQUES
DIAMÈTRE DU CERCLE | oo CHAQUE ANGLE | TRIANGLE
De MICROSCOPES OO SOs A
RORPONTES MICROSCOPE | CHAQUE
DIREOTION a as
Directions.
Starke di 27 cm. -Brunner di 42cm. | 2” 2" 2M. 4M 30 230 32 0',640 | 0,4096
Starke di 27 em. id. Id 30: 30. 30 0 , 560 0,3186
id. id. id. 30, 30, 30 02,650 0, 4225
id. id. id. 30 30 35 1.206 1, 4544
id. id. id. 30 30 eS 12,280 5, 1984
ids id. id. 30 85 35 || 220 1, 4884
id. id. id. 30 35 35 0,770) 0,5929
id. id. id. 30 30 35 1.176) 12.3880
id. id. id. 30 30.188 1 , 060 121230
id. id. id. 3020: 35 10,210 0, 0441
id. id. id. 0 30 32 0,270 0,0729
id. id. id, 30 30 233 1,610 2021
id. id. id, 30 30 30 0,260 0, 0676
id. id. id. 30 30 32 2,430 5, 9049
id. id. id. s0 30. 32 1,820 2, 3104
id. id. id. 30 30. 32 1,250 1,9628
id. id. id. 30, 230, 32 2, 260 5, 1076
id. id. id. 30 30 32 |1,220 1, 4884
id. id. id. 30. 30, 32 10,970 0, 4489
id. id. id. u 3232 98% 0, 6724
id. id. id, 30 30, 30 270 1, 6129
id. id. id. 30, 30) 32) 1.790 3, 2041
VI:
REGION A L’OUEST DE LA MERIDIENNE DE MILAN.
Reseau a nord du parallele moyen.
Directions.
Starke di 27 cm. 2 2M. 29 31 31 |2 184 4, 5540
| id. id. id. 30 32.28 07 238 0, 0566
id. id. id. 30: 32 30 2,218 10, 1453
id. id. id. 80.32 30 0.1063 0, 0266
id. id. id. 521 32.28 1,659 2,1023
id. id. id. 30 30. 30 09271 0, 8593
id. id. id. 30. 80 - 32 0,357) 0,1274
id. ig. id, 30 20 32 0507 0, 1498
id. id. id. 29. 30 32 10.097 0, 3102
id. id. id. 28 32.32 0,883 0,7797
id. id. id. 28 32 5320,94 0, 5388
id. id. id. 23 32 28 0,150 05715
id. id. id. 32 32 30 |0,544 0, 2959
id. id. id. 29 32 3| 1,108 1,2724
id. nae id. 80. 30° 30 0, 082 0, 0067
id. id. id. 30 30 32 2,598) 6,7496
id. id. id. 80,30, 20. 5,1249 29, 2122
id. id. id. 30 30 30 10,028 0, 0008
id. id. lle 30 30° 30 0.898 0, 7310
id. id. id. 30. 30: 322 1.08 102 0, 0104
id. id. id. 202 307 32 0,329 0, 1082
‘id. id. id. 30: 50 22 1, 306 1, 7056
id. id. id. 30) 30) 32 2,145 1.0390
ide id. id. 80.982. 32 142 2,3118

 

 

 

 

 
