 

 

 

 

 

 

 

 

 

 

 

 

 

 

 

 

 

 

 

 

 

| | | | |

a + ler + |18-886 | 006" 286 — 106°386 | 0881 2 868: 286 (Ge) | OL | sr oil Jo Ly yh | (T9SUJ) OITLATOM | BYLIOULEPION
F + |T + 208°186 |803°186 | 0 908° 186 | s3/6Tgt | INGE Teo eo) 0: 90 ee | ‘A Ig ‘uopuoyT) puepsug ®
9 +17 + 688086 |ees’0os6 | 0 |S6c'086| ” i 666°086| (¢°3) | 03 | & FL —|L°GF OF | TOO-T0D ‘10% MONT | exmemeproN
98 + |98 + \61¢ | 09 | 0 1809 . : 709 (g'a) | 8 FG 91 —|1°90 IT | TeAoy 04 “woremep | uelrquy 1

|| |
Oh 00e | 661 0 |008 = & 861 & 9 gg 19 —|6'88 OT | (Sur) peprumy, | vyourepng
6g + [88 + |SFI | 988 0 |8es x : | FIG sa ef | Gi ele oes. | WO “UWMOJIIT -
916 + | SIG + 080 | CFS = 108 a . |FFG (8°6) | 9 #9 1°76 0 +] (Tesuy) seoroyL 98 BAY
8 _ (07 — 00 | 080 | O {680 à : GO (2) | 8 LI PF —9'IS & a TBqUELEIX | FAHOTEPRS
05 + | 108 + 881 | 688 == 1088 f S 858 (8°) | g GG FT —| 9 2 =) UOISU99SY | UE9ZO ‘JUEVY
wy + |p + lies euclacc'e16| — |seg'sı6l East ourqeg sıe:sıs| & | 99 |,1€.8¢ —lr;6¢.61— Biyeg | uornmseig

‘(GGSI— GISI) TNITVS U9INP UOSUNSSON ‘4
-_ 998 u C00°0 FE :UOTHHNUPOIWUOISAS 10P JOMIOUOISUN 910 ‘Wo sAg-6 1aıepsjog "uauoreIg

Fr + | & + |8L6 |910°886| 0 |z:10‘e86| " 4 | (Gi O45 8. 1716202 8:07:09 qsug | sulspuepeys

| | | u u | . a fe n di
bY tr | sen | GLL ro cm | 991 | Gra) se ero 0 in le 408110 |
se + | oe + lose 19 0 1819 a N lero | Oc 0c) KORG — eee | WOT GET) puemoyog
aııa „ae mes >= ise à . ee | (g°0) ee | wog a
m +18 4.896 786 — 008 sısT : |485. | @G) | 968 | ert —6 st ee | IH Amnqry 5
SE + | OL + [808 GIG 0 |STG GT/STST ; | 906 | ee | oe 10) 0) lr te 46 ‘H Yq uopuor 5
91 +16 + last'Ts6lTer'Ts6| Oo |S6r 186 | 618 ay  |orr'is6) (e°e) | FL [er —(r:26.00 hysımwegungwegs|  puepsug

(SIST N gIgT) zauıvy y9aınp uedunssem VF
-ujopuaduapuny9S UAYU9S UALYY UJogeldeAul NW U9SUunssom SANEIOH ‘J oddnay

WO gO | WO goof um | mo | WO g_OT 16) u | | uw À
Ogee OL) | 04— 06 04 | a) Ê— 6 0 gef 1974984004 |o1oMuoS one eyoH | osuyy OPO uorreIg puef

| | |

 

 

‘U9SUNSSON 9UOSI[ SU

‘IX STILL

 

a do dl ol,

 
