 

 

 

226 :
x
u
3 . Lingendifferenz
Land. “a Stationen. Différence de longit. Beobachter
Pays. Ai Stations. in Zeit, | W.#. Observateurs.
| en temps. | E. P.
Halton: | 1 Me Sempione Soe 439516 | +05013 Celoria, Plantamour
2 Mano INeUChAtel, . ı. wo. sts. 8 55.99|+0.016| Celoria, Hirsch
|
| |
| 3) Napoli—Roma . 7 6.25; +0.027| Fergola, Secchi .
_ 4) Napoli— Palermo 3 35.82 +0.013 Nobile, Tacchini
| 5, Milano—Padova—Monaco—Vienna . — Celoria, Lorenzoni, Orff, Oppolzer
| 6 Milano—Padova—Genova— Napoli . — — | Celoria, Lorenzoni, Lasaqua, Nobile. -
Niederlande.| 1| Leiden—Brüssel . . . =». . .! 0. 27.49 | 0,027
mr bon 0.0.0.0... 10 26.95 | 20.017
| 3| Leiden— Göttingen. . . ge 21 49.82 | +0.03 ne der ee
Norwegen. | 1 Christiania—  Afsakliahn ne in Fearnley, Schjellerup, Lindhagen
Oesterreich. | 1| Prag (Dablitz)—Leipzig... . ... 8 17.83/+0.02 | Weiss, Bruhns =
kuss) | 3
| 2| Wien (Laaerberg)—Berlin . 12 13412002 | Weiss, Förster =
3 Wien (Laaerberg)—Leipzig 16 2.24/+0.02 | Weiss, Bruhns
| | =
bil
| 4 Wien (Laaerbere)—Fiume . . un su Herr, Ganahl.
| 5! Wien (Polytechnicum)— Kremsmünster a = Herr, Karlinski .
ı 6| Bregenz Zürich .—. ee er a Oppolzer, Wolf .
| 7 Wien (Tirkenschanze)—Pola . . ..| a a Oppolzer, Palisa
| 8 Kremsmünster—Pola . Ce ae — | Palisa, Anton
' 9; Wien (Türkenschanze)—Paris . I .56 0,22 30.01 | Oppolzer, Löwy :
‚10 Wien (Türkenschanze)— Bregenz. . | 26 14.78|+0.02 | Palisa, Tinter he
11 Krakau— Wien (Türkenschanze) Be m J senram, Anton’. ye
12, Wien (Türkenschanze) -München. . | = ne Oppolzer, Orff . ; i
113) Krakau—Prag (Dablitz) . . | ni zu Schram, Anton . a
14 Wien (Tarkensehanze) Drag (Date) an — Anton, Schram . |
15 Bregenz—München . | LS ieee Oppolzer, Orff 4
JO PRIE CNE Pate Pr .se.rel Le Me Oppolzer, Löwy .
1172| Krakau—Kremsmimster . . . . . an Gruber, Schram. 4
(18! Prag (Dablitz)—München . . . .| a | — + | Anton, Orff ; 1
fio) Kremsmimster—Bregenz. . . . . | = pr Gruber, Steeb a
20 Prag CR EE N = a Anton, Schram . ‚JE
21 Pola— Bregenz . ee. — 0 Steeb, Gruber
22 Pola— Prag (Dablitz) . a, nl = [== &) Gruber, Schram.
23, Wien (Türkenschanze) — München. . | = Ws. | Anton, Ort
24 Wien (Tirkenschanze)—Padua. . . | — | — | Oppolzer, Lorenzoni
25 Wien (Türkenschanze)—Mailand . . | — | — Oppolzer, Celoria
26 Wien (Tiirkenschanze)—Miinchen . | — | — Oppolzer, Or».
27) Lemberg—Krakau . . = | — | Schram, Nahlik .
28> Czernowitz— Wien (Türkenschanze) . | = leg Steeb, Kühnert .
29. Lemberg— Wien (Türkenschanze) . . — | —. | Anton, Nablik
130) Czernowitz—Krakau Bees Comat ca — | — | Kihnert, Schram
81) Warschau— Wien . | — — | Anton, Sawitzki.
32 Wien (Laaerberg) — Wien (Türkensch, ) — | — Steeb, Nahlik
33) Czernowitz— Lemberg. . . — Be Schram, Kühnert
Se lkoma Wien =... .. — — | Anton, Sawitzki.
135, Wien (Türkenschanze) - München. . — mn teed, Orit.
36 Wien (Türkenschanze)— Strassburg . — | — Steeb, Schur .
37 Jassy—Czernowitz . . 1 = | o— Capitaneanu, Kühnert.
38 Wien (Türkenschanze) — — Leipzig — es Steeb, Weinek
|

 
