   

 

 

 

 

 

 

 

 

 

Rumänien.
o | Indication des ai Longi- f Directeur | Is ni
N Pointe, os itude. ae Epoque. DO schyatouns | Instrument. | Remarques.
| |
|
25|Lusteria ...... 44° 5'84"|42° 1’ 2° |
26 Obrejü ...... -.| 44 13 6 |42 12 42 | |
D7)Bopu 2 ....... AAA Al 56 15 | | | N
28 | Capu Bralului . . . | 44 20 40 | 41 52 53 | | |
29|M. Casacelor .. .|44 22 20 |42 3 17 | | | |
30, Op0rel .....-. 44 35 8 |49 5 93 | | |
91) D) Oltului ..... 44 42 36 | 41 54 48 | |
32|Piscu Bobrei....|44 49 6 |42 6 22 | : | |
38 | Cruce fnalte . . . .| 44 53 38 | 41 52 19 | a | |
(34 Hentatu ...... 45 4 49 | 42 12 30 | | 5 | |
35 Locul frumos ...|45 9 6 |41 57 17 | > |
so EUR 45 14 31 | 41 45 38 | 2 |
Ses 6 6 45 19 29 |42 O 18 | |
Ss Gil... .... 45 21 88 | 42 21 48 | =, |
39 | Vîrfu mare. .... 45 31 34 | Ai 47 50 =
40) Preshe - .... .: 45 36 34 |41 46 54 =
Al Surul .. ...... 45 35 27 42 6 26 | En |
AD Argerii ........ 45 9 83 | 42 41 37 | > |
43 | Adincata...... 44 0 43 | 42 36 42 | | oS |
44 | Magura de Passe .|43 48 8 |42 83 95 = |
22a | Movila Gavanôsa .|43 55 16 142 47 6 | = | ne tan
45 | M. Soium. . . .. 148 48 11 143 137] a |
46 | Gradboir . ..... 48 36 48 |48 0 85 | = | =
47 | Kresnambasi . . . .| 43 39 29 | 43 17 56 | = | =
48) Padina ......, 43 44 14 | 43 29 21 | | > | ee
49 | La Crocea ..... 43 51 47 | 48 13 45 u | © !
50 | Stefânesti . .... 43 55 54 | 43 29 51 © | 3 = i
51| Levent Tabia . . ./ 43 49 40 | 43 87 34 S | 2c 3
52|Frassina ...... 44 1 58 |43 41 45 26 & | 5 ©
53 | Keresi Tepesi .. .|43 51 44 | 43 57 49 | © = SE
54 | Topraklik Sirti . .|44 2 44 | 44 16 24 = =>
95 | Greaca ....... 44 619 |44 0 4 = = Es
56 | Badovan ...... 44 10 57 | 44 11 1. = | 2 ST i
Cv... 44 10 31 |43 55 3 | = 28 1
53 Pırita ...:... 44 15 34 ‚43 41 56 i as
59|Mosia-Mica..... 44 22 29 | 43 54 34 2 ee
l 60 |Bucharest .....|44 25 38 [43 46 3 | = 8
6 Sacson........ 44 24 59 |43 30 48 = DE
| 62|Baneasa ...... 44 29 23 |43 44 47 | S Ne
: 63|Trestieni...... 44 30 30 | 48 25 48 | =
Oe BUM ........ 4484 0 143 06 3 | 3
65|Mavrodin...... 44 39 8 |43 23 3 | 5
66 Frasina....... 44 48 7 |43 31 53 | ©
67 Bocsanı.......: 44 52 47 |43 20 10 ©
l 68 | Luceni Ungureni. . | 44 52 23 |43 3 34 8 |
| 09 Malaesli ...... 45 4 27 |42 59 14 & | |
‘ 19 hozeW ....... 45 0 49 |44 14 55 = | |
| 71|M. Suhatulni. .. .|44 57 10 | 43 32 47 à | |
72 | Mâcesu . ...... 45 9 19 |43 30 3 a0 | |
18) MAgura . . . . . .. 45 11 25 | 43 18 48 | Ss | |
7. Liahta......... 45 19 82 |42 59 8 = | |
| 75|D. Obirsi...... 45 28 8 |43 7 38 2 |
| 76|Ghrohotis...... 45 24 32 | 43 32 2 > |
27 Biuoas ...--... 45 31 28 |43 35 45 2 |
| 78 | Christian mare .. 45 34 18 | 43 14 14 | |
' 79 | Königstein . . . .. 45 31 47 | 41 52 52 | |
| 80|Varhegy ...... 45 51 47 |43 6 28 |
81 | Pilesketeto . . . .. 45 42 44 | 48 34 59 |
Mm DE....... 45 24 2 | 48 52 51
88 | Salbla ....... 45 12 50 |43 59 16
| 84/Istrita ....... 45 722 |44 12 46

 

 

 

 
