 

 

STATION

méridien.

géodésique.

géodésique.

méridien.

géodésique.

géodésique.

toire, centre

Point géodésiq
toire. centre

ral.

toire, centre

 

grande coupole.
Munich ( Observatoire |

de Bogenhausen ).
He.

2 Pola. Cercle méridien .
Bregenz (Pfinder). Point |

23 Pola. Cercle méridien .
Prague (Dablitz). Point

de

de

grande coupole. |
Padoue. Quadrant mu-

de

grande coupole.
Milan. Centre
grande coupole.

de

2) Kremsmünster. Cercle

Bregenz (Pfänder). Po int.

21 Prague (Dablitz). Point

Vienne. Nouvel observa- |
la

95 Vienne. Nouvel observa- |
la |

26 Vienne. Nouvel observa- |

la

la

 

DIFF. DE LONGITUDE

Erreur

En temps.
En temps [probable

m S Ss

|
+ 17 95,882 | + 0,015
| |

20,228 | - 0,015)

+
ES

Kremsmünster. Gercle

+ 16 16,721 | + 0,020
— 2 98,971 | + 0,020

+ 18 55,514, + 0,039

EN 92,233 | Fr 0,021)

+ 28 35,458 | + 0.019

 

OBSERVATEURS

Gruber.

v. Steeb,

v. Steeb.

Anton, Schram.

Gruber.

Gruber, Schram.

Anton, ¥:

'. Oppolzer,

v. Oppolzer,

Orff.

Lorenzoni.

Celoria.

 

Instruments des passa-
ges à lunette droite.

Instruments des passa- |

ces à lunette brisée

 

 

 

 
