 

“wayskg Tauaıy

 

 

 

 

 

 

 

 

 

 

 

 

 

 

 

 

 

 

EI * Iopleydpapuog

9L8°086 “SUT “I8008-[IUL “WOT Ay OL
6 En NIV | 660186 | CEST 2 5 866 086 | F0‘ I86 | SZ} O 186.086 || FIE 0 78 | 2066 | °° °° * * * ‘SiequoT | GLI
Os l'y. — | 720186 S68 = = 886086 | FIO‘IS6 | | 0 I86 086 | 108 PA SG | PP GP | © © * * vu) PLL
IE a VE |. S10 186 [east = 2 FL6‘086 | 200‘186 | sa | 0 616 086 || 698 69 88 | a‘6e 6P | ©‘ © * * * ‘007 tazozg SLT
8 +} 8% — | 500186 | 8681 | CAIN ‘poouroS "A 626086 | 900186 | ‘8 | 0 686 086 || 798 89 88 | 8‘086P | : * © ©: * : Moleponim BLL
ree ie. Et | 166056 | 29661 sole “pny 810‘ T86 | 190°Is6 | es | 0 CE6086 || Och | Ely ol | SOC Gr." 2: 2.2.2 sous) ILL
Mo 9 1 866-086-2681 5 5 986.086 | 996086 | se! 0 GL8°086 || 468 19.86 Ge 0p "0 #0 OLT
IL +7,08 -— | 2s6'086 | 2687 | ‘CAIN pemiag “A 896086 | 866056 | ee} Oo 106°086 || 008 ASC | GeO rece) ee Ea 691
96 1270 8,6‘086 | 9681 ‘Toke “Pur 816°086 | FLO'IS6 | 0% | T+ | 806086 || Fre | OFPST | Peler | °° wmermg 89L
8 Se Le, 235) | 516.096. ]°.2681 2 2 986.086 | 6960086 | 58 | 0 698086 || Sze Shes | OSL6P | °° °° °° Moyouuoy LOT
02 -— | 48 ~ | 126086 | GOST | “PATTY “Jooutoyg "A| pgs'og6 | Tee‘0g6 | ee | 0 618086 || Seg GRC MOiO ORE ei. ee | 99€
Bic be. =F 100.086 ser “ıofepy “pny 000'186 | 080186 | ae | 8 + | Tre‘Og6 || 06s | O°8s8T | 8 6F | °° °° °° ouop-SvA GOT
g ze 4 206080! COL = 2 186086 | 896086 | 98 | T+ | 6g8‘ose || Leg 98 88 | L‘e 6 | "ouzim oyzpomouig FOL
Oh = | 196-086 26st E x 068086 | se6‘0se | se | #+ | Forrose || LEP 0S 86 | 6S 6P | °° °° °° Seta oo S91
Per — |L-006 080. 26er | |“ 2 816 086 | 096.086 | ae | ¢+ | 808086 || gor 86S | 88SR8F | °° °° * *  MOUSGIT COL
18 +] es — | 186086 | 2681 l'E ours ‘4 816 086 | 8L6‘086 | ‘a | sg + | gos‘oge || oFg CCC Tape Ets er aan I9T
08 + |es + | 06'086 | 9681 = zoo [86 | 080°186 | 2% | 8 + | L56‘086 || 898 | L'OTST | 9Fe gr | * ©  zordap-ugsouang, O9T
99 + |vr + | sr6‘086 | 968T “OÂBIT ‘Puy 866 086 | FI0 T6 | 28 | Lt | ‘656086 || Lie | L'e et | Leg gp | * wosomeng, è * uiwsun | 6CT
06 +/88 — | 876086 | Gest | BITTY ‘Hours "All 106.086 | 9960086 | «7 | g—+ | 2s1'os6 | res HOSE OG Sys >... Soysrters Sel
8h +166 + | 976086 | gest “okay PUY 616.086 | 66.086 | Ss} oO 256.086 | 987 SSL HE I 10GgE |: 2 22 zes LST
OÙ + | 88 +1 Tre‘086 | Zest S B 696.086 | 110186 | ea | F+ | sıs‘ose || SFE 803 | 68h SPF | negosgog, OST
LEE 4 oy + |:t56086 | cest HE “ou ‘A || 986086 | 600186 | qe | a+ | LF8‘086 || 799 88 88 | 8'8F8p |‘ * ‘°° * * ‘ ouzooueT ac
co +i} ye + | L96'086 | 96st “JOAUJY ‘Puy 716.086 | 800186 | 3% L+ | o16‘o86 || 088 | ‘gg st | F9 gr | * * : * * * + -olSrauxx PSL
air 68 + | Le6‘0se | gest | “ey ‘yoouryg -A 996.086 | 6FO'L86 | 98} I+ | B0s‘ose || 66L OC 62 GAP SEA >  DEneeg gel
es ot | 29 + | 986‘086 | 96st = 866086 | 810 T86 | sa 0 856086 | S6L | 66H ZT | 9CP SF | * : * “ipeisnon-Suen BSl
8 +|se + | 986086 | 96er ‘woke “puyy ¥L6.086 | 800186! 3's] 0 806086 ||. 968 | TSS Akl | Serer | 12° 0202 “euery Ist
A + | 886°086 | 2681 l'O ons ‘A || 656086 | LLe‘086 ae} e+ | gos‘osc | age ge os | gr sr | N oles-osıy OST
98 +1]0¢ + | ve6‘086 | 968 ‘okey “pny ¥86-086 | 080186 | a | 8—+ | g06‘086 || zoe | 06 6L erpan |". © ©. Zıyosmen 6FL
88 + | 17 + | 26086 | est l'ex ‘yoouteyg A}; €/6°086 | 080186 | ge | P+ | 898086 || E6F RSC LOT OMAN See 2270070 SPL
98 +|te -+ | 1e6086 | gest 2 296.086 | LIO'186 | 93] $+ | 2w8‘086 | oge | racer | ‘er ge | : ‘ : : : + * zumery LFT
18 +68 +] 626‘086 | 968r “ofen “pny 886086 | OLO‘I86 | Se] 0 976.086 || 80% | SeéGhl | SOrSr | °° °° °°: <= zormezg OFT
ty + /6~ + | 186°086 | 6st | eAIHY ‘yoouraig -4|| ope‘oge | vL6086 | cz 6+ | 188°086 || 18g 88 08 | 168 8F | * * © * : * : nœuosoy (A
sol + | 8 + | 926086 |Yesı “AGIT “pny L00°T86 | 880‘ 186 | ‘8 | 0 896086 || E61 | F'STST | 94e 8F | * * Jomoquesg-eurÂN PPL
8 + 1 Ls) 6+ | 286.086 | #681 |"eypuy ours ‘A 676086 | 716086 | 93 | 9+ | B88‘086 || 66% 60 | Ian re TION SP
12004 | #20°0+ | 126‘086 | 9687 ‘roke py “pny 16'086 | 66'086 | 2a | 0 876086 || GOT | F,O9 LT | 96 87 | * © © * © * * * wyAysoq orl

um wo wo wo m0” b— 5 wo u En

A = Q = 5 H 5

E . PEN = x ge
=) =. & 7 a 2 bd a 2
B g SR a 8. 5 g = a3 =
o4 of 040$ = = 1934984007 BS | to ae a 4 = 2 B 9)191 uor}eIS 19P OUBN GNV'I E
x 8 S : See & m ©
= 5 Is: we oS Ei 3

2 5 N i = = 5 on 5

= a Oa, j Ex 2 oe 4

Si 2 S 2 5 &:

 

 

3 sn a Whale ne eu

ET FETE TRUE DES V9 DRE eee

 

 

uit

m

 

Terie

 

 
