4
4
1
À

 

 

 

 

STATION

9 Helgoland. Point geode-
sique. a

10 Granzin. Point géodési-
que oe

11 Rauenberg. Point géodé-
sique.

12 Breslau. Observatoire.

13 Schneekoppe. Point géo-
desique . ea,

14 Strassburg.

Citadelle.
Pilier. a.

15 Fallstein. Point géodé-
sigue .

16 Brocken.
sique .

Point geode-

 

 

408

 

DIRECTION

Signal.

Lauenburg.

Berlin. Marienthurm.

Rosenthal.

Zobten.

Donon.

Rimbeck.

Fallstein.

 

 

Azimut.

o !

245 59 8,0:

317 29 50,32

19 46 4,87

&

29:19

~
~

: 2

1 30 41,25

Erreur
probabie.

+ 0,22

be
1
&
qo
en

+ 021

 

 

 

OBSERVATEURS

Baeyer.

Paschen.

Baeyer.

Baeyer, Sadebeck.

Y. Villarceaux.

Baeyer, Sadebeck.

|

 

 
