        
       
       
              
               
      
   
 
  

 

 

 

 

 

 

 

 

 

 

 

 

 

 

 

 

 

 

 

 

 

   

 

 

       
         
      
       

 

 

 

 

 

   
 

     
 
   
  

 

 
    

 

  
    
  

 
    

     
 

    
  

 

 

  

 

     
   
   
   
    

 

 

 

 

Bun | 1
4 ; 27 ns AI _30
_ AG 5 6° ostlic v von. u Fe rro__% = oe er, user es an
zu den
astronemischen Triangulirungs- Fracisions-Nivellements-
Arbeiten.
Ü B E N SIC C H TS KARTE ati J.Ord. ausgeführt von der BE | eee fee g) Bern =
de einge Commission he Triang ulirung LOra (fe ) ——— (doppeli gemessene Fe
” Int oom Hiniste i Bee = = =, ° 5 e =
| der | | ” (projectirt) | —— einfach Nivellements
| > | | f & ”„. EOrd, | Fan von der ästron: | + Sichten LOrd(zu.recognosciren) == projecürle Linien.
A 3) SUN GS + ARBEI É EN won \ ot NM AN Te N N here | / ; = ER, geodätischen projecürte Miordlomnz2 ta eae fremdländische
GX À IN \ N | : I er ae las A Trigonometrische Puncte| welche in das
|| en | | | / 7 EUR is bthalung JEMELSSENE IL. in das Haupinetz
| AS AS EL N x 5 = i | | entwickelte Örioullinien ® Hegel Nivellementein,
| ———— a \ | | f. Be —— ee == G ) DB Mh 7 | mit. geog.Inst. | ; :
in der ER | Es 7 a Re — ose sig —} So ; sue ae @ Meteorologische Stationen bezogenwurden
A \
| RL | NN N Y | > |
| » . > “a > | aap oooh enver
| oesterreichisch -ungarischen Monarchie ! fable go
I | y i Enr Re
| aM
> 2 | Stan d | a) I 4 is oe Cu RS ia An
} der } 5 gf vf ri Pagek gén a oe |
| : ey X or | Kain Le à CR JEAN |
4 e rn . re ° ee ° Tv » awn ; |
50 astronomischen Triansulirungs- Präc.Nivellements- \ apemgabrüche Kir DI ha > U ee |
ie + id CZ # Niwiska s tee LYSagore . |
. « ny ote N BERN ze on Scleryt eae Krolewski N I pans u
| Arbeiten mit Ende October 1882. pein cnn ER lose /\ ÿ 2 ’ Seelze Kann ER 2
> 7, N A Li yderpys hort thw IR
| as A one Hui : A SEE > LA z if jeferina 7 IP GE Ser er an \
| 2 À : - "IE Gi 2 Win a Ze |
1:2000000 BERG. Sawa x :
N Ê TN À Se Wwpel. SPhamotdoryska,
40 20 30 M St 60 10 es Li) sou 400 à #0 20 130 a Go ©: Ë > S| ss x
ee P— n m Gite ge 5 ‘ ve |
} 5 Konjuc 4 \
N u Rs, 4 3 |
Kalne \ \ ; a \

   
       
 
   
     
    
 

N

— Kobilowiüky

  
 

sana hola

 

x N I Javea? YAS zd SER ; 7 «

SRS Saye), — ee, none \ Si
V 4 shat x i N / NV \ WE: uchiu Dziab \ ? YY 1 / EN ty he FEN

49 jf

 

 

 

 

 

 

  
 

N A
Ne WR. Grussb-Schi IQ
pe ST ZN

IP eK AS uf — res igs ay J PL = K
Le Al ee SR Ste 7
NE SL N

 

 

   
   

2

 

 

 

  
  
      
  

  

 

Kid
LAN as ss Aa
ee lem

te 4

terre H real bg :

        
   
 
   
     
 
  
   

M iskolea\

Sifalvan

 

 

 

ER LAN AS a 1 BER - > dut, Zi /
# — . À

D
Sn + !
1 Wendelstei y ac Höhe Gehren

 
  
 
 
 

  
  

  

  
    

 
 

/\ Debreczin®

\

    
          
  

Benedictenwan
ee
Hi nt A
J er
> un > 9 BE Eayek
; W Ah: men, : |
Dial A Bimi

\ 7 |
\Kunhegreä PLadA
Ke en \

eK
ISZaR SS
\

 

Kortvelles \

    

<T

 

 
  
 
   
        
   
     

 

heure a
ae ern

 

fe
4 2 Thorkofi
Pe Net ent nt \
Para tt
X A

  
 
   

 

org Nea
Ne \ N \
Bandor Céstenyes, |.

L Ur goht

     

v

Vashchely

 

  

 

 

 
   
 

 

SZEGEDNS |

ERSTER EN,

as
\ >
‘Ss

     

 

 

 
   
  
 

gon pe

.Szigetvar
©

    

Gr a
© brappa

 

 

 
 

= Mm z N
" Dugd. &@oster-
Dig Pyvanich

 
  

 

 

i LM Czernja

  
 
 
 

   
 

Bäsahid

£

   
 
 
  
  
  
  
 
 

  
 
 
  

Luceni

 

Unéukent
is

 

 

 

#Funt ina faetje EN

op Duy:

 

 
 
       
    
 
  

 

 

sa = Karen

Anhır na Liw Lane

     
    
      
   
      
 
 
        
  
  
 

angsowa : | \

~~ fawanis té | ZN

F N / N = LÉ rar
/ Te Sail

vr fea We _YRamondo! >
> Vis

EX x RE ake Südlicher Anschlufs

A { à 5 5
choc mare SSD Kil mit den-astronomisch-trigonometrischen Arbeiten in Albanien
oP ik efi

        
 
 

 

 
 
 
    

 
 
 

 

Umgebung von Budapest.

Tisovac

Umgebung von Wien.

ilostaneuburg
Bhf:

 

 
     

Hals Umgebung von
Prag.

> Drahtseil-Bhf.

(ehemaliger)

 

    

 

 

 
 

 

 

  
   
  
 
  

   

 

 

EN Jodlpseo Bhi
RN
Nussdarf
ERS Sfloridsat
BhE er
(entral-Anstaltf ON W Baha StädtIriang Pot,
| MetuErdmage DonawBr: ¥ XXXVI
|

 

DEN
bte |
oljäna

1

 
   
   
  
   
  
 

  
 
 
 

ae CR

 
 
   

 
 

  

 

| XXIL <O est. Staatsbhe. Stadt Tr rian ‚Pet.
3 Nordbahnkk KatasterEuncte coe

 

 

   
 
  
 
  
  
  
 

peas)

     

Steinbi
Ung. Stanisbhf:

      
  
  
  
  
  

Szecheiy
> en hegy

eer,
|
|
|

ale:

|

|

\
\
|

 

 

 

LME

a

 

      
 
 

Staatsbahnhof BR Weer,

SüdbahnhofoR

 

 

 

 

yan Uber

 

Le arfu a

OP;
romontor SEE

 

     
 
   

  

 

 

 

 

 

 

GrudaGrii

 

 

            
   

 

| 24 N |

[Es ———— ee CE = =
33 34 35 z 36 317 3

 

 

Fotolitographie- und Schnellprefsendruck des k.k.militär. geographischen Instifufes In Wien.
