 

|
i
i
ü
i
i
|

 

 

‘YUTAIOA uouorrejstequoen uop ju °A—° 4 uox Sunyoroaqy zosso18 uogom YOOULO}S “A TWOP] 10GB YAIOA\A UOUOIOM “uogfeyte [9/086 ueSS9Y IN] opInA S68TI (T

 

 

 

 

 

 

 

 

 

 

 

 

 

 

 

 

    

 

 

"wojsÄs TOUT
F FILS — | 28086 F6ST | = | c0s‘086 | 9F8°086 | 8 | L + | 201086 9 LE el
9 we) Ge | GPS 086 | TGST | “ooUIa}g ‘A | L6L'086 | 988086 | Ss | 9 + | Te9‘086 6 BL
es + | 0F +) TFS‘086 | Fest © || 188086 | #26086 | 9S 18 + I 911086 9‘0S ST
io 9 + | 669086 | cer À || 278086 | 788‘086 | se | S + | 231086 98 CT
dg, Pe + | L89‘086 | 2681 Z || OFS‘086 | 268086 | Se | Z + | 911086 6G SL
SIT + | LT + | ges‘ose | gest = || ass‘ns6 | eee‘oge | ss | tT + | 6F9‘086 0¢ ST
88 ot | th — | ¥es‘ogse | est 2 £6L‘086 | 998086 | ge | 9 + | 689086 GP GT
0%; + | 9T —:|.se8‘086 [| 8681 | "UYHLIN LIS‘086 | 688086 | 8 | #7 + | 8190086 OF SI
SG + 61: — | 069096 | Lost 'AP9U1916 ‘A 192086 | 861086 | re | L + | SFo‘ose || Fer | FOLZT
86 FIT + | gzsnsc | rest ® 698°086 | 086086 | L‘& | 8 + | 021086 || SF | Je 9
see +|0g — | ses086 | zesr É 861086 | 9c8‘086 | ge | F + | 119086 Fe CT
[ye | $e. =| gasuse | zes “BY HTY 261086 | L¥8‘086 | 36 | ¢ + | 919.086 Le ST
OF. | 60L-— | 628086. | 1687 = 614086 | 894086 | F‘& | L + | 809086 68 €L
16 ee 108086 | S681 "yooutayg "A 821086 | 64086 | 8e | 0 0,9086 LF 6
Ue Sk = |. res 086 | cesT "EXT 908086 | LSS‘086 | d'a | > + | £69‘086 te ST
ee | hi, | "918086! 8087 "AP9m91S “A TPL'086 | SLL‘086 | ve | 6 + | er9'086 FF 6
og +!1ct — | Frogs | east “By Yy 662036 | FF8‘086 | ga | S + | ¥69‘096 GT GI
#9 va GON — | 818086 | Test as 801-086 | 6FL'086 | FS | ot + | ege‘oge 69F IL
9 + | 68 —| sos‘ose | esst ‘H09019)S "A 6LL°086 | FIS‘O86 | 23 |S + | 289086 8&8 6
g + | ce — | 108086 | Zest "EXILIM &LL 086 | OIS‘086 | s'e | 8 + | 819086 Ge ST
9% = | 66 — | 908086 | 8981 | = L0L°086 | 0&L'086 | Fs | 08 + | Fag‘ose Fat
ba | 88 : 7} 808.086 | Tosı 5 L6L'086 | 821086 | v& | FI + | 909086 res IL
Dee | Li : — | 209006 | sel ‘Joau197S ‘A 164086 | 991086 | ‘& | LT + | 2Lç‘086 S'PLTIL
PDP ie = | 20808 | @68t | “ey ITY 6,1086 | 618086 | 0% | 4 + | s89‘086 61 SL
ST 22: 109. -— . 208:086) S88T. = @rL 086 | FSL‘0S6 | PS | $2 + | Zse‘ose 688 01
Boia | TI = | 1090886 | 18er x 089°086 | Ezl‘os6 | #3 | ST + | sFe‘oge SPS IL
ee oe ==, 008086 | 8691| er 8FL'086 | 88L‘0se | ee | % + | LF9‘086 96 6
I +/ 8 — | 661086 | 8881 | “yoousoyg a 162086 | TI8‘086 | FS |,LT + | OLS‘O86 9'FF OT
BI. € — | L6L°086 | S68T oy &6L'086 | 298086 | «3 | 0 GF9‘086 Fe QT
Fe he — | 962086 | 8681 “ey JULY £6L°086 | 088‘086 | 28 | Fr + (190,086 T8 ST
PST + | 87 + | c61‘086 | Fest = er8‘086 | 646°086 | Ja | ae + | gec'ogc 68S SL
be 2 80L 2)" 465086 | L8er = 189°086 | 962‘086 | 9° | et + | F1c‘086 6 FS IL
ee | 6. 7 | COL 086 | 6817 E 881.086 |. @LL'086 | 8% | 6 + | 19'086 GF 6
00 221801 | 661.086 |. S68 | 5 689°086 | SeL‘086 | FS | 61 + | 09c‘086 676
4200+ | er00— | 162086 | ges | “yoautayg "A | 8FL'086, | SFS'086 | SS | BT + | S6F'086 96,01
| |

um 116) um | wy | mo : um tH

| 4 = | %& Sg ÿ 5

BS | O° a

= so LIN | © ”

5 ei = | 4 & a, & 2

=” © nr © | 2 a R

8 5 19109409 =. = 7 = | Es ao a

° ° A—°,6 ” & Pd AS > | BR

1 if | 2 Bs ere ee. =

= 5 SH cn | 5 3

= ED og, I & | = E ae

‘ © S 5 = 4 ©

a e

 

SCP LF
SOF Lb
SIP LP
9‘0F LF
9'68 LF
0°88 LF
OLS LE
798 LY
6 FS LP
Fes LP
L@e LY
$08 LP
9°66 LE
6G LP
GSS LP
Ge LY
9S LP
P86 LY
08 LF
SOL LP
eT LP
SSL LF
€ OL LP
SOL LY
O'9L LF
L'ET LF
ST LP
GPL LF
SSL LP
OL LP
6 LL LP
OL LF
Ll LF
6 LP
6 LP
ci ©

oorg

 

 

(est
a MOS Testy:
neuayoray
* ZLUBB0TD
U9IMJJ0U9S
SULTOULUI9G

"ge [endg
SVLYOSNZZIN IT

* mloisyny
* : Quedsy
° y9ejSaLıy
* S1oqpury
Bgm
© + guasoig
HAS
* uIIQUIO(T

‘WB yong

* ‘qouquor
" * " S1Z}05
°° ZUTUXTIN
i SSS TOU
: SUSZILLT
ety
uspropugorg
++ ang
*yoniqsauy
* YOULY PLOT
yswf
* ydeLıuag
* : nuss04
" * PPIOYS
‘vos
% " SULZUON
° * zuopnig
“* YOsttpy

 

| ° + Yoter193s9Q
Ron rot

 * U9I91197$90)

 

gel
eel
Tel
OT
Gel
sel
LT
OT
cel
FOL
goal
eal
Tél
021
6LL
SII
LTI
OTT
STI
FIT
etl
et |
ul
om
60T |
SOL |
Lot |
907 |
COT
FOL
GOT
«ol
Tot
001
66

JOULUINAT

 

 

à, ist bell él i Miah dl wr u

HET DES DS V9 TE rn

 

 

mil

 

Ta Bd Haiti I did a

20

II
