PL.V.

 

 

 

 

  
  
      
   
  
 
 

  
    
 
 
 
   

 

 

 

 

 

       

 

 

 

 

 

 

 

 

 

 

 

 

 

 

 

 

 

 

 

Cle re ae 148 149 150 == ean
| |
Ba | |
\ a nn ———— —— 1 zn 4 ete JO 33)
3 Warrawotong
| ®
| |
| | |
| \ PTS YMaroota
| ase Es à to I
| I SL Castle
| Le
i Howard g ie {|| S
| ep | | She, &
u A as is ua See eG ITE She CRE eer eee a Gran |
ua, BES: 34
| Darlingg a
Boo Geegallalorg 2 i.
2 ren x Jellore .
? Gibraltar
| BF + Sutton. Forest S
NL]
Mundoo
35 YE Barra ÖBarren Jack
N RÉ RS A TER A 135
| ilies Wheel of Fortune B WoW
| |
oHlanging Rock |
|
| Tennent,
|
|
o-Loka Clear
Olea aa iee | |
2 Co ee = _ 6
| | | Warnbrook |
| | I SKETCH MAP
Shewing Progress
OF
r
TRIANGULATION
Ÿ KG = IN
X Tatıra N.SW.
EB x S 1902
TingiRingi © ee) Scale 32 Milesto an | nch
ee : ae WY
ae = NOTES 37
A | Substitute Stations at which latitude hasbeen measured are shewn thus -o-
| D D ara) 2 nn ©
D TOUTE EN) » BD n ©
| Lines observed from both ends with 18 inch instrument nn » O—O
|
N Suz 490 __ 1

 

 

 

 

 

 

: LITH. MULDE DEN.
E. J. BRILL, LEYDEN. T ULDER, LEYDEN.

 
