 

 

 

 

 

 

 

 

 

 

 

 

 

 

 

  

Land | Station Polhöhe Ay. F Beobachter Jahr und Monat |g?
|
F
Frankreich | 5 | Rodez . 44° 21’ 23759 Y. Villarceau 1864 - |
6|| Carcassonne . 43 13 19.82 desgl. 1864 |
7|| Saligny le Vif . 47 2 40.00 desgl. 1865 |
8 Lyon (Fourvières) 45 45 49.86 desgl. 1865, |
9 Banısı > qu 48 50 11.22 desgl. 1866
10| St. Martin du Tertre 49 6 29.86 desgl. | 1866
11|| Alger . a 86 45 % 7 Perrier | 1874
12| Puy de Döme Non calculé Perrier, Bassot, 1875/76
13 | Bône (Algérie) . 36 54. 18.3 Perrier 1876
14 | Nemours (Algerie) 35 5 49.5 Perrier 1876
15 Biskra (Algérie) 34 51 13.6 Perrier, Bassot 1877
16 | Laghouat (Algérie) 33 48 28 Perrier 1877
17| Geryville . 33 40 51.5 Defforges | 1878 |
18 || Carthage (Tunisie) 36, ole 16.5 Perrier 1878 |
19 || M’Sabiha . : 35 89 36.7 Defforges 1879 ;
Italien 4|| Napoli, Pizzo falcone 40 49 49.29 = 0710 De Vita ed Arabia 1874, Luglio Mil vert
40 49 49.31 30.11 al
40 49 48.60 = 0.08 d’Atri e De Vita 1874, Giugno ed Artnr;
Agosto
Media . 40 49 48.89 = 0.06
5| Monte li Foi in Basilicata | 40 38 59.82 + 0.02 1875, Maggio e y
\ d’Atri Giugno
40 39 0.08) + 0.04 1876, Giugno ie
Media . . | 40 38 59.87 | , -E 0.02 |
6 | Monte Catania in Sicilia 38. 15 54.07 == 0.03 De Vita ! 1875, Octobre, Not} ri
| EE vembre
88 2595208 M0 0.05. | à
Media . 38 15 53.38 | -+ 0.03 :
7 | Termoli . Nobile
S| Capo Passaro > Magnaghi |
9 | Isola della Maddalena desel. |
10 | Cagliari, Torre di S, Pan- desgl. |
erazio | |
| |
| |
Norwegen _ Dragonkollen iy
Husbergö | |
Oesterreich Pola | |
Ragusa . |
Nord-Basis- Endpunkt bei |
Lo , 46 48 10.1 | Ganahl . | 1876/1877
€ | | 187
Lietzen ‘ ¥ nn
Wien (Türkenschanze) : 1877
eo wehenhes ) | 1877
| Dubica 46 12 21.61 | 2 0.11 | 1878
4) Wien Eolytechnlenm) 48 11 58.27 | | Tinter | 1870/1871
5| St. Peter bei Klagenfurt | | desel. |. 1876

 

 

 

 
