 

 

 

INDICATION
DES POINTS

 

LATITUDE 'LONGITUDE

 

— 138 —

 

VIL® — Grande Bretagne (Inde).

 

À

2494]! 8”| 71°43/587

 

Gulasan.. .........
Waladhar.........
Dawal....... ah ee
kajura............
Sabla. lee

Sohagi..:.........
Bhilgäon..........
Gangasära ........
Jhund ey
Vitara eee
Alam-Shahar......
Käribhit..........

Panera ek

Dang-kä-basti.. ..
Shä-Turel.........
Nindamäni........
Alam Khän .... ..
Hakimani.........

Kärothal..........
Ghatana ..........
KGa ee

Bol (Karachi Base
Line)
Bolalis (Karachi
Base Lite).

ss.

 

 

24 32 7
24 50 33
24 35 15
24 46 45
24 43 46
24.85 5
24 52 39
24 40 43
24 51 19
24 48 3
24 41 34
24 58 40
24 47 51
24 56 36
2452 2
25 0 28
24 49 55
24 58 23
2450 5
25 0 2
24 48 17
24 57 26
24 52 56

25 13 31
24 54 37
25 8 56

 

71 45-52
71 42 52
71 32 19
71 34 7
711.25 50
11/25 32
10270
71 16 31
11 16/97
Ne 7136
71 443
7) 1] 34
70 58 52
0 258
70 50 34
70 48 20
70 36 52
70 39 42
70 24 10
70 24 16
10 10 58
70 14 17
70 3 40
10/5561
69 58 54
69 47 35
69 51 22
69 34 8
69 30 23
69 42 53
69 27 56
69 20 25
69 20 38
69 11 28
69 11.36
69 12 49
69 3 24
627 355.
68 53 32
68 53 51
68 52 0
68 43 47
68 42 47
68 34 28
68 34 18
68 34 6
68 23 40
68 22 27
68 2 50
68 10 35
61 53 32
67 58 34
67 39 19
67 35 58
67 45 43
67 30 37

67 20 4

00 21 25

 

 

EPOQUE

1851
1851
1851
1851
1851
1851
1851
1851
1851
1851
1851
1851
1851
1851

sel

1851

1851

1851

1851

1851

1851

1851

1851

1852
1851

1852
1852
1852
1852
1852
1852
1852
1852
1852
1852
1852
1852
1852
1852
1852
1852
1852
1852
1852
1853
1853
1853
1853
1853
1853
1853
1853
1853
1853
1853
1853
1853

1853
1853

 

DIRECTEURS
ET OBSERVATEURS

Strange.

Strange,
Strange.

Strange,
Strange.
Strange,
Lane.
Strange.
Lane.
Strange.
Strange,
Lane.

Strange,
Strange,
Strange,
Strange.

Strange,
Strange.

Strange,
Strange.
Strange,

Strange.
Strange,
Strange.

| Strange,

Strange.

id.
Lane.
id.
Lane.

Lane.

Lane.
id.
id.

Lane.

Tennant, Lane.
Tennant.

id.
id.
id.
Tennant, Lane.
id.
Tennant.
Tennant.
id.
id.
Tennant.

id.
id.

Tennant.

 

   

INSTRUMENTS

REMARQUES

 

 

Det 5, 301.

 

 

=

 

lsat tamer

ea, au 4 Mau aa du lh le
