 

 

 

 

 

 

 

 

0107

-Ihdegur = N
In nn. & =

nn

j

Ke

\ |
wieda
Sn | $

7038

\

\

7

oS

Aeyepue N

SE
008 o

0 091 001

9296

a

VIGNI NI SNOLLVYSdO ONITIHAIT
ogy Jo
ss912014 au} SuIMoysS
nel)

 

a

Fr
I

ra. Gun
NOTAGO\

mt

seipew

peqetepstina

undse[ig Ÿ

\ f Y
\oglegumoge 6)

ANS
pur

upueune y °

SR

ung an

8 BAOOSSNW

ca

DS sn uaous st suotyeredgQ Aumene eg Jo esmoo eu} —YLON

 

ugey Q

o eye)

RS

 

 

 

 

 

 

 

 

 

 

 

 

 

 

 

IL WLVid

 

A ann Rte LA a Mehr à

 

Hier

 

 

 
