 

408

Sur cette somme est déposé:

aupres du „Kur- und Neumärkische Darlehns-

kasse à Bern 4 0 0. . M. 6 234,00
aupres du „Königliche Besandluug oh

Staabsbank). a Berlin 0 0. » OL 000, 1%
dans la caisse du Bureau central pour tos fag

dadmiinisttation D oo, 1 500,00

Total: M. 58 803,17.

Les contributions arriérées étaient à la fin de
l'année. es una. means sul. Mi, ODO.29

Le total des contributions annuelles monte
d’après le tableau à la fin de cet art. à „ 71 400,00

Les dépenses spécifiés pour le service des latitudes sont:

Pour les stations au nord de l’équateur.

Frais d’exploitation de la station à Carloforte . . . . . . M.
» » en „ Mizousawa NU
» y En „ Bechardjoi . np ay
„ hs ee „Omeinnsi ‘. . s
» D Ukiah du {er Juillet 1913,

jusqu’à la fin in mois de Jun OA 0.00), à

Frais d’exploitation de la station de Gaithersburg du 1er Juillet

1913, jusqu'à la fin du mois de Juin 1914 . . . . … ,

Frais d'exploitation de la station de Turin 1913 . .. . . . ,

Honoraires poue des caleue 2, . ne ey

mals daimpresson 6 eg

Frais de bureau divers ac A di durement ee A ub

Total: M.

Pour les stations au sud de l'équateur.

Frais d’exploitation de la station à Johannesburg 1918 . . . M.
» » vy ye cantiano (Chili) 1915), 47,
Honoraires pont lesccaleul ... oo
rails de bureau (iverson
Total: ..M.

 

8 000,00

8 000,00
4 000,00
1 000,00

8 000,00

8 000,00
1 000,00
8 794,70
112,70
940,01
47 847,41

4 000,00
1 000,00
1 038,20

130,70
6 168,90

i
;
i
i
i
j

ected ll id badass al iden

 
