|
=
|

LS

 

 

 

 

 

 

 

 

 

 

à 58
Now Senn: 2 | Decl. 1870.0 ue a = Praecession. sen
| | S Rebler. |. bewegung.
| uk ah, Dill mohneul iy
|
| carr. 7616.7 |-+ 81°46 3169| #007 | 7 | + 19.8805 t — 0.000456 t? — 0,00000044 4°| -+ 0.085 t
> | 8 Urs. min. |45 | + 85 33 2997| £0.14 | 13 | + 19,.5499+ — 0.001167 t? — 0.00000153 1° | — 0.015 t
à | Ca 256] 7 |+81 18 518t| #035 | 3 | + 18.1708 — 0.002132 #2 — 0.00000135 4 | + 0.019
al 99917 | 482 36 49.74| #025 | 4) 4 17.4890 1 — 0.003024 1? — 0.00000219 1° | — 0.041 t
5 | Bradley 344 | 6 +80 53 36.18| #046 \ 6 | + 1.9500 t — 0.003629 t? — 0.00000186 1? | — 0.095 t
| carr. 4511 6 | +84 26 35.99| £0292] 11) + 14.0554+— 0.006727 #2 — 0.00000479 +8 | — 0.124
7} — 49116 | +8613 5090| +013 | 14 | + 12.6086. — 0.010717 t? — 0.00000999 1? | — 0.055 t
sl 580 ]}6.5) +83 28 55.01) 033 | 6 | + 10.1524t — 0.008300 t — 0,00000863 t?| + 0.005 t
9| — 698167 +85 46 50.61) £0.20) 8| + 6.3591 t — 0.014023 t2 — 0,00000586 1° | -- 0.078 t
10| — 770/67) +85 7 19.97| £0.18} 18) + 3.4308 ¢ — 0.013302 t? — 0.000257 t?| + 0.012 t
| 11 | Carr. 842] 7.6 +86 45 42.88) 0.25 | 13 + 0.4655 t — 0.019459 4 — 0.00000069 12 | — 0.094 t
| 12 | 51 Cephei |5.6 + 87 14 22.07] +£0.12 | 16 | — 3.3725 t — 0.021842 €? -+ 0.00000754 1°, — 0.058 t
| 13 | Carr. 1097 |5.6 | +82 89 10.32] #025 | 12 | — 5.4911 t— 0.009133 # + 0.00000198 1° — 0.045 ¢
ui — 97 | oT 4 84 25 2722) £029) 8 — 8.9047t — 0.010000 €? + 0.00000456 1? | — 0.004 t
15| — 1165 | 6.7) +82 49 3353| £027) 7, — 9.9595 t — 0.007753 12 + 0.00000811 t* | — 0.024 t
| 16 | Carr. 1986 | 6.7 +84 41 46.91 | 019 | 8 | — 13.4085 t — 0.007443 12 ++ 0.00000538 1° | + 0.025 t
) 17 1 Draconis |45 -+81 58 4934| 40.19 | 12 | — 15.2673 t — 0.004295 t? + 0.00000240 ## | — 0,030 1
| 18 | Carr. 1451] 7 +84 32 3123| #021 | 7 | — 16.7879 — 0.004236 t2 + 0.0000081 1? | — 0.014 t
i 19| — 1516 |65 +84 54 3536| +#0.16 | 13 | — 17.8002 t — 0.003308 t? + 0.00000341 t? | — 0.048 t
20 — 1688 15.6) +83 13 B94) 4028 | 8 | — 17.9416 — 0.003551 1 + 0.00000207 4? | + 0.017 1
21 | Carr. 1707 [65 | +81 30 33.71) 0.11 | 6, — 19.7860 — 0.000496 t + 0.00000053 4? | + 0.032 4
99) — 1193 16.7 | + 86 18 2777) £0.18] 11 | — 20.0521 t + 0.000030 t2 + 0,00000020 +? | + 0.089 t
23 | 32Camelop. | 5 | +84 7 10.59, +014] 15 | — 19.6109 € + 0.000103 t? + 0.00000012 1° | + 0.011 t
24 | Carr, 2080 | 6 |-+ 83 24 1580, +023) 8 | — 17.9391 t — 0.000639 +? + 0,00000068 1? | — 0.041 t
25 | — 2261] 6 | +83 237.22) £018] 8 | — 1422824 0.002357 1° 4 0.00000150 1° | — 0.255 t
: 26 | Carr. 2493 | 7 | 85 40 18.63! #016 | 8 | — 9.7629t — 0.007845 t? + 0.00000505 1° | + 0.024 t A
27 | « Urs. min. [45 | + 82 14 48.78| #013 | 19 | — 5.2424 — 0.004496 t? + 0.00000092 t? | — 0.004 t
8 | 3 Urs. min. [45 | + 86 36 21.42) +0.06 | 18 | + 1.2480 — 0.014141 1? — 0.00000138 4° | + 0.038 t
29 | Carr. 2822 |67 | +83 42502| #007 | 4| + 35904: — 0.005573 12 — 0.00000080 1? | — 0,0101
30) — 2908 [7.6 |+83 43 2045, #081 | 4 | + 5.891831 — 0.005970 1 — 0.00000157 4° | — 0.0404
31 | Car. 3091 |76 1284 17 347) +0,36 | 5 | + 11.3607 — 0.004795 t? — 0.00000270 4% | — 0.044
32 | 76 Draconis | 6 | 4.82 2 61.04, +£0.95 | 11| + 13.6658 t — 0.002131 t? — 0.00000110 4% | + 0.008 ¢
33 | Carr. 3264 | 7 |-L83 49 26.91! +025 | 7 | + 15.5773 t — 0.002133 t? — 0,00000156 # | — 0.0114
34| — 32731 7 |-+86 29 39.16) #023 | 12 | + 15.6439 — 0.004864 1” — 0.00000609 &? | — 0.003 &
25 | — addi [56/485 97 833 £0.15 | 15 | + 18.2931 + — 0.001183 # — 0.00000142 t* | + 0.040
36 | Carr, 3502 | 5 |-+ 82 27 50.33, 0.22 | 7 | -+ 19.0690 + — 0.000058 t? — 0.00000016 1? | + 0.047 t
37, — 3525 [56/483 39 148) -£0.19| 8 | -F 19.2600 — 0.000102 t? — 0.000000214? | + 0.014 t
28 | — 3621 165/486 35 9485, +012 | 18 | + 19.8556 t — 0.000055 t? — 0.000000184? | + 0.004 t
Se; + 9360 + 85 58 57.86 | £025 | 11 | + 20.0446 + + 0.000004 4? — 0.00000010 1? | — 0.005 t

 

 

 

General-Bericht f 1874. %

 
