 

Kiloverhül a he Gos) s ai,
Bosebyere ii ee. oy
Din ee nn en

Dre Dane RENE,
Hroliemosepanke Va Se.
Diet DR ee a RES À
BReisnes 0) EN Ds
Kiovyesiion Dors it EE

Meme dd D Do nt,
Bossa 0 en an:
Mroldemosebanke ... he . . \

Wyre ne, ANR RU HAN,
Boers eee ae Ju
DENIS MAN HUE CL
Skamlmespanken. va.

DÉC ee ee . . . .
Ro biere ee
Skamlimgshanke . . . . . . . . . .
Hrividemoschanke ., ..... +
DRE este
POS D uni:

INroldemosebanke 21.2 4 04.1
D rpanke, DEAR ER Un
économe URL DR
Kuiysbjersene . UO ee

a

Refsnes.

[1

0 00 00,00
89 06 41,84
174 59 02,19

Bögebjerg.

0 00 00,00
54 51 07,82
107 19 54,58
153 51 55,82
207 05 38,48

Dyret.

0 00 00,00
47 35 39,05
133 55 03,38

Troldemosebanke.

0 00 00,00
di 14 4901
86 45 58,56

"149 82 25,81

Dyrebanke.

0 00 00,00
12 28 27,48
109 20 42,67
169 41 43,06

214 56 32,12

249 16 31,39

Skamlingsbanke.

0 00 00,00
63 52 36,00
91 54 19,69

159 57 26,85

0 ! It
0 00 00,00
89 06 41,23

174 59 01.98

0 00 00,00

54 51 07,68

107 19 54,48
153 51 56,07
207 05 38,37

0 00 00,00
AT 35 39,25
133 55 04,72

0 00 00,00
41 11 51,29
86 45 59,50
142 32 96,73

)
S

=
wm Wm eo
bo
&
Or

DD
=
ar >

Cr BO BS
oo

NEN SI |
m»

169 41
214 56
249 16::

CB

Ae
>
1 ©

DORA

0 00 00,00
63 52 36,31
91 54 19,37
159: 57.26.41

4,2318079
4,1141893
4,1067099

4,2862010
4,4252264
4,2447780
4,1141893
4,3281088

4,1067099
4,2447780
4,3254675

4.44231
4,3092356
4,3450244

4,1505198
nD

4,4133853

4,2862010

4,3308727
4,3092356
4,4532672
4,2229196

ash ak a bh ah ak le

 

 
