 

TA

 

   

  
  

 

 

 

 

 

 

 

 

 

 

; a Déclinaison 1875.0 | Reduction
a Ascension | ___ 2 hoe Fee
une : | du cat. de ducat.de/du cat. de
Ktoile. l'E | droite Vierteljahrs- Association Safford | la Viertel- | Safford Safford au
= 1875.0 : De allord. | jahrsschrift jau cat. de catal. de la
S schrift. géodésique | au cat. de | l’Assoc. | Viertel-
u a nn |! Smacon.|g6odes |jahrsschr.
3 Geminorum 1416044033 +34) 6134162) 434° 6’ 34177 | Hors |s
15 Lyncis 5 46 27 +58 34 59.81)458 35 0.42 | +0.61 |
63 Aurigae Dh 30 512809 3: 13.99.4139 32 ,19.56) 0857 |
ß Canis min. 3 20 22 41 8 32 21.52|4 8 32 21.80) | +0.28 |
ui ae I 32 457 5 32 36-7714. 5 32 37.11) (4-0. 34) |
ß Geminorum 2 37 40 | +28 19 33.80 28 19 34.53 | +973 |
Gr. 1408 Bl Oe aay, |e 8 4:91 476 8.4.32] | —0.60 |
6 Cancri _ 4.3 9 44 |+ 9 34 8.694 9 34 9.35 +0.66
ı Ursae maj. 3 50 38 |448 31 50.05|-+48 31 52.07) 41.02 |
40 Lyncis ‚49.23 26.434 55 10.511134 ss 11.10) 0.59 | |
« Hydrae 2 21 27e 81,7: 41037 8 7 4.28 +-0.35 |
S Ursae maj. | 3 24 29 |452 14 43.19 452 14 44 38| +1.19 | |
e Leonis 3 38 45 |+24 20 54.89 424 20 55.84 +0.95 | |
v Ursae maj. 3 42 5 +59 37 29.64 +59 37 31.00! 1.36 |
a Leonis +210 1 43 [4312 34 37.91|+12 34 38.58) —+o.67 | |
À Ursae maj. 3.4 9 33 +43 32 14.36/+43 32 15.91) 1.55 |
Be, 3 14 53 |442 7-37-69 +42 7 38.40) 0.71
31 Leon. min. 4.5 20 39 +37 20 47.93 +37 20 49.28 | 1235
36 Ursae maj. 5 22 57 156 37 34.01.156 37 14.17| 40.16 |
De 54 1, )157 à 5.93.457-.3.7.26| +1.23
a — 2 56 0 |+62 25 30.37+62 25 31.22 | +0.85
Ÿ oy 3 |ıı 2 38 |445 10 33.42/+45 10 34.80 |; +1.38 | |
ÿ Leonis 13 7 27 |+21 12 28.95 421 12 30.14 | +1.21 | |
& Ursae maj.med./4. 3 IL 30 | $32 13 55.79-32.13 55.48] | —0.31
x Ursae maj. 4 39 27 |4+48 28 19.83| 448 23 20.85 | +ı1.02 |
ß Leonis ee 42 41 |+15 16 14.48) 415 16 15:09] +o.61 |
ß Virginis “A 44 ıı |L 2 528 8.06 42 28 8.82 | 40.76 |
y Ursae maj. “3 47 15 454 23 22.464154 23.22.57] +o.11
8 - 412 9 14 457 43 37.021457 43 38.30|+57° 43° 37.90) 1.28 |Fo’4o| —0"88
2 Canum ven. 6 D ou AL 2 aa 441 21 25-10! | |Lo.42
6 mn. sl 19 4139 42.43.66! [+39 42 43.50) | I—0. 44
74 Ursae maj. || 6 24 71459 5 36.48 +59 5 37-00 ip oes
8 Canum ven. 4.5 27 48 142.2 12.91 442 2 13.10 eo
y Seins 3 35 20 |— © 45 49.69 — o 45 48.55 (+3.14)| |
e Ursae maj. | 2 48 31 |+56 38 17.94 +56 38 17.80 | +o.14
12 Can. ven. seq. | 3 so ir |+38 59 37.59/38 59 38.07 +0.48 | |
14 Canum ven. | 5 59 54 136 28 5.50/136 28 5.60! na
B AO 4407 11-6113 3 53 +38 5 22.48/138 5 23.00 I—o. 52
17 Canum ven. 16.7 4 19 [+39 9 48.40 +39 9 49.70 1230
20 se ı1 56 441 13 51.42)441 13 52.490441 13 52.60] +0.98 |—o0.20\—1.18
¢ Ursae maj. pr. |2.3 18 53 +55 34 41.88 +55 34 43.08] +55 34 42.90| +1.20 |+0.181—1.02
ı7 H. Can. ven. | 5 29 13 |+37 49 23.06 +37 49 23.50 | aa
n Ursae maj. 2 42 37 |4+49 56 15.70\-+49 56 16.00/Amer. Ephemer.| -t-0.30 |
n Bootis 3 48 44 |+19 1 30.25|+19 1X 31.09 | +0.84 |
a Draconis 4.414 L 01464 §8.25.06/164 58 25.12 40.06 |
B. A. C. 4699 15.3 2 56 +44 26 59.35/+44 26 59.60 |—0.25
13 Bootis 6 337 +50 2 58.33 +50 2 58.10 ito.2
a. Bootis I 9 58 |+19 50 3.07/+19 50 3.44! +0.37 |
Do 4 11 38 |446 39 45.12|4+46 39 47.27 +2.14 |
Da 4.5) 11 44 [+451 56 39.41 +51 56 39.80 | —0.39
s — du 20 56 |+52 25 44.30|+52 25 45.30/Amer. Kphemer.| +1.00 |
a 4-3} 26 27 |-+30 55 16.37 +30 55 16.40 | —0.03
Yoo 13.2 27 31438 51 20.66 i+38 51 20.90 | —0.2
33 — 6 34 11 |444 56 40.91 +44 56 41.80 | —0.89

 

 

 

 

 

 

 

=

zn (baa a BT A ak

LE) i

Ib ren ey

js me ns abi dl ant pus à:
