 

|
|

rn at

1 paw lu

ORR 8H ae

MP LI

 

A SNES

    

 

 

 

= or

 

 

 

 

Erreurs de clôture des triangles desquels ont été mesurés les trois angles.

 

REMARQUES

 

 

 

a AUTEURS DES INSTRUMENTS er NOMBRE a) ERB
BE 2 ‚EN DES OBSERVATIONS DE CLÖTURE
5 es one DES EXÉCUTÉES DE
© ET a VERNIERS POUR CHAQUE A?
7 DIAMÈTRE DU CERCLE i OU DES CHAQUE ANGLE TRIANGLE
ë HORIZONTAL a MICROSCOPES : OU, POUR A
MICROSCOPE CHAQUE DIRECTION |
ee ae a Ed
Directions.
317 | Ramsden, 3 feet. B.O. Microscope. 3 1214 200 335 Del 5 10e
318 id, 18% (0% id. a 14.10 23,1 20.18 2022 5,193
319 id. 18% 0 a id. 3 9 3 10238 17.18 2 al 5, 386
: { Troughton and Simms, 2 feet. id, > 20,15 De
5 ( Ramsden, 3 feet. B. 0. i. : 19.28 12.16 2,2| 5 Le
il. Be O; id. ie 18 c
321 | id. RS. I 5 13.19 20,15 | 2,98 | 9,5%
n id. Bo, id. 10, 15 5
322 | id. Bo id. 5 , SU 96 En
Sa id. R.S. id. a We 27.24
323 ! Troughton and Simms, 2 feet. id. 5 13.10 | 2,34 | 95,476
324 | Ramsden, 3 feet. B.O. id = 3,5 815 5G | 2.34.) ,5 Age
Bee id. eS: Te 21.30. 23.8
325 | id, B. 0. id. 3 90. 19 À 2 34 5, 476
id. BO; id. à 11.10 ;
326 { Ramsden, 18 inch. id. 3 23,22 | 2 34 5, 476
Troughton and Simms, 2 feet. i. 5 . on
- Ramsden, 3 feet. R.S. id. 5 So 282 >
327 | id. BO. i. 3 92.10 | 2,35 | 5,622
a id. IBY Oy id. 3 12
328 | id. R.S. id. 5 do a 2 ,38 | 5,664
329 id, 3.0: id. 3 8.8 94108 | 2939 5.112
330 | id. RS. 5 5 02 89 2.,40 5, 760
e id. RS. id. 5 1724/1020 ;
oo! Troughton and Simms, 2 feet. ie 5) ‘ - 10. 10 A : 5, 905
> § Ramsden, 3 feet. R.S. id. 9 34. 40 )
332 | id. B. 0. i. 3 i 32415 or
N id. RS. id. 5 33.21 r
ı id. B. 0. id. 3 ast 7.6328 se
335 | Ramsden, 18 inch. _ id. 3 1,12 1614 2 2 ,49 | 6,200
336 | Ramsden, 3 feet. R.S. id. 5 8.4 125 BL 2.50, 6,250
337 id. B. O. id. 3 28.6 3.95 5 2 2 6, 300
338 id. B. O. ie : .. a i I 9.16 2 52 | Bot
330 | Ramsden 3 feet. R.S. id. 5 a, a
340 | id. RS. i 5 ET 93.18 38.501 € 00 Ge
341 id. Bo id. 3 15,28 bol Sls Bk 2,58 6, 656
342 | id. RS: id. 5 10515 14,20. 219 61 2.58 6, 656
343 | Ramsden, 18 inch. id. 3 22.26: 5,4 1212 21,02 6, 864
344 ss 3 feet. _ à 1 5 19. 16 de | 2 ,64 | 6,970
345 | id. B. O. id. 3 13, 8 “15: 11 20. 10} 2,64 | 6,970
. ( Troughton and Simms, 2 feet. id. 5 14.18 > tk 7. 022
346°) namen 46 note id. 3 19.13 8, 9 } 2 6 ,
347 | Ramsden, 3 feet. R.S. id. BD 12.19: 14.8 27.6 | 2 „65 7,022
348 | Troughton and Simms, 2 feet. i : 15.-90 He 2,69 | 7,236
Sy Ramsden, 18 inch. id. : 5. 7.290
a | Ramsden, 3 feet. B.O, 5 ; a 19. 13 à : | a '
QE 10% Ba Oy id, : 22: : +
350 | id. R.S. id. 5 38.28 12,7 N
351 | id. B, O. id. 3 12.23: 11.20: 92.9 | 2.16 7,618
|
|

 

 

 

 

 

 

 

 

 

 
