 

 

 

 

   
  

 

Conti Ok

orTipera SKA
PAVAVA ER
AA N
VAY

Si

2

>

DRY

>
\

|
RS

 

 

erraPoonjee „cs
„ch Pas 124 Longt Series.

IS et 4
À + pee os 1

M:
DL
Cachar

 

  

 

 

 

  

 

N° GG À E

 

 

CHART OF BURMA TRIANGULATION
WITH MANIPUR CONNECTION

IN DOTTED

Den
Tidal SE"

I 2 À À
A A) #
°Sandowa Y > ER 1 >

  
  

Tidal\str !)
Elepha
D

D»

©
oO
Uths of Ÿ

 

LINES.

 

 

 

 

 

LIBRAIRIE ET IMPRIMERIE CI-DEVANT E, J. BRILL, LEIDE.

> Winn aa Meubles ca
Pe cot 7

KT/ 9
Tidal stupor} ergui Base
wm EN #x
a \/ |

„Amherst & Nee
a Se
= 07 a

 

NE |
N'_eTenasserim |_
Q ‘\ :

    

|
IL Pat

 

 

 

 

 

+—
100°

sel

 

 

Vi

|
i
i

 
