(SR nn 5 =

 

 

 

 

— 195 —

Erreurs de clöture des triangles desquels ont été

 

mesurés les trois angles.
ul I

 

 

 

 

 

 

 

A AUTEURS DES INSTRUMENTS Tu NOMBRE one EAU NS
Ei EE EN Dis DES OBSERVATIONS DE CLOTURE
8 ET nn VERNIERS a Sk A? Ä R
| : R a = REMARQUES
a DIAMETRE DU CERCLE Bra. OU DES CHAQUE ANGLE TRIANGLE
‘a HORIZONTAL ey MICROSCOPES pue Po a
MICROSCOPE CHAQUE DIRECTION
à a
107 | Waugh's 24" n° 1. 5 32; 20. 3 0,27 | 0,070
108 | Waugh's 24” n° let T. ets. 36". 55 3. 30, 21 0,08 | 0,0064
109 id. 55 so, Ss 2) 0”, 74 0, 5476
110 | Waugh’s 24 ne 1, 5 30.31 32 0 ,01 | 0,0001
111 | Waugh’s 24" n° 1 et T. et S. 36”. DS SL 332 32 0 ,08 0, 0064
112 | T. ers or 5 36. 38 32 0,21 0164|,
HS id. 5 Al. 35. 37 0.13 0, 0225
114 | T. et S. 36" et Waugh’s 24" n° 1, 55 30, 3 33 ] ,41 } 1,9881
1», 1. es 30% 5 34 32 32 0,05 0, 0025
116 id. 5 38,32 34 0 ,68 0, 4624 .
LL? id. 5 s2 36. al 0,85) 0,25
118 | T. et S. 36" et Waugh’s 24” n° 1. | 5 D 31. 91 30 0,38 | 0,1444
119 | T, et S. 361. 5 32 3, 2 O , 45-1 0: 2025
120 id. 5 Sl 33. 50 0,2517 0.005
12] id. 5 32 320 ol oo 0, 1369
122 id. 5 40. 34, 34 0 ,56 0, 3136
123 id. 5 30: 36, 33 0 ,09 0, 0081
124 id. : 5 sl. 3. 32 1,48 | 2.1004
125 id. ei 5 33, 5140 0,35 | 0, 1225
126 id. gS 5 32. 3. 36 0,23, 0.0989
127 id. © 5 30, 3L 5 0,01 | 0,0001
128 id. a 5 327,35. 3 0,5 0902
129 id. 2 5 3 3080 ol 0, 0121
130 id. 5 5 3 32 9 0,81 0, 3249
= 131 id. a 5 S407. 300 1 0 , 00 0, 0000
= 132 id. 2 5 32.) 388 83 1,00 | 1,0000
= 133 id. B 5 53. 32 30, 1, 1, 7689
134 id. .8 5 20. 33 3 1,29 | 1.0641
= 135 id. = 5 36 34 34 0 ‚60 0, 3600
= 136 id. = 5 Ss 32. 3 0,88 | 0,7744
137 id. 2 5 38. 32. 38 0,29 | 0,0841
138 id. = 5 AD Sle 91 0 ,80 0, 6400
: 139 id. © 5 32.380 38 0,53 0, 2704
140 id. S 5 38.4 33 0,94 | 0,8836
141 id. 5 5 36, 41 32 0,26 |. 0, 0670
142 Te a 5 3l 36. 36 0,16 | 0,0256
143 id. = 5 Sie 3250 0,23 0.0939
= 144 id. 4 5 31, 2345-35 1,05. 1108
145 id. 5 84. 34.33 1,67, 2.2021
146 id. 5 Sin 81 on 0 ,83 0, 6889
147 id. 5 32. 333 30 0 , 60 0, 3600
148 id. 5 37.34 31 0,23 0, 0529
149 id. 5 30, DE Be 0 , 84 0, 7056
150 id. 5 a a On 0,66 | 0,4356
151 id. 5 34 55 2 0,92 0, 8464
152 id. 5 30,38 00 0,44 | 0,1936
153 id. | 5 238 32.3 0,21 | 0,0441
154 id. | 5 32, 80. 83 0,10 0, 0100
155 id. 5 37. 39: di 0,78 | 0,6084
156 id. | 5 3 0,40 | 0,1600
157 id. 5 37. 33. 35 0 ,28 0, 0784
- 158 id. 5 32. 33.80 0 ,08 0, 0064
à 159 id. 5 36, 30) 35 " 10 ,19 | 0, 036)
à 160 id. 5 53. 362 34 0,35. 0.1205
= 161 id. 5 40. 34. 33 0 ,09 | 0,0081

Jah

LI |

F

 

 

 

 

 

 
