 

sr 101

 

 

 

 

 

 

 

 

 

 

 

 

 

tite Ourse et 51

lius),etlesignal,
mesures au

’ moyen de l’ins-

, „trument univer-

< selde Repsold,

de 1l’Observa-

toire de Leyde.

\
IM: ! | |
u At s et ins- : i |
” Methodes etins- | Knnseetmois.| TITRE DE LA PUBLICATION REMARQUES |
N truments emplove£s. |
SMethode A. Ins- | 1888 juillet. | Publication der Norwegischen
’ trument univer- | Commission der Europäischen
- sel d’Olsen. \ Gradmessung. Astronomische
' ' Beobachtungen. |
» 1888 aoüt. | »
|
: » » » |
k |
"FMethode A. Tiheo- 1889 aolıt. » |
dolite Olsen. |
'B » 1893 juillet. | » |
» 1893 aoüt. » |
[Methode A. Ins- » | »
F irument univer- | |
sel d’Olsen. | |
‚, Methode A. Theo- 1892 mar. ı Non publie.
dolite Olsen. | |
Ju » | 1894 aoüt. | » |
| |
|
| I
zu
|
J Augles entre « Pe- | 1893 septem- | ?
Me title Ourse, 3 Pe- | bre,novem.
\ |
Cephee (Heve- |
|
|

 

 

 

 

 
