 

On“

ei]

Fi il IE. gi

 

 

— 289 —

Erreurs de clöture des triangles desquels ont &t6 mesur6s les trois angles.

 

 

 

 

NOMBRE
_ AUTEURS DES INSTRUMENTS LuSBUER NOMBRH DES ERuND
E . EN OBSERVATIONS | DE CLÖTURE
E EMPLOYES a DES ae 3m.
s ET n ERNIm. VERNIERS POUR CHAQUE A?
n DIAMÄTRE DU CEROLH ounms am
a OU DU OU POUR A
HORIZONTAL MIOROSCOPn |, MIOROSCoPES CHAQUN
DIREOTION +| -
Directions.
48 | Repsold de 27 em. - Starke de 27 em. 22 2M. 2M. 30 36 36 1|0",9680 0, 9370
49 | Starke de 27 cm. id. id. 30 36 36 |0,3662 0, 1341
50 | Repsold de 27 cm. -Starke de 27 em. | id. \" id. id: 30 24 36 1",0198] 1,0400
5l | Starke de 27 cm. - Troughton and id. id. id. 2M. 30 42 36 |0,1985 0, 0394
Simms de 27 cm.
52 | Repsold de 27 em. - Starke de 27 em. \ id. id. id. id. 30 36 36 3.0965 9.2203
53 id. id 1d. id. ıd. 42 36 36 0,2356) 0,0555
54 id. did. id id. 42. 36 30 5,4909| 30, 1511
59 id. id. id. id. id. 42: 306 30 1,2087) 1,4607
56 10% id. id. id. id. 220 5.108 11, 7924
Sn id. ide dl id. id. 42.24 36 0.014 0, 0003
58 id. id. id. id. id. 42 36 36 2.5890 6, 7029
9 id. ide de id. 10. 42 24 36 3,0979) 19.0752
60 id. id. id. id de 42 20 36 2,4694 : 6, 0787
61 id. id. id. id» Id. 42 30 42 0,2611 0, 0682

 

 

 

 

 

 

 

 

 

 

L*

 

REMARQUES

 
