  
   
   
     

RG Ge

 

Pays-Bas.

 

 

 

 

 

 

| | |
INDICATION | | if | DIRECTEURS |
Nee on LONGITUDE.| ÉPOQUE. | INSTRUMENTS. | REMARQUES.
| DES POINTS. | | ET OBSERVATEURS. |
| | |
I 43 | Hornhuizen . .. | DD: 20" | 34° 130" | Dir en feu Dt F. J. Stam- 4 2 |
' 44 | Uithuizermeeden . | 53 24 33 | 24 22 52 | oe Observateurs: feu D* as ie |
Nig 45 | Midwolde...... | 53 11 42 | 24 40 34 | mn | ey: Stamkart, avec le con- oes
bin, à 46 | Onstwedde. . ... | 53 1 53 | 24 42 38 Rn | cours de: 1866 licut. d’art. ER |
te 47 | Holwierde.. . | 53 21 30 | 24 32 12 © | A. L. Boeck; 1867-71 ing. es |
ut pe ee iisum....... | 538 29. 2 | 24 43 44 | do | civ. A.N.J.van Hees;1872-74 ears | Prusse.
| AP Emuen .....,5392 d | 2452 93 | se lieut. d'art. P. de Wilde; TS © © | Hôtel de la Ville,
} | be | 1874-76ing.civ. H. van Sche- eae | Prusse.
: RU POP 0... | 08 13 46 | 25 6 58 | | vichaven; 1876-79 ing. civ. ES | Prusse.
r | | | A.L. J. Bouten; 1879-81 M* |
| | Ve Heesleméme dé} anommeé. |
il {

 
