 

 

 

 

 

 

 

 

 

 

 

 

 

 

 

 

 

 

 

 

Längendifferenz |
Land |. Stationen | Beobachter
in Zeit W. Fehler
Oesterreich |21| Pola—Bregenz . . noch nicht |v. Steeb, Gruber
22 Pola—Prag (Dablitz) ; : reducirt | Gruber, Schramm
23 | Wien (Tiirkenschanze)—Miinchen ; —+ 18" 55:09 | Anton, v. Orff
24| Wien (Türkenschanze)—Padua . ALI? 52.02 4a= 0.019 |V- Oppolzer, Lorenzoni
|25|| Wien (Türkenschanze)—Mailand . | + 28 35.25 = 0.012 |v. Oppolzer, Celoria
26 || Wien (Türkenschanze)—München . . | +18 55.11! + 0.020 |v. Oppolzer, v. Orff
27 | Lemberg - Krakau  . 2 ram, Nahlik
28| Czernowitz— Wien (Türkenschanze) a i v. Steeb, Kühnert
29 | Lemberg -- Wien (Türkenschanze) . Anton, Nahlik
30 | Czernowitz— Krakau : | | Kühnert, Schramm
31| Warschau — Wien +18 46.11 Anton, Sawitzki
32 Wien (Laaerberg)-Wien(Türkenschanze) + 0 15.08 'v, Steeb, Nahlik
33| Czernowitz—Lemberg . : ‚Schramm, Kühnert
34 | Pulkowa— Wien . Se, + 55 57.43 | Anton, Sawitzki
185| Wien (Türkenschanze) - - München . 'Kühnert, v. Orff
86 | Wien (Türkenschanze)— u +34 16.54| + 0.013 |v. Steeb, Schur
| 37 || Jassy--Czernowitz ; .|+ 6 39.76 | Capitaneanu, Kiihnert
| 38) Wien (Türkenschanze)—Leipzig 5.15: 4748| 7E.0:013 |v. Steeb, Weinek
| 39 | Wien (Tiirkenschanze)—Miinchen . | +18 54.87 | pa. v. Orff
| 40 | Wien (Tiirkenschanze)=Miinchen . . | +18 55.04, |Nahlik, v. Orff
41 | Ragusa — Pola . . |\ noch nicht |Nahlik, v. Steeb, Palisa
|42 | Wien—Ragusa ; | veducint desgl.
43 | Wien (Tiirkenschanze) — —Greenwich . +65 21.21 | Kühnert u. Anton, Nahlik u. Schrank
44 | Wien (Türkenschanze)—Berlin . . | +11 46.30 Kühnert, Becker D
45 | Berlin — Greenwich | +58 34.89 ‘Becker, Nahlik |
46 Greenwich - München : : | Ab 26-29 |Nahlik und Schramm, v. Orff |
|47 | Budapest (Schwabenberg)— Wien : |\ noch nicht | Nahlik, Kalmar |
48 | Budapest—Krakau ap À | redueirt desgl. |
‚49 | Budapest-Pola . . | Kalmar, Palisa
| | Ey
| |
Preussen 1 || Altona-Schwerin -_ 5 54.56) sE 0.008 | Peters, Paschen, Pape m
I | Sept
at
| 2) Strassburg—Paris 21 43.56 | |
3 | Altona— Kopenhagen —10 32.56| + 0.008 || Peters, Lesser
| + Berlin—Leipzig |+ 4 0.89| + 0.020 | Bruhns, Forster
| | || |
| 5] Breslau—Leipzis . À | - 18 34.88
cena Born Bes ae | Forsch, ne Tiele
7, Bonn—Nieuport ‚az 91.46 | dese.
8 | Bonn —Greenwich |L98 98.31 | 8
a : : I desgl.
| 9) Breslau— Warschau . 115 57.66 | desgl.
10 | Berlin— Königsberg . 128 24.21) == 0.02 | Tiele, Romberg
| 11} Leipzig—Gotha + 6 43.48 | + 0.016 | Bruhns, Auwers
| | | I
| | |

 

 

 
