 

  
  

STATIONS

   
  
     
    
   
  
  
   
 

=

_ Neverfjeld. Point geo-
désique ae

Gu

Höstbjörkampen. Point |
céodésique |

—
WS #

Husbergö. Point geode-
sique Sa

 

Gausia. Point geodési-
que. ne

8 Gien. Point géodésique.

~

) Dragonkollen »

10 Graakallen »

 

  
   
 

11 Lekötind »

| 12 Norberghang »

| 19 Jedercn Base i. porn
géodésique

 

      
     
   

Bodö Base B. Point o&o-
desique

  

Gulfjeld. Point géodési-
que 8

 

Azimut.

 

irreur

O BS E à V AT E Ü BR g

 

Joederen Base A

Hjertö

Tveitekvitingen

»

 

16,35

 

 

 

DIRECTION rents)
| |
Ve a
Hôikors. Point géodés. | 178 27 369 | | Fearnley
| |
| | |
| |
Noeverfjeld » “or 1 28,6 @ 4: 4a Fearnley et Gee,
| | | muyden,
|
| | 2
Christiania » | 2 0 48,5 | 0.63 Geelmuyden,
| |
| 5 il | |
Jousknuden » | 142 14 11.5 | Ei ca »
| | | |
Sisselhö » | 307 5 54,7 + 0.9¢a. | »
| |
| |
| Tveteraas » | 298 56 57,4 “5 0.42 | Fearnley,
| Vasfjeld » | 163 33 48,9 |-+ 0,6ea.)
| | |
| i |
} | |
| | |
Vegtind L if 8209 | 2050| '
D | | le ; |
| | |
| | |
| | |
Rindenleret Base A.P.g. | 192 8 49.05 | + 0,35 :

Geelmuydel.

Ebbesen.

 

 

 

ee nn

M

 

     
