4 Ce Sn ST

AA ln ALL

D

MILE ES Ae AV) wg HF

   

 

Lg

 

Erreurs de clöture des triangles desquels ont été mesurés les trois angles.

 

 

 

 

 

 

 

AUTEURS DES INSTRUMENTS en NOMBRE a ee
= EN DES DE CLOTURE
5 EMPLOYÉS en DES OBSERVATIONS DE i
© ET | ee VERNIERS EXÉCUTÉES CHAQUE A REMARQUES
= DIAMETRE DU CERCLE OU DES POUR CHAQUE ANGLE TRIANGLE
a HORIZONTAL an MICROSCOPES OU POUR A
ZERO Cor CHAQUE DIRECTION
ler _——
88 | Troughton d = 0,356 et d= I 2 160 56 68 84 00 60 1,107 1,2224
= 0,306
89 id. 10. 2 60 6000 G0 62 56 1,018 .1, 0363
90 | Troughton @ = 0,356 id. 2 84 68 60 60 60 60 0, 955'| 07-9120
9] id. id. 2 160 56 60 60 76084) 4 148 17, 2059
92 | Troughton 4 = 0,356 et d= id. 2 96 52 84 76 64 160 |0,900 0, 8100
— 0,306
93 id. id. 2 60 60 84 84 64 160 |3,080 9, 4864
94 id. id. 2 106 22 60 © 64 641.95 3, 9006
95 id. id. 2 60.60, 52 418 068 64 1,684| 2,8359
96 | Repsold d = 0,196 | 2 2 104 104 52 68 60 60 |0,818 0, 6691
97 id. id. 2 o2 106 60 60 60 60 OC ASI | 0; 2314
98 id. id. 2 10 08 ‚60 60 104 104 2,22 7, 4093
99 id. id. 2 104 104 76 76 68 68 1,549| 2,3994
100 id. id. 2 100270 69 60 0604528 20, 5028
101 id. id. 2 92:68 .00 00% 76, 68 | 0, 337 0, 1136
102 id. id. 2 ‘92 96 60 60 92 68 3,226 10 2071
103 id. id. 2 08 72 92 76. 88 96 4,220 | 17, 8084
104 id. id. 2 24 64 60 60 72 52 |0,937 0, 8780
105 id. id. 2 100 88) 64.64 2 21,3% 1, 9321
106 id. id. 2 100 92 24 64 60 605,817 14, 5695
107 id. id. 2 92 88 C0 60 72 520,560 0, 3136
108 id. id. 2 92 188 64 52 92100 1,374 1, 8961
109 id. id. 2 10 188 2 >» 092 88 4,500 19, 2721
110 id. id. 2 2.10.01 2 2 72 2 081 8, 9222
Bl In ad =0,196, Troughton 21 2 88 304 60 72 60 60 0,086 0, 0074
ed — ‚306 |
12 id, id. 2 60 60 65 060 76 76 1,081) 1,1686,
113 id. id. | 2 96 304 76 92 60 60 |3,226 10, 4071
114 id. id. 2 60 52 60 60 92 304 1,019: 1,0384
115 | Repsold @ = 0,196 au | 2 02601100 027 60 64 2 027 4, 1087
116 id. | id. 2 0 69 64 60 68 72 11,032 2, 6634
117 | Troughton @=0,356, Repsold 2 2 60 60 60 68 60 60 |0,886 0, 7850
d = 0,196
118 | Repsold @ = 0,196. y 2 52 0 88) 92 63 720,210 0, 0480
119 | Troughton d=0,356, Repsold 12 2 2 60 60 60 60 100 76 0,2761 0,0762
d= 0,196 :
120 id. id. | 2 80 80: 60 60 60 60 3,593 | 12, 9096
121 id. id. | 2 0 C0 00 C0 72 16 1,720, 2 9584
122 id. id. | 2 80 80 100 72 60 60 2,149) 46182
123 id, id. 2 60 80 64 04 60 60 7,220, 1,4884
124 id. id. 2 64 64 304 96 60 60 2,014) 58516
125 | Troughton @= 0,356 et d= id. 2 12 24 80 20 60 60 3,285 10, 7912
= 0,306, Repsold d = 0,196
126 | Troughton d=0,356, Repsold id, 2 60. 60 30 80 60 60 2,538 20, 5753
a = 0,196
i277 | Troughton d= 0,356 et, d= 1 2 60.60 24 28 60 60 2,846 8, 0997
— 0,306
128 id. id. 2 60 60 28° >20 60 co 0,159| 0,0253
129 id. id. 2 60 60 24 20 60 60 | 0,088 0, 0077
150 | Troughton @ = 0,356 id. 2 60 60 60 60 60) 60 |2, 598 6, 7496
131 | Troughton d= 0,356 et d= jou 2 60: 60: 802 80 20 12 1,1691 1.3926
= 0,306, Repsold @= 0,196
132 | Repsold d = 0,196 | Di 2 80 68 188 92 80 92 2,007 | 4,0280
133 id. id. 2 68 72 96 80 64 64 |4,680 21, 4369

 

 

 

 
