 

Br ee aE ee ee SE xe = . S DENT
ne ss TR: = |
= —- = à = à …— | Ale I
= é = | | FIEBER itt
. @ 832 = | | Kee | |
Lit 2 Ma 3 | | 4 in j | |
on Cc Oo ne = | =A ÊT* | ||
D os Geta > | | AT | | |
Pol 2 2-51: | # | | AT | are
| Sir | Re hoe
Ca nos a À ne 4 So “| AN ar =
| =) 5 5 | iy | RAK KE j
Pan: 5: MW) | imax | ZARA | oe
| oa oO x $Y A a
| Siege À 4 fe | ANSE 0
> | 3# » \ & . a 3
LI ‘me ge LE a ET ‘i 3
35 £ 8 © \ ~ «ne
“Tl <x = 4 ( 2
= = 2
| > . 5 =
3 ‘à :
= 5 :
— nd ®

3

    

 

L2
*
Lh
3
5 ee

Ss
a a ee un

 

 

 

ie perse nte ¢
——— Differenze dilongitudine pubblicate

Drfferenze di

 

ee eer
RE

 

 

 

 

 

 

 

PIRE

R n © © © 2

o Fm eis q
Ay

=e |

 

 

  

 

   

|
=) |
|

 

 

 

€
Es
Bo À
ner 7X p Arr:
. LES
> Ä
a : :

 

À

    

DEAN PSE a
Va 7

+
+
+
xx

   

    

 

 

a

SAS

NIE
KON,

ge SR» peer à.

=
\ === _ eee |
[3 RARES

 

Settembre 1898
