 

 

Erreurs de clöture

 

 

— 406 7

 

des triangles desquels ont &i6 mesures les trois angles.

 

 

 

 

 

 

 

 

 

 

 

 

 

 

 

 

 

NOMBRE 5
en s le LECTURE DES = 5
Br AUTEURS DES INSTRUMENTS Ss NOMBRE ss s :
g EMPLOYKS DES BXRBCUTERS j
es SECONDES DE CHAQUE .
2 ET De nn VERNIERS . POUR - "RIANGLE A? REMARQUES
S DIAMETRE DU CERCLE . OU DES an A
a OU DU N OU POUR
HORIZONTAL MICROSCoPE MICROSCOPES CHAQUR
DIRECTION en | —
Triangulation du Gouvernement de St. Pötersbourg.
l Repsold (1851) 0,2 2 12 0",01 | 0,0001 | Observations de 1878.
D=]3p. angl. = 330" Methode des
mires circulaires.
2 id. id. id. id. 0,17, 0.599
3 id. id. id. Sid. 0,32, 0,1094
4 id. id. id. id. 1,09) 1,1881
5 id. id. id. id. 1,33 ; 1,7689
6 id. id. id. id. 0,70 0, 4900
7 id. id. id. id. 2,38 88804
8 id. id. id. id. 0,07 0, 0049
9 10, id. id id. 3.03 10, 4329
10 id. id. id id. 1.13. 1,2269
11 id. id. id id. 0.1 00925
12 id. id. id. id. 1,29 39221
13 id. id. id. id. 1,02 1.0404
14 id. id. id. id. 0,64 | 0,4096
15 id. id. id. id. 1,46 2,1316
10. id. 1d. id. jd sl 907201
17 id. id. id. id. 0,86 | 0,7396
18 ‚ld. id. id. id. 0,297, 0,2401
19 id. id. id. id. 1,48 2, 1904
1 Bamberg & Berlin (1888) 1,0 2 | 12 0,52 | 0,2704 | Observations de1888.
D-7D». ang]. — 17,gun Methode des
mires circulaires.
2 id. id. id. id. 2.82 1,9024
3 id. id. id. id. „87 | 14, 9769
4 id. id. id. id. 0", 44 0, 1936
5 id, id. id. id. 201 4, 2849
6 id. id. dr ® id. 2,05 4, 2025
7 id. id. id. id. 0,88 | 0,7744
8 id. id. id. id. 2.28 5, 0625
9 id. id. id. id. 1-61 2, 5921
10 id. id. id. id. 1,57 24649
il id. id. id. id. 0,23 0059
12 id. id. id. id. 05 32..0,.1024
»B id. id. id id. 3,01 13,.0321
14 id. id. id id. 0,5 0722
16 id. id. id id. 0,94 | 0,8836
16 id. id. id. id. 2.0 4, 0401
17 id. id. id. id. F.20: 1.4400
18 id. id. > id. id. 3,80 10, 8900
19 | id. id. id. id. 0,27 | 0,0729
20 id. id. id. id. 0,48 | 0,2304
21 id. id. id. id en! 1, 2321
22 id. id. id. id. 0,553. 0.1225
23 id. id. id. id 1:20, 1.6900
24 id. id. id. id 23, 993901
25 id. id.: id. id 0,10 0, 0100
26 id. id. id. id. 0,90) 0,8100
27 id. id. id. id. 0,89 0,7921

u aaa andere rennen

nern nnd haha a, Aa

PRRENN!
