 

 

 

 

 

 

 

 

 

 

 

 

 

 

 

 

 

 

 

 

 

260
© Auteurs des instruments Lecture Norakee. nn ombremee) mneurs de
= 6 2 des 0 0 clöture de
° employees secondes en. |executees pour = =
= ne =. | verniers chaque triangle| A? Remarques
: et diametre du cercle du vernieı des chaque angle R |
A horizontal So mMicroscopes SU DaUr aque |
microscope direction a
5 Directions ne
41 Starke de 27 cm. 2 2M. 30 30 30 0,864 | 0,7465
42 id. id. id. 30 30 30 E 3,981 115,8484,
43 id. id. id. 30,30,30 227155 4,6440)
Ak id, id. id. 30 30.30 71,024 1,0424
45 id. id. id. 30 30 30 2,333 | 5,4429)
46 id. id. id. 30 30 30 0,259 | 0,0674
47 id. id. id. 30 30 30 3,083 | 9,5049
48 id. id. id. 30 30 30 1,897 | 3,5986
49 id. id. id. 30 30 30 0,935 | 0,8742]
Se |
so eh een, la | 2m | 3603| 1,349 | 4,8198
51 Brunner de 42 cem.-Starkede27cm, 2”—2” |4M.—2M.| id. 0,009 | | 0,0004
592 id. ed id. | | 2,780 | 7,7284
53 Salmoiraghi de 40 cm. id. | A’—id 2M. id. | 0,764 | 0,5837,
54 jSalmoiraghi de 40 em. id. | id. id. id. 2,471 6,1058
2 \Brunner de 42 cm. 2 4M. id.
55 Salmoiraghi de 40 cın. id. 9, > M. id. 29392 | 95919
56 en de 40 em. id. | id. id. id. 1,613 2,6018
5 Brunner de 42 cm. | 2 AN. id. |
on Salmoiraghi de 40 em. il. 41"— IN. id. 1,246 | 1,5525,
58 id. id. id. id. ER) 3,6100)
59 (Salmoiraghi de 40 cm. id. id. id. id. | 3,244 |10,5235
a | Brunner de 42 cm. 2 AM. id.
en > man ia 11,493 | 2,9290
XVM.
Reseau de Sardaigne et developpement de la base d’Ozieri.
Directions ” | |
4 | Repsold de 27 cm. - Starke de 27 cm.-\|2° 2" 41”) ’M.2M 2M.| 36 32 30 | 2,7029 | 7,3062
Troughton and Simms de 27 cm. | Ki |
2 | Repsold de 27 cm.- Troughton and | id. id. | id. id. ı 80.32 30 3,9340 | 8,6084|
Simms de 25 cm. |
3 | Starke de 27 cm. - Troughton and id. id. ob ds | 82 8 80 | en | 1,5826)
Simms de 27 et 25 cm. | |
4 id. id. id. id | 92 32,362 1,9485 | 3,7963)
5 | Repsold de 27 cm. - Troughton and | id. id |id. id 36 32,90, 119,1585 | 4,6591
Simms de 27 et 25 cm.
6 | Repsold de 27 cm.-Starkede 27cm. |id. id. id. |id. id. id. | 30 32 36 3,2116 10,3169
Troughton and Simmsde 27 et 25cm |
7 | Starke de 27 cm. - Tronghton and id. id Id ir, 20397967 1159879) 3,9513
Simms de 27 et 25 cm. | |
8 | Starke de 27 cm. id. id. 30 28 30 | 3,8631 |14,9228|
9 , Repsold de 27 cm. - Starke de 27 em. |id. id. [id. id. 30 40 30 2,8211 | 7,9580
10 id. ide 1d. iorsid. 30 42 32 0,9149 | 0,8370
11 id. id. cd. id. id. 30 35 32 | 2,9048 8,4390)
12 id. id. id. id. id. 30 35 30 0,6363 0,4049

 

UL ul

hl

N RI RTL ENEN

min

nn eabmdhh bb a la ha aa nn
