LRA Ae ere Ee een

TE nn

 

 

 

‘Qroyruosue) woJsÂS-P/ TFOWEPSI0oT "uBuoryeIg 6

      

 

 

 

O8G+ | 686 + |FOG  |£er aire en a ee) u PoE Ol zi Bext | ANA) BURY i

996+ | 696 + | | €9F ce oor Hac : ‘or: GIGI a) | er |9:G6 97 19706 | BABJOIO op oWond :

os¢+ | ot + ser 626 | occ-626, — |s91°626| “ | : | 609 | (8e) | ooge | se or —| 9188 oprEEnprequeyey epmouor

798+ | 698 + |ecr | eu 0 182 | 5 | gg |eale leo ot —k'r or | ‘889 ‘ANON SHOT "IS À

AS EI 198" "816/927 826 0 ae cer lorpyenbnog ar 816 | (8*e) 91 ga LI —8*0r 51 | Woy “wyVd | VCAMEISOM

| Keen | | |

eo ae 196 | 8c6 0 196 sssT | "en gonbnog 126 | Eco e mi Pree" oe à

0 | 96086996 086) 0 1296086 [es/1s81! | 686° 086 | gro 27 06 6 | 16.08 87 | ‘ASAO SEX) Yoroıyueı]
| 96 + | 29T — 08c-816 sis sıs| — |919°816| Z88t | À | 866: LL6 | “a | 9818 [eI 86 — Pe B+) HOT OPIOT) DIA]

vo —|79 —|ees-ts6lees-1e6) — |ees-1e6| rust l'orrpaonbnog/sez-re6| @°6 | (23) | .6 .6ot |L:¢¢.09—| Teqdumy eT) weezo HIS

 

 

-ulopuoduepunyag UOIAUIIPAUT JIM U9SUNSSON ‘V
[ART [31

‘uayeaedderopusg uodenau JU Us}Ieqdy °*g oddnayg

*, OS WO 100'O Fe :uUoNNnpoameIsÄg ap Moqisyaısun 919} "woIsAg-Ö aomepsI0og 'uauoryels yI

 

 

 

 

 

 

 

 

 

 

 

 

 

 

 

 

6 31 Ice | Ore 0 |886 alLıst| en Fes | WG CG U u: sn ‘AI9SQO ‘SRE | .
86 +| 8% -+ Orr 086 | FLF' 088) = ZEST Aoaodnq \817°086 | (7-3) | g | 9¢ ¢ EL 8 | uopmoL | YOWAIYUBILT
6054 | 6084 89 | FeO | — ro : a | es 6 | @-a) | 3 | Ty 991 1'29 08 | euyeyey “ne :
gest 9ea+ ore ore | — 19 GISI : | gra | (BB) | @ Mdr LE) Sue au) | aeO ene
G+ | ev = 080 eo | 0 Lo gist | Pupkaı |10O | @ a | 9g oer or 0 7] yeauy Josup  20SPNS
681+ | 88T + [85T “ote = BLIG GEST | 2 GTS | Bela ar ec 2] UOISU99SY | UB9ZO ‘JUELV
ece+ | Bee + loro  |r68 = 0 Fest | emedng (¢68 | (sa) | ¢ | 86 LG | : | .
6st | 196 + [erg | 006 == ‚206 SIST 2 168 | (Gi) où | sete 6 aouel] OP SS] | UveZO 'PUI
ee 816 |TO8°816 — ‚708°816 |05 'SIST, N Ras a | at er orousf op org | BYMouTEpns
G6 + 68 + 189°616 | a — |964°616| 6181 | youoderg | 912616 (8:c) | 68 | JSTo TST | pers ‘Koup4g | uorensny
| | | | | | |
04—06 | of _ 96 on | 0 6 | °6 yee | 19498409 es ojqoi | aqoy | adug] | oyoag | uoneIg | puey
| | | | | | | | | | |
| | | | Il |

 

887 'S LILA 90

 
