rf | LAS Ses mr

 

 

 

 

 

 

 

 

 

 

 

 

 

 

TR Rn ge TTT i 71 u ı i a RT m nl Qi
zz 8. << ma 2 800 <<
VO = = ne 006. €
== OL) ae SON CGT. <
6 € 0G) oN xX ge, eoer ıpıag +
G — 1G — , woyskg TOUsIAA JNv UOl]yNpey oJtoyRussuy
| (uorers | -
| 666 186 | 2S | VY 87!666 68 -zua1ejoy) WEPSIOT puvlyospned x6
Go Lu: ach « « 980 | c60 (GG) | — | F886] 099] 11S 06 | OV neo idee ia « 8
OY + 164 + | 70'886 « x YO S86 | 790 Co) == £00'886 | S6F | £ Lr0G | 008 84 ueppf{n SOUTIXBAIO NT < ja
95 a 10) =} S86 < < SEOIGSO. | 710 (eo) a 606 OVS | O06) SI | 6 0E peo] SOIEUM x 9
OL = | GG + | 886 € < OLOE86 | 8G0 £86 (GG) aed LV6 1867 | 8 86 0G | 7 06 LL JULOgG SO[BYUM aS G
6 0 — | 996°686 G x 696686 | 796 686 (ic) = 696786 | S GLGSI | 7 9C OL PUuSULO FT uo5410qz71d$ VY
| AJIEMUL9IS |
Cae + 1,806 « « 786 | 076 10% 0 | 816 bE | G6) cor lap sofey « « +6
LG eG a | GVO « « 666 | 666 L0G 0 916 YL | L608} 697 WNLOPVLOGVT] ‘BMOY[O puvyssny #0
| 9JIEMUIIIS
1000 — | 900 0 — | SLS'ISG | TO6T Tysuey GLS 186 LL8 186 CG 0 | Cy |GE 8b! 9'0Z 6S | Top æeI(9Y "woyN90IS U9P9MUIS xb
1 oO / © |
"MOINS SYICAMUIIISANEF-IUO0IN uoyaıjıasteyp op usdunssom “by
mo m9 wo = wo | wo S| = Wd bg u | |
= | a ee ® = |
= Î Dt G2 Do:
| > 06 = | 198080000 +5 [SE la LÀ S| 8) 25 |
(en) °4| a | t oe | a. ae | Soe |. ee bs
005210, 05 © 1914984094 |SUTELIOT, SOP | Tonvues I9po an | ge | aa xr Ss © ayeıag "UolreIS J9P OUEN GNv'I | "oN
2 HOM - uorgyeiy | eo. Sa 2 © |
“109U, J, = snuru 95 | Gr = + pa ee fe = 5 S| Soe |
| = | HG © | 2 ® eo 3 | |

 

 

|

    

 

 
