 

eu = —— ethene D MO TP EDT EE = SE Eten f Eminne amet minette

re SET TROTTER eT ON = m mem mn m —

 

 

 

 

 

 

 

 

 

 

 

 

 

 

 

 

“mayskG aust Ay |
69 +|69 + | ec'o86 | 5681 “ 889086 | 69086 | “ | 0 189°086 || & ae | eros ee he OTe ne ses) ae i |
re Ne | HPS 086 «| F681 5 66F° 086 | 667086 | “ 0 86r 086 || 7 DAL Tagan REA EN m |
eg + |es + | ops‘ose | s6st x 69086 | 269086 | “ 0 69086 || L RAP L PR a es I eae soci 29
Brin | 8h 07 | 064086 | 8681 = 619086 | 729086 | “ 0 149086 || 6 Ph OT OP Lt Von ANDO BISON A Le ce en
8) == 09 = |: 20086 | Host i | 197086 | F9F 086 | “ 0 LGP086 || 9% Bebe SR ys a ae god ee 7
68 + | 6% + | 882086 | 8681 4 198086 | 192086 | “ Er 1 62000 | Ol PAGE | 0OTEEN 2 N ee .
IE Sur Se 19 066.|-6081 = 799086 | 792086 | “ 0 692086 || & ELSE IE A A CAR Aer rs Te, Ne 2
Po oye> 16... = | 619086. | VEST x 187°086 | T8P086 | “ 0 O8F‘086 || & Dez. Im. Seren eee IT ia
OG a) Se |010 086 Ef = L0S‘086 | 089‘086 | “ 0 “omas. 1982 Oel gem. Team mu =
04 + |0L + | 002086 | 8681 = 029086 | 042086 | * 0 695086 || F BOEST EDGE hee coe LS À. -nonemsr |
10-08: tr) 009086 | 6681 = ose‘os6 | 189‘086 | “ 0 SiO NSE Erbe 10 Mag? Ur Er SR PERS ES ee
9 T|LE + | 6086 | 668 5 189086 | 092086 | “ | 0 Glv086.|| DEAN LIT OT OTaBE en ee
D El x). 207086 | OS 5 98P‘086 | L8F086 | “ 0 came ar Teer Ren neo) APE ee
dr | 14 He | 688086 | 8687 . 079086 | 072086 | “ | 0 099°086 || T QSL OO | OA ee =
Ba pas + | 09'036 | E68T 7 | -989°086 | 989/086 | “ 0 982086 || I CDD OP eee ee meer =
0A. #109 + | 225086 | £68T : | L8g'086 | 255‘086 | “ | 0 gornes | Bet (mor. LOver | ip Ne ne
LL, + | 9h + | 817/086 | 8681 2 i.grasgaes]; era'oas KURS La ierotoge | Ol meet elew |. 227. en
Ger et | 38 + | 027086 | F681 * 609086 | gos‘os6 | “ 0 66P086 || &T BOSS | GDS DR CAN SUN ie 8

Be ge PS 6897086) Sr à |_LFS'086 | 172086 | “ 0 LPS‘086 || T Saar Lo Man ee no A ee LY
I +16 — | e9F 086 | F68T = FcF‘086 | FOFO8G | “ 0 98h086 || 26 Ged | Olea soe ae Aa ee gee ae) a |
ol + |Sr + | 197086 | g6st E PLY086 | SLr0s6 | “ I+ | 827086 ||°I GC Of LOS SR 1 oe et ns RE ae cP
oy + | OL + | 997086 | 7681 x | 99P086 | 88F086 | “ Lite |. .680:086 |), CEG: POC t COC CP | nen ee De Haas si
BE Ge ++ 10477 086 |:S687 = SLP‘086 | SLr0s6 | “ 0 8,9086 | I RACE AGIR Rene nes SE PRE
OF + 8 | \epr'086 | F68T 195086 | ssP0s6 | “ 0 Re 086.1 as ee Tuer ern nen) 7 nn 6
oe + | fe + | 287/086 | FEST S | 717086 | 119086 | ‘ 0 97086 || 68 | 0‘8FeT | 9OT er | : ©: * : * © * : oBıomg soma A Se SEHE I?
Th +18 + | 187086 | S68T 5 g0e‘0s6 | 202086 | “ It | 308086 || I Door MORE eh Cou We ta eee ama ie et OF

opi LL + | 8h + | ver0s6 | F68I E | 809086 | TOS‘086 | “ Carter 206086 1 OB Suit Een een mb | 1: 2 OBS
. 88 +1g + | 127086 | 8681 5 | 609‘086 | 802086 | “ @+ | 09086 | L PMOL | OS OR | pe DA er eee
¢6 +16 + | 81F086 | F68I 5 | 619086 | 818086 | 0 DIS Ose OT IB apart | ae NS cae oe ere OUR BS Lh eee Le
96 + |26 + | 1086 | 8681 à 602086 | 204086 | “ 6 209086 || 1 COT VIG Oh To er ueryemped | 98
8 ber) 82-6 | "TIROS6-| Past À 617086 | 617086 | “ 0 817086 | 8 g'eaer | 690 8r | : : * :  oJuouT, [op oyepowg 'S \ ce
98, 101. + | 607086 | F6RL . £TF 086 | 887086 | “ 1 | racto86. | eo | a'Pecrt.#19-Gp oS a AC" ON0pTA ,199EN ve
6 +|88 + | g6s‘086 | PEST x 187086 | Ssr0s6 | “ 0 COR 086 1 Coon PAW Or, | Gr Pe ec Me 88
Sel + | PLT + | 168086 | PERT x sog‘os6s | FIS‘086 | “ OS ORSON er BCG aT | Serer hoe ot Seen FE ROTE] “GS
hee Een S88 086 | PEST © 688086 | 907086 | “ 2 6] 1081086908 | OLE | abe ee Le
IEE = l'68E + | 198086 | PEST 5 067 086 | L6r‘086 | “ 0 pLr086 || GL | AGLOL | geegr |: °°!!!) 7 "eos | 0&
0700 + | 500‘0 + | 896086 | V68T | “IML “4 PH | G96‘086 | 898086 | (a'a)| 0 1661066 Ra. Omen ale ee i a Reese | 66
un wo u wo wo b—6 wo w HA .
°4 4 o | 6 H 5
> = S = 2 S
5 = 8 | ms 5 X ® =
> a net x © Ooi a S
3 19}498q09cf 2.5 > + 5 > | ® 5 opeig uOIJ8]G 19P OUEN ANYT E
OA—$ io. 5 u no 2 | 2 . ; à 5
: 8 ce =| ere 28 3 © 8 .

= a ll St | # eo | EX S

Sg 2 SB WJ a 5 S: 8

a = o ‘a I a a | $ 4

: § ® aS 5 = : S

° 2 $ BD

 

 

 

 

 

 

 

 
