206

II. — Tableau récapitulatif des écarts de fermeture des mailles de 2©™e ordre
envisagées dans la compensation générale du réseau
de base (ler et 2©™e ordres).

 

i

TH 1 74

RI EE

 

 

 

 

 

 

 

 

 

 

 

 

 

 

 

 

 

Sil yeaa i ee ee) © ne
Lettres indicatrices 5 Has aot à 2 So Lettres indicatrices © Donate es.
Fe n R iS Ss 225 rm, A 4 x ag son
Be 5 28 meture apres | 2 ¢ 2 AE = x 28 meture apres | 2 5 2 ER:
Ze a 3 Sn ‘correction À à ane ie. 3 2.3 gia | correction 5,8 En
Bo 28 = ° A orthométrique 2 a = $ 2 ||»85$ a 3 a 5 | orthométrique 8 pee | 8 Ss
ES À À ©: es jenes |ess| Ag 28a |——|8# | 358
Ao ee © TD DS © | Mar ES Ks BS ©
ee ee ee aes ee) ee) er
| km mm. | mm. | mm km mm. | mm. | mm

a+f 272 127 30 4,24 a 219 32 33 0,97

c joe 255 5 28 2,68 b 147 6 29 0,21

c 208 60 22 2,12 Jig (ie 148 56 20 2,80

d+e 263 54 28 1,93 d 182 15 25 0,60

a 232 34 27 1,26 e+f+g ‚300 33 32 1,03

(> 167 8 15 0,53 a 217 22 18 1,22

o je 240 8 40 | 872 K {b+d 262 | 61 Blé LOT

5 À d 183 6 31 0,19 c 217 27 28 0,97

e 171 71 28 2,53 a 261 9 28 0,32

Vs 048 | 18 98 | 0,65 eb 299 33 | 0,00

a+b+h 400 75 40 1,88 c+d | 842 19 35 0,55

D {ec 142 22 18 1,22 e 230 5 21 0,24

dte+tftg| 405 9 28 0,32 ate 332 34 35 0,97

a 284 12 30 0,40 b+c+f+g| 328 115 45 2,57

b 181 63 23 2,13 I et 186 38 21 1,81

D’ (c+f+g 448 107 39 2,75 h 185 20 40 0,50

d+e 389 27 42 0,64 i 200 27 25 1,08

h 155 16 30 0,54 a 285 20 Ir 1,18

E | e 330 85 32 2,65 [i 297 21 27 0,78

f 237 22 27 0,82 c 173 11 19 0,58

a+c+e 495 51 40 1,28 JA 312 Ra 32 2,40

Elch 232 36 34 1,06 e 279 71 22 3,23

< d+f 370 12 36 0,33 É 318 25 30 0,83

a 183 66 21 3,14 | g 211 35 18 1,94

gq Jb 213 | 20 26 0,77 Ih 203 10 | 20 | 0,50

c 224 42 22 Won e 131 3 11 0,27

d 188 90 , 24 8,75 ( 190 33 20 1,65

a 162 13 11 1,18 h 176 103 23 4,48

@ | b+e 321 109 27 4,03 N 155 3 26 0,12

e+d 335 58 35 1,65 j 286 37 31 1,20

ate 348 14 29 0,48 | k 169 99 22 4,50

b 214 91 23 3,95 1 207 49 23 2,13

He ec 142 37 22 1,68 o Je 131 5 23 0,22

d 157 56 21 2,67 1 187 44 27 1,63

f 235 1 18 0,05 a 76 21 10 2,10

a 249 58 38 1,39 Pe) 86 17 14 1,22

H jb 233 | 109 39 2,80 c 59 56 12 4,68

e+d+te+f| 4A Ly 30 0,57 a 320 8 33 0,24

Le 226 7 34 0,21 b 274 10 30 0,33

1 4h 260 52 32 1,63 P (e+d-+g 532 69 52 1,32

6 485 8 40 0,20 e 292 6 42 0,14

ate+j 432 1) 85 0,03 f 284 21 | 99-006

In 212 6 29 0,21 a 244 23 19 1,21

e+ftg+th| 415 55 31 1,78 Q.ıb 251 49 19 2,57

d 174 6 Ly. 3,30 € 267 4 42 0,10

 

 

 

 

 

 

ne

 

débuter bt

SA cat hahah bi, Mal emi ll ra à
Sar

 
