 

sree freer rear 2 NT 1186 en

 

 

 

 

( { 1 Le Cpe Ce ha alee | Shed | Kol
We de Lead onu Ame 0 opt) 067
| | CLEA DOC ae a | oo | GR
07 ne eu COOL 0 LOG Wen Col eee oe) BEB | Bah
ma AREA oe CG le nn | ORY
"pardn9909.1 7067 Jo SUoT} Lo OG 16| rr) 6G lo =e Se 2s’ | sERPpas | Be
-BqS OLB QBT PUL BP “oN | , ee es | eer
| | | (o OG 16 GG PRONE. | 087
(9 C6 SiGe ee 2. ee car
| Ferse ar 00 ere) a}
ec... 22 mon | ee),
OG SO IGG Oba 5 ed co
(S90, 86 | Gee OG 22.2, 2 wopuen | el
| ee 2 2 oi | O8}
‘suotgisod re 66 L6 | SE 07 66 |‘ © ‘ : : ‘eseg Je UNBeg | GLI
HO u SB 66 £ 86 | IT 6865 | ° ‘ : : eseg 10 umseg | BLT
DS oo ae, za, Eh)
Yove 107 7681 107 G4 6 86 | &S GF 65 | 'S’9 'S’n 'TITHUOISSIM 10 uorssim | 9LT
todayy Aoaing sep} aosıng "HM 7G 6G 16 | ie + 0 7 ee | GL
‘GOGT 107 J1odoyy Avaang)-099 pur 3S809 944 pue VOC) OF. Ge C6) IR Co nes ee 09 Zul
o1jepoey pure ysvogeyjjog)jo 8 xrpueddy. Âq}uosnStox "M 'O| —6061 | 98 8 86 | 7G 9 66 | © © © * © © * * Sn | SLI
xipuoddy ut poystrqna | £rmy poqrtosop ‘OT | LE Se oe - Jesonty | SLL
| pue CYT ‘soN SV od hy Bes Io ge mE u 5: audio) | LP
2 owes oy} Jo 'spuoo GG 86: 96m 0Gle. 3.25. _  Temeanon | LL
-98 0} SuIpvet sedoo OG Moree TOS ee ee ee 269 69,
-SOIDTUE 9} UYIM Le OS 6 SES es Ve" © uote | BOL
So}TTOPOY} “UID Og GS Re | ee ru roy
eer 66) fe 96 0G 000: MOUS | O01
LPS LG 6S 0808 ee SINR, | GOD
OG 7l 86.9 Gre Fo rn ead | or
LE 86. OS SU Ne ce OO  bJvzzng | Cor
| [eo eee ee _ rorıqen | COT
| | | oe ES eee m
sonbaetuoy |  saeum.usuf u aubod | opnyrsuog | opnyıyeT syurod sap UOIJU2IpUT “N

 

 

VHIAANV NOA NALV VIS ALOINIAUAA

 

ES in een sun nisse ns a a us nun nn
= EEE EEE en a Ge

 

en nd nn a Som

 
