   

Ta mn! T THT ii

 
 

  

 

 

 

 

 

 

 

 

it ART FT er) einen = 7 2 Henn ; Ha ee ge
TONVIBVAPEST UTM GES LPUET Sein] | | ..Q
-uOEIT 1op Sunmuysog|-suy uoyostydeisoox-IezITI PA | | “09 SGT eme n aeg "A ATTY) | | sjny1Isuf "10099
INZ OYloissunjyorqoog jy ny sop uoedunpragggim | & | —‘AON 268 IT| “ue Mo LOEWE | BHJUN Soou19)S "A | F000 20:07 ST SP l'IIN S9P 9MUAMUI9)S "usrTAA SOIT
IOIOUTEY ‘N SAIS ‘A ‘ATUN | |
| noope] nogeuom (& | | | 5
« | | : 14090 8061|’ zn (a az m oltsuv|  gosgeg umemdg | | Jropxesery LOT
| | |TOLOUMV YY N OYAVIG “A “ATTY |
2 . : 1129090 g0sı la zn C2 WO CG SV) Ssaeıım wneud neyyuoses 901
| | | | |
| | | |TOTOUULEN ‘n 9H18)S ‘A ALU] |
| | | 330978 T,-MOQOTIOFT (@ | |
‘ À 5 1400 8061 ZW (& 'C'ZW'O (L suv seipuy uud | | Asoy ASUEN COT
| |
| | |
| OOM YN oyIejg “A “ATUL | |
| | HOTEL | |
« « cs | Lun£ Z68T MOQOIOF (8 ‘ŒZN Oo (T say ce 600 | C666 & SF BdewSs Zol
ee
| |
| | (OTOWWEN 'n oyıeıg "A "Alu |
5 5 | TRE Cos | OZ G4 WO say : POO | Seti Ot er 19S0HSUUEUMOEL EOT
| | | IOIOMMVY “N OY.Ie}G “A “ATU,
| | oe] |
“ = = | ung 8681 |-Moqoloy (¢ “CZ WO (L sn y 5 170 IV LP OS 97 I950HU9pPUxISU0OET [QI
| |
ce « fe | mp og | = | = &0'0 6698 66 87 Saaquor A (OT
| | :
: - : | ME 1687 | | 2 L0°0 SOE Giz Sip TANISS PET 66
| | ce |
| | |
« G € | TDL L681 | S | a $10 TSS LY SF seule 86
| | |
: a | une test : | : 90°0 816 29 87 Saaquop£u 16
yong | |LOIOUUEM ‘N 2NIU)Q "A "Alu
yost1ostAoLd Yeynsay yısroıpqnd Yyoru Toon -Iqgep JOuiog | une [681 l'Œ'ZNG az mo (LT sav| yooursyg "A yupsiegQo | 800 + 86 9L OL 67 SIOFT G6
| | |
| | | | | |
ee | | | | | |
sanbıemay uoryeoipggnd ef op ayyı], | sep a | oon | only | SIn9JUAI9SC) ae opnymer | SNOILVLS
‘ | SUOLISOT | jo oouuy | JUOUTNIJSUL 49 Epomam | INOLIG, :

 

 

 

 

 

 

 

: Hd OLILY

 
 
