 

Em

dut RT

RSA VIN RU gi

mir AURA

  

485

Reiskirehen Ruppertenrod

Giessen

 

Friedberg pe) Ranstadt

Indem wir jetzt zur Ausgleichung übergehen, so zeigt die Figur, dass hier 14 Be-
dingungsgleichungen bestehen, welche die gleiche Anzahl von Widersprüchen zur Folge ha-
ben. Für die letzteren erhält man folgende Werthe (Millimeter) :

Ww, == by — by —h, —h, 299998 = 4,39
W, = hy — h, + he)
We == h, — b, + hs = —16,35

Wi = h, + ae + b, — ip — an, — 994

Ws = hyp — hy. + hyz— hy, — his + hy, = —3,63

We = hy + hy; —hy, + hy, — hig — byy — hoy = 8,66
W,; =h, + hoy—h,, = 3,80

Wg = hy + ho, + bog — 187,46216 — 4,09

Wo = hys— ho, + ho, = 11,17

Wo by, —h,, +h, 4 hy. + Dog + ho, — hog = 34,36
Wu his bo then, he hs, — 98,56693 — 15,50
Wia= Nog = Ngo + hy, = 5,99

Wis= ho; — hg, + hy, — hg, =— 4,33

Wa bgp — hy, + higg — hy, — 144,29738 — = 25,28

  
      

 
