 

PNT TATE TT IRA OWL IVEY PF 111 Am

PM CRT LAM UTIL] 4

 

 

 

 

 

 

Sv. BATIO( 5 : = | | 2
I, on CS En | 88 ce LG | 86 ge er |‘: : ' wuoßtog eos] | 87%
pr opyaodort ‘Sur Tyoleq « 7681 | hl De ee r
“pl rurqoowy, “doy, Mole UT C0 | Earl aan, CARYN | GHG
pr [onpavnx) “SU “pl L88b | Vk 10 6B | LG 6b 87 |: ‘ ‘©: ououeusiA or | Fc
“pl asoavg ‘dey Er LSST S007 GG | O7 Scr) > PS IV | O7G
sturp |
“pl -IBleg eq € STUBJOYS 9( "ID 9887 Of SG VE 1S Weer ee ONE odeg | 68%
In Tuosng « ted N ay cn 0: | 10% |: 1aomuop o1sSog | SES
pl ouroqaey ‘Buy raue] jog || 60881 c0 07 85 | 85 LO &Y | MHOTJUOI 01 8
sup | |
“pl |-awtag aq “Sut | sturyeig eq 109 | 9887 OL EC 0€ C0 ae 2, ouluusdg JIN. | bce
exıon ‘doy, | Monpaenn ‘uf Zoey | ; ince Jude à
pi een mort | sugersegion | egey {| 17 86 LE | LE GO 67 ((or1e3S) oy IN) Breaded eT] a
2 | poupareng “Bul Pl | G68 NUE Ge cence; Etes Pr
Am | ouorseg “deo “pl oo vos ar, = = eg BINA pres
‘Is OWL,
| “pl | "pl zur C68) So 6) 86 | 69.16 Gy | (OUI UOT” EP PSE P7EG
à | Wonpıengy « ‘SONO SUMET,
PF 190 “Buy De « cost | 68 or 86 | LG Le Gr | : : : 'ourqworg op eseg |a7EZ
“pl | rar ‘dep | Wonpueng « 2067
| tuosug « 14249( ai no) GY 60 86 | OF LG GY | °° °° ‘Offeouossey ord | H&G
pl | wonprens ‘Sur {| stuure3S 8109 | *
pr | tugooeg, do], ‘pl ees; | yi WG | cu 9 ey | cee
"pl Iuosn4 “GUT IY942( CUT C68) 80 FE 80 | 00 65.6% |) = MiSs BW Eee
‘pl | turyooey, “doy, Pe 0687 16.95.08 116 650% 2.2 3) O1OMOK N VEG
‘PI ponpaen) ‘Su | SIUUJ9FS eq 109 LS88T GG. GS 66 | G0 67 Gy | °° eload AN | 06G
m | je ul 1681 O0 6608 10 6% cr | 909797 ua 3%
‘pl “pl ag L68t 80 66 6G | 97 GE GY |  [UIUAUIS EjBp 92010 | LOG
"pl | UZ0[9 ae Tyoteq@ « 1681 GG 1G 66 | 96 VG GY | 0 ougumg 'W | 76%
‘DI TAIT ‘489 LDONpPARNT « 206 an : >
| wo ıg = oyıeıg | ‘WAeuly “Sul Tyo1eq = « 1681 00 08 8 | Ir 86 &% OLIVJUISIV “WW | CGS
; = Lop “GOT, | a | ;
u ee 95 86 13 7105.55 |: : ° * * oysuooquog oil | OZ
‘PI | won dep | OO [09 E881
"pl | ie Su] u 9881 8S 60 06 | GY VL GY | °° °° * 87810 'M | 816
= STULP |
‘WD LZ Op oIVIg | -dwtog oq] “SUT | stUBJe}g eq “[09 o88r | 7) 66.66 | 08 70 By | °° **  ousuy SW | er

 

 

‘OUIqMIOIg ep esvq BI ep quomeddoeasp yo oyorem “erıgtun *(epeuorpriom odd) ouvosoy, 8] ep neasoy

AIR

 

 

 

| |

syuotun.gsuf | S.INOBAIOSO | SINOPIOAL(T anboday ee apnyıyeT syurod sep uoljvorpuy | oN

| |

sonbaewey]

 

 

 

 
