 

AN

VO

Br
ie

Il EEO

WIEN

RETRO

 

PORT TARN PART PME ALE VOTO A
ROIS SAP I ER

EN SN SE TAN IRL Te ETRE. TLE FEES GOTT TE EY SRT OL TE TT
een : éd — ne

EE nT NN ONNNN ETETTNPNTENTNNNRR

INDICATION

 

VI.— France et Algérie.

ae ÉPOQUE.

Se OÙ oe

DIRECTEURS

 

 

 

 

 

No LATITUDE. INSTRUMENTS, REMARQUES.
DES POINTS. ET OBSERVATEURS.
Triangulation de la Méridienne de Biskra. (Non encore publiée.)
Tchouelt .......... 36% ZLHAA 940 ART AP ioe |
Rochbet-Djemel....) 35 57 21.23.4930 323% |
@iretman 2.2... 99 D2 34) 24 1 2: © ea |
| Tougour........... 35 33 58 | 23 42 97 à nr À |
OU TIL 35 86 51 | 24 6 16 ie 2 BH |
Mähmmel.......... 35.20 30 | 23.57 27-|| os 44s |
Re 35 11 32 | 23 36 48 | a ae ==. |
Amar Kaddou...... 34 57 46 | 23 46 56 Q Bs aaa
Bourzel ........... 4541333 Ei soo
| Tahir Rassou...... 94 38.48 72922 5 =% Soc
Cheng... 34 26 19-225 38 07 = 2e ©
Bea. 2... 34 51 32 | 23 23 25 À Bo
Pilier géodésique Sac
Triangulation Primordiale entre Bone et Tunis. (Non publiée.)
Konarn 3 90 22097-25914 97
Bou Abed......... 3627.01 25.4149
Santon 2... 3654 u | 2525.39 5
Koursi ........: 3653 19: 2553 5 3
Phare du Lion 30,04 31 125 26 22 4 a |
R’hourra.......... 36 35.50. 20.245 FA =
Bit 22.2. .,; 3626 1426 23 57 ae ea
Bou Rebbah....... 36 24 43 | 2618 6 se BA ©
Mia... 36 2357 25 4391. © 8 =
El Ma 2. 86 22 44 | 96 4 3 + oF =
Saguaguid......... 36 27 21 | 26 45 32 & Ê =
Djeguega.......... 3649 7 | 26 55 42 a 2% S
ne 265 | 36 25 50 | 27 13 55 ae S
| Ensarinn .......... 3649 99759 39 on 2
Zaghouan.......... 20 27.10 272639 2 =
Bou Said.......... 36 52 24 | 98 0 51 ©
Bou Rukbah....... 20 2b ole | 20 Lr 4D
Carthage.......... 20 0116/27/59 18;
Jonction Hispano-Algérienne.
M.>Sabiha. . 35° 39/ 37/| 16°48' 49] | C.t Perrier. die Tome XII.
sen ee 32 0:55: 15.58.20. = Cap. Bassot. a 2
ulhacen. ......... 3 r= ee 3 a
me: Poets |teikat| | Sato Bague F
Il

 

 

 

 

 

 

 

 

 

 

 

 

 

|

 

 

 

 

 

  

  
