 

 

 

TEE TEE

 

 

 

® Zee — wojstg IOU9IA Jne WONYNpoy SYıayeussuy
“ost “eyouseN ‘ssuliog || 868°186
881 —+|IST + 1690086 | 0061 "eur 008086 | 208086 | 3s — _|S881‘086 || 09
68 tie —<+|ser8626 | 6681 = 006646 | 206646 ® — |68°6L6 || 98
83 +108 +691 626 | seer ¢ 618°6L6 | T8 626 ® — | 918°6L6 || ST
870°0 + |850°0 + | 1IL‘626 | 6687 | ‘tuwO ‘olurgos ‘exouSen || 601 616 | 682646 | à — | 14646 || Sg
“Uopleqry SJONON "2IIIAX
BG =a Ro — wWostg IOU9TA| JnB UONYnpey oyepRuesuy
06 +les +| ter‘ose | rest Fereunz n eavsrfng oyepemeuur|| etc ‘086 | 91c‘086 o | ors‘ose || te
Bu 76.1 6h + | 691/616 5 = 158‘6L6 | F8 626 | — | — | 98'616 || 4
868 HILL +1 982646 | 08ST "Iteyquopuomy 9 'L e18‘646 |080°086 | 1S | wp dion | 98816 || 2618
Vel +/Ssl + |cer6L6 | Set | ‘oyepexeuex ‘n rexes ||g74‘%616 | 652 616 | — BA
168 +)168 + 1910 616 | PSL | ‘orepexeueg, n teurs | 607616 | 817646 | — — | 8476216 || &
LPT'O + | OFTO + | SI0‘6L6 | SSSI | 'eyepeyeue, 'n reyeg ELSE este, | (8's) | — |ret'626 || 9
: ‘U9JIOQIY 91970 ‘YIIIAX
ws u wo. | u un b—b wo u
of oO
E ee Le
R =? PEN ch 8,
8 a | = | | a oe i Es
= g | Bie eae 8. 2 8 =
= 1910198409 Senet + m Ss a
0405 40" D = = yoeqoog | 5 2 | bo = = $8 =
oo el. ee
8 5 | SE | S 3 5 >
5 oe 5 3 :
“| Des | ee :
|| |

 

yoımuaaıd 9808 oJueT

RL No PME TER NP EN en

88 68
888 98

9'GF 9e
9'T 98

CICR CS

 

or Vane ment Break &

‘[eusjapueg “4su] “pooy ‘mepsjog | " "purpyasznagq
tte eee ee es © storeys
-Ud}lolg “‘UOIJEUIOQUI “BMESUZIMA |
d'etre ee eher ee ee. eMezeuey] miss ete uoddiN |
„sup 'yısäyd yeysıoarun ‘omfoL |
rerrtesee see: oofy |
ae EEE ++ oxoddeg | ed ossop |
re NOTE Le . |
AUS : - euefouryospag | moda,
: ; ++ + emrgososey | * * * niqosnry |
piven Opel: 6 Recta Vip wuts et et “emo . -[osuf uruog
hear 0: epee Ae 7.0) Oly 050s.» whet te "eyeN | . (eMeurNO)

ujosuf nyosyuf |

uoreIg Ip ameN ANVY'T |

rR Hid © oN oO A

COTTON NY

 

 

 

‘raqyoeqoeg eyostueder

‘IITAX TOUL

 

 

 

 
