 

 

 

 

12

 

 

 

 

 

 

|
‘ éclinai | é ion
5 sn : Déclinaison 1875.0 Le 4 ie
Etoile. | droite ir N ee =.
5 one Vierteljahrs- Association Safford. | jar aura de call de
; & ? schrift. géodésique eo eee l’Assoc. | Viertel-
| | + ASS. B+ | géodés, | jabrsschr.
| 4e Lyrae a. pr. 4.518" Æ30° 32 25/11 (+ 39° 32° 25/66) |+39° 32’ 26! 10 —0”99
| se Lyrae med. |5.4 +39 28 58.57 +39 28 58.70 —0.13
8 Lyrae 433 ı3 7.30) +33 ı3 7.74 |Amer. Ephemer.|4-0"44
o Dracon. seq. 5-4 +59 14 9.32) +59 14 9.28 459 14 9.30|—0.04|—0.02| +0.
| ı3 R Lyrae 4 +43 46 55.92 +43 46 56.40 — 0.48
y Lyrae 314 432 31 9.42 +32 31 9.40 to.
% Aquilae 2.4 S25) 4 5.9721 — Bie ae 65 26,3") .09
Co +13 40 44.58] +13 40 45.09 | SI
| + Lyrae 19 +35 54 18.33) +35 54 19.00 ee. |
| 53 Draconis +56 38 48.00 +56 38 47.90 .10|
| $ Lyrae -H37 54 42.76 +37 54 42.50 0.
ÿ Draconis +67 26 29.12) +67. 26 29.78 .66 |
x Cygni +53 8 17.81| +53 8 18.60 [+53 8 18.20 .79 .40| —0.
ÿ Aquilae 2.82 IL ST 2521 1.68 13
ı! Cygni B52 935922211452 <3 57.90 .32)

— +27 41 .46| +27 41 54.04 | | .42 |
Ua +51 27 50.31) 451 27 51.04 |+51 27 50.70\-+-0.73/+0. 34) —O.
B. A. C. 6723 +50 58 8.43 |+50 58 9.20 77
S Cygni +49 55 56.52) +49 55 56.61 +49 55 56.20) +<o.0g|+o.4r| +0.3
LS mn 37.2 3.11.05 437 1:3% 11590) leas 2
y Aquilae ro 18 35.98} +10 18 36.39 .4I
à Cygni +44 49 35-10] +44 49 35.76 | +44 49 35.50/+o.66 26| —0
a Aquilae A 8 321-22, 59 832 22-61 | o4| |
Be. 0 545.7. 0.5.4579 \ .04| |
À Ursae min. +88 55 51.97| +88 55 51.52 | .45|
Ww Cygni +52 6 28.32) +52 6 27.84 [+52 6 28.30|—0.48/—0. 46) +0.02
ae +49 45 27.24 |+49 45 27.00 .24
B. A. C. 6928 20 +52 47 48.52 |+52 47 48.20] 32

| 31 oCygni +46 21 224 PAG PT 47. Or I+46 21 46.80 79| .21| —0O.
33 Cygni 5 +56 11 8.51) +56 11 8.30) | | +o.
32 5 | +47 19 51.88 |+47 19 52.10] 122)

D a 2 39 51 12] +39 51 26.98 |+39 51 27.30|—0.14| -32| — ©.
u | ede 3155.05 Iıt48 31 56:40 |—°-75)

eo — I +44 50 .96| 444 50 4.22 |+44 50 3-60) 26 67) 7°
Sn 5 +49 53 30.70 |+49 53 30.30) +40)

y Delphini seq. |3.4 +15 40 29.92] +15 40 30.08 |to.16 |

e Oygni 2 +33 30 10.79) +33 30 10.76 |+33 30 10.80 208 o4| —0
6 H. Cephei .4 457 7 .19 +57 7 55-10] | —1.
À Cygni 4 +36 1 55.17} +36 1 55.82 |+36 1 55.80 .65 02| —o
32 Vulpeculae .6| +27 34 58.74| +27 34 59.59 Jt-o. 85) |

v Cygni +40 4ı .09 Amer. Ephemer.| |
B. A. C. 7294 | +49 58 37-63 |+49 58 37-60) 03,

£ Cygni 21 u 14 +43 25 47-50) | —o.36
6x Cygni pr. +38 8 8.27) +38 8 7.94 |Amer. Ephemer.|—o. 33
B. 4.0. 7365 MES ,3,72.08 |-1-53 348 12,00] o8|
Gr. 3415 +59 28 58 +59 28 22.20 | | to
r Cygni +37 30 44.48 +37 30 45.00) | | —o.
a Cephei +62 3 £77 | 41-62-93 .22.60 83 |

g Cygni +45 59 23.28 +45 59 23-90) | 0.
ß Aquarii ewe 7 tense! = 6.7 .12.06 54

ß Cephei +70 0 76| +70 o 43.51 | 75
Radcl. 5279 +47 53 31.64 |447 53 32.20] 56!
74 Oygni 0 Gt 8255 +39 51 9.80) a
13 H. Cephei +56 55 26.69 +56 55 26.70) op,

 

 

 

 

 

 

 

 

 

 

 

 

 

 

 

 

ù À 1 #/di 1

vn TAN a Rede

 

Ian

u rk N

jh ad be a Hat nd al Al chy psi 4
