     
 

 

Ri 1 Ro “ e 2 ® ER ER TE A er ug = TEE
Ha ERAER BERN SEEN ET ae = a
BE AH En 2 \ Bes NEL BR ER NEREES 2 Sr N a x
a Rs RR U & = S BE
& ; ; t e x
i #
#
; E
:
#
g
5
d
3
> EL
3
U
. &
i

 

3

 

 

ES

 
