 

Verbindungs - Kette
der österreichischen und italienischen Dreiecke.

i s erneny

f

     
 

 

 

J
/ ¢
/ ' we |
Fagliarone USED Nu à
: \ ———

 

 

1: 12000"
oder 864000 der Natur .

Lith Anst y Leopold Kraatz in Berlin

 
