 

99T
ILL
10%

 

„.ias/uo

4 —0f |04 0. f|

 

6

6
ai
Gal
TFL
TFL
GPT
CFL

+ SPL

GET
LP
6&1

IGPT

FPT
SEA
881
Trl
TPL
CPL
sel
6FL

|A8L

681
ESE
oie
sel

EL
IOPT

[él
Ost

iss

SLT

rage
OFT
+ FOL

 

€ ‚OLE, DS €
O8T‘O + |GLL0 — 812 08616061

gl°5/00 | 2 95/19

+| :woqyskg TouolAA Sep JB UOI}AUPOY

998
= 184
{She
el
in
—|SLL
4
— LI
— 89,
—1094
—\09L
— 661
el
eh
— 66,
— 664
CSL
— 694
GPL
—|6PL
— CH
= So
SL
CL
re 2
mm (077

SSL
SSL
— [eh
=
—/964
— 96,
ee EG)
— 16h
— 064

 

 

|
|

(L061) %
11o M “LOTT,

 

Wed pays

4
“

U
U
u

A9WWEUJOLN

1974928409

188
799
989
769
669
809
969
619
969
619
869
419
619
169
LT9
9
LES
409
ELS
009
809
F09
66S
969
809
709
86%
609
109
86%
619
109
18%
LT9
019

668°086

„108 fu

0,6 Be
SUTELIOT, Sop

WoT} e444 V
snurur 05

 

 

618 (LG) €
OL (1°) sg
992 (1°) | 6
006 - (19) 8
68 (1°3) | ST
608 .. (1°) sı
gc) (LG) | 88
686 eg
182 (1%) | 9%
LPS (12) | 08
LOL (1'8) | 08
HON ee (1%) 6%
Fes (LS) | 0
19 (16) | LG
LPL (16) | 96
egg (L'e)| ge
ecg (1.8) SE
881 0) 6G
959 CEG) 9¢
9F9 | 88 | OF
C68  (L°8) | 6
SPQ Ca) Git
259 vo) IF
879 CLG)4 SG
689 Ne): 8%
SPL (2°%) | 8%
8,9 Le | CG
PPL (1%) FE
Cig), Le lo
989 (18) 5%
Les (LG) | Fe
TSL nee
188 CBS

668 69°

L66 G9°%
868086 co‘

HR RER EEE EEE RE EEE EEE st

Gb
6L +
ger
lb ar

 

Ge0'086 | 46,2

"UOISSIUTUON-SFUNSSIWPEIL) SYOSLIEZIEMYIS EIP H9INP U9SUNSSON ‘IX

 

=

ral NANQHNRAHR

an

bal
0 tk CO tc

a

© O19 O19 00 <H D GO Où <H H 10
a. a. mt E> © 00 CO © A D 1 1 Cd 10 10 = ©

m1 © 10

an

00D R19 19 by HM OO Ma. ONMWHAMAR®*

1d oO
CO t=

=

LI

=

n
=

a

=
=

en

TE © © © 1 10 © Or

=~

HD SH

=

=
n

=
>

=
=

I.

10 O29 O10 9) OO Hob

=

rn
u

| S62Z°O86
TPL LPP
OTF LSOL
gee à POPI
aS PCPS
968 EPLST
19% gell
988 &698T
670 BESS
688 Feel
&LT LSIZ
COS 96FT
ESE 6F0T
9,1 Cele
FES CSET
ice TS£T
FFF 689
PPP 889
988 TEST
TSF 98
OFF 679
808 d8661
CSP de1S
£68 LOS
618 6LP
LED 889
888 PLPL
628 OTIT
89% 6S
61% LOFT
ISP d LLP
9LT III
96% CO9T
G60 998%
g60.086 | 888%
966.626 | 9108

rn
=

 

 

an nn oo wo XXX oO QM 00 © © ©

HOS <H = <H 10
1D 10 19 19

~
~

(uoTye}g-zu2.19J9 )
|umnueifjnoulsg ‘Tesegg
sing
uauueyqnd
| yoopury,
(oyoysseg) eI
ZIdSOY[9SUITAL)
ed

prea1go
oy NYeIp1ooUoD

UWoSUT AIO
ULOYSISOY
(eyuoTos}oT) pory
no
djejog
peqıoynorf
ur

“

Sıug

ISO
SES

dst,
zıdsoyuojdung
UST
PERS
one “49
EI
opuordung
SDEEEN 238
punisseeg
epueyy

AUST ILL
YAVUIyAe PY
yyeunioz,
S104 [ONY
9OSZIVMTO
YLIZIOUION)

 

3108 /TULO z198/t9 wu
°
; eu! se SE ses
H 9808-0 +38 88 a.
: D S
zonwuo 10po Se ee ee a et | Se uore]g Jap OUEN
A | a Sel Bl ee
a ® iS SR:
at Bo |S & es
HG 2

oyynysdwagag | 21914709

 

9EL
| CGT
| PEL
SGL
GGL
| LOT
| OGL
6IL
SLL
LIL
9LL
STIL
VILL
STE
GLL
LE
ixOLL
«601
ixSOL
*LOL
| 9OL
ixSOL
* POL
SOL
IxGOL
ix LOL
ixOOT
66

#96

 

 

“oN

 

|

 

À A uma a a a a na a aa

11 TV EN PURE RSR PSE PES PRE

‘IX OII8qU,L Jop JUNZJ9SI10,T

ai ahssd li

 

 

His son

 

se hd Manila see

 
 
