ea

 

MAR

ULM

IT ct

IR RR N AR

d’altitudes. Les discordances entre les temp6ratures constalees au moment des £talonnages,
et les temp6ratures calculdes d’apres les tensions de vapeur, l’indiquent suffisamment.

Si l’on veut bien reflechir A toutes ces circonslances, on reconnailra que rien, dans
les rösultats en question, n’est de nature A infirmer les lois du colonel Goulier.

D. — OBSERVATIONS DU LIEUTENANT-COLONEL FRANZ LEHRL.
A propos d’un nivellement ex&cut& aux environs d’Agram, en 1885, M. le lieute-

Varietions ahsolues de longueur d’une mire et variations concomitantes de la temperature

et de Ü!’humidite.

(Observations du lieut.-colonel Franz Lehrl.)

10972

10 20 10 20 10 20

Avril Mai Juin Juillet Aoüt Septembre Octobre 1885
iO o 20 o

    

 

 

 

 

 

 

 

 

 

 

 

 

 

 

 

 

 

 

 

 

 

 

 

 

 

 

 

 

 

 

 

 

 

ce 7 58
tra!”
euk
\ de d

| | 5 N leca ee z i

05 dl a 9,5
Ss N
e x Aryısion
Letalon®?

0, 0,4
0,3 0,3
30° Belei] 7 30°

ee |

I |

| | N N \
20 m nr ur 20

| N N I. Temperature

 

 

 

 

 

 

 

 

 

 

 

 

 

 

 

 

 

 

 

 

 

 

 

 

 

 

 

 

 

 

 

 

 

 

 

 

 

 

 

 

 

 

 

 

50
20T r 20
!
15 15
N
x NaR |
10 s I \ : 10
x Tensıon absolue .de| lalvapeur |\d eau |dans Jaı
ze 5
Rio. 2:
ASSOCIATION GEODESIQUE — 31

 
