 

DIFF. DE LONGITUDE.

+

|

 

 

INSTRUMENTS

 

 

 

OBSERVATEURS.
a | ERREUR - EMPLOYÉS.
EN TEMPS.
PROBABLE,
Espagne. Spanien.
2 Tetica—M’Sabiha | Perrier, Merino | Cercles méridiens de Brunner

3 Reducto—Madrid
4 Madrid—Lerida .
5 Reducto—Lerida

France. Frankreich.

19 Paris—Puy de Döme

20 Paris*)—Neuchatel .

21 Paris*)—Lyon (St. ae ;

24 Lyon—Genéve

25 Lyon—Puy de Dôme

26 Lyon—Marseille .

34 Aloer—M’Sabiha

385 M’Sabiha—Tetica

39 Alger—Guelt-es-Stel

40 Guelt- -es Stel—Laghouat .
41 Paris—Milan .

42 Paris—Nice

43 Nice—Milan

Italie. Italien.

11 Napoli (Capodimonte)—Termoli

12 Padova—Milano .
13 Napoli—Padova .
14 Napoli—Milano

15 Milano—Genova .
16 Napoli—Genova .

*) La station frangaise a été & Montsouris; pour

 

 

— 6™ 14°99 |
pas encore calculée.

do.
do.

— 2" 31511 = 0,011
—18 28.815 | + 0.015

— 9 47.10 = 0.006
— 5 28.32 a= 0.014
+ 7 16.15 a 02081
— 2 26.63 ate 0.011
. | +15 35.08 + 0.006
Voir Espagne
+ 0 7.26 = 0.010
+ 0 33.15 == 0010
—27 24.96 se 0101
—19 51.23 a= 0.01
— 7 33.74 0-0!

 

pas encore calculée

+10 43.978| =# 0.021
+9 81.251] = 0.020
+90 14.529 | # 0.017
1 4.628| #:0.018
+91 19.169 | Æ 0.019

 

 

samener les différences

Eugenio, Esteban

do.
do.

Perrier, Bassot

Perrier, Hirsch

Perrier, Bassot

Bassot, Plantamonr
| Perrier, Bassot
| Perrier, Stephan

| Perrier, Bassot

do.
Bassot, Defforges
Perrier, Celoria
Bassot, Perrotin

Perrotin, Celoria

Fergola, Nobile

Lorenzoni, Celoria
Nobile, Lorenzoni

| . .

|| Nobile, Celoria
|Celoria, Lazagna
|Nobile, Lazagna

do.
do.
do.

Cercles de Brunner et de
Rigaud

Paris, cercle de Brunner;

Neuchatel cercle méridien

Cercles de Brunner
Lyon, cercle de Brunner;
Genéve, altazimut
Cercles de Brunner

Cercles de Brunner

Cercles de Rigaud et de
Brunner

Cercles de Brunner
do.
do.

Cercles de Brunner et de
Gauthier

| Nice, cercle méridien de
Gautier;
|Milan, instrument des pas-

sages de Repsold

Naples, lunette méridienne

| de Reichenbach;

Termoli, instrument des pas-
sages à lunette brisée de
Repsold

| Padoue, Milan et Naples,

ges à lunette brisée de

Gènes, instruments des

 

 

| Repsold;

passages de Cook

de longitude à la Méridienne de Casiml

instruments des passa- .

oe

 

 

 

lm Sep

It, hi

À fang

 
