 

 

 

 

   

   

NER

 

  

  

 

NIVELLEMENT GENERAL DE LA FRANCE

CARTE MONTRANT L’AVANCEMENT DU RESEAU TFONDAMENTAL

®

ORNECLETERBE

 

 

 
   

 
 

x
B I aut,
DArgues

    
 
 
     
   
  

+ 2%
i m Give,
er Sr
N
a

 
 

RS Rey
MEZIERES— N %,
Longuy

 
     
   

VANNES
SQ

   

QAUXERRE

 

15-5-TileQ

BOURGES 9

 
 
 
 
      

 
 

©
CHATEAUROUX

 
  
  

  

  
    
  
 

 

   
  
 

  
     
  
  
 
 

  
  

 

 

   

    
  

    
     

 
   

 
   
     
  

MOoULINS
OITIERS 7)’ © :
si @OFSENEVE
GUERET Aoniugor >& Annenitsse
) Q i Lx Cluse S ee
BE 1 A Di - Gannal 4 SE
\NNRRD SESıulpice-Lauriere ANNE }
N Reillant- QLIMOGES QCLERMONT-FERRANDD Wıyon IR Ecnamserv &
INIIILK a .
INN n , : a BR x.
I If Q ANGDULEME L STETIENNE Porz =
N s % 3
| N „.. PERIGUEUX\ OTUFLE N > N Bardlonnäitf.
) \ °o > > QTURIN
l) Wo F AURIELA ° ALENGE 9 Mont
lt 2 LE PUY a
|HbRrDEAU A ao x
Fügen ı PRIVA Veynes® nn \ =
s rpdenac. . | nn
rmande CAHORS o© MeNDE V I rn
» U Ardoise ;
Alais y © a ]
MONTAUBAN -
IE: NIME
/MONT-DE-MARSAN \ na oT? Team
Z 9 Sonınızergg en
o ATOULOUSE u
AUCH G

  

      
      

   
  
   
 

   

 

 
  
 

le Somport E OFOIX f ö - _
BE We. WAT 52 2 2 — &
: 5 PERPIGNANG | - 4-72
Echelle : a, lege MEDITE-
ENEe & . x N R \\ \

Te, Perth@® Q
Kr Ü

 

Harn er zer ei = } =| /

o 50 100 150 20085; 2 )
Hi
[ )

 

NN
UN
IN AN

  

   
  

 

 

 

 

SIGNES CONVENTIONNELS

Lignes niveldes de 188441888. 6.105” — Maregraphes et Medimaremetres =
de 239889. - 4.500: —— |
eis Ton | Raccord® avec effectus —® S
Lignes & niveler ulterieurement 4.445” —— les pays etraugers ( & effectuer —@

  
