 

 

 

188

 

  
  
 
 
    

2

 

ige din

|

 

 

ED

 

ing]

5

 

 

php fafa

       

SS

 

il E
1

(fl

 

 

 

 

 

 

 

hit)

 

 

 

 

 

 

 

 

 

Qi ro + LOF 00.0 © — NI MIS LC R DO O — UNI NOR ORO-ANMS NOR DRO—ANNM+¥ NOR DARO—ANFWOR AHO—AMYTMNON AAG

 

\ loots

=

 

 

Mt ORDRMO—AMY NON DOO—AMTNONRDGAS—

 

 

 

 

 

 

 

 

 

 

 

 

 

 

 

Fig. 15. Fig. 16.
Mire de Breithaupt. Mire de Bamberg.
(Echelle: + environ). (Echelle: + environ).

        
    
   
             
       
     
 
      
 
  
    
      
    
 

m
o

fu une

9
So
~

N

juin ia

vf

  

ji

a
uf
N

  

aif fai

UD
N
Wil
N

  
 

hui

en
ln
N
m

   
  

fan

N

N
A
so
N

il)

an
i]
N

 

   

SIERT

aula
oe

=
Anau luau
g o

_ 2
ea

=

  

wo
Le]

 

 

 

 

Lt

Rio: 17.
Mire de Caminada.
(Echelle: + environ).

 

mern äh

cha shi aan

4
4
4
|
i

 
