ER

W D OBDBE

 

 

Erreurs de clôture des triangles desquels ont été mesurés les trois angles.

i 2 SSS SSE SDSS

 

 

— 17

 

 

 

 

 

 

 

 

 

 

 

 

 

 

 

 

  

 

| NOMBRE
= = no D a ae NOMBRE DES OBSERVATIONS ae pee
= Dunn as DES EXÉCUTÉES DE
= = ET Oe ie VERNIERS POUR CHAQUE REMARQUES
% DIAMÈTRE DU CERCLE ao OU DES CHAQUE ANGLE a
HORIZONTAL MICROSCOPE MICROSCOPES | OU POUR =
CHAQUE DIRECTION oo
|
. ' en \ Directions. |
> amsden, een BO ieroscope. 3 TA 1e 2768
1 | id. R. S. id. 5 6.10 | 076 | 5 a
133 | Ramsden, 18 inch. id. 3 14.16 25 1923 | OnE 0,593
134 a » Leet DO: id. 3 17, 6 23.13) 21 0 is 0, 608
a amsden, 18 inch. ide 3 AR 55 2 1
135 | Troughton and Simms, 2 feet. id. 5 43.49 28.213 oe 0
Ramsden, 3 feet. R.S. id. à 19.11 2.18
= 136) id. no id. 3 13.15 5 0,79 oe
= id. RS id. 5 9.10
i Troughton and Simms, 2 feet. id. 5 40 19.12) 0580 1 Do
aE amsden, 5 feet. R.S id. > 33.10 42.35
> id. B. O. id. 3 7 4 {0,81 ee
i 189] i BuO: id. 3 31.38.20 1018| 0,8 0, 656
i id. RS id. 5 12. 19
É 10) id. 0 id. 3 13.10 2. 4 081 N
j id. Bo id. 3 14.7 16.24
er oo id. 5 27.16 | 0,81) 0, 656
id BO. id. 3 Ae)
142 } a es. id. 5 34.27 84) 0,83 | 0,689
id. 1B. O- id. 3 148
12 Troughton and Simms, 2 feet. id. Si 50, 10 Lo 14 0,84 | 0,706
144 | Ramsden, 3 feet. B. O. id. à 65 06 3 + 01 0,84) 0, 706
= id. Res. id: » 4.1 24.20 :
© | Troughton and Simms, 2 feet. id. > 5. 10 eee on
Ramsden, 3 feet. R.S. id. D: 1. >. 122 4
120 Troughton and Simms, 2 feet. id. : 1 | 0,84 oe
E Ramsden, 3 feet. B. ©. id. = 22 42 :
47 | id. ns id. 5 38. 13 | 0,84 0, 706
id. RS id. D 19.12
148 | id. B. 0. id. 3 a 0,84] 0,706
ae id. 1B. ©. id. 3 18 15
= #4} id. RS. id. 5 13.20 9.133 oe
= Le id Be Oz id. 3 29.22 > r
zw) id. RS. id. 5 1.32 25.46 | 0,85 | 0,722
LE id. 18 (Ok ide 3 21.29 22.14
151 } id. R. S. id. 5 11.10 | 0,86 nn
„ id. B. ©: id. 3 7. nl : 0
i, 7 Ramsden, 18 inch. id. = 29.28 | 0,86 | 0,74
153 || id. id. 3 21.20 1611419295 | 07. 80 0,740
> Ramsden, 3 feet. R.S. id. D 4 2078.19 =
154 | id. ne id. 3 | 35.24 | ne 0,757
5 ao id, 3 ee. 0,757 | trapezium,
2 id. B. 0. id. 3 9.16 =
156 | id. RS. id. 5 19.12 12.17 § 9987 on
2 Ramsden, 3 feet. B. O. id. 42.26 en
ie) id. Roc id. 5 8.38 24,27 | 0:89 De
158 | id. Bo id. 3 22 4 318 + 100 0, 792
= id. BR.» id
159 | id. B. O. id. 3 8. 7 7.25 | 999 0, 828
> an | Troughton and Simms, 2 2 Teet. id. 5 io te ak oy
a Norte | id. id. 5 16:16 2720 Lie] 0,9 0, 846
: Ramsden, 3 feet. R.S. id. a AS ve - 57) 69 99 0.846
Fe Troughton and Simms, 2 feet. id. 5 8. 8 | 2 I
| “

 

|

à

Al

=
=
"=>
=
=

 

 

 

 

 

 
