 

0

0.0
IN

(il

graphes de France.
No. 5.

 

 

 

| Causes d’obstruction du canal

 

 

 

 

 

 

 

 

 

 

|
fa mor. | Distance de la bouche | | up
| | Intensité | par motif
| ee : “sapere | |
Exposition | au fond du puits. LE la nn au moment | | | des matiöres
de la bouche par _ | (Différence de niveau entre | ii sienne Courant | de la nature |
| = .„ | (Les distances negatives | | | que l’eau
rapport au courant | le bas de Vorifice de prise |sont celles au-dessous de la des eaux. | du sol. | i
des eaux. | d'eau et le fond du puits.) | surface de la basse-mer.) | | | COURS
- — — = = = — | — | — —
Dans le sens du courant | 0750 — 92720 | = Sol Sablonneux| Sable fin
| | | |
do. | 0.60 RA | do. | do
| | |
|
|
|
do. | 0.10 — 0.85 | » | Sol argileux | Vase
1! | I |
| | | |
En face du courant | 0.25 —1:35 | ” | do. | do.
|| || |
do. | 0.10 + 0.20 |» | Sol rocheux | ‘Vase et sable
| || |
Dans le sens du courant | 0.10 —1.10 | > | do. | do.
| | | | |
do. 0.10 de orifice inférieur | L'orifice inférieur a—0.15| ss | Sol argileux | Vase
| | | |
En face du courant | 0.00 | — 0.415 | ” | do. do.
| | | |
| | | |
Sens du courant | 1.00 | —1.00 | : | Sable Sable
En face du courant | ap —0.49 | = do. do.
| |
do. | : 2100 | : Roches do.
| | | Puits encombré
| | |
Latéral au courant | a Er | = | Enrochements do.
| | |
| | |
Sens du courant | 0.35 —0.725 | 3 |  Argileux Vase et sable
| |
Il 1} |
|| | |
| | |
| |

 

 

 

 
