 

 

 

 

 

 

 

 

 

I sg 171777177 VRRBSBBBäNgBERgegegg ge >

VEN ZEN ?
\ BEE \ \ m RL )
ı

 

 

N \
\ =
\ Y- Du \
N DEE \
en \ \
EN 2
\ Be \
\ R
———— \ ,
\ DEN
BI
er as N
2 \ \
\ v _
\ ! :
\ \ AR
\ \ 2

    

\ k
A
7

A

\
Iscement des bases gäodesigue:

=
Emp

 

 

 

 

 

 

 

\
a He \
I \ Be ee \
R a
&
e I
N i a TUT
\
a |
IS 2 4
_— \ j i
I

=
1
IL
Fe
\
\
L

 

nn

T INOFL en

 

 
   

 

tONST

 

 

 

— N

   

 

 

 

 

 

 

 

 

 

 

 

See

 

 

!
Sa

N
as

 

NN

 

 

 

Sl

 

Florence -Insttut geographique militaire - 1889-90

 

 

erh F SD
By Se 4
NerPrsT nr x

  

 

 

 

 

 

 

 

   

N
Ju

ma‘
Bi

  

 

ME;

  

f
IF

DES

1
I

3

    

Bus auree!

)

E

 

5

 

!

1
!
1

 

|
AUX

AVi
DPE

|
N

IDUANT
A

)
}

ON

 

 

 

 

 

 

 

 

 

 

 

 

|
By

v.

NE

N
i

Ü

TRIG

 

&
=
=,

LAVANGEMENT

e

i
1

ES TMA

   

a)

|
EUR|

Lil

N

2

 

ECHELLE 1:8,000,000

+
Les longitudes sont rapportees au ineridien
delle deFer A20”Duest du meridien de Paris

 

 

 

 

 

 

 

 

 

 

 

 

 

 

 

 

 

 

 
