 

 

 

— 439 —

Erreurs de clôture des triangles desquels ont été mesurés les trois angles.

teams 7

 

   

 

 

 

 

   

 

 

 

 

 

 

NOMBRE
= nr LECTURE DES ERREURS
UTEURS DES INSTRUMENTS S NOMBRE eos on en
E SECONDES Be EXÉCUTÉES en
© ET u VERNIERS POUR CHAQUE A2 REMARQUES
a DIAMÈTRE DU CERCLE OU DES CHAQUE ANGLE FRE
Zi OU DU OU POUR A
STONE MIORORCOPE | CHAQUE
DIRECTION + lo
271 | Repsold 8 pouces. 2e 2 : 9 | 2) i A,'7089
212 id. 3 id. id. 9 218 7, 1284
273 id. id. 10. 9 0,45 0, 2025
274 id. id. id. 2 0,39 0, 1521
je 218, 10 id. id. 9 “u 1.90 2, 4025
Er 216 id. id. id. o 022 0, 0484
k 27 id. id. id. 9 2,20 4, 8400
iE 218 id. id. id. 9 1,63 2, 6569
x 219 id. id. id. 9 1,58 2, 4964
F 280 | Ertel 12 pouces. id. id. 15 0,72 | 0,5184
E 281 id. id. id. 15 10.07 0,0049
IE 282 id. id. id. 15 1,52 2, 3104
| 283 id. | id. id. 15 0,38 0, 1444
IE 284 id. id. id. 15 1,06 1, 1236
5 28 id. id. id. 15 1,21 1, 4641
© 286 id. id. id, 15 Ze ou 5, 6169
287 id. id. id. 15 4,91 | 24, 1081
288 id. id. id. 15 I, 11 3,2921
289 id. id. id. 15) 0,90 0, 8100
290 id. id. id. 15 3 64 13, 2496
aol id. id. id; 15 3, ‚22 10, 3684
292 id. id. id. 15 2,19 4, 7961
293 id. id. id. 15 0,43 0, 1849
= 294 id. id. id. 15 1,44 2, 0736 |
295 id. id. id. 15 0705 0, 0025
296 id. id. id, 15 I,» 1, 2321
297 id. id. id. 15 0,41 0, 1681
= 1293 id. id. id. 15 1,88 3, 5344
= 299 id. id. ide. 15 1539 1, 9321
+ 300 id. id. id. 15 1,98 3, 9204
= 301 id. id. id. 15 0,23 | 0,0529
302 id. id. id. 15 2,50 6, 2500
303 id. id. id. 15 2,30 8, 4100
304 id. id. id 15 0,48 0, 2304

 

 

 

 

w
à

> A?
: m = + \ = + Ve nn _ 21009

4

MI FIR DO CAEN DM on LUE pr
