 

  
  

      
     
     
 
   
    
    
   
   

 

4 ITALIA a

Rete Geodetica di ’Ördine
| oe
|

| Frovincie Meridi®nai. |

 

 

  

5 yannücch 10

VS. Angelo

\ / 7 2 od arile 7 > ue

\ / 4 / \ Ta VE,
NE, | ENDE NE L- Jar
t \/Y La Saray Lise |
eS NI rio
1 24 \ Nee AT ar Z AIO
iGervati \ Ve Wed 175:

\ | DE Noté |
Vi \ / Mn How PS
h voomama VE

Ae | LS, D eee

U.
—<

     

 

 

BUTT ere opens i ase

ee RTT rere err
