ASIE,AFRIQUE er AUSTRALIE

50° 60° 70° 80°90°100°110° 120° 130° 140° 150°

 

 

SSR TRET FUSS eRulTerrer \ \ S

 

 

A “
‚chelle: 20.000.000

an \ Du u DI = == NIVELLEMENTS DE PRECISION

  
 
 
 
 
  
             
     
 
   
    
    

Sb E 7

A ee
° :
FB an Pracht |

Ixon NIVELLEMENTS DE PRECISION

LIGNES EXISTANT, AU 1ER JANVIER 9 Operations simples

a es } Mabinella |
DANS = : = ‘ Nivellements executes a | LIGNES 0, IER JANVIER 1912,
are y | ANS |
L.EMPIRE RU S S E Maregraphes ............. 1 . |
r Limites d’Etats | LE MAROC,L’ALGERIE ETLA TUNISIE u:

 

 

36°

 

 

Dal = Böne

„| Pbiftippexities © Tabarka AN Ska Goulette
Q iz „% m AT ):

Ei gie 7 j 9 |
Y N Ze ‚Chanlegs N we Tunis;

R Aazmalt : fanına er (| x Ä a Me nzel | |
En a), nk S |

\

 

  
  

  

Terd Br
ZZ DIN Belizance : Fanaeı un, _ > Zaghotan u
Beni-Sap 777, Pereeyaux In.) 1 AinBeidap + , ‚Ss en
Vemours ? a Mascara 7, Batna% NS MEANS a
© Ren e ! IM N W7Bals
X 91di-del-Abbe: 5 ' Krenchela 7.)2 4 17: a |
2 I 1 Y Pe, . adhta
se En ch | | ada El-Kantara Tebessa y
x | Biskral\ | f e
d& ! ıskrah\ | t Sfax |
| | | Y\ I Sfax ı

  
 

u = 7) a 3u°|
a 4 NSS li
ı * HOTT-E 1? FA
\ = ı | 6ab Ss er |
a | | |
N | | |

 

 

 

  

 

 

 

 

 

 

   
 
 
 
      
   
   
     
   

 

 

N / at = AI
SS | 187, + S ji
e | na | | BE
| > | + ‚|
Se | Charaaiao_| ) ” i f { |
| 7 ) + "Berressef ! 2 ee
Ei a ' 8 = I =
I x a |
| EURZERRE en ee ne NND, NER Blase
| | Ouargla | \ ] Bar,
j | r 1 x IA | |
| MR 1% |
| | | | “x IR I
! ' } AS „E |
! | | run] ' |
| |
| |
I I
|
m 1. ae,
| SR] ! ® ! a 30°
: |
Legende |
Nivellements executes ( Operations doubles ) |
I |
a) | IWvellementsumzorsies. 2...
| Ma regraphes
I !
Se sn] Ela C2 zu. 2 Alla ae RE En en Ne SS] ln 22 |
4° 2 0° 28 Z° 6°

 

Longitudes rapportees au meridien de Greenwich (2?20’Ouest de Paris)

 

 

 

 

 

 
  
    
  

   
      
    
    
     
   

   
   

 

  
 
  

 

 

   

 

 

 

 

 

 

   
  

 

 

 

 

 

  
  

 

 

 

 

     
  

 

 

 

 

 

 

 

   

 

 

 

 

 

 

 

 

 

  
  
 

 

 

 

 

 

 

 

 

190% nn
: : nn a un nn BD nn ee I er N
I | | | |
a | NIVELLEMENTS DE PRECISION |
5 ae | | Legende I
14 SAel} | +
Sf Kälabagh N | en x |
| ° ii | N a _ ’ . |
32° | lt F | unedet kam | | 1 32° Rn ; p REN ) el Sr Srmaen | ; ER DAN
' | Ronasze 1, 5 / 117 ES — | | LIGNES EXISTANT, AU 1°* JANVIER 1912 ‚DANS I Nivellemenis executes (operalions doubles) —— LAKE VICTORIA | LIGNES EXISTANT, AU 1ER JANVIER 1912, 5
Ser ["era /smail Aha, ähore an = Te Sales Ta ae | N BR | | 5
N ar 1 re | | Nivellements projetes... Ru | | 5
/ kuhiena | | | ’ D S IN D E S , 2 EHE WALLRREER L’ETAT D E Vi CT ORIA
| © | Dera Ghdsih, ee | L EMPIRE ki | Mareiapmes nn ®
| > @ Ghası Ähan tia mba i | a ER
| Puetta | 1 A “ Dun > | | (AU STRALIE )
| Mi sfarnager J | | E Cne u 6: 15.00 0.0 00 KA A N
| Moe LMoravabad NE | 0 10 200 200 %00 500 600 700 800 200 1000km | 28
2g° PRibhrt Umamnan —— bmsaet ———nse ent  — En — Me Ze | R E 2 hi Ri E
| ae Shlreity { ) | 2 Nivellements executes (Operations sımples)
en ha EI ne ua n s
| 2 N Wehahjahı npür In | _— 1 z = | ll asyr ums)
| Yaisa ; x > Darjeelin \ v \ | s
| aısalmero Jaipuro, Ag I 2 \ ucknow } ; Sa n 7 3 gebe? ulr \ | Echelle: 3.00 s08 000°
| Lama N > k & En \
Joohpur SR Ayzabad, \ Songkhoc ohubri np Ruhall | | | 5 100 so
| en: | I Serzotpur a7 R 4 Frkırgang | \ ) | | Ve en ss —— ———
| Bande Nlahıabad x q Ah Nrarbatipur all AN : |
x I ! — I wenares Fo. Ben \ , |
u % Bone 1 | rhar Bagafın | | 2x engen
. I | | ER | } | = p
| Sirony‘ \ Damah a Hazaribagh_ en — ia een Wi | ofinle
25 ein 7 % ‘ N Roc: | | Y Kealeainn |
dehore Bhopl UN asohagpur | Burdweren \ x | |
Alndore _Jubbulpore PR '& e. ler Magong OIRA, | |
| nn IIBN \ | | gh Chi h Picol. | z |
ale | Bildspur | AırdSanore Dan hd Hi A A 3 | SE REN : un ro .icola ee A 36°
| Ä | / ; » Rn‘ ) LAKE HINDMARSIKZN Ä x x Broken, __ Yan 4 u Zr [|
£ } Be A WublatlSrugor Island‘) K 4 | h u ’
, I An; RSambalpu. Sy | | Äı
a > =“ Nagpu I Räipur = je | = | ei) In N f N N Yo a Numurkan }
a VAnjBAY JPaman | ı ieh E 4 ADUTHS orzne GANCHNE da | | wol eley | = |Shepparton
| Net | & I Khurfa aise Ai ______ — 1 gE | ° R N | £ Brafey,
| | AK — 4 pet ’ | a 2 erviceton 4 TEE
| } | f. Pur! Lo | In ofo /
vl RONIS AY Kalyan . d , N Ir 2
1 ” I a9 2 / Ahmadılagan KEINE E era | | SI | | A
z [vona | | G Potench? E | \ | a:
I \S- Viziaaayra 1 £ | | Il
a A \sholapu, | I B 1 E |
Sätarg PAR, os SNizägapatam 4 \ | I
| | Ä | | ı Noradjuhe >
x \ seid h | + (ev, 5
18° » \ \ Bijapun 4 & acanada | | = ) N 188) Ei 5 Ns a
| | | = | } ampians [= Cathkin
BE | Goa \ 09% az zn I —  —Gyamondt | H \ “ | \« S oAlex
| | el Mormugaggz SERER | | | 8 j Aracat % Ki h
I k > : not \ + ilmore )
| | i Hubli on ADD | il | | f
| | | : x B MOUTHS or me = + ° N. \Creswick d }
| = ey BER BIT | m == = | Owahbra 4° W oWhittlesea
| | \ | | | © Ni == z E Ballarat | GYAN YEAN RESY.
| | | | | = | = 1: I Zn = == = \ | s Aafam  Kuaflealesuille | i |
> | ) | | | ! | >  Mergu Ve N Warn z
== | | | | \f | 2 ol | = Ta \ telhourne’.o  —. „Wärburton \ e |
€ | | Mangalore u | | | ANDAMAN \ © er \ | amilton ( } { 2 Lilydal | B : Ber
ee >= : | ee R | | E  -1SLÄnDs | 2 a | a2 BE TE ER ER nn | ZN - ei! den 2 : | U .
| : = ycıd —_ SS — : °192] | & | N | andringhem obemtrook | ( EN |
„te Öff 2 . ... a | NIVELLEMENTS DE PRECISION ee SL a Sn
y N a ee | | Kush moto, | HERR : Bar Pandenong SWeerim South Ompson &
3 + ER \ | | | | Morsington J a Moe _za_Trabe_ N, SSalk__
© R, ba | | & | ß I dk. ‘ a ; ca NE Warrbaui zZ praralgon |} MErınsTon
ES IR BR SS % di ; | u egend Ö | 1 | ’ ? i Qurra = { gan ruhe o Fnonuape 2,
17 Ri H | F & ” sa yn
EN a | | LIGNES EXISTANT, AU 1=® JANVIER 1912, DANS eg Poyge mg ee |
© % odur | y 5 5 | | > Portland E ee = oprunsurrae | VO |
Kin A | en „J Pperations smples........... | | FE BER. en = = | \ 1 £
Ir a elle L 6 e & | 5 OÖ | | G 7 | Na Br
a N ae) am L'’EMPIRE DU JAPON | en
—— zn SR es 2 5 i : | | | I CAPE PATERSOR Er
MANAR | i Stalion permanente d’observalion des marees......& | | en | uaszate
IEYLON \ [E4) > Echell . | \f 5 a | |
Colombo } - d o temnor3ir d o | | Lconeile 5.000. 00 | N E Ve | |
Aal — 4 — lemporfäft ___—_— 0 ——— + | ee 300 & I | Sa = er. — Se nn
Pfde Gal ee Se | N wıLsom’s mar
= a ee Eee N ner ln anlgeiy Son. ers Se re ee en Te ren N Rue Iene
16° 80° 84° 88°

 

   

 

 

 

 

tongitudes rspporlees gumerioien de Greenwich (2°20’Ouest de Psris)

Lungituges rapporte>s au mesidien de Greenwion (2420 Quest de Parıs)

longıtuges rapporl&es au meridien de Greenwich (2°20'wesı de Parıs)

6.Gouny, Paris

 
