 

 

 

 

 

     

 

   

 

10 15

 

 

      
      
  
   
    
   
   
   
  

  

CARTE DEMONSTRATIVE
DES DETERMINATIONS ASTRONOMIQUES
| DE LATITUDE ET D’AZIMUTH

= ALTER TT]
LL
HO

[|
YF
Hy

    
   

 

   

 

 

Echelle 1: 10,000,000.

as
men

Les longitudes sont rapportées auméridien de l'ile de Fer à 20° Ouest duméridien dePvis.

2 — —

 

| Determinations delatitude etd’azimuth..@
| Determinations de latitude.................. 0

 

 

 

MINE a
Ih

|
u

ne
IH
Tey
A

aa
A

 

 

 

fe

 

 

 

 

 

 

 

 

 

 

 

 

 

 

 

 

 

 

 

 

 

 

 

 

Re ©

ape
x

 

 

 

 

 

   

 

 

 

 

 

 

 

 

 

 

 

 

 

 

 

 
  

 

 

 

 

  

 

|
| Es

 

wid

 

 

Decbica.
ITA ets,
Le 0 ln LA
Er 3 san u à
3 Seg DY
De

À >
Drame md À
a = @lelerwardtin

 

I»
3 Vent

 

 

 

 

 

 

 

 

 

tl

 

 

 

 

 

 

 

 

 

 

 

 

 

 

 

 

 

 

 

 

 

 

 

 

 

 

 

   
 
  
    
 

 

 

 

 

 

 

 

 

 

 

 

 

 

 

 

 

 

 

 
