 

 

u:

 

 

|
|

 

 

 

 

 

 

 

 

 

 

| |
| ERREUR | | MÉTHODE ET INSTRUMENT
STATE T'ON. LATITUDE. | OBSERVATEUR. | ;
PROBABLE. | EMPLOYÉS.
|
| |
| |
Portugal. Portugal. |
| |
1. Lisboa . .|| 88° 42’ 31725 + 0104 | Oom | Passages au premier vertical
2. Coimbra .|40 12 25.85 = 0:06 | Astronomes de l’Observat.| Hauteurs des circumpolaires
| |
Prusse. Preussen. | |
1. Lauenburg : | | |
2. Altona . : Voyez Danemark | |
3. Lyssabel “if | |
4. Helgoland . .|54 10 46.58 + 01 | Hansen |Instrument des passages
| dans le premier vertical
5. Altona . .|53 32 45.27 | Gauss | Distances zénithales
6. Güldenstein nd 18 933 == 0.08 Schumacher, Nehus do.
7. Trunz es .154 13 11.47 Bessel Passages au premier vertical
8. Lübeck, Marienthurm . .|53 52 6.15 | Petersen do.
9. Memel ; 55 43 40.45 ! Bessel do.
10 Bomesberg . 26... 54 42 50.50 Baeyer | do.
11. Tarnowitz (Trockenberg) 50 24 43.89 + 0.08 | Baeyer | Distances zenithales
12. Berlin (Centre de l'Observatoire). .152 30 17.12 + 0.09 | Baeyer do.
13. Bonn en .|50 43 44.40 =E 0.09 Förster | Instrument des passages
| dans le premier vertical
14. Schwerin .153 37 39.12 Æ 0.08. | Paschen do.
15. Granzin .|53 27 11.53; +0.19 | Paschen | do.
16. Breslau . 51 6 55.8 a 0.07 Baeyer, Sadebeck, Galle || Distances zénithales
17. Schneekoppe . 150 44 19.94 se: 0.12 Baeyer, Sadebeck Hauteurs  circumméridien-
: nes. Instrument universel
18. Strassburg Voyez France
19. Fallstein 02 1 808. ae 0.09 Baeyer, Sadebeck | do.
20. Brocken ‘loi 48 1084, as O07 Baeyer, Sadebeck | do.
na... es ws  ,|00 297 5.06 3 0.15 Tietjen | do.
22. Berlin (Centre de l'Observatoire). .|52 30 16.74 + 0.08 Sadebeck, Albrecht | do.
23. Göttingen . AH SUR. 0 51 31 48.43 Gauss, Bürgen | do.

 

 

=

=
È
=

 
