 

 

 

 

 

 

 

 

me

 

 

 

d’Horsetzki, Randhar-
tinger, Rehm.

 

 

 

126
a... a 000002
DESIGNATION > 5 | NOMS | | ERREURS PROBABLES
DE LA BASE = F | DES OBSERVATEURS ne et relatives
| FA een ne
Base de Christiania 1864) Fearnley et Naser. 2025°.., Erreur moyenne
| non calculée.
Norwège. Base de Levanjer (Dront- 1840| Fearnley et Naser. 1806.
| heimfjord)
[Base dArad 23.205 . 1840| Hawliczek, Fromm, de |4623.06990
Rueber, Szodtfried. Klafter.
Base de Partyn pres de|1849| Joh. Marien, de Rue-| 3149%19654
Tarnow ber et Pechmann.
Base de Hall prés d’Inspruck }1851| J. Marieni, de Rueber | 2990%38500
et Pechmann, Veigl. 8
Base de Slobozie en Valachie 1855) de Rueber, Grünner, de| 3505%57382 5
Nemethy, Fromberg. S
Base de Wiener Neustadt .|1857| de Rueber,deGanahl,bar.| 5000%77554 =
| Zezschwitz,de Hittnern. | =
Base de Kranichsfeld pres 1860 de Rucber, Breymann,| 300417297 2
Marburg Trapschia, Walter. | =
Base de Josefstadt (Bohême) nee de Ganahl, Wagner, Ett- 2772%07089)| c
| | ner, de Hittnern, Merkl. | =
Autriche |Base de Skutari (Albanie) liscol de Ganahl, Tinter, de, 1614811041 S
et À | | Gyurkovice, Prickler. | 2
H à Base de Sign (Dalmatie) .|1870 de Ganall, Breymann, | 1305827400 =
ongrie. : E
Hartl, de Gyurkovie. =
| Base de Kleinmünchen près 1871) deGanahl,R.deSterneck, | 1668*.... a
Linz H. de Sterneck, Hartl, | 3
Randhartinger. =
Base de Grossenhain pres 1872| de@ranahl, R.de Sterneck, | 21ed hi: =
Dresde Hartl, de Gyurkovic. =
SS
—
Base d’Eger (Bohéme) .|1873| R. de Sterneck, de Hor-| 2208%4028 =
setzkt, Hartl, Waitz. ~
=
3ase d’Udine en Italie). . 1874| de Ganahl, Kalmar ,| 1712%.... =

 

=

PU TO DL BER ky

vll

ak nik) Wi

Wie te MT

À as the ds Mt Ad del nd pau mn 11
