 

 

  

 

— 210 —

 

Erreurs de clöture des triangles desquels ont dt mesures les trois angles.

 

 

 

 

 

 

 

 

 

 

 

 

 

 

 

 

 

 

 

 

 

 

a AUTEURS DES INSTRUMENTS NOMBRE DES a a
3 EMPLOYES SECONDES DES EXECUTEES DE
„2 ET VERNIERS POUR CHAQUE A? REMARQUES
" DIAMETRE DU CERCLE en OU DES CHAQUE ANGLE a
En En OU DU OU POUR A
HORIZONTAL MICROSCOPE MICROSCOPES CHAQUE DIREOTION
An — | Ze
60 | T. et a n° 1 et Barrow's 24" DB 22 20,20 0,03 0, 0009
192.
0.) -Barfows 24 ne 2. 5 N, 20, 22 14,06.) 1,1236
02, id. D 20, 222% 22] 0,18 0, 0324
63 id. h 5 24, 21: 20 I 3, 1329
64. id. 2 5 20, 20. 20 0 ,86 0, 7396
65 id. = 5 207 20 20 I 21 1, 6129
66 id. S 5 20, 22. 20 072, 9029
67 id. a 5 u 0 2 0.15 0, 0225
68 id. © 5 20. 212 20 2,94 6, 4516
69 id. = 5 2: 20224 1,44 2.0738
70 id. 2 5 22 20, 22 0 ,69 0, 4761
71 id. ® 5 0 33 20 1,00 1,0000
nn ni B 5 28. 20. 022 0,4 0, 1681
id. 8 5 20.20, 22 0,19 0, 0361
74 BarEow.S 24 n%2et T. et, S, 24" » 5.8 20. 2. 21 11 123521
nal. . Ber
75 id. 2 5 5 20 202 0,02 0, 0004
76 id. - Do 2: 22 20 0,25 0, 0625
nn id. © 55 =2 20. 20 0,48) 0,2304
8 id. = » 5 202 202, 2 073: 7.0.5329
79 id. & 5.8 2a le 28 0,94 0, 8836
80 id. 2 58 20 2 A| 0 ,49 0, 2401
8l id. a 09 20, 20 20 030 0, 1296
82 id. = 55 22. 20.38 0.32 | .0,5184
88 id. 5.5 20:35. 20 075 0, 5625
84 id. 55 BB 2 2 0 „54 0,2916
85 id. DD. 23 20. 24 0,00 0, 0000
86 id. 5 19 220 34 3,78 | 14, 2884
CGaleutta Longitudinal.
1 7]. sets, 30. . 5 a2 ol 32 12.08 1, 1236
2 id. = 5 Sl, 233. .39 02,1 | 0,0289
8 id. & 5 802 3 30 01,9, 9.0391
4 id. 8 5 a2 932. al 0,59 0, 3481
5 id. @ 5 ale 38. 31 20) 0, 0400
6 id. > D el. 31. 31 042 0, 1764
7 id. = 5 ale 82 30 02% 0, 0729
8 id. ” 5 83. 30: 30 577 0, 5929
9 id. oO 5 20 22 50 0.45 0, 2025
10 id. 5 5 31:20. 30 0,64 0, 4096
11 id. .@ 5 30, 30.. 30 0 0, 0361
12 id. >» 5 20. 20,30 0,097 0, 3481
13 id. = 5 35. 30. 30 0,25 | 0,0625
14 id. 2 5 35. 30, 80 0,00 0, 0000
D id. > 5 sur 32. 3 07205 0, 0025
5 2 s 5 2, 2.50 0,26 0, nn
id. D Sr 30, 3] 056 0
18 | T. etS. 36" et Waugh’s 24" ne 1. 2 55 su. 32 30 0,36 0, 1296
19,77, 2 “ N. = 24 nel = De 20, 30. 34 0 ‚60 | 0,3600
e eu " \ Ba i z
el

vous sah eh

be

a hi hd ha
