og

V. — Espagne.

 

 

 

 

 

 

 

 

 

 

 

 

 

 

 

 

 

 

 

 

 

 

 

 

 

 

 

 

 

 

Vol.

INDICATION 2 DIRECTEURS
o % Inn! Imn 7
N Dre LATITUDE |LONGITUDE| EPOQUE ne INSTRUMENTS REMAROUES
Triangulation du Parallöle de Paleneia. (Sxite.)
207 KMatute..:......:... 41° 49! 42"| 15028" 9" 1866 Comm. d’art. Uriarte. Repsold n® L,
208 | Alto Oruz ......... 71 3029 1557 1866 id. id.
209 | Moneay0........... A) 47 13 | 15 49758 1870 Lieut. col. d’art. Uriarte. id.
210.1. Mores... 2........ 41,27 40 10 397 1866 Comm. d’art. Uriarte. id.
211 | Montolar.......... 41 38 2916 26 34 1870.-71 Lieut. col. d’art. Uriarte. id.
212 | Loma Negra ....... 42 419, 161829 1870 id. id.
213.) Bsteban.. 2... .... 4156 21) 10 43 15 1871 Cap. du genie Ruiz Mo- | Repsold C.
| 41 39 24 | 16 47 36 187] ee
214 | Zaragoza.......... e id. id.
a 41410|171220| 1er ni id.
216  Anndor ...,.. 72 4247 17,25 18 1871 id. id.
Zn Sigena.. ......., 2) 3950 | 1737 0 1871 id. id.
218 | Bone... ... 412 343 | 175912 1870-76 id. n° 1, Rep-
sold A.

ae ı A 37 3 18 IT 1871 id. Repsold (.
220 | Monsech-. .. 2 223,18 2620 1876 Lieut. co]. du genie Ruiz | Repsold 4.

4512118 4422| 1876 ae, Repsold C
22] : 41 45 22 ir id. epsold (.
een oo, 1 id. Repsold A.
a a0 1,0. 1876 id. Repsold €.
an 274 923 1876 id. Repsold A.
Se... 41 50 58 | 19 47 48 1871 Cap. du gönie Barraquer. | Repsold B.
226 | Se-Calm... ..,ı 42 730 |20 337 | 1868-76 | Cap. du genie Barraquer, | Repsold B, Reps, D.

a col. d’art. Uriarte.
221. | Matagalls. ........ 41 48 32 | 20 318 1871 Cap. du genie Barraquer. ' Repsold B,
228 | Roca-Üorva........ 2 a2 2 1871 id. id,
Triangulation du Meridien de Pamplona.
229 | Orzanzurieta....... 43° 1'192 16023. 48.) 1871 Lieut. col. d’art. Uriarte. | Repsold n® 1. Publids dans les
220  Berisin:;....,.... 42 53 18 | 15 41 32 1868 id. id. en
2 Bla... ... 24%, 16 09 1869 id. id. de, a
232 | 8. Bartolome....... 4233 48 | 1547 10 1868 id. id. IH. Madrid, 1831.
233. Misas.. 2... 42 25 44 | 16 10 46 1869 id. id.
234, Berta... 22.200.208 a2 855 5 aA2 1 1868 id. id.
285 | Herrera. ....2... 2110 9 10340 1870-71 Lieut. col. d’art. Uriarte, | Repsold A, Reps»!d
cap. d’art. Cabello. D°. 1:
236 | Santa Cruz........ 41 0650 160 65 1870 Cap. d’art. Cabello. Repsold A.
237 | Valdellosa ......... AU, 53.30 | 10 18 50 1870 id. id.
238. Aeulla ......2..... 40, 52 14 1554210 Sl Lieut. col. d’art. Uriarte. ' Repsold n®].
239 | Ouerda... ......... 2,1 6 20 1876 Comm. d’E.-M. L. Puigcer- | Repsold D.
ver.
240)  Belado.. .:... 39 44 571 10 1740 1876 id. id.
241, Oallejas ......... .. 39 37 32 | 15 50 56 1873 Comm. d’art. Cabello. Repsold A.
242 | Moluengo.......:.. 3929 17116 13 39 1876 Comm. d’E.-M.L. Puigcer- | Repsold D..
Vor
le 39154 |162051 | 1871. | Cap- art. Cabello.  Repsold A.
244 | Asomadilla ........ 39 14 21 16 1 55 1871-75 Cap., d’art. Cahello, cap: | Repsold A, Re)s. @.
| d’E.-M. L. Puigcerver. |

245 | Molaton........... 38 59.27. 16 1529, 1871 Cap. d’art. Cabello. ' Repsold A.
246 | Chinchilla.......... 38 09.8 1556 38 | 1879.16 Can. d’E,-M.L. Puigcerver. Repsold D.
2A | BUT ............ 8 9172. lo 455 N 1866 Cap. d’E.-M. Ahumada. | Repsold C.
248 Espuna ............ 875147 , 0 5,50 | 1866 id. id.
249 | Gigante........... 37.44 24 | 15.41 22\ 1366 id. id.
200) | Dalayon.......... 30 88340 | 16 816 | 1869 id. id.

 

cd which huhu che a

 
