AP!

IP PEU.

_ 885

= 387
388

- 396

ET TPE TOUT

Te

TOT UN ORR OTOH WaT CTE

Tw

ge OTC OLED LLC AT unless

383a

384

386

389
390
391
392
393
394
395

397
398
399
400
401
402
403

43

 

 

 

Oesterreich.
Indication des Latitude, Longi- Epoque. Directeur Instrument. Remarques.
Points. | tude. et Observateurs,
Visokl kamen ~| 49°56’ 6”) 42°50" 18" 1875
Jzwedi 3 49 49 12 |43 6 36 1875
Ostazowce ..... 49 39 54 |43 0 36 1875
Zembowa...... 49 42 42 | 43 16 30 1875
DojJzanka...... 49 32 36 |43 9 54 1875—76
Kane > 49 23 18 |42 51 6 1875
Mogila . . . 49 16 18 |43 5 48 1874
Kilbassowa . . ... 49 22 54 | 43 19 42 1875
Skale 0 35. 49 30 24 | 43 86 36 1875
Grzimalow mogila . | 49 19 24 | 48 37 48 1875
Bohot 3.3. 3... 49 11 12 | 43 49 54 1875
Kobilowlohy ..../49 11 48 | 43 27 24 | 1874—-75 - 76
Petlikowce..... AO SON AS) 0.29 1874
Rzepince ...... 49: 0 18 | 43 10 36 1874
Czortkow...... AQ u | 43 2a 4 | 1874—76
Probuzna...... 48 59 48 | 43 41 30 1874—76
Slon@.: 224. 2. 48 50 0 43 19 48 1875
Kunisowce ..... 48 49 18 |43 318 1875
Korolowka ..... 48 45 42 | 43 37 6 1875
Metnica =. ... 2. AS 370 0,415 22722 1874
Horodenka..... 49 80 19 148 9 © 1874
Gwordiee...... 48 35 30 | 42 54 36 1875 -
Kuhotowa ..... 48 28 48 | 43 16 48 | 1875
Visoky obie . 48 25 0 | 43 6 30 1874 !
Brio : . .. .... 48 26 12 |43 37 48 1874—75
Dozuko :; .. ..... AS 18 24 143418 12 1874—75
Czernowitz..... 48 17 54 | 43 35 36 | 1875
(Observatoire)
Cocina 2 +=. 3s 48 17 48 | 43 30 42 1874—75
Roptura. 2. 48 17 18 | 43 17 48 1874 —75
Plaipantin ..... 48 8 6 |43 33 24 1874—75
Arsica 2 48 3 12 | 43 43 30 1874—75
Fondatura ..... AT 59 48 | 43 32 42 1874—75
Petruska ...... 47. 570. 36 143 8 18 1875
Zaranka— = 3 .... 47 51 54 | 43 47 48 1875
Orsoe:. 2.2 322: Al, bl 76 41331 30 1874.
Base de Radautz .| 47 54 24 |48 29 0 1874
(Terme Ouest)
Base de Radautz . | 47 53 48 | 48 32 36 1874
(Terme Central)
Base de Radautz .|47 53 6 | 43 36 42 1874.
(Terme Est)
Szathmar: 3c... 47 47 36 | 40 32 36 1867
Nagy Karoly....|47 39 36 | 40 7 48 1867
Mihaly falva . . . .| 47 31 12 | 39 48 6 1867
Nagy Leta . . ... 47 22 48 |39 34 0 1867
Aranhegy...... 47 448 |39 37 42 1867
Varatijek...... A7. 119 |40 954 1867
Ejszakhgy . . . .. 47 9 12 | 40 46 12 1868—71
Ciclu lui Vultur . .| 47 23 49 | 40 19 42 1867
Tarnıtza 2... 47 37 30 | 40 48 48 1867
Gutin ass: 47 Al 48 | 41 31 48 1867
Dialu Zsimg . . . .|47 23 18 | 41 23 48 1871
Babgyi 0. 47 6 18 | A1 18 48 1868—71
Dmubalives . . . .. A 1 54 21.4542 1868—71
Gsibles +... 4755 18 44759, 42 1871
Viraner Stein . . .| 47 13 36 | 42 11 42 1871
Pojana tomi . .|47 22414227 6 1871 |
6066084... 4.05 47 14 19 | 42 32 36 1871
neni aces. ...|47 31 36 | 42 33 12 1871
ONS0f.. css à 747 28.0 4255.36 Sek

 

 

 

 

 

 

 

 

6*

 
