 

Datum.

ı89ı Juni 19
Juli zo
Aue. ı5
Sept. 17
Det, a7
Nov. 14
Dee.-ı9

1892 Jam. 16
Febr. 16
März ı6
April 18
Mai ı6
Juni 14

Monatsmittel abgeleitet aus den Tagesresultaten auf pag. ı54—ı55 des Appendix No. 1;

Report for 1892.

Jahr.

1891.

1892.

Coast and Geodetic Survey.

47
55
62
7ı
79
87
97
04
13
2I
30
37
45

Polhöhe.

218 16,

24.50
24.24
24.19
24.12
24.15
24.16
24.28
24.31
244.150
ru
24.69
24.62
a

 

24.39

Paare.

204
149
250
154
122
164
272,
185
259
208
118
216
127

2368

JA

Abweichung Reduction

vom Mitte. Ch.(s2);3r, 9

Preston.

—olıı —0.08 +0703
—0.15 0.06 —0.09
—0.20 -+0.16 —0.04
—0.27 -+0.25 —0.02
—0.24 0.28 -+0.04
—0.23 40.25 --0.02
—0.11I 0.14 0.03
— 0.08 --0.03 — 0,05
0.11 —0.11 0.00
40.34 —0.20 0.14
0.30 —0.26 0.04
—0.23 —0.25 — 0.02
0.16 —0.20 —0.04

dl maus.

 

 
