 

u

XII. — Prusse, B, — Erreurs de clöture des triangles desquels ont &t6 mesur6s les trois angles.

 

N. D’ORDRE

63

 

 

 

 

 

 

 

i NOMBRE
LECTURE DES ERREURS
AUTEURS DES INSTRUMBNTS an NOMBRE esyantons, Dr Uno
EMPLOYES non: DES EXECUTEES DE
ET VERNIERS POUR CHAQUE A? REMARQUES
DIAMETRE DU CERCLE N OU DES CHAQUE ANGLE | TRIANGLE
HORIZONTAL MICROSCOPES on A
MICROSCOPE CHAQUE
DIRECTION ee
15 zölliger Theodolit von Ertel (Thei- Ablesung 4 Mikroskop- 24 0",098 0,0096 | Veröffentlichungen
lungsdurehmesser = 355"m), mittelbar von | Mikrometer. nzund n.]2,
'/ sekunden.

id. id. id. 24 1",706| : 2,9104
id. id. id. 24 0,749) 0,5010
id. id. id. 24 0,254| 0,0645
id. id. id. 24 0,711 0, 5055
id. id. id. 24 0,190 0, 0361
id. id. id. 24 0, 075 0, 4556
id. id. id. 24 0,374) 0,1999
id. id. id. 24 2.09) 1,292
id. id. id. 24 0,641 0, 4109
id. id. id. 24 0,001 | 0, 0000
id. id. id. 24 0,800 0, 6400
id. id. ld. 24 0,360) 0,1286
id. id. * 1d. 24 0,580| 0,3364
id. id. id. 24 0,748 0, 5595
id, id. id. 24 0,247| 0,0610
id. | id. id. 24 1,296 1, 6796
id. | id. id. 24 2,040) 4,1616
id. | id. id. 24 1 , 869 3, 4932
id. | id. id. 24 1 ‚292 1, 6693
id. | id. id. 24 0,401 0, 1608
id. | id. id. 24 0,394) 0.1092
id. | id. id. 24 0,266) 0,0708
id. | id. id. 24 1,208) 1 159
id. | id. | id. 24 1,062 1, 1208
id. | id. | id. 24 0,389 0,1513
id. | id. | id. 24 0,193 0, 0372
id. | id. id. 24 0,168 0, 0282
id. | id. id. 24 0,416 0, 1731
id. | id. id. 24 0,458| 0,2098
id. | id. id. 24 0,82 009
id. | id. id. 24 0,167) 0,0279
id. | id. id. 24 1,808) 3,2689
id. | id. id. 24 17,921. >, 159
id. | id. id. 24 0,079 | 0, 0062
id. | id. id. 24 1,024 2, 6374
id. | id. id. 24 1,254 1, 5725
id. | id. id. 24 1,458. 2,1258
id. | id. id. 24 0,679) : 0,4610
id. | id. id. 24 0,788| 0,6209
id. | id. id. 24 1,086| 2,8426]

 

 

 

 

 

Rasa hu,

uns ss lhu Muh An

cn Lk Ana nk

 
