 

  
  
 

 

 

     
   
   
  
 
 
    
   
 
  

 

 

28 Antelope, Utah. . ..:. >

      
     

| 29 Taku River, Alaska. . »

 

 

 

 

 

 

168 38 13,0

0 00 38,5

Ir

11

 

»

O.-B. French.

  

 

 

 

 

Erreur en '
STATIONS DIRECTION Azimut. probable. OBSERVATEURS ie
| ft
4
a
| 91 Mount Ellen, Utah . . Mark. 342 18 06,5 | W. Eimbeck, p
| 22 Ogden observatory sta- » 190 03 57,2 ‘ip
tion, Utah :
| |
| 93 Mort Morgan, Ala. . - » 267 84 26,4 #49 J.-B. Baylor, | 'p
| |
| 24 Yakutal, Khantaak Is- > 0 00 19,5 J.-H. Turner, | ly
land, Alaska. : | | |
if
| =
I
| 25 Waddoup, Utah . . . > 339 14 058 W. Eimbeck. bin
| |
IR
Il
Had
26 Promontory, Utah’... » 140 50 44,9 » | |
| 37 Deeret, Utah. - . . . 183 23 09,8 Ir
La
| li
ll
nt

  
