 
  

ÜBERSICHTSKARTE ver MESSUNGEN ner SCHWERRRAFT.

CARTE SYNOPTIQUE ves DETERMINATIONS pe ZINTENSITE
DE LA PESANTEUR.
1900.

 

 

 
   
   
             
    
    
      
  

de | —

   

Sika Ne fy |
Net Wrangpiz

q

Et. Stimpson

   

 

 

 

    
  

 

   
  

 

 

 

 

 

 

 

 

 

 

al SI
D s\! \ \ 7 =
| : \\ Ganges | © \ 1
2 band d 2 —
N rio deCuba I) © le C atta \
Jamaica S Do LA Badgaon _ a, N
> © | ® \ & mi: \ A |
\rort-Ro al Borba 2 | \Ran, S| By \ \ Maria a A
OL e Charette) LS | 8. \ \ oe Guat \ À \
> = U | Bang: S \ \\10| À |
Mangalore % Madras } \ À
4 ise le | | |
Minicoy® | 1 1 |
Golomb® À

Ceylon

) Panganı
Sarisibar -

  
 
 
 
 

 

 

 

|

~~ Caroling Island.

 
 
 
   

 

 

 

 
 
    
  
   
    
 
 
  

\| Moatrosi}
EE, Stich?

 

 

N Du Se © ir) À

 

 

 

 

 

 

 

 

 

 

 

 

    
 

 

 

/
PR Fe = / / : 2e ¥
Peete he

 

 

 

 

 

29 Sr
2 ange Von.
ose? = Creep

 
  

Siidpol %

  

LIBRAIRIE ET IMPRIMERIE CI-DEYANT E EB
CI-DEVANT E. J. BRILL, LEIDE, LITH. MULDER, LEIDE.

 
