 

 

 

 

 

 

 

 

 

 

 

 

ge {
me.» i
———— = |
| © 2 E
DESIGNATION = > NOMS ERREURS PROBABLES =:
i © a LONGUEURS a F
DE LA BASE | St DES OBSERVATEURS et relatives
<= |
Base de Radautz (Gallice 1874) R. de Sterneck, Tuma,| 2436. ... | Non calculées.
ni "| ; |
Autriche orientale) baron de Magdeburg, |
Mayer.
et Base de Kranichsfeld (la 1875| de Ganahl, Hartl, Brüch, | 1502"...
Hongrie. moitié méridionale) baron de Magdeburg,
Trojan.
ne | | =
Base de Königsberg 1834| Dessel et, Daeyer. 9347993124, «kr 0,936
| A
863.500
(Voir: .,Das rheinische £
Dreiecksnetz, Heft I, die =
| Bonner Basis.‘ page 16. } =
Base de Berlin. . . . 1846| Baeyer. 11198723032 2.0763 ;
| 1 f
| 1.375.100
| (Voir de même: .Das
rheinische Dreiecksnetz
| u, 8 w." page 16.)
|
Prusse.
|
! |
| i
|
Bate de Bonn . . : .|1847| Baeyer. 11094!844025|  * 01535
| | 1
| 1.709.300
|
|

 

 

 

 

|
|
