 

SEEN SEITE

ae

EEE SEE,

EN ENTE

 

 

22

Triangulation de Liaison de la Base de Bone avec la chaine primordiale.

Indication des ide | Longi- |
Points. tude. |

AGORA
Bon Aboed . . . .. |
Bolt . =... :
La Mafrag.....
Bone: :.....
(Phare)
Edeugh i. . . 2...
Base de Bone...
(Terme Nord)
Base de Bone...
(Terme Sud)

 

.| Base d'Oran.

 

 

Triangulation de Liaison de la Base d'Oran avec la chaîne

(Kahan. ....... | |
Tafaraoni ..... | |
Tour Combes |
Mangin.-..... |
Santa Cruz |
Base d’Oran.

(Terme Etoile) |

_ (Terme Azereg) |
| | |

Epoque.

1867
1867
1867
1867
1867

1867
1868

1868

1867
1867
1867
1867
1867
1867

1867

Directeur
et Observateurs.

Commandant Versigny.

Capit. Boudivenne.

Capit. Perrier.

Instrument.

 

Cercle répétiteur No. 4.

primordiale.

| Théodolite de | |

 Gambey No: 1 |

|

Cercle azimu-

|

| |
|

 

 

tal de Brunner.

Triangulation de Liaison de la Base de Blidah avec la mer.

Donera ....:..; |
Melab el Kora. |
| Matifon ...... |
| Rusgonia...... |
La Boudjareah. |
La Maison Carrée: |
Alger en

(Phare) | | |

 

36 54 13.325 25 26.3
Nemours ...... 35 5 49.5115 48 51.3
Era ..... 134 51 13.823 23 15.4
Layhouat...... 33 48 1.820 32 32.3
Geryville...... 33 40 51.518 40 24.1
Carthage . ..... I Bl 6.527 59 6.4

gen... dou 8 7"9120°42’35"5

1860
1859
1860
1860
1860
1860
1860

Capit. Versigny.

\\ Théodolite
No 13 |
\ Cercle répétit. | |
No a4 |
Gals No. 13.|

Se N |

4,

n

remarques.

 

|
|

 
