 

 

 

 

 

 

 

 

258
o Auteurs des instruments Lecture Nombre Nomis ie u de
= | : en observations À
5 employés secondes ues exécutées pour clone ae
S N : verniers P chaque triangle] A? Remarques
ns) et diametre du cercle du vernier du des chaque angle A 2
2 Lo ou du net ou pour chaque
orizontal se microscopes ER
microscope direction + |

4 | Starke de 27 cm. ® 2M. | 36d 36d 36d | 0,126 0,0159
42, id. id. id. 36d 36d 36d | 0,844 = 0,6577
43 id. id. id. 36d 36d 36d 2,112 | 4,4605
44 id. id. id. 36d 36d 36d | 0,294 0,0864
45 id. id. id. 36d 364 36d | 1,184 1,4019
46 id. id. id. 36d 36d 36d | 2,575 6,6306
47 id, id. id. | 36d 36d 36d | 3,297 10,8702
48 id. id. id. | 36d 36d 36d | 3,046 | 9,2784 |
49 id. id. id. | 36d 36d 36d | 0,743 | | 0,5520
50 Starke de 27 cm. - Repsold de 27 cm. | id. id. | 36d 38d 39d | 10,417 | 0,1739)
Sl id. id. id. | 34d 34d 414d 2,188 | | 4,7873
52 id. id. id. [sid 34d 27d | | 2,838 | 8,0542)
53 id. id. id. 36d 34d 34d | 10,825 | 0,6806)
54 | Reichenbach de 32 cm. De AV. |20a 26a 30a | 0,584 | 0,3411
55 id. id. id. 20a 22a 24a | 0,270 0,0729
56 id. id. id. la 262 22a 0,024 | 0,0006
Bz id. id. id. Q4a 28a 20a 4,972 | 3,8888
58 id. id. id. 92a 28a 22a 2,092 | 4,3765
59 id. id. id. 24a 20a 20a 1,048 | 1,0983
60 id. id. id Qha Wa 22a 0,089 | 0,0079
64 id. id. id. Q4a 20a 22a | 0,222 0,0493
go |J Salmoiraghi de 40 cm. 1" 2 M. 36d 36d 36d 2,881 | 8,3002

|Starke de 27 cm. 2 id.
63 a de 40 cm. 1 id. 36d 36d 36d | 0,421 0,1772

Starke de 27 cm. 2 id.
64 Salmoiraghi de 40 cm. il id. 36d 36d 36d | 4,090 16,7281

Starke de 27 cm. 2 id. :
65 ea ae de 40 cm. il id. 36d 36d 36d | 4,855 23,5710

Starke de 27 cm. à id.

Ibis,
Jonction de l'île Sicile avec les îles de Malte.

| oi de 40 cm. | 4 2M. | 36d 36d 36d) 1,485 | 9.9058

Brunner de 42 cm. 2 4»

Salmoiraghi de 40 cm. 1 2» id. 1,601 2,9632
2 Brunner de 42 cm. - 2 A»

Starke de 27 cm. 2 2» À
3 oo de 40 cm. 1 2 » id. 4,094 |16,7608

| Brunner de 42 cm. D) 4»

 

 

 

 

 

 

 

 

 

 

 

 

  

nr gta i) ae MT Bet

ak nun Hat

ton!

ju th sin ell dei il sayy

i
1
|
|

 
