 

 

 

 

 

 

 

 

54
D  ,
ERREUR
Slot SON: DIRECTION. AZIMUT. OBSERVATEUR.
PROBABLE.
II 2 | + .
3. Termoli (Point trigonomötrique) . Torre Penne non calculé | Nobile
| |
4. Termoli (Point trigonométrique) . Raccolo | do. | do.
5. Termoli (Point trigonomötrique) . . | Clocher de St. Martino do. | do.
6. Lecce (Extrémité Nord-Ouest de la |
Base) Il Pizzo 190° 42'30”5 Æ 014 || Lorenzoni
1190 42 29.5 |
7. Napoli (Pizzofalcone) . I. Camaldoli | 302 22 47.10 Æ 0.16 | De Vita, Arabia
8. Li Foi (Point trigonométrique) Acerenza 50 23 55.40 = 0.17 || d’ Atri
9. Castania (Point trigonométrique) . || Phare de Milazzo otk =o 16.26 + 0.24 || De Vita
10. Guardia’ Vecchia M. Sacuri 1156 51 1.34| = 0.27 || Magnaghi
11. Cagliari (Tour St. Panerace) . . . |M. Serpeddi 43 48 29.37 = 0.12 | Magnaghi
12. Genova (Observatoire de la Marine) || Semaphore de Portofino 17 87 8,8 = 0.24 | Lasagna
13. Pachino (Sicile) . en nl. || Mezzo Gresorio non calculé | Magnaghi
14. Arcetri (Observatoire de Florence) . || Monte Senario 21 36 29.90 = 0.13 |Gra, Mira, Mansueti
|

15.

Milano (Observatoire) .

 

 

Monte Palanzuolo

 

 

 

non calculé

 

 

 

 

| Rajna

 

 

 

ul et
dan d
alt fit
| aa du
des pase
Yas nétho
net
| Pitor et }

 

 
