TEE

        
 

48°

JISUIPOT

NN.

29 €0#

222277777772

 

    

 

     

 

  
          

 

 

 

  

    

         

 

 

 

 

 

©

| -
Re PSS
1606 | 72049 _ vy a
| Ceres | | ‘ ,
{ 6 | re \
: | ee 5
| 7 ee
| \ Ps x
i I I? "
4 > ! J x -
EO GG ee a À 2 [St ery gt st et
On LIE wahu gy | “a
4 rd
i
I
4
zo
Tre UOT | £
EE ‘ 5
on 0L9 | WILUSIIL S aA
. N
er oY a À:
D hg 6 AY
N op
a nn | :
© /L089 | wa ISITTIUOLT be .
= | NS .
: Pas?»
ioe À Ne 72,
i > Vy %
Y2 | SQ £ Le
se ky ‘ON à IN Mp
a oe “Ee? ~
{ | ow f Mer | ty LE 7
= SLOCL | wahurjor . > Be, \
| S A SD ) 7; =
COD | Ÿ = a wwe” S
= à Se | ys en
ne © Aut SS
pod nn re nm. mm me dm ne ent vai a ds ds min ne lon mscmm ses esse E a
_ IE | : EN f
_ & GOS | , 2PPISTEN 3 x
ri | S a ann, :
Es) | NS | / Sn Fo "à
to ne.
> | & & / 5 Y =
| Ÿ ® 4 ‚A A
| S EE à S
u _ nn. on à a ia» | N
D 6COSTL | * JOYHLIQVIAT  Sge. | i 5 Ÿ Sn
| SOY bLIGP]2.T È u 2 5 Y
~ | + \ Ff à =
a | j D 2 Ss
De “1 a 8 Bi
oe | S 9
u | ein m Ÿ
Ce 000 IE nr EEE ER NE EEE 4 | 2 '
. 68 WALL PUD] SUTDYIP wl
« 7 :
fae = z u
À 5 © 3
se | a 3
ee .....% a. = % ‘on 5 &
HuNglad gy ~ & 5 Sn
. « = a 5
% 5 À
Eu, | @ A =
= . ._ b= “4h © ‘©
WASH 2 mM, PF
na o %
“N We :
2 u
a «
® © u
%

| 724704 2290.

00000

urayy

7:2000

 

 

Langen-1
hen

 
