 

mir [

 

fm Lahm -_ ee

 

 

 

 

 

 

 

 

 

 

 

 

 

 

 

 

 

 

 

 

 

alters Se e EEE Br
ze SEN oe ao neo Su A]IT 0061
a a 006T a X ge ‘gOGL HOLE
S 2 — sn Su TAX 'geL ‘0061 IUomog Ba eo 9 ON TEN a
| 2 yQ TE | |
lg 1ouary ne uormpoy OMOUELOSUY | | (worpag-zuarajoyr)
0 | 0 wegsÄg I | | | Ess : / Kyo = 66
| | | sıs sıesıs | as| 0 [vrs [ST |osreer| yarse hmmsursÄudiohien |
| + | 208 | «
ZE EU eprug | | "8198 EI SUSIE 86
Us EEE ‘e)\| — Io) 018 | s’c OFL vs 5 «

+ @ + | 18 |eost| mazeurs uno en 0 lot Im | orser| ec ug) 12
I: Im * | eprug m nzrungg ‘oluris | ebh a | | es emyeure « 9%
; | | lin. a: ro EL | FE6EL| sel anyeuey]
“ + Its + [el N a a : | : eureAtgonyug “ <6
: | | en s61 Ge ol |. oser oa i
m a | 2% nn am 06T. nzrwgg oluryg N 76 A | | N ii ouoyIpf ce 5%

| | | n 3 | o; 6 0m | oe Koßt “
a. -|09 a In © 0 |soa  |rr | .eoer| wor wosun 80
. a on + | 191 “ |ewwop] nm epiyg nzumyg| 124, | | | | zen] a ee
| | nn | L BC 8eT | #4 N

I + TO6T | 'n nzrurgg ‘TumIg “ofurgg | 008 IE 108 on | oe
LB nr | | mar {nsotp \ | ec} 8% 0 984 gg age] OT | s #16
een 3067 | Tznurug on LiL Bi | | |
“ | | | | sg | LHSEeL| gT SE 2 2
0. ae Rare MODE a a 68 | ser Fe egonziug - 08
5, ln + | « | epryg 'n tULIO eiems OL} | | | ir Z er

| | en 18% se| 0 lu. |s2 | or2e vie 11ez20 |
wre + een TO6T | m nzrunug eo in » | zömen a 7
| Ä Sr Eh »a| 0° 99. 19 | cur a & 1
du 3067 | u nzunggolurggegorsen | 694 | 8 9EL, 6% Q
0 \ | h + oo . (euro Nas Name) u 68, a, . une © L
| “ug es 69% el g% 0 1298 ıe | er2EeL|.6%% USSIBNIST 9
0 + + ee u nm | z 5 n
A | | anal "n Tyso IH : 1EL VE | 0 eEl, @ GT SET | ger OSCyIN Gi
G nn + | 861 “ | nzrumgg ‘olurng er : | WITgSOALFT S PL
| | r . ’c% ® “
| 5 = 569 & m azrugg olurgg‘ vyousen | 069 069 4° 0 nn . e a sn en n eT
z z og “ | 1usofgp m nzwurrag ‘oAuıyg S | 2. n n 189 ce | 6ZıErL| For monseunet : ai
CE | te. 2.019 S £ - 5 en I
| "N BWWUO ee 189 &89 2% 0 619 FL FH IsL|ı SS 78 ee urdep IL
Im + |St +:,90 SuoL|, Denon Bam = | el . #01
ı 1% Si 2 047 I. 208% es) 0 |6W# — 8seTar gııTe u a a %
Gere Ks : I 5 «

“ + | ggg « . I68 | 30% c 0 |ıse deL |S’LL#LL| S’seog | ‚del 'sıey SS 6
0% el v6 : : : - - ‘del ’stey ‘ıse 5 8
. ec. ee > & OrE6L6 | 8EE6L6 | 0 |sT8E626|E88T S'FLSIL| TSToe en

ah ss % « 684 £6L Me 0 ge | SOLFIL| 8'8LES -wArosgo a wuryg
7 > er def -stey ‘o1odegur - |
= 2 : ® . “ . IS |u9IPUJ-I04UIH 9
Te00 + | 6500 + | 670816 |E06T | -wwer pun ung ‘olumsi s60'8I6 | 00T'8L6 | 16 0 760 | I® 8,09 E01 ILL L°steg
. aoyreqgiy atenoN 'QIIIAX
w wu |
Ri wo wu = = n es 94 6 ES = S S = = 5:
R = = 9 _ zo s 8 3@ x 5 5
ondn = as surwiapsop| sms [WE |sFL lu: 3 © | more | wong zop sweN | 'UNVI |0N
Vol og) am B ao4fpwgoad a a ei SS “| 20
= 2 am g ey ans nn I = ES. \ Es ® E| =8
| > | 3 er se = © =

 

 

 

 

 

 

‚ao4q9ego9g ayasıueder
"IIIAX olTqeL Iop JuUnZJ9sJ10T

 
 
