 

90

24. Station Hovhdi.

A = 56° 38 41'4145

Lysnet i
Rold Bavnehöi.
Muldbjerg :
Hegedal Bavnehöi

i= + 2° 34° 3178289

Log. d. Entfern.
in Toisen.

Azimuthe.
2.19 29.09 4.1925856
141 28 09.97 8.0528357
208.15 08.97 4,2334235

298 155 20.00 4,2901119

25. Station Rold Bavnehdi.

“56 460039262
J&gerdalshöi
Muldbjerg
Hovhöi
Lysnet

{= + 2° 45° 13°1574
173 30 50/51 20900907
259 21 531.88 4.2010412

21 19 13:90 3.928357
348 07 32.71 4.3627314

26. Station Muldbjerg.

D — bb 94 9016644
Hovhöi

Rold Bavnehöi.

Jægerdalshôi

Storskoven . .

Hegedal Bavnehöi

= + 2° 18° 58'4754

28 28 wii 4.2334235
59 43 50.10 42010412
94 16 51.38 4.1437768
176, 25 58.17 4.2224929
331 15 49.85 4.3970945

27. Station Jægerdalshôi.

A == 56° 55° 3373238

. Tise
Storskoven .
Muldbjerg
Rold Bavnehöi.

I 0. A, Schiecs
180 01 30°27... 48174015
220 14 50.61 43141222

273 54 30.49 4,1437768
358 35 09.05 3.9565997

28. Station Storskoven. :

À = 00) 12.021152

Jegerdalshoi
Tise
Teglhöi .
Flade .
Muldbjerg .

| nip 10% 52"G024

40° 36° 28"29 4.3141222
114,06 48.8. 4.1526573
168 .45 24.83 4.2258282
208 23 45.92 4.1591936

+000 248 9,04 4.2224929

Medias it Abs

118814111188

url.

ak nl

A A han 11

à us theme ds ha

2. stats masse DA |

 

 
