    

 

   

 

 

   

 

 

 

  

 

  

 

N Zobten
| Le
kelett zum en
EG \ \
LZ a | N
BS i A | x
% a a IQ Z \ N
Generalbericht pro 1868. a
DAS \ x
NEN N, | x
\ N \ \ N
\ NER \ \
\ N \ \
\ > | \
x KEN \ N
Dreiecke in Mähren und Oesterreich, I \
ae | \
CHERE N | N
ai ( à A \
j prone Teor 4 N \ \ Ne N
Mafsstab 1152000. = N | ve.
\ <
=, ss skoppe N | \ R \ En
Er A OR \ CR x
a x | i = Wachofskoppe MS
LA | ea N \ ys \ = u if
rie + — Sal / \ N pa 2 2 {
a 5 i À ue
ER
-9_Psov
: / N
re / WE
> Ae // yy EN N,
a | \ + \ =+—
LS | \ 1 uy jd
eae | N “ 2 ren, S
\ ee Lay’
= N / 09 i Lee |
\ x N / In Hurley
\ IE | NX 7 Wie oY,
\ X | \ we
\ Sw N /
\ sb Sbalava 3 N
\ 3 \ |
\ de \ ys ei
a \ EE N
\ IR \ f N
SE \ N N N \ RN
_ \ N 1 x DR]
ah elechaw à AN \ x | Lissahora®
>> SSL N Ne | : 1
ar \ \
a) x | 2 !
\ | - /
/ ne i 7 Hi
y N ue
Javornik Ks /
. . \ A A | IN :
_j Jridnik N En, 7 | N NEN, 1
AN res Vee / HE a ES
# N a HOY Ny / AZ Imbro zug es 1 N ;
A \ 2 X Soitaber. N à !
N N Vix J | LA \ 2 | \ /
a \ fer i N / | N /
fe 7 74 \ N \
7 Yh 74
He 2 7 vo | |
| N ; / | FErTVen:, à N
\ Y pu \
| N / | --____ \ | Gservene
| \ / a X
| N . % u 7 | 77 a
| 7 4 > VER à
| a f Ser
TVeternik DA Re
| a | Ki) | j
/ { NEIGEN HL
JA | \ N Ve
| | SENN
‘ | > A 27 openik
Schöninger . er
x oh 5
| ‘ | Hy D
| & i 4
| are
| N Ban DL = /
| Kohaue i
| = A
| \ ed >>
/ | / 7
| } / \ / >
| SZ \ |
LEN \
Sams | GNS L os
SSR \ 3’ \ Dents = A _
> el Bt: | ae Ju  CILO ET
D Poe | NS eG
ISternstein | > N — \
/ | 7 | N Tr N \
| ae D
| A yy, | N / FE
2 4 Va | \ i Sn :
/ N | NC i Rachsthurm
| y YA | N ! \
= aay y aa
K. Kuhenod > | / | x N >
IN | Taner | 2 | N 4
À uy, Ya | x va |
à N ( jj
\ | | 8 N \ /
\ | N = iff \
: i | N i Hea
/ ee \ SS
N rl N Hundsheimer B
gu = AR Berg N ae lan {
ZEN > } 1 7
à : 2 N 9 nine er A
Sternrvarte Kremsmünster N A A À 7 3 Nae
\ JSptndeleb DS Ney | AA :
ry OF eleben : 5 N) ; i à
Nov ee FE, N . | \ ah — beobachtete Richtungen
\ >) tbe l ye A x
\ = are Dische | 7 ! | nicht “
IT N Dar en H obey wl | A) Ui
\ \ = | ar N O astronomüsche Stationen
\ y sl Tor eee 1 À DE Schneeberg. Le ET ; o Stanpfeiler
2 an | a i 7 . a
\ = NOSE \ / 4 ‘ z K a Pyramide mut. holiernen Instrumentenstand.
6r.Priel P Rosalia Kap.
\ 1 FE D
ly u
S Hochschwab

br Burgas

3
Lugarer

 

Wechsel

Lith Anst.v. Leopold Kraatz in Berlin

 
