ne = z nin Fr Ines ini een ln dan am OR NT

 

 

 

à ; Fr
es
Se +
hear N
aS +
LACS
RAR t
ss ‘
oe
>
ERS $
ER
>
ar
x 2 x
ER
=”
£
M xy
ER
R x
des (
Be...
f ZB
ae
oe
Be
SS
F a x

 

RNCS

Bo

es
1
SER,

er
ek

Bo

 

 

Hee

 

 
