 

 

Berechmmg der Quoten von X (Gaulsheim bei Bingen) und Y

(Niederrad bei Frankfurt).

Sollen auch X und Y als Knotenpunkte betrachtet und Normalgleichungen da-
für aufgestellt werden, so können wir, nach Einführung der bereits ausgeglichenen

Quoten setzen:

Quote v

onA= 87.7301 +a
D= 98.00945 + d’

29

5 X = 35.9305 de X (nach der vorläufigen Ausgleichung des Beobachters.)
| @ = 139.0488 = 7
0 on — 107.1582 + y (desgl.)

B= 87.0109 +0

daraus ergeben sich, an Stelle der Fehlergleichungen fiir D’A und GB der früheren Aus-
gleichung der 4 Fehlergleichungen des folgenden Schemas:

Vorläufiger

Höhenunterschied Beobachtet LKilom. us

gu

gg

 

 

AX 2.1996
DX | 1407895
GY | 24.8901
YB | 20.1473

ar

| | | |
De 278 07 =a! —@ | 0.359 | +0251
don Cd | Li 0 > | 0.166 “| “0.101
24.8937 | gig | 36 =g—y | 0457 | — 1.645
peo, 5A 6 ey pl | 0595 | 1.027
Normalgleichungen:

— 0.442 = 0.525 « — 0.251 d — 0.191 d’
— 0.618 — 0.852 y — 0.457 g — 0.395 D

Dis = 6 — g —d = Null, so wird:

Aachen,

x = — 0.80 = +02

den 26. September 1877.
Dr. Ch. August Vogler.

Für die Richtigkeit der Abschrift
Dr. Hügel.

 

x
=
à

=

=
=

a

a

=

=

È

x

al

ah nina

to NN

AAAI ma 11

It 4 allo bts ha

 
