  

MAIL AU LIL i MIT mr It OTT PEO) eT

Pi re u M
F
| | | | 19197 | -uossoWwos [EWIOMZ
| | ‘sorpuy 66ST
| Ge D
‘ApINA uossowos [Uu-g 10pol uouop uoA | . ZIEMUIQ |
= | | [73 7 ; | ‘ D \e
91104998 lou, 4 Ul opium siseq oi | se | Fe | CLIC SPPP yoourleyg wo A jodourey, toq sTseg "88
| | | |
| ; | | a
‘OPIN UWossowles [vUI-g = | | | TOTX19 A UOSSOW0S [BUITOAN,
Joyopom “UsjUNoU sop awyeusny ru Soy | | | CN CEE E LEST ..
“UISSOU9S [EUL-8 [LOU], Iopel pun “royg ı © ZIEMUOS |
. . : ce = € f 2
-93 ofloyf, SI ur opıma sıseg ICT S a de = ZHST 8688 [ey IVUI}VZG 10q sıseg ‘TG
— = |
a“ “eu “9 a“ < Es |
“u DB. NES TEAS a“ Tl Il |
u ICH UBS Sir a“ | |
u un 2 a a | J9[X10 AA | UOSSOU9S eUoM7Z
u We == B ‘To ABW c
‘Wassatias Jew-z Ist 'T 10 S CZIEMUOQ GOST
ö | € de .
11104998 OUI, 9 UT 9pINA SISUG OTCL HR | . . | - 83996607 NICH | 2yasıam Toq siseg 06
wo | |

 

“8 9110S “TIT PUB ‘Son
-HNSUL uoyostqderS098-IRJITUU “yy sop ueSunt
OUI :OUOIS ‘USSR [EIOMZ JQGT Taqtuga
-ON I opıma agyuyosqy usIepur G IP 19P9L
"(FLT Oded °/88T Uraagg 'opeuoryeunoyur anbıs
-9p095 90U919JU09 98 8] 2P SUPUOI sagdwon) ust
UM U9PIOA UeUUOUISUE UIQUII9I09-SSUNUYP
-SuUy ualopygım OIP IN UIHUP SIQ AUOTAM ‘9719 M
TPOI[OIJUOD 9Ip 2H02MZ9q SUUINSIIQUA 9801([

   

994 JUN
“IUOrT 988 IOQUOAON
| SJrupoZ ‘NET

 

 

(286 F00 000 0000 + 2298 ITO 0000 + D 00% 106€ = II

(280 300 000 0000 + 2,53 ITO 0000 + U) Ies 106€ = III “
(268 300 000 000°0 + Z2L0F LIO 0000 + I) LOS I06'8

(281 800 000 0000 +Z28FI ITO 0000 + I)

     

 

 

 

 

 

 

 

 

 

 

 

: a à | 9PELTJOUO (I
UOSSAUOS U9INCIAQUOT, uasLıparu Taq TaqtuaAoN | fe 7
UWI [BUISTIeS pun uorugeradwa] uayoy 19{ [EWSUI98 | On snSn
9881 JSNSny Wr opm [loyy, 4819 To 'LOygaS ‘yrup9z, "meh JO SDS
ayyruyos ur opım m Ypejsuory To ce ce re 1 - .
Huyosqy gur opına ‘pejsuony Toq SISE 21 ISP OS TP ‘pure yy TOA FPEISUOI 194 SISET (GE
‘9 ayras ‘A PUET
S9NATSUT 19098 ‘JT sop U9SUNIOUJHE :9U9IS
A ie G 2 G \ “ “ <i 4d
“uassou1a3 ey oe "L/ 2 | | SomysuJ "gde13093 [tur 'y°7sop
u u u 2 $ u © x
1 a : u a = i U9SUN TOUT Lop JT] opurg WT
“ Dan “ 8 n eee “OT AL UL SoJNjISUT WoTos |
“ “Bu “au soins | -TUAELDO9I-IL DE u £
“Messotuos Teu-p gst yruyosqy "I 10g Le a en a D 2 all yAsop eyraq | | up 7704 UOA Uassoules [VULIOMT,
| our Jo sprod sop jeu |-xY Uoyos}epoos-YostmoUoISV | [[Pyosnyo NT cae
‘Yroyjes oyyruyosay 9 -Ol}VULO}UL NeoINg“ | Joep opurg 'T wI uoqarıyosog | youyoo10q ‘191197 uoa F8sT
ur opıum ysodepng oq siseq og Sop dajowypeuionN | 4st yeavdd y oyostyoretse4s0 Joy {YOUN 9860 SPP TURN qsodepng 194 siseq “ST
SOAI}RTOI JOU %
uoryerefp uosrereduiod soAojdure rel I | sanopeArosgo ofqnop no ordurıs
9P SYUOTOITR0D aseq ap sTroredde ne | ep ee ne op oouut
SOJUIOI 9199, P JUVJHIOU SJICT ronde | 3 So] 3p q m I 49 sopinpad | sop IANSYUT Bl op ROUE 99
HE . oO ‘ x 3
: i ba SHOT Ê sajgqeqoad yo soopnopea | SUTONT OSU Al OP a Ou SOE
sep suotenby 7 uorgeusisyql 7 ‘s{ed Sp SON

SINILIT SININZUOT
x ei À

Pe ne aan ch Seen : Re

 

 

 

 
