 

 

 

 

 

 

 

 

 

 

 

 

 

 

 

 

 

20 I
— ——— —ı
Erreur
PATIC Latitude. OBSERVATEUR. Methode et instrument
STATION. Latitude Ba men oh a
|
o 1 u 2 = |
73 Krummenort (point tri- | 54 20 55.89 | + Dt Werner. Hauteurs eircummer. 18
gonomeötrique) . diennes. Instrumen
universel.
74 Schleswig (pointtrigon.) | 54 31 46,39 | = 0,09 » » 18
75 Handewitt(pointtrigon.) | 54 45 89,99 | + 0,11 » » {
st
76 Fingleff (point trigon.).. | 54 56 54,32 | =+ 0,09 » » 1
77 Knivsberg(pointtrigon.) | 55 8 4,69 | + 0,09 > » 1
78 Sophienhoi (point trigo- | 55 22 13,09 tr 0,09 » » | 1
monmeurique) .. ,
79 Golm (point astron.). 52»: 7506| 0.0 Fischer. » | ie
80 Glienicke prösdeZossen | 52 16 16,19 | + 0,09 » » N
(point astronomique) I
81 Eichberg (point astron.) | 52 18 57,34 | + 0,09 » » | ;
82 Hagelsberg (point astro- | 52 8 %,57 | +0,15 » » 18
nomique 1885) . |
Hagelsberg (pointtrigon. | 52 8 26,8 + 0.83 Sadebeck, Albrecht. » : i
de Y’Institut geodesi.)
83 Hubertsberg (point tri- | 51 54 48,9 + 0,1 b » ji
gonomeötrique). E '
84 Herzberg (point trigon.) | 51 Al 35,2 zu » » ;

 

 

 

 

 
