 

 

 

 

 

ITALIA

Rete Geodetica di l’Ordine
dee

Provincie Meridionali.

 

 

 

 

rre Macchia

 

Prin | ws
| x
ee se Be
lasted al TO

| en Ke eo

 

SS

 

de VA
Ventotene I. | Be EN Eponte

Ischia I.

 

|

|

|

|

|

Starioni esequ ile
2

th OLD eseg wurst

 

Rete tra Puglia e Dalmanıa
tra Basilicata e Calabria
a Calabria e Sicilia...

Rete di Sicilia

|
Re wont com FP? CPUS Ae) )
7 |

 

 

 

 

|
|

 

 

|
|
|
|
|
|

 

OF indian

ü
a AR Re
Ki bs & , N

de / ae 7 J
Ma re Castèkretra

 

|
|

(po Passaro
|
# |

| 0 2 RR 2 : ; © ; SEN 7 o
E32

 

 

Zen Anst.v.Leopold ea aatz Ba

1

 
