 

| va mme ere =e

 

am an an

ALT

1m in

IHRER I A ae

17

Polhöhenkurven und Tagesmittel
nach den visuellen und photographischen

Beobachtungen in Potsdam.

199% April Mai

Juni

 

5370 I
; visuell
2

3300

52.90

52.80

 

53.50

 

PRotogr

33.40

93.30

53.20

ME:
visuell

532.70

 

53.00

52,90

 

52.80

52.70

Die kleinen Zahlen bedeuten die Anzahl der Paare eines Abends.

a

 
