 

 

 

  

OA

Erreurs de cloture des triangles desquels ont été mesurés les trois angles.

D D 7 ES

 

 

 

 

 

 

 

NOMBRE |
AUTEURS DES INSTRUMENTS ERS DES ERREURS |
2 : EN NOMBRE | OBSERVATIONS | DE CLOTURE |
z ce CS foo oe co ge cage 2 |
© DT : \ POUR A? REMARQUES _ i
? DIAMBIRE DU CERCLE OU | ox CHAQUE ANGLE | TRIANGLE |
z nn MICROSCOPES Oe É
HORIZONTAL MICROSCOPE | CHAQUE |
DIRECTION + | — | |
ne }
IX.
RESEAU DE TERRA DI LAVORO.
Directions.
1  Repsold di 27 cm. -Starke di 27 cm. 20 2 2M. 2M. 52 2 2 1",664 | 2,7689
2 | Repsold di 27 cm. id. id. 2320 31 0,227\- 0,0515
3 id. id. id. 34 21 32 05.025 0, 0006
4 | Repsold di 27 em. - Starke di 27 cm. id. id. id. id, 40 21 34 10,037 0, 0014
D id. id. Id. id. 10: 36 45 94 10,533 0, 2841
6 id. dad. ide id. 33 39 50 1,216 2,2983
2 id. id. id. id. id. 44 34 36 |0,531 0, 2820
8 | Repsold di 27 cm. - Starke di 27 cm.- | id. id. 1" | id. id. 2M. | 20 24 44 1,202| 1, 4448
Pistor di 28 cm. .
9 | Repsold di 27 cm. id. id. 42 32 32 0,444) 0,1971
10 id. id. id. A) ot As | 1,705 3, 1082
11 il id. id. 36 34 40 0201 0, 0906
12 a id. id. 41 36 41 1,003| 1,0060
13 id. id. 44 56 142 1,289 1, 6615
14 | Repsold di 27 cm. ke di 27. cm. id, 1d. id. id. 50 40 48 3,966 |. 15, 7292
15 id. Vs id. id: id. 40 41 49 10 875 0, 7656
16 id. id id id. id. 44 34 32 10,642 0, 4122
17 | Repsold di 27 cm.-Starke di 27 em.- | id. id. id. |id. ïid. id. | 32 32 44 0,963| 0,9274
Pistor di 28 em.
18 id. id. ad. id, id id id. 19 30. 082 0,229 | 0, 0524
19 | Repsold di 27 cm. -Starke di 27 cm. id. id. ide id. 42 36 47 0,185| 0,032
20 | Repsold di 27 em. -Starke di 27 cm. - | id. id. id. | id. id. id. 82. 82 59. 1.094 1,1172
Pistor di 28 cm.
21 id. id, d de id. id. id, | 085.82. 39 0,392| 0,1537
22 | Repsold di 27 cm.-Pistor di 28 cm. id. id. id. id. 53 56 35 10 086 00072
23 id. id. id. | id, id. 48. 56 36 .|0, 166 0, 0276
24 | Repsold di 27 cm. -Starke di 27 cm. id id id. ad. 42, 35 32 0,02 0, 5069
25 id. id. id. id. id. Bi 30° 49 0,208 | 0,0433 |
26 | Repsold di 27 cm. id. id. 38 35 38 2,564| 6,5741
27 | Repsold di 27 cm. - Starke di 27 cm. id. id. id. id. 26, AQ. 39 11,074 1, 1539 4
28 id. id. id. id. 10. bo 40 25 10; 858 0, 7362 4
29 id. id: id. id. id. 36. 34 40.1, 873 3, 5081 3
30 id. id. id, id, id. 41 36 41 0,376] 0,1414 i
31 id. id,. id, id. id. AA, 806 42 1,0813 3, 2870 |
32 | Repsold di 27 cm. id. id. 50 40 48 |1,584 2,5091

 

 

 

 

 

 

À
RÉSEAU DE TERRA D'OTRANTO, DÉVELOPPEMENT DE LA BASE DE LECCE ET JONCTION AVEC L'ALBANIE,

| Directions. | |
1 | Repsold di 27 cm. - Starke di 27 cm. va al 2M. 2M. \=42: 87.29: 01,611 0,3338
2 id. ide id} id 10 41 41 39 4,431 19, 6338
3 id. id di ol lan 38 SE cal 3, 140, 9,9099.
4 id. ide, 1d) id 10, 60 41 40 |1,728 2, 9860
5 | Repsold di 27 cm. id. id. 60 41 44 1,141 1,3019
6 id. id. id. 10 46 64 0,253 | 0,0640
af id. : id. id. 73 104 39 |0,071 0, 0050 |
