= nehmer sites rteieenen u een ee - =

 

BE ereRTUNTTTTeTeC FE Eee

 

‘(SeıyoBN UOPU9F[oF wnZz uaSunIang[IT Ip oyaIs) usyey.1a nz woIsÄg 'ps}og wu
98 um ‘uspıom Jyowıgedus „_Y98 wo J00°0+ UONNELIOY aIp (19 addnımy) offeqe], uopuoyogsioa aop ur %4— 6 pun °6 % 419 M Syaıyues us mw
uossopagjorur -WI0F ınu mpuos “opına uowmouegus yzyelsıq om “wu zer yyoru YIRLJ0q OIs ‘u9PIOM uageFgedue IFeyxojyoF wg wm AOysıq SIfLy ul
syereddejopueg Sop }opurIg UP IMF OUQYSSLHO Alp IST aumoanaanıg NoA SJUBUMOLLIOUDN ULIOF] SEP ZMON Aoum yoeN :Zunyıowuy

‘-_.y08 wo T00°0 + MeAusJege]L = WeIsÄg-# 1owmepsj0og 'uauoreIg 5

 

 

 

 

 

 

 

 

 

 

 

 

 

 

 

 

 

 

 

 

 

 

 

 

 

0 |<IL SIL : n IE LER bar 2:09 86109 ASURIULy g
6, Br | 88C FO6T nefdeg |ıse | a Ten yosnoy| wu
Un 089 | | 084 . n | 014 |ve \e'ıa se 92 1epounoByof “
I) 089 | 129 2061 | umeyosyyag | 9ır lıse \6'sg Im Ir jodommeg susexney
ip An | <99 : 2 |899 | IE |azee ae |lorn 81sopood H
20T a | | IT. FO6T meldet | €r9 | |ase |9c ve Luc jodorgmg wu
Be 06% | 119 ö . 599 lo Ir 2 ea | yshssoromon. a
Te a vEg | 94 2 h | 989 |68 |ee 6 Ic | osdiog | n
Ds 65% | 984 Ei “ | ese isses |es er les sszoagelg x
Get LIS | IrT 2061 | ummoyosgpog | 65 | lees em ar [eve ASPOMOISTM e

| ee | ey | | 68 3 h a8 | loı rw ı gs | Ausong | .

| | orr | In L06T | Nomed |TeE | ı69 oww eg ® | SENAUTIPEIM e
LE = ger 868 206T | ummoyosryag | 168 0 mie wnyong. i
Le ver 68 LOGT S ae 07T |g:0g ir |e6G | Nopd 5
+ 1 | | a0r ' i ns ı sea. | so ©
Se | | eg . n ze | oe Eee | Yomsıec | 5
9 — 89€ | 28€ N i | FL5 | ıı ger er mal steuy 3
( | 688 | org 8061 ‘ \ 808 | es [E08 8 |9°6 | Tpoqueg e
07 LEE LIE LO6T R | 918 | g er ı7 88 | noa X

| 8 vog | 908 S0BL 2 | 208 | m we ac | Xnyyosug] a
a 028086 | 813086 | LO6T | Momeg \ 088°086 | | 98— 9:81.87 |TiE .Sr| yuogqioq | snseyney

| | | |
WO 5-07 | wO 5-07 u wo u 6-07 wo | wo Me 2
%4%— 26 | %4—°%6 °4 %6 Is— 6) Io) ayef  Aogoegoag, |roayog Ianıora oyoH | edug] | syeıg | uoyelg pue]
| | | | | |

 

fee TA '@WL

 
