 

   

 

      

 

= m

 

XV. — Russie.
N
| NEITUDE| ;
©, INDIOKTION | an DIRECTEURS j
N - LANITUDE) va EPOQUE INSTRUMENTS REMARQUES

DES POINTS - | POULKOWA| ET OBSERVATEURS

 

 

 

 

 

 

Nouvelles stations en Finlande. (Suite.)

 

 

 

 

 

6 | Kykkiosaari....... 6023' 23" | - 2°53 16" |
ia 7 Buldr ...... 60 27 37 = 44 52
= 8 | Wawarna-vuori. .| 60 29 42 1-2 39.45
E 9 | Huovori (Pyra-
iF md) | 6023 48 |-2 37 13 18 |
r 10 | Suom-pään-vuori...| 60 33 19 2 2.30 25 \ &
Il, Wellote .. | 60 25 26 |-2 24 26 = - |
12 | Ajän- suon-harju.... 60 342] -217 6 n
13 | Heinärsuon-harju ..) 60 32 35 |-2 14 14 ä : |
E 1 Root... | 60.27 6|-158 9 E 5 |
IE 15 | Tupuransaari...... 60734 7 |- 1 53 40 / = Ad |
© 16| Kukura-Mäki...... | 60 40 21 |-1 51 37 | = < |
7 Bonsai 0... 160 20 12 |-ı 51 18 | 1886 F Ä |
18 | Suer-surio......... „O0 2858 -L41 DD 1885 a S |
19 | Bonn 000.0. ı 60 26 59 |-146 27 | 1886 = \ |
20 | Trangsund......... | 60 38 2 |-1 44 59 | 1885 u 2 |
21 | Hnosinsmakl....... 00T |-1446| 188 5 . |
7.22  Saviwori........ 60 2256 |-141 41 | 1886 oO E
ER | Sepelä-Mäki .......) 6021 0 |-1 38 26 | 1886 Er = |
=: 24 | Sunri-Mäki........ Wal S S |
7 25 | Wiborg (la tour du z = |
i4 | chäteau) ........| 60 43 2 |-1 3550 1885 9 S |
7 26 Matta-Surio....... | 60 21 23 |-1 28 12 1886 = 5 |
3 27 | Na-Seivisto........ 00 II S5 1] 18.99 1886 - = = |
2 28 | Stirstudene........ ı 60.1115 |-1 17 46 1886 8 3 |
is (Le phare) | =
= 9 Takla .. 1 60 16 16 \-1 135 1886
Ep 50 |Sarı-Mäki....... 1114 -1 83| 1886 |
31 | Mesterjarvi........ ee | 1886
32 | Neivola............ 6016 5|-05348 | 1886 |
Slam. 12.2.0. 100 1126 053 17, 1886 Ä
ir 34 Buüchtoln. ..... 60 13 55 ı-0 38 49 | 1886 |
E |
St.-Petersbourg, le nn 1887,

ng de la section topographique de U’ Etat- -Major
 Dieut.- General

STEBNITSKT.

Lie ı pen ill

    

a
N

5
S

Am

JR

 
