87

211. Station Mörkemosebjerg.

| we memes don 4

Hi 05 30 00 19) IV 53 a Bigg

Log. d. Entfern.
in Toisen.

Azimuthe.

Kliveko . 17.8) 00 ae 00.2 io 4.0564035
Knösen . + 2. 32 28. a0 47 01022 |
Vetehdie.\ . (8,41 Ah ue 4724 20020 4,1110350
Staarup à: . . ah 0 à dd 00 700

Bavnehöi. . ... eee, a 520.20) 00
"Holbeki\ösaa ee ı 22... oa oo
Jubanehôi : „nes“ a... 220 28 06060 4.0846993
Rosklde. . 4. 4 +. 200 2 802 4.1084479
Snoldeley, 0 1A oe au. cu... 280 De Do À 1753947

N |.

12. Station VeirhGi.

U

ud a, A

Klöyeshöi . .......... ea nm
Salolie ou... 0... 2 0 2
Alteshause,.. .....:...:... oa ton
Resass . ........ a2. 000. 4.2020921
Staarup 0. nu... 22... 0:02 02 20
Julianehoi . . ... .. . . mo a8 222
Bavnehöi ... . .»....2... 200 5 230
Mörkemosebjerg 41m une nel 10% 13,02 4,1110350

A PTT

LENO EL)

: Knosen » 2.0 u. ... 2,2008
13. Station Klöveshöi.
* DD 95,2 10.5009 i= +1 13 224010

_ Rersor 2 2%... 4° 06... 18001
Bögebire . .....: 2.2... 2 Aaron 4.3281088
Refsnes. 2 2 20.020, 10240 OA et 4,2318079
Saltofte .  ....2 . ie 250.5, 202
Klleshause . "4.007 8 .0...159 30 2.00)
Veirhoi 2 eur. ou... aso 094 A199 4.1091132
Bavnehör’ -, 0.0. vu... 000.53 0
Knosen. ... 20. 20 ve, 250 30 ROUE
Môrkemosebjerg "2 0, 2. 200. 50 23 4.0564035

a
=
=
8
=
®
=
=
=
x
à

 
