 

 

 

 

 

 

 

 

 

 

 

 

 

 

 

 

 

 

 

 

 

 

 

 

 

 

 

 

 

 

 

 

 

 

 

 

 

   

 

yehs | Isae | 2198  0mweE | vege | eure | 168 | weg: | eonE | ee | Zus | T0EE | 69€ | PrrE | Tese | ua
| | | Il ; |
| | |
rise | yess | 908 1evE | zeue | eere we BEE some | sale Lege | 0958 | rc oaq
008 | Tees | Sog Teve | soce || ale yes | OmE | Iome  omze gae | 1sge | 68 "AoN
028 | gere | wege | caee | wre || tere 08ge | SEE | 6re || os'E 009 | YEre | sıce PO
One | ssce | enyE | sure | sece || euıe ass Kos Om os Tone se “dog
Ihe | 0esie | STye | 2u7E | Teae | eaıe ne IE Ks se ale | amme  Nose ‚Suy
eale | BLEE | BEyE | SEHE | BCE || ale | enge | ssHE | wIee | yere vaoe Tepe 19ce Kup
re | Lu | Bee | gave | Bee | sure Brig | FEwE | Toce LELE 689°8 | Igpg | were sum
nesie | 9ueE | esyE | Zome |, suce || geLe sıye | 98sE | 0098 | Tone code | Toys | use, em
Sys | eIee | Hose | seme | Hree | sage | | 6898 | 66%8 | else | gege Lore | Lese | ı1ye | qudy
splie  Lsoe | 08ye | one | wie || 178€ 6ogE | LuHe | gese | TogE | oerre | gege | osHE | erg | yo
Eule | 23006 | 0SCE | osee | sone || ooLe 0yE | Tene O6sE || 269e | tere | ee | 05 | Er
gesie | 0ose8 | 88ye | 288°E | HFogg gug'g I Teyie | Tess | 2098 || o6LE | aese | 1e9E | zere  coge| wer
'OIZIYAVYN OLYOA 40 zonva wars,
| | | | | | |
Luue | LIVE | ware | moBB | 60BE | eure | gey2 | Here | To6% | zeBe ı 9928 | 6898 | wowe | 816% | o6re |" wem
| Se = = & E || | er | || | I | 2 5 =
| Peve | Te0E | 2208 | Bye | Lob | 68E | 608% | wor | Leve | 166% | olee ‘oq
| 89E8 | 8668 | este || 209e | Les | geee | sı68 | ware soge | 6I8’s | eroe "aoN
2668 | 1680. | #608 || 009°E | 8686 | seee | 088% | soTE GEL | EHE, 668 | Ole | RO
ae | Tee | 0. |, Moe Le cwe | eos, sone || le | ass | 0 See
vos | wre | 9088 | 806% ces | Hveoe | see ı sI8® | 99uE | 986% | 9ace onY
66uE | 008 | Be || Suse | 016 | 9aeE | weoe | o0see | 98835 | asyE | H0E | 08 me
sIos | Ferne | 00878 | 6r25 | core | Foo | Here male | ame eooe | Olee sun
s00E | 9EsE | Q28E | #918 es | erg | 6608 | 2898 | euere | 8966 | re sem
| To0'e | eeds | 0068 | 882% tz0e | sorge |) ı 0oso | ser: | me oe adv
| 266% | 2168 S0LE | 999% oo 0% | 08:58 | Yrrg | FIOS | 08se | yore
9e8o | vous || Lese | <09% | 08 | soee OBgE | 2uese | 6R5 | esoe | ar
LIO'E = || 9668 | 989% I one eco | 099% | Tees | SP60 | ISTeE “ur
| | | | ) |
Seen ge een ag SS | Bee: % |
2 2 2.2. .20 202 2|2 Eee
an See ae: Se |
ne Se SB Su ro ee Ss Seen, ee SB
ae irn Be &

 

 

 

 

 

 

 

 

 

 

 

 

 

 

 

 

 

 

 

‘INISYOD OLYOI 40 39nv9 AaLf,

1 ku cu aashmullh hd a han au

 

 

 

 

 

al

 

wurd

 
