|
|

 

 

EL

 

18

 

  

 

 

 

 

 

 

 

 

 

 

 

 

 

 

 

 

 

ERREUR MÉTHODE ET INSTRUMENT >
STATEEN LATITUDE. OBSERVATEUR. :
PROBABLE. EMPLOYES.
4
45. St. Peter bei Klagenfurt non calculée | Tinter |A. Instrument des passages
| à lunette brisée dans la
premier vertical
B. Hauteurs circumméridien-
nes. Instrument universel
46. Tserhäthegy . .|46° 21’ 4970 y. Sterneck, Netuschill do.
-47. Cvortkovo brdo . 145 51 25.7 do. do. : 0,
48. Peterwardein . A5, 147 32,9 | do. do. ‘8,
49. Lopenik .|48 55 0.6 | do. do. si
| |
50. Zobor .|48 20 45.7 | do. do. ‘ey
| | ‘881, :
51. Magoshezy .|47 84 47.1 do. do. $81
| | » 2 +
62. Rossberg .|49 32 24.1 do. do. RE:
| 89, .
53. Neretein 49 85 11.8 do. | do. æ
Bade. Baden. |
1. Mannheim . .|49 29 10.96, =+ 0703 | Albrecht | a I
| | EB
2. Durlach. .|48 59 57.02} = 0.04 | Albrecht, Löw | do. i |
| | Hi
3. Feldberg (im Schwarzwald). .ı47 52 24.18 Æ 0.04 Albrecht, Westphal | do. 816,
{| 5 ,
Bavière. Bayern. |
1. Nürnberg (Thurm der Veste) . :\49 27 25.61 + 0.23 v. Orff Méthode de Horrebow (Tal- i
| cott). Instrument des pas- $73, J
2. Mitt ld | sages à lunette brisée
. Mittenwa .|47 26 40.15 a 0.27 v. Orff | Méthode de Horrebow (Tal- 2%
cott). Secteur zénithal, % 8
construction provisoire de ?
3. Holzkirchen .147 68 8.07 + 0.28 v. Orff >

do. Img 0,

 
