 

 

 

 

 

 

 

 

 

 

 

 

 

   

 

 

 

 

 

 

 

 

 

 

 

 

 

j818 n | n | es Ey 76 08160 | U0IS0A]EH) | 5
|8ST°626 | GEST. | . 616 Ias:e | 881: |5:18 66 —c:08. 28 | opaıe] | fe
‚016 968T | weumg Korea | 1om Aoy | uagung “oA
| ‚816 2081 | 1 ed) | 9 | BO njonopg | “
| Ig56 zsl1o81 2 a N ageo ‘stem | Y
LI | 2LIF |ge9 en E lörs wo) | z | seymmey | 2
LIT | LLar led 1006 | 984 |868 a 1 ‚690 1868 | nerem "woN ons | S
s0C+ | 166 + 219 716° s16 0I+ |G5T'6I6 s6SI |en UOI89I | ‚66H ) | 0808 | epnnump ‘eyorepexr IBABH
06 | 260 | EIN | a 600° 816| 2 71 a uorpurıoyurff
wHr| — eos - — |z20°826| 1061 ı eusog es: 06)  ı. 1599001 |2/19.0 . oyu90] yeaog| vıyerung
(89 9 'uogdurgsen 88 Joy)
-upspusduspunyasafeH ujagelaeaur rw 'y ’S 'n AaAang 9N9Poag pur Ise0) dep uedunssew *z addnay
198 m TI0°0F A294 010°0=F 3381394 uormpoaweIsÄg I9p NOyLDYoISUN 91apyur Hr "woISAg-6 aawepsIog. "ueuoryeIg GI
sb + | 865 4 1608" 616. L08° 616 a sei: a |909°626 9) | 5 07 19 16558 Tpnmmag'soäiagng i
em 2a en e i Is 3 |(Co) | 81 98 69 —) 7 SEIT 'psqıwgq Tumopospug 2
791 + | 891 + |sgı ‚163 — 868 : e 065 (ad) | € Cs FL — 99 | suBosy (UMOJOZ109N) \
086 + | SEL+ 1651 |r83 be 6bE 068 2 | LEL (@° 2) | 989 | 88 FL —| LE L — 'osy urgjunop ueoıd) | UBOZO "JUEIFY
ee ıcı \ 661 = 106 688T 3 ‚061 | (G’e) | 97 FT el | 67 8 —| epusor] op mea 48 BIAFY
165 + | 966 Sir FL z. m x 5 | 01. '@o) | OR men G | 8 ‚ UOJoT IS "UMoIsOWweL 2
LIE + | 995 4 087826 |989°826 Sa, (Herzsne, u | 824°826| (G°2) | eg 07 9 | 18 STaeISPPHNE/POoKM2uom | W220 Nueny
6% + | IS 4 079°626 |199°626| — |899°616| oBsL uogsord |629°026 ie 3 Baer | er enorme ur
jan | | I | |
Ge 98 SOT'E86 | 820° 886 ass | en Apeıy 0:06 va L 8ER 79 — om Is |"Tuung reduogyoT MN Puzugay
6 + |sH Hi 190086 | CTT"086 188T | en uogsorg |EIL086| 8% | Op a ln 8, EUo8s sup ug wogsurgse uopelg "I9A
| | ||
ud 0 wo wo 1 | u | |
| Agef | A9IqDeIOOT Oramyag oraLc | oyoH | odug] | opeıg | uoneıs
| | | | | | |

 

 

sr S

 

 

 

 

 

 

 

IIX '99ıL

 
