 

Collm
Grossberg
Brautberg
Keulenberg

Grossberg
Strauch

Keulenberg

Collm
Strauch
Brautberg
Brandberg
Hochstein .

Hochstein .
Keulenberg
Brautberg
Marienberg
Hutberg
Rückenbere

Rückenberg
Gröditzberg
Schneekoppe
Keulenberg
Brandberg

Meiseberg
Dalkau
Gröditzberg
Hochstein
Brandberg
Hutberg .

S +.n au e

Col m.
| 0
| AG
ey
Keuleuber
| 0
| 25
| 76
| DT
ı

o

S°

Bran d be vie.

| 0
| 69
128
163
203
292

Hoch stein

Ruürckenb,er
| 0

| 50
103

ck

200

291

0
54

18
21
98

58

ZU

0,000
59,648
20,745

0,000
34,665
57,130
52,418

35,368

0,000
27,690
44,659
49,758
4,16:

5:

97 rm
Ol, (de

NP Ne

0,000
50,444

2,262
42,971

39,073

0,

=

OO
3,572
59,141
48,417
9,836

49,756

Ct

Log. ad Bt. (i.

4,6065112 .

4,5467790 .
4,6104016 .

4,5023253

4,6704297 .
4,6065112 .
48231241 .

4,8231241 .
4,5023253 .
4,7210165 .
4,7646207 .

4,7892956 .

4,6887364 .
4,7646207 .
4,6777357 .
4,7765460 .
4,7615763 . ©
4,6043919 .

4,6986442 .
4,8103060 .
A On ial.
4,7892956 .
4,6887304 .

46173428

M.

()

COMO aI

SY)

a
4,7175852 .
48106247 . :
4,6986442 .
4,6043919 .
4,8447108 .

Oo

e

=]

La bis ds Add be dy hae sod

sald

Jide dale

ny nahh ba u a a A da se

 
