   

a

Erreurs de clöture des triangles desquels ont &te mesur6s les trois angles.

 

 

 

 

 

 

 

 

 

 

 

 

 

 

ER LECTURE E ERREURS
| AUTEURS DES INSTRUMENTS = NOMBRE rs a non
5 EMPLOYES dos Du DES EXKouThEs DE
o ET nn VERNIERS POUR CHAQUE A? REMARQUES
E DIAMEIRE DU CEROLE u OU DRS CHAQUE ANGLE TRIANGLE
A HORIZONTAL Syn MICROSCOPES u u e
} MICROSCOPE CHAQUE DIRECTION
+ 1 —
nn : Directions. |
Ramsden, 3 feet. B.O. Mieroscope. 3 19.19 1
s8 | id. Rs id. 5 u Er
89 | id. 0, id. 3 11 55 2, s 1,98| 3.90
90 id. B.®. n 3 0 9:2, 52211, 3, 960
id. RS. id. 5 6.11
us id. B. 0. id. 3 0 8 1418 | u,
id. Res: id. 5 16.24 19.26 2 00
| id. Bo id 3 12 2 2 =
\ A
23 n id, no id. 3 5.13 18. 14 IS | 2,02 4,080 |5 sided figure.
Bamaden, 18 inch. a id. 3 2a
Troughton and Simms, 2 feet. id. 5 10. 14 9.610 ‚02
2 Ramsden, 18 inch. id. 3 22.14 ) a 00
295 | . id. iu. 3 16.16 24.24 3.21 | 2% 4,080
Rams 2 3 feet. R.S. id. 5 20.18 )
296 | B.O. il 3 20.35 1.20 ) nn
a 18 inch. id. D 2
nn | Troughton and Simms, 2 feet. id. 5 14.210. 14 0
Ramsden, 3 feet. B. 0. id. 3 36 08
‚298 id, B.S. id. 5 17 2; 4, 326
 \ Troushton and Simms, 2 feet. id. 5 gi
: Ramsden, 3 feet. R. 5, id. 5 89
299 id. B. 0. id. Ö Ip, Jul 2092, 7,368
Ramsden, 18 inch. ä N 3 29.20
Ramsden, Sleet R. id. 5 40.30 16.26
300 | id. B.O id 3 20.14) ee
. id. B.O id. 3 17.16 27.48 :
301) R.S. id. 5 19.49 \ a 10
302 | Troughton and Simms, 2 feet. id, 5 5» 9 1. 5|,2,2 4, 494
Ramsden, 18 inch. id. 3 16. 18 121812 12
303 | Ramsden, 3 B. 0, id. 3 8.3 \ ’ en
Ramsden, 18 inc id. 3 Io. 17 2 4
nn fee RE, Q 5 ai N)
305 id. RS id. 5 3 127 99) 2.15, 1202
X
0. id. B.O. id. 3 41,22, 42.59 nn = \ 2,17 4,709 | Trapezium.
id. Rs» id. 5 9 8 A200 7
307 | id, B.0. id. 3 19.15 on an
ER id. RS, id. 5 0: 5 \
308 ! Ramsden, 18 inch. id. 3 >. 10 2,19 4, 796
; Ramsden, 3 feet. B.O. id. 3 1011]
30 | u 5.0 I ut a
310 | id. B. 0. id. 3 21a 9395 »15[|2,2 4,840
id. RS, id. 5 13.50
al). id. B.0. id. 3 21.15 3? >
312 | a N 2 u - ds 24.34 ns | 2,22 | 4,928
id. 8, id. a2
313 id. B.0% id. 3 © 8 1821 1018 | 222 4, 928
ide B.0. id. B 1218
314 id. R.SE id. 5 8. 8 2,2 506
un un ö z 3 ı 20.17
amsden, 3 feet. B.O,. id. 3 5. 29
315 | Ramsiden, 18 inch, id. 3 13.38 23.19 12,2 3082
Ramsden, 3 feet. B.O. id. 3 11.47 24.13 >
316 | id. R.S. id. 5 31.28 | ea

ach aaa

mul lu dr
