 

 

 

 

 

 

 

 

 

 

40 . : 30 Ss 2 20 a : a a mn 2

 

 

 

oo

< @Kay
S

verford-West

 

N

 

 

¢
=
Ss

> Notes

¢
\

So

Bordeaux

 

1} |
/

j
ny

/

}

> iff
i Carcassonnd, |

|

})

! f
i]

7

5.Martin duTertre‘

a

erry-Pu x

Weis

\ RR,

\

Tab

k
ons
Ye

5

mn kn ee moe Ro ee Hors _— = = —
/

 

5 Ya d. N es
Lion ee N

Me
pj Rodes =

  
 
 
 

 

 

 

À “

/
/

10 :
oO 410 20 Er 30 ï 40 50 60 70 3 |
- 0. Se : ae

/

|
|
|
|
|
|
|

  

 

 

 

 

   

\
J |
x |
'
\ D | |
|
Va |
4 |
x x j
: \ (fl
x iH}
x ill
\ ik
if
il
5 it
= \ (fl
7 À |
>. ” |
7 if}
_ 5 x | |
\ 18!
. N HH
=
IE
I
\
\ }
\
ee if
\i
‘Ne
N
S
5 \ 20
> R IF
\
[/ a
a © Mosca : -
OPENAGHEN Samara p— to >
Lu rn re ig Ee
ve oe Oremburg a
/ N Se E
Y ee } Se
SER
>
à 2
o& Saratow ; ee N
ieee N
& er SY
a,
BE > € n
& N
| \ => CS L
181 At 1 7: ;
II 5 rossenham L oy
i \ N SIE] Es
e N N -Fretk ero ehren of
t x * > /
E \ = L = He ;
"Mannheim Pr à \ gauerniy/ / À dE Ber =
3 012007 LAS N en ‚Arakau.. aac En = a & 2 7
7 / 4 NN WEGES à D f : > |
IA leasbargo / 5 | \ \ : 2 u È TS f < QQ x
Res a / | 4 Ves J St à
_ a + , ; | \ / : ~ à”
| 2 | \\ ‘ \ Se SR
wall I ee Fe 5 \ a a z ’ : A :
a — ET D CSS =>
| Ss Ir Bes TV
er nr
U
ES Ve
\ \S
\\\ \t BER
0} \ 3 RN: 140
{ 3 ER J
\ N \
\ UN
N \ : YR = À |
Se aS
Sa ; =<
\ = LT |
XS \ ESC |
ee | |
: ee Be AS ta |
2 |
eo | |
Ë | |
|
|

aA R
EE

GI@OLLEGAMENTO |
degli seservatoristaliani coali altrid Guropa |

|

|
à ee ty dA Son s N, Ç . ar |
Bb. |? re (A LATINE CL Long vhwdure |
T &

1876 \

 

 

 

 

 

 

 

 

 

 

 

 

 

 

 

 

 

 

| |
SS .,
40

 

 

 
