 

232

1897
April o
Io
20
30
Mai ıo0
20
30
Juni 9
20
29

an die Resultate jedes einzelnen Paares anbrachte; so ergaben, nach Intensitäten
der schwächeren Spur (m. 6) geordnet, die einzelnen Sternpaare die folgenden mittleren

 

Y—Pp
+ 0!17
- 0.16
+ 0.15
1. 0.13
+ 0.11
+ 0.09
+ 0.06
-- 0.03

0.00
— 0.03

Polhöhen 9, und die mittleren Fehler einer Beobachtung us:

Paar. % (m. d) U; Anzahl.
VI 6 Rn male = 024 22
ea 63.52 7.1 eo. 15 15
IV 6 53.53 6.8 SER] 1o
Va4 53.48 6, SEIOrTT 18
b 53.242 6.6 SEO.X5 18
SV r 53.40 6.6 Son25 12
g 53.45 6.4 120,17, IT
IV 5 53.47 902 =0.16 10
IV r Ban 6.2 =13or 211 7
e 53. 57 62 S=o.178 ır
c 5347, 6.1 =1= 0.13 19
es BG Si 6.1 =2,09.13 15
d 58.50 6.1 =13 0.17 19
V6 53.50 6.0 Sera 18
a 53.52 6.0 =12 0.06 10
VI4 Ba 8 So TS 26
f 53.41 57 Seo II
Mr 58.50 5.7 S2o.14 20
IV 3 53.53 5.5 0.14 9
V2 IB con Be SJorLE 21

VI 2 55 55 =129.16 16

VEE Dr Son Se &.%2% 13

VIs 53.46 4.9 120.14 13
IV 2 53.49 4-9 SE 0,10) 9

Im Mittel aus allen Paaren ist:

us = Don: — ob 0'155

33T 2

und daraus der mittlere Wert des konstanten Tagesfehlers:

Yu? — m? = # o!og.

32

SE N nV

u, im

Mittel.

=E 0"222

=1=/6,. 18T

=1=/or. 15/41

Sr 0r 13%

SE 0R 141

el 08130:

 

had ne MH Mlähıku |. aid ul

lRı

al ı Mk

 

1. 2unmeisnnsiiennn mama A |
