 

 

 

 

 

 

 

 

 

 

 

 

53
SER = TR p aN Sar TGS NRA Te N NE RAT LOT | PSN SEA SOA | ré Fi |
| | Distanza | : Distanza is
pi à | : | Rifra- à | Declinazione
Data men. r. der | Somma | , zenitale ' | Latitudine
| N Si hans k zione | apparente |
| Divisioni| Secondi | fili fissi | app. FE RUE
ad | | | | | | |
é à | sae | i #4 | 4 ee ‘ “a | di | a “4 | ‘ “a | ‘ u“
Luglio 7.| 385.88 (2° 9. 66/10. 36. 75/12 45. 41/ 0.20/12’ 45. 61| 42° 8° 9°91 | 41° 55° 24° 30
9, | 387.88 | 40. 83) | 46 08 46 28 10 55 | 24 27
10.| 388.83 | 10 84| ll 46:50 46 79 10 871% 20 08
ii, 38618 1°: 9 03. be 46:68 45 88 | 11 19 ae
12.| 388.08 | 10 57/| |. 16 32 . 46. 52. 1151| 24 99
13) 288.03 | 10 57 | 46 32 46 52| 11 83 | 25 31
15} 38033 |. «40 01 i 46 76 46 96. 12 47 25 51
16.| 392.83 |. 12 18. | 47 98 I, 48. 13 12 79 24 66
18.| 394.33 -| 12 89 | 4 48 64 13 43 24 79
19.| 395.33 13 03. L 2 4S 7s 48 98 | 13 75 94:77
20.| 397.33 | 13 70) Ed Ab 49 65 14 06 | 24 41
22. 396.33 13 52) ae ein 14 37 | 24 90
| 23.| 398.83 | 14 19] I. 290 81 50 14| 14 68 | 24 54
| Medio | 41° 55° 24. 41
F 7041°B. A. C. Cygni 6
Luglio 11.) 144.10 |0 48. 48/16° 55.91/16 7.43) 0. 27116 7.70! 42°19 99.04 | 41°55 22" 24
12.| 143.90 | 48 42| | 7 49| 7 76. 30 28 | 22 52
13.| 143.50 |. „48 28 | 7 63 7 90. 30 64 | 22 74
16: } 140.80 | 47 358 | 8 53 8 | 31 2 22) 72
16.| 139.25 | 46 85 | 9 06 | 9 33 31 66 22 33
19.1 15410 5 4 1020 oe 32 71 22 24
20.| 140.50 | 47 28| | 8 63) | 8 90) 33 05 24 15
22.| 138.30 | 46 53| | 9 38) | 9 55| 33 73 24 18
Medio | 41° 55 22° 89
1679 B. A. C. Cygni 62
Luglio 12.|— 7.09 —0 2.4216 55. 91116 53. 49) 0. 29/16 53. 78| 42° 12° 18° 54 | 41° 55’ 24. 76
130) 2.80. 0 77 TO 55 43 | 18 86 23 43
1a Ab, to |. 54 4 54 63 19 50 24 87
| 165) 01400 !| 1 35 | 54 56! 54 85. 19 83 | 24 98
f 18: |. 4.20.1 0,40) yer gee | | 66 60! 20 46 23 86
i 19.200. 0 84 | + BE DT [be sa) 20 78 25 42
20. 1.50 | 0 51 | 5B 40] bal 557769) 21 10 25 41
22.000... 000 |, 76p 94 |. 656 18. 21 74 25 66
28.|—+ 1:65 + 0 55) | 86 46) Is 156° 076] 22 06 25 31
Medio | 41° 55 24. 84
o Andromedae 4? 2
Luglio 5.| 63.65 |—-21. 43|16 55. 91,16 34. 48| 0. 26/16 34. 74| 419 38 50. 48 | 41°55 25. 22
8.| 68.04 22 88| | 33 03 | | 33 29) 51 30 24 59
12, Tas ı 22 85 |. Sans [it 80 34 52 49 23 83
13.| 73.05 24 56| 1.81 85 a 52 79 24 40
15.) al 106 87 | | 8S a! 29 80 53 39 23 19
16.) 20074, 1) 25 83 Be... B08 34 53 69 24 03
18.| 78.94 26 57 | 29 34] |: 20 60 54 19 | . 23 19
19.) 78:83:45 26%. a8) 29 56 | 29 82 54 59 24 41
20..| .: 81.82 27 45 | 28 46] tr 28.021 54 90 23 62
32. 00. Sa ae | |) 98 64 l'OS OT 55 52 24 43
98. |. 8914649768. 28 18) | 28 44 55 83 24 27
27.| 86.80 | 29 20. |. 26 Te 26 97 57 07 24 04
28.| 88.10 | 29 64| |: 26 2m 21996 :158 57 38 23 91

 

 

Medio | 41° 55° 24. 13

 
