 

ai
Verzeichnis der nach der Formel m — 3, berechneten mittleren

Winkelfehler der Hauptdreiecksgruppen.

 

 

| Namen der Dreiecksgruppe und Zeit |
a : | za
|

|
|
| m
der Messung | N | 2
| |

 

| |

1 | Pfälzisches Dreiecksnetz 1896—97 | 4,6763 | 14 | 0,334
| | |

R | Französischer Anschluss 1899 | 0,0048 | 3 | 0,023
| Aus beiden Dreiecksgruppen ergiebt | | |
Der. 4,6811 | 17 0,303
|

 

 

ä
=
ä
x
&
i
ü

i
