 

 

SpnyıyeT BT 9p

SUOIJELIBA SIT JOUTULI9J|:

-9p mod suoyeArssgo

0061 Ug ‘6681
TUE wr [Ssq “g6gt ul
“19 ‘L68T 14009 wi uory
“BLIVAUO}IOIG Lop JUngosIoFim

TP PUS ‘pn tog “4y001q1V
"mpıqg uf 10p neoinqyeay
“U9 :9.1ostAold yeypusoy

cc

cc

cc

€

cc

sıyqnd von

sırqud o1ooue seg

(IX 9 Wwo) "pers À
‘13099 'I1SU] [ep seLIomorf

9rrqud oroous seg

cc
cc

cc

eattqnd e1ooue seg

 

<c

cc

€
ce
cc
ce
ce

ce

youq
-Iyep Joupıog

cc

UPIIMU9OID op
‘380 SivoX oy,

19 S189 X QUIN

UITI9ST
op 99 onsey

-uadog a SUOI}BA
‘qonqiye p

-195q0
‘uo1JSe ‘TO

U9IMU99IL) 2p 389
S189 7 Ud], puoaas

AOLAURF HAST

1OLATP BERT

 

|
|
e

Sa SR Per er

ume 6681
VE GR

00 S68T
0 8681
‘AON 868T
THA
—SIeW 8681
SIEIT 86ST

TOHADT 8681

‘dos TO6L
moYy TO6T

‘des 2681
‘des 206
des TO6L
IOV LO6I
WOV LO6L

‘des
MOV 0061

SU9UOIT UOTPU9 UT 919)
"SOUUITPLIIUL SIMO] NVET |

cc

cc
[3
ce
(a
ce

cc

JOUUNIe 9p UI PI lo UL 919190)
SUUSIPIIAU SIn90E

 

JS90OT %
19 IST % sodessed soy auyuo
‚usowngsur,[op opdwıs uorsıoA
-UL.p opoygour ef Jueaıns [VOI
“IA tormeid ne sosesseg

cc
ce
cc

"queg 'ıq ung 2 'ssed “p ‘ysu
"MOQOIIOFT Opoyioy

 

 

RE SAS eae REED SIRET SES

: ET

qeIssounoy

JOWISseyAL

qouosseyy ‘sloos.nog
urpteuos
uremep

qouosseyy ‘UITPIOU0S

ce

urgınepy ‘onduopuog op

JOTOSSB TAT ‘Juouu

ce

cc

weqoisy “Vy SU]

ce
cc
cc

pues

U9SUBUOF

66 0

08 0
800
910
sl 0
FLO

ST 0

L10

ILO

IL0

u

 

080°

 

+H

 

G6'0F Ih Sp
8°68 LF 9¢
ge gm 98
OLS FS FS
F'68 IT 9€
Gh Sh og
Fe OF ES
9°98 SP 8e
0'88 88 88

3649 IP

PSS FS OF
26:98 68 LP

99]n9/89 uoN

 

 

SUOTOI UOIPITOU
21019 “eltojeatesqg *aoAry

(olvyg) «es

({O1TO A.
op 91101 8A.108q ()) LOS TW

BSJBx
IN2S
UBNnOXIEYX
epıes
Bajos uly
euruspaM

HONVAH

(anbıs
-9P093 quiox) oxouoqrë

(enbrs9p093 quioq) prxperx

(oub
-189p09$ quioq) ezoSuaez

ANDVASA
IOUSTIOTA 9103S
Jousuern
Saxo fqesowmireHaxo
TOUSOAOTYT

(epue]s]) Trhoany vw

 

49

Lg
9g

1Q
De)

&&
TS
08
67

87

Te
0%

6L

IP
OF
68
88
LS

|
| 1 | ee ee Se vr ee

sonbreway

 

 

|
|

uoreorggnd ef op our,

2e count mass NA |

Eos
sop sounoÂour
SUOIJISO

|

som |
jo 99uuy |
|

94oyduro
JUOUNASUT J9 opomop

 

| a
CAE ED VA

 

|
|
| SIN97UA 19890)
|

1 to!

erqeqord

Liat fete

{i

|
n |
| neu |

epnjyeTy |
|

SNOILVILS

DL

arte the 1641 bee ta bd

 

d/l ld

 
