 

Lae

 

 

 

 

 

 

 

 

 

 

 

 

u
BAFA

u

HOOU19S
BALL
YOOUIOIS
BTU
HPOU197Q

u

Sa

RES
IOUS
BST

TI9LIOIS

4

BATH

HIOU19]S
CoS

"A

JA

“A

 

 

Nu

‘A

|

 

 

 

CLG
LIS
LVS
696
Gare
0GG
IP
966
E68
FSI

 

 

CCG n
\er6 :
G16 &
|LE6 ‘
02 2
FLG :
egg À
‘916 2
C16 F68T
£96 3681
|TI6 :
196 F6SI
|916 =
|8L6
\668 ‘
0&6 4
\9F6 a
1968 à
‚768 5
706 F68T
116 aG8T
|G68
068 À
6F6 F6ST
1986
786 ä
|7°6°086 | 3681
wD
| og yee

 

1992409 areas ompra oo H |

968 |
688 | GG
088 v8
LLL Ne
os | %8
6 | 7g
on | ve
ge | ya
TLS | rs
OG | Ge
cos 78
668 ee
098°086 ©
068 c'e
CO) v5
rcs QB
618 re
le ae
Ce | ee
1G Neves
Ces Gg
logs | +8
logs | we
706 ma
968 ere
| SOL ant
| L68°086 | 4°&

|

oT

|

uL

 

 

 

 

 

 

 

 

 

ce ı EL |re6 0
Wear | €. 4 06 0
C= 7021086 ee
Site 17 2 616 0
Gar | Ll = | SG 0
IS 6G ah 1) ae 0
Te— | 19 — | 916 0

1 + | 86 — | 416 | 0
Uae IE eG 0
Clas iG = 16 0

0 | = IE 0
eg + | pe + | 906 10
0I+ |6 — | 906 10
19+ | 68 + | G06 0

G — | 6p — | 706 0
ize Oe C0 Er
er+ | 03 + | ¢06 | 0
a ic. ce | | 0

8 — or—-|m ee |o :
6 + |ee — co 698 0
Ola | Ol =) 106 = ase | 0

g — |o8— 1006 joss | 0
OT— | &9 — |006 Fi | 0
og+ |ce + joes ree | 0

+ |ı +|ees |zoe | o
et le — less Vo |
6¢ + | oF +  68°086 | 286° 086 0

WO g—OT wo 9-01 | wo mo a g—0T
| 4 | 56 |B

oF 'S

AL E

Dia Ra bb th numuss à

g'98 GT er swoıy, 2
Ve | FIOPSIONIOM | =
[GT VI | 1°66 | qoRqosy | =
HO tal | Oke 1107 | =
2960, Gi | 4°08 qovqraned | x
ie ro | ung, u
\7:08 eT en | que | a
GN Wise | (zurp) ıyepin. u
Is:re 91 6:97 | SSoyoe. à
03 91 |g:9T P3oysuueunoH i
16°8E 91 |0°9L [POTSHOUpVISyIV AL u
leo Gl eet | Strom u
G'ic 91 | Z'el 8+. IT 9-M UOIM e
hole on ee | wood 18 :
(Avr St |e UE | wıIoysaoJsıy i
Grip I DON | wunggqsseIg u
ea cil 'gor | sax R
leer FI | 0°OL | SOSITe M a
ILE FI 226 | { STOMA o
19°08 PI | | worpammeon-topaın if
Te 91 | S10q1oueT 7
Fer 9T | dp” mo 2
|L'YG SI | Simqsuyo'y :
| g-0 LT | IUUISFI0 M a
| ot on | SUITPOW N
| eg CT | Eg | pdoyag A
SSL in ash | JIOPSUUBULIO POI | YOWALIISO
esuvy | oper | UOT}RIS | pur]
|
‘QOL

 

 

|

Fret

alu ma inks

 

was
