 

 

 

 

 

 

Se =

 

 

200] TS

>

7" Brına woy)

 

Scale of Seconds for Residuals.
1ER 0 BEI BE 7 3 ER HEE SER GE RE ONE)
IE ee

 

105° 100

95° 50°

RESIDUALS OF SOLUTION 6

 

 

l

ii.
AN I.
|
|

 

 

|
|

 

 

 

 

 

 

 

 

 

 

 

 

 

 

 

 

 

 

 

PN

> Ss \s ah, D
u

155

176

105: a4
DR 2

 

 

 

 

BTT Z-
38 II K L ?

 

 

 

 

 

 

 
