   

x xe x BE tat Pa Y x we N RITTER en
ae eee Be we A
A Uae te AI = x er BET ae 5 Be ! x
fe a: PERLE NN < À t 5
a: Et BE 2 ; 5 Ë CPR
N " > S Ë MER % 3 7 7 GR 5

 

 

 

 

m

helt lth ed of idan did a

nal

elas ld aad lh asa

EN!
