 

 

Depenses de 1909.

Indemnite du Secretaire .

Frais d’adninistration, d’impres-
sion et de travaux scientifiques
auxiliaires.

Pour le service des latitudes
(Nord).

Service des stations . .

Service cenmwal ne...

Pour le service des latitudes
(Sud).

Service des stations . . . .

Bervice central sn 2

Total des depenses de 1909. . .

Done actif disponible A la fin de
Bexereice de ala 2,

Recettes de P’exereice de 1910.

Rentrde des contributions arierdes
des exercices precedents . .
Contributionsreglementaires pour
AO Sn er
Recettes provenant des interöts
bonifies et de la vente des pu-
biieauonen > Aa
Total. .
Actif disponible pour l’exereice

de 190.

Depenses de 1910.
Indemnite du Seeretaire . .
Frais d’administration, d’impres-

sion et de travaux scientifiques
aullames a2 2.00. 00%

Pour le service des latitudes
(Nord).

Service des stations ......

Seryicereentral no.

Pour le service des latitudes
(Sud).

Service des stations . .....
Service central. . .

Total des depenses de 1910. . .

Done actif disponible a la fin de
llexereice design 0 00

 

M.
5.000.00

10 625.81

37 000.00

14 682.79

2.000.00

- 1 2492.40

3 999.60

68 276.00

>
SI
eo
x
x
OT

5 000.00

11 822.19

37 000.00

14 600.51

8 000.00

. | 2336.00

 

6 250.00

13 282.26

46 250.00

18 353.49

4999.50

85 348.00

>| 2136.06

6 250.00

14 777.74

46 250.00

18 250.64

10 000.00

2 920.00

 

 

  

M.

15 625.81

51 682.79

4 492.40

13 984.45

16 822.19

51 600.51

10 336.10 |

 

 

19 532.26

—

64 603.49

5 615.50

92 480.56

64 500.64

12 920.00

 

 

71 801.00

68 505.92

142 490.37

78 758.70

63 731.67

 

Fr.

89 751.25

—

85 632.40

178 112.96

Ba

98 448.37

79 664.59

 
