Doo 66g)

Te m ee

Gruppe i

 

 

 

Paar 1 Paar 2 Paar 3 Paar 4 Paar 5 Paar 6 Paar 7

1897 Jam ı a, 0727 +0754 oo —0"54 0744 +o'4g9
= 2 — 0.63 — 0.30 0.72 —+o.31 — 0.23 +0.35 —0.19

2. — 1.19 +o.14 —o.87 — 0.04 —0.35 0.23 40.37

5. —1.II — 0.21 0.64 +0.19 —0.50 0.59 —o.39

6. —0.85 —0.0I +0.45 +0.51 —0.26 0.21 —0.07

8. —1.18 0.35 +0.72 —0.02 —0.32 +0.54 Oo.

10. —1.05 —0.06 —+0.42 +0.62 —o.16 0.26 — 0.12

13. — 1.00 — 0.44 0.75 0.37 —0.32 770,26 —0.34

15. — 0.63 = Oo 47 70-05 0.40 — or ET = 0.509 -+0.04

1. —0.55 —0.40 --0.47 os —-0.38 9% 0.44

- 19. — 1.13 —0.08 RO ON 0.40 OO C0) moO +0.16

Ze —1.48 +0.17 —-0.45 —-0.36 —0.28 0.05 One

2A. —0.80 —-0.08 0.97 —-0.54 —0.77 09.12 —o.17

= le —0.88 —0.24 --0.62 —0.51I —0.71 — 02.09 FO. ot

IE 1892 AOI! 16), — 0.95 — 0.23 —o.39 +0.64 —0.45 —-0.23 0.34
> 029. —0.85 -0.27 0.52 —o28 0.30 u: 207 —+0.32
= = 20. — 1.15 —0.55 —o.66 0.48 —0.05 — 9,04 0.64
i Mai r. = 0.006 0.07 0.28 —0.24 —0.59 +o.69 0.46
F - 4. — 1.02 — 0.27 40.51 0.02 —0.22 +o.48 +0.47
ü 5 — 1.36 —o.48 —o.62 0.02 —0.34 027 40.24
| or —1.14 —0.18 +0.88 — 0.02 0.11 Oho) 0.68
| 14 —1.19 —0.27 —o.78 +0.15 —0.13 0.20 045
| 25 ae! 0.53 0.61 —0.0I —0.68 —0.05 —o.88
if 18. — 1.02 —O.19 0.56 =-0.09 —0.28 0.47 0.38
= Mittel on 0,06 or on — 0.34 0.31 4.0.32

 

 

 

 

Gruppe i

 

 

 

 

 

 

 

 

 

 

 

Paarr Paar 2 Paar 3 Paar 4 alan 5 Paar 6 Paar 7 Paar 8
regi Jun 2 +o 08 +0167 —0173 0), 22 Po —0"77 008 ogg
= - 6. +0.53 —+0.18 —1.09 —0.01 0.42 + 0.02 —o.46 +0.44
= 8. —-0.10 40.75 —0.98 —0.03 0.15 —0.24 — 0.70 +0.93
= 1, +0.64 +o.40 —1.23 —0.52 —o.95 — 0.43 0.40 AOC
3 12. —0.16 — 0.08 — 0.44 --0.13 40.62 — 0.32 —0.74 —-0.99
ss 17. +0.09 —0.25 —0.32 — 0.03 --0.72 0.00 —0.60 +o.40
== 19. 40.17 +0.47 —0.37 —0.14 40.47 —0.26 —0.47 40.12
= Da EST Oo 12 — 1.05 —0.31 0.70 a = © 50 -70.98
= 27% +0.07 —o.12 —o.80 +o.10 0.35 0.07 —0.96* on
ap - 20: —o.24 40.55 —0.09 — 0.47 +0.43 —0.41I —0.35 40.13
= Juli 4. +0.09 0,51 — 0.76 —0.15 —+0.16 —o.o7 —0.73 10.82
= b 8. 2e :: eo 51 — 0.79 —-0.35 0.41 — 0.06 —0.56 +0.45
10. — 0.01 +0.43 — 1.10 —o.13 —o.18 —O.II — 0.71 1.22
18. +0.75 +-0.20 —o.62 = 0.40 Og uit —0.19 010.0 =O. 40
a 26. +0.50 +o.18 —0.69 Eon ZT —-0.16 —0.16 — 0.35 0.18
x 27. 0.20 +0.05 — 0.89 —-0.04 —-0.49 —0.24 —0.73 —-1.12
August 5 0.02 —-.0.48 —0.37 0.15 0.09 +0.03 —0.59 29 19
6. —0.16 — 0.06 —0.7I +0.22 +0.43 +0.27 —0.66 0.68
10. 13 +0.34 —0.32 +0.03 —-0.42 —-0.15 —0.09 —0.02
4 : ah —0.25 —+0.09 —0.23 0.47 +o.11 — 0.06 — 0.77 —o.64
Mittel 0.15 0.28 — 0.68 —0.06 40.39 —o.14 —0.55 40.61
Gruppe Hl

Paar 1 Paar 2 Paar 3 Paar 4 Paar 5 Paar 6 Paar 7 Paar 8
1891 Juli 1o. +0723 17143 —0"23 —oloı +o'69 —0"23 -+0"24 —o"60o
- 37. —0.09 — 1.50 — 0.73 --0.68 0.79 +0.25 —o.28 0.29
18. 046 700 —0.56 —o.61 +1.31 —0.17 —o.43 +0.13
3 2 27. 0.01 a —0.21 0.47 +0.84 —+0.04 0.05 +0.13
a August 5. —0.49 — 1.10 — 0.48 —+o.17 1.15 —0.05 —o.42 —0.42
à - 10. oe — 1.25 +0.17 +0.47 +0.88 — 0.49 —o.36 +0.23
= 13. OT OS is —0.59 0.56 —-0.61 0.19 +o.48 +o0.31
= 17 40.19 1.61 040 +0.53 +o.72 --0.08 0.08 +0.44
= 20. 20,22 So — 0.50 —o.24 40.75 40.11 -4+0.69 0,12

= Resultate der Beobachtungsreihen in Honolalu ete, 12

MIA à |

 
