 

9

 

Erreurs de clöture des triangles desquels ont 6t& mesures les trois angles.

 

. D’ORDRE

AT
N

 

SONINDUITAWO-

OUT PARWUO—

wm

10
11
12
13
14

15°

16
1%

 

 

ERREURS
DE. CLOTURE
DE CHAQUE

 

TRIANGLE
A
ae

md

18.9

| Ds

10) 0
0

20
4 ,3

a
6,3

22

a

> 0

5,9

81
0

& 9

3,
0,6

951
KO
2.8
Sl

13,2
@,5

A

l

0 6
5,3

3 8
ie, 8

0

0,8
I A

N
[81

0.4
0,3
|

 

 

 

»D

REMARQUES

 

D’ORDRE

N.

 

ERREURS
DE CLOTURE
DE CHAQUE
TRIANGLE

A

 

REMARQUES

 

 

D’ORDRE

N.

ERREURS
DE CLOTURE
DE CHAQUE
TRIANGLE
A

Sl

 

54,76
357, 21
123, 21
100, 00

0,36
8,41
18, 49
9,61

39,69
148, 84
26, 01
31, 36
34, 8]
179, 56

0, 49
47, 61
11,56

0, 36
82, 81
102, 01
60, 84
13, 69

174, 24
42,25
1705, 69
198, 81
7,84
1909, 69

0, 36
28,09
14, 44

 

Triangulation de la Chaine des Pyrendes.

 

 

15
16
I
18
19
20
21
22
23
24
25
26
2
28

 

3", Ic
1,6
12
15 ,0
15 ‚2
16", 4
1,8
an
6,8
os
id
6.
u

 

9,61
2,56
51, 84
225, 00
231,04
268, 96
60, 84
59, 29

28,09

1,21
44, 89
59, 29

 

17, 64

42,25 4

 

 

29
30
sl
32
33
34
39
36
Su
38
39
40

 

Triangulation du Parallöle de Rodez. (Partie Oceidentale.)

 

Triangulation de la Meridienne de Strasbourg.

32, 8

os

3,8

14 ,6
17%, 8

37

1075, 84
1584, 04
190, 44
213,16
316, 84
1421,29

13
14
15
16
17
18

Triangulation de la Me6ridienne de Scdan. (Partie Nord.)

 

4

 

20", 5
a
>

 

59, 29

420, 25
51,84

 

=

8

 

 

Triangulation de la Meridienne de Scdan. (Partie Moyenne.)

3, 24
3, 61
0,64
129, 96
16, 81
327, 61
0,16
0, 64
4,4l

18
9
20
2]
22
29
24
29
26

0,04
104, 04
457, 96

60, 84
640,09

0,64
198, 81
376, 36

21,16

2

En 6
10 ‚6
7
8,2
1
7.0
0,0
6,8
5 m
3),
6,0
1
1.2
3,2
4,6
ad
1,8
a
8,6
0,8
Ds
12 ,9
5,5
16“, 7
16 ‚8
23,2
8 6
2
1082
5,8
310
12 ,5
12 ,6
5,8
2,8

A?

59, 29-
67, 24
146, 41
49, 00
0, 00
46, 24

 

-I
m oo

 

566, 44
166, Al
30, 25
278, 89
282, 24
538, 24

HI co
no

262, 44
33, 64
1413, 76
156, 25
158, 76
28, 09
5,29

 

 

 

REMARQUES

nnd hihi ch ann
