N

mn

OT Lu

+ men

TR

TRATEN

TAT

 

 

9

0.000033 (A)—0,000718 (.B)— 0,000407 (©)-+0,0( 31158 (D)
1 0.28814 da” 008009 4B"+0,20802 dy’"—=dem sich ergebenden Widerspruch

F, ausgerechnet giebt-+ 1,170 m.

Wir wollen die Rechnung der Anschaulichkeit halber fur die Cosinusgleichung

EEE ‘ n save c 2 Or ON EN 11
eos 88° 35’ 33,95”... 8,39020065 — | (97)—(96) ; —da

16431872
1159. 8853 m.
Be. Lars + à
Bae Oy Tone 9,94 630620 RL | (43)— (42) (58) — 1108 )) | tt

ER 970
COS AL «

4,49398944

 

31188,1572

EE 4 66649986 1 (0)
ee 95038 — | (58)—(105) a

D 4710161542 4)
50308,9704 m.

Macht man jetzt die Probe nach Gleichung IV, so erhält man

17661 ‚3410
50309 ‚3635

50508,9704

+ 0,393 m. Der W ist also

5

ee en

 

 

 
