 

0.
Neckar-Bahn) durchschneidet das Grossherzogthum Hessen und bietet dadurch die Ge-
legenheit, durch Anschluss der hier ausgeführten Nivellements an denselben, die Meeres-
höhe der Punkte der betreffenden Strecken abzuleiten.

|
i

I MAUERFUGE DER
1 BRUCKE IN

   
  
 
 
 

D EEE CEE

    

4 FRANKFURT
N° 3
- N°0 BEI LOUISA
i) = 5
i ( BEI De
N2 134 \ |
: |
(pet GAULSHEIM ) 28 © Vs !
| \ À ©
| 32 MAINZ N io |
N >
D À ©

  
   
   
  
  
     
    
  
      
   
 

ıY/VIADUCET BEI
À DARMSTADT

   

27
Mi =
i e |
NN OPPENHEIM he
} / À © ;
4 WOLF SKEHLEN > |
| ] ZWINGENBERG
| i
| { |
ARMSHEIM
8 pis | |
26 (BEI GERNSHEIM)-—
|
i le
| 3 MR :
hi a
| : : i à
i BIBLIS |)
I
i My
i y

ñ
2

|IBENSH

BURSTAOT

(er ROSENGARTEN)

24 18

4, 6520

WALDHOF

TU

FRANKENTHAL

JHAUPTBAHNHOF
MANNHEIM

RHEINBRUCKE

|
|
|
|
N
N
i

   
