 

 

 

 

 
  

 

ED

   
     

&

©

=

ê

S
GET EST E

RUSLAND

es :
x Vas 4
ety D De

>
BAY TR a
ngsnes

\ D
x
+
+
a
ts
pe =
Roiken 2%. | a
«oe
Kyat

x
x
x
x
x
x
x
x

 
   

rfjeld
N \
BY
RTE CORRECTE

"Riksgränsen

FINLAND

      

| Pl. 4.
PLAN
: : for ; e,
Præcisionsnivellement i Norge x Ko
1911 0 ’ : & Vardo
: Nordlige Norge. ı = yi je
a | Le
Anmerkning : : ; | 3
: Planen vil kunne forandres ved kommunikationernes utvikling, / 8
5 krav fra den topografiske detaljemaaling m. v., saaledes at her 7: :
| anferte linjer kan bli sleifet, nye bli optat. chan \
St | : 9 2. . 2 A 3
4 © \ $ +
2M 2p >

 

Nivellerte linjer.
Nivellierte Linien.

De OS mn mu um m Planlagte

—>—,
Projektierte Linien.
SVERI GE © Vandstandsmaalere.
Pegel.
x Trigonometriske punkter,

hvortil er nivellert.

Trigonometrische Punkte, deren Höhe
durch Nivellement bestimmt ist.

Maalestok 1 : 2,400,000

t eee 1
G0 40 30 20 10 0

 

700

 

 

 

 
