ee PE TPE CA OT Mondsee À

AP!

ILE PT

Oesterreich.

 

 

 

 

 

 

 

 

 

 

nn
| |
ro | Indication des | tongs. . Directeur
N° Latitude, = Epoque. i :
| Points, tude. et Observateurs. a

464 | Sviniescha . ..... .|44°48’ 0"| 39°49’24”| 1867

465 | Stirbetz mare . . . 44 35 36 | 39 56 49 | 1867

466|Kukujova...... 44 32 0 13947 O | 1867

467 | Bavamste...... .|44 49 12 |38 84 6 | 1870

468 | Funtina faetje . . . | 44 59 18 | 38 37 48 | 1870

469 | Zichydorf. :. : . . | 45 13 48 | 38 47 80 | 1870

470 | Boka ... .--->.71 45 Oi 94 | 88 30 12) 1870 -
471 | Ludwigsdorf . . ..|45 8 12 | 38 22 19 | 1870

472 | Pancsova ..... | 44 59 94 | 38 18 24 | 1870 .
475 Szurduk ...: . |45. 4 18 137 59 36 | 1870

474) Kalakatsch. ... .| 45 9 24 | 37 45 42 | 1870

avo | Nentlvar =... 45 17 18 | 87 53 48 | 1870

276 }Orlovat o. 2 . ... [45 15 48 | s8 15 51 | 1870

477 | Becskerek .... ./|45 22 54 |38 8 80 | 1870

478| Kis Torak .....| 45 80 18 |38 16 O0 | 1870

419 | CSurugf 20... | 45 28 54 | 37 44 42 | 1870
. 480 | Peterwardein . . . | 45 15 18 | 37 31 49 | 1870

AOL Ojeow = 2 |50 12 6 |37 29 30 | 1848-49

482 | Koninsza . : . . . .| 50 11 0 |5759 541 1848—49

483 | Sieborowice . . . .| 50 9 48 | 37 49 49 | 1848 —49 À

484 | Bukovina . . . ... | 50 22 12 | 40 20 18 | 1848-49

485 | Biszeza : . . .... |50 26 0 |40 18 30 | 1848-49

486|Szyskow ..... . | 50 22.0 40 10 18 | 1848 —49

 

 

 

 

 

 

 

 

 

 

 

 

NE | Lee Oe | Latitude, | Lome) | Epoque. Der Instrument. Remarques.
Points. |= tude | et Observateurs.
| : | | = :

1 | Alcaria de Cume . | 37°14’32”| 9°57’42”| |

2 | Alcaria Ruive . . .| 37 41 56 | 9 56 21 |

3 NiPet eo 39°32 3 9350| |

A Aljustrel... ....| 3% b2 48 | 93159)

5) Almeirim. ... 39 8 26 | 9 4 50] |

6 Atalaya.. 2... 8810: €; 9518) |

DAME 2 40 38 86 | 958 3 | |

8 Bateller,.  ..., 38 44 29 | 8 45 43 |

9 Buarcose . 4... 40 11 38 | 8 50 47 |

10 | Bussaco-. |. .. | 40 21 37 | 9 20 45 |

Wi Cabeea st: 6 87 11 7 1040 4)

12 | Cabeca alta . .ı40 31 55 | 10 16 31

13 | Cabo de Sta. Maria | 36 58 24 | .9 50 10 |

A Cabrera 0 | 41 88 14 | 9 39 95 | |
151 Balxeiro: >... .- 38 54 53 |10 9 48 | |
16! Candieiros ...... 89 26 9 | 8 46 55 |
17|Caramullo ..... 40 32 44 | 9 99 54 | |
18 | Cercalsasiase ba 37 47 34 | 8 58 55 | |
19: Coimbra ce!) ‚neh 40 12 19 | 9 1628 | |

20|Contenda...... 39 1 47 | 10 35 36 | |

AM Corve: e240 2. aa 40 49 38 | 9 35 47 |

22 | Cota de Mairos . . | 41 50 45 | 10 22 9 |

03: Folia esha. 6 0% | 37 21 51 | Opa Gear |

24 | Fonte Longa . . . . 21 13 56 | 10 26 31 | | |

| | | |

TR RT ATT BET LTE TT PAT TTT

 
