OR

Danemark.

| INDICATION

| DES POINTS.

LATITUDE.

LONGITUDE.

ß DIRECTEURS
ÉPOQUE.
ET OBSERVATEURS.

INSTRUMENTS.

REMARQUES,

 

 

Hamburg

Rönneburg....... :
Lüneburg...
Lauenburg

Store Möllehöi .....

Malmö
Falsterbo

B3°32, 93

53 25 38
53 14 57
53 22 42
DO 9

55 36 25
55 23 1

55110 90:

22 38) 367

28 8
28 13 28.

30 40 5
30 28 54
29 40 17

37, 39, 56 |:
56 |

30 5 12 |

1817-18-22
23-24-25
1823
1818

mann, Nehus.
Caroc.
Schumacher.
1818-23. | Caroc.
1837-40 Schumacher ,
| Nyegaard, Nehus.
1839 Petersen.
1839 id.
1842 Nyegaard.

Petersen,

Théod. de 12 p.

Schumacher, Caroc, Zahrt-

Théod. de 8 et 12p.
Théod. Ertel de 15p.

uède, N.2
nede, N. 1

.

Théod. Ertelde 15p.

Kulsbjerg
Hiddensö

Darserort
Vigerlöse

|
|
|| Prusse, N, 73,
| Prusse, N.

|| Prusse, N.
Il

30 46 56 | |
80 10 22
1839-40-41 Théod. Ertel de 15p.

54 35 51
54 28 35
54 42 42

54 626
54 57 55
»126 9°

53 58 47

29 35 13
29 95 44 |
30 10 24

98 51 39

28 45 33

Petersen, Nehus, Nye-
gaard. |
| Prusse, N. 7

Théod. Erteldel5p. | Prusse, N.
Theod. Reichenb. de | Prusse, N.
|
|

Dietrichshagen ....
Kongsbjerg 1839-40 id.
1841 Nehus.

12-P: |

 

|| Prusse, N.

I

 

Hohen Schönbere. . |

 

 

 

 

 

|

 
