 

u
|

u Visa were
U

 

 

 

 

 

 

 

 

 

 

 

 

  

 

 

 

 

>)
> y H:
a Mi:
= 59
= 24 f
ki £
F
ZiE
7 I,
B; * An Br ?
73 j e
p =
un
= 4
Bee En 4 f { ur Euer
5
= z TIE:
ui eg Ft ZZ en
rt es s ” 19
rt —
/ I 4 a
m J ;
Ä £
A 1
A
f =
A a
= — _— — _ ij En
1 |
N
j
|
l
|
H
u fi
1 |
’
Ih 1
Ni Ei
| S
Rı
Ki
Mi
%
il
\ f
hr | Bl
|
N I $
! Ip
N
|
! |
|
|

PEN DIE REVER 2
construit par BRUNNER

eu adopte par le Service Seographique en France

Imprimerie sincographique du Service Ceographique

 

 
