 

 

  

  
 

 

 

 

 

 

 

 

 

 

 

 

 

 

 

  

 

 

 

 

 

 

 

 

 

 

 

 

 

 

ee en | 1 | | ] |
| 160 0 |sel a | yuRpaonen “A190 8 | ses |TEH LI C9l | z}07duozjoH | gi
1880 ec D aosseH |8C0 vo | 886 |1°68 <ı Kart MogospiqnoN =
| 180 e+ erı G6ST | UBPIONON "A || 100 1° | Ir [287 Li |ser | MEp[eAIocH 5 =
| 180 o ee 0681 | zaaureıs A | 196 | reg |erer EI | 81 | uvqz 2
| 1so ‚® |260 2 x ‚866 | Tee |8’9T 9T |6°6 NP» mewoppd | =
| 1s0 0 en S68T | ywepzogton 'A | 2I6" 086 | ges los ar lee | SET 9PeISUIV a
"810 |.o lost 2 . ‚FO | 818 |e’eg vı |€'8 Bısprg u
820 | ar Om 688T | Noeuregg ‘A 000°I86| L’s | ICE |T'se FI |5'8 Onaya 2
m | e+ 2 . Iıs6-os6| 2a | erg |erea ıı ma weyguogen m i
720 0 “ a |220°186 | za | ae ae Bir Inc FOPUIOSRL %
ro | 890 Te. ni _ “oe la ic sol yormıy 2
\ 220 680 | r+ or “ | guUBpIopog "A | 686086 | 16 | esr |se ı1 67 Sraquasorat | a
690 \ 90T 0 gl u zosseH 1090°186| © | Flo |0'LF CT |E'e ZyAnpABd | E
690 | «90 | 0 1207 CEST | auwpaooy A 166 92 | 89€ |8:08 91 88 SoqsıoroN | a
[280 1020 e+ 091 ni 4 906 iboee zu 1 00 0 uoqe,) =
| 890 gg0 | 068T | MWouLIg 'A 978 LG | 686 |7°08 al |5'89 STOqUOTTLL r
£90 Iso | u ER 1 1 1886°086 | 7°& Mes u u u al) i
[290 | 910 gest | Tousem |TI0:186| &'s | Isa |6:6 97 erg | paeuuoyoR | E
190 wo 6837 | euros a |986°086 | He | or \eıı cr 99 | BIOSAA ii
| 190 260 | C68T | Tuapaogroy A | 9E0°IS6 | 58 | 095 |F°74 LI |F°9C neddoxs | x
| eo | 88T | Woug a | ce6 | Lie | aps cin VI |6 v0 Suooa | “
| 8C0 es 0 or " | yuepıoyog A |986'086 | 9°& | 188 0'218 97 |s'T< uonjspur]| Ä
Diet eo | 0 |eu “ | mem seo | 2a | eos |2ga ei. \oe nuIst) “
gr+ |9&+ |ıco 1880 0 1e0l a & | 070:186| && | zos |s'Ta 8T |e’rC | ya Sqropo | 5
+ | - |w |eo |o 120 68T | Nurpraay A | 786 Dre oe Iaces 97 lose | Pe}suooNT N
st |2a— |oo |e0 | e+ |sco oggt | Wonagg ‘a |2ı8:086| 9° | on | or er|ver | out 4
2. + |9e+ | 0g0:1861980°186| 0 |saL'1s6| <esı | uepıagrog 'A | 11'186 | #& | 648 16,58 s6L | 67.65 | VIeIg-ZINONEE | Yolozıagsg)
| | | | | ER |
Wo g--0T | Wo g-0T wo ud | wo g-01 wo | | wo | u | |
04— 96 |%4-— 26) oA 26 15—.8 °%6 ayep | aoyyorgoog sroNgag| BIC) SUoET SUR] | era | UOrNBIS | puvef
| | | | | |
67 Ss 72:00,

u kruaı  Mähhuskulkanhshuiuunih nes

 
 
