  

TRIANGLE

 

 

448 —

 

Erreurs de clöture des triangles dont les trois angles ont été mesurés.

 

 

 

  
  
 
  
 
  
  
 
 
 
 
  
  
 
  
 
  
  
  
  
  
  
  
  
  
  
  
 
 
 
  
 
  

mole Colombier—Trélod.............65-.0..006. oe
Colonné- Dole-Trélod......... Bl,
ee Colonne Gis. 5... ee oe. ove ees
D MR DOI NA VO... - nee
Pont PHPNeL Se NATO nenne
DNA SerdeSnchet- Berre oe
Ba Chasse = Benps,, 0 vee ee eck
Bonn MUON = BOLlA 4... eo ek le nn. j

Dep Gurten Berra .........2.....0... a
Dame ame Ohasseral. ........2.2.222222222200. 2.
POUL Olasseral ........22. cee cee cae eee
Wiesen - Napf-Röthi ............ Mae unie
MM NOU Nat.
PP eV iSOm = NROthI.........,......,.......
Deliver = AViSSen = Lärern.,.:...,.....,............
Papers ROUE MIÉSOM.........,................
Honenıwiel - Roldbere - Lägern....... ,........:...::..
Poe Lasern - Hohentwiel. ......................:
klenbero - Hohentwiel - Hörnli. :.............2.......
Babe OUI HOPSWONS 6. ees sp cee ee ee ce ees 3
Pfändler - Hersberg - Gabris,............ Me ne
UNIAN ee eek cy ceca ets g eves >
Born  Waesen.. 0 00 een scene.
Pete ywiesem = Pager. ......6 6.6.65 050. er a
POO OUI ec seen.

Base = litlis -Hamgendhorn......................
Benno NUS SR aduN ............... ces

Ghiridone - Basodine - Cramosino................. a
Menone= Ghiridone—Cramosino......................

 

 

 

 

 

 

 

 

 

+ — REMARQUES
er... 1”, 19
So ee 0 ,03
ae 0 ,36
de in 2 ,06
oe ee 0,14
ae ee 1.87
ee eS. oil
ra nr 1.20
a 0 ,23
a ... 0 ‚07
ee oT 0 ,69
ii .. 1,3
en 0,34
ee. 0,09
Ce es 0 ,48
en... D 12
en 0 ,78
de 2
ee 0 ,20
ee. 2 ,85
a... 272
ee. 0 ,40
a 0,57
a 1 ,58
en 0 ,30
ee 0,45
a... 0 ,05
DR he 2 ,22
a. 1,04
en 1 ,58
en 0 ,48
a 2,53
ee I 48
a | 2 63
re... 1 ,05
eS een es |. 0,09
eee 1 ,54
ee. 1 , 64
cee ee ee 2 ,88
er... S

Hua hide able

yh ds sat de

Hebb sate

aan au u dl Mh ae
