 

 

127

 

"98.08°6 =

‘769866°0 = I yereddy uoyos,pjosdeyy uajzynusg ‘ozueyosuoyanz, ‘uerM ur aezjoddo ‘A yoanp wop yıuı „87 eAyef wı aoıy pur Jao UoA Teaouon of z

 

 

"ure1aoL wep Joqn Ugy

 

 

 

 

 

 

 

 

 

 

 

 

 

 

 

 

 

 

 

 

 

 

 

(opug oyaıs)
"qdoy oulau
se = -odjje nzaon
7 + | LL818°6 \7681 « SaH18°6 | GE6l86 | Er LO6V8°6 | VL | 0808 | 897 68 t- 7
yeah  puejssny
9 + | 6rC18°6 7681 « or918°6 | szyıs'6 | E% vsgh8’6 | aur| TELE | Ey 95 ums “meysom ) er
Jo][97 "aJdeh
974 | 09E18‘6 |z681 « 9or18°6 | LoTis’6 | SV oorI8’6| 76 | se6 g'zE EG | "Sanqweg &)
| | | ung m mesajend | DUEIYOSINOKL
7 696 18°6 cos « gyels’6 | Trers’6 | Sr | 0 EOEVS’6 || 8E | 77 E1 | E08 85 |-wor ws Surnaog 27
98 + | Lezt8‘e |268 1 « ereis’6 | 0zE18°6 | 61 | 0 E6818°6 | L8 ” €. 1:06:08 88 | wepsiog 0
| yoım
re + | 6L118°6 [E68 1 « 0r818°6 | SIaI8’6 | E%7 0086| 87 | 0 0 |9'85 18 |-ussug «  puejsug | 6
21 — | 8LY18‘6 |essy « ıarı8’6 | z9u18‘6 | €°% 09118°6 || S 61 0- | 18% 18 |moy‘uopuor 8
i i i ; ; : SUN ES
gE-+ | 87608'6 |e6s I « 91608°6 | 28608°6 | €'% £9608°6 | 09 | 088 180887 |''sqo ‘staeg |" ypreaqueag | Z
IEMUIIIS
Es + | 18608°6 jesgr|woums’ ısırao]| 77698°6 | 09608°6 | (8'z) 91608°6 | EFl | ET L 0°gE 87 | “Zangsseng |'puejyosinogq | 9
i 9Zueyasuoay
68-4 | 88808°6 |y6gr) "1azioddg 'A || L1608°6 | 68608°6 | 2'% 99808°6 || 9E2| 08.97 |0Tı ST | mL UML. oanosog | *
‘su "10099 Se
9% -- | 18808°6 | 1681| WLIIS’A 1sıogo]| E1608'6 | TE608°6 | 9Ls08’6 | E8r | 8 91 | Lei 87 | - wu or ) 7
„ 192190: 4 - uosneyuos
ve — | 18808°6 | 1681| "NOSUIMIS 08808°6 86808°6 °& | 0 12G8208°6 | 628) 9E vr | 8°8 87 |-og’uoyounm uoAeg | €
79-+ | €2808°6 |essy| erpiey undH | 28808°6 | 86808°6 | da | 0 09808°6 | 8er | 7 67 | 268 Zr | ysodepng |" waeäun |z
TUOZUDAOT 'JOdg . IBM
e7 + | E£908°6 | 1681| POWIS’A 1saogo| 91908°6 | LL9IO8°'6 | 8° 11908°6 |164 | 28 ur | v°ya 97 |-uaogs“enpeg |°""""""" uonfegf | y
oA > un u oO oO b -,b w ur H ® u
55 = 2 ss|e= b Has = =
S = e oe "SIN9JEAAOSIO) 3 & = E® E . 5 S = oe In E Sue SAVd =
; 2 S 3 ı = 1 = 2. 25 g Ss >& BE m -"uor 3
I = oo a» Bl 1% Sn ee|lZzole „ss E =
= > = |Z8| ‘1ojyoegoog | 2 ls as 3 & == |2% oO 3 -2IS J9pP 9WeN aANVT RZ
=2 33 | Dessen:
Sg an Q ro 2 N &
0, 27 | a Bsagssı)] sa,
x en an ee Bart. Seen, wur rear ee 2 ere a Sl
I JIPIeL

SA am aumalbh hieran

In era Ver

 

kt]

{Lamp

kl

   

uud

 
