 

INDICATION DIRECTEURS

LATITUDE. |LONGITUDE.| EPOQUE. INSTRUMENTS. REMARQUES.

DES POINTS. ET OBSERVATEURS.

 

 

Döbra 50°16' A3"| 29018 27°| 1877 en
Ochsenkopf 502 1259272928 20 1877 . 86, Baviere.
Stelzen 30.29 29 29 91 2 1877
Röden 0 1220, 294850. | or
Bruse an 50 50 512959, 3 1875
Kuhberg 50 36 10 | 2953 0 1876
Kapellenberg 50. 106, 72956 30 1876-77 . 32, Autriche.
Leipzig Dr 20 | 80, 27 1376 . 278, Prusse, B.
Leipzig 3206 30 Dt
Observatoire
Asehberg 53010 1876 . 31, Autriche.
Pfaffenberg 2 502 1875
Rochlitz 30 | 30: 26 1875
Hohburg 5 25 151.80. 27 . 1874
Fichtelberg 25 46 36 1874 £ . 30, Autriche.
40 1873 ? 172, Brusse, B. >
49 1875
1873
Freiberg i 2 1578
Bernstein L i 4 1570
Baeyerhöhe 4 52 1873
Baselitz. ......: € 1871
Raschütz 2... 1871
Basisendpunkt
Grossenhain 1872
Basiszwischenp |
Grossdobritz oa
Strauch. - 2 1871
uersa : 1871
Basisendpunkt
Dresden
“ Mathemat. Salon Z
Kahleberg 31 \ . 23, Autriche.
Buchberg gt Y
Porsberg sl -
Keulenberg } 31 ; 5 MuRR Trug B. ;
Schneeberg 31 N. 22, Autriche. re
Ossling al
Vaitenberg al a
Tausche ... .-.:. 32 „21, Aubriche.
Nostitzhöhe 32
Jauernick 82 981 Ä
Jeschken 32 38 35 . 20, Autriche.

 

 

 

y

.171, Prusse, B.

Inst. Univ. de Repsold (1862)

 

 

 

 

 

 

 

 

 

 

 

 

 

 

 

 
