 

 

166 |
|
0 OO OO 4464 km. doppelt, gleichzeitig, u. auch drei- |
: fach, meistingleicher Richtung.
D CD SDS , .. . 3500°» . doppelt, in gleicher Richtung ;
gleichzeitig.
s Hambare (188489) : . . . 986 » doppelt, in entgegengesetzter
Richtung.
4. Hessen (seit 1869) m 32» doppell, m entgegengesetzter
9 Mecklenburg (1869-73) . . . 623 » doppelt und meist in enigegen-
= |6. Preussen, Geodälisches Institut gesetzter Richtung.
= a... 173 » 2022 km. einfach, 3551 km.
= | doppelt, in entgegengesetzter
2 Preussen, Landes- Aufnahme Richtung.
= we 539393930 7... NT » 19206 km. doppelt in enigegen-
= cesetzter Richtung.
» ) > 1171 ims welche keme Bol |
sone bilden, vierfach. i
7 Sachsen, (1855-86) . . . . 2800 > doppelt.inenigegengesetzier Rich-
tung.

8. Würtemberg (1868-81). . . 1905 » 1379 km. einfach; 452 km. dop-
pelt, theils in gleicher, theils

 

D in entgegengeselzterRichtung ;
. æ | 74 km. dreifach.
i 9. Oesterreich-Ungarn (seit 1873). 16985 » davon 15815 km. doppelt, in ent-
| segengesetzter Richtung, die '
: übrigen1170 km. noch einfach. |
| 10. Belgien (das neue Nivellement
. a nn. m, 1356 » doppeli, inenigegengesetzter Rich-
| tung, 63 km vierfach.
11 Dawemark (seit 1884) . ..- 900 » doppelt, in entgegengesetzter Rıch- |
tung.
Semen Cet 481) ... : . 10792 » doppelt, in entgegengesetzter Rich-
; lung.

13. Frankreich (das neue « Nivelle-
ment général » seit 1884) . . . . . . 10780 » doppelt, inentgegengesetzter Rich-

 

a tung.

| Frankreich in Algerien und Tunis

1 : en ee == . 945 » doppelt, in entgegengesetzter Rich-

: - ne

i

1 Im Berichte vom Jahre 1889 war diese Zahl falsch.

 
