MP LOCNTER 1)

  
 

 

 

 

 

 

N I Il qi Mt ih | im! am un Kl ze
% — 8 — :wogsÄg OUST AA Jue WOT} AN poy, a] 1oyRuosu Vy
| (uor}eg-Zzu91 |
Do 0 608 Bios Er u 00a ca | oa) zur ron MER od . #L LT
| +, CL6 TOGT 5 866 686 no 0 A6 m 16008 |, Sara) : VMOU . #9LT
fe ot |. 8 | 808 006T | ssertog ele 91e do 0 90€ eo Sole vie À Sanquayyofaeug : GLI
or + 6 © | 560 GO6L = 186 866 Le 0 69% 80T| 086 GI | VOT 942109 . PLL
oar | IY |. PLS 6061 ci GTS 618 Len 0 GOs i, MONS EC | zyraopotet > SLL
fe | OL + | She 6681 a 888 56% Go| 0 ng LD 02m 07 | 06 }pagsuaddeyog : GAL
D» | ce À | Le 6061 * 968 Org | (0 898 her| Ves 01 MOIS uasurugyag : UAL
be à oo | 616 6061 808 ale i2 | 6 18% 86 |: 998 61 | 98 SIZ] | OLT
fe | Ss ot | OLS 606T à 918 688 Te 0 858 Vi OS Ol | ou Sing ory : 69L
oo | 09 © | 698 GOGT : GIE 188 we | 0 G66 SIE, COs UE | So | uogqapopopuogoH ; 89L
ort | FL | 606 GOGT : £86 88% De; © 69 Ho) Ge ci 19 u9Z}TIQUONOUT, : LOL
i) 06 | 996 S06L 5 GOS eee CG.) 0 098 oo 00 6 | Gx uosneqUe PUTT ‘ 991
epee | de | 998 S061. . 108 608 ro} 0 98% rs | ders. . &% | upojnzjeg : GOT
ae Sn | 908 S06L | 786 86% TG 0 9&6 UE OS © 07 | JIOPUAULWOUZILS - POL
Bor or SE ae) G9G S061 | = 88% 668 1er) 09% ATL| 0668 Fe | uopepsoq Ur olleH egl
ek £06T : 166 808 76 | 0 GLB Gil) SSL 6 50 woz V i «gl
D nn ce + | 0% 6681 : 783 16% LG © 996 18. SS SL waqe [soos Q “ TOL
G2 a | 8. | 196 006L 2 696 186 Ga | 0) 986 sit) 4, O01 | 60 wala yoog : O9T
Goa | 86 | 096 0061 : 88% 866 na 0 LLG Ga pu) 00 © : aZ[VQ SSo.14) a 6ST
ee | 11,98% 6681 + 598 18% 96 | 0 988 QVL| 969 01 | 985 Any “8 4peysesutq 2 Sct
ie | lc nc S06L : LLG 886 io 0 1696 G9 | 9608 818 [OyurmosıeH & I ger
Or om Bt ©1086 6061 x PLB 966 Go 0 1% Wee | OOF 8 | ls uosneysurIoO « gel
D | Yt | OSG B06L a 166 208 vw 0 1% Gh. 7S, Cr | GS 189107 « CGT
Et EO6L : GG - $66 zo) 0 LV 6PL| 069 8 | 898 plowed. _ PST
DD | Sc. 1680, 20688 . 082 266 Ba 0 Kg co. 006 | use 19poryog & sel
Op | Le + | pce 106T = 688 868 9% 0 ELS co LOG LI OS FLO pU977 Y ce eel
ee + OT + | 28% 0061 : 696 066 90 Tae | 600 €96| 196 OL | SYS Ie]soy) = TSI
i | © LL S061 2 86 868 Vo 0, 1 9G 06 | FHS 6 | OFS 1104 a OST
ee | à | 06 6681 2 84% 898 Gov (0, I6ec | 56 | O0 IE | os 9491980 JA : BFL
oe. + | 9) + | 6F6 G06T N 9 GLE vo 0 196 08 | 878 21 | 0'889 ephog fs QPL
(| Sk 21,0% 006L 2 L9G 6L8 96 | 0 PS GIL| GPS IL | 088 4paysqoog & LPL
ro + | Ik | SC 0061 a 6&6 61s SG | Ba | 69 Gey | OE OL | ¥ cS Smqziey tq S1oqSing se OPT
coe + | 96 + | sv 606T = PLE 18% 120 89% ch | 0:68 61 | 888 Saoquoyyı tg CHL
2. 1,1% 0061 : c98 BLE me | 0 6% Be Ss yanjsseIg “ PPL
HT ee | 186 TO6L 5 086 886 9% | 0 996 02 À 68e br GES U9Q2]ZIOU0UO FF és CET
ce0°0 + F&0O+ | 95186 | LO6I  uuewoste| 028186 648 T86 Ho | 0 GGCIS6| 98 | STE TI | OLE TE u98u1409 UOSSN9IX SPL
eee ee Ta a aaa a
wo wo wo ey m9 tu mo td u
= u ao 5 © ® =
nal à 6 Josogoooo+ ASE) 5 à | E| 38
/ © = SUIVIIOT, SO joneues 19p0 Desi = © 4 © g 3 © . ; : :
%—§ | 040 § aM = S ae _ D = . = a. = Fe 2 09 orig uOI}e)S IP OUEN ANVT oN
"109 © © RE A © a
on TOoUT, 5 3 snuru 06 H41)6=% Sean © & = = g

 

 

 

 

 

 

 

4 m —

 

 
