 

48

Europäische Längengradmessung 1865

vorläufige Längendifferenzen.

Referenzstation Königsberg.
Beob. Forsch u. Tischler.

 

 

 

: : Forsch u. Tiele u.
Zeitbestimmung bade i.
Zylinski ischler
Tiele u. Forsch u.
a Tischler | Zylinski
Breslau — Königsberg
— 13” 50°. 61 — 13" 505.08
50. 45 50, 36
50. 87 50. 26
50. 45 50. 30
50. 52 50. 30
50. 60 0. 45
50. 50 50.29
50. 50

Warschau — Königsberg
+2” 75.04

T.
i

a1] =

ala

92
30

. 45

23
09
25

. 24

+2 78.39
DD)

1. 33

al
>
oo

aaa
>
ei

 

=I
ND
Co

Grodno — Königsberg
. +13" 195.62

19.
19.
19.
19.
19.
19.
oi
19. 55

67
51
56
88
DA
60
56

4+ 13™ 195. 42
| 19. 44
19. 59

Referenzstation Moskau.
Beob. Forsch u. Stubendorf.

Uhrvergleichung |

Zeitbestimmung |

Forsch u. | Stubendorf u.

Tiele Zylinski.
Stubendorf u. ( Forsch u.
Zylinski Tiele.

 

Bobruisk — Moskau

— 33" 235.18
23, 29)
29. 25
20 17
25. 06
22. 98
25, 16
23.27
Deon Mat
2, 12

— 33" 255.48
20 00
23. 32

23.02

NS ROE IN

MD

|

bo | bo

co) we Go oo Ww Go
ZU
co =

cok

Orel — Moskau

— 6" 15.62
1.5)
1.63
HO
1. 43
1.69

ce
>
O9

Gm 15.
il.

id bed bed pod
Ce Cn) CO) 16), =I
CD AO pe OO
#

=~]
COX

|
D
o>

AAA uma nie

an etd dda a

re ers de sn ah ana A dl Mae nn are be
