181

 

 

 

 

 

 

 

 

 

 

 

= "AON B06T | 191  “ : us 'q 60 |060r AB ger| osom onu | -Idsuuog ‘sa0pstouro Ay OFT
5 0 8061 | “ 3 ae 2 | 880 OF GE LT S81} osegq Ise ouoy IM = “uosau 681
3 40 8061 |89T “ + OIMOG ‘AM 1F'0 9F SI 906 spuowpy swogeNo “PrwSurga gel
2 "90 806T |ShI “ “ wing “HM | 880 8109 GI S88) SENT PRTTE A susuvy ‘oOUlIBAA EL
: des 8061 | 491  ° 2 yıug ‘A LF'0 SLILS FE deg sioam) —| Aesop MON “QUIOGT USIET 98T
: wıqunjoy
= des 8061 [ahr is 18m H ‘M PPO BLT 61 1ge Aso aoost ysyug “P¥oET Aqovegy GET
| | O8NoF SsYY9sny9Bsse [N ‘Osnorl
2 Ads su I © 3 ynug “gf 19°0 08'8P 18 091) JAST quiog join | JUSII PUSEL AjuquES FEI
. das gosı | “ x a a SF'0 86 8L SF 06 | asnop y43rT Ysooqey, UOISUIYIeA\ JOSSBIO EET
: | uoydut
* ‘Buy 8061 | Grr =“ se roSing “H 'M 880 69e 88 LOS 6 SITY “st “PUSSUMOY 10 GEL
= | Ang g06l à < a © go eo65 0 29 yueg Aug se ‘1N0J0CL I£I
= Amp gosı | “ : : ¢ 99°0 OSI 69 GE e[OqIy, uedrypıy “UBOIN A (ET
® Atop goer | * . : 8 F0 LS'e8 [8 691 eruopopeg usuoasiy ‘SXOUTOSS 63]
SUur seo |e ö : . 280 39T 17 29 wort SIOUI(I] OUUY JUIUS Bgl
| - 2 oung 8061 | “ . x = 120 869 84 LIZ PUEIIIOY TUBIPUL ISA LET
2 Av 8061 | “ f . = 880 OSL FS OF uomg eA UBBIILPIY ‘UBUITEUS 9ZT
= | sum 8061 |891 “ 9IMOY ‘A | 880 ae Wer 1907spooM | usdıypoın "Kepungg co
2 ‘IVA 806L | FL 'poayL ua ” S 80 9T’LE AU 611 AUX 1S0M | grurojtfe) “LOQAVET Fol
| SP ey a enol | | (pro) osnor |
paysıpqnd Jon | “G90 806T | -Opooqy, aq BA Ye sLıeJog 18104 ‘H ‘M 610 F E02 97 88 | 4yStT 8morf yuog | RIMIOIT[RQ SOSSIqE UBS est
| | | SINO-SLVLT
a ee
sonbrewayy uoryesıpgnd ef op 91417, ee algae $.1N9}8A1OSq() di yuuizYy uOLJ291T(T | SNOLLYIS
jo oauuy | yuammıysur 30 OPoyaA IUT |

 

 

LANIZV

di tei ed Lahn mil 1 rl il ns LL : dd) 1 lb

 

{hts san ph An ha

 

sau mans si |
