 

 

 

 

 

 

 

 

 

 

 

 

 

 

 

 

 

 

 

 

 

 

 

 

 

 

 

 

 

 

 

 

 

 

 

 

 

 

 

 

 

 

 

  
     
  
  

  
   

 

on a da Vecchia |

Lie

)

|
0
NS of
N |
8%
Vor
>
MR
58

 

 

  

 

  
 

 

5 x 6

LAVORI ASTRONOMICO-BEOBETICI

= Sfferenze di longitudine determinate due volte indi_

.… pendentemente e pubblicate
Differenze dilongitudine pubblicate

eseguite.e pubblicati so-

loi risultati
» " »  manonpubblic.
@) Stazioni di latitudine ed azimut pubblicate
x eseguite e non pubblicate

 

 

 

DA
ls

 

 

 

 

 

  

ET Jesse > pop ea ae
0 1 2 En

 

 

  
    
 
  

REGGIO

a

 

SCALA OI 1: 5,006,000

on : ri a

Settembre 1895

 

 

 

 

 

 

 

 

 

 

 

 

 

 

 
