 

0

 

 

 

 

   

 

 

 

 

 

 

 

DIFF. DE LONGITUDE
STATION. z r ne OBSERVATEUR. Instruments employ&s,
2 De probable.
nn In Ss Ss
36 Berlin. Centre de la | + 53 34,905 | + 0,018 |} Becker, Nahlik, Küh- | A Berlin, cercle wer.
grande coupole. nert. dien.
Greenwich. Gercle me- A Greenwich, instn;.
ridien. ment des passagesı
Repsold.
a7 Berlin Centre de Ta Veir
grande coupole. Autriche 45.
Vienne (Bast. des Turcs).
38 Berlin. Gentre de l’Ob- Voir
I ser'valoire. France 29.
| Paris. Meridien de Gas-
| sini.
;
ı 39 Berlin. Centre de ’Ob- Voir
| servatoire. France 30.
| Paris (Montsouris).
'40 Berlin. Centre de l’Ob- | + 25 11,603 | # 0,007 | Albrecht, Löw, Richter. | Instruments des pas
| _ servatoire.
| Bonn. Gentre de l’Ob-
servatoire.
4 Bonn. Centre de l’Ob- Veir
| servatoire. France 31.
| Paris. Meridien de Cas-
| sini.
42 Bonn. Centre de l’Ob- Voir
| servatoire. France 32.
N Paris (Montsouris).
|
43 Berlin. Centre de ’Ob- | -+ 13 48,505 | -£ 0,008 » Instruments des passt
| servatoire. ves A lunette brisde |
| EG ns ss risee. I
| Altona.‘ Cerele merid. 2 ; I
‚44 Altona. Gercle merid 814,7 06 >
B Se 2 | 2090 »
| Helgoland. Point g&o- nn = >
| desique.
|
45 Altona. Gercle mörid 11 23.03 }
En Id. 23,025 | & 0,008 E »
' Benn. Centre de l’O»- u
| servatoire.

 

 
   
 

 
 

ges de Pistor et Marl
tins. | >

 

 

 
