MORE

RT PPT ATP UNE |

am an qi

ik!

je air

a as

BR

æ
x
=

27

D CES

    

 

  

   

 

 

 

 

 

 

 

 

= RR Winkel :

Namen Berichtigte nach gleicher Log. Sin.

der spharische Vertheilung dieser

aay i des sphärischen a

Stationen. Winkel. les Winkel.

XII. | | ®-ar| | er. lM. 8. | |
Twistringen . . | a.{ 77| 22| 23,464 “| 22 22,521 [9.9893668
Mordkuhlenberg ; b.[ 40 À 33,445 19.8084522)
KRuckhber... He 85) | 4076114162 35| 4,034 |9.9482645

| 1 1,827 | ”) 0| 0,000 le.

XIV.

Asendorf 2. 72| 24) 26,842 72| 24) 26,364 19.9791974
Twistringen . . | b.] 51) 48] 43,482 | 51) 48) 49,954 |9.8954146
Knickberg : . . e 1, 55, Aoı 959 55| 46] 50,682 19.9174486

Fi ° 1,483 | 180| O0! 0,000 le.

DV. | |
Bremen . . . 4: a) 44] 29] 41,484 | 41) 29) 40,807 19.8212189
Twisteingen ..*. | bel 277) 41), 38,638 77| 41| 32,960 |9.9899024
Asendon . 1.77: c.| 60| 48| 46,910 60| A8| 46,233 }9.9410299

a À 2,032 | 180} 0] 0,000 le.
i XVI.
Steinberg . . . | a.J 70] 29) 1,740 | 70) 29) 0,932 |9.9743025
Bremen . as b.| 52) 16) 49,344 52| 16, 48,536 |9.8981829
Asendort ... e.| 57| 14| 11,340 | 57] 14) 10,582 |9.9247491

a ° 2,424 | 180 û 0,000 lg

XVII. |
Zeven as 52,8, 26 52 8| 23,284 |9.8973580
Bremen . . | b.| 53| 20) 4,004 | 53) 20) 3,111 19.9042459 x
Steinberg . . . |e.| 74] 31] 34,498 | 74) 31| 33,605 |9.9839651

‘ 2,678 | 180 9 0,000 lg.

XVIII. | | |
Brillit 2. 0. la. 7528| Giese 75) 28) 5 cin. 19.9658 704
Bremen te b.j 33) 44) 18,130 33| 44] 17,394 19.7446046
Zieven re COPAINS AE 70] 47! 36,696 [9.9751280

| 1 2,207 | si 4 0,000 le.

XIX. |
Garlste . a.| 115) 52| 11,136 | 115) 52) 10,733 |9.9541407
Bremens. u... b. a 29| 56,439 34| 29| 56,037 19.7531159
Bold ne. c. 34, 93,632 29| 37) 53,230 |[9.6940952

“480 RO. lg.

D N men ° 0,000

 

ES

Berechnung der Seiten.

(in Preuss. Rheinl. Ruthen.)

ac.

ac.

ac.

+ ac.

ac.

ach

ac.

 

 

 

 

ayy | m
0.0106332 0.0106332
4.0643268 4.0643 268
9.8084522 9.9482615
3.8834122] le. ab. |4.0232215

7645,61 10549, 25

00208026 0.0208026
3.8834122 3.8834122
9.8954146 9.9174486
3.7996294] lg. ab. |3.8216634

6304,19 6632, 29
0.1787811 0.1787811
3.8216634 3.8216634
9.9899024 9.9410299
BO lg. ab. |3.9414744

9780,18 8739,25

0.0256975 0.0256975
3.9903469 3.9903469
9.8981829 9.9247491
3.9142273] lg. ab. |3.9407935

8207,81 8725,56
|

0.1026420 0.1026420
13. 9407935 3.9407935
19.9042. 9042459 9,9839651
ee 9476814] lg. ab. |4.0274006

8865,06 106514 ,25

0.0141206 0.0141206
4.0274006 4.0274006
9.7446046 9.9751280
3.7861258| Ig. ab. /4. a

6111,19 10390,8

00458508 0.0458593
4.0166492 4.0166492
9.7531159 9.6940952
3.8156244| lg. ab. |3.7566037

6540,70 5709,57

4*

 
