HAS CPR

a rene

Li URL HU

LR im

iin

DU à DOC DPI Om Tk à

 

 

 

 

 

 

 

 

 

 

 

 

 

 

 

 

 

 

 

 

 

 

 

 

 

 

 

 

 

 

 

 

Resultate der Beobachtungsreihen in Honolulu etc.

 

 

 

 

 

 

 

 

 

| ||
| Gruppe | Kreis- || Mikro | Correction wegen s | Arithm, Mittel Halbe Diff, | Corr.
1892 | und | | \ ae d heinb d
| Differenz, er scheinb. er wegen
| Paar | le, Ne, Liens) Sue Abe Declinationen. | Mikr. Ables. | Refract.
oe > | |
s | W | 8¥o74| 21.0 -o|-+ 2.0] 88o Se ” ae
| ı © |r2.163|-132.3 L 1.64 2 eee + un + u +39) 7 0:04) 20) 1g 25
| 6 | O | 9.188) .o 116 921 | |
| ee las 2314 san 2.030 || 17 25.51 —1 1.06 —0.02 24.43
| : | | |
| a | We ne oe JE «53.067 | |
| "ol, 709.433. 3 “li ce ae — nn 20 a 4.22 —0.07 24.79
| | | |
| 3, 0 on. a eee .g\ r.sirr. 308! | |
| ny | a u cl a Dee + 2.393 | To TE 30 1 11.98 4.0.02 25.30
| | | | | |
VAT | 712 886 10,02 oo or | |
| ro rn à TOI . l Se à A ns sa 32-037, 0 oO 254°
| | | | | | | |
| 2 | © |ı8.135) 117.01 0.282 2713 18 | |
| 7 | | | | 16.845 | 8.88 +8 26. . rc
| W | 1.315 5.4 1.1.4 5.0 1.313 I “| Te a 26.70 40.15 25.73
| | WZ Ie cos) Eo. : 2.212.018 | |
| 3 lO “nil oe À 1 à ao) 4.270 | 18 33.35/—2 8.44 —0.04 24.87
| | | | | ; - | |
| | | | 1 |
| 4 | O |l16.582|-422.3 .4 2.916.60 | |
| wie 2 Lane +12 919 | 9 56 a 28.60 10.12 25.05
| | | || |
W 12.202 903 ı 932 ,06227 | |
sphere) PS
| 6,0 | 6.377 27.1) on oo 6.405 | |
| 10 17 002070) 6 2.213.004 99 | 19 43.08 —3 18.50—0 27) 245
| W |14.07 LB girl 02 tala |
| oO | on 2 + eo oe Le 7) 19 52.42 —3 27.46 —0.06 24.90
| | | | | Il |
| | | | | |
Hepr. 29.) Vil | OÖ 1.00 11 0 : 1.314.409 | |
var) 9 easibeslt otk set § ous] ni ae |
| | |
| 2| W 11.132 8.8 — 0.3 1.211.141 i |
O eis ee ee = on Iso. at 0
3,0 10.785) 1.6] .8 0.710.786) | |
| W |10.968|—11.0|+ 0.1/4 1.0)10.958 N 16 30:09 Re | a
W len 8a so à a ee
| : O Ie Ee gE dE I a ce | eee a
| 5 | O 11.602 10.1| de. |
| 9 ape etant ENS
6.) WM 10.983 + se nl 2.010, 993, | |
| lo 8.936/+22.3 a, à a 2 17 256.65|—1 1.09 —0.02 24.54
| | | | |
| 0 6.053 — 7.5|+ 1.1|+ 0.6) 6.047) _ | is |
| W 14.192] —29.12 — en | 20 29.23 —4 4.16|—0.07 25.00
| 81 W | 8:672|416.7]— 0.94 2.2) 8.690 |
| | @ en Erler one] + 2.398 | 15 13.451 12.13) 0.02 25.99
Viz | W | 1.6174 2.3|— 0.2/4 4.2] 2.622] | |
O 5e ae .1| + ee +16.839 | 7 59.0248 26.52 40.15 250
| | |
3! 0 | 8.097) 415.64 1.3/2 2.0) 8.116). au 4 SE
| W |I12.373|— 5-8)— 0.14 2.512.370] I we
4 | W || 3.527] —ı1.8|— 1.44 1.2] 3.515) | :
O |\r6.414|-+ 2.9/+ 0.1/4 2 516.420] 1 7? 995 | 9 56:47) 10 28.28, 1012 “177
O .827 18.6 + + 0.6) 5.846)
: PW, so = = un 0 4) 19 52:55 3270) a
8 | W a 5.6 - 0.5.4 1,314.396| a es 5
O | 4.770 +370 + 8 oa — 10 24 21.27.40 —-5 2.81 0.08 4-51
| | | | |

 

Bi pei tine isd

en

en a ee er

N ne

u een

sn it RL

Ki nie

 
