   

 

 

 

 

 

 

 

 

 

 

 

 

 

 

 

 

 

 

 

 

 

 

 

 

 

 

 

 

 

 

— 1 — PR oe
| NY Rise
En.
i | | | | | | 4
a. N? | Te LATITUDE LONGITUDE) & | oe | INSTRUMENTS ~
ee bee ok | = Hi | ET OBSERVATEURS (og .
a De
Triangulation de Pologne. Jonction & Thorn. (Sucte.)
JOS 200%. FAGOW. 2 10292828 | 39°16 351
BIS 26. Krusche 02 26,28 3 2% |
0°. 262 Pustelnik. ........ Be 161% | 39 6h |
OS 263 | Kobelka........... 52 20 28 | 38 51 46, | -
264.| Milosna. =... | 52 13 35 | 3853 9 ho
265. Marsovie ......... . 02 14 41 | 38 40 40 | |
266 Lens 0... FD 28 0 3 0 oF
267 | Zakrotschym....... oe 20 33 138 173 i
2 Bm 0 LES 13.10 238 15 52) 3 ae
269, l'Radikow.. 52 15-59 | 37:57 52 2 Ss
270 | Slomino.......:. ne | a me
271 | Zaluskow........ ..) 52 18 26 37 30 40°] 2 cS
272, | Peplewo. 03. 2... | 22.30. 08 1-37 30 10 | oe = à =
2 Bybe. 0.0 Do 2) 0 57 1 0! = ©
274 | Slomkowo......... 92.35.50 3730 54, 0 oS =
275 | Maehévo.. 2. «1.52 34 49 37 17 46. = = 3
276 | Gesdowe .......... | 52 44 Oh 127 20 30” 5 À 3
277. | Bembeln .. 252 58 41 | oh a
278, Baldowo.. . 2 ..:..52 487 3658 54, | = Ss <
219 | Spetal  . J. 07 52.40 80 | 26 4a aoe I =
280 | Konotope.......... | 02 08 16 3647 a |
281 | Razionjek......... | 52 51 28 | 36 28 8| |
282 | Dobrzewitze....... | od (12.9136 eles ®
2 Das 2... 258 3 27 186 ae i
284 | Kowalewo......... Lo. 9 27 | 86.30 527) A Bee
285 | Kulmse......... 5317.10 ..0 100 ; _
Se 280: | Phorm. 1153 :0°42 "36 16 17)
|
. Triangulation de Pologne. Jonetion a Tarnowitz.
Tortschin et Osmi- ) |
= gowitschi........ \ |
Ss = . 287 | Paulowitschi ...... 50246 2, 1223 0"
S288 | Swinituh!....... 2. Bee >|
S = 289 | Rykowitsehi....... 50 39.81 42 1) 38 |
S = 290:| Kmelewka... ..... 50 46 11 | 42 555 |
€ 291 | Sabolotzy.......... 50 37 36 | Al 56 18) |
S 292 | Wischuew......... 5034 42 | Ale old
< 293 | Wetzatin......... 60 48 15 14140 20 5 |
S . = . 294 | @dechin....... 120401645160 38 | S a
= = 205 Rilme uy), 50 33 4 | Al 13.80 | 5 a
¢ 296 | Felixowha......... 50 36 56 | 40 54 34 | . m ©
© v2. 297 | Dembowelz .. 50 48.10 | 40 58 54 | 2 =
¢  .. 298 | Kawentsehln...... 150.4, In | 40 34 20 | ca = ©
ee 200 Guin | 50 47 13 |.40 19 29 | = =
; 300 | Welobytsch........ 20 59 18: 40/46 8 | & = oS
: 30 | Petzkow =. 2 7... 5, 250 40 1659| = 2 =
302 | Dominow.......... 51 114840915741 i eS
308, Spddnik. 2... 51 13.28 | 40.19 53 | =
304 | Krenjnitza.......:.| 51 10 38 | 40 7 3 2 7
308 Dee se 52 19 15 , 4013 16 =
306 | Tomachewitze..... V5) 16-138 1240 © 30 |
S0F:- Ahramem: ....... 51.2750, 5999238 |
> 8 308 | Zbendowitze....... 51 21 36 | 39:40 46 | :
; & 309°) Kratschewitza ..... 51 12 34 | 39 4 19) \
SO | etwas 2 51 15 42 | 39 26 42 | -
: 311 | Kamien .: | 5l 114 720808 3 ii
312 ,.Wiggda. 5 510 7180016 2 ie

 
