een |

BE A

perte

CT ahd Mod

Objecte.

Dolchauerberg A
Arneburg A
Stöllnerberg A

Gollwitzerberg, Belv.

Landsberg A
Zichtauerberg A
Hoehbeck A
Polkern A
Arneburg A

Dolchauerberg A
Hochbeck A
Woltersdorf A
Arneburg A

Wittstock A
Stöllnerberg A
Arneburg A
Polkern A
Hoehbeck A
Ruhnerberg A

Stöllnerberg A
Woltersdorf A
Ruhnerberg A

Glienitz A
Karenz A
Ruhnerberg À
Woltersdorf À
Polkern À
Dolchauerberg A

0

Station: Landsberg.

 

 

 

 

Grad. | Min. Sec. Log. Entfernung.
ol of 0725 | 41832808.5
13 | 40 | 41,718 4,1863060.8
85 | 48 8,997 4,4627460.9
33,368 4,3564447.1

| 134 | 54

Station: Dolchauerberg.

0 0 0,011 4,1832808.5
64 | 50 0,568
205 1” 23 1,740 4,2970799.3
258 | 46 6,850 4,0224719.1
306 | 34 | 20,483 4,2636688.6
Station: Polkern.
0 0 1,225 4,0224719.1
92.111138: 1 22,882 4,2124953.8
176 1 | 54,666 4,3251865.3
262 | 28 | 43,404 4,1371505.8
Station: Woltersdorf.
0 0 0,008 3,9696933.7
| LOL jak 2,429 4,3172791.1
1357| 35 1.283841 4,3884147.9
471 1.37). 2024 | 4329106

211 | 38 | 43,661 4,4013702.2
266 S| 25,397 4,1845647.2

Station: Wittstock (Hexenberg).

0 0 | —0,088 4,3877972.8
56 |, 21 1° 26780 3,9696933.7
112 1 0 | »00 4,2658223.3

 

 

 

 

Station: Hoehbeck.
0 0 0,026
46 | 20 4,775

115 | 58 | 12,346 4,3122526.2
153»] : 19°) 916,190 4,4013702.2
209 | 48 6,965 4,2124953.8
241 1 511 41,848 4,2970799.3

Entfernung.

15250,388
15356,989
29023,253
22121,902

15250,388

19818,919
10531,056
18351,386

10531,056
16311,556
21143,967
13713,572

9325,955:9
20762,474
24457,655
21143,967
25198,240
15295,536

24422,903
9529,0900.9
18442,607

20523,558

25198,240

16311,556

19818,919
4

 
