 

| a

2. Parallel von Shirakawa-Licata. 9p=+377

Corbination Ciba yan, Shirakawa! 1 zn. 2 2 221 2 yohe

Holen Inc Salem) ı... 2... — 14.0

Ostamerika, Petersburg (Virgmien) . .. .. + 77-4

Westamerika, Felton (Californien)... ... + 122.1

| De Py
2: = 1.86 «= 1.02 __., 0094
N = 609.9 und 150% Das — 1:95 Pr — 1.83 A 972

Diese Combination hat bisher im Vordergrunde der Discussion gestanden. Ihre
mathematische Grundlage ist als günstig anzusehen.

| 3. Parallel von Fukushima-San Francisco. Pp=+H 3747
Combination D: Japan, Fukushima . . . . . - a... 2.1 — 105
Bo Marsala (Sicilien) . . — 12.5
| in ika, nördl. von nd any. 5 77.0
Westamer Di Sternwarte San Francisco . . . + 122.5
Px Py
_- ı98 Dy, = 1.88 ; =o9
N = 43'9 und 133°9 Das — 1:95 Dumm — WSI 41-0911

Auch diese Combination bietet vom mathematischen Standpunkte aus günstige
Verhältnisse dar.

4. Parallel von Sendai-Palermo. P= + 38° 10
Combination E: Japan, Masuda, Vorort von Sendai ......A=— 140°9
Italien, Ealerun chen) sy... — 13.3
Omen ika, nördlich von Richmenn isn) + 97.4
Westamer ik a, Benicia, nordöstl. vonSan Francisco + 122.2
Px Py
= 1.8 y=1.3 ae
p 7 Py 9 TE, 94

1

N — 409 umd 139% Pos = 1.94 Pam 193 0 11-011

Diese Combination bietet eine günstige mathematische Grundlage dar.

 

 

ä
|
i
i

Libkunulaubucı.

blass.

ca anaanma hl bs a lb an

EEE!
