 

te mee ner

|

1892 July

| 1892 Sept.

|

| 1892 October
|

| 1893
‘Feb. and Mar.
|

1893 Sept.

 

|
| |
| 1893 October-
|

| 1893
J uly and Aug. |

Im

 

| 1894
= July and Aug.|
: 1895 May |
1895 May
1 1895
‘May and June
|. pes
June and July
1895 |
July and Sept.|
1895 Sept.
:

Positions moyennes

des étoiles

See note in column
|

of remarks

 

 

TITRE DE LA PUBLICATION

No publication has been made.

C. and G.-S. Report for 1895.

No publication has been made.

 

 

REMARQUES

Computed since last report.
W. Eimbeck, chief of party.

»

 

 
