 

ST ae ae nS Se See et eee

| fo!
|
f
|
|
|
i

86

 

7. Station Valhöi.

= 55. 40: 29/6610 1.0 02 05 5599

Log.d. Entfern.
in Toisen.

ao 3 0 : _ 60° 26. 184,91 4.082322
Noa. 0 0. . ._. 266.55 47.39 3.0019525

Azimuthe.

Ba holm. 5 2°, 2. 300 45 12.78 3 4607934 :

Sydlce Undepumkt.. ..4.. .-» 303.40 „19.61 3.6839332
don 6  ) ... . 7. 331. 18. 29.78 3.8698809
denote  . .  . 9554 45 21.47 3.4385065

s

8. Station Kongelunden.

Re 9D (35 39 6090 - . = 2. 02, 00. 2978314
HOME eo 22... 2 31 299 41498176
Ome ee . oo, 48 57.64 2.100 1290
ne dal. 238 (56.38 9.8098809
DC 2 + D 169 11 904 3.8279748
Boleuderoy >... .°......228 03 44.88 3.4736620

9. Station Snoldelev.

. — 55° 34’ 1671320 | = 1. 0° 26° 3971018

 

 

MiGiiemOscmyers à . |. . .. 104° 21 13756 4.1753947
mau 0... 0.020.194 Db1 42.47 4.1233437
Oe see 01,40. 07.53 3.6448642

nn. 240 ..30.-26.,33 4.0823225
wo. ..0.2...5346 09 36.79.  : 41209845
CAG 55 91.62 * 410979894
moe ... 0... 26451 10.59. 49149986
Don dlundua . .... ....272 09 58.68 4.1498176
oe Moll 8 . - . ... 326.43 19.00 42352542

30. Station Julianehöi.
P= bp) 46 be 724i i= -+ 0° 37’ 10"2943

Morkomosebjere : . % . . . 46° 41’ 40"58 4.0846993
eu 0 0 D. Lun. 992 90 90.68 42564394

0 ee 286 05 05:70 43145344:

Boll on ou 333 19 18.29 3.9483179
PON dl. 93443 01.19 41283437

*
we eam A mB A id) mek

  

 

|

 
