 

RR Pe QU me i) NUL ART LUE «in eye eye Tye | | a ea

 

| | ‘op Con a UG 46 | 09 ce ce | "xoy, ‘oseq “| “@ SIMOG | eCT
“op GO6L | FTO 86 | Ge LS Se | "Xoy, ‘oseq “AA “N OTMOG | BST

‘op GOGOL | Ge Jt 86 | 0S ol Ge “xXoy, “URIPUy | [ST

‘op BOGL | iz 1 Ch | Ho. eo Ge ‘xoy, ‘“sunperdg | OEL

‘op GOL | 8S % 86 | 16 16 Se ‘xoj, ‘Souof | GET

‘op “or ee am en "xaL und) | SEL

“op 2061 | IS FI 86 | 98 Le ge “xey, SaoÂIY | LOT

“op C06L cr. seo | Je Se ee ‘XoT, ‘oqn) | JT

: ‘op Glen | Ce Ch 1G 0 ey ee ‘zo, ng | Gel

‘op 2061 | 79 17 16 | 6S % FE ‘LI ‘Aperay | Pe

‘op “OG | Se 16 | Se Ss 7e *L ‘I ‘uoyueg | e2L

‘op 206L | 9F 6 86 | OF 86 78 "L ‘J ‘weound | @é1

‘op 2060 | 7S Fo LG | So WL VS "L ‘I Yuaumuom | [GI

‘suotptsod OL UT SAINSBAU ‘op &O6TI ie ee L6 8 al pe af 7 “901 ], AUOrT OGL
peystiqnd yon, OH uoy up yore zog PUS ‘op 2001 O0 ST 20 2 wre ‘LT umgunom opponqry | GIL
15 01 SuIpeoi so dos À ‘op ZOnT. M HP 0 | 2 9er LI opyongay | Str
d0wozozuT aaa} WM GOT ‘op ZO6L | ST PS L6 | OF IP 7e Dodo) 1
pu LOT soN SO}TOPOSY} “WO-OE ‘op GO6L | BF 6G L6 | 8I OF FE LT IH OrasL | 911
\ ‘op SOG IS u 2 years BHO “MY | SLL
‘op | e0el | 09 06 16 PSE 0 Ge ‘LT 11840d | FIL

‘op zZ |oe 6S 1616 t ce AL Jowmer cr

‘op Goel | Se us Dé CO op & Ni Duo) CT

"OP GOGT | OF 66 L6 | 1S 8B SE ‘YO ‘AHUS | LIT

“op GOGL | PZ 9S L6 | OF 9% GE ‘eo ‘oseq 4svq OU9Y IX | OIL

‘op C061 | FC 7 86 | 7 66 SE "BETO ‘oseq JSO A ou IM | 60L

‘op 2061 | 1% SP L6 | OS 8B SE ‘BIO ‘UOAUX | SOL

‘op GO6E | Le 6S 26 | SS 9S Sg eo ‘OPPE) | LOL

‘op B06L | 9S LB L6 | 38 68 Sg ‘BAO ‘Spuowpy | 9OT

"op BO61 | St Is 16 | Ly iP ce elo ‘yoyo | SOL

‘Wosnsiog “MO | BOGL | 69 LS L6 | SE Gg gE wo “Wosing | FOL

| CS mogwenmm| GO6L | 0% 66.16 | LP 99 C6 wo 'PıedurM | SOT

 

 

 

 

 

"98BQ 9IMOT 0% aseq ouoy IH

 

 

b SIN9FATISQO Ed en .
: NI4SU anbo 9 oO | apnıme squiod so 2
K sonbrewaoyy S] USN I4SUT yo sanoyooztcy H ut PRAY CT QUI p uorgeorpuf oN

 

 
