 

 

 

 

1
| Tableau n®. 15. — Danemark et Prusse.
Numeros matricules Altitudes definitives
des reperes En orthometriques
Noms des Be EL LE Designation de SB Differences
P’emplacement des
localitds i Danemark _ Prusse D-P
Danemark Prusse teperes
D BD
1 2 | 3 | 4 5 | 6 | 7
IITTTITITTTTITITCTCTITCOT m
N + NN
N 3 B 2 m m nı
Tarming * 8609 , Graensepille, lige over 35,798 35,549 H 0,249
for tysk Milepal
Ved Hvidding 8588 Gran$epille ved den 9,495 (?) 9,249 - 0,246
Station danske Graense
Foldingbro 3 8632 Gransepille ved'l'old-, 20,839 20,598 + 0,241
kammerbygningen
Kalvslund > 8637 . | Grensepille ved Bav-| 21,988(?)| 21,743 - 0,245
negaard | |
Difference moyenne generale: D-P = -H 0,245
Tableau n®. 16. — Danemark et Suede.
Numeros matrieules Altitudes definitives Differences
a des reperes Designation de . en nn
l’emplacement des [
localıtes | F Ä Danemark Suede Moyennes
Danemark Suede DZ e Partielles par
D 3 localite
1 2 3 | 4 | 5 6 7 | 8
m DL nn nn
+ ZN + Niveau
moyen (?)
m m m
| 1341 5 Kronborg, Frederic d. III. 10,974 10,880 8 2 | 5
ln : Bastion ee 0, 94
Helsingöi ı 1496 » Kronborg Telegraftaarnet 31,256 31162 DB) a
| 1497 . 4 Düetaarnet 26,239 26,145 1 0,094
ß 718, Mog. | Pälsjö Klint 30,576 30,479°81%1.0,09. |  , goas
Helsingborg h Tal PälSjö Leje 10,758 10,664 + 0,094 ne
i 5 Po) Vikingsberg 24,862 24.768 —. 0,094 + 0,094

Difförence moyenne generale: D-S = -+- 0,095

 

 

|
1
|
