 

 

-wogsig OUST AA.
|

| | | ¢ A o
8800 + £00°0 + SGLTS6| * u SEL IS6 | 9FL 186 Cal o | oco‘rec | 9‘ost ‘0e osl 8°2e | OHEMUTIIS “MOU puejseny  &
| a | | (uorye4g-Zus10j0Y)
GF0‘0 + ,980°0 +1880°L861F06L iyzpny FILIS6 | ESL 186 ce | 0 | ozotise! 608 of GI] 66 Oo | mnumg ner uarzıeg "120I8Q | «I

-Iyzaay -Jorıg unopf ypınp uodunssem 'pAI

TE:

 

 

 

 

 

 

 

z.ps/uo | „ies/wa | „was/to = „08 /us „.os/uo g| EX „tos/uo re os > Hi
| 4 Er > a © @ 5 £ : |
| 6= |\mosos sot + 4] we kg a | See | |
Mh IM BIS = |, = 194, qouqooq SuUIvIIey, Sep aaneu93 19p0 en | 8 2 a 4 Slug = = oyraıg UO Jop OUEN an
| |: uoryyea} y iS = )? of Da zZ + 5 Ss = 2
| = 2 06 ope, 1 = es | oO og © Fo
SQUTUL > 5
| el po! one | ee ? os
— = . — A

 

‘19749809 9U9SLIUSUN-HOSIUOI91107S0 OUOPOTUISI À

*AI OIIOQUI, Jop SunZJ9SJIO I

 

 
