 

ns

{

XVIIL. XIX. RX.
Perriere Lauro Stella Grecuzzo Montagna Caltagirone. Montagna. Montagna Grecuzzo Cane. £

|

 

ee ee —
! I

CSS 1e — 59 40 30,676 E78 = 5832 06,738 | [59 ]= 6841 32,58624
[98 142 = 4840.05,929 | [79] —4e = 38 11 37,107 | [39] = 6654 40,43056
[3°] 4: = 56.28 37,194 | [192] — 1e = 68.0327,763 | [4] = 46.46 31,58457
[946] —4e = 66 54 40,000 | [9] — 1e — 39 17 35,345 | [io ] >= 69 36 38,40572

10
[229] — 48 = 35 29 49,913 | | 59 ]— Le — 68 41 32,098 Pi] > 4725 32,42174

pa] = 16 46 31,58457

[740] = 65 29 44,29127

[946] = 67 43 45,67315
—e...1,549

 

 

 

 

10 ä
9,9360998,3 9,9309291,9 ner ieee _
> ) ?
9,8755818,7 9,7912141,5 en
I 9,9209911,7 9,9673423,2 ann
| .9,9637395,0  9,8016015,3 DENN
| y 9,7639242,4 9,9692491,2
5 9,4603363,1 9,4603363,1
_ Ä 9,4603363,1
É 00,0
| XL XXII’.
N Perriere Caltagirone Grecuzzo Cane Altesina Casana Montagna. Baur o
; [295] — Je = 75 48 37,988 | [92°] —4e = 35 2949,913 | [9 ] = 38.59 10,73429
| : [AUOT Le = 30 17 36,345 | [0] — Le = 73.47 44,657 | [72] = 53 3438, 75578
k | | 016] — je = 67 43 45,157 | [A ]—4e — 65 29 43,775 | [49] = 5437 20,04735

pot] — de 52 00 387,922 | FU —
iat] dea 54 1634518 | [151°] —
p80] — te = 66 17 30,343 | [51°] —4e = 49 07 26,048 | [13°] =
| [%5]= 5940 31,37934

= 6222 44,387 | [824] = 60 39 00,10779
s= 78 1753,842 | [45] = 5417 41,22067
38 11 37, 75480

|
|
i

a cold calm =m ae

 

 

 

 

 

| 9,9865435,4 9,7639242,4
9,8016015,3 9,9823946,9 ee eg
: es 9.9500073.2 — 360 00 00,00000
À 9 8965944,9 9,9474502,3 on
i -9,9094713,2 9,9908788,5

À 9.9617080,2 9,8785945,1

| 9,5222498,4 9,5222498 4

; 9,5222498,4

: 00,0

ie
ke
N
IB

4
A
ù
I

rer

 
