 

                                     

 

 

 

 

 

 

 

 

 

 

 

 

 

 

 

 

 

 

 

8g Sr: 60 — W9JSÂS rower jne uorynpay eyIoyeuasuy
668 +) 8¢g +) 883816 | 6IgL “qouro sory || 019826 | IT9'8L6 | (88) | — | 019826 || & 89 FPT + Gel +] RS a > JUS |
| | 3peIS “ujosay SEEN ‘weng "UNO Toliug | 9
88% +|888 + 660'8,6 | ez8T “forrodng 188 826 os eo | noel GEHE | 828 L — eg Kang ‘Zqe[q Sourqug ‘UOISUOS YF | ‘6000 ‘Juey | &
1610 + | 9810 + | 000826 | 8er "yourokarg 98T'8L6 | LET'8L6 | (2) 0 98T'8L6 || & SSO8T + l9T O0 —]:: ‘eoumy noy oq yemey pesay | : : : : ‘eespng | T
"AHXYHAN(T YOUNp pun LENIOXHUT UOInp ue.dunssepy "IX
"WEHT Leqn "wer (I
eh = cL — Ges1 u u u n 4 TEEN HL ERE ET Se
Bees ee Oe ti LT LOST Wajskg our me uorpnpay ay1oqeuosuy
sel TILL +] Fe6‘ise a E _ || 180°686 | 280°886 | (8%) 0 610°886 || 6 180 7 19'909 RR RR MOIS OUR EE Cet
Rae ‘aloo, ure FRS ‘sun | ujesuf-puspjoyg ST
SOF | 20L +| 199786. | Liat 4olg “g °C OLITS6 | SL9‘'TSB | 9% 0 999186 || 18 OLS; lose cc : a 9ssenta], “MOL AUOT | uoruusgtigssong | gy
48 | 18'.--E | Ori 186 | 60ST NOG 0 FOI ‘A 'L|| LS 186 | Las‘ Ie6 | se 0 988186 || F 88%: ee To ee “2.22 8sogos
-oSpım ‘UrZ88e Pre Sur
nern “Wl 2 Sundıporipu, © uoyaLyund : TI
Gh +69 +] ere‘ose | “ ee oe «cr *p ‚| 810°T86 | 8TOTS6 | 8% 0 | .966%086 I, | 088 + |2'ossr ee ps HI DIET
| EE Sey Ot ae = BT op offes “erlojearosqg ‘Ste OL
69 +166 +! L99‘086 | sogt "noryyemw - 969°086 | 982‘086 | seg = 119086 || 906 |9 ge + |s‘orcer Be ROSE ©] Sp J
[39H UT es BG 4UOULIOTI 6
a nr 689°086 | © ee 069086 | 102086 | 8°T 0 649086 || OST | 116 + |0‘88 | ee puepreyy | - + -uorpeay [8
88 —+|o81 —+| 889086 = se 802086 | 19,086 | 8% 0 194086 || 18 | GIL + | Leg re or ee unpeg : L
SIT +901 +| 829086 | szsı [og y° « 182/086 | 861086 | (Fe) | — | 812086 || go | sert + lot à ssoyosadpag * oydauy “pq snezy ‘© ‘uresun
| FAO UOUTOTH WOUI9 UT ‘UNIT -UPI9119S90 | 9
Ende + og en | 109°086 | 809086 | & 0 609086 | oT 1p == AU: AR ol ee AT xnvoplog ) qororyuerg | &
1g +/98 +! ggs‘ose | gost norgyrept nm ol 'eL'L || 82 086 | S19 086 | 9% — | 979086 || ces | & à + |s'oerr es 7 vost | : F
OST +|O8L + | 022086 5 en 068086 | 068‘086 | (9%) 0 688°086 | F ee era ea 22,2 302 seuojonregn | =: Susruede |
706. Ar 08T, + | 180086 = RE “ || 208086 | TE3‘086 (8' à Ger 891086 || 808 | SSL + !6feese rer @roquoumor | wesndyrq'uorueds|
0880 + | 6880 | 010086 | EST (IY)IOIE Egon Tr 682086 | 0rz‘086 (BZ 02. 4eo0en 6 | Jamr 2 Duos en eee a dem"
| |
‘OHITHLVL pun LOIg YyoInp uecunssep ‘?I[X
m0 um wo | | || wo 16) | | b—6 wo | wu + | |
= S > S BJ | oR
| bo = rn = © o
| Ae | 5 | A ee = , og |
4 a © PR Coes) © | : 2
5 2 | Pie eo ete her et he oe = LÉ
2 | 19498409 ren t° St an SuSE © B CRIER uOI]U)S I9P ou ANVT
04—0f 106 : | g | youqoog | 5 a bs] 5 n 5 3 boas © a N | E
= a | | I 2 Na, key 8 es | Be © LE
= 2 | 88 I Sn lee
= ead | ofa. al a | à 8 | a.
a an | af
—t |

 

    

19498409 OU9SISOZUBI IT

wy

 

 

ITX 9199 eT

I Mail tai 1; 41 uk

a 11 ER

 

 
