 

Deutsches Reich,

ENTER

 

'/, der wahren Gröfse.

 

 

 

 

 

 

 

 

 

 

 

 

 

 

 

 

 

 

  

 

 

      

af |

11

lun
i

 

  

 

 

 

 

 

 

 

 

   

Wa
N 4 F

{kr amy ama bc a ha aie Ih. Dante | valent Late oil ion

 

 

a ve 1 RT Mala
RARE OISE ROSE
