 

 

 

STATION.

 

 

1

2

3

BHO

OU

SUEDE

Bredskäv .

Kennekulle V

Bonds 6 6

Frösö

Herno

Madero, "122
Bispbergs Klack.

Klintebacke

Arderviksberg

 

DIRECTION

Djeknebölsklint.

Hallesnipan.

Högberg.

Almäsen.

Mochsjöberg.

Eggegraul.

Frausberg.

Utholmen.

Glarsberg.

 

AZIMUT.

323 46 39,94

346 48 22,10 |

303 54 0,76
518 54 48,99

 

Erreur

probable.

uw"

+ 0,22

+ 0,23

+
_
19
Q

Fr
ee
a

+ 0
+ 027

non calculé

 

|

Tosen.

 

 

 

 

 

    

os

 
