IRA

en

ill

TITTEN ULB Ballen

ini

en

 

 

 

 

Erreurs de clöture des triangles desquels ont 6te mesur6s les trois angles.

 

 

 

 

AUTEURS DES INSTRUMENTS nn NOMBRE NOMBRL In
= nero EN ; DES OBSERVATIONS DE CLÖTURE
a N 8 DE EXKOUTEES Du
8 ET on VERNIERS POUR CHAQUE A? REMARQUES
2 DIAMÄTRE DU CERCLE a OU DES CHAQUE ANGLE BIENEN
zZ : OU POUR A
HORIZONTAL ioRoscopm |, MTOROSCOPES On ee
il. i
| i Directions. |
Ramslen, Steer B.O. Mieroscope. 3 1.29 225 gu '
2
nn | Ramsden, 18 inch. id. 3 17.22 | 04 wo
\ Ramsden, a tee, R.S. id. 5 9.48
383 Troughton and Simms, 2 Teet. id. ö 3.13 3,04 9,242
! Ramsden, 3 feet. B. 0. id. 3 20 8
: Trouehton and Simms, 2 feet. id 5 2.18 1618 _
Me id. 5 27,98 on
& id. RS: id. 5 1.6 29.12 -
385 | id. B.O. id. 3 15. 1) a,
: id. B.O id. 3 12.27 Be 17 ne
386 | id. R.S id. 5 eh ns
387 | id. B.O id. 3 7.12 5». 2 2160| 31a, 9.497
id. R.S id. D 20, 13
388 | id. B.O id 3 21.22 m! re
Ramsden, 18 inch. id 3 10.14
389 ? Trougshton and Simms, 2 feet. id. 5 re 75 3.16: 9,986
( Ramsden, 3 feet. R.S. id. D 2. 14
id. B20, id. 3 18. 12. 20.28
390 | id. R.S. id. 5 > a 10, 112
id. B.0. id. 3 i. 3 414.18 :
391 | id. Ei id. 5 6.10 | ne
Ramsden, 18 inch. id. 3 14.19 18.10 e
on | Troughton and Simms, 2 feet. id. > 19. 14 | 2,22 | 10,368
\ Ramsden, 3 feet. B.O. id. 3 20.23
393 ? Trougshton and Simms, 2 feet. id. 9 2132 3,28. 10,438
! Ramsden, 18 inch. id. 5 10.41
ı $ Ramsden, 3 feet. R.S. id. 6.20 22216 . o
394 | id. B.O. id. 3 . 2.10) 2
905 id. B.O id. 3 2 =e
305 | d R.S n oa mo
396 | id. „Bo id. 3 ı s a5 or) 3 ,32| 11,022
id. B.O id. 3 19. 14 10.18 c
397 | id. R.S id. 5 20 8 13,32 11,022
id. Rs 1d. 5 48. 38 a
308 | id. B.O. id. 3 „a 6 | 2,35 ML222
‚ < Troughton and Simms, 2 feet. id. 5 I. SL 2 >
=D | namen ID neh. id. 3 . 12.08 | 3,5 Me
Ramsden, 3 feet, R. S. id. 8 2 lo. 15 :
n | Troughton and Simms, 2 feet. id. 5 I 22 | 3,36 11, 290
401 | Ramsden, 3 feet. B.O. id. 8 ie 0 ee 3301) son
| id. B..0, id. ® A 9
\
402 ; Troughton and Simms, 2 feet. id. > 13. 24 38 11, 424
! Ramsden, 3 feet. R.S. id. > 12 7
403 | id. B.0. id. 3 3.0 860 952 350 11, 492
404 id. BO, id. 3 sl 24 2.5| 3,4 11, 628
Troughton and Simms, 2 feet. id. do 24.24
205 men 8 eh RS id. 5 5.11 12. 5,34 Ni
406 | id. 5.0 id. 3 yon 10 1110| 2,46 14, 972
Ramsden, 18 inch. id. 3 19. z
u ns no id. 3 230 2 | >“ |
Troushton and Simms, 2 feet. id. 5 :
8 nm ne id. 3 a 13,48 N
Kamsden, 3 feet. R.S, id. o Ö%
409 | : se 3 3 ea 3) 3,48 | 12, 110
en and Simms, 2 feet. id. & 19.1
a | Ramsden, 3 feet. B. 0. id. ® 2283 | 3,49 ZN)

 

 

 

 

 

 

 

 
