 

 

da

XIII. — Prusse, B. — Erreurs de clöture des triangles desquels ont &t6 mesures les trois angles.

 

10

11
12
1

15
16
iu
18
19
20
21
22
23
24
29
26
2a
28
29
30

wa
SOO IDUIWDD

11
12
It)
14
5
16
17
18
19
20

21
29

79

N. D’ORDRE

 

 

 

 

 

 

 

 

 

 

 

 

 

NOMRRE
- LECTURE DES ERREURS
AUTEURS a ne ER Ve OBSTRSATIONS |. "Dh dhorumm
MPEONE ES EXECUTEES DE
ET a VERNIERS POUR CHAQUE A? REMARQUES
DIAMETRE DU CERCLE Ben OU DES CHAQUE ANGLE|  TRIANGLE
HORIZONTAL en MIOROSCOPES ee A.
MICROSCOPE CHAQUE
DIRECTION on
15 Zölliger Theodolit von Ertel (Thei- | Ablesung| 4bezw2Mi- 24 0",870| 0,7569 |, Veröffentlichungen

lungsdurchmesser — 355@m) und | mittelbar von | kroskop - Mi- ul

13 zölliges Universal Instrument | '/,, bezw 1 se- | krometer.

von Pistor und Martins. kunden.
id. id. id. 24 0",561 0, 3147
id. id. id. 24 0,291, 0,0847
id. id. id. 24 0,252, 0,0660
id. id. id. 24 0,079. .0,3306
id. id. id. 24 0,975 - 0, 9506
id. id. id. 24 0,922| 0,8501
id. id. id» 24 1,1594 1,2013
id. id. id. 24 0,604| 0,3648

idR id. id. 24 1,748 | 3,0558
id. id. id. 24 0,624 0, 3894
id. id. id. 24 1,192] 1,4209
id. id. id. 24 0,159| 0,0253
id. id. id. 24 0,888 0, 7885
id. id. id. 24 1,459| 2, 12837
id. id. id. 24 1,062, 1,1278
id. id. id. 24 0,554) 0,3069
id. id. id. 24 05502 0, 2520
id. id. id. 24 1,772| 8,1400
id. 1d- id. 24 0,205) 0, 0420
id. id. 10: 24 0,951) 0,9044
VI.
SCHLESISCHE DREIECKSKETTE 1854.
15 Zölliger Theodolit von Ertel (Thei- | Ablesung| 4bezw 2Mi- 24 7,222 1, 4933 Id.

lungsdurchmesser = 355®®) und | mittelbar von | kroskop - Mi-

13 zölliges Universal Instrument | '/,, bezw 1 se- |krometer.

von Pistor und Martins. kunden.
id. id. id. 24 0,7821. 0,5452
id. id. id. 24 0,463) 0,2144
id. id. id. 24 0,994 0, 9880
id. id. id. 24 0,338| 0,1142
id. id. id. 24 1, 747. 3,0520
id. id. id. 24 1.02, 1.0221
id. id. id. 24 2,646| 7,0013
id. id. Id. 24 1 , 496 2, 2380
id. id. id. 24 05203. 0. 0412
id. id. id. 24 0,579 0, 3352
id. id. id. 24 0:,.160:)> 0,9126
id. id. id. 24 2,947| 8,6848
id. id. id. 24 1,048 |. 1,0983
id. >; id. id. 24 1 , 140 1,2996
id, id. id. 24 1,129 1,2092
id. id. id. 24 0,688| 0,4733
id. id. id. 24 1,082, 1 207
id. id. id. 24 0,886 | 0,7850
id. id. id. 24 0,884| 0,7815

id. id. id. 24 1,098 | 1,2056

id. id, id. 24 0,851 0, 7242

 

 

 

 

 

 

 

anussaashnnhuh u 2 bh ln

rn rn hl Aha

 
