2.2

 

— 118 —

 

Erreurs de clöture des triangles desquels ont 6te mesur6s les trois angles..

 

 

 

 

 

 

 

 

 

 

 

 

 

 

: a LECTURE = NOMBRE ERREURS
a AUTRURS DES INSTRUMENTS N NOMBR ns OFeE Aurons nn ren
a EMPLOYES, SECONDES DES EX&CUTERS DE
S ET DD VERNIERS POUR CHAQUE An
” DIAMETRE DU CERCLE OU DES CHAQUE ANGLE TRIANGLE
= HORIZONTAL MIOROSCOPRS | a 2
MICROSCOPE CHAQUE DIRECTION
re
Directions.
a7 ı Rameden, 3 feel. B.O. Mieroscope. 3 22.23 : 6 6 0,232 0055
38 | Ramsden, 18 inch. ide. 3, 1920 21.20. 9:21 0,23), 0.053
Ramsden, 3 feet. B.O. id. 3 13.12 14.15
39 | id. RS id. 5 21.20 | 92
id. RS. id. 5 2.18 12 12 >
40 id. B.0. id. 3 10.15 ©, 0
al | id. B.o id. 3 >60 91: 5309| 0,26 | 0,068
id. R.S. id. 5 IH
Troughton and Simms, 2 feet. id. 5 8.10 028 0, 068
Ramsden, 3 B.0. id. 3 11.16
Ramsden, 18 inch. id. 3 DT, u 8)
= | Troughton 20 2 Teet. Id. 5 10. 14 OL 2
id. id. 5 807.021 :
4 | Ramsden, 18 inch. id. 3 15.14 \ ee
45 | id. id. 3 21.18 15.34. 29.24 | 07,26) 0,068
Ramsden, 3 feet. R.S. id. 5 9,2
46 ! Ramsden, 18 inch. id. 3 1812 0,28 0, 068
Ramsden, 3 feet. B.O. id. 3 2.15
id. B.0. id. 3 19.9 2.2
47 id. Rs id. 5 28.23 0,27 a
id. B. 0: id. 3 Ba 25.15
| id. RS, u; id. 5 mel 0,073
Troughton and Simms, 2 feet. id. > 12.21 24.24 5
2 | Ramsden, 3 feet. R.S. id. 5 5 | | 0,28. 0,078
Ramsden, 18 inch. id. 3 A :
50 $ Ramsden, 3 feet. B.O. id. 3 6.9 028 0, 078
. Troughton and Simms, 2 feet. id. a 6.6
ol | Ramsden, 3 feet. B.O. id. 3 &%.8 2a 25,18 | 02920084
id. RS id. 5 13.60.2314
52 | ii ...0 id. 3 20.14 | 0,29 u
Troughton and Simms, 2 feet. id. 5 4.10 Q
ee id. 5 8.8 27.0) 0,30 | 0,090
id. B.0. id. 3 8, 12 11,10
54 | Ramsden, 18 inch. : id. 3 I). 5 | 0 ‚30 0, 090
Troughton and Simms, 2 feet. id. d 52.31
a id. 3 31.34 36.25) u
56 | Ramsden, 3 feet. B.O. id, 3 1217,20 nn 7 .:0,,81.|:0,096
‚id. R.S. id. 5 8 16.25
57 | id. ı.. id. 3 22.14 0,31 0, 096
Troughton and Simms, 2 feet. id, 5 0, 9
88 ! Ramsden, 18 inch. id. 3 19.18 Val 0, 096
Ramsden, 3 feet, B.O. id. 3. 35
: 30. B.0, id. 3 13. 8
dad Simes, 2 feet. id. 5 9, 10,82 ..0,10
60 | Ramsden, 3 feet. B.O. id. 8 18.19 21.234 16.22 | 0,32. 0.102
61 Ramsden, en id. 3 310 2024 8210,92 0, 102
Ramsden, 3 feet. B.O. ide > 2 8 16.3 6019
2 Ramsden, 18 inch. id. 8 22 | 0,33 | 0,109
63 en 3. tieet. B.O. id. 3 7 918 14210 | 0 29 0,22
64 id. i B.©. n id. 3 12.95 1815 07,30), 0,122
Troughton and Simms, 2 feet. id. 5 10.17 14.10
= | Ramsden, 3 feet. B.O. id. 3 1228 \ 0 ,35 0, 122
66 | Ramsden, 18 inch. id. 3 2a 21 222 33.8 | 0 017
67 ä sn id. 3 2. 1912 71.120,38 0, 144
Kamsden, 3 leet. RS. id. 5 8.8 a
68 | id. B. 0. id. 3 51.20 5.8038 0, 144

REMARQUES

Trapezium,

Trapezium.

 

elle aan
