 

 

EE

 

 

 

ERREURS

 

 

|
|
|

 

Soma nn

 

 

 

 

 

 

 

 

Constructeurs oo a, SE : |
e2= »3| =. 3 | declöturedechaque |
des instruments employés et diamètre = e 2 26125 = triangle N
— Ss |e Es eas 5
du cercle horizontal se as a8 A
z = Set
Triangulation premier ordre (Suite). |
Pistor et Martins 27™ 1 21,24,25 | 1,96 3,8116 |
Wegener, Pistor et Martins 27 i 21,24 139 a
> i | 2 24 0,81 0,6561
» > | 21,22 0.16 0,0256
Pistor et Martins 27m i 2 1 24 0a 00324
Wegener, Pistor et Martins 27 |2, 1] 2 21,24 1,01 2,3921
Pistor et Martins 27 cm | ri 2 DD 0,84 0,7056
Wegener, Pistor et Martins 27°" 12 M) 2 DD 0.42 0,1764
» 2 1. 2 21,24 2,03 4,1209
» > | 9 21 24 O45) 021i
) 2 11.2 u 0,83 : 0,6889
> 2 ile 24 0,72 0,5184
: 222,00 24 0,24 | 0,0576
» 2 Lie 2 24,25 1,74 3.0276
» a m. 24,20 0,41 0,1681
» > en an 25 | 1.00 aan
Pistor et Martins 27 i ee pue | 0.11 | 0,0121
Wegener, Pistor et Martins 27° |? 2 24 0,54 | 0,2916
> 2 i 2 24 120 ı 1.9600
2h41) © a el | 4,4521
Dei 24 0,45 | 0,2025
» 2 al 2 24 0,66 | 0,4356
Wegener 27°™ 2» 24 0,46 | 0,2116
Wegener, Pistor et Martins 27% |2 I» 2125 0,73 0.5329
Pistor et Martins 27m 1 0 VED | 1,99 2,3409
Wegener 27 ™ 2 0 24 119 1.2044
Bison et Maruns 270 eue) 24 0,78 0,6084
> I, 2 24 1,88 3,0344
> nr 24 11.89 2,4025
5 » 8 24 D ds | DS
51 _Pistor et Martins 27cm ph © DL 0,91 0,8281
‚52 | Wegener, Pistor et Martins 27 I, 9 24 1,68 2,8224
58 Wegener 27m 2 94.36 | 0.25 0,0625
54 | Wegener, Pistor et Martins 27” 1) 2 2405. | 004 0,2916
aD » 2 21,28 0,91 0,8281
56 » : 2 21 28 | 2,09 6,4009

 

 

nn

 

 

 

ew ala daa Mad at dll a a

 
