va gene ea SY orrr TN |

Te NNT Fre NT

ii

TT

wr

hei
Td —

&
=
13
a
He
Le
ss
u
iR
ze
=3
==
5
a
an

 

Sawitsch
Schaub
Schiaparelli
Schiavoni
Schidlowski
Schiegg .
Schinz

Schlesinger .

Schmidt .
Scholz

Schott

Schreiber
Schrenk .
Schroeder
Schubert .

Schumacher

Schur
Schweins
Schweizer
Schwentner
Schwerd .
Secchi
Sedlaczek
Seeliger .
Seibt .
Seidel
Seyffer
Seyffert .
Short .
Shortrede
Smystloff
Snellius .
Soldner
Sonderhof
Späth.
Stamkart
Stampfer
Stebnitzky
Stegmann
Steinheil
Stephan .
Steppes .
Sterneck .
Steward .
Stirling .
Stokes
Struve, F.

Seite
94
60

14 15
83

|
|

94 |

10
10

. 48 53 54 |
60 |

83
67 83
10 11

. 100

11 64

 

 

IX.

60 |

44 |

60 .
54 |
28 |

| Seite
| Struve, O. et W. 96 97
| Stuart 55
Studer . 105
Stück . Ar
Svanberg 102 103
Szekeli
T.
| Tachini . 51
Tasse .
| Tellkampf . 84
| Tennant . 28
| Tengstrom , ~ 103
| Thersner 103
| Tiarks 28
| Tinter
| Toaldo
Todhunter .
Topping . . 28
Tralles OS
Trechsel . 105 106
Trepied . 42
Tresch À
Trew . ee
Triesnecker 60
Troughton . 23
Tuyll . 56
U.
Ulloa . 107
V.
Valentiner . eo se, à 64
Villarceau 42 43 44 65 66
Vincent . ee AA
Visconti . 54
Vita, de. 1 864
| Vogler Oe
Voit 64.
W.
Wagner , 84 98
Walbeck . 103
en ag

 

44 |

|

| Wales
| Walker
en

Bae.
Qn:

| Waller
| Wand

| Wargentin .

| Warren .

| Weber

| Weidler .

| Weingarten

| Weiprecht .

Weisbach
Weiss .
Werner .
Westphal
Weyer
Wild .
Willigen
Winckler
Winlock ,
Winterberg

| Weierstrass
|
|
|

Wittstein
Wolf C..

Wright
Ximenes ,

Young

Zach, A .
— FX.
Zachariae
Zech .

 

Zinger

U,

Wittmann ,

Woldstedt .

Seite
28

1 2
28 29

29

12

109
29

34

83

84

60

. 84
on... HO
« » 12.60 61.67
68 84
68

» 84

: 106
56

+ ol
6 6!
84

61

84 85
97

a Ae
105 106
29.

54
29

98
98 99
. id
. 108

97

 
