 

 

 

— 447 —

XIX -——- Suisse,

  
  
   
 
   
    
  
   
  
   
    
 
 
 
  
  
 
 
 
  
   

 

 

 

 

 

 

 

 

 

 

 

 

N° a LATITUDE ‚LONGITUDE| EPOQUE N TRU i
DES POINTS : ET OBSERVATEURS ma
1 | Wisenberg........ 47° 24' 14”| 25°32' 47”) 1865-67-79 | Denzler, Koppe, Scheibla- | Reichenbach de 12". | N.8:
ner.
2 dägerın. 47 28 58 | 26 3 55 || 1861-65-78 | Denzler, Gelpke. Ertel 8”; Reichenb. 12”;
79 Starke 8'; Kern 8”.
3.) Morpli, 2 AT 22 20 | 26 36 24 || 1865-67-75 | Denzler, Jacky, Gelpke. Reichenb. 12"; Starke
78 8) ne OF
4 Gib. ale: 472258 \ 21 150 1864-67 | Denzler. Ertel 8; Starke 9%
SSERISL eee 47 3 29 | 26 9 0 | 1861-67-75 | Denzler, Jacky, Gelpke. Ertel 8”; Reichenb.
78 12", Starke 8”.
hs 6 | Naph 2.5. eo 47 018 | 25 36 17 || 1861-62-65 | Denzler, L’Hardy, Jacky. | Ertel 8’; Reichenb.
= 67-75 De
n 7 | Gurten (B.)....... 46 55 7 | 25 6 30 | 1854-58-61 | Denzler, Jacky. Ertel 8"; Reichenb.
iL 65-66-—-76-79 12"; Starke 9",
IF 8. Böthe 2... 47 15 34 | 25 11 33 | 1862-65-67 | Denzler, Kündig, L’Hardy, | Ertel8"; Reichenb.12;
75-77 Jacky. Starke 9"; Kern 8".
9 | Chasseral......... 47 8 4 | 24 43 26 | 1861-65-67 | Denzler, L’Hardy, Lechner, | Ertel 7” et 8"; Star- |
74-76 Pfändler, Jacky. ke9"; Reichenb. 12".
10. Suchet 2... 2... 46 46 25 | 24 7 50 | 1866-67-78 | Gysin, Lechner, Gelpke, |Starke 8" et 9".
| Haller.
i ie: Ber, 235. 46 40 38 | 24 50 55 || 1866-67-76 | Gelpke, Jacky. Ertel 8", Reichenb. 8"
= 79 etl 2 Karem 8%
12 Doles. 2.2... 46 25 36 | 23 45 50 || 1867-76-77 | Lechner, Gelpke. Starke 8! et 9.
13  Hangendhorn ..... 216 37 5) Bay 50 ECO 1867 Gelpke. Reichenbach 8".
14 | Hundstock........ 46 55 15 | 26 20 54 || 1865-66-77 |L’Hardy, Stambach. . | Brtel 8’; Richenb. 35;
3 Starke 8" et 9".
: 15) Be. 0. 0. 46 46 24 | 26 6 9 | 1865-66-67 | L'Hardy, Gelpke, Pfandler. | Ertel 7” et 8”; Rei-
i 74-75 chenb. 8.
= 16 | Sixmadun......... 46 37 26 | 26 19 4 1865 L'Hardy. : Brtel 8. | ie
= 17 | Basodine.......... 46 24 46 | 26 7 59 | 1866-67-76 | L'Hardy, Gelpke, Pfändler. | Reichenb. 8"; Ertel&'. || N-361, Hale
78 oo
18 | Cramosino ........ 46 21 52 | 26 3028 1865-76 |L’Hardy, Gelpke. Ertel 8”, Starke 8”. || N. 359, Italie
19 | Menone........... 46 7 29 | 26 48 34 1865-76 id. id. N. 351, Itali
20 | Ghiridone......... 46 7 28 | 26 18 46 || 1865-72-76 | id. 8 eid.
3 21 |! Wasenhorn........ 46 16 4: 2545 1 || 1870-76-77 | Lechner, Gelpke. Reichen.8";Starke8".
2 22 | Feldbergi. Sch. ...| 47 52 31 | 25 40 8 | 1864-74-79 | Denzler, Koppe, Scheibla- Ertel 8’; Reichenb.
3 ner. 12%
F 23 | Hohentwiel ....... 47 45 58 | 26 29 2|| 1864-75 | Denzler, Jacky. id.
24 | Hersberg.......... Ay AO 1 ) 22 02 1864 Denzler. Ertel 8”. Be
25 | Bfändler.... 2 5.- A 30 31 | 20.2022 1864 id. id. N. 548, Autri
2 O6.| Nay@we: ae AT 25 59 | 24 38 26 1867-78 Lechner, Gelpke, Haller. | Starke 8” et 9’. ae
fe 271. Colome.. . ..... 45 58 21 | 24 21 19 || 1867-74-77 | Gelpke, Pfandler. eee 8"; Starke
; 83. Ertel 7.
28 | Trélod: 45 41 38 | 23 51 38 | 1867-74-77 | Gelpke, Pfandler, Jacky. Reichen, 8" et 12"; || N.272, France.
Brtel 7. ae
‘3 29 | Colombier........- 45 53 0 | 23 25 17 || 1867-74-77 id. id.

 

 

    

iz
=
=
=
=
