 

  

— 407 —

De ee

Erreurs de clöture des triangles desquels ont &te mesures les trois angles.

 

 

 

 

 

 

 

 

 

 

 

 

 

 

 

| | NOMBRE
S AUTRURS DES INSTRUMENTS | ZNGLURD NOMBER DES ERREURS
= a OBSERVATIONS DR enöruRE
a EMPLOYKS | DES EXKCUTERS "
© ET De VERNIERS POUR AO | REMARQUNS
a RNIER ee GLE i Ba
z DIAMÜTRE DU CEROLE .. OU DES | nn A | De,
ea OU DU Es OU POUR
| az ee CHAQUE
| | DIRECTION + | =
Trianzulation de la Pologne (avec la Lithuanie).
I | Brauer D=10 p. angl. = 254" A" 2 6 2 7,3441 | Observationsde 1885.
2 id. ide id. id > 2,09 „3081 2
3 id. id. id. id. 3,94 15, 9236
4 id. id. id. id. 0,85 0,1225
5 id. id. id. id. 0,17) 0.0289
6 id. id. id. id. 3,46 | 11, 9716
7 id. Id id. id. 4,44 19.1156
8 id, id.» id. id. 1,609, 2,8501
9 1d. id. = 1d. id. 1.86 3, 4596
10 id. id. id. id 4,73 |.22, 8484
11 id. ide. id. 0... 4,96 24, 6016
12 id. id. id. id. 1.27 1, 6129
3 id. id. id. id, 0,67 0,4489
14 id. id. id. id. 0,85 0, 2225
lo id. id. id. id. 0,45 0, 2025
= 16 id. id. id. id. 4,44 19, 7136
= 12 id. Id" id. Id 0,66 0, 4356
= 18 id. id. id. id. 0,73 0,5329
ax. id. id. id. id. 0,39) 0,1521
20 id. id. id. id. 1,84 | 3,3856
2 id. id. id. id. 1.75 3, 0625
2 id. de id. id. 2,35 5,5225
2 id. id. id. ad 0,55 | 0,3025
24 id. id. id. id. 0,03 | 0,0009
29 id. id. id. id. 0,45 0, 2025
3,.26 id. id. id. id. 71,24 52, 4176 a
T. 27 id. id. id. id. 8,98 | 80, 6404 N
28 id. id. id. id. 0.03 0, 0009
29 id. id. id. id. 6,61 43, 6921
= id. id. id. id. 1,30 L 6900
= 3 id. id id. id, A vo.
32 id. id. id. id. 9,9 99, 4009 }
33 id. id. id. id. 4,80 23, 0400
34 id. id. id. nal 4,49 20, 1601
ı id. id. id. id. 3 So
36 id. id. id. Na. 9,0% 91, 5849
37 id. id. id. do 0,25 | 0,0685
38 id. id. id. id 000 33, 4084
39 id. id. id. id. 0,80 0, 6400
40 id. id. id. id. 0,44 | 0,1936
4] id. id. id. id. 1.6020 2, 6244
42 id. id. ide id. 7,62 | 58, 0644
43 id. id. id. id. 2,92 | 8,5264
44 id. id. id. id. 6,46 41, 7316
3 %5 id. id, id. id. 0,60 | 0,3000
a6 id. id. id. id 7,16 | 51, 2656
8 7 id. id. id. .r id. 1,03 2, 6569
2.48 id. id. id. id. 0,98 0, 9604
= 49 id. ws id. idee 0 2, 4649
Do id. id. id. id. 4,14 17, 1396
= 5] id. id. id. id. 1,09, 26969
= 052 id. id. id. Ä id. 3,20 | 10, 2400
I 5 id. id. id. id. 1,60 | 2,5600
ar id. id. id. id. »,.10.1 99.068

 

 

 

 

 

 

 

 

 

 
