 

208, ©

 

 

RESULTAT DER

 

 

 

 

Name Sta Tions-A USGLEICHUNG
Chlomön I
Knimis 0 0 0.000
Xiron6oros 87 19 2.008
Ktipas 199: 97.10.5498
Kisärôn 199. 28 23 321
Paläovüna 242 IH 48 841
Parnassös 302 48 44 -247
Kidärön
Patéra 0 0° 0.000
Makripläji 1e 68 D) one
Paläovüna 154 39 42.349
Chlomön I 19746 96 314
Ktipas 256 42 44 .395

Megalo Vunö 1

315 40 54.144

Parnassös

 

 

Kalliöromon
Knimis
Chlomön 1
Paläovüna
Valtsa
Killini
Panachaikön
Gjéna

 

0 0° 0.000
44 58 2.250
89 9 41.438

150 30 23.596
189 37 27.170
208 9 7.385
251 51 59.500
302 36 54.404

 

Jerakovüni

 

Chlomön II
Knimis
Kallidromon
Andinitsa
Kassidiäris
Saratsi

0 0 0.000
94 34 41 .028
131 42 24.217
196 29 27.762
240 49 43.012
285 13 48 .619

BEOBACHTUNGS STAZIONEN I. ORDNUNG. |
RESULTAT DE
Neue Sie ara UNG
Mavrovüni
Ossa | 0° 0 0.000
Pilion 158 48 5.992
Saratsi 216 90 12: 265
Paläökastron 2A) AG 18 "O8!
Hassanbaliötiko | 313 26 53.768 |
Paläökastron
Saratsi 0 0 0.000
Kassidiaris 70 18 19.800
Aovrütsi 153:39° 1.5.9047
| Hassanbalidtiko 21298 :7.049
Mavrovuni 256 14 12.469
Antinitsa
ee: 0 0 0.000
Jerakovüni 57 19 92 011
Kallisromon 15622 8.469
Gjöna 200 56 55.684
Timfristös 364 .20 41.139
Katächloron 309 10 0,214
Paläovüna
Kisärön 0° 0 0.000
Makriplaji 33 6 18.191
Valtsa 101 87 12:03
Parnassös 207 47 52.878
Chlomön I 065 54 15.728

 

 

 

 

 

 

 

 

 

 

 

 

=

=
=z
si
a
al

1
TE

TT
They

aa de na Made a nn

et

À ds us

 
