 

I. Abtheilung.

l. Amöneburg, Postamentstein.

2. Berger Warte, Thurmknopf.

RR.
Knill DD oi
Taufstein 14 58 58,8660
Dünsberg 166 59 45,5406
*Frauenberg 175 42 55,4720
*Wehrshauser Höhe BOW 31 36,2151
Hasserod 232 56 50,6641
Hohelohr 306 18 42,9123
J ohannisberg 020 0
Taufstein 43 38 58,0973

Orber- Reissig 87 42 13,4280

log. L

42866347
4,2936521
4,1732847
3,1215946
3,8379826
4,1840427
4,1315723

4,0692118
4,4373763

4,3753559 |

Lt

19347,94
19663,10
14903,38

5340,66

6886,25
15277,16
13538,55

11727,67
27376,40
23733,18

3. Brocken, Standpunkt und Visirpunkt?

4,1353744
4,6279307
4,5502490
4,4515107

54371,89
42455,18
35501,68
28282,04

4. Deiss elberg, Postamentstein.

. 5. Desenberg, Postamentstein.

Inselsberg 0.5.00

Meisner 84.11: 11,0574
Hohehagen 53 ...6. 45.9896
Hils 95 57 16,3009
Langeberg 0.2090

Stauffenberg 30 11 2,8904
Hercules 85 50 22,7243
Desenberg 142 18 2,9793
Deisselberg 0 0.0

Langeberg 19/05 5.2396
Stauffenberg 34 5 15,6682
Meisner 09 99 01550
Hercules 92 40 14,2129
Weidelsberg 134 42 16,2725
Hohelohr 139 29 10,1502

3,1586775
3,8932376
4,1793033
3,8899499

3,8899499
4,1069144
4,1115003
44507140
4,1006864
4,1188654
44450595

5736,90

1820,56 .

15111,35
7761,58

7761,58
12791,29
12927,08
28230,20
12609,17
13148,17
27864,58

corr. R"
— 0,0083
— 0,0507
— 0,5644
+ 0,8984
— 0,0347
0,9223
— 0,2990

— 0,0270
+ 0,0698
— 0,0428

203176
-+ 0,5198
+.0,1337
— 0,3267

+0,0175
— 0,3221
+ 0,7630
— 0,4584

+ 0,1208
— 0,0380
+ 0,2833
— 0,0675
— 0,2625
+-0,5180
— 0,5535

1. 1 pate Mn pa

 

 
