 

ae:

WASSERSTANDS-CURVE NAC ZWEIJÄHRIGEN AUFZEICHNUNGEN DES SELBSTRECISTRIRENDEN OSTSEEPEGELS IN SWINEMUNDE.

|

  

_
x
“I
ji

 

3
Ins

Dre Orchnaten sind aufgetragen vv einer Verzüngung von 1:/0.

Be ee : Null des euler Pegels im Bauhofe . III] LR LL 1 Se Ta ee

 

 

 

 

JANUAR FEBRUAR MARZ APRIL MAI | | JONI | joyful | | lAUCUST | | SEPTEMBER OCTOBER. NOVEMBER. DECEMBER.
ss 10,219 20 20 30 5 10) 15 2070 al 5: 10 15 20 25.30. 5 10 15 20 25 30 5 1D 15, 20 25 80 © 10 1520729739 3 10 15 20 25 30 5 10 15 20 25 30 se 10115 20 25 30> 6 10) 15) 2p 25 30) 2.20: 19720 25 30:5. 10) 15) 520) 25) 3p

 

see] 1 tes 1 1 = Jy gop
Lith. Anst v. Leopold Kraatz mn Berlin

 
