   
  
 
 
  
  
  
  
  
 
 
  
 
  
  
 
  
   
   
  
  
 
 
  
  
 

 

 

— 18 —

 

 

 

 

 

 

 

 

 

 

 

 

 

 

 

Erreurs de clôture des triangles desquels ont été mesurés les trois angles.
nd ve LECTURE Sn ERREURS
A |. AUTEURS DES INSTRUMENTS in NOMBRE DES OBSERVATIONS DE CLOTURE
foe | EMPLOYÉS DES - EXÉCUTÉES DE
8 - ET no, VERNIERS POUR CHAQUE A? REMARQUES
nn  DIAMÈTRE DU CERCLE ee OU DES CHAQUE ANGLE a
A: HORIZONTAL ‘onoscopn | MICROSCOPES - OU POUR
CHAQUE DIRECTION + | —
Directions. |
{ Ramsden, 3 feet. R.S. Microscope. 5 0 101 f
+ i 3 ol D 00
id. RS. id. 179
id. B..0. id. 3 12192 13 De ee
id B. ©. id. 3 2,12 32.16. 1.56 | 0,2 0, 865
id. Be ©. id. 3 9
id. Rs. id. 5 28.14 41.17 à 0% ae
id. RO id. 3 DSi 9.23
id. R. S. id. 5 : Be | 0,04 Dee
id. RS, id. 5 38. 26 20.41 | 5
id. B. 0. id. 3 40. 31 (0,8 oo
Troughton and Simms, 2 feet. id. D 10.20 2817 16.10 | 0,96 | 0,922
Ramsden, 3 feet. B. O. id. 3 pele 9 10-10: ON 0, 941
id. Bs Ox id. 3 I 7 42.1 5
i RS. id. 5 21.14 | 0,9 ae
ates He Se id. D 21.22 222.24
no Bio id. 3 46.19 | 0,9
id. > Bes. id. ® Seal
id. no id. 3 23.22 12.14 5 0798 ve
174 | Ramsden, 18 inch. id. 3 19 tl 26. 20. 147714 | 0798 0, 960
1% | Ramsden, 3 feet. B. O. id. 3 1.8 | 1.00 1. 000
Troughton and Simms, 2 feet. id. 5 2027 10.1] , :
a Ramsden, 3 feet. B. 0. id. à D © 0 1.020
Ramsden, 18 inch. id. 3 23.19 28.21 2 :
Ramsden, 3 fecu. R. S: id. D 912 11.10 5 4 1.04 | 1,082
id. B 0: id. 0 28.25 914. 59.22 | 9A 1, 082
id: B. ©. id. 3 20 12 1211 22. 8.1,05 1, 102
| Troughto 18 inch, id. 3 234219. 2 1.05 1.102
Troughton ue Simms, 2 feet. id. 5 14.19 2 :
id. 5 15.13
Ramsden, © feet, ROS: id. 5 3 © 1.06 1424
d. B. 0. id. 3 10, 12
en 18 inch. id. 3 1.0 | 1-06 |. L 124
mn, and Simms, 2 feet. id. 5 10.6 9.10 : 2
Ramsden, 3 feet. B. O, id. 3 sale 208
ns N 2 7.34 | 1:07 ae
Troughton and Simms, 2 feet. id. 5 13; #3 2
Ramsden, 3 feet. B. O. id. 3 123 107), do
Ramsden, 18 inch. id. 3 1818 19.19
185 Ramsden, 3 feet.” B. O. It 3 19.22. 221. 6.0814 | 1,08 1, 166
186. Ramsden, [3 inch. + id. 3 26.29. 24,345 29.1971 508 1, 166
Ramsden, 3 feet. R.S. id. 5 9.12
187 80 id. 3 10.23 1,09 118
oo Troughton and Simms, 2 feet. id. 8 24,21
188 Ramsden, 3 feet. B. 0. id. 3 Does onde 2714| 1,09 1, 188
“id. Be O. id. 3 80.23
189 Ramsden, 18 inch. id. 3 15.55 15.091) 5,188
a an and Simms, 2 feet.. id. 5 43.29
id. B. 0. id. 3 17.12 ? nee
ad: a B. ©. id. 3 16. 40 12. lee 1 ile il 232
N R. S id. 5 38. 19 : ee
id. . Res id. D 30. 30 :
id. BO id. 3 20.7 16.10 § De) ba
10 13, ©, id. 3 HA ose 6 227 | 5 1418 1283

 

 

 

BB

een
