 

 

188

Die beobachteten Sterne haben folgende Resultate ergeben :

1. 2 Perse =
2. 1 Ur mal, ==
> © (yon —
4: 8 > —
D. 421) —
6. 43 » ==
7. a » O ==

Wahrscheinlichster Werth der Polhöhe des
punctes des Instrumentes
Reduction auf das Centrum der SHE.

Polhöhe des Gentrums der Station

Il. Azimut.

Das Azimut wurde von der Richtung : Spieglitzer Schneeberg-Grosskoppe in 15 Sätzen

50 12 33,996
33,469
33,283
33,162
34,980
39,138

50 12 33,244

Aufstellungs-

=S

gemessen. Die Resultate für die einzelnen Sätze sind:

@ — 88 || 53,009

mn 61
ao

19

19

7

10

h == oo

— 50°12 33'615 + 0'041

— 0'941

 

o = 50° 19 33'374 + 0'041.

 

+ 0'945

1.
2 99,128
3. 91,448
A. 91,760
D, 96,230
6. 01,249
1, 47,898
8. 91,898
4 04,430
10. 49,608
14° 09,940
19, 99,010
13. 91,285
14. 91,475
1). @ — 208 11 52,908
10 nu a = 288 11 52 469
Reduction auf das Centrum der Station + 38,697
Convergenz der Meridiane — 0,321

N.-O. Azimut der Richtung Spiegl. Schnee,
berg-Grosskoppe (Centrum der Station) a = 288° 12 30.845

+ 0.245.

 

ar dd à

 
