‘4
I
2
Bi
1
|

ig

|
>

End See

Erreurs de cloture des triangles desquels ont été mesurés les trois angles.

enter,

 

 

 

 

 

 

 

 

 

 

TE aS IN an en NOMBRE ERREURS
8 AUTRURS DES INSTRUMENTS N NOMBRE as a one rn
S EMPLOYÉS A DES CU TUE DE
© ET a VERNIERS POUR CHAQUE A? REMARQUES
= DIAMETRE DU CERCLE a a OU DES CHAQUE ANGLE TRIANGLE
A HORIZONTAL MICROSCOPES ee A
MICROSCOPE CHAQUE DIRECTION
oe . _ meule an
| Directions.
Ramsden, 3 feet. B.0. Microscope. 3 22,
Boe id. RS id. 5 8, 10° 22,16 7, 618
Ramsden, 18 inch. ie 3 a) 12
9) Ramsden, 3 feet. R.S. id. D 1.45 80. 22 en re
a id. B.0. id. 3 Sl | at 1,673
354 | Troughton and Simms, 2 feet. id. D 32.10 19.17 9610| 2.71), 1.008
955 Ramsden, 3 feet. R.S. id. > 25. 17 | > 78| 77e
Hot id. B. O. id. 3 11.20: 15.16 ) 1,72
- id. B. ©. id. 3 10.15 lo » Be
356 | id. RS. id. 5 i be es
es id. Br O. id. 3 2. 07 ) oe
357 | id. B.S. id. 5 9. 5) ye! tg Gee
Troughton and Simms, 2 feet. id. D 16.9 1221 eh
358 Ramsden, 18 inch. id. 3 8.13 | a 1, 896
> Ramsden, 3 feet. R.S. id. 5 20.23. 93 al PERS =
à Troughton and Simms, 2 feet. id. 5) 16. 22 | nn 1,952
360 | Ramsden, 3 feet. B.O. id. 3 13.18 193.12 14.91] 27,84 8, 066
2 id. B.O. id. 3 Od Die er,
2. | Troughton and Simms, 2 feet. id. D 12215 | 2 ,85 8, 122
362 oi 3 feet. e . I 2 18. 20 ie 14.11 2 ,85| 8,122 | Trapezium.
id. RS. id. D 11.40 41.11): 2 }
363 | id. B. 0. id. 3 21.11 (2,80 0
; id. B: 0. id. © 18.15 5 aoe
364 } id. Rs. id. 5 40. 8 17.413 por
| id, RS. id. 5 2.20 |
365 5 Ramsden, 18 inch. id. 3 2. 18 2281 2.8281
| Ramsden, 3 feet. B.0. id. > 22.4 \
366 id. B.0. id. 3 3.32 1111571 240 8, 294
367 | id. Bo id. 3 O11 6: 104 10, 10 | 2 ,89 | 8,352
id. ie Ss id. D 13. 19 :
368 id. BO. id. 3 1.1 2 ,89 8, 352
Ramsden, 18 inch. id. 3 12.29
369 | Ramsden, 3 feet. B.O. id. 3 22.241198. 426.10 200 8, 410
on id. R.S: id. D 19. 24 S
370 | id. BO. id. 3 21.13 14,22 | 2 90 u
a id. RS, id. 5 11.19 Il. 10 : ;
71 | id. 0 id. 3 15.12 | Zu.
~) § Troughton and Simms, 2 feet. id. 5 O28 29.110) 0° 2 HAD
Re eme id. 3 6 4 12,06) ne
BIB | Ramsden, 3 feet. B.O id. 3 iar OF 10. 9 elas | 2207. |. 882k
374 id. B.O id. > 8 2:80.25 Nes 2 5 07 8, 821
ee id. B. O id. 3 14. 16 =
375 | id. R.S id. 5 ano nn
S10 | id. BO id. 3 09.500.182 0. 003,0 9, 060
ee id. B.O id. à Bee DT a c
om | id. RS id. 5 11.34 nr
i Ramsden, 18 inch. id. D 8.10 10:26 9.060
378 Troughton and Simms, 2 feet. id. 5 8: 9 | 0 >
Ramsden, 3 feet. B.O. id. 3 ih 214.19 30
379 | id. R.S. id. 5 10.15 13,00 en
Troughton and Simms, 2 feet. id. > 19.94 96.27 ) 9 9. 18]
380 | Ramsden, 3 feet. B.0. id. s 30,29 § 3 208 4
Ramsden, 18 inch. id. 3 i. 6 ne
381 | Ramsden, 3 feet. B.O. id. 3 13, 13 _ {3:08 9, 181
Troughton and Simms, 2 feet. id. 5 15.15,

 

 

 

a Lab D lu La dl ans en

ii ie

 
