 

 

 

 

 

 

 

 

J Marke MT an der Güterhalle Reinheim,

 

1 m

47 von der nordwestlichen Ecke, Sockel.

K Eisenbahngrenzstein zwischen den Stationen Wiebelsbach und Gross-Umstadt.
L Marke L] am Viaduct für den Weg nach Wiebelsbach.
die Landstrasse nach Höchst.

E Be
= wa m

Nach Fie.

SE
» Tander (rüterhalle Erbach, Sockel, nahe der nordwestlichen Ecke.
» Ts ander Brücke der Landstrasse von Weschnitz nach Fürth.
nordwestlich von Gadernheim, nahe bei der Kreuzung der $

» I-|

»

»

nach Oberramstadt.

chen führen, nämlich

eh,
BR,
ee A,
w—h,

Be Ms hr

 

2 bestehen 8

ns

his + Rus + An —

hi At Au

+ h, —4

+, —h+h,-+h,
2 6,
— kt

£,

= 94

351 70

‚84119

n— —+ | EIITEYR
See h Sur y=
why; + fir — hrs + 37,54850

hir
hy + 0,97

890

ho; + hat ha

In der folgenden Tafel sind die beobachteten Höhendifferenzen
nivellirten Strecken, die Gewichte p, sowie auch die Werthe der Coefficienten a, b, c...
der Bedingungsgleichungen zusammengestellt :

|
|

I

\

|

30,81
1.18
0,42
5, 39

3.12

13,08

— 11,37

— 99,46

Strasse

Bedingungsgleichungen, welche zu ebensovielen Widersprü-

h, die Längen ! der

 

 

 

 

 

 

 

 

 

 

 

 

 

 

 

 

 

 

 

 

 

 

  

 

 

 

 

 

 

 

| | h di | | S 10 n Ä | | | { :
| | j : e\f | 5 7 E
| Meter. iin. | > | 2. . | . A 2 Millim. Meter. E > ec / . :
| | | | | | |
1| #,19735124,410,041| A 4 130,81]13) 77,22201|10,5/0,095| 4
2) 3,94358| 1,011,000| A I | 7.18]14113%,49900)15.9)0,063 04
3 2,54910 0,81.250 —I \— 0,42]15|249,27296|11.3|0,088) A ie
| 410.31267|10.70,093| 1) 1 — 5,55[16,106,.2855%22,60,0%4 | —| 1
5 8,9058810,4.0,096| 1 1 | | | 3,2217] 78,06787| 9,20,103|| | | || AA)
618.19937 15.20,066| —1| I I I | !-13,63[18| 45,48089| 2,70,370| | | | | 20
7, 3,3397014,00,074| | 4 | 11,73 19126.11487.16,510,061| | | | 4
13 5.2102 1,2071 | 1 | 722.46]0| 10,72263| 1,610.628| | | | | l
[9 137702 1,10,909| | 1) | 19.61297| #,00.250| | | | —
1062.28935112,30.081) ı | >| 39.4053417,5 0,057] | |
11125,62540| 7,50,133| | 1 ı 23) 4,6447923,910,042| | l
12,49,84038| 7,80.128| 4 | E |
| |

 

 

 

 

 

 

 
