 

 

Bewegung des Nordpoles der Krdaxe,

1
Fur 1891 Juni - 1892 September aus sieben Stationen.

März 1
©

OBI. Fans

O
1892. Sept.t.

not, ul,

Pulkowa.

   

2,
Ce

berechnet aus den in den Jahren 1891-1894 zur Bestimmung der Breitenvariation angestellten Beobachtungsreihen.

TE
Für 1892 October - 1894 Juli aus drei Stationen.

   
 
 

Sunt.

   

18% Juli 1

   

1894.) Sant.

1892. Oct. 20

   

Nor

2, Ks"

 

SR, SE
: sc ug
cl VOC,
pro” A ”g
so
y ‘
D N
RS $
$ ©
x Ÿ
RS
N
Vv
Ry
Maassstab.
'
o 005 070 06 020 2 3 035 040

 
