EEE RE EIER =

—————

 

138 |

7 Banda (1) ~ Dammer (1) Koepang (1) Bima (1) |
| Long. 1299,9 Lat.4°,58. Long. 128°,7 Lat.7°,18. Long. 123°,6 Lat.10°,28. Long. 118°,7 Lat. 8°,45. ;
I 1/, ampl. situation 1/, ampl. situation 1/7, ampl. situation 1/7, ampl. situat.on |
= 5 am 101 29cm 920 agen 999 14 49° |
} M, 57 36 47 29 52 322 29 8 i
3 K, 29 310 31 315 23 294 188 316 :
; 0 19 299 14 288 10 331 12 253 |
| P 9 275 6 300 7 107 8 318 j
| N 10. 9 6 359 8 301 3 304 |
| K. 5 71 eco 8 32 2 28 |
F ;
| Bonerate (1) Saleïjer (1) Kadjang (1) Bonthain (1) |
| Long. 121°,2 Lat. 79,48. Long. 120°,5 Lat. 6°,1 8. Long. 120°,0 Lat. 5°,48. Long. 119°,9 Lat. 59,65. i
y 1/, ampl. situation 1/, ampl. situation 17, ampl. situation 1/, amp). situation
F 5, — = = — = = a z |
Sy Gin. 481 19m 61° [dw 89° 20m 154° |

: M, 14 358 38 359 37 3 9 44 i
! K, 11 42 37 291 21 303 22 325 |
he O 9 236 23 279 15 266 4 266 |
P 19 308 9 246 15 282 16 260 |
| N 2 353 11 356 6 336 4 54 ;
K, 10 266 6 344 1 341 7 206 |
Donggala (1) i
: Long. 119°,7 Lat. 0°,78. !
a 1/, ampl. situation i
: By = es |
i 8. 3g 206°
a M, 33 152 |
r K, 23 278
| 0 7 254 |
Kr B 13 313 i
É N 3 136

| Re 9 212

——_—

 
