 

 

 

 

 

 

 

 

 

 

 

 

 

 

N 63
Su) 2 — u ei
un
N : Positions moyennes Bonn
FAnnee et mOls. des ätoiles, | TITRE DE LA PUBLICATION :: | REMAROUES
u u | | Be = —
I | |
een): |
Mal 1892 Fundamental-Cata- N
& Bit) log, Catalogue | |
| d’Auwers-Brad- - | |
ley. IJyearsCata-
losue. New 4
years Catalogue B
P- P- ı | |
4 N
1892 v
3
I 18% »
1893 »
us1#1890 mai. Berliner Jahrbuch. Non publie. Latitudes dötermindes simultane-)
juin. ment A l’aide des ınemes Be
» » » » |

 

 

 

 

 

 

 

‚I 1892 sept. 9»
v S
) » » » |
1893 aoüt. » »
| |
» > » \
4
| 1895 Juin. » » {
A » s
2 » v \
il
|
j

 

 
