 

  
  
 
 
  

a Ey

 

   

D

 

 

 

   
   
   
  

x

 

a NOMBRE
) LECTURE DES ERREURS
AUTEURS une Be = NOMBRE en
DATE CONDE DES EXÉCUTÉES DE
hr ENTER VERNIERS POUR all A? REMARQUES
DIAMÈTRE DU CERCLE on OU DES CHAQUE ANGLE| TRIANGLE
HORIZONTAL 1 MIOROSCOPES en x |
MICROSCOPE : CHAQUE |
DIRECTION ae | —
15 zölliger Theodolit von Ertel (Thei- | Ablesung 4 bezv 2 Mi- 24 0,350. 0,1225 | Nach nicht publicien.
lungsdurchmesser = 355™™) en von !i. se-| kroskop- Mi-
die 10 zölligen Theodolite N. eunde. | krometer.
‘ und II von "Pistor und nn
(Theilungsdurchmesser = 265™™).
id. id. id. 24 0;771| 0,5944
id. id. id. 24 0,967; 0, 9351
id. id. id. 24 0.1.67. 0, 0279
id. id. id. 24 0,427 | 0,183,
id. id. id. 24 D 221 120 0488
id. ide id. 24 0 , 169 0, 0286
id. id. id. 24 0,893 0, 1246
id. id. id. 24 On 146 0, 0299
id. id. id. 22 0,268. 0,1394
id. id. id. | 24 0,018 | ‘0,0003
id. id. | id. | 24 1% 72972; 0081
id. Nie id. Ie 24 0 , 688 0, 4733
id. id. id. 24 0,185 0; 6162 |
id. id. id. | 24 0,789 056225,
id. 10. | id. | 24 0,4871 0,2372
id. id. id. | 24 | 0,244 0, 0595
id. id. id. | 24 0,154 0.0251.
id. id. id. | 24 0, 5621. 0,3158
id. id. id. 24 0,392 01239:
id. : id. id. 24 0,551 0, 3036
N id. | id. 24 | 0,222, 0.178]
id. id. | id. 24 | 10,664! 0,4409 |
id. id. id. 24 "0, 012% 0: 0002.)
id. id. id. | 24 ‘0,357 | 0,1274 |
id. id. id 24 0,3422 0.1120
id. id. id. | 24 1.032 1, 0650
id. id. id. | 24 0,909 | 0,8263
id. id. id. | 24 | 1,519| 2,3074
id. id. id. 24 | 0,833 | 0,6939 |
“id. nae id. 24 0,3491 0, 0222
id. id. id. | = 24 | 0, 363 | 0, 1318
X
ELSASS- LOTHRINGISCHE DREIECKSKETTE 1876.
Die 10 An Theodolite N. 1 und | Ablesung| 2Mikroskop- 24 0552 0, 2714 | Noch nicht publicirt.
II von Pistor und Martins (Thei- | von ‘/, se-| Mikrometer.
_lungsdurehmesser = = 2002"), Cum de.
; id. id. id. 24 dol 1,8248
id. id. id. 24 0,361 0.138
id. id. id. 24 0,310) 0, 0961
id. id. id. 24 | | D 483 022
id. id. id. 24 10,040 | 0,0016
id. id. a 24 1, 100 1, 2100
id. id. id. 24 EU SO 0, 8046
id. id. a 24 0,210} 0, 0441
de. id. id. 24 0 , 054 0, 0029
id. ‘ak 24 10,543 0,2948
id. id. id. 24 0,651 | 0, 4238
id. id. 24 10,254 | 0,0645

id,

 

 

 

 

 

 

 

 

 

 

 

 

 

 

 

 

 
