4

XV. — Russie,

 

INDIOATION a DIRECTEURS
LATITUDE. | LONGITUDE. EPOQUE, INSTRUMENTS.
DES POINTS. ET OBSERVATEURS.

 

 

 

 

 

 

 

 

 

Triangulation de Lithuanie. Jonction a Memel. (Suite.)

|
Dejä mentionnes. |
Bor Aa
59812 0.591||
Couvent Polaven...| 55 48 14 | 42 32 48
Domiany 55,58.26 412 0 5
Butninuy ».1.8,412234
Poschtschutaty ....| 55 55 54 | 4l 20
Grusche oe Al 12
Kemiany 15 10741 45
Lanksaitzi........: 0A 50
81 Al 25
132,4 42
41 | 41

1 | 40
Schipili al | 20
Seliany 740
Lopaitzi 26 |.39
Eitentaitzi 0,389
Zwirblastzy........ 1839
Zwaschni 83 0539
Chweidany 89
Medweigola........ ya)
Lepaitzi Io. 39
Jakubowo 52.58
Tarwidsi 14238
Grabschitzi 39
38 46
Polangen 5I 38.44

epetition de Reichenbach de 12 p.

 

Lieut.-General de Tenner.

>

etition de Trougshton.

Theodolite terrestre & r

| N. 142, Prusse.

Cercle & repetition de Baumann de 13 p.

Cercle A rep

 

 

 

 

 

 

 

 

Triangulation du Parallele 52°.

Tarassowzi
Putzewitschi |
Mirotetchy Sa 43° 38 \ \
Mitskewitchy 16 a |
Juchkewitchy 14 43 50 |
Roskocha 32 44 |
)

| Dejäa mentionnes. |

Kroutoi-beregue ... 16 44
Kouchtchitza 3 44
Koukowitchy 9 44
Jodtchilsy 52.59.. 48
Lutowitchy 2 54 44
Boulatniki 4 44
Kondratowitchy ... 13 44
15 45
Bototchitsa 56 45
l 45
Mordwitowitchy ... 50 45
Bassika... .“....... 88 45
2 Ar 45

54 46
4 46
5 46
7 46
52 46
59 47

Lieut.-Genöral
de Tenner

 

Travaux
supplementaires
Colonel Zylinski

 

 

 

 

 

 

 
