 

323

 

 

 

 

 

 

 

 

 

if
"

a | Positions moyennes a |
Annee et mois des Siclen TITRE:DE LA PUBLICATION REMAROQUES
1896 juillet | Berliner astronom.
Jahrbuch
1896 aoüt

 

 

 

 

1896 sept.

1897 juillet

 

1897 aoüıt

1897 sept.

1895 mai Ces stations ne sont pas des points

 

 

= trigonomeötriques; on s’en Serl
z uniquement pour l’etude des de-
= viations de la verticale.
v | »
= | |
2 1895 juin »
» »
1895 juillet »
» »
1896 juin »

 

 

 

 

La

MIR ERRANG NUR OLE

 
