    

COMPTES RENDUS

DES SEANCES

DE LA SELZIEME CONFERENCE GENERALE

    
  
 
    
   
  
  

L'ASSOCIATION GÉODÉSIQUE INTERNATIONALE

RÉUNIE À LONDRES ET À CAMBRIDGE DU 21 AU 29 SEPTEMBRE 1909

Publiés par le Secrétaire perpétuel
H. G. VAN DE SANDE BAKHUYZEN.

ITTe Vorume: Rapport spécial sur les mesures relatives de la pesanteur.

   

AVEC 2 CARTES.

   
    
  

VERHANDLUNGEN

DER VOM #1. BIS 29. SEPTEMBER 1909 IN LONDON UND CAMBRIDGE ABGEHALTENEN

  
   

6

5

    
  

pi

ie n à = iA | a Fs
|
i e

3

2

1

 
 
  

DLL LADA TON EL ONE TON TELL ON ON LOSE) LTO cana

0 oe

 

         
 

 

 

 

 

 

(on
Iren, 4 we =
c I =)
= S
i: |) it
Lt ae N
FU (la in
4 ie >
Si 3

   
 

I

 
