 

Tulipier [ Redles , Peuplier (Regles ner,

 

 

Resle naturelle Reöle peinte Regle huilee ' Regle naturelle Regle peinte Reöle huilee
P, = 389°00 P3 = 489° 50 Ps = 619°60 P, = 409r35 P; = 509775 Pz = 209°45

Temperatures Temperat ures Temperatures Termperatures Temperatures Ternperatures
En N

 

 

 

 

 

= L - N x 7
2° 30° 10° 50° 60° . ee». a: ea a RR ma 2 9 - 20° 30° 40° 50° 60° 200 300 oo 200 300° 100
| | | | 1

 

 

 

 

 

.

 

 

 

wo
es

 

 

 

 

 

 

 

 

 

 

 

 

 

 

 

 

 

 

Öıerttee

DD ..-
oO
o©

 

 

 

 

or
oO

 

 

—.

SS =

 

 

 

T

 

be73

>
SR: 29: *
293 a z00
et
2

 

 

 

 

 

 

 

 

 

 

 

 

 

 

 

 

 

 

 

 

 

 

 

 

 

 

 

 

 

 

 

 

 

 

 

 

 

 

 

|: L 77
Aceroissements Aceroissements
1 de pards

de pöilds
Alisier (Aedles n°22)
®)

 

 

 

 

 

a De, DEO }
Frene (Redles n”’24)
Resle naturelle Regle peinte Resle huilee >

p, : 759°20 Pz = 85940 P3 =/009° 30 oo \ n 4 . “oo ws

Temperatures Temperatures Temp£ratures Regle naturelle Resle pe nte Regle huilee

27 Eh re men 6 P, = 689 20 Pz = 799765 P3 =829°20
+ - + a; 4 + l x

Te emperatures Temperatu pes Temperatures

 

 

 

 

 

 

 

 

 

 

 

 

20° 30° 40° 20°. 230° 38 20° 30°

 

 

 

 

 

 

 

 

 

 

 

 

 

 

 

 

 

 

 

 

 

 

 

 

 

 

 

 

 

 

 

 

 

 

 

 

 

 

 

 

 

 

 

 

 

 

 

 

 

 

 

 

 

 

 

 

 

 

 

 

 

 

 

 

 

 

 

 

 

 

 

 

 

 

 

 

 

 

 

 

 

 

 

 

 

 

 

 

 

 

13

 

 

 

 

| | | | | | 15 149° : | 149
1 Sg [ | T I | T ' Aceroissements Accroissements
2] j de poids de poids

 

 

 

 

 

7

| L | | | | zes SE
16 | | k 169

Aepoissements Aceroissements
IT de poids

 

 

 

 

 

 

 

 

 

 

 

 

 
