 

Triangulation du département de la Somme  (i0rdre ).

 

N DS
Se Bonnières

   

Hébuterne

Commune
de
Etinehem

  
  

Villers-Bretonneux

 
  

>
à
€
N - ~
= Zn se
/ \ vy Ne a =: a
N Ee Ne NS RER ANT DES JA ae
Kad NT c
\ RN
\ x = DANS) U
NES Fontaine s/* ¢
\ a

SIO Mentdidier N

St 1 T £

N ESS \

NEN \

ni =
\ \
= 4 2
GER a un
SEN 7 ef
x \ ”
\ SE
SS i 7
N 1

©
Lihons Le.

 

PLN.

 
