 

 

38

 

nee

 

ERREUR

MÉTHODE ET INSTRUMENT

 

 

 

SE A TR IHOUN: LATITUDE. OBSERVATEUR. :
| PROBABLE, EMPLOYÉS.
| |
18. Osterode 51° 43’ 2280| + 0705 Richter | Hauteurs circumméridien-
| nes. Instrument universel
|
19. ils: 58. bl 583 58.05 0.0 do. | do.
20. Langelsheim . bl 56 29.58, = 0.06 do. do.
21. Mansfeld 51 35 43.58 a= 0,06 do. do.
22. Monraburg Bl 14.15.15 20.06 do. do.
23. Dollmar 50 37 27.25 = 0.06 do. do.
24. Heldburg 90 17. 19:09 2 0.07 do. do.
25. Kyffhäuser .|51 24 52.89 Æ 0.14 Albrecht Instrument des passages à
| | | lunette brisée dans le pre-
| mier vertical
26. Lohberg . .|51 41 15.19 + 0.09 do. do.
27. Blankenburg . .|51 47 23.46 20.10 _ Löw | Hauteurs circumméridien-
| | nes. Instrument universel
28. Hüttenrode 51 46 34.59 | 0.06 do. do.
29. Hasselfelde lol 41 20:87 = 0.08 do. | do.
30. Nordhausen 15k. 30. 2.94. 30.07 do. | do.
31. Neinstedt . 151 45 54.61 =E 0.09 do. | do.
82. Vietorshöhe .\51 41 20.04! -+ 0.08 || Richter Instrument des passages &
| | | lunette brisée dans le pre-
| mier vertical
33. Josephshöhe .|51 34 50.62 == 0:10 do. do.
Roumanie. Rumänien. | |
1. Constance (Kustendje) non calculée | Capitaneanu
Russie. Russland. | |
1. Warschau . oo. 13.4.0 = 0.01 | Zinger, Sawitzki |
| |
2. Kiew non Calculée | Pomerantzeff, Rylké Instrument des passages
| au premier vertical
Passages d’une étoile cir-
cumpolaire et d’une étoile
près de l'équateur par le
vertical de la plus grande
digression de la cireum-
polaire. Méthode de Mr.
Döllen
3. Rostow sur Don do. do. do.
Saxe. Sachsen. | |
1. Leipzig (Sternwarte) . 61.20% 65 | 401 | Bruhns Instrument des passages

 

 

 

 

au premier vertical.

 

 

en

Rn

 

 
