      
          

   

   

0 Graphise
_ der Lothabweichun gen

En Leipzig. |

CotKcheind |

je -—_

 

 

 

 

Sehlis

Cu ersdp f

% |

 

 

   
    
   
        
   
  

 

 

 

  

 

 

 

 

 

 
 

  

 

 

 

  

 

 

 
    
   
  
  
  
 
   

N I
t
u
r >
I |
|
I E
N
zZ
S
Albrech tshaın RS
: NA
Ÿ
in eifertshain
© 1: 1 Y
\ % a
(ee mm SE 2
a I, Fuchshain
RY |
N |
=
ASAT Cr. Pols fra
Sj}
> ee
Z Thane \
= ; Kohra |
2 © ormthal . vi 3
Meridionale John. Longitudinate
Lothabweichungen : blau.

 

Lotliabweichungen : roth.

 

Westen, Randegger&C' Put

  
