 

 
  
  
  

 

 

 

 

 

 

 

 

 

 

 

 

 

 

 

 

 

 

 

 

 

 

 

r 13° : 14° 1 o = BEE SE > mere =
| | | | | |
| |. CARTE | |
du réseau de triangles
au
SPITZBERG i
Echelle de 1: 1000000 | |
Projecüon conique |
|
B0° 6e)
79° fs 79°]
78° 78°}

 

 

 

 

 

 

 

 

 

 

 

 

 

 

 

 

 

 

 

 

 

 

 

 

2 202 21° 2

Fotolit. Gen. Stab. Lit. Anst. Stockh.

L.de Greenw. 16° 172 18°

 
