TR or er or

MET TR VI |

0 PTT

LAW

93

40. Station Segeberg.

Ac= 58° 56 OF 2156 (= +? 15 34/1679

Azimuthe. a ee
Siek ABUS URSS Re 24 19 41085 42360963
Michaelis . > 2. 2. 200. 7 St 20 0 4.3961425
Hohenkorst . : .. 7. 2°, ) 106 04 09609 4.2681025
Bussberg . ....: 2... 99 9 31 4.3188814
Lübeck . . 2... .,... 2 00 0. 4.1134593
EieRede . à . 2 2 2 2.0. 3240 16 5.0 4.1076072

41. Station Lübeck.

ı. == 53 052° 040231 f= + 1! 53 30/3106
Eichede : 4 oi 2 Ag 10 ls 4.1049363
Michaelis; . . . 2. „.... 2 so >20 4.4783524
Begeberg. . . + + gan ees LOU 25,40 06 4.1134593
Bungsbere . .. .. .2.. 8 9. 4.2929424

42. Station Eichede.

À — 53° 43 023469 1= 29 10 He
Miehaeh . a. E. 2. 56 > an 4.2416642
Ségebdre: + ze. fe. oe . 166 2 00 4.1076072
BEübeck 2 . 08. 2. 22. 27 20220 4.1049363

43. Station Basis, nordlige Endepunkt.

A= 53° 33° 20 4025 = 2 21 5098178
Michaelis :. .. . „a2 022 256..09 21.905 3.9712324
Bormbeck: . 0. 0 0 959 22 525 3.6440482
Sicko. are. nt. 211 0494 02 24 3.4744251

Basis, sydlige Endepunkt. . . 329 00 24.175 3.4791988

44. Station Basis, sydlige Endepunkt.

= 53 35. 444,9] b= 2° 19 (5 3210
Michaelis .:. var... =... 7203 3043 3.9917849
Niendort. .- 8.80 27270, 796 2 DO 4.0205909
Basis, nordlige Endepunkt . . 149 02 36.63 3.4791988
SHORE 2 san m, in, Da AR 0a 26 3.4142850
Bernbeck. . 404 20.20, 280 - 4 223 7 290

Hobenhorn . .W.- VW 2er we sa ie Fe 3.8930387

 
