 

 

 

 

46

 

 

 

 

 

 

 

 

 

 

 

 

 

 

ERREUR
S MA TION. DIRECTION. AZIMUT. OBSERVATEUR.
PROBABLE. |
Bo :
28. Tetschner Schneeberg . Bösig 302° 56’ 3157| -+.0"198 || Herr
29. Tetschner Schneeberg . Donnersberg 25 2115.94) - 0.335 | do.
30. Wetrnik douce Markstein 1260 8/44.78| —Æ 0.222 730
81. Jauerling . Predigstuhl non calculée | Tinter
32. Kremsmünster Hochbuchberg 321 26 52.55| =E 0.165 do.
33. Kremsmünster Grosser Priel 1, 45851.80| == 0.299 300
34 Krakau. Wandahügel 268 44 32.59 | do.
||
35. Pola . Dignano non calculée | Anton
36. Pola . Ossero do. | de.
37. Ragusa . St. Andrae do, | do.
|
38. St. Peter bei Klagenfurt Gerlitz— Alpe do. | Tinter
39. St. Peter bei Klagenfurt Golitza do. | do.
40, Opching .. . . . . . Pirano (tour) do. ı v. Ganahl, Rehm
41. Lietzen . ; en et Grimming Py- do. | v. Ganahl, v. Kalmar
ramide |
42. Wien (Türkenschanze) , Laaerberg und Anninger do. | v. Kalmär, Rehm
43. Budapest (Schwabenberg) Dreihotterberg Pyramide do. |v. Kalmar
Me Damon: san... en, et Hunka- |175 37 25.1 =: 0:8 iv. Ganahl, v. Kalmar
eliotrop |
25. Wola. Ossero non calculée |v. Kalmar
46. Tserhathegy . Csernieder 134 2 49.9 | | v. Sterneck
47. Tserhäthegy . Harterberg 190 4 59.0 | do.
48. Cvortkovo brdo . Trojnäs 158 47 25.2 | do.
49. Cvortkovo brdo . Essegg 101 4 55.0 do.
50. Peterwardein . Csurug 2 0 One | do.
51. Lopenik Chmelova 281 811.5 | do.
52. Zobor Innovec nA 355 | do.
53. Magoshegy Gerecs 269 16 5.7 | do.
54. Rossberg Wolinivreh 59 20 42.6 | do.
55. Neretein Brodlstein 158 33 42.1 do.
|
|

D.

do

 

se eereesecsse esse = ee = => a =

 

 

 
