 

een

 

 

 

 

 

  

 

 

 

 

 

|

Poe | 6 = 1968 L88 0 1006 z681 | BN YoouI9}g"A || G98 GG | GIT 6F 06
6s+ | ett |r6s | 06 0 856 i : LLS gS | SE (0.38 oll
Bear ca 16 0 196 9681 TOABTAL 856 26 | Ge AS SIL
Ska. | 6S 868 Fes 0 1038 ei 2 PIS G*8 | TOI 8F IG
fi Jo. | 168 G98 où us x 7 ers ¢& | 601 ge TG
a a | 168 1928 © 6 S68L “yon YoUIa}g’A | PLS gs | 901 zn ie
Wie rer | ae 086 0  |&96 k 10 BIT | 168 ge | rie |g'os 61
Tse | Gia 968 | 888 0 (006 e ‘ | 98 | ae | CE | Erle IL
or + | 16 + 988 816 0 [986 9681 | ZU "A | 688 | && | Bl SG GI
9 a | 93. | 688 9L8 0 888 GEST | “BN YoouI}g “A | ECS l ce | rx eV IG
96 | Sl | ese 068 0 |806 9681 | ZU "A ‚698 De ol Em Ol
Tod | Gk | GLS 196 0  |896 G6ST | WHEN 156 Goa |: ot er OT
rit | 1 + |918 LLS 0 068 A mn las | 9:8 | zer jergr ut
Vee | Soe | OLS 118 0. See 9681 Zu ‘A | 878 ea cu she se
Bes: ene ELS |068 0 1606 E6ST BAI | Frs ie or Ge OL
oe | Pe 008 9¢8 0 [698 6681 BT YoouIa}g"A | TES GG | Gol er IG
che er 698 198 0 |&8L8 e681 BIPM ces Gee el IF 91
LG ur: 1698 988 I + [968 9681 Zu ‘A |£98 | os | sor |6°rr 8
GEL | 8: + | 898 118 0 188 e681 BIPM Ges ea 0 08 91
02 | 61-1. | 298 988 Lay 1268 4 rode 898 Se ur co: 0
ter | GL. 199 8L8 0 |068 9681 Zu "A cog Ge aı eı 8
ai+ | F — 66 CS 0 ns BSI | “BN YouIe}§ ‘A | CGB 9°6 | 6FT IF IG
0 ci 68 978 0 |6g8 x : FE cie GI ee bt
Sha le 08 088 0 1806 I6ST Zu ‘A | LES Ge | BIG |8 ae OT
Gi. | leg | S88 128 0. |ez8 £681 GIS  |608 GG | 90e | Ge OD
96 + | 68+ |9S8 886 0 646 | TOARTAL | G16 ira ca 8c OL
eg+ | 06+ | ¢¢8'086|)G28°086| 0 1068086 | 968T ZILA “A per Cro. | 7 61 ooh
wo g-01 WO g—OT wo wo wo _— 71

off | DE 07 06 6— 6) ‘6 ayep | xoyypoeqosg loromuqoglojqoiq| euoH | esuRT

OS iS:

 

 

 

 

 

 

 

 

 

 

 

 

 

 

8"6G
6°9¢
goog |
Sie |
liée à
Die à

0g |
9°8F

SP

9/88 ob |

oyroıg

 

 

 

‘AUIOIS BTÄH-O

 

ZOTONSIAL |
PBWABAL-BSSEIRE |
SesAqody |
AS20UW9 y
OO [BALA |
ZONT-BZSTL
SUUOLOL-SINT |
Koyepıozg-wung |
josnyyNoN
BZBYABOALA NY
uunıquonoag,
youqing
simquoeyy-sug.

UOHBAL-SIM
oqo goa!
yzsny
ueıH
AuBp104-8AMA
U97}18 AA
UIOUO
ZRUPEH
odeur

u
sinqueped
POZsV
STIOL

uonegg

 

DLLEBT

 
