urjdtaet ut ZT prodooT AISUV UW]

Ts

 

 

 

-V

Y

 

 

 

 

 

 

 

 

 

 

 

 

 

 

 

 

 

 

nme mia 91h |

 

 

 

 

 

 

 

 

 

1 hu A un ALLA AL A a mg)

 

lu ta il

al

 

 

 

 

 

®; PFUPEr) ‘doing pui ‘Us

sud, 1188 4111188 hdi 1 Mél 1444 À

1
