|
i
N

Ss

en

 

 

 

 

 

 

 

 

 

 

 

 

 

 

 

 

76
Lecture en a À ~ | Nombre des Erreurs de
Constructeurs des ie observations cloture de
No, u we du vernier 5 2 8 ee ae Be A? Remarques
du cercle horizontal an 5.3.8 ou pour chaque
een direction
Pr + —
Le le nenn
231 Olsen de 10 pouces Lecture di- |2micros-| Directions 1.536 2.3593 Réseau de Tromso.
232 recte de 10”.| copes 0.782 0.6115
233 Les secondes 1.235 1.5252
234 ont été 1.695 2.8730
235 estimées. 2.151 4.6268
236 1.207 2.9138
237 2 1.3821
238 2.676 7.1610
239 0.500 0.2500
240 0.126 0.0159
241 1.649 2.7192
242 0.566 0.3204
243 0.243 0.0590
244 3.360 | 11.2896
245 2.450 6.0025
246 2.270 5.1529
247 1.588 2.5217
248 2.928 8.5782
249 2.306 5.3176
250 0.075 0.0056
251 2.878 8.2829
[ A? ] = 79.9639
79.9632 i
eV a ren
252 Bamberg de 27 cm. Lecture di- |2micros-| Directions 1.786 3.1898 Réseau de Buskerud.
253 mecte de 2. | copes 8 0.032 0.0010
254 et partiellement Les parties 2.409 5.8033
255 Olsen de 10 pouces décimales 10 0.518 0.2683
256 ont été 0.996 0.9920
257 estimées. 2.257 5.0940
258 1.428 2.0392
259 0.755 0.5700
260 0.726 0.5271
261 0.605 0.3660
262 1.574 | 9.4775
263 0.579 | 0.3352
264 2.943 | 8.6612
265 0.004 0.0000
266 0.436 0.1901

 

 

 

 

 

 

[ A? ] = 30.5147

30.5147 oe
fe Se ip = £07.83

 

 

sete ve EL ie

Joi Monten dlisedbanertddlbendernrenpene tt

can ae Le au

 
