 

laf

(fl
|

 

or

sen. B Es

 

Qt

| 40 k

 

ee a - |
ronomischen Bestimmungen, Carte-es determinations

1871. m a Se na à M rn RUN MON. an

 

un _Karte der ast “astronomiques.

   

     

 

‘ : c : Dee MAC ELON MeO haa ns mgr ees
35 30 25 20 15 10 ee Me eee ee 10 8 50 55 60
nn = — —— = — nn m RE SS ee ee = MAN FATS SAR —— = ——
<e

 

Erklärung der Zeichen, N 7
Explieations . at

o Lange ,

 

longitu des
, latitudes

. - 3 m À >> y << / ~ ie 7) / |
e _Izimuthe , azımuds De a ee SG / fae Sol. / |
/ / = a 2] Pp

m Breiten

e Lange und Breite , longitude et latitude IR / Dit
T + ; ; 3 / N / / | EEE |
e Lange, Preite und Arimuth, longitude, / ou a

latitude et azimut.

 

a Dreie und Anmut, latitude et arimub > D

I
Q |
+!

  

A lendellinge, longeur du pendule

  
 
 
 
     

 
 
  

1
= ae : i
SU G ¢ 1% 1
* y Se TX 7
a N Dad 33 >> @ Pp ; / oz 3 à \ ES #
a : cop De Be er ÿ a “Wisthergkampen : aA ado a \ em ES a À
= \ Er <

ioe af L © =
| Be: Kokko DUor' Ar 1

ep; > al | ee TE |
- ho 45 \ sl — rn |
rg a PETER SBUR €

À
N [eae a ee
a \ a vs

_ iy

ye ste Chri sti
{ 2 RB
ve

EA)
ania/

 

 

( OS
b> Us Ay =, \
2 Zan DA 4 AZ. \ NEE
aS sf \ D kr) Pulkoroa ?
N is i oe a re \ A

  
 
 

/ 50
Br en foes Sh
| E F de ae )
4 Os Nr
| Harpe

       
 
 

 

    

=. a = : ar i / Pez
ay ay ASS

Canal la Manch,
Nr ee -

>

       

   
 
          
    

 

 

  

 

EIS FN 8
ex : Ne tee a
mn en |
Lemberg -— ee,
> TA \ f
— as
7 Cr > |
"AUS BE LIT LT UN! © BD LURLCOL IT
Se oy — NY = Feen ‘
y AVC = O_- CSN res; CW LE
Nis fa : OF es ter N y
oh ; Nez Srrsbrui, : (Neustadt
: 10

4f

A>
v

 
   

 

 

 

 

 

 

35|l
35
i| À
| es L Chatonia
ie = Meer
||
|| 3
It wg PR is Ue ete ee en | Ä
10 W.L.v.Paris 5 0 5 35 10 15 O.L.v Paris

 

 
