 

 

Land.
Pays.

re

Preussen.

Russland.
Sachsen.

Schweiz.

 

 

 

  

 

 

 

 

 

 

 

 

 

 

 

 

 

 

 

 

 

 

 

 

 

 

 

 

 

| |
Station. | Polhthe. | W. F. Beobachter. | Jahr und Monat.
| © ;
Ai Station. | Latitude. | E. P. Observateurs. eS Année ei Mois.
| 35 | Taufstein . — | Sailebenls: Werner 1874, September
| 86 | Knill . | 80756" 4711 | 207091! Sadebeck, Lamp : . | 1875; Juni, Jali
| 87 | Hercules . : | 5119 0.75|+0.07| Albrecht, Richter. . | 1875, August, Septbr.
| |
Polhöhen behufs Ermittlung Lath
: ae = gist
| 1 | Mühlhausen 151712 6.18 0.1 | Albrecht, Löw. 1873 a
| 2 | Tettenborn 51311729) „ desgl. | 1873 :
| 3 | Hohegeis . 51895202 desgl. ane itn
| 4 | Isenbure . 51 52 35.71 . desgl. | 1878 ip
5 | Asse 52 820.38) desgl. 1873 f
6 | Löwenburg 51 26 33.93 > Albrecht. 1874 | to
7 | Kulberg  . . , ‚5120 0329.00 best | 1874 | to
8 | Bornstedter Warte 51 29 0.84 =“ Richter 187 À to.
9 | Gegenstein 51 44 25.58 5 desgl. | 1874 (to.
10 Regenstein 51 48 57.66 > desgl. 1874 ito.
11 (Harzbure ae — | Low . 1875 ito.
12 | Dienkopf . — — desgl. . 1875 ito.
13 | Craula. a= — desel. . 1875 ito.
14 | Pfarrsberg = — | desgl.. | 1. Fe ,.. ito.
15 Eckartsberga — dene 0... ea ito,
16 Sachsenbure : = — desel. . Le Re IS see ito.
17 | Schildberg — — Richter . wear „ein a. ito.
18 | Osterode . — — des. dirt. Mode di. dt.
19 | Hals en — — desel. ee. A ito.
| 20 | Langelsheim . — m ea, 0... 2 ko.
| 21 | Mansfeld . — Soy | AE RE A de ae ito,
22 | Monraberg — — desgl. os ISSN. EIS ito,
23 | Dollmar — — des =... .2. SORT. an ito,
| 24 | Heldburg . — — desel. een an tty
| 25 | Kyffhäuser — He te ASE ON [Vert
| 26 | Lohberg — — DE a ies ttn
Do u er A I ee oe
1 | Peipzie 51°20’ 673 | +071 | Bruhns, Engelmann . . | 1863—1870 . hihi
L Ver
|2—6| Fünf pour | = — >} Brohns,; Helmert. . 1868, August— Novbr.
7 | Dresden i 5134382 | 60.1. Bruns, .böw 1865, 1874 tt
8 | Freiberg . be — | Bruhns ieee at
9 Capellenbere . — — | Valentiner . | 1868, August — Septbr. di
10 | Fichtelbere = — desel. . | 1868, September —Octbr. a
Ht Kahlenberg i = desel. a. | 1867, Juli—August : d
12 | Grossenhain : — — Seeliger, Weinek . 1872, August—Septbr. . d
1 | Genève 46°11'58!8 RC ee i
2 | Neuchâtel. 46 59 51.0 | +015 Hirsch, Schmidt, Becker . | 1860—1872 . “
| | vat
8 | Zurich . AY 2239.66") E21 | Wolfe. : | 184 185. as M
4 | Berne : 46 57 8.66| +0.09| Plantamour : . | 1869, Juillet et Aoüt di
| 5 | Righi 47 341.26| +0.21| dto. . | 1867, Juillet et Août N u
| RN
| | ‘leat
6 | Weissenstein. - | 4715: 2.82; +0,90): dio, | 1868 . AN
q

 
