= on :

 

Station: Eichstädt.

 

 

 

Objecte. | craa. | Min. Sec. | Log. Entfernung. | Entfernung
Eichberg A 0 0 1.906 .ı 122991412 21378,361
Götzerberg A 43. 24. 22,154 4,2781290.6 18972,697
Stöllnerberg A 100 | 44 LOS 4,3813986,5 24065,708
Station: Götzerberg.
Stöllnerberg A 0 0 | —0,014 4,3247449.1 1122/4081
Eichstädt A 73 93 2.225 4,2781290.6 18972,697
Eichberg A 150 | 22 2,676 4,1786288.6 15087,901
Hagelsberg A 236 | a0 | 16.119 4,2670108.5 18493,147
Gollwitzerberg, Belv. | 287 18 20,276 4,1956610.4 15691,377
Station: Hagelsberg. 2
Gollwitzerberg, Belv. 0 te 0551 4,1717029.1 14849,195 F
Götzerberg A bao DO | 22.810 4,2670108.5 18493,147
Eichberg A 95 | 32 35 4,3634365.4 23090,672
Station: Gollwitzerberg.
Stöllnerberg A 0 0 0,291 4,3473854.0 22252,836
Götzerberg A 641 759 | 25,051 4,1956610.4 15691,377
Hagelsberg A 139 | 28 | 0,327 | 4,1717029.1 | 14849,195
Landsberg A DIR. STK: Bl, AZ 4,3564447.1 22121.%02 |
Arneburg A | 320 | 54 | 45,013 4,3096739.4 20402,058
Station: Stéllnerberg. j
Arneburg A . 0 0 | -0,223 4.1576178.1 14375,328 1
Woltersdorf A s6l 12| 3,355 | 4,8172791.1 | 20762,474 |
Wittstock À 108 dE 35.890 4,3871912.8 24422,903
Eichstädt A 205 4 25,913 4,3813986.5 24065, 708
Götzerberg A 252 1.11.16 45.281 ‚3247449.1 21122,481
Gollwitzerberg, Belv. 296 | 30 | 43,847 4,3473854.0 22252,836
Landsberg A 341 2 1,755 4,4627460.9 29023.253
Station: Arneburg.
Landsberg A 0 0 0,052 4,1863060.8 15356,989
Dolchauerberg A 52 | 53 | 41,694 4,2636688.6 18351,386
Polkern A 87 34 11,637 4,1371505.8 13713,572
Woltersdorf A 147 11 | 51,579 4,3884147.9 24457,655
Stöllnerberg A 205 5 | 24,452 4,1576178.1 14375,328
Gollwitzerberg, Belv. 282 | 30 | 56,032 4,3096739.4 20402,058

 
