ah u

li ml iM m un 1

LjUh

a Irir 1 IT LRAILAR UUramingi Mil it el

 

 

 

 

 

od,

AV. Suede,

 

 

SONO

N°

 

 

 

 

INDICATION
DES POINTS

 

Falsterbo..........
Malmo: ....

el eklee lei a tef aan era)

Dagsstomp
Uranienbor Be.
Gräfsvehacken ......
Helsingborg.......
Högkull e
Hogalteknall.......

Boarp. ... .......
Wilsharad.........
Nyenas..
Hinnakle..........
Fastumper.........
Himmelskullen.....
Slmor........
Askomberg........
Folkaredsklef......
Elmeberg..........
Apelviksas.........
Borstaras..........
Nidingen..........

Ytter Fistlarne....
Winsa
Westerberg........
Marstrand.........
Aleklatt ee

Bene en
Lejdeberg .........
Ss

Ornekull ..........
Wäderö .. . ...
Amundshatt.......
N® Kosteron .......
Lofverasfjell.......
Wagnarberg.......
Dragonkull........

Ionen Beer

Busen... ,
Westanaberg ......
Golekull...........
Sjogeras... ........
Daltjarnshojden....
Halneknatten......
Syarttjarnshojden.
Elgdalshojden......
Saxehojden........
Stuteklefven.......
Klaxkull..........

 

| LATITUDE

a EPOQUE
55023' 2") 30028! 5g'' 1839
55.36 25,| 30 40 10 1839
55 3 37 21 | 31 0 1839
55 43 8 | 30:53 55 1839
554653 31 857 1839
55 49 a 30 43 50 1839
55 54 28. | 30 2147| 1839
>59 574.504 35 1840
56 2:56 20 21 5i 1840
56 12 16 30.11 36 1840
56 22 35 | 30 42 25 1840
56 27 48 | 30 24 20 | 1867
56 37 45 | 30 45 13 1867
56.41 28 | 30 23 55 | 1867
5645 6 | 3028 35 1841
56 46 13 | 30 48 26 1841
56 53 6 | 30 34 47 1841
56 53 29 | 30.19 28 1841
56 55 28 130. 1 34 1881
5% 040 5022 17 1841
>0.092|:010 || 1841
>20 35.30.1116 | 1841.67
27.999 .20955 5 | 1841-67
3.132, 30013 1867
571815 729 34 6 1867
87 2220 |30 326 | 1867
872514 ,292953| 1867
57 32 29 | 29 44 59 1867
57 30 40 | 29 23 33 1866
57 3759.2916 3 1866
5740 2|2938 39 | 1867
57 53 15 | 29 14 38 | 1885
57 54 16 | 29 40 56 1867
58:77 9935| ıser
58: 8 35 | 29-31 53 1867
58 18 38 | 29 17 46 1866
38.20.22 2852 7 1867
>80 17,298 4 5 1867
58 3453 2344 13 1867
5841 029 255 1867
58 54 12 | 28 40 18 || 1866-67
59050129 4 9 1866
59.2 3.28.48 29 1866
ae ıT 1866
>85 30%05 1844
58 39 47 | 30 20 28 1844
58 51 44 | 30 18 40 1844
5857 5 | 30 40 46 1847
53 216 30983] 1847
585722 3015 3 1850
59 259 50.10 17 1850
59 4.46 | 30 34 50 1850
59 14 35 | 3038 5 || 1850-51
59 13 58 | 30 11.43 1850
59 20 37 | 30 17 22 1851
59 26 18 | 30 39 52 1851
59 24 14 | 3025 0 1851
59 25 22 | 30 49 20 1852
59 30 48 | 30 48 16 1852

 

 

 

 

 

 

 

 

 

 

 

 

 

 

DIRECTEURS
INSTRUMENTS
ET OBSERVATEURS
Häggbladh, Littman.
id, id.
10% id.
id. id.
id. id.
id. id.
id. id.
id. id.
id. id.
id. id.
10. id.
Lindhagen. Ertel.
id. id.
id. id.
Higehladh, Littman.
id. id.
id. id.
id. id.
id. id.
10» ld.
id. id.
Häggbladh, Lindhagen, Littman, ir
id. id.
Lindhagen. Ertel.
10. Id.
id. id.
id. id.
id. Id,
Stecksen. Littman. .
id. id.
id. id.
Rosen. Repsold 1.
Stecksen. Littman.
„ id.
id. id.
id. id.
id. id.
id. id.
id. id.
id. id.
id. id.
id. id.
id. id.
id. id.
Lilliehööck, Skogman. id.
id. id.
id. id.
Arosenius. id.
id. id.
id. id.
id. id.
id. id.
id. id.
id. id.
id. id.
102 id.
id. id.
id. id.
id,

id.

 

 

REMARQUES

 

|
BD

 

 

 

 

 

 
