m: FAAS NA Tere FETTE TER TE I Te en mn mm A ee eat a etre en nn nn a ee ee nn nn

Tee

 

a TEE nn

 

 

 

 

 

 

 

 

 

 

 

 

 

 

 

 

 

 

U9)SÂS IOUdT AY
Oh oor 1.68 | 981086 1: 4881 ji | 879086 | 990086 | 88 | 98 + | 099086 || 928 | BESTT | E Reg |" ' ' ‘ "Sueazıy \ | 42
607 + | 86. — | 461086 | 8881 : | 879:086 | PrS'086 | P'S] GIA | 691086, || 8818 | O'6GOT | O'BROr |.” ° * "omoyenpzueng \ 9%
BAL 1106. — | 961086. | 8881 e | e906 | S606 | FZ | 6 + | 190‘086 || 0948 | Fe Or | 8‘T8 97 |‘ ° °" " wolresgng | ce
00% OT 7 |. 664.086 ,| 881 “ 019 0867 280086 | Sari St te | 020006 1802 | PTCA 00g ert. | Meee | pe
09° == | Oh "064086 |-LS8T = | 099.086 | 219086 | 8 | 98 + | F49086 || 818 | 698 IT | 86897 | "7° 7, men ge
ze a Lb: oo 166086, 18881 > | 079086 | 229086 | 88 | IL | 189086 || 978 | T’SLLT | 1.6899 Joruuser : do
0e 1165 191080618881 : 569086 | 199‘086 | 8% | FI + | 899086 || 898 | S°BLIT | 6°88 9% | AIO “uorgspunuäig 18
el 72 198..  | 701.086 | 68 = 869086 10400861 80) SLR. 1180-088 NORE. SOLLL Pe reer | -4 7 ee 0%
ao gl —: | 9080 | LEBT 2 079086: 1.149:088° 1:80 2|.PLr ,| 889°096. 11. 61e= | DRTIL | 26197 | 7  RUEHDeN RAGE
O88 = O0 = 1.014086: |-1681 . "9191088... renee ge PT + l'éon 000 | Pre Mer Tl Ver OF | 3,05, aues ) uno el
Bie ee a8 | 008086: | LOST = 1 STE086 |.ScH 088 143.31 Sl | s00086 || Cis OL TL |. OCL er | 2 24. STOUR iS I a
Oe 0% 7:1 102.086 | TOST N (060 08600086 92.1 GL. 1.109.086 || 806.109 m 00.07 Wie vt ce ee 91
Sie | bo. 7 ROO 08h: |. Lost : 29.0863 1:.189.086 192, | IL=M. 12129 OS HEBEN ah IL a On 8 8 es era QT
g 37:8 — | 889086 | IGSL Y 089086 :689:080%| gaı | er... | z0lose |:887 1 94 IL | 00.0u. 0,777 0er FL
mer + NI69086 | 1681 r F E69:086: | 269108622. 1| Kl 4’ 079 088-|| CRT | 8a 1h |G 9acp 4 "47 SOA el
dr ll. 129086 | 1687 E | F69‘086 | 889086 | 88 | LI + | 199086 || 04 GOR OL |. Mears 2 BAT ro
0 9 — | 629086 | 168 à 1.899.086 1 19086160" Obs | 1690861)! 916) 60 IT Ta 7.) C0 VUS RON pe ae
; Ad oh "+ | 909086 | [68T = 9840802. 881086: ac ne 7189:08621.0972 1.0.0211. Samen ar eV, OT
0611600 086 ; |: LOT F "nel086. 2) 180802. c'e | SL 7:1 889.086 HN 68h | Tao... Tem 9 ee 6
© 21,9), 78 1889086: | TEST t Pipe OS6e | hel OS6rdv Gre | Pict: | COM0S6 1 9Gle.| CVO | SOC cil «> 1a ones abled G 8
gg + | 88 + | 6979086 | I68I À TEL 086 F6 086.60.) 9 "101086 ||S01 =| 667 OL) OEar 7,7, ORE I
we nl der 1-179°086 | T68T E 899086 | SL9°086 | de | 0 129086 || 84 6°69 OL | 96a cm |. vurnuesod | 9
6% 66 T|-169 086 | 18ST 5 | 999086 | 999086 | de | 0 <99°086 || ¥ SOLeL| 9080: 0 N ese come ee
Be 20. ae 6 15880086. ı TOSL.) 3 | 19086 | 889086 | 88 | 0 699°086 || 99 go PROC 2 zouongosang: : F
8, #48 |. 619086 | Lest iz | 999086 | 019086 | 88 | 0 g¢9°086 || LY EMO (CSL GPa lim mi CUB UZe IN: &
de he 1019086. 1.1081 = | 809086 | 09086 | «a | 0 869086 || 1% POT IC Bay a 8 EN) BO 6
900 — | 2900 — | 809086 | 168T | ABIEIG “A 381040 |) 482086 | Les’ose | a | 0 088086 || T& CAROL Se rl oe “21070$10€f | I
“1OpUBLIVGYORN 'n UIvdU-YOIEI1e}seQ UOA Eye SyaısoM “IT
Be RE a ne a a N A ese ee ee le le ee RL ERBE PER SET Sl nr |
wo wo ud | | wo wo b— Bb wo u 2] |
Wag Le gee | | SQ = 5 | H 5 |
2 | Q = mo) | |
| | 2 | | oe = 2 | = |
| © i cee : ae ,
By ep 04e 5 = = 1934084004 pose = ae ZUR 8 B oneig | uoneg Jap omeyy aNVT =
| 8 | 2 he = ae . a E
| = > | DE N 5 = ale = =
| | 2 & - SE I = 5 5 = 3
| 5 = | o a els Ls > =
| | 4 | 2 | ° = es 3 S.

 

 

 

 

 

 

‘OG — FRR] ‘uory nz nggsup ‘18093- Ju 7 'n ‘7 sep ypanp uedunssom
‘II OT

ng de Emi sn are PR ase rene eek EEE en RE Fe 3% < x = ers, Fe & = = ==

 
