u sf

 

 

: = Se eR EE Re PEU D Ro ER EE ae NES EE RT AS RET Set PS NN ST i ee eR ee eae a eR er IER a ere
Den ai ea oe oe LE Zu ee nn on > = Le Teen a - nr ne . ea x à es ee ee nn. - g
ET DE BE ne ne Karel = : EEE Se Se SS OC re = ee
> =. ET Ts Fa - 3

= = = ar aw tS
“ E at erg — — er
ee me ei re ~ = or m - 2 De DB gen = = Cr
ao = re = + gg TE ot a ru Don u ere mue = A ~ ee : as Te ~ 7 = ee .
RP PR ee ge HEERES DE De r gan > Sig eg NE clot ope EE > , 5 en en ee
= ze N = we‘
> Si Fete I

 

SE EN
u u reger en u

2%

wi nn 5 En 2 7 : eg N, 2 Ze
ig * = SS, en: Res’ a Sins Rl ae 7 ge” a 5 =
ae ow, ee Na en en 2 Pi A a nr * : = rer at ST sng ES es np à © 5 i rd

2 en CEE * ge: a m oe ae eo ec Sing eS a es a m. ee am a a ne = ee SS

nn ie : Den SAT Sa zu a ee = 3 Mere ee = ;
oe en nae nm en Se le a a re u * 3 es Pt Nel Een sg are en
om Cea ornare ert NL NN gag Sg Soe See Ty RO ZT, = es nn SER man een R
a en er ee rege TT PU PE nr i age Te en pe ET rg a gee IE: tn rg ee a un is tin)
sao EEE RUN PO EEE ee NEO Se Ne SE TE See Re PS een

 

 
