   

TE EE

 

 

12%

Paar ı

ne

91

17.
17).
TE

Paar ı

17"
17.
17.
17.
17
17%
18.
17.

30
06
65

38
21
42
07
18
41
14
39

17%
10:
T7.
I:
17:
16

19
oF
C7)
33
Ly

397

Paar 2

16.
17.

88

10

17-95

HE
16.

Paar

"

ne
17e
17.
I.
16.
107)
IR
17.»

21
83

40
43
60
45
98
53

45
38

NE
ne
ur
17.
17:
17e

79
24
45
24
32
23

2

Paar 3

17.18
17.00
17.20
17.43
17.15

Paar 3

"

TE
7e
17.
Wale
-43
17.
17
io

17

23
14
OI
44

29
04
49

17208
17230
1.72 34
17.62
T7513

Gruppe I

Paar 4 Paar 5

16.78 16.80
17.18) 192.22
17.62 —
27.48 17.00
27.00. 117.155
Gruppe V

Paar 6

17.06
17.50
17.07
17.30

Paar 8

16.95
17.26
172.07
17.85

16.81

Paar 4 Paars5 Paar6 Paar7 Paar 8

17.26
17.38
1-27
17.44
u
17.30
16.95
7232

77235
17.68
17.73
17.46
17 T2
16.92
177 02

17.09
17.37
17.49
Te

17/30
17.18
17.25
17279
17.06
724
ELU
17.25
RO
17.32
17.32
CDS

17.62

1720
17.32
16.95
DS
RON
17.22
17-07
17.59
172.216
17.24

Paar ı

17:55
SG
17.65
PS4
1715
17.44
17 090)
17.40
1737
17228
RES
27.23
Tse
17.07
17.44
17.29
7

Paar 2

Paar z
17.09
17.50
17.16
17.00
UE
17.20
17.34
17.46

  

Station

  
  

Polhöhe
Gruppe I
Paar 3 Paar 4 Paars Paar 6
174431 17.06 — 16.90
17,18, 17.47 17-32 08
17.26 17.52 19.12 17160
17% 354: 1216.1768 1460.83 17.09
17.39 — 17-69 1708
17-07 277238 17.80 1000200
17.13, 27.70 — =
17.15 17.00 1727 —
27149 0% 47 45 ey a —
17.29 17.29 17.08 1707
17.1.8 17.39 17.22 17-58
Gruppe VI
Paar 4 Paar ;s Paar 6 Paar7
m om. > or, "7
17.56 17:24 17:24 D TE
17.12 16:92 17.28 0008 2
17.27 17.20 17.60 00, m |
— — =
17:49 17-59 ma 0 3
16.05 17-25 17-65 GS Bl
17.43 ..17.28 7.23 08 I
17.14 17-47 mo 2 Le à
17.52 17.57 1740 uaa id
17.45 27.53 mo |
En 17.41 17.64. Weed €
17.17 170838 — 17.19 A
17.05 27.54 17-50 Le og
17.98 16,65 26 de 17:39
17.42 17.35 17-35 D a

 
