257

 

 

 

 

 

 

 

 

 

 

 

 

 

 

 

 

 

Saxavord ee yes, + 0.4310 u + 0.0007 w 7587
Balta: sn. me. 222,510. -+ 0.4282 — 0.0001 er 19,007
Ben Hutig. Ban 1.0.9984 -+ 0.3492 — 0.0187 — 2.608
Cowhythe . &, = + 0.9985 —- 0 3179 — 0.0238 — 4603
Great Surneıı 2.0, 1,0998 -+ 0.3101 — 0.0249 — "801
Kelle bawaaıı 0... m... &, = + 0.9988 es 0 2663 — 0.0294 273888
Game —_ 1,0988 " = 0.2558 — 0.0301 Aal
Durham 5 nr 099 + 02131 — 0 0314 9,0609
Burleish Moor .. & = + 0.9990 | = 0.2060 — 0 0314 A
Clifton Beacon. . &0 = +0.9992 + 0.1660 — 0.0300 — 0.059
Arbury Hill a | » + 0.1216 — 0.0258 — 4010
rem a. 0.9995 12 10 0947 — 0.0919 3940
Nieuporbe a: | 5, + 0.9996 | 2 + 0.0822 — 0.0198 — 41.080
Rosendaöl-les-Dunkerque . | 2, + 0.9996 + 0.0792 — 0 0192 — 1.580
Lihons . u &£,=+t 0.9998 —+ 0 0355 — 0.0097 — 0220
Pantheon . &% = + 1.0000 —- 0.0000 -+ 0.0000 + 0000
Cheunyı 0: 2 20002 — 0.0302 + 0.0097 — 2490
Salienylevıtı 2. a 1.0003 — 0.0649 + 0.0225 + 3.570
Arpheuille St.-Priest . &, + 1.0005 |  — 0.0944 + 0.0347 A ah
Puy de Döme un 1.0005 | — 0.4107 —. 0.0420 + 7911
Ir Hoden &,, + 10008 — 0.1617 + 0.0673 938139
1 Carcassonne . 2 ee 1.0010 — 0.2026 -- 0.0903 A AI
1 Rivesaltes . &,— + 1.0011 — 0.2195 + 0.1005 + 1.204
I Montolar &,— +1.0013 — 0.2596 -+ 0.1264 + 5.824
Lerida . 2, 11.0013 — 0.2604 | =£. 0.1270 + 2.014
Javalon. 00 = 03109 + 0.1627 ı 9495
Desierto &, = + 1.0015 = 0457 22.0.1666 — 1.845
; Chinchilla . &, — +1 0017 — 0.3577 + 0.1996 + 5215 |
li Mola de Formentera 2 —=+10018 | 03669 + 0.2071 + 1.965 !
ii Tetiea . &0 — + 1.0020 1 —04178 + 0.2512 | + 7.015
Roldan . &,, = + 1.0021 | — 0.4289 —+ 0.2613 — 2.305
Conjuros. . &, — + 1.0021 — 0 4362 -+ 0.2680 — 8.945
Mt. Sabiha &, = 1.0023 — 0.4753 + 0.3052 + 10.513
Nemours &,, — + 1.0024 — 0.4957 + 0.3254 —+ 11.654
Joyzareaı 00 | — 0.4342 + 0.2661 2 6.559)
Mes Wolo) 2 u a 0 | 2. — 0.4358 - 0.2676 \— 5.365 N
@ueltfes Steele 2.2... 02.., 2, 11.0094 — 0.4944 + 0.3241 + 3.164
m... 20,005 1.0096 — 0.5494 + 0.3740 1832

 

I. Für die Ellipse, die sich diesem Meridianbogen von 27° Ausdehnung am besten
anschmiegt, ergeben sich die Normalgleichungen: !)

+ 38.0353 £, you + 3,6914 w 31.203 = 0 |
2 9,5057 23.6513 —,1,64.68 0806 0 i
130014 1.0468 -+ 0.9936 + 12.052 = 0; |

1) Infolge einer undeutlichen Ziffer in einem meiner Rechenblätter ist zwischen den in der Abhandlung: Die Grösse

der Erde benutzten Normalgleichungen und den obigen eine Differenz von 2 Einheiten der 3. geltenden. Ziffer in einem 1
Koöflieienten von w entstanden; die dortigen Grössen de = 1:281.4,da = + 1078 m, Quadratsumme der Abweichungen |
gleich 663 sind durch die obigen zu ersetzen. Die aus den anschliessenden Betrachtungen folgenden Schlüsse werden von
den kleinen Aenderungen nicht betroffen.

33 \

a en

 

 
