 

 

 

 

 

 

 

 

 

 

 

 

 

 

 

83
is | * en  AnınrerkDe LA BÜBLICATION REMARQUES
S |
U) T :
1888 Sept. Not yet published. Rough field result.
Ok,
3 1888 July. Latest catalogues. »
| August.
Ok :
889 Nov. » Rough field result. Measures were
| also taken of Zen. Dist. of Po-
larisin 1891 April and May with
| Vertical eircle N° 57.
al 1889 June. » » A new determination by the same
| observer was made in 1895,
I February ; not yet computed.
au 1889 Octob. » »
1889 Aug., » Rough field result. |
- Septemb. |
he 1889 April, > » |
May.
ante 1889 July. » » The station was reoccupied by the
A same observer in 1893, August.
nk 2 - Not yet computed.
1889 Sept. 3
„1890 March, » » Station a little to the east of longi-
jan April. tude 141° west of Greenwich.
1890. June. | Not yet computed.
un |
„1890 AUg,, » »
in Septemb.
18% Dee. » | Rough field result.
1 » » »
1890 Nov. Latest catalogues. » A subordinate station.
I |

 

 
