 

 

No. 2.

Angoli osservati.

66 —

Angoli com-

Rete intorno alla base di Catania.

Angoli ridotti

 

Nu- EE ee :
é 1.
meri, | Nomi dei punt
{ Jazzovecchio.
1. Perni
Gerbini.
Anania .
2. Gerbini.
Perni

Gerbini .

Anania .

Perriere

Anania .

ee ee,

Montirossi.

5: Anania .

|

6. Perriere

Montirossi.

Jazzovecchio.

 

Jazzovecchio .

Jazzovecchio .

Jazzovecchio .

 

Logaritmi

 

 

 

 

 

 

 

pensati. pel calcolo. de lati.
24. 48. 21.010 24. 48. 21.643 241 48, 91.644 3.5672673
292 22. 39.114 79. 27. 35.051 193. 27. 35.025 3.9370957
75. 44. 03.466 75. 44. 03.384 oy 44. 03.358 3.9308832
59.587 = = 0.078 0.000
a+ e = — 0.413
= 0.078
e = — 0.491
21. 29. 47.052 21. 29. 46.986 21. 29. 46.954 3.5672673
80. 38. 58.595 80. 38. 58.340 80. 38. 58.311 3.9974524
5 1191. 14.029 Gi. 91. 148465 77. 51. 14.735 3.9934294
Z+e— +0.376 = = 0.091 0.000
== 0.0091
e = + 0.285
12. 35. 01.998 12. 35. 01.809 12. 35. 01.780 3.9934294
156. 23. 02.060 156. 23. 01.724 156. 23. 01.696 4.2579560
41. 01. 55.963 11. 01. 56.552 11. 01. 96.524 3.9370956
Zte= 0.021 > = 0.085 0.000
== 0.085
82. 59. 17.120 82. 59. 16.970 82. 59. 16.815 4.2579560
45. 02. 24.739 45. 02. 24.659 45. 02. 24.504 4.1110055
51. 58. 18.288 51. 58. 18.837 51. 58. 18.681 4.1575818
Ste= +0447 = = 0.466 0.000
== + 0.466
e = — 0.319
47. 20. 51.784 47. 20. 52.417 47. 20. 52.102 4.2579560
69. 21. 38.226 69. 21. 38.016 69. 21. 37.701 4.3625758
63. 17. 29.729 63. 17. 30.511 63. 17. 30.197 4.3423855
59.737 >= = 0.944 0.000
Z+e— — 0.263
= = — 0.943
> = — 1.206
26. 20. 05.062 26. 20. 04.891 26. 20. 04.626 4.1575818
45. 20. 00.191 45. 20. 00.735 45. 20. 00.469 4.3625758
i 108. 19. 54.466 | 108. 19. 55.170 | 108. 19. 54.905 4.4879586
59.719 Sa DIU CT
S+e = — 0.281
0795
e = — 1.076

Lati in metr

in

3692.04759
8651.584

in 8528.708
3692.047
9941.511
9849.844

9849.844
18111.564

8651.582

18111.564
12912.356
14374.138

18111.564
23044.947

21998.117

14374.138
23044.947

30758.035

en
NC I

b

B

    

DEI TE I TUTTE

mM

11881

4

um

Lu Wi

tay edhe blue, ps Pb he dit pistes, que

|
|
