 

269

 

Nm sn

 

 

 

N® | Indication des points | Latitude | Longitude | Epoque ne Instrument | Remarques
mm de
| 88 | Oshima 33 54 26 | 1302628
100 | Yahazudake 32 7 10 | 13024 0
| 89 | Mitsuseyama 33 27 37 | 1801819
101 | Fugendake 32 45 23 | 13017 30
i 102 | Nomadake 3l 24 3 | 130 937
" 103 | Okinoshima 34 14 28 | 130 619
104 | Kadodake 32 23 45 | 130 5 36
105 | Kyönodake 32 59 3 | 130 433
106 | Nashigochi 33 26 3 | 12955 6 |
107 | Kamikoshikishima 31 49 49 | 199 53 48 |
108 | Hachirodake 32 40 O | 1295121
109 | Nagauramura 32 54 36 | 129 44 39
110 | Dakemine 33 44 17 | 129 42 35 |
111 | Tengudake 33 19 54 | 12928 8 |

 

 

 

 

 

 

Chaine de Goto.

109 , Nagauramura 32 54 36 | 199 44 39 1892 T. Tasaka

111 | Tengudake 33 19 54 | 12928 8 D. Seki No 3
112 | Ukushima 33 16 10 | 129 626

113 | Sannayama 32 55 48 | 129 3 8

114 | Otoyama 32 40 2 | 12847 5

Chaîne de Ho-san,

 

 

45 | Myöjinyama [Awa] | 33 48 7 | 13439 2 | 1893 T. Tasaka
115 | Shözakumori 33 28 3 | 134 814 M. Sugiyama N0 2
48 | Tsurugisan 33 51 1 | 134 539
49 | Kiyama 34 17 11 | 133 53 238
116 | Niogauchiyama 33 51 8 | 1333447
117 | Kuishiyama 33 39 56 1303023
67 | Okinoshima 34 10 26 | 133 18 53
118 | Gozaishomori 33 10 26 | 133 9 1
119 | Omogayama 33 45 19 | 133 5 36 |
120 | Shiratakiyama 32 45 9 | 132 59 46
121 | Azonomine 33 28 8 | 132 51 56
2 70 | Takanawayama 33 56 32 | 132 50 59
= 122 | Nametokoyama 33 11 6 | 13238 6
= 123 | Tsubokomiyama 33 36 8 | 1323315
7 124 | Okinoshima [Tosa] | 32 43 24 | 132 33 14
@ 125 | Mitsukuyeyama 33 25 47 | 13212 22
= 75 | Murotsuyama 33 50 59 | 132 831
= 126 | Motogoshiyama 32 54 3 | 1315747
127 | Mominokiyama 3 1912 181501
78 | Himeshima 33 44 7 | 1313958
3 90.| Horikawayama 32 44 3 | 1313046
1 81 | Kanaraseyama 39 05 52 33115 8
92 | Kujüsan | 33 4.44 | 1311425

 

 

 

 

 

 

 

: Chaîne de Ku.

31 | Mimunesan 34 26 44 | 13612 22 |1895—96| T. Tasaka |
128 | Takakoyayama 34 1 43 | 136 8 50 Y. Taura N° 5 |
129 | Odaigaharayama 34 10 55 | 136 633

36

CNT iil

TAN am lite

WIPE TURAL |

 
