ee]

83

 

 

a a nennen ner un

 

 

 

© | N° des jAuteurs des[Lecture en Nombre oe Erreurs de
= instruments seecondes écutées Oture de
' 3 | stations jemployés et ee des verniers a veo | chaque ;
| S |formant lel diamötre |FU vernier 7 pour chaque! triangle A Remarques |
| | formant le d ou des ansle au
a du cercle QUO A
| 4 | triangle | horizontal microscope] Microscopes | POUr Chaque|————-——
dE | dmeenom 20
mE nn IE ea a
| 4
109 |53 54 64) em a 2 Mikroskope 48 im „...0'295| 0:0870
110 153 64 69| Theodolit | » » Minimum {0-054 0:0029 |
111 153 69 68| von Starke | » » 1-215) 1:4762 |
112 | 59 68 52 und | » » 0:952 0:9063 |
113 | 64 70 69! Kammerer » » 0:034 0:0012 |
114 |64 65 70 » » 0:087 0:0076
445.169 73 70 » » 1.118, 31019
1416-4 65. 2 | » » 0184 0:0339
417: | 79 198 » » 0-803 06448
118 | 2 2 | » » 0785| 0:6162 |
419° 9 TER | » » 0:656 0.4303 1
120 2 3 73 | » » 1'744 30415 |
124° 722 80 75 » » 1.050 271295 |
1922172 5.80 » D 0:769) 05914 2 |
193 116 715 80 » » . |0°598) 0:3576 |
124 79 16 75 » » 0761| 0:5791 |
125 176 80 77 » » 0:025 0:0006 |
126 179 716 78 » » 0:774| 0:5991
121,18 21 5 » » 1344| 1:8063 |
128 716, u na » » | 0-194) 0:0376 |
1929 75 716 78 > » | 0-118| 0:0139 h
130 | 792 718: 75 » » | 0105| 0:0110 |
ASA MS HE TC » » 1268| 1:6078 |
132 |80 74 82 » » 1.399 41-9572
TS OO. Vian So | » » 0:623| 0.3881
134 |82 75 TA » » 032 01384 |
135 |82 81 80 » > | 0-615] 03782 |
196182 72 0% » » 0:289 0:0835 f
131. 182 67 61, | » » 0:529 0:2798 i
138 |82 61 86 | » » | 0.842 0.7090 |
139 |82 86 81 | » a) | 0:288| 0:0829
4 140 |86 83 81 | » | » 0-179 0:0320 \
= 141 |86 84 83 » | » | 127118165550
= 142 | 86 60 84 » | » | 0-156} 0:0243 1
143 | 86 61 60 » » 1'240 1.993110 |
= 144 |59 84 60 » » 1:038| 1:0774
= 145 159 85 84 » » 0-104! 0-0108
| 146 59 35 5 » » 0500| 02500
= 147 |29 85 35 » » 0-080 0:0064
3 148 |29 34 85 » » 1.971 38848
149 |34 36 85 » » 1:599 2:5568
150143 1999) » » 1:327| 1:7609
151 |43 99 18) » » 4248 18-0455
152 |99 19 18 » » 4°313/18:6020
= 153 994100 19 | » » 0:834| 0:6956
3 ‘ 154 |99 12100 » » 1:363 1.8578
155 |12 98100 » » 1'884 3°5495
156 | 97100 98 » » 2.954) 87261
157 | 97101 100; » » 0:590 0:3481
158 97 96101 » » 4 805 3:2580
159 196 95101 » » 0.546 0.2981
160 |96 94 95 » » 3°452|11:9163
161 |96 97 94 » » 1'874, 35119
162 |93 94 97 » » 0.129 0:0166
1163 93 97 98 » » 2:959| 821931
164 193 98 901 » | » | 3:984 158723

 

 

 

 

 

 

 

i

TU aA MOI!

x

 
