 

 

 

ie 200 OL6
68 + st + 016

Cal | 8 > 16867646 | 986° 616

9G6-F | 9G6 + | TTL
eat | LGS + | TTL

          

ece+ oFre-+ | 689
PLI+ YLI + 989
CGG+ | Lpe + 919

 

 

fe
FSI+ | FSI + | 98T°

 

 

(oe | © 186 LSS
ss | — |666°616| gest
| | 6 + |ego:08s6]| ”
1206 | „206 L881
| 1896 essl
es | = ee 1881
les | — |698°816] 8887
lece | 194 |6er'626| Leer
8L6|0LS° 8161 — |OLS:8161 EST

"yas WO 600°0F 38810 uorAnpoauuosÂs Jop HOUIOUOISU( o19[}ILOL ot ‘niayskg-f IoUIBps}og ‘UOUOHEIS 8

 

04 96 |04— 056) 04 | 6
|
|

 

“

u

11

 

 

 

lore | #2
59e =| ee
(699° 616 ve
1996 . | (9°a)
1196 | (0°)
| 906 | (9:2)
| scs | (0:8)
| 818 | Qa)

| (9°3)

 

 

 

 

| PIL nee ası ur
| PIT Iu:ca soI—|G" LY
| 2861 |9°S@ 1ZI—|F'08 LE
@ 8:19 LGT—|T:8T
| + Be LOT SI I&
litt | oz 991—| 99
g 1F JCI— €
| 1008 |. ST 99I— | SF 08
le ‚FL.OST—| 0 .0I—

‘UJOPUOÏSUOISIOAOY U9Y9S,aosıa Jg JIWw UOSUNSSON “q

 

| 1994984094 | 9I9MUIS
|

 

 

 

 

  

|
|
|

PI ou0H | oSueT 9J1914
|

| se | reer loc
L | 610 —|T'86 19
Ve Ge Lise
cor 86 9 - |lo:cr 9F
OL 6 FL em
sre |O°L 08 —|L°LS
199 | gr 82 —l0°LS OF
BET | ‚66:92 —| ‚8%.6E

(0687 — 5,87) uISpuadsuolsasaay-uspunyas uw 'y ’s 'n kdAang 9179P099 pue 1580) dOp u9Sunsson ‘EL Jddnay

UL

| | | ‘ u |

Hr —|2 = ies. 41086, a 0 88 : ar a a
Grm | LL" 186 | ITS" 186 | 0 (|GIa'186| " . ‚018°186 | 86

(dog +|es +|ase [986 | 0 (866 9LST z | 696 gs
e -\# — |v 1629 a el GLST a 196€ GB
1e ue nice «eee 0 ce en : 1088 (eo)
of los don io | 2 ‚360 (ro)
ee se We Ka eee 81 | 90104  |L80 (F° 0)
G —|gr —|gor'osclgrr'o86| — |sst'o86l o88r | ‘6 n someq |08T°086 | (G°8)

‘[OPUOÏSUOISIOAOÏ UOUIS,ATOSATY Wolo JIW UOSUNSSON “V
9 g—0T | Wd 8-01 um | ud wo 08 | wo | ws |
6—6| .°6 Jager |

-uoFunssoM oyOstuvylIouUy 'IIX ollogeL

ec sat Mild Lan dle tel

a ER NaOeN acm

 

 

|
u |
|
|

O9SIDUUIT UES |
|
UOJEUBE, JUNON |

u “u

uoBeIg “IO A

ngeQ ‘nnfouofl |
Tey, “OY |

, mem “BUBUBT |
‘JUIN ‘MEN ‘OUOUACA |
png ‘purysy oulporep | UvdaZQ HIS

u

                   

u

 

 

| HAN (uog | puepyosmeq
; MOM puejsug
“Aa9sqQ SLed | Yorrtyusry
jun ZIOMUIS
| 9suf 'Ao9g (uoyogoH | 2
‘A1SQO ‘AUS

|
Sıngsusg] |
|

|
|
|
|
| YIOK | WoyBByg “10 A

uonwIg pue]

ai min l

ma Du
