 

 

       

 

 

 

a ar

VIL'S — Grande Bretagne (Inde).
DIRECTEURS |

 

 

WL IE LUE RAR AS RAAT IL ONLINE

 

 

u „|. INDICATION

DES POINTS

LATITUDE |LONGITUDE

 

 

 

EPOQUE

ET OBSERVATEURS

Madras Meridional and Coast.

 

 

 

INSTRUMENTS

———mTm—————— u — . . . 1

REMARQUES

 

 

 

 

 

 

Hu (Bider :
Fons) re. 212.312, 29037167 1868 Shelverton. ; 1
Adalieat (Bider : : Be
bons) ee cr 172217 795530 1868 id. id.
) | Anantagiri........ u 31817959924 1868 id. id.
2 | Niälamari....-: ld 134,79 4929 1868 id. id.
3 | Miädarsäl......... 16412 3180 332 1868 id. id.
4 | Särangapalle...... 16 41 19 | 79 45 35 1868 id. id.
5 | Kachalboru....... 16 30 43 | 79 58 39 1868 id. id.
6 | Voruvakallu....... 16/3585 1180) 0/56 1868 id. id.
7 | Dhulipalla........ 1672567 80 529 1863-68 Branfill, Shelverton. Let Se 247 ne len
Ts et S. 36)"
8 | Manlam.......... 16 22 21 295257 1863-68 id. id.
9 Kotapa ne 6 97°%,80 239 1863 Branfill. Let S. 245 n° 1,
10 | Adamsäb.......... 16 15 12,80. 17 20 1863 id. id.
11 | Yerrakonda....... 16 5 49 | 79 42 19 1862 Basevi. id.
12 Balapaeu.. 22. 16 3 Io 80.16.35 1864 Branfill. ra.
13 | Babbepalle........ 15 66 50 | SO 7 Bz 1863 id. id.
14 | Dénapa.......:... 19,56 01.7950 a7 1862-63 Basevi, Brantill. id.
15 | Medarametla...... 15 43 54 | 80 0 26 1864 Branfill. id.
16 | Faranguldinne ....| 15 40 56 | 80 12 42 1864 id. id.
17 | Peddakaltippa..... 15 49 42 | 79 43 23 1864 id. id.
8 Ongole..., .. 2 19 29 57 | 20 225 1864 id. Il:
19 | Chemakurti....... 15 37 12 , 79 49 34 1864 10. id.
20 | Netivaripälem..... 19 22 41, 719748 38 1864 id. id.
2) Burpad ..... . 15 1420 | 79 58 35 1864 id. id.
= 22 | Nishankonda...... 15 30.5979 32 24 1864 id. id.
= 23 | Bicherla... ....... 15 1059,79 32 0 1864 id. id.
= 24 | Kucherla.......... io 5.30 | 792 21 1864 id. id.
2 25 | Darutippa......... 5 056 7955 2 1864 id. id.
26 | Kesavaram........ 14 54 42 | 79 49 12 1864 id. id.
= 27 | Chäkalakonda..... 1450 45 1) 7950 37 1864 . id. id.
= RS Rajan 14 4232 | 79 36.48 1864 id. id.
7 29 | Nishänbodu ....... 14 A] 48 79 55 56 1864 id. id.
30 | Yerrakonda....... 14 42 40 | 79 15 26 1864 id. id.
: 21 KiStama ss 14 27 15 | 79 45 18 1864 id. id.
= 32 | Pallakonda ....... 142416 92309 1864 id. id.
33 | Votukur......... 14 14722719 42728 1865 id. id.
34 | Bandalduru....... 12 18 11, 7956 3 1865 id. id.
35 | Bälcherla......... 14 10 16 | 79 28 13 1865 id. id.
= 36.) Kayyur......2.. 14 0°39 | 72 39 32 1865 id. id.
à 37 | Gurramkonda ..... 14 0742795078 1865 id. id.
38 Gudali. 32 4 1 980 15 1865 id. id.
39 | Anepüdi........... 13 48 24 | 79 59 35 1865 id. id.
40 | Pillimedu......... 8 51 20°) 79 41255 1865 id. id.
41 | Kambäkamdurgam.| 13 34 27 | 79 51 45 1865 id. id.
42 | Jonangipalem..... 3 38 36) 80 1128 1865 id. id.
43...Xerpet2:. .. . 18 4257. 9) 3359 1865 id. id.
44 | Rettambedu....... 18206 51,80 10 1 1865 id. id.
Nagari (Madras : :
Long) 13 22 45 | 79 35 46 1865 id. id.
Chembedu (Madras :
Lonely 4 13. 19.232 7195873 1865 À id. id.
Dhär (Bider Longl.) | 17 43 59 | 82 28 27 1860-61 Basevi. Barrow 24” ne 2.
Sänjib (Bider Lon- :
Sl) rer 17.31 19 1,8247 23 1860 Basevi, Clarkson. id.
{5 | Gundälamma...... 17 3) 27 | 82 1923 1861 Basevi. id.

 
