PE EN re

 

 

OS

 

 

ld Soe ici sana
VE Be een sr sca

 

 

        

 

NOMBRE
AUTEURS DES INSTRUMENTS LECTURE DES ERREURS .
= oe EN ee OBSERVATIONS | DE CLOTURE
2 5 : SECONDES D EXÉCUTÉES DE .
2 = ET On Cae VERNIERS POUR CHAQUE A2
DIAMÈTRE DU CERCLE : OU DES CHAQUE ANGER, ARSASSS
: = HORIZONTAL ae MICROSCOPES Ce Ee a
Bee MICROSCOPE : CHAQUE
DIRECTION + | —
26 | 15 zölliger Theodolit von Ertel (Thei- | Ablesung| 4bezw2Mi- 24 | 7.064 1,152
lunesdurchmesser — 3oo™™) sowie | von */,, se-| kroskop-Mi-
die 10 zölligen Universal Instru- | cunde. krometer.
mente N. 1; und U von Pistor Erst Abth
und Martins (Theilungsdurch- 5 N ans
messer = 26522), i
27 id. id. id. 24 0",002 0,0000 | Iin 1803,
28 id. ide id. 24 0,362) 0,1210 we
29 id. id. id. 24 0,704! 0, 4956
30 | id. id. id. 24 0.830, 0.0889 ,
3l id. id. id. 24 0,215 0, 0462
32 id. id. id. 24 de a 0, 142) 3
33 id. id. id. 24 0,20, 0, 0480 ;
34 id. id» id. 24 0,479| 0,2294 a
35 id. id. id. 24 0 , 728 0, 5300
36 id. id. id. 24 0 , 909 : |; 0,826
37 id. id. id. 24 1,109! 1,2299
38 id. id. id. 24 0.511 0261 . :
39 id. id. id. 24 1, 798 8, 2808
40 id. id. id. 24 0,257) 0,0660
4l id. id. id. 24 0,220 0, 0484
42 id. id. ide N 24 0 : 372 0, 1384 :
43 id. id. id. 24 0 ,064 0, 0041
44 id. id. id.” 24 |0,449| 0,2016
45 id. id. id. 24 0. 303 0, 0918
46 id. id. id. 24 0 904, 0, 8172
47 id. id. id. 24 1,037 1,0754
48 id. oh id. 24 1;027, 10547 ;
49 id. id. id. 24 0, 563 0, 3170
50 id. id. id. 24 10,547| 0, 2992
5] id. id. id. 24 10, 649 6, 4212
052 id. id. id. 24 1, 366 1,8660 |
DJ id. id. id. 124 0,013 0.
=. 9 id. id. id. 24 0 , 666 =| 0, 4436
== 55 id. id. id. 24 0,255| 0,0050
56 id. id. id. 24 0,098. 0,2076
57 id. id. id. 24 0,101 0, 5883
58 id. ds. id. 24 0 , 023 0, 0005
oe. 359 id. id. id. 24 L ,:080 1, 10609 ;
4 0) id. id. id. 24 1,344 1e 8063 :
61 id. id. id. 2A L, 121 i 2566
62 id. id. id. 24 0,086 | 0, 0074
J 3 id. id. id. 24 0,690 |. 0,4761
XVII.
ELBKETTE 1856, 1874-75. À a
1 | 15 zülliger Theodolit von Ertel (Thei- | Ablesung| 4 bezw 2 Mi- 24 0",022) . 0, 0005 (Non m nu.
lungsdurchmesser = 355™™)sowie | von /, se- | kroskop-Mi-
die 10 zölligen Theodolite N. 1 |eunde. krometer.
= und IT von Pistor und Martins
il Theilungsdurchmesser = 265™™), :
a 2 . id. id. id. 24 0", 254 0, 0645
® 3 id. ad, id. 24 0 2156 0,8710,
4 id. id. id. 24 1 ‚588 0, 3457

N

=
®

=
=
=
=
=

\

à

\\.

 

 

 

 

 

 

 

 

 

 

 

 

 

      
    
    
     
   
    
 
  
   
 
  
  
  
 
  
  
  
  
  
  
  
  
  
 
 
 
 
 
 
 
  
 
 
 
 
 
 
 
 
  
   
 
 
  
  
  
  

  

 

 
 
