ae m

— 47T —

   
 

 

 
 
  

 

 

 

 

 

 

 

 

 

 

  
    
   
   
 
 
 
  
  
  
  
  
  
    
 
 
    
 
    
  
  

| XIX. — Suisse.
N INDIOATION | LAuıTuDE LONGITUDE TPOQUR a, TRUMENT
DES POINTS s ET OBSERVATEURS
1 | Wisenberg........ 47°24'14”| 25°32'47” 1865-67-79 | Denzler, Koppe, Scheibla- Reichenbach de 12". 2
ner. za
D Dagern 0... 47 28 58 | 26 355 || 1861-65-78 | Denzler, Gelpke. Ertel8";Reichenb.12";
79 Starke 8'; Kern 8".
3. Hörna........... 47 22 20 | 26 36 24 || 1865-67-75 | Denzler, Jacky, Gelpke. Reichenb. 12"; Starke
78 8.009.
4 äbris... ... 2.2.0 Ara 21 U 2 1864-67 | Denzler. Ertel 8"; Starke 9".
SSL BIT 00.0000 47 32926 9 0 || 1861-67-75 | Denzler, Jacky, Gelpke. Ertel 8’; Reichenb.
78 12, Starke 8.
I: 6 Nape 0.0.0.0. 47 018 | 25 36 17 || 1861-62-65 |Denzler, L’Hardy, Jacky. |Ertel 8; Reichenb.
= 67-75 0}
= 7 | Gurten (B.).-....- 46 55 7|25 6 30 | 1854-58-61 | Denzler, Jacky. Ertel 8"; Reichenb.
IE 65-66--76-79 12", Starke 9",
IF 8. Rötl. 0... 47 15 34 | 25 11 33 | 1862-65-67 |Denzler, Kündig, L’Hardy, | Ertel®";Reichenb.12';
75-77 Jacky. Starke 9"; Kern ®".
9 | Chasseral ......... 417 8 4 | 24 43 26 || 1861-65-67 | Denzler, L’Hardy, Lechner, |Ertel 7’ et 8"; Star- | N.
74-76 Pfändler, Jacky. ke9"; Reichenb. 12".
10.) Suchet .. 2... 46 46 25 | 24 750 || 1866-67-78 Gysin, Lechner, Gelpke, |Starke 8" et 9".
| Haller.
j ie Berra .. 2... 46 40 38 | 24 50 55 || 1866-67-76 | Gelpke, Jacky. Ertel 8", Reichenb. &'
iz 79 et. 12. Kirm 8% ni
12 1:DBoler. 02... 46 25 36 | 23 45 50 || 1867-76-77 | Lechner, Gelpke. Starke 8! et 9. N. 193, Fra
13 | Hangendhorn ..... 46 37 51 | 25 50.0 1867 Gelpke. Reichenbach 8".
14 | Hundstock......... 46 55 15 | 26 20 54 || 1865-66-77 |L’Hardy, Stambach. Ertel 8"; Richenb. 8';
: Starke 8: eu 9.
15) Be... 46 46 24 | 26 6 9 | 1865-66-67 | L’Hardy, Gelpke, Pfändler. | Ertel 7" et 8; Rei-
74-75 chend. 8.
16 | Sixmadun......... 46 37 26 | 26 19 42 1865 L'Hardy. Briel ©. N
17 :\ Basodine....... .. 46 24 46 \ 26 759 | 1866-67-76 |L’Hardy, Gelpke, Pfändler. | Reichenb. 8"; Ertel 8”. | N-361, Italie
718 ae
18 | Cramosino .......- 46 21 52 | 26 3028 1865-76 |L’Hardy, Gelpke. Ertel 8”, Starke 8". || N.359, Ttalie
19 | Menone........... 46 729 | 26 48 34 1865-76 id. id. N. 351, Italie
20 | @hiridone........- 46 7128 | 26 18 46 || 1865-72-76 id. % id. N. 350; Ita
= 2] |; Wasenhorn........ 46 16 4 | 25 45 1 || 1870-76-77 | Lechner, Gelpke. Reichen. 8";Starke®'. a
2 22 | Feläbergi. Sch. ...| 4752 31 | 25 40 8 || 1864-74-79 |Denzler, Koppe, Scheibla- | Ertel 8"; Reichenb. || N.31, Pruss
= ner. 12% |
1 23 | Hohentwiel ....... 47 45 58 | 26 29 2 || 1864-75 |Denzler, Jacky. id. Kıiw
24 | Hersberg.......... Ay AO Il 2 03 1864 Denzler. Ertel 8. ; a
25 | Bfändler.... AT 30 31 | 27.20 22 1864 id. id. N. 548, Autı
1 5 | Nave....... 4T 25 59 | 24 38 26 1867-78 Lechner, Gelpke, Haller. |Starke 8" et 9. hi
in 27, Colome.. ...... 45 58 21 | 24 21 19 || 1867-74-77 |Gelpke, Pfändler. Reichenb. 8"; Starke
; 8; Briel 7.
28. Trelod............ 45 41 38 | 23 51 38 || 1867-74-77 \Gelpke, Pfändler, Jacky. Reichenb. 8" et 12"; | N.272, France
Ertel 7".
= 29 | Colombier........- 0 | 23 25 17 | 1867-74-77 id. id.

 

 

 

 

 

 

 

 

 

 

 

 
  

 

 

 

iü
ir
’R

    

mim

  
