 

 

 

 

 

 

 

 

 

 

 

 

 

 

jeprinf-rort49)
LRL GT :T8JOOIN 138T 39 Juan
*pogs jutod ne uotjonpay “ se -lotauel 0881 « à ce à ; s a
608°,8 — ronbisep gortınl “ant 960°0 SIL $6 OF 9¢ onSequodo F ao
-098 quiod ue uorjon pay] ® is oda « « : ; = nt
816°,0 — zonbisop $600 SILOS $y LE UIOBHS §
-098 yurod ne uolyonpay & ¢ 2140790 6] « « : . 3s 4
s1ajay red «099 sl 860°0 689 OL FE PC TATORT 6
-LUO9 ‘uosuyof
HObee © na | AI 4 yo jossag ‘AeTperg| Jyov Yon! uopsurey op juyjtuoz 1n0792$
-098 quiod ne uorjonpoy | Sureempuir oxsuep uo(T oR Sonora GISI ‘SOUUOIPIIHHMNOLO SIN9INEE] Joyawungog * SOT'0 COS LI Se ge Saoquenury |
eee ‘ WAVWANVE
sa}uwıtLiq so]Toga | onqwerdes 40 ufıpuojfeg, Juwuaynarrf on
attqud o1o9ue sed 7s9,N Sep ondojeye) | 4908 goßI owSIId ® aqejorjsy yojed Juepuemwmon | 8600 + GLS 6P 6F 9adrwurr 8
5 | uorpriout
Sa[[OXNIQ op TeAoy | | 9[9109 np o1xju99 'ofoon.p
jr SE TONELIISGO ESP SOTRUUN [99 .P 2110JUA108q0) eG Lh OG} elojwatosqgQ ‘selToxnagy_ J
wm ’ Oo
fée SUIJIUFY pun | : à
. | Toquraydeg | 103517 uoA "urnıgsaruogesseg | ŒADI9 TA
se | re ‘jSu3nY COGI ‘epoy}eIN 109[UL-MOqOIIOF
3 plosdey uoa "aruq
= Jouyootos yoru YOON = ‘dog 60617 | Poy sep YEN dep ul -q-7 Zupuy ‘jorg | 68 8h uss Ww
+ | |
= | | | werd DL er MAURO AO) | ŒHATAVA
| 1oqur)dog ‘MOQ9.L10 FJ -1} 09] 8 J, 2
| ) | snony “U9ZUTISIPYIUIZ- Ploy
2 | 2 6061 ‘u9zuegsipgJtu9z-"pLIo- NZ | saıpuy "undy umdun) “wowyeszwaS 9IT
| ce | “ lune 6061 cc 5 « ce ‘x9u08{ Cll
« | ce lune 6061 ce | « AIVUI9191S ‘yeuxocr FIT
cc | ce Tuu 6061 ce © ce uoyeory “BD1A9SOlL I SLL
| | | | yaraı
| x | 8 ‘dos 8061 © | = | |-1098010paIN ‘Saoqddou XL ZII
| u9qO OLA ‘IJSUI[BSIOAIU() | :
| qonq ‘ueZURISIPYiueZ-"piulapy | Morey
qtorattqnd yyorm Toon | -ayep Jonrplog | ysnsny JOR] ‘doZURISIPyILUIZ-"PLiay-“YUZ, | gojıagg "wydyT | -183s019poın Paaqeouyos [II
|
| mm mm mm |
Saar sıom s9Kopdue | orqrqoad | é :
sanbıewoyy uoryeorgqud ef op OM, sop souuo{our À | SIN9}8A19$ 0) apayıye] SNO!LVALS
SUOLJISOT 39 oouuy yuommazsur 99 epoqpm | arg |
| |
eve
ne Ha ki] ; 4141 lk

 

il à on It

 
 
 

À A au me D ha ah LA din aies pue 1 itt

EE canes, nam hi À
