157

“

3
“
sc
cc

sc

6061 wepsI0g
"606 IHdy sıq go6T [dy
UOA 1107 9Ip any synJ14suT
uoyasıyepoeg "[stuoy sap
S1OJYONG sap sYotoqsaiqer
:09 IN 93[07 ana “Isq

sc

OL6E “(9g 919 06T Sauer
wur [owap ur soynmizy sep
pun oyoyjog Jap Junwurtsagr

"EP IN 9S[0oq onen “"Iasq

SS sy, (ois sei Ute
"99 WINYLOgG-wWsps}og ZU919}
-JIpuesuey] Joep Sunwmuyjseg
"Zunupig 'T uayeqıy ayos
-1J8p0en-Yosimouolsy :Y%
‘IN 98[07 onon ‘saynyıysuf
uayası)epoag oyasıssmorg
-T31uoy sap Zunyarpyuepgo1o A

0109 "N
U9}YOIGOVN syosimouolysy

668 IN
Ud} QoUIoeN Oyosımouolysy

 

 

 

 

cc

€

ce

ce

cc

cc

ce

cc

€

“

sZofeyeyferuou

-epung uonoN
sap wojsig

 

“
cc
cc
cc
ce

cc

des— np
8061
jsn3ny—tane

LO6L

Tue “rane
LO6L

mp “run
FO6L

‚aa FO6T
= 2a Sol

‘HO ‘ds
8061

 

“
“
cc
ce
ce |

“

“

JUONIJSUTT ESS ATU
‘U9ZUUISIPATU9Z-UEIPIIO JU

ce

cc

yuouınıysuluodesseg
“opoygapy 9Y00JeL-MogeLtof

wıowey]}ruez opusdurgf

 

 

cc
ce
ce

cc
cc

“

dapneuyag

AOJOTT "A

cc

ggoaıqıy

youg

PIryoszıemyog

 

L0°0
90°0
80°0
60°0
60°0
OT 0

110

90°0

F70'0

680,0 #

 

9688 88 [LS
eee T¢ 19
FL'9S 9 Te
98 LT LP TS
BEER 08 IS

TOL sé Tg

066 O6 IS

LOF SF GG

TV 0? &F GG

F6 LT G8, 89
SG 87 Is IE

Te sy Te LE
LA ’ o

 

 

9DA9qS19Se1dS [SI
FP9STIS OSL

I 3P93S08CT 6/1
3P9SUUOFX S/I
Saxoquezn' }/I

PISFII 9/1

A uesnuuysosuss QLI

ce

UWINJ}UOUOT TOUS FI

win
-jyoney 19)[8 wunyaogg Ç/I

cc

SIOIYUVIPLI9]Y ‘WISUI4IOX) F/T

assnud

 

 

sonbaeure woe d a sou so fordue orgqegoıd |
F a eaıpgnd 8 op e1}17, sop souu9oAour SIN9}VAIOSqGO ep | SNOILVIS
SUOTJISOT 39 souuy queunisut J9 9pOUJ9 IN Ina |
|
MaNLTIEVT
Lied a Ha au}

umnesannnn ame hi |

 

un om ay fled ai inl ey gn» ih

 

rir!

 
