 

€

Equazion

 

 

 

 

 

 

 

 

 

 

 

 

 

 

 

ee sn ge ee N
| Pace 2e | RE Tee ee ju | ms
a teal ee
In 0—= 0,000 |-+6,36707|-+0,62500|-+0,71429|-+1,25000|+1,11111|4-0,66667-}2,00000| %— = =
IT O= 0,000 | .... |+2,50534) — — L. = = |40,57895, — — |
III Oe! 0000s; anal 4, VE = — — —  |-0,41786| — ey
IV oe —  |43,50000| — — ee = _
v Os OR, — = > AA TPE ee =’ | 00003 — —
VI Ge DO ii = = DL TES oo) gy | 06 — =
VI CaGoooe RL .. e ee A = = — \-43,57576|-10,55493; — —
VIII  |0——0,007 = Cee ee ge a Sl
IX 0= 0,000 i a — = — A + = ne) |
X 0= 0,000 — — — — —_ — — oe = -+2,00909)
SI 0= 0,000 = = ur EN ly td te a a oT |
Nil 0= 0,000 . = = - & af a a x a
XIE  |0— 0,008 a = = a > a = nn a
RIV bee... — eee — = =
XV 0= 0,000 = — ot = _ Le = |
XVI 0= 0,900 Ar ue = = — a ea! iis 2 a |
XVII l0= 0,000 = = an “ = a as Oa a
XVII Oe -+0)000696 0. 3 — _ a sg à a a _ ||
XIX  |0= 0,000 an a a = E pe a en be |
RX Owes. O00 a as a 2 a je a 2 ie io |
EXIM jo -+0,008 6 O- 5 — = à. | =) a = uy
XXIV [O=—5,11832] — — cn lo — = | — a |
Valorı de: coe:ifkrcıent| |
Kl ae a en u m

+-0,49052) — 0,17418|— 0,79022| —0,98282| —0,44233|—0,15343|)—0,30914|+0,22425| — 1,02298|—0,92464| _

 
