 

09 ETE POTTER] UIT Tees |

sitet

ronments

IMP ENED I

Wie h his

A haha

sé EEE TERN
ET TRETEN BITTER gen ni

ne

 

 

 

Stern.

Gr. 2164

8 Ursae min.
8 Bootis

kin

8 Librae

8 Bootis

M —

t Draconis

v Bootis pr.
seq.
+ Coronae

oe eS

6 Bootis

¢ Coronae seq.
« Serpentis
Radel. 3443
Gr. 2296

S Draconis

d Herculis

à Ophiuchi

t Herculis
Gr 2343

n Dracon. seq.
À Ophiuchi

6 Herculis

oi

16 Draconis

¢ Herculis

we
Gr. 2377

x Ophiuchi

e Herculis

e Ursae min.
u Dracon. med.
Gr. 2455

a Herculis

TT —
74
p ne

x nn

ß Draconis

« Ophiuchi

y Draconis pr.
seq.

y —

‘ us
t Herculis
ee ee
£ Draconis
S Herculis
y Draconis

Gr. 2333

3 Urgae min.
b Draconis
a Lyrae

„B- Ar 0, 6372

 

CHEN CHa

Wwo pA

6

2 51

3 SR
ES ee eT

2

3

 

Io
Io

29

5:5
an

pr
Un
©

 

Un Ur OU) DW) DD WN
OPO COOP HO I

D BO Do

fp -
hu pA A =
Un
in

in OD OG
Un + BR
ba
©

RECU
Où
in

Ra»
MM rw
MS
00

 

 

 

= Reet: = kc
um \

2 | ascension
= | |

cdo)

1875.0

r4 48" r 0

+39"
174
14 |+4o
T7
17. |— 8
28 +33
20 EE
9 |+59
26 |+41
18 |t41
52 Ra
24 +27
20 +40
40 |+37

740

27
59 155
33 +58
50 |+45
48 |— 3
59 |+46
41 +55
ı8 [161
31 ee 2
51 —21
4 |+42
14
39,38
37 |+39
56 |+57
45000: 9
30 |+31
+82

SI

45
+40
+14

42
57
+36

42
49
22
25 |+48
+52
& |+12
+55
+55
+46
27
150
137
aE
+42
186
5 |4+58
138

 

 

  

Declination 1875.0

Vierteljahrs-
schrift.

48° 8174

39
3

39
46
48
24
15
ns
46

8
45

49

6

53
15
22
36
29
47
15
45
4I

ae)
9

©

oo
6

14

40
32
3

DAT
23
39
16

2

47

5%
16

30

43
40

IR:
10

3

13%
So,
3%
EO:
‘02
28.
55:
12%
40.
32:

37

12.
57:
48.
LS,
42.
28:
+44
35
49.
45.

SI

49:
39:
20.
Es,
AT
25

22

48.
“718

3

4.

516.
40.

9.
12:
30.
24
42.
34:
6e
14:
2.
20%
43.
6

86

05
13
26
16

58
06
17
on
92

.03

IT
22

SZ
76
13
24

12)

72
14
WI

64.

. 48

#5
12

61
91

92,
39

127

+40
me

=m39

+27
26
+52
+58

+61
+21
+42
+53
+31
9

+82
+54
aie
+36
+46
437

+52
+12

27

nee
+86

+38
+52

 

55
38

55

24

40
45

47
15
43
41

49

14
38

32

27
15

ao
39

aw

30

40

| Gradmessung.

+74° 39° 58743
54
44
70

42.

rs

27.

.56

on
7

"33

279

.o5
EA
.89
.13
+43
.61

47
.93

03
I
33
225

To
44.

 

 

 
 
 

Safford.

Reduction

Viertel-
jahrsschrift
auf Grad-

messung, |messung.

Safford | Safford

f auf
Gea Viertel-
jahrs-
schrift.

  
      
 
      
 

 

 
 

 

+59°

Amer. Ephemer.
+48 34 4.50

33 46 56.20
Amer. Ephemer.
+59 24 16.60
+41 15 37.00
+41 19 28.60
32 46 55.10

+40 45
+37 2

noe | 45
55 6
58, 53
145 05

+46
+55

48’ 10"00

41.70
33230

22
12°
58.
48.

00
70
30
60

36
29

42.
23.

79

20

42 4: 45.00
53,9 210
+31 49 50.00
Amer, Ephemer.

+57 0.20.70
Aa

+54
+40

+36
+ 46
137.
+48
+52

55 16
55 85
ao

“56 53 34.00
-237 16 5.00
Amer. Ephemer.

42.0 350

+58 43 43.50
+38 40 6.30

6 42.20

38 7.
40

79

‚Io

97 430
ZT ‘10
15 120
in: ‚50
23 DO

20
.60
‚Io

oy

30

 

 

+52 4 43.70

 

DL NT DAT TN or hr EE EEE ET

A700 50
+0.84

0.29

—o.4o

32
32
22

.09

‘42

22

—1!26
+0794
0 07
—0.04/—0.44
+o.02 |
—0.02
—0.04
—1.63
— 0.38
—0.13|
IE Osada
0.03 —0.36
$0.05
—0,29
40.58
0.47 —0.38
+0.33
—0.39|—0.48
— 0.57
0.44
+0.23

 

   

 
 

    

 

    
               
     
        
         
       
          
    
     
   
 
    
   
  
   
   
  
  
  
      
  
     
     
 
   
  

 

 
