—— + 1 Ihn men em

Tall Wij | it aT LULU All TEE TY |

PAPE LR À RU LU een

 

 

|
à “pl 6687 0 207% 66 SI 857 FUOWAG
ensuojuog ep “dep | ST 86% | EC LE 87 Sous]
"9889 77647 = 20
Ly w90G6E : SIE)

-UBlf Inova Aossy-oouBUY 99300 [91ION
‘(T06T HAL TX ‘uoney ‘dug ‘sioe8mog “dep | Whey |e ae 97 899-e]-Lossq

-nZuwL1Is9pußT] IoA) Puwwe]Yy TERN!
-OOUBIY JUPWOYIVIZVA NP SUOLZVYS ‘deg ‘stoasinog ‘deg 6687 | GS 7e © 66 C7 Sy QOUCCUY
‘PI we wre yuowspnen
‘pl 0061—6681| 68 06 § | LY GY 8x Aopnig
‘pt % 8S | W SG 87 [99uoM
: ‘PI OF OS | 7 77 87 | ouSiop-er-jruseg
ensuojuog ep ‘deg 67 9 & | FF BG 87 pues

ureineyy “deg

| onduojuo,] ap ‘dep LSB LTR auouy “4g
| "pl 0067 OCZ VG GE 87 | xeS-ans-Ssıorjuom
| pr | 87 0G G | S v7 87 2TITA9SUOTT
: ensuoju0y ep “deg CET Ie VV OS 87 nsseq
“pl b 7% | 6b IE BY JINODUISSEUT)
ureanem du) 86 6S F | LG bY BY smdwog
‘PI SV #7 L | WG 56 87 Sa8no J
"pt S06L | 7G LED | 67 GI 87 uopneaeyg
‘pl GO—106L | 9) SI Db | 87 Ge 87 qsoues} U0]
"pl TO6F 6S 67 9 | 66 CT 87 Au)
‘PI | 97 67 O | G €E 87 vorpdweyg
"sadoosoaatw 9 % ansuojuoy op “deg 1067 ro 0 | GS se SelgyA

€ 18 % soU Jeuunug ysoagig ‘deg
ob SHel nul sajna) >ozuomo, sp den cool ec cc 0 Lo cc. nva/qoure}u0 7

 

 

 

 

‘@orqnd won) (@]eyUeII0 oysed) stieg ep eleT[eIVg np uoNeNSueny apganoN

ey

 

stugg ap
sonbaewoy SYuEWN.AISUJ es anbodg MAP NP) opayner syurod N
-1asq() 18 Sine}eII : San 384) SP UOTJUIpUT
apaysuoT | oes

 

 

: AINHITV LA HONVUA

 
