| bldg seite Loattsnss
ee

klare un

HEHE

 

1 ir! (ll Fat ul tit

FH

il

WOM Pa Wa ELT pe Lid

min

 

 

 

| | Grupos Kreis | Mikrom. Correction wegen Verbes Arithm. Mittel Halbe Diff, | Corr.
| 1891 | und ne An re Dion | der scheinb. der wegen Polhoéhe.
| Paar. | ES Nec | treme. | Sohn. m | Declinationen, | Mikr. Ables. | Refract,
|
5 O I 2644 725 0.8 1.51 6 o ’ 1 1 ” 22 ”
| Ww ee ee ae ae oe 117186 |--21°10' 47773 |--5'36747|4-0-09| 21° 16° 24.29
| O \5.882 4 40 lol 6.6) 5.868
| ‘ Ww Se oe ene 1.8 oe == 71,008 20 14.24 —3 48.85|—0.06 25.33
| 8| W | 7.917 — 3.3|— 0.3 1.9] 7.915
| O 11.164 —11.2+ o.5|+ 1.2]/11.154 de a 2
| |
| TITI 2 | W 17.124 —18.9— 0.8)+ 4.1/17.108
| I —13.6 23 15.41 |—6 .52|—O.12 25.
| O | 3.5241 31.5 0.5 1.2| 3.494 3 a 3 15.4 49.52 ae
| 3 O 13. 414\— 76. 1.0 7 Sine ©
| | W | ne eo 0.34 0.8 a ws 13 20 ws 15,0 os A
| |
| a | W | 1.655|/—17.1/— 0.11 4.1) 1.642
| 0 a 1.2| + ae Hi au au 140
| O | ‘To 61.8 1.110 0. ‚171
| 5 ww Lee ce ae ee oe —13.201 23. 1.29|—6 37.08/—o.11 24.10
| || | | |
6 Ha a Sta a 0 ON EST .78 |
| O eas a a oo . a, a a aa
| iO I 226.111 0.2) r.01r.380 |
| Lee ak vo et 3.674 14 34.04 |+ı 50.52|40.03 24.59
8 | W Ina, nen — 24.3 — 1.3 1.314.107
I — 2004 20 : — .52 —0.08 24%
| O 15.430.235. 0.7, 7 a | al 1:32
Aue 2 | II x | W || 2.057—10.7]— 0.9 + 3.1] 2.048
2 | | | | | = 02 209) 8 “216 6.91 40.1 24.41
| | O ae 2 | 0.55 17.579) 5:5 ee 4
2 | O |r0.9798| 43, 9.7 z 910095,
W pe ee 0.6|+ 0.910.928 al 02.5 ae eee a
W 27.068 8.2) o3 © 00
3 mean Bl ht seine] a6 2s0jo namens | aaa
wlan 02 a ee :
5»! 0 I Sl | 10 47.84 +5 36.23] 40.09 24.16
a CA eee a Ve ee + 7.615 ı2 36.07 +3 49.06/40.07 25,20
| | n A bot | — 7.620 20 14.38 —3 49.21 —0.06 25.107
a, ie om Le ae dite 14 46.58 |+1 37.70|-10.03 24.31
| 7 | le |
| AT | 1 |
DE 5 ee a A 7 a Zn 20 43.79 | —4 18.30 —0.08 BIS An
en 0 124.80
: | a2 ‘ : 5110.
eus) o Moneateotisnan se) sem A
| a | 2 Az or er ue ca + 0.055 16 23.12 40 1.65] 0.00 24.77
| | +362) ; i : : |
| | | le ae 768 |
| 3 i. Be ii or do 15.212) 24 3.04|=—7 37.58|/—0.13 25.33
| | .926 i ; : ; |
| 4! W \|xz,013|—-50.3/—. 0. 54+ 2.311.963 à si sit 6
| — 3.034 I .92 | —I 31.2 0.03 24.63
| | O | 8.995 —66.6 + 0.84 1.9) 8.931 4% | 7,544
| | | |
| 5| O |ı5.5544+ 8.94 0.84 1.515.565 447.18 6 add
| | | es ae „185 10 47.94 +5 36.45|40.09 4-4
| | We 4.353|+27.2 0.6, 0.8| 4.380 |

 

 

 

 

 

 

 

 

 

 

 

 

 

 

 

 

 

 

 

 

 

 

 

 

 

 

 

 

 

 

 

 

 
