297

Erreurs de cloture des triangles desquels ont été mesurés les trois angles.

        

ERREURS ERREURS ERREURS

 

 

 

 

  

& | DE CLOTURE | DE CLOTURE f | DE CLOTURE
2 | DE CHAQUE A | DE CHAQUE : R | DE CHAQUE 5
S TRIANGLE A REMARQUES. | © TRIANGLE A? | REMARQUES | 8 TRIANGLE A® | REMARQUES
a A a
= A A : A
A 2 2.
= I. à | + | — + | =
i Triangulation du Paralléle de Bourges. (Partie Occidentale — Suite.)
! .
IF 45 12" 2 | 148,84 53 oe 61 2520. 104
IE 46 | 2,6 6,76 | 14 8 204, 49 eo 171, 61
IE 47 4,112 1601 Doh 8,5 12,25 64 5 3 | 28,09
ig 48 9 (4 |. 88.36 A 18, 49 65 2.0 10284
ig 49 16,2 | 20224 51 15,7 246, 49 66 | 23 0 529, 00
50 / 3,6 12, 96 58 Dr 4) 12000 10 1 114, 49
fel | 15 7 246, 49 59 17 ;5 | 806,25
Be | 15,5 182, 25 GO| 23,8 33, 64
Triangulation du Parallèle Moyen. (Partie Orientale.)
l 36. 31,36 Go 8\,3 | 68, 89 [li pie 3, 61
7 2 | 515 12, 25 7 10 ,0 | 100,00 [12,20 49, 00
a 3 0.3 0,09 18 10 118 102,01 | 13 9,3| 86,49
= 4 10 ,0 | 100, 00 9 6,0) 49,00 pl st 13, 69
Fo 3 13, 69 10 | 2.4 153, 76 | 15 102 1, 44
iz Triangulation du Paralléle Moyen. (Partie Occidentale.)
7 161 558 33, 64 24 10%, > 106, 09 204 0, 16
17 0% 6 0,36 25 3°. 008 33 0", 6 0, 36
+ 18 2,0 6,25 26 | 4, 41 B41 2 5 6, 25
1 0 2 0, 04 25 32, 49 35 4,41 19 56
20) 115 1, 69 28 6,5) 4% 36 Bog | 32,40
21 3.0 9, 00 29 5211.21 04 37 eo 0,09
2 6 9 47.61 30 3,0) 121 28) 8 1 65, 61
4 25 | 6-6 43, 56 31 3,80 14
Triangulation de Jonction de la Base de Bordeaux au Parallèle Moyen.
l 1", 2 1, 44 Eı 0 38,44 2) 68 46, 24 :
2.1055 110,25 18) 1.0.2 1,44 22 A 5, 29
3), 1 0 1, 00 13 0\,5 0,25 23 |. 7,0 62, 41
49 4 88, 36 11.5.0 25, 00 24, 6,5 42,25
Sen 44, 89 | 90 92, 16 55) 14,2 201, 64
6} 41 16, 81 162,1 So 26 | 6,5 39, 69
1140 24, 01 | 5,8 33, 64 BU rd 54, 76
8 | 12 0 144, 00 18) 0,8 60, 84 28 Bi | 2001
iE 9 10,1 102, O1 ig 219, | 171, 61 20 | 14 A 207, 36
in 10 7,01 49,00 20 Fee 139, 24
ie Triangulation du Parallöle de Rodez. (Partie Orientale.)
= | 69 | 47,61 16, 00 23 | 12,3 151, 29
= 2 85, 72,25 1225 24 8 1, O0!
rf 3 ie 3,24 102, 01 25 a1 9, 61
en 4 30, 521 12% 8 2168, 84 26 24 5, 76
5 10,4 | 108,16 60, 84 27 14 ,3 | 204, 49
6 96. | 92,16 8,4) 70,56 23 9,0 81, 00
7 10 ,0 | 100, 00 3,1 18.09 29 59) 34,8!
8 D 5, 29 6 ou, 21 30 15 2,25
9 10,0 112,50 14) sie al 12.8 163, 84
10) 404 19, 36 9,3 | 86,49 32 6.9 | Ar Gt
11 6,41 40,96 19, 36 33 6,6| 48,56

 

|

 
