-UUVIY SOP SUNJILLUIF 9)195S0QUOA Wapj}tes 9Ip yoınp Isl OOF ‘Ss wodunpuegon 19}184}10)S U9P UL U9][OQU], op ueoqeSuy uop

 

 

 

 

7 C68
6 168
0'138
6 683
F 698
L 698
1'698
1188
9918
8028

798
088
618
698
798
&L8
638
«33
088
848
8,8
188
606
O16
906
LL6
806
606
668
068
£68
668
868
968
068
068

188086

wo

  

(A)
911O9UT,

NBIATUSIL99 PA un

 

9 106
0688
0'688
1'768
6 098
8 698
18483
& 768
6988
1268
O1S8
TSL8
7 998
(OA)
PSS
STHS
sel8
nes
9 7&8
3 118
9'908
9 968
VPLS
L'FTG
9° 606
Fre6
9 786
& 0C6
& 906
GhQSS
L488
6 9L8
6 618
SETS
& 898
& 698

9'F8"086

TU)

  

\dungysegoag

Lop yoru

WRAY TOMI

 

Goo 6 C6. ae
Bo 6 =
08. + de Ar
Sl ie SER
Ge Oe =
(eae É0
90 = Ol
on GO ir
96 + JB.
AC ale ld
De Al
08 = Gres
Val = =
OS = Gil aus
VGC == 6G
008 — Os
oe Of
OSG == Se
Ogi == C7
OG = Id
099 — 00
00 — Va
00% = OC
08 + Coe
Op + pot
0eL + Ce
Out at Niet
OE LT +
Ost + er
OF — po
OO = O1 —
OL = 9[—
Vor == GE
Va ee
CC = CC
016 — Mo
UV = FF —
tu | eT Wo
Ere = 6
UOA | un!
auqeuu y | SNOT
orun |e
on 1084
UN Suni0}s
un 0
JU9IU9S |-218MU9S |
apua.o)s
oroopr |

oa = ss = — a

HO oO >

ie
NBOATU
SITOI "zZ

9 68
5 SG
& GL
6 LG
76°
8°66
199
Tr
VVE
VCS
8°68
O'FOT
678
6 88
VV
SVL
6 $9
S IF
OLY
SIV
09,
29
GEIL
O'6L
8%
T'SL
OLS
C'LOT
9'GPI
6 68
06

Q

A 20 20 ©

g—0T wo

4e à
H¢ 8

  

 

stq

14019 ‘P

Sunysızuy

   

 

A N
DODDODOAh— CO wm
Am RN

MH CO OÙ L- 10 G

© CO Hi
P19 WOO

FHARSSOor,

© 2O > D 1 © © D m
M1919 © — HH

THAN NN

s-01 Wo

+

H '9808000'0
uoryynpau

“uso

 

 

FINNROTIOTOCOLRREDNOM HO SR
ROOOMmOOONN A1 IN © © © © DO © m

meme
Ye

x

AN CS
SEX

SHAHRHOSSoo—S

Novo AO

10 10 B= © op
eee)

uOt}HU PO]

‘180407,

 

 

V9 ATUSO 199 JN sep jue uwolyynpayy

 

 

BQ 19 19 1E 19 2D 10 19 19 19 19 10 19 19 10 19 19 10 10 10 Yes}
NOIR Da na

za aa a a a aa

Se Mie a ey Se on

aQaaoaaıa

10 10 20 b= P= m

 

  

6

9YVBYGIIGo
PIX n
NBIATT
-S9.199 [iT
UOTOSIMZ
ayoryog
tap

arti |

 

|

0° GPS FP PSsl
e'cps 6 Gael =
L'888 O'SFeT =
F SPL 6 OLFL =
T 908 PLESL .
8208 BSSSL x
2'861, 9 6°8T =
ggg) 6 SPL x
L66L 9°S98T 2
7'828 l'ESGT _
Fog) LLS8t =
Loo. C'e60T _
8'809 6 SILI _
ggg) G'&6gL =
Sch RAR >
sec) S'OLFI S
8 cel 9'IFCI S
6 SPL FOGPT a
628 S'TAPI .
9° 66h 9 18ST x
LE‘) OLFSL =
@PS9 P 6rOL =
008) NS 'g
80,8 9°69TL <
& 698 Sell <
7888 F'6EIL ®
0'188 Serll =
G'T98 YE6LL &
PLL G'OLOT 2
O'T£9 S'OGLT =
Ve G'LGGT =
6 SIL TS9st =
LUPL T'96FI =
C'IPL SPOSL x
1192 LESFTL =
819, 6 SFL s
T'60/ S'8CPT ‘H
0'286 81180 ‘q
0'386 6° LL80 q
0'286‘086| 861,80 8080 H
wo Ss
b
WBIyIaMyoS oem &
“SSUNSUIM TOS S
a
=
Ss
91e]498q09

re ess

€

 

 

 

 

NUE HSE

leqnuese

 

  
  

 

 

 

rain

 

GG LS SP
6S 8S 8g
CY 66 FE
9% 1887
Ss CG PS
LT 68 08 LE
S= SS T 48
976% SV 9¢
GP Zr
5888 O8 Fr L
88 86
0897 610
F UP $96
GT Le mon
GL PS 6 98
6 68 CT PS
88 0G 8098
Se In 9 67
6197 CL 8g 8
SP 6& G6 OL
68 F CG
7 67 GF 81
88 6S LP F9 6
v8 PV Lie Me
OF I GS PS
G 6S LS
3 85 Sir 89 97
9F 64 1808
LG SS 988% L
LS IS 71%
VSS LY G1
69 GF 0G
87 98 oe
ac 8488
ié 1G GG 9F 8
9 IS 970
EG Liz IR 0
680 Pr Fe
680 DP PS
G0 69 ey
° aS)
®
(+
oyro1g UIIAU99IT)

159 Bury

ayostydussoox

 

 

 

opte
‘JSutpoq SJXUNATINN-uaJeutpI00 Joey
uauomIsog Ueyospeid008 sop zuorepiq 21 (°

usjueg
TS
wes uer[yoG
[Oza yr
[oseq
ES EHENOURST
usguryorg
neu} poy,

a ee
uouraIg
Sınquajnejuopy
soout}poJ,
pPuwayosusyoor]
LUE REA
u9Suoqueuorz
u97J9}saT
uoduıyosopery
[OTA Woy oR,
TL9ZFTOpEY
ZUB}SUOM
perjsuommy
Sıoquoätprerr
YOITYSso Ay
TE)
yousiarg
[LOAN O1IEG GQ
Do} oIssn Fy
‘g ‘Tr Sinqroagy
(ePLeH) Pursumenog
JOYSIOq ploy
‘MU9S ‘1 JPEJSNON
uodupjorT
wosuryosonwuog
WOSUISTOL)
uesug
4289036
"§ “8 Uayvyssrmapny
SIMUOSUIOF ayostuyoay,
SUNISTIEY
2INU98U00H eyostuyoay,
oynispley
‘SPAD-SSTUURS ‘To ‘D TION
Synısp1ey

uonreIg

a es a a he

 

 

 

cc

cc

cc

“

cc

cc

cc

cc

cc

20

€

“

<

ce

cc

ce

“

cc

cc

€

ce

6061

cc

cc

cc

cc

ce

ce

cc

ce

“

cc

“

L68T
SO6L
S061

L68T

   

a |

cree ae when

 
