 

 

  
  

 

 

Mukowonshi

 
 

320E
MD Chipala

Chereüili

  
  

 

 

 

    

  

 

|
|
| Vanbe

 

| GET N co

| Msengızdle ?

Lavaıst

 

Mabyıulo—)

\
2
an

%

    
  

—Q Mtsense

13°

 

2 S Kweshi
Ch fikunyaQ -
. MHachechett €
1508
hakwe

KaurashishiC

 

 
 

 

  
  

 

 

}

 

2 Q

  

 

 

 

 
   
   

Nyan al

 

  

Zumbo Mt.

eira Flagstaff
VAT, Boundary Toy B K

 

10 5

 

30 40 so 60 zo so
==

 

—— ee F E =

 

Scale. English Miles .

PLAN

OF THE

GEODETIC SURVEY OF N. E.RHODESJA.

State of the work in July 7906 .

Primary Irtangulation.

Secondary Iriangılation.
© Astronomical Latitude Stations.
© »

  

99 Miles

  
  

16°

Jatitude and Aximuth Stalions.

  
