 

 

 

   

 

Su

Erreurs de clôture des triangles desquels ont été mesurés les trois angles. (*) _

ee ee Ge ee

 

 

 

 

 

 

 

 

 

 

 

 

 

 

 

 

 

 

| ERREURS ERREURS 2 a
an a DE CLÔTURE B DE CLÔTURE
a a DE 2 DE ;
m © CHAQUE Ae REMARQUES © CHAQUE A2 REMARQUES
= EA TRIANGLE A TRIANGLE
St zZ A Zz A

+) — ; ! | =
[ ” 5 A1-A26- Geodätische Ar- v
@ | 00 v SS beiten. Heft II. oy Die Verbin! = 0 2 ln
= 2 1 ’ 088 1, 1837 dung der Basis bei Christiania 56 0 ‚269 0, 0724
G : a I an I au voice 2 E,09] 5 1, 0630
N = oaas-Kolsaas. : 0 ,89 0, 8010
5 5 | 0 ‚537 0 3102 50 | 0,456 0, 2079
à 2 60 | 0 ‚298 0, 0888
r 7 0,212 | 0,0449 61 0,4 | 0.2808
01.8 _ | 0,076 | 00 62 | 0 ‚266 0, 0708
= 9) 0.20 0, 0882 63 0 ,174 | -0, 0303
2:0 0,579 | 0,3352 64 1 ,357.| 18474
i 10.09 0, 0253 65 1,667 | 208
# 12/ 0,068 0, 0046 66 0,948 | 0,8987
= 30758 0, 5700 67 | 1 , 722 2, 9653
1 2 ’ u 2 2
E14 1,722 | 2,9653 68 es, 1, 6564
4 , 9
É 15 0,069 | 0, 0048 69 0,59 0, 1518
E 16 1,262 | 1,5926 70 0,917 | 0,8409
= 17 0 ,590 | 0,3481 71 0,692 |. 04180
u =: 1 ‚224 | 1,4982 72 0,653 | 0,4264
wy +, 19) 1.470 2, 1874 : 73 j|.ieeı waa
ee.» 0,310 | 0,0961 74 | O , 939 0, 8780
ig 21 0 361 |< 0, 1303 75 0,697 | 0,4858
2g 22 ar 2, 913 76 0,253 | 0,0552
< 23 0 ,927 | 0,8593 file os 0, 0156
.g 24 2,437 | 5,9390 78 1 ‚305 ) 1,7080 '
JS = 85 0 ,301 | 0, 0906 79 1,088, ilies
Si 26 0,916 | 0,8391 80 0,711 | 0,5055
© le 97 276 | -0, 0762 | et eo 1, 3225
co 28 |: 0 , 600 0, 360 u 2 0 ,106 | 0,0112
GA 29 | 0 170 0,0289 | dee 0 10 | van
ie = 30, 0,154 6, 0237 arskallen. 84 i 0,916 | 0,8391
6 = 31 0,199 | 0,039 85 | 0 ,476 0, 2266
6 ae 321 0,60 0, 4802 86 | 0 ‚824 0, 6790
Ce 33 | 0 340 0, 1156 87 0,525 | 0,2756
e 2 3240,38 0, 1102 88 | 0 , 868 0, 7534
En 35 0,162] 0,0262 89 0 ,060 | 0,0036
€ 36 0,466 | 0,2172 90 | 6 , 032 0, 0011 L
g 37 0,1601 005 91 | 1,865 3, 4782
€ 38 1,227 | 1,5055 a 0 318 | Otol
€ = 39 7.0485: 1.0020 93 | 0 ‚655 0, 4290
A 40 | 1.163 1, 3526 94 0,737 | 60,5482
h 41 0 , 952 0, 9063 91 1,82 3, 3966 .A95-A127-HeftIV.— Das
hoe 42) 1,008 3, 2328 96 0,495) 02450 DOTAEGRS AA SAS
RUE: 4 1 ‚360 | 1,8496 1.9 l, 67 | 2350
N 44 | 0 ,098 0, 0096 98 0,330 | 0,1089
À 45 1,475 | 2,1756 99 | 0,523 0, 2735
N 46 | 1 , 262 1,5926 100 0,699 | 0,4886
47 0,014 | 0,0002 101 | 1 ‚602 2, 5664
48 | 1 ,985 3, 9402 102 1,674 | 2, 8023
49 0,229 | 0,0524 103 2,286 | 5,2258
3 50 | 1 ,555 2, 4180 104 1,599 | 2,5568
; 51 1,186 | 1,4066 105 | 0 ,987 0, 9742
i 52 0 64 0370 106 2 651 | T0
[5 0 ,282 | 0,0795 107 2 ,036 | 4, 1453
a = 54) 1,094 1, 1968 108 1,037 | 1,0754
i

(*) Ces données, étant arrivées en retard, on les a ajoutées a la suite du Rapport.

ya nbahhliämbd IN LHÜNDEN. BMI Tinladlan y ıhlesiı an
a NORE OM HU OR

À

Al Ik)

 
