35

Norwegen.

(Siehe Karte im Generalbericht 1877.)
Tee om

 

 

 

 

 

 

 

 

 

 

nn Indication des : | = Boner || . Directeur |
N2 Latitude. ee Epoque. . .
Points. | } «tudes: ae et Observateurs. u |
| ere |58°54’ 3" 28°40'40" |
— 2) Torbjérushjcer . . 58 59 43 |28 27 14 | |
e° 8} Vagnarberg ....|59 1 54 | 28 48 50 | |
4 | Dragonkollen ...159 5 53 |28 58 29 | = |
Motor | 59 10 30 [28 5 59 | > |
6|Tverteraas...... |59 13 11 [28 39 34 | à |
7 | Vatervarde. . . .. 59.29. 1 1,2830 14 | = |
8 Glejnaas . . „=. 59 37831 28 531 | ee
9 | Skibergfjeld .| 59 34 42 | 27 38 29 | © |
10 | Fonskunden ....|59 40 12 |27 11 38 | 5 |
me oaas. =. | 59 49 20 |28 19 19 ©
12 | Kolsaas . . . . . . . | 59 55 42 |98 11 29 | Ex
3 Hankaas : 2: ; .: | 59 53 43-128 34 49 | =
14) Christiania... . . |59 54 44 | 28 23 24 =
(Observatoire) | | =
ia | Nasodtangen . . . .| 59 52 13 |28 19 39 | oa À
14b | Husbergo . .. ... | 59 51 42 |28 23 12 | =
Re Base A. .. .... |59 53 45 |28 26 29 | EA a
fa Base B. ...... | 59 51 49 |28 28 24 8, 2
LL 15 | Gjeviekol . . . . .. | 59 53 32 | 27 51 29 ss ao
ip 17 /Opkuven ...... 160 5 21 |28 11 33 | Be oS |
416) Gansta . . ..... 50 51 12 | 26 19 14 | s Ce À
18 | Hégervarde . | 60 17.3% | 26 54 44 mo à 2 . à
19 | Këjkors . . . . . . |60 39 0 2816 4 | = aod eo
20 | Hostbjorkamp .. . 60 53 20 | 28 39 44 | 2 E48 Sm 5
Bi Spalind... .... 61 4 32 |97 24 12 = a oe oe |
IE 22) Neverfjeld . . . | |61 11 28 |28 12 12 | 2 a8 a
Is Kvlen... .....:: 61 33 25 |28 12 34 | = ce 232
ES Bouden......., (61 56 38 |27 34 19 | À SNA nor
RON. ee 62 10 21 | 28 22 44 | 225 Due |
26 | Knudsho ...... 62 18: 23 | 27 21 31 | a Tee |
biens. 62 22-56 | 27 47 44 Br Ses |
28: Sisselhö >... 62.31.58 27.23 14 ad Sag |
= 29 | Sveergsjohô . . . .| 62 38 30 28 2 4 as Sen
30 | Hogkittelen . . ... 62 56 4 |28 11 49 | oe eae. |
sl iigelfjeld . -. 62 56 45 | 27 36 44 | 3 BE
152 Vastfjeld-...... 63 15 47 |28 144 | = Han |
| 33|Klevfjeld ..... .|63 92 45 | 98 47 34 | =
= 34|Gräkallen ..... 63 25 16 |27 55.84 | a
22 35 | Hestgrovhej . . . .| 63 31 33 |27 21 9 | = x
1786 |Munken ....... 63 34 5 |27 58 56 | ©
= 87 | Haarskallen . .. .| 63 39 5/29 11 9 =
88 | Kvinfjeld...... 63 44 41 |29 18 7 2 |
À 38a | Baglan . .. .... 63 46 15 | 29 10 22 A |
es; | Skanes ..:;.... 63 46 58 29 A176, a |
| Base A. ...... 63 45 45 |29 6 38 S |
D 384 | Base B. . ..... 63 47 38 129 718. = |
Æ 58e | Nordberghong . . .| 63 48 38 |29 8 1] & |
5 ssr| Oklanhong ..... 63 49 43 |29 18 14 | a |
| ssg|Kverkilberg ... .|63 50 58/29 1 46)
— 39) Stokvola . . . . . .|63 35 27 |28 44 14 | |
h :40 | Follahô . ...... 63 59 23 | 98 43 49 | |

 

 

 

 

 

pe

A Ga à à be à

Rein A A AW Ai um
OL OEE RE RTT BETTE TT FRA TOUTE

 
