 

PHRIODE DE 1885 A 1838

MIRES A COM

LA TEMPERATURE ET DE L’ETAT HYGROMETRIQUE.

MONTRANT LES VARIATIONS METRIQUES DE PENSATION

AVEC LES VARIATIONS CORRE

DIAGRAMME

LONGUEUR ‚v-Arr&s LES ETALonNAcEs , DE
SPONDANTES DE

Planche I

 

 

 

    

 

   
 

  
  
 
 

 

 
  
 
 

 

 

 

 

 

 

 

  

 

 

 

 

 

 

 

 

 

 

 

 

 

 

 

 

 

 

 

 

 

 

 

 

 

 

 

   

 

 

 

 

 

 

 

 

 

 

 

 

 

 

 

 

 

 

 

 

 

 

 

 

 

 

 

 

 

 

 

 

  

 

 

 

 

 

 

 

 

 

 

 

 

 

 

 

 

 

 

 

 

 

 

 

 

 

 

 

 

 

 

 

 

 

 

 

 

 

 

 

 

 

 

 

 

 

 

  

 

 

 

 

 

 

 

 

 

 

 

 

 

 

 

 

 

 

 

 

 

 

 

 

 

 

 

 

 

 

 

 

 

en ANWEES ANNEES | aunEes
7 { r I T | | TeeseRt 7 n I —— 1 | ! | TI -—— I! Term —
Go 1885 | 1886 | 1881 | \ 1888 | | SE on | 1895 1858 Yzüm@83T 1es6 | 1881 | 1888 | 1889 ] 1890 | 1891 [1892 | 1893 | 189% | 1896 hass] I a \1835 | 1896 | [sr [1838 |
| | | | |) fe & 3m ——— I
3 = See I re ee. | | Varıations | „ | Be]
Variations |: | | = | a \2 1 0 |
r E a = Seren Varıations | de ! |
ee: Se ee de || lonqueur 0|
!onqueur IE Se || J |
I | 0 MIRES ) longueur | MIRES gt | |
es Se nee | N°s25 et26 \ \ N
NSS5 et 6 | | Etat || lure <
) || ne |
\ Lempcrature {hygr om! |
= 4 ' ee ee = [ =
ale Varıations | | |
z Zum — | de I en |
are : | lonquewr | a \
longueur | EB L ) longueur ( 0
MIRES 2 u A222 un
\ I os N / sc
NDS 7&t 8 0° 0 |
1 emperature Temperature
en | En
er | er
En - f Tadım ES
2 . Vaxatons \ 2 em
u longuem 1 | Ma
MIRES MIRES 0 on
N°S9 et10 ) N0S.23 et 4 59° 0.15 S MIRES longueur
T t 28 0.70 | N°S31et32
emperature nn | ar Ten
} a Temperature De al n an
15 | 0.60 Hygrom T* =
10 0.55
7m m 3 0.50 = = + =
an ee Ze | |
N 3 wa = = Re = = 3 = == = ] ee am ——
nes ach LE IGENDR EcH E I: ‚ES Bean e oe
air a ze een __ Variation de longueur d de la mire impaire. ee, longueur (0
NoS1ler12 ee, Abscisses : 10" Im par anne. | miRES |
. Lila ! 70 = age — — 1 20.95,
Temperature s 0.65 Iygeomt® | 2 dt pälte. Ordonnees N°533 et 34 ii 9 Ss 9. ol Etat
ji I mpenatine. an | lemperalure ) . = Hyarom 1%
| | | | | | = os ._ | Sl Variations de longueur : W’n pour mm 0 fois la gıa ndnaturell). | ae - I | \ .e son
_188h| 1885 | 1886 | 1887 | 1888 | 1889 a eo. ln Sn IE Eat hygrometrique. Temperature: ‚8°. pour 10° centigrades. \ 1895 | 1896 1891 | 1898 | a
FR _ ANNEES a a an Fat ygromötnque hy pour 0,10. l ANWEES zz |

 

 

 

 

mp. @ Goury. Farıs

 
