    

 

 

 

 

 
  
 
  
 
   
 
  
 
 
 
  
 
  
   
 
 
 
 
   
 
 
  
 
 
  
  
 
   
 
  
 
  
 
 
 

 

 

 

 

 

 

 

 

 

 

ee ne AOMBEN ERREURS
AUTEURS DES INSTRUMENTS NOMBRE DES OBSERVATIONS DE OLÔTURE
moe A EN 2 5
EMPLOYÉS DES EXÉCUTÉES DE
HD.” ee VERNIERS ‘POUR CHAQUE A? REMARQUES
DIAMÈTRE DU CERCLE on OU DES CHAQUE ANGLE ee
HORIZONTAL ne MICROSCOPES OU POUR
CHAQUE DIRECTION = | =
Directions. :
en 3 feet. Bb: 0. Microscope. 3 Bae bl 2.20 9,80 12, 200
id. aN: S. id. 5 Whe
| Ramsden, 18 inch. Al 3 18. \ 3,51 12, 320
( Ramsden, 3 feet. B. 0. id. 3 3.25
| id. BB: 40; id. 3 D De 4 6, 0618 | 3,03. 12, 461
“He. BC? id. 3 13132 18.20 92.15| 23,54 122552
Al F8, 0. id. 3 15. 16 = >
a ns id. 5 a a
id.’ B. 0. id. s AA 12.13 5 ne
Al RS id. 5 19.31 oo nn)
id. B. 0. id. 3 = IAs n ST D JAE
Ä id. RS id. 5 acs Eel eee
( Ramsden, 18 inch. id. 3 18.10 20.27 > 06
on and Simms, 2 feet. id. > 10.12 0
 Ramsden, 18 inch. id. 3 Ce 15 (3 65 13. 322
Ramsden, 3 feet. R. Ss. ee 5 1278 2 ;
id. RS id. 5 940 41. 8
Toduchion and Simms, 2 feet. id. 5 7.10 a 13, 200
: Ramsden, 3 feet. R.S. id. 5 40, 17 46.26
a | Ad. Bo id. 3 os zn
422 | nes id. > Bo. id. 3 1237 7% 9 17. 9 | 3.608 13, 542
an B. O. id. 3 ae 13,616 | Trapezium.
44 Ramsden, 18 inch. id. 3 16/16. 26,24 2225 | 3.60 13, 616
Ramsden, Seer. BO. id. 3 V5. dle 2 14 : 5
| Ramsden, 18 inch. id. 3 18. 10 3,70 eo
Ramsden, 3 feet. B. 0. ida 5, 10. 14 Seley 3°71 | 13.764
at and Simms, 2 feet. id. 3 16. 16 : ?
a en, Steet: B. Or > id. 3 6. 9 - a TR,
id. ks id 5 28.13 15.2 | oe
a no id. 3 12.5 3.
Ramsden, 18 inch. id. 3 19.23 | SL
amsden, 3 feet. B. 0. id. 3 B76 5138-2. 6 | 3,416 | 14,138
amsden, is: meh, > id. 9 A]
roughton and Simms, 2 feet. id. 5 13: 20 | 3. 76.) 14,138
amsden, 3 feet. B. 0. id. 3 2215 >
ad: R. 8, id. 5 040 (3, 14.213
: and Simms, 2 feet. id. 5 24. 13 2 ue
amsden, 3 feet. B. 0. : id. 5 42 0212289
amsden, 18 inch. id. 3 28105 3,77 | 14215
amsden, 3 feet. B. 0. id. >» lé) Girls 00 8 | 3,78 | 14,288
cn id. = O. id. 3: Bes ole Ol 2106 3,79 | 14,364
1 S. id. D 10. 40 A? :
(Rare, au EB. 2 feet. id. 5 5.18 | 0 1890
amsden, 3 feet. B. O. id. 3 Io. 16. 22.18
id. 5 25.19 31.16 a
vn es B.0. ee id. 3 | 7.20 | le
roughton and Simms, eet. id. D On 746
Ramsden, 18 inch. id. 8 2,4 20.3 | 3,84 >.
| Ramsden, i teet. D. 0. id. 3 3. 5.38.28: 10,4 | 3588 15, 054
a à s id. ; nn ©. de 3 Sl 16° 5 24.82 3,92 | 15, 366
', hamsden, 15 Inch. id. Sn 24.20 22.11 >
i Ramsden, 3 feet. B. 0. id. 3 By | ae es

  

 

 

 

 

Lids Mba aedes dad ad

ae
A
