nation au 1° Janvier 1906,

 

 

 

    
 

 

 

 

 

 

 

 

ı reperes. — Preeision des resultats.
2 N Discordance
Nombre des reperes e
| Erreur aceidentelle moyenne systömatique
| Ne 2ao® uadratique resultant moyenne par \
erees de 1903 & 1906 exclus || existant au ler janvier 1906 385 q a ee eh Observatıons ‘
a8 en “
I ne] ee | < 22 2.2 dena | entzerl-aller’ ot
r x | © d fi " 'AaQ
Reperes Reperes | Nombre ‚| Reperes | Reperes | Nombre 23 Be ermetures comparaison de 18 :
elerordre | de 2e ordre | total \\de ler ordre | de 2eordre | total | ” = | des polygones Dee ehe e retour
n ED SIE Ta gRıf70E RC TETIRGERASGEREFRTUEN IF ENTEIERTRGUCHTNNGREN RENTEN AEEHETSTAETEETE TEE ERR TEE TONETREREETRTETNETNT TER NEENSETTERTT ANETTE "
l || km my + Mm + "mn
| ı
77 984 361 || 351 455 806 au ” 0,9 5 (1) Pays dont le ques-
120 6.2 1200|, 681 2,400 3,0831 | 1,4 1,0 0,5 > tionnaire n’est pas
300 143 1,043 | 568 1,232 1,800 0,2 » 0,6 5 rentre. |
= & 3 111 1,090 2010 713 1,4 a 4,0 1,0 & 5,0 & (2) Outre 235 km de
wi. n 652 652, 10 2 20 . nivellement de r&vi-
. | 409 2,305 2,714| 30 5 ; . sion
“© | Wo Nasa... 12,840) 135 1,59 0,39 0,47 (3) Operations doubles,
4,000 = 4,000 16,500 A 16,500 0,7 1,25 0,67 0,007 mais de m&me sens.
| | R
\ 4 2 1720 4 1,720) 16 4 2,4 ki
% = : 213 1,600 1,813 1 » IE) % (4) Operations executees
314 as 962 || 3,814 10,941 14,755, 1,4 1,82 1,2 (°) 0,57 en 1902. &
> = a) 626 1,487 2,113 n = ; a (8) un. poste-
3 es 1,000(°) 1,400 2,400 » ’ 5 h vieures & ;
E19 524 647 1,583 12,424 14,007 0,9 a den (6) Rep£res souterrains.
I “ n 30,000 15,000 | 45,000) 0,6 1,50 0,78 \
F° | 3,40 231
F |
IE» 5 N 23 | %19g | 2215| 09 1,0
j |) | » » ”» » »
Bu | ala, | 7514 800 8314| 08 1 1,4 2,2 Ä
30 | 18 48 167 71 2338| 43 5 2.3 :
A x 461 432 8983| 2,8 0,5 05 i
, . ; 500 DA | aa on » 2 . .
» 878 “ 878 1b) @) (A) (a (7) Les erreurs ne sont
oe 601 | 2,101 2,101 | 12,7 s la 1,0 2... saloulds,
| | compris sie ‚
» > Sl 342 342| 18,8 » ? ? russe.
- ‚ r 2/4410 os | ges 38 4,4 224 1,37
nl 425 6 | 391 2505 |. 6.490, N 1,08 0,85 0,85 r
: |
: |
& | ;
2 23% 508 740 || 715 1,837 2552| 0,7 0,8 0,3 \
= |
| I
ao 594 614 || 1,397 12,181 | 13,528| 20 1,4 (19) “ 0,6 (10) (9) Operations röpetdes
50 5 50 7,399 , 71,399 2,0 2,71 5 1,13 deux fois. ;
| (10) Nombre calcul& par
| le Rapporteur. '
— |)
131 x 131 || 398 a 3922| 3,4 n 1,78 “ aı on repe-
| | | tees deux fols.
3,011 201 | 8,900 | 8300| 3,6 Fo 07219 0,03 & 0,74
14 . 14 14 al 22 0,27 0,03
\
S \ 3700 3,700| 0,8 A {
12,298 || 96,287 |” 99,157 | 206,787
i 11,343

 

 

 

 
