 

Numeros
des

triangles

 

102

Erreurs de
i fermetur
Sommets des triangles ermeture

 

 

+

Carrés des
erreurs de
fermeture

 

 

 

 

Figure 8.

m

[44 Bueran, 45 Yausai, 46 Namurelte, 47 Cuenca, 48 Soldados,
49 Borma, 52 Tinajillas].

 

 

 

 

 

 

 

 

 

 

 

 

[80] 49 Borma, 45 Yausai, 44 Bueran. 7,618 | 58,033924
[81] 46 Namurelte, 49 Borma, 44 Bueran. 0,265 0,070225
[82] 46 Namurelte, 45 Yausai, 44 Bueran. 1,900 3,610000
[83] 49 Borma, 45 Yausai, 46 Namurelte. 9,783 | 95,707089
[84] 47 Cuenca, 45 Yausai, 46 Namurelte. 5,994 35,928036
[85] 47 Cuenca, 49 Borma, 45 Yausai. 10,801 | 116,661601
[86] 47 Cuenca, 49 Borma, 46 Namurelte. 4,976 24,760576
[87] | 52 Tinajillas, 49 Borma, 46 Namurelte. 3,461 11,978521
[88] 48 Soldados, 52 'Tinajillas, 46 Namurelte. 5,356 28,686736
[89] | 48 Soldados, 49 Borma, 46 Namurelte. 9,232 85,229824
[90] 52 Tinajillas, 49 Borma, 48 Soldados. 11,127 | 123,810129
Triangle [91].
| |
[91] | 50 Minas, 52 Tinajillas, 48 Soldados. | | 7,400 | 54,760000
| |
Figure 9.
[50 Minas, 51 Narihuiña, 52 Tinajillas, 54 Chilla Cocha, 55 Fierro Ureu].

[92] | 55 Fierro Ureu, 52 Tinajillas, 50 Minas. | | 2,074 | 4301476
[93] 54 Chilla Cocba, 52 Tinajillas, 50 Minas. | 0,047 0,002209
[94] 51 Narihuina, 55 Fierro Ureu, 50 Minas. 0,073 | 0,005329
[95] | 51 Narihuifia, 54 Chilla Cocha, 50 Minas. 2,488 | 6,190144
[96] 54 Chilla Cocha, 55 Fierro Urcu, 50 Minas. 3,810 14,516100
[97] 55 Fierro Urcu, 52 Tinajillas, 54 Chilla Cocha. 1,783 3,179089
[98] 54 Chilla Cocha, 55 Fierro Urcu, 51 Narihuina. 6,225 38,750625

Sen = : a SEES [Pe

10):
[54 Chilla Cocha, 55 Fierro Urcu, 56 Guachanama, 57 Colambo].

[99] 56 Guachanama, 55 Fierro Urcu, 54 Chilla Cocha. 3,866 | 14,945956
[100] 57 Colambo, 55 Fierro Urcu, 56 Guachanama. 0,248 % VO,
[101] 57 Colambo 55 Fierro Urcu 54 Chilla Cocha. 1 1,545
[102] 56 Guachanama, 57 Colambo, 54 Chilla Cocha | 5,357 | 28,697449

 

 

 

 
