 

u

Polarcoordinaten wie sie aus den Beobachtungen in Verbindung mit den Dreiecks-
ketten gefunden werden.

 

coon eh de 45h be hi à +3 Ré du id ds dd

Station Berlin, Sternwarte, Centrum des Heliometer.

 

 

 

 

 

: p = 52° 30'16/,68 (17", 22).
| | Entfernungen

4 Name der Punkte. Azimuthe. } ;

i Log. in Toisen.

| 0 ! i |

| Nordpunkt ....::... © : 01. 0,000

| Min. Bl. 27, DIDI6 5,5011348 . 4 317055,167

| Konisebersiit - ... . A. 50455. 4782 5,4345773 . 0 272005,261

| Tyme... |. 62 31 15,582 5,3643847 . 0 231411,373

| Kopéthagenté ...: . «. 351 46 55,433 5,2633275 . 9 183369,708

q Mom... aC. 297 59 3,278 5,1233535 . 65 132847,555

| Station Trunz, Dreieckspunkt.

g = 54° 13’ 111,466.

'

| Neripnukt .......- 0 0 0,000

h Don. 20, 8 16,031 5,0012822 . 2 100295,678

| Kömsehene ... ..--.- rt 30232 4,6296286 . O 42621,487
Bd. |. 247 26 56,501 5,3643847 . O 931411,373

: Kopenhagen... . .. 292 51 36,093 5,3859048 . 3 243167,110

|
Station Königsberg, Sternwarte.
Centrum des Passageninstruments.
| gp == 54° 42! 50",50.
| Nordpnnkt ........ 0 0 0,000 |
N; Meme nah ©. 1... 18 28 44,819 4,7867802 . 4 61204,061
Rom ee. 228 56 52338 4,6296286 .0 42621,487 |
| Belin a 245 16 16,636 5,4345773 .0 272005,261
Kopenhagen ....... 285 16 24,280 54219401 . 4 264204,456

Station Memel, Steinpfeiler.

: p — 55° 43' 40" 446.

| Nora. Li. . 0 0 0,000

1 Konigabere ....... 198 58 15,301 4,7867802 . 4 61204,061

| M Le. 211 24 59,040 5,0012822 . 2 100295,678

| Por en ir. 287, 41,141 474 5,5011348 . 4 317055,167

: Kopenhagen... un 812,05 „51,745 5,4385426 . 3 274500,178

 
