 

amd BL rast
NP PTT LL YY

prey

WT

PTE TOR TT TT

Western 2.22

 
 

aM! Grant
N° |.
ES
aM! Woodhouse B25
a Black Hill
vw
F2 a Bal
N à
N
N /B24
i AN N)
N i
\ BG \ ee /
Dooleena 4—:—:—:—:—;,A4:T Taloa Peak j
! LA | Re ni
| 4 —45 Mile Hill
| A \ |
| ve \ |
I: N |
Wa N :
Marble Bar =. N |
fi Ser . 1
x a N i
= MF Edgar
N
| NS
| ~
| S
| N
[
G222

  
   

624 >
4G2/
NE.
DL Morangup
In a
N / a
N 7 a
NS Vi > a
N i SS
/ =.
S i >: MF Bakewell
N 4 „2
N / Be ai.
pe Ne À | ~
Rottnest I. WK. 7 \Gungin We. |
4 \ 4 | \
a : | |
nn \ 4
= i Se | N
a \ | N County Peak
+ à \ We | a or Quajabin
a. nn
SS we
D — +
Mt Randall TBTT.

Pf Robert

Scale 20 miles = l inch

University Press Cambridge
Y ¢

SE EE Se RS A ER TE RRR AEE TARE SR a SR RR SE SE SRS RR RS Se een ern TT

 
