‘yS0[95Ula Neu ossou
osseg seJyung sep Y7e1suy -

a

sonbaewmeoy]

 

‘LOE OP G 49 & sou

‘d OF op ¢

eu 94187S
«
«
«
«
«
«
«
«
‘PI
‘d 8 OP 61G où
A9 UE "n 9Y181S
«
«
«
«
«

«
«

«
‘d g op LIE ou
«
ao) oe u
ap, peu

‘d OF 9p G ou
‘d OF 9p & où ‘PI

«

‘d QF Op £ ou oyarıg

SYuU9WN.AISUJ

 

S9Ipu y

«
«
«
«
«
«
«
«
«

108911)

«
«
«
«
«

«
«

«
«
«
ZIEMUIS
Jieuos
ZIBMUIS ‘JICUISQ
J18u9S
«
«
ZIEMUIS

SANOYVA
-19SqQ) 39 SiN979941(T

 

L061
VO6)
140927
LO6T
LO6h
TO6T
1067
7067
1067
YO6r
F06Fr

6687
6687
6687
6681
6687

L68V
LOST

LOST
L681
7681
7681
7681
7687
7687
7681
S681
C681

enbody

 

 

 

 

 

 

G 66 7e 1 GP Ge Gr UISJ910N | 099
88 54 SG | 76 66 % yoyrueg | 6C9
VE PL 66 | SY OS 97 ULB[YIS | 8C9
6 36. 32 7° 9 uoryspunwarg | LC9
Gb 17 SG | £ 96 97 UHEMUIOH | 9G9
67 8686 5 07% ‘dg aodturunez | Ccg9
9 06 86 | SC TE 9 jessnaneg | 7C9
SS 67 88 | C7 O7 97 yolzunsıy seyoy | ecg
G 11 8% | 08 se 97 ydoyassuung | ZC9
66 Sb 83 | 8¥ OF 97 US}, |. C9
87 S6 80 | cc er OF epuBls BIZelg | 069
LY 8S GY | 6& TE 67 MOINBI, | 679
str S7 | IS & 67 Bor, BsXT | S79
7” 01 87 | 11 65 67 ıyufpeuss | 179
6 6 &7 | LY 96 97 ‘HS ewes, | 979
81 9 Sr | &% 8G 67 ‘O ‘N ewe, | org
jodouuey, op ose
VG LY OF | SY 9 BF I N ew.aeL | 779
em OF | 86S BF ‘O'S ema, | E79
ABLWUIBZS op 9SUT
I IE OR ere sr Asoy svyey | G79
LG VY OF | 86 8 87 ASoy eyeyaq | 179
% 8G 8S | 98 0G 97 sony | 219
G 1G Se | ey ry oF neygussos | 919
GE 86 6 | TS GF OF seAdoy | c19
96 VP 6 | 8F SS OY svag | 719
C7 07 6€ | &S FY GY EINSON | £T9
SY ST 6€ | GY OE GF SLUUEAS | S19
06 SG 88 | LY 6S FY JS ou] PIT9
„03 Sa se | LEO ay Son) SU], 279
© ZAOYOSLI AA sp OSB
0118, Op
uarpLıow | |
np 999dıuon | SPAFIET squiod sep uoryearpuf | oN
SpnyLauoT |

 

anxieties, name hi |

 

HISONOH-HHDIALNV

J ict dl ada Aa

 

PE IL

lb tort

ak nik

a

Liu Dede lll dnted

 

30

 
