 

   

230

ängendifferenz

 

Land Stationen. Différence de longit.
Pays Stations. in Zeit.
_en temps.
Russland. 3 Palkéwa— a 21 2961
Pulkowa—Abo 32 12.24
Pulkowa—Lowisa . 16 24.48
Pulkowa—Wiborg . 6 23.84
Helsingfors und Stockholm .
| 5, Pulkowa—Wien u
ı Pulkowa— Warschau . — |
| Warschau— Wien . 2 |
Sachsen. | Berlin— Leipzig. 4m 0589 | +
| Leipzig—Gotha . 6 43.48 | +
| Leipzig— Wien (Sternwarte) 15 57.66 | +
| Leipzig—Dablitz (Prag) . 8. LATE
| Leipzig—Gôttingen 341.97
‚ Leipzig— Mannheim 15 43.48 | =
Leipzig—Brocken . 1.8.59
Leipzig— Breslau — |
Leipzig—Bonn . ee
Leipzig-- München . erg
Leipzig—Freiberg . —
| Leipzig—Dresden . 5 22.00
| Leipzig—Jauernik . _
| Leipzig—Grossenhain . 4 39.10
| Leipzig— Wien (Türkenschanze) . — |
Schweden. | Stockholm— RE — |
| Stockholm—Helsingfors . 5 20 084 ae
Schweiz. 1; Genéve— Neuchatel 3™ 125966 |
| |
| |
2 Neuchätel— Zürich . 022867 +
| 3 Neuchätel— Righi 662528
4 Zürich— Righi 0 15.839
5 Neuchatel — “Weissenstein 2 13.088 | +
6 Neuchätel—Berne . 1 55.806 +
7, Neuchätel— Simplon 4
8 Neuchätel—Milan . 8
9 Milan— Simplon 4
10), Zürich— Gaebris —
Zürich--Pfaender = |
Spanien. =

 

 

 

 

24 35.14 | 0.021

 

|
|

 

à
a
=

 

Beobachter

Observateurs.

Krüger, Järnefelt und Fuss
desgl.
desgl.
desgl.

Fuss, Nyren .

| Sawitzki, Anton

dieselben.
dieselben.

| Bruhns, Förster .

| Bruhns, Auwers .

Bruhns, Weiss

desgl.
| Valentiner, Albrecht

Albrecht, Löw
Albrecht, Löw, Richter

Seeliger, Weinek
Bruhns, Engelmann

desgl.
desgl.

ı Seeliger, Weinek
v. Steeb, Weinek

 

 

16.824 | +0.016 |
56.062 | + 0.016 |
39.238 | + 0.013 |

Lindhagen, Pr, Fearnley .
| Fuss, Nyren : ot

+0:014 | Plantamour, Hirsch

|

3| Hirsch, Wolf.

| Hirsch, Plantamour

+ 0.019 | Wolf, Plantamour

| Hirsch, Plantamour
desgl.
desel.
Hirsch, Schmidt, Celoria .
Celoria, Plantamour
| Wolf, Plantamour
| | Wolf, Oppolzer

 
