:
ji
h

 

DD) >

V. — Espagne.

 

 

 

 

 

N° Ben LATITUDE LONGITUDE| EPOQUE INST y . |
. DES POINTS u | | 2 ET OBSERVATEURS RUTEENIE Bu BONN |
| | |
Jonction des iles Bal6ares au Continent. (Suite.) \
289 | Torellas...........| 39048! 24"| 20°27' 55" 1867-83 Col. du gönie Ibähez,comm. Theod.de Brunner5, |
d’E.-M. L. Puigcerver et | et Cerele de Brun-
eap. d’art. Bellön. Ne 8% |
2% | San Salvador...... 39 27 17 | 2051 25 | 1867-84 | Col. du genie Ibänez, cap. id. |
d’art. Bellön. |
>29) | Cohreta:.. ... 3983 |20 3535 1883 Comm. d’E.-M. L. Puigcer- | Cercle de Brunner 3. |
| ver et cap. d’art. Bellön. |
292 an 1867 | Col. du genie Ibädez. The&od, de Brunner. |

an

|

bush har

 
