SRE

ESTs

CHEZ EEE

SOT LIS ST

Sagen

ee
D:
i
j
(aa
i
,
t
|
|

 

za a a = m m m a er a Eng En ERS

 

 

 

 

 

 

 

+
1
|
!

Remarques. |

40
Oesterreich.
D EE PP ER EE TE IE DEL IEEE SELES I IO EEE EE SEITE LDL IE
Ng Indication des | Latitude. Houst Epoque. os Instrument.
Points. | tude. : et Observateurs.
92 mon... -.... 42%50% 6. 85231862 1870—71 Hartl. Starke 8.
NOS ROGO ......:.. 42 46 12 | 35 36 36 1870 Gyurkovich. ‘Starke 1.
194|S. Andrae .:... 42 38 48 35 37 0 1870—71 id. id.
195 | Ostra glavica . . . 42 41 12 | 35 46 12 | 1870—71 id. id.
196 | Snieznica . . . . . . 42 34 80 36 1 6| 1870 id. | id. |
197 Onion. ........ 42 34 12 | 36 12 36 | 1869 ROG: ‘Reichenbach 2.
198|Hin vrch...... 42530 0,36 3 12 1869 | id. | id.
199 | Pa. d’Ostro | 40 04 0 3611 6| 1869—71 | Pott. id.
| Gyurkovich. IStarke I.
200 ÉLoveen . . : . . . . 42 23 54 186 29 6 1869 Pott. Reichenbach 2.)
201 Strlmia ..- .... 42 15 54 | 86 35 30 1869—71 Zerschwitz, ‘Starke 1. I
Hartl. Starke 3. |
202 Rumia. ....... 49 612 36 5118| 1869 Zerschwitz. Starke 1.
203 | MUNUR. :.. .... 41 58 36 36 52 42 id. id.
204|Tarabos ...... a2 254 537 6 42 | id. id. |
205 | Gruda grischi . . .| 42 9 42 37 10 12 Ganahl. Inst. Univ. de 10!
| pouces d Starke.|
Hartl. Starke 3. |
205a | Base de Scutari . 42 6 12 37 11 0 Ganahl. Inst. Univ. de)
Terme Ouest Starke de 10”.
205) | Base de Scutari . 42 6 30 | 87 13 12 id. id.
Terme Est
206 Jubany ....... 42 1 54 | 87 15 30 Zerschwitz. Starke 1.
207 | Malirenzit . . . .. 41 51 48 137 9 54 Pott. Reichenbach 1.
208|Musil -.. : :... 41 33 18 |37 10 48 id. Reichenbach 2.
Hartl. Starke 3.
209 | Durazzo ...... Al 19 54 137 5 24 Sterneck. Inst.Univ.d,10"
| Pott. Reichenbach 2.
210. Barzes |: . : . . . . 41 18 48 | 37 19 36 Sterneck. Inst.Univ.d 10”.
211 | Malibitscherit . . .| 41 724 |37 10 6 | Kalmar. Reichenbach 2.
2192 | Maliblinz . . . . .. A 6 6 720% id, id. |
213 | Gurigomares . . . .| 40 54 18 | 37 14 30 id. id.
214 | Kodrakamores . . .| 40 50 48 37 25 48 Pott. |Theod. d’Ertel
de 9”,
215 |Semeny....... 40 47 0 37 1 54 | Sterneck. IInst.Univ.d.10”.
216 | Licovum ...... 40 39 48 | 37 11 36 1869 Kalmar. (Reichenbach 2,
217 Sasen0 ....... 40 29 48 | 36 57 30 | 1869—70—73 | Sterneck, Inst. Univ. de
Starke.
Pott, Reichenbach 1.
Steffan. Starke 3.
218 | Linguetta . . . . .. 40 22 42 387 1 48 1870 Pott. ‚Reichenbach 1.
193 Elias .....:. 40 13 50 | 37 11 30 1869 —70 id. Théod. d'Ertel
de 9”.
‘Reichenbach 1.
PDU RANO ......... 39 50 86 137 3 12 1873 Sterneck. Starke 4.
291 | Salvatore . . ... 39 44 49 | 37 82 24 1870—73 Por Reichenbach 1.
Steffan. Starke 5.
a el .:.. .. 39 41 6 | 87 22 42 1870—73 id. | id.
298 | Mte. Giorgio... .| 39 36 6 | 37 27 18 1873 Sterneck. Starke 4.
RA VOL ........ 39 27 12 | 37 35 54 1873 | id. | id.
295 | Cemerka . ..... 49 19 54 136 5 54 1875 —76 |
226  Chmelova...... 49 4.30 |85 49 18 1875—76
227 | Lopenik. . : . . .. 48 55 6 |35 26 54 1875
228 INoVeo ...:. . . 48 46 36 | 35 42 30 1878
229 Bra0l0 ....;..: 48 40 48 | 35 18 48 1879
20 PZODOr . . . : . : . . 48 20 48 | 35 46 30 1878 |
231 | Magoshegy . . . .. 47 34 41 | 35 19 36 1878 |
202 Gerecs ....... 4740 54 386 912 1878 |
233 | Kortvelies ..... 4729 24 |86 7 6 1878 |
234 | Meleghegy . . ... 47 15 36 | 36 25 48 |
235 | Johannisberg. .. .|47 31 6 |36 37 36 1879 |

 

 

 

 

 

 
