 

       

 

— 297 —

X. — Norvege.

ee :

 

 

 

 

 

 

 

 

 

 

 

 

 

 

 

 

 

N® mel, LATITUDE |LONGITUDE | EPOQUE De \ ENT .
DES POINTS 4 : QUE on INSTRUMENTS an
\ | | |
1. Veten u... 592. 10,322, 282 551.
2. Lveteraas®........ 9.13 22 28 3224 2
3 | Vaaler Varde...... 3329 128350 5 5 |
4 | Skibergfjeld ...... 59 34 52 2738 19 ra |
5 | @leinaas.......... Do a7 3 38 14 > = |
6 | Yonsknuten ....... 940 121 2% 17 29 S
= Roaas 2.020 59 49 21 | 28 19 10 2
8. Gausta °... 5991 220 19 6 5
9 | Husbersö ......... 59 51 43 | 2823 4 z
10. | Base 2, oa 19 2828 7 S
+ 11 | Nasodtangen ...... » 52 2 2819 33 DB
ee 12 | Gjevlekollen ...... 2533232 275 22 22
iE 18. Base A... 90,53, 49, 128 2021 Se 2
| 14 | Christiania (Obserrat.).| 59 54 44 | 28 23 15 SH ; =
i la |eKolsaas 95942 238 118 an mi
16 | Opkuven.......... 60 522,28 U 24 ns
| 17 | Högevarde........ 60 7417 27 39 Is 8 = S
E18  Höfkons 0 —_ 60 29 0 | 28 16 33 388 as
k 19 | Höstbjörkampen...| 60 53 20 | 28 39 39 325 ne
| 20 | Spaatmd... . ..  . 6 25 2 22 Sen
# 21 | Neverfjeld........ 2A Bin ma a.
22 | Kuien...:.... . 61 3325 2812 24 es aan 5
23 Ronden.... 5: 50 38 | 27 34 12 SO sE93 2 SS
Allen: 20 ar . En
25 | Kuudshö..... .... 62 18 22 02721 21 a an 5 = 2
Sen Banana, 5. a PEE
2 27 , Sisselho ...... . 62 3:56 22317 3 mE mo.
E 28 | Svergsjöhö ....... 02 3829 23 154 2 = > 23933
= ..29 | Högkitielen.. 6256 3 | 28 11 40 E29 I.
= Solace 62 56 43 | 27 36 33 282 223
sl  Vastjeld ..... 03 10.49, 028 194 & 2° 353
= 32 | Klevfjeld ......... 6322 43 | 28 AUT 2A an Ss
= 33 | Graakallen........ 032515 225519 en ea 2
= 34 | Hestgrovhei....... 655 7 2172, 9 33 HHS
35.1 Munken 0334 5 12758147 a8 Be
: s6| Stokrela. ..... 0385 25 | 28 424 5 a
e 37 | Haarskallen....... 03 59 5 29 10 58 E
38 Krinfjeld ......... 63 44 40 | 29 17 59 <&
39 | Base A,Rindenleret. 63 45 45 29 6 27 a
40: | Baslan 0... 63 49 15 | 29 70210 x
z al. Skaanes 634633294193 3
3 42 | Base B,Rindenleret. | 63 47 38|29 7 7 3
43 | Nordberghoug..... 63 48 39 | 29 751 +
44 | Okulhoug......... 63 AA, 2919 3 Ss
45 | Kverkilberg....... & 50 58:29 1 87 S |
46. ; Bollak6.... 2... 63 5921| 2843 39 2
Koster en Suöde...| 58 54 4 | 28 40 30 =
Vagnarberg, id....) 59 155 | 28 48 42
Dragonkollen, id... | 59 5 53 | 28 58 20 a
47. Hervola. ........ 63.53 31. 29 38 59 Sn
48 | Sienskavlen....... 64 16 48 | 2845 5 en
49 | Gjetfjeld.......... 64 24 52 295259 a.
50. Gallen  _ 64 40 . 2 s 3 S
5 | Kyitgeld 64 50 © & . ii en
52 | Lekötind.......... 65 442 | 29 16 56 2 a ee
i 53 | Bredvastind......:| 65 23 51 | 30 36 13 = & Horde > u
a 54 Vestmd . 69.37 31 29 3228 a : Se
= 565.) Finkneel....... 65 45 27 | 30 28 18 a so 208
: 56 | Brurskanken...... 6547 9 | 31 10 5 328238
E57 Oklind 65 59 56 | 31 55 30 Eee
58. | Dontind....... > 66 315120 60% i ee

 

MI PIE ET IRDTANAUR IHN

M*

 
