 

 

96

LONGITUDE

   

 

Bonn Centre de l'Oh-
servatoire.

 

 

 

 

 

   
 
   
  

 

 

 

 

 

 

DIFF. DE |
STATION. = ae E : OBSERVATEUR. Instruments employ&
srreur JU,
mm probable.
one Ss S
36 Berlin. Centre de la | + 53 34,905 | + 0,018 |! Becker, Nahlik, Küh- A Berlin, cercle mé
grande coupole. À nert. dien. sep
Greenwich. Cercle mé- A Greenwich, instr,
ridien. ment des passages de
Repsold.
37 Berlin Centre de Ta Voir
grande coupole. Autriche 45,
Vienne (Bast. des Turcs). 1 |
5 ae 7
38 Berlin. Centre de l'Ob- Voir [|
servatoire. France 29. i@
Paris. Méridien de Cas- |
sini. Er
| 89 Berlin. Centre de l'Ob- Voir |
servatoire. France 30. | |
Paris (Montsouris). 1
| 40 Berlin. Centre de ’Ob- | + 25 11,603 | # 0,007 | Albrecht, Low, Richter. | Instruments des passa: :
_servatoire. ges de Pistor et Mar} |
Bonn. Centre de l’Ob- tins. '
servatoire.
Al Bonn. Centre de l'Ob- Voir
servatoire. France 31. 4
| Paris. Méridien de Cas- I
| sini. |
42 Bonn. Centre de l’Ob- Voir I
| servatoire. France 32, I
| Paris (Montsouris). |
| |
| 43 Berlin. Centre de l'Ob- | + 13 48,505 | E 0,008 » Instruments des past! |
ser valoire. ges à lunette brisée. & |
Altona. Cercle mérid. |
44 Altona. Cercle mérid. | + 8 14,411 | + 0,006 » »
Helgoland. Point géo-
desique. I
x | ne |
45 Altona. Cercle mérid. | + 11 23,025 | + 0,008 > » I

 

 

 
