 

 

 

— 158 —

VIL."* — Grande Bretagne (Inde).

OT REP SEP IE ER DETTE CIN

 
 
 

 

 

 

 

 

yo) INDICATION | or DIRECTEURS |
N DES POINTS | & | |LONGITUDE EPOQUE ET OBSERVATEURS INSTRUMENTS | » REMARQUES
.24 | Upäskata ......... 210.0 27780229284 1866 Shelverton. Ns Oi So Bole
econ DBAS 0... 20, 50.43 80.21 25 1866 id. id.
26 | Bhimsain ......... 20,57 36 11946 7 1866 id. | id.
27 | Partäbgarh ......! 20 47 44 | 80: 5 52 1866 id. id.
28 | Säthbaini........:ı 20 31 59 | 79 34 4 1866 id. id.
29 | Parasgäon ........ 20 82 19-1 80 15 1866 i id. |
s0  Ramli :.. ...... 20 1255 | 7944 48 1866 To > id. |
ol Ampaisarh - ... 20 15 43 | 79 19: 7 1866 id. id. |
2 thekar . . ...! 20. 17 3% | 801647 1867 id. | id. |
DD DEA 2 66 o 19.49 33 | 79 32 28 1867 id. id. |
34 ICRO 2... ..ı 19/46 54 } 70 57 29 1867 id, id.
Bo zAnkora.. ...... ,. 1972435 7936 27 1867 id. id.
20 8onda 7... ... 19987 22 192) 5 1867 id. id.

- 87 | Poläm Rajul....... 19 3016 80 349 1867 id. id. 1
58 RADAR. 0. 191239 1791919 1867 id. | ide i
130 ThiIera 1914 50.79.54 1 1867 id. | Id I

A)  hechnl............ 197951.) 7923 423 1867 id. | id. |
4 Bbuepaili......... 1904 7.7941 56| 1867 1d. | id. i
42 | Timäpuram........ 118 0746 | 79 23 53 1867 id. id. I

434 Sirkonda......... [8.58 30 1 80 4 28 | 1867 id. | id. |
Rämgir (Bider Lon- | - |
el Series) |. “18 35 26 | 79 31 42 1867 id. id. |
Partabgiri (Bider | | |
Bone], series)... 183819 | 80 0 20 1667 1 id. | id. |

 

 

 

 

 

 

 

 

Bilaspur Meridional.

 

 

 

 

 

Chamki (Calcutta | : |
Eonel. Series)... .| 23034 102) 81238 157 1869 Keelan. Skauchs24 m] |
Murergarh (Calcut- |
ta Longl. Series)..| 23 35 35 | 81 57 47 1869 id. id. |
1 +Mahora........... 23 24 25 | 81 49 45 | 1869 id. id. |
2, Bhulma 250... 23.13.00 | 81. 39 32 1870 id. id. |
3 Bhamnaı.......... 2 10 21212 0 1870 id. id.
4, Dhanras.......... 23 11 37 | 81.50 49 1870 id. id. |
Dee. 00... 55 2629| 32 24 1870 id. id. I
6 | Bähmangarh ...... 22 52 26 | 81 46 39 1870 id. id. |
7 | Dugidei. .......... 28 24/8228 10 1870 id. id.
8 | Bahmanai......... 22 20, 7 1.822 2 11 1870 id. id. |
O | Gidhaur= 6... .... 22 158 | 89222 2 1870 id. id. |
10 | Chitairgarh.......| 22 30 12.) 82 16 29 1870 0; | id. |
1 | Manguru.......... 22 34 59 | 8229 5 1870 id, id. |
1251 Dalea........22..:. 221% 31,02 130 1871 id. id. |
15 eK by ee aes ere Pe NS 23 1482 32213 1871 id. id. |
14 | Gathaura.......... 22.334 | 82 15. 13 1871 id. id. |
16 Bodhi 242.0. 2... 22022 824 6 26 1871 id. id. i
16 Rote... ...... 22 2313 22038 1871 id. id. |
17 VKanéni 7... 2166 1582 12 16 1871 id. id.
18 | Konargarh........ 2 5932 201 1871 id. | id.
19 | Pathäidi.......... 21 48 46 | 82 16 46 1871 id. id,
20 bBhikalı.......... 2125 43 82 8 3 1871 id. id.

2] | Dongä Kharod ....| 21 50 16 | 82 26 1 1871 id. id, |
22. Bamın............ 21 42 36 | 82 10 25 1871 id. id. |
23. Bardha. ........., 2 395 3219 9 1871-72 id. | id.

24 | Charkädi.......... 223 60 212.9 1872 id. id.
25, Galas 6. VA 17823 6 1872 id. id.
25, Sihehät..........: 21 2316 82 17 36 1872 id. id.
27. Jarwa ........ 212045 8159 32 1872 id. id. |
28. ,Chapora.......... 2 lo lo | 82 14 2). 1872 | id. | id. |

 

 

 

 

 

 

 

PI PTT TPS NE ENT ENT RS

dim huis.

aa mA de a Mad A bd aan um ns
