 

 

 

 

 

 

INSTRUMENTS.

 

 

 

Roumanie.
= INDICATION > DIRECTEURS
N° LATITUDE. | LONGITUDE. EPOQUE.
DES POINTS. | ET OBSERVATEURS.
|
| [ : Eee

ive) Jevoarele. . ... - | 47° 26'53"| 45° 18'55!' | | Se \

Carpiti . : . .... | 47 16 50 | 45 16 23 | SR
u N 147 2449 |45 619 | 525
NSE ...%.2... 47 10 30 | 45 15 40 = \ A LS
Bar n : 47 1435 | 445210( © ST |
192 | Pietrosita . - . .. 47 25 26 | 44.42 40 | | Ba
123 | Ringhilesti. 45 37 36 | 44 53 42 | aa |
194 | Cineinlea. . .. .. | 47 39 8 | 45 10 12, D }
1723 Copaläu........ | 47 37 241 44 82 33 \ \ \
196 | Tomesti. . .. .. . | 47 48 29 | 442998 | | oe |
127 | Borolea. . . 47 55 47.| 44 41 55 | os
D Hodron....:.. | 48 5 54 | 44 34 56 en 2s
129 | Vorniceni ..... | 47 58 45 | 4494 5/7 a 38
130 | Darabani. . . . . . | 48 11 44 |-44 17 19 | = | se |
fot Innen ......|48 341.44 193 AS |
132 | Cerbicesti . . . . . | 47 46 55 | 44 9 11 | =

 

 

 

4. Théodolites de

Starke et Käm-

merer.
9 Cercles azimu-

Théodolite

de Starke
et Kämmerer.

taux de Brun-

ner.

 

|
|
| REMARQUES.

 

 

 

 

 
