   

LES NIVELLEMENTS DE PRECISION
| dans la Russie d Europe ef d Asie

33 Om» Deppo

= 4 REZ LR

88 Q 23 Ome Peppo
3 S Sr SS SIR DEE ma SES - 55, < = SERIE SS —
= ¥

I. Mpuroswenie kr ucruereniso nosepxnocemu Poccu

 

 

 

LE ST PRIE

LIKE NN
à N AA

we‘

 

 

at Besa,» 2
j

?

 

{
”

»
rv \
Wartu ho)
4
\ x

“Ul

 

N
A ’ - ; ‘ ’ À 63 \ gu Arm \
Ge A / A - 6 IE % 4 > À. à 4 ‘i Ay} x gu y : x

Nunera

 

 

En \y \
NS \

Te Fe az

\
\ s

‘ Br À

i LUN S
% \

À,

 

ky

Ku

 

- :
20" wo el
at zsurı

®Peaodidns

or

 

 

 

Si),
a Se) uk
is) CR,

 

 

 

Vile ZL WIE Z BE ET, 7 ze DIN 1
| 25 Oma Ny.ıkosa 40
Ben Ser = ey Se bee *

 

 

 

 
     
   

 

 

 
 
 

AS 8 A 4 N . ° ao x it | 105 Ome Iytkooa
Es : = ee un —_ 2-9

QE de pri oe OR oe

 

fo om Dun

H\ gr
omen as deux directions | Les nivellenents efTeclües mms JS deux direchtons | Les nivellements effeclües

== mms Qars une direction Jusgu'a' 1906. mm (0/7725 une director | en 1906- 1907- 1906.

 

 
