 

bi dd hdi dt

core edad tlh at

80

I ee en en,

Messungen und wurde denselben das doppelte Gewicht beigelegt. Die 14 Polygone
führen zu der gleichen Zahl von Widersprüchen, nämlich:

 

w, =h —h — iu) = — 9.84™
a», th, — hb, — + 15.82
| =) +h, - 369870 —.— 2.4
| 7) = 7, +h, — hb, — 33.81100 = — 8.16
a, nn du + 320510 — — 22.76
| or =h, — yy — h, = — 4.04
Fh tO, — Ing = + 0.85
| a. dd + in + 4.65200 — + 0.79
| Ww, = h, — iy, Mm = + 1.76
eh, 4h, — 7.03840 = — 1.33
| MM hy; 1 hs a hs À hs ae hy, ale Io, 2 hs = — 9.43
| Vn = h, ie h, Te he À h,, + hn Si hy, ae hy. A he, Ber Por ne hog IE = 2.61
| is = Dan My, — Ing Ay = — 9.20
| Ce da + ln — — 28.58
| a Man erhält jetzt folgende 14 Normalgleichungen: i
oa 50. 10.8 &, — 9.84 = 0
no... GAL, + 23.2 b — 149 &, + 15.82 = 0
B30 + 242 b, — 2.44 = 0
Go) D DE — 10.6 &, — 23.0 1, — 8.16 — 0
eG = i, D 25 & + 129 &, — 8.1%, — 22.76 — 0
an, ti he, Alu + Abi, — 4.14 = 0
eG, Su 28, HF I15 430.408 = 0
| Pe 75,5. D 009 — 95k, + 40%, + 0.79.= 0
oe ea, 21s, + 47, + 1.76 = 0
mots + 88k, 4+ 193%, — 133 — 0

| 93... 205 Alm 4125, + 360%, — 40h, 9.43 — 0
708% 30 —316, + 45%, + 3.04 —40k, + 19.24, — 223%, + 2.61 —0
D À 10, — 17.9 &, —,.0.25 = 0

ion, + 515 2, — 28.58 — 0

Die Werthe der % ergeben sich hieraus, wie folgt:

k, = + 0.4075 k = — 0.5634 k, = + 0.9065 |
ky = + 0.1341 k, = — 0.8979 k, — + 0.6562
k, = — 0.0276 k, = — 1.8863 k. = + 0.3365

+ 0.6349

k, = + 0.8843 k, = — 1.2721 bos
| k, = + 1.6639 k,, = — 0.7361

   
