 

 

389

 

 

 

 

 

 

 

 

 

 

 

 

 

 

NOMS DES PAYS NOMS | LONGUEURS | ERREURS DESIGNATION
DESIGNATION DE LA BASE CALCULEES ET Mn :
& Rz xu| ERREURS _

ET ANNEE DE LA MESURE REDUITES AU NIVE Q -
SIMPLE OU DOUBLE OBSERVATEURS DE TA MER ErABIVES APPAREILS DES BASES EMPLOYES
ITALIE (Suite).

6. Base d’Udine. Cap® Maggia, 3918,57855 + 0,00216 | Appareil du systeme Bessel.
1872 deut Sum. |
. » Giletta, 1 501 000
Mesur6e deux fois. > Buceı,
Ing" Cloza.
m m a
7. Base du Tessin Cap° Maggia, 9999,53801 2 »
nd mma. Lieut! Pavese,
eo Ing" Garbolino, 3.2380 000
(Lombardie). Space.
1878.
Mesuree deux fois.
e m m :
8. Base d’Ozieri. Major Magseia. 3402,22868 + 0,00181 »
Jor Mass
(Sardaigne). Cap®s Mirabello, a L
1879 te 1877 000
; Lieut! Pavese,
Mesurse deux fois. Ing! Derchi.
m m
9. Base de Piombino. 41621,50746 + 0,00485 >
1

1895.

Mesuree deux fois.

PRUSSE.
Base de Strehlen.
(Silesie).
1879.

Mesuree deux fois.

Base de Berlin.
1880.

Mesuree deux fois.

Base de Bonn.
1892.

Mesuree deux fois.

 

Institut
g6odesique.

»

m
2762,58917

m
2336,39239

m
2512,96955

 

952000.

 

|

1.000 000

Ei.

)

/

‘

mm

de)
1

1 000.000

 

 

Appareil prussien de Brunner

 

 

 

 

 

 

a Male di uld ul

ak ı mil

I uno ine

1.1. hin hs u u

Mh a rn 1

 
