ann mme nn Mens se Le De : ensure ul re
eee meer meme ere nm ann mann nn SEE —

 

 

 

 

 

 

 

-uomwmousguR YGT = eyouppunty Jop snipey fy oyof AoAyefoı ur ggg UOA oddnyZıog oyosıpoqeaug (7
‘(ut 2°96 prey yoru OTOYUrIeIIAT,) YOIp W VG Os[e Fyargospım Suepogpig Wop toqn eyoy{T W gg Ul WInYyy, Wout june 43917 ylossunyyoeqoog 19( (T
8 re +  wegsÄs IOUOTA Jue LONYyNpey opToeUIy |
TE |.SE , + | V8L'IS6 | 698 . IN8PT'T86 | 568186 “| 0 | Fa6'086 || OT6 | 88 OT S1S0G | °° 17 | SMB WoYasemJoH sep
| | | ol “ToseB Ea ‘oquis oem Aaaleoanr - pusfyosjnogq &
Ov ot | UF + | GIT'186 | OLSI ‘ | ea1'186 set‘osß | 0 | 6g1‘086 || 29 | D) 8008 |: "yosos pag, MU ‘UUOF 8
000 — | 8100 — | 800°186 | 0481 PPEIALY 111686086 | L66°086 | @lo | 626°086 || € LSB | 86869 Je: "auos ‘moquuerg I
“LHOHUTTY I088J017 UNO yoınp uodunssem ‘7A À
F = F — wojskg IOU9IA| JNB UOIJANPOY 9JIOUEUIL)

. : | |
9¢ + | 9a + | 097186 | OL8T 3 || et9‘te6 | ore‘tse | | o | cos‘ts6 | 6G | 08 08 S'BPRA SE, |.0 Le Gree Osea ‘810qs$tu0Y Le
bg + | Fo + | 098186 | 6981 = FIv'1g6 | L'Is6 | © | 0 | LOF I86 | 1 996 878 et RS UE ANS SORA " puepgosjno(

| | | 235 ‘ortoqpiez ‘JUMUIIIS “euoiTy | g
ee + | 6l “+ | 698186 | 6987 | “td “M “AO || 880186 | 262186 | © | O | 088186 || 98 Ve ET | g‘0g 89 + | vommgs,Tossag “orLwauegg “UITTOET 8
980°0 + | F80°0 + | 526626 | SI8T | “10 feunoN L80‘086 | 680‘086 | (s°3)| 0 | 880086 || SI GS PPT | 6‘6P 18 — | bie a 2 UOTE le 810). |
: | | | U9N9U WOA ‘ ‘S ‘WA 9° 0 “OT ° uorersuy
| | | | | | | ‘opeıeg zo1fodyuom ‘ouinoq[e Ti | I
‘qeıeddy-[opuef s.1kowyor] uw uedunssom '7A
98 + wogsÄsg OUST JU uonynpay 919U8099)
08 + | 097186 | OL8T | ‘si ‘AM TO || O8F'T86 | SBF 186 | * 2 al [SB ||, 3° a 5 = | |
9 | O9FTS6 |-n seer ‘10804 ‘A “WT PSy'T86 | 997186 | S| 0 | 677 86 0808 | 8er rs se a ee |
| -PION ‘oHVMUIO}G “Broqsstuoy | 8
6. + | swiss | yet | “sted “mM “AO || OF‘T86 | gen'tss | “ | “ | a0v'186 oe : pe PPS
FL + | 8IP‘186 |-a star) - "loypeumyog I) ‘H || S8PI86 | SEP TS6 | 96 T| O | LIFTS6 | 69 0201 | SST FS er ee se
i | | | "T wı feeg ‘ssopyag ursJsusping &
8100 + | 698186 | GEST | "Tessog “M “WL T8186 | P8Z°L86 8| 0 | £L8'T86 | pe SI | 8,08 88 | vogasnequagteg ‘o}IVMUIO}G UITIOT I
| | a |
‘Tessog uoA yeıwddy-Jopusduepe ] Wop ru uodunssom “7A
Dow nee ee
wo | u | wo ud b— 5 wo IR un 4 |
°4 | oO B | 8: | :
= | LS SQ e | H 5
et boat en | @
| Jo. . og
on. 8 u 19398400 Fee = = =) de pe 3 onaıg wog Top aueN anvı E
sw © | EEE les} ° Ee See | © a a
© her ASE un eS
en Poe oo ee Be lel ¢ -
© | = > B
> = | 0 æ I es a ® 4
. 2 | a 5 5 | : | ©
° 2 | | ee

 

 

 

 

‘1ayyoRqoeg eos|nepp.0N
"A OTIOd'ET,

PONE an PRE DE DR ME reat see a er E see ee se fn RP 2 sewn RE Per as = RE sn

 
