 

 

 

   
 
  

 

  

  
  

 

 

 

  
  
 
   
    

  

 

 

    
  
 

 

 

 

 

 

 

 

 

 

 

 

 

 
   
   

 

  
  
 

 
 

 

  
  
  
 

 

 

 

  

  
   
  

 

  
 

 

 

 

   

 

 
 
 
   
   
 

  
 
  
 
 
  

 
  
  
 
 
  

  

   

   

    
 

 

 

   
 

  
  

  

 

       
    
  
  

  

 
 
    
 
   

 
  
  

 

  

 

  

|
|
|
|
|

 

  

. KR x a 5 , : re x fs 820 ano 720 mo #10 IR BR :
Longrtude occidentale 92° 90° ré i By 30 28 76 74 72 Z0 68° 66° w est Vv. née Fos
me ‘ = x = s |
SE > N ÿ m f |
Se : 3 À 4 |
£ : : Be |
BR) N |
Y NE 5 N gs |
aay N Lake Abbitibl rar D x |
| A NN : s i |
| f x u N Saquenag A À 400 |
| à | 48°) oa. Tt SR \ a nn, OR mar 8
i — | P&G GT a 5 C : 2 ayy # = AT Vhaley “9 _R
OL CEA res A a ee 7...
+ oe 2 ) * pe J
| e aequha; 5 hs 2 1 { arid
# 7 an ? 4
| 2 { nn! : { °.
| ; ; Stirton , 8 2
| i ' i - Samteetp, 4 \% e
rt ‘ cell Sa
i 5 3 st + re ? ro |
| \ ( A, a 20 : | >= Copper Har do: hy \ PS 2
) j 5 > r | \ È PS
( v 19. ro. À À 4 ad a |
| ni Mt Hoe tgbtony N ulcan ee. | Lye” N
( ’uchanan Le UV EN
| \ c
J I ge Se Duter Wand Wheal Kate Cane oo è ff \ ;
Onto, fv A9 <i ) Var \ }
C nagar, ) J f / ¥
Pr eo = esa D. an AST South a a ? he. ( ee iw } :
= Le me Aw AR. A / ue { <
| Se ie Gy" Ben a ORR ine. Keweenaw el & y 1 \
| er i 3 53 % An. re val. N $ Q + ay
| go eat : ; ee } oe ve \ RE 2 \
eo ct es | I Bones dee 47; ar. > Ÿ aD \ |
NS | . Ÿ 7 Bi” ng » K ff 5 \ 146°
46°" : { 46e a $ \ À Ë \ pee:
+ er” f \ es
| Da nr “a” À \ À 4 J
| 7 9 il N f
| ? a ST nl ow Fire RER gee | A 8
is C Den Dr ers
) J s ; A ark Ni ¥ssing N. Q
7 D 5 $ ; Sr Escanaba / À I: r / # f.
J é 4 Ly / J
f 4 ° oF ord River eS 7 if j Ss
< é po + ) (
6 = pl Codar River / er À J for | ye
) ? RE 2 ¢ & 4 te
5 1 RER 2 5 - N
St} f / 5 e 4 RS Les
rul 2 ( £ 2 k
a cS ; 5 EE À ( bac
Fe ¢ J | An DoorBinff fo ; ) “Bam Macias
a } 3 Menomonee us { 2 2 A \ Bangor 3 re 78
Nas Ser ‘ 5 { \ P ( +1 ¢ y Ae
= oe { S } fo ® de ie \ A \<
à # | ey d ; 7 FR me | Uswort
\ As ¢ £ | PA er tL ro { À N « Ir Kar u ar a \ 2 Am i
| } 2 y À pi | \ \ | / a “Sy N% 0) i : = |
\ . ee 2 OC y à ee | \ Be wre 00 ee à
| te, < ES \Fort Howard es io £ \ LE \ ha Ip
à | \ fi de g (GE Green Bay / a J 5 | À D a aa à 2 es =
+ à : 44°: N ee fe i > £ f ] a 1 | ) pe 3 P |
À SR, >, | | \ A { 1 | y ' |
: À. i À y = m | mt ES
4 NS f Br ys pera) off 7 I | A Kingston |
| Rte —_ + be f By a | À Ey ) > \ |
An À 2 et 5 { Bey | |
Hd > ; | & ee en fe N 1] { rief? zn Faden |
Fond du Lac \ | | AA Re TE —- re ett a i De ¥ = 2 Fe SW; aterlown # > ¥ Bal er i / if \ “Sige, pol
5 | | re Û i ‘ | oe A i
; e J bong a d y \ a | | AR | 4 | ae +: 4 | qos ch m + : ei
( | \ / \ q | { ie ille } ; | 4 | Guistoke K RE
| | lines +3 / ( \ PY | | ) 4 2) 0-12Mamısvi F1 Se J suit i \
| ): esota Junction | re \ | D. A | 2 ( Toronto T_ le th Base ° 61} x } oe Ralls BE
/ = \ wa \ Î | | ose E- nr ne Sans Creek | É 4 Great EX 0 i ~ \ n
| 4 ei \ \ | eee x Sandy ; % : amener ; ;
|: = \ / | id | f Fi | 2, % \ Concord “ 2 : \ :
lf \ ir  gellerdhincy \ RENE ee | -3 “Oswego N ( A peers
| if AG : A | oi v Ride 3 Ad ae { palstes of Shoals ea
4 a N À à ( û as, a ‘ = a / A / i Z \ RN
+ À 5 a Milwaukee A & . Were a 3 ie Utica j N) {  Unkonoonue 1° : a
hy | “ AZ = pS ~ ¢ } À 3 z N nu PO) x
NAY t y ) | er 1200 \ 1: oy Cezar He Rochester IR Er DS x 1/2: Bok, 5 rewbury pe bs |
| } x y Räeina\ ® | Se N / sy London Niagara Falls -0 ~ Syracuse or hencktadıy N | Nash [6) i A
I ' 5 1 bé | : Tonawan Adtaen | ee Sad fr | ER ye ong HAM an -
. Rs awal r \ | 7 \ À
/ ( } m: u ix a & Cohoes oo" roy Er Bar Lowel fompo ? À | me
j Oy { 4 D 1 \ - Pufll De | Bu \ :
Jf | Dubugue N € a 9 IR RTE x Albanv BEA a ‘ee OF itch burgg aaah FR
rh N Jackson Ss oy | a : REA ~ Wachusett ai Piha nae
leon ag © + SAH: Te A a vr ° ; PR 1€ nowBon : -
| 42° Sn SS wa LÉ nn ete À : i ie ER
| k er 4 ‘ ) : J ip an \ |
| i aoe M en À e iW prcester |
| \ | Detroit » \ A ar 7/710 Dunkirk =e get Tow 2 i on |
Ki! | ‘ es \ Fi 4 at Pr \ > of Be 2% S rringlield} DE IR |
\ nn j ar ur ‘ * if POT ae x. idence
a Te ! / { MONE Cape Br - à Binghumton \ WP s j Provide \ L
% J CE x 2 Ç 4 | fi = | er IR > rm. auge = ATK \ yr N ; 44 + } 4 a | |
$ a — | É PTE Min L ‘ ~( Kings tot, "à
| d licago, Le SCR 1 P er =a ine a aes ea ae Le f À {Hartfoëd dy af \ |
| u wen is es Ser: | | |
N < f 5 | D PRESS \ |
\ x ough OEP STC KV 2 vw‘ ) | i
à x a y
À « Newbupgh À ue Sandford e3; / ù Br 2 Nantucket | |
SE j N ) a Sac | |
| SE 7 2 € New Haven rene | N \ | À |
J ) N na gs = -k ‘Cleveland. cal So | A |
A f 1 Bar FH N |
y J ET ie Sanduskv
2 |
+4 ee re |
Kai Klizabe iR |
ae Ar — 140°
ED Ô { Voir Brunswick fF" | |
Allenton |
) ee u |
\ X |
be : ) se |
Pitisbure ORteading Ne" Ko: 3 |
Pe) es a Trenton |
à Norristown I
? AA. PR it '
Sprindfie Te a i deze A a a j
ave } mofie ld wen \ | Wheelin Yar d +5 sandra |
5 t TR — Nee apie SUI a 7 a et ee
| | Ir Indianopolis | Seat D Columbus Zanesville m \
4 |
& N
Principe gs # 4

  

     

  

His :
| \ x ES 5 df West Base Olnev «2
\ D: LOUIS 9 °

  
 

 
  

Parkersburg © 2 &
° +1 GO ao

Paducah \

    
 

  
 
 
 

 

 
  

 

 

 

Lexmeto
oO

 

n

es

WS oeOL, :

wus Knoxville

Ohio

   

 

     
  

   

 

  

 

| : is wv 2 x 2. N Nr RC #
| ; Éhattäncoge à $
| Z ei À M: Li
| ? ft 2 x
| à
| ; - et
340 yer oh Biche os 7 : NF
af fort, aS th
Lavender Mt} 5 LD Than
| LE ES APE NT
| fie Rom {
| : u rs
| J -Scwnce
| -
| amet «Middle Basd e0
(ll "
| Adanta ei
u : +1
90° 88° vl

vo EN 5,5

Pics
son
Ar
gut
all

£

ClarBerille
A: +1
fa Currahee

 

{tiens

  

ead ee

   

Greenville

Belton

 

 

 

 

rer eds
S2S aris NU!

Mod. 7

aie

  

 
     

     
 
 
  

Morganton

Chester

}

/
Shelby ile |

20

)

EN
{
I
I

)
+2 Youné
Yo

JalisburyN

) Charlotte

Columbia

 

IE

u

 

1 Moore

Pikopeme yh

Gre

80°

 

lors

B: altimor QY $ 7 <
S © Pool’ sIsland

y ?o® & a {
EL ff ing , We ebb: aA WZ
Bl i en 1, 01, %

e N

F yiadiedeg .
1 Le 38 Washing oes « Tay og ut aml

are & ca WS,

\
À
à ay Pr \ L

 

 

 

Petérsburer

 

  

 

 

    
   
  
  

 

 

CARTE SYNOPTIQUE
DES DEVIATIONS DE LA VERTIC!

 

 

 

 
  
   

  
  
  
   
  
  
  

  
   

 

 

 

ET % a
N Lv 257 outil 7 | ' : : : |
> a Portsmouth’ 4 \ F t U d | { { ri
a - 136!
nt dans les États-Unis de Amerique septentrionale D
DT ISA a
LOS aaa
7 Danville a \
| Se ; TEBERSICHTSKARTE
ensboro N u DA A4 É À 19 RU A
\ R Eh en . > |
| | | | DER LOTHABWEICHUNGEN
\ \ D | | Tal ! IN UE,
2 = / es A. : ff 1e : ed) I 2 |, Li | yk the 1 V j LIUILVULIYV LILNV |
4 3 = à à 2 /C Hatteras
A me k
Ile | NES 3 |
7 x =
e de | ini S Nordamerika
New Beng eines in den Vereinigien Staaten von No
4 VV x à J |
\ f
| \ en 5 34° /R
| | Expheati Erklarungen .
» € Lookout éxplications . 8 :
A u; Zi | > wn haklen sind die Sekunden positiver hothabweichung in Breite
N ? Les nombres rouges signifient les secondes de déviation. postive er latitadc | Die oe 4 sahlen sind die Sekunden ae BE ss i r
Pa ~ en , . : . negative * FORCE A $ NE - 5 ;
e ns a . " . . en longitude | „ vehmwarsen der Lothabweichung. in hänge ;
à Wilminöton? |
2 \
/ /)
/ 2 NY ‘ Reduction 1: 3,500,000.
x 7 j ‘ | |
\ i $s 5 Fa RAN ee CRE — 100 300 Kilm Le j
; da YC. Fea:
Sn | - En 70°
ay 7 74° 7 oe & x
28 76 Ce Az — =
E a = 5 ze, FIR tabl! top.de Wurster, Randegger & 0% à 1

 

 

     
  
       
      
    
          
 
   
              
 
        
 
     
     
 
      
