VANADA.

IE

 

 

 

INSTRUMENTS ENPLOYES, DE 1883 A 1896, POUR LES NIVELLEMENTS DE PRECISION PI.®

 

 

Mire de Philadelphie. Details de la partie inferieure de la mie.
Modele Talon_Faux talon zeglable_Nivelle ä bulle d’air.
; a ie io ; Vue laterale
modifie pour nivellements depröcision. Vue laterale. Ja Grandeur naturelle. \ - nn
Wehe a en El&vation.. (ötd de la nivelle
Cote de la face dınsee.

Vue de face. | | Faux-talon.

 

 

 

 

 

 

 

 

 

 

 

 

\/ue de Profil.

 

 

 

 

Niveau de Stampfer
q modifie par M.Hilgard en 1878 en Echelle#)

 

 

 

 

Vis mierometrique
ae

 

 

 

 

 

 

 

 

 

 

 

 

 

 

 

 

 

 

 

 

 

 

 

 

 

 

 

 

 

 

 

 

 

 

 

 

 

 

Kese

 

 

 

 

 

 

Retieule.
rg. I

 

 

 

 

Figl. Fig.2.

 

Fig.
u

En = [mn a == Se ae ee = mass
en En ne nn a EEE nne EEE = Seen

 

SE ETEEEEER TESTER EENSCNENESETEECIENLSTESNCHaREN

 
