   

 

 

 

 

 

 

 

N
LgLL 28 29 30 31 32 33 34 35 36 37 38 39 40 41 42 43 44 45 |
u Mai rc oa Bo 31 230 — ee oe Se er ar
r1 Bao a 55os a a Ha 59.05 5a m
Da — 5570 55.08 55.130 5440 = = 54.38 55.35 = 57.81 56.02 ei 56.76
4 6e 55.0, 55.39, 58.24, 54:39 u a 25 222 .54450235
17 —_ — — 54.86 54.30 ar ae SS ar 7 Ts Ges Fu
To a OS sa 3 37 = = SE = = = =
19 — — — = = = = SONO me Se ie 7 En = De = |
20 Bars 5150.372552.012556.20154» 39 550.25, 55659, 55.01 524 — . 55.40 54.24 55.72 55 555. asbeng |
21 55.05 55.40 55.63 55.74 54.56 56.02 55.38 55.54 55.29 = 55.53 54.30 55.76 55.72 58.52 55.45 55.09, 55.73 )
; 22, — — 59604 Shonn Sara 550830 55525 50, 55086) —r Br: E Sn 5 =; GE =
23 = Bo OOE EB A EN = > mE = = = FE FE == =
24 54.32 54.93 55.02 55.26 54.20 55.35 55.25 — 55.18 HoRON 518 5A. 3 Sonn E25 Lu
25 O5 SO So RL SS a5 ones, oe ss Aaer4. 24 55.08 5152.83. 577.318 1552,30 =
26 54.29 55.23 55.35 55.18 54.31 55.83 55.53 55.93 55.33 55.45 55.54 54.32 55.64 55.57 58.04 55.26 55.49 56.21
27 == SR me er ya ee = m sar25 55.470 55.089 57283, 55.462 55.7256
Mi 28 54.23 55.29 55.54 55.39 54.42 56.01 55.30 56.04 55.34 55.78 55.30 54.58 55.71 56.19 57.68 55.55 55.42 56.36
29 54.62 55.10 55.29 55.19 54.34 55.91 55.23 55.53 54.96 = == = = 158m 208547 91515.7185/0
30 54.30 55215 55.39, 55.04, 541.25 55.004 55.150 55.010 55.37 OT IE — Hy ee Hyaga 55>56) 50538
31 u Sa a OA a 1510070551720 550338 SSR OS == 055287, 58.060 55074 55.07 50.42
Juni ı 54.68 55.19 55.35 55.07 54.42 55.44 55.50 55.87 55.57 56.26 : = |
2 — ee = DA m == 579 55:37 ,55.0.8945,0.78
| 3 Do 55a u 55 ou TE ne SSe8seE — = Go = E= —
| 4 Do 56 Ton 5545 54.208 551,820 515.17 515.53, 55.55 a er oe ee
5 Sara 55.620 552.530 55.43, 5aR no 55542 555 390,551.199, 56.18 55.63 54.81 55.79 55.81 58.19 55.37 55.55 56.35
6 54.57 55.62 55.74 55.01 54.10 55.49 55.38 55.75 55.06 55.50 55.18 54.69 55.57 55.64 58.30 55.51 64 56.38
1 54.21 55.30 55.55 55.29 54.56 55.85 55.23 55.56 55.66 a 3538 Oo 64 56.21
| 8 54.87 55.45 55.73 55.09 54.05 55.25 55.43 55.54 55.13 55.56 55.40 54.34 55.42 55.86 57.95 55.02 55.08 56.00
9 54.45 55.29 55.61 55.43 54.27 55.54 55.74 55.89 55.50 = En 1 ODER EOEE 258 09 on =
" 10 54.73 55.33 55.39 55.18 54.33 55.56 55.71 55.70 55.48 5a He 5550 55 ee 5525 53.00 305306
ıL 54.37 55.28 55.70 55.22 54.51 55.63 55.64 55.64 55.67 — 55.59 54.42 55.88 55.45 58.25 55.05 55.46 55.95
2 54.96 55.35 55.62 55.57 54.38 56 04 55.44 55.83 55.19 56.42 55.41 54.92 55.98 55.95 58.43 56.25 55.65 56.34
13 54.17 54.83 55.19 55.41 54.23 55.53 55.42 55.91 55.58 se ao 5a 55.517 58.00 55.41 55.52 506.19
14 53.93 55.28 55.64 55.42 54.31 55.54 55.09 55.65 55.14 55.56, 55.24 54.515. 55.57055.,30 58.401055 2030 35.517 55.09
i 15 54.50 55.20 55.66 55.24 54.46 55.66 55.43 55.77 55.7 55.80 55.59 =
16 54.28 55.37 55.46 55.13 54.26 55.58 55.27 55.88 55.57 56.20 5 = 212552.6955,50,008.572.985 552008 550.70855.0%
27 De SIoE 5 ae ae ea 5 55 OA 553 Ba aa oE es 55.26 55.35 56.42
| 18 18 = = — . 54.60 55065 5580 5 55.84 54.94 54.44 55.58 55.80 55.23 55.83 55.88
19 54.46 55.21 55.45 55.23 54.25 55.69 55.27 55.79 55.39 55.67 55.53 54.49) 55.70 55.78 58.19 55.47 55.70 56.08
2 54.09 55.44 — 54.76 54.26 55.97 54.87 56.27 54.68 Sr 042 5[0r 300 5a or HE er nero Iso
E 54.06 54.85 54.89 (53.92) 54.31 56.26 55.58 55.85 55.52 55.08 55.32 55.06 55.67 55.56 58.09 55.15 55.24 56.20
| a ag saroge iss aTeis4.07 55. 3a see 55.77 54.00 Sur ngergse arbesnr baby 5 2 up
23 54.24 55.26 55.57 54.99 54.32 55.61 54.78 55.59 55.28 55.83 55.21 54.70 55.86 55.52 58.94 55.36 54.91 56.04 &
24 u SEE 52 OEEBEOR ES SESSEeI r3 5l055o 55.99 55.46 54.53 55.66 55.85 58.18 55.27 55.74 56.19
N 25 54.39 55.49 55.59 55.33 54.10 55.60 55.33 56.07 55.65 55.83 55.51 54.48 55.80 55.80 58.30 55.21 55.48 56.37
1 26 54.95 55.65 55.85 55.20 54.54 55.97 55.69 56.00 55.39 56.09 55.48 54.70 — 56.25 58.39 55.53 55.64 56.65
8 27 CE Son SEReo az Bob SoSe u So 5 Bora ar lee ee or
j
|
37 38 39 40 41 2 43 44 H5 46 47 48 49 50 51 52 53 54 |
| Juni 28 = u ns Be 55.96 55857 (5063:0) 50,50 SO 5) zoR2a 588897 - — 55.83 |
| 29 BOOTE OB L0A 558 55.76 — — 55866 So ea 0 Solar
| weg SOROsN? me sa 255.101 56.42 — 155.42 55.78. 155682355. 772 55.402 5558200.50.072555288
| ul =... Sa) Dache, x 55.44 55-35 56.18 55.70 56.28 55.79 56.19 56.21 55.92 ||
| 2 wessen 56.13 55.09 55.43 55.60 55.59 56.05 55.50 55.77 55.99 55.37 ||
| 4 Da 55.38 55.67 55.19 55.30 56.34 55.07256.2064.07..605020. 5,286 55.95 |
e 55.55 55.22 54.24 Be — - 55.13 56.08 — 55.84 55.36. 56.16, 56.42 55.68
DB. 054525552 55084 55.40. 56.2060 55.56 55.07 So.07 En oor 55.0 \
7 — 5500 Sala 55.0% 2 = = 2 x = > = =
IL me en = 5) 80 = = = = Be = —
22 55.71 55.56 54.83 56.08 E OR, — 55691. 55.64, 506095 55.50..55880 = Z
13 gs: ODE 55.16 55.41 == BABES ST — 55.56. — 55.65 55.96 — 55.56
2 ze 55.28 54.66 — se 5.3 = 55.03 55.55 56.36 55.70 56.03 55.65 56.02 55.98 55-59
I SR OEL SEO OLD E55 55 55.67 55.67 56.01 55.60 56.36 55.19 55.97 55.76 55.97
7 = u oben. 0 3 DSenuaesme DErssnlOE NO — 55.30 55.94 (55.26) 55.82 55.39 55.91 55.32 55.76

 
