 

540

 

|

 

 

 

 

 

 

 

 

 

 

 

 

 

 

 

 

 

 

| = SA
| Se Hess Længe
' Grundlinie und Zeit | ==
| AD aie 5 =
N9 3] 5-2 = | aul internationale Apparat
| S £ £ £
| der Messung Sse Meter reduzirt |
| LE |
| == |
a 2 3 be de Ser — 6
1 Ioemel ...., eo 2300,602 | Bessel’scher Basis-Apparat | Copien N° 9 und 11 der Toise yy
| 1851-1852 Bessel
2 Ostende. … , + 57 2488,856 » >
| 0 7226, 792 Französischer Apparat von | Regle geodesique normale (Inter-'
1890 | Brunner nationales Meter) |
2 31 Bespignan. ! » sine 4S 0 11706,69 » »
| 1891 | |
D iG ee 00 28809300 Spanischer monometall. tegle de Borda N° 1 (vermittelst des
1877 | ; Apparat spanischen bimetall. Apparates) i
: Se aa Ss ; : a it
OG Cartagena... . | 4+ 56 2700, 416 » | » i
1879 | | | | N
7 Oran. | 0 9364.178 Apparat v. Porro (Hossard) | Metre-du COR N
1867 | I
3 Diidabssisssnt, ous. 0 10000,286 » » i
1854 | |
a POMC ee le | 0 10325, 167 » | » |
| 1866 |
m Vick: . . . | + 56 |. 2489.8375 .| Spanischer monometail Règle de Borda N° 1 (vermittelst des?
| 1877 Apparat spanischen bimetall. Apparales |
Pe Ole. ... user) H564-000%601 bi » > |
| 1879 | | |
ie Duo, 2...  . + 56 2180,450 » »
1875
|  auimMadéidéjosk aus nn + 96 | 14663,085 Spanischer bimetallischer | Règle de Borda N? I
| 1858 | Apparat ante
ix» 10 Arcos dela Frontera | + 56 | 2483,767 | Spanischer monomet: Regle de Borda No 1 (vermittelt (FT
; I onomelall. se
| 270 | | A bimetallischen Apparates
a 87/6 | Apparat
| siehe 14 |
| ewes | Pan eras RENE a SR WT BEER ET Er = EEE RE ans en AN re = A $
SR Het raser on à À la : | vo 1 (vermittelst des
sub Cartagena’... 1), EG | 2700,416 Spanischer monometall. | Regle de Borda N I (vermitelhn
| | 1879 | | Apparat spanischen bimetall. Appl”
Pde | A rcos de laFrontera | -+ 56 2483,767 | » »
(siehe 13)| 1876 | |
co | | |
à - c : ae anne SUIVES
15 | luough Foyle... .| 4-58 | 12692213 | Colby'scher Apparat Etalon 0j der Ordnance SN
1827 | : |
u) Salsbury Plain ... + 58 | 11148,995 » | 2
told | | poise YO} |
siehe 2 stende my | 2e ae jer Toi
| siehe ‘2 | Ostende à + 57 | 2488.856 Bessel scher Basis-Apparat | Copien N°? und ESS |
| 1853 | | Bessel |
| sieh | Lommel ee H- 57 | 2300,602 » | » |
| | 1851-1852 | |
| |

 

 
