 

| |
| Instrument. | Remarques.

 

 

 

 

 

 

 

 

 

 

 

 

 

 

 

N° Indication des Lititude Longi- Directeur
Points. tude. et Observateurs. | |
| | |
lan . à... 51°12'32”| 2053’ 24”) | |
9 | Hondschoote . . . .| 50 58 56 2015 4° |
10 | Dunkerque . . . .. bi :2 11 202726 | | | Nr. 23, Frankreich.
al Gassel .. . .. . 50 48 O0 |20 9 13 | | NE ibretc,
12 | Mt. Kemmel . . . .|50 46 47 |20 28 41 | | |
18 | Hooglede...... 50 58 44 | 20 44 50 | |
HAS TRI. 4. ... ai 0 420 59 261 |
15 Courtrac...... 50 49 42 | 20 59 49 | |
16 | Aardenburg . . . .|51 16 53 |21 6 47 |
17 | Assenede . . . ... 51 13 43 21.25 7|
Is Gand?.:.....% 5 3 1A 21 23 30 |
19 Mt. l’Enclus . . . . 50 45 30 |21 9 24 |
20 | Andenhove . . . .. 50 50 8 |21 27 40 |
21 | Assche . . ..... 50 54 42 21 51 42
29 | Bruxelles. . . . .. 50 60 37 | 2919 11
23 | Malines . . . . . .. Bi | 46 129 733
24) ANVEFS : . . . à . . 191 82273169 ||
25 | Hérentals . . . . .. 51 10 21 | 22 30 5 |
26 | Montaign . .. .. 50 58 52 | 22 38 39 |
DUNMOW mil 11 6 2246 56 |
28 | Lommel . .. .... 51 13 46 | 22 58 49 |
98a | Lommel . . . . . .. Di 10 7, 22 58 6 |
29 Camp de Beverloo |51 6 52 |22 56 9) |
28b | Base de Lommel | |
(Terme A) |
28c id. Ip coordinées n'ont
(Terme B) pas été calculées.
284 id. |
(Terme C) |
Bo Beer ..-..::. i ee 05 7 0! |
31  Tongres . . . . .. 50 46 54 | 23 7 48 |
82 | Nederwest . . . .. 51 17 13 | 23 14 50 | |
83 | Ruremonde . . . .. 51 11 50 |23 39 4 |
34|Ubagsberg..... 50 50 49 | 23 37 8 |
35 | Henri Chapelle. . . | 50 40 38 | 23 35 21 |
Bol Halse... ig... 50 52 57 | 20 57 39 | |
37 | Bergen op Zoom .|51 29 43 | 21 57 12 | |
88 | Hoogstraeten 51 24 6 | 20 25 37 | |
39 | Duysbourg . . . . . 50 49 0/22 138 4
aunbastre . :. :... 50 46 38 | 21 36 12 |
41 Lion de Waterloo . | 50 40 45 |22 4 13 |
42 | M. St. Anbert . . .| 50 39 19 |21 3 53 |
43 | Mt. Mainvault . . . 50 39 38 | 21 22 14 |
44 | Bon Secours . . . . | 50 29 53 | 21 16 21 |
AS MONS . :......: 50 27 17 | 21 36 55 |
46 | La Houssières . . . | 50 35 22 | 21 49 49, |
AJ SumMEt. ...:. . . . 50 27: 50122 529 |
48 Mt. S. Geneviève . | 50 22 59 121 54 16 |
A9 | Avernas ...... 50 42° 7 | 22 44 13 |
BO PErWwezZ ......-: 50 37 12 12229 3 |
51  Hanzinelle . . ... 50 17 56 | 22 13 54 |
59 | Philippeville . . . .| 50 11 56 | 22 12 37 |
53 'Saufain. .. . ..- 50 9 52 |21 53 3l |
54 Bois de Villers . .| 50 23 17 |22 29 6 |
moigney ....-..- 50 25 50 | 22 47 81 |
56|Beanfays...... 50 83 47 | 23 18 56 |
57|Stoumont...... 50 25 50 | 23 28 53 |
58 FIAVIOn : : . . . . . 50 15 38 | 23 22 53 |
59 | Mepnil St. Blaise . | 50 10 44 | 22 34 50 |
60 | Achêne ....... 50 16 15 | 22 48 32 |
61  Hantfays . . . .. -|50 0 9 |22 40 54 |

 

 

 

 

|
|
i

paw th Lh br
