 

ib.d.Europ.Gradm.f.d.J.1870.

D +
FENDER U

|
\

 

 

 

 

 

 

 

 

Lith.Anst x. Leopold Kraatz in Berlin.

 

A

 

 

 

 

 

 

 

 

 

A

 

|
ee | || .
& N
iN Al N
N, ||]
DET l'AS ———
1 ff]
es esa [||
| [I |
| |
|
|

ti

1181

Bam Mall lau |

ud
