 

es

Tafel I.

und Vertheilung der Stationen.

_ prog
= Po ts dant

Strassburg

 

 

VA > \
os S \S\
4 So \S \
9 S \al
© Ss D ey
& N + \ sc
ss Ÿ =
«© > se
$ I 8 à
à > ee

OOF

Y

Lage der (

A as ae Mla il gaa DE arm | La dun fut al

Bewegung des Nordpoles.

Se
S
=)

|
S |
a
S
|

|

|

|
|
|

 

 

 

S |
8
S |
S |
SIERT
S |
|

|

|
o |
Ne ne
S |

|
S |
ad Bonn
Ss
+9

S

Ss

LENO LEST MT eae
. % 3 :

ty ie Ce LM etd | ud ul

eee

PEI

    
