 

60° : 270° 80°

 

     
       
     
   

 

 

 

 

 

   
  
  
        
     
 
  
  

60°

 

 

 

 

 

 

 

 

 

 

 

 

 

 

 

 

NIVELLEMENTS DE PRECISION

 

 

 

I | I ! | | |

 

1 u
l T

 

| I
a |

 

 

 

[ rl
Te
I

 

 

 

EEE

 

 

| es |
a
LIGNES EXISTANT, AU IFRJANVIER 1906, DANS Prttenhein 0)
« re 5 zu 2 | ı | N
LA SCANDINAVIE ET L'EMPIRE RUSSE ee,

 

     
  
     
  

 

|
0TA

Al

a | | kom mar

   

ı
j
+

ee

a
An...

++

-
= or

 

 

   

| |
endeten ernennt
| | 9

>

 
  

T x
AR
[>
nenn

| ER
! ra aü

    
  
  
    
 
 

  

2
%

 

  
  
   
  
   
  
   
 

    
 
 
 
  
 

   
 
 
 
 
   

 

   
  

 

  

  
  
 
  
      
 
 

 

 

7 Beirgpaviovoh Men wi
Dee | h | +1202 mm | \ “Yy s
j ‚ Tcheliabinsk N os KLEN u
' I r= / LE [ # j Fr | 182 \ ' a rer
| | m 2 a [} ' | ’ a WE Merhern een ansehe ssaerrttt ae X
| 1 | } Y \ E
\ "2 | | L | ! ! # Fanreechaegn | in D 2 S \ Ss MY >
| nn | \ ! i| ‘ | 3 ask Haprimanduh6l? 72 ne aTıu
| & | ri | | DER FT >= \ Indg, 85 Kaerthteh
> ° enbourg | N x i | ! a nusburd uns eiRmoage Flelenelend "5
h 12 mi H ” avec | RE
IN Ee N r R
|

     

Oural__L

 

  
 
 
 

3 = "Ada N
+ +42 mm .\ +

+ |860km Birmingham,

+ » +
+\ \

   
  
   
  
  
  

      

 

A

 

 
 
  
    
 
 
   
        
   
     
     
    
    
 
   
  

Jeters Löndinga, Fark
|Shreveport,

        

r

a Ra)ıs |

ln bampasaso—dlome |.
| holland | |

\ r
| A on
+47

    

\r4lmm | 2%
Hrukm | 9}
@ |

 

  

NIVELLEMENTS DE PRECISION ie

 

 

 

 

 

 

 

 

     
     
    
    

 

 

 
 

       

 

 

 

 

 

 

 

 

 

 

 

 

 

 

 

 

 

 

 

 

   
 
    
      
 
    
         

 

 

 

 

 

 

 

 

 

 

 

 

 

 

  
 
    
  
 
 
 
 
        
         
  
 

 

 

 

 

 

 

 

 

 

 

 

     
 

 

 

 

   

 

 

 

 

 

 

 

 

 

 

 

 

 

 

 

 

 

 

 

 

 

 

 

 

 

 

 

 

 

 

   
    
 

    

 

 

 

 

 

 

 

 

 

 

 

 

 

 

 

 

 

 

 

 

 

 

 

 

 

 

 

 

 

 

 

 

 

 

 

 

 

 

 

 

 

 

 

 

 

 

 

 

 

 

 

 

 

 

 

 

 

 

 

 

 

 

 

 

 

 

 

 

 

 

 

 

 

 

 

 

 

 

 

 

 

 

 

 

 

 

 

 

 

 

 

 

 

 

 

 

 

 

 

 

 

 

 

 

 

 

 

 

 

 

 

 

 

 

 

 

 

 

 

 

 

 

 

 

    

 

 

 

 

 

 

 

 

 

 

 

 

 

 

 

 

 

 

 

 

 

 

 

 

 

 

 

 

 

 

 

 

 

 

 

 

 

 

 

 

 

 

 

 

 

 

 

 

 

 

 

 

 

 

 

 

 

 

 

 

 

 

 

 

 

 

 

 

 

 

 

 

 

 

 

 

 

 

 

 

 

 

 

 

 

 

 

 

 

 

 

 

 

 

 

 

 

 

 

 

 

 

 

 

 

 

 

 

 

 

 

 

 

 

 

 

 

  
 
 

 

 

 

 

 

 

 

 

 

 

 

 

 

 

 

 

 

 

   

 

 

 

 

 

 

 

 

 

 

 

 

 

 

 

 

 

 

 

 
 
 
 
 
     
     
    
   
 

 

 

 

 

 

 

 

 

 

 

 

 

 

 

 

 

 

 

 

 

 

 

 

 

 

 

 

 

 

 

 

 

 

 

 

 

 

 

 

 

 

 

 

 

 

 

 

 

 

 

 

 

 

 

 

 

 

 

 

 

 

 

 

 

 

 

 

 

 

 

 

 

 

 

   

 

 

 

 

 

 

 

 

 

 

 

 

 

 

 

 

 

 

    
     
     
 
  

 

 

 

 

 

 

 

 

  

 

 

 

 

 

 

 

 

 

 

 

 

 

 

 

 

 

 

 

   

 

 

 

 

 

 

 

 

 

 

 

 

 

 

 

 

 

 

 

 

 

 

 

 

 

 

 

 

 

 

 

 

 

 

 

 

 

 

 

 

 

 

 

  

 

 

 

 

 

 

 

 

 

 

 

 

 

 

 

 

 

 

 

 

 

 

 

 

 

 

 

 

 

 

 

 

| Legende n ln
I Aa 3 LIGNES EXISTANT, AU I=RJANVIER 1906. |
Mveli (Operations simples.......... ae
ivellements ex&eutes
de double De, DANS LES u 4 “ Pr) a . Mirellements exeeutes ( operalions doubles N
am r - NZ] I E ; Ecazts de fermeiure d’un polygone +302
lichelle ; ur-s00-000 Nivellements projetes L , Da Be au
0° 0 m am 0 a su ei mu a 0 mn i = ETATS-UNIS oe L’AMERI 0 UE ou NORD ee ee Perimetre. du polygone
\ Maregrannes 2.0 0. 3 8 | a ler nn m
It Be : a: | Eichelles de maree ratlachees aumvellement de preeision.. +
SER SERIRRATRTEN —. - | ? x Y \
| Kr = = a 80° _Kousohka ar no wu doR 2 Be 90° 85° ar 80° : 215°
Longitudes rapportees au meridien de St Petersbourg ( 27258’ Est de Paris) r = Longitudes rapportees au möridien de Greenwich (2? 20'Quest de Paris) zu \
une ei
\ i
zT 5
} a 2 RO IL N a Eu 88° 92: 36° 2% | 130° 132° % 100 Inge 1n3° Lime 1050 1nG® ine J
T 1 — 5 T 1 r e 7 - ’ T T = T T = En N
Peshawr Sei R i i n } | 5 | v
„ran hita NIVELLEMENTS DE PRECISION NIVELLEMENTS DE PRECISION | FR | NIVELLEMENTS DE PRECISION |
Aa ; *
R J ne Ktäöngn Jhelım |  . 20°\__ H |
me et J der Summe N: 32° :
| Dar | F 2 Br | LIGNES EXISTANT,AU 31 MAI 1906, DANS a iyako ? = zu er du
X an main] iR r | i r ' j LIGNES EXISTANT, AU 17T JANVIER 1906, DANS Ve LIGNES EXISTANT, AU 1ER JANVIER 1908, DANS |
h | di Y E 5 =
| e 4 En . ve
un | Dre hät] © is L EMPIRE DES INDES L’EMPIRE DU JAPON | | L’ETAT DE VICTORIA |
% I oDerha Dun z 2 Re =
| | E |
mr a
zaffarnager | Echelle: 15.000.000 Echelle. 5.000.000 | | (A USTRALIE )
oratlabad, | 0 100 200 300 0 500 600 700 800 200 1000km . 0 100 EN et en oe | }
aRibhii } nat —— — ni nl ——— — end — | zei o > REN AINT SEHE & SE EaREN.N % nn
| %
: Nivellements executes (Operations simpes) ————| ||
388 R FSALT LAKES | 350 N
} ar | | 382||
r ’ Echelle:z 50.000
\
+
x
+
! ° |Denitiguin | |
4 offnley | 5
x L.ALBACUTY, s. | kn
‘ WE 2 |
1 2.ifmoma "engobrem | | : |
“ t med 22 a „.Picola Far OrOwagE, MY, | ; Fi De
ee LAKE HINDMARS Fe a Broken __ yarlanııı ah Say ek 1 e|
ı Eofuca \ 3 a x Springhursl "Molonga )
Hi | —ıNumurka, \' & x
+ = R hworch J I) Taflan Gala
Wälgeley op lathändanden 5,
4 Jervicaton R N. a, 2 =
+ er S I
; S
% © SS
A Garake Whitfie
A N
: \l eläpene 5
: exandıa ‚Road ga EN
+ TEN -
: Tanzen
4 \
’ N Mi eägBnesr = R
+ \Elgham „so Aealesville ® a
eo ae
Dou ilydale a arburto \ g S
Croydon | IS Mr
= & andringhem oGembrook Syanı m.
| De A FORT PREREEAE Dandenong °Neerim South er 2)
| e.soRansAnrE; & a Tem ——= ornington J ol Ma, Ja _Treie A,
or 4 aa Y Geelon Qucenschff =; DR a e ra % oJpara
Legende P FR u er „ Thonpdale o / Morwell
Erations simples........._ him on“ Mirboo
— | Ba Tao
Nivellements exeeutes 2 Be any el 7740 \
d®__doubles | se ; a athna di Ama |, n
— 1 — una — 82 Nivellements exeeutes (\ operations doubles) a = ER a Be
; ’ S , ; = GAPE-PATERBON
Station permanente d’observation des mardes......® Nivellements executes,non caleules.............. one - f Be AM (dmg
70 sn o RT 2 = —e— = eo. \ :
d‘ „lemporsire 2 d 5. Vrape 9 ee Er BZ ae our une ar \
i 39 - —= : — > = e 139°
- = N PROMONTORY- ==]
138° 140° | 141° 142° 1u3° ; TEr® 185° Ia6® 137°

 

Longitudes rapportees au meridien de Greenwich (2°20' Quest de Paris)

 

longitudes rapportees au meridien de Greenwich (2°P0'Quest de Paris)

Longitudes rapportses au meridien de Greenwich (2°20'Ovest de Parıs,)

 
