 

)
J

Se

eee

eee TASTE ee le es EN UE

aaa

—

FR SIS

Re et Re rer ee

Sn

RER

Fe
N
Ei
a

seer ee

34

 

 

 

 

 

 

 

 

 

 

 

 

 

 

 

 

 

 

 

 

 

 

 

 

 

 

 

 

 

 

 

 

 

 

Polhöhe.

Gruppe | kreis- |Mikrom.| Correction wegen |Verbess. | Arithm, Mittel | Halbe Diff. | Corr. |

1897. und Differenz, | der scheinb. der wegen |

Lun | Sobr. pole. || Declinationen, | Mikr. Ables. | Refract.
| al ae eae

a 20) Zei.) — 38085) Haxcan sntosi—u'sa!sol-otos

510 ksespalzer alt eilt nhlse9rälhenne) do aus 35255140.

4 „ + on ay a ae ag ee en

AD rs sal ed st ssl go 15.20) 50.26 0.08

| | |

D nn mods) 14 48-25]-+1 55-87|+0-08

| | |

CL à n a a oa a ee es | 20 45.46 —4 en

el sl ran] 5.670, 23 x7-33]—6 5120 0.1

3 7: ae a he re oe + 6 446) 13 11.2043 eh

os © costs s.o1tore

| | |

Monte ul à 3406 39.50.10

RU no ein se) st 15.40 40:02

he) ame 24 s6-cglt+s 47.511004

8 i ees de a a ee 8.778 20 48.17|—4 23.84 —0.08|

Donne ho Mie ot sims | 8 als ansılton

4 A | + 2 de + 20 = et ° 018. 16 24.2040 0.54 Lo

; : ee En . ne 15.254 ni dr 38.84 — 0.13]

D ee el sone) 17 57.161 32.16) 0.0:

1 w We a. el 0.8 en dei: | 10 49.27 45 ne 09

u: 4 en .. | a — 36751 20 45.62|—4 21 —

1 i aan Je nn a 23 17065200 a.

; Wr a eo ae 0 439, 13 II 9[+3 PB 2132-5!

4 4 ae en 4 oe As Ss 721 “he 2.95 40.16]

5 n a a 4 ae 13.288 23 3.611—6 39.55 —o.ıı

0 uhr 2 reelle“

DA A

24.58

24.75

24.59

ad ss

an à. Mia Mu aad td

 

 
