UieH a ans ze

Nertmmwee

 

INN rl

7 IR LARA IL) RING HALL HER Hl

ra Ip

ER NDEL-S TATIONEN

IN NORDAMERICA

August 1895

 

   

180Westl von Gr.

150

140

120

 

   
    
  
  
  
       
     
     
 

Da

 

60

 

 

30 /

ao

 

/

Maalsstab 1: 86000000

 

7

+

GE

7

5

nn

.
\rönuı dark

. /

II

ES M

  

    

 

_Denve IP
I ee

® Pikes®. al

 

no vorth

g
est

r E

Au stin

 

Ies%

_
So

\c Be, Alles?
1 ne How zute
ti
© inat
Kansas "SR Louis a
TA

\

\

Ned Orleaniy

 

 

  
 

4
e.
8

|
“
|

 

 

120

 

90

 

 

Gesgrdrst u ME Bore] Nerehatel.

re

Een nt

a

 
