               

 

 

 

lo Ir
lo |ver
lo ver
io jez
0 sw
o jw
0  |ser
or Ton
o gar
I-+ (98%
0

 

 

 

 

 

0
0

0

! 0

Den Keo, 00% em 0
at ıo-t 1 gor 0
T-8—- [ir |ee 0
wa. 62722007 gor 0
9I+ | eT+ |168 90F v
& ar N © 1 688 168 0
0 0
| 0

| 0

| 0

| 0

  

| 0 828186
| | |
| u g-07 |

|

 

WW g-07 | WO E01 | um | u wo

a

4 6 %

| II | |
| | |

 

 

6681
1681
4
9681
1681
9681
L68L
6681
#681
8061
1681
Fest
9681
SoßI
L68T
#681
soßT
9681
SOBT
L68L
so61
6681
8061
9681
1681
#681

gef

 

 

uugumyog 0702| 007 8866
SSBLIOT 76 cr 1'968
“ 08 | 78 LP
, uuswoseeH 0% 7 0%
| SSBLIOT 66 LE 696
| uuBwoseuEHL ven 26
| SSBLIOT So or oye
, uugungog 05021.09.2,.@508
e 'n uuewosevH] 0 8 | enete
| uuewoseeH 95 I ES
| SSBLLIOT | aa Dee
en uugwoseeH 19°6.| 09 | 0'567
| a | a (3
uuvwoseeH | 6°I r | 866
sseuog | | & me
wen uueweseuH| 0% LLE |0'87
| “ | re |e |ere
| S 0252. 0% 5
uugwoseeH 61 | 9 0'784
SSBIIOT Snom | KG OST
Se 052.170
uuvwoseerH L’6 |
uusuunyog 0 |
A 288 |
uugwoseeH |T88 0°6 |
SSBLIOT gLe 66 |
en uuetaseeH cE 1856| 0°5 |

 

 

um

8

  

| zo4ypwgoag
|

 
 
 

na basan. Mähhusksliankalinh nn ı

 

 

 

08 |8°27
81 |6°0F
6 |ereg
6 |988
81 \2.08
01 |e:0z
8T | 9°8T.
01 &el
er eu
Lı |s:or
el 69
er |g:9
01 77
8 0:%g
er Irre
er |s:1q
s ger
or |e’er
2 un
er |9 1
L 007
s7e
8:28
ls:ıe
| g:08
| 1:68
|

91ONYOg oIyoIq|oyoH | aZugT

 

 

                                               

| |
| "MUS SIOASSUgN |
"Sponer] wuoyıy |
dnieq1spng |
OPAIQFUINIH |

y e wsıog

"MILIOIS “TOLM |
punspegg |
uroJsuopnd |
3109104
pusjoSfoHL

G

UOULWILIN)
ung
197sunmumoN
| IOANON |
uruutuo(L
| SI9J10IM
| OPWIENO
| 90789PIO
30010Jue AM

‘L '® MoydoıL
uogoıyuoyod |
yo

| OB Mo9g Sımquef
| USABUSTUIOUJEML
NOqUDZIBMUOg
"W 'Tpwesıeg
319448101

   

puejgosmoq

 

uoeg pue]

II '99L

 
