 

034

 

Variations relatives de poids des règles de cinq espèces de bois pendant la durée

complèle des expériences.

L Variations relatives de poids des régles naturelles par rapport aux regles peintes correspandantes,
CO

 

  

Octobre 1883 Novembre Decembre
Go ree et paar oS
Sees OMS oO ST io Ml 22, 27 01 7 12. 17 122
QE" sie ur see —— | Eee oo Rise
+3 m ut = =

Janvıer 1881, Février

    
 

Gr
9
1 N

 

 

+2

 

bale ul,

 

+1

 

A

 

 

 

 
 

ec

AN
N

A
N

   
  

N we por
AR =
\ HZ

 

 

 

 

 

 

 

 

 

 

 

 

 

 

 

 

 

 

  

 

 

 

 

 

 

 

 

 

 

 

 

SEE
100 125 Jours

IL. Aceroissements relatifs de poıds des régles huilées par rapport aux régles naturelles correspondantes.

Ge
+

Gr

 

+3

 

 

en

 

 

 

+1

 

 

 

 

 

 

 

  

 

 

 

 

 

 

 

125 Jours

 

 

 

 

 

 

IIL Temperatures et états correspondants de l'étuve. États
hygrometrique:
nn nn ee
an ee 90
a RN
LZ =
— —| + +
|

 

 

 

 

 

— 0.

—— ee

 

 

20 30
Nombre de jours écoulés depuis l'origine des essais.
w

LEGENDE

Sapin.
Pitch-pin.

Alisier.’
wa
‘ -Tulipier.

Charme.

 

 

 

N

40 50

N
Lip
| Ai

  

 

 

 

 

    

 

 

 

 

 

 

j . ne rs

A A

 

 

 

 

60 70

 

m
ZA
Loy

--____. Variations de l'état hygrométrique. \ l’etuve.

Pig. 5.

 

 

80 90 100 110

 

 

 

DZ | |
en

 

Chlorure de calcium dans la cuvette.
Eau dans la cuvette.
Cuvette vide.

Variations de la température. ) dans

 

i

 
