CN; PCT ee

22 DO EE Pa

—s on

De >
aS = =

Nay
jy {
ja!

ju!

—

Polhöhen.

 

52788

53:
52.

53:
53.

14
68

06
05

07
13

.96
.90
.12
.07
.03
.98
299
"93
.c8
.86

>
.)
/

.94

52.80
52.73

.92

.03
202,
.06
.92
03
.08
.96

.09
me 93
OF
07
516

.90

.89

bi
Us
Ms
Hs

.86
.06
.08

|

53.07
5810

179

.03

.86

25
.82

223
.05
28

.06

und die Kurve II, die mit I
Fehler einer Beobachtung ergab sich in derselben Weise,
graphischen Reihe, nach den verschiedenen Methoden hergeleitet:

-+-

Sie
4-

m 02295

UD
.96
or
.96

.06
.84
.08
199
03
DT

AL
.04
.18

die beste Ubereinstimmung zeigt.

937

VII

b
oo
BR

52..75°%,592,75 53,01
52-990 5309: %4.15
53-07 52.99 2.88
53,06 52.08 59.2

52.95 52.96 53.32
53.015 ,102,, 8784 5 36:31

52.00 57.16 162.84
Sa TO
53.15 53.10 52.90

5334 53.098 52.75
53.13 59.18 52:00

( photographisch:

( »

( ”

( »
37

5
52303 Die
52.99 52.
53.09 52.
53.02 52.
52.95 52.
52.90 52.
53.03 52.
52.96 52.
Bio Oo 53h
53.20 53.
58.20.,.53:
53.15 .53-
20 53)

of rs?) )
G.-154)
0,166)

frets He lk

8,170).

Tages-
mittel,

Der

52.84
52.

53%

79

NO A À  R

mittlere
wie bei der photo-

 
