 

a - ERREURS
I RS PAYS LONGUEURS | : Z
RL NOMS ee PROBABLES DESIGNATION
DESIGNATION DE LA BASE nee a ET wae
ET ANNEE DE LA MESURE . x DI menu ERREURS u
OBSERVATEURS. PPAREILS DES BASES EMPLOYÉ, |

AU NIVEAU DE LA MER. RELATIVES.

eS eee

SIMPLE OU DOUBLE.

 

 

 

| :
| PORTUGAL. |GénéralFolque.|  4787,9419 Appareil à règles en bois dus
| Brésil, du D' Monteiro de
Rocha.

Base de Montijo.
1835.

Mesurée deux fois.

 

 

 

 

 

 

 

| PRUSSE.
| Le a |
1. Base de Königsberg. | Bessel et Beyer. 34.998124 a= 0.936 Appareil de Bessel.
| 1834. —
; : 86350
Mesurée deux fois. (Voir : Das Rheinische
| Dreiecksnetz, Heft 1:
| Die Bonner Basis, p.46).
|
|
ci : à Lees. i
2. Base de Berlin. Beeyer. 1198,723032 0108 à 2 i
1846. 1 |
, a 375000 il
Mesurée deux fois. a |
|
FR
Mesurée encore deux fois | Sept membres 1198,72 1 Appareil prussien M,
en 1880. de l'Institut geo- (valeur 4600000 de Brunner frères: | |
désiquede Berlin.| approchee.) (environ). N

 

 

 

 

 
