 

   

 

 

 

 

 

 

 

 

 

 

 

 

 

| XIV. — Roumanie. a
so | |
of a wot TNE TORT ION a DIRECTEURS
N i N on LATITUDE LONGITUDE) EPOQUE no INSTRUMENTS
I 1 | Baldoveni......... 492.6 30 40912 22% |
S 2 | Hunea-Comena..... 44 54 28 0914
& 3 | Movila Brinzei..... 44 57 9 | 40 27 24 || | |
i. 4 | Cimpu-mare .......| 44 46 34 | 40 23 15 | :
G > | Dealu Dregesti ....| 44 34 18 | 40 10 34
0 6 | Dealu Kili......... 44 33 56 1.40 29. 0 |
F 1 | Piquet... 44 29 32 | 40 14 9 =
6 8 | St. Korlatel....... 44 23 29 | 40 36 9 =
C 9 | Coasta Ysvoare.... 44 17 59 | 40 20 25 =
OI 10 | Dârvari de jos..... 44 11 42 | 40 44 50
I il | Dealu Bacerova.... 44 6 53 | 40 30 16 3
SI 12} Blocoasa. .-... 2... 44 71) 51404347 ©
1 13 | Mägura Kamiloiu- | =:
er ee 44 6 24 | 40 59.41 3.
14 | Dealu Obrejii...... ‚4300, 8 40.39 56 =
15 , Magura Baranga... 43 58 48 | 41 20 52 z ae
16 | Kiler-Baeri........ 43.47 3b PAW lo 17 = a
17 | Grindu-Gol........ 4356 711 2850 & ee
18 | Trei-Mighile....... 43 44 19 | 41 36 29 + So
LO" Robita,. 2... 43 56 5 | 41 51 25 = : ae
20 | Dealu Virtej....... 48 41 15 | 41 55 33 a as
DIV Piganias. 4346 2, 2058 = oS
22. Baranza.......... 28 50. 7 | 42 44 417 a | 2.
23. .0slera ....... 43 5p 12 | 42 22 = en
24  Cetalea... 2 45. 5 31) 4 18240 & 2 =
S 25 | Busterla........... dd 34 Aa > à | = en
S oo Ohm 5 4150, 21238 = | LS
S Dice BOWE i. 2.2.2... 44147 | 4150015 = a4
S 28 | Capu Dealului ....., 44 20 40 | 41 52 53 = oe
g 29 | Magura Cazacilor ..| 44 22 20 | 42 3 17 1 a oe
& 30 ı Oporel®- ......... | 44735 8 14 525 We a oo
6 31 | Dealu Ottului...... | 44 42 36 | 41 54 48 co 3 2 2
& 32 | Piscu Dobrei..... 1,4449 6 | 42 6 22 © HE
€ 33 | Bruce-inaltä....... 44 53 38 | 41 52 19 = She
6 BA Konsaru..2....... 45 449421230 a
6 35 | Laeul-frumos ...... 45.96 Al 5211 ©
5 so, Billa... 2.2... 45 14 31 | 41 49. 238 2
5 SE Kot... ee a 451920174297" 0718 = À
G Si EG 0.5. 45 21 83.1 42.21.43 2 a
6 = 3 | VYırkı-mate ........ 45 31 34 4] 4730 ‘ © |
it AQ Présheé.7 1... 45 36:54 + 417 40 57 3 |
tt Satu 45 35 27 | 42 6 26 3 ie
| 42. | Argerii..... ee 45 9 33) 24) 537 ©
Nee 43.1 Adıncals, ..:.....: 44 043 , 42 36 42 2 |
es 44 | Magura de Passe...) 43 48 8 | 42 33 25 © |
: : 224 Movila Gaunösä....| 43 55 16 | 42 47 6 oS |
45 | Movila Soimu......| 4348 11 | 43 137 = |
; 46 | Gradboir.......... 43 36°48, | 43° 0 35 2
= 47 | Kresnambasi....... 43 39 29 | 43 17 56 8
AS PAIN. os 43.44 14 | 4329 2] =,
49 | La Crocea......... 43 51 47 | 43 13 45 3 i L
50, Staseestl. . -- 43 55 541 | 48 28 31 = von
51 | Levent-Tabia ...... 43 49 40 | 43 37 34 = Kan
92.1, Brassins. 7... 44 1 58 | 43 4] 45 i Se
53 | Keresi-Tepesi...... | 43 51 44 | 43-57 49 D 2 © ® gS,
54 | Topraklik-Sirti .... 41 2 44 | 44 16 24 = 2288
55... Greaea. 4 44.619) 44.0 4 S = Ss m
gi 56... BRadovan =... 44.10.57. 44 1] 2 = ST
= SEN Ryenk. 1 44°10 311-43 55> 3 a eS
Do RAF... A4 IS 34 | 45/46 90 Er eae
59 | Mosia Mieä...... .. | 44 22 29 | 48 54 34 ue

 

 

 

 

 

 

=
s

z
=
=
=
=

in

à

\l

 

 

 
