  
  
 
  
     
   
  
 
 
   
  
 
  
 
  
 
 
  
 
  
 
  
 
  
 
   
 
 
 
 
 
  
 
 
  
 
 
 
 
  
 
  
  
 
  

 

 

 

 

 

 

 

 

 

: does DES INSTRUMENTS LECTURE ue ERREURS
é a a NOMBRE DES OBSERVATIONS DE OLÔTURE
. EMPLOYÉS, i DES EXÉCUTÉES DE
SECONDES
Le ET _ VERNIERS POUR CHAQUE A REMARQUES
a = -DU VERNIER TRIANGLE
DIAMÈTRE DU CERCLE Ur OU DES CHAQUE ANGLE x
a CHAQUE DIRECTION + | —
‘ | es 2 ’ Directions.
= Ramsden, a feet. B, 0. Microscope. 3 Dale
52) id. R.S. id. 5 8.10 2" 76 7,018
es Ramsden, 18 inch. id. 3 21,14
ma Ramsden, 3 feet. R. S. | id. 5 11.425 80 2 n
o id. B. 0. id. 3 ee eine
354 ‘Troughton and Simms, 2 feet. . o =3.10 10417, 16.16 | Zul | 1,018
355 ( Ramsden, 3 feet. R. ce id. 5 Lo [1 : “ro
a id. B. 0. 3 11.20 15.16 | Bed
B. 0. id. 3 10. 13 =
R. S. id. 5 13, 8 25.92} 279 i
B. 0. id. 3 2107 5
es ; id. i hs 5 9. 5 wi...
; To on and Simms, 2 feet. id. 5 16. 9 12. 2 9
-( Ramsden, 18 inch. id. 3 28 | od
a { Ramsden, 3 feet. R.S. id. D 20.23 9.14 9.82 7. 952
t Troughton and Simms, 2 feet. id. > I 22, 2 Er
Ramsden, 3 feet. B. 0. id. 3 13.18 19 12.014 92 2,8% =1..,8,.066
oe and Simms, 2 feet. id. 5 121 jee oe
Ramsden 3 feet. B. ©. id. 3 1820 5» 142.1 = > | Fonte
Rs | id. 5 18.10 | een
RS: : id. 5 11. 40 41.14
BO: id. 3 Lil | 2,86 8,180 |
BO. id. 3 18 lo ay |
R.S. id. 5 > Ah. 8 17.414 ne |
eS id. 5 2.20 i
den. 18 inch. 10. 3 21.18 2308291 |
| Ramsden, sleet. BO, id. 3 22. 4 i
id. By OF id. 3 Sie SEs oe 7 | 2,88 8, 294 3
id. B.0, id. 3 GAT. 9710 10,10 2,89 | 8,352 i
id. RES. id. > 118, 19)
id, : By One id. 8 III 2.89 8, 352
asien, 18 inch. : id. 3 12,29)
| Ramsden, eo feet. B. 0. id. 3 221 58.12 0 10 | 2,00 8, 410
Dot Re S: id. 5 19. 24
id. B. O. i. 3 21.13 14.29 | 2:00 N
Id NS id. 5 11.19 11.10 Q
et id. 3 15.12 \ pe
roughton and Simms, 2 feet. id. D 9.8 Boll a
Ramsden, 18 inch. ; id. 3 6. 4 oe 0
| Bamsden, 3 feet. B. O. id. 3 1500107014 15 | 207) 8,821
ae Bie. id. à 8.222 30,.202.18.84 12,97 8, 821
ele B. ©. id. 3 4.10,
id. R.S. id. 5 8. 5 97.16 | 218 a
x i. B. ©. A 3 drone 6186.17 13 01 9, 060
id. B. 0: id. ro DD et
ke a, eS id. 5 a | 9,01) 9,060
amsden, 18 inc 5 ‘ id. > 8. 10 106
nant, ae Simms, 2 feet. id. 5 8. 9 | a >00
 Ramsden, 3 feet. B. ©. id. 8 21.14.18 e <
id. R. S. id. 5 10.15 | 301 un
Troughton and Simms, 2 feet. id. > 19.94 96.27 \ 3.08 9.181
Ramsden, 3 feet. B.O. : Jo. 8 30. 29 2 2 5
Ramsden, is mche* . id. 3 Lis 6
, Ramsden, 3 feet, -B. 0, id. 3 18.18 8,083 9, 181
* Troughton and Simms, 2 feet. id. dre 15.15

   

 
