  

a

 

 

  

  

 

 

 

BASE MESUREE

 

 

 

PRECISION DE L

A BASE GALOU

 

   

 

          
    

 

 

   

 
   
   
    

     
       
      
   
   
  
 
     
   
 

 

 

 

 

 

   

  
 

 

 

|

 

 

 

|

 

 

 

|

   
   
      
       

 

    
    

   

ERREUR MOYENNE
NOMS DE LA BASE MESUREE
N® LONGUEUR — —|
S > TQ > I ” > Ai
DES PAYS NOM ET ANNÜE DE LA MESURE | EN unırfiıg | NOMS DES POINTS EXTREMES
m EN PARTIES | | m
5 DU LOG. | 8)
ee en ee F: ee nn Er == Be == a en en = nn = mes oe en nn
| / Baktäpur-Manganäl ......... 11991557
47 | Baden 184b.2,.222 0,0... 41578, 548 = — mu DE 94268, 55
\ Bächäpäli-Dudäla ........... 81163, 92
|
\ Chotaki-Newäni ....2...2.2..2 | 58801, 15
48 Sonakhoda, 1847-48 ......... 36685, 795 7 —
Kanchäbäri-Newäni........ 74224, 91
|
| |
£ Pathrijala Sura 0 136534, 96
4) Chachor Attok, 1853-54 ..... 41345, 422 — a
Khagriäna-Surla ............ 164200, 71
|
a r:Bol-Bolalio.. 2.2. 86858, 07
= | India.....:( Karaki, 1854-55... ....... 38624, 322 a. 3,6
751 880 ) I I
| (Mäio-Bolalio -, 20 89289, 95 |
| 0
\ Marki-Gumen,. ...: 2 0. 70734, 96 |
öl. Vizagapatam, 1862-6: 34778, 3° — = <<
sa] 2 en N ) Marki-Vizagapatam Basiline | |
\ S.End::...22: se 61963, 04 |)
| 5
| a
/ Bannergatta-Tirthapalli ..... 138506, 96 |,
|
h Halasurbetta-Tirthapalli..... 104859, 68
52 Bangalore, 1868............ 36083, 626 nn 3,9 | :
ee nn 1123 596 a
3 Rangaswamibetta-Hemagiri.. | 81873,38
\ = I
| \ Kolar-Bhupatamma.......... 54522, 47]
| A
| | 2 2 =
\ . ‘ °s > gps ©
| 5 ; ee 1 Rädhäpuram-Peddaranga- E
53 ' Cape Comorin, 1869......... | -8912, 528 or 9,5 | Puram cn. 19077. 90
448 431 | u
| , 3 1 | n:
» mat } NEN - . en>rr NER
54 urn er 2180, 421 1147 500 | 3,8 Goba-Pradaa6 . nn. 50556, 050)
al |
fr 21 . mg /» ON) Me 1 R‘ |
55 Arcos de la Frontera, 1876 ®).| 2483, 734 nm | # 2 | Gibalbin-Algibe........!.... 47344, 57
ni x a, S : 1 | : a
26 -Espaune; > Vieh, 1877.92... 2483, 343 1855 087 2.4 Roelös-Matagalls........... ..\:.21939, 8
ou yig 3
FR AT: m %) rr 1 | | ® IT® Oct
57 Olite, 1879 ®..... ee 2054, 575 1706 558 2,8 |, Higa-Vigsit oc, 129824 8
gi
58 \ Cartagena, 1879 ©) 2700, 380 I 7 fi ae | argg
BE DONIN OEH en Nee id, & 3547 599 1, Columbares-Santi-Spiritus... | 37891,1

  
