+8 Pendel 2 gibt die Ost—West-Componente.

 

 

 

 

mean za, 4... Nord Sud. "
Nord mL
7 nn
su an
® De
2 +6 SS
® IS
a e =
-11
+
ii
"
|
[ ae a meer berechnete halbtägige Mondwelle M,
E DA Rain) | -- theoretisch für starre Erde.
Ba)
Me nt 74

a Ta Ta Fame are HT

 
