 

 

 

 

 

            
 
 
 
  
 
 
 
  
 
 
 
  
 
     
   
    
   
     
    

 

 

 

 

 

 

 

 

 

 

 

 

 

 

 

@
Ä 6
. zZ 1 «
5 % 3 | 2 u R 4 2 3: 4 5 6
ZERA Bun n en
ee ‚LAVORI DI LIVELLAZIONE
: VEVERNE ® Sm
Domösassole RR $- . Be Tonale % N SE
. x, x ; = en eo. % & | ' % e 5 ; 46
u Yyhass IE „„Aalholane ı Game | Linee livellate prima de! 1893
“ ı\ Avon deren: 4 u it Sirasolde
ı ns dorghem \, a ..
ine 3 ___._ Ninee livellste gel 1895
Ä Linse che si |ivelleranno nel 1894
BIUSEN
a Linse che sı livelleranno dal 1894inpon”
® Mareografi
ia collegati
©  Medimarimetri I
alla livellazione
Ä ö x i Ale
a Idrometrt lungaı mari
„» Mareografi che funzionano, ma non
ancora collegati alla livellazione.
| © Medimarimetri progettati.

431) I“
| Inomi dei Capasaldı comun: alle liv.”'estere sono sot.|
| A tolinsati in ressa.
| a |
| £ \ a BSCHTE
N on | nn 2 Orlanz

Aal Kapalın Flussometro) un
| Termoh '

! "19 R N EL IMON
Civävecchta N 8 n 4
a Manfredonıs :
n_ Vnktuatura -r
i | \ Faggian__
l \

al !D21anelloN

|
Napolı

40,

391

38H

Sun

5 Scala di 1:5000,000
5 % 3 2, 7 oO 1 2 3 . 5

 

 

 

) Settembre 1894

 
