 

 

 

 

 

 

 

 

 

 

 

 

 

 

 

 

 

 

 

 

 

 

 

 

 

 

 

 

 

 

 

 

 

 

 

 

 

 

 

 

 

 

 

 

 

 

 

 

 

 

 

 

CANEYAS TRIGONOMÉTRIQUE
INDIQUANT
L'AVANCEMENT DES TRAVAUX GEODESIQUES

 

EN EUROPE

 

 

 

 

 

ECHELLE 1:10000000.

 

 

 

 

Les longitudes sont rapportées au méridien

 

de lile de Fer 2 20'Ouest dumeridien deParis

 

 

 

 

 

 

 

 

 

 

 

 

 

 

 

 

 

 

 

 

 

 

 

 

 

 

 

 

 

 

 

 

 

 

 

 

 

 

 

 

SE

5 AR Beret |
‘a a
el Y
VAR

 

 

 

 

 

 

 

 

 

 

 

 

 

 

 

I | Rx

Ternesrr BR

lo AY eS
{ey |

 

| |
kAncone)

|

 

 

 

\consm) NTI OP

|

 

 

 

 

 

 

 

 

 

 

 

 

 

 

 

 

\ 7 ER
\ le] Fragt Br Ag

 

 

 

 

 

 

 

 

 

 

 

 

D'après la Elfe annexee au rapport du Colonel
Ferrera 4 {5 conférence geodesique de Munich en 1880,
Conte 1e en 1803.
mis eu courent pour la Com

 

 

 

ence de Rom

 

er

\ \ | : ae ; : 5
u SS = — SES > |

50 | sa

 

 

 

 

 

 

 

 

 

 

 

 

 

 

 

 

 

 

 

 

 

 

 

 

 

 

 

 

 

 

 

 

 

 

 

 

 

 

 

 

 

 

 

Flörence_Institut topographigue militaire - 1884.

 

 
