 

 

 

 

 

 

 

 

 

 

 

 

 

 

89° =

 

 

 

 

 

 

 

 

 

 

 

 

Saxe.
| INDICATION | : I DIRECTEURS
à DES POINTS. | won ET OBSERVATEURS. aa ae
|
a at le ode er _
fo Pouras..... .. | 50° 16'48" |. 290 181 97" 1877 N. 26, Baviöre.
2% | Ochsenkopf 1:90.21: 02 :1.29..98 26: 1877 | N. 86, Bavière.
3 | Stelzen . . . .. 0020 9 20-37 OO 1877 à |
er Roden. ..... LOT 01: 20: 29 48-50 | 1874-75
DM ROUST . : . .:. . 50:90:18. 29.51 30 1875
6 | Kuhberg.... 50 36 10 | 29 53 0 1876. |
7 | Kapellenberg ... | 50 11 16 | 29 56 30 | 1876-77 Hire
8 | Leipzig... .. Ll 20 Fe so 217.186 | À PEN
Sal Leipzig . . . .. 51 20.0130 3.47 N. 31, Autriche.
Observatoire |
9 | Aschberg . . .. 0099 99 | 30:10 ,0 1876
10 | Pfaffenberg . ... | 50 48 45 | 30 23 5 1875
Br Rochlitz... .... | 51 1 30 | 30 26 10 .1875
zer Höohkure ........| 512515 | 30 27 30 1874 N Sn ee
13 | Fichtelberg .... | 50 23 46 | 30 36 55 1874 u ee
2 eollm.....: | 51.18 15 | 30 40 20 1873 a
15 | Udohöhe ...... 1,090.53. 20.80 49:10 1875 2
16 | Weida...... 1.55.17 301,30. 5&°40 1873 et
#7  Freiberg...... 1.50 54.12 | 30.59.26 | 1878 =
18 | Bernstein . 50:32 18 | 31. 7 40 1870 2
19 | Baeyerhöhe . 5.42.32. 031 27.45 1873 a ®
oo Baselitz. ... .. | 5114 15'| 31 8 10 | - 1871 ep pa
21 | Rasehiitz.... toe thy 4005 319-20 1871 Ai 3
Basisendpunkt | ;
22 | Grossenhain.... | 51 18 21 | 3113 3 1872 2
Basiszwischenp D
23 | Grossdobritz. . . . | 51 12 30 | 31 13 45 1871 5
21° Strauch. ..... »5°.23101 31 14.20 1877. 2%; 2 N. 68, Prusse.
25.| Quersa . .... 1151:18:30 |. 3116 50 ia. 2 a
Basisendpunkt
Dresden. .... 51:343 | 31.23.47
Mathémat. Salon | |
Kahleberg 7.504511 |31 9850|" 1869 z
Buchberg. ..... 5114 10 | 31 29 40 1871 Na Que
Porsberg....: ot 0.50: | 31 38 Sp 1869
Keulenberg .. | 51 13 42 | 31 36 55 1810
Schneeberg . 550.47 41 | 31.46 20: 1869 + | No
Be... 1512135. 51 48 50 1867 | :
Valtenberg yee ols 431/131 56 29 1868 |
Lausche. . .. ... | 50 51 3 | 32 18 30 | 1867 re
Nostitzhôhe . . . . | 51 15 29 | 32 21 40 | 1867 a.
Jauernick 31 5.43:1.39:33.10 1867: N. 20, Autriche.
Jeschken . ... 5 32

    
    
      
  
  
      

 

 
