 

i
|
|
|

66

7. Le niveau moyen de l’Océan Atlantique

a Bayonne au-dessus du niveau moyen de la
Méditerranée a Marseille, d’a-
pres le nivellement general de
la France, III 153, 1 378,

1235 DI 106... „2...
à La Rochelle id. ia. ere
a Brest ad... 2.2...
a Calais (Manche) did ee

Done le niveau moyen de l'Océan Atlan-
tique ou de la Manche au-dessus de la Bal-
tique

OO ee .
a Roc ......2..2.20.: 2eseen
nen

alas 2.2.2222 a

ne

 

 

m.

0,856
0,400
1,022
0,753

 

 

Hauteur au-dessus
du niveau moyen de la
Baltique

+ 0,159
— 0,297
+ 0,325

 

+ 0,056

 

=
=
È
a

eT dL

Jah mil

Ah nn 11

À 26 ml Ms a

 
