 

sodo9sommm TG %

G ou zyong
op [enwıze 99199

 

er
1%
“pl
pi
SR
a
ge
jur
8
au
Spt
vr
Eur
pl
au
zu
a
“pl
an
zpN
sp
zul
at
au
aD
aD
sur
ap
“pt
au
zDr
gen

 

onZuojuog op 'dey

 

1067

10-0067

0067

0067

6687

 

Desce ae
 70& Ve ee
ea 9oı<©
sehe Vcae
| go a
reg ey

[ Base oc
SEeaı I 9ce
Be Ve rc
em ı se ze
Orte (ee
Be sea
I ee:
s 6er ITrım ce

| 9E Er | 6877
ST, Ss ner

| Seo u 1 ıec&
ea mi

| 269 v | or ge
Sua ı Ve

( we oo
ben sem ce
we der
ww 70 | 08 87 &
10 70 ,058%8
1 68 87% | 66 & &&
61070 | cc 85 €E
gan) 19 goes
Bo see

| caoeo Venaee
181.66 co 86 ıVE 068

 

souuoruowu vloq |

“(ogıqnd uon) e[sIeng-FenoyseT 9uusıpLiam e] op uorrenSueLLT,

ekeyren IA
oyeaqnof IA
IONO TH
epequelt

TEOSE PET

ep IS JelBio
Suıvy IH

Yello] Jo J9qnoIey
ween u9 [pay
essnom 9Lndeg
ıw[pozam

NOLıq og
noLIyıng Pano
insenay 7
yezznon)
aUrPnoS

ago TO SeH
EluoT

eo,

epeıy [IH

ezuen |

oyeamaN Ua sSnoy
aqegalpv IH
ourwrealg Pong
wmaLloz POng
MIDI PEN
aypnoyg yaeq seyy
eig] [2 peno
suyyea]L nog

ap 9 no
yeınoz,

(penogolq

Souayy IH

 

stieg op 4 |
sInoJeA Ast syuro
sonbrewoy syuommm.asu] . anbodyg [US NP) opnyrer m oN
al.
| -a9sqQ 79 S.MOPAUIq a9rdıumoa ‘gs sop uoredıpu]

opnnsuoT |

(Be

 

   

 

I ei ak ann u ln Li.s

  
 
