OUR Cb HA

D

 

INDICATION

DES POINTS.

Fuchsberg
Wargelitten
Königsberg
(HaferbergerThurm)
Königsberg
(Sternwarte)
Galtgarben........
Condehnen
Wildenhof
RUIN Zest ees
Nidden
Lattenwalde

(Leuetthurm)

(Kirehthurm)
Lepaizi
Algeberg
Kalleninken
G@ilge =. =. Dr:
Legitten

Wildenhof
| Trunz
Sommerfeld
Talpitten
Brosowken

(Gr. Waplitz)
Stegen (1837)
Buschkau
Dohnasberg
Schönwalder Hütte.
Thurmberg
Boschpol

Barenberg
Gollenberg

Klorberg
Sprengelsberg

Vogelsang
Luckow

Koboldsberg
Künkendorf
Templin
Hausberg
Freienwalde
Prenden

 

 

| 54 15 38

| 54 28 32
54 26 54

 

| 54 12 31
| 54 10 39
53 51 52

Kleistberg. (1841). . |

 

Ebd AGREE
| 53 414 11
Buchholz ........- |

LATITUDE.

54° 45 55”
54 46 33
54 47 24
54 45 10
54 41 53

54 42 53

54 48 29 |
54 47 14
54 20 39
54 15 14
55 18 25
5D x 6Y18
55 43 45

42 40

 

5 38
5 17

Gradmessung in Ostpreussen.

LONGITUDE. |

|
38 317°
38
38
38

38

45
39 14 2
38 59 31
38 54 39
38 41 37

 

 

 

 

54° 20' 39”
54 13 14
b4 3 20
54 0 7
5350 8)

54 20 40
54 13 12
54 28 15
54 28 26
54 13 32
54 33 2

54 39 26
54 20 9

54 5 45

5350, 0
53 28 21
593 29.0]

Dal2r ou
52 59 27
52,59 91
53. 121
52 54 18
52 45 13

38° 447”
87 12 12
3786 1
37 20 39
36 52 58

36 46 54
36 3, 59
36.36.19
35 53 58
35 47 32
35 36
35 25 39
34 52 45
35 0
34 11
34 5
34 25

53

14 e

27

46

3

12

22

52

25

57

34

10

25

38 30

 

 

52 46:46

12 38

 

ÉPOQUE.

+

 

DIRECTEURS.

Küstenvermessung.

 

 

 

INSTRUMENTS.

 

 

 

 

REMARQUES.

Publikation N. 1.

Publikation N. 2.

 
