 

 
 
 
 

 
 

 

 
 
 
 
 
 

 
 
 

 

 
 
 
 
 
 
 

 
 
 
 
 

 

2 : I [ & are a Bun a9 > 1 In ==
\ & 1 = m ae Ne = = a. er S
5 = So = Da oo = S = - 5 2
ER | | a | | ae | 2 | =f: | = = |
I I I I ! I i | |
a i ER en
I >
- e - & a ee n N = u ee - aa
I | ı | I I | | | | | N
5 f | | 1 == | |
\ l | l | | | | | | | | | |
5
%
B = ER - SIR EET a Ne N N =
8 o
A
‚

SEES he a ungenau ee n a

  

un em aaa sUrAaUmenaaere z

 
 
