 

42

AR. 1870.0 Epoche der/Anzahl der Ge Decl. 1870.0 Epoche der|Anzahl der

j
q
i
i

 

 

 

 

 

 

 

 

 

 

 

 

 

 

 

 

 

 

 

 

Catalog. Nr. (ohne Beobach- | Beobach- | wight (ohne | Beobach- | Beobach-
à Eigenbewegung). | tungen. tungen. | Eigenbewegung). | tungen. tungen. i
1% 1 Draconis.
Groombridge . 11537] 9h 18m 22510 | 1807.2 | | 7 an + 81° 53’ 508 | 1807.2 6 34;
Struve 2001 20.74 | 1814.7 6 — nn
Schwerdi. . 6.001 568 20.22 | 18274 | 57 ja 50.5 5 1897, 4 46 Lit fs
Greenwich 12 Y. . 818 20.69 | 1838.7 5 1 50.6 | 1838.5 20 2
Greenwich 12 Y. .| 818 20.68 | 1845.0 6 A 50.0 | 1848.5 Che chit
Radcliffe I . . . 12324 20.43 | 1845.0 | 5 u 50.9| 1849.6 1% 14%
Greenwich 6 Y. . | 666 20.24 | 1851.0 7 1 re 00.2) 1851.2 ih Laas
Carrington . . 11881 20.39 | 1856.2 | 3 50.2 | 1856.2 Bio
Greenwich 7 Y. HET 20.16 | 1860.2 2 2 50.2 | 1860.2 Bea tl]
Washington 13932 20.17 | 1863.5 ae 1. 494, 18638.7. | AB i
Radcliffe IL .:. 945 20.42 | 1856.6 5 ek 49.6 | 1856.9 5 A
Greenwich N. 7 Y. . 1153]. 20.11 | 1866.5 4 1 49.3 | 1866.5 4 1
Greenwich 1868 376] 19.91 | 1868.2 4 25] 48.4] 1868.2 Gi)
16% Carrinseton 1457
Schwerd . 990[ 9h 47m 21557 | 1826.8 | 2 ‘fait 84° 8213175 | 1826.8°| 2 vs
Radcliffe I. . . 12404 22.82 | -1852.8 11 31.0 1851.6 | 5 on
Carrington . . 1451 22.24 | 1855.2 3 i 32.3 | 1855.2 | 3 1
Rance 2. 989 22.40 | 1857.4 22 iY, 31.4} 1856.8 | Dr,
Radcliffe 1862—1864 .| — 21.46 | 18643 1 if, Stil 18639 | «rs A
Radcliffe 18651867 .| — ee li 31.5| 1866.2 | 10. a
Radcliffe 1868— 1870 — — — ne = 30.6] 1869.1 | 9 1
19: Carrington 1516. 1
i Bradley . . 1399] 10k 10m 31506 | 1750.9 | 3 iis f+ 84° 5474077 | 1750.9 | A hee a
| Groombridge . 1620 27.31 | 1807.3 8 eh 40.0 1807.3 SHE
Struve 83 2110) | 18152 | 2 a — Hh ew LO ee
Debwerd 1. 610 28.00; 1827.51 i 36.4 | 1827.5 bas eit
Greenwich 12 Y. . 867 210 | 185809 11H06 mes — | — de
Greenwich 12 Y. .| 867 a er md 565) 18455. 209.
Radcliffe I. . . . 12462 22.15 | 1849.6 20°. 1] Dr POOR alu
Greenwich 6 Y. . 1.697 21.43 | 1851.0 we | ae 30,8) 18518 | 1 Wivalar);
Carrington . . . 1916 20.80 | 1855.1 Br vid 36 9 18054 3 1
Greenwich 7 Y. | 185 20.62 | 18605 | ore lei 35.7, 1860.8--l600 Qed 2;
Washington . 4275 79.814 | 1861.9 an AY, 34.9} 1863.6 | Dd
Radcliffe II. . 1012 2067 |: 1858.17 dde, ie 30.6 | 1854.3 40°. 1 |
Radcliffe 1862-1864 .| — 20.24 | 1863.2 4 eh 36.0| 1863.5 42 de i
Radcliffe 1865—1867 . — — — a 35.6 | 1866.4 8 1 4
Radcliffe 1868 —1870 — -- — — - 50.1] 1869.8:) 7 1 j
20. Carrington 1538. i
Groombridge . 11633] 10 15m 3830 | 1807.5 Pid 83013 81| 1807.5 6 a j
Struve . 86 2.66 | 1815.1 2 5 — a = ir
Schwerd . 624 0.52 | 1827.0 4 ae 2.0 | 1827.0 4 >
Greenwich 12 Y. Stl — — _ — 3.8| 1847.5 9 1,
Radcliffe I. . 12482 0.58 | 1845.4 7 1 3.6 | 1844.8 6 1
Greenwich 6 Y. | 109 0.85 | 1850.5 à ys 31 1860.01 20 2
Carrington . . 11538 14 59.94 | 1855.2 3 a 4.4} 1855.2 3 1
a Washington . 480) 59.12 | 1866.8 4 ik 3.4} 1866.7 8 que
li Radcliffe II. 111022 59.69 | 1857.6 5 ie 4.9| 1856.0 3 =i
(| al. Garrington 1707,
Groombridge | a8 11h 22m 38854 | 1807.3 6 a + 81° 50.305] 1807.3 | 8 EN
Server... LM pO 38.10 | 1814.9 3 i ee = Fa Fa
Schwerd . . | 684 906,11 | 18274 5 ih 32.4] 1827.4 a ay
Radcliffe I. . . 12691 30.93 | 1843.8 5 a 32.5 | 1846.3 D a
Carrington . - 11707 30,67 | 1856.2 3 33.4} 1856.2 3
Washington . 4785 36.32 | 1846.3 Mi Su 33.9 | 1869.3 2 Si
Berlin i 34.54 | 1865.9 9 11/, 33.5| 1865.9 2 2a
22. Carrington 1798.
Groombridge . 1850] 112 58m 13581 | 1807.6 6 3/,]+ 86° 18’ 21/7 | 1807.6 7 on
Struve . 2 14.51 | 1815.0 + N aa a ue FES
Schwerd . .| 711 12.07 | 1826.3 4 a 24,5 | 1826.3 4 a
Radcliffel. . . „2792 11.34 | 1850.2 41 Bun 25.9| 1847.9 16 de
Greenwich 6 Y. (02 10.20 | 1850.8 4 iL 29.0. ASS ME 1
Carrington . . 11793 10.95 | 1854.7 24 2 26.9} 1854.7 24 2

 
