open

i

TERRA TIBIA |

 

PR OR SET TY |

Ei]

 

 

 

LN gees eer

 

 

 

 

 

 

 

cs
| Eh

 

AM

KM

u ul Tl
NO

all

I

|

[a =|

1b

ML

|

|

= —
ee
ss SS

SSS

a

ill 1 Im (LL

 

TTT oh
1 pit it

 

Xi MANS
am oo Te sitter
| Th N
EN) N
, OU
N LY N
7 A \\y À

I

y
N

N

|

ll

 

 

 

 

 

 
