 

 

112

Cötes de jonetion et leurs longueurs

mn

 

 

 

| nn mn m
Reseaux r = des ı ee relatives | 4
ee ogarithmes| fonctions |lOgarithmes 5 es cötes
partiels en le, des cötes des eöt&s | des cötes | jcuıs
5 > connus, : Ü calcules, calcules, Sales
A.km1. eh Ak. [e]k ®R.
10-8%X |10-8%X | 10-8%x
; 1
Triangle [103). (Guachanama- (Guachanama-Los + 874,54 |+ 93,48.| + 879,50 |# gg 3790 | # 1,225
Colambo) Pozos) x |
57.131 ın. 60.514 m.
e = 1
Triangle [104]).| (Guachanama-Los | (La Masa-Los Pozos) 879,50 254,01 915,46 | gr 440 1,044
Pozos) 49.537 ın.
60.514 m.
: n 1
Triangle [105].| (La Masa-Los Pozos) (La Masa-Ereo) 915,46 39,07 916,29 | gr gg7 0,708
49.537 m. 33.564 m.)
: 5 En ; 1
Triangle [106]. (La Masa-Ereo) (Ereo-El Buitre) 916,29 118,41 923,92 17 006 0,741
33,564 m. 34.815 m.
5 . : ; 1
Triangle [107).| (Ereo-El Buitre) (El Buitre-Punta 923,92 182,29 941,72| Gen? 0,630
34.815 m. Arena)
29.069 m.
: , : 1
Triangle [108).| (El Buitre-Punta (El Buitre-El 941,72 174,55 957,82 453412 0,900
Arena) Ahorcado) er
29.069 m. 40.798 m.
1
Triangle [109]. El Buitre-El (Terme est-El 957,82 0,88 GOLD HL = ro: 0,620
g £ ’ ’ ’ 45 342 ’
Ahorcado) Ahorcado) SIEH
40.798 m. 28.090 m.
1
Figure 11. (Terme est-El (Terme est-Terme 957,82 322,46 1010,58) Gagzı 243 HM
Ahorcado) ouest) {
28.090 m. 8.220 m.

 

 

Erreurs moyennes

 

 

III. CoRRECTIONS A APPORTER POUR RÄALISER L’ACCORD DES BASES AUX

RESEAU PRIMORDIAL.

ANGLES DEJA COMPENSES D’UN ENCHAINEMENT SIMPLE DE TRIANGLES EXTRAITS DU

 

Erreurs moyennes

L’enchainement choisi est celui represente sur la planche Il: Ohaines de triangles
pour lesquels Vaccord des bases a Ei6 realise. Trois chaines partent des bases de San Gabriel,
Riobamba et Viviate et aboutissent au cöt6 commun (Aupate-Yana Ashpa). La valeur definitive
de ce cöt6 a &t6 caleulde de maniere & rendre minima la somme des carres des &carts entre
son logarithme et les trois logarithmes des valeurs du m@me cöt6 caleulees en partant de
chacune des trois bases.

 

nn

 
