 

 

|
|
|
|
|
|
| ©
| [7
|
|
|
l
|
|
2]
|
|
|

 

 

 

 

 

 

 

 

 

| a | 7)
= ©
= 5 |8F
8 Name of Station Latitude | Longitude Name of Observer Instrument = 2 I 2
| i © | wi
| | Ba ee ee
11 Dasha | 1° 86° | 67 3735 C. H, Tresham T. & S. 12” N9.2 | 190940 | 2
19. Malkandeu 0 2 wer 26 9 53 4 “ 5 4190910 ı 2
13...|.Sakımar er ee 556 51 44 n n 1909 10 | 2
1422 nSaleshara A 2954.| 68 25 6 5 S 1909-410 | 23
15: | Tanıshpa ae RL FR 1097 94 | » on 190910 | 2
16 | Sprnabau a 2. 349 5219 » n 4909-40 | 2
An | Mazwashah Dabbarı 2... 2346 | 69 638 5 # 1909-10, 2
AS omakuza a 185 3924 = » 1909—10 | 2
ae. 0.020. 80520% 3116 5 190910 | 2
Som Behr... N 4614 | 70 459 „ 5 4190910 | 2
92 Sunkhulaea. 2.2.2.2... 108312450 53% 5 s 1909—10 | 2
"Langawala..... = 03050197 4318 n n 1909—10 2
(Great Indus Series)
launsag a see ende, 41 52 390 » 5 4909-40 | 2
(Great Indus Series)
Series Upper Irrawaddy.
o 4 n o ‘ u
Kilanstebeisn.. 28 wu 2359418, 9675456 Lieut. Cardew IB So ON. 3, 71909210 2
(Great Salween Series)
Diiakan Bump = 4338 97 1047 5 » 4190910 | 2
| (Great Salween Series)
12 | lo Lone Bumı a2 20. | 24 2550 42115 h | 5 190910 | %
9 Na Bun ei... ; 4953 34.42 5 n 490910 | 2
a Kumtuneg Bum sea: 46 45 918 5 5 1909-—10 9,
4 Wwlonore@Bum sad... | 50.19 42 40 5 n 1909—10 | 2
925 MarausBume ma 9200, ı 25 1848 | 30 0 = a 1909—11 >)
6.0 Matu Bbume 2002 : 192 59 44 5 5 190914 | 2%
7» Kauhto-Bume se >. el 23 5398 » " 41909—10 | 2
8 Sinslens Bum a2... | 32 44 42 33 „ a, 1910—11 2
97 7 Gwimanebun na, | 28 9 | 96 5996 n „ 4410—11 | 2
410, E Kumons Bump ar 3814 | 97 334 n : » 41910—14 2
A Bumsal Bumeıı  rı. | 2120 | 96 3259 5 5 41910—11 9)
or koimyerı a a ei. BUS 9942 = . 141011 9
13 Bundaw, Bun an 45 49 38 n ” 4011 2
12" Nambang Bum 2222 u 1444 al al Not observed n — —
Series Kashmir.
Nerheisss rer . 88324357 | 73, 32/46 J. de Graaff Hunter & EA
| (N. W. Himalaya Ser ies) Lieut. H. G. Bell. | en
| KlogHaie er 4412 | 72 5738 J. de Graaff Hunter T. & S. 12° N0. 4 | 190910 | 2
| : N, W. Himalaya Series) le
SO IN De ee | ; + | I8 98 %k J. de Graaff Hunter & En
(N. W. Himalaya a Lieut. H. €. Bell. | 1. & 8. 12° N0. 5 | 190940 | 3
1 HGansa;Choti surıar. . | 34 A831 4749 5 M 1909910 | 3
2 | Mianjani ae . 6.20 24 26 J. de Graaff Hunter DISS DEN 2 190 A >
3 | Kaerkhane a8 RR 1626 45 59 ä x 4190910 | 2
4 | Kakwaka-Pahar . . .. .. 195 | 5956 | de Graaff Hunter & | T.&$.1% No 4 &5| 190910 |9& 3

| Lieut. H. @. Bell.

 
