 

een wehren meer +

RER mn tere Brees ater tomers Te m

I

 

 

 
 

 

 

 

 

 

 

 

 

mepIEM« F 9°96 | 99°90 88 LIS | POSTS OSF “NEPTIMal b | POOLT | LPLLT9 08 |6TP86 SEP
ere Due [gene st sae Trcos nde “DEAYOS[M xl IL | LESS | 886060 PHL | 18699 LPP
‘gasuogtx|@ | OOSLT | 61S°L1 61 69T | 8°8698 GOFF neYOSNG x BI) LOPS | eeepa ng Lg |9'6809 828
“USFMOFUIY x! GL | 86718 | LGVTSSh 86 | $6889 LOST ‘Sroqseuyods| 9 | PSOLI | PESATOV BE | SEES CEST
AYO Yx| TL | SOSLS | SINLG SY ES | O'SLLE GOSS open | —| —— | 209°8689 & —|
‘uepion |— | —— |esonPses.—l —— . Le
. f n 20 %
gonaıqssıuoy ‘OI „SgL. Jumndorseg “orequanu,n |
monagsstuoyg| OT | PPE'SS | 99889 61 6VE | 8'8698 607 F soyongel ¢ | epr'9¢ | 6089999 St | OTIS OLE
TUNE € | POLE | #9E0EB 16 | 66560 P6ET ‘yonaqsSuoye| OT| GSTPS |OLEPS IE LET | POSTE OFF
De m Oe Oe et next TT| 26786 | 50'888 St | LO8ST LIS
‘OP[VAISNSUY x! COURT |SBFELOL SST FPCOS FIST] cop SunFoysoyg Sroqumansıs | sum | 989L L Fe | 61786 898%
“Depurls| FL| S33 Lh | SPL TP ST TIL | SLS9L L89°F mop | = coger
“TaYMOFUIY x! SL| SZESS | PSS CGI SS | PF 18E8669'h
mopioy | oo 9 | = neste
‘ogsuaq x ‘6
É 2 mepromslr | Lestss | 1s9'se Lg BSE | S9TTS OLS
se | Lues eue ss 0e bee | er soystivyx| 6 | FrLOe | 8806 FS 908 | S'L097 188%
POs body | COL 08 We OUT ‘sostogitx| 6 | 00/08 | 68596 IIL | 66880 r68 °F
ou) 0e eet a ee ‘qonaqsS1uoyx| OL| 6106r | 966 6F ST SP | L'2608 068 F
Saoquouqersl et) SIPS | LAC BP PY JET |G'PIGE LOF A | === lees ©)
nepueig« FL| L06°98 | 900°1808 19 |S PETS 199%
298094 %| 6 | 8899 |91S9 IT & PCOS PIS PF Toyong 'e
momo || IT UE I a
| .
| epee nsay à Sroquoyorel L | CEST |ePrister 18T | 59708 0187
oO oppemgsnänygig | TESLE | 9SL'L608 LOT | T6109 8837
| “BLOQUE Te T | TOLPS | 098 PS 96 966 |)9'TILS SEP oosuoqme 6 | JISGS 608866 19 | SOFIE THOT
| ‘Broquouyeqx| 6T) OGL‘6P | COS 67 F6 ES | L'B0Sh 999 F TOTMLe| & | SOOST | L8OST SS 96 | S'L097 LES T
‘opjemysnsnVx! 8 | 669° | 1Shh 69 SS | 91896 68S°F ‘weplon |= | == 2088 © oC ete a
HISPION, |= 1 > =— loose es | ==
TOUSTI®S 5
omoyaeTey % J OMSTIe Mac
R ¢ | ¢ . ¢
‘1981 SunSopsox ‘SroquanqLe G | OCSTS |JSTIS GS BIS | 80888 SEC AE L 80T LE 166 98 98 9TT 9 TLLS CSV F
À 5 | apjeaysnsnyy| § | OLS6L. | FELGTI 19 |9'088F £L9
neyyosngy| ZL] 889FS | SPLST IST | L'COLL LE V rete | ee, Ge ore ne
"yreMmosegy| LT| 2608 | 48088 ST 901 | 8 TL60 819% Cee re
Do Ces | | ae EL mil
‘Gleqseuyod ‘9 = S19q conor «|
ee 2.2 2. 000 _
yoeu Zunyyary “oN | '}YoBqosg | uayorjsessny g Bory you Zungyaryg ‘oN | ‘}yoeqoog| uayorjsodsuy Q 30
eee — — — — { { ——— —
‘ASSIULY
ZLHNSMOHNUALINVH SHHOISISSNHYIALSHM N
"NHSSAYU4I

 

 
