         
 

 

bs i R v. A Es % ® 6 Ku j
R & N t %s Cs ie A Ci ER, fa Ss |
: ie ae N re ER RT Ai RESTE Be |
. r EIER. ie SEX Lee 7 eS 1 a BET
I ie Far le Reo Tat EEE EN 33 x
BE peer so ads Fo 3 ee sade Es EN ADS À
DUR BEINEN > PE MR US Ee x 7
5 | se
# Î
i
;
|
i
à 1
|
ï
»
>
;
3
i
4
i
i
4
‘2
À KR CSNY À Dur ‘ x
ws REN vs N ae Se nn. >: : Qu CS à at Ras st > > à

 
