SEE Io rrTAeerprET FT nmSSeRF

AM aRIL  A

UML IER

ul

nl)

Em IRIF © LÖTTARIER 1LIAMINNILOM U WUEELL HA lL

 

 

 

Erreurs de clöture des triangles desquels ont ete mesures les trois angles.

 

 

 

 

 

 

 

 

 

 

 

 

 

 

 

 

 

| NOMBRE
| AUTEURS DES INSTRUMENTS en NOMBRE DES DESL UNS
= | AMPROYd EN OBSERYATIONS | DE CLOTURE
en SE SEOONDES ne EXhcurfins >
5 ET | VERNIERS POUR - CHAQUE Ar REMARQUES
= DIAMETRE DU CEROLE en OU DES CHSQUDANGLE | TBIANGLD
z ; oo MICROSCOPES ee =
| HORIZONTAL MICROSCOPE CHAQUE
DIRECTION .- a
Directions.
4 | Pistor di2Scem.-Reichenbach di32cm. | 1";5" 2m. AV. 60 39: 42 0",930 | 0,8649
5 | Reichenbach di 32 cm. id. id. BO 39 1 0,918| 0,8427
6 | Pistor di28cm.-Reichenbach di32cm. | id. id. id. ie, 35 47 43 |0",318 0,1011
7 id. id. id. ide Id: 30 24 34 0,318 0,1011
8 id. id. id. id ich 82.29 39 0,266] 0,0708
9 id. id. id. id. id. 34 29 48 1,419) 2,0186
10 | id. id. id. id, id. 52 65.48 12,139 4,5753
| id. ide id. id, id. 24 62 42 2,000 1.09%
12 id. id. id. id. id. so 18 57 12,804 8,2025
13 | Reichenbach di32cm.-Repsold di27cem. | 5";2"; 1" 4V. 2M. 2M [9 30: 50 10,070 0,0049
-Pistor di 28 cm.
14 | Reichenbachdi32em.-Repsolddi27em. | id.id.id. 2" |id. id. id. ae 0, 242 | 0,0586
- Pistor di28cm.-Starke di27 cm.
15 | Reichenbach di32em.-Pister 4285cm. | ididı a ad id a8 210 4,6268
- Starke di 27 cm,
16 id. ie ia. a a 36 42 29 |3,040 9,2416
17 | Reichenbach di32em.-Repsold di27em. | id.id.id.id. | id. id. id. 26. 39: 29 2,030, 6,9169
-Pistor di 28 cm.
18 | Reichenbachdi32em.-Repsold. di27em. | id.id.e. id. id. id. id. Id 82 209 1,740 3,0276
- Starke di 27 cm.
19 | Reichenbachdi32cm. Pistordi28cm 'd. did dd ed 24 28 28 |0 ‚262 0,0686
-Starke di 27 em. \
20 | Reichenbach di32cm.-Pistor di28cm. | id. id. id. id. a0 38 24 1,936 3,7481
2] | Repsold di 27 cm. -Pistor di 28 em. id. id.ad. | id. cd, a 43 46 26 3,737 13, 9652
-Starke di 27 cm.
22 Pistor di 28 cm.-Starke di 27 cm. id. id. id. id. 45 BL 53 0,210) 0,5041
23 id. id. id. id. 19 47.42 3,459| 11,9647
24  Pistor di 28 cm. id. id. 33.39 602 0,098) 0,0096
25  Pistor di 28 cm. -Starke di 27 em. id. id. id. ud. 42 59 80 .13.,359 11,2829
26 | Starke di 27 cm. id. 10), 40 42 25 2 oz 6,6152 Un et De triangle
appartient & la trian-
gulation autrichienne,
m id. id. ; id. 24 Al 57 0,271. 0,1376 id.
28 | Pistor di 23 cm. - Starke di 27 cm. 10. id. id. id. 46 Al 26 |0 ,636 0,4045
29 id. id. id. id. id. 50 45 44 1,499| 2,2380 ia,
30 id. id. id. id. 66 24 36 1 „Lo 5,2122
|
|
1808
DEVELOPPEMENT DE LA BASE DU CRATI EN CALABRE.
Directions.
. 2 : I: 2M 23. 30. 32 ,0),850 0, 7225
eu. id. id. 33 38 36 0",428| 0,1832
3 id. id. id. 34 32 38 110,500 0, 1296
4 id. id. id. I9 398412 0,85 0,7310
5 id. id. id. 22.38 28 0,154 0,2061
6 id. id: id. 291 33 88 1,240 340485
7 id. id. id. 30.39.25 0,305 0,1832
8 id. id. id. 10 24 42 1,126 1,2979
9 id. id. id. 82 32 29 |\0,.188 0,0190
10 id. id. id. 33 534218 0,124 0,0154

 
