 

 

 

 

 

 

 

 

 

 

 

 

 

 

 

 

 

 

 

 

 

 

 

 

 

 

 

 

 

 

 

 

 

 

 

 

 

 

 

 

 

 

 

 

|
i Gruppe Be | Mio Correction wegen Werhoss | Arithm. Mittel Halbe Diff. Corr:
À som und nn, | Ahle. Ahl Differenz. | der scheinb. der wegen Polhöhe.
Paar, oe | Se Non Ve on | cen + | Declinationen. | Mikr, Ables. | Refract.
= en. ies 4 ae ee =
1 Oct. 2. :, 0 | ;:80 20 ‚ol 1.712. 5% R | Dodo Ba AU neh
Ww | Byes ee igs we 1234.68 +3 49.27|--0.08| 21° 16 24.03 |
Dy WM \, Poor 2: eo 2.210.236 |
O | hae nn 1.4 — a a ee
| |
2 00 389 17,0 0.8 1.2 0.36 |
Ww ke a ane sc à a 286 — 1.023 | 16 56.18 |—0 30.77|—0.01 25.40
| | nn
A| W | 6.766) 2 12 8| 6.76
= 0) Ie Le nn 2-- 0.1 2 ae 5-375 | Ban 2433
5 | O | 4.683/+ 6.4|4 0.614 0.8] 4.691 | ral A
| Ww I14 a or 3\14.765 ea 2.1 2072.70 5 3.03|—0.08 24.68
u 6| W | 3.3764 7.5 — 1.54 1.3] 3-383 | |
is | | EI2.133 || ro 7: 6% Op Wi 2A SR
: | O 115.553 +21 6 0.04 ı 115.566 3. 1:93 Lt a 4-5
iE 2.0 | Ho 0.04 0.9) 4.204 0.488 21 40.02 —5 1 0.0 24.42
iE | W |rq.696|— 4.2/— 1.44 1 114.692 | Aa 0) : 4°43
IE | | | |
| Sl ny SUN oA —= Oodla= TO] Foure |
| Oo oe ae LE ee eee 5.789 | 13 29.58 12 54.13) lo.05 2.3. 716
Loo le |
- 5. | LV 2 | W 6500, 03 0.04 0.6) 6.397| , | :
| | O ra cs Ole re mo 102 | made ee a
| | | |
| 2 | Oo 31.6 0.0 2.09 0.737 | |
| | 5 Be a IST Re 2 Où |— 8 .13[—0.16 23... 0.
| | W Ien.zsılhao.d— nal 5.77.7901 (7060) 45009) as 3.65
| 21 W lho. so4lt 13.11 os! oo. |
| | I | — 1.045 | 16 56.50 |—O 31.43 —0.01 25.06
| | O | a 102 2 1.0| 9.472) 45 | I a 9
| | © 73.407 .8 2) 3i13- |
: | hw VETER ii diet) MR zo 1339
= | 5 | OW | 256222 0 0.6 1.3|18.240 8 7 8
3 iO rag 5.9| On) O.7| 5-142 a, mat 8
= | > | 2 on LE ve DG pia. 78 | 10 18.26|16 6.32)4o0.11 24.69
= 7 | N ee à ai we ee 21 40.37 —5 16,39 0.10 23.88
| i Se Lae oT Al 6 . 7 |
= 8 Où Ed
| | 9 jez sale ssfezejsle sol A ee
| | | | |
-. ro IN re 0 lea eso eee CO Oe 1.7113. 506% | 6
| | | : | . . .08 23.
- | | W | 5.969|--13.3 Ted On Ol 5.1082 Te 12 35-50 aang x ae
Rp onto) cts us) a0 nano seele] ee
Le be | |
| BE js a | é | |
| tf ty RSR SRI NS 25.57
| | -457| -7| : eo |
Pr .925|—16.6|— 1.21 o.09| 6.908| |
nl 5 > ie Es JL su ee 13 43.55 +2 40.474+0.04 24.06
| .255| .4) . : : |
| | | | |
a o 4592 11, aa 0.67 6.8) 4,599 0 | 21 28.891 5 414 008 24.59
| nr ale OTe: 31a |
6 | WM 33 aaa Hr :
ee sr en u 24.18
| | -0| -0| : :
i 2 0 3.9064 3.3] o.ol4 ı1.o| 3.910 A uno 1
3 | | | | war 5825 | 41.09 5 10.00 O.10 24.39 i il
= | W Wid aap 6:9 ra 0 2.322.495 ? a
; | 8 | W | - 5 | o rl I . 7.209 | 8 |
ë | | 7, ELI\— 5.0. 0.0.0. 2007 !
= | : | | | .766 .6 2 : O0 DAT N
= | F6 es sou ee on 13 30.69 |+2 53.44|4-0.05 4 |

I
u San

eine

 
