Vil

Generalbericht tiber den Fortschritt der Arbeiten fiir die Europäische
Gradmessung im Jahre 1880.

Rapport general sur les progres des travaux pour la mesure des degres
en Europe dans l’année 1880.

Inn wer

 

5 Seite Seite °
Baden 3. Oesterreich  ., . . .. 2.2. 2... 3
Bayern . 3 | Portugal een ee
Belgien 6 | Preusseh .) .- 2 2 2.2.2.2. 2 2 0.3
Frankreich Soe eee ew a ae nO) Russland. > = |
Hessen. . . ee Sachsen” ee
Italien. . . 2... eo... | Schweiz az
Niederlande . 2 ee
Norwegen 4 4 2 0 200 Need 7

 

— © > ©:

+ Arr AQU WT DETROIT

naar

rt

EEE RE TSAI BETTIE OTL WRT 110078

     
