SE Pr TW" |

He IF TTR TPT

#” we ge
> fg eg
x 10 # Î 8
f wf EES o>
ry \ i Or A
ins | ; if
8 ch

General - bericht

über die

mitteleuropäische Gradmessung

pro 1863.

 

Bertın,
Druck und Verlag von Georg Reimer.

1864.

 

 
