  

 

 

97

38

39

40

   

43

 

44 |.

R

NOMS

DES PAYS

 

 

 

Russie .

|
|
|

|

Suisse ... \

\

 

 

| Rogatschew,

| Orsk,

Sironj,

NOM ET ANNÉE

Czenstochau, 1848 (1)

Warschau, 1846 3

Ieletz, 1863 ("3

Wolsk, 1863 (9

Busuluk, 1863 3...

1863 (19

/ Aarberg, 1880 ©
Weinfelden, 1881

Bellinzona, 1881 ©

jalcutta, 1831-32

Dehra Dun, 1834-

1837-38

DE LA MESURE

1562 (13)

PRESSE CNET RATE FENTE EDEN ENST I

BAS

FOR RM ONE PT)

wien Sehe ein leere

|
|

| 6962, 889 (13

MESURÉE

E

LONGUEUR

M
(3)

2250, 633

5665, 031 (19

| 7713, 870 >)

8876, 479 (13)

 

|

| 2399, 943

| 2540, 167 ©)

| 98413, 531 D

3200, 298 (1

em
Or
D&D

39

Qo

OT

39184, 032

4370, 275 (9)

ox eT

1

 

 

1 800 000

1 320 000

 
 

 
  

   

 
   

ERREUR MOYENNE
DE LA BASE MESURÉE |
ae |
ee unItis | NOMS DES POINTS EXTREMES
IN PARTIES
EN ns u | ER |
: à 2 ur | 7”° ORDRE |
LONGUEU DU TOC |

 

nr
252 000

A
296 000

1 |

570 000

he
570 000

Er
550 000

Ov
oO
bo
©
S

5) |

if

1 (8)

660 000

]
921 543

 

5, 2 (#)
» | Mirow-Grabowka (

Theater-Ljiissnowolja (7)

Ope at wry

14,6 9

Sa —

. Milossna-Kobelka

ee. van liés Paire

\ Rogatschew-Tertesch

Rogatschewk-Shlobin........

7,6 (9)

pag ubowo-Olchowka (7)

Borki-Tschernigowka (7)... ..
7,9 Schichani-Kirjakowka (7...

ee =
7,7 «9 | Trimichailowka-Lipowka (7, , |

oN
Or

2,4 || Chasseral-Röthi ®...........
3,30 Hörnli-Hersberg W.........
2,6 © Ghiridone-Menone ().........

Baniban-Samali:

\ Säatten-Chinsura

19,5
Banog-Amsot .. 022...

Surantal-Kämkhera .

|
\ Bhaoräsa-Pärdho

Kämkhera-Bhaoräsa

| Lohdizhjokki-Nuppi-vaara (2),

 

    
 

  
       
  

  

LONGUEUR

     

m

   
      
     

| SE, x |
| 27572, 324

   
     
 

9642, 19

   
    

18131, 99

   
  
  

16675, 08

   
   
    
 
 

| 18608, 63

    
 

| 16740, 42

      
           

    

 

45140, 21

 
 

38387, 42

          
   
   
 

70611, 36
| 64528, 23

1109346, 55

|
|
|
|

89351,59

109877, 06

|
|

|

| 94522, 46

 

 

 

 
