 

|
|
I
|
N

Hollanderby

Basis, nördl. Endpunkt
Basis, südl. Endpunkt
Kongelunden
Frederiksholm
Frydenhöi

Valhöı

Nicolai
Basis, südl. Endpunkt
Hollanderby

Kongelunden
Valhöı

Nicolai

Frederiksholm

Basis, südl. Endpunkt
Kongelunden
Frydenhöi

Snoldelev

Snoldelev
Frydenhöi
Valhöi
Nicolai
Hollanderby

Hollanderby
Store Möllehöi
Snoldelev
Petri

Nicolai II.
00°00 00,00 | 00 00 00,00
11 55 05,65 | 11 55 06,63
20 04 58,40 | 20 04 58,79
24 18 44,24 | 24 18 44,10
62 21 43,76 | 62 21 44,63
72 22 48,51 | 72 22 49,60

| 107 32 01,22 | 107 32 01,63

Frydenhôi.

00 00 00,00 | 00 00 00,00
37 22 47,43 | 37 22 46,92
56 03 28,45 | 56 03 28,22
86 56 55,96 | 86 56 55,66
302 58 45,34 | 302 58 46,01

Valhöı.

00 00 00,00 | 00 00 00,00
33 49 95,12 | 33 49 95,39
36 44 27,90 | 36 44 28,29
64 22 41,29 | 64 22 42,39
87 49 34,87 | 87 49 34,08

| 153 50 45,94 | 153 50 47,52

Kongelunden.

00 00 00,00 | 00 00 00,00
46 17 24,51 | 46 17 24,65
58 52 23,57 | 58 52 23,39
91 16 23,36 | 91 16 23,72

135 32 11,93 | 135 32 11,89

Nicolai I,

00 00 00,00 | 00 60 00,00
34 45 31,65 | 34 45 3152
87 47 44,92 | 87 47 44,23

123 16 05,94 | 123 16 06,48

3,7029006 |
3,1872944
3,4612104
3,8279748
3,30D8812

3,6779474 |

3,6019525

3,6779474
3,5762385
3,1631638
3,7001290
3,4385065

3,6019525 |

3.4607934
3,6839332
3,8698809
3,4385065
4,0823225

4,1498176
3,7001290
3,8698809
3,8279748
3,4736620

3,7029006
4,3257767
4,1979824
9 5503951

 

=
x

MMM ma an

11: 44) than) Lili a

i
|
j
|

 
