LE ni ne

nn |

MucıE

mal RT

Johannisberg
Dünsberg
Amöneburg
Knill
Milseburg

Orber - Reissig
#25.

*Dünsberg
*Hasserod

*Sternwarte

— 53

24. Taufstein, Postamentstein.

R
one
42 39 29,8299
19 4 46,1193
130 59 6,1689
200 45 26,9629
278 49 22.0549

log. L

43128512
43994401
4,2936521
4,3155733
4,3812989
4,2892211

LY

20551,86
5086,50
19663,10
23745,06
4060,18
19463,51

Wehrshauser Höhe, Postamentstein.

0.070
108 51 37,6742
234 52 5,7264

*Meteorologischer Thurm 240 28 34,1004

*Amüneburg

*Frauenberg

Deisselberg

Hercules
Hohelohr
Dommel
Hausheide

Köterberg

Do

Hiin enburg
Soester Warte

Nonnenstein

3. Dommel, hölzernes Postament, Visirpunkt:

Spitzewarte

Hausheide

Desenberg
Hohelohr
General-Bericht f. 1865.

245 21 56,0801
295 32 16,7838

4,0275440
3,9789920
3,1304176
3,0283839
3,8379826
3,5641596

Il. Abtheilung.

10654,77
9597,79
1350,26
1067,54
6886,25
3665,72

1. Desenbers, Postameutstern.

R
Odeo
92 40 14,213
139 29 10,150
189 25 14,520
275 54 31,385
318 32 57,833

0.0.0
57 46 17,702
309 48 27,998

07 0
62158 39,939
9935 50,592
180 52 56,398

log. L

4,1006864
4, 4450525
4,3261697
4,1782091

4,3168887

4,2403635
4,4011286
4,1965884

4,1205610
4,4021253
4,3261697
4,3338924

LE

12609,17
27864,58
21191,89
15073,33
20743,82

corr. R!'

+0,1632
— 0,0488
+ 1,9249
—. 0,5326
— 0,3445
— 1,1622

+ 0,1355
+0,4707
+ 0,7667
— 1,2102
+. 0,1627
— 0,2815

corr. RY

1,180
r 1.180
+ 0,240
— 0,341
= 1070

Dôrenbers, Standpunkt nicht markirt, Visirpunkt, Signalpyramide.

17392,56 0,051
25184,23 — 0,550
15724,92 2 0279
Signalpyramide.

13199,61 — 0,323
25242,09 — 0,631
21191,89 + 1,659
91572,10 ..—0,706

8

 
