X. = Prüsse, BD.

 

 

 

INDICATION
DES POINTS.

Jablonken

Gillau
Lengeinen.........
Jedwabno

Mispelsee

Dobrzyn
Soldau

Kauernik

Waldeu. .. ....... S

Sprengelsberg
Vogelsang

Klorberg
Kleistberg (1865)...
Hufenberg
Russenberg
Bullenverg
Hochratzenbere. ...
Pollackenberg
Schottenberg
Springberg
Krummenfliess
Krostkowo ........
Jastrezembke
Dembogora ........

Trzeinentowken....
Berlinek

Mutitrin

Thurmberg
Platenheim
Przytarnia
Rittersherg
Heinrichsthal
Tuchel
Pollackenberg
Krummenfliess
Jastrezembke

Io

153 49

1534
758
I
758
53
Kernsdorf ......... |
| 53

 

 

|
LATITUDE. LONGITUDE.

EPOQUR.
ET

 

DIRECTEURS

INSTRUMENTS. |
OBSERVATEURS. |

 

Sg”
27
10
14
17
33 27
24 52
15
I
39
23
93 al
53 41

3 29

53 20

Ha.
59,49

53 32

wo

53

ANIDDAAD

oem
(51

 

53° 55:
53 29
51
28
36
50
41 5
24:
46
32
Hu

‚34 20 57

 

54°20' 9”
54 15 38
54 13 32
54 527
53 56 40
53 42 52
53 42 46
53 36 39
53 46 10
53 28 52
53 20 59

 

38043’ 46”
33 28 30 |
38 17 56 |
38 24 44 |
38 3 52 |

37 58

2

(6%)
RB

HD 09 OL OL CH SI OL

SAAISOIWDR OLD

320 46' 59"
3212 0
33 27 58
33 9 34
33 31 3
33 52 15 |
33 47
33 50 10 |
34 16 46 |

Sad
34 40 32
34 54 31
35 15 23
3 9
35 30 18 |
35 97 50 |
39 5526|
35 54 8,
96.14 1
36 16.26 |
36 Da
36 16 59 ||
36 30 56 |

 

 

350 0' 17”

35 25 39 |

35 4732|
35. 4 36 ||
35 32 21
a4 A892
35 948
35 30.49 ||

34 16 46 |

34 40 32
35 1523|

16) °

Dreieckskette 1861-62.

|
|
|
|

|
|
|
|
|

REMARQUES.

Publikation N. 4,

von Hesse.
Ne I und.6

Dreieckskette 1865.

 

Dreieckskette

 

von Hesse.

 

 

186%.

von Hesse.
- No I und 4.

 

 

”

ıı Publikation N. 4

| Publikation N. 4,

 
