 

Samara
ur Moskau
18 Kasan
19 Pulkowo

 

Netzpunkt

Greenwich
Potsdam

Breite

45.:
A.
46.:

Anm.: Die Schwerkraftswerte in

 

Höhe Schwerkraft, a

|
|

Te
62

980.903 + (10)
980.943 + (11)
980.966 + (12)
981.016 + (13)

| 981.201 + (14)

981.188 + (15)

 

981.274 + (0)

981.365 + (16)

Ba 981.564 + (17)

49 230 0270712298197 2, (d8)
207192 zen 981.899 + (19)

 

der letzten Spalte bezeichnen wir im fol-
genden allgemein durch 9+(v), wwv—=0,1,...19 ist.

 

B, 0

 

 

 

Ber l
Reihe) Nr. Station Per » on | (v) Tab Beobachter | Quelle
| E ee |
ee

1 2 Bulkowo 3 981.899 | 2 | 981.899 | (19) | 1890 | SoxorLow \eaBer2 1900, 2)

2 | Samara...... 366 271 365 do H Tabxe he
2 , Wien M.-G. I. | 980.860 | 4 || 980.860 a) 1891 | v. Sternec |\ Ber. 1900, | + 0.40
Wien Sternw. | 85414 | 853 Oo), 5 I" Tabl 20:40
B) 5 | Wien M.-G. I. | 980.860 | 4 || 980.860 | (8) 1894 | v. StErneex | | Ber. 1900 | — 0.08
6 | Pulkowo..... 981.897 | A | 981.899 (19)| „ n | a
7 | Moskau...... 566. | 2 564\(i7)| „ 5 |J | —2.55
4 8 | Potsdam ....|| 981.274 | 6 981.274 (0)) 1894 |\ Borrass |\ Ber. 1900, | — 0.07
9 | Wien M.-@.1.| 980.860 | 6 | 980.860 (8)] „ |/ Kümmm |f Tab. vd + 0.07

| | |

5 | 10 Wien M.-G.I.| 980.860 | 2 | 980.860| (8) 11895 Lamser || Ber. 1goo, | + 0-9
11 | Hongkong ...|| 978.772 | 2 | 978.771 ()| „| : a
DI Zee | 979.442 | 2 | 979.40 () ,„ ; || — 0.84

| | | |
6 13 | Potsdam ....|| 981.974 | 6 | 981.274 | (0)| 1895 | Haasnmann Ber. 1900, | + 0.00
ar | PRoburses 2. 016 | 3 016 (13) „ 5 Tape vd |, 02.00
nl 15 | Wien M.-G.I.|) 980.860 | 4 | 980.860 (8) | 1896  Krassnow | ji — 0.25
16 | Wien Sternw. | 8544| ol, : Ber. 1900, — 1.08
17 | Moskau ..... 981.562 | 4 | 981.564 \(17) , : Tab. Xi | +1.98
Sa Deo se \as)| : : | +0.03

| | | |
8 19 | Karlsruhe... 980.966 | 2 | 980.966 (12) 1896 Ber. 1900, | +1.26
20 | Potsdam ....|| 981.276 | 2 | 981.274 | (0)| „ Tab. VIc | —1.26

| | |

 

 

 

 

 

 

 

 

 

   
   

    
   
   
  
  
   
   
    

 
  
 
  

 

 

FR

 

 
