 

 

 

 

 

 

 

 

 

 

 

 

 

 

 

 

 

 

 

 

 

 

 

 

 

 

 

 

 

 

 

 

— 249 —
| NOMBRE ne
jo INDE SÉRIE DES > 4? | Mm
i. TRIANGLES

17. WY
Karachi Longitudinal 0...) 139 129. 7480 =E) 558
Ne West Himalaya: 57 - 70.2972 sey 641
& [Great Indus. EE 202 77. 9960 BE 2359
3 \ Great Arc Meridional 24° to 300... 7" ee cae 80 120. 4012 se. 108
== {Rabon Meridional,. 0, 110 35. 1961 327
= = | Gurhagarh Meridiona!. 0000000000 108 210, 8219 Æ O14
S | Jogi Tila Meridiogal. 3 61 42, 2712 se 48)
a 50 17. 9896 ee 346
Jodhpore Meridional ty 76 19. 2970 2 201
Bastern sind Meridional 92. 00 2 67 11.9219 ae 214
950 795. 9401 S526
© | Great Aro Moeridiowal Ie) joo 7 61 58. 9097 ce DOT
a  ız 86 95.2309 = .608
= | Calcutta Longitudinal 0000 0 2 108 . 44. 0386 D 369
5 jBider Longitudinal. nn... 0.0 0 60 27.3931 ae ol
= [Jabaipue Meridional 2 58 19. 0702 Æ 30
© | Bilaspur Meridiomal, 000 74 20. 2079 302
444 2948001 + AST
8 [ Khanpisara Meriionan,, nn 48 216. 7204 Æ 1.227
wyanei Meridional.. 00 2 52 219. 8966 Æ 1.187
= (5 Mer ot 19 21, 6838 = .617
a Kattywar Mn 55 161. 8132 Æ .990
S ( Guzerat Longitudinal...) EEE 40 88. 4900 BE 859
& | Cutch Coast 63 183. 7304 Æ .986
= 2717 892. 3344 =2 1.036
Great Are Meridional 8° 10 189... 2 5 142 64.8081 E50
= Bombay Longitudinal, cn... 42 89. 8414 ae. 844
2.5, | South Ronkan as >» 355. 1670 = 2.176
1-2 ) Mangalore Meridional 0 58 | 33. 7282 Æ .440
FF | Madras Monidional et ad... 98 53. 4624 a 126
1 ee I? 91. 4946 7 328
3 Madras Longitudinal 202 ...0, 5) ee 55 24. 3317 SE 364
532 712. 8334 22.068
= NorthrBast Loneiuamal ......... 0 135 80. 5490 2.486
Budhon Meridional, .......... 00000000000 om 859. 8311 = 2.249
Rangir Menidional u. 34 279. 3222 =E 1.013
Amua Méridional. 2 34 276.8010 =E 1.0647
| ara Meridien ıe 46 319.20. ae 1. 507°
= | Gurwani Meridional ee 2 32 130. 3620 Æ 1.165
pq | Gora Meridional Bil + 288, 1282 see 2.979
vo ( Hurilaong Meridional 6 37 250. 4395 = 1.509
= | Chendwar Medina 31 65. 8279 = ef)
3 j North Parasnath Meridional. 5) Ae 20 48. 1140 Æ .89
S| North Maluneha Meridional 0 21.26 124. 9439 + 1.266
Calcutta, Meridional......-0.. a 45 185. 8267 se 16 1279
Hast’ Caleutta Longitudinal... 57 44 18. 9850 er 319
Brabmaputra Meridional. 0.0. 0. 0. 57 54. 3675 zer 50
= Bastern Erontier 25° to 26 000000000 74 37. 1802 == 1.409
= Assam Longitadinal. ... 0.000000 2 57 57. 4250 + 579
: 760 2867. 3709 AO)
: 2963 5523, 3292 2.
= (Br

ml

 
