 

 

 

498

 
  

  

 

 

 

 

 

 

 

= Soe Bion || SS ee | le Bee
| : Een eles ea 2) Se = 252:
à LAND [Name der Sta} = Ze = 2|» = men 22
is on Een. en. |...» sr
= Bee eee te eh hc ole
a PAYS Stations. = Bele fle Ss Se eee =
© D No | LA cr eae
sei | SRE Ss
Den m || mm mm mm ae
Desterreich-Ungarn |.
46 Mana... 16 36 33111 411 7| 92661 993.533 | 993,616 | 993,605 | 2,8
47 ie Maa kG 33 46111 43 24) 2541 093,519 | 993,591 | 993,582 | 2.8
48 | Sigmundskron 46 29 8/44 48 7| 246 993,536 | 993,613 | 993,596 | 2,8
Bahnhof |
AY Sigmundskron| 46 28 54/44 18 48| 353|| 993,507 | 993,617 993,590 | 2,8 ||
Obseryatorium
0 Iyrol.:.... Martinsbruck|46 53 9140 28 15| 1044| 993,353 | 993,679 | 993,607 | 2,2
54 Mrafor ..... 16 33 4110 30 39| 1544|| 993,461 | 993,643 | 993,526 2.4
52 Franzenshöhe| 46 34 58|10 29 4) 2488)| 993,419 | 993,802 | 993,602 2,4
53 Stilfersjoch .|[46 34 46110 27 22] 2760) 993,040 | 993,871 | 993,602 ! 2,4
54 Brad... Me A N 2658| 516
59 \ Marisch ....|46 40 £8|10 33 48) 1076
56 Svidnik ....149 23 38144 57 47| 738] 993,815 | 994,045 993,964 | 2,7
51 | Mezioratach./49 36 44/44 40 29) 742|) 993,846 | 994,068 993.990 | 2,7
58 Pecny...... 19 34 85114 47 27| 5431) 993,899 | 994,070 | 994,014 | 2,7
59 | Schneekoppe| 50 44 13/15 44 38 1602|| 993,720 | 994,220 | 994,054 | 2,7
60 Dalen. 0; BO 8 424112 98 6| 3561 993,977 | 994,088 | 994,047 | 2,7 |
61 Donnersberg 50 33 21143 56 6 835 993,884 | 992,445 | 994,061 | 2,7 ||
62 Sadska. 50 8 48114 58 45| 213] 994,032 | 994,099 | 994,078 | 2,3 |
63 Vvysokä.…...|49 56 37115 41 32) 470) 993,913 | 994,060 | 994,041 | 2,6
64 Neies...... 30 92 9144 417 43| 205) 994,038 | 994,102 | 994,084 | 2,3
65 Rip, Kapelle.|50 23 14/14 17 36| 459 993,980 | 994,123 | 994,074 | 2,9
66 Ebene b.Klapail 50 25 22/44 O0 35| 202] 994,022 | 994,085 994,067 | 2,3
67 Hasenburg..|50 26 6/14 4 6) 417) 993,959 | 994,088 | 994,046 | 3,0
68  Jerelin..... 50 25 3144 0 %7| 250|| 99,047 | 994,095 | 994,066 | 3,0
non | Kamejk ....|49 44 2144 47 55] 624 993,805 | 994,000 | 993,930 | 2,7
70 ‘+: \ Volinivich ..\49 22 28143 48 53] 585|| 993,810 | 993,993 993,930 | 2,6
71 | oka. .....|49 39 95143 50 55] 8421| 993,814 | 994,077 993,982 | 2,1
72 Studeny vreh|49 48 22114 5 43) 659 993,874 | 994,077 | 994,044 | 2,6
15 BENOL...... k9 £9 28/43 40 28| 7161) 993,852 | 994,073 | 993,999 | 2,6
14 Gebon .... 50 O0 58143 0 21| 822|| 993,882 | 994,139 | 994,049 | 2,7
75 ASSO es 50 49 47143 45 20) 834|| 993,944 | 994,110 | 994,058 | 2,3 |
76 Bernstein. ..|30 34 19/43 28 6! 924| 993,880 | 994,168 | 994,068 ell
Til H. Schneeberg| 50 47 39/44 6 44| 748|| 993,924 | 994,157 994,080 | 2.6
78 Jeschken ...150 44 2144 89 20) 4040! 993,875 | 994,190 994,086 | 2,7
m» | Mells......, 80 25 5145 49 6! 430|| 993,977 | 994,110 | 994,063 Pel
80 BOIS i... 30 32 2Bl44 43 26] 565|| 993,950 | 994,127 | 994,066 | 2,8
81 | Tillenberg .149 58 9/42 30 23) 939 993.821 | 994,144 | 994,044 | 2,7
82 | Bôhmerwall..49 40 4112 59 A6\ 537 993,898 | 994,065 | 994,009 | 2,5 |
83 | Doubrava...|49 25 59/13 19 23] 724) 993,836 | 994,062 | 993,985 | 2,7
84 | Bayern... don... 49 6 49143 8 2414458) 993,646 | 994,074 | 993,924 | 2,7
85 / Kubäny....|48 59 32113 49 15| 4362|] 993,620 | 994,044 | 993,894 | 2,7
86 Schôninger..|48 51 59/14 17 1311084 993.673 | 994,044 | 993,894 | 2,7
87| Böhmen....\ Kohout.....|48 46 11114 35 10] 869 993,718 | 993,990 993,894 | 2,7
88 Melechau ...149 38 42145 19 19| 709)! 993,808 | 994,029 993,952 | 2,7
89 | Spalavä ....149 46 44/15 44 7 662|| 993,854 | 994,061 | 993,992 | 2,6 |
\

 

 

 

 

 

 

 

 

 

 

 

 

 

 

 

 

||
{|
{|

 

 

 

Beobachter.

Observateurs

von Sterneck

 

 

 

Jahr der Beob.
Annéede l'observation

 

1888)
1888
1888
1888,

1888)

| 1888)

1888
1888,

1888
1888

Bemerkungen.

Remarques

 

Nicht publicirt

 

|

|

|

|
|
|

 

 

141889

1889
1889
1889
1889
1889
1889)

11889
14889
14889

1889

| 41889
1889
11890

1890

1890
11890
| 1890

4890

|1890

4890
1890
1890
1890

| 4890
| 4890

1890

| 1890

| 4890

|
|
|
|
|
|
|
|

1890
1890
1890
1890
1890

Publicirt in X, 1890.] i

und umgerechnet.

   
   

ac ah ha dd ac a na

 

 
