  
    
   
   
 
   
  

und „Service geographique.“)

‘fo der wahren Gröfse.

13.14. Frankreich. (,,Nivellement g

?/ der wahren Gröfse.

 

  
    
   
 

 

 

 

 

     

os F oz

 

   

. Bayon de <owrburre «030

015

   

 

LT.

 

(Repère Bourdaloué).

 

 

 

> 4
=: N
Né

 

 

 

ESS

 

RÉ

 

 

=

 

=}

 

 

 

 

 

 

Ll.

22
2 L
Z
CH
i y,
D
|
|

SR

DENT
a

LTM

 

NIV,

  

==

CT TT

ss \

eel TTT

I

a

AS \

Sy

fy

MT

m

u

ON

 

DIEB
LT

 

2
SD

te

SS

N
xD
Y

WEITERER

2
N

LL,

«
Ye

N

IN
LL,

N

 

Sees

SS
SZ
Sy KES

 

4

À
À

   

15

 

für Hauptpunkte '/,.
» Nebenpunkte 1}.
der wahren: Gröfse.

 

    
   
  

LD

    

 
 

 

 
