 

 

rl ]—

“onepsdunsumyog 19p Sunıopuy uopsuorlodond MEZ aop 1our omyeuuy 1oyun Togo AOp 951 b uojıe My UOZJOSOIUB u9pIoq
um ojroMsguspuy woA Zmayegg uomBIszueropoy] A9p na 1onepsdungummyog 1op JoMpum dop yorm EOGT Saysf WI

 

 

nen een ern Teen pm

 

 

  

 

 

 

 

 

 

 

 

Sen TEE

 

"uopIoN YPUTO91DA PMOMHNITOSUYy uopIoq AOp [ey Wep Mur oroyum op

 

 

 

 

 

 

 

 

uop UOA :QB ‚_OT 86 —
:SunyIowuvy

                     

‘-_208 mo CI00'0F SunyolofssnezyoN AP YOBU FORıJ0A uoyynp91mogsäg op Noydoyaısup 9Xapylur old 'wosig-d 1amepsjog "uouomeIs Cr
er 21 060. |eeo ».0 |2co u u |z96 es | 2oe |vrıe e less | mO-Wsnad u
98+ |s + |rio-1ss|szoıse| T+ |ero \ | a #86 ee cr seo cr | mug 4
08&+ 0 766 \766 © 770 Ss i 876 nie 8l6e0) | Man uorjog h
ea | 9, 88 \res-os6| 0 110 go0t | wmgen ||L9 rein | 2:07 9 jo: zw >
gel Mit | 286 ‚700 0 820 8061 | wen erueg 196 S6L nm 09 punwosıses 3
sa+ |os+ |ess Isoorss| 0 Ieeoısel " | . \er6 sea oe ı le | YOSHE, &

& = ar 186 lıse | o 1066 = | euseo |eW .| | sre [ae 9 lc | Sıoquoxiat .
cm el 036 \816 | 0  |ges‘oss| gosı | wma |976 | @°& | 8S1 oda 2 ua er) smquogroM 5
ze |e  |cl6 lo 900°186| " “ 886 Nee | oe | me ‚979% | uolumIBBS K
80.6 106 | 0 |686 a era um) 1226 | Zu | 08 | 1:08 8 767 | sugg-neosIgyg. n
|. 2 1096 0, a8 | 2a Is | 086 | epı nes ey neusäuH | &
68+ |6 + |0% ro lesb:0se, | e 06 aa co her.) cr 9zn21q u
sc |ıe+ me | 0 010 a R 76 || 8a | 208 | era . |emw wioguz 5
sa+ | Te+ 866 o  |Ttro:1se| 061 | wn eroumg || TE6 a mqueug ä
a. 2,076. See 0  |976 = = |?06°086 | 0:2 | zeı | ıov z jorse er, Smagung| y
Bl. u | | 0. 206 = 2 606 || @°@ | | tlse) re \ Stzmt | r
a. © 6 0 “ 4 less | os | ser |sue ı |v1e unoqärddng | &
ir: |o+ ve Ir |8+ Tseose| * # 868 | gg | sog SL ı jerıe Bau zn h
ec+ |vı+ |ees | | e+ iggoıss| " . ieos | ze | za IT6 1 j0og zouogn) £
os+ |oa+ [os |os6 | 7 + |086°086| 0067 | "e'n opeq Ives || 9:2 | org | g’er . |»e8 z09uLU0g | s
nee Neo |  %r om ° A ic Nee | es, Ferz ) 09 Sıoquenmpo f
Did 0. |eo 0 cm oT, wmer 08 | os | ıeı |oor ı |rse rosa e
gL 28 + [616086 Tr6‘os6 T-+ |766°086| 0067 | en 1oxaog Ites:o86| ea | 894 | 279 .. 0:18.87 | sopeug | "Surtugor]- "sid

uozzallmerun or uw ud | me | |
| 06 en In ayef | AoJyoBgoog 9aomyog oIyoIq 2yoH 93Uuy opoag | uolyeIs puvf

 

 

 

 

    

I GO,

 
