a

x. — Pays-Bas.

 

 

 

|
2 INDICATION I : |
N° > LATITUDE |LONGITUDE EPOQUE OBSERVATEURS INSTRUMENTS | REMARQUES
DES POINTS | |
= = === Zen
61 , Ameland....... 53° 27' 30"| 23° 26) 45" |
62 | Schiermonnikoog | |
(Phare). oe 53.28 56 23 49 25 I
63 | Workum:.........- 52.98 41 | 23.026
64 | Sexbierum......... bo 18 111723 28 53
65 | Leeuwarden ....... HO 12 13123 220 17
66. Kollum.::...:..... 53 16 50 | 23 48 50 |
67 | Groningen......... 53 1312 2414 0)
68.| Gleten ...........: 53 022,24 2515| |
69 | Sleon :...........: 52 46 36 | 24 28 4 |
20.) Ruimen...........: 59 45 pl 1027 132 |
71! Snilde. ee 52 57 0 24 042) |

 

 

 

 

 

 

 

salad La el seau

3

 
