 

3%

 

 

 

 

 

 

 

 

 

 

 

 
 

 

 

 

Mesure6e deux fois.

 

2. Base de Berlin.
1846.

Mesuree deux fois.

en 1830.

 

Beyer.

 

Mesur6e encore deux fois | Sept membres

de U’Institut geo-

1198,723032

1198,72
(valeur
approchee.)

 

Kl: de Berlin.

 

(Voir : Das Rheinische
Dreiecksnetz, Heft 4:
Die Bonner Basis, p.46).

088
1
1375000

ji

(environ).

 

ie VERREURS
NOMS DES PAYS. LONGUEURS | .
S 2 u ES )E rn N T NT
DESIGNATION DE LA BASE . : 0, nn T Ge nn
An N a ET REDUITES
pe ee Pound | OBSERVATBURS, | ne ERREURS | APPAREILS DES BASES EMPLOYÜs
SIMPLE OU’: DOUBLE. EZ EEE RELATIVES.
B
PORTUGAL. Gen6ral Folque. 4787,9412 Appareil & rögles en bois du
Bresil, du Dr Monteiro de
Rocha.
Base de Montijo.
1839.
Mesuree deux fois.
PrRUSSm.
e \ 1 :
1. Base de Königsberg. | Bessel et Beyer. 934,993124 2.0.9336 Appareil de Bessel.
1834. en
863500

ai
al

i)

a

|

4

Appareil prussien |’
de Brunner freres. |

EN

 

 

 

 

 

 

 
