 

HE" 1 tg" +0") = 0,20589340,2 ....58° 5'58",8301
Te COS a
a — = Lig Mt" I 0,11553784,9 .... 52°31'58",8741
cosa Rare RON M MER RS
o!— 5°33/59",9560
bam! == ,3,986788 1,4
1B 1 te (M+ a") = 0,78273268,7 .... 79°30'59",4894
— cosa
lt — 0,51192935,3 .... 72°53'56",3150
COS & ;

a” = 6°37! 39.1744
1.sin 0" = 9,0616085,0

Berechnung von os’, Os", Os", nach den Gleichungen (®.).

A! = 0,997982240 1.(q' Y) = 7,2231464,—10 1.(g' )" = 7,2231282,— 10
A" — 0,998210624 1.(g")" = 7,2280538,—10  1.(g"” y" — 7,2230840, —10
Al = 0,997728836 = 1.(q!")! = 7,2232288, —10 1.(g”y" = 7,2232415, —10

a An m
oa LE 04 AI:
sın

en ' 2; 125 = 1,7882483

l.sinw”’cosw"cosa! = 9,4573014, 1.sina''coswu"'cosa” — 9,6517662  Lsiny/cosu'cosa”’ — 9,0592269,

 

 

 

 

 

 

oe sk ci Coe 5 1 ay! ‘ :
yt == 2.93 (D000, L are — >33. 19094, ne — 2,5316639,
1,9948547 2,1892756, 1,5968808
l.sinu'cosw’cos«' —= 9,5148060 l,sinu" cosu''cosa" — 9,6198767, 1.sinu’"cosu"'cosa"" — 9,2553746
mm nn
en = 20510115, 1. (4 ) = 2,0514181, io Rn 2,0376666,,
n 1!” sin 1” “sin It
2,0523775, 2,1573554 1,7930412,,
a2 8178 + 143,6664 — 62,0928
-.u08,0222 — 154,6235 +-39,5258
+-11.33,9264 +- 35,8590 + 54,1064
cs — 190208 Os! 24 0018 Os! — 31,5394

of = 4°40'13",8858 oo" = 5°33'59",9560 0" — 60377 3 1744
s—403953",0560  s"—53335"0542  s" — 603631" 6380
sins’ = 8,9102479,1  lsins” — 8,9862498,8  Lsins” — 9,0610357,2

Dies sind die den sphäroidischen Winkeln m’, n", m"
für die halbe grosse Axe — 1, oder — a.

Nachdem das sphärische Dreieck nach seinen Seiten und Winkeln bestimmt ist
wir nun zu der sphärischen Berechnung desselben über.

gegenüberliegenden sphäroidischen Seiten

» gehen

 

{
i
|
j
|

 
