 

 

 

ee

 

 

 

 

 

 

 

 

 

 

 

=
|
Erreur nn Méthodes et [Instrument |
SPAY Latitude. OBSERVATEURS à S| Aone
AAA probable. ee employés. |
a = i I
|
| |
| o ! n 2 | a
6 Kahleberg. Point géodé- | 90 Mo ddese | 0081 Valentiner. A. Passages au premier 18
sique. ODM | | | vertical.
| | | | B. Hauteurs circummé
| | | vidiennes. Instrument
| i Wi verse. |
|
ry : . 2 = De | | 1Q
7 Fichtelberg. Point géo- | 50 25 47,47 | E O.IÙ » ) 18
désique . | | |
! | | | | 18
| | |
ns . ’ , . -_ _ - + | . ri ù
8 Leipzig. Point geodesi- | 5! 20a VA Helmert. Hauteurs  cireumméi |
que sur le Pleissen- | | diennes. Instrument
burg . | | universel
= à PA OF a fi
9 Wachauer Denkstein 51. 16 54.55 | E 0,16 ) | » It
Point géodésique. |
x 2: : e | = m A
10 Grenzhübel. Point géo- | 51 15 40,67 | + 0,16 » ) i
desique .
ys r , = ¢ o- ¢ ; |
11 Wachberg. Point géodé- | 51 20 85,21 | bt 0,16 | » I
sique. |
|
. . r r - - à | | |
12 Markstein. Point géodé- | 51 25 10,24 | § 0,16 | ) ; I
sique. |
a, ee | ei, | 1
13 Schwarzeberg. Pointgéo- | 51 24 8.15 | 20,16 | » » A
’ . | | |
desique . | |
à à ar à Al Se BE gif) —
14 Grossenhaint Point in-| 51 13 2000:) £0,070 | Seeliger, Weinek. | A. Instrument des pa |
termédiaire de la base. | sages à lunette bris
| dans le premier ver
| | cal.
| B. Hauteurs eircummt
| ridiennes. Instrumell |
| universel. a |
(5 Lausche.- Poimt géodé- + 50:51.:0,80 1 E.0,10 1 Harzer. Hauteurs circumimell |
= © R - 1 k ant |
sique. | | diennes. Instrumell |
| | üniversel. i |
16 Jauernick. Point géodé- | Voyez Prusse. | |
. © | |
sique. | ne 29), | | Ei.
| Ela
a ee À = 2 a à ; p | i
17 Kapellenberg. Point g6öo- | 50 11 15,18 | 1: 0,00 | Richter, Borrass. | A. Hauteurs eireumil |
désique . | ridiennes. Instrumel
| universel. a
| | B. Passages au prer
| | vertic. Instrument”
1 1 a - 3: COLE
| | pass. à lunette bris |

|
|

 
