 

Tableau Lil.

406

AZIMUTS

 

 

 

 

; Erreur -
STATION DIRECTION ne _ OBSERVATEURS
probable.
AUTRICHE-HONGRIE
1 Prague (Dablitz). Bosig. 201 59 25,5 | a 0528 | Weiss.
2 Spieglitzer Schneeberg . Grosskoppe. 108 12 50,581 + 02% Herr.
3 Vienne (Laaerberg) . Hundsheimerberg. 275 D0 28 + 0,32 Weiss.
4 Tetschner Schneeberg . Bösig. S02 56 5357| 019 Herr.
5 Tetschner Schneeberg . Donnersberg. >5 91 15,94 | + 0,880 )
6 Cerkov. Böhmerwall. 204 40 26,8 + 0,4 v. Ganahl.
V.
7 Vetrnik. Markstein. 260 8 44,78 | + 0,222 Herr.
8 Rapotic. Maidenberg. 331 94 562 1208 v. Ganahl.
9 Extrémité nord de la Anninger. 185 14 21,8. | 0.4 | v. Ganahl, v. Sterneck
base prés de Wiener-Neu-
stadt | |
10 Saseno . Valona. 979 34 57,9 | + 0,4 v. Sterneck.

 

 

 

 

 

 

 

 

 

 

 
