   

312

 

 
      
    

Erreur Methode et instrument

       
 
   
     
   
   
   
       
   
     
 
   
      
    
       
   
     
 

rut a 1184111 UNE be à 1 : 114

     

 

   

 

STATION Latitude | OBSERVATEUR |
probable | employé
12 Schoorl. Pas encore R. Posthumus Meyjes | Distances zénithales cir- |
calculée. cumméridiennes d'étoiles |
méridionales.
Altazimut de Repsold,
emprunté de l’Observa-
| toe d Utrecht. Dia- |
| metre du Cercle verti- |  :
| cal 26 cm. :
| | |
13 Terschelling . > | »
14 Leeuwarden . » | D
15 Urk . , |
16 Groningen. » » 2
PORTUGAL. :
D Praz (Ponta-Del- | 37 45 58,05 | + 0,18 Fernando Costa | Methode de Horrebow
gada). [le de St-Michel | (Talcott).
6 Villa do Porto . . 36 56 50,01 | + 0,44 | R.de Quintanilha Sousa {
Ile de Sainte-Marie Vianna. | |
| |
| PRUSSE. | |
| |
| | 114 Potsdam. Geoda- 52 22 55,96 Schnauder. |  Horrebow-Taleott. | À
| | tisches Institut . | Zenitteleskop.
| | Observatorium, mitt-
| lere Kuppel . |
1162 Potsdam. Geodäti- | 52 22 56,01 Galle. | Horrebow-Talcott.
| sches Institut Passageninstrument.
| Observatorium, mitt-
I lere Kuppel .

 

 

 

2 vases sean ail

 
