No

.

INDICATION
DES POINTS.

LATITUDE.

eo

V. — Triangulation 1858, 1859, 1861, 1862.

LONGITUDE.

ÉPOQUE.

 

 

 

Rösseh ... .-
Schippenbeil. .
Paulinen...
Drengfurth ..
Styrlak.....
Schemionken ..
Szameyten ....
Döorken.....«.
Kallenczinnen. .
Kollesehniken. .
Wiersbowen...
Jurken :.... ..

Seesker Berg .

Goldapper Berg

Pillackerberg. . .

Kucklinsberg . .
Bliken . : ...:..
Schwentischken .
Pillkallen . ..

Kattenau.....
Mallwischken . .
Szillen:. .....‘.

Wersmeningken.

Schodenen
Piklupôknen. . .
Neukirch

Kallningken. ...

 

DA 2/07
54 16 25
54 17 21
54 13 16
53 59 49
53 56 51
D3 52 29
53 42 47
09 47 18
53 50 54
53 55 42
54 4 30
54 11 4
54 16 58
5211 18
54 27 37
54 31 22
54 26 27
54 46 20
54 40 24
54 43 49
54 54 21
54 54 58
55 8 33
DD: 076
DD 45, EL
55 : 9 38

38° 48' 54"
38 40 57
38 23 59
88 12 49
99 17
39 41

39 59 51
39,09
40 9
40 23
40 19
40 1
40 0
39 57
39 38
39 37

39 53
40 12
40 10
40 5
39 53
39 35»
40 6
39 44
39 38
39

38

 

 

 

1858-59-61-62.

 

DIRECTEURS
ET OBSERVATEURS.

INSTRUMENTS.

 

Bartenwerffer, v. Bronsart, v. Hesse, v. Holleben,
v. Lancizolle, v. Morozowicz, Stockmarr, v. Zastrow.

 

p-

Cercle de Pistor et Martins de 8
Cercle d’Ertel de 15 p.

 

 

. IE ES

REMARQUES.

 

CON LA CPE an ee PS LR NN EE A à

3
y
:
Fe
di
a
nA
4
4
4
2
4
4
4
F4
4
5
5
5
Le
6
à
5
i
af
5g
