   
 

 

 

   

Da RT

 

Die Rectascensionen dieser Sterne werden u. A.
stimmt und nach Bedürfniss mitgetheilt werden.

ST ar a

 

Nr.} «& 1867.0 | d 1867.0 [sro] Praecession r. | « 1867.0 | d 1867.0 Grosse Praecession
21] 5°19". 6[+ 85° 7. 116.0} 185. D}+ 4" | 53] 14°34™. 3]4+-81° 24", O16. 7] 28, 5|— 16"
E 22] 6 16.385282 13.916. 1612.91 aa 37.4780 14,016,5 1:91
23} 6 37 .3[4-87 14. 15.0/430.5—- 9 0] 14 56 .1|+86 29.9[6.8|-—- 12.2) — 14
24 17.0.0481 29.46.53|111.7 5 56 14 56 .6]+81 17.216.8|— 3.0—714
25] 1 24982 39.515512 123 15 or 14 59 . 41+ 83 3.416.01— 4.7—14
26| 7 34.380 35.46.5|4-10.5I—- 8 | 581 15 38 .] +81 12.616. 4.0)—12
2U 7 84. 8+ 80 «12.016. 51/4 10. 1 8 150 47 .11+480 23.816. 3.6—11
28| 1 44 .71+84 26.016.014+15.4— 8 | 60| 16 59 .71+82 15.114. 6.4— 5
29 758.932 50.16.57112.3 70 PO de 29 . 71 +80 15.016. 4.,6— 3
30| 8 47.1484 42.516.01413.9-—-13 | 62] 18 15 .31+86 36.314. 19.44 2
3l 851.181 21 .46.7)! 9.5 213 0] 1e 20.1786 59.16.01) >22 a1 9
32) 3 17.9481 54.714.317 9. 2-35 0818 41 ,61488 4.26.27 7.0.1
33} 9 46 .9/4+84 33.316.5|4+10.8—17 | 65| 19 8.12.82 11.500 6 oe
34410 7 .1/4+83 28.1/6.8]/4+ 8.6/—18 | 66l 19 8.U+83 43.0/6.5|— 8.514 6
35) 10 9.914834 55.5[5.014+10.11--18 | 67 19 32.033 11.900.723. 3
36| 10 14 .61+83 13.9]5.214+ 8.1/—18 | 68] 19 07 .3|+88 54.616.5|—58.3+10
: 37 10 22 .1/4+-81 10.7/6.2]4+ 6.7/—18 | 69] 20 21 .94480, 6.163 22719
: 38] 10 30 .2|+81 7.216.214 6.418 | 70] 20 36 „01580 57.95.81 3.4175
L 9 11 22.4481 51.5[6.2|4 4.620 | zıl 20 37.0480 a7.als.ıl- 3.217 13
F 401 11 53 . 314-81 35.416.214 3.3l—920 | 20 42 .1/+83 9.616.2|- 5.4113
41| 11 58 .0)+86 19.4]5.7|+ 3.3/—-20 | 73l 20 52 .1/+82 2.216. 3.9 +14
421 12 5.014532 27.06.7|1 2 97-00 74 20 53.580 3.015. 2.5|+ 14
43 12 12 .8[4+87 10.5/6.5|+ 1.5—920 | 75] 21 17 .8[4-80 14.816. 2.0+15
i 44] 12 14 .41+88 26.216.51— 0.0|—20 | 76l 21 18 .8]+80 40.316. 2.2 +15
i 451 12 30 .11+80 59.016.814 2.01— 920 | 77| 22 23 .5/4+85 26.215. 3.8/+18
46] 12 34 .814+86 27.816.5|—- 0.2/—20 181 22 23 .9]+85 33.116. 3.9418
471 12 41 .1[4+81 21.016.3[+ 1.5|—20 19] 22 39 .0]480 41.816. 0.3419
48] 12 48 .0[+84 8.4|6.5|+ 0.4/—20 | 80 22 41 .9]+82 26.815. 0.0/4 19
49] 12 48 .1l+84 8.1/5.514 0.4|-20 | 81] 22 54 11284 39 .6/6.5|— 1.014 19
DOI 15 11 .3]4 81. 10.616.314 0.419 | 89 22 55 . 31+ 83 38.015. 0.3/+19
511 13 46.311 83 9%5.216.5l— 2.1 18 19 23 27 .3S|186 34.416. 0.0/+20
521 13 53.01.81 29.36.81 Lin 4% 50 .3|+82 27.116. 2 .6|+- 20

 

auf der Berliner Sternwarte neu be-

 
