 

 

 

 

 

 

i
à
=

 

1/17 0/08 i)

ETATS-UNIS DE

SO Rae

RR

=

L'AMÉRIQUE DU NORD

 

   

 

 

 

 

 

 

 

 

Fig. 7, — NIVEAU, VU DE GAUGE

 

 

 

  

 

 

>

S

 

 

 

 

 

 

 

 

 

Fig. 8. — NIVEAU, VU DE DROITE.

 
