 

94

 

  
   
   
 

 

 

 

 

 

 

 

 

 

 

 

 

 

  

 

 

 

  
    
   
      

u: OBSERVATEUR : \ |
NICE (Observatoire) — PEIRACAVA nn | |
d aus |
STATION DE Prinacava |
Pendule N° 1.
jan | répuc- |
DATE DURÉE OBSERVÉE 2 0 DUREE REDUITE LÀ
ey TURE 0 |
à 10,0 | |
1887 Octobre PLB Masse »
17 Droite 0,711742 | + 8.0 12: | 0,711754 °
18 6 | Sl da 748 |
19 742 | + 8,1 | + 124 755 } | oe
17 Gauche 0.711749 + 8,0 | + 12 761 ln
17 758 | + 7,9 | + 43 14140)
18 746 | + 8,1 | + 12 758 |
19 73 | + 8.2 | + : 74h 0 711781
PLB Masse }
16 Droite 0.711796 | + 8,1 | + 12 | 0,711808
18 798 | + 8,1 | + 12 810 0.711807
16 Gauche 7 4 Be el BOA: ST
18 796 8,2 | + 11 807 |
PLH Masse -
17 Droite 0,71191& | #:7,9:| 4 13: | 0,711927 ;
18 896 | + 8,1 12 908 >
19 O06 ES EE BD JS |}
17 Gauche 917 | + 7,9 13 930°) > 0,711923
17 919 Bb Huile 032 {À
18 913 8,1 | + 12 925 | |
19 „a | I Sl, + 12 926 } 0.711978 if
PLH Masse ° | |
16 Droite  0,712018 | + 8,2 | -+ 41 | 0,712029 |
18 030 | + 8,0 | + 12 042 a
16 Gauche De PES) 10 032 | 0.712033
18 015 | + 8,1 | + 12 O27 4)
: > A =0,000197
ty — 0,711781 — 1,762 X 0,000197
Amplitude moyenne 40’ (correct. = — 0.000006)
#1 à 10,0 et à l'amplitude 0 —  0,711498
Réduction au pendule n° 2 — — 0,000074

Réduction à la latitude du Mont-Gros — -+- 0.000014

RL = one

  
