 

18

0

 

 

 

 

 

 

Toise du Perow. — Les lemperalures sont, encore ici, les m&mes que dans les series
’

precedentes.

 

 

 

Comparaison de la Toise du Perou avec la R£gle-etalon E.

Premiere position de lu Toise (inscription en dessus).

 

|
| COMBINAISON gar TOISE —- ABOUTS TOISE LONGUEUR
TEMPERATURE ABOUTS

DES ABOUTS, — ETALON — HTALON DE LA TOISE
En | en n EL a

e D. p. D ii

| 1-1 17.380 + 259.8 — 207.9 + 463.7 1949086.1

Il 17.470 + 179.0 — 285.3 + A6%.3 089.8

IV-I 17.532 + 232,8 — 229.8 + 462.7 090.3

IV-Ä 17.984 + 308.5 — 151.8 + 460.4 089.8

11-1 17.639 + 253.6 — 207,9 + 461.5 092.6

II-i 17.290 + 180.4 — 285.3 + 469.7 085.0

| II-IV 17.397 + 234.0 — 229.8 263.9 086.8
II-IV | 17.597 + 309.5 — 151.8 + 461.4 1949089.2 |

 

 

 

 

 

 

 

 

 

 

 

 

 

 

 

 

 

| COMBINAISON TOISE —- ABOUTS TOISE
TEMPERATURE ; ABOUTS :
| DES ABOUTS KTALON — ETALON
| ° u 08 NL
| 1-3 16.231 2 1010.9 Bla r 505.5
| 1-5 15.344 u 175 I Aug + 502.6
1-8 16.646 0, 1 435.5 507.2
| ns 16.697 A 030 | ralnnss.8 I
| „68 16.549 1 942.9 4 AuSA 1 494.0
a 16.899 eo + 460.4 4 193.9
|
| 008 16.917 1 1008.9 + 518.5 1 490.1
| 123 16.735 + BT-8 41478.9 1 488.9
| 7-2 16.889 1.0912 1 490.3 1 490.8
| 23 17.038 03h 1.1165 + 486.8
| 48 17.126 1 935.8 + 446.9 1 188.9
| AR 17.186 + 949.2 + 159.1 + 490.4
1-3 16.958 + 999.5 + 505.4 + 4874
| 1-5 17.782 1 932.9 4 444.9 1 188.0
| 1-8 18.006 7 911.6 + 135.5 Go
| 4-8 18.089 ee) 4 438.8 a
ı 108 18.136 1 994.9 1 4hSA 1 4761
| 208 17.948 4 941.7 4 460.4 1 481.5
|
| 6-3 18.116 E00) + 518.5 A
| 1 18.251 1. 0951.4 1.478.9 1 472.5
| 7-2 18.318 4 893.5 4 420.5 nal
| 7-5 18.328 1 888.2 + 416.3  unzle
I 0 18.078 as | Zus | +imlı
in 18.163 ı . + 452.1 1 481.3

 

 

LONGUEIR
DE LA TOISE

1949088.
089.3
104.5
099.0
087.8
099.0

096.9
089.1
096.2
097.4
102.0
105.8

095.0
124.2
120.0
124.1
124.5
123.8

1949130.6

 

|

 

 

 

 

 

syn A IHR MEI ll

Ill ehnlkal! 1

HEIL.

uam hc a Me

 

 
