EEE EEE ELLE BEE

 

 

 

 

 

 

 

 

 

 

 

 

 

 

61ST CURT oe
à nn
‘ouordweg [op 9uorzeIs wIToo : 2 : <
euoizeo | 9 [OIRTONEN Ip ’A.osso ie: Tosti noureywegen 910°0 6869 8 ‘(099 otues) OUBIENT
_.  “jqand eyjep ur tquuoz | @loig 1p ‘AIoSS0 [jap aurpny (
-u09 ouos uou euordmes | -ISU0I Ip Jp ®T e.rwurunteIop ne din ou.
9 ToygyonaN N tuorzugs | Jod OL8T [ou owerp ® oyyey ol[sny-ousnty AT 1P 2 ee ip on
Ole Taryejoı 1[de}49p | | Tuorzeuodo affop oyuooosayy § OLST sessed ‘ung — ‘ouelryy BIIO[OD ‘tfferederyog "Jorg F100 GOT'68 F -ZBUL 9110 ou) ousfı e
8II0[99 ‘'JOIT OUBILTAL
‘TUOZMOLOTT *JOIg | FI0‘0 088: OT \ BAOPBI 8
- (999 onueo) OUUITEN
A on, RIT0199) ‘JO (uesnequeSog 1p ‘A10850
LOI © 10100) “Het ‘rezjoddg “org 2 7100 GFL OP 6 ‚Ip afeyuso 'TId) ooBuozgu ),
0
un ab a, (RISIOAIUQ ‚ITEp *AI9SSO TOP
-euor | 4p 9 eh u ee Be Tu Ip TUOZUSIOT "Ford ofeınurajueıpenb) "BAOPB.T à
-eorqgnd eyop ur you) 13 exy aurpaySuo tp “Hip = as, oN FO O1TPU0LOI 610'0 220° LI | (ezueyosuoyiny,) wuuerA 6
n OUOS UOU VUUOLA | oT oreuIuLIO}ep Jed aygL jou (o1r0yearesso [jap Aromen
9 UOT IP TU0IZeIS | eaopeg B po OUEILJQ ® 0147 244 011p O1SSe = ; ai
2 IN ES LH 1p | “40. | 3
OT TATU[0I 1980 J | ruorzerodo eppop ojuooosoy | OUOTZwuLULIENE(] GLeT 138essed "ung — "eAopeg en 210°0 Beige 9% ae ir 9
4 6 546$ ALU pre
| | “AVIV ALI
: “AON —0q | TUISSEO op uarpuiap ‘staal
-urejdeg ‘Zoey © e000 606 08 6 | 9I9119 AIsueL] "qoImusauny
GO6GI ‘SuorUAIISAQ |
YOIMUSILH ‘YoIMusery ‘£104
| -BALesq¢Q [eAoy oy} JO S104
“ISA JO plvog oy} 04 pedo SI9A19${0 Jo | Kem— yore | LUIssep ep USIPHOU SIABCT
IOWOUOIJSY 94} Jo yıodey odueyoxrf 2061 SIOH ‘uosid 1100 = | FL608 6 | PU Asue1], "yormueoany
s s wm |
|
soTjouuosied u sdmo} ug |
INV
sonbrewoy uorgeorrgnd ef op ory, ye Sour sofojdmo syuomnysuy SIN9JUA198qQ u : SNOILVIS
19 99uuy
LOpELLLUTN epnyisuoTy 9p ‘HI |
| |

 

 

 

 

aa ISDN Oz

as lil 1 D be bs nla ddd lh aay yy in Tell ARE a el TE? | vee ied: tm Hie Mk Bek kD did lh

 
