 

ns Rennes " a —

A

Gen Ber.üb.d. Europ. Gradm.f.d. I. 1871.

      
     
    
        

Laaerberg 1 132°707
N{sädl v. Wien)

Johannesberg
J06° x
(3)
0 berlanizendorf”

88%.

TT
S
S
I
=
>
S
SQ
©

B. PUNT 115?

Maria En zersdorf 117 °

  
  

/
v /
% §
4 7
7 /
Re 4
£ as ig . 1
F Mödling 120° 7 u
E j X
£ Ve an
7 ee NER
& (5) PAR as m
E 4 N. Da
eo ae

; ee
BBichlodl
Dreieckiger 313% De

Markstein ) 5

 

A nninger
256°076

 

Maafsstab 144,000. noe

 

ee

 

LORE PRTG ETT gen Hin

oie:

Lith Anst.v Leopold Kraata in?

 
