 

123

Deuxieme position de la Torise [inseriplion en dessous).

 

 

 

 

 

 

 

COMBINAISON : TOISE -4- ABOUTS TOISE LONGUEUR
TEMPERATURE Ä ABOUTS }

DES ABOUTS ETALON —— ETALON DE LA TOISE

B pr p p p

3 I-U 15.568 + 284.7 —. 2065 + 491.0 1949051.1
a I-III 15.559 — 207.7 — 984.0 + 491.7 051.4
Ä IV-II 15.258 — 266.1 9208 — 495.9 045.2
IV-U 15.358 4 343.9 — 18 + 496.1 048.9

H-! 15.544 - 288.7 _ 2005 —+ 495.0 054.2

II-I 15.652 + 210.3 — 254.0 + 494.3 057.2

II-IV 15.688 — 269.5 — 229.8 + 493.3 057.%

H-IV 15.609 + 340.3 — 152.2 + 492.5 1949053.9

 

 

 

 

 

 

 

Comme pour l’autre Toise, nous r&eunirons ces r&sultats A ceux des observalions pos-
ierieures pour en tirer des conclusions delinitives.

MESURES FAITES EN AVRIL-MAI 1891. — Les series d’operalions faites en ayril-mai
1891 ont &te conduites exactement comme les precedentes, avec cette seule difference que
les deux Toises ont ete placees simultanement dans le comparateur, chacune sur l’un des
bancs. Dans les comparaisons intervenaient done maintenant trois regles : les deux Toises et
l’Etalon E, que l’on faisait passer alternativement sous les microscopes, chacune qualre fois,
suivant un schema symetrique. Chaque sörie est ainsi necessairement un peu plus longue
a ex&cuter; mais elle permmet de cette maniere d’obtenir non seulement la longueur absolue
de chacune des Toises par l’intermediaire de la Regle-6talon, mais en outre leur difference
relative independammen! de cette derniere. |

Je reproduirai les r&sultats obtenus, sous la m&me forme que precedemment.

 

war 5 Tr RTeITNIRATTRE 9° SPOT in as

1° Determination des constantes des appareils de contact.

 

 

 

DIRT RT EN

 

 

 

 

 

 

Comsinasson I-1. Comginaison I-II. Compinaison II-IV. Comsinaison III-IV.
\ 1 2090 I. 2986.9 neo 189 1. as
2 2035 I 11983. 2 2 41895 2 _ NT
3 ol = —ı 284.0 ® 35 = —_ 230.0
- h — 206.8 h 9826 4 rn % 201
5 - 9005 5 N) > — 1508 5 85
6 —_ 2098 6 = 281.6 6 a) 6 2249
I 7 20727 m DS U m — 4545 N = 2»99
F 8 — DS 8 9818 8 = A517 8 = 792995
Moy. — 207.0 Moy. — 284.1 Moy. — 152.8 Moy. — 228.9
ee wa + 02 + 03 28

 

 

 

 

 

 

ei

IEEt

rkaindndenhlh Abb
all EL Da LIED, BET DEE DEEI ZELLE

nike
Sr

 
