$ = ES EEE oe EIERN na. nen Bee EEE a Eee TR 9
SE gO eee eect” ee t= Se cP NL heh PU 2 Toren = ee ome Lae SP ne En eee ee ee ee EEE
En En ge a 25 ~

                          
    

 

meer nes re ee eee

2 er it = ss 2 Ta yt oe 5 = *: a “ = à Sn = > ee = = : 2 x a os ; ee & es . ee é = ee Bat er 2 an Fi
WA ne he, AU € LE Are Pr ni 2 ia eee a be = My Ze >
Pre. Pee LE ages NS Kamm. PTE a, te en e = ; 2
(Bene! ISSN = à à Se RE ene
* ome LT

TA a a N
pl 3 Page PEL CR à ~~ à
12 ee
I eer
a tPA IY NAN
é oa LA "u LT | ha = f
UL, mines Pe rae

ee a I A DEIN a
= = es, = m ee, AN LPS : u

SO REISE SEE EEE NEE

. u . Ay er 3 = 7 5 à PL he Pa EU BE

MR rase ET it TS Pana ae Lh a oe u ac
% ne TV, $ PSS h 2 x Ze pr, Pog 2 7

RES Sy TL OR D OI NP TEE AL LU

js 5 TA Te a i a ad So VES es SP SP PS " 7 et re Fe a

PF SAT D TR AL INES ag a ANG LL CE Wh ge Wig ip Ot TBO RAGE

tyes ET IE KAP TE WIE À Ne aT PIAL EA

 

PES, CR A Le

  
  

 

 

 

 

 

    

 

   

 

               

 

23 = #
CE

 

EEE
CP RP 7.

 

           

ARS
RAR TT EUR
Ä AT RCE GBR}

À

cs Ps g ze
a i (Pia er on < 5 + # a
Py z Fr - - BT i Fe St”
eee? a al Del a 2 - ER
J aa sof? 2 1 et xs a a.
.- , hi ET EZ 5 3 17:

 

 

ne as 4 ä 2 =
API à EEE
ang“ bad wu ieee È € ARLES ne m ie

RAT PE

    
                

)
ù

= ea
u ae se << wy a hs
Ca
2

Û
N

0 \ ‘ C4
Pi À À

A

en

bo

u

bu.

»
I

a)

a

      

e > ex @ 2 Nit cia a in Du 7

PL NP LE es SE PR ET

An ir | i = - Zr . LES ; aoe | = E #
A

     

 

RE Pe ee
ar or ee ee

                    

 
        

  

LT > a ARZT Sm on ee
PNR IST TE TS PRE RP hn : : np CS
Neck ck. PEPE rte a, PET ee ee a J rae, LCR AR POP DE ee Pe Ne
LT PET nr TER ET Ce SERIES Pe

+,“ Fm 2 ea à os it Ze CE a Sin osé {pes ae ais oa. u x Age a 7 > 2 cs he ae he igi Sen
RR Pe ER De Re RP DD IF cosine

ne hei LT ee ES EEE se lose a me Sn ENT ee ie ne N DREI;
CRP Se Br cc ee as a er Pn Ok
A ur Eu | ' = ca a

ET,
u OPA à ANY; an SS . Nie ee eae ete
SS SSNS
N ome fe À FA 4 nr =} co * = e u x # a Ee sil

      

 

 

 

   

      
 
      

    

    
 

          

 

 

   

 

 

 

 

Lg . na a SC
‘4s ne 7 PER
44 | LATE er et Fs ha
TRI TES |
RES RUE,
y TS PP SCT ER
€ . 2 ALES, N
, Br A Ye / NE 1
