 

„208 wo 9I00°0 FF Junyorojssnezyon 1op yoru Ydemoq uongnpermegsig ı9p Noyroygarsuf) oxopyiut oIg 'weIsäg- somepstog 'uauoyeIs Ly

 

| L | ar 22 8s 2, | mngeuney elmpen wluog Blemon

Gel T SY | 109807 “Üyzenofog
07 7,8 a8[9IuByJly
Ian Snlsn fiamom
9G 09 uApıoyosL
68 |387 268 ®8P30I0M |
67 TIeIA
681 SAyasny
19 | elemosnyosL
69 | eyosyusısg-sltugsın
ur | = | | AMowwıwg | "68 69 Moser)

za+ wu |om — |agı
et | 62g

re + ee
g9oH | 000886 ‘en oßelqnq.
SI, 796 | MoueIgg
en || 688 o8slana
08+ 888
No FL8 |
ja | MOuBIeg

  

s+ | | | ‘en Mousıeg

ge9+ 5 ‘en Mmoueregl | 69 | 7° ee

 

nei | | | | | se asurgäy
+ | | | 92 wog
+ 978 64 [Se L-ruysın.
65+ |7EL al | or BWOLNSON
ne 1472 | | 68 Taejsorge |
IE + 06, | g9L ' MOUEIBT VE, | sr eyıennyY
sa | ell | [e62 wen “ousıeg | 91. | le 09 3 ysurlaoN

| 869 |821 | Moweiser 869

 

 

 

 

 

 

 

 

 

| zyoMolınf |
\r89 | |6T4 ‘wm Mouwıeg | 669 | i } | wounfg,.
219 we 989 | “ouswg |1209 I | | | SupIoM
999 EG | LEL en Mouewiegl | 179 | 5 ueneyog
649 979 a g19 Mofyaskueyy |
829" 186) F89" 186 \@e14°186 Mouewg 889186 | 8°'5 | 2 Is Sınquuegestor, puejgng

 

  

 

 
 

 

 

 

 

 

 

 

wo g-01 | wo g-OL wo | un | WO 9-07 | u | | um | u | |
%4— 26 |%A— 26 4 | 10 | B—, 5 ° ayef | do9uDegoog o1omyog E1pIq ayoH | aSugT | oneag uoreIg put
m | sis area ah | | |
6FL 'S g2 22m

 

 
