 

 

 

     

 

 

clöture des triangles desquels ont été mesurés les trois angles.

 

 

 

 

 

 

 

 

 

 

 

 

 

Erreurs de
a ERREURS a ERREURS a ERREURS
a DE CLÖTURE = DE CLÔTURE = DE OLOTURE
ü E CE p F4 i 9

| uam | © mung) 2 | mem | a | manques 3 | mmunamm | 4° | mmanguns

2 A 2 A 2 A
: al“ mn er el 2

Triangulation du Parallele d’Amiens. (Partie Occidentale.)

18 la: 246, 49 23 TL TA 767, 29 28 10,01 245,96 |
19.1278 163, 84 24 205 6,25 29 9,2) 84,64 |
20 9 62 |. 27, 04 25 9,8 | 96,04 BO 100 3 104, 04

21 | 12,6 158, 76 26 69 | 4761 31 | 18,3 | 59460

> 11,3 127, 69 2j 16.59 | 285,61

Triangulation du Paralléle de Paris. (Partie Orientale.)

1 14",0 | 196,00 91616 43, 56 7: 320 9, 00

07 0, 49 LOG 4 54, 76 18 A 1, 96

3 0 ,6 0, 36 We 6 73, 96 Ne 4 5, 76

4 1,9 Bail 2, 3.2 1, 44 20, 7.2 51,84

5 0 1. 102.01 13 Dr 3) 2800 2] 6-11 4489

65,8 33, 64 hs 27, 04 22 9 6 92, 16

7 9 9) 980] 15 | 3,6 12, 96 2,97 94, 09

8 3,2 10, 24 164 138 3, 24 210 0 62, 41

Triangulation du Parallele de Paris. (Partie Occidentale.)

>) 0 22, 09 40 2,0] 4,00 2 148, 84

26 1,4 1, 96 41: A 1, 96 50 81 70,56

21, 4,8 23, 04 42 7,0. 5176 a ı 49, 00

28 1,6 2, 56 43 00 0, 00 08115, 0 2928]

29 92) 8464 AA, 80.7 75, 69 07 44, 89

50) 0 2 0,04 2, 10 1,00 60 6",0 | 36,00

2 79 62, 41 46 1.9 3,61 Ol 6-8 46, 24

32 A 0 | 16.00 47 17,2 20726 62 Te 2 | a

Dh 22, 09 48 9,3| 86,49 65 | 10 1, 00

34 5 01.26.00 49 23, 122 64 | 18 ,4 338, 56

5 0 4) 88 56 50) 2110 8,41 65 2 0 8, 41,

12 ,4| 153,76 SI 6.8 46, 24 601.25 6,25

37 10,4 | 108,16 52 110 121, 00 Gr) 15,0 225, 00

38 1.2 1, 44 pe 0 6 92, 16

39 = A) 11,506 A) pol

Triangulation du Parallèle de Bourges. (Partie Orientale.)

Ho 102, O1 11 10e). 110 2 21) 01 0,01

1, 1% 2 0,8 0, 64 2218.3 68, 89

26 8 718, 24 231 629 47, 61 23 9,3 | 86,49

208 5, 29 14 9 52 2,0) 0,01

3,5 12,25 15 13 ,8 | 190, 44 25 1.6 2,56

8 ,6 73, 96 16 223 | 488, 41 26 2.1 4,41

0.5 0, 25 a 68, 89 a 5,5 30, 25

2.21 5,84 18 14) 51.76 28 1 || 1088|

1 0,01 19 | 0) 4 0, 16 2 10 1, 00
1,2 1,44 20 “3 39.69

Triangulation du Parallele de Bourges. (Partie Oceidentale.)

1146 57, 76 35) 1 9 3, 61 40 ie | 102: 01

B47 1 32,49 36 6, 512.76 41 4 1) 1681

58 | 008 a7 158 3,24 42 0,5 0, 25

18 ,6 | 345,96 Be | 4 1, 96 43) 17 2, 89

106 112,36 39 0 >| 100 09 AA) 10 9 118, 81

a dank

ee
