 

 

Année et mois.

 
 

   
 
  
  
 

  

1864.

 
 

Hi 1865 mai, juin.

  

1865 juin.

  

1865 juin.

 
 

1865 aout.

 
 

1865 septem-
pre.

1866 juillet.

 

 

   
 

 

1866 juillet.

 

  

1866 juillet.

J

  

1866 juillet.

 
  
  
 
 

  

 

 

 
 

Positions moyennes |
des étoiles.

TIERE DE LA PUBLICATION

 

REMARQUES

 

 

| Btoiles fondamen-
tales du catalog.
de Pulkova 1875:
posit. moyennes
de 3542 étoiles.

»

 

 

Berlin. Jahrb.; po-
sit.moyennesde
3042 étoiles.

Berliner astrono-
misches Jahr-
buch.

Berlin. Jahrb. ; po-

sit. moyennesde
3942 étoiles.

Publication de la section topo-
graphique de l'état-major, Vol.
XLVI. « Description de la me-

AOO

sure du degré du paral. 52°. »

Public. de la section topogra-
phique de l’etat-major. Vol.
XLVIM.

Publication de la section topogr.
de l’état-major, Vol. XX XVII.

Publication de la section topogr.
de l’etat-major, Vol. XLIX.
(Sous presse).

 

 

 

 
 

 

   
