 

EEE EZ SE?

Se

REIF

ne
TREE Bene

Bar!

 

i
6

a
.

i

Set

EEE EFT

ge ee ee

 

Hiigeberg .
Rost
Scheelsberg
Nordhohe .
Stagehöhe

Scheersberg
Hügeberg
Hochholzberg
Scheelsberg

Nordhöhe .
Ostenfeld
Wongshöhe
Stagehöhe

Scheersberg
Nordhöhe .
Warkshöhe
Wongshöhe
Bärenwald
Knivsberg

Hügeberg .

“Rost
Scheersberg
Stagehöhe
Knivsberg
Skamlingsbanke

Bärenwald

Stagehöhe
Warkshöhe

Rangtang

u ME

Sehe ®@ 2 sh! e Me.

101
150
202
267
i 0 S 1

0
52
192
251

Warkshöhe.

| 0

[oo we
246
| 317

Siva © e h 6 le.

bd bo ee mm
VO aD Ci
1 41 Le À 1 ©

 

©
©
CO

SQ
6

io Oe et

jp
er on ww
es No SU ©

  
 

143
Wongs

| 0
49
96
307

höhe.

0)
50
55
27

0
16
26
I

12

0,000

n

0,000
9,290
44,260
29,548

6,390

0,000
Slate
43,096
50590

0,000
30,457
41,498
30,571

31482 6
8,025
35,882.
27,359
6,112
o2,0 10

0,000
24,184

5,045
34,343
51,034

0,000
0,319
46,376
41,524

 

Lo or

s (in Metern.)

4,4440164 . 4
4,1833344 .
4,D 721852. '4
4,3268932 .
4, 327014459

DO

DC
Sw

3 x
wees
I

en
=
bo
r+ oD
1 Le I

4,4716118 .

4,4795478 . 9
4,5300243 .
4,5904833
4,5050608

bo eS Be

4,3270141 . 9
4,3553560

4,5050608 .
4,6205500 .
4,5208034 .
4,477427
452930

bo

ee INO

I I
N

me
pe

4 b362302 24
4,4440164 . 4
A Db 20301 299
4,5894968 . 8
4,1535891 .5

12849598. 2
4,6205300 . 7
4,5904833 . 1
44616723 9

dual dh u à

 

 
