 

 

 

1 1 did oh

re a rs
R * i ae x

 

 

 

 

: 8
| Benennung 5 ep Namen | | Wahrscheinlicher :
ae der = = der | Länge. | und :
N Grundlinien. Ss Beobachter. | relativer Fehler.
’ Grundlinie von Radautz . .|1874| R. de Sterneck, Tuma, | 2 436®.... |nicht berechnet.
Oesterreich (östl. Galizien) Baron von Magdeburg,
Mayer.
und „ „ Kranichsfeld . |1875|v. Ganahl, Hartl, Brüch, | ı5o2®....

 

(die südl. Hälfte) Baron von Magdeburg,

Ungarn.
Trojan.

 

Grundlinie von Königsberg . 1834 Bessel und Baeyer. 934'993124 + 0:91 :

Ht

 

863.500
(Siehe: ,,Das rheinische
Dreiecksnetz, Heft I. die
Bonner Basis,'' Seite 16.)

vie

il

Le tb il

I limit

„ „ Berlin. . .|1846| Baeyer. 11198723032 1 0753

1
| 1.375.100
(Siehe ebenfalls: „Das
' rheinische Dreiecksnetz
u, s, w.'' Seite 16.)

Preussen. 4;
i Bonn +): .\1847)| Baeyer. 1094844025) + 01535

 

 

 

 

à mal Len nla baa ld apa ne 1

À
1.769,300

 

 

2: cetutttluæs, mamie wih |

 
