 

 

  

  

 

  

   

 

 

 

 

 

 

 

 

 

 

 

 

 

    

 

 

 

 

 

 

 

 

 

 

 

 

 

 

 

 

 

 

 

 

 

 

 

 

 

=
| Be Annexe aw rapport sur les nivellements de precision 1889, par von Jialmar.
569 57° 60° 63°
2
Fi Sr
i
pr || 56:
57:
|
h 56°
|
55° nn | Hirtshals 7%... fi
| en = >} Aslbeige

 

  
    
 
  

 

 
 

Es 4
= _ _ | =e 7

|
© |
| Biliund.Avef | N :
| Varde 4 foldinghro| Spxtiolding ÖPENHAGEN ,
= 4 ; i = Ö: x = ù
N RK
t

  

54

 

 

 

x

 

 

®

53th. \Hadersieben

 

 

  

 

 

  

h | = + | = | =
i | | ann RApenrade 1
6 ! | CArcona
| Tondeln  |Afensburg |
lo Eckérnfürde LA hmarn -
=F, i te
ZU | =. 7 arienleuc! Stra

  

 

 

     
 
  

 

ef B 3 Kiel
v 52 Helgaland Y 2
T Amik Fravoyrande
runsbutte
. Cuxhavat Jtzehog, > fe

 

SD fickstéd
SI Am

Wilheliasheven Hamburg
| Emde a ©Bremerhave ol t
j Hack de nd stemü arourg FE

| | 1
ouingen, ar Wochans
À PLéenwade Re 3 = FL joten

on +
é
| = eller + Lote Assen $- Geer
| SMaartensbru "Is if

  

 

 

  

 

Perleberg Gran ee

 
 

 

emmer À
Mernkhursen TE a Rulnen 4

  

Q +

 

 

  
   
     
    
    
  
 
 

 

 

 
  
 

     

Castricum 4 2) + è
Beverwhik =:
ern
Haariemn ©
| Btw; y The en
| ykaan Zee Treuer

    
 

rg ©
SGraveul
: hag abe
a ge ef ;

>
5

Rotterdam

 

soins

 

 

 

 

 

 

 

 

 

 

 

 

     

 

 

 

|

    
   
  
 
 
   

       
  

 
 
 

     
  
  
  

 

 

 

 

 

 

re
NG é Ba Dee 3

CINAVE

ul
(A
ive >
5

 

     
 
       
    
 
  
  
 
 
 
  
   
 
  
 

 

CARTE DES NIVELLEMENTS DE PRECISION ii a Nae re =
2 EXECUTES OU PROJETÉS EN EUROPE IS m eer
1889

Echelle de 1:5,000 000
een

ie

Lines de nivellement simples … ne

a

  

= COTE N
Hirsongs, ‘«\Martenburg

  

  

Thierry

 

   

surMarne

T Baniehiie afancy

En | oe I KG
- ) | Neufchäteau |}
©

2 - | _ 3 5 4 fe Ro S > é Bar-gur-Aube | Mrrecourt ©
Ligrees densvelleneerdt pre lies. ... zuuuu tern N CD EE ee en
Ab = Ihrapanı reperes de I” ordre ... 2 6 a \ \ : |

   

    
   
   
 
   
 
 
  
 

    
   
  

  
 
 
 
 

     
  
 
  
       
  

Saarburg® ie

\Mehm

 

5

 

     

 

ir

Feissenbg. 45 angst

  
   
      
 

 

   
 
  

      
 
 

  
 

 
 
 

 

     
     
    

      

  
  
   
 
    

 

 

 

     
  
  
  
 
  

      

 

    
 

  
 

 

 

   
 

ten fissen 5, sé 4
D |. kel
RER, , à FPR +. 5 aie Bischofshofen :
: Dijon ; Radstadt
: fp Clamecy 5 . i Delemont
Maregraplıes vrestalles | 7 Yo | à Aarburg N 2
no Acherd a A ie Chfiean binon. fp 5 à I | ERBE
7 Les Sables Oane a Qecize 7 2 Fthagny, Franzensreste|  —— > E
/ Te Ridin 3 x € ne |
Mareyra, hes ratlaches © = Feeney laTour wer | a A
— DM à P ee 4 Pontebba
2 ——— ic 8 | ps +++" 9
= Roy ae Ma ait Morg Vi x PBotzen x 6 f
2 5 fl goin CON ES =
Les lines dombles sonterceutées en Trance par le Service dura dle- a 7 3 Bind D le f Le |
NUN RER # a 3 +
i 9 » © 3 väineb
ment général en Allemagne par le, Gendatische Institut D nat LEE fog yen : fake à _ ;
A ee: © 2 : x “|
À i } as af) +
NR BR.ZEN. 7
8 Vicenza. |
à = Padoy, à
ont

 
 

-Straÿlela

 

 

 

Briançon d ve Voghers
x Alossandria
x QWovi Ligure
+ ON
Saluzzo Se
+
F @ d AoncolSerivia Reg
AGenoya Ÿ
Br (um LS ©
” Savona
x

   
    
 
     
    
     
        
   
   
     
 

 

  
  

a/guier 7”
Me
Rertuis

De

( pri En
jardanne “QI

Marseille & Toulon
©

         
  
  

 

 

   

| +, ———
hors te = de an
+ QP rpi =
erpiqna
ANDORRA man
+ x

  

=
NA Fa
& Al tVendres |

  
  

ee 9 7
Zamors 7 © Corda; x J ae

OF Orra/as

 

E77. <
DT Le zad3 Fe Valduncion |

__ GA évafo

gb arg, da

 

 
 
 

©
Vendsell

Te a, arragons ;
| ae | |

—=

  
 
     
 
  
  

 

 
    

 

  
 

 

a
| = — = = 2
&

  
  
  

 

 

  
 

  
 

— fa, 2 | |
Pen la Escalona à . N | Torres
= na Marque | T
oS Crim aldg Tah, — oMag eid. qWeamado ® | | © 2
aver, A Weiz hr Gdieña 27 | | ASSATL
9  Werrijos 4 Qu Q IL inaroz = 5
“TaCalzady |  Tohod se Mio: Noo ee a Cu Steals de Chis | i |
Q oF Fvalmora) | | bh “Tasman Wars Kane 2 de Chisbert ki x R E =
Fice, Dan dal|sg. ~~? ongiiva | 2 vy S
| a D nn en |
Trap | gaz Q | Pris |
à Ô = lo | 9 emblegug Mo Sego Be =e u
Yucen I Er de S.Cryz | Matra) Dis : : "a de! Pinap | = |
ep yadaz 2 FE 8240 des on Hmglaniliz |
gs = © 6 Wee be do

  

Alberigue

 

      
 

Mar Fy À
© logende 1 | @
eda Amante a > IE = | 4 +
4588 de! Campi | r, SSS | \ =
dHellin bille > | = a a = =
« EIR aliesa vel de < | | | |
ff | "guillo à | Elch, Gs icante | | |
+ ¢ f | |
ie | D ES 2 | Molinze dr; | | i |
5 se me oc; ] N rihuela | |
Ja, | . a |

 

Be Aldyjon | —

 

 

 

Gi

 

 

 

 

 

 

 

 

 

 

 

 

 

 

 

 

 

 

 

 

 

 

 

 

 

 

 

 

 

 

 

   
 
  
   

Znaim

   
  
 

   
 
 
 
 
 
 
     

&
agentur
= Faal

T

   
     

ge]

Licata | >
@ 4

rqenti
%

Lo
Rstolpe

Bükow Danzig
A -

|

 

7

 

 
 

enzo,

Rb Graud À
z b

\ \ G
¥
à
+

 

 

Wischau 7 — |

.Soßr#nn |
aigern

   
  
 
     

AE py: Schon au,
„Er! sb se

| Vas

Feu it! @e }
À 8 \

\

| +
| Bari®

ue.
= |

V2 \ Taranto ®

. \
Satama_ |
Gata a,

Sram |

 
       

di.
= = \

$+ + Er d Kielce
sae 22° us \ 10% À
S Norasenberg | LS
2 ER à £ >
Kr AN N À
ndeshut LR LOpye | A
Knlgshain \ ant „strenttz 2), a or
\ à 4 "Szczakow@ | x
any JGatZ | Beuthe metro un
fe . BEER y
fark VR Sagptchill | Weep
im, | > Ve ie sr :\ Labr7ey
x Me À ir 7
, Kabischau |, & Tinnaberg—x
3 PoterrWitz Hogber ee
\ TO
TRO} 1 Pk che

  
 
     
   
       
  
 
 
   
     
   
       
     
 

Le i
MM me +
\

Ss

jou

ng

VP ie
Ir
x \

x

 

Sy, \

 

Terry gaert®
_——

ata,

      
  
 
 
      

ses)
RBA

 

  

  
  
  
 

    
 
 
       

 

 

 

 

 

 

 

 

 

  
   
      

   
       
 

        
   
    
   
     

 

 
 

    

     
    
 
  
 
 
 

  

    
   
       
        
 
     
     
  
   

 

 

 

 

 

 

 

 

 

 

 

 

 

 

 

 

 

 

 

 

 

 

 

 

 

 

 

 

 

 

 
 
 
 

 

 

 

 

 

 

 

 

 

 

 

 

 

 

 

 

 

 

 

 

 

 

 

 

 
