 

STATION.

Ad

DIFF. DE LONGITUDE

 

 

 

 

 

 

 

 

| Kiel. Gerele meridien

Swinemünde. Signal du
temps.
Swinemünde. Signal du
temps.

Königsberg. Cercle meri-
dien de Repsold.

Königsberg. Gercle m&ri-
dien de Repsold.

Varsovie. Gercle meridien
d’Ertel.

Berlin. Centre de l’obser-
vatoire.

Varsovie. Gercle meridien
d’Ertel.

Berlin. Gentre de l’obser-
vatoire.

Breslau. Centre de l’obser-

-vatoire.

Breslau. Gentre de l’obser-
vatoire.

Königsberg. CGerele me£ri-
dien de Repsold.

Rugard. Point g&odesique.
Königsberg. CGercle m£ri-
dien de Repsold.

Kiel. Cerele meridien .
Rugard. Point geodesique.

Kiel. Gercle meridien .
Berlin. Centre de l’obser-
vatoire.

Berlin
Rauenberg.

 

Erreur
a probable.
m Ss S z

— 16 28,203 | + 0,013
— 24 55,166 0.010
— 2 8,300 0,011
— 30 32,477 | + 0,007
— 14 33,936 | + 0,007
— 13 50,278 | + 0,008
— 28 11,819 0,009
— 13 11,592 0,009
— 12 59,241 0,010
-H 0 6,398) | 40,005

 

OBSERVATEUR.

Instruments employcs.

 

 

Albrecht, Richter

Albrecht, Richter,
Borrass

Albrecht, Richter

Richter, Borrass

»

 

    

Instruments des passa-
ges a lJunette brisce,

Instruments des passa-

ges & lunette droite.

Instruments des passa-
ges ä lunette brisee.

 

 

 

 
