 

 

  

 

 

 

 
    

 

          

  

 

 

 

 

 

 

 

 

 

 

 

 

 

 

 

 

   

 

 

  

 

 

 

 

 

 

 

 

 

 

 

 

| ] | |
SF | Na E 6881 u \or8 I. 48 | 8e2; |s'28 FL 1988 | Aruprag | a
a 68T |- NOemıayg A Er leur | yoaA 1uroX | &
e | m 010 | cost | ossem 068 78 | 01 |L’eT 87 [678 ZyNOLESLSORD | ii
+ | ge— |600 |10€6°086 | I68t | zeug A |aes | 26 |689 |T'C 9L 9:78 Inzoaquuy | 5
| A 2 186 | 28 | 008 ga me urdoxgg) 2
. | u | 686 va sen |oco or lei | wosmasomrgom | e
2 A |'e86 Be eo De ZU NOUTOSTL R
| est | zomsseHr 886 8 0m e a umosa| \
+ eo 1681 | paurog A | 108 we jası |eros er |eeı | Srogzııdg | q
| ‚890 BgT | MOSsBH 1286 ze we ao or NUgOSTA | \
4 | ‚820 068T | TO9LLOIS "A ‚088 I ı v@9 |6°ır Fr or | ılowuey} Br
| | 710 u 4 | 876 ma eo non ne unz | &
3 \6TO:T86| C68T | AaTSSeH es | Ges 1:98 97T |MTT | umıg &
— | | Isseros6 | " | x 9:3 |ere Tor or |ertr onodey .
+ | |790°186| I68T | Noouıaıg "A va 01 mer ar leo | BIO | =
F | \966°086 | 46ST | 1978 |98 vo | 068 16:0 ep vo aNogomm-Tem | HOTLIEISQ
ec, 096 \evo FI+ |860 068T | OULSIg ‘A | 879 ws | ser |vs 81 18:9 aoqgıy  urmärg
I 1986 186°086| 0 900 GEST 1osseH 1876 88 | 608 |6rea LT |8'9 | PeayoppM | a
| 99+ |e86 | 180186 | 0 |0g0 a # ‚886 ec es Irae 97 |F°<C urosrey | 2
Se | \ 976’ 086 | 0 \620 I68T | pouroIg "A | E08 DRS TEN | MEER UIOISYIBIN Bi
ron, ‚886 ‚000°186 | 0 2c0 | “ 606 L°& | 97 \srsr u: | ampne © | a
F | 8I+ |886 \766°086 0 180 76ST | CNN 9:3 | 978 |T°er 97 oe | mewoay-yosLupr 5
E | ran |086  |roo:Is6|0 [220186 | . | Tee jerie SL | ee | Ze ‘
ol ri 896 0.1866 68T | TOseH |1916 Ps | 878 0:68 27] Porz u) e
ame ale 1H6 0  |196°086| F6ST HI 106 a cos 6 veeH | “
Hi ıı+ | 226 766 0 |TE0:186| 68T | AOJSSEEL cs 108 | 000 &Is SI |6'6C nd x
08 + | ge —| |726:086| 0 |L66086| F6sT emp  ||266°086 | ©°8 | 986 8:18.91 | 1/69 .8% u y9ToLıaıs()
UDSSZOR Da un ie wo | ud | | —_
0% 050405] °% | 20 1,8) °%6 Auer | aoyypwgoag. tee oayora| eyoH odugf | opeıg | uoneIg | puv]
| | | | | ae | | | |
LES I'LL

ka kulbanksssiuunik nun.

 

 
