4

TER TTTTEETTG

 

ik
ii
zE
2B
1:
3E
B:

F

F
A:

5

381

Tabelle III.

 

 

 

 

 

 

 

 

 

 

 

 

 

 

 

 

 

 

103

 

 

 

 

 

 

 

 

 

 

Be | En | En H
eG Ai IR
22 SEN an Zn
alr | ala 5 P|es > | ®
N 2 | So 3 eIPR ein
S = & I et St
3 = a 3 | o S
an sg | 3) (map
5 Sl | | er | |
= En ie he a
Aa = N IN ea | ZEN | ZEN
ur RS | a | 5 [88 kESBlES>
—ı 0
iS | S i | = | =
a—-b 2150 |+ 1,54— 2,982 + 33,28 +-13,94 a
2150— 2148 |+ 0,08 — 2,024 — 815—2,22a| 2148 + 1,57— 5,002 + 25,13 + 11,72 a
2148—2147 —1,69 + 2,922 + 0,02—0,66a|| 2147 |— 0.12 — 2,08Sal+ 25,15 +11,06a
2147— 2146. — 0,93 —2,23a|— 8,55 —2,46a| 2146 |— 1,05— 4,31la-+ 16,60 + 8,60a
2146— 2145 —0,55+ 3,29a|+ 1,82 —0,15allı 2145 |— 1,60— 1,03a+ 18,42 + 8,45 a
2145—2144 —1,64— 2,49a — 8,10—2,30a| 2144 |— 3,24— 3,52a+ 10,32 + 6,15a
2144—2148 + 0,03 + 3,28a+ 1,89—0,53a|| 2143 |— 321 — 0,24a+ 12,21+ 5,62a
2143—2142 2,82 — 2,34 a 6,45 —2,35a|| 2142 |— 6,08— 2,58a+ 5,76+ 3,27a
2142 —2141 +2,22 +3,16a+ 0,653—0,40a| 2141 |— 3,81+ 0,58a+ 6,39+ 2,87a
2141—2140 |— 3,71 — 2,604 — 7,19 —2,71a| 2140 — 7,52 — 2,024 — 0,804 0,16a
2140—2103 + 3,41+ 2,93a+ 0,80—0,16a| 2103 |— 411-+ 0,91a 0
2108— 2102 2,55 — 1,37 a 6,26—2,47a| 2102 \— 6,64— 0,462 — 6,26— 2,47a
21092701. 7 505. Slsa 0,11. 0,540 >10 2 00 eo os orale
2101—2103 —2,52—1,78a+ 637+28la| 21083 |— 4,11+ 0,9la 0
2105—2104 + 5,11+3,14a— 0,53 —0,28a|| 2104 + 1,00+ 405a— 0,53— 0,28a
2104—2105 — 1,92 —1,68a+ 4,45 + 2,642 2105 °|— 0,92+ 2,37a+ 3,92+ 2,36.
2105—2106 |+ 3,68 + 8,854 + 0,36—0,07a| 2106 |+ 2,764 5,72a+ 428 + 2,29a
2106 —2107 1,55—1,87a+ 497 +2,39a| 2107 |+ 1,21+ 3,85a+ 9,25+ 4,68a
2107—2108 |+ 5,18 + 3,14a— 0,03—0,20a|| 2108 |+ 6,39-+ 6,99a+ 2 4,48 a
2108—2109 |—2,77—1,9la+ 6,93 + 2,67a| 2109 + 3,62-+ 5,08a/+ 16,15 7,15a
2109—2110 + 485 + 3,252 — 1,00—0,47a| 2110 |+ 847+ 8,33a|+ 15, a 6,682
2110—21]1 —2,17—1,7a+ 8,18+ 2,84a| 2111 + 6,30+ 6,68a|+ 23, et 9,52 a
2111—2112 + 3,31 +3,25a— 0,48 —0,04a| 2112 |+ 9,61+ 9,9a+ 22,85+ 9,48 a
2112 —2113 —2,49—1,78a+ 860+26la| 2113 | + 712 + 8.15a+ 31,45 +12,09 a
2113—2114 |+ 3,96 + 3,60 — 2,70—0,36a| 2114 |+11,08+11,75a|+ 28,75 +11,73 v
2114—2115 —4,26—1,98a+ 9,60-+ 23,63a 2115 + 6,82 + 9,77a+ 38,35 + 14,36 &.
2115—2116 |+ 4,26 + 2,98a— 2,78—0,05a| 2116 |+11,08+12,75a+ 385,57 + 14,31 a
2116—2117 — 5,06 —1,84a|+ 10,03 + 2,4la| 2117 + 6,02+10,91a+ 45,60 + 16,72
2117—2118 +5,47 +3,18a— 3,06—0,17a| 2118 |+ 11,49 + 14,09a + 42,54 +-16,55 a
2118—2119 —5,08—1,73a + 10,40 + 2,76a| 2119 + 6,41 + 12,36a-+ 52,94 +19,31 a
2119—2117 |—0,39—1,45a— 7,34—2,59a| 2117 |+ 6,02+ 10,91 a+ 45,60 + 16,72 a
2117—2126 |—5,835—1,88a+ 930+ 2342| 2126 |+ 0,69+ 9,032 + 54,90 + 19,06 a
2126— 2127 + 1,63 — 0,78 a— 8.45 —2,94a|| 2127 + 2,33 + 8,25a+ 46,45 +16,12a
21872128 4,72 1,902 + 839 +2,32a| 2128 + 2,39 6,3524 54,84 + 18,44 a
2128—2129 + 2,68— 0,908 — 5,67—2802| 2129 + 0,294 5,45a+ 49,17 + 15,64
212932130 — 2,94 — 1,86a+ 6,10+2,30a| 2130 — 2,65+ 3,59a|+ 55,27 + 17,94a
2130— 2155 |+ 1.50 15,002 10.20, 2.932 || 250) 212977 2,59a+ 4901 +15,0la
2155— 2154 |+ 1,18— 1,682 + 6,90+2,53a| 2154 |— 0,11+ 0,91a|* 55,91 + 17,54
2154—2153 + 0,11—0,9la— 8,80—3,0la| 2153 0 + 47,11 + 14,53 a
2153—2152 +2,08 —1,9la+ 7,34+2,43a| 2152 |+ 2,08— 1,91a+ 54,45 + 16,96 a
2152—2150 —1,26— 1,072 —1114—3,02a|| 2150 |+ 0,32 — 2,9824 43,31 + 13,94 a

EL"

 
