 

109

TABLEAU IV

(suite).

 

 

  
 

STATIONS

 

 

 

Nons

Description

   

LONGITUDE EST DE GREENWICH

 

Ire hypothèse

Que hypothèse

 

Se OU DD

la? ar a? ar -T
OD II

=

QUE

|
;

j
|
i

eo WETTTTERTET

Hcacoco

+4 9

dd ares iosodsd
PERERPEREE TAT

pre pe

Le Li

er

9 O2 C0

AU

"C9 M O9 Hi O9 C0 AD A2 LT CO AO mn

 

 

 

PATHE Pye ARTA | PRIYA NL Ep

 

Lemberg
Lerida
Leyde
Bipetak
Lisbonne
Lowisa

Lund

Lyon (Saint-Genis

Laval)

Lyon (Four vières)..
Madrid

Madrid
Mannheim

Marennes
Marseille
Memel
Milan

Moscou
M’Sabiha
Munich .

Nantes
Naples

Nemours
Neuchatel
Nice.

Nicolaieff
Nieuport

Novo-Alexandria .|

Odessa
Orel .
Orenbourg .
Orsik.
Bachıno.
Padoue
Palerme
Pass, =
BDiedu Midi

Point géodésique .

Point géodésique .

Cercle méridien: \

Pilier, point astronomique :

Clocher de l'église luthé-
rienne

Centre de |’ obser vatoire .

Pilier du peut cexcle men
dien de l’observatoire as-
tronomique, rattaché au
parallèle moyen. à

Pilier du cercle méridien

Centre de l'observatoire .

Cercle méridien

Point géodésique à Vobser-

vatoire

Clocher .

Cercle méridien

Point de Bessel au phare

Observatoire, centre de la
grande coupole 3

Cercle méridien

Point géodésique .

Observatoire de Bogenhau-
sen. point géodésique .

Cathédrale, tour australe

Observatoi'®de Gapodimonte,
centre. Be.

Pilier meridien

Gercle meridien

Observatoire, petite méri-
dienne
Centre de l’obser vatoire .

Tour des Templiers

Coupole de la chapelle

Cercle méridien

Pilier porn astronomique

Pilier, point astronomique

Pilier, point astronomique

Bomt eeodesique >

Quadrant mural

Cercle méridien

Méridien de Cassini

Sommet géodésique de la
chaine des Pyrenees

 

m
96

»

~

17
158
—36

104
52

ie
30,595
56,192
24,760
44,680

54,188
45,041

8,091
16,471
45,010
19.079

50,482
25,459
34,631
93,974

; 45,949

17,118

3 23,672

26,100
11,839

1.760
23,904

49,960

12,219

a 53,830

1.1.90

7 49,762

2,182

| 15,568

26,369

13,549

29,197
29,222

25,937
21,001

Be UTA

 

m
96
2 30,484

17
158
—36

104
52

123
144
220
294
60 :
47
53

9

  

Ss
1,

06,191
24,107
44,680

DA koe)
44,988

8,520
16,400
45,081
45,150

50) 428
25,930
ae 560
23,220

) 45,886

17,065
93,745

26,049
1,310

1.699
23.029
49,897

53.777
1,767
19,709
2,079
15,515
26,316
13,496
93,136
29,163
95,876
20,930

34,100

 

 

 
