 

 

 

 

 

 

 

 

 

 

 

7 +
gt
+
se +
ec 4
6L+
ee I
& oe
gg | ccH
at | ct
66 | ct
vu ca,
Tg + | 6 +
98 + | e+
0
eu.
Pan.

 

 

rar |) Gran
en ae:
6+ |me+
Bi | 99+
84 0°4
6ee+ | LEe+
Oya ce,
nH | 99 4
|

un g-07 | wo g-07 |

0406 |04—96)
|

ENS:

 

 

Sad
N au
19 10

a

\

&
IS)

a

ı

nm
Ne)

1

o

9 29 10
SENDE

Bi ©
Arc r ca rcarmarmn rm m
II Ne}

m
ia

 

186

 

 

 

 

 

  

 

 

 

 

 

 

 

ov Itee FO6T | z || 824 0X ee 0 0.0< pogsıg :
0 [es a a | aeg ee IT 0:08 10s10J | 2
| 0 18 1061 I m uos1opod | 94T See, OT 6'61 Bodg, ® =
20 190 E06I | wosuwyor |CcC Base 01 |8°61 Kqlokt, z
oo see Fo6L | i 1698 Oxe | c9 oxer 07 <u6r | dnzourwoL &
| 0 108g [061 en uosıojoq | SFC De Do | Z2ogAN | =

0 199 g06T | ussuwyor FC ie ı «9 |8’9e OL 8:91 P24so1IOH | Iwururq

0 \6ıc G6ST | Uessnuseg CIE ge | sı |F'sr FI |9°9L | or oFunpy | woquıog

0 1889 FOBT en wostogod 08C Bao ao ca Suossy .
| 0 |ase | a |ere Ne ee oe (Ras yuoz) odung 3

0 \geg g06T | uesusgor |68C ie w» 99 or Um due, | “

0 122g 2 2 en Kqoıg-topuog =
Io m TO6T | en uosuogog | One 237 1032 oe | (yes 'quoz) Squerf | NUewouge
wo ‚899 Ba % 92 | 15 area vr |uer \ostarsr “Ipau wofypng =
| 0 988 Kar a lege 28 | 66 oma r a. OL or a
E20 GGG G6ST | Uossnwsey | YFG re F NUM OfstH | wfoquıog
0. 100@ S06L USSUBUOL 8G 0'% | 98 0 ANIPUIR@AST | AABWOUGT
| 0,964 C6ST | uassnuse 99 IS GTT T 9yıy SuEwoaJy 2 wOquıog
| 0 ee FOBI | n uosaogog| FCC 6°T | 69 dnuyswer e

0 |29G 8061 UOSUBLOL | 674 oa SIOISTOIOTLIT =

0 1898 FO6T | en uosıojog | 994 Bes s2upH | AIBWouRd|

o [erg u 3 8cQ ae ONtaIstÄN ä

0 1864 a . 194 9:6 | C0L ON Ortupr 201sQ | &

0 |198 C6ST | Wossmuseyg | 19C Se or SAAL ONTUBAg | woyIOE

0 |r98 SOBT | wn uosıopod | LVC 08 | #8 Aop | a

0 |reg £061 | uosuByor | 1eC 10% 99 mo | YIBWOUBA

0 189186 | 68T uossnwuseT | LE2I86| 9° 297 UOIIRUNLopAy | WOqUAIOS ;
Bea gef | doygowgoog, Oro tor ONBEL| osuyT | oneag | uoegg puv

 

III '9®L

 
 
