ee

nenn

es HT

.. da 0

dio 0,00001230, e si indicano con
S-la Tesa Spano
_ E-la Ertel
P-quella del Pert;
Siccome la Tesa Ertel per studii anteriori @ minore di quella del Pert di 01,0072741
a 13° R., cosi si avrà
S = P+ 0'0156850
E = P—0,0072741

© Napoli addi 1° Aprile 1866.

a 13° R,

Tl Professore di Geodesia

Frederigo Schiavoni.

 
