 

| 174

L’amplitude presente les variations suivantes:

| m |
12 18 49,7
15 »9 39,0
29.48 13,4
28 28 9,4
31.48 Di
‚36 S0 9,4%
49 A& 2
07 35 1,1

La serie a done dure 48h.
formule (1). On anra

Di a

et l!’on trouve :

44 m. entre les amplitudes 63.2 et 11. Appliquons-lui la

0,000149 > 1,3

= (,00046
log e

0,027 ' 0,098 de. 63 a 13
0,027
0,010 |

DU. de 18 a, 9
0,008
0,002

v2 0.009 de 5a)

0,003 |

ll

ey 1a WRITE MARIA I. 11

Da

kon imikı \

ll)

 

 

 
