 

"s[oToyjo SJUaUIN20p XUB OUIO}
-U09 50 oyduigo}io affeanou vT
*G88T 9p }roddex ef suep o2foçduo
9[[09 Sp AlayIp Sosuq soutey.ted
ap swou sop oydeıdougio,] ‘od
-dex Juasgıd a] sueq *"P 990 MN
“Io VI OP NBOATU
ue soympor 939 sud quou ‘038
-uB9,] 8 soanyıs “ourpp 49 uÂeqUuES
-soI)“ op soseq SIT "BE OFONT
BT 99 17/7, sounjoA
« sopnyygsup 3 'w 'y 'y sop uo}
-[9g1y OYosıyEpoad-yostwouorsy“
sot [ug 49 1ıeJnyg “peIsjosop op
soseq sot Inod MOA "3 840 M
‘simonsuot
SOJ[OANOU SO Jo SOuuoIout SOI
alu sedUeleyIp sey Ins s[lejap
sSuor sujd op sed suorouuop ou
snou Issny ‘UOZHOU,] & SUOTJOUPAI
Sa] suup mojıns ‘spnofea suorur
so] suep SINOLIO P aIqwou pur.ıd
zasse um 9faAgıL 8 UOTBj9 ToAnNou
np uorJouoF ua sınonsuof sap STnd
-[89 SIP UOISTIIO,| % H94MIIX9 SO9u
-UOP S9P SAT}U94}v UOISIADL UY)
“[BUL9P MIP1O ,], NP SOJUN OL À C9
op TE.19U93 u9 Juos [EULIOU 91J9UT OT
uosruteduoo op uojejo ınod yueu
-o1d Uo sagTNoTVo quoumoopt $9[[09
ap }o sınonduof sd op somy}It
-vBO] So] 91]U9 sodUOLayIp soy
‘(soquearns
Jo g ‘d ‘A ‘V oxouuy ‘688I °P
snpuoi-s9}{m09 110A) ‘OUU9IA 9P
o[UmIOu IMC vl Wostwreduron
op uope9 anod queuoid ue sosçno
-[U 30 sIoje.yne sosturpe sınond
-UO] Sat juojuesaider sosgqjuoied
aU9 9IQUOU sey "IT SION

s9}epor
919,p JUUMIOUT SJLUT

 

 

 

SE à LL Da LL RE SSO

AT
II
=I ‘oll ose
TOR POST
al 9 sep suoıyenbrf

I

err 106° €
1G 106 &
oor 106° § = II
L0G 106m

)
)
)
)

I

T

I

I

neaing nt
v1 op seis

0 +
) +e
gig
0 +

euro qut

€
€

0
0

® osuq op rroredd

‘o +4298 [LO 000°
youn

00 000 0000 + + L0F TIO 000
:S9INSOJY 39 Spiog sap TeUo

(23 8T 800 000 090'0 +48hL LLO 00
(:3 80 800 000 0000 +4486 TTO 00
‘ua

(23 36 900 000 000
(<3 68 &

wo soajnooxg soouartadxe soy satdu,p
‘ ‘ .. x €

“(gg U ‘II ‘V oxou

-UV ‘G68tT °P sup
-uayJ-sa}dwo/) OA

 

UOBYEeITD
ap SYUETOTF909
Troıedde,[ op sopser
sop uoryenbrf

 

1

 

br

*soINSO TAL
49 splog sop [eu
-olyeusojyul neolng
Up [BWAOU 219

uosterwdwoN)
op SUOTUJT

 

rn

‘ojo “uaryoLıme
oseq op plereddy

s9{oçduo
oseq op spreredde
sop UOIJeUSIS9(T

de ment tu

 

rennen

pn

‘8909/90/89 UON

SOATJU[OI
sımalıa
je soçquqord
sINOIIG,

*T 9300 ALOA
(OLSr‘ GLP)
SELPSLPS
TU

‘T 940U ATOA
(L919°0L08)
LL6L 1908
wu

"[ 940U ITOA

(QL8T'LSS9)

79981978
wu

ST. 9300 ILOA
(88918788)
LSFL'8PS8
u

*[ 9}0U ILOA

(006886)

SF90 7876
w

JOUL VB] Op NBIA
| -Tu nu soJIn pat
| 90 saajnojed
sınonguorf

 

‘graoyın/d op
“uusurkoig
‘TH
‘Tuvuvo op

‘graoyınkd op
‘Topo
“LUI,
‘uvue9 Op

“ULOUJMH 9P
‘FAN
“rau

“Joust

‘Tyeuey op

oem
“erqgosderT,
‘uuewAvIig

‘leqeny op

*UIOUJIE 9P
SZHAMU9S197
aeg [yguegop
‘togeny 9p

SIn9}BAIEsqo
sop SUON

 

2 EEE Te

‘4 9JOU IIOA
‘0481
39819 AUT
sues uo ‘SIOJ XN9P 991NS9U
‘p 9JOU ALOA
{OLE “A CV, oxomny,
e981 op snpuay-soJduwon
S9[ SUUP USIS 9P oseq opçedde)
‘oneme( ue
NIS da asvg ‘6

‘g 9J0U ILOA
‘6981
‘sas1OAUL
sues uo ‘SIOJ XN9P 991NS0U
forueqiy ue
javınyg ad ASVG 8

‘& 9Y0U JTOA
‘E981
‘S2SI9AUL
sues us ‘SIOJ XN9P 991USOU
‘ouauog ue
‘Lavisaasoe aa asvg “L

“098T
(pou Jusu12ag)

‘S2S19AUT
su9s uo ‘SIOJ XN9P 99INS8U
‘Sinqavyy seid
‘CIGHSHOINVAY AC ASVG “9

“LESt
‘sosIOAUL
suas ue “sloy xnep 9910590

‘LAVISNAN-AINTIM AG asyvq G

ce Pe m —

erqnop no opdwıs einsour 8] 9P
o9uuw 49 aseq BI 9P
uoreuSisop sted sop smoN

 

 

 

 

"ISO NOH-HHOTALNAV

-(eyng) °I neolgeL

 

 
