  
   
 
 
 
 
 
   
   
  
  

en

Erreurs de clôture des triangles desquels ont été mesurés les trois

 

 

 

 

 

 
   
    

; NOMBRE ee -
| AUTEURS DES INSTRUMENTS LECTURE _ DES ERREURS | à
É Es u hs EN Be OBSERVATIONS DE CLÔTURE a >
A EMPLOYES DES 4 7 ; Sena
F4 SECONDES 5 i EXÉCUTÉES DE nn
2 2 en "VERNIERS ~ POUR CHAQUE A2
> DIAMETRE DU CERCLE OU DES ‚CHAQUE ANGLE BINGEN va
a T Du 2 MICROSCOPES na 4
HORIZONTAL MICROSCOPE CHAQUE :
5 N DIRECTION bh
59 Repsold 12 pouces. 2 2 a 0222 0, joe |
56 id. id. id. 9 0", 70 0, 4900
57 2 id. id. id. 9 0,07 | 000m:
58 7 id. id. id. 9 0,88 0, 1444 |
59 A id. 9 0.93 | 0, 8649
60 id. id. u 9 0, 07 0, 0049
ao Ol id. id. id. 9 0,46 | 0,2116
=  @ id. id. id. 9 la ee
i 63 id. id. id. 9 3 , 85 | 14, 8225
i 64 id. id. id. 9 2 ,0021°4 0000!
. 65 id. id. id. u | 1:58 | 24964
» 2 id id. Co 0.75 / "| 0,5625
id. id. id. ng 0 87 0,1 a
68 = ia; id 9 0,47 | 0 u on
69 id. id. id. 9. 0 ,43 | 0 18400
i 0 id. id. id. 9 0,39 0, 1521
71 id. id. id. 9 (1, 11a: 0, 0196
12 id. id. id. 9 0,04 0, 0016
73 id. id, id. 9 0,31 0,0961 | |
74 id. id. id. 18 1 1, 3680 |
75 id. id. id. 18 120 1, 8225 a
; & eo ww...
| id. i id. 3 225
78 i. id. id 9 0.78 <7 Oo
7 id. id. id. 9° 0,52 0, 2704
80 ‘a ic: id. 9 0,04 | 0.0016
sl 7104. 102 id. 9 1,98 Bi, 71249
82 id. A de 9 2,46 6,0516
83 id. id. id. 9 0, 04 0, 0016
84 id. id. id. 9 1,54 2,3716
2 id. id aL 9 O. 1 0 5329 |.
-86 | Repsold 8 pouces. id. id. 9 0,34 0, 1156 |
87 id. id. id. 9 6,90 5. 0, 8100
88 id. id, id. 9 1 30 | 1, 6900 |.
89 id. Id id. 9 2,09 | 4,3681 |
ss 90 id. id. id. 9 0,3 0,160!
= 91 id id. id. 9 0 , 9. 0, 6241
a 92 id. id. id. 9 1,08 a" 0201
93 id. id. id. 9 1,3 3. 6100
94 id. id. id. 9 Ol 0,0121
= 95 | Ertel 12 pouces. id. 4 12 0; 47 0, 9409
96 id. id. id. 12 0,51 | 03240) 0:
97 id. id. id. 12 3,06 9, 3636
98 id. id. id. 12 al 0,3721.
99 id. id. id. 9 3,89 il, AQ?
4 100 id. id. id. 9 ee oe
101 id. f id. id. 9 L238 Be
102 id. id. id. 9 1,04 1, 0816
103 : id. id. id: 9 Bn 06 15, 6025
i 104 id. id, id. 9 1,28 1,6384
= 105 id. id. id. 9 00 28, 4089
a 106 id. id. id. a 2,85 8 1225
107 id. id. id. 9 Reon 5, 1529
id, id, id. 9 4,33 18. a

 

 

 

 

 

 

 

 

 

  
 
 
   
 
 
   
 
   
 
   
  
  
  
