[IR fering me ES +

ae

    

1 RES em

 

N ART

Kun

la

 

LT OLD TL TT

 

 

Regle natureil
P, = 38200

Ter nperatures

   
 

202808 40°

 

 

    
     

      

Reöle huilée
Ps = 109° 45

Ternperatures

 

 

 

 

 

 

 

 

 

 

 

 

 

  
    

Aceroissements
de poids

   

=

0 10° 29°

 

 

 

 

 

 

 

Regle naturell
P, = 759°20

Temperatures

30°. 40°

  

 

 

 

 

| | | | | qs
Tannen nm pepe |

mm 0

 

 

   
 

 

Accraissements
de poids

Regle huilée
P3 = 82720

rt 4
7 emperatures

 

 

1

 

 

 

 

 

HJ

 

 

wn

 

 

 

 

 

 

 

 

10

 

 

12

13

11

 

M?

 

 

 

 

 

‚13

 

 

 

 

 

 

169°

 

|

Accroissements
e paids

 

 

 

 

Lot ee

 

 

 

Accroissements
de poids

 

 
