 

——
|
|
|

 

   
   
   
   
 
  
      
   

 

 

 

   

 

 

 

 

 

 

 

 

  
     
   
        
    

 

 

  

 

 

 

 

 

  

 

 

 

 

 
 

 

 

 

 

  
 
 
  

 

 

  

 
     
    
   
    
 
 

 

 

 

 

 

 

 

 

 

 

1
| | |
| | |
| | | |
lusore | Sr 2313:
|
FE MERIDEN DE OuITo. | ‘
1
| |
| |
| |
|
SCHE TESTEN SEHNTETRERT I |
| < > |
And |
nn _7000.000
1 z |
FA OS rn ee ee rn N ee a = Be a2 A ne I: Ga NP = Kase = + 2 }
' | or meraldas
|
| L ( N : >
| SS oCumbal 4790
! N
| \ | RR ’ |
| \\ $*-+.+-+-+ + x "@fulgan+ 0 48 25”
N | ‚m 3000
N N aChiles 40}
| \ \ ] Pojsde — „Troya Im 3525
| Il Im er — >s
N 7 N
1 \ : ) . S
| f | N / = Mirador
| / | N o 875 7 4 / Im 3830 |
| 7 | N > I |
| nn ) |  Yanalreu 2 DE v
| | | \ Im iöso IS
| IN a nn |
| | | EN Cotacachi 44864) | }
I . | >
ii | al a, ! arr |
| j \ m Do ie | , mbar un
| | |
| | |
I ! > | |
0° { Equateur en =, I De ı ah ea 45 \ ! _ 0°
| |
F |
| | |
ol Santo Domingo o
| Y | N delos Colora d’os \
| / |
| | |
| I
| I
| I \
| |
| I
z |
— | Sincholagua |
| 1 4535 |
| Pam a ia de Caraquer @Antisana 5756
| n
nn |
k : I |
| | L N eG zn Amio Colapaxi 5943 l ES
\ I
| I
| N © |
| \ | “
| I
| =
| |
I I I
Ki | oO |
- I |
2 = = ze de en ne (a za az an 0 on 2 } —_ ee
> | SPorloviejo | g | |
j |
\ | / l "
| I ® |
. | Er | |
I |
N ' x | \ 25
| | x | N I |
| | ) | | |
| | a |
odipifapa I© | |
| 74 !
| Ä I
OBahos | < |
| N ulm = ® P 18e0 | }
\ e J NS po © Tunguragua 5087 ' | |
{ | I: |
| 3 un
| | a | | |
5 | | © il
ü { l
— | Yı.. i
| | © kas la 730 © | j
| Es e 5
3 ] @Altar Slot 4
) pi | 8
I
; | 3 | Fon ! ’
| | > | {
er ! GE [ | I j 7
oMangla: alto \ N ! enangay 5323 I 1:
N da; un 2 | |
@ N m nas,| De N
| I | |
< i ji Ei |
an x ; Sarnen \ | |
in L un _ ı.2 Li
| US / / | i ay
' | —a _ / 7 290 | | | ‘
| ud / | | f
| ö N | | | #
: | EN es | a
Medimaremetre - Change 2 ya | |
N I | 1 n
was —Tio-Loma | |
- 34 | z _ Im 4300 I | |
| / Ve EE | la | |
| + | ! |
4 Sn |
S_ A e J ' lAm Kö | | | « |
- nen | nn | uinoa-Lome z ' | | |
| a Im 3975 | |
_ | | {
| a
> | | | |
Morroo r ; | N
| | !
I =
ck Namureite |
DE a | lm 3550 7 }
re A Si
} Pu , | | |
} | I !
\ f | Cuenca S | | |
| una Zu | er za : | El
| = |
| nn
| | f

 

 

 

 

 

 

 

 

 

 

 

 

 

 

 

 

 

 

|
|
1
1
|
!
|
|
\
ierroureu _ LEGENDE
Or [ mn. Base: |
| R
ei Difference de longitude. | \
\ -_—-_-—- Azimut. |
oO Station astronomique prineipale. | \
7 / 2 98 | °ı
.._..e_ : nn "Guacha-ures- ne m» Latitude au cercle meridien. 1-4 '
m 31oo S | |
2 1 — au theodolite. | |
ee) A — 4 Fastrolabe a prisme. | f
| 1
A ns) | m. Station magnetique. il
\Colambo | |
Lm 3100 X) | OP — de pendule. Ss
| : Da | |
, ; s —_—_. Chemin en explotation. |
Desert de n |
2 De De en Nivellement de precision. | |
x. en
f ER Y Medimaremietre. | |
+ | f
. z R | ® Capitale de province. |
&) 7 _oAyabaca | L |
l | —Z | “ © Sommet montagneux. |
,, / / | > | iS 3, ö 2 |
f 2 | H ——akos Bozos | x ur, Doonkere d Blar. |
\ 7 / An 008 | z | | |
\ I
x nn | si 5 ; , sus | |
i 2 + 74 Stations geodesiques (les nombres places a cölE indiquent
= > | = u |
| i | les altitudes provisoires 4 25" pres). |
I r
| x |
s | x 3 Bases |
x
| ‘x > .rr, . TIERES I
| x, | 8 Differences de longitudes telegraphiques. |
| _ | |
} x | Be :
| i 6 Aximuts astronomiques. |
| i : Je s DR = |
r | 10 Latitudes au cercle meridien par distances zenithales meri- | |
| x | diennes. |
ner en = en EN EIERN > SS en ar . . ls
mE 5 a | 44 Latitudes au theodohte & microscopes par distances xeni- +
> ı e | thales circummeridiennes.
“ |
0 | \ . ro Latitudes a V’astrolabe & prisme.
_n r }
| y . % | D sinne mnonpt c
| Huancabamba © : 48 Stalions magneliques. ä |
| x s |
. | # 6 — de pendule.
x | 5 2 Lignes de nivellement de precision comprenant 410"" 03. |
Sr + | ee Sr | 4
No 2 + | 2 Medimaremeires & Salinas et Payta. |
= YA K | | N
> | 4
| |
ä | }
2° 49 0° 2007 jo

 

 

 

 

ENTE EEE EEE EEE EEE EEE EEE tn ARTE ELTERN PERLE ESTER. Jarmeeimnune

 
