 

 

8, = + 40(—&, +h) = — 0.86 hi = 21.02590
= + 23h Ah = + 1.05 h. = 37.00035
De 69 &, = — 141 hy == 24.80182
6, = —162% +) = + 1.48 Rh... 1542143
nat = — 028 hie == 10.73461
Sioa Us oe 0 he == 1000100
6,= + 67(—4, +h) = + 8.74 A. 18.838871
6,= + 37 (—&+%) = + 0.59 h,, == 1.04042
ans EI Kia = 046 h, — 24.834177
J, = —10.0 fk, ed heb = 01087
Öse 3.4 k, = — 0.66 b= 22901188

Der mittlere Fehler m pro 1 Kilometer ergiebt sich:
in = V CRE pue = 2.653 Millimeter.
6 6

Die Höhen der einzelnen Punkte über dem Mittelwasser der Ostsee finden sich,
wenn auf Millimeter abgerundet wird:

Ba = 134.551 Tr oo ss
So — 131.235 Sa — 149.178
R — 128.519 eo:
M — 126.006 Br oa
Re 1n187 6562 — 108.015
F — 150.814 6576 — 123.188
H — 185.387

Im Band V der Nivellements der Landesaufnahme sind die Hühen der beiden
Boizensteine über Normal-Null angegeben und zwar:
6562 — 107.843, 6576 — 123.018

m
Addiren wir zu jeder dieser Angaben 0.056, um solche. auf das Mittelwasser
der Ostsee zu reduciren, so erhalten wir:

6562 — 107 899 ü. d.O. 6876 — 123.0744. 4.0.

Das eine Resultat ist um 116, das andere um 114 Millimeter kleiner, als die
oben gefundenen Werthe.

Dr. Nell.

—— — ——  EEOEEOOOOOO>

32*

re

 
