 

 

 

 

 

 

 

 

 

 

  

 

 

 

 

:6 Irc6
6 986
186 186
:6 \ 886
6 016
6 676
66 76
6 806
5 |i686
3 66
6 G56
SIG \856
116 G6
16 1996
‚T16 8°6
Te 786
16 "E16
06 126
06 \eıs
‚06 1916
906 E88
906 1168
06  |286
|106 |irss
006 86
| 268 °16
168086
um I

Dee a

906086

wo

D

0
0

0

I+

v0
0
0

v
0

0

0

0
0

0

Tao or

 

|900°186

 

|086°086
200° 186

|216°086

68T
I68T
6681
9681
u
c68T
968T

u

c68L
u
I68T
68T
9681
66SI
I68T
68T
9681
6681
9681
6681
9681

u

6681

ayef

 

 

 

19ABN.

u

en I9UIOIS A
A9ABN

"Bn NI9UISIS A|

BEyG NG |
|

u

I
"en J99ULOIgJ A
9A |

u

u

JTOABML

"w'n I9UIDIS A|

 

OA

BnELLEIS"A|
: '
1948

 

en JO9ULISIg A,

A9ABN

BnNO9WIOIg A,

\og8

zug A
"Ben JI9ULIIS A
zu A

u

"en PI9UIOIS A |

101y0B1091 \oronıpog o1yoıq

kiue

 

 

sI6

‚888

776
706 !

\F6L |

766
666 |
G98
906 |
816

| 866
BNNOO9ULOIS A

906
906
186
066
888
188

188
198 |

206
798
016

768 |

488086 |

wo I

een rein

 

 

 

&
a

x

|
|

au

au

%

407
gs

0
IS
9758
&
"WW
0°
vs
6°86

 

a1

G

au

 

al

au

 

a car au

a1

au

 

a a

aa

 

 

sI | 9°88

 

 

er lee
36 | 1:68
ST 9'218
35 |6°%8
un | 2°<8

 

6L | 2:61
ST 6:81
08 | 18T
ST ler
08 \©°91
61 9° FI
os | rer
sı |erer
ae
9 zz
MB ee nr
Is |7'6
LT \2°8
18 |6°9

a

| OyQH | duy] oyoag

 

AugsojodeL-ÄSeN
2998[o4
®AATOZS

SOPIIN-IZ8
zyuurogos
SIHNUNML
Ape3sIoıT
elfeuıosL
osorquıyzs
OABIA-SOAURIY
uägg

J9SZUL, |

ZIUOSOL

eıynoN

9A9LUFT
HOUDN

BUpe A

OPA
1094-4uezg-oles
a
BRNSSIDT
°TI-M uorm
vyueTeH
SIUILDZS
Sınqssoid
(eyor
1OSI9WAT

 

uoreIg

 

|
| u

|

|
| u

|
1 u
|

uwaun]

YIRALOISQ)

umsun

PUBT

 

 

T 9

 
