ine nn

 
 

TTR LEUR LL UNE Jana) T THT IL A TAT Fame vel chal

 

   

 

 

 

 

 

 

 

 

| | nn a ee
|uouoryeorpqug 1op pur 'ITAX 5 Tune O68L “CZ PLOW (6 a7 W OtTsny) | [0 0 LAGS VE OS] :
| | | | | |
| | | jap Tunp JOUE ‘D 9718) |
| x | 5 0651 = ANON Kara No SENY AMIENS ANUS Q GT 0 06% 7r 0S ueHyqoses” 6),
| | | | = | |
| & | 5 Lenny 6887 | © | Joouo3s ‘A dolce cle) 6666 85 08 SA9qSIOUUolT 89
LOUE ‘n 2H18JS ‘A “ATTA
uouoryeorgang Top puug 'TIX | A uf 0681 OZ PLOW (& Œ'ZI0 (Sur) H9au1976 ‘A 4UITIS.1EGO 800 GI Se GE OS | SIsogy [8
| Wee ne | |
s | : reer Ê | i 080 666 IT LF| I19040S 14
| | | |
« | « ICI PSSI pie ‘nu 9Y1U)S ‘A ‘AU yooureys ‘A toleyy 90°0 | BL 9S SL LY | ASOYUSBS 98
| usuoresrtgug dep PUET 1x | % | ysusny [gst | a | # | 90°0 | SO LY VS LV ASOUSOSEIN IG
« | & | Mp eget | « | « eT'0 | OLIL Ge GF | UIdJOAONT GG
| | | |
= | = | Tune Zggt | . yooureyg ‘A undp LTO 90 V6 GE 6P SLOGSSOZT CG
| ee | =
| a | « 320 '+das £981) & YOoUIo}G “A Yuygsıogg 820 PL Le PS QP Saoquosng OI
| | | | BPELAGHTS
+ | à | = | lune T9981 = | FU m jyeueg 'A 3sıegQ | .60°0 08°%5% IL 67 oryodezz 8
| | | | |
| youq Ma THA VL 181 ALteIS UOA TU9SUSSE] ‘0 “un JOaUIEIS |
| uauorjeoıqug lop purg “TA | -Igep JOUlpLeg rdog“änypggr [PAO A" (& ‘a'Z'N 0 (1 Sny| IUT “n [yeas A ys10qQ | OT'0 Gere Hr OS waoy eyoNounyg IF
| | | | |
| ® | x | tunp69gr | - x G0 Os Ol Wy C220 Gl Cl
| \ | | OXY Jap ur "Iulog Au omg, |
| 5 | < je “1dY 6981) U04 ‘AtUA ‘A Z'N'O SUV | Yooulsjg “A Yupgsegg TO | L6P 66 OF OTSSUS IT :
| | |
; « | « | tone eet | cs yoouiejg A uuemydnepy To GCL LE 68 ATOS) GT
| | | | me
| = | = tag we TLS) = TIO “B[Yeuey “A 71840 To Sy 1. Sy EE DUO el
| | ‘juent) | os |
| 880g “N D'OL8T | ngoq § OL8T!
| ln} ouo]smpeug)| ses ? 6IST ON EIS UOA Uuodesse ‘0 ‘AU (| =
| wsuorwolqng tap puvg “AT P 100 “THIN PNY INC GOST PAMEAT(G ŒZNOTSNV)  Tjeuep ‘A 351000) 10,9 + | 90°69 22 _6P | eo)
| | | | | | | YHITALNAV
| | | |
b | d et op oyı | sop Se ou | eAoqdure | S109J8A195q | eçqeqord | opngıerg SNOLLYIS
IUT uoruorrqnd we IL, | i 4 | g
sonbremay | 1} BOI] q I 9 IL | SUOHISOZ | qo oguuy | yuawmızsut 49 POI | | ano.apy | | N
| | | |

| |

 

 

 

 

 

 

HONMEILVI

  
