 

 

 

Erreurs de clôture des triangles desquels ont été mesurés les trois angles.

 

 

 

 

 

 

 

 

 

 

 

 

 

meme
NOMBRE
AUTEURS DES INSTRUMENTS LETC NOMBRE : DES DRRNDRS

= i EN OBSERVATIONS | DE CLOTURE

a SECONDES en EXÉCUTÉES 2m

© ET VERNIERS POUR CHAQUE (ys REMARQUES
A DIAMÈTRE DU CERCLE 2] DU WERNER OU DES CHAQUE ANGLE TRIANGLE

ä OU DU OU POUR A

HO AONTAL Microscopg | ‘7 OFOSCOPES CHAQUE
DIRECTION =“ eee
Triangulation de la Méridienne de Pamplona.
1 | Ertel 0™,37, Ertel et Repsold 0™, 32 2,302 5, 2992 :
Repsold. _

2 | Repsold et Ertel Repsold, Repsold. LEO 2, 6147

3 | Ertel et Repsold, Repsold, Repsold. 2,001 4, 0040

4 | Repsold. 2,911 8, 4739

5 id. 3,997 12, 9384

8 id. a 2”, 388 5, 7025

7 id. 997 0, 1576

8 id. 1, 216 1, 4787

9 id. à ei 2, 0707

10 id. wa ‚96 0, 9274

11 id. s = 3 , 249 0, 0620

12 id. se 3 : 278, 10) 7125

r id an 2 5 0.0 0,2500
14 |: id on 5 5 0,870 0, 7569 i
15 id oo = = l;, 272 1, 6180 À
16 i NA a = 3.099 1,217 à cu i

1 ESS 3

18 id aL a a 0, 182 0, 0331
19 id © a2 Ser ea) en 0, 3376
20 id Ser 2 ae 0 , 366 0, 1340
Au id. En 1,902 3,6176
22 id. a 1 , 346 1,8117
23 id. 0,906 | 0.8208
24 id. 1, 130 1, 2769
25 id. 2,192 4, 8049
26 id. 0,113} 0.0128
27 ae id. 1,200 1, 4400
28 id. 0,864 | 0,7465
29 id. 3,518. 12, 3763

Triangulation de la Méridienne de Lérida.

1 | Pistor 0,20, Repsold 0, 32 Pistor. | 7 © | 07,963 0, 9274 |

2 | Pistor. : a | © | = 17,680 2, 8224

3 | Pistor, Pistor Repsold. = © E 0,186 0, 0346

4 | Repsold Pistor Repsold. . _ 2 | g | a 2, 069 4, 2808

> | Pistor, Pistor et Repsold, Repsold. 72 a = 0,644 0, 4147

6 | Pistor, Repsold, Repsold. | Ao 5 0, 940 | 0, 8836 |

7 | Pistor, Pistor, Repsold. = | = = 0 , 300 0, 0900

8 | Repsold, Pistor, Pistor. ok ae Ss PS1 2, 3013
9 | Repsold, Repsold, Pistor. a | Se 8 0,639 0, 4083

10 | Repsold. re à BA 2,30 5, 4850

 

 

 

 
