 

\

 

|

Praecession.

 

 

al

- 82

3 eg
No.| Stern. | 2 | AR. 18700. fae ES
= Fehler. 35
NO
hems s
L | Carr. 76 | 6.7 0 90 #8.78: 1 4-006 Ti +
22 Urs mm. 14.0%.:0:51 26.061 Æ 0.10 | 15, +
on Carr, 250 107 2.40 514% 20.06 3 | +
4 — 293% 191.919 | = 0:99 8 | +
5 | Bradley 344 | 6 2 29 43,66 | + 0.16 8 | +
Or Carr, 451-4 6 5 DO Steck O31.) 78
4 ae 491 | 6 2241 945, 2.014 || 14
8 — 60 16511906 200€) Æ0.18 a
9 me 698Uhed.) 4:402 0.74 jot 020 6
10 ae TION 6.4 |. 29 20 B5.14 1c 0.094511
a Catr, 842. 7.65)" 5:54 40.71! À 10.18 1.16
12 | 51 Cephei 5.6 6,39;.43.60... 4: 0.13.) 15
15 | Carr. 1027 | 5.6 (8 2401 | 0.18.11
14 eo enon tot 71.29 21.22 = 0.16 9
15 = 11016541.6,0:1:1°0:. 59. 02 OAS 7
16 | Carr, 1286 167 | 8 47 45.15 | Æ0.30 5
17 | 1 Draconis | 45 | 9 18 20.06 | + 0.12 | 13
16) Carr. 1451.17 GOA 22 bee) DOS) 5 4,
19 = 1516165 | 10 10 19.59 | 4019) 12 | 4
20 =. 1556156. 10 1158.95! 2019 8! +
24 | Carr 1707 165 | 11, 22.34.43.) 4.0.13 | +
ao — 9810670 1158 951 2014133) +
23 | 32 Camelop. | 5 | 12 48 12.05 | E 018 | 16 | +
24 \. Carr 2080 | 6 | 13 46 10.52 | +0.18 8 | ,—
25 — 2261 | 6 11 59 11.50, 20.19 il —
26 | Carr, 24231 7 16.8 2100|, 2037 6
€ Urs. min. 14.5) 16 59 22.82 | 220,05 | 17
coo Urs. min. 145 | 18 14 16.55, - 0.05 | 16
23 Var. 2822167| 183 Al 15.40). #049 5
30 — 2908 | 7.6 | 19 8 2040 | +£0.32 4
ol | Carr. 3091 17.6 | 20 18 226 | #013 5
76 Draconis | 6 | 20 51 5050 | #015 | 9
os, Var. 926407 | 2195 5975 |-E009 ! 8
34 "onto DT | 21095 959 | E08) 12
ao — 3441 1561 22°23 1621 |) +0134 16
96 Gau 3502 15 | 22 47 54.72 | 20414 8
37 = 009258 | 5.6 | 22 55 20.41 |. # 0.10 9
38 — (pol 16.5) 23'27 5028 | 20.11 | 17
39 — 6000) % | 23 58 27.64 | 2012 | 11

 

oo ann san ne nern em

Eigen-
bewegung.

 

 

 

 

Ss S Ss
4.2808 t + 0.001846 t?2 + 0.00000121 t?
6.9009 t + 0.006561 t? + 0.00000775 t?
6.7723 t + 0.008046 t? + 0.00000153 t?
8.3575 t + 0.004701 t? + 0.00000269 t?
8.1259 t + 0.003209 t? + 0.00000107 t?

+ 12.8715 t + 0.007959 t? + 0.00000304 t3
+ 18.8501 t + 0.016069 t? + 0.00000579 t3
+ 13.1613 t + 0.005023 t? — 0.00000058 t?
+ 20.2568 t + 0.007812 t? — 0.00000827 t?
+ 18.5046 t + 0.003291 t? — 0.00000794 t?

+ 26.6942 t + 0.000957 t? — 0.00002798 t?
+ 30.4014 t — 0.009854 t? — 0.00003895 t?
+ 13.0428 t — 0.002497 t? — 0.00000215 t?
+ 15.3407 t — 0.006150 t? — 0.00000185 t?
+ 12.2895 t — 0.004165 t? — 0.00000054 t?

+ 13.7830 t — 0.008621 t? + 0.00000288 t?
+ 9.1583 t — 0.004000 t? + 0.00000136 t?
10.7231 t — 0.007865 t? + 0.00000542 t?
9.9821 t — 0.008216 t? + 0.00000698 t?
8.0435 t — 0.004799 t? + 0.00000310 t?

4.5873 t — 0.002046 t? + 0.00000135 t?
3.2377 t — 0.002554 t? + 0.00000389 t?
0.3612 t + 0.001114 t? — 0.00000102 t?
2.0957 t + 0.002780 t? — 0.00000203 t?
4.6526 t + 0.003559 t? — 0.00000163 t?

— 12.3548 t + 0.008760 t? — 0.00000083 t?
— 6.4065 t + 0.001532 t? + 0.00000057 t?
— 19.4266 t — 0.002078 t? + 0.00001597 t?
— 71.7558 t — 0.001307 t? + 0.00000120 t?
— 8.5452 t — 0.002597 t? + 0.00000110 t?

— 17.9352 t — 0.005205 t? — 0.00000140 t?
— 3.9324 t — 0.002598 t? — 0.00000097 t?
— 4.5636 t — 0.004180 t? — 0.00000249 t?
— 10.5805 t — 0.014988 t? — 0.00001546 t?

3.8141 t — 0.005962 t? — 0.00000640 t?

— 0.0554 t — 0.001113 t? — 0.00000078 t?
— 0.2737 t — 0.001517 t? — 0.00000127 t?
— 0.0673 t — 0.002581 t? — 0.00000418 t?
+ 2.5279 t + 0.001383 t? + 0.00000191 t?

4
— 0.050 t
+ 0.068 t
+ 0.086 t
+ 0.061 t
+ 0.003 t

+ 0.054 t
+ 0.142 t
— 0.007 t
+ 0.048 t
— 0.004 t

70.0350
— 0.046 t
+ 0.005 t
— 0.005 t
— 0.028 t

+ 0.004 t
= 10,010 6
+ 0.016 t
au WdE
— 0.063 t

— 0.064 t
— 0.079 t
— 0.014 t
“+ 0.039 t
+ 0.109 t

_ 90174
+ 0.0114
+ 0.026 t
+ 0.013 t
+ 0.080 t

— 0.009 t
+ 0.020 t
+ 0.008 t
+ 0.024 t
+ 0.046 t

+ 0.010t
+ 0.057 t
+ 0.085 t
+ 0.033 t

 

 

4
i
i
3
i
4
x
3
a
3
3

 
