 

STATIONS

DIRECTION

 

 

 

Buschberg

Neretein .
Hochstraden
7 Hermannskogel

Schopfl

BAVIERE

Aenger

 

Maydenberg.

Bradlstein.
Schöckl.
Hundsheimer.

Hermannskogel.

Kirchheim, Thurm.

Waldburg, Sign.

Eschers, Sign.

Peissenberg, Thurm.

Hochgreuth, Sign.
Auerberg, Thurm.

Grünten, Sign.

Erreur

Azimut. probable.

OBSERVATEUR

 

uv "

2005-60 007

158 33 42,08 | + 0,48
|
| 138 3 1187

287 31 13,6

Noch nicht
fertig
| redueirt.

 

 

 

 

 

Dr Oertel.

 

SERN R EEO RTE

LEER SECs

 

      
    
     
       
    
  
 
 
  
   
   
  
  
  
 
  
