 

Erreurs de clôture des triangles desquels ont été mesurés les trois angles.

 

 

— 322 —

 

AR

a En ET

 

 

 

 

 

 

 

 

 

 

LECTURE NOMBRE ERREURS
= AUTEURS DES INSTRUMENTS In NOMBRE ER A eva ons ro es
a EMPLOXfIS ONDES DES EXÉCUTÉES DE :
© ET nn VERNIERS POUR CHAQUE A? REMARQUES
: DIAMÈTRE DU CERCLE D LL OU DES Vi ANGLE en
POUR
(a MICROSCOPE An CHAQUE DIRECTION
aad Eee 2
134| Repsold d = 0,196 2! 2 80 92 92 100 232 80 1",565| 2, 4492
135 id. id. 2 80 64 92 88 80 232 | 1", 447 2, 0938
136} id. id. 2 64 64 72 80 64 64 2 ,170| 47089
197 id. id. D 80 80 64 80 64 64/1 ,013 1,0262
138 id. id. 2 80 80 72 140 64 64 |0 ‚045 0, 0020
139 id. id. D 64 80 140 80 80 80 1,206) 1,4544
|
EA 699.0499
m =k 4/ = aa t= OG
3n 139 X 3 .

due

dés

ern ud ito held ea)

Jobb testa seth

yam ks, ll a

an ent na LL:
