à

gr!

 

memele

; a / N N Be »
° ae SE TEN BER
Pte. Viperc } a
= f

 

V Me

 

ero

 

beobachtete füchtungen

Pyramide mit Steinpfeiler

 
   
  
   
  
  
    
  
    
  
 
   
    
    
   
     
    
    
         
            
         
 
     

Skelett zum

Generalbericht pro 1868.

Dreiecksnetz ın Dalmatien und Albanien

A
Malsstab 1152000.

 

PSX
\ <2
Nir Derg nordl. vor
2 Markonie

      
 
 
     
     
    
 
 
  
 

a a N
I: at L

NN IN 1
a: Ne \ orien \ NP prch

Sniper a7 TA
VV

 

 

 

Ls
N
I WUT N N

4

\ \
UN
| | Cr = — Kguban
x

Nig Dee N i \
KZ Ungur \ / \
NSS \

NEN DE

     
  

 

 

4
| Kalmetta
; \
7
e a
DS.
4
|
\\ Grabe
=
Med: lin Z
eek |
\ |
/ N rem
/ N
N N
5 Ve ‘6,
\ horse
ta wee VENISST J
|
a
a
I 4 I En Peschtar h 4
i ;
E N
4 \
\
\
\
N
\

 

|
|
|
|
|
|
|
|
|
|
|
|
|
|

 

\ 4
IN N 5. Z Z €
° Dtranto fo
KSrpoté
\ / \ Se
\ / \ ie ots à
/ \ ! lee z
\ / at 7 ie
3 / Vee! ee
\ | A / x :
\ / / / / N

N ’ y \
\ i 4 | : \ \ \
2 \ \

a a 2 Me leroo N J Sear anita

 

Re Bao a N 4)
N : a = Se Salpatore

Vers /\ N
Mte Ercale © N SA
aa

. Fe os
S. Giorgos. AU orfu |

 
  

  
 

eo |
\ Ma OPONDOTOS L
Noel: x DR N
Mte damo _—__.
° NOR eee

  

Jith.Anst.v. Leopold Kraatz in Berlin
