 

 

 

 

 

 

 

 

 

 

 

 

262
BR N De
5 Auteurs des instruments Lecture Nomere Nombree des | mireuns de
= en observations i
= employds secondes U ex&cutees pour un d>
S a En VORNIERS or apee ro P chaque triangle | A?
> et diamötre du cercle du vernier | u des | Chaque ns A |
: : ou du : ourchaque
zZ horizontal ee microscopes on
Directions 7

46 Repsold de 27 cm.- Troughton and | 2” 12» M. 2M | 28 36 36 |0,5123 0,2625

Simms de 27 cm. [577 |
47 id. id. id. |id. id. | 24 36 42 1 0,4608 , 0,2123
48 | Repsold de 27 cm. - Starke de 27cm. id. 2” id. 2M. 30 36 36 | 0,9680 0,9370)
49. | Starke de 27 cm. | id. id. 30 36 36 0,3662 0,1344
50 | Repsold de 27 cm. - Starke de 27 em. |id. 1” al al. | 309436 | 1,0198 | 1,0400
51 Starke de 27 cm.- Troushton and |id. id. id. id.| 30 42 36 |0,1985 | | 0,0394

Simms de 27 cm. | |
52 | Repsold de 27 cm. - Starke de 27 cm. |id. id. id. id, 30 36 36 | 3,0865 | | 9,2203)
53 id. Ina id. ad. id. 19730 3001 0,2356 , 0,0555,
54 id. ide ıd. id. id. 49 36 30 | | 5,4909 30,15141
55 id. id. id. el, al. 42 36 36 | 1,2087 1,4607
56 id. aid. id.’ id. 49 30 36 | 3,4343 | 11,7924|
Sn id. ol al, ide de 42 24 36 0,0174 0,0003,
58 id. Inder id. id. 3d. 42 36 36 | 2,5890 6,7029)
59 id. ide id. ide ide 42 234 36 | 3,6979 113,6752
60 id. ia, id, id. id. 42 36 36 | 2,4654 | 6,0787)
61 id. id. id. ide ı1d. 42 30 42 |0,2611 \ 0,0682
62 Salmoiraghi de 40 cm.-Starkede 27cm | 1" 2 ide ide 30,80, 3008 | 3,477. |12,0895|
63 id. ide id. id. id. id. 1,7146 | 3,0483
64 id. id. de id. id. id, 12,166 | 4,6916,
65 id. id. dk ide id. id. 3,902 15,2256|

XVIlbis,
Jonetion de l’ile de Sardaigne avec le continent.
N R | | Direetions | Pr

4 Salmoiraghi de 40 cm. - Brunner de 1" 2” |2M. 4M. 36 36 36 10317155154

42 cm.
9 id. id. id. ide de id. 9,994 | 8,9640
3 id. Id ıd. id“ ıd, id. : 1,763 | 3,1082
A id. al, da al, a id. 1,10% | 1,2188
5 id. id. 1d. ide nd. id. ı 4,646 91.5853]
6 id. Me id. las1ı | 5.3407|

Remarques

 

HB) Maulähukı | ud ul

RT

ru ashmelhh ha lassen uch anna u »
