 

de rer |ı

‘attendre d
le,

$

jveso

 

 

 

a

  

 

Lac Ontario.

 

Contrees.

Lae Michigan.

Erie.

Ibexe

ar

Illinois

 
 

 

 

Noms des stations.

Escabana
Phare
s -
Ford River
Point trigon.
Burnt Bluff
Point trigon.
Beaver Island
S Phare
Gedar River
Point trieon.
Boyers Bluff
Point trigon.
Door Bluff
Point trigon.
Menomonee
Point trigon.
Fort Howard
: Point trigon.
Minnesota Junction
Point trigon.
Chicago
Phare.
Willow Springs

Point triegon,

Latitude

geogr. observ.

 

° f n
45 Ak 35,05
Bil 5.04
45 Al 3,88

34 28,78

1525 48,

41525 980
15 17 45,69

2)

4% 30

12,78
30,28
3 28 31,88)
53 22,49

13 98.0)

vun

3187:

geogr. |
Est
de Greenwich.

Longitude

Sen
Minus
o /

SS
ANS7E >6
86 43

35

36
Su
87
88
85 Al
87 37
Sl

|

Altit. approx. au-
dessus de la mer.|

 

180

1180

250
180
180
220
210
180
180
30
180

220

 

 

 

Deviation A.-G.

Clarke 1866.

9,

1.3

 

Watertown
Palais de Justice.
Nth Base, Sandy Creek
Point trigon.
Oswego
Point trigon.
Rochester
Hötel de Ville
Tonawanda

Point trigon.

€ Buffalo Croisement des routes

d’Exchange et de Michigan
Dunkirk
Nouveau phare de 1576
Erie
Phare
Cleveland
Phare ;
Sandusky City
Point trigon.
Detroit Groisement des ave-
nuesGrand River et Washington
Monroe
Coupole du Palais de Justice.
Toledo
Pilier de 1581

58 32,88
40 41,52

43 26 39,97

13 9 22,4477 37
3 0 7,83l78 53
12 52 A4,66\78 52
12 2944,30 .79 21
2 917,4980 5
"1 30 6,1381 2
1129 4,5982 41

12 1959,02
DA 48,69

1 39 8,05

RS

 

Fairmount
Point trigon.
West Base Olney,
Point trigon.

Parkersburg

40 1 36,70
38 51 41,28
38 34 53,20

 

 

 

Point trigon.

ed
83
33 99

24

200

s0
130
230
190
180
180
180
180
190
180
190
180

FFHFHFEIHF+FH

+++

 

8751
83 6
83 2

 

210
150
170

 

 

 

 

)

/

Itemarques.

Sur le Green-Bay et dans la partie
nord du lac Michigan.

La configuration exterieure ne suffit
pas ä& expliquer ce fait, quoique les for-
tes valeurs s’accordent quant au signe.

Sur larive sud du lace Ontario et du

) lac Erie; les valeurs s’accordent quant

| au signe, mais sont trop grandes.

>=

Rive ouest du lac Erie; on devait
S’attendre ä moins pres de®Monroe.

200-300 kın. au sud du lae Michigan;
rögion de plaine.

 

 

 

 
