00

Erreurs de clôture des triangles desquels ont été mesurés les trois angles.
nie

     

ERREURS ERREURS

 

 

 

 

 

 

 

 

 

 

 

 

 

 

 

 

 

 

 

base davidson subies pt he

AA le po

 

 

 

 

 

a ss ERREURS ;
ra DE CLOTURE oa DE CLOTURE ee DE CLOTURE 3
2 DE CHAQUE 2 = DE CHAQUE 2 : : 2 = DE CHAQUE 2 |
© TRIANGLE A REMARQUES | S TRIANGLE A REMARQUES | S TRIANGLE A REMARQUES :
= ei 2 i
Eh za ee |... 1. er oie | i
Triangulation du Parallele Sud-Algérien. (Partie Orientale.) i
1 ee oo tel 823 Secondes 120 | 3", 31 10, 956 Secondes 39 Dy 1, 369 Secondes
2 où 50 0, 250 centésimales. 2] ] , 96 3, 842 centésimales. 40 5\, 04 25, 402 centésimales.
3 O25 | 0) 068 | 22 | 5. 68 32, 262 a 2 > | 1022
4 758 | 57456 I >> 0“, 05 | 0,003 42 ae
De Lt 26, 420 | 24 2, 74 | 13,988 43 3°, 28 | 40, 433
6 6 ,48,| 41, 990 | 25 12, 1254 44 3,88 1.715.054
114.03 16, 241 | 26 1 20 440 45 4,05 | 1624
8 D 11 7, 344 | 27 > 00 | 14440 46 | 4,26 18, 148
9 0,91.) 0,828 | 236,3 40, 832 47 2 D) 7 1e
10 1,151 1082 | 29 2, 10 | 9, 200 48 8 ,42 | 70, 896
il 2,92 | 8,526 | 50,5 94 25, 402 49 0,88) 0,774
12 8 25) Or [312.05 30, 803 a0 5.08 25, 806
13 9 ,45 | 89, 303 | 32 00, 2000| Bl 3 5 11,223
14 0,641 010 33 @ 49 | 0,240 | bo 374 13, 988
15 1,86 | 3,160 Bd 4 2 20, 430 53 8.530) 78, 788
16101] 0,012 2023.30 15, 210 | oA | 7 ‚82 Bi, 152
1712 4 6, 200 36 0,2, 0.270, De 1, 488
18 0,50 | 0, 000 Bye sy 6, 605 |
19 | 0 , 26 0, 068 | BS | 1 (32 Gao
Triangulation du Paralléle Sud-Algérien. (Partie Occidentale.)
l O28 | 0,078 | 9 95 | 2 110) 17 | 0,060 840
2 0,98 | 0,960 10 | 5,08 | 25, 806 18 | 4,60 21, 160 |
3 2.97 | 18 821 11 10,69 | 0,476 19 | 2,71 | 7,344 |
43002] 10, 304 12 0 4) 01 20 11,18 1,392 |
5 0,43 0, 185 8 1.08 2,822 21 0 ‚38 0, 144 |
6 1.00. 1,124 14 La 20 U 364 22 2,98 | 8,880
1. 0 361 0, 130 15 | 19,90: | 3, 610 23.) 0,26 85, 748
8 2 | 12 16 112,00 | 8,410 24 8 , 22 67568
Triangulation de la Méridienne de Mécheria.
1 2,6 19 010 4 66) 45, 698 13 AN AG) 17,389
2182,33 11, 089 8 6) 61/1 46,376
3 107,18 | 108,632 919,00 92, 160
4 61,16 | 37.946 10 12 ,20 | 148, 840
be 27 6, 101 11 el 125
6 202 200 12 1g 222

 

 

sascha hl he
