 

Bi
hal

de trian

“| |
M |
a) |
if
IM |

 
 

 

  
 

 
 

    

  
  
  

  
  
 

 

  
 

 

 

  

 

  

LES TRAVAUX

EN RUSSIE

y -
Macumnads

=

gulations

 

 

 

Meise hop nakeyoose

 

 

 

 

I
8400000

   
 

400 66p le

 

\ Va
VA Cope Reh

is

touch sf;

NS

 

 

Fe; à =
POO rr

 

Do Ayah,
G

 

Doré

TE TP OZ Ap ORCK

SY

X

ler.

   
  
 
 
  
  
    
 
  

G bya a I

AN

à \
S. N
\ = Pte

Nbrtereire

Ne ye
co Vay @ixkecks [|<
US, =
Ir RS \ N a.
N 0 CHAR À A Axe

dE

 

 

 

 

   

Ky
Wain oss

 

NN u >”

   
 
 
   

APBROBE

Le 2: sähe fi
al etritshajed. SIZ
ANA EEE RE

Apiynon

gg
|

 
 

  
  

RE 7
vr Ara
Vv x V 1

PET
7 VTBEPE

 

 

Ade
| a
iydene koe la

a

VN
VEOL RA |
f

I

 

  

À g Tarp oreak!
\ #2 EP OG
0 Pe OU press eco ig LA AUMIP'D

  

MOC

Oo de»
I a

 
 

N
Bosttarchs

  
 

Teanpoer,

 

 

  

ÆLobrcoskæ

Hoaxoe
~~ SAMBOB'B

KOUEPRACKB _
ap hackehsit das.

FIRE

keandpa Buplumdepzcka

FVUNEREOBL OP

   

Zoe
U

 

es

A
INS

 
  
 
 

 

 
   

      
  

 
   

 
 
 
 
     
   
      
  

   
   
  
     

 

CTs

HD;

  
 

  

  
  
 

- \
upulysree  Crse. DSP |
aris §

EIER

     

 
  

 

25
WSN MIN

  

  
   
   
   
   

cla.2,2\\. G

   

x

nn

 

    

  

À

2 1
2

1a |

 

 

    

 

 

 
 

bnp TORE
Ypdaxe

   

  
   
 
 
  
 
  

F

Ta à

  

HLoarcôp 088

Axe

\

 

 

a

 
     

     
  
  
 

Ee Qs. damowe |

   
  
  
   

      

 
         

NZ
ur HB

 
 

Aëp era
ACTPAXAH

Astrakledt

    
  

Toutes les triangulalions de 17
ordre

    
 
  

 

    

 

Les arcs de meridiens et de
pwralleles .

   

N

 

   

Les biiangulalions nouvelles ,

    

 

     

 

 

 

 

 

 

 

 

NN

TO

 

AN

 

 

 

 

 

 

 

 

 

 

 

 

 

 

 

 

 

 
