 

   
  

      
 

Be $

—

Prusse, B. — Erreurs de clôture

PO nn
|

 

 

 

   
 
 
  
  
  
 
 
  
 
 
  
 
  
 
 
 
  
 
  
  
 
 
  
 
  
  
  
  
   
 
   
  
 
 
 
 
  
  
  
  
  
  
  
  
  
  
  
  
  
  
  
  
   
  
 
  

 

 

 

 

 

 

 

 

 

 

 

 

 

 

 

2 : on i | NOMBRE
ee . ‚TUR | DES ERREURS
1. re DES Dane N | NOMBRE sl ous
ee ae oe es oe CHAQUE A?
E ERA POUR JE 2 f REMARQUES
 DIAMÈTRE DU CERCLE a + de OU DES CHAQUE ANGLE | TRIANGLE
\ ni OU POUR
OR ONTAL ern MICROSCOPES on
DIRECTION —
10 | 15 zölliger Theodolit von Ertel (Thei- Ablesung| 4bezw2Mi- 24 181020, 7000 Die Werbindune de
= |  jungsdurchmesser — 355%») und | mittelbar von | kroskop - Mi- | A eee
13 zolliges Universal Instrument | ‘/,, bezw 1 se-| krometer. ketten bei Thorn und
\ | yon Pistor ul Martins. a : : | a en on
pe id. id. id. 24 | 0,31 recon omerseahen
AD id. ide id. ; 0,29 0, 0847 Gaines doe eo.
eee a il i z Denen.
oe à a ie 24 0,578, 03306 | Biken parin 157
clone : : ; 2 OD ak
erie : id. id. id. 24 10,922) 0,8501
wi id. id. id. 24 1,139} 1,2973
181 0. nz ld. id. id. 24 0,604 | 0,3648 |
On id : id. id. 24 1,748 3, 0555
a id. id. id. 24 | | 0,3894
a + dd id. id. 24 1.4908. 1,4209
aa Et 1d. id. id. 24 10,159) 0, 0253
peo hes od. id. id. 24 | 0,7885 |
ae id id. id. 24 1, 459| 2, 1287 |
Se id. id. id. 24 1,062) 1,1278 |
20 “id id. id. | 24 0,554 | 0,3069
a. id. id. id. | 24 0,2520 |
a aid. id. id. | 24 ie) 10
oo id. id. id. | 24 0,205) 0, 0420 |
30 id. id. id. 24 0.951, 0,0042 |
d 0 : VIT.
um | SCHLESISCHE DREIECKSKETTE 1854.
_ 1 | 15Zülliger Theodolit von Ertel(Thei- | Ablesung| 4 bezw 2 Mi- | 24 1, 4933: | Id.
‘+ | lungsdurchmesser — 355%) und | mittelbar von | kroskop - Mi- 24 | |
13 zölliges Universal Instrument 1, Pezw 1 se- | krometer. | 24 |
von Pistor und Martins. cunde. 24 | |
2 od: id. id. 24 10",737| 0,5432 |
3 id: id. id. 24 0,463, 0,2144 |
A id. id. id. 24 | 0,9880 |
a id. id. id. | 24 0,338) 0,114 |
6e id. id. id. | 24 1 1747| 3,0520 |
ih id. id. id. | 24 1.018 |: 1,0941 |
8 : id. id. id. | 24 2,646! 7, 0013 |
9 id. ach id. 24 2,2380
DD... id. id. id. | 24 0,203} 0,0412.
De id. id. id. | 24 0, 3352
a id. id. id. | 24 0,760 | 0,5776 |
Le id: id. id. | 24 2.947 | 8, 6848
A| id. id. id. | 24 1,048} 1,0983
ae 9 id. id. ioe | 24 12 2000
1602. ic id. id. | 24 | 18 2022
À id. id. id. | 24 10,688) 0,4733
; id. id. id. | 24 1,089 | 1,1707
ee id, id. | 24 | |0,886| 0, 7850 |
id. id. id. | 24 | |0-, 884) 0,7815 |
id. id. id. | 24 11,098! 1,2056
id. id. id. 24 0, 7242

kk ts Mah eld ld lle a
