Triangulation du Parallele de Paleneia.
en A LV RER

 

 

 

 

 

 

 

 

 

 

 

 

 

 

 

 

 

 

 

 

 

 

 

 

 

 

 

 

We | Indication des Sr Longi- | 4, | Directeur
N° Latitude. | Si Epoque. : ;
Points. tude. | a et Observateurs. Dr | Wa
212 | Loma-Negra ..\. . [42° 4'19" 16°18’ 29” | “1870 Vriarte. Repsold I.
2419) EStôhan- .: 4 2 41 56 21643 15 | 1871 Ruiz Moreno (D. J) : Repsold C.
214) Saragosse . .... 41 39 24 |16 47 36 | 1871 id. id.
215 | San Caprasio ...|41 43 10 |17 12 20 | 1871 id. id,
= 2/6 Anator ....... 42 447 17 518, 1871 id. id.
27 .Sigena . .... 41 39 50 | 17 37 © | 1871 id. id.
218 Bunero : 42 3 48 | 17 59 12 | 1870—76 id. Piston I.
| | Repsold A.
S19 Leckie 41 87 2 | 18 17 57 | 1871 | id. Repsold C.
220 | Monsech . ..... 42 2 23 | 18 26 20 | 1876 id. Repsold A,
221; Anmenara ..... | 41 45 12 | 18 44 22 | 1876 | id. Repsold C.
222 | Coseellet .. . ... 42° 651 |18 56 24 1876 | ds Repsold A.
23 emis .... 98 0 ı gm 5 1876 | id. Repsold C.
224 | Paguera. . .... „42 7 44192733 1876 id. Repsold A.
225 Rodés. ...... Ji41 50 58-119 47 46) 1871 Barraquer. Repsold B.
226 Se-Calm 22... . 42 780120 3.37. 186 4 Barraquer. Repsold D.
| | | | Vriarte, Repsold D.
227 | Matagalls. .. ... | 41.48 32 |90 5 18. 1871 Barraquer. Repsold B.
228 | Roca-Corva..... 1142 11 21.90 27 31) 1871 id. id.
| | | I
| Triangulation du Meridien de Pamplona.
229 | Orzanzurieta . . . . 43 1 19 | 16 23 48 | 1871 Vriarte, Repsold I.
250 | Beriain .. ... 2 | 42 53 18 | 15,41 32 1868 | id. id.
Bi Ha... . |42 41 46 |16 10 29 | 1869 id. id.
232 |S. Bartolomé. . . . 42 33 48 |15 44 10 | 1868 id. id.

E 233 Vigas 142 #4 6 10% | 1869 id. id.

284 Terga....... . 28:86 5 2 ı 1868 | id. id.

1295 | Herrera. . . .. .. 447 19 6 16 4.0 1870 —71 id. id.

Cabello. Repsold A.
236 | Sta. Cruz...... [416 50 iG 6 25 1870 id, id.
237 | Valdellosa . . . .. 40 53 36 |16 18 50 1870 id. id.
298: | Agile. .. our 4052.14 | 15 54 10 181 | Vian Repsold I. ~

2259  Cuerda : . : 7. 89 57, 1 | 16-235 1876 Lopez, Puigcerver. Repsold D.

240 |Pelado :.: 89 24 57 | 16 17 40 | 1876 id. id.

4241 |Callejas ...... 39 37 32 |15 50 56 | 1873 Cabello. Repsold A.

= 242|Molnengo...... 232317 | 16 13 39 | 1876 Lopez, Puigcerver. Repsold D.

245) Ceja. i.e 39 15 49 | 16 20 51 1871 Cabello. Repsold A.

= 244 | Asomadilla . . . .. ov 1421 16 155 1871—75 id. “id:

= I: Lopez, Puigcerver. | Repsold C. fe -

= 245 | Molaton . ...... 38 59 27 | 16 15 59 | 1871 Cabello. Repsold A. |

- 246 | Chinchilla ..... a8 50. °9./ 15 56 38 || 1876 Lopez, Puigcerver. Repsold D.

2247| Bultre......2.... 38° 9 12 | 15 45 51 1866 Ahumada. Repsold C.

7248 Espına .:..... ot 51 47 16 550) 1866 ideen 2 id.
249|Gigante....... 37 44 24 | to 41 22 | 1866 id ae id.
250|Talayon....... 37 33 45 |16 8 16 | 1866 id. id.

Triangulation du Meridien de Lerida.

251 :Manpas..... ., 42:42 5 1843 5 1873—75 Monet. Pistor II.
252 | Crahére: ... 42 49 33 |18 31 51 1876 id. Piston ly. |
253. Birherri:::....: 42 85 29 | 18 28 51 | 1874 id. Pistor II.
254 Turbon .......o 42 25 1 |18 10 49-- 1874 5) Es ee 10 id.

255 | S. Gervas -...... 42 18 51 | 18 30 38 1876 Vriarte. Repsold I,
250) Pinjat .., . 0. os Al 21 5 (18 13 53 1871 Eugenio, Pistor IV.
Ol | PRAKESS 6 6. eo 41 19 33 | 18 40 36 | 1871 id. | id.

258. .Haveria....... Al 33218 32% 1877 Casado. Repsold II.
249 PESpina os 4. 40 52 4% 18 2 0! 1876 Borrés. Repsold B.
260 | Fangal ....... 40 45 53 | 18 27 54 1877 Casado. Repsold II.

l
10*

BIT RAIN IT

TOT CORP PAT CUITE

rr were y

 
