   

no

Erreurs de clôture des triangles desquels ont été mesurés les trois angles.

EEE EEE EEE EEE EEE ernennt Se see ese

 

Ran

INN IRB

Voll

 

 

 

 

alla

PL A À RIB NEEL FH

 

a
ITEURS DE LAGEURE NOMBRE ERREURS
i AUTEURS DES DYSTRUMENTS a NOMBRE ee Benes Gs D COTE n
= nn SMOONDES DES EXÉCUTÉES DE
& VERNIERS POUR CHAQUE A2 REMARQUES
3 DIAMETRE DU CEROLE PU Eee ot one CHAQUE ANGLE TRIANGLE
a HORIZONTAL a no due OU POUR A
MICROSCOPE CHAQUE DIRECTION
E an = he
Directions.
299 | Ramsden, 18 inch. Microscope. es 16.17 1658420724) 166 2, 756
256 | Ramsden, 3 feet. B.O. id. 3 40.21 10. 1231.22 on 2, 789
Don id. B.O. ide 3 0. 3 34 413.06 106 | 2,02
id. B. O. id. 8 1821 14. 13 : :
258 | id. R.S. id. 5 10.15 1,08 2,82
> Troughton and Simms, 2 feet. id. 5 10. 9 kL We A es
ay Ramsden, 18 inch. id. 3 13.12 | 1,69 | 2,856
260 | Ramsden, 3 feet. R.S. id. 5 De. 104 94. 112) 65-18 | h470) 2 800
Ramsden, 18 inch. id. 3 4.27 )
261 Troughton and Simms, 2 feet. id. 5 29:93 35.33) ) 1,70 | 2,890
Ramsden, 3 feet. B.O. id. 3 3 Rd
oz | Troughton and Simms, 2 feet. id. 5 Blé 1234 Kar 2, 924
Ramsden, 3 feet. R.S. id. > IE. 11 10
Bee 3 | Ramsden, 18 inch. id. 3 19.3 | Py 022
Ramsden, 3 feet. B.O. id. 3 28,20 1124 ) :
264 | id. RS. id. 5 au, 2, 958
265 id. B. 0. id. 3 31.20 52147 7% Te 7a 25998
266 id. B.O. id. 3 IA 0648810 31) 5 78 3, 028
267 id. B. O. id. 3 34.36 13.10 34.33 LH 3, 062
( Ramsden, 18 inch. id. à Poe
268 } Troughton and Simms, 2 feet. id. 5) 13. 14 nor: 8,002
! Ramsden, 3 feet. B.O. id. 3 1 2
269 id. 50: id. 8 4.12. 819,821 1... 3,138
270 id. RS. id. a Aal): 2570 10210 ah 9) 3, 204
27] id. B.0. id. 3 6 3 219: 12/1181 2216
Troughton and Simms, 2 feet. id. > 2 8 19. 16 Ar
20 namen 3 ek RS id. 5 19. 14 | 1,83 eres
id. RS. id. 5 9.20 .
273 | id. B.O. id. 3 5. 6 35.11} 184 aoe
SA | id. R.S. id. 5 ed 3.5.6 3 basa ara
: Ramsden, 18 inch. id. 3 185 :
215 Troughton and Simms, 2 feet. id. 5 Sei OOS | 1,85) 3,422
Ramsden, 3 feet. R.S. id. 5 20. 12 By dl
= | Troughton and Simms, 2 feet. id. 5 2A, 24 1,86) 3,460
77 | Ramsden, 3 feet. B.O. id. 3 un 18) 5 28. 18] 1 ,86| 3,460
5 id. RS. id. 5 39.35 50.35 A
278 | id. B.0. id. 3 31.34 | 1,86 on
\ ide Rs. id. 5 A
279 ) Troughton and Simms, 2 feet. id. 5 1: 6 1 ,89 Sane
Ramsden, 18 inch. id. 3 87
( Ramsden, 3 feet. R.S. id. 5 104.46 22.94 :
0: id. B.O. id. 3 21.5) Be
id. R.S. id. 5 2.10. 6% :
281 | id. Bo. id. 3 10.12 À 1 3, 686
e id. B.O id. 8 13.23 10. 14
> | id. RS id. 5 lds 8 | Pe
id. R.S id. 5 219 9. 2 5
RS Rameden 18 inch: id. 3 8.18 | Le)
284 | Ramsden, 3 feet. B.0 id. 3 ro. 11 172.117. 10.91 1,96 3, 842
= id. RS id. 5 13.14 Al, 24
285 | id. B.0 id. 3 46.15 [1,96 3, 842
id. RS id. 5 Te 3 ot :
. Troughton and Simms, 2 feet. id. 5 12. 14 | 1,96) 3,842
Ramsden, 18 inch. id. 3 1210)
287 Ramsden, Seel, B.0. id. 3 ley, 1,3 3, 881
( id. R.S. id. 5 14.17 )

 

 

 

 

 

 

 
