 

 

 

 

   

 

=

   

ze NXVIN

 

1. — Erreurs moyennes de l’unite de poids pour quelques triangulations avant

et apres la compensation des differents reseaux.

 

- INDICATION DES TRIANGULATIONS

 

 

 

Inde (suite).

N. E. Quadrilateral.

 

North-East Longitudinal. .................. Kr

BudhoneMeridional.r ............... 0008.
Rangir » Bun BE N ER
Amua > es
Karara a es
Gurwani De N
Gora Da IS .
Hunlaone So... 0.0.0 EEE RN
Chendwar » 2

North Parasmath Meridional..... ............
North Maluncha » RE
Caleutta DI ;
Bast Caleutta Longitudinal.....................
Brahmaputra Meridional............2........ i

Bastern Buontier 28060250... .....

essam bonsuwudmal 0.2.0.2.

ERREUR MOYENNE DE L’UNITHE DE POIDS

 

AVANT

APRES

 

 

 

LA COMPENSATION DU RESEAU

 

 

un $ = un D
aa Sn 8 a 22 REMARQUES
ER an Ei e SB
De Ess Maybe, age
25 DE Sansa) 25
AR aa loser, Bm.
Aa ei Ay
Een ae 3
558 EAn @-BA8| Se:
a Ba
le ER | =:
An a 4 9
1) (2) (8) (@)
E07, 266 ae,
(1 ,00) (2 ,15)
0 ,940 +1 ,748
(1,00) (1,8%
0 ,843 ==) 12
(1,00) (0 ‚18)
ziel 7265 — Pas de figure polygonale dans cette serie.
0 ,874 Stel „All
(1 ,‚00) dh)
E00 ,629 — > » » »
0 ‚904 zii 045
(1 ‚00) (1 ‚16)
+0 ‚678 +0 ‚826
za) (dl „>)
=E0 ‚431 =e1 ,476
(di ,00) (3 ,42)
=), 506 en » » » »
del 087 el 0)
(1 ,00) (1 ‚20)
a3, 100 = » » > »
0 ,266 0 ,249
(1 ,00) (0 ,94)
=E 0,298 == 0 ‚499
(di ,00) sen)
= 0 ‚483 ei)
(l ,00) (0)
0 ,494 == 0 ‚630
(1,00) (1 ,‚28)

 

 

 

 

 

Uuda-surlkamslahsinackeune
