er

IV. — Danemark.

LE EL m m 4
———z

No

INDICATION
DES POINTS.

LATITUDE.

|
LONGITUDE.|

ÉPOQUE.

DIRECTEURS
INSTRUMENTS.

RE 4
ET OBSERVATEURS. MARQUES,

 

 

 

Hamburg

Rônneburg

Lüneburg

Lauenburg
Store Möliehöi

Falsterbo
Kulsbjerg
Hiddensö

Darserort

igerlöse.. .........

Dietrichshagen ....

Kongsbjerg.
Bu rg

Hohen Schönberg ..

 

 

53432 53”
53 25 38
53 14 57
53 92 42
55 19 9

55. 36: 25
DD 28 4
55 039
54 35 51
54 28 35

54 42 42
54 6 26

D457 5D
»4.26 9

53 58 47

 

27238 3067

27 39 56
28 > 3.90
28 13 28
30

30 40 5
30 28 54
29 40 17
30 46 56
30 10 22

29 30 13

| 29 25 44
30 10 24

28 51 39
28 45 33

5 12 |

 

 

1817-18-22
23-24-25
1823
1818
1818-23
1837-40

1839

1839
1842

1839-40-41

1839-40
1841

 

|
Schumacher, Caroc, Zahrt-
ö mann, Nehus. \ Theod. de 12p.
aroc.
Schumacher. \
Caroc.
Schumacher, Petersen ,
Nyegaard, Nehus.

Petersen.

| Mecklembourg xl

Théod. de 8 et 12 p- | Meeklemboung ig

Théod. Ertel de 15 p. |

|

|

| |

id. | Théod. Ertel de 15 p. |
Nyegaard. 3
| Prusse, B. N. 73, 2
| Prusse,B,N.74 Ko
| cklembourg, N

| Prusse, B. N, 76,

|
|
|
|
|
||
|
|

Petersen, Nehus, Nye- | Théod. Ertel de 15 p.
gaard. | !
| Prusse,B.N 77,1.
| cklembourg, N.3),
Prusse, Bo Nabe
| Prusse, B.N. ns

id. Théod. Ertel de 15 p.
Theod. Reichenb. de |

12 p.

Nehus.

|
IP russe,B. N.79. ig
| oven a

 

 
