Fühenusder san

 

RR

ah

ıl

MI RI TI IR ARRNAER ILHARINGI BL LIUEamL gem Ni

 

— 349 —

XIV. —Prusse, B.

 

 

 

 

 

 

 

 

 

 

 

INDICATION
No nn | : DIRECTEURS
Dr Fon ae EPOQUE ne INSTRUMENTS REMARQUES.
Elbkette.
237 | Steinhöhe......... 23015 au ax ıı A
238 | Hohen Bünstorf...| 53 3 8 | 28 8 40 n we
239 Biss. 5250 9128 037 = en :
240 | Wilsede........... 5510 9 2730 3% _ E83 >
241, Bitberg.. 53231927165» S Ss =
242 | Vahrendorf ....... 53 26 16 | 27 33 58 3 ce 2
243 | Havighorst........ 53 30 58 | 2751 9 <* SS .
244 | Baursberg ........ 53 34 3 | 27 27 18 7 An =
2451 Stade... 3301227 38 = Ss 2
246 | Kaiserberg........ 357er 2 Be =
|
Schleswig-Holsteinsche Dreieckskette,
TErBıee 540 26’ 16"| 28°51' 50" Werötienihehune
76 | Dietriehshagen.... 54 6 32 | 29 25 55 NsundnD,.:
247 | Bungsberg........ 54 12 40 | 28 23 35
248 | Hohen Schönberg..| 53 58 54 | 28 45 45
249 | Lübeek .......... aa W 82 93
243 | Havighorst........ >> 30.58 2251 9
244 | Baursbere......... 3334 3 27, 27 18
246 | Kaiserberg........ »3 5553| 271255
250.) Bass... Da 38 34 | 27 53 4
(Nördlicher End-
punkt)
256 | Basis... 0.0... 53 35 51 | 27 55 26
(Südlicher End-
punkt
252 | Bornbeck......... 53 38 17 | 28 028
253 | Bocksberg ......... 53 A0 as | 2751 > .
254 | Rathkrügen.......| 5349 6 | 2742 32 5 1d
255 | Segeberg ......... 5356.14 2759 5 E 2
256 | Siebenbäumen..... 53 44 46 | 28 11 52 & Q s
257 | Schweinhagen..... >34 021 | 271253 2 2 5
258 | Hohenhorst........ 54215 8 22.0, 4 = _ n
259 | Nindorf........... 5 7531.21 202 i -
260 | Westensee ........ 54 15 58 | 27 34 21 = 2
261 | Rauheberg........ San r
262 | Hochholzberg...... 54 24 30, 27 AS 2]
263 | Scheelsberg....... »As25 51 | 2 19 52
264 | Ostenfeld ......... Ben
265 | Nordhöhe ......... 54 39 48 |27 645
266 | Scheersberg....... 5 25 52 | 27 28 Sl
261 1 Ro 2.2... 53949, 271359
268 | Warkshöhe........ 54 44 33 | 26 39 54
269 | Stagehöhe......... 5452 1,27 0%
70 | Hügeberg......... 5458 5 | 27 38 32
271 | Wongshöhe ....... >». 5283| 20 85 21
72 | Bärenwald........ 33 | 26 2 2
273: Kniwsbeis . 55.812 25 rn
2 Ban 55 19 38 | 26 46 29 nn
203 | Skamlingsbanke... 55 25 14 | 27 14 0 vor N.
Hannoversch-Sächsische Dreieckskette.
164 | G@ollmberg ........ 522 W 32,310 0 2 : = & Veröffentlichungen
166 ee er 540 9| 31.059 © 3 = N.8 und N. 11.
168. Col |, 51 18 17 | 30. 40 44 & © =
222 | Hagelsberg ....... 52824 0167 | & a > |
2) =

 

 

 

 

 

 

 

 

 

 

 

 

 

 
