 

 

ie

 

  
  
       
       
     
     

  

|
|
teal is 5
+ À A f
4 301,
St >) ARO
DES 5 ar =
| te KAO
* 2
NONE ER
| NE =
N Kaı \} À / \ SR
I x EN 7 80 \ A
| \ (7
xy 7
Hbra NS
|
|

 

 

 

 

 

   
  
  

 

 

 

  

 

LESS FSU
Die NON
88 \

 

 

 

 

 

 

|
——n__. Üfferenze di longitudine determinate due volte indi_

tt

 

an |

LAVOR! ASTRONOMICO-GEQDETICI

 

 

|

pendentemente e pubblicate —
————  Diferenze di longitudine pubblicate

— » »

esequite,ma non pubblicate. |
|

esequite e non pubblicate

 

 

 

 

 

 

 

 

 

  

? NE 7
Nag (ee CHR
Gr}
\
N

 

 

ZEPSZE RRS

Alec eA RAS

SLND
NZ ey

 

 

 

 

 

 

 

 

 

 

 

 

 

©
GIRGEN

 

 

   

 

 

 

 

 

 

 

 

 

 

 

 

Settembre 1894

46

@) Stazioni dilatitudine ed azimut pubblicate | |

a,

 

 
