INDIOATION
DES POINTS.

LATITUDE.

LONGITUDE.

se

XVII. — Suède.

ee a ae cc  ——————————…—…—…—…”"…" .…"…"…"’ _——  — —_ me TST

ÉPOQUE.

DIRECTEURS

ET OBSERVATEURS.

INSTRUMENTS.

REMARQUES.

 

© © 1 © ON À CO N

 

Falsterbo. :  ::...:.

Lobered
Dagstorp
Uranienborg
Gräfsvehacken
Helsingborg
Högkull
Hogalteknall
Knosen

Wilsharad

Nyrnas

Hinnaklo
Fastumper. ........
Himmelskullen

Slanor

Askomberg
Folkaredsklef
Elmeberg
Apelviksas
Borstaras
Nidingen
Fexleberg

‘Ytter Fistlarne....

Winga
Westerberg

Boxviks sadel
Brandaberg
Lejdeberg

N2 Kosteron
Lofverasfjell
Wagnarberg
Dragonkull

| Westanaberg
Golekull...........

_Sjogeras
Daltjarnshojden. .

Halneknatten

Svarttjarnshojden ..

Elgdalshojden
Saxehojden
Stuteklefven

Klaxkull...,.,.....

 

bees’ 27

59.90%
SD on
55 43
55 46 2
55 49
54:
©
2

x

17
22
HT.
) 37 4

4l
45
46
53
53
DD

0

0

6

9
13
18
22
25
32
30
3%
40
53
54

u

8
18
20
30
34
47
54

0

2

6

38 25
39 47
-51 44
5881 0
Z NG

57 22

4 59

4 46

14 35

13 58
220 3%
26 18
24 14
25 22
59 30 48

3002859”
30 40 10
31 6
30 53 35
BE 8 oT
30 43 50
30 21 47
30 41 45
30 21 51:
30 11 36
30 42 25
30 24 20
30 45 13
30 23 55
30 28 25
30 48 26
30 34 47
30 19 28
30 1 34
50 22 17
50 12 11
30 11 16
29 55 5
30 0 13
29 34 6
30 3 26
29 29 53
29 44 59
29 23 33
29 16 3
29 38 39
29 14 38
29 40 56
29 9 35
29 31 53
29 17 46
28 52 17
gg A»
28 44 13
29 4 35
28 40 18
29 .4 9
28 48 29
7

D

28
40
46

Sl

3

iit

50

5

43
22
39 52
25 0
49 20
30 48 16

 

 

 

Häggbladh. 4

Lindhagen.

id.
Häggbladh. 1

id.
Häggbladh, u
id.

Lindhagen.
id.
id.
id.
id.

id.
id.

Stecksen.

Rosen.
Stecksen.

Lilliehööck, an
id.

id.
Arosenius.

 

 

Littman.

Ertel.

id.
Littman, Ertel.
id.

Ertel.
1d.
id.
id.

id.
Théod. de Littman.
id.
id.
Repsold I.
Littman.

 

 

 
