nn nr

2 RT Te HT U |

til

aa)

itu

a IL

 

Weidelsberge—$_
i Schar =
be loservbet a ‘
on elohr ns A she
ae \ /
a / N /
Hasserod ral N /
~ \
| I \ N
| SS = \ nn ey as
S / — \ < N
Amédnebur g \ Ae Pf Soisberg
45" \
|  Wieselsberg .
N
Dünsberg Sengersberg
\
Herchenhcmnerhohe= nee
N . N
Johannisb ergo.
| |
Berger Warte Han a “ re
S Hahnenkamm 1: 1500000 d.ur 6.
I — — zt = T T

296° To 3o' 45° 2% TON
| |

 

/ \
\ £
/ À
/ N
Wittekindstein  —_ ® \
on Stintel
Desenberg

 
  

  
    
 

   
 

DON To BSS, hi

Ea

“hb Or, ichtohorte
€
des

Errgonomehischen Hanptnioellements
von

Kurhessen.

Die Visirlinien tir correspondaende Höhen,

messunger sind scharf aus gexogert, die
andern punchırt, und nur an den. End,
Puncten, wo dıe Messungen ausgelithrt,

scharf.

9 bottingen

 

 

S —
ro
==]

Taf: HT.

 
