 

É
i
i
|
|
|
|
i
|
|

Em m mem nn ne

ee

|
I.
i

 

 

 

 

 

oe
+ | Höhen
über Mittelwasser
der Ostsee.
| & =
Nach dem Nivellement général de la France, I.
pag. 315, III. pag. 198, liegt
Schlettstadt über Null des Pegels im Hafen a
von Marseille 220.0. 072". + 177,894
‘ über Mittelwasser des Mittelmeeres
bes Marseille... ...... -+177,494
Daher Mittelmeer bei Marseille über Ostsee 4
Mer SO MANEMARAE .........2. 0...» — 0,654
5. Schlettstadt @ am Pfeiler etc. . . . .... . .. +176,840
Mühlhausen @ am Stationsgebiude ........ + 240,660
Basel(N.F46)S 517 am Centralbahnhof . . . . .. —+279,123
(Vgl. Publ. des g. Inst. Präc.-Niv. Band I. No. 58 und
Nivellement général de la France, III. 198 —203.)
6. Berlin [as] am Maschinenhause des Pots- |
damer Bahnhofes ....... | + 36,919 |
Halle [eo am Stationsgebaude ........ la
|
Frankfurt ?/x. 2te Mauerfuge des zweiten nördl. |
Pfeilers der Main — Neckar | |
kisenbahnbrücke.... :... + 95,846
Basel {ss} am Badischen Bahnhofe. . . . .. +258,348 |
» (N.F46)S 517 am Centralbahnhofe ..... +279,167
(Vgl. Publ. des geod. Inst. Pr.-Nivell. Band I. No. 12, |
15, iv, 18, >23, 24, 32, 37, 42, 48, 44, 45, 46 und |
nachträglich neu eingeführte Lattencorrectionen.) |
Basel (N. F. 46) © 517 am Centralbahnhof, Mittel
AUS D UM Oe. +279,145

 

 

=
S
=
a
=
=

vy (haa 118801) 118€

ak iki)

CP mn 11

in u nid ds Aa

 
