 

 

 

.— 150 —

.VIL>® — Grande Bretagne (Inde).

 

Ne

 

INDIC ATION
DES POINTS

#

LATITUDE LONGITUDE| KPOQUR

DIRECTEURS

 

ET OBSERVATEURS

INSTRUMENTS

 

 

REMARQUES

 

   

SO ITTIAIO-

 

Stabıb.,..:.....;.

 

1200,73 507

24 46 51
23 550
2 15 28
25 28 3]
25 24 32
25 35 48
‚25 46 52
25 49 0
26 3 6
26 8 34
20 3.46
26 20 21
26 16 51
26 30 43
ol A
26 29 19
26 39 58
26 39 53
26 48 40
26 48 55
26 50 26
26 57 58
26 59 30
21 545
21 654
27 16 44
.27 16 29
27 25 36
2 20.2
21 25 31
2136 5
21 38 22
27 44 29
27 42 36
27 51 55
:27 49 A]

28 015
28 028

27 53 22
28 15 19
28 2 49
28 14 56
= 17 3
28 30 57
28 29 41
28 42 51
28 44 0
28 45 7
28 50 50
28 56 37
29 155
28 56 11
29 413
29 522
29 10 34

29 13 41

a) So

 

251 54 |
22 25 17
72 20 30
12 39 35
72 19 58

72 51 16
72 922
72 34 20
72 22 2]
2 Ale
72 48 45
72 20 14
72 39 18
72 30 56
218 0
72 46 28
72 22 32
72 35 25
72 27 49
12 17 28
72 39 57
72 22 50
msı
72 19 47
72 28 35
72 21 10
Da 5
72 25 58
li 8
72 36 4
72 17 57
72.29 20
7220 35
72 11 32
7219 6
72 29 51
12 28 33
72 14 59°
72 39 54
12 2443
eur
2 As
72 41 50
72 22 17
72 39 32
17233 4
72 20 10
72 45 39
72.25 24
72 38 59
72 27 50
7214 8
72 37 35
72 14 46
mo 8
72 16 27

 

 

 

Jodhpore Meridional.

1873°
1873
1873
1873
1873
1873
1873
1873
1873
1873
1873
1873
1873
1873
1873
1873
1874
1874
1874
1874
1874
1874
1874
1874
1874
1874
1874
1874
1874
1874
1874
1874
1874
1874
1874
1874-75
1875
1875
1875
1875
.1875
.1875
1875
.1875
1875
.1875
.1875
‚187
.1875
1875
. 1875
. 1875
1875
-1875

‚1876

. 1875
1875

 ı Lieut. M.W.Rogers.
id,

id.
Lieut. J. Hill.
Rogers, Hill.
Hill.

Rogers.

 

'|-Barrow 24 092.

id.
id.

 

 

 

 

 

 
