 

ionalen Erdmessung,

 

ion der Internat

ISS

27

UEBERSICHT
nach dem Stande am I. Oktober 1887.

Fonds der Permanenten Comm

Où

Ions-

LHANTAH
: ÊUNSSOULDAT UIIDUOIDU
-LOJUT LOD SIMAMNQIDAJUID SIP LOPIMEG AT
‘LR8T 1940790 ‘TE U9P ‘UILIO

‘UOPIOM 1619019

“YAVU RE
"AIBUL OGENT

    

* JT 014 9581104
enden

-"U9PIOM UISITMIHUILU

UOLIOLIHTISH(SIUNUYISY STE SUNUYI9ASIALLF UASISSPYUL Sumumpsasoryep Jap ur uapıom woqyes
ar is 5 . ! 1c >: e |
-SSUNUP.AIO Jap eu U9PIOM pun ue NVIING || orp) purs Jiqnjogne you aeıy sodenog
-[RAJU9") WI PUIS U9SUNJJIN() pun WosuNsIaMUyY OICT uogrzol sorut weyStsny8uttey sep u0s |

> “CUS: Ses

 

-OM OU9IJOM SP ‘P INF OJIN JIOS SOpPUVJS
-9 SEP U9SUIZ 9IP UPJOU UOUIUIOM NZR(T

 

 

 

 

 

 

hs
[as
per
©
Q
E
©
>
=
©
>

Anlage III.

 

 

=i . Summe MI wo. à à à Come
06 E Sendo im bee À 2 de)?
SL 2 7, Hétu ın)
| | Sserfeqsuoyejod | | DOCS |‘ ewung : ouyeuum
| sap SunwuruuteA En eS
|-2A 194 yedureys[es ee ee 0089 | « « 2... woneds le, |
| -moM IDJ uesetsny | eq ‘essey-suoTyeoeyT | 9 || 008T | € 22 ‚one u
— 0088| - 1887 Teliend 'o 'n 00 | x ni = 1er
| lf Old aunompeupsIUG | = = = © ce Cl D07E EC « ° * + uerueuny [GL |
— 098° WISppma pie > - = = eq 71.0704 |< © a kg
a zn One Oo  & Lo pee > OT
| © uoSUNIPUEUJIA » 0705 den « _ 22 2mwaurd \6
orpanz uegsogsponag | * © | ' pe | || 016 « = = SPUBLOpeIN '8
jnedunpyezsöeryasqy | NON "YSUH 704 | El OC | « SIIAWONANM LL
D de es 7-30 >: 22 mon ORG | C oe 2.0,
-SOLEISTEIOUIN sep OVS « zz es
eu;  udercomaT |< | Oke « 2 omer 7
= 707 ar 2 2988, Um 07% « "YPRISULTBCL-UOSSOH |
| « uedungppueyaoa » |  ZUSIOX ‘INJISUT © ‘Hood
uop nZ U9JIEM AN | "yostyde.109s- Aw | I Deaog-suoyeog) © °° Uessnetd ı[
ee em 5 u. |
ya IN “pue|sueso+) “JOSULJWA soN| ‘SUR | ‘purysuesex) * Lo;YeZury | oN
HadVOsS ay | ANHVNNIH

 

 

 

 

 

  
  

 

 

 

 

 

    

 

 
