 

|
ji
\

Fe nie

I He Wen FFTTTN ——

ra ART

kl

ein

TE I AT}

me]

441

_] Thürschwelle des Betriebsgebäudes Brucköhel.

© Windecken-Heldenbergen, am Betrjebsgebäude ;

[I] Mitte des östl. Flügels düs Viaducts bei Kilometerstein 10, Mu

U] Südöstl. Ecke des grossen Viaducts bei Assenheim : |
U] Deckplatte, südöstl. Ecke des Viaducts bei Kilometerstein 5, 7 ;
U] Thürschwelle des Betriebsgebäudes Assenheim

_] Westl. Ecke der Brücke über die Wetter

© Friedberg, Betriebsgebäude der Main-Weser- Bahn.

Eisenbahn Gelnhausen-Ranstadt-Hungen-Lich-Giessen.

© Gelnhausen, an der Güterhalle der Bahn Hanau-Bebra
| Nordwestl. Flügel der Kinzigbrücke
_ Südwestl. Flügel des Viaducts bei Lieblos
[J] Nittelgründau, Sockel am Betriebsgehäude .
_] Südl. Eingang des Tunnels, östl. Ecke :
_] Nördl. Eingang des a östl. Ecke, bei Enge
© Büdingen, Betriebsgebäude .
_] Sockel des Viaducts bei Boa dei Seite |
_] Nordwestl. Ecke des Betriebsgebäudes Stockheim .
_] Südl. Tunnel-Eingang, östl. Seite .
2] Nördl. Tunnel- Be bei Ranstadt, östl. Sch ;
_] Bahngrenzstein, südl. des Do Nr. 33 vor Ranstadt .
© Ranstadt, Dh \
_J] Brücke über die Nidda :
U] Nidda, Sockel am Betriebsgebäude
U] Durchlass westl. von Borsdorf
_] Durchlass bei Bahnwärterhaus 95 . ae
_] Ober Widdersheim, Treppe am Beinicheochu.e an
] Erster Durchlass sich Ober Widdersheim und Hungen
(] Durchlass am Kanal der Riedmühle .
© Hungen, Betriebsgebäude >
_J Langsdorf, Sockel am Betriebsgebäude
© Lich, Betriebsgebäude
za aduei‘ westsüdwestlich von Lich“ ; :
_] Westseite des Durchlasses zwischen den Wären 9 gar 10
1 Garbentaich, Platte am Abfallrohr des Betriebsgebäudes
O Durchlass bei Hausen a
_} Viaduet der Ludwigstrasse in een nn ;
5 Grenzstein zwischen Eisenbahn und babaralhmhn
© Giessen, Betriebsgebäude

Höhe der
N.N.
124”596
135,331
168,970
143,105
144,771
142,680
133,521
150,757

130,949
129,035
134,383
146,684
178,132
172,040
134,498
152,094
131,177
147,619
149,656
138,685
128,469
129,994
153,558
167,964
156,093
148,536
133,287
131,197
146,456
162,736
169,759
173,698
217,383
216,171
208,499
163,177
166,607
168,159

Entferng.
Kilom.

8,72
14,89
20,32
23,90
95,19
25,48
98,19
31,0%

0,00
1,10
AM
7,35
10,63
11,20
14,81
20,92
94,04
26,25
26,94
28,00
29,23
32,21
34,74
38,88
40,23
41,04
43,08
44,82
41,59
50,69
54,00
54,87
58,91
61,14
61,85
68,00
68,40
68,79

 
