{
  "type": "object",
  "additionalProperties": false,
  "properties": {
    "participants": {
      "type": "array",
      "items": {
        "type": "object",
        "properties": {
          "name": {
            "type": "string"
          },
          "role": {
            "type": "string",
            "enum": ["interviewer", "interviewee", "participant"]
          }
        }
      }
    },
    "title": {
      "type": "string"
    },
    "media_type": {
      "type": "string"
    },
    "permalink": {
      "type": "string"
    },
    "transcript": {
      "type": "string"
    },
    "collection": {
      "type": "string"
    },
    "date": {
      "type": "string",
      "format": "date"
    },
    "description": {
      "type": "string"
    },
    "summary": {
      "type": "string"
    },
    "publisher": {
      "type": "string"
    }
  },
  "title": "combio_metadata_scheme"
}
