[
    {
        "e1":1783,
        "e2":1786
    },
    {
        "e1":1786,
        "e2":1788
    },
    {
        "e1":1788,
        "e2":1725
    },
    {
        "e1":1725,
        "e2":1789
    }
]