<?xml version="1.0" encoding="UTF-8" standalone="no"?>
<!DOCTYPE svg PUBLIC "-//W3C//DTD SVG 1.1//EN" "http://www.w3.org/Graphics/SVG/1.1/DTD/svg11.dtd">
<svg width="100%" height="100%" viewBox="0 0 824 909" version="1.1" xmlns="http://www.w3.org/2000/svg" xmlns:xlink="http://www.w3.org/1999/xlink" xml:space="preserve" xmlns:serif="http://www.serif.com/" style="fill-rule:evenodd;clip-rule:evenodd;stroke-linejoin:round;stroke-miterlimit:2;">
    <g transform="matrix(1,0,0,1,-31.5,-156.5)">
        <path d="M330.5,157.5C324.858,157.586 319.524,157.586 314.5,157.5C319.833,156.167 325.167,156.167 330.5,157.5Z" style="fill:rgb(252,229,154);"/>
    </g>
    <g transform="matrix(1,0,0,1,-31.5,-156.5)">
        <path d="M433.5,301.5L433.5,302.5C432.673,307.985 432.173,313.652 432,319.5C429.901,323.231 428.734,327.231 428.5,331.5C425.321,340.826 421.821,350.159 418,359.5C413,366.167 408,372.833 403,379.5C399.701,382.978 396.034,385.978 392,388.5C391.598,389.872 391.098,391.205 390.5,392.5C393.353,394.025 394.353,396.191 393.5,399C398.956,410.873 404.123,423.039 409,435.5C413.819,444.468 419.152,453.135 425,461.5C429.757,472.086 435.924,481.752 443.5,490.5C452.872,493.601 461.539,492.768 469.5,488C474.57,487.575 479.57,486.741 484.5,485.5C486.58,485.686 488.08,486.686 489,488.5C492.409,487.378 495.909,487.211 499.5,488C511.838,490.847 524.172,492.847 536.5,494C539.149,494.452 541.649,495.286 544,496.5C544.561,495.978 545.228,495.645 546,495.5C556.878,497.755 567.878,499.088 579,499.5C592.111,497.627 605.278,496.127 618.5,495C622.596,494.143 626.596,492.976 630.5,491.5C637.544,497.71 644.044,504.377 650,511.5C651.752,516.662 653.585,521.829 655.5,527C653.813,532.746 654.313,538.246 657,543.5C659.167,546 661.333,548.5 663.5,551C667.342,551.956 671.175,552.79 675,553.5C691.118,553.093 707.951,551.926 725.5,550C728.471,549.206 731.471,548.539 734.5,548C736.888,546.139 739.554,544.806 742.5,544C750.848,531.506 758.514,518.672 765.5,505.5C772.613,499.391 778.947,492.725 784.5,485.5C787.004,483.856 789.671,482.356 792.5,481C799.643,472.42 808.309,465.753 818.5,461C826.514,458.324 834.514,455.657 842.5,453C845.507,452.699 848.507,452.865 851.5,453.5C851.747,456.505 850.747,459.005 848.5,461C841.668,463.459 834.668,465.459 827.5,467C823.714,468.393 820.048,470.059 816.5,472C789.011,491.821 770.511,517.987 761,550.5C758.92,553.065 757.087,555.732 755.5,558.5C737.362,562.573 719.029,565.74 700.5,568C688.626,570.911 676.96,574.578 665.5,579C663.253,580.277 661.253,581.777 659.5,583.5C653.441,584.446 648.274,587.113 644,591.5C633.222,611.628 618.722,628.794 600.5,643C591.907,648.365 582.574,651.198 572.5,651.5L572.5,650.5C567.345,644.511 562.011,638.678 556.5,633C553.167,630 549.833,627 546.5,624C545.552,623.517 544.552,623.351 543.5,623.5C543.067,620.715 541.734,618.381 539.5,616.5C527.311,606.477 514.977,596.643 502.5,587C491.86,576.36 481.194,565.694 470.5,555C465.294,551.903 460.294,548.569 455.5,545C450.429,542.678 445.262,540.845 440,539.5C437.082,534.913 435.916,530.08 436.5,525C429.457,503.748 419.624,483.914 407,465.5C401.629,455.411 396.629,445.078 392,434.5C387.603,429.39 383.936,423.724 381,417.5C379.612,410.223 377.779,403.056 375.5,396C377.644,391.545 380.144,387.378 383,383.5C388.049,378.953 392.549,373.953 396.5,368.5C396.328,367.508 396.662,366.842 397.5,366.5C399.807,364.662 402.14,362.662 404.5,360.5C409.316,353.573 413.482,346.239 417,338.5C419.109,337.965 419.609,336.965 418.5,335.5C421.064,326.042 423.064,316.375 424.5,306.5C424.124,302.119 423.458,297.786 422.5,293.5C420.098,291.991 417.765,291.658 415.5,292.5C410.833,293.833 406.167,295.167 401.5,296.5C399.278,296.441 398.278,295.275 398.5,293C399.071,290.456 399.738,287.956 400.5,285.5C402.124,285.64 403.29,284.973 404,283.5C404.333,283.833 404.667,284.167 405,284.5C408.174,280.497 412.341,278.497 417.5,278.5C421.689,279.08 425.689,280.08 429.5,281.5C430.892,284.025 430.558,286.192 428.5,288C429.938,289.569 431.438,291.069 433,292.5C432.905,295.328 433.072,298.328 433.5,301.5Z"/>
    </g>
    <g transform="matrix(1,0,0,1,-31.5,-156.5)">
        <path d="M434.5,283.5C434.823,289.69 434.49,295.69 433.5,301.5C433.072,298.328 432.905,295.328 433,292.5C431.438,291.069 429.938,289.569 428.5,288C430.558,286.192 430.892,284.025 429.5,281.5C425.689,280.08 421.689,279.08 417.5,278.5C412.341,278.497 408.174,280.497 405,284.5C404.667,284.167 404.333,283.833 404,283.5C403.29,284.973 402.124,285.64 400.5,285.5C408.631,274.617 418.631,272.45 430.5,279C431.733,280.667 433.067,282.167 434.5,283.5Z" style="fill:rgb(116,119,125);"/>
    </g>
    <g transform="matrix(1,0,0,1,-31.5,-156.5)">
        <path d="M400.5,285.5C399.738,287.956 399.071,290.456 398.5,293C398.278,295.275 399.278,296.441 401.5,296.5C399.898,298.074 397.898,298.741 395.5,298.5C396.193,294.84 397.026,291.173 398,287.5C398.417,286.244 399.25,285.577 400.5,285.5Z" style="fill:rgb(115,117,119);"/>
    </g>
    <g transform="matrix(1,0,0,1,-31.5,-156.5)">
        <path d="M415.5,292.5C417.011,293.502 418.678,294.169 420.5,294.5C422.039,305.655 421.206,316.655 418,327.5C413.735,336.522 409.902,345.522 406.5,354.5C406.725,352.284 405.892,350.617 404,349.5C393.545,355.48 382.712,360.48 371.5,364.5C351.018,374.073 330.185,383.406 309,392.5C303.813,386.978 298.98,381.145 294.5,375C292.833,374.333 291.167,374.333 289.5,375C283.556,378.522 277.556,381.856 271.5,385C254.401,392.353 237.401,399.853 220.5,407.5C221.979,411.802 223.479,416.135 225,420.5C227.692,423.692 230.192,427.025 232.5,430.5C232.167,431.5 231.5,432.167 230.5,432.5C228.528,431.695 227.028,430.361 226,428.5C221.571,422.178 217.738,415.511 214.5,408.5C210.73,404.285 208.564,399.285 208,393.5C207.333,392.833 206.667,392.167 206,391.5C205.739,387.294 205.239,383.127 204.5,379C204.763,377.054 205.763,376.388 207.5,377C211.635,379.929 212.802,383.762 211,388.5C211.763,393.454 213.263,398.12 215.5,402.5C220.054,402.848 224.054,401.348 227.5,398C238.652,393.758 249.318,388.424 259.5,382C269.657,378.92 279.324,374.753 288.5,369.5C289.631,367.926 289.798,366.259 289,364.5C287.1,360.134 285.6,355.634 284.5,351C284.645,349.774 284.978,348.607 285.5,347.5C293.209,345.98 300.209,342.814 306.5,338C326.739,328.881 346.739,319.214 366.5,309C376.46,306.007 386.126,302.507 395.5,298.5C397.898,298.741 399.898,298.074 401.5,296.5C406.167,295.167 410.833,293.833 415.5,292.5Z" style="fill:rgb(253,253,251);"/>
    </g>
    <g transform="matrix(1,0,0,1,-31.5,-156.5)">
        <path d="M415.5,292.5C417.765,291.658 420.098,291.991 422.5,293.5C423.458,297.786 424.124,302.119 424.5,306.5C423.064,316.375 421.064,326.042 418.5,335.5C419.609,336.965 419.109,337.965 417,338.5C413.482,346.239 409.316,353.573 404.5,360.5C402.14,362.662 399.807,364.662 397.5,366.5C400.503,362.491 403.503,358.491 406.5,354.5C409.902,345.522 413.735,336.522 418,327.5C421.206,316.655 422.039,305.655 420.5,294.5C418.678,294.169 417.011,293.502 415.5,292.5Z" style="fill:rgb(109,112,117);"/>
    </g>
    <g transform="matrix(1,0,0,1,-31.5,-156.5)">
        <path d="M433.5,302.5C435.379,312.898 433.712,322.565 428.5,331.5C428.734,327.231 429.901,323.231 432,319.5C432.173,313.652 432.673,307.985 433.5,302.5Z" style="fill:rgb(88,90,94);"/>
    </g>
    <g transform="matrix(1,0,0,1,-31.5,-156.5)">
        <path d="M506.5,381.5C506.557,380.391 506.89,379.391 507.5,378.5C508.15,378.196 508.817,377.863 509.5,377.5C510.515,374.146 511.515,370.812 512.5,367.5C522.967,357.866 532.967,347.699 542.5,337C550.195,330.255 559.195,327.255 569.5,328C571.683,330.35 574.016,332.517 576.5,334.5C574.785,338.387 572.452,341.887 569.5,345C560.44,347.848 551.44,350.848 542.5,354C536.355,358.644 530.355,363.477 524.5,368.5C519.779,375.216 516.445,382.549 514.5,390.5C515.17,395.196 516.004,399.863 517,404.5C518.487,406.985 520.321,409.152 522.5,411C520.19,414.66 517.19,415.327 513.5,413C512.069,409.573 509.902,406.74 507,404.5C505.303,396.893 505.136,389.226 506.5,381.5Z" style="fill:rgb(2,2,2);"/>
    </g>
    <g transform="matrix(1,0,0,1,-31.5,-156.5)">
        <path d="M512.5,367.5C511.515,370.812 510.515,374.146 509.5,377.5C508.817,377.863 508.15,378.196 507.5,378.5C508.592,374.55 510.259,370.883 512.5,367.5Z" style="fill:rgb(120,120,120);"/>
    </g>
    <g transform="matrix(1,0,0,1,-31.5,-156.5)">
        <path d="M506.5,381.5C505.136,389.226 505.303,396.893 507,404.5C509.902,406.74 512.069,409.573 513.5,413C517.19,415.327 520.19,414.66 522.5,411C520.321,409.152 518.487,406.985 517,404.5C516.004,399.863 515.17,395.196 514.5,390.5C516.445,382.549 519.779,375.216 524.5,368.5C530.355,363.477 536.355,358.644 542.5,354C551.44,350.848 560.44,347.848 569.5,345C572.452,341.887 574.785,338.387 576.5,334.5C574.016,332.517 571.683,330.35 569.5,328C559.195,327.255 550.195,330.255 542.5,337C532.967,347.699 522.967,357.866 512.5,367.5C517.58,359.679 522.913,352.013 528.5,344.5C531.972,342.039 534.639,339.039 536.5,335.5C541.061,333.548 545.395,331.048 549.5,328C557.452,325.426 565.452,325.093 573.5,327C576.103,329.429 578.436,331.929 580.5,334.5C580.101,336.197 579.601,337.863 579,339.5C576.318,341.903 573.818,344.403 571.5,347C562.161,350.334 552.828,353.667 543.5,357C533.564,363.601 525.73,372.101 520,382.5C518.669,389.459 518.336,396.459 519,403.5C520.098,407.433 522.598,408.933 526.5,408C532.084,400.036 539.75,395.369 549.5,394C561.167,393.333 572.833,393.333 584.5,394C590.322,395.553 596.155,397.053 602,398.5C604.41,397.252 606.91,396.252 609.5,395.5C609.351,394.448 609.517,393.448 610,392.5C616.96,386.881 624.46,382.048 632.5,378C649.472,374.2 665.972,375.7 682,382.5C685.634,385.826 689.3,389.159 693,392.5C693.867,394.684 694.701,396.851 695.5,399C695.061,404.223 693.727,409.057 691.5,413.5C689.302,414.014 687.302,415.014 685.5,416.5C683.885,415.846 682.218,415.346 680.5,415C676.863,410.692 673.196,406.358 669.5,402C659.981,396.911 649.814,394.078 639,393.5C630.699,395.195 622.866,398.028 615.5,402C614.903,403.062 614.57,404.228 614.5,405.5C616.524,409.037 618.357,412.704 620,416.5C620.172,420.749 621.339,424.582 623.5,428C622.884,429.4 622.551,430.9 622.5,432.5C625.148,446.633 624.648,460.633 621,474.5C619.685,479.386 616.518,482.219 611.5,483C604.665,483.476 597.832,483.976 591,484.5C578.006,483.366 565.006,483.366 552,484.5C534.456,484.402 517.623,481.069 501.5,474.5C502.167,473.833 502.833,473.167 503.5,472.5C502.372,465.884 502.205,459.218 503,452.5C505.694,441.476 509.194,430.81 513.5,420.5C512.028,415.554 509.528,411.221 506,407.5C502.59,398.617 502.756,389.951 506.5,381.5Z" style="fill:rgb(112,113,115);"/>
    </g>
    <g transform="matrix(1,0,0,1,-31.5,-156.5)">
        <path d="M643.5,379.5C656.239,380.345 668.572,383.012 680.5,387.5C684.159,390.327 687.326,393.66 690,397.5C690.995,402.405 690.161,406.905 687.5,411C686.5,411.667 685.5,411.667 684.5,411C669.4,393.138 650.4,386.805 627.5,392C620.902,395.467 614.235,398.634 607.5,401.5C609.092,398.521 611.092,395.688 613.5,393C617.761,390.413 621.761,387.413 625.5,384C631.421,381.744 637.421,380.244 643.5,379.5Z" style="fill:rgb(1,1,2);"/>
    </g>
    <g transform="matrix(1,0,0,1,-31.5,-156.5)">
        <path d="M565.5,395.5C584.34,394.502 601.007,400.002 615.5,412C616.196,413.893 617.03,415.726 618,417.5C622.451,438.417 620.785,458.75 613,478.5C605.248,479.934 597.415,480.934 589.5,481.5C576.519,480.235 563.186,480.235 549.5,481.5C540.758,481.466 532.092,480.632 523.5,479C520.215,478.241 517.215,476.908 514.5,475C512.866,474.506 511.199,474.34 509.5,474.5C504.055,437.941 518.722,412.107 553.5,397C557.688,396.824 561.688,396.324 565.5,395.5Z"/>
    </g>
    <g transform="matrix(1,0,0,1,-31.5,-156.5)">
        <path d="M755.5,558.5C757.087,555.732 758.92,553.065 761,550.5C770.511,517.987 789.011,491.821 816.5,472C820.048,470.059 823.714,468.393 827.5,467C834.668,465.459 841.668,463.459 848.5,461C850.747,459.005 851.747,456.505 851.5,453.5C848.507,452.865 845.507,452.699 842.5,453C834.514,455.657 826.514,458.324 818.5,461C808.309,465.753 799.643,472.42 792.5,481C789.671,482.356 787.004,483.856 784.5,485.5C784.369,484.761 784.536,484.094 785,483.5C790.147,480.325 794.647,476.325 798.5,471.5C811.527,460.972 826.194,453.805 842.5,450C854.578,447.581 857.578,451.748 851.5,462.5C844.229,466.284 836.563,468.784 828.5,470C824.385,471.48 820.385,473.147 816.5,475C790.231,493.975 772.398,519.142 763,550.5C761,553.666 758.5,556.332 755.5,558.5Z" style="fill:rgb(102,102,102);"/>
    </g>
    <g transform="matrix(1,0,0,1,-31.5,-156.5)">
        <path d="M784.5,485.5C778.947,492.725 772.613,499.391 765.5,505.5C766.072,503.745 766.906,502.078 768,500.5C772.786,496.706 776.952,492.372 780.5,487.5C781.86,486.82 783.193,486.153 784.5,485.5Z" style="fill:rgb(98,96,94);"/>
    </g>
    <g transform="matrix(1,0,0,1,-31.5,-156.5)">
        <path d="M396.5,368.5C392.549,373.953 388.049,378.953 383,383.5C380.144,387.378 377.644,391.545 375.5,396C377.779,403.056 379.612,410.223 381,417.5C383.936,423.724 387.603,429.39 392,434.5C396.629,445.078 401.629,455.411 407,465.5C419.624,483.914 429.457,503.748 436.5,525C435.916,530.08 437.082,534.913 440,539.5C445.262,540.845 450.429,542.678 455.5,545C460.294,548.569 465.294,551.903 470.5,555C481.194,565.694 491.86,576.36 502.5,587C514.977,596.643 527.311,606.477 539.5,616.5C541.734,618.381 543.067,620.715 543.5,623.5C517.309,603.373 492.642,581.373 469.5,557.5C464.414,554.422 459.414,551.256 454.5,548C446.887,546.368 440.387,542.868 435,537.5C432.691,529.596 430.691,521.596 429,513.5C426.077,507.985 423.41,502.318 421,496.5C405.445,470.29 390.779,443.623 377,416.5C374.779,408.817 373.279,401.151 372.5,393.5C373.675,393.719 374.675,393.386 375.5,392.5C381.142,383.199 388.142,375.199 396.5,368.5Z" style="fill:rgb(109,111,114);"/>
    </g>
    <g transform="matrix(1,0,0,1,-31.5,-156.5)">
        <path d="M428.5,331.5L428.5,340.5C425.304,348.587 421.804,356.587 418,364.5C412.785,369.489 408.451,375.156 405,381.5C401.992,384.211 398.992,386.878 396,389.5C395.833,390.5 395.667,391.5 395.5,392.5C403.392,417.947 414.726,441.613 429.5,463.5C432.825,474.35 439.159,482.85 448.5,489C455.229,490.991 461.563,489.991 467.5,486C473.646,485.021 479.813,484.187 486,483.5C516.356,487.46 546.856,491.794 577.5,496.5C592.76,493.86 608.093,491.693 623.5,490C625.067,488.924 626.734,488.091 628.5,487.5C638.3,493.472 646.634,500.972 653.5,510C657.703,519.72 659.537,529.887 659,540.5C660.713,542.507 662.379,544.507 664,546.5C664.903,547.701 666.069,548.535 667.5,549C673.196,549.257 678.863,549.757 684.5,550.5C699.057,549.357 713.724,548.19 728.5,547C731.774,545.798 735.107,544.798 738.5,544C745.032,536.612 750.199,528.445 754,519.5C757.401,514.371 761.234,509.704 765.5,505.5C758.514,518.672 750.848,531.506 742.5,544C739.554,544.806 736.888,546.139 734.5,548C731.471,548.539 728.471,549.206 725.5,550C707.951,551.926 691.118,553.093 675,553.5C671.175,552.79 667.342,551.956 663.5,551C661.333,548.5 659.167,546 657,543.5C654.313,538.246 653.813,532.746 655.5,527C653.585,521.829 651.752,516.662 650,511.5C644.044,504.377 637.544,497.71 630.5,491.5C626.596,492.976 622.596,494.143 618.5,495C605.278,496.127 592.111,497.627 579,499.5C567.878,499.088 556.878,497.755 546,495.5C545.228,495.645 544.561,495.978 544,496.5C541.649,495.286 539.149,494.452 536.5,494C524.172,492.847 511.838,490.847 499.5,488C495.909,487.211 492.409,487.378 489,488.5C488.08,486.686 486.58,485.686 484.5,485.5C479.57,486.741 474.57,487.575 469.5,488C461.539,492.768 452.872,493.601 443.5,490.5C435.924,481.752 429.757,472.086 425,461.5C419.152,453.135 413.819,444.468 409,435.5C404.123,423.039 398.956,410.873 393.5,399C394.353,396.191 393.353,394.025 390.5,392.5C391.098,391.205 391.598,389.872 392,388.5C396.034,385.978 399.701,382.978 403,379.5C408,372.833 413,366.167 418,359.5C421.821,350.159 425.321,340.826 428.5,331.5Z" style="fill:rgb(110,111,113);"/>
    </g>
    <g transform="matrix(1,0,0,1,-31.5,-156.5)">
        <path d="M496.5,599.5C497.626,600.858 497.626,602.192 496.5,603.5C489.926,605.893 484.259,609.726 479.5,615C478.062,615.219 476.729,615.719 475.5,616.5C467.843,623.171 460.843,630.505 454.5,638.5C453.902,639.795 453.402,641.128 453,642.5C447.283,649.216 441.95,656.216 437,663.5C426.937,684.94 417.937,707.273 410,730.5C397.713,784.863 397.38,838.863 409,892.5C424.45,943.386 446.783,990.719 476,1034.5C483.733,1043.34 491.899,1051.67 500.5,1059.5C500.119,1060.93 499.119,1061.76 497.5,1062C493.981,1062.38 490.481,1062.88 487,1063.5C479.821,1062.23 472.655,1060.9 465.5,1059.5C461.412,1060.29 457.412,1059.62 453.5,1057.5C436.021,1051.48 418.688,1044.32 401.5,1036C394.431,1031.93 388.264,1026.77 383,1020.5C375.255,1009.75 367.421,999.083 359.5,988.5C358.92,986.251 357.587,984.585 355.5,983.5C354.258,979.345 352.258,975.678 349.5,972.5C348.054,967.939 345.387,964.272 341.5,961.5C339.896,960.713 339.229,959.38 339.5,957.5C336.736,949.655 333.736,941.988 330.5,934.5C327.415,929.61 325.082,924.276 323.5,918.5C323.822,911.276 320.489,907.11 313.5,906C306.096,898.313 297.096,895.646 286.5,898C284.676,898.66 283.343,899.827 282.5,901.5L279.5,901.5C279.371,903.216 279.038,904.883 278.5,906.5C277.542,906.953 276.708,907.619 276,908.5C265.168,930.114 259.668,953.114 259.5,977.5C260.961,983.056 261.794,988.723 262,994.5C263.972,1003.59 267.472,1011.92 272.5,1019.5C272.851,1021.87 273.018,1024.2 273,1026.5C266.477,1033.01 258.644,1036.84 249.5,1038C246.798,1039.34 244.131,1040.67 241.5,1042C224.592,1046.28 207.592,1050.28 190.5,1054C167.521,1055.51 144.521,1055.84 121.5,1055C118.911,1053.8 116.244,1052.8 113.5,1052C112.62,1050.64 112.286,1049.14 112.5,1047.5C116.034,1047.64 118.701,1046.31 120.5,1043.5L123.5,1043.5C123.953,1044.46 124.619,1045.29 125.5,1046C150.419,1047.01 174.752,1044.01 198.5,1037C210.957,1036.35 223.124,1033.51 235,1028.5C235.414,1028.96 235.914,1029.29 236.5,1029.5C242.154,1028.06 247.487,1026.06 252.5,1023.5C253.097,1023.26 253.43,1022.76 253.5,1022C251.709,1016.8 250.042,1011.63 248.5,1006.5C245.167,978.484 247,950.818 254,923.5C260.151,905.882 267.818,888.882 277,872.5C278.333,871.167 279.667,869.833 281,868.5C287.037,856.928 294.204,846.095 302.5,836C303.448,835.517 304.448,835.351 305.5,835.5C305.702,823.563 305.035,811.729 303.5,800C304.643,785.453 305.643,770.62 306.5,755.5C308.636,754.141 308.969,752.307 307.5,750C308.834,744.331 310.167,738.664 311.5,733C311.355,732.228 311.022,731.561 310.5,731C316.295,708.283 323.795,685.783 333,663.5C341.031,646.44 349.864,629.773 359.5,613.5C354.727,601.088 347.061,591.088 336.5,583.5C333.784,579.641 330.45,576.641 326.5,574.5C325.167,574.167 323.833,573.833 322.5,573.5C317.855,565.748 310.855,561.248 301.5,560C299.911,558.255 297.911,557.088 295.5,556.5C294.833,555.5 294.167,554.5 293.5,553.5C285.531,550.196 277.531,546.863 269.5,543.5C264.41,544.263 259.743,545.93 255.5,548.5C253.358,545.2 252.025,541.533 251.5,537.5C254.958,534.251 259.125,532.585 264,532.5C269.379,534.221 274.879,535.388 280.5,536C291.167,540.667 301.833,545.333 312.5,550C322.269,556.109 332.269,561.776 342.5,567C348.692,568.172 354.358,570.505 359.5,574C364.088,575.284 368.755,576.118 373.5,576.5C383.705,574.986 393.705,572.653 403.5,569.5C407.357,563.476 412.357,558.643 418.5,555C430.534,550.333 441.534,551.999 451.5,560C456.5,565.667 461.5,571.333 466.5,577C472.091,580.586 477.091,584.92 481.5,590C486.181,593.674 491.181,596.84 496.5,599.5Z"/>
    </g>
    <g transform="matrix(1,0,0,1,-31.5,-156.5)">
        <path d="M243.5,543.5L245.5,543.5C246.185,545.414 246.685,547.414 247,549.5C247.708,550.381 248.542,551.047 249.5,551.5C251.175,554.507 251.841,557.84 251.5,561.5C247.025,577.492 242.192,593.492 237,609.5C227.229,629.058 214.729,646.391 199.5,661.5C197.426,662.514 195.426,663.514 193.5,664.5C186.406,667.108 179.073,669.108 171.5,670.5C164.707,668.853 158.374,666.353 152.5,663C149.61,658.705 146.61,654.538 143.5,650.5C144.075,646.928 143.408,643.428 141.5,640C142.035,638.538 142.035,636.872 141.5,635C141.572,630.675 142.572,626.842 144.5,623.5C149.683,627.26 154.683,631.26 159.5,635.5C161.828,644.328 167.495,649.495 176.5,651C182.548,651.663 188.548,651.33 194.5,650C198.197,646.393 202.031,642.893 206,639.5C214.11,625.137 221.443,610.47 228,595.5C231.479,577.571 236.646,560.238 243.5,543.5Z" style="fill:rgb(2,2,2);"/>
    </g>
    <g transform="matrix(1,0,0,1,-31.5,-156.5)">
        <path d="M322.5,573.5C319.984,573.245 317.65,572.411 315.5,571C310.352,566.235 304.685,562.235 298.5,559C290.941,556.091 283.441,552.924 276,549.5C269.79,547.744 263.957,548.411 258.5,551.5C257.694,550.272 256.694,549.272 255.5,548.5C259.743,545.93 264.41,544.263 269.5,543.5C277.531,546.863 285.531,550.196 293.5,553.5C294.167,554.5 294.833,555.5 295.5,556.5C297.911,557.088 299.911,558.255 301.5,560C310.855,561.248 317.855,565.748 322.5,573.5Z" style="fill:rgb(128,127,124);"/>
    </g>
    <g transform="matrix(1,0,0,1,-31.5,-156.5)">
        <path d="M245.5,543.5C247.202,545.84 248.535,548.507 249.5,551.5C248.542,551.047 247.708,550.381 247,549.5C246.685,547.414 246.185,545.414 245.5,543.5Z" style="fill:rgb(112,113,113);"/>
    </g>
    <g transform="matrix(1,0,0,1,-31.5,-156.5)">
        <path d="M440.5,551.5C438.028,551.058 435.528,550.725 433,550.5C427.286,552.076 421.452,553.076 415.5,553.5C418.715,551.756 422.048,549.923 425.5,548C429.594,547.233 433.594,547.566 437.5,549C438.942,549.377 439.942,550.21 440.5,551.5Z" style="fill:rgb(163,165,175);"/>
    </g>
    <g transform="matrix(1,0,0,1,-31.5,-156.5)">
        <path d="M755.5,558.5C753.747,560.223 751.747,561.723 749.5,563C718.605,566.393 688.605,573.226 659.5,583.5C661.253,581.777 663.253,580.277 665.5,579C676.96,574.578 688.626,570.911 700.5,568C719.029,565.74 737.362,562.573 755.5,558.5Z" style="fill:rgb(114,115,115);"/>
    </g>
    <g transform="matrix(1,0,0,1,-31.5,-156.5)">
        <path d="M326.5,574.5C330.45,576.641 333.784,579.641 336.5,583.5C332.5,581.082 329.167,578.082 326.5,574.5Z" style="fill:rgb(77,77,81);"/>
    </g>
    <path d="M220,415L220,405C220.341,401.34 219.675,398.007 218,395C217.035,392.007 215.702,389.34 214,387L212,387C211.562,385.994 210.896,385.994 210,387C210.377,385.242 211.044,383.575 212,382C210.788,376.853 209.121,371.853 207,367C206.258,366.213 205.425,365.547 204.5,365C201.614,357.669 197.28,351.336 191.5,346C188.045,340.068 183.712,334.735 178.5,330C177.089,327.85 176.255,325.516 176,323L173,323C171.879,319.026 170.046,315.36 167.5,312C163.891,307.676 160.224,303.343 156.5,299C148.024,283.25 139.357,267.583 130.5,252C130.071,245.484 127.737,239.817 123.5,235C119.383,217.642 115.05,200.308 110.5,183C107.032,151.742 110.699,121.409 121.5,92C123.743,88.017 126.41,84.35 129.5,81C132.863,72.213 138.03,64.713 145,58.5C156.023,50.496 167.356,42.829 179,35.5C191.246,29.352 203.579,23.352 216,17.5C225.322,15.258 234.322,12.258 243,8.5C250.124,6.053 257.458,4.553 265,4C266.749,1.969 268.749,1.635 271,3C274.889,1.689 278.889,1.022 283,1C288.024,1.086 293.358,1.086 299,1C320.696,1.172 342.363,2.005 364,3.5C371.827,5.812 379.827,7.145 388,7.5C389.544,7.79 390.877,8.456 392,9.5C422.16,13.796 451.326,21.629 479.5,33C481.973,34.145 484.14,35.645 486,37.5C504.822,45.597 523.155,54.43 541,64C541.942,63.892 542.775,63.559 543.5,63C557.354,33.823 580.187,22.323 612,28.5C623.554,35.388 629.054,45.555 628.5,59C626.649,62.504 625.316,66.17 624.5,70C622.117,74.211 619.617,78.377 617,82.5C613.811,83.926 610.811,85.592 608,87.5C601.056,88.955 594.056,89.288 587,88.5C572.743,85.694 559.41,80.694 547,73.5C546,72.833 545,72.833 544,73.5C536.981,88.494 526.647,100.828 513,110.5C509.081,111.035 505.414,112.202 502,114C501.667,114.5 501.333,115 501,115.5C503.776,117.888 504.443,120.722 503,124C494.746,128.256 486.412,132.423 478,136.5C476.694,139.639 474.361,141.472 471,142C469.635,144.251 469.969,146.251 472,148C471.523,148.978 470.857,149.811 470,150.5C456.108,156.646 442.441,163.313 429,170.5C425.534,170.378 422.868,171.711 421,174.5C415.577,176.046 410.577,178.38 406,181.5C403.026,182.493 400.026,183.326 397,184L397,175C402.212,166.065 403.879,156.398 402,146L402,145C402.99,139.19 403.323,133.19 403,127C420.885,121.261 438.552,114.927 456,108C456.268,112.085 457.602,115.751 460,119C465.344,116.379 471.011,114.212 477,112.5C482.134,109.518 487.301,106.685 492.5,104C495.791,104.792 497.958,106.792 499,110C509.13,107.065 517.796,101.732 525,94C530.073,86.591 534.739,78.924 539,71C537.519,70.02 536.185,68.853 535,67.5C511.407,56.211 488.073,44.545 465,32.5C431.604,22.319 397.604,14.652 363,9.5C340.572,8.459 318.405,7.293 296.5,6C245.98,10.068 200.147,26.568 159,55.5C146.296,64.2 136.463,75.366 129.5,89C121.896,104.018 117.229,120.018 115.5,137C114.208,148.593 113.374,160.093 113,171.5C113.96,172.919 114.793,174.419 115.5,176C116.543,186.841 118.543,197.507 121.5,208C124.447,219.839 128.781,231.172 134.5,242C135.145,245.059 135.978,248.059 137,251C143.71,262.545 150.21,274.212 156.5,286C167.859,301.033 178.859,316.367 189.5,332C201.181,343.991 210.514,357.658 217.5,373C218.316,374.323 219.483,374.989 221,375C220.159,376.879 219.825,378.879 220,381C220.525,385.033 221.858,388.7 224,392C225.157,392.748 226.131,393.709 226.924,394.885L227,395C226.987,395.285 226.976,395.57 226.968,395.854C226.906,397.848 226.942,399.838 227.075,401.823C227.105,402.266 227.139,402.708 227.179,403.15C227.21,403.499 227.244,403.849 227.281,404.198C227.345,404.799 227.418,405.399 227.5,406C228.007,407.81 228.479,409.622 228.915,411.439L228.999,411.787C229.254,412.859 229.497,413.932 229.727,415.004C230.017,416.354 230.287,417.705 230.538,419.055C230.698,419.917 230.85,420.779 230.994,421.641C231.275,423.324 231.526,425.009 231.747,426.693C231.785,426.982 231.822,427.271 231.858,427.562C231.953,428.322 232.042,429.082 232.125,429.843C232.368,432.082 232.558,434.323 232.695,436.566C232.738,437.263 232.775,437.96 232.808,438.657C232.833,439.193 232.855,439.729 232.873,440.266C232.952,442.501 232.978,444.738 232.952,446.98C232.94,447.995 232.917,449.01 232.884,450.026C232.875,450.29 232.866,450.553 232.856,450.817C232.806,452.115 232.739,453.414 232.654,454.713C232.586,455.75 232.507,456.788 232.417,457.828C232.249,459.763 232.042,461.7 231.797,463.639C231.762,463.915 231.726,464.191 231.689,464.468C231.631,464.91 231.57,465.352 231.508,465.794C231.43,466.346 231.349,466.898 231.264,467.451L231.125,468.349L231.004,469.093C230.882,469.84 230.755,470.585 230.621,471.331C230.581,471.554 230.541,471.777 230.5,472L230.468,472.222C230.277,473.568 230.076,474.91 229.865,476.252C229.605,477.902 229.331,479.548 229.041,481.191C228.905,481.965 228.766,482.739 228.623,483.51C228.483,484.269 228.339,485.028 228.192,485.786L227.859,487.479L227.725,488.147C227.638,488.575 227.55,489.003 227.461,489.431C227.202,490.681 226.933,491.929 226.656,493.174C226.298,494.787 225.925,496.395 225.537,498C224.978,500.317 224.388,502.626 223.768,504.927L223.655,505.345C223.448,506.107 223.238,506.869 223.025,507.629C222.721,508.711 222.411,509.792 222.094,510.871C221.901,511.526 221.706,512.181 221.508,512.836L221.2,513.849L221,514.5C218.524,518.68 216.075,522.866 213.655,527.059C211.071,531.532 208.52,536.012 206,540.5C208.865,544.123 211.798,547.675 214.8,551.153C218.068,554.94 221.418,558.641 224.848,562.256C225.273,562.704 225.699,563.151 226.127,563.596C227.744,565.279 229.378,566.944 231.03,568.59C231.774,569.331 232.521,570.068 233.272,570.8L233.883,571.396L234.811,572.293C235.801,573.246 236.796,574.193 237.799,575.133C239.067,576.324 240.346,577.504 241.636,578.674L242.686,579.623L244.019,580.815L245.669,582.272C246.109,582.658 246.55,583.042 246.992,583.425L247.741,584.072C248.49,584.718 249.243,585.36 250,586C250.067,586.09 250.135,586.18 250.203,586.271C251.16,587.541 252.156,588.769 253.19,589.953L253.541,590.353C253.832,590.68 254.125,591.004 254.421,591.324L255.143,592.092C255.41,592.372 255.68,592.649 255.953,592.924L256.698,593.665L256.916,593.876C257.312,594.259 257.712,594.637 258.118,595.009L258.843,595.664C259.778,596.497 260.737,597.301 261.722,598.078C262.008,598.304 262.297,598.528 262.587,598.749C262.853,598.952 263.121,599.152 263.391,599.351C263.557,599.474 263.725,599.596 263.892,599.717L264.731,600.313L265,600.5C265.052,600.914 265.119,601.298 265.203,601.652L265.238,601.797C265.325,602.138 265.427,602.45 265.544,602.731C265.635,602.949 265.735,603.15 265.844,603.333L265.91,603.44C265.971,603.535 266.035,603.624 266.101,603.709C266.254,603.904 266.421,604.071 266.601,604.211C266.774,604.346 266.961,604.455 267.16,604.54C267.284,604.592 267.413,604.635 267.547,604.668C267.777,604.725 268.022,604.754 268.281,604.755L268.405,604.753C268.573,604.747 268.748,604.73 268.928,604.701C269.089,604.676 269.255,604.641 269.426,604.597L269.759,604.502C270.149,604.379 270.563,604.212 271,604C271.555,607.512 270.888,610.512 269,613C261.383,608.531 255.05,602.698 250,595.5C239.333,586.833 228.667,578.167 218,569.5C213.761,565.55 209.761,561.384 206,557C205.175,556.114 204.175,555.781 203,556C202.72,552.275 200.72,551.108 197,552.5C194.214,556.953 191.048,561.12 187.5,565C187.729,568.31 186.229,570.144 183,570.5C181.851,573.752 179.518,575.585 176,576C175.114,576.825 174.781,577.825 175,579C172.126,580.344 169.126,581.51 166,582.5C164.233,584.89 161.9,586.557 159,587.5C151.689,588.331 144.356,588.831 137,589C132.813,588.929 128.813,588.262 125,587C120.723,588.106 116.39,588.272 112,587.5C103.13,583.567 94.13,579.9 85,576.5C81.053,574.058 78.053,570.891 76,567C73.74,566.361 71.74,565.194 70,563.5C48.912,543.069 30.746,520.236 15.5,495C13.849,491.698 12.182,488.364 10.5,485C8.754,476.769 6.421,468.769 3.5,461C2.637,453.075 1.471,445.242 0,437.5C0.505,433.954 0.505,430.288 0,426.5C1.041,414.678 5.541,404.512 13.5,396C13.833,394.667 14.167,393.333 14.5,392C20.633,387.618 26.467,382.785 32,377.5C41.057,375.616 50.057,375.949 59,378.5C69.616,386.28 76.616,396.614 80,409.5C82.296,413.593 84.963,417.426 88,421C89.823,422.247 91.823,422.914 94,423C94.529,418.377 96.529,414.544 100,411.5C101.667,410.833 103.333,410.833 105,411.5C110.702,418.736 116.035,426.236 121,434C122.088,435.434 123.422,436.434 125,437C124.577,439.281 125.244,440.948 127,442C128.82,445.64 130.653,449.307 132.5,453C133.511,453.837 134.678,454.17 136,454C135.657,455.983 136.324,457.317 138,458C139.257,460.596 140.424,463.263 141.5,466C148.283,473.261 154.45,480.927 160,489C159.157,490.673 157.824,491.84 156,492.5C149.515,493.947 143.848,492.447 139,488C136.19,483.848 132.524,480.848 128,479C123.183,474.76 118.183,470.76 113,467C112,465.333 110.667,464 109,463L107.197,461.448C103.174,458.01 99.055,454.656 94.84,451.387C90.609,448.105 86.28,444.908 81.855,441.795C81.237,441.361 80.62,440.93 80,440.5C79.733,440.364 79.463,440.253 79.188,440.167L78.89,440.085C78.558,440.004 78.219,439.958 77.875,439.949L77.603,439.949L77.261,439.969C77.174,439.977 77.087,439.987 77,440C77.018,439.794 77.04,439.59 77.067,439.391C77.138,438.852 77.241,438.335 77.375,437.84L77.59,437.139L77.64,437C77.896,436.293 78.224,435.637 78.622,435.032C79.536,433.643 80.824,432.521 82.485,431.667L82.664,431.576L83.219,431.317L83.41,431.235C83.602,431.153 83.799,431.075 84,431C84.113,430.905 84.22,430.808 84.322,430.71L84.618,430.405L84.802,430.189C84.96,429.994 85.098,429.795 85.216,429.59C85.265,429.506 85.31,429.42 85.353,429.334C85.407,429.224 85.455,429.113 85.498,429L85.614,428.651C85.753,428.152 85.793,427.626 85.732,427.073L85.664,426.634C85.623,426.426 85.568,426.215 85.5,426C84.548,425.065 83.637,424.106 82.767,423.124L82.443,422.755C80.622,420.663 78.985,418.464 77.532,416.16C77.287,415.772 77.047,415.381 76.813,414.987C76.654,414.72 76.498,414.453 76.345,414.184C76.236,413.993 76.128,413.802 76.022,413.611L75.706,413.033C75.555,412.752 75.406,412.469 75.26,412.185C75.052,411.782 74.85,411.376 74.652,410.966C73.262,408.089 72.122,405.066 71.234,401.897C70.967,400.946 70.722,399.979 70.5,399C70.206,398.541 69.907,398.088 69.603,397.639L69.308,397.208C68.925,396.653 68.535,396.106 68.137,395.567C67.374,394.534 66.583,393.529 65.764,392.552C65.221,391.905 64.666,391.27 64.099,390.649C61.447,387.742 58.526,385.108 55.333,382.745C55.223,382.663 55.112,382.581 55,382.5L54.588,382.378C54.039,382.219 53.492,382.075 52.947,381.945C52.336,381.799 51.726,381.671 51.119,381.561L50.912,381.524C48.073,381.028 45.284,380.925 42.546,381.216L42.155,381.26C38.652,381.68 35.23,382.746 31.89,384.458L31.674,384.57C31.238,384.797 30.803,385.035 30.369,385.284L30,385.5C28.543,386.758 27.138,388.053 25.785,389.385L25.222,389.943C24.285,390.882 23.372,391.84 22.485,392.816L22.041,393.308C21.209,394.236 20.399,395.181 19.612,396.143C19.334,396.482 19.058,396.824 18.785,397.168C18.344,397.724 17.911,398.285 17.485,398.852C16.259,400.481 15.093,402.155 13.987,403.873L13.352,404.875L13.05,405.363C12.825,405.729 12.602,406.097 12.383,406.467C11.188,408.48 10.072,410.551 9.035,412.678C8.942,412.869 8.849,413.06 8.758,413.252L8.499,413.797C8.254,414.319 8.013,414.844 7.777,415.373C7.684,415.581 7.592,415.79 7.5,416C7.369,416.961 7.247,417.921 7.136,418.879C7,420.05 6.877,421.219 6.77,422.383C6.73,422.813 6.693,423.243 6.657,423.673C6.435,426.341 6.29,428.995 6.22,431.637L6.204,432.358C6.191,432.964 6.182,433.57 6.177,434.176L6.174,434.667C6.171,435.446 6.175,436.223 6.185,437L6.193,437.5C6.225,439.396 6.297,441.286 6.409,443.168L6.451,443.841C6.566,445.628 6.718,447.408 6.905,449.181C7.009,450.163 7.124,451.143 7.251,452.123L7.285,452.384C7.379,453.103 7.479,453.821 7.586,454.54C7.809,456.052 8.06,457.558 8.337,459.061L8.452,459.676C8.521,460.043 8.593,460.41 8.666,460.778C8.867,461.791 9.08,462.802 9.306,463.812C9.363,464.066 9.42,464.321 9.478,464.575L9.765,465.794L9.879,466.265C10.216,467.645 10.575,469.02 10.958,470.392C11.128,471.003 11.303,471.614 11.483,472.225C11.567,472.51 11.652,472.796 11.738,473.081C12.534,475.719 13.416,478.342 14.385,480.95L14.75,481.924C15.354,483.515 15.99,485.1 16.658,486.679C17.347,488.306 18.069,489.927 18.824,491.541L19.309,492.565C19.696,493.377 20.094,494.189 20.5,495C21.037,495.784 21.571,496.57 22.104,497.359C22.866,498.486 23.623,499.618 24.375,500.752C25.82,502.93 27.247,505.12 28.657,507.323C31.333,511.504 33.948,515.729 36.5,520C36.836,520.46 37.177,520.915 37.522,521.365L37.782,521.701C37.941,521.904 38.1,522.105 38.26,522.306C38.369,522.443 38.478,522.578 38.588,522.714C39.633,524.002 40.72,525.243 41.85,526.438C42.171,526.777 42.495,527.112 42.822,527.443C43.266,527.893 43.717,528.335 44.174,528.771L44.416,529C44.766,529.331 45.12,529.657 45.478,529.98L45.5,530C45.752,530.462 46.007,530.922 46.267,531.38C47.222,533.067 48.23,534.727 49.29,536.359C49.875,537.26 50.476,538.152 51.093,539.036L51.777,540.003C51.936,540.225 52.096,540.447 52.257,540.668L52.5,541C56.694,545.194 60.86,549.36 65,553.5L65.487,553.745C66.824,554.436 68.044,555.227 69.145,556.118L69.694,556.578L70.074,556.918C70.614,557.415 71.123,557.939 71.599,558.491L71.848,558.784C72.024,558.998 72.196,559.215 72.364,559.437L72.664,559.844C72.89,560.161 73.107,560.485 73.315,560.816C73.495,561.105 73.669,561.399 73.836,561.699C73.891,561.798 73.946,561.899 74,562C74.331,562.104 74.657,562.215 74.978,562.332L75.548,562.546L75.954,562.709C76.318,562.859 76.675,563.017 77.027,563.182L77.267,563.297C77.666,563.491 78.056,563.695 78.439,563.91L78.668,564.04C78.846,564.142 79.022,564.247 79.196,564.355C79.989,564.842 80.746,565.377 81.468,565.96C82.194,566.546 82.884,567.182 83.538,567.865L83.761,568.101L84.302,568.704L84.46,568.889C84.581,569.031 84.7,569.175 84.818,569.321L84.986,569.532C85.711,570.45 86.382,571.44 87,572.5C87.897,572.788 88.792,573.082 89.684,573.381C89.981,573.48 90.279,573.581 90.576,573.681L92.355,574.293C92.651,574.396 92.947,574.5 93.243,574.604L94.13,574.918C94.425,575.024 94.72,575.13 95.015,575.236L95.807,575.524C98.487,576.503 101.149,577.53 103.792,578.604L104.662,578.96C108.14,580.391 111.586,581.904 115,583.5C115.427,583.557 115.855,583.612 116.28,583.665C118.415,583.931 120.549,584.152 122.683,584.33L123.964,584.431L125.245,584.521C126.739,584.621 128.233,584.698 129.728,584.754L130.368,584.777C130.644,584.786 130.92,584.794 131.196,584.802C132.628,584.842 134.061,584.862 135.493,584.862L136.134,584.86C139.337,584.847 142.54,584.734 145.745,584.521L147.026,584.431L147.667,584.382C147.936,584.36 148.206,584.338 148.475,584.316C149.06,584.266 149.645,584.214 150.231,584.158C150.658,584.117 151.086,584.075 151.513,584.03L152.154,583.963C153.434,583.824 154.717,583.67 156,583.5L156.505,583.351L156.853,583.241C157.212,583.126 157.568,583.004 157.92,582.874C158.676,582.595 159.415,582.283 160.137,581.937C160.759,581.639 161.369,581.316 161.965,580.969L162.188,580.837C162.633,580.572 163.07,580.293 163.5,580L164.409,579.455L165.309,578.9L165.517,578.769C166.888,577.905 168.228,577.002 169.537,576.061C169.99,575.735 170.44,575.404 170.885,575.069C171.95,574.269 172.993,573.441 174.016,572.588C176.465,570.543 178.793,568.348 181,566L181.022,565.96C181.608,564.895 182.203,563.838 182.808,562.787C183.406,561.749 184.013,560.718 184.628,559.696L185.245,558.677C185.568,558.149 185.893,557.623 186.22,557.098L186.466,556.706C187.625,554.86 188.815,553.037 190.036,551.239C190.238,550.94 190.441,550.643 190.645,550.346C191.417,549.222 192.203,548.106 193,547C192.471,546.506 191.96,546 191.467,545.483L191.173,545.17C190.784,544.752 190.406,544.325 190.038,543.891L189.765,543.563L189.497,543.233C189.141,542.791 188.796,542.34 188.463,541.882L188.215,541.537C187.957,541.172 187.706,540.803 187.462,540.429C186.853,539.498 186.288,538.535 185.765,537.542L185.568,537.161C185.372,536.779 185.183,536.391 185,536C180.757,531.771 176.502,527.611 172.236,523.52C168.689,520.117 165.133,516.762 161.57,513.454L160,512C160.233,510.438 160.9,509.105 162,508C163.926,507.014 165.926,506.014 168,505C169.459,505.067 170.792,504.734 172,504L171.981,504.109C171.973,504.162 171.965,504.215 171.96,504.267C171.933,504.494 171.928,504.714 171.945,504.927C171.956,505.069 171.976,505.209 172.006,505.345L172.018,505.393C172.025,505.425 172.034,505.457 172.042,505.489L172.056,505.537C172.075,505.6 172.095,505.662 172.118,505.724C172.258,506.1 172.478,506.452 172.779,506.777C172.848,506.853 172.922,506.927 173,507C173.962,507.825 174.911,508.662 175.846,509.511C176.593,510.189 177.331,510.874 178.06,511.566L178.252,511.749L178.515,512C178.693,512.17 178.87,512.341 179.046,512.511L179.27,512.729C179.382,512.838 179.494,512.948 179.607,513.057L179.855,513.301C180.681,514.115 181.497,514.939 182.301,515.774C182.939,516.435 183.57,517.103 184.193,517.777L184.512,518.122C185.064,518.724 185.611,519.33 186.152,519.941C186.561,520.403 186.967,520.868 187.37,521.335C187.914,521.967 188.452,522.604 188.985,523.246L189.143,523.437C189.243,523.558 189.342,523.679 189.442,523.8L189.628,524.028C190.278,524.823 190.919,525.626 191.551,526.438L191.79,526.745C191.886,526.869 191.982,526.993 192.078,527.118L192.276,527.376C192.527,527.704 192.777,528.034 193.026,528.365C193.185,528.576 193.343,528.788 193.5,529C194.258,529.487 195.01,529.982 195.756,530.486C196.549,531.021 197.336,531.566 198.116,532.12L198.346,532.284C198.434,532.347 198.522,532.41 198.61,532.473L198.842,532.64C199.038,532.781 199.233,532.923 199.428,533.066L199.662,533.238L199.924,533.431C200.622,533.946 201.313,534.469 202,535L202.31,534.509C203.045,533.34 203.767,532.164 204.476,530.979C204.883,530.298 205.286,529.614 205.684,528.929L205.896,528.563C205.992,528.396 206.089,528.229 206.185,528.062L206.296,527.867C206.696,527.167 207.092,526.465 207.482,525.761L207.601,525.547C207.694,525.378 207.787,525.21 207.879,525.041L208.156,524.535L208.431,524.028C208.522,523.858 208.613,523.689 208.705,523.52L208.976,523.011L209.134,522.714C209.295,522.409 209.456,522.104 209.615,521.799C209.76,521.522 209.904,521.245 210.047,520.968L210.311,520.455C210.411,520.259 210.511,520.063 210.611,519.866L210.833,519.427C210.919,519.255 211.005,519.083 211.092,518.911L211.139,518.817C211.304,518.486 211.468,518.154 211.631,517.823C211.798,517.484 211.963,517.145 212.128,516.805L212.36,516.323C212.443,516.15 212.526,515.977 212.609,515.803L212.856,515.282L213.101,514.761L213.223,514.5C213.426,514.064 213.628,513.628 213.828,513.191L214.067,512.666C214.146,512.491 214.225,512.316 214.304,512.14L214.497,511.71C214.683,511.293 214.867,510.876 215.05,510.458C215.696,508.981 216.323,507.494 216.93,505.998L217.023,505.77L217.175,505.393C217.628,504.267 218.069,503.136 218.5,502C218.738,500.648 218.977,499.297 219.217,497.946L219.25,497.763L219.422,496.796C219.647,495.538 219.873,494.281 220.1,493.026L220.264,492.12L220.485,490.905C220.897,488.644 221.313,486.385 221.733,484.126L221.819,483.667L222.038,482.496C222.256,481.33 222.475,480.165 222.695,479C223.123,476.74 223.555,474.481 223.99,472.225L224.224,471.016C224.315,470.549 224.406,470.081 224.497,469.613L224.648,468.836C225.135,466.344 225.626,463.854 226.123,461.364L226.156,461.2L226.305,460.454C226.536,459.302 226.767,458.151 227,457C226.855,455.335 226.72,453.668 226.596,452.001C226.544,451.307 226.493,450.612 226.445,449.917C226.223,446.751 226.037,443.58 225.887,440.403C225.807,438.711 225.737,437.019 225.677,435.325C225.658,434.781 225.64,434.238 225.623,433.694C225.593,432.772 225.567,431.85 225.544,430.928C225.528,430.285 225.513,429.642 225.5,429C225.402,428.425 225.301,427.852 225.194,427.279C225.082,426.675 224.966,426.073 224.844,425.471C224.79,425.203 224.734,424.936 224.678,424.668L224.641,424.488L224.573,424.173C224.538,424.006 224.501,423.839 224.465,423.673L224.375,423.266L224.322,423.028C224.264,422.775 224.207,422.521 224.148,422.268L224.096,422.046L224.054,421.87C223.993,421.612 223.931,421.354 223.869,421.096L223.804,420.83L223.703,420.426L223.601,420.022C223.567,419.887 223.532,419.752 223.498,419.618L223.433,419.368C223.26,418.705 223.082,418.045 222.897,417.386C222.768,416.923 222.635,416.461 222.5,416C222.46,415.954 222.418,415.911 222.377,415.868C222.345,415.836 222.313,415.804 222.28,415.774C222.245,415.741 222.209,415.709 222.174,415.678L222.105,415.621L222.076,415.598C221.938,415.488 221.793,415.392 221.643,415.312L221.602,415.29L221.526,415.253L221.45,415.218C221.424,415.207 221.398,415.196 221.372,415.185L221.293,415.155C221.201,415.122 221.108,415.093 221.012,415.07L220.969,415.06L220.886,415.042C220.718,415.009 220.545,414.991 220.366,414.987L220.276,414.987C220.216,414.987 220.155,414.989 220.093,414.993L220,415ZM594,31C601.124,30.47 607.791,32.304 614,36.5C621.562,42.51 624.395,50.344 622.5,60C619.265,67.627 615.098,74.794 610,81.5C603.403,85.454 596.403,86.121 589,83.5C575.052,80.576 562.052,75.409 550,68C549.315,61.698 551.648,56.698 557,53C557.431,49.402 559.431,47.235 563,46.5C566.85,41.323 571.85,37.657 578,35.5C583.335,33.77 588.668,32.27 594,31Z" style="fill:rgb(254,252,248);"/>
    <g transform="matrix(1,0,0,1,-31.5,-156.5)">
        <path d="M167.5,610.5C166.178,610.67 165.011,610.337 164,609.5C162.153,605.807 160.32,602.14 158.5,598.5C159.73,595.596 161.73,593.263 164.5,591.5C166.697,591.848 168.53,592.848 170,594.5C170.667,597.833 170.667,601.167 170,604.5C168.441,606.217 167.608,608.217 167.5,610.5Z"/>
    </g>
    <g transform="matrix(1,0,0,1,-31.5,-156.5)">
        <path d="M659.5,583.5C654.896,586.908 650.062,590.242 645,593.5C638.899,605.752 630.899,616.419 621,625.5C620.208,627.587 619.041,629.421 617.5,631C611.115,635.54 605.115,640.706 599.5,646.5C594.505,649.646 589.172,652.146 583.5,654C580.167,654.667 576.833,654.667 573.5,654C572.748,653.329 572.414,652.496 572.5,651.5C582.574,651.198 591.907,648.365 600.5,643C618.722,628.794 633.222,611.628 644,591.5C648.274,587.113 653.441,584.446 659.5,583.5Z" style="fill:rgb(99,100,101);"/>
    </g>
    <g transform="matrix(1,0,0,1,-31.5,-156.5)">
        <path d="M169.5,614.5C167.824,613.817 167.157,612.483 167.5,610.5C167.608,608.217 168.441,606.217 170,604.5C170.667,601.167 170.667,597.833 170,594.5C168.53,592.848 166.697,591.848 164.5,591.5C161.73,593.263 159.73,595.596 158.5,598.5C156.744,597.448 156.077,595.781 156.5,593.5C159.832,588.357 164.499,586.69 170.5,588.5C171.333,589.5 172.167,590.5 173,591.5C174.521,599.799 173.354,607.466 169.5,614.5Z" style="fill:rgb(104,103,108);"/>
    </g>
    <g transform="matrix(1,0,0,1,-31.5,-156.5)">
        <path d="M501.5,606.5C505.729,608.287 509.729,610.62 513.5,613.5C519.652,619.152 525.652,624.985 531.5,631C542.606,639.47 553.606,648.137 564.5,657C566.638,661.317 569.138,665.484 572,669.5C573.667,671.167 575.333,672.833 577,674.5C578.545,684.274 577.212,693.607 573,702.5C571.537,708.223 571.537,713.89 573,719.5C576.878,725.045 581.711,729.545 587.5,733C599.967,740.069 612.634,746.903 625.5,753.5C631.23,756.725 636.23,760.891 640.5,766C642.452,766.366 644.118,767.199 645.5,768.5C655.131,779.74 664.297,791.406 673,803.5C674.634,807.98 676.634,812.313 679,816.5C680.869,819.691 683.369,820.358 686.5,818.5L689.5,818.5C690.167,818.5 690.5,818.833 690.5,819.5C695.935,821.026 701.435,822.693 707,824.5C709.893,824.683 712.893,824.349 716,823.5C716.519,824.516 717.353,825.182 718.5,825.5C724.092,826.99 729.759,828.156 735.5,829C741.792,832.41 748.458,834.91 755.5,836.5C760.367,842.57 766.7,847.57 774.5,851.5C780.849,857.018 787.016,862.685 793,868.5C794.827,870.586 794.827,872.586 793,874.5C791.301,873.594 789.467,873.261 787.5,873.5C786.134,870.936 784.467,868.436 782.5,866C763.445,855.305 743.779,845.972 723.5,838C713.194,835.589 702.861,833.422 692.5,831.5C686.88,833.825 681.213,833.992 675.5,832C671.325,826.494 667.159,820.994 663,815.5C662.667,814.167 662.333,812.833 662,811.5C656.05,805.177 650.884,798.511 646.5,791.5C642.833,789.833 640.167,787.167 638.5,783.5C637.448,783.649 636.448,783.483 635.5,783C629.205,777.706 623.205,772.04 617.5,766C611.395,763.446 605.728,760.113 600.5,756C590.267,752.201 580.267,748.868 570.5,746C556.71,745.289 544.877,750.122 535,760.5C534.51,761.793 534.343,763.127 534.5,764.5C532.406,766.559 530.572,768.893 529,771.5C528.982,773.797 529.149,776.131 529.5,778.5C528.839,781.787 528.339,785.12 528,788.5C526.482,789.163 525.315,790.163 524.5,791.5C522.72,792.99 522.054,794.99 522.5,797.5L522.5,807.5C522.054,810.01 522.72,812.01 524.5,813.5C531.081,823.236 539.747,830.736 550.5,836C555.331,840.409 559.664,845.242 563.5,850.5C565.173,852.086 567.173,852.753 569.5,852.5C569.402,854.553 570.069,856.22 571.5,857.5C573.193,860.19 575.527,862.19 578.5,863.5C578.67,866.204 580.003,867.871 582.5,868.5C583.209,872.556 585.209,875.89 588.5,878.5C591.091,883.096 593.591,887.763 596,892.5C597.113,893.305 598.279,893.972 599.5,894.5C600.692,897.562 602.192,900.562 604,903.5C605.11,905.037 606.61,905.703 608.5,905.5L608.5,907.5C608.92,909.674 608.92,911.674 608.5,913.5C616.101,925.304 621.768,937.97 625.5,951.5C627.361,953.888 628.694,956.554 629.5,959.5C631.5,960.833 633.167,962.5 634.5,964.5C640.536,967.096 646.203,970.096 651.5,973.5L652.5,973.5C655.814,978.627 660.48,982.127 666.5,984C671.431,989.322 677.431,992.988 684.5,995C689.419,998.042 694.252,1001.21 699,1004.5C699.333,1004.17 699.667,1003.83 700,1003.5C706.311,1007.07 712.811,1010.24 719.5,1013C728.946,1014.42 737.613,1017.75 745.5,1023C752.713,1024.38 760.046,1026.22 767.5,1028.5C767.343,1030.82 766.176,1032.48 764,1033.5C755.593,1033.45 747.093,1032.95 738.5,1032C734.971,1030.53 731.305,1029.53 727.5,1029C714.416,1024.56 701.749,1019.23 689.5,1013C680.472,1008.29 671.806,1003.12 663.5,997.5C662.167,996.833 660.833,996.167 659.5,995.5C658.972,994.279 658.305,993.113 657.5,992C652.027,989.344 646.694,986.511 641.5,983.5C637.223,982.525 633.557,980.525 630.5,977.5C629.015,974.917 626.682,973.584 623.5,973.5C622.878,970.224 620.878,968.891 617.5,969.5C615.75,968.341 614.75,966.674 614.5,964.5C612.507,958.511 610.507,952.511 608.5,946.5C607.85,944.816 606.85,943.483 605.5,942.5C604.583,935.913 602.749,929.58 600,923.5C599.29,922.027 598.124,921.36 596.5,921.5C595.662,921.158 595.328,920.492 595.5,919.5C593.94,914.053 592.107,908.72 590,903.5C588.333,901.833 586.667,900.167 585,898.5C581.848,892.199 578.182,886.199 574,880.5C572.269,877.932 570.102,875.932 567.5,874.5C559.929,860.082 547.929,853.915 531.5,856C527.407,857.265 524.407,859.765 522.5,863.5L519.5,863.5C518.868,878.437 521.868,892.604 528.5,906C528.043,906.414 527.709,906.914 527.5,907.5C532.853,924.756 538.02,942.09 543,959.5C543.571,966.995 544.071,974.495 544.5,982C543.664,993.521 542.664,1005.02 541.5,1016.5C540.833,1018.17 540.167,1019.83 539.5,1021.5C536.379,1027.74 533.213,1034.07 530,1040.5C527.59,1043.4 525.423,1046.4 523.5,1049.5C522.078,1049.71 520.745,1050.21 519.5,1051C516.058,1053.92 512.724,1056.76 509.5,1059.5C508.417,1059.54 507.417,1059.87 506.5,1060.5C505.148,1059.48 503.815,1058.48 502.5,1057.5C493.063,1048.57 484.563,1038.9 477,1028.5C468.063,1013.23 458.729,998.235 449,983.5C431.311,947.77 417.978,910.437 409,871.5C410.004,866.547 409.337,861.88 407,857.5C406.678,852.148 406.178,846.814 405.5,841.5C406.298,821.517 406.798,801.517 407,781.5C408.024,766.271 410.358,751.271 414,736.5C423.075,702.176 438.408,670.176 460,640.5C469.22,630.28 479.386,621.114 490.5,613C493.952,611.774 497.285,610.274 500.5,608.5C501.298,608.043 501.631,607.376 501.5,606.5Z"/>
    </g>
    <g transform="matrix(1,0,0,1,-31.5,-156.5)">
        <path d="M243.5,543.5C236.646,560.238 231.479,577.571 228,595.5C221.443,610.47 214.11,625.137 206,639.5C202.031,642.893 198.197,646.393 194.5,650C188.548,651.33 182.548,651.663 176.5,651C167.495,649.495 161.828,644.328 159.5,635.5C164.024,637.348 167.69,640.348 170.5,644.5C175.348,648.947 181.015,650.447 187.5,649C189.324,648.34 190.657,647.173 191.5,645.5C196.029,645.504 199.529,643.504 202,639.5C217.063,615.365 227.73,589.365 234,561.5C236.316,555.383 238.816,549.383 241.5,543.5C242.396,542.494 243.062,542.494 243.5,543.5Z" style="fill:rgb(118,118,118);"/>
    </g>
    <g transform="matrix(1,0,0,1,-31.5,-156.5)">
        <path d="M415.5,553.5C421.452,553.076 427.286,552.076 433,550.5C435.528,550.725 438.028,551.058 440.5,551.5C451.098,555.621 459.765,562.121 466.5,571C469.171,573.447 472.171,575.447 475.5,577C478.646,580.829 481.979,584.496 485.5,588C488.734,589.233 491.401,591.233 493.5,594C496.177,594.249 498.51,595.249 500.5,597C503.18,601.343 506.514,605.01 510.5,608C515.429,608.609 518.929,611.109 521,615.5C526.727,619.772 531.893,624.605 536.5,630C540.356,632.515 544.356,634.848 548.5,637C556.626,643.791 564.46,650.957 572,658.5C573.9,664.876 576.567,670.876 580,676.5C582.542,685.691 581.208,694.358 576,702.5C574.697,709.231 575.53,715.564 578.5,721.5C580.688,724.522 583.355,727.022 586.5,729C601.661,737.08 616.661,745.413 631.5,754C635.572,758.435 640.072,762.269 645,765.5C645.483,766.448 645.649,767.448 645.5,768.5C644.118,767.199 642.452,766.366 640.5,766C636.23,760.891 631.23,756.725 625.5,753.5C612.634,746.903 599.967,740.069 587.5,733C581.711,729.545 576.878,725.045 573,719.5C571.537,713.89 571.537,708.223 573,702.5C577.212,693.607 578.545,684.274 577,674.5C575.333,672.833 573.667,671.167 572,669.5C569.138,665.484 566.638,661.317 564.5,657C553.606,648.137 542.606,639.47 531.5,631C525.652,624.985 519.652,619.152 513.5,613.5C509.729,610.62 505.729,608.287 501.5,606.5C498.257,607.58 494.924,607.747 491.5,607C492.99,605.228 494.657,605.061 496.5,606.5C501.384,604.331 501.384,601.998 496.5,599.5C491.181,596.84 486.181,593.674 481.5,590C477.091,584.92 472.091,580.586 466.5,577C461.5,571.333 456.5,565.667 451.5,560C441.534,551.999 430.534,550.333 418.5,555C412.357,558.643 407.357,563.476 403.5,569.5C393.705,572.653 383.705,574.986 373.5,576.5C368.755,576.118 364.088,575.284 359.5,574C354.358,570.505 348.692,568.172 342.5,567C332.269,561.776 322.269,556.109 312.5,550C301.833,545.333 291.167,540.667 280.5,536C274.879,535.388 269.379,534.221 264,532.5C259.125,532.585 254.958,534.251 251.5,537.5C251.325,535.379 251.659,533.379 252.5,531.5C255.925,530.235 259.425,529.235 263,528.5C272.382,531.045 281.882,533.545 291.5,536C302.279,541.724 313.279,546.891 324.5,551.5C329.652,556.581 335.652,560.414 342.5,563C349.827,564.911 356.827,567.577 363.5,571C367.195,571.318 370.862,571.818 374.5,572.5C383.696,571.044 392.696,568.877 401.5,566C405.644,561.168 410.311,557.002 415.5,553.5Z" style="fill:rgb(122,121,123);"/>
    </g>
    <g transform="matrix(1,0,0,1,-31.5,-156.5)">
        <path d="M251.5,561.5L251.5,571.5C247.985,586.531 243.318,601.198 237.5,615.5C231.776,621.622 227.609,628.622 225,636.5C217.82,644.63 210.653,652.63 203.5,660.5C202.292,661.234 200.959,661.567 199.5,661.5C214.729,646.391 227.229,629.058 237,609.5C242.192,593.492 247.025,577.492 251.5,561.5Z" style="fill:rgb(115,113,111);"/>
    </g>
    <g transform="matrix(1,0,0,1,-31.5,-156.5)">
        <path d="M543.5,623.5C544.552,623.351 545.552,623.517 546.5,624C549.833,627 553.167,630 556.5,633C562.011,638.678 567.345,644.511 572.5,650.5C570.692,650.509 569.025,650.009 567.5,649C559.973,640.806 552.14,632.973 544,625.5C543.536,624.906 543.369,624.239 543.5,623.5Z" style="fill:rgb(109,106,102);"/>
    </g>
    <g transform="matrix(1,0,0,1,-31.5,-156.5)">
        <path d="M140.5,619.5C142.167,620.5 143.5,621.833 144.5,623.5C142.572,626.842 141.572,630.675 141.5,635C142.035,636.872 142.035,638.538 141.5,640C143.408,643.428 144.075,646.928 143.5,650.5C146.61,654.538 149.61,658.705 152.5,663C158.374,666.353 164.707,668.853 171.5,670.5C179.073,669.108 186.406,667.108 193.5,664.5C192.4,665.605 191.733,666.938 191.5,668.5C182.154,672.634 172.487,673.467 162.5,671C159.79,669.253 156.79,668.253 153.5,668C149.333,663.167 145.167,658.333 141,653.5C139.193,648.58 137.693,643.58 136.5,638.5C139.358,632.546 140.691,626.213 140.5,619.5Z" style="fill:rgb(115,114,115);"/>
    </g>
    <g transform="matrix(1,0,0,1,-31.5,-156.5)">
        <path d="M320.5,687.5C320.59,690.152 319.924,692.485 318.5,694.5C318.41,691.848 319.076,689.515 320.5,687.5Z" style="fill:rgb(197,173,102);"/>
    </g>
    <g transform="matrix(1,0,0,1,-31.5,-156.5)">
        <path d="M496.5,599.5C501.384,601.998 501.384,604.331 496.5,606.5C494.657,605.061 492.99,605.228 491.5,607C494.924,607.747 498.257,607.58 501.5,606.5C501.631,607.376 501.298,608.043 500.5,608.5C497.285,610.274 493.952,611.774 490.5,613C479.386,621.114 469.22,630.28 460,640.5C438.408,670.176 423.075,702.176 414,736.5C410.358,751.271 408.024,766.271 407,781.5C406.798,801.517 406.298,821.517 405.5,841.5C406.178,846.814 406.678,852.148 407,857.5C409.337,861.88 410.004,866.547 409,871.5C417.978,910.437 431.311,947.77 449,983.5C458.729,998.235 468.063,1013.23 477,1028.5C484.563,1038.9 493.063,1048.57 502.5,1057.5C501.5,1057.83 500.833,1058.5 500.5,1059.5C491.899,1051.67 483.733,1043.34 476,1034.5C446.783,990.719 424.45,943.386 409,892.5C397.38,838.863 397.713,784.863 410,730.5C417.937,707.273 426.937,684.94 437,663.5C441.95,656.216 447.283,649.216 453,642.5C453.402,641.128 453.902,639.795 454.5,638.5C460.843,630.505 467.843,623.171 475.5,616.5C476.729,615.719 478.062,615.219 479.5,615C484.259,609.726 489.926,605.893 496.5,603.5C497.626,602.192 497.626,600.858 496.5,599.5Z" style="fill:rgb(94,99,105);"/>
    </g>
    <g transform="matrix(1,0,0,1,-31.5,-156.5)">
        <path d="M534.5,764.5C533.431,769.479 531.765,774.146 529.5,778.5C529.149,776.131 528.982,773.797 529,771.5C530.572,768.893 532.406,766.559 534.5,764.5Z" style="fill:rgb(120,115,110);"/>
    </g>
    <g transform="matrix(1,0,0,1,-31.5,-156.5)">
        <path d="M524.5,791.5C524.405,793.786 523.738,795.786 522.5,797.5C522.054,794.99 522.72,792.99 524.5,791.5Z" style="fill:rgb(170,165,157);"/>
    </g>
    <g transform="matrix(1,0,0,1,-31.5,-156.5)">
        <path d="M645.5,768.5C649.697,768.194 651.697,770.194 651.5,774.5C652.552,774.351 653.552,774.517 654.5,775C665.578,787.564 675.245,801.064 683.5,815.5C684.1,816.9 685.1,817.9 686.5,818.5C683.369,820.358 680.869,819.691 679,816.5C676.634,812.313 674.634,807.98 673,803.5C664.297,791.406 655.131,779.74 645.5,768.5Z" style="fill:rgb(116,116,120);"/>
    </g>
    <g transform="matrix(1,0,0,1,-31.5,-156.5)">
        <path d="M522.5,807.5C523.738,809.214 524.405,811.214 524.5,813.5C522.72,812.01 522.054,810.01 522.5,807.5Z" style="fill:rgb(230,230,233);"/>
    </g>
    <g transform="matrix(1,0,0,1,-31.5,-156.5)">
        <path d="M683.5,815.5C685.75,816.13 687.75,817.13 689.5,818.5L686.5,818.5C685.1,817.9 684.1,816.9 683.5,815.5Z" style="fill:rgb(201,177,100);"/>
    </g>
    <g transform="matrix(1,0,0,1,-31.5,-156.5)">
        <path d="M690.5,819.5C714.527,819.471 737.193,824.971 758.5,836C770.697,845.539 782.864,855.039 795,864.5C800.059,875.363 796.893,879.196 785.5,876C781.788,873.289 778.788,869.956 776.5,866C753.544,852.68 729.21,842.68 703.5,836C694.833,835.667 686.167,835.333 677.5,835C674.982,833.498 672.482,831.998 670,830.5C659.546,812.218 646.38,796.218 630.5,782.5C629.614,781.675 629.281,780.675 629.5,779.5C628.448,779.649 627.448,779.483 626.5,779C611.54,763.714 593.54,754.048 572.5,750C556.879,747.417 544.212,752.25 534.5,764.5C534.343,763.127 534.51,761.793 535,760.5C544.877,750.122 556.71,745.289 570.5,746C580.267,748.868 590.267,752.201 600.5,756C605.728,760.113 611.395,763.446 617.5,766C623.205,772.04 629.205,777.706 635.5,783C636.448,783.483 637.448,783.649 638.5,783.5C640.167,787.167 642.833,789.833 646.5,791.5C650.884,798.511 656.05,805.177 662,811.5C662.333,812.833 662.667,814.167 663,815.5C667.159,820.994 671.325,826.494 675.5,832C681.213,833.992 686.88,833.825 692.5,831.5C702.861,833.422 713.194,835.589 723.5,838C743.779,845.972 763.445,855.305 782.5,866C784.467,868.436 786.134,870.936 787.5,873.5C789.467,873.261 791.301,873.594 793,874.5C794.827,872.586 794.827,870.586 793,868.5C787.016,862.685 780.849,857.018 774.5,851.5C766.7,847.57 760.367,842.57 755.5,836.5C748.458,834.91 741.792,832.41 735.5,829C729.759,828.156 724.092,826.99 718.5,825.5C717.353,825.182 716.519,824.516 716,823.5C712.893,824.349 709.893,824.683 707,824.5C701.435,822.693 695.935,821.026 690.5,819.5Z" style="fill:rgb(117,116,118);"/>
    </g>
    <g transform="matrix(1,0,0,1,-31.5,-156.5)">
        <path d="M322.5,573.5C323.833,573.833 325.167,574.167 326.5,574.5C329.167,578.082 332.5,581.082 336.5,583.5C347.061,591.088 354.727,601.088 359.5,613.5C349.864,629.773 341.031,646.44 333,663.5C323.795,685.783 316.295,708.283 310.5,731C311.022,731.561 311.355,732.228 311.5,733C310.167,738.664 308.834,744.331 307.5,750C308.969,752.307 308.636,754.141 306.5,755.5C305.643,770.62 304.643,785.453 303.5,800C305.035,811.729 305.702,823.563 305.5,835.5C304.448,835.351 303.448,835.517 302.5,836C294.204,846.095 287.037,856.928 281,868.5C279.667,869.833 278.333,871.167 277,872.5C267.818,888.882 260.151,905.882 254,923.5C247,950.818 245.167,978.484 248.5,1006.5C246.909,1002.8 246.076,998.796 246,994.5C245.588,979.427 245.421,964.427 245.5,949.5C247.255,943.64 248.422,937.64 249,931.5C255.145,912.306 262.812,893.64 272,875.5C276.721,869.779 281.054,863.779 285,857.5C286.667,854.167 288.333,850.833 290,847.5C294.177,842.46 298.344,837.46 302.5,832.5C302.771,814.372 302.771,796.372 302.5,778.5C302.298,775.361 301.631,772.361 300.5,769.5C302.388,767.012 303.055,764.012 302.5,760.5C304.281,749.538 306.115,738.538 308,727.5C310.904,715.826 314.404,704.826 318.5,694.5C319.924,692.485 320.59,690.152 320.5,687.5C322.843,682.05 324.676,676.384 326,670.5C328.809,665.09 331.809,659.757 335,654.5C337.914,643.354 343.247,633.688 351,625.5C352.248,621.35 353.748,617.35 355.5,613.5C353.833,609.5 352.167,605.5 350.5,601.5C342.108,591.94 332.942,583.273 323,575.5C322.536,574.906 322.369,574.239 322.5,573.5Z" style="fill:rgb(118,117,118);"/>
    </g>
    <g transform="matrix(1,0,0,1,-31.5,-156.5)">
        <path d="M567.5,874.5C565.672,873.206 563.672,872.206 561.5,871.5C559.816,866.974 556.816,863.474 552.5,861C546.825,859.322 541.159,857.822 535.5,856.5C530.684,858.101 526.351,860.434 522.5,863.5C524.407,859.765 527.407,857.265 531.5,856C547.929,853.915 559.929,860.082 567.5,874.5Z" style="fill:rgb(105,103,100);"/>
    </g>
    <g transform="matrix(1,0,0,1,-31.5,-156.5)">
        <path d="M571.5,857.5C572.552,857.351 573.552,857.517 574.5,858C575.665,859.992 576.998,861.825 578.5,863.5C575.527,862.19 573.193,860.19 571.5,857.5Z" style="fill:rgb(113,108,105);"/>
    </g>
    <g transform="matrix(1,0,0,1,-31.5,-156.5)">
        <path d="M578.5,863.5C580.543,864.579 581.876,866.246 582.5,868.5C580.003,867.871 578.67,866.204 578.5,863.5Z" style="fill:rgb(118,115,110);"/>
    </g>
    <g transform="matrix(1,0,0,1,-31.5,-156.5)">
        <path d="M582.5,868.5C589.543,876.231 595.209,884.898 599.5,894.5C598.279,893.972 597.113,893.305 596,892.5C593.591,887.763 591.091,883.096 588.5,878.5C585.209,875.89 583.209,872.556 582.5,868.5Z" style="fill:rgb(108,109,113);"/>
    </g>
    <g transform="matrix(1,0,0,1,-31.5,-156.5)">
        <path d="M599.5,894.5C603.173,897.517 606.173,901.183 608.5,905.5C606.61,905.703 605.11,905.037 604,903.5C602.192,900.562 600.692,897.562 599.5,894.5Z" style="fill:rgb(114,115,119);"/>
    </g>
    <g transform="matrix(1,0,0,1,-31.5,-156.5)">
        <path d="M567.5,874.5C570.102,875.932 572.269,877.932 574,880.5C578.182,886.199 581.848,892.199 585,898.5C586.667,900.167 588.333,901.833 590,903.5C592.107,908.72 593.94,914.053 595.5,919.5C588.274,904.73 579.274,891.063 568.5,878.5C567.754,877.264 567.421,875.93 567.5,874.5Z" style="fill:rgb(113,111,109);"/>
    </g>
    <g transform="matrix(1,0,0,1,-31.5,-156.5)">
        <path d="M282.5,901.5C282.33,904.204 280.997,905.871 278.5,906.5C279.038,904.883 279.371,903.216 279.5,901.5L282.5,901.5Z" style="fill:rgb(106,104,102);"/>
    </g>
    <g transform="matrix(1,0,0,1,-31.5,-156.5)">
        <path d="M323.5,918.5C322.345,912.514 318.678,909.014 312.5,908C303.697,900.273 293.697,898.106 282.5,901.5C283.343,899.827 284.676,898.66 286.5,898C297.096,895.646 306.096,898.313 313.5,906C320.489,907.11 323.822,911.276 323.5,918.5Z" style="fill:rgb(103,106,107);"/>
    </g>
    <g transform="matrix(1,0,0,1,-31.5,-156.5)">
        <path d="M522.5,863.5C521.425,865.157 520.758,866.991 520.5,869C528.449,898.305 536.616,927.472 545,956.5C547.449,976.279 546.782,995.946 543,1015.5C542.617,1016.06 542.117,1016.39 541.5,1016.5C542.664,1005.02 543.664,993.521 544.5,982C544.071,974.495 543.571,966.995 543,959.5C538.02,942.09 532.853,924.756 527.5,907.5C527.709,906.914 528.043,906.414 528.5,906C521.868,892.604 518.868,878.437 519.5,863.5L522.5,863.5Z" style="fill:rgb(107,106,108);"/>
    </g>
    <g transform="matrix(1,0,0,1,-31.5,-156.5)">
        <path d="M596.5,921.5C598.124,921.36 599.29,922.027 600,923.5C602.749,929.58 604.583,935.913 605.5,942.5C602.23,935.625 599.23,928.625 596.5,921.5Z" style="fill:rgb(111,109,108);"/>
    </g>
    <g transform="matrix(1,0,0,1,-31.5,-156.5)">
        <path d="M608.5,907.5C611.645,911.811 614.478,916.478 617,921.5C621.823,933.145 626.489,944.812 631,956.5C634.17,959.017 637.003,961.85 639.5,965C644.84,966.206 648.84,969.039 651.5,973.5C646.203,970.096 640.536,967.096 634.5,964.5C633.167,962.5 631.5,960.833 629.5,959.5C628.694,956.554 627.361,953.888 625.5,951.5C621.768,937.97 616.101,925.304 608.5,913.5C608.92,911.674 608.92,909.674 608.5,907.5Z" style="fill:rgb(124,125,128);"/>
    </g>
    <g transform="matrix(1,0,0,1,-31.5,-156.5)">
        <path d="M330.5,934.5C333.736,941.988 336.736,949.655 339.5,957.5C335.141,950.433 332.141,942.766 330.5,934.5Z" style="fill:rgb(100,99,97);"/>
    </g>
    <g transform="matrix(1,0,0,1,-31.5,-156.5)">
        <path d="M605.5,942.5C606.85,943.483 607.85,944.816 608.5,946.5C610.507,952.511 612.507,958.511 614.5,964.5C613.542,964.047 612.708,963.381 612,962.5C610.111,955.667 607.944,949 605.5,942.5Z" style="fill:rgb(119,118,118);"/>
    </g>
    <g transform="matrix(1,0,0,1,-31.5,-156.5)">
        <path d="M341.5,961.5C345.387,964.272 348.054,967.939 349.5,972.5C347.366,970.314 345.199,967.981 343,965.5C342.209,964.255 341.709,962.922 341.5,961.5Z" style="fill:rgb(89,89,90);"/>
    </g>
    <g transform="matrix(1,0,0,1,-31.5,-156.5)">
        <path d="M617.5,969.5C620.878,968.891 622.878,970.224 623.5,973.5C621.147,972.66 619.147,971.326 617.5,969.5Z" style="fill:rgb(121,119,115);"/>
    </g>
    <g transform="matrix(1,0,0,1,-31.5,-156.5)">
        <path d="M278.5,906.5C275.864,915.093 272.698,923.426 269,931.5C262.653,952.083 260.987,973.083 264,994.5C266.342,1003.03 269.176,1011.36 272.5,1019.5C267.472,1011.92 263.972,1003.59 262,994.5C261.794,988.723 260.961,983.056 259.5,977.5C259.668,953.114 265.168,930.114 276,908.5C276.708,907.619 277.542,906.953 278.5,906.5Z" style="fill:rgb(105,104,104);"/>
    </g>
    <g transform="matrix(1,0,0,1,-31.5,-156.5)">
        <path d="M623.5,973.5C626.682,973.584 629.015,974.917 630.5,977.5C627.594,976.892 625.26,975.559 623.5,973.5Z" style="fill:rgb(115,113,110);"/>
    </g>
    <g transform="matrix(1,0,0,1,-31.5,-156.5)">
        <path d="M349.5,972.5C352.258,975.678 354.258,979.345 355.5,983.5C352.377,980.482 350.377,976.816 349.5,972.5Z" style="fill:rgb(101,101,98);"/>
    </g>
    <g transform="matrix(1,0,0,1,-31.5,-156.5)">
        <path d="M355.5,983.5C357.587,984.585 358.92,986.251 359.5,988.5C356.703,988.033 355.369,986.367 355.5,983.5Z" style="fill:rgb(106,103,100);"/>
    </g>
    <g transform="matrix(1,0,0,1,-31.5,-156.5)">
        <path d="M641.5,983.5C646.694,986.511 652.027,989.344 657.5,992C658.305,993.113 658.972,994.279 659.5,995.5C652.813,992.493 646.813,988.493 641.5,983.5Z" style="fill:rgb(114,113,112);"/>
    </g>
    <g transform="matrix(1,0,0,1,-31.5,-156.5)">
        <path d="M652.5,973.5C661.134,977.659 669.134,982.826 676.5,989C679.807,990.284 683.141,991.617 686.5,993C703.652,1004.23 722.318,1012.23 742.5,1017C743.551,1018.38 744.884,1019.38 746.5,1020C753.19,1021.9 759.857,1023.57 766.5,1025C770.738,1027.17 771.572,1030.34 769,1034.5C767.207,1035.97 765.207,1036.97 763,1037.5C741.028,1036.17 720.194,1030.67 700.5,1021C690.742,1015.86 681.075,1010.52 671.5,1005C668.308,1002.97 665.641,1000.47 663.5,997.5C671.806,1003.12 680.472,1008.29 689.5,1013C701.749,1019.23 714.416,1024.56 727.5,1029C731.305,1029.53 734.971,1030.53 738.5,1032C747.093,1032.95 755.593,1033.45 764,1033.5C766.176,1032.48 767.343,1030.82 767.5,1028.5C760.046,1026.22 752.713,1024.38 745.5,1023C737.613,1017.75 728.946,1014.42 719.5,1013C712.811,1010.24 706.311,1007.07 700,1003.5C699.667,1003.83 699.333,1004.17 699,1004.5C694.252,1001.21 689.419,998.042 684.5,995C677.431,992.988 671.431,989.322 666.5,984C660.48,982.127 655.814,978.627 652.5,973.5Z" style="fill:rgb(113,112,112);"/>
    </g>
    <g transform="matrix(1,0,0,1,-31.5,-156.5)">
        <path d="M252.5,1023.5C247.487,1026.06 242.154,1028.06 236.5,1029.5C235.914,1029.29 235.414,1028.96 235,1028.5C223.124,1033.51 210.957,1036.35 198.5,1037C174.752,1044.01 150.419,1047.01 125.5,1046C124.619,1045.29 123.953,1044.46 123.5,1043.5C134.204,1043 145.204,1042.83 156.5,1043C175.83,1039.67 195.164,1036.33 214.5,1033C226.934,1029.09 239.601,1025.92 252.5,1023.5Z" style="fill:rgb(114,114,114);"/>
    </g>
    <g transform="matrix(1,0,0,1,-31.5,-156.5)">
        <path d="M539.5,1021.5C537.187,1029.13 534.02,1036.47 530,1043.5C527.963,1045.71 525.797,1047.71 523.5,1049.5C525.423,1046.4 527.59,1043.4 530,1040.5C533.213,1034.07 536.379,1027.74 539.5,1021.5Z" style="fill:rgb(90,89,91);"/>
    </g>
    <g transform="matrix(1,0,0,1,-31.5,-156.5)">
        <path d="M523.5,1049.5C520.35,1053.1 516.684,1056.27 512.5,1059C511.552,1059.48 510.552,1059.65 509.5,1059.5C512.724,1056.76 516.058,1053.92 519.5,1051C520.745,1050.21 522.078,1049.71 523.5,1049.5Z" style="fill:rgb(100,98,98);"/>
    </g>
    <g transform="matrix(1,0,0,1,-31.5,-156.5)">
        <path d="M272.5,1019.5C276.533,1021.09 277.533,1023.92 275.5,1028C272.793,1030.69 269.793,1033.02 266.5,1035C240.07,1044.86 213.07,1052.53 185.5,1058C163.489,1057.54 141.822,1057.54 120.5,1058C116.328,1057.51 112.828,1055.67 110,1052.5C110.145,1049.49 110.645,1046.49 111.5,1043.5C114.71,1043.25 117.71,1043.25 120.5,1043.5C118.701,1046.31 116.034,1047.64 112.5,1047.5C112.286,1049.14 112.62,1050.64 113.5,1052C116.244,1052.8 118.911,1053.8 121.5,1055C144.521,1055.84 167.521,1055.51 190.5,1054C207.592,1050.28 224.592,1046.28 241.5,1042C244.131,1040.67 246.798,1039.34 249.5,1038C258.644,1036.84 266.477,1033.01 273,1026.5C273.018,1024.2 272.851,1021.87 272.5,1019.5Z" style="fill:rgb(122,123,123);"/>
    </g>
    <g transform="matrix(1,0,0,1,-31.5,-156.5)">
        <path d="M359.5,988.5C367.421,999.083 375.255,1009.75 383,1020.5C388.264,1026.77 394.431,1031.93 401.5,1036C418.688,1044.32 436.021,1051.48 453.5,1057.5C457.412,1059.62 461.412,1060.29 465.5,1059.5C472.655,1060.9 479.821,1062.23 487,1063.5C490.481,1062.88 493.981,1062.38 497.5,1062C499.119,1061.76 500.119,1060.93 500.5,1059.5C500.833,1058.5 501.5,1057.83 502.5,1057.5C503.815,1058.48 505.148,1059.48 506.5,1060.5C507.417,1059.87 508.417,1059.54 509.5,1059.5C509.423,1060.75 508.756,1061.58 507.5,1062C498.035,1065.03 488.368,1066.03 478.5,1065C467.697,1063.65 457.03,1061.65 446.5,1059C431.397,1053.2 416.564,1046.7 402,1039.5C397.495,1036.33 392.995,1033.16 388.5,1030C382.75,1024.34 377.583,1018.17 373,1011.5C369.496,1005.16 365.496,999.156 361,993.5C359.991,991.975 359.491,990.308 359.5,988.5Z" style="fill:rgb(111,110,112);"/>
    </g>
</svg>
