id	screenId	description
bibi_1	bibi_iB_06455	abdominal odoriferous glands colorless secretion
bibi_2	bibi_iB_06635	abdominal odoriferous glands size decrease
bibi_3	bibi_iB_07379	abdominal odoriferous glands less secretion
bibi_4	bibi_iB_07536	abdominal odoriferous glands secretion color darker
bibi_5	bibi_iB_07738	abdominal odoriferous glands size decrease
bibi_6	bibi_iB_07787	abdominal odoriferous glands irregular reservoir size
bibi_7	bibi_iB_07820	abdominal odoriferous glands melanized gland content
bibi_8	bibi_iB_07886	abdominal odoriferous glands irregular reservoir size
bibi_9	bibi_iB_07950	abdominal odoriferous glands secretion color darker
bibi_10	bibi_iB_07976	abdominal odoriferous glands secretion color lighter
bibi_11	bibi_iB_08057	abdominal odoriferous glands less secretion
bibi_12	bibi_iB_08160	abdominal odoriferous glands secretion color darker
bibi_13	bibi_iB_08263	abdominal odoriferous glands size decrease
bibi_14	bibi_iB_08565	abdominal odoriferous glands less secretion
bibi_15	bibi_iB_08572	abdominal odoriferous glands secretion color lighter
bibi_16	bibi_iB_08877	abdominal odoriferous glands less secretion
bibi_17	bibi_iB_09271	abdominal odoriferous glands size decrease
bibi_18	bibi_iB_10094	abdominal odoriferous glands irregular reservoir size
bibi_19	bibi_iB_10258	abdominal odoriferous glands secretion color darker
bibi_20	bibi_iB_10282	abdominal odoriferous glands irregular reservoir size
bibi_21	bibi_iB_10307	abdominal odoriferous glands less secretion
bibi_22	bibi_iB_10350	abdominal odoriferous glands size decrease
bibi_23	bibi_iB_10379	abdominal odoriferous glands less secretion
bibi_24	bibi_iB_10398	abdominal odoriferous glands size decrease
bibi_25	bibi_iB_10399	abdominal odoriferous glands size decrease
bibi_26	bibi_iB_10410	abdominal odoriferous glands less secretion
bibi_27	bibi_iB_10416	abdominal odoriferous glands less secretion
bibi_28	bibi_iB_10636	abdominal odoriferous glands less secretion
bibi_29	bibi_iB_10818	abdominal odoriferous glands less secretion
bibi_30	bibi_iB_10843	abdominal odoriferous glands less secretion
bibi_31	bibi_iB_12106	abdominal odoriferous glands less secretion
bibi_32	bibi_iB_12119	abdominal odoriferous glands less secretion
bibi_33	bibi_iB_12122	abdominal odoriferous glands less secretion
bibi_34	bibi_iB_12143	abdominal odoriferous glands secretion color lighter
bibi_35	bibi_iB_12151	abdominal odoriferous glands less secretion
bibi_36	bibi_iB_12159	abdominal odoriferous glands less secretion
bibi_37	bibi_iB_12160	abdominal odoriferous glands less secretion
bibi_38	bibi_iB_12164	abdominal odoriferous glands size decreae
bibi_39	bibi_iB_12171	abdominal odoriferous glands less secretion
bibi_40	bibi_iB_12179	abdominal odoriferous glands less secretion
bibi_41	bibi_iB_12227	abdominal odoriferous glands size decrease
bibi_42	bibi_iB_12410	abdominal odoriferous glands size decrease
bibi_43	bibi_iB_12420	abdominal odoriferous glands secretion color darker
bibi_44	bibi_iB_12424	abdominal odoriferous glands colorless secretion
bibi_45	bibi_iB_12502	abdominal odoriferous glands secretion color darker
bibi_46	bibi_iB_12548	abdominal odoriferous glands secretion color darker
bibi_47	bibi_iB_12567	abdominal odoriferous glands less secretion
bibi_48	bibi_iB_12594	abdominal odoriferous glands irregular reservoir size
bibi_49	bibi_iB_12808	abdominal odoriferous glands less secretion
bibi_50	bibi_iB_12904	abdominal odoriferous glands less secretion
bibi_51	bibi_iB_12930	abdominal odoriferous glands size decrease
bibi_52	bibi_iB_12934	abdominal odoriferous glands less secretion
bibi_53	bibi_iB_12946	abdominal odoriferous glands secretion color darker
bibi_54	bibi_iB_12953	abdominal odoriferous glands secretion color lighter
bibi_55	bibi_iB_12957	abdominal odoriferous glands less secretion
bibi_56	bibi_iB_12988	abdominal odoriferous glands irregular reservoir size
bibi_57	bibi_iB_12995	abdominal odoriferous glands secretion color darker
bibi_58	bibi_iB_12998	abdominal odoriferous glands less secretion
bibi_59	bibi_iB_13213	abdominal odoriferous glands less secretion
bibi_60	bibi_iB_13267	abdominal odoriferous glands size decrease
bibi_61	bibi_iB_13286	abdominal odoriferous glands less secretion
bibi_62	bibi_iB_13287	abdominal odoriferous glands size decrease
bibi_63	bibi_iB_13384	abdominal odoriferous glands less secretion
bibi_64	bibi_iB_13393	abdominal odoriferous glands less secretion
bibi_65	bibi_iB_13397	abdominal odoriferous glands size decrease
bibi_66	bibi_iB_13400	abdominal odoriferous glands secretion color lighter
bibi_67	bibi_iB_13404	abdominal odoriferous glands size decrease
bibi_68	bibi_iB_13418	abdominal odoriferous glands size decrease
bibi_69	bibi_iB_13420	abdominal odoriferous glands size decrease
bibi_70	bibi_iB_13427	abdominal odoriferous glands less secretion
bibi_71	bibi_iB_13436	abdominal odoriferous glands less secretion
bibi_72	bibi_iB_13442	abdominal odoriferous glands size decrease
bibi_73	bibi_iB_13443	abdominal odoriferous glands size decrease
bibi_74	bibi_iB_13444	abdominal odoriferous glands size decrease
bibi_75	bibi_iB_13446	abdominal odoriferous glands size decrease
bibi_76	bibi_iB_13447	abdominal odoriferous glands less secretion
bibi_77	bibi_iB_13455	abdominal odoriferous glands size decrease
bibi_78	bibi_iB_13462	abdominal odoriferous glands less secretion
bibi_79	bibi_iB_13470	abdominal odoriferous glands less secretion
bibi_80	bibi_iB_13474	abdominal odoriferous glands size decrease
bibi_81	bibi_iB_13476	abdominal odoriferous glands secretion color lighter
bibi_82	bibi_iB_13479	abdominal odoriferous glands less secretion
bibi_83	bibi_iB_13480	abdominal odoriferous glands irregular reservoir size
bibi_84	bibi_iB_13481	abdominal odoriferous glands secretion color darker
bibi_85	bibi_iB_13490	abdominal odoriferous glands less secretion
bibi_86	bibi_iB_13492	abdominal odoriferous glands less secretion
bibi_87	bibi_iB_13507	abdominal odoriferous glands size decrease
bibi_88	bibi_iB_13520	abdominal odoriferous glands secretion color lighter
bibi_89	bibi_iB_13523	abdominal odoriferous glands irregular reservoir size
bibi_90	bibi_iB_13525	abdominal odoriferous glands less secretion
bibi_91	bibi_iB_13527	abdominal odoriferous glands size decrease
bibi_92	bibi_iB_13531	abdominal odoriferous glands size decrease
bibi_93	bibi_iB_13538	abdominal odoriferous glands size decrease
bibi_94	bibi_iB_13539	abdominal odoriferous glands less secretion
bibi_95	bibi_iB_13541	abdominal odoriferous glands less secretion
bibi_96	bibi_iB_13546	abdominal odoriferous glands size decrease
bibi_97	bibi_iB_13550	abdominal odoriferous glands less secretion
bibi_98	bibi_iB_13552	abdominal odoriferous glands size decrease
bibi_99	bibi_iB_13556	abdominal odoriferous glands secretion color darker
bibi_100	bibi_iB_13558	abdominal odoriferous glands less secretion
bibi_101	bibi_iB_13560	abdominal odoriferous glands secretion color darker
bibi_102	bibi_iB_13565	abdominal odoriferous glands less secretion
bibi_103	bibi_iB_13568	abdominal odoriferous glands melanized gland content
bibi_104	bibi_iB_13576	abdominal odoriferous glands less secretion
bibi_105	bibi_iB_13578	abdominal odoriferous glands size decrease
bibi_106	bibi_iB_13585	abdominal odoriferous glands irregular reservoir size
bibi_107	bibi_iB_13602	abdominal odoriferous glands secretion color lighter
bibi_108	bibi_iB_13614	abdominal odoriferous glands less secretion
bibi_109	bibi_iB_13619	abdominal odoriferous glands less secretion
bibi_110	bibi_iB_13626	abdominal odoriferous glands less secretion
bibi_111	bibi_iB_13628	abdominal odoriferous glands secretion color darker
bibi_112	bibi_iB_13639	abdominal odoriferous glands irregular reservoir size
bibi_113	bibi_iB_13656	abdominal odoriferous glands less secretion
bibi_114	bibi_iB_13660	abdominal odoriferous glands secretion color darker
bibi_115	bibi_iB_13667	abdominal odoriferous glands less secretion
bibi_116	bibi_iB_13673	abdominal odoriferous glands less secretion
bibi_117	bibi_iB_13677	abdominal odoriferous glands less secretion
bibi_118	bibi_iB_13680	abdominal odoriferous glands less secretion
bibi_119	bibi_iB_13692	abdominal odoriferous glands less secretion
bibi_120	bibi_iB_13694	abdominal odoriferous glands irregular reservoir size
bibi_121	bibi_iB_13698	abdominal odoriferous glands less secretion
bibi_122	bibi_iB_13701	abdominal odoriferous glands secretion color darker
bibi_123	bibi_iB_13704	abdominal odoriferous glands size decrease
bibi_124	bibi_iB_13707	abdominal odoriferous glands size decrease
bibi_125	bibi_iB_13712	abdominal odoriferous glands less secretion
bibi_126	bibi_iB_13723	abdominal odoriferous glands size decraese
bibi_127	bibi_iB_13730	abdominal odoriferous glands less secretion
bibi_128	bibi_iB_13736	abdominal odoriferous glands less secretion
bibi_129	bibi_iB_13739	abdominal odoriferous glands irregular reservoir size
bibi_130	bibi_iB_13754	abdominal odoriferous glands less secretion
bibi_131	bibi_iB_13761	abdominal odoriferous glands less secretion
bibi_132	bibi_iB_13815	abdominal odoriferous glands size decrease
bibi_133	bibi_iB_13821	abdominal odoriferous glands size decrease
bibi_134	bibi_iB_14407	abdominal odoriferous glands melanized gland content
bibi_135	bibi_iB_14666	abdominal odoriferous glands melanized gland content
bibi_136	bibi_iB_14689	abdominal odoriferous glands melanized gland content
bibi_137	bibi_iB_14948	abdominal odoriferous glands less secretion
bibi_138	bibi_iB_14954	abdominal odoriferous glands size decrease
bibi_139	bibi_iB_14977	abdominal odoriferous glands less secretion
bibi_140	bibi_iB_15009	abdominal odoriferous glands size decrease
bibi_141	bibi_iB_15044	abdominal odoriferous glands less secretion
bibi_142	bibi_iB_15047	abdominal odoriferous glands less secretion
bibi_143	bibi_iB_15051	abdominal odoriferous glands less secretion
bibi_144	bibi_iB_15097	abdominal odoriferous glands secretion color darker
bibi_145	bibi_iB_15098	abdominal odoriferous glands less secretion
bibi_146	bibi_iB_15099	abdominal odoriferous glands less secretion
bibi_147	bibi_iB_15103	abdominal odoriferous glands size decrease
bibi_148	bibi_iB_15108	abdominal odoriferous glands secretion color darker
bibi_149	bibi_iB_15160	abdominal odoriferous glands less secretion
bibi_150	bibi_iB_15169	abdominal odoriferous glands less secretion
bibi_151	bibi_iB_15175	abdominal odoriferous glands size decrease
bibi_152	bibi_iB_15179	abdominal odoriferous glands size decrease
bibi_153	bibi_iB_15181	abdominal odoriferous glands secretion color lighter
bibi_154	bibi_iB_15193	abdominal odoriferous glands size decrease
bibi_155	bibi_iB_15264	abdominal odoriferous glands size decrease
bibi_156	bibi_iB_15303	abdominal odoriferous glands less secretion
bibi_157	bibi_iB_15413	abdominal odoriferous glands less secretion
bibi_158	bibi_iB_15423	abdominal odoriferous glands size decrease
bibi_159	bibi_iB_15460	abdominal odoriferous glands size decrease
bibi_160	bibi_iB_15474	abdominal odoriferous glands less secretion
bibi_161	bibi_iB_15476	abdominal odoriferous glands less secretion
bibi_162	bibi_iB_15482	abdominal odoriferous glands less secretion
bibi_163	bibi_iB_15490	abdominal odoriferous glands less secretion
bibi_164	bibi_iB_15493	abdominal odoriferous glands less secretion
bibi_165	bibi_iB_15516	abdominal odoriferous glands melanized gland content
bibi_166	bibi_iB_15531	abdominal odoriferous glands less secretion
bibi_167	bibi_iB_15626	abdominal odoriferous glands melanized gland content
bibi_168	bibi_iB_15646	abdominal odoriferous glands melanized gland content
bibi_169	bibi_iB_15676	abdominal odoriferous glands less secretion
bibi_170	bibi_iB_15744	abdominal odoriferous glands less secretion
bibi_171	bibi_iB_15758	abdominal odoriferous glands secretion color lighter
bibi_172	bibi_iB_15780	abdominal odoriferous glands less secretion
bibi_173	bibi_iB_15798	abdominal odoriferous glands secretion color lighter
bibi_174	bibi_iB_15842	abdominal odoriferous glands secretion color darker
bibi_175	bibi_iB_15862	abdominal odoriferous glands secretion color darker
bibi_176	bibi_iB_15886	abdominal odoriferous glands secretion color darker
bibi_177	bibi_iB_15894	abdominal odoriferous glands secretion color darker
bibi_178	bibi_iB_15895	abdominal odoriferous glands secretion color darker
