observationId	imageId
bibi_1	bibi_iB_06455
bibi_2	bibi_iB_06635
bibi_3	bibi_iB_07379
bibi_4	bibi_iB_07536
bibi_5	bibi_iB_07738
bibi_6	bibi_iB_07787
bibi_7	bibi_iB_07820
bibi_8	bibi_iB_07886
bibi_9	bibi_iB_07950
bibi_10	bibi_iB_07976
bibi_11	bibi_iB_08057
bibi_12	bibi_iB_08160
bibi_13	bibi_iB_08263
bibi_14	bibi_iB_08565
bibi_15	bibi_iB_08572
bibi_16	bibi_iB_08877
bibi_17	bibi_iB_09271
bibi_18	bibi_iB_10094
bibi_19	bibi_iB_10258
bibi_20	bibi_iB_10282
bibi_21	bibi_iB_10307
bibi_22	bibi_iB_10350
bibi_24	bibi_iB_10398
bibi_25	bibi_iB_10399
bibi_26	bibi_iB_10410
bibi_27	bibi_iB_10416
bibi_29	bibi_iB_10818
bibi_30	bibi_iB_10843
bibi_31	bibi_iB_12106
bibi_33	bibi_iB_12122
bibi_34	bibi_iB_12143
bibi_35	bibi_iB_12151
bibi_36	bibi_iB_12159
bibi_37	bibi_iB_12160
bibi_38	bibi_iB_12164
bibi_39	bibi_iB_12171
bibi_40	bibi_iB_12179
bibi_41	bibi_iB_12227
bibi_42	bibi_iB_12410
bibi_42	bibi_iB_12410_2
bibi_44	bibi_iB_12424
bibi_45	bibi_iB_12502
bibi_46	bibi_iB_12548
bibi_47	bibi_iB_12567
bibi_48	bibi_iB_12594
bibi_49	bibi_iB_12808
bibi_50	bibi_iB_12904
bibi_51	bibi_iB_12930
bibi_52	bibi_iB_12934
bibi_53	bibi_iB_12946
bibi_54	bibi_iB_12953
bibi_55	bibi_iB_12957
bibi_56	bibi_iB_12988
bibi_57	bibi_iB_12995
bibi_58	bibi_iB_12998
bibi_60	bibi_iB_13267
bibi_61	bibi_iB_13286
bibi_62	bibi_iB_13287
bibi_63	bibi_iB_13384
bibi_64	bibi_iB_13393
bibi_65	bibi_iB_13397
bibi_66	bibi_iB_13400
bibi_67	bibi_iB_13404
bibi_68	bibi_iB_13418
bibi_69	bibi_iB_13420
bibi_70	bibi_iB_13427
bibi_71	bibi_iB_13436
bibi_72	bibi_iB_13442
bibi_73	bibi_iB_13443
bibi_74	bibi_iB_13444
bibi_75	bibi_iB_13446
bibi_76	bibi_iB_13447
bibi_77	bibi_iB_13455
bibi_78	bibi_iB_13462
bibi_79	bibi_iB_13470
bibi_80	bibi_iB_13474
bibi_81	bibi_iB_13476
bibi_82	bibi_iB_13479
bibi_83	bibi_iB_13480
bibi_84	bibi_iB_13481
bibi_85	bibi_iB_13490
bibi_86	bibi_iB_13492
bibi_87	bibi_iB_13507
bibi_88	bibi_iB_13520
bibi_89	bibi_iB_13523
bibi_90	bibi_iB_13525
bibi_91	bibi_iB_13527
bibi_92	bibi_iB_13531
bibi_93	bibi_iB_13538
bibi_94	bibi_iB_13539
bibi_95	bibi_iB_13541
bibi_96	bibi_iB_13546
bibi_97	bibi_iB_13550
bibi_98	bibi_iB_13552
bibi_99	bibi_iB_13556
bibi_100	bibi_iB_13558
bibi_101	bibi_iB_13560
bibi_102	bibi_iB_13565
bibi_103	bibi_iB_13568
bibi_104	bibi_iB_13576
bibi_105	bibi_iB_13578
bibi_106	bibi_iB_13585
bibi_107	bibi_iB_13602
bibi_108	bibi_iB_13614
bibi_109	bibi_iB_13619
bibi_110	bibi_iB_13626
bibi_111	bibi_iB_13628
bibi_112	bibi_iB_13639
bibi_113	bibi_iB_13656
bibi_114	bibi_iB_13660
bibi_115	bibi_iB_13667
bibi_116	bibi_iB_13673
bibi_117	bibi_iB_13677
bibi_118	bibi_iB_13680
bibi_119	bibi_iB_13692
bibi_120	bibi_iB_13694
bibi_121	bibi_iB_13698
bibi_122	bibi_iB_13701
bibi_123	bibi_iB_13704
bibi_124	bibi_iB_13707
bibi_125	bibi_iB_13712
bibi_126	bibi_iB_13723
bibi_127	bibi_iB_13730
bibi_128	bibi_iB_13736
bibi_129	bibi_iB_13739
bibi_130	bibi_iB_13754
bibi_131	bibi_iB_13761
bibi_132	bibi_iB_13815
bibi_132	bibi_iB_13815_2
bibi_133	bibi_iB_13821
bibi_137	bibi_iB_14948
bibi_138	bibi_iB_14954
bibi_142	bibi_iB_15047
bibi_144	bibi_iB_15097
bibi_146	bibi_iB_15099
bibi_147	bibi_iB_15103
bibi_151	bibi_iB_15175
bibi_155	bibi_iB_15264
bibi_165	bibi_iB_15516
bibi_167	bibi_iB_15626
bibi_168	bibi_iB_15646
bibi_172	bibi_iB_15780
