attr1	attr2	count(*)
egg without cuticle	NULL	613
cuticle remnants	NULL	217
follicular epithelium	NULL	13
prothorax musculature	NULL	3
vertex triplet	vertex triplet anterior	3
terminus musculature	NULL	1
bell row	NULL	4
vertex	vertex triplet anterior	1
gena triplet	gena triplet anterior	1
serosa	NULL	2
embryonic tissue	NULL	3
half ovary	NULL	1
vertex	posterior labrum bristle	1
labrum	vertex triplet anterior	2
labrum	anterior labrum bristle	1
