<?xml version="1.0" encoding="UTF-8"?>
<svg id="Ebene_1" data-name="Ebene 1" xmlns="http://www.w3.org/2000/svg" viewBox="0 0 200 200">
  <defs>
    <style>
      .cls-1 {
        fill: #f96;
      }

      .cls-2 {
        fill: #6b5086;
      }

      .cls-2, .cls-3, .cls-4 {
        stroke: #29332b;
        stroke-miterlimit: 10;
        stroke-width: .5px;
      }

      .cls-3 {
        fill: #73b7bf;
      }

      .cls-4 {
        fill: #a4c25e;
      }
    </style>
  </defs>
  <path class="cls-1" d="m141,32.2c13.5,4.6,26.8,12.8,31.1,24.7,4.3,11.9-.4,27.5-3.4,41.4-2.9,13.9-4.2,26.1-8.4,38.1-4.2,12.1-11.3,24-21.9,29-10.5,5-24.5,3.1-38.9,3.9-14.3.7-29.2,4.3-39.2-1-10-5.3-15.3-19.4-24-32.3-8.7-12.8-20.8-24.4-21.7-36.5s9.5-24.7,17.5-38.8c8-14,13.6-29.6,24.5-35.7,10.9-6.1,27.2-2.7,42.1-.5,15,2.2,28.8,3.2,42.3,7.7Z"/>
  <g>
    <path class="cls-4" d="m106.24,116.2c-2.28,2.14-5.57,2.84-11.52,1.81-1.03-.18-1.5-1.11-1.36-1.93.18-1.03,1.11-1.5,1.93-1.36,4.93.86,7.53.46,8.92-1.41l2.04,2.89Z"/>
    <path class="cls-4" d="m121.2,88.55c1.07-1.29,2.89-2.04,4.85-2.33,3.05-.53,6.68.53,6.9,2.89.06.86.81,1.41,1.67,1.35s1.41-.81,1.35-1.67c-.69-4.56-5.71-6.07-10.28-5.38-2.37.22-4.43,1.13-5.7,2.39-.52.54-1.04,1.09-1.35,1.67l2.56,1.08Z"/>
    <path class="cls-4" d="m140.09,111.3c.65-.1,1.1-.23,1.34-.4s.52-.54.79-.92c.28-.38.38-.99.8-2.19.38-.99.53-1.81.6-2.22.04-.21-.13-.45-.1-.65-.24.17-.28.38-.52.54s-.86.06-1.96.29c-.21-.04-.65.1-1.27,0-.86.06-1.27,0-1.27,0-.41-.07-2.37.22-5.62.72-.65.1-.89.27-1.13.44-.45.13-.96.68-1.55,1.63-.55.75-.94,1.74-1.08,2.56l-.29,1.64c.04-.21.28-.38.52-.54.45-.13,1.13-.44,2.2-.46.21.04,3.19-.08,8.53-.42Zm3.69-9.09c-.38-.28-.54-.52-.71-.76-.21-.04-.34-.48-.92-.79s-.71-.76-.92-.79c-.75-.55-1.46-1.31-2.38-2.11-.38-.28-.88-1-1.39-1.72-.88-1-1.49-2.37-1.86-3.92l-1.68,4.79c-.38.99-.56,2.02-.46,2.67.17.24.27.89.78,1.62.34.48.85,1.21,1.77,2,.21.04.38.28,1.13.83.86-.06,1.51-.16,1.71-.13s.62.11,1.27,0c.86-.06,1.3-.2,1.3-.2,1.06-.03,1.71-.13,1.92-.09.24-.17.28-.38.31-.58.28-.38.11-.62.14-.82Zm-5.59,16.37c-.17-.24-.54-.52-.71-.76-.21-.04-.34-.48-.92-.79-.54-.52-.71-.76-.92-.79-.75-.55-1.46-1.31-2.38-2.11l-.17-.24c-1.27,0-2.12.05-2.12.05-1.1.23-1.3.2-1.99.5-.48.34-.79.92-.79.92l-.07.41s-.04.21.1.65c.17.24.13.45.3.69.34.48.85,1.21,1.77,2,.21.04.34.48.92.79.89-.27,4.49-.28,4.49-.28,1.06-.03,1.71-.13,1.96-.29q.24-.17.31-.58c.38.28.41.07.24-.17Zm-14.54,16.72c.44,1.13.95,1.86,1.9,2.45,1.33.87,2.7,1.53,3.96,1.53.21.04.62.11.86-.06.41.07.65-.1,1.1-.23.65-.1.93-.47.83-1.13-.1-.65-.47-.93-.92-.79l-.21-.04c-.21-.04-.45.13-.65.1-1.3.2-2.71-.26-3.83-1.09-1.13-.83-1.7-2.41-1.55-4.5.11-.62-.27-.89-.88-1l-.41-.07c-.45.13-.69.3-.79.92-.07.41.06.86,0,1.27.06.86.13,1.71.6,2.64Zm-.15-7.64l-.29,1.64c.04-.21.28-.38.52-.54.45-.13,1.13-.44,2.2-.46.21.04,1.71-.13,4.7-.24l.62.11c.41.07.65-.1,1.06-.03,1.06-.03,1.71-.13,1.71-.13.86-.06,1.51-.16,2.2-.46.24-.17.52-.54.79-.92.28-.38.38-.99.8-2.19.38-.99.53-1.81.6-2.22.04-.21-.13-.45-.1-.65-.28.38-.52.54-.72.51-.24.17-.86.06-1.96.29,0,0-.45.13-1.3.2s-1.27,0-1.47-.04-1.96.29-4.97.62c-.89.27-1.34.4-1.58.57-.48.34-.96.68-1.55,1.63-.69.3-1.04,1.09-1.25,2.32Z"/>
    <path class="cls-4" d="m121.76,125.46c-.54-.52-1.05-1.24-2.07-2.69l2.61-11.39-4.03,2.47-8.61-13.76-3.78,2.3,1.14-6.57-2.17-3.34-3.34,2.17c-.64-1.17-.88-2.27-1.14-3.16-.22-2.37.71-4.11,2.81-5.22.69-.3,1.54-.37,2.37-.22,1.03.18,1.64.29,2.02.56.41.07.79.35.96.59l.41.07c.41.07.65-.1.93-.47.31-.58.18-1.03-.4-1.34-.34-.48-.71-.76-1.29-1.07-.41-.07-.99-.38-1.61-.49l-1.03-.18c-1.06.03-2.16.26-3.26.49-3.03,1.59-4.31,4.12-3.86,7.58.23,1.1.63,2.44,1.21,4.02l-2.37,1.49,13.22,21.33-3.99,2.27,11.36,2.82c1.19,1.69,1.9,2.45,2.41,3.17.38.28.75.55,1.23.21s.62-1.16.29-1.64Z"/>
    <path class="cls-4" d="m120.6,110.24l3.13-2.21-.96,5.54,1.49,2.37,1.65-.98c.05-2.74.42-6.06,1.53-7.56l-9.42-15.17,3.06-1.79-9.95-2.36-2.36,9.95,3.06-1.79s8.78,14.01,8.78,14.01Z"/>
  </g>
  <path class="cls-3" d="m73.24,99.58l-2.62,5.34c-.42.86-1.46,1.21-2.31.79s-1.21-1.46-.79-2.31l2.62-5.34c2.32-4.7,1.77-10.32-1.42-14.48l-7.09-9.3c-3.99-5.2-4.68-12.22-1.78-18.1l2.62-5.34c.42-.86,1.46-1.21,2.31-.79s1.21,1.46.79,2.31l-2.62,5.34c-2.32,4.7-1.77,10.32,1.42,14.48l7.09,9.3c3.99,5.2,4.68,12.22,1.78,18.1Zm-7.34-4.68l-17.05-8.36c.59-1.02,1.32-1.96,2.15-2.8l14.11,6.92c.86.42,1.89.07,2.31-.79s.07-1.89-.79-2.31l-12.55-6.15c1.33-.74,2.78-1.26,4.28-1.53.94-.17,1.57-1.07,1.4-2.01-.17-.94-1.07-1.57-2.01-1.4h0c-5.42.98-10.04,4.48-12.47,9.42l-2.62,5.34c-.42.86-.07,1.89.79,2.31s1.89.07,2.31-.79l1.52-3.11,17.08,8.37c.86.42,1.89.07,2.31-.79s.07-1.89-.79-2.31Zm23.72-32.67c-.86-.42-1.89-.07-2.31.79l-1.52,3.11-17.08-8.37c-.86-.42-1.89-.07-2.31.79s-.07,1.89.79,2.31l17.05,8.36c-.59,1.02-1.32,1.96-2.15,2.8l-14.11-6.92c-.86-.42-1.89-.07-2.31.79s-.07,1.89.79,2.31l12.55,6.15c-1.33.74-2.78,1.26-4.28,1.53-.94.17-1.57,1.07-1.4,2.01.17.94,1.07,1.57,2.01,1.4,5.41-.98,10.04-4.47,12.47-9.41l2.62-5.34c.42-.86.07-1.89-.79-2.31Z"/>
  <path class="cls-2" d="m127.81,59.44l-2.74,11.36c-.27,1.11-1.38,1.79-2.49,1.53,0,0,0,0,0,0l-11.36-2.74c-1.11-.27-1.79-1.39-1.53-2.5s1.39-1.79,2.5-1.53l6.51,1.57-6.01-9.84c-4.17-6.81-13.06-8.96-19.88-4.8-.97.59-2.25.29-2.84-.69s-.29-2.25.69-2.84c8.77-5.34,20.2-2.58,25.56,6.17l6.01,9.84,1.57-6.51c.27-1.11,1.39-1.79,2.5-1.53s1.79,1.39,1.53,2.5h0Z"/>
  <path class="cls-2" d="m58.98,127.13l2.74-11.36c.27-1.11,1.38-1.79,2.49-1.53,0,0,0,0,0,0l11.36,2.74c1.11.27,1.79,1.39,1.53,2.5s-1.39,1.79-2.5,1.53l-6.51-1.57,6.01,9.84c4.17,6.81,13.06,8.96,19.88,4.8.97-.59,2.25-.29,2.84.69s.29,2.25-.69,2.84c-8.77,5.34-20.2,2.58-25.56-6.17l-6.01-9.84-1.57,6.51c-.27,1.11-1.39,1.79-2.5,1.53s-1.79-1.39-1.53-2.5h0Z"/>
</svg>