<?xml version="1.0" encoding="UTF-8"?>
<svg id="Ebene_1" data-name="Ebene 1" xmlns="http://www.w3.org/2000/svg" viewBox="0 0 637.49 640">
  <defs>
    <style>
      .cls-1, .cls-2, .cls-3, .cls-4, .cls-5, .cls-6, .cls-7, .cls-8, .cls-9, .cls-10, .cls-11, .cls-12, .cls-13, .cls-14, .cls-15, .cls-16, .cls-17, .cls-18, .cls-19, .cls-20, .cls-21, .cls-22, .cls-23, .cls-24, .cls-25, .cls-26, .cls-27, .cls-28 {
        stroke: #000;
      }

      .cls-1, .cls-2, .cls-13, .cls-14, .cls-18, .cls-22, .cls-26 {
        fill: #fff59a;
      }

      .cls-1, .cls-12, .cls-23, .cls-28 {
        stroke-miterlimit: 4;
        stroke-width: 1px;
      }

      .cls-29, .cls-30, .cls-31, .cls-32, .cls-33, .cls-34, .cls-35, .cls-36, .cls-37, .cls-38, .cls-39, .cls-40, .cls-41 {
        isolation: isolate;
      }

      .cls-29, .cls-30, .cls-31, .cls-32, .cls-34, .cls-36, .cls-38, .cls-39, .cls-41 {
        font-family: Arial-BoldMT, Arial;
        font-weight: 700;
      }

      .cls-29, .cls-41 {
        font-size: 55.51px;
      }

      .cls-2, .cls-10 {
        stroke-width: 1.2px;
      }

      .cls-3, .cls-4, .cls-15, .cls-22 {
        stroke-miterlimit: 4;
        stroke-width: 1px;
      }

      .cls-3, .cls-5, .cls-7, .cls-16, .cls-23, .cls-27 {
        fill: #83d0f0;
      }

      .cls-4, .cls-8, .cls-17, .cls-19, .cls-21, .cls-28 {
        fill: #f19fc1;
      }

      .cls-42, .cls-30 {
        fill: #e42322;
      }

      .cls-42, .cls-43 {
        stroke-width: 0px;
      }

      .cls-5, .cls-9, .cls-13, .cls-21 {
        stroke-miterlimit: 4;
        stroke-width: 1px;
      }

      .cls-30, .cls-31, .cls-38, .cls-39 {
        font-size: 16.65px;
      }

      .cls-32 {
        letter-spacing: -.04em;
      }

      .cls-32, .cls-34, .cls-36 {
        font-size: 44.41px;
      }

      .cls-6, .cls-7, .cls-18, .cls-19 {
        stroke-miterlimit: 4;
        stroke-width: 1px;
      }

      .cls-6, .cls-9, .cls-11, .cls-12, .cls-15, .cls-20 {
        fill: #8fc796;
      }

      .cls-34 {
        letter-spacing: -.04em;
      }

      .cls-10 {
        stroke-linecap: round;
        stroke-linejoin: round;
      }

      .cls-35 {
        font-size: 17.76px;
      }

      .cls-35, .cls-37, .cls-40 {
        font-family: ArialMT, Arial;
      }

      .cls-43 {
        fill: #f6f6f6;
      }

      .cls-37 {
        font-size: 17.76px;
      }

      .cls-38 {
        letter-spacing: -.04em;
      }

      .cls-44 {
        stroke: #e42322;
        stroke-miterlimit: 10;
        stroke-width: 2px;
      }

      .cls-44, .cls-25 {
        fill: none;
      }

      .cls-14, .cls-16, .cls-17, .cls-20 {
        stroke-miterlimit: 4;
        stroke-width: 1px;
      }

      .cls-39 {
        letter-spacing: -.04em;
      }

      .cls-40 {
        font-size: 22.2px;
      }

      .cls-45 {
        letter-spacing: 0em;
      }

      .cls-46 {
        letter-spacing: -.04em;
      }

      .cls-47 {
        letter-spacing: -.07em;
      }

      .cls-41 {
        letter-spacing: -.04em;
      }

      .cls-24 {
        fill: #fff;
      }

      .cls-48 {
        letter-spacing: -.04em;
      }

      .cls-49 {
        letter-spacing: -.06em;
      }
    </style>
  </defs>
  <circle class="cls-43" cx="310.84" cy="310.84" r="310.84"/>
  <g id="c">
    <g id="d">
      <g id="e">
        <g id="f">
          <path class="cls-27" d="m310.84,310.84V88.81c-7.27,0-14.53.36-21.76,1.07l21.76,220.96Z"/>
          <path class="cls-8" d="m310.84,310.84l-21.76-220.97c-7.23.71-14.43,1.78-21.55,3.2l43.32,217.77Z"/>
          <path class="cls-26" d="m310.84,310.84l-43.32-217.77c-7.13,1.42-14.18,3.18-21.14,5.29l64.45,212.47Z"/>
          <path class="cls-11" d="m310.84,310.84l-64.45-212.47c-6.95,2.11-13.8,4.56-20.52,7.34l84.97,205.13Z"/>
        </g>
        <g id="f-2" data-name="f">
          <path class="cls-3" d="m310.84,310.84l-84.97-205.13c-6.71,2.78-13.29,5.89-19.7,9.32l104.67,195.81Z"/>
          <path class="cls-4" d="m310.84,310.84l-104.67-195.82c-6.41,3.43-12.65,7.16-18.69,11.2l123.36,184.62Z"/>
          <path class="cls-22" d="m310.84,310.84l-123.36-184.62c-6.04,4.04-11.88,8.37-17.5,12.98l140.86,171.64Z"/>
          <path class="cls-15" d="m310.84,310.84l-140.86-171.63c-5.62,4.61-11.01,9.49-16.15,14.63l157,157Z"/>
        </g>
      </g>
      <g id="e-2" data-name="e">
        <g id="f-3" data-name="f">
          <path class="cls-23" d="m310.84,310.84l-157-157c-5.14,5.14-10.02,10.53-14.63,16.15l171.63,140.86Z"/>
          <path class="cls-28" d="m310.84,310.84l-171.63-140.86c-4.61,5.62-8.94,11.46-12.98,17.5l184.62,123.36Z"/>
          <path class="cls-1" d="m310.84,310.84l-184.61-123.36c-4.04,6.04-7.78,12.28-11.2,18.69l195.82,104.67Z"/>
          <path class="cls-12" d="m310.84,310.84l-195.82-104.67c-3.43,6.41-6.54,12.98-9.32,19.7l205.13,84.97Z"/>
        </g>
        <g id="f-4" data-name="f">
          <path class="cls-5" d="m310.84,310.84l-205.13-84.97c-2.78,6.71-5.23,13.56-7.34,20.52l212.47,64.45Z"/>
          <path class="cls-21" d="m310.84,310.84l-212.47-64.45c-2.11,6.95-3.88,14.01-5.29,21.14l217.77,43.32Z"/>
          <path class="cls-13" d="m310.84,310.84l-217.77-43.32c-1.42,7.13-2.48,14.32-3.2,21.55l220.97,21.76Z"/>
          <path class="cls-9" d="m310.84,310.84l-220.96-21.76c-.71,7.23-1.07,14.5-1.07,21.76h222.03Z"/>
        </g>
      </g>
    </g>
    <g id="d-2" data-name="d">
      <g id="e-3" data-name="e">
        <g id="f-5" data-name="f">
          <path class="cls-27" d="m310.84,310.84H88.81c0,7.27.36,14.53,1.07,21.76l220.96-21.76Z"/>
          <path class="cls-8" d="m310.84,310.84l-220.97,21.76c.71,7.23,1.78,14.43,3.2,21.55l217.77-43.32Z"/>
          <path class="cls-26" d="m310.84,310.84l-217.77,43.32c1.42,7.13,3.18,14.18,5.29,21.14l212.47-64.45Z"/>
          <path class="cls-11" d="m310.84,310.84l-212.47,64.45c2.11,6.95,4.56,13.8,7.34,20.52l205.13-84.97Z"/>
        </g>
        <g id="f-6" data-name="f">
          <path class="cls-7" d="m310.84,310.84l-205.13,84.97c2.78,6.71,5.89,13.29,9.32,19.7l195.81-104.67Z"/>
          <path class="cls-19" d="m310.84,310.84l-195.82,104.67c3.43,6.41,7.16,12.65,11.2,18.69l184.62-123.36Z"/>
          <path class="cls-18" d="m310.84,310.84l-184.62,123.36c4.04,6.04,8.37,11.88,12.98,17.5l171.64-140.86Z"/>
          <path class="cls-6" d="m310.84,310.84l-171.63,140.86c4.61,5.62,9.49,11.01,14.63,16.15l157-157Z"/>
        </g>
      </g>
      <g id="e-4" data-name="e">
        <g id="f-7" data-name="f">
          <path class="cls-23" d="m310.84,310.84l-157,157c5.14,5.14,10.53,10.02,16.15,14.63l140.86-171.63Z"/>
          <path class="cls-28" d="m310.84,310.84l-140.86,171.63c5.62,4.61,11.46,8.94,17.5,12.98l123.36-184.62Z"/>
          <path class="cls-1" d="m310.84,310.84l-123.36,184.61c6.04,4.04,12.28,7.78,18.69,11.2l104.67-195.82Z"/>
          <path class="cls-12" d="m310.84,310.84l-104.67,195.82c6.41,3.43,12.98,6.54,19.7,9.32l84.97-205.13Z"/>
        </g>
        <g id="f-8" data-name="f">
          <path class="cls-16" d="m310.84,310.84l-84.97,205.13c6.71,2.78,13.56,5.23,20.52,7.34l64.45-212.47Z"/>
          <path class="cls-17" d="m310.84,310.84l-64.45,212.47c6.95,2.11,14.01,3.88,21.14,5.29l43.32-217.77Z"/>
          <path class="cls-14" d="m310.84,310.84l-43.32,217.77c7.13,1.42,14.32,2.48,21.55,3.2l21.76-220.97Z"/>
          <path class="cls-20" d="m310.84,310.84l-21.76,220.96c7.23.71,14.5,1.07,21.76,1.07v-222.03Z"/>
        </g>
      </g>
    </g>
  </g>
  <g id="c-2" data-name="c">
    <g id="d-3" data-name="d">
      <g id="e-5" data-name="e">
        <g id="f-9" data-name="f">
          <path class="cls-27" d="m310.84,310.84v222.03c7.27,0,14.53-.36,21.76-1.07l-21.76-220.96Z"/>
          <path class="cls-8" d="m310.84,310.84l21.76,220.97c7.23-.71,14.43-1.78,21.55-3.2l-43.32-217.77Z"/>
          <path class="cls-26" d="m310.84,310.84l43.32,217.77c7.13-1.42,14.18-3.18,21.14-5.29l-64.45-212.47Z"/>
          <path class="cls-11" d="m310.84,310.84l64.45,212.47c6.95-2.11,13.8-4.56,20.52-7.34l-84.97-205.13Z"/>
        </g>
        <g id="f-10" data-name="f">
          <path class="cls-3" d="m310.84,310.84l84.97,205.13c6.71-2.78,13.29-5.89,19.7-9.32l-104.67-195.81Z"/>
          <path class="cls-4" d="m310.84,310.84l104.67,195.82c6.41-3.43,12.65-7.16,18.69-11.2l-123.36-184.62Z"/>
          <path class="cls-22" d="m310.84,310.84l123.36,184.62c6.04-4.04,11.88-8.37,17.5-12.98l-140.86-171.64Z"/>
          <path class="cls-15" d="m310.84,310.84l140.86,171.63c5.62-4.61,11.01-9.49,16.15-14.63l-157-157Z"/>
        </g>
      </g>
      <g id="e-6" data-name="e">
        <g id="f-11" data-name="f">
          <path class="cls-23" d="m310.84,310.84l157,157c5.14-5.14,10.02-10.53,14.63-16.15l-171.63-140.86Z"/>
          <path class="cls-28" d="m310.84,310.84l171.63,140.86c4.61-5.62,8.94-11.46,12.98-17.5l-184.62-123.36Z"/>
          <path class="cls-1" d="m310.84,310.84l184.61,123.36c4.04-6.04,7.78-12.28,11.2-18.69l-195.82-104.67Z"/>
          <path class="cls-12" d="m310.84,310.84l195.82,104.67c3.43-6.41,6.54-12.98,9.32-19.7l-205.13-84.97Z"/>
        </g>
        <g id="f-12" data-name="f">
          <path class="cls-5" d="m310.84,310.84l205.13,84.97c2.78-6.71,5.23-13.56,7.34-20.52l-212.47-64.45Z"/>
          <path class="cls-21" d="m310.84,310.84l212.47,64.45c2.11-6.95,3.88-14.01,5.29-21.14l-217.77-43.32Z"/>
          <path class="cls-13" d="m310.84,310.84l217.77,43.32c1.42-7.13,2.48-14.32,3.2-21.55l-220.97-21.76Z"/>
          <path class="cls-9" d="m310.84,310.84l220.96,21.76c.71-7.23,1.07-14.5,1.07-21.76h-222.03Z"/>
        </g>
      </g>
    </g>
    <g id="d-4" data-name="d">
      <g id="e-7" data-name="e">
        <g id="f-13" data-name="f">
          <path class="cls-27" d="m310.84,310.84h222.03c0-7.27-.36-14.53-1.07-21.76l-220.96,21.76Z"/>
          <path class="cls-8" d="m310.84,310.84l220.97-21.76c-.71-7.23-1.78-14.43-3.2-21.55l-217.77,43.32Z"/>
          <path class="cls-26" d="m310.84,310.84l217.77-43.32c-1.42-7.13-3.18-14.18-5.29-21.14l-212.47,64.45Z"/>
          <path class="cls-11" d="m310.84,310.84l212.47-64.45c-2.11-6.95-4.56-13.8-7.34-20.52l-205.13,84.97Z"/>
        </g>
        <g id="f-14" data-name="f">
          <path class="cls-7" d="m310.84,310.84l205.13-84.97c-2.78-6.71-5.89-13.29-9.32-19.7l-195.81,104.67Z"/>
          <path class="cls-19" d="m310.84,310.84l195.82-104.67c-3.43-6.41-7.16-12.65-11.2-18.69l-184.62,123.36Z"/>
          <path class="cls-18" d="m310.84,310.84l184.62-123.36c-4.04-6.04-8.37-11.88-12.98-17.5l-171.64,140.86Z"/>
          <path class="cls-6" d="m310.84,310.84l171.63-140.86c-4.61-5.62-9.49-11.01-14.63-16.15l-157,157Z"/>
        </g>
      </g>
      <g id="e-8" data-name="e">
        <g id="f-15" data-name="f">
          <path class="cls-23" d="m310.84,310.84l157-157c-5.14-5.14-10.53-10.02-16.15-14.63l-140.86,171.63Z"/>
          <path class="cls-28" d="m310.84,310.84l140.86-171.63c-5.62-4.61-11.46-8.94-17.5-12.98l-123.36,184.62Z"/>
          <path class="cls-1" d="m310.84,310.84l123.36-184.61c-6.04-4.04-12.28-7.78-18.69-11.2l-104.67,195.82Z"/>
          <path class="cls-12" d="m310.84,310.84l104.67-195.82c-6.41-3.43-12.98-6.54-19.7-9.32l-84.97,205.13Z"/>
        </g>
        <g id="f-16" data-name="f">
          <path class="cls-16" d="m310.84,310.84l84.97-205.13c-6.71-2.78-13.56-5.23-20.52-7.34l-64.45,212.47Z"/>
          <path class="cls-17" d="m310.84,310.84l64.45-212.47c-6.95-2.11-14.01-3.88-21.14-5.29l-43.32,217.77Z"/>
          <path class="cls-14" d="m310.84,310.84l43.32-217.77c-7.13-1.42-14.32-2.48-21.55-3.2l-21.76,220.97Z"/>
          <path class="cls-20" d="m310.84,310.84l21.76-220.96c-7.23-.71-14.5-1.07-21.76-1.07v222.03Z"/>
        </g>
      </g>
    </g>
  </g>
  <g id="a">
    <g id="b">
      <path class="cls-27" d="m238.62,136.48c22.9-9.48,47.44-14.37,72.22-14.37v188.73l-72.22-174.36Z"/>
      <path class="cls-8" d="m177.39,177.4c17.52-17.52,38.33-31.43,61.23-40.91l72.22,174.36-133.45-133.45Z"/>
      <path class="cls-26" d="m136.48,238.63c9.48-22.9,23.39-43.7,40.91-61.23l133.45,133.45-174.36-72.22Z"/>
      <path class="cls-11" d="m122.12,310.84c0-24.78,4.88-49.33,14.37-72.22l174.36,72.22H122.12Z"/>
    </g>
    <g id="b-2" data-name="b">
      <path class="cls-27" d="m136.47,383.06c-9.48-22.9-14.37-47.44-14.37-72.22h188.73l-174.36,72.22Z"/>
      <path class="cls-8" d="m177.39,444.29c-17.52-17.52-31.43-38.33-40.91-61.23l174.36-72.22-133.45,133.45Z"/>
      <path class="cls-26" d="m238.62,485.19c-22.9-9.48-43.7-23.39-61.23-40.91l133.45-133.45-72.22,174.36Z"/>
      <path class="cls-11" d="m310.83,499.56c-24.78,0-49.33-4.88-72.22-14.37l72.22-174.36v188.73Z"/>
    </g>
  </g>
  <g>
    <g id="a-2" data-name="a">
      <g id="b-3" data-name="b">
        <path class="cls-27" d="m383.07,485.21c-22.9,9.48-47.44,14.37-72.22,14.37v-188.73l72.22,174.36Z"/>
        <path class="cls-8" d="m444.3,444.29c-17.52,17.52-38.33,31.43-61.23,40.91l-72.22-174.36,133.45,133.45Z"/>
        <path class="cls-26" d="m485.21,383.06c-9.48,22.9-23.39,43.7-40.91,61.23l-133.45-133.45,174.36,72.22Z"/>
        <path class="cls-11" d="m499.57,310.84c0,24.78-4.88,49.33-14.37,72.22l-174.36-72.22h188.73Z"/>
      </g>
      <g id="b-4" data-name="b">
        <path class="cls-27" d="m485.22,238.63c9.48,22.9,14.37,47.44,14.37,72.22h-188.73l174.36-72.22Z"/>
        <path class="cls-8" d="m444.3,177.4c17.52,17.52,31.43,38.33,40.91,61.23l-174.36,72.22,133.45-133.45Z"/>
        <path class="cls-26" d="m383.07,136.49c22.9,9.48,43.7,23.39,61.23,40.91l-133.45,133.45,72.22-174.36Z"/>
        <path class="cls-11" d="m310.86,122.13c24.78,0,49.33,4.88,72.22,14.37l-72.22,174.36V122.13Z"/>
      </g>
    </g>
    <g>
      <path class="cls-2" d="m421.86,310.84c0,61.31-49.7,111.02-111.02,111.02h0v-111.02h111.02Z"/>
      <path class="cls-8" d="m310.84,421.86c-61.31,0-111.02-49.7-111.02-111.02h111.02v111.02Z"/>
      <path class="cls-27" d="m199.83,310.84c0-61.31,49.7-111.02,111.02-111.02v111.02h-111.02Z"/>
      <path class="cls-11" d="m310.84,199.83c61.31,0,111.02,49.7,111.02,111.02h-111.02v-111.02Z"/>
    </g>
    <g>
      <path class="cls-25" d="m354.16,93.08l17.33-87.1"/>
      <path class="cls-25" d="m395.82,105.71l33.99-82.05"/>
      <path class="cls-25" d="m467.84,153.85l62.8-62.8"/>
      <path class="cls-25" d="m495.46,187.49l73.84-49.34"/>
      <path class="cls-25" d="m506.67,206.18l78.32-41.87"/>
      <path class="cls-25" d="m515.98,225.87l82.05-33.99"/>
      <path class="cls-25" d="m528.61,267.53l87.1-17.33"/>
      <path class="cls-25" d="m531.81,289.09l88.38-8.71"/>
      <path class="cls-25" d="m515.98,395.82l82.05,33.99"/>
      <path class="cls-25" d="m467.84,467.84l62.8,62.8"/>
      <path class="cls-25" d="m434.19,495.46l49.34,73.84"/>
      <path class="cls-25" d="m395.82,515.98l33.99,82.05"/>
      <path class="cls-25" d="m246.39,523.32l-25.78,84.98"/>
      <path class="cls-25" d="m225.87,515.98l-33.99,82.05"/>
      <path class="cls-25" d="m153.85,467.84l-62.8,62.8"/>
      <path class="cls-25" d="m126.23,434.19l-73.84,49.34"/>
      <path class="cls-25" d="m105.71,395.82l-82.05,33.99"/>
      <path class="cls-25" d="m93.08,354.16l-87.1,17.33"/>
      <path class="cls-25" d="m105.71,225.87l-82.05-33.99"/>
      <path class="cls-25" d="m153.85,153.85l-62.8-62.8"/>
      <path class="cls-25" d="m187.49,126.23l-49.34-73.84"/>
      <path class="cls-25" d="m225.87,105.71l-33.99-82.05"/>
    </g>
  </g>
  <g id="i">
    <polygon class="cls-42" points="321.3 302.03 330.16 310.68 321.3 319.69 336.35 310.33 321.3 302.03"/>
    <polygon class="cls-42" points="422.69 302.03 431.54 310.68 422.69 319.69 437.74 310.33 422.69 302.03"/>
    <polygon class="cls-42" points="535.34 302.03 544.2 310.68 535.34 319.69 550.4 310.33 535.34 302.03"/>
    <g>
      <polygon class="cls-42" points="302.03 300.39 310.68 291.53 319.69 300.39 310.33 285.34 302.03 300.39"/>
      <polygon class="cls-42" points="302.03 199 310.68 190.14 319.69 199 310.33 183.95 302.03 199"/>
      <polygon class="cls-42" points="302.03 86.34 310.68 77.49 319.69 86.34 310.33 71.29 302.03 86.34"/>
    </g>
  </g>
  <g id="i-2" data-name="i">
    <polygon class="cls-42" points="300.39 319.66 291.53 311.01 300.39 302 285.34 311.36 300.39 319.66"/>
    <polygon class="cls-42" points="199 319.66 190.14 311.01 199 302 183.95 311.36 199 319.66"/>
    <polygon class="cls-42" points="86.34 319.66 77.49 311.01 86.34 302 71.29 311.36 86.34 319.66"/>
    <g>
      <polygon class="cls-42" points="319.66 321.3 311.01 330.16 302 321.3 311.36 336.35 319.66 321.3"/>
      <polygon class="cls-42" points="319.66 422.69 311.01 431.54 302 422.69 311.36 437.74 319.66 422.69"/>
      <polygon class="cls-42" points="319.66 535.34 311.01 544.2 302 535.34 311.36 550.4 319.66 535.34"/>
    </g>
  </g>
  <g>
    <circle class="cls-24" cx="310.84" cy="310.84" r="11.1"/>
    <g>
      <g>
        <path class="cls-10" d="m196.53,599.69l15.75-13.36,3.7,20.32-19.44-6.95Z"/>
        <rect class="cls-10" x="566.45" y="264.2" width="14.43" height="14.43"/>
        <rect class="cls-10" x="544.57" y="189.88" width="14.43" height="14.43"/>
        <rect class="cls-10" x="531.91" y="167.6" width="14.43" height="14.43"/>
      </g>
      <rect class="cls-10" x="563.46" y="617.96" width="19.98" height="19.98"/>
      <path class="cls-10" d="m563.46,611.32v-19.98l17.31,9.99-17.31,9.99Z"/>
    </g>
  </g>
  <g>
    <g>
      <g>
        <text class="cls-29" transform="translate(242.63 283.09)"><tspan x="0" y="0">G</tspan></text>
        <text class="cls-29" transform="translate(337.43 283.09)"><tspan x="0" y="0">U</tspan></text>
        <text class="cls-41" transform="translate(243.06 377.45)"><tspan x="0" y="0">A</tspan></text>
        <text class="cls-29" transform="translate(337.43 377.45)"><tspan x="0" y="0">C</tspan></text>
      </g>
      <g>
        <text class="cls-36" transform="translate(323.67 178.73)"><tspan x="0" y="0">U</tspan></text>
        <text class="cls-36" transform="translate(378.07 202.05)"><tspan x="0" y="0">C</tspan></text>
        <text class="cls-32" transform="translate(419.15 243.12)"><tspan x="0" y="0">A</tspan></text>
        <text class="cls-36" transform="translate(441.22 297.52)"><tspan x="0" y="0">G</tspan></text>
      </g>
      <g>
        <text class="cls-31" transform="translate(314.82 111.02)"><tspan x="0" y="0">U</tspan></text>
        <text class="cls-31" transform="translate(334.81 113.23)"><tspan x="0" y="0">C</tspan></text>
        <text class="cls-39" transform="translate(353.68 117.68)"><tspan x="0" y="0">A</tspan></text>
        <text class="cls-31" transform="translate(373.2 123.23)"><tspan x="0" y="0">G</tspan></text>
        <text class="cls-31" transform="translate(392.53 131)"><tspan x="0" y="0">U</tspan></text>
        <text class="cls-31" transform="translate(409.19 139.88)"><tspan x="0" y="0">C</tspan></text>
        <text class="cls-39" transform="translate(425.84 150.98)"><tspan x="0" y="0">A</tspan></text>
        <text class="cls-31" transform="translate(442.03 164.3)"><tspan x="0" y="0">G</tspan></text>
        <text class="cls-31" transform="translate(456.92 178.73)"><tspan x="0" y="0">U</tspan></text>
        <text class="cls-31" transform="translate(469.13 193.17)"><tspan x="0" y="0">C</tspan></text>
        <text class="cls-39" transform="translate(480.24 210.93)"><tspan x="0" y="0">A</tspan></text>
        <text class="cls-31" transform="translate(489.76 228.69)"><tspan x="0" y="0">G</tspan></text>
        <text class="cls-31" transform="translate(500.22 248.67)"><tspan x="0" y="0">U</tspan></text>
        <text class="cls-31" transform="translate(503.55 266.44)"><tspan x="0" y="0">C</tspan></text>
        <text class="cls-39" transform="translate(506.88 286.42)"><tspan x="0" y="0">A</tspan></text>
        <text class="cls-31" transform="translate(508.64 306.4)"><tspan x="0" y="0">G</tspan></text>
        <text class="cls-31" transform="translate(509.1 326.38)"><tspan x="0" y="0">U</tspan></text>
        <text class="cls-31" transform="translate(507.99 347.48)"><tspan x="0" y="0">C</tspan></text>
        <text class="cls-39" transform="translate(503.55 366.35)"><tspan x="0" y="0">A</tspan></text>
        <text class="cls-31" transform="translate(497.53 385.22)"><tspan x="0" y="0">G</tspan></text>
        <text class="cls-31" transform="translate(491.34 405.21)"><tspan x="0" y="0">U</tspan></text>
        <text class="cls-31" transform="translate(480.24 422.97)"><tspan x="0" y="0">C</tspan></text>
        <text class="cls-39" transform="translate(470.24 438.51)"><tspan x="0" y="0">A</tspan></text>
        <text class="cls-31" transform="translate(456.46 455.16)"><tspan x="0" y="0">G</tspan></text>
        <text class="cls-31" transform="translate(442.49 469.6)"><tspan x="0" y="0">U</tspan></text>
        <text class="cls-31" transform="translate(428.06 484.03)"><tspan x="0" y="0">C</tspan></text>
        <text class="cls-39" transform="translate(410.3 492.91)"><tspan x="0" y="0">A</tspan></text>
        <text class="cls-31" transform="translate(392.07 501.79)"><tspan x="0" y="0">G</tspan></text>
        <text class="cls-31" transform="translate(373.66 510.67)"><tspan x="0" y="0">U</tspan></text>
        <text class="cls-31" transform="translate(354.79 516.22)"><tspan x="0" y="0">C</tspan></text>
        <text class="cls-39" transform="translate(334.81 519.55)"><tspan x="0" y="0">A</tspan></text>
        <text class="cls-31" transform="translate(314.36 521.77)"><tspan x="0" y="0">G</tspan></text>
        <text class="cls-31" transform="translate(293.73 521.77)"><tspan x="0" y="0">U</tspan></text>
        <text class="cls-31" transform="translate(273.75 520.66)"><tspan x="0" y="0">C</tspan></text>
        <text class="cls-38" transform="translate(254.87 515.11)"><tspan x="0" y="0">A</tspan></text>
        <text class="cls-31" transform="translate(234.43 509.56)"><tspan x="0" y="0">G</tspan></text>
        <text class="cls-31" transform="translate(216.02 501.79)"><tspan x="0" y="0">U</tspan></text>
        <text class="cls-31" transform="translate(198.26 494.02)"><tspan x="0" y="0">C</tspan></text>
        <text class="cls-38" transform="translate(181.6 481.81)"><tspan x="0" y="0">A</tspan></text>
        <text class="cls-31" transform="translate(165.6 468.49)"><tspan x="0" y="0">G</tspan></text>
        <text class="cls-31" transform="translate(151.63 454.05)"><tspan x="0" y="0">U</tspan></text>
        <text class="cls-31" transform="translate(139.42 438.51)"><tspan x="0" y="0">C</tspan></text>
        <text class="cls-38" transform="translate(128.32 421.86)"><tspan x="0" y="0">A</tspan></text>
        <text class="cls-31" transform="translate(117.86 404.1)"><tspan x="0" y="0">G</tspan></text>
        <text class="cls-31" transform="translate(110.55 385.22)"><tspan x="0" y="0">U</tspan></text>
        <text class="cls-31" transform="translate(105 366.35)"><tspan x="0" y="0">C</tspan></text>
        <text class="cls-38" transform="translate(101.67 346.37)"><tspan x="0" y="0">A</tspan></text>
        <text class="cls-31" transform="translate(98.99 326.38)"><tspan x="0" y="0">G</tspan></text>
        <text class="cls-31" transform="translate(99.45 306.4)"><tspan x="0" y="0">U</tspan></text>
        <text class="cls-31" transform="translate(100.56 286.42)"><tspan x="0" y="0">C</tspan></text>
        <text class="cls-38" transform="translate(105 266.44)"><tspan x="0" y="0">A</tspan></text>
        <text class="cls-31" transform="translate(110.09 247.56)"><tspan x="0" y="0">G</tspan></text>
        <text class="cls-31" transform="translate(118.32 228.69)"><tspan x="0" y="0">U</tspan></text>
        <text class="cls-31" transform="translate(127.21 210.93)"><tspan x="0" y="0">C</tspan></text>
        <text class="cls-38" transform="translate(139.42 194.28)"><tspan x="0" y="0">A</tspan></text>
        <text class="cls-31" transform="translate(152.28 178.73)"><tspan x="0" y="0">G</tspan></text>
        <text class="cls-31" transform="translate(166.06 164.3)"><tspan x="0" y="0">U</tspan></text>
        <text class="cls-31" transform="translate(181.6 150.98)"><tspan x="0" y="0">C</tspan></text>
        <text class="cls-38" transform="translate(198.26 139.88)"><tspan x="0" y="0">A</tspan></text>
        <text class="cls-31" transform="translate(216.67 131)"><tspan x="0" y="0">G</tspan></text>
        <text class="cls-31" transform="translate(234.89 123.23)"><tspan x="0" y="0">U</tspan></text>
        <text class="cls-31" transform="translate(254.87 117.68)"><tspan x="0" y="0">C</tspan></text>
        <text class="cls-38" transform="translate(273.75 113.23)"><tspan x="0" y="0">A</tspan></text>
        <text class="cls-31" transform="translate(294.38 111.02)"><tspan x="0" y="0">G</tspan></text>
      </g>
      <g>
        <text class="cls-36" transform="translate(441.35 354.14)"><tspan x="0" y="0">U</tspan></text>
        <text class="cls-36" transform="translate(264.84 472.93)"><tspan x="0" y="0">U</tspan></text>
        <text class="cls-36" transform="translate(147.16 296.41)"><tspan x="0" y="0">U</tspan></text>
        <text class="cls-36" transform="translate(169.36 243.12)"><tspan x="0" y="0">C</tspan></text>
        <text class="cls-36" transform="translate(419.15 409.65)"><tspan x="0" y="0">C</tspan></text>
        <text class="cls-36" transform="translate(211.55 450.72)"><tspan x="0" y="0">C</tspan></text>
        <text class="cls-32" transform="translate(378.07 450.72)"><tspan x="0" y="0">A</tspan></text>
        <text class="cls-34" transform="translate(210.44 202.05)"><tspan x="0" y="0">A</tspan></text>
        <text class="cls-34" transform="translate(169.36 409.65)"><tspan x="0" y="0">A</tspan></text>
        <text class="cls-36" transform="translate(264.71 179.84)"><tspan x="0" y="0">G</tspan></text>
        <text class="cls-36" transform="translate(145.92 355.25)"><tspan x="0" y="0">G</tspan></text>
        <text class="cls-36" transform="translate(322.44 474.04)"><tspan x="0" y="0">G</tspan></text>
      </g>
    </g>
    <g>
      <text class="cls-30" transform="translate(303.44 316.39)"><tspan x="0" y="0">5´</tspan></text>
      <text class="cls-30" transform="translate(604.29 316.39)"><tspan x="0" y="0">3´</tspan></text>
      <text class="cls-30" transform="translate(5.92 316.39)"><tspan x="0" y="0">3´</tspan></text>
      <text class="cls-30" transform="translate(305.66 16.65)"><tspan x="0" y="0">3´</tspan></text>
      <text class="cls-30" transform="translate(305.66 617.25)"><tspan x="0" y="0">3´</tspan></text>
    </g>
    <g>
      <text class="cls-35" transform="translate(15.79 340.82)"><tspan x="0" y="0">Arg (R)</tspan></text>
      <text class="cls-35" transform="translate(27.38 393)"><tspan x="0" y="0">Ser (S)</tspan></text>
      <text class="cls-35" transform="translate(44.36 441.84)"><tspan class="cls-48" x="0" y="0">L</tspan><tspan class="cls-45" x="9.22" y="0">ys (K)</tspan></text>
      <g class="cls-33">
        <text class="cls-35" transform="translate(85.72 477.37)"><tspan x="0" y="0">Asn</tspan></text>
        <text class="cls-35" transform="translate(88.69 499.57)"><tspan x="0" y="0">(N)</tspan></text>
      </g>
      <g class="cls-33">
        <text class="cls-35" transform="translate(148.76 529.54)"><tspan x="0" y="0">Thr</tspan></text>
        <text class="cls-35" transform="translate(150.74 549.53)"><tspan x="0" y="0">(T)</tspan></text>
      </g>
      <text class="cls-37" transform="translate(218.41 584.68) rotate(-69.53)"><tspan x="0" y="0">Met (M)</tspan></text>
      <g class="cls-33">
        <text class="cls-35" transform="translate(262.61 571.73)"><tspan x="0" y="0">Ile</tspan></text>
        <text class="cls-35" transform="translate(263.61 593.93)"><tspan x="0" y="0">(I)</tspan></text>
      </g>
      <g class="cls-33">
        <text class="cls-35" transform="translate(348.09 570.62)"><tspan x="0" y="0">Arg</tspan></text>
        <text class="cls-35" transform="translate(349.58 590.6)"><tspan x="0" y="0">(R)</tspan></text>
      </g>
      <g class="cls-33">
        <text class="cls-35" transform="translate(423.58 543.98)"><tspan x="0" y="0">Gln</tspan></text>
        <text class="cls-35" transform="translate(424.58 563.96)"><tspan x="0" y="0">(Q)</tspan></text>
      </g>
      <g class="cls-33">
        <text class="cls-35" transform="translate(466.76 514)"><tspan x="0" y="0">His</tspan></text>
        <text class="cls-35" transform="translate(467.26 533.98)"><tspan x="0" y="0">(H)</tspan></text>
      </g>
      <g class="cls-33">
        <text class="cls-35" transform="translate(521.28 454.05)"><tspan x="0" y="0">Pro</tspan></text>
        <text class="cls-35" transform="translate(523.26 474.04)"><tspan x="0" y="0">(P)</tspan></text>
      </g>
      <g class="cls-33">
        <text class="cls-35" transform="translate(554.69 355.25)"><tspan x="0" y="0">Leu</tspan></text>
        <text class="cls-35" transform="translate(558.66 375.23)"><tspan x="0" y="0">(L)</tspan></text>
      </g>
      <text class="cls-35" transform="translate(543.08 303.07)"><tspan class="cls-46" x="0" y="0">T</tspan><tspan x="10.19" y="0">rp (W)</tspan></text>
      <text class="cls-35" transform="translate(536.09 238.68)"><tspan x="0" y="0">Cys (C)</tspan></text>
      <g class="cls-33">
        <text class="cls-35" transform="translate(506.11 136.55)"><tspan class="cls-49" x="0" y="0">T</tspan><tspan x="9.87" y="0">yr</tspan></text>
        <text class="cls-35" transform="translate(506.61 156.53)"><tspan x="0" y="0">(Y)</tspan></text>
      </g>
      <g class="cls-33">
        <text class="cls-35" transform="translate(445.78 84.37)"><tspan x="0" y="0">Ser</tspan></text>
        <text class="cls-35" transform="translate(447.77 104.35)"><tspan x="0" y="0">(S)</tspan></text>
      </g>
      <g class="cls-33">
        <text class="cls-35" transform="translate(373.74 53.29)"><tspan x="0" y="0">Leu</tspan></text>
        <text class="cls-35" transform="translate(377.7 75.49)"><tspan x="0" y="0">(L)</tspan></text>
      </g>
      <g class="cls-33">
        <text class="cls-35" transform="translate(321.69 43.29)"><tspan x="0" y="0">Phe</tspan></text>
        <text class="cls-35" transform="translate(326.15 63.28)"><tspan x="0" y="0">(F)</tspan></text>
      </g>
      <g class="cls-33">
        <text class="cls-35" transform="translate(245.34 48.85)"><tspan x="0" y="0">Gly</tspan></text>
        <text class="cls-35" transform="translate(245.84 68.83)"><tspan x="0" y="0">(G)</tspan></text>
      </g>
      <g class="cls-33">
        <text class="cls-35" transform="translate(171.57 71.05)"><tspan x="0" y="0">Glu</tspan></text>
        <text class="cls-35" transform="translate(173.56 93.25)"><tspan x="0" y="0">(E)</tspan></text>
      </g>
      <g class="cls-33">
        <text class="cls-35" transform="translate(126.8 101.02)"><tspan x="0" y="0">Asp</tspan></text>
        <text class="cls-35" transform="translate(129.77 121.01)"><tspan x="0" y="0">(D)</tspan></text>
      </g>
      <g class="cls-33">
        <text class="cls-35" transform="translate(77.09 158.75)"><tspan x="0" y="0">Ala</tspan></text>
        <text class="cls-35" transform="translate(78.08 178.73)"><tspan x="0" y="0">(A)</tspan></text>
      </g>
      <g class="cls-33">
        <text class="cls-35" transform="translate(34.45 257.56)"><tspan class="cls-47" x="0" y="0">V</tspan><tspan class="cls-45" x="10.53" y="0">al</tspan></text>
        <text class="cls-35" transform="translate(34.79 279.76)"><tspan x="0" y="0">(V)</tspan></text>
      </g>
    </g>
    <text class="cls-40" transform="translate(590.6 608.37)"><tspan x="0" y="0">Start</tspan></text>
    <text class="cls-40" transform="translate(590.6 632.79)"><tspan x="0" y="0">Stop</tspan></text>
  </g>
  <line class="cls-44" x1="322.4" y1="310.81" x2="598.06" y2="310.81"/>
  <line class="cls-44" x1="299.29" y1="310.81" x2="23.66" y2="310.81"/>
  <line class="cls-44" x1="310.86" y1="299.29" x2="310.86" y2="23.71"/>
  <line class="cls-44" x1="310.86" y1="322.4" x2="310.86" y2="598.01"/>
</svg>