<?xml version="1.0" encoding="UTF-8"?>
<svg id="Ebene_1" data-name="Ebene 1" xmlns="http://www.w3.org/2000/svg" viewBox="0 0 120.5 200">
  <defs>
    <style>
      .cls-1 {
        fill: #010101;
        stroke-width: 0px;
      }
    </style>
  </defs>
  <path class="cls-1" d="m120.5,168.3v24.55c0,3.94-3,7.14-6.69,7.14s-6.69-3.2-6.69-7.14v-24.55c.07-21.67-11.41-41.49-29.61-51.12l-40.5-21.6C14.27,83.56-.08,58.78,0,31.7V7.14C0,3.2,3,0,6.69,0s6.69,3.2,6.69,7.14v24.55c-.07,21.67,11.41,41.49,29.61,51.12l40.5,21.6c22.74,12.03,37.09,36.81,37,63.89Zm-33.47-4.02H13.53c.32-4.87,1.23-9.67,2.7-14.29h60.84c3.7,0,6.69-3.2,6.69-7.14s-3-7.14-6.69-7.14H22.98c3.36-5.18,7.5-9.73,12.26-13.46,2.99-2.33,3.63-6.81,1.44-10-2.19-3.19-6.38-3.88-9.37-1.54h0C10.16,124.2.03,145.57,0,168.3v24.55c0,3.94,3,7.14,6.69,7.14s6.69-3.2,6.69-7.14v-14.29h73.64c3.7,0,6.69-3.2,6.69-7.14s-3-7.14-6.69-7.14ZM113.8,0c-3.7,0-6.69,3.2-6.69,7.14v14.29H33.47c-3.7,0-6.69,3.2-6.69,7.14s3,7.14,6.69,7.14h73.5c-.32,4.87-1.23,9.67-2.7,14.29h-60.84c-3.7,0-6.69,3.2-6.69,7.14s3,7.14,6.69,7.14h54.1c-3.36,5.18-7.5,9.73-12.26,13.46-2.98,2.33-3.62,6.81-1.44,9.99,2.19,3.18,6.38,3.87,9.36,1.53,17.14-13.48,27.28-34.85,27.31-57.57V7.14c0-3.94-3-7.14-6.69-7.14Z"/>
</svg>