{
   "swagger":"2.0",
   "info":{
      "title":"FATHM-APP",
      "description":"API for the FATHMM Service",
      "version":"1.0",
      "contact":{
         "name":"University Medical Center Göttingen",
         "url":"https://www.umg.eu/"
      }
   },
   "securityDefinitions":{
      "Bearer":{
         "type":"apiKey",
         "name":"Authorization",
         "in":"header",
         "description":"JWT Authorization header using the Bearer scheme. Example: \"Authorization: Bearer {token}\""
      }
   },
   "security":[
      {
         "Bearer":[
            
         ]
      }
   ]
}