\relax 
\providecommand\hyper@newdestlabel[2]{}
\providecommand\HyperFirstAtBeginDocument{\AtBeginDocument}
\HyperFirstAtBeginDocument{\ifx\hyper@anchor\@undefined
\global\let\oldcontentsline\contentsline
\gdef\contentsline#1#2#3#4{\oldcontentsline{#1}{#2}{#3}}
\global\let\oldnewlabel\newlabel
\gdef\newlabel#1#2{\newlabelxx{#1}#2}
\gdef\newlabelxx#1#2#3#4#5#6{\oldnewlabel{#1}{{#2}{#3}}}
\AtEndDocument{\ifx\hyper@anchor\@undefined
\let\contentsline\oldcontentsline
\let\newlabel\oldnewlabel
\fi}
\fi}
\global\let\hyper@last\relax 
\gdef\HyperFirstAtBeginDocument#1{#1}
\providecommand\HyField@AuxAddToFields[1]{}
\providecommand\HyField@AuxAddToCoFields[2]{}
\@writefile{toc}{\contentsline {section}{\numberline {1}Method}{1}{section.1}\protected@file@percent }
\@writefile{toc}{\contentsline {section}{\numberline {2}Discussion}{1}{section.2}\protected@file@percent }
\@writefile{toc}{\contentsline {section}{\numberline {3}Teamwork}{2}{section.3}\protected@file@percent }
\@writefile{toc}{\contentsline {section}{\numberline {A}Time Schedule}{3}{appendix.A}\protected@file@percent }
\newlabel{appendix:time_schedule}{{A}{3}{Time Schedule}{appendix.A}{}}
\newlabel{appendix:time_schedule@cref}{{[appendix][1][2147483647]A}{[1][3][]3}}
\@writefile{toc}{\contentsline {section}{\numberline {B}Code}{5}{appendix.B}\protected@file@percent }
\newlabel{appendix:code}{{B}{5}{Code}{appendix.B}{}}
\newlabel{appendix:code@cref}{{[appendix][2][2147483647]B}{[1][5][]5}}
\gdef \@abspage@last{17}
