No.     Time           Source                Destination           Protocol Length Info
      2 0.000081000    10.0.4.10             224.0.0.9             RIPv2    66     Request

Frame 2: 66 bytes on wire (528 bits), 66 bytes captured (528 bits) on interface 0
Ethernet II, Src: RealtekS_00:0a:40 (00:e0:4c:00:0a:40), Dst: IPv4mcast_00:00:09 (01:00:5e:00:00:09)
Internet Protocol Version 4, Src: 10.0.4.10 (10.0.4.10), Dst: 224.0.0.9 (224.0.0.9)
User Datagram Protocol, Src Port: 520 (520), Dst Port: 520 (520)
Routing Information Protocol

No.     Time           Source                Destination           Protocol Length Info
      3 0.001523000    10.0.4.3              10.0.4.10             RIPv2    106    Response

Frame 3: 106 bytes on wire (848 bits), 106 bytes captured (848 bits) on interface 0
Ethernet II, Src: Cisco_9c:0c:e1 (00:1f:ca:9c:0c:e1), Dst: RealtekS_00:0a:40 (00:e0:4c:00:0a:40)
Internet Protocol Version 4, Src: 10.0.4.3 (10.0.4.3), Dst: 10.0.4.10 (10.0.4.10)
User Datagram Protocol, Src Port: 520 (520), Dst Port: 520 (520)
Routing Information Protocol

No.     Time           Source                Destination           Protocol Length Info
      8 19.214173000   10.0.4.3              224.0.0.9             RIPv2    106    Response

Frame 8: 106 bytes on wire (848 bits), 106 bytes captured (848 bits) on interface 0
Ethernet II, Src: Cisco_9c:0c:e1 (00:1f:ca:9c:0c:e1), Dst: IPv4mcast_00:00:09 (01:00:5e:00:00:09)
Internet Protocol Version 4, Src: 10.0.4.3 (10.0.4.3), Dst: 224.0.0.9 (224.0.0.9)
User Datagram Protocol, Src Port: 520 (520), Dst Port: 520 (520)
Routing Information Protocol

No.     Time           Source                Destination           Protocol Length Info
     12 45.722803000   10.0.4.3              224.0.0.9             RIPv2    106    Response

Frame 12: 106 bytes on wire (848 bits), 106 bytes captured (848 bits) on interface 0
Ethernet II, Src: Cisco_9c:0c:e1 (00:1f:ca:9c:0c:e1), Dst: IPv4mcast_00:00:09 (01:00:5e:00:00:09)
Internet Protocol Version 4, Src: 10.0.4.3 (10.0.4.3), Dst: 224.0.0.9 (224.0.0.9)
User Datagram Protocol, Src Port: 520 (520), Dst Port: 520 (520)
Routing Information Protocol

No.     Time           Source                Destination           Protocol Length Info
     14 72.047404000   10.0.4.3              224.0.0.9             RIPv2    106    Response

Frame 14: 106 bytes on wire (848 bits), 106 bytes captured (848 bits) on interface 0
Ethernet II, Src: Cisco_9c:0c:e1 (00:1f:ca:9c:0c:e1), Dst: IPv4mcast_00:00:09 (01:00:5e:00:00:09)
Internet Protocol Version 4, Src: 10.0.4.3 (10.0.4.3), Dst: 224.0.0.9 (224.0.0.9)
User Datagram Protocol, Src Port: 520 (520), Dst Port: 520 (520)
Routing Information Protocol

No.     Time           Source                Destination           Protocol Length Info
     17 97.936014000   10.0.4.3              224.0.0.9             RIPv2    106    Response

Frame 17: 106 bytes on wire (848 bits), 106 bytes captured (848 bits) on interface 0
Ethernet II, Src: Cisco_9c:0c:e1 (00:1f:ca:9c:0c:e1), Dst: IPv4mcast_00:00:09 (01:00:5e:00:00:09)
Internet Protocol Version 4, Src: 10.0.4.3 (10.0.4.3), Dst: 224.0.0.9 (224.0.0.9)
User Datagram Protocol, Src Port: 520 (520), Dst Port: 520 (520)
Routing Information Protocol

No.     Time           Source                Destination           Protocol Length Info
     20 127.848731000  10.0.4.3              224.0.0.9             RIPv2    106    Response

Frame 20: 106 bytes on wire (848 bits), 106 bytes captured (848 bits) on interface 0
Ethernet II, Src: Cisco_9c:0c:e1 (00:1f:ca:9c:0c:e1), Dst: IPv4mcast_00:00:09 (01:00:5e:00:00:09)
Internet Protocol Version 4, Src: 10.0.4.3 (10.0.4.3), Dst: 224.0.0.9 (224.0.0.9)
User Datagram Protocol, Src Port: 520 (520), Dst Port: 520 (520)
Routing Information Protocol

No.     Time           Source                Destination           Protocol Length Info
     23 157.625425000  10.0.4.3              224.0.0.9             RIPv2    106    Response

Frame 23: 106 bytes on wire (848 bits), 106 bytes captured (848 bits) on interface 0
Ethernet II, Src: Cisco_9c:0c:e1 (00:1f:ca:9c:0c:e1), Dst: IPv4mcast_00:00:09 (01:00:5e:00:00:09)
Internet Protocol Version 4, Src: 10.0.4.3 (10.0.4.3), Dst: 224.0.0.9 (224.0.0.9)
User Datagram Protocol, Src Port: 520 (520), Dst Port: 520 (520)
Routing Information Protocol

No.     Time           Source                Destination           Protocol Length Info
     26 184.282057000  10.0.4.3              224.0.0.9             RIPv2    106    Response

Frame 26: 106 bytes on wire (848 bits), 106 bytes captured (848 bits) on interface 0
Ethernet II, Src: Cisco_9c:0c:e1 (00:1f:ca:9c:0c:e1), Dst: IPv4mcast_00:00:09 (01:00:5e:00:00:09)
Internet Protocol Version 4, Src: 10.0.4.3 (10.0.4.3), Dst: 224.0.0.9 (224.0.0.9)
User Datagram Protocol, Src Port: 520 (520), Dst Port: 520 (520)
Routing Information Protocol

No.     Time           Source                Destination           Protocol Length Info
     28 211.918675000  10.0.4.3              224.0.0.9             RIPv2    106    Response

Frame 28: 106 bytes on wire (848 bits), 106 bytes captured (848 bits) on interface 0
Ethernet II, Src: Cisco_9c:0c:e1 (00:1f:ca:9c:0c:e1), Dst: IPv4mcast_00:00:09 (01:00:5e:00:00:09)
Internet Protocol Version 4, Src: 10.0.4.3 (10.0.4.3), Dst: 224.0.0.9 (224.0.0.9)
User Datagram Protocol, Src Port: 520 (520), Dst Port: 520 (520)
Routing Information Protocol

No.     Time           Source                Destination           Protocol Length Info
     31 240.287377000  10.0.4.3              224.0.0.9             RIPv2    106    Response

Frame 31: 106 bytes on wire (848 bits), 106 bytes captured (848 bits) on interface 0
Ethernet II, Src: Cisco_9c:0c:e1 (00:1f:ca:9c:0c:e1), Dst: IPv4mcast_00:00:09 (01:00:5e:00:00:09)
Internet Protocol Version 4, Src: 10.0.4.3 (10.0.4.3), Dst: 224.0.0.9 (224.0.0.9)
User Datagram Protocol, Src Port: 520 (520), Dst Port: 520 (520)
Routing Information Protocol

No.     Time           Source                Destination           Protocol Length Info
     33 266.603996000  10.0.4.3              224.0.0.9             RIPv2    106    Response

Frame 33: 106 bytes on wire (848 bits), 106 bytes captured (848 bits) on interface 0
Ethernet II, Src: Cisco_9c:0c:e1 (00:1f:ca:9c:0c:e1), Dst: IPv4mcast_00:00:09 (01:00:5e:00:00:09)
Internet Protocol Version 4, Src: 10.0.4.3 (10.0.4.3), Dst: 224.0.0.9 (224.0.0.9)
User Datagram Protocol, Src Port: 520 (520), Dst Port: 520 (520)
Routing Information Protocol

No.     Time           Source                Destination           Protocol Length Info
     37 296.088677000  10.0.4.3              224.0.0.9             RIPv2    106    Response

Frame 37: 106 bytes on wire (848 bits), 106 bytes captured (848 bits) on interface 0
Ethernet II, Src: Cisco_9c:0c:e1 (00:1f:ca:9c:0c:e1), Dst: IPv4mcast_00:00:09 (01:00:5e:00:00:09)
Internet Protocol Version 4, Src: 10.0.4.3 (10.0.4.3), Dst: 224.0.0.9 (224.0.0.9)
User Datagram Protocol, Src Port: 520 (520), Dst Port: 520 (520)
Routing Information Protocol

No.     Time           Source                Destination           Protocol Length Info
     39 322.773316000  10.0.4.3              224.0.0.9             RIPv2    106    Response

Frame 39: 106 bytes on wire (848 bits), 106 bytes captured (848 bits) on interface 0
Ethernet II, Src: Cisco_9c:0c:e1 (00:1f:ca:9c:0c:e1), Dst: IPv4mcast_00:00:09 (01:00:5e:00:00:09)
Internet Protocol Version 4, Src: 10.0.4.3 (10.0.4.3), Dst: 224.0.0.9 (224.0.0.9)
User Datagram Protocol, Src Port: 520 (520), Dst Port: 520 (520)
Routing Information Protocol

No.     Time           Source                Destination           Protocol Length Info
     43 351.681995000  10.0.4.3              224.0.0.9             RIPv2    106    Response

Frame 43: 106 bytes on wire (848 bits), 106 bytes captured (848 bits) on interface 0
Ethernet II, Src: Cisco_9c:0c:e1 (00:1f:ca:9c:0c:e1), Dst: IPv4mcast_00:00:09 (01:00:5e:00:00:09)
Internet Protocol Version 4, Src: 10.0.4.3 (10.0.4.3), Dst: 224.0.0.9 (224.0.0.9)
User Datagram Protocol, Src Port: 520 (520), Dst Port: 520 (520)
Routing Information Protocol

No.     Time           Source                Destination           Protocol Length Info
     45 380.878676000  10.0.4.3              224.0.0.9             RIPv2    106    Response

Frame 45: 106 bytes on wire (848 bits), 106 bytes captured (848 bits) on interface 0
Ethernet II, Src: Cisco_9c:0c:e1 (00:1f:ca:9c:0c:e1), Dst: IPv4mcast_00:00:09 (01:00:5e:00:00:09)
Internet Protocol Version 4, Src: 10.0.4.3 (10.0.4.3), Dst: 224.0.0.9 (224.0.0.9)
User Datagram Protocol, Src Port: 520 (520), Dst Port: 520 (520)
Routing Information Protocol

No.     Time           Source                Destination           Protocol Length Info
     49 406.963290000  10.0.4.3              224.0.0.9             RIPv2    106    Response

Frame 49: 106 bytes on wire (848 bits), 106 bytes captured (848 bits) on interface 0
Ethernet II, Src: Cisco_9c:0c:e1 (00:1f:ca:9c:0c:e1), Dst: IPv4mcast_00:00:09 (01:00:5e:00:00:09)
Internet Protocol Version 4, Src: 10.0.4.3 (10.0.4.3), Dst: 224.0.0.9 (224.0.0.9)
User Datagram Protocol, Src Port: 520 (520), Dst Port: 520 (520)
Routing Information Protocol

No.     Time           Source                Destination           Protocol Length Info
     51 434.803976000  10.0.4.3              224.0.0.9             RIPv2    106    Response

Frame 51: 106 bytes on wire (848 bits), 106 bytes captured (848 bits) on interface 0
Ethernet II, Src: Cisco_9c:0c:e1 (00:1f:ca:9c:0c:e1), Dst: IPv4mcast_00:00:09 (01:00:5e:00:00:09)
Internet Protocol Version 4, Src: 10.0.4.3 (10.0.4.3), Dst: 224.0.0.9 (224.0.0.9)
User Datagram Protocol, Src Port: 520 (520), Dst Port: 520 (520)
Routing Information Protocol
