No.     Time           Source                Destination           Protocol Length Info
      1 0.000000000    10.10.10.100          10.10.10.120          ICMP     98     Echo (ping) request  id=0x0cce, seq=1/256, ttl=64 (reply in 2)

Frame 1: 98 bytes on wire (784 bits), 98 bytes captured (784 bits) on interface 0
Ethernet II, Src: RealtekS_00:0a:10 (00:e0:4c:00:0a:10), Dst: RealtekS_00:0a:30 (00:e0:4c:00:0a:30)
Internet Protocol Version 4, Src: 10.10.10.100 (10.10.10.100), Dst: 10.10.10.120 (10.10.10.120)
Internet Control Message Protocol

No.     Time           Source                Destination           Protocol Length Info
      2 0.000313000    10.10.10.120          10.10.10.100          ICMP     98     Echo (ping) reply    id=0x0cce, seq=1/256, ttl=64 (request in 1)

Frame 2: 98 bytes on wire (784 bits), 98 bytes captured (784 bits) on interface 0
Ethernet II, Src: RealtekS_00:0a:30 (00:e0:4c:00:0a:30), Dst: RealtekS_00:0a:10 (00:e0:4c:00:0a:10)
Internet Protocol Version 4, Src: 10.10.10.120 (10.10.10.120), Dst: 10.10.10.100 (10.10.10.100)
Internet Control Message Protocol

No.     Time           Source                Destination           Protocol Length Info
      3 5.002773000    RealtekS_00:0a:10     RealtekS_00:0a:30     ARP      42     Who has 10.10.10.120?  Tell 10.10.10.100

Frame 3: 42 bytes on wire (336 bits), 42 bytes captured (336 bits) on interface 0
Ethernet II, Src: RealtekS_00:0a:10 (00:e0:4c:00:0a:10), Dst: RealtekS_00:0a:30 (00:e0:4c:00:0a:30)
Address Resolution Protocol (request)

No.     Time           Source                Destination           Protocol Length Info
      4 5.003056000    RealtekS_00:0a:30     RealtekS_00:0a:10     ARP      60     10.10.10.120 is at 00:e0:4c:00:0a:30

Frame 4: 60 bytes on wire (480 bits), 60 bytes captured (480 bits) on interface 0
Ethernet II, Src: RealtekS_00:0a:30 (00:e0:4c:00:0a:30), Dst: RealtekS_00:0a:10 (00:e0:4c:00:0a:10)
Address Resolution Protocol (reply)

No.     Time           Source                Destination           Protocol Length Info
      5 9.440798000    10.10.10.100          10.10.10.101          ICMP     98     Echo (ping) request  id=0x0ccf, seq=1/256, ttl=64 (reply in 6)

Frame 5: 98 bytes on wire (784 bits), 98 bytes captured (784 bits) on interface 0
Ethernet II, Src: RealtekS_00:0a:10 (00:e0:4c:00:0a:10), Dst: RealtekS_00:0a:20 (00:e0:4c:00:0a:20)
Internet Protocol Version 4, Src: 10.10.10.100 (10.10.10.100), Dst: 10.10.10.101 (10.10.10.101)
Internet Control Message Protocol

No.     Time           Source                Destination           Protocol Length Info
      6 9.440945000    10.10.10.101          10.10.10.100          ICMP     98     Echo (ping) reply    id=0x0ccf, seq=1/256, ttl=64 (request in 5)

Frame 6: 98 bytes on wire (784 bits), 98 bytes captured (784 bits) on interface 0
Ethernet II, Src: RealtekS_00:0a:20 (00:e0:4c:00:0a:20), Dst: RealtekS_00:0a:10 (00:e0:4c:00:0a:10)
Internet Protocol Version 4, Src: 10.10.10.101 (10.10.10.101), Dst: 10.10.10.100 (10.10.10.100)
Internet Control Message Protocol

No.     Time           Source                Destination           Protocol Length Info
      7 13.904338000   RealtekS_00:0a:10     Broadcast             ARP      42     Who has 10.10.10.121?  Tell 10.10.10.100

Frame 7: 42 bytes on wire (336 bits), 42 bytes captured (336 bits) on interface 0
Ethernet II, Src: RealtekS_00:0a:10 (00:e0:4c:00:0a:10), Dst: Broadcast (ff:ff:ff:ff:ff:ff)
Address Resolution Protocol (request)

No.     Time           Source                Destination           Protocol Length Info
      8 14.442782000   RealtekS_00:0a:10     RealtekS_00:0a:20     ARP      42     Who has 10.10.10.101?  Tell 10.10.10.100

Frame 8: 42 bytes on wire (336 bits), 42 bytes captured (336 bits) on interface 0
Ethernet II, Src: RealtekS_00:0a:10 (00:e0:4c:00:0a:10), Dst: RealtekS_00:0a:20 (00:e0:4c:00:0a:20)
Address Resolution Protocol (request)

No.     Time           Source                Destination           Protocol Length Info
      9 14.442913000   RealtekS_00:0a:20     RealtekS_00:0a:10     ARP      60     10.10.10.101 is at 00:e0:4c:00:0a:20

Frame 9: 60 bytes on wire (480 bits), 60 bytes captured (480 bits) on interface 0
Ethernet II, Src: RealtekS_00:0a:20 (00:e0:4c:00:0a:20), Dst: RealtekS_00:0a:10 (00:e0:4c:00:0a:10)
Address Resolution Protocol (reply)

No.     Time           Source                Destination           Protocol Length Info
     10 14.902770000   RealtekS_00:0a:10     Broadcast             ARP      42     Who has 10.10.10.121?  Tell 10.10.10.100

Frame 10: 42 bytes on wire (336 bits), 42 bytes captured (336 bits) on interface 0
Ethernet II, Src: RealtekS_00:0a:10 (00:e0:4c:00:0a:10), Dst: Broadcast (ff:ff:ff:ff:ff:ff)
Address Resolution Protocol (request)

No.     Time           Source                Destination           Protocol Length Info
     11 15.902779000   RealtekS_00:0a:10     Broadcast             ARP      42     Who has 10.10.10.121?  Tell 10.10.10.100

Frame 11: 42 bytes on wire (336 bits), 42 bytes captured (336 bits) on interface 0
Ethernet II, Src: RealtekS_00:0a:10 (00:e0:4c:00:0a:10), Dst: Broadcast (ff:ff:ff:ff:ff:ff)
Address Resolution Protocol (request)

No.     Time           Source                Destination           Protocol Length Info
     12 26.288048000   10.10.10.101          10.10.10.100          ICMP     98     Echo (ping) request  id=0x0e07, seq=1/256, ttl=64 (reply in 13)

Frame 12: 98 bytes on wire (784 bits), 98 bytes captured (784 bits) on interface 0
Ethernet II, Src: RealtekS_00:0a:20 (00:e0:4c:00:0a:20), Dst: RealtekS_00:0a:10 (00:e0:4c:00:0a:10)
Internet Protocol Version 4, Src: 10.10.10.101 (10.10.10.101), Dst: 10.10.10.100 (10.10.10.100)
Internet Control Message Protocol

No.     Time           Source                Destination           Protocol Length Info
     13 26.288082000   10.10.10.100          10.10.10.101          ICMP     98     Echo (ping) reply    id=0x0e07, seq=1/256, ttl=64 (request in 12)

Frame 13: 98 bytes on wire (784 bits), 98 bytes captured (784 bits) on interface 0
Ethernet II, Src: RealtekS_00:0a:10 (00:e0:4c:00:0a:10), Dst: RealtekS_00:0a:20 (00:e0:4c:00:0a:20)
Internet Protocol Version 4, Src: 10.10.10.100 (10.10.10.100), Dst: 10.10.10.101 (10.10.10.101)
Internet Control Message Protocol

No.     Time           Source                Destination           Protocol Length Info
     14 31.288062000   RealtekS_00:0a:20     RealtekS_00:0a:10     ARP      60     Who has 10.10.10.100?  Tell 10.10.10.101

Frame 14: 60 bytes on wire (480 bits), 60 bytes captured (480 bits) on interface 0
Ethernet II, Src: RealtekS_00:0a:20 (00:e0:4c:00:0a:20), Dst: RealtekS_00:0a:10 (00:e0:4c:00:0a:10)
Address Resolution Protocol (request)

No.     Time           Source                Destination           Protocol Length Info
     15 31.288086000   RealtekS_00:0a:10     RealtekS_00:0a:20     ARP      42     10.10.10.100 is at 00:e0:4c:00:0a:10

Frame 15: 42 bytes on wire (336 bits), 42 bytes captured (336 bits) on interface 0
Ethernet II, Src: RealtekS_00:0a:10 (00:e0:4c:00:0a:10), Dst: RealtekS_00:0a:20 (00:e0:4c:00:0a:20)
Address Resolution Protocol (reply)

No.     Time           Source                Destination           Protocol Length Info
     16 49.600137000   10.10.10.101          10.10.10.100          ICMP     98     Echo (ping) request  id=0x0e09, seq=1/256, ttl=64 (reply in 17)

Frame 16: 98 bytes on wire (784 bits), 98 bytes captured (784 bits) on interface 0
Ethernet II, Src: RealtekS_00:0a:20 (00:e0:4c:00:0a:20), Dst: RealtekS_00:0a:10 (00:e0:4c:00:0a:10)
Internet Protocol Version 4, Src: 10.10.10.101 (10.10.10.101), Dst: 10.10.10.100 (10.10.10.100)
Internet Control Message Protocol

No.     Time           Source                Destination           Protocol Length Info
     17 49.600185000   10.10.10.100          10.10.10.101          ICMP     98     Echo (ping) reply    id=0x0e09, seq=1/256, ttl=64 (request in 16)

Frame 17: 98 bytes on wire (784 bits), 98 bytes captured (784 bits) on interface 0
Ethernet II, Src: RealtekS_00:0a:10 (00:e0:4c:00:0a:10), Dst: RealtekS_00:0a:20 (00:e0:4c:00:0a:20)
Internet Protocol Version 4, Src: 10.10.10.100 (10.10.10.100), Dst: 10.10.10.101 (10.10.10.101)
Internet Control Message Protocol

No.     Time           Source                Destination           Protocol Length Info
     18 50.599802000   10.10.10.101          10.10.10.100          ICMP     98     Echo (ping) request  id=0x0e09, seq=2/512, ttl=64 (reply in 19)

Frame 18: 98 bytes on wire (784 bits), 98 bytes captured (784 bits) on interface 0
Ethernet II, Src: RealtekS_00:0a:20 (00:e0:4c:00:0a:20), Dst: RealtekS_00:0a:10 (00:e0:4c:00:0a:10)
Internet Protocol Version 4, Src: 10.10.10.101 (10.10.10.101), Dst: 10.10.10.100 (10.10.10.100)
Internet Control Message Protocol

No.     Time           Source                Destination           Protocol Length Info
     19 50.599840000   10.10.10.100          10.10.10.101          ICMP     98     Echo (ping) reply    id=0x0e09, seq=2/512, ttl=64 (request in 18)

Frame 19: 98 bytes on wire (784 bits), 98 bytes captured (784 bits) on interface 0
Ethernet II, Src: RealtekS_00:0a:10 (00:e0:4c:00:0a:10), Dst: RealtekS_00:0a:20 (00:e0:4c:00:0a:20)
Internet Protocol Version 4, Src: 10.10.10.100 (10.10.10.100), Dst: 10.10.10.101 (10.10.10.101)
Internet Control Message Protocol

No.     Time           Source                Destination           Protocol Length Info
     20 51.599775000   10.10.10.101          10.10.10.100          ICMP     98     Echo (ping) request  id=0x0e09, seq=3/768, ttl=64 (reply in 21)

Frame 20: 98 bytes on wire (784 bits), 98 bytes captured (784 bits) on interface 0
Ethernet II, Src: RealtekS_00:0a:20 (00:e0:4c:00:0a:20), Dst: RealtekS_00:0a:10 (00:e0:4c:00:0a:10)
Internet Protocol Version 4, Src: 10.10.10.101 (10.10.10.101), Dst: 10.10.10.100 (10.10.10.100)
Internet Control Message Protocol

No.     Time           Source                Destination           Protocol Length Info
     21 51.599814000   10.10.10.100          10.10.10.101          ICMP     98     Echo (ping) reply    id=0x0e09, seq=3/768, ttl=64 (request in 20)

Frame 21: 98 bytes on wire (784 bits), 98 bytes captured (784 bits) on interface 0
Ethernet II, Src: RealtekS_00:0a:10 (00:e0:4c:00:0a:10), Dst: RealtekS_00:0a:20 (00:e0:4c:00:0a:20)
Internet Protocol Version 4, Src: 10.10.10.100 (10.10.10.100), Dst: 10.10.10.101 (10.10.10.101)
Internet Control Message Protocol

No.     Time           Source                Destination           Protocol Length Info
     22 52.599760000   10.10.10.101          10.10.10.100          ICMP     98     Echo (ping) request  id=0x0e09, seq=4/1024, ttl=64 (reply in 23)

Frame 22: 98 bytes on wire (784 bits), 98 bytes captured (784 bits) on interface 0
Ethernet II, Src: RealtekS_00:0a:20 (00:e0:4c:00:0a:20), Dst: RealtekS_00:0a:10 (00:e0:4c:00:0a:10)
Internet Protocol Version 4, Src: 10.10.10.101 (10.10.10.101), Dst: 10.10.10.100 (10.10.10.100)
Internet Control Message Protocol

No.     Time           Source                Destination           Protocol Length Info
     23 52.599798000   10.10.10.100          10.10.10.101          ICMP     98     Echo (ping) reply    id=0x0e09, seq=4/1024, ttl=64 (request in 22)

Frame 23: 98 bytes on wire (784 bits), 98 bytes captured (784 bits) on interface 0
Ethernet II, Src: RealtekS_00:0a:10 (00:e0:4c:00:0a:10), Dst: RealtekS_00:0a:20 (00:e0:4c:00:0a:20)
Internet Protocol Version 4, Src: 10.10.10.100 (10.10.10.100), Dst: 10.10.10.101 (10.10.10.101)
Internet Control Message Protocol

No.     Time           Source                Destination           Protocol Length Info
     24 53.599746000   10.10.10.101          10.10.10.100          ICMP     98     Echo (ping) request  id=0x0e09, seq=5/1280, ttl=64 (reply in 25)

Frame 24: 98 bytes on wire (784 bits), 98 bytes captured (784 bits) on interface 0
Ethernet II, Src: RealtekS_00:0a:20 (00:e0:4c:00:0a:20), Dst: RealtekS_00:0a:10 (00:e0:4c:00:0a:10)
Internet Protocol Version 4, Src: 10.10.10.101 (10.10.10.101), Dst: 10.10.10.100 (10.10.10.100)
Internet Control Message Protocol

No.     Time           Source                Destination           Protocol Length Info
     25 53.599785000   10.10.10.100          10.10.10.101          ICMP     98     Echo (ping) reply    id=0x0e09, seq=5/1280, ttl=64 (request in 24)

Frame 25: 98 bytes on wire (784 bits), 98 bytes captured (784 bits) on interface 0
Ethernet II, Src: RealtekS_00:0a:10 (00:e0:4c:00:0a:10), Dst: RealtekS_00:0a:20 (00:e0:4c:00:0a:20)
Internet Protocol Version 4, Src: 10.10.10.100 (10.10.10.100), Dst: 10.10.10.101 (10.10.10.101)
Internet Control Message Protocol

No.     Time           Source                Destination           Protocol Length Info
     26 54.599728000   10.10.10.101          10.10.10.100          ICMP     98     Echo (ping) request  id=0x0e09, seq=6/1536, ttl=64 (reply in 27)

Frame 26: 98 bytes on wire (784 bits), 98 bytes captured (784 bits) on interface 0
Ethernet II, Src: RealtekS_00:0a:20 (00:e0:4c:00:0a:20), Dst: RealtekS_00:0a:10 (00:e0:4c:00:0a:10)
Internet Protocol Version 4, Src: 10.10.10.101 (10.10.10.101), Dst: 10.10.10.100 (10.10.10.100)
Internet Control Message Protocol

No.     Time           Source                Destination           Protocol Length Info
     27 54.599765000   10.10.10.100          10.10.10.101          ICMP     98     Echo (ping) reply    id=0x0e09, seq=6/1536, ttl=64 (request in 26)

Frame 27: 98 bytes on wire (784 bits), 98 bytes captured (784 bits) on interface 0
Ethernet II, Src: RealtekS_00:0a:10 (00:e0:4c:00:0a:10), Dst: RealtekS_00:0a:20 (00:e0:4c:00:0a:20)
Internet Protocol Version 4, Src: 10.10.10.100 (10.10.10.100), Dst: 10.10.10.101 (10.10.10.101)
Internet Control Message Protocol

No.     Time           Source                Destination           Protocol Length Info
     28 55.599714000   10.10.10.101          10.10.10.100          ICMP     98     Echo (ping) request  id=0x0e09, seq=7/1792, ttl=64 (reply in 29)

Frame 28: 98 bytes on wire (784 bits), 98 bytes captured (784 bits) on interface 0
Ethernet II, Src: RealtekS_00:0a:20 (00:e0:4c:00:0a:20), Dst: RealtekS_00:0a:10 (00:e0:4c:00:0a:10)
Internet Protocol Version 4, Src: 10.10.10.101 (10.10.10.101), Dst: 10.10.10.100 (10.10.10.100)
Internet Control Message Protocol

No.     Time           Source                Destination           Protocol Length Info
     29 55.599755000   10.10.10.100          10.10.10.101          ICMP     98     Echo (ping) reply    id=0x0e09, seq=7/1792, ttl=64 (request in 28)

Frame 29: 98 bytes on wire (784 bits), 98 bytes captured (784 bits) on interface 0
Ethernet II, Src: RealtekS_00:0a:10 (00:e0:4c:00:0a:10), Dst: RealtekS_00:0a:20 (00:e0:4c:00:0a:20)
Internet Protocol Version 4, Src: 10.10.10.100 (10.10.10.100), Dst: 10.10.10.101 (10.10.10.101)
Internet Control Message Protocol
