No.     Time           Source                Destination           Protocol Length Info
     13 18.016357000   10.0.1.11             10.0.1.12             TCP      74     38936 > 23 [SYN] Seq=0 Win=29200 Len=0 MSS=1460 SACK_PERM=1 TSval=465712 TSecr=0 WS=128

Frame 13: 74 bytes on wire (592 bits), 74 bytes captured (592 bits) on interface 0
Ethernet II, Src: RealtekS_00:0a:10 (00:e0:4c:00:0a:10), Dst: RealtekS_00:0a:20 (00:e0:4c:00:0a:20)
Internet Protocol Version 4, Src: 10.0.1.11 (10.0.1.11), Dst: 10.0.1.12 (10.0.1.12)
Transmission Control Protocol, Src Port: 38936 (38936), Dst Port: 23 (23), Seq: 0, Len: 0

No.     Time           Source                Destination           Protocol Length Info
     14 18.016399000   10.0.1.12             10.0.1.11             TCP      74     23 > 38936 [SYN, ACK] Seq=0 Ack=1 Win=28960 Len=0 MSS=1460 SACK_PERM=1 TSval=466063 TSecr=465712 WS=128

Frame 14: 74 bytes on wire (592 bits), 74 bytes captured (592 bits) on interface 0
Ethernet II, Src: RealtekS_00:0a:20 (00:e0:4c:00:0a:20), Dst: RealtekS_00:0a:10 (00:e0:4c:00:0a:10)
Internet Protocol Version 4, Src: 10.0.1.12 (10.0.1.12), Dst: 10.0.1.11 (10.0.1.11)
Transmission Control Protocol, Src Port: 23 (23), Dst Port: 38936 (38936), Seq: 0, Ack: 1, Len: 0

No.     Time           Source                Destination           Protocol Length Info
     15 18.016532000   10.0.1.11             10.0.1.12             TCP      66     38936 > 23 [ACK] Seq=1 Ack=1 Win=29312 Len=0 TSval=465712 TSecr=466063

Frame 15: 66 bytes on wire (528 bits), 66 bytes captured (528 bits) on interface 0
Ethernet II, Src: RealtekS_00:0a:10 (00:e0:4c:00:0a:10), Dst: RealtekS_00:0a:20 (00:e0:4c:00:0a:20)
Internet Protocol Version 4, Src: 10.0.1.11 (10.0.1.11), Dst: 10.0.1.12 (10.0.1.12)
Transmission Control Protocol, Src Port: 38936 (38936), Dst Port: 23 (23), Seq: 1, Ack: 1, Len: 0

No.     Time           Source                Destination           Protocol Length Info
     16 18.017164000   10.0.1.11             10.0.1.12             TELNET   93     Telnet Data ...

Frame 16: 93 bytes on wire (744 bits), 93 bytes captured (744 bits) on interface 0
Ethernet II, Src: RealtekS_00:0a:10 (00:e0:4c:00:0a:10), Dst: RealtekS_00:0a:20 (00:e0:4c:00:0a:20)
Internet Protocol Version 4, Src: 10.0.1.11 (10.0.1.11), Dst: 10.0.1.12 (10.0.1.12)
Transmission Control Protocol, Src Port: 38936 (38936), Dst Port: 23 (23), Seq: 1, Ack: 1, Len: 27
Telnet

No.     Time           Source                Destination           Protocol Length Info
     17 18.017183000   10.0.1.12             10.0.1.11             TCP      66     23 > 38936 [ACK] Seq=1 Ack=28 Win=29056 Len=0 TSval=466063 TSecr=465712

Frame 17: 66 bytes on wire (528 bits), 66 bytes captured (528 bits) on interface 0
Ethernet II, Src: RealtekS_00:0a:20 (00:e0:4c:00:0a:20), Dst: RealtekS_00:0a:10 (00:e0:4c:00:0a:10)
Internet Protocol Version 4, Src: 10.0.1.12 (10.0.1.12), Dst: 10.0.1.11 (10.0.1.11)
Transmission Control Protocol, Src Port: 23 (23), Dst Port: 38936 (38936), Seq: 1, Ack: 28, Len: 0

No.     Time           Source                Destination           Protocol Length Info
     18 18.096706000   10.0.1.12             10.0.1.11             TELNET   78     Telnet Data ...

Frame 18: 78 bytes on wire (624 bits), 78 bytes captured (624 bits) on interface 0
Ethernet II, Src: RealtekS_00:0a:20 (00:e0:4c:00:0a:20), Dst: RealtekS_00:0a:10 (00:e0:4c:00:0a:10)
Internet Protocol Version 4, Src: 10.0.1.12 (10.0.1.12), Dst: 10.0.1.11 (10.0.1.11)
Transmission Control Protocol, Src Port: 23 (23), Dst Port: 38936 (38936), Seq: 1, Ack: 28, Len: 12
Telnet

No.     Time           Source                Destination           Protocol Length Info
     19 18.096843000   10.0.1.11             10.0.1.12             TCP      66     38936 > 23 [ACK] Seq=28 Ack=13 Win=29312 Len=0 TSval=465732 TSecr=466083

Frame 19: 66 bytes on wire (528 bits), 66 bytes captured (528 bits) on interface 0
Ethernet II, Src: RealtekS_00:0a:10 (00:e0:4c:00:0a:10), Dst: RealtekS_00:0a:20 (00:e0:4c:00:0a:20)
Internet Protocol Version 4, Src: 10.0.1.11 (10.0.1.11), Dst: 10.0.1.12 (10.0.1.12)
Transmission Control Protocol, Src Port: 38936 (38936), Dst Port: 23 (23), Seq: 28, Ack: 13, Len: 0

No.     Time           Source                Destination           Protocol Length Info
     20 18.096884000   10.0.1.12             10.0.1.11             TELNET   105    Telnet Data ...

Frame 20: 105 bytes on wire (840 bits), 105 bytes captured (840 bits) on interface 0
Ethernet II, Src: RealtekS_00:0a:20 (00:e0:4c:00:0a:20), Dst: RealtekS_00:0a:10 (00:e0:4c:00:0a:10)
Internet Protocol Version 4, Src: 10.0.1.12 (10.0.1.12), Dst: 10.0.1.11 (10.0.1.11)
Transmission Control Protocol, Src Port: 23 (23), Dst Port: 38936 (38936), Seq: 13, Ack: 28, Len: 39
Telnet

No.     Time           Source                Destination           Protocol Length Info
     21 18.096978000   10.0.1.11             10.0.1.12             TCP      66     38936 > 23 [ACK] Seq=28 Ack=52 Win=29312 Len=0 TSval=465732 TSecr=466083

Frame 21: 66 bytes on wire (528 bits), 66 bytes captured (528 bits) on interface 0
Ethernet II, Src: RealtekS_00:0a:10 (00:e0:4c:00:0a:10), Dst: RealtekS_00:0a:20 (00:e0:4c:00:0a:20)
Internet Protocol Version 4, Src: 10.0.1.11 (10.0.1.11), Dst: 10.0.1.12 (10.0.1.12)
Transmission Control Protocol, Src Port: 38936 (38936), Dst Port: 23 (23), Seq: 28, Ack: 52, Len: 0

No.     Time           Source                Destination           Protocol Length Info
     22 18.097089000   10.0.1.11             10.0.1.12             TELNET   134    Telnet Data ...

Frame 22: 134 bytes on wire (1072 bits), 134 bytes captured (1072 bits) on interface 0
Ethernet II, Src: RealtekS_00:0a:10 (00:e0:4c:00:0a:10), Dst: RealtekS_00:0a:20 (00:e0:4c:00:0a:20)
Internet Protocol Version 4, Src: 10.0.1.11 (10.0.1.11), Dst: 10.0.1.12 (10.0.1.12)
Transmission Control Protocol, Src Port: 38936 (38936), Dst Port: 23 (23), Seq: 28, Ack: 52, Len: 68
Telnet

No.     Time           Source                Destination           Protocol Length Info
     23 18.097110000   10.0.1.12             10.0.1.11             TCP      66     23 > 38936 [ACK] Seq=52 Ack=96 Win=29056 Len=0 TSval=466083 TSecr=465732

Frame 23: 66 bytes on wire (528 bits), 66 bytes captured (528 bits) on interface 0
Ethernet II, Src: RealtekS_00:0a:20 (00:e0:4c:00:0a:20), Dst: RealtekS_00:0a:10 (00:e0:4c:00:0a:10)
Internet Protocol Version 4, Src: 10.0.1.12 (10.0.1.12), Dst: 10.0.1.11 (10.0.1.11)
Transmission Control Protocol, Src Port: 23 (23), Dst Port: 38936 (38936), Seq: 52, Ack: 96, Len: 0

No.     Time           Source                Destination           Protocol Length Info
     24 18.097414000   10.0.1.12             10.0.1.11             TELNET   69     Telnet Data ...

Frame 24: 69 bytes on wire (552 bits), 69 bytes captured (552 bits) on interface 0
Ethernet II, Src: RealtekS_00:0a:20 (00:e0:4c:00:0a:20), Dst: RealtekS_00:0a:10 (00:e0:4c:00:0a:10)
Internet Protocol Version 4, Src: 10.0.1.12 (10.0.1.12), Dst: 10.0.1.11 (10.0.1.11)
Transmission Control Protocol, Src Port: 23 (23), Dst Port: 38936 (38936), Seq: 52, Ack: 96, Len: 3
Telnet

No.     Time           Source                Destination           Protocol Length Info
     25 18.097518000   10.0.1.11             10.0.1.12             TELNET   69     Telnet Data ...

Frame 25: 69 bytes on wire (552 bits), 69 bytes captured (552 bits) on interface 0
Ethernet II, Src: RealtekS_00:0a:10 (00:e0:4c:00:0a:10), Dst: RealtekS_00:0a:20 (00:e0:4c:00:0a:20)
Internet Protocol Version 4, Src: 10.0.1.11 (10.0.1.11), Dst: 10.0.1.12 (10.0.1.12)
Transmission Control Protocol, Src Port: 38936 (38936), Dst Port: 23 (23), Seq: 96, Ack: 55, Len: 3
Telnet

No.     Time           Source                Destination           Protocol Length Info
     26 18.106670000   10.0.1.12             10.0.1.11             TELNET   69     Telnet Data ...

Frame 26: 69 bytes on wire (552 bits), 69 bytes captured (552 bits) on interface 0
Ethernet II, Src: RealtekS_00:0a:20 (00:e0:4c:00:0a:20), Dst: RealtekS_00:0a:10 (00:e0:4c:00:0a:10)
Internet Protocol Version 4, Src: 10.0.1.12 (10.0.1.12), Dst: 10.0.1.11 (10.0.1.11)
Transmission Control Protocol, Src Port: 23 (23), Dst Port: 38936 (38936), Seq: 55, Ack: 99, Len: 3
Telnet

No.     Time           Source                Destination           Protocol Length Info
     27 18.106811000   10.0.1.11             10.0.1.12             TELNET   69     Telnet Data ...

Frame 27: 69 bytes on wire (552 bits), 69 bytes captured (552 bits) on interface 0
Ethernet II, Src: RealtekS_00:0a:10 (00:e0:4c:00:0a:10), Dst: RealtekS_00:0a:20 (00:e0:4c:00:0a:20)
Internet Protocol Version 4, Src: 10.0.1.11 (10.0.1.11), Dst: 10.0.1.12 (10.0.1.12)
Transmission Control Protocol, Src Port: 38936 (38936), Dst Port: 23 (23), Seq: 99, Ack: 58, Len: 3
Telnet

No.     Time           Source                Destination           Protocol Length Info
     28 18.106835000   10.0.1.12             10.0.1.11             TELNET   86     Telnet Data ...

Frame 28: 86 bytes on wire (688 bits), 86 bytes captured (688 bits) on interface 0
Ethernet II, Src: RealtekS_00:0a:20 (00:e0:4c:00:0a:20), Dst: RealtekS_00:0a:10 (00:e0:4c:00:0a:10)
Internet Protocol Version 4, Src: 10.0.1.12 (10.0.1.12), Dst: 10.0.1.11 (10.0.1.11)
Transmission Control Protocol, Src Port: 23 (23), Dst Port: 38936 (38936), Seq: 58, Ack: 102, Len: 20
Telnet

No.     Time           Source                Destination           Protocol Length Info
     29 18.143719000   10.0.1.11             10.0.1.12             TCP      66     38936 > 23 [ACK] Seq=102 Ack=78 Win=29312 Len=0 TSval=465744 TSecr=466086

Frame 29: 66 bytes on wire (528 bits), 66 bytes captured (528 bits) on interface 0
Ethernet II, Src: RealtekS_00:0a:10 (00:e0:4c:00:0a:10), Dst: RealtekS_00:0a:20 (00:e0:4c:00:0a:20)
Internet Protocol Version 4, Src: 10.0.1.11 (10.0.1.11), Dst: 10.0.1.12 (10.0.1.12)
Transmission Control Protocol, Src Port: 38936 (38936), Dst Port: 23 (23), Seq: 102, Ack: 78, Len: 0

No.     Time           Source                Destination           Protocol Length Info
     30 18.203059000   10.0.1.12             10.0.1.11             TELNET   77     Telnet Data ...

Frame 30: 77 bytes on wire (616 bits), 77 bytes captured (616 bits) on interface 0
Ethernet II, Src: RealtekS_00:0a:20 (00:e0:4c:00:0a:20), Dst: RealtekS_00:0a:10 (00:e0:4c:00:0a:10)
Internet Protocol Version 4, Src: 10.0.1.12 (10.0.1.12), Dst: 10.0.1.11 (10.0.1.11)
Transmission Control Protocol, Src Port: 23 (23), Dst Port: 38936 (38936), Seq: 78, Ack: 102, Len: 11
Telnet

No.     Time           Source                Destination           Protocol Length Info
     31 18.203182000   10.0.1.11             10.0.1.12             TCP      66     38936 > 23 [ACK] Seq=102 Ack=89 Win=29312 Len=0 TSval=465758 TSecr=466110

Frame 31: 66 bytes on wire (528 bits), 66 bytes captured (528 bits) on interface 0
Ethernet II, Src: RealtekS_00:0a:10 (00:e0:4c:00:0a:10), Dst: RealtekS_00:0a:20 (00:e0:4c:00:0a:20)
Internet Protocol Version 4, Src: 10.0.1.11 (10.0.1.11), Dst: 10.0.1.12 (10.0.1.12)
Transmission Control Protocol, Src Port: 38936 (38936), Dst Port: 23 (23), Seq: 102, Ack: 89, Len: 0

No.     Time           Source                Destination           Protocol Length Info
     32 21.717882000   10.0.1.11             10.0.1.12             TELNET   67     Telnet Data ...

Frame 32: 67 bytes on wire (536 bits), 67 bytes captured (536 bits) on interface 0
Ethernet II, Src: RealtekS_00:0a:10 (00:e0:4c:00:0a:10), Dst: RealtekS_00:0a:20 (00:e0:4c:00:0a:20)
Internet Protocol Version 4, Src: 10.0.1.11 (10.0.1.11), Dst: 10.0.1.12 (10.0.1.12)
Transmission Control Protocol, Src Port: 38936 (38936), Dst Port: 23 (23), Seq: 102, Ack: 89, Len: 1
Telnet

No.     Time           Source                Destination           Protocol Length Info
     33 21.718002000   10.0.1.12             10.0.1.11             TELNET   67     Telnet Data ...

Frame 33: 67 bytes on wire (536 bits), 67 bytes captured (536 bits) on interface 0
Ethernet II, Src: RealtekS_00:0a:20 (00:e0:4c:00:0a:20), Dst: RealtekS_00:0a:10 (00:e0:4c:00:0a:10)
Internet Protocol Version 4, Src: 10.0.1.12 (10.0.1.12), Dst: 10.0.1.11 (10.0.1.11)
Transmission Control Protocol, Src Port: 23 (23), Dst Port: 38936 (38936), Seq: 89, Ack: 103, Len: 1
Telnet

No.     Time           Source                Destination           Protocol Length Info
     34 21.718098000   10.0.1.11             10.0.1.12             TCP      66     38936 > 23 [ACK] Seq=103 Ack=90 Win=29312 Len=0 TSval=466637 TSecr=466989

Frame 34: 66 bytes on wire (528 bits), 66 bytes captured (528 bits) on interface 0
Ethernet II, Src: RealtekS_00:0a:10 (00:e0:4c:00:0a:10), Dst: RealtekS_00:0a:20 (00:e0:4c:00:0a:20)
Internet Protocol Version 4, Src: 10.0.1.11 (10.0.1.11), Dst: 10.0.1.12 (10.0.1.12)
Transmission Control Protocol, Src Port: 38936 (38936), Dst Port: 23 (23), Seq: 103, Ack: 90, Len: 0

No.     Time           Source                Destination           Protocol Length Info
     35 21.903414000   10.0.1.11             10.0.1.12             TELNET   67     Telnet Data ...

Frame 35: 67 bytes on wire (536 bits), 67 bytes captured (536 bits) on interface 0
Ethernet II, Src: RealtekS_00:0a:10 (00:e0:4c:00:0a:10), Dst: RealtekS_00:0a:20 (00:e0:4c:00:0a:20)
Internet Protocol Version 4, Src: 10.0.1.11 (10.0.1.11), Dst: 10.0.1.12 (10.0.1.12)
Transmission Control Protocol, Src Port: 38936 (38936), Dst Port: 23 (23), Seq: 103, Ack: 90, Len: 1
Telnet

No.     Time           Source                Destination           Protocol Length Info
     36 21.903526000   10.0.1.12             10.0.1.11             TELNET   67     Telnet Data ...

Frame 36: 67 bytes on wire (536 bits), 67 bytes captured (536 bits) on interface 0
Ethernet II, Src: RealtekS_00:0a:20 (00:e0:4c:00:0a:20), Dst: RealtekS_00:0a:10 (00:e0:4c:00:0a:10)
Internet Protocol Version 4, Src: 10.0.1.12 (10.0.1.12), Dst: 10.0.1.11 (10.0.1.11)
Transmission Control Protocol, Src Port: 23 (23), Dst Port: 38936 (38936), Seq: 90, Ack: 104, Len: 1
Telnet

No.     Time           Source                Destination           Protocol Length Info
     37 21.903621000   10.0.1.11             10.0.1.12             TCP      66     38936 > 23 [ACK] Seq=104 Ack=91 Win=29312 Len=0 TSval=466683 TSecr=467035

Frame 37: 66 bytes on wire (528 bits), 66 bytes captured (528 bits) on interface 0
Ethernet II, Src: RealtekS_00:0a:10 (00:e0:4c:00:0a:10), Dst: RealtekS_00:0a:20 (00:e0:4c:00:0a:20)
Internet Protocol Version 4, Src: 10.0.1.11 (10.0.1.11), Dst: 10.0.1.12 (10.0.1.12)
Transmission Control Protocol, Src Port: 38936 (38936), Dst Port: 23 (23), Seq: 104, Ack: 91, Len: 0

No.     Time           Source                Destination           Protocol Length Info
     38 22.062965000   10.0.1.11             10.0.1.12             TELNET   67     Telnet Data ...

Frame 38: 67 bytes on wire (536 bits), 67 bytes captured (536 bits) on interface 0
Ethernet II, Src: RealtekS_00:0a:10 (00:e0:4c:00:0a:10), Dst: RealtekS_00:0a:20 (00:e0:4c:00:0a:20)
Internet Protocol Version 4, Src: 10.0.1.11 (10.0.1.11), Dst: 10.0.1.12 (10.0.1.12)
Transmission Control Protocol, Src Port: 38936 (38936), Dst Port: 23 (23), Seq: 104, Ack: 91, Len: 1
Telnet

No.     Time           Source                Destination           Protocol Length Info
     39 22.063022000   10.0.1.12             10.0.1.11             TELNET   67     Telnet Data ...

Frame 39: 67 bytes on wire (536 bits), 67 bytes captured (536 bits) on interface 0
Ethernet II, Src: RealtekS_00:0a:20 (00:e0:4c:00:0a:20), Dst: RealtekS_00:0a:10 (00:e0:4c:00:0a:10)
Internet Protocol Version 4, Src: 10.0.1.12 (10.0.1.12), Dst: 10.0.1.11 (10.0.1.11)
Transmission Control Protocol, Src Port: 23 (23), Dst Port: 38936 (38936), Seq: 91, Ack: 105, Len: 1
Telnet

No.     Time           Source                Destination           Protocol Length Info
     40 22.063115000   10.0.1.11             10.0.1.12             TCP      66     38936 > 23 [ACK] Seq=105 Ack=92 Win=29312 Len=0 TSval=466723 TSecr=467075

Frame 40: 66 bytes on wire (528 bits), 66 bytes captured (528 bits) on interface 0
Ethernet II, Src: RealtekS_00:0a:10 (00:e0:4c:00:0a:10), Dst: RealtekS_00:0a:20 (00:e0:4c:00:0a:20)
Internet Protocol Version 4, Src: 10.0.1.11 (10.0.1.11), Dst: 10.0.1.12 (10.0.1.12)
Transmission Control Protocol, Src Port: 38936 (38936), Dst Port: 23 (23), Seq: 105, Ack: 92, Len: 0

No.     Time           Source                Destination           Protocol Length Info
     41 22.239055000   10.0.1.11             10.0.1.12             TELNET   67     Telnet Data ...

Frame 41: 67 bytes on wire (536 bits), 67 bytes captured (536 bits) on interface 0
Ethernet II, Src: RealtekS_00:0a:10 (00:e0:4c:00:0a:10), Dst: RealtekS_00:0a:20 (00:e0:4c:00:0a:20)
Internet Protocol Version 4, Src: 10.0.1.11 (10.0.1.11), Dst: 10.0.1.12 (10.0.1.12)
Transmission Control Protocol, Src Port: 38936 (38936), Dst Port: 23 (23), Seq: 105, Ack: 92, Len: 1
Telnet

No.     Time           Source                Destination           Protocol Length Info
     42 22.239111000   10.0.1.12             10.0.1.11             TELNET   67     Telnet Data ...

Frame 42: 67 bytes on wire (536 bits), 67 bytes captured (536 bits) on interface 0
Ethernet II, Src: RealtekS_00:0a:20 (00:e0:4c:00:0a:20), Dst: RealtekS_00:0a:10 (00:e0:4c:00:0a:10)
Internet Protocol Version 4, Src: 10.0.1.12 (10.0.1.12), Dst: 10.0.1.11 (10.0.1.11)
Transmission Control Protocol, Src Port: 23 (23), Dst Port: 38936 (38936), Seq: 92, Ack: 106, Len: 1
Telnet

No.     Time           Source                Destination           Protocol Length Info
     43 22.239204000   10.0.1.11             10.0.1.12             TCP      66     38936 > 23 [ACK] Seq=106 Ack=93 Win=29312 Len=0 TSval=466767 TSecr=467119

Frame 43: 66 bytes on wire (528 bits), 66 bytes captured (528 bits) on interface 0
Ethernet II, Src: RealtekS_00:0a:10 (00:e0:4c:00:0a:10), Dst: RealtekS_00:0a:20 (00:e0:4c:00:0a:20)
Internet Protocol Version 4, Src: 10.0.1.11 (10.0.1.11), Dst: 10.0.1.12 (10.0.1.12)
Transmission Control Protocol, Src Port: 38936 (38936), Dst Port: 23 (23), Seq: 106, Ack: 93, Len: 0

No.     Time           Source                Destination           Protocol Length Info
     44 22.463065000   10.0.1.11             10.0.1.12             TELNET   67     Telnet Data ...

Frame 44: 67 bytes on wire (536 bits), 67 bytes captured (536 bits) on interface 0
Ethernet II, Src: RealtekS_00:0a:10 (00:e0:4c:00:0a:10), Dst: RealtekS_00:0a:20 (00:e0:4c:00:0a:20)
Internet Protocol Version 4, Src: 10.0.1.11 (10.0.1.11), Dst: 10.0.1.12 (10.0.1.12)
Transmission Control Protocol, Src Port: 38936 (38936), Dst Port: 23 (23), Seq: 106, Ack: 93, Len: 1
Telnet

No.     Time           Source                Destination           Protocol Length Info
     45 22.463184000   10.0.1.12             10.0.1.11             TELNET   67     Telnet Data ...

Frame 45: 67 bytes on wire (536 bits), 67 bytes captured (536 bits) on interface 0
Ethernet II, Src: RealtekS_00:0a:20 (00:e0:4c:00:0a:20), Dst: RealtekS_00:0a:10 (00:e0:4c:00:0a:10)
Internet Protocol Version 4, Src: 10.0.1.12 (10.0.1.12), Dst: 10.0.1.11 (10.0.1.11)
Transmission Control Protocol, Src Port: 23 (23), Dst Port: 38936 (38936), Seq: 93, Ack: 107, Len: 1
Telnet

No.     Time           Source                Destination           Protocol Length Info
     46 22.463280000   10.0.1.11             10.0.1.12             TCP      66     38936 > 23 [ACK] Seq=107 Ack=94 Win=29312 Len=0 TSval=466823 TSecr=467175

Frame 46: 66 bytes on wire (528 bits), 66 bytes captured (528 bits) on interface 0
Ethernet II, Src: RealtekS_00:0a:10 (00:e0:4c:00:0a:10), Dst: RealtekS_00:0a:20 (00:e0:4c:00:0a:20)
Internet Protocol Version 4, Src: 10.0.1.11 (10.0.1.11), Dst: 10.0.1.12 (10.0.1.12)
Transmission Control Protocol, Src Port: 38936 (38936), Dst Port: 23 (23), Seq: 107, Ack: 94, Len: 0

No.     Time           Source                Destination           Protocol Length Info
     47 22.577018000   10.0.1.11             10.0.1.12             TELNET   67     Telnet Data ...

Frame 47: 67 bytes on wire (536 bits), 67 bytes captured (536 bits) on interface 0
Ethernet II, Src: RealtekS_00:0a:10 (00:e0:4c:00:0a:10), Dst: RealtekS_00:0a:20 (00:e0:4c:00:0a:20)
Internet Protocol Version 4, Src: 10.0.1.11 (10.0.1.11), Dst: 10.0.1.12 (10.0.1.12)
Transmission Control Protocol, Src Port: 38936 (38936), Dst Port: 23 (23), Seq: 107, Ack: 94, Len: 1
Telnet

No.     Time           Source                Destination           Protocol Length Info
     48 22.577075000   10.0.1.12             10.0.1.11             TELNET   67     Telnet Data ...

Frame 48: 67 bytes on wire (536 bits), 67 bytes captured (536 bits) on interface 0
Ethernet II, Src: RealtekS_00:0a:20 (00:e0:4c:00:0a:20), Dst: RealtekS_00:0a:10 (00:e0:4c:00:0a:10)
Internet Protocol Version 4, Src: 10.0.1.12 (10.0.1.12), Dst: 10.0.1.11 (10.0.1.11)
Transmission Control Protocol, Src Port: 23 (23), Dst Port: 38936 (38936), Seq: 94, Ack: 108, Len: 1
Telnet

No.     Time           Source                Destination           Protocol Length Info
     49 22.577168000   10.0.1.11             10.0.1.12             TCP      66     38936 > 23 [ACK] Seq=108 Ack=95 Win=29312 Len=0 TSval=466852 TSecr=467203

Frame 49: 66 bytes on wire (528 bits), 66 bytes captured (528 bits) on interface 0
Ethernet II, Src: RealtekS_00:0a:10 (00:e0:4c:00:0a:10), Dst: RealtekS_00:0a:20 (00:e0:4c:00:0a:20)
Internet Protocol Version 4, Src: 10.0.1.11 (10.0.1.11), Dst: 10.0.1.12 (10.0.1.12)
Transmission Control Protocol, Src Port: 38936 (38936), Dst Port: 23 (23), Seq: 108, Ack: 95, Len: 0

No.     Time           Source                Destination           Protocol Length Info
     50 22.895124000   10.0.1.11             10.0.1.12             TELNET   68     Telnet Data ...

Frame 50: 68 bytes on wire (544 bits), 68 bytes captured (544 bits) on interface 0
Ethernet II, Src: RealtekS_00:0a:10 (00:e0:4c:00:0a:10), Dst: RealtekS_00:0a:20 (00:e0:4c:00:0a:20)
Internet Protocol Version 4, Src: 10.0.1.11 (10.0.1.11), Dst: 10.0.1.12 (10.0.1.12)
Transmission Control Protocol, Src Port: 38936 (38936), Dst Port: 23 (23), Seq: 108, Ack: 95, Len: 2
Telnet

No.     Time           Source                Destination           Protocol Length Info
     51 22.896276000   10.0.1.12             10.0.1.11             TELNET   78     Telnet Data ...

Frame 51: 78 bytes on wire (624 bits), 78 bytes captured (624 bits) on interface 0
Ethernet II, Src: RealtekS_00:0a:20 (00:e0:4c:00:0a:20), Dst: RealtekS_00:0a:10 (00:e0:4c:00:0a:10)
Internet Protocol Version 4, Src: 10.0.1.12 (10.0.1.12), Dst: 10.0.1.11 (10.0.1.11)
Transmission Control Protocol, Src Port: 23 (23), Dst Port: 38936 (38936), Seq: 95, Ack: 110, Len: 12
Telnet

No.     Time           Source                Destination           Protocol Length Info
     52 22.896400000   10.0.1.11             10.0.1.12             TCP      66     38936 > 23 [ACK] Seq=110 Ack=107 Win=29312 Len=0 TSval=466932 TSecr=467283

Frame 52: 66 bytes on wire (528 bits), 66 bytes captured (528 bits) on interface 0
Ethernet II, Src: RealtekS_00:0a:10 (00:e0:4c:00:0a:10), Dst: RealtekS_00:0a:20 (00:e0:4c:00:0a:20)
Internet Protocol Version 4, Src: 10.0.1.11 (10.0.1.11), Dst: 10.0.1.12 (10.0.1.12)
Transmission Control Protocol, Src Port: 38936 (38936), Dst Port: 23 (23), Seq: 110, Ack: 107, Len: 0

No.     Time           Source                Destination           Protocol Length Info
     53 23.231095000   10.0.1.11             10.0.1.12             TELNET   67     Telnet Data ...

Frame 53: 67 bytes on wire (536 bits), 67 bytes captured (536 bits) on interface 0
Ethernet II, Src: RealtekS_00:0a:10 (00:e0:4c:00:0a:10), Dst: RealtekS_00:0a:20 (00:e0:4c:00:0a:20)
Internet Protocol Version 4, Src: 10.0.1.11 (10.0.1.11), Dst: 10.0.1.12 (10.0.1.12)
Transmission Control Protocol, Src Port: 38936 (38936), Dst Port: 23 (23), Seq: 110, Ack: 107, Len: 1
Telnet

No.     Time           Source                Destination           Protocol Length Info
     54 23.269460000   10.0.1.12             10.0.1.11             TCP      66     23 > 38936 [ACK] Seq=107 Ack=111 Win=29056 Len=0 TSval=467377 TSecr=467015

Frame 54: 66 bytes on wire (528 bits), 66 bytes captured (528 bits) on interface 0
Ethernet II, Src: RealtekS_00:0a:20 (00:e0:4c:00:0a:20), Dst: RealtekS_00:0a:10 (00:e0:4c:00:0a:10)
Internet Protocol Version 4, Src: 10.0.1.12 (10.0.1.12), Dst: 10.0.1.11 (10.0.1.11)
Transmission Control Protocol, Src Port: 23 (23), Dst Port: 38936 (38936), Seq: 107, Ack: 111, Len: 0

No.     Time           Source                Destination           Protocol Length Info
     55 23.407115000   10.0.1.11             10.0.1.12             TELNET   67     Telnet Data ...

Frame 55: 67 bytes on wire (536 bits), 67 bytes captured (536 bits) on interface 0
Ethernet II, Src: RealtekS_00:0a:10 (00:e0:4c:00:0a:10), Dst: RealtekS_00:0a:20 (00:e0:4c:00:0a:20)
Internet Protocol Version 4, Src: 10.0.1.11 (10.0.1.11), Dst: 10.0.1.12 (10.0.1.12)
Transmission Control Protocol, Src Port: 38936 (38936), Dst Port: 23 (23), Seq: 111, Ack: 107, Len: 1
Telnet

No.     Time           Source                Destination           Protocol Length Info
     56 23.407147000   10.0.1.12             10.0.1.11             TCP      66     23 > 38936 [ACK] Seq=107 Ack=112 Win=29056 Len=0 TSval=467411 TSecr=467059

Frame 56: 66 bytes on wire (528 bits), 66 bytes captured (528 bits) on interface 0
Ethernet II, Src: RealtekS_00:0a:20 (00:e0:4c:00:0a:20), Dst: RealtekS_00:0a:10 (00:e0:4c:00:0a:10)
Internet Protocol Version 4, Src: 10.0.1.12 (10.0.1.12), Dst: 10.0.1.11 (10.0.1.11)
Transmission Control Protocol, Src Port: 23 (23), Dst Port: 38936 (38936), Seq: 107, Ack: 112, Len: 0

No.     Time           Source                Destination           Protocol Length Info
     57 23.551036000   10.0.1.11             10.0.1.12             TELNET   67     Telnet Data ...

Frame 57: 67 bytes on wire (536 bits), 67 bytes captured (536 bits) on interface 0
Ethernet II, Src: RealtekS_00:0a:10 (00:e0:4c:00:0a:10), Dst: RealtekS_00:0a:20 (00:e0:4c:00:0a:20)
Internet Protocol Version 4, Src: 10.0.1.11 (10.0.1.11), Dst: 10.0.1.12 (10.0.1.12)
Transmission Control Protocol, Src Port: 38936 (38936), Dst Port: 23 (23), Seq: 112, Ack: 107, Len: 1
Telnet

No.     Time           Source                Destination           Protocol Length Info
     58 23.551047000   10.0.1.12             10.0.1.11             TCP      66     23 > 38936 [ACK] Seq=107 Ack=113 Win=29056 Len=0 TSval=467447 TSecr=467095

Frame 58: 66 bytes on wire (528 bits), 66 bytes captured (528 bits) on interface 0
Ethernet II, Src: RealtekS_00:0a:20 (00:e0:4c:00:0a:20), Dst: RealtekS_00:0a:10 (00:e0:4c:00:0a:10)
Internet Protocol Version 4, Src: 10.0.1.12 (10.0.1.12), Dst: 10.0.1.11 (10.0.1.11)
Transmission Control Protocol, Src Port: 23 (23), Dst Port: 38936 (38936), Seq: 107, Ack: 113, Len: 0

No.     Time           Source                Destination           Protocol Length Info
     59 23.999100000   10.0.1.11             10.0.1.12             TELNET   68     Telnet Data ...

Frame 59: 68 bytes on wire (544 bits), 68 bytes captured (544 bits) on interface 0
Ethernet II, Src: RealtekS_00:0a:10 (00:e0:4c:00:0a:10), Dst: RealtekS_00:0a:20 (00:e0:4c:00:0a:20)
Internet Protocol Version 4, Src: 10.0.1.11 (10.0.1.11), Dst: 10.0.1.12 (10.0.1.12)
Transmission Control Protocol, Src Port: 38936 (38936), Dst Port: 23 (23), Seq: 113, Ack: 107, Len: 2
Telnet

No.     Time           Source                Destination           Protocol Length Info
     60 23.999135000   10.0.1.12             10.0.1.11             TCP      66     23 > 38936 [ACK] Seq=107 Ack=115 Win=29056 Len=0 TSval=467559 TSecr=467207

Frame 60: 66 bytes on wire (528 bits), 66 bytes captured (528 bits) on interface 0
Ethernet II, Src: RealtekS_00:0a:20 (00:e0:4c:00:0a:20), Dst: RealtekS_00:0a:10 (00:e0:4c:00:0a:10)
Internet Protocol Version 4, Src: 10.0.1.12 (10.0.1.12), Dst: 10.0.1.11 (10.0.1.11)
Transmission Control Protocol, Src Port: 23 (23), Dst Port: 38936 (38936), Seq: 107, Ack: 115, Len: 0

No.     Time           Source                Destination           Protocol Length Info
     61 24.005497000   10.0.1.12             10.0.1.11             TELNET   68     Telnet Data ...

Frame 61: 68 bytes on wire (544 bits), 68 bytes captured (544 bits) on interface 0
Ethernet II, Src: RealtekS_00:0a:20 (00:e0:4c:00:0a:20), Dst: RealtekS_00:0a:10 (00:e0:4c:00:0a:10)
Internet Protocol Version 4, Src: 10.0.1.12 (10.0.1.12), Dst: 10.0.1.11 (10.0.1.11)
Transmission Control Protocol, Src Port: 23 (23), Dst Port: 38936 (38936), Seq: 107, Ack: 115, Len: 2
Telnet

No.     Time           Source                Destination           Protocol Length Info
     62 24.005601000   10.0.1.11             10.0.1.12             TCP      66     38936 > 23 [ACK] Seq=115 Ack=109 Win=29312 Len=0 TSval=467209 TSecr=467561

Frame 62: 66 bytes on wire (528 bits), 66 bytes captured (528 bits) on interface 0
Ethernet II, Src: RealtekS_00:0a:10 (00:e0:4c:00:0a:10), Dst: RealtekS_00:0a:20 (00:e0:4c:00:0a:20)
Internet Protocol Version 4, Src: 10.0.1.11 (10.0.1.11), Dst: 10.0.1.12 (10.0.1.12)
Transmission Control Protocol, Src Port: 38936 (38936), Dst Port: 23 (23), Seq: 115, Ack: 109, Len: 0

No.     Time           Source                Destination           Protocol Length Info
     63 24.075568000   10.0.1.12             10.0.1.11             TELNET   130    Telnet Data ...

Frame 63: 130 bytes on wire (1040 bits), 130 bytes captured (1040 bits) on interface 0
Ethernet II, Src: RealtekS_00:0a:20 (00:e0:4c:00:0a:20), Dst: RealtekS_00:0a:10 (00:e0:4c:00:0a:10)
Internet Protocol Version 4, Src: 10.0.1.12 (10.0.1.12), Dst: 10.0.1.11 (10.0.1.11)
Transmission Control Protocol, Src Port: 23 (23), Dst Port: 38936 (38936), Seq: 109, Ack: 115, Len: 64
Telnet

No.     Time           Source                Destination           Protocol Length Info
     64 24.075699000   10.0.1.11             10.0.1.12             TCP      66     38936 > 23 [ACK] Seq=115 Ack=173 Win=29312 Len=0 TSval=467226 TSecr=467578

Frame 64: 66 bytes on wire (528 bits), 66 bytes captured (528 bits) on interface 0
Ethernet II, Src: RealtekS_00:0a:10 (00:e0:4c:00:0a:10), Dst: RealtekS_00:0a:20 (00:e0:4c:00:0a:20)
Internet Protocol Version 4, Src: 10.0.1.11 (10.0.1.11), Dst: 10.0.1.12 (10.0.1.12)
Transmission Control Protocol, Src Port: 38936 (38936), Dst Port: 23 (23), Seq: 115, Ack: 173, Len: 0

No.     Time           Source                Destination           Protocol Length Info
     65 24.075718000   10.0.1.12             10.0.1.11             TELNET   113    Telnet Data ...

Frame 65: 113 bytes on wire (904 bits), 113 bytes captured (904 bits) on interface 0
Ethernet II, Src: RealtekS_00:0a:20 (00:e0:4c:00:0a:20), Dst: RealtekS_00:0a:10 (00:e0:4c:00:0a:10)
Internet Protocol Version 4, Src: 10.0.1.12 (10.0.1.12), Dst: 10.0.1.11 (10.0.1.11)
Transmission Control Protocol, Src Port: 23 (23), Dst Port: 38936 (38936), Seq: 173, Ack: 115, Len: 47
Telnet

No.     Time           Source                Destination           Protocol Length Info
     66 24.075816000   10.0.1.11             10.0.1.12             TCP      66     38936 > 23 [ACK] Seq=115 Ack=220 Win=29312 Len=0 TSval=467227 TSecr=467578

Frame 66: 66 bytes on wire (528 bits), 66 bytes captured (528 bits) on interface 0
Ethernet II, Src: RealtekS_00:0a:10 (00:e0:4c:00:0a:10), Dst: RealtekS_00:0a:20 (00:e0:4c:00:0a:20)
Internet Protocol Version 4, Src: 10.0.1.11 (10.0.1.11), Dst: 10.0.1.12 (10.0.1.12)
Transmission Control Protocol, Src Port: 38936 (38936), Dst Port: 23 (23), Seq: 115, Ack: 220, Len: 0

No.     Time           Source                Destination           Protocol Length Info
     67 24.075831000   10.0.1.12             10.0.1.11             TELNET   70     Telnet Data ...

Frame 67: 70 bytes on wire (560 bits), 70 bytes captured (560 bits) on interface 0
Ethernet II, Src: RealtekS_00:0a:20 (00:e0:4c:00:0a:20), Dst: RealtekS_00:0a:10 (00:e0:4c:00:0a:10)
Internet Protocol Version 4, Src: 10.0.1.12 (10.0.1.12), Dst: 10.0.1.11 (10.0.1.11)
Transmission Control Protocol, Src Port: 23 (23), Dst Port: 38936 (38936), Seq: 220, Ack: 115, Len: 4
Telnet

No.     Time           Source                Destination           Protocol Length Info
     68 24.075917000   10.0.1.11             10.0.1.12             TCP      66     38936 > 23 [ACK] Seq=115 Ack=224 Win=29312 Len=0 TSval=467227 TSecr=467578

Frame 68: 66 bytes on wire (528 bits), 66 bytes captured (528 bits) on interface 0
Ethernet II, Src: RealtekS_00:0a:10 (00:e0:4c:00:0a:10), Dst: RealtekS_00:0a:20 (00:e0:4c:00:0a:20)
Internet Protocol Version 4, Src: 10.0.1.11 (10.0.1.11), Dst: 10.0.1.12 (10.0.1.12)
Transmission Control Protocol, Src Port: 38936 (38936), Dst Port: 23 (23), Seq: 115, Ack: 224, Len: 0

No.     Time           Source                Destination           Protocol Length Info
     69 24.573920000   10.0.1.12             10.0.1.11             TELNET   98     Telnet Data ...

Frame 69: 98 bytes on wire (784 bits), 98 bytes captured (784 bits) on interface 0
Ethernet II, Src: RealtekS_00:0a:20 (00:e0:4c:00:0a:20), Dst: RealtekS_00:0a:10 (00:e0:4c:00:0a:10)
Internet Protocol Version 4, Src: 10.0.1.12 (10.0.1.12), Dst: 10.0.1.11 (10.0.1.11)
Transmission Control Protocol, Src Port: 23 (23), Dst Port: 38936 (38936), Seq: 224, Ack: 115, Len: 32
Telnet

No.     Time           Source                Destination           Protocol Length Info
     70 24.574069000   10.0.1.11             10.0.1.12             TCP      66     38936 > 23 [ACK] Seq=115 Ack=256 Win=29312 Len=0 TSval=467351 TSecr=467703

Frame 70: 66 bytes on wire (528 bits), 66 bytes captured (528 bits) on interface 0
Ethernet II, Src: RealtekS_00:0a:10 (00:e0:4c:00:0a:10), Dst: RealtekS_00:0a:20 (00:e0:4c:00:0a:20)
Internet Protocol Version 4, Src: 10.0.1.11 (10.0.1.11), Dst: 10.0.1.12 (10.0.1.12)
Transmission Control Protocol, Src Port: 38936 (38936), Dst Port: 23 (23), Seq: 115, Ack: 256, Len: 0

No.     Time           Source                Destination           Protocol Length Info
     71 31.279414000   10.0.1.11             10.0.1.12             TELNET   67     Telnet Data ...

Frame 71: 67 bytes on wire (536 bits), 67 bytes captured (536 bits) on interface 0
Ethernet II, Src: RealtekS_00:0a:10 (00:e0:4c:00:0a:10), Dst: RealtekS_00:0a:20 (00:e0:4c:00:0a:20)
Internet Protocol Version 4, Src: 10.0.1.11 (10.0.1.11), Dst: 10.0.1.12 (10.0.1.12)
Transmission Control Protocol, Src Port: 38936 (38936), Dst Port: 23 (23), Seq: 115, Ack: 256, Len: 1
Telnet

No.     Time           Source                Destination           Protocol Length Info
     72 31.279643000   10.0.1.12             10.0.1.11             TELNET   67     Telnet Data ...

Frame 72: 67 bytes on wire (536 bits), 67 bytes captured (536 bits) on interface 0
Ethernet II, Src: RealtekS_00:0a:20 (00:e0:4c:00:0a:20), Dst: RealtekS_00:0a:10 (00:e0:4c:00:0a:10)
Internet Protocol Version 4, Src: 10.0.1.12 (10.0.1.12), Dst: 10.0.1.11 (10.0.1.11)
Transmission Control Protocol, Src Port: 23 (23), Dst Port: 38936 (38936), Seq: 256, Ack: 116, Len: 1
Telnet

No.     Time           Source                Destination           Protocol Length Info
     73 31.279740000   10.0.1.11             10.0.1.12             TCP      66     38936 > 23 [ACK] Seq=116 Ack=257 Win=29312 Len=0 TSval=469027 TSecr=469379

Frame 73: 66 bytes on wire (528 bits), 66 bytes captured (528 bits) on interface 0
Ethernet II, Src: RealtekS_00:0a:10 (00:e0:4c:00:0a:10), Dst: RealtekS_00:0a:20 (00:e0:4c:00:0a:20)
Internet Protocol Version 4, Src: 10.0.1.11 (10.0.1.11), Dst: 10.0.1.12 (10.0.1.12)
Transmission Control Protocol, Src Port: 38936 (38936), Dst Port: 23 (23), Seq: 116, Ack: 257, Len: 0

No.     Time           Source                Destination           Protocol Length Info
     74 31.390938000   10.0.1.11             10.0.1.12             TELNET   67     Telnet Data ...

Frame 74: 67 bytes on wire (536 bits), 67 bytes captured (536 bits) on interface 0
Ethernet II, Src: RealtekS_00:0a:10 (00:e0:4c:00:0a:10), Dst: RealtekS_00:0a:20 (00:e0:4c:00:0a:20)
Internet Protocol Version 4, Src: 10.0.1.11 (10.0.1.11), Dst: 10.0.1.12 (10.0.1.12)
Transmission Control Protocol, Src Port: 38936 (38936), Dst Port: 23 (23), Seq: 116, Ack: 257, Len: 1
Telnet

No.     Time           Source                Destination           Protocol Length Info
     75 31.391222000   10.0.1.12             10.0.1.11             TELNET   67     Telnet Data ...

Frame 75: 67 bytes on wire (536 bits), 67 bytes captured (536 bits) on interface 0
Ethernet II, Src: RealtekS_00:0a:20 (00:e0:4c:00:0a:20), Dst: RealtekS_00:0a:10 (00:e0:4c:00:0a:10)
Internet Protocol Version 4, Src: 10.0.1.12 (10.0.1.12), Dst: 10.0.1.11 (10.0.1.11)
Transmission Control Protocol, Src Port: 23 (23), Dst Port: 38936 (38936), Seq: 257, Ack: 117, Len: 1
Telnet

No.     Time           Source                Destination           Protocol Length Info
     76 31.391323000   10.0.1.11             10.0.1.12             TCP      66     38936 > 23 [ACK] Seq=117 Ack=258 Win=29312 Len=0 TSval=469055 TSecr=469407

Frame 76: 66 bytes on wire (528 bits), 66 bytes captured (528 bits) on interface 0
Ethernet II, Src: RealtekS_00:0a:10 (00:e0:4c:00:0a:10), Dst: RealtekS_00:0a:20 (00:e0:4c:00:0a:20)
Internet Protocol Version 4, Src: 10.0.1.11 (10.0.1.11), Dst: 10.0.1.12 (10.0.1.12)
Transmission Control Protocol, Src Port: 38936 (38936), Dst Port: 23 (23), Seq: 117, Ack: 258, Len: 0

No.     Time           Source                Destination           Protocol Length Info
     77 31.553056000   10.0.1.11             10.0.1.12             TELNET   67     Telnet Data ...

Frame 77: 67 bytes on wire (536 bits), 67 bytes captured (536 bits) on interface 0
Ethernet II, Src: RealtekS_00:0a:10 (00:e0:4c:00:0a:10), Dst: RealtekS_00:0a:20 (00:e0:4c:00:0a:20)
Internet Protocol Version 4, Src: 10.0.1.11 (10.0.1.11), Dst: 10.0.1.12 (10.0.1.12)
Transmission Control Protocol, Src Port: 38936 (38936), Dst Port: 23 (23), Seq: 117, Ack: 258, Len: 1
Telnet

No.     Time           Source                Destination           Protocol Length Info
     78 31.553261000   10.0.1.12             10.0.1.11             TELNET   67     Telnet Data ...

Frame 78: 67 bytes on wire (536 bits), 67 bytes captured (536 bits) on interface 0
Ethernet II, Src: RealtekS_00:0a:20 (00:e0:4c:00:0a:20), Dst: RealtekS_00:0a:10 (00:e0:4c:00:0a:10)
Internet Protocol Version 4, Src: 10.0.1.12 (10.0.1.12), Dst: 10.0.1.11 (10.0.1.11)
Transmission Control Protocol, Src Port: 23 (23), Dst Port: 38936 (38936), Seq: 258, Ack: 118, Len: 1
Telnet

No.     Time           Source                Destination           Protocol Length Info
     79 31.553357000   10.0.1.11             10.0.1.12             TCP      66     38936 > 23 [ACK] Seq=118 Ack=259 Win=29312 Len=0 TSval=469096 TSecr=469447

Frame 79: 66 bytes on wire (528 bits), 66 bytes captured (528 bits) on interface 0
Ethernet II, Src: RealtekS_00:0a:10 (00:e0:4c:00:0a:10), Dst: RealtekS_00:0a:20 (00:e0:4c:00:0a:20)
Internet Protocol Version 4, Src: 10.0.1.11 (10.0.1.11), Dst: 10.0.1.12 (10.0.1.12)
Transmission Control Protocol, Src Port: 38936 (38936), Dst Port: 23 (23), Seq: 118, Ack: 259, Len: 0

No.     Time           Source                Destination           Protocol Length Info
     80 31.711244000   10.0.1.11             10.0.1.12             TELNET   67     Telnet Data ...

Frame 80: 67 bytes on wire (536 bits), 67 bytes captured (536 bits) on interface 0
Ethernet II, Src: RealtekS_00:0a:10 (00:e0:4c:00:0a:10), Dst: RealtekS_00:0a:20 (00:e0:4c:00:0a:20)
Internet Protocol Version 4, Src: 10.0.1.11 (10.0.1.11), Dst: 10.0.1.12 (10.0.1.12)
Transmission Control Protocol, Src Port: 38936 (38936), Dst Port: 23 (23), Seq: 118, Ack: 259, Len: 1
Telnet

No.     Time           Source                Destination           Protocol Length Info
     81 31.711421000   10.0.1.12             10.0.1.11             TELNET   67     Telnet Data ...

Frame 81: 67 bytes on wire (536 bits), 67 bytes captured (536 bits) on interface 0
Ethernet II, Src: RealtekS_00:0a:20 (00:e0:4c:00:0a:20), Dst: RealtekS_00:0a:10 (00:e0:4c:00:0a:10)
Internet Protocol Version 4, Src: 10.0.1.12 (10.0.1.12), Dst: 10.0.1.11 (10.0.1.11)
Transmission Control Protocol, Src Port: 23 (23), Dst Port: 38936 (38936), Seq: 259, Ack: 119, Len: 1
Telnet

No.     Time           Source                Destination           Protocol Length Info
     82 31.711519000   10.0.1.11             10.0.1.12             TCP      66     38936 > 23 [ACK] Seq=119 Ack=260 Win=29312 Len=0 TSval=469135 TSecr=469487

Frame 82: 66 bytes on wire (528 bits), 66 bytes captured (528 bits) on interface 0
Ethernet II, Src: RealtekS_00:0a:10 (00:e0:4c:00:0a:10), Dst: RealtekS_00:0a:20 (00:e0:4c:00:0a:20)
Internet Protocol Version 4, Src: 10.0.1.11 (10.0.1.11), Dst: 10.0.1.12 (10.0.1.12)
Transmission Control Protocol, Src Port: 38936 (38936), Dst Port: 23 (23), Seq: 119, Ack: 260, Len: 0

No.     Time           Source                Destination           Protocol Length Info
     83 31.951496000   10.0.1.11             10.0.1.12             TELNET   68     Telnet Data ...

Frame 83: 68 bytes on wire (544 bits), 68 bytes captured (544 bits) on interface 0
Ethernet II, Src: RealtekS_00:0a:10 (00:e0:4c:00:0a:10), Dst: RealtekS_00:0a:20 (00:e0:4c:00:0a:20)
Internet Protocol Version 4, Src: 10.0.1.11 (10.0.1.11), Dst: 10.0.1.12 (10.0.1.12)
Transmission Control Protocol, Src Port: 38936 (38936), Dst Port: 23 (23), Seq: 119, Ack: 260, Len: 2
Telnet

No.     Time           Source                Destination           Protocol Length Info
     84 31.952772000   10.0.1.12             10.0.1.11             TELNET   76     Telnet Data ...

Frame 84: 76 bytes on wire (608 bits), 76 bytes captured (608 bits) on interface 0
Ethernet II, Src: RealtekS_00:0a:20 (00:e0:4c:00:0a:20), Dst: RealtekS_00:0a:10 (00:e0:4c:00:0a:10)
Internet Protocol Version 4, Src: 10.0.1.12 (10.0.1.12), Dst: 10.0.1.11 (10.0.1.11)
Transmission Control Protocol, Src Port: 23 (23), Dst Port: 38936 (38936), Seq: 260, Ack: 121, Len: 10
Telnet

No.     Time           Source                Destination           Protocol Length Info
     85 31.952895000   10.0.1.11             10.0.1.12             TCP      66     38936 > 23 [ACK] Seq=121 Ack=270 Win=29312 Len=0 TSval=469196 TSecr=469547

Frame 85: 66 bytes on wire (528 bits), 66 bytes captured (528 bits) on interface 0
Ethernet II, Src: RealtekS_00:0a:10 (00:e0:4c:00:0a:10), Dst: RealtekS_00:0a:20 (00:e0:4c:00:0a:20)
Internet Protocol Version 4, Src: 10.0.1.11 (10.0.1.11), Dst: 10.0.1.12 (10.0.1.12)
Transmission Control Protocol, Src Port: 38936 (38936), Dst Port: 23 (23), Seq: 121, Ack: 270, Len: 0

No.     Time           Source                Destination           Protocol Length Info
     86 31.977881000   10.0.1.12             10.0.1.11             TCP      66     23 > 38936 [FIN, ACK] Seq=270 Ack=121 Win=29056 Len=0 TSval=469554 TSecr=469196

Frame 86: 66 bytes on wire (528 bits), 66 bytes captured (528 bits) on interface 0
Ethernet II, Src: RealtekS_00:0a:20 (00:e0:4c:00:0a:20), Dst: RealtekS_00:0a:10 (00:e0:4c:00:0a:10)
Internet Protocol Version 4, Src: 10.0.1.12 (10.0.1.12), Dst: 10.0.1.11 (10.0.1.11)
Transmission Control Protocol, Src Port: 23 (23), Dst Port: 38936 (38936), Seq: 270, Ack: 121, Len: 0

No.     Time           Source                Destination           Protocol Length Info
     87 31.978086000   10.0.1.11             10.0.1.12             TCP      66     38936 > 23 [FIN, ACK] Seq=121 Ack=271 Win=29312 Len=0 TSval=469202 TSecr=469554

Frame 87: 66 bytes on wire (528 bits), 66 bytes captured (528 bits) on interface 0
Ethernet II, Src: RealtekS_00:0a:10 (00:e0:4c:00:0a:10), Dst: RealtekS_00:0a:20 (00:e0:4c:00:0a:20)
Internet Protocol Version 4, Src: 10.0.1.11 (10.0.1.11), Dst: 10.0.1.12 (10.0.1.12)
Transmission Control Protocol, Src Port: 38936 (38936), Dst Port: 23 (23), Seq: 121, Ack: 271, Len: 0

No.     Time           Source                Destination           Protocol Length Info
     88 31.978109000   10.0.1.12             10.0.1.11             TCP      66     23 > 38936 [ACK] Seq=271 Ack=122 Win=29056 Len=0 TSval=469554 TSecr=469202

Frame 88: 66 bytes on wire (528 bits), 66 bytes captured (528 bits) on interface 0
Ethernet II, Src: RealtekS_00:0a:20 (00:e0:4c:00:0a:20), Dst: RealtekS_00:0a:10 (00:e0:4c:00:0a:10)
Internet Protocol Version 4, Src: 10.0.1.12 (10.0.1.12), Dst: 10.0.1.11 (10.0.1.11)
Transmission Control Protocol, Src Port: 23 (23), Dst Port: 38936 (38936), Seq: 271, Ack: 122, Len: 0
