No.     Time           Source                Destination           Protocol Length Info
      1 0.000000000    10.10.10.11           10.10.10.12           TCP      74     53565 > 21 [SYN] Seq=0 Win=29200 Len=0 MSS=1460 SACK_PERM=1 TSval=2263204 TSecr=0 WS=128

Frame 1: 74 bytes on wire (592 bits), 74 bytes captured (592 bits) on interface 0
Ethernet II, Src: RealtekS_00:0a:10 (00:e0:4c:00:0a:10), Dst: RealtekS_00:0a:20 (00:e0:4c:00:0a:20)
Internet Protocol Version 4, Src: 10.10.10.11 (10.10.10.11), Dst: 10.10.10.12 (10.10.10.12)
Transmission Control Protocol, Src Port: 53565 (53565), Dst Port: 21 (21), Seq: 0, Len: 0

No.     Time           Source                Destination           Protocol Length Info
      2 0.000164000    10.10.10.12           10.10.10.11           TCP      74     21 > 53565 [SYN, ACK] Seq=0 Ack=1 Win=28960 Len=0 MSS=1460 SACK_PERM=1 TSval=2263582 TSecr=2263204 WS=128

Frame 2: 74 bytes on wire (592 bits), 74 bytes captured (592 bits) on interface 0
Ethernet II, Src: RealtekS_00:0a:20 (00:e0:4c:00:0a:20), Dst: RealtekS_00:0a:10 (00:e0:4c:00:0a:10)
Internet Protocol Version 4, Src: 10.10.10.12 (10.10.10.12), Dst: 10.10.10.11 (10.10.10.11)
Transmission Control Protocol, Src Port: 21 (21), Dst Port: 53565 (53565), Seq: 0, Ack: 1, Len: 0

No.     Time           Source                Destination           Protocol Length Info
      3 0.000215000    10.10.10.11           10.10.10.12           TCP      66     53565 > 21 [ACK] Seq=1 Ack=1 Win=29312 Len=0 TSval=2263204 TSecr=2263582

Frame 3: 66 bytes on wire (528 bits), 66 bytes captured (528 bits) on interface 0
Ethernet II, Src: RealtekS_00:0a:10 (00:e0:4c:00:0a:10), Dst: RealtekS_00:0a:20 (00:e0:4c:00:0a:20)
Internet Protocol Version 4, Src: 10.10.10.11 (10.10.10.11), Dst: 10.10.10.12 (10.10.10.12)
Transmission Control Protocol, Src Port: 53565 (53565), Dst Port: 21 (21), Seq: 1, Ack: 1, Len: 0

No.     Time           Source                Destination           Protocol Length Info
      4 0.005950000    10.10.10.12           10.10.10.11           FTP      131    Response: 220 PC2 FTP server (Version 6.4/OpenBSD/Linux-ftpd-0.17) ready.

Frame 4: 131 bytes on wire (1048 bits), 131 bytes captured (1048 bits) on interface 0
Ethernet II, Src: RealtekS_00:0a:20 (00:e0:4c:00:0a:20), Dst: RealtekS_00:0a:10 (00:e0:4c:00:0a:10)
Internet Protocol Version 4, Src: 10.10.10.12 (10.10.10.12), Dst: 10.10.10.11 (10.10.10.11)
Transmission Control Protocol, Src Port: 21 (21), Dst Port: 53565 (53565), Seq: 1, Ack: 1, Len: 65
File Transfer Protocol (FTP)

No.     Time           Source                Destination           Protocol Length Info
      5 0.005994000    10.10.10.11           10.10.10.12           TCP      66     53565 > 21 [ACK] Seq=1 Ack=66 Win=29312 Len=0 TSval=2263206 TSecr=2263584

Frame 5: 66 bytes on wire (528 bits), 66 bytes captured (528 bits) on interface 0
Ethernet II, Src: RealtekS_00:0a:10 (00:e0:4c:00:0a:10), Dst: RealtekS_00:0a:20 (00:e0:4c:00:0a:20)
Internet Protocol Version 4, Src: 10.10.10.11 (10.10.10.11), Dst: 10.10.10.12 (10.10.10.12)
Transmission Control Protocol, Src Port: 53565 (53565), Dst Port: 21 (21), Seq: 1, Ack: 66, Len: 0

No.     Time           Source                Destination           Protocol Length Info
      6 3.441722000    10.10.10.11           10.10.10.12           FTP      79     Request: USER ubuntu

Frame 6: 79 bytes on wire (632 bits), 79 bytes captured (632 bits) on interface 0
Ethernet II, Src: RealtekS_00:0a:10 (00:e0:4c:00:0a:10), Dst: RealtekS_00:0a:20 (00:e0:4c:00:0a:20)
Internet Protocol Version 4, Src: 10.10.10.11 (10.10.10.11), Dst: 10.10.10.12 (10.10.10.12)
Transmission Control Protocol, Src Port: 53565 (53565), Dst Port: 21 (21), Seq: 1, Ack: 66, Len: 13
File Transfer Protocol (FTP)

No.     Time           Source                Destination           Protocol Length Info
      7 3.441877000    10.10.10.12           10.10.10.11           TCP      66     21 > 53565 [ACK] Seq=66 Ack=14 Win=29056 Len=0 TSval=2264443 TSecr=2264065

Frame 7: 66 bytes on wire (528 bits), 66 bytes captured (528 bits) on interface 0
Ethernet II, Src: RealtekS_00:0a:20 (00:e0:4c:00:0a:20), Dst: RealtekS_00:0a:10 (00:e0:4c:00:0a:10)
Internet Protocol Version 4, Src: 10.10.10.12 (10.10.10.12), Dst: 10.10.10.11 (10.10.10.11)
Transmission Control Protocol, Src Port: 21 (21), Dst Port: 53565 (53565), Seq: 66, Ack: 14, Len: 0

No.     Time           Source                Destination           Protocol Length Info
      8 3.447439000    10.10.10.12           10.10.10.11           FTP      101    Response: 331 Password required for ubuntu.

Frame 8: 101 bytes on wire (808 bits), 101 bytes captured (808 bits) on interface 0
Ethernet II, Src: RealtekS_00:0a:20 (00:e0:4c:00:0a:20), Dst: RealtekS_00:0a:10 (00:e0:4c:00:0a:10)
Internet Protocol Version 4, Src: 10.10.10.12 (10.10.10.12), Dst: 10.10.10.11 (10.10.10.11)
Transmission Control Protocol, Src Port: 21 (21), Dst Port: 53565 (53565), Seq: 66, Ack: 14, Len: 35
File Transfer Protocol (FTP)

No.     Time           Source                Destination           Protocol Length Info
      9 3.447501000    10.10.10.11           10.10.10.12           TCP      66     53565 > 21 [ACK] Seq=14 Ack=101 Win=29312 Len=0 TSval=2264066 TSecr=2264444

Frame 9: 66 bytes on wire (528 bits), 66 bytes captured (528 bits) on interface 0
Ethernet II, Src: RealtekS_00:0a:10 (00:e0:4c:00:0a:10), Dst: RealtekS_00:0a:20 (00:e0:4c:00:0a:20)
Internet Protocol Version 4, Src: 10.10.10.11 (10.10.10.11), Dst: 10.10.10.12 (10.10.10.12)
Transmission Control Protocol, Src Port: 53565 (53565), Dst Port: 21 (21), Seq: 14, Ack: 101, Len: 0

No.     Time           Source                Destination           Protocol Length Info
     10 10.524183000   10.10.10.11           10.10.10.12           FTP      76     Request: PASS lab

Frame 10: 76 bytes on wire (608 bits), 76 bytes captured (608 bits) on interface 0
Ethernet II, Src: RealtekS_00:0a:10 (00:e0:4c:00:0a:10), Dst: RealtekS_00:0a:20 (00:e0:4c:00:0a:20)
Internet Protocol Version 4, Src: 10.10.10.11 (10.10.10.11), Dst: 10.10.10.12 (10.10.10.12)
Transmission Control Protocol, Src Port: 53565 (53565), Dst Port: 21 (21), Seq: 14, Ack: 101, Len: 10
File Transfer Protocol (FTP)

No.     Time           Source                Destination           Protocol Length Info
     11 10.564012000   10.10.10.12           10.10.10.11           TCP      66     21 > 53565 [ACK] Seq=101 Ack=24 Win=29056 Len=0 TSval=2266224 TSecr=2265835

Frame 11: 66 bytes on wire (528 bits), 66 bytes captured (528 bits) on interface 0
Ethernet II, Src: RealtekS_00:0a:20 (00:e0:4c:00:0a:20), Dst: RealtekS_00:0a:10 (00:e0:4c:00:0a:10)
Internet Protocol Version 4, Src: 10.10.10.12 (10.10.10.12), Dst: 10.10.10.11 (10.10.10.11)
Transmission Control Protocol, Src Port: 21 (21), Dst Port: 53565 (53565), Seq: 101, Ack: 24, Len: 0

No.     Time           Source                Destination           Protocol Length Info
     12 10.606666000   10.10.10.12           10.10.10.11           FTP      94     Response: 230 User ubuntu logged in.

Frame 12: 94 bytes on wire (752 bits), 94 bytes captured (752 bits) on interface 0
Ethernet II, Src: RealtekS_00:0a:20 (00:e0:4c:00:0a:20), Dst: RealtekS_00:0a:10 (00:e0:4c:00:0a:10)
Internet Protocol Version 4, Src: 10.10.10.12 (10.10.10.12), Dst: 10.10.10.11 (10.10.10.11)
Transmission Control Protocol, Src Port: 21 (21), Dst Port: 53565 (53565), Seq: 101, Ack: 24, Len: 28
File Transfer Protocol (FTP)

No.     Time           Source                Destination           Protocol Length Info
     13 10.606699000   10.10.10.11           10.10.10.12           TCP      66     53565 > 21 [ACK] Seq=24 Ack=129 Win=29312 Len=0 TSval=2265856 TSecr=2266234

Frame 13: 66 bytes on wire (528 bits), 66 bytes captured (528 bits) on interface 0
Ethernet II, Src: RealtekS_00:0a:10 (00:e0:4c:00:0a:10), Dst: RealtekS_00:0a:20 (00:e0:4c:00:0a:20)
Internet Protocol Version 4, Src: 10.10.10.11 (10.10.10.11), Dst: 10.10.10.12 (10.10.10.12)
Transmission Control Protocol, Src Port: 53565 (53565), Dst Port: 21 (21), Seq: 24, Ack: 129, Len: 0

No.     Time           Source                Destination           Protocol Length Info
     14 10.606751000   10.10.10.11           10.10.10.12           FTP      72     Request: SYST

Frame 14: 72 bytes on wire (576 bits), 72 bytes captured (576 bits) on interface 0
Ethernet II, Src: RealtekS_00:0a:10 (00:e0:4c:00:0a:10), Dst: RealtekS_00:0a:20 (00:e0:4c:00:0a:20)
Internet Protocol Version 4, Src: 10.10.10.11 (10.10.10.11), Dst: 10.10.10.12 (10.10.10.12)
Transmission Control Protocol, Src Port: 53565 (53565), Dst Port: 21 (21), Seq: 24, Ack: 129, Len: 6
File Transfer Protocol (FTP)

No.     Time           Source                Destination           Protocol Length Info
     15 10.608080000   10.10.10.12           10.10.10.11           TCP      66     21 > 53565 [ACK] Seq=129 Ack=30 Win=29056 Len=0 TSval=2266235 TSecr=2265856

Frame 15: 66 bytes on wire (528 bits), 66 bytes captured (528 bits) on interface 0
Ethernet II, Src: RealtekS_00:0a:20 (00:e0:4c:00:0a:20), Dst: RealtekS_00:0a:10 (00:e0:4c:00:0a:10)
Internet Protocol Version 4, Src: 10.10.10.12 (10.10.10.12), Dst: 10.10.10.11 (10.10.10.11)
Transmission Control Protocol, Src Port: 21 (21), Dst Port: 53565 (53565), Seq: 129, Ack: 30, Len: 0

No.     Time           Source                Destination           Protocol Length Info
     16 10.608148000   10.10.10.12           10.10.10.11           FTP      93     Response: 215 UNIX Type: L8 (Linux)

Frame 16: 93 bytes on wire (744 bits), 93 bytes captured (744 bits) on interface 0
Ethernet II, Src: RealtekS_00:0a:20 (00:e0:4c:00:0a:20), Dst: RealtekS_00:0a:10 (00:e0:4c:00:0a:10)
Internet Protocol Version 4, Src: 10.10.10.12 (10.10.10.12), Dst: 10.10.10.11 (10.10.10.11)
Transmission Control Protocol, Src Port: 21 (21), Dst Port: 53565 (53565), Seq: 129, Ack: 30, Len: 27
File Transfer Protocol (FTP)

No.     Time           Source                Destination           Protocol Length Info
     17 10.644629000   10.10.10.11           10.10.10.12           TCP      66     53565 > 21 [ACK] Seq=30 Ack=156 Win=29312 Len=0 TSval=2265866 TSecr=2266235

Frame 17: 66 bytes on wire (528 bits), 66 bytes captured (528 bits) on interface 0
Ethernet II, Src: RealtekS_00:0a:10 (00:e0:4c:00:0a:10), Dst: RealtekS_00:0a:20 (00:e0:4c:00:0a:20)
Internet Protocol Version 4, Src: 10.10.10.11 (10.10.10.11), Dst: 10.10.10.12 (10.10.10.12)
Transmission Control Protocol, Src Port: 53565 (53565), Dst Port: 21 (21), Seq: 30, Ack: 156, Len: 0
