No.     Time           Source                Destination           Protocol Length Info
      1 0.000000000    10.0.1.12             10.0.1.11             ICMP     98     Echo (ping) request  id=0x0afd, seq=1/256, ttl=64 (reply in 2)

Frame 1: 98 bytes on wire (784 bits), 98 bytes captured (784 bits) on interface 0
Ethernet II, Src: RealtekS_00:0a:20 (00:e0:4c:00:0a:20), Dst: RealtekS_00:0a:10 (00:e0:4c:00:0a:10)
Internet Protocol Version 4, Src: 10.0.1.12 (10.0.1.12), Dst: 10.0.1.11 (10.0.1.11)
Internet Control Message Protocol

No.     Time           Source                Destination           Protocol Length Info
      2 0.000044000    10.0.1.11             10.0.1.12             ICMP     98     Echo (ping) reply    id=0x0afd, seq=1/256, ttl=64 (request in 1)

Frame 2: 98 bytes on wire (784 bits), 98 bytes captured (784 bits) on interface 0
Ethernet II, Src: RealtekS_00:0a:10 (00:e0:4c:00:0a:10), Dst: RealtekS_00:0a:20 (00:e0:4c:00:0a:20)
Internet Protocol Version 4, Src: 10.0.1.11 (10.0.1.11), Dst: 10.0.1.12 (10.0.1.12)
Internet Control Message Protocol

No.     Time           Source                Destination           Protocol Length Info
      3 0.999504000    10.0.1.12             10.0.1.11             ICMP     98     Echo (ping) request  id=0x0afd, seq=2/512, ttl=64 (reply in 4)

Frame 3: 98 bytes on wire (784 bits), 98 bytes captured (784 bits) on interface 0
Ethernet II, Src: RealtekS_00:0a:20 (00:e0:4c:00:0a:20), Dst: RealtekS_00:0a:10 (00:e0:4c:00:0a:10)
Internet Protocol Version 4, Src: 10.0.1.12 (10.0.1.12), Dst: 10.0.1.11 (10.0.1.11)
Internet Control Message Protocol

No.     Time           Source                Destination           Protocol Length Info
      4 0.999545000    10.0.1.11             10.0.1.12             ICMP     98     Echo (ping) reply    id=0x0afd, seq=2/512, ttl=64 (request in 3)

Frame 4: 98 bytes on wire (784 bits), 98 bytes captured (784 bits) on interface 0
Ethernet II, Src: RealtekS_00:0a:10 (00:e0:4c:00:0a:10), Dst: RealtekS_00:0a:20 (00:e0:4c:00:0a:20)
Internet Protocol Version 4, Src: 10.0.1.11 (10.0.1.11), Dst: 10.0.1.12 (10.0.1.12)
Internet Control Message Protocol
