No.     Time           Source                Destination           Protocol Length Info
      1 0.000000000    Cisco_6b:9d:61        Broadcast             ARP      60     Who has 10.0.2.10?  Tell 10.0.2.138

Frame 1: 60 bytes on wire (480 bits), 60 bytes captured (480 bits) on interface 0
Ethernet II, Src: Cisco_6b:9d:61 (00:21:55:6b:9d:61), Dst: Broadcast (ff:ff:ff:ff:ff:ff)
Address Resolution Protocol (request)

No.     Time           Source                Destination           Protocol Length Info
      2 6.878191000    Cisco_6b:9d:61        Broadcast             ARP      60     Who has 10.0.2.137?  Tell 10.0.2.138

Frame 2: 60 bytes on wire (480 bits), 60 bytes captured (480 bits) on interface 0
Ethernet II, Src: Cisco_6b:9d:61 (00:21:55:6b:9d:61), Dst: Broadcast (ff:ff:ff:ff:ff:ff)
Address Resolution Protocol (request)
