<?xml version="1.0" encoding="UTF-8" standalone="no"?>
<svg
   xmlns:dc="http://purl.org/dc/elements/1.1/"
   xmlns:cc="http://creativecommons.org/ns#"
   xmlns:rdf="http://www.w3.org/1999/02/22-rdf-syntax-ns#"
   xmlns:svg="http://www.w3.org/2000/svg"
   xmlns="http://www.w3.org/2000/svg"
   xmlns:sodipodi="http://sodipodi.sourceforge.net/DTD/sodipodi-0.dtd"
   xmlns:inkscape="http://www.inkscape.org/namespaces/inkscape"
   version="1.1"
   id="svg2"
   xml:space="preserve"
   width="1133.0675"
   height="402.62134"
   viewBox="0 0 1133.0675 402.62134"
   sodipodi:docname="epsp_efficacy_h.svg"
   inkscape:version="1.0.1 (3bc2e813f5, 2020-09-07)"><style
     id="style3461"></style><metadata
     id="metadata8"><rdf:RDF><cc:Work
         rdf:about=""><dc:format>image/svg+xml</dc:format><dc:type
           rdf:resource="http://purl.org/dc/dcmitype/StillImage" /><dc:title></dc:title></cc:Work></rdf:RDF></metadata><defs
     id="defs6"><rect
       x="702.45654"
       y="-216.88718"
       width="459.61679"
       height="122.88474"
       id="rect9116" /><marker
       style="overflow:visible"
       id="Arrow1Send"
       refX="0"
       refY="0"
       orient="auto"
       inkscape:stockid="Arrow1Send"
       inkscape:isstock="true"><path
         transform="matrix(-0.2,0,0,-0.2,-1.2,0)"
         style="fill:#000000;fill-opacity:1;fill-rule:evenodd;stroke:#000000;stroke-width:1pt;stroke-opacity:1"
         d="M 0,0 5,-5 -12.5,0 5,5 Z"
         id="path8241" /></marker><marker
       style="overflow:visible"
       id="Arrow1Sstart"
       refX="0"
       refY="0"
       orient="auto"
       inkscape:stockid="Arrow1Sstart"
       inkscape:isstock="true"><path
         transform="matrix(0.2,0,0,0.2,1.2,0)"
         style="fill:#000000;fill-opacity:1;fill-rule:evenodd;stroke:#000000;stroke-width:1pt;stroke-opacity:1"
         d="M 0,0 5,-5 -12.5,0 5,5 Z"
         id="path8238" /></marker><marker
       style="overflow:visible"
       id="Arrow1Mend"
       refX="0"
       refY="0"
       orient="auto"
       inkscape:stockid="Arrow1Mend"
       inkscape:isstock="true"><path
         transform="matrix(-0.4,0,0,-0.4,-4,0)"
         style="fill:#000000;fill-opacity:1;fill-rule:evenodd;stroke:#000000;stroke-width:1pt;stroke-opacity:1"
         d="M 0,0 5,-5 -12.5,0 5,5 Z"
         id="path8235" /></marker><clipPath
       clipPathUnits="userSpaceOnUse"
       id="clipPath50"><path
         d="M -1016,-351 H 1660 V 1068 H -1016 Z"
         id="path48" /></clipPath><clipPath
       clipPathUnits="userSpaceOnUse"
       id="clipPath202"><path
         d="M 2.8346457,2.8346457 H 429.16535 V 268.36535 H 2.8346457 Z"
         id="path200" /></clipPath><clipPath
       clipPathUnits="userSpaceOnUse"
       id="clipPath212"><path
         d="M 2.8346457,2.8346457 H 429.16535 V 268.36535 H 2.8346457 Z"
         id="path210" /></clipPath><clipPath
       clipPathUnits="userSpaceOnUse"
       id="clipPath2540"><path
         d="M 2.8346457,2.8346457 H 429.16535 V 268.36535 H 2.8346457 Z"
         id="path2538" /></clipPath><clipPath
       clipPathUnits="userSpaceOnUse"
       id="clipPath2556"><path
         d="M 2.8346457,2.8346457 H 429.16535 V 268.36535 H 2.8346457 Z"
         id="path2554" /></clipPath><clipPath
       clipPathUnits="userSpaceOnUse"
       id="clipPath2566"><path
         d="M 2.8346457,2.8346457 H 429.16535 V 268.36535 H 2.8346457 Z"
         id="path2564" /></clipPath><clipPath
       clipPathUnits="userSpaceOnUse"
       id="clipPath2576"><path
         d="M 2.8346457,2.8346457 H 429.16535 V 268.36535 H 2.8346457 Z"
         id="path2574" /></clipPath><clipPath
       clipPathUnits="userSpaceOnUse"
       id="clipPath2586"><path
         d="M 2.8346457,2.8346457 H 429.16535 V 268.36535 H 2.8346457 Z"
         id="path2584" /></clipPath><clipPath
       clipPathUnits="userSpaceOnUse"
       id="clipPath2596"><path
         d="M 2.8346457,2.8346457 H 429.16535 V 268.36535 H 2.8346457 Z"
         id="path2594" /></clipPath><clipPath
       clipPathUnits="userSpaceOnUse"
       id="clipPath2606"><path
         d="M 2.8346457,2.8346457 H 429.16535 V 268.36535 H 2.8346457 Z"
         id="path2604" /></clipPath><clipPath
       clipPathUnits="userSpaceOnUse"
       id="clipPath2616"><path
         d="M 2.8346457,2.8346457 H 429.16535 V 268.36535 H 2.8346457 Z"
         id="path2614" /></clipPath><clipPath
       clipPathUnits="userSpaceOnUse"
       id="clipPath2626"><path
         d="M 2.8346457,2.8346457 H 429.16535 V 268.36535 H 2.8346457 Z"
         id="path2624" /></clipPath><clipPath
       clipPathUnits="userSpaceOnUse"
       id="clipPath3511"><path
         d="M -1016,-351 H 1660 V 1068 H -1016 Z"
         id="path3509" /></clipPath><clipPath
       clipPathUnits="userSpaceOnUse"
       id="clipPath3639"><path
         d="M 2.8346457,2.8346457 H 429.16535 V 268.36535 H 2.8346457 Z"
         id="path3637" /></clipPath><clipPath
       clipPathUnits="userSpaceOnUse"
       id="clipPath3649"><path
         d="M 2.8346457,2.8346457 H 429.16535 V 268.36535 H 2.8346457 Z"
         id="path3647" /></clipPath><clipPath
       clipPathUnits="userSpaceOnUse"
       id="clipPath5977"><path
         d="M 2.8346457,2.8346457 H 429.16535 V 268.36535 H 2.8346457 Z"
         id="path5975" /></clipPath><clipPath
       clipPathUnits="userSpaceOnUse"
       id="clipPath5993"><path
         d="M 2.8346457,2.8346457 H 429.16535 V 268.36535 H 2.8346457 Z"
         id="path5991" /></clipPath><clipPath
       clipPathUnits="userSpaceOnUse"
       id="clipPath6003"><path
         d="M 2.8346457,2.8346457 H 429.16535 V 268.36535 H 2.8346457 Z"
         id="path6001" /></clipPath><clipPath
       clipPathUnits="userSpaceOnUse"
       id="clipPath6013"><path
         d="M 2.8346457,2.8346457 H 429.16535 V 268.36535 H 2.8346457 Z"
         id="path6011" /></clipPath><clipPath
       clipPathUnits="userSpaceOnUse"
       id="clipPath6023"><path
         d="M 2.8346457,2.8346457 H 429.16535 V 268.36535 H 2.8346457 Z"
         id="path6021" /></clipPath><clipPath
       clipPathUnits="userSpaceOnUse"
       id="clipPath6033"><path
         d="M 2.8346457,2.8346457 H 429.16535 V 268.36535 H 2.8346457 Z"
         id="path6031" /></clipPath><clipPath
       clipPathUnits="userSpaceOnUse"
       id="clipPath6043"><path
         d="M 2.8346457,2.8346457 H 429.16535 V 268.36535 H 2.8346457 Z"
         id="path6041" /></clipPath><clipPath
       clipPathUnits="userSpaceOnUse"
       id="clipPath6053"><path
         d="M 2.8346457,2.8346457 H 429.16535 V 268.36535 H 2.8346457 Z"
         id="path6051" /></clipPath><clipPath
       clipPathUnits="userSpaceOnUse"
       id="clipPath6063"><path
         d="M 2.8346457,2.8346457 H 429.16535 V 268.36535 H 2.8346457 Z"
         id="path6061" /></clipPath><clipPath
       clipPathUnits="userSpaceOnUse"
       id="clipPath50-3"><path
         d="M -1016,-351 H 1660 V 1068 H -1016 Z"
         id="path48-6" /></clipPath><clipPath
       clipPathUnits="userSpaceOnUse"
       id="clipPath6053-5"><path
         d="M 2.8346457,2.8346457 H 429.16535 V 268.36535 H 2.8346457 Z"
         id="path6051-9" /></clipPath><clipPath
       clipPathUnits="userSpaceOnUse"
       id="clipPath50-3-5"><path
         d="M -1016,-351 H 1660 V 1068 H -1016 Z"
         id="path48-6-0" /></clipPath><clipPath
       clipPathUnits="userSpaceOnUse"
       id="clipPath50-3-0"><path
         d="M -1016,-351 H 1660 V 1068 H -1016 Z"
         id="path48-6-9" /></clipPath></defs><sodipodi:namedview
     pagecolor="#ffffff"
     bordercolor="#666666"
     borderopacity="1"
     objecttolerance="10"
     gridtolerance="10"
     guidetolerance="10"
     inkscape:pageopacity="0"
     inkscape:pageshadow="2"
     inkscape:window-width="1920"
     inkscape:window-height="1034"
     id="namedview4"
     showgrid="false"
     showguides="true"
     inkscape:guide-bbox="true"
     fit-margin-top="0"
     fit-margin-left="0"
     fit-margin-right="0"
     fit-margin-bottom="0"
     inkscape:zoom="0.75928046"
     inkscape:cx="607.6258"
     inkscape:cy="158.76001"
     inkscape:window-x="0"
     inkscape:window-y="22"
     inkscape:window-maximized="0"
     inkscape:current-layer="layer1"><sodipodi:guide
       position="1074.2223,365.24389"
       orientation="1,0"
       id="guide7717" /><sodipodi:guide
       position="1240.9155,360.45845"
       orientation="1,0"
       id="guide7719" /><sodipodi:guide
       position="837.40876,583.04302"
       orientation="0,-1"
       id="guide7929" /></sodipodi:namedview><g
     id="g10"
     inkscape:groupmode="layer"
     inkscape:label="epsp_efficacy_h"
     transform="matrix(1.3333333,0,0,-1.3333333,-17.893877,380.22046)"><g
       id="g2544"
       transform="translate(-92.923811,-35.724066)"><text
         transform="scale(1,-1)"
         style="font-variant:normal;font-weight:normal;font-size:14px;font-family:'DejaVu Sans';-inkscape-font-specification:DejaVuSans;writing-mode:lr-tb;fill:#000000;fill-opacity:1;fill-rule:nonzero;stroke:none"
         id="text2548"
         x="144.85262"
         y="-284.29333"><tspan
           sodipodi:role="line"
           id="tspan2546"
           x="144.85262"
           y="-284.29333"
           style="font-size:18px">Human physiology</tspan><tspan
           sodipodi:role="line"
           x="144.85262"
           y="-261.79333"
           id="tspan8023"
           style="font-size:18px">NAR = 1.8</tspan></text></g><g
       id="g7493"
       transform="rotate(1.2945528,242.55129,125.39496)"><path
         d="M 53.124444,64.172873 237.55355,41.078177"
         style="fill:none;stroke:#000000;stroke-width:0.8;stroke-linecap:square;stroke-linejoin:round;stroke-miterlimit:10;stroke-dasharray:none;stroke-opacity:1"
         id="path22" /><path
         d="M 62.61212,63.358829 58.602118,62.737474"
         style="fill:none;stroke:#000000;stroke-width:0.8;stroke-linecap:square;stroke-linejoin:round;stroke-miterlimit:10;stroke-dasharray:none;stroke-opacity:0.1"
         id="path66" /><path
         d="M 102.45678,58.375044 98.462314,57.734698"
         style="fill:none;stroke:#000000;stroke-width:0.8;stroke-linecap:square;stroke-linejoin:round;stroke-miterlimit:10;stroke-dasharray:none;stroke-opacity:0.1"
         id="path72" /><path
         d="m 143.5275,53.237903 -3.97607,-0.660221"
         style="fill:none;stroke:#000000;stroke-width:0.8;stroke-linecap:square;stroke-linejoin:round;stroke-miterlimit:10;stroke-dasharray:none;stroke-opacity:0.1"
         id="path78" /><path
         d="M 185.88175,47.940218 181.9272,47.259181"
         style="fill:none;stroke:#000000;stroke-width:0.8;stroke-linecap:square;stroke-linejoin:round;stroke-miterlimit:10;stroke-dasharray:none;stroke-opacity:0.1"
         id="path84" /><path
         d="M 229.58065,42.474342 225.65101,41.77149"
         style="fill:none;stroke:#000000;stroke-width:0.8;stroke-linecap:square;stroke-linejoin:round;stroke-miterlimit:10;stroke-dasharray:none;stroke-opacity:0.1"
         id="path90" /><path
         d="M 388.298,68.258622 237.55355,41.078177"
         style="fill:none;stroke:#000000;stroke-width:0.8;stroke-linecap:square;stroke-linejoin:round;stroke-miterlimit:10;stroke-dasharray:none;stroke-opacity:1"
         id="path96" /><path
         d="m 242.64048,42.475993 4.73554,-0.589566"
         style="fill:none;stroke:#000000;stroke-width:0.8;stroke-linecap:square;stroke-linejoin:round;stroke-miterlimit:10;stroke-dasharray:none;stroke-opacity:0.1"
         id="path110" /><path
         d="m 292.04175,51.37122 4.69606,-0.559938"
         style="fill:none;stroke:#000000;stroke-width:0.8;stroke-linecap:square;stroke-linejoin:round;stroke-miterlimit:10;stroke-dasharray:none;stroke-opacity:0.1"
         id="path116" /><path
         d="m 338.9928,59.825258 4.65461,-0.532489"
         style="fill:none;stroke:#000000;stroke-width:0.8;stroke-linecap:square;stroke-linejoin:round;stroke-miterlimit:10;stroke-dasharray:none;stroke-opacity:0.1"
         id="path122" /><path
         d="m 383.6715,67.870136 4.61163,-0.50701"
         style="fill:none;stroke:#000000;stroke-width:0.8;stroke-linecap:square;stroke-linejoin:round;stroke-miterlimit:10;stroke-dasharray:none;stroke-opacity:0.1"
         id="path128" /><g
         id="g8906"><text
           transform="matrix(1.0009924,-0.02262048,-0.02256413,-0.99849865,-2.7710505,5.5117938)"
           style="font-variant:normal;font-weight:normal;font-size:13.7243px;font-family:'DejaVu Sans';-inkscape-font-specification:DejaVuSans;writing-mode:lr-tb;fill:#000000;fill-opacity:1;fill-rule:nonzero;stroke:none;stroke-width:1.71549"
           id="text94"
           x="207.82796"
           y="-22.97184"><tspan
             x="207.82796 216.55815 225.28685"
             y="-22.97184"
             sodipodi:role="line"
             id="tspan92"
             style="stroke-width:1.71549">500</tspan></text><text
           transform="matrix(1.0012468,-5.6345685e-5,5.6345688e-5,-0.99875475,0,0)"
           style="font-variant:normal;font-weight:normal;font-size:13.7243px;font-family:'DejaVu Sans';-inkscape-font-specification:DejaVuSans;writing-mode:lr-tb;fill:#000000;fill-opacity:1;fill-rule:nonzero;stroke:none;stroke-width:1.71549"
           id="text70"
           x="43.132477"
           y="-42.629574"><tspan
             x="43.132477 51.860935 60.589527"
             y="-42.629574"
             sodipodi:role="line"
             id="tspan68"
             style="stroke-width:1.71549">100</tspan></text><text
           transform="matrix(1.0012468,-5.6345685e-5,5.6345688e-5,-0.99875475,0,0)"
           style="font-variant:normal;font-weight:normal;font-size:13.7243px;font-family:'DejaVu Sans';-inkscape-font-specification:DejaVuSans;writing-mode:lr-tb;fill:#000000;fill-opacity:1;fill-rule:nonzero;stroke:none;stroke-width:1.71549"
           id="text76"
           x="85.387558"
           y="-36.880978"><tspan
             x="85.387558 94.116058 102.84471"
             y="-36.880978"
             sodipodi:role="line"
             id="tspan74"
             style="stroke-width:1.71549">200</tspan></text><text
           transform="matrix(1.0012468,-5.6345685e-5,5.6345688e-5,-0.99875475,0,0)"
           style="font-variant:normal;font-weight:normal;font-size:13.7243px;font-family:'DejaVu Sans';-inkscape-font-specification:DejaVuSans;writing-mode:lr-tb;fill:#000000;fill-opacity:1;fill-rule:nonzero;stroke:none;stroke-width:1.71549"
           id="text82"
           x="127.13679"
           y="-32.668785"><tspan
             x="127.13679 135.86522 144.5934"
             y="-32.668785"
             sodipodi:role="line"
             id="tspan80"
             style="stroke-width:1.71549">300</tspan></text><text
           transform="matrix(1.0012468,-5.6345685e-5,5.6345688e-5,-0.99875475,0,0)"
           style="font-variant:normal;font-weight:normal;font-size:13.7243px;font-family:'DejaVu Sans';-inkscape-font-specification:DejaVuSans;writing-mode:lr-tb;fill:#000000;fill-opacity:1;fill-rule:nonzero;stroke:none;stroke-width:1.71549"
           id="text88"
           x="167.01945"
           y="-27.065519"><tspan
             x="167.01945 175.7484 184.47676"
             y="-27.065519"
             sodipodi:role="line"
             id="tspan86"
             style="stroke-width:1.71549">400</tspan></text><text
           transform="matrix(1.0012468,-5.6345685e-5,5.6345688e-5,-0.99875475,0,0)"
           style="font-variant:normal;font-weight:normal;font-size:13.7243px;font-family:'DejaVu Sans';-inkscape-font-specification:DejaVuSans;writing-mode:lr-tb;fill:#000000;fill-opacity:1;fill-rule:nonzero;stroke:none;stroke-width:1.71549"
           id="text120"
           x="267.5787"
           y="-30.493767"><tspan
             x="267.5787 276.30746"
             y="-30.493767"
             sodipodi:role="line"
             id="tspan118"
             style="stroke-width:1.71549">50</tspan></text><text
           transform="matrix(1.0012468,-5.6345685e-5,5.6345688e-5,-0.99875475,0,0)"
           style="font-variant:normal;font-weight:normal;font-size:13.7243px;font-family:'DejaVu Sans';-inkscape-font-specification:DejaVuSans;writing-mode:lr-tb;fill:#000000;fill-opacity:1;fill-rule:nonzero;stroke:none;stroke-width:1.71549"
           id="text126"
           x="321.80191"
           y="-40.247974"><tspan
             x="321.80191 330.53012 339.25906"
             y="-40.247974"
             sodipodi:role="line"
             id="tspan124"
             style="stroke-width:1.71549">100</tspan></text><text
           transform="matrix(1.0012468,-5.6345685e-5,5.6345688e-5,-0.99875475,0,0)"
           style="font-variant:normal;font-weight:normal;font-size:13.7243px;font-family:'DejaVu Sans';-inkscape-font-specification:DejaVuSans;writing-mode:lr-tb;fill:#000000;fill-opacity:1;fill-rule:nonzero;stroke:none;stroke-width:1.71549"
           id="text132"
           x="373.94543"
           y="-49.630859"><tspan
             x="373.94543 382.67374 391.40262"
             y="-49.630859"
             sodipodi:role="line"
             id="tspan130"
             style="stroke-width:1.71549">150</tspan></text></g><path
         d="m 53.124444,64.172873 3.0206,146.354487"
         style="fill:none;stroke:#000000;stroke-width:0.8;stroke-linecap:square;stroke-linejoin:round;stroke-miterlimit:10;stroke-dasharray:none;stroke-opacity:1"
         id="path134" /><path
         d="M 388.42202,74.267663 208.07009,93.673561 52.997275,70.254664"
         style="fill:none;stroke:#b0b0b0;stroke-width:0.8;stroke-linecap:butt;stroke-linejoin:round;stroke-miterlimit:10;stroke-dasharray:none;stroke-opacity:1"
         id="path140" /><path
         d="m 389.29411,116.52209 -181.29127,16.91 -153.538511,-20.40813"
         style="fill:none;stroke:#b0b0b0;stroke-width:0.8;stroke-linecap:butt;stroke-linejoin:round;stroke-miterlimit:10;stroke-dasharray:none;stroke-opacity:1"
         id="path144"
         sodipodi:nodetypes="ccc" /><path
         d="M 390.17537,159.22105 207.93493,173.58312 55.13079,157.04424"
         style="fill:none;stroke:#b0b0b0;stroke-width:0.8;stroke-linecap:butt;stroke-linejoin:round;stroke-miterlimit:10;stroke-dasharray:none;stroke-opacity:1"
         id="path148"
         sodipodi:nodetypes="ccc" /><path
         d="M 391.06595,202.37159 207.86634,214.1325 56.1374,200.60072"
         style="fill:none;stroke:#b0b0b0;stroke-width:0.8;stroke-linecap:butt;stroke-linejoin:round;stroke-miterlimit:10;stroke-dasharray:none;stroke-opacity:1"
         id="path152"
         sodipodi:nodetypes="ccc" /><path
         d="m 386.88623,74.432914 4.61216,-0.496268"
         style="fill:none;stroke:#000000;stroke-width:0.8;stroke-linecap:square;stroke-linejoin:round;stroke-miterlimit:10;stroke-dasharray:none;stroke-opacity:0.1"
         id="path154" /><path
         d="m 387.74983,116.66613 4.63767,-0.43258"
         style="fill:none;stroke:#000000;stroke-width:0.8;stroke-linecap:square;stroke-linejoin:round;stroke-miterlimit:10;stroke-dasharray:none;stroke-opacity:0.1"
         id="path166" /><path
         d="m 388.18503,137.94883 4.65053,-0.40022"
         style="fill:none;stroke:#000000;stroke-width:0.8;stroke-linecap:square;stroke-linejoin:round;stroke-miterlimit:10;stroke-dasharray:none;stroke-opacity:0.1"
         id="path172" /><path
         d="m 388.62251,159.34342 4.66347,-0.36752"
         style="fill:none;stroke:#000000;stroke-width:0.8;stroke-linecap:square;stroke-linejoin:round;stroke-miterlimit:10;stroke-dasharray:none;stroke-opacity:0.1"
         id="path178" /><path
         d="m 389.0623,180.8508 4.67647,-0.33447"
         style="fill:none;stroke:#000000;stroke-width:0.8;stroke-linecap:square;stroke-linejoin:round;stroke-miterlimit:10;stroke-dasharray:none;stroke-opacity:0.1"
         id="path184" /><path
         d="m 389.50441,202.47184 4.68955,-0.30106"
         style="fill:none;stroke:#000000;stroke-width:0.8;stroke-linecap:square;stroke-linejoin:round;stroke-miterlimit:10;stroke-dasharray:none;stroke-opacity:0.1"
         id="path190" /><g
         id="g196"><g
           id="g198"
           clip-path="url(#clipPath202)"><path
             d="m 68.988859,71.527862 5.071643,6.080072 5.056443,5.894027 5.04086,5.71775 5.024923,5.551331 5.008658,5.394678 4.992108,5.24675 4.975286,5.10844 4.95817,4.98206 4.94067,4.87915 4.9226,4.81601 4.90387,4.81075 4.88978,4.4101 4.08746,76.76718 4.93606,0.4355 4.91238,0.43342 4.88887,0.43134 4.86552,0.42928 4.84233,0.42724 4.81933,0.42521 4.79647,0.42319 4.77378,0.42118 4.75125,0.4192 4.72889,0.41723 4.70667,0.41527 4.68462,0.41332 4.66272,0.41139 4.64097,0.40947 4.61937,0.40756 4.59793,0.40567"
             style="fill:none;stroke:#e36f47;stroke-width:4;stroke-linecap:round;stroke-linejoin:round;stroke-miterlimit:10;stroke-dasharray:none;stroke-opacity:1"
             id="path204" /></g></g><g
         id="g2534"><g
           id="g2536"
           clip-path="url(#clipPath2540)"><path
             d="m 88.766172,69.095536 5.079748,5.766339 5.068337,5.264299 5.054753,4.855947 5.03952,4.520874 5.02301,4.245509 5.00551,4.01963 4.98728,3.833356 4.9684,3.68544 4.94905,3.57075 4.92928,3.49152 4.90908,3.45871 4.88836,3.49283 4.85161,5.46241 4.20953,85.52897 4.90032,0.43982 4.87669,0.43769 4.85324,0.43559 4.82994,0.4335 4.80682,0.43143 4.78386,0.42936 4.76106,0.42732 4.73844,0.42528 4.71597,0.42327 4.69365,0.42127 4.67151,0.41928 4.64951,0.4173 4.62766,0.41535 4.60598,0.4134 4.58445,0.41146"
             style="fill:none;stroke:#ce7648;stroke-width:4;stroke-linecap:round;stroke-linejoin:round;stroke-miterlimit:10;stroke-dasharray:none;stroke-opacity:1"
             id="path2542" /></g></g><g
         id="g2550"><g
           id="g2552"
           clip-path="url(#clipPath2556)"><path
             d="m 108.84238,66.625418 5.08423,5.551232 5.07294,4.908685 5.05856,4.431077 5.04212,4.070268 5.02418,3.798583 5.00518,3.59766 4.98538,3.45673 4.96493,3.377786 4.94381,3.379371 4.92159,3.54698 4.84665,11.16055 4.84661,9.44965 4.40802,81.14025 4.91127,0.44854 4.88736,0.44636 4.86363,0.44419 4.84005,0.44204 4.81665,0.4399 4.79343,0.43778 4.77036,0.43567 4.74747,0.43359 4.72474,0.4315 4.70217,0.42945 4.67977,0.4274 4.65752,0.42536 4.63543,0.42335 4.6135,0.42135 4.59172,0.41936 4.5701,0.41738"
             style="fill:none;stroke:#b97c49;stroke-width:4;stroke-linecap:round;stroke-linejoin:round;stroke-miterlimit:10;stroke-dasharray:none;stroke-opacity:1"
             id="path2558" /></g></g><g
         id="g2560"><g
           id="g2562"
           clip-path="url(#clipPath2566)"><path
             d="m 129.22433,64.113999 5.08639,5.377559 5.07372,4.673501 5.05788,4.178014 5.03998,3.826299 5.02069,3.580996 5.00044,3.423962 4.97938,3.360654 4.95747,3.44002 4.91021,7.903516 4.88625,9.5075 4.89166,5.42971 4.87955,3.89408 4.86161,3.29511 4.8412,3.23232 4.65137,78.78903 4.84962,0.45083 4.82594,0.44863 4.80244,0.44645 4.77911,0.44428 4.75595,0.44212 4.73295,0.43998 4.71013,0.43787 4.68746,0.43576 4.66497,0.43366 4.64262,0.43159 4.62045,0.42953 4.59843,0.42748 4.57657,0.42545 4.55487,0.42343"
             style="fill:none;stroke:#a58349;stroke-width:4;stroke-linecap:round;stroke-linejoin:round;stroke-miterlimit:10;stroke-dasharray:none;stroke-opacity:1"
             id="path2568" /></g></g><g
         id="g2570"><g
           id="g2572"
           clip-path="url(#clipPath2576)"><path
             d="m 149.91904,61.558658 5.08668,5.220705 5.07195,4.504423 5.0544,4.01937 5.03512,3.690537 5.01469,3.481648 4.99343,3.389911 4.97136,3.479808 4.93112,8.298687 4.91575,8.304893 4.91076,4.50729 4.8939,3.15733 4.8737,2.50532 4.85226,2.12032 4.83027,1.86639 4.80801,1.68732 4.78563,1.55547 4.76326,1.45556 4.74091,1.37865 4.71864,1.31942 4.69649,1.2742 4.67446,1.24132 4.6526,1.22015 4.63091,1.21143 4.60947,1.21824 4.58833,1.24829 4.56769,1.32209 4.54818,1.51406 4.53904,2.98766 5.09264,72.11149"
             style="fill:none;stroke:#908a4a;stroke-width:4;stroke-linecap:round;stroke-linejoin:round;stroke-miterlimit:10;stroke-dasharray:none;stroke-opacity:1"
             id="path2578" /></g></g><g
         id="g2580"><g
           id="g2582"
           clip-path="url(#clipPath2586)"><path
             d="m 170.93373,58.95859 5.08524,5.067667 5.06819,4.374487 5.04894,3.918091 5.02841,3.62306 5.00707,3.463288 4.98514,3.47915 4.9582,6.198153 4.93629,9.007937 4.92484,4.536887 4.90508,3.04578 4.88317,2.36719 4.86051,1.9748 4.83756,1.71743 4.81449,1.53539 4.79141,1.39973 4.76837,1.29481 4.7454,1.21139 4.72253,1.14338 4.69977,1.08701 4.67714,1.0395 4.65463,0.99885 4.63227,0.96377 4.61004,0.93311 4.58795,0.90606 4.56601,0.88202 4.54421,0.86049 4.52256,0.84111 4.50105,0.82349 4.47968,0.80742"
             style="fill:none;stroke:#7c904b;stroke-width:4;stroke-linecap:round;stroke-linejoin:round;stroke-miterlimit:10;stroke-dasharray:none;stroke-opacity:1"
             id="path2588" /></g></g><g
         id="g2590"><g
           id="g2592"
           clip-path="url(#clipPath2596)"><path
             d="m 192.27583,56.314242 5.08205,4.91381 5.06272,4.265918 5.04193,3.853557 5.02033,3.603605 4.99838,3.512597 4.97645,3.773702 4.95899,9.48534 4.93927,5.361181 4.91599,3.237245 4.8923,2.417363 4.86849,1.97773 4.84467,1.7012 4.8209,1.51099 4.79723,1.37206 4.77367,1.26636 4.75024,1.18339 4.72695,1.11653 4.7038,1.0616 4.68081,1.01572 4.65796,0.97683 4.63526,0.9434 4.61273,0.91438 4.59035,0.88893 4.56811,0.86641 4.54605,0.84633 4.52412,0.82828 4.50236,0.81197 4.48074,0.79714 4.45928,0.78354"
             style="fill:none;stroke:#67974c;stroke-width:4;stroke-linecap:round;stroke-linejoin:round;stroke-miterlimit:10;stroke-dasharray:none;stroke-opacity:1"
             id="path2598" /></g></g><g
         id="g2600"><g
           id="g2602"
           clip-path="url(#clipPath2606)"><path
             d="m 213.95302,53.626486 5.07705,4.7585 5.05566,4.169929 5.03355,3.810183 5.0112,3.619007 4.98911,3.633352 4.97429,6.207523 4.96042,7.609447 4.92856,3.81667 4.90189,2.624375 4.87654,2.072226 4.85172,1.749519 4.8272,1.536999 4.80291,1.386504 4.77883,1.27465 4.75495,1.18826 4.73125,1.11977 4.70773,1.06415 4.68438,1.01811 4.66121,0.97941 4.6382,0.94641 4.61537,0.91796 4.59271,0.89311 4.57021,0.87122 4.54787,0.85178 4.5257,0.83438 4.50369,0.81866 4.48184,0.80439 4.46014,0.79135 4.43861,0.77936"
             style="fill:none;stroke:#529d4d;stroke-width:4;stroke-linecap:round;stroke-linejoin:round;stroke-miterlimit:10;stroke-dasharray:none;stroke-opacity:1"
             id="path2608" /></g></g><g
         id="g2610"><g
           id="g2612"
           clip-path="url(#clipPath2616)"><path
             d="m 235.97323,50.895949 5.07017,4.603578 5.04703,4.079356 5.02391,3.780054 5.00118,3.660691 4.97994,3.855532 4.98043,7.917556 4.94814,5.350475 4.91326,3.07599 4.88518,2.271516 4.8589,1.857244 4.83342,1.602562 4.80842,1.429949 4.78376,1.305438 4.75938,1.211624 4.73524,1.13855 4.71134,1.080077 4.68763,1.032279 4.66413,0.99255 4.64081,0.95893 4.61768,0.93011 4.59473,0.90515 4.57196,0.88326 4.54936,0.8639 4.52693,0.84662 4.50468,0.83107 4.48259,0.81699 4.46066,0.80415 4.43889,0.79235 4.41729,0.78148"
             style="fill:none;stroke:#3ea44e;stroke-width:4;stroke-linecap:round;stroke-linejoin:round;stroke-miterlimit:10;stroke-dasharray:none;stroke-opacity:1"
             id="path2618" /></g></g><g
         id="g2620"><g
           id="g2622"
           clip-path="url(#clipPath2626)"><path
             d="m 154.09615,61.042245 5.08653,5.189844 5.07134,4.475888 5.05345,3.99564 5.03391,3.672368 5.01327,3.471839 4.99185,3.397519 4.96959,3.542783 4.92802,9.496146 4.92055,7.183978 4.91071,4.08088 4.89227,2.94158 4.87139,2.3633 4.84956,2.0115 4.82727,1.77453 4.80481,1.60414 4.78226,1.47608 4.75971,1.37674 4.73721,1.29773 4.7148,1.23372 4.69247,1.18123 4.67027,1.13773 4.64818,1.10145 4.62623,1.07119 4.60443,1.04618 4.58276,1.0256 4.56126,1.00936 4.53992,0.99725 4.51874,0.98935 4.49776,0.98634"
             style="fill:none;stroke:#000000;stroke-width:4;stroke-linecap:round;stroke-linejoin:round;stroke-miterlimit:10;stroke-dasharray:none;stroke-opacity:1"
             id="path2628" /></g></g><g
         id="g8906-5"
         transform="translate(423.17964,-9.4148078)"><text
           transform="matrix(1.0009924,-0.02262048,-0.02256413,-0.99849867,0,0)"
           style="font-variant:normal;font-weight:normal;font-size:13.7243px;font-family:'DejaVu Sans';-inkscape-font-specification:DejaVuSans;writing-mode:lr-tb;fill:#000000;fill-opacity:1;fill-rule:nonzero;stroke:none;stroke-width:1.71549"
           id="text94-6"
           x="204.93669"
           y="-25.422676"><tspan
             x="204.93669 213.66689 222.39558"
             y="-25.422676"
             sodipodi:role="line"
             id="tspan92-9"
             style="stroke-width:1.71549">500</tspan></text><text
           transform="matrix(1.0012468,-5.6345685e-5,5.6345688e-5,-0.99875475,0,0)"
           style="font-variant:normal;font-weight:normal;font-size:13.7243px;font-family:'DejaVu Sans';-inkscape-font-specification:DejaVuSans;writing-mode:lr-tb;fill:#000000;fill-opacity:1;fill-rule:nonzero;stroke:none;stroke-width:1.71549"
           id="text70-3"
           x="43.20034"
           y="-45.632549"><tspan
             x="43.20034 51.928799 60.657391"
             y="-45.632549"
             sodipodi:role="line"
             id="tspan68-7"
             style="stroke-width:1.71549">100</tspan></text><text
           transform="matrix(1.0012468,-5.6345685e-5,5.6345688e-5,-0.99875475,0,0)"
           style="font-variant:normal;font-weight:normal;font-size:13.7243px;font-family:'DejaVu Sans';-inkscape-font-specification:DejaVuSans;writing-mode:lr-tb;fill:#000000;fill-opacity:1;fill-rule:nonzero;stroke:none;stroke-width:1.71549"
           id="text76-4"
           x="85.421486"
           y="-38.382465"><tspan
             x="85.421486 94.149986 102.87864"
             y="-38.382465"
             sodipodi:role="line"
             id="tspan74-5"
             style="stroke-width:1.71549">200</tspan></text><text
           transform="matrix(1.0012468,-5.6345685e-5,5.6345688e-5,-0.99875475,0,0)"
           style="font-variant:normal;font-weight:normal;font-size:13.7243px;font-family:'DejaVu Sans';-inkscape-font-specification:DejaVuSans;writing-mode:lr-tb;fill:#000000;fill-opacity:1;fill-rule:nonzero;stroke:none;stroke-width:1.71549"
           id="text82-2"
           x="127.13679"
           y="-32.668785"><tspan
             x="127.13679 135.86522 144.5934"
             y="-32.668785"
             sodipodi:role="line"
             id="tspan80-5"
             style="stroke-width:1.71549">300</tspan></text><text
           transform="matrix(1.0012468,-5.6345685e-5,5.6345688e-5,-0.99875475,0,0)"
           style="font-variant:normal;font-weight:normal;font-size:13.7243px;font-family:'DejaVu Sans';-inkscape-font-specification:DejaVuSans;writing-mode:lr-tb;fill:#000000;fill-opacity:1;fill-rule:nonzero;stroke:none;stroke-width:1.71549"
           id="text88-4"
           x="166.98552"
           y="-25.56403"><tspan
             x="166.98552 175.71446 184.44283"
             y="-25.56403"
             sodipodi:role="line"
             id="tspan86-7"
             style="stroke-width:1.71549">400</tspan></text><text
           transform="matrix(1.0012468,-5.6345685e-5,5.6345688e-5,-0.99875475,0,0)"
           style="font-variant:normal;font-weight:normal;font-size:13.7243px;font-family:'DejaVu Sans';-inkscape-font-specification:DejaVuSans;writing-mode:lr-tb;fill:#000000;fill-opacity:1;fill-rule:nonzero;stroke:none;stroke-width:1.71549"
           id="text120-4"
           x="267.4769"
           y="-25.989298"><tspan
             x="267.4769 276.20566"
             y="-25.989298"
             sodipodi:role="line"
             id="tspan118-4"
             style="stroke-width:1.71549">50</tspan></text><text
           transform="matrix(1.0012468,-5.6345685e-5,5.6345688e-5,-0.99875475,0,0)"
           style="font-variant:normal;font-weight:normal;font-size:13.7243px;font-family:'DejaVu Sans';-inkscape-font-specification:DejaVuSans;writing-mode:lr-tb;fill:#000000;fill-opacity:1;fill-rule:nonzero;stroke:none;stroke-width:1.71549"
           id="text126-3"
           x="321.7001"
           y="-35.743511"><tspan
             x="321.7001 330.42831 339.15726"
             y="-35.743511"
             sodipodi:role="line"
             id="tspan124-0"
             style="stroke-width:1.71549">100</tspan></text><text
           transform="matrix(1.0012468,-5.6345685e-5,5.6345688e-5,-0.99875475,0,0)"
           style="font-variant:normal;font-weight:normal;font-size:13.7243px;font-family:'DejaVu Sans';-inkscape-font-specification:DejaVuSans;writing-mode:lr-tb;fill:#000000;fill-opacity:1;fill-rule:nonzero;stroke:none;stroke-width:1.71549"
           id="text132-7"
           x="373.87756"
           y="-46.627884"><tspan
             x="373.87756 382.60587 391.33475"
             y="-46.627884"
             sodipodi:role="line"
             id="tspan130-8"
             style="stroke-width:1.71549">150</tspan></text></g></g><g
       id="g3471"
       inkscape:label="epsp_efficacy_m"
       transform="translate(429.16535,-2.8346457)"><path
         d="M 0,0 H 432 V 288 H 0 Z"
         style="fill:#000000;fill-opacity:0;fill-rule:nonzero;stroke:none"
         id="path3473" /><path
         d="M 53.124444,64.172873 237.55355,41.078177"
         style="fill:none;stroke:#000000;stroke-width:0.8;stroke-linecap:square;stroke-linejoin:round;stroke-miterlimit:10;stroke-dasharray:none;stroke-opacity:1"
         id="path3483" /><path
         d="m 143.5275,53.237903 -3.97607,-0.660221"
         style="fill:none;stroke:#000000;stroke-width:0.8;stroke-linecap:square;stroke-linejoin:round;stroke-miterlimit:10;stroke-dasharray:none;stroke-opacity:0.1"
         id="path3539" /><path
         d="M 185.88175,47.940218 181.9272,47.259181"
         style="fill:none;stroke:#000000;stroke-width:0.8;stroke-linecap:square;stroke-linejoin:round;stroke-miterlimit:10;stroke-dasharray:none;stroke-opacity:0.1"
         id="path3545" /><path
         d="M 229.58065,42.474342 225.65101,41.77149"
         style="fill:none;stroke:#000000;stroke-width:0.8;stroke-linecap:square;stroke-linejoin:round;stroke-miterlimit:10;stroke-dasharray:none;stroke-opacity:0.1"
         id="path3551" /><path
         d="M 388.298,68.258622 237.55355,41.078177"
         style="fill:none;stroke:#000000;stroke-width:0.8;stroke-linecap:square;stroke-linejoin:round;stroke-miterlimit:10;stroke-dasharray:none;stroke-opacity:1"
         id="path3557" /><path
         d="m 242.64048,42.475993 4.73554,-0.589566"
         style="fill:none;stroke:#000000;stroke-width:0.8;stroke-linecap:square;stroke-linejoin:round;stroke-miterlimit:10;stroke-dasharray:none;stroke-opacity:0.1"
         id="path3571" /><path
         d="m 292.04175,51.37122 4.69606,-0.559938"
         style="fill:none;stroke:#000000;stroke-width:0.8;stroke-linecap:square;stroke-linejoin:round;stroke-miterlimit:10;stroke-dasharray:none;stroke-opacity:0.1"
         id="path3577" /><path
         d="M 390.29058,164.80369 207.92605,178.83073 51.080981,161.90061"
         style="fill:none;stroke:#b0b0b0;stroke-width:0.8;stroke-linecap:butt;stroke-linejoin:round;stroke-miterlimit:10;stroke-dasharray:none;stroke-opacity:1"
         id="path3605" /><g
         id="g7542"
         transform="rotate(1.0711142,246.55244,141.2458)"><path
           d="M 62.61212,63.358829 58.602118,62.737474"
           style="fill:none;stroke:#000000;stroke-width:0.8;stroke-linecap:square;stroke-linejoin:round;stroke-miterlimit:10;stroke-dasharray:none;stroke-opacity:0.1"
           id="path3527" /><path
           d="M 102.45678,58.375044 98.462314,57.734698"
           style="fill:none;stroke:#000000;stroke-width:0.8;stroke-linecap:square;stroke-linejoin:round;stroke-miterlimit:10;stroke-dasharray:none;stroke-opacity:0.1"
           id="path3533" /><path
           d="m 338.9928,59.825258 4.65461,-0.532489"
           style="fill:none;stroke:#000000;stroke-width:0.8;stroke-linecap:square;stroke-linejoin:round;stroke-miterlimit:10;stroke-dasharray:none;stroke-opacity:0.1"
           id="path3583" /><path
           d="m 383.6715,67.870136 4.61163,-0.50701"
           style="fill:none;stroke:#000000;stroke-width:0.8;stroke-linecap:square;stroke-linejoin:round;stroke-miterlimit:10;stroke-dasharray:none;stroke-opacity:0.1"
           id="path3589" /><path
           d="m 388.298,68.258622 3.0206,146.354518"
           style="fill:none;stroke:#000000;stroke-width:0.8;stroke-linecap:square;stroke-linejoin:round;stroke-miterlimit:10;stroke-dasharray:none;stroke-opacity:1"
           id="path3595" /><path
           d="M 388.42697,74.507575 208.0697,93.899373 52.992198,70.497482"
           style="fill:none;stroke:#b0b0b0;stroke-width:0.8;stroke-linecap:butt;stroke-linejoin:round;stroke-miterlimit:10;stroke-dasharray:none;stroke-opacity:1"
           id="path3601" /><path
           d="M 389.3536,119.40462 207.99825,136.14343 52.04197,115.94173"
           style="fill:none;stroke:#b0b0b0;stroke-width:0.8;stroke-linecap:butt;stroke-linejoin:round;stroke-miterlimit:10;stroke-dasharray:none;stroke-opacity:1"
           id="path3603" /><path
           d="m 386.89114,74.672706 4.6123,-0.495909"
           style="fill:none;stroke:#000000;stroke-width:0.8;stroke-linecap:square;stroke-linejoin:round;stroke-miterlimit:10;stroke-dasharray:none;stroke-opacity:0.1"
           id="path3609" /><path
           d="m 387.80874,119.54721 4.63941,-0.42821"
           style="fill:none;stroke:#000000;stroke-width:0.8;stroke-linecap:square;stroke-linejoin:round;stroke-miterlimit:10;stroke-dasharray:none;stroke-opacity:0.1"
           id="path3615" /><path
           d="m 388.73661,164.92322 4.66684,-0.35896"
           style="fill:none;stroke:#000000;stroke-width:0.8;stroke-linecap:square;stroke-linejoin:round;stroke-miterlimit:10;stroke-dasharray:none;stroke-opacity:0.1"
           id="path3621" /><path
           d="m 389.6749,210.8092 4.6946,-0.28812"
           style="fill:none;stroke:#000000;stroke-width:0.8;stroke-linecap:square;stroke-linejoin:round;stroke-miterlimit:10;stroke-dasharray:none;stroke-opacity:0.1"
           id="path3627" /><g
           id="g3633"><g
             id="g3635"
             clip-path="url(#clipPath3639)"><path
               d="m 68.967979,72.631093 5.000716,9.998182 5.000284,9.25857 4.997216,8.597045 4.991889,8.00344 4.984622,7.46914 4.975682,6.98679 4.965302,6.55013 4.95367,6.15381 4.94091,5.79734 4.92727,5.46941 4.9128,5.1699 4.89764,4.8961 4.88186,4.64562 4.86555,4.41653 4.84877,4.20722 4.83159,4.01639 4.81405,3.84309 4.79619,3.69161 4.77806,3.55869 4.75975,3.43786 4.74126,3.33469 4.72263,3.2504 4.70377,3.21154 4.68494,3.18157 4.66661,3.03967 4.64797,2.96478 4.62897,3.02636 4.60983,3.26211 4.5907,3.84883"
               style="fill:#000000;fill-opacity:0;stroke:#e36f47;stroke-width:4;stroke-linecap:round;stroke-linejoin:round;stroke-miterlimit:10;stroke-dasharray:none;stroke-opacity:1"
               id="path3641" /></g></g><g
           id="g8019"
           transform="translate(-7.4986895,0.14020035)"><text
             transform="matrix(0.02063452,0.99978709,0.99978709,-0.02063452,0,0)"
             style="font-variant:normal;font-weight:normal;font-size:18px;font-family:'DejaVu Sans';-inkscape-font-specification:DejaVuSans;writing-mode:lr-tb;fill:#000000;fill-opacity:1;fill-rule:nonzero;stroke:none"
             id="text3599"
             x="107.53886"
             y="436.11151"><tspan
               sodipodi:role="line"
               id="tspan3597"
               x="107.53886"
               y="436.11151"
               style="font-size:18px">EPSP (mV)</tspan></text><text
             transform="matrix(1,0,0,-1,406.55782,158.90838)"
             style="font-variant:normal;font-weight:normal;font-size:13.5px;font-family:'DejaVu Sans';-inkscape-font-specification:DejaVuSans;writing-mode:lr-tb;fill:#000000;fill-opacity:1;fill-rule:nonzero;stroke:none"
             id="text3625"><tspan
               sodipodi:role="line"
               id="tspan3623"
               style="font-size:13.5px"
               x="0"
               y="0" /></text><text
             transform="matrix(0.0312708,0.99951095,0.99951095,-0.0312708,0,0)"
             style="font-variant:normal;font-weight:normal;font-size:18px;font-family:'DejaVu Sans';-inkscape-font-specification:DejaVuSans;writing-mode:lr-tb;fill:#000000;fill-opacity:1;fill-rule:nonzero;stroke:none;stroke-width:0.999998"
             id="text3599-4"
             x="101.60935"
             y="-399.13953"><tspan
               sodipodi:role="line"
               id="tspan3597-9"
               style="font-size:18px;stroke-width:0.999998"
               x="101.60935"
               y="-399.13953">EPSP (mV)</tspan></text></g><g
           id="g5971"><g
             id="g5973"
             clip-path="url(#clipPath5977)"><path
               d="m 88.751928,69.959856 5.035965,8.56542 5.033958,7.679395 5.028389,6.930432 5.01992,6.296148 5.00918,5.753229 4.99664,5.282 4.98262,4.87368 4.96732,4.52266 4.95112,4.20781 4.93412,3.929 4.91643,3.68652 4.89819,3.46949 4.87958,3.27071 4.8606,3.09137 4.84128,2.93536 4.82175,2.79184 4.80207,2.65743 4.78223,2.5344 4.76227,2.42462 4.74221,2.32771 4.72212,2.23189 4.70201,2.14319 4.68186,2.06092 4.6617,1.99035 4.64156,1.923 4.62145,1.85653 4.60138,1.79436 4.58135,1.73612 4.56136,1.68618"
               style="fill:none;stroke:#ce7648;stroke-width:4;stroke-linecap:round;stroke-linejoin:round;stroke-miterlimit:10;stroke-dasharray:none;stroke-opacity:1"
               id="path5979" /></g></g><g
           id="g5987"><g
             id="g5989"
             clip-path="url(#clipPath5993)"><path
               d="m 108.83345,67.263448 5.06076,7.339197 5.05402,6.516537 5.04418,5.832664 5.03186,5.263808 5.0177,4.780054 5.00204,4.369322 4.98516,4.022 4.96741,3.71688 4.9489,3.45295 4.92977,3.22747 4.91025,3.02269 4.89035,2.84117 4.87012,2.68846 4.84973,2.54364 4.82916,2.4132 4.80846,2.30051 4.78767,2.19749 4.76685,2.09997 4.74598,2.01073 4.7251,1.93613 4.70423,1.86234 4.68339,1.79271 4.66259,1.72821 4.64183,1.67436 4.62112,1.62097 4.60049,1.56894 4.57993,1.52027 4.55943,1.4764 4.53904,1.43969"
               style="fill:none;stroke:#b97c49;stroke-width:4;stroke-linecap:round;stroke-linejoin:round;stroke-miterlimit:10;stroke-dasharray:none;stroke-opacity:1"
               id="path5995" /></g></g><g
           id="g5997"><g
             id="g5999"
             clip-path="url(#clipPath6003)"><path
               d="m 129.21924,64.557623 5.07665,6.30212 5.06509,5.604691 5.05124,5.02407 5.03558,4.53866 5.01857,4.126646 5.00046,3.776307 4.98147,3.481046 4.96188,3.222047 4.94176,2.99691 4.92121,2.80724 4.90041,2.63458 4.87938,2.48168 4.85814,2.35155 4.83683,2.23179 4.81542,2.12263 4.79398,2.02689 4.77251,1.94232 4.75104,1.86104 4.72961,1.78672 4.7082,1.7238 4.68686,1.66322 4.66556,1.60532 4.64434,1.55172 4.62321,1.50708 4.60215,1.46257 4.58118,1.41932 4.5603,1.37885 4.53953,1.34354 4.51888,1.31179"
               style="fill:none;stroke:#a58349;stroke-width:4;stroke-linecap:round;stroke-linejoin:round;stroke-miterlimit:10;stroke-dasharray:none;stroke-opacity:1"
               id="path6005" /></g></g><g
           id="g6007"><g
             id="g6009"
             clip-path="url(#clipPath6013)"><path
               d="m 149.91646,61.848179 5.08501,5.444747 5.06944,4.875641 5.05232,4.396133 5.03398,3.99211 5.0147,3.647683 4.9947,3.352059 4.97414,3.097285 4.95311,2.881425 4.93178,2.689552 4.91021,2.521314 4.88846,2.376142 4.86658,2.24764 4.84463,2.1309 4.82264,2.02673 4.80063,1.93853 4.77864,1.8538 4.75668,1.77691 4.73476,1.70932 4.71291,1.64896 4.69113,1.59027 4.66942,1.53622 4.6478,1.48922 4.62629,1.44593 4.60486,1.40298 4.58354,1.36297 4.56232,1.32714 4.54125,1.29616 4.52025,1.26332 4.49937,1.23246"
               style="fill:none;stroke:#908a4a;stroke-width:4;stroke-linecap:round;stroke-linejoin:round;stroke-miterlimit:10;stroke-dasharray:none;stroke-opacity:1"
               id="path6015" /></g></g><g
           id="g6017"><g
             id="g6019"
             clip-path="url(#clipPath6023)"><path
               d="m 170.93263,59.133179 5.08717,4.747101 5.06853,4.288712 5.04889,3.897862 5.02848,3.563129 5.00746,3.27515 4.98599,3.028203 4.96416,2.813538 4.94207,2.625523 4.91981,2.460666 4.89741,2.317853 4.87493,2.19136 4.85242,2.07738 4.82989,1.975537 4.80739,1.887697 4.78492,1.80671 4.7625,1.73234 4.74014,1.66475 4.71788,1.60737 4.6957,1.55165 4.67361,1.4999 4.65162,1.45217 4.62976,1.41193 4.608,1.37197 4.58635,1.33396 4.56481,1.2985 4.54341,1.26749 4.52215,1.2389 4.50097,1.20973 4.47994,1.18227"
               style="fill:none;stroke:#7c904b;stroke-width:4;stroke-linecap:round;stroke-linejoin:round;stroke-miterlimit:10;stroke-dasharray:none;stroke-opacity:1"
               id="path6025" /></g></g><g
           id="g6057"><g
             id="g6059"
             clip-path="url(#clipPath6063)"><path
               d="m 154.09394,61.305741 5.08589,5.292923 5.06964,4.747762 5.05196,4.288443 5.03316,3.898203 5.0135,3.565116 4.99317,3.279622 4.97232,3.036875 4.95107,2.823506 4.92954,2.637292 4.90778,2.476557 4.88586,2.335377 4.86385,2.207973 4.84178,2.09441 4.81967,1.9984 4.79756,1.90726 4.77548,1.82478 4.75343,1.75186 4.73144,1.68762 4.70951,1.62536 4.68766,1.56819 4.6659,1.51819 4.64423,1.47263 4.62265,1.4276 4.60118,1.38577 4.57981,1.34839 4.55858,1.31576 4.53743,1.28166 4.5164,1.24967 4.49549,1.21957"
               style="fill:none;stroke:#000000;stroke-width:4;stroke-linecap:round;stroke-linejoin:round;stroke-miterlimit:10;stroke-dasharray:none;stroke-opacity:1"
               id="path6065" /></g></g></g><path
         d="M 391.23811,210.71326 207.85309,221.96827 53.533424,207.74225"
         style="fill:none;stroke:#b0b0b0;stroke-width:0.8;stroke-linecap:butt;stroke-linejoin:round;stroke-miterlimit:10;stroke-dasharray:none;stroke-opacity:1"
         id="path3607"
         sodipodi:nodetypes="ccc" /><g
         id="g5981"
         transform="translate(-97.900694,-32.88942)"><text
           transform="scale(1,-1)"
           style="font-variant:normal;font-weight:normal;font-size:14px;font-family:'DejaVu Sans';-inkscape-font-specification:DejaVuSans;writing-mode:lr-tb;fill:#000000;fill-opacity:1;fill-rule:nonzero;stroke:none"
           id="text5985"
           x="149.72458"
           y="-284.29333"><tspan
             x="149.72458"
             sodipodi:role="line"
             id="tspan5983"
             y="-284.29333"
             style="font-size:18px">Mouse physiology</tspan><tspan
             x="149.72458"
             sodipodi:role="line"
             y="-261.79333"
             id="tspan8021"
             style="font-size:18px">NAR = 0.25</tspan></text></g><g
         id="g6027"><g
           id="g6029"
           clip-path="url(#clipPath6033)"><path
             d="m 192.27549,56.406952 5.08432,4.183836 5.06341,3.81429 5.04187,3.495207 5.01988,3.219009 4.99753,2.980242 4.97491,2.771183 4.9521,2.588073 4.92917,2.427052 4.90616,2.284887 4.88312,2.161911 4.86007,2.050144 4.83703,1.950213 4.81405,1.860548 4.79112,1.782201 4.76827,1.710611 4.74551,1.644502 4.72284,1.584272 4.70028,1.530857 4.67784,1.48268 4.65549,1.43629 4.63328,1.39345 4.61118,1.35402 4.58925,1.32085 4.5674,1.2866 4.54569,1.25459 4.52411,1.22465 4.50269,1.19825 4.48139,1.1739 4.46022,1.14903"
             style="fill:none;stroke:#67974c;stroke-width:4;stroke-linecap:round;stroke-linejoin:round;stroke-miterlimit:10;stroke-dasharray:none;stroke-opacity:1"
             id="path6035" /></g></g><g
         id="g6037"><g
           id="g6039"
           clip-path="url(#clipPath6043)"><path
             d="m 213.95298,53.663097 5.07743,3.72928 5.05482,3.429728 5.03188,3.168107 5.00869,2.93978 4.9853,2.739097 4.9618,2.562377 4.93822,2.406253 4.91462,2.267867 4.89102,2.14479 4.86744,2.036409 4.84393,1.939162 4.82048,1.85105 4.7971,1.771598 4.77382,1.69971 4.75067,1.636715 4.72762,1.578118 4.70468,1.523936 4.68186,1.474257 4.65919,1.428939 4.63666,1.389642 4.61424,1.350728 4.59196,1.31462 4.56981,1.28103 4.54782,1.25091 4.52599,1.22363 4.50426,1.19619 4.48268,1.17042 4.46124,1.14616 4.43995,1.12451"
             style="fill:none;stroke:#529d4d;stroke-width:4;stroke-linecap:round;stroke-linejoin:round;stroke-miterlimit:10;stroke-dasharray:none;stroke-opacity:1"
             id="path6045" /></g></g><g
         id="g6047"><g
           id="g6049"
           clip-path="url(#clipPath6053)"><path
             d="m 235.97323,50.895949 5.06719,3.361599 5.04336,3.116641 5.01934,2.900412 4.99522,2.709582 4.97104,2.540692 4.94685,2.390531 4.92267,2.256776 4.89852,2.137301 4.87444,2.030275 4.85044,1.934125 4.82653,1.848154 4.80273,1.771255 4.77904,1.700494 4.75548,1.636163 4.73204,1.577502 4.70873,1.523897 4.68559,1.477143 4.66257,1.432002 4.63968,1.390358 4.61695,1.351837 4.59435,1.31611 4.57195,1.285399 4.54965,1.254634 4.52751,1.225742 4.5055,1.198677 4.48366,1.173265 4.46198,1.151435 4.44044,1.12949 4.41903,1.10821"
             style="fill:#000000;fill-opacity:0;stroke:#3ea44e;stroke-width:4;stroke-linecap:round;stroke-linejoin:round;stroke-miterlimit:10;stroke-dasharray:none;stroke-opacity:1"
             id="path6055" /></g></g><g
         id="g8056"
         transform="matrix(0.85997333,0,0,0.79378021,-293.66818,-9.4116487)"><g
           id="g8039"><rect
             style="opacity:1;fill:#ffffff;fill-opacity:1;fill-rule:evenodd;stroke:#f2f2f2;stroke-width:0.529415;stroke-linejoin:bevel;stroke-opacity:1;paint-order:stroke fill markers"
             id="rect7715"
             width="149.02235"
             height="123.36958"
             x="275.06564"
             y="-288.86707"
             transform="scale(1,-1)" /><g
             id="g6067"
             transform="translate(-115.83088,-43.678666)"><path
               d="m 415.18435,242.32066 h 24"
               style="fill:none;stroke:#000000;stroke-width:4;stroke-linecap:round;stroke-linejoin:round;stroke-miterlimit:10;stroke-dasharray:none;stroke-opacity:1"
               id="path6069" /><text
               transform="scale(1,-1)"
               style="font-variant:normal;font-weight:normal;font-size:18.1551px;font-family:'DejaVu Sans';-inkscape-font-specification:DejaVuSans;writing-mode:lr-tb;fill:#000000;fill-opacity:1;fill-rule:nonzero;stroke:none"
               id="text6073"
               x="448.78436"
               y="-238.12065"><tspan
                 x="448.78436"
                 sodipodi:role="line"
                 id="tspan6071"
                 y="-238.12065"
                 style="font-size:18.1551px">spike</tspan><tspan
                 x="448.78436"
                 sodipodi:role="line"
                 y="-215.42677"
                 id="tspan7713"
                 style="font-size:18.1551px">threshold</tspan></text></g><g
             id="g6067-6"
             transform="translate(-129.35594,-4.0296826)"><path
               d="m 428.15322,251.15631 h 24"
               style="fill:#e36f47;fill-opacity:1;stroke:#e36f47;stroke-width:4;stroke-linecap:round;stroke-linejoin:round;stroke-miterlimit:10;stroke-dasharray:none;stroke-opacity:1"
               id="path6069-1" /><text
               transform="scale(1,-1)"
               style="font-variant:normal;font-weight:normal;font-size:18.1551px;font-family:'DejaVu Sans';-inkscape-font-specification:DejaVuSans;writing-mode:lr-tb;fill:#000000;fill-opacity:1;fill-rule:nonzero;stroke:none"
               id="text6073-8"
               x="461.75323"
               y="-246.9563"><tspan
                 sodipodi:role="line"
                 id="tspan6071-7"
                 x="461.75323"
                 y="-246.9563"
                 style="font-size:18.1551px">proximal</tspan></text></g><g
             id="g6067-6-9"
             transform="translate(-129.13513,-27.508541)"><path
               d="m 428.15051,249.8999 h 24"
               style="fill:#000000;fill-opacity:0;stroke:#3ea44e;stroke-width:4;stroke-linecap:round;stroke-linejoin:round;stroke-miterlimit:10;stroke-dasharray:none;stroke-opacity:1"
               id="path6069-1-2" /><text
               transform="scale(1,-1)"
               style="font-variant:normal;font-weight:normal;font-size:18.1551px;font-family:'DejaVu Sans';-inkscape-font-specification:DejaVuSans;writing-mode:lr-tb;fill:#000000;fill-opacity:1;fill-rule:nonzero;stroke:none"
               id="text6073-8-0"
               x="461.75052"
               y="-245.69989"><tspan
                 sodipodi:role="line"
                 id="tspan6071-7-2"
                 x="461.75052"
                 y="-245.69989"
                 style="font-size:18.1551px">distal</tspan></text></g></g></g><g
         id="g6047-2"
         transform="translate(-427.48057,2.7050473)"><g
           id="g6049-2"
           clip-path="url(#clipPath6053-5)"><path
             d="m 236.03634,49.45906 5.26799,3.440755 5.2432,3.190029 5.21824,2.968707 5.19316,2.773385 5.16802,2.600518 5.14288,2.446821 5.11772,2.309917 5.09263,2.187628 5.0676,2.078083 5.04265,1.979668 5.01778,1.891672 4.99304,1.812963 4.96841,1.740536 4.94393,1.674689 4.91955,1.614648 4.89532,1.55978 4.87125,1.511926 4.84734,1.465721 4.82352,1.423097 4.79991,1.383669 4.7764,1.347101 4.75312,1.315666 4.72993,1.284177 4.70692,1.254605 4.68403,1.226902 4.66133,1.200892 4.6388,1.178545 4.61639,1.15609 4.59414,1.13431"
             style="fill:#000000;fill-opacity:0;stroke:#3ea44e;stroke-width:3.6765;stroke-linecap:round;stroke-linejoin:round;stroke-miterlimit:10;stroke-dasharray:7.353, 7.353;stroke-dashoffset:0;stroke-opacity:1"
             id="path6055-8" /></g></g><g
         id="g8056-6"
         transform="matrix(1.0473715,0,0,0.9998989,-369.40966,-115.9572)"><g
           id="g8039-1"><rect
             style="opacity:0.57;fill:#ffffff;fill-opacity:1;fill-rule:evenodd;stroke:#f2f2f2;stroke-width:0.117562;stroke-linejoin:bevel;stroke-opacity:1;paint-order:stroke fill markers"
             id="rect7715-2"
             width="35.530567"
             height="25.514992"
             x="208.65163"
             y="-208.27974"
             transform="scale(1,-1)" /></g></g></g><g
       id="g9244"
       transform="translate(0,0.79514543)"><g
         id="g7391-7"
         transform="matrix(1.6295173,0.20574298,-0.20574298,1.6295173,347.75642,-66.784142)"><text
           transform="matrix(0.99225067,-0.12425223,-0.12425223,-0.99225067,93.810969,35.218816)"
           style="font-variant:normal;font-weight:normal;font-size:11px;font-family:'DejaVu Sans';-inkscape-font-specification:DejaVuSans;writing-mode:lr-tb;fill:#000000;fill-opacity:1;fill-rule:nonzero;stroke:none"
           id="text26-5"><tspan
             x="0 6.9850001 13.75 20.724001 27.709 32.23 35.287998 39.599998 42.658001 48.708"
             y="0"
             sodipodi:role="line"
             id="tspan24-3">dendritic</tspan></text><g
           id="g28-5"
           transform="rotate(-7.1375749,226.82681,-688.72094)"><text
             transform="matrix(1,0,0,-1,0,0.640625)"
             style="font-variant:normal;font-weight:normal;font-size:11px;font-family:'DejaVu Sans';-inkscape-font-specification:DejaVuSans;writing-mode:lr-tb;fill:#000000;fill-opacity:1;fill-rule:nonzero;stroke:none"
             id="text32-6"><tspan
               x="0 3.0561523 9.8237305 16.79541 23.777832 28.09082 35.0625"
               y="0"
               sodipodi:role="line"
               id="tspan30-2">length(</tspan></text><text
             transform="matrix(1,0,0,-1,46.352539,0.640625)"
             style="font-style:italic;font-variant:normal;font-size:11px;font-family:'DejaVu Sans';-inkscape-font-specification:DejaVuSans-Oblique;writing-mode:lr-tb;fill:#000000;fill-opacity:1;fill-rule:nonzero;stroke:none"
             id="text36-9"><tspan
               x="0"
               y="0"
               id="tspan34-1">m</tspan></text><text
             transform="matrix(1,0,0,-1,57.067871,0.640625)"
             style="font-variant:normal;font-weight:normal;font-size:11px;font-family:'DejaVu Sans';-inkscape-font-specification:DejaVuSans;writing-mode:lr-tb;fill:#000000;fill-opacity:1;fill-rule:nonzero;stroke:none"
             id="text40-2"><tspan
               x="0"
               y="0"
               id="tspan38-7">)</tspan></text><g
             id="g42-0"
             transform="matrix(0.011,0,0,0.011,39.354004,0.640625)"><g
               id="g44-9"><g
                 id="g46-3"
                 clip-path="url(#clipPath50-3)"><g
                   id="g52-6"><path
                     d="m -12,-207 146,754 h 90 L 158,207 c -2,-8 -3,-16 -4,-24 -1,-8 -1,-17 -1,-25 0,-30 9,-54 28,-70 19,-16 46,-24 82,-24 48,0 86,13 116,41 30,27 50,68 61,123 l 62,319 h 90 L 510,126 c -2,-6 -3,-12 -3,-16 0,-4 0,-8 0,-12 0,-10 2,-18 6,-22 4,-5 10,-7 19,-7 3,0 7,0 13,2 6,2 14,5 25,9 L 556,8 C 542,1 528,-3 515,-7 c -13,-4 -26,-6 -38,-6 -22,0 -39,7 -51,20 C 414,20 408,39 408,63 390,37 368,17 343,5 317,-7 288,-13 254,-13 223,-13 196,-6 174,7 152,21 137,39 130,62 L 77,-207 h -89"
                     style="fill:#000000;fill-opacity:1;fill-rule:nonzero;stroke:none"
                     id="path54-0" /></g></g></g></g></g></g><text
         transform="matrix(0.99999198,0.00400598,0.00400598,-0.99999198,0,0)"
         style="font-variant:normal;font-weight:normal;font-size:18.067px;font-family:'DejaVu Sans';-inkscape-font-specification:DejaVuSans;writing-mode:lr-tb;fill:#000000;fill-opacity:1;fill-rule:nonzero;stroke:none;stroke-width:1.64245"
         id="text100-6"
         x="745.07196"
         y="-7.9038272"><tspan
           x="745.07196"
           sodipodi:role="line"
           style="stroke-width:1.64245"
           id="tspan9120"
           y="-7.9038272">co-active</tspan><tspan
           x="745.07196"
           sodipodi:role="line"
           style="stroke-width:1.64245"
           y="14.679922"
           id="tspan9124">synapses</tspan></text></g><g
       id="g9244-1"
       transform="translate(-423.16147,0.79514543)"><g
         id="g7391-7-7"
         transform="matrix(1.6295173,0.20574298,-0.20574298,1.6295173,347.75642,-66.784142)"><text
           transform="matrix(0.99225067,-0.12425223,-0.12425223,-0.99225067,93.810969,35.218816)"
           style="font-variant:normal;font-weight:normal;font-size:11px;font-family:'DejaVu Sans';-inkscape-font-specification:DejaVuSans;writing-mode:lr-tb;fill:#000000;fill-opacity:1;fill-rule:nonzero;stroke:none"
           id="text26-5-7"><tspan
             x="0 6.9850001 13.75 20.724001 27.709 32.23 35.287998 39.599998 42.658001 48.708"
             y="0"
             sodipodi:role="line"
             id="tspan24-3-1">dendritic</tspan></text><g
           id="g28-5-1"
           transform="rotate(-7.1375749,226.82681,-688.72094)"><text
             transform="matrix(1,0,0,-1,0,0.640625)"
             style="font-variant:normal;font-weight:normal;font-size:11px;font-family:'DejaVu Sans';-inkscape-font-specification:DejaVuSans;writing-mode:lr-tb;fill:#000000;fill-opacity:1;fill-rule:nonzero;stroke:none"
             id="text32-6-5"><tspan
               x="0 3.0561523 9.8237305 16.79541 23.777832 28.09082 35.0625"
               y="0"
               sodipodi:role="line"
               id="tspan30-2-9">length(</tspan></text><text
             transform="matrix(1,0,0,-1,46.352539,0.640625)"
             style="font-style:italic;font-variant:normal;font-size:11px;font-family:'DejaVu Sans';-inkscape-font-specification:DejaVuSans-Oblique;writing-mode:lr-tb;fill:#000000;fill-opacity:1;fill-rule:nonzero;stroke:none"
             id="text36-9-7"><tspan
               x="0"
               y="0"
               id="tspan34-1-7">m</tspan></text><text
             transform="matrix(1,0,0,-1,57.067871,0.640625)"
             style="font-variant:normal;font-weight:normal;font-size:11px;font-family:'DejaVu Sans';-inkscape-font-specification:DejaVuSans;writing-mode:lr-tb;fill:#000000;fill-opacity:1;fill-rule:nonzero;stroke:none"
             id="text40-2-6"><tspan
               x="0"
               y="0"
               id="tspan38-7-7">)</tspan></text><g
             id="g42-0-3"
             transform="matrix(0.011,0,0,0.011,39.354004,0.640625)"><g
               id="g44-9-6"><g
                 id="g46-3-5"
                 clip-path="url(#clipPath50-3-0)"><g
                   id="g52-6-6"><path
                     d="m -12,-207 146,754 h 90 L 158,207 c -2,-8 -3,-16 -4,-24 -1,-8 -1,-17 -1,-25 0,-30 9,-54 28,-70 19,-16 46,-24 82,-24 48,0 86,13 116,41 30,27 50,68 61,123 l 62,319 h 90 L 510,126 c -2,-6 -3,-12 -3,-16 0,-4 0,-8 0,-12 0,-10 2,-18 6,-22 4,-5 10,-7 19,-7 3,0 7,0 13,2 6,2 14,5 25,9 L 556,8 C 542,1 528,-3 515,-7 c -13,-4 -26,-6 -38,-6 -22,0 -39,7 -51,20 C 414,20 408,39 408,63 390,37 368,17 343,5 317,-7 288,-13 254,-13 223,-13 196,-6 174,7 152,21 137,39 130,62 L 77,-207 h -89"
                     style="fill:#000000;fill-opacity:1;fill-rule:nonzero;stroke:none"
                     id="path54-0-3" /></g></g></g></g></g></g><text
         transform="matrix(0.99999198,0.00400598,0.00400598,-0.99999198,0,0)"
         style="font-variant:normal;font-weight:normal;font-size:18.067px;font-family:'DejaVu Sans';-inkscape-font-specification:DejaVuSans;writing-mode:lr-tb;fill:#000000;fill-opacity:1;fill-rule:nonzero;stroke:none;stroke-width:1.64245"
         id="text100-6-9"
         x="745.07196"
         y="-7.9038272"><tspan
           x="745.07196"
           sodipodi:role="line"
           style="stroke-width:1.64245"
           id="tspan9120-4"
           y="-7.9038272">co-active</tspan><tspan
           x="745.07196"
           sodipodi:role="line"
           style="stroke-width:1.64245"
           y="14.679922"
           id="tspan9124-8">synapses</tspan></text></g></g><g
     inkscape:groupmode="layer"
     id="layer1"
     inkscape:label="epsp_efficacy_h 1"
     transform="translate(1.2278694)"><text
       style="font-variant:normal;font-weight:normal;font-size:20px;line-height:0;font-family:'DejaVu Sans';-inkscape-font-specification:DejaVuSans;writing-mode:lr-tb;fill:#000000;fill-opacity:1;fill-rule:nonzero;stroke:none;stroke-width:1.01452"
       id="text2548-9"
       x="352.15231"
       y="277.45706"><tspan
         style="font-size:20px;line-height:1;stroke-width:1.01452"
         sodipodi:role="line"
         id="tspan9327"
         x="352.15231"
         y="277.45706">NMDA</tspan><tspan
         sodipodi:role="line"
         x="352.15231"
         y="295.45706"
         id="tspan8023-3"
         style="font-size:20px;line-height:0.8;stroke-width:1.01452">spike</tspan></text><path
       style="fill:none;stroke:#000000;stroke-width:1.906;stroke-linecap:butt;stroke-linejoin:miter;stroke-miterlimit:4;stroke-dasharray:none;stroke-opacity:1;marker-start:url(#Arrow1Sstart);marker-end:url(#Arrow1Send)"
       d="m 347.75622,268.68757 v 19.92678"
       id="path8224" /><text
       style="font-variant:normal;font-weight:normal;font-size:20px;line-height:0;font-family:'DejaVu Sans';-inkscape-font-specification:DejaVuSans;writing-mode:lr-tb;fill:#000000;fill-opacity:1;fill-rule:nonzero;stroke:none;stroke-width:1.01452"
       id="text2548-9-0"
       x="280.18533"
       y="121.1431"><tspan
         sodipodi:role="line"
         id="tspan2546-7-6"
         x="280.18533"
         y="121.1431"
         style="font-size:20px;line-height:1.25;stroke-width:1.01452">Soma</tspan><tspan
         sodipodi:role="line"
         x="280.18533"
         y="141.6431"
         id="tspan8023-3-3"
         style="font-size:20px;line-height:0.8;stroke-width:1.01452">spike</tspan></text><text
       transform="matrix(1.0009925,-0.02256413,0.02262049,0.99849857,0,0)"
       style="font-variant:normal;font-weight:normal;font-size:18.2991px;font-family:'DejaVu Sans';-inkscape-font-specification:DejaVuSans;writing-mode:lr-tb;fill:#000000;fill-opacity:1;fill-rule:nonzero;stroke:none;stroke-width:2.28732"
       id="text70-6-3"
       x="20.68685"
       y="241.0536"><tspan
         sodipodi:role="line"
         id="tspan68-8-1"
         style="stroke-width:2.28732"
         x="20.68685"
         y="241.0536">20</tspan></text><text
       transform="matrix(1.0009925,-0.02256413,0.02262049,0.99849857,0,0)"
       style="font-variant:normal;font-weight:normal;font-size:18.2991px;font-family:'DejaVu Sans';-inkscape-font-specification:DejaVuSans;writing-mode:lr-tb;fill:#000000;fill-opacity:1;fill-rule:nonzero;stroke:none;stroke-width:2.28732"
       id="text70-6-4"
       x="21.035456"
       y="182.26392"><tspan
         sodipodi:role="line"
         id="tspan68-8-9"
         style="stroke-width:2.28732"
         x="21.035456"
         y="182.26392">40</tspan></text><text
       transform="matrix(1.0009925,-0.02256413,0.02262049,0.99849857,0,0)"
       style="font-variant:normal;font-weight:normal;font-size:18.2991px;font-family:'DejaVu Sans';-inkscape-font-specification:DejaVuSans;writing-mode:lr-tb;fill:#000000;fill-opacity:1;fill-rule:nonzero;stroke:none;stroke-width:2.28732"
       id="text70-6-2"
       x="23.916193"
       y="127.90285"><tspan
         sodipodi:role="line"
         id="tspan68-8-0"
         style="stroke-width:2.28732"
         x="23.916193"
         y="127.90285">60</tspan></text><text
       transform="matrix(1.0009925,-0.02256413,0.02262049,0.99849857,0,0)"
       style="font-variant:normal;font-weight:normal;font-size:18.2991px;font-family:'DejaVu Sans';-inkscape-font-specification:DejaVuSans;writing-mode:lr-tb;fill:#000000;fill-opacity:1;fill-rule:nonzero;stroke:none;stroke-width:2.28732"
       id="text70-6-3-6"
       x="1070.6748"
       y="249.77612"><tspan
         sodipodi:role="line"
         id="tspan68-8-1-8"
         style="stroke-width:2.28732"
         x="1070.6748"
         y="249.77612">10</tspan></text><text
       transform="matrix(1.0009925,-0.02256413,0.02262049,0.99849857,0,0)"
       style="font-variant:normal;font-weight:normal;font-size:18.2991px;font-family:'DejaVu Sans';-inkscape-font-specification:DejaVuSans;writing-mode:lr-tb;fill:#000000;fill-opacity:1;fill-rule:nonzero;stroke:none;stroke-width:2.28732"
       id="text70-6-4-9"
       x="1070.9781"
       y="192.98843"><tspan
         sodipodi:role="line"
         id="tspan68-8-9-2"
         style="stroke-width:2.28732"
         x="1070.9781"
         y="192.98843">20</tspan></text><text
       transform="matrix(1.0009925,-0.02256413,0.02262049,0.99849857,0,0)"
       style="font-variant:normal;font-weight:normal;font-size:18.2991px;font-family:'DejaVu Sans';-inkscape-font-specification:DejaVuSans;writing-mode:lr-tb;fill:#000000;fill-opacity:1;fill-rule:nonzero;stroke:none;stroke-width:2.28732"
       id="text70-6-2-6"
       x="1073.9042"
       y="136.62538"><tspan
         sodipodi:role="line"
         id="tspan68-8-0-6"
         style="stroke-width:2.28732"
         x="1073.9042"
         y="136.62538">30</tspan></text><text
       transform="matrix(1.0009925,-0.02256413,0.02262049,0.99849857,0,0)"
       style="font-variant:normal;font-weight:normal;font-size:18.2991px;font-family:'DejaVu Sans';-inkscape-font-specification:DejaVuSans;writing-mode:lr-tb;fill:#000000;fill-opacity:1;fill-rule:nonzero;stroke:none;stroke-width:2.28732"
       id="text70-6-3-6-1"
       x="1071.7043"
       y="308.08572"><tspan
         sodipodi:role="line"
         id="tspan68-8-1-8-2"
         style="stroke-width:2.28732"
         x="1071.7043"
         y="308.08572">0</tspan></text><text
       transform="matrix(1.0009925,-0.02256413,0.02262049,0.99849857,0,0)"
       style="font-variant:normal;font-weight:normal;font-size:18.2991px;font-family:'DejaVu Sans';-inkscape-font-specification:DejaVuSans;writing-mode:lr-tb;fill:#000000;fill-opacity:1;fill-rule:nonzero;stroke:none;stroke-width:2.28732"
       id="text70-6-3-6-1-9"
       x="31.671286"
       y="299.6376"><tspan
         sodipodi:role="line"
         id="tspan68-8-1-8-2-3"
         style="stroke-width:2.28732"
         x="31.671286"
         y="299.6376">0</tspan></text><text
       style="font-variant:normal;font-weight:normal;font-size:20px;line-height:0;font-family:'DejaVu Sans';-inkscape-font-specification:DejaVuSans;writing-mode:lr-tb;fill:#000000;fill-opacity:1;fill-rule:nonzero;stroke:none;stroke-width:1.01452"
       id="text2548-9-0-8"
       x="841.92908"
       y="116.91602"><tspan
         sodipodi:role="line"
         id="tspan2546-7-6-5"
         x="841.92908"
         y="116.91602"
         style="font-size:20px;line-height:1.25;stroke-width:1.01452">Soma</tspan><tspan
         sodipodi:role="line"
         x="841.92908"
         y="137.41602"
         id="tspan8023-3-3-0"
         style="font-size:20px;line-height:0.8;stroke-width:1.01452">spike</tspan></text></g></svg>
