<?xml version="1.0" encoding="UTF-8" standalone="no"?>
<svg
   xmlns:dc="http://purl.org/dc/elements/1.1/"
   xmlns:cc="http://creativecommons.org/ns#"
   xmlns:rdf="http://www.w3.org/1999/02/22-rdf-syntax-ns#"
   xmlns:svg="http://www.w3.org/2000/svg"
   xmlns="http://www.w3.org/2000/svg"
   xmlns:xlink="http://www.w3.org/1999/xlink"
   xmlns:sodipodi="http://sodipodi.sourceforge.net/DTD/sodipodi-0.dtd"
   xmlns:inkscape="http://www.inkscape.org/namespaces/inkscape"
   width="432pt"
   height="288pt"
   viewBox="0 0 432 288"
   version="1.2"
   id="svg477"
   sodipodi:docname="epsp.svg"
   inkscape:version="1.0.1 (3bc2e813f5, 2020-09-07, custom)">
  <metadata
     id="metadata481">
    <rdf:RDF>
      <cc:Work
         rdf:about="">
        <dc:format>image/svg+xml</dc:format>
        <dc:type
           rdf:resource="http://purl.org/dc/dcmitype/StillImage" />
        <dc:title></dc:title>
      </cc:Work>
    </rdf:RDF>
  </metadata>
  <sodipodi:namedview
     pagecolor="#ffffff"
     bordercolor="#666666"
     borderopacity="1"
     objecttolerance="10"
     gridtolerance="10"
     guidetolerance="10"
     inkscape:pageopacity="0"
     inkscape:pageshadow="2"
     inkscape:window-width="1920"
     inkscape:window-height="1034"
     id="namedview479"
     showgrid="false"
     inkscape:snap-bbox="true"
     showguides="true"
     inkscape:guide-bbox="true"
     inkscape:zoom="1.444904"
     inkscape:cx="141.00241"
     inkscape:cy="246.8991"
     inkscape:window-x="1920"
     inkscape:window-y="22"
     inkscape:window-maximized="0"
     inkscape:current-layer="surface1810">
    <sodipodi:guide
       position="-49.945621,305.65827"
       orientation="1,0"
       id="guide1874" />
    <sodipodi:guide
       position="232.70009,257.53611"
       orientation="1,0"
       id="guide2656" />
    <sodipodi:guide
       position="-65.189246,303.20586"
       orientation="1,0"
       id="guide2720" />
  </sodipodi:namedview>
  <defs
     id="defs172">
    <marker
       style="overflow:visible;"
       id="marker2338"
       refX="0.0"
       refY="0.0"
       orient="auto"
       inkscape:stockid="Arrow2Mend"
       inkscape:isstock="true">
      <path
         transform="scale(0.6) rotate(180) translate(0,0)"
         d="M 8.7185878,4.0337352 L -2.2072895,0.016013256 L 8.7185884,-4.0017078 C 6.9730900,-1.6296469 6.9831476,1.6157441 8.7185878,4.0337352 z "
         style="fill-rule:evenodd;stroke-width:0.625;stroke-linejoin:round;stroke:#000000;stroke-opacity:1;fill:#000000;fill-opacity:1"
         id="path2336" />
    </marker>
    <marker
       style="overflow:visible;"
       id="marker2280"
       refX="0.0"
       refY="0.0"
       orient="auto"
       inkscape:stockid="Arrow1Mend"
       inkscape:isstock="true">
      <path
         transform="scale(0.4) rotate(180) translate(10,0)"
         style="fill-rule:evenodd;stroke:#000000;stroke-width:1pt;stroke-opacity:1;fill:#000000;fill-opacity:1"
         d="M 0.0,0.0 L 5.0,-5.0 L -12.5,0.0 L 5.0,5.0 L 0.0,0.0 z "
         id="path2278" />
    </marker>
    <marker
       style="overflow:visible"
       id="Arrow2Mstart"
       refX="0.0"
       refY="0.0"
       orient="auto"
       inkscape:stockid="Arrow2Mstart"
       inkscape:isstock="true">
      <path
         transform="scale(0.6) translate(0,0)"
         d="M 8.7185878,4.0337352 L -2.2072895,0.016013256 L 8.7185884,-4.0017078 C 6.9730900,-1.6296469 6.9831476,1.6157441 8.7185878,4.0337352 z "
         style="fill-rule:evenodd;stroke-width:0.625;stroke-linejoin:round;stroke:#000000;stroke-opacity:1;fill:#000000;fill-opacity:1"
         id="path1900" />
    </marker>
    <marker
       style="overflow:visible;"
       id="Arrow2Mend"
       refX="0.0"
       refY="0.0"
       orient="auto"
       inkscape:stockid="Arrow2Mend"
       inkscape:isstock="true">
      <path
         transform="scale(0.6) rotate(180) translate(0,0)"
         d="M 8.7185878,4.0337352 L -2.2072895,0.016013256 L 8.7185884,-4.0017078 C 6.9730900,-1.6296469 6.9831476,1.6157441 8.7185878,4.0337352 z "
         style="fill-rule:evenodd;stroke-width:0.625;stroke-linejoin:round;stroke:#000000;stroke-opacity:1;fill:#000000;fill-opacity:1"
         id="path1903" />
    </marker>
    <marker
       style="overflow:visible;"
       id="Arrow1Mend"
       refX="0.0"
       refY="0.0"
       orient="auto"
       inkscape:stockid="Arrow1Mend"
       inkscape:isstock="true">
      <path
         transform="scale(0.4) rotate(180) translate(10,0)"
         style="fill-rule:evenodd;stroke:#000000;stroke-width:1pt;stroke-opacity:1;fill:#000000;fill-opacity:1"
         d="M 0.0,0.0 L 5.0,-5.0 L -12.5,0.0 L 5.0,5.0 L 0.0,0.0 z "
         id="path1885" />
    </marker>
    <marker
       style="overflow:visible;"
       id="Arrow1Send"
       refX="0.0"
       refY="0.0"
       orient="auto"
       inkscape:stockid="Arrow1Send"
       inkscape:isstock="true">
      <path
         transform="scale(0.2) rotate(180) translate(6,0)"
         style="fill-rule:evenodd;stroke:#000000;stroke-width:1.0pt;"
         d="M 0.0,0.0 L 5.0,-5.0 L -12.5,0.0 L 5.0,5.0 L 0.0,0.0 z "
         id="path1891" />
    </marker>
    <g
       id="g170">
      <symbol
         overflow="visible"
         id="glyph0-0">
        <path
           style="stroke:none;"
           d="M 4.132812 -8.632812 C 3.472656 -8.632812 2.976562 -8.308594 2.640625 -7.65625 C 2.300781 -7.007812 2.144531 -6.03125 2.144531 -4.730469 C 2.144531 -3.433594 2.300781 -2.457031 2.640625 -1.808594 C 2.976562 -1.15625 3.472656 -0.832031 4.132812 -0.832031 C 4.796875 -0.832031 5.289062 -1.15625 5.628906 -1.808594 C 5.953125 -2.457031 6.121094 -3.433594 6.121094 -4.730469 C 6.121094 -6.03125 5.953125 -7.007812 5.628906 -7.65625 C 5.289062 -8.308594 4.796875 -8.632812 4.132812 -8.632812 M 4.132812 -9.644531 C 5.1875 -9.644531 5.992188 -9.21875 6.566406 -8.386719 C 7.125 -7.539062 7.410156 -6.316406 7.410156 -4.730469 C 7.410156 -3.132812 7.125 -1.910156 6.566406 -1.078125 C 5.992188 -0.246094 5.1875 0.167969 4.132812 0.167969 C 3.066406 0.167969 2.25 -0.246094 1.691406 -1.078125 C 1.132812 -1.910156 0.859375 -3.132812 0.859375 -4.730469 C 0.859375 -6.316406 1.132812 -7.539062 1.691406 -8.386719 C 2.25 -9.21875 3.066406 -9.644531 4.132812 -9.644531 "
           id="path2" />
      </symbol>
      <symbol
         overflow="visible"
         id="glyph0-1">
        <path
           style="stroke:none;"
           d="M 1.402344 -9.476562 L 6.433594 -9.476562 L 6.433594 -8.398438 L 2.574219 -8.398438 L 2.574219 -6.070312 C 2.757812 -6.136719 2.949219 -6.1875 3.132812 -6.214844 C 3.316406 -6.238281 3.511719 -6.265625 3.691406 -6.265625 C 4.746094 -6.265625 5.578125 -5.96875 6.199219 -5.394531 C 6.824219 -4.808594 7.136719 -4.03125 7.136719 -3.042969 C 7.136719 -2.015625 6.8125 -1.222656 6.175781 -0.664062 C 5.539062 -0.105469 4.640625 0.167969 3.496094 0.167969 C 3.09375 0.167969 2.691406 0.128906 2.273438 0.078125 C 1.859375 0.0117188 1.441406 -0.078125 1 -0.222656 L 1 -1.507812 C 1.378906 -1.300781 1.769531 -1.144531 2.183594 -1.039062 C 2.585938 -0.9375 3.015625 -0.898438 3.472656 -0.898438 C 4.199219 -0.898438 4.785156 -1.078125 5.214844 -1.46875 C 5.628906 -1.859375 5.851562 -2.378906 5.851562 -3.042969 C 5.851562 -3.691406 5.628906 -4.210938 5.214844 -4.601562 C 4.785156 -4.992188 4.199219 -5.1875 3.472656 -5.1875 C 3.132812 -5.1875 2.78125 -5.148438 2.445312 -5.070312 C 2.105469 -4.992188 1.753906 -4.875 1.402344 -4.71875 L 1.402344 -9.476562 "
           id="path5" />
      </symbol>
      <symbol
         overflow="visible"
         id="glyph0-2">
        <path
           style="stroke:none;"
           d="M 1.613281 -1.078125 L 3.703125 -1.078125 L 3.703125 -8.308594 L 1.429688 -7.851562 L 1.429688 -9.023438 L 3.691406 -9.476562 L 4.980469 -9.476562 L 4.980469 -1.078125 L 7.070312 -1.078125 L 7.070312 0 L 1.613281 0 L 1.613281 -1.078125 "
           id="path8" />
      </symbol>
      <symbol
         overflow="visible"
         id="glyph0-3">
        <path
           style="stroke:none;"
           d="M 2.496094 -1.078125 L 6.96875 -1.078125 L 6.96875 0 L 0.949219 0 L 0.949219 -1.078125 C 1.429688 -1.574219 2.09375 -2.25 2.9375 -3.105469 C 3.769531 -3.953125 4.304688 -4.496094 4.523438 -4.746094 C 4.941406 -5.199219 5.226562 -5.589844 5.382812 -5.914062 C 5.539062 -6.226562 5.628906 -6.550781 5.628906 -6.863281 C 5.628906 -7.359375 5.445312 -7.773438 5.097656 -8.085938 C 4.746094 -8.398438 4.289062 -8.566406 3.71875 -8.566406 C 3.316406 -8.566406 2.886719 -8.488281 2.445312 -8.359375 C 2.003906 -8.214844 1.519531 -8.007812 1.015625 -7.722656 L 1.015625 -9.023438 C 1.535156 -9.230469 2.015625 -9.386719 2.457031 -9.488281 C 2.898438 -9.59375 3.316406 -9.644531 3.691406 -9.644531 C 4.667969 -9.644531 5.445312 -9.398438 6.03125 -8.90625 C 6.617188 -8.410156 6.914062 -7.761719 6.914062 -6.941406 C 6.914062 -6.550781 6.839844 -6.175781 6.695312 -5.835938 C 6.550781 -5.484375 6.292969 -5.070312 5.902344 -4.601562 C 5.796875 -4.472656 5.460938 -4.121094 4.886719 -3.535156 C 4.316406 -2.949219 3.523438 -2.132812 2.496094 -1.078125 "
           id="path11" />
      </symbol>
      <symbol
         overflow="visible"
         id="glyph0-4">
        <path
           style="stroke:none;"
           d="M 5.277344 -5.109375 C 5.890625 -4.980469 6.371094 -4.707031 6.707031 -4.289062 C 7.046875 -3.875 7.226562 -3.355469 7.226562 -2.757812 C 7.226562 -1.820312 6.902344 -1.09375 6.265625 -0.585938 C 5.617188 -0.078125 4.707031 0.167969 3.523438 0.167969 C 3.121094 0.167969 2.703125 0.128906 2.289062 0.0507812 C 1.871094 -0.0117188 1.429688 -0.128906 0.988281 -0.285156 L 0.988281 -1.519531 C 1.339844 -1.3125 1.730469 -1.15625 2.15625 -1.054688 C 2.574219 -0.949219 3.015625 -0.898438 3.484375 -0.898438 C 4.289062 -0.898438 4.902344 -1.054688 5.316406 -1.363281 C 5.734375 -1.675781 5.953125 -2.144531 5.953125 -2.757812 C 5.953125 -3.300781 5.757812 -3.742188 5.367188 -4.054688 C 4.980469 -4.367188 4.433594 -4.535156 3.730469 -4.535156 L 2.625 -4.535156 L 2.625 -5.589844 L 3.78125 -5.589844 C 4.40625 -5.589844 4.886719 -5.707031 5.226562 -5.96875 C 5.5625 -6.214844 5.734375 -6.578125 5.734375 -7.058594 C 5.734375 -7.539062 5.550781 -7.917969 5.214844 -8.175781 C 4.863281 -8.4375 4.367188 -8.566406 3.730469 -8.566406 C 3.378906 -8.566406 3.003906 -8.527344 2.601562 -8.449219 C 2.195312 -8.371094 1.753906 -8.253906 1.273438 -8.097656 L 1.273438 -9.242188 C 1.753906 -9.371094 2.210938 -9.476562 2.640625 -9.542969 C 3.054688 -9.605469 3.457031 -9.644531 3.847656 -9.644531 C 4.808594 -9.644531 5.578125 -9.425781 6.148438 -8.984375 C 6.722656 -8.539062 7.007812 -7.941406 7.007812 -7.1875 C 7.007812 -6.667969 6.851562 -6.226562 6.550781 -5.863281 C 6.253906 -5.5 5.824219 -5.238281 5.277344 -5.109375 "
           id="path14" />
      </symbol>
      <symbol
         overflow="visible"
         id="glyph0-5">
        <path
           style="stroke:none;"
           d="M 4.914062 -8.359375 L 1.675781 -3.300781 L 4.914062 -3.300781 L 4.914062 -8.359375 M 4.574219 -9.476562 L 6.1875 -9.476562 L 6.1875 -3.300781 L 7.539062 -3.300781 L 7.539062 -2.234375 L 6.1875 -2.234375 L 6.1875 0 L 4.914062 0 L 4.914062 -2.234375 L 0.636719 -2.234375 L 0.636719 -3.472656 L 4.574219 -9.476562 "
           id="path17" />
      </symbol>
      <symbol
         overflow="visible"
         id="glyph0-6">
        <path
           style="stroke:none;"
           d="M 4.289062 -5.253906 C 3.71875 -5.253906 3.261719 -5.042969 2.925781 -4.652344 C 2.585938 -4.265625 2.417969 -3.71875 2.417969 -3.042969 C 2.417969 -2.351562 2.585938 -1.808594 2.925781 -1.417969 C 3.261719 -1.027344 3.71875 -0.832031 4.289062 -0.832031 C 4.863281 -0.832031 5.316406 -1.027344 5.65625 -1.417969 C 5.992188 -1.808594 6.160156 -2.351562 6.160156 -3.042969 C 6.160156 -3.71875 5.992188 -4.265625 5.65625 -4.652344 C 5.316406 -5.042969 4.863281 -5.253906 4.289062 -5.253906 M 6.839844 -9.269531 L 6.839844 -8.097656 C 6.511719 -8.253906 6.1875 -8.371094 5.863281 -8.449219 C 5.523438 -8.527344 5.199219 -8.566406 4.886719 -8.566406 C 4.03125 -8.566406 3.378906 -8.28125 2.9375 -7.710938 C 2.496094 -7.136719 2.234375 -6.265625 2.183594 -5.121094 C 2.429688 -5.484375 2.742188 -5.773438 3.121094 -5.96875 C 3.496094 -6.160156 3.914062 -6.265625 4.367188 -6.265625 C 5.316406 -6.265625 6.070312 -5.96875 6.617188 -5.394531 C 7.164062 -4.824219 7.449219 -4.03125 7.449219 -3.042969 C 7.449219 -2.066406 7.148438 -1.285156 6.578125 -0.703125 C 6.007812 -0.117188 5.238281 0.167969 4.289062 0.167969 C 3.199219 0.167969 2.351562 -0.246094 1.78125 -1.078125 C 1.195312 -1.910156 0.910156 -3.132812 0.910156 -4.730469 C 0.910156 -6.226562 1.261719 -7.421875 1.976562 -8.308594 C 2.679688 -9.191406 3.640625 -9.644531 4.835938 -9.644531 C 5.148438 -9.644531 5.472656 -9.605469 5.8125 -9.554688 C 6.136719 -9.488281 6.472656 -9.398438 6.839844 -9.269531 "
           id="path20" />
      </symbol>
      <symbol
         overflow="visible"
         id="glyph1-0">
        <path
           style="stroke:none;"
           d="M 11.59375 -12.113281 L 11.59375 -10.242188 C 10.980469 -10.78125 10.351562 -11.195312 9.664062 -11.484375 C 8.980469 -11.753906 8.28125 -11.898438 7.523438 -11.898438 C 6.011719 -11.898438 4.859375 -11.429688 4.066406 -10.511719 C 3.277344 -9.59375 2.878906 -8.28125 2.878906 -6.550781 C 2.878906 -4.824219 3.277344 -3.492188 4.066406 -2.574219 C 4.859375 -1.65625 6.011719 -1.207031 7.523438 -1.207031 C 8.28125 -1.207031 8.980469 -1.332031 9.664062 -1.621094 C 10.351562 -1.890625 10.980469 -2.304688 11.59375 -2.863281 L 11.59375 -1.007812 C 10.960938 -0.574219 10.296875 -0.269531 9.613281 -0.0703125 C 8.929688 0.125 8.191406 0.234375 7.414062 0.234375 C 5.4375 0.234375 3.871094 -0.359375 2.71875 -1.566406 C 1.566406 -2.773438 1.007812 -4.429688 1.007812 -6.550781 C 1.007812 -8.65625 1.566406 -10.3125 2.71875 -11.539062 C 3.871094 -12.742188 5.4375 -13.355469 7.414062 -13.355469 C 8.207031 -13.355469 8.945312 -13.246094 9.628906 -13.050781 C 10.3125 -12.835938 10.980469 -12.527344 11.59375 -12.113281 "
           id="path23" />
      </symbol>
      <symbol
         overflow="visible"
         id="glyph1-1">
        <path
           style="stroke:none;"
           d="M 5.507812 -8.710938 C 4.644531 -8.710938 3.960938 -8.371094 3.457031 -7.6875 C 2.953125 -7.003906 2.699219 -6.085938 2.699219 -4.914062 C 2.699219 -3.726562 2.933594 -2.808594 3.4375 -2.125 C 3.941406 -1.441406 4.625 -1.117188 5.507812 -1.117188 C 6.371094 -1.117188 7.054688 -1.441406 7.558594 -2.125 C 8.0625 -2.808594 8.316406 -3.726562 8.316406 -4.914062 C 8.316406 -6.066406 8.0625 -7.003906 7.558594 -7.6875 C 7.054688 -8.371094 6.371094 -8.710938 5.507812 -8.710938 M 5.507812 -10.078125 C 6.910156 -10.078125 8.011719 -9.613281 8.820312 -8.710938 C 9.613281 -7.792969 10.027344 -6.535156 10.027344 -4.914062 C 10.027344 -3.292969 9.613281 -2.035156 8.820312 -1.132812 C 8.011719 -0.214844 6.910156 0.234375 5.507812 0.234375 C 4.085938 0.234375 2.96875 -0.214844 2.179688 -1.132812 C 1.386719 -2.035156 0.988281 -3.292969 0.988281 -4.914062 C 0.988281 -6.535156 1.386719 -7.792969 2.179688 -8.710938 C 2.96875 -9.613281 4.085938 -10.078125 5.507812 -10.078125 "
           id="path26" />
      </symbol>
      <symbol
         overflow="visible"
         id="glyph1-2">
        <path
           style="stroke:none;"
           d="M 0.882812 -5.652344 L 5.617188 -5.652344 L 5.617188 -4.210938 L 0.882812 -4.210938 L 0.882812 -5.652344 "
           id="path29" />
      </symbol>
      <symbol
         overflow="visible"
         id="glyph1-3">
        <path
           style="stroke:none;"
           d="M 6.175781 -4.949219 C 4.859375 -4.949219 3.960938 -4.789062 3.457031 -4.5 C 2.953125 -4.195312 2.699219 -3.691406 2.699219 -2.96875 C 2.699219 -2.394531 2.878906 -1.925781 3.257812 -1.601562 C 3.636719 -1.261719 4.15625 -1.097656 4.804688 -1.097656 C 5.707031 -1.097656 6.425781 -1.402344 6.964844 -2.050781 C 7.507812 -2.683594 7.777344 -3.527344 7.777344 -4.589844 L 7.777344 -4.949219 L 6.175781 -4.949219 M 9.394531 -5.617188 L 9.394531 0 L 7.777344 0 L 7.777344 -1.492188 C 7.398438 -0.882812 6.929688 -0.449219 6.390625 -0.179688 C 5.851562 0.0898438 5.164062 0.234375 4.375 0.234375 C 3.367188 0.234375 2.554688 -0.0351562 1.960938 -0.59375 C 1.367188 -1.152344 1.078125 -1.90625 1.078125 -2.863281 C 1.078125 -3.960938 1.441406 -4.789062 2.195312 -5.363281 C 2.933594 -5.921875 4.03125 -6.210938 5.507812 -6.210938 L 7.777344 -6.210938 L 7.777344 -6.371094 C 7.777344 -7.109375 7.523438 -7.6875 7.039062 -8.101562 C 6.550781 -8.496094 5.867188 -8.710938 4.984375 -8.710938 C 4.410156 -8.710938 3.871094 -8.640625 3.328125 -8.496094 C 2.789062 -8.351562 2.285156 -8.152344 1.800781 -7.902344 L 1.800781 -9.394531 C 2.375 -9.613281 2.953125 -9.792969 3.511719 -9.898438 C 4.066406 -10.007812 4.609375 -10.078125 5.148438 -10.078125 C 6.570312 -10.078125 7.632812 -9.703125 8.335938 -8.964844 C 9.035156 -8.226562 9.394531 -7.109375 9.394531 -5.617188 "
           id="path32" />
      </symbol>
      <symbol
         overflow="visible"
         id="glyph1-4">
        <path
           style="stroke:none;"
           d="M 8.785156 -9.46875 L 8.785156 -7.957031 C 8.316406 -8.207031 7.867188 -8.386719 7.398438 -8.515625 C 6.929688 -8.640625 6.480469 -8.710938 6.011719 -8.710938 C 4.96875 -8.710938 4.140625 -8.371094 3.5625 -7.703125 C 2.988281 -7.039062 2.699219 -6.101562 2.699219 -4.914062 C 2.699219 -3.707031 2.988281 -2.773438 3.5625 -2.105469 C 4.140625 -1.441406 4.96875 -1.117188 6.011719 -1.117188 C 6.480469 -1.117188 6.929688 -1.171875 7.398438 -1.296875 C 7.867188 -1.421875 8.316406 -1.621094 8.785156 -1.871094 L 8.785156 -0.378906 C 8.316406 -0.160156 7.847656 0 7.378906 0.0898438 C 6.894531 0.179688 6.371094 0.234375 5.832031 0.234375 C 4.355469 0.234375 3.167969 -0.214844 2.304688 -1.152344 C 1.421875 -2.070312 0.988281 -3.328125 0.988281 -4.914062 C 0.988281 -6.515625 1.421875 -7.777344 2.304688 -8.695312 C 3.1875 -9.613281 4.390625 -10.078125 5.941406 -10.078125 C 6.445312 -10.078125 6.929688 -10.027344 7.398438 -9.917969 C 7.867188 -9.808594 8.335938 -9.664062 8.785156 -9.46875 "
           id="path35" />
      </symbol>
      <symbol
         overflow="visible"
         id="glyph1-5">
        <path
           style="stroke:none;"
           d="M 3.292969 -12.636719 L 3.292969 -9.847656 L 6.625 -9.847656 L 6.625 -8.585938 L 3.292969 -8.585938 L 3.292969 -3.238281 C 3.292969 -2.429688 3.402344 -1.90625 3.617188 -1.691406 C 3.835938 -1.457031 4.285156 -1.351562 4.96875 -1.351562 L 6.625 -1.351562 L 6.625 0 L 4.96875 0 C 3.707031 0 2.84375 -0.234375 2.375 -0.703125 C 1.90625 -1.171875 1.675781 -2.015625 1.675781 -3.238281 L 1.675781 -8.585938 L 0.484375 -8.585938 L 0.484375 -9.847656 L 1.675781 -9.847656 L 1.675781 -12.636719 L 3.292969 -12.636719 "
           id="path38" />
      </symbol>
      <symbol
         overflow="visible"
         id="glyph1-6">
        <path
           style="stroke:none;"
           d="M 1.691406 -9.847656 L 3.3125 -9.847656 L 3.3125 0 L 1.691406 0 L 1.691406 -9.847656 M 1.691406 -13.679688 L 3.3125 -13.679688 L 3.3125 -11.628906 L 1.691406 -11.628906 L 1.691406 -13.679688 "
           id="path41" />
      </symbol>
      <symbol
         overflow="visible"
         id="glyph1-7">
        <path
           style="stroke:none;"
           d="M 0.539062 -9.847656 L 2.25 -9.847656 L 5.328125 -1.585938 L 8.40625 -9.847656 L 10.117188 -9.847656 L 6.425781 0 L 4.230469 0 L 0.539062 -9.847656 "
           id="path44" />
      </symbol>
      <symbol
         overflow="visible"
         id="glyph1-8">
        <path
           style="stroke:none;"
           d="M 10.117188 -5.328125 L 10.117188 -4.535156 L 2.683594 -4.535156 C 2.753906 -3.421875 3.078125 -2.554688 3.691406 -1.980469 C 4.285156 -1.402344 5.113281 -1.117188 6.191406 -1.117188 C 6.804688 -1.117188 7.414062 -1.1875 7.992188 -1.332031 C 8.566406 -1.476562 9.160156 -1.710938 9.738281 -2.035156 L 9.738281 -0.503906 C 9.160156 -0.253906 8.566406 -0.0546875 7.957031 0.0546875 C 7.34375 0.160156 6.714844 0.234375 6.101562 0.234375 C 4.519531 0.234375 3.277344 -0.214844 2.359375 -1.117188 C 1.441406 -2.015625 0.988281 -3.257812 0.988281 -4.824219 C 0.988281 -6.425781 1.421875 -7.703125 2.285156 -8.65625 C 3.148438 -9.59375 4.339844 -10.078125 5.8125 -10.078125 C 7.144531 -10.078125 8.191406 -9.648438 8.964844 -8.800781 C 9.71875 -7.9375 10.117188 -6.785156 10.117188 -5.328125 M 8.496094 -5.796875 C 8.476562 -6.679688 8.226562 -7.378906 7.757812 -7.921875 C 7.273438 -8.441406 6.625 -8.710938 5.832031 -8.710938 C 4.933594 -8.710938 4.210938 -8.441406 3.671875 -7.9375 C 3.132812 -7.433594 2.808594 -6.714844 2.734375 -5.796875 L 8.496094 -5.796875 "
           id="path47" />
      </symbol>
      <symbol
         overflow="visible"
         id="glyph1-9">
        <path
           style="stroke:none;"
           d=""
           id="path50" />
      </symbol>
      <symbol
         overflow="visible"
         id="glyph1-10">
        <path
           style="stroke:none;"
           d="M 7.972656 -9.558594 L 7.972656 -8.027344 C 7.507812 -8.242188 7.039062 -8.425781 6.550781 -8.550781 C 6.046875 -8.65625 5.542969 -8.730469 5.023438 -8.730469 C 4.210938 -8.730469 3.601562 -8.605469 3.203125 -8.351562 C 2.808594 -8.101562 2.609375 -7.738281 2.609375 -7.253906 C 2.609375 -6.875 2.753906 -6.589844 3.042969 -6.371094 C 3.328125 -6.15625 3.90625 -5.941406 4.769531 -5.761719 L 5.328125 -5.632812 C 6.480469 -5.382812 7.289062 -5.023438 7.777344 -4.589844 C 8.242188 -4.140625 8.496094 -3.511719 8.496094 -2.71875 C 8.496094 -1.800781 8.136719 -1.078125 7.414062 -0.558594 C 6.695312 -0.0195312 5.6875 0.234375 4.429688 0.234375 C 3.886719 0.234375 3.347656 0.179688 2.773438 0.0898438 C 2.195312 0 1.601562 -0.144531 0.972656 -0.359375 L 0.972656 -2.035156 C 1.566406 -1.710938 2.160156 -1.476562 2.734375 -1.332031 C 3.3125 -1.171875 3.886719 -1.097656 4.464844 -1.097656 C 5.21875 -1.097656 5.8125 -1.222656 6.226562 -1.476562 C 6.625 -1.726562 6.839844 -2.105469 6.839844 -2.59375 C 6.839844 -3.023438 6.679688 -3.367188 6.390625 -3.601562 C 6.101562 -3.835938 5.453125 -4.066406 4.445312 -4.285156 L 3.886719 -4.410156 C 2.878906 -4.625 2.140625 -4.949219 1.710938 -5.382812 C 1.261719 -5.8125 1.042969 -6.40625 1.042969 -7.183594 C 1.042969 -8.101562 1.367188 -8.820312 2.015625 -9.324219 C 2.664062 -9.828125 3.601562 -10.078125 4.824219 -10.078125 C 5.417969 -10.078125 5.976562 -10.027344 6.515625 -9.9375 C 7.039062 -9.847656 7.523438 -9.71875 7.972656 -9.558594 "
           id="path53" />
      </symbol>
      <symbol
         overflow="visible"
         id="glyph1-11">
        <path
           style="stroke:none;"
           d="M 5.796875 0.898438 C 5.328125 2.050781 4.878906 2.824219 4.445312 3.1875 C 4.015625 3.546875 3.4375 3.726562 2.71875 3.726562 L 1.421875 3.726562 L 1.421875 2.375 L 2.375 2.375 C 2.808594 2.375 3.148438 2.269531 3.402344 2.050781 C 3.652344 1.835938 3.925781 1.351562 4.230469 0.558594 L 4.519531 -0.160156 L 0.539062 -9.847656 L 2.25 -9.847656 L 5.328125 -2.140625 L 8.40625 -9.847656 L 10.117188 -9.847656 L 5.796875 0.898438 "
           id="path56" />
      </symbol>
      <symbol
         overflow="visible"
         id="glyph1-12">
        <path
           style="stroke:none;"
           d="M 9.882812 -5.941406 L 9.882812 0 L 8.261719 0 L 8.261719 -5.886719 C 8.261719 -6.820312 8.0625 -7.507812 7.703125 -7.972656 C 7.34375 -8.441406 6.804688 -8.675781 6.085938 -8.675781 C 5.203125 -8.675781 4.519531 -8.386719 4.015625 -7.828125 C 3.511719 -7.273438 3.257812 -6.515625 3.257812 -5.5625 L 3.257812 0 L 1.636719 0 L 1.636719 -9.847656 L 3.257812 -9.847656 L 3.257812 -8.316406 C 3.636719 -8.890625 4.085938 -9.34375 4.625 -9.628906 C 5.148438 -9.917969 5.761719 -10.078125 6.445312 -10.078125 C 7.558594 -10.078125 8.425781 -9.71875 9 -9.019531 C 9.574219 -8.316406 9.882812 -7.289062 9.882812 -5.941406 "
           id="path59" />
      </symbol>
      <symbol
         overflow="visible"
         id="glyph1-13">
        <path
           style="stroke:none;"
           d="M 3.257812 -1.476562 L 3.257812 3.726562 L 1.636719 3.726562 L 1.636719 -9.847656 L 3.257812 -9.847656 L 3.257812 -8.351562 C 3.582031 -8.929688 4.015625 -9.359375 4.535156 -9.648438 C 5.058594 -9.9375 5.6875 -10.078125 6.40625 -10.078125 C 7.597656 -10.078125 8.566406 -9.59375 9.324219 -8.65625 C 10.0625 -7.703125 10.441406 -6.460938 10.441406 -4.914062 C 10.441406 -3.367188 10.0625 -2.105469 9.324219 -1.171875 C 8.566406 -0.234375 7.597656 0.234375 6.40625 0.234375 C 5.6875 0.234375 5.058594 0.0898438 4.535156 -0.179688 C 4.015625 -0.449219 3.582031 -0.882812 3.257812 -1.476562 M 8.765625 -4.914062 C 8.765625 -6.101562 8.515625 -7.019531 8.027344 -7.703125 C 7.523438 -8.386719 6.859375 -8.730469 6.011719 -8.730469 C 5.148438 -8.730469 4.480469 -8.386719 3.996094 -7.703125 C 3.492188 -7.019531 3.257812 -6.101562 3.257812 -4.914062 C 3.257812 -3.726562 3.492188 -2.789062 3.996094 -2.105469 C 4.480469 -1.421875 5.148438 -1.097656 6.011719 -1.097656 C 6.859375 -1.097656 7.523438 -1.421875 8.027344 -2.105469 C 8.515625 -2.789062 8.765625 -3.726562 8.765625 -4.914062 "
           id="path62" />
      </symbol>
      <symbol
         overflow="visible"
         id="glyph2-0">
        <path
           style="stroke:none;"
           d="M -13.121094 -1.765625 L -13.121094 -10.0625 L -11.628906 -10.0625 L -11.628906 -3.546875 L -7.738281 -3.546875 L -7.738281 -9.792969 L -6.246094 -9.792969 L -6.246094 -3.546875 L -1.492188 -3.546875 L -1.492188 -10.222656 L 0 -10.222656 L 0 -1.765625 L -13.121094 -1.765625 "
           id="path65" />
      </symbol>
      <symbol
         overflow="visible"
         id="glyph2-1">
        <path
           style="stroke:none;"
           d="M -11.664062 -3.546875 L -6.730469 -3.546875 L -6.730469 -5.777344 C -6.730469 -6.605469 -6.929688 -7.234375 -7.363281 -7.6875 C -7.792969 -8.136719 -8.40625 -8.371094 -9.199219 -8.371094 C -9.988281 -8.371094 -10.585938 -8.136719 -11.015625 -7.6875 C -11.449219 -7.234375 -11.664062 -6.605469 -11.664062 -5.777344 L -11.664062 -3.546875 M -13.121094 -1.765625 L -13.121094 -5.777344 C -13.121094 -7.234375 -12.78125 -8.351562 -12.113281 -9.109375 C -11.449219 -9.863281 -10.476562 -10.242188 -9.199219 -10.242188 C -7.902344 -10.242188 -6.910156 -9.863281 -6.265625 -9.109375 C -5.597656 -8.351562 -5.273438 -7.234375 -5.273438 -5.777344 L -5.273438 -3.546875 L 0 -3.546875 L 0 -1.765625 L -13.121094 -1.765625 "
           id="path68" />
      </symbol>
      <symbol
         overflow="visible"
         id="glyph2-2">
        <path
           style="stroke:none;"
           d="M -12.691406 -9.628906 L -10.960938 -9.628906 C -11.285156 -8.945312 -11.519531 -8.316406 -11.683594 -7.722656 C -11.824219 -7.109375 -11.914062 -6.535156 -11.914062 -5.992188 C -11.914062 -5.023438 -11.71875 -4.265625 -11.359375 -3.742188 C -10.980469 -3.222656 -10.441406 -2.96875 -9.757812 -2.96875 C -9.179688 -2.96875 -8.730469 -3.132812 -8.441406 -3.492188 C -8.136719 -3.835938 -7.902344 -4.5 -7.722656 -5.472656 L -7.507812 -6.550781 C -7.253906 -7.867188 -6.804688 -8.839844 -6.175781 -9.46875 C -5.527344 -10.097656 -4.679688 -10.421875 -3.617188 -10.421875 C -2.339844 -10.421875 -1.386719 -9.988281 -0.738281 -9.144531 C -0.0898438 -8.28125 0.234375 -7.039062 0.234375 -5.398438 C 0.234375 -4.769531 0.160156 -4.105469 0.0351562 -3.402344 C -0.0898438 -2.699219 -0.289062 -1.980469 -0.574219 -1.242188 L -2.410156 -1.242188 C -1.996094 -1.960938 -1.691406 -2.664062 -1.492188 -3.347656 C -1.277344 -4.03125 -1.1875 -4.714844 -1.1875 -5.398438 C -1.1875 -6.40625 -1.386719 -7.183594 -1.78125 -7.738281 C -2.179688 -8.28125 -2.734375 -8.566406 -3.492188 -8.566406 C -4.140625 -8.566406 -4.644531 -8.371094 -5.003906 -7.972656 C -5.363281 -7.578125 -5.632812 -6.929688 -5.8125 -6.03125 L -6.03125 -4.949219 C -6.28125 -3.617188 -6.695312 -2.664062 -7.273438 -2.070312 C -7.828125 -1.476562 -8.605469 -1.1875 -9.613281 -1.1875 C -10.765625 -1.1875 -11.683594 -1.585938 -12.347656 -2.410156 C -13.015625 -3.222656 -13.355469 -4.355469 -13.355469 -5.796875 C -13.355469 -6.40625 -13.300781 -7.019531 -13.195312 -7.667969 C -13.085938 -8.296875 -12.90625 -8.945312 -12.691406 -9.628906 "
           id="path71" />
      </symbol>
      <symbol
         overflow="visible"
         id="glyph2-3">
        <path
           style="stroke:none;"
           d=""
           id="path74" />
      </symbol>
      <symbol
         overflow="visible"
         id="glyph2-4">
        <path
           style="stroke:none;"
           d="M -13.660156 -5.578125 C -12.292969 -4.789062 -10.960938 -4.210938 -9.648438 -3.835938 C -8.335938 -3.4375 -7.003906 -3.257812 -5.652344 -3.257812 C -4.285156 -3.257812 -2.953125 -3.4375 -1.636719 -3.835938 C -0.304688 -4.210938 1.007812 -4.789062 2.359375 -5.578125 L 2.359375 -4.175781 C 0.972656 -3.292969 -0.359375 -2.628906 -1.691406 -2.195312 C -3.023438 -1.765625 -4.339844 -1.546875 -5.652344 -1.546875 C -6.949219 -1.546875 -8.261719 -1.765625 -9.59375 -2.195312 C -10.925781 -2.628906 -12.277344 -3.277344 -13.660156 -4.175781 L -13.660156 -5.578125 "
           id="path77" />
      </symbol>
      <symbol
         overflow="visible"
         id="glyph2-5">
        <path
           style="stroke:none;"
           d="M -7.957031 -9.359375 C -8.675781 -9.757812 -9.199219 -10.242188 -9.558594 -10.800781 C -9.898438 -11.359375 -10.078125 -12.023438 -10.078125 -12.796875 C -10.078125 -13.804688 -9.71875 -14.597656 -9 -15.15625 C -8.28125 -15.714844 -7.253906 -16.003906 -5.941406 -16.003906 L 0 -16.003906 L 0 -14.382812 L -5.886719 -14.382812 C -6.820312 -14.382812 -7.523438 -14.203125 -7.992188 -13.878906 C -8.441406 -13.535156 -8.675781 -13.03125 -8.675781 -12.347656 C -8.675781 -11.503906 -8.386719 -10.835938 -7.828125 -10.351562 C -7.273438 -9.863281 -6.515625 -9.628906 -5.5625 -9.628906 L 0 -9.628906 L 0 -8.011719 L -5.886719 -8.011719 C -6.820312 -8.011719 -7.523438 -7.828125 -7.992188 -7.507812 C -8.441406 -7.164062 -8.675781 -6.640625 -8.675781 -5.957031 C -8.675781 -5.128906 -8.386719 -4.464844 -7.828125 -3.976562 C -7.273438 -3.492188 -6.515625 -3.257812 -5.5625 -3.257812 L 0 -3.257812 L 0 -1.636719 L -9.847656 -1.636719 L -9.847656 -3.257812 L -8.316406 -3.257812 C -8.910156 -3.617188 -9.359375 -4.066406 -9.648438 -4.589844 C -9.9375 -5.09375 -10.078125 -5.707031 -10.078125 -6.425781 C -10.078125 -7.144531 -9.898438 -7.738281 -9.539062 -8.242188 C -9.179688 -8.746094 -8.640625 -9.109375 -7.957031 -9.359375 "
           id="path80" />
      </symbol>
      <symbol
         overflow="visible"
         id="glyph2-6">
        <path
           style="stroke:none;"
           d="M 0 -5.148438 L -13.121094 -0.144531 L -13.121094 -1.996094 L -2.070312 -6.15625 L -13.121094 -10.3125 L -13.121094 -12.167969 L 0 -7.164062 L 0 -5.148438 "
           id="path83" />
      </symbol>
      <symbol
         overflow="visible"
         id="glyph2-7">
        <path
           style="stroke:none;"
           d="M -13.660156 -1.441406 L -13.660156 -2.84375 C -12.277344 -3.707031 -10.925781 -4.375 -9.59375 -4.804688 C -8.261719 -5.238281 -6.949219 -5.472656 -5.652344 -5.472656 C -4.339844 -5.472656 -3.023438 -5.238281 -1.691406 -4.804688 C -0.359375 -4.375 0.972656 -3.707031 2.359375 -2.84375 L 2.359375 -1.441406 C 1.007812 -2.214844 -0.304688 -2.789062 -1.636719 -3.1875 C -2.953125 -3.5625 -4.285156 -3.761719 -5.652344 -3.761719 C -7.003906 -3.761719 -8.335938 -3.5625 -9.648438 -3.1875 C -10.960938 -2.789062 -12.292969 -2.214844 -13.660156 -1.441406 "
           id="path86" />
      </symbol>
      <symbol
         overflow="visible"
         id="glyph3-0">
        <path
           style="stroke:none;"
           d="M 7.140625 -1.246094 L 7.140625 -3.601562 L 5.207031 -3.601562 L 5.207031 -4.570312 L 8.316406 -4.570312 L 8.316406 -0.816406 C 7.859375 -0.480469 7.355469 -0.238281 6.804688 -0.0859375 C 6.253906 0.0703125 5.664062 0.15625 5.039062 0.15625 C 3.671875 0.15625 2.59375 -0.238281 1.824219 -1.03125 C 1.054688 -1.824219 0.671875 -2.941406 0.671875 -4.367188 C 0.671875 -5.785156 1.054688 -6.898438 1.824219 -7.703125 C 2.59375 -8.496094 3.671875 -8.902344 5.039062 -8.902344 C 5.605469 -8.902344 6.144531 -8.832031 6.660156 -8.6875 C 7.175781 -8.542969 7.65625 -8.339844 8.089844 -8.074219 L 8.089844 -6.816406 C 7.644531 -7.175781 7.175781 -7.453125 6.683594 -7.644531 C 6.191406 -7.835938 5.675781 -7.933594 5.136719 -7.933594 C 4.054688 -7.933594 3.253906 -7.632812 2.722656 -7.03125 C 2.183594 -6.433594 1.921875 -5.542969 1.921875 -4.367188 C 1.921875 -3.179688 2.183594 -2.292969 2.722656 -1.691406 C 3.253906 -1.09375 4.054688 -0.804688 5.136719 -0.804688 C 5.542969 -0.804688 5.914062 -0.839844 6.253906 -0.910156 C 6.589844 -0.984375 6.875 -1.09375 7.140625 -1.246094 "
           id="path89" />
      </symbol>
      <symbol
         overflow="visible"
         id="glyph3-1">
        <path
           style="stroke:none;"
           d="M 1.128906 -9.121094 L 2.207031 -9.121094 L 2.207031 0 L 1.128906 0 L 1.128906 -9.121094 "
           id="path92" />
      </symbol>
      <symbol
         overflow="visible"
         id="glyph3-2">
        <path
           style="stroke:none;"
           d="M 1.019531 -2.59375 L 1.019531 -6.5625 L 2.101562 -6.5625 L 2.101562 -2.628906 C 2.101562 -2.003906 2.21875 -1.546875 2.460938 -1.234375 C 2.699219 -0.925781 3.058594 -0.769531 3.550781 -0.769531 C 4.128906 -0.769531 4.597656 -0.949219 4.933594 -1.320312 C 5.269531 -1.691406 5.4375 -2.195312 5.4375 -2.84375 L 5.4375 -6.5625 L 6.515625 -6.5625 L 6.515625 0 L 5.4375 0 L 5.4375 -1.007812 C 5.171875 -0.601562 4.859375 -0.3125 4.523438 -0.121094 C 4.175781 0.0585938 3.78125 0.15625 3.324219 0.15625 C 2.566406 0.15625 1.992188 -0.0703125 1.609375 -0.539062 C 1.210938 -0.996094 1.019531 -1.679688 1.019531 -2.59375 M 3.730469 -6.71875 L 3.730469 -6.71875 "
           id="path95" />
      </symbol>
      <symbol
         overflow="visible"
         id="glyph3-3">
        <path
           style="stroke:none;"
           d="M 5.328125 -4.105469 C 5.578125 -4.007812 5.832031 -3.828125 6.070312 -3.550781 C 6.3125 -3.265625 6.550781 -2.878906 6.792969 -2.386719 L 7.992188 0 L 6.71875 0 L 5.605469 -2.242188 C 5.316406 -2.820312 5.027344 -3.214844 4.765625 -3.40625 C 4.488281 -3.601562 4.117188 -3.695312 3.648438 -3.695312 L 2.363281 -3.695312 L 2.363281 0 L 1.175781 0 L 1.175781 -8.746094 L 3.851562 -8.746094 C 4.847656 -8.746094 5.59375 -8.53125 6.085938 -8.125 C 6.574219 -7.703125 6.828125 -7.066406 6.828125 -6.226562 C 6.828125 -5.675781 6.695312 -5.207031 6.445312 -4.847656 C 6.179688 -4.488281 5.808594 -4.234375 5.328125 -4.105469 M 2.363281 -7.777344 L 2.363281 -4.667969 L 3.851562 -4.667969 C 4.414062 -4.667969 4.847656 -4.800781 5.136719 -5.0625 C 5.425781 -5.328125 5.578125 -5.710938 5.578125 -6.226562 C 5.578125 -6.730469 5.425781 -7.117188 5.136719 -7.378906 C 4.847656 -7.644531 4.414062 -7.777344 3.851562 -7.777344 L 2.363281 -7.777344 "
           id="path98" />
      </symbol>
      <symbol
         overflow="visible"
         id="glyph3-4">
        <path
           style="stroke:none;"
           d="M 5.316406 -6.371094 L 5.316406 -5.351562 C 5.003906 -5.496094 4.691406 -5.617188 4.367188 -5.699219 C 4.03125 -5.773438 3.695312 -5.820312 3.347656 -5.820312 C 2.808594 -5.820312 2.398438 -5.734375 2.136719 -5.566406 C 1.871094 -5.398438 1.738281 -5.160156 1.738281 -4.835938 C 1.738281 -4.585938 1.835938 -4.390625 2.027344 -4.246094 C 2.21875 -4.105469 2.605469 -3.960938 3.179688 -3.839844 L 3.550781 -3.757812 C 4.320312 -3.589844 4.859375 -3.347656 5.183594 -3.058594 C 5.496094 -2.761719 5.664062 -2.339844 5.664062 -1.8125 C 5.664062 -1.199219 5.425781 -0.71875 4.945312 -0.371094 C 4.464844 -0.0117188 3.792969 0.15625 2.953125 0.15625 C 2.59375 0.15625 2.230469 0.121094 1.847656 0.0585938 C 1.464844 0 1.066406 -0.0976562 0.648438 -0.238281 L 0.648438 -1.355469 C 1.042969 -1.140625 1.441406 -0.984375 1.824219 -0.886719 C 2.207031 -0.78125 2.59375 -0.730469 2.976562 -0.730469 C 3.480469 -0.730469 3.875 -0.816406 4.152344 -0.984375 C 4.414062 -1.152344 4.558594 -1.402344 4.558594 -1.726562 C 4.558594 -2.015625 4.453125 -2.242188 4.261719 -2.398438 C 4.066406 -2.554688 3.636719 -2.710938 2.964844 -2.855469 L 2.59375 -2.941406 C 1.921875 -3.085938 1.429688 -3.300781 1.140625 -3.589844 C 0.839844 -3.875 0.695312 -4.273438 0.695312 -4.789062 C 0.695312 -5.398438 0.910156 -5.878906 1.34375 -6.214844 C 1.777344 -6.550781 2.398438 -6.71875 3.214844 -6.71875 C 3.613281 -6.71875 3.984375 -6.683594 4.34375 -6.625 C 4.691406 -6.5625 5.015625 -6.480469 5.316406 -6.371094 "
           id="path101" />
      </symbol>
      <symbol
         overflow="visible"
         id="glyph3-5">
        <path
           style="stroke:none;"
           d="M 1.175781 -8.746094 L 2.941406 -8.746094 L 5.171875 -2.796875 L 7.414062 -8.746094 L 9.179688 -8.746094 L 9.179688 0 L 8.027344 0 L 8.027344 -7.679688 L 5.773438 -1.679688 L 4.585938 -1.679688 L 2.328125 -7.679688 L 2.328125 0 L 1.175781 0 L 1.175781 -8.746094 "
           id="path104" />
      </symbol>
      <symbol
         overflow="visible"
         id="glyph3-6">
        <path
           style="stroke:none;"
           d="M 3.671875 -5.808594 C 3.097656 -5.808594 2.640625 -5.578125 2.304688 -5.125 C 1.96875 -4.667969 1.800781 -4.054688 1.800781 -3.277344 C 1.800781 -2.484375 1.957031 -1.871094 2.292969 -1.414062 C 2.628906 -0.960938 3.085938 -0.742188 3.671875 -0.742188 C 4.246094 -0.742188 4.703125 -0.960938 5.039062 -1.414062 C 5.375 -1.871094 5.542969 -2.484375 5.542969 -3.277344 C 5.542969 -4.042969 5.375 -4.667969 5.039062 -5.125 C 4.703125 -5.578125 4.246094 -5.808594 3.671875 -5.808594 M 3.671875 -6.71875 C 4.609375 -6.71875 5.339844 -6.40625 5.878906 -5.808594 C 6.40625 -5.195312 6.683594 -4.355469 6.683594 -3.277344 C 6.683594 -2.195312 6.40625 -1.355469 5.878906 -0.757812 C 5.339844 -0.144531 4.609375 0.15625 3.671875 0.15625 C 2.722656 0.15625 1.980469 -0.144531 1.453125 -0.757812 C 0.925781 -1.355469 0.660156 -2.195312 0.660156 -3.277344 C 0.660156 -4.355469 0.925781 -5.195312 1.453125 -5.808594 C 1.980469 -6.40625 2.722656 -6.71875 3.671875 -6.71875 "
           id="path107" />
      </symbol>
      <symbol
         overflow="visible"
         id="glyph3-7">
        <path
           style="stroke:none;"
           d="M 6.742188 -3.550781 L 6.742188 -3.023438 L 1.789062 -3.023438 C 1.835938 -2.28125 2.050781 -1.703125 2.460938 -1.320312 C 2.855469 -0.9375 3.40625 -0.742188 4.128906 -0.742188 C 4.535156 -0.742188 4.945312 -0.792969 5.328125 -0.886719 C 5.710938 -0.984375 6.109375 -1.140625 6.492188 -1.355469 L 6.492188 -0.335938 C 6.109375 -0.167969 5.710938 -0.0351562 5.304688 0.0351562 C 4.894531 0.109375 4.476562 0.15625 4.066406 0.15625 C 3.011719 0.15625 2.183594 -0.144531 1.570312 -0.742188 C 0.960938 -1.34375 0.660156 -2.171875 0.660156 -3.214844 C 0.660156 -4.285156 0.949219 -5.136719 1.523438 -5.773438 C 2.101562 -6.394531 2.890625 -6.71875 3.875 -6.71875 C 4.765625 -6.71875 5.460938 -6.433594 5.976562 -5.867188 C 6.480469 -5.292969 6.742188 -4.523438 6.742188 -3.550781 M 5.664062 -3.863281 C 5.652344 -4.453125 5.484375 -4.921875 5.171875 -5.28125 C 4.847656 -5.628906 4.414062 -5.808594 3.886719 -5.808594 C 3.289062 -5.808594 2.808594 -5.628906 2.449219 -5.292969 C 2.089844 -4.957031 1.871094 -4.476562 1.824219 -3.863281 L 5.664062 -3.863281 "
           id="path110" />
      </symbol>
      <symbol
         overflow="visible"
         id="glyph3-8">
        <path
           style="stroke:none;"
           d=""
           id="path113" />
      </symbol>
      <symbol
         overflow="visible"
         id="glyph3-9">
        <path
           style="stroke:none;"
           d="M 3.71875 -9.109375 C 3.191406 -8.195312 2.808594 -7.308594 2.554688 -6.433594 C 2.292969 -5.554688 2.171875 -4.667969 2.171875 -3.769531 C 2.171875 -2.855469 2.292969 -1.96875 2.554688 -1.09375 C 2.808594 -0.203125 3.191406 0.671875 3.71875 1.570312 L 2.785156 1.570312 C 2.195312 0.648438 1.753906 -0.238281 1.464844 -1.128906 C 1.175781 -2.015625 1.03125 -2.890625 1.03125 -3.769531 C 1.03125 -4.632812 1.175781 -5.507812 1.464844 -6.394531 C 1.753906 -7.285156 2.183594 -8.183594 2.785156 -9.109375 L 3.71875 -9.109375 "
           id="path116" />
      </symbol>
      <symbol
         overflow="visible"
         id="glyph3-10">
        <path
           style="stroke:none;"
           d="M 1.175781 -8.746094 L 2.773438 -8.746094 L 6.648438 -1.429688 L 6.648438 -8.746094 L 7.800781 -8.746094 L 7.800781 0 L 6.203125 0 L 2.328125 -7.320312 L 2.328125 0 L 1.175781 0 L 1.175781 -8.746094 "
           id="path119" />
      </symbol>
      <symbol
         overflow="visible"
         id="glyph3-11">
        <path
           style="stroke:none;"
           d="M 4.105469 -7.585938 L 2.496094 -3.226562 L 5.710938 -3.226562 L 4.105469 -7.585938 M 3.433594 -8.746094 L 4.777344 -8.746094 L 8.113281 0 L 6.875 0 L 6.085938 -2.242188 L 2.136719 -2.242188 L 1.34375 0 L 0.0976562 0 L 3.433594 -8.746094 "
           id="path122" />
      </symbol>
      <symbol
         overflow="visible"
         id="glyph3-12">
        <path
           style="stroke:none;"
           d="M 1.273438 -5.449219 L 8.785156 -5.449219 L 8.785156 -4.464844 L 1.273438 -4.464844 L 1.273438 -5.449219 M 1.273438 -3.058594 L 8.785156 -3.058594 L 8.785156 -2.0625 L 1.273438 -2.0625 L 1.273438 -3.058594 "
           id="path125" />
      </symbol>
      <symbol
         overflow="visible"
         id="glyph3-13">
        <path
           style="stroke:none;"
           d="M 3.816406 -7.96875 C 3.203125 -7.96875 2.746094 -7.667969 2.4375 -7.066406 C 2.125 -6.46875 1.980469 -5.566406 1.980469 -4.367188 C 1.980469 -3.167969 2.125 -2.269531 2.4375 -1.667969 C 2.746094 -1.066406 3.203125 -0.769531 3.816406 -0.769531 C 4.429688 -0.769531 4.882812 -1.066406 5.195312 -1.667969 C 5.496094 -2.269531 5.652344 -3.167969 5.652344 -4.367188 C 5.652344 -5.566406 5.496094 -6.46875 5.195312 -7.066406 C 4.882812 -7.667969 4.429688 -7.96875 3.816406 -7.96875 M 3.816406 -8.902344 C 4.789062 -8.902344 5.53125 -8.507812 6.058594 -7.738281 C 6.574219 -6.960938 6.839844 -5.832031 6.839844 -4.367188 C 6.839844 -2.890625 6.574219 -1.765625 6.058594 -0.996094 C 5.53125 -0.226562 4.789062 0.15625 3.816406 0.15625 C 2.832031 0.15625 2.074219 -0.226562 1.558594 -0.996094 C 1.042969 -1.765625 0.792969 -2.890625 0.792969 -4.367188 C 0.792969 -5.832031 1.042969 -6.960938 1.558594 -7.738281 C 2.074219 -8.507812 2.832031 -8.902344 3.816406 -8.902344 "
           id="path128" />
      </symbol>
      <symbol
         overflow="visible"
         id="glyph3-14">
        <path
           style="stroke:none;"
           d="M 1.285156 -1.488281 L 2.519531 -1.488281 L 2.519531 0 L 1.285156 0 L 1.285156 -1.488281 "
           id="path131" />
      </symbol>
      <symbol
         overflow="visible"
         id="glyph3-15">
        <path
           style="stroke:none;"
           d="M 2.304688 -0.996094 L 6.433594 -0.996094 L 6.433594 0 L 0.875 0 L 0.875 -0.996094 C 1.320312 -1.453125 1.933594 -2.074219 2.710938 -2.867188 C 3.480469 -3.648438 3.972656 -4.152344 4.175781 -4.378906 C 4.558594 -4.800781 4.824219 -5.160156 4.96875 -5.460938 C 5.113281 -5.746094 5.195312 -6.046875 5.195312 -6.335938 C 5.195312 -6.792969 5.027344 -7.175781 4.703125 -7.464844 C 4.378906 -7.753906 3.960938 -7.90625 3.433594 -7.90625 C 3.058594 -7.90625 2.664062 -7.835938 2.257812 -7.714844 C 1.847656 -7.585938 1.402344 -7.390625 0.9375 -7.128906 L 0.9375 -8.328125 C 1.414062 -8.519531 1.859375 -8.664062 2.269531 -8.761719 C 2.675781 -8.855469 3.058594 -8.902344 3.40625 -8.902344 C 4.308594 -8.902344 5.027344 -8.675781 5.566406 -8.21875 C 6.109375 -7.765625 6.382812 -7.164062 6.382812 -6.40625 C 6.382812 -6.046875 6.3125 -5.699219 6.179688 -5.386719 C 6.046875 -5.0625 5.808594 -4.679688 5.449219 -4.246094 C 5.351562 -4.128906 5.039062 -3.804688 4.511719 -3.265625 C 3.984375 -2.722656 3.253906 -1.96875 2.304688 -0.996094 "
           id="path134" />
      </symbol>
      <symbol
         overflow="visible"
         id="glyph3-16">
        <path
           style="stroke:none;"
           d="M 1.296875 -8.746094 L 5.941406 -8.746094 L 5.941406 -7.753906 L 2.375 -7.753906 L 2.375 -5.605469 C 2.542969 -5.664062 2.722656 -5.710938 2.890625 -5.734375 C 3.058594 -5.761719 3.238281 -5.785156 3.40625 -5.785156 C 4.378906 -5.785156 5.148438 -5.507812 5.722656 -4.980469 C 6.300781 -4.441406 6.589844 -3.71875 6.589844 -2.808594 C 6.589844 -1.859375 6.289062 -1.128906 5.699219 -0.613281 C 5.113281 -0.0976562 4.285156 0.15625 3.226562 0.15625 C 2.855469 0.15625 2.484375 0.121094 2.101562 0.0703125 C 1.714844 0.0117188 1.332031 -0.0703125 0.925781 -0.203125 L 0.925781 -1.390625 C 1.273438 -1.199219 1.632812 -1.054688 2.015625 -0.960938 C 2.386719 -0.863281 2.785156 -0.828125 3.203125 -0.828125 C 3.875 -0.828125 4.414062 -0.996094 4.8125 -1.355469 C 5.195312 -1.714844 5.398438 -2.195312 5.398438 -2.808594 C 5.398438 -3.40625 5.195312 -3.886719 4.8125 -4.246094 C 4.414062 -4.609375 3.875 -4.789062 3.203125 -4.789062 C 2.890625 -4.789062 2.566406 -4.753906 2.257812 -4.679688 C 1.945312 -4.609375 1.621094 -4.5 1.296875 -4.355469 L 1.296875 -8.746094 "
           id="path137" />
      </symbol>
      <symbol
         overflow="visible"
         id="glyph3-17">
        <path
           style="stroke:none;"
           d="M 0.960938 -9.109375 L 1.894531 -9.109375 C 2.472656 -8.183594 2.914062 -7.285156 3.203125 -6.394531 C 3.492188 -5.507812 3.648438 -4.632812 3.648438 -3.769531 C 3.648438 -2.890625 3.492188 -2.015625 3.203125 -1.128906 C 2.914062 -0.238281 2.472656 0.648438 1.894531 1.570312 L 0.960938 1.570312 C 1.476562 0.671875 1.859375 -0.203125 2.125 -1.09375 C 2.375 -1.96875 2.507812 -2.855469 2.507812 -3.769531 C 2.507812 -4.667969 2.375 -5.554688 2.125 -6.433594 C 1.859375 -7.308594 1.476562 -8.195312 0.960938 -9.109375 "
           id="path140" />
      </symbol>
      <symbol
         overflow="visible"
         id="glyph3-18">
        <path
           style="stroke:none;"
           d="M 2.363281 -7.777344 L 2.363281 -4.488281 L 3.851562 -4.488281 C 4.402344 -4.488281 4.824219 -4.621094 5.125 -4.90625 C 5.425781 -5.195312 5.578125 -5.605469 5.578125 -6.132812 C 5.578125 -6.660156 5.425781 -7.054688 5.125 -7.34375 C 4.824219 -7.632812 4.402344 -7.777344 3.851562 -7.777344 L 2.363281 -7.777344 M 1.175781 -8.746094 L 3.851562 -8.746094 C 4.824219 -8.746094 5.566406 -8.519531 6.070312 -8.074219 C 6.574219 -7.632812 6.828125 -6.984375 6.828125 -6.132812 C 6.828125 -5.269531 6.574219 -4.609375 6.070312 -4.175781 C 5.566406 -3.730469 4.824219 -3.515625 3.851562 -3.515625 L 2.363281 -3.515625 L 2.363281 0 L 1.175781 0 L 1.175781 -8.746094 "
           id="path143" />
      </symbol>
      <symbol
         overflow="visible"
         id="glyph3-19">
        <path
           style="stroke:none;"
           d="M 0.589844 -3.769531 L 3.742188 -3.769531 L 3.742188 -2.808594 L 0.589844 -2.808594 L 0.589844 -3.769531 "
           id="path146" />
      </symbol>
      <symbol
         overflow="visible"
         id="glyph3-20">
        <path
           style="stroke:none;"
           d="M 6.589844 -3.960938 L 6.589844 0 L 5.507812 0 L 5.507812 -3.925781 C 5.507812 -4.546875 5.375 -5.003906 5.136719 -5.316406 C 4.894531 -5.628906 4.535156 -5.785156 4.054688 -5.785156 C 3.46875 -5.785156 3.011719 -5.59375 2.675781 -5.21875 C 2.339844 -4.847656 2.171875 -4.34375 2.171875 -3.707031 L 2.171875 0 L 1.09375 0 L 1.09375 -6.5625 L 2.171875 -6.5625 L 2.171875 -5.542969 C 2.425781 -5.929688 2.722656 -6.226562 3.085938 -6.421875 C 3.433594 -6.613281 3.839844 -6.71875 4.296875 -6.71875 C 5.039062 -6.71875 5.617188 -6.480469 6 -6.011719 C 6.382812 -5.542969 6.589844 -4.859375 6.589844 -3.960938 "
           id="path149" />
      </symbol>
      <symbol
         overflow="visible"
         id="glyph3-21">
        <path
           style="stroke:none;"
           d="M 3.863281 0.601562 C 3.550781 1.367188 3.253906 1.882812 2.964844 2.125 C 2.675781 2.363281 2.292969 2.484375 1.8125 2.484375 L 0.949219 2.484375 L 0.949219 1.585938 L 1.585938 1.585938 C 1.871094 1.585938 2.101562 1.511719 2.269531 1.367188 C 2.4375 1.222656 2.617188 0.898438 2.820312 0.371094 L 3.011719 -0.109375 L 0.359375 -6.5625 L 1.5 -6.5625 L 3.550781 -1.429688 L 5.605469 -6.5625 L 6.742188 -6.5625 L 3.863281 0.601562 "
           id="path152" />
      </symbol>
      <symbol
         overflow="visible"
         id="glyph3-22">
        <path
           style="stroke:none;"
           d="M 1.175781 -8.746094 L 2.363281 -8.746094 L 2.363281 -5.160156 L 6.660156 -5.160156 L 6.660156 -8.746094 L 7.847656 -8.746094 L 7.847656 0 L 6.660156 0 L 6.660156 -4.164062 L 2.363281 -4.164062 L 2.363281 0 L 1.175781 0 L 1.175781 -8.746094 "
           id="path155" />
      </symbol>
      <symbol
         overflow="visible"
         id="glyph3-23">
        <path
           style="stroke:none;"
           d="M 6.238281 -5.304688 C 6.503906 -5.785156 6.828125 -6.132812 7.199219 -6.371094 C 7.570312 -6.601562 8.015625 -6.71875 8.53125 -6.71875 C 9.203125 -6.71875 9.730469 -6.480469 10.105469 -6 C 10.476562 -5.519531 10.667969 -4.835938 10.667969 -3.960938 L 10.667969 0 L 9.589844 0 L 9.589844 -3.925781 C 9.589844 -4.546875 9.46875 -5.015625 9.253906 -5.328125 C 9.023438 -5.628906 8.6875 -5.785156 8.230469 -5.785156 C 7.667969 -5.785156 7.222656 -5.59375 6.898438 -5.21875 C 6.574219 -4.847656 6.421875 -4.34375 6.421875 -3.707031 L 6.421875 0 L 5.339844 0 L 5.339844 -3.925781 C 5.339844 -4.546875 5.21875 -5.015625 5.003906 -5.328125 C 4.777344 -5.628906 4.429688 -5.785156 3.972656 -5.785156 C 3.421875 -5.785156 2.976562 -5.59375 2.652344 -5.21875 C 2.328125 -4.847656 2.171875 -4.34375 2.171875 -3.707031 L 2.171875 0 L 1.09375 0 L 1.09375 -6.5625 L 2.171875 -6.5625 L 2.171875 -5.542969 C 2.410156 -5.941406 2.710938 -6.238281 3.058594 -6.433594 C 3.394531 -6.625 3.804688 -6.71875 4.285156 -6.71875 C 4.765625 -6.71875 5.160156 -6.601562 5.496094 -6.359375 C 5.832031 -6.121094 6.070312 -5.761719 6.238281 -5.304688 "
           id="path158" />
      </symbol>
      <symbol
         overflow="visible"
         id="glyph3-24">
        <path
           style="stroke:none;"
           d="M 4.117188 -3.300781 C 3.238281 -3.300781 2.640625 -3.191406 2.304688 -3 C 1.96875 -2.796875 1.800781 -2.460938 1.800781 -1.980469 C 1.800781 -1.597656 1.921875 -1.285156 2.171875 -1.066406 C 2.425781 -0.839844 2.773438 -0.730469 3.203125 -0.730469 C 3.804688 -0.730469 4.285156 -0.9375 4.644531 -1.367188 C 5.003906 -1.789062 5.183594 -2.351562 5.183594 -3.058594 L 5.183594 -3.300781 L 4.117188 -3.300781 M 6.265625 -3.742188 L 6.265625 0 L 5.183594 0 L 5.183594 -0.996094 C 4.933594 -0.589844 4.621094 -0.300781 4.261719 -0.121094 C 3.898438 0.0585938 3.445312 0.15625 2.914062 0.15625 C 2.242188 0.15625 1.703125 -0.0234375 1.308594 -0.394531 C 0.910156 -0.769531 0.71875 -1.273438 0.71875 -1.90625 C 0.71875 -2.640625 0.960938 -3.191406 1.464844 -3.574219 C 1.957031 -3.949219 2.6875 -4.140625 3.671875 -4.140625 L 5.183594 -4.140625 L 5.183594 -4.246094 C 5.183594 -4.738281 5.015625 -5.125 4.691406 -5.398438 C 4.367188 -5.664062 3.910156 -5.808594 3.324219 -5.808594 C 2.941406 -5.808594 2.578125 -5.761719 2.21875 -5.664062 C 1.859375 -5.566406 1.523438 -5.4375 1.199219 -5.269531 L 1.199219 -6.265625 C 1.585938 -6.40625 1.96875 -6.527344 2.339844 -6.601562 C 2.710938 -6.671875 3.070312 -6.71875 3.433594 -6.71875 C 4.378906 -6.71875 5.089844 -6.46875 5.554688 -5.976562 C 6.023438 -5.484375 6.265625 -4.738281 6.265625 -3.742188 "
           id="path161" />
      </symbol>
      <symbol
         overflow="visible"
         id="glyph3-25">
        <path
           style="stroke:none;"
           d="M 1.488281 -0.996094 L 3.421875 -0.996094 L 3.421875 -7.667969 L 1.320312 -7.246094 L 1.320312 -8.328125 L 3.40625 -8.746094 L 4.597656 -8.746094 L 4.597656 -0.996094 L 6.527344 -0.996094 L 6.527344 0 L 1.488281 0 L 1.488281 -0.996094 "
           id="path164" />
      </symbol>
      <symbol
         overflow="visible"
         id="glyph3-26">
        <path
           style="stroke:none;"
           d="M 3.816406 -4.152344 C 3.253906 -4.152344 2.808594 -3.996094 2.484375 -3.695312 C 2.160156 -3.394531 2.003906 -2.988281 2.003906 -2.460938 C 2.003906 -1.933594 2.160156 -1.511719 2.484375 -1.210938 C 2.808594 -0.910156 3.253906 -0.769531 3.816406 -0.769531 C 4.367188 -0.769531 4.8125 -0.910156 5.136719 -1.222656 C 5.460938 -1.523438 5.628906 -1.933594 5.628906 -2.460938 C 5.628906 -2.988281 5.460938 -3.394531 5.148438 -3.695312 C 4.824219 -3.996094 4.378906 -4.152344 3.816406 -4.152344 M 2.628906 -4.65625 C 2.125 -4.777344 1.726562 -5.015625 1.441406 -5.363281 C 1.152344 -5.710938 1.019531 -6.132812 1.019531 -6.636719 C 1.019531 -7.332031 1.261719 -7.882812 1.765625 -8.292969 C 2.257812 -8.699219 2.941406 -8.902344 3.816406 -8.902344 C 4.679688 -8.902344 5.363281 -8.699219 5.867188 -8.292969 C 6.359375 -7.882812 6.613281 -7.332031 6.613281 -6.636719 C 6.613281 -6.132812 6.46875 -5.710938 6.179688 -5.363281 C 5.890625 -5.015625 5.507812 -4.777344 5.003906 -4.65625 C 5.566406 -4.523438 6.011719 -4.261719 6.335938 -3.875 C 6.648438 -3.492188 6.816406 -3.011719 6.816406 -2.460938 C 6.816406 -1.609375 6.550781 -0.960938 6.035156 -0.515625 C 5.507812 -0.0585938 4.777344 0.15625 3.816406 0.15625 C 2.84375 0.15625 2.101562 -0.0585938 1.585938 -0.515625 C 1.066406 -0.960938 0.816406 -1.609375 0.816406 -2.460938 C 0.816406 -3.011719 0.972656 -3.492188 1.296875 -3.875 C 1.609375 -4.261719 2.050781 -4.523438 2.628906 -4.65625 M 2.195312 -6.527344 C 2.195312 -6.070312 2.328125 -5.710938 2.617188 -5.460938 C 2.902344 -5.207031 3.300781 -5.089844 3.816406 -5.089844 C 4.320312 -5.089844 4.714844 -5.207031 5.003906 -5.460938 C 5.292969 -5.710938 5.4375 -6.070312 5.4375 -6.527344 C 5.4375 -6.984375 5.292969 -7.332031 5.003906 -7.585938 C 4.714844 -7.835938 4.320312 -7.96875 3.816406 -7.96875 C 3.300781 -7.96875 2.902344 -7.835938 2.617188 -7.585938 C 2.328125 -7.332031 2.195312 -6.984375 2.195312 -6.527344 "
           id="path167" />
      </symbol>
    </g>
    <marker
       style="overflow:visible"
       id="Arrow2Sstart"
       refX="0"
       refY="0"
       orient="auto"
       inkscape:stockid="Arrow2Sstart"
       inkscape:isstock="true">
      <path
         transform="matrix(0.3,0,0,0.3,-0.69,0)"
         d="M 8.7185878,4.0337352 -2.2072895,0.01601326 8.7185884,-4.0017078 c -1.7454984,2.3720609 -1.7354408,5.6174519 -6e-7,8.035443 z"
         style="fill:#000000;fill-opacity:1;fill-rule:evenodd;stroke:#000000;stroke-width:0.625;stroke-linejoin:round;stroke-opacity:1"
         id="path3497" />
    </marker>
    <marker
       style="overflow:visible"
       id="Arrow2Send"
       refX="0"
       refY="0"
       orient="auto"
       inkscape:stockid="Arrow2Send"
       inkscape:isstock="true">
      <path
         transform="matrix(-0.3,0,0,-0.3,0.69,0)"
         d="M 8.7185878,4.0337352 -2.2072895,0.01601326 8.7185884,-4.0017078 c -1.7454984,2.3720609 -1.7354408,5.6174519 -6e-7,8.035443 z"
         style="fill:#000000;fill-opacity:1;fill-rule:evenodd;stroke:#000000;stroke-width:0.625;stroke-linejoin:round;stroke-opacity:1"
         id="path3231" />
    </marker>
    <marker
       style="overflow:visible"
       id="Arrow2Mstart-2"
       refX="0"
       refY="0"
       orient="auto"
       inkscape:stockid="Arrow2Mstart"
       inkscape:isstock="true">
      <path
         transform="scale(0.6)"
         d="M 8.7185878,4.0337352 -2.2072895,0.01601326 8.7185884,-4.0017078 c -1.7454984,2.3720609 -1.7354408,5.6174519 -6e-7,8.035443 z"
         style="fill:#000000;fill-opacity:1;fill-rule:evenodd;stroke:#000000;stroke-width:0.625;stroke-linejoin:round;stroke-opacity:1"
         id="path1900-6" />
    </marker>
    <marker
       style="overflow:visible"
       id="marker2338-1"
       refX="0"
       refY="0"
       orient="auto"
       inkscape:stockid="Arrow2Mend"
       inkscape:isstock="true">
      <path
         transform="scale(-0.6)"
         d="M 8.7185878,4.0337352 -2.2072895,0.01601326 8.7185884,-4.0017078 c -1.7454984,2.3720609 -1.7354408,5.6174519 -6e-7,8.035443 z"
         style="fill:#000000;fill-opacity:1;fill-rule:evenodd;stroke:#000000;stroke-width:0.625;stroke-linejoin:round;stroke-opacity:1"
         id="path2336-8" />
    </marker>
  </defs>
  <g
     id="surface1810">
    <path
       style="fill:none;stroke-width:3;stroke-linecap:round;stroke-linejoin:round;stroke:rgb(0%,60.499573%,97.799683%);stroke-opacity:1;stroke-miterlimit:10;"
       d="M 54.894531 47.5 L 58.546875 50.621094 L 62.199219 53.476562 L 65.851562 56.089844 L 69.503906 58.496094 L 74.980469 61.765625 L 80.457031 64.683594 L 85.9375 67.3125 L 91.414062 69.691406 L 96.890625 71.855469 L 104.195312 74.460938 L 111.5 76.796875 L 118.800781 78.910156 L 127.933594 81.28125 L 137.0625 83.40625 L 146.191406 85.324219 L 157.144531 87.40625 L 169.925781 89.578125 L 182.707031 91.519531 L 197.316406 93.507812 L 213.75 95.511719 L 232.007812 97.492188 L 252.09375 99.433594 L 274.003906 101.320312 L 299.566406 103.277344 L 326.957031 105.136719 L 354.34375 106.769531 L 385.382812 108.390625 L 418.25 109.910156 "
       transform="matrix(1,0,0,-1,0,288)"
       id="path176" />
    <path
       style="fill:none;stroke-width:0.8;stroke-linecap:butt;stroke-linejoin:round;stroke:rgb(0%,0%,0%);stroke-opacity:1;stroke-miterlimit:10;"
       d="M 53.070312 40.574219 L 53.070312 44.074219 "
       transform="matrix(1,0,0,-1,0,288)"
       id="path178" />
    <g
       style="fill:rgb(0%,0%,0%);fill-opacity:1;"
       id="g182">
      <use
         xlink:href="#glyph0-0"
         x="48.936598"
         y="260.800354"
         id="use180" />
    </g>
    <path
       style="fill:none;stroke-width:0.8;stroke-linecap:butt;stroke-linejoin:round;stroke:rgb(0%,0%,0%);stroke-opacity:1;stroke-miterlimit:10;"
       d="M 144.363281 40.574219 L 144.363281 44.074219 "
       transform="matrix(1,0,0,-1,0,288)"
       id="path184" />
    <g
       style="fill:rgb(0%,0%,0%);fill-opacity:1;"
       id="g190">
      <use
         xlink:href="#glyph0-1"
         x="136.099207"
         y="260.800354"
         id="use186" />
      <use
         xlink:href="#glyph0-0"
         x="144.367207"
         y="260.800354"
         id="use188" />
    </g>
    <path
       style="fill:none;stroke-width:0.8;stroke-linecap:butt;stroke-linejoin:round;stroke:rgb(0%,0%,0%);stroke-opacity:1;stroke-miterlimit:10;"
       d="M 235.660156 40.574219 L 235.660156 44.074219 "
       transform="matrix(1,0,0,-1,0,288)"
       id="path192" />
    <g
       style="fill:rgb(0%,0%,0%);fill-opacity:1;"
       id="g200">
      <use
         xlink:href="#glyph0-2"
         x="223.261816"
         y="260.800354"
         id="use194" />
      <use
         xlink:href="#glyph0-0"
         x="231.529816"
         y="260.800354"
         id="use196" />
      <use
         xlink:href="#glyph0-0"
         x="239.797816"
         y="260.800354"
         id="use198" />
    </g>
    <path
       style="fill:none;stroke-width:0.8;stroke-linecap:butt;stroke-linejoin:round;stroke:rgb(0%,0%,0%);stroke-opacity:1;stroke-miterlimit:10;"
       d="M 326.957031 40.574219 L 326.957031 44.074219 "
       transform="matrix(1,0,0,-1,0,288)"
       id="path202" />
    <g
       style="fill:rgb(0%,0%,0%);fill-opacity:1;"
       id="g210">
      <use
         xlink:href="#glyph0-2"
         x="314.557237"
         y="260.800354"
         id="use204" />
      <use
         xlink:href="#glyph0-1"
         x="322.825237"
         y="260.800354"
         id="use206" />
      <use
         xlink:href="#glyph0-0"
         x="331.093237"
         y="260.800354"
         id="use208" />
    </g>
    <path
       style="fill:none;stroke-width:0.8;stroke-linecap:butt;stroke-linejoin:round;stroke:rgb(0%,0%,0%);stroke-opacity:1;stroke-miterlimit:10;"
       d="M 418.25 40.574219 L 418.25 44.074219 "
       transform="matrix(1,0,0,-1,0,288)"
       id="path212" />
    <g
       style="fill:rgb(0%,0%,0%);fill-opacity:1;"
       id="g220">
      <use
         xlink:href="#glyph0-3"
         x="405.852659"
         y="260.800354"
         id="use214" />
      <use
         xlink:href="#glyph0-0"
         x="414.120659"
         y="260.800354"
         id="use216" />
      <use
         xlink:href="#glyph0-0"
         x="422.388659"
         y="260.800354"
         id="use218" />
    </g>
    <g
       style="fill:rgb(0%,0%,0%);fill-opacity:1;"
       id="g258">
      <use
         xlink:href="#glyph1-0"
         x="149.26852"
         y="281.175354"
         id="use222" />
      <use
         xlink:href="#glyph1-1"
         x="161.83252"
         y="281.175354"
         id="use224" />
      <use
         xlink:href="#glyph1-2"
         x="172.84852"
         y="281.175354"
         id="use226" />
      <use
         xlink:href="#glyph1-3"
         x="179.34652"
         y="281.175354"
         id="use228" />
      <use
         xlink:href="#glyph1-4"
         x="190.38052"
         y="281.175354"
         id="use230" />
      <use
         xlink:href="#glyph1-5"
         x="200.28052"
         y="281.175354"
         id="use232" />
      <use
         xlink:href="#glyph1-6"
         x="207.33652"
         y="281.175354"
         id="use234" />
      <use
         xlink:href="#glyph1-7"
         x="212.34052"
         y="281.175354"
         id="use236" />
      <use
         xlink:href="#glyph1-8"
         x="222.99652"
         y="281.175354"
         id="use238" />
      <use
         xlink:href="#glyph1-9"
         x="234.06652"
         y="281.175354"
         id="use240" />
      <use
         xlink:href="#glyph1-10"
         x="239.79052"
         y="281.175354"
         id="use242" />
      <use
         xlink:href="#glyph1-11"
         x="249.16852"
         y="281.175354"
         id="use244" />
      <use
         xlink:href="#glyph1-12"
         x="259.82452"
         y="281.175354"
         id="use246" />
      <use
         xlink:href="#glyph1-3"
         x="271.23652"
         y="281.175354"
         id="use248" />
      <use
         xlink:href="#glyph1-13"
         x="282.27052"
         y="281.175354"
         id="use250" />
      <use
         xlink:href="#glyph1-10"
         x="293.70052"
         y="281.175354"
         id="use252" />
      <use
         xlink:href="#glyph1-8"
         x="303.07852"
         y="281.175354"
         id="use254" />
      <use
         xlink:href="#glyph1-10"
         x="314.14852"
         y="281.175354"
         id="use256" />
    </g>
    <path
       style="fill:none;stroke-width:0.8;stroke-linecap:butt;stroke-linejoin:round;stroke:rgb(0%,0%,0%);stroke-opacity:1;stroke-miterlimit:10;"
       d="M 43.996094 45.824219 L 47.496094 45.824219 "
       transform="matrix(1,0,0,-1,0,288)"
       id="path260" />
    <g
       style="fill:rgb(0%,0%,0%);fill-opacity:1;"
       id="g264">
      <use
         xlink:href="#glyph0-0"
         x="32.229021"
         y="247.112808"
         id="use262" />
    </g>
    <path
       style="fill:none;stroke-width:0.8;stroke-linecap:butt;stroke-linejoin:round;stroke:rgb(0%,0%,0%);stroke-opacity:1;stroke-miterlimit:10;"
       d="M 43.996094 83.070312 L 47.496094 83.070312 "
       transform="matrix(1,0,0,-1,0,288)"
       id="path266" />
    <g
       style="fill:rgb(0%,0%,0%);fill-opacity:1;"
       id="g272">
      <use
         xlink:href="#glyph0-2"
         x="23.963396"
         y="209.868795"
         id="use268" />
      <use
         xlink:href="#glyph0-0"
         x="32.231396"
         y="209.868795"
         id="use270" />
    </g>
    <path
       style="fill:none;stroke-width:0.8;stroke-linecap:butt;stroke-linejoin:round;stroke:rgb(0%,0%,0%);stroke-opacity:1;stroke-miterlimit:10;"
       d="M 43.996094 120.3125 L 47.496094 120.3125 "
       transform="matrix(1,0,0,-1,0,288)"
       id="path274" />
    <g
       style="fill:rgb(0%,0%,0%);fill-opacity:1;"
       id="g280">
      <use
         xlink:href="#glyph0-3"
         x="23.963396"
         y="172.624782"
         id="use276" />
      <use
         xlink:href="#glyph0-0"
         x="32.231396"
         y="172.624782"
         id="use278" />
    </g>
    <path
       style="fill:none;stroke-width:0.8;stroke-linecap:butt;stroke-linejoin:round;stroke:rgb(0%,0%,0%);stroke-opacity:1;stroke-miterlimit:10;"
       d="M 43.996094 157.558594 L 47.496094 157.558594 "
       transform="matrix(1,0,0,-1,0,288)"
       id="path282" />
    <g
       style="fill:rgb(0%,0%,0%);fill-opacity:1;"
       id="g288">
      <use
         xlink:href="#glyph0-4"
         x="23.963396"
         y="135.380768"
         id="use284" />
      <use
         xlink:href="#glyph0-0"
         x="32.231396"
         y="135.380768"
         id="use286" />
    </g>
    <path
       style="fill:none;stroke-width:0.8;stroke-linecap:butt;stroke-linejoin:round;stroke:rgb(0%,0%,0%);stroke-opacity:1;stroke-miterlimit:10;"
       d="M 43.996094 194.800781 L 47.496094 194.800781 "
       transform="matrix(1,0,0,-1,0,288)"
       id="path290" />
    <g
       style="fill:rgb(0%,0%,0%);fill-opacity:1;"
       id="g296">
      <use
         xlink:href="#glyph0-5"
         x="23.963396"
         y="98.136755"
         id="use292" />
      <use
         xlink:href="#glyph0-0"
         x="32.231396"
         y="98.136755"
         id="use294" />
    </g>
    <path
       style="fill:none;stroke-width:0.8;stroke-linecap:butt;stroke-linejoin:round;stroke:rgb(0%,0%,0%);stroke-opacity:1;stroke-miterlimit:10;"
       d="M 43.996094 232.042969 L 47.496094 232.042969 "
       transform="matrix(1,0,0,-1,0,288)"
       id="path298" />
    <g
       style="fill:rgb(0%,0%,0%);fill-opacity:1;"
       id="g304">
      <use
         xlink:href="#glyph0-1"
         x="23.963396"
         y="60.892742"
         id="use300" />
      <use
         xlink:href="#glyph0-0"
         x="32.231396"
         y="60.892742"
         id="use302" />
    </g>
    <path
       style="fill:none;stroke-width:0.8;stroke-linecap:butt;stroke-linejoin:round;stroke:rgb(0%,0%,0%);stroke-opacity:1;stroke-miterlimit:10;"
       d="M 43.996094 269.289062 L 47.496094 269.289062 "
       transform="matrix(1,0,0,-1,0,288)"
       id="path306" />
    <g
       style="fill:rgb(0%,0%,0%);fill-opacity:1;"
       id="g312">
      <use
         xlink:href="#glyph0-6"
         x="23.963396"
         y="23.648729"
         id="use308" />
      <use
         xlink:href="#glyph0-0"
         x="32.231396"
         y="23.648729"
         id="use310" />
    </g>
    <g
       style="fill:rgb(0%,0%,0%);fill-opacity:1;"
       id="g332">
      <use
         xlink:href="#glyph2-0"
         x="16.213396"
         y="172.200312"
         id="use314" />
      <use
         xlink:href="#glyph2-1"
         x="16.213396"
         y="160.824312"
         id="use316" />
      <use
         xlink:href="#glyph2-2"
         x="16.213396"
         y="149.970312"
         id="use318" />
      <use
         xlink:href="#glyph2-1"
         x="16.213396"
         y="138.540312"
         id="use320" />
      <use
         xlink:href="#glyph2-3"
         x="16.213396"
         y="127.686312"
         id="use322" />
      <use
         xlink:href="#glyph2-4"
         x="16.213396"
         y="121.962312"
         id="use324" />
      <use
         xlink:href="#glyph2-5"
         x="16.213396"
         y="114.942312"
         id="use326" />
      <use
         xlink:href="#glyph2-6"
         x="16.213396"
         y="97.410312"
         id="use328" />
      <use
         xlink:href="#glyph2-7"
         x="16.213396"
         y="85.098312"
         id="use330" />
    </g>
    <path
       style="fill:none;stroke-width:3;stroke-linecap:round;stroke-linejoin:round;stroke:rgb(88.899231%,43.598938%,27.799988%);stroke-opacity:1;stroke-miterlimit:10;"
       d="M 54.894531 47.496094 L 58.546875 50.613281 L 62.199219 53.453125 L 65.851562 56.058594 L 69.503906 58.449219 L 74.980469 61.691406 L 80.457031 64.585938 L 85.9375 67.1875 L 91.414062 69.53125 L 96.890625 71.664062 L 104.195312 74.226562 L 111.5 76.515625 L 118.800781 78.578125 L 127.933594 80.890625 L 137.0625 82.957031 L 148.015625 85.167969 L 158.972656 87.140625 L 171.753906 89.195312 L 184.535156 91.027344 L 199.140625 92.902344 L 215.574219 94.777344 L 233.835938 96.628906 L 253.917969 98.433594 L 277.65625 100.320312 L 303.21875 102.101562 L 330.609375 103.789062 L 356.171875 105.164062 L 389.035156 106.699219 L 418.25 107.894531 "
       transform="matrix(1,0,0,-1,0,288)"
       id="path334" />
    <path
       style="fill:none;stroke-width:1;stroke-linecap:square;stroke-linejoin:miter;stroke:rgb(0%,0%,0%);stroke-opacity:1;stroke-miterlimit:10;"
       d="M 43.996094 40.574219 L 43.996094 285.164062 "
       transform="matrix(1,0,0,-1,0,288)"
       id="path336" />
    <path
       style="fill:none;stroke-width:1;stroke-linecap:square;stroke-linejoin:miter;stroke:rgb(0%,0%,0%);stroke-opacity:1;stroke-miterlimit:10;"
       d="M 43.996094 40.574219 L 429.152344 40.574219 "
       transform="matrix(1,0,0,-1,0,288)"
       id="path338" />
    <path
       style="fill:none;stroke:#3da34c;stroke-width:3;stroke-linecap:round;stroke-linejoin:round;stroke-miterlimit:10;stroke-opacity:1"
       d="m 54.894531,47.550781 3.652344,3.246094 3.652344,3.011719 5.476562,4.144531 5.480469,3.78125 5.476562,3.488281 5.476563,3.253906 7.304687,4.058594 9.128908,4.746094 25.5625,12.972656 1.82812,1.085938 1.82422,3.410156 5.47656,11.52734 1.82813,3.1875 1.82422,2.72657 1.82812,2.33984 1.82422,2.02734 1.82422,1.78125 1.82813,1.58204 3.65234,2.72265 3.65234,2.28906 3.64844,1.98047 3.65234,1.75391 5.48047,2.3125 5.47657,2.04297 7.30468,2.4375 9.12891,2.76953 14.60547,4.34765 5.48047,1.875 3.64843,1.53907 1.82813,0.97265 1.82422,1.31641 1.82812,3.25781 m 0,0 1.82422,126.70313"
       transform="matrix(1,0,0,-1,0,288)"
       id="path340"
       sodipodi:nodetypes="ccccccccccccccccccccccccccccccccccc" />
    <g
       style="fill:rgb(0%,0%,0%);fill-opacity:1;"
       id="g352">
      <use
         xlink:href="#glyph3-0"
         x="318.723644"
         y="102.005"
         id="use342" />
      <use
         xlink:href="#glyph3-1"
         x="328.023644"
         y="102.005"
         id="use344" />
      <use
         xlink:href="#glyph3-2"
         x="331.359644"
         y="102.005"
         id="use346" />
      <use
         xlink:href="#glyph3-3"
         x="338.967644"
         y="102.005"
         id="use348" />
      <use
         xlink:href="#glyph3-4"
         x="347.307644"
         y="102.005"
         id="use350" />
    </g>
    <g
       id="g1373"
       transform="translate(-0.18504833,17.33893)">
      <path
         style="fill:none;stroke:#0099f8;stroke-width:3;stroke-linecap:square;stroke-linejoin:round;stroke-miterlimit:10;stroke-opacity:1"
         d="m 253.92187,172.57031 h 24"
         transform="matrix(1,0,0,-1,0,288)"
         id="path354" />
      <g
         style="fill:#000000;fill-opacity:1"
         id="g392">
        <use
           xlink:href="#glyph3-5"
           x="287.52365"
           y="119.63"
           id="use356"
           width="100%"
           height="100%" />
        <use
           xlink:href="#glyph3-6"
           x="297.87964"
           y="119.63"
           id="use358"
           width="100%"
           height="100%" />
        <use
           xlink:href="#glyph3-2"
           x="305.22363"
           y="119.63"
           id="use360"
           width="100%"
           height="100%" />
        <use
           xlink:href="#glyph3-4"
           x="312.83163"
           y="119.63"
           id="use362"
           width="100%"
           height="100%" />
        <use
           xlink:href="#glyph3-7"
           x="319.08365"
           y="119.63"
           id="use364"
           width="100%"
           height="100%" />
        <use
           xlink:href="#glyph3-8"
           x="326.46365"
           y="119.63"
           id="use366"
           width="100%"
           height="100%" />
        <use
           xlink:href="#glyph3-9"
           x="330.27963"
           y="119.63"
           id="use368"
           width="100%"
           height="100%" />
        <use
           xlink:href="#glyph3-10"
           x="334.95966"
           y="119.63"
           id="use370"
           width="100%"
           height="100%" />
        <use
           xlink:href="#glyph3-11"
           x="343.93564"
           y="119.63"
           id="use372"
           width="100%"
           height="100%" />
        <use
           xlink:href="#glyph3-3"
           x="352.14365"
           y="119.63"
           id="use374"
           width="100%"
           height="100%" />
        <use
           xlink:href="#glyph3-8"
           x="360.48364"
           y="119.63"
           id="use376"
           width="100%"
           height="100%" />
        <use
           xlink:href="#glyph3-12"
           x="364.29965"
           y="119.63"
           id="use378"
           width="100%"
           height="100%" />
        <use
           xlink:href="#glyph3-8"
           x="374.35565"
           y="119.63"
           id="use380"
           width="100%"
           height="100%" />
        <use
           xlink:href="#glyph3-13"
           x="378.17163"
           y="119.63"
           id="use382"
           width="100%"
           height="100%" />
        <use
           xlink:href="#glyph3-14"
           x="385.80365"
           y="119.63"
           id="use384"
           width="100%"
           height="100%" />
        <use
           xlink:href="#glyph3-15"
           x="389.61963"
           y="119.63"
           id="use386"
           width="100%"
           height="100%" />
        <use
           xlink:href="#glyph3-16"
           x="397.25165"
           y="119.63"
           id="use388"
           width="100%"
           height="100%" />
        <use
           xlink:href="#glyph3-17"
           x="404.88364"
           y="119.63"
           id="use390"
           width="100%"
           height="100%" />
      </g>
    </g>
    <g
       style="fill:#000000;fill-opacity:1"
       id="g436"
       transform="translate(-0.18504076,-18.185451)">
      <use
         xlink:href="#glyph3-8"
         x="351.25565"
         y="137.255"
         id="use414"
         width="100%"
         height="100%" />
      <use
         xlink:href="#glyph3-8"
         x="385.27563"
         y="137.255"
         id="use424"
         width="100%"
         height="100%" />
      <use
         xlink:href="#glyph3-8"
         x="399.14764"
         y="137.255"
         id="use428"
         width="100%"
         height="100%" />
      <g
         id="g1351">
        <path
           style="fill:none;stroke:#e16e45;stroke-width:3;stroke-linecap:square;stroke-linejoin:round;stroke-miterlimit:10;stroke-opacity:1"
           d="m 253.92187,154.94531 h 24"
           transform="matrix(0.99999997,0,0,-0.99999997,0,288)"
           id="path394" />
        <use
           xlink:href="#glyph3-11"
           x="287.52365"
           y="137.255"
           id="use396"
           width="100%"
           height="100%" />
        <use
           xlink:href="#glyph3-5"
           x="295.73166"
           y="137.255"
           id="use398"
           width="100%"
           height="100%" />
        <use
           xlink:href="#glyph3-18"
           x="306.08765"
           y="137.255"
           id="use400"
           width="100%"
           height="100%" />
        <use
           xlink:href="#glyph3-11"
           x="313.32364"
           y="137.255"
           id="use402"
           width="100%"
           height="100%" />
        <use
           xlink:href="#glyph3-19"
           x="321.53165"
           y="137.255"
           id="use404"
           width="100%"
           height="100%" />
        <use
           xlink:href="#glyph3-6"
           x="325.86365"
           y="137.255"
           id="use406"
           width="100%"
           height="100%" />
        <use
           xlink:href="#glyph3-20"
           x="333.20764"
           y="137.255"
           id="use408"
           width="100%"
           height="100%" />
        <use
           xlink:href="#glyph3-1"
           x="340.81564"
           y="137.255"
           id="use410"
           width="100%"
           height="100%" />
        <use
           xlink:href="#glyph3-21"
           x="344.15164"
           y="137.255"
           id="use412"
           width="100%"
           height="100%" />
        <use
           xlink:href="#glyph3-9"
           x="355.07166"
           y="137.255"
           id="use416"
           width="100%"
           height="100%" />
        <use
           xlink:href="#glyph3-10"
           x="359.75165"
           y="137.255"
           id="use418"
           width="100%"
           height="100%" />
        <use
           xlink:href="#glyph3-11"
           x="368.72763"
           y="137.255"
           id="use420"
           width="100%"
           height="100%" />
        <use
           xlink:href="#glyph3-3"
           x="376.93564"
           y="137.255"
           id="use422"
           width="100%"
           height="100%" />
        <use
           xlink:href="#glyph3-12"
           x="389.09164"
           y="137.255"
           id="use426"
           width="100%"
           height="100%" />
        <use
           xlink:href="#glyph3-13"
           x="402.96365"
           y="137.255"
           id="use430"
           width="100%"
           height="100%" />
        <use
           xlink:href="#glyph3-14"
           x="410.59564"
           y="137.255"
           id="use432"
           width="100%"
           height="100%" />
        <use
           xlink:href="#glyph3-17"
           x="414.41165"
           y="137.255"
           id="use434"
           width="100%"
           height="100%" />
      </g>
    </g>
    <g
       id="g1394"
       transform="translate(-0.18504833)">
      <path
         style="fill:none;stroke:#3da34c;stroke-width:3;stroke-linecap:square;stroke-linejoin:round;stroke-miterlimit:10;stroke-opacity:1"
         d="m 253.92187,137.32031 h 24"
         transform="matrix(1,0,0,-1,0,288)"
         id="path438" />
      <g
         style="fill:#000000;fill-opacity:1"
         id="g474">
        <use
           xlink:href="#glyph3-22"
           x="287.52365"
           y="154.88"
           id="use440"
           width="100%"
           height="100%" />
        <use
           xlink:href="#glyph3-2"
           x="296.54764"
           y="154.88"
           id="use442"
           width="100%"
           height="100%" />
        <use
           xlink:href="#glyph3-23"
           x="304.15564"
           y="154.88"
           id="use444"
           width="100%"
           height="100%" />
        <use
           xlink:href="#glyph3-24"
           x="315.84366"
           y="154.88"
           id="use446"
           width="100%"
           height="100%" />
        <use
           xlink:href="#glyph3-20"
           x="323.19965"
           y="154.88"
           id="use448"
           width="100%"
           height="100%" />
        <use
           xlink:href="#glyph3-8"
           x="330.80765"
           y="154.88"
           id="use450"
           width="100%"
           height="100%" />
        <use
           xlink:href="#glyph3-9"
           x="334.62366"
           y="154.88"
           id="use452"
           width="100%"
           height="100%" />
        <use
           xlink:href="#glyph3-10"
           x="339.30365"
           y="154.88"
           id="use454"
           width="100%"
           height="100%" />
        <use
           xlink:href="#glyph3-11"
           x="348.27963"
           y="154.88"
           id="use456"
           width="100%"
           height="100%" />
        <use
           xlink:href="#glyph3-3"
           x="356.48764"
           y="154.88"
           id="use458"
           width="100%"
           height="100%" />
        <use
           xlink:href="#glyph3-8"
           x="364.82764"
           y="154.88"
           id="use460"
           width="100%"
           height="100%" />
        <use
           xlink:href="#glyph3-12"
           x="368.64365"
           y="154.88"
           id="use462"
           width="100%"
           height="100%" />
        <use
           xlink:href="#glyph3-8"
           x="378.69965"
           y="154.88"
           id="use464"
           width="100%"
           height="100%" />
        <use
           xlink:href="#glyph3-25"
           x="382.51566"
           y="154.88"
           id="use466"
           width="100%"
           height="100%" />
        <use
           xlink:href="#glyph3-14"
           x="390.14764"
           y="154.88"
           id="use468"
           width="100%"
           height="100%" />
        <use
           xlink:href="#glyph3-26"
           x="393.96365"
           y="154.88"
           id="use470"
           width="100%"
           height="100%" />
        <use
           xlink:href="#glyph3-17"
           x="401.59564"
           y="154.88"
           id="use472"
           width="100%"
           height="100%" />
      </g>
    </g>
    <g
       id="g3986"
       transform="translate(-244.01497,-18.248169)">
      <g
         id="g3181"
         transform="rotate(90,355.68372,97.224199)">
        <path
           style="fill:none;stroke:#000000;stroke-width:1.90563;stroke-linecap:butt;stroke-linejoin:miter;stroke-miterlimit:4;stroke-opacity:1"
           d="M 314.0909,116.52115 351.31926,97.224198"
           id="path198" />
        <path
           style="fill:#ffffff;fill-opacity:1;fill-rule:nonzero;stroke:#000000;stroke-width:1.90563;stroke-linecap:butt;stroke-linejoin:miter;stroke-miterlimit:4;stroke-opacity:1"
           d="m 320.05724,105.12943 c 5.08837,0 9.21299,4.12549 9.21299,9.21299 0,5.08837 -4.12462,9.21299 -9.21299,9.21299 -5.0875,0 -9.21212,-4.12462 -9.21212,-9.21299 0,-5.0875 4.12462,-9.21299 9.21212,-9.21299"
           id="path200" />
        <path
           style="fill:none;stroke:#000000;stroke-width:0.867061;stroke-linecap:round;stroke-linejoin:round;stroke-miterlimit:4;stroke-opacity:1"
           d="m 372.20583,97.224198 h 28.3165"
           id="path202-5" />
        <path
           style="fill:none;stroke:#000000;stroke-width:0.485935;stroke-linecap:round;stroke-linejoin:miter;stroke-miterlimit:4;stroke-opacity:1"
           d="m 378.13541,97.288098 -0.0149,-6.47317"
           id="path204" />
        <path
           style="fill:none;stroke:#000000;stroke-width:0.485935;stroke-linecap:round;stroke-linejoin:miter;stroke-miterlimit:4;stroke-opacity:1"
           d="m 388.82774,97.288098 -0.0149,-6.47317"
           id="path206" />
        <path
           style="fill:none;stroke:#000000;stroke-width:0.485935;stroke-linecap:round;stroke-linejoin:miter;stroke-miterlimit:4;stroke-opacity:1"
           d="m 391.84942,97.288098 -0.0157,-6.47317"
           id="path208-3" />
        <path
           style="fill:none;stroke:#000000;stroke-width:0.485935;stroke-linecap:round;stroke-linejoin:miter;stroke-miterlimit:4;stroke-opacity:1"
           d="m 398.0311,97.288098 -0.0158,-6.47317"
           id="path210" />
        <path
           style="fill:#ffffff;fill-opacity:1;fill-rule:nonzero;stroke:#000000;stroke-width:1.90563;stroke-linecap:butt;stroke-linejoin:round;stroke-miterlimit:4;stroke-opacity:1"
           d="m 350.89297,97.304728 21.95974,-12.62333 -0.0481,25.328942 z m 0,0"
           id="path216" />
        <path
           style="fill:none;stroke:#000000;stroke-width:1.90563;stroke-linecap:butt;stroke-linejoin:miter;stroke-miterlimit:4;stroke-opacity:1"
           d="m 314.02327,78.29593 37.22836,19.29695"
           id="path198-3" />
        <path
           style="fill:#ffffff;fill-opacity:1;fill-rule:nonzero;stroke:#000000;stroke-width:1.90563;stroke-linecap:butt;stroke-linejoin:miter;stroke-miterlimit:4;stroke-opacity:1"
           d="m 319.98961,89.68765 c 5.08837,0 9.21299,-4.12549 9.21299,-9.21299 0,-5.08837 -4.12462,-9.21299 -9.21299,-9.21299 -5.0875,0 -9.21212,4.12462 -9.21212,9.21299 0,5.0875 4.12462,9.21299 9.21212,9.21299"
           id="path200-5" />
      </g>
      <path
         style="fill:#ffffff;stroke:#000000;stroke-width:1.5;stroke-linecap:butt;stroke-linejoin:miter;stroke-miterlimit:4;stroke-dasharray:none;stroke-opacity:1"
         d="m 355.66524,106.64937 37.7916,-26.58641 6.71058,12.572019 z"
         id="path1810"
         sodipodi:nodetypes="cccc" />
    </g>
    <path
       style="fill:none;stroke:#000000;stroke-width:0.75px;stroke-linecap:butt;stroke-linejoin:miter;stroke-opacity:1"
       d="m 152.88954,66.483934 c 0,0 34.12888,-4.253747 34.77673,-17.164883 0.60653,-12.087669 -31.10869,-7.150031 -30.78648,-19.248618 0.31966,-12.002878 22.63075,-17.313892 22.63075,-17.313892"
       id="path1814"
       sodipodi:nodetypes="cssc" />
    <path
       style="fill:#000000;stroke:#000000;stroke-width:1.275;stroke-linecap:butt;stroke-linejoin:miter;stroke-miterlimit:4;stroke-dasharray:none;stroke-opacity:1"
       d="m 84.797721,42.565309 18.898829,-0.04187 c 0,0 -0.23454,-8.505517 -8.758225,-8.53182 -9.395007,0.0643 -9.265504,8.638517 -9.265504,8.638517 z"
       id="path1816"
       sodipodi:nodetypes="ccccc" />
    <path
       style="fill:none;stroke:#000000;stroke-width:1.275;stroke-linecap:butt;stroke-linejoin:miter;stroke-miterlimit:4;stroke-dasharray:none;stroke-opacity:1"
       d="m 94.405064,34.189118 0,-27.5534744"
       id="path1818"
       sodipodi:nodetypes="cc" />
    <path
       style="fill:#000000;stroke-width:0.0598698"
       d="m 197.38474,32.700099 v -1.13753 h 3.1731 3.17311 v 1.13753 1.13753 h -3.17311 -3.1731 z m -4.13102,-4.49048 v -1.13777 l 7.25922,0.0152 7.25922,0.0152 0.0163,1.12256 0.0163,1.12256 h -7.27551 -7.27551 z m -3.53232,-4.54971 v -1.13768 h 4.84946 4.84945 v -4.90933 -4.90933 h 1.13753 1.13753 v 4.90933 4.90933 h 4.84946 4.84946 l 0.007,1.01778 c 0.004,0.55979 0.0109,1.06494 0.015,1.12256 0.007,0.0994 -0.55166,0.10555 -10.84393,0.11991 l -10.85141,0.0151 z"
       id="path1840"
       sodipodi:nodetypes="ccccccccccccccccccccccccccccccccscc" />
    <g
       style="fill:#000000;fill-opacity:1"
       id="g352-6"
       transform="translate(-263.08078,-82.162804)">
      <use
         xlink:href="#glyph3-0"
         x="318.72363"
         y="102.005"
         id="use342-2"
         width="100%"
         height="100%" />
      <use
         xlink:href="#glyph3-1"
         x="328.02365"
         y="102.005"
         id="use344-9"
         width="100%"
         height="100%" />
      <use
         xlink:href="#glyph3-2"
         x="331.35965"
         y="102.005"
         id="use346-1"
         width="100%"
         height="100%" />
      <use
         xlink:href="#glyph3-3"
         x="338.96765"
         y="102.005"
         id="use348-2"
         width="100%"
         height="100%" />
      <use
         xlink:href="#glyph3-4"
         x="347.30765"
         y="102.005"
         id="use350-7"
         width="100%"
         height="100%" />
    </g>
    <path
       style="fill:none;stroke:#000000;stroke-width:1.125;stroke-linecap:butt;stroke-linejoin:miter;stroke-miterlimit:4;stroke-dasharray:none;stroke-opacity:1;marker-start:url(#Arrow2Mstart);marker-end:url(#marker2338)"
       d="m 118.75109,159.45653 v 33.90276"
       id="path1872"
       sodipodi:nodetypes="cc" />
    <text
       xml:space="preserve"
       style="font-size:18px;line-height:0;font-family:sans-serif;letter-spacing:0px;word-spacing:0px;stroke-width:0.75"
       x="70.977226"
       y="174.15196"
       id="text2456"><tspan
         sodipodi:role="line"
         id="tspan2454"
         x="70.977226"
         y="174.15196"
         style="font-size:13px;line-height:1;stroke-width:0.75">NMDA</tspan><tspan
         sodipodi:role="line"
         x="70.977226"
         y="187.15196"
         style="font-size:13px;line-height:1;stroke-width:0.75"
         id="tspan2458">spike</tspan></text>
    <path
       style="fill:none;stroke:#000000;stroke-width:1.125;stroke-linecap:butt;stroke-linejoin:miter;stroke-miterlimit:4;stroke-dasharray:none;stroke-opacity:1;marker-start:url(#Arrow2Mstart-2);marker-end:url(#marker2338-1)"
       d="m 232.70009,27.490867 0,79.894383"
       id="path1872-7"
       sodipodi:nodetypes="cc" />
    <text
       xml:space="preserve"
       style="font-size:18px;line-height:0;font-family:sans-serif;letter-spacing:0px;word-spacing:0px;stroke-width:0.75"
       x="243.362"
       y="61.370659"
       id="text2456-9"><tspan
         sodipodi:role="line"
         x="243.362"
         y="61.370659"
         style="font-size:13px;line-height:1;stroke-width:0.75"
         id="tspan2458-0">Soma Na spike</tspan></text>
    <text
       xml:space="preserve"
       style="font-size:7px;line-height:0.4;font-family:sans-serif;letter-spacing:0px;word-spacing:0px;stroke-width:0.75"
       x="298.61096"
       y="53.275841"
       id="text2662"><tspan
         sodipodi:role="line"
         id="tspan2660"
         x="298.61096"
         y="53.275841"
         style="font-size:7px;stroke-width:0.75">+</tspan></text>
    <path
       style="fill:#3da34c;fill-opacity:1;stroke:#3da34c;stroke-width:3;stroke-linecap:butt;stroke-linejoin:miter;stroke-miterlimit:4;stroke-dasharray:3,3;stroke-opacity:1;stroke-dashoffset:0"
       d="M 219.22656,9.7578098 419.52835,9.4340754"
       id="path2688"
       sodipodi:nodetypes="cc" />
    <g
       id="g2718"
       transform="translate(-0.50625415,-0.04277761)">
      <path
         style="fill:none;stroke:#000000;stroke-width:0.485935;stroke-linecap:round;stroke-linejoin:miter;stroke-miterlimit:4;stroke-opacity:1"
         d="m 95.787599,9.3854407 6.473171,-0.0149"
         id="path204-2" />
      <path
         style="fill:none;stroke:#000000;stroke-width:0.485935;stroke-linecap:round;stroke-linejoin:miter;stroke-miterlimit:4;stroke-opacity:1"
         d="m 95.787599,20.07777 6.473171,-0.0149"
         id="path206-3" />
      <path
         style="fill:none;stroke:#000000;stroke-width:0.485935;stroke-linecap:round;stroke-linejoin:miter;stroke-miterlimit:4;stroke-opacity:1"
         d="m 95.787599,23.09945 6.473171,-0.0157"
         id="path208-3-7" />
      <path
         style="fill:none;stroke:#000000;stroke-width:0.485935;stroke-linecap:round;stroke-linejoin:miter;stroke-miterlimit:4;stroke-opacity:1"
         d="m 95.787599,29.28113 6.473171,-0.0158"
         id="path210-5" />
    </g>
  </g>
</svg>
