 ;convolution file, from 5250_mhd_5lines_profs.fits
 ;simulates a Fabry-Perot measurement at 617.3 nm 
 ;Contains only FP
 ;WL(A)       Intensity 
    5248.808000   7.915454e-07
    5248.818000   7.585042e-07
    5248.828000   7.278158e-07
    5248.838000   6.986626e-07
    5248.848000   6.720608e-07
    5248.858000   6.472890e-07
    5248.868000   6.248840e-07
    5248.878000   6.046502e-07
    5248.888000   5.860832e-07
    5248.898000   5.700209e-07
    5248.908000   5.562216e-07
    5248.918000   5.444851e-07
    5248.928000   5.341438e-07
    5248.938000   5.252421e-07
    5248.948000   5.178922e-07
    5248.958000   5.118948e-07
    5248.968000   5.077537e-07
    5248.978000   5.044931e-07
    5248.988000   5.026901e-07
    5248.998000   5.023070e-07
    5249.008000   5.034550e-07
    5249.018000   5.062344e-07
    5249.028000   5.100759e-07
    5249.038000   5.144480e-07
    5249.048000   5.186028e-07
    5249.058000   5.226895e-07
    5249.068000   5.266343e-07
    5249.078000   5.303633e-07
    5249.088000   5.339955e-07
    5249.098000   5.378996e-07
    5249.108000   5.423617e-07
    5249.118000   5.468328e-07
    5249.128000   5.511950e-07
    5249.138000   5.555297e-07
    5249.148000   5.600121e-07
    5249.158000   5.647915e-07
    5249.168000   5.704674e-07
    5249.178000   5.773677e-07
    5249.188000   5.857786e-07
    5249.198000   5.957664e-07
    5249.208000   6.074111e-07
    5249.218000   6.209072e-07
    5249.228000   6.359101e-07
    5249.238000   6.526601e-07
    5249.248000   6.712055e-07
    5249.258000   6.915926e-07
    5249.268000   7.137517e-07
    5249.278000   7.375979e-07
    5249.288000   7.632952e-07
    5249.298000   7.913129e-07
    5249.308000   8.215076e-07
    5249.318000   8.540395e-07
    5249.328000   8.888985e-07
    5249.338000   9.264078e-07
    5249.348000   9.674843e-07
    5249.358000   1.012688e-06
    5249.368000   1.061733e-06
    5249.378000   1.114222e-06
    5249.388000   1.170823e-06
    5249.398000   1.232378e-06
    5249.408000   1.299472e-06
    5249.418000   1.371974e-06
    5249.428000   1.450000e-06
    5249.438000   1.535267e-06
    5249.448000   1.628186e-06
    5249.458000   1.729382e-06
    5249.468000   1.839007e-06
    5249.478000   1.956410e-06
    5249.488000   2.083061e-06
    5249.498000   2.220824e-06
    5249.508000   2.371372e-06
    5249.518000   2.535456e-06
    5249.528000   2.714184e-06
    5249.538000   2.909431e-06
    5249.548000   3.123882e-06
    5249.558000   3.361404e-06
    5249.568000   3.621161e-06
    5249.578000   3.904979e-06
    5249.588000   4.215437e-06
    5249.598000   4.555881e-06
    5249.608000   4.929934e-06
    5249.618000   5.336970e-06
    5249.628000   5.778336e-06
    5249.638000   6.259882e-06
    5249.648000   6.788976e-06
    5249.658000   7.372284e-06
    5249.668000   8.015224e-06
    5249.678000   8.722754e-06
    5249.688000   9.497045e-06
    5249.698000   1.035216e-05
    5249.708000   1.129927e-05
    5249.718000   1.234960e-05
    5249.728000   1.351419e-05
    5249.738000   1.480533e-05
    5249.748000   1.625416e-05
    5249.758000   1.788381e-05
    5249.768000   1.971139e-05
    5249.778000   2.176401e-05
    5249.788000   2.407533e-05
    5249.798000   2.668648e-05
    5249.808000   2.964950e-05
    5249.818000   3.304198e-05
    5249.828000   3.691391e-05
    5249.838000   4.133604e-05
    5249.848000   4.640020e-05
    5249.858000   5.222587e-05
    5249.868000   5.896221e-05
    5249.878000   6.673761e-05
    5249.888000   7.573978e-05
    5249.898000   8.621731e-05
    5249.908000   9.843800e-05
    5249.918000   1.127697e-04
    5249.928000   1.297152e-04
    5249.938000   1.498916e-04
    5249.948000   1.739254e-04
    5249.958000   2.028619e-04
    5249.968000   2.379336e-04
    5249.978000   2.807220e-04
    5249.988000   3.332866e-04
    5249.998000   3.983554e-04
    5250.008000   4.796163e-04
    5250.018000   5.822809e-04
    5250.028000   7.134903e-04
    5250.038000   8.831101e-04
    5250.048000   1.104558e-03
    5250.058000   1.396517e-03
    5250.068000   1.786515e-03
    5250.078000   2.315778e-03
    5250.088000   3.045758e-03
    5250.098000   4.072366e-03
    5250.108000   5.544844e-03
    5250.118000   7.697747e-03
    5250.128000   1.090149e-02
    5250.138000   1.573883e-02
    5250.148000   2.309852e-02
    5250.158000   3.422670e-02
    5250.168000   5.052266e-02
    5250.178000   7.258242e-02
    5250.188000   9.798390e-02
    5250.198000   1.190657e-01
    5250.208000   1.255388e-01
    5250.218000   1.135494e-01
    5250.228000   8.998116e-02
    5250.238000   6.507220e-02
    5250.248000   4.476589e-02
    5250.258000   3.023086e-02
    5250.268000   2.044206e-02
    5250.278000   1.399414e-02
    5250.288000   9.750459e-03
    5250.298000   6.928417e-03
    5250.308000   5.019356e-03
    5250.318000   3.703004e-03
    5250.328000   2.781132e-03
    5250.338000   2.120910e-03
    5250.348000   1.642237e-03
    5250.358000   1.288844e-03
    5250.368000   1.023644e-03
    5250.378000   8.219800e-04
    5250.388000   6.671176e-04
    5250.398000   5.469608e-04
    5250.408000   4.524256e-04
    5250.418000   3.774559e-04
    5250.428000   3.174779e-04
    5250.438000   2.690747e-04
    5250.448000   2.296530e-04
    5250.458000   1.971884e-04
    5250.468000   1.701689e-04
    5250.478000   1.474931e-04
    5250.488000   1.284107e-04
    5250.498000   1.123512e-04
    5250.508000   9.882604e-05
    5250.518000   8.738601e-05
    5250.528000   7.760817e-05
    5250.538000   6.909353e-05
    5250.548000   6.156011e-05
    5250.558000   5.480163e-05
    5250.568000   4.869295e-05
    5250.578000   4.316608e-05
    5250.588000   3.818012e-05
    5250.598000   3.377388e-05
    5250.608000   2.997637e-05
    5250.618000   2.673893e-05
    5250.628000   2.396539e-05
    5250.638000   2.155358e-05
    5250.648000   1.941949e-05
    5250.658000   1.750063e-05
    5250.668000   1.580808e-05
    5250.678000   1.433010e-05
    5250.688000   1.306246e-05
    5250.698000   1.198778e-05
    5250.708000   1.107985e-05
    5250.718000   1.031703e-05
    5250.728000   9.645880e-06
    5250.738000   9.015249e-06
    5250.748000   8.402019e-06
    5250.758000   7.802808e-06
    5250.768000   7.224838e-06
    5250.778000   6.678608e-06
    5250.788000   6.171403e-06
    5250.798000   5.703892e-06
    5250.808000   5.280044e-06
    5250.818000   4.895680e-06
    5250.828000   4.545850e-06
    5250.838000   4.226093e-06
    5250.848000   3.932233e-06
    5250.858000   3.663126e-06
    5250.868000   3.414753e-06
    5250.878000   3.185960e-06
    5250.888000   2.975268e-06
    5250.898000   2.780422e-06
    5250.908000   2.598739e-06
    5250.918000   2.431035e-06
    5250.928000   2.277380e-06
    5250.938000   2.134645e-06
    5250.948000   2.002160e-06
    5250.958000   1.879696e-06
    5250.968000   1.766974e-06
    5250.978000   1.663448e-06
    5250.988000   1.568679e-06
    5250.998000   1.481861e-06
    5251.008000   1.401764e-06
    5251.018000   1.327717e-06
    5251.028000   1.259327e-06
    5251.038000   1.196212e-06
    5251.048000   1.137961e-06
    5251.058000   1.084052e-06
    5251.068000   1.034228e-06
    5251.078000   9.881498e-07
    5251.088000   9.456092e-07
    5251.098000   9.063475e-07
    5251.108000   8.695858e-07
    5251.118000   8.345960e-07
    5251.128000   8.011166e-07
    5251.138000   7.691662e-07
    5251.148000   7.386124e-07
    5251.158000   7.094018e-07
    5251.168000   6.816694e-07
    5251.178000   6.554752e-07
    5251.188000   6.305735e-07
    5251.198000   6.070085e-07
    5251.208000   5.850038e-07
    5251.218000   5.645238e-07
    5251.228000   5.453512e-07
    5251.238000   5.274371e-07
    5251.248000   5.115539e-07
    5251.258000   4.972276e-07
    5251.268000   4.844028e-07
    5251.278000   4.729521e-07
    5251.288000   4.626960e-07
    5251.298000   4.534252e-07
    5251.308000   4.449453e-07
    5251.318000   4.373925e-07
    5251.328000   4.305445e-07
    5251.338000   4.242909e-07
    5251.348000   4.186076e-07
    5251.358000   4.135999e-07
    5251.368000   4.095638e-07
    5251.378000   4.061810e-07
    5251.388000   4.034808e-07
    5251.398000   4.012447e-07
    5251.408000   3.993754e-07
    5251.418000   3.978716e-07
    5251.428000   3.967963e-07
    5251.438000   3.963560e-07
    5251.448000   3.963394e-07
    5251.458000   3.969520e-07
    5251.468000   3.983297e-07
    5251.478000   4.005900e-07
    5251.488000   4.038097e-07
    5251.498000   4.079604e-07
    5251.508000   4.134042e-07
    5251.518000   4.193083e-07
    5251.528000   4.260662e-07
    5251.538000   4.338460e-07
    5251.548000   4.425481e-07
    5251.558000   4.519052e-07
    5251.568000   4.623186e-07
    5251.578000   4.736054e-07
    5251.588000   4.855639e-07
    5251.598000   4.981569e-07
    5251.608000   5.113869e-07
    5251.618000   5.253061e-07
    5251.628000   5.400802e-07
    5251.638000   5.554313e-07
    5251.648000   5.728873e-07
    5251.658000   5.922341e-07
    5251.668000   6.136651e-07
    5251.678000   6.375905e-07
    5251.688000   6.643992e-07
    5251.698000   6.945599e-07
    5251.708000   7.288594e-07
    5251.718000   7.678302e-07
    5251.728000   8.115038e-07
    5251.738000   8.607999e-07
    5251.748000   9.172969e-07
    5251.758000   9.812556e-07
    5251.768000   1.054163e-06
    5251.778000   1.135542e-06
    5251.788000   1.228533e-06
    5251.798000   1.335243e-06
