%!PS-Adobe-3.0
%%BoundingBox: 42 52 552 789
%%Title: Graphics produced by IDL
%%For: lagg@lagg-sxm2, /disk1/home/lagg/work/polarimeter/linefit
%%Creator: IDL Version 6.0 (linux x86 m32)
%%CreationDate: Tue Aug 10 11:48:10 2004
%%DocumentData: Clean7bit
%%Requirements: color
%%LanguageLevel: 1
%%PageOrder: Ascend
%%Pages: (atend)
%%DocumentNeededResources: (atend)
%%EndComments
%%BeginProlog
save
%+ prolog.ps -- Prolog for IDL generated PostScript files
%+ Copyright (c) 1988-2003 Research Systems, Inc. All Rights Reserved.
%v 4
/$IDL_DICT 40 dict def $IDL_DICT begin /bdef { bind def } bind def /C
{currentpoint newpath moveto} bdef /CP {currentpoint} bdef /D {currentpoint
stroke moveto} bdef /F {closepath fill} bdef /K { setgray } bdef /M {moveto}
bdef /N {rmoveto} bdef /P {lineto} bdef /R {rlineto} bdef /S {gsave show
grestore} bdef /X {currentpoint pop} bdef /Z {gsave currentpoint lineto 20
setlinewidth 1 setlinecap stroke grestore} bdef /L0 {[] 0 setdash} bdef /L1
{[40 100] 0 setdash} bdef /L2 {[200 200] 0 setdash} bdef /L3 {[200 100 50
100] 0 setdash} bdef /L4 {[300 100 50 100 50 100 50 100] 0 setdash} bdef /L5
{[400 200] 0 setdash} bdef /STDFONT { findfont exch scalefont setfont } bdef
/ISOFONT { findfont dup length dict begin { 1 index /FID ne {def} {pop pop}
ifelse } forall /Encoding ISOLatin1Encoding def currentdict end /idltmpfont
exch definefont exch scalefont setfont } bdef /ISOBULLET { gsave /Helvetica
findfont exch scalefont setfont (\267) show currentpoint grestore moveto}
bdef end 2.5 setmiterlimit
%%EndProlog
%%Page: 0 1
%%PageRequirements: color
%%PageResources: (atend)
%%PageOrientation: Portrait
%%PageBoundingBox: 42 52 552 789
%%BeginPageSetup
save
$IDL_DICT begin 42 52 translate 0.0283465 dup scale
%%IncludeResource: font Helvetica
423.333 /Helvetica ISOFONT
%%EndPageSetup
0.000 0.000 0.000 setrgbcolor gsave 2700 25188 translate 0 0 M 1.2 dup scale
(bfree_1x1_noff_nostray_v01) show grestore gsave 9450 5728 translate 0 0 M
1.2 dup scale -1435.31 0 N
(Wavelength [\305]) show grestore gsave 666 15986 translate 0 0 M 90 rotate
1.2 dup scale -0 0 N grestore gsave 1088 15986 translate 0 0 M 90 rotate
1.2 dup scale -0 0 N grestore gsave 1511 15986 translate 0 0 M 90 rotate
1.2 dup scale -0 0 N grestore 15 setlinewidth L0 2808 20694 M 13284 0 R D
4223 20694 M 0 422 R D gsave 4223 20060 translate 0 0 M 1.2 dup scale
-58.8433 0 N
( ) show grestore 7720 20694 M 0 422 R D gsave 7720 20060 translate 0 0 M
1.2 dup scale -58.8433 0 N
( ) show grestore 11216 20694 M 0 422 R D gsave 11216 20060 translate 0 0 M
1.2 dup scale -58.8433 0 N
( ) show grestore 14713 20694 M 0 422 R D gsave 14713 20060 translate 0 0 M
1.2 dup scale -58.8433 0 N
( ) show grestore 5972 20694 M 0 211 R D 9468 20694 M 0 211 R D
12964 20694 M 0 211 R D gsave 9450 19511 translate 0 0 M 1.2 dup scale
-58.8433 0 N
( ) show grestore 2808 25079 M 13284 0 R D 4223 25079 M 0 -422 R D
7720 25079 M 0 -422 R D 11216 25079 M 0 -422 R D 14713 25079 M 0 -422 R D
5972 25079 M 0 -211 R D 9468 25079 M 0 -211 R D 12964 25079 M 0 -211 R D
2808 20694 M 0 4385 R D 2808 20856 M Z gsave 2675 20694 translate 0 0 M
1.2 dup scale -588.433 0 N
(0.4) show grestore 2808 22090 M Z gsave 2675 21921 translate 0 0 M
1.2 dup scale -588.433 0 N
(0.6) show grestore 2808 23325 M Z gsave 2675 23156 translate 0 0 M
1.2 dup scale -588.433 0 N
(0.8) show grestore 2808 24560 M Z gsave 2675 24391 translate 0 0 M
1.2 dup scale -588.433 0 N
(1.0) show grestore gsave 1569 22886 translate 0 0 M 90 rotate 1.2 dup scale
-58.8433 0 N
(I) show grestore 16092 20694 M 0 4385 R D 16092 20856 M Z 16092 22090 M Z
16092 23325 M Z 16092 24560 M Z 2808 16093 M 13284 0 R D 4223 16093 M
0 422 R D gsave 4223 15459 translate 0 0 M 1.2 dup scale -58.8433 0 N
( ) show grestore 7720 16093 M 0 422 R D gsave 7720 15459 translate 0 0 M
1.2 dup scale -58.8433 0 N
( ) show grestore 11216 16093 M 0 422 R D gsave 11216 15459 translate 0 0 M
1.2 dup scale -58.8433 0 N
( ) show grestore 14713 16093 M 0 422 R D gsave 14713 15459 translate 0 0 M
1.2 dup scale -58.8433 0 N
( ) show grestore 5972 16093 M 0 211 R D 9468 16093 M 0 211 R D
12964 16093 M 0 211 R D gsave 9450 14910 translate 0 0 M 1.2 dup scale
-58.8433 0 N
( ) show grestore 2808 20478 M 13284 0 R D 4223 20478 M 0 -422 R D
7720 20478 M 0 -422 R D 11216 20478 M 0 -422 R D 14713 20478 M 0 -422 R D
5972 20478 M 0 -211 R D 9468 20478 M 0 -211 R D 12964 20478 M 0 -211 R D
2808 16093 M 0 4385 R D 2808 17158 M Z gsave 2675 16989 translate 0 0 M
1.2 dup scale -1306.41 0 N
(-0.002) show grestore 2808 18285 M Z gsave 2675 18117 translate 0 0 M
1.2 dup scale -1059.18 0 N
(0.000) show grestore 2808 19413 M Z gsave 2675 19244 translate 0 0 M
1.2 dup scale -1059.18 0 N
(0.002) show grestore 2808 16594 M Z 2808 17722 M Z 2808 18849 M Z
2808 19977 M Z gsave 708 18285 translate 0 0 M 90 rotate 1.2 dup scale
-377.114 0 N
(Q/I) show X -202.102 M
%%IncludeResource: font Helvetica
262.467 /Helvetica ISOFONT
(C) show grestore
%%IncludeResource: font Helvetica
423.333 /Helvetica ISOFONT 16092 16093 M 0 4385 R D 16092 17158 M Z
16092 18285 M Z 16092 19413 M Z 16092 16594 M Z 16092 17722 M Z
16092 18849 M Z 16092 19977 M Z 2808 11492 M 13284 0 R D 4223 11492 M
0 422 R D gsave 4223 10858 translate 0 0 M 1.2 dup scale -58.8433 0 N
( ) show grestore 7720 11492 M 0 422 R D gsave 7720 10858 translate 0 0 M
1.2 dup scale -58.8433 0 N
( ) show grestore 11216 11492 M 0 422 R D gsave 11216 10858 translate 0 0 M
1.2 dup scale -58.8433 0 N
( ) show grestore 14713 11492 M 0 422 R D gsave 14713 10858 translate 0 0 M
1.2 dup scale -58.8433 0 N
( ) show grestore 5972 11492 M 0 211 R D 9468 11492 M 0 211 R D
12964 11492 M 0 211 R D gsave 9450 10309 translate 0 0 M 1.2 dup scale
-58.8433 0 N
( ) show grestore 2808 15877 M 13284 0 R D 4223 15877 M 0 -422 R D
7720 15877 M 0 -422 R D 11216 15877 M 0 -422 R D 14713 15877 M 0 -422 R D
5972 15877 M 0 -211 R D 9468 15877 M 0 -211 R D 12964 15877 M 0 -211 R D
2808 11492 M 0 4385 R D 2808 11602 M Z gsave 2675 11492 translate 0 0 M
1.2 dup scale -1306.41 0 N
(-0.003) show grestore 2808 12296 M Z gsave 2675 12127 translate 0 0 M
1.2 dup scale -1306.41 0 N
(-0.002) show grestore 2808 12990 M Z gsave 2675 12821 translate 0 0 M
1.2 dup scale -1306.41 0 N
(-0.001) show grestore 2808 13684 M Z gsave 2675 13516 translate 0 0 M
1.2 dup scale -1059.18 0 N
(0.000) show grestore 2808 14379 M Z gsave 2675 14210 translate 0 0 M
1.2 dup scale -1059.18 0 N
(0.001) show grestore 2808 15073 M Z gsave 2675 14904 translate 0 0 M
1.2 dup scale -1059.18 0 N
(0.002) show grestore 2808 15767 M Z gsave 2675 15581 translate 0 0 M
1.2 dup scale -1059.18 0 N
(0.003) show grestore gsave 708 13684 translate 0 0 M 90 rotate
1.2 dup scale -365.26 0 N
(U/I) show X -202.102 M
%%IncludeResource: font Helvetica
262.467 /Helvetica ISOFONT
(C) show grestore
%%IncludeResource: font Helvetica
423.333 /Helvetica ISOFONT 16092 11492 M 0 4385 R D 16092 11602 M Z
16092 12296 M Z 16092 12990 M Z 16092 13684 M Z 16092 14379 M Z
16092 15073 M Z 16092 15767 M Z 2808 6892 M 13284 0 R D 4223 6892 M 0 422 R
D gsave 4223 6258 translate 0 0 M 1.2 dup scale -588.433 0 N
(10826) show grestore 7720 6892 M 0 422 R D gsave 7720 6258 translate 0 0 M
1.2 dup scale -588.433 0 N
(10828) show grestore 11216 6892 M 0 422 R D
gsave 11216 6258 translate 0 0 M 1.2 dup scale -588.433 0 N
(10830) show grestore 14713 6892 M 0 422 R D
gsave 14713 6258 translate 0 0 M 1.2 dup scale -588.433 0 N
(10832) show grestore 5972 6892 M 0 211 R D 9468 6892 M 0 211 R D
12964 6892 M 0 211 R D 2808 11276 M 13284 0 R D 4223 11276 M 0 -422 R D
7720 11276 M 0 -422 R D 11216 11276 M 0 -422 R D 14713 11276 M 0 -422 R D
5972 11276 M 0 -211 R D 9468 11276 M 0 -211 R D 12964 11276 M 0 -211 R D
2808 6892 M 0 4384 R D 2808 7972 M Z gsave 2675 7803 translate 0 0 M
1.2 dup scale -1071.03 0 N
(-0.01) show grestore 2808 9084 M Z gsave 2675 8915 translate 0 0 M
1.2 dup scale -823.807 0 N
(0.00) show grestore 2808 10196 M Z gsave 2675 10027 translate 0 0 M
1.2 dup scale -823.807 0 N
(0.01) show grestore 2808 7416 M Z 2808 8528 M Z 2808 9640 M Z 2808 10752 M
Z gsave 990 9084 translate 0 0 M 90 rotate 1.2 dup scale -353.619 0 N
(V/I) show X -202.102 M
%%IncludeResource: font Helvetica
262.467 /Helvetica ISOFONT
(C) show grestore
%%IncludeResource: font Helvetica
423.333 /Helvetica ISOFONT 16092 6892 M 0 4384 R D 16092 7972 M Z
16092 9084 M Z 16092 10196 M Z 16092 7416 M Z 16092 8528 M Z 16092 9640 M Z
16092 10752 M Z 20 setlinewidth 2808 24612 M 55 -66 R 54 7 R 55 34 R
54 -36 R 55 -31 R 54 0 R 54 -17 R 55 16 R 54 -7 R 55 5 R 54 -25 R 55 0 R
54 -36 R 55 23 R 54 -59 R 54 -7 R 55 -31 R 54 0 R 55 -14 R 54 3 R 55 0 R
54 0 R 54 -11 R 55 0 R 54 -37 R 55 -27 R 54 -4 R 55 0 R 54 4 R 55 14 R
54 -68 R 54 -58 R 55 -4 R 54 4 R 55 -32 R 54 -30 R 55 0 R 54 -91 R 54 -44 R
55 -26 R 54 -37 R 55 -24 R 54 -116 R 55 -55 R 54 -36 R 54 -46 R 55 -59 R
54 -76 R 55 -92 R 54 -64 R 55 -111 R 54 -110 R 55 -201 R 54 -132 R 54 -321 R
55 -192 R 54 -273 R 55 -329 R 54 -252 R 55 -180 R 54 -87 R 54 -66 R 55 -42 R
54 52 R 55 54 R 54 199 R 55 255 R 54 278 R 55 254 R 54 215 R 54 246 R
55 153 R 54 162 R 55 129 R 54 104 R 55 79 R 54 141 R 54 21 R 55 50 R 54 48 R
55 99 R 54 74 R 55 16 R 54 50 R 54 33 R 55 45 R 54 55 R 55 48 R 54 30 R
55 38 R 54 13 R 55 33 R 54 37 R 54 30 R 55 7 R 54 0 R 55 19 R 54 41 R
55 17 R 54 23 R 54 0 R 55 18 R 54 13 R 55 0 R 54 0 R 55 25 R 54 38 R 55 63 R
54 19 R 54 24 R 55 -24 R 54 24 R 55 0 R 54 5 R 55 -4 R 54 0 R 54 -11 R
55 -3 R 54 0 R 55 4 R 54 -30 R 55 -14 R 54 0 R 54 17 R 55 31 R 54 -13 R
55 -33 R 54 0 R 55 6 R 54 13 R 55 0 R 54 0 R 54 -13 R 55 12 R 54 2 R 55 15 R
54 -2 R 55 30 R 54 -17 R 54 -6 R 55 0 R 54 3 R 55 0 R 54 0 R 55 -10 R 54 6 R
55 0 R 54 11 R 54 0 R 55 -11 R 54 -28 R 55 -2 R 54 -20 R 55 -67 R 54 -94 R
54 -58 R 55 -89 R 54 -58 R 55 -90 R 54 -147 R 55 -78 R 54 -157 R 54 -42 R
55 -22 R 54 -74 R 55 -51 R 54 11 R 55 11 R 54 30 R 55 21 R 54 34 R 54 13 R
55 42 R 54 0 R 55 6 R 54 -11 R 55 0 R 54 -12 R 54 0 R 55 3 R 54 -5 R 55 0 R
54 15 R 55 15 R 54 19 R 55 50 R 54 57 R 54 49 R 55 85 R 54 135 R 55 77 R
54 61 R 55 97 R 54 117 R 54 53 R 55 57 R 54 48 R 55 30 R 54 74 R 55 0 R
54 -47 R 54 -10 R 55 -3 R 54 0 R 55 19 R 54 18 R 55 -18 R 54 -29 R 55 -46 R
54 -34 R 54 -70 R 55 -79 R 54 -127 R 55 -172 R 54 -262 R 55 -454 R 54 -711 R
54 -834 R 55 -170 R 54 0 R 55 712 R 54 705 R 55 512 R 54 287 R 55 234 R
54 192 R 54 114 R 55 58 R 54 71 R 55 46 R 54 67 R 55 21 R 54 20 R 54 24 R
55 70 R 54 47 R 55 61 R 54 -24 R 55 -69 R 54 -83 R 54 -61 R 55 -31 R 54 0 R
54 46 R D 15 setlinewidth 2808 20694 M 13284 0 R D 4223 20694 M 0 422 R D
gsave 4223 20060 translate 0 0 M 1.2 dup scale -58.8433 0 N
( ) show grestore 7720 20694 M 0 422 R D gsave 7720 20060 translate 0 0 M
1.2 dup scale -58.8433 0 N
( ) show grestore 11216 20694 M 0 422 R D gsave 11216 20060 translate 0 0 M
1.2 dup scale -58.8433 0 N
( ) show grestore 14713 20694 M 0 422 R D gsave 14713 20060 translate 0 0 M
1.2 dup scale -58.8433 0 N
( ) show grestore 5972 20694 M 0 211 R D 9468 20694 M 0 211 R D
12964 20694 M 0 211 R D gsave 9450 19511 translate 0 0 M 1.2 dup scale
-58.8433 0 N
( ) show grestore 2808 25079 M 13284 0 R D 4223 25079 M 0 -422 R D
7720 25079 M 0 -422 R D 11216 25079 M 0 -422 R D 14713 25079 M 0 -422 R D
5972 25079 M 0 -211 R D 9468 25079 M 0 -211 R D 12964 25079 M 0 -211 R D
2808 20694 M 0 4385 R D 2808 20856 M 422 0 R D
gsave 2675 20694 translate 0 0 M 1.2 dup scale -117.687 0 N
( ) show grestore 2808 22090 M 422 0 R D gsave 2675 21921 translate 0 0 M
1.2 dup scale -117.687 0 N
( ) show grestore 2808 23325 M 422 0 R D gsave 2675 23156 translate 0 0 M
1.2 dup scale -117.687 0 N
( ) show grestore 2808 24560 M 422 0 R D gsave 2675 24391 translate 0 0 M
1.2 dup scale -117.687 0 N
( ) show grestore gsave 2134 22886 translate 0 0 M 90 rotate 1.2 dup scale
-58.8433 0 N
( ) show grestore 16092 20694 M 0 4385 R D 16092 20856 M -422 0 R D
16092 22090 M -422 0 R D 16092 23325 M -422 0 R D 16092 24560 M -422 0 R D
2808 20694 M 13284 0 R D 4223 20694 M 0 422 R D
gsave 4223 20060 translate 0 0 M 1.2 dup scale -58.8433 0 N
( ) show grestore 7720 20694 M 0 422 R D gsave 7720 20060 translate 0 0 M
1.2 dup scale -58.8433 0 N
( ) show grestore 11216 20694 M 0 422 R D gsave 11216 20060 translate 0 0 M
1.2 dup scale -58.8433 0 N
( ) show grestore 14713 20694 M 0 422 R D gsave 14713 20060 translate 0 0 M
1.2 dup scale -58.8433 0 N
( ) show grestore 5972 20694 M 0 211 R D 9468 20694 M 0 211 R D
12964 20694 M 0 211 R D gsave 9450 19511 translate 0 0 M 1.2 dup scale
-58.8433 0 N
( ) show grestore 2808 25079 M 13284 0 R D 4223 25079 M 0 -422 R D
7720 25079 M 0 -422 R D 11216 25079 M 0 -422 R D 14713 25079 M 0 -422 R D
5972 25079 M 0 -211 R D 9468 25079 M 0 -211 R D 12964 25079 M 0 -211 R D
2808 20694 M 0 4385 R D 2808 20856 M 422 0 R D
gsave 2675 20694 translate 0 0 M 1.2 dup scale -117.687 0 N
( ) show grestore 2808 22090 M 422 0 R D gsave 2675 21921 translate 0 0 M
1.2 dup scale -117.687 0 N
( ) show grestore 2808 23325 M 422 0 R D gsave 2675 23156 translate 0 0 M
1.2 dup scale -117.687 0 N
( ) show grestore 2808 24560 M 422 0 R D gsave 2675 24391 translate 0 0 M
1.2 dup scale -117.687 0 N
( ) show grestore gsave 2134 22886 translate 0 0 M 90 rotate 1.2 dup scale
-58.8433 0 N
( ) show grestore 16092 20694 M 0 4385 R D 16092 20856 M -422 0 R D
16092 22090 M -422 0 R D 16092 23325 M -422 0 R D 16092 24560 M -422 0 R D
20 setlinewidth 1.000 0.000 0.000 setrgbcolor 2808 24558 M 55 0 R 54 0 R
55 -1 R 54 0 R 55 0 R 54 0 R 54 0 R 55 0 R 54 0 R 55 0 R 54 0 R 55 0 R
54 0 R 55 0 R 54 0 R 54 0 R 55 0 R 54 0 R 55 0 R 54 0 R 55 0 R 54 0 R 54 0 R
55 0 R 54 0 R 55 0 R 54 0 R 55 0 R 54 0 R 55 0 R 54 0 R 54 0 R 55 0 R 54 0 R
55 0 R 54 0 R 55 0 R 54 0 R 54 0 R 55 0 R 54 0 R 55 -1 R 54 0 R 55 0 R
54 0 R 54 0 R 55 0 R 54 0 R 55 0 R 54 0 R 55 0 R 54 0 R 55 0 R 54 0 R 54 0 R
55 0 R 54 0 R 55 0 R 54 0 R 55 0 R 54 -1 R 54 0 R 55 0 R 54 0 R 55 0 R
54 0 R 55 0 R 54 0 R 55 0 R 54 0 R 54 0 R 55 0 R 54 -1 R 55 0 R 54 0 R
55 0 R 54 0 R 54 0 R 55 0 R 54 0 R 55 -1 R 54 0 R 55 0 R 54 0 R 54 0 R
55 0 R 54 -1 R 55 0 R 54 0 R 55 0 R 54 -1 R 55 0 R 54 0 R 54 0 R 55 -1 R
54 0 R 55 0 R 54 -1 R 55 0 R 54 -1 R 54 0 R 55 -1 R 54 0 R 55 -1 R 54 -1 R
55 -1 R 54 -1 R 55 -2 R 54 -1 R 54 -2 R 55 -3 R 54 -3 R 55 -4 R 54 -6 R
55 -6 R 54 -8 R 54 -9 R 55 -11 R 54 -13 R 55 -14 R 54 -15 R 55 -16 R
54 -16 R 54 -14 R 55 -13 R 54 -11 R 55 -7 R 54 -5 R 55 -1 R 54 2 R 55 4 R
54 7 R 54 6 R 55 7 R 54 5 R 55 3 R 54 1 R 55 -1 R 54 -4 R 54 -6 R 55 -7 R
54 -8 R 55 -8 R 54 -6 R 55 -6 R 54 -4 R 55 -4 R 54 -3 R 54 -5 R 55 -7 R
54 -11 R 55 -18 R 54 -26 R 55 -35 R 54 -48 R 54 -59 R 55 -72 R 54 -82 R
55 -92 R 54 -98 R 55 -100 R 54 -97 R 54 -90 R 55 -77 R 54 -62 R 55 -42 R
54 -23 R 55 -2 R 54 15 R 55 31 R 54 40 R 54 46 R 55 45 R 54 41 R 55 30 R
54 18 R 55 6 R 54 -7 R 54 -15 R 55 -20 R 54 -20 R 55 -14 R 54 -4 R 55 10 R
54 25 R 55 42 R 54 57 R 54 70 R 55 81 R 54 86 R 55 89 R 54 87 R 55 82 R
54 74 R 54 65 R 55 55 R 54 46 R 55 37 R 54 29 R 55 23 R 54 18 R 54 14 R
55 11 R 54 8 R 55 7 R 54 6 R 55 5 R 54 4 R 55 3 R 54 3 R 54 2 R 55 3 R
54 2 R 55 1 R 54 2 R 55 1 R 54 2 R 54 1 R 55 1 R 54 1 R 55 1 R 54 1 R 55 1 R
54 0 R 55 1 R 54 1 R 54 0 R 55 1 R 54 0 R 55 1 R 54 0 R 55 1 R 54 0 R 54 0 R
55 1 R 54 0 R 55 0 R 54 1 R 55 0 R 54 0 R 54 1 R 55 0 R 54 0 R 54 0 R D
15 setlinewidth 0.000 0.000 0.000 setrgbcolor 2808 20694 M 13284 0 R D
4223 20694 M 0 422 R D gsave 4223 20060 translate 0 0 M 1.2 dup scale
-58.8433 0 N
( ) show grestore 7720 20694 M 0 422 R D gsave 7720 20060 translate 0 0 M
1.2 dup scale -58.8433 0 N
( ) show grestore 11216 20694 M 0 422 R D gsave 11216 20060 translate 0 0 M
1.2 dup scale -58.8433 0 N
( ) show grestore 14713 20694 M 0 422 R D gsave 14713 20060 translate 0 0 M
1.2 dup scale -58.8433 0 N
( ) show grestore 5972 20694 M 0 211 R D 9468 20694 M 0 211 R D
12964 20694 M 0 211 R D gsave 9450 19511 translate 0 0 M 1.2 dup scale
-58.8433 0 N
( ) show grestore 2808 25079 M 13284 0 R D 4223 25079 M 0 -422 R D
7720 25079 M 0 -422 R D 11216 25079 M 0 -422 R D 14713 25079 M 0 -422 R D
5972 25079 M 0 -211 R D 9468 25079 M 0 -211 R D 12964 25079 M 0 -211 R D
2808 20694 M 0 4385 R D 2808 20856 M 422 0 R D
gsave 2675 20694 translate 0 0 M 1.2 dup scale -117.687 0 N
( ) show grestore 2808 22090 M 422 0 R D gsave 2675 21921 translate 0 0 M
1.2 dup scale -117.687 0 N
( ) show grestore 2808 23325 M 422 0 R D gsave 2675 23156 translate 0 0 M
1.2 dup scale -117.687 0 N
( ) show grestore 2808 24560 M 422 0 R D gsave 2675 24391 translate 0 0 M
1.2 dup scale -117.687 0 N
( ) show grestore gsave 2134 22886 translate 0 0 M 90 rotate 1.2 dup scale
-58.8433 0 N
( ) show grestore 16092 20694 M 0 4385 R D 16092 20856 M -422 0 R D
16092 22090 M -422 0 R D 16092 23325 M -422 0 R D 16092 24560 M -422 0 R D
2808 20694 M 13284 0 R D 4223 20694 M 0 422 R D
gsave 4223 20060 translate 0 0 M 1.2 dup scale -58.8433 0 N
( ) show grestore 7720 20694 M 0 422 R D gsave 7720 20060 translate 0 0 M
1.2 dup scale -58.8433 0 N
( ) show grestore 11216 20694 M 0 422 R D gsave 11216 20060 translate 0 0 M
1.2 dup scale -58.8433 0 N
( ) show grestore 14713 20694 M 0 422 R D gsave 14713 20060 translate 0 0 M
1.2 dup scale -58.8433 0 N
( ) show grestore 5972 20694 M 0 211 R D 9468 20694 M 0 211 R D
12964 20694 M 0 211 R D gsave 9450 19511 translate 0 0 M 1.2 dup scale
-58.8433 0 N
( ) show grestore 2808 25079 M 13284 0 R D 4223 25079 M 0 -422 R D
7720 25079 M 0 -422 R D 11216 25079 M 0 -422 R D 14713 25079 M 0 -422 R D
5972 25079 M 0 -211 R D 9468 25079 M 0 -211 R D 12964 25079 M 0 -211 R D
2808 20694 M 0 4385 R D 2808 20856 M 422 0 R D
gsave 2675 20694 translate 0 0 M 1.2 dup scale -117.687 0 N
( ) show grestore 2808 22090 M 422 0 R D gsave 2675 21921 translate 0 0 M
1.2 dup scale -117.687 0 N
( ) show grestore 2808 23325 M 422 0 R D gsave 2675 23156 translate 0 0 M
1.2 dup scale -117.687 0 N
( ) show grestore 2808 24560 M 422 0 R D gsave 2675 24391 translate 0 0 M
1.2 dup scale -117.687 0 N
( ) show grestore gsave 2134 22886 translate 0 0 M 90 rotate 1.2 dup scale
-58.8433 0 N
( ) show grestore 16092 20694 M 0 4385 R D 16092 20856 M -422 0 R D
16092 22090 M -422 0 R D 16092 23325 M -422 0 R D 16092 24560 M -422 0 R D
10 setlinewidth L2 0.000 0.000 1.000 setrgbcolor 8579 20694 M 54 797 R
54 0 R 55 0 R 54 0 R 55 0 R 54 0 R 55 0 R 54 0 R 55 0 R 54 0 R 54 0 R 55 0 R
54 0 R 55 0 R 54 0 R 55 0 R 54 0 R 54 0 R 55 0 R 54 0 R 55 0 R 54 0 R 55 0 R
54 0 R 55 0 R 54 0 R 54 0 R 55 0 R 54 0 R 55 0 R 54 0 R 55 0 R 54 0 R 55 0 R
54 0 R 54 3189 R 55 0 R 54 0 R 55 0 R 54 0 R 55 0 R 54 0 R 55 0 R 54 0 R
54 0 R 55 0 R 54 0 R 55 0 R 54 0 R 55 0 R 54 0 R 55 0 R 54 0 R 54 0 R 55 0 R
54 0 R 55 0 R 54 0 R 55 0 R 54 0 R 55 0 R 54 0 R 54 0 R 55 0 R 54 0 R 55 0 R
54 0 R 55 0 R 54 0 R 55 0 R 54 0 R 54 0 R 55 0 R 54 0 R 55 0 R 54 0 R 55 0 R
54 0 R 55 0 R 54 0 R 54 0 R 55 0 R 54 0 R 55 0 R 54 0 R 55 0 R 54 0 R 55 0 R
54 0 R 54 0 R 55 0 R 54 0 R 55 0 R 54 0 R 55 0 R 54 0 R 55 0 R 54 0 R 54 0 R
55 -3986 R D L0 16452 20694 M 0 4385 R D 16452 20694 M -266 0 R D
gsave 16563 20694 translate 0 0 M
(0.0) show grestore 16452 21491 M -266 0 R D
gsave 16563 21350 translate 0 0 M
(0.2) show grestore 16452 22289 M -266 0 R D
gsave 16563 22148 translate 0 0 M
(0.4) show grestore 16452 23086 M -266 0 R D
gsave 16563 22945 translate 0 0 M
(0.6) show grestore 16452 23883 M -266 0 R D
gsave 16563 23742 translate 0 0 M
(0.8) show grestore 16452 24680 M -266 0 R D
gsave 16563 24540 translate 0 0 M
(1.0) show grestore 16452 20893 M -133 0 R D 16452 21093 M -133 0 R D
16452 21292 M -133 0 R D 16452 21691 M -133 0 R D 16452 21890 M -133 0 R D
16452 22089 M -133 0 R D 16452 22488 M -133 0 R D 16452 22687 M -133 0 R D
16452 22886 M -133 0 R D 16452 23285 M -133 0 R D 16452 23484 M -133 0 R D
16452 23684 M -133 0 R D 16452 24082 M -133 0 R D 16452 24282 M -133 0 R D
16452 24481 M -133 0 R D 16452 24880 M -133 0 R D 16452 25079 M -133 0 R D
gsave 17528 22886 translate 0 0 M 90 rotate -729.403 0 N
(weight I) show grestore L1 0.000 0.000 0.000 setrgbcolor 9627 20694 M
0 4384 R D 11653 20694 M 0 4384 R D 11810 20694 M 0 4384 R D 20 setlinewidth
L0 2808 18110 M 55 -2 R 54 178 R 55 529 R 54 3 R 55 -252 R 54 -714 R
54 280 R 55 -331 R 54 0 R 55 0 R 54 613 R 55 537 R 54 4 R 55 -875 R 54 -2 R
54 -52 R 55 312 R 54 104 R 55 628 R 54 -471 R 55 470 R 54 -679 R 54 26 R
55 629 R 54 4 R 55 -499 R 54 -953 R 55 530 R 54 79 R 55 317 R 54 -51 R
54 56 R 55 0 R 54 0 R 55 -378 R 54 -519 R 55 -136 R 54 126 R 54 106 R
55 362 R 54 -1 R 55 -1 R 54 199 R 55 0 R 54 -59 R 54 -1517 R 55 313 R
54 -141 R 37 -788 R D 6067 16094 M 8 3446 R 1 936 R D 6323 20476 M
10 -4382 R D 6959 16094 M 41 877 R 54 5 R 55 13 R 54 287 R 55 110 R
54 1136 R 55 -1180 R 54 447 R 54 -404 R 55 1275 R 54 -517 R 55 143 R 54 0 R
55 0 R 54 807 R 55 -586 R 54 -1 R 54 -686 R 55 1 R 54 328 R 55 109 R
54 271 R 55 431 R 54 -30 R 54 -430 R 55 -161 R 54 0 R 55 0 R 54 80 R 55 0 R
54 -1 R 55 77 R 54 390 R 54 -392 R 55 -181 R 54 -234 R 55 -26 R 54 26 R
55 545 R 54 415 R 54 -232 R 55 -390 R 54 -157 R 55 313 R 54 1 R 55 132 R
54 104 R 54 260 R 55 412 R 54 -49 R 55 320 R 54 -576 R 55 -446 R 54 -523 R
55 -418 R 54 1045 R 54 1 R 55 -1 R 54 -548 R 55 -417 R 54 156 R 55 1 R
54 857 R 54 -571 R 55 26 R 54 286 R 55 26 R 54 -26 R 55 -26 R 54 0 R
55 -182 R 54 -442 R 54 26 R 55 -469 R 54 -605 R 55 0 R 54 1045 R 55 553 R
54 -562 R 54 -902 R 55 -601 R 54 429 R 55 119 R 54 111 R 55 664 R 54 259 R
54 552 R 55 -307 R 54 62 R 55 -62 R 54 949 R 55 -1044 R 54 126 R 55 0 R
54 -373 R 54 -463 R 55 6 R 54 0 R 55 339 R 54 797 R 55 0 R 54 278 R
54 -277 R 55 646 R 54 1 R 55 216 R 54 -34 R 55 272 R 54 -1073 R 55 600 R
54 -10 R 54 435 R 55 -605 R 54 -360 R 55 -819 R 54 4 R 55 -20 R 54 88 R
54 -77 R 55 -415 R 54 -72 R 55 548 R 54 618 R 55 0 R 54 2 R 54 259 R
55 -439 R 54 0 R 55 205 R 54 0 R 55 -308 R 54 0 R 55 547 R 54 3 R 54 -683 R
55 -56 R 54 -4 R 55 1014 R 54 42 R 55 81 R 54 50 R 54 254 R 55 -944 R
54 -304 R 55 41 R 54 -41 R 55 31 R 54 -385 R 55 354 R 54 -137 R 54 538 R
55 288 R 54 -9 R 55 47 R 54 -882 R 55 1 R 54 51 R 54 -152 R 55 3 R 54 -198 R
55 598 R 54 100 R 55 379 R 54 -475 R 54 -50 R 55 1 R 54 155 R 54 123 R D
15 setlinewidth 2808 16093 M 13284 0 R D 4223 16093 M 0 422 R D
gsave 4223 15459 translate 0 0 M 1.2 dup scale -58.8433 0 N
( ) show grestore 7720 16093 M 0 422 R D gsave 7720 15459 translate 0 0 M
1.2 dup scale -58.8433 0 N
( ) show grestore 11216 16093 M 0 422 R D gsave 11216 15459 translate 0 0 M
1.2 dup scale -58.8433 0 N
( ) show grestore 14713 16093 M 0 422 R D gsave 14713 15459 translate 0 0 M
1.2 dup scale -58.8433 0 N
( ) show grestore 5972 16093 M 0 211 R D 9468 16093 M 0 211 R D
12964 16093 M 0 211 R D gsave 9450 14910 translate 0 0 M 1.2 dup scale
-58.8433 0 N
( ) show grestore 2808 20478 M 13284 0 R D 4223 20478 M 0 -422 R D
7720 20478 M 0 -422 R D 11216 20478 M 0 -422 R D 14713 20478 M 0 -422 R D
5972 20478 M 0 -211 R D 9468 20478 M 0 -211 R D 12964 20478 M 0 -211 R D
2808 16093 M 0 4385 R D 2808 17158 M 422 0 R D
gsave 2675 16989 translate 0 0 M 1.2 dup scale -117.687 0 N
( ) show grestore 2808 18285 M 422 0 R D gsave 2675 18117 translate 0 0 M
1.2 dup scale -117.687 0 N
( ) show grestore 2808 19413 M 422 0 R D gsave 2675 19244 translate 0 0 M
1.2 dup scale -117.687 0 N
( ) show grestore 2808 16594 M 211 0 R D 2808 17722 M 211 0 R D 2808 18849 M
211 0 R D 2808 19977 M 211 0 R D gsave 2134 18285 translate 0 0 M 90 rotate
1.2 dup scale -58.8433 0 N
( ) show grestore 16092 16093 M 0 4385 R D 16092 17158 M -422 0 R D
16092 18285 M -422 0 R D 16092 19413 M -422 0 R D 16092 16594 M -211 0 R D
16092 17722 M -211 0 R D 16092 18849 M -211 0 R D 16092 19977 M -211 0 R D
10 setlinewidth L1 2808 18285 M 13283 0 R D 15 setlinewidth L0 2808 16093 M
13284 0 R D 4223 16093 M 0 422 R D gsave 4223 15459 translate 0 0 M
1.2 dup scale -58.8433 0 N
( ) show grestore 7720 16093 M 0 422 R D gsave 7720 15459 translate 0 0 M
1.2 dup scale -58.8433 0 N
( ) show grestore 11216 16093 M 0 422 R D gsave 11216 15459 translate 0 0 M
1.2 dup scale -58.8433 0 N
( ) show grestore 14713 16093 M 0 422 R D gsave 14713 15459 translate 0 0 M
1.2 dup scale -58.8433 0 N
( ) show grestore 5972 16093 M 0 211 R D 9468 16093 M 0 211 R D
12964 16093 M 0 211 R D gsave 9450 14910 translate 0 0 M 1.2 dup scale
-58.8433 0 N
( ) show grestore 2808 20478 M 13284 0 R D 4223 20478 M 0 -422 R D
7720 20478 M 0 -422 R D 11216 20478 M 0 -422 R D 14713 20478 M 0 -422 R D
5972 20478 M 0 -211 R D 9468 20478 M 0 -211 R D 12964 20478 M 0 -211 R D
2808 16093 M 0 4385 R D 2808 17158 M 422 0 R D
gsave 2675 16989 translate 0 0 M 1.2 dup scale -117.687 0 N
( ) show grestore 2808 18285 M 422 0 R D gsave 2675 18117 translate 0 0 M
1.2 dup scale -117.687 0 N
( ) show grestore 2808 19413 M 422 0 R D gsave 2675 19244 translate 0 0 M
1.2 dup scale -117.687 0 N
( ) show grestore 2808 16594 M 211 0 R D 2808 17722 M 211 0 R D 2808 18849 M
211 0 R D 2808 19977 M 211 0 R D gsave 2134 18285 translate 0 0 M 90 rotate
1.2 dup scale -58.8433 0 N
( ) show grestore 16092 16093 M 0 4385 R D 16092 17158 M -422 0 R D
16092 18285 M -422 0 R D 16092 19413 M -422 0 R D 16092 16594 M -211 0 R D
16092 17722 M -211 0 R D 16092 18849 M -211 0 R D 16092 19977 M -211 0 R D
20 setlinewidth 1.000 0.000 0.000 setrgbcolor 2808 18285 M 55 0 R 54 0 R
55 0 R 54 0 R 55 0 R 54 0 R 54 0 R 55 0 R 54 0 R 55 0 R 54 0 R 55 0 R 54 0 R
55 0 R 54 0 R 54 0 R 55 0 R 54 0 R 55 0 R 54 0 R 55 0 R 54 0 R 54 0 R 55 0 R
54 0 R 55 0 R 54 0 R 55 0 R 54 0 R 55 0 R 54 0 R 54 0 R 55 0 R 54 0 R 55 0 R
54 0 R 55 0 R 54 0 R 54 0 R 55 0 R 54 0 R 55 0 R 54 0 R 55 0 R 54 0 R 54 0 R
55 0 R 54 0 R 55 0 R 54 0 R 55 0 R 54 0 R 55 0 R 54 0 R 54 0 R 55 0 R 54 0 R
55 0 R 54 0 R 55 0 R 54 0 R 54 0 R 55 0 R 54 0 R 55 0 R 54 0 R 55 0 R 54 0 R
55 0 R 54 0 R 54 0 R 55 0 R 54 0 R 55 0 R 54 0 R 55 0 R 54 0 R 54 0 R 55 0 R
54 0 R 55 0 R 54 0 R 55 0 R 54 0 R 54 0 R 55 0 R 54 0 R 55 0 R 54 0 R 55 0 R
54 0 R 55 0 R 54 0 R 54 0 R 55 0 R 54 0 R 55 0 R 54 0 R 55 0 R 54 0 R
54 -1 R 55 0 R 54 0 R 55 0 R 54 -1 R 55 0 R 54 -1 R 55 -1 R 54 -2 R 54 -1 R
55 -3 R 54 -3 R 55 -3 R 54 -3 R 55 -4 R 54 -3 R 54 -2 R 55 0 R 54 2 R 55 4 R
54 7 R 55 10 R 54 10 R 54 11 R 55 9 R 54 5 R 55 -1 R 54 -7 R 55 -15 R
54 -23 R 55 -29 R 54 -33 R 54 -33 R 55 -28 R 54 -20 R 55 -4 R 54 15 R
55 36 R 54 56 R 54 74 R 55 82 R 54 82 R 55 70 R 54 49 R 55 20 R 54 -12 R
55 -42 R 54 -68 R 54 -84 R 55 -91 R 54 -88 R 55 -75 R 54 -59 R 55 -37 R
54 -17 R 54 2 R 55 19 R 54 33 R 55 43 R 54 49 R 55 51 R 54 46 R 54 38 R
55 23 R 54 4 R 55 -20 R 54 -45 R 55 -71 R 54 -93 R 55 -107 R 54 -110 R
54 -99 R 55 -70 R 54 -22 R 55 39 R 54 108 R 55 177 R 54 232 R 54 267 R
55 272 R 54 244 R 55 188 R 54 110 R 55 19 R 54 -73 R 55 -152 R 54 -213 R
54 -247 R 55 -254 R 54 -234 R 55 -194 R 54 -142 R 55 -83 R 54 -30 R 54 15 R
55 47 R 54 66 R 55 72 R 54 70 R 55 62 R 54 52 R 54 42 R 55 31 R 54 23 R
55 18 R 54 12 R 55 9 R 54 6 R 55 5 R 54 3 R 54 3 R 55 2 R 54 1 R 55 2 R
54 1 R 55 0 R 54 1 R 54 1 R 55 0 R 54 0 R 55 1 R 54 0 R 55 0 R 54 1 R 55 0 R
54 0 R 54 0 R 55 0 R 54 0 R 55 0 R 54 1 R 55 0 R 54 0 R 54 0 R 55 0 R 54 0 R
55 0 R 54 0 R 55 0 R 54 0 R 54 0 R 55 0 R 54 0 R 54 0 R D 15 setlinewidth
0.000 0.000 0.000 setrgbcolor 2808 16093 M 13284 0 R D 4223 16093 M 0 422 R
D gsave 4223 15459 translate 0 0 M 1.2 dup scale -58.8433 0 N
( ) show grestore 7720 16093 M 0 422 R D gsave 7720 15459 translate 0 0 M
1.2 dup scale -58.8433 0 N
( ) show grestore 11216 16093 M 0 422 R D gsave 11216 15459 translate 0 0 M
1.2 dup scale -58.8433 0 N
( ) show grestore 14713 16093 M 0 422 R D gsave 14713 15459 translate 0 0 M
1.2 dup scale -58.8433 0 N
( ) show grestore 5972 16093 M 0 211 R D 9468 16093 M 0 211 R D
12964 16093 M 0 211 R D gsave 9450 14910 translate 0 0 M 1.2 dup scale
-58.8433 0 N
( ) show grestore 2808 20478 M 13284 0 R D 4223 20478 M 0 -422 R D
7720 20478 M 0 -422 R D 11216 20478 M 0 -422 R D 14713 20478 M 0 -422 R D
5972 20478 M 0 -211 R D 9468 20478 M 0 -211 R D 12964 20478 M 0 -211 R D
2808 16093 M 0 4385 R D 2808 17158 M 422 0 R D
gsave 2675 16989 translate 0 0 M 1.2 dup scale -117.687 0 N
( ) show grestore 2808 18285 M 422 0 R D gsave 2675 18117 translate 0 0 M
1.2 dup scale -117.687 0 N
( ) show grestore 2808 19413 M 422 0 R D gsave 2675 19244 translate 0 0 M
1.2 dup scale -117.687 0 N
( ) show grestore 2808 16594 M 211 0 R D 2808 17722 M 211 0 R D 2808 18849 M
211 0 R D 2808 19977 M 211 0 R D gsave 2134 18285 translate 0 0 M 90 rotate
1.2 dup scale -58.8433 0 N
( ) show grestore 16092 16093 M 0 4385 R D 16092 17158 M -422 0 R D
16092 18285 M -422 0 R D 16092 19413 M -422 0 R D 16092 16594 M -211 0 R D
16092 17722 M -211 0 R D 16092 18849 M -211 0 R D 16092 19977 M -211 0 R D
10 setlinewidth L1 2808 18285 M 13283 0 R D 15 setlinewidth L0 2808 16093 M
13284 0 R D 4223 16093 M 0 422 R D gsave 4223 15459 translate 0 0 M
1.2 dup scale -58.8433 0 N
( ) show grestore 7720 16093 M 0 422 R D gsave 7720 15459 translate 0 0 M
1.2 dup scale -58.8433 0 N
( ) show grestore 11216 16093 M 0 422 R D gsave 11216 15459 translate 0 0 M
1.2 dup scale -58.8433 0 N
( ) show grestore 14713 16093 M 0 422 R D gsave 14713 15459 translate 0 0 M
1.2 dup scale -58.8433 0 N
( ) show grestore 5972 16093 M 0 211 R D 9468 16093 M 0 211 R D
12964 16093 M 0 211 R D gsave 9450 14910 translate 0 0 M 1.2 dup scale
-58.8433 0 N
( ) show grestore 2808 20478 M 13284 0 R D 4223 20478 M 0 -422 R D
7720 20478 M 0 -422 R D 11216 20478 M 0 -422 R D 14713 20478 M 0 -422 R D
5972 20478 M 0 -211 R D 9468 20478 M 0 -211 R D 12964 20478 M 0 -211 R D
2808 16093 M 0 4385 R D 2808 17158 M 422 0 R D
gsave 2675 16989 translate 0 0 M 1.2 dup scale -117.687 0 N
( ) show grestore 2808 18285 M 422 0 R D gsave 2675 18117 translate 0 0 M
1.2 dup scale -117.687 0 N
( ) show grestore 2808 19413 M 422 0 R D gsave 2675 19244 translate 0 0 M
1.2 dup scale -117.687 0 N
( ) show grestore 2808 16594 M 211 0 R D 2808 17722 M 211 0 R D 2808 18849 M
211 0 R D 2808 19977 M 211 0 R D gsave 2134 18285 translate 0 0 M 90 rotate
1.2 dup scale -58.8433 0 N
( ) show grestore 16092 16093 M 0 4385 R D 16092 17158 M -422 0 R D
16092 18285 M -422 0 R D 16092 19413 M -422 0 R D 16092 16594 M -211 0 R D
16092 17722 M -211 0 R D 16092 18849 M -211 0 R D 16092 19977 M -211 0 R D
10 setlinewidth L2 0.000 0.000 1.000 setrgbcolor 8579 16093 M 54 1595 R
54 0 R 55 0 R 54 0 R 55 0 R 54 0 R 55 0 R 54 0 R 55 0 R 54 0 R 54 0 R 55 0 R
54 0 R 55 0 R 54 0 R 55 0 R 54 0 R 54 0 R 55 0 R 54 0 R 55 0 R 54 0 R 55 0 R
54 0 R 55 0 R 54 0 R 54 0 R 55 0 R 54 0 R 55 0 R 54 0 R 55 0 R 54 0 R 55 0 R
54 0 R 54 2391 R 55 0 R 54 0 R 55 0 R 54 0 R 55 0 R 54 0 R 55 0 R 54 0 R
54 0 R 55 0 R 54 0 R 55 0 R 54 0 R 55 0 R 54 0 R 55 0 R 54 0 R 54 0 R 55 0 R
54 0 R 55 0 R 54 0 R 55 0 R 54 0 R 55 0 R 54 0 R 54 0 R 55 0 R 54 0 R 55 0 R
54 0 R 55 0 R 54 0 R 55 0 R 54 0 R 54 0 R 55 0 R 54 0 R 55 0 R 54 0 R 55 0 R
54 0 R 55 0 R 54 0 R 54 0 R 55 0 R 54 0 R 55 0 R 54 0 R 55 0 R 54 0 R 55 0 R
54 0 R 54 0 R 55 0 R 54 0 R 55 0 R 54 0 R 55 0 R 54 0 R 55 0 R 54 0 R 54 0 R
55 0 R 54 0 R 55 0 R 54 0 R 55 0 R 54 0 R 55 0 R 54 0 R 54 0 R 55 0 R 54 0 R
55 0 R 54 0 R 55 0 R 54 0 R 55 0 R 54 0 R 54 0 R 55 0 R 54 0 R 55 0 R 54 0 R
55 0 R 54 0 R 55 0 R 54 0 R 54 0 R 55 0 R 54 0 R 55 0 R 54 0 R 55 0 R 54 0 R
55 0 R 54 0 R 54 0 R 55 0 R 54 0 R 54 0 R D L0 16452 16093 M 0 4385 R D
16452 16093 M -266 0 R D gsave 16563 16093 translate 0 0 M
(0.0) show grestore 16452 16890 M -266 0 R D
gsave 16563 16749 translate 0 0 M
(0.2) show grestore 16452 17688 M -266 0 R D
gsave 16563 17547 translate 0 0 M
(0.4) show grestore 16452 18485 M -266 0 R D
gsave 16563 18344 translate 0 0 M
(0.6) show grestore 16452 19282 M -266 0 R D
gsave 16563 19141 translate 0 0 M
(0.8) show grestore 16452 20079 M -266 0 R D
gsave 16563 19939 translate 0 0 M
(1.0) show grestore 16452 16292 M -133 0 R D 16452 16492 M -133 0 R D
16452 16691 M -133 0 R D 16452 17090 M -133 0 R D 16452 17289 M -133 0 R D
16452 17488 M -133 0 R D 16452 17887 M -133 0 R D 16452 18086 M -133 0 R D
16452 18285 M -133 0 R D 16452 18684 M -133 0 R D 16452 18883 M -133 0 R D
16452 19083 M -133 0 R D 16452 19481 M -133 0 R D 16452 19681 M -133 0 R D
16452 19880 M -133 0 R D 16452 20279 M -133 0 R D 16452 20478 M -133 0 R D
gsave 17528 18285 translate 0 0 M 90 rotate -835.237 0 N
(weight Q) show grestore L1 0.000 0.000 0.000 setrgbcolor 9627 16093 M
0 4384 R D 11653 16093 M 0 4384 R D 11810 16093 M 0 4384 R D 20 setlinewidth
L0 2808 13654 M 55 -907 R 54 1 R 55 533 R 54 -627 R 55 -5 R 54 -157 R
54 217 R 55 -218 R 54 219 R 55 346 R 54 -2 R 55 536 R 54 -413 R 55 2 R
54 -484 R 54 -448 R 55 1181 R 54 578 R 55 0 R 54 129 R 55 -579 R 54 0 R
54 0 R 55 225 R 54 812 R 55 4 R 54 -586 R 55 -587 R 54 0 R 55 0 R 54 -3 R
54 -467 R 55 -266 R 54 764 R 55 32 R 54 603 R 55 0 R 54 -505 R 54 -276 R
55 33 R 54 589 R 55 1 R 54 112 R 55 -501 R 54 398 R 54 -217 R 55 1370 R
54 59 R 31 725 R D 6119 15875 M 9 -4383 R D 6295 11492 M 9 4383 R D
7186 15875 M 32 -824 R 54 -675 R 55 1015 R 54 272 R 54 -334 R 55 -14 R
54 -683 R 55 479 R 54 -942 R 55 375 R 54 -379 R 55 99 R 54 -309 R 54 -1 R
55 -68 R 54 0 R 55 -235 R 54 666 R 55 264 R 54 195 R 54 0 R 55 -1026 R
54 954 R 55 0 R 54 0 R 55 -332 R 54 -4 R 55 -233 R 54 -226 R 54 -1216 R
55 1216 R 54 799 R 55 -800 R 54 -32 R 55 0 R 54 -607 R 54 191 R 55 0 R
54 0 R 55 -96 R 54 288 R 55 -290 R 54 -323 R 54 2 R 55 291 R 54 0 R 55 95 R
54 0 R 55 257 R 54 0 R 55 97 R 54 0 R 54 0 R 55 868 R 54 0 R 55 157 R
54 -191 R 55 -5 R 54 -478 R 54 -736 R 55 288 R 54 0 R 55 65 R 54 0 R
55 -513 R 54 192 R 55 -192 R 54 385 R 54 0 R 55 448 R 54 130 R 55 709 R
54 69 R 55 374 R 54 160 R 54 -921 R 55 -224 R 54 7 R 55 431 R 54 -401 R
55 -427 R 54 -329 R 54 227 R 55 1 R 54 3 R 55 2 R 54 194 R 55 -1 R 54 230 R
55 -3 R 54 -4 R 54 341 R 55 30 R 54 529 R 55 74 R 54 79 R 55 -908 R
54 -339 R 54 -683 R 55 265 R 54 0 R 55 228 R 54 -1 R 55 75 R 54 450 R
55 -454 R 54 181 R 54 -4 R 55 674 R 54 217 R 55 84 R 54 121 R 55 -26 R
54 -163 R 54 -273 R 55 -818 R 54 -323 R 55 -31 R 54 1 R 55 62 R 54 0 R
54 -190 R 55 0 R 54 0 R 55 -31 R 54 -221 R 55 -128 R 54 93 R 55 285 R
54 -1 R 54 651 R 55 -623 R 54 165 R 55 -174 R 54 138 R 55 -445 R 54 623 R
54 746 R 55 361 R 54 312 R 55 -496 R 54 -166 R 55 23 R 54 -14 R 55 -1847 R
54 -203 R 54 319 R 55 1868 R 54 -13 R 55 -167 R 54 -738 R 55 -316 R 54 1 R
54 32 R 55 2 R 54 -429 R 55 5 R 54 -368 R 55 514 R 54 464 R 54 348 R
55 -507 R 54 -254 R 54 -91 R D 15 setlinewidth 2808 11492 M 13284 0 R D
4223 11492 M 0 422 R D gsave 4223 10858 translate 0 0 M 1.2 dup scale
-58.8433 0 N
( ) show grestore 7720 11492 M 0 422 R D gsave 7720 10858 translate 0 0 M
1.2 dup scale -58.8433 0 N
( ) show grestore 11216 11492 M 0 422 R D gsave 11216 10858 translate 0 0 M
1.2 dup scale -58.8433 0 N
( ) show grestore 14713 11492 M 0 422 R D gsave 14713 10858 translate 0 0 M
1.2 dup scale -58.8433 0 N
( ) show grestore 5972 11492 M 0 211 R D 9468 11492 M 0 211 R D
12964 11492 M 0 211 R D gsave 9450 10309 translate 0 0 M 1.2 dup scale
-58.8433 0 N
( ) show grestore 2808 15877 M 13284 0 R D 4223 15877 M 0 -422 R D
7720 15877 M 0 -422 R D 11216 15877 M 0 -422 R D 14713 15877 M 0 -422 R D
5972 15877 M 0 -211 R D 9468 15877 M 0 -211 R D 12964 15877 M 0 -211 R D
2808 11492 M 0 4385 R D 2808 11602 M 422 0 R D
gsave 2675 11492 translate 0 0 M 1.2 dup scale -117.687 0 N
( ) show grestore 2808 12296 M 422 0 R D gsave 2675 12127 translate 0 0 M
1.2 dup scale -117.687 0 N
( ) show grestore 2808 12990 M 422 0 R D gsave 2675 12821 translate 0 0 M
1.2 dup scale -117.687 0 N
( ) show grestore 2808 13684 M 422 0 R D gsave 2675 13516 translate 0 0 M
1.2 dup scale -117.687 0 N
( ) show grestore 2808 14379 M 422 0 R D gsave 2675 14210 translate 0 0 M
1.2 dup scale -117.687 0 N
( ) show grestore 2808 15073 M 422 0 R D gsave 2675 14904 translate 0 0 M
1.2 dup scale -117.687 0 N
( ) show grestore 2808 15767 M 422 0 R D gsave 2675 15581 translate 0 0 M
1.2 dup scale -117.687 0 N
( ) show grestore gsave 2134 13684 translate 0 0 M 90 rotate 1.2 dup scale
-58.8433 0 N
( ) show grestore 16092 11492 M 0 4385 R D 16092 11602 M -422 0 R D
16092 12296 M -422 0 R D 16092 12990 M -422 0 R D 16092 13684 M -422 0 R D
16092 14379 M -422 0 R D 16092 15073 M -422 0 R D 16092 15767 M -422 0 R D
10 setlinewidth L1 2808 13684 M 13283 0 R D 15 setlinewidth L0 2808 11492 M
13284 0 R D 4223 11492 M 0 422 R D gsave 4223 10858 translate 0 0 M
1.2 dup scale -58.8433 0 N
( ) show grestore 7720 11492 M 0 422 R D gsave 7720 10858 translate 0 0 M
1.2 dup scale -58.8433 0 N
( ) show grestore 11216 11492 M 0 422 R D gsave 11216 10858 translate 0 0 M
1.2 dup scale -58.8433 0 N
( ) show grestore 14713 11492 M 0 422 R D gsave 14713 10858 translate 0 0 M
1.2 dup scale -58.8433 0 N
( ) show grestore 5972 11492 M 0 211 R D 9468 11492 M 0 211 R D
12964 11492 M 0 211 R D gsave 9450 10309 translate 0 0 M 1.2 dup scale
-58.8433 0 N
( ) show grestore 2808 15877 M 13284 0 R D 4223 15877 M 0 -422 R D
7720 15877 M 0 -422 R D 11216 15877 M 0 -422 R D 14713 15877 M 0 -422 R D
5972 15877 M 0 -211 R D 9468 15877 M 0 -211 R D 12964 15877 M 0 -211 R D
2808 11492 M 0 4385 R D 2808 11602 M 422 0 R D
gsave 2675 11492 translate 0 0 M 1.2 dup scale -117.687 0 N
( ) show grestore 2808 12296 M 422 0 R D gsave 2675 12127 translate 0 0 M
1.2 dup scale -117.687 0 N
( ) show grestore 2808 12990 M 422 0 R D gsave 2675 12821 translate 0 0 M
1.2 dup scale -117.687 0 N
( ) show grestore 2808 13684 M 422 0 R D gsave 2675 13516 translate 0 0 M
1.2 dup scale -117.687 0 N
( ) show grestore 2808 14379 M 422 0 R D gsave 2675 14210 translate 0 0 M
1.2 dup scale -117.687 0 N
( ) show grestore 2808 15073 M 422 0 R D gsave 2675 14904 translate 0 0 M
1.2 dup scale -117.687 0 N
( ) show grestore 2808 15767 M 422 0 R D gsave 2675 15581 translate 0 0 M
1.2 dup scale -117.687 0 N
( ) show grestore gsave 2134 13684 translate 0 0 M 90 rotate 1.2 dup scale
-58.8433 0 N
( ) show grestore 16092 11492 M 0 4385 R D 16092 11602 M -422 0 R D
16092 12296 M -422 0 R D 16092 12990 M -422 0 R D 16092 13684 M -422 0 R D
16092 14379 M -422 0 R D 16092 15073 M -422 0 R D 16092 15767 M -422 0 R D
20 setlinewidth 1.000 0.000 0.000 setrgbcolor 2808 13685 M 55 0 R 54 0 R
55 0 R 54 0 R 55 0 R 54 0 R 54 0 R 55 0 R 54 0 R 55 0 R 54 0 R 55 0 R 54 0 R
55 0 R 54 0 R 54 0 R 55 0 R 54 0 R 55 0 R 54 0 R 55 0 R 54 0 R 54 0 R 55 0 R
54 0 R 55 0 R 54 0 R 55 0 R 54 0 R 55 0 R 54 0 R 54 0 R 55 0 R 54 0 R 55 0 R
54 0 R 55 0 R 54 0 R 54 0 R 55 0 R 54 0 R 55 0 R 54 0 R 55 0 R 54 0 R 54 0 R
55 0 R 54 0 R 55 0 R 54 0 R 55 0 R 54 0 R 55 0 R 54 0 R 54 0 R 55 0 R 54 0 R
55 0 R 54 0 R 55 0 R 54 0 R 54 0 R 55 0 R 54 0 R 55 0 R 54 0 R 55 0 R 54 0 R
55 0 R 54 0 R 54 0 R 55 0 R 54 0 R 55 0 R 54 0 R 55 0 R 54 0 R 54 0 R 55 0 R
54 0 R 55 0 R 54 0 R 55 0 R 54 0 R 54 0 R 55 0 R 54 0 R 55 0 R 54 0 R 55 0 R
54 0 R 55 0 R 54 0 R 54 0 R 55 0 R 54 0 R 55 0 R 54 0 R 55 0 R 54 0 R 54 0 R
55 0 R 54 0 R 55 1 R 54 0 R 55 0 R 54 1 R 55 0 R 54 1 R 54 1 R 55 2 R 54 1 R
55 2 R 54 3 R 55 2 R 54 2 R 54 1 R 55 0 R 54 -1 R 55 -2 R 54 -5 R 55 -5 R
54 -6 R 54 -6 R 55 -5 R 54 -3 R 55 1 R 54 5 R 55 10 R 54 15 R 55 18 R
54 21 R 54 21 R 55 19 R 54 12 R 55 3 R 54 -10 R 55 -24 R 54 -36 R 54 -48 R
55 -54 R 54 -53 R 55 -46 R 54 -32 R 55 -13 R 54 7 R 55 28 R 54 44 R 54 55 R
55 59 R 54 57 R 55 49 R 54 37 R 55 24 R 54 11 R 54 -1 R 55 -12 R 54 -20 R
55 -26 R 54 -30 R 55 -30 R 54 -27 R 54 -22 R 55 -13 R 54 0 R 55 14 R 54 30 R
55 47 R 54 60 R 55 70 R 54 72 R 54 65 R 55 46 R 54 17 R 55 -24 R 54 -68 R
55 -112 R 54 -149 R 54 -171 R 55 -175 R 54 -158 R 55 -121 R 54 -70 R
55 -12 R 54 47 R 55 99 R 54 137 R 54 160 R 55 163 R 54 150 R 55 123 R
54 88 R 55 50 R 54 16 R 54 -14 R 55 -34 R 54 -46 R 55 -50 R 54 -47 R
55 -42 R 54 -35 R 54 -28 R 55 -21 R 54 -16 R 55 -11 R 54 -9 R 55 -5 R
54 -5 R 55 -3 R 54 -2 R 54 -2 R 55 -1 R 54 -1 R 55 -1 R 54 -1 R 55 0 R
54 -1 R 54 0 R 55 0 R 54 0 R 55 -1 R 54 0 R 55 0 R 54 0 R 55 0 R 54 0 R
54 -1 R 55 0 R 54 0 R 55 0 R 54 0 R 55 0 R 54 0 R 54 0 R 55 0 R 54 0 R
55 0 R 54 0 R 55 0 R 54 0 R 54 0 R 55 0 R 54 0 R 54 0 R D 15 setlinewidth
0.000 0.000 0.000 setrgbcolor 2808 11492 M 13284 0 R D 4223 11492 M 0 422 R
D gsave 4223 10858 translate 0 0 M 1.2 dup scale -58.8433 0 N
( ) show grestore 7720 11492 M 0 422 R D gsave 7720 10858 translate 0 0 M
1.2 dup scale -58.8433 0 N
( ) show grestore 11216 11492 M 0 422 R D gsave 11216 10858 translate 0 0 M
1.2 dup scale -58.8433 0 N
( ) show grestore 14713 11492 M 0 422 R D gsave 14713 10858 translate 0 0 M
1.2 dup scale -58.8433 0 N
( ) show grestore 5972 11492 M 0 211 R D 9468 11492 M 0 211 R D
12964 11492 M 0 211 R D gsave 9450 10309 translate 0 0 M 1.2 dup scale
-58.8433 0 N
( ) show grestore 2808 15877 M 13284 0 R D 4223 15877 M 0 -422 R D
7720 15877 M 0 -422 R D 11216 15877 M 0 -422 R D 14713 15877 M 0 -422 R D
5972 15877 M 0 -211 R D 9468 15877 M 0 -211 R D 12964 15877 M 0 -211 R D
2808 11492 M 0 4385 R D 2808 11602 M 422 0 R D
gsave 2675 11492 translate 0 0 M 1.2 dup scale -117.687 0 N
( ) show grestore 2808 12296 M 422 0 R D gsave 2675 12127 translate 0 0 M
1.2 dup scale -117.687 0 N
( ) show grestore 2808 12990 M 422 0 R D gsave 2675 12821 translate 0 0 M
1.2 dup scale -117.687 0 N
( ) show grestore 2808 13684 M 422 0 R D gsave 2675 13516 translate 0 0 M
1.2 dup scale -117.687 0 N
( ) show grestore 2808 14379 M 422 0 R D gsave 2675 14210 translate 0 0 M
1.2 dup scale -117.687 0 N
( ) show grestore 2808 15073 M 422 0 R D gsave 2675 14904 translate 0 0 M
1.2 dup scale -117.687 0 N
( ) show grestore 2808 15767 M 422 0 R D gsave 2675 15581 translate 0 0 M
1.2 dup scale -117.687 0 N
( ) show grestore gsave 2134 13684 translate 0 0 M 90 rotate 1.2 dup scale
-58.8433 0 N
( ) show grestore 16092 11492 M 0 4385 R D 16092 11602 M -422 0 R D
16092 12296 M -422 0 R D 16092 12990 M -422 0 R D 16092 13684 M -422 0 R D
16092 14379 M -422 0 R D 16092 15073 M -422 0 R D 16092 15767 M -422 0 R D
10 setlinewidth L1 2808 13684 M 13283 0 R D 15 setlinewidth L0 2808 11492 M
13284 0 R D 4223 11492 M 0 422 R D gsave 4223 10858 translate 0 0 M
1.2 dup scale -58.8433 0 N
( ) show grestore 7720 11492 M 0 422 R D gsave 7720 10858 translate 0 0 M
1.2 dup scale -58.8433 0 N
( ) show grestore 11216 11492 M 0 422 R D gsave 11216 10858 translate 0 0 M
1.2 dup scale -58.8433 0 N
( ) show grestore 14713 11492 M 0 422 R D gsave 14713 10858 translate 0 0 M
1.2 dup scale -58.8433 0 N
( ) show grestore 5972 11492 M 0 211 R D 9468 11492 M 0 211 R D
12964 11492 M 0 211 R D gsave 9450 10309 translate 0 0 M 1.2 dup scale
-58.8433 0 N
( ) show grestore 2808 15877 M 13284 0 R D 4223 15877 M 0 -422 R D
7720 15877 M 0 -422 R D 11216 15877 M 0 -422 R D 14713 15877 M 0 -422 R D
5972 15877 M 0 -211 R D 9468 15877 M 0 -211 R D 12964 15877 M 0 -211 R D
2808 11492 M 0 4385 R D 2808 11602 M 422 0 R D
gsave 2675 11492 translate 0 0 M 1.2 dup scale -117.687 0 N
( ) show grestore 2808 12296 M 422 0 R D gsave 2675 12127 translate 0 0 M
1.2 dup scale -117.687 0 N
( ) show grestore 2808 12990 M 422 0 R D gsave 2675 12821 translate 0 0 M
1.2 dup scale -117.687 0 N
( ) show grestore 2808 13684 M 422 0 R D gsave 2675 13516 translate 0 0 M
1.2 dup scale -117.687 0 N
( ) show grestore 2808 14379 M 422 0 R D gsave 2675 14210 translate 0 0 M
1.2 dup scale -117.687 0 N
( ) show grestore 2808 15073 M 422 0 R D gsave 2675 14904 translate 0 0 M
1.2 dup scale -117.687 0 N
( ) show grestore 2808 15767 M 422 0 R D gsave 2675 15581 translate 0 0 M
1.2 dup scale -117.687 0 N
( ) show grestore gsave 2134 13684 translate 0 0 M 90 rotate 1.2 dup scale
-58.8433 0 N
( ) show grestore 16092 11492 M 0 4385 R D 16092 11602 M -422 0 R D
16092 12296 M -422 0 R D 16092 12990 M -422 0 R D 16092 13684 M -422 0 R D
16092 14379 M -422 0 R D 16092 15073 M -422 0 R D 16092 15767 M -422 0 R D
10 setlinewidth L2 0.000 0.000 1.000 setrgbcolor 8579 11492 M 54 1595 R
54 0 R 55 0 R 54 0 R 55 0 R 54 0 R 55 0 R 54 0 R 55 0 R 54 0 R 54 0 R 55 0 R
54 0 R 55 0 R 54 0 R 55 0 R 54 0 R 54 0 R 55 0 R 54 0 R 55 0 R 54 0 R 55 0 R
54 0 R 55 0 R 54 0 R 54 0 R 55 0 R 54 0 R 55 0 R 54 0 R 55 0 R 54 0 R 55 0 R
54 0 R 54 2391 R 55 0 R 54 0 R 55 0 R 54 0 R 55 0 R 54 0 R 55 0 R 54 0 R
54 0 R 55 0 R 54 0 R 55 0 R 54 0 R 55 0 R 54 0 R 55 0 R 54 0 R 54 0 R 55 0 R
54 0 R 55 0 R 54 0 R 55 0 R 54 0 R 55 0 R 54 0 R 54 0 R 55 0 R 54 0 R 55 0 R
54 0 R 55 0 R 54 0 R 55 0 R 54 0 R 54 0 R 55 0 R 54 0 R 55 0 R 54 0 R 55 0 R
54 0 R 55 0 R 54 0 R 54 0 R 55 0 R 54 0 R 55 0 R 54 0 R 55 0 R 54 0 R 55 0 R
54 0 R 54 0 R 55 0 R 54 0 R 55 0 R 54 0 R 55 0 R 54 0 R 55 0 R 54 0 R 54 0 R
55 0 R 54 0 R 55 0 R 54 0 R 55 0 R 54 0 R 55 0 R 54 0 R 54 0 R 55 0 R 54 0 R
55 0 R 54 0 R 55 0 R 54 0 R 55 0 R 54 0 R 54 0 R 55 0 R 54 0 R 55 0 R 54 0 R
55 0 R 54 0 R 55 0 R 54 0 R 54 0 R 55 0 R 54 0 R 55 0 R 54 0 R 55 0 R 54 0 R
55 0 R 54 0 R 54 0 R 55 0 R 54 0 R 54 0 R D L0 16452 11492 M 0 4385 R D
16452 11492 M -266 0 R D gsave 16563 11492 translate 0 0 M
(0.0) show grestore 16452 12289 M -266 0 R D
gsave 16563 12148 translate 0 0 M
(0.2) show grestore 16452 13087 M -266 0 R D
gsave 16563 12946 translate 0 0 M
(0.4) show grestore 16452 13884 M -266 0 R D
gsave 16563 13743 translate 0 0 M
(0.6) show grestore 16452 14681 M -266 0 R D
gsave 16563 14540 translate 0 0 M
(0.8) show grestore 16452 15478 M -266 0 R D
gsave 16563 15338 translate 0 0 M
(1.0) show grestore 16452 11691 M -133 0 R D 16452 11891 M -133 0 R D
16452 12090 M -133 0 R D 16452 12489 M -133 0 R D 16452 12688 M -133 0 R D
16452 12887 M -133 0 R D 16452 13286 M -133 0 R D 16452 13485 M -133 0 R D
16452 13684 M -133 0 R D 16452 14083 M -133 0 R D 16452 14282 M -133 0 R D
16452 14482 M -133 0 R D 16452 14880 M -133 0 R D 16452 15080 M -133 0 R D
16452 15279 M -133 0 R D 16452 15678 M -133 0 R D 16452 15877 M -133 0 R D
gsave 17528 13684 translate 0 0 M 90 rotate -823.383 0 N
(weight U) show grestore L1 0.000 0.000 0.000 setrgbcolor 9627 11492 M
0 4384 R D 11653 11492 M 0 4384 R D 11810 11492 M 0 4384 R D 20 setlinewidth
L0 2808 8920 M 55 4 R 54 0 R 55 -64 R 54 119 R 55 -1 R 54 86 R 54 0 R
55 -15 R 54 0 R 55 -61 R 54 -10 R 55 -76 R 54 14 R 55 -9 R 54 -33 R 54 -36 R
55 20 R 54 97 R 55 0 R 54 -77 R 55 0 R 54 46 R 54 0 R 55 -10 R 54 -79 R
55 -2 R 54 0 R 55 26 R 54 -20 R 55 -67 R 54 -4 R 54 -19 R 55 -22 R 54 -122 R
55 -3 R 54 -131 R 55 0 R 54 -26 R 54 -5 R 55 -75 R 54 -172 R 55 -4 R
54 -48 R 55 111 R 54 -214 R 54 -10 R 55 -249 R 54 -49 R 55 -246 R 54 -207 R
55 -308 R 41 -77 R D 6192 6892 M 46 1811 R 42 2571 R D 6875 11274 M
16 -200 R 55 -185 R 54 -193 R 54 -130 R 55 -471 R 54 27 R 55 -20 R 54 -14 R
55 -236 R 54 -59 R 54 -4 R 55 -46 R 54 -142 R 55 -49 R 54 -2 R 55 -9 R
54 -39 R 55 -30 R 54 -89 R 54 -234 R 55 135 R 54 0 R 55 20 R 54 9 R
55 -144 R 54 -32 R 54 0 R 55 121 R 54 0 R 55 21 R 54 21 R 55 4 R 54 -32 R
55 -2 R 54 117 R 54 -201 R 55 -9 R 54 -103 R 55 -5 R 54 -46 R 55 -221 R
54 -15 R 54 -88 R 55 -159 R 54 -57 R 55 21 R 54 28 R 55 30 R 54 46 R
54 223 R 55 43 R 54 117 R 55 41 R 54 124 R 55 129 R 54 170 R 55 31 R
54 -16 R 54 1 R 55 30 R 54 62 R 55 -119 R 54 -283 R 55 -5 R 54 -36 R
54 -36 R 55 -56 R 54 0 R 55 0 R 54 41 R 55 20 R 54 67 R 55 205 R 54 138 R
54 -133 R 55 -30 R 54 -144 R 55 -98 R 54 -450 R 55 -361 R 54 -205 R
54 -149 R 55 -270 R 54 -197 R 55 -155 R 54 -49 R 55 73 R 54 42 R 54 533 R
55 373 R 54 403 R 55 20 R 54 663 R 55 68 R 54 115 R 55 72 R 54 -3 R 54 -38 R
55 -101 R 54 -273 R 55 -85 R 54 -194 R 55 -54 R 54 -213 R 54 -55 R 55 -6 R
54 79 R 55 109 R 54 122 R 55 303 R 54 270 R 55 68 R 54 313 R 54 122 R
55 250 R 54 78 R 55 39 R 54 -9 R 55 -21 R 54 -199 R 54 -35 R 55 -51 R
54 -28 R 55 -209 R 54 -236 R 55 -80 R 54 -53 R 54 -96 R 55 -61 R 54 0 R
55 -1 R 54 -107 R 55 -40 R 54 10 R 55 0 R 54 -10 R 54 -31 R 55 38 R 54 -21 R
55 85 R 54 -83 R 55 67 R 54 -141 R 54 111 R 55 -26 R 54 -60 R 55 -45 R
54 10 R 55 -31 R 54 5 R 55 -3 R 54 89 R 54 -84 R 55 69 R 54 10 R 55 46 R
54 -16 R 55 -121 R 54 0 R 54 111 R 55 30 R 54 -75 R 55 -19 R 54 0 R 55 59 R
54 0 R 54 -10 R 55 0 R 54 51 R 54 -269 R D 15 setlinewidth 2808 6892 M
13284 0 R D 4223 6892 M 0 422 R D gsave 4223 6258 translate 0 0 M
1.2 dup scale -58.8433 0 N
( ) show grestore 7720 6892 M 0 422 R D gsave 7720 6258 translate 0 0 M
1.2 dup scale -58.8433 0 N
( ) show grestore 11216 6892 M 0 422 R D gsave 11216 6258 translate 0 0 M
1.2 dup scale -58.8433 0 N
( ) show grestore 14713 6892 M 0 422 R D gsave 14713 6258 translate 0 0 M
1.2 dup scale -58.8433 0 N
( ) show grestore 5972 6892 M 0 211 R D 9468 6892 M 0 211 R D 12964 6892 M
0 211 R D gsave 9450 5709 translate 0 0 M 1.2 dup scale -58.8433 0 N
( ) show grestore 2808 11276 M 13284 0 R D 4223 11276 M 0 -422 R D
7720 11276 M 0 -422 R D 11216 11276 M 0 -422 R D 14713 11276 M 0 -422 R D
5972 11276 M 0 -211 R D 9468 11276 M 0 -211 R D 12964 11276 M 0 -211 R D
2808 6892 M 0 4384 R D 2808 7972 M 422 0 R D gsave 2675 7803 translate 0 0 M
1.2 dup scale -117.687 0 N
( ) show grestore 2808 9084 M 422 0 R D gsave 2675 8915 translate 0 0 M
1.2 dup scale -117.687 0 N
( ) show grestore 2808 10196 M 422 0 R D gsave 2675 10027 translate 0 0 M
1.2 dup scale -117.687 0 N
( ) show grestore 2808 7416 M 211 0 R D 2808 8528 M 211 0 R D 2808 9640 M
211 0 R D 2808 10752 M 211 0 R D gsave 2134 9084 translate 0 0 M 90 rotate
1.2 dup scale -58.8433 0 N
( ) show grestore 16092 6892 M 0 4384 R D 16092 7972 M -422 0 R D
16092 9084 M -422 0 R D 16092 10196 M -422 0 R D 16092 7416 M -211 0 R D
16092 8528 M -211 0 R D 16092 9640 M -211 0 R D 16092 10752 M -211 0 R D
10 setlinewidth L1 2808 9084 M 13283 0 R D 15 setlinewidth L0 2808 6892 M
13284 0 R D 4223 6892 M 0 422 R D gsave 4223 6258 translate 0 0 M
1.2 dup scale -58.8433 0 N
( ) show grestore 7720 6892 M 0 422 R D gsave 7720 6258 translate 0 0 M
1.2 dup scale -58.8433 0 N
( ) show grestore 11216 6892 M 0 422 R D gsave 11216 6258 translate 0 0 M
1.2 dup scale -58.8433 0 N
( ) show grestore 14713 6892 M 0 422 R D gsave 14713 6258 translate 0 0 M
1.2 dup scale -58.8433 0 N
( ) show grestore 5972 6892 M 0 211 R D 9468 6892 M 0 211 R D 12964 6892 M
0 211 R D gsave 9450 5709 translate 0 0 M 1.2 dup scale -58.8433 0 N
( ) show grestore 2808 11276 M 13284 0 R D 4223 11276 M 0 -422 R D
7720 11276 M 0 -422 R D 11216 11276 M 0 -422 R D 14713 11276 M 0 -422 R D
5972 11276 M 0 -211 R D 9468 11276 M 0 -211 R D 12964 11276 M 0 -211 R D
2808 6892 M 0 4384 R D 2808 7972 M 422 0 R D gsave 2675 7803 translate 0 0 M
1.2 dup scale -117.687 0 N
( ) show grestore 2808 9084 M 422 0 R D gsave 2675 8915 translate 0 0 M
1.2 dup scale -117.687 0 N
( ) show grestore 2808 10196 M 422 0 R D gsave 2675 10027 translate 0 0 M
1.2 dup scale -117.687 0 N
( ) show grestore 2808 7416 M 211 0 R D 2808 8528 M 211 0 R D 2808 9640 M
211 0 R D 2808 10752 M 211 0 R D gsave 2134 9084 translate 0 0 M 90 rotate
1.2 dup scale -58.8433 0 N
( ) show grestore 16092 6892 M 0 4384 R D 16092 7972 M -422 0 R D
16092 9084 M -422 0 R D 16092 10196 M -422 0 R D 16092 7416 M -211 0 R D
16092 8528 M -211 0 R D 16092 9640 M -211 0 R D 16092 10752 M -211 0 R D
20 setlinewidth 1.000 0.000 0.000 setrgbcolor 2808 9084 M 55 0 R 54 0 R
55 0 R 54 0 R 55 0 R 54 0 R 54 0 R 55 0 R 54 0 R 55 0 R 54 0 R 55 0 R 54 0 R
55 0 R 54 0 R 54 0 R 55 0 R 54 0 R 55 0 R 54 0 R 55 0 R 54 0 R 54 0 R 55 0 R
54 0 R 55 0 R 54 0 R 55 0 R 54 0 R 55 0 R 54 -1 R 54 0 R 55 0 R 54 0 R
55 0 R 54 0 R 55 0 R 54 0 R 54 0 R 55 0 R 54 0 R 55 0 R 54 0 R 55 0 R 54 0 R
54 0 R 55 0 R 54 0 R 55 0 R 54 0 R 55 0 R 54 0 R 55 0 R 54 0 R 54 0 R 55 0 R
54 0 R 55 0 R 54 0 R 55 0 R 54 0 R 54 0 R 55 0 R 54 0 R 55 0 R 54 0 R 55 0 R
54 -1 R 55 0 R 54 0 R 54 0 R 55 0 R 54 0 R 55 0 R 54 0 R 55 0 R 54 0 R
54 0 R 55 0 R 54 -1 R 55 0 R 54 0 R 55 0 R 54 0 R 54 0 R 55 0 R 54 -1 R
55 0 R 54 0 R 55 0 R 54 -1 R 55 0 R 54 0 R 54 -1 R 55 0 R 54 -1 R 55 0 R
54 -1 R 55 -1 R 54 0 R 54 -2 R 55 -1 R 54 -1 R 55 -2 R 54 -3 R 55 -3 R
54 -4 R 55 -5 R 54 -7 R 54 -9 R 55 -12 R 54 -15 R 55 -20 R 54 -24 R 55 -28 R
54 -33 R 54 -35 R 55 -37 R 54 -34 R 55 -29 R 54 -19 R 55 -5 R 54 10 R
54 28 R 55 46 R 54 59 R 55 70 R 54 74 R 55 71 R 54 62 R 55 47 R 54 26 R
54 4 R 55 -17 R 54 -37 R 55 -51 R 54 -59 R 55 -57 R 54 -50 R 54 -35 R
55 -17 R 54 2 R 55 19 R 54 33 R 55 40 R 54 39 R 55 28 R 54 10 R 54 -16 R
55 -49 R 54 -83 R 55 -119 R 54 -152 R 55 -180 R 54 -198 R 54 -203 R
55 -192 R 54 -164 R 55 -118 R 54 -57 R 55 16 R 54 95 R 54 169 R 55 235 R
54 285 R 55 311 R 54 313 R 55 291 R 54 244 R 55 177 R 54 95 R 54 8 R
55 -76 R 54 -147 R 55 -194 R 54 -214 R 55 -201 R 54 -157 R 54 -90 R 55 -7 R
54 77 R 55 154 R 54 216 R 55 253 R 54 267 R 55 255 R 54 222 R 54 171 R
55 110 R 54 44 R 55 -19 R 54 -75 R 55 -116 R 54 -143 R 54 -155 R 55 -153 R
54 -141 R 55 -123 R 54 -103 R 55 -83 R 54 -64 R 54 -49 R 55 -37 R 54 -28 R
55 -20 R 54 -16 R 55 -12 R 54 -9 R 55 -7 R 54 -6 R 54 -5 R 55 -4 R 54 -3 R
55 -3 R 54 -2 R 55 -2 R 54 -2 R 54 -2 R 55 -1 R 54 -1 R 55 -2 R 54 -1 R
55 0 R 54 -1 R 55 -1 R 54 -1 R 54 0 R 55 -1 R 54 0 R 55 -1 R 54 0 R 55 -1 R
54 0 R 54 0 R 55 -1 R 54 0 R 55 0 R 54 0 R 55 -1 R 54 0 R 54 0 R 55 0 R
54 0 R 54 -1 R D 15 setlinewidth 0.000 0.000 0.000 setrgbcolor 2808 6892 M
13284 0 R D 4223 6892 M 0 422 R D gsave 4223 6258 translate 0 0 M
1.2 dup scale -58.8433 0 N
( ) show grestore 7720 6892 M 0 422 R D gsave 7720 6258 translate 0 0 M
1.2 dup scale -58.8433 0 N
( ) show grestore 11216 6892 M 0 422 R D gsave 11216 6258 translate 0 0 M
1.2 dup scale -58.8433 0 N
( ) show grestore 14713 6892 M 0 422 R D gsave 14713 6258 translate 0 0 M
1.2 dup scale -58.8433 0 N
( ) show grestore 5972 6892 M 0 211 R D 9468 6892 M 0 211 R D 12964 6892 M
0 211 R D gsave 9450 5709 translate 0 0 M 1.2 dup scale -58.8433 0 N
( ) show grestore 2808 11276 M 13284 0 R D 4223 11276 M 0 -422 R D
7720 11276 M 0 -422 R D 11216 11276 M 0 -422 R D 14713 11276 M 0 -422 R D
5972 11276 M 0 -211 R D 9468 11276 M 0 -211 R D 12964 11276 M 0 -211 R D
2808 6892 M 0 4384 R D 2808 7972 M 422 0 R D gsave 2675 7803 translate 0 0 M
1.2 dup scale -117.687 0 N
( ) show grestore 2808 9084 M 422 0 R D gsave 2675 8915 translate 0 0 M
1.2 dup scale -117.687 0 N
( ) show grestore 2808 10196 M 422 0 R D gsave 2675 10027 translate 0 0 M
1.2 dup scale -117.687 0 N
( ) show grestore 2808 7416 M 211 0 R D 2808 8528 M 211 0 R D 2808 9640 M
211 0 R D 2808 10752 M 211 0 R D gsave 2134 9084 translate 0 0 M 90 rotate
1.2 dup scale -58.8433 0 N
( ) show grestore 16092 6892 M 0 4384 R D 16092 7972 M -422 0 R D
16092 9084 M -422 0 R D 16092 10196 M -422 0 R D 16092 7416 M -211 0 R D
16092 8528 M -211 0 R D 16092 9640 M -211 0 R D 16092 10752 M -211 0 R D
10 setlinewidth L1 2808 9084 M 13283 0 R D 15 setlinewidth L0 2808 6892 M
13284 0 R D 4223 6892 M 0 422 R D gsave 4223 6258 translate 0 0 M
1.2 dup scale -58.8433 0 N
( ) show grestore 7720 6892 M 0 422 R D gsave 7720 6258 translate 0 0 M
1.2 dup scale -58.8433 0 N
( ) show grestore 11216 6892 M 0 422 R D gsave 11216 6258 translate 0 0 M
1.2 dup scale -58.8433 0 N
( ) show grestore 14713 6892 M 0 422 R D gsave 14713 6258 translate 0 0 M
1.2 dup scale -58.8433 0 N
( ) show grestore 5972 6892 M 0 211 R D 9468 6892 M 0 211 R D 12964 6892 M
0 211 R D gsave 9450 5709 translate 0 0 M 1.2 dup scale -58.8433 0 N
( ) show grestore 2808 11276 M 13284 0 R D 4223 11276 M 0 -422 R D
7720 11276 M 0 -422 R D 11216 11276 M 0 -422 R D 14713 11276 M 0 -422 R D
5972 11276 M 0 -211 R D 9468 11276 M 0 -211 R D 12964 11276 M 0 -211 R D
2808 6892 M 0 4384 R D 2808 7972 M 422 0 R D gsave 2675 7803 translate 0 0 M
1.2 dup scale -117.687 0 N
( ) show grestore 2808 9084 M 422 0 R D gsave 2675 8915 translate 0 0 M
1.2 dup scale -117.687 0 N
( ) show grestore 2808 10196 M 422 0 R D gsave 2675 10027 translate 0 0 M
1.2 dup scale -117.687 0 N
( ) show grestore 2808 7416 M 211 0 R D 2808 8528 M 211 0 R D 2808 9640 M
211 0 R D 2808 10752 M 211 0 R D gsave 2134 9084 translate 0 0 M 90 rotate
1.2 dup scale -58.8433 0 N
( ) show grestore 16092 6892 M 0 4384 R D 16092 7972 M -422 0 R D
16092 9084 M -422 0 R D 16092 10196 M -422 0 R D 16092 7416 M -211 0 R D
16092 8528 M -211 0 R D 16092 9640 M -211 0 R D 16092 10752 M -211 0 R D
10 setlinewidth L2 0.000 0.000 1.000 setrgbcolor 8579 6892 M 54 1594 R
54 0 R 55 0 R 54 0 R 55 0 R 54 0 R 55 0 R 54 0 R 55 0 R 54 0 R 54 0 R 55 0 R
54 0 R 55 0 R 54 0 R 55 0 R 54 0 R 54 0 R 55 0 R 54 0 R 55 0 R 54 0 R 55 0 R
54 0 R 55 0 R 54 0 R 54 0 R 55 0 R 54 0 R 55 0 R 54 0 R 55 0 R 54 0 R 55 0 R
54 0 R 54 2391 R 55 0 R 54 0 R 55 0 R 54 0 R 55 0 R 54 0 R 55 0 R 54 0 R
54 0 R 55 0 R 54 0 R 55 0 R 54 0 R 55 0 R 54 0 R 55 0 R 54 0 R 54 0 R 55 0 R
54 0 R 55 0 R 54 0 R 55 0 R 54 0 R 55 0 R 54 0 R 54 0 R 55 0 R 54 0 R 55 0 R
54 0 R 55 0 R 54 0 R 55 0 R 54 0 R 54 0 R 55 0 R 54 0 R 55 0 R 54 0 R 55 0 R
54 0 R 55 0 R 54 0 R 54 0 R 55 0 R 54 0 R 55 0 R 54 0 R 55 0 R 54 0 R 55 0 R
54 0 R 54 0 R 55 0 R 54 0 R 55 0 R 54 0 R 55 0 R 54 0 R 55 0 R 54 0 R 54 0 R
55 0 R 54 0 R 55 0 R 54 0 R 55 0 R 54 0 R 55 0 R 54 0 R 54 0 R 55 0 R 54 0 R
55 0 R 54 0 R 55 0 R 54 0 R 55 0 R 54 0 R 54 0 R 55 0 R 54 0 R 55 0 R 54 0 R
55 0 R 54 0 R 55 0 R 54 0 R 54 0 R 55 0 R 54 0 R 55 0 R 54 0 R 55 0 R 54 0 R
55 0 R 54 0 R 54 0 R 55 0 R 54 0 R 54 0 R D L0 16452 6892 M 0 4384 R D
16452 6892 M -266 0 R D gsave 16563 6892 translate 0 0 M
(0.0) show grestore 16452 7689 M -266 0 R D gsave 16563 7548 translate 0 0 M
(0.2) show grestore 16452 8486 M -266 0 R D gsave 16563 8345 translate 0 0 M
(0.4) show grestore 16452 9283 M -266 0 R D gsave 16563 9142 translate 0 0 M
(0.6) show grestore 16452 10080 M -266 0 R D
gsave 16563 9940 translate 0 0 M
(0.8) show grestore 16452 10877 M -266 0 R D
gsave 16563 10737 translate 0 0 M
(1.0) show grestore 16452 7091 M -133 0 R D 16452 7291 M -133 0 R D
16452 7490 M -133 0 R D 16452 7888 M -133 0 R D 16452 8088 M -133 0 R D
16452 8287 M -133 0 R D 16452 8685 M -133 0 R D 16452 8885 M -133 0 R D
16452 9084 M -133 0 R D 16452 9483 M -133 0 R D 16452 9682 M -133 0 R D
16452 9881 M -133 0 R D 16452 10280 M -133 0 R D 16452 10479 M -133 0 R D
16452 10678 M -133 0 R D 16452 11077 M -133 0 R D 16452 11276 M -133 0 R D
gsave 17528 9084 translate 0 0 M 90 rotate -811.742 0 N
(weight V) show grestore L1 0.000 0.000 0.000 setrgbcolor 9627 6892 M
0 4383 R D 11653 6892 M 0 4383 R D 11810 6892 M 0 4383 R D
%%IncludeResource: font Courier
423.333 /Courier STDFONT gsave 0 -25999 translate 0 0 M
(----------------------------------------------------------------------------------------------------) show
grestore gsave 9000 5652 translate 0 0 M 0.708661 dup scale -12700 0 N
(----------------------------------------------------------------------------------------------------) show
grestore gsave 9000 5347 translate 0 0 M 0.708661 dup scale -12700 0 N
(      |                      Component 1             |                      Component 2             ) show
grestore gsave 9000 5041 translate 0 0 M 0.708661 dup scale -12700 0 N
(  Par | Fit         Value  \( Scale Min to  Scale Max\)| Fit         Value  \( Scale Min to  Scale Max\)) show
grestore gsave 9000 4736 translate 0 0 M 0.708661 dup scale -12700 0 N
(----------------------------------------------------------------------------------------------------) show
grestore gsave 9000 4430 translate 0 0 M 0.708661 dup scale -12700 0 N
(     B|   4     410.31000  \(      0.00 to    3000.00\)|   4     698.42999  \(      0.00 to    3000.00\)) show
grestore gsave 9000 4125 translate 0 0 M 0.708661 dup scale -12700 0 N
(   AZI|   3      76.97520  \(    -90.00 to      90.00\)|   3      75.87540  \(    -90.00 to      90.00\)) show
grestore gsave 9000 3819 translate 0 0 M 0.708661 dup scale -12700 0 N
(   INC|   2     144.08821  \(      0.00 to     180.00\)|   2     119.06640  \(      0.00 to     180.00\)) show
grestore gsave 9000 3514 translate 0 0 M 0.708661 dup scale -12700 0 N
(  VLOS|   1    2385.60034  \(  -7000.00 to    7000.00\)|   1   17172.50977  \(   7000.00 to   50000.00\)) show
grestore gsave 9000 3208 translate 0 0 M 0.708661 dup scale -12700 0 N
(  DAMP|   0       0.30000  \(      0.00 to       0.70\)|   0       0.30000  \(      0.00 to       0.70\)) show
grestore gsave 9000 2902 translate 0 0 M 0.708661 dup scale -12700 0 N
(  DOPP|   1       0.23670  \(      0.10 to       0.80\)|   1       0.22067  \(      0.10 to       0.80\)) show
grestore gsave 9000 2597 translate 0 0 M 0.708661 dup scale -12700 0 N
( SGRAD|   5       4.25550  \(      0.00 to      10.00\)|   5       3.47570  \(      0.00 to      10.00\)) show
grestore gsave 9000 2291 translate 0 0 M 0.708661 dup scale -12700 0 N
(ETAZER|   0       1.00000  \(      0.00 to      10.00\)|   0       1.00000  \(      0.00 to      10.00\)) show
grestore gsave 9000 1986 translate 0 0 M 0.708661 dup scale -12700 0 N
(    FF|   0       0.50000  \(      0.01 to       0.99\)|   0       0.50000  \(      0.01 to       0.99\)) show
grestore gsave 9000 1680 translate 0 0 M 0.708661 dup scale -12700 0 N
(----------------------------------------------------------------------------------------------------) show
grestore gsave 9000 1375 translate 0 0 M 0.708661 dup scale -11303 0 N
( APPROX_DIR 0 0  |  APPROX_AZI 0 0  |  APPROX_DEV 0 0  |  IQUV_WEIGHT1.00 1.00 1.00 1.00 ) show
grestore gsave 9000 1069 translate 0 0 M 0.708661 dup scale -11176 0 N
( MAGOPT 1 1  |  USE_GEFF 1 1  |  NCALLS 800 0  |  NOISE 0.00 |  PROFILE voigt |  SYNTH 0) show
grestore gsave 9000 764 translate 0 0 M 0.708661 dup scale -5461 0 N
( OBSERVATION 13may01.014 |  STRAYPOL_CORR 0) show grestore
gsave 9000 458 translate 0 0 M 0.708661 dup scale -12700 0 N
(----------------------------------------------------------------------------------------------------) show
grestore
%%IncludeResource: font Helvetica
423.333 /Helvetica STDFONT gsave 0 0 translate 0 0 M 1.2 dup scale
(97 | 70, Fitness: 2.38) show grestore gsave 0 26000 translate 0 0 M
0.9 dup scale grestore gsave 0 25683 translate 0 0 M 0.9 dup scale
(./input/xdisplay.ipt) show grestore gsave 18000 0 translate 0 0 M
1.2 dup scale -10160 0 N
(Perc: 100.00 end: 10.08.2004;11:48:10.81) show grestore
gsave 0 0 translate 0 0 M grestore gsave 0 -351 translate 0 0 M grestore
gsave 0 -703 translate 0 0 M
(./ps/xdisplay.13may01.014.pikaia.x097.y070_bfree_1x1_noff_nostray_v01.ps) show
grestore
%%PageTrailer
end
restore
showpage
%%PageResources: font Helvetica
%%+ font Helvetica
%%Trailer
restore
%%Pages: 1
%%DocumentNeededResources: font Helvetica
%%+ font Helvetica
%%EOF
