route_long_name,route_short_name,agency_id,route_type,route_id
EC,EC,1,2,1
EN,EN,1,2,3
EuroCity,EC,1,2,9
EuroCity-Express,ECE,1,2,2
EuroNight,EN,1,2,4
IC,IC,1,2,5
ICE,ICE,1,2,8
Intercity,IC,1,2,7
Intercity-Express,ICE,1,2,6
RJ,RJ,1,2,10
