stop_name,stop_id,stop_lat,stop_lon
's-Hertogenbosch,1269,51.69054,5.293723
's-Hertogenbosch,674,51.69054,5.293723
's-Hertogenbosch,70,51.69054,5.293723
's-Hertogenbosch,949,51.69054,5.293723
Aachen Hbf,1001,50.7678,6.091499
Aachen Hbf,59,50.7678,6.091499
Aachen Hbf,685,50.7678,6.091499
Aachen Süd(Gr),187,50.731915,6.04541
Aalen Hbf,1319,48.841015,10.096271
Aalen Hbf,306,48.841015,10.096271
Aarhus,451,56.150074,10.204997
Aarhus,637,56.150074,10.204997
Aarhus,710,56.150074,10.204997
Aarhus,733,56.150074,10.204997
Aarhus,929,56.150074,10.204997
Alfeld(Leine),1143,51.98142,9.817779
Alfeld(Leine),623,51.98142,9.817779
Almelo,614,52.357285,6.654811
Almelo,865,52.357285,6.654811
Altena(Westf),271,51.301983,7.668808
Altena(Westf),820,51.301983,7.668808
Altenbeken,861,51.766434,8.943319
Altenbeken,945,51.766434,8.943319
Amersfoort Centraal,45,52.153465,5.373909
Amersfoort Centraal,596,52.153465,5.373909
Amersfoort Centraal,921,52.153465,5.373909
Amsterdam Centraal,120,52.37919,4.899431
Amsterdam Centraal,136,52.37919,4.899431
Amsterdam Centraal,1392,52.37919,4.899431
Amsterdam Centraal,513,52.37919,4.899431
Amsterdam Centraal,546,52.37919,4.899431
Amsterdam Centraal,567,52.37919,4.899431
Amsterdam Centraal,61,52.37919,4.899431
Amsterdam Centraal,729,52.37919,4.899431
Amsterdam Centraal,814,52.37919,4.899431
Amsterdam Centraal,958,52.37919,4.899431
Amstetten NÖ,1291,48.121605,14.878112
Amstetten NÖ,43,48.121605,14.878112
Andernach,1145,50.434544,7.404839
Andernach,525,50.434544,7.404839
Angermünde,1061,53.01522,13.996361
Angermünde,598,53.01522,13.996361
Anklam,1174,53.856102,13.701827
Anklam,524,53.856102,13.701827
Ansbach,116,49.29803,10.578239
Apeldoorn,198,52.20943,5.967491
Apeldoorn,237,52.20943,5.967491
Apeldoorn,468,52.20943,5.967491
Apolda,1056,51.03094,11.526136
Apolda,655,51.03094,11.526136
Arnhem Centraal,1248,51.98478,5.901003
Arnhem Centraal,904,51.98478,5.901003
Arnhem Centraal,912,51.98478,5.901003
Arnhem Centraal,941,51.98478,5.901003
Aschaffenburg Hbf,1224,49.980556,9.143697
Aschaffenburg Hbf,232,49.980556,9.143697
Attnang-Puchheim,957,48.012802,13.720719
Augsburg Hbf,1277,48.36544,10.88557
Augsburg Hbf,1278,48.36544,10.88557
Augsburg Hbf,205,48.36544,10.88557
Augsburg Hbf,320,48.36544,10.88557
Augsburg Hbf,554,48.36544,10.88557
Augsburg Hbf,792,48.36544,10.88557
Augsburg Hbf,90,48.36544,10.88557
Augustfehn,301,53.22089,7.759659
Augustfehn,988,53.22089,7.759659
Aulendorf,1090,47.953053,9.644046
Aulendorf,1150,47.953053,9.644046
Bad Bentheim,352,52.30985,7.158539
Bad Bentheim,885,52.30985,7.158539
Bad Bentheim(Gr),326,52.3091,7.04016
Bad Bevensen,693,53.078247,10.574141
Bad Bevensen,961,53.078247,10.574141
Bad Endorf,57,47.905067,12.301558
Bad Endorf,709,47.905067,12.301558
Bad Gastein,36,47.111744,13.132456
Bad Hersfeld,1041,50.869633,9.716182
Bad Hersfeld,138,50.869633,9.716182
Bad Hofgastein,1123,47.195713,13.100939
Bad Hofgastein,913,47.195713,13.100939
Bad Kleinen,1353,53.766975,11.466925
Bad Kleinen,959,53.766975,11.466925
Bad Krozingen,667,47.91972,7.697632
Bad Krozingen,75,47.91972,7.697632
Bad Nauheim,1012,50.367905,8.749334
Bad Nauheim,1369,50.367905,8.749334
Bad Oeynhausen,1207,52.2054,8.796523
Bad Oeynhausen,586,52.2054,8.796523
Bad Schandau,300,50.91929,14.137538
Bad Schandau,403,50.91929,14.137538
Bad Zwischenahn,1424,53.18255,8.003123
Baden-Baden,475,48.790325,8.190831
Baden-Baden,74,48.790325,8.190831
Bamberg,1300,49.90076,10.899489
Bamberg,974,49.90076,10.899489
Basel Bad Bf,1330,47.567287,7.607805
Basel Bad Bf,38,47.567287,7.607805
Basel SBB,436,47.547405,7.589551
Basel SBB,441,47.547405,7.589551
Basel SBB,453,47.547405,7.589551
Basel SBB,548,47.547405,7.589551
Basel SBB,668,47.547405,7.589551
Basel SBB,83,47.547405,7.589551
Basel SBB,932,47.547405,7.589551
Basel SBB,972,47.547405,7.589551
Bebra,1235,50.969566,9.797788
Bebra,616,50.969566,9.797788
Bebra,755,50.969566,9.797788
Bensheim,1386,49.681328,8.616717
Bensheim,782,49.681328,8.616717
Bergen auf Rügen,27,54.4205,13.417821
Bergen auf Rügen,869,54.4205,13.417821
Berlin Gesundbrunnen,349,52.54896,13.388513
Berlin Gesundbrunnen,4,52.54896,13.388513
Berlin Gesundbrunnen,529,52.54896,13.388513
Berlin Gesundbrunnen,666,52.54896,13.388513
Berlin Gesundbrunnen,68,52.54896,13.388513
Berlin Gesundbrunnen,816,52.54896,13.388513
Berlin Gesundbrunnen,886,52.54896,13.388513
Berlin Hbf,1254,52.525593,13.369545
Berlin Hbf,239,52.525593,13.369545
Berlin Hbf,625,52.525593,13.369545
Berlin Hbf,821,52.525593,13.369545
Berlin Hbf (tief),1035,52.525593,13.369545
Berlin Hbf (tief),1244,52.525593,13.369545
Berlin Hbf (tief),1250,52.525593,13.369545
Berlin Hbf (tief),1332,52.525593,13.369545
Berlin Hbf (tief),1338,52.525593,13.369545
Berlin Hbf (tief),185,52.525593,13.369545
Berlin Hbf (tief),549,52.525593,13.369545
Berlin Hbf (tief),629,52.525593,13.369545
Berlin Hbf (tief),684,52.525593,13.369545
Berlin Ostbahnhof,104,52.510487,13.434681
Berlin Ostbahnhof,1163,52.510487,13.434681
Berlin Ostbahnhof,1191,52.510487,13.434681
Berlin Ostbahnhof,1403,52.510487,13.434681
Berlin Ostbahnhof,274,52.510487,13.434681
Berlin Ostbahnhof,994,52.510487,13.434681
Berlin Ostkreuz,1000,52.503036,13.469105
Berlin Ostkreuz,1019,52.503036,13.469105
Berlin Südkreuz,1091,52.475048,13.365319
Berlin Südkreuz,1181,52.475048,13.365319
Berlin Südkreuz,1350,52.475048,13.365319
Berlin Südkreuz,482,52.475048,13.365319
Berlin Südkreuz,662,52.475048,13.365319
Berlin Südkreuz,805,52.475048,13.365319
Berlin Südkreuz,832,52.475048,13.365319
Berlin Wannsee,1280,52.42097,13.179528
Berlin Wannsee,131,52.42097,13.179528
Berlin Zoologischer Garten,1037,52.50728,13.331992
Berlin Zoologischer Garten,29,52.50728,13.331992
Berlin Zoologischer Garten,460,52.50728,13.331992
Berlin Zoologischer Garten,704,52.50728,13.331992
Berlin-Lichtenberg,15,52.510136,13.496693
Berlin-Spandau,454,52.53465,13.196898
Berlin-Spandau,575,52.53465,13.196898
Berlin-Spandau,679,52.53465,13.196898
Berlin-Spandau,955,52.53465,13.196898
Bern,100,46.948833,7.439131
Bern,1138,46.948833,7.439131
Bern,1151,46.948833,7.439131
Bern,725,46.948833,7.439131
Bernau(b Berlin),1014,52.675568,13.592641
Bernau(b Berlin),20,52.675568,13.592641
Biberach(Riß),14,48.101845,9.793127
Biberach(Riß),947,48.101845,9.793127
Bielefeld Hbf,379,52.029263,8.532722
Bielefeld Hbf,408,52.029263,8.532722
Bielefeld Hbf,687,52.029263,8.532722
Bingen(Rhein) Hbf,67,49.968727,7.884263
Bingen(Rhein) Hbf,86,49.968727,7.884263
Bischofshofen,1339,47.41786,13.219888
Bischofshofen,797,47.41786,13.219888
Bitterfeld,133,51.62286,12.31685
Bitterfeld,236,51.62286,12.31685
Bitterfeld,40,51.62286,12.31685
Bitterfeld,901,51.62286,12.31685
Bludenz,353,47.154724,9.814564
Bludenz,891,47.154724,9.814564
Bochnia,385,49.9773,20.430775
Bochum Hbf,1161,51.478607,7.223275
Bochum Hbf,1256,51.478607,7.223275
Bochum Hbf,137,51.478607,7.223275
Bochum Hbf,452,51.478607,7.223275
Bohumin,1320,49.90073,18.359444
Bohumin(Gr),819,49.916576,18.322226
Bologna Centrale,13,44.50614,11.343411
Bolzano/Bozen,812,46.496376,11.358791
Bondorf(b Herrenberg),1154,48.523552,8.827662
Bondorf(b Herrenberg),281,48.523552,8.827662
Bonn Hbf,1118,50.73201,7.097136
Bonn Hbf,124,50.73201,7.097136
Bonn Hbf,190,50.73201,7.097136
Bonn-Bad Godesberg,1418,50.683926,7.159555
Bonn-Beuel,196,50.738476,7.127657
Bonn-Beuel,673,50.738476,7.127657
Borovnica,1073,45.921318,14.367972
Brandenburg Hbf,1346,52.400555,12.566138
Brandenburg Hbf,764,52.400555,12.566138
Brandenburg Hbf,914,52.400555,12.566138
Bratislava hl.st.,397,48.15891,17.106466
Braunschweig Hbf,275,52.252216,10.540295
Braunschweig Hbf,77,52.252216,10.540295
Breclav,980,48.7539,16.893236
Breclav(Gr),831,48.71255,16.868402
Bregenz,1070,47.503002,9.739627
Bregenz,1225,47.503002,9.739627
Bregenz,1314,47.503002,9.739627
Bregenz,854,47.503002,9.739627
Bregenz,862,47.503002,9.739627
Bregenz,98,47.503002,9.739627
Bremen Hbf,1126,53.08348,8.813834
Bremen Hbf,1356,53.08348,8.813834
Bremen Hbf,1360,53.08348,8.813834
Bremen Hbf,416,53.08348,8.813834
Bremen Hbf,461,53.08348,8.813834
Bremen Hbf,494,53.08348,8.813834
Bremen Hbf,87,53.08348,8.813834
Bremen Hbf,967,53.08348,8.813834
Bremerhaven Hbf,646,53.534912,8.599555
Bremerhaven Hbf,920,53.534912,8.599555
Bremerhaven-Lehe,1002,53.566322,8.600657
Bremerhaven-Lehe,1417,53.566322,8.600657
Brennero/Brenner,750,47.002342,11.505426
Bressanone/Brixen,732,46.709896,11.649764
Brno hl.n.,393,49.19054,16.612774
Bruchsal,1028,49.124622,8.589649
Bruchsal,1249,49.124622,8.589649
Bruchsal,703,49.124622,8.589649
Bruck/Mur,1309,47.41383,15.279433
Bruck/Mur,977,47.41383,15.279433
Bruxelles Midi,1036,50.835377,4.335694
Bruxelles Midi,1336,50.835377,4.335694
Bruxelles Midi,1404,50.835377,4.335694
Bruxelles Midi,323,50.835377,4.335694
Bruxelles Midi,481,50.835377,4.335694
Bruxelles Midi,65,50.835377,4.335694
Bruxelles Midi,874,50.835377,4.335694
Bruxelles-Nord,1065,50.860237,4.361454
Bruxelles-Nord,555,50.860237,4.361454
Bruxelles-Nord,906,50.860237,4.361454
Brzeg,230,50.85297,17.471178
Buchloe,1167,48.033722,10.716217
Buchloe,28,48.033722,10.716217
Buchloe,330,48.033722,10.716217
Buchloe,402,48.033722,10.716217
Budapest-Déli,1119,47.498535,19.025288
Budapest-Kelenföld,303,47.464355,19.020456
Budapest-Keleti,1272,47.50038,19.085072
Budapest-Nyugati,387,47.510708,19.057467
Bydgoszcz Glowna,443,53.135113,17.991636
Böblingen,363,48.68776,9.004128
Böblingen,531,48.68776,9.004128
Böblingen,670,48.68776,9.004128
Büchen,19,53.47497,10.623298
Büchen,226,53.47497,10.623298
Bünde(Westf),206,52.202076,8.573876
Bünde(Westf),483,52.202076,8.573876
Bützow,1170,53.837112,11.998194
Bützow,132,53.837112,11.998194
Celle,611,52.620457,10.062468
Celle,665,52.620457,10.062468
Chalupki,125,49.925476,18.311562
Chur,1072,46.853085,9.528938
Chur,859,46.853085,9.528938
Coburg,1419,50.262928,10.957328
Coburg,595,50.262928,10.957328
Cottbus Hbf,148,51.750957,14.324162
Cottbus Hbf,601,51.750957,14.324162
Crailsheim,1074,49.13787,10.064326
Crailsheim,1342,49.13787,10.064326
Darmstadt Hbf,1049,49.8725,8.629636
Darmstadt Hbf,39,49.8725,8.629636
Darmstadt Hbf,492,49.8725,8.629636
Darmstadt Hbf,659,49.8725,8.629636
Debica,1136,50.054417,21.405565
Decin hl.n.,427,50.773415,14.201247
Delmenhorst,1084,53.05279,8.629758
Delmenhorst,690,53.05279,8.629758
Dessau Hbf,30,51.839867,12.234945
Dessau Hbf,855,51.839867,12.234945
Deventer,102,52.257435,6.160506
Deventer,280,52.257435,6.160506
Deventer,563,52.257435,6.160506
Diepholz,456,52.60477,8.380334
Dillenburg,1031,50.734882,8.294088
Dillenburg,1202,50.734882,8.294088
Doberlug-Kirchhain,775,51.620575,13.564241
Doberlug-Kirchhain,970,51.620575,13.564241
Dobova,1197,45.89839,15.655178
Dobova(Gr),1152,45.890633,15.680238
Donaueschingen,538,47.947784,8.498919
Donaueschingen,888,47.947784,8.498919
Donauwörth,342,48.714027,10.771443
Dorfgastein,229,47.23867,13.103062
Dorfgastein,533,47.23867,13.103062
Dornbirn,263,47.41769,9.738808
Dornbirn,569,47.41769,9.738808
Dortmund Hbf,1062,51.517895,7.45929
Dortmund Hbf,1321,51.517895,7.45929
Dortmund Hbf,184,51.517895,7.45929
Dortmund Hbf,380,51.517895,7.45929
Dortmund Hbf,565,51.517895,7.45929
Dortmund Hbf,989,51.517895,7.45929
Dresden Hbf,356,51.04056,13.732035
Dresden Hbf,41,51.04056,13.732035
Dresden Hbf,521,51.04056,13.732035
Dresden-Neustadt,1262,51.0659,13.740701
Dresden-Neustadt,175,51.0659,13.740701
Dresden-Neustadt,485,51.0659,13.740701
Dresden-Neustadt,543,51.0659,13.740701
Duisburg Hbf,1283,51.429787,6.775903
Duisburg Hbf,1376,51.429787,6.775903
Duisburg Hbf,298,51.429787,6.775903
Duisburg Hbf,324,51.429787,6.775903
Duisburg Hbf,527,51.429787,6.775903
Duisburg Hbf,712,51.429787,6.775903
Duisburg Hbf,807,51.429787,6.775903
Duisburg Hbf,908,51.429787,6.775903
Düren,1394,50.809517,6.482451
Düren,769,50.809517,6.482451
Düsseldorf Flughafen,130,51.292007,6.786836
Düsseldorf Flughafen,428,51.292007,6.786836
Düsseldorf Hbf,1054,51.219963,6.794319
Düsseldorf Hbf,1297,51.219963,6.794319
Düsseldorf Hbf,1401,51.219963,6.794319
Düsseldorf Hbf,154,51.219963,6.794319
Düsseldorf Hbf,89,51.219963,6.794319
Düsseldorf Hbf,916,51.219963,6.794319
Düsseldorf Hbf,966,51.219963,6.794319
Eberswalde Hbf,508,52.834023,13.797062
Eberswalde Hbf,839,52.834023,13.797062
Eisenach,391,50.97692,10.331986
Eisenach,559,50.97692,10.331986
Ellwangen,681,48.964123,10.129681
Elsterwerda,1355,51.45968,13.516428
Elsterwerda,310,51.45968,13.516428
Elsterwerda,413,51.45968,13.516428
Elze(Han),1173,52.120148,9.746894
Elze(Han),1351,52.120148,9.746894
Emden Außenhafen,315,53.344467,7.186179
Emden Hbf,1382,53.369038,7.195176
Emden Hbf,202,53.369038,7.195176
Emden Hbf,435,53.369038,7.195176
Emden Hbf,99,53.369038,7.195176
Emmerich(Gr),1212,51.901196,6.137652
Engen,25,47.856346,8.772786
Engen,357,47.856346,8.772786
Erfurt Hbf,1259,50.97255,11.038499
Ergenzingen,1184,48.489532,8.809857
Ergenzingen,849,48.489532,8.809857
Erkelenz,1201,51.076565,6.32172
Erkelenz,238,51.076565,6.32172
Erlangen,1046,49.59583,11.001638
Erlangen,1100,49.59583,11.001638
Essen Hbf,1017,51.451355,7.014793
Essen Hbf,1411,51.451355,7.014793
Essen Hbf,591,51.451355,7.014793
Essen Hbf,899,51.451355,7.014793
Esslingen(Neckar),962,48.73881,9.30008
Eutingen im Gäu,1064,48.479954,8.782236
Eutingen im Gäu,418,48.479954,8.782236
Faak am See,97,46.56437,13.913006
Fehmarn-Burg,486,54.443592,11.18898
Feldkirch,1328,47.24098,9.604102
Feldkirch,55,47.24098,9.604102
Finnentrop,1229,51.173046,7.964563
Finnentrop,1273,51.173046,7.964563
Fischen,631,47.456593,10.271717
Flensburg,612,54.77404,9.436526
Flensburg(Gr),562,54.814842,9.36324
Flughafen BER - Terminal 1-2,1343,52.364803,13.51195
Flughafen BER - Terminal 1-2,272,52.364803,13.51195
Forbach(F),717,49.189217,6.900258
Forbach(fr),1398,49.21409,6.944314
Fortezza/Franzensfeste,1234,46.78872,11.610083
Frankfurt(M) Flughafen Fernbf,170,50.053165,8.570185
Frankfurt(M) Flughafen Fernbf,404,50.053165,8.570185
Frankfurt(M) Flughafen Fernbf,570,50.053165,8.570185
Frankfurt(M) Flughafen Fernbf,9,50.053165,8.570185
Frankfurt(M) Flughafen Regionalbf,440,50.05122,8.571251
Frankfurt(M) Flughafen Regionalbf,981,50.05122,8.571251
Frankfurt(Main)Hbf,1215,50.107143,8.663789
Frankfurt(Main)Hbf,1299,50.107143,8.663789
Frankfurt(Main)Hbf,134,50.107143,8.663789
Frankfurt(Main)Hbf,197,50.107143,8.663789
Frankfurt(Main)Hbf,255,50.107143,8.663789
Frankfurt(Main)Hbf,316,50.107143,8.663789
Frankfurt(Main)Hbf,396,50.107143,8.663789
Frankfurt(Main)Hbf,406,50.107143,8.663789
Frankfurt(Main)Hbf,500,50.107143,8.663789
Frankfurt(Main)Hbf,506,50.107143,8.663789
Frankfurt(Main)Hbf,507,50.107143,8.663789
Frankfurt(Main)Hbf,556,50.107143,8.663789
Frankfurt(Main)Hbf,626,50.107143,8.663789
Frankfurt(Main)Hbf,633,50.107143,8.663789
Frankfurt(Main)Hbf,702,50.107143,8.663789
Frankfurt(Main)Hbf,738,50.107143,8.663789
Frankfurt(Main)Hbf,758,50.107143,8.663789
Frankfurt(Main)Hbf,802,50.107143,8.663789
Frankfurt(Main)Hbf,927,50.107143,8.663789
Frankfurt(Main)Hbf,95,50.107143,8.663789
Frankfurt(Main)Hbf,969,50.107143,8.663789
Frankfurt(Main)Hbf,978,50.107143,8.663789
Frankfurt(Main)Hbf,987,50.107143,8.663789
Frankfurt(Main)Süd,1159,50.099365,8.686457
Frankfurt(Main)Süd,1295,50.099365,8.686457
Frankfurt(Main)Süd,143,50.099365,8.686457
Frankfurt(Main)Süd,656,50.099365,8.686457
Frankfurt(Main)West,432,50.118862,8.639335
Frankfurt(Main)West,939,50.118862,8.639335
Frankfurt(Oder),1033,52.336414,14.546496
Frankfurt(Oder),289,52.336414,14.546496
Frankfurt(Oder),327,52.336414,14.546496
Frankfurt(Oder)(Gr),1189,52.321175,14.576403
Fredericia st,1051,55.56809,9.738813
Fredericia st,1087,55.56809,9.738813
Fredericia st,624,55.56809,9.738813
Freiburg(Breisgau) Hbf,1131,47.997696,7.84117
Freiburg(Breisgau) Hbf,466,47.997696,7.84117
Freiburg(Breisgau) Hbf,541,47.997696,7.84117
Freilassing,103,47.836918,12.977193
Freilassing,1413,47.836918,12.977193
Freilassing,287,47.836918,12.977193
Freilassing,386,47.836918,12.977193
Friedberg(Hess),1390,50.332607,8.762056
Friedberg(Hess),743,50.332607,8.762056
Friedberg(Hess),81,50.332607,8.762056
Friedrichshafen Stadt,424,47.653225,9.4739
Friedrichshafen Stadt,996,47.653225,9.4739
Fulda,1305,50.55472,9.683977
Fulda,21,50.55472,9.683977
Fulda,574,50.55472,9.683977
Fulda,734,50.55472,9.683977
Fulda,918,50.55472,9.683977
Fürth(Bay)Hbf,1057,49.469707,10.989988
Garmisch-Partenkirchen,31,47.49145,11.097013
Garmisch-Partenkirchen,761,47.49145,11.097013
Garmisch-Partenkirchen,875,47.49145,11.097013
Gdansk Glowny,6,54.35552,18.643803
Gdansk Oliwa,661,54.409893,18.571741
Gdansk Wrzeszcz,178,54.38186,18.605434
Gdynia Glowna,1165,54.52084,18.529556
Geilenkirchen,1192,50.96104,6.124518
Geilenkirchen,711,50.96104,6.124518
Geislingen(Steige),92,48.619358,9.841941
Geislingen(Steige),953,48.619358,9.841941
Gelsenkirchen Hbf,183,51.5049,7.102455
Gelsenkirchen Hbf,312,51.5049,7.102455
Gelsenkirchen Hbf,314,51.5049,7.102455
Gelsenkirchen Hbf,487,51.5049,7.102455
Gelsenkirchen Hbf,599,51.5049,7.102455
Gelsenkirchen Hbf,696,51.5049,7.102455
Gera Hbf,1038,50.883423,12.077092
Gera Hbf,364,50.883423,12.077092
Gera Hbf,741,50.883423,12.077092
Gießen,1130,50.57906,8.661462
Gießen,1276,50.57906,8.661462
Gliwice,1111,50.301105,18.677158
Glogow,924,51.668957,16.079712
Gniezno,587,52.52965,17.602184
Golling-Abtenau,1326,47.600574,13.164086
Golling-Abtenau,590,47.600574,13.164086
Gotha,101,50.93907,10.712568
Gotha,1013,50.93907,10.712568
Gotha,228,50.93907,10.712568
Gotha,605,50.93907,10.712568
Graz Hbf,515,47.072296,15.416437
Graz Hbf,675,47.072296,15.416437
Graz Hbf,868,47.072296,15.416437
Greifswald,762,54.092922,13.370262
Greifswald,965,54.092922,13.370262
Györ,372,47.68198,17.63479
Gäufelden,971,48.55966,8.850308
Gäufelden,990,48.55966,8.850308
Göppingen,142,48.700027,9.651969
Göppingen,157,48.700027,9.651969
Göppingen,550,48.700027,9.651969
Göttingen,1153,51.536816,9.926072
Göttingen,1241,51.536816,9.926072
Göttingen,16,51.536816,9.926072
Göttingen,496,51.536816,9.926072
Göttingen,568,51.536816,9.926072
Göttingen,607,51.536816,9.926072
Göttingen,714,51.536816,9.926072
Götzis,540,47.33661,9.636696
Günzburg,351,48.460564,10.279262
Günzburg,986,48.460564,10.279262
Gütersloh Hbf,156,51.90694,8.385071
Gütersloh Hbf,806,51.90694,8.385071
Haffkrug,1129,54.054188,10.742682
Haffkrug,26,54.054188,10.742682
Hagen Hbf,1196,51.362747,7.460249
Hagen Hbf,1240,51.362747,7.460249
Hagen Hbf,1313,51.362747,7.460249
Hagen Hbf,167,51.362747,7.460249
Hagen Hbf,756,51.362747,7.460249
Hagen Hbf,76,51.362747,7.460249
Hagen Hbf,843,51.362747,7.460249
Haiger,879,50.741352,8.220657
Halle(Saale)Hbf,114,51.47751,11.987085
Halle(Saale)Hbf,368,51.47751,11.987085
Halle(Saale)Hbf,721,51.47751,11.987085
Halle(Saale)Hbf,998,51.47751,11.987085
Hallein,224,47.68517,13.099434
Hallein,578,47.68517,13.099434
Hamburg Dammtor,1293,53.560753,9.989566
Hamburg Dammtor,376,53.560753,9.989566
Hamburg Hbf,1053,53.552734,10.006909
Hamburg Hbf,1106,53.552734,10.006909
Hamburg Hbf,1162,53.552734,10.006909
Hamburg Hbf,1370,53.552734,10.006909
Hamburg Hbf,1384,53.552734,10.006909
Hamburg Hbf,346,53.552734,10.006909
Hamburg Hbf,445,53.552734,10.006909
Hamburg Hbf,458,53.552734,10.006909
Hamburg Hbf,49,53.552734,10.006909
Hamburg Hbf,588,53.552734,10.006909
Hamburg Hbf,645,53.552734,10.006909
Hamburg Hbf,663,53.552734,10.006909
Hamburg Hbf,694,53.552734,10.006909
Hamburg Hbf,824,53.552734,10.006909
Hamburg Hbf,983,53.552734,10.006909
Hamburg-Altona,1055,53.552696,9.935175
Hamburg-Altona,108,53.552696,9.935175
Hamburg-Altona,219,53.552696,9.935175
Hamburg-Altona,225,53.552696,9.935175
Hamburg-Altona,282,53.552696,9.935175
Hamburg-Altona,498,53.552696,9.935175
Hamburg-Altona,713,53.552696,9.935175
Hamburg-Altona,942,53.552696,9.935175
Hamburg-Altona,976,53.552696,9.935175
Hamburg-Bergedorf,215,53.489834,10.206171
Hamburg-Bergedorf,359,53.489834,10.206171
Hamburg-Harburg,1209,53.45591,9.991701
Hamburg-Harburg,1274,53.45591,9.991701
Hamburg-Harburg,592,53.45591,9.991701
Hamburg-Harburg,695,53.45591,9.991701
Hamburg-Harburg,71,53.45591,9.991701
Hamburg-Harburg,786,53.45591,9.991701
Hamm(Westf)Hbf,1109,51.678078,7.807821
Hamm(Westf)Hbf,1199,51.678078,7.807821
Hamm(Westf)Hbf,1315,51.678078,7.807821
Hamm(Westf)Hbf,1387,51.678078,7.807821
Hamm(Westf)Hbf,2,51.678078,7.807821
Hamm(Westf)Hbf,844,51.678078,7.807821
Hanau Hbf,1039,50.120953,8.929
Hanau Hbf,1354,50.120953,8.929
Hanau Hbf,164,50.120953,8.929
Hanau Hbf,438,50.120953,8.929
Hanau Hbf,512,50.120953,8.929
Hanau Hbf,545,50.120953,8.929
Hannover Hbf,1303,52.376762,9.741021
Hannover Hbf,1379,52.376762,9.741021
Hannover Hbf,1409,52.376762,9.741021
Hannover Hbf,207,52.376762,9.741021
Hannover Hbf,234,52.376762,9.741021
Hannover Hbf,37,52.376762,9.741021
Hannover Hbf,476,52.376762,9.741021
Hannover Hbf,514,52.376762,9.741021
Hannover Hbf,593,52.376762,9.741021
Hannover Hbf,644,52.376762,9.741021
Hannover Messe/Laatzen,544,52.3169,9.792863
Hausach,192,48.284924,8.181665
Hausach,671,48.284924,8.181665
Hegyeshalom,840,47.913506,17.14702
Hegyeshalom(Gr),658,47.93826,17.095844
Heide(Holst),1156,54.19356,9.101029
Heide(Holst),632,54.19356,9.101029
Heidelberg Hbf,1010,49.40357,8.675442
Heidelberg Hbf,1171,49.40357,8.675442
Heidelberg Hbf,1426,49.40357,8.675442
Heidelberg Hbf,262,49.40357,8.675442
Heidelberg Hbf,509,49.40357,8.675442
Heidelberg Hbf,510,49.40357,8.675442
Heidelberg Hbf,585,49.40357,8.675442
Helmstedt,1231,52.222088,11.010553
Helmstedt,8,52.222088,11.010553
Hengelo,117,52.261852,6.793726
Hengelo,355,52.261852,6.793726
Hengelo,627,52.261852,6.793726
Heppenheim(Bergstr),853,49.641552,8.633379
Heppenheim(Bergstr),895,49.641552,8.633379
Herborn(Dillkr),1255,50.684406,8.30814
Herford,1076,52.11961,8.663643
Herford,536,52.11961,8.663643
Hermsdorf-Klosterlausnitz,35,50.903778,11.858626
Hermsdorf-Klosterlausnitz,400,50.903778,11.858626
Herrenberg,1040,48.59399,8.862662
Herrenberg,7,48.59399,8.862662
Herzogenrath,1292,50.870914,6.094486
Herzogenrath,473,50.870914,6.094486
Hildesheim Gbf,1032,52.157387,9.942379
Hildesheim Hbf,1172,52.160625,9.953497
Hildesheim Hbf,415,52.160625,9.953497
Hilversum,647,52.22667,5.181399
Hilversum,727,52.22667,5.181399
Hohenems,553,47.364708,9.681001
Homburg(Saar)Hbf,118,49.328083,7.337035
Homburg(Saar)Hbf,780,49.328083,7.337035
Horb,469,48.44147,8.688982
Horb,54,48.44147,8.688982
Hornberg(Schwarzw),1097,48.211895,8.23294
Hornberg(Schwarzw),1377,48.211895,8.23294
Horsens st,943,55.86279,9.8355
Horsens st,960,55.86279,9.8355
Hude,1081,53.10943,8.460956
Hude,17,53.10943,8.460956
Husum,111,54.47227,9.055026
Husum,1375,54.47227,9.055026
Husum,463,54.47227,9.055026
Hünfeld,1349,50.67327,9.762453
Hünfeld,153,50.67327,9.762453
Ibbenbüren,1075,52.276867,7.721486
Ilirska Bistrica,172,45.569275,14.236037
Immendingen,796,47.93601,8.729536
Immendingen,85,47.93601,8.729536
Immenstadt,818,47.559204,10.213999
Immenstadt,890,47.559204,10.213999
Imst-Pitztal,32,47.219074,10.76167
Ingolstadt Hbf,1102,48.74454,11.437337
Ingolstadt Hbf,247,48.74454,11.437337
Ingolstadt Hbf,347,48.74454,11.437337
Innsbruck Hbf,307,47.26333,11.40051
Innsbruck Hbf,34,47.26333,11.40051
Innsbruck Hbf,683,47.26333,11.40051
Innsbruck Hbf,887,47.26333,11.40051
Innsbruck Hbf,96,47.26333,11.40051
Inowroclaw,341,52.804947,18.24406
Interlaken Ost,1318,46.6905,7.869
Interlaken Ost,450,46.6905,7.869
Interlaken West,122,46.68295,7.851366
Interlaken West,1304,46.68295,7.851366
Itzehoe,1108,53.923874,9.510287
Itzehoe,827,53.923874,9.510287
Jaroslaw,833,50.01067,22.677896
Jena Paradies,1261,50.924854,11.587461
Jena Paradies,798,50.924854,11.587461
Jena Paradies,866,50.924854,11.587461
Jena West,1180,50.923286,11.577848
Jena West,144,50.923286,11.577848
Jena-Göschwitz,1121,50.88394,11.593537
Jena-Göschwitz,179,50.88394,11.593537
Jena-Göschwitz,465,50.88394,11.593537
Jena-Göschwitz,480,50.88394,11.593537
Jenbach,1296,47.388447,11.778454
Jenbach,5,47.388447,11.778454
Jesenice(Gr),1327,46.48141,14.020333
Jesenice(SL),1204,46.436325,14.054913
Jurdani,1253,45.39309,14.308552
Kaiserslautern Hbf,222,49.43614,7.768716
Kaiserslautern Hbf,384,49.43614,7.768716
Kapfenberg,317,47.44512,15.292088
Kapfenberg,771,47.44512,15.292088
Karlsruhe Hbf,1144,48.993515,8.402181
Karlsruhe Hbf,1221,48.993515,8.402181
Karlsruhe Hbf,1243,48.993515,8.402181
Karlsruhe Hbf,1294,48.993515,8.402181
Karlsruhe Hbf,1408,48.993515,8.402181
Karlsruhe Hbf,267,48.993515,8.402181
Karlsruhe Hbf,388,48.993515,8.402181
Karlsruhe Hbf,736,48.993515,8.402181
Karlsruhe Hbf,737,48.993515,8.402181
Karlsruhe Hbf,88,48.993515,8.402181
Karlsruhe Hbf,938,48.993515,8.402181
Karlsruhe Hbf,992,48.993515,8.402181
Karlsruhe-Durlach,1316,49.002327,8.462822
Karlsruhe-Durlach,519,49.002327,8.462822
Karlsruhe-Durlach,589,49.002327,8.462822
Karlsruhe-Durlach,698,49.002327,8.462822
Kassel-Wilhelmshöhe,1233,51.313114,9.446898
Kassel-Wilhelmshöhe,1252,51.313114,9.446898
Kassel-Wilhelmshöhe,242,51.313114,9.446898
Kassel-Wilhelmshöhe,459,51.313114,9.446898
Kassel-Wilhelmshöhe,539,51.313114,9.446898
Kassel-Wilhelmshöhe,933,51.313114,9.446898
Katowice,770,50.257515,19.017164
Kaufbeuren,688,47.87543,10.629496
Kaufbeuren,902,47.87543,10.629496
Kedzierzyn Kozle,1155,50.34436,18.204765
Kehl(Gr),337,48.575645,7.801118
Keitum,423,54.888813,8.368969
Keitum,751,54.888813,8.368969
Kempten(Allgäu)Hbf,1415,47.711746,10.31761
Kempten(Allgäu)Hbf,499,47.711746,10.31761
Kiel Hbf,69,54.314983,10.131976
Kiel Hbf,975,54.314983,10.131976
Klagenfurt Hbf,641,46.615585,14.313569
Klanxbüll,1258,54.861996,8.676454
Klanxbüll,374,54.861996,8.676454
Koblenz Hbf,1140,50.35093,7.588345
Koblenz Hbf,1364,50.35093,7.588345
Koblenz Hbf,203,50.35093,7.588345
Koblenz Hbf,361,50.35093,7.588345
Koblenz Hbf,842,50.35093,7.588345
Koebenhavn H,1245,55.67272,12.564617
Koebenhavn H,686,55.67272,12.564617
Koebenhavn H,748,55.67272,12.564617
Kolding st,22,55.49084,9.481528
Kolding st,795,55.49084,9.481528
Konin,926,52.231396,18.253336
Konstanz,112,47.658752,9.177312
Konstanz,448,47.658752,9.177312
Krakow Glowny,594,50.067196,19.947426
Krakow Plaszow,220,50.03509,19.974894
Kranj,664,46.23901,14.348167
Krefeld Hbf,1317,51.325718,6.569885
Krefeld Hbf,746,51.325718,6.569885
Kreiensen,128,51.85142,9.967798
Kreiensen,708,51.85142,9.967798
Kreiensen,776,51.85142,9.967798
Kreuztal,1223,50.956028,7.991696
Kreuztal,822,50.956028,7.991696
Kronach,126,50.239613,11.320115
Kronach,794,50.239613,11.320115
Krsko,390,45.95624,15.493454
Krumpendorf/Wörthersee,1128,46.62633,14.221512
Krumpendorf/Wörthersee,1308,46.62633,14.221512
Kufstein,1045,47.58308,12.16555
Kufstein,261,47.58308,12.16555
Kutno,1383,52.226963,19.348616
Kuty,46,48.661892,17.047695
Kuty(Gr),649,48.71108,17.000406
Köln Hbf,1003,50.94303,6.958729
Köln Hbf,1047,50.94303,6.958729
Köln Hbf,1115,50.94303,6.958729
Köln Hbf,1210,50.94303,6.958729
Köln Hbf,1218,50.94303,6.958729
Köln Hbf,1242,50.94303,6.958729
Köln Hbf,1282,50.94303,6.958729
Köln Hbf,1287,50.94303,6.958729
Köln Hbf,1324,50.94303,6.958729
Köln Hbf,204,50.94303,6.958729
Köln Hbf,223,50.94303,6.958729
Köln Hbf,299,50.94303,6.958729
Köln Hbf,328,50.94303,6.958729
Köln Hbf,331,50.94303,6.958729
Köln Hbf,394,50.94303,6.958729
Köln Hbf,411,50.94303,6.958729
Köln Hbf,426,50.94303,6.958729
Köln Hbf,431,50.94303,6.958729
Köln Hbf,719,50.94303,6.958729
Köln Hbf,730,50.94303,6.958729
Köln Hbf,871,50.94303,6.958729
Köln Messe/Deutz,233,50.940872,6.975001
Köln Messe/Deutz Gl.11-12,537,50.941723,6.974067
Köln Messe/Deutz Gl.11-12,760,50.941723,6.974067
Köln Messe/Deutz Gl.11-12,837,50.941723,6.974067
Köln-Ehrenfeld,1005,50.951534,6.917276
Köln-Ehrenfeld,777,50.951534,6.917276
Köln/Bonn Flughafen,412,50.878902,7.119302
Köln/Bonn Flughafen,772,50.878902,7.119302
Köln/Bonn Flughafen,999,50.878902,7.119302
Königs Wusterhausen,93,52.296635,13.631472
Köthen,573,51.75193,11.989358
Köthen,956,51.75193,11.989358
Lahr(Schwarzw),1307,48.340435,7.834734
Lahr(Schwarzw),484,48.340435,7.834734
Lancut,701,50.08143,22.227507
Landeck-Zams,1018,47.148243,10.578392
Landeck-Zams,217,47.148243,10.578392
Landquart,1016,46.96744,9.554045
Landquart,409,46.96744,9.554045
Landstuhl,1270,49.416286,7.565931
Langen am Arlberg,1363,47.13172,10.120375
Langen am Arlberg,660,47.13172,10.120375
Langenhagen Mitte,813,52.440277,9.725427
Langenhagen Mitte,905,52.440277,9.725427
Leer(Ostfriesl),1027,53.23165,7.465283
Leer(Ostfriesl),462,53.23165,7.465283
Leer(Ostfriesl),936,53.23165,7.465283
Legnica,784,51.21385,16.168922
Leipzig Hbf,201,51.34547,12.382064
Leipzig Hbf,227,51.34547,12.382064
Leipzig Hbf,371,51.34547,12.382064
Leipzig Hbf,455,51.34547,12.382064
Leipzig Hbf,606,51.34547,12.382064
Leipzig Hbf,718,51.34547,12.382064
Leipzig Hbf,722,51.34547,12.382064
Leipzig Hbf,80,51.34547,12.382064
Leipzig Hbf,937,51.34547,12.382064
Leipzig/Halle Flughafen,110,51.42334,12.223426
Leipzig/Halle Flughafen,240,51.42334,12.223426
Lennestadt-Altenhundem,210,51.104134,8.071517
Lennestadt-Altenhundem,270,51.104134,8.071517
Lennestadt-Grevenbrück,1042,51.14178,8.017977
Lennestadt-Grevenbrück,963,51.14178,8.017977
Leoben Hbf,1421,47.386604,15.089603
Leoben Hbf,621,47.386604,15.089603
Lesce-Bled,860,46.360416,14.157971
Letmathe,377,51.36284,7.618397
Letmathe,405,51.36284,7.618397
Leverkusen Mitte,1078,51.031513,6.991661
Lichtenfels,1105,50.146454,11.059472
Lichtenfels,332,50.146454,11.059472
Liestal,1095,47.484375,7.731353
Liestal,1288,47.484375,7.731353
Liestal,669,47.484375,7.731353
Liezen,1148,47.56271,14.241886
Limburg Süd,1135,50.3825,8.096112
Limburg Süd,150,50.3825,8.096112
Lindau-Reutin,1029,47.552383,9.703292
Lindau-Reutin,382,47.552383,9.703292
Lingen(Ems),354,52.519867,7.321731
Lingen(Ems),501,52.519867,7.321731
Linz Hbf,1096,48.29018,14.292131
Linz Hbf,1101,48.29018,14.292131
Linz Hbf,1176,48.29018,14.292131
Linz Hbf,246,48.29018,14.292131
Linz Hbf,291,48.29018,14.292131
Linz Hbf,744,48.29018,14.292131
Lippstadt,1079,51.67069,8.348785
Lippstadt,699,51.67069,8.348785
Liège-Guillemins,1067,50.62436,5.566483
Liège-Guillemins,1085,50.62436,5.566483
Liège-Guillemins,23,50.62436,5.566483
Ljubljana,1372,46.05869,14.512937
Lubin Gorniczy,1236,51.393955,16.195839
Ludwigsburg,1142,48.89186,9.18542
Ludwigshafen(Rh)Hbf,603,49.477985,8.433402
Ludwigslust,1158,53.33467,11.494491
Ludwigslust,231,53.33467,11.494491
Ludwigslust,609,53.33467,11.494491
Ludwigslust,778,53.33467,11.494491
Lunderskov st,1113,55.48012,9.303791
Lunderskov st,1198,55.48012,9.303791
Lunderskov st,253,55.48012,9.303791
Lutherstadt Wittenberg Hbf,151,51.86781,12.662285
Lutherstadt Wittenberg Hbf,566,51.86781,12.662285
Lübben(Spreewald),505,51.939735,13.877182
Lübben(Spreewald),651,51.939735,13.877182
Lübbenau(Spreewald),244,51.862167,13.9609
Lübbenau(Spreewald),304,51.862167,13.9609
Lübeck Hbf,1117,53.867546,10.669821
Lübeck Hbf,572,53.867546,10.669821
Lübeck Hbf,836,53.867546,10.669821
Lübeck Hbf,857,53.867546,10.669821
Lüneburg,1147,53.249657,10.41989
Lüneburg,1373,53.249657,10.41989
Lüneburg,1410,53.249657,10.41989
Lüneburg,728,53.249657,10.41989
Magdeburg Hbf,1011,52.13035,11.626891
Magdeburg Hbf,1208,52.13035,11.626891
Magdeburg Hbf,50,52.13035,11.626891
Magdeburg Hbf,654,52.13035,11.626891
Magdeburg Hbf,680,52.13035,11.626891
Magdeburg Hbf,993,52.13035,11.626891
Mainz Hbf,1206,50.001118,8.25872
Mainz Hbf,1341,50.001118,8.25872
Mainz Hbf,1347,50.001118,8.25872
Mainz Hbf,439,50.001118,8.25872
Mainz Hbf,640,50.001118,8.25872
Mallnitz-Obervellach,113,46.981213,13.176498
Mallnitz-Obervellach,171,46.981213,13.176498
Mannheim Hbf,1044,49.479355,8.468921
Mannheim Hbf,336,49.479355,8.468921
Mannheim Hbf,504,49.479355,8.468921
Mannheim Hbf,754,49.479355,8.468921
Mannheim Hbf,84,49.479355,8.468921
Mannheim Hbf,850,49.479355,8.468921
Marburg(Lahn),115,50.81927,8.775014
Marburg(Lahn),308,50.81927,8.775014
Marienhafe,1331,53.519238,7.27436
Marienhafe,442,53.519238,7.27436
Memmingen,48,47.98558,10.186853
Memmingen,740,47.98558,10.186853
Meppen,1388,52.696022,7.298015
Meppen,489,52.696022,7.298015
Metzingen(Württ),1193,48.539726,9.290156
Metzingen(Württ),155,48.539726,9.290156
Minden(Westf),401,52.29014,8.934728
Minden(Westf),650,52.29014,8.934728
Mittenwald,296,47.44003,11.265705
Mittenwald,783,47.44003,11.265705
Mittenwald(Gr),1217,47.39807,11.267441
Montabaur,146,50.444836,7.825333
Montabaur,622,50.444836,7.825333
Mosonmagyarovar,1385,47.850357,17.266424
Murnau,449,47.682266,11.192628
Murnau,488,47.682266,11.192628
Mönchengladbach Hbf,1230,51.196583,6.446111
Mönchengladbach Hbf,149,51.196583,6.446111
Mönchengladbach Hbf,576,51.196583,6.446111
Mönchengladbach Hbf,700,51.196583,6.446111
Mühlacker,1395,48.953194,8.846101
Mühlacker,47,48.953194,8.846101
Mülheim(Ruhr)Hbf,395,51.431343,6.88651
Mülheim(Ruhr)Hbf,551,51.431343,6.88651
Müllheim(Baden),169,47.809742,7.599332
Müllheim(Baden),252,47.809742,7.599332
München Hbf,1059,48.140232,11.558335
München Hbf,1247,48.140232,11.558335
München Hbf,139,48.140232,11.558335
München Hbf,1405,48.140232,11.558335
München Hbf,305,48.140232,11.558335
München Hbf,362,48.140232,11.558335
München Hbf,422,48.140232,11.558335
München Hbf,464,48.140232,11.558335
München Hbf,493,48.140232,11.558335
München Hbf,597,48.140232,11.558335
München Hbf,642,48.140232,11.558335
München Hbf,682,48.140232,11.558335
München Hbf,731,48.140232,11.558335
München Hbf,752,48.140232,11.558335
München Hbf,759,48.140232,11.558335
München Hbf,984,48.140232,11.558335
München Hbf,991,48.140232,11.558335
München Hbf Gl.27-36,1030,48.14153,11.556708
München Hbf Gl.27-36,1407,48.14153,11.556708
München Hbf Gl.27-36,166,48.14153,11.556708
München Hbf Gl.27-36,176,48.14153,11.556708
München Hbf Gl.27-36,517,48.14153,11.556708
München Hbf Gl.27-36,810,48.14153,11.556708
München Ost,1179,48.12744,11.604971
München Ost,214,48.12744,11.604971
München-Pasing,339,48.149853,11.461872
München-Pasing,564,48.149853,11.461872
München-Pasing,692,48.149853,11.461872
München-Pasing,903,48.149853,11.461872
Münster(Westf)Hbf,1125,51.956566,7.635715
Münster(Westf)Hbf,277,51.956566,7.635715
Münster(Westf)Hbf,389,51.956566,7.635715
Münster(Westf)Hbf,42,51.956566,7.635715
Münster(Westf)Hbf,491,51.956566,7.635715
Münster(Westf)Hbf,739,51.956566,7.635715
Mürzzuschlag,421,47.60795,15.677393
Mürzzuschlag,532,47.60795,15.677393
Naumburg(Saale)Hbf,630,51.16307,11.796984
Naumburg(Saale)Hbf,834,51.16307,11.796984
Neu-Edingen/Friedrichsfeld,581,49.44867,8.580125
Neu-Ulm,161,48.39304,10.004823
Neu-Ulm,258,48.39304,10.004823
Neumarkt/Wallersee,919,47.954674,13.224806
Neumünster,1052,54.075752,9.979816
Neumünster,1335,54.075752,9.979816
Neumünster,547,54.075752,9.979816
Neuss Hbf,835,51.20435,6.684527
Neustadt(Weinstr)Hbf,322,49.349552,8.140757
Neustadt(Weinstr)Hbf,369,49.349552,8.140757
Neustrelitz Hbf,1190,53.359257,13.074603
Neustrelitz Hbf,470,53.359257,13.074603
Neustrelitz Hbf,706,53.359257,13.074603
Niebüll,366,54.789604,8.834572
Niebüll,467,54.789604,8.834572
Niebüll,735,54.789604,8.834572
Nienburg(Weser),254,52.645565,9.217753
Nienburg(Weser),580,52.645565,9.217753
Norddeich,1134,53.62158,7.160824
Norddeich,1160,53.62158,7.160824
Norddeich Mole,689,53.624313,7.158806
Norden,399,53.588196,7.218913
Norden,677,53.588196,7.218913
Northeim(Han),106,51.70314,9.986618
Northeim(Han),208,51.70314,9.986618
Nove Zamky,251,47.995003,18.173956
Nürnberg Hbf,1,49.445618,11.082989
Nürnberg Hbf,1020,49.445618,11.082989
Nürnberg Hbf,1092,49.445618,11.082989
Nürnberg Hbf,1183,49.445618,11.082989
Nürnberg Hbf,1239,49.445618,11.082989
Nürnberg Hbf,173,49.445618,11.082989
Nürnberg Hbf,260,49.445618,11.082989
Nürnberg Hbf,276,49.445618,11.082989
Nürnberg Hbf,552,49.445618,11.082989
Nürnberg Hbf,615,49.445618,11.082989
Nürnberg Hbf,697,49.445618,11.082989
Nürnberg Hbf,801,49.445618,11.082989
Nürnberg Hbf,889,49.445618,11.082989
Nürnberg Hbf,951,49.445618,11.082989
Nürtingen,1164,48.628,9.342648
Nürtingen,925,48.628,9.342648
Oberhausen Hbf,1063,51.474876,6.851588
Oberhausen Hbf,135,51.474876,6.851588
Oberhausen Hbf,279,51.474876,6.851588
Oberhausen Hbf,848,51.474876,6.851588
Oberhausen Hbf,931,51.474876,6.851588
Oberndorf(Neckar),365,48.29567,8.575514
Oberndorf(Neckar),604,48.29567,8.575514
Oberstdorf,425,47.411034,10.278097
Oberstdorf,911,47.411034,10.278097
Odense st,1228,55.401775,10.386005
Odense st,781,55.401775,10.386005
Offenburg,1088,48.476475,7.946723
Offenburg,1400,48.476475,7.946723
Offenburg,757,48.476475,7.946723
Offenburg,878,48.476475,7.946723
Oldenburg(Holst),535,54.283825,10.882838
Oldenburg(Oldb),1422,53.14432,8.222713
Oldenburg(Oldb),212,53.14432,8.222713
Oldenburg(Oldb),60,53.14432,8.222713
Oldenburg(Oldb),63,53.14432,8.222713
Oldenburg(Oldb),648,53.14432,8.222713
Olten,1263,47.351936,7.9077
Olten,414,47.351936,7.9077
Olten,830,47.351936,7.9077
Opatija Matulji,715,45.3647,14.32098
Opole Glowne,213,50.661514,17.925863
Oranienburg,608,52.753654,13.249613
Oranienburg,617,52.753654,13.249613
Osnabrück Hbf,358,52.27285,8.061781
Osnabrück Hbf,58,52.27285,8.061781
Osnabrück Hbf,954,52.27285,8.061781
Osnabrück Hbf,995,52.27285,8.061781
Osterholz-Scharmbeck,1006,53.222775,8.797434
Osterholz-Scharmbeck,419,53.222775,8.797434
Ostrava hl.n.,1015,49.852085,18.267262
Ostseebad Binz,1238,54.40482,13.600507
Ostseebad Binz,285,54.40482,13.600507
Padborg st,325,54.82425,9.358803
Padborg st,343,54.82425,9.358803
Padborg st,691,54.82425,9.358803
Paderborn Hbf,1008,51.71298,8.740505
Paderborn Hbf,288,51.71298,8.740505
Padova,1352,45.417824,11.88062
Papenburg(Ems),1205,53.089706,7.386708
Papenburg(Ems),518,53.089706,7.386708
Paris Est,1374,48.876976,2.35912
Pasewalk,502,53.515354,13.988875
Pasewalk,790,53.515354,13.988875
Passau Hbf,165,48.57363,13.450776
Passau Hbf,542,48.57363,13.450776
Peine,188,52.318943,10.232145
Peine,571,52.318943,10.232145
Pforzheim Hbf,1099,48.894154,8.703099
Pforzheim Hbf,1378,48.894154,8.703099
Pivka,266,45.675255,14.191376
Plattling,1043,48.779617,12.86394
Plattling,867,48.779617,12.86394
Plettenberg,1104,51.23193,7.868913
Plettenberg,858,51.23193,7.868913
Plochingen,1089,48.71308,9.41081
Plochingen,1222,48.71308,9.41081
Plochingen,1257,48.71308,9.41081
Plochingen,1359,48.71308,9.41081
Plochingen,474,48.71308,9.41081
Postojna,1127,45.7731,14.221469
Potsdam Hbf,1365,52.39151,13.066703
Potsdam Hbf,273,52.39151,13.066703
Poznan Gl.,1285,52.401993,16.91087
Praha hl.n.,293,50.08306,14.436039
Praha-Holesovice,292,50.110214,14.440013
Prenzlau,1060,53.32161,13.866532
Prenzlau,765,53.32161,13.866532
Prien a Chiemsee,1082,47.855515,12.346615
Prien a Chiemsee,846,47.855515,12.346615
Przemysl Gl.,1367,49.78366,22.776363
Przeworsk,791,50.067215,22.503357
Pörtschach am Wörther See,1182,46.6362,14.146231
Pörtschach am Wörther See,530,46.6362,14.146231
Raciborz,766,50.09035,18.226397
Radolfzell,1157,47.735874,8.968984
Radolfzell,1264,47.735874,8.968984
Radstadt,10,47.38424,13.467809
Rankweil,168,47.273018,9.637252
Ravensburg,107,47.78448,9.6061
Ravensburg,934,47.78448,9.6061
Recklinghausen Hbf,1381,51.61636,7.20349
Recklinghausen Hbf,286,51.61636,7.20349
Regensburg Hbf,1149,49.011673,12.099617
Regensburg Hbf,1306,49.011673,12.099617
Remagen,1066,50.577213,7.229779
Remagen,345,50.577213,7.229779
Rendsburg,809,54.30226,9.671134
Rendsburg,900,54.30226,9.671134
Reutlingen Hbf,1246,48.49608,9.209116
Reutlingen Hbf,191,48.49608,9.209116
Rheine,1069,52.2763,7.434255
Rheine,1237,52.2763,7.434255
Rheine,471,52.2763,7.434255
Rheine,522,52.2763,7.434255
Rheydt Hbf,1112,51.16303,6.439564
Rheydt Hbf,579,51.16303,6.439564
Ribnitz-Damgarten Ost,79,54.251015,12.487015
Ribnitz-Damgarten West,1177,54.239178,12.436965
Ribnitz-Damgarten West,613,54.239178,12.436965
Riesa,1397,51.309654,13.287734
Riesa,639,51.309654,13.287734
Rijeka,250,45.330135,14.430337
Ringsted st,1048,55.438038,11.786155
Ringsted st,109,55.438038,11.786155
Ringsted st,152,55.438038,11.786155
Roedekro st,477,55.069687,9.332754
Roedekro st,982,55.069687,9.332754
Rosenheim,1393,47.850018,12.119202
Rosenheim,367,47.850018,12.119202
Rosenheim,652,47.850018,12.119202
Rosenheim,676,47.850018,12.119202
Rosenheim,72,47.850018,12.119202
Rostock Hbf,1098,54.078247,12.131079
Rostock Hbf,1122,54.078247,12.131079
Rostock Hbf,218,54.078247,12.131079
Rostock Hbf,284,54.078247,12.131079
Rostock Hbf,964,54.078247,12.131079
Rottweil,1094,48.165302,8.639295
Rottweil,1337,48.165302,8.639295
Rovereto,1007,45.89096,11.033601
Rzepin,429,52.350224,14.815073
Rzeszow Gl.,851,50.043114,22.006798
Saalfeld(Saale),256,50.650272,11.374583
Saalfeld(Saale),53,50.650272,11.374583
Saarbrücken Hbf,1195,49.241066,6.991021
Saarbrücken Hbf,1219,49.241066,6.991021
Saarbrücken Hbf,672,49.241066,6.991021
Salzburg Hbf,1203,47.81305,13.04582
Salzburg Hbf,1361,47.81305,13.04582
Salzburg Hbf,1380,47.81305,13.04582
Salzburg Hbf,268,47.81305,13.04582
Salzburg Hbf,62,47.81305,13.04582
Salzburg Hbf,64,47.81305,13.04582
Salzburg Hbf,745,47.81305,13.04582
Salzburg Hbf,768,47.81305,13.04582
Salzburg Hbf,973,47.81305,13.04582
Salzburg Süd,200,47.770226,13.078491
Salzburg Süd,753,47.770226,13.078491
Sapjane,582,45.477036,14.244352
Sapjane(Gr),1312,45.505157,14.244213
Sargans,1114,47.044823,9.44626
Sargans,1194,47.044823,9.44626
Schaffhausen,1311,47.69828,8.632756
Schaffhausen,321,47.69828,8.632756
Schaffhausen,779,47.69828,8.632756
Scharbeutz,1334,54.01874,10.745762
Scharbeutz,583,54.01874,10.745762
Schladming,1026,47.393826,13.678151
Schleswig,534,54.49946,9.53814
Schleswig,628,54.49946,9.53814
Schlüchtern,897,50.34118,9.510039
Schorndorf,249,48.80715,9.52631
Schorndorf,51,48.80715,9.52631
Schwarzach-St.Veit,1322,47.318535,13.154464
Schwarzach-St.Veit,841,47.318535,13.154464
Schwerin Hbf,1093,53.63474,11.407455
Schwerin Hbf,1414,53.63474,11.407455
Schwerin Hbf,265,53.63474,11.407455
Schwerin Hbf,528,53.63474,11.407455
Schwerte(Ruhr),1286,51.44228,7.55896
Schwerte(Ruhr),335,51.44228,7.55896
Schwäbisch Gmünd,407,48.80101,9.787795
Schwäbisch Gmünd,828,48.80101,9.787795
Schärding,457,48.46372,13.442511
Schärding,876,48.46372,13.442511
Schöna(Gr),444,50.860054,14.222133
Seefeld in Tirol,1310,47.32873,11.189483
Seefeld in Tirol,194,47.32873,11.189483
Seefeld in Tirol,767,47.32873,11.189483
Selzthal,209,47.550243,14.312841
Semmering,747,47.639553,15.830923
Sevnica,338,46.009678,15.301231
Siegburg/Bonn,557,50.793915,7.203026
Siegburg/Bonn,799,50.793915,7.203026
Siegen Hbf,129,50.87594,8.016508
Siegen Hbf,1420,50.87594,8.016508
Siegen Hbf,495,50.87594,8.016508
Siegen-Weidenau,1325,50.895966,8.029842
Siegen-Weidenau,560,50.895966,8.029842
Sierksdorf,907,54.068523,10.769108
Singen(Hohentwiel),1178,47.75844,8.840383
Singen(Hohentwiel),1214,47.75844,8.840383
Singen(Hohentwiel),723,47.75844,8.840383
Singen(Hohentwiel),94,47.75844,8.840383
Singen(Hohentwiel),948,47.75844,8.840383
Skanderborg st,318,56.043564,9.924497
Skanderborg st,447,56.043564,9.924497
Soest,1344,51.57842,8.104589
Soest,264,51.57842,8.104589
Solingen Hbf,1281,51.160767,7.004187
Solingen Hbf,726,51.160767,7.004187
Sonthofen,78,47.51324,10.272344
Sopot,1068,54.440166,18.562323
Spaichingen,420,48.06899,8.740147
Spaichingen,653,48.06899,8.740147
Spiez,121,46.686398,7.680103
Spiez,257,46.686398,7.680103
Spiez,946,46.686398,7.680103
Spittal-Millstättersee,410,46.7957,13.487416
Spittal-Millstättersee,873,46.7957,13.487416
St Georgen(Schwarzw),1086,48.123814,8.341955
St Georgen(Schwarzw),145,48.123814,8.341955
St. Anton am Arlberg,295,47.127563,10.26699
St. Anton am Arlberg,952,47.127563,10.26699
St. Gallen(CH),313,47.42318,9.369897
St. Gallen(CH),785,47.42318,9.369897
St. Gallen(CH),896,47.42318,9.369897
St. Johann im Pongau,1146,47.348377,13.194961
St. Johann im Pongau,344,47.348377,13.194961
St. Margrethen SG,526,47.453217,9.638262
St. Margrethen SG,678,47.453217,9.638262
St. Valentin,1124,48.179146,14.521846
St. Valentin,221,48.179146,14.521846
St.Michael in Obersteiermark,375,47.346622,15.009187
St.Pölten Hbf,162,48.2083,15.624672
St.Pölten Hbf,437,48.2083,15.624672
Stadt Rottenmann,915,47.52723,14.367174
Stadtroda,193,50.868217,11.722792
Stadtroda,360,50.868217,11.722792
Stainach-Irdning,634,47.529194,14.106753
Steinach(b Rothenburg ob der Tauber),804,49.453217,10.273535
Stendal Hbf,1023,52.594723,11.854412
Stendal Hbf,1139,52.594723,11.854412
Stendal Hbf,44,52.594723,11.854412
Stendal Hbf,997,52.594723,11.854412
Stralsund Hbf,1004,54.308624,13.077321
Stralsund Hbf,1166,54.308624,13.077321
Stralsund Hbf,1289,54.308624,13.077321
Stralsund Hbf,319,54.308624,13.077321
Stralsund Hbf,516,54.308624,13.077321
Stralsund Hbf,826,54.308624,13.077321
Strasbourg,1268,48.58534,7.734067
Straubing,1260,48.87698,12.574094
Straubing,370,48.87698,12.574094
Sturovo,928,47.800125,18.67992
Stuttgart Hbf,1211,48.784084,9.181635
Stuttgart Hbf,1213,48.784084,9.181635
Stuttgart Hbf,1232,48.784084,9.181635
Stuttgart Hbf,1275,48.784084,9.181635
Stuttgart Hbf,1290,48.784084,9.181635
Stuttgart Hbf,1348,48.784084,9.181635
Stuttgart Hbf,1391,48.784084,9.181635
Stuttgart Hbf,1406,48.784084,9.181635
Stuttgart Hbf,181,48.784084,9.181635
Stuttgart Hbf,417,48.784084,9.181635
Stuttgart Hbf,433,48.784084,9.181635
Stuttgart Hbf,497,48.784084,9.181635
Stuttgart Hbf,558,48.784084,9.181635
Stuttgart Hbf,825,48.784084,9.181635
Stuttgart Hbf,872,48.784084,9.181635
Stuttgart Hbf,950,48.784084,9.181635
Stuttgart-Vaihingen,1187,48.72628,9.113226
Stuttgart-Vaihingen,618,48.72628,9.113226
Sulz(Neckar),259,48.366486,8.636748
Swiebodzin,66,52.245144,15.53954
Szob(Gr),195,47.824898,18.844774
Tarnow,923,50.0054,20.97418
Tatabanya,1185,47.58493,18.393612
Tczew,1024,54.09732,18.790155
Telfs-Pfaffenhofen,1362,47.30071,11.078869
Telfs-Pfaffenhofen,278,47.30071,11.078869
Thun,1137,46.754692,7.629414
Thun,1266,46.754692,7.629414
Thun,350,46.754692,7.629414
Thun,561,46.754692,7.629414
Timmendorfer Strand,1301,53.994213,10.76227
Timmendorfer Strand,1329,53.994213,10.76227
Tinglev st,1227,54.936172,9.258234
Tinglev st,979,54.936172,9.258234
Traunstein,1358,47.869728,12.638801
Traunstein,847,47.869728,12.638801
Trento,1251,46.07229,11.1189
Treuchtlingen,1071,48.961266,10.908159
Treuchtlingen,1271,48.961266,10.908159
Treuchtlingen,24,48.961266,10.908159
Treuchtlingen,329,48.961266,10.908159
Treysa,309,50.91066,9.185673
Treysa,520,50.91066,9.185673
Triberg,1025,48.140003,8.236806
Triberg,789,48.140003,8.236806
Tullnerfeld,158,48.295235,15.996536
Tullnerfeld,763,48.295235,15.996536
Tuttlingen,1133,47.98058,8.798542
Tuttlingen,290,47.98058,8.798542
Tutzing,1116,47.907143,11.27289
Tutzing,189,47.907143,11.27289
Tübingen Hbf,378,48.515812,9.055407
Tübingen Hbf,392,48.515812,9.055407
Tübingen Hbf,930,48.515812,9.055407
Uelzen,383,52.96978,10.553053
Uelzen,910,52.96978,10.553053
Ulm Hbf,1120,48.399437,9.982227
Ulm Hbf,1169,48.399437,9.982227
Ulm Hbf,610,48.399437,9.982227
Ulm Hbf,705,48.399437,9.982227
Ulm Hbf,800,48.399437,9.982227
Ulm Hbf,883,48.399437,9.982227
Unna,577,51.538982,7.692858
Unna,638,51.538982,7.692858
Usti nad Labem hl.n.,52,50.65956,14.044728
Utrecht Centraal,1034,52.089397,5.109861
Utrecht Centraal,105,52.089397,5.109861
Utrecht Centraal,1416,52.089397,5.109861
Utrecht Centraal,163,52.089397,5.109861
Utrecht Centraal,177,52.089397,5.109861
Utrecht Centraal,511,52.089397,5.109861
Utrecht Centraal,892,52.089397,5.109861
Vac,1200,47.782726,19.13306
Vaihingen(Enz),1050,48.948116,8.957632
Vaihingen(Enz),243,48.948116,8.957632
Vamdrup st,1186,55.428093,9.286454
Vamdrup st,944,55.428093,9.286454
Vejle st,1302,55.706356,9.536869
Vejle st,882,55.706356,9.536869
Velden am Wörther See,1284,46.62005,14.044838
Velden am Wörther See,643,46.62005,14.044838
Velgast,829,54.277317,12.803137
Venezia Mestre,894,45.481907,12.231898
Venezia Santa Lucia,490,45.441395,12.320459
Venlo(Gr),602,51.340893,6.192712
Verden(Aller),720,52.92082,9.237855
Verden(Aller),788,52.92082,9.237855
Verona Porta Nuova,940,45.428658,10.982739
Vicenza,1021,45.5411,11.540777
Viersen,774,51.254948,6.403896
Viersen,811,51.254948,6.403896
Villach Hbf,1009,46.618626,13.848536
Villach Hbf,1077,46.618626,13.848536
Villach Hbf,1220,46.618626,13.848536
Villach Hbf,434,46.618626,13.848536
Villach Hbf,446,46.618626,13.848536
Villach Hbf,863,46.618626,13.848536
Villach Hbf,864,46.618626,13.848536
Villingen(Schwarzw),620,48.05802,8.465261
Vojens st,1366,55.248478,9.304915
Vojens st,91,55.248478,9.304915
Vöcklabruck,803,48.010067,13.663703
Wabern(Bz Kassel),123,51.103134,9.35804
Wabern(Bz Kassel),302,51.103134,9.35804
Wanne-Eickel Hbf,1103,51.531258,7.165783
Wanne-Eickel Hbf,33,51.531258,7.165783
Wanne-Eickel Hbf,398,51.531258,7.165783
Warburg(Westf),1107,51.492954,9.163845
Warburg(Westf),1267,51.492954,9.163845
Waren(Müritz),584,53.52151,12.680678
Waren(Müritz),856,53.52151,12.680678
Warnemünde,815,54.176853,12.091271
Warnemünde,870,54.176853,12.091271
Warszawa Centralna,1298,52.22886,21.003235
Warszawa Wschodnia,216,52.25155,21.052336
Warszawa Zachodnia,140,52.21997,20.965246
Weil am Rhein,1175,47.59397,7.608419
Weilheim(Oberbay),1399,47.845364,11.14286
Weilheim(Oberbay),147,47.845364,11.14286
Weimar,1265,50.991486,11.326458
Weimar,186,50.991486,11.326458
Weimar,619,50.991486,11.326458
Weinheim(Bergstr)Hbf,1216,49.553303,8.665351
Weinheim(Bergstr)Hbf,1396,49.553303,8.665351
Weißenfels,1022,51.204617,11.970926
Weißenfels,1357,51.204617,11.970926
Wels Hbf,1080,48.166077,14.026569
Wels Hbf,1132,48.166077,14.026569
Wels Hbf,160,48.166077,14.026569
Werdohl,373,51.259483,7.757544
Werdohl,898,51.259483,7.757544
Werfen,12,47.4726,13.195183
Werfen,430,47.4726,13.195183
Westerland(Sylt),1110,54.906837,8.310925
Westerland(Sylt),1279,54.906837,8.310925
Westerstede-Ocholt,11,53.202168,7.886468
Westerstede-Ocholt,817,53.202168,7.886468
Wetzlar,1168,50.56563,8.503819
Wetzlar,479,50.56563,8.503819
Wien Hbf,119,48.184925,16.375866
Wien Hbf,245,48.184925,16.375866
Wien Hbf,3,48.184925,16.375866
Wien Hbf,348,48.184925,16.375866
Wien Hbf,478,48.184925,16.375866
Wien Hbf,523,48.184925,16.375866
Wien Hbf,635,48.184925,16.375866
Wien Hbf,773,48.184925,16.375866
Wien Hbf,852,48.184925,16.375866
Wien Hbf,880,48.184925,16.375866
Wien Meidling,1389,48.17445,16.333088
Wien Meidling,56,48.17445,16.333088
Wien Meidling,707,48.17445,16.333088
Wien Meidling,724,48.17445,16.333088
Wiener Neustadt Hbf,1340,47.81056,16.233187
Wiener Neustadt Hbf,1371,47.81056,16.233187
Wiesbaden Hbf,180,50.07079,8.243731
Wiesbaden Hbf,241,50.07079,8.243731
Wiesbaden Hbf,283,50.07079,8.243731
Wiesloch-Walldorf,174,49.29135,8.664146
Wiesloch-Walldorf,472,49.29135,8.664146
Wiesloch-Walldorf,909,49.29135,8.664146
Winterthur,1345,47.500336,8.723821
Winterthur,917,47.500336,8.723821
Witten Hbf,1423,51.435543,7.329442
Witten Hbf,311,51.435543,7.329442
Wittenberge,1368,53.003117,11.762871
Wittenberge,235,53.003117,11.762871
Wittenberge,636,53.003117,11.762871
Wolfsburg Hbf,1402,52.429497,10.787784
Wolfsburg Hbf,1412,52.429497,10.787784
Wolfsburg Hbf,82,52.429497,10.787784
Wolfsburg Hbf,845,52.429497,10.787784
Worms Hbf,808,49.63494,8.356448
Worms Hbf,823,49.63494,8.356448
Wroclaw Glowny,716,51.09808,17.037088
Wuppertal Hbf,1425,51.254364,7.149543
Wuppertal Hbf,935,51.254364,7.149543
Wörgl Hbf,159,47.4918,12.060581
Wörgl Hbf,340,47.4918,12.060581
Würzburg Hbf,141,49.801796,9.93578
Würzburg Hbf,269,49.801796,9.93578
Würzburg Hbf,294,49.801796,9.93578
Würzburg Hbf,381,49.801796,9.93578
Würzburg Hbf,657,49.801796,9.93578
Würzburg Hbf,922,49.801796,9.93578
Würzburg Hbf,968,49.801796,9.93578
Zabrze,211,50.30528,18.786947
Zagreb Glavni kolodvor,127,45.80444,15.978705
Zbaszynek,1323,52.242508,15.818092
Zidani Most,333,46.085587,15.170324
Zielona Gora Gl.,18,51.947437,15.513709
Zürich Flughafen,248,47.450386,8.562402
Zürich Flughafen,893,47.450386,8.562402
Zürich HB,1083,47.378178,8.540212
Zürich HB,1141,47.378178,8.540212
Zürich HB,1226,47.378178,8.540212
Zürich HB,1333,47.378178,8.540212
Zürich HB,182,47.378178,8.540212
Zürich HB,199,47.378178,8.540212
Zürich HB,297,47.378178,8.540212
Zürich HB,334,47.378178,8.540212
Zürich HB,503,47.378178,8.540212
Zürich HB,600,47.378178,8.540212
Zürich HB,73,47.378178,8.540212
Zürich HB,787,47.378178,8.540212
Zürich HB,877,47.378178,8.540212
Zürich HB,881,47.378178,8.540212
Zürich HB,884,47.378178,8.540212
Zürich HB,985,47.378178,8.540212
Züssow,1188,53.97388,13.548191
Züssow,838,53.97388,13.548191
Ötztal,1058,47.238483,10.859114
Ötztal,793,47.238483,10.859114
Übersee,742,47.82205,12.487338
Übersee,749,47.82205,12.487338
