{
	"n_targets": 20030,
	"n_bootstraps": 100,
	"n_processed": 31860431,
	"n_pseudoaligned": 21489238,
	"n_unique": 18334400,
	"p_pseudoaligned": 67.4,
	"p_unique": 57.5,
	"kallisto_version": "0.48.0",
	"index_version": 10,
	"start_time": "Fri Mar  3 13:28:07 2023",
	"call": "kallisto quant --bootstrap-samples 100 --rf-stranded -t 20 -i /scratch/users/dadras/Stress_profiling_of_zygnema_circumcarinatum_1b/kallisto_index/SAG698_1b_CDS.fna.idx -o /scratch/users/dadras/Stress_profiling_of_zygnema_circumcarinatum_1b/kallisto/Z_1_20_EKRN220057099-1A_HLN7GDSX5_L2 /scratch/users/dadras/Stress_profiling_of_zygnema_circumcarinatum_1b/trimmed_reads_PE/Z_1_20_EKRN220057099-1A_HLN7GDSX5_L2_1.fq.gz /scratch/users/dadras/Stress_profiling_of_zygnema_circumcarinatum_1b/trimmed_reads_PE/Z_1_20_EKRN220057099-1A_HLN7GDSX5_L2_2.fq.gz"
}
