-107103.4392589032
-107071.4239645399
-107132.9312602362
-107394.1152386513
-107210.9234058077
-106843.7258296251
-106596.9193796280
-106284.2415727470
-106321.7009615211
-106376.6725477313
-107249.7090858261
-106970.9734623602
-106765.3772129664
-106792.7146509129
-106351.6079931138
-106347.8217066336
-106134.2901625953
-106379.0657927312
-106302.5184454635
-106265.3854602272
-106375.6477938073
-106500.1640640016
-106527.4564568424
-106721.8216489633
-106698.5219357251
-107019.3695807836
-106843.9140416265
-106527.2264948141
-106214.3678103771
-106547.5966735993
-106506.7067593497
-106560.3608176015
-106623.5037786114
-107607.3012808568
-106859.0970889789
-106460.2687188446
-106300.7145600006
-106564.5131717149
-106952.6853724544
-106747.8669542461
-106700.4231227248
-106835.7197438330
-106370.3003821189
-107280.3865508094
-106789.1054908240
-106648.6143631220
-106539.1004807139
-106582.6492529260
-106393.6268897035
-106449.0826480127
-107596.2063239041
-107130.8643068126
-106949.1169049957
-106733.7023236676
-106687.3555789207
-106533.4806190049
-106328.0099904659
-106535.0768892864
-106934.6422733947
-106979.8246928371
-106995.8158027222
-106912.8802385134
-106566.3152721717
-106411.7827335585
-106333.9296737635
-106471.3135532818
-106580.1574788922
-106882.8387015634
-106505.2180462680
-106392.0630445719
-106252.9262505872
-106148.0301727143
-106171.7168572802
-106539.6621175730
-106689.9098138475
-106973.9854517751
-106600.8869996075
-106362.5798039093
-106358.9119047447
-106552.9877782397
-106544.9775709666
-106647.8148946973
-106556.6315532728
-107022.3750514194
-106518.8406911255
-106713.3210537648
-106626.0632437011
-107115.7142311657
-106744.5058676496
-106593.2173703128
-106774.2050648235
-106760.9731952073
-107299.1553161555
-106979.7381353462
-106919.1187490796
-106689.7551590994
-106696.7129816282
-106612.1771127481
-106665.4621879404
-106828.9076216922
-106876.8822807078
-106552.0571863810
-106481.8250773494
-106708.4394078790
-107115.4955301993
-106748.5298277801
-106391.8555885590
-106164.3442995897
-106202.0554778925
-107455.2319843931
-106886.8750271201
-106757.6944500577
-107112.7487899178
-106601.2752565736
-106424.6003820205
-106765.2359661767
-106339.9110079622
-107041.0975069798
-106681.8494094350
-107036.3638069727
-106631.1350590682
-106748.1333777868
-106699.3933072874
-106474.2689371583
-106483.8249833820
-106626.8298649480
-106724.0525609794
-106823.7823829718
-107060.2909157442
-106985.2026124913
-106872.7932436302
-106639.0482806315
-107018.5136200529
-106819.5941754513
-106752.1250857143
-107274.1944384319
-107008.0838146086
-106961.1839325260
-106985.3366993361
-106498.2966259018
-106633.5935261780
-107064.4465271067
-107014.9162580679
-106852.6317472143
-107008.3252672686
-106964.5990828657
-106579.4219831299
-106688.1528960138
-106506.6552580864
-107112.6761919315
-106800.8111596799
-106440.4680547652
-106265.5946773234
-106267.9965441933
-106313.8408213272
-106331.8854608662
-106352.2216413096
-106078.5312310214
-106203.0741360360
-106280.2404718109
-106537.8017690789
-106473.0568849670
-106633.0747221072
-106900.0826967233
-106683.2163363286
-106797.4890424204
-106601.1879028572
-106709.0689097716
-106821.7545730075
-106880.7246993460
-106750.8147254364
-106882.2794932970
-106422.2884827259
-106509.0141974993
