nodeName	altName	nodeAttr[nodesPresent, ]
Me1_v2_0021300	NA	greenyellow
Me1_v2_0026000	NA	greenyellow
Me1_v2_0031120	NA	greenyellow
Me1_v2_0034840	NA	greenyellow
Me1_v2_0035350	NA	greenyellow
Me1_v2_0035600	NA	greenyellow
Me1_v2_0035910	NA	greenyellow
Me1_v2_0039280	NA	greenyellow
Me1_v2_0039820	NA	greenyellow
Me1_v2_0039830	NA	greenyellow
Me1_v2_0041020	NA	greenyellow
Me1_v2_0041650	NA	greenyellow
Me1_v2_0049400	NA	greenyellow
Me1_v2_0050180	NA	greenyellow
Me1_v2_0051110	NA	greenyellow
Me1_v2_0051120	NA	greenyellow
Me1_v2_0053130	NA	greenyellow
Me1_v2_0054670	NA	greenyellow
Me1_v2_0054680	NA	greenyellow
Me1_v2_0056360	NA	greenyellow
Me1_v2_0061320	NA	greenyellow
Me1_v2_0061330	NA	greenyellow
Me1_v2_0065150	NA	greenyellow
Me1_v2_0066840	NA	greenyellow
Me1_v2_0066850	NA	greenyellow
Me1_v2_0068670	NA	greenyellow
Me1_v2_0070110	NA	greenyellow
Me1_v2_0070230	NA	greenyellow
Me1_v2_0070990	NA	greenyellow
Me1_v2_0077710	NA	greenyellow
Me1_v2_0078210	NA	greenyellow
Me1_v2_0081260	NA	greenyellow
Me1_v2_0082240	NA	greenyellow
Me1_v2_0082730	NA	greenyellow
Me1_v2_0082750	NA	greenyellow
Me1_v2_0083940	NA	greenyellow
Me1_v2_0085580	NA	greenyellow
Me1_v2_0089840	NA	greenyellow
Me1_v2_0091610	NA	greenyellow
Me1_v2_0092830	NA	greenyellow
Me1_v2_0092840	NA	greenyellow
Me1_v2_0099540	NA	greenyellow
Me1_v2_0101140	NA	greenyellow
Me1_v2_0101720	NA	greenyellow
Me1_v2_0102310	NA	greenyellow
Me1_v2_0102390	NA	greenyellow
Me1_v2_0103340	NA	greenyellow
Me1_v2_0104410	NA	greenyellow
Me1_v2_0104860	NA	greenyellow
Me1_v2_0105580	NA	greenyellow
Me1_v2_0106000	NA	greenyellow
Me1_v2_0106090	NA	greenyellow
Me1_v2_0108630	NA	greenyellow
Me1_v2_0111660	NA	greenyellow
Me1_v2_0113500	NA	greenyellow
Me1_v2_0113610	NA	greenyellow
Me1_v2_0113620	NA	greenyellow
Me1_v2_0114410	NA	greenyellow
Me1_v2_0114440	NA	greenyellow
Me1_v2_0114460	NA	greenyellow
Me1_v2_0115710	NA	greenyellow
Me1_v2_0116730	NA	greenyellow
Me1_v2_0117100	NA	greenyellow
Me1_v2_0119100	NA	greenyellow
Me1_v2_0119620	NA	greenyellow
Me1_v2_0120110	NA	greenyellow
Me1_v2_0120800	NA	greenyellow
Me1_v2_0122580	NA	greenyellow
Me1_v2_0122750	NA	greenyellow
Me1_v2_0124450	NA	greenyellow
Me1_v2_0124940	NA	greenyellow
Me1_v2_0131000	NA	greenyellow
Me1_v2_0132480	NA	greenyellow
Me1_v2_0132490	NA	greenyellow
Me1_v2_0134340	NA	greenyellow
Me1_v2_0134670	NA	greenyellow
Me1_v2_0135970	NA	greenyellow
Me1_v2_0137630	NA	greenyellow
Me1_v2_0137720	NA	greenyellow
Me1_v2_0137870	NA	greenyellow
Me1_v2_0137880	NA	greenyellow
Me1_v2_0141630	NA	greenyellow
Me1_v2_0142240	NA	greenyellow
Me1_v2_0144550	NA	greenyellow
Me1_v2_0146480	NA	greenyellow
Me1_v2_0147380	NA	greenyellow
Me1_v2_0147410	NA	greenyellow
Me1_v2_0147620	NA	greenyellow
Me1_v2_0147630	NA	greenyellow
Me1_v2_0147880	NA	greenyellow
Me1_v2_0149040	NA	greenyellow
Me1_v2_0150170	NA	greenyellow
Me1_v2_0152510	NA	greenyellow
Me1_v2_0153590	NA	greenyellow
Me1_v2_0153650	NA	greenyellow
Me1_v2_0156250	NA	greenyellow
Me1_v2_0160080	NA	greenyellow
Me1_v2_0163110	NA	greenyellow
Me1_v2_0163380	NA	greenyellow
Me1_v2_0164130	NA	greenyellow
Me1_v2_0165280	NA	greenyellow
Me1_v2_0166770	NA	greenyellow
Me1_v2_0169690	NA	greenyellow
Me1_v2_0174590	NA	greenyellow
Me1_v2_0175230	NA	greenyellow
Me1_v2_0180810	NA	greenyellow
Me1_v2_0181920	NA	greenyellow
Me1_v2_0182070	NA	greenyellow
Me1_v2_0184590	NA	greenyellow
Me1_v2_0185660	NA	greenyellow
Me1_v2_0185780	NA	greenyellow
Me1_v2_0187310	NA	greenyellow
Me1_v2_0190140	NA	greenyellow
Me1_v2_0192900	NA	greenyellow
Me1_v2_0196250	NA	greenyellow
Me1_v2_0199160	NA	greenyellow
Me1_v2_0199170	NA	greenyellow
Me1_v2_0200930	NA	greenyellow
Me1_v2_0203270	NA	greenyellow
Me1_v2_0205980	NA	greenyellow
Me1_v2_0206470	NA	greenyellow
Me1_v2_0208060	NA	greenyellow
Me1_v2_0208650	NA	greenyellow
Me1_v2_0208720	NA	greenyellow
Me1_v2_0209300	NA	greenyellow
Me1_v2_0210490	NA	greenyellow
Me1_v2_0211010	NA	greenyellow
Me1_v2_0212110	NA	greenyellow
Me1_v2_0212290	NA	greenyellow
Me1_v2_0214050	NA	greenyellow
Me1_v2_0215160	NA	greenyellow
Me1_v2_0217570	NA	greenyellow
Me1_v2_0217580	NA	greenyellow
Me1_v2_0217590	NA	greenyellow
Me1_v2_0219710	NA	greenyellow
Me1_v2_0220210	NA	greenyellow
Me1_v2_0220880	NA	greenyellow
Me1_v2_0220910	NA	greenyellow
Me1_v2_0221710	NA	greenyellow
Me1_v2_0221720	NA	greenyellow
Me1_v2_0223880	NA	greenyellow
Me1_v2_0228800	NA	greenyellow
Me1_v2_0228830	NA	greenyellow
Me1_v2_0229150	NA	greenyellow
Me1_v2_0229820	NA	greenyellow
Me1_v2_0229860	NA	greenyellow
Me1_v2_0230000	NA	greenyellow
Me1_v2_0231220	NA	greenyellow
