"","ID","Description","GeneRatio","BgRatio","pvalue","p.adjust","qvalue","geneID","Count"
"GO:0043271","GO:0043271","negative regulation of ion transport","2/27","12/4295",0.00241649793810874,0.438337250252517,0.435085719960994,"Zci_02003/Zci_08054",2
"GO:2001023","GO:2001023","regulation of response to drug","2/27","12/4295",0.00241649793810874,0.438337250252517,0.435085719960994,"Zci_05575/Zci_12358",2
"GO:2001038","GO:2001038","regulation of cellular response to drug","2/27","12/4295",0.00241649793810874,0.438337250252517,0.435085719960994,"Zci_05575/Zci_12358",2
"GO:1901565","GO:1901565","organonitrogen compound catabolic process","6/27","237/4295",0.00294186073994978,0.438337250252517,0.435085719960994,"Zci_00322/Zci_00856/Zci_02003/Zci_02114/Zci_11175/Zci_11706",6
"GO:0051051","GO:0051051","negative regulation of transport","2/27","17/4295",0.0048839013796473,0.450429411948517,0.447088183530672,"Zci_02003/Zci_08054",2
"GO:0022898","GO:0022898","regulation of transmembrane transporter activity","2/27","25/4295",0.0104451454056939,0.450429411948517,0.447088183530672,"Zci_02003/Zci_08054",2
"GO:0032409","GO:0032409","regulation of transporter activity","2/27","25/4295",0.0104451454056939,0.450429411948517,0.447088183530672,"Zci_02003/Zci_08054",2
"GO:0032412","GO:0032412","regulation of ion transmembrane transporter activity","2/27","25/4295",0.0104451454056939,0.450429411948517,0.447088183530672,"Zci_02003/Zci_08054",2
"GO:0044257","GO:0044257","cellular protein catabolic process","4/27","147/4295",0.0125179142909642,0.450429411948517,0.447088183530672,"Zci_00856/Zci_02003/Zci_02114/Zci_11175",4
"GO:0003713","GO:0003713","transcription coactivator activity","2/27","28/4295",0.0130093666255894,0.450429411948517,0.447088183530672,"Zci_05575/Zci_07393",2
"GO:0034765","GO:0034765","regulation of ion transmembrane transport","2/27","28/4295",0.0130093666255894,0.450429411948517,0.447088183530672,"Zci_02003/Zci_08054",2
"GO:0000981","GO:0000981","DNA-binding transcription factor activity, RNA polymerase II-specific","2/27","31/4295",0.0158195259061982,0.450429411948517,0.447088183530672,"Zci_05575/Zci_10818",2
"GO:0034762","GO:0034762","regulation of transmembrane transport","2/27","31/4295",0.0158195259061982,0.450429411948517,0.447088183530672,"Zci_02003/Zci_08054",2
"GO:0009735","GO:0009735","response to cytokinin","3/27","90/4295",0.0180967401563331,0.450429411948517,0.447088183530672,"Zci_00856/Zci_03245/Zci_07393",3
"GO:0030163","GO:0030163","protein catabolic process","4/27","165/4295",0.0184759633243185,0.450429411948517,0.447088183530672,"Zci_00856/Zci_02003/Zci_02114/Zci_11175",4
"GO:0043269","GO:0043269","regulation of ion transport","2/27","38/4295",0.0232805547549003,0.450429411948517,0.447088183530672,"Zci_02003/Zci_08054",2
"GO:0003712","GO:0003712","transcription coregulator activity","2/27","43/4295",0.0293348558087142,0.450429411948517,0.447088183530672,"Zci_05575/Zci_07393",2
"GO:0006511","GO:0006511","ubiquitin-dependent protein catabolic process","3/27","110/4295",0.0305941121409283,0.450429411948517,0.447088183530672,"Zci_02003/Zci_02114/Zci_11175",3
"GO:0044092","GO:0044092","negative regulation of molecular function","2/27","45/4295",0.0319152848946027,0.450429411948517,0.447088183530672,"Zci_02003/Zci_08054",2
"GO:0019941","GO:0019941","modification-dependent protein catabolic process","3/27","112/4295",0.0320424210510835,0.450429411948517,0.447088183530672,"Zci_02003/Zci_02114/Zci_11175",3
"GO:0044248","GO:0044248","cellular catabolic process","6/27","396/4295",0.0329724863112514,0.450429411948517,0.447088183530672,"Zci_00322/Zci_00856/Zci_02003/Zci_02114/Zci_11175/Zci_11706",6
"GO:1901575","GO:1901575","organic substance catabolic process","6/27","398/4295",0.0336958165868717,0.450429411948517,0.447088183530672,"Zci_00322/Zci_00856/Zci_02003/Zci_02114/Zci_11175/Zci_11706",6
"GO:0042127","GO:0042127","regulation of cell population proliferation","2/27","47/4295",0.0345826979767167,0.450429411948517,0.447088183530672,"Zci_05575/Zci_07393",2
"GO:0044265","GO:0044265","cellular macromolecule catabolic process","4/27","201/4295",0.0350977473801075,0.450429411948517,0.447088183530672,"Zci_00856/Zci_02003/Zci_02114/Zci_11175",4
"GO:0006839","GO:0006839","mitochondrial transport","2/27","48/4295",0.0359482683820708,0.450429411948517,0.447088183530672,"Zci_12885/Zci_15568",2
"GO:0019900","GO:0019900","kinase binding","2/27","48/4295",0.0359482683820708,0.450429411948517,0.447088183530672,"Zci_02003/Zci_08054",2
"GO:0042440","GO:0042440","pigment metabolic process","2/27","49/4295",0.0373346840049507,0.450429411948517,0.447088183530672,"Zci_02011/Zci_11706",2
"GO:0022603","GO:0022603","regulation of anatomical structure morphogenesis","2/27","50/4295",0.0387416501537999,0.450429411948517,0.447088183530672,"Zci_02011/Zci_04376",2
"GO:0043632","GO:0043632","modification-dependent macromolecule catabolic process","3/27","122/4295",0.0398215312588582,0.450429411948517,0.447088183530672,"Zci_02003/Zci_02114/Zci_11175",3
"GO:0031401","GO:0031401","positive regulation of protein modification process","2/27","51/4295",0.0401688747753578,0.450429411948517,0.447088183530672,"Zci_02003/Zci_07393",2
"GO:0048583","GO:0048583","regulation of response to stimulus","5/27","310/4295",0.0410782416622481,0.450429411948517,0.447088183530672,"Zci_02003/Zci_05575/Zci_08054/Zci_08692/Zci_12358",5
"GO:0080135","GO:0080135","regulation of cellular response to stress","2/27","54/4295",0.044569218108126,0.450429411948517,0.447088183530672,"Zci_02003/Zci_12358",2
"GO:0006357","GO:0006357","regulation of transcription by RNA polymerase II","3/27","128/4295",0.0449147468502853,0.450429411948517,0.447088183530672,"Zci_05575/Zci_07393/Zci_10818",3
"GO:0019866","GO:0019866","organelle inner membrane","3/27","130/4295",0.0466825334406394,0.450429411948517,0.447088183530672,"Zci_11706/Zci_12885/Zci_15568",3
"GO:0009056","GO:0009056","catabolic process","6/27","440/4295",0.051398942937072,0.450429411948517,0.447088183530672,"Zci_00322/Zci_00856/Zci_02003/Zci_02114/Zci_11175/Zci_11706",6
"GO:0043067","GO:0043067","regulation of programmed cell death","2/27","59/4295",0.052281785633412,0.450429411948517,0.447088183530672,"Zci_02003/Zci_12358",2
"GO:0051603","GO:0051603","proteolysis involved in cellular protein catabolic process","3/27","140/4295",0.056038167561308,0.450429411948517,0.447088183530672,"Zci_02003/Zci_02114/Zci_11175",3
"GO:0003700","GO:0003700","DNA-binding transcription factor activity","3/27","141/4295",0.0570204475986336,0.450429411948517,0.447088183530672,"Zci_05575/Zci_07393/Zci_10818",3
"GO:0009966","GO:0009966","regulation of signal transduction","3/27","142/4295",0.0580111043187505,0.450429411948517,0.447088183530672,"Zci_02003/Zci_08054/Zci_12358",3
"GO:0005811","GO:0005811","lipid droplet","1/27","10/4295",0.0611772658536405,0.450429411948517,0.447088183530672,"Zci_15594",1
"GO:0048564","GO:0048564","photosystem I assembly","1/27","10/4295",0.0611772658536405,0.450429411948517,0.447088183530672,"Zci_00856",1
"GO:0080092","GO:0080092","regulation of pollen tube growth","1/27","10/4295",0.0611772658536405,0.450429411948517,0.447088183530672,"Zci_04376",1
"GO:2000060","GO:2000060","positive regulation of ubiquitin-dependent protein catabolic process","1/27","10/4295",0.0611772658536405,0.450429411948517,0.447088183530672,"Zci_02003",1
"GO:0010941","GO:0010941","regulation of cell death","2/27","66/4295",0.0638175137266806,0.450429411948517,0.447088183530672,"Zci_02003/Zci_12358",2
"GO:0006508","GO:0006508","proteolysis","4/27","246/4295",0.065312722036489,0.450429411948517,0.447088183530672,"Zci_00856/Zci_02003/Zci_02114/Zci_11175",4
"GO:0010646","GO:0010646","regulation of cell communication","3/27","150/4295",0.066234063543572,0.450429411948517,0.447088183530672,"Zci_02003/Zci_08054/Zci_12358",3
"GO:0006629","GO:0006629","lipid metabolic process","4/27","248/4295",0.0669019051445668,0.450429411948517,0.447088183530672,"Zci_02011/Zci_08692/Zci_12208/Zci_15594",4
"GO:0015866","GO:0015866","ADP transport","1/27","11/4295",0.0670928350069544,0.450429411948517,0.447088183530672,"Zci_12885",1
"GO:0015996","GO:0015996","chlorophyll catabolic process","1/27","11/4295",0.0670928350069544,0.450429411948517,0.447088183530672,"Zci_11706",1
"GO:0016109","GO:0016109","tetraterpenoid biosynthetic process","1/27","11/4295",0.0670928350069544,0.450429411948517,0.447088183530672,"Zci_02011",1
"GO:0016117","GO:0016117","carotenoid biosynthetic process","1/27","11/4295",0.0670928350069544,0.450429411948517,0.447088183530672,"Zci_02011",1
"GO:0031058","GO:0031058","positive regulation of histone modification","1/27","11/4295",0.0670928350069544,0.450429411948517,0.447088183530672,"Zci_07393",1
"GO:0031396","GO:0031396","regulation of protein ubiquitination","1/27","11/4295",0.0670928350069544,0.450429411948517,0.447088183530672,"Zci_02003",1
"GO:0032434","GO:0032434","regulation of proteasomal ubiquitin-dependent protein catabolic process","1/27","11/4295",0.0670928350069544,0.450429411948517,0.447088183530672,"Zci_02003",1
"GO:0032875","GO:0032875","regulation of DNA endoreduplication","1/27","11/4295",0.0670928350069544,0.450429411948517,0.447088183530672,"Zci_05575",1
"GO:0046149","GO:0046149","pigment catabolic process","1/27","11/4295",0.0670928350069544,0.450429411948517,0.447088183530672,"Zci_11706",1
"GO:0090480","GO:0090480","purine nucleotide-sugar transmembrane transport","1/27","11/4295",0.0670928350069544,0.450429411948517,0.447088183530672,"Zci_12885",1
"GO:0001067","GO:0001067","transcription regulatory region nucleic acid binding","2/27","68/4295",0.0672606313377821,0.450429411948517,0.447088183530672,"Zci_05575/Zci_10818",2
"GO:0008610","GO:0008610","lipid biosynthetic process","3/27","152/4295",0.0683712645334275,0.450429411948517,0.447088183530672,"Zci_02011/Zci_08692/Zci_15594",3
"GO:0023051","GO:0023051","regulation of signaling","3/27","152/4295",0.0683712645334275,0.450429411948517,0.447088183530672,"Zci_02003/Zci_08054/Zci_12358",3
"GO:0009057","GO:0009057","macromolecule catabolic process","4/27","250/4295",0.0685117895143131,0.450429411948517,0.447088183530672,"Zci_00856/Zci_02003/Zci_02114/Zci_11175",4
"GO:0004659","GO:0004659","prenyltransferase activity","1/27","12/4295",0.0729725020132131,0.450429411948517,0.447088183530672,"Zci_08692",1
"GO:0005849","GO:0005849","mRNA cleavage factor complex","1/27","12/4295",0.0729725020132131,0.450429411948517,0.447088183530672,"Zci_12358",1
"GO:0006787","GO:0006787","porphyrin-containing compound catabolic process","1/27","12/4295",0.0729725020132131,0.450429411948517,0.447088183530672,"Zci_11706",1
"GO:0010769","GO:0010769","regulation of cell morphogenesis involved in differentiation","1/27","12/4295",0.0729725020132131,0.450429411948517,0.447088183530672,"Zci_04376",1
"GO:0033015","GO:0033015","tetrapyrrole catabolic process","1/27","12/4295",0.0729725020132131,0.450429411948517,0.447088183530672,"Zci_11706",1
"GO:0033559","GO:0033559","unsaturated fatty acid metabolic process","1/27","12/4295",0.0729725020132131,0.450429411948517,0.447088183530672,"Zci_08692",1
"GO:0046128","GO:0046128","purine ribonucleoside metabolic process","1/27","12/4295",0.0729725020132131,0.450429411948517,0.447088183530672,"Zci_03245",1
"GO:1903320","GO:1903320","regulation of protein modification by small protein conjugation or removal","1/27","12/4295",0.0729725020132131,0.450429411948517,0.447088183530672,"Zci_02003",1
"GO:1905269","GO:1905269","positive regulation of chromatin organization","1/27","12/4295",0.0729725020132131,0.450429411948517,0.447088183530672,"Zci_07393",1
"GO:2000058","GO:2000058","regulation of ubiquitin-dependent protein catabolic process","1/27","12/4295",0.0729725020132131,0.450429411948517,0.447088183530672,"Zci_02003",1
"GO:0080134","GO:0080134","regulation of response to stress","3/27","158/4295",0.0749738023286642,0.450429411948517,0.447088183530672,"Zci_02003/Zci_08692/Zci_12358",3
"GO:0000977","GO:0000977","RNA polymerase II transcription regulatory region sequence-specific DNA binding","1/27","13/4295",0.0788164764343304,0.450429411948517,0.447088183530672,"Zci_10818",1
"GO:0009812","GO:0009812","flavonoid metabolic process","1/27","13/4295",0.0788164764343304,0.450429411948517,0.447088183530672,"Zci_12208",1
"GO:0010205","GO:0010205","photoinhibition","1/27","13/4295",0.0788164764343304,0.450429411948517,0.447088183530672,"Zci_00856",1
"GO:0019432","GO:0019432","triglyceride biosynthetic process","1/27","13/4295",0.0788164764343304,0.450429411948517,0.447088183530672,"Zci_15594",1
"GO:0042278","GO:0042278","purine nucleoside metabolic process","1/27","13/4295",0.0788164764343304,0.450429411948517,0.447088183530672,"Zci_03245",1
"GO:0042455","GO:0042455","ribonucleoside biosynthetic process","1/27","13/4295",0.0788164764343304,0.450429411948517,0.447088183530672,"Zci_03245",1
"GO:0043155","GO:0043155","negative regulation of photosynthesis, light reaction","1/27","13/4295",0.0788164764343304,0.450429411948517,0.447088183530672,"Zci_00856",1
"GO:0005741","GO:0005741","mitochondrial outer membrane","1/27","14/4295",0.0846249666576541,0.450429411948517,0.447088183530672,"Zci_15568",1
"GO:0006898","GO:0006898","receptor-mediated endocytosis","1/27","14/4295",0.0846249666576541,0.450429411948517,0.447088183530672,"Zci_01582",1
"GO:0009163","GO:0009163","nucleoside biosynthetic process","1/27","14/4295",0.0846249666576541,0.450429411948517,0.447088183530672,"Zci_03245",1
"GO:0009960","GO:0009960","endosperm development","1/27","14/4295",0.0846249666576541,0.450429411948517,0.447088183530672,"Zci_04376",1
"GO:0010214","GO:0010214","seed coat development","1/27","14/4295",0.0846249666576541,0.450429411948517,0.447088183530672,"Zci_12208",1
"GO:0016645","GO:0016645","oxidoreductase activity, acting on the CH-NH group of donors","1/27","14/4295",0.0846249666576541,0.450429411948517,0.447088183530672,"Zci_00322",1
"GO:0051510","GO:0051510","regulation of unidimensional cell growth","1/27","14/4295",0.0846249666576541,0.450429411948517,0.447088183530672,"Zci_04376",1
"GO:1904062","GO:1904062","regulation of cation transmembrane transport","1/27","14/4295",0.0846249666576541,0.450429411948517,0.447088183530672,"Zci_02003",1
"GO:1905156","GO:1905156","negative regulation of photosynthesis","1/27","14/4295",0.0846249666576541,0.450429411948517,0.447088183530672,"Zci_00856",1
"GO:0031347","GO:0031347","regulation of defense response","2/27","80/4295",0.0891484136472234,0.450429411948517,0.447088183530672,"Zci_08692/Zci_12358",2
"GO:0004521","GO:0004521","endoribonuclease activity","1/27","15/4295",0.0903981799022796,0.450429411948517,0.447088183530672,"Zci_12358",1
"GO:0015865","GO:0015865","purine nucleotide transport","1/27","15/4295",0.0903981799022796,0.450429411948517,0.447088183530672,"Zci_12885",1
"GO:0015868","GO:0015868","purine ribonucleotide transport","1/27","15/4295",0.0903981799022796,0.450429411948517,0.447088183530672,"Zci_12885",1
"GO:0046460","GO:0046460","neutral lipid biosynthetic process","1/27","15/4295",0.0903981799022796,0.450429411948517,0.447088183530672,"Zci_15594",1
"GO:0046463","GO:0046463","acylglycerol biosynthetic process","1/27","15/4295",0.0903981799022796,0.450429411948517,0.447088183530672,"Zci_15594",1
"GO:0050660","GO:0050660","flavin adenine dinucleotide binding","1/27","15/4295",0.0903981799022796,0.450429411948517,0.447088183530672,"Zci_00322",1
"GO:0051503","GO:0051503","adenine nucleotide transport","1/27","15/4295",0.0903981799022796,0.450429411948517,0.447088183530672,"Zci_12885",1
"GO:0032270","GO:0032270","positive regulation of cellular protein metabolic process","2/27","81/4295",0.0910599026867756,0.450429411948517,0.447088183530672,"Zci_02003/Zci_07393",2
"GO:0045892","GO:0045892","negative regulation of transcription, DNA-templated","2/27","81/4295",0.0910599026867756,0.450429411948517,0.447088183530672,"Zci_05575/Zci_10818",2
"GO:0051247","GO:0051247","positive regulation of protein metabolic process","2/27","83/4295",0.0949198987319028,0.450429411948517,0.447088183530672,"Zci_02003/Zci_07393",2
"GO:0004176","GO:0004176","ATP-dependent peptidase activity","1/27","16/4295",0.0961363222253261,0.450429411948517,0.447088183530672,"Zci_00856",1
"GO:0006626","GO:0006626","protein targeting to mitochondrion","1/27","16/4295",0.0961363222253261,0.450429411948517,0.447088183530672,"Zci_15568",1
"GO:0010359","GO:0010359","regulation of anion channel activity","1/27","16/4295",0.0961363222253261,0.450429411948517,0.447088183530672,"Zci_08054",1
"GO:0016108","GO:0016108","tetraterpenoid metabolic process","1/27","16/4295",0.0961363222253261,0.450429411948517,0.447088183530672,"Zci_02011",1
"GO:0016116","GO:0016116","carotenoid metabolic process","1/27","16/4295",0.0961363222253261,0.450429411948517,0.447088183530672,"Zci_02011",1
"GO:0032040","GO:0032040","small-subunit processome","1/27","16/4295",0.0961363222253261,0.450429411948517,0.447088183530672,"Zci_10883",1
"GO:0070585","GO:0070585","protein localization to mitochondrion","1/27","16/4295",0.0961363222253261,0.450429411948517,0.447088183530672,"Zci_15568",1
"GO:0072655","GO:0072655","establishment of protein localization to mitochondrion","1/27","16/4295",0.0961363222253261,0.450429411948517,0.447088183530672,"Zci_15568",1
"GO:1903959","GO:1903959","regulation of anion transmembrane transport","1/27","16/4295",0.0961363222253261,0.450429411948517,0.447088183530672,"Zci_08054",1
"GO:1902679","GO:1902679","negative regulation of RNA biosynthetic process","2/27","85/4295",0.0988278137515862,0.450429411948517,0.447088183530672,"Zci_05575/Zci_10818",2
"GO:1903507","GO:1903507","negative regulation of nucleic acid-templated transcription","2/27","85/4295",0.0988278137515862,0.450429411948517,0.447088183530672,"Zci_05575/Zci_10818",2
"GO:0009891","GO:0009891","positive regulation of biosynthetic process","3/27","179/4295",0.100229816678072,0.450429411948517,0.447088183530672,"Zci_02011/Zci_05575/Zci_07393",3
"GO:0006378","GO:0006378","mRNA polyadenylation","1/27","17/4295",0.101839598528181,0.450429411948517,0.447088183530672,"Zci_12358",1
"GO:0006862","GO:0006862","nucleotide transport","1/27","17/4295",0.101839598528181,0.450429411948517,0.447088183530672,"Zci_12885",1
"GO:0015780","GO:0015780","nucleotide-sugar transmembrane transport","1/27","17/4295",0.101839598528181,0.450429411948517,0.447088183530672,"Zci_12885",1
"GO:0140110","GO:0140110","transcription regulator activity","3/27","182/4295",0.104095262518508,0.450429411948517,0.447088183530672,"Zci_05575/Zci_07393/Zci_10818",3
"GO:0000045","GO:0000045","autophagosome assembly","1/27","18/4295",0.107508212562716,0.450429411948517,0.447088183530672,"Zci_02003",1
"GO:0000462","GO:0000462","maturation of SSU-rRNA from tricistronic rRNA transcript (SSU-rRNA, 5.8S rRNA, LSU-rRNA)","1/27","18/4295",0.107508212562716,0.450429411948517,0.447088183530672,"Zci_10883",1
"GO:0004722","GO:0004722","protein serine/threonine phosphatase activity","1/27","18/4295",0.107508212562716,0.450429411948517,0.447088183530672,"Zci_08054",1
"GO:0010942","GO:0010942","positive regulation of cell death","1/27","18/4295",0.107508212562716,0.450429411948517,0.447088183530672,"Zci_12358",1
"GO:0010959","GO:0010959","regulation of metal ion transport","1/27","18/4295",0.107508212562716,0.450429411948517,0.447088183530672,"Zci_02003",1
"GO:0032984","GO:0032984","protein-containing complex disassembly","1/27","18/4295",0.107508212562716,0.450429411948517,0.447088183530672,"Zci_02003",1
"GO:0035251","GO:0035251","UDP-glucosyltransferase activity","1/27","18/4295",0.107508212562716,0.450429411948517,0.447088183530672,"Zci_12208",1
"GO:0043068","GO:0043068","positive regulation of programmed cell death","1/27","18/4295",0.107508212562716,0.450429411948517,0.447088183530672,"Zci_12358",1
"GO:0043130","GO:0043130","ubiquitin binding","1/27","18/4295",0.107508212562716,0.450429411948517,0.447088183530672,"Zci_11175",1
"GO:0043631","GO:0043631","RNA polyadenylation","1/27","18/4295",0.107508212562716,0.450429411948517,0.447088183530672,"Zci_12358",1
"GO:0044070","GO:0044070","regulation of anion transport","1/27","18/4295",0.107508212562716,0.450429411948517,0.447088183530672,"Zci_08054",1
"GO:0050684","GO:0050684","regulation of mRNA processing","1/27","18/4295",0.107508212562716,0.450429411948517,0.447088183530672,"Zci_12358",1
"GO:0051536","GO:0051536","iron-sulfur cluster binding","1/27","18/4295",0.107508212562716,0.450429411948517,0.447088183530672,"Zci_11706",1
"GO:0051540","GO:0051540","metal cluster binding","1/27","18/4295",0.107508212562716,0.450429411948517,0.447088183530672,"Zci_11706",1
"GO:1901800","GO:1901800","positive regulation of proteasomal protein catabolic process","1/27","18/4295",0.107508212562716,0.450429411948517,0.447088183530672,"Zci_02003",1
"GO:1903052","GO:1903052","positive regulation of proteolysis involved in cellular protein catabolic process","1/27","18/4295",0.107508212562716,0.450429411948517,0.447088183530672,"Zci_02003",1
"GO:2001252","GO:2001252","positive regulation of chromosome organization","1/27","18/4295",0.107508212562716,0.450429411948517,0.447088183530672,"Zci_07393",1
"GO:0005743","GO:0005743","mitochondrial inner membrane","2/27","90/4295",0.108796186328921,0.450429411948517,0.447088183530672,"Zci_12885/Zci_15568",2
"GO:0009893","GO:0009893","positive regulation of metabolic process","4/27","294/4295",0.109007448115282,0.450429411948517,0.447088183530672,"Zci_02003/Zci_02011/Zci_05575/Zci_07393",4
"GO:1901615","GO:1901615","organic hydroxy compound metabolic process","2/27","91/4295",0.110822258474181,0.450429411948517,0.447088183530672,"Zci_08692/Zci_12208",2
"GO:0009725","GO:0009725","response to hormone","5/27","413/4295",0.11109513128178,0.450429411948517,0.447088183530672,"Zci_00856/Zci_03245/Zci_05575/Zci_07393/Zci_08054",5
"GO:0006641","GO:0006641","triglyceride metabolic process","1/27","19/4295",0.113142366937466,0.450429411948517,0.447088183530672,"Zci_15594",1
"GO:0006935","GO:0006935","chemotaxis","1/27","19/4295",0.113142366937466,0.450429411948517,0.447088183530672,"Zci_04376",1
"GO:0009145","GO:0009145","purine nucleoside triphosphate biosynthetic process","1/27","19/4295",0.113142366937466,0.450429411948517,0.447088183530672,"Zci_03245",1
"GO:0009201","GO:0009201","ribonucleoside triphosphate biosynthetic process","1/27","19/4295",0.113142366937466,0.450429411948517,0.447088183530672,"Zci_03245",1
"GO:0009206","GO:0009206","purine ribonucleoside triphosphate biosynthetic process","1/27","19/4295",0.113142366937466,0.450429411948517,0.447088183530672,"Zci_03245",1
"GO:0032182","GO:0032182","ubiquitin-like protein binding","1/27","19/4295",0.113142366937466,0.450429411948517,0.447088183530672,"Zci_11175",1
"GO:0042330","GO:0042330","taxis","1/27","19/4295",0.113142366937466,0.450429411948517,0.447088183530672,"Zci_04376",1
"GO:1901659","GO:1901659","glycosyl compound biosynthetic process","1/27","19/4295",0.113142366937466,0.450429411948517,0.447088183530672,"Zci_03245",1
"GO:1903364","GO:1903364","positive regulation of cellular protein catabolic process","1/27","19/4295",0.113142366937466,0.450429411948517,0.447088183530672,"Zci_02003",1
"GO:1905037","GO:1905037","autophagosome organization","1/27","19/4295",0.113142366937466,0.450429411948517,0.447088183530672,"Zci_02003",1
"GO:0031324","GO:0031324","negative regulation of cellular metabolic process","3/27","190/4295",0.114696702798945,0.450429411948517,0.447088183530672,"Zci_00856/Zci_05575/Zci_10818",3
"GO:0008643","GO:0008643","carbohydrate transport","1/27","20/4295",0.118742263123782,0.450429411948517,0.447088183530672,"Zci_08692",1
"GO:0042548","GO:0042548","regulation of photosynthesis, light reaction","1/27","20/4295",0.118742263123782,0.450429411948517,0.447088183530672,"Zci_00856",1
"GO:0009719","GO:0009719","response to endogenous stimulus","5/27","424/4295",0.120865319202727,0.450429411948517,0.447088183530672,"Zci_00856/Zci_03245/Zci_05575/Zci_07393/Zci_08054",5
"GO:0051253","GO:0051253","negative regulation of RNA metabolic process","2/27","96/4295",0.121103642793022,0.450429411948517,0.447088183530672,"Zci_05575/Zci_10818",2
"GO:0009064","GO:0009064","glutamine family amino acid metabolic process","1/27","21/4295",0.124308101461948,0.450429411948517,0.447088183530672,"Zci_00322",1
"GO:0009142","GO:0009142","nucleoside triphosphate biosynthetic process","1/27","21/4295",0.124308101461948,0.450429411948517,0.447088183530672,"Zci_03245",1
"GO:0009788","GO:0009788","negative regulation of abscisic acid-activated signaling pathway","1/27","21/4295",0.124308101461948,0.450429411948517,0.447088183530672,"Zci_08054",1
"GO:0016125","GO:0016125","sterol metabolic process","1/27","21/4295",0.124308101461948,0.450429411948517,0.447088183530672,"Zci_12208",1
"GO:0045732","GO:0045732","positive regulation of protein catabolic process","1/27","21/4295",0.124308101461948,0.450429411948517,0.447088183530672,"Zci_02003",1
"GO:0048471","GO:0048471","perinuclear region of cytoplasm","1/27","21/4295",0.124308101461948,0.450429411948517,0.447088183530672,"Zci_02003",1
"GO:1901420","GO:1901420","negative regulation of response to alcohol","1/27","21/4295",0.124308101461948,0.450429411948517,0.447088183530672,"Zci_08054",1
"GO:1905958","GO:1905958","negative regulation of cellular response to alcohol","1/27","21/4295",0.124308101461948,0.450429411948517,0.447088183530672,"Zci_08054",1
"GO:0051049","GO:0051049","regulation of transport","2/27","98/4295",0.125283068422948,0.450429411948517,0.447088183530672,"Zci_02003/Zci_08054",2
"GO:0019899","GO:0019899","enzyme binding","3/27","198/4295",0.125706116780833,0.450429411948517,0.447088183530672,"Zci_02003/Zci_08054/Zci_11175",3
"GO:0006638","GO:0006638","neutral lipid metabolic process","1/27","22/4295",0.129840081167265,0.450429411948517,0.447088183530672,"Zci_15594",1
"GO:0006639","GO:0006639","acylglycerol metabolic process","1/27","22/4295",0.129840081167265,0.450429411948517,0.447088183530672,"Zci_15594",1
"GO:0008285","GO:0008285","negative regulation of cell population proliferation","1/27","22/4295",0.129840081167265,0.450429411948517,0.447088183530672,"Zci_05575",1
"GO:0030433","GO:0030433","ubiquitin-dependent ERAD pathway","1/27","22/4295",0.129840081167265,0.450429411948517,0.447088183530672,"Zci_02003",1
"GO:0043467","GO:0043467","regulation of generation of precursor metabolites and energy","1/27","22/4295",0.129840081167265,0.450429411948517,0.447088183530672,"Zci_00856",1
"GO:0045089","GO:0045089","positive regulation of innate immune response","1/27","22/4295",0.129840081167265,0.450429411948517,0.447088183530672,"Zci_12358",1
"GO:0031399","GO:0031399","regulation of protein modification process","2/27","102/4295",0.133748302741948,0.450429411948517,0.447088183530672,"Zci_02003/Zci_07393",2
"GO:0009765","GO:0009765","photosynthesis, light harvesting","1/27","23/4295",0.135338400336113,0.450429411948517,0.447088183530672,"Zci_00856",1
"GO:0009926","GO:0009926","auxin polar transport","1/27","23/4295",0.135338400336113,0.450429411948517,0.447088183530672,"Zci_02011",1
"GO:0030490","GO:0030490","maturation of SSU-rRNA","1/27","23/4295",0.135338400336113,0.450429411948517,0.447088183530672,"Zci_10883",1
"GO:0061136","GO:0061136","regulation of proteasomal protein catabolic process","1/27","23/4295",0.135338400336113,0.450429411948517,0.447088183530672,"Zci_02003",1
"GO:0090502","GO:0090502","RNA phosphodiester bond hydrolysis, endonucleolytic","1/27","23/4295",0.135338400336113,0.450429411948517,0.447088183530672,"Zci_12358",1
"GO:1903050","GO:1903050","regulation of proteolysis involved in cellular protein catabolic process","1/27","23/4295",0.135338400336113,0.450429411948517,0.447088183530672,"Zci_02003",1
"GO:2000377","GO:2000377","regulation of reactive oxygen species metabolic process","1/27","23/4295",0.135338400336113,0.450429411948517,0.447088183530672,"Zci_10818",1
"GO:0031966","GO:0031966","mitochondrial membrane","2/27","105/4295",0.140184603980756,0.450429411948517,0.447088183530672,"Zci_12885/Zci_15568",2
"GO:0000976","GO:0000976","transcription cis-regulatory region binding","1/27","24/4295",0.140803255951966,0.450429411948517,0.447088183530672,"Zci_10818",1
"GO:0009119","GO:0009119","ribonucleoside metabolic process","1/27","24/4295",0.140803255951966,0.450429411948517,0.447088183530672,"Zci_03245",1
"GO:0031056","GO:0031056","regulation of histone modification","1/27","24/4295",0.140803255951966,0.450429411948517,0.447088183530672,"Zci_07393",1
"GO:0031124","GO:0031124","mRNA 3'-end processing","1/27","24/4295",0.140803255951966,0.450429411948517,0.447088183530672,"Zci_12358",1
"GO:0090329","GO:0090329","regulation of DNA-templated DNA replication","1/27","24/4295",0.140803255951966,0.450429411948517,0.447088183530672,"Zci_05575",1
"GO:1903362","GO:1903362","regulation of cellular protein catabolic process","1/27","24/4295",0.140803255951966,0.450429411948517,0.447088183530672,"Zci_02003",1
"GO:0046700","GO:0046700","heterocycle catabolic process","2/27","106/4295",0.142345737563786,0.450429411948517,0.447088183530672,"Zci_00322/Zci_11706",2
"GO:0006275","GO:0006275","regulation of DNA replication","1/27","25/4295",0.146234843891394,0.450429411948517,0.447088183530672,"Zci_05575",1
"GO:0045862","GO:0045862","positive regulation of proteolysis","1/27","25/4295",0.146234843891394,0.450429411948517,0.447088183530672,"Zci_02003",1
"GO:0050778","GO:0050778","positive regulation of immune response","1/27","25/4295",0.146234843891394,0.450429411948517,0.447088183530672,"Zci_12358",1
"GO:0048584","GO:0048584","positive regulation of response to stimulus","2/27","109/4295",0.148873828925385,0.450429411948517,0.447088183530672,"Zci_02003/Zci_12358",2
"GO:0043565","GO:0043565","sequence-specific DNA binding","2/27","110/4295",0.151064194051024,0.450429411948517,0.447088183530672,"Zci_05575/Zci_10818",2
"GO:0009116","GO:0009116","nucleoside metabolic process","1/27","26/4295",0.151633358930019,0.450429411948517,0.447088183530672,"Zci_03245",1
"GO:0015748","GO:0015748","organophosphate ester transport","1/27","26/4295",0.151633358930019,0.450429411948517,0.447088183530672,"Zci_12885",1
"GO:0015994","GO:0015994","chlorophyll metabolic process","1/27","26/4295",0.151633358930019,0.450429411948517,0.447088183530672,"Zci_11706",1
"GO:0016114","GO:0016114","terpenoid biosynthetic process","1/27","26/4295",0.151633358930019,0.450429411948517,0.447088183530672,"Zci_02011",1
"GO:0036503","GO:0036503","ERAD pathway","1/27","26/4295",0.151633358930019,0.450429411948517,0.447088183530672,"Zci_02003",1
"GO:0140030","GO:0140030","modification-dependent protein binding","1/27","26/4295",0.151633358930019,0.450429411948517,0.447088183530672,"Zci_02003",1
"GO:0005740","GO:0005740","mitochondrial envelope","2/27","112/4295",0.155465431946166,0.450429411948517,0.447088183530672,"Zci_12885/Zci_15568",2
"GO:0010154","GO:0010154","fruit development","3/27","219/4295",0.156365177905369,0.450429411948517,0.447088183530672,"Zci_04376/Zci_11706/Zci_12208",3
"GO:0000122","GO:0000122","negative regulation of transcription by RNA polymerase II","1/27","27/4295",0.156998994748452,0.450429411948517,0.447088183530672,"Zci_10818",1
"GO:0002684","GO:0002684","positive regulation of immune system process","1/27","27/4295",0.156998994748452,0.450429411948517,0.447088183530672,"Zci_12358",1
"GO:0009845","GO:0009845","seed germination","1/27","27/4295",0.156998994748452,0.450429411948517,0.447088183530672,"Zci_12208",1
"GO:0009914","GO:0009914","hormone transport","1/27","27/4295",0.156998994748452,0.450429411948517,0.447088183530672,"Zci_02011",1
"GO:0022604","GO:0022604","regulation of cell morphogenesis","1/27","27/4295",0.156998994748452,0.450429411948517,0.447088183530672,"Zci_04376",1
"GO:0051302","GO:0051302","regulation of cell division","1/27","27/4295",0.156998994748452,0.450429411948517,0.447088183530672,"Zci_05575",1
"GO:0060918","GO:0060918","auxin transport","1/27","27/4295",0.156998994748452,0.450429411948517,0.447088183530672,"Zci_02011",1
"GO:1901606","GO:1901606","alpha-amino acid catabolic process","1/27","27/4295",0.156998994748452,0.450429411948517,0.447088183530672,"Zci_00322",1
"GO:0071702","GO:0071702","organic substance transport","4/27","337/4295",0.157167903254996,0.450429411948517,0.447088183530672,"Zci_08692/Zci_09109/Zci_12885/Zci_15568",4
"GO:0048523","GO:0048523","negative regulation of cellular process","4/27","338/4295",0.158377134455818,0.450429411948517,0.447088183530672,"Zci_00856/Zci_05575/Zci_08054/Zci_10818",4
"GO:0000413","GO:0000413","protein peptidyl-prolyl isomerization","1/27","28/4295",0.162331943938188,0.450429411948517,0.447088183530672,"Zci_02258",1
"GO:0003755","GO:0003755","peptidyl-prolyl cis-trans isomerase activity","1/27","28/4295",0.162331943938188,0.450429411948517,0.447088183530672,"Zci_02258",1
"GO:0016236","GO:0016236","macroautophagy","1/27","28/4295",0.162331943938188,0.450429411948517,0.447088183530672,"Zci_02003",1
"GO:0031349","GO:0031349","positive regulation of defense response","1/27","28/4295",0.162331943938188,0.450429411948517,0.447088183530672,"Zci_12358",1
"GO:0060284","GO:0060284","regulation of cell development","1/27","28/4295",0.162331943938188,0.450429411948517,0.447088183530672,"Zci_04376",1
"GO:0009266","GO:0009266","response to temperature stimulus","3/27","224/4295",0.164004191261464,0.450429411948517,0.447088183530672,"Zci_07393/Zci_08054/Zci_08692",3
"GO:1901361","GO:1901361","organic cyclic compound catabolic process","2/27","117/4295",0.166580631693062,0.450429411948517,0.447088183530672,"Zci_00322/Zci_11706",2
"GO:2000113","GO:2000113","negative regulation of cellular macromolecule biosynthetic process","2/27","117/4295",0.166580631693062,0.450429411948517,0.447088183530672,"Zci_05575/Zci_10818",2
"GO:0048519","GO:0048519","negative regulation of biological process","5/27","471/4295",0.167121010066296,0.450429411948517,0.447088183530672,"Zci_00856/Zci_02003/Zci_05575/Zci_08054/Zci_10818",5
"GO:0006338","GO:0006338","chromatin remodeling","1/27","29/4295",0.16763239800748,0.450429411948517,0.447088183530672,"Zci_07393",1
"GO:0008374","GO:0008374","O-acyltransferase activity","1/27","29/4295",0.16763239800748,0.450429411948517,0.447088183530672,"Zci_15594",1
"GO:0042274","GO:0042274","ribosomal small subunit biogenesis","1/27","29/4295",0.16763239800748,0.450429411948517,0.447088183530672,"Zci_10883",1
"GO:0044255","GO:0044255","cellular lipid metabolic process","3/27","227/4295",0.168644461490396,0.450429411948517,0.447088183530672,"Zci_02011/Zci_08692/Zci_15594",3
"GO:0048585","GO:0048585","negative regulation of response to stimulus","2/27","119/4295",0.171068252861553,0.450429411948517,0.447088183530672,"Zci_05575/Zci_08054",2
"GO:0001666","GO:0001666","response to hypoxia","1/27","30/4295",0.172900547387179,0.450429411948517,0.447088183530672,"Zci_02003",1
"GO:0008202","GO:0008202","steroid metabolic process","1/27","30/4295",0.172900547387179,0.450429411948517,0.447088183530672,"Zci_12208",1
"GO:0040011","GO:0040011","locomotion","1/27","30/4295",0.172900547387179,0.450429411948517,0.447088183530672,"Zci_04376",1
"GO:0043648","GO:0043648","dicarboxylic acid metabolic process","1/27","30/4295",0.172900547387179,0.450429411948517,0.447088183530672,"Zci_00322",1
"GO:1903311","GO:1903311","regulation of mRNA metabolic process","1/27","30/4295",0.172900547387179,0.450429411948517,0.447088183530672,"Zci_12358",1
"GO:0045934","GO:0045934","negative regulation of nucleobase-containing compound metabolic process","2/27","120/4295",0.17332035226729,0.450429411948517,0.447088183530672,"Zci_05575/Zci_10818",2
"GO:0048518","GO:0048518","positive regulation of biological process","5/27","478/4295",0.174591284509798,0.450429411948517,0.447088183530672,"Zci_02003/Zci_02011/Zci_05575/Zci_07393/Zci_12358",5
"GO:0010558","GO:0010558","negative regulation of macromolecule biosynthetic process","2/27","122/4295",0.177840382039509,0.450429411948517,0.447088183530672,"Zci_05575/Zci_10818",2
"GO:0009152","GO:0009152","purine ribonucleotide biosynthetic process","1/27","31/4295",0.178136581436545,0.450429411948517,0.447088183530672,"Zci_03245",1
"GO:0010109","GO:0010109","regulation of photosynthesis","1/27","31/4295",0.178136581436545,0.450429411948517,0.447088183530672,"Zci_00856",1
"GO:0016859","GO:0016859","cis-trans isomerase activity","1/27","31/4295",0.178136581436545,0.450429411948517,0.447088183530672,"Zci_02258",1
"GO:0034404","GO:0034404","nucleobase-containing small molecule biosynthetic process","1/27","31/4295",0.178136581436545,0.450429411948517,0.447088183530672,"Zci_03245",1
"GO:0046527","GO:0046527","glucosyltransferase activity","1/27","31/4295",0.178136581436545,0.450429411948517,0.447088183530672,"Zci_12208",1
"GO:0032879","GO:0032879","regulation of localization","2/27","123/4295",0.180108018312196,0.450429411948517,0.447088183530672,"Zci_02003/Zci_08054",2
"GO:0051173","GO:0051173","positive regulation of nitrogen compound metabolic process","3/27","236/4295",0.182805931451363,0.450429411948517,0.447088183530672,"Zci_02003/Zci_05575/Zci_07393",3
"GO:0004540","GO:0004540","ribonuclease activity","1/27","32/4295",0.183340688449025,0.450429411948517,0.447088183530672,"Zci_12358",1
"GO:0006164","GO:0006164","purine nucleotide biosynthetic process","1/27","32/4295",0.183340688449025,0.450429411948517,0.447088183530672,"Zci_03245",1
"GO:0009063","GO:0009063","cellular amino acid catabolic process","1/27","32/4295",0.183340688449025,0.450429411948517,0.447088183530672,"Zci_00322",1
"GO:0022411","GO:0022411","cellular component disassembly","1/27","32/4295",0.183340688449025,0.450429411948517,0.447088183530672,"Zci_02003",1
"GO:1905393","GO:1905393","plant organ formation","1/27","32/4295",0.183340688449025,0.450429411948517,0.447088183530672,"Zci_02011",1
"GO:0006914","GO:0006914","autophagy","1/27","33/4295",0.188513055658004,0.450429411948517,0.447088183530672,"Zci_02003",1
"GO:0008237","GO:0008237","metallopeptidase activity","1/27","33/4295",0.188513055658004,0.450429411948517,0.447088183530672,"Zci_00856",1
"GO:0042176","GO:0042176","regulation of protein catabolic process","1/27","33/4295",0.188513055658004,0.450429411948517,0.447088183530672,"Zci_02003",1
"GO:0061919","GO:0061919","process utilizing autophagic mechanism","1/27","33/4295",0.188513055658004,0.450429411948517,0.447088183530672,"Zci_02003",1
"GO:0090351","GO:0090351","seedling development","1/27","33/4295",0.188513055658004,0.450429411948517,0.447088183530672,"Zci_12208",1
"GO:0009144","GO:0009144","purine nucleoside triphosphate metabolic process","1/27","34/4295",0.193653869242526,0.450429411948517,0.447088183530672,"Zci_03245",1
"GO:0009199","GO:0009199","ribonucleoside triphosphate metabolic process","1/27","34/4295",0.193653869242526,0.450429411948517,0.447088183530672,"Zci_03245",1
"GO:0009205","GO:0009205","purine ribonucleoside triphosphate metabolic process","1/27","34/4295",0.193653869242526,0.450429411948517,0.447088183530672,"Zci_03245",1
"GO:0031331","GO:0031331","positive regulation of cellular catabolic process","1/27","34/4295",0.193653869242526,0.450429411948517,0.447088183530672,"Zci_02003",1
"GO:0042981","GO:0042981","regulation of apoptotic process","1/27","34/4295",0.193653869242526,0.450429411948517,0.447088183530672,"Zci_02003",1
"GO:0046148","GO:0046148","pigment biosynthetic process","1/27","34/4295",0.193653869242526,0.450429411948517,0.447088183530672,"Zci_02011",1
"GO:0072522","GO:0072522","purine-containing compound biosynthetic process","1/27","34/4295",0.193653869242526,0.450429411948517,0.447088183530672,"Zci_03245",1
"GO:1990837","GO:1990837","sequence-specific double-stranded DNA binding","1/27","34/4295",0.193653869242526,0.450429411948517,0.447088183530672,"Zci_10818",1
"GO:0031327","GO:0031327","negative regulation of cellular biosynthetic process","2/27","129/4295",0.193811507263798,0.450429411948517,0.447088183530672,"Zci_05575/Zci_10818",2
"GO:0009414","GO:0009414","response to water deprivation","2/27","130/4295",0.196110397479785,0.450429411948517,0.447088183530672,"Zci_00322/Zci_08054",2
"GO:0009415","GO:0009415","response to water","2/27","131/4295",0.198413202721406,0.450429411948517,0.447088183530672,"Zci_00322/Zci_08054",2
"GO:0009890","GO:0009890","negative regulation of biosynthetic process","2/27","131/4295",0.198413202721406,0.450429411948517,0.447088183530672,"Zci_05575/Zci_10818",2
"GO:0008299","GO:0008299","isoprenoid biosynthetic process","1/27","35/4295",0.198763314332987,0.450429411948517,0.447088183530672,"Zci_02011",1
"GO:0009787","GO:0009787","regulation of abscisic acid-activated signaling pathway","1/27","35/4295",0.198763314332987,0.450429411948517,0.447088183530672,"Zci_08054",1
"GO:0030684","GO:0030684","preribosome","1/27","35/4295",0.198763314332987,0.450429411948517,0.447088183530672,"Zci_10883",1
"GO:0036293","GO:0036293","response to decreased oxygen levels","1/27","35/4295",0.198763314332987,0.450429411948517,0.447088183530672,"Zci_02003",1
"GO:1901419","GO:1901419","regulation of response to alcohol","1/27","35/4295",0.198763314332987,0.450429411948517,0.447088183530672,"Zci_08054",1
"GO:1905957","GO:1905957","regulation of cellular response to alcohol","1/27","35/4295",0.198763314332987,0.450429411948517,0.447088183530672,"Zci_08054",1
"GO:0048522","GO:0048522","positive regulation of cellular process","4/27","372/4295",0.201564184729682,0.451634121598542,0.448283956796857,"Zci_02003/Zci_05575/Zci_07393/Zci_12358",4
"GO:0006633","GO:0006633","fatty acid biosynthetic process","1/27","36/4295",0.203841575016792,0.451634121598542,0.448283956796857,"Zci_08692",1
"GO:0006778","GO:0006778","porphyrin-containing compound metabolic process","1/27","36/4295",0.203841575016792,0.451634121598542,0.448283956796857,"Zci_11706",1
"GO:0009896","GO:0009896","positive regulation of catabolic process","1/27","36/4295",0.203841575016792,0.451634121598542,0.448283956796857,"Zci_02003",1
"GO:0070482","GO:0070482","response to oxygen levels","1/27","36/4295",0.203841575016792,0.451634121598542,0.448283956796857,"Zci_02003",1
"GO:1901264","GO:1901264","carbohydrate derivative transport","1/27","36/4295",0.203841575016792,0.451634121598542,0.448283956796857,"Zci_12885",1
"GO:0004721","GO:0004721","phosphoprotein phosphatase activity","1/27","37/4295",0.208888834343992,0.452083487597164,0.448729989455327,"Zci_08054",1
"GO:0006897","GO:0006897","endocytosis","1/27","37/4295",0.208888834343992,0.452083487597164,0.448729989455327,"Zci_01582",1
"GO:0009141","GO:0009141","nucleoside triphosphate metabolic process","1/27","37/4295",0.208888834343992,0.452083487597164,0.448729989455327,"Zci_03245",1
"GO:0033013","GO:0033013","tetrapyrrole metabolic process","1/27","37/4295",0.208888834343992,0.452083487597164,0.448729989455327,"Zci_11706",1
"GO:0042742","GO:0042742","defense response to bacterium","2/27","136/4295",0.20998134211252,0.452083487597164,0.448729989455327,"Zci_00322/Zci_11706",2
"GO:0006721","GO:0006721","terpenoid metabolic process","1/27","38/4295",0.213905274332887,0.452083487597164,0.448729989455327,"Zci_02011",1
"GO:0009110","GO:0009110","vitamin biosynthetic process","1/27","38/4295",0.213905274332887,0.452083487597164,0.448729989455327,"Zci_08692",1
"GO:0009706","GO:0009706","chloroplast inner membrane","1/27","38/4295",0.213905274332887,0.452083487597164,0.448729989455327,"Zci_11706",1
"GO:0010638","GO:0010638","positive regulation of organelle organization","1/27","38/4295",0.213905274332887,0.452083487597164,0.448729989455327,"Zci_07393",1
"GO:0016765","GO:0016765","transferase activity, transferring alkyl or aryl (other than methyl) groups","1/27","38/4295",0.213905274332887,0.452083487597164,0.448729989455327,"Zci_08692",1
"GO:0018208","GO:0018208","peptidyl-proline modification","1/27","38/4295",0.213905274332887,0.452083487597164,0.448729989455327,"Zci_02258",1
"GO:0031625","GO:0031625","ubiquitin protein ligase binding","1/27","38/4295",0.213905274332887,0.452083487597164,0.448729989455327,"Zci_11175",1
"GO:1902275","GO:1902275","regulation of chromatin organization","1/27","38/4295",0.213905274332887,0.452083487597164,0.448729989455327,"Zci_07393",1
"GO:0031123","GO:0031123","RNA 3'-end processing","1/27","39/4295",0.218891075975595,0.455115037584829,0.451739051788545,"Zci_12358",1
"GO:0044389","GO:0044389","ubiquitin-like protein ligase binding","1/27","39/4295",0.218891075975595,0.455115037584829,0.451739051788545,"Zci_11175",1
"GO:0045088","GO:0045088","regulation of innate immune response","1/27","39/4295",0.218891075975595,0.455115037584829,0.451739051788545,"Zci_12358",1
"GO:0009409","GO:0009409","response to cold","2/27","140/4295",0.219293109764822,0.455115037584829,0.451739051788545,"Zci_07393/Zci_08054",2
"GO:0010604","GO:0010604","positive regulation of macromolecule metabolic process","3/27","261/4295",0.223779069192652,0.455115037584829,0.451739051788545,"Zci_02003/Zci_05575/Zci_07393",3
"GO:0006470","GO:0006470","protein dephosphorylation","1/27","40/4295",0.223846419243607,0.455115037584829,0.451739051788545,"Zci_08054",1
"GO:0009528","GO:0009528","plastid inner membrane","1/27","40/4295",0.223846419243607,0.455115037584829,0.451739051788545,"Zci_11706",1
"GO:0009751","GO:0009751","response to salicylic acid","1/27","40/4295",0.223846419243607,0.455115037584829,0.451739051788545,"Zci_05575",1
"GO:0019901","GO:0019901","protein kinase binding","1/27","40/4295",0.223846419243607,0.455115037584829,0.451739051788545,"Zci_08054",1
"GO:0071555","GO:0071555","cell wall organization","1/27","40/4295",0.223846419243607,0.455115037584829,0.451739051788545,"Zci_08692",1
"GO:0031325","GO:0031325","positive regulation of cellular metabolic process","3/27","262/4295",0.225460654063191,0.455115037584829,0.451739051788545,"Zci_02003/Zci_05575/Zci_07393",3
"GO:1902680","GO:1902680","positive regulation of RNA biosynthetic process","2/27","144/4295",0.228647223264961,0.455115037584829,0.451739051788545,"Zci_05575/Zci_07393",2
"GO:1903508","GO:1903508","positive regulation of nucleic acid-templated transcription","2/27","144/4295",0.228647223264961,0.455115037584829,0.451739051788545,"Zci_05575/Zci_07393",2
"GO:0001558","GO:0001558","regulation of cell growth","1/27","41/4295",0.228771483093295,0.455115037584829,0.451739051788545,"Zci_04376",1
"GO:0006766","GO:0006766","vitamin metabolic process","1/27","41/4295",0.228771483093295,0.455115037584829,0.451739051788545,"Zci_08692",1
"GO:0031977","GO:0031977","thylakoid lumen","1/27","41/4295",0.228771483093295,0.455115037584829,0.451739051788545,"Zci_00856",1
"GO:0045017","GO:0045017","glycerolipid biosynthetic process","1/27","41/4295",0.228771483093295,0.455115037584829,0.451739051788545,"Zci_15594",1
"GO:0016491","GO:0016491","oxidoreductase activity","3/27","265/4295",0.230522328760108,0.455115037584829,0.451739051788545,"Zci_00322/Zci_03245/Zci_11706",3
"GO:0007033","GO:0007033","vacuole organization","1/27","42/4295",0.233666445471406,0.455115037584829,0.451739051788545,"Zci_02003",1
"GO:0009260","GO:0009260","ribonucleotide biosynthetic process","1/27","42/4295",0.233666445471406,0.455115037584829,0.451739051788545,"Zci_03245",1
"GO:0030162","GO:0030162","regulation of proteolysis","1/27","42/4295",0.233666445471406,0.455115037584829,0.451739051788545,"Zci_02003",1
"GO:0034976","GO:0034976","response to endoplasmic reticulum stress","1/27","42/4295",0.233666445471406,0.455115037584829,0.451739051788545,"Zci_02003",1
"GO:0046390","GO:0046390","ribose phosphate biosynthetic process","1/27","42/4295",0.233666445471406,0.455115037584829,0.451739051788545,"Zci_03245",1
"GO:0080008","GO:0080008","Cul4-RING E3 ubiquitin ligase complex","1/27","42/4295",0.233666445471406,0.455115037584829,0.451739051788545,"Zci_10883",1
"GO:1901657","GO:1901657","glycosyl compound metabolic process","1/27","43/4295",0.238531483320518,0.463077407358399,0.459642357710032,"Zci_03245",1
"GO:0018130","GO:0018130","heterocycle biosynthetic process","3/27","272/4295",0.242425610076226,0.465951647021815,0.462495276627093,"Zci_03245/Zci_08692/Zci_10818",3
"GO:0006979","GO:0006979","response to oxidative stress","2/27","150/4295",0.242741394949011,0.465951647021815,0.462495276627093,"Zci_00322/Zci_12358",2
"GO:0031968","GO:0031968","organelle outer membrane","1/27","44/4295",0.243366772584474,0.465951647021815,0.462495276627093,"Zci_15568",1
"GO:0098657","GO:0098657","import into cell","1/27","44/4295",0.243366772584474,0.465951647021815,0.462495276627093,"Zci_01582",1
"GO:0051252","GO:0051252","regulation of RNA metabolic process","4/27","403/4295",0.243920996427527,0.465951647021815,0.462495276627093,"Zci_05575/Zci_07393/Zci_10818/Zci_12358",4
"GO:0009892","GO:0009892","negative regulation of metabolic process","3/27","274/4295",0.245848720637854,0.468133666134699,0.46466110979813,"Zci_00856/Zci_05575/Zci_10818",3
"GO:0019867","GO:0019867","outer membrane","1/27","45/4295",0.24817248821379,0.469558104683869,0.466074982042272,"Zci_15568",1
"GO:0048509","GO:0048509","regulation of meristem development","1/27","45/4295",0.24817248821379,0.469558104683869,0.466074982042272,"Zci_02011",1
"GO:0009617","GO:0009617","response to bacterium","2/27","153/4295",0.249810291587328,0.471117147768525,0.467622460342478,"Zci_00322/Zci_11706",2
"GO:0003682","GO:0003682","chromatin binding","1/27","46/4295",0.25294880417102,0.471117147768525,0.467622460342478,"Zci_07393",1
"GO:0006366","GO:0006366","transcription by RNA polymerase II","1/27","46/4295",0.25294880417102,0.471117147768525,0.467622460342478,"Zci_10818",1
"GO:0008194","GO:0008194","UDP-glycosyltransferase activity","1/27","46/4295",0.25294880417102,0.471117147768525,0.467622460342478,"Zci_12208",1
"GO:0010016","GO:0010016","shoot system morphogenesis","1/27","46/4295",0.25294880417102,0.471117147768525,0.467622460342478,"Zci_02011",1
"GO:0071705","GO:0071705","nitrogen compound transport","3/27","279/4295",0.254445880128784,0.472429110768708,0.468924691367033,"Zci_09109/Zci_12885/Zci_15568",3
"GO:0048638","GO:0048638","regulation of developmental growth","1/27","47/4295",0.257695893436114,0.476977492198521,0.473439333478574,"Zci_04376",1
"GO:0051254","GO:0051254","positive regulation of RNA metabolic process","2/27","157/4295",0.259251636017937,0.478371439834956,0.474822940987716,"Zci_05575/Zci_07393",2
"GO:0006720","GO:0006720","isoprenoid metabolic process","1/27","48/4295",0.262413928011731,0.479750616855804,0.47619188744783,"Zci_02011",1
"GO:0016616","GO:0016616","oxidoreductase activity, acting on the CH-OH group of donors, NAD or NADP as acceptor","1/27","48/4295",0.262413928011731,0.479750616855804,0.47619188744783,"Zci_03245",1
"GO:1902531","GO:1902531","regulation of intracellular signal transduction","1/27","48/4295",0.262413928011731,0.479750616855804,0.47619188744783,"Zci_02003",1
"GO:0048868","GO:0048868","pollen tube development","1/27","49/4295",0.267103078928539,0.485345838540882,0.481745604486004,"Zci_04376",1
"GO:0050776","GO:0050776","regulation of immune response","1/27","49/4295",0.267103078928539,0.485345838540882,0.481745604486004,"Zci_12358",1
"GO:0010557","GO:0010557","positive regulation of macromolecule biosynthetic process","2/27","164/4295",0.275800284254987,0.499626046857058,0.495919884022725,"Zci_05575/Zci_07393",2
"GO:0009644","GO:0009644","response to high light intensity","1/27","52/4295",0.280998925563208,0.504443854324313,0.500701953603433,"Zci_00856",1
"GO:0016614","GO:0016614","oxidoreductase activity, acting on CH-OH group of donors","1/27","52/4295",0.280998925563208,0.504443854324313,0.500701953603433,"Zci_03245",1
"GO:0045229","GO:0045229","external encapsulating structure organization","1/27","52/4295",0.280998925563208,0.504443854324313,0.500701953603433,"Zci_08692",1
"GO:0008219","GO:0008219","cell death","1/27","53/4295",0.285574232895236,0.508565918840611,0.504793441166414,"Zci_11706",1
"GO:0090501","GO:0090501","RNA phosphodiester bond hydrolysis","1/27","53/4295",0.285574232895236,0.508565918840611,0.504793441166414,"Zci_12358",1
"GO:0043207","GO:0043207","response to external biotic stimulus","3/27","298/4295",0.287540362519897,0.508565918840611,0.504793441166414,"Zci_00322/Zci_05575/Zci_11706",3
"GO:0051707","GO:0051707","response to other organism","3/27","298/4295",0.287540362519897,0.508565918840611,0.504793441166414,"Zci_00322/Zci_05575/Zci_11706",3
"GO:0032268","GO:0032268","regulation of cellular protein metabolic process","2/27","170/4295",0.289990428281521,0.508565918840611,0.504793441166414,"Zci_02003/Zci_07393",2
"GO:0002682","GO:0002682","regulation of immune system process","1/27","54/4295",0.290121497325181,0.508565918840611,0.504793441166414,"Zci_12358",1
"GO:0045595","GO:0045595","regulation of cell differentiation","1/27","54/4295",0.290121497325181,0.508565918840611,0.504793441166414,"Zci_04376",1
"GO:1901617","GO:1901617","organic hydroxy compound biosynthetic process","1/27","54/4295",0.290121497325181,0.508565918840611,0.504793441166414,"Zci_08692",1
"GO:0009607","GO:0009607","response to biotic stimulus","3/27","300/4295",0.291055277520541,0.508706584757309,0.50493306364113,"Zci_00322/Zci_05575/Zci_11706",3
"GO:0031328","GO:0031328","positive regulation of cellular biosynthetic process","2/27","171/4295",0.292354477351962,0.509483241233244,0.50570395897754,"Zci_05575/Zci_07393",2
"GO:0009150","GO:0009150","purine ribonucleotide metabolic process","1/27","55/4295",0.294640884161357,0.51197074915501,0.508173014880106,"Zci_03245",1
"GO:1901362","GO:1901362","organic cyclic compound biosynthetic process","3/27","306/4295",0.301626711669056,0.521378631771907,0.517511111013443,"Zci_03245/Zci_08692/Zci_10818",3
"GO:0045935","GO:0045935","positive regulation of nucleobase-containing compound metabolic process","2/27","175/4295",0.301804744901523,0.521378631771907,0.517511111013443,"Zci_05575/Zci_07393",2
"GO:0006163","GO:0006163","purine nucleotide metabolic process","1/27","57/4295",0.303596681612186,0.52295844578284,0.519079206163823,"Zci_03245",1
"GO:0009605","GO:0009605","response to external stimulus","4/27","446/4295",0.30596781999369,0.525523979009335,0.521625708589273,"Zci_00322/Zci_04376/Zci_05575/Zci_11706",4
"GO:0048367","GO:0048367","shoot system development","2/27","178/4295",0.308883918317483,0.529008089992011,0.52508397487727,"Zci_02011/Zci_11706",2
"GO:0005768","GO:0005768","endosome","2/27","179/4295",0.311241591782335,0.530529873898574,0.526594470383255,"Zci_01877/Zci_09109",2
"GO:0016054","GO:0016054","organic acid catabolic process","1/27","59/4295",0.312442929091274,0.530529873898574,0.526594470383255,"Zci_00322",1
"GO:0046395","GO:0046395","carboxylic acid catabolic process","1/27","59/4295",0.312442929091274,0.530529873898574,0.526594470383255,"Zci_00322",1
"GO:0051172","GO:0051172","negative regulation of nitrogen compound metabolic process","2/27","181/4295",0.315953396465545,0.534923296052,0.530955302686725,"Zci_05575/Zci_10818",2
"GO:0010119","GO:0010119","regulation of stomatal movement","1/27","60/4295",0.316825375010664,0.534923296052,0.530955302686725,"Zci_08054",1
"GO:0019684","GO:0019684","photosynthesis, light reaction","1/27","61/4295",0.321180915713075,0.540745270522579,0.536734090486912,"Zci_00856",1
"GO:0019219","GO:0019219","regulation of nucleobase-containing compound metabolic process","4/27","457/4295",0.3222480908039,0.540771417549749,0.536760043558741,"Zci_05575/Zci_07393/Zci_10818/Zci_12358",4
"GO:0010629","GO:0010629","negative regulation of gene expression","2/27","184/4295",0.323011115180723,0.540771417549749,0.536760043558741,"Zci_05575/Zci_10818",2
"GO:0016192","GO:0016192","vesicle-mediated transport","2/27","186/4295",0.327708742605202,0.541908624770386,0.537888815120022,"Zci_01582/Zci_06361",2
"GO:0051246","GO:0051246","regulation of protein metabolic process","2/27","186/4295",0.327708742605202,0.541908624770386,0.537888815120022,"Zci_02003/Zci_07393",2
"GO:0009968","GO:0009968","negative regulation of signal transduction","1/27","63/4295",0.32981191602248,0.541908624770386,0.537888815120022,"Zci_08054",1
"GO:0031329","GO:0031329","regulation of cellular catabolic process","1/27","63/4295",0.32981191602248,0.541908624770386,0.537888815120022,"Zci_02003",1
"GO:0031461","GO:0031461","cullin-RING ubiquitin ligase complex","1/27","63/4295",0.32981191602248,0.541908624770386,0.537888815120022,"Zci_10883",1
"GO:0046486","GO:0046486","glycerolipid metabolic process","1/27","63/4295",0.32981191602248,0.541908624770386,0.537888815120022,"Zci_15594",1
"GO:0006886","GO:0006886","intracellular protein transport","2/27","187/4295",0.330055085220889,0.541908624770386,0.537888815120022,"Zci_09109/Zci_15568",2
"GO:0005516","GO:0005516","calmodulin binding","1/27","64/4295",0.334087690660333,0.544324554936626,0.540286824221801,"Zci_12358",1
"GO:0051130","GO:0051130","positive regulation of cellular component organization","1/27","64/4295",0.334087690660333,0.544324554936626,0.540286824221801,"Zci_07393",1
"GO:0065009","GO:0065009","regulation of molecular function","2/27","189/4295",0.334742477864356,0.544324554936626,0.540286824221801,"Zci_02003/Zci_08054",2
"GO:0034654","GO:0034654","nucleobase-containing compound biosynthetic process","2/27","190/4295",0.337083390365052,0.544324554936626,0.540286824221801,"Zci_03245/Zci_10818",2
"GO:0009738","GO:0009738","abscisic acid-activated signaling pathway","1/27","65/4295",0.338337190152692,0.544324554936626,0.540286824221801,"Zci_08054",1
"GO:0010564","GO:0010564","regulation of cell cycle process","1/27","65/4295",0.338337190152692,0.544324554936626,0.540286824221801,"Zci_05575",1
"GO:0048608","GO:0048608","reproductive structure development","3/27","327/4295",0.338832902485718,0.544324554936626,0.540286824221801,"Zci_04376/Zci_11706/Zci_12208",3
"GO:0061458","GO:0061458","reproductive system development","3/27","327/4295",0.338832902485718,0.544324554936626,0.540286824221801,"Zci_04376/Zci_11706/Zci_12208",3
"GO:0009259","GO:0009259","ribonucleotide metabolic process","1/27","66/4295",0.342560569790015,0.54444293225293,0.540404323430143,"Zci_03245",1
"GO:0010243","GO:0010243","response to organonitrogen compound","1/27","66/4295",0.342560569790015,0.54444293225293,0.540404323430143,"Zci_02003",1
"GO:0010648","GO:0010648","negative regulation of cell communication","1/27","66/4295",0.342560569790015,0.54444293225293,0.540404323430143,"Zci_08054",1
"GO:0023057","GO:0023057","negative regulation of signaling","1/27","66/4295",0.342560569790015,0.54444293225293,0.540404323430143,"Zci_08054",1
"GO:0009733","GO:0009733","response to auxin","1/27","67/4295",0.346757983981471,0.548069394311583,0.544003884851836,"Zci_07393",1
"GO:0016747","GO:0016747","acyltransferase activity, transferring groups other than amino-acyl groups","1/27","67/4295",0.346757983981471,0.548069394311583,0.544003884851836,"Zci_15594",1
"GO:0009889","GO:0009889","regulation of biosynthetic process","4/27","474/4295",0.347601058808353,0.548069394311583,0.544003884851836,"Zci_02011/Zci_05575/Zci_07393/Zci_10818",4
"GO:0004519","GO:0004519","endonuclease activity","1/27","68/4295",0.350929586259736,0.549337674392072,0.545262756991072,"Zci_12358",1
"GO:0007005","GO:0007005","mitochondrion organization","1/27","68/4295",0.350929586259736,0.549337674392072,0.545262756991072,"Zci_15568",1
"GO:0031967","GO:0031967","organelle envelope","4/27","477/4295",0.352092267815053,0.549337674392072,0.545262756991072,"Zci_00856/Zci_11706/Zci_12885/Zci_15568",4
"GO:0031984","GO:0031984","organelle subcompartment","4/27","477/4295",0.352092267815053,0.549337674392072,0.545262756991072,"Zci_00856/Zci_01877/Zci_11706/Zci_15594",4
"GO:0033044","GO:0033044","regulation of chromosome organization","1/27","69/4295",0.355075529285756,0.551126853554984,0.547038664249207,"Zci_07393",1
"GO:0031975","GO:0031975","envelope","4/27","479/4295",0.355088442558916,0.551126853554984,0.547038664249207,"Zci_00856/Zci_11706/Zci_12885/Zci_15568",4
"GO:0009534","GO:0009534","chloroplast thylakoid","2/27","199/4295",0.358056210728281,0.553763330335613,0.549655583978478,"Zci_00856/Zci_11706",2
"GO:0003690","GO:0003690","double-stranded DNA binding","1/27","71/4295",0.363291043894672,0.553763330335613,0.549655583978478,"Zci_10818",1
"GO:0006351","GO:0006351","transcription, DNA-templated","1/27","71/4295",0.363291043894672,0.553763330335613,0.549655583978478,"Zci_10818",1
"GO:0009165","GO:0009165","nucleotide biosynthetic process","1/27","71/4295",0.363291043894672,0.553763330335613,0.549655583978478,"Zci_03245",1
"GO:0072521","GO:0072521","purine-containing compound metabolic process","1/27","71/4295",0.363291043894672,0.553763330335613,0.549655583978478,"Zci_03245",1
"GO:0097659","GO:0097659","nucleic acid-templated transcription","1/27","71/4295",0.363291043894672,0.553763330335613,0.549655583978478,"Zci_10818",1
"GO:1901293","GO:1901293","nucleoside phosphate biosynthetic process","1/27","71/4295",0.363291043894672,0.553763330335613,0.549655583978478,"Zci_03245",1
"GO:0031976","GO:0031976","plastid thylakoid","2/27","202/4295",0.365004090203325,0.554251928854095,0.550140558134937,"Zci_00856/Zci_11706",2
"GO:0019693","GO:0019693","ribose phosphate metabolic process","1/27","72/4295",0.367360916483414,0.554251928854095,0.550140558134937,"Zci_03245",1
"GO:0072330","GO:0072330","monocarboxylic acid biosynthetic process","1/27","72/4295",0.367360916483414,0.554251928854095,0.550140558134937,"Zci_08692",1
"GO:0009856","GO:0009856","pollination","1/27","73/4295",0.371405731840967,0.554251928854095,0.550140558134937,"Zci_04376",1
"GO:0044706","GO:0044706","multi-multicellular organism process","1/27","73/4295",0.371405731840967,0.554251928854095,0.550140558134937,"Zci_04376",1
"GO:0006631","GO:0006631","fatty acid metabolic process","1/27","74/4295",0.375425638340326,0.554251928854095,0.550140558134937,"Zci_08692",1
"GO:0009894","GO:0009894","regulation of catabolic process","1/27","74/4295",0.375425638340326,0.554251928854095,0.550140558134937,"Zci_02003",1
"GO:0015979","GO:0015979","photosynthesis","1/27","74/4295",0.375425638340326,0.554251928854095,0.550140558134937,"Zci_00856",1
"GO:0016746","GO:0016746","acyltransferase activity","1/27","74/4295",0.375425638340326,0.554251928854095,0.550140558134937,"Zci_15594",1
"GO:0043161","GO:0043161","proteasome-mediated ubiquitin-dependent protein catabolic process","1/27","74/4295",0.375425638340326,0.554251928854095,0.550140558134937,"Zci_02003",1
"GO:0048646","GO:0048646","anatomical structure formation involved in morphogenesis","1/27","74/4295",0.375425638340326,0.554251928854095,0.550140558134937,"Zci_02011",1
"GO:0051052","GO:0051052","regulation of DNA metabolic process","1/27","74/4295",0.375425638340326,0.554251928854095,0.550140558134937,"Zci_05575",1
"GO:0051128","GO:0051128","regulation of cellular component organization","2/27","207/4295",0.37652932841545,0.554251928854095,0.550140558134937,"Zci_04376/Zci_07393",2
"GO:0015031","GO:0015031","protein transport","2/27","208/4295",0.378825690056351,0.554251928854095,0.550140558134937,"Zci_09109/Zci_15568",2
"GO:0015833","GO:0015833","peptide transport","2/27","208/4295",0.378825690056351,0.554251928854095,0.550140558134937,"Zci_09109/Zci_15568",2
"GO:0015931","GO:0015931","nucleobase-containing compound transport","1/27","75/4295",0.379420783510857,0.554251928854095,0.550140558134937,"Zci_12885",1
"GO:0031969","GO:0031969","chloroplast membrane","1/27","75/4295",0.379420783510857,0.554251928854095,0.550140558134937,"Zci_11706",1
"GO:0010817","GO:0010817","regulation of hormone levels","1/27","76/4295",0.383391314042896,0.55596404664128,0.551839975648886,"Zci_02011",1
"GO:0015711","GO:0015711","organic anion transport","1/27","76/4295",0.383391314042896,0.55596404664128,0.551839975648886,"Zci_12885",1
"GO:0045087","GO:0045087","innate immune response","1/27","76/4295",0.383391314042896,0.55596404664128,0.551839975648886,"Zci_11706",1
"GO:0009908","GO:0009908","flower development","1/27","77/4295",0.387337375792326,0.558541839690298,0.554398646955047,"Zci_11706",1
"GO:0032774","GO:0032774","RNA biosynthetic process","1/27","77/4295",0.387337375792326,0.558541839690298,0.554398646955047,"Zci_10818",1
"GO:0042886","GO:0042886","amide transport","2/27","212/4295",0.387980405422455,0.558541839690298,0.554398646955047,"Zci_09109/Zci_15568",2
"GO:0006355","GO:0006355","regulation of transcription, DNA-templated","3/27","356/4295",0.390238867365909,0.559124140148043,0.554976627981632,"Zci_05575/Zci_07393/Zci_10818",3
"GO:0045184","GO:0045184","establishment of protein localization","2/27","213/4295",0.390261144801319,0.559124140148043,0.554976627981632,"Zci_09109/Zci_15568",2
"GO:0010498","GO:0010498","proteasomal protein catabolic process","1/27","79/4295",0.395156672221877,0.564780279722394,0.56059081102788,"Zci_02003",1
"GO:0048316","GO:0048316","seed development","2/27","216/4295",0.397083512480625,0.564897852521283,0.560707511686614,"Zci_04376/Zci_12208",2
"GO:0009642","GO:0009642","response to light intensity","1/27","80/4295",0.399030194482315,0.564897852521283,0.560707511686614,"Zci_00856",1
"GO:0071215","GO:0071215","cellular response to abscisic acid stimulus","1/27","80/4295",0.399030194482315,0.564897852521283,0.560707511686614,"Zci_08054",1
"GO:0097306","GO:0097306","cellular response to alcohol","1/27","80/4295",0.399030194482315,0.564897852521283,0.560707511686614,"Zci_08054",1
"GO:0001101","GO:0001101","response to acid chemical","3/27","362/4295",0.400811719016675,0.565679751201061,0.561483610340862,"Zci_00322/Zci_05575/Zci_08054",3
"GO:0006955","GO:0006955","immune response","1/27","81/4295",0.40287982312976,0.565679751201061,0.561483610340862,"Zci_11706",1
"GO:0042170","GO:0042170","plastid membrane","1/27","81/4295",0.40287982312976,0.565679751201061,0.561483610340862,"Zci_11706",1
"GO:1903506","GO:1903506","regulation of nucleic acid-templated transcription","3/27","364/4295",0.404328144314852,0.565679751201061,0.561483610340862,"Zci_05575/Zci_07393/Zci_10818",3
"GO:2001141","GO:2001141","regulation of RNA biosynthetic process","3/27","364/4295",0.404328144314852,0.565679751201061,0.561483610340862,"Zci_05575/Zci_07393/Zci_10818",3
"GO:0044282","GO:0044282","small molecule catabolic process","1/27","82/4295",0.406705699915592,0.566347189602086,0.56214609776823,"Zci_00322",1
"GO:0070925","GO:0070925","organelle assembly","1/27","82/4295",0.406705699915592,0.566347189602086,0.56214609776823,"Zci_02003",1
"GO:0040008","GO:0040008","regulation of growth","1/27","83/4295",0.410507965783686,0.568983133969946,0.564762489034103,"Zci_04376",1
"GO:0090567","GO:0090567","reproductive shoot system development","1/27","83/4295",0.410507965783686,0.568983133969946,0.564762489034103,"Zci_11706",1
"GO:0031410","GO:0031410","cytoplasmic vesicle","2/27","223/4295",0.412880525775967,0.569622206857585,0.565396821359877,"Zci_01877/Zci_09109",2
"GO:0097708","GO:0097708","intracellular vesicle","2/27","223/4295",0.412880525775967,0.569622206857585,0.565396821359877,"Zci_01877/Zci_09109",2
"GO:0034613","GO:0034613","cellular protein localization","2/27","224/4295",0.415122654915738,0.571392846027205,0.567154326152047,"Zci_09109/Zci_15568",2
"GO:0006970","GO:0006970","response to osmotic stress","2/27","225/4295",0.417361007793294,0.572765898437937,0.568517193433628,"Zci_00322/Zci_10818",2
"GO:0000151","GO:0000151","ubiquitin ligase complex","1/27","85/4295",0.418042224531044,0.572765898437937,0.568517193433628,"Zci_10883",1
"GO:0098542","GO:0098542","defense response to other organism","2/27","226/4295",0.419595542841431,0.573575558563058,0.569320847602328,"Zci_00322/Zci_11706",2
"GO:0005777","GO:0005777","peroxisome","1/27","87/4295",0.425483710939643,0.57896870255714,0.574673985936264,"Zci_03652",1
"GO:0042579","GO:0042579","microbody","1/27","87/4295",0.425483710939643,0.57896870255714,0.574673985936264,"Zci_03652",1
"GO:1901605","GO:1901605","alpha-amino acid metabolic process","1/27","89/4295",0.432833523936971,0.586410264174156,0.582060346990243,"Zci_00322",1
"GO:0016788","GO:0016788","hydrolase activity, acting on ester bonds","2/27","232/4295",0.432920329256088,0.586410264174156,0.582060346990243,"Zci_08054/Zci_12358",2
"GO:0006605","GO:0006605","protein targeting","1/27","90/4295",0.436474392898859,0.589702353392281,0.585328015906856,"Zci_15568",1
"GO:0031982","GO:0031982","vesicle","2/27","234/4295",0.43732959764998,0.589702353392281,0.585328015906856,"Zci_01877/Zci_09109",2
"GO:0003006","GO:0003006","developmental process involved in reproduction","3/27","386/4295",0.442675151428478,0.595562957678042,0.591145146971141,"Zci_04376/Zci_11706/Zci_12208",3
"GO:0044283","GO:0044283","small molecule biosynthetic process","2/27","237/4295",0.443912179902275,0.595882115364315,0.591461937186056,"Zci_03245/Zci_08692",2
"GO:0016791","GO:0016791","phosphatase activity","1/27","93/4295",0.44726246303167,0.597687058221694,0.593253491205567,"Zci_08054",1
"GO:0016853","GO:0016853","isomerase activity","1/27","93/4295",0.44726246303167,0.597687058221694,0.593253491205567,"Zci_02258",1
"GO:0070727","GO:0070727","cellular macromolecule localization","2/27","239/4295",0.448279279762547,0.597705706350063,0.593272001004478,"Zci_09109/Zci_15568",2
"GO:0046677","GO:0046677","response to antibiotic","1/27","94/4295",0.450814084520995,0.59974373744311,0.5952949142406,"Zci_05575",1
"GO:0008104","GO:0008104","protein localization","2/27","243/4295",0.456961183905854,0.606398895892147,0.601900705565854,"Zci_09109/Zci_15568",2
"GO:0016311","GO:0016311","dephosphorylation","1/27","96/4295",0.457851515354809,0.606398895892147,0.601900705565854,"Zci_08054",1
"GO:0006364","GO:0006364","rRNA processing","1/27","99/4295",0.468245082639346,0.618789510538915,0.614199408200053,"Zci_10883",1
"GO:0004518","GO:0004518","nuclease activity","1/27","101/4295",0.475067241973665,0.621080853407072,0.616473754176571,"Zci_12358",1
"GO:0006820","GO:0006820","anion transport","1/27","101/4295",0.475067241973665,0.621080853407072,0.616473754176571,"Zci_12885",1
"GO:0014070","GO:0014070","response to organic cyclic compound","1/27","101/4295",0.475067241973665,0.621080853407072,0.616473754176571,"Zci_05575",1
"GO:0071396","GO:0071396","cellular response to lipid","1/27","101/4295",0.475067241973665,0.621080853407072,0.616473754176571,"Zci_08054",1
"GO:0003677","GO:0003677","DNA binding","2/27","252/4295",0.476231459743342,0.621080853407072,0.616473754176571,"Zci_05575/Zci_10818",2
"GO:0010605","GO:0010605","negative regulation of macromolecule metabolic process","2/27","252/4295",0.476231459743342,0.621080853407072,0.616473754176571,"Zci_05575/Zci_10818",2
"GO:0009791","GO:0009791","post-embryonic development","3/27","409/4295",0.481903950784024,0.627106451238598,0.622454654885363,"Zci_04376/Zci_11706/Zci_12208",3
"GO:0006952","GO:0006952","defense response","2/27","256/4295",0.484674485548347,0.627212672919458,0.622560088627226,"Zci_00322/Zci_11706",2
"GO:0016072","GO:0016072","rRNA metabolic process","1/27","104/4295",0.485142688281662,0.627212672919458,0.622560088627226,"Zci_10883",1
"GO:0044270","GO:0044270","cellular nitrogen compound catabolic process","1/27","104/4295",0.485142688281662,0.627212672919458,0.622560088627226,"Zci_11706",1
"GO:0042578","GO:0042578","phosphoric ester hydrolase activity","1/27","105/4295",0.488459592938401,0.630134020327461,0.625459765849581,"Zci_08054",1
"GO:0005802","GO:0005802","trans-Golgi network","1/27","106/4295",0.49175591537054,0.631651994743193,0.626966480123057,"Zci_01877",1
"GO:0019439","GO:0019439","aromatic compound catabolic process","1/27","106/4295",0.49175591537054,0.631651994743193,0.626966480123057,"Zci_11706",1
"GO:0046907","GO:0046907","intracellular transport","2/27","260/4295",0.49304036608893,0.631939910083876,0.627252259744151,"Zci_09109/Zci_15568",2
"GO:1901698","GO:1901698","response to nitrogen compound","1/27","107/4295",0.495031778413031,0.633130772390915,0.62843428838519,"Zci_02003",1
"GO:0009579","GO:0009579","thylakoid","2/27","263/4295",0.499263243082035,0.637175359479428,0.632448873238147,"Zci_00856/Zci_11706",2
"GO:0043933","GO:0043933","protein-containing complex organization","2/27","264/4295",0.501327601191025,0.638442842542417,0.633706954272056,"Zci_00856/Zci_02003",2
"GO:0016758","GO:0016758","hexosyltransferase activity","1/27","110/4295",0.504737829016441,0.639322049330538,0.634579639215405,"Zci_12208",1
"GO:0005739","GO:0005739","mitochondrion","3/27","423/4295",0.505236049051482,0.639322049330538,0.634579639215405,"Zci_00322/Zci_12885/Zci_15568",3
"GO:2000112","GO:2000112","regulation of cellular macromolecule biosynthetic process","3/27","423/4295",0.505236049051482,0.639322049330538,0.634579639215405,"Zci_05575/Zci_07393/Zci_10818",3
"GO:0019438","GO:0019438","aromatic compound biosynthetic process","2/27","268/4295",0.509534806166571,0.642659573745569,0.637892406296379,"Zci_03245/Zci_10818",2
"GO:0009620","GO:0009620","response to fungus","1/27","112/4295",0.511108452945302,0.642659573745569,0.637892406296379,"Zci_05575",1
"GO:0051726","GO:0051726","regulation of cell cycle","1/27","112/4295",0.511108452945302,0.642659573745569,0.637892406296379,"Zci_05575",1
"GO:0002376","GO:0002376","immune system process","1/27","113/4295",0.51426410003363,0.643779700077218,0.639004223672548,"Zci_11706",1
"GO:0006397","GO:0006397","mRNA processing","1/27","113/4295",0.51426410003363,0.643779700077218,0.639004223672548,"Zci_12358",1
"GO:0050793","GO:0050793","regulation of developmental process","2/27","271/4295",0.51563691990663,0.643779700077218,0.639004223672548,"Zci_02011/Zci_04376",2
"GO:0071554","GO:0071554","cell wall organization or biogenesis","1/27","114/4295",0.517400128082193,0.643779700077218,0.639004223672548,"Zci_08692",1
"GO:2000241","GO:2000241","regulation of reproductive process","1/27","114/4295",0.517400128082193,0.643779700077218,0.639004223672548,"Zci_04376",1
"GO:0009117","GO:0009117","nucleotide metabolic process","1/27","115/4295",0.520516654401682,0.646223268816933,0.641429666328358,"Zci_03245",1
"GO:0010556","GO:0010556","regulation of macromolecule biosynthetic process","3/27","433/4295",0.521612201243616,0.646223268816933,0.641429666328358,"Zci_05575/Zci_07393/Zci_10818",3
"GO:0006753","GO:0006753","nucleoside phosphate metabolic process","1/27","116/4295",0.523613795629231,0.646223268816933,0.641429666328358,"Zci_03245",1
"GO:0051649","GO:0051649","establishment of localization in cell","2/27","275/4295",0.52370107187681,0.646223268816933,0.641429666328358,"Zci_09109/Zci_15568",2
"GO:0008233","GO:0008233","peptidase activity","1/27","119/4295",0.532790065105996,0.65608032810573,0.651213607197846,"Zci_00856",1
"GO:0072594","GO:0072594","establishment of protein localization to organelle","1/27","120/4295",0.535810818995397,0.658439686847951,0.653555464515275,"Zci_15568",1
"GO:0033043","GO:0033043","regulation of organelle organization","1/27","121/4295",0.538812761004289,0.660766266581391,0.655864785974465,"Zci_07393",1
"GO:0006091","GO:0006091","generation of precursor metabolites and energy","1/27","122/4295",0.541796003805651,0.663060407121494,0.658141908870152,"Zci_00856",1
"GO:0071229","GO:0071229","cellular response to acid chemical","1/27","127/4295",0.556435628092491,0.679581217916239,0.674540170379595,"Zci_08054",1
"GO:0033036","GO:0033036","macromolecule localization","2/27","295/4295",0.56275427144294,0.685892731656426,0.680804866108992,"Zci_09109/Zci_15568",2
"GO:0031326","GO:0031326","regulation of cellular biosynthetic process","3/27","461/4295",0.566032561476454,0.687849411929044,0.682747031974784,"Zci_05575/Zci_07393/Zci_10818",3
"GO:0009755","GO:0009755","hormone-mediated signaling pathway","1/27","131/4295",0.567821997766929,0.687849411929044,0.682747031974784,"Zci_08054",1
"GO:0045893","GO:0045893","positive regulation of transcription, DNA-templated","1/27","131/4295",0.567821997766929,0.687849411929044,0.682747031974784,"Zci_05575",1
"GO:0003729","GO:0003729","mRNA binding","1/27","133/4295",0.573409109831911,0.691177696788131,0.686050628037672,"Zci_12358",1
"GO:0032787","GO:0032787","monocarboxylic acid metabolic process","1/27","133/4295",0.573409109831911,0.691177696788131,0.686050628037672,"Zci_08692",1
"GO:0019752","GO:0019752","carboxylic acid metabolic process","2/27","301/4295",0.57404859045323,0.691177696788131,0.686050628037672,"Zci_00322/Zci_08692",2
"GO:0090305","GO:0090305","nucleic acid phosphodiester bond hydrolysis","1/27","134/4295",0.576176518297682,0.691674832146097,0.686544075708418,"Zci_12358",1
"GO:0022414","GO:0022414","reproductive process","3/27","468/4295",0.576782536202366,0.691674832146097,0.686544075708418,"Zci_04376/Zci_11706/Zci_12208",3
"GO:0090407","GO:0090407","organophosphate biosynthetic process","1/27","135/4295",0.578926634617307,0.692331448187341,0.687195821054903,"Zci_03245",1
"GO:0000003","GO:0000003","reproduction","3/27","471/4295",0.581343939329266,0.692331448187341,0.687195821054903,"Zci_04376/Zci_11706/Zci_12208",3
"GO:0006520","GO:0006520","cellular amino acid metabolic process","1/27","136/4295",0.581659562709935,0.692331448187341,0.687195821054903,"Zci_00322",1
"GO:0005654","GO:0005654","nucleoplasm","2/27","306/4295",0.583309173694434,0.692331448187341,0.687195821054903,"Zci_02003/Zci_12358",2
"GO:0006396","GO:0006396","RNA processing","2/27","306/4295",0.583309173694434,0.692331448187341,0.687195821054903,"Zci_10883/Zci_12358",2
"GO:0005215","GO:0005215","transporter activity","2/27","307/4295",0.585144695608334,0.692331448187341,0.687195821054903,"Zci_09109/Zci_12885",2
"GO:0033365","GO:0033365","protein localization to organelle","1/27","139/4295",0.589756247842028,0.692331448187341,0.687195821054903,"Zci_15568",1
"GO:0000166","GO:0000166","nucleotide binding","1/27","140/4295",0.592421450274238,0.692331448187341,0.687195821054903,"Zci_00322",1
"GO:0005789","GO:0005789","endoplasmic reticulum membrane","1/27","140/4295",0.592421450274238,0.692331448187341,0.687195821054903,"Zci_15594",1
"GO:1901265","GO:1901265","nucleoside phosphate binding","1/27","140/4295",0.592421450274238,0.692331448187341,0.687195821054903,"Zci_00322",1
"GO:0006082","GO:0006082","organic acid metabolic process","2/27","311/4295",0.592431272777759,0.692331448187341,0.687195821054903,"Zci_00322/Zci_08692",2
"GO:0043436","GO:0043436","oxoacid metabolic process","2/27","311/4295",0.592431272777759,0.692331448187341,0.687195821054903,"Zci_00322/Zci_08692",2
"GO:0070887","GO:0070887","cellular response to chemical stimulus","2/27","311/4295",0.592431272777759,0.692331448187341,0.687195821054903,"Zci_02003/Zci_08054",2
"GO:0042175","GO:0042175","nuclear outer membrane-endoplasmic reticulum membrane network","1/27","141/4295",0.595069975146103,0.69269864294351,0.687560292006804,"Zci_15594",1
"GO:0098827","GO:0098827","endoplasmic reticulum subcompartment","1/27","141/4295",0.595069975146103,0.69269864294351,0.687560292006804,"Zci_15594",1
"GO:0035556","GO:0035556","intracellular signal transduction","1/27","143/4295",0.60031739311071,0.697444768604256,0.69227121150758,"Zci_11783",1
"GO:0016757","GO:0016757","glycosyltransferase activity","1/27","144/4295",0.602916485207533,0.698065387981007,0.692887227208276,"Zci_12208",1
"GO:0009941","GO:0009941","chloroplast envelope","2/27","317/4295",0.603194085252045,0.698065387981007,0.692887227208276,"Zci_00856/Zci_11706",2
"GO:0098791","GO:0098791","Golgi apparatus subcompartment","1/27","146/4295",0.608065928833404,0.702339716249436,0.697129849050129,"Zci_01877",1
"GO:1901700","GO:1901700","response to oxygen-containing compound","3/27","492/4295",0.61248041468574,0.704119494134081,0.698896424767491,"Zci_00322/Zci_05575/Zci_08054",3
"GO:0006325","GO:0006325","chromatin organization","1/27","148/4295",0.613151035999309,0.704119494134081,0.698896424767491,"Zci_07393",1
"GO:0042254","GO:0042254","ribosome biogenesis","1/27","148/4295",0.613151035999309,0.704119494134081,0.698896424767491,"Zci_10883",1
"GO:0034470","GO:0034470","ncRNA processing","1/27","149/4295",0.615669705405631,0.70565220081107,0.700417762020172,"Zci_10883",1
"GO:0009526","GO:0009526","plastid envelope","2/27","331/4295",0.627524217716472,0.717858798001952,0.712533812216703,"Zci_00856/Zci_11706",2
"GO:0032870","GO:0032870","cellular response to hormone stimulus","1/27","155/4295",0.63045334522235,0.7189723158622,0.713639070142275,"Zci_08054",1
"GO:0007165","GO:0007165","signal transduction","2/27","333/4295",0.630910270462971,0.7189723158622,0.713639070142275,"Zci_08054/Zci_11783",2
"GO:0005783","GO:0005783","endoplasmic reticulum","2/27","337/4295",0.637615107844568,0.720890062155266,0.715542590835852,"Zci_02003/Zci_15594",2
"GO:0022607","GO:0022607","cellular component assembly","2/27","338/4295",0.639277308931516,0.720890062155266,0.715542590835852,"Zci_00856/Zci_02003",2
"GO:0009535","GO:0009535","chloroplast thylakoid membrane","1/27","159/4295",0.640003221262887,0.720890062155266,0.715542590835852,"Zci_00856",1
"GO:0023052","GO:0023052","signaling","2/27","339/4295",0.640933909554212,0.720890062155266,0.715542590835852,"Zci_08054/Zci_11783",2
"GO:0051641","GO:0051641","cellular localization","2/27","339/4295",0.640933909554212,0.720890062155266,0.715542590835852,"Zci_09109/Zci_15568",2
"GO:0016071","GO:0016071","mRNA metabolic process","1/27","160/4295",0.642353296946133,0.720890062155266,0.715542590835852,"Zci_12358",1
"GO:0055086","GO:0055086","nucleobase-containing small molecule metabolic process","1/27","160/4295",0.642353296946133,0.720890062155266,0.715542590835852,"Zci_03245",1
"GO:0016053","GO:0016053","organic acid biosynthetic process","1/27","161/4295",0.644688595853618,0.720890062155266,0.715542590835852,"Zci_08692",1
"GO:0042802","GO:0042802","identical protein binding","1/27","161/4295",0.644688595853618,0.720890062155266,0.715542590835852,"Zci_02003",1
"GO:0046394","GO:0046394","carboxylic acid biosynthetic process","1/27","161/4295",0.644688595853618,0.720890062155266,0.715542590835852,"Zci_08692",1
"GO:0055035","GO:0055035","plastid thylakoid membrane","1/27","164/4295",0.651606722942309,0.727261436092914,0.721866702727336,"Zci_00856",1
"GO:0036094","GO:0036094","small molecule binding","1/27","166/4295",0.656146548296869,0.730959519224175,0.725537353945579,"Zci_00322",1
"GO:0071495","GO:0071495","cellular response to endogenous stimulus","1/27","167/4295",0.658395045074778,0.731168278073791,0.725744564248447,"Zci_08054",1
"GO:0005773","GO:0005773","vacuole","2/27","350/4295",0.658787525714138,0.731168278073791,0.725744564248447,"Zci_02003/Zci_12208",2
"GO:0010035","GO:0010035","response to inorganic substance","2/27","353/4295",0.663539599602468,0.735073608481545,0.729620925409093,"Zci_00322/Zci_08054",2
"GO:0010628","GO:0010628","positive regulation of gene expression","1/27","170/4295",0.665055905803424,0.735386493244603,0.729931489232545,"Zci_05575",1
"GO:0042651","GO:0042651","thylakoid membrane","1/27","173/4295",0.671591608032244,0.740868416612352,0.73537274838598,"Zci_00856",1
"GO:0034357","GO:0034357","photosynthetic membrane","1/27","174/4295",0.673742754704521,0.740868416612352,0.73537274838598,"Zci_00856",1
"GO:0140098","GO:0140098","catalytic activity, acting on RNA","1/27","174/4295",0.673742754704521,0.740868416612352,0.73537274838598,"Zci_12358",1
"GO:1901137","GO:1901137","carbohydrate derivative biosynthetic process","1/27","175/4295",0.675880329473504,0.741850232718616,0.736347281504525,"Zci_03245",1
"GO:0098588","GO:0098588","bounding membrane of organelle","2/27","371/4295",0.691006992287716,0.757059131256395,0.751443362356224,"Zci_12208/Zci_15568",2
"GO:0022613","GO:0022613","ribonucleoprotein complex biogenesis","1/27","185/4295",0.696527504899218,0.761707142972356,0.75605689570905,"Zci_10883",1
"GO:0034660","GO:0034660","ncRNA metabolic process","1/27","188/4295",0.702470582226822,0.766799390123052,0.761111369214332,"Zci_10883",1
"GO:0004672","GO:0004672","protein kinase activity","1/27","189/4295",0.704426582781942,0.767528781239556,0.761835349799772,"Zci_11783",1
"GO:1901701","GO:1901701","cellular response to oxygen-containing compound","1/27","194/4295",0.714022300870444,0.77656440021676,0.770803943698021,"Zci_08054",1
"GO:0043168","GO:0043168","anion binding","1/27","196/4295",0.717775978215202,0.778281211853527,0.772508020243168,"Zci_00322",1
"GO:0009651","GO:0009651","response to salt stress","1/27","197/4295",0.719634980066432,0.778281211853527,0.772508020243168,"Zci_10818",1
"GO:0009737","GO:0009737","response to abscisic acid","1/27","197/4295",0.719634980066432,0.778281211853527,0.772508020243168,"Zci_08054",1
"GO:0044271","GO:0044271","cellular nitrogen compound biosynthetic process","2/27","392/4295",0.720824209636152,0.778281211853527,0.772508020243168,"Zci_03245/Zci_10818",2
"GO:0006468","GO:0006468","protein phosphorylation","1/27","199/4295",0.723317672102521,0.779561180059859,0.773778493807208,"Zci_11783",1
"GO:0005774","GO:0005774","vacuolar membrane","1/27","204/4295",0.732321746714398,0.787840723902132,0.781996621040265,"Zci_12208",1
"GO:0016021","GO:0016021","integral component of membrane","1/27","205/4295",0.734088383927478,0.788318336614012,0.782470690881447,"Zci_12885",1
"GO:1990234","GO:1990234","transferase complex","1/27","207/4295",0.737588035646416,0.790651923102992,0.78478696712095,"Zci_10883",1
"GO:0097305","GO:0097305","response to alcohol","1/27","208/4295",0.739321187074387,0.791086943440457,0.785218760532563,"Zci_08054",1
"GO:0019637","GO:0019637","organophosphate metabolic process","1/27","211/4295",0.744454756747297,0.795152392511449,0.789254052616451,"Zci_03245",1
"GO:0018193","GO:0018193","peptidyl-amino acid modification","1/27","212/4295",0.74614420864931,0.795531213515186,0.789630063573886,"Zci_02258",1
"GO:0009888","GO:0009888","tissue development","1/27","214/4295",0.749490903727559,0.797656750448448,0.791739833542967,"Zci_04376",1
"GO:0007154","GO:0007154","cell communication","2/27","415/4295",0.750814491613388,0.797656750448448,0.791739833542967,"Zci_08054/Zci_11783",2
"GO:0016887","GO:0016887","ATP hydrolysis activity","1/27","224/4295",0.765597061243848,0.81191432117675,0.805891643414577,"Zci_00856",1
"GO:0071310","GO:0071310","cellular response to organic substance","1/27","227/4295",0.770231204176922,0.81537797102921,0.809329600350435,"Zci_08054",1
"GO:0006811","GO:0006811","ion transport","1/27","229/4295",0.773271483148833,0.815698768064964,0.809648017754344,"Zci_12885",1
"GO:0031224","GO:0031224","intrinsic component of membrane","1/27","229/4295",0.773271483148833,0.815698768064964,0.809648017754344,"Zci_12885",1
"GO:0033993","GO:0033993","response to lipid","1/27","235/4295",0.782161669276754,0.823619001570575,0.81750949996938,"Zci_08054",1
"GO:0065003","GO:0065003","protein-containing complex assembly","1/27","237/4295",0.785049746847471,0.825202203035437,0.819080957445983,"Zci_00856",1
"GO:0051239","GO:0051239","regulation of multicellular organismal process","1/27","241/4295",0.79071568584187,0.82969462810168,0.823540058271184,"Zci_04376",1
"GO:0051276","GO:0051276","chromosome organization","1/27","242/4295",0.792109537958858,0.829696458037749,0.823541874633018,"Zci_07393",1
"GO:0030154","GO:0030154","cell differentiation","1/27","244/4295",0.794870472671274,0.831127722301894,0.824962521959845,"Zci_05575",1
"GO:0016773","GO:0016773","phosphotransferase activity, alcohol group as acceptor","1/27","247/4295",0.798945773558407,0.833925886236095,0.82773992946783,"Zci_11783",1
"GO:1901135","GO:1901135","carbohydrate derivative metabolic process","1/27","251/4295",0.804258388614922,0.837669052804311,0.831455329699793,"Zci_03245",1
"GO:0005730","GO:0005730","nucleolus","1/27","253/4295",0.806863744630095,0.837669052804311,0.831455329699793,"Zci_10883",1
"GO:0009416","GO:0009416","response to light stimulus","1/27","254/4295",0.80815386805785,0.837669052804311,0.831455329699793,"Zci_00856",1
"GO:0022857","GO:0022857","transmembrane transporter activity","1/27","254/4295",0.80815386805785,0.837669052804311,0.831455329699793,"Zci_12885",1
"GO:0017111","GO:0017111","nucleoside-triphosphatase activity","1/27","264/4295",0.820606938181088,0.849100234645709,0.842801716479846,"Zci_00856",1
"GO:0009314","GO:0009314","response to radiation","1/27","274/4295",0.832279710133694,0.859685801108634,0.853308760549368,"Zci_00856",1
"GO:0016301","GO:0016301","kinase activity","1/27","277/4295",0.835636502041459,0.861308510093993,0.854919432484677,"Zci_11783",1
"GO:1990904","GO:1990904","ribonucleoprotein complex","1/27","278/4295",0.836740985477218,0.861308510093993,0.854919432484677,"Zci_10883",1
"GO:0016462","GO:0016462","pyrophosphatase activity","1/27","291/4295",0.850464668355156,0.873455975902273,0.866976789927724,"Zci_00856",1
"GO:0016818","GO:0016818","hydrolase activity, acting on acid anhydrides, in phosphorus-containing anhydrides","1/27","292/4295",0.851473023488625,0.873455975902273,0.866976789927724,"Zci_00856",1
"GO:0016817","GO:0016817","hydrolase activity, acting on acid anhydrides","1/27","294/4295",0.853470126479873,0.87351207157391,0.867032469488762,"Zci_00856",1
"GO:0048869","GO:0048869","cellular developmental process","1/27","295/4295",0.854458955918774,0.87351207157391,0.867032469488762,"Zci_05575",1
"GO:0009653","GO:0009653","anatomical structure morphogenesis","1/27","302/4295",0.861203028375663,0.877396589592983,0.870888172644395,"Zci_02011",1
"GO:0016310","GO:0016310","phosphorylation","1/27","302/4295",0.861203028375663,0.877396589592983,0.870888172644395,"Zci_11783",1
"GO:0055085","GO:0055085","transmembrane transport","1/27","317/4295",0.874656144586051,0.889582017360557,0.882983210449722,"Zci_12885",1
"GO:0005794","GO:0005794","Golgi apparatus","1/27","323/4295",0.879677913904268,0.893165309517791,0.886539922198867,"Zci_01877",1
"GO:0016772","GO:0016772","transferase activity, transferring phosphorus-containing groups","1/27","342/4295",0.894334168353139,0.905693229570045,0.898974911724417,"Zci_11783",1
"GO:0003723","GO:0003723","RNA binding","1/27","343/4295",0.895055892981135,0.905693229570045,0.898974911724417,"Zci_12358",1
"GO:0065008","GO:0065008","regulation of biological quality","1/27","358/4295",0.905328476923716,0.914535207197516,0.907751300679979,"Zci_02011",1
"GO:0043167","GO:0043167","ion binding","1/27","364/4295",0.909160238988208,0.916851949977956,0.910050858155442,"Zci_00322",1
"GO:1902494","GO:1902494","catalytic complex","1/27","372/4295",0.914037570145896,0.920213499673909,0.913387472300842,"Zci_10883",1
"GO:0034645","GO:0034645","cellular macromolecule biosynthetic process","1/27","403/4295",0.930662223757986,0.935370464350353,0.928432004530022,"Zci_10818",1
"GO:0033554","GO:0033554","cellular response to stress","1/27","409/4295",0.933500526746239,0.936643626162893,0.929695722189237,"Zci_02003",1
"GO:1901566","GO:1901566","organonitrogen compound biosynthetic process","1/27","424/4295",0.940115334066783,0.940947911995103,0.933968079373451,"Zci_03245",1
"GO:0009059","GO:0009059","macromolecule biosynthetic process","1/27","426/4295",0.940947911995103,0.940947911995103,0.933968079373451,"Zci_10818",1
