LOC_Os01g64140
LOC_Os05g38510
LOC_Os09g31420
LOC_Os08g36600
LOC_Os03g45350
LOC_Os06g31220
LOC_Os11g25870
LOC_Os11g13500
LOC_Os07g10480
LOC_Os05g04710
LOC_Os01g52470
LOC_Os04g45740
LOC_Os09g15400
LOC_Os01g54360
LOC_Os02g24340
LOC_Os08g15600
LOC_Os05g39640
LOC_Os08g03510
LOC_Os01g57500
LOC_Os05g18660
