{
	"n_targets": 87533,
	"n_bootstraps": 100,
	"n_processed": 29180255,
	"n_pseudoaligned": 27018464,
	"n_unique": 2083097,
	"p_pseudoaligned": 92.6,
	"p_unique": 7.1,
	"kallisto_version": "0.48.0",
	"index_version": 10,
	"start_time": "Fri Mar  3 18:35:35 2023",
	"call": "kallisto quant --bootstrap-samples 100 --rf-stranded -t 20 -i /scratch/users/dadras/Stress_profiling_of_physcomitrium_patens/kallisto_index/Ppatens_318_v3.3.transcript.fa.idx -o /scratch/users/dadras/Stress_profiling_of_physcomitrium_patens/kallisto/P_1_42_EKRN220057211-1A_HKHYCDSX5_L1 /scratch/users/dadras/Stress_profiling_of_physcomitrium_patens/trimmed_reads_PE/P_1_42_EKRN220057211-1A_HKHYCDSX5_L1_1.fq.gz /scratch/users/dadras/Stress_profiling_of_physcomitrium_patens/trimmed_reads_PE/P_1_42_EKRN220057211-1A_HKHYCDSX5_L1_2.fq.gz"
}
