gene	ColdCluster	HeatCluster	HLCluster	HL_no_RCluster	HLt0Cluster	ath	symbol	use_me	module
Zci_11497	7	2	4	7	7	AT1G58230	BCHB	BCHB	black
Zci_08002	7	2	4	7	7	AT4G30990	-	AT4G30990	black
Zci_10336	7	8	4	7	7	AT3G02890	AIPP2, PHD3	AIPP2, PHD3	black
Zci_13737	NA	NA	NA	NA	NA	AT3G08020	-	AT3G08020	black
Zci_04329	NA	NA	NA	NA	NA	AT2G36720	-	AT2G36720	black
Zci_02679	1	2	4	7	7	AT2G17930	TRA1a	TRA1a	black
Zci_09547	7	7	4	7	7	AT5G24740	SHBY	SHBY	black
Zci_14164	7	2	4	7	7	AT1G65440	SPT6L, GTB1	SPT6L, GTB1	black
Zci_13654	7	2	4	3	3	AT3G46640	LUX, PCL1	LUX, PCL1	black
Zci_10430	7	2	4	3	7	AT1G61690	FYVE4	FYVE4	black
Zci_03588	1	8	4	3	7	AT1G72270	IDAP1, HDP1	IDAP1, HDP1	black
Zci_03588	1	8	4	3	7	AT4G27010	EMB2788	EMB2788	black
Zci_02911	7	2	4	11	7	AT3G11910	UBP13, AtUBP13	UBP13, AtUBP13	black
Zci_04846	7	8	4	3	7	AT3G48190	ATATM, PIG1, ATM	ATATM, PIG1, ATM	black
Zci_07315	6	2	4	7	7	NA	NA	Zci_07315	black
Zci_02589	NA	NA	NA	NA	NA	AT3G21430	ALY3, ATALY3	ALY3, ATALY3	black
Zci_07054	NA	NA	NA	NA	NA	AT1G55540	emb1011, LNO1	emb1011, LNO1	black
Zci_15924	5	2	4	7	7	NA	NA	Zci_15924	black
Zci_15925	1	2	4	3	7	AT5G65930	KCBP, PKCBP, ZWI	KCBP, PKCBP, ZWI	black
Zci_11119	8	2	4	7	3	AT5G23150	ART1, HUA2	ART1, HUA2	black
Zci_07758	7	8	2	7	7	NA	NA	Zci_07758	black
Zci_15920	NA	NA	NA	NA	NA	AT5G23110	-	AT5G23110	blue
Zci_08871	NA	NA	NA	NA	NA	AT4G17140	-	AT4G17140	blue
Zci_00916	NA	NA	NA	NA	NA	AT1G67120	MDN1, AtMDN1	MDN1, AtMDN1	blue
Zci_10284	NA	NA	NA	NA	NA	AT2G26890	KAM2, MTV12, SGR8, GRV2	KAM2, MTV12, SGR8, GRV2	blue
Zci_04989	NA	NA	NA	NA	NA	AT1G31810	AtFH14, AFH14	AtFH14, AFH14	blue
Zci_10318	NA	NA	NA	NA	NA	NA	NA	Zci_10318	blue
Zci_10115	NA	NA	NA	NA	NA	AT3G19190	ATG2, ATATG2, PEUP1	ATG2, ATATG2, PEUP1	blue
Zci_15150	NA	NA	NA	NA	NA	AT3G12810	chr13, SRCAP, PIE1	chr13, SRCAP, PIE1	blue
Zci_13273	NA	NA	NA	NA	NA	AT3G50370	-	AT3G50370	blue
Zci_14082	NA	NA	NA	NA	NA	AT3G62900	-	AT3G62900	blue
Zci_13142	NA	NA	NA	NA	NA	AT5G56890	-	AT5G56890	blue
Zci_13939	NA	NA	NA	NA	NA	AT1G55860	UPL1	UPL1	blue
Zci_00429	NA	NA	NA	NA	NA	AT2G39260	UPF2	UPF2	blue
Zci_10964	NA	NA	NA	NA	NA	AT5G56730	-	AT5G56730	blue
Zci_12998	NA	NA	NA	NA	NA	AT5G58410	-	AT5G58410	blue
Zci_08567	NA	NA	NA	NA	NA	AT1G63700	EMB71, MAPKKK4, YDA	EMB71, MAPKKK4, YDA	blue
Zci_15874	NA	NA	NA	NA	NA	AT1G53570	MAPKKK3, MAP3KA	MAPKKK3, MAP3KA	blue
Zci_09821	NA	NA	NA	NA	NA	AT4G24680	MOS1	MOS1	blue
Zci_13147	NA	NA	NA	NA	NA	NA	NA	Zci_13147	blue
Zci_15764	NA	NA	NA	NA	NA	AT4G35350	XCP1	XCP1	blue
Zci_05013	3	5	4	6	7	AT1G30070	-	AT1G30070	brown
Zci_04770	3	9	4	6	7	AT5G20720	ATCPN21, CPN20, CPN21, CHCPN10, CPN10	ATCPN21, CPN20, CPN21, CHCPN10, CPN10	brown
Zci_14659	1	8	4	3	7	AT5G52640	HSP81-1, ATHSP90, HSP81, AtHsp90-1, HSP83, ATHS83, HSP90	HSP81-1, ATHSP90, HSP81, AtHsp90-1, HSP83, ATHS83, HSP90	brown
Zci_10764	4	6	4	3	7	AT1G53540	HSP17C	HSP17C	brown
Zci_11293	8	8	4	3	7	AT1G60470	AtGolS4, GolS4	AtGolS4, GolS4	brown
Zci_02285	4	6	4	6	7	AT3G17611	ATRBL10, RBL14, ATRBL14, RBL10	ATRBL10, RBL14, ATRBL14, RBL10	brown
Zci_00183	3	6	4	6	7	AT2G04030	CR88, EMB1956, AtHsp90, HSP90C, AtHsp90C, Hsp88, HSP90	CR88, EMB1956, AtHsp90, HSP90C, AtHsp90C, Hsp88, HSP90	brown
Zci_10454	9	9	4	1	7	AT4G23160	CRK8	CRK8	brown
Zci_07026	9	8	4	3	7	AT5G02500	AtHsp70-1, HSP70-1, HSC70-1, HSC70, AT-HSC70-1	AtHsp70-1, HSP70-1, HSC70-1, HSC70, AT-HSC70-1	brown
Zci_03616	6	5	4	6	6	AT1G74310	ATHSP101, HSP101, HOT1	ATHSP101, HSP101, HOT1	brown
Zci_05742	9	8	4	7	7	AT5G52640	HSP81-1, ATHSP90, HSP81, AtHsp90-1, HSP83, ATHS83, HSP90	HSP81-1, ATHSP90, HSP81, AtHsp90-1, HSP83, ATHS83, HSP90	brown
Zci_11486	1	8	4	3	7	AT1G04980	PDIL2-2, ATPDI10, ATPDIL2-2, PDI10	PDIL2-2, ATPDI10, ATPDIL2-2, PDI10	brown
Zci_04639	1	9	4	6	7	AT1G79930	HSP91, AtHsp70-14	HSP91, AtHsp70-14	brown
Zci_14588	2	8	4	3	7	AT3G56510	-	AT3G56510	brown
Zci_00590	9	8	4	6	7	AT1G68730	-	AT1G68730	brown
Zci_02032	3	6	4	6	7	AT1G48450	-	AT1G48450	brown
Zci_04193	4	5	4	6	7	AT1G63440	HMA5, AtHMP12	HMA5, AtHMP12	brown
Zci_08144	1	6	4	6	7	NA	NA	Zci_08144	brown
Zci_11539	9	5	4	1	6	AT1G20610	CYCB2;3	CYCB2;3	brown
Zci_14847	3	6	4	6	7	AT5G49910	HSC70-7, cpHsc70-2	HSC70-7, cpHsc70-2	brown
Zci_14847	3	6	4	6	7	AT4G24280	cpHsc70-1	cpHsc70-1	brown
Zci_03990	NA	NA	NA	NA	NA	AT1G59900	AT-E1 ALPHA, E1 ALPHA, IAR4L	AT-E1 ALPHA, E1 ALPHA, IAR4L	cyan
Zci_00553	NA	NA	NA	NA	NA	AT2G37770	AKR4C9, ChlAKR	AKR4C9, ChlAKR	cyan
Zci_04618	NA	NA	NA	NA	NA	AT3G60750	AtTKL1, TKL1	AtTKL1, TKL1	cyan
Zci_06994	NA	NA	NA	NA	NA	NA	NA	Zci_06994	cyan
Zci_02948	NA	NA	NA	NA	NA	AT5G51010	-	AT5G51010	cyan
Zci_09183	NA	NA	NA	NA	NA	AT5G44310	-	AT5G44310	cyan
Zci_05055	NA	NA	NA	NA	NA	AT1G20630	CAT1	CAT1	cyan
Zci_11259	NA	NA	NA	NA	NA	AT1G05500	SYTE, NTMC2T2, ATSYTE, NTMC2TYPE2, SYT5	SYTE, NTMC2T2, ATSYTE, NTMC2TYPE2, SYT5	cyan
Zci_03749	NA	NA	NA	NA	NA	AT5G63620	HER2	HER2	cyan
Zci_10740	NA	NA	NA	NA	NA	NA	NA	Zci_10740	cyan
Zci_00587	NA	NA	NA	NA	NA	NA	NA	Zci_00587	cyan
Zci_11131	NA	NA	NA	NA	NA	NA	NA	Zci_11131	cyan
Zci_03643	NA	NA	NA	NA	NA	AT1G17870	ATEGY3, EGY3	ATEGY3, EGY3	cyan
Zci_00701	NA	NA	NA	NA	NA	AT5G50700	HSD1	HSD1	cyan
Zci_10738	NA	NA	NA	NA	NA	NA	NA	Zci_10738	cyan
Zci_10821	NA	NA	NA	NA	NA	AT3G22840	ELIP1, ELIP	ELIP1, ELIP	cyan
Zci_09768	NA	NA	NA	NA	NA	NA	NA	Zci_09768	cyan
Zci_11279	NA	NA	NA	NA	NA	AT2G20230	-	AT2G20230	cyan
Zci_05110	NA	NA	NA	NA	NA	AT3G22840	ELIP1, ELIP	ELIP1, ELIP	cyan
Zci_01556	NA	NA	NA	NA	NA	AT3G16240	ATTIP2;1, TIP2;1, DELTA-TIP, DELTA-TIP1, AQP1	ATTIP2;1, TIP2;1, DELTA-TIP, DELTA-TIP1, AQP1	cyan
Zci_15380	NA	NA	NA	NA	NA	NA	NA	Zci_15380	darkgreen
Zci_01843	7	9	1	10	5	AT5G65950	ROG2, TRAPPC11	ROG2, TRAPPC11	darkgreen
Zci_09564	NA	NA	NA	NA	NA	AT2G31400	GUN1	GUN1	darkgreen
Zci_00042	NA	NA	NA	NA	NA	AT5G63200	-	AT5G63200	darkgreen
Zci_03286	8	5	1	9	4	AT4G00231	MEE50, ZIX	MEE50, ZIX	darkgreen
Zci_15644	NA	NA	NA	NA	NA	NA	NA	Zci_15644	darkgreen
Zci_15118	NA	NA	NA	NA	NA	AT1G23170	-	AT1G23170	darkgreen
Zci_05193	NA	NA	NA	NA	NA	AT5G65750	E1-OGDH2	E1-OGDH2	darkgreen
Zci_10229	NA	NA	NA	NA	NA	AT4G27680	-	AT4G27680	darkgreen
Zci_10114	NA	NA	NA	NA	NA	AT1G06220	MEE5, CLO, GFA1	MEE5, CLO, GFA1	darkgreen
Zci_10491	NA	NA	NA	NA	NA	AT5G41380	-	AT5G41380	darkgreen
Zci_14583	NA	NA	NA	NA	NA	AT2G37840	ATG1c	ATG1c	darkgreen
Zci_07129	8	2	1	9	4	AT1G69680	-	AT1G69680	darkgreen
Zci_11203	NA	NA	NA	NA	NA	AT3G58050	-	AT3G58050	darkgreen
Zci_14055	8	8	11	7	1	AT1G27150	-	AT1G27150	darkgreen
Zci_15152	8	4	1	4	5	AT3G54440	-	AT3G54440	darkgreen
Zci_02467	NA	NA	NA	NA	NA	AT5G35750	AHK2, HK2	AHK2, HK2	darkgreen
Zci_02532	NA	NA	NA	NA	NA	AT1G61850	PLAI	PLAI	darkgreen
Zci_04260	2	5	1	10	4	AT4G21540	SPHK1	SPHK1	darkgreen
Zci_11410	8	9	1	5	4	NA	NA	Zci_11410	darkgreen
Zci_05187	2	1	1	4	2	AT5G23730	EFO2, RUP2	EFO2, RUP2	darkgrey
Zci_02421	2	1	1	9	1	AT5G43310	-	AT5G43310	darkgrey
Zci_11021	5	2	1	10	2	AT1G64720	CP5	CP5	darkgrey
Zci_12394	7	7	1	9	1	AT3G55240	-	AT3G55240	darkgrey
Zci_09313	7	8	1	11	1	AT5G61380	PRR1, AtTOC1, TOC1, APRR1	PRR1, AtTOC1, TOC1, APRR1	darkgrey
Zci_09619	NA	NA	NA	NA	NA	AT5G26820	RTS3, IREG3, ATIREG3, MAR1, FPN3	RTS3, IREG3, ATIREG3, MAR1, FPN3	darkgrey
Zci_07518	7	6	1	9	1	AT5G13740	ZIF1	ZIF1	darkgrey
Zci_14500	7	2	1	5	1	AT5G64300	RIBA1, GCH, ATGCH, RFD1, ATRIBA1	RIBA1, GCH, ATGCH, RFD1, ATRIBA1	darkgrey
Zci_12145	NA	NA	NA	NA	NA	AT2G40860	VTC3	VTC3	darkgrey
Zci_01588	1	2	1	10	2	AT3G55730	AtMYB109, MYB109	AtMYB109, MYB109	darkgrey
Zci_09179	8	2	1	6	8	AT5G17300	RVE1	RVE1	darkgrey
Zci_09456	8	9	1	7	1	AT5G66730	ENY, IDD1	ENY, IDD1	darkgrey
Zci_08813	1	1	1	12	2	NA	NA	Zci_08813	darkgrey
Zci_01098	NA	NA	NA	NA	NA	AT1G02000	GAE2	GAE2	darkgrey
Zci_11074	1	9	1	9	2	AT1G70630	RAY1	RAY1	darkgrey
Zci_08876	NA	NA	NA	NA	NA	AT3G06483	PDK, ATPDHK	PDK, ATPDHK	darkgrey
Zci_03379	8	1	1	9	1	AT1G30360	ERD4, OSCA3	ERD4, OSCA3	darkgrey
Zci_06375	8	1	1	5	8	NA	NA	Zci_06375	darkgrey
Zci_07353	NA	NA	NA	NA	NA	AT1G56170	HAP5B, ATHAP5B, NF-YC2	HAP5B, ATHAP5B, NF-YC2	darkgrey
Zci_04510	NA	NA	NA	NA	NA	NA	NA	Zci_04510	darkgrey
Zci_09673	3	4	6	5	4	NA	NA	Zci_09673	darkolivegreen
Zci_07435	NA	NA	NA	NA	NA	NA	NA	Zci_07435	darkolivegreen
Zci_14522	3	1	6	4	4	AT5G19740	LAMP1	LAMP1	darkolivegreen
Zci_03359	3	1	3	4	4	AT3G60340	-	AT3G60340	darkolivegreen
Zci_05202	1	4	6	5	5	AT5G49740	ATFRO7, FRO7	ATFRO7, FRO7	darkolivegreen
Zci_04688	NA	NA	NA	NA	NA	AT4G16210	ECHIA, E-COAH-2	ECHIA, E-COAH-2	darkolivegreen
Zci_03424	3	1	3	4	4	AT5G35735	-	AT5G35735	darkolivegreen
Zci_11220	NA	NA	NA	NA	NA	NA	NA	Zci_11220	darkolivegreen
Zci_12165	3	5	10	4	5	AT1G12520	AtHMP03, ATCCS, CCS	AtHMP03, ATCCS, CCS	darkolivegreen
Zci_11511	NA	NA	NA	NA	NA	AT1G74520	ATHVA22A, HVA22A	ATHVA22A, HVA22A	darkolivegreen
Zci_09589	NA	NA	NA	NA	NA	AT3G19620	-	AT3G19620	darkolivegreen
Zci_02488	3	4	3	5	5	NA	NA	Zci_02488	darkolivegreen
Zci_14053	1	2	6	5	1	AT1G15690	AtVHP1;1, AtAVP1, ATAVP3, AVP-3, AVP1, FUGU5, VHP1	AtVHP1;1, AtAVP1, ATAVP3, AVP-3, AVP1, FUGU5, VHP1	darkolivegreen
Zci_07859	NA	NA	NA	NA	NA	AT5G16550	LDIP	LDIP	darkolivegreen
Zci_08382	NA	NA	NA	NA	NA	NA	NA	Zci_08382	darkolivegreen
Zci_00237	NA	NA	NA	NA	NA	NA	NA	Zci_00237	darkolivegreen
Zci_02964	NA	NA	NA	NA	NA	AT1G18580	GAUT11	GAUT11	darkolivegreen
Zci_10907	1	2	11	8	1	AT5G24130	-	AT5G24130	darkolivegreen
Zci_01465	NA	NA	NA	NA	NA	AT1G53590	NTMC2T6, NTMC2TYPE6	NTMC2T6, NTMC2TYPE6	darkolivegreen
Zci_03319	1	7	6	8	4	AT1G09900	-	AT1G09900	darkolivegreen
Zci_09655	2	7	1	10	1	AT5G35930	-	AT5G35930	darkorange
Zci_03013	NA	NA	NA	NA	NA	NA	NA	Zci_03013	darkorange
Zci_06382	8	7	12	7	4	AT1G76040	CPK29	CPK29	darkorange
Zci_11864	7	9	1	10	1	AT3G56850	DPBF3, AREB3	DPBF3, AREB3	darkorange
Zci_08260	2	1	1	10	2	NA	NA	Zci_08260	darkorange
Zci_11866	10	2	11	9	1	NA	NA	Zci_11866	darkorange
Zci_10143	7	7	12	7	1	AT4G36530	-	AT4G36530	darkorange
Zci_05117	1	7	1	8	1	NA	NA	Zci_05117	darkorange
Zci_09981	NA	NA	NA	NA	NA	AT1G72000	A/N-InvF	A/N-InvF	darkorange
Zci_04359	NA	NA	NA	NA	NA	AT3G45830	NFRKB1	NFRKB1	darkorange
Zci_08913	NA	NA	NA	NA	NA	AT1G02520	ABCB11, MDR8, PGP11	ABCB11, MDR8, PGP11	darkorange
Zci_13031	9	8	9	11	1	AT1G27320	AHK3, HK3	AHK3, HK3	darkorange
Zci_10677	7	8	9	3	2	AT3G06620	-	AT3G06620	darkorange
Zci_08960	7	7	12	7	1	AT2G28840	XBAT31	XBAT31	darkorange
Zci_13042	2	2	6	9	4	AT1G30410	MRP13, ABCC12, ATMRP13	MRP13, ABCC12, ATMRP13	darkorange
Zci_01979	2	2	1	2	1	AT3G44530	HIRA	HIRA	darkorange
Zci_08748	1	1	5	5	1	AT5G22260	MS1	MS1	darkorange
Zci_03302	7	2	11	7	2	AT5G58140	PHOT2, AtPHOT2, NPL1	PHOT2, AtPHOT2, NPL1	darkorange
Zci_05090	NA	NA	NA	NA	NA	AT1G50700	CPK33	CPK33	darkorange
Zci_01796	7	2	1	7	1	NA	NA	Zci_01796	darkorange
Zci_05740	NA	NA	NA	NA	NA	AT1G14700	ATPAP3, PAP3	ATPAP3, PAP3	darkred
Zci_01510	1	2	13	11	2	AT3G02720	DJ1D, DJ-1d	DJ1D, DJ-1d	darkred
Zci_12001	3	8	4	3	3	AT5G11280	-	AT5G11280	darkred
Zci_13690	6	8	4	3	3	AT5G57170	AT5G57170, MDL1	AT5G57170, MDL1	darkred
Zci_10540	NA	NA	NA	NA	NA	AT2G28190	CSD2, CZSOD2, SOD2, AtSOD2	CSD2, CZSOD2, SOD2, AtSOD2	darkred
Zci_01045	NA	NA	NA	NA	NA	AT3G05600	AtEH1	AtEH1	darkred
Zci_02472	NA	NA	NA	NA	NA	AT5G14660	ATDEF2, DEF2, PDF1B	ATDEF2, DEF2, PDF1B	darkred
Zci_00132	NA	NA	NA	NA	NA	AT2G36060	MMZ3, UEV1C	MMZ3, UEV1C	darkred
Zci_04405	NA	NA	NA	NA	NA	AT2G25080	GPX1, ATGPX1, GPXL1	GPX1, ATGPX1, GPXL1	darkred
Zci_06036	NA	NA	NA	NA	NA	AT1G17270	-	AT1G17270	darkred
Zci_10685	NA	NA	NA	NA	NA	AT5G27560	-	AT5G27560	darkred
Zci_14731	NA	NA	NA	NA	NA	AT1G78870	UBC13A, UBC35	UBC13A, UBC35	darkred
Zci_00837	3	1	4	3	2	AT5G18660	PCB2, DVR	PCB2, DVR	darkred
Zci_01571	NA	NA	NA	NA	NA	AT3G02600	LPP3, ATLPP3	LPP3, ATLPP3	darkred
Zci_04311	6	2	4	3	7	AT1G19950	HVA22H	HVA22H	darkred
Zci_15089	NA	NA	NA	NA	NA	AT5G39990	GlcAT14A	GlcAT14A	darkred
Zci_05536	NA	NA	NA	NA	NA	AT5G64350	FKBP12, ATFKBP12, FKP12	FKBP12, ATFKBP12, FKP12	darkred
Zci_03835	1	2	4	3	3	NA	NA	Zci_03835	darkred
Zci_13051	3	2	4	14	2	AT5G34850	PUP3, PAP26, ATPAP26	PUP3, PAP26, ATPAP26	darkred
Zci_11210	5	2	2	3	2	AT4G07950	-	AT4G07950	darkred
Zci_07965	NA	NA	NA	NA	NA	AT1G30630	epsilon1-COP	epsilon1-COP	darkturquoise
Zci_10539	NA	NA	NA	NA	NA	AT2G01490	PAHX	PAHX	darkturquoise
Zci_02100	6	5	4	13	7	AT1G72640	-	AT1G72640	darkturquoise
Zci_05154	NA	NA	NA	NA	NA	AT2G26590	RPN13	RPN13	darkturquoise
Zci_02362	6	1	4	5	7	NA	NA	Zci_02362	darkturquoise
Zci_01740	NA	NA	NA	NA	NA	AT5G38900	PDI	PDI	darkturquoise
Zci_03640	NA	NA	NA	NA	NA	AT2G34690	ACD11	ACD11	darkturquoise
Zci_00947	6	10	4	6	7	AT3G06460	ELO1	ELO1	darkturquoise
Zci_05153	NA	NA	NA	NA	NA	NA	NA	Zci_05153	darkturquoise
Zci_14390	6	4	6	12	5	AT5G04510	PDK1, ATPDK1	PDK1, ATPDK1	darkturquoise
Zci_12031	NA	NA	NA	NA	NA	NA	NA	Zci_12031	darkturquoise
Zci_00719	NA	NA	NA	NA	NA	AT3G19800	DUF177B	DUF177B	darkturquoise
Zci_02162	3	4	4	13	7	AT5G03160	ATP58IPK, P58IPK	ATP58IPK, P58IPK	darkturquoise
Zci_11523	NA	NA	NA	NA	NA	AT3G55360	CER10, GLH6, ATTSC13, ECR, TSC13	CER10, GLH6, ATTSC13, ECR, TSC13	darkturquoise
Zci_12741	NA	NA	NA	NA	NA	AT3G63130	ATRANGAP1, RANGAP1	ATRANGAP1, RANGAP1	darkturquoise
Zci_10038	NA	NA	NA	NA	NA	AT5G26040	HDA2	HDA2	darkturquoise
Zci_14330	NA	NA	NA	NA	NA	NA	NA	Zci_14330	darkturquoise
Zci_12383	NA	NA	NA	NA	NA	AT4G23850	LACS4	LACS4	darkturquoise
Zci_01356	NA	NA	NA	NA	NA	AT3G62600	ERDJ3B, ATERDJ3B	ERDJ3B, ATERDJ3B	darkturquoise
Zci_01044	6	6	4	12	7	NA	NA	Zci_01044	darkturquoise
Zci_02533	3	1	1	5	1	AT1G09890	-	AT1G09890	green
Zci_02097	6	1	3	4	1	AT3G55830	GMT1, EPC1	GMT1, EPC1	green
Zci_03987	3	10	1	5	1	NA	NA	Zci_03987	green
Zci_07604	6	1	3	5	4	AT1G80290	-	AT1G80290	green
Zci_01475	6	3	1	5	1	AT5G04430	BTR1, BTR1L, BTR1S	BTR1, BTR1L, BTR1S	green
Zci_02347	1	1	1	5	1	AT1G26810	GALT1	GALT1	green
Zci_06358	6	1	1	5	1	AT3G49340	-	AT3G49340	green
Zci_09475	3	1	1	5	1	AT2G26100	-	AT2G26100	green
Zci_02228	3	1	1	5	1	NA	NA	Zci_02228	green
Zci_01594	5	1	1	4	1	AT2G03210	ATFUT2, FUT2	ATFUT2, FUT2	green
Zci_06278	3	1	1	5	1	AT4G20140	GSO1, SGN3	GSO1, SGN3	green
Zci_09557	6	1	1	5	1	AT3G11320	-	AT3G11320	green
Zci_14681	3	3	1	5	1	AT4G31600	UTr7	UTr7	green
Zci_03879	NA	NA	NA	NA	NA	AT1G70630	RAY1	RAY1	green
Zci_11849	3	1	1	5	1	AT1G30650	AR411, WRKY14, ATWRKY14	AR411, WRKY14, ATWRKY14	green
Zci_11849	3	1	1	5	1	AT5G52830	WRKY27, ATWRKY27	WRKY27, ATWRKY27	green
Zci_03799	1	1	1	5	1	AT3G26730	-	AT3G26730	green
Zci_14240	NA	NA	NA	NA	NA	AT4G21150	RPN2, HAP6	RPN2, HAP6	green
Zci_02565	6	1	1	5	1	AT2G33570	GALS1	GALS1	green
Zci_08129	NA	NA	NA	NA	NA	AT5G13390	NEF1	NEF1	green
Zci_07672	3	1	1	5	1	NA	NA	Zci_07672	green
Zci_10842	9	8	2	3	7	AT4G35090	CAT2	CAT2	greenyellow
Zci_01686	9	8	2	3	3	AT2G44870	-	AT2G44870	greenyellow
Zci_12221	7	8	2	11	3	AT2G35795	PAM18-1	PAM18-1	greenyellow
Zci_09400	NA	NA	NA	NA	NA	AT3G55380	UBC14	UBC14	greenyellow
Zci_10682	1	8	4	3	7	NA	NA	Zci_10682	greenyellow
Zci_05385	1	8	2	3	3	AT5G01350	-	AT5G01350	greenyellow
Zci_02831	8	8	2	3	3	AT5G66010	-	AT5G66010	greenyellow
Zci_03894	NA	NA	NA	NA	NA	AT4G14716	ARD1, ATARD1, SGB3	ARD1, ATARD1, SGB3	greenyellow
Zci_10332	9	8	2	11	3	AT2G35360	-	AT2G35360	greenyellow
Zci_02875	2	8	2	11	7	AT2G16940	CC1	CC1	greenyellow
Zci_03527	8	8	2	3	8	AT1G55150	AtRH20, RH20	AtRH20, RH20	greenyellow
Zci_00778	NA	NA	NA	NA	NA	AT3G06910	AtULP1a, ULP1A, ELS1	AtULP1a, ULP1A, ELS1	greenyellow
Zci_05702	2	8	2	3	3	AT2G37660	-	AT2G37660	greenyellow
Zci_11970	9	8	2	3	3	AT4G35550	HB-4, ATWOX13, WOX13	HB-4, ATWOX13, WOX13	greenyellow
Zci_05683	9	8	2	3	3	NA	NA	Zci_05683	greenyellow
Zci_04936	9	8	4	3	7	AT2G30970	ASP1	ASP1	greenyellow
Zci_00128	8	8	2	3	3	NA	NA	Zci_00128	greenyellow
Zci_10898	1	9	2	3	7	AT5G67030	LOS6, NPQ2, ZEP, ABA1, ATABA1, ATZEP, IBS3	LOS6, NPQ2, ZEP, ABA1, ATABA1, ATZEP, IBS3	greenyellow
Zci_12990	NA	NA	NA	NA	NA	AT5G40650	SDH2-2	SDH2-2	greenyellow
Zci_05061	NA	NA	NA	NA	NA	AT3G58680	MBF1B, ATMBF1B	MBF1B, ATMBF1B	greenyellow
Zci_00005	10	2	11	7	1	AT4G32610	-	AT4G32610	grey
Zci_00167	2	1	1	5	4	NA	NA	Zci_00167	grey
Zci_00227	NA	NA	NA	NA	NA	AT4G29230	anac075, SND4, NAC075	anac075, SND4, NAC075	grey
Zci_00242	NA	NA	NA	NA	NA	AT4G13030	-	AT4G13030	grey
Zci_00248	NA	NA	NA	NA	NA	AT3G11040	AtENGase85B, ENGase85B	AtENGase85B, ENGase85B	grey
Zci_00248	NA	NA	NA	NA	NA	AT5G05460	AtENGase85A, ENGase85A	AtENGase85A, ENGase85A	grey
Zci_00384	NA	NA	NA	NA	NA	NA	NA	Zci_00384	grey
Zci_00451	NA	NA	NA	NA	NA	AT3G18680	PUMPKIN	PUMPKIN	grey
Zci_00487	NA	NA	NA	NA	NA	AT2G20390	-	AT2G20390	grey
Zci_00552	NA	NA	NA	NA	NA	AT2G47210	SWC4, ATSWC4	SWC4, ATSWC4	grey
Zci_00635	NA	NA	NA	NA	NA	NA	NA	Zci_00635	grey
Zci_00672	NA	NA	NA	NA	NA	AT2G19830	SNF7, VPS32	SNF7, VPS32	grey
Zci_00738	NA	NA	NA	NA	NA	AT3G13180	AtTRM4e, TRM4e	AtTRM4e, TRM4e	grey
Zci_00832	NA	NA	NA	NA	NA	AT5G15920	EMB2782, AtSMC5, SMC5	EMB2782, AtSMC5, SMC5	grey
Zci_00838	8	6	2	7	3	AT3G22840	ELIP1, ELIP	ELIP1, ELIP	grey
Zci_00839	8	4	6	3	8	AT3G22840	ELIP1, ELIP	ELIP1, ELIP	grey
Zci_00851	8	1	2	1	4	NA	NA	Zci_00851	grey
Zci_00932	NA	NA	NA	NA	NA	AT4G20150	-	AT4G20150	grey
Zci_00997	NA	NA	NA	NA	NA	AT5G54130	-	AT5G54130	grey
Zci_01131	NA	NA	NA	NA	NA	AT4G28740	-	AT4G28740	grey
Zci_01219	NA	NA	NA	NA	NA	AT5G44790	HMA7, AtHMP51, RAN1	HMA7, AtHMP51, RAN1	grey
Zci_04668	2	9	2	3	3	AT3G48530	KINgamma, KING1	KINgamma, KING1	grey60
Zci_11880	2	8	11	7	2	AT3G53040	-	AT3G53040	grey60
Zci_12515	8	9	12	7	4	AT4G35985	-	AT4G35985	grey60
Zci_02211	2	6	11	11	1	AT4G02280	SUS3, ATSUS3	SUS3, ATSUS3	grey60
Zci_07972	2	8	1	3	1	AT3G11670	DGD1, ATTS02	DGD1, ATTS02	grey60
Zci_10474	NA	NA	NA	NA	NA	NA	NA	Zci_10474	grey60
Zci_14881	9	9	11	7	2	AT2G01620	MEE11	MEE11	grey60
Zci_14881	9	9	11	7	2	AT3G26000	RIFP1	RIFP1	grey60
Zci_14615	2	6	13	3	2	AT1G27990	-	AT1G27990	grey60
Zci_05410	2	6	9	14	1	AT1G43710	EMB1075, ATSDC1, SDC1	EMB1075, ATSDC1, SDC1	grey60
Zci_09607	8	9	11	9	1	AT3G06510	SFR2, ATSFR2	SFR2, ATSFR2	grey60
Zci_07078	2	9	11	7	3	AT1G15520	ATABCG40, ABCG40, PDR12, ATPDR12	ATABCG40, ABCG40, PDR12, ATPDR12	grey60
Zci_04354	8	8	2	3	3	NA	NA	Zci_04354	grey60
Zci_04406	2	9	12	7	4	AT3G44380	-	AT3G44380	grey60
Zci_12795	2	8	11	3	3	AT1G29760	SEIPIN2	SEIPIN2	grey60
Zci_09600	2	8	13	11	3	AT3G12680	HUA1	HUA1	grey60
Zci_15366	2	9	9	3	3	AT5G43140	-	AT5G43140	grey60
Zci_13634	NA	NA	NA	NA	NA	NA	NA	Zci_13634	grey60
Zci_09048	8	8	11	11	4	NA	NA	Zci_09048	grey60
Zci_04525	NA	NA	NA	NA	NA	AT2G23140	AtPUB4, PUB4	AtPUB4, PUB4	grey60
Zci_00316	2	6	2	3	3	AT1G09870	-	AT1G09870	grey60
Zci_06181	NA	NA	NA	NA	NA	AT3G52300	ATPQ, ATPd	ATPQ, ATPd	lightcyan
Zci_04518	NA	NA	NA	NA	NA	AT5G13450	ATP5	ATP5	lightcyan
Zci_05677	NA	NA	NA	NA	NA	AT4G02620	VHA-F	VHA-F	lightcyan
Zci_12710	NA	NA	NA	NA	NA	AT1G22450	ATCOX6B2, COX6B	ATCOX6B2, COX6B	lightcyan
Zci_08679	NA	NA	NA	NA	NA	AT5G08180	-	AT5G08180	lightcyan
Zci_06539	NA	NA	NA	NA	NA	AT2G21870	MGP1, PHI1	MGP1, PHI1	lightcyan
Zci_07902	NA	NA	NA	NA	NA	AT4G23710	VHA-G2, VAG2, VATG2	VHA-G2, VAG2, VATG2	lightcyan
Zci_02177	NA	NA	NA	NA	NA	AT4G09010	APX4, TL29	APX4, TL29	lightcyan
Zci_09338	NA	NA	NA	NA	NA	AT2G45790	PMM, ATPMM	PMM, ATPMM	lightcyan
Zci_03317	NA	NA	NA	NA	NA	AT3G02230	RGP1, ATRGP1	RGP1, ATRGP1	lightcyan
Zci_07330	NA	NA	NA	NA	NA	NA	NA	Zci_07330	lightcyan
Zci_09404	NA	NA	NA	NA	NA	NA	NA	Zci_09404	lightcyan
Zci_12798	6	5	3	5	5	NA	NA	Zci_12798	lightcyan
Zci_04506	NA	NA	NA	NA	NA	AT4G09620	mTERF12	mTERF12	lightcyan
Zci_01308	NA	NA	NA	NA	NA	AT3G54900	AtGRXS14, ATGRXCP, CXIP1	AtGRXS14, ATGRXCP, CXIP1	lightcyan
Zci_06837	NA	NA	NA	NA	NA	AT4G37925	NDH-M, NdhM	NDH-M, NdhM	lightcyan
Zci_04303	NA	NA	NA	NA	NA	NA	NA	Zci_04303	lightcyan
Zci_01274	NA	NA	NA	NA	NA	AT4G35260	IDH-I, IDH1	IDH-I, IDH1	lightcyan
Zci_12586	NA	NA	NA	NA	NA	AT1G14030	LSMT-L	LSMT-L	lightcyan
Zci_15251	NA	NA	NA	NA	NA	AT1G73060	LPA3	LPA3	lightcyan
Zci_10507	3	1	6	5	3	AT2G32520	-	AT2G32520	lightgreen
Zci_02963	6	2	6	12	3	AT1G79870	HPPR2	HPPR2	lightgreen
Zci_04089	NA	NA	NA	NA	NA	AT4G32390	-	AT4G32390	lightgreen
Zci_02651	NA	NA	NA	NA	NA	AT3G02660	FAC31, EMB2768	FAC31, EMB2768	lightgreen
Zci_05916	6	1	4	12	7	AT5G63910	FCLY	FCLY	lightgreen
Zci_11650	6	1	8	4	3	AT2G01170	AtGABP, GABP, BAT1	AtGABP, GABP, BAT1	lightgreen
Zci_12934	NA	NA	NA	NA	NA	NA	NA	Zci_12934	lightgreen
Zci_05986	NA	NA	NA	NA	NA	AT5G24400	PGL3, EMB2024	PGL3, EMB2024	lightgreen
Zci_01547	NA	NA	NA	NA	NA	AT5G38360	-	AT5G38360	lightgreen
Zci_11902	4	2	4	8	3	AT5G38990	MDS1	MDS1	lightgreen
Zci_10597	NA	NA	NA	NA	NA	AT4G37030	-	AT4G37030	lightgreen
Zci_00057	3	1	6	5	7	NA	NA	Zci_00057	lightgreen
Zci_01201	3	1	4	6	7	NA	NA	Zci_01201	lightgreen
Zci_02314	6	1	4	13	7	AT1G15740	-	AT1G15740	lightgreen
Zci_12733	NA	NA	NA	NA	NA	AT3G44100	-	AT3G44100	lightgreen
Zci_14525	NA	NA	NA	NA	NA	AT3G56820	-	AT3G56820	lightgreen
Zci_08104	6	10	4	10	7	NA	NA	Zci_08104	lightgreen
Zci_10007	NA	NA	NA	NA	NA	AT5G07270	XBAT33	XBAT33	lightgreen
Zci_07557	NA	NA	NA	NA	NA	AT2G21370	XK-1, XK1	XK-1, XK1	lightgreen
Zci_14538	3	1	6	4	2	AT5G44670	GALS2	GALS2	lightgreen
Zci_08918	1	1	6	10	5	AT2G01980	ATNHX7, ATSOS1, SOS1	ATNHX7, ATSOS1, SOS1	lightyellow
Zci_12483	3	1	5	10	4	NA	NA	Zci_12483	lightyellow
Zci_00054	6	1	6	10	5	AT1G50030	TOR	TOR	lightyellow
Zci_04612	6	1	1	4	1	AT5G35980	YAK1	YAK1	lightyellow
Zci_04283	6	1	1	10	1	NA	NA	Zci_04283	lightyellow
Zci_07585	3	1	6	5	5	AT1G55325	MED13, GCT, MAB2	MED13, GCT, MAB2	lightyellow
Zci_06221	3	1	5	10	1	AT1G74040	IPMS2, IMS1, MAML-3	IPMS2, IMS1, MAML-3	lightyellow
Zci_04459	5	1	5	10	8	AT4G00060	NTP9, MEE44	NTP9, MEE44	lightyellow
Zci_07835	6	1	1	10	1	NA	NA	Zci_07835	lightyellow
Zci_06741	1	2	5	10	4	AT2G15560	-	AT2G15560	lightyellow
Zci_09671	3	1	6	4	5	AT3G52200	mtE2-1, LTA3	mtE2-1, LTA3	lightyellow
Zci_03610	NA	NA	NA	NA	NA	AT3G27670	RST1, CER13	RST1, CER13	lightyellow
Zci_07118	1	1	5	4	5	AT3G06810	IBR3	IBR3	lightyellow
Zci_11476	4	1	6	13	8	AT5G55830	LecRK-S.7	LecRK-S.7	lightyellow
Zci_05317	6	3	6	2	7	NA	NA	Zci_05317	lightyellow
Zci_15564	6	1	3	4	5	AT1G53080	-	AT1G53080	lightyellow
Zci_14212	NA	NA	NA	NA	NA	AT4G22290	SHOU4L2	SHOU4L2	lightyellow
Zci_16532	1	7	5	10	5	NA	NA	Zci_16532	lightyellow
Zci_07526	NA	NA	NA	NA	NA	AT3G52140	FMT, NOXY38, FRIENDLY	FMT, NOXY38, FRIENDLY	lightyellow
Zci_14322	1	7	5	10	5	AT3G55870	-	AT3G55870	lightyellow
Zci_07547	NA	NA	NA	NA	NA	AT4G14800	PBD2	PBD2	magenta
Zci_02434	NA	NA	NA	NA	NA	AT1G26910	RPL10B	RPL10B	magenta
Zci_09204	NA	NA	NA	NA	NA	AT1G52280	AtRABG3d, RABG3d	AtRABG3d, RABG3d	magenta
Zci_05700	NA	NA	NA	NA	NA	AT3G13445	TFIID-1, TBP1	TFIID-1, TBP1	magenta
Zci_04512	NA	NA	NA	NA	NA	AT2G44860	RPL24C	RPL24C	magenta
Zci_01532	NA	NA	NA	NA	NA	AT3G15660	GRXS15, ATGRX4, GRX4	GRXS15, ATGRX4, GRX4	magenta
Zci_02734	NA	NA	NA	NA	NA	AT5G57120	-	AT5G57120	magenta
Zci_01474	NA	NA	NA	NA	NA	AT5G06360	-	AT5G06360	magenta
Zci_00438	NA	NA	NA	NA	NA	AT5G53300	UBC10, AtUBC10	UBC10, AtUBC10	magenta
Zci_12662	NA	NA	NA	NA	NA	AT5G58290	RPT3	RPT3	magenta
Zci_05053	NA	NA	NA	NA	NA	AT5G06160	ATO	ATO	magenta
Zci_01101	NA	NA	NA	NA	NA	AT4G01560	MEE49	MEE49	magenta
Zci_11046	NA	NA	NA	NA	NA	AT5G57330	-	AT5G57330	magenta
Zci_02381	NA	NA	NA	NA	NA	AT5G35080	OS9, AtOS9	OS9, AtOS9	magenta
Zci_09886	9	9	11	14	1	AT4G16310	LDL3	LDL3	magenta
Zci_04322	NA	NA	NA	NA	NA	AT3G15460	atBRX1-1	atBRX1-1	magenta
Zci_02750	NA	NA	NA	NA	NA	AT4G12760	-	AT4G12760	magenta
Zci_10656	NA	NA	NA	NA	NA	AT3G13200	EMB2769, CWC15	EMB2769, CWC15	magenta
Zci_03825	9	8	13	3	3	AT2G16710	-	AT2G16710	magenta
Zci_14442	9	9	13	14	7	AT1G51160	BET5, AtBET5	BET5, AtBET5	magenta
Zci_03098	7	1	1	4	1	AT4G28080	REC2	REC2	midnightblue
Zci_14066	7	4	1	5	5	AT3G10940	LSF2	LSF2	midnightblue
Zci_13049	8	1	1	4	5	AT1G79830	GC5	GC5	midnightblue
Zci_14579	8	7	1	10	1	AT5G60790	ABCF1, GCN20	ABCF1, GCN20	midnightblue
Zci_13205	1	3	1	2	1	AT4G24480	-	AT4G24480	midnightblue
Zci_09644	10	7	1	10	4	AT2G02760	UBC2, ATUBC2	UBC2, ATUBC2	midnightblue
Zci_00419	5	6	1	5	1	AT2G38040	CAC3	CAC3	midnightblue
Zci_00002	5	1	1	10	1	AT1G19220	IAA22, ARF19, ARF11	IAA22, ARF19, ARF11	midnightblue
Zci_11473	8	3	1	10	4	NA	NA	Zci_11473	midnightblue
Zci_07893	7	4	1	5	1	AT5G03760	CSLA09, CSLA9, ATCSLA9, RAT4, ATCSLA09	CSLA09, CSLA9, ATCSLA9, RAT4, ATCSLA09	midnightblue
Zci_13201	5	1	1	10	4	AT3G13960	GRF5, AtGRF5	GRF5, AtGRF5	midnightblue
Zci_12256	NA	NA	NA	NA	NA	AT3G16290	FtsHi2, EMB2083	FtsHi2, EMB2083	midnightblue
Zci_06069	2	7	1	10	1	AT3G49340	-	AT3G49340	midnightblue
Zci_11069	5	1	1	10	1	AT1G19800	TGD1, ABCI14	TGD1, ABCI14	midnightblue
Zci_10393	5	4	3	4	5	AT4G10300	TRR14	TRR14	midnightblue
Zci_00307	1	4	1	10	1	AT5G36160	AtTAT2, TAT2	AtTAT2, TAT2	midnightblue
Zci_02690	NA	NA	NA	NA	NA	AT2G17820	ATHK1, HK1, AHK1	ATHK1, HK1, AHK1	midnightblue
Zci_06787	1	1	1	10	4	AT2G20300	ALE2	ALE2	midnightblue
Zci_09727	NA	NA	NA	NA	NA	AT5G45560	-	AT5G45560	midnightblue
Zci_02826	1	7	1	4	4	NA	NA	Zci_02826	midnightblue
Zci_06675	NA	NA	NA	NA	NA	AT2G30060	-	AT2G30060	orange
Zci_00925	NA	NA	NA	NA	NA	AT4G34350	ISPH, CLB6, HDR	ISPH, CLB6, HDR	orange
Zci_00115	NA	NA	NA	NA	NA	AT5G13780	NAA10	NAA10	orange
Zci_00137	NA	NA	NA	NA	NA	AT1G80780	CAF1j	CAF1j	orange
Zci_07273	NA	NA	NA	NA	NA	AT2G21270	UFD1	UFD1	orange
Zci_03447	NA	NA	NA	NA	NA	AT2G24765	ARF3, ARL1, ATARL1	ARF3, ARL1, ATARL1	orange
Zci_10410	NA	NA	NA	NA	NA	AT5G03430	-	AT5G03430	orange
Zci_13508	NA	NA	NA	NA	NA	AT1G30580	EngD-1	EngD-1	orange
Zci_10681	NA	NA	NA	NA	NA	AT2G42780	-	AT2G42780	orange
Zci_14386	NA	NA	NA	NA	NA	AT3G22110	PAC1	PAC1	orange
Zci_04775	NA	NA	NA	NA	NA	AT1G62850	-	AT1G62850	orange
Zci_07226	NA	NA	NA	NA	NA	AT2G46100	-	AT2G46100	orange
Zci_06796	NA	NA	NA	NA	NA	AT3G56800	ACAM-3, CAM3	ACAM-3, CAM3	orange
Zci_00159	4	8	2	3	7	AT5G19910	MED31	MED31	orange
Zci_14639	NA	NA	NA	NA	NA	AT5G64760	RPN5B	RPN5B	orange
Zci_00446	NA	NA	NA	NA	NA	AT3G58170	ATBET11, MTV15, BS14A, BET11, ATBS14A	ATBET11, MTV15, BS14A, BET11, ATBS14A	orange
Zci_08201	NA	NA	NA	NA	NA	AT3G08890	-	AT3G08890	orange
Zci_12856	NA	NA	NA	NA	NA	AT2G04845	GNAT9	GNAT9	orange
Zci_01619	NA	NA	NA	NA	NA	AT2G47420	DIM1A	DIM1A	orange
Zci_10693	NA	NA	NA	NA	NA	AT5G10010	HIT4	HIT4	orange
Zci_04039	1	4	3	4	5	AT4G25570	ACYB-2	ACYB-2	paleturquoise
Zci_05106	6	4	3	4	5	NA	NA	Zci_05106	paleturquoise
Zci_03829	6	4	3	5	5	NA	NA	Zci_03829	paleturquoise
Zci_10666	2	4	3	4	6	AT3G47790	ATATH7, ATH7, ABCA8	ATATH7, ATH7, ABCA8	paleturquoise
Zci_11531	4	4	3	5	10	NA	NA	Zci_11531	paleturquoise
Zci_11530	1	4	3	5	5	AT1G23010	LPR1	LPR1	paleturquoise
Zci_11536	6	4	3	5	5	AT1G71040	LPR2	LPR2	paleturquoise
Zci_03874	6	4	3	4	6	AT4G10050	PMES	PMES	paleturquoise
Zci_02151	4	4	3	4	5	NA	NA	Zci_02151	paleturquoise
Zci_10387	4	5	3	4	6	NA	NA	Zci_10387	paleturquoise
Zci_12156	1	4	3	4	4	AT1G12580	PEPKR1	PEPKR1	paleturquoise
Zci_03828	7	4	5	10	10	NA	NA	Zci_03828	paleturquoise
Zci_06885	8	5	3	4	5	AT5G62670	HA11, AHA11	HA11, AHA11	paleturquoise
Zci_03790	1	3	1	4	5	NA	NA	Zci_03790	paleturquoise
Zci_12923	4	4	3	4	5	NA	NA	Zci_12923	paleturquoise
Zci_15305	2	5	1	4	5	AT5G03840	TFL1, TFL-1	TFL1, TFL-1	paleturquoise
Zci_15304	3	4	3	5	5	AT5G62040	BFT	BFT	paleturquoise
Zci_15852	6	4	6	4	6	AT3G44990	XTH31, XTR8, AtXTH31, ATXTR8	XTH31, XTR8, AtXTH31, ATXTR8	paleturquoise
Zci_15852	6	4	6	4	6	AT3G25050	XTH3, AtXTH3	XTH3, AtXTH3	paleturquoise
Zci_15852	6	4	6	4	6	AT4G30270	MERI5B, XTH24, MERI-5, SEN4	MERI5B, XTH24, MERI-5, SEN4	paleturquoise
Zci_13010	1	4	1	4	4	NA	NA	Zci_13010	paleturquoise
Zci_13632	1	6	1	5	5	AT1G23010	LPR1	LPR1	paleturquoise
Zci_01971	3	5	1	4	5	AT5G26667	PYR6	PYR6	pink
Zci_02136	6	4	3	5	5	AT4G38800	MTN1, ATMTN1, ATMTAN1, MTAN1	MTN1, ATMTN1, ATMTAN1, MTAN1	pink
Zci_02632	3	4	1	4	5	AT2G36880	MAT3	MAT3	pink
Zci_07085	1	5	1	5	5	AT5G62790	PDE129, DXR	PDE129, DXR	pink
Zci_07426	NA	NA	NA	NA	NA	AT1G12840	DET3, ATVHA-C	DET3, ATVHA-C	pink
Zci_04009	3	5	1	5	5	AT1G77610	-	AT1G77610	pink
Zci_04549	NA	NA	NA	NA	NA	AT1G29310	Sec. 61-alpha1	Sec. 61-alpha1	pink
Zci_06928	NA	NA	NA	NA	NA	AT2G03390	-	AT2G03390	pink
Zci_09602	3	4	3	5	4	AT1G60810	ACLA2, ACLA-2	ACLA2, ACLA-2	pink
Zci_11807	NA	NA	NA	NA	NA	AT1G74910	KJC1	KJC1	pink
Zci_02685	NA	NA	NA	NA	NA	AT4G31480	beta1-COP	beta1-COP	pink
Zci_11918	6	5	1	5	4	AT1G52360	-	AT1G52360	pink
Zci_01981	3	4	3	4	6	AT4G39460	SAMC1, SAMT1	SAMC1, SAMT1	pink
Zci_05616	6	5	1	5	5	AT1G80380	GLYK	GLYK	pink
Zci_04600	3	4	3	5	5	AT4G34450	gamma2-COP	gamma2-COP	pink
Zci_11586	1	5	3	4	5	AT3G53130	LUT1, CYP97C1	LUT1, CYP97C1	pink
Zci_10914	NA	NA	NA	NA	NA	AT3G02090	MPPBETA	MPPBETA	pink
Zci_01528	NA	NA	NA	NA	NA	AT2G39770	CYT1, EMB101, GMP1, VTC1, SOZ1	CYT1, EMB101, GMP1, VTC1, SOZ1	pink
Zci_01548	3	4	3	4	5	AT1G45474	Lhca5	Lhca5	pink
Zci_05776	3	5	3	4	5	AT2G33840	-	AT2G33840	pink
Zci_14052	9	8	2	3	3	NA	NA	Zci_14052	purple
Zci_03461	NA	NA	NA	NA	NA	NA	NA	Zci_03461	purple
Zci_03887	NA	NA	NA	NA	NA	AT4G31420	REIL1	REIL1	purple
Zci_09224	1	8	13	11	2	AT4G03430	STA1, EMB2770	STA1, EMB2770	purple
Zci_11731	NA	NA	NA	NA	NA	NA	NA	Zci_11731	purple
Zci_14422	9	8	11	11	8	NA	NA	Zci_14422	purple
Zci_09683	8	8	13	14	2	AT5G01980	BTL16	BTL16	purple
Zci_10481	8	8	11	7	2	NA	NA	Zci_10481	purple
Zci_12040	NA	NA	NA	NA	NA	NA	NA	Zci_12040	purple
Zci_14610	NA	NA	NA	NA	NA	AT4G02720	MAS2	MAS2	purple
Zci_04874	NA	NA	NA	NA	NA	AT4G19600	CYCT1;4	CYCT1;4	purple
Zci_04917	NA	NA	NA	NA	NA	AT4G26620	-	AT4G26620	purple
Zci_00433	NA	NA	NA	NA	NA	AT5G58130	ROS3	ROS3	purple
Zci_11004	8	8	11	7	3	NA	NA	Zci_11004	purple
Zci_16335	2	2	11	7	2	NA	NA	Zci_16335	purple
Zci_00455	9	8	13	11	3	AT4G00690	ULP1B	ULP1B	purple
Zci_15504	7	8	2	3	3	AT2G30590	WRKY21	WRKY21	purple
Zci_16304	8	8	13	7	3	NA	NA	Zci_16304	purple
Zci_16320	7	2	2	7	2	NA	NA	Zci_16320	purple
Zci_16349	9	8	2	7	8	NA	NA	Zci_16349	purple
Zci_15928	NA	NA	NA	NA	NA	AT1G76350	NLP5	NLP5	red
Zci_03364	9	9	9	14	4	NA	NA	Zci_03364	red
Zci_01326	9	9	6	9	6	AT3G23890	ATTOPII, TOPII	ATTOPII, TOPII	red
Zci_09888	9	5	1	14	1	AT3G56190	ALPHA-SNAP2, ASNAP	ALPHA-SNAP2, ASNAP	red
Zci_03315	9	9	1	14	5	AT2G22310	ATUBP4, UBP4	ATUBP4, UBP4	red
Zci_00889	7	6	11	14	5	AT1G07270	CDC6b	CDC6b	red
Zci_00586	9	5	1	10	5	AT5G20850	ATRAD51, RAD51	ATRAD51, RAD51	red
Zci_04257	7	9	11	3	6	AT1G12580	PEPKR1	PEPKR1	red
Zci_03630	9	9	11	3	4	NA	NA	Zci_03630	red
Zci_10555	7	9	1	9	5	AT4G14310	-	AT4G14310	red
Zci_10062	9	5	1	5	5	AT2G02040	AtNPF8, PTR2, NTR1, ATPTR2-B, ATPTR2, PTR2-B, NPF8	AtNPF8, PTR2, NTR1, ATPTR2-B, ATPTR2, PTR2-B, NPF8	red
Zci_02442	2	9	11	7	5	NA	NA	Zci_02442	red
Zci_10720	NA	NA	NA	NA	NA	AT4G32830	AtAUR1, AUR1	AtAUR1, AUR1	red
Zci_07575	NA	NA	NA	NA	NA	AT5G06770	KHZ2	KHZ2	red
Zci_01538	NA	NA	NA	NA	NA	AT3G19900	-	AT3G19900	red
Zci_08935	7	5	1	9	4	AT5G10720	HK5, CKI2, AHK5	HK5, CKI2, AHK5	red
Zci_04539	1	9	1	4	6	AT5G48600	ATSMC4, SMC3, SMC4, ATCAP-C, ATSMC3	ATSMC4, SMC3, SMC4, ATCAP-C, ATSMC3	red
Zci_07298	9	9	1	9	5	NA	NA	Zci_07298	red
Zci_10805	9	9	1	7	4	NA	NA	Zci_10805	red
Zci_12039	9	9	11	11	4	AT4G30210	AR2, ATR2	AR2, ATR2	red
Zci_12035	NA	NA	NA	NA	NA	AT5G03070	IMPA-9	IMPA-9	royalblue
Zci_04285	NA	NA	NA	NA	NA	AT4G25590	ADF7	ADF7	royalblue
Zci_06402	NA	NA	NA	NA	NA	AT5G20920	EIF2 BETA, EMB1401, eIF-2bs	EIF2 BETA, EMB1401, eIF-2bs	royalblue
Zci_02457	NA	NA	NA	NA	NA	AT1G24530	-	AT1G24530	royalblue
Zci_01638	NA	NA	NA	NA	NA	AT5G61970	-	AT5G61970	royalblue
Zci_10014	2	9	1	12	2	AT5G20950	BGLC1	BGLC1	royalblue
Zci_03574	9	11	1	12	1	AT3G10572	DAU, DAYU, PEX26, APEM9	DAU, DAYU, PEX26, APEM9	royalblue
Zci_01654	1	9	1	9	4	AT4G03960	AtPFA-DSP4, PFA-DSP4	AtPFA-DSP4, PFA-DSP4	royalblue
Zci_06510	NA	NA	NA	NA	NA	AT4G18040	AT.EIF4E1, EIF4E, eIF4E1, CUM1	AT.EIF4E1, EIF4E, eIF4E1, CUM1	royalblue
Zci_11379	3	4	3	5	4	NA	NA	Zci_11379	royalblue
Zci_00241	NA	NA	NA	NA	NA	AT2G35640	-	AT2G35640	royalblue
Zci_09254	NA	NA	NA	NA	NA	AT3G63410	E37, VTE3, IEP37, APG1	E37, VTE3, IEP37, APG1	royalblue
Zci_08581	NA	NA	NA	NA	NA	AT3G55350	HHP1, HARB1	HHP1, HARB1	royalblue
Zci_07116	NA	NA	NA	NA	NA	AT5G51410	LUC7RL	LUC7RL	royalblue
Zci_00243	NA	NA	NA	NA	NA	NA	NA	Zci_00243	royalblue
Zci_09213	NA	NA	NA	NA	NA	AT3G16270	MTV1	MTV1	royalblue
Zci_03655	NA	NA	NA	NA	NA	AT1G21065	-	AT1G21065	royalblue
Zci_07524	NA	NA	NA	NA	NA	NA	NA	Zci_07524	royalblue
Zci_14130	NA	NA	NA	NA	NA	AT1G10580	-	AT1G10580	royalblue
Zci_05046	NA	NA	NA	NA	NA	AT5G13240	MAF1	MAF1	royalblue
Zci_08773	NA	NA	NA	NA	NA	AT2G41040	-	AT2G41040	saddlebrown
Zci_13195	NA	NA	NA	NA	NA	AT1G53750	RPT1A	RPT1A	saddlebrown
Zci_14852	NA	NA	NA	NA	NA	AT1G07230	NPC1	NPC1	saddlebrown
Zci_09809	NA	NA	NA	NA	NA	AT2G01060	-	AT2G01060	saddlebrown
Zci_12499	NA	NA	NA	NA	NA	NA	NA	Zci_12499	saddlebrown
Zci_09675	NA	NA	NA	NA	NA	AT3G26560	-	AT3G26560	saddlebrown
Zci_00641	NA	NA	NA	NA	NA	AT1G49380	-	AT1G49380	saddlebrown
Zci_08875	NA	NA	NA	NA	NA	AT4G17650	-	AT4G17650	saddlebrown
Zci_03221	NA	NA	NA	NA	NA	AT2G30580	BMI1A, DRIP2, AtDRIP2	BMI1A, DRIP2, AtDRIP2	saddlebrown
Zci_13967	NA	NA	NA	NA	NA	AT5G65110	ATACX2, ACX2	ATACX2, ACX2	saddlebrown
Zci_08026	NA	NA	NA	NA	NA	AT1G79550	PGKc, PGK, PGK3	PGKc, PGK, PGK3	saddlebrown
Zci_11365	NA	NA	NA	NA	NA	AT4G20460	-	AT4G20460	saddlebrown
Zci_14670	NA	NA	NA	NA	NA	AT5G46180	DELTA-OAT	DELTA-OAT	saddlebrown
Zci_12909	NA	NA	NA	NA	NA	AT1G49670	NQR	NQR	saddlebrown
Zci_09759	NA	NA	NA	NA	NA	AT4G26750	EXT-like, LIP5	EXT-like, LIP5	saddlebrown
Zci_11574	NA	NA	NA	NA	NA	AT3G12580	HSP70, ATHSP70, HSC70-4	HSP70, ATHSP70, HSC70-4	saddlebrown
Zci_12435	NA	NA	NA	NA	NA	AT3G23280	XBAT35	XBAT35	saddlebrown
Zci_12435	NA	NA	NA	NA	NA	AT4G14365	XBAT34	XBAT34	saddlebrown
Zci_01295	NA	NA	NA	NA	NA	AT4G37870	PCK1, PEPCK	PCK1, PEPCK	saddlebrown
Zci_15117	NA	NA	NA	NA	NA	AT3G16190	-	AT3G16190	saddlebrown
Zci_01012	8	9	11	7	3	NA	NA	Zci_01012	saddlebrown
Zci_03479	1	6	1	5	1	AT1G54130	AT-RSH3, RSH3, ATRSH3	AT-RSH3, RSH3, ATRSH3	salmon
Zci_01105	NA	NA	NA	NA	NA	AT3G23920	BMY7, AtBAM1, BAM1, TR-BAMY	BMY7, AtBAM1, BAM1, TR-BAMY	salmon
Zci_01213	NA	NA	NA	NA	NA	AT4G19670	-	AT4G19670	salmon
Zci_01118	1	6	1	12	1	AT3G06110	MKP2, DSPTP1B, ATMKP2	MKP2, DSPTP1B, ATMKP2	salmon
Zci_10680	NA	NA	NA	NA	NA	AT1G55150	AtRH20, RH20	AtRH20, RH20	salmon
Zci_04306	2	10	1	5	1	NA	NA	Zci_04306	salmon
Zci_13578	9	6	1	5	1	AT5G23080	TGH	TGH	salmon
Zci_11983	1	1	1	5	1	AT1G28520	VOZ1, ATVOZ1	VOZ1, ATVOZ1	salmon
Zci_02284	2	6	1	5	1	NA	NA	Zci_02284	salmon
Zci_01028	2	4	1	5	1	AT1G76040	CPK29	CPK29	salmon
Zci_15283	8	9	1	14	1	AT2G27030	ACAM-2, CAM5	ACAM-2, CAM5	salmon
Zci_10790	NA	NA	NA	NA	NA	AT4G27500	PPI1	PPI1	salmon
Zci_01427	NA	NA	NA	NA	NA	AT3G13670	PPK1, AEL2, MLK4	PPK1, AEL2, MLK4	salmon
Zci_00909	NA	NA	NA	NA	NA	AT5G23670	LCB2	LCB2	salmon
Zci_01969	NA	NA	NA	NA	NA	AT3G06080	TBL10	TBL10	salmon
Zci_01463	8	1	1	9	1	AT2G19880	GCS	GCS	salmon
Zci_05998	NA	NA	NA	NA	NA	AT3G61350	SKIP4	SKIP4	salmon
Zci_04888	3	11	1	5	1	AT4G19110	-	AT4G19110	salmon
Zci_01330	1	1	1	4	1	NA	NA	Zci_01330	salmon
Zci_02754	NA	NA	NA	NA	NA	NA	NA	Zci_02754	salmon
Zci_06386	2	8	6	9	1	NA	NA	Zci_06386	skyblue
Zci_07190	NA	NA	NA	NA	NA	AT2G42450	COR15A, LEA24	COR15A, LEA24	skyblue
Zci_01658	NA	NA	NA	NA	NA	NA	NA	Zci_01658	skyblue
Zci_12601	8	8	12	7	1	NA	NA	Zci_12601	skyblue
Zci_10731	8	8	12	7	1	AT3G03341	-	AT3G03341	skyblue
Zci_02940	NA	NA	NA	NA	NA	NA	NA	Zci_02940	skyblue
Zci_12597	2	8	12	7	2	NA	NA	Zci_12597	skyblue
Zci_09545	NA	NA	NA	NA	NA	AT3G12930	DG238	DG238	skyblue
Zci_05996	2	8	11	7	1	NA	NA	Zci_05996	skyblue
Zci_04835	NA	NA	NA	NA	NA	AT1G04920	SPS3F, AtSPSB, ATSPS3F, SPSB	SPS3F, AtSPSB, ATSPS3F, SPSB	skyblue
Zci_12263	8	8	12	7	8	AT3G05880	RCI2A	RCI2A	skyblue
Zci_12946	7	8	12	9	2	NA	NA	Zci_12946	skyblue
Zci_12106	8	11	1	7	1	NA	NA	Zci_12106	skyblue
Zci_14853	8	8	12	7	9	NA	NA	Zci_14853	skyblue
Zci_01717	NA	NA	NA	NA	NA	AT3G55760	LESV	LESV	skyblue
Zci_15298	8	2	2	3	2	AT5G09650	PPa6, AtPPa6	PPa6, AtPPa6	skyblue
Zci_11526	8	7	1	9	1	NA	NA	Zci_11526	skyblue
Zci_12865	NA	NA	NA	NA	NA	AT5G35930	-	AT5G35930	skyblue
Zci_03818	NA	NA	NA	NA	NA	AT1G07180	NDA1, ATNDI1	NDA1, ATNDI1	skyblue
Zci_10730	10	8	12	7	1	AT3G03341	-	AT3G03341	skyblue
Zci_08319	2	9	2	3	7	AT3G19970	-	AT3G19970	steelblue
Zci_00880	9	9	4	3	7	AT3G57480	SAP13	SAP13	steelblue
Zci_08533	8	9	2	3	7	AT4G00755	-	AT4G00755	steelblue
Zci_14479	8	9	4	7	6	AT5G43830	-	AT5G43830	steelblue
Zci_03652	9	6	4	6	6	AT2G42450	COR15A, LEA24	COR15A, LEA24	steelblue
Zci_08166	8	5	4	1	6	AT1G30090	-	AT1G30090	steelblue
Zci_05028	9	5	2	3	7	AT1G73650	-	AT1G73650	steelblue
Zci_06087	8	9	2	6	10	NA	NA	Zci_06087	steelblue
Zci_04511	9	6	4	3	7	AT5G20910	AIP2	AIP2	steelblue
Zci_08054	8	9	2	6	7	AT1G07430	HAI2, HON, AtAIP1, AIP1	HAI2, HON, AtAIP1, AIP1	steelblue
Zci_01877	8	5	4	6	7	AT1G67300	-	AT1G67300	steelblue
Zci_06361	2	6	4	1	6	AT4G11740	SAY1	SAY1	steelblue
Zci_15002	2	9	4	2	6	AT1G01440	-	AT1G01440	steelblue
Zci_08692	7	9	4	1	7	AT5G24120	SIGE, ATSIG5, SIG5	SIGE, ATSIG5, SIG5	steelblue
Zci_09309	7	8	4	7	4	NA	NA	Zci_09309	steelblue
Zci_02226	8	9	4	7	7	AT4G37300	MEE59	MEE59	steelblue
Zci_15064	7	8	2	7	9	AT1G21000	AIN1, PLATZ1	AIN1, PLATZ1	steelblue
Zci_02011	7	9	4	1	6	AT2G26170	CYP711A1, MAX1	CYP711A1, MAX1	steelblue
Zci_08835	7	9	2	3	7	NA	NA	Zci_08835	steelblue
Zci_15609	2	9	2	3	7	AT5G38900	PDI	PDI	steelblue
Zci_01157	NA	NA	NA	NA	NA	AT4G15470	LFG5, AtLFG5	LFG5, AtLFG5	tan
Zci_12046	NA	NA	NA	NA	NA	AT2G43560	-	AT2G43560	tan
Zci_07188	NA	NA	NA	NA	NA	AT1G12230	GSM2-LIKE	GSM2-LIKE	tan
Zci_00827	NA	NA	NA	NA	NA	AT1G56050	EngD-2	EngD-2	tan
Zci_09430	NA	NA	NA	NA	NA	AT1G09330	ECH	ECH	tan
Zci_05087	NA	NA	NA	NA	NA	AT3G63540	-	AT3G63540	tan
Zci_13893	NA	NA	NA	NA	NA	AT5G04480	BUP	BUP	tan
Zci_14607	NA	NA	NA	NA	NA	AT1G74970	TWN3, SOT8, RPS9, PRPS9	TWN3, SOT8, RPS9, PRPS9	tan
Zci_14585	NA	NA	NA	NA	NA	AT5G48580	FKBP15-2	FKBP15-2	tan
Zci_03213	NA	NA	NA	NA	NA	AT3G50560	-	AT3G50560	tan
Zci_00875	6	1	3	5	8	NA	NA	Zci_00875	tan
Zci_00320	NA	NA	NA	NA	NA	AT4G11960	PGRL1B	PGRL1B	tan
Zci_07362	NA	NA	NA	NA	NA	AT4G01150	CURT1A	CURT1A	tan
Zci_07365	NA	NA	NA	NA	NA	AT3G55330	PPL1	PPL1	tan
Zci_05939	NA	NA	NA	NA	NA	AT2G41760	NTAQ1	NTAQ1	tan
Zci_10727	NA	NA	NA	NA	NA	AT2G44020	-	AT2G44020	tan
Zci_07639	NA	NA	NA	NA	NA	AT1G15120	-	AT1G15120	tan
Zci_04910	NA	NA	NA	NA	NA	AT1G80950	AtLPEAT1, LPEAT1	AtLPEAT1, LPEAT1	tan
Zci_04747	NA	NA	NA	NA	NA	AT2G26230	UOX	UOX	tan
Zci_11974	4	6	3	4	4	AT3G44620	-	AT3G44620	tan
Zci_00615	4	4	1	5	4	AT5G36790	-	AT5G36790	turquoise
Zci_02277	6	4	3	5	4	AT5G12180	CPK17	CPK17	turquoise
Zci_07248	6	4	3	5	4	AT5G55060	-	AT5G55060	turquoise
Zci_04187	1	4	3	5	4	AT4G35250	HCF244	HCF244	turquoise
Zci_04821	6	4	1	5	5	AT1G62020	alpha1-COP	alpha1-COP	turquoise
Zci_13484	4	1	3	5	5	AT5G36890	BGLU42	BGLU42	turquoise
Zci_04615	3	6	1	4	5	NA	NA	Zci_04615	turquoise
Zci_14888	3	1	3	4	5	AT1G20020	LFNR2, FNR2, ATLFNR2	LFNR2, FNR2, ATLFNR2	turquoise
Zci_13858	6	4	3	5	5	AT2G17890	CPK16, CDPK16, AtCDPK16	CPK16, CDPK16, AtCDPK16	turquoise
Zci_01710	NA	NA	NA	NA	NA	AT5G27470	-	AT5G27470	turquoise
Zci_12612	3	4	1	4	4	AT4G24840	COG2	COG2	turquoise
Zci_07065	6	4	3	5	5	AT4G24620	PGI1, PGI	PGI1, PGI	turquoise
Zci_01007	3	4	1	5	5	AT5G05010	-	AT5G05010	turquoise
Zci_06869	6	4	1	5	5	AT4G14570	AtAARE, AARE	AtAARE, AARE	turquoise
Zci_00725	6	4	1	4	1	AT2G33255	-	AT2G33255	turquoise
Zci_04617	1	4	1	5	5	AT3G11330	PIRL9	PIRL9	turquoise
Zci_09152	3	1	1	5	1	AT2G26330	QRP1, ER	QRP1, ER	turquoise
Zci_05180	3	1	3	4	5	AT1G72480	-	AT1G72480	turquoise
Zci_06403	3	4	1	5	4	AT5G16300	COG1	COG1	turquoise
Zci_14168	3	4	1	5	5	AT2G15080	RLP19, AtRLP19	RLP19, AtRLP19	turquoise
Zci_13192	1	4	5	10	6	AT3G48110	EDD1, EDD	EDD1, EDD	violet
Zci_15645	6	4	3	10	5	AT1G03475	HEMF1, ATCPO-I, LIN2	HEMF1, ATCPO-I, LIN2	violet
Zci_08239	1	4	5	10	5	AT5G24710	TWD40-2	TWD40-2	violet
Zci_06641	1	4	5	10	5	NA	NA	Zci_06641	violet
Zci_08274	NA	NA	NA	NA	NA	AT1G15980	NDF1, NDH48, PnsB1	NDF1, NDH48, PnsB1	violet
Zci_00172	1	4	1	10	5	NA	NA	Zci_00172	violet
Zci_13331	NA	NA	NA	NA	NA	AT3G18130	RACK1C, RACK1C_AT	RACK1C, RACK1C_AT	violet
Zci_06455	6	9	1	4	5	NA	NA	Zci_06455	violet
Zci_15145	NA	NA	NA	NA	NA	AT3G04340	EMB2458, FtsHi5	EMB2458, FtsHi5	violet
Zci_13127	6	5	1	4	5	AT1G17270	-	AT1G17270	violet
Zci_10363	1	4	5	10	5	NA	NA	Zci_10363	violet
Zci_12980	1	5	5	10	5	AT1G62400	HT1	HT1	violet
Zci_08660	5	5	5	10	6	AT2G01320	ABCG7	ABCG7	violet
Zci_00840	NA	NA	NA	NA	NA	AT4G33510	DAHP2, AtDAHP2, DHS2	DAHP2, AtDAHP2, DHS2	violet
Zci_03724	NA	NA	NA	NA	NA	AT3G55260	HEXO1, ATHEX2	HEXO1, ATHEX2	violet
Zci_04384	NA	NA	NA	NA	NA	AT1G08640	CJD1	CJD1	violet
Zci_06177	7	1	3	10	5	NA	NA	Zci_06177	violet
Zci_07357	NA	NA	NA	NA	NA	NA	NA	Zci_07357	violet
Zci_09121	3	4	5	10	5	AT1G70630	RAY1	RAY1	violet
Zci_00643	NA	NA	NA	NA	NA	AT2G47510	FUM1	FUM1	violet
Zci_15241	6	1	6	4	6	AT3G54890	LHCA1	LHCA1	white
Zci_11585	6	1	5	10	5	AT1G15820	CP24, LHCB6	CP24, LHCB6	white
Zci_04401	6	1	6	4	6	AT3G47470	LHCA4, CAB4	LHCA4, CAB4	white
Zci_00732	1	1	8	4	6	AT4G10340	LHCB5	LHCB5	white
Zci_12463	5	2	5	10	10	AT1G06680	OE23, PSII-P, PSBP-1, OEE2	OE23, PSII-P, PSBP-1, OEE2	white
Zci_08643	6	1	5	4	6	AT5G66570	OEE1, PSBO-1, MSP-1, OE33, OEE33, PSBO1	OEE1, PSBO-1, MSP-1, OE33, OEE33, PSBO1	white
Zci_10392	1	1	5	10	6	AT1G61520	LHCA3	LHCA3	white
Zci_09519	1	1	3	4	5	AT4G05180	PSBQ-2, PSBQ, PSII-Q	PSBQ-2, PSBQ, PSII-Q	white
Zci_07052	6	3	6	4	6	AT4G37020	-	AT4G37020	white
Zci_11077	3	2	5	10	10	AT3G16140	PSAH-1	PSAH-1	white
Zci_03607	1	1	5	10	10	AT4G12800	PSAL	PSAL	white
Zci_13084	6	1	4	10	7	AT3G61470	LHCA2	LHCA2	white
Zci_04388	6	1	5	4	4	AT1G03130	PSAD-2	PSAD-2	white
Zci_09986	1	1	5	10	6	AT1G55670	PSAG	PSAG	white
Zci_04788	3	1	1	4	5	AT1G29930	LHCB1, AB140, CAB140, CAB1	LHCB1, AB140, CAB140, CAB1	white
Zci_04586	NA	NA	NA	NA	NA	AT1G67740	YCF32, PSBY	YCF32, PSBY	white
Zci_04387	3	1	6	4	6	AT1G31330	PSAF	PSAF	white
Zci_04782	3	2	8	2	10	AT2G30570	PSBW	PSBW	white
Zci_10944	6	1	6	13	7	AT3G08940	LHCB4	LHCB4	white
Zci_00502	11	1	6	13	6	AT1G58290	HEMA1, GluTR, AtHEMA1	HEMA1, GluTR, AtHEMA1	white
Zci_13832	3	4	1	5	1	AT5G42420	URGT3	URGT3	yellow
Zci_01986	3	4	1	5	1	AT1G64650	-	AT1G64650	yellow
Zci_07867	5	4	1	5	5	AT3G54050	HCEF1, cfbp1	HCEF1, cfbp1	yellow
Zci_14106	5	4	3	5	1	AT2G37220	-	AT2G37220	yellow
Zci_02028	5	4	1	5	1	AT3G11170	FAD7, AtFAD7, FADD	FAD7, AtFAD7, FADD	yellow
Zci_08388	3	4	1	5	5	NA	NA	Zci_08388	yellow
Zci_05472	5	4	1	5	1	NA	NA	Zci_05472	yellow
Zci_11878	3	4	1	5	1	NA	NA	Zci_11878	yellow
Zci_02514	5	4	1	5	1	AT4G39260	RBGA6, CCR1, ATGRP8, GR-RBP8, GRP8	RBGA6, CCR1, ATGRP8, GR-RBP8, GRP8	yellow
Zci_03469	NA	NA	NA	NA	NA	AT5G61410	EMB2728, RPE	EMB2728, RPE	yellow
Zci_02209	6	4	1	5	1	AT3G29360	UGD2	UGD2	yellow
Zci_04893	2	4	1	4	1	AT4G36850	-	AT4G36850	yellow
Zci_01321	8	4	3	5	5	AT1G30450	HAP5, CCC1, ATCCC1	HAP5, CCC1, ATCCC1	yellow
Zci_06621	2	4	1	5	1	AT5G42370	-	AT5G42370	yellow
Zci_10289	6	4	1	4	4	AT3G29360	UGD2	UGD2	yellow
Zci_06826	3	4	1	4	1	AT2G47600	MHX1, ATMHX, MHX, ATMHX1	MHX1, ATMHX, MHX, ATMHX1	yellow
Zci_12533	6	4	1	5	5	AT3G25860	LTA2, PLE2	LTA2, PLE2	yellow
Zci_00818	3	4	1	5	1	NA	NA	Zci_00818	yellow
Zci_05438	3	4	3	4	4	AT5G08570	-	AT5G08570	yellow
Zci_10519	3	4	1	4	1	AT4G27800	PPH1, TAP38	PPH1, TAP38	yellow
