cluster	gene	probability
1	Zci_00086	0.7098
1	Zci_00507	0.3574
1	Zci_00851	0.6544
1	Zci_00935	0.0990
1	Zci_00946	0.7284
1	Zci_01850	0.7706
1	Zci_01882	0.6668
1	Zci_02011	0.6217
1	Zci_02114	0.7049
1	Zci_02220	0.6699
1	Zci_02230	0.7220
1	Zci_02338	0.6918
1	Zci_02435	0.1238
1	Zci_03356	0.6287
1	Zci_03459	0.6984
1	Zci_03586	0.3767
1	Zci_03737	0.2231
1	Zci_03805	0.7619
1	Zci_04088	0.7034
1	Zci_04356	0.7338
1	Zci_04363	0.0236
1	Zci_04458	0.5194
1	Zci_05040	0.7667
1	Zci_05615	0.7587
1	Zci_05961	0.0612
1	Zci_06019	0.0828
1	Zci_06201	0.2829
1	Zci_06290	0.7630
1	Zci_06361	0.1061
1	Zci_06399	0.7558
1	Zci_06457	0.3819
1	Zci_06530	0.0589
1	Zci_06672	0.6661
1	Zci_06830	0.7403
1	Zci_06882	0.1367
1	Zci_07014	0.7711
1	Zci_07025	0.4300
1	Zci_07384	0.7748
1	Zci_07446	0.3441
1	Zci_07447	0.3818
1	Zci_07595	0.7401
1	Zci_07701	0.4133
1	Zci_08166	0.7163
1	Zci_08317	0.7492
1	Zci_08630	0.1336
1	Zci_08692	0.1021
1	Zci_08915	0.4421
1	Zci_09052	0.1383
1	Zci_09322	0.1222
1	Zci_09477	0.4574
1	Zci_09706	0.1831
1	Zci_09756	0.1311
1	Zci_09878	0.3410
1	Zci_10128	0.5166
1	Zci_10192	0.5688
1	Zci_10212	0.4316
1	Zci_10453	0.3135
1	Zci_10454	0.1006
1	Zci_11152	0.3117
1	Zci_11362	0.5119
1	Zci_11539	0.7704
1	Zci_11716	0.6400
1	Zci_12614	0.2030
1	Zci_12888	0.7387
1	Zci_12889	0.7357
1	Zci_13355	0.7663
1	Zci_13686	0.7289
1	Zci_13971	0.5558
1	Zci_14463	0.7675
1	Zci_14575	0.3691
1	Zci_14614	0.5321
1	Zci_15243	0.3867
1	Zci_15417	0.7404
1	Zci_15592	0.7748
1	Zci_15942	0.5175
1	Zci_16607	0.6892
1	Zci_16617	0.4051
2	Zci_00059	0.4439
2	Zci_00317	0.1358
2	Zci_00322	0.4392
2	Zci_00368	0.1870
2	Zci_00373	0.2772
2	Zci_00688	0.0895
2	Zci_01457	0.3874
2	Zci_01531	0.4337
2	Zci_01575	0.3773
2	Zci_01578	0.5017
2	Zci_01590	0.4560
2	Zci_01804	0.5164
2	Zci_01926	0.5155
2	Zci_01952	0.4042
2	Zci_01979	0.1713
2	Zci_02157	0.4531
2	Zci_02194	0.4298
2	Zci_02952	0.1421
2	Zci_03040	0.3941
2	Zci_03063	0.4971
2	Zci_03203	0.5186
2	Zci_03207	0.3818
2	Zci_03234	0.5420
2	Zci_03258	0.4464
2	Zci_03290	0.3654
2	Zci_03563	0.3042
2	Zci_03760	0.2629
2	Zci_03903	0.2065
2	Zci_04184	0.4915
2	Zci_04610	0.4989
2	Zci_04694	0.0637
2	Zci_04782	0.5160
2	Zci_05017	0.0780
2	Zci_05197	0.4217
2	Zci_05260	0.2488
2	Zci_05290	0.3060
2	Zci_05317	0.4046
2	Zci_05660	0.3777
2	Zci_05696	0.3615
2	Zci_05950	0.2861
2	Zci_05967	0.2989
2	Zci_05968	0.4389
2	Zci_05974	0.5071
2	Zci_06035	0.4471
2	Zci_06076	0.5026
2	Zci_06077	0.1686
2	Zci_06083	0.0641
2	Zci_06120	0.4930
2	Zci_06219	0.1459
2	Zci_06233	0.4614
2	Zci_06449	0.4336
2	Zci_06550	0.4390
2	Zci_06733	0.3121
2	Zci_06883	0.2946
2	Zci_06978	0.5284
2	Zci_07070	0.5283
2	Zci_07131	0.3735
2	Zci_07254	0.3108
2	Zci_07260	0.2792
2	Zci_07348	0.4844
2	Zci_07556	0.2485
2	Zci_07622	0.2461
2	Zci_07830	0.4048
2	Zci_07843	0.5076
2	Zci_07889	0.2950
2	Zci_07970	0.4894
2	Zci_08070	0.2480
2	Zci_08091	0.1150
2	Zci_08366	0.5208
2	Zci_08456	0.3964
2	Zci_08607	0.4052
2	Zci_08682	0.4737
2	Zci_08830	0.4234
2	Zci_08845	0.3702
2	Zci_08869	0.3522
2	Zci_08920	0.4752
2	Zci_08995	0.3827
2	Zci_08996	0.2712
2	Zci_09081	0.1892
2	Zci_09100	0.2768
2	Zci_09318	0.5197
2	Zci_09344	0.4220
2	Zci_09532	0.3800
2	Zci_09697	0.5309
2	Zci_09717	0.5189
2	Zci_09973	0.4771
2	Zci_09998	0.1821
2	Zci_10060	0.2841
2	Zci_10077	0.1617
2	Zci_10146	0.1801
2	Zci_10203	0.5134
2	Zci_10308	0.1131
2	Zci_10330	0.3882
2	Zci_10434	0.2219
2	Zci_10538	0.1157
2	Zci_10799	0.1601
2	Zci_10810	0.4476
2	Zci_10922	0.3897
2	Zci_10971	0.2530
2	Zci_11070	0.5356
2	Zci_11098	0.3050
2	Zci_11187	0.5151
2	Zci_11319	0.4561
2	Zci_11398	0.1933
2	Zci_11602	0.4377
2	Zci_11614	0.4293
2	Zci_11660	0.3647
2	Zci_11800	0.3836
2	Zci_12182	0.3474
2	Zci_12202	0.3745
2	Zci_12309	0.2113
2	Zci_12393	0.3107
2	Zci_12460	0.2315
2	Zci_12461	0.4094
2	Zci_12581	0.3112
2	Zci_12714	0.4831
2	Zci_12866	0.4047
2	Zci_12867	0.5349
2	Zci_12994	0.4106
2	Zci_13028	0.3639
2	Zci_13203	0.2827
2	Zci_13205	0.3439
2	Zci_13337	0.3241
2	Zci_13365	0.2537
2	Zci_13375	0.4948
2	Zci_13405	0.4165
2	Zci_13486	0.2018
2	Zci_13653	0.5252
2	Zci_13759	0.2930
2	Zci_14277	0.1450
2	Zci_14344	0.4144
2	Zci_14532	0.4068
2	Zci_14580	0.3580
2	Zci_14762	0.5064
2	Zci_15002	0.3254
2	Zci_15037	0.2071
2	Zci_15062	0.3070
2	Zci_15177	0.1010
2	Zci_15294	0.4315
2	Zci_15375	0.3515
2	Zci_15598	0.1369
2	Zci_15613	0.5162
2	Zci_15627	0.4332
2	Zci_15634	0.3678
2	Zci_15716	0.4677
2	Zci_15778	0.4537
2	Zci_15853	0.4747
2	Zci_15867	0.1621
2	Zci_15979	0.3720
2	Zci_16415	0.4921
2	Zci_16518	0.0625
2	Zci_16602	0.4169
3	Zci_00008	0.4510
3	Zci_00038	0.5139
3	Zci_00048	0.3697
3	Zci_00128	0.4475
3	Zci_00159	0.5588
3	Zci_00180	0.4651
3	Zci_00266	0.5250
3	Zci_00287	0.4561
3	Zci_00288	0.4911
3	Zci_00316	0.4195
3	Zci_00337	0.3101
3	Zci_00372	0.3048
3	Zci_00402	0.5325
3	Zci_00484	0.4907
3	Zci_00486	0.3367
3	Zci_00490	0.4105
3	Zci_00506	0.5112
3	Zci_00568	0.2584
3	Zci_00742	0.3597
3	Zci_00781	0.5168
3	Zci_00801	0.5401
3	Zci_00805	0.4668
3	Zci_00837	0.4961
3	Zci_00839	0.2032
3	Zci_00861	0.5440
3	Zci_00879	0.3531
3	Zci_00880	0.3082
3	Zci_00896	0.5250
3	Zci_00898	0.5123
3	Zci_00918	0.4927
3	Zci_00926	0.4755
3	Zci_00936	0.5218
3	Zci_01004	0.4658
3	Zci_01129	0.5231
3	Zci_01156	0.5660
3	Zci_01158	0.4425
3	Zci_01170	0.4203
3	Zci_01215	0.5538
3	Zci_01216	0.5038
3	Zci_01354	0.4910
3	Zci_01376	0.3976
3	Zci_01534	0.2778
3	Zci_01565	0.3731
3	Zci_01623	0.4608
3	Zci_01651	0.2876
3	Zci_01662	0.2408
3	Zci_01678	0.4827
3	Zci_01686	0.5120
3	Zci_01705	0.5667
3	Zci_01706	0.4707
3	Zci_01709	0.4957
3	Zci_01728	0.5081
3	Zci_01760	0.5414
3	Zci_01769	0.5022
3	Zci_01883	0.5155
3	Zci_01934	0.5392
3	Zci_01977	0.2300
3	Zci_02009	0.4558
3	Zci_02016	0.3159
3	Zci_02069	0.4527
3	Zci_02115	0.3084
3	Zci_02137	0.5347
3	Zci_02141	0.4874
3	Zci_02331	0.5284
3	Zci_02367	0.5048
3	Zci_02368	0.2772
3	Zci_02525	0.4118
3	Zci_02600	0.4449
3	Zci_02605	0.5716
3	Zci_02667	0.3452
3	Zci_02674	0.5524
3	Zci_02683	0.4624
3	Zci_02688	0.3996
3	Zci_02707	0.3749
3	Zci_02737	0.4964
3	Zci_02768	0.4236
3	Zci_02771	0.3667
3	Zci_02801	0.4999
3	Zci_02829	0.5440
3	Zci_02831	0.5034
3	Zci_02873	0.4573
3	Zci_02893	0.5209
3	Zci_02894	0.4998
3	Zci_02941	0.4345
3	Zci_02942	0.4228
3	Zci_02962	0.5068
3	Zci_02982	0.4535
3	Zci_03008	0.5527
3	Zci_03010	0.4276
3	Zci_03011	0.3771
3	Zci_03035	0.4765
3	Zci_03043	0.4141
3	Zci_03053	0.5316
3	Zci_03054	0.4983
3	Zci_03129	0.5216
3	Zci_03144	0.3966
3	Zci_03145	0.2640
3	Zci_03165	0.5147
3	Zci_03177	0.2856
3	Zci_03192	0.5110
3	Zci_03210	0.4257
3	Zci_03396	0.5686
3	Zci_03433	0.4317
3	Zci_03452	0.4295
3	Zci_03454	0.5004
3	Zci_03517	0.3909
3	Zci_03527	0.5083
3	Zci_03588	0.2058
3	Zci_03596	0.4707
3	Zci_03630	0.3889
3	Zci_03653	0.3173
3	Zci_03694	0.5210
3	Zci_03715	0.4533
3	Zci_03825	0.4787
3	Zci_03831	0.4750
3	Zci_03835	0.5310
3	Zci_03868	0.4723
3	Zci_03912	0.1520
3	Zci_03959	0.4281
3	Zci_03961	0.5014
3	Zci_04024	0.1428
3	Zci_04053	0.5621
3	Zci_04166	0.5317
3	Zci_04257	0.1954
3	Zci_04275	0.5612
3	Zci_04291	0.5069
3	Zci_04298	0.4923
3	Zci_04311	0.3249
3	Zci_04313	0.5303
3	Zci_04319	0.5450
3	Zci_04327	0.3766
3	Zci_04337	0.4538
3	Zci_04341	0.3151
3	Zci_04345	0.4982
3	Zci_04354	0.4003
3	Zci_04366	0.4163
3	Zci_04368	0.5397
3	Zci_04407	0.4852
3	Zci_04436	0.5234
3	Zci_04502	0.4398
3	Zci_04511	0.4028
3	Zci_04537	0.4780
3	Zci_04624	0.4771
3	Zci_04640	0.5117
3	Zci_04641	0.5100
3	Zci_04643	0.5488
3	Zci_04668	0.3930
3	Zci_04670	0.4618
3	Zci_04699	0.4968
3	Zci_04700	0.5255
3	Zci_04762	0.4815
3	Zci_04798	0.3657
3	Zci_04820	0.1514
3	Zci_04831	0.5171
3	Zci_04842	0.5137
3	Zci_04846	0.4916
3	Zci_04876	0.5052
3	Zci_04880	0.5383
3	Zci_04889	0.5469
3	Zci_04936	0.5340
3	Zci_04973	0.4849
3	Zci_04995	0.5390
3	Zci_04999	0.4165
3	Zci_05028	0.4444
3	Zci_05054	0.4311
3	Zci_05065	0.5472
3	Zci_05134	0.5655
3	Zci_05155	0.4314
3	Zci_05212	0.4624
3	Zci_05221	0.4250
3	Zci_05284	0.1739
3	Zci_05286	0.3481
3	Zci_05338	0.2779
3	Zci_05384	0.4965
3	Zci_05385	0.5268
3	Zci_05419	0.3440
3	Zci_05501	0.5699
3	Zci_05525	0.3443
3	Zci_05529	0.2469
3	Zci_05534	0.5658
3	Zci_05580	0.5256
3	Zci_05617	0.5488
3	Zci_05622	0.4821
3	Zci_05662	0.5068
3	Zci_05663	0.5543
3	Zci_05678	0.4681
3	Zci_05683	0.4981
3	Zci_05685	0.5138
3	Zci_05701	0.4273
3	Zci_05702	0.5363
3	Zci_05707	0.5439
3	Zci_05737	0.2556
3	Zci_05816	0.5176
3	Zci_05848	0.5453
3	Zci_05888	0.4221
3	Zci_05917	0.5466
3	Zci_05919	0.4210
3	Zci_05995	0.4859
3	Zci_06004	0.5155
3	Zci_06005	0.5303
3	Zci_06009	0.5086
3	Zci_06038	0.3390
3	Zci_06059	0.3806
3	Zci_06109	0.3554
3	Zci_06224	0.4949
3	Zci_06303	0.4632
3	Zci_06333	0.5062
3	Zci_06347	0.4430
3	Zci_06356	0.5087
3	Zci_06363	0.3488
3	Zci_06454	0.5445
3	Zci_06487	0.1950
3	Zci_06496	0.3628
3	Zci_06499	0.4997
3	Zci_06543	0.5170
3	Zci_06555	0.5636
3	Zci_06589	0.5485
3	Zci_06657	0.4553
3	Zci_06706	0.2538
3	Zci_06720	0.5465
3	Zci_06721	0.3568
3	Zci_06728	0.3214
3	Zci_06730	0.2217
3	Zci_06744	0.5224
3	Zci_06810	0.5274
3	Zci_06812	0.5256
3	Zci_06827	0.5434
3	Zci_06863	0.2854
3	Zci_06866	0.4151
3	Zci_06906	0.4003
3	Zci_06907	0.3928
3	Zci_06909	0.3963
3	Zci_06983	0.4712
3	Zci_06995	0.3927
3	Zci_07005	0.5488
3	Zci_07019	0.4523
3	Zci_07026	0.5084
3	Zci_07075	0.5146
3	Zci_07172	0.4642
3	Zci_07175	0.4542
3	Zci_07178	0.5038
3	Zci_07179	0.3984
3	Zci_07185	0.5643
3	Zci_07192	0.5500
3	Zci_07210	0.4978
3	Zci_07256	0.4418
3	Zci_07290	0.3084
3	Zci_07402	0.4263
3	Zci_07420	0.5338
3	Zci_07451	0.2681
3	Zci_07545	0.5457
3	Zci_07566	0.4065
3	Zci_07577	0.4525
3	Zci_07709	0.5472
3	Zci_07721	0.3348
3	Zci_07754	0.4713
3	Zci_07763	0.4718
3	Zci_07813	0.5296
3	Zci_07857	0.3430
3	Zci_07878	0.3116
3	Zci_07961	0.4247
3	Zci_07964	0.4695
3	Zci_07972	0.1947
3	Zci_07978	0.5630
3	Zci_07986	0.5189
3	Zci_08017	0.3642
3	Zci_08019	0.4287
3	Zci_08041	0.5394
3	Zci_08044	0.3286
3	Zci_08096	0.2824
3	Zci_08098	0.4919
3	Zci_08126	0.4586
3	Zci_08137	0.5203
3	Zci_08163	0.4206
3	Zci_08229	0.3898
3	Zci_08243	0.4493
3	Zci_08270	0.2170
3	Zci_08282	0.4874
3	Zci_08283	0.4470
3	Zci_08319	0.3902
3	Zci_08375	0.3716
3	Zci_08402	0.5076
3	Zci_08484	0.3797
3	Zci_08496	0.5274
3	Zci_08514	0.3377
3	Zci_08533	0.4332
3	Zci_08629	0.5000
3	Zci_08662	0.4846
3	Zci_08697	0.4731
3	Zci_08744	0.3773
3	Zci_08761	0.5273
3	Zci_08791	0.5434
3	Zci_08835	0.2062
3	Zci_08922	0.5013
3	Zci_08949	0.5643
3	Zci_08988	0.3651
3	Zci_09019	0.5650
3	Zci_09090	0.2737
3	Zci_09158	0.3543
3	Zci_09166	0.5473
3	Zci_09226	0.3907
3	Zci_09269	0.4628
3	Zci_09314	0.5487
3	Zci_09382	0.4933
3	Zci_09385	0.4304
3	Zci_09403	0.5601
3	Zci_09414	0.4844
3	Zci_09424	0.3424
3	Zci_09425	0.4494
3	Zci_09435	0.4118
3	Zci_09446	0.5704
3	Zci_09550	0.5022
3	Zci_09662	0.2902
3	Zci_09719	0.1943
3	Zci_09757	0.3372
3	Zci_09775	0.1079
3	Zci_09787	0.5257
3	Zci_09854	0.5050
3	Zci_09870	0.4742
3	Zci_09984	0.4028
3	Zci_10001	0.2403
3	Zci_10002	0.5320
3	Zci_10009	0.5074
3	Zci_10063	0.4467
3	Zci_10142	0.4527
3	Zci_10167	0.2411
3	Zci_10326	0.4544
3	Zci_10430	0.4350
3	Zci_10462	0.5106
3	Zci_10479	0.2094
3	Zci_10504	0.3256
3	Zci_10575	0.5410
3	Zci_10593	0.3382
3	Zci_10644	0.4239
3	Zci_10677	0.4916
3	Zci_10682	0.4907
3	Zci_10764	0.4090
3	Zci_10842	0.5412
3	Zci_10856	0.5451
3	Zci_10898	0.5443
3	Zci_10900	0.4810
3	Zci_10917	0.1893
3	Zci_10926	0.4450
3	Zci_10928	0.4828
3	Zci_10934	0.5504
3	Zci_10946	0.4076
3	Zci_10993	0.4941
3	Zci_11016	0.5419
3	Zci_11018	0.4998
3	Zci_11109	0.2859
3	Zci_11113	0.4817
3	Zci_11149	0.5543
3	Zci_11177	0.5189
3	Zci_11185	0.4800
3	Zci_11189	0.5241
3	Zci_11206	0.5043
3	Zci_11210	0.5546
3	Zci_11293	0.3532
3	Zci_11381	0.5128
3	Zci_11437	0.3040
3	Zci_11486	0.3035
3	Zci_11554	0.4212
3	Zci_11609	0.5201
3	Zci_11706	0.3059
3	Zci_11744	0.4246
3	Zci_11783	0.5017
3	Zci_11787	0.4232
3	Zci_11790	0.4783
3	Zci_11838	0.2346
3	Zci_11842	0.4997
3	Zci_11852	0.5321
3	Zci_11900	0.5125
3	Zci_11962	0.4031
3	Zci_11967	0.5257
3	Zci_11970	0.4918
3	Zci_11997	0.4184
3	Zci_12001	0.4461
3	Zci_12004	0.4938
3	Zci_12008	0.3823
3	Zci_12011	0.5268
3	Zci_12064	0.4789
3	Zci_12148	0.2279
3	Zci_12152	0.4960
3	Zci_12157	0.4761
3	Zci_12186	0.2840
3	Zci_12222	0.5143
3	Zci_12358	0.3399
3	Zci_12405	0.2094
3	Zci_12420	0.4983
3	Zci_12712	0.4704
3	Zci_12738	0.1881
3	Zci_12795	0.3714
3	Zci_12859	0.2642
3	Zci_12863	0.4336
3	Zci_12884	0.5146
3	Zci_12973	0.5152
3	Zci_12974	0.2862
3	Zci_12981	0.4924
3	Zci_12992	0.5218
3	Zci_13026	0.4226
3	Zci_13032	0.4228
3	Zci_13096	0.2366
3	Zci_13180	0.4400
3	Zci_13186	0.2967
3	Zci_13284	0.4282
3	Zci_13287	0.5270
3	Zci_13374	0.5339
3	Zci_13392	0.4389
3	Zci_13582	0.5561
3	Zci_13627	0.5160
3	Zci_13629	0.2960
3	Zci_13650	0.3815
3	Zci_13654	0.5052
3	Zci_13690	0.4134
3	Zci_13758	0.5567
3	Zci_13840	0.4673
3	Zci_13865	0.5300
3	Zci_13901	0.4557
3	Zci_14050	0.5152
3	Zci_14052	0.4312
3	Zci_14110	0.3584
3	Zci_14179	0.3774
3	Zci_14218	0.4265
3	Zci_14324	0.2484
3	Zci_14336	0.5054
3	Zci_14380	0.1556
3	Zci_14397	0.3455
3	Zci_14415	0.3781
3	Zci_14444	0.4861
3	Zci_14588	0.4033
3	Zci_14615	0.4172
3	Zci_14645	0.3601
3	Zci_14659	0.3769
3	Zci_14704	0.4744
3	Zci_14746	0.1942
3	Zci_14749	0.3448
3	Zci_14755	0.3565
3	Zci_14806	0.3901
3	Zci_14808	0.4089
3	Zci_14907	0.4225
3	Zci_14915	0.4949
3	Zci_14917	0.5517
3	Zci_14961	0.2098
3	Zci_14985	0.5231
3	Zci_15057	0.5581
3	Zci_15097	0.5554
3	Zci_15265	0.4888
3	Zci_15281	0.3218
3	Zci_15298	0.4034
3	Zci_15322	0.5110
3	Zci_15335	0.2410
3	Zci_15347	0.3865
3	Zci_15362	0.4013
3	Zci_15366	0.2722
3	Zci_15407	0.5697
3	Zci_15424	0.2539
3	Zci_15504	0.4489
3	Zci_15609	0.5402
3	Zci_15689	0.3086
3	Zci_15837	0.5267
3	Zci_15925	0.2179
3	Zci_15970	0.4016
3	Zci_15984	0.4729
3	Zci_16014	0.5043
3	Zci_16336	0.4904
3	Zci_16368	0.4531
3	Zci_16400	0.2308
3	Zci_16424	0.4157
3	Zci_16507	0.3443
3	Zci_16512	0.5049
3	Zci_16525	0.3135
3	Zci_16572	0.1543
4	Zci_00118	0.1667
4	Zci_00144	0.3125
4	Zci_00187	0.4870
4	Zci_00204	0.2919
4	Zci_00223	0.2579
4	Zci_00289	0.3437
4	Zci_00333	0.4766
4	Zci_00339	0.1911
4	Zci_00383	0.1846
4	Zci_00412	0.0580
4	Zci_00511	0.4268
4	Zci_00645	0.4787
4	Zci_00722	0.4903
4	Zci_00725	0.4830
4	Zci_00727	0.4790
4	Zci_00731	0.5126
4	Zci_00732	0.2998
4	Zci_00733	0.4703
4	Zci_00768	0.5025
4	Zci_00846	0.4731
4	Zci_00849	0.4932
4	Zci_00872	0.5033
4	Zci_00876	0.4929
4	Zci_00901	0.3152
4	Zci_01021	0.4011
4	Zci_01050	0.4744
4	Zci_01052	0.4453
4	Zci_01160	0.5094
4	Zci_01185	0.4902
4	Zci_01192	0.4913
4	Zci_01268	0.4503
4	Zci_01269	0.4785
4	Zci_01286	0.4731
4	Zci_01300	0.4809
4	Zci_01330	0.4344
4	Zci_01348	0.4646
4	Zci_01380	0.4740
4	Zci_01391	0.4769
4	Zci_01421	0.4886
4	Zci_01442	0.4729
4	Zci_01444	0.4980
4	Zci_01453	0.4651
4	Zci_01455	0.4872
4	Zci_01472	0.5122
4	Zci_01481	0.4822
4	Zci_01525	0.4898
4	Zci_01548	0.5125
4	Zci_01594	0.4841
4	Zci_01599	0.1390
4	Zci_01604	0.4825
4	Zci_01617	0.4753
4	Zci_01636	0.4427
4	Zci_01675	0.4913
4	Zci_01693	0.4870
4	Zci_01748	0.4569
4	Zci_01767	0.4516
4	Zci_01831	0.2278
4	Zci_01855	0.1503
4	Zci_01861	0.4805
4	Zci_01871	0.3955
4	Zci_01971	0.4956
4	Zci_01981	0.4098
4	Zci_01983	0.4906
4	Zci_01989	0.4644
4	Zci_02004	0.4901
4	Zci_02046	0.5190
4	Zci_02077	0.1111
4	Zci_02095	0.4569
4	Zci_02097	0.4264
4	Zci_02151	0.4818
4	Zci_02195	0.2282
4	Zci_02201	0.4900
4	Zci_02288	0.4944
4	Zci_02340	0.5002
4	Zci_02343	0.4263
4	Zci_02352	0.4485
4	Zci_02355	0.4656
4	Zci_02428	0.4790
4	Zci_02460	0.4997
4	Zci_02563	0.4112
4	Zci_02607	0.4805
4	Zci_02630	0.4594
4	Zci_02632	0.4996
4	Zci_02647	0.4846
4	Zci_02701	0.4894
4	Zci_02742	0.4765
4	Zci_02769	0.4656
4	Zci_02800	0.4186
4	Zci_02826	0.3306
4	Zci_02858	0.2660
4	Zci_02870	0.4628
4	Zci_03050	0.4714
4	Zci_03064	0.3743
4	Zci_03098	0.4081
4	Zci_03113	0.4889
4	Zci_03136	0.4783
4	Zci_03174	0.4979
4	Zci_03181	0.3234
4	Zci_03238	0.4246
4	Zci_03270	0.4461
4	Zci_03288	0.4703
4	Zci_03321	0.4574
4	Zci_03344	0.4854
4	Zci_03359	0.4939
4	Zci_03375	0.3647
4	Zci_03378	0.5024
4	Zci_03421	0.2134
4	Zci_03422	0.3908
4	Zci_03424	0.5113
4	Zci_03438	0.4970
4	Zci_03473	0.4553
4	Zci_03474	0.4931
4	Zci_03480	0.4911
4	Zci_03524	0.4839
4	Zci_03531	0.4820
4	Zci_03569	0.4789
4	Zci_03572	0.1325
4	Zci_03619	0.4544
4	Zci_03664	0.4309
4	Zci_03704	0.4809
4	Zci_03721	0.4917
4	Zci_03738	0.4215
4	Zci_03757	0.3445
4	Zci_03774	0.4705
4	Zci_03788	0.4983
4	Zci_03790	0.4095
4	Zci_03857	0.4655
4	Zci_03873	0.4891
4	Zci_03874	0.3868
4	Zci_03909	0.4999
4	Zci_03966	0.4785
4	Zci_03980	0.3116
4	Zci_04020	0.3150
4	Zci_04039	0.4819
4	Zci_04046	0.4922
4	Zci_04052	0.3365
4	Zci_04128	0.4064
4	Zci_04148	0.4792
4	Zci_04150	0.4123
4	Zci_04173	0.4060
4	Zci_04178	0.4296
4	Zci_04189	0.4337
4	Zci_04240	0.5070
4	Zci_04295	0.4753
4	Zci_04314	0.4929
4	Zci_04387	0.3675
4	Zci_04388	0.4105
4	Zci_04389	0.4146
4	Zci_04401	0.2775
4	Zci_04414	0.3188
4	Zci_04416	0.3515
4	Zci_04480	0.4715
4	Zci_04490	0.4132
4	Zci_04503	0.4332
4	Zci_04507	0.4545
4	Zci_04521	0.4323
4	Zci_04539	0.2039
4	Zci_04596	0.4896
4	Zci_04612	0.3948
4	Zci_04615	0.4584
4	Zci_04646	0.4687
4	Zci_04654	0.4982
4	Zci_04685	0.4830
4	Zci_04701	0.4480
4	Zci_04746	0.4213
4	Zci_04761	0.4413
4	Zci_04771	0.4737
4	Zci_04788	0.1825
4	Zci_04869	0.4711
4	Zci_04893	0.4816
4	Zci_04931	0.3610
4	Zci_04996	0.3841
4	Zci_05002	0.4963
4	Zci_05003	0.4225
4	Zci_05044	0.4685
4	Zci_05048	0.3901
4	Zci_05059	0.4519
4	Zci_05060	0.4556
4	Zci_05086	0.4968
4	Zci_05089	0.4694
4	Zci_05093	0.4947
4	Zci_05106	0.4947
4	Zci_05145	0.5135
4	Zci_05161	0.3397
4	Zci_05169	0.5082
4	Zci_05180	0.4984
4	Zci_05187	0.3844
4	Zci_05198	0.4663
4	Zci_05231	0.5008
4	Zci_05245	0.4952
4	Zci_05252	0.4817
4	Zci_05331	0.4944
4	Zci_05337	0.4739
4	Zci_05350	0.4821
4	Zci_05438	0.4637
4	Zci_05443	0.4898
4	Zci_05471	0.4836
4	Zci_05485	0.4887
4	Zci_05516	0.4940
4	Zci_05546	0.4616
4	Zci_05574	0.4703
4	Zci_05649	0.4577
4	Zci_05681	0.2676
4	Zci_05694	0.4740
4	Zci_05721	0.4755
4	Zci_05724	0.3113
4	Zci_05776	0.4858
4	Zci_05826	0.4927
4	Zci_05832	0.4839
4	Zci_05836	0.4971
4	Zci_05866	0.4743
4	Zci_05868	0.4562
4	Zci_05925	0.4958
4	Zci_05935	0.4733
4	Zci_05949	0.4938
4	Zci_05960	0.4666
4	Zci_05966	0.1710
4	Zci_06013	0.4693
4	Zci_06023	0.4615
4	Zci_06049	0.4486
4	Zci_06051	0.4707
4	Zci_06055	0.2675
4	Zci_06089	0.4965
4	Zci_06099	0.4568
4	Zci_06104	0.4676
4	Zci_06105	0.3807
4	Zci_06106	0.4572
4	Zci_06108	0.4897
4	Zci_06176	0.4926
4	Zci_06192	0.3641
4	Zci_06217	0.4519
4	Zci_06261	0.2286
4	Zci_06293	0.4934
4	Zci_06350	0.4830
4	Zci_06377	0.4505
4	Zci_06409	0.3041
4	Zci_06414	0.3553
4	Zci_06455	0.3524
4	Zci_06466	0.3800
4	Zci_06512	0.1887
4	Zci_06582	0.4871
4	Zci_06666	0.4482
4	Zci_06751	0.3302
4	Zci_06785	0.4752
4	Zci_06786	0.4275
4	Zci_06823	0.4815
4	Zci_06826	0.4604
4	Zci_06850	0.1902
4	Zci_06867	0.4655
4	Zci_06885	0.4990
4	Zci_06918	0.4340
4	Zci_07020	0.4612
4	Zci_07028	0.4757
4	Zci_07052	0.4101
4	Zci_07067	0.5096
4	Zci_07076	0.2185
4	Zci_07084	0.4006
4	Zci_07110	0.3194
4	Zci_07118	0.3249
4	Zci_07164	0.4674
4	Zci_07209	0.4945
4	Zci_07222	0.4754
4	Zci_07251	0.4274
4	Zci_07252	0.5029
4	Zci_07279	0.4000
4	Zci_07291	0.4917
4	Zci_07307	0.4651
4	Zci_07317	0.4756
4	Zci_07351	0.2308
4	Zci_07376	0.2378
4	Zci_07387	0.4507
4	Zci_07391	0.4634
4	Zci_07395	0.4410
4	Zci_07396	0.4423
4	Zci_07436	0.4621
4	Zci_07558	0.4605
4	Zci_07574	0.4824
4	Zci_07587	0.4875
4	Zci_07616	0.4819
4	Zci_07635	0.4704
4	Zci_07647	0.4329
4	Zci_07707	0.4984
4	Zci_07727	0.3596
4	Zci_07733	0.0954
4	Zci_07735	0.4694
4	Zci_07749	0.4818
4	Zci_07755	0.4940
4	Zci_07769	0.4679
4	Zci_07775	0.2449
4	Zci_07806	0.4750
4	Zci_07827	0.1458
4	Zci_07831	0.4561
4	Zci_07847	0.4384
4	Zci_07918	0.4395
4	Zci_07929	0.4186
4	Zci_07931	0.4457
4	Zci_07955	0.3212
4	Zci_07958	0.4524
4	Zci_07982	0.4818
4	Zci_07999	0.4712
4	Zci_08011	0.4818
4	Zci_08042	0.4256
4	Zci_08109	0.3401
4	Zci_08120	0.4971
4	Zci_08206	0.5022
4	Zci_08236	0.4895
4	Zci_08256	0.4212
4	Zci_08303	0.4310
4	Zci_08331	0.0871
4	Zci_08358	0.4946
4	Zci_08399	0.4753
4	Zci_08413	0.3846
4	Zci_08463	0.4979
4	Zci_08489	0.4680
4	Zci_08518	0.3363
4	Zci_08534	0.4199
4	Zci_08565	0.4822
4	Zci_08643	0.3512
4	Zci_08681	0.4926
4	Zci_08742	0.4555
4	Zci_08762	0.4877
4	Zci_08806	0.4564
4	Zci_08808	0.4926
4	Zci_08844	0.2676
4	Zci_08885	0.5168
4	Zci_08911	0.4460
4	Zci_08927	0.4617
4	Zci_08929	0.4538
4	Zci_08993	0.4867
4	Zci_09057	0.4817
4	Zci_09062	0.4743
4	Zci_09082	0.2664
4	Zci_09127	0.3677
4	Zci_09130	0.1653
4	Zci_09131	0.5042
4	Zci_09180	0.4767
4	Zci_09312	0.1896
4	Zci_09315	0.2027
4	Zci_09351	0.4628
4	Zci_09359	0.3507
4	Zci_09412	0.4444
4	Zci_09421	0.3279
4	Zci_09471	0.4978
4	Zci_09514	0.3747
4	Zci_09519	0.4272
4	Zci_09544	0.4563
4	Zci_09621	0.4833
4	Zci_09623	0.4691
4	Zci_09626	0.4732
4	Zci_09666	0.1972
4	Zci_09667	0.4677
4	Zci_09670	0.4348
4	Zci_09671	0.3202
4	Zci_09688	0.4805
4	Zci_09703	0.3676
4	Zci_09728	0.4792
4	Zci_09738	0.4911
4	Zci_09749	0.5117
4	Zci_09772	0.4879
4	Zci_09887	0.4023
4	Zci_09904	0.5000
4	Zci_09905	0.4629
4	Zci_09913	0.5074
4	Zci_09937	0.3531
4	Zci_09970	0.4600
4	Zci_10032	0.4177
4	Zci_10058	0.5085
4	Zci_10240	0.4398
4	Zci_10241	0.3623
4	Zci_10289	0.4988
4	Zci_10355	0.4654
4	Zci_10387	0.4751
4	Zci_10393	0.3775
4	Zci_10407	0.4923
4	Zci_10501	0.1489
4	Zci_10519	0.4657
4	Zci_10607	0.3165
4	Zci_10617	0.4893
4	Zci_10623	0.4512
4	Zci_10666	0.5074
4	Zci_10712	0.4527
4	Zci_10716	0.4451
4	Zci_10775	0.4436
4	Zci_10795	0.4828
4	Zci_10836	0.4672
4	Zci_10839	0.4626
4	Zci_10884	0.4465
4	Zci_10968	0.4258
4	Zci_10997	0.4709
4	Zci_11042	0.4541
4	Zci_11051	0.2947
4	Zci_11091	0.4818
4	Zci_11105	0.4899
4	Zci_11110	0.4464
4	Zci_11118	0.3603
4	Zci_11123	0.5075
4	Zci_11134	0.4659
4	Zci_11154	0.4873
4	Zci_11157	0.4980
4	Zci_11160	0.4622
4	Zci_11180	0.4973
4	Zci_11212	0.5094
4	Zci_11222	0.4893
4	Zci_11351	0.4573
4	Zci_11364	0.3393
4	Zci_11368	0.3218
4	Zci_11453	0.0488
4	Zci_11487	0.4778
4	Zci_11496	0.4447
4	Zci_11532	0.5029
4	Zci_11538	0.4899
4	Zci_11547	0.4817
4	Zci_11551	0.4232
4	Zci_11586	0.4875
4	Zci_11650	0.4139
4	Zci_11728	0.5028
4	Zci_11747	0.4864
4	Zci_11827	0.5013
4	Zci_11829	0.4269
4	Zci_11857	0.4761
4	Zci_11859	0.1441
4	Zci_11862	0.4053
4	Zci_11909	0.4904
4	Zci_11945	0.4834
4	Zci_11968	0.4803
4	Zci_11974	0.4514
4	Zci_11990	0.4088
4	Zci_12009	0.3403
4	Zci_12089	0.4706
4	Zci_12094	0.4897
4	Zci_12095	0.4458
4	Zci_12097	0.4911
4	Zci_12112	0.4784
4	Zci_12116	0.4720
4	Zci_12142	0.4814
4	Zci_12156	0.5156
4	Zci_12165	0.4956
4	Zci_12183	0.4385
4	Zci_12193	0.4810
4	Zci_12240	0.4754
4	Zci_12244	0.4423
4	Zci_12273	0.4302
4	Zci_12289	0.5099
4	Zci_12365	0.4801
4	Zci_12386	0.4809
4	Zci_12410	0.3824
4	Zci_12465	0.3365
4	Zci_12470	0.3462
4	Zci_12495	0.1801
4	Zci_12546	0.4279
4	Zci_12580	0.0577
4	Zci_12612	0.4968
4	Zci_12613	0.5046
4	Zci_12729	0.5012
4	Zci_12777	0.4299
4	Zci_12789	0.4813
4	Zci_12915	0.4530
4	Zci_12923	0.4834
4	Zci_12949	0.3316
4	Zci_12955	0.4252
4	Zci_12972	0.4789
4	Zci_13010	0.4108
4	Zci_13020	0.4679
4	Zci_13049	0.4327
4	Zci_13078	0.5020
4	Zci_13103	0.4507
4	Zci_13127	0.4685
4	Zci_13197	0.4635
4	Zci_13224	0.4835
4	Zci_13252	0.4850
4	Zci_13308	0.4848
4	Zci_13312	0.3446
4	Zci_13320	0.4986
4	Zci_13339	0.2500
4	Zci_13353	0.3278
4	Zci_13394	0.4559
4	Zci_13400	0.4678
4	Zci_13494	0.3775
4	Zci_13540	0.3055
4	Zci_13586	0.5037
4	Zci_13641	0.4304
4	Zci_13683	0.4479
4	Zci_13788	0.4094
4	Zci_13791	0.2837
4	Zci_13812	0.5034
4	Zci_13838	0.4337
4	Zci_13895	0.4465
4	Zci_13898	0.4867
4	Zci_13903	0.4922
4	Zci_13910	0.4854
4	Zci_13937	0.4394
4	Zci_13954	0.4416
4	Zci_13968	0.4234
4	Zci_14014	0.4449
4	Zci_14015	0.5070
4	Zci_14065	0.4921
4	Zci_14112	0.4022
4	Zci_14256	0.4813
4	Zci_14291	0.4068
4	Zci_14509	0.4635
4	Zci_14518	0.4655
4	Zci_14522	0.4713
4	Zci_14538	0.4539
4	Zci_14562	0.3167
4	Zci_14596	0.4768
4	Zci_14600	0.4483
4	Zci_14613	0.4621
4	Zci_14624	0.4467
4	Zci_14637	0.4779
4	Zci_14657	0.4616
4	Zci_14660	0.2983
4	Zci_14705	0.4927
4	Zci_14716	0.5087
4	Zci_14717	0.4871
4	Zci_14738	0.4546
4	Zci_14760	0.4497
4	Zci_14826	0.5065
4	Zci_14846	0.4881
4	Zci_14888	0.5011
4	Zci_14898	0.4536
4	Zci_14932	0.4457
4	Zci_14950	0.4630
4	Zci_14977	0.4796
4	Zci_15024	0.3574
4	Zci_15039	0.4655
4	Zci_15051	0.3790
4	Zci_15152	0.3182
4	Zci_15219	0.2647
4	Zci_15241	0.2118
4	Zci_15264	0.4528
4	Zci_15284	0.2782
4	Zci_15305	0.4851
4	Zci_15334	0.4826
4	Zci_15377	0.5046
4	Zci_15379	0.3391
4	Zci_15381	0.4956
4	Zci_15394	0.5036
4	Zci_15423	0.4884
4	Zci_15436	0.3800
4	Zci_15445	0.4837
4	Zci_15491	0.4797
4	Zci_15508	0.4457
4	Zci_15564	0.4949
4	Zci_15566	0.4590
4	Zci_15617	0.5146
4	Zci_15633	0.4662
4	Zci_15737	0.4772
4	Zci_15852	0.4637
4	Zci_15872	0.4942
4	Zci_15911	0.4785
4	Zci_15968	0.4345
4	Zci_15971	0.4815
4	Zci_15977	0.5117
4	Zci_15988	0.4806
4	Zci_16272	0.5036
5	Zci_00010	0.5931
5	Zci_00024	0.6309
5	Zci_00034	0.5936
5	Zci_00041	0.3938
5	Zci_00057	0.4240
5	Zci_00066	0.7108
5	Zci_00082	0.7010
5	Zci_00094	0.6673
5	Zci_00112	0.6032
5	Zci_00167	0.6804
5	Zci_00169	0.6671
5	Zci_00174	0.4955
5	Zci_00182	0.5072
5	Zci_00196	0.2678
5	Zci_00198	0.3065
5	Zci_00203	0.6550
5	Zci_00209	0.6639
5	Zci_00215	0.7112
5	Zci_00247	0.6894
5	Zci_00254	0.3230
5	Zci_00335	0.4578
5	Zci_00374	0.3974
5	Zci_00391	0.6119
5	Zci_00414	0.6193
5	Zci_00419	0.3237
5	Zci_00426	0.6927
5	Zci_00439	0.5996
5	Zci_00495	0.5713
5	Zci_00498	0.7237
5	Zci_00500	0.5029
5	Zci_00513	0.7162
5	Zci_00546	0.5652
5	Zci_00581	0.5711
5	Zci_00615	0.7178
5	Zci_00666	0.1220
5	Zci_00668	0.3032
5	Zci_00747	0.6887
5	Zci_00761	0.6994
5	Zci_00771	0.6666
5	Zci_00773	0.7284
5	Zci_00788	0.6855
5	Zci_00792	0.6773
5	Zci_00818	0.6747
5	Zci_00823	0.4434
5	Zci_00871	0.4794
5	Zci_00875	0.6770
5	Zci_00887	0.6451
5	Zci_00888	0.0718
5	Zci_00893	0.7078
5	Zci_00921	0.6628
5	Zci_00933	0.6415
5	Zci_00942	0.6367
5	Zci_00960	0.5802
5	Zci_00962	0.4980
5	Zci_00968	0.6229
5	Zci_00977	0.6692
5	Zci_00994	0.7186
5	Zci_00996	0.7022
5	Zci_01007	0.5706
5	Zci_01020	0.6835
5	Zci_01025	0.7178
5	Zci_01028	0.7237
5	Zci_01033	0.7066
5	Zci_01051	0.6054
5	Zci_01066	0.6946
5	Zci_01085	0.6870
5	Zci_01133	0.4212
5	Zci_01149	0.7153
5	Zci_01151	0.4526
5	Zci_01196	0.6590
5	Zci_01200	0.6362
5	Zci_01222	0.3652
5	Zci_01232	0.6558
5	Zci_01296	0.5910
5	Zci_01301	0.5656
5	Zci_01304	0.5482
5	Zci_01313	0.4318
5	Zci_01321	0.4446
5	Zci_01338	0.5955
5	Zci_01366	0.6441
5	Zci_01375	0.6349
5	Zci_01382	0.6575
5	Zci_01383	0.7058
5	Zci_01387	0.5719
5	Zci_01403	0.6790
5	Zci_01413	0.5990
5	Zci_01414	0.6632
5	Zci_01425	0.4452
5	Zci_01447	0.6928
5	Zci_01458	0.5740
5	Zci_01468	0.5831
5	Zci_01471	0.6690
5	Zci_01475	0.7132
5	Zci_01485	0.6804
5	Zci_01489	0.5457
5	Zci_01497	0.5392
5	Zci_01501	0.7112
5	Zci_01518	0.5870
5	Zci_01519	0.6310
5	Zci_01520	0.5982
5	Zci_01533	0.3952
5	Zci_01544	0.6326
5	Zci_01552	0.6674
5	Zci_01569	0.4247
5	Zci_01580	0.6882
5	Zci_01585	0.5914
5	Zci_01602	0.5892
5	Zci_01612	0.7186
5	Zci_01613	0.6302
5	Zci_01618	0.6878
5	Zci_01645	0.5014
5	Zci_01652	0.6970
5	Zci_01656	0.2818
5	Zci_01660	0.7045
5	Zci_01664	0.5722
5	Zci_01666	0.5309
5	Zci_01667	0.5328
5	Zci_01681	0.4478
5	Zci_01684	0.6426
5	Zci_01685	0.4031
5	Zci_01692	0.3374
5	Zci_01696	0.7225
5	Zci_01698	0.6944
5	Zci_01702	0.7189
5	Zci_01707	0.4553
5	Zci_01714	0.5770
5	Zci_01715	0.5598
5	Zci_01722	0.4631
5	Zci_01749	0.6231
5	Zci_01752	0.2679
5	Zci_01766	0.6733
5	Zci_01783	0.6280
5	Zci_01786	0.5638
5	Zci_01787	0.6580
5	Zci_01799	0.6237
5	Zci_01812	0.0726
5	Zci_01826	0.6469
5	Zci_01854	0.7223
5	Zci_01867	0.7120
5	Zci_01869	0.6701
5	Zci_01925	0.6817
5	Zci_01930	0.7122
5	Zci_01937	0.6959
5	Zci_01964	0.5797
5	Zci_01985	0.6681
5	Zci_01986	0.6769
5	Zci_02008	0.6658
5	Zci_02023	0.5242
5	Zci_02028	0.6705
5	Zci_02031	0.6359
5	Zci_02039	0.4341
5	Zci_02061	0.6251
5	Zci_02062	0.3370
5	Zci_02064	0.6026
5	Zci_02067	0.6868
5	Zci_02073	0.1796
5	Zci_02096	0.6528
5	Zci_02102	0.4214
5	Zci_02119	0.6936
5	Zci_02136	0.6655
5	Zci_02153	0.6233
5	Zci_02156	0.6985
5	Zci_02160	0.5997
5	Zci_02183	0.4800
5	Zci_02188	0.7116
5	Zci_02209	0.6468
5	Zci_02214	0.2912
5	Zci_02219	0.6581
5	Zci_02225	0.3636
5	Zci_02228	0.6522
5	Zci_02260	0.6323
5	Zci_02277	0.7001
5	Zci_02284	0.6258
5	Zci_02291	0.5270
5	Zci_02301	0.6570
5	Zci_02311	0.4699
5	Zci_02329	0.6406
5	Zci_02333	0.6908
5	Zci_02345	0.6822
5	Zci_02346	0.6543
5	Zci_02347	0.6960
5	Zci_02348	0.4037
5	Zci_02351	0.7098
5	Zci_02358	0.4821
5	Zci_02359	0.5876
5	Zci_02362	0.3061
5	Zci_02370	0.6704
5	Zci_02422	0.7157
5	Zci_02426	0.6197
5	Zci_02431	0.6396
5	Zci_02433	0.5851
5	Zci_02437	0.5216
5	Zci_02452	0.6197
5	Zci_02453	0.6151
5	Zci_02466	0.6283
5	Zci_02471	0.5168
5	Zci_02479	0.7217
5	Zci_02488	0.5069
5	Zci_02493	0.5255
5	Zci_02514	0.6409
5	Zci_02531	0.6988
5	Zci_02533	0.6882
5	Zci_02539	0.7237
5	Zci_02565	0.6636
5	Zci_02570	0.7074
5	Zci_02603	0.6062
5	Zci_02606	0.6613
5	Zci_02636	0.7070
5	Zci_02660	0.6649
5	Zci_02661	0.6518
5	Zci_02741	0.6128
5	Zci_02774	0.6386
5	Zci_02787	0.6281
5	Zci_02797	0.5226
5	Zci_02818	0.6733
5	Zci_02828	0.6275
5	Zci_02837	0.6998
5	Zci_02863	0.5926
5	Zci_02877	0.5696
5	Zci_02885	0.6476
5	Zci_02891	0.6625
5	Zci_02945	0.6498
5	Zci_02973	0.5109
5	Zci_03016	0.3095
5	Zci_03021	0.6388
5	Zci_03030	0.5180
5	Zci_03048	0.6169
5	Zci_03057	0.5928
5	Zci_03061	0.6958
5	Zci_03062	0.5770
5	Zci_03077	0.5980
5	Zci_03092	0.5286
5	Zci_03110	0.6915
5	Zci_03168	0.5437
5	Zci_03191	0.5350
5	Zci_03194	0.6841
5	Zci_03259	0.4312
5	Zci_03265	0.6660
5	Zci_03267	0.6119
5	Zci_03269	0.5968
5	Zci_03271	0.7141
5	Zci_03293	0.6992
5	Zci_03294	0.6546
5	Zci_03310	0.5831
5	Zci_03339	0.7094
5	Zci_03351	0.6152
5	Zci_03354	0.4209
5	Zci_03403	0.6709
5	Zci_03423	0.6448
5	Zci_03427	0.7126
5	Zci_03458	0.6911
5	Zci_03462	0.6633
5	Zci_03464	0.6767
5	Zci_03470	0.7062
5	Zci_03479	0.6863
5	Zci_03494	0.3853
5	Zci_03495	0.6835
5	Zci_03504	0.4341
5	Zci_03508	0.6435
5	Zci_03515	0.2339
5	Zci_03523	0.6743
5	Zci_03554	0.4285
5	Zci_03583	0.2595
5	Zci_03611	0.5875
5	Zci_03612	0.7126
5	Zci_03618	0.7176
5	Zci_03622	0.6904
5	Zci_03648	0.6675
5	Zci_03651	0.6325
5	Zci_03680	0.3092
5	Zci_03688	0.7143
5	Zci_03691	0.7002
5	Zci_03698	0.6048
5	Zci_03711	0.6237
5	Zci_03719	0.6520
5	Zci_03744	0.7044
5	Zci_03745	0.6726
5	Zci_03755	0.4709
5	Zci_03769	0.6744
5	Zci_03783	0.2837
5	Zci_03793	0.6431
5	Zci_03794	0.6788
5	Zci_03796	0.5260
5	Zci_03799	0.6781
5	Zci_03829	0.4033
5	Zci_03847	0.4211
5	Zci_03866	0.4244
5	Zci_03872	0.7018
5	Zci_03877	0.7084
5	Zci_03880	0.6469
5	Zci_03906	0.5618
5	Zci_03913	0.6511
5	Zci_03916	0.6733
5	Zci_03939	0.5287
5	Zci_03940	0.5962
5	Zci_03957	0.6463
5	Zci_03976	0.0081
5	Zci_03987	0.7010
5	Zci_03988	0.6824
5	Zci_03999	0.6165
5	Zci_04006	0.5417
5	Zci_04009	0.5407
5	Zci_04011	0.6674
5	Zci_04017	0.5878
5	Zci_04042	0.6528
5	Zci_04056	0.7077
5	Zci_04059	0.6676
5	Zci_04060	0.6729
5	Zci_04083	0.6677
5	Zci_04090	0.6016
5	Zci_04095	0.7207
5	Zci_04120	0.6254
5	Zci_04124	0.7277
5	Zci_04156	0.5325
5	Zci_04176	0.7130
5	Zci_04182	0.7248
5	Zci_04187	0.6358
5	Zci_04222	0.6628
5	Zci_04223	0.3295
5	Zci_04224	0.6235
5	Zci_04226	0.6325
5	Zci_04237	0.5349
5	Zci_04248	0.6816
5	Zci_04267	0.6217
5	Zci_04271	0.2643
5	Zci_04281	0.4925
5	Zci_04284	0.6754
5	Zci_04301	0.7028
5	Zci_04306	0.6303
5	Zci_04308	0.5688
5	Zci_04323	0.6634
5	Zci_04365	0.6789
5	Zci_04381	0.6233
5	Zci_04462	0.5093
5	Zci_04468	0.7061
5	Zci_04485	0.0690
5	Zci_04496	0.6921
5	Zci_04505	0.6239
5	Zci_04583	0.6491
5	Zci_04600	0.4537
5	Zci_04601	0.5992
5	Zci_04616	0.6015
5	Zci_04617	0.5874
5	Zci_04626	0.7139
5	Zci_04633	0.6530
5	Zci_04634	0.5187
5	Zci_04644	0.5230
5	Zci_04672	0.4887
5	Zci_04690	0.4932
5	Zci_04714	0.6961
5	Zci_04716	0.6816
5	Zci_04725	0.3319
5	Zci_04731	0.3667
5	Zci_04735	0.6410
5	Zci_04738	0.7023
5	Zci_04749	0.6222
5	Zci_04751	0.6322
5	Zci_04765	0.6962
5	Zci_04767	0.7011
5	Zci_04774	0.5825
5	Zci_04785	0.4824
5	Zci_04802	0.6892
5	Zci_04821	0.5988
5	Zci_04822	0.6799
5	Zci_04845	0.5251
5	Zci_04888	0.6077
5	Zci_04890	0.6903
5	Zci_04914	0.6822
5	Zci_04921	0.6130
5	Zci_04950	0.6829
5	Zci_04953	0.5371
5	Zci_04960	0.6960
5	Zci_04986	0.5036
5	Zci_05029	0.7155
5	Zci_05062	0.7270
5	Zci_05095	0.6896
5	Zci_05102	0.4104
5	Zci_05111	0.6020
5	Zci_05119	0.6032
5	Zci_05144	0.6511
5	Zci_05148	0.4966
5	Zci_05157	0.6488
5	Zci_05158	0.6696
5	Zci_05170	0.2132
5	Zci_05184	0.6896
5	Zci_05202	0.5958
5	Zci_05255	0.7169
5	Zci_05256	0.7036
5	Zci_05311	0.6597
5	Zci_05330	0.3999
5	Zci_05340	0.6371
5	Zci_05352	0.6263
5	Zci_05370	0.6158
5	Zci_05378	0.7141
5	Zci_05425	0.6262
5	Zci_05437	0.4657
5	Zci_05472	0.6847
5	Zci_05477	0.5073
5	Zci_05509	0.6617
5	Zci_05524	0.5996
5	Zci_05530	0.6040
5	Zci_05539	0.7019
5	Zci_05543	0.3473
5	Zci_05545	0.6338
5	Zci_05606	0.6961
5	Zci_05616	0.7003
5	Zci_05630	0.4170
5	Zci_05686	0.6560
5	Zci_05705	0.7015
5	Zci_05717	0.6030
5	Zci_05722	0.6429
5	Zci_05725	0.5376
5	Zci_05727	0.5447
5	Zci_05749	0.1789
5	Zci_05759	0.7129
5	Zci_05761	0.6841
5	Zci_05779	0.5703
5	Zci_05790	0.6173
5	Zci_05852	0.6952
5	Zci_05855	0.6266
5	Zci_05856	0.4859
5	Zci_05857	0.5057
5	Zci_05870	0.6800
5	Zci_05890	0.7209
5	Zci_05918	0.6791
5	Zci_05928	0.6982
5	Zci_05944	0.6483
5	Zci_05951	0.6827
5	Zci_05953	0.6837
5	Zci_05955	0.6311
5	Zci_05980	0.1545
5	Zci_06026	0.3384
5	Zci_06043	0.7063
5	Zci_06048	0.5450
5	Zci_06052	0.4651
5	Zci_06053	0.5145
5	Zci_06075	0.6209
5	Zci_06095	0.6438
5	Zci_06096	0.6833
5	Zci_06113	0.6122
5	Zci_06116	0.6827
5	Zci_06123	0.6553
5	Zci_06170	0.5954
5	Zci_06182	0.3424
5	Zci_06183	0.7077
5	Zci_06191	0.3557
5	Zci_06206	0.4815
5	Zci_06223	0.7183
5	Zci_06248	0.3944
5	Zci_06258	0.5101
5	Zci_06278	0.6888
5	Zci_06289	0.5303
5	Zci_06301	0.6781
5	Zci_06310	0.5531
5	Zci_06312	0.6969
5	Zci_06313	0.6469
5	Zci_06344	0.5202
5	Zci_06351	0.7142
5	Zci_06358	0.6960
5	Zci_06368	0.6059
5	Zci_06375	0.5006
5	Zci_06376	0.6415
5	Zci_06392	0.6989
5	Zci_06400	0.5681
5	Zci_06403	0.7087
5	Zci_06405	0.5332
5	Zci_06418	0.4132
5	Zci_06422	0.7146
5	Zci_06424	0.6870
5	Zci_06458	0.3632
5	Zci_06461	0.6308
5	Zci_06462	0.6965
5	Zci_06477	0.5549
5	Zci_06482	0.4895
5	Zci_06493	0.3731
5	Zci_06509	0.7119
5	Zci_06520	0.6703
5	Zci_06527	0.5683
5	Zci_06537	0.6413
5	Zci_06542	0.6612
5	Zci_06544	0.6514
5	Zci_06548	0.7077
5	Zci_06561	0.5925
5	Zci_06564	0.4941
5	Zci_06565	0.7339
5	Zci_06579	0.6667
5	Zci_06621	0.7093
5	Zci_06624	0.6707
5	Zci_06628	0.6855
5	Zci_06634	0.7125
5	Zci_06652	0.6068
5	Zci_06678	0.7207
5	Zci_06714	0.6410
5	Zci_06727	0.6784
5	Zci_06747	0.6564
5	Zci_06764	0.3857
5	Zci_06772	0.0333
5	Zci_06776	0.5982
5	Zci_06792	0.5395
5	Zci_06808	0.7009
5	Zci_06813	0.5289
5	Zci_06828	0.4218
5	Zci_06869	0.5732
5	Zci_06880	0.6041
5	Zci_06887	0.5277
5	Zci_06891	0.6831
5	Zci_06913	0.6448
5	Zci_06926	0.6034
5	Zci_07001	0.6798
5	Zci_07009	0.6677
5	Zci_07042	0.5312
5	Zci_07056	0.6837
5	Zci_07065	0.5407
5	Zci_07069	0.6812
5	Zci_07085	0.6473
5	Zci_07159	0.5239
5	Zci_07167	0.6820
5	Zci_07168	0.6712
5	Zci_07183	0.5619
5	Zci_07191	0.0761
5	Zci_07202	0.7080
5	Zci_07204	0.5594
5	Zci_07208	0.6235
5	Zci_07215	0.7126
5	Zci_07248	0.6443
5	Zci_07276	0.3669
5	Zci_07355	0.6767
5	Zci_07367	0.5879
5	Zci_07388	0.5998
5	Zci_07414	0.7172
5	Zci_07433	0.4144
5	Zci_07453	0.6932
5	Zci_07467	0.6928
5	Zci_07509	0.6421
5	Zci_07564	0.7140
5	Zci_07582	0.5728
5	Zci_07583	0.5546
5	Zci_07585	0.4535
5	Zci_07604	0.7226
5	Zci_07611	0.7321
5	Zci_07620	0.6163
5	Zci_07646	0.6813
5	Zci_07669	0.4763
5	Zci_07672	0.7050
5	Zci_07675	0.6811
5	Zci_07692	0.6946
5	Zci_07708	0.7192
5	Zci_07715	0.6972
5	Zci_07724	0.5097
5	Zci_07728	0.7194
5	Zci_07757	0.6429
5	Zci_07766	0.7051
5	Zci_07767	0.7072
5	Zci_07802	0.7134
5	Zci_07837	0.5627
5	Zci_07848	0.4773
5	Zci_07867	0.6307
5	Zci_07893	0.5298
5	Zci_07908	0.5263
5	Zci_07923	0.5774
5	Zci_07951	0.5719
5	Zci_07954	0.6963
5	Zci_08007	0.6232
5	Zci_08035	0.5779
5	Zci_08036	0.4918
5	Zci_08052	0.3044
5	Zci_08075	0.4020
5	Zci_08127	0.5129
5	Zci_08145	0.7252
5	Zci_08152	0.6205
5	Zci_08178	0.5869
5	Zci_08182	0.6823
5	Zci_08183	0.6647
5	Zci_08214	0.6708
5	Zci_08232	0.4543
5	Zci_08235	0.5905
5	Zci_08308	0.7095
5	Zci_08318	0.5340
5	Zci_08330	0.5394
5	Zci_08345	0.6945
5	Zci_08361	0.6000
5	Zci_08363	0.6516
5	Zci_08388	0.5459
5	Zci_08390	0.5999
5	Zci_08401	0.5820
5	Zci_08409	0.4301
5	Zci_08466	0.6717
5	Zci_08513	0.6473
5	Zci_08536	0.5716
5	Zci_08538	0.5611
5	Zci_08544	0.1009
5	Zci_08555	0.3847
5	Zci_08585	0.5318
5	Zci_08652	0.5645
5	Zci_08659	0.6815
5	Zci_08748	0.3829
5	Zci_08767	0.5413
5	Zci_08770	0.6607
5	Zci_08771	0.6699
5	Zci_08785	0.6882
5	Zci_08788	0.6806
5	Zci_08807	0.5895
5	Zci_08878	0.6916
5	Zci_08879	0.4434
5	Zci_08889	0.5021
5	Zci_08890	0.3797
5	Zci_08924	0.4826
5	Zci_08925	0.4127
5	Zci_08931	0.5306
5	Zci_08951	0.5325
5	Zci_08958	0.7041
5	Zci_08990	0.6757
5	Zci_09005	0.4026
5	Zci_09029	0.7293
5	Zci_09051	0.7208
5	Zci_09077	0.6069
5	Zci_09088	0.4711
5	Zci_09152	0.6443
5	Zci_09203	0.3250
5	Zci_09205	0.7165
5	Zci_09212	0.7158
5	Zci_09235	0.5995
5	Zci_09251	0.4778
5	Zci_09255	0.3376
5	Zci_09257	0.6780
5	Zci_09277	0.4471
5	Zci_09283	0.6908
5	Zci_09384	0.3108
5	Zci_09401	0.5782
5	Zci_09422	0.6271
5	Zci_09426	0.5030
5	Zci_09432	0.5076
5	Zci_09440	0.6969
5	Zci_09473	0.6510
5	Zci_09475	0.6939
5	Zci_09504	0.6773
5	Zci_09553	0.5401
5	Zci_09557	0.7194
5	Zci_09560	0.6638
5	Zci_09602	0.6455
5	Zci_09610	0.6356
5	Zci_09613	0.5858
5	Zci_09673	0.6480
5	Zci_09685	0.6917
5	Zci_09704	0.6991
5	Zci_09715	0.6725
5	Zci_09754	0.4984
5	Zci_09781	0.4044
5	Zci_09820	0.4835
5	Zci_09832	0.4129
5	Zci_09868	0.6559
5	Zci_09882	0.7204
5	Zci_09896	0.5514
5	Zci_09909	0.6424
5	Zci_09930	0.6712
5	Zci_09959	0.5729
5	Zci_09987	0.6692
5	Zci_10010	0.6485
5	Zci_10020	0.7016
5	Zci_10054	0.6615
5	Zci_10062	0.5760
5	Zci_10065	0.7184
5	Zci_10067	0.7244
5	Zci_10118	0.6676
5	Zci_10155	0.7203
5	Zci_10209	0.2827
5	Zci_10210	0.5607
5	Zci_10211	0.6532
5	Zci_10218	0.6833
5	Zci_10278	0.3935
5	Zci_10287	0.5805
5	Zci_10290	0.4812
5	Zci_10342	0.2589
5	Zci_10350	0.6794
5	Zci_10362	0.6117
5	Zci_10412	0.7347
5	Zci_10428	0.6762
5	Zci_10441	0.7047
5	Zci_10447	0.6964
5	Zci_10458	0.3882
5	Zci_10476	0.6354
5	Zci_10484	0.3998
5	Zci_10507	0.6773
5	Zci_10512	0.6996
5	Zci_10517	0.2275
5	Zci_10532	0.6729
5	Zci_10534	0.7251
5	Zci_10543	0.0355
5	Zci_10568	0.6282
5	Zci_10572	0.6421
5	Zci_10581	0.7036
5	Zci_10595	0.6497
5	Zci_10596	0.6731
5	Zci_10601	0.6108
5	Zci_10608	0.2643
5	Zci_10612	0.4007
5	Zci_10614	0.7300
5	Zci_10628	0.6389
5	Zci_10629	0.6833
5	Zci_10649	0.6252
5	Zci_10660	0.7139
5	Zci_10663	0.5717
5	Zci_10684	0.6447
5	Zci_10695	0.6439
5	Zci_10706	0.5917
5	Zci_10708	0.6948
5	Zci_10709	0.4160
5	Zci_10713	0.6689
5	Zci_10726	0.6715
5	Zci_10749	0.6940
5	Zci_10756	0.6734
5	Zci_10778	0.5453
5	Zci_10779	0.6960
5	Zci_10822	0.2944
5	Zci_10829	0.4616
5	Zci_10833	0.6728
5	Zci_10852	0.3971
5	Zci_10881	0.6309
5	Zci_10889	0.7245
5	Zci_10894	0.6170
5	Zci_10911	0.3995
5	Zci_10930	0.5954
5	Zci_10933	0.4612
5	Zci_10953	0.4409
5	Zci_10962	0.5869
5	Zci_10965	0.6859
5	Zci_10972	0.4420
5	Zci_10978	0.6114
5	Zci_10987	0.6852
5	Zci_10996	0.2481
5	Zci_11012	0.6341
5	Zci_11037	0.7016
5	Zci_11047	0.6880
5	Zci_11061	0.6415
5	Zci_11072	0.5134
5	Zci_11082	0.6622
5	Zci_11103	0.1655
5	Zci_11114	0.3952
5	Zci_11174	0.6434
5	Zci_11181	0.6533
5	Zci_11188	0.6201
5	Zci_11207	0.6700
5	Zci_11216	0.7113
5	Zci_11226	0.6017
5	Zci_11238	0.6415
5	Zci_11239	0.5351
5	Zci_11294	0.2665
5	Zci_11349	0.6920
5	Zci_11370	0.1763
5	Zci_11379	0.6191
5	Zci_11410	0.6808
5	Zci_11433	0.5529
5	Zci_11438	0.7163
5	Zci_11521	0.6726
5	Zci_11530	0.4973
5	Zci_11531	0.5536
5	Zci_11536	0.4091
5	Zci_11544	0.7289
5	Zci_11561	0.6504
5	Zci_11572	0.5197
5	Zci_11578	0.7063
5	Zci_11581	0.5047
5	Zci_11583	0.6744
5	Zci_11597	0.5264
5	Zci_11637	0.6884
5	Zci_11669	0.7016
5	Zci_11691	0.5936
5	Zci_11704	0.6637
5	Zci_11737	0.7204
5	Zci_11748	0.6795
5	Zci_11769	0.6846
5	Zci_11797	0.6629
5	Zci_11813	0.6737
5	Zci_11825	0.7130
5	Zci_11837	0.5467
5	Zci_11849	0.6754
5	Zci_11854	0.6681
5	Zci_11863	0.6920
5	Zci_11872	0.6083
5	Zci_11878	0.6418
5	Zci_11901	0.3780
5	Zci_11918	0.6459
5	Zci_11933	0.6479
5	Zci_11983	0.4598
5	Zci_12005	0.5750
5	Zci_12024	0.5810
5	Zci_12061	0.6884
5	Zci_12073	0.7177
5	Zci_12082	0.7241
5	Zci_12087	0.7038
5	Zci_12105	0.2155
5	Zci_12117	0.5161
5	Zci_12128	0.6910
5	Zci_12131	0.6683
5	Zci_12137	0.5322
5	Zci_12169	0.6646
5	Zci_12174	0.6392
5	Zci_12176	0.5523
5	Zci_12196	0.4192
5	Zci_12220	0.5387
5	Zci_12224	0.5872
5	Zci_12227	0.7158
5	Zci_12228	0.6497
5	Zci_12265	0.1620
5	Zci_12310	0.6542
5	Zci_12344	0.7060
5	Zci_12368	0.6667
5	Zci_12374	0.5915
5	Zci_12385	0.3557
5	Zci_12403	0.6867
5	Zci_12404	0.5092
5	Zci_12433	0.6856
5	Zci_12439	0.6507
5	Zci_12475	0.6531
5	Zci_12479	0.6897
5	Zci_12533	0.5270
5	Zci_12549	0.6384
5	Zci_12550	0.4829
5	Zci_12632	0.6042
5	Zci_12642	0.6832
5	Zci_12732	0.3269
5	Zci_12755	0.4618
5	Zci_12793	0.5297
5	Zci_12798	0.5849
5	Zci_12799	0.6415
5	Zci_12827	0.6485
5	Zci_12830	0.6853
5	Zci_12847	0.7004
5	Zci_12848	0.6012
5	Zci_12869	0.5747
5	Zci_12907	0.5589
5	Zci_12937	0.5890
5	Zci_12938	0.5408
5	Zci_12940	0.6717
5	Zci_12986	0.6710
5	Zci_13041	0.7134
5	Zci_13046	0.4694
5	Zci_13048	0.5682
5	Zci_13095	0.1452
5	Zci_13111	0.5125
5	Zci_13211	0.6764
5	Zci_13215	0.7009
5	Zci_13249	0.6059
5	Zci_13261	0.6133
5	Zci_13283	0.5710
5	Zci_13311	0.7152
5	Zci_13421	0.6399
5	Zci_13434	0.6631
5	Zci_13440	0.5183
5	Zci_13443	0.6513
5	Zci_13445	0.5546
5	Zci_13484	0.5090
5	Zci_13485	0.6438
5	Zci_13491	0.7083
5	Zci_13492	0.6943
5	Zci_13493	0.5705
5	Zci_13578	0.5377
5	Zci_13592	0.6011
5	Zci_13598	0.5963
5	Zci_13604	0.3129
5	Zci_13611	0.3290
5	Zci_13630	0.7093
5	Zci_13632	0.4849
5	Zci_13664	0.6146
5	Zci_13669	0.6038
5	Zci_13671	0.1700
5	Zci_13684	0.6197
5	Zci_13692	0.6272
5	Zci_13696	0.4028
5	Zci_13708	0.4940
5	Zci_13725	0.4941
5	Zci_13740	0.3509
5	Zci_13748	0.5243
5	Zci_13781	0.4054
5	Zci_13786	0.6841
5	Zci_13796	0.6396
5	Zci_13810	0.3726
5	Zci_13832	0.6428
5	Zci_13835	0.7152
5	Zci_13837	0.6796
5	Zci_13849	0.4995
5	Zci_13850	0.6091
5	Zci_13856	0.6430
5	Zci_13858	0.6290
5	Zci_13868	0.6887
5	Zci_13896	0.6307
5	Zci_13900	0.4485
5	Zci_13912	0.4821
5	Zci_13913	0.6049
5	Zci_13919	0.6806
5	Zci_13923	0.6323
5	Zci_14053	0.2440
5	Zci_14056	0.6321
5	Zci_14061	0.6989
5	Zci_14066	0.4271
5	Zci_14068	0.6832
5	Zci_14069	0.7167
5	Zci_14070	0.6382
5	Zci_14106	0.5751
5	Zci_14122	0.6724
5	Zci_14136	0.7131
5	Zci_14138	0.7129
5	Zci_14168	0.6457
5	Zci_14186	0.6640
5	Zci_14187	0.6739
5	Zci_14266	0.6824
5	Zci_14335	0.7196
5	Zci_14348	0.6756
5	Zci_14349	0.5572
5	Zci_14352	0.6763
5	Zci_14423	0.5355
5	Zci_14455	0.6053
5	Zci_14457	0.7208
5	Zci_14485	0.6849
5	Zci_14496	0.7030
5	Zci_14497	0.6198
5	Zci_14500	0.6752
5	Zci_14514	0.4099
5	Zci_14516	0.5320
5	Zci_14544	0.4454
5	Zci_14558	0.6992
5	Zci_14617	0.6697
5	Zci_14622	0.5363
5	Zci_14634	0.7355
5	Zci_14656	0.2863
5	Zci_14681	0.6183
5	Zci_14694	0.5531
5	Zci_14709	0.5449
5	Zci_14730	0.6906
5	Zci_14735	0.4966
5	Zci_14775	0.5443
5	Zci_14776	0.2227
5	Zci_14796	0.6768
5	Zci_14807	0.5192
5	Zci_14825	0.6905
5	Zci_14843	0.7214
5	Zci_14876	0.5927
5	Zci_14878	0.7129
5	Zci_14886	0.5411
5	Zci_14889	0.6553
5	Zci_14901	0.7154
5	Zci_14903	0.7202
5	Zci_14919	0.7243
5	Zci_14942	0.7133
5	Zci_14951	0.6972
5	Zci_14982	0.5907
5	Zci_15006	0.5745
5	Zci_15028	0.4675
5	Zci_15070	0.6848
5	Zci_15099	0.6957
5	Zci_15198	0.6581
5	Zci_15214	0.6864
5	Zci_15240	0.6237
5	Zci_15250	0.1464
5	Zci_15253	0.2412
5	Zci_15277	0.4372
5	Zci_15285	0.7076
5	Zci_15297	0.6993
5	Zci_15301	0.5676
5	Zci_15304	0.2469
5	Zci_15315	0.6942
5	Zci_15327	0.6021
5	Zci_15329	0.4635
5	Zci_15333	0.7063
5	Zci_15338	0.7233
5	Zci_15348	0.6264
5	Zci_15356	0.6649
5	Zci_15386	0.7299
5	Zci_15415	0.6672
5	Zci_15458	0.6495
5	Zci_15570	0.6622
5	Zci_15586	0.7188
5	Zci_15599	0.5714
5	Zci_15601	0.3963
5	Zci_15619	0.5903
5	Zci_15649	0.3325
5	Zci_15697	0.6365
5	Zci_15782	0.3684
5	Zci_15786	0.7033
5	Zci_15804	0.4473
5	Zci_15849	0.7265
5	Zci_15854	0.6865
5	Zci_15859	0.4143
5	Zci_15887	0.6696
5	Zci_15923	0.5964
5	Zci_15964	0.1836
5	Zci_15975	0.0407
5	Zci_15985	0.5652
5	Zci_16264	0.6696
5	Zci_16407	0.6152
5	Zci_16425	0.6719
6	Zci_00183	0.6482
6	Zci_00238	0.6002
6	Zci_00348	0.4388
6	Zci_00421	0.6530
6	Zci_00422	0.1793
6	Zci_00579	0.6153
6	Zci_00590	0.4791
6	Zci_00836	0.3515
6	Zci_00862	0.5997
6	Zci_00907	0.6700
6	Zci_00947	0.1580
6	Zci_00969	0.2274
6	Zci_00991	0.4004
6	Zci_01201	0.2341
6	Zci_01312	0.5411
6	Zci_01353	0.2434
6	Zci_01419	0.6220
6	Zci_01820	0.6270
6	Zci_01834	0.2479
6	Zci_01877	0.4150
6	Zci_01973	0.6063
6	Zci_02032	0.6199
6	Zci_02218	0.0750
6	Zci_02285	0.4825
6	Zci_02832	0.3151
6	Zci_02946	0.4586
6	Zci_02959	0.3969
6	Zci_03205	0.4581
6	Zci_03316	0.6093
6	Zci_03616	0.4849
6	Zci_03652	0.4808
6	Zci_03801	0.1310
6	Zci_03833	0.4234
6	Zci_03870	0.4551
6	Zci_03911	0.6251
6	Zci_03982	0.4541
6	Zci_04030	0.2447
6	Zci_04193	0.6184
6	Zci_04335	0.1221
6	Zci_04397	0.4128
6	Zci_04398	0.5472
6	Zci_04536	0.5810
6	Zci_04639	0.6514
6	Zci_04770	0.4509
6	Zci_04916	0.3042
6	Zci_04937	0.2525
6	Zci_04967	0.2871
6	Zci_04988	0.4631
6	Zci_05013	0.6328
6	Zci_05103	0.4786
6	Zci_05112	0.4941
6	Zci_05264	0.1995
6	Zci_05265	0.6578
6	Zci_05364	0.6694
6	Zci_05541	0.3267
6	Zci_05741	0.3300
6	Zci_05893	0.2067
6	Zci_06046	0.6171
6	Zci_06087	0.1248
6	Zci_06088	0.6080
6	Zci_06718	0.6023
6	Zci_06876	0.6122
6	Zci_06877	0.1608
6	Zci_07061	0.2698
6	Zci_07392	0.5989
6	Zci_07432	0.6395
6	Zci_07479	0.6333
6	Zci_07663	0.1509
6	Zci_07865	0.3837
6	Zci_07868	0.5410
6	Zci_07881	0.2384
6	Zci_07916	0.5704
6	Zci_08054	0.1647
6	Zci_08143	0.5146
6	Zci_08144	0.6296
6	Zci_08150	0.5495
6	Zci_08165	0.4536
6	Zci_08212	0.3725
6	Zci_08315	0.3452
6	Zci_08549	0.5372
6	Zci_08670	0.5857
6	Zci_08946	0.3389
6	Zci_08999	0.5622
6	Zci_09014	0.2673
6	Zci_09047	0.5997
6	Zci_09087	0.5932
6	Zci_09179	0.3860
6	Zci_09184	0.6503
6	Zci_09319	0.4032
6	Zci_09413	0.6421
6	Zci_09447	0.6057
6	Zci_09490	0.5104
6	Zci_09800	0.6293
6	Zci_09982	0.6402
6	Zci_10090	0.6475
6	Zci_10181	0.6022
6	Zci_10333	0.6623
6	Zci_10426	0.3474
6	Zci_10429	0.2230
6	Zci_10513	0.6762
6	Zci_10550	0.6376
6	Zci_10622	0.3658
6	Zci_10742	0.1317
6	Zci_10969	0.6005
6	Zci_11019	0.4236
6	Zci_11137	0.6480
6	Zci_11182	0.6273
6	Zci_11190	0.3853
6	Zci_11256	0.2616
6	Zci_11481	0.2704
6	Zci_11520	0.6635
6	Zci_11666	0.4831
6	Zci_11798	0.6411
6	Zci_12002	0.3845
6	Zci_12007	0.3862
6	Zci_12190	0.4022
6	Zci_12242	0.4231
6	Zci_12257	0.5228
6	Zci_12387	0.4497
6	Zci_12402	0.5981
6	Zci_12543	0.4896
6	Zci_12578	0.5952
6	Zci_13107	0.2272
6	Zci_13122	0.3408
6	Zci_13126	0.5207
6	Zci_13208	0.4023
6	Zci_13327	0.1475
6	Zci_13463	0.3106
6	Zci_13467	0.6394
6	Zci_13614	0.4256
6	Zci_13709	0.6428
6	Zci_13756	0.4732
6	Zci_14058	0.3709
6	Zci_14284	0.6560
6	Zci_14285	0.6186
6	Zci_14391	0.4159
6	Zci_14469	0.6415
6	Zci_14616	0.5361
6	Zci_14684	0.5610
6	Zci_14737	0.4751
6	Zci_14847	0.5982
6	Zci_14891	0.3349
6	Zci_14893	0.6607
6	Zci_14908	0.6528
6	Zci_15036	0.2369
6	Zci_15175	0.6643
6	Zci_15289	0.4535
6	Zci_15291	0.2144
6	Zci_15324	0.5655
6	Zci_15503	0.5453
6	Zci_15569	0.6667
6	Zci_15680	0.6081
6	Zci_15771	0.3094
6	Zci_15781	0.4955
6	Zci_15831	0.2012
6	Zci_15851	0.5813
6	Zci_15877	0.2932
6	Zci_15892	0.5746
6	Zci_15916	0.3612
6	Zci_16322	0.5891
6	Zci_16360	0.4150
6	Zci_16406	0.2086
6	Zci_16488	0.6389
6	Zci_16587	0.6191
6	Zci_16616	0.6656
7	Zci_00005	0.5752
7	Zci_00040	0.3876
7	Zci_00060	0.6193
7	Zci_00097	0.6581
7	Zci_00134	0.6225
7	Zci_00162	0.6539
7	Zci_00171	0.5134
7	Zci_00217	0.4588
7	Zci_00255	0.6355
7	Zci_00275	0.6240
7	Zci_00303	0.4508
7	Zci_00310	0.4345
7	Zci_00311	0.6118
7	Zci_00353	0.4059
7	Zci_00369	0.2573
7	Zci_00396	0.5510
7	Zci_00523	0.5331
7	Zci_00554	0.4559
7	Zci_00558	0.5694
7	Zci_00582	0.6570
7	Zci_00608	0.6631
7	Zci_00614	0.5587
7	Zci_00617	0.3925
7	Zci_00678	0.1558
7	Zci_00683	0.4239
7	Zci_00741	0.6541
7	Zci_00804	0.5865
7	Zci_00838	0.6016
7	Zci_00905	0.2635
7	Zci_00944	0.4845
7	Zci_00981	0.4369
7	Zci_01005	0.4209
7	Zci_01012	0.6430
7	Zci_01169	0.5267
7	Zci_01386	0.1514
7	Zci_01429	0.5754
7	Zci_01616	0.5420
7	Zci_01668	0.3622
7	Zci_01708	0.6438
7	Zci_01750	0.3117
7	Zci_01757	0.3906
7	Zci_01796	0.5333
7	Zci_01818	0.4993
7	Zci_01870	0.1576
7	Zci_01892	0.6593
7	Zci_01959	0.4447
7	Zci_02014	0.5368
7	Zci_02017	0.4924
7	Zci_02026	0.5616
7	Zci_02063	0.5178
7	Zci_02173	0.3612
7	Zci_02199	0.6057
7	Zci_02226	0.4096
7	Zci_02310	0.4431
7	Zci_02439	0.6751
7	Zci_02442	0.5630
7	Zci_02509	0.2052
7	Zci_02573	0.4335
7	Zci_02622	0.5719
7	Zci_02645	0.6240
7	Zci_02679	0.4799
7	Zci_02695	0.6380
7	Zci_02699	0.1816
7	Zci_02912	0.5295
7	Zci_03029	0.6504
7	Zci_03045	0.3477
7	Zci_03060	0.5372
7	Zci_03090	0.1635
7	Zci_03208	0.5050
7	Zci_03211	0.6794
7	Zci_03225	0.6690
7	Zci_03228	0.4345
7	Zci_03272	0.4850
7	Zci_03302	0.6473
7	Zci_03578	0.6200
7	Zci_03582	0.4288
7	Zci_03733	0.3458
7	Zci_03820	0.3467
7	Zci_03969	0.3742
7	Zci_04076	0.4280
7	Zci_04077	0.5732
7	Zci_04123	0.3897
7	Zci_04172	0.5780
7	Zci_04269	0.1808
7	Zci_04288	0.2430
7	Zci_04293	0.5617
7	Zci_04294	0.5923
7	Zci_04324	0.3465
7	Zci_04339	0.5620
7	Zci_04382	0.5358
7	Zci_04406	0.6228
7	Zci_04432	0.6858
7	Zci_04440	0.3195
7	Zci_04486	0.5166
7	Zci_04687	0.5843
7	Zci_04776	0.1445
7	Zci_04806	0.5912
7	Zci_04856	0.5326
7	Zci_04969	0.6693
7	Zci_05069	0.5940
7	Zci_05092	0.5487
7	Zci_05108	0.4139
7	Zci_05143	0.5446
7	Zci_05235	0.5558
7	Zci_05259	0.4359
7	Zci_05326	0.6823
7	Zci_05467	0.4014
7	Zci_05486	0.6698
7	Zci_05547	0.4512
7	Zci_05575	0.4628
7	Zci_05618	0.5913
7	Zci_05672	0.6609
7	Zci_05674	0.6710
7	Zci_05675	0.6680
7	Zci_05703	0.5219
7	Zci_05742	0.3032
7	Zci_05838	0.4954
7	Zci_05861	0.6527
7	Zci_05895	0.6458
7	Zci_05907	0.6574
7	Zci_05908	0.5132
7	Zci_05952	0.6346
7	Zci_05996	0.6056
7	Zci_06062	0.5717
7	Zci_06085	0.4992
7	Zci_06282	0.4266
7	Zci_06285	0.6184
7	Zci_06311	0.6580
7	Zci_06354	0.5884
7	Zci_06379	0.4737
7	Zci_06382	0.5046
7	Zci_06412	0.6046
7	Zci_06507	0.6634
7	Zci_06563	0.5751
7	Zci_06593	0.2087
7	Zci_06637	0.5448
7	Zci_06712	0.6137
7	Zci_06725	0.6492
7	Zci_06872	0.3378
7	Zci_06920	0.4472
7	Zci_06925	0.5340
7	Zci_06992	0.6324
7	Zci_06996	0.3349
7	Zci_07046	0.2296
7	Zci_07078	0.4277
7	Zci_07120	0.3408
7	Zci_07169	0.5970
7	Zci_07224	0.6328
7	Zci_07227	0.3769
7	Zci_07255	0.5011
7	Zci_07262	0.6478
7	Zci_07315	0.3141
7	Zci_07415	0.1269
7	Zci_07546	0.2922
7	Zci_07572	0.6142
7	Zci_07598	0.6388
7	Zci_07668	0.6458
7	Zci_07699	0.5636
7	Zci_07700	0.5459
7	Zci_07758	0.5832
7	Zci_07850	0.4803
7	Zci_07853	0.3390
7	Zci_07876	0.6022
7	Zci_07940	0.6732
7	Zci_07973	0.6197
7	Zci_07988	0.6497
7	Zci_07992	0.6484
7	Zci_08000	0.4992
7	Zci_08002	0.4913
7	Zci_08029	0.5103
7	Zci_08055	0.4932
7	Zci_08076	0.5651
7	Zci_08079	0.5271
7	Zci_08097	0.6512
7	Zci_08130	0.1200
7	Zci_08174	0.6822
7	Zci_08223	0.5367
7	Zci_08293	0.3689
7	Zci_08355	0.6333
7	Zci_08357	0.4133
7	Zci_08414	0.6175
7	Zci_08546	0.4324
7	Zci_08570	0.6596
7	Zci_08661	0.6684
7	Zci_08663	0.5833
7	Zci_08812	0.6690
7	Zci_08867	0.4081
7	Zci_08912	0.6078
7	Zci_08956	0.6539
7	Zci_08960	0.4482
7	Zci_09021	0.6768
7	Zci_09049	0.5688
7	Zci_09120	0.5094
7	Zci_09228	0.6444
7	Zci_09234	0.5653
7	Zci_09309	0.6431
7	Zci_09343	0.4788
7	Zci_09408	0.6286
7	Zci_09451	0.6550
7	Zci_09456	0.5209
7	Zci_09535	0.4566
7	Zci_09547	0.6494
7	Zci_09627	0.6360
7	Zci_09753	0.4173
7	Zci_09789	0.4661
7	Zci_09833	0.1913
7	Zci_09865	0.2495
7	Zci_09940	0.6731
7	Zci_09974	0.5775
7	Zci_10048	0.6065
7	Zci_10082	0.6282
7	Zci_10141	0.6222
7	Zci_10143	0.5376
7	Zci_10177	0.6530
7	Zci_10208	0.3697
7	Zci_10292	0.3651
7	Zci_10306	0.4726
7	Zci_10315	0.5702
7	Zci_10336	0.5615
7	Zci_10399	0.5096
7	Zci_10481	0.5448
7	Zci_10498	0.3967
7	Zci_10499	0.4178
7	Zci_10520	0.4099
7	Zci_10535	0.4540
7	Zci_10542	0.4869
7	Zci_10586	0.6239
7	Zci_10718	0.6732
7	Zci_10724	0.4133
7	Zci_10725	0.6279
7	Zci_10730	0.6541
7	Zci_10731	0.6570
7	Zci_10744	0.6122
7	Zci_10763	0.3674
7	Zci_10767	0.3960
7	Zci_10769	0.5325
7	Zci_10805	0.6586
7	Zci_10841	0.2021
7	Zci_10877	0.6316
7	Zci_10910	0.2112
7	Zci_11004	0.5864
7	Zci_11092	0.1959
7	Zci_11119	0.5589
7	Zci_11132	0.5803
7	Zci_11140	0.5700
7	Zci_11172	0.6560
7	Zci_11173	0.6572
7	Zci_11175	0.6246
7	Zci_11197	0.5964
7	Zci_11236	0.3625
7	Zci_11247	0.6212
7	Zci_11273	0.6053
7	Zci_11367	0.4060
7	Zci_11380	0.5934
7	Zci_11387	0.1235
7	Zci_11394	0.5477
7	Zci_11401	0.2008
7	Zci_11451	0.3072
7	Zci_11467	0.6685
7	Zci_11497	0.5680
7	Zci_11627	0.6260
7	Zci_11641	0.6295
7	Zci_11746	0.3980
7	Zci_11789	0.5412
7	Zci_11792	0.1484
7	Zci_11815	0.6612
7	Zci_11880	0.4948
7	Zci_11881	0.6521
7	Zci_11913	0.5250
7	Zci_11943	0.6400
7	Zci_11996	0.5155
7	Zci_12038	0.6028
7	Zci_12043	0.3860
7	Zci_12066	0.6478
7	Zci_12104	0.3713
7	Zci_12106	0.3284
7	Zci_12158	0.6663
7	Zci_12208	0.4776
7	Zci_12263	0.6276
7	Zci_12275	0.6463
7	Zci_12313	0.4420
7	Zci_12338	0.5933
7	Zci_12353	0.6542
7	Zci_12354	0.1896
7	Zci_12366	0.6093
7	Zci_12473	0.4628
7	Zci_12480	0.6158
7	Zci_12482	0.2964
7	Zci_12488	0.6304
7	Zci_12515	0.6591
7	Zci_12516	0.4088
7	Zci_12597	0.6019
7	Zci_12601	0.6002
7	Zci_12725	0.6015
7	Zci_12855	0.5586
7	Zci_12879	0.6908
7	Zci_12885	0.6032
7	Zci_12961	0.0404
7	Zci_13054	0.5075
7	Zci_13098	0.5480
7	Zci_13123	0.4889
7	Zci_13159	0.4656
7	Zci_13202	0.2095
7	Zci_13207	0.3106
7	Zci_13244	0.6009
7	Zci_13367	0.6348
7	Zci_13446	0.5405
7	Zci_13479	0.6035
7	Zci_13481	0.5838
7	Zci_13597	0.6611
7	Zci_13613	0.5344
7	Zci_13619	0.6523
7	Zci_13624	0.6660
7	Zci_13659	0.6555
7	Zci_13680	0.5821
7	Zci_13701	0.3905
7	Zci_13702	0.6608
7	Zci_13883	0.3587
7	Zci_13922	0.6457
7	Zci_13965	0.1581
7	Zci_14037	0.5572
7	Zci_14055	0.6893
7	Zci_14083	0.1378
7	Zci_14124	0.6495
7	Zci_14164	0.5828
7	Zci_14216	0.5999
7	Zci_14241	0.6167
7	Zci_14248	0.5340
7	Zci_14250	0.6158
7	Zci_14257	0.5100
7	Zci_14282	0.5769
7	Zci_14289	0.5384
7	Zci_14332	0.6468
7	Zci_14468	0.6715
7	Zci_14479	0.6019
7	Zci_14494	0.6098
7	Zci_14503	0.6672
7	Zci_14535	0.5241
7	Zci_14589	0.1253
7	Zci_14698	0.6521
7	Zci_14853	0.6254
7	Zci_14856	0.5560
7	Zci_14881	0.4125
7	Zci_14883	0.5599
7	Zci_14909	0.5590
7	Zci_14959	0.3579
7	Zci_14960	0.5218
7	Zci_15061	0.5114
7	Zci_15064	0.6721
7	Zci_15210	0.4964
7	Zci_15232	0.2828
7	Zci_15239	0.5827
7	Zci_15276	0.6630
7	Zci_15278	0.3192
7	Zci_15336	0.3794
7	Zci_15357	0.5059
7	Zci_15465	0.3470
7	Zci_15526	0.5790
7	Zci_15616	0.4997
7	Zci_15658	0.6899
7	Zci_15679	0.5481
7	Zci_15684	0.6240
7	Zci_15687	0.6208
7	Zci_15708	0.5357
7	Zci_15718	0.6030
7	Zci_15795	0.6697
7	Zci_15802	0.5789
7	Zci_15915	0.5131
7	Zci_15924	0.6135
7	Zci_15953	0.4522
7	Zci_15965	0.2366
7	Zci_15974	0.6570
7	Zci_16304	0.4029
7	Zci_16320	0.4424
7	Zci_16335	0.4544
7	Zci_16349	0.4308
7	Zci_16359	0.4238
7	Zci_16517	0.3998
7	Zci_16574	0.6023
7	Zci_16583	0.6154
7	Zci_16592	0.6503
7	Zci_16599	0.1097
7	Zci_16605	0.5934
8	Zci_00234	0.8698
8	Zci_00417	0.1923
8	Zci_00646	0.8453
8	Zci_00891	0.8698
8	Zci_01093	0.8557
8	Zci_01329	0.7787
8	Zci_01423	0.8652
8	Zci_01551	0.8371
8	Zci_01745	0.5029
8	Zci_02470	0.8513
8	Zci_02576	0.7680
8	Zci_02898	0.8124
8	Zci_03298	0.8600
8	Zci_03319	0.5648
8	Zci_03520	0.7898
8	Zci_03585	0.4223
8	Zci_03935	0.0948
8	Zci_04225	0.8335
8	Zci_04247	0.8285
8	Zci_04923	0.8606
8	Zci_05117	0.0323
8	Zci_05217	0.7605
8	Zci_05276	0.8350
8	Zci_05728	0.8276
8	Zci_06041	0.3942
8	Zci_06259	0.8553
8	Zci_06339	0.8652
8	Zci_06656	0.5065
8	Zci_06748	0.5491
8	Zci_07671	0.2687
8	Zci_07924	0.8650
8	Zci_08826	0.7569
8	Zci_09229	0.8187
8	Zci_09496	0.8235
8	Zci_09657	0.7013
8	Zci_09659	0.8055
8	Zci_09664	0.4347
8	Zci_09731	0.7980
8	Zci_09732	0.7855
8	Zci_09918	0.0457
8	Zci_10080	0.2945
8	Zci_10171	0.1569
8	Zci_10858	0.0952
8	Zci_10907	0.7077
8	Zci_11302	0.6395
8	Zci_11436	0.8698
8	Zci_11902	0.8566
8	Zci_12192	0.8650
8	Zci_12319	0.8654
8	Zci_12370	0.8698
8	Zci_12790	0.6087
8	Zci_12831	0.8425
8	Zci_12881	0.1122
8	Zci_12963	0.8359
8	Zci_13003	0.8362
8	Zci_13390	0.7310
8	Zci_13601	0.7505
8	Zci_14107	0.8276
8	Zci_14573	0.3850
8	Zci_15078	0.1715
8	Zci_15856	0.8372
9	Zci_00049	0.5411
9	Zci_00161	0.7776
9	Zci_00213	0.7143
9	Zci_00411	0.1336
9	Zci_00460	0.5481
9	Zci_00504	0.5122
9	Zci_00509	0.6976
9	Zci_00525	0.7494
9	Zci_00544	0.7311
9	Zci_00588	0.2639
9	Zci_00826	0.5070
9	Zci_00845	0.6632
9	Zci_00890	0.3757
9	Zci_01042	0.7648
9	Zci_01282	0.6582
9	Zci_01324	0.6988
9	Zci_01326	0.6973
9	Zci_01359	0.7667
9	Zci_01463	0.7611
9	Zci_01529	0.0372
9	Zci_01546	0.4595
9	Zci_01567	0.0895
9	Zci_01653	0.1704
9	Zci_01654	0.2893
9	Zci_01725	0.7733
9	Zci_01726	0.7394
9	Zci_01762	0.0971
9	Zci_01773	0.7298
9	Zci_01784	0.1147
9	Zci_01891	0.7163
9	Zci_01972	0.4616
9	Zci_02012	0.5009
9	Zci_02051	0.7734
9	Zci_02229	0.6032
9	Zci_02304	0.7209
9	Zci_02328	0.2890
9	Zci_02341	0.7552
9	Zci_02361	0.7610
9	Zci_02421	0.2609
9	Zci_02879	0.7095
9	Zci_03071	0.4626
9	Zci_03280	0.7284
9	Zci_03286	0.6676
9	Zci_03379	0.5389
9	Zci_03428	0.3963
9	Zci_03792	0.7568
9	Zci_03960	0.5373
9	Zci_04278	0.3489
9	Zci_04279	0.6585
9	Zci_04309	0.4136
9	Zci_04340	0.1153
9	Zci_04477	0.1815
9	Zci_04631	0.7401
9	Zci_04753	0.6377
9	Zci_04830	0.2447
9	Zci_04879	0.7370
9	Zci_04930	0.3073
9	Zci_04959	0.5472
9	Zci_05075	0.5300
9	Zci_05094	0.5128
9	Zci_05177	0.4773
9	Zci_05263	0.7540
9	Zci_05282	0.2665
9	Zci_05283	0.7701
9	Zci_05336	0.4619
9	Zci_05348	0.3832
9	Zci_05363	0.2331
9	Zci_05374	0.4055
9	Zci_05415	0.7729
9	Zci_05548	0.4179
9	Zci_05689	0.5579
9	Zci_06016	0.6641
9	Zci_06042	0.5733
9	Zci_06178	0.7635
9	Zci_06184	0.6944
9	Zci_06326	0.3827
9	Zci_06386	0.7289
9	Zci_06420	0.3654
9	Zci_06456	0.6998
9	Zci_06805	0.1893
9	Zci_07017	0.4768
9	Zci_07129	0.5258
9	Zci_07277	0.7060
9	Zci_07298	0.2108
9	Zci_07340	0.7395
9	Zci_07403	0.7685
9	Zci_07461	0.6854
9	Zci_07496	0.5927
9	Zci_07518	0.5852
9	Zci_07623	0.6620
9	Zci_07640	0.1696
9	Zci_08149	0.1403
9	Zci_08394	0.7246
9	Zci_08407	0.7532
9	Zci_08495	0.5434
9	Zci_08524	0.7268
9	Zci_08525	0.4750
9	Zci_08935	0.2564
9	Zci_08939	0.7728
9	Zci_08943	0.7726
9	Zci_08961	0.7388
9	Zci_08973	0.6093
9	Zci_09083	0.5616
9	Zci_09196	0.6816
9	Zci_09221	0.7438
9	Zci_09345	0.5372
9	Zci_09460	0.7161
9	Zci_09482	0.2666
9	Zci_09513	0.7441
9	Zci_09607	0.7733
9	Zci_10189	0.5110
9	Zci_10272	0.2936
9	Zci_10555	0.7184
9	Zci_10632	0.6455
9	Zci_10741	0.7424
9	Zci_10752	0.7602
9	Zci_10873	0.7439
9	Zci_11074	0.7533
9	Zci_11265	0.2126
9	Zci_11512	0.6001
9	Zci_11526	0.5478
9	Zci_11750	0.1845
9	Zci_11866	0.5213
9	Zci_11998	0.7194
9	Zci_12006	0.7338
9	Zci_12012	0.1706
9	Zci_12055	0.1547
9	Zci_12119	0.7540
9	Zci_12159	0.4796
9	Zci_12187	0.7064
9	Zci_12364	0.2924
9	Zci_12394	0.7736
9	Zci_12442	0.7310
9	Zci_12591	0.7171
9	Zci_12709	0.1712
9	Zci_12946	0.1497
9	Zci_13004	0.6145
9	Zci_13022	0.1227
9	Zci_13042	0.7638
9	Zci_13220	0.7181
9	Zci_13241	0.0928
9	Zci_13246	0.3730
9	Zci_13276	0.2392
9	Zci_13321	0.4359
9	Zci_13379	0.7645
9	Zci_13398	0.7561
9	Zci_15717	0.7776
9	Zci_15801	0.1225
9	Zci_15976	0.6175
9	Zci_16531	0.2093
9	Zci_16538	0.6609
9	Zci_16578	0.0913
10	Zci_00002	0.3651
10	Zci_00012	0.5808
10	Zci_00028	0.5770
10	Zci_00039	0.4800
10	Zci_00045	0.5672
10	Zci_00047	0.5526
10	Zci_00053	0.5841
10	Zci_00054	0.3566
10	Zci_00069	0.4424
10	Zci_00090	0.6043
10	Zci_00172	0.2758
10	Zci_00197	0.5432
10	Zci_00228	0.4561
10	Zci_00230	0.6107
10	Zci_00232	0.5636
10	Zci_00260	0.4809
10	Zci_00307	0.4440
10	Zci_00321	0.6163
10	Zci_00361	0.4167
10	Zci_00548	0.3406
10	Zci_00549	0.5289
10	Zci_00571	0.3467
10	Zci_00576	0.5490
10	Zci_00586	0.0986
10	Zci_00591	0.4303
10	Zci_00596	0.2947
10	Zci_00669	0.5793
10	Zci_00671	0.4554
10	Zci_00677	0.5919
10	Zci_00705	0.1664
10	Zci_00734	0.3171
10	Zci_00833	0.5296
10	Zci_00842	0.3489
10	Zci_01017	0.0988
10	Zci_01041	0.4139
10	Zci_01109	0.4109
10	Zci_01194	0.5680
10	Zci_01320	0.1973
10	Zci_01371	0.3362
10	Zci_01396	0.3133
10	Zci_01469	0.3853
10	Zci_01573	0.1819
10	Zci_01588	0.3200
10	Zci_01670	0.2413
10	Zci_01703	0.2428
10	Zci_01724	0.6002
10	Zci_01735	0.2822
10	Zci_01832	0.2470
10	Zci_01843	0.2018
10	Zci_01859	0.3201
10	Zci_01889	0.6066
10	Zci_01910	0.5729
10	Zci_01948	0.5708
10	Zci_01960	0.3438
10	Zci_01966	0.3213
10	Zci_01995	0.6115
10	Zci_02192	0.4561
10	Zci_02240	0.1299
10	Zci_02259	0.5298
10	Zci_02263	0.2620
10	Zci_02300	0.3512
10	Zci_02303	0.2254
10	Zci_02475	0.5723
10	Zci_02572	0.4056
10	Zci_02747	0.4158
10	Zci_02839	0.1394
10	Zci_02871	0.5347
10	Zci_02903	0.2360
10	Zci_02974	0.5966
10	Zci_02978	0.3760
10	Zci_03041	0.3325
10	Zci_03065	0.5802
10	Zci_03140	0.2975
10	Zci_03146	0.5266
10	Zci_03215	0.5393
10	Zci_03220	0.2294
10	Zci_03327	0.1886
10	Zci_03400	0.5231
10	Zci_03405	0.2584
10	Zci_03412	0.2813
10	Zci_03607	0.5040
10	Zci_03703	0.5351
10	Zci_03708	0.5809
10	Zci_03767	0.3082
10	Zci_03827	0.0985
10	Zci_03828	0.3096
10	Zci_03878	0.3075
10	Zci_04073	0.2658
10	Zci_04085	0.2677
10	Zci_04099	0.5932
10	Zci_04177	0.2737
10	Zci_04198	0.3750
10	Zci_04260	0.4598
10	Zci_04283	0.2400
10	Zci_04292	0.3297
10	Zci_04386	0.5718
10	Zci_04415	0.5446
10	Zci_04429	0.2131
10	Zci_04433	0.5732
10	Zci_04459	0.5548
10	Zci_04538	0.5454
10	Zci_04676	0.5741
10	Zci_04695	0.4314
10	Zci_04741	0.5799
10	Zci_04763	0.0845
10	Zci_04773	0.1706
10	Zci_04860	0.1155
10	Zci_04904	0.6088
10	Zci_04925	0.1078
10	Zci_04945	0.3994
10	Zci_04993	0.3609
10	Zci_05160	0.5521
10	Zci_05172	0.1545
10	Zci_05239	0.4558
10	Zci_05278	0.2469
10	Zci_05327	0.4619
10	Zci_05379	0.4872
10	Zci_05428	0.2064
10	Zci_05429	0.3468
10	Zci_05602	0.1004
10	Zci_05687	0.3004
10	Zci_05859	0.1246
10	Zci_05891	0.1252
10	Zci_05981	0.1561
10	Zci_06034	0.4439
10	Zci_06056	0.5561
10	Zci_06066	0.3724
10	Zci_06069	0.5677
10	Zci_06073	0.1178
10	Zci_06172	0.1679
10	Zci_06177	0.3727
10	Zci_06185	0.5193
10	Zci_06221	0.5640
10	Zci_06294	0.2135
10	Zci_06295	0.1230
10	Zci_06300	0.5699
10	Zci_06307	0.2961
10	Zci_06373	0.4851
10	Zci_06390	0.4608
10	Zci_06440	0.2435
10	Zci_06523	0.3479
10	Zci_06526	0.2073
10	Zci_06641	0.2938
10	Zci_06741	0.4618
10	Zci_06787	0.5616
10	Zci_06817	0.5950
10	Zci_06836	0.5073
10	Zci_06846	0.3510
10	Zci_06952	0.4984
10	Zci_06970	0.3328
10	Zci_07010	0.4681
10	Zci_07018	0.2578
10	Zci_07247	0.5456
10	Zci_07278	0.5576
10	Zci_07536	0.5681
10	Zci_07565	0.5602
10	Zci_07619	0.4748
10	Zci_07679	0.4889
10	Zci_07737	0.5834
10	Zci_07739	0.5822
10	Zci_07745	0.6011
10	Zci_07751	0.3824
10	Zci_07756	0.5450
10	Zci_07833	0.6197
10	Zci_07835	0.2942
10	Zci_07836	0.6063
10	Zci_07862	0.5685
10	Zci_07956	0.3946
10	Zci_08020	0.4476
10	Zci_08051	0.4348
10	Zci_08059	0.6081
10	Zci_08104	0.0884
10	Zci_08108	0.5770
10	Zci_08222	0.3353
10	Zci_08239	0.5369
10	Zci_08260	0.5384
10	Zci_08266	0.6039
10	Zci_08287	0.6151
10	Zci_08323	0.5592
10	Zci_08367	0.3205
10	Zci_08451	0.2081
10	Zci_08460	0.5962
10	Zci_08543	0.4784
10	Zci_08548	0.5795
10	Zci_08660	0.4657
10	Zci_08700	0.4132
10	Zci_08717	0.4993
10	Zci_08759	0.4860
10	Zci_08824	0.4095
10	Zci_08872	0.4798
10	Zci_08880	0.4944
10	Zci_08918	0.5474
10	Zci_09079	0.5863
10	Zci_09105	0.5072
10	Zci_09121	0.5581
10	Zci_09175	0.4286
10	Zci_09178	0.5583
10	Zci_09327	0.1795
10	Zci_09493	0.4201
10	Zci_09498	0.4905
10	Zci_09614	0.2282
10	Zci_09639	0.5440
10	Zci_09644	0.5809
10	Zci_09655	0.3518
10	Zci_09678	0.3616
10	Zci_09916	0.4337
10	Zci_09922	0.1445
10	Zci_09960	0.2772
10	Zci_09969	0.5296
10	Zci_09986	0.5579
10	Zci_10070	0.3678
10	Zci_10363	0.4790
10	Zci_10379	0.2980
10	Zci_10392	0.4323
10	Zci_10438	0.1432
10	Zci_10480	0.4003
10	Zci_10757	0.1314
10	Zci_10808	0.2644
10	Zci_10819	0.5820
10	Zci_10820	0.5757
10	Zci_10835	0.2894
10	Zci_10949	0.4839
10	Zci_10951	0.5369
10	Zci_10961	0.3148
10	Zci_10989	0.5269
10	Zci_11013	0.5001
10	Zci_11021	0.4855
10	Zci_11023	0.2387
10	Zci_11024	0.6039
10	Zci_11056	0.1949
10	Zci_11069	0.4521
10	Zci_11077	0.3920
10	Zci_11081	0.2365
10	Zci_11138	0.5988
10	Zci_11144	0.4690
10	Zci_11354	0.4793
10	Zci_11372	0.4557
10	Zci_11397	0.3590
10	Zci_11406	0.6078
10	Zci_11427	0.4343
10	Zci_11429	0.5350
10	Zci_11473	0.5133
10	Zci_11474	0.6236
10	Zci_11534	0.2691
10	Zci_11548	0.3423
10	Zci_11576	0.5898
10	Zci_11585	0.3187
10	Zci_11593	0.2320
10	Zci_11741	0.2341
10	Zci_11757	0.4804
10	Zci_11835	0.6191
10	Zci_11847	0.3809
10	Zci_11864	0.5295
10	Zci_11865	0.5785
10	Zci_11873	0.4036
10	Zci_11889	0.5221
10	Zci_11897	0.4327
10	Zci_11919	0.5476
10	Zci_11992	0.5209
10	Zci_12016	0.5157
10	Zci_12323	0.5946
10	Zci_12345	0.1522
10	Zci_12347	0.6026
10	Zci_12463	0.3512
10	Zci_12483	0.5642
10	Zci_12551	0.4789
10	Zci_12593	0.4026
10	Zci_12631	0.4738
10	Zci_12760	0.5909
10	Zci_12835	0.3991
10	Zci_12916	0.5897
10	Zci_12918	0.3907
10	Zci_12951	0.2381
10	Zci_12980	0.5618
10	Zci_13043	0.6000
10	Zci_13047	0.2273
10	Zci_13055	0.6012
10	Zci_13084	0.3656
10	Zci_13118	0.5483
10	Zci_13130	0.5708
10	Zci_13140	0.4186
10	Zci_13177	0.5685
10	Zci_13189	0.5344
10	Zci_13192	0.5827
10	Zci_13201	0.6090
10	Zci_13204	0.5905
10	Zci_13259	0.2054
10	Zci_13323	0.5190
10	Zci_13368	0.4857
10	Zci_13370	0.5044
10	Zci_13408	0.4313
10	Zci_13409	0.2891
10	Zci_13452	0.2822
10	Zci_13464	0.5557
10	Zci_13472	0.2942
10	Zci_13476	0.4480
10	Zci_13503	0.2991
10	Zci_13507	0.6076
10	Zci_13533	0.5742
10	Zci_13745	0.0783
10	Zci_13818	0.5631
10	Zci_13955	0.5436
10	Zci_13973	0.5314
10	Zci_14048	0.5354
10	Zci_14322	0.5425
10	Zci_14334	0.1815
10	Zci_14476	0.5497
10	Zci_14513	0.3786
10	Zci_14578	0.5684
10	Zci_14579	0.5583
10	Zci_14661	0.5711
10	Zci_14691	0.4362
10	Zci_14858	0.5599
10	Zci_14885	0.5691
10	Zci_14937	0.2659
10	Zci_14976	0.3983
10	Zci_15082	0.5906
10	Zci_15169	0.5834
10	Zci_15170	0.3168
10	Zci_15178	0.4829
10	Zci_15256	0.3767
10	Zci_15269	0.5818
10	Zci_15272	0.5406
10	Zci_15330	0.4435
10	Zci_15332	0.1486
10	Zci_15419	0.4304
10	Zci_15426	0.5886
10	Zci_15629	0.3866
10	Zci_15645	0.3910
10	Zci_15653	0.5730
10	Zci_15656	0.2698
10	Zci_15667	0.5252
10	Zci_15788	0.2478
10	Zci_15838	0.4619
10	Zci_15880	0.3687
10	Zci_15890	0.6196
10	Zci_15913	0.4679
10	Zci_15926	0.3561
10	Zci_16420	0.5216
10	Zci_16469	0.5926
10	Zci_16475	0.2303
10	Zci_16532	0.3752
10	Zci_16533	0.0258
10	Zci_16563	0.5345
10	Zci_16610	0.6084
11	Zci_00145	0.4566
11	Zci_00455	0.4856
11	Zci_00595	0.4634
11	Zci_01168	0.4079
11	Zci_01267	0.4890
11	Zci_01466	0.3550
11	Zci_01492	0.4674
11	Zci_01510	0.4483
11	Zci_01633	0.4080
11	Zci_01978	0.2785
11	Zci_02163	0.4574
11	Zci_02211	0.3727
11	Zci_02216	0.4710
11	Zci_02280	0.4227
11	Zci_02516	0.2350
11	Zci_02678	0.3607
11	Zci_02704	0.4627
11	Zci_02779	0.4465
11	Zci_02791	0.4769
11	Zci_02875	0.4972
11	Zci_02911	0.3704
11	Zci_02932	0.4759
11	Zci_02935	0.4251
11	Zci_02951	0.4571
11	Zci_03044	0.4674
11	Zci_03087	0.4161
11	Zci_03166	0.3579
11	Zci_03184	0.4065
11	Zci_03197	0.4036
11	Zci_03408	0.4174
11	Zci_03443	0.4679
11	Zci_03487	0.4805
11	Zci_03530	0.4651
11	Zci_03841	0.3069
11	Zci_04108	0.3945
11	Zci_04296	0.4960
11	Zci_04321	0.4780
11	Zci_04376	0.4144
11	Zci_04380	0.3467
11	Zci_04946	0.3670
11	Zci_04965	0.5063
11	Zci_05289	0.4762
11	Zci_05418	0.3722
11	Zci_05445	0.3332
11	Zci_05693	0.4421
11	Zci_05767	0.3998
11	Zci_06102	0.2984
11	Zci_06118	0.4623
11	Zci_06187	0.4779
11	Zci_06349	0.4728
11	Zci_06450	0.3650
11	Zci_06504	0.4338
11	Zci_06506	0.2739
11	Zci_06645	0.4525
11	Zci_06676	0.4878
11	Zci_06997	0.1953
11	Zci_07386	0.4975
11	Zci_07504	0.3039
11	Zci_08001	0.5034
11	Zci_08094	0.4311
11	Zci_08128	0.4980
11	Zci_08385	0.4259
11	Zci_08572	0.4770
11	Zci_08950	0.3572
11	Zci_09048	0.4032
11	Zci_09102	0.3985
11	Zci_09224	0.4669
11	Zci_09282	0.2887
11	Zci_09313	0.4397
11	Zci_09510	0.3944
11	Zci_09600	0.3998
11	Zci_09838	0.2801
11	Zci_10033	0.4623
11	Zci_10039	0.4863
11	Zci_10094	0.4263
11	Zci_10332	0.5074
11	Zci_10411	0.4219
11	Zci_10554	0.4899
11	Zci_10636	0.4885
11	Zci_10868	0.4696
11	Zci_10899	0.5022
11	Zci_11120	0.5009
11	Zci_11373	0.3949
11	Zci_11468	0.3482
11	Zci_11743	0.4657
11	Zci_11937	0.3788
11	Zci_11985	0.3098
11	Zci_11986	0.4824
11	Zci_12039	0.4314
11	Zci_12221	0.4373
11	Zci_12357	0.4246
11	Zci_12708	0.4842
11	Zci_12780	0.4129
11	Zci_13031	0.2741
11	Zci_13092	0.4763
11	Zci_13243	0.3436
11	Zci_13378	0.4503
11	Zci_13471	0.1996
11	Zci_13888	0.4472
11	Zci_14063	0.4563
11	Zci_14350	0.4579
11	Zci_14422	0.4610
11	Zci_14466	0.4379
11	Zci_14531	0.4757
11	Zci_14540	0.4299
11	Zci_14646	0.4167
11	Zci_15190	0.4772
11	Zci_15433	0.4759
11	Zci_15818	0.4152
11	Zci_16302	0.4496
11	Zci_16369	0.3432
11	Zci_16451	0.2562
11	Zci_16480	0.4506
12	Zci_00440	0.4737
12	Zci_00573	0.3626
12	Zci_00612	0.3515
12	Zci_00780	0.3093
12	Zci_00934	0.3588
12	Zci_01044	0.3371
12	Zci_01118	0.2834
12	Zci_01388	0.4350
12	Zci_01543	0.4151
12	Zci_01554	0.3879
12	Zci_01572	0.4429
12	Zci_01729	0.3395
12	Zci_01737	0.5178
12	Zci_01790	0.3286
12	Zci_01840	0.4717
12	Zci_02044	0.4128
12	Zci_02190	0.4860
12	Zci_02249	0.3958
12	Zci_02262	0.2679
12	Zci_02744	0.4800
12	Zci_02882	0.4000
12	Zci_02892	0.4559
12	Zci_02963	0.4794
12	Zci_03226	0.4633
12	Zci_03393	0.3512
12	Zci_03489	0.3756
12	Zci_03500	0.4362
12	Zci_03574	0.2994
12	Zci_03595	0.1772
12	Zci_04232	0.3630
12	Zci_04333	0.4974
12	Zci_04479	0.4102
12	Zci_04481	0.4900
12	Zci_04551	0.4676
12	Zci_04710	0.2886
12	Zci_04913	0.5100
12	Zci_04994	0.3021
12	Zci_05168	0.3830
12	Zci_05247	0.3875
12	Zci_05271	0.2848
12	Zci_05491	0.4298
12	Zci_05680	0.2341
12	Zci_05754	0.4488
12	Zci_05831	0.3028
12	Zci_05916	0.4960
12	Zci_05983	0.4207
12	Zci_05987	0.2697
12	Zci_06020	0.4518
12	Zci_06114	0.4301
12	Zci_06226	0.3964
12	Zci_06342	0.2240
12	Zci_06391	0.2146
12	Zci_06425	0.4602
12	Zci_06522	0.5013
12	Zci_06586	0.3769
12	Zci_06696	0.3404
12	Zci_06738	0.4989
12	Zci_06854	0.4397
12	Zci_06878	0.2582
12	Zci_06881	0.3845
12	Zci_06988	0.4828
12	Zci_07012	0.4508
12	Zci_07062	0.3588
12	Zci_07286	0.2363
12	Zci_07326	0.4869
12	Zci_07494	0.3967
12	Zci_07695	0.4023
12	Zci_07983	0.2021
12	Zci_08180	0.3301
12	Zci_08373	0.2116
12	Zci_08768	0.2126
12	Zci_08813	0.3844
12	Zci_09279	0.3753
12	Zci_09733	0.5035
12	Zci_09783	0.2746
12	Zci_09877	0.3985
12	Zci_10014	0.3363
12	Zci_10242	0.4692
12	Zci_10248	0.2517
12	Zci_10421	0.3112
12	Zci_10486	0.3779
12	Zci_10558	0.3027
12	Zci_10913	0.3506
12	Zci_11041	0.4675
12	Zci_11059	0.4480
12	Zci_11498	0.5027
12	Zci_11500	0.3863
12	Zci_11803	0.4969
12	Zci_11959	0.2344
12	Zci_11976	0.3879
12	Zci_11980	0.1910
12	Zci_12003	0.0965
12	Zci_12101	0.3913
12	Zci_12167	0.4794
12	Zci_12210	0.3547
12	Zci_12214	0.2565
12	Zci_12519	0.3139
12	Zci_12620	0.3519
12	Zci_12752	0.3333
12	Zci_13691	0.2007
12	Zci_13764	0.3131
12	Zci_13766	0.2745
12	Zci_13782	0.4558
12	Zci_14390	0.2659
12	Zci_14396	0.5077
12	Zci_14462	0.3597
12	Zci_14557	0.1639
12	Zci_14739	0.4445
12	Zci_14842	0.4728
12	Zci_14890	0.4925
12	Zci_14980	0.3448
12	Zci_15016	0.2538
12	Zci_15019	0.3981
12	Zci_15249	0.4797
12	Zci_15755	0.3834
12	Zci_15787	0.3936
12	Zci_15929	0.2903
12	Zci_16540	0.2210
12	Zci_16567	0.4544
13	Zci_00400	0.5882
13	Zci_00502	0.4695
13	Zci_00598	0.5757
13	Zci_00723	0.4369
13	Zci_00786	0.5245
13	Zci_01374	0.5585
13	Zci_01765	0.6034
13	Zci_01800	0.5268
13	Zci_01814	0.2277
13	Zci_01886	0.6302
13	Zci_02078	0.4217
13	Zci_02100	0.5589
13	Zci_02101	0.5725
13	Zci_02159	0.4862
13	Zci_02162	0.4859
13	Zci_02245	0.6160
13	Zci_02314	0.6225
13	Zci_02339	0.5790
13	Zci_02468	0.3361
13	Zci_02595	0.6015
13	Zci_02815	0.5703
13	Zci_02841	0.4714
13	Zci_02929	0.2739
13	Zci_03055	0.3033
13	Zci_03201	0.3421
13	Zci_03287	0.2489
13	Zci_03318	0.5734
13	Zci_03764	0.4355
13	Zci_03849	0.2427
13	Zci_04064	0.4844
13	Zci_04127	0.1928
13	Zci_04241	0.6382
13	Zci_04375	0.3531
13	Zci_04491	0.4540
13	Zci_05011	0.4390
13	Zci_05079	0.4231
13	Zci_05098	0.4367
13	Zci_05272	0.4504
13	Zci_05395	0.6000
13	Zci_05522	0.5813
13	Zci_05572	0.3295
13	Zci_05936	0.5975
13	Zci_05975	0.5310
13	Zci_05982	0.4619
13	Zci_06199	0.4494
13	Zci_07030	0.6247
13	Zci_07073	0.6085
13	Zci_07187	0.2407
13	Zci_07702	0.4175
13	Zci_07915	0.5730
13	Zci_08171	0.4401
13	Zci_08333	0.5281
13	Zci_08604	0.5194
13	Zci_09193	0.0901
13	Zci_09654	0.4793
13	Zci_09999	0.5381
13	Zci_10361	0.3078
13	Zci_10401	0.5971
13	Zci_10571	0.4230
13	Zci_10944	0.2334
13	Zci_11040	0.5096
13	Zci_11125	0.4993
13	Zci_11163	0.1893
13	Zci_11292	0.1151
13	Zci_11356	0.3570
13	Zci_11476	0.2000
13	Zci_11535	0.3937
13	Zci_11651	0.1828
13	Zci_12132	0.6224
13	Zci_12147	0.5800
13	Zci_12153	0.4335
13	Zci_12307	0.1418
13	Zci_12326	0.1010
13	Zci_12891	0.4862
13	Zci_13029	0.3159
13	Zci_13816	0.4744
13	Zci_13853	0.1279
13	Zci_14176	0.5540
13	Zci_14346	0.5199
13	Zci_14443	0.5640
13	Zci_14460	0.3884
13	Zci_14561	0.1907
13	Zci_14747	0.5955
13	Zci_15343	0.2999
13	Zci_15406	0.1930
13	Zci_15594	0.6124
13	Zci_15893	0.4500
13	Zci_16615	0.5300
14	Zci_00104	0.2652
14	Zci_00127	0.5412
14	Zci_00158	0.4491
14	Zci_00170	0.6522
14	Zci_00173	0.3124
14	Zci_00403	0.4183
14	Zci_00528	0.6763
14	Zci_00616	0.5137
14	Zci_00766	0.5710
14	Zci_00769	0.4332
14	Zci_00783	0.6066
14	Zci_00825	0.3128
14	Zci_00850	0.6599
14	Zci_00889	0.0383
14	Zci_00979	0.6786
14	Zci_01365	0.5677
14	Zci_01373	0.4011
14	Zci_01443	0.5541
14	Zci_01488	0.6437
14	Zci_01503	0.6455
14	Zci_01671	0.6037
14	Zci_01673	0.6365
14	Zci_01751	0.1662
14	Zci_01772	0.6045
14	Zci_01808	0.5473
14	Zci_01817	0.5920
14	Zci_02035	0.6611
14	Zci_02054	0.5615
14	Zci_02056	0.2776
14	Zci_02108	0.6713
14	Zci_02116	0.6415
14	Zci_02234	0.5563
14	Zci_02357	0.6493
14	Zci_02401	0.5695
14	Zci_02432	0.6344
14	Zci_02465	0.3139
14	Zci_02638	0.5104
14	Zci_02676	0.4318
14	Zci_02710	0.6762
14	Zci_02745	0.5641
14	Zci_02770	0.2097
14	Zci_02881	0.1750
14	Zci_02890	0.4127
14	Zci_02921	0.2675
14	Zci_02999	0.4513
14	Zci_03039	0.5215
14	Zci_03186	0.6827
14	Zci_03195	0.5624
14	Zci_03297	0.6579
14	Zci_03308	0.5262
14	Zci_03315	0.4618
14	Zci_03361	0.6798
14	Zci_03364	0.5741
14	Zci_03398	0.6495
14	Zci_03410	0.3484
14	Zci_03448	0.6585
14	Zci_03575	0.3763
14	Zci_03740	0.3472
14	Zci_03844	0.6054
14	Zci_03921	0.5543
14	Zci_04074	0.6536
14	Zci_04158	0.6530
14	Zci_04242	0.0125
14	Zci_04261	0.4264
14	Zci_04346	0.6040
14	Zci_04370	0.2943
14	Zci_04402	0.2752
14	Zci_04488	0.6150
14	Zci_04589	0.1278
14	Zci_04609	0.6412
14	Zci_04662	0.4413
14	Zci_04734	0.5834
14	Zci_04786	0.5125
14	Zci_04792	0.3734
14	Zci_04794	0.6325
14	Zci_04796	0.4184
14	Zci_04827	0.6231
14	Zci_04898	0.6042
14	Zci_04952	0.5436
14	Zci_05031	0.3564
14	Zci_05063	0.5724
14	Zci_05186	0.3421
14	Zci_05251	0.1524
14	Zci_05361	0.5356
14	Zci_05367	0.3659
14	Zci_05410	0.4951
14	Zci_05468	0.5745
14	Zci_05502	0.2068
14	Zci_05520	0.6817
14	Zci_05586	0.3162
14	Zci_05653	0.4205
14	Zci_05745	0.6724
14	Zci_05751	0.2896
14	Zci_05764	0.2903
14	Zci_05846	0.6686
14	Zci_05867	0.5421
14	Zci_05937	0.5008
14	Zci_05959	0.5643
14	Zci_06000	0.6335
14	Zci_06010	0.4946
14	Zci_06081	0.2368
14	Zci_06174	0.5828
14	Zci_06236	0.5840
14	Zci_06299	0.6525
14	Zci_06318	0.3309
14	Zci_06319	0.5545
14	Zci_06336	0.1918
14	Zci_06340	0.5549
14	Zci_06369	0.2986
14	Zci_06426	0.3659
14	Zci_06492	0.4842
14	Zci_06524	0.6613
14	Zci_06566	0.3550
14	Zci_06694	0.6271
14	Zci_06753	0.5336
14	Zci_06917	0.6794
14	Zci_07037	0.5274
14	Zci_07058	0.6743
14	Zci_07097	0.5891
14	Zci_07124	0.3548
14	Zci_07156	0.4490
14	Zci_07198	0.2241
14	Zci_07285	0.3626
14	Zci_07318	0.5200
14	Zci_07333	0.6738
14	Zci_07354	0.4533
14	Zci_07456	0.4821
14	Zci_07463	0.4381
14	Zci_07560	0.1621
14	Zci_07618	0.4937
14	Zci_07691	0.6406
14	Zci_07711	0.6382
14	Zci_07732	0.0807
14	Zci_07904	0.5318
14	Zci_07976	0.6517
14	Zci_08040	0.4027
14	Zci_08056	0.6418
14	Zci_08213	0.3510
14	Zci_08224	0.4905
14	Zci_08230	0.4297
14	Zci_08400	0.5992
14	Zci_08406	0.4463
14	Zci_08408	0.5231
14	Zci_08450	0.3418
14	Zci_08591	0.5772
14	Zci_08725	0.6154
14	Zci_08974	0.5311
14	Zci_09109	0.1406
14	Zci_09149	0.4534
14	Zci_09161	0.3878
14	Zci_09242	0.6743
14	Zci_09252	0.4432
14	Zci_09268	0.4493
14	Zci_09395	0.4226
14	Zci_09452	0.6823
14	Zci_09542	0.6647
14	Zci_09546	0.1592
14	Zci_09618	0.6682
14	Zci_09683	0.1530
14	Zci_09792	0.6227
14	Zci_09822	0.6374
14	Zci_09828	0.3558
14	Zci_09886	0.3989
14	Zci_09888	0.6452
14	Zci_10085	0.3948
14	Zci_10139	0.5945
14	Zci_10172	0.5270
14	Zci_10269	0.2762
14	Zci_10347	0.1182
14	Zci_10409	0.5883
14	Zci_10415	0.3459
14	Zci_10711	0.6746
14	Zci_10714	0.2474
14	Zci_10723	0.1610
14	Zci_10843	0.6673
14	Zci_10943	0.5775
14	Zci_11426	0.5157
14	Zci_11470	0.2062
14	Zci_11879	0.6712
14	Zci_12230	0.6123
14	Zci_12362	0.4842
14	Zci_12414	0.6389
14	Zci_12508	0.5341
14	Zci_12734	0.6335
14	Zci_12747	0.3163
14	Zci_12794	0.3077
14	Zci_12797	0.4206
14	Zci_12892	0.6285
14	Zci_12904	0.2929
14	Zci_13051	0.3533
14	Zci_13376	0.6821
14	Zci_13385	0.6236
14	Zci_13489	0.6183
14	Zci_13647	0.6463
14	Zci_13660	0.4698
14	Zci_13959	0.4071
14	Zci_14394	0.5523
14	Zci_14419	0.6481
14	Zci_14442	0.5924
14	Zci_14484	0.4710
14	Zci_14629	0.5832
14	Zci_14719	0.4506
14	Zci_14723	0.6746
14	Zci_14753	0.6622
14	Zci_14874	0.3713
14	Zci_15196	0.3586
14	Zci_15225	0.3944
14	Zci_15283	0.5611
14	Zci_15688	0.1127
14	Zci_15784	0.6602
14	Zci_15794	0.2602
14	Zci_16449	0.5296
14	Zci_16494	0.6004
14	Zci_16565	0.2681
