moduleColors	Count
turquoise	2092
blue	1459
brown	1357
yellow	1001
green	952
red	885
black	840
pink	793
magenta	711
purple	637
greenyellow	617
tan	448
salmon	436
cyan	382
midnightblue	370
lightcyan	326
grey60	322
lightgreen	299
lightyellow	297
royalblue	283
grey	261
darkred	236
darkgreen	193
darkturquoise	154
darkgrey	128
orange	89
darkorange	77
white	67
skyblue	66
