Description	time	Count
shade avoidance	0.25	1
entrainment of circadian clock	0.25	1
skotomorphogenesis	0.25	1
response to red or far red light	0.25	1
anthocyanin-containing compound metabolic process	0.25	1
flavonoid metabolic process	0.25	1
response to absence of light	0.25	1
regulation of circadian rhythm	0.25	1
photomorphogenesis	0.25	1
photoperiodism, flowering	0.25	1
circadian rhythm	0.25	1
photoperiodism	0.25	1
response to light intensity	0.25	1
pigment metabolic process	0.25	1
response to red light	0.25	1
regulation of stomatal movement	0.25	1
response to toxic substance	0.25	1
response to hydrogen peroxide	0.25	1
glycogen biosynthetic process	0.25	1
ammonium transmembrane transport	0.25	1
shade avoidance	0.5	4
entrainment of circadian clock	0.5	3
skotomorphogenesis	0.5	3
response to red or far red light	0.5	6
anthocyanin-containing compound metabolic process	0.5	3
flavonoid metabolic process	0.5	3
response to absence of light	0.5	3
regulation of circadian rhythm	0.5	3
photomorphogenesis	0.5	3
photoperiodism, flowering	0.5	3
circadian rhythm	0.5	3
photoperiodism	0.5	3
response to light intensity	0.5	4
pigment metabolic process	0.5	3
response to red light	0.5	3
regulation of stomatal movement	0.5	1
response to toxic substance	0.5	1
response to hydrogen peroxide	0.5	1
glycogen biosynthetic process	0.5	1
ammonium transmembrane transport	0.5	1
shade avoidance	1	5
entrainment of circadian clock	1	4
skotomorphogenesis	1	4
response to red or far red light	1	9
anthocyanin-containing compound metabolic process	1	4
flavonoid metabolic process	1	4
response to absence of light	1	4
regulation of circadian rhythm	1	4
photomorphogenesis	1	4
photoperiodism, flowering	1	4
circadian rhythm	1	4
photoperiodism	1	4
response to light intensity	1	8
pigment metabolic process	1	4
response to red light	1	4
regulation of stomatal movement	1	5
response to toxic substance	1	6
response to hydrogen peroxide	1	4
glycogen biosynthetic process	1	1
ammonium transmembrane transport	1	1
shade avoidance	2	5
entrainment of circadian clock	2	1
skotomorphogenesis	2	1
response to red or far red light	2	1
anthocyanin-containing compound metabolic process	2	1
flavonoid metabolic process	2	1
response to absence of light	2	1
regulation of circadian rhythm	2	1
photomorphogenesis	2	1
photoperiodism, flowering	2	1
circadian rhythm	2	1
photoperiodism	2	1
response to light intensity	2	1
pigment metabolic process	2	1
response to red light	2	1
regulation of stomatal movement	2	1
response to toxic substance	2	1
response to hydrogen peroxide	2	1
glycogen biosynthetic process	2	6
ammonium transmembrane transport	2	5
shade avoidance	4	8
entrainment of circadian clock	4	5
skotomorphogenesis	4	6
response to red or far red light	4	30
anthocyanin-containing compound metabolic process	4	1
flavonoid metabolic process	4	1
response to absence of light	4	7
regulation of circadian rhythm	4	1
photomorphogenesis	4	1
photoperiodism, flowering	4	1
circadian rhythm	4	1
photoperiodism	4	1
response to light intensity	4	31
pigment metabolic process	4	1
response to red light	4	20
regulation of stomatal movement	4	19
response to toxic substance	4	17
response to hydrogen peroxide	4	10
glycogen biosynthetic process	4	7
ammonium transmembrane transport	4	5
