nodeName	altName	nodeAttr[nodesPresent, ]
Pp3c1_10000V3	NA	yellow
Pp3c1_10530V3	NA	yellow
Pp3c1_10880V3	NA	yellow
Pp3c1_11820V3	NA	yellow
Pp3c1_11980V3	NA	yellow
Pp3c1_12120V3	NA	yellow
Pp3c1_12630V3	NA	yellow
Pp3c1_13050V3	NA	yellow
Pp3c1_1320V3	NA	yellow
Pp3c1_13260V3	NA	yellow
Pp3c1_13308V3	NA	yellow
Pp3c1_14760V3	NA	yellow
Pp3c1_15060V3	NA	yellow
Pp3c1_1570V3	NA	yellow
Pp3c1_17860V3	NA	yellow
Pp3c1_18520V3	NA	yellow
Pp3c1_19200V3	NA	yellow
Pp3c1_19950V3	NA	yellow
Pp3c1_200V3	NA	yellow
Pp3c1_20640V3	NA	yellow
Pp3c1_21000V3	NA	yellow
Pp3c1_21200V3	NA	yellow
Pp3c1_21290V3	NA	yellow
Pp3c1_21970V3	NA	yellow
Pp3c1_22820V3	NA	yellow
Pp3c1_23460V3	NA	yellow
Pp3c1_24440V3	NA	yellow
Pp3c1_25280V3	NA	yellow
Pp3c1_25640V3	NA	yellow
Pp3c1_26740V3	NA	yellow
Pp3c1_27050V3	NA	yellow
Pp3c1_2710V3	NA	yellow
Pp3c1_27510V3	NA	yellow
Pp3c1_27870V3	NA	yellow
Pp3c1_29500V3	NA	yellow
Pp3c1_29590V3	NA	yellow
Pp3c1_29840V3	NA	yellow
Pp3c1_30428V3	NA	yellow
Pp3c1_30790V3	NA	yellow
Pp3c1_31360V3	NA	yellow
Pp3c1_31970V3	NA	yellow
Pp3c1_32200V3	NA	yellow
Pp3c1_32520V3	NA	yellow
Pp3c1_32960V3	NA	yellow
Pp3c1_34050V3	NA	yellow
Pp3c1_34100V3	NA	yellow
Pp3c1_34170V3	NA	yellow
Pp3c1_34240V3	NA	yellow
Pp3c1_34680V3	NA	yellow
Pp3c1_35120V3	NA	yellow
Pp3c1_35180V3	NA	yellow
Pp3c1_3520V3	NA	yellow
Pp3c1_37620V3	NA	yellow
Pp3c1_37680V3	NA	yellow
Pp3c1_38670V3	NA	yellow
Pp3c1_39540V3	NA	yellow
Pp3c1_39760V3	NA	yellow
Pp3c1_40230V3	NA	yellow
Pp3c1_40610V3	NA	yellow
Pp3c1_4140V3	NA	yellow
Pp3c1_42760V3	NA	yellow
Pp3c1_580V3	NA	yellow
Pp3c1_5850V3	NA	yellow
Pp3c1_5860V3	NA	yellow
Pp3c1_6350V3	NA	yellow
Pp3c1_6410V3	NA	yellow
Pp3c1_6570V3	NA	yellow
Pp3c1_6950V3	NA	yellow
Pp3c1_7730V3	NA	yellow
Pp3c1_8080V3	NA	yellow
Pp3c10_10200V3	NA	yellow
Pp3c10_10520V3	NA	yellow
Pp3c10_10850V3	NA	yellow
Pp3c10_11200V3	NA	yellow
Pp3c10_12340V3	NA	yellow
Pp3c10_12900V3	NA	yellow
Pp3c10_13030V3	NA	yellow
Pp3c10_13560V3	NA	yellow
Pp3c10_14070V3	NA	yellow
Pp3c10_14480V3	NA	yellow
Pp3c10_14490V3	NA	yellow
Pp3c10_14520V3	NA	yellow
Pp3c10_15920V3	NA	yellow
Pp3c10_16390V3	NA	yellow
Pp3c10_17260V3	NA	yellow
Pp3c10_18090V3	NA	yellow
Pp3c10_18330V3	NA	yellow
Pp3c10_18860V3	NA	yellow
Pp3c10_19190V3	NA	yellow
Pp3c10_19650V3	NA	yellow
Pp3c10_19740V3	NA	yellow
Pp3c10_19880V3	NA	yellow
Pp3c10_200V3	NA	yellow
Pp3c10_22890V3	NA	yellow
Pp3c10_23170V3	NA	yellow
Pp3c10_23960V3	NA	yellow
Pp3c10_25470V3	NA	yellow
Pp3c10_2580V3	NA	yellow
Pp3c10_2812V3	NA	yellow
Pp3c10_3220V3	NA	yellow
Pp3c10_3580V3	NA	yellow
Pp3c10_5000V3	NA	yellow
Pp3c10_6100V3	NA	yellow
Pp3c10_7770V3	NA	yellow
Pp3c10_8620V3	NA	yellow
Pp3c10_9500V3	NA	yellow
Pp3c10_9750V3	NA	yellow
Pp3c11_12080V3	NA	yellow
Pp3c11_12200V3	NA	yellow
Pp3c11_12280V3	NA	yellow
Pp3c11_12640V3	NA	yellow
Pp3c11_14047V3	NA	yellow
Pp3c11_14630V3	NA	yellow
Pp3c11_14980V3	NA	yellow
Pp3c11_15050V3	NA	yellow
Pp3c11_15230V3	NA	yellow
Pp3c11_15430V3	NA	yellow
Pp3c11_15470V3	NA	yellow
Pp3c11_15500V3	NA	yellow
Pp3c11_15530V3	NA	yellow
Pp3c11_16390V3	NA	yellow
Pp3c11_16910V3	NA	yellow
Pp3c11_17230V3	NA	yellow
Pp3c11_19220V3	NA	yellow
Pp3c11_19370V3	NA	yellow
Pp3c11_19790V3	NA	yellow
Pp3c11_21790V3	NA	yellow
Pp3c11_2200V3	NA	yellow
Pp3c11_22390V3	NA	yellow
Pp3c11_22710V3	NA	yellow
Pp3c11_22850V3	NA	yellow
Pp3c11_23030V3	NA	yellow
Pp3c11_24130V3	NA	yellow
Pp3c11_24210V3	NA	yellow
Pp3c11_24600V3	NA	yellow
Pp3c11_25510V3	NA	yellow
Pp3c11_26010V3	NA	yellow
Pp3c11_26420V3	NA	yellow
Pp3c11_30V3	NA	yellow
Pp3c11_3860V3	NA	yellow
Pp3c11_5070V3	NA	yellow
Pp3c11_5330V3	NA	yellow
Pp3c11_5570V3	NA	yellow
Pp3c11_5590V3	NA	yellow
Pp3c11_6080V3	NA	yellow
Pp3c11_6630V3	NA	yellow
Pp3c11_7520V3	NA	yellow
Pp3c11_7990V3	NA	yellow
Pp3c11_800V3	NA	yellow
Pp3c11_8660V3	NA	yellow
Pp3c11_8830V3	NA	yellow
Pp3c11_8930V3	NA	yellow
Pp3c11_9750V3	NA	yellow
Pp3c12_10340V3	NA	yellow
Pp3c12_11660V3	NA	yellow
Pp3c12_12300V3	NA	yellow
Pp3c12_12500V3	NA	yellow
Pp3c12_13990V3	NA	yellow
Pp3c12_14020V3	NA	yellow
Pp3c12_14230V3	NA	yellow
Pp3c12_14240V3	NA	yellow
Pp3c12_14710V3	NA	yellow
Pp3c12_15000V3	NA	yellow
Pp3c12_15800V3	NA	yellow
Pp3c12_15820V3	NA	yellow
Pp3c12_1600V3	NA	yellow
Pp3c12_16113V3	NA	yellow
Pp3c12_16590V3	NA	yellow
Pp3c12_17610V3	NA	yellow
Pp3c12_17860V3	NA	yellow
Pp3c12_1790V3	NA	yellow
Pp3c12_18499V3	NA	yellow
Pp3c12_19290V3	NA	yellow
Pp3c12_19370V3	NA	yellow
Pp3c12_210V3	NA	yellow
Pp3c12_21290V3	NA	yellow
Pp3c12_22220V3	NA	yellow
Pp3c12_23050V3	NA	yellow
Pp3c12_2376V3	NA	yellow
Pp3c12_23920V3	NA	yellow
Pp3c12_25210V3	NA	yellow
Pp3c12_25430V3	NA	yellow
Pp3c12_25460V3	NA	yellow
Pp3c12_2550V3	NA	yellow
Pp3c12_25780V3	NA	yellow
Pp3c12_26220V3	NA	yellow
Pp3c12_4000V3	NA	yellow
Pp3c12_4670V3	NA	yellow
Pp3c12_5770V3	NA	yellow
Pp3c12_7180V3	NA	yellow
Pp3c12_8620V3	NA	yellow
Pp3c12_8680V3	NA	yellow
Pp3c12_8840V3	NA	yellow
Pp3c12_9510V3	NA	yellow
Pp3c13_10540V3	NA	yellow
Pp3c13_10830V3	NA	yellow
Pp3c13_10930V3	NA	yellow
Pp3c13_11150V3	NA	yellow
Pp3c13_11630V3	NA	yellow
Pp3c13_11820V3	NA	yellow
Pp3c13_11920V3	NA	yellow
Pp3c13_12320V3	NA	yellow
Pp3c13_1370V3	NA	yellow
Pp3c13_13820V3	NA	yellow
Pp3c13_14240V3	NA	yellow
Pp3c13_15090V3	NA	yellow
Pp3c13_15786V3	NA	yellow
Pp3c13_15800V3	NA	yellow
Pp3c13_15990V3	NA	yellow
Pp3c13_16000V3	NA	yellow
Pp3c13_16130V3	NA	yellow
Pp3c13_17250V3	NA	yellow
Pp3c13_17710V3	NA	yellow
Pp3c13_190V3	NA	yellow
Pp3c13_20209V3	NA	yellow
Pp3c13_20960V3	NA	yellow
Pp3c13_21070V3	NA	yellow
Pp3c13_21311V3	NA	yellow
Pp3c13_21730V3	NA	yellow
Pp3c13_23370V3	NA	yellow
Pp3c13_24080V3	NA	yellow
Pp3c13_2440V3	NA	yellow
Pp3c13_4320V3	NA	yellow
Pp3c13_5170V3	NA	yellow
Pp3c13_6090V3	NA	yellow
Pp3c13_6400V3	NA	yellow
Pp3c13_6760V3	NA	yellow
Pp3c13_690V3	NA	yellow
Pp3c13_7900V3	NA	yellow
Pp3c13_8420V3	NA	yellow
Pp3c13_9737V3	NA	yellow
Pp3c14_11030V3	NA	yellow
Pp3c14_11150V3	NA	yellow
Pp3c14_11250V3	NA	yellow
Pp3c14_11530V3	NA	yellow
Pp3c14_12190V3	NA	yellow
Pp3c14_13820V3	NA	yellow
Pp3c14_14030V3	NA	yellow
Pp3c14_14700V3	NA	yellow
Pp3c14_15040V3	NA	yellow
Pp3c14_15110V3	NA	yellow
Pp3c14_15250V3	NA	yellow
Pp3c14_15360V3	NA	yellow
Pp3c14_15560V3	NA	yellow
Pp3c14_16100V3	NA	yellow
Pp3c14_1610V3	NA	yellow
Pp3c14_17100V3	NA	yellow
Pp3c14_17240V3	NA	yellow
Pp3c14_17400V3	NA	yellow
Pp3c14_17980V3	NA	yellow
Pp3c14_18440V3	NA	yellow
Pp3c14_19470V3	NA	yellow
Pp3c14_21075V3	NA	yellow
Pp3c14_21530V3	NA	yellow
Pp3c14_22450V3	NA	yellow
Pp3c14_23280V3	NA	yellow
Pp3c14_23710V3	NA	yellow
Pp3c14_25540V3	NA	yellow
Pp3c14_2570V3	NA	yellow
Pp3c14_26180V3	NA	yellow
Pp3c14_26410V3	NA	yellow
Pp3c14_3550V3	NA	yellow
Pp3c14_4880V3	NA	yellow
Pp3c14_7400V3	NA	yellow
Pp3c14_7440V3	NA	yellow
Pp3c14_7560V3	NA	yellow
Pp3c14_8127V3	NA	yellow
Pp3c14_8760V3	NA	yellow
Pp3c14_8990V3	NA	yellow
Pp3c14_9160V3	NA	yellow
Pp3c14_9740V3	NA	yellow
Pp3c15_10740V3	NA	yellow
Pp3c15_11110V3	NA	yellow
Pp3c15_12110V3	NA	yellow
Pp3c15_12140V3	NA	yellow
Pp3c15_12440V3	NA	yellow
Pp3c15_12810V3	NA	yellow
Pp3c15_13120V3	NA	yellow
Pp3c15_13530V3	NA	yellow
Pp3c15_13560V3	NA	yellow
Pp3c15_140V3	NA	yellow
Pp3c15_1420V3	NA	yellow
Pp3c15_14310V3	NA	yellow
Pp3c15_14720V3	NA	yellow
Pp3c15_16510V3	NA	yellow
Pp3c15_16690V3	NA	yellow
Pp3c15_16700V3	NA	yellow
Pp3c15_1680V3	NA	yellow
Pp3c15_17530V3	NA	yellow
Pp3c15_18180V3	NA	yellow
Pp3c15_1830V3	NA	yellow
Pp3c15_19100V3	NA	yellow
Pp3c15_19390V3	NA	yellow
Pp3c15_20280V3	NA	yellow
Pp3c15_20330V3	NA	yellow
Pp3c15_20650V3	NA	yellow
Pp3c15_20930V3	NA	yellow
Pp3c15_21210V3	NA	yellow
Pp3c15_21880V3	NA	yellow
Pp3c15_22130V3	NA	yellow
Pp3c15_22530V3	NA	yellow
Pp3c15_22780V3	NA	yellow
Pp3c15_23370V3	NA	yellow
Pp3c15_2540V3	NA	yellow
Pp3c15_2570V3	NA	yellow
Pp3c15_3710V3	NA	yellow
Pp3c15_3990V3	NA	yellow
Pp3c15_4370V3	NA	yellow
Pp3c15_5970V3	NA	yellow
Pp3c15_6440V3	NA	yellow
Pp3c15_7120V3	NA	yellow
Pp3c15_7150V3	NA	yellow
Pp3c15_7540V3	NA	yellow
Pp3c15_7720V3	NA	yellow
Pp3c15_8950V3	NA	yellow
Pp3c16_11060V3	NA	yellow
Pp3c16_11330V3	NA	yellow
Pp3c16_11670V3	NA	yellow
Pp3c16_11960V3	NA	yellow
Pp3c16_12110V3	NA	yellow
Pp3c16_12600V3	NA	yellow
Pp3c16_15690V3	NA	yellow
Pp3c16_16040V3	NA	yellow
Pp3c16_16610V3	NA	yellow
Pp3c16_16660V3	NA	yellow
Pp3c16_16670V3	NA	yellow
Pp3c16_16940V3	NA	yellow
Pp3c16_17420V3	NA	yellow
Pp3c16_17440V3	NA	yellow
Pp3c16_17480V3	NA	yellow
Pp3c16_17970V3	NA	yellow
Pp3c16_18700V3	NA	yellow
Pp3c16_19430V3	NA	yellow
Pp3c16_20090V3	NA	yellow
Pp3c16_21110V3	NA	yellow
Pp3c16_21460V3	NA	yellow
Pp3c16_21950V3	NA	yellow
Pp3c16_22268V3	NA	yellow
Pp3c16_22750V3	NA	yellow
Pp3c16_22900V3	NA	yellow
Pp3c16_23380V3	NA	yellow
Pp3c16_2540V3	NA	yellow
Pp3c16_25560V3	NA	yellow
Pp3c16_3320V3	NA	yellow
Pp3c16_3940V3	NA	yellow
Pp3c16_4780V3	NA	yellow
Pp3c16_5420V3	NA	yellow
Pp3c16_5670V3	NA	yellow
Pp3c16_5870V3	NA	yellow
Pp3c16_6700V3	NA	yellow
Pp3c16_6910V3	NA	yellow
Pp3c16_8720V3	NA	yellow
Pp3c17_10380V3	NA	yellow
Pp3c17_1110V3	NA	yellow
Pp3c17_11450V3	NA	yellow
Pp3c17_13700V3	NA	yellow
Pp3c17_14350V3	NA	yellow
Pp3c17_14650V3	NA	yellow
Pp3c17_14681V3	NA	yellow
Pp3c17_15260V3	NA	yellow
Pp3c17_15590V3	NA	yellow
Pp3c17_17050V3	NA	yellow
Pp3c17_17060V3	NA	yellow
Pp3c17_17430V3	NA	yellow
Pp3c17_17510V3	NA	yellow
Pp3c17_17580V3	NA	yellow
Pp3c17_18770V3	NA	yellow
Pp3c17_18850V3	NA	yellow
Pp3c17_19052V3	NA	yellow
Pp3c17_20360V3	NA	yellow
Pp3c17_21360V3	NA	yellow
Pp3c17_21870V3	NA	yellow
Pp3c17_22290V3	NA	yellow
Pp3c17_22370V3	NA	yellow
Pp3c17_22380V3	NA	yellow
Pp3c17_2626V3	NA	yellow
Pp3c17_3060V3	NA	yellow
Pp3c17_4810V3	NA	yellow
Pp3c17_5890V3	NA	yellow
Pp3c17_5900V3	NA	yellow
Pp3c17_6390V3	NA	yellow
Pp3c17_6480V3	NA	yellow
Pp3c17_7390V3	NA	yellow
Pp3c17_8040V3	NA	yellow
Pp3c18_10730V3	NA	yellow
Pp3c18_10760V3	NA	yellow
Pp3c18_10780V3	NA	yellow
Pp3c18_10930V3	NA	yellow
Pp3c18_10950V3	NA	yellow
Pp3c18_11200V3	NA	yellow
Pp3c18_11860V3	NA	yellow
Pp3c18_12020V3	NA	yellow
Pp3c18_12270V3	NA	yellow
Pp3c18_12280V3	NA	yellow
Pp3c18_13360V3	NA	yellow
Pp3c18_13380V3	NA	yellow
Pp3c18_1410V3	NA	yellow
Pp3c18_14470V3	NA	yellow
Pp3c18_14481V3	NA	yellow
Pp3c18_14600V3	NA	yellow
Pp3c18_14700V3	NA	yellow
Pp3c18_15950V3	NA	yellow
Pp3c18_16750V3	NA	yellow
Pp3c18_17790V3	NA	yellow
Pp3c18_17950V3	NA	yellow
Pp3c18_19440V3	NA	yellow
Pp3c18_21610V3	NA	yellow
Pp3c18_21650V3	NA	yellow
Pp3c18_21950V3	NA	yellow
Pp3c18_22500V3	NA	yellow
Pp3c18_4810V3	NA	yellow
Pp3c18_6770V3	NA	yellow
Pp3c18_6780V3	NA	yellow
Pp3c18_7860V3	NA	yellow
Pp3c18_8100V3	NA	yellow
Pp3c18_8800V3	NA	yellow
Pp3c18_9260V3	NA	yellow
Pp3c18_9650V3	NA	yellow
Pp3c19_10080V3	NA	yellow
Pp3c19_12910V3	NA	yellow
Pp3c19_15920V3	NA	yellow
Pp3c19_16160V3	NA	yellow
Pp3c19_1780V3	NA	yellow
Pp3c19_18080V3	NA	yellow
Pp3c19_1820V3	NA	yellow
Pp3c19_19180V3	NA	yellow
Pp3c19_20470V3	NA	yellow
Pp3c19_20870V3	NA	yellow
Pp3c19_22960V3	NA	yellow
Pp3c19_2490V3	NA	yellow
Pp3c19_2790V3	NA	yellow
Pp3c19_3030V3	NA	yellow
Pp3c19_4100V3	NA	yellow
Pp3c19_4270V3	NA	yellow
Pp3c19_5680V3	NA	yellow
Pp3c19_6880V3	NA	yellow
Pp3c19_9680V3	NA	yellow
Pp3c19_9760V3	NA	yellow
Pp3c2_10400V3	NA	yellow
Pp3c2_10460V3	NA	yellow
Pp3c2_11410V3	NA	yellow
Pp3c2_13410V3	NA	yellow
Pp3c2_14420V3	NA	yellow
Pp3c2_14510V3	NA	yellow
Pp3c2_15060V3	NA	yellow
Pp3c2_15630V3	NA	yellow
Pp3c2_15870V3	NA	yellow
Pp3c2_16260V3	NA	yellow
Pp3c2_1630V3	NA	yellow
Pp3c2_18330V3	NA	yellow
Pp3c2_19150V3	NA	yellow
Pp3c2_19700V3	NA	yellow
Pp3c2_19730V3	NA	yellow
Pp3c2_20450V3	NA	yellow
Pp3c2_2150V3	NA	yellow
Pp3c2_22478V3	NA	yellow
Pp3c2_23040V3	NA	yellow
Pp3c2_23320V3	NA	yellow
Pp3c2_23690V3	NA	yellow
Pp3c2_24950V3	NA	yellow
Pp3c2_25160V3	NA	yellow
Pp3c2_25350V3	NA	yellow
Pp3c2_25840V3	NA	yellow
Pp3c2_26190V3	NA	yellow
Pp3c2_27110V3	NA	yellow
Pp3c2_28160V3	NA	yellow
Pp3c2_28550V3	NA	yellow
Pp3c2_2860V3	NA	yellow
Pp3c2_29153V3	NA	yellow
Pp3c2_30990V3	NA	yellow
Pp3c2_31820V3	NA	yellow
Pp3c2_32740V3	NA	yellow
Pp3c2_33410V3	NA	yellow
Pp3c2_33430V3	NA	yellow
Pp3c2_34110V3	NA	yellow
Pp3c2_34370V3	NA	yellow
Pp3c2_3460V3	NA	yellow
Pp3c2_35250V3	NA	yellow
Pp3c2_3540V3	NA	yellow
Pp3c2_35520V3	NA	yellow
Pp3c2_36190V3	NA	yellow
Pp3c2_36220V3	NA	yellow
Pp3c2_36500V3	NA	yellow
Pp3c2_36570V3	NA	yellow
Pp3c2_36900V3	NA	yellow
Pp3c2_37000V3	NA	yellow
Pp3c2_37630V3	NA	yellow
Pp3c2_3800V3	NA	yellow
Pp3c2_4040V3	NA	yellow
Pp3c2_4790V3	NA	yellow
Pp3c2_5540V3	NA	yellow
Pp3c2_6330V3	NA	yellow
Pp3c2_6370V3	NA	yellow
Pp3c2_8570V3	NA	yellow
Pp3c20_10350V3	NA	yellow
Pp3c20_11410V3	NA	yellow
Pp3c20_11510V3	NA	yellow
Pp3c20_13120V3	NA	yellow
Pp3c20_15680V3	NA	yellow
Pp3c20_18280V3	NA	yellow
Pp3c20_18640V3	NA	yellow
Pp3c20_1940V3	NA	yellow
Pp3c20_21900V3	NA	yellow
Pp3c20_22540V3	NA	yellow
Pp3c20_23080V3	NA	yellow
Pp3c20_23240V3	NA	yellow
Pp3c20_2530V3	NA	yellow
Pp3c20_3330V3	NA	yellow
Pp3c20_6180V3	NA	yellow
Pp3c20_640V3	NA	yellow
Pp3c20_6890V3	NA	yellow
Pp3c20_8260V3	NA	yellow
Pp3c20_8370V3	NA	yellow
Pp3c20_8510V3	NA	yellow
Pp3c20_8520V3	NA	yellow
Pp3c20_9690V3	NA	yellow
Pp3c20_9750V3	NA	yellow
Pp3c21_11530V3	NA	yellow
Pp3c21_11820V3	NA	yellow
Pp3c21_13420V3	NA	yellow
Pp3c21_15330V3	NA	yellow
Pp3c21_15430V3	NA	yellow
Pp3c21_1570V3	NA	yellow
Pp3c21_16120V3	NA	yellow
Pp3c21_16320V3	NA	yellow
Pp3c21_16480V3	NA	yellow
Pp3c21_16630V3	NA	yellow
Pp3c21_18250V3	NA	yellow
Pp3c21_18410V3	NA	yellow
Pp3c21_20462V3	NA	yellow
Pp3c21_21340V3	NA	yellow
Pp3c21_3130V3	NA	yellow
Pp3c21_3680V3	NA	yellow
Pp3c21_3950V3	NA	yellow
Pp3c21_4200V3	NA	yellow
Pp3c21_6200V3	NA	yellow
Pp3c21_7106V3	NA	yellow
Pp3c21_7800V3	NA	yellow
Pp3c21_8120V3	NA	yellow
Pp3c21_8250V3	NA	yellow
Pp3c21_8800V3	NA	yellow
Pp3c21_9420V3	NA	yellow
Pp3c21_9750V3	NA	yellow
Pp3c22_10000V3	NA	yellow
Pp3c22_10510V3	NA	yellow
Pp3c22_11100V3	NA	yellow
Pp3c22_11110V3	NA	yellow
Pp3c22_11700V3	NA	yellow
Pp3c22_12800V3	NA	yellow
Pp3c22_13680V3	NA	yellow
Pp3c22_14290V3	NA	yellow
Pp3c22_14630V3	NA	yellow
Pp3c22_14660V3	NA	yellow
Pp3c22_14990V3	NA	yellow
Pp3c22_15620V3	NA	yellow
Pp3c22_17440V3	NA	yellow
Pp3c22_17730V3	NA	yellow
Pp3c22_18560V3	NA	yellow
Pp3c22_19000V3	NA	yellow
Pp3c22_1920V3	NA	yellow
Pp3c22_19410V3	NA	yellow
Pp3c22_21710V3	NA	yellow
Pp3c22_2200V3	NA	yellow
Pp3c22_2310V3	NA	yellow
Pp3c22_2330V3	NA	yellow
Pp3c22_240V3	NA	yellow
Pp3c22_2590V3	NA	yellow
Pp3c22_2850V3	NA	yellow
Pp3c22_490V3	NA	yellow
Pp3c22_520V3	NA	yellow
Pp3c22_5320V3	NA	yellow
Pp3c22_5610V3	NA	yellow
Pp3c22_5850V3	NA	yellow
Pp3c22_7000V3	NA	yellow
Pp3c22_9100V3	NA	yellow
Pp3c23_10310V3	NA	yellow
Pp3c23_1060V3	NA	yellow
Pp3c23_11160V3	NA	yellow
Pp3c23_11590V3	NA	yellow
Pp3c23_1190V3	NA	yellow
Pp3c23_12480V3	NA	yellow
Pp3c23_1260V3	NA	yellow
Pp3c23_12930V3	NA	yellow
Pp3c23_13220V3	NA	yellow
Pp3c23_13320V3	NA	yellow
Pp3c23_13660V3	NA	yellow
Pp3c23_13890V3	NA	yellow
Pp3c23_14950V3	NA	yellow
Pp3c23_15150V3	NA	yellow
Pp3c23_15190V3	NA	yellow
Pp3c23_15570V3	NA	yellow
Pp3c23_16240V3	NA	yellow
Pp3c23_16260V3	NA	yellow
Pp3c23_16670V3	NA	yellow
Pp3c23_17020V3	NA	yellow
Pp3c23_17550V3	NA	yellow
Pp3c23_18160V3	NA	yellow
Pp3c23_18560V3	NA	yellow
Pp3c23_20180V3	NA	yellow
Pp3c23_20900V3	NA	yellow
Pp3c23_21510V3	NA	yellow
Pp3c23_21620V3	NA	yellow
Pp3c23_22170V3	NA	yellow
Pp3c23_22180V3	NA	yellow
Pp3c23_22290V3	NA	yellow
Pp3c23_22490V3	NA	yellow
Pp3c23_22500V3	NA	yellow
Pp3c23_2500V3	NA	yellow
Pp3c23_2850V3	NA	yellow
Pp3c23_3920V3	NA	yellow
Pp3c23_4560V3	NA	yellow
Pp3c23_6490V3	NA	yellow
Pp3c23_6720V3	NA	yellow
Pp3c23_6780V3	NA	yellow
Pp3c23_6810V3	NA	yellow
Pp3c23_6980V3	NA	yellow
Pp3c23_7050V3	NA	yellow
Pp3c23_7640V3	NA	yellow
Pp3c23_9280V3	NA	yellow
Pp3c23_9440V3	NA	yellow
Pp3c23_970V3	NA	yellow
Pp3c24_11510V3	NA	yellow
Pp3c24_12380V3	NA	yellow
Pp3c24_12930V3	NA	yellow
Pp3c24_14080V3	NA	yellow
Pp3c24_14090V3	NA	yellow
Pp3c24_14460V3	NA	yellow
Pp3c24_15000V3	NA	yellow
Pp3c24_15170V3	NA	yellow
Pp3c24_16260V3	NA	yellow
Pp3c24_17360V3	NA	yellow
Pp3c24_20050V3	NA	yellow
Pp3c24_20750V3	NA	yellow
Pp3c24_20960V3	NA	yellow
Pp3c24_2500V3	NA	yellow
Pp3c24_4100V3	NA	yellow
Pp3c24_4990V3	NA	yellow
Pp3c24_5060V3	NA	yellow
Pp3c24_5900V3	NA	yellow
Pp3c24_60V3	NA	yellow
Pp3c24_6320V3	NA	yellow
Pp3c24_7080V3	NA	yellow
Pp3c24_8280V3	NA	yellow
Pp3c24_8830V3	NA	yellow
Pp3c24_9420V3	NA	yellow
Pp3c24_9710V3	NA	yellow
Pp3c24_9920V3	NA	yellow
Pp3c25_13010V3	NA	yellow
Pp3c25_13150V3	NA	yellow
Pp3c25_14400V3	NA	yellow
Pp3c25_180V3	NA	yellow
Pp3c25_1920V3	NA	yellow
Pp3c25_2510V3	NA	yellow
Pp3c25_300V3	NA	yellow
Pp3c25_3080V3	NA	yellow
Pp3c25_4320V3	NA	yellow
Pp3c25_5460V3	NA	yellow
Pp3c25_5620V3	NA	yellow
Pp3c25_600V3	NA	yellow
Pp3c25_680V3	NA	yellow
Pp3c25_7300V3	NA	yellow
Pp3c25_7960V3	NA	yellow
Pp3c25_8080V3	NA	yellow
Pp3c25_8910V3	NA	yellow
Pp3c26_10210V3	NA	yellow
Pp3c26_11240V3	NA	yellow
Pp3c26_11770V3	NA	yellow
Pp3c26_11990V3	NA	yellow
Pp3c26_12240V3	NA	yellow
Pp3c26_12570V3	NA	yellow
Pp3c26_1270V3	NA	yellow
Pp3c26_13090V3	NA	yellow
Pp3c26_1350V3	NA	yellow
Pp3c26_14030V3	NA	yellow
Pp3c26_14140V3	NA	yellow
Pp3c26_14520V3	NA	yellow
Pp3c26_14760V3	NA	yellow
Pp3c26_15490V3	NA	yellow
Pp3c26_4440V3	NA	yellow
Pp3c26_4950V3	NA	yellow
Pp3c26_5590V3	NA	yellow
Pp3c26_5740V3	NA	yellow
Pp3c26_5980V3	NA	yellow
Pp3c26_670V3	NA	yellow
Pp3c26_7670V3	NA	yellow
Pp3c27_1320V3	NA	yellow
Pp3c27_2240V3	NA	yellow
Pp3c27_2310V3	NA	yellow
Pp3c27_400V3	NA	yellow
Pp3c27_4610V3	NA	yellow
Pp3c27_4880V3	NA	yellow
Pp3c27_5080V3	NA	yellow
Pp3c27_5980V3	NA	yellow
Pp3c27_6380V3	NA	yellow
Pp3c27_7310V3	NA	yellow
Pp3c27_7380V3	NA	yellow
Pp3c3_10220V3	NA	yellow
Pp3c3_10740V3	NA	yellow
Pp3c3_10921V3	NA	yellow
Pp3c3_11050V3	NA	yellow
Pp3c3_11210V3	NA	yellow
Pp3c3_11320V3	NA	yellow
Pp3c3_11680V3	NA	yellow
Pp3c3_11850V3	NA	yellow
Pp3c3_12090V3	NA	yellow
Pp3c3_12510V3	NA	yellow
Pp3c3_14670V3	NA	yellow
Pp3c3_15220V3	NA	yellow
Pp3c3_15290V3	NA	yellow
Pp3c3_15840V3	NA	yellow
Pp3c3_1650V3	NA	yellow
Pp3c3_16950V3	NA	yellow
Pp3c3_17810V3	NA	yellow
Pp3c3_18340V3	NA	yellow
Pp3c3_18570V3	NA	yellow
Pp3c3_18730V3	NA	yellow
Pp3c3_20110V3	NA	yellow
Pp3c3_22140V3	NA	yellow
Pp3c3_22490V3	NA	yellow
Pp3c3_23640V3	NA	yellow
Pp3c3_25210V3	NA	yellow
Pp3c3_25264V3	NA	yellow
Pp3c3_25870V3	NA	yellow
Pp3c3_26090V3	NA	yellow
Pp3c3_2620V3	NA	yellow
Pp3c3_26310V3	NA	yellow
Pp3c3_26700V3	NA	yellow
Pp3c3_28300V3	NA	yellow
Pp3c3_30120V3	NA	yellow
Pp3c3_30150V3	NA	yellow
Pp3c3_30330V3	NA	yellow
Pp3c3_30360V3	NA	yellow
Pp3c3_30370V3	NA	yellow
Pp3c3_31110V3	NA	yellow
Pp3c3_31260V3	NA	yellow
Pp3c3_31380V3	NA	yellow
Pp3c3_31720V3	NA	yellow
Pp3c3_31810V3	NA	yellow
Pp3c3_32730V3	NA	yellow
Pp3c3_33028V3	NA	yellow
Pp3c3_34250V3	NA	yellow
Pp3c3_34260V3	NA	yellow
Pp3c3_34390V3	NA	yellow
Pp3c3_34720V3	NA	yellow
Pp3c3_35300V3	NA	yellow
Pp3c3_35330V3	NA	yellow
Pp3c3_35820V3	NA	yellow
Pp3c3_35850V3	NA	yellow
Pp3c3_36800V3	NA	yellow
Pp3c3_37150V3	NA	yellow
Pp3c3_38220V3	NA	yellow
Pp3c3_4140V3	NA	yellow
Pp3c3_4150V3	NA	yellow
Pp3c3_430V3	NA	yellow
Pp3c3_5010V3	NA	yellow
Pp3c3_5480V3	NA	yellow
Pp3c3_5490V3	NA	yellow
Pp3c3_5620V3	NA	yellow
Pp3c3_5650V3	NA	yellow
Pp3c3_8930V3	NA	yellow
Pp3c3_9470V3	NA	yellow
Pp3c3_9960V3	NA	yellow
Pp3c4_10480V3	NA	yellow
Pp3c4_11030V3	NA	yellow
Pp3c4_12150V3	NA	yellow
Pp3c4_12660V3	NA	yellow
Pp3c4_13400V3	NA	yellow
Pp3c4_13790V3	NA	yellow
Pp3c4_14390V3	NA	yellow
Pp3c4_15190V3	NA	yellow
Pp3c4_16391V3	NA	yellow
Pp3c4_16880V3	NA	yellow
Pp3c4_17010V3	NA	yellow
Pp3c4_17740V3	NA	yellow
Pp3c4_17830V3	NA	yellow
Pp3c4_17970V3	NA	yellow
Pp3c4_20120V3	NA	yellow
Pp3c4_20150V3	NA	yellow
Pp3c4_20930V3	NA	yellow
Pp3c4_20940V3	NA	yellow
Pp3c4_21910V3	NA	yellow
Pp3c4_21990V3	NA	yellow
Pp3c4_22420V3	NA	yellow
Pp3c4_2250V3	NA	yellow
Pp3c4_23170V3	NA	yellow
Pp3c4_23860V3	NA	yellow
Pp3c4_26050V3	NA	yellow
Pp3c4_26280V3	NA	yellow
Pp3c4_27300V3	NA	yellow
Pp3c4_27680V3	NA	yellow
Pp3c4_27860V3	NA	yellow
Pp3c4_28680V3	NA	yellow
Pp3c4_29270V3	NA	yellow
Pp3c4_29510V3	NA	yellow
Pp3c4_29920V3	NA	yellow
Pp3c4_30010V3	NA	yellow
Pp3c4_4070V3	NA	yellow
Pp3c4_4130V3	NA	yellow
Pp3c4_4370V3	NA	yellow
Pp3c4_4720V3	NA	yellow
Pp3c4_5690V3	NA	yellow
Pp3c4_6840V3	NA	yellow
Pp3c4_7070V3	NA	yellow
Pp3c4_7140V3	NA	yellow
Pp3c4_8080V3	NA	yellow
Pp3c4_8140V3	NA	yellow
Pp3c4_8330V3	NA	yellow
Pp3c4_8670V3	NA	yellow
Pp3c4_9140V3	NA	yellow
Pp3c4_930V3	NA	yellow
Pp3c5_10V3	NA	yellow
Pp3c5_11350V3	NA	yellow
Pp3c5_12750V3	NA	yellow
Pp3c5_14240V3	NA	yellow
Pp3c5_14860V3	NA	yellow
Pp3c5_16520V3	NA	yellow
Pp3c5_17010V3	NA	yellow
Pp3c5_17290V3	NA	yellow
Pp3c5_1870V3	NA	yellow
Pp3c5_190V3	NA	yellow
Pp3c5_19320V3	NA	yellow
Pp3c5_19590V3	NA	yellow
Pp3c5_20330V3	NA	yellow
Pp3c5_20850V3	NA	yellow
Pp3c5_21790V3	NA	yellow
Pp3c5_21897V3	NA	yellow
Pp3c5_22950V3	NA	yellow
Pp3c5_23290V3	NA	yellow
Pp3c5_23860V3	NA	yellow
Pp3c5_24460V3	NA	yellow
Pp3c5_24550V3	NA	yellow
Pp3c5_24610V3	NA	yellow
Pp3c5_25780V3	NA	yellow
Pp3c5_2580V3	NA	yellow
Pp3c5_26380V3	NA	yellow
Pp3c5_27640V3	NA	yellow
Pp3c5_2897V3	NA	yellow
Pp3c5_3190V3	NA	yellow
Pp3c5_4070V3	NA	yellow
Pp3c5_4110V3	NA	yellow
Pp3c5_4140V3	NA	yellow
Pp3c5_4200V3	NA	yellow
Pp3c5_4530V3	NA	yellow
Pp3c5_4560V3	NA	yellow
Pp3c5_5440V3	NA	yellow
Pp3c5_6010V3	NA	yellow
Pp3c5_640V3	NA	yellow
Pp3c5_6630V3	NA	yellow
Pp3c5_690V3	NA	yellow
Pp3c5_750V3	NA	yellow
Pp3c5_8240V3	NA	yellow
Pp3c5_8300V3	NA	yellow
Pp3c5_8591V3	NA	yellow
Pp3c5_8910V3	NA	yellow
Pp3c5_9970V3	NA	yellow
Pp3c6_10050V3	NA	yellow
Pp3c6_10350V3	NA	yellow
Pp3c6_10501V3	NA	yellow
Pp3c6_11200V3	NA	yellow
Pp3c6_12510V3	NA	yellow
Pp3c6_13830V3	NA	yellow
Pp3c6_15310V3	NA	yellow
Pp3c6_15360V3	NA	yellow
Pp3c6_15990V3	NA	yellow
Pp3c6_16090V3	NA	yellow
Pp3c6_16710V3	NA	yellow
Pp3c6_17399V3	NA	yellow
Pp3c6_18000V3	NA	yellow
Pp3c6_18010V3	NA	yellow
Pp3c6_1830V3	NA	yellow
Pp3c6_18530V3	NA	yellow
Pp3c6_19200V3	NA	yellow
Pp3c6_20300V3	NA	yellow
Pp3c6_20820V3	NA	yellow
Pp3c6_22140V3	NA	yellow
Pp3c6_22670V3	NA	yellow
Pp3c6_23080V3	NA	yellow
Pp3c6_23220V3	NA	yellow
Pp3c6_240V3	NA	yellow
Pp3c6_24280V3	NA	yellow
Pp3c6_24470V3	NA	yellow
Pp3c6_24540V3	NA	yellow
Pp3c6_24590V3	NA	yellow
Pp3c6_25050V3	NA	yellow
Pp3c6_25560V3	NA	yellow
Pp3c6_26100V3	NA	yellow
Pp3c6_26460V3	NA	yellow
Pp3c6_26630V3	NA	yellow
Pp3c6_26940V3	NA	yellow
Pp3c6_27050V3	NA	yellow
Pp3c6_27180V3	NA	yellow
Pp3c6_27783V3	NA	yellow
Pp3c6_29375V3	NA	yellow
Pp3c6_29380V3	NA	yellow
Pp3c6_29390V3	NA	yellow
Pp3c6_4360V3	NA	yellow
Pp3c6_5280V3	NA	yellow
Pp3c6_5420V3	NA	yellow
Pp3c6_6031V3	NA	yellow
Pp3c6_8520V3	NA	yellow
Pp3c6_9830V3	NA	yellow
Pp3c6_9862V3	NA	yellow
Pp3c7_11900V3	NA	yellow
Pp3c7_12150V3	NA	yellow
Pp3c7_13700V3	NA	yellow
Pp3c7_14840V3	NA	yellow
Pp3c7_18000V3	NA	yellow
Pp3c7_18380V3	NA	yellow
Pp3c7_18880V3	NA	yellow
Pp3c7_20040V3	NA	yellow
Pp3c7_20680V3	NA	yellow
Pp3c7_20780V3	NA	yellow
Pp3c7_2130V3	NA	yellow
Pp3c7_22320V3	NA	yellow
Pp3c7_23040V3	NA	yellow
Pp3c7_23220V3	NA	yellow
Pp3c7_24620V3	NA	yellow
Pp3c7_24754V3	NA	yellow
Pp3c7_25400V3	NA	yellow
Pp3c7_25430V3	NA	yellow
Pp3c7_280V3	NA	yellow
Pp3c7_3670V3	NA	yellow
Pp3c7_4820V3	NA	yellow
Pp3c7_4940V3	NA	yellow
Pp3c7_5360V3	NA	yellow
Pp3c7_6280V3	NA	yellow
Pp3c7_6320V3	NA	yellow
Pp3c7_6980V3	NA	yellow
Pp3c7_9280V3	NA	yellow
Pp3c7_9800V3	NA	yellow
Pp3c8_1070V3	NA	yellow
Pp3c8_11470V3	NA	yellow
Pp3c8_11610V3	NA	yellow
Pp3c8_12400V3	NA	yellow
Pp3c8_12460V3	NA	yellow
Pp3c8_13170V3	NA	yellow
Pp3c8_13470V3	NA	yellow
Pp3c8_13980V3	NA	yellow
Pp3c8_14270V3	NA	yellow
Pp3c8_14580V3	NA	yellow
Pp3c8_15630V3	NA	yellow
Pp3c8_15724V3	NA	yellow
Pp3c8_16830V3	NA	yellow
Pp3c8_17900V3	NA	yellow
Pp3c8_17970V3	NA	yellow
Pp3c8_17990V3	NA	yellow
Pp3c8_18820V3	NA	yellow
Pp3c8_18960V3	NA	yellow
Pp3c8_19270V3	NA	yellow
Pp3c8_19810V3	NA	yellow
Pp3c8_20960V3	NA	yellow
Pp3c8_22630V3	NA	yellow
Pp3c8_22670V3	NA	yellow
Pp3c8_23110V3	NA	yellow
Pp3c8_2410V3	NA	yellow
Pp3c8_25250V3	NA	yellow
Pp3c8_25320V3	NA	yellow
Pp3c8_25510V3	NA	yellow
Pp3c8_3270V3	NA	yellow
Pp3c8_5700V3	NA	yellow
Pp3c8_6890V3	NA	yellow
Pp3c8_6980V3	NA	yellow
Pp3c8_7780V3	NA	yellow
Pp3c8_7820V3	NA	yellow
Pp3c8_7840V3	NA	yellow
Pp3c8_900V3	NA	yellow
Pp3c9_11400V3	NA	yellow
Pp3c9_12460V3	NA	yellow
Pp3c9_12480V3	NA	yellow
Pp3c9_12510V3	NA	yellow
Pp3c9_13440V3	NA	yellow
Pp3c9_14020V3	NA	yellow
Pp3c9_14620V3	NA	yellow
Pp3c9_18930V3	NA	yellow
Pp3c9_19210V3	NA	yellow
Pp3c9_19250V3	NA	yellow
Pp3c9_19280V3	NA	yellow
Pp3c9_19520V3	NA	yellow
Pp3c9_19750V3	NA	yellow
Pp3c9_22120V3	NA	yellow
Pp3c9_22230V3	NA	yellow
Pp3c9_23450V3	NA	yellow
Pp3c9_24520V3	NA	yellow
Pp3c9_25080V3	NA	yellow
Pp3c9_3190V3	NA	yellow
Pp3c9_3320V3	NA	yellow
Pp3c9_390V3	NA	yellow
Pp3c9_4240V3	NA	yellow
Pp3c9_4250V3	NA	yellow
Pp3c9_430V3	NA	yellow
Pp3c9_60V3	NA	yellow
Pp3c9_6470V3	NA	yellow
Pp3c9_8730V3	NA	yellow
Pp3c9_8750V3	NA	yellow
Pp3c9_8970V3	NA	yellow
Pp3c9_9220V3	NA	yellow
Pp3c9_9380V3	NA	yellow
Pp3s37_140V3	NA	yellow
Pp3s397_40V3	NA	yellow
Pp3s51_30V3	NA	yellow
Pp3s52_10V3	NA	yellow
