Sample	percent_aligned	sample_name
Z_1_10_EKRN220057089-1A_H22HLDSX5_L3	66.64074832865975	control_4h_rep3
Z_1_11_EKRN220057090-1A_HKF3KDSX5_L2	68.78667925070958	control_6h_rep3
Z_1_12_EKRN220057091-1A_H22HLDSX5_L3	64.39492439950733	control_24h_rep3
Z_1_13_EKRN220057092-1A_H22HLDSX5_L3	68.07024776785501	cold_0.5h_rep1
Z_1_14_EKRN220057093-1A_H22HLDSX5_L3	69.67841243993553	cold_1h_rep1
Z_1_15_EKRN220057094-1A_HKF3KDSX5_L2	68.00236633508551	cold_2h_rep1
Z_1_16_EKRN220057095-1A_HKF3KDSX5_L2	68.26828435662938	cold_4h_rep1
Z_1_17_EKRN220057096-1A_HKF3KDSX5_L2	64.8746592780912	cold_6h_rep1
Z_1_18_EKRN220057097-1A_HKF3KDSX5_L2	64.99835231250599	cold_24h_rep1
Z_1_19_EKRN220057098-1A_HLN7GDSX5_L2	66.47836579432345	cold_0.5h_rep2
Z_1_1_EKRN220057080-1A_HKF3KDSX5_L2	63.167785369176	control_1h_rep2
Z_1_20_EKRN220057099-1A_HLN7GDSX5_L2	67.4480455082356	cold_1h_rep2
Z_1_21_EKRN220057100-1A_HLN7GDSX5_L2	67.05069984724057	cold_2h_rep2
Z_1_22_EKRN220057101-1A_HKHYCDSX5_L1	64.35728278013882	cold_4h_rep2
Z_1_23_EKRN220057102-1A_H22HLDSX5_L3	64.04688313950798	cold_6h_rep2
Z_1_24_EKRN220057103-1A_H22FNDSX5_L4	64.93242826225823	cold_24h_rep2
Z_1_25_EKRN220057104-1A_H22HLDSX5_L3	67.79005760865357	cold_0.5h_rep3
Z_1_26_EKRN220057105-1A_H22HLDSX5_L3	64.28436919348758	cold_1h_rep3
Z_1_27_EKRN220057106-1A_H3MF7DSX5_L4	67.24164661752174	cold_2h_rep3
Z_1_28_EKRN220057107-1A_HLN7GDSX5_L2	68.8359407197352	cold_4h_rep3
Z_1_29_EKRN220057108-1A_HLN7GDSX5_L2	67.61556827047433	cold_6h_rep3
Z_1_2_EKRN220057081-1A_H22FNDSX5_L4	69.59695931928125	control_2h_rep2
Z_1_30_EKRN220057109-1A_H22HLDSX5_L3	66.06641251671502	cold_24h_rep3
Z_1_31_EKRN220057110-1A_H22HLDSX5_L3	67.75064514320907	heat_0.5h_rep1
Z_1_32_EKRN220057111-1A_H22HLDSX5_L3	63.53105785076944	heat_1h_rep1
Z_1_33_EKRN220057112-1A_HKHYCDSX5_L1	66.55826315050207	heat_2h_rep1
Z_1_34_EKRN220057113-1A_H22HLDSX5_L3	65.26042236645256	heat_4h_rep1
Z_1_35_EKRN220057114-1A_HLN7GDSX5_L4	68.74620030052448	heat_6h_rep1
Z_1_36_EKRN220057115-1A_HLN7GDSX5_L4	62.02130982801655	heat_24h_rep1
Z_1_37_EKRN220057116-1A_H22HLDSX5_L3	67.59149550810649	heat_0.5h_rep2
Z_1_38_EKRN220057117-1A_H22HLDSX5_L3	63.26545580448296	heat_1h_rep2
Z_1_39_EKRN220057118-1A_HLN7GDSX5_L4	67.0682370313407	heat_2h_rep2
Z_1_3_EKRN220057082-1A_H22FNDSX5_L4	64.09634635478999	control_4h_rep2
Z_1_40_EKRN220057119-1A_HYMV5DSX3_L3	70.1722889033944	heat_4h_rep2
Z_1_41_EKRN220057120-1A_HYMV5DSX3_L3	66.85999643234642	heat_6h_rep2
Z_1_42_EKRN220057121-1A_HYMV5DSX3_L3	59.5576415552597	heat_24h_rep2
Z_1_43_EKRN220057122-1A_HLN7GDSX5_L4	69.9483395673383	heat_0.5h_rep3
Z_1_44_EKRN220057123-1A_HYMV5DSX3_L3	69.53366531706642	heat_1h_rep3
Z_1_45_EKRN220057124-1A_HYMV5DSX3_L3	69.51149848937752	heat_2h_rep3
Z_1_46_EKRN220057125-1A_HLN7GDSX5_L4	71.42003558868556	heat_4h_rep3
Z_1_47_EKRN220057126-1A_H23CGDSX5_L3	67.18815975724048	heat_6h_rep3
Z_1_48_EKRN220057127-1A_H23VJDSX5_L3	52.78262193195439	heat_24h_rep3
Z_1_49_EKRN220057128-1A_HLN7GDSX5_L3	70.0859232508768	control_0h_rep4
Z_1_4_EKRN220057083-1A_HKF3KDSX5_L2	70.57016261543764	control_6h_rep2
Z_1_50_EKRN220057129-1A_HLN7GDSX5_L4	68.13891850941802	control_0.5h_rep1
Z_1_51_EKRN220057130-1A_HLN7GDSX5_L4	64.41389370781975	control_1h_rep1
Z_1_52_EKRN220057131-1A_HLN7GDSX5_L4	67.63084723788745	control_2h_rep1
Z_1_53_EKRN220057132-1A_HLN7GDSX5_L4	69.9491915660132	control_4h_rep1
Z_1_54_EKRN220057133-1A_HLN7GDSX5_L4	69.76378859567589	control_6h_rep1
Z_1_55_EKRN220057134-1A_H23VJDSX5_L3	71.14672000668618	control_24h_rep1
Z_1_56_EKRN220057135-1A_HLN7GDSX5_L4	66.33455475370404	control_0h_rep5
Z_1_57_EKRN220057136-1A_HLN7GDSX5_L3	68.26409707183228	control_0.5h_rep2
Z_1_58_EKRN220057137-1A_HLN7GDSX5_L4	68.68629946036727	control_0h_rep1
Z_1_59_EKRN220057138-1A_HLN7GDSX5_L4	71.39092859381132	high_light_s_0.25_rep1
Z_1_5_EKRN220057084-1A_H22HLDSX5_L3	67.10838159111127	control_24h_rep2
Z_1_60_EKRN220057139-1A_HLN7GDSX5_L4	68.69886030851342	high_light_s_0.5_rep1
Z_1_61_EKRN220057140-1A_HLN7GDSX5_L4	66.23482838757666	high_light_s_2_rep1
Z_1_62_EKRN220057141-1A_HLN7GDSX5_L4	69.7483675948051	high_light_s_4_rep1
Z_1_63_EKRN220057142-1A_HLN7GDSX5_L4	69.40347953564458	high_light_s_6_rep1
Z_1_64_EKRN220057143-1A_HLN7GDSX5_L4	71.38057394392328	high_light_r_0.25h_rep1
Z_1_65_EKRN220057144-1A_HLN7GDSX5_L4	69.49086277348304	high_light_r_0.5h_rep1
Z_1_66_EKRN220057145-1A_HLN7GDSX5_L4	71.17668024913614	high_light_r_1h_rep1
Z_1_67_EKRN220057146-1A_H23VJDSX5_L3	73.67845055962894	high_light_r_2h_rep1
Z_1_68_EKRN220057147-1A_H23VJDSX5_L2	70.166017026763015	high_light_r_4h_rep1
Z_1_69_EKRN220057148-1A_HLN7GDSX5_L4	67.91934310647281	control_0h_rep2
Z_1_6_EKRN220057085-1A_H22HLDSX5_L3	67.93991244755908	control_0h_rep6
Z_1_70_EKRN220057149-1A_H23VJDSX5_L3	68.7957273385058	high_light_s_0.25_rep2
Z_1_71_EKRN220057150-1A_HLN7GDSX5_L4	66.2805642705933	high_light_s_0.5_rep2
Z_1_72_EKRN220057151-1A_HLN7GDSX5_L4	68.32414195764088	high_light_s_2_rep2
Z_1_73_EKRN220057152-1A_HLN7GDSX5_L4	70.85842366247871	high_light_s_4_rep2
Z_1_74_EKRN220057153-1A_H23VJDSX5_L3	69.5965136292577	high_light_s_6_rep2
Z_1_75_EKRN220057154-1A_H23VJDSX5_L3	69.83205423079194	high_light_r_0.25h_rep2
Z_1_76_EKRN220057155-1A_H23VJDSX5_L3	69.84954419571554	high_light_r_0.5h_rep2
Z_1_77_EKRN220057156-1A_HLN7GDSX5_L4	66.44089017931356	high_light_r_1h_rep2
Z_1_78_EKRN220057157-1A_HLN7GDSX5_L4	68.05319051169427	high_light_r_2h_rep2
Z_1_79_EKRN220057158-1A_HLN7GDSX5_L4	64.38094460458574	high_light_r_4h_rep2
Z_1_7_EKRN220057086-1A_H22HLDSX5_L3	63.84815151407064	control_0.5h_rep3
Z_1_80_EKRN220057159-1A_HLN7GDSX5_L4	70.00811245014489	control_0h_rep3
Z_1_81_EKRN220057160-1A_HLN7GDSX5_L4	67.34205624354534	high_light_s_0.25_rep3
Z_1_82_EKRN220057161-1A_HLN7GDSX5_L4	67.75160535690303	high_light_s_0.5_rep3
Z_1_83_EKRN220057162-1A_HLN7GDSX5_L4	70.33185113615357	high_light_s_2_rep3
Z_1_84_EKRN220057163-1A_HLN7GDSX5_L4	63.89392343037811	high_light_s_4_rep3
Z_1_85_EKRN220057164-1A_HLN7GDSX5_L4	67.66168225146329	high_light_s_6_rep3
Z_1_86_EKRN220057165-1A_HLN7GDSX5_L4	67.99347388470393	high_light_r_0.25h_rep3
Z_1_87_EKRN220057166-1A_HLN7GDSX5_L4	69.66256766714228	high_light_r_0.5h_rep3
Z_1_88_EKRN220057167-1A_HLN7GDSX5_L4	66.50280274642627	high_light_r_1h_rep3
Z_1_89_EKRN220057168-1A_HLN7GDSX5_L4	66.91342781459882	high_light_r_2h_rep3
Z_1_8_EKRN220057087-1A_H22HLDSX5_L3	61.578819022046694	control_1h_rep3
Z_1_90_EKRN220057169-1A_HLN7GDSX5_L4	64.3601184614902	high_light_r_4h_rep3
Z_1_9_EKRN220057088-1A_H22HLDSX5_L3	69.87496492016886	control_2h_rep3
