{
	"n_targets": 20030,
	"n_bootstraps": 100,
	"n_processed": 18535916,
	"n_pseudoaligned": 12915532,
	"n_unique": 11071369,
	"p_pseudoaligned": 69.7,
	"p_unique": 59.7,
	"kallisto_version": "0.48.0",
	"index_version": 10,
	"start_time": "Fri Mar  3 13:35:50 2023",
	"call": "kallisto quant --bootstrap-samples 100 --rf-stranded -t 20 -i /scratch/users/dadras/Stress_profiling_of_zygnema_circumcarinatum_1b/kallisto_index/SAG698_1b_CDS.fna.idx -o /scratch/users/dadras/Stress_profiling_of_zygnema_circumcarinatum_1b/kallisto/Z_1_14_EKRN220057093-1A_H22HLDSX5_L3 /scratch/users/dadras/Stress_profiling_of_zygnema_circumcarinatum_1b/trimmed_reads_PE/Z_1_14_EKRN220057093-1A_H22HLDSX5_L3_1.fq.gz /scratch/users/dadras/Stress_profiling_of_zygnema_circumcarinatum_1b/trimmed_reads_PE/Z_1_14_EKRN220057093-1A_H22HLDSX5_L3_2.fq.gz"
}
