nodeName	altName	nodeAttr[nodesPresent, ]
Zci_00003	NA	red
Zci_00004	NA	red
Zci_00026	NA	red
Zci_00030	NA	red
Zci_00036	NA	red
Zci_00044	NA	red
Zci_00048	NA	red
Zci_00049	NA	red
Zci_00050	NA	red
Zci_00055	NA	red
Zci_00071	NA	red
Zci_00099	NA	red
Zci_00118	NA	red
Zci_00126	NA	red
Zci_00131	NA	red
Zci_00133	NA	red
Zci_00171	NA	red
Zci_00224	NA	red
Zci_00321	NA	red
Zci_00336	NA	red
Zci_00337	NA	red
Zci_00360	NA	red
Zci_00371	NA	red
Zci_00403	NA	red
Zci_00418	NA	red
Zci_00554	NA	red
Zci_00581	NA	red
Zci_00586	NA	red
Zci_00614	NA	red
Zci_00679	NA	red
Zci_00734	NA	red
Zci_00750	NA	red
Zci_00767	NA	red
Zci_00775	NA	red
Zci_00783	NA	red
Zci_00809	NA	red
Zci_00815	NA	red
Zci_00825	NA	red
Zci_00842	NA	red
Zci_00889	NA	red
Zci_00920	NA	red
Zci_00944	NA	red
Zci_00955	NA	red
Zci_00972	NA	red
Zci_00981	NA	red
Zci_00996	NA	red
Zci_01016	NA	red
Zci_01018	NA	red
Zci_01035	NA	red
Zci_01094	NA	red
Zci_01113	NA	red
Zci_01120	NA	red
Zci_01123	NA	red
Zci_01144	NA	red
Zci_01163	NA	red
Zci_01304	NA	red
Zci_01306	NA	red
Zci_01324	NA	red
Zci_01326	NA	red
Zci_01348	NA	red
Zci_01373	NA	red
Zci_01377	NA	red
Zci_01396	NA	red
Zci_01429	NA	red
Zci_01436	NA	red
Zci_01456	NA	red
Zci_01469	NA	red
Zci_01491	NA	red
Zci_01538	NA	red
Zci_01540	NA	red
Zci_01583	NA	red
Zci_01598	NA	red
Zci_01785	NA	red
Zci_01803	NA	red
Zci_01813	NA	red
Zci_01819	NA	red
Zci_01823	NA	red
Zci_01891	NA	red
Zci_01944	NA	red
Zci_01946	NA	red
Zci_01959	NA	red
Zci_01968	NA	red
Zci_01982	NA	red
Zci_01994	NA	red
Zci_02002	NA	red
Zci_02006	NA	red
Zci_02017	NA	red
Zci_02020	NA	red
Zci_02054	NA	red
Zci_02066	NA	red
Zci_02153	NA	red
Zci_02174	NA	red
Zci_02194	NA	red
Zci_02195	NA	red
Zci_02210	NA	red
Zci_02259	NA	red
Zci_02280	NA	red
Zci_02341	NA	red
Zci_02376	NA	red
Zci_02442	NA	red
Zci_02504	NA	red
Zci_02518	NA	red
Zci_02538	NA	red
Zci_02652	NA	red
Zci_02664	NA	red
Zci_02676	NA	red
Zci_02748	NA	red
Zci_02822	NA	red
Zci_02871	NA	red
Zci_02873	NA	red
Zci_02896	NA	red
Zci_02930	NA	red
Zci_02961	NA	red
Zci_03041	NA	red
Zci_03068	NA	red
Zci_03071	NA	red
Zci_03132	NA	red
Zci_03151	NA	red
Zci_03152	NA	red
Zci_03169	NA	red
Zci_03183	NA	red
Zci_03184	NA	red
Zci_03185	NA	red
Zci_03186	NA	red
Zci_03197	NA	red
Zci_03211	NA	red
Zci_03220	NA	red
Zci_03225	NA	red
Zci_03289	NA	red
Zci_03315	NA	red
Zci_03361	NA	red
Zci_03364	NA	red
Zci_03409	NA	red
Zci_03410	NA	red
Zci_03421	NA	red
Zci_03456	NA	red
Zci_03459	NA	red
Zci_03470	NA	red
Zci_03485	NA	red
Zci_03490	NA	red
Zci_03501	NA	red
Zci_03506	NA	red
Zci_03510	NA	red
Zci_03512	NA	red
Zci_03553	NA	red
Zci_03578	NA	red
Zci_03582	NA	red
Zci_03583	NA	red
Zci_03630	NA	red
Zci_03656	NA	red
Zci_03740	NA	red
Zci_03783	NA	red
Zci_03795	NA	red
Zci_03820	NA	red
Zci_03889	NA	red
Zci_03903	NA	red
Zci_03904	NA	red
Zci_03934	NA	red
Zci_04038	NA	red
Zci_04066	NA	red
Zci_04076	NA	red
Zci_04108	NA	red
Zci_04157	NA	red
Zci_04158	NA	red
Zci_04160	NA	red
Zci_04195	NA	red
Zci_04198	NA	red
Zci_04201	NA	red
Zci_04231	NA	red
Zci_04234	NA	red
Zci_04257	NA	red
Zci_04259	NA	red
Zci_04288	NA	red
Zci_04347	NA	red
Zci_04363	NA	red
Zci_04364	NA	red
Zci_04494	NA	red
Zci_04499	NA	red
Zci_04526	NA	red
Zci_04539	NA	red
Zci_04631	NA	red
Zci_04638	NA	red
Zci_04667	NA	red
Zci_04676	NA	red
Zci_04740	NA	red
Zci_04741	NA	red
Zci_04758	NA	red
Zci_04805	NA	red
Zci_04840	NA	red
Zci_04842	NA	red
Zci_04853	NA	red
Zci_04856	NA	red
Zci_04877	NA	red
Zci_04879	NA	red
Zci_04883	NA	red
Zci_04887	NA	red
Zci_04909	NA	red
Zci_04945	NA	red
Zci_04969	NA	red
Zci_04970	NA	red
Zci_04974	NA	red
Zci_05047	NA	red
Zci_05063	NA	red
Zci_05065	NA	red
Zci_05095	NA	red
Zci_05138	NA	red
Zci_05145	NA	red
Zci_05157	NA	red
Zci_05160	NA	red
Zci_05177	NA	red
Zci_05195	NA	red
Zci_05266	NA	red
Zci_05270	NA	red
Zci_05284	NA	red
Zci_05315	NA	red
Zci_05330	NA	red
Zci_05365	NA	red
Zci_05382	NA	red
Zci_05449	NA	red
Zci_05467	NA	red
Zci_05468	NA	red
Zci_05499	NA	red
Zci_05505	NA	red
Zci_05515	NA	red
Zci_05519	NA	red
Zci_05537	NA	red
Zci_05538	NA	red
Zci_05611	NA	red
Zci_05738	NA	red
Zci_05741	NA	red
Zci_05764	NA	red
Zci_05775	NA	red
Zci_05797	NA	red
Zci_05811	NA	red
Zci_05854	NA	red
Zci_05856	NA	red
Zci_05861	NA	red
Zci_05895	NA	red
Zci_05907	NA	red
Zci_05917	NA	red
Zci_05952	NA	red
Zci_05957	NA	red
Zci_06016	NA	red
Zci_06109	NA	red
Zci_06115	NA	red
Zci_06116	NA	red
Zci_06118	NA	red
Zci_06126	NA	red
Zci_06174	NA	red
Zci_06175	NA	red
Zci_06179	NA	red
Zci_06184	NA	red
Zci_06199	NA	red
Zci_06285	NA	red
Zci_06293	NA	red
Zci_06299	NA	red
Zci_06326	NA	red
Zci_06340	NA	red
Zci_06351	NA	red
Zci_06365	NA	red
Zci_06367	NA	red
Zci_06371	NA	red
Zci_06444	NA	red
Zci_06504	NA	red
Zci_06505	NA	red
Zci_06506	NA	red
Zci_06517	NA	red
Zci_06566	NA	red
Zci_06567	NA	red
Zci_06568	NA	red
Zci_06579	NA	red
Zci_06650	NA	red
Zci_06672	NA	red
Zci_06680	NA	red
Zci_06712	NA	red
Zci_06721	NA	red
Zci_06803	NA	red
Zci_06878	NA	red
Zci_06922	NA	red
Zci_06966	NA	red
Zci_06967	NA	red
Zci_06970	NA	red
Zci_06984	NA	red
Zci_07122	NA	red
Zci_07160	NA	red
Zci_07258	NA	red
Zci_07296	NA	red
Zci_07298	NA	red
Zci_07340	NA	red
Zci_07369	NA	red
Zci_07386	NA	red
Zci_07402	NA	red
Zci_07427	NA	red
Zci_07460	NA	red
Zci_07464	NA	red
Zci_07496	NA	red
Zci_07506	NA	red
Zci_07507	NA	red
Zci_07523	NA	red
Zci_07542	NA	red
Zci_07575	NA	red
Zci_07582	NA	red
Zci_07668	NA	red
Zci_07738	NA	red
Zci_07756	NA	red
Zci_07757	NA	red
Zci_07804	NA	red
Zci_07845	NA	red
Zci_07971	NA	red
Zci_07976	NA	red
Zci_07988	NA	red
Zci_07995	NA	red
Zci_08004	NA	red
Zci_08007	NA	red
Zci_08034	NA	red
Zci_08045	NA	red
Zci_08064	NA	red
Zci_08076	NA	red
Zci_08145	NA	red
Zci_08149	NA	red
Zci_08203	NA	red
Zci_08244	NA	red
Zci_08250	NA	red
Zci_08259	NA	red
Zci_08273	NA	red
Zci_08288	NA	red
Zci_08306	NA	red
Zci_08357	NA	red
Zci_08394	NA	red
Zci_08457	NA	red
Zci_08550	NA	red
Zci_08648	NA	red
Zci_08747	NA	red
Zci_08751	NA	red
Zci_08759	NA	red
Zci_08822	NA	red
Zci_08844	NA	red
Zci_08857	NA	red
Zci_08880	NA	red
Zci_08912	NA	red
Zci_08922	NA	red
Zci_08935	NA	red
Zci_08948	NA	red
Zci_08997	NA	red
Zci_09018	NA	red
Zci_09023	NA	red
Zci_09035	NA	red
Zci_09036	NA	red
Zci_09052	NA	red
Zci_09093	NA	red
Zci_09111	NA	red
Zci_09148	NA	red
Zci_09159	NA	red
Zci_09192	NA	red
Zci_09196	NA	red
Zci_09221	NA	red
Zci_09242	NA	red
Zci_09295	NA	red
Zci_09318	NA	red
Zci_09335	NA	red
Zci_09342	NA	red
Zci_09353	NA	red
Zci_09355	NA	red
Zci_09485	NA	red
Zci_09504	NA	red
Zci_09510	NA	red
Zci_09594	NA	red
Zci_09617	NA	red
Zci_09658	NA	red
Zci_09680	NA	red
Zci_09690	NA	red
Zci_09691	NA	red
Zci_09720	NA	red
Zci_09721	NA	red
Zci_09753	NA	red
Zci_09763	NA	red
Zci_09777	NA	red
Zci_09866	NA	red
Zci_09888	NA	red
Zci_09920	NA	red
Zci_09923	NA	red
Zci_09957	NA	red
Zci_09969	NA	red
Zci_09971	NA	red
Zci_10005	NA	red
Zci_10019	NA	red
Zci_10044	NA	red
Zci_10048	NA	red
Zci_10062	NA	red
Zci_10063	NA	red
Zci_10066	NA	red
Zci_10074	NA	red
Zci_10083	NA	red
Zci_10120	NA	red
Zci_10158	NA	red
Zci_10190	NA	red
Zci_10227	NA	red
Zci_10343	NA	red
Zci_10433	NA	red
Zci_10443	NA	red
Zci_10496	NA	red
Zci_10497	NA	red
Zci_10514	NA	red
Zci_10551	NA	red
Zci_10555	NA	red
Zci_10557	NA	red
Zci_10560	NA	red
Zci_10635	NA	red
Zci_10720	NA	red
Zci_10743	NA	red
Zci_10748	NA	red
Zci_10752	NA	red
Zci_10763	NA	red
Zci_10780	NA	red
Zci_10789	NA	red
Zci_10793	NA	red
Zci_10805	NA	red
Zci_10873	NA	red
Zci_11036	NA	red
Zci_11059	NA	red
Zci_11138	NA	red
Zci_11174	NA	red
Zci_11176	NA	red
Zci_11195	NA	red
Zci_11206	NA	red
Zci_11207	NA	red
Zci_11256	NA	red
Zci_11436	NA	red
Zci_11475	NA	red
Zci_11478	NA	red
Zci_11491	NA	red
Zci_11494	NA	red
Zci_11548	NA	red
Zci_11554	NA	red
Zci_11579	NA	red
Zci_11661	NA	red
Zci_11743	NA	red
Zci_11750	NA	red
Zci_11799	NA	red
Zci_11816	NA	red
Zci_11840	NA	red
Zci_11879	NA	red
Zci_11897	NA	red
Zci_11910	NA	red
Zci_11938	NA	red
Zci_11939	NA	red
Zci_11985	NA	red
Zci_11998	NA	red
Zci_12033	NA	red
Zci_12038	NA	red
Zci_12039	NA	red
Zci_12089	NA	red
Zci_12103	NA	red
Zci_12195	NA	red
Zci_12223	NA	red
Zci_12246	NA	red
Zci_12250	NA	red
Zci_12272	NA	red
Zci_12319	NA	red
Zci_12367	NA	red
Zci_12420	NA	red
Zci_12439	NA	red
Zci_12445	NA	red
Zci_12473	NA	red
Zci_12659	NA	red
Zci_12751	NA	red
Zci_12769	NA	red
Zci_12782	NA	red
Zci_12783	NA	red
Zci_12793	NA	red
Zci_12801	NA	red
Zci_12814	NA	red
Zci_12835	NA	red
Zci_12962	NA	red
Zci_13027	NA	red
Zci_13032	NA	red
Zci_13085	NA	red
Zci_13086	NA	red
Zci_13098	NA	red
Zci_13106	NA	red
Zci_13159	NA	red
Zci_13221	NA	red
Zci_13276	NA	red
Zci_13343	NA	red
Zci_13356	NA	red
Zci_13372	NA	red
Zci_13405	NA	red
Zci_13415	NA	red
Zci_13444	NA	red
Zci_13446	NA	red
Zci_13471	NA	red
Zci_13479	NA	red
Zci_13481	NA	red
Zci_13574	NA	red
Zci_13600	NA	red
Zci_13629	NA	red
Zci_13653	NA	red
Zci_13662	NA	red
Zci_13712	NA	red
Zci_13764	NA	red
Zci_13774	NA	red
Zci_13781	NA	red
Zci_13869	NA	red
Zci_13905	NA	red
Zci_13935	NA	red
Zci_13938	NA	red
Zci_13971	NA	red
Zci_14013	NA	red
Zci_14077	NA	red
Zci_14083	NA	red
Zci_14107	NA	red
Zci_14124	NA	red
Zci_14125	NA	red
Zci_14143	NA	red
Zci_14210	NA	red
Zci_14245	NA	red
Zci_14337	NA	red
Zci_14351	NA	red
Zci_14380	NA	red
Zci_14437	NA	red
Zci_14445	NA	red
Zci_14456	NA	red
Zci_14464	NA	red
Zci_14468	NA	red
Zci_14484	NA	red
Zci_14489	NA	red
Zci_14560	NA	red
Zci_14572	NA	red
Zci_14580	NA	red
Zci_14592	NA	red
Zci_14593	NA	red
Zci_14617	NA	red
Zci_14629	NA	red
Zci_14646	NA	red
Zci_14652	NA	red
Zci_14656	NA	red
Zci_14671	NA	red
Zci_14675	NA	red
Zci_14691	NA	red
Zci_14700	NA	red
Zci_14746	NA	red
Zci_14776	NA	red
Zci_14780	NA	red
Zci_14808	NA	red
Zci_14823	NA	red
Zci_14845	NA	red
Zci_14851	NA	red
Zci_14898	NA	red
Zci_14908	NA	red
Zci_14918	NA	red
Zci_14961	NA	red
Zci_14964	NA	red
Zci_14965	NA	red
Zci_14979	NA	red
Zci_15011	NA	red
Zci_15171	NA	red
Zci_15185	NA	red
Zci_15242	NA	red
Zci_15260	NA	red
Zci_15289	NA	red
Zci_15303	NA	red
Zci_15340	NA	red
Zci_15370	NA	red
Zci_15379	NA	red
Zci_15433	NA	red
Zci_15610	NA	red
Zci_15616	NA	red
Zci_15647	NA	red
Zci_15651	NA	red
Zci_15664	NA	red
Zci_15812	NA	red
Zci_15821	NA	red
Zci_15856	NA	red
Zci_15926	NA	red
Zci_15928	NA	red
Zci_15954	NA	red
Zci_15960	NA	red
Zci_16075	NA	red
Zci_16278	NA	red
Zci_16319	NA	red
Zci_16350	NA	red
Zci_16424	NA	red
Zci_16494	NA	red
Zci_16578	NA	red
