1	NA	NA	NA	1	NA	NA	1	1	NA	NA	NA	NA	NA
1	NA	NA	NA	1	NA	NA	1	1	NA	NA	NA	NA	NA
1	NA	NA	NA	1	NA	NA	1	1	NA	NA	NA	NA	NA
0.9893617021276596	1	1	1	1	1	1	0.9908256880733946	1	1	1	1	1	1
1	NA	NA	NA	1	NA	NA	1	1	NA	NA	NA	NA	NA
0.9937304075235109	1	1	1	0.9626168224299065	1	1	0.9940119760479041	0.997134670487106	1	1	1	1	1
1	NA	NA	NA	1	NA	NA	1	1	NA	NA	NA	NA	NA
1	NA	NA	NA	1	NA	NA	1	1	NA	NA	NA	NA	NA
1	NA	NA	NA	1	NA	NA	1	1	NA	NA	NA	NA	NA
1	NA	NA	NA	1	NA	NA	1	1	NA	NA	NA	NA	NA
1	NA	NA	NA	1	NA	NA	1	1	NA	NA	NA	NA	NA
