"","x"
"1","Pp3c12_4660V3"
"2","Pp3c19_22640V3"
"3","Pp3c21_6480V3"
"4","Pp3c21_6510V3"
"5","Pp3c12_24560V3"
"6","Pp3c15_12510V3"
"7","Pp3c17_9940V3"
"8","Pp3c16_21290V3"
"9","Pp3c21_4880V3"
"10","Pp3c10_6880V3"
"11","Pp3c14_16620V3"
"12","Pp3c9_3840V3"
"13","Pp3c26_6470V3"
"14","Pp3c22_15610V3"
"15","Pp3c1_20790V3"
"16","Pp3c13_10560V3"
"17","Pp3c19_15130V3"
"18","Pp3c3_22400V3"
"19","Pp3c14_4680V3"
"20","Pp3c10_11250V3"
