{
	"n_targets": 87533,
	"n_bootstraps": 100,
	"n_processed": 34549969,
	"n_pseudoaligned": 32166774,
	"n_unique": 1868480,
	"p_pseudoaligned": 93.1,
	"p_unique": 5.4,
	"kallisto_version": "0.48.0",
	"index_version": 10,
	"start_time": "Fri Mar  3 18:38:07 2023",
	"call": "kallisto quant --bootstrap-samples 100 --rf-stranded -t 20 -i /scratch/users/dadras/Stress_profiling_of_physcomitrium_patens/kallisto_index/Ppatens_318_v3.3.transcript.fa.idx -o /scratch/users/dadras/Stress_profiling_of_physcomitrium_patens/kallisto/P_1_88_EKRN220057257-1A_HKHYCDSX5_L2 /scratch/users/dadras/Stress_profiling_of_physcomitrium_patens/trimmed_reads_PE/P_1_88_EKRN220057257-1A_HKHYCDSX5_L2_1.fq.gz /scratch/users/dadras/Stress_profiling_of_physcomitrium_patens/trimmed_reads_PE/P_1_88_EKRN220057257-1A_HKHYCDSX5_L2_2.fq.gz"
}
