"","x"
"1","Zci_06181"
"2","Zci_04518"
"3","Zci_05677"
"4","Zci_12710"
"5","Zci_08679"
"6","Zci_06539"
"7","Zci_07902"
"8","Zci_02177"
"9","Zci_09338"
"10","Zci_03317"
"11","Zci_07330"
"12","Zci_09404"
"13","Zci_12798"
"14","Zci_04506"
"15","Zci_01308"
"16","Zci_06837"
"17","Zci_04303"
"18","Zci_01274"
"19","Zci_12586"
"20","Zci_15251"
