{
	"n_targets": 87533,
	"n_bootstraps": 100,
	"n_processed": 29568715,
	"n_pseudoaligned": 27149950,
	"n_unique": 1665230,
	"p_pseudoaligned": 91.8,
	"p_unique": 5.6,
	"kallisto_version": "0.48.0",
	"index_version": 10,
	"start_time": "Fri Mar  3 18:08:35 2023",
	"call": "kallisto quant --bootstrap-samples 100 --rf-stranded -t 20 -i /scratch/users/dadras/Stress_profiling_of_physcomitrium_patens/kallisto_index/Ppatens_318_v3.3.transcript.fa.idx -o /scratch/users/dadras/Stress_profiling_of_physcomitrium_patens/kallisto/P_1_30_EKRN220057199-1A_HKHYCDSX5_L1 /scratch/users/dadras/Stress_profiling_of_physcomitrium_patens/trimmed_reads_PE/P_1_30_EKRN220057199-1A_HKHYCDSX5_L1_1.fq.gz /scratch/users/dadras/Stress_profiling_of_physcomitrium_patens/trimmed_reads_PE/P_1_30_EKRN220057199-1A_HKHYCDSX5_L1_2.fq.gz"
}
