geneID	cold_0.5h_rep1	cold_0.5h_rep2	cold_0.5h_rep3	cold_1h_rep1	cold_1h_rep2	cold_1h_rep3	cold_2h_rep1	cold_2h_rep2	cold_2h_rep3	cold_4h_rep1	cold_4h_rep2	cold_4h_rep3	cold_6h_rep1	cold_6h_rep2	cold_6h_rep3	cold_24h_rep1	cold_24h_rep2	cold_24h_rep3	control_0h_rep1	control_0h_rep2	control_0h_rep3	control_0h_rep4	control_0h_rep5	control_0h_rep6	control_0.5h_rep1	control_0.5h_rep2	control_0.5h_rep3	control_1h_rep1	control_1h_rep2	control_1h_rep3	control_2h_rep1	control_2h_rep2	control_2h_rep3	control_4h_rep1	control_4h_rep2	control_4h_rep3	control_6h_rep1	control_6h_rep2	control_6h_rep3	control_24h_rep1	control_24h_rep2	control_24h_rep3	heat_0.5h_rep1	heat_0.5h_rep2	heat_0.5h_rep3	heat_1h_rep1	heat_1h_rep2	heat_1h_rep3	heat_2h_rep1	heat_2h_rep2	heat_2h_rep3	heat_4h_rep1	heat_4h_rep2	heat_4h_rep3	heat_6h_rep1	heat_6h_rep2	heat_6h_rep3	heat_24h_rep1	heat_24h_rep2	heat_24h_rep3	high_light_s_0.25_rep1	high_light_s_0.25_rep2	high_light_s_0.25_rep3	high_light_s_0.5_rep1	high_light_s_0.5_rep2	high_light_s_0.5_rep3	high_light_s_2_rep1	high_light_s_2_rep2	high_light_s_2_rep3	high_light_s_4_rep1	high_light_s_4_rep2	high_light_s_4_rep3	high_light_s_6_rep1	high_light_s_6_rep2	high_light_s_6_rep3	high_light_r_0.25h_rep1	high_light_r_0.25h_rep2	high_light_r_0.25h_rep3	high_light_r_0.5h_rep1	high_light_r_0.5h_rep2	high_light_r_0.5h_rep3	high_light_r_1h_rep1	high_light_r_1h_rep2	high_light_r_1h_rep3	high_light_r_2h_rep1	high_light_r_2h_rep2	high_light_r_2h_rep3	high_light_r_4h_rep1	high_light_r_4h_rep2	high_light_r_4h_rep3
Zci_00861	3.119036580761892	2.709455630342634	3.2378960253683298	2.8563914032036606	2.6446871119874897	3.3375290009535923	3.3701656302200016	2.9475067045125884	2.9965204296721653	2.5043053168691327	3.4583299654786672	2.9066156147143	2.670654602667496	3.1445711551456195	2.8665103593294443	2.213535832127884	2.8691756762798093	2.5338716430197117	2.3256026665679284	2.2056822306259427	2.9595704702796115	3.1782971216534337	2.841929284952474	3.058948690470462	3.0072205288024625	2.5231358857261417	3.296809183126249	2.265990738656258	3.4178592766496645	3.702362226289599	3.061805008304186	2.594306473826073	2.768324629942676	2.603508891074665	2.565527200198465	3.226710795940858	2.109767589793884	2.623566681905152	2.648431185522322	3.544863849346191	2.7684666406397698	3.176232941657541	3.498212199759533	3.555852061963882	3.1452950619876305	3.939977010233043	4.715524456168502	4.0079282703271035	3.407934373607585	3.4125707535817797	3.8984960351384914	3.9784211484678815	3.991289462614664	3.582808901540363	3.836755679845407	3.884367596730277	4.005796384687146	3.4243228671813553	4.37648315640869	5.113294915279595	2.755266132723727	3.3735909940558275	2.905065669382723	3.32650916204047	2.975573213254145	3.3038562882087548	4.216118595840968	3.0983765239470364	3.628479890415137	3.5314781475222357	3.114004104860451	2.81999813432743	3.6466978046740377	4.141227538088149	3.943835841569403	2.95517710359649	3.891391058757195	3.5076503992303225	2.5457680320526865	3.169414925065135	2.35502732782726	2.889265761678104	3.281232319853475	3.3258369961736056	3.369230975662665	3.316135016686972	2.8040253284395757	3.189443629270251	3.0303235817548426	2.032039629384731
Zci_01488	3.3372023518056464	2.8531656691205622	3.2177175302959315	3.647539742811211	3.7744403406121463	3.620156412556988	2.7921370605616582	3.1248855729293745	3.093749264098545	3.3494875192357476	3.228691182542949	3.433397646891292	3.115869641318541	3.4257232331032004	2.562102790797512	2.565455509763934	3.214271559421029	3.242399947986935	3.2701601425557287	2.084094178781845	3.1874885017237364	3.075148474398519	3.268837800326692	3.2559141724879574	3.0225887903224766	3.358414027644238	3.672880701234099	2.26817671554168	2.1215031425828896	3.2303883373742805	3.3379044068154924	2.690802649450626	3.249389589808099	2.5674574320018673	3.2124195102843007	3.4965524643157457	2.3807798112883725	2.661024051933982	2.3454968391392144	3.297836452608688	3.143926392460037	3.0290296424388554	4.5100345979196685	4.605652386185456	3.98014084533024	4.3352120185534675	4.150686655786754	3.503921690985641	3.8998166646975494	3.8323627630568105	4.3988717374226205	4.142170052660427	3.5341519408882576	3.57481231117389	3.561445254161423	4.531746741961455	2.7512912166919303	1.2899023747732767	3.2269128539034857	2.1555660009217332	3.2012877996939237	3.742795954308875	3.696166780161118	3.659718775768851	3.1934175727556697	3.443692918045002	3.032074292493664	2.8381474201326236	3.223901236525972	3.3753077627199346	2.993901625473434	2.6396524681785714	3.5308225821569987	4.034833455963821	3.212837431585021	2.6580524814733275	3.264960847852628	2.8770456723800706	1.337681768445912	3.176134148044905	2.860634818470478	2.807433396949542	2.743775209478956	3.109632730680231	2.5007518727834723	2.996545635360851	2.94910582522178	3.3741898174469256	2.8308187178226047	2.7494466047452377
Zci_01820	4.138840948920576	4.581122311228702	4.5855164330543	4.367658401790071	4.25911577072007	3.8833850619378647	3.931564954345637	4.01440677826104	4.044163269196429	3.6929567565316215	3.2450329442180457	3.568136784997129	3.2241291876996097	3.4020106459397472	2.924802695130957	2.00616579300694	2.270982379211754	3.035646265684317	4.68749194023949	4.842762229381491	3.905497803408064	3.9745042850593153	3.848159665696965	5.131087344894673	3.8939135759994703	3.8908207398939583	4.152075653733398	4.074521355468126	3.435805300666338	5.2307628393051715	4.280603563501029	4.0303477446783145	3.99246529110158	3.753333982023395	3.9789288171895993	4.329304968614616	4.2311052869063595	4.308996245961821	4.554956049668906	4.089735405824473	4.373690593501572	4.655440413571596	4.022397289379795	4.3951738659038435	4.7860858624633185	4.286043994666299	4.886024595040314	4.987790036931917	4.6242613839093725	5.2481869822993445	4.746820940375189	4.918550188451247	5.0359826347361665	5.265440781816627	5.381718368560885	4.822186661161226	5.787972982760703	6.233851950292989	5.567208887653663	6.4656142145112545	5.308624883152376	6.244077564924995	4.533974805892834	5.618393071793363	4.91533952278601	4.801561747634436	5.253150842367746	5.250791739993729	6.440558684549432	4.923841987515701	5.26810575270881	5.575937645191235	6.242347552219292	5.9591207748464	5.071874044598358	5.84713439275381	5.43020951904092	4.892840981711232	4.134950768475063	4.382396290366718	3.970106431757835	3.8748014371600608	3.779483458183064	3.790154300327185	3.1984304427620742	4.310404966496949	3.2711142460929006	4.1876849074077525	4.715818863934557	3.525003235258451
Zci_07848	1.7866285121274814	3.1735007036945695	2.3177436841536028	1.5878523093718715	1.9356081505947271	2.495909551952989	0.973419997186231	0.8523354820803687	2.424382342538657	1.0477717848293164	1.024297938625389	1.1289241867728457	1.8607903988574832	2.1028244160590353	2.3501216513246024	-0.6417809268076081	0.7304576467578888	1.5614803729604578	1.1273292358963336	2.533086357383598	0.2994194141260131	1.9390874172017312	2.391395915652553	3.1429903287635024	1.1446717846170955	1.081490164973898	3.260695834845194	1.4108998584422778	0.8570078929127976	3.1058972372052636	1.1703443757056788	1.2670252808516542	2.6028330130075927	1.6890718021982103	2.5273046143618836	2.6302509350846983	1.961066401064896	2.0285195585644806	2.598618321256119	1.5742687441592709	3.7133173602092966	1.2881326813420326	2.5044694407960173	1.5130845279476317	2.022730638704049	2.6400953779530507	1.639822217643185	2.1734661505268753	2.5352902329842344	1.2276900996932156	2.723095830124834	3.189095733267645	3.818607272054728	0.6599567192120702	1.854764516808478	3.769692227884805	2.9934769569805115	0.29663738362162534	3.901183132542154	1.193570264898319	1.897470403001672	2.9271971271591903	1.3918546169195891	2.425026378836596	2.0585423692535096	1.414194289638822	1.4309883558779588	0.5318287156178073	1.2143585005984592	1.5360573778475306	0.6514128908835203	1.0234920690215088	1.7361508282624112	2.466838754950309	2.2964033909256583	1.371827125931171	1.8604684372788456	1.1094251374295132	-2.188461137239119	0.8365163743271778	0.8495937498642454	0.5384296670242006	1.7275270743567397	0.8210266170043565	0.9246049079145874	0.3579733034163951	0.7420366845063797	0.19382563487467555	0.7910606720203897	1.7270355429562685
Zci_10085	2.492148202809159	1.854554697088343	2.6110089938245036	2.488568025443469	1.9173936778947376	2.1145627002204295	1.662489753459238	2.226452929541767	2.5529007486166075	2.2978206948642876	2.4724399414391565	2.5840511160151616	2.2813716027033495	2.305307098700744	2.7158631524361723	2.9576187431192253	3.0583496365184035	3.222503398532792	1.8179222454000623	2.025011820499102	1.9349140543677956	2.208583594541544	2.8708886049972557	2.438177286503552	2.2648547536610217	2.2926779742059673	2.600651507140464	2.7094307887208378	3.6647902237658703	3.858606072286224	2.9530339090231665	2.6281810455999697	2.968801583308508	2.6396149721245656	3.006768489269005	2.15340200483892	2.059621678097403	1.8726119788599451	1.70729403790779	2.0279356666234194	2.2347697356920726	2.837862395977777	1.897948505356413	2.3442901057175902	2.182171989870895	2.77837523110181	2.533321624097822	2.267171653944279	2.5049115179411543	2.0874375098448934	3.057431769400787	2.5565920815082595	2.0208679942261596	2.8567997014250324	1.90028909635771	2.752261227171194	3.145811833121999	1.9292583331562003	3.16901025633879	1.193570264898319	2.1484844774537364	1.768791513735416	1.7485092159616635	1.654539458709677	2.156372549245177	1.871651285896659	2.742726660494735	2.7023118475246526	1.9206329158996045	2.554666812288618	2.2436642161311267	2.2718856784711603	3.0647152461984057	2.6318723865420743	2.376984994030626	1.787555537232565	2.175497518237862	2.557275865616673	1.1610570435790926	1.535140965680284	2.2328299054703913	2.4695690123060845	2.038288967585848	2.061405567327739	2.240357119892677	2.602934721358295	2.2858552127767675	2.608722139854308	3.1512535518686215	2.656418372430121
Zci_13650	2.338979814021014	2.166229556807328	2.904860425689511	2.103346355019123	2.714346206880138	1.7300241139928778	2.0210307655295994	1.4523224542426647	1.0511637419443929	1.9906866973221995	1.728651313765026	1.5380345738980523	2.1330272158646624	2.34802717295891	1.5329380748228325	2.036784590297357	0.96119188589648	2.6453663147147424	2.4640670662175017	2.9033946457928135	2.272582795450771	2.6958285400495683	2.796359732691077	2.1887238802930193	2.788336794808592	3.1562961521614064	3.0383057692341904	2.593045037418604	3.426423578828315	2.8904720279705702	3.587497789711257	2.3203964658451453	2.446655093905118	3.0679417525980037	2.6337223000728867	2.553161468631359	2.8889113416365095	3.106463377157354	2.0203549411679687	2.380654780011767	2.7333785421290746	3.3173265235053075	3.223857366289013	3.6030700930397552	4.096394876101711	2.530816021706129	3.705252195072338	3.2774999064019683	3.047959822108293	3.4214732201472953	2.8887608854545372	2.984148136706992	3.812719163252283	4.513206180508149	3.338880146726002	3.449112076619711	3.0710779633415837	4.290436633046042	3.750168488316805	4.813827969056512	2.208705995040642	1.3091974615559974	2.0885142100901297	2.4662541896738506	2.0038553316494205	2.3732106013809102	2.2359823377735255	1.681824739097413	2.2781427377863546	3.0417843709840033	2.8684964086584857	2.810128858665951	3.3813433450386543	2.162599858729252	3.1024186286621616	4.068929281352386	4.618444580999192	3.806776025539689	5.532964062850398	3.272966118167679	4.9101899387984504	4.27460245225737	3.3670091789595493	3.841546433527352	3.4828305806515627	3.658187242443765	3.5861890639323493	2.8646675202822003	2.9462314338627715	3.1443692206117664
Zci_16406	3.4373366122443683	2.514012040499266	3.0261632448437368	2.8655982202871932	2.3522842355894067	2.9799431619216437	3.170621719303478	2.972505897744942	3.3479348811119305	2.5241435246790926	1.6451784566058556	2.840390154566522	2.482742920398924	3.02603838745119	3.0701722261217377	1.9316905882138025	2.688165136132265	2.9566766523995476	2.774904330796077	2.7864189780456363	2.774904330796077	2.8766185873317656	2.4191902208846736	3.420803496019653	2.683955502064192	3.1895243015526153	3.4509164438339184	2.9922330423276993	2.770532697608487	3.5285386223594526	1.7731304006243374	3.489647661266727	3.003759569267604	2.5869951037087175	3.3981987931304514	2.6143988600769106	2.7503655797161906	3.076611512673866	2.868542877564807	3.2531630035009216	2.5484529011251964	2.8026620526253505	3.2760665667122635	3.4688571265706285	3.553502586840948	3.743996959062165	3.2007066564129723	3.102314492578259	3.0420200631171332	2.7389305351484547	2.9248221255549476	2.8506091585083895	3.2908790999780817	2.7398740456474147	2.512700548907086	2.670765376570966	2.6824857139086635	2.4179698909824303	3.552604468012228	3.175330072916371	2.741346387802001	2.983862489389069	2.7764689721020717	3.212914562239796	2.666344988889745	2.92929932939783	3.2601943171692875	3.040420821813573	3.3715283084390104	2.3403019410623926	2.686444413695102	2.795514382168335	3.0266677737983625	3.4476525167640575	3.222202977420787	2.8971441840592016	3.7191054227949816	2.4408099452033936	1.5906459467847494	2.7726921473799484	1.847435660096131	2.856342899208681	2.9257084140443372	2.293850480995928	3.2161252059412644	3.127158305084794	2.824394264716632	3.808274997658388	2.9411157725470045	3.5883896092319763
