{
	"n_targets": 44734,
	"n_bootstraps": 100,
	"n_processed": 40427567,
	"n_pseudoaligned": 34045529,
	"n_unique": 13630663,
	"p_pseudoaligned": 84.2,
	"p_unique": 33.7,
	"kallisto_version": "0.48.0",
	"index_version": 10,
	"start_time": "Tue Aug 23 10:47:15 2022",
	"call": "kallisto quant --bootstrap-samples 100 --rf-stranded -t 20 -i /scratch/users/dadras/Stress_profiling_of_mesotaenium_endlicherianum/kallisto_index/Me1_v2.release.gff3.cdna.idx -o /scratch/users/dadras/Stress_profiling_of_mesotaenium_endlicherianum/kallisto/M_1_80 /scratch/users/dadras/Stress_profiling_of_mesotaenium_endlicherianum/trimmed_reads_PE/M_1_80_1.fq.gz /scratch/users/dadras/Stress_profiling_of_mesotaenium_endlicherianum/trimmed_reads_PE/M_1_80_2.fq.gz"
}
