"","ID","Description","GeneRatio","BgRatio","pvalue","p.adjust","qvalue","geneID","Count"
"GO:0043085","GO:0043085","positive regulation of catalytic activity","2/7","39/1957",0.00763138584467866,0.282867450975329,0.273847858800549,"Zci_12165/Zci_13895",2
"GO:0044093","GO:0044093","positive regulation of molecular function","2/7","42/1957",0.00882167141551229,0.282867450975329,0.273847858800549,"Zci_12165/Zci_13895",2
"GO:0050790","GO:0050790","regulation of catalytic activity","2/7","60/1957",0.0175822034550713,0.282867450975329,0.273847858800549,"Zci_12165/Zci_13895",2
"GO:0065009","GO:0065009","regulation of molecular function","2/7","85/1957",0.0339646470170765,0.282867450975329,0.273847858800549,"Zci_12165/Zci_13895",2
"GO:0002831","GO:0002831","regulation of response to biotic stimulus","1/7","10/1957",0.0352786452526506,0.282867450975329,0.273847858800549,"Zci_07164",1
"GO:0060548","GO:0060548","negative regulation of cell death","1/7","10/1957",0.0352786452526506,0.282867450975329,0.273847858800549,"Zci_07164",1
"GO:0006875","GO:0006875","cellular metal ion homeostasis","1/7","12/1957",0.0422048279143142,0.282867450975329,0.273847858800549,"Zci_12165",1
"GO:0031348","GO:0031348","negative regulation of defense response","1/7","13/1957",0.0456519056544685,0.282867450975329,0.273847858800549,"Zci_07164",1
"GO:0032101","GO:0032101","regulation of response to external stimulus","1/7","13/1957",0.0456519056544685,0.282867450975329,0.273847858800549,"Zci_07164",1
"GO:0051345","GO:0051345","positive regulation of hydrolase activity","1/7","13/1957",0.0456519056544685,0.282867450975329,0.273847858800549,"Zci_13895",1
"GO:0097237","GO:0097237","cellular response to toxic substance","1/7","13/1957",0.0456519056544685,0.282867450975329,0.273847858800549,"Zci_06883",1
"GO:0010228","GO:0010228","vegetative to reproductive phase transition of meristem","1/7","15/1957",0.0525141711263915,0.282867450975329,0.273847858800549,"Zci_07164",1
"GO:0010562","GO:0010562","positive regulation of phosphorus metabolic process","1/7","15/1957",0.0525141711263915,0.282867450975329,0.273847858800549,"Zci_13895",1
"GO:0045088","GO:0045088","regulation of innate immune response","1/7","15/1957",0.0525141711263915,0.282867450975329,0.273847858800549,"Zci_07164",1
"GO:0045937","GO:0045937","positive regulation of phosphate metabolic process","1/7","15/1957",0.0525141711263915,0.282867450975329,0.273847858800549,"Zci_13895",1
"GO:0071407","GO:0071407","cellular response to organic cyclic compound","1/7","16/1957",0.0559294135579651,0.282867450975329,0.273847858800549,"Zci_06883",1
"GO:0001666","GO:0001666","response to hypoxia","1/7","17/1957",0.0593340988259166,0.282867450975329,0.273847858800549,"Zci_13895",1
"GO:0030003","GO:0030003","cellular cation homeostasis","1/7","17/1957",0.0593340988259166,0.282867450975329,0.273847858800549,"Zci_12165",1
"GO:0036293","GO:0036293","response to decreased oxygen levels","1/7","17/1957",0.0593340988259166,0.282867450975329,0.273847858800549,"Zci_13895",1
"GO:0055076","GO:0055076","transition metal ion homeostasis","1/7","17/1957",0.0593340988259166,0.282867450975329,0.273847858800549,"Zci_12165",1
"GO:1901699","GO:1901699","cellular response to nitrogen compound","1/7","17/1957",0.0593340988259166,0.282867450975329,0.273847858800549,"Zci_06883",1
"GO:0006873","GO:0006873","cellular ion homeostasis","1/7","18/1957",0.0627282541394313,0.282867450975329,0.273847858800549,"Zci_12165",1
"GO:0010243","GO:0010243","response to organonitrogen compound","1/7","18/1957",0.0627282541394313,0.282867450975329,0.273847858800549,"Zci_06883",1
"GO:0034599","GO:0034599","cellular response to oxidative stress","1/7","18/1957",0.0627282541394313,0.282867450975329,0.273847858800549,"Zci_06883",1
"GO:0070482","GO:0070482","response to oxygen levels","1/7","18/1957",0.0627282541394313,0.282867450975329,0.273847858800549,"Zci_13895",1
"GO:0051336","GO:0051336","regulation of hydrolase activity","1/7","19/1957",0.0661119066515634,0.282867450975329,0.273847858800549,"Zci_13895",1
"GO:0055082","GO:0055082","cellular chemical homeostasis","1/7","19/1957",0.0661119066515634,0.282867450975329,0.273847858800549,"Zci_12165",1
"GO:0006302","GO:0006302","double-strand break repair","1/7","20/1957",0.0694850834593236,0.282867450975329,0.273847858800549,"Zci_13895",1
"GO:0050776","GO:0050776","regulation of immune response","1/7","20/1957",0.0694850834593236,0.282867450975329,0.273847858800549,"Zci_07164",1
"GO:0065008","GO:0065008","regulation of biological quality","2/7","128/1957",0.0717695639061513,0.282867450975329,0.273847858800549,"Zci_12165/Zci_15566",2
"GO:0007178","GO:0007178","transmembrane receptor protein serine/threonine kinase signaling pathway","1/7","21/1957",0.0728478116037657,0.282867450975329,0.273847858800549,"Zci_02815",1
"GO:0043067","GO:0043067","regulation of programmed cell death","1/7","21/1957",0.0728478116037657,0.282867450975329,0.273847858800549,"Zci_07164",1
"GO:0002682","GO:0002682","regulation of immune system process","1/7","22/1957",0.0762001180700744,0.282867450975329,0.273847858800549,"Zci_07164",1
"GO:0007167","GO:0007167","enzyme-linked receptor protein signaling pathway","1/7","22/1957",0.0762001180700744,0.282867450975329,0.273847858800549,"Zci_02815",1
"GO:0042542","GO:0042542","response to hydrogen peroxide","1/7","22/1957",0.0762001180700744,0.282867450975329,0.273847858800549,"Zci_06883",1
"GO:0051716","GO:0051716","cellular response to stimulus","3/7","305/1957",0.0808086685350666,0.282867450975329,0.273847858800549,"Zci_02815/Zci_06883/Zci_13895",3
"GO:0007166","GO:0007166","cell surface receptor signaling pathway","1/7","24/1957",0.0828735736301976,0.282867450975329,0.273847858800549,"Zci_02815",1
"GO:0010941","GO:0010941","regulation of cell death","1/7","24/1957",0.0828735736301976,0.282867450975329,0.273847858800549,"Zci_07164",1
"GO:0080135","GO:0080135","regulation of cellular response to stress","1/7","24/1957",0.0828735736301976,0.282867450975329,0.273847858800549,"Zci_07164",1
"GO:0009267","GO:0009267","cellular response to starvation","1/7","26/1957",0.089505664907057,0.282867450975329,0.273847858800549,"Zci_06883",1
"GO:0061024","GO:0061024","membrane organization","1/7","26/1957",0.089505664907057,0.282867450975329,0.273847858800549,"Zci_07164",1
"GO:0019725","GO:0019725","cellular homeostasis","1/7","28/1957",0.0960966057796317,0.282867450975329,0.273847858800549,"Zci_12165",1
"GO:0055065","GO:0055065","metal ion homeostasis","1/7","28/1957",0.0960966057796317,0.282867450975329,0.273847858800549,"Zci_12165",1
"GO:0031669","GO:0031669","cellular response to nutrient levels","1/7","29/1957",0.0993767114092544,0.282867450975329,0.273847858800549,"Zci_06883",1
"GO:0033554","GO:0033554","cellular response to stress","2/7","155/1957",0.100537902166596,0.282867450975329,0.273847858800549,"Zci_06883/Zci_13895",2
"GO:0042594","GO:0042594","response to starvation","1/7","31/1957",0.105906325761935,0.282867450975329,0.273847858800549,"Zci_06883",1
"GO:0006468","GO:0006468","protein phosphorylation","2/7","160/1957",0.106218259191678,0.282867450975329,0.273847858800549,"Zci_02815/Zci_06883",2
"GO:0000302","GO:0000302","response to reactive oxygen species","1/7","32/1957",0.109155887402468,0.282867450975329,0.273847858800549,"Zci_06883",1
"GO:0055080","GO:0055080","cation homeostasis","1/7","32/1957",0.109155887402468,0.282867450975329,0.273847858800549,"Zci_12165",1
"GO:0019220","GO:0019220","regulation of phosphate metabolic process","1/7","33/1957",0.112395320539186,0.282867450975329,0.273847858800549,"Zci_13895",1
"GO:0031668","GO:0031668","cellular response to extracellular stimulus","1/7","33/1957",0.112395320539186,0.282867450975329,0.273847858800549,"Zci_06883",1
"GO:0051174","GO:0051174","regulation of phosphorus metabolic process","1/7","33/1957",0.112395320539186,0.282867450975329,0.273847858800549,"Zci_13895",1
"GO:0071496","GO:0071496","cellular response to external stimulus","1/7","33/1957",0.112395320539186,0.282867450975329,0.273847858800549,"Zci_06883",1
"GO:0098771","GO:0098771","inorganic ion homeostasis","1/7","33/1957",0.112395320539186,0.282867450975329,0.273847858800549,"Zci_12165",1
"GO:0071214","GO:0071214","cellular response to abiotic stimulus","1/7","34/1957",0.115624651493565,0.282867450975329,0.273847858800549,"Zci_06883",1
"GO:0104004","GO:0104004","cellular response to environmental stimulus","1/7","34/1957",0.115624651493565,0.282867450975329,0.273847858800549,"Zci_06883",1
"GO:0031347","GO:0031347","regulation of defense response","1/7","35/1957",0.11884390653233,0.285642371840864,0.276534297748358,"Zci_07164",1
"GO:1901698","GO:1901698","response to nitrogen compound","1/7","36/1957",0.12205311186754,0.28829786768712,0.279105119697097,"Zci_06883",1
"GO:0050801","GO:0050801","ion homeostasis","1/7","37/1957",0.125252293656675,0.290840071711261,0.281566262279054,"Zci_12165",1
"GO:0031667","GO:0031667","response to nutrient levels","1/7","38/1957",0.128441478002718,0.291736954499582,0.282434546807125,"Zci_06883",1
"GO:0007154","GO:0007154","cell communication","2/7","180/1957",0.129897476091055,0.291736954499582,0.282434546807125,"Zci_02815/Zci_06883",2
"GO:0014070","GO:0014070","response to organic cyclic compound","1/7","40/1957",0.134789958505507,0.293114671670706,0.283768333695805,"Zci_06883",1
"GO:0048285","GO:0048285","organelle fission","1/7","40/1957",0.134789958505507,0.293114671670706,0.283768333695805,"Zci_15566",1
"GO:0009636","GO:0009636","response to toxic substance","1/7","42/1957",0.141098761113124,0.297392773423047,0.287910022676173,"Zci_06883",1
"GO:0009991","GO:0009991","response to extracellular stimulus","1/7","42/1957",0.141098761113124,0.297392773423047,0.287910022676173,"Zci_06883",1
"GO:0009657","GO:0009657","plastid organization","1/7","43/1957",0.144238347887123,0.299403843341453,0.289856967045894,"Zci_07164",1
"GO:0046677","GO:0046677","response to antibiotic","1/7","49/1957",0.162870085724919,0.333032861855431,0.322413681089391,"Zci_06883",1
"GO:0048878","GO:0048878","chemical homeostasis","1/7","50/1957",0.165941317066599,0.334322947619471,0.323662630811013,"Zci_12165",1
"GO:0045935","GO:0045935","positive regulation of nucleobase-containing compound metabolic process","1/7","55/1957",0.181153034586284,0.357081728730952,0.345695718940453,"Zci_13895",1
"GO:0048585","GO:0048585","negative regulation of response to stimulus","1/7","56/1957",0.184166666951108,0.357081728730952,0.345695718940453,"Zci_07164",1
"GO:0006996","GO:0006996","organelle organization","2/7","223/1957",0.185056954305822,0.357081728730952,0.345695718940453,"Zci_15566/Zci_07164",2
"GO:0050794","GO:0050794","regulation of cellular process","3/7","439/1957",0.191964696511621,0.365266158640167,0.353619177784565,"Zci_02815/Zci_07164/Zci_13895",3
"GO:0010033","GO:0010033","response to organic substance","2/7","234/1957",0.19989132486258,0.375138513783199,0.363176740197334,"Zci_06883/Zci_13895",2
"GO:0080134","GO:0080134","regulation of response to stress","1/7","63/1957",0.204997163174007,0.379521775065392,0.36742023556081,"Zci_07164",1
"GO:0006281","GO:0006281","DNA repair","1/7","64/1957",0.20793539963535,0.379828663333905,0.367717338302513,"Zci_13895",1
"GO:0006974","GO:0006974","cellular response to DNA damage stimulus","1/7","66/1957",0.213783958312429,0.380368860893542,0.368240310968777,"Zci_13895",1
"GO:0042592","GO:0042592","homeostatic process","1/7","66/1957",0.213783958312429,0.380368860893542,0.368240310968777,"Zci_12165",1
"GO:0006979","GO:0006979","response to oxidative stress","1/7","67/1957",0.216694329698898,0.38060414318909,0.36846809098598,"Zci_06883",1
"GO:0051173","GO:0051173","positive regulation of nitrogen compound metabolic process","1/7","75/1957",0.23964673465888,0.415589906940084,0.402338288701118,"Zci_13895",1
"GO:0071495","GO:0071495","cellular response to endogenous stimulus","1/7","78/1957",0.248103977470091,0.424878061417531,0.411330278437256,"Zci_06883",1
"GO:0031325","GO:0031325","positive regulation of cellular metabolic process","1/7","84/1957",0.264776832126365,0.446097672491085,0.431873274943348,"Zci_13895",1
"GO:0010604","GO:0010604","positive regulation of macromolecule metabolic process","1/7","85/1957",0.267524596234809,0.446097672491085,0.431873274943348,"Zci_13895",1
"GO:1901701","GO:1901701","cellular response to oxygen-containing compound","1/7","86/1957",0.270263553407008,0.446097672491085,0.431873274943348,"Zci_06883",1
"GO:0043412","GO:0043412","macromolecule modification","2/7","291/1957",0.279698058585981,0.456174214598564,0.441628513556812,"Zci_02815/Zci_13895",2
"GO:0006259","GO:0006259","DNA metabolic process","1/7","91/1957",0.283827057202041,0.457462433372701,0.442875655819903,"Zci_13895",1
"GO:0009893","GO:0009893","positive regulation of metabolic process","1/7","98/1957",0.302452615089865,0.480412082327422,0.465093525726125,"Zci_13895",1
"GO:0071310","GO:0071310","cellular response to organic substance","1/7","99/1957",0.305079205565589,0.480412082327422,0.465093525726125,"Zci_06883",1
"GO:0009628","GO:0009628","response to abiotic stimulus","2/7","317/1957",0.317008780323885,0.49352503300423,0.477788353119731,"Zci_06883/Zci_13895",2
"GO:0016043","GO:0016043","cellular component organization","2/7","334/1957",0.341480060342597,0.517096599171221,0.500608309608712,"Zci_15566/Zci_07164",2
"GO:0048608","GO:0048608","reproductive structure development","1/7","114/1957",0.343472923537088,0.517096599171221,0.500608309608712,"Zci_07164",1
"GO:0061458","GO:0061458","reproductive system development","1/7","114/1957",0.343472923537088,0.517096599171221,0.500608309608712,"Zci_07164",1
"GO:0048523","GO:0048523","negative regulation of cellular process","1/7","119/1957",0.355859877997492,0.529921774844091,0.513024538074188,"Zci_07164",1
"GO:0048522","GO:0048522","positive regulation of cellular process","1/7","121/1957",0.360758264557798,0.531439594026004,0.514493959641002,"Zci_13895",1
"GO:0048583","GO:0048583","regulation of response to stimulus","1/7","124/1957",0.368045967659618,0.53640742095072,0.51930338102029,"Zci_07164",1
"GO:0070887","GO:0070887","cellular response to chemical stimulus","1/7","128/1957",0.377652046708685,0.544614004200946,0.527248286817665,"Zci_06883",1
"GO:0042221","GO:0042221","response to chemical","2/7","364/1957",0.384531643555811,0.548758699657773,0.531260823333687,"Zci_06883/Zci_13895",2
"GO:0071840","GO:0071840","cellular component organization or biogenesis","2/7","373/1957",0.397365910064525,0.561228141018968,0.543332660533154,"Zci_15566/Zci_07164",2
"GO:0009791","GO:0009791","post-embryonic development","1/7","143/1957",0.412568846264912,0.576754407533601,0.55836385208785,"Zci_07164",1
"GO:0003006","GO:0003006","developmental process involved in reproduction","1/7","145/1957",0.417094991638989,0.577192059136783,0.558787548607258,"Zci_07164",1
"GO:0016310","GO:0016310","phosphorylation","1/7","151/1957",0.430494538236834,0.589777517384462,0.570971703345695,"Zci_02815",1
"GO:0023052","GO:0023052","signaling","1/7","155/1957",0.439280136164945,0.590013516221544,0.571200177056585,"Zci_02815",1
"GO:0048518","GO:0048518","positive regulation of biological process","1/7","155/1957",0.439280136164945,0.590013516221544,0.571200177056585,"Zci_13895",1
"GO:0005975","GO:0005975","carbohydrate metabolic process","1/7","157/1957",0.443629193820193,0.590069898576373,0.571254761587576,"Zci_11990",1
"GO:0010035","GO:0010035","response to inorganic substance","1/7","161/1957",0.452240633690987,0.595740065535243,0.576744127986482,"Zci_06883",1
"GO:0007165","GO:0007165","signal transduction","1/7","165/1957",0.460737574191169,0.597007244472672,0.577970901295095,"Zci_02815",1
"GO:0006950","GO:0006950","response to stress","2/7","419/1957",0.461918013971556,0.597007244472672,0.577970901295095,"Zci_06883/Zci_13895",2
"GO:0019219","GO:0019219","regulation of nucleobase-containing compound metabolic process","1/7","168/1957",0.467035904663243,0.597980550830507,0.578913172528958,"Zci_13895",1
"GO:0048519","GO:0048519","negative regulation of biological process","1/7","172/1957",0.475335523981952,0.60297191468081,0.583745380328713,"Zci_07164",1
"GO:0022414","GO:0022414","reproductive process","1/7","176/1957",0.483524113340605,0.607732142455623,0.588353822123769,"Zci_07164",1
"GO:0000003","GO:0000003","reproduction","1/7","179/1957",0.489593438630781,0.609766373567427,0.590323189162472,"Zci_07164",1
"GO:0009719","GO:0009719","response to endogenous stimulus","1/7","186/1957",0.503517944392151,0.615210080246959,0.595593316259061,"Zci_06883",1
"GO:0044260","GO:0044260","cellular macromolecule metabolic process","2/7","450/1957",0.504061881686663,0.615210080246959,0.595593316259061,"Zci_02815/Zci_13895",2
"GO:0009605","GO:0009605","response to external stimulus","1/7","188/1957",0.507436051590557,0.615210080246959,0.595593316259061,"Zci_06883",1
"GO:0090304","GO:0090304","nucleic acid metabolic process","1/7","206/1957",0.541522861428746,0.650777473822264,0.630026597784136,"Zci_13895",1
"GO:1901700","GO:1901700","response to oxygen-containing compound","1/7","213/1957",0.554221551188663,0.655223970760027,0.634331312453042,"Zci_06883",1
"GO:0048731","GO:0048731","system development","1/7","214/1957",0.556010799549717,0.655223970760027,0.634331312453042,"Zci_07164",1
"GO:0080090","GO:0080090","regulation of primary metabolic process","1/7","216/1957",0.559570836342505,0.655223970760027,0.634331312453042,"Zci_13895",1
"GO:0051171","GO:0051171","regulation of nitrogen compound metabolic process","1/7","222/1957",0.570104535032107,0.661901027961006,0.640795463104777,"Zci_13895",1
"GO:0006793","GO:0006793","phosphorus metabolic process","1/7","237/1957",0.59549892466144,0.681659257058234,0.659923675676816,"Zci_02815",1
"GO:0006796","GO:0006796","phosphate-containing compound metabolic process","1/7","240/1957",0.600420379342842,0.681659257058234,0.659923675676816,"Zci_02815",1
"GO:0060255","GO:0060255","regulation of macromolecule metabolic process","1/7","241/1957",0.602049416817857,0.681659257058234,0.659923675676816,"Zci_13895",1
"GO:0031323","GO:0031323","regulation of cellular metabolic process","1/7","245/1957",0.60850877323419,0.683325425681017,0.661536716371941,"Zci_13895",1
"GO:0006464","GO:0006464","cellular protein modification process","1/7","255/1957",0.624265371405413,0.691419881832133,0.669373070386852,"Zci_02815",1
"GO:0036211","GO:0036211","protein modification process","1/7","256/1957",0.62581069596485,0.691419881832133,0.669373070386852,"Zci_02815",1
"GO:0006139","GO:0006139","nucleobase-containing compound metabolic process","1/7","273/1957",0.651260195976651,0.711262997835768,0.688583463137202,"Zci_13895",1
"GO:0007275","GO:0007275","multicellular organism development","1/7","275/1957",0.654154289980342,0.711262997835768,0.688583463137202,"Zci_07164",1
"GO:0019222","GO:0019222","regulation of metabolic process","1/7","287/1957",0.671090295476216,0.723932051025525,0.700848547285564,"Zci_13895",1
"GO:0044267","GO:0044267","cellular protein metabolic process","1/7","299/1957",0.687310395102111,0.735309184039347,0.71186290579299,"Zci_02815",1
"GO:0046483","GO:0046483","heterocycle metabolic process","1/7","305/1957",0.69515994572698,0.735309184039347,0.71186290579299,"Zci_13895",1
"GO:0032501","GO:0032501","multicellular organismal process","1/7","307/1957",0.697738641789161,0.735309184039347,0.71186290579299,"Zci_07164",1
"GO:0006725","GO:0006725","cellular aromatic compound metabolic process","1/7","312/1957",0.704103729616231,0.736352755400181,0.712873201539937,"Zci_13895",1
"GO:0034641","GO:0034641","cellular nitrogen compound metabolic process","1/7","318/1957",0.711589876550327,0.737467390725551,0.713952295285589,"Zci_13895",1
"GO:0019538","GO:0019538","protein metabolic process","1/7","326/1957",0.721318469760758,0.737467390725551,0.713952295285589,"Zci_02815",1
"GO:1901360","GO:1901360","organic cyclic compound metabolic process","1/7","326/1957",0.721318469760758,0.737467390725551,0.713952295285589,"Zci_13895",1
"GO:0048856","GO:0048856","anatomical structure development","1/7","338/1957",0.735383547088753,0.746278118156734,0.722482081350354,"Zci_07164",1
"GO:0032502","GO:0032502","developmental process","1/7","354/1957",0.753187483392717,0.758725626652958,0.734532685042433,"Zci_07164",1
"GO:1901564","GO:1901564","organonitrogen compound metabolic process","1/7","448/1957",0.838451920657568,0.838451920657568,0.811716803709978,"Zci_02815",1
