"","ID","Description","GeneRatio","BgRatio","pvalue","p.adjust","qvalue","geneID","Count"
"GO:0006631","GO:0006631","fatty acid metabolic process","3/25","24/1957",0.00312447081950508,0.383790536719865,0.373821951350518,"Zci_05425/Zci_07831/Zci_02095",3
"GO:0010359","GO:0010359","regulation of anion channel activity","2/25","10/1957",0.00662377604141401,0.383790536719865,0.373821951350518,"Zci_07757/Zci_03470",2
"GO:1903959","GO:1903959","regulation of anion transmembrane transport","2/25","10/1957",0.00662377604141401,0.383790536719865,0.373821951350518,"Zci_07757/Zci_03470",2
"GO:0044070","GO:0044070","regulation of anion transport","2/25","11/1957",0.00803254357284022,0.383790536719865,0.373821951350518,"Zci_07757/Zci_03470",2
"GO:0009606","GO:0009606","tropism","2/25","12/1957",0.00956387243164077,0.383790536719865,0.373821951350518,"Zci_11487/Zci_03470",2
"GO:0006629","GO:0006629","lipid metabolic process","5/25","107/1957",0.0098227705820799,0.383790536719865,0.373821951350518,"Zci_05290/Zci_05425/Zci_07831/Zci_02095/Zci_00507",5
"GO:0006082","GO:0006082","organic acid metabolic process","5/25","109/1957",0.010608300134891,0.383790536719865,0.373821951350518,"Zci_08150/Zci_05425/Zci_05776/Zci_07831/Zci_02095",5
"GO:0043436","GO:0043436","oxoacid metabolic process","5/25","109/1957",0.010608300134891,0.383790536719865,0.373821951350518,"Zci_08150/Zci_05425/Zci_05776/Zci_07831/Zci_02095",5
"GO:0044272","GO:0044272","sulfur compound biosynthetic process","2/25","13/1957",0.0112146585405155,0.383790536719865,0.373821951350518,"Zci_08150/Zci_07831",2
"GO:0022898","GO:0022898","regulation of transmembrane transporter activity","2/25","16/1957",0.0168535227262712,0.389151069193499,0.379043249214447,"Zci_07757/Zci_03470",2
"GO:0032409","GO:0032409","regulation of transporter activity","2/25","16/1957",0.0168535227262712,0.389151069193499,0.379043249214447,"Zci_07757/Zci_03470",2
"GO:0032412","GO:0032412","regulation of ion transmembrane transporter activity","2/25","16/1957",0.0168535227262712,0.389151069193499,0.379043249214447,"Zci_07757/Zci_03470",2
"GO:0032787","GO:0032787","monocarboxylic acid metabolic process","3/25","45/1957",0.0183512296852562,0.389151069193499,0.379043249214447,"Zci_05425/Zci_07831/Zci_02095",3
"GO:0034762","GO:0034762","regulation of transmembrane transport","2/25","17/1957",0.0189521624607223,0.389151069193499,0.379043249214447,"Zci_07757/Zci_03470",2
"GO:0034765","GO:0034765","regulation of ion transmembrane transport","2/25","17/1957",0.0189521624607223,0.389151069193499,0.379043249214447,"Zci_07757/Zci_03470",2
"GO:0044255","GO:0044255","cellular lipid metabolic process","4/25","88/1957",0.0234093285523391,0.450629574632527,0.438924910356358,"Zci_05425/Zci_07831/Zci_02095/Zci_00507",4
"GO:0006633","GO:0006633","fatty acid biosynthetic process","2/25","21/1957",0.0283663335932947,0.49899251926391,0.486031674607704,"Zci_05425/Zci_07831",2
"GO:0044281","GO:0044281","small molecule metabolic process","6/25","191/1957",0.0291619004764623,0.49899251926391,0.486031674607704,"Zci_08150/Zci_01765/Zci_05425/Zci_05776/Zci_07831/Zci_02095",6
"GO:0010029","GO:0010029","regulation of seed germination","2/25","23/1957",0.0336472854868466,0.545440206839408,0.531272928739683,"Zci_01891/Zci_10181",2
"GO:1900140","GO:1900140","regulation of seedling development","2/25","24/1957",0.0364220868202413,0.560900137031716,0.546331302303619,"Zci_01891/Zci_10181",2
"GO:0006813","GO:0006813","potassium ion transport","2/25","25/1957",0.0392830799402578,0.571576016533703,0.556729886234127,"Zci_13725/Zci_04860",2
"GO:0043269","GO:0043269","regulation of ion transport","2/25","26/1957",0.0422278025216239,0.571576016533703,0.556729886234127,"Zci_07757/Zci_03470",2
"GO:0019752","GO:0019752","carboxylic acid metabolic process","4/25","106/1957",0.042682624611283,0.571576016533703,0.556729886234127,"Zci_05425/Zci_05776/Zci_07831/Zci_02095",4
"GO:0007165","GO:0007165","signal transduction","5/25","165/1957",0.0533707285428769,0.67509019061399,0.657555380468173,"Zci_08150/Zci_07757/Zci_06293/Zci_03470/Zci_10181",5
"GO:0072330","GO:0072330","monocarboxylic acid biosynthetic process","2/25","30/1957",0.054796281705681,0.67509019061399,0.657555380468173,"Zci_05425/Zci_07831",2
"GO:0006790","GO:0006790","sulfur compound metabolic process","2/25","38/1957",0.0832577705290092,0.68093924631361,0.663252512643126,"Zci_08150/Zci_07831",2
"GO:0030001","GO:0030001","metal ion transport","2/25","40/1957",0.0909683346197943,0.68093924631361,0.663252512643126,"Zci_13725/Zci_04860",2
"GO:0065009","GO:0065009","regulation of molecular function","3/25","85/1957",0.091414482151191,0.68093924631361,0.663252512643126,"Zci_11487/Zci_07757/Zci_03470",3
"GO:0048584","GO:0048584","positive regulation of response to stimulus","2/25","41/1957",0.0949022019294472,0.68093924631361,0.663252512643126,"Zci_08150/Zci_07757",2
"GO:0051049","GO:0051049","regulation of transport","2/25","41/1957",0.0949022019294472,0.68093924631361,0.663252512643126,"Zci_07757/Zci_03470",2
"GO:1901564","GO:1901564","organonitrogen compound metabolic process","9/25","448/1957",0.0955567308200584,0.68093924631361,0.663252512643126,"Zci_08150/Zci_07757/Zci_01765/Zci_13445/Zci_05425/Zci_13494/Zci_03470/Zci_05776/Zci_07831",9
"GO:0019538","GO:0019538","protein metabolic process","7/25","326/1957",0.107606473391885,0.68093924631361,0.663252512643126,"Zci_08150/Zci_07757/Zci_13445/Zci_13494/Zci_03470/Zci_05776/Zci_07831",7
"GO:0098662","GO:0098662","inorganic cation transmembrane transport","2/25","45/1957",0.111119359791619,0.68093924631361,0.663252512643126,"Zci_13725/Zci_04860",2
"GO:0000413","GO:0000413","protein peptidyl-prolyl isomerization","1/25","10/1957",0.120910042028366,0.68093924631361,0.663252512643126,"Zci_13494",1
"GO:0030258","GO:0030258","lipid modification","1/25","10/1957",0.120910042028366,0.68093924631361,0.663252512643126,"Zci_00507",1
"GO:0031349","GO:0031349","positive regulation of defense response","1/25","10/1957",0.120910042028366,0.68093924631361,0.663252512643126,"Zci_07757",1
"GO:0045860","GO:0045860","positive regulation of protein kinase activity","1/25","10/1957",0.120910042028366,0.68093924631361,0.663252512643126,"Zci_11487",1
"GO:0051604","GO:0051604","protein maturation","1/25","10/1957",0.120910042028366,0.68093924631361,0.663252512643126,"Zci_07831",1
"GO:0051606","GO:0051606","detection of stimulus","1/25","10/1957",0.120910042028366,0.68093924631361,0.663252512643126,"Zci_07757",1
"GO:1904062","GO:1904062","regulation of cation transmembrane transport","1/25","10/1957",0.120910042028366,0.68093924631361,0.663252512643126,"Zci_03470",1
"GO:0016310","GO:0016310","phosphorylation","4/25","151/1957",0.121310011467945,0.68093924631361,0.663252512643126,"Zci_07757/Zci_06293/Zci_13445/Zci_03470",4
"GO:0023052","GO:0023052","signaling","4/25","155/1957",0.130267195809241,0.68093924631361,0.663252512643126,"Zci_08150/Zci_07757/Zci_03470/Zci_10181",4
"GO:0033674","GO:0033674","positive regulation of kinase activity","1/25","11/1957",0.132197791873919,0.68093924631361,0.663252512643126,"Zci_11487",1
"GO:0043043","GO:0043043","peptide biosynthetic process","1/25","11/1957",0.132197791873919,0.68093924631361,0.663252512643126,"Zci_05776",1
"GO:0043271","GO:0043271","negative regulation of ion transport","1/25","11/1957",0.132197791873919,0.68093924631361,0.663252512643126,"Zci_03470",1
"GO:0048511","GO:0048511","rhythmic process","1/25","11/1957",0.132197791873919,0.68093924631361,0.663252512643126,"Zci_03470",1
"GO:0071483","GO:0071483","cellular response to blue light","1/25","11/1957",0.132197791873919,0.68093924631361,0.663252512643126,"Zci_03470",1
"GO:0006006","GO:0006006","glucose metabolic process","1/25","12/1957",0.143346330005035,0.68093924631361,0.663252512643126,"Zci_01765",1
"GO:0007623","GO:0007623","circadian rhythm","1/25","12/1957",0.143346330005035,0.68093924631361,0.663252512643126,"Zci_03470",1
"GO:0010118","GO:0010118","stomatal movement","1/25","12/1957",0.143346330005035,0.68093924631361,0.663252512643126,"Zci_03470",1
"GO:0051051","GO:0051051","negative regulation of transport","1/25","12/1957",0.143346330005035,0.68093924631361,0.663252512643126,"Zci_03470",1
"GO:0051656","GO:0051656","establishment of organelle localization","1/25","12/1957",0.143346330005035,0.68093924631361,0.663252512643126,"Zci_03470",1
"GO:0032879","GO:0032879","regulation of localization","2/25","53/1957",0.145515664914742,0.68093924631361,0.663252512643126,"Zci_07757/Zci_03470",2
"GO:0098660","GO:0098660","inorganic ion transmembrane transport","2/25","53/1957",0.145515664914742,0.68093924631361,0.663252512643126,"Zci_13725/Zci_04860",2
"GO:0033993","GO:0033993","response to lipid","3/25","106/1957",0.150049949956482,0.68093924631361,0.663252512643126,"Zci_13445/Zci_04860/Zci_10181",3
"GO:0001934","GO:0001934","positive regulation of protein phosphorylation","1/25","13/1957",0.154357302627078,0.68093924631361,0.663252512643126,"Zci_11487",1
"GO:0018208","GO:0018208","peptidyl-proline modification","1/25","13/1957",0.154357302627078,0.68093924631361,0.663252512643126,"Zci_13494",1
"GO:0007018","GO:0007018","microtubule-based movement","1/25","14/1957",0.165232337315516,0.68093924631361,0.663252512643126,"Zci_10412",1
"GO:0042327","GO:0042327","positive regulation of phosphorylation","1/25","14/1957",0.165232337315516,0.68093924631361,0.663252512643126,"Zci_11487",1
"GO:0051347","GO:0051347","positive regulation of transferase activity","1/25","14/1957",0.165232337315516,0.68093924631361,0.663252512643126,"Zci_11487",1
"GO:0044267","GO:0044267","cellular protein metabolic process","6/25","299/1957",0.170614021500129,0.68093924631361,0.663252512643126,"Zci_07757/Zci_13445/Zci_13494/Zci_03470/Zci_05776/Zci_07831",6
"GO:0006096","GO:0006096","glycolytic process","1/25","15/1957",0.175973043217272,0.68093924631361,0.663252512643126,"Zci_03774",1
"GO:0010228","GO:0010228","vegetative to reproductive phase transition of meristem","1/25","15/1957",0.175973043217272,0.68093924631361,0.663252512643126,"Zci_10181",1
"GO:0010562","GO:0010562","positive regulation of phosphorus metabolic process","1/25","15/1957",0.175973043217272,0.68093924631361,0.663252512643126,"Zci_11487",1
"GO:0045088","GO:0045088","regulation of innate immune response","1/25","15/1957",0.175973043217272,0.68093924631361,0.663252512643126,"Zci_07757",1
"GO:0045937","GO:0045937","positive regulation of phosphate metabolic process","1/25","15/1957",0.175973043217272,0.68093924631361,0.663252512643126,"Zci_11487",1
"GO:0098655","GO:0098655","cation transmembrane transport","2/25","60/1957",0.17725081699362,0.68093924631361,0.663252512643126,"Zci_13725/Zci_04860",2
"GO:0048580","GO:0048580","regulation of post-embryonic development","2/25","62/1957",0.186528858556828,0.68093924631361,0.663252512643126,"Zci_01891/Zci_10181",2
"GO:0012501","GO:0012501","programmed cell death","1/25","16/1957",0.186581011250005,0.68093924631361,0.663252512643126,"Zci_07757",1
"GO:0007154","GO:0007154","cell communication","4/25","180/1957",0.192249270432618,0.68093924631361,0.663252512643126,"Zci_08150/Zci_07757/Zci_03470/Zci_10181",4
"GO:0016053","GO:0016053","organic acid biosynthetic process","2/25","64/1957",0.195882374927679,0.68093924631361,0.663252512643126,"Zci_05425/Zci_07831",2
"GO:0046394","GO:0046394","carboxylic acid biosynthetic process","2/25","64/1957",0.195882374927679,0.68093924631361,0.663252512643126,"Zci_05425/Zci_07831",2
"GO:0006412","GO:0006412","translation","1/25","17/1957",0.197057814299336,0.68093924631361,0.663252512643126,"Zci_05776",1
"GO:0009967","GO:0009967","positive regulation of signal transduction","1/25","17/1957",0.197057814299336,0.68093924631361,0.663252512643126,"Zci_08150",1
"GO:0019318","GO:0019318","hexose metabolic process","1/25","17/1957",0.197057814299336,0.68093924631361,0.663252512643126,"Zci_01765",1
"GO:0031401","GO:0031401","positive regulation of protein modification process","1/25","17/1957",0.197057814299336,0.68093924631361,0.663252512643126,"Zci_11487",1
"GO:0043604","GO:0043604","amide biosynthetic process","1/25","17/1957",0.197057814299336,0.68093924631361,0.663252512643126,"Zci_05776",1
"GO:0009725","GO:0009725","response to hormone","4/25","182/1957",0.197602418161527,0.68093924631361,0.663252512643126,"Zci_13445/Zci_03470/Zci_04860/Zci_10181",4
"GO:0010876","GO:0010876","lipid localization","1/25","18/1957",0.207405007414035,0.68093924631361,0.663252512643126,"Zci_03393",1
"GO:0023056","GO:0023056","positive regulation of signaling","1/25","18/1957",0.207405007414035,0.68093924631361,0.663252512643126,"Zci_08150",1
"GO:0046467","GO:0046467","membrane lipid biosynthetic process","1/25","18/1957",0.207405007414035,0.68093924631361,0.663252512643126,"Zci_05425",1
"GO:0046496","GO:0046496","nicotinamide nucleotide metabolic process","1/25","18/1957",0.207405007414035,0.68093924631361,0.663252512643126,"Zci_01765",1
"GO:0051640","GO:0051640","organelle localization","1/25","18/1957",0.207405007414035,0.68093924631361,0.663252512643126,"Zci_03470",1
"GO:0071805","GO:0071805","potassium ion transmembrane transport","1/25","18/1957",0.207405007414035,0.68093924631361,0.663252512643126,"Zci_04860",1
"GO:1901566","GO:1901566","organonitrogen compound biosynthetic process","3/25","124/1957",0.208037481399627,0.68093924631361,0.663252512643126,"Zci_08150/Zci_05425/Zci_05776",3
"GO:0009719","GO:0009719","response to endogenous stimulus","4/25","186/1957",0.208459363149534,0.68093924631361,0.663252512643126,"Zci_13445/Zci_03470/Zci_04860/Zci_10181",4
"GO:0006812","GO:0006812","cation transport","2/25","68/1957",0.21477906985716,0.68093924631361,0.663252512643126,"Zci_13725/Zci_04860",2
"GO:0006399","GO:0006399","tRNA metabolic process","1/25","19/1957",0.217624127999207,0.68093924631361,0.663252512643126,"Zci_05776",1
"GO:0006643","GO:0006643","membrane lipid metabolic process","1/25","19/1957",0.217624127999207,0.68093924631361,0.663252512643126,"Zci_05425",1
"GO:0006928","GO:0006928","movement of cell or subcellular component","1/25","19/1957",0.217624127999207,0.68093924631361,0.663252512643126,"Zci_10412",1
"GO:0008219","GO:0008219","cell death","1/25","19/1957",0.217624127999207,0.68093924631361,0.663252512643126,"Zci_07757",1
"GO:0009637","GO:0009637","response to blue light","1/25","19/1957",0.217624127999207,0.68093924631361,0.663252512643126,"Zci_03470",1
"GO:0010647","GO:0010647","positive regulation of cell communication","1/25","19/1957",0.217624127999207,0.68093924631361,0.663252512643126,"Zci_08150",1
"GO:0019362","GO:0019362","pyridine nucleotide metabolic process","1/25","19/1957",0.217624127999207,0.68093924631361,0.663252512643126,"Zci_01765",1
"GO:0044092","GO:0044092","negative regulation of molecular function","1/25","19/1957",0.217624127999207,0.68093924631361,0.663252512643126,"Zci_03470",1
"GO:0045859","GO:0045859","regulation of protein kinase activity","1/25","19/1957",0.217624127999207,0.68093924631361,0.663252512643126,"Zci_11487",1
"GO:0006464","GO:0006464","cellular protein modification process","5/25","255/1957",0.218626373096323,0.68093924631361,0.663252512643126,"Zci_07757/Zci_13445/Zci_13494/Zci_03470/Zci_07831",5
"GO:0009651","GO:0009651","response to salt stress","2/25","69/1957",0.219536369845181,0.68093924631361,0.663252512643126,"Zci_13725/Zci_10181",2
"GO:0036211","GO:0036211","protein modification process","5/25","256/1957",0.221040048313688,0.68093924631361,0.663252512643126,"Zci_07757/Zci_13445/Zci_13494/Zci_03470/Zci_07831",5
"GO:0008610","GO:0008610","lipid biosynthetic process","2/25","70/1957",0.224304823460572,0.68093924631361,0.663252512643126,"Zci_05425/Zci_07831",2
"GO:0043549","GO:0043549","regulation of kinase activity","1/25","20/1957",0.227716696007473,0.68093924631361,0.663252512643126,"Zci_11487",1
"GO:0050776","GO:0050776","regulation of immune response","1/25","20/1957",0.227716696007473,0.68093924631361,0.663252512643126,"Zci_07757",1
"GO:0072524","GO:0072524","pyridine-containing compound metabolic process","1/25","20/1957",0.227716696007473,0.68093924631361,0.663252512643126,"Zci_01765",1
"GO:0006518","GO:0006518","peptide metabolic process","1/25","21/1957",0.237684214128182,0.69062960331585,0.672691172060893,"Zci_05776",1
"GO:0007178","GO:0007178","transmembrane receptor protein serine/threonine kinase signaling pathway","1/25","21/1957",0.237684214128182,0.69062960331585,0.672691172060893,"Zci_08150",1
"GO:0032270","GO:0032270","positive regulation of cellular protein metabolic process","1/25","21/1957",0.237684214128182,0.69062960331585,0.672691172060893,"Zci_11487",1
"GO:0002682","GO:0002682","regulation of immune system process","1/25","22/1957",0.247528167974668,0.699437392075207,0.681270187086241,"Zci_07757",1
"GO:0007167","GO:0007167","enzyme-linked receptor protein signaling pathway","1/25","22/1957",0.247528167974668,0.699437392075207,0.681270187086241,"Zci_08150",1
"GO:0071482","GO:0071482","cellular response to light stimulus","1/25","22/1957",0.247528167974668,0.699437392075207,0.681270187086241,"Zci_03470",1
"GO:0051247","GO:0051247","positive regulation of protein metabolic process","1/25","23/1957",0.257250026269569,0.713810883702947,0.695270341269105,"Zci_11487",1
"GO:0051338","GO:0051338","regulation of transferase activity","1/25","23/1957",0.257250026269569,0.713810883702947,0.695270341269105,"Zci_11487",1
"GO:0005996","GO:0005996","monosaccharide metabolic process","1/25","24/1957",0.266851241028235,0.720966510848213,0.702240107969039,"Zci_01765",1
"GO:0007166","GO:0007166","cell surface receptor signaling pathway","1/25","24/1957",0.266851241028235,0.720966510848213,0.702240107969039,"Zci_08150",1
"GO:0071478","GO:0071478","cellular response to radiation","1/25","24/1957",0.266851241028235,0.720966510848213,0.702240107969039,"Zci_03470",1
"GO:0018205","GO:0018205","peptidyl-lysine modification","1/25","27/1957",0.294945297429494,0.733704773780697,0.714647506929251,"Zci_07831",1
"GO:0033692","GO:0033692","cellular polysaccharide biosynthetic process","1/25","27/1957",0.294945297429494,0.733704773780697,0.714647506929251,"Zci_08150",1
"GO:0051179","GO:0051179","localization","5/25","287/1957",0.299904311052651,0.733704773780697,0.714647506929251,"Zci_11487/Zci_03393/Zci_13725/Zci_03470/Zci_04860",5
"GO:0006970","GO:0006970","response to osmotic stress","2/25","86/1957",0.301357837230124,0.733704773780697,0.714647506929251,"Zci_13725/Zci_10181",2
"GO:0018193","GO:0018193","peptidyl-amino acid modification","2/25","86/1957",0.301357837230124,0.733704773780697,0.714647506929251,"Zci_13494/Zci_07831",2
"GO:0001932","GO:0001932","regulation of protein phosphorylation","1/25","28/1957",0.304078130364345,0.733704773780697,0.714647506929251,"Zci_11487",1
"GO:0043412","GO:0043412","macromolecule modification","5/25","291/1957",0.310535760728881,0.733704773780697,0.714647506929251,"Zci_07757/Zci_13445/Zci_13494/Zci_03470/Zci_07831",5
"GO:0051649","GO:0051649","establishment of localization in cell","2/25","88/1957",0.310995009766218,0.733704773780697,0.714647506929251,"Zci_03393/Zci_03470",2
"GO:2000026","GO:2000026","regulation of multicellular organismal development","2/25","88/1957",0.310995009766218,0.733704773780697,0.714647506929251,"Zci_01891/Zci_10181",2
"GO:0007017","GO:0007017","microtubule-based process","1/25","29/1957",0.313097335517736,0.733704773780697,0.714647506929251,"Zci_10412",1
"GO:0019693","GO:0019693","ribose phosphate metabolic process","1/25","29/1957",0.313097335517736,0.733704773780697,0.714647506929251,"Zci_01765",1
"GO:0042325","GO:0042325","regulation of phosphorylation","1/25","29/1957",0.313097335517736,0.733704773780697,0.714647506929251,"Zci_11487",1
"GO:0048518","GO:0048518","positive regulation of biological process","3/25","155/1957",0.317363896354284,0.733704773780697,0.714647506929251,"Zci_11487/Zci_08150/Zci_07757",3
"GO:0000160","GO:0000160","phosphorelay signal transduction system","1/25","30/1957",0.322004268407807,0.733704773780697,0.714647506929251,"Zci_06293",1
"GO:0007010","GO:0007010","cytoskeleton organization","1/25","30/1957",0.322004268407807,0.733704773780697,0.714647506929251,"Zci_11487",1
"GO:0009826","GO:0009826","unidimensional cell growth","1/25","30/1957",0.322004268407807,0.733704773780697,0.714647506929251,"Zci_13445",1
"GO:0009737","GO:0009737","response to abscisic acid","2/25","91/1957",0.325414752105049,0.733704773780697,0.714647506929251,"Zci_04860/Zci_10181",2
"GO:0045087","GO:0045087","innate immune response","1/25","31/1957",0.33080026907714,0.733704773780697,0.714647506929251,"Zci_07757",1
"GO:0006468","GO:0006468","protein phosphorylation","3/25","160/1957",0.335501760210584,0.733704773780697,0.714647506929251,"Zci_07757/Zci_13445/Zci_03470",3
"GO:0009101","GO:0009101","glycoprotein biosynthetic process","1/25","32/1957",0.339486662261497,0.733704773780697,0.714647506929251,"Zci_08150",1
"GO:0040008","GO:0040008","regulation of growth","1/25","32/1957",0.339486662261497,0.733704773780697,0.714647506929251,"Zci_01891",1
"GO:0044283","GO:0044283","small molecule biosynthetic process","2/25","94/1957",0.33977618342459,0.733704773780697,0.714647506929251,"Zci_05425/Zci_07831",2
"GO:0044260","GO:0044260","cellular macromolecule metabolic process","7/25","450/1957",0.346265071826752,0.733704773780697,0.714647506929251,"Zci_08150/Zci_07757/Zci_13445/Zci_13494/Zci_03470/Zci_05776/Zci_07831",7
"GO:0000271","GO:0000271","polysaccharide biosynthetic process","1/25","33/1957",0.348064757556802,0.733704773780697,0.714647506929251,"Zci_08150",1
"GO:0006955","GO:0006955","immune response","1/25","33/1957",0.348064757556802,0.733704773780697,0.714647506929251,"Zci_07757",1
"GO:0019220","GO:0019220","regulation of phosphate metabolic process","1/25","33/1957",0.348064757556802,0.733704773780697,0.714647506929251,"Zci_11487",1
"GO:0051174","GO:0051174","regulation of phosphorus metabolic process","1/25","33/1957",0.348064757556802,0.733704773780697,0.714647506929251,"Zci_11487",1
"GO:0010033","GO:0010033","response to organic substance","4/25","234/1957",0.34969897574275,0.733704773780697,0.714647506929251,"Zci_13445/Zci_03470/Zci_04860/Zci_10181",4
"GO:0033036","GO:0033036","macromolecule localization","2/25","97/1957",0.354063466394126,0.733704773780697,0.714647506929251,"Zci_11487/Zci_03393",2
"GO:0009658","GO:0009658","chloroplast organization","1/25","34/1957",0.35653584958439,0.733704773780697,0.714647506929251,"Zci_03470",1
"GO:0009738","GO:0009738","abscisic acid-activated signaling pathway","1/25","34/1957",0.35653584958439,0.733704773780697,0.714647506929251,"Zci_10181",1
"GO:0034637","GO:0034637","cellular carbohydrate biosynthetic process","1/25","34/1957",0.35653584958439,0.733704773780697,0.714647506929251,"Zci_08150",1
"GO:0071214","GO:0071214","cellular response to abiotic stimulus","1/25","34/1957",0.35653584958439,0.733704773780697,0.714647506929251,"Zci_03470",1
"GO:0104004","GO:0104004","cellular response to environmental stimulus","1/25","34/1957",0.35653584958439,0.733704773780697,0.714647506929251,"Zci_03470",1
"GO:0006793","GO:0006793","phosphorus metabolic process","4/25","237/1957",0.358907288269661,0.733704773780697,0.714647506929251,"Zci_07757/Zci_01765/Zci_13445/Zci_03470",4
"GO:0034220","GO:0034220","ion transmembrane transport","2/25","99/1957",0.363539845484001,0.733704773780697,0.714647506929251,"Zci_13725/Zci_04860",2
"GO:0097305","GO:0097305","response to alcohol","2/25","99/1957",0.363539845484001,0.733704773780697,0.714647506929251,"Zci_04860/Zci_10181",2
"GO:0019684","GO:0019684","photosynthesis, light reaction","1/25","35/1957",0.364901218154536,0.733704773780697,0.714647506929251,"Zci_00705",1
"GO:0031347","GO:0031347","regulation of defense response","1/25","35/1957",0.364901218154536,0.733704773780697,0.714647506929251,"Zci_07757",1
"GO:0006796","GO:0006796","phosphate-containing compound metabolic process","4/25","240/1957",0.368128174845672,0.733704773780697,0.714647506929251,"Zci_07757/Zci_01765/Zci_13445/Zci_03470",4
"GO:0010119","GO:0010119","regulation of stomatal movement","1/25","36/1957",0.373162128428281,0.733704773780697,0.714647506929251,"Zci_03470",1
"GO:0043603","GO:0043603","cellular amide metabolic process","1/25","36/1957",0.373162128428281,0.733704773780697,0.714647506929251,"Zci_05776",1
"GO:0034660","GO:0034660","ncRNA metabolic process","1/25","37/1957",0.381319831077574,0.733704773780697,0.714647506929251,"Zci_05776",1
"GO:0051726","GO:0051726","regulation of cell cycle","1/25","37/1957",0.381319831077574,0.733704773780697,0.714647506929251,"Zci_11487",1
"GO:0051239","GO:0051239","regulation of multicellular organismal process","2/25","104/1957",0.387031895612641,0.733704773780697,0.714647506929251,"Zci_01891/Zci_10181",2
"GO:0009100","GO:0009100","glycoprotein metabolic process","1/25","38/1957",0.389375562443751,0.733704773780697,0.714647506929251,"Zci_08150",1
"GO:0051641","GO:0051641","cellular localization","2/25","106/1957",0.396339462568984,0.733704773780697,0.714647506929251,"Zci_03393/Zci_03470",2
"GO:0043085","GO:0043085","positive regulation of catalytic activity","1/25","39/1957",0.397330544694354,0.733704773780697,0.714647506929251,"Zci_11487",1
"GO:0060560","GO:0060560","developmental growth involved in morphogenesis","1/25","39/1957",0.397330544694354,0.733704773780697,0.714647506929251,"Zci_13445",1
"GO:0002376","GO:0002376","immune system process","1/25","40/1957",0.405185985978317,0.733704773780697,0.714647506929251,"Zci_07757",1
"GO:0009735","GO:0009735","response to cytokinin","1/25","40/1957",0.405185985978317,0.733704773780697,0.714647506929251,"Zci_03470",1
"GO:0014070","GO:0014070","response to organic cyclic compound","1/25","40/1957",0.405185985978317,0.733704773780697,0.714647506929251,"Zci_13445",1
"GO:0031399","GO:0031399","regulation of protein modification process","1/25","40/1957",0.405185985978317,0.733704773780697,0.714647506929251,"Zci_11487",1
"GO:0006811","GO:0006811","ion transport","2/25","111/1957",0.419355967819594,0.733704773780697,0.714647506929251,"Zci_13725/Zci_04860",2
"GO:0006486","GO:0006486","protein glycosylation","1/25","42/1957",0.420603009068845,0.733704773780697,0.714647506929251,"Zci_08150",1
"GO:0016049","GO:0016049","cell growth","1/25","42/1957",0.420603009068845,0.733704773780697,0.714647506929251,"Zci_13445",1
"GO:0044093","GO:0044093","positive regulation of molecular function","1/25","42/1957",0.420603009068845,0.733704773780697,0.714647506929251,"Zci_11487",1
"GO:0045893","GO:0045893","positive regulation of transcription, DNA-templated","1/25","42/1957",0.420603009068845,0.733704773780697,0.714647506929251,"Zci_11487",1
"GO:0009657","GO:0009657","plastid organization","1/25","43/1957",0.42816693845437,0.733704773780697,0.714647506929251,"Zci_03470",1
"GO:0044264","GO:0044264","cellular polysaccharide metabolic process","1/25","43/1957",0.42816693845437,0.733704773780697,0.714647506929251,"Zci_08150",1
"GO:1902680","GO:1902680","positive regulation of RNA biosynthetic process","1/25","43/1957",0.42816693845437,0.733704773780697,0.714647506929251,"Zci_11487",1
"GO:1903508","GO:1903508","positive regulation of nucleic acid-templated transcription","1/25","43/1957",0.42816693845437,0.733704773780697,0.714647506929251,"Zci_11487",1
"GO:0006520","GO:0006520","cellular amino acid metabolic process","1/25","44/1957",0.435636022330357,0.733704773780697,0.714647506929251,"Zci_05776",1
"GO:0006753","GO:0006753","nucleoside phosphate metabolic process","1/25","44/1957",0.435636022330357,0.733704773780697,0.714647506929251,"Zci_01765",1
"GO:0009117","GO:0009117","nucleotide metabolic process","1/25","44/1957",0.435636022330357,0.733704773780697,0.714647506929251,"Zci_01765",1
"GO:0046777","GO:0046777","protein autophosphorylation","1/25","44/1957",0.435636022330357,0.733704773780697,0.714647506929251,"Zci_03470",1
"GO:0051234","GO:0051234","establishment of localization","4/25","262/1957",0.435670167958665,0.733704773780697,0.714647506929251,"Zci_03393/Zci_13725/Zci_03470/Zci_04860",4
"GO:0009605","GO:0009605","response to external stimulus","3/25","188/1957",0.436493002915856,0.733704773780697,0.714647506929251,"Zci_11487/Zci_07757/Zci_03470",3
"GO:0050793","GO:0050793","regulation of developmental process","2/25","116/1957",0.441974971104966,0.733704773780697,0.714647506929251,"Zci_01891/Zci_10181",2
"GO:1901135","GO:1901135","carbohydrate derivative metabolic process","2/25","116/1957",0.441974971104966,0.733704773780697,0.714647506929251,"Zci_08150/Zci_01765",2
"GO:0055085","GO:0055085","transmembrane transport","3/25","190/1957",0.443575548713267,0.733704773780697,0.714647506929251,"Zci_13725/Zci_07010/Zci_04860",3
"GO:0000902","GO:0000902","cell morphogenesis","1/25","46/1957",0.450294201743243,0.733704773780697,0.714647506929251,"Zci_13445",1
"GO:0048589","GO:0048589","developmental growth","1/25","46/1957",0.450294201743243,0.733704773780697,0.714647506929251,"Zci_13445",1
"GO:0071215","GO:0071215","cellular response to abscisic acid stimulus","1/25","46/1957",0.450294201743243,0.733704773780697,0.714647506929251,"Zci_10181",1
"GO:0097306","GO:0097306","cellular response to alcohol","1/25","46/1957",0.450294201743243,0.733704773780697,0.714647506929251,"Zci_10181",1
"GO:0010467","GO:0010467","gene expression","2/25","119/1957",0.45533847270292,0.733704773780697,0.714647506929251,"Zci_05776/Zci_07831",2
"GO:0032259","GO:0032259","methylation","1/25","47/1957",0.457485538716774,0.733704773780697,0.714647506929251,"Zci_00507",1
"GO:0051254","GO:0051254","positive regulation of RNA metabolic process","1/25","47/1957",0.457485538716774,0.733704773780697,0.714647506929251,"Zci_11487",1
"GO:0034645","GO:0034645","cellular macromolecule biosynthetic process","2/25","120/1957",0.459756562791151,0.733704773780697,0.714647506929251,"Zci_08150/Zci_05776",2
"GO:0048522","GO:0048522","positive regulation of cellular process","2/25","121/1957",0.46415599852811,0.73690746158071,0.717767008033159,"Zci_11487/Zci_08150",2
"GO:0048583","GO:0048583","regulation of response to stimulus","2/25","124/1957",0.477239866985414,0.748145629859548,0.728713275837222,"Zci_08150/Zci_07757",2
"GO:0044249","GO:0044249","cellular biosynthetic process","4/25","276/1957",0.478035802126737,0.748145629859548,0.728713275837222,"Zci_08150/Zci_05425/Zci_05776/Zci_07831",4
"GO:0031328","GO:0031328","positive regulation of cellular biosynthetic process","1/25","50/1957",0.478521717799776,0.748145629859548,0.728713275837222,"Zci_11487",1
"GO:0010557","GO:0010557","positive regulation of macromolecule biosynthetic process","1/25","51/1957",0.485358087519233,0.755001469474363,0.735391041695808,"Zci_11487",1
"GO:0032268","GO:0032268","regulation of cellular protein metabolic process","1/25","52/1957",0.492108374933724,0.760487440566481,0.740734520032287,"Zci_11487",1
"GO:0010628","GO:0010628","positive regulation of gene expression","1/25","53/1957",0.498773619357166,0.760487440566481,0.740734520032287,"Zci_11487",1
"GO:0071396","GO:0071396","cellular response to lipid","1/25","53/1957",0.498773619357166,0.760487440566481,0.740734520032287,"Zci_10181",1
"GO:0005976","GO:0005976","polysaccharide metabolic process","1/25","54/1957",0.505354848094598,0.760487440566481,0.740734520032287,"Zci_08150",1
"GO:0015979","GO:0015979","photosynthesis","1/25","54/1957",0.505354848094598,0.760487440566481,0.740734520032287,"Zci_00705",1
"GO:0042221","GO:0042221","response to chemical","5/25","364/1957",0.509192591454077,0.760487440566481,0.740734520032287,"Zci_01765/Zci_13445/Zci_03470/Zci_04860/Zci_10181",5
"GO:0032989","GO:0032989","cellular component morphogenesis","1/25","55/1957",0.5118530765747,0.760487440566481,0.740734520032287,"Zci_13445",1
"GO:0045935","GO:0045935","positive regulation of nucleobase-containing compound metabolic process","1/25","55/1957",0.5118530765747,0.760487440566481,0.740734520032287,"Zci_11487",1
"GO:0009059","GO:0009059","macromolecule biosynthetic process","2/25","133/1957",0.515409718527857,0.760487440566481,0.740734520032287,"Zci_08150/Zci_05776",2
"GO:0006091","GO:0006091","generation of precursor metabolites and energy","1/25","56/1957",0.518269308480922,0.760487440566481,0.740734520032287,"Zci_00705",1
"GO:1901700","GO:1901700","response to oxygen-containing compound","3/25","213/1957",0.522662908958742,0.760487440566481,0.740734520032287,"Zci_13445/Zci_04860/Zci_10181",3
"GO:0009966","GO:0009966","regulation of signal transduction","1/25","57/1957",0.524604535881225,0.760487440566481,0.740734520032287,"Zci_08150",1
"GO:1901576","GO:1901576","organic substance biosynthetic process","4/25","293/1957",0.528156298290616,0.760487440566481,0.740734520032287,"Zci_08150/Zci_05425/Zci_05776/Zci_07831",4
"GO:0009891","GO:0009891","positive regulation of biosynthetic process","1/25","58/1957",0.530859739356472,0.760487440566481,0.740734520032287,"Zci_11487",1
"GO:0016051","GO:0016051","carbohydrate biosynthetic process","1/25","58/1957",0.530859739356472,0.760487440566481,0.740734520032287,"Zci_08150",1
"GO:0046686","GO:0046686","response to cadmium ion","1/25","58/1957",0.530859739356472,0.760487440566481,0.740734520032287,"Zci_01765",1
"GO:0051246","GO:0051246","regulation of protein metabolic process","1/25","58/1957",0.530859739356472,0.760487440566481,0.740734520032287,"Zci_11487",1
"GO:0044262","GO:0044262","cellular carbohydrate metabolic process","1/25","59/1957",0.537035888127451,0.763859605368103,0.744019096137763,"Zci_08150",1
"GO:0010646","GO:0010646","regulation of cell communication","1/25","60/1957",0.543133940180567,0.763859605368103,0.744019096137763,"Zci_08150",1
"GO:0023051","GO:0023051","regulation of signaling","1/25","60/1957",0.543133940180567,0.763859605368103,0.744019096137763,"Zci_08150",1
"GO:0050790","GO:0050790","regulation of catalytic activity","1/25","60/1957",0.543133940180567,0.763859605368103,0.744019096137763,"Zci_11487",1
"GO:0040007","GO:0040007","growth","1/25","62/1957",0.555099530651805,0.766400193888844,0.746493695346277,"Zci_13445",1
"GO:0009414","GO:0009414","response to water deprivation","1/25","63/1957",0.560968929983576,0.766400193888844,0.746493695346277,"Zci_10181",1
"GO:0009415","GO:0009415","response to water","1/25","63/1957",0.560968929983576,0.766400193888844,0.746493695346277,"Zci_10181",1
"GO:0009755","GO:0009755","hormone-mediated signaling pathway","1/25","63/1957",0.560968929983576,0.766400193888844,0.746493695346277,"Zci_10181",1
"GO:0071229","GO:0071229","cellular response to acid chemical","1/25","63/1957",0.560968929983576,0.766400193888844,0.746493695346277,"Zci_10181",1
"GO:0080134","GO:0080134","regulation of response to stress","1/25","63/1957",0.560968929983576,0.766400193888844,0.746493695346277,"Zci_07757",1
"GO:0051716","GO:0051716","cellular response to stimulus","4/25","305/1957",0.562358583827528,0.766400193888844,0.746493695346277,"Zci_08150/Zci_07757/Zci_03470/Zci_10181",4
"GO:0035556","GO:0035556","intracellular signal transduction","1/25","65/1957",0.572485508356028,0.776764478298047,0.756588777563032,"Zci_03470",1
"GO:0009058","GO:0009058","biosynthetic process","4/25","310/1957",0.576272425132129,0.777578258221279,0.757381420345401,"Zci_08150/Zci_05425/Zci_05776/Zci_07831",4
"GO:0055086","GO:0055086","nucleobase-containing small molecule metabolic process","1/25","66/1957",0.57813448419699,0.777578258221279,0.757381420345401,"Zci_01765",1
"GO:0006979","GO:0006979","response to oxidative stress","1/25","67/1957",0.583711764945311,0.781666189578938,0.761363171667797,"Zci_06652",1
"GO:0009628","GO:0009628","response to abiotic stimulus","4/25","317/1957",0.595389219444698,0.793852292592931,0.773232752525582,"Zci_11487/Zci_13725/Zci_03470/Zci_10181",4
"GO:0008104","GO:0008104","protein localization","1/25","70/1957",0.600022110740948,0.796581078052639,0.775890660440882,"Zci_11487",1
"GO:0005975","GO:0005975","carbohydrate metabolic process","2/25","157/1957",0.608535738714861,0.803176193776445,0.782314474457577,"Zci_08150/Zci_01765",2
"GO:0009617","GO:0009617","response to bacterium","1/25","72/1957",0.610552925818148,0.803176193776445,0.782314474457577,"Zci_07757",1
"GO:0001101","GO:0001101","response to acid chemical","2/25","159/1957",0.615699422287626,0.803176193776445,0.782314474457577,"Zci_04860/Zci_10181",2
"GO:0032870","GO:0032870","cellular response to hormone stimulus","1/25","74/1957",0.620817289732451,0.803176193776445,0.782314474457577,"Zci_10181",1
"GO:0065003","GO:0065003","protein-containing complex assembly","1/25","74/1957",0.620817289732451,0.803176193776445,0.782314474457577,"Zci_00705",1
"GO:0010035","GO:0010035","response to inorganic substance","2/25","161/1957",0.622769659474753,0.803176193776445,0.782314474457577,"Zci_01765/Zci_10181",2
"GO:0051173","GO:0051173","positive regulation of nitrogen compound metabolic process","1/25","75/1957",0.625851579566061,0.803176193776445,0.782314474457577,"Zci_11487",1
"GO:1901137","GO:1901137","carbohydrate derivative biosynthetic process","1/25","75/1957",0.625851579566061,0.803176193776445,0.782314474457577,"Zci_08150",1
"GO:0016043","GO:0016043","cellular component organization","4/25","334/1957",0.639911255249851,0.815273943881985,0.794097997287648,"Zci_11487/Zci_13445/Zci_00705/Zci_03470",4
"GO:0071495","GO:0071495","cellular response to endogenous stimulus","1/25","78/1957",0.640572384478702,0.815273943881985,0.794097997287648,"Zci_10181",1
"GO:0046907","GO:0046907","intracellular transport","1/25","79/1957",0.645354550730981,0.817980253601408,0.796734013248125,"Zci_03393",1
"GO:0019637","GO:0019637","organophosphate metabolic process","1/25","80/1957",0.650075603037544,0.819039236149101,0.797765489755618,"Zci_01765",1
"GO:0006810","GO:0006810","transport","3/25","255/1957",0.651508483300421,0.819039236149101,0.797765489755618,"Zci_03393/Zci_13725/Zci_04860",3
"GO:0010038","GO:0010038","response to metal ion","1/25","83/1957",0.663879521127373,0.830064370343474,0.808504256828059,"Zci_01765",1
"GO:0031325","GO:0031325","positive regulation of cellular metabolic process","1/25","84/1957",0.668363518977862,0.830064370343474,0.808504256828059,"Zci_11487",1
"GO:0043933","GO:0043933","protein-containing complex organization","1/25","84/1957",0.668363518977862,0.830064370343474,0.808504256828059,"Zci_00705",1
"GO:0010604","GO:0010604","positive regulation of macromolecule metabolic process","1/25","85/1957",0.672790060368974,0.83220617909094,0.810590434179487,"Zci_11487",1
"GO:1901701","GO:1901701","cellular response to oxygen-containing compound","1/25","86/1957",0.677159851229432,0.83426093671466,0.812591821475318,"Zci_10181",1
"GO:0018130","GO:0018130","heterocycle biosynthetic process","1/25","87/1957",0.681473589187349,0.836230539719935,0.814510265960975,"Zci_07831",1
"GO:0050794","GO:0050794","regulation of cellular process","5/25","439/1957",0.691705650999963,0.845418017888844,0.823459108333289,"Zci_11487/Zci_08150/Zci_07757/Zci_03470/Zci_10181",5
"GO:0044271","GO:0044271","cellular nitrogen compound biosynthetic process","1/25","97/1957",0.721675786036051,0.878561826478671,0.855742038777927,"Zci_05776",1
"GO:0009893","GO:0009893","positive regulation of metabolic process","1/25","98/1957",0.725416702890405,0.879138258623659,0.856303498659408,"Zci_11487",1
"GO:0071310","GO:0071310","cellular response to organic substance","1/25","99/1957",0.729109323884349,0.879138258623659,0.856303498659408,"Zci_10181",1
"GO:0071840","GO:0071840","cellular component organization or biogenesis","4/25","373/1957",0.730712318856028,0.879138258623659,0.856303498659408,"Zci_11487/Zci_13445/Zci_00705/Zci_03470",4
"GO:1901362","GO:1901362","organic cyclic compound biosynthetic process","1/25","104/1957",0.746868669468395,0.895079961853174,0.871831131675169,"Zci_07831",1
"GO:0048869","GO:0048869","cellular developmental process","1/25","109/1957",0.76350734515093,0.908942185380446,0.885333297448487,"Zci_13445",1
"GO:0022607","GO:0022607","cellular component assembly","1/25","111/1957",0.769864384025952,0.908942185380446,0.885333297448487,"Zci_00705",1
"GO:0046483","GO:0046483","heterocycle metabolic process","3/25","305/1957",0.772570107859768,0.908942185380446,0.885333297448487,"Zci_01765/Zci_05776/Zci_07831",3
"GO:0006952","GO:0006952","defense response","1/25","113/1957",0.77605720089918,0.908942185380446,0.885333297448487,"Zci_07757",1
"GO:0009416","GO:0009416","response to light stimulus","1/25","114/1957",0.779093301754668,0.908942185380446,0.885333297448487,"Zci_03470",1
"GO:0048608","GO:0048608","reproductive structure development","1/25","114/1957",0.779093301754668,0.908942185380446,0.885333297448487,"Zci_10181",1
"GO:0061458","GO:0061458","reproductive system development","1/25","114/1957",0.779093301754668,0.908942185380446,0.885333297448487,"Zci_10181",1
"GO:0009653","GO:0009653","anatomical structure morphogenesis","1/25","119/1957",0.793690538626664,0.916054304013878,0.892260685727803,"Zci_13445",1
"GO:0006996","GO:0006996","organelle organization","2/25","223/1957",0.797114316075654,0.916054304013878,0.892260685727803,"Zci_11487/Zci_03470",2
"GO:0009314","GO:0009314","response to radiation","1/25","123/1957",0.804697069882104,0.916054304013878,0.892260685727803,"Zci_03470",1
"GO:0016070","GO:0016070","RNA metabolic process","1/25","125/1957",0.809986719587593,0.916054304013878,0.892260685727803,"Zci_05776",1
"GO:0071702","GO:0071702","organic substance transport","1/25","125/1957",0.809986719587593,0.916054304013878,0.892260685727803,"Zci_03393",1
"GO:1901360","GO:1901360","organic cyclic compound metabolic process","3/25","326/1957",0.812800689010525,0.916054304013878,0.892260685727803,"Zci_01765/Zci_05776/Zci_07831",3
"GO:0006950","GO:0006950","response to stress","4/25","419/1957",0.81626655586622,0.916054304013878,0.892260685727803,"Zci_07757/Zci_13725/Zci_10181/Zci_06652",4
"GO:0065008","GO:0065008","regulation of biological quality","1/25","128/1957",0.8176641117096,0.916054304013878,0.892260685727803,"Zci_04860",1
"GO:0070887","GO:0070887","cellular response to chemical stimulus","1/25","128/1957",0.8176641117096,0.916054304013878,0.892260685727803,"Zci_10181",1
"GO:0043207","GO:0043207","response to external biotic stimulus","1/25","132/1957",0.827438582695286,0.916054304013878,0.892260685727803,"Zci_07757",1
"GO:0051707","GO:0051707","response to other organism","1/25","132/1957",0.827438582695286,0.916054304013878,0.892260685727803,"Zci_07757",1
"GO:0006508","GO:0006508","proteolysis","1/25","133/1957",0.829802437726857,0.916054304013878,0.892260685727803,"Zci_14600",1
"GO:0009607","GO:0009607","response to biotic stimulus","1/25","133/1957",0.829802437726857,0.916054304013878,0.892260685727803,"Zci_07757",1
"GO:1903506","GO:1903506","regulation of nucleic acid-templated transcription","1/25","133/1957",0.829802437726857,0.916054304013878,0.892260685727803,"Zci_11487",1
"GO:2001141","GO:2001141","regulation of RNA biosynthetic process","1/25","133/1957",0.829802437726857,0.916054304013878,0.892260685727803,"Zci_11487",1
"GO:0009791","GO:0009791","post-embryonic development","1/25","143/1957",0.85179351370478,0.936972865075258,0.912635907540835,"Zci_10181",1
"GO:0003006","GO:0003006","developmental process involved in reproduction","1/25","145/1957",0.855851549199648,0.938086395564027,0.913720515159767,"Zci_10181",1
"GO:0051252","GO:0051252","regulation of RNA metabolic process","1/25","147/1957",0.859802799149212,0.939075397652331,0.91468382888214,"Zci_11487",1
"GO:2000112","GO:2000112","regulation of cellular macromolecule biosynthetic process","1/25","150/1957",0.865535330584471,0.941996048833982,0.917528618994139,"Zci_11487",1
"GO:0010556","GO:0010556","regulation of macromolecule biosynthetic process","1/25","153/1957",0.871042470318383,0.94465169316219,0.920115285547587,"Zci_11487",1
"GO:0033554","GO:0033554","cellular response to stress","1/25","155/1957",0.874592892804369,0.945174073627178,0.920624097688809,"Zci_07757",1
"GO:0006139","GO:0006139","nucleobase-containing compound metabolic process","2/25","273/1957",0.883470981951455,0.95120790832084,0.926501209403415,"Zci_01765/Zci_05776",2
"GO:0031326","GO:0031326","regulation of cellular biosynthetic process","1/25","163/1957",0.887878712765934,0.95120790832084,0.926501209403415,"Zci_11487",1
"GO:0044085","GO:0044085","cellular component biogenesis","1/25","164/1957",0.889441161027279,0.95120790832084,0.926501209403415,"Zci_00705",1
"GO:0019219","GO:0019219","regulation of nucleobase-containing compound metabolic process","1/25","168/1957",0.89548448214033,0.953857987036781,0.929082454905956,"Zci_11487",1
"GO:0009889","GO:0009889","regulation of biosynthetic process","1/25","172/1957",0.901209981258777,0.953857987036781,0.929082454905956,"Zci_11487",1
"GO:0048519","GO:0048519","negative regulation of biological process","1/25","172/1957",0.901209981258777,0.953857987036781,0.929082454905956,"Zci_03470",1
"GO:0022414","GO:0022414","reproductive process","1/25","176/1957",0.906633711736416,0.953870438831692,0.929094583277623,"Zci_10181",1
"GO:0006355","GO:0006355","regulation of transcription, DNA-templated","1/25","178/1957",0.909237216863097,0.953870438831692,0.929094583277623,"Zci_11487",1
"GO:0000003","GO:0000003","reproduction","1/25","179/1957",0.91051269161207,0.953870438831692,0.929094583277623,"Zci_10181",1
"GO:0010468","GO:0010468","regulation of gene expression","1/25","191/1957",0.924537281310766,0.96412068146363,0.939078585841198,"Zci_11487",1
"GO:0006725","GO:0006725","cellular aromatic compound metabolic process","2/25","312/1957",0.926557538029982,0.96412068146363,0.939078585841198,"Zci_01765/Zci_05776",2
"GO:0034641","GO:0034641","cellular nitrogen compound metabolic process","2/25","318/1957",0.931737984266288,0.966246798498373,0.941149479056857,"Zci_01765/Zci_05776",2
"GO:0090304","GO:0090304","nucleic acid metabolic process","1/25","206/1957",0.939119153551791,0.9693234940741,0.944146260461785,"Zci_05776",1
"GO:0048731","GO:0048731","system development","1/25","214/1957",0.945747848740812,0.9693234940741,0.944146260461785,"Zci_10181",1
"GO:0048856","GO:0048856","anatomical structure development","2/25","338/1957",0.946720352948011,0.9693234940741,0.944146260461785,"Zci_13445/Zci_10181",2
"GO:0080090","GO:0080090","regulation of primary metabolic process","1/25","216/1957",0.947293414663325,0.9693234940741,0.944146260461785,"Zci_11487",1
"GO:0051171","GO:0051171","regulation of nitrogen compound metabolic process","1/25","222/1957",0.951680622977524,0.970588185023435,0.945378102295553,"Zci_11487",1
"GO:0032502","GO:0032502","developmental process","2/25","354/1957",0.956490110000915,0.972273775182448,0.947019910891995,"Zci_13445/Zci_10181",2
"GO:0060255","GO:0060255","regulation of macromolecule metabolic process","1/25","241/1957",0.963379268213678,0.974965361903429,0.949641586269574,"Zci_11487",1
"GO:0031323","GO:0031323","regulation of cellular metabolic process","1/25","245/1957",0.965468946040734,0.974965361903429,0.949641586269574,"Zci_11487",1
"GO:0007275","GO:0007275","multicellular organism development","1/25","275/1957",0.977874400987769,0.984265736941938,0.958700393125264,"Zci_10181",1
"GO:0019222","GO:0019222","regulation of metabolic process","1/25","287/1957",0.981524553476484,0.984721701859144,0.959144514797867,"Zci_11487",1
"GO:0032501","GO:0032501","multicellular organismal process","1/25","307/1957",0.986359612734359,0.986359612734359,0.960739882533467,"Zci_10181",1
