GeneID	HOG	OG	Gene Tree Parent Clade	A_agrestis_oxf	A_filiculoides	A_thaliana	B_distachyon	C_braunii	C_melkonianii	C_reinhardtii	Closterium_sp_NIES_67	K_nitens	M_endlicherianum	M_polymorpha	M_viride	O_lucimarinus	O_sativa	P_coloniale	P_margaritaceum	P_patens	S_lycopersicum	S_moellendorffii	S_muscicola	Z_circumcarinatum_SAG698_1a	Z_circumcarinatum_SAG698_1b	Z_circumcarinatum_UTEX1559	Z_circumcarinatum_UTEX1560	Z_mays
Zci_08319	N0.HOG0004106	OG0003061	n0	AagrOXF_evm.TU.utg000059l.352	Azfi_s0022.g016085, Azfi_s0045.g030012	AT2G18245, AT3G19970	Bradi3g03050, Bradi1g29457, Bradi1g29424	CBR_g28544	Chrsp119S01787	Cre08.g381650_4532	CLOP_g18399, CLOP_g18397	13547	Me1_v2_0180570, Me1_v2_0180590	Mp1g12310	9192	Olucimarinus_93463	LOC_Os02g04110, LOC_Os06g51390	PRCOL_00001555_RA, PRCOL_00006941_RA	pm024845g0020, pm016531g0010	Pp3c24_12450, Pp3c23_11600, Pp3c20_16960, Pp3c23_5980	Solyc02g085080, Solyc02g020890	33888, 65425	SM000120S25723, SM000250S08724	Zci1a_44603	Zci_08319	UTEX1559_06946	UTEX1560_15747	Zm00001d015181
Zci_00880	N0.HOG0003284	OG0002344	n0	AagrOXF_evm.TU.utg000100l.263	Azfi_s0027.g023672, Azfi_s0104.g044873	AT3G28210, AT2G41835, AT3G57480, AT5G48205	Bradi4g29530, Bradi1g24140	NA	Chrsp66S07283	Cre09.g389750_4532	CLOP_g10736	13402, 4698	Me1_v2_0235170	Mp4g16050	12301	NA	LOC_Os09g21710, LOC_Os07g38240	PRCOL_00003472_RA	pm023358g0010, pm000128g0040, pm098841g0010, pm000392g0090, pm004637g0060, pm018945g0010, pm000392g0080	Pp3c8_25400, Pp3c8_230, Pp3c15_4950	Solyc02g087210, Solyc04g015570, Solyc10g080200	68146	SM000060S19599, SM000114S24114, SM000385S14616	Zci1a_41501	Zci_00880, Zci_00691	UTEX1559_08047, UTEX1559_14330	UTEX1560_03763, UTEX1560_12562	Zm00001d005698, Zm00001d021842
Zci_08533	N0.HOG0002589	OG0001739	n0	AagrOXF_evm.TU.utg000125l.69	Azfi_s0061.g034938	AT4G00755	Bradi1g77420, Bradi1g76670, Bradi1g77410, Bradi1g00497	CBR_g18757	NA	Cre11.g468383_4532	CLOP_g7492	1272	Me1_v2_0136130	Mp4g09710	12278	NA	LOC_Os03g02560, LOC_Os03g64360	NA	pm008813g0020	Pp3c2_30060, Pp3c17_15230, Pp3c14_19630	Solyc03g026170, Solyc10g017880, Solyc01g091710, Solyc01g091720	76555	SM000085S23229, SM000044S16013, SM000001S04801	Zci1a_42079, Zci1a_32692	Zci_16607, Zci_04964, Zci_16565, Zci_08513, Zci_08532, Zci_08533, Zci_08561	UTEX1559_05086, UTEX1559_17782, UTEX1559_04178, UTEX1559_18946, UTEX1559_12649, UTEX1559_17338	UTEX1560_14923, UTEX1560_18499, UTEX1560_01528, UTEX1560_19205, UTEX1560_17453, UTEX1560_16998, UTEX1560_15869, UTEX1560_16052, UTEX1560_14192	Zm00001d027362, Zm00001d034336
Zci_14479	N0.HOG0001432	OG0000858	n0	AagrOXF_evm.TU.utg000002l.90, AagrOXF_evm.TU.utg000035l.168	Azfi_s0127.g048702, Azfi_s0174.g055900, Azfi_s0009.g011970, Azfi_s0182.g056405	AT5G19140, AT3G22850, AT5G43830, AT4G27450, AT3G15450	Bradi4g42890, Bradi1g08930, Bradi1g05540, Bradi5g26320	CBR_g12931	Chrsp50S06453, Chrsp76S07644	Cre16.g680700_4532	CLOP_g14823, CLOP_g15623, CLOP_g13232, CLOP_g16810, CLOP_g22497, CLOP_g22501, CLOP_g17698	11044, 4474	Me1_v2_0208450, Me1_v2_0069210	Mp7g03680	4313, 15165	Olucimarinus_28874	LOC_Os12g05050, LOC_Os11g09864, LOC_Os11g05050, LOC_Os03g53270, LOC_Os03g58170, LOC_Os04g58280	NA	pm187883g0010, pm000107g0060, pm024440g0010, pm004469g0030, pm004469g0040, pm000704g0110, pm005695g0020, pm003665g0020, pm004104g0010, pm001148g0010, pm007192g0010, pm000689g0060, pm006572.t1	Pp3c14_4330, Pp3c1_21540	Solyc06g054370, Solyc01g079880, Solyc09g082780, Solyc08g023495.1, Solyc02g078380, Solyc02g078500.2, Solyc03g006490, Solyc12g013700	270173, 270383, 227818	SM000024S07831, SM000006S19408, SM000008S22372	Zci1a_01595	Zci_14479	UTEX1559_10794	UTEX1560_11855	Zm00001d023376, Zm00001d052493, Zm00001d033983, Zm00001d034433, Zm00001d026632
Zci_03652	N0.HOG0002187	OG0001419	n5	AagrOXF_evm.TU.utg000006l.699	Azfi_s0246.g060037, Azfi_s0004.g008693	AT2G42450	Bradi4g38895	CBR_g40789, CBR_g51917, CBR_g36895	Chrsp66S09166, Chrsp123S01831, Chrsp37S05467	Cre14.g622800_4532, Cre07.g325150_4532	CLOP_g9923	2134, 4973	Me1_v2_0007570, Me1_v2_0031350, Me1_v2_0191650, Me1_v2_0162820, Me1_v2_0162830	Mp3g01610, Mp4g18430	NA	NA	LOC_Os09g39790	NA	pm007549g0020, pm000878g0010, pm008867g0010	Pp3c22_2890, Pp3c8_16570, Pp3c8_13590, Pp3c4_30510, Pp3c22_5940, Pp3c21_10810	Solyc06g083920	97906	SM000042S15395, SM000008S22210, SM000039S14508, SM000097S24815, SM000014S00422, SM000249S08254, SM000193S05191, SM000357S13383, SM000069S20746	Zci1a_08731, Zci1a_08728, Zci1a_08729, Zci1a_15897, Zci1a_21108, Zci1a_32916	Zci_03652	UTEX1559_02946	UTEX1560_11485	Zm00001d005313
Zci_08166	N0.HOG0000128	OG0000062	n0	AagrOXF_evm.TU.utg000059l.74, AagrOXF_evm.TU.utg000008l.306, AagrOXF_evm.TU.utg000087l.108, AagrOXF_evm.TU.utg000020l.83, AagrOXF_evm.TU.utg000024l.118, AagrOXF_evm.TU.utg000003l.512, AagrOXF_evm.TU.utg000003l.509, AagrOXF_evm.TU.utg000027l.319, AagrOXF_evm.TU.utg000058l.106, AagrOXF_evm.TU.utg000116l.317, AagrOXF_evm.TU.utg000085l.7, AagrOXF_evm.TU.utg000024l.272, AagrOXF_evm.TU.utg000100l.242, AagrOXF_evm.TU.utg000018l.466, AagrOXF_evm.TU.utg000005l.142	Azfi_s0167.g054438, Azfi_s0046.g030177, Azfi_s0004.g008839, Azfi_s0009.g011929, Azfi_s0068.g036232, Azfi_s0016.g014290, Azfi_s2186.g109824, Azfi_s0068.g036247, Azfi_s0065.g035805, Azfi_s0018.g014855, Azfi_s0092.g043100, Azfi_s0116.g046369, Azfi_s0237.g059582, Azfi_s0051.g031353, Azfi_s0015.g013874, Azfi_s0106.g045035	AT3G63220, AT4G03030, AT2G44130, AT3G59940, AT1G15670, AT1G80440, AT2G24540, AT1G30090, AT1G22040, AT3G61350, AT1G55270, AT1G16250, AT1G27420, AT1G67480	Bradi3g47920, Bradi3g11000, Bradi4g21000, Bradi4g20980, Bradi3g46090, Bradi1g37010, Bradi1g31260, Bradi1g58530, Bradi3g46700, Bradi3g01360, Bradi1g73860, Bradi3g43930, Bradi5g07660	CBR_g38018, CBR_g37301, CBR_g63114	NA	Cre03.g205400_4532	CLOP_g20267, CLOP_g21296, CLOP_g15168, CLOP_g23398, CLOP_g10677, CLOP_g22833, CLOP_g3997, CLOP_g7574, CLOP_g14846, CLOP_g16508	2413, 1686, 13255, 7608, 465, 6029	Me1_v2_0052480, Me1_v2_0136270, Me1_v2_0077750, Me1_v2_0220920, Me1_v2_0035400, Me1_v2_0150730, Me1_v2_0062110, Me1_v2_0138710, Me1_v2_0125270, Me1_v2_0205000, Me1_v2_0082050, Me1_v2_0039430, Me1_v2_0082360, Me1_v2_0222100, Me1_v2_0213750, Me1_v2_0108560, Me1_v2_0120950, Me1_v2_0108370, Me1_v2_0007430, Me1_v2_0100640, Me1_v2_0230630	Mp5g04070, Mp1g09260, Mp7g04930, Mp1g25730, Mp7g02760, Mp8g07800, Mp4g20550, Mp6g10520, Mp2g26320, Mp1g25860, Mp1g25820, Mp1g11590, Mp7g02060, Mp3g08140, Mp2g13040, Mp7g05720, Mp1g09370, Mp7g08240	NA	NA	LOC_Os10g24900, LOC_Os02g21110, LOC_Os11g14140, LOC_Os02g35530, LOC_Os02g11790, LOC_Os06g39370, LOC_Os12g31390, LOC_Os06g44500, LOC_Os07g05880, LOC_Os02g36520, LOC_Os10g21930, LOC_Os02g02350, LOC_Os10g26990, LOC_Os03g07160, LOC_Os02g10850, LOC_Os02g30210, LOC_Os04g31120	NA	pm007569g0010, pm005721g0090, pm022422g0010, pm034684.t1, pm001226g0110, pm004265.t1, pm012440g0020, pm005784g0010, pm012440g0010, pm011728g0010, pm002283g0050, pm003575g0030, pm011717g0010, pm007558g0030, pm011844g0020, pm004002g0020, pm006683g0020, pm058882.t1, pm017289g0010, pm017945g0010, pm096926g0010, pm018177.t1, pm001994g0010, pm004386g0030	Pp3c14_17660, Pp3c11_19400, Pp3c3_23580, Pp3c26_7990, Pp3c13_12640, Pp3c3_15470, Pp3c9_7690, Pp3c14_1310, Pp3c8_18180, Pp3c10_1490, Pp3c1_20910, Pp3c2_13250, Pp3c1_22300, Pp3c10_4990, Pp3c14_4360, Pp3c7_3160, Pp3c11_18480, Pp3c8_9940, Pp3c5_5360, Pp3c22_21630, Pp3c18_4130	Solyc09g065400, Solyc06g008690.1, Solyc09g066210, Solyc10g080610.1, Solyc06g066770.1, Solyc03g120330.1, Solyc03g120320.1, Solyc02g021600.1, Solyc04g051870, Solyc01g104980, Solyc01g094520, Solyc01g005970, Solyc01g022740, Solyc07g042950.1	99292, 403983, 420459, 412321, 88328, 4998, 121243, 65366, 410670, 429850, 55890, 115581, 85806, 92722, 411144, 404324, 438121, 431561, 441635, 426714, 429669, 83069, 87207, 405137	SM002316S08055, SM000065S20164, SM000243S08567, SM000133S26834, SM000074S21703, SM000168S02593, SM000069S20720, SM000258S09106, SM000121S26008, SM000062S19905, SM000719S21279	Zci1a_13419, Zci1a_12639, Zci1a_03931, Zci1a_04820, Zci1a_16859, Zci1a_36538, Zci1a_39446, Zci1a_34973, Zci1a_41904, Zci1a_12550, Zci1a_16934, Zci1a_16431, Zci1a_06965, Zci1a_06964, Zci1a_32421, Zci1a_30801, Zci1a_13877	Zci_03530, Zci_04912, Zci_11505, Zci_08166, Zci_01549, Zci_14255, Zci_13468, Zci_08526, Zci_08560, Zci_15369, Zci_01539, Zci_01630	UTEX1559_06987, UTEX1559_10129, UTEX1559_11920, UTEX1559_04120, UTEX1559_09135, UTEX1559_05124, UTEX1559_11620, UTEX1559_11546, UTEX1559_01714, UTEX1559_17594, UTEX1559_12353, UTEX1559_18786, UTEX1559_17336, UTEX1559_03340, UTEX1559_11561, UTEX1559_13043	UTEX1560_04132, UTEX1560_11949, UTEX1560_09772, UTEX1560_09836, UTEX1560_13657, UTEX1560_07827, UTEX1560_06085, UTEX1560_01372, UTEX1560_01371, UTEX1560_04055, UTEX1560_15818, UTEX1560_18346, UTEX1560_13786, UTEX1560_16051, UTEX1560_16806, UTEX1560_01388, UTEX1560_10489	Zm00001d014338, Zm00001d015698, Zm00001d007274, Zm00001d049016, Zm00001d050815, Zm00001d036925, Zm00001d046921, Zm00001d046922, Zm00001d018813, Zm00001d050862, Zm00001d049632, Zm00001d014986, Zm00001d032991, Zm00001d027827, Zm00001d015744, Zm00001d016553
Zci_05028	N0.HOG0003161	OG0002236	n0	AagrOXF_evm.TU.utg000125l.85	Azfi_s0207.g057939	AT1G18180, AT1G73650	Bradi1g11150	CBR_g19480, CBR_g30737	Chrsp29S00344	Cre09.g401701_4532	CLOP_g13580, CLOP_g16523	8303, 244	Me1_v2_0209010, Me1_v2_0209020	Mp3g23330, Mp4g01590, Mp7g02070	22708	Olucimarinus_34095	LOC_Os03g50070	PRCOL_00001152_RA	pm000128g0100, pm008833g0040, pm006163g0010, pm017992g0020, pm008902g0030	Pp3c10_10850, Pp3c14_25340, Pp3c13_4300	Solyc06g068970, Solyc03g118830	NA	SM000162S02372, SM000010S04184, SM000239S08067, SM000182S03952, SM000015S01289, SM000128S26229	Zci1a_04114, Zci1a_12102	Zci_13092, Zci_05028	UTEX1559_14379, UTEX1559_16050	UTEX1560_09080, UTEX1560_03891	Zm00001d013456
Zci_06087	N0.HOG0019212	OG0017127	n0	NA	Azfi_s0015.g014062	NA	NA	NA	NA	NA	NA	NA	Me1_v2_0103900	NA	NA	NA	NA	NA	NA	NA	NA	403585	NA	NA	Zci_06087	UTEX1559_02559	NA	NA
Zci_04511	N0.HOG0000154	OG0000077	n123	AagrOXF_evm.TU.utg000098l.19, AagrOXF_evm.TU.utg000124l.50, AagrOXF_evm.TU.utg000124l.46	Azfi_s0006.g010490, Azfi_s0051.g031438, Azfi_s0125.g048560, Azfi_s0149.g053204, Azfi_s0019.g015047, Azfi_s0035.g025644, Azfi_s0132.g049293, Azfi_s0185.g056585, Azfi_s0045.g029809	AT2G40830, AT3G56580, AT3G10815, AT1G68180, AT1G60360, AT3G19950, AT4G26400, AT5G56340, AT1G55530, AT3G13430, AT3G46620, AT5G59550, AT2G39720, AT2G44330, AT3G60080, AT5G20910	Bradi2g52600, Bradi1g62350, Bradi3g57880, Bradi1g46110, Bradi3g29400, Bradi1g52440, Bradi2g10520, Bradi1g63720, Bradi2g21870, Bradi1g04180, Bradi1g66780, Bradi2g39220, Bradi2g04010, Bradi2g54784, Bradi4g31030	CBR_g153, CBR_g36486, CBR_g17961	Chrsp49S06169, Chrsp21S03371	NA	CLOP_g4551	6054, 4941	Me1_v2_0200030, Me1_v2_0125300	Mp7g15970, Mp5g05250	NA	NA	LOC_Os05g41520, LOC_Os01g58780, LOC_Os03g22830, LOC_Os02g52870, LOC_Os06g10800, LOC_Os10g34590, LOC_Os06g01200, LOC_Os01g16950, LOC_Os03g20870, LOC_Os05g40980, LOC_Os03g59760, LOC_Os03g16480, LOC_Os10g03920, LOC_Os05g01940, LOC_Os01g74040, LOC_Os01g62640, LOC_Os09g26400	PRCOL_00004260_RA	pm020923g0010, pm009852g0020, pm007834g0030, pm016348g0030, pm066853g0010, pm035587g0010, pm003968g0060, pm020580g0030	Pp3c3_13100, Pp3c13_21890, Pp3c13_19370, Pp3c1_5780, Pp3c2_5960, Pp3c1_42450	Solyc08g075910.1, Solyc01g009000, Solyc01g104260, Solyc11g012950, Solyc03g098590, Solyc04g009170, Solyc01g050040, Solyc04g011610, Solyc06g005650.2, Solyc02g088030.1, Solyc08g067290	8109, 129201	SM000037S13589, SM000130S27115, SM000098S25132, SM000087S23369, SM000065S20169, SM000243S08577, SM000078S22129, SM000111S18777, SM000187S03899	Zci1a_03567, Zci1a_07114, Zci1a_18606	Zci_10068, Zci_04511	UTEX1559_07657, UTEX1559_04646	UTEX1560_13485, UTEX1560_15696, UTEX1560_07665	Zm00001d043183, Zm00001d012564, Zm00001d047476, Zm00001d052154, Zm00001d018190, Zm00001d037167, Zm00001d032646, Zm00001d013971, Zm00001d045625, Zm00001d040445, Zm00001d008237, Zm00001d047560, Zm00001d028982, Zm00001d038528, Zm00001d010635, Zm00001d013005, Zm00001d023335, Zm00001d028590, Zm00001d047824, Zm00001d035677, Zm00001d011076, Zm00001d017465, Zm00001d005795
Zci_08054	N0.HOG0000733	OG0000399	n0	AagrOXF_evm.TU.utg000058l.72	Azfi_s0398.g068185, Azfi_s4122.g118060, Azfi_s0006.g010165, Azfi_s0003.g008090, Azfi_s0149.g053235	AT5G51760, AT3G11410, AT5G59220, AT1G07430, AT2G29380, AT1G72770, AT1G17550, AT4G26080, AT5G57050	Bradi2g15840, Bradi2g45470, Bradi5g00673, Bradi4g28098, Bradi2g54810, Bradi1g66920, Bradi2g39533, Bradi2g14420, Bradi2g41950, Bradi2g18510	NA	NA	Cre03.g211073_4532, Cre02.g141250_4532	CLOP_g12842	13526	Me1_v2_0028080, Me1_v2_0141120, Me1_v2_0047120, Me1_v2_0060400	MpUg00130, MpVg00730	28433, 28434, 28435	NA	LOC_Os05g49730, LOC_Os01g46760, LOC_Os09g15670, LOC_Os05g38290, LOC_Os01g62760, LOC_Os03g16170, LOC_Os03g38920, LOC_Os05g51510, LOC_Os01g40094, LOC_Os05g46040	PRCOL_00004502_RA	pm021225g0030, pm022020g0020	Pp3c7_5390, Pp3c11_18330	Solyc08g082260, Solyc06g051940, Solyc03g007230, Solyc03g006930, Solyc03g006960, Solyc03g006940, Solyc03g006950, Solyc05g052980, Solyc03g096670, Solyc06g076400, Solyc03g121880, Solyc08g062640, Solyc12g096020, Solyc08g062650.2, Solyc07g040990	113714, 13309, 54775	SM000009S23482, SM000227S07445, SM000041S15483, SM000060S19644, SM000009S23475, SM000067S20347, SM000137S00470	Zci1a_44793, Zci1a_34128, Zci1a_14091, Zci1a_22231, Zci1a_18037, Zci1a_26463	Zci_11367, Zci_11373, Zci_00934, Zci_00935, Zci_08054, Zci_09733, Zci_03916	UTEX1559_08959, UTEX1559_08953, UTEX1559_07999, UTEX1559_13607, UTEX1559_13732, UTEX1559_17270	UTEX1560_07347, UTEX1560_09712, UTEX1560_04874, UTEX1560_18918, UTEX1560_19670, UTEX1560_18286, UTEX1560_11018, UTEX1560_10451, UTEX1560_10450	Zm00001d009626, Zm00001d044015, Zm00001d011495, Zm00001d025055, Zm00001d004357, Zm00001d020100, Zm00001d005609, Zm00001d042886, Zm00001d012401, Zm00001d028574, Zm00001d039163, Zm00001d009747, Zm00001d044301, Zm00001d011202, Zm00001d038846, Zm00001d011131
Zci_01877	N0.HOG0001005	OG0000563	n62	AagrOXF_evm.TU.utg000063l.145	Azfi_s0112.g045793, Azfi_s0117.g046549	AT1G67300, AT1G79820	Bradi3g10210	NA	NA	NA	CLOP_g22466	2867	Me1_v2_0121650	Mp1g13590	NA	NA	LOC_Os02g17500	NA	pm005071g0050, pm035548g0010, pm010731g0030	Pp3c5_28630, Pp3c15_10670	Solyc07g020790, Solyc06g066600	107365, 100582	SM000059S18702, SM000148S01023, SM000170S02693	Zci1a_04815	Zci_01877	UTEX1559_09214	UTEX1560_08929, UTEX1560_16535	Zm00001d053334
Zci_06361	N0.HOG0004574	OG0003480	n0	NA	Azfi_s2531.g112055, Azfi_s0075.g037627, Azfi_s0335.g065522, Azfi_s0362.g066918, Azfi_s0807.g087714, Azfi_s2531.g112054	AT4G00752, AT4G11740, AT4G23040	Bradi4g35720, Bradi3g42080	CBR_g50340	Chrsp17S02760	Cre09.g406416_4532, Cre04.g230830_4532	CLOP_g1316	13301	Me1_v2_0101460	Mp1g20270	8445	Olucimarinus_15181	LOC_Os09g35710, LOC_Os08g43300	NA	pm021498g0010, pm012164.t1, pm012164g0040	NA	Solyc08g080410	268911	NA	Zci1a_23051	Zci_06361	UTEX1559_06098	UTEX1560_05237	Zm00001d021227, Zm00001d006176, Zm00001d052735
Zci_15002	N0.HOG0001538	OG0000930	n0	AagrOXF_evm.TU.utg000042l.47	Azfi_s0061.g034992, Azfi_s0142.g051417, Azfi_s0533.g076059, Azfi_s0389.g067652	AT2G46380, AT3G61670, AT1G01440, AT4G01090	Bradi2g43830, Bradi2g14820, Bradi3g09700, Bradi1g38390	CBR_g58828	NA	NA	CLOP_g6236, CLOP_g4651, CLOP_g5842, CLOP_g18276, CLOP_g6235, CLOP_g6234, CLOP_g15886, CLOP_g20781, CLOP_g11283, CLOP_g18552, CLOP_g19845, CLOP_g19741, CLOP_g10563, CLOP_g10562	10616, 3891, 3443	Me1_v2_0207750	Mp1g20340	NA	NA	LOC_Os01g43330, LOC_Os05g50910, LOC_Os02g15820, LOC_Os06g33320	NA	pm017915g0010, pm024130g0020, pm001697.t1, pm022328g0010, pm000497g0070, pm017335g0020, pm044768g0010, pm160992.t1, pm022886.t1, pmUn.t112	Pp3c25_9130, Pp3c16_10870, Pp3c7_4630	Solyc08g082040, Solyc01g095590	428331	SM000067S20308, SM000009S23590, SM000196S05356	Zci1a_44694, Zci1a_27223, Zci1a_37989	Zci_15002	UTEX1559_08882	UTEX1560_04112, UTEX1560_18551, UTEX1560_13731	Zm00001d044191, Zm00001d011373, Zm00001d009716, Zm00001d053382, Zm00001d016081, Zm00001d046072
Zci_08692	N0.HOG0000779	OG0000436	n55	AagrOXF_evm.TU.utg000003l.654, AagrOXF_evm.TU.utg000006l.366	Azfi_s0004.g008473, Azfi_s0004.g008355, Azfi_s0004.g008766, Azfi_s0003.g007447, Azfi_s0012.g013021, Azfi_s0178.g056190	AT5G24120, AT1G64860	Bradi2g14790, Bradi3g16040	CBR_g17823	Chrsp127S01942	NA	CLOP_g6042, CLOP_g22546	13917, 12498, 1880, 11139	Me1_v2_0155790, Me1_v2_0157280	Mp3g02240, Mp7g15030	25228	NA	LOC_Os05g50930, LOC_Os08g06630	PRCOL_00006281_RA	pm007550g0030, pm002962g0060, pm072680g0010, pm006685g0010	Pp3c22_18520, Pp3c14_4440, Pp3s32_300	Solyc03g007370, Solyc03g097330.1, Solyc03g097320, Solyc06g072710	147096, 53596, 266972	SM000193S05159, SM000102S09186, SM000296S11299, SM000245S08192, SM000386S14569, SM000284S10658	Zci1a_36011, Zci1a_23470, Zci1a_18458	Zci_08692, Zci_09461	UTEX1559_06977, UTEX1559_06992	UTEX1560_15626, UTEX1560_04127	Zm00001d039194, Zm00001d024507, Zm00001d049494
Zci_09309	N0.HOG0033187	OG0031010	-	NA	NA	NA	NA	NA	NA	NA	NA	NA	NA	NA	NA	NA	NA	NA	NA	NA	NA	NA	NA	NA	Zci_09309	UTEX1559_14056	UTEX1560_12914	NA
Zci_02226	N0.HOG0008762	OG0007399	n0	NA	NA	AT4G37300	Bradi1g67120, Bradi2g23680	NA	NA	NA	CLOP_g20592	NA	Me1_v2_0231200	Mp1g11190	NA	NA	LOC_Os03g15920, LOC_Os05g37830	NA	pm000343g0030, pm002702g0020	Pp3c23_2900, Pp3c8_16060	Solyc06g006000, Solyc02g092880	85007	SM000021S06520, SM000145S00817, SM000232S07946	Zci1a_07905	Zci_02226	UTEX1559_10861	UTEX1560_10959	Zm00001d028548, Zm00001d038267
Zci_15064	N0.HOG0000509	OG0000263	n0	AagrOXF_evm.TU.utg000003l.432, AagrOXF_evm.TU.utg000100l.191, AagrOXF_evm.TU.utg000100l.188, AagrOXF_evm.TU.utg000077l.409, AagrOXF_evm.TU.utg000094l.25, AagrOXF_evm.TU.utg000126l.194	Azfi_s0040.g026656, Azfi_s0190.g056920, Azfi_s0587.g078565, Azfi_s0003.g007389, Azfi_s0001.g000953, Azfi_s0191.g056977, Azfi_s0719.g083549, Azfi_s0314.g064258, Azfi_s0007.g010629, Azfi_s0246.g060041, Azfi_s0065.g035742, Azfi_s0014.g013621, Azfi_s0048.g030564	AT1G31040, AT2G12646, AT3G60670, AT2G01818, AT2G27930, AT1G32700, AT5G46710, AT4G17900, AT1G43000, AT1G21000, AT1G76590	Bradi3g50830, Bradi1g32050, Bradi3g05380, Bradi3g06190, Bradi4g38790, Bradi2g41235, Bradi3g43000, Bradi2g38150, Bradi3g34160, Bradi5g19980, Bradi3g52170, Bradi1g35697, Bradi3g06820, Bradi3g07480	CBR_g45908, CBR_g6725	Chrsp51S06491, Chrsp4S06226	Cre16.g650400_4532	CLOP_g6014, CLOP_g2272, CLOP_g25490, CLOP_g11522, CLOP_g16637	343, 12828, 7463, 4415	Me1_v2_0207800, Me1_v2_0194480	Mp3g06190, Mp1g07250	28048, 28049, 28234	Olucimarinus_29623	LOC_Os02g44260, LOC_Os06g45540, LOC_Os02g07650, LOC_Os02g09070, LOC_Os01g33370, LOC_Os01g33350, LOC_Os08g44620, LOC_Os11g24130, LOC_Os10g42410, LOC_Os04g50120, LOC_Os02g46610, LOC_Os06g41930, LOC_Os02g10000	PRCOL_00006493_RA	pm024861g0030, pm037153g0010, pm016654.t1, pm002579g0040, pm014158g0020, pm002987g0040, pm005147g0030, pm012986.t1	Pp3c18_12270, Pp3c18_12180, Pp3c21_8120, Pp3c21_11530, Pp3c13_11088, Pp3c9_19170, Pp3c15_23190, Pp3c4_12320, Pp3c10_12560, Pp3c3_19680, Pp3c8_4000, Pp3c13_4760, Pp3c3_3180, Pp3c26_11480, Pp3c4_30530	Solyc02g068510, Solyc07g007320, Solyc12g010470, Solyc01g091000, Solyc04g008090, Solyc03g044625.1, Solyc10g085800, Solyc08g076860, Solyc08g005100, Solyc06g061240	425306, 4832, 412053, 102589, 26454, 131111, 36842, 39612, 26582, 410393, 69065	SM000090S24345, SM000200S05832, SM000003S10992	Zci1a_19291, Zci1a_00066, Zci1a_11958	Zci_09315, Zci_15064	UTEX1559_10373, UTEX1559_00661	UTEX1560_08154, UTEX1560_17496	Zm00001d051376, Zm00001d046958, Zm00001d015394, Zm00001d015560, Zm00001d015868, Zm00001d009292, Zm00001d031925, Zm00001d030032, Zm00001d047025, Zm00001d026047, Zm00001d028594, Zm00001d002489, Zm00001d051511, Zm00001d017682
Zci_02011	N0.HOG0000815	OG0000462	n5	AagrOXF_evm.TU.utg000019l.96, AagrOXF_evm.TU.utg000035l.456, AagrOXF_evm.TU.utg000019l.95	NA	AT2G26170	Bradi3g08356, Bradi4g08970, Bradi1g75310, Bradi4g09040, Bradi1g37730	CBR_g39355, CBR_g49050, CBR_g4855, CBR_g4856, CBR_g4863	Chrsp32S04956, Chrsp33S04999, Chrsp23S03696, Chrsp369S00858	Cre16.g648200_4532, Cre09.g397216_4532, Cre09.g397105_4532, Cre09.g397734_4532, Cre09.g396994_4532, Cre09.g397031_4532, Cre14.g626400_4532, Cre07.g340850_4532, Cre01.g054250_4532, Cre07.g354350_4532, Cre07.g354450_4532, Cre07.g354400_4532	CLOP_g19752, CLOP_g560	10983, 9051, 11402, 11403	Me1_v2_0216320	NA	29766, 4795, 9575, 4713, 4714, 4710, 4709, 4708, 4711, 12104, 5545, 5546	NA	LOC_Os02g12890, LOC_Os01g50590, LOC_Os01g50580, LOC_Os01g50530, LOC_Os01g50570, LOC_Os01g50520, LOC_Os06g36920	NA	pm332670.t1, pm000549g0050, pm014697g0010, pm026046.t1, pm000554.t1, pm172980g0010, pm007195g0030, pm001831g0030, pm019169g0020, pm014414g0040, pm037641g0020, pm001831g0010, pm014414g0030, pm037641g0010, pm000549g0090, pm012952g0010, pm001831g0020, pm019169.t1, pm000554g0010, pm007195g0020, pm021446.t1, pm000549g0080, pm022172g0010, pm038774.t1, pm004896g0030, pm027249g0020, pm047533g0010, pm009179.t1, pm002151g0070, pm001593g0010, pm000554g0040, pm001831g0050, pm012952g0020, pm012670g0030	NA	Solyc08g062950	96541	SM000118S25565, SM000002S05728, SM000152S01526, SM000180S03482, SM000027S09601, SM000028S10076	Zci1a_01623	Zci_02011	UTEX1559_01867	UTEX1560_04697	Zm00001d053569, Zm00001d028832, Zm00001d041199, Zm00001d039697, Zm00001d046207
Zci_08835	N0.HOG0032987	OG0030810	-	NA	NA	NA	NA	NA	NA	NA	NA	NA	NA	NA	NA	NA	NA	NA	NA	NA	NA	NA	NA	NA	Zci_08835	UTEX1559_17669	UTEX1560_17078	NA
Zci_15609	N0.HOG0003023	OG0002115	n15	AagrOXF_evm.TU.utg000022l.83, AagrOXF_evm.TU.utg000022l.84	Azfi_s0024.g020353	AT5G38900	Bradi1g15070	NA	Chrsp108S01395	Cre12.g553650_4532, Cre12.g553700_4532	CLOP_g18855	5174	Me1_v2_0036150, Me1_v2_0113020	Mp1g17170	26669	Olucimarinus_26861	NA	PRCOL_00005781_RA	pm024559g0010, pm001692g0090, pm003292g0040	Pp3s30_530, Pp3c14_20450	Solyc02g089230	272288	SM000014S00228, SM000031S11582, SM000092S24508	Zci1a_09617	Zci_15609	UTEX1559_02133	UTEX1560_02336	Zm00001d033171, Zm00001d007242, Zm00001d013755
Zci_12208	N0.HOG0000508	OG0000262	n0	AagrOXF_evm.TU.utg000103l.37	Azfi_s0002.g006482, Azfi_s0001.g000474, Azfi_s0021.g015839, Azfi_s0068.g036338, Azfi_s0165.g054336	AT3G19450, AT4G34230, AT4G39330, AT2G21890, AT2G21730, AT4G37970, AT4G37990, AT4G37980, AT1G72680	Bradi3g06480, Bradi5g04130, Bradi5g21550, Bradi3g17920, Bradi3g10580, Bradi4g29780, Bradi4g29770, Bradi3g22980	NA	Chrsp76S07662, Chrsp26S04022, Chrsp17S02755, Chrsp46S06098, Chrsp195S03019, Chrsp195S00207, Chrsp22S03457	Cre09.g392134_4532, Cre14.g623650_4532, Cre03.g207550_4532, Cre03.g207800_4532	CLOP_g7632, CLOP_g11877, CLOP_g31, CLOP_g17802, CLOP_g23878, CLOP_g16531, CLOP_g23879, CLOP_g16532	5390, 5391, 6240	Me1_v2_0015930, Me1_v2_0205600, Me1_v2_0228980, Me1_v2_0042300, Me1_v2_0011340, Me1_v2_0006200, Me1_v2_0074290, Me1_v2_0211260, Me1_v2_0181050, Me1_v2_0074320, Me1_v2_0010370	Mp3g13380, Mp5g18560, Mp5g14710, Mp5g14650, Mp5g14670, Mp5g14660, Mp5g14700, Mp3g16070, Mp3g16080	21681, 26958, 10270	Olucimarinus_41988, Olucimarinus_48780, Olucimarinus_13349	LOC_Os02g09490, LOC_Os04g15920, LOC_Os04g52280, LOC_Os10g29470, LOC_Os08g16910, LOC_Os03g12270, LOC_Os09g23540, LOC_Os09g23550, LOC_Os09g23560, LOC_Os09g23530, LOC_Os10g11810, LOC_Os11g40690	PRCOL_00005982_RA	pm024650.t1, pm009863g0020, pm025028g0010	Pp3s30_80, Pp3c14_4770, Pp3c1_39700, Pp3c2_10530	Solyc01g107590, Solyc08g014360, Solyc02g030480, Solyc02g069250, Solyc03g078425.1, Solyc03g078440, Solyc11g011330, Solyc05g024310.1, Solyc04g048960.1, Solyc11g011340, Solyc05g024315.1, Solyc11g010960, Solyc11g010980, Solyc11g010990, Solyc08g048300, Solyc12g055820	444096, 230239, 90947, 235915, 90436, 231648, 410286, 267688, 149351, 268735	SM000056S17981, SM000003S11081, SM000107S14045, SM000107S14036, SM000003S11071, SM000056S17974, SM000001S04650, SM000010S04314, SM000052S17711	Zci1a_32656, Zci1a_37287, Zci1a_25845, Zci1a_25859, Zci1a_12301	Zci_15335, Zci_15336, Zci_02085, Zci_12208	UTEX1559_12689, UTEX1559_15114, UTEX1559_06369, UTEX1559_17280	UTEX1560_16786, UTEX1560_12029, UTEX1560_06948	Zm00001d015618, Zm00001d004443, Zm00001d002346, Zm00001d024314, Zm00001d020402, Zm00001d020400, Zm00001d020401, Zm00001d002250, Zm00001d045043
Zci_03210	N0.HOG0000975	OG0000539	n0	AagrOXF_evm.TU.utg000081l.118, AagrOXF_evm.TU.utg000117l.130	Azfi_s0113.g045929, Azfi_s0141.g051318, Azfi_s0038.g026302	AT3G60940, AT3G61028, AT3G62850, AT3G62050, AT3G56730, AT5G64590, AT5G64450, AT3G61090, AT3G61100, AT2G38365, AT5G61190, AT5G61180, AT3G62200, AT3G62210, AT5G09840, AT5G64710, AT2G15560	Bradi1g61490, Bradi1g20125, Bradi1g20119, Bradi4g41810, Bradi4g24700, Bradi4g08110	CBR_g45845	NA	NA	CLOP_g17553	13834, 2815, 5143	Me1_v2_0086650	Mp2g26710, Mp6g08570	6031, 6032	NA	LOC_Os03g25420, LOC_Os07g44320, LOC_Os12g06560, LOC_Os11g06680, LOC_Os08g13390	NA	pm001432g0030, pm009949g0030, pm000317g0080, pm002193g0070, pm000317g0090, pm000862g0020	Pp3c25_11880, Pp3c16_22960, Pp3c13_3950, Pp3c3_5910	Solyc01g101140, Solyc02g088850, Solyc02g088860, Solyc02g088880.1, Solyc02g088870.1, Solyc02g088890, Solyc11g005440, Solyc10g050190, Solyc01g108010	113855, 426280, 419584, 57723, 417477, 227265	SM006505S20280, SM000033S12375, SM000017S02777, SM000285S10808	Zci1a_00836, Zci1a_00839, Zci1a_33858, Zci1a_30806, Zci1a_30807, Zci1a_33732	Zci_15831, Zci_15971, Zci_10837, Zci_03210	UTEX1559_18944, UTEX1559_15588, UTEX1559_01703, UTEX1559_01525, UTEX1559_00891	UTEX1560_16963, UTEX1560_19009, UTEX1560_18288, UTEX1560_18946, UTEX1560_16965, UTEX1560_12403, UTEX1560_05146, UTEX1560_12093	Zm00001d029286, Zm00001d022273, Zm00001d006940, Zm00001d006941, Zm00001d041914, Zm00001d053183, Zm00001d023974
Zci_06085	N0.HOG0018788	OG0016756	n0	NA	NA	NA	NA	NA	NA	NA	NA	NA	NA	NA	NA	NA	NA	NA	NA	NA	NA	NA	NA	Zci1a_04471, Zci1a_28614, Zci1a_12017	Zci_06085	UTEX1559_02561	UTEX1560_16103	NA
Zci_05575	N0.HOG0000022	OG0000005	n88	AagrOXF_evm.TU.utg000049l.90	Azfi_s0061.g034930, Azfi_s1025.g095454, Azfi_s0812.g087843, Azfi_s0179.g056258, Azfi_s0173.g055749, Azfi_s0390.g067689	AT1G43330, AT4G00540, AT5G11510, AT4G32730, AT3G09370, AT2G13960, AT5G02320	Bradi3g10075, Bradi3g10067, Bradi2g31887, Bradi2g07677, Bradi2g23320, Bradi2g23310, Bradi2g23339, Bradi2g54640	CBR_g18982	Chrsp33S05002	NA	NA	2317	Me1_v2_0144990	Mp6g16170, Mp1g08640, Mp5g22280, Mp5g20280, Mp3g13510, Mp4g04760, Mp5g13030, MpUg00230, MpUg00270, Mp5g13040, Mp5g13060, Mp4g09860, Mp4g09880	13675	Olucimarinus_34891	LOC_Os01g63680, LOC_Os07g14110, LOC_Os07g12130, LOC_Os02g17190, LOC_Os01g12860, LOC_Os12g13570, LOC_Os05g38460, LOC_Os01g62410	PRCOL_00000546_RA	NA	Pp3c10_10240, Pp3c14_14040, Pp3c14_14030	Solyc08g080580, Solyc11g071300, Solyc08g068320, Solyc09g010820	75978	SM000049S16756, SM000048S16518, SM000080S22924	Zci1a_25761, Zci1a_25759	Zci_05575	UTEX1559_02786	UTEX1560_02160	Zm00001d033265, Zm00001d016000, Zm00001d041821, Zm00001d037836, Zm00001d039306, Zm00001d042910, Zm00001d012404
Zci_06282	N0.HOG0006434	OG0005181	n0	NA	NA	AT1G07170, AT2G30000	Bradi1g36290, Bradi5g25110	NA	Chrsp127S01907	Cre05.g234648_4532	CLOP_g23443	276	Me1_v2_0134430	Mp8g14050	12257	Olucimarinus_39608	LOC_Os04g56760, LOC_Os05g30410	PRCOL_00000162_RA	pm124150g0010, pm004428.t1, pm010307g0050, pm024916g0020, pm035046.t1	Pp3c6_23270, Pp3c24_80	Solyc12g010340	228566	SM000037S13562, SM000098S25122, SM000130S27096	Zci1a_07092, Zci1a_43244	Zci_06282	NA	UTEX1560_11835	Zm00001d001951
Zci_02258	N0.HOG0021081	OG0018979	n0	NA	NA	NA	NA	NA	NA	NA	NA	NA	NA	NA	NA	NA	NA	NA	pm005432g0010, pm049035g0010	NA	NA	NA	NA	NA	Zci_02258	UTEX1559_06262	UTEX1560_03228	NA
Zci_12358	N0.HOG0002198	OG0001426	n0	AagrOXF_evm.TU.utg000050l.395, AagrOXF_evm.TU.utg000116l.395, AagrOXF_evm.TU.utg000032l.19	Azfi_s0016.g014277, Azfi_s0078.g038093, Azfi_s0232.g059342, Azfi_s0168.g054589	AT1G30460, AT4G11970	Bradi1g32560	CBR_g11088, CBR_g9036	Chrsp33S05101, Chrsp103S00992	Cre24.g755647_4532, Cre12.g516400_4532	CLOP_g12929, CLOP_g12928, CLOP_g16781	5577, 12363	Me1_v2_0184740	Mp6g15200, Mp3g00420	24651	Olucimarinus_10510	LOC_Os06g46400	PRCOL_00005787_RA, PRCOL_00006800_RA	pm003502.t1, pm051513g0020	Pp3c20_9290, Pp3c8_11880	Solyc02g070240, Solyc02g021760, Solyc08g007760, Solyc08g007730.2, Solyc08g007750	77664	SM000024S07869, SM000006S19441, SM000186S04148, SM000188S03836, SM000098S25083, SM000115S23914	Zci1a_26386	Zci_12358, Zci_07938	UTEX1559_16869, UTEX1559_13135	UTEX1560_10735, UTEX1560_10737, UTEX1560_10736, UTEX1560_05626, UTEX1560_05625	Zm00001d014378, Zm00001d036595, Zm00001d036594, Zm00001d014379
Zci_04376	N0.HOG0002542	OG0001706	n0	AagrOXF_evm.TU.utg000058l.172, AagrOXF_evm.TU.utg000081l.145, AagrOXF_evm.TU.utg000041l.15, AagrOXF_evm.TU.utg000006l.27, AagrOXF_evm.TU.utg000006l.69, AagrOXF_evm.TU.utg000006l.92, AagrOXF_evm.TU.utg000024l.266	Azfi_s0010.g012128	AT2G41630, AT3G10330, AT3G29380, AT4G10680	Bradi4g42115, Bradi2g17760, Bradi2g17730, Bradi4g36290	CBR_g39879	Chrsp59S06948	Cre06.g310450_4532	CLOP_g4770	12327	Me1_v2_0202150	Mp6g05790, Mp6g02040, Mp6g02100, Mp1g22580	6533	Olucimarinus_43151	LOC_Os03g09820, LOC_Os05g47480, LOC_Os09g36440	PRCOL_00005639_RA	pm001523g0140, pm023680g0010, pm030035.t1	Pp3c1_38410, Pp3c14_21180	Solyc10g079990, Solyc10g079370, Solyc10g079360	266576	SM000014S00284, SM000036S13277	Zci1a_29957, Zci1a_10852	Zci_04376	UTEX1559_08084	UTEX1560_13168	Zm00001d038889, Zm00001d021309, Zm00001d006220, Zm00001d034116, Zm00001d040018, Zm00001d043792
Zci_08017	N0.HOG0032903	OG0030726	-	NA	NA	NA	NA	NA	NA	NA	NA	NA	NA	NA	NA	NA	NA	NA	NA	NA	NA	NA	NA	NA	Zci_08017	UTEX1559_03843	UTEX1560_15816	NA
Zci_12885	N0.HOG0001074	OG0000613	n10	AagrOXF_evm.TU.utg000028l.113, AagrOXF_evm.TU.utg000056l.39, AagrOXF_evm.TU.utg000063l.391	Azfi_s0058.g034420	AT3G20240	Bradi3g40497, Bradi4g34100, Bradi5g26776	CBR_g19105, CBR_g19106	NA	NA	CLOP_g4227, CLOP_g10759	11134	Me1_v2_0202710, Me1_v2_0154240	Mp7g12620	NA	NA	LOC_Os08g40850, LOC_Os09g32200	NA	pm000668g0010	Pp3c15_14990, Pp3c10_6880	Solyc03g123990	7250	SM000011S19132, SM000007S20979, SM000212S06919, SM000133S26775, SM000107S14073, SM000208S06324	NA	Zci_12885	UTEX1559_12281	NA	Zm00001d031527, Zm00001d022406, Zm00001d020980
Zci_04610	N0.HOG0007402	OG0006108	n0	AagrOXF_evm.TU.utg000091l.552	Azfi_s0018.g014793	AT3G13235	Bradi3g07286	CBR_g36902, CBR_g31527	Chrsp3S00435	Cre10.g447300_4532	CLOP_g3890	4409	Me1_v2_0199780	Mp8g17750	NA	Olucimarinus_29872	LOC_Os02g10510	PRCOL_00000426_RA	pm001391g0050, pm009899g0010	Pp3c17_4800, Pp3c4_20890	Solyc10g005890	NA	SM000032S12063, SM000071S21051, SM000045S16254	Zci1a_35627, Zci1a_00310	Zci_04610	UTEX1559_00255	UTEX1560_00199	Zm00001d053658
Zci_07869	N0.HOG0001028	OG0000580	n0	AagrOXF_evm.TU.utg000006l.417	Azfi_s0524.g075300, Azfi_s0093.g043205, Azfi_s0213.g058278, Azfi_s0114.g046082, Azfi_s0002.g001103, Azfi_s0087.g042232, Azfi_s0292.g063379, Azfi_s0004.g008611	AT3G03950, AT5G61020, AT1G55500, AT3G13460, AT1G48110, AT3G17330, AT1G09810, AT1G79270, AT1G27960, AT3G13060, AT5G58190	Bradi1g05970, Bradi1g74560, Bradi4g02150, Bradi2g12380, Bradi2g34785, Bradi1g64100, Bradi2g46590, Bradi5g01317, Bradi3g06031, Bradi3g18190, Bradi3g42640	CBR_g12212	Chrsp103S01081, Chrsp103S01083, Chrsp103S01085	NA	CLOP_g552, CLOP_g2115, CLOP_g760, CLOP_g20558	4614, 3534, 2139, 4591	Me1_v2_0225630	Mp1g00140	NA	NA	LOC_Os07g07490, LOC_Os03g06240, LOC_Os03g53670, LOC_Os01g22630, LOC_Os03g20180, LOC_Os01g48790, LOC_Os04g04000, LOC_Os05g01520, LOC_Os04g51940, LOC_Os08g12760, LOC_Os08g44200	NA	pm000926.t2, pm011397g0030, pm000792g0040, pm000831g0020, pm002906g0020	Pp3c10_17810, Pp3c3_33560	Solyc01g028860, Solyc12g099090, Solyc01g103540, Solyc05g032850	6427	SM000115S23950, SM000098S25091, SM000188S03816, SM008089S22595	Zci1a_21935, Zci1a_21936	Zci_07869	UTEX1559_14800	UTEX1560_08771, UTEX1560_08772	Zm00001d018896, Zm00001d007890, Zm00001d027731, Zm00001d048424, Zm00001d034005, Zm00001d034996, Zm00001d049729, Zm00001d010826, Zm00001d043860, Zm00001d011602, Zm00001d048501, Zm00001d002372, Zm00001d002008, Zm00001d012730, Zm00001d049360, Zm00001d024339, Zm00001d047072, Zm00001d008913, Zm00001d031981
Zci_02026	N0.HOG0008548	OG0007196	n0	NA	NA	NA	NA	NA	NA	NA	CLOP_g22889	NA	NA	NA	NA	NA	NA	NA	pm007275g0010, pm016681.t1, pm000418g0070, pm001135g0080, pm024251g0010, pm066612g0010, pm000622.t1, pm005829g0010	NA	NA	NA	NA	Zci1a_24687, Zci1a_01633	Zci_14961, Zci_14856, Zci_02026, Zci_02014	UTEX1559_05663, UTEX1559_14542, UTEX1559_17120, UTEX1559_01868, UTEX1559_01872	UTEX1560_14813, UTEX1560_14992, UTEX1560_04767, UTEX1560_04698, UTEX1560_04703	NA
Zci_03040	N0.HOG0011407	OG0009835	n0	AagrOXF_evm.TU.utg000027l.349	Azfi_s0007.g010936, Azfi_s0104.g044710	NA	NA	NA	NA	NA	NA	NA	Me1_v2_0075910	Mp1g27860	NA	NA	NA	NA	NA	Pp3c21_14350, Pp3c18_6970	NA	NA	SM000200S05837, SM000214S06791	Zci1a_37521	Zci_03040	UTEX1559_15415, UTEX1559_15414	UTEX1560_15222	NA
Zci_02003	N0.HOG0002652	OG0001795	n0	AagrOXF_evm.TU.utg000091l.61, AagrOXF_evm.TU.utg000100l.236	Azfi_s0006.g010128, Azfi_s0051.g031231	AT2G17190, AT2G17200	Bradi1g76321, Bradi1g76314	CBR_g54797	Chrsp57S06778	Cre15.g637100_4532	CLOP_g25043	2298	Me1_v2_0153160	Mp1g23030	23051	Olucimarinus_28268	LOC_Os10g39620, LOC_Os03g03920	PRCOL_00001915_RA	pm007370g0010, pm000113g0060, pm001783g0030	Pp3c8_4020, Pp3c4_6722, Pp3c4_6720, Pp3c12_13580, Pp3c3_32590	Solyc03g032160, Solyc02g060600.1, Solyc02g061640, Solyc02g060590, Solyc02g061720, Solyc02g061670.1, Solyc02g060570.1, Solyc02g060580, Solyc02g061710, Solyc02g061680, Solyc02g061610.1, Solyc02g082800	171198	SM000074S21699, SM000168S02594, SM000347S12989	Zci1a_21722, Zci1a_15725	Zci_02003	UTEX1559_15073	UTEX1560_04689	Zm00001d029782, Zm00001d047373, Zm00001d027514, Zm00001d048343
Zci_11783	N0.HOG0001548	OG0000938	n0	AagrOXF_evm.TU.utg000116l.268	Azfi_s0064.g035719, Azfi_s0345.g065769, Azfi_s0056.g034033	AT5G50000, AT3G01490, AT3G63260, AT3G22750, AT4G14780	Bradi2g15560, Bradi2g44910, Bradi4g02367, Bradi1g14000, Bradi1g14010, Bradi1g08865	CBR_g22920	NA	Cre07.g319350_4532, Cre06.g301000_4532	CLOP_g13007, CLOP_g13006, CLOP_g7067, CLOP_g3309, CLOP_g8147, CLOP_g8145	5836	Me1_v2_0176870, Me1_v2_0115980	Mp8g09610, Mp8g05930	29004	NA	LOC_Os05g50190, LOC_Os01g45380, LOC_Os12g30570, LOC_Os12g41260, LOC_Os03g43760, LOC_Os03g53410	PRCOL_00006433_RA	pm011979.t1, pm036951g0010, pm140145g0010	Pp3c2_18630, Pp3c4_20780, Pp3c1_18390	Solyc04g026210, Solyc06g071410, Solyc03g114210, Solyc12g062280, Solyc09g082470, Solyc10g045270	271276, 34528	SM000013S26485, SM000004S15051, SM000045S16181	Zci1a_16103, Zci1a_16104, Zci1a_19262	Zci_05749, Zci_11783	UTEX1559_11219, UTEX1559_08098	UTEX1560_05169, UTEX1560_05170, UTEX1560_10615	Zm00001d009660, Zm00001d044091, Zm00001d011458, Zm00001d033275, Zm00001d031014, Zm00001d018591, Zm00001d017226, Zm00001d033991, Zm00001d013288
Zci_08312	N0.HOG0046625	OG0044448	-	NA	NA	NA	NA	NA	NA	NA	NA	NA	NA	NA	NA	NA	NA	NA	NA	NA	NA	NA	NA	NA	Zci_08312	NA	UTEX1560_17913	NA
Zci_15568	N0.HOG0008427	OG0007081	n0	AagrOXF_evm.TU.utg000050l.565	Azfi_s0185.g056664	AT2G19080	Bradi1g48210	NA	Chrsp94S08257	Cre03.g177900_4532	CLOP_g11429	9965	Me1_v2_0109300	Mp1g19620	13833	Olucimarinus_26295	LOC_Os06g07160	PRCOL_00000454_RA	pm000255g0050, pm022379g0020	Pp3c4_10660, Pp3c12_12510	Solyc07g009320	405344	NA	Zci1a_24107	Zci_15568	UTEX1559_02092	UTEX1560_16499	Zm00001d045193
Zci_01582	N0.HOG0010911	OG0009378	n0	NA	NA	NA	NA	NA	NA	NA	CLOP_g18259	NA	Me1_v2_0092060	NA	NA	NA	NA	NA	pm003811g0020, pm008246g0020, pm003811g0030, pm037898g0010	NA	NA	NA	SM000118S25581, SM000002S05707, SM000152S01541	Zci1a_44785, Zci1a_32417, Zci1a_32414	Zci_01582	UTEX1559_11504	UTEX1560_08588, UTEX1560_08587	NA
Zci_02622	N0.HOG0033250	OG0031073	-	NA	NA	NA	NA	NA	NA	NA	NA	NA	NA	NA	NA	NA	NA	NA	NA	NA	NA	NA	NA	NA	Zci_02622	UTEX1559_15735	UTEX1560_16248	NA
Zci_00303	N0.HOG0001510	OG0000908	n0	AagrOXF_evm.TU.utg000091l.492, AagrOXF_evm.TU.utg000126l.246, AagrOXF_evm.TU.utg000081l.393, AagrOXF_evm.TU.utg000003l.545, AagrOXF_evm.TU.utg000035l.367, AagrOXF_evm.TU.utg000081l.392, AagrOXF_evm.TU.utg000081l.390, AagrOXF_evm.TU.utg000116l.425, AagrOXF_evm.TU.utg000071l.10	Azfi_s0119.g046687, Azfi_s0015.g013981, Azfi_s0449.g070723, Azfi_s0167.g054530	AT2G22660, AT4G37682, AT4G37900, AT1G56230	Bradi4g13281, Bradi4g13272, Bradi2g12637	NA	NA	Cre13.g565050_4532	CLOP_g1084, CLOP_g9035, CLOP_g11709, CLOP_g9034, CLOP_g20225	790, 5052, 8449	Me1_v2_0102350, Me1_v2_0029270, Me1_v2_0102340, Me1_v2_0074830, Me1_v2_0217260	Mp3g10020, Mp3g10030, Mp4g04810, Mp6g10720, Mp6g11850, Mp6g11870, Mp3g14930, Mp7g18660, Mp1g14110, Mp1g29810	NA	NA	LOC_Os11g40590, LOC_Os01g24480	NA	pm024713.t1, pm003990g0010, pm005921g0010, pm004276g0010	Pp3c21_5400, Pp3c12_24320, Pp3c10_15350, Pp3c14_14700, Pp3c1_29600, Pp3c9_20110, Pp3c25_8040	Solyc02g091650, Solyc02g063450, Solyc01g099980	439262	NA	Zci1a_14423, Zci1a_23758	Zci_07727, Zci_00303, Zci_03065	UTEX1559_06869, UTEX1559_10143, UTEX1559_03811	UTEX1560_08357, UTEX1560_08910, UTEX1560_10730	Zm00001d048802, Zm00001d040784
Zci_05290	N0.HOG0008104	OG0006765	n0	AagrOXF_evm.TU.utg000002l.266, AagrOXF_evm.TU.utg000006l.1101	Azfi_s0064.g035445	NA	NA	NA	Chrsp42S05735	NA	CLOP_g2461	11040	Me1_v2_0213330	Mp8g05720, Mp7g19310	NA	NA	NA	NA	pm001675.t2, pm010462.t1, pm001816.t1, pm018666g0010	Pp3c7_7930, Pp3c11_21990, Pp3c11_21996	NA	440673, 404059, 404357	SM000037S13598, SM000130S27130, SM000098S25162	Zci1a_01982	Zci_05290	UTEX1559_13503	UTEX1560_11073	NA
Zci_11175	N0.HOG0005904	OG0004685	n0	AagrOXF_evm.TU.utg000024l.78	Azfi_s0059.g034594	AT2G47970, AT3G63000	Bradi2g13180	NA	Chrsp1S03191	Cre06.g800716_4532	CLOP_g17594	6142	Me1_v2_0110680	Mp2g11680	5180	Olucimarinus_31250	LOC_Os01g27990	PRCOL_00001630_RA	pm006561g0010, pm008045g0010, pm027530g0010, pm016419g0010	Pp3c4_25410	Solyc06g084440	129073	SM000035S13140, SM000106S13982, SM000352S13423	Zci1a_29307	Zci_11175	UTEX1559_10546	UTEX1560_04997	Zm00001d005621, Zm00001d050704, Zm00001d012267, Zm00001d042709
Zci_07312	N0.HOG0000624	OG0000325	n0	AagrOXF_evm.TU.utg000033l.263, AagrOXF_evm.TU.utg000006l.578, AagrOXF_evm.TU.utg000063l.293, AagrOXF_evm.TU.utg000084l.137	Azfi_s0006.g009709, Azfi_s0006.g009710, Azfi_s0390.g067712, Azfi_s0250.g060267, Azfi_s0390.g067709, Azfi_s0250.g060272	AT1G70630	Bradi2g19997	CBR_g25868	NA	Cre04.g217949_4532	CLOP_g23193, CLOP_g11173, CLOP_g12682, CLOP_g2343, CLOP_g2344, CLOP_g2792, CLOP_g23497, CLOP_g23509, CLOP_g24282, CLOP_g4977, CLOP_g23305, CLOP_g1859, CLOP_g19179, CLOP_g22142, CLOP_g19180, CLOP_g22141, CLOP_g13226, CLOP_g16805	640	Me1_v2_0210770, Me1_v2_0210780, Me1_v2_0222560, Me1_v2_0225690, Me1_v2_0229870, Me1_v2_0229880, Me1_v2_0229890, Me1_v2_0129020, Me1_v2_0166820	Mp6g12540	NA	NA	LOC_Os05g43810	NA	pm003552g0010, pm008107g0030, pm008670g0030, pm000138g0090, pm016047g0020, pm004296g0010, pm015669g0020, pm020713g0010, pm014348g0020, pm000027g0010, pm000027g0020, pm032047g0010, pm011635g0050, pm006874g0040, pm008224.t1, pm011635g0040, pm011635g0030, pm008583g0010	Pp3c1_26680, Pp3c18_680	Solyc05g013500	76356	SM000140S00580, SM000013S26522, SM000157S02097, SM000051S17568, SM000009S23556, SM000084S23153, SM000058S18512, SM000142S00555	Zci1a_15955, Zci1a_44277, Zci1a_16291, Zci1a_27893, Zci1a_28188, Zci1a_27891, Zci1a_12694, Zci1a_09835, Zci1a_34519, Zci1a_19386, Zci1a_39701, Zci1a_39866, Zci1a_30333, Zci1a_35364, Zci1a_30331, Zci1a_23138, Zci1a_23140, Zci1a_41187, Zci1a_41186, Zci1a_14794, Zci1a_12693, Zci1a_02581, Zci1a_39867, Zci1a_17544, Zci1a_17768, Zci1a_23165	Zci_10706, Zci_09121, Zci_07312, Zci_03879, Zci_00501, Zci_15658, Zci_11074, Zci_01127, Zci_13955, Zci_04947	UTEX1559_08851, UTEX1559_13648, UTEX1559_06725, UTEX1559_06401, UTEX1559_07364, UTEX1559_17604, UTEX1559_01950, UTEX1559_05557, UTEX1559_16488, UTEX1559_04157	UTEX1560_11310, UTEX1560_11309, UTEX1560_10894, UTEX1560_11867, UTEX1560_11536, UTEX1560_01003, UTEX1560_04529, UTEX1560_06599, UTEX1560_04104, UTEX1560_17658, UTEX1560_18249, UTEX1560_01555	Zm00001d038687, Zm00001d046727
Zci_00856	N0.HOG0000197	OG0000100	n161	AagrOXF_evm.TU.utg000053l.35	Azfi_s0065.g035780, Azfi_s0002.g001361, Azfi_s3805.g117002	AT5G42270, AT1G50250	Bradi1g29900	CBR_g4126	NA	Cre12.g485800_4532	CLOP_g9571, CLOP_g5026	4377	Me1_v2_0099280, Me1_v2_0099290	Mp3g08790	18885	NA	LOC_Os06g51029	PRCOL_00001055_RA	pm000019g0190, pm022316g0020, pm037246g0030, pm005540g0020	Pp3c20_15780, Pp3c23_8400	Solyc04g082250	139726	SM000079S22445, SM000088S23703, SM000124S25945	Zci1a_14520, Zci1a_43866, Zci1a_18652	Zci_00856	UTEX1559_04464	UTEX1560_01670	Zm00001d036371
Zci_15594	N0.HOG0001547	OG0000937	n11	AagrOXF_evm.TU.utg000113l.225	Azfi_s0099.g043999	AT3G51520	Bradi3g53247, Bradi1g42650	CBR_g8007, CBR_g23340	NA	Cre03.g205050_4532	CLOP_g17434, CLOP_g1434, CLOP_g3991, CLOP_g11597, CLOP_g11607	1045, 10098	Me1_v2_0060660, Me1_v2_0201130	Mp3g04330	NA	Olucimarinus_27747	LOC_Os02g48350, LOC_Os06g22080	PRCOL_00002759_RA, PRCOL_00006880_RA	pm002352g0010, pm040064.t1, pm004573g0060, pm002093g0090, pm055907g0010, pm007078g0010, pm002980g0040, pm004978.t1, pm039937g0010, pm121702g0010, pm004860g0070, pm004978g0030	Pp3c22_20760, Pp3c14_20110	Solyc02g068240	96204	SM005983S19572, SM000284S10670, SM006285S20099, SM000061S19201, SM000145S00792, SM000284S10675, SM000061S19210, SM000145S00795, SM000284S10671	Zci1a_32929, Zci1a_40151, Zci1a_03724	Zci_15596, Zci_15594	UTEX1559_02119, UTEX1559_02117, UTEX1559_05832	UTEX1560_04329, UTEX1560_04327, UTEX1560_01153	Zm00001d051628, Zm00001d049024, Zm00001d014506, Zm00001d045927
Zci_10232	N0.HOG0008956	OG0007578	n0	AagrOXF_evm.TU.utg000100l.325	NA	AT5G62280, AT1G12320, AT1G62840, AT2G45360, AT3G60780	NA	NA	NA	NA	NA	NA	NA	Mp1g19100	NA	NA	LOC_Os08g01910, LOC_Os02g25780	NA	NA	Pp3c9_7130, Pp3c15_12130	Solyc01g095920, Solyc01g091250, Solyc03g083500, Solyc06g034410, Solyc03g083490, Solyc10g018200, Solyc08g007480, Solyc08g079480	NA	NA	NA	Zci_10232	UTEX1559_10288	UTEX1560_12430	Zm00001d018712
Zci_13028	N0.HOG0005107	OG0003948	n0	NA	Azfi_s0004.g008469	AT1G79030, AT1G16680, AT5G49580	Bradi4g01910, Bradi1g02800	CBR_g8288	NA	Cre10.g445900_4532	CLOP_g17514	11373	Me1_v2_0079270	Mp5g15880	637	NA	LOC_Os12g41820, LOC_Os03g61730	PRCOL_00000480_RA	pm001625g0030, pm008822.t1, pm001625g0020, pm035428g0010, pm010202g0030	Pp3c24_9110	Solyc07g066290, Solyc07g026810	NA	SM000128S26236, SM005551S17902, SM000182S03937, SM000015S01278	Zci1a_08509	Zci_13028	UTEX1559_15308, UTEX1559_15309	UTEX1560_03179	Zm00001d031059, Zm00001d041488, Zm00001d012913
Zci_00217	N0.HOG0006030	OG0004800	n0	AagrOXF_evm.TU.utg000083l.99	Azfi_s0001.g000803	AT1G16290	Bradi3g60592, Bradi3g05286, Bradi1g38119	CBR_g32054	Chrsp175S02400	NA	CLOP_g1630, CLOP_g13475	701	Me1_v2_0232630	Mp8g12060	17227, 22843, 22844	NA	LOC_Os02g07480	PRCOL_00003152_RA	pm012371g0020, pm012371g0010, pm021677g0020	Pp3c5_22590	Solyc07g066640	113854, 441741, 443508	SM000266S09829, SM000118S25621, SM000122S25807	NA	Zci_00217	UTEX1559_07139	UTEX1560_12675	Zm00001d053799
Zci_04839	N0.HOG0001271	OG0000743	n1	AagrOXF_evm.TU.utg000002l.275	Azfi_s0230.g059183, Azfi_s0015.g013902	NA	NA	NA	NA	NA	CLOP_g21095, CLOP_g12480	13040	Me1_v2_0135100	Mp8g07390	NA	NA	NA	NA	pm000274g0050, pm021481g0010, pm030414g0010, pm010720g0010, pm004492g0020, pm054265g0010	Pp3c4_6860, Pp3c12_13650	NA	414095, 418727	SM000014S00266, SM000002S05680, SM000036S13288	Zci1a_05574	Zci_04839	UTEX1559_01446	UTEX1560_01196	NA
Zci_05525	N0.HOG0003112	OG0002195	n0	AagrOXF_evm.TU.utg000010l.308	Azfi_s0006.g010107	AT4G24730	Bradi4g38330, Bradi4g38340	CBR_g48132	Chrsp58S06899	NA	CLOP_g6894, CLOP_g7771, CLOP_g4714	10236, 7110	Me1_v2_0230990, Me1_v2_0197460	Mp1g14560, Mp1g07280	NA	Olucimarinus_5767, Olucimarinus_5807	LOC_Os07g48840	PRCOL_00003021_RA	pm016681g0030, pm007275g0020, pm012064g0010, pm030553g0010, pm003415g0070, pm003033g0040	Pp3c15_10910, Pp3c23_9280, Pp3c2_17660, Pp3c23_9300	Solyc03g112080.1	78013	SM000186S04126, SM000342S12977, SM000146S00943, SM000048S16564, SM000072S21189	Zci1a_00993, Zci1a_38275	Zci_02229, Zci_05525	UTEX1559_10856, UTEX1559_05362	UTEX1560_10954, UTEX1560_06498	Zm00001d049960, Zm00001d019656
Zci_10883	N0.HOG0005037	OG0003885	n0	AagrOXF_evm.TU.utg000063l.225	Azfi_s0001.g000988	AT4G28450	Bradi5g21640, Bradi2g08280	CBR_g34460	Chrsp251S00804	Cre07.g318702_4532	CLOP_g16958	8195	Me1_v2_0026370, Me1_v2_0051910	Mp5g11980	21298	Olucimarinus_50969	LOC_Os01g13730	PRCOL_00005495_RA	pm015554g0020, pm026075g0010, pm153758g0010, pm000954g0120, pm023457g0030	Pp3c9_6000	Solyc07g053660	439559	SM000004S15014, SM000007S20826	Zci1a_44152	Zci_10883	UTEX1559_01587, UTEX1559_01586, UTEX1559_01585	UTEX1560_03260, UTEX1560_03259, UTEX1560_03261	Zm00001d034883
Zci_11706	N0.HOG0000683	OG0000366	n5	AagrOXF_evm.TU.utg000050l.733, AagrOXF_evm.TU.utg000006l.965, AagrOXF_evm.TU.utg000117l.67	Azfi_s0065.g035849, Azfi_s0368.g067031	AT4G25650, AT3G44880	Bradi1g04810, Bradi1g75270	CBR_g26035, CBR_g53748, CBR_g49646, CBR_g37742, CBR_g49649, CBR_g81620, CBR_g49638	Chrsp369S05411, Chrsp44S05819, Chrsp108S01386, Chrsp108S01391	Cre10.g450550_4532, Cre13.g583050_4532, Cre17.g724700_4532, Cre17.g724600_4532	CLOP_g22798, CLOP_g9097, CLOP_g13632, CLOP_g12434	12361, 1148, 14597, 1432, 594, 9332	Me1_v2_0126260, Me1_v2_0215170, Me1_v2_0215180, Me1_v2_0122130	Mp6g13750, Mp7g01120, Mp2g00380, Mp3g10850	26837, 12819, 12818, 19807, 12820	Olucimarinus_43309	LOC_Os03g59110, LOC_Os03g59100, LOC_Os03g59152, LOC_Os03g59120, LOC_Os03g05310	PRCOL_00006185_RA	pm005035g0020, pm013376g0020, pm004612g0030, pm003442g0040, pm009987g0010, pm003416g0060, pm010918g0010, pm001021g0130, pm048009g0010, pm025834g0020	Pp3c2_6220, Pp3c3_19130, Pp3c1_40790	Solyc04g039880, Solyc04g040160, Solyc04g039870, Solyc11g066440	130316, 174928	SM000136S00153, SM000122S25764, SM000425S15897, SM007016S21277, SM008189S22585, SM000020S05971, SM000096S24849, SM000153S01622, SM007421S21521, SM011309S24270, SM000003S11182, SM000061S19246, SM000036S13260, SM000036S13266, SM000003S11174, SM000061S19238, SM000075S21999, SM000025S08386, SM000165S02198	Zci1a_14277, Zci1a_03186, Zci1a_26319, Zci1a_26321, Zci1a_44361, Zci1a_33617, Zci1a_09423, Zci1a_26322, Zci1a_32464, Zci1a_20664	Zci_04730, Zci_10399, Zci_11706, Zci_05622	UTEX1559_02696, UTEX1559_01792, UTEX1559_16355, UTEX1559_01827, UTEX1559_01828	UTEX1560_03472, UTEX1560_01224, UTEX1560_16840, UTEX1560_19364, UTEX1560_03800, UTEX1560_03802	Zm00001d034523, Zm00001d011533, Zm00001d002582, Zm00001d035045, Zm00001d027656
Zci_16616	N0.HOG0000141	OG0000067	n61	AagrOXF_evm.TU.utg000013l.104, AagrOXF_evm.TU.utg000084l.205, AagrOXF_evm.TU.utg000011l.110, AagrOXF_evm.TU.utg000009l.311, AagrOXF_evm.TU.utg000089l.11, AagrOXF_evm.TU.utg000091l.460, AagrOXF_evm.TU.utg000100l.271, AagrOXF_evm.TU.utg000004l.102, AagrOXF_evm.TU.utg000053l.19, AagrOXF_evm.TU.utg000009l.472, AagrOXF_evm.TU.utg000011l.107, AagrOXF_evm.TU.utg000063l.163, AagrOXF_evm.TU.utg000063l.177, AagrOXF_evm.TU.utg000038l.265, AagrOXF_evm.TU.utg000018l.476, AagrOXF_evm.TU.utg000018l.479, AagrOXF_evm.TU.utg000103l.156	NA	AT5G09340, AT2G36170, AT3G52590, AT1G11980, AT1G11970, AT1G53950, AT1G53980, AT1G53945, AT1G53930, AT2G35635, AT1G31340, AT3G09790, AT5G37640, AT1G65350, AT5G20620, AT5G03240, AT4G02890, AT4G05050, AT4G05320, AT1G55060	Bradi2g38317, Bradi1g68940, Bradi4g38540, Bradi2g28050, Bradi5g07198, Bradi2g12323, Bradi2g12326, Bradi2g12405, Bradi1g27095, Bradi1g67545, Bradi4g28550, Bradi1g30940, Bradi4g30470, Bradi3g15350, Bradi1g77862, Bradi3g52300, Bradi1g56230, Bradi1g32860, Bradi3g04730, Bradi1g32700, Bradi1g32460, Bradi3g03957, Bradi4g10305	CBR_g51339, CBR_g74692, CBR_g763, CBR_g17872, CBR_g17869	Chrsp33S08964, Chrsp259S03888, Chrsp171S08709, Chrsp23S03702	Cre07.g317050_4532, Cre07.g322100_4532, Cre01.g007051_4532, Cre09.g396400_4532, Cre11.g467567_4532	CLOP_g24253, CLOP_g11829, CLOP_g17978, CLOP_g9427, CLOP_g18626, CLOP_g17977, CLOP_g9251, CLOP_g17341, CLOP_g6801	9450, 9774, 9813, 2202	Me1_v2_0111780, Me1_v2_0083210, Me1_v2_0214780, Me1_v2_0052760, Me1_v2_0085420	Mp7g12490, Mp8g00780, Mp6g19060, Mp8g11720, Mp6g16040, Mp4g02730, Mp4g02740, Mp3g22950, Mp2g17420, Mp6g03960	17112, 17839, 24824, 22229, 3455	Olucimarinus_16428, Olucimarinus_40601, Olucimarinus_26775	LOC_Os03g13170, LOC_Os09g39500, LOC_Os09g27930, LOC_Os09g31019, LOC_Os07g30640, LOC_Os03g15370, LOC_Os05g38310, LOC_Os08g08760, LOC_Os09g31031, LOC_Os10g39590, LOC_Os01g45400, LOC_Os01g45420, LOC_Os06g44080, LOC_Os09g25320, LOC_Os02g06640, LOC_Os06g46770, LOC_Os04g53620, LOC_Os05g42424	PRCOL_00005939_RA	pm137653g0010, pm009443g0040, pm011771g0020, pm006974g0020, pm061945g0010, pm000201g0110, pm019255g0010, pm001799g0020, pm005766g0020, pm018000g0010, pm006060g0010, pm001503g0030, pm023094g0010, pm017420g0010, pm013521.t1, pm005314g0060, pm042990g0010, pm015072g0020, pm009002.t1, pm006588g0040, pm011104g0020, pm008475.t1, pm007206g0020, pm008980g0030	Pp3c7_23750, Pp3c10_25270, Pp3c24_430, Pp3c4_11930, Pp3c3_25480, Pp3c20_23170, Pp3c25_14180, Pp3c16_3920, Pp3c22_21900, Pp3c25_6580, Pp3c3_26770, Pp3c4_11430, Pp3c18_2470, Pp3c18_2510, Pp3c19_8830, Pp3c12_18200, Pp3c5_1920	Solyc08g083120, Solyc01g096290, Solyc03g082570, Solyc06g053210, Solyc08g008590, Solyc11g005650.1, Solyc11g072020.1, Solyc03g078630, Solyc11g005635.1, Solyc10g005560, Solyc09g098385.1, Solyc11g005670, Solyc07g064130, Solyc10g006480	122864, 101548, 93613, 163447, 228943, 271198, 138728, 187148, 173723, 227280, 270468, 19615, 162003, 271419	SM000014S00313, SM000012S25422, SM000038S14352, SM000022S07200, SM000043S15856, SM000263S09812	Zci1a_37303, Zci1a_17400, Zci1a_27268, Zci1a_24002, Zci1a_24003, Zci1a_07779, Zci1a_04604, Zci1a_23835, Zci1a_23999, Zci1a_39939, Zci1a_35381, Zci1a_45013, Zci1a_05580, Zci1a_39941, Zci1a_38527	Zci_16614, Zci_16616, Zci_16606, Zci_13865, Zci_16549	UTEX1559_18585	UTEX1560_12821	Zm00001d005334, Zm00001d036717, Zm00001d020511, Zm00001d015327, Zm00001d053838, Zm00001d053834
Zci_07384	N0.HOG0005071	OG0003918	n0	AagrOXF_evm.TU.utg000100l.111	Azfi_s0048.g030633	AT3G04500	Bradi3g12840, Bradi3g49130	CBR_g52330	Chrsp31S04911	Cre02.g088800_4532	CLOP_g19377, CLOP_g22093	5801	Me1_v2_0228090	Mp8g18410	17842, 17844, 17843	Olucimarinus_10530	LOC_Os08g45240, LOC_Os02g40900	PRCOL_00001552_RA	pmUn.t109	Pp3c23_14650	Solyc05g055010, Solyc04g010000, Solyc04g010040	68142	SM000030S11382, SM000028S10178, SM000076S21797	Zci1a_31509	Zci_07384	UTEX1559_08453	UTEX1560_09027	Zm00001d022050, Zm00001d006771, Zm00001d051139
Zci_00422	N0.HOG0002309	OG0001518	n0	AagrOXF_evm.TU.utg000012l.210, AagrOXF_evm.TU.utg000063l.154	Azfi_s0193.g057090, Azfi_s0193.g057092, Azfi_s0007.g011111	AT4G01650, AT5G08720	Bradi2g62090, Bradi1g02450	CBR_g31139, CBR_g48801	Chrsp122S08667, Chrsp97S08398	Cre02.g107750_4532	CLOP_g6879, CLOP_g9045	6555, 6707	Me1_v2_0144520, Me1_v2_0232010	Mp4g06770, Mp4g17170	23691	Olucimarinus_28967	LOC_Os01g74010, LOC_Os03g62170	PRCOL_00005747_RA	pm019228g0010, pm002417g0050, pm041656g0010, pm023481g0030	Pp3c6_14570, Pp3c16_9330	Solyc01g068620, Solyc05g009080	47431, 117904	SM000129S26117, SM000099S25247, SM000054S18103, SM000350S13034, SM000113S24062, SM000073S21458, SM000050S16975	Zci1a_14321, Zci1a_07230	Zci_01466, Zci_00422, Zci_09832	UTEX1559_15197, UTEX1559_07306, UTEX1559_14930	UTEX1560_03636, UTEX1560_01688, UTEX1560_05356	Zm00001d041961, Zm00001d034779
Zci_07393	N0.HOG0004053	OG0003014	n0	AagrOXF_evm.TU.utg000010l.414	Azfi_s0002.g001479, Azfi_s0034.g025436	AT4G16420, AT3G07740	Bradi1g08470	CBR_g12949	Chrsp31S00373	Cre02.g089150_4532	CLOP_g8554, CLOP_g14378	2473	Me1_v2_0228580	Mp1g02190	25513	Olucimarinus_19271, Olucimarinus_51202	LOC_Os03g53960	PRCOL_00001626_RA	pm003400g0040, pm030065g0010, pm014227g0010, pm002271g0010, pm010351g0010, pm017535g0020	Pp3c24_3660, Pp3c23_12600, Pp3c10_25160	Solyc05g054200, Solyc07g047610	96986	SM000028S10105, SM000027S09631, SM000076S21865	Zci1a_08858, Zci1a_08862	Zci_07393	UTEX1559_08470	NA	Zm00001d034033, Zm00001d013265
Zci_12105	N0.HOG0023785	OG0021641	n0	NA	NA	NA	NA	NA	NA	NA	NA	NA	Me1_v2_0143050	NA	NA	NA	NA	NA	NA	NA	NA	NA	NA	Zci1a_08046	Zci_12105	UTEX1559_05639	NA	NA
Zci_09109	N0.HOG0008115	OG0006776	n0	AagrOXF_evm.TU.utg000003l.179, AagrOXF_evm.TU.utg000006l.894	Azfi_s0385.g067550, Azfi_s0385.g067553, Azfi_s4031.g117678	AT1G48550	NA	CBR_g74660, CBR_g44935	NA	NA	NA	12041	Me1_v2_0057010, Me1_v2_0057050	Mp8g03740	14897	Olucimarinus_6250	NA	NA	NA	Pp3c2_29770, Pp3c1_6570	Solyc03g118660	3956	SM000135S27018, SM000029S10551, SM000189S04093	Zci1a_24995	Zci_09109, Zci_09108	UTEX1559_11572	UTEX1560_10517	NA
Zci_00322	N0.HOG0004803	OG0003684	n0	AagrOXF_evm.TU.utg000126l.218	Azfi_s0092.g043022, Azfi_s0038.g026273	AT3G30775, AT5G38710	Bradi3g32880	CBR_g41282	Chrsp94S08295	Cre16.g648350_4532, Cre01.g036850_4532	CLOP_g1669	9967	Me1_v2_0120640	Mp1g17910	8712	Olucimarinus_31222	LOC_Os10g40360	NA	pm006223g0010, pm004435g0040, pm004067g0040, pm021916g0010, pm002626g0060, pm004435g0050	Pp3c16_2800, Pp3c17_4560, Pp3c5_9640	Solyc02g089620, Solyc02g089630	100996	SM000666S20277, SM000190S04879	Zci1a_28927	Zci_00322	UTEX1559_10162	UTEX1560_08401	Zm00001d029853, Zm00001d047124
Zci_02114	N0.HOG0008229	OG0006890	n0	AagrOXF_evm.TU.utg000095l.96	Azfi_s0004.g008515	AT4G15420	Bradi2g40480	CBR_g4891	Chrsp36S05423	NA	CLOP_g17928, CLOP_g719	14711	Me1_v2_0073200	Mp1g04760	23965	NA	LOC_Os01g35040	NA	pm006973g0030, pm014452g0010, pm024000g0010	Pp3c3_2100	Solyc07g048120	NA	SM000123S25866, SM000095S24969, SM000012S25374	Zci1a_29797	Zci_02114	UTEX1559_16145	UTEX1560_07889	Zm00001d009359
Zci_10818	N0.HOG0002066	OG0001327	n0	AagrOXF_evm.TU.utg000006l.266	Azfi_s1837.g107348, Azfi_s0309.g064098, Azfi_s0557.g076880	AT5G05660, AT1G10170	Bradi2g00247, Bradi2g00226, Bradi1g44269	CBR_g3071, CBR_g24300, CBR_g19005, CBR_g23063	Chrsp108S00041, Chrsp26S04130, Chrsp26S04129	Cre03.g163200_4532	CLOP_g17761, CLOP_g22689	11456, 5247	Me1_v2_0190140, Me1_v2_0034480, Me1_v2_0151920	Mp8g16170, Mp1g08660, Mp2g10850	26240, 1978, 26241, 6824	NA	LOC_Os01g06550, LOC_Os06g14190	NA	pm011290g0020, pm010325.t1, pm017996g0010, pm018508g0030	Pp3c2_24250, Pp3c25_1058, Pp3c25_1050	Solyc06g051570, Solyc03g118420	509, 30433	SM000154S01428, SM000023S07536, SM000062S19951	Zci1a_10199, Zci1a_43061, Zci1a_08828, Zci1a_43062	Zci_10818, Zci_05376	UTEX1559_08706, UTEX1559_10609	UTEX1560_14818, UTEX1560_04302	Zm00001d008648, Zm00001d006812, Zm00001d037356, Zm00001d044726
Zci_02016	N0.HOG0001444	OG0000867	n37	AagrOXF_evm.TU.utg000017l.113	Azfi_s0002.g006776	NA	NA	CBR_g49491	Chrsp31S04892	NA	CLOP_g24259, CLOP_g3206, CLOP_g1286, CLOP_g9414	12267, 12585, 2732, 6582	Me1_v2_0216350, Me1_v2_0167590, Me1_v2_0072080	Mp7g12590	NA	NA	NA	PRCOL_00000423_RA	pm072460g0010, pm001133g0080, pm015169g0020	Pp3c9_21990	NA	409828, 429095	SM000090S24300, SM000058S18540, SM000155S01666	Zci1a_45116, Zci1a_43376, Zci1a_43375, Zci1a_10958, Zci1a_10959	Zci_02016, Zci_12499	UTEX1559_01874, UTEX1559_13409, UTEX1559_09722	UTEX1560_13961, UTEX1560_15844, UTEX1560_15843, UTEX1560_02555	NA
Zci_01531	N0.HOG0000669	OG0000357	n37	AagrOXF_evm.TU.utg000041l.96, AagrOXF_evm.TU.utg000084l.138, AagrOXF_evm.TU.utg000041l.97, AagrOXF_evm.TU.utg000081l.157, AagrOXF_evm.TU.utg000006l.421	Azfi_s0004.g008310, Azfi_s0222.g058801, Azfi_s0003.g008160, Azfi_s0024.g020393, Azfi_s0034.g025374	AT1G54280, AT3G13900, AT1G17500, AT1G72700, AT1G13210, AT3G25610, AT1G68710, AT1G26130, AT3G27870	Bradi1g37700, Bradi1g42310, Bradi2g40060, Bradi3g35000	CBR_g38283, CBR_g29777, CBR_g38278, CBR_g34949	Chrsp201S03276, Chrsp201S03282	Cre12.g536000_4532, Cre12.g536050_4532	CLOP_g2415, CLOP_g2802, CLOP_g9346	12756, 690, 1430	Me1_v2_0152860, Me1_v2_0075770, Me1_v2_0075480	Mp4g23410, Mp5g08200	16483	Olucimarinus_49740	LOC_Os06g36990, LOC_Os06g29380, LOC_Os05g01030, LOC_Os08g29150	PRCOL_00000294_RA	pm003893g0010, pm001688g0020, pm016360g0040, pm023061g0010, pm001536g0020, pm012835g0010	Pp3c7_2800, Pp3c11_23720, Pp3c19_8640, Pp3c23_680, Pp3c8_12410	Solyc02g069420, Solyc06g062780, Solyc03g121810.2, Solyc12g044920, Solyc12g062510.1, Solyc05g010120, Solyc02g086800	76454, 116231, 95836	SM000202S05886, SM000367S13680, SM000324S12591	Zci1a_08434, Zci1a_09171, Zci1a_43984	Zci_06439, Zci_01531, Zci_03063	UTEX1559_05000, UTEX1559_11567, UTEX1559_03813	UTEX1560_07470, UTEX1560_01394, UTEX1560_01396, UTEX1560_10728	Zm00001d036968, Zm00001d046194, Zm00001d037465, Zm00001d045956, Zm00001d035775, Zm00001d032334
Zci_03245	N0.HOG0004249	OG0003186	n0	AagrOXF_evm.TU.utg000029l.6	Azfi_s0034.g025161, Azfi_s0051.g031266	AT1G16350, AT1G79470	Bradi1g06810, Bradi4g31320	CBR_g30467	Chrsp32S04952	Cre14.g614300_4532	CLOP_g10574	3834	Me1_v2_0030820, Me1_v2_0220330, Me1_v2_0026070	Mp7g17950	16665	Olucimarinus_119530, Olucimarinus_48856	LOC_Os03g56800	PRCOL_00001751_RA	pm003798.t1, pm027429g0030, pm023488g0030, pm015946g0010	Pp3c14_26610, Pp3c1_34070, Pp3c1_34170	Solyc10g079500	165452	SM000067S20360, SM000009S23470, SM000137S00462	NA	Zci_03245	UTEX1559_02409	UTEX1560_17441	Zm00001d013140, Zm00001d034023, Zm00001d034320
Zci_00281	N0.HOG0000404	OG0000198	n0	AagrOXF_evm.TU.utg000150l.17, AagrOXF_evm.TU.utg000111l.259, AagrOXF_evm.TU.utg000063l.464, AagrOXF_evm.TU.utg000003l.208, AagrOXF_evm.TU.utg000006l.856, AagrOXF_evm.TU.utg000020l.75	Azfi_s0038.g026227, Azfi_s0120.g046757, Azfi_s0001.g000828, Azfi_s0014.g013525	AT2G37360, AT3G53510, AT5G13580, AT3G55100, AT3G55110, AT3G55130, AT2G39350, AT3G55090, AT1G53270, AT2G13610, AT5G19410, AT4G25750, AT5G52860	Bradi4g29810, Bradi2g26560, Bradi1g62810, Bradi2g37632, Bradi2g54300, Bradi1g66110, Bradi1g66120, Bradi2g43570, Bradi5g27650, Bradi2g26800, Bradi2g13193, Bradi1g40464	CBR_g40481, CBR_g40473, CBR_g40486, CBR_g40477, CBR_g76851, CBR_g88618, CBR_g38412	Chrsp58S06870	NA	CLOP_g13162, CLOP_g17605, CLOP_g10060, CLOP_g25133, CLOP_g4571, CLOP_g21625, CLOP_g2653, CLOP_g21626, CLOP_g2352, CLOP_g4570, CLOP_g19366, CLOP_g21274, CLOP_g38, CLOP_g13801, CLOP_g17819, CLOP_g13143	6259, 8410, 11877, 2041	Me1_v2_0124740, Me1_v2_0124780, Me1_v2_0232050, Me1_v2_0141540, Me1_v2_0106680	Mp7g03860, Mp2g17910, Mp3g16700, Mp5g05620, Mp5g17950, Mp5g15770, Mp1g25240, Mp5g04860, Mp2g07990	6129	NA	LOC_Os09g23640, LOC_Os05g02890, LOC_Os07g04660, LOC_Os05g02870, LOC_Os01g61940, LOC_Os03g17370, LOC_Os03g17350, LOC_Os01g42900, LOC_Os05g31910, LOC_Os06g30730	NA	pm071399g0010, pm007424g0030, pm004384g0020, pm013714g0030, pm021308g0020, pm007424g0040, pm017441g0020, pm003245g0030	Pp3c9_18880, Pp3c20_6990, Pp3c8_17020, Pp3c1_17220, Pp3c22_15570, Pp3c18_7010, Pp3c22_15560, Pp3c18_7000, Pp3c5_16290, Pp3c3_34730, Pp3c8_1580, Pp3c12_11190, Pp3c26_3590	Solyc01g097430, Solyc09g098410, Solyc09g005970.1, Solyc05g054890, Solyc04g010210.1, Solyc04g010200.1, Solyc07g053300.1, Solyc07g062630.1, Solyc04g025910.1, Solyc05g056470.1, Solyc03g113690.1, Solyc06g005040.1, Solyc03g007690.1	134275, 90494, 84236, 93898, 88976	SM000111S18810, SM000025S08413, SM000085S23293, SM000025S08420, SM000085S23285, SM003069S11639, SM000027S09557, SM000085S23296, SM000025S08412, SM000027S09568, SM000089S23798, SM000043S15858, SM000127S26668	Zci1a_41737, Zci1a_32755, Zci1a_32760, Zci1a_32761, Zci1a_29889, Zci1a_42990, Zci1a_29472, Zci1a_39126, Zci1a_39130, Zci1a_29473	Zci_01760, Zci_00285, Zci_00281, Zci_10749, Zci_04002	UTEX1559_12747, UTEX1559_07221, UTEX1559_07218, UTEX1559_08795, UTEX1559_04886	UTEX1560_15937, UTEX1560_05262, UTEX1560_05259, UTEX1560_06121, UTEX1560_07818	Zm00001d024075, Zm00001d043722, Zm00001d035553, Zm00001d011006, Zm00001d042953, Zm00001d012438, Zm00001d028689, Zm00001d011350, Zm00001d044476, Zm00001d046071, Zm00001d026706, Zm00001d009492, Zm00001d038068, Zm00001d044895
Zci_05524	N0.HOG0001080	OG0000616	n0	AagrOXF_evm.TU.utg000014l.23, AagrOXF_evm.TU.utg000049l.694	Azfi_s0018.g014960, Azfi_s0004.g008356, Azfi_s3917.g117327	NA	NA	CBR_g30987, CBR_g32413, CBR_g32402, CBR_g32405	Chrsp12S01992, Chrsp12S01991, Chrsp1S03195, Chrsp36S00420, Chrsp29S00338	Cre02.g146300_4532, Cre13.g603750_4532	CLOP_g11715, CLOP_g9040, CLOP_g11716, CLOP_g9041, CLOP_g23263, CLOP_g16066, CLOP_g12654, CLOP_g23265, CLOP_g23264	10651, 4153	Me1_v2_0020500, Me1_v2_0103490, Me1_v2_0143070, Me1_v2_0020020, Me1_v2_0029780, Me1_v2_0078230, Me1_v2_0143060	Mp3g00930, Mp3g20950, Mp7g12080	22842, 8997, 960, 961, 2989, 11878, 2988, 10905	NA	NA	NA	pm025162g0030, pm010361.t1, pm000123g0070, pm004544g0050, pm004544g0040, pm005613g0010, pm184444g0010, pm023841g0040, pm032151g0010, pm031820g0010	Pp3c12_7370, Pp3c14_18490, Pp3c14_18300, Pp3c8_8470, Pp3c8_9390, Pp3c12_7350, Pp3c27_7700, Pp3c12_7361, Pp3c12_7360	NA	441904, 406662	SM000146S00940, SM000048S16560, SM000072S21206	Zci1a_09637, Zci1a_09640, Zci1a_09638, Zci1a_19083, Zci1a_09639, Zci1a_19250	Zci_04840, Zci_05524, Zci_15397, Zci_15390	UTEX1559_01447, UTEX1559_05363, UTEX1559_13678, UTEX1559_17572, UTEX1559_18773, UTEX1559_19189, UTEX1559_13688	UTEX1560_01197, UTEX1560_06497, UTEX1560_19741, UTEX1560_15475, UTEX1560_19463, UTEX1560_16009, UTEX1560_19471, UTEX1560_19316	NA
Zci_07682	N0.HOG0009129	OG0007735	n0	AagrOXF_evm.TU.utg000008l.312	Azfi_s0123.g048397, Azfi_s0052.g031629, Azfi_s2090.g109127, Azfi_s0505.g073938	AT2G14910	Bradi4g03477, Bradi1g14830	NA	NA	NA	NA	5959	NA	Mp8g04410, Mp2g22010	NA	NA	LOC_Os12g39200, LOC_Os03g41080	NA	NA	NA	Solyc01g107380	145704	NA	Zci1a_17050, Zci1a_04792	Zci_07682	UTEX1559_06924	UTEX1560_07698	Zm00001d033366, Zm00001d013745
