geneID	cold_0.5h_rep1	cold_0.5h_rep2	cold_0.5h_rep3	cold_1h_rep1	cold_1h_rep2	cold_1h_rep3	cold_2h_rep1	cold_2h_rep2	cold_2h_rep3	cold_4h_rep1	cold_4h_rep2	cold_4h_rep3	cold_6h_rep1	cold_6h_rep2	cold_6h_rep3	cold_24h_rep1	cold_24h_rep2	cold_24h_rep3	control_0h_rep3	control_0h_rep1	control_0h_rep4	control_0h_rep5	control_0h_rep6	control_0h_rep2	control_0.5h_rep3	control_0.5h_rep1	control_0.5h_rep2	control_1h_rep2	control_1h_rep3	control_1h_rep1	control_2h_rep2	control_2h_rep3	control_2h_rep1	control_4h_rep2	control_4h_rep3	control_4h_rep1	control_6h_rep2	control_6h_rep3	control_6h_rep1	control_24h_rep2	control_24h_rep3	control_24h_rep1	heat_0.5h_rep1	heat_0.5h_rep2	heat_0.5h_rep3	heat_1h_rep1	heat_1h_rep2	heat_1h_rep3	heat_2h_rep1	heat_2h_rep2	heat_2h_rep3	heat_4h_rep1	heat_4h_rep2	heat_4h_rep3	heat_6h_rep1	heat_6h_rep2	heat_6h_rep3	heat_24h_rep1	heat_24h_rep2	heat_24h_rep3	high_light_r_0.25_rep1	high_light_r_0.25_rep2	high_light_r_0.25_rep3	high_light_r_0.5_rep1	high_light_r_0.5_rep2	high_light_r_0.5_rep3	high_light_r_1_rep1	high_light_r_1_rep2	high_light_r_1_rep3	high_light_r_2_rep1	high_light_r_2_rep2	high_light_r_2_rep3	high_light_r_4_rep1	high_light_r_4_rep2	high_light_r_4_rep3	high_light_s_0.25_rep1	high_light_s_0.25_rep2	high_light_s_0.25_rep3	high_light_s_0.5_rep1	high_light_s_0.5_rep2	high_light_s_0.5_rep3	high_light_s_2_rep1	high_light_s_2_rep2	high_light_s_2_rep3	high_light_s_4_rep1	high_light_s_4_rep2	high_light_s_4_rep3	high_light_s_6_rep1	high_light_s_6_rep2	high_light_s_6_rep3
Pp3c1_31440V3	5.691311830145849	6.042685739996607	5.912876775520556	5.549192680375768	5.953392369819444	6.130629691692519	5.845118380745057	6.143378656358527	6.347171899240849	6.512602466757233	6.298894264613925	6.282976992797191	5.550222727879758	5.664772286145447	5.740951580435243	5.266343283724842	4.974265331976325	4.9871215216506934	5.216987716064175	5.133858100945935	5.455239182725233	4.964400175288399	4.914949706626484	5.492382369240741	4.975296468455599	5.06242916752872	5.377678526994575	5.323492932131129	5.128030387476401	5.669132328820569	5.38443864269281	5.559542279144125	5.637108506268349	5.278274682875136	5.122199992071059	5.588780172405285	5.234323745082518	4.7199793924772315	4.95519512551867	5.182573242416779	5.820996454708712	4.89592399916747	4.617078429702016	4.699213639441102	4.712152941664988	4.8487699659716466	4.781901384711583	4.84924803021058	5.029986654882672	4.826795781464294	4.7865108953954305	4.602091487357907	4.857797989664513	4.330801632315952	3.50309416164564	3.1466499674390302	3.243493458414475	5.311814410150429	5.265310031754525	5.041263310974427	5.214753612141661	4.744704137287357	4.135349773053628	3.9924002367605618	4.317768198501992	4.1319953245374865	4.323788781319226	3.5099855673231097	3.5080262777322413	3.5852249046071507	3.807340330138641	3.7618930913661472	3.8555112709238974	3.4757871319194193	3.1319492291786903	5.829495922164655	5.089340694094242	5.552833854435918	5.999915447091808	5.898157126711561	5.79427972117482	6.108729489112497	5.761539581163593	5.9227264038442105	6.110692756823704	6.000475077113123	5.914462300369646	5.743492937646397	4.629626914269301	5.2227820870561414
Pp3c1_430V3	3.3664057525269935	3.743354019995496	3.7759709953221954	2.4995612971418284	3.541019944328111	3.0271678393275545	2.7209915474398376	2.9605134120694028	2.8527373933117723	3.136042174062004	2.3749855103945823	2.8052376750504253	2.744609065277216	2.546095763185621	2.857344323993087	4.304545601865687	4.419453058351246	4.522200308962909	3.0387820814455937	3.4993589492030113	3.7670324254629897	5.080252951048562	3.73003765128198	2.7850425835068355	3.0019236939891374	3.5300375200349388	3.0476326318743965	3.0969617377399628	2.7684673729148668	3.537749863910514	2.7841127735486175	2.447013985386916	3.138790861214767	2.8418047265894515	2.455041998399872	2.9079465079544784	2.7962276082812028	2.16688260945297	3.4529565719856135	2.0947425234200097	3.4889058868643037	2.9954034522634467	2.2153331360722324	2.2449811704639098	2.8386662502833997	1.1311632347642755	1.1214435859914187	1.0902527102006492	0.10928760861982838	-0.1450121035120157	0.6197200909787846	2.556535121484789	2.302383249822038	2.7402119330092685	3.3241019195192147	3.0934990002038405	3.3559616216144112	3.330783421462435	2.9951934598013317	3.1058959521936544	3.6841133854219654	3.54965618659311	3.6870528195145704	3.3804400932683016	3.562493546260516	3.2944590809228367	3.593960649351374	2.962156490363441	3.4376530226060695	4.856555878925336	3.30054181355175	3.4032408765148237	3.5731351943214023	2.7336286069281917	4.132163445244406	3.8848793906520624	5.101320485296432	3.4238369941303146	5.3702995490121435	3.6104547166276393	3.4061977941825066	3.7849952871816703	5.148577082952797	3.5998494171685453	4.4175612362359296	3.755386439993016	4.445140682603206	3.5518444442210133	6.603113384560692	3.874924675255131
Pp3c10_10570V3	3.712100316769976	4.56391326991492	4.599783995640083	3.147904776124183	3.217150003129526	3.863983893180891	2.8013963959183243	3.319041055616475	2.939377390090939	3.614968306714783	3.5891178658739005	3.162943231280567	2.98264656338783	3.006502278099256	3.542635740877654	3.89510948900318	3.746430082936208	3.650172836940295	3.973471783627106	3.809388708999197	3.7724917747546	3.639672377839295	3.2216568078942114	3.991176935348107	3.3602575458339325	3.5385821908259114	3.2532320606848053	3.037089200422588	3.3582196658336323	2.5241165239726646	3.2204523997046093	2.6823257994150596	2.9593663021952192	3.0325748399347816	3.2493907615654134	2.877039010082109	3.113999002869963	3.182899507123278	2.2409061740029546	4.257727102388385	5.320918556877505	3.3938748542016546	3.939322616476398	4.418626504518901	3.5439066651911135	4.360635436879305	4.305549161634121	4.247031963865633	3.0753902686519616	3.4112992585432984	2.8848133905223903	1.9504300717634304	2.637572917265645	2.6178943291254737	2.938944348750644	3.107281861715724	3.0019774954320027	3.313164101112152	2.977951758401366	2.765293871982642	4.238798358095178	3.537703396033895	2.266936679913004	1.865273286884292	2.645243382412498	2.460469968776304	2.5929749657057584	1.9005719920719228	1.802400590573647	1.752499388506605	1.881160308877063	1.939496274541037	3.3590990855912386	2.8038260215698037	3.019257679174572	3.7381147719478527	3.5787407196138146	3.586268932076926	4.131552946296846	4.234551073677402	3.4943974848602695	3.9484301827082	3.749657317101122	3.2532771935934783	3.4680035364921484	3.603787580124591	3.2905398019313603	3.8465500715547023	3.3249700172251644	3.079484524087357
Pp3c10_9670V3	-5.762499172383022	-5.811548059573956	-5.808217086750024	-5.284353496200716	-5.83387693151679	-5.83026935436132	-5.756266988347608	-5.832352938071287	-5.827933877094616	-0.0998897106540984	0.6588620393526612	-5.815842906787754	-0.5564055707486001	-5.830565585494573	-0.202293420533978	2.5531249109895113	3.1245985844540094	2.1227512090661738	-5.038066799615004	-4.996634508709391	1.384371103362527	2.8755550966536103	-5.317693376554654	-2.2193612329534615	-5.568678072268888	-5.324532215254534	-5.345384491978805	-4.2431474551669455	-5.385679920681482	-5.050287444453501	-4.3432580984638225	-5.522707110046481	-5.4309024186618275	-5.009547662611248	-5.035539925360065	-5.513105718004838	-4.491280570710144	-5.15533487804357	-4.996990812940657	-4.17455224665868	-5.826317605877788	-5.776314233245793	-5.866729285955677	-5.866732557064056	-5.866706907644686	-5.871933159959508	-5.8719331815656695	-5.850004000449518	-5.869603011920429	-5.869192871719725	-5.869469426862975	-5.871980113986084	-5.866497956242936	-5.87202609159354	-5.839654721356444	-5.835478386393955	-5.835478386393955	-1.6018854266291502	-5.421004850509101	-5.624984352071864	-2.435275715767404	-5.974314834899595	-5.973097528346558	-5.884939038240472	-5.879381265779578	-5.892311102832038	-1.406167446189838	-5.736006092678057	-5.810261713007746	-5.930937138559928	-5.859731637899025	-4.933849763671979	-5.956287416484294	-1.283520784678188	-3.976471933514912	-1.0723299717480042	3.571025888740341	-5.599213509147482	3.661806561074062	-5.9299364956290965	-5.722801882862693	-6.024332437458691	1.531136086619186	-6.009847451202662	-5.973067735143744	-5.976047009471541	-5.94551661133454	-0.12119107281079668	4.8252461566379	-1.128262377208561
Pp3c12_8281V3	3.357325615897091	2.070522736487768	2.088739926274902	3.136254640255213	1.977974856630688	2.1982696411715845	3.0299854594596947	2.4251974612506837	2.459222210413189	1.846040870205301	2.0041409147090365	2.380580768458201	2.2679436918340907	2.590326287309927	2.2967329837586594	1.4866381857214666	1.087191788263632	1.0795674121329917	0.9174783495822656	0.06045484578139712	0.9418572632440132	1.9670535740768451	1.551293623764748	3.162147136478029	1.1704015718407954	1.6248924797141466	2.957639672085292	3.7692802025402505	0.01917948519478319	2.020190460278823	3.356230980422515	2.2022431711247816	2.101538328029071	3.2260579022408544	2.631420460944606	3.001481116034107	3.643612083538187	2.342667160505276	1.6927088673833224	2.6445859307586828	1.0937355499357215	1.334950350503972	-0.7508499802682563	1.6836275963381395	0.888937170093995	1.6845006425791529	1.903837845913776	-0.6693775135884281	1.9661893935247736	3.190735963567537	2.7896514533146135	3.4738717929302503	1.7892196563791445	3.306812553407726	2.7553909433706196	2.810154866547879	2.65584989735864	3.2543932123671744	2.6616272750196677	3.204997881364441	1.559549623291215	0.4462773101766936	0.9248747993318271	0.5880113157024217	1.7170818828613923	1.3642841775455423	1.0586176181226596	1.2782276676343545	1.1775595783817294	0.3816797657691215	1.931215737983068	1.3638878454773344	1.9696169245989807	2.251486494541737	2.3708130215900076	0.1332392687471564	1.8153603221549393	3.179779653833045	0.2322099270786092	1.4794545985392855	2.4969342625738924	-2.4545345219740065	1.413311946505278	-2.2459678334430464	-0.4262858968293965	1.2966887693200742	-2.730063037190165	-4.637541018738948	1.7923277882533069	-1.2223761870660907
Pp3c13_12570V3	2.501670490688242	2.352958258463546	2.893730794705832	2.6754147599430578	3.0906383746275887	3.0037208847596824	2.6978153464249557	3.7802890963410785	3.903138522351689	3.3939822489426565	3.435096286139007	3.142261539171557	1.9971817264866925	2.258051927805968	2.008424910065237	5.476170717521629	5.492698255788974	5.342774102636397	3.544140465012919	3.1969364980090367	3.905689276332521	3.616666729449276	3.462621773451946	4.117281698801646	2.900448268923694	2.70846548880653	3.038861829000644	1.9478329788955224	2.10957451676649	2.2249912738088273	0.968155705738584	0.9659193623778968	1.441699216724227	0.00717069027583397	0.4003617427552708	-0.9862089912331724	-1.197009729311898	-1.9750609483171384	-1.4117491555369817	3.2276686886753736	3.234730220482792	3.3985110268758123	3.0331125535254975	2.7639344432668085	3.389301854460227	3.636975426068747	2.5264034262534825	2.942297908609286	0.6951318922554798	1.2816011100082207	0.6504005179946231	-3.3466757923037496	-3.7919474334144834	-1.613882143016311	-4.215442089783156	-1.1903520285853393	-4.150996108929681	2.6645694192719387	2.5847026475896326	2.48802922947261	-0.6994210699352217	-1.1415212357949538	-2.813454029755447	-3.758152576267137	-2.363022228567487	-2.363022228567487	-2.1520804396554065	-2.1520804396554065	-3.50235215117411	-2.8889309421543024	-3.5530371919133805	-1.127895688013996	-2.3060643166565504	-1.0375921084641162	0.4342452543026432	4.671750682005548	3.5503239875418706	3.5774835298044247	5.486525239467608	5.554978671854259	5.339577459523131	4.810837422779498	3.778904060897956	4.3613939069946746	1.3543469445819727	1.3435516382775148	1.457772117297534	-1.0883261538124738	-1.4106755244714704	-0.7914212649843002
Pp3c14_11460V3	4.1656085332144634	5.098454621572286	5.164723180844989	4.27248534489326	5.003485882277951	5.327025895212476	4.74312337506285	5.235182782472588	5.204300870009127	5.299172349467113	5.446784561893798	5.275144729775455	4.741002930104405	4.9843977127190175	4.598538116481726	4.973550799295593	4.965022452185723	4.968301201613768	4.6939812305507225	4.577036310771556	5.117672442984712	4.74176694590875	4.52289344513614	4.64683632151924	4.688965467351363	4.309040341804359	4.584654010395908	3.9195167800106567	4.507917551383781	4.039083955396517	4.183519642149869	4.3029020047186215	3.8214238967162113	3.3714370768839412	3.757816620271863	3.915217747895241	3.100595684591977	2.9542859538007225	3.2344668002865076	4.833339466817559	5.835874922864065	4.592743200877205	5.6224626357152605	5.793223308632634	5.671511884678268	5.926059228335779	5.912225267414682	5.881804939254734	4.628089505679487	4.746231757771175	4.624925945999004	2.4849231006266304	2.674221896366971	2.5864561975226064	1.9135028322786312	2.4393627761677386	2.4952357784317933	5.693410073901084	5.597340924284833	5.607937696653398	3.2369574976427193	3.1542500460916423	2.4749836259521896	1.796517643638005	2.220759374950262	2.1465401278935805	2.1278720999664915	1.576915333527604	1.8283434298261736	2.467597389127766	2.5318798994647804	2.6123747263188952	3.4391593212265814	3.112139808862133	3.7491851315246745	5.497366866288627	4.895208744576642	4.735578099360928	6.013334067720625	5.820910650997387	5.394183675765283	5.70798582782423	4.956452903704599	5.141739436190527	4.443761945600948	4.4891194090904145	4.37848108559087	3.5935350383580684	2.956532078526861	3.3633832180434315
Pp3c14_8980V3	2.4372419502983633	2.580375838993823	2.625233389599909	2.7879385778061083	2.65395414006293	2.2873778430907605	2.996635218745842	2.754184323020315	2.770161989526701	2.9257741521675156	2.631890252464625	2.223819561529956	2.396536951209984	2.21053873003103	2.1027096756978305	3.632196721980214	3.781627451379049	3.132340700897952	2.534465991226824	1.9247278270011867	3.5107581016811684	5.039520018311125	2.5646062582781077	2.704047635052014	2.1962056808530286	2.0737801258111244	2.491351418087634	2.0139863866101777	2.2851461103586987	2.868065620046567	2.1528585919630348	1.8246620135949212	1.9073549067592377	2.0048161268219005	1.1511405005695896	1.0112058580013688	1.1318451901584834	0.35718213855136555	1.92064094834468	2.033875213689319	2.6946449483871087	2.5026505088203734	2.670942536292436	2.6556624158405713	2.9829421339019477	3.033235349700768	2.706128060275293	2.6728840635845863	2.989159985905852	3.085025865734102	3.4125704421944403	2.4281074278405415	2.78340595526625	2.499014184478075	2.494125466158033	2.400122118979003	2.5509373238816995	3.507588892036952	3.446928630771174	3.441769922602389	2.593796429618785	1.763796424827744	2.0805650834071043	1.9446563721811063	2.046070693235623	2.076303662640949	2.346479832108091	1.8231510772885489	1.986480451560119	3.042763146890596	1.888916526347916	2.0659410120741746	1.8625416807289656	1.976392010524714	1.5894994621989098	2.6988804983481307	5.060243644929642	2.2849370547176857	4.684403728607975	2.2127041211940974	2.306273818418028	2.41164263474727	4.419580004549978	2.0640674760778457	2.5315388356353625	2.6147735657832385	1.8967566408930892	2.146612380370625	7.733694325677308	2.685650864249087
Pp3c14_9410V3	4.50069833964942	5.617758346829693	5.554637062541147	4.334690376599633	5.394388111282521	5.434258724918791	4.099844305959726	4.784351262920872	5.017837434377484	5.0225859613776125	4.701395100702015	4.6158896680788395	4.869529843182058	4.4812067870245285	4.625270934032312	6.075753467025882	5.929475540847802	5.238716796292851	3.830452463017011	4.135315158237823	4.746132342787522	5.257005397736939	3.7283979472490905	4.098309530786352	3.655118636917422	3.781694060360927	3.5116006025897044	3.4602595292129275	3.2465966233367145	3.9366952511660016	2.885015578398341	3.060855176004928	3.3847626696280977	2.8231522960773376	2.5780557790620557	3.337516684529773	2.891014921229232	2.6971383034906897	2.7493128164141543	3.635910949691531	5.313795256626104	3.9288425775605105	3.23525202092666	2.770554367322646	3.153458268265395	2.147318449109438	2.235062141793224	2.264166001214306	1.6679038355327007	1.658077686160481	1.828871543043311	0.9806792679893288	1.4129625954901606	0.27970661877177694	0.47050645051544554	0.18455522160019083	0.9092552021626806	2.954639405243535	2.9053213719689883	2.785999699582409	4.080650157124869	4.166247626512229	3.3117689237468393	2.137741885213261	3.4606286903591776	3.2678338698196905	3.6234485261841582	2.3126416089484687	2.638830858716364	2.954848153253903	2.4052629010492432	2.000265788296916	2.952463939652106	2.83289407530441	3.119321377243841	4.529845643709867	5.075005818588676	3.392762638045363	4.950836428850583	4.027964830930731	3.707701510926495	3.6606282214927375	4.716384746097688	3.5546883028591094	4.013861332985879	4.186785103223569	3.160568483706583	3.9279006025833554	6.098691169911305	3.567321599244317
Pp3c15_8731V3	1.6719827665811977	2.6327801683395435	3.3433582253019765	1.687844366006931	2.4416085278920043	2.2484001607158	1.8291108854313445	1.864234195868587	2.6495872733023207	2.315691655878657	2.4032713213511476	2.7631626842792953	1.9756910730889017	2.3594926579519635	1.7237860808910712	2.880797059430803	2.4483421243410124	2.604838773067737	3.3337362430229125	3.294683415274109	3.6482639234633463	3.5738586027239347	3.803455958801667	2.6579246725956875	2.584689445894762	2.9591004269707293	3.0487837422310435	3.060006200432423	2.525341859400956	3.201461510416357	1.8571795185825304	2.270678598743695	2.293292699247109	1.3807376512598115	1.6482317789802503	1.1456027650982552	1.2561662502566395	0.47543641832227274	1.2653695070751474	2.862618508898922	4.423045895841881	2.534761438237879	3.7991329054857026	3.526526572273936	3.470996719486781	3.815192866934737	3.5819831251591387	3.715426910975395	2.647645922235761	2.235070192311757	2.673909598076321	-0.999372804516566	0.37387827787588834	-0.2705007625658555	-1.7869092557004516	-1.7225338420263354	-1.490916568987605	3.133461967946551	3.20462579889543	2.1581893183645446	2.1622645615069245	1.7189310160983164	1.4828834833365114	1.1735856886859113	1.4296633511645271	1.2793041165423742	1.6913321463650002	0.328006073693765	1.6622236525158856	1.4513319304041212	0.2119399213430908	0.8961172812594492	1.5426248148571886	1.6793208025124031	1.3060675688322811	4.57247281829012	3.5026991213243948	3.634153182886236	4.888809348897863	4.1347458971715865	4.489903484145095	4.26600552722937	3.28425655695414	3.8177925129799384	3.1186487153143103	2.3135535656558255	2.634565718221243	2.4226678597553812	2.7090635525504356	2.4508225373732886
Pp3c16_18890V3	3.8656985500228687	2.4918019408287484	2.514008616449061	3.70025361910661	2.87599018108787	2.9430862131273177	3.818522925151518	3.0835223242448286	2.6335366453807016	2.8278471558230476	3.2768331589142266	3.211203050609832	3.042012917390833	3.052444753134459	3.31212821138064	3.103074276991914	3.473827918843032	3.6398172100195816	3.755139570203877	3.322361887158754	2.9716560998733894	3.2206301143630407	3.562413474857728	4.1003826224683975	3.623520923734488	3.536735761464936	3.1204737118814023	3.2137802980467853	3.546998952715269	3.300769770550806	3.7781940650546826	3.522276055307749	3.4920983262689833	3.334868051189311	3.469918886310055	3.261415179778478	3.732220029646516	3.9083224787331257	3.509300371572188	3.500100371379923	2.6729300755215943	2.896400129062162	2.4124510174895626	2.686093554064584	2.523921111888098	2.899962210540495	2.7327859947880233	2.396939880722518	3.0324174707406932	2.699741056956992	2.6111221180017012	3.1052040926772584	3.009638914435848	2.9854295933856614	3.065262676264679	2.9575647563239773	3.079535272575572	3.0304066880296445	2.831549156126539	2.764755914365848	1.950799810867006	2.32331653340868	3.0055218092304576	3.0069815427025897	2.704547460492423	3.278228689911799	2.1462640234510326	2.997728419673215	3.010666380639232	3.622951379291509	3.519008230389268	3.6403967463173967	3.333762781315136	3.615011958099597	3.961467466028744	2.836576398727425	3.045474594408707	3.3844567746941165	2.755359672897286	3.4061977941825066	3.639213820608144	2.715578848865395	3.142377155888871	3.0655634610131153	1.6950531645751667	2.699135079235093	2.026500246605549	2.008529328129364	1.8775715390286876	1.9393910109945711
Pp3c16_19230V3	2.919987765383151	3.534195221709634	3.327738625916574	2.351598728954468	3.1237580456753564	3.682489881759312	2.2794200207127497	2.920945831016637	3.212120935978175	2.8611031077060027	2.3556796650910914	2.380066705057871	1.4561495264502382	1.1209900802716546	1.756970851040024	2.2357355331667055	1.155455741805978	1.7515501780073643	2.9343889203204663	2.4881870368219934	2.6833285068197106	1.927853354583283	2.3837384759506444	2.698713185657698	2.659059550872592	2.363649759288426	1.454032984347147	3.0903900926982724	2.4181000727562467	2.7110308493841937	2.660343372997178	2.2428469056435687	2.9205326855835905	2.2570936233108907	2.371060766429981	1.9217086200788456	2.503751829872462	1.8145166142452924	1.259644110263367	3.086864187350982	4.628047756597446	1.9691153478557488	2.5397251857648193	2.278807767221615	2.0810312456400752	3.0889444608785035	2.777789576106384	3.0302620246148324	3.088762224762845	2.992712699324779	3.1406464801095875	2.3112396907575197	3.0579107788206996	2.4342918797852047	0.984202582993462	0.8932369327939602	1.5676554747617433	2.5516648298326947	2.809801131520373	2.151605457097518	2.106638200994628	1.940673706638311	1.282266270066983	0.569327197801666	1.4430607033572946	0.6446409676122627	1.163951112248929	0.07481221370987064	-0.5957078967486483	-0.31762921657134696	0.3486330588173202	-0.03069794665853091	0.594360004316819	-0.43029499393693754	1.1054643929960737	3.4924264147947905	2.790539184721052	3.401208516331128	3.4785268693523643	3.5851167040769973	2.992124057913333	3.0420046385662283	2.584024126833131	2.9907493829615075	3.1469434899575206	2.9286269502287503	2.8253380685224516	2.9166750496014635	1.4849670490545344	1.71262631684539
Pp3c17_21100V3	4.517300747273864	4.300516571128942	4.408499995513639	4.52179303631195	4.4814050689663905	4.702025711107084	5.097188078254214	5.1631409190693605	5.281638066287985	4.990791447756816	5.153147267727496	5.077994663301937	4.286529122081851	4.667232496038228	4.507935266169001	4.743391529093116	4.949935645768186	4.683432138440826	4.119065152164299	3.875128897918952	4.062726467375925	3.746886929329812	3.810211974314929	4.300907702557744	3.9366481684683103	4.128761638474491	3.8946469231950567	3.599029776151963	3.997890728461653	3.9966596926977407	4.211406475825164	4.085574608426398	3.930665247750295	3.8277848130121663	3.624437073530068	3.723358582662026	2.9858292570673517	2.6412539952286145	3.4165158737869725	4.146689049462427	4.1152393699279965	3.8040209342012217	3.748377180049278	3.616912891779361	3.804009334817748	3.6429788974878767	3.6661939888073647	3.326275979890122	3.172794208474157	2.962140790666263	3.016555249431318	1.6318166812607364	1.725264722085574	2.197694035402909	0.8767660069800105	1.1902057720513215	1.463348415963665	4.450383568079514	4.486396815145506	4.6996223251611475	2.7978038075785734	2.8008464479862565	2.3125178798239037	2.010277873825141	2.1529911153062167	1.8639082914287208	2.6781079720302023	1.932220259033062	1.7227410537353764	2.4406250776934746	1.8550487450454816	2.083328520072613	2.478188539025834	2.4691867846860216	2.8645511668638957	4.446924875038024	4.1593586184394535	4.582198668983624	4.83487103640225	4.900694594556533	4.970948775996027	4.726943363242193	4.7243456548517875	4.881796703397336	4.117020672108352	4.262969415727941	4.068303697856604	3.036674716159955	2.7946219468180726	3.508982756810115
Pp3c18_3270V3	4.998653913817197	4.795026961888085	4.417714447386748	5.546172828141112	5.170362305753974	4.576829958013275	5.361071152506471	5.0813634617329075	5.0868559821237	5.023178249876434	4.777966874899994	4.795372047583152	4.946574371276899	4.973804716462804	4.643281101381632	5.462950256394392	5.7296322690898975	5.131588016414344	3.8404121114352945	4.0112184660406465	4.485030530823919	5.230680633000118	3.769970322484875	3.850444840458902	3.8667437044819377	4.15382336947464	4.244714386784415	3.591411049662101	3.3550568020616893	3.800240520664314	3.9210279033921034	3.3679212139687493	3.635153627679923	3.5536638761385055	2.606717063477285	3.409513864297028	3.1494135581023057	2.6233020943462275	3.5458260209835553	3.981394585076981	3.263384648908205	4.394565101830944	3.681606796973439	3.887974660930208	3.6001271269313184	3.2688208545772026	3.441482502488035	3.0884235736842434	2.983721802854572	2.8599269745839586	2.72483067254137	1.1256858461155914	1.426452347204794	1.225106879165629	0.8314856992893217	1.577201821230931	1.009084324192086	2.0071072253714357	2.1636152836985043	1.7832057581648806	3.2270066625290896	3.4457223588407846	2.9417267845524684	3.08988856074729	3.2000272407417	3.401135498026436	3.2338015581059714	3.3325758819166507	3.4531945801628012	3.17000771405324	3.277552369147271	3.021364622219856	3.3239094137684946	3.335078247688575	3.229543244568433	3.627140647704407	5.120003094297973	3.6829879762216753	4.3332039378403175	3.7773285023011023	3.193795975512588	3.033495219971229	4.925069936162219	3.086527296203629	3.616162429183328	4.080949765715415	2.9197279426233345	3.579641198224647	6.812186650572282	3.6482308862432777
Pp3c19_14130V3	2.033045546260908	1.7922294160946706	1.65657422296378	2.2861057764996873	1.9166941788065877	2.4802555903435346	2.3070302836531447	1.9269289541741204	1.5881683860356068	1.797174456577266	1.522207467624949	0.8742214235954009	2.4993933059627564	1.7216495744538416	1.5979725550021169	2.7503604281609646	3.19579905481271	3.4411414693742532	1.551293623764748	2.0397888966508178	1.143988022250291	1.1907812331426435	0.6296466413268955	1.9137344762946984	1.2665353613100157	1.718665533957928	1.2151656583685728	1.6659435122313309	1.8032504190773593	1.355142431667726	1.9677763312215368	1.4879939853313815	0.9474053823885796	2.0476623419337687	1.9298439482770668	2.5099050787293997	1.583401657655272	2.366461353087678	2.2537001290175707	1.220474379989673	1.3165991730544708	2.194439032323056	-0.36919898108430393	-0.00187313804947302	0.01047323058876636	-0.303623370554758	-0.342860349823361	-0.9009847607493224	-0.8845636989366367	-1.4620204251925124	-1.0133131123837462	1.0077299485421976	1.0556526287356387	0.2653424745425495	0.6051123139499043	0.6611215246932242	0.6758033639342206	2.2143780750738893	2.2066668193559296	2.4678941184888568	2.6849511411848432	2.7102053829122488	2.8842950854840237	2.8960615925104984	3.127135071906992	3.6957230934824143	3.2357691974436493	3.4245664772271565	2.377527037298731	1.895488247452448	2.4876464333825767	2.7872682832516835	1.9963953930629632	2.1161450652436167	2.07982031878434	0.40279513028853253	0.8447129453813945	1.2569342881655257	0.5718684949746762	0.7901073341378657	-0.6382123559682843	-0.0801104404990073	0.914546281903082	1.01752489565795	1.3487629378855237	2.22507350299638	1.728541317004776	2.827513099879627	1.7505097962893026	2.1200982417528302
Pp3c19_19970V3	3.459015912374907	2.6185470936722908	2.267641476950943	4.539295870692066	3.4886609596215212	3.524409956325912	5.0628312359741345	4.944361453570678	4.82445639661721	4.669312902880338	4.843293647479247	4.813381684197057	4.6638502722336765	4.660496612703228	4.631522215983348	3.259619769048828	3.4411414693742532	3.1647012749240573	1.9476888775697951	2.2430165694204067	2.1792811561703296	2.4966302644012837	2.4421827292371803	2.684362020483458	2.420765051531637	2.084485685111626	2.661817695571578	2.8989207516527182	1.6849012436733042	3.092921088580491	2.9148659684726925	2.620394883684509	2.9000843377571863	3.557941731139925	2.887800895643665	2.889303198075137	3.03713212939731	3.2244871567183435	2.828807760454381	2.3579574247233683	1.264645358355376	2.4606760033273245	3.5016998056320783	3.55555598426208	3.006671926996943	4.041553113351621	3.7484622023140792	3.377651144664489	2.9381694421419637	3.191647739583252	3.347189963450108	2.1932697428045236	2.3248719794045583	2.8041306380449873	2.1499374194641243	2.6275758884408353	2.355743249684377	3.972321302607007	4.011964010984272	4.637160958439414	3.1293769480220397	3.459720582425992	2.267686958775492	2.3263549668445873	2.3252424941780108	1.929996355070854	2.276455245573224	2.378834091688207	2.6165889736563477	2.796794461015555	2.784993832153926	2.8438200377957212	3.61216248540402	3.925067640590428	4.302416732545079	3.249868452510486	3.296307602888571	2.9475674095701043	4.547591140103252	4.690865329927214	4.60787546427777	3.1155526957044692	3.5682884791323586	3.4528082433855527	2.913030647598751	3.2544196363634934	3.190355307872207	3.33843819508332	4.157967686333978	3.703327652430022
Pp3c19_4900V3	4.099335584345335	4.262245805342732	4.280183028858073	3.8359320551988	4.100627877696832	3.763054513886307	4.193451420850864	3.8234987279594432	3.708553125014004	4.382579757142849	4.596515078151003	4.741580409281331	4.624736498831127	5.125488209659713	4.746763861416378	3.976925554142372	3.978099792254579	4.347170214009731	5.074153204453471	4.818183266317275	4.584977607482174	4.842761078613577	4.927158105706119	4.954017969493256	4.954490480275673	4.546841652793745	5.361317258041913	5.229351672775704	5.032344812097434	4.799371620256799	5.086710871275073	4.997420578006649	5.1195861479228775	5.229720405571823	4.978125763954466	5.110049213231121	5.072723070897695	5.166753529299852	5.026087879814353	4.921265225361776	4.348298758994346	5.0238182287041715	4.156392123623394	4.613848200358512	4.167598946756944	3.483961960822013	3.8460100680466542	3.716068694852802	5.34365208273384	5.477923309433146	5.458760785600096	5.592837154927474	5.566345310546047	6.0363710745439905	5.752285810287871	5.803676477304736	5.766785992357746	1.9333764762890064	1.8292727938046731	2.25917432309024	4.682269473955593	4.551577165906933	3.6310944802238554	3.846410745088799	4.099789885341791	3.7666590262801103	3.2864287862155463	4.03800857181981	4.146224561067912	4.659274162575984	4.819757848050434	4.8591844795421935	4.817767235148732	4.922815332472951	5.011066399382581	5.049516012692789	4.888515887923536	5.194270049886066	4.974767793984034	5.108220283315824	5.1118413032006105	4.935659033399921	4.920205261710243	5.240771508655339	4.908383984389425	5.158273048193143	5.1800808511702625	4.985226402653143	5.155957342442024	4.860398817598215
Pp3c19_6660V3	1.7330449608331286	1.8269654388797976	1.2087193731383608	1.614495198830206	1.8590991285528864	2.115845085931974	-0.1342525512627427	1.7033556985823806	1.233300256213356	2.6538049219760698	1.1878283877962892	1.278428328562217	2.7756082993454565	0.2079337379069688	0.8992324707148209	3.9461159680990248	3.8031738635254086	3.5753959649703293	0.6502066369936577	2.1539447736343695	1.826737202652359	0.33581670673134173	0.37512787152574034	1.030175890377799	0.32038051378070564	1.5182851212563002	0.9008684377441932	0.5130493578284911	0.8350781962329485	1.555792007481817	-0.07472376478184664	0.08344746121446817	0.7281391095797958	1.528799184283262	0.776112576093287	1.4259744464907855	1.844793883690075	1.35744602808069	1.802754005482119	1.8379347797289416	3.1152083363079335	2.4953889197475316	2.0803770633577203	1.8182374181365064	1.8141274667085283	2.319551967289406	2.830857343757222	1.8914268270839836	2.8339970973679107	3.2211609385925586	2.966009595885599	3.7742448420377377	3.549901309191028	3.915996043845424	3.6773438852419034	3.1709815115717013	3.1887715773588616	6.220375660730232	6.27432294345851	5.953818488738879	4.742068990660051	4.763533155491891	4.741183402346693	5.1734357511826765	5.052084819299519	5.855809664990604	5.399337264861432	5.074730649623976	4.241654857711921	3.8233930424223663	4.903412721637646	4.575238633013102	4.120369688872943	3.805267576684923	3.7545856754734306	-0.2660352836759555	1.2839025240457134	1.233543857151641	1.391525028166123	1.3510529665631013	0.934920510781562	0.5361413312092473	0.27969503199367346	0.6963066383038538	2.5523316442878445	3.9230223150742622	2.948427741760232	4.887997959873099	3.1960001886298377	4.590765114289828
Pp3c2_28540V3	3.6294687082598474	3.897457191233027	4.08473627768891	3.9950948039349186	3.840353399250077	4.149273078689941	4.121418475921125	4.099574677136182	4.176856752233056	3.131817569351723	3.3177350797043914	3.1669780303614345	2.6648721912520075	2.8143626468387386	2.4265430132267967	3.7951257317031737	3.838317135978936	3.839996981205178	4.660040958715752	4.745865265004303	4.756042844342126	4.698243248444773	4.481831031542772	5.244261537694454	4.325956607457555	4.0851594906156095	4.254903265043734	4.224440103076453	4.177941079574205	3.913995463608435	4.2229573360551145	3.99377455467975	3.701992604126795	3.4839181494752047	3.1444033829573783	3.0329316840576337	2.63331740730111	2.132027665310001	2.094954630655963	4.909293866341264	4.957134117724015	4.368177253330914	4.575985970807465	4.68892602458537	4.63580492997531	4.5702893365766135	4.409279105769567	4.426139512853734	3.94482564958952	4.0265205598907565	4.156070854468869	2.561042123801955	2.337400889047876	2.2047034362424225	0.8818564675841815	1.280865768719682	0.66707222932509	4.5872001102362905	4.312822544759682	4.29460065345872	1.685437181170504	2.065903392451525	0.9538528208018012	0.8098328847509487	1.1478634781575217	1.7170818828613923	1.0516321922347616	1.1409825246659344	0.8341533233066093	2.1699208390071285	1.4567230836115246	2.2835752163833525	2.1245436003863865	1.8311947057923257	2.8007182261018126	5.092230260267452	4.722546609043469	4.865599187951287	5.194957568560454	5.055968337960532	4.918317960968936	4.272061638805835	3.970417440168699	4.1693188365962595	3.7114115620744506	3.7035827215286288	3.62885792567005	2.4029957769514363	2.7158441773852315	2.2388661056583565
Pp3c2_32860V3	4.442612925067763	4.295520970282938	4.364952253284568	4.227097106284884	4.039074329040407	4.263482780054218	3.647805518580535	3.4470264926796936	3.5258776475788443	2.809156267072756	2.5280598202332447	3.005983803171045	1.7629953047050189	1.642220907694415	1.667780102004212	4.352272557068996	4.418326854403732	3.8992518629406607	4.543683875100425	4.858318454844124	4.668975652513503	4.581181987006103	4.4363392213539345	4.8667605714742015	4.115085884654561	4.060724320029871	4.2435793848665755	3.722407344703178	4.024319852128588	4.170527140862151	3.522276055307749	3.467244978549878	3.7338274954545176	1.63333060670763	2.4679110477529425	2.063262078435172	0.6200655243176278	0.7521188845441336	1.5726964952275857	4.463455412564932	4.620520138321077	4.475858376184527	3.971581866389691	3.943755204018787	3.7921541314539415	4.38953239955689	4.4131012309578725	3.795174136389131	4.2701501505629755	4.160417455668982	4.029788062049919	2.2453210566157837	2.325243182024669	2.408110705277401	-0.01999820134947212	1.5796643239470096	0.18455522160019083	6.054156944763326	6.090803828878795	5.513913804328127	3.5156279005273223	3.4140182376175656	2.9056699288050445	2.2530638801687584	3.2805201018109575	3.440995834910413	3.749912349743051	1.6783506024276582	1.832320847748146	1.3228719963650544	1.3677025354442918	1.644484609676076	1.1796642763034273	1.8219170692683544	2.007267000640113	4.352820408356979	4.49560290937577	4.386445123259267	4.540823427576218	4.28046716680148	4.485829530399938	4.035045234553163	4.244448074352453	3.916467697508668	3.698670952748353	3.9392503166334416	3.658153872909285	3.3753908074312724	5.146489294953946	3.4621171646761453
Pp3c20_5060V3	2.808761717391318	3.0436563097378833	2.667454820912455	4.101646565639791	3.400650334457454	3.5345048529736296	3.7929012959542505	3.6037291512837726	3.461921524861427	4.041056274995986	3.469633427908107	3.7502064943386086	4.08965707099174	3.3839300672516655	3.823302193677524	3.404865418863668	3.0730811804979687	3.1357364794998093	0.5526352562764216	1.909549953131862	0.40820207657164065	1.0622166202897103	0.9104845356536172	2.1182384885748275	1.3479618951060135	0.4621393359524445	1.5590257030604613	0.5359373064630022	1.365464479833013	1.9403755395885505	1.9465236112787008	1.333766516585548	1.5849391857872701	1.9467457888123283	1.353788313100913	2.0032196743955435	2.092540345625538	2.010372937638196	1.7086688917938029	1.6343178872382775	2.427137073875203	1.975115741844003	0.5029311214944255	0.7687438168981953	-0.02575886663887305	-0.45358828351341496	0.8767364980557798	0.00670751908881782	0.2681691296892954	1.1419572347039235	0.09657143401743544	0.4927285727852363	0.6306332156195302	-0.2409955894312577	0.5731545120535897	-0.4942343294027332	0.6086246990986545	1.7733742717736882	2.2020760401632535	1.6370609274290422	0.2325960961198836	0.8613612377957739	-0.23947419497999045	-0.11966992039416584	0.6367225213766585	0.6226646822602493	0.2166308313319897	0.6600992579270865	0.0521074926416043	-0.5288942584658628	0.4537001147280237	0.4452846256764402	0.1538348875724187	0.7743692107748413	0.978762196623812	0.8559945260701175	1.2520042059524357	0.6402523104567225	0.02904585250222643	1.391525028166123	0.46856197129325616	1.1751437156360072	1.2218087333931862	1.2774784536423271	1.7472706707361998	1.8524350280684696	1.804916575584173	1.0259435284777836	2.0078493540132865	1.697802941732645
Pp3c21_16210V3	0.3374357955689361	-0.08699086554476876	-0.28170689613571365	0.94427788575207	-0.00356750369417529	-0.3992562417102013	0.6925067351020154	0.7437638944499316	0.4500447695406463	1.2633072005503074	0.7324599388976968	1.1603321413126613	2.5632635714572456	2.5786611695811383	2.4745124971691137	-0.4483332961022817	0.09048805703022918	-0.6374672802137571	0.48839868939159686	0.40820207657164065	0.3414934999565537	-1.3300217922150082	0.07791738417869229	0.8965235268710475	0.19749774428856265	-0.45546270104974645	0.15641145783184665	-0.41999535173620806	-0.11518320699032011	0.17847381763045184	-0.9195761827153176	-0.3664363481812695	-0.5848209532304143	0.27080037238824856	0.6232818582236879	-2.6701379918142223	1.6736896763458982	1.757260605455193	1.6245440184377216	-0.5232631819610868	0.4456718153499619	0.7065837031314127	-0.9610077847689144	-1.2297881938366864	-0.30101541946440524	-0.8717027771427188	-0.8196889692730673	-1.2996361594217338	-3.9088158362693903	-2.251642564237747	-3.0414871885719093	-0.31628896250483773	-1.0822717557243664	-1.3844875609071563	3.715878806602892	3.209608466064881	4.1103248645627986	5.162590016759195	5.194156814837751	4.98035399362248	-1.1120133847281632	0.07143466310927325	0.8499219358539768	2.7765370917851495	1.2433210513336126	1.4014778587599694	0.670241983880503	3.482557331625503	2.9187893065157353	4.698385704253891	5.106854824271902	5.391773825288546	5.790372402788826	5.9386738506004	6.007016407446575	-0.19812331711869663	-1.2221307604895564	0.6819887034375028	-1.6176423060015963	-1.0655133806988184	0.214846218846124	-2.2459678334430464	-0.17611797536925425	-1.8599695448829083	-2.2814320258324665	-2.2814320258324665	-5.94551661133454	-0.48489868683896376	0.05647046023511615	-1.1778986387516412
Pp3c23_2890V3	3.1558114597633327	3.9158756883178216	3.8776544460761313	2.843983596029409	3.757947301227371	3.8780443117275927	2.9296478027551496	3.410006924108872	3.6884695852217497	4.132724666466544	3.8280337682543673	3.924989225618356	3.563956590775716	3.621699355108488	3.723969362973797	4.38014418933409	4.624649313671203	4.186069022187426	3.0781819667458916	3.538709403376062	3.627313747585081	3.2050663419252876	3.2971468538725057	3.457208162534592	3.0243024800908964	2.886326274947091	2.688043201860866	2.3152148592127753	2.737431434756599	3.12816412541366	2.8826660931974732	2.9051457991656475	3.009547762333077	2.547539239693184	2.4492805068641617	2.0150887348194355	1.6324652785947975	1.8241387068945496	2.116026825765742	3.2661864330539294	4.074614312484463	2.7476100301786732	1.7222940497596202	2.2382887330872387	1.9292717960261945	2.3394434326709392	1.4271783567343153	1.8658930682662624	2.1118683338891344	1.4823071987160197	2.0367472343449875	0.02372359013470424	0.15321534174798945	0.5794861397341736	-0.6618987720722858	-0.6753127811711164	-2.09228249935396	3.0633130083367535	2.874322396726136	2.6818314132407464	2.4302597110306263	2.1466094175539445	1.4066215216978226	1.1418901864158708	1.2696861635890075	1.5112137480026178	1.5565690944560646	0.757763435193633	0.6487148239731477	0.4713329028386095	1.3228719963650544	0.9122360115255128	1.1899235937715908	1.6057899658374122	1.218228337240987	3.5050957915173915	3.2865759066711457	2.913437351085762	3.790809188960657	3.500824787365006	3.5157309228244813	3.5308678361183268	3.5631925105001163	3.610723079653422	3.472413686678914	2.8276132598904433	3.06134384378061	2.2289082979396433	2.1493171275086733	2.6195467079406645
Pp3c23_6560V3	4.639752687013766	4.831644913331172	4.400259833224396	4.274212189504554	4.576829958013275	4.208888052942501	3.7483576700662065	3.801424972479882	3.957649716439998	4.8615765408987635	4.513577108649794	4.468376583325059	4.836825287211575	4.718724647732164	4.476079898703685	4.342772332286233	3.900780030579412	3.5188669837299673	1.696371880154273	2.961867043823805	2.757295994933563	2.5948375758132336	2.6090823597784043	3.2371192318591713	2.614629073007646	3.149563462760782	2.533714114194855	3.310503952674634	2.5041347069237845	3.0088903045033337	3.1232509993208635	3.2717938262128334	3.4598865803721486	3.657444158245017	3.229993298886227	3.3686366406276567	3.6186004624716386	3.488755290077833	3.83080981648788	2.4754141154854916	3.142440620592094	2.5057138640068395	0.46268212556740634	0.4163257135882926	0.35818885449912113	-2.3635189447205	-2.3420536297793717	-2.0112195506194652	-3.5667864782931	-4.167387764495548	-3.75617363312918	-1.2458049841485306	-0.2640127213212995	-1.8756301268474724	0.19670275447811017	0.7124905390307561	1.3755665190206776	-1.9501422627740836	-3.115986991734268	-1.1370468871612311	1.547502305871924	2.0481147563697624	2.9875622050175465	3.795118365847232	3.76164928023136	3.6767929099727543	3.1696299735415616	3.8230945694277	3.7430113649187566	3.4746883084225466	3.7840624530297258	3.573707996450036	4.057525575055717	3.580647332810078	4.057525575055717	2.1832048049070103	2.714598988093443	2.8155884960320003	1.213241904485618	1.458098553078324	1.8185278547634376	1.5961879030484367	2.495070431166564	2.1721688498161607	2.3531189012034015	2.1986733244221974	1.9439409221823312	1.6770433655860468	2.849984988255165	1.719593815259402
Pp3c23_8061V3	7.50672870526421	7.436435688708476	7.601853266774787	7.649375856203655	7.389070140259618	7.409333795476068	7.673483811349809	7.6874893704822	7.581190602045071	7.368000467751732	7.364535317785896	7.363571422357057	7.218795454104521	6.872817907136251	6.963446169431889	8.801127442072897	8.723300585985232	8.645590554840798	7.798823555309376	7.81552256122593	8.006870499524508	8.061194538222887	7.7295539927339965	7.669269074311193	7.582989520781679	7.672413462760521	7.506200585496414	7.114245691245583	7.230907781272503	7.278006048028929	6.843773304018247	6.915993120305721	6.905034587493995	6.1223626146967725	6.0378948350615245	6.0372954781709565	5.146772674689553	5.215995053820993	5.351496628998635	7.775449658986768	7.674743997979878	7.795328086941055	6.905025093481665	7.016973995020509	7.134800946859759	6.952492979206319	6.8706961246148355	6.610678510947848	6.451311600000165	6.441661850120339	6.31677387182315	4.152983710195836	4.513317791974231	4.3617132730181085	2.7193778840774567	3.7177426791636634	2.6175346117501377	8.057163499656086	8.10705239104214	7.805552072803165	5.364289384417494	5.300568141924252	5.076396472445807	4.622106118346678	5.117994298194175	5.285366821659425	4.941011569359694	4.944717196560246	4.90176846960521	4.781924110541297	4.697000556868942	4.461224195955361	5.00631369282519	5.096637731029163	5.17057629801401	7.69093561431829	7.786370562398479	7.562368937627361	7.977578976052706	7.848755326113497	7.782834857067917	7.363103724665488	7.577193048133825	7.396562660707748	6.457857088171552	6.6342383413162045	6.317038528756297	5.335857677379314	7.335681345903666	5.493285624575646
Pp3c24_14460V3	3.6274605187417057	2.282980572589051	2.797546477764994	3.4750018680923933	2.175187028500482	2.433633969063012	3.499129019085674	2.7919172484110235	2.347497750787889	1.789591002891281	2.0975774122322117	2.570868169605521	1.7477135993464186	1.3297760710826256	2.02039402388746	1.6216851703862936	1.5014651892081727	2.4768030311100224	3.8753178163321897	3.012443902217684	2.9403193678996	2.3532412253172073	3.664731896491443	4.366439524616042	3.7264109834055694	2.7422522666139173	3.647397874172228	4.2234530498145775	4.043833005081895	2.8556025242139116	3.696835243066398	3.7288636343863777	3.0719168307749265	3.475495275745287	3.4355180036785993	3.3456114992267363	2.8567181418939445	3.5391574481331185	2.8039650738227437	4.035102791123523	2.295717013922012	3.538928625016748	3.0480073603997733	3.283445418267379	3.345939163260165	2.849909014816986	3.065844397566304	2.9623350688417065	2.6754719067408117	2.1975519576622125	2.0740039448334455	2.27570150529019	2.1583105515281877	1.830629942529012	1.9544421820811515	1.3937049452377943	1.7879881785167853	3.375762153054866	3.46121008756353	3.192966056162848	1.2990543041771585	2.2919241051709536	1.9612005213459296	3.174421432080009	2.5852104891639502	3.0940957913494103	1.5986837234187967	3.404609468449515	2.933986316467779	2.9630614639173962	3.4196874918224056	3.5552703593214714	2.979214417780216	2.9725758617767375	3.5710215993524836	3.3079755773943633	2.60069080448731	4.079001729339446	2.941164643747069	3.463187713480737	3.4685013334535637	2.435927040082916	2.636344642561919	2.379248911659775	1.3706156163972214	2.0490701909433615	1.5240392524323578	1.9240659974165324	1.6862295932056723	2.031438812556062
Pp3c24_19680V3	5.120928941884119	5.249089389146247	5.329218249581295	5.272012016647845	5.327220589066523	5.671311852470638	4.7825065603764	5.322846506891775	5.34789783937229	5.228836736763885	5.047767614684604	5.182824748471103	5.218608037014641	5.212603108283762	5.177027444969831	4.598610895028262	4.516652229131246	5.030860445501869	5.097213905400277	4.967181202699615	4.768760155317803	4.5597163439157375	4.244153761512669	5.056010112649627	4.921606696333051	4.325956607457555	4.704654114149259	4.637772447476993	4.859634553778221	4.615196119541686	4.173944679894762	4.455262885258201	4.386598698386294	4.268156562649586	4.184048661251863	4.270729226768193	4.359485962667507	4.093073080802608	3.456916983097252	5.401786309930438	5.584658739381357	4.557229036149522	3.491480333401946	3.7923228373729927	3.880033644896415	3.550671266767715	3.3661774884879865	3.0221584430467088	3.3403326797313415	2.85619384502659	2.8743193857832807	4.058383095370151	3.912571576584547	3.787552113946493	3.624721187537875	3.3093415149749137	3.1187229445613056	4.654623390712196	4.450985325180214	4.755748494842561	1.806137405490401	2.6370454135163426	1.8915569894586752	1.640876854255197	1.3218467213612943	1.121298838691409	0.07998860650024124	2.203550076438136	2.4097271690453335	2.164363025308534	2.955810718111815	3.2968493142953723	2.6680614244600385	3.228436057552699	3.4518509650030307	4.704022282203322	4.5714072053941	5.203113135442913	4.501182521154538	4.860467092311339	4.7187498050185805	4.407933246993283	4.519061020923018	4.308538982328878	3.885062825602211	3.741078592874023	3.7736460324149927	2.2746683077493812	3.007458966489707	2.6586877482811175
Pp3c24_3580V3	4.167277572392203	4.479307342424425	4.317014814569518	3.8486661804957794	4.1478247283183824	4.1638699823256795	3.735113139637501	3.8650253058201014	4.156830919180731	3.5752975162360916	3.750797393229301	3.846206977792229	2.997166131553434	3.1102747882060164	2.849211488130557	3.368088840621619	3.415612641692527	3.138990613673027	4.270785730908248	4.500525612949139	4.4868382724148885	4.485788459689696	4.072307163723576	4.360431246798401	4.092673918195766	4.069006522476763	4.117958665500951	4.158884746139026	3.8659771588026177	4.376288780942178	3.734121421427014	3.6927379825042257	3.933342398844327	2.089178435003004	2.4394769838936496	3.0140741036068044	1.4059112864212575	1.7052471902626287	2.1942186071516954	4.241823067563445	4.5406723933035735	3.7305168648923264	4.491129058515409	4.488541800065704	4.4993019153152805	4.452817349392366	4.342263653498608	4.43821577079568	3.2766303097262446	2.985003652489042	3.215740437222158	2.1940188095289384	1.795688612101439	1.272024462115657	0.15790348181990518	0.06449813767133201	-0.6618987720722858	4.245775624306052	4.223431810611902	4.119533482582282	1.5982263088565958	1.1638410923759317	0.9506084957177884	0.7472453687541972	0.8733849030875871	1.3263057810949568	1.3803700952340103	0.8341533233066093	1.025651098733604	1.8307813078464736	1.306397669549779	1.1080526330233915	1.0583669723802431	1.5448845505087492	1.1136578566296784	4.726334124503365	4.637349087103411	4.602575859117109	5.299917331592621	5.066373133268388	4.919570274655012	3.8658643687119314	3.8618151246992167	3.6050989306036274	3.485148459396449	3.1010483840699403	3.1469434899575206	1.3177253948250696	3.4968213807633535	1.903556262278001
Pp3c25_14500V3	1.1333255629413723	3.4409675511805444	2.347651026683571	1.9573034401220255	2.606710518134681	2.3279574011594284	1.9405879633403504	1.4831453493945184	2.2677191861034594	3.7009414415879	2.83749412133484	2.9667679202349726	3.821584091230248	3.079105661835136	3.321498767862028	4.596668086887333	3.716151316681249	3.513754946711495	1.272939805376614	1.5918861991707527	2.751602299125871	2.8183124128442234	1.9805457605843864	2.8330124706268665	1.8317338485066617	1.3252567533127828	1.428354999468307	1.452199248566614	1.1969001822984686	1.7878238375376003	1.509510682654194	1.802321361555972	2.219639416148552	1.4243107161415989	0.8648028749600055	1.0382468826371123	1.9120341918781243	1.5241419273212389	1.867232884708545	1.299577043907948	3.439865668007454	1.6615054382022725	2.8604636099044893	2.7287150817199186	1.8887794211620133	1.3521910278861502	1.65428144071593	2.2810222105668325	2.6615943751165023	3.118886196401501	3.3981828240832357	3.260847083627309	3.769347981974434	2.7683029809569786	3.1633160118278725	3.4374038441433417	3.048676188754676	4.18567758151271	4.318325183063544	4.103467565382019	2.546679955902938	1.1215533794551975	1.8250176288074091	2.376042779499016	1.074152937885571	-0.29673772562777495	2.332647952249817	1.24869659743037	2.3412496877387214	2.097065342206665	2.3813964360825266	2.5431347516062472	2.597631833921474	3.005252177584898	1.3369159690897603	1.9178693046547	3.0287449596833516	1.6055728400517957	3.754967500795686	2.4728357920964186	1.7206964134572584	2.4961856732658343	2.9413227860271993	1.8855191942915144	1.5624438697435084	1.0829309184284313	0.2594138540357915	1.8801240287166137	2.962061946488431	2.4298685062329017
Pp3c25_6730V3	5.884368079555424	7.351625834945525	7.3708019594469105	5.518487723696293	6.7448761004294635	7.28946518824336	5.530822357109656	6.212018164757012	6.645580834096109	7.058974666316863	6.3811139478545025	6.095797160649235	6.059567544147674	5.61986923335791	5.951406623391248	7.655929341097957	7.162666115375182	7.237469847158896	6.699930109538141	6.625205729382655	6.769347301606991	6.902407799161444	6.250089176375627	6.361999013135361	6.476888614987502	6.279775933763289	6.376389356837927	5.955654660496406	6.408444414860684	6.004477465997106	5.94011268126069	6.1091805180235355	6.049411953845781	5.38796293138043	5.396551148604504	5.728011442688068	3.994504795800724	4.111893108978197	3.9599386603198607	6.8694707437246745	8.624051853245701	6.248689824145329	7.408419852798769	7.1289763332912965	7.334504030099152	6.721524703502041	6.437568622386794	6.867234680056274	6.023468721074994	5.971808722506932	6.04296718396498	4.732520608243034	5.063845313288166	4.4431135470522225	1.8589285021663833	2.4283134914358686	1.3741055120839585	7.419434811452846	7.606466011032137	7.565334008242997	5.434551789115008	4.6727472619481825	3.918334568255316	2.7230405025045834	3.83298362261814	3.344989058173651	4.056010282871872	2.0412695513119896	2.537482020840572	1.5028554444934936	2.085478454373089	0.961210708747082	2.4730729114221717	2.183651544348025	2.1335334198743054	7.801767179701868	6.913246993942435	6.830317762893918	7.9369641717070145	7.633706142350988	7.154893576202821	7.244529725939231	6.488979071210706	6.388577363393715	6.589748148292749	6.454429147943892	6.105229682369621	5.718912687129995	4.390162427336876	4.867605465457619
Pp3c26_1140V3	4.924647995920183	5.987869089127385	5.961029304252334	4.669020119085003	5.647539947692611	6.175174345663195	4.600330170452357	5.372174614895396	5.869186256125592	5.712815959643582	5.69406644930694	5.419279515819774	5.532556750197269	5.533940597019166	5.458392861128538	4.4670247769869995	4.136191985221708	4.040104744352081	4.9418473885781244	5.405369237342732	5.31352912023791	5.019063558374635	4.288430719685069	4.910749692632758	5.041537972413717	4.816135258932615	4.5811685204439145	4.626066413143684	4.95418922026432	5.364835928526318	4.92115353225378	4.9419040068363325	5.288437264364603	4.5916755708919625	4.700927313787958	4.986685182832223	4.768840636739	4.803226185336727	4.094683529649678	5.542678666795989	6.6222516811159755	4.7313272347981234	5.210746105122479	5.28674800119641	5.0785797025737756	4.110891455641135	4.465118979094883	4.16880030174193	-1.2566833499472805	-0.8023796667574874	-0.40302129507128903	-1.613882143016311	-1.7164913878515289	-4.054158848852701	-1.2448011278969524	-2.73914687027839	-1.3970530912553711	-1.473829349288584	-1.9501422627740836	-0.8487986601800016	4.614353397834443	4.0591997099097465	2.801867362482548	2.803612596232883	3.344438770399462	2.8846427468602176	2.5226236799650597	3.0082392527934467	2.5226236799650597	2.8042457414801563	3.3626502003294703	2.9319466603279896	4.42378916931105	3.8740291728960856	3.201206053947657	5.627003225030925	4.927361139189	4.87153550223963	5.603807549948952	5.395493491529813	4.890830173249603	4.981728190620802	4.646893676949697	4.495215824492129	5.300468642658883	5.147576964791186	4.866442068146949	4.896970751396844	3.9291822657836226	3.869979366418106
Pp3c3_10731V3	4.494173480052379	5.114815637926401	5.14338059901845	5.223074094968464	5.516330052369263	5.7038434209005535	5.298913197221679	5.547968080832367	5.9428456006627695	6.095797160649235	5.867611495131501	5.902824039525597	5.689781517250857	5.545026930798423	5.660341482750514	5.5786600743385355	5.427951197438672	5.313341792952228	3.840778832426738	4.2452711720668095	3.999427211904936	3.85755793618337	3.8069123542217658	3.907093222626061	3.659220120768506	4.09311440540364	3.713221671363027	3.291822305469835	3.906738007816858	3.737226956580634	4.081354985580749	3.8112705546105343	4.018822073955536	3.9280802093531824	3.7958822611804535	3.9403986795351593	3.53128597423199	3.549086136178885	3.8442691919425305	4.168957700558076	4.496870352390202	3.739142877305357	3.834459184832816	3.607878342688567	3.466962808411129	3.979405397996792	3.1103044229424386	3.9015431079311607	4.461842170124569	4.379433658537236	4.423863217522711	3.73171191548572	4.291837070116767	4.198943886302567	2.9883337441463778	2.8675654922364635	2.83998361879927	4.636457415395854	4.926417203111306	4.919754832826794	3.2173347928267177	3.3197486966346075	2.9894314799116395	2.682355260889171	2.863622432448983	2.597191223799596	3.1956830943277503	2.72145422855624	3.0320861953724596	3.5119250332572785	3.027887781229649	2.935118162430882	3.2411711528530263	3.311505632741621	3.269945724665151	4.736334534718991	4.63643571415036	4.4343570432411354	4.756464898324212	4.735747891169941	4.841032641171169	4.6312575303142784	4.307385849939001	4.217688840898772	4.1822867938727155	4.1051138305065304	3.9798650539207863	3.912311902579564	3.67749821606753	3.818734843468836
Pp3c3_1160V3	5.947073216517163	6.075135957906069	5.943101683979636	5.994429654617944	6.162726731036183	6.076225443842876	5.995906639142682	5.974075700409873	5.999918956815882	6.157361375074137	6.257543788702948	6.246298042788138	5.948641612862727	5.953438496595835	5.990773271919774	5.942436437987555	5.753412633106518	5.807879976228569	5.749651177595593	5.655807893045712	5.828831027490831	5.714824965883719	6.045234551392475	5.638000623556885	5.454286040507204	5.641896191398799	5.496967604556617	5.501960782831835	5.153392256981279	5.17359132800282	4.816065275475792	5.152628529289157	5.08194677881969	4.602414745295208	4.494436070050305	4.629873603180005	3.893879618102937	4.355152787772808	4.321181057473235	5.567921743098207	5.385270834871819	5.4803791342153305	5.391592393123914	5.4871979594002696	5.426262250433482	4.490400421622528	4.821065700138497	4.162499515778774	2.712924050432065	2.727339698969236	2.833450913060083	2.2643013207404534	2.524229347717178	1.7904015207988462	-0.03156023402708437	0.6287519098143141	0.6438658623063606	2.839574363964719	2.8922617139194498	2.23898807677041	4.8721079347600105	4.414558999165993	3.784440154588826	3.311364741098349	3.7954396717086354	3.924204260616458	4.36764268335301	3.411336209953616	3.5156315413308215	4.015088129728004	2.846293813740542	3.741742402880636	3.6436029880430754	3.6778489104229553	4.10427936813384	6.272918304881742	5.5964368046900335	6.046403572093489	5.785268257407432	5.864159883142564	6.019321574155378	5.532599741469232	5.012918725105017	5.304315033589265	5.184233872735691	5.2855090205626585	5.371377982511682	4.69638408693715	4.630738473676476	5.038975605850596
Pp3c3_2690V3	5.1857917972722785	5.650334658172255	5.690486794803637	4.9289736403996995	5.48878850544058	5.490210213573616	5.31346131708779	5.022251034233533	5.291658521360526	5.142839427899263	4.985225852815382	5.162919440924151	4.809513081028791	4.586364135284857	4.510567290648649	5.497738261559954	5.389573707111031	5.077264855162845	5.131416681303502	5.374805815938616	5.297222365685714	5.162999786900118	4.948497711931309	5.096939466558167	4.989630714026687	4.924176609701177	4.8341052640602005	5.030521616071062	4.728525043157863	5.361950632960334	4.6580949479644485	4.7210455024500355	5.013416560382725	3.9953309987347514	3.5251094366709324	4.148087172695678	3.1583756052208116	3.3549111209508857	3.6533568377738064	5.26374043567085	5.735026004422251	5.120438992738374	6.043828333494091	5.8414752217654105	5.924088233919035	6.03585049903323	5.871759765518668	5.861082466962305	5.283827928421969	5.403056923477684	5.561521497749394	2.226088200264385	2.762799611499715	2.638906817922774	0.4450200606091989	2.1062446220786737	0.945648226121708	5.951753131426989	6.141254304435499	5.800311760473338	3.991498230882453	3.5293964825877464	2.6772345640170983	1.6425619559228817	2.950333303860412	2.5181574730188285	3.2216679034741507	1.566853009980176	1.9379299207944056	2.237133630290308	2.0168335790527494	2.5254297221240556	3.0816696746665033	3.1757778273752377	3.1362959752572475	5.640056735794335	5.330908418775043	5.399959602315458	6.057359979676704	5.7899457897567554	5.917576858765142	5.406867283322087	5.3030336750823945	5.104224540878307	4.702648584615878	4.653786839668893	4.4876571964065075	3.784970390839582	3.750519291942074	3.7284302670409817
Pp3c4_13790V3	3.3646669854586366	3.511719354836301	3.41971769591476	3.093079769765809	3.06391322121992	2.782817869706657	2.7106881464562544	2.3816802864745803	2.640416930733585	1.937029287100014	1.9655306232291687	2.130151431889826	2.8324273679778966	2.541716252898606	2.5537099163669725	1.8487722415549668	1.9376710785342663	1.5404648624010802	3.2504824598791906	3.110726351206889	3.620067250915944	4.018770767697934	3.67013845207942	4.393139721943299	3.3281519482768407	3.4292666265981304	3.787442426765824	4.408940398851825	3.9760508394209015	3.693899627651279	4.541479762041168	3.984205430804986	3.963045622914874	4.011864416836749	4.0426280871258	3.993314281542847	4.0996875158212704	4.403168365271588	3.4941798677854976	3.8721261677682945	3.129844058620599	4.040847367468302	3.157468584467889	3.226855113176239	3.5393359911429636	1.958926000759157	1.6837032013776223	1.2442735729693148	-1.4354609775385418	-0.8248164295454651	-0.14931662387312922	-1.9253836943874965	-1.7301473793621809	-1.9170863774356912	-2.09228249935396	-1.0898649026810237	-0.9189148368672744	-3.8517990009053977	-3.293663433088273	-3.21309328344512	1.4549311315899078	1.4113042860048124	2.73427610977449	3.618523801279951	2.8082523823618626	2.69116178056572	2.0128392649745113	3.8527375073368546	3.6307128528946313	3.139739620266233	3.258567412717712	2.2414479770637805	2.9461110520221867	3.055528618181553	3.1080045713329523	3.7133275954674154	4.279415076708323	3.7020453690314	3.2402632549738675	2.553242114236835	3.2106581873287547	2.820230631190118	3.651022764327924	2.8071779559166044	2.2418647649820604	2.331326666246407	2.129112765272456	1.294068700829741	3.3388233938418628	0.680788911278656
Pp3c4_30530V3	3.98355790140622	4.732815145984515	4.745756621146353	3.9420126725782985	4.118046110642944	4.313717906128163	3.179963230089268	3.3944049119924324	3.780030666029759	3.579662551918516	3.341392207488132	2.653189547185261	2.9485218480414956	2.403837141392888	2.546488018623589	2.131552254885256	1.6018145446997465	1.6488926775737245	3.928449177165543	4.382937033975893	4.1437154006886425	3.739448978382766	2.950155995466526	3.948865523870938	3.649104857718929	4.229151030312471	3.8589061051359375	3.9094868054257663	3.772960831477696	4.176571513500347	4.035962635287859	3.9384160917861095	3.9613454102847014	3.882426239741576	3.792712602026571	4.043212704277347	3.9929115646687423	3.383704256009188	3.3872238873001614	4.624007212880918	5.727197709021764	4.058961769963523	3.5813794800538865	3.914298166619915	3.8279528670902585	3.5631847460520785	3.6136395809591626	3.5529855244480912	3.8792774793699896	3.647959563226238	3.740945594321004	3.0451243371042467	3.4492863511318337	2.889093706284734	2.6550138265429872	2.5599150706639153	2.977647144750522	2.6007955460701564	2.9118108140755203	2.692796331483193	3.5902778891692724	3.434933621706188	2.1498284628819584	2.210883983272776	2.7903467883173323	2.4087353673336938	2.5032514396843673	2.133474293969524	1.339456033132972	2.5864693368469114	2.657985101726613	2.1100777716853134	3.5152005796132175	3.4000760151951797	2.7224053221042466	4.314547288238819	3.94700884391856	3.750221187471875	4.66861727307966	4.659725291819259	3.969806190290196	4.314437290390409	3.7575376151993383	4.030030674221715	4.524999890307389	4.4856875146726845	3.976833953749035	3.9771335766197535	3.0313335568674047	3.442106709989164
Pp3c5_13670V3	4.322847337785968	4.326729865418091	4.4460415130017825	3.934747035202067	4.03381468384495	3.7096210625727424	3.323671710235437	3.317904004975644	3.0461766629553892	2.34020531412443	2.86762227616425	3.110858261618588	1.6431134927939866	2.1067257352358117	2.240907903536445	1.0633886211069343	1.0989951966707776	1.409891068106719	4.335460278486296	4.583847599068476	4.642013939481144	4.722882912526732	4.717464040175467	4.18174390850818	4.282369178903016	4.492947487387822	4.316773620331483	4.733875041580536	4.364722164367267	4.424968585840375	4.383755158751366	4.503100143106887	4.245718076089024	3.659647896214028	3.211474836910928	3.8920296500061102	2.611642145874104	3.0939210496479346	3.5201916767590458	3.652010785489695	3.5175520168151886	4.192442235166327	2.2764531764447526	2.1684787938857353	2.308449666679253	0.2695648576499009	-0.604261252346386	-1.337401634565386	-0.3196437384846781	-0.4493387515452617	0.6424639227569264	1.0045698261222071	0.7588752548348676	0.3711983075722437	-0.4489640308290999	-0.2543500991082426	0.11731947431900742	0.534600011595952	0.7416446734233465	0.03010813453385266	2.0481147563697624	2.041475193772818	2.467535295026327	1.1772977600545873	1.683918331310345	1.8507468143683632	1.6751831541185316	1.774135611038674	1.701536838729806	1.9770845796381027	2.2945556489290477	1.683612110504637	2.2391491722476493	2.085409519238432	1.37899364634524	4.619881618209353	4.650804404653947	4.780025962830503	4.46653042005598	4.265153797854112	4.784811867475546	4.212644921158167	4.13041956369535	4.207840954046136	3.4249068949593857	3.0830726728602884	3.420476006366845	1.8601021573343837	3.673973027398364	2.4676007892305813
Pp3c5_1870V3	2.5199049183451248	1.724442560322191	2.110555028968021	2.043046407401069	1.7794924635045035	1.45604330283675	-0.28176505236282806	0.6162677549107689	-0.09967809854641468	0.7731345173804417	0.4924700170568869	0.5280442458023087	0.3692877463985858	-0.3447473346818179	-0.4560052404935656	0.8375058690690276	0.6012398411265343	0.8126596043402566	2.321933540862607	2.2878090573831087	1.8378396409794724	1.6995108412061797	2.5169116075075877	2.6311897280404604	1.8810694751184265	2.0159612949647587	1.9483874779641257	2.4957297867170136	2.133054596066063	1.4333389142529591	1.3212401622101946	1.989044782196742	1.6902118100918857	1.729400849298251	2.3015839285271915	1.4617901084780829	1.6066424010855016	1.785047401241239	1.794420540541315	2.7724656811803294	2.11697379474729	2.6729300755215943	4.096307457852334	4.145981054040367	4.470047457995759	3.0591268696660703	3.539545651714443	3.5277560164837904	-0.7379513513102913	0.01226289628981884	0.7076045237876127	-0.6186678370817129	-1.13937642082053	-0.20191600453586273	-0.582783449498063	-0.4063275797008914	-2.667278132856897	-0.3524003278443773	0.06868925500174702	-1.48382068931759	0.8086892892897827	1.222550066904431	1.726620448221419	2.4027244174922697	1.3405507179621885	1.8972347154378413	1.6364879314148355	2.1766120806418714	1.9398389974356751	2.5603194161729506	2.530523014865181	3.045124915859279	0.9926998471438214	1.9785309438625671	1.66623585107591	2.002550382258396	2.05258811731362	2.5877005214818865	2.4171901161575446	2.791105951291592	2.7716403657610194	1.4032160377103446	1.414991811794178	0.5699040335477698	0.0987161351159796	0.6699567200093755	1.1658670916435712	0.3882438296866847	-0.1326604366036144	0.6635542201929792
Pp3c5_9700V3	4.220154303781036	4.178745943754253	4.496187179706533	4.025097410402362	3.634637780255886	4.14096063085447	3.4622250317112457	3.768514851636009	3.9363368422254825	3.5884998164418067	3.7069393712162206	3.66971074942812	3.161125390455083	3.456579106219367	3.473210221139507	3.0866873715203114	2.7262949634672595	3.1509326749840483	4.675802943685527	4.719282944244639	4.631437917740793	4.182776357871692	3.9731597043869313	4.678976851654416	4.272857850317565	4.714881757910857	4.29717813010345	4.366233362862301	4.39766026106099	4.315012836531496	4.5870210157009765	4.460099638752358	4.294922582521803	3.9721108783603194	3.897713503752046	4.313646301966729	3.6024044684195737	3.4292221174758035	3.225286601099143	4.666944104216351	5.2921587804484655	4.291900140215722	3.982565086766065	3.899137792444343	3.81261433106469	3.3680147434749257	3.617466234218526	3.128159699276854	3.639712388336903	3.4663961395764034	3.1517898312860098	2.4500805863783444	2.397074794417779	1.6882225020427215	-0.34451311783627697	-0.4540728730156092	-0.7789065176615726	3.4266014643666063	3.226397123944697	2.760127636165263	4.09103170021806	3.764173820330319	2.8556643565030844	2.394352569673998	3.0014422663497133	2.562355759916565	2.9721711668094772	1.98487546490094	2.3657313496742636	2.4388544821233182	2.801814934858373	2.3783644798074417	2.636818035172241	2.7425366123589003	3.2708001305716232	4.832564332841047	4.300442657558727	4.526423989675938	4.913078923371612	4.886879083006794	4.788762296284508	4.982928608615438	4.756586427464815	4.921837063145093	5.061276861792256	4.922537698966634	4.862877185807994	4.3819305794947265	3.4872081175145384	3.998817101323891
Pp3c6_17413V3	4.109218665848775	3.857126155452946	2.845539382244438	3.745277299394507	3.682489881759312	3.306878282780133	3.910233904906307	3.4892164880424192	3.356203851253357	2.494427727587035	3.022839803335345	3.71002518523681	1.944988031719036	2.603349027060218	2.258051927805968	4.125812417920492	4.090486473830258	4.5052773886957604	5.277439616381055	4.0365299493053906	3.791551150375194	3.172348247299334	3.834899472396029	4.179044416744808	4.474697724044615	4.543544813838745	4.58163745348432	4.509142922746837	4.414399084126432	3.583615419629477	4.167838780606221	3.6380204459462857	3.262635255585278	3.774658165143277	3.480774616112798	3.602931130338612	0.9363818379036992	3.914331588328797	2.7147367261880717	4.645096639350935	3.8852112439761495	3.7774958023527287	4.2351462886477345	3.912617074568558	4.217366806843844	3.802734445911556	3.9392633035223503	3.967557862380216	3.9585264946325	4.285349323463099	3.863378913346923	1.622913150561021	2.5893668831163805	2.002866032288824	0.847334697382599	-2.060404942701145	-0.13069573366337597	5.190850368392202	4.705950850837412	4.794191662280021	2.993030150454198	1.966241565175077	2.8477469875098085	1.857667393737234	2.188669194647378	2.016167680052983	2.166317553050547	2.515963484400045	0.11116122678712068	2.0554429254509685	1.998872016229062	1.8140295125699435	1.5660101541684677	2.181176377722738	1.894991945261718	3.842573555786358	4.002101267306103	4.443724117656119	3.7332395977125494	4.198372442511314	4.725848335850821	3.5941148355472405	3.935087894858712	4.461850427885745	3.7916100490757754	3.6534167605579015	3.97564899117933	3.387888242198811	3.1476526261434827	3.6579210090304137
Pp3c6_250V3	2.8006608713934655	2.6538030091723104	2.754051381906944	3.765335557879531	3.409408388479783	2.7683381146477033	3.763841698176997	3.568202114580716	3.7225934026305856	3.8648867812262577	3.905549706858917	3.581521442681215	3.836905640059928	4.218974729286671	3.9602874035607383	5.053184973533631	4.995164025401844	4.704636436279364	2.7576012026652412	2.0848697681239443	2.1564573861754033	2.96788147672018	1.771676851795524	2.2750129186919357	1.924969161492381	1.7398305690837683	1.577917747307716	0.5742221067292901	1.6448249266762518	1.101427905617363	1.3505172625518918	2.386905797141362	1.406470295972604	2.401020514129631	2.298796344007976	1.5637118800652494	2.600938720504406	1.887563709153227	2.1328301313914753	2.1054843648200205	2.017102727822767	2.398783198510399	0.6387070745698317	0.5159886792345215	1.4173459007070566	0.6519920801480017	-0.15439451689679587	-0.090449772773714	1.0638080836734114	1.4624377164593212	1.1006639529918605	1.0825899417734082	0.6174537332618726	1.286596751394776	1.3025462770459184	1.2040183870583074	1.5240739599249815	1.8985750236094223	1.528858808031078	2.071274262881405	4.162599834075374	4.03435110178415	3.5747677121423966	3.1689622217115643	3.4121550130256733	3.804042010471112	3.904645794475118	3.1719459302825475	3.0890247734624854	3.5176590900391265	2.9453121065482852	2.739369910065371	3.330758185454307	3.3860059623548535	3.541144484748814	1.6674093455546122	3.250190699488156	1.7322923377490835	2.4132650327843694	1.9972046606172775	1.5028048962362262	2.75057547610031	3.680857277548037	2.7207718530070126	3.8141280512163647	3.896020014274352	3.67501054886798	4.347329508474112	5.3240262008514065	4.139572053739979
Pp3c7_10610V3	1.3208493492901323	1.523134423641675	1.2720648530934917	2.11996535396736	2.3150105534179626	2.054591394430315	2.97075971489253	2.6694218627397666	2.536937845434383	3.731641335024556	3.325448451008264	3.379887111577631	4.033729390039079	3.52797510187389	3.738535134796081	2.9284970749470656	2.269839032096901	2.2686660422772333	0.8837441388073811	1.1688515871387744	0.6782252731819858	1.0705884901857157	1.0084271086976289	0.4719527198885021	0.26849081648607837	0.6786238848070717	0.5571847032946372	0.11061389785078836	-1.0086917236428177	1.3251833451866852	0.7281391095797958	-0.4534445690570509	1.1563457736353893	1.1137045767871825	0.9922000749410844	1.507183665179536	3.160759622812087	3.104135244321949	3.028853735027323	1.3373758909461095	-0.07374342734411485	1.3282474435912193	-0.02575886663887305	0.4905375238423809	0.11055132960520134	3.989915275411703	2.8898805135290404	2.058745942994534	2.321774322792833	3.232988511373806	3.5006851749804757	0.7610828188576435	-0.13072109187355904	1.1120556136327584	4.272808871024264	4.21666172472317	4.560469806553071	3.8001377281449344	3.666723345551272	4.115315473493072	1.824087111404325	2.595567590489439	2.786396915240837	3.804642740525677	2.537805591095037	3.491319372437748	3.0613014951552957	3.839431006890193	3.856714397202172	4.378151907000868	4.228865820207513	4.2148212758515715	4.340783801625218	4.3503108056800315	4.152978720004246	0.6587725006525467	0.29241704381874645	0.14498536729412215	-0.2578444393506373	-0.8673629338380832	0.00764060717708841	-2.094221068466057	-0.04572782631508371	-2.348797094755908	-1.2366057348156738	-0.8961713453880507	-1.2761961086065026	1.7956301092050782	2.7880011238800897	1.722630491251135
Pp3c7_15240V3	4.718239598825236	0.44670221264868903	-5.808217086750024	4.4228051781620445	2.2447516381372323	2.1864918354108784	4.5361917111368175	4.332318532487523	4.095649270118066	3.3979290680075973	4.360353237350423	4.4958514353041394	4.084348644369651	4.335841261831843	5.093613185346142	4.695096100436131	5.368433751589163	5.301776434104925	2.440668972666543	-4.996634508709391	0.33581670673134173	-5.020827722996992	2.1625415919429467	-2.2193612329534615	1.1968911479529512	-3.03210988171445	3.1546730963399763	0.6644324654850955	-3.5887915044433676	3.1194047086027266	2.2758864102821574	2.781144547268767	1.113723360413	2.0846015669412172	3.761495016718599	-3.91451429417716	3.8033016927726297	1.8519226319861584	-4.996990812940657	3.2017472965571496	0.4945057224716708	3.1716210106355915	2.036755488566323	2.0765877871978975	2.0506190877483235	2.519277257504365	3.4874394591912163	2.974023539284974	2.4990473395164243	0.5260388857725494	2.317692660271714	2.454567957314188	1.9436977370376471	-0.6885867194474812	-5.839654721356444	0.4935747342132743	2.8188976541575617	2.853256564970187	2.032666486212405	2.4010637031504105	3.104764563426513	2.9303016578515217	-0.3798791146308564	3.0484085113386103	-2.0482501328020013	3.679461336186274	0.2531275294783053	2.056338551219915	2.26511512664231	3.184457891801588	1.737778106509369	4.277289480051957	2.4893208655208574	3.132694799664346	2.188443200565399	-1.4857450325531467	1.3664580370912611	3.011005448708061	1.0060303747556054	0.3664109563524562	3.1391486651298814	2.3641724563020037	3.37328215052978	-2.3778618488081644	1.52067691547513	-5.654111363171531	2.52267958891048	-5.878149891803754	-0.07713911592876262	-5.950221476057347
Pp3c7_25550V3	3.801292480780808	3.644023896885877	3.7175832220514686	3.6212056676756874	3.147904776124183	3.4157827100242293	3.2361026578629843	3.2363947267792263	3.0668646254159517	2.1371795719740923	2.018059698392034	2.0565268327381903	1.5485941868642012	1.528489322228568	1.1432376802027802	3.250040862214917	3.2556661293701272	3.262763831425385	3.792651641369724	3.2276601121312773	3.7809140935984473	3.870656578994879	3.910867798336968	4.3985601250826125	3.41295391229441	3.067208150885566	3.4760874042553667	3.895955419305248	3.6208845978063033	3.26967373106806	2.8740831207617017	2.675194134755735	2.986637629490541	1.68181601424017	1.4925161089961696	2.33869954836632	1.5008183924555378	1.6015342065529177	1.3561461035205562	3.809651751009328	3.809651751009328	3.685516363017739	4.040247415420865	4.169312688614691	4.014437411828499	4.574743063842047	4.262413629674708	4.376171669750265	2.741826246452758	3.09588012375288	3.1616351219806376	-0.04783470605589836	1.0333316629251292	0.25648891980187577	-2.326103279460712	-1.737386873881503	-4.274228367176176	4.5860355198909675	4.7998309896607	4.7438294325238965	1.539708453678387	0.8054970925116568	0.4629879652569671	-0.37635286176591354	0.31144269824076615	-0.6290128565458941	-0.1023701655149722	-0.8004282345952217	0.6151822671740244	0.6786133466064053	-0.02676745417658114	0.02971513176195876	0.16374177853301913	0.6121112053092743	0.8978822910908737	4.406375682923117	3.8892188863998953	4.10440073589162	5.065617018357469	4.85747920646873	5.056514006300852	3.437161407004244	3.3343560073614853	3.382052800548666	2.473951143385382	2.585889474231743	2.3810851420721493	1.141540038413812	1.5044000431874842	1.911442789380117
Pp3c7_6850V3	4.301497838871322	4.2905138131717795	4.373327397408107	4.195108294046299	4.315238767044242	4.348993204831416	3.0906698550854066	2.989410290900392	3.3970110527514064	3.8456367226171406	3.6041359343722097	4.284966989232381	4.1238093370730775	4.062893937297718	4.423265980897379	2.3511135706647175	2.8015050884848605	3.1734709471192883	3.7523422874970858	2.894773139341563	3.769773265555748	3.3312679620168413	3.373763080105418	3.4185125497064552	3.464212174812589	2.056963876057459	3.1788222595153863	3.621517966119153	3.384051998485283	1.6332363895647752	2.871150571205014	3.231660121792068	2.2518404219680264	2.652484570733424	2.992956873399146	3.621753107986287	3.764814493479964	3.5841055884594297	2.600105218340766	3.9551104538439943	4.403851636232502	3.867719094128101	3.4255682428717704	3.3665815778035477	3.818611176908348	1.958075072622394	2.460909867780172	2.5072794116621906	0.7671099348763948	1.7622603012443423	1.260143171458977	2.7951315319468475	2.8572040808744137	1.3504344617093562	2.418578430350238	2.1317982199993817	1.7911280351819816	0.7246942585892543	0.5542811792885431	0.1088058017320932	2.835299820197557	3.0887867323894422	4.262026834715743	4.01311030555003	4.33087630823925	4.092883312456336	3.771972268396112	4.282913784388737	3.9157102561339623	3.358846122966203	3.3645051162458133	3.849709546084548	4.60098651092364	4.465627086014536	4.335154880120949	3.4310835146918204	3.041609875518262	3.280028035517783	3.2504501575404015	3.1947419374511976	3.3754414347907726	3.816085875641037	2.937926206527269	3.244154441221958	2.953053816834672	3.1227068997077905	2.7534658097232514	3.5180915436979774	2.6869657277161325	2.921372194051065
Pp3c8_14050V3	3.415521568336475	4.558065302136513	4.399385815752891	3.137412856455983	4.062358805950972	4.3735536991944235	3.329748345607326	3.562800395752498	3.9207887642993304	4.175971752722598	3.905897272658627	3.63269186897921	3.434118210669776	3.367118228835353	3.546337703308523	4.621646539055793	4.20574389544287	4.137107438855906	4.229654062830778	4.209452954695067	4.561314726579781	4.127496152362991	4.041030740943454	4.143313192571616	3.770275815486889	3.8872914654392896	3.6113782492033666	3.606010478723985	3.6266940552	3.5483430903634905	2.598466082457544	3.242160815383601	2.996222246081119	2.4136269256913745	2.4553047858704704	3.252187243785108	1.859384354720124	1.774156325691169	2.2520165186771677	4.725818215181589	5.784109096081325	3.9559707542492633	5.195179874738831	4.826275098864613	5.089500184164556	4.815071979074291	4.792849542936838	5.207320277583134	4.436224640709165	4.244054992289681	4.4046263695180095	1.1736346068163963	1.734979492326504	1.5335831101205666	-1.539367520969218	-0.6179762167425313	-1.6460536340604937	6.142179406066554	6.352524096910793	6.038235984745512	1.857884188461112	1.363692670182522	0.6621574748284573	-1.0321466105541302	0.5378667026424792	0.7316405336445999	1.24869659743037	-0.4593024679972555	-0.7892695985652725	-0.2243384664984435	-0.4985526167004076	0.5050307422560987	0.5341009101681284	0.9401182304778424	0.06675863613727306	4.919684456740127	4.174253510043035	4.281340893776088	4.794013039013555	4.543363243746982	4.519812849984321	4.332695511349742	3.675944404650652	3.871044777147998	3.02403835714988	2.865657272523065	2.84034835100862	1.8349302781375183	1.3212209612891217	1.408036043871213
Pp3c8_1870V3	3.3786544006600754	4.374300242730987	4.19671983052058	3.97168584289564	4.156652984332831	4.391683333210816	4.382002973734031	4.5617397204007855	4.766254381565849	5.123996816729073	4.738249564689116	4.711302688870692	4.305309865464073	3.909297377493772	4.052191740249349	5.407233387909877	5.171606294625726	5.326454895026276	3.7714448135509704	4.178181966019893	4.129187469024243	4.051807166265299	3.4348109391477197	4.399499005872889	3.8322782084693103	3.9050474182800774	3.458643279954809	3.2901730199227788	3.5802963057722565	3.908094705745576	3.4816044951585905	3.5568734802478	3.4654924939070733	2.3696946897018445	2.33869954836632	2.4370957057394507	0.7400109022811041	0.4290860750505364	1.300467069930259	3.948514073992516	4.8706994358714235	4.042021596930176	4.2632451015566	4.061400791065507	3.893524926266685	5.239926307256302	4.716989447920323	4.7450393967116415	4.244282432793806	4.122098160960722	4.3448908108470405	2.281959238091389	2.271755841249944	2.298734117706843	-0.3687634416049067	0.4450200606091989	0.6936068099225556	5.024352707434175	4.9145087698604355	4.721252199780265	3.445431809327538	2.765555425584363	1.736976941152405	-0.02907674045720622	1.8639082914287208	1.5405087674206828	2.19981307325618	-0.24678509207920932	0.7549330017834335	0.7865853925354612	0.5123370604959151	0.45643780481020246	0.11377683014438636	1.231705096255845	-0.1306314995811391	4.948551509450648	4.552408329541003	4.323010911297341	5.669083311383941	5.413194046522339	5.05841646964269	5.120746510691008	4.8284742521457575	4.791506896772702	4.2369431292206325	4.250616578408759	4.074344251068881	3.405338942656783	2.6074118835699527	3.0232019842248223
Pp3c8_19960V3	1.7616796347259616	2.443340801182762	2.219536794848449	1.7635615026156184	2.949867602668216	2.71800796849058	2.3752204023817254	2.842215785163587	2.9293812440816627	2.7781390108417887	2.6640977136874144	2.7620938963419843	1.9370173822147527	2.6025139895445037	1.9766592883502412	1.955419294239339	1.5774725913032095	1.8733812208175824	1.7168702265356854	1.3285940586757472	1.7519079601604932	1.6151281757948666	1.565907983189073	1.8988058420707972	1.5440424089557296	0.9273020723304796	1.7879143278111356	1.5667836679596898	1.7519555669353002	1.6287667699411736	1.0873162014843285	1.5732300466691271	2.1451004369688467	1.4259744464907855	1.4056951626154697	1.2675198406979873	0.16819436492156897	0.5551056581250845	0.6607018908569219	2.287934664585527	2.7076722359395604	1.177495639978354	1.594231022323009	1.1434033742630123	0.9487144555183072	1.8383142556870529	1.5803426054668783	0.60432056284816	0.7094162969151179	1.2301613453290432	1.03856893258997	0.8603667709957793	0.517625580082281	0.0942727444700202	-0.6753127811711164	-1.0190342831677182	-0.6288167636474253	3.913552995353134	3.9773656452667776	3.750053805209662	2.1475712983543978	1.8016518821186005	1.5002573874153349	-0.29673772562777495	1.1458244077366952	0.6649685023265826	1.1801944709977952	0.2003964896219174	0.00374512494152055	-0.4985526167004076	0.369413027920174	0.06890023539792856	0.6893691489662968	0.43053916463504976	-0.3464211296369752	2.233154236533607	1.1778661661394274	1.5528497614222951	2.466327143431256	2.438818489103583	2.2096063674735364	2.4354296491667045	1.4032160377103446	2.4312876599757396	2.7354096002752604	1.926870690457231	2.6124476182782637	2.326014176816613	0.1809436211091267	2.1076570967199793
Pp3c8_25010V3	2.693232413430108	2.25133473200858	2.1446649252503605	3.1836472693762556	2.2702878767143404	2.388251937088018	3.0643710921138965	3.295566897625017	2.987458918044082	3.693570086560172	3.420057848960139	3.4184906380894793	3.841653353180046	3.697232774976911	3.3180731005015383	3.09767843585931	3.207762479943021	2.9955283299800413	2.240588755993	2.381966199004818	2.1454552527826483	2.1121716069966157	2.3988493782816556	2.562371183102189	2.045315795820482	2.259348369790904	2.129183558314894	1.931188597146055	1.6464770650383245	1.7932899139497391	2.3376378583798965	1.052990185700473	1.9992807089487803	1.7087209215080683	0.6668663838572357	2.170855793117952	1.96562202516838	1.510837286839138	1.500818392455538	2.6642763637553837	1.351143975497226	2.377451949840441	1.404564826472798	1.3794758241665874	1.3775100523194337	0.4862401074133452	0.45204290916409295	0.7942387275539279	1.191897776662626	1.4054874605661445	1.570129098112134	1.8422462408923597	1.591548856701282	1.5672495339275094	1.2284764421309988	1.3424712047791934	1.441332788789643	2.9795060984739012	2.957996197827791	2.864097908392316	1.923156568434658	2.3450770741095193	1.9691478502796973	0.03194056184768391	2.24656441687634	1.3908309732579756	1.3194086086016663	1.425160219567856	0.820939269664301	0.08357567433772718	1.3538125113636028	2.1217650710423612	1.5017394555869044	2.036861724980587	1.012456118167234	1.8638703661116176	1.871160008169096	2.323391514643961	2.1873386236979044	2.456375904942298	2.7991947330113707	2.4664716433754266	2.818624554032024	2.679618948585596	2.47747059367263	2.4227361173982658	2.8001049977268626	2.2144392442524437	2.49093614477976	2.261675361944657
Pp3c9_20230V3	3.0659518071023912	3.5881665800828366	3.7345353625215214	3.36260036492888	3.4060821497243485	3.6067817339568258	3.170183044750385	3.4337969078064376	3.824518184432757	2.7797538618286657	2.451578293762936	2.2599875877138875	1.9911574286071092	1.891318137540029	0.9417221285177564	4.320900064090984	4.147585543690016	4.284226650020703	4.17204307356769	4.1665623166063295	4.328292717461008	4.222672408786311	3.981496048047165	4.428770489519815	4.027208906007075	4.134339480776825	4.033919677192325	3.244372195132794	3.872464378211236	3.502594120802476	3.404134720842214	3.302584294250124	3.235268227614218	1.6893371023377797	2.6420487140370015	2.401896235043311	0.0256957109827418	1.2941322121302392	1.5834016576552723	4.304979412055524	4.929167939228142	3.9581011750622617	5.008757371575443	4.807796471027692	4.88459715688378	5.238660031263254	4.752862825305145	4.940803967115235	3.509537780814302	3.322783437671547	3.813269918897737	0.470080185398625	1.6752706623276865	0.5418563108217104	-1.278891440243494	-0.2724431836760195	-3.3704657345873077	5.29219198243505	5.368966352216536	5.264810286004744	1.137322629634516	0.9435804118709687	0.5921636636286963	-0.3167583963653814	-0.6716103269495963	-0.730269286184897	-0.1707970887992289	-0.2375799702032197	0.16613740149188003	-0.1787089126366844	-0.552248162640157	0.4867473353269314	-0.6230923476383009	0.5133830913882624	0.8336377640447044	5.220070488028273	4.777063191388485	4.756269729968788	5.654842386060416	5.462613602949633	5.396498799155166	4.59047594448444	4.03148326731818	4.01088444493639	3.1218975169887315	2.9368957274845093	2.809675702032273	1.6571962441183825	1.814738684119181	1.7107559988629286
Pp3c9_7310V3	3.9580004188877314	3.573406667279587	3.3114555790373883	4.052185501643754	3.719276117541965	2.7694552753758965	3.7223883314537582	3.2614346354805743	3.3829373316203046	3.9090444468123735	3.440859984790856	3.583583133850667	3.9012168221012664	3.5949127274521127	2.973299021647402	3.6510559490059338	4.032149502009548	3.53830349868053	2.7815795852281875	3.873600501260353	3.4210205053157647	3.740141262627955	3.451202952195284	3.2009806636321563	3.43309106873758	4.04702552949204	3.781181955451312	4.012499651268152	3.137940509610749	4.428273928563743	4.275706848470541	3.9180609119708	3.99654681869877	4.102416683060633	4.038610109841298	3.87092614569397	3.973378526604903	4.119316852839822	4.5786546240518815	3.3462563886139134	2.7282926661352773	3.2715614569931755	0.7434371366878534	1.2712830717845591	1.8456738725254236	-1.8264533745274831	-1.2675951506278074	-3.462271205209264	-2.112659918515222	-1.999777464304368	-1.301406436228714	-0.4934205051719482	-0.4934205051719482	-2.067757444770357	-0.5030051453744274	-0.9189148368672744	-0.2037258454950287	-3.1352768989740616	-1.520930905119393	-2.03035098888876	4.201948333114939	4.504300420360753	4.88673281188447	5.385874276601979	5.183261455779013	5.23922226162696	5.532973798748436	5.054253864808286	5.029615129740893	4.261062494533931	4.164736072615883	4.11335895490261	3.4705845342420556	3.687326329425423	3.4178849685629547	3.0849231266167463	3.61602769629116	3.5346526304668267	3.0428295598731996	3.154100835706392	3.467953983711626	2.3164036898342317	3.153973767423204	3.1989379218782346	3.677326779309843	3.7984574497921977	3.217457264169691	3.639978871016961	4.671750401599028	4.054704900979853
Pp3s775_50V3	1.1782323454514352	4.0553498699358155	4.352490831509399	-1.0753499511395472	2.258038996244798	1.8537244810558295	-1.4276534726365877	-3.9177032297879975	-3.044149691737742	-0.7786976519487118	-0.2811349275449172	0.12722468567222883	-1.5248301817990753	-0.5564055707486001	0.5734505950388191	3.1633822681362567	2.024147942848116	1.135244970768582	1.565907983189073	0.48839868939159686	1.417157851814578	1.1508640439639948	1.308847503127553	1.5189710241665455	1.3112130413439846	-0.5053997987316369	-1.0745861459768435	0.03385372683770124	0.9293189739887712	-0.7169075515607393	-4.3432580984638225	0.6859916976024425	-2.924482461038393	-2.6311829787180625	0.3357857641415016	-5.513105718004838	-4.491280570710144	-5.15533487804357	-4.996990812940657	2.1036373192636137	3.944633780048923	2.1036373192636137	-0.9923412013540692	-0.14966093767676722	-1.20652817424346	-5.871933159959508	-2.498938063814315	-3.117239076793325	-5.869603011920429	-5.869192871719725	-5.869469426862975	-5.871980113986084	-5.866497956242936	-2.45365505333296	-5.839654721356444	-5.835478386393955	-5.835478386393955	-5.869700140752287	-5.421004850509101	-2.7402549957077844	3.137796565576749	2.4770248916574915	0.03586692333086299	-2.3828516450550183	0.06510969406144469	-2.8877453086130527	0.22336390041998752	-5.736006092678057	-5.810261713007746	-5.930937138559928	-5.859731637899025	-4.933849763671979	-1.2124856642943609	-1.084346001664486	-0.8286338103198395	2.922461007013315	1.6612305199615731	1.1509558089315433	3.3752739323692484	1.8990177720377024	1.8391247544441471	3.722207889524332	1.4772617056197546	1.5696843827921314	2.774002675321858	2.344836425840929	2.434981235900374	2.9714149348496166	0.8981296735033147	1.1539824994117518
