AT5G18340
AT5G19350
AT1G33890
AT3G19130
AT5G18620
AT4G25380
AT3G24520
AT2G38470
AT1G33930
AT5G56010
AT5G10010
AT1G74310
AT4G18880
AT5G03720
AT4G17750
AT3G15840
AT5G54070
AT5G47550
AT1G21910
AT1G33880
AT1G56300
AT4G15802
AT1G47490
AT2G19540
AT4G13980
AT1G43160
AT4G14675
AT5G64910
AT2G25140
AT2G26150
AT2G46020
AT1G54490
AT3G51910
AT4G18870
AT4G14670
AT3G02990
AT3G08970
AT5G66080
AT5G15450
AT3G25230
AT3G62410
AT5G48570
AT5G17710
AT1G33910
AT3G23610
AT5G16820
AT3G22840
AT5G65790
AT2G30250
AT2G47400
AT2G20880
AT5G07100
AT4G19630
AT5G43840
AT5G09920
AT5G56030
AT3G06400
AT1G67970
AT5G52640
AT2G38340
AT5G27660
AT5G61780
AT1G32330
AT5G21160
AT5G62390
AT3G22830
AT2G21320
AT5G07350
AT1G33900
AT3G63350
AT5G56000
AT5G12140
AT2G26330
AT1G77570
AT5G45710
AT1G76560
AT1G47500
AT1G49600
AT4G19020
AT1G79350
AT4G14690