time	viol	9_cis_neo	anthera	Chlb	Lut	Zeax	Chla	alpha_car	11_cis	beta_car	9_cis	6MHO	beta_CC	beta_Io	DHA	DHA_per_beta_Io	Chla_per_b	beta_car_per_9_cis_neox	V_A_Z_per_Chla_b	A_Z_per_V_A_Z	beta_Car_per_beta_CC	beta_Car_per_beta_Io	beta_Car_per_DHA	beta_Car_per_beta_CC_beta_Io_DHA
0.25	0.195107771	0.729378691	0.445734266	0.760106237	0.814199478	0.994410834	0.704794923	0.637939391	0.720406422	0.557393901	0.67681657	2.430677161	2.345359393	1.006465517	0.924321432	0.918052257	0.930378775	0.718093409	0.773222538	1.355184345	0.211487848	0.570878991	0.557926109	0.282018332
2	0.265478781	0.934932008	0.462479926	0.981428207	1.065024018	1.197716998	0.938876874	0.855691066	1.253339969	0.733639548	0.806952469	1.483843829	1.873926319	1.395410886	0.83032815	0.66477595	0.97264728	0.814020082	0.810422542	1.23703589	0.35502846	0.557587244	0.815860801	0.440050178
6	0.189420561	0.65686778	0.249705244	0.747600382	0.834226752	0.866081791	0.677557883	0.655920979	1.318931685	0.457879395	0.593134008	0.982275633	1.32121404	1.357142857	1.437655995	1.11603116	0.903224471	0.668953098	0.812793014	1.182623578	0.329955086	0.35425853	0.297099052	0.327774656
6.25	2.120151841	0.837692477	2.891634459	0.846097665	0.841436746	0.593188814	0.868394658	0.833765269	0.764992814	0.849482314	0.882211875	1.105742166	1.036804069	1.021778584	0.462886464	0.408523145	1.029031296	1.025192341	1.079244589	0.89774124	0.810238114	0.769377312	2.031579526	0.912173924
10	4.741395892	0.857488219	2.523208313	0.829915228	0.801006625	0.529523169	0.844333609	0.801940373	0.5943273	0.80817056	0.772934037	1.059969775	0.95637276	0.667876588	0.823492865	1.122336517	1.021366571	0.840823799	1.138359499	0.767229127	0.828670934	1.111596835	0.936250588	0.860120462