Sample	Filename	File type	Encoding	Total Sequences	Sequences flagged as poor quality	Sequence length	%GC	total_deduplicated_percentage	avg_sequence_length	basic_statistics	per_base_sequence_quality	per_tile_sequence_quality	per_sequence_quality_scores	per_base_sequence_content	per_sequence_gc_content	per_base_n_content	sequence_length_distribution	sequence_duplication_levels	overrepresented_sequences	adapter_content
M_1_10_1	M_1_10_1.fq.gz	Conventional base calls	Sanger / Illumina 1.9	37331918.0	0.0	36-150	54.0	26.420889881530847	147.82559556677478	pass	pass	pass	pass	warn	pass	pass	warn	fail	pass	pass
M_1_10_2	M_1_10_2.fq.gz	Conventional base calls	Sanger / Illumina 1.9	37331918.0	0.0	36-150	55.0	26.021090094090066	147.08794520013677	pass	pass	pass	pass	warn	pass	pass	warn	fail	warn	pass
M_1_11_1	M_1_11_1.fq.gz	Conventional base calls	Sanger / Illumina 1.9	40333957.0	0.0	36-150	54.0	26.08986820998456	147.8661600447484	pass	pass	pass	pass	warn	pass	pass	warn	fail	pass	pass
M_1_11_2	M_1_11_2.fq.gz	Conventional base calls	Sanger / Illumina 1.9	40333957.0	0.0	36-150	55.0	25.13061725954575	147.0403745161924	pass	pass	pass	pass	warn	warn	pass	warn	fail	pass	pass
M_1_12_1	M_1_12_1.fq.gz	Conventional base calls	Sanger / Illumina 1.9	36971550.0	0.0	36-150	54.0	32.69978267481892	147.08901882663832	pass	pass	pass	pass	warn	pass	pass	warn	fail	pass	pass
M_1_12_2	M_1_12_2.fq.gz	Conventional base calls	Sanger / Illumina 1.9	36971550.0	0.0	36-150	55.0	31.173345180841167	147.29649798290848	pass	pass	pass	pass	warn	warn	pass	warn	fail	pass	pass
M_1_13_1	M_1_13_1.fq.gz	Conventional base calls	Sanger / Illumina 1.9	40075302.0	0.0	36-150	54.0	27.941473405387278	147.10007627640584	pass	pass	pass	pass	warn	pass	pass	warn	fail	pass	pass
M_1_13_2	M_1_13_2.fq.gz	Conventional base calls	Sanger / Illumina 1.9	40075302.0	0.0	36-150	55.0	27.214490557428718	147.17528164853255	pass	pass	pass	pass	warn	pass	pass	warn	fail	warn	pass
M_1_14_1	M_1_14_1.fq.gz	Conventional base calls	Sanger / Illumina 1.9	35029106.0	0.0	36-150	53.0	30.783730931968606	146.0148591574104	pass	pass	pass	pass	warn	warn	pass	warn	fail	pass	pass
M_1_14_2	M_1_14_2.fq.gz	Conventional base calls	Sanger / Illumina 1.9	35029106.0	0.0	36-150	54.0	29.043699798416984	146.61666726521653	pass	pass	pass	pass	warn	warn	pass	warn	fail	pass	pass
M_1_15_1	M_1_15_1.fq.gz	Conventional base calls	Sanger / Illumina 1.9	30232653.0	0.0	36-150	53.0	29.50079138359297	147.06798401053325	pass	pass	pass	pass	warn	pass	pass	warn	fail	pass	pass
M_1_15_2	M_1_15_2.fq.gz	Conventional base calls	Sanger / Illumina 1.9	30232653.0	0.0	36-150	54.0	27.46917811724782	147.62042335484088	pass	pass	pass	pass	warn	pass	pass	warn	fail	pass	pass
M_1_16_1	M_1_16_1.fq.gz	Conventional base calls	Sanger / Illumina 1.9	37957035.0	0.0	36-150	54.0	27.53595664549806	145.7843921423262	pass	pass	pass	pass	warn	pass	pass	warn	fail	pass	warn
M_1_16_2	M_1_16_2.fq.gz	Conventional base calls	Sanger / Illumina 1.9	37957035.0	0.0	36-150	54.0	27.112685536828778	145.2715005005001	pass	pass	pass	pass	warn	pass	pass	warn	fail	warn	warn
M_1_17_1	M_1_17_1.fq.gz	Conventional base calls	Sanger / Illumina 1.9	34346860.0	0.0	36-150	54.0	27.837683666293827	146.63907265467643	pass	pass	pass	pass	warn	pass	pass	warn	fail	pass	pass
M_1_17_2	M_1_17_2.fq.gz	Conventional base calls	Sanger / Illumina 1.9	34346860.0	0.0	36-150	54.0	27.54374962195907	146.68844424206463	pass	pass	pass	pass	warn	pass	pass	warn	fail	warn	pass
M_1_18_1	M_1_18_1.fq.gz	Conventional base calls	Sanger / Illumina 1.9	37370173.0	0.0	36-150	55.0	29.943879742818304	146.7826426706668	pass	pass	pass	pass	warn	pass	pass	warn	fail	pass	pass
M_1_18_2	M_1_18_2.fq.gz	Conventional base calls	Sanger / Illumina 1.9	37370173.0	0.0	36-150	55.0	29.616815794741054	146.82650644940819	pass	pass	pass	pass	warn	warn	pass	warn	fail	pass	pass
M_1_19_1	M_1_19_1.fq.gz	Conventional base calls	Sanger / Illumina 1.9	35195391.0	0.0	36-150	54.0	30.010778658639364	146.76983784609752	pass	pass	pass	pass	warn	pass	pass	warn	fail	pass	pass
M_1_19_2	M_1_19_2.fq.gz	Conventional base calls	Sanger / Illumina 1.9	35195391.0	0.0	36-150	55.0	29.823515689846776	147.1757727595639	pass	pass	pass	pass	warn	pass	pass	warn	fail	warn	pass
M_1_1_1	M_1_1_1.fq.gz	Conventional base calls	Sanger / Illumina 1.9	37928578.0	0.0	36-150	53.0	31.2793698211942	146.16614559079963	pass	pass	warn	pass	warn	pass	pass	warn	fail	pass	pass
M_1_1_2	M_1_1_2.fq.gz	Conventional base calls	Sanger / Illumina 1.9	37928578.0	0.0	36-150	54.0	28.815851468220778	147.18167717756253	pass	pass	pass	pass	warn	pass	pass	warn	fail	warn	pass
M_1_20_1	M_1_20_1.fq.gz	Conventional base calls	Sanger / Illumina 1.9	37357137.0	0.0	36-150	55.0	30.653920294515597	146.95639558780962	pass	pass	pass	pass	warn	pass	pass	warn	fail	pass	pass
M_1_20_2	M_1_20_2.fq.gz	Conventional base calls	Sanger / Illumina 1.9	37357137.0	0.0	36-150	55.0	29.579923001668583	147.0334109918541	pass	pass	pass	pass	warn	pass	pass	warn	fail	pass	pass
M_1_21_1	M_1_21_1.fq.gz	Conventional base calls	Sanger / Illumina 1.9	52701752.0	0.0	36-150	54.0	27.025646582546674	146.28429671560065	pass	pass	warn	pass	warn	pass	pass	warn	fail	pass	pass
M_1_21_2	M_1_21_2.fq.gz	Conventional base calls	Sanger / Illumina 1.9	52701752.0	0.0	36-150	55.0	24.6508663583404	146.88122121632694	pass	pass	pass	pass	warn	warn	pass	warn	fail	pass	pass
M_1_22_1	M_1_22_1.fq.gz	Conventional base calls	Sanger / Illumina 1.9	45950742.0	0.0	36-150	53.0	22.921691375848624	146.20367412130145	pass	pass	warn	pass	warn	pass	pass	warn	fail	pass	pass
M_1_22_2	M_1_22_2.fq.gz	Conventional base calls	Sanger / Illumina 1.9	45950742.0	0.0	36-150	54.0	22.167070175828236	146.6215290277576	pass	pass	pass	pass	warn	pass	pass	warn	fail	warn	pass
M_1_23_1	M_1_23_1.fq.gz	Conventional base calls	Sanger / Illumina 1.9	47658282.0	0.0	36-150	54.0	27.723318910702734	146.27457408137371	pass	pass	warn	pass	warn	pass	pass	warn	fail	pass	pass
M_1_23_2	M_1_23_2.fq.gz	Conventional base calls	Sanger / Illumina 1.9	47658282.0	0.0	36-150	55.0	25.181259305771576	147.10551013987453	pass	pass	pass	pass	warn	pass	pass	warn	fail	pass	pass
M_1_24_1	M_1_24_1.fq.gz	Conventional base calls	Sanger / Illumina 1.9	34840121.0	0.0	36-150	55.0	32.66839187660251	147.01797533940825	pass	pass	pass	pass	warn	pass	pass	warn	fail	pass	pass
M_1_24_2	M_1_24_2.fq.gz	Conventional base calls	Sanger / Illumina 1.9	34840121.0	0.0	36-150	55.0	30.449116718284824	147.34323520288578	pass	pass	pass	pass	warn	warn	pass	warn	fail	pass	pass
M_1_25_1	M_1_25_1.fq.gz	Conventional base calls	Sanger / Illumina 1.9	45661163.0	0.0	36-150	54.0	29.63780488895541	146.29055324324526	pass	pass	warn	pass	warn	warn	pass	warn	fail	pass	pass
M_1_25_2	M_1_25_2.fq.gz	Conventional base calls	Sanger / Illumina 1.9	45661163.0	0.0	36-150	54.0	27.124365321682696	146.8783026398167	pass	pass	pass	pass	warn	warn	pass	warn	fail	pass	pass
M_1_26_1	M_1_26_1.fq.gz	Conventional base calls	Sanger / Illumina 1.9	33728867.0	0.0	36-150	54.0	27.45897231957029	147.14426938799932	pass	pass	pass	pass	warn	warn	pass	warn	fail	pass	pass
M_1_26_2	M_1_26_2.fq.gz	Conventional base calls	Sanger / Illumina 1.9	33728867.0	0.0	36-150	54.0	25.581876617988485	147.40574111190867	pass	pass	pass	pass	warn	warn	pass	warn	fail	pass	pass
M_1_27_1	M_1_27_1.fq.gz	Conventional base calls	Sanger / Illumina 1.9	31856152.0	0.0	36-150	54.0	32.36901797408772	147.0726577397044	pass	pass	pass	pass	warn	warn	pass	warn	fail	pass	pass
M_1_27_2	M_1_27_2.fq.gz	Conventional base calls	Sanger / Illumina 1.9	31856152.0	0.0	36-150	54.0	30.340069990724267	147.29984864461971	pass	pass	pass	pass	warn	warn	pass	warn	fail	pass	pass
M_1_28_1	M_1_28_1.fq.gz	Conventional base calls	Sanger / Illumina 1.9	35121758.0	0.0	36-150	53.0	25.843524263799644	146.8669541257018	pass	pass	pass	pass	fail	warn	pass	warn	fail	warn	pass
M_1_28_2	M_1_28_2.fq.gz	Conventional base calls	Sanger / Illumina 1.9	35121758.0	0.0	36-150	54.0	25.565939110436954	147.0992835552252	pass	pass	pass	pass	warn	warn	pass	warn	fail	warn	pass
M_1_29_1	M_1_29_1.fq.gz	Conventional base calls	Sanger / Illumina 1.9	38654053.0	0.0	36-150	54.0	30.508887460642324	146.74621900580516	pass	pass	pass	pass	warn	warn	pass	warn	fail	pass	pass
M_1_29_2	M_1_29_2.fq.gz	Conventional base calls	Sanger / Illumina 1.9	38654053.0	0.0	36-150	55.0	31.29200397723188	146.38836351779204	pass	pass	pass	pass	warn	warn	pass	warn	fail	warn	pass
M_1_2_1	M_1_2_1.fq.gz	Conventional base calls	Sanger / Illumina 1.9	32328870.0	0.0	36-150	55.0	30.780404660078037	147.89906272628767	pass	pass	pass	pass	warn	pass	pass	warn	fail	pass	pass
M_1_2_2	M_1_2_2.fq.gz	Conventional base calls	Sanger / Illumina 1.9	32328870.0	0.0	36-150	55.0	29.78531598976555	147.1002209170936	pass	pass	pass	pass	warn	pass	pass	warn	fail	pass	pass
M_1_30_1	M_1_30_1.fq.gz	Conventional base calls	Sanger / Illumina 1.9	37948180.0	0.0	36-150	55.0	36.08519666600156	146.1976345374139	pass	pass	pass	pass	warn	fail	pass	warn	fail	pass	pass
M_1_30_2	M_1_30_2.fq.gz	Conventional base calls	Sanger / Illumina 1.9	37948180.0	0.0	36-150	55.0	36.14560113070001	146.63965178303675	pass	pass	pass	pass	warn	fail	pass	warn	fail	warn	pass
M_1_31_1	M_1_31_1.fq.gz	Conventional base calls	Sanger / Illumina 1.9	40584334.0	0.0	36-150	54.0	25.4600067401343	146.68636567991973	pass	pass	pass	pass	warn	warn	pass	warn	fail	pass	pass
M_1_31_2	M_1_31_2.fq.gz	Conventional base calls	Sanger / Illumina 1.9	40584334.0	0.0	36-150	55.0	25.241525438931	146.64493018414444	pass	pass	pass	pass	warn	warn	pass	warn	fail	warn	pass
M_1_32_1	M_1_32_1.fq.gz	Conventional base calls	Sanger / Illumina 1.9	29216731.0	0.0	36-150	54.0	27.79743093387718	147.0526632154706	pass	pass	pass	pass	warn	warn	pass	warn	fail	pass	pass
M_1_32_2	M_1_32_2.fq.gz	Conventional base calls	Sanger / Illumina 1.9	29216731.0	0.0	36-150	54.0	26.98042905791199	147.32243039099754	pass	pass	pass	pass	warn	warn	pass	warn	fail	pass	pass
M_1_33_1	M_1_33_1.fq.gz	Conventional base calls	Sanger / Illumina 1.9	31528768.0	0.0	36-150	54.0	28.632573964320684	147.0173357550793	pass	pass	pass	pass	warn	warn	pass	warn	fail	pass	pass
M_1_33_2	M_1_33_2.fq.gz	Conventional base calls	Sanger / Illumina 1.9	31528768.0	0.0	36-150	54.0	26.91820566572317	147.3670742542176	pass	pass	pass	pass	warn	warn	pass	warn	fail	pass	pass
M_1_34_1	M_1_34_1.fq.gz	Conventional base calls	Sanger / Illumina 1.9	35446448.0	0.0	36-150	54.0	34.00965781935621	145.89832625824738	pass	pass	fail	pass	warn	warn	pass	warn	fail	pass	pass
M_1_34_2	M_1_34_2.fq.gz	Conventional base calls	Sanger / Illumina 1.9	35446448.0	0.0	36-150	55.0	32.724043460676356	145.94444207780705	pass	pass	warn	pass	warn	warn	pass	warn	fail	warn	pass
M_1_35_1	M_1_35_1.fq.gz	Conventional base calls	Sanger / Illumina 1.9	36617295.0	0.0	36-150	55.0	34.591628752188164	146.7840365324637	pass	pass	pass	pass	warn	warn	pass	warn	fail	pass	pass
M_1_35_2	M_1_35_2.fq.gz	Conventional base calls	Sanger / Illumina 1.9	36617295.0	0.0	36-150	55.0	33.032764003728545	147.22338766421714	pass	pass	pass	pass	warn	warn	pass	warn	fail	warn	pass
M_1_36_1	M_1_36_1.fq.gz	Conventional base calls	Sanger / Illumina 1.9	31666905.0	0.0	36-150	55.0	39.11117005300549	146.74187000592573	pass	pass	pass	pass	warn	fail	pass	warn	fail	pass	pass
M_1_36_2	M_1_36_2.fq.gz	Conventional base calls	Sanger / Illumina 1.9	31666905.0	0.0	36-150	55.0	37.94029692232305	146.89154967938924	pass	pass	pass	pass	warn	fail	pass	warn	fail	pass	pass
M_1_37_1	M_1_37_1.fq.gz	Conventional base calls	Sanger / Illumina 1.9	29932422.0	0.0	36-150	54.0	33.03832945664757	147.18505107939478	pass	pass	pass	pass	warn	warn	pass	warn	fail	pass	pass
M_1_37_2	M_1_37_2.fq.gz	Conventional base calls	Sanger / Illumina 1.9	29932422.0	0.0	36-150	55.0	31.402960135829638	147.2235171280159	pass	pass	pass	pass	warn	warn	pass	warn	fail	pass	pass
M_1_38_1	M_1_38_1.fq.gz	Conventional base calls	Sanger / Illumina 1.9	36513865.0	0.0	36-150	54.0	27.2914183924278	147.19249791825652	pass	pass	pass	pass	warn	pass	pass	warn	fail	pass	pass
M_1_38_2	M_1_38_2.fq.gz	Conventional base calls	Sanger / Illumina 1.9	36513865.0	0.0	36-150	54.0	25.33053596084967	147.427464416599	pass	pass	pass	pass	warn	warn	pass	warn	fail	pass	pass
M_1_39_1	M_1_39_1.fq.gz	Conventional base calls	Sanger / Illumina 1.9	34125450.0	0.0	36-150	54.0	27.737120135628114	147.14499852749194	pass	pass	pass	pass	warn	warn	pass	warn	fail	pass	pass
M_1_39_2	M_1_39_2.fq.gz	Conventional base calls	Sanger / Illumina 1.9	34125450.0	0.0	36-150	54.0	26.29814720549435	147.09357798944777	pass	pass	pass	pass	warn	warn	pass	warn	fail	pass	pass
M_1_3_1	M_1_3_1.fq.gz	Conventional base calls	Sanger / Illumina 1.9	43686643.0	0.0	36-150	54.0	29.337008676709143	146.3383520450404	pass	pass	warn	pass	warn	pass	pass	warn	fail	pass	pass
M_1_3_2	M_1_3_2.fq.gz	Conventional base calls	Sanger / Illumina 1.9	43686643.0	0.0	36-150	55.0	27.388251114410345	146.79495590906356	pass	pass	pass	pass	warn	pass	pass	warn	fail	pass	pass
M_1_40_1	M_1_40_1.fq.gz	Conventional base calls	Sanger / Illumina 1.9	33586657.0	0.0	36-150	53.0	26.527845563355886	146.11843250729	pass	pass	pass	pass	fail	fail	pass	warn	fail	warn	pass
M_1_40_2	M_1_40_2.fq.gz	Conventional base calls	Sanger / Illumina 1.9	33586657.0	0.0	36-150	53.0	26.93633969860484	146.14940099575853	pass	pass	pass	pass	warn	warn	pass	warn	fail	warn	pass
M_1_41_1	M_1_41_1.fq.gz	Conventional base calls	Sanger / Illumina 1.9	32695843.0	0.0	36-150	53.0	33.75525297445035	143.72902166798391	pass	pass	fail	pass	warn	fail	pass	warn	fail	pass	pass
M_1_41_2	M_1_41_2.fq.gz	Conventional base calls	Sanger / Illumina 1.9	32695843.0	0.0	36-150	54.0	33.114207239209726	144.79533560275536	pass	pass	warn	pass	warn	warn	pass	warn	fail	warn	pass
M_1_42_1	M_1_42_1.fq.gz	Conventional base calls	Sanger / Illumina 1.9	37720180.0	0.0	36-150	54.0	36.67661092578153	144.29012730055902	pass	pass	fail	pass	warn	fail	pass	warn	fail	pass	pass
M_1_42_2	M_1_42_2.fq.gz	Conventional base calls	Sanger / Illumina 1.9	37720180.0	0.0	36-150	54.0	36.86171466026864	144.90919987656474	pass	pass	warn	pass	warn	fail	pass	warn	fail	warn	pass
M_1_43_1	M_1_43_1.fq.gz	Conventional base calls	Sanger / Illumina 1.9	39231615.0	0.0	36-150	54.0	32.164049959366636	144.9874521352231	pass	pass	fail	pass	warn	warn	pass	warn	fail	pass	pass
M_1_43_2	M_1_43_2.fq.gz	Conventional base calls	Sanger / Illumina 1.9	39231615.0	0.0	36-150	54.0	31.86777104031545	145.58418015674349	pass	pass	warn	pass	warn	warn	pass	warn	fail	warn	pass
M_1_44_1	M_1_44_1.fq.gz	Conventional base calls	Sanger / Illumina 1.9	40998769.0	0.0	36-150	53.0	30.021400653882562	144.82764214213358	pass	pass	warn	pass	warn	warn	pass	warn	fail	pass	pass
M_1_44_2	M_1_44_2.fq.gz	Conventional base calls	Sanger / Illumina 1.9	40998769.0	0.0	36-150	54.0	28.726425387625103	145.88787251148932	pass	pass	pass	pass	warn	warn	pass	warn	fail	pass	pass
M_1_45_1	M_1_45_1.fq.gz	Conventional base calls	Sanger / Illumina 1.9	38471361.0	0.0	36-150	53.0	32.92115351204332	145.0409410782218	pass	pass	warn	pass	warn	warn	pass	warn	fail	pass	pass
M_1_45_2	M_1_45_2.fq.gz	Conventional base calls	Sanger / Illumina 1.9	38471361.0	0.0	36-150	53.0	30.973001219248108	146.07976666071158	pass	pass	pass	pass	warn	warn	pass	warn	fail	warn	pass
M_1_46_1	M_1_46_1.fq.gz	Conventional base calls	Sanger / Illumina 1.9	33016318.0	0.0	36-150	54.0	34.170419396235395	145.566244576394	pass	pass	fail	pass	warn	warn	pass	warn	fail	pass	pass
M_1_46_2	M_1_46_2.fq.gz	Conventional base calls	Sanger / Illumina 1.9	33016318.0	0.0	36-150	54.0	32.84921160615543	146.22233236304544	pass	pass	warn	pass	warn	warn	pass	warn	fail	pass	pass
M_1_47_1	M_1_47_1.fq.gz	Conventional base calls	Sanger / Illumina 1.9	42236354.0	0.0	36-150	54.0	32.568639904370464	145.47103310574582	pass	pass	warn	pass	warn	warn	pass	warn	fail	pass	pass
M_1_47_2	M_1_47_2.fq.gz	Conventional base calls	Sanger / Illumina 1.9	42236354.0	0.0	36-150	54.0	29.922697866986507	146.33618640472613	pass	pass	pass	pass	warn	warn	pass	warn	fail	warn	pass
M_1_48_1	M_1_48_1.fq.gz	Conventional base calls	Sanger / Illumina 1.9	42415127.0	0.0	36-150	54.0	34.23301317022195	145.52009869026207	pass	pass	fail	pass	warn	warn	pass	warn	fail	pass	pass
M_1_48_2	M_1_48_2.fq.gz	Conventional base calls	Sanger / Illumina 1.9	42415127.0	0.0	36-150	54.0	32.72967209464432	145.93460248274158	pass	pass	warn	pass	warn	warn	pass	warn	fail	pass	pass
M_1_49_1	M_1_49_1.fq.gz	Conventional base calls	Sanger / Illumina 1.9	37882736.0	0.0	36-150	54.0	36.5569421727338	145.81519647894493	pass	pass	fail	pass	warn	warn	pass	warn	fail	pass	pass
M_1_49_2	M_1_49_2.fq.gz	Conventional base calls	Sanger / Illumina 1.9	37882736.0	0.0	36-150	55.0	34.561766755491924	146.34354261001633	pass	pass	warn	pass	warn	warn	pass	warn	fail	pass	pass
M_1_4_1	M_1_4_1.fq.gz	Conventional base calls	Sanger / Illumina 1.9	32266201.0	0.0	36-150	54.0	30.101299881645854	147.0192771067161	pass	pass	pass	pass	warn	warn	pass	warn	fail	pass	pass
M_1_4_2	M_1_4_2.fq.gz	Conventional base calls	Sanger / Illumina 1.9	32266201.0	0.0	36-150	54.0	30.58045591050249	147.09879080589624	pass	pass	pass	pass	warn	warn	pass	warn	fail	warn	pass
M_1_50_1	M_1_50_1.fq.gz	Conventional base calls	Sanger / Illumina 1.9	31352155.0	0.0	36-150	55.0	41.000579253938014	145.56594250060323	pass	pass	fail	pass	warn	warn	pass	warn	fail	pass	pass
M_1_50_2	M_1_50_2.fq.gz	Conventional base calls	Sanger / Illumina 1.9	31352155.0	0.0	36-150	55.0	39.345177161803974	145.99580233001527	pass	pass	warn	pass	warn	warn	pass	warn	fail	pass	pass
M_1_51_1	M_1_51_1.fq.gz	Conventional base calls	Sanger / Illumina 1.9	36540448.0	0.0	36-150	54.0	35.63327625584414	146.31975223730151	pass	pass	fail	pass	warn	warn	pass	warn	fail	pass	pass
M_1_51_2	M_1_51_2.fq.gz	Conventional base calls	Sanger / Illumina 1.9	36540448.0	0.0	36-150	55.0	34.06772628767814	146.09183694190065	pass	pass	pass	pass	warn	warn	pass	warn	fail	pass	pass
M_1_52_1	M_1_52_1.fq.gz	Conventional base calls	Sanger / Illumina 1.9	33156863.0	0.0	36-150	54.0	32.05072030219861	145.64776296840867	pass	pass	fail	pass	warn	fail	pass	warn	fail	pass	pass
M_1_52_2	M_1_52_2.fq.gz	Conventional base calls	Sanger / Illumina 1.9	33156863.0	0.0	36-150	55.0	32.17021963871493	145.80632214814773	pass	pass	pass	pass	warn	warn	pass	warn	fail	pass	pass
M_1_53_1	M_1_53_1.fq.gz	Conventional base calls	Sanger / Illumina 1.9	31783532.0	0.0	36-150	54.0	21.991783359449865	143.51051255096507	pass	pass	fail	pass	warn	fail	pass	warn	fail	warn	pass
M_1_53_2	M_1_53_2.fq.gz	Conventional base calls	Sanger / Illumina 1.9	31783532.0	0.0	36-150	54.0	23.31096962281534	143.58743203870483	pass	pass	pass	pass	warn	fail	pass	warn	fail	warn	pass
M_1_54_1	M_1_54_1.fq.gz	Conventional base calls	Sanger / Illumina 1.9	32108120.0	0.0	36-150	54.0	32.612311219039505	145.41822881563917	pass	pass	fail	pass	warn	warn	pass	warn	fail	pass	pass
M_1_54_2	M_1_54_2.fq.gz	Conventional base calls	Sanger / Illumina 1.9	32108120.0	0.0	36-150	54.0	32.35452001222843	145.4793439167413	pass	pass	pass	pass	warn	warn	pass	warn	fail	warn	pass
M_1_55_1	M_1_55_1.fq.gz	Conventional base calls	Sanger / Illumina 1.9	35382566.0	0.0	36-150	53.0	33.510644928073575	144.71708812752587	pass	pass	fail	pass	warn	warn	pass	warn	fail	pass	pass
M_1_55_2	M_1_55_2.fq.gz	Conventional base calls	Sanger / Illumina 1.9	35382566.0	0.0	36-150	53.0	33.29947335248887	145.08678423718618	pass	pass	warn	pass	warn	warn	pass	warn	fail	warn	pass
M_1_56_1	M_1_56_1.fq.gz	Conventional base calls	Sanger / Illumina 1.9	29600501.0	0.0	36-150	53.0	32.13237839242784	144.63874770227707	pass	pass	fail	pass	warn	warn	pass	warn	fail	pass	pass
M_1_56_2	M_1_56_2.fq.gz	Conventional base calls	Sanger / Illumina 1.9	29600501.0	0.0	36-150	53.0	30.72232794938361	145.83154136478973	pass	pass	warn	pass	warn	warn	pass	warn	fail	pass	pass
M_1_57_1	M_1_57_1.fq.gz	Conventional base calls	Sanger / Illumina 1.9	39277843.0	0.0	36-150	55.0	27.344828173384865	145.5287477217117	pass	pass	fail	pass	warn	warn	pass	warn	fail	pass	pass
M_1_57_2	M_1_57_2.fq.gz	Conventional base calls	Sanger / Illumina 1.9	39277843.0	0.0	36-150	55.0	28.212334776566767	145.64048784450816	pass	pass	pass	pass	warn	warn	pass	warn	fail	warn	pass
M_1_58_1	M_1_58_1.fq.gz	Conventional base calls	Sanger / Illumina 1.9	38945294.0	0.0	36-150	55.0	31.177592758961275	145.52833502810378	pass	pass	fail	pass	warn	fail	pass	warn	fail	pass	pass
M_1_58_2	M_1_58_2.fq.gz	Conventional base calls	Sanger / Illumina 1.9	38945294.0	0.0	36-150	55.0	31.38551580279443	145.65608078347026	pass	pass	pass	pass	warn	warn	pass	warn	fail	warn	pass
M_1_59_1	M_1_59_1.fq.gz	Conventional base calls	Sanger / Illumina 1.9	34534562.0	0.0	36-150	54.0	37.80885401157925	146.6058717930171	pass	pass	fail	pass	warn	warn	pass	warn	fail	pass	pass
M_1_59_2	M_1_59_2.fq.gz	Conventional base calls	Sanger / Illumina 1.9	34534562.0	0.0	36-150	55.0	38.89106623643788	145.99313282154844	pass	pass	pass	pass	warn	warn	pass	warn	fail	warn	pass
M_1_5_1	M_1_5_1.fq.gz	Conventional base calls	Sanger / Illumina 1.9	32346313.0	0.0	36-150	54.0	30.970068023351555	147.04345419522775	pass	pass	pass	pass	warn	warn	pass	warn	fail	pass	pass
M_1_5_2	M_1_5_2.fq.gz	Conventional base calls	Sanger / Illumina 1.9	32346313.0	0.0	36-150	55.0	30.75108065243688	147.19641441050794	pass	pass	pass	pass	warn	pass	pass	warn	fail	warn	pass
M_1_60_1	M_1_60_1.fq.gz	Conventional base calls	Sanger / Illumina 1.9	36611346.0	0.0	36-150	55.0	38.49876979628765	146.4586910571384	pass	pass	fail	pass	warn	warn	pass	warn	fail	pass	pass
M_1_60_2	M_1_60_2.fq.gz	Conventional base calls	Sanger / Illumina 1.9	36611346.0	0.0	36-150	55.0	38.336080719208354	146.40328626541074	pass	pass	pass	pass	warn	warn	pass	warn	fail	warn	pass
M_1_61_1	M_1_61_1.fq.gz	Conventional base calls	Sanger / Illumina 1.9	40173232.0	0.0	36-150	55.0	36.81728587198354	146.2362360090918	pass	pass	fail	pass	warn	fail	pass	warn	fail	pass	pass
M_1_61_2	M_1_61_2.fq.gz	Conventional base calls	Sanger / Illumina 1.9	40173232.0	0.0	36-150	55.0	36.70392585549527	146.5199768841103	pass	pass	pass	pass	warn	warn	pass	warn	fail	warn	pass
M_1_62_1	M_1_62_1.fq.gz	Conventional base calls	Sanger / Illumina 1.9	38236170.0	0.0	36-150	55.0	38.070334958056165	146.52613881045093	pass	pass	fail	pass	warn	warn	pass	warn	fail	pass	pass
M_1_62_2	M_1_62_2.fq.gz	Conventional base calls	Sanger / Illumina 1.9	38236170.0	0.0	36-150	55.0	37.77761029429137	146.66105862590317	pass	pass	pass	pass	warn	warn	pass	warn	fail	pass	pass
M_1_63_1	M_1_63_1.fq.gz	Conventional base calls	Sanger / Illumina 1.9	35417288.0	0.0	36-150	55.0	38.64404605249507	146.56082763875088	pass	pass	fail	pass	warn	warn	pass	warn	fail	pass	pass
M_1_63_2	M_1_63_2.fq.gz	Conventional base calls	Sanger / Illumina 1.9	35417288.0	0.0	36-150	55.0	38.162623789369796	146.56577652134177	pass	pass	pass	pass	warn	warn	pass	warn	fail	pass	pass
M_1_65_1	M_1_65_1.fq.gz	Conventional base calls	Sanger / Illumina 1.9	43686725.0	0.0	36-150	54.0	26.555283116477884	146.7919309584319	pass	pass	fail	pass	warn	warn	pass	warn	fail	pass	pass
M_1_65_2	M_1_65_2.fq.gz	Conventional base calls	Sanger / Illumina 1.9	43686725.0	0.0	36-150	54.0	28.52569986852404	146.7068027415651	pass	pass	pass	pass	warn	warn	pass	warn	fail	pass	pass
M_1_66_1	M_1_66_1.fq.gz	Conventional base calls	Sanger / Illumina 1.9	40602787.0	0.0	36-150	53.0	27.186777136737465	146.34173348740813	pass	pass	fail	pass	warn	warn	pass	warn	fail	pass	pass
M_1_66_2	M_1_66_2.fq.gz	Conventional base calls	Sanger / Illumina 1.9	40602787.0	0.0	36-150	54.0	28.20157219766322	146.7374647459545	pass	pass	pass	pass	warn	warn	pass	warn	fail	warn	pass
M_1_67_1	M_1_67_1.fq.gz	Conventional base calls	Sanger / Illumina 1.9	42568579.0	0.0	36-150	54.0	23.86566201396102	146.62546746040078	pass	pass	fail	pass	warn	warn	pass	warn	fail	pass	pass
M_1_67_2	M_1_67_2.fq.gz	Conventional base calls	Sanger / Illumina 1.9	42568579.0	0.0	36-150	54.0	25.033613749435812	147.03072294238433	pass	pass	pass	pass	warn	warn	pass	warn	fail	warn	pass
M_1_68_1	M_1_68_1.fq.gz	Conventional base calls	Sanger / Illumina 1.9	32557731.0	0.0	36-150	54.0	25.742430771937286	146.6178385404069	pass	pass	fail	pass	warn	warn	pass	warn	fail	pass	pass
M_1_68_2	M_1_68_2.fq.gz	Conventional base calls	Sanger / Illumina 1.9	32557731.0	0.0	36-150	55.0	26.58505403278855	147.01716778113314	pass	pass	pass	pass	warn	warn	pass	warn	fail	warn	pass
M_1_69_1	M_1_69_1.fq.gz	Conventional base calls	Sanger / Illumina 1.9	44179899.0	0.0	36-150	53.0	26.137662958452097	146.86523792188842	pass	pass	fail	pass	warn	warn	pass	warn	fail	pass	pass
M_1_69_2	M_1_69_2.fq.gz	Conventional base calls	Sanger / Illumina 1.9	44179899.0	0.0	36-150	54.0	26.630882445039123	147.02777401098177	pass	pass	pass	pass	warn	warn	pass	warn	fail	warn	pass
M_1_6_1	M_1_6_1.fq.gz	Conventional base calls	Sanger / Illumina 1.9	30010152.0	0.0	36-150	54.0	30.929006543837527	146.9375560976832	pass	pass	pass	pass	warn	warn	pass	warn	fail	pass	pass
M_1_6_2	M_1_6_2.fq.gz	Conventional base calls	Sanger / Illumina 1.9	30010152.0	0.0	36-150	55.0	31.22681311929672	146.6511406540027	pass	pass	pass	pass	warn	warn	pass	warn	fail	warn	pass
M_1_70_1	M_1_70_1.fq.gz	Conventional base calls	Sanger / Illumina 1.9	33663002.0	0.0	36-150	54.0	34.60140111865847	146.818048966637	pass	pass	fail	pass	warn	warn	pass	warn	fail	pass	pass
M_1_70_2	M_1_70_2.fq.gz	Conventional base calls	Sanger / Illumina 1.9	33663002.0	0.0	36-150	54.0	34.67701044639832	146.90540302971198	pass	pass	pass	pass	warn	warn	pass	warn	fail	warn	pass
M_1_71_1	M_1_71_1.fq.gz	Conventional base calls	Sanger / Illumina 1.9	41158094.0	0.0	36-150	55.0	34.57520420192049	146.9481415733197	pass	pass	fail	pass	warn	warn	pass	warn	fail	pass	pass
M_1_71_2	M_1_71_2.fq.gz	Conventional base calls	Sanger / Illumina 1.9	41158094.0	0.0	36-150	55.0	35.88072632848678	146.2859387511968	pass	pass	pass	pass	warn	warn	pass	warn	fail	warn	pass
M_1_72_1	M_1_72_1.fq.gz	Conventional base calls	Sanger / Illumina 1.9	42433148.0	0.0	36-150	54.0	35.240176171299176	146.65908543952477	pass	pass	fail	pass	warn	warn	pass	warn	fail	pass	pass
M_1_72_2	M_1_72_2.fq.gz	Conventional base calls	Sanger / Illumina 1.9	42433148.0	0.0	36-150	54.0	34.765754032035865	146.81239963624665	pass	pass	pass	pass	warn	warn	pass	warn	fail	warn	pass
M_1_73_1	M_1_73_1.fq.gz	Conventional base calls	Sanger / Illumina 1.9	45725263.0	0.0	36-150	54.0	35.83450621492468	146.83408010140914	pass	pass	fail	pass	warn	warn	pass	warn	fail	pass	pass
M_1_73_2	M_1_73_2.fq.gz	Conventional base calls	Sanger / Illumina 1.9	45725263.0	0.0	36-150	55.0	35.37985156894069	146.7693826277172	pass	pass	pass	pass	warn	warn	pass	warn	fail	warn	pass
M_1_74_1	M_1_74_1.fq.gz	Conventional base calls	Sanger / Illumina 1.9	41006115.0	0.0	36-150	54.0	36.331632432263206	146.5993625341001	pass	pass	fail	pass	warn	warn	pass	warn	fail	pass	pass
M_1_74_2	M_1_74_2.fq.gz	Conventional base calls	Sanger / Illumina 1.9	41006115.0	0.0	36-150	54.0	35.36566782307446	147.009586887224	pass	pass	pass	pass	warn	warn	pass	warn	fail	pass	pass
M_1_75_1	M_1_75_1.fq.gz	Conventional base calls	Sanger / Illumina 1.9	39826971.0	0.0	36-150	53.0	25.16385206150798	146.0771786787401	pass	pass	fail	pass	warn	fail	pass	warn	fail	pass	pass
M_1_75_2	M_1_75_2.fq.gz	Conventional base calls	Sanger / Illumina 1.9	39826971.0	0.0	36-150	53.0	24.994061537480405	147.03463451940647	pass	pass	fail	pass	warn	warn	pass	warn	fail	warn	pass
M_1_76_1	M_1_76_1.fq.gz	Conventional base calls	Sanger / Illumina 1.9	36915441.0	0.0	36-150	54.0	23.04078153920305	146.8096827016099	pass	pass	fail	pass	fail	warn	pass	warn	fail	warn	pass
M_1_76_2	M_1_76_2.fq.gz	Conventional base calls	Sanger / Illumina 1.9	36915441.0	0.0	36-150	54.0	24.492693827649997	147.22002727801626	pass	pass	pass	pass	warn	pass	pass	warn	fail	warn	pass
M_1_77_1	M_1_77_1.fq.gz	Conventional base calls	Sanger / Illumina 1.9	44583108.0	0.0	36-150	54.0	24.290206067563336	146.99175138260887	pass	pass	fail	pass	warn	warn	pass	warn	fail	pass	pass
M_1_77_2	M_1_77_2.fq.gz	Conventional base calls	Sanger / Illumina 1.9	44583108.0	0.0	36-150	55.0	25.543136764430773	147.20466296338066	pass	pass	pass	pass	warn	pass	pass	warn	fail	pass	pass
M_1_78_1	M_1_78_1.fq.gz	Conventional base calls	Sanger / Illumina 1.9	37906236.0	0.0	36-150	54.0	25.59372024335291	147.04716532657054	pass	pass	fail	pass	warn	warn	pass	warn	fail	pass	pass
M_1_78_2	M_1_78_2.fq.gz	Conventional base calls	Sanger / Illumina 1.9	37906236.0	0.0	36-150	55.0	27.38514671569194	146.97895443905324	pass	pass	pass	pass	warn	pass	pass	warn	fail	warn	pass
M_1_79_1	M_1_79_1.fq.gz	Conventional base calls	Sanger / Illumina 1.9	42738226.0	0.0	36-150	54.0	23.571546192184158	146.94245486464507	pass	pass	fail	pass	warn	warn	pass	warn	fail	pass	pass
M_1_79_2	M_1_79_2.fq.gz	Conventional base calls	Sanger / Illumina 1.9	42738226.0	0.0	36-150	55.0	24.735669871980424	147.10827414783196	pass	pass	pass	pass	warn	warn	pass	warn	fail	warn	pass
M_1_7_1	M_1_7_1.fq.gz	Conventional base calls	Sanger / Illumina 1.9	36477291.0	0.0	36-150	54.0	28.248795485702605	147.57683644873737	pass	pass	pass	pass	warn	pass	pass	warn	fail	pass	pass
M_1_7_2	M_1_7_2.fq.gz	Conventional base calls	Sanger / Illumina 1.9	36477291.0	0.0	36-150	55.0	28.213627561231995	146.964319801051	pass	pass	pass	pass	warn	pass	pass	warn	fail	warn	pass
M_1_80_1	M_1_80_1.fq.gz	Conventional base calls	Sanger / Illumina 1.9	40427567.0	0.0	36-150	55.0	30.162940263113036	146.75879176701383	pass	pass	fail	pass	warn	pass	pass	warn	fail	pass	pass
M_1_80_2	M_1_80_2.fq.gz	Conventional base calls	Sanger / Illumina 1.9	40427567.0	0.0	36-150	55.0	31.275833757745353	146.83334913525715	pass	pass	pass	pass	warn	warn	pass	warn	fail	warn	pass
M_1_81_1	M_1_81_1.fq.gz	Conventional base calls	Sanger / Illumina 1.9	29741972.0	0.0	36-150	55.0	30.33270983461531	147.08504621011681	pass	pass	fail	pass	warn	warn	pass	warn	fail	pass	pass
M_1_81_2	M_1_81_2.fq.gz	Conventional base calls	Sanger / Illumina 1.9	29741972.0	0.0	36-150	55.0	31.547860664867056	147.05715007733852	pass	pass	pass	pass	warn	pass	pass	warn	fail	pass	pass
M_1_82_1	M_1_82_1.fq.gz	Conventional base calls	Sanger / Illumina 1.9	46130360.0	0.0	36-150	53.0	34.88261329211478	146.19505191375052	pass	pass	fail	pass	warn	warn	pass	warn	fail	pass	pass
M_1_82_2	M_1_82_2.fq.gz	Conventional base calls	Sanger / Illumina 1.9	46130360.0	0.0	36-150	54.0	34.48075362909624	146.53270813407917	pass	pass	pass	pass	warn	warn	pass	warn	fail	warn	pass
M_1_83_1	M_1_83_1.fq.gz	Conventional base calls	Sanger / Illumina 1.9	39697516.0	0.0	36-150	54.0	34.11952373639006	146.2903626262157	pass	pass	fail	pass	warn	warn	pass	warn	fail	pass	pass
M_1_83_2	M_1_83_2.fq.gz	Conventional base calls	Sanger / Illumina 1.9	39697516.0	0.0	36-150	54.0	34.67835686617106	146.55135568180134	pass	pass	pass	pass	warn	warn	pass	warn	fail	pass	pass
M_1_84_1	M_1_84_1.fq.gz	Conventional base calls	Sanger / Illumina 1.9	49542111.0	0.0	36-150	54.0	31.263113588965613	146.6535417112121	pass	pass	fail	pass	warn	warn	pass	warn	fail	pass	pass
M_1_84_2	M_1_84_2.fq.gz	Conventional base calls	Sanger / Illumina 1.9	49542111.0	0.0	36-150	54.0	31.107959717370033	146.94960555879422	pass	pass	pass	pass	warn	warn	pass	warn	fail	pass	pass
M_1_85_1	M_1_85_1.fq.gz	Conventional base calls	Sanger / Illumina 1.9	42976237.0	0.0	36-150	53.0	36.85704822247597	145.94503972043898	pass	pass	fail	pass	warn	warn	pass	warn	fail	pass	pass
M_1_85_2	M_1_85_2.fq.gz	Conventional base calls	Sanger / Illumina 1.9	42976237.0	0.0	36-150	53.0	36.52683112527403	146.3142413562174	pass	pass	pass	pass	warn	warn	pass	warn	fail	pass	pass
M_1_86_1	M_1_86_1.fq.gz	Conventional base calls	Sanger / Illumina 1.9	42844896.0	0.0	36-150	53.0	34.580679369642134	146.1387906508164	pass	pass	fail	pass	warn	warn	pass	warn	fail	pass	pass
M_1_86_2	M_1_86_2.fq.gz	Conventional base calls	Sanger / Illumina 1.9	42844896.0	0.0	36-150	54.0	34.00239783179734	146.6165309398814	pass	pass	pass	pass	warn	warn	pass	warn	fail	pass	pass
M_1_87_1	M_1_87_1.fq.gz	Conventional base calls	Sanger / Illumina 1.9	37404490.0	0.0	36-150	54.0	38.18005070252598	146.4433975974542	pass	pass	fail	pass	warn	warn	pass	warn	fail	pass	pass
M_1_87_2	M_1_87_2.fq.gz	Conventional base calls	Sanger / Illumina 1.9	37404490.0	0.0	36-150	54.0	38.28759657067849	146.23209071959008	pass	pass	pass	pass	warn	warn	pass	warn	fail	warn	pass
M_1_88_1	M_1_88_1.fq.gz	Conventional base calls	Sanger / Illumina 1.9	34722099.0	0.0	36-150	54.0	35.09010234232275	145.01989427540082	pass	pass	warn	pass	warn	warn	pass	warn	fail	pass	pass
M_1_88_2	M_1_88_2.fq.gz	Conventional base calls	Sanger / Illumina 1.9	34722099.0	0.0	36-150	54.0	34.58032671960593	145.80483936181392	pass	pass	pass	pass	warn	warn	pass	warn	fail	pass	pass
M_1_89_1	M_1_89_1.fq.gz	Conventional base calls	Sanger / Illumina 1.9	33845645.0	0.0	36-150	54.0	38.23117600696288	146.17103009855478	pass	pass	pass	pass	warn	warn	pass	warn	fail	pass	pass
M_1_89_2	M_1_89_2.fq.gz	Conventional base calls	Sanger / Illumina 1.9	33845645.0	0.0	36-150	54.0	36.07328274856378	146.58518651365634	pass	pass	pass	pass	warn	warn	pass	warn	fail	pass	pass
M_1_8_1	M_1_8_1.fq.gz	Conventional base calls	Sanger / Illumina 1.9	29307456.0	0.0	36-150	53.0	31.95596782159062	146.87098648207473	pass	pass	pass	pass	warn	pass	pass	warn	fail	pass	pass
M_1_8_2	M_1_8_2.fq.gz	Conventional base calls	Sanger / Illumina 1.9	29307456.0	0.0	36-150	54.0	31.495096098959525	147.07186669494615	pass	pass	pass	pass	warn	pass	pass	warn	fail	warn	pass
M_1_90_1	M_1_90_1.fq.gz	Conventional base calls	Sanger / Illumina 1.9	35596011.0	0.0	36-150	54.0	35.23115969824083	145.69902672521368	pass	pass	warn	pass	warn	warn	pass	warn	fail	pass	pass
M_1_90_2	M_1_90_2.fq.gz	Conventional base calls	Sanger / Illumina 1.9	35596011.0	0.0	36-150	54.0	33.823367341615146	145.9119828061633	pass	pass	pass	pass	warn	warn	pass	warn	fail	pass	pass
M_1_91_1	M_1_91_1.fq.gz	Conventional base calls	Sanger / Illumina 1.9	45241708.0	0.0	36-150	54.0	32.7998656892582	145.83468643579945	pass	pass	pass	pass	warn	warn	pass	warn	fail	pass	pass
M_1_91_2	M_1_91_2.fq.gz	Conventional base calls	Sanger / Illumina 1.9	45241708.0	0.0	36-150	54.0	31.50416108413988	146.30474645210123	pass	pass	pass	pass	warn	warn	pass	warn	fail	pass	pass
M_1_92_1	M_1_92_1.fq.gz	Conventional base calls	Sanger / Illumina 1.9	30195112.0	0.0	36-150	54.0	39.033877488216554	145.7807567661945	pass	pass	pass	pass	warn	warn	pass	warn	fail	pass	pass
M_1_92_2	M_1_92_2.fq.gz	Conventional base calls	Sanger / Illumina 1.9	30195112.0	0.0	36-150	54.0	38.46719116073214	145.82900033621337	pass	pass	pass	pass	warn	warn	pass	warn	fail	pass	pass
M_1_93_1	M_1_93_1.fq.gz	Conventional base calls	Sanger / Illumina 1.9	31386656.0	0.0	36-150	54.0	38.21054628748025	145.51882822432566	pass	pass	pass	pass	warn	warn	pass	warn	fail	pass	pass
M_1_93_2	M_1_93_2.fq.gz	Conventional base calls	Sanger / Illumina 1.9	31386656.0	0.0	36-150	54.0	37.54331780610393	145.77630251531096	pass	pass	pass	pass	warn	warn	pass	warn	fail	pass	pass
M_1_94_1	M_1_94_1.fq.gz	Conventional base calls	Sanger / Illumina 1.9	30646802.0	0.0	36-150	55.0	33.65178876243809	146.49788222601498	pass	pass	pass	pass	warn	warn	pass	warn	fail	pass	pass
M_1_94_2	M_1_94_2.fq.gz	Conventional base calls	Sanger / Illumina 1.9	30646802.0	0.0	36-150	55.0	33.51539906277098	145.89987836251234	pass	pass	pass	pass	warn	warn	pass	warn	fail	pass	pass
M_1_95_1	M_1_95_1.fq.gz	Conventional base calls	Sanger / Illumina 1.9	35370377.0	0.0	36-150	54.0	35.600343649551434	145.98866938851117	pass	pass	pass	pass	warn	warn	pass	warn	fail	pass	pass
M_1_95_2	M_1_95_2.fq.gz	Conventional base calls	Sanger / Illumina 1.9	35370377.0	0.0	36-150	54.0	35.15700521649098	145.86737102067076	pass	pass	pass	pass	warn	warn	pass	warn	fail	pass	pass
M_1_96_1	M_1_96_1.fq.gz	Conventional base calls	Sanger / Illumina 1.9	33585607.0	0.0	36-150	53.0	35.72791477851349	146.08325313280776	pass	pass	pass	pass	warn	warn	pass	warn	fail	pass	pass
M_1_96_2	M_1_96_2.fq.gz	Conventional base calls	Sanger / Illumina 1.9	33585607.0	0.0	36-150	54.0	35.25188008404182	146.08511428720047	pass	pass	pass	pass	warn	warn	pass	warn	fail	pass	pass
M_1_9_1	M_1_9_1.fq.gz	Conventional base calls	Sanger / Illumina 1.9	30124493.0	0.0	36-150	54.0	29.116453272609004	147.07851298941364	pass	pass	pass	pass	warn	pass	pass	warn	fail	pass	pass
M_1_9_2	M_1_9_2.fq.gz	Conventional base calls	Sanger / Illumina 1.9	30124493.0	0.0	36-150	55.0	27.98514859940705	147.3379485258059	pass	pass	pass	pass	warn	pass	pass	warn	fail	pass	pass
