GeneID	HOG	OG	Gene Tree Parent Clade	A_agrestis_oxf	A_filiculoides	A_thaliana	B_distachyon	C_braunii	C_melkonianii	C_reinhardtii	Closterium_sp_NIES_67	K_nitens	M_endlicherianum	M_polymorpha	M_viride	O_lucimarinus	O_sativa	P_coloniale	P_margaritaceum	P_patens	S_lycopersicum	S_moellendorffii	S_muscicola	Z_circumcarinatum_SAG698_1a	Z_circumcarinatum_SAG698_1b	Z_circumcarinatum_UTEX1559	Z_circumcarinatum_UTEX1560	Z_mays
Pp3c14_1450	N0.HOG0004922	OG0003783	n0	AagrOXF_evm.TU.utg000007l.41, AagrOXF_evm.TU.utg000084l.149	Azfi_s0027.g023562, Azfi_s0121.g046904, Azfi_s0896.g091564	AT4G34840, AT4G38800	Bradi1g51720	CBR_g20180	Chrsp234S00257	Cre03.g162550_4532	CLOP_g2227	6595	Me1_v2_0139830	Mp2g12780	NA	Olucimarinus_26221	LOC_Os06g02220	PRCOL_00006969_RA	pm001401g0010, pm000880g0030, pm000530g0010, pm000004g0010	Pp3c1_20870, Pp3c26_5320, Pp3c14_1450	Solyc01g111060	98535	SM000096S24845, SM000020S05980, SM000153S01615	Zci1a_14119	Zci_02136	UTEX1559_07771	UTEX1560_10313	Zm00001d031621, Zm00001d049823
Pp3c16_8630	N0.HOG0006140	OG0004904	n0	AagrOXF_evm.TU.utg000002l.63	Azfi_s0377.g067310	AT2G29630	Bradi1g12550	CBR_g30996	Chrsp10S00052	Cre05.g240850_4532	CLOP_g21779	9531	Me1_v2_0086530, Me1_v2_0061630	Mp5g00080	2368, 2369	NA	LOC_Os03g47610	NA	pm005719g0050, pm008098g0010, pm250007g0010	Pp3c25_5720, Pp3c16_8630	Solyc06g006080	120890, 152730	SM000017S02779, SM000033S12372, SM000285S10800	Zci1a_29386, Zci1a_35257	Zci_02465	UTEX1559_07542	UTEX1560_02199	Zm00001d033383
Pp3c24_10800	N0.HOG0003560	OG0002576	n0	AagrOXF_evm.TU.utg000002l.62, AagrOXF_evm.TU.utg000002l.122	Azfi_s0377.g067312	AT5G54770	Bradi1g25860	CBR_g30805	Chrsp37S05481	Cre04.g214150_4532	CLOP_g2566	9530	Me1_v2_0086540	Mp5g00090	2367	NA	LOC_Os07g34570	NA	pm000735g0020, pm199019g0010, pm025081g0020, pm001685g0100, pm009798g0030, pm003182g0040, pm019140g0010, pm003120g0010, pm028800g0010	Pp3c20_13540, Pp3c20_13543, Pp3c20_13770, Pp3c24_10800, Pp3c8_11240, Pp3c23_6580, Pp3c23_6600, Pp3c23_6510	Solyc07g064160	271002	SM000033S12377, SM000017S02789, SM000285S10789, SM002815S10737	Zci1a_29385, Zci1a_35256	NA	UTEX1559_07541	UTEX1560_02198	Zm00001d044228, Zm00001d011183
Pp3c5_4840	N0.HOG0009842	OG0008397	n0	AagrOXF_evm.TU.utg000003l.593	Azfi_s0073.g037242	NA	NA	CBR_g9114	Chrsp26S08869	Cre04.g225750_4532	NA	326	NA	Mp3g14220	27907	Olucimarinus_4044	NA	PRCOL_00003133_RA	NA	Pp3c5_4840, Pp3c6_22340, Pp3c9_24820, Pp3c15_23420, Pp3c14_15540, Pp3c10_18180, Pp3c10_11680	NA	99737, 415743	NA	NA	NA	NA	NA	NA
Pp3c23_6510	N0.HOG0003560	OG0002576	n0	AagrOXF_evm.TU.utg000002l.62, AagrOXF_evm.TU.utg000002l.122	Azfi_s0377.g067312	AT5G54770	Bradi1g25860	CBR_g30805	Chrsp37S05481	Cre04.g214150_4532	CLOP_g2566	9530	Me1_v2_0086540	Mp5g00090	2367	NA	LOC_Os07g34570	NA	pm000735g0020, pm199019g0010, pm025081g0020, pm001685g0100, pm009798g0030, pm003182g0040, pm019140g0010, pm003120g0010, pm028800g0010	Pp3c20_13540, Pp3c20_13543, Pp3c20_13770, Pp3c24_10800, Pp3c8_11240, Pp3c23_6580, Pp3c23_6600, Pp3c23_6510	Solyc07g064160	271002	SM000033S12377, SM000017S02789, SM000285S10789, SM002815S10737	Zci1a_29385, Zci1a_35256	NA	UTEX1559_07541	UTEX1560_02198	Zm00001d044228, Zm00001d011183
Pp3c20_17800	N0.HOG0004759	OG0003643	n0	AagrOXF_evm.TU.utg000077l.388	Azfi_s0329.g065353	AT5G64860	Bradi1g20790	CBR_g16839, CBR_g31505	Chrsp115S00761, Chrsp45S09064, Chrsp64S07177	Cre03.g181500_4532	CLOP_g4076	12875	Me1_v2_0155020	Mp3g00810	9762, 3331, 20393, 20394	Olucimarinus_44779	LOC_Os07g43390	PRCOL_00006523_RA	pm032126g0020, pm032126g0030, pm033760g0010	Pp3c6_28760, Pp3c20_17800, Pp3c8_6000	Solyc04g053120	109836	SM000307S11700, SM000016S01825, SM000108S14248	NA	Zci_08832, Zci_08834	UTEX1559_17667	UTEX1560_18178	Zm00001d022206
Pp3c23_6600	N0.HOG0003560	OG0002576	n0	AagrOXF_evm.TU.utg000002l.62, AagrOXF_evm.TU.utg000002l.122	Azfi_s0377.g067312	AT5G54770	Bradi1g25860	CBR_g30805	Chrsp37S05481	Cre04.g214150_4532	CLOP_g2566	9530	Me1_v2_0086540	Mp5g00090	2367	NA	LOC_Os07g34570	NA	pm000735g0020, pm199019g0010, pm025081g0020, pm001685g0100, pm009798g0030, pm003182g0040, pm019140g0010, pm003120g0010, pm028800g0010	Pp3c20_13540, Pp3c20_13543, Pp3c20_13770, Pp3c24_10800, Pp3c8_11240, Pp3c23_6580, Pp3c23_6600, Pp3c23_6510	Solyc07g064160	271002	SM000033S12377, SM000017S02789, SM000285S10789, SM002815S10737	Zci1a_29385, Zci1a_35256	NA	UTEX1559_07541	UTEX1560_02198	Zm00001d044228, Zm00001d011183
Pp3c15_12980	N0.HOG0000483	OG0000245	n0	AagrOXF_evm.TU.utg000012l.281, AagrOXF_evm.TU.utg000042l.150, AagrOXF_evm.TU.utg000059l.351, AagrOXF_evm.TU.utg000003l.457, AagrOXF_evm.TU.utg000003l.460, AagrOXF_evm.TU.utg000049l.723	Azfi_s0047.g030342, Azfi_s0068.g036292, Azfi_s0272.g061300, Azfi_s0173.g055810, Azfi_s0206.g057843, Azfi_s0206.g057846, Azfi_s0032.g024974, Azfi_s0749.g085086, Azfi_s0070.g036790, Azfi_s1711.g106009, Azfi_s0035.g025703, Azfi_s0035.g025709, Azfi_s0035.g025712, Azfi_s0035.g025715, Azfi_s0035.g025714, Azfi_s0035.g025701, Azfi_s2521.g112009, Azfi_s0011.g012579	AT1G67560, AT1G17420, AT1G72520, AT3G45140, AT3G22400, AT1G55020	Bradi1g72690, Bradi5g11590, Bradi3g07000, Bradi3g07010, Bradi3g39980, Bradi1g09270, Bradi1g09260, Bradi1g11680, Bradi1g11670, Bradi3g59710	CBR_g45631, CBR_g57594, CBR_g16901, CBR_g76811, CBR_g34510, CBR_g34506, CBR_g20158, CBR_g76904	NA	Cre12.g512300_4532	NA	1745, 3925	NA	Mp1g21930, Mp2g20300, Mp8g12930, Mp2g16000, Mp3g06610, Mp5g21680, Mp8g08690, Mp8g01650, Mp8g15570, Mp2g00660, Mp8g09050, Mp2g23370, Mp2g23380, Mp2g12250, Mp2g12180, Mp2g12220	NA	Olucimarinus_46073	LOC_Os02g13480, LOC_Os03g08220, LOC_Os04g37430, LOC_Os02g10120, LOC_Os12g37260, LOC_Os12g37320, LOC_Os12g37350, LOC_Os08g39840, LOC_Os08g39850, LOC_Os02g19790, LOC_Os06g04420, LOC_Os03g49260, LOC_Os03g52860, LOC_Os03g49350, LOC_Os11g36719, LOC_Os03g49380, LOC_Os05g23880	NA	NA	Pp3c3_18720, Pp3c4_10250, Pp3c3_18710, Pp3c12_14480, Pp3c7_26600, Pp3c11_5120, Pp3c14_15340, Pp3c14_10640, Pp3c17_16260, Pp3c1_29300, Pp3c1_29700, Pp3c15_12990, Pp3c15_13020, Pp3c15_12980, Pp3c15_13040	Solyc05g014790, Solyc03g122340, Solyc01g005750.1, Solyc01g006555.1, Solyc12g011033.1, Solyc01g006540, Solyc12g011037.1, Solyc09g075860, Solyc09g075870, Solyc01g099210, Solyc07g022850.1, Solyc01g099200, Solyc08g014000, Solyc01g099150.5, Solyc01g099160, Solyc01g099170, Solyc01g099190, Solyc08g029000, Solyc09g055890, Solyc09g055900	437605, 168576, 170977, 178158, 112468, 112556, 109226, 439120, 446635, 439121, 140773, 268169, 441081, 429044, 402722, 402721	SM000004S15082, SM000045S16207, SM000013S26587, SM003927S15164, SM000179S03412, SM000013S26584, SM000366S13824	NA	NA	NA	NA	Zm00001d027893, Zm00001d025524, Zm00001d003533, Zm00001d053675, Zm00001d015852, Zm00001d031449, Zm00001d002000, Zm00001d042541, Zm00001d042540, Zm00001d033623, Zm00001d033624, Zm00001d013493, Zm00001d041204
Pp3c17_12060	N0.HOG0002885	OG0001995	n0	AagrOXF_evm.TU.utg000083l.251	NA	AT1G78670, AT1G78680, AT1G78660	Bradi2g19700	CBR_g19230	Chrsp21S03311, Chrsp68S07359, Chrsp138S02143	Cre07.g315050_4532, Cre06.g275050_4532	CLOP_g5183, CLOP_g18500, CLOP_g7790, CLOP_g7764	5452, 6688, 4185	Me1_v2_0231040, Me1_v2_0193930	Mp5g13440	21758	NA	LOC_Os05g44130	PRCOL_00000035_RA, PRCOL_00004178_RA	pm016694g0020, pm020360.t1, pm043275g0010, pm005254g0030, pm020067g0010	Pp3c17_12060, Pp3c26_1140	Solyc07g062280, Solyc07g062270, Solyc10g007410	120664, 177157, 109437	SM000375S13734, SM000181S03534, SM000353S13173	Zci1a_19579, Zci1a_09365	Zci_02239, Zci_02791	UTEX1559_06238, UTEX1559_03215	UTEX1560_12484, UTEX1560_05419	Zm00001d010744
Pp3c7_19020	N0.HOG0002785	OG0001911	n0	AagrOXF_evm.TU.utg000063l.143	Azfi_s0185.g056592, Azfi_s0001.g000807, Azfi_s0001.g000906	AT3G19480, AT4G34200, AT1G17745	Bradi1g07400, Bradi5g24220, Bradi3g37240, Bradi1g31270	CBR_g8610, CBR_g3076	Chrsp26S08861	Cre07.g324550_4532, Cre07.g344600_4532	CLOP_g2818	12964	Me1_v2_0074840, Me1_v2_0217270	Mp8g16970	22198, 27676	NA	LOC_Os04g55720, LOC_Os08g34720, LOC_Os06g44460	PRCOL_00002795_RA	pm003233g0010, pm031301g0010	Pp3c7_10960, Pp3c11_15420, Pp3c7_19020, Pp3c1_7910	Solyc10g049890, Solyc03g112070, Solyc03g123830	149626, 267539, 413037, 412486	SM000200S05812, SM000214S06770	Zci1a_32214, Zci1a_44618	Zci_03090	UTEX1559_12943	UTEX1560_05389	Zm00001d026472, Zm00001d002051, Zm00001d032114, Zm00001d046923
Pp3c1_3150	N0.HOG0008103	OG0006764	n0	AagrOXF_evm.TU.utg000002l.541	Azfi_s0245.g059946	AT5G42850	Bradi4g23300	CBR_g40140	Chrsp56S06724	Cre12.g549500_4532, Cre07.g315100_4532	CLOP_g13468	3635	Me1_v2_0207660	NA	NA	NA	LOC_Os06g21550	NA	pm027411g0010, pm001094g0040, pm019855g0030, pm016354g0010	Pp3c1_3150	Solyc10g037980	132775	SM004058S15576, SM015765S01997	Zci1a_11982, Zci1a_33121	Zci_15055	UTEX1559_00669	UTEX1560_17775	NA
Pp3c2_2120	N0.HOG0006876	OG0005606	n0	AagrOXF_evm.TU.utg000008l.172	Azfi_s0208.g058015, Azfi_s0478.g073051	AT5G58330	Bradi3g12460	NA	NA	Cre09.g410700_4532	CLOP_g23247, CLOP_g8572, CLOP_g23248, CLOP_g8452	1986	Me1_v2_0198860	Mp2g04530	NA	Olucimarinus_42336	LOC_Os08g44810	PRCOL_00004283_RA	NA	Pp3c2_2120, Pp3c17_20310, Pp3c14_16940	Solyc11g007990, Solyc03g071590	270710	SM000053S17407, SM000005S17324, SM000091S24638	Zci1a_17076	Zci_06324	UTEX1559_12305	UTEX1560_06850	Zm00001d031899
Pp3c11_24300	N0.HOG0009030	OG0007649	n0	NA	NA	NA	NA	CBR_g50032	Chrsp290S04331	Cre09.g391050_4532	CLOP_g24173, CLOP_g7513	3908	Me1_v2_0070200	NA	5540, 5541	Olucimarinus_29652, Olucimarinus_27258	NA	PRCOL_00003275_RA, PRCOL_00006344_RA	pm002243g0010	Pp3c7_1040, Pp3c11_24300	NA	NA	SM000017S02744, SM000057S18378, SM000082S22865	Zci1a_15115	Zci_08401	UTEX1559_05226	UTEX1560_04439	NA
Pp3c20_3450	N0.HOG0017347	OG0015347	n0	NA	Azfi_s0002.g003621	NA	NA	NA	NA	Cre14.g611650_4532	NA	9499	NA	Mp7g03660	NA	NA	NA	NA	NA	Pp3c20_3450, Pp3c14_20590	NA	NA	NA	NA	NA	NA	NA	NA
Pp3c2_34550	N0.HOG0007074	OG0005797	n0	AagrOXF_evm.TU.utg000091l.709	Azfi_s0469.g072869, Azfi_s1387.g102500	NA	Bradi2g16402	CBR_g31268	NA	NA	CLOP_g1159	5407	Me1_v2_0131380	Mp8g01340	NA	NA	LOC_Os05g49060	NA	pm004309g0040, pm012046g0010, pm024236g0030, pm010624g0030, pm004309.t1	Pp3c2_34550	Solyc02g070800.2	271184	SM000126S26297, SM000111S18817, SM000312S11992	Zci1a_36319, Zci1a_40392, Zci1a_01584	Zci_01643	UTEX1559_13031	UTEX1560_02529	Zm00001d021218, Zm00001d039029, Zm00001d028138
Pp3c13_5460	N0.HOG0001181	OG0000690	n0	AagrOXF_evm.TU.utg000077l.151	Azfi_s0005.g009029, Azfi_s0703.g082642, Azfi_s0045.g029735, Azfi_s0045.g029738, Azfi_s0812.g087839, Azfi_s3058.g114370	AT5G16230, AT3G02610, AT3G02620, AT3G02630, AT5G16240, AT2G43710, AT1G43800	Bradi2g58930, Bradi5g07410, Bradi3g43920, Bradi3g17670, Bradi4g32120, Bradi1g25010, Bradi2g56850	CBR_g38778	Chrsp103S01079	Cre17.g701700_4532, Cre14.g630883_4532, Cre10.g458183_4532	CLOP_g1058, CLOP_g7048, CLOP_g24860	11386, 11380, 5497	Me1_v2_0210470	Mp3g23380, Mp2g21130, Mp2g24510	3486	Olucimarinus_15111	LOC_Os01g69080, LOC_Os04g31070, LOC_Os02g30200, LOC_Os03g30950, LOC_Os01g65830	PRCOL_00005280_RA	pm007705g0010, pm002407g0030, pm003085.t1, pm029434g0010	Pp3c13_5460, Pp3c4_21920, Pp3c12_3090, Pp3c4_9110, Pp3c12_16620, Pp3c10_18380, Pp3c3_28120	Solyc11g008680, Solyc03g063110, Solyc06g053480, Solyc01g009960, Solyc06g054670, Solyc06g059710, Solyc06g059720	411132, 82227, 108612, 231587, 272030	SM000063S20063, SM000033S12345, SM000201S05914	Zci1a_16388	Zci_10274, Zci_05024	UTEX1559_02334, UTEX1559_16055	UTEX1560_15755, UTEX1560_13857	Zm00001d042344, Zm00001d012033, Zm00001d025170, Zm00001d004019, Zm00001d050552, Zm00001d024273, Zm00001d021059, Zm00001d014498, Zm00001d012221
Pp3c22_9570	N0.HOG0002194	OG0001423	n5	AagrOXF_evm.TU.utg000010l.137, AagrOXF_evm.TU.utg000018l.336	Azfi_s0004.g008718	AT1G14660, AT2G01980	Bradi4g00290	NA	NA	NA	CLOP_g22013, CLOP_g14637, CLOP_g12015, CLOP_g12014, CLOP_g14650, CLOP_g22014	1863, 9015, 11726, 9016	Me1_v2_0034250, Me1_v2_0218520, Me1_v2_0218530, Me1_v2_0218510	Mp5g19970, Mp7g05010	NA	NA	LOC_Os12g44360	PRCOL_00005090_RA	pm009299g0020, pm021742g0010, pm006243g0040, pm037693g0010, pm018446g0010, pm005487.t1, pm049939g0010, pm313099g0010, pm001628g0030, pm001178g0010, pm006038g0010, pm031812g0010, pm006038g0020, pm034455g0020	Pp3c22_9570, Pp3c16_14280	Solyc04g018100, Solyc04g018090.2, Solyc01g005020	75049, 74518	NA	Zci1a_23369, Zci1a_23368	Zci_08918	UTEX1559_16750, UTEX1559_16751	UTEX1560_04656, UTEX1560_04657, UTEX1560_04658	Zm00001d031232
Pp3c6_24700	N0.HOG0000946	OG0000527	n54	AagrOXF_evm.TU.utg000063l.507__508, AagrOXF_evm.TU.utg000050l.692	Azfi_s0215.g058376, Azfi_s0015.g013820	AT3G46970, AT3G29320	Bradi2g55120, Bradi1g08070	CBR_g12053	Chrsp33S05080	NA	NA	10273, 15059	Me1_v2_0177850, Me1_v2_0167880	Mp3g02670, Mp1g09490	21280, 21279, 21281	Olucimarinus_25192	LOC_Os01g63270, LOC_Os03g55090	PRCOL_00006748_RA	pm010784g0010, pm001480g0050, pm001596g0040	Pp3c1_12800, Pp3c6_14860, Pp3c6_24700	Solyc09g031970, Solyc05g012510, Solyc03g065340	164611, 184206	SM000004S14954, SM000007S20894, SM000106S13976, SM000035S13126, SM000352S13419	Zci1a_18651, Zci1a_16135	Zci_01042, Zci_02351	UTEX1559_07861, UTEX1559_01170	UTEX1560_04053, UTEX1560_00282	Zm00001d042842, Zm00001d034074
Pp3c17_19720	N0.HOG0000752	OG0000414	n33	AagrOXF_evm.TU.utg000113l.93, AagrOXF_evm.TU.utg000084l.17, AagrOXF_evm.TU.utg000084l.20, AagrOXF_evm.TU.utg000006l.983	Azfi_s0022.g015912, Azfi_s0024.g020323, Azfi_s0449.g070725, Azfi_s3509.g115949	AT5G04895, AT2G01130, AT1G48650, AT2G35920	Bradi1g08607, Bradi2g01360, Bradi3g28477	CBR_g36488	Chrsp175S00141	NA	CLOP_g2689, CLOP_g9815, CLOP_g25157, CLOP_g17039	1154, 12645	Me1_v2_0233820, Me1_v2_0227870	Mp1g27560, Mp6g10050	NA	NA	LOC_Os03g53760, LOC_Os01g02884, LOC_Os10g33275	PRCOL_00000991_RA	pm006913g0010, pm020641g0020, pm025330g0010, pm000425g0030, pm020641g0030, pm021879g0010	Pp3c2_32730, Pp3c14_12310, Pp3c17_19726, Pp3c17_19720	Solyc01g006710, Solyc04g007510, Solyc03g118920, Solyc01g006970	419303, 98495	SM000008S22221, SM000039S14494, SM000042S15380, SM000241S08521, SM000252S09075	Zci1a_12058, Zci1a_34164	Zci_01818, Zci_08271	UTEX1559_13921, UTEX1559_00393	UTEX1560_14343, UTEX1560_14869, UTEX1560_14452	Zm00001d034013, Zm00001d040082, Zm00001d032735, Zm00001d000351
Pp3c15_330	N0.HOG0043912	OG0041735	-	NA	NA	NA	NA	NA	NA	NA	NA	NA	NA	NA	NA	NA	NA	NA	NA	Pp3c9_80, Pp3c15_330	NA	NA	NA	NA	NA	NA	NA	NA
Pp3c2_14390	N0.HOG0005364	OG0004184	n0	AagrOXF_evm.TU.utg000085l.68	Azfi_s0329.g065352	AT2G25280	Bradi3g19990	CBR_g59364	NA	Cre02.g096200_4532	CLOP_g21073	7687	Me1_v2_0102320, Me1_v2_0097710	Mp1g23300	22665	NA	LOC_Os08g20270, LOC_Os05g24580	PRCOL_00000176_RA	pm023543g0010, pm034427g0010, pm000274.t2, pm021138g0010, pm023179g0020	Pp3c2_14390, Pp3c14_17280	Solyc08g029110	438442	SM000061S19265, SM000036S13245, SM000003S11204, SM000018S03655	Zci1a_03039, Zci1a_03038	Zci_04873	UTEX1559_01480	UTEX1560_00021, UTEX1560_00022	Zm00001d011850
Pp3c16_14160	N0.HOG0006600	OG0005342	n0	AagrOXF_evm.TU.utg000035l.211, AagrOXF_evm.TU.utg000057l.257	Azfi_s0313.g064221	AT2G17350	Bradi4g33840, Bradi3g40120	CBR_g20399, CBR_g764	NA	NA	CLOP_g2306	3862, 8887	Me1_v2_0101660	Mp5g21810	NA	NA	LOC_Os09g31466, LOC_Os08g40100	NA	pm001684g0060, pm000855g0010	Pp3c5_11560, Pp3c6_23720, Pp3c16_14160	Solyc06g065200	80524	SM000114S24166, SM000260S09942, SM000216S06559	Zci1a_17284	Zci_13613	UTEX1559_17212	UTEX1560_09571	Zm00001d020950, Zm00001d006032
Pp3c5_16850	N0.HOG0002146	OG0001385	n3	AagrOXF_evm.TU.utg000033l.212, AagrOXF_evm.TU.utg000125l.130	Azfi_s0059.g034599, Azfi_s0090.g042652	AT3G54660, AT3G24170	Bradi3g26737, Bradi1g74180, Bradi3g55030	CBR_g36558, CBR_g21301	Chrsp29S04580, Chrsp94S08362	Cre09.g396252_4532, Cre06.g262100_4532	CLOP_g17435	804, 7398	Me1_v2_0216010, Me1_v2_0159740	Mp1g20690, Mp1g25390	10786, 10787	NA	LOC_Os10g28000, LOC_Os03g06740, LOC_Os02g56850	PRCOL_00002730_RA	pm013344g0010, pm004521.t1, pm021027g0010, pm019397g0020	Pp3c4_17890, Pp3c5_16850	Solyc09g065900, Solyc09g091840	438142, 164085	SM000003S10964, SM000003S11022, SM000072S21229, SM000270S10362, SM000247S08274, SM000342S12966	Zci1a_05063, Zci1a_05062, Zci1a_17304	Zci_12761, Zci_13391	UTEX1559_14740, UTEX1559_01892	UTEX1560_02694, UTEX1560_02696, UTEX1560_02693, UTEX1560_14564	Zm00001d027769, Zm00001d018454
Pp3c27_2550	N0.HOG0003212	OG0002280	n10	AagrOXF_evm.TU.utg000006l.1164	Azfi_s0048.g030578	AT5G58970, AT3G54110	Bradi2g40390, Bradi4g09060	CBR_g12201	Chrsp17S00184	Cre06.g278750_4532	CLOP_g20441, CLOP_g8173	8708	Me1_v2_0195320	Mp1g13240	10601	Olucimarinus_16269	LOC_Os01g74640, LOC_Os11g48040	PRCOL_00001592_RA	pm005819.t1, pm019343.t1	Pp3c27_2550, Pp3c16_5320	Solyc09g031680, Solyc09g011920	80205	SM000099S25225, SM000129S26146, SM000028S10206, SM000166S02468	Zci1a_38721	Zci_10094	UTEX1559_15270	NA	Zm00001d024951, Zm00001d004561, Zm00001d048583
Pp3c12_14480	N0.HOG0000483	OG0000245	n0	AagrOXF_evm.TU.utg000012l.281, AagrOXF_evm.TU.utg000042l.150, AagrOXF_evm.TU.utg000059l.351, AagrOXF_evm.TU.utg000003l.457, AagrOXF_evm.TU.utg000003l.460, AagrOXF_evm.TU.utg000049l.723	Azfi_s0047.g030342, Azfi_s0068.g036292, Azfi_s0272.g061300, Azfi_s0173.g055810, Azfi_s0206.g057843, Azfi_s0206.g057846, Azfi_s0032.g024974, Azfi_s0749.g085086, Azfi_s0070.g036790, Azfi_s1711.g106009, Azfi_s0035.g025703, Azfi_s0035.g025709, Azfi_s0035.g025712, Azfi_s0035.g025715, Azfi_s0035.g025714, Azfi_s0035.g025701, Azfi_s2521.g112009, Azfi_s0011.g012579	AT1G67560, AT1G17420, AT1G72520, AT3G45140, AT3G22400, AT1G55020	Bradi1g72690, Bradi5g11590, Bradi3g07000, Bradi3g07010, Bradi3g39980, Bradi1g09270, Bradi1g09260, Bradi1g11680, Bradi1g11670, Bradi3g59710	CBR_g45631, CBR_g57594, CBR_g16901, CBR_g76811, CBR_g34510, CBR_g34506, CBR_g20158, CBR_g76904	NA	Cre12.g512300_4532	NA	1745, 3925	NA	Mp1g21930, Mp2g20300, Mp8g12930, Mp2g16000, Mp3g06610, Mp5g21680, Mp8g08690, Mp8g01650, Mp8g15570, Mp2g00660, Mp8g09050, Mp2g23370, Mp2g23380, Mp2g12250, Mp2g12180, Mp2g12220	NA	Olucimarinus_46073	LOC_Os02g13480, LOC_Os03g08220, LOC_Os04g37430, LOC_Os02g10120, LOC_Os12g37260, LOC_Os12g37320, LOC_Os12g37350, LOC_Os08g39840, LOC_Os08g39850, LOC_Os02g19790, LOC_Os06g04420, LOC_Os03g49260, LOC_Os03g52860, LOC_Os03g49350, LOC_Os11g36719, LOC_Os03g49380, LOC_Os05g23880	NA	NA	Pp3c3_18720, Pp3c4_10250, Pp3c3_18710, Pp3c12_14480, Pp3c7_26600, Pp3c11_5120, Pp3c14_15340, Pp3c14_10640, Pp3c17_16260, Pp3c1_29300, Pp3c1_29700, Pp3c15_12990, Pp3c15_13020, Pp3c15_12980, Pp3c15_13040	Solyc05g014790, Solyc03g122340, Solyc01g005750.1, Solyc01g006555.1, Solyc12g011033.1, Solyc01g006540, Solyc12g011037.1, Solyc09g075860, Solyc09g075870, Solyc01g099210, Solyc07g022850.1, Solyc01g099200, Solyc08g014000, Solyc01g099150.5, Solyc01g099160, Solyc01g099170, Solyc01g099190, Solyc08g029000, Solyc09g055890, Solyc09g055900	437605, 168576, 170977, 178158, 112468, 112556, 109226, 439120, 446635, 439121, 140773, 268169, 441081, 429044, 402722, 402721	SM000004S15082, SM000045S16207, SM000013S26587, SM003927S15164, SM000179S03412, SM000013S26584, SM000366S13824	NA	NA	NA	NA	Zm00001d027893, Zm00001d025524, Zm00001d003533, Zm00001d053675, Zm00001d015852, Zm00001d031449, Zm00001d002000, Zm00001d042541, Zm00001d042540, Zm00001d033623, Zm00001d033624, Zm00001d013493, Zm00001d041204
Pp3c7_11570	N0.HOG0001647	OG0001015	n1	AagrOXF_evm.TU.utg000012l.222	Azfi_s0154.g053568, Azfi_s0157.g053808	AT2G36250, AT3G52750	Bradi5g09300, Bradi2g55590, Bradi2g23900	NA	Chrsp109S01456	Cre02.g142186_4532	CLOP_g11426	5968, 1265	Me1_v2_0176130	Mp2g21320, Mp5g10470	19931, 20928	Olucimarinus_32569	LOC_Os03g44420, LOC_Os05g37160	PRCOL_00006328_RA	pm032906g0010, pm000705g0010, pm020348g0010	Pp3c3_11140, Pp3c7_11570, Pp3c11_17860	Solyc09g009430, Solyc10g083490	99069, 84291	SM000054S18121, SM000005S17234, SM000041S15446	Zci1a_32690	Zci_08565	UTEX1559_17340	UTEX1560_12576	Zm00001d026669, Zm00001d010135
Pp3c22_22070	N0.HOG0000233	OG0000113	n115	AagrOXF_evm.TU.utg000109l.57, AagrOXF_evm.TU.utg000109l.31, AagrOXF_evm.TU.utg000109l.35, AagrOXF_evm.TU.utg000109l.33	Azfi_s0030.g024352, Azfi_s0061.g035042	AT1G80920, AT1G72070	Bradi1g30980	NA	NA	Cre07.g327450_4532	CLOP_g24814, CLOP_g4966	NA	NA	Mp3g16340, Mp5g02800	NA	NA	LOC_Os06g44160	PRCOL_00003812_RA	pm001669g0040, pm018627g0010, pm013877.t1	Pp3c26_5100, Pp3c4_26000, Pp3c8_2480, Pp3c3_35390, Pp3c4_11750, Pp3c12_16420, Pp3c22_22180, Pp3c18_3780, Pp3c22_22070, Pp3c18_3800	Solyc06g068500, Solyc03g117590	8923, 440364	NA	NA	NA	NA	NA	Zm00001d046813, Zm00001d046812
Pp3c20_10460	N0.HOG0004688	OG0003573	n0	AagrOXF_evm.TU.utg000018l.169	Azfi_s0071.g036802, Azfi_s0159.g053925	AT3G27300, AT5G40760	Bradi3g47910, Bradi5g13860	CBR_g18745	Chrsp153S02237, Chrsp153S02251	Cre17.g725550_4532	CLOP_g7203	1049	Me1_v2_0110790	Mp7g14370	11187, 9865	NA	LOC_Os02g38840, LOC_Os04g40874	NA	pm000672.t2, pm000672.t1, pm003208g0060, pm020175g0020	Pp3c24_8780, Pp3c20_10460, Pp3c23_16910	Solyc02g093830	150322	SM000042S15350, SM000039S14481, SM000008S22230	Zci1a_08810	Zci_01765	UTEX1559_12743	UTEX1560_02454	Zm00001d017119, Zm00001d003252
Pp3c15_24170	N0.HOG0001330	OG0000783	n0	AagrOXF_evm.TU.utg000024l.360, AagrOXF_evm.TU.utg000061l.76	Azfi_s0149.g053144, Azfi_s0064.g035714, Azfi_s0035.g025621, Azfi_s0704.g082661, Azfi_s2239.g109964	AT5G47550, AT4G16500, AT5G05110, AT2G40880, AT3G12490, AT5G12140, AT2G31980	Bradi1g48316, Bradi2g10146, Bradi2g25507, Bradi2g52670, Bradi2g21280, Bradi2g58610, Bradi5g06660	CBR_g40714, CBR_g29808	NA	Cre04.g225650_4532	CLOP_g1005, CLOP_g10353, CLOP_g19802, CLOP_g21572	10978, 9572	Me1_v2_0065270	Mp2g10340, Mp7g11520, Mp6g17590	27367	NA	LOC_Os03g11180, LOC_Os01g16430, LOC_Os05g33880, LOC_Os01g58890, LOC_Os05g41460, LOC_Os01g68660, LOC_Os01g68670, LOC_Os04g28250	PRCOL_00003887_RA	pm028663g0010, pm003991g0020, pm006197g0050	Pp3c9_24080, Pp3c8_17580, Pp3c15_24139, Pp3c9_24090, Pp3c15_24180, Pp3c15_24170, Pp3c13_18300	Solyc05g054120.1, Solyc04g014790.1, Solyc04g014780.1, Solyc11g012385.1, Solyc03g097270, Solyc01g009020, Solyc09g097850.1, Solyc12g098607.1	19455, 418098, 85303	SM000006S19333, SM000021S06449, SM000037S13475	Zci1a_31851, Zci1a_28312, Zci1a_28314	Zci_01147	UTEX1559_05573	UTEX1560_06150	Zm00001d008268, Zm00001d038173, Zm00001d010290, Zm00001d043175, Zm00001d012561, Zm00001d038586, Zm00001d038558, Zm00001d012068
Pp3c22_7610	N0.HOG0003535	OG0002559	n0	NA	Azfi_s0134.g049371	AT4G23496, AT3G02180, AT5G15600, AT2G03680, AT1G26355, AT1G69230	Bradi5g19120, Bradi1g22101	CBR_g30321	NA	Cre11.g467576_4532, Cre09.g394065_4532	NA	10634, 89	Me1_v2_0171410	Mp4g11160	15356	Olucimarinus_32204, Olucimarinus_92946	LOC_Os04g48870, LOC_Os12g31780, LOC_Os11g41150, LOC_Os03g30430	PRCOL_00003810_RA	NA	Pp3c15_1640, Pp3c19_22130, Pp3c19_4100, Pp3c19_4053, Pp3c19_4103, Pp3c22_7610, Pp3c18_18370, Pp3c18_18290	Solyc08g081470, Solyc03g114970, Solyc02g089065.1, Solyc05g012160, Solyc01g010270	443554	NA	NA	NA	NA	NA	Zm00001d002590, Zm00001d023735, Zm00001d048795, Zm00001d040773, Zm00001d047282, Zm00001d029527
Pp3c3_1860	N0.HOG0002849	OG0001966	n0	AagrOXF_evm.TU.utg000009l.334__335	Azfi_s0129.g048874	AT5G15680	Bradi3g60610	CBR_g31516	Chrsp26S04002	Cre17.g703750_4532	CLOP_g3537	12250	Me1_v2_0076750	Mp5g03120	21923	Olucimarinus_33418	LOC_Os02g58410	NA	pm091728g0010, pm000019g0060, pm209499g0010, pm164723g0010, pm014435g0020, pm025390g0020, pm110792g0010, pm025390g0030, pm014435g0010, pm010213g0020, pm000019g0050, pm014435g0080, pm000019g0070, pm025390g0010, pm070544g0010, pm025851g0020, pm025851g0010, pm010213g0010, pm014435g0070	Pp3c12_3160, Pp3c13_5370, Pp3c3_1860	Solyc02g089370.2, Solyc02g089390, Solyc03g046450	84835	SM000142S00502, SM000104S09321, SM000176S03137	Zci1a_34923	Zci_06185	UTEX1559_08403	UTEX1560_03013, UTEX1560_11300	Zm00001d051839, Zm00001d018543
Pp3c15_5610	N0.HOG0006887	OG0005616	n5	AagrOXF_evm.TU.utg000009l.537	Azfi_s0003.g007534, Azfi_s0009.g011858	NA	NA	CBR_g37236	NA	NA	NA	1374, 7230	Me1_v2_0120830	Mp3g13250	16237	Olucimarinus_88841	NA	PRCOL_00005426_RA	pm014712g0020, pm001659g0050, pm027096.t2, pm004719g0040, pm044102g0010	Pp3c15_5610	NA	235490	SM000040S14837, SM000055S18276, SM000139S00100	Zci1a_38961	Zci_08715	UTEX1559_16838	UTEX1560_06508	NA
Pp3c16_260	N0.HOG0006415	OG0005164	n0	NA	Azfi_s0046.g030185	AT3G52180	Bradi1g78040	NA	Chrsp92S00687, Chrsp59S09142	Cre03.g151000_4532	CLOP_g3489	316	Me1_v2_0058450, Me1_v2_0227090, Me1_v2_0227070, Me1_v2_0189310, Me1_v2_0227100	Mp1g21210	23443, 23444	NA	LOC_Os03g01750	NA	pm016313g0020, pm020203.t1	Pp3c6_19150, Pp3c16_260	Solyc11g007830, Solyc03g111160	34445	SM000039S14529, SM000024S07742, SM000049S16701	Zci1a_02483	Zci_09621	UTEX1559_09926	UTEX1560_13449	Zm00001d027309
Pp3c3_18850	N0.HOG0007285	OG0005995	n0	AagrOXF_evm.TU.utg000041l.195, AagrOXF_evm.TU.utg000017l.19	Azfi_s0078.g038257	AT3G52610	Bradi2g55730	NA	NA	NA	CLOP_g15901	7857	Me1_v2_0220820	Mp3g09440, Mp1g22120	NA	NA	LOC_Os01g64256	NA	pm066244g0010, pm001485g0070, pm005065g0020, pm001485g0060	Pp3c3_18850, Pp3c11_23550, Pp3c15_17540	Solyc09g009990	407067	SM000015S01171, SM000086S23009, SM000002S05559, SM003713S13761	Zci1a_25756	Zci_11863	UTEX1559_17524	UTEX1560_02632	Zm00001d012289
Pp3c11_24020	N0.HOG0043850	OG0041673	-	NA	NA	NA	NA	NA	NA	NA	NA	NA	NA	NA	NA	NA	NA	NA	NA	Pp3c24_20760, Pp3c11_24020	NA	NA	NA	NA	NA	NA	NA	NA
Pp3c9_7340	NA	NA	NA	NA	NA	NA	NA	NA	NA	NA	NA	NA	NA	NA	NA	NA	NA	NA	NA	NA	NA	NA	NA	NA	NA	NA	NA	NA
Pp3c7_21050	N0.HOG0004523	OG0003430	n0	AagrOXF_evm.TU.utg000083l.454, AagrOXF_evm.TU.utg000109l.201	Azfi_s0001.g000499	AT1G13060, AT3G26340	Bradi1g49140	CBR_g23349, CBR_g34466	Chrsp110S01580	Cre10.g461950_4532	CLOP_g8500	6830	Me1_v2_0189200	Mp2g06230	15902	Olucimarinus_27330	LOC_Os06g06030	PRCOL_00003194_RA	pm010886.t1, pm020590.t1	Pp3c7_21050, Pp3c11_2970	Solyc03g063420, Solyc05g056160, Solyc03g063450	270977, 431723	SM000253S09022, SM000141S00862, SM000010S04391	Zci1a_26923, Zci1a_26924	Zci_04087	UTEX1559_05464, UTEX1559_05463	UTEX1560_06751, UTEX1560_06752	Zm00001d045315
Pp3c24_17430	N0.HOG0008485	OG0007137	n0	NA	Azfi_s0003.g007591	AT5G20930	Bradi1g08540	NA	Chrsp2S04716	Cre11.g481400_4532	NA	3118	Me1_v2_0078040	Mp3g15440	23810, 23811	Olucimarinus_17798	LOC_Os03g53880	PRCOL_00006471_RA	NA	Pp3c24_17430	Solyc11g071680	440179, 230254	SM000012S25281, SM000230S07357	Zci1a_04924	Zci_09494	UTEX1559_15557	UTEX1560_09903	Zm00001d034018, Zm00001d013267
Pp3c6_8930	N0.HOG0009698	OG0008263	n0	AagrOXF_evm.TU.utg000116l.436	Azfi_s0003.g007627	AT5G03345	Bradi4g04370	NA	Chrsp35S05297	Cre03.g183050_4532	NA	7976	Me1_v2_0075230	Mp4g11680	NA	NA	LOC_Os12g37880	NA	pm005790g0010, pm012079g0010	Pp3c5_16080, Pp3c6_8930	Solyc09g008140	228080	NA	NA	NA	UTEX1559_18182	UTEX1560_17642	Zm00001d041594, Zm00001d030665
Pp3c24_4810	N0.HOG0002617	OG0001764	n0	AagrOXF_evm.TU.utg000006l.692	Azfi_s0076.g037829, Azfi_s0013.g013358, Azfi_s0412.g068553, Azfi_s0099.g044210	AT1G64650, AT3G49310, AT4G27720	Bradi1g77580, Bradi3g31140	CBR_g44925, CBR_g3911, CBR_g23298	Chrsp22S03424, Chrsp33S05182	Cre13.g580150_4532, Cre16.g695500_4532	CLOP_g6567, CLOP_g24835, CLOP_g19268, CLOP_g13970	3288, 7484	Me1_v2_0216470	Mp3g11540	16214, 14413, 14412, 14414	Olucimarinus_30525, Olucimarinus_3784	LOC_Os03g02380, LOC_Os10g37520	PRCOL_00000345_RA	pm008035.t1, pm004732g0020, pm003536g0030, pm018213g0010	Pp3c20_16560, Pp3c24_4810, Pp3c8_9720	Solyc03g082660, Solyc08g066750	176583	NA	Zci1a_30217	Zci_01986	UTEX1559_10413	UTEX1560_04711, UTEX1560_04712	Zm00001d027344, Zm00001d018189, Zm00001d048507, Zm00001d032435
Pp3c1_38260	N0.HOG0002699	OG0001837	n0	AagrOXF_evm.TU.utg000027l.57	Azfi_s0008.g011383, Azfi_s0126.g048603, Azfi_s0068.g036349, Azfi_s0137.g051009, Azfi_s0077.g038058, Azfi_s3350.g115456, Azfi_s0063.g035322, Azfi_s0791.g087244	AT3G19610, AT1G70340, AT1G23790, AT1G08760, AT2G31920, AT3G14170	Bradi2g00750, Bradi4g35280, Bradi3g41830, Bradi1g72510	CBR_g49456	NA	NA	NA	NA	NA	Mp5g18740	NA	NA	LOC_Os01g01890, LOC_Os09g34110, LOC_Os08g42870, LOC_Os11g37480, LOC_Os03g08390	NA	NA	Pp3c2_3720, Pp3c1_38260, Pp3c7_26930, Pp3c11_800, Pp3c1_210, Pp3c2_28590	Solyc10g049790.1, Solyc10g049800, Solyc01g107120, Solyc05g005580, Solyc06g073110, Solyc01g081640, Solyc12g049500, Solyc03g122080	39369, 84972	NA	NA	NA	NA	NA	Zm00001d000051, Zm00001d040147, Zm00001d021181, Zm00001d006130, Zm00001d031700, Zm00001d012110, Zm00001d038770, Zm00001d032126, Zm00001d017634, Zm00001d027907
Pp3c10_9020	N0.HOG0007150	OG0005869	n0	NA	Azfi_s0116.g046367	AT5G47040	Bradi4g36160	CBR_g31118, CBR_g31124	NA	NA	CLOP_g24254, CLOP_g11830	3311	Me1_v2_0092360, Me1_v2_0216780	NA	NA	NA	LOC_Os09g36300	PRCOL_00006160_RA	pm005521g0030, pm000972g0060, pm000972g0070, pm010154g0010	Pp3c9_13420, Pp3c10_9020, Pp3c14_7840	Solyc08g077440	141788, 405160, 444435	NA	Zci1a_15159	Zci_01995	UTEX1559_12261	UTEX1560_19001, UTEX1560_05593	Zm00001d021301, Zm00001d006214
Pp3c3_25360	N0.HOG0002475	OG0001651	n0	AagrOXF_evm.TU.utg000020l.162	Azfi_s0011.g012589, Azfi_s2592.g112275, Azfi_s0373.g067200, Azfi_s0002.g006654	AT5G17380, AT3G48990	Bradi2g06680, Bradi5g26740	CBR_g39223, CBR_g39224, CBR_g39225	Chrsp75S07584	NA	CLOP_g12999	2658, 2657, 13338, 2659	Me1_v2_0064910	Mp7g01760	1205	Olucimarinus_37273	LOC_Os01g32080, LOC_Os04g58710	PRCOL_00004783_RA	pm002805.t1, pm004073g0050, pm001312g0040, pm029262g0010, pm008751g0020, pm019450g0010, pm014077g0010, pm034902g0020, pm001178g0090, pm021581g0020, pm334847g0010	Pp3c24_4490, Pp3c3_25360, Pp3s155_30	Solyc02g091100, Solyc06g035960, Solyc03g025720	178690, 170181	SM000001S04631, SM000007S20886, SM000004S14931	Zci1a_40788	Zci_08012	UTEX1559_03979	UTEX1560_15441, UTEX1560_15440, UTEX1560_15439	Zm00001d008739, Zm00001d026649
Pp3c18_5480	N0.HOG0004344	OG0003274	n0	NA	Azfi_s0198.g057433, Azfi_s0051.g031245	AT4G14930, AT1G72880	Bradi1g54410, Bradi2g47910	CBR_g41018	Chrsp80S07920	Cre10.g436500_4532	CLOP_g9557	12557	Me1_v2_0193760	Mp5g08220	29688, 29689	NA	LOC_Os07g10460, LOC_Os01g51280	PRCOL_00000499_RA	pm000409g0020, pm011310.t1	Pp3c21_18240, Pp3c18_5480, Pp3s70_200	Solyc09g075990, Solyc06g054250, Solyc06g054240, Solyc06g062750, Solyc03g121730	441080	SM000301S11762, SM000035S13158, SM000363S13640	Zci1a_16174	Zci_02356	UTEX1559_01163	UTEX1560_00289	Zm00001d019123, Zm00001d043686, Zm00001d011699
Pp3c8_8380	N0.HOG0000087	OG0000037	n0	AagrOXF_evm.TU.utg000063l.191, AagrOXF_evm.TU.utg000045l.146, AagrOXF_evm.TU.utg000045l.89, AagrOXF_evm.TU.utg000012l.572, AagrOXF_evm.TU.utg000050l.785, AagrOXF_evm.TU.utg000112l.14, AagrOXF_evm.TU.utg000012l.557, AagrOXF_evm.TU.utg000076l.53, AagrOXF_evm.TU.utg000017l.151, AagrOXF_evm.TU.utg000012l.567, AagrOXF_evm.TU.utg000012l.568, AagrOXF_evm.TU.utg000028l.12, AagrOXF_evm.TU.utg000012l.570, AagrOXF_evm.TU.utg000012l.571	Azfi_s0034.g025428, Azfi_s0132.g049204, Azfi_s0268.g061075, Azfi_s0006.g010145, Azfi_s0006.g010286, Azfi_s0051.g031230, Azfi_s0004.g008528, Azfi_s0211.g058106, Azfi_s3770.g116828, Azfi_s0020.g015434, Azfi_s0049.g030880, Azfi_s0019.g015312, Azfi_s0002.g001646, Azfi_s0254.g060434, Azfi_s0006.g010266, Azfi_s0098.g043949, Azfi_s0217.g058558, Azfi_s2579.g112202, Azfi_s0231.g059227, Azfi_s1386.g102493, Azfi_s0032.g024954, Azfi_s0045.g029932	AT3G53330, AT4G01380, AT3G28958, AT5G26330, AT2G31050, AT2G26720, AT2G44790, AT3G60270, AT3G60280, AT1G17800, AT3G17675, AT1G64640, AT5G57920, AT5G25090, AT2G25060, AT4G31840, AT2G23990, AT4G30590, AT4G32490, AT4G28365, AT4G27520, AT5G53870, AT3G20570, AT1G79800, AT5G14345, AT1G48940, AT3G18590, AT2G27035, AT3G01070, AT4G12880, AT5G15350, AT2G02850, AT3G27200, AT5G07475, AT1G72230, AT1G22480, AT2G32300, AT5G20230	Bradi1g04690, Bradi1g24121, Bradi1g29910, Bradi1g77560, Bradi3g19540, Bradi2g49767, Bradi2g06290, Bradi1g32840, Bradi3g04777, Bradi3g04773, Bradi2g52155, Bradi5g25890, Bradi3g56421, Bradi2g10245, Bradi1g43451, Bradi2g50790, Bradi1g08030, Bradi1g59120, Bradi4g37700, Bradi4g36621, Bradi1g25480, Bradi3g09220, Bradi3g09240, Bradi3g09230, Bradi3g14670, Bradi3g14690, Bradi3g14662, Bradi3g14680, Bradi3g14580, Bradi3g14695, Bradi4g05250, Bradi4g05260, Bradi4g05200, Bradi3g14570, Bradi1g59510, Bradi2g52050, Bradi1g05990, Bradi1g06010, Bradi1g06140, Bradi1g06020, Bradi1g06130, Bradi1g56570, Bradi1g56552, Bradi1g56560, Bradi1g01610, Bradi1g11240, Bradi1g67580, Bradi1g11230, Bradi5g09958, Bradi3g09640, Bradi3g09630, Bradi3g57010, Bradi1g43860, Bradi1g68150, Bradi4g32690, Bradi4g32680, Bradi3g38540, Bradi1g45710, Bradi3g58560, Bradi3g50410, Bradi1g13635, Bradi2g15920, Bradi2g15910	CBR_g21062	Chrsp1S08784, Chrsp99S08513, Chrsp369S05356	Cre14.g629050_4532	NA	595	NA	Mp3g23650, Mp5g00140, Mp7g00010, Mp2g05330, Mp3g09420, Mp3g05570, Mp2g20980, Mp6g07510, Mp2g02330, Mp3g12570, Mp4g15680, Mp3g14680, Mp2g21450, Mp2g21460, Mp1g07620, Mp2g14890, Mp2g12430, Mp2g14780, Mp2g14790, Mp3g10810, Mp5g02450, Mp3g06110, Mp3g10260, Mp3g10320, Mp3g10270, Mp3g10290, Mp3g10330, Mp3g14000, Mp3g17480, Mp3g17490, Mp3g21010, Mp3g10770, Mp3g14010, Mp3g10780, Mp3g10790	13947, 29550	NA	LOC_Os02g48820, LOC_Os03g59280, LOC_Os07g38290, LOC_Os06g50420, LOC_Os06g50650, LOC_Os03g02400, LOC_Os08g17160, LOC_Os01g54430, LOC_Os01g10480, LOC_Os06g46740, LOC_Os02g06690, LOC_Os01g57880, LOC_Os04g57750, LOC_Os02g49350, LOC_Os01g16610, LOC_Os06g17730, LOC_Os03g55120, LOC_Os07g02200, LOC_Os09g38540, LOC_Os09g36940, LOC_Os07g35860, LOC_Os12g05470, LOC_Os09g39940, LOC_Os08g04350, LOC_Os08g04360, LOC_Os08g04370, LOC_Os08g04340, LOC_Os08g04310, LOC_Os07g01440, LOC_Os01g57690, LOC_Os03g57730, LOC_Os07g07170, LOC_Os03g57740, LOC_Os11g24140, LOC_Os03g63390, LOC_Os03g50160, LOC_Os03g15340, LOC_Os03g50140, LOC_Os04g34480, LOC_Os02g15710, LOC_Os02g15730, LOC_Os02g49850, LOC_Os06g15600, LOC_Os04g46120, LOC_Os08g37670, LOC_Os09g29390, LOC_Os08g37660, LOC_Os06g11490, LOC_Os02g52180, LOC_Os04g53710, LOC_Os02g43660, LOC_Os04g46130, LOC_Os03g44630, LOC_Os05g49580	NA	NA	Pp3c15_5090, Pp3c1_7880, Pp3c7_18880, Pp3c20_17730, Pp3c23_9820, Pp3c3_25110, Pp3c4_11030, Pp3c12_20040, Pp3c15_7400, Pp3c23_21090, Pp3c24_5210, Pp3c8_8380, Pp3c4_18939, Pp3c4_20310, Pp3c26_6400, Pp3c12_6750, Pp3c25_13010, Pp3c5_23940, Pp3c6_3530, Pp3c16_22330, Pp3c25_13140, Pp3c7_7010, Pp3c11_22360, Pp3c5_5180	Solyc11g012130, Solyc09g065250, Solyc09g065260, Solyc09g075810, Solyc01g014060, Solyc01g014070.1, Solyc01g150116, Solyc10g037880, Solyc01g090120, Solyc07g008420, Solyc10g081520.1, Solyc08g066740, Solyc12g010000, Solyc11g072627.1, Solyc08g006790, Solyc10g007070, Solyc07g053880, Solyc12g005465, Solyc07g063020, Solyc12g013900, Solyc07g064240, Solyc03g120860.2, Solyc02g093650, Solyc03g119880, Solyc10g005940.1, Solyc02g088380, Solyc02g088390, Solyc12g042580, Solyc03g117560, Solyc07g052660.1, Solyc12g005710, Solyc08g079780, Solyc01g104400, Solyc01g104380, Solyc01g104390, Solyc02g094050, Solyc05g054900, Solyc04g074740, Solyc11g006440.1, Solyc07g008130, Solyc07g150103, Solyc07g150104, Solyc12g042780, Solyc03g116700, Solyc03g116690, Solyc07g008140	27978, 443452, 69294, 76299, 19307, 39173, 19117, 27471, 29265, 405234, 409386, 405136, 19213, 37976, 69095, 422957, 72991, 24493	NA	NA	NA	NA	NA	Zm00001d034546, Zm00001d013038, Zm00001d021850, Zm00001d014807, Zm00001d027346, Zm00001d043453, Zm00001d039430, Zm00001d014463, Zm00001d053829, Zm00001d053830, Zm00001d015331, Zm00001d043232, Zm00001d012602, Zm00001d026595, Zm00001d051696, Zm00001d051118, Zm00001d040502, Zm00001d040382, Zm00001d037376, Zm00001d043357, Zm00001d018641, Zm00001d021391, Zm00001d022607, Zm00001d021700, Zm00001d019726, Zm00001d019725, Zm00001d024691, Zm00001d018621, Zm00001d043242, Zm00001d034396, Zm00001d018880, Zm00001d018879, Zm00001d007899, Zm00001d018877, Zm00001d018874, Zm00001d018876, Zm00001d024868, Zm00001d025564, Zm00001d033711, Zm00001d013448, Zm00001d033710, Zm00001d028486, Zm00001d033709, Zm00001d017936, Zm00001d045680, Zm00001d002773, Zm00001d031257, Zm00001d020794, Zm00001d020793, Zm00001d037194, Zm00001d052191, Zm00001d018118, Zm00001d051333, Zm00001d017455, Zm00001d002772, Zm00001d033209, Zm00001d039071, Zm00001d017006
Pp3c15_19890	N0.HOG0005864	OG0004646	n0	AagrOXF_evm.TU.utg000009l.176	Azfi_s0076.g037789	AT3G28760	Bradi1g73220	NA	Chrsp29S08888	Cre05.g248250_4532	CLOP_g3011	4828	Me1_v2_0129200	Mp1g05330	12078	Olucimarinus_4482	LOC_Os03g07420	PRCOL_00003957_RA	pm003486g0030, pm007687g0010	Pp3c10_2120, Pp3c2_18540, Pp3c1_20750, Pp3c1_20753, Pp3c10_1080, Pp3c9_19570, Pp3c15_19890	Solyc03g058860	NA	SM000373S13607, SM000002S05678, SM000172S03074	Zci1a_24632	Zci_03459, Zci_16075	UTEX1559_06438	UTEX1560_01256	Zm00001d048315
Pp3c22_5210	N0.HOG0026321	OG0024144	-	NA	Azfi_s0060.g034844	NA	NA	NA	NA	NA	NA	NA	NA	NA	NA	NA	NA	NA	NA	Pp3c22_5210	NA	437856	NA	NA	NA	NA	NA	NA
Pp3c2_17640	N0.HOG0003720	OG0002727	n0	AagrOXF_evm.TU.utg000035l.110	Azfi_s0009.g011931, Azfi_s0074.g037508, Azfi_s0074.g037514	AT5G49750, AT5G49760, AT5G49770, AT5G49780, AT1G79620	Bradi4g40160, Bradi2g36880, Bradi2g53277, Bradi2g53291, Bradi2g21990, Bradi1g63550	NA	NA	NA	NA	NA	Me1_v2_0069140	Mp7g05370	NA	NA	LOC_Os11g14050, LOC_Os12g10740, LOC_Os05g24010, LOC_Os01g60060, LOC_Os05g40770, LOC_Os03g21230	NA	NA	Pp3c2_17640, Pp3c19_9410, Pp3c23_19730	Solyc01g102680, Solyc01g102700, Solyc12g017550.1, Solyc01g102710.2, Solyc10g075000, Solyc02g024060, Solyc10g085670	438263, 78967, 438262	NA	NA	NA	NA	UTEX1560_19372	Zm00001d041773, Zm00001d010448, Zm00001d043091, Zm00001d038522, Zm00001d029012
Pp3c3_14060	N0.HOG0007384	OG0006090	n0	AagrOXF_evm.TU.utg000077l.125	Azfi_s0083.g038861	AT1G71220	Bradi3g28605	CBR_g48619	Chrsp6S07457	Cre05.g233303_4532	CLOP_g25096	2668	Me1_v2_0065060	Mp7g09620	16879	Olucimarinus_44445	LOC_Os02g44510	PRCOL_00004479_RA	pm003779g0010, pm037627g0020, pm017810g0010	Pp3c3_14060	Solyc01g104040	186368, 428335	SM000004S15021, SM000007S20802	Zci1a_20373	Zci_10810	UTEX1559_08717	UTEX1560_00735	Zm00001d018423
Pp3c10_18810	N0.HOG0004396	OG0003318	n0	AagrOXF_evm.TU.utg000005l.61, AagrOXF_evm.TU.utg000010l.365	Azfi_s0268.g061119, Azfi_s0030.g024293	AT1G07700	Bradi3g46420	NA	Chrsp109S01444	Cre03.g144787_4532	CLOP_g19775, CLOP_g20288	15290, 12153	Me1_v2_0153960	Mp1g10500	11742	NA	LOC_Os02g35900	NA	pm001263g0040, pm009353g0020, pm009353.t1, pm014775g0020, pm004158g0030, pm004160.t1	Pp3c10_18810, Pp3c4_3900	Solyc04g078910	NA	SM000118S25616, SM000192S04898, SM000004S15128, SM000005S17121, SM000138S00064	Zci1a_13505	Zci_02676, Zci_03868	UTEX1559_01012, UTEX1559_06389	UTEX1560_01579, UTEX1560_11645	Zm00001d016893
Pp3c26_6560	N0.HOG0000061	OG0000020	n0	AagrOXF_evm.TU.utg000009l.515, AagrOXF_evm.TU.utg000018l.254, AagrOXF_evm.TU.utg000006l.339, AagrOXF_evm.TU.utg000098l.2, AagrOXF_evm.TU.utg000059l.157, AagrOXF_evm.TU.utg000103l.15, AagrOXF_evm.TU.utg000124l.34, AagrOXF_evm.TU.utg000124l.30, AagrOXF_evm.TU.utg000124l.33, AagrOXF_evm.TU.utg000083l.93, AagrOXF_evm.TU.utg000018l.302, AagrOXF_evm.TU.utg000140l.78, AagrOXF_evm.TU.utg000140l.76, AagrOXF_evm.TU.utg000003l.74, AagrOXF_evm.TU.utg000007l.45, AagrOXF_evm.TU.utg000022l.52, AagrOXF_evm.TU.utg000103l.171, AagrOXF_evm.TU.utg000103l.170, AagrOXF_evm.TU.utg000091l.467, AagrOXF_evm.TU.utg000104l.4, AagrOXF_evm.TU.utg000126l.11, AagrOXF_evm.TU.utg000018l.189, AagrOXF_evm.TU.utg000018l.191, AagrOXF_evm.TU.utg000018l.396, AagrOXF_evm.TU.utg000018l.401, AagrOXF_evm.TU.utg000018l.181, AagrOXF_evm.TU.utg000006l.534, AagrOXF_evm.TU.utg000006l.535, AagrOXF_evm.TU.utg000002l.146, AagrOXF_evm.TU.utg000002l.147, AagrOXF_evm.TU.utg000091l.486, AagrOXF_evm.TU.utg000002l.148, AagrOXF_evm.TU.utg000002l.149, AagrOXF_evm.TU.utg000018l.239, AagrOXF_evm.TU.utg000005l.204, AagrOXF_evm.TU.utg000111l.105, AagrOXF_evm.TU.utg000114l.15, AagrOXF_evm.TU.utg000114l.23, AagrOXF_evm.TU.utg000081l.326, AagrOXF_evm.TU.utg000081l.325, AagrOXF_evm.TU.utg000091l.674, AagrOXF_evm.TU.utg000125l.195, AagrOXF_evm.TU.utg000050l.228, AagrOXF_evm.TU.utg000050l.276, AagrOXF_evm.TU.utg000050l.232, AagrOXF_evm.TU.utg000109l.183, AagrOXF_evm.TU.utg000103l.74, AagrOXF_evm.TU.utg000050l.277, AagrOXF_evm.TU.utg000050l.231, AagrOXF_evm.TU.utg000045l.256, AagrOXF_evm.TU.utg000102l.6, AagrOXF_evm.TU.utg000002l.639, AagrOXF_evm.TU.utg000050l.226, AagrOXF_evm.TU.utg000002l.3, AagrOXF_evm.TU.utg000050l.274, AagrOXF_evm.TU.utg000091l.246, AagrOXF_evm.TU.utg000083l.127, AagrOXF_evm.TU.utg000083l.126, AagrOXF_evm.TU.utg000083l.121, AagrOXF_evm.TU.utg000083l.124, AagrOXF_evm.TU.utg000126l.217, AagrOXF_evm.TU.utg000003l.429, AagrOXF_evm.TU.utg000083l.358, AagrOXF_evm.TU.utg000008l.161, AagrOXF_evm.TU.utg000008l.159, AagrOXF_evm.TU.utg000091l.517, AagrOXF_evm.TU.utg000018l.256, AagrOXF_evm.TU.utg000018l.267, AagrOXF_evm.TU.utg000091l.510, AagrOXF_evm.TU.utg000018l.273, AagrOXF_evm.TU.utg000018l.253, AagrOXF_evm.TU.utg000018l.257, AagrOXF_evm.TU.utg000018l.316, AagrOXF_evm.TU.utg000091l.598, AagrOXF_evm.TU.utg000038l.279, AagrOXF_evm.TU.utg000038l.273, AagrOXF_evm.TU.utg000038l.280, AagrOXF_evm.TU.utg000050l.281, AagrOXF_evm.TU.utg000010l.16, AagrOXF_evm.TU.utg000010l.19, AagrOXF_evm.TU.utg000010l.17, AagrOXF_evm.TU.utg000010l.15, AagrOXF_evm.TU.utg000028l.79	Azfi_s0355.g066730, Azfi_s0112.g045742, Azfi_s0112.g045752, Azfi_s0112.g045773, Azfi_s0112.g045774, Azfi_s0233.g059352, Azfi_s0112.g045767, Azfi_s0472.g072931, Azfi_s0033.g025136, Azfi_s0033.g025139, Azfi_s0422.g069198, Azfi_s0001.g000331, Azfi_s0061.g035024, Azfi_s0061.g035044, Azfi_s0061.g035028, Azfi_s0061.g035032, Azfi_s0079.g038391, Azfi_s2402.g111187, Azfi_s0011.g012479, Azfi_s0011.g012484, Azfi_s0004.g008667, Azfi_s0038.g026350, Azfi_s0008.g011405	AT1G74550, AT1G74540, AT2G40890, AT5G07990, AT4G12330, AT4G22690, AT4G12334, AT1G33720, AT1G33730, AT2G45550, AT2G45560, AT2G45570, AT2G45580, AT3G61040, AT5G04330, AT3G48280, AT3G48310, AT3G48320, AT3G48290, AT3G48270, AT3G48300, AT4G20240, AT4G13290, AT4G13310, AT5G42590, AT4G20235, AT5G24960, AT5G24950, AT2G30770, AT2G30750, AT1G11610, AT5G25130, AT5G25120, AT5G25140, AT5G25180, AT2G24180, AT5G57260, AT2G02580, AT3G26330, AT3G26320, AT3G26290, AT3G26300, AT3G26310, AT1G01280, AT3G61035	Bradi2g21300, Bradi1g24840, Bradi4g16560, Bradi3g04750, Bradi1g17180, Bradi2g11620, Bradi1g61577, Bradi1g68090, Bradi3g22560, Bradi3g37820, Bradi1g35980, Bradi2g10294, Bradi2g07598, Bradi2g07590, Bradi1g02670, Bradi1g02736, Bradi2g07577, Bradi5g10721, Bradi3g36680, Bradi1g15190, Bradi4g08997, Bradi5g21470, Bradi5g21420, Bradi5g21430, Bradi4g39240, Bradi4g31380, Bradi4g31367, Bradi5g08374, Bradi5g08570, Bradi1g57000, Bradi3g14390	CBR_g2943, CBR_g12412, CBR_g12414, CBR_g12415, CBR_g12416, CBR_g12428	Chrsp31S08934, Chrsp180S02882, Chrsp180S02881, Chrsp61S07011, Chrsp104S01282	NA	CLOP_g23505, CLOP_g5400, CLOP_g11639, CLOP_g5401, CLOP_g9551, CLOP_g24072	2098, 12450, 2237, 7308	NA	Mp3g11100, Mp5g12720, Mp7g08060, Mp5g10800, Mp3g03410, Mp3g03390, Mp3g02640, Mp3g22190, Mp3g22210, Mp3g19330, Mp3g14950, Mp2g17120, Mp7g19270, Mp3g14900, Mp5g21950, Mp7g08070, Mp7g08020, Mp7g08050, Mp4g10800, Mp4g13420, Mp3g09970, Mp3g14440, Mp2g26700, Mp3g20410, Mp4g05650, Mp3g18700, Mp2g04040, Mp5g08730, Mp1g19500, Mp2g17680	27764	NA	LOC_Os10g12080, LOC_Os05g41440, LOC_Os10g16974, LOC_Os10g17260, LOC_Os03g25150, LOC_Os03g14400, LOC_Os10g08319, LOC_Os10g08540, LOC_Os10g08474, LOC_Os08g36310, LOC_Os02g36030, LOC_Os02g36280, LOC_Os01g38110, LOC_Os02g36110, LOC_Os02g36070, LOC_Os06g39780, LOC_Os08g39694, LOC_Os08g39640, LOC_Os08g39660, LOC_Os08g39730, LOC_Os06g30640, LOC_Os12g09790, LOC_Os03g02180, LOC_Os06g41070, LOC_Os05g35010, LOC_Os09g36070, LOC_Os08g01490, LOC_Os08g01480, LOC_Os06g22020, LOC_Os08g01450, LOC_Os08g01470, LOC_Os01g36294, LOC_Os01g36350, LOC_Os08g01510, LOC_Os08g01520, LOC_Os11g28065, LOC_Os11g27730, LOC_Os11g28060, LOC_Os01g12760, LOC_Os01g12770, LOC_Os01g12750, LOC_Os01g12740, LOC_Os03g39650, LOC_Os03g39760, LOC_Os03g39690, LOC_Os02g09400, LOC_Os06g43520, LOC_Os12g16720, LOC_Os09g26960, LOC_Os09g26980, LOC_Os08g35510, LOC_Os09g26940, LOC_Os09g08990, LOC_Os09g08920, LOC_Os02g29960, LOC_Os09g26950, LOC_Os03g44740, LOC_Os06g10260, LOC_Os06g35620, LOC_Os08g03682	NA	NA	Pp3c22_19010, Pp3c17_14010, Pp3c2_37410, Pp3c27_4440, Pp3c27_4400, Pp3c3_26120, Pp3c6_19010, Pp3c16_630, Pp3c11_7340, Pp3c15_21450, Pp3c22_19580, Pp3c11_470, Pp3c25_15450, Pp3s124_100, Pp3c27_8510, Pp3c7_22790, Pp3c11_6580, Pp3c26_6560, Pp3c23_6470, Pp3c21_19760, Pp3c2_24000, Pp3c7_17090, Pp3c11_13670, Pp3c2_30400, Pp3c1_1880, Pp3c17_21950, Pp3c1_39440, Pp3c3_20750, Pp3c4_15170, Pp3c12_8440, Pp3c4_30670, Pp3c3_3050, Pp3c3_32210, Pp3c13_14870, Pp3c3_17840	Solyc10g078240, Solyc01g009370, Solyc10g078220, Solyc10g078230, Solyc01g096670, Solyc03g115220, Solyc11g066580, Solyc08g079420, Solyc06g066270.1, Solyc06g084820, Solyc10g085500, Solyc04g011690, Solyc04g150131, Solyc04g050625.1, Solyc04g054220, Solyc04g011680, Solyc03g046496.1, Solyc04g054250, Solyc04g050620, Solyc04g050575.1, Solyc12g044956.1, Solyc12g044954.1, Solyc12g042480, Solyc12g045020, Solyc04g054256.1, Solyc04g054258.1, Solyc04g054260, Solyc04g083150, Solyc01g010260, Solyc03g111880, Solyc03g111953.1, Solyc03g111950, Solyc03g111885.1, Solyc03g111990, Solyc03g111970, Solyc03g111930, Solyc03g111920, Solyc03g111940.2, Solyc03g150105, Solyc03g111997.1, Solyc03g112010, Solyc03g112040.1, Solyc03g112030, Solyc04g063245.1, Solyc08g150142, Solyc09g014900, Solyc03g122360, Solyc03g122350, Solyc11g030730, Solyc04g051244.1, Solyc04g071780, Solyc04g071805.1, Solyc04g150164, Solyc04g071800, Solyc04g071790, Solyc10g009390	271465, 17683, 29565, 166299, 15275, 77365, 432094, 124545, 158157, 165663, 124537, 418271, 90567, 111331, 111377, 78844, 78680, 78910, 404307, 78293, 113134, 90651, 132063, 90326, 421431, 421437, 115634, 115322, 83018, 77761, 112052, 419692, 271116, 102826, 422266, 22308, 35341, 20611, 408377, 26356, 64553, 116408, 421782, 93924, 85436, 116301, 12440, 85404, 12447, 12450, 116184, 22371, 22372, 18538, 159100, 126936, 159093, 124314, 74166, 229947, 235879, 230667, 168443, 76773, 166599, 169986, 228641, 124363, 118120	NA	Zci1a_07337, Zci1a_36798, Zci1a_04357, Zci1a_32228, Zci1a_07341, Zci1a_28179, Zci1a_28175, Zci1a_04356, Zci1a_27892, Zci1a_41008, Zci1a_28360, Zci1a_40217, Zci1a_28369, Zci1a_28371, Zci1a_28377, Zci1a_17229, Zci1a_09654, Zci1a_09655, Zci1a_30981, Zci1a_44982, Zci1a_40219, Zci1a_28367, Zci1a_19481	Zci_08579, Zci_08580, Zci_08583, Zci_13763, Zci_08574, Zci_03906	UTEX1559_05056, UTEX1559_05057, UTEX1559_05061, UTEX1559_17012, UTEX1559_17349, UTEX1559_04859	UTEX1560_12801, UTEX1560_12800, UTEX1560_08912, UTEX1560_14852, UTEX1560_16890, UTEX1560_16909	Zm00001d043174, Zm00001d038555, Zm00001d010521, Zm00001d050955, Zm00001d017077, Zm00001d047425, Zm00001d047424, Zm00001d039698, Zm00001d028419, Zm00001d030372, Zm00001d013830, Zm00001d030976, Zm00001d022532, Zm00001d046758, Zm00001d020177, Zm00001d035013, Zm00001d034986, Zm00001d035178, Zm00001d048710, Zm00001d003140, Zm00001d029184, Zm00001d003144, Zm00001d008987, Zm00001d008985, Zm00001d008990, Zm00001d039310, Zm00001d042047, Zm00001d033139, Zm00001d013759, Zm00001d049551, Zm00001d046603, Zm00001d023625, Zm00001d048626, Zm00001d020628, Zm00001d005823, Zm00001d050097, Zm00001d005821, Zm00001d005577, Zm00001d005822, Zm00001d024574, Zm00001d029243, Zm00001d029241, Zm00001d018839, Zm00001d007918
Pp3c22_4050	N0.HOG0000266	OG0000125	n0	AagrOXF_evm.TU.utg000024l.125, AagrOXF_evm.TU.utg000024l.121, AagrOXF_evm.TU.utg000035l.457, AagrOXF_evm.TU.utg000029l.42, AagrOXF_evm.TU.utg000003l.414, AagrOXF_evm.TU.utg000009l.92, AagrOXF_evm.TU.utg000009l.101, AagrOXF_evm.TU.utg000009l.96, AagrOXF_evm.TU.utg000081l.230	Azfi_s0040.g026631, Azfi_s0142.g051383, Azfi_s0046.g030137, Azfi_s0142.g051380, Azfi_s0112.g045799, Azfi_s0006.g010153, Azfi_s0075.g037635, Azfi_s0028.g023810, Azfi_s0095.g043589, Azfi_s0020.g015518, Azfi_s0589.g078718, Azfi_s0375.g067271, Azfi_s0045.g030060, Azfi_s0104.g044712	AT2G28120, AT2G39210, AT1G74780, AT1G18940, AT2G34355, AT2G34350, AT2G16660, AT4G34950, AT1G80530, AT5G50520, AT5G50630, AT3G01930, AT5G14120	Bradi1g12440, Bradi3g27980, Bradi1g05180, Bradi1g54990, Bradi4g07330, Bradi4g00480, Bradi4g36420, Bradi1g47737, Bradi1g47750, Bradi5g14850, Bradi3g41320, Bradi5g08190	CBR_g2804, CBR_g40099, CBR_g32419, CBR_g29526	Chrsp10S01502	Cre01.g039950_4532	CLOP_g13914, CLOP_g14715, CLOP_g40009, CLOP_g6925, CLOP_g18173, CLOP_g7841	13199, 11672, 12395, 4491, 9968, 11115, 5283	Me1_v2_0115630, Me1_v2_0115780, Me1_v2_0116360, Me1_v2_0193600, Me1_v2_0086480	Mp2g25060, Mp5g19920, Mp2g06490, Mp4g12380, Mp1g26030, Mp3g06660, Mp6g03460, Mp6g00260	10565, 10566	NA	LOC_Os12g44070, LOC_Os12g44060, LOC_Os03g47810, LOC_Os10g08850, LOC_Os03g58580, LOC_Os07g09010, LOC_Os08g20190, LOC_Os12g29950, LOC_Os12g44180, LOC_Os09g36600, LOC_Os06g08110, LOC_Os08g15450, LOC_Os04g42420, LOC_Os08g42010, LOC_Os04g31924	NA	pm012274g0040, pm015323g0030, pm008221g0030, pm028130g0010, pm012277g0020, pm017984g0010, pm006465g0020, pm033238g0010, pm012892g0020, pm157440g0010, pm042129g0010	Pp3c15_2390, Pp3c2_16900, Pp3c14_2614, Pp3c14_2610, Pp3c9_2960, Pp3c20_2290, Pp3c23_17590, Pp3c20_11000, Pp3c10_21640, Pp3c20_21850, Pp3c3_17130, Pp3c12_7920, Pp3c18_22300, Pp3c22_4050, Pp3c19_7270, Pp3c13_2450	Solyc11g008180.1, Solyc11g066330, Solyc06g011590, Solyc09g008370.1, Solyc10g083940.1, Solyc10g083950.1, Solyc01g109760, Solyc05g055540, Solyc11g008200, Solyc03g113330, Solyc03g113340, Solyc10g055390, Solyc01g111350, Solyc07g007340, Solyc03g117300, Solyc03g019650, Solyc02g068140, Solyc02g094190, Solyc07g026700.1	402179, 445712, 271410, 178001, 111826, 89661, 31833, 93948, 89169, 89688, 166510, 266544, 62386, 166743, 418769, 79408, 414802	SM000100S09429, SM000003S11138, SM000262S09891, SM000003S11134, SM000262S09888, SM000100S09427, SM000400S15605, SM000035S13138, SM000301S11768, SM000017S02796, SM000147S01096, SM000049S16721	Zci1a_30424, Zci1a_13211, Zci1a_38816, Zci1a_12044	Zci_12226, Zci_12230, Zci_15968, Zci_15755, Zci_12848, Zci_12187, Zci_03215	UTEX1559_17295, UTEX1559_17300, UTEX1559_01696, UTEX1559_11796, UTEX1559_09686, UTEX1559_06343, UTEX1559_00886	UTEX1560_11160, UTEX1560_08709, UTEX1560_11155, UTEX1560_13363, UTEX1560_12609, UTEX1560_14955, UTEX1560_07992, UTEX1560_16068	Zm00001d033517, Zm00001d007941, Zm00001d007710, Zm00001d034488, Zm00001d034489, Zm00001d019049, Zm00001d007785, Zm00001d041025, Zm00001d041203, Zm00001d022636, Zm00001d023827, Zm00001d009770, Zm00001d036235, Zm00001d037495, Zm00001d045136, Zm00001d003116, Zm00001d025797, Zm00001d031634, Zm00001d033452, Zm00001d049831, Zm00001d025237, Zm00001d003949, Zm00001d003950, Zm00001d003954, Zm00001d010281
Pp3c2_25720	N0.HOG0003932	OG0002914	n0	AagrOXF_evm.TU.utg000059l.133	Azfi_s0192.g057034	AT3G03720, AT1G58030, AT5G36940	Bradi4g34265, Bradi4g01240, Bradi1g13440, Bradi3g27246	CBR_g36274, CBR_g51009, CBR_g61206	NA	NA	CLOP_g21837, CLOP_g10934	2665	Me1_v2_0168190	Mp7g18850, Mp8g12420	NA	NA	LOC_Os12g42850, LOC_Os03g45170, LOC_Os10g30090	NA	pm015905.t2, pm012878g0020, pm001560g0050, pm012472g0050	Pp3c2_25720, Pp3c1_14670	Solyc08g077810, Solyc02g037510, Solyc10g081460	124335, 177383	NA	Zci1a_04872	Zci_15334	UTEX1559_12690	UTEX1560_17278, UTEX1560_19038	Zm00001d031120, Zm00001d033493, Zm00001d013652, Zm00001d014152
Pp3c10_23130	N0.HOG0001017	OG0000572	n0	AagrOXF_evm.TU.utg000002l.141	Azfi_s0032.g024628, Azfi_s0120.g046747, Azfi_s0102.g044461, Azfi_s0239.g059661, Azfi_s0214.g058319, Azfi_s0018.g014717, Azfi_s0114.g046153, Azfi_s0093.g043201	AT1G78090, AT1G22210, AT5G65140, AT5G10100, AT2G22190, AT4G39770, AT1G35910, AT5G51460, AT4G22590, AT4G12430	Bradi3g58960, Bradi1g45480, Bradi3g35590, Bradi4g29030, Bradi1g60950, Bradi1g21420, Bradi5g17890, Bradi3g50810, Bradi3g32970, Bradi1g27470	CBR_g38545, CBR_g818	Chrsp90S08116	Cre12.g497750_4532	CLOP_g10352, CLOP_g11452	10802	Me1_v2_0093220	Mp1g08690	14269	Olucimarinus_43599	LOC_Os02g51680, LOC_Os06g11840, LOC_Os08g31630, LOC_Os09g20390, LOC_Os03g26910, LOC_Os07g43160, LOC_Os04g46760, LOC_Os02g44235, LOC_Os02g44230, LOC_Os10g40555, LOC_Os10g40550, LOC_Os07g30160	PRCOL_00006260_RA	pm001911g0040, pm323819g0010, pm035918g0010, pm007948g0030	Pp3c12_7510, Pp3c4_11080, Pp3c12_20050, Pp3c10_23130, Pp3c3_25080, Pp3c4_20080, Pp3c10_13170, Pp3c3_22990	Solyc04g072920, Solyc05g051880, Solyc04g054930, Solyc03g083960, Solyc08g079060, Solyc06g060600, Solyc04g082550, Solyc03g007290	104829, 105991	SM000019S05013, SM000078S22029, SM000252S09068	Zci1a_24328	Zci_09904, Zci_09905	UTEX1559_06964, UTEX1559_06963	NA	Zm00001d052227, Zm00001d018082, Zm00001d044854, Zm00001d032298, Zm00001d020272, Zm00001d005658, Zm00001d029371, Zm00001d022193, Zm00001d022192, Zm00001d006913, Zm00001d017502, Zm00001d047110, Zm00001d006375, Zm00001d052226
Pp3c9_5610	N0.HOG0004093	OG0003049	n0	AagrOXF_evm.TU.utg000084l.213, AagrOXF_evm.TU.utg000049l.518	Azfi_s0060.g034823, Azfi_s0065.g035950	AT1G07030, AT1G07025, AT2G30160	Bradi1g65170	CBR_g910	Chrsp97S08418	Cre16.g695950_4532	CLOP_g16522	4881	Me1_v2_0091810, Me1_v2_0160410	Mp6g14420	27389	Olucimarinus_15926	LOC_Os03g18550	PRCOL_00000819_RA	pm007211g0020	Pp3c9_5610, Pp3c15_17240	Solyc06g082290	230023, 76024, 8423, 432650, 232372, 166450	SM000239S08081, SM000162S02361, SM000010S04189	Zci1a_39558, Zci1a_32470	Zci_05033	UTEX1559_16041	UTEX1560_03901	Zm00001d028784, Zm00001d047709
Pp3c9_1880	N0.HOG0000187	OG0000097	n0	AagrOXF_evm.TU.utg000009l.53, AagrOXF_evm.TU.utg000001l.28, AagrOXF_evm.TU.utg000045l.198, AagrOXF_evm.TU.utg000005l.471, AagrOXF_evm.TU.utg000083l.352, AagrOXF_evm.TU.utg000098l.35	Azfi_s0075.g037659, Azfi_s0004.g008644, Azfi_s0034.g025419, Azfi_s0018.g014776, Azfi_s0114.g046110, Azfi_s0004.g008875, Azfi_s0277.g061489, Azfi_s0032.g024741, Azfi_s0277.g061491, Azfi_s0005.g009209, Azfi_s0275.g061393, Azfi_s0002.g001561, Azfi_s0001.g000316, Azfi_s0001.g000319, Azfi_s0003.g007559, Azfi_s0003.g007560, Azfi_s0185.g056566, Azfi_s0006.g009834, Azfi_s0048.g030589, Azfi_s0007.g010652, Azfi_s0560.g076949, Azfi_s0010.g012088, Azfi_s0486.g073434	AT4G00870, AT4G17880, AT5G46760, AT1G32640, AT5G46830, AT4G16430, AT1G01260, AT2G46510, AT4G09820, AT4G00480, AT1G63650, AT5G41315, AT4G21330, AT1G10610, AT2G16910, AT4G29930, AT5G57150, AT5G10570, AT5G65640, AT1G12860, AT3G26744, AT2G22770, AT2G22760, AT2G22750, AT4G37850	Bradi4g35400, Bradi3g41950, Bradi3g41930, Bradi3g41940, Bradi3g34200, Bradi2g47730, Bradi2g08080, Bradi1g54070, Bradi1g54111, Bradi1g25230, Bradi3g01910, Bradi3g01901, Bradi5g01900, Bradi5g05110, Bradi1g76030, Bradi1g30000, Bradi2g59497, Bradi4g17460, Bradi1g12770, Bradi1g12780, Bradi1g12760, Bradi4g00920, Bradi1g10170, Bradi3g21460	CBR_g30908, CBR_g45945, CBR_g22468	NA	NA	NA	NA	Me1_v2_0145260, Me1_v2_0045870	MpUg00430, MpVg00340, Mp2g05070, Mp2g00910, Mp2g02460, Mp8g06230, Mp4g15560, Mp2g07150, Mp2g00510, Mp5g03020, Mp4g04910, Mp4g04920, Mp3g25200, Mp6g04650, Mp1g01160	29217	Olucimarinus_92375	LOC_Os09g34330, LOC_Os08g43070, LOC_Os10g42430, LOC_Os01g50940, LOC_Os01g13460, LOC_Os07g11020, LOC_Os01g39480, LOC_Os01g39580, LOC_Os04g47080, LOC_Os11g15210, LOC_Os04g47040, LOC_Os04g47059, LOC_Os01g39560, LOC_Os01g39430, LOC_Os07g36460, LOC_Os02g02820, LOC_Os04g23440, LOC_Os04g23550, LOC_Os10g39750, LOC_Os03g04310, LOC_Os06g50900, LOC_Os01g70310, LOC_Os11g32100, LOC_Os03g46790, LOC_Os03g46860, LOC_Os12g43620, LOC_Os03g51580, LOC_Os10g01530	NA	NA	Pp3c13_11550, Pp3c3_9950, Pp3c11_15370, Pp3c7_11010, Pp3c3_9970, Pp3c7_11000, Pp3c21_15150, Pp3c18_14850, Pp3c22_2930, Pp3c11_20550, Pp3c11_23320, Pp3c26_4390, Pp3c13_14400, Pp3c13_14420, Pp3c3_15850, Pp3c5_1140, Pp3c16_5980, Pp3c13_6760, Pp3c3_2760, Pp3c9_1880, Pp3c15_1800, Pp3c10_4280, Pp3c2_16410, Pp3c8_18070, Pp3c1_20960, Pp3c7_7950, Pp3c11_21970, Pp3c9_18600	Solyc08g083170.1, Solyc08g008600, Solyc01g096370, Solyc10g009290.1, Solyc10g009270, Solyc08g076930.1, Solyc08g005050, Solyc06g083980, Solyc05g050560.1, Solyc01g096050, Solyc09g065100, Solyc08g081140, Solyc02g079810, Solyc05g005300.2, Solyc08g062780, Solyc07g018010, Solyc05g014590, Solyc04g076845.1, Solyc12g088130, Solyc02g063430, Solyc02g091690, Solyc06g068870, Solyc03g118310, Solyc05g009640, Solyc06g064590, Solyc06g064580, Solyc02g091810, Solyc02g091820, Solyc02g091800, Solyc01g106460	445428, 158887, 422483, 73360, 424604, 431375, 16039, 77288, 75047, 91237, 94010, 34848, 407706, 422169	SM000232S07931, SM000368S13754, SM000387S14692	Zci1a_23668, Zci1a_25486	Zci_05570, Zci_10958	UTEX1559_02792, UTEX1559_02791, UTEX1559_01664	UTEX1560_02154, UTEX1560_02155, UTEX1560_08844	Zm00001d021164, Zm00001d006150, Zm00001d031717, Zm00001d052728, Zm00001d030028, Zm00001d047017, Zm00001d043706, Zm00001d039271, Zm00001d007536, Zm00001d047630, Zm00001d009013, Zm00001d019170, Zm00001d026147, Zm00001d000236, Zm00001d006564, Zm00001d053895, Zm00001d004095, Zm00001d024522, Zm00001d025141, Zm00001d027546, Zm00001d036382, Zm00001d014814, Zm00001d042263, Zm00001d007382, Zm00001d049294, Zm00001d025462, Zm00001d003604, Zm00001d026009, Zm00001d038966, Zm00001d024781, Zm00001d033412, Zm00001d033413, Zm00001d033407, Zm00001d031167, Zm00001d013370, Zm00001d033848, Zm00001d030232
Pp3c18_14130	N0.HOG0001289	OG0000755	n1	AagrOXF_evm.TU.utg000050l.569	Azfi_s0373.g067169, Azfi_s0111.g045724, Azfi_s0068.g036412, Azfi_s0111.g045660	AT1G76390, AT1G20780	Bradi3g60810, Bradi4g39167	CBR_g32545	NA	NA	NA	NA	NA	Mp8g11800	NA	NA	LOC_Os12g17880, LOC_Os07g32940, LOC_Os03g45420, LOC_Os12g17900	NA	NA	Pp3c14_22370, Pp3c1_37320, Pp3c9_2300, Pp3c15_2670, Pp3c18_15360, Pp3c21_7160, Pp3c5_13940, Pp3c18_14130	Solyc04g082570	80532, 165881, 82283	NA	NA	NA	NA	NA	Zm00001d021425, Zm00001d051829, Zm00001d023634, Zm00001d041098
Pp3c14_26183	N0.HOG0031143	OG0028966	-	NA	NA	NA	NA	NA	NA	NA	NA	NA	NA	NA	NA	NA	NA	NA	NA	Pp3c14_26183, Pp3c14_26180, Pp3c17_23480	NA	NA	NA	NA	NA	NA	NA	NA
Pp3c5_20080	N0.HOG0003439	OG0002474	n0	AagrOXF_evm.TU.utg000001l.406	Azfi_s0002.g001246, Azfi_s0048.g030424	AT5G53460	Bradi2g46670, Bradi2g17192	CBR_g31844, CBR_g18718, CBR_g18711, CBR_g18717	Chrsp27S04246	Cre13.g592200_4532	CLOP_g24104	7917	Me1_v2_0042590, Me1_v2_0223880	Mp1g25420	28114, 28115	NA	LOC_Os01g48960, LOC_Os05g48200	NA	pm012456g0010, pm003930g0010, pm018373g0010, pm022956g0020, pm001940g0010, pm001613g0010	Pp3c10_8200, Pp3c14_8740, Pp3c5_20080, Pp3c16_19110	Solyc03g083440	158084, 439142	SM000029S10448, SM000019S05115, SM000064S19752	Zci1a_09900	Zci_04335	UTEX1559_04024	UTEX1560_05796	Zm00001d043845, Zm00001d011610, Zm00001d038948
Pp3c24_4350	N0.HOG0005030	OG0003878	n0	AagrOXF_evm.TU.utg000059l.180	Azfi_s0078.g038296, Azfi_s0002.g005703	AT1G65410	Bradi4g38210	CBR_g23946	Chrsp23S03801	Cre16.g801906_4532	CLOP_g2381, CLOP_g9575, CLOP_g1336	4391	Me1_v2_0231880	Mp3g20590	3480	Olucimarinus_16468	LOC_Os03g46740	PRCOL_00001103_RA	pm022206g0020, pm000019g0280, pm001636.t1, pm012113g0020, pm012113g0030	Pp3c24_4350, Pp3c20_17770	Solyc04g056650	89097	SM000103S09506, SM000051S17537, SM000197S05466	Zci1a_24079	NA	UTEX1559_08044	UTEX1560_03754	Zm00001d019644, Zm00001d003145, Zm00001d047131
Pp3c17_15940	N0.HOG0000118	OG0000056	n0	AagrOXF_evm.TU.utg000063l.242, AagrOXF_evm.TU.utg000058l.13, AagrOXF_evm.TU.utg000113l.81, AagrOXF_evm.TU.utg000002l.601, AagrOXF_evm.TU.utg000009l.38, AagrOXF_evm.TU.utg000049l.512, AagrOXF_evm.TU.utg000100l.169, AagrOXF_evm.TU.utg000049l.509, AagrOXF_evm.TU.utg000049l.511, AagrOXF_evm.TU.utg000083l.434, AagrOXF_evm.TU.utg000083l.435, AagrOXF_evm.TU.utg000063l.287, AagrOXF_evm.TU.utg000063l.285, AagrOXF_evm.TU.utg000063l.286, AagrOXF_evm.TU.utg000063l.284, AagrOXF_evm.TU.utg000063l.267, AagrOXF_evm.TU.utg000063l.271, AagrOXF_evm.TU.utg000109l.196	Azfi_s0075.g037706, Azfi_s0043.g027147	AT5G44670, AT4G20170, AT3G60990, AT5G48190, AT3G07380, AT2G33570	Bradi1g35710, Bradi1g42556, Bradi3g53170	NA	Chrsp17S02520	NA	CLOP_g16507, CLOP_g3869, CLOP_g10648, CLOP_g14727, CLOP_g13649, CLOP_g24232, CLOP_g24235, CLOP_g1920, CLOP_g24236, CLOP_g1921, CLOP_g11748, CLOP_g15863, CLOP_g1045, CLOP_g796, CLOP_g6172, CLOP_g17592, CLOP_g18258, CLOP_g10625, CLOP_g17393, CLOP_g4600, CLOP_g4586, CLOP_g8467, CLOP_g20342, CLOP_g684, CLOP_g24903, CLOP_g1362, CLOP_g10649, CLOP_g23326, CLOP_g1470, CLOP_g10072, CLOP_g5032, CLOP_g81	14082, 4332, 1617, 7221, 12942	Me1_v2_0143670, Me1_v2_0156050, Me1_v2_0177700, Me1_v2_0140440, Me1_v2_0048860, Me1_v2_0139860, Me1_v2_0016520, Me1_v2_0140400, Me1_v2_0022140, Me1_v2_0193060, Me1_v2_0062750, Me1_v2_0062780, Me1_v2_0025170, Me1_v2_0101110, Me1_v2_0123750, Me1_v2_0142010, Me1_v2_0075970, Me1_v2_0216580, Me1_v2_0015260, Me1_v2_0123740, Me1_v2_0132950, Me1_v2_0095800, Me1_v2_0049440, Me1_v2_0216810, Me1_v2_0173040	Mp2g14970, Mp1g18380, Mp4g09490, Mp4g07890, Mp6g19180, Mp6g19260, Mp7g09030, Mp3g21560, Mp5g04520	NA	NA	LOC_Os06g41910, LOC_Os06g22330, LOC_Os02g48190	NA	pm017626.t1, pm191403g0010, pm000119g0020, pm001183g0060, pm001183g0070, pm105382g0010, pm019088g0020, pm007018g0040, pm019651g0010, pm064302g0010, pm005546.t1, pm004228g0050, pm015584.t2, pm002082g0030, pm000120g0040, pm011968g0010, pm006190g0020, pm009560g0020, pm022482.t1, pm019885g0030, pm022482g0010, pm006190g0010, pm009560.t1, pm002495.t1, pm013528g0010, pm009986g0020, pm010158g0010, pm010365.t1, pm019885g0020, pm000959.t2, pm011601g0010, pm029471g0020, pm009634.t1, pm020857g0010, pm004421.t1, pm009739.t1, pm001466g0130, pm014681g0020, pm004421.t2, pm010211g0040, pm004421g0020, pm011599.t1, pm008103g0010, pm002705g0050, pm004300.t1, pm001561g0040, pm002705g0060, pm006138.t2, pm022318g0010, pm002664.t2, pm013769g0010, pm016110g0010, pm006773g0010, pm005897.t1	Pp3c13_10860, Pp3c1_12470, Pp3c3_35060, Pp3c8_1720, Pp3c8_1800, Pp3c4_10730, Pp3c10_23600, Pp3c3_33280, Pp3c17_15940, Pp3c2_7810, Pp3c22_21200, Pp3c21_19210, Pp3c25_6770	Solyc05g015790, Solyc02g082140, Solyc10g005200, Solyc04g082950	77156, 406883	SM000055S18244, SM000040S14801, SM000139S00132, SM000001S04717, SM000127S26614, SM000044S15944, SM000008S22320, SM000006S19472, SM000272S10264, SM000428S16068, SM000171S03216, SM000219S06666, SM000016S01959, SM000024S07767, SM000039S14548, SM000049S16716	Zci1a_00771, Zci1a_38755, Zci1a_37007, Zci1a_05039, Zci1a_16119, Zci1a_24746, Zci1a_31999, Zci1a_40047, Zci1a_08413, Zci1a_40592, Zci1a_29069, Zci1a_10502, Zci1a_40652, Zci1a_40206, Zci1a_28716, Zci1a_05635, Zci1a_43641, Zci1a_15874, Zci1a_34742, Zci1a_37612, Zci1a_33744, Zci1a_04478, Zci1a_04782, Zci1a_37431, Zci1a_20651, Zci1a_08202, Zci1a_18781, Zci1a_00509, Zci1a_38339, Zci1a_38432, Zci1a_11575, Zci1a_07850, Zci1a_32110, Zci1a_35366, Zci1a_30518, Zci1a_18782, Zci1a_31308, Zci1a_38508, Zci1a_18783, Zci1a_44663	Zci_05758, Zci_07729, Zci_05278, Zci_11507, Zci_10583, Zci_02291, Zci_04538, Zci_00693, Zci_02565, Zci_12112, Zci_14538, Zci_14629, Zci_05037, Zci_15416, Zci_15424, Zci_01972, Zci_10002, Zci_13592, Zci_04120, Zci_07591, Zci_13805, Zci_09949, Zci_11032, Zci_02183	UTEX1559_03647, UTEX1559_06866, UTEX1559_13977, UTEX1559_01235, UTEX1559_04612, UTEX1559_14332, UTEX1559_11394, UTEX1559_07974, UTEX1559_08197, UTEX1559_03003, UTEX1559_16555, UTEX1559_12384, UTEX1559_16035, UTEX1559_16036, UTEX1559_17410, UTEX1559_09390, UTEX1559_10397, UTEX1559_10399, UTEX1559_07730, UTEX1559_11777, UTEX1559_05430, UTEX1559_04338, UTEX1559_16804, UTEX1559_04542, UTEX1559_19020, UTEX1559_18679, UTEX1559_10915	UTEX1560_00904, UTEX1560_08353, UTEX1560_09256, UTEX1560_07824, UTEX1560_08483, UTEX1560_11215, UTEX1560_01903, UTEX1560_16110, UTEX1560_09158, UTEX1560_00740, UTEX1560_08836, UTEX1560_14173, UTEX1560_19467, UTEX1560_13069, UTEX1560_13070, UTEX1560_03906, UTEX1560_18179, UTEX1560_06872, UTEX1560_13663, UTEX1560_11499, UTEX1560_06827, UTEX1560_11437, UTEX1560_14357, UTEX1560_15717, UTEX1560_19260, UTEX1560_18218, UTEX1560_12621	Zm00001d046690, Zm00001d037434, Zm00001d017820
Pp3c7_15160	N0.HOG0002766	OG0001894	n4	AagrOXF_evm.TU.utg000018l.359	Azfi_s0137.g051005, Azfi_s0159.g053959	AT5G57850	Bradi2g08250, Bradi3g10127	CBR_g38626, CBR_g41167, CBR_g18754	Chrsp56S06711	NA	CLOP_g9436, CLOP_g18636	520	Me1_v2_0052470, Me1_v2_0074550, Me1_v2_0119540	Mp5g04180	26064	NA	LOC_Os05g15530, LOC_Os02g17330	PRCOL_00001238_RA	pm006684g0020, pm000667g0030, pm006419g0010, pm006684g0010, pm002831g0050, pm006722g0020	Pp3c4_31240, Pp3c7_15160, Pp3c2_23040	Solyc07g062810, Solyc11g071280	230663	SM000129S26141, SM000099S25230, SM000166S02475	Zci1a_20473, Zci1a_25895	Zci_10019, Zci_07494	UTEX1559_07712, UTEX1559_04217, UTEX1559_04216	UTEX1560_08534, UTEX1560_11531	Zm00001d039264, Zm00001d016006
Pp3c6_8620	N0.HOG0003507	OG0002531	n0	AagrOXF_evm.TU.utg000063l.433	NA	AT3G42850, AT4G16130	Bradi3g03620, Bradi1g34327	CBR_g29486	Chrsp103S00005	Cre03.g185300_4532	CLOP_g2182, CLOP_g9701	83	Me1_v2_0066040, Me1_v2_0026270, Me1_v2_0014890, Me1_v2_0066050	Mp1g06320	13697, 13698, 13699	Olucimarinus_89290	LOC_Os02g04840, LOC_Os06g48940	PRCOL_00002758_RA	pm005247g0010, pm012484g0020	Pp3c6_8620, Pp3c16_4920	Solyc07g016160, Solyc07g016170, Solyc08g069231.1	98990	SM000118S25610, SM000122S25794, SM000192S04895	Zci1a_31214	Zci_13073	UTEX1559_15801, UTEX1559_15802, UTEX1559_15803	UTEX1560_15251, UTEX1560_13049	Zm00001d053886, Zm00001d052474, Zm00001d014689
Pp3c2_2750	N0.HOG0001627	OG0001000	n0	AagrOXF_evm.TU.utg000024l.166, AagrOXF_evm.TU.utg000050l.790	Azfi_s0172.g055703, Azfi_s0005.g008956, Azfi_s0017.g014463, Azfi_s0006.g010515	AT5G15330, AT2G26660, AT5G20150, AT2G45130	Bradi1g03160, Bradi1g36610, Bradi3g07470, Bradi1g21510, Bradi1g60250	CBR_g52290, CBR_g55079	Chrsp1S03193	Cre07.g325950_4532	CLOP_g6231	6354	Me1_v2_0103310, Me1_v2_0189010	Mp1g27550	28138, 28136, 28137	Olucimarinus_31447	LOC_Os03g61200, LOC_Os06g40120, LOC_Os02g10780, LOC_Os10g25310, LOC_Os03g29250	PRCOL_00004446_RA	pm008592.t1, pm043517.t1, pm009206.t1	Pp3c17_13877, Pp3c17_13870, Pp3c2_2750, Pp3c1_35820, Pp3c24_4250, Pp3c23_9150, Pp3c8_7050	Solyc02g088210, Solyc02g067160, Solyc08g060920, Solyc12g009480, Solyc01g090890	56716, 85666, 123281, 236690, 230649	SM000171S03215, SM000008S22200, SM000042S15403, SM000216S06552, SM000419S15579, SM001791S03437	Zci1a_32930	Zci_15600	UTEX1559_02123	UTEX1560_04334, UTEX1560_04333	Zm00001d034718, Zm00001d046500, Zm00001d053626, Zm00001d033047, Zm00001d044541, Zm00001d029460
Pp3c25_8320	N0.HOG0009717	OG0008281	n0	NA	Azfi_s0140.g051224	AT3G59090	Bradi2g49980	NA	NA	NA	CLOP_g10361	14556	Me1_v2_0086470	Mp6g15400	NA	NA	LOC_Os01g54784	NA	pm012320g0060	Pp3c6_6380, Pp3c5_22420, Pp3c25_8320	Solyc02g070860	446892, 416368	NA	NA	Zci_03236	UTEX1559_02420	UTEX1560_15708, UTEX1560_18632	Zm00001d043483
Pp3c13_21490	N0.HOG0000671	OG0000359	n0	AagrOXF_evm.TU.utg000076l.38, AagrOXF_evm.TU.utg000091l.345, AagrOXF_evm.TU.utg000058l.104	Azfi_s0003.g007921, Azfi_s0095.g043641, Azfi_s0003.g007529, Azfi_s0114.g046115	AT2G23150, AT5G67330, AT1G47240, AT4G18790, AT1G15960, AT1G80830	Bradi4g03490, Bradi1g14840, Bradi1g70650, Bradi2g13670, Bradi1g53160, Bradi1g53150, Bradi1g32640	CBR_g39755, CBR_g3061	Chrsp78S09214, Chrsp99S08524, Chrsp17S02693	Cre05.g248300_4532, Cre17.g707700_4532, Cre07.g321951_4532	CLOP_g1380, CLOP_g17322, CLOP_g13810, CLOP_g21642, CLOP_g8784, CLOP_g22274, CLOP_g23992, CLOP_g14025	8697, 3833, 2986	Me1_v2_0049660, Me1_v2_0011560, Me1_v2_0100990, Me1_v2_0067300, Me1_v2_0211960	Mp4g07480, Mp4g12740, Mp4g10130, Mp4g20480, Mp7g11150	26637, 17749, 493, 494, 9785	Olucimarinus_2189, Olucimarinus_27409	LOC_Os12g39180, LOC_Os03g41064, LOC_Os03g41070, LOC_Os03g11010, LOC_Os01g53210, LOC_Os02g03900, LOC_Os01g31870, LOC_Os07g15370, LOC_Os07g15460, LOC_Os06g46310	PRCOL_00004970_RA	pm002928g0030, pm007353g0030, pm003509g0020, pm009093g0020, pm002109g0020, pm002268g0020, pm007346g0020, pm006621.t1, pm040036g0010, pm000140g0070, pm008549g0020, pm004625g0020	Pp3c2_37310, Pp3c1_10690, Pp3c7_20820, Pp3c4_30390, Pp3c13_21490, Pp3c3_11850	Solyc04g078230.1, Solyc02g092800, Solyc04g078250, Solyc11g018530.2, Solyc03g116900	417169, 173368, 407690, 85390, 86387, 122391	SM000186S04152, SM000006S19457, SM000024S07873, SM001387S00009, SM000657S20139, SM001325S26678, SM000005S17285, SM000041S15515, SM000060S19638	Zci1a_10371, Zci1a_19506, Zci1a_19509, Zci1a_24739	Zci_00971, Zci_09044, Zci_11082	UTEX1559_07953, UTEX1559_07462, UTEX1559_01966, UTEX1559_01965, UTEX1559_01967	UTEX1560_01785, UTEX1560_17301, UTEX1560_06615, UTEX1560_06616	Zm00001d030846, Zm00001d033367, Zm00001d048129, Zm00001d015133, Zm00001d007397, Zm00001d019327, Zm00001d005479, Zm00001d014391
Pp3c3_17780	N0.HOG0002905	OG0002010	n8	NA	Azfi_s0301.g063670, Azfi_s0032.g024613	AT2G25070, AT4G31860	Bradi3g48281, Bradi3g43440, Bradi3g43430, Bradi5g14713, Bradi5g14730, Bradi3g05990, Bradi1g31080, Bradi4g37710	NA	NA	NA	NA	NA	NA	NA	NA	NA	LOC_Os04g42260, LOC_Os02g08364, LOC_Os06g44210, LOC_Os09g38550	NA	NA	Pp3c13_14120, Pp3c4_17160, Pp3c3_17780	Solyc08g074230.1, Solyc08g069233.1, Solyc08g006060, Solyc12g042570	230326, 34798	NA	NA	NA	NA	NA	Zm00001d025780, Zm00001d015504, Zm00001d036710, Zm00001d018815, Zm00001d039151, Zm00001d047200, Zm00001d046828, Zm00001d046831, Zm00001d021390
