0.9523809523809523	0.9736247174076865	0.9689922480620154	0.9681603773584906	0.9787610619469027	0.9620637329286799	0.9905149051490515	0.9774951076320939	0.9415282392026578	0.9899103139013453	0.9946949602122016	0.9854014598540146	0.995774647887324	1	0.9479048697621744	0.9853403141361257
0.9857270294380018	0.9372804816859006	0.9829842931937173	0.9631277813095995	0.9714593430263867	0.9794472005669738	0.9474053295932678	0.8981804103755323	0.9578527062999113	0.9506016466117796	0.9573002754820936	0.9324468085106383	0.9861973775017253	0.9983593109105825	0.963076923076923	0.944954128440367
0.8328115216030056	0.9917355371900827	0.9485294117647058	0.96875	0.9436619718309859	0.983218163869694	0.9898148148148148	0.9854227405247813	0.9239733629300777	0.9861788617886179	0.9917808219178083	0.9834500318268619	0.9846596356663471	0.9975278121137207	0.952341824157765	0.9977134146341463
0.9838472834067548	0.978369384359401	0.9847094801223242	0.9444444444444444	0.972809667673716	0.9889705882352942	0.9867330016583747	0.9732283464566929	0.988911988911989	0.9745989304812834	0.9967845659163987	0.9882246376811594	0.9965337954939342	0.9908536585365854	0.9271255060728745	0.9915458937198067
0.9662921348314607	0.9855907780979827	0.9694749694749695	0.9377162629757786	0.9140271493212669	0.9832869080779945	0.9845956354300385	0.9575402635431918	0.9870210135970334	0.9512735326688815	0.995	0.9906614785992218	0.993368700265252	1	0.9605543710021321	0.9940535183349851
0.988962472406181	0.9816053511705686	0.9907407407407407	0.9776223776223776	0.9849246231155779	0.9655172413793104	0.9726495726495726	0.9843423799582464	0.9642601858470335	0.977027027027027	0.9884678747940692	0.9683131407269339	0.9839285714285715	1	0.9725130890052356	0.9764267990074442
0.9886547811993517	0.9935483870967742	0.9787234042553191	0.9983443708609272	0.9977324263038548	0.9902439024390244	0.9893617021276596	0.9977973568281938	0.9373493975903614	0.9984126984126984	0.9812108559498957	0.9876160990712074	0.9697674418604652	0.9896373056994818	0.9969558599695586	0.9942446043165467
0.9933628318584071	0.8847184986595175	0.9795918367346939	0.9729493891797557	0.9958620689655172	0.979296066252588	0.9913294797687862	0.964053702901689	0.9472222222222222	0.9941471571906354	0.9856459330143541	0.8875358166189111	0.998025666337611	1	0.9505541346973572	0.9573420836751436
0.9263480929416923	0.9929732103645147	0.9521212121212121	0.9738636363636364	0.9117954070981211	0.9772007599746675	0.9679802955665024	0.9444444444444444	0.8871252204585538	0.9567198177676538	0.9606153846153846	0.9722091380122468	0.9233791748526523	0.9949604031677466	0.9740761169332598	0.98989898989899
0.7511551155115511	0.9959514170040485	0.9507609668755596	0.9728618421052632	0.9231853417899929	0.9846449136276392	0.9973118279569892	0.9860082304526749	0.948690539818279	0.981629392971246	0.9928825622775801	0.9962940086473131	0.9860074626865671	0.9988066825775657	0.9796397807361003	0.9970126960418223
0.9899152884227511	0.9418657052726453	0.9886621315192744	0.9729580573951435	0.9576229907452508	0.9829476248477467	0.9578567128236002	0.8418674698795181	0.9712804148384523	0.9241733181299886	0.9468599033816425	0.9443133553563001	0.9752714113389626	0.9965421853388658	0.9824654622741764	0.9420995670995671
0.9974380871050385	0.9840319361277445	1	0.980806142034549	0.9887640449438202	0.9970501474926253	1	0.9789473684210527	0.9967871485943776	0.9872727272727273	1	0.9988962472406181	0.9972826086956522	1	0.9896373056994818	0.9983974358974359
0.998139534883721	0.8329439252336448	0.9950946040644709	0.9899732620320856	0.9938167509836987	0.9877300613496932	0.9830633284241531	0.8954619124797407	0.9812614259597806	0.9901445466491459	0.9787545787545787	0.9035444509006392	0.9970260223048327	0.9981801637852593	0.9870550161812298	0.8752627890679747
1	0.9691011235955056	1	0.9749582637729549	0.9943693693693694	1	0.9937629937629937	0.9421631000578369	1	0.9905362776025236	0.9979838709677419	0.9989888776541962	1	1	0.9954887218045113	0.9842180774748924
0.9857142857142858	0.9968253968253968	0.9736070381231672	0.9974193548387097	0.9787234042553191	0.9737302977232924	0.9858934169278997	0.99444724886421	0.9252336448598131	0.9924717691342535	0.9751552795031055	0.9470319634703196	0.9558573853989814	0.9945205479452055	0.977859778597786	0.9883855981416957
1	0.9887983706720977	1	0.9940357852882704	0.9987244897959183	0.9936102236421726	0.9919571045576407	0.979845880260818	0.9991823385118561	0.9924242424242424	0.9974226804123711	0.9954441913439636	1	1	0.998211091234347	0.9915966386554622
