"0","condition <- targets$condition"
"0","condition <- factor(condition)"
"0","replicate <- targets$replicate"
"0","replicate <- factor(replicate)"
"0",""
"0","library(plotly)"
"0","pca.res <- prcomp(t(v.DEGList.filtered.norm$E), scale.=F, retx=T)"
"0","pc.var<-pca.res$sdev^2 # sdev^2 captures these eigenvalues from the PCA result"
"0","pc.per<-round(pc.var/sum(pc.var)*100, 1)"
"0","pca.res.df <- as_tibble(pca.res$x)"
"0",""
"0","pca.plot <- ggplot(pca.res.df) +"
"0","  aes(x=PC1, y=PC2, label=sampleLabels, shape = replicate, color = condition) +"
"0","  geom_point(size=4) +"
"0","  stat_ellipse() +"
"0","  xlab(paste0(""PC1 ("",pc.per[1],""%"","")"")) +"
"0","  ylab(paste0(""PC2 ("",pc.per[2],""%"","")"")) +"
"0","  labs(title=""PCA plot"","
"0","       caption=paste0(""produced on "", Sys.time())) +"
"0","  coord_fixed() +"
"0","  theme_bw()"
"0","ggsave(filename = ""plots/PCA_beautiful.pdf"", pca.plot, width = 15, height = 15)"
"0",""
"0","pca.plot <- ggplot(pca.res.df) +"
"0","  aes(x=PC1, y=PC2, label=sampleLabels, shape = replicate, color = condition) +"
"0","  geom_point(size=4) +"
"0","  geom_label() +"
"0","  stat_ellipse() +"
"0","  xlab(paste0(""PC1 ("",pc.per[1],""%"","")"")) +"
"0","  ylab(paste0(""PC2 ("",pc.per[2],""%"","")"")) +"
"0","  labs(title=""PCA plot"","
"0","       caption=paste0(""produced on "", Sys.time())) +"
"0","  coord_fixed() +"
"0","  theme_bw()"
"0","ggsave(filename = ""plots/PCA.pdf"", pca.plot, width = 15, height = 15)"
"0",""
"0","ggplotly(pca.plot)"
