HOG	Jannotate	ath_blast_symbol
N0.HOG0005670	NA	PRPL11
N0.HOG0000003	LRR SPS Kinases	LRR XI-23, RLK7, GSO1, SGN3, EDA23, GSO2, FLS2, FEI1, FEI2, SRF8, CARK3, PTI1-4, CARK1, CARK6, MAZ, MRI, MLLR4, LLR4, LLR3, MLLR3, AtRLP16, RLP16, PBL28, SIMP1, PERK5, AtPERK5, AtPERK7, PERK7, AtPERK6, PERK6, PERK4, AtPERK4, PERK1, ATPERK1, AtPERK3, PERK3, AtPERK15, PERK15, PERK14, PERK11, AtPERK11, IGI1, PERK12, AtPERK12, PERK13, RHS10, AtPERK13, PERK8, AtPERK8, PERK10, AtPERK10, PERK9, AtPERK9, ALE2, CDG1, PBL21, ASG5, PBL22, LIP2, PBL5, LIP1, PBL43, PBL26, PBL24, PBL25, PBL23, PBL41, PBL6, CDL1, PBL7, PBL27, PBS1, PBL20, PBL19, PBL37, PBL38, PCRK1, PBL39, PCRK2, PBL40, PBL36, PBL35, PBL34, SGN1, PBL15, RIPK, PBL14, PBL13, PBL12, ARSK1, PBL33, PBL17, PBL16, PBL8, PBL32, Kin3, CST, Kin4, PBL30, CX32, PBL31, PBL29, PBL4, PBL18, APK2A, PBL2, Kin1, PBL3, APK2B, Kin2, APK1A, APK1, PBL9, PBL10, APK1B, PK1B, BIK1, PBL1, NAK, PBL11
N0.HOG0000511	mTERF4-like	NA
N0.HOG0000225	NA	OXI1, AGC2, AtOXI1, AGC2-1, UCN, AGC2-3, AGC2-4, UCNL, RPT1, PHOT1, JK224, NPH1, PHOT2, AtPHOT2, NPL1, PLPA, PLPB, PLPC, PLP, AGC1-12, D6PKL3, ATPK7, D6PKL2, PK5, D6PKL1, AGC1-2, AGC1-1, D6PK, PAX, AGC1-3, AGC1-4, PAXL, AGC1, RSH3, AGC1-6, AGC1-8, AGC1-9, KIPK, AGC1-10, PID2, WAG1, PK3AT, WAG2, ABR, PID
N0.HOG0007120	NA	ELF3, PYK20
N0.HOG0003336	NA	NA
N0.HOG0004781	ATXR3	ATXR3, SDG2
N0.HOG0003685	NA	bZIP23, AtbZIP23, bZIP19, AtbZIP19, ATBZIP24, BZIP24
N0.HOG0001097	NA	ATU2AF65B, U2AF65b, ATU2AF65A
N0.HOG0003683	NA	emb1345, CIA1
N0.HOG0000466	NA	MYBC1, LUX, PCL1, BOA
N0.HOG0000164	NA	OBP1, DOF3, ATDOF5, SCAP1, DOF4, DOF1, ADOF1, DOF2, ADOF2, AtDOF5, OBP4, DOF6, TMO6, DOF5, DAG2, DAG1, VDOF1, Dof4, DOF1, VDOF2, DOF5, HCA2, DOF4, AtDOF4, ITD1, DOF2, OBP2, URP3, OBP3, ATDOF2, DOF2, PEAR1, PEAR2, CDF3, CDF1, CDF2, COG1, CDF4, CDF5, CDF6
N0.HOG0005951	NA	NA
N0.HOG0002310	NA	PMH1, ATRH9, PMH2, ATRH53, AtRH3, RH3, emb1138
N0.HOG0000163	PLAC8 (PCR)	PCR1, AtPCR1, AtPCR2, PCR2, PCR11
N0.HOG0000409	NA	FH19, AtFH19, AtFH16, FH16, FH13, AtFH14, AFH14, ATFH6, FH6, FH2, FH10, FH9, AFH1, AHF1, FH1, ATFH1, FH11, Fh5, ATFH5, FORMIN7, FORMIN 8, FH8, ATFH8, FH4, ATFH4
N0.HOG0000730	NA	RTNLB10, BTI1, RTN1, RTNLB1, BTI2, RTNLB2, RTN2, RTNLB3, RTN3, RTNLB4, BTI3, RTNLB5, RTN6, RTNLB6, RTNLB7, RTNLB8, RTNLB9
N0.HOG0006952	NA	GNAT5
N0.HOG0004708	NA	atg16
N0.HOG0001530	CYB-1,-2	ACYB-1, CYB-1, ACYB-2
A_Z_per_V_A_Z	NA	NA
N0.HOG0002184	NA	ATNTRA, NTRA, NTR2, ATNTRB, NTR1, NTRB, NTRC
N0.HOG0000128	Kelch repeat F-Box (SAGL/AFR)	KFB39, KMD3, KMD4, AtKFB50, KFB50, KFB01, KMD2, KFB20, KMD1, AFR, SKIP4, SAGL1
N0.HOG0001875	NA	EMB1135, FGT1
N0.HOG0008640	NA	NA
N0.HOG0000294	CESA	ATCESA7, MUR10, IRX3, CESA7, CESA8, LEW2, IRX1, ATCESA8, IRX5, NWS2, CESA4, CESA5, MUM3, IXR2, PRC1, E112, CESA6, CESA9, CESA09, ATH-A, CESA2, ATCESA2, CESA10, CESA1, AtCESA1, RSW1, ANY1, CEV1, IXR1, ELI1, ATH-B, CESA3, MRE1, ATCESA3, ATCSLD6, CSLD6, ATCSLD5, CSLD5, SOS6, CSLD3, KJK, RHD7, ATCSLD3, CSLD2, ATCSLD2, CSLD1, ATCSLD1, ATCSLD4, CSLD4
N0.HOG0001272	NA	BZR1, BES1, BZR2, BEH2, BEH1, BEH4, BEH3
N0.HOG0000628	NA	JMJ14, PKDM7B, PHD3, JMJ18, JMJ15, MEE27, PKDM7C, PKDM7D, JMJ16
N0.HOG0002689	NA	emb1579, RSA1
N0.HOG0000240	MAGL	MAGL14, MAGL16, CSE, LysoPL2, AtMAGL3, MAGL1, MAGL15, MAGL5, MAGL9, MAGL12, MAGL11, MAGL6, MAGL10, MAGL7, MAGL8, MAGL2, MAGL4, MAGL13
N0.HOG0008502	NA	NA
N0.HOG0000226	EXORDIUM-like	EXL3, EXL5, EXL7, EXL6, EXO, HUP46, PHI-1, EXL1, EXL4, EXL2
N0.HOG0000694	PDE339	PDE339
N0.HOG0000669	NA	ALA6, ALA7, ALA4, ALA5, ALA11, ACA.l, ALA10, ALA9, ALA12, ALA8
N0.HOG0004710	NA	NA
N0.HOG0001321	NA	JMJ29, JMJ26, IBM1, JMJ24, JMJ28, B160, JMJ27, AtJMJ17
N0.HOG0000621	COBL	COBL5, AtCOBL4, IRX6, COBL4, COB, COBL1, COBL2, COBL6, COBL10, COBL11, COBL9, SHV2, MRH4, DER9, COBL8, ATSEB1, COBL7, SEB1
N0.HOG0000187	NA	bHLH014, bHLH14, MYC4, MYC3, JAI1, ZBF1, JIN1, ATMYC2, MYC2, RD22BP1, MYC5, ATNIG1, bhlh28, NIG1, bHLH3, bHLH003, JAM3, bHLH03, bHLH13, bHLH013, JAM2, ATAIB, bHLH017, bHLH17, JAM1, AIB, AtTT8, BHLH42, TT8, myc1, ATMYC1, EGL1, ATMYC-2, EGL3, AtEGL3, GL3, MYC6, DYT1, AMS, NFL, bHLH093, ICE2, SCRM2, SCRM, ICE1, SCREAM, ATICE1, NAI1
N0.HOG0000468	Pleckstrin (EDR)	EDR2
N0.HOG0005238	NA	NA
N0.HOG0000712	NA	REV3, ASG4, RVE5, LCL5, RVE8, LCL1, RVE4, RVE6
N0.HOG0000481	DEG18,AIR12	Araport11, DEG18, AIR12
N0.HOG0000059	TBL	TBL18, YLS7, TBL17, TBL25, MOAT3, TBL26, MOAT4, TBL24, MOAT2, MOAT1, TBL23, TBL21, TBL19, TBL20, AXY4L, TBL22, AXY4, TBL27, TBL16, TBL15, TBL14, TBL13, TBL12, TBL5, TBL2, TBL1, TBR, TBL4, TBL6, TBL10, TBL11, TBL8, TBL9, TBL7, TBL36, TBL30, TBL28, ESK1, XOAT1, TBL29, TBL33, TBL32, TBL34, TBL35, TBL31, TBL3, TBL45, TBL44, PMR5, TBL42, TBL43, TBL41, TBL38, TBL37, TBL39, TBL40
N0.HOG0002198	NA	ATCPSF30, OXT6, CPSF30
N0.HOG0000832	NA	HAP5A, NF-YC1, ATHAP5A, NF-YC4, NF-YC5, NF-YC8, NF-YC7, NF-YC6, NF-YC12, NF-YC10, NF-YC3, NF-YC9, HAP5C, HAP5B, ATHAP5B, NF-YC2
N0.HOG0000507	NA	CKI1, ATHK1, HK1, AHK1
N0.HOG0001148	NA	ATNDK1, NDPK1, NDK1, NDPK3, NDPK2, NDPK IA, NDPK IA IA, NDPK1A, ATNDPK2
N0.HOG0000122	NA	PAB1, PSRP2, PDE322, CP33, CP29, ATRBP33, ATRBP31, CP31A, RBP31, CP33a, CP31, CP31B, RBGA3, GR-RBP7, CCR2, ATGRP7, GRP7, SRBP1, RBGA6, CCR1, ATGRP8, GR-RBP8, GRP8, RZ-1b, RBGB1, AtRZ-1b, RZ-1c, RBGB3, AtRZ-1c, RZ-1A, ATRZ-1A, RBGB2
N0.HOG0000742	MAPK	ATMPK7, MPK7, MPK14, ATMPK14, ATMPK1, MPK1, MPK2, ATMPK2, ATMPK13, MPK11, ATMPK11, MPK4, ATMPK4, MAPK4, MPK12, ATMPK12, MAPK12, ATMPK5, MPK5, MPK10, ATMPK10, MPK6, ATMPK6, MAPK6, ATMAPK6, ATMAPK3, ATMPK3, MPK3
N0.HOG0000049	WRKY I, II, III	MINI3, WRKY10, ATWRKY10, WRKY50, ATWRKY50, ATWRKY59, WRKY59, ATWRKY51, WRKY51, ATWRKY13, WRKY13, WRKY12, AtWRKY12, WRKY43, ATWRKY43, WRKY56, ATWRKY56, WRKY24, ATWRKY24, WRKY45, ATWRKY45, WRKY75, ATWRKY75, ATWRKY71, EXB1, WRKY71, ATWRKY28, WRKY28, ATWRKY8, WRKY8, ATWRKY23, WRKY23, WRKY68, AtWRKY68, ATWRKY48, WRKY48, ATWRKY57, WRKY57, WRKY27, ATWRKY27, AtWRKY22, WRKY22, AR411, WRKY14, ATWRKY14, AtWRKY35, MEE24, WRKY35, ATWRKY29, WRKY29, ATWRKY65, WRKY65, WRKY69, ATWRKY69, TRP, WRKY39, ATWRKY39, WRKY74, ATWRKY74, WRKY21, WRKY7, ATWRKY7, AtWRKY15, WRKY15, ATWRKY17, WRKY17, ATWRKY11, WRKY11, ATWRKY66, WRKY66, ATWRKY67, WRKY67, WRKY63, ABO3, ATWRKY63, ATWRKY64, WRKY64, WRKY38, ATWRKY38, WRKY62, ATWRKY62, ATWRKY46, WRKY46, ATWRKY70, WRKY70, WRKY54, ATWRKY54, WRKY30, ATWRKY30, ATWRKY55, WRKY55, WRKY41, AtWRKY41, ATWRKY53, WRKY53, WRKY49, ATWRKY49, ATWRKY72, WRKY72, WRKY61, ATWRKY61, ATWRKY36, WRKY36, ATWRKY9, WRKY9, WRKY47, AtWRKY47, WRKY6, ATWRKY6, WRKY31, ATWRKY31, AtWRKY42, WRKY42, ATWRKY40, WRKY40, WRKY60, ATWRKY60, WRKY18, ATWRKY18
N0.HOG0000080	MRPs	AtABCC13, MRP11, ABCC13, ATMRP11, ATMRP6, ABCC8, MRP6, ATMRP14, MRP14, ABCC10, ABCC5, ATABCC5, MRP5, ATMRP5, ABCC15, MRP15, ATMRP15, MRP9, ABCC9, ATMRP9, NAP5, ATNAP5, MRP3, ATMRP3, ABCC3, ABCC7, ATMRP7, MRP7, MRP8, ABCC6, ATMRP8, ABCC4, ATMRP4, MRP4, EST3, MRP10, ABCC14, ATMRP10
N0.HOG0000369	NA	NIK1, AtNIK1, NIK2, AtNIK2, CLERK, CIK2, SARK, CIK3, CIK1, AtNIK3, NIK3, CIK4, RKS10, ELG, ATSERK3, BAK1, ATBAK1, SERK3, ATSERK5, SERK5, BAK8, BKK1, ATSERK4, SERK4, BAK7, SERK2, ATSERK2, ATSERK1, SERK1
N0.HOG0001086	NA	AtGBF1, GBF1, AtbZIP68, bZIP68, AtbZIP16, bZIP16, GBF3, GBF2, ATBZIP54
N0.HOG0003712	NA	ATRBR1, RBR1, RB1, RB, RBR
N0.HOG0001694	NA	SRO4, SRO5, SRO3, SRO2, RIMB1, ATP8, RCD1, CEO, CEO1, AtRCD1, SRO1
N0.HOG0003377	NA	SKB1, AtPMRT5, CAU1, PRMT5
N0.HOG0000770	NA	TIFY11B, JAZ6, TIFY11A, JAZ5, TIFY10B, JAZ2, JAZ1, TIFY10A, AtJAZ1, JAZ11, TIFY3A, JAZ12, TIFY3B, TIFY8, AtJAZ4, JAZ4, TIFY6A, JAZ3, JAI3, TIFY6B, JAZ9, TIFY7, PPD1, TIFY4A, PPD2, TIFY4B
N0.HOG0000348	NA	ABI3, AtABI3, SIS10, FUS3, LEC2, AtLEC2, NGAL1, ABS2, SOD7, NGAL2, NGAL3, DPA4, EDF1, AtTEM1, TEM1, AtRAV2, EDF2, TEM2, RAP2, RAV2, AtRAV1, RAV1, EDF4, EDF3, NGA1, NGA2, NGA3, NGA4, VAL3, VAL1, HSI2, HSI2-L1, HSL1, VAL2
N0.HOG0001273	NA	DRB2, AtDRB2, DRB3, DRB5, HYL1, AtDRB1, DRB1, DRB4, ATTIF3K1
N0.HOG0004271	NA	ERD15, CID1, LSR1
N0.HOG0005745	NA	NA
N0.HOG0000099	NA	RHC1, bige1b, MATE45, bige1a, ABS4, ZF14, BCD1, ZRZ, AtDTX50, DTX50, ADP1, ADS1, ABS3, ELS1, DTX14, ATDTX1, DTX1, TX1, ATTT12, TT12, DTX18, ALF5
N0.HOG0001421	NA	BAG1, ATBAG1, BAG3, ATBAG3, BAG2, ATBAG2, ATBAG4, BAG4
N0.HOG0001676	NA	NUDT4, atnudt4, NUDT21, atnudt21, NUDT18, atnudt18, atnudt17, NUDT17, NUDT12, atnudt12, ATNUDX13, ATNUDT13, NUDX13, atnudt16, NUDT16
N0.HOG0000599	NA	LHCA21, Lhca6, LHCA2
N0.HOG0006712	NA	STRS1, RH5
N0.HOG0001758	NA	AtXRN3, XRN3, XRN2, AtXRN2, XRN4, ATXRN4, AIN1, EIN5
N0.HOG0000509	NA	ORE15, PLATZ3, PLATZ7, RITF1, PLATZ10, PLATZ11, AIN1, PLATZ1, PLATZ2
N0.HOG0001132	NA	PRE2
N0.HOG0005661	NA	NA
N0.HOG0000227	NA	NAKR2, AtHMP21, NAKR3, AtHMP30, AtHMP18, NAKR1, NPCC6, AtHMP42, AtHMP27, AtHMP25, AtHMP46, AtHMP23, AtHMP05, AtHMP50, AtHMP10, AtHMP49, AtHMP44, HIPP24, AtHMP33, AtHMP41, ATFP6, FP6, HIPP26, AtHMP40, HIPP25, AtHMP39, HIPP27, AtHMP55, AtHMP45, HIPP21, AtHMP04, HIPP22, AtHMP15, HIPP20, AtHMP34, HIPP44, AtHMP16, AtHMP29, AtHMP07, AtHMP02, AtHMP32, AtHMP26, AtHMP31, CCH, AtHMP14, ATX1, ATATX1
N0.HOG0003344	NA	ACG1, NFC4, ATMSI4, MSI4, FVE, NFC04, NFC5, MSI5
N0.HOG0001635	NA	TRR14, PTAC18
N0.HOG0004426	NA	CRM1B, XPO1B, ATCRM1, ATXPO1, XPO1, HIT2, XPO1A
N0.HOG0000744	NA	ZFN2, ZFN1, PNT1, ZFN3, HUA1
N0.HOG0008602	NA	SBP3, EDA38, SBP2, SBP1, AtSBP1
V_A_Z_per_Chla_b	NA	NA
N0.HOG0000723	NA	mTERF 3, EMB3114, SL1, mTERF10, EMB93, SOLDAT10, mTERF11, EMB2219
N0.HOG0006523	NA	ISPF, MECPS
N0.HOG0009392	NA	NA
N0.HOG0000108	HSPs	HSP21, HSP26, HSP17B, HSP17II, AT-HSP17A, HSP17A, HSP17, ACD31, ACD32, HSP15, HSP17, HSP17A, HSP18, HSP17C, HSP17, ATHSP17, ATHSP22, HSP22
N0.HOG0004761	NA	AtHMP03, ATCCS, CCS
N0.HOG0003202	NA	ABD1
N0.HOG0004520	NA	epsilon1-COP, epsilon2-COP
N0.HOG0006168	NA	CYP71, AtCYP71
N0.HOG0007234	NA	LPAT5, LPAT4
N0.HOG0001081	NA	NA
N0.HOG0000156	ETR	ETR, EIN1, RDO3, ETR1, AtETR1, ERS1, ERS, EIN4, ETR2, ERS2
N0.HOG0009149	NA	NA
N0.HOG0004334	NA	FLU
N0.HOG0003621	NA	DPB, ATDPB, DPA
N0.HOG0004432	NA	AtPARK13, PARK13, DEG14
N0.HOG0002194	NA	NHX8, ATNHX8, ATNHX7, ATSOS1, SOS1
N0.HOG0005383	NA	PIA1, PIA2, ANK6
beta_Car_per_beta_Io	NA	NA
N0.HOG0003580	NA	NA
N0.HOG0004772	NA	AtGRXS17, GRXS17
N0.HOG0003744	NA	PSY
N0.HOG0000411	NA	BZIP9, ATBZIP9, BZO2H2, BZO2H4, BZIP25, ATBZIP25, BZO2H1, ATBZIP10, bZIP63, AtbZIP63, BZO2H3, bZIP4, ATBZIP4, bZIP1, AtbZIP1, bZIP5, AtbZIP5, AtbZIP6, bZIP6, AtbZIP7, bZIP7, AtbZIP58, bZIP58, AtbZIP48, bZIP48, bZIP70, AtbZIP70, AtbZIP75, bZIP75, AtbZIP, bZIP, ATBZIP42, bZIP42, AtbZIP43, bZIP43, AtbZIP3, bZIP3, ATBZIP53, BZIP53, GBF5, ATBZIP2, bZIP2, FTM3, bZIP44, AtbZIP44, BZIP11, ATB2, GBF6, AtbZIP11
N0.HOG0001232	NA	LFG5, AtLFG5, GAAP1, LFG1, AtLFG1, GAAP2, BIL4, AtLFG2, LFG2, AtLFG4, LFG4, GAAP3, LFG3, AtLFG3
N0.HOG0000095	GRUSP	GRUSP, USP, AtUSP, USP17, HRU1, RD2, ATPHOS34, PHOS34, USP21, ATPHOS32, PHOS32
N0.HOG0000289	OSCA	ERD4, OSCA3, ATHYP1, OSCA2, HYP1, RXW8, OSCA1, CSC1, OSCA1, osca1, OSCA1
N0.HOG0000057	bHLH (PIF1-8)	PFB2, bHLH007, bHLH059, PFB1, UNE12, DROP1, LRL1, DROP2, LRL2, DROP3, LRL3, RSF1, REP1, HFR1, FBI1, bHLH48, bHLH60, BPEp, BPE, ZCW32, BPEub, CIL2, CIB3, CIB2, CIB4, CKG, CES, HAF, BEE1, BEE3, CIB1, HBI1, BEE2, bHLH49, CIL1, CIB5, BIM3, BIM1, BIM2, RHD6, AtRHD6, RSL1, ATRSL1, RSL4, RSL5, RSL2, HEC3, IND, GT140, IND1, EDA33, HEC2, HEC1, ROX, AKS1, CFLAP1, FBH3, FBH4, AKS3, AKS2, bHLH129, SPT, ALC, PIF1, PIL5, PIF3, PAP3, POC1, PIL1, PIL2, PIF6, SRL2, AtPIF4, PIF4, bHLHb1, A-PUT2, PIF5, PIL6, PIF7, PIF8, UNE10
N0.HOG0000717	NA	HVA22D, ATHVA22D, HVA22E, ATHVA22E, ATHVA22B, HVA22B, ATHVA22C, HVA22C, ATHVA22A, HVA22A, HVA22F
N0.HOG0000428	NA	ATBPM4, BPM4, ATBPM6, BPM6, BPM5, ATBPM5, ATBPM2, BPM2, BPM1, ATBPM1, BPM3, ATBPM3
N0.HOG0000978	NA	AAE7, BZU1, ACN1, AAE2, AAE9, AAE5, AtAAE11, AAE11, BZO1, AAE12, AAE1
N0.HOG0000452	NA	PLDBETA, PLDBETA1, PLDBETA2, PLDGAMMA1, MEE54, PLDGAMMA3, PLDGAMMA2, PLDDELTA, ATPLDDELTA
N0.HOG0000738	NA	TLP6, AtTLP6, AtTLP2, TLP2, TLP5, AtTLP5, AtTLP10, TLP10, AtTLP1, TLP1, TLP7, AtTLP7, AtTLP3, TLP3, TLP4, AtTLP4, ATTLP9, TLP9, AtTLP11, TLP11
N0.HOG0003690	NA	CPN10
N0.HOG0001041	NA	WOX9A, STIP, HB-3, WOX9, WOX9B, STPL, WOX8, WUS, WUS1, PGA6, WOX6, PFS2, HOS9, WOX5B, WOX5, WOX5A, WOX7, WOX4, WOX2, PRS1, WOX3, PRS, WOX13B, WOX10, WOX14, ATWOX14, HB-4, ATWOX13, WOX13
N0.HOG0003286	NA	SIZ1, ATSIZ1
N0.HOG0000391	DEG24, RBCS 1A, 1B, 2B,3B	DEG24, RBCS2B, RBCS1B, RBCS1A, RBCS3B
N0.HOG0009414	NA	PRP17, CDC40
N0.HOG0004508	NA	SEC31A, SEC31B
N0.HOG0000054	Subtilases (e.g., ALE1)	ALE, ALE1, SLP3, ATSBT3, UNE17, SBT3, AtSBT3, SBT3, ATSBT3, SBT3, SBT3, ATSBT3, SBT4, ATSBT4, XSP1, SBT5(b), SBT5(a), CRSP, ATSBT5, SBT5, ATSBT5, AIR3, SDD1, AtSDD1, SBT1, ATSBT1, SBTI1, SLP2, ATSBT1, SBT1, ARA12, SBT1, SASP
N0.HOG0000469	NA	AKR4C8, AKR4C10, AKR4C11, AKR4C9, ChlAKR
N0.HOG0000094	PUBs	PUB3, AtPUB4, PUB4, PUB2, B80, PUB8, PUB26, PUB25, atPub30, PUB31, PUB24, PUB23, AtPUB23, PUB22, AtPUB22, CMPG1, ATCMPG1, CMPG5, PUB21, PUB29, ATPUB29, ATCMPG2, CMPG2, PUB28, PUB17, ATPUB17, PUB16, AtPUB19, PUB19, ATPUB18, PUB18, PUB11, PUB10, PUB15, PUB46, PUB47, PUB48, PUB9, ATPUB9, ATPUB13, PUB13, AtPUB12, PUB12, PUB14, ATPUB14
N0.HOG0000107	LHCB	LHCB3, LHCB31, LHCB2, DEG13, LHCB2, LHCB2, LHCB2, LHCB2, DEG11, LHCB1, LHB1B1, LHCB1, LHB1B2, LHCB1, AB140, CAB140, CAB1, CAB3, LHCB1, AB180, AB165, CAB2, LHCB1
N0.HOG0000631	NA	JMJ17
N0.HOG0000209	NA	NA
N0.HOG0001166	NA	ATMKK4, MKK4, ATMEK4, ATMAP2K_ALPHA, ATMKK5, ATMEK5, MAP2K_A, MEK5, MKK5, MKK10, ATMKK10, ATMKK8, MKK8, MKK9, ATMKK9, BUD1, MKK7, ATMKK7, MKK1, NMAPKK, MEK1, ATMEK1, ATMKK2, MKK2, MK1, MKK6, SUMM4, ATMKK6, ANQ1
N0.HOG0000422	GT11, 13,18,XLT2	XUT1, RHS8, AtMUR3, MUR3, KAM1, RSA3, ATGT13, GT13, GT11, GT18, ATGT18, XLT2
N0.HOG0006768	NA	TRM82, AtTRM82
N0.HOG0001743	NA	DAR3, DAR7, DAR6, DAR5, DAR2, LRD3, DAR1, DA1
N0.HOG0000083	NA	A39, A36, NANA, ASPG1, AED1, ASPR1, CDR1, ECS1, ECS2
N0.HOG0000779	NA	SIGE, ATSIG5, SIG5, SIG1, SIGA, SIGB, SIG2, RPOD1
N0.HOG0003279	NA	CP12, CP12-1, CP12, CP12-2, CP12-3
N0.HOG0006851	NA	ALNS, TTL
N0.HOG0000103	PEN/PDR	ABCG29, AtABCG29, ATPDR1, PDR1, ABCG36, ATABCG36, PEN3, PDR8, ATPDR8, ATPDR7, ABCG35, PDR7, ABCG42, ABCG43, ATPDR13, ABCG41, PDR13, PDR2, ABCG30, ATPDR2, ATPDR5, PDR5, ABCG33, ABCG37, PIS1, ATPDR9, PDR9, ABCG39, ATPDR11, PDR11, ABCG34, AtABCG34, PDR6, ATPDR6, ATABCG40, ABCG40, PDR12, ATPDR12, PDR10, ABCG38, ATPDR10, PEC1, PDR4, ATPDR4, ABCG32, AtABCG32, ATPDR3, ABCG31, PDR3
N0.HOG0002071	NA	ABHD11
N0.HOG0000550	NA	CXXS1, ATCXXS1, TRX H9, ATH9, TRXh9, TH9, CXXS2, ATCXXS2, TRX2, ATH2, ATTRX2, ATTRXH2, TRXH2, TH7, ATH7, ATH8, TH8, ATTRX4, ATH4, TRX-h5, ATTRX5, LIV1, ATH5, TRX5, ATH3, TRX3, TRXH3, ATTRX3, ATTRXH3, ATTRX H1, TRX1, ATTRX1
N0.HOG0001359	NA	ATPLC4, PLC4, ATPLC8, PLC8, PLC9, ATPLC9, PLC5, ATPLC5, PLC7, ATPLC2, PLC2, PLC1, ATPLC1, PLC3, ATPLC3, PLC1, ATPLC1, ATPLC
N0.HOG0004801	NA	AtFBS1, FBS1, AtFBS2, FBS2, AtFBS3, FBS3, FBS4, AtFBS4
N0.HOG0003376	NA	FRG2, CHR28, FRG3, FRG1, CHR27, FRG5, EDA16, FRG4
N0.HOG0004824	NA	TFIIS, RDO2
N0.HOG0000909	A/N−Inv	A/N-InvE, At-A/N-InvE, INV-E, A/N-InvC, INVH, A/N-InvH, At-A/N-InvH, A/N-InvA, CINV1, A/N-InvG, NIN2, CINV2, A/N-InvI, A/N-InvD, A/N-InvF, A/N-InvB
N0.HOG0000138	NA	AtGH9B12, GH9B12, AtGH9B11, GH9B11, GH9B9, AtGH9B9, AtGH9B10, GH9B10, AtGH9C1, GH9C1, GH9B8, AtGH9B8, AtGH9C2, GH9C2, AtGH9C3, GH9C3, ATGH9B3, ATCEL3, CEL3, ATCEL5, CEL5, ATGH9B4, AtGH9B18, CEL6, GH9B18, GH9B16, AtGH9B16, GH9B17, AtGH9B17, AtGH9B6, GH9B6, GH9B1, CEL1, ATGH9B1, CEL2, ATCEL2, AtGH9B13, GH9B13, GH9A4, AtGH9A4, GH9B15, AtGH9B15, GH9B14, AtGH9B14, AtKOR2, ATGH9A2, KOR2, KOR, RSW2, TSD1, GH9A1, DEC, KOR1, ATGH9A1, IRX2, AtKOR3, KOR3, ATGH9A3, GH9A3, AtGH9B7, GH9B7, GH9B5, AtGH9B5
N0.HOG0001327	NA	bHLH34, IDT1, bHLH104, ILR3, bHLH105, bHLH115, bHLH11, bHLH121, URI
N0.HOG0001131	NA	ATX2, SDG30, ATX1, SDG27
N0.HOG0000031	AP2-TFs (e.g., ERF)	CRF7, CRF8, ERF070, AtERF070, ERF113, RAP2, Rap2L, ERF109, RRTF1, ERF115, ERF114, ABR1, CRF2, TMO3, CRF1, CRF5, CRF6, CRF4, CRF3, ERF7, ATERF7, ATERF-7, ERF3, ATERF3, SHN1, WIN1, AtSHN1, SHN3, SHN2, ESE3, WIND4, AtERF53, ERF53, WIND3, TG, RAP2, RAP2d, WIND2, AtWIND1, WIND1, RAP2, ERF13, EREBP, ATERF13, CRF10, CRF12, CRF11, RAP2, HRD, CBF4, DREB1D, CBF1, DREB1B, ATCBF1, CBF3, DREB1A, ATCBF3, DREB1C, CBF2, ATCBF2, FTQ4, ERF040, TNY, ERF041, TINY2, ESE2, ERF043, ERF036, ERF38, ATERF38, ERF39, ERF34, ERF35, ERF035, FUF1, ERF022, EPI1, ERF014, AtERF014, DREB26, RAP2, DEAR5, DEAR3, RAP2, DEAR4, DEAR1, ATERF#011, CEJ1, DEAR2, AtERF019, ERF019, ERF016, ERF017, ERF17, ORA47, ERF018, DREB2, DREB2A, DREB2B, DREB2, DREB2C, AtERF48, DREB19, SAN5, ISI3, SUN6, ABI4, SIS5, ATABI4, GIN6
N0.HOG0001498	NA	ATSUS6, SUS6, ATSUS5, SUS5, ATSUS4, SUS4, ASUS1, SUS1, atsus1, SUSY1, SUS2, SSA, ATSUS2, SUS3, ATSUS3
N0.HOG0004405	NA	LOS5, SIR3, ACI2, ABA3, ATABA3, AtLOS5, GIN5
