Zci_14422
Zci_03166
Zci_02932
Zci_07124
Zci_01510
Zci_06224
Zci_04796
Zci_04643
Zci_05767
Zci_00781
Zci_11913
Zci_05693
Zci_14397
Zci_05289
Zci_02710
Zci_07097
Zci_04123
Zci_13378
Zci_05367
Zci_04537
Zci_13284
Zci_15239
Zci_03443
Zci_09683
Zci_10347
Zci_03302
Zci_01004
Zci_00170
Zci_09446
Zci_09435
Zci_07700
Zci_11986
Zci_03844
Zci_12152
Zci_04624
Zci_14069
Zci_02141
Zci_07156
Zci_07983
Zci_01678
Zci_13650
Zci_14538
Zci_13691
Zci_16565
Zci_05703
Zci_00182
Zci_01312
Zci_12442
Zci_01737
Zci_07881
Zci_07973
Zci_09166
Zci_02311
Zci_11302
Zci_12460
Zci_15794
Zci_13758
Zci_16449
Zci_16320
Zci_16369
Zci_11247
Zci_11744
Zci_10575
Zci_06059
Zci_03087
Zci_11109
Zci_00038
Zci_06102
Zci_16494
Zci_13627
Zci_08514
Zci_00926
Zci_16349
Zci_04641
Zci_09550
Zci_11787
Zci_01565
Zci_00805
Zci_00837
Zci_13597
Zci_06720
Zci_04913
Zci_16304
Zci_02573
Zci_10769
Zci_14698
Zci_08484
Zci_00455
Zci_00836
Zci_10177
Zci_06997
Zci_14842
Zci_07175
Zci_10481
Zci_00769
Zci_08019
Zci_14615
Zci_08126
Zci_06333
Zci_15984
Zci_10167
Zci_13051
Zci_06524
Zci_08001
Zci_11210
Zci_09102
Zci_16335
Zci_04275
Zci_05112
Zci_01158
Zci_01934
Zci_15082
Zci_12712
Zci_13613
Zci_09184
Zci_10172
Zci_07285
Zci_11190
Zci_00127
Zci_00523
Zci_11790
Zci_11373
Zci_13922
Zci_15831
Zci_14350
Zci_04640
Zci_06645
Zci_13582
Zci_07075
Zci_00568
Zci_00311
Zci_16540
Zci_05838
Zci_11650
Zci_06744
Zci_15433
Zci_03680
Zci_03452
Zci_06492
Zci_11902
Zci_03880
Zci_02769
Zci_04458
Zci_04432
Zci_15708
Zci_09268
Zci_10248
Zci_06026
Zci_09081
Zci_14856
Zci_07078
Zci_00617
Zci_05065
Zci_10507
Zci_06075
Zci_06041
Zci_07395
Zci_09498
Zci_05283
Zci_16563
Zci_01850
Zci_09228
Zci_13782
Zci_11829
Zci_12519
Zci_16400
Zci_05653
Zci_05486
Zci_10409
Zci_02137
Zci_13489
Zci_08813
Zci_08163
Zci_02699
Zci_12338
Zci_06356
Zci_02779
Zci_09179
Zci_04798
Zci_01708
Zci_06236
Zci_14494
Zci_01673
Zci_05547
Zci_02890
Zci_05103
Zci_02310
Zci_09224
Zci_02946
Zci_06830
Zci_07992
Zci_03454
Zci_05937
Zci_05251
Zci_00008
Zci_01728
Zci_06038
Zci_01005
Zci_13246
Zci_13367
Zci_05751
Zci_15298
Zci_12797
Zci_08174
Zci_02465
Zci_02745
Zci_11880
Zci_01883
Zci_16525
Zci_01170
Zci_00595
Zci_01729
Zci_10269
Zci_01804
Zci_04806
Zci_07671
Zci_07191
Zci_08408
Zci_04298
Zci_02942
Zci_14394
Zci_04074
Zci_01790
Zci_06375
Zci_14775
Zci_00898
Zci_09477
Zci_06696
Zci_07572
Zci_10900
Zci_03801
Zci_16599
Zci_04889
Zci_06906
Zci_15976
Zci_08402
Zci_04313
Zci_02525
Zci_04536
Zci_12461
Zci_04150
Zci_10993
Zci_00057
Zci_16488
Zci_14903
Zci_15249
Zci_03906
Zci_08040
Zci_01543
Zci_00766
Zci_07701
Zci_15877
Zci_14684
Zci_06877
Zci_09403
Zci_05186
Zci_15196
Zci_14179
Zci_03205
Zci_01216
Zci_04436
Zci_06303
Zci_15225
Zci_07546
Zci_02683
Zci_09319
Zci_02829
Zci_09984
Zci_02063
Zci_03165
Zci_00801
Zci_11381
Zci_10898
Zci_12973
Zci_15057
Zci_05701
Zci_09047
Zci_04846
Zci_02115
Zci_11113
Zci_10430
Zci_05678
Zci_13965
Zci_03835
Zci_10315
Zci_10842
Zci_11367
Zci_11451
Zci_07192
Zci_09854
Zci_07758
Zci_11842
Zci_01267
Zci_00918
Zci_14444
Zci_04376
Zci_08812
Zci_10094
Zci_02893
Zci_03396
Zci_04319
Zci_05384
Zci_08791
Zci_12620
Zci_07857
Zci_07560
Zci_14645
Zci_03959
Zci_09787
Zci_13865
Zci_04335
Zci_02218
Zci_10946
Zci_03870
Zci_14907
Zci_07354
Zci_13374
Zci_09425
Zci_03210
Zci_03433
Zci_07878
Zci_08835
Zci_03969
Zci_09269
Zci_08029
Zci_14250
Zci_00086
Zci_09049
Zci_11137
Zci_11273
Zci_13392
Zci_02929
Zci_07210
Zci_13032
Zci_15925
Zci_00905
Zci_08098
Zci_07566
Zci_14248
Zci_08406
Zci_12242
Zci_11900
Zci_10593
Zci_15407
Zci_08104
Zci_14442
Zci_08091
Zci_00582
Zci_04366
Zci_12480
Zci_15924
Zci_00369
Zci_11019
Zci_06496
Zci_14909
Zci_15064
Zci_07169
Zci_05054
Zci_12831
Zci_00159
Zci_04166
Zci_09424
Zci_09451
Zci_11189
Zci_04368
Zci_00288
Zci_08283
Zci_13840
Zci_06543
Zci_13107
Zci_09385
Zci_08546
Zci_04321
Zci_04831
Zci_11967
Zci_02069
Zci_01686
Zci_15322
Zci_15465
Zci_10682
Zci_01156
Zci_14336
Zci_14284
Zci_04876
Zci_02831
Zci_07663
Zci_14915
Zci_13690
Zci_05916
Zci_05286
Zci_05235
Zci_11092
Zci_07019
Zci_06555
Zci_09234
Zci_04293
Zci_04370
Zci_06454
Zci_07763
Zci_02982
Zci_00353
Zci_11468
Zci_00879
Zci_13207
Zci_11236
Zci_12738
Zci_12357
Zci_01376
Zci_05385
Zci_08000
Zci_02216
Zci_03868
Zci_06996
Zci_04973
Zci_02667
Zci_07754
Zci_05816
Zci_10326
Zci_05155
Zci_02173
Zci_13654
Zci_02737
Zci_12708
Zci_06005
Zci_08165
Zci_12001
Zci_04077
Zci_13202
Zci_07833
Zci_05961
Zci_12006
Zci_14891
Zci_02695
Zci_07735
Zci_07009
Zci_08513
Zci_00851
Zci_08373
Zci_03208
Zci_14747
Zci_09149
Zci_07565
Zci_13701
Zci_02707
Zci_02676
Zci_00486
Zci_00158
Zci_05689
Zci_05340
Zci_13376
Zci_15210
Zci_01751
Zci_04479
Zci_04172
Zci_07904
Zci_00861
Zci_11500
Zci_15942
Zci_04083
Zci_09482
Zci_01869
Zci_06785
Zci_07326
Zci_08496
Zci_02280
Zci_15755
Zci_08096
Zci_03408
Zci_10987
Zci_14503
Zci_06721
Zci_02199
Zci_07456
Zci_01892
Zci_13659
Zci_08212
Zci_02056
Zci_03563
Zci_10082
Zci_08548
Zci_02704
Zci_15062
Zci_12275
Zci_00741
Zci_06810
Zci_09309
Zci_13619
Zci_14110
Zci_04856
Zci_01709
Zci_08097
Zci_07402
Zci_15913
Zci_08920
Zci_13208
Zci_06347
Zci_00097
Zci_10799
Zci_11815
Zci_09974
Zci_12158
Zci_02645
Zci_14961
Zci_07876
Zci_02832
Zci_05674
Zci_03177
Zci_00060
Zci_10479
Zci_06712
Zci_08661
Zci_02026
Zci_00317
Zci_13624
Zci_00255
Zci_13098
Zci_05675
Zci_15362
Zci_01760
Zci_10039
Zci_14063
Zci_00238
Zci_07986
Zci_10554
Zci_11177
Zci_10899
Zci_14985
Zci_11970
Zci_07290
Zci_08094
Zci_03272
Zci_07721
Zci_11943
Zci_07699
Zci_04734
Zci_16322
Zci_06676
Zci_03144
Zci_03527
Zci_12004
Zci_10926
Zci_08056
Zci_10928
Zci_10498
Zci_14540
Zci_12543
Zci_03008
Zci_01093
Zci_11132
Zci_14052
Zci_01616
Zci_01668
Zci_08670
Zci_01651
Zci_00742
Zci_05212
Zci_02432
Zci_01534
Zci_03694
Zci_01870
Zci_02791
Zci_12008
Zci_05683
Zci_07172
Zci_00838
Zci_01169
Zci_12795
Zci_08414
Zci_16359
Zci_00128
Zci_11881
Zci_08946
Zci_16014
Zci_13888
Zci_13096
Zci_15061
Zci_09343
Zci_14976
Zci_15688
Zci_06909
Zci_01215
Zci_07916
Zci_10001
Zci_13092
Zci_02875
Zci_07005
Zci_03825
Zci_06995
Zci_03961
Zci_16368
Zci_02999
Zci_00372
Zci_02911
Zci_07961
Zci_07850
Zci_06009
Zci_14257
Zci_10332
Zci_12221
Zci_12157
Zci_07545
Zci_14050
Zci_04440
Zci_10002
Zci_00266
Zci_12007
Zci_05702
Zci_04346
Zci_10542
Zci_05908
Zci_12879
Zci_11119
Zci_14324
Zci_16592
Zci_08385
Zci_02331
Zci_00287
Zci_01168
Zci_01012
Zci_06000
Zci_13287
Zci_09833
Zci_05950
Zci_10142
Zci_11144
Zci_16512
Zci_03228
Zci_03316
Zci_15718
Zci_15818
Zci_13702
Zci_12863
Zci_06019
Zci_09052
Zci_13026
Zci_14749
Zci_08524
Zci_15190
Zci_11743
Zci_07256
Zci_06637
Zci_11380
Zci_16302
Zci_00316
Zci_04354
Zci_16336
Zci_04337
Zci_12981
Zci_02941
Zci_04965
Zci_11962
Zci_15504
Zci_10868
Zci_11018
Zci_05445
Zci_03053
Zci_02963
Zci_12963
Zci_14462
Zci_11609
Zci_00213
Zci_12066
Zci_04380
Zci_01705
Zci_11627
Zci_11016
Zci_02600
Zci_15278
Zci_06499
Zci_05888
Zci_07178
Zci_08128
Zci_02768
Zci_05707
Zci_00839
Zci_05338
Zci_11185
Zci_07420
Zci_00969
Zci_06187
Zci_10586
Zci_11401
Zci_12709
Zci_00504
Zci_09019
Zci_04670
Zci_07012
Zci_01772
Zci_15243
Zci_01706
Zci_09382
Zci_04053
Zci_03831
Zci_04668
Zci_03010
Zci_00936
Zci_06530
Zci_07179
Zci_06369
Zci_14463
Zci_06917
Zci_06589
Zci_16507
Zci_05134
Zci_09252
Zci_03060
Zci_04842
Zci_08572
Zci_03310
Zci_05284
Zci_05618
Zci_03448
Zci_02163
Zci_01817
Zci_04694
Zci_00234
Zci_11597
Zci_13629
Zci_00608
Zci_02898
Zci_06095
Zci_00361
Zci_06376
Zci_05983
Zci_15689
Zci_11992
Zci_15852
Zci_04177
Zci_08607
Zci_00260
Zci_11614
Zci_00171
Zci_14746
Zci_02017
Zci_05696
Zci_07025
Zci_11539
Zci_14575
Zci_05098
Zci_04869
Zci_10361
Zci_14562
Zci_04490
Zci_15856
Zci_00422
Zci_00411
Zci_08017
Zci_15964
Zci_11070
Zci_12132
Zci_12580
Zci_04088
Zci_06035
Zci_01554
Zci_03410
Zci_13680
Zci_09703
Zci_01877
Zci_12581
Zci_16420
Zci_03203
Zci_05936
Zci_15853
Zci_06076
Zci_04294
Zci_15256
Zci_04401
Zci_16567
Zci_09315
Zci_14561
Zci_05029
Zci_14479
Zci_02978
Zci_05161
Zci_05952
Zci_03760
Zci_01531
Zci_10543
Zci_15616
Zci_05967
Zci_15241
Zci_07635
Zci_10971
Zci_13912
Zci_09654
Zci_16533
Zci_11319
Zci_12353
Zci_10644
Zci_00322
Zci_07415
Zci_16615
Zci_04988
Zci_15598
Zci_10128
Zci_05572
Zci_02226
Zci_04782
Zci_04184
Zci_11118
Zci_06457
Zci_10622
Zci_15036
Zci_08333
Zci_11364
Zci_12465
Zci_09868
Zci_06918
Zci_10429
Zci_07775
Zci_02011
Zci_09937
Zci_01645
Zci_00321
Zci_02114
Zci_03287
Zci_06361
Zci_10666
Zci_02355
Zci_11585
Zci_03903
Zci_00792
Zci_10535
Zci_08331
Zci_10392
Zci_01326
Zci_08166
Zci_00059
Zci_03652
Zci_08051
Zci_10342
Zci_06666
Zci_03583
Zci_13973
Zci_02230
Zci_10308
Zci_02195
Zci_05966
Zci_08643
Zci_15357
Zci_07014
Zci_04257
Zci_00368
Zci_07843
Zci_07668
Zci_08055
Zci_02078
Zci_14380
Zci_02858
Zci_03805
Zci_02160
Zci_12888
Zci_04741
Zci_15002
Zci_11800
Zci_16517
Zci_03912
Zci_07978
Zci_09999
Zci_10212
Zci_10401
Zci_05615
Zci_06109
Zci_11256
Zci_07915
Zci_15592
Zci_00683
Zci_03055
Zci_04503
Zci_04241
Zci_02016
Zci_14443
Zci_05855
Zci_01485
Zci_02046
Zci_05895
Zci_08604
Zci_01429
Zci_01882
Zci_12463
Zci_13812
Zci_09986
Zci_16617
Zci_05260
Zci_06219
Zci_07988
Zci_11040
Zci_09913
Zci_10139
Zci_04485
Zci_13029
Zci_02077
Zci_14544
Zci_13337
Zci_07254
Zci_12578
Zci_07187
Zci_04375
Zci_02339
Zci_03064
Zci_03207
Zci_15680
Zci_00732
Zci_07046
Zci_11602
Zci_14460
Zci_03040
Zci_08844
Zci_06285
Zci_08872
Zci_07970
Zci_13028
Zci_11134
Zci_02352
Zci_13192
Zci_12097
Zci_13611
Zci_04539
Zci_14334
Zci_03733
Zci_07222
Zci_07376
Zci_00337
Zci_06672
Zci_07020
Zci_05011
Zci_11397
Zci_06641
Zci_10949
Zci_14291
Zci_15601
Zci_04414
Zci_16415
Zci_00705
Zci_06440
Zci_04076
Zci_04610
Zci_09014
Zci_11077
Zci_06083
Zci_02301
Zci_04788
Zci_09717
Zci_00688
Zci_05960
Zci_12949
Zci_01855
Zci_06191
Zci_07278
Zci_01194
Zci_12420
Zci_06049
Zci_04030
Zci_14908
Zci_00571
Zci_06259
Zci_09546
Zci_08171
Zci_09519
Zci_15419
Zci_06992
Zci_16610
Zci_07070
Zci_14514
Zci_12889
Zci_04388
Zci_00668
Zci_10048
Zci_04240
Zci_02815
Zci_06786
Zci_13078
Zci_07865
Zci_01861
Zci_03174
Zci_07348
Zci_08303
Zci_11651
Zci_09351
Zci_11581
Zci_11051
Zci_04969
Zci_11372
Zci_12358
Zci_15336
Zci_13197
Zci_14932
Zci_15377
Zci_01469
Zci_07298
Zci_01421
Zci_03828
Zci_03225
Zci_14885
Zci_12364
Zci_10486
Zci_01575
Zci_05158
Zci_06988
Zci_02338
Zci_01820
Zci_04327
Zci_14346
Zci_04387
Zci_07982
Zci_08830
Zci_05040
Zci_06087
Zci_01800
Zci_07494
Zci_13467
Zci_09496
Zci_04064
Zci_01814
Zci_13003
Zci_03530
Zci_06657
Zci_07037
Zci_05575
Zci_13095
Zci_00484
Zci_08036
Zci_12760
Zci_11512
Zci_03489
Zci_08317
Zci_06342
Zci_03039
Zci_13900
Zci_06020
Zci_12326
Zci_11498
Zci_14890
Zci_09255
Zci_14468
Zci_06426
Zci_10810
Zci_03586
Zci_03473
Zci_04491
Zci_07733
Zci_12780
Zci_09193
Zci_05790
Zci_13375
Zci_14614
Zci_11356
Zci_15406
Zci_03913
Zci_15893
Zci_15634
Zci_08232
Zci_12307
Zci_06458
Zci_12918
Zci_14589
Zci_06318
Zci_15653
Zci_13895
Zci_07198
Zci_06527
Zci_09203
Zci_13954
Zci_08075
Zci_14613
Zci_02044
Zci_10617
Zci_12915
Zci_11901
Zci_12405
Zci_09090
Zci_04407
Zci_08059
Zci_05264
Zci_09109
Zci_15679
Zci_02014
Zci_02841
Zci_06004
Zci_07286
Zci_00896
Zci_12003
Zci_05982
Zci_08533
Zci_01834
Zci_10742
Zci_08629
Zci_11789
Zci_09226
Zci_02032
Zci_13756
Zci_02245
Zci_05108
Zci_02159
Zci_07030
Zci_11481
Zci_05502
Zci_04193
Zci_08150
Zci_03764
Zci_10550
Zci_13365
Zci_08315
Zci_08662
Zci_00833
Zci_00223
Zci_04967
Zci_04639
Zci_10454
Zci_04820
Zci_05995
Zci_00991
Zci_15781
Zci_02367
Zci_11120
Zci_03976
Zci_14588
Zci_09838
Zci_00400
Zci_02162
Zci_02770
Zci_09100
Zci_16572
Zci_04127
Zci_16616
Zci_00723
Zci_04511
Zci_14893
Zci_10306
Zci_02100
Zci_04356
Zci_09878
Zci_10453
Zci_15198
Zci_12994
Zci_06718
Zci_07185
Zci_11666
Zci_05917
Zci_07447
Zci_11163
Zci_06081
Zci_02362
Zci_08143
Zci_09775
Zci_08450
Zci_14557
Zci_05079
Zci_00558
Zci_09706
Zci_12891
Zci_07387
Zci_00303
Zci_15892
Zci_13084
Zci_10141
Zci_11798
Zci_08630
Zci_13122
Zci_09120
Zci_14058
Zci_14277
Zci_15658
Zci_06846
Zci_06088
Zci_12147
Zci_00421
Zci_10181
Zci_16518
Zci_04398
Zci_03578
Zci_01419
Zci_02959
Zci_12192
Zci_10513
Zci_05737
Zci_08144
Zci_02595
Zci_14218
Zci_06593
Zci_01129
Zci_09756
Zci_10146
Zci_12516
Zci_08995
Zci_13126
Zci_08076
Zci_11152
Zci_02220
Zci_08922
Zci_02622
Zci_00040
Zci_05395
Zci_07446
Zci_01765
Zci_06077
Zci_15594
Zci_03422
Zci_14391
Zci_00880
Zci_04024
Zci_06733
Zci_11554
Zci_11206
Zci_03708
Zci_05741
Zci_07556
Zci_04776
Zci_09087
Zci_04502
Zci_03616
Zci_05063
Zci_04339
Zci_12867
Zci_10944
Zci_11859
Zci_07073
Zci_07052
Zci_03356
Zci_11292
Zci_01353
Zci_12747
Zci_13901
Zci_00946
Zci_14762
Zci_03016
Zci_00373
Zci_11362
Zci_14629
Zci_05974
Zci_05525
Zci_05975
Zci_11175
Zci_01757
Zci_08768
Zci_12186
Zci_00786
Zci_00502
Zci_09973
Zci_00947
Zci_10841
Zci_02101
Zci_03911
Zci_09998
Zci_07813
Zci_04324
Zci_05580
Zci_10060
Zci_07318
Zci_14466
Zci_15687
Zci_05265
Zci_10877
Zci_10292
Zci_14755
Zci_14037
Zci_15915
Zci_10090
Zci_04382
Zci_02962
Zci_14285
Zci_06854
Zci_15265
Zci_06812
Zci_01201
Zci_12148
Zci_09662
Zci_04345
Zci_04291
Zci_12508
Zci_08375
Zci_00402
Zci_08761
Zci_01750
Zci_01818
Zci_10009
Zci_02009
Zci_14332
Zci_09510
Zci_09789
Zci_15684
Zci_00217
Zci_03596
Zci_02935
Zci_03054
Zci_05617
Zci_08041
Zci_08002
Zci_12011
Zci_12002
Zci_04589
Zci_09490
Zci_12881
Zci_08130
Zci_11437
Zci_04700
Zci_04936
Zci_15347
Zci_11997
Zci_07255
Zci_15837
Zci_05534
Zci_01386
Zci_12884
Zci_00275
Zci_05221
Zci_05663
Zci_15097
Zci_01973
Zci_03517
Zci_13463
Zci_03145
Zci_02801
Zci_08355
Zci_02679
Zci_08070
Zci_02605
Zci_08243
Zci_01354
Zci_04916
Zci_11996
Zci_13180
Zci_14917
Zci_06114
Zci_05685
Zci_03833
Zci_14704
Zci_10336
Zci_06282
Zci_09547
Zci_00598
Zci_02951
Zci_02314
Zci_03035
Zci_10462
Zci_09719
Zci_04296
Zci_04292
Zci_03129
Zci_04486
Zci_02509
Zci_05662
Zci_06391
Zci_15503
Zci_02468
Zci_06522
Zci_03318
Zci_03011
Zci_08042
Zci_02674
Zci_01840
Zci_06412
Zci_08323
Zci_10969
Zci_10538
Zci_08767
Zci_07386
Zci_00678
Zci_05364
Zci_08293
Zci_01492
Zci_14737
Zci_03029
Zci_04999
Zci_12402
Zci_14960
Zci_14959
Zci_04397
Zci_13686
Zci_10333
Zci_05028
Zci_12859
Zci_12208
Zci_05919
Zci_15851
Zci_08549
Zci_06062
Zci_08697
Zci_12387
Zci_00490
Zci_07702
Zci_02771
Zci_05419
Zci_09982
Zci_02912
Zci_03043
Zci_08744
Zci_11838
Zci_09413
Zci_06876
Zci_03192
Zci_08282
Zci_10910
Zci_09158
Zci_11427
Zci_06850
Zci_08869
Zci_08692
Zci_15281
Zci_08663
Zci_06363
Zci_06085
Zci_05013
Zci_00162
Zci_03063
Zci_13788
Zci_06907
Zci_12614
Zci_10636
Zci_12992
Zci_03715
Zci_10203
Zci_02285
Zci_13791
Zci_14469
Zci_08054
Zci_12257
Zci_12885
Zci_07479
Zci_06827
Zci_00183
Zci_06523
Zci_12005
Zci_01685
Zci_09535
Zci_09800
Zci_15324
Zci_14883
Zci_06046
Zci_14216
Zci_12866
Zci_01977
Zci_05848
Zci_04341
Zci_11125
Zci_06730
Zci_04402
Zci_08925
Zci_15867
Zci_15916
Zci_07262
Zci_07061
Zci_02249
Zci_05317
Zci_06983
Zci_10499
Zci_15970
Zci_08319
Zci_09870
Zci_08988
Zci_03044
Zci_04699
Zci_04995
Zci_04880
Zci_12222
Zci_14415
Zci_10764
Zci_14847
Zci_12190
Zci_03045
Zci_00907
Zci_11182
Zci_04311
Zci_06349
Zci_07964
Zci_04770
Zci_05501
Zci_10033
Zci_12064
Zci_10856
Zci_09783
Zci_11852
Zci_09408
Zci_07432
Zci_09395
Zci_03487
Zci_07315
Zci_15771
Zci_10934
Zci_00579
Zci_08996
Zci_11149
Zci_12153
Zci_01044
Zci_05069
Zci_14616
Zci_00862
Zci_10426
Zci_12354
Zci_11497
Zci_13186
Zci_15232
Zci_03653
Zci_09447
Zci_11293
Zci_13614
Zci_07392
Zci_05259
Zci_08867
Zci_07227
Zci_10208
Zci_00180
Zci_01769
Zci_02688
Zci_10767
Zci_08137
Zci_06925
Zci_14753
Zci_11486
Zci_05742
Zci_11520
Zci_00590
Zci_00348
Zci_07026
Zci_01623
Zci_11706
Zci_15609
Zci_02428
Zci_02516
Zci_15569
Zci_03298
Zci_14659
Zci_08270
Zci_03982
Zci_09865
Zci_14164
Zci_12974
Zci_11783
Zci_12309
Zci_11394
Zci_02894
Zci_03588
Zci_04762
Zci_09414
Zci_12228
Zci_10330
Zci_13647
Zci_04120
Zci_14122
Zci_05102
Zci_11004
Zci_09697
Zci_04505
Zci_15697
Zci_00646
Zci_05361
Zci_00104
Zci_11426
Zci_09057
Zci_02744
Zci_04662
Zci_00968
Zci_01503
Zci_01978
Zci_15929
Zci_04247
Zci_06487
Zci_12082
Zci_03290
Zci_07351
Zci_15291
Zci_15801
Zci_05539
Zci_12043
Zci_09600
Zci_07595
Zci_00391
Zci_08109
Zci_09659
Zci_01466
Zci_08400
Zci_03195
Zci_05094
Zci_00506
Zci_01529
Zci_03403
Zci_02368
Zci_10843
Zci_09161
Zci_10741
Zci_06563
Zci_00588
Zci_12946
Zci_12482
Zci_04959
Zci_00041
Zci_13766
Zci_16480
Zci_13759
Zci_07709
Zci_15953
Zci_10714
Zci_14694
Zci_06863
Zci_05893
Zci_16451
Zci_12230
Zci_13385
Zci_09229
Zci_01633
Zci_08949
Zci_01365
Zci_05529
Zci_13390
Zci_10744
Zci_10080
Zci_05348
Zci_06339
Zci_12362
Zci_09618
Zci_05548
Zci_09452
Zci_04923
Zci_06866
Zci_00145
Zci_07058
Zci_06290
Zci_04930
Zci_09733
Zci_14806
Zci_11098
Zci_05187
Zci_08367
Zci_07463
Zci_09828
Zci_08725
Zci_02234
Zci_12176
Zci_01588
Zci_05415
Zci_10677
Zci_05586
Zci_08127
Zci_04946
Zci_07691
Zci_14881
Zci_05143
Zci_05622
Zci_02576
Zci_05959
Zci_12904
Zci_03841
Zci_01546
Zci_02401
Zci_06882
Zci_12344
Zci_05846
Zci_11937
Zci_04340
Zci_09940
Zci_10171
Zci_08213
Zci_03308
Zci_06694
Zci_02678
Zci_06010
Zci_08950
Zci_12597
Zci_07695
Zci_12366
Zci_02453
Zci_14535
Zci_00173
Zci_04406
Zci_07577
Zci_02192
Zci_06450
Zci_10272
Zci_14241
Zci_09877
Zci_04710
Zci_11467
Zci_09792
Zci_01457
Zci_01671
Zci_08999
Zci_06118
Zci_13203
Zci_10558
Zci_00511
Zci_12101
Zci_06379
Zci_10718
Zci_15965
Zci_16538
Zci_08266
Zci_10242
Zci_10836
Zci_06311
Zci_15289
Zci_16424
Zci_06034
Zci_03554
Zci_11578
Zci_10063
Zci_10189
Zci_01453
Zci_07755
Zci_10399
Zci_07751
Zci_15078
Zci_06056
Zci_06425
Zci_02116
Zci_05271
Zci_05170
Zci_00804
Zci_00825
Zci_13204
Zci_15276
Zci_13244
Zci_08182
Zci_14497
Zci_01578
Zci_04937
Zci_05168
Zci_04429
Zci_00230
Zci_13054
Zci_15786
Zci_14919
Zci_03688
Zci_02787
Zci_03339
Zci_14068
Zci_13578
Zci_09553
Zci_04314
Zci_07956
Zci_02096
Zci_02348
Zci_00888
Zci_13601
Zci_04267
Zci_09607
Zci_13592
Zci_05928
Zci_05779
Zci_03999
Zci_04735
Zci_01867
Zci_06221
Zci_00118
Zci_08079
Zci_00414
Zci_08973
Zci_01051
Zci_10065
Zci_04731
Zci_01544
Zci_06628
Zci_13215
Zci_03479
Zci_15988
Zci_05759
Zci_02533
Zci_03737
Zci_14266
Zci_10032
Zci_04468
Zci_15348
Zci_12087
Zci_12601
Zci_12937
Zci_03531
Zci_05336
Zci_09440
Zci_04714
Zci_03462
Zci_03515
Zci_14186
Zci_14578
Zci_12848
Zci_01463
Zci_01613
Zci_10572
Zci_04073
Zci_02539
Zci_05184
Zci_00614
Zci_06808
Zci_01149
Zci_16475
Zci_03987
Zci_10775
Zci_03719
Zci_02061
Zci_01118
Zci_04309
Zci_04888
Zci_12479
Zci_09909
Zci_06301
Zci_13913
Zci_14516
Zci_04365
Zci_07640
Zci_12174
Zci_02211
Zci_03265
Zci_05705
Zci_15214
Zci_01403
Zci_09460
Zci_03574
Zci_05955
Zci_16469
Zci_06706
Zci_12105
Zci_09345
Zci_09757
Zci_08826
Zci_00875
Zci_08108
Zci_12546
Zci_08120
Zci_09421
Zci_14825
Zci_11521
Zci_04477
Zci_00498
Zci_07333
Zci_08879
Zci_10568
Zci_10778
Zci_06748
Zci_02741
Zci_14719
Zci_16602
Zci_09905
Zci_04953
Zci_14807
Zci_10612
Zci_03500
Zci_11172
Zci_04687
Zci_06656
Zci_05541
Zci_11551
Zci_12061
Zci_05745
Zci_06772
Zci_02260
Zci_09314
Zci_03077
Zci_12794
Zci_02660
Zci_09542
Zci_06561
Zci_11864
Zci_10730
Zci_01443
Zci_05263
Zci_06422
Zci_01468
Zci_04830
Zci_10749
Zci_01762
Zci_01551
Zci_06678
Zci_05749
Zci_10725
Zci_09560
Zci_08762
Zci_05117
Zci_01590
Zci_06123
Zci_04232
Zci_00935
Zci_03378
Zci_04785
Zci_14014
Zci_12104
Zci_06482
Zci_03215
Zci_14532
Zci_00094
Zci_08960
Zci_06307
Zci_01359
Zci_12202
Zci_11173
Zci_06828
Zci_11041
Zci_08806
Zci_02347
Zci_00440
Zci_10852
Zci_15016
Zci_05378
Zci_15028
Zci_05545
Zci_13321
Zci_13022
Zci_03508
Zci_09670
Zci_11265
Zci_03140
Zci_01656
Zci_15019
Zci_02431
Zci_03792
Zci_09212
Zci_03916
Zci_08318
Zci_08878
Zci_15887
Zci_00335
Zci_10632
Zci_11985
Zci_10407
Zci_09732
Zci_01042
Zci_12012
Zci_03428
Zci_04952
Zci_02606
Zci_13241
Zci_12265
Zci_05092
Zci_07120
Zci_10520
Zci_09655
Zci_08044
Zci_12734
Zci_14500
Zci_08052
Zci_07451
Zci_01066
Zci_01796
Zci_12345
Zci_12227
Zci_09918
Zci_15327
Zci_04269
Zci_05410
Zci_02361
Zci_02572
Zci_10756
Zci_11526
Zci_01594
Zci_02565
Zci_01282
Zci_01391
Zci_11387
Zci_01580
Zci_11849
Zci_02333
Zci_11669
Zci_14187
Zci_15586
Zci_11737
Zci_00616
Zci_03847
Zci_06368
Zci_02452
Zci_08407
Zci_03745
Zci_01670
Zci_13923
Zci_13818
Zci_04749
Zci_15356
Zci_02426
Zci_12830
Zci_03755
Zci_10596
Zci_02879
Zci_00823
Zci_15458
Zci_10858
Zci_03703
Zci_10716
Zci_02051
Zci_08943
Zci_07889
Zci_06466
Zci_15526
Zci_13835
Zci_06565
Zci_10709
Zci_08700
Zci_07835
Zci_05370
Zci_05826
Zci_01979
Zci_12210
Zci_11741
Zci_07707
Zci_07010
Zci_06728
Zci_00310
Zci_02747
Zci_06373
Zci_02012
Zci_07598
Zci_15787
Zci_01567
Zci_02892
Zci_06120
Zci_09048
Zci_05728
Zci_06926
Zci_01666
Zci_00850
Zci_05352
Zci_05326
Zci_08230
Zci_08951
Zci_01660
Zci_15366
Zci_00962
Zci_13042
Zci_06382
Zci_05418
Zci_01937
Zci_00417
Zci_00891
Zci_06805
Zci_11792
Zci_10822
Zci_09322
Zci_03398
Zci_00005
Zci_02921
Zci_12488
Zci_05350
Zci_10731
Zci_16583
Zci_12240
Zci_07923
Zci_05867
Zci_03379
Zci_01133
Zci_10907
Zci_01414
Zci_05996
Zci_03988
Zci_02421
Zci_00890
Zci_01458
Zci_07518
Zci_09882
Zci_00942
Zci_06178
Zci_09384
Zci_09456
Zci_06456
Zci_15716
Zci_13031
Zci_08214
Zci_07403
Zci_07131
Zci_09313
Zci_04278
Zci_00049
Zci_12394
Zci_10833
Zci_09822
Zci_03585
Zci_03611
Zci_06386
Zci_13660
Zci_12370
Zci_10014
Zci_01808
Zci_05217
Zci_00528
Zci_11750
Zci_14289
Zci_08956
Zci_05363
Zci_05727
Zci_05075
Zci_14344
Zci_07618
Zci_06881
Zci_12055
Zci_14723
Zci_13243
Zci_11021
Zci_02108
Zci_05282
Zci_04898
Zci_11074
Zci_01662
Zci_13379
Zci_00849
Zci_06055
Zci_00826
Zci_09886
Zci_10415
Zci_13959
Zci_02190
Zci_03267
Zci_12414
Zci_04921
Zci_07766
Zci_12752
Zci_08260
Zci_11188
Zci_03582
Zci_01329
Zci_12159
Zci_11140
Zci_05428
Zci_12313
Zci_00591
Zci_06753
Zci_12725
Zci_02328
Zci_11866
Zci_12263
Zci_12855
Zci_04753
Zci_01972
Zci_12940
Zci_01745
Zci_13485
Zci_02433
Zci_09005
Zci_04609
Zci_10711
Zci_12790
Zci_13259
Zci_05520
Zci_04488
Zci_02035
Zci_02304
Zci_03269
Zci_06867
Zci_03226
Zci_16531
Zci_12892
Zci_11976
Zci_15788
Zci_14056
Zci_02023
Zci_08206
Zci_15253
Zci_14886
Zci_09088
Zci_13405
Zci_08785
Zci_10504
Zci_00396
Zci_04156
Zci_02837
Zci_11105
Zci_02439
Zci_01960
Zci_00069
Zci_11474
Zci_04222
Zci_07583
Zci_07279
Zci_03966
Zci_02797
Zci_07159
Zci_07675
Zci_10519
Zci_00615
Zci_10649
Zci_09781
Zci_02742
Zci_07867
Zci_15039
Zci_13837
Zci_14637
Zci_04914
Zci_00977
Zci_00513
Zci_08152
Zci_06403
Zci_03698
Zci_11406
Zci_14509
Zci_10726
Zci_10889
Zci_03921
Zci_06400
Zci_14600
Zci_08358
Zci_00818
Zci_05443
Zci_04295
Zci_11047
Zci_07623
Zci_15240
Zci_12591
Zci_00761
Zci_05852
Zci_13669
Zci_07247
Zci_07604
Zci_07767
Zci_13684
Zci_13421
Zci_06542
Zci_12128
Zci_13043
Zci_15667
Zci_01826
Zci_13796
Zci_00247
Zci_05002
Zci_01020
Zci_00002
Zci_03286
Zci_15649
Zci_11945
Zci_01910
Zci_07745
Zci_09644
Zci_13111
Zci_14513
Zci_00045
Zci_06566
Zci_03878
Zci_15599
Zci_04802
Zci_01871
Zci_10020
Zci_05951
Zci_10628
Zci_02370
Zci_07224
Zci_10532
Zci_05256
Zci_08652
Zci_05003
Zci_14518
Zci_05606
Zci_02636
Zci_09728
Zci_02531
Zci_14889
Zci_07611
Zci_03619
Zci_03424
Zci_10054
Zci_02262
Zci_03740
Zci_03351
Zci_02095
Zci_02004
Zci_10534
Zci_05680
Zci_12642
Zci_14070
Zci_13394
Zci_02054
Zci_08961
Zci_10350
Zci_03769
Zci_06182
Zci_15338
Zci_13201
Zci_02157
Zci_00773
Zci_14977
Zci_04771
Zci_10155
Zci_05721
Zci_03194
Zci_04248
Zci_01735
Zci_03504
Zci_05722
Zci_01664
Zci_10010
Zci_01812
Zci_13312
Zci_06069
Zci_00893
Zci_13004
Zci_01519
Zci_10943
Zci_10965
Zci_07769
Zci_00028
Zci_06544
Zci_01752
Zci_06312
Zci_04644
Zci_13443
Zci_05717
Zci_07802
Zci_03021
Zci_06823
Zci_15099
Zci_10884
Zci_03294
Zci_04615
Zci_07436
Zci_02351
Zci_09180
Zci_00048
Zci_04631
Zci_03622
Zci_12403
Zci_14738
Zci_08929
Zci_02514
Zci_05944
Zci_01413
Zci_04738
Zci_00439
Zci_12119
Zci_10581
Zci_09959
Zci_01749
Zci_07564
Zci_01618
Zci_13832
Zci_03940
Zci_04389
Zci_08011
Zci_01338
Zci_01726
Zci_08889
Zci_01748
Zci_02209
Zci_12550
Zci_07893
Zci_10629
Zci_12117
Zci_07208
Zci_14348
Zci_13491
Zci_09896
Zci_06792
Zci_08308
Zci_11637
Zci_03960
Zci_04583
Zci_04774
Zci_09888
Zci_06507
Zci_14496
Zci_06537
Zci_06624
Zci_08388
Zci_06052
Zci_04893
Zci_06278
Zci_09666
Zci_14352
Zci_09152
Zci_10210
Zci_14716
Zci_00996
Zci_12347
Zci_14843
Zci_08363
Zci_01832
Zci_04060
Zci_06310
Zci_00215
Zci_12073
Zci_01783
Zci_10209
Zci_04284
Zci_12799
Zci_07183
Zci_01612
Zci_03794
Zci_01268
Zci_09062
Zci_06826
Zci_00010
Zci_02493
Zci_08330
Zci_07396
Zci_10218
Zci_04601
Zci_14950
Zci_13339
Zci_12404
Zci_01286
Zci_01767
Zci_00082
Zci_13910
Zci_06461
Zci_01784
Zci_07728
Zci_11181
Zci_10757
Zci_06891
Zci_13492
Zci_13708
Zci_11878
Zci_02863
Zci_04596
Zci_11691
Zci_07056
Zci_11072
Zci_06053
Zci_07202
Zci_09051
Zci_01569
Zci_05062
Zci_00426
Zci_07461
Zci_13898
Zci_15284
Zci_03618
Zci_01383
Zci_08401
Zci_06201
Zci_02952
Zci_15424
Zci_05374
Zci_06184
Zci_09916
Zci_09493
Zci_06747
Zci_14853
Zci_15417
Zci_11959
Zci_06725
Zci_09282
Zci_04763
Zci_08525
Zci_09627
Zci_09657
Zci_08591
Zci_12847
Zci_04006
Zci_07669
Zci_09251
Zci_15269
Zci_04095
Zci_06096
Zci_01696
Zci_03612
Zci_02229
Zci_05197
Zci_06920
Zci_03319
Zci_01301
Zci_14053
Zci_15423
Zci_01388
Zci_01021
Zci_11180
Zci_03427
Zci_12732
Zci_05907
Zci_14055
Zci_05630
Zci_10663
Zci_05509
Zci_05044
Zci_08845
Zci_13047
Zci_12106
Zci_03098
Zci_07129
Zci_11354
Zci_15872
Zci_09235
Zci_12183
Zci_06836
Zci_02300
Zci_06294
Zci_12793
Zci_02945
Zci_15629
Zci_14942
Zci_00845
Zci_01652
Zci_01533
Zci_06621
Zci_01475
Zci_00933
Zci_02028
Zci_07951
Zci_05198
Zci_10441
Zci_03110
Zci_08035
Zci_04363
Zci_14485
Zci_01859
Zci_01681
Zci_01986
Zci_12755
Zci_09623
Zci_06300
Zci_05472
Zci_10355
Zci_14634
Zci_06358
Zci_04890
Zci_03092
Zci_05866
Zci_00872
Zci_03464
Zci_07168
Zci_10623
Zci_13849
Zci_10067
Zci_00725
Zci_10712
Zci_05543
Zci_08287
Zci_15570
Zci_14951
Zci_08536
Zci_02340
Zci_03048
Zci_05761
Zci_00771
Zci_09922
Zci_11561
Zci_08748
Zci_09029
Zci_13311
Zci_01375
Zci_04261
Zci_12368
Zci_07692
Zci_01715
Zci_13630
Zci_04323
Zci_11803
Zci_10660
Zci_01028
Zci_11069
Zci_08990
Zci_13118
Zci_07620
Zci_13745
Zci_00307
Zci_15297
Zci_07708
Zci_02470
Zci_02346
Zci_06289
Zci_08345
Zci_03393
Zci_13740
Zci_08788
Zci_01925
Zci_04845
Zci_11037
Zci_04128
Zci_07453
Zci_03211
Zci_06183
Zci_02329
Zci_11197
Zci_00012
Zci_00934
Zci_10379
Zci_11879
Zci_11865
Zci_06299
Zci_01304
Zci_08466
Zci_04333
Zci_13850
Zci_08974
Zci_01380
Zci_05949
Zci_07062
Zci_14476
Zci_04011
Zci_02828
Zci_01653
Zci_10713
Zci_07806
Zci_09079
Zci_02303
Zci_00460
Zci_04994
Zci_12220
Zci_10684
Zci_06462
Zci_11813
Zci_05687
Zci_04612
Zci_10894
Zci_10512
Zci_13048
Zci_01330
Zci_02630
Zci_12310
Zci_02479
Zci_05530
Zci_13400
Zci_09557
Zci_08183
Zci_16407
Zci_02345
Zci_08399
Zci_06392
Zci_03359
Zci_14455
Zci_04182
Zci_11583
Zci_08924
Zci_08534
Zci_04283
Zci_14622
Zci_06420
Zci_06073
Zci_01702
Zci_01617
Zci_03271
Zci_11544
Zci_00066
Zci_07672
Zci_11238
Zci_10962
Zci_15070
Zci_12869
Zci_13283
Zci_04085
Zci_11983
Zci_02008
Zci_13261
Zci_04223
Zci_02119
Zci_14901
Zci_03293
Zci_09475
Zci_00666
Zci_04306
Zci_04960
Zci_00994
Zci_06813
Zci_14681
Zci_01854
Zci_02097
Zci_07069
Zci_00525
Zci_07954
Zci_03799
Zci_07999
Zci_02062
Zci_10706
Zci_12024
Zci_15283
Zci_07277
Zci_03935
Zci_01033
Zci_04794
Zci_02701
Zci_02228
Zci_12167
Zci_15911
Zci_03872
Zci_04381
Zci_06424
Zci_13786
Zci_06586
Zci_11872
Zci_02284
Zci_03458
Zci_01447
Zci_00228
Zci_03400
Zci_08020
Zci_02188
Zci_14624
Zci_09257
Zci_07972
Zci_09930
Zci_11863
Zci_03793
Zci_01085
Zci_11103
Zci_00169
Zci_10708
Zci_01725
Zci_10881
Zci_06099
Zci_08495
Zci_01773
Zci_08939
Zci_02774
Zci_15627
Zci_01930
Zci_01387
Zci_11438
Zci_15426
Zci_15717
Zci_03877
Zci_08361
Zci_14256
Zci_04716
Zci_04281
Zci_03280
Zci_14579
Zci_09077
Zci_10143
Zci_13041
Zci_12169
Zci_13276
Zci_08180
Zci_10595
Zci_09283
Zci_12385
Zci_06738
Zci_11433
Zci_06418
Zci_03197
Zci_00733
Zci_01602
Zci_15415
Zci_07582
Zci_12187
Zci_09664
Zci_13434
Zci_07167
Zci_03061
Zci_14858
Zci_04725
Zci_10608
Zci_10434
Zci_15613
Zci_00677
Zci_08224
Zci_15784
Zci_03630
Zci_08544
Zci_07868
Zci_02570
Zci_05276
Zci_02891
Zci_04224
Zci_15285
Zci_07084
Zci_13664
Zci_09279
Zci_12214
Zci_01200
Zci_14396
Zci_00887
Zci_11154
Zci_03711
Zci_11157
Zci_04124
Zci_04993
Zci_10978
Zci_00054
Zci_10118
Zci_00645
Zci_03168
Zci_07908
Zci_14874
Zci_12142
Zci_01481
Zci_10421
Zci_01703
Zci_07848
Zci_01488
Zci_09987
Zci_12951
Zci_16360
Zci_02471
Zci_09021
Zci_07504
Zci_04792
Zci_04148
Zci_11476
Zci_09513
Zci_10085
Zci_11641
Zci_08570
Zci_07732
Zci_05868
Zci_15971
Zci_06512
Zci_06336
Zci_07940
Zci_12433
Zci_16574
Zci_11453
Zci_05918
Zci_01296
Zci_11873
Zci_13479
Zci_13481
Zci_15977
Zci_08543
Zci_13955
Zci_09242
Zci_08456
Zci_12319
Zci_12972
Zci_01886
Zci_13493
Zci_06872
Zci_02357
Zci_03595
Zci_11056
Zci_04242
Zci_15333
Zci_02475
Zci_07756
Zci_06504
Zci_09277
Zci_09504
Zci_08915
Zci_14646
Zci_04108
Zci_00544
Zci_00979
Zci_13140
Zci_16578
Zci_04052
Zci_07384
Zci_08229
Zci_03607
Zci_15975
Zci_03783
Zci_06477
Zci_13598
Zci_01572
Zci_01766
Zci_15491
Zci_06405
Zci_03412
Zci_11123
Zci_11114
Zci_01722
Zci_08742
Zci_11160
Zci_04090
Zci_00734
Zci_05831
Zci_10555
Zci_04480
Zci_00339
Zci_09359
Zci_07028
Zci_06414
Zci_03438
Zci_02343
Zci_03062
Zci_03980
Zci_10933
Zci_14730
Zci_01989
Zci_05485
Zci_15394
Zci_13507
Zci_13130
Zci_09130
Zci_12980
Zci_07307
Zci_10278
Zci_03757
Zci_12094
Zci_11534
Zci_03321
Zci_08518
Zci_04237
Zci_01831
Zci_05856
Zci_13353
Zci_03288
Zci_08538
Zci_15645
Zci_11586
Zci_06177
Zci_07085
Zci_04189
Zci_07388
Zci_14107
Zci_13764
Zci_03569
Zci_14808
Zci_10996
Zci_01599
Zci_00944
Zci_03234
Zci_00671
Zci_03767
Zci_13472
Zci_06351
Zci_14573
Zci_04672
Zci_08149
Zci_05724
Zci_11187
Zci_03572
Zci_07558
Zci_15272
Zci_04931
Zci_07619
Zci_13486
Zci_11138
Zci_03459
Zci_05776
Zci_05832
Zci_09772
Zci_10058
Zci_00172
Zci_13725
Zci_06023
Zci_15024
Zci_00596
Zci_12112
Zci_11536
Zci_01489
Zci_03030
Zci_06913
Zci_11012
Zci_08807
Zci_13868
Zci_07260
Zci_07739
Zci_13853
Zci_07929
Zci_05754
Zci_00549
Zci_00053
Zci_04676
Zci_03181
Zci_09671
Zci_12729
Zci_00144
Zci_10805
Zci_00134
Zci_06751
Zci_16607
Zci_13409
Zci_09639
Zci_14580
Zci_01948
Zci_03790
Zci_13653
Zci_08394
Zci_15802
Zci_00669
Zci_13177
Zci_15979
Zci_10989
Zci_12009
Zci_03664
Zci_10968
Zci_05890
Zci_14876
Zci_02225
Zci_11531
Zci_06108
Zci_03524
Zci_06042
Zci_06226
Zci_05522
Zci_16605
Zci_15343
Zci_15037
Zci_12393
Zci_13123
Zci_11429
Zci_00612
Zci_12374
Zci_07587
Zci_06634
Zci_02219
Zci_06741
Zci_11349
Zci_11837
Zci_05987
Zci_05859
Zci_10723
Zci_10913
Zci_05272
Zci_14176
Zci_02871
Zci_06340
Zci_02442
Zci_03866
Zci_14282
Zci_06509
Zci_08682
Zci_06105
Zci_09715
Zci_06714
Zci_09969
Zci_08918
Zci_15778
Zci_11532
Zci_03297
Zci_00412
Zci_13816
Zci_13327
Zci_10411
Zci_14760
Zci_04099
Zci_05290
Zci_01373
Zci_09820
Zci_10829
Zci_13355
Zci_03827
Zci_09344
Zci_11757
Zci_03421
Zci_03874
Zci_03191
Zci_13540
Zci_02870
Zci_05086
Zci_05968
Zci_11535
Zci_00403
Zci_08759
Zci_07018
Zci_15849
Zci_12439
Zci_01518
Zci_01604
Zci_03857
Zci_06978
Zci_11728
Zci_15335
Zci_12551
Zci_11436
Zci_07827
Zci_12038
Zci_09532
Zci_08912
Zci_13211
Zci_09832
Zci_02214
Zci_11239
Zci_04761
Zci_02873
Zci_10458
Zci_13838
Zci_02064
Zci_15386
Zci_01185
Zci_01109
Zci_13308
Zci_12632
Zci_02607
Zci_06048
Zci_04860
Zci_14390
Zci_02973
Zci_09738
Zci_06261
Zci_00112
Zci_01787
Zci_08239
Zci_10501
Zci_11990
Zci_01966
Zci_14657
Zci_03829
Zci_08565
Zci_01573
Zci_12470
Zci_05574
Zci_05327
Zci_14898
Zci_15782
Zci_08451
Zci_06192
Zci_08890
Zci_04039
Zci_08660
Zci_10571
Zci_11919
Zci_16272
Zci_10387
Zci_15304
Zci_14065
Zci_09121
Zci_03474
Zci_00586
Zci_13494
Zci_02194
Zci_11110
Zci_05048
Zci_06883
Zci_14322
Zci_08366
Zci_10077
Zci_07110
Zci_02151
Zci_06776
Zci_06582
Zci_01192
Zci_11716
Zci_04996
Zci_07164
Zci_02647
Zci_03065
Zci_10972
Zci_05252
Zci_09196
Zci_14617
Zci_01636
Zci_06350
Zci_07496
Zci_09221
Zci_05106
Zci_07836
Zci_11827
Zci_10363
Zci_05660
Zci_04017
Zci_12165
Zci_15250
Zci_00383
Zci_09175
Zci_06174
Zci_06106
Zci_01981
Zci_07622
Zci_07291
Zci_01525
Zci_14846
Zci_08911
Zci_07433
Zci_04904
Zci_00254
Zci_05379
Zci_01374
Zci_01714
Zci_12182
Zci_15177
Zci_03849
Zci_10480
Zci_00289
Zci_14776
Zci_15375
Zci_10820
Zci_00204
Zci_04879
Zci_06449
Zci_02881
Zci_06390
Zci_06354
Zci_01050
Zci_04301
Zci_13464
Zci_08357
Zci_12714
Zci_05330
Zci_06727
Zci_13971
Zci_10917
Zci_03354
Zci_00960
Zci_13709
Zci_11222
Zci_03050
Zci_06409
Zci_01025
Zci_12549
Zci_11398
Zci_06089
Zci_13220
Zci_04521
Zci_14739
Zci_12193
Zci_04481
Zci_07340
Zci_04226
Zci_01151
Zci_04260
Zci_00548
Zci_06787
Zci_09318
Zci_13408
Zci_03364
Zci_13476
Zci_02974
Zci_09626
Zci_06399
Zci_03939
Zci_00788
Zci_16425
Zci_01891
Zci_15890
Zci_11897
Zci_12961
Zci_05981
Zci_01889
Zci_05177
Zci_01396
Zci_08007
Zci_15219
Zci_13368
Zci_03201
Zci_14937
Zci_02039
Zci_14066
Zci_13692
Zci_07467
Zci_06764
Zci_01501
Zci_13586
Zci_04821
Zci_01442
Zci_04308
Zci_09082
Zci_08808
Zci_13370
Zci_15330
Zci_15301
Zci_08935
Zci_03375
Zci_10062
Zci_05089
Zci_02156
Zci_15152
Zci_05144
Zci_04986
Zci_04462
Zci_09131
Zci_05119
Zci_00039
Zci_09602
Zci_13671
Zci_07017
Zci_03259
Zci_11410
Zci_15737
Zci_05059
Zci_02422
Zci_07367
Zci_01371
Zci_14705
Zci_00333
Zci_03820
Zci_03470
Zci_15175
Zci_11023
Zci_04701
Zci_14138
Zci_14888
Zci_13249
Zci_07215
Zci_00846
Zci_12777
Zci_06258
Zci_14826
Zci_00768
Zci_08555
Zci_05935
Zci_13696
Zci_08463
Zci_12789
Zci_03136
Zci_10951
Zci_12156
Zci_13452
Zci_13010
Zci_11216
Zci_04020
Zci_03327
Zci_10412
Zci_12386
Zci_06878
Zci_15332
Zci_01843
Zci_04176
Zci_03220
Zci_00196
Zci_05546
Zci_05060
Zci_11082
Zci_11548
Zci_09514
Zci_08771
Zci_10211
Zci_06970
Zci_02263
Zci_03258
Zci_06233
Zci_12473
Zci_02800
Zci_12137
Zci_06885
Zci_01313
Zci_11081
Zci_02153
Zci_15564
Zci_05649
Zci_07757
Zci_14061
Zci_04616
Zci_01497
Zci_00495
Zci_10476
Zci_05602
Zci_08489
Zci_10484
Zci_07727
Zci_04600
Zci_10808
Zci_05516
Zci_04386
Zci_01321
Zci_02358
Zci_13252
Zci_06176
Zci_05231
Zci_14717
Zci_04009
Zci_03146
Zci_02839
Zci_05524
Zci_03909
Zci_14796
Zci_02201
Zci_15617
Zci_15880
Zci_01472
Zci_07118
Zci_13632
Zci_12196
Zci_09432
Zci_11538
Zci_15985
Zci_15381
Zci_10290
Zci_10362
Zci_04271
Zci_09127
Zci_01971
Zci_10839
Zci_06172
Zci_05857
Zci_06170
Zci_08885
Zci_15305
Zci_14660
Zci_02288
Zci_00500
Zci_02102
Zci_07830
Zci_01667
Zci_07391
Zci_05925
Zci_02460
Zci_03480
Zci_12955
Zci_10393
Zci_07918
Zci_09412
Zci_08409
Zci_07209
Zci_02563
Zci_01348
Zci_15619
Zci_12835
Zci_10241
Zci_00842
Zci_05471
Zci_00047
Zci_05157
Zci_09473
Zci_11547
Zci_00871
Zci_11174
Zci_14083
Zci_04288
Zci_11889
Zci_08222
Zci_02259
Zci_07831
Zci_02240
Zci_11368
Zci_06066
Zci_14661
Zci_09205
Zci_10517
Zci_06013
Zci_06295
Zci_12798
Zci_10835
Zci_05681
Zci_10795
Zci_07252
Zci_03057
Zci_10930
Zci_06887
Zci_01693
Zci_01548
Zci_00187
Zci_15436
Zci_13446
Zci_06455
Zci_04945
Zci_07837
Zci_09749
Zci_06550
Zci_04507
Zci_10240
Zci_04773
Zci_07574
Zci_07276
Zci_00374
Zci_03721
Zci_10953
Zci_13323
Zci_15445
Zci_07749
Zci_08770
Zci_13127
Zci_15264
Zci_06377
Zci_15926
Zci_04416
Zci_03957
Zci_12244
Zci_06344
Zci_08256
Zci_10447
Zci_04751
Zci_06206
Zci_08927
Zci_05202
Zci_14735
Zci_13224
Zci_15968
Zci_03270
Zci_12089
Zci_04415
Zci_04173
Zci_02488
Zci_07251
Zci_02136
Zci_05616
Zci_13683
Zci_07715
Zci_05311
Zci_15633
Zci_05148
Zci_01017
Zci_10779
Zci_04178
Zci_03774
Zci_11918
Zci_10724
Zci_05180
Zci_03113
Zci_12410
Zci_03315
Zci_01964
Zci_06293
Zci_13903
Zci_14048
Zci_16532
Zci_06520
Zci_09471
Zci_11576
Zci_13781
Zci_09178
Zci_15795
Zci_05331
Zci_07724
Zci_08993
Zci_12289
Zci_07931
Zci_07065
Zci_00546
Zci_12916
Zci_15294
Zci_04433
Zci_10192
Zci_11968
Zci_15277
Zci_09105
Zci_10614
Zci_02603
Zci_10287
Zci_06313
Zci_01692
Zci_03041
Zci_05093
Zci_05160
Zci_10763
Zci_02638
Zci_12475
Zci_01995
Zci_01041
Zci_07585
Zci_16264
Zci_00780
Zci_05491
Zci_08223
Zci_13159
Zci_09904
Zci_15508
Zci_09704
Zci_06223
Zci_01926
Zci_05694
Zci_02818
Zci_00889
Zci_06952
Zci_06185
Zci_10911
Zci_11530
Zci_11212
Zci_07853
Zci_11660
Zci_12923
Zci_03238
Zci_03186
Zci_05247
Zci_16587
Zci_15854
Zci_13748
Zci_06199
Zci_06319
Zci_01520
Zci_02466
Zci_06248
Zci_04551
Zci_08390
Zci_02437
Zci_10819
Zci_07737
Zci_05861
Zci_15169
Zci_05017
Zci_09678
Zci_07001
Zci_03520
Zci_16406
Zci_07955
Zci_04626
Zci_01799
Zci_01952
Zci_02882
Zci_08958
Zci_01724
Zci_13471
Zci_06506
Zci_14531
Zci_11797
Zci_09610
Zci_01698
Zci_08236
Zci_05031
Zci_11769
Zci_04459
Zci_06817
Zci_13398
Zci_09731
Zci_04279
Zci_07509
Zci_09083
Zci_00198
Zci_11593
Zci_03575
Zci_14484
Zci_05764
Zci_07679
Zci_14419
Zci_03361
Zci_14558
Zci_00197
Zci_01959
Zci_00203
Zci_00981
Zci_09312
Zci_15566
Zci_12016
Zci_00573
Zci_11980
Zci_00167
Zci_11470
Zci_04158
Zci_01007
Zci_00034
Zci_14168
Zci_01552
Zci_04690
Zci_09422
Zci_03648
Zci_01269
Zci_12495
Zci_09614
Zci_09685
Zci_08659
Zci_09960
Zci_07847
Zci_08145
Zci_09688
Zci_02903
Zci_09401
Zci_15923
Zci_11487
Zci_00576
Zci_05172
Zci_06116
Zci_03495
Zci_01366
Zci_05278
Zci_01985
Zci_10289
Zci_00174
Zci_06043
Zci_09327
Zci_03494
Zci_13046
Zci_09621
Zci_14015
Zci_03796
Zci_04617
Zci_12612
Zci_15804
Zci_05429
Zci_13856
Zci_09613
Zci_05337
Zci_07248
Zci_12613
Zci_13484
Zci_01196
Zci_04925
Zci_15051
Zci_11998
Zci_11024
Zci_09667
Zci_03090
Zci_06016
Zci_04198
Zci_07414
Zci_02885
Zci_14457
Zci_14691
Zci_05467
Zci_03071
Zci_01232
Zci_07076
Zci_08460
Zci_13103
Zci_13641
Zci_12593
Zci_08880
Zci_14656
Zci_02826
Zci_12224
Zci_01444
Zci_15315
Zci_05836
Zci_04059
Zci_07711
Zci_11496
Zci_11747
Zci_15838
Zci_12938
Zci_00581
Zci_13810
Zci_14709
Zci_13937
Zci_04746
Zci_13858
Zci_02632
Zci_02359
Zci_12095
Zci_15379
Zci_02291
Zci_07647
Zci_10695
Zci_05953
Zci_01983
Zci_05438
Zci_15006
Zci_05245
Zci_08178
Zci_05437
Zci_08413
Zci_13445
Zci_06051
Zci_05095
Zci_01425
Zci_03651
Zci_05145
Zci_10428
Zci_01052
Zci_04950
Zci_11226
Zci_03344
Zci_03523
Zci_13440
Zci_12533
Zci_15656
Zci_02183
Zci_07355
Zci_01320
Zci_11059
Zci_00921
Zci_15334
Zci_05980
Zci_03788
Zci_05169
Zci_14112
Zci_11704
Zci_04822
Zci_14596
Zci_11862
Zci_01324
Zci_06326
Zci_11013
Zci_13055
Zci_00209
Zci_00747
Zci_10997
Zci_04767
Zci_04056
Zci_12116
Zci_08235
Zci_15178
Zci_07536
Zci_13189
Zci_00090
Zci_10752
Zci_04633
Zci_01222
Zci_13896
Zci_14106
Zci_06104
Zci_02661
Zci_04646
Zci_06217
Zci_13968
Zci_05686
Zci_00727
Zci_14878
Zci_00419
Zci_05111
Zci_02031
Zci_13503
Zci_10607
Zci_00232
Zci_07204
Zci_02073
Zci_11379
Zci_10438
Zci_11835
Zci_09887
Zci_05891
Zci_14423
Zci_03405
Zci_07646
Zci_05255
Zci_14349
Zci_05870
Zci_03691
Zci_00722
Zci_04042
Zci_04046
Zci_08717
Zci_03704
Zci_15170
Zci_04765
Zci_05425
Zci_06869
Zci_02277
Zci_07958
Zci_05725
Zci_07067
Zci_13049
Zci_00731
Zci_00024
Zci_11854
Zci_05477
Zci_04695
Zci_15859
Zci_04685
Zci_11061
Zci_08585
Zci_11857
Zci_00876
Zci_01160
Zci_01382
Zci_13020
Zci_02435
Zci_06113
Zci_06652
Zci_06579
Zci_08824
Zci_01786
Zci_01471
Zci_02067
Zci_04496
Zci_14982
Zci_12323
Zci_12483
Zci_11294
Zci_14335
Zci_06493
Zci_12827
Zci_11572
Zci_11909
Zci_13320
Zci_04634
Zci_13533
Zci_10070
Zci_06880
Zci_06564
Zci_01455
Zci_08681
Zci_03744
Zci_05239
Zci_06548
Zci_12365
Zci_13919
Zci_10961
Zci_12986
Zci_02877
Zci_11351
Zci_15329
Zci_07616
Zci_13205
Zci_12273
Zci_03423
Zci_11473
Zci_12907
Zci_07976
Zci_01654
Zci_09970
Zci_01707
Zci_05468
Zci_14980
Zci_13604
Zci_04654
Zci_10873
Zci_04827
Zci_14522
Zci_11091
Zci_08931
Zci_11748
Zci_11933
Zci_11825
Zci_07317
Zci_04187
Zci_04225
Zci_11847
Zci_14124
Zci_11207
Zci_12131
Zci_10601
Zci_13883
Zci_00509
Zci_09754
Zci_06526
Zci_00901
Zci_02341
Zci_05672
Zci_09753
Zci_01300
Zci_03184
Zci_14136
Zci_01684
Zci_09673
Zci_11974
Zci_00783
Zci_12631
Zci_11746
Zci_07924
Zci_01585
Zci_03738
Zci_11370
Zci_11042
Zci_09426
Zci_01675
Zci_03873
Zci_12515
Zci_04538
Zci_10922
Zci_12039
Zci_01423
Zci_00161
Zci_07042
Zci_04786
Zci_07862
Zci_15974
Zci_00554
Zci_09544
Zci_00507
