Zm00001d014503
Zm00001d050690
Zm00001d053255
Zm00001d022423
Zm00001d014812
Zm00001d025671
Zm00001d003772
Zm00001d042342
Zm00001d042557
Zm00001d030057
Zm00001d018914
Zm00001d027566
Zm00001d039289
Zm00001d042320
Zm00001d035330
Zm00001d033008
Zm00001d040631
Zm00001d028202
Zm00001d039998
Zm00001d029929
Zm00001d032202
Zm00001d051916
Zm00001d016569
Zm00001d016571
Zm00001d034450
Zm00001d035019
Zm00001d012711
Zm00001d041531
