"0","v.DEGList.filtered.norm_E.df <- as_tibble(v.DEGList.filtered.norm$E, rownames = ""geneID"")"
"0","write_tsv(v.DEGList.filtered.norm_E.df, ""tables/normalized_expression_values_on_the_log2_scale.tsv"")"
"0","save(v.DEGList.filtered.norm, file = ""log2_expression_voom.RData"")"
