Azfi_s0153.g053480
Azfi_s0080.g038455
Azfi_s0003.g007457
Azfi_s0038.g026224
Azfi_s0241.g059757
Azfi_s0129.g048880
Azfi_s0087.g042383
Azfi_s3749.g116750
Azfi_s0160.g054011
Azfi_s0619.g079567
Azfi_s0043.g027028
Azfi_s1506.g103797
Azfi_s1026.g095464
Azfi_s0188.g056819
Azfi_s0230.g059138
Azfi_s0083.g038815
Azfi_s0090.g042605
Azfi_s0075.g037684
Azfi_s0173.g055885
Azfi_s0250.g060237
Azfi_s0045.g029770
Azfi_s0074.g037381
Azfi_s0111.g045686
Azfi_s0049.g030784
Azfi_s0006.g010104
Azfi_s0004.g008746
Azfi_s0049.g030831
Azfi_s0775.g086523
Azfi_s0035.g025499
Azfi_s0073.g037095
Azfi_s0801.g087534
Azfi_s0078.g038157
Azfi_s0206.g057807
Azfi_s0065.g035928
Azfi_s0414.g068603
Azfi_s0038.g026220
Azfi_s3966.g117405
Azfi_s0022.g016065
Azfi_s0117.g046478
Azfi_s0037.g026013
Azfi_s0002.g003643
Azfi_s0880.g091023
Azfi_s0006.g010443
Azfi_s0099.g044089
Azfi_s0005.g009123
Azfi_s0212.g058164
Azfi_s0017.g014553
Azfi_s0074.g037295
Azfi_s1495.g103612
Azfi_s0097.g043881
Azfi_s1257.g100498
Azfi_s1446.g103196
Azfi_s0236.g059494
Azfi_s0076.g037860
Azfi_s0076.g037784
Azfi_s0479.g073091
Azfi_s0061.g034908
Azfi_s0370.g067093
Azfi_s0002.g003108
Azfi_s0003.g007689
