"","ID","Description","GeneRatio","BgRatio","pvalue","p.adjust","qvalue","geneID","Count"
"GO:0010105","GO:0010105","negative regulation of ethylene-activated signaling pathway","2/35","14/5696",0.00318705295962541,0.359680933516347,0.347589336907888,"Pp3c27_1350V3/Pp3c14_18760V3",2
"GO:0070298","GO:0070298","negative regulation of phosphorelay signal transduction system","2/35","14/5696",0.00318705295962541,0.359680933516347,0.347589336907888,"Pp3c27_1350V3/Pp3c14_18760V3",2
"GO:0010104","GO:0010104","regulation of ethylene-activated signaling pathway","2/35","16/5696",0.00417043819465618,0.359680933516347,0.347589336907888,"Pp3c27_1350V3/Pp3c14_18760V3",2
"GO:0070297","GO:0070297","regulation of phosphorelay signal transduction system","2/35","16/5696",0.00417043819465618,0.359680933516347,0.347589336907888,"Pp3c27_1350V3/Pp3c14_18760V3",2
"GO:0009581","GO:0009581","detection of external stimulus","2/35","19/5696",0.00587462243353685,0.359680933516347,0.347589336907888,"Pp3c9_4230V3/Pp3c4_15350V3",2
"GO:0009582","GO:0009582","detection of abiotic stimulus","2/35","19/5696",0.00587462243353685,0.359680933516347,0.347589336907888,"Pp3c9_4230V3/Pp3c4_15350V3",2
"GO:0009638","GO:0009638","phototropism","2/35","20/5696",0.00650229210427763,0.359680933516347,0.347589336907888,"Pp3c4_15350V3/Pp3c27_6760V3",2
"GO:0000281","GO:0000281","mitotic cytokinesis","3/35","71/5696",0.00913074866336766,0.359680933516347,0.347589336907888,"Pp3c17_15260V3/Pp3c22_5840V3/Pp3c9_4230V3",3
"GO:0006997","GO:0006997","nucleus organization","2/35","25/5696",0.010071368425626,0.359680933516347,0.347589336907888,"Pp3c18_19540V3/Pp3c10_14800V3",2
"GO:0010200","GO:0010200","response to chitin","2/35","26/5696",0.0108688429465554,0.359680933516347,0.347589336907888,"Pp3c27_1350V3/Pp3c2_11380V3",2
"GO:0000910","GO:0000910","cytokinesis","3/35","77/5696",0.0113967276616507,0.359680933516347,0.347589336907888,"Pp3c17_15260V3/Pp3c22_5840V3/Pp3c9_4230V3",3
"GO:0061640","GO:0061640","cytoskeleton-dependent cytokinesis","3/35","77/5696",0.0113967276616507,0.359680933516347,0.347589336907888,"Pp3c17_15260V3/Pp3c22_5840V3/Pp3c9_4230V3",3
"GO:1902532","GO:1902532","negative regulation of intracellular signal transduction","2/35","28/5696",0.0125446647907474,0.359680933516347,0.347589336907888,"Pp3c27_1350V3/Pp3c14_18760V3",2
"GO:1901698","GO:1901698","response to nitrogen compound","4/35","150/5696",0.0128280668549119,0.359680933516347,0.347589336907888,"Pp3c27_1350V3/Pp3c14_18760V3/Pp3c9_4230V3/Pp3c2_11380V3",4
"GO:0051606","GO:0051606","detection of stimulus","2/35","30/5696",0.0143260451629062,0.359680933516347,0.347589336907888,"Pp3c9_4230V3/Pp3c4_15350V3",2
"GO:0009753","GO:0009753","response to jasmonic acid","3/35","85/5696",0.0148831113785231,0.359680933516347,0.347589336907888,"Pp3c27_1350V3/Pp3c16_11020V3/Pp3c4_15350V3",3
"GO:0045893","GO:0045893","positive regulation of transcription, DNA-templated","4/35","159/5696",0.0156121540287851,0.359680933516347,0.347589336907888,"Pp3c5_27150V3/Pp3c1_38880V3/Pp3c17_15260V3/Pp3c2_11380V3",4
"GO:0010243","GO:0010243","response to organonitrogen compound","3/35","89/5696",0.0168293980606309,0.359680933516347,0.347589336907888,"Pp3c27_1350V3/Pp3c9_4230V3/Pp3c2_11380V3",3
"GO:1902680","GO:1902680","positive regulation of RNA biosynthetic process","4/35","167/5696",0.0183868359134098,0.359680933516347,0.347589336907888,"Pp3c5_27150V3/Pp3c1_38880V3/Pp3c17_15260V3/Pp3c2_11380V3",4
"GO:1903508","GO:1903508","positive regulation of nucleic acid-templated transcription","4/35","167/5696",0.0183868359134098,0.359680933516347,0.347589336907888,"Pp3c5_27150V3/Pp3c1_38880V3/Pp3c17_15260V3/Pp3c2_11380V3",4
"GO:0009867","GO:0009867","jasmonic acid mediated signaling pathway","2/35","37/5696",0.0213538067270068,0.359680933516347,0.347589336907888,"Pp3c27_1350V3/Pp3c4_15350V3",2
"GO:0071395","GO:0071395","cellular response to jasmonic acid stimulus","2/35","38/5696",0.0224541510526809,0.359680933516347,0.347589336907888,"Pp3c27_1350V3/Pp3c4_15350V3",2
"GO:0051254","GO:0051254","positive regulation of RNA metabolic process","4/35","180/5696",0.0235218861989294,0.359680933516347,0.347589336907888,"Pp3c5_27150V3/Pp3c1_38880V3/Pp3c17_15260V3/Pp3c2_11380V3",4
"GO:0010557","GO:0010557","positive regulation of macromolecule biosynthetic process","4/35","185/5696",0.0257091514189782,0.359680933516347,0.347589336907888,"Pp3c5_27150V3/Pp3c1_38880V3/Pp3c17_15260V3/Pp3c2_11380V3",4
"GO:0007033","GO:0007033","vacuole organization","2/35","41/5696",0.0258928394975518,0.359680933516347,0.347589336907888,"Pp3c14_5930V3/Pp3c9_4230V3",2
"GO:0009637","GO:0009637","response to blue light","3/35","106/5696",0.0266373705307504,0.359680933516347,0.347589336907888,"Pp3c5_27150V3/Pp3c4_15350V3/Pp3c27_6760V3",3
"GO:1901615","GO:1901615","organic hydroxy compound metabolic process","3/35","107/5696",0.0272921752611747,0.359680933516347,0.347589336907888,"Pp3c11_10350V3/Pp3c20_8330V3/Pp3c4_15350V3",3
"GO:0009617","GO:0009617","response to bacterium","4/35","189/5696",0.0275455150150647,0.359680933516347,0.347589336907888,"Pp3c27_1350V3/Pp3c14_18760V3/Pp3c3_1500V3/Pp3c4_19160V3",4
"GO:0010628","GO:0010628","positive regulation of gene expression","4/35","189/5696",0.0275455150150647,0.359680933516347,0.347589336907888,"Pp3c5_27150V3/Pp3c1_38880V3/Pp3c17_15260V3/Pp3c2_11380V3",4
"GO:0051301","GO:0051301","cell division","3/35","110/5696",0.0293084806033724,0.359680933516347,0.347589336907888,"Pp3c17_15260V3/Pp3c22_5840V3/Pp3c9_4230V3",3
"GO:0006468","GO:0006468","protein phosphorylation","6/35","390/5696",0.0295819022070873,0.359680933516347,0.347589336907888,"Pp3c2_25440V3/Pp3c1_21050V3/Pp3c14_18760V3/Pp3c22_5840V3/Pp3c25_7050V3/Pp3c14_3550V3",6
"GO:0010646","GO:0010646","regulation of cell communication","4/35","194/5696",0.0299502512750774,0.359680933516347,0.347589336907888,"Pp3c27_1350V3/Pp3c17_13870V3/Pp3c14_18760V3/Pp3c17_15260V3",4
"GO:0045935","GO:0045935","positive regulation of nucleobase-containing compound metabolic process","4/35","195/5696",0.0304458618195514,0.359680933516347,0.347589336907888,"Pp3c5_27150V3/Pp3c1_38880V3/Pp3c17_15260V3/Pp3c2_11380V3",4
"GO:0031328","GO:0031328","positive regulation of cellular biosynthetic process","4/35","198/5696",0.0319621683058042,0.359680933516347,0.347589336907888,"Pp3c5_27150V3/Pp3c1_38880V3/Pp3c17_15260V3/Pp3c2_11380V3",4
"GO:0048523","GO:0048523","negative regulation of cellular process","6/35","403/5696",0.0340361801925968,0.359680933516347,0.347589336907888,"Pp3c27_1350V3/Pp3c5_27150V3/Pp3c14_5930V3/Pp3c14_18760V3/Pp3c9_4230V3/Pp3c4_15350V3",6
"GO:0006366","GO:0006366","transcription by RNA polymerase II","2/35","51/5696",0.0387554312723447,0.359680933516347,0.347589336907888,"Pp3c1_38880V3/Pp3c14_14540V3",2
"GO:0006721","GO:0006721","terpenoid metabolic process","2/35","51/5696",0.0387554312723447,0.359680933516347,0.347589336907888,"Pp3c20_8330V3/Pp3c4_15350V3",2
"GO:0009606","GO:0009606","tropism","2/35","51/5696",0.0387554312723447,0.359680933516347,0.347589336907888,"Pp3c4_15350V3/Pp3c27_6760V3",2
"GO:0031325","GO:0031325","positive regulation of cellular metabolic process","5/35","317/5696",0.0425432112982216,0.359680933516347,0.347589336907888,"Pp3c5_27150V3/Pp3c1_38880V3/Pp3c14_5930V3/Pp3c17_15260V3/Pp3c2_11380V3",5
"GO:0009891","GO:0009891","positive regulation of biosynthetic process","4/35","222/5696",0.0457016457853918,0.359680933516347,0.347589336907888,"Pp3c5_27150V3/Pp3c1_38880V3/Pp3c17_15260V3/Pp3c2_11380V3",4
"GO:0006066","GO:0006066","alcohol metabolic process","2/35","56/5696",0.0459299093255046,0.359680933516347,0.347589336907888,"Pp3c20_8330V3/Pp3c4_15350V3",2
"GO:1903047","GO:1903047","mitotic cell cycle process","3/35","134/5696",0.0482085978019137,0.359680933516347,0.347589336907888,"Pp3c17_15260V3/Pp3c22_5840V3/Pp3c9_4230V3",3
"GO:0042542","GO:0042542","response to hydrogen peroxide","2/35","58/5696",0.0489275276562993,0.359680933516347,0.347589336907888,"Pp3c14_18760V3/Pp3c9_4230V3",2
"GO:1902531","GO:1902531","regulation of intracellular signal transduction","2/35","58/5696",0.0489275276562993,0.359680933516347,0.347589336907888,"Pp3c27_1350V3/Pp3c14_18760V3",2
"GO:0090558","GO:0090558","plant epidermis development","3/35","136/5696",0.0500016869405278,0.359680933516347,0.347589336907888,"Pp3c1_38880V3/Pp3c11_10350V3/Pp3c4_15350V3",3
"GO:0042127","GO:0042127","regulation of cell population proliferation","2/35","59/5696",0.0504526733735268,0.359680933516347,0.347589336907888,"Pp3c14_5930V3/Pp3c17_15260V3",2
"GO:0006720","GO:0006720","isoprenoid metabolic process","2/35","61/5696",0.0535543489790201,0.359680933516347,0.347589336907888,"Pp3c20_8330V3/Pp3c4_15350V3",2
"GO:0000278","GO:0000278","mitotic cell cycle","3/35","141/5696",0.054627112796936,0.359680933516347,0.347589336907888,"Pp3c17_15260V3/Pp3c22_5840V3/Pp3c9_4230V3",3
"GO:0048522","GO:0048522","positive regulation of cellular process","6/35","452/5696",0.0547276428477311,0.359680933516347,0.347589336907888,"Pp3c17_13870V3/Pp3c5_27150V3/Pp3c1_38880V3/Pp3c14_5930V3/Pp3c17_15260V3/Pp3c2_11380V3",6
"GO:0009968","GO:0009968","negative regulation of signal transduction","2/35","62/5696",0.0551303703233018,0.359680933516347,0.347589336907888,"Pp3c27_1350V3/Pp3c14_18760V3",2
"GO:0010648","GO:0010648","negative regulation of cell communication","2/35","63/5696",0.0567228455296251,0.359680933516347,0.347589336907888,"Pp3c27_1350V3/Pp3c14_18760V3",2
"GO:0023057","GO:0023057","negative regulation of signaling","2/35","63/5696",0.0567228455296251,0.359680933516347,0.347589336907888,"Pp3c27_1350V3/Pp3c14_18760V3",2
"GO:0009893","GO:0009893","positive regulation of metabolic process","5/35","345/5696",0.0575908213469966,0.359680933516347,0.347589336907888,"Pp3c5_27150V3/Pp3c1_38880V3/Pp3c14_5930V3/Pp3c17_15260V3/Pp3c2_11380V3",5
"GO:0016310","GO:0016310","phosphorylation","5/35","347/5696",0.0587715230418779,0.359680933516347,0.347589336907888,"Pp3c2_25440V3/Pp3c1_21050V3/Pp3c14_18760V3/Pp3c22_5840V3/Pp3c14_3550V3",5
"GO:0000422","GO:0000422","autophagy of mitochondrion","1/35","10/5696",0.0598210878880783,0.359680933516347,0.347589336907888,"Pp3c14_5930V3",1
"GO:0009559","GO:0009559","embryo sac central cell differentiation","1/35","10/5696",0.0598210878880783,0.359680933516347,0.347589336907888,"Pp3c10_14800V3",1
"GO:0009583","GO:0009583","detection of light stimulus","1/35","10/5696",0.0598210878880783,0.359680933516347,0.347589336907888,"Pp3c4_15350V3",1
"GO:0009585","GO:0009585","red, far-red light phototransduction","1/35","10/5696",0.0598210878880783,0.359680933516347,0.347589336907888,"Pp3c4_15350V3",1
"GO:0009649","GO:0009649","entrainment of circadian clock","1/35","10/5696",0.0598210878880783,0.359680933516347,0.347589336907888,"Pp3c4_15350V3",1
"GO:0009687","GO:0009687","abscisic acid metabolic process","1/35","10/5696",0.0598210878880783,0.359680933516347,0.347589336907888,"Pp3c4_15350V3",1
"GO:0018202","GO:0018202","peptidyl-histidine modification","1/35","10/5696",0.0598210878880783,0.359680933516347,0.347589336907888,"Pp3c14_18760V3",1
"GO:0030203","GO:0030203","glycosaminoglycan metabolic process","1/35","10/5696",0.0598210878880783,0.359680933516347,0.347589336907888,"Pp3c4_19160V3",1
"GO:0031338","GO:0031338","regulation of vesicle fusion","1/35","10/5696",0.0598210878880783,0.359680933516347,0.347589336907888,"Pp3c19_14290V3",1
"GO:0043288","GO:0043288","apocarotenoid metabolic process","1/35","10/5696",0.0598210878880783,0.359680933516347,0.347589336907888,"Pp3c4_15350V3",1
"GO:0048766","GO:0048766","root hair initiation","1/35","10/5696",0.0598210878880783,0.359680933516347,0.347589336907888,"Pp3c1_38880V3",1
"GO:0061726","GO:0061726","mitochondrion disassembly","1/35","10/5696",0.0598210878880783,0.359680933516347,0.347589336907888,"Pp3c14_5930V3",1
"GO:0071216","GO:0071216","cellular response to biotic stimulus","1/35","10/5696",0.0598210878880783,0.359680933516347,0.347589336907888,"Pp3c14_18760V3",1
"GO:0071732","GO:0071732","cellular response to nitric oxide","1/35","10/5696",0.0598210878880783,0.359680933516347,0.347589336907888,"Pp3c14_18760V3",1
"GO:0090630","GO:0090630","activation of GTPase activity","1/35","10/5696",0.0598210878880783,0.359680933516347,0.347589336907888,"Pp3c19_14290V3",1
"GO:1902644","GO:1902644","tertiary alcohol metabolic process","1/35","10/5696",0.0598210878880783,0.359680933516347,0.347589336907888,"Pp3c4_15350V3",1
"GO:0005986","GO:0005986","sucrose biosynthetic process","1/35","11/5696",0.0656083305760696,0.359680933516347,0.347589336907888,"Pp3c20_980V3",1
"GO:0006714","GO:0006714","sesquiterpenoid metabolic process","1/35","11/5696",0.0656083305760696,0.359680933516347,0.347589336907888,"Pp3c4_15350V3",1
"GO:0006874","GO:0006874","cellular calcium ion homeostasis","1/35","11/5696",0.0656083305760696,0.359680933516347,0.347589336907888,"Pp3c4_15350V3",1
"GO:0010161","GO:0010161","red light signaling pathway","1/35","11/5696",0.0656083305760696,0.359680933516347,0.347589336907888,"Pp3c4_15350V3",1
"GO:0019432","GO:0019432","triglyceride biosynthetic process","1/35","11/5696",0.0656083305760696,0.359680933516347,0.347589336907888,"Pp3c20_8330V3",1
"GO:0031152","GO:0031152","aggregation involved in sorocarp development","1/35","11/5696",0.0656083305760696,0.359680933516347,0.347589336907888,"Pp3c9_4230V3",1
"GO:0045834","GO:0045834","positive regulation of lipid metabolic process","1/35","11/5696",0.0656083305760696,0.359680933516347,0.347589336907888,"Pp3c14_5930V3",1
"GO:0098630","GO:0098630","aggregation of unicellular organisms","1/35","11/5696",0.0656083305760696,0.359680933516347,0.347589336907888,"Pp3c9_4230V3",1
"GO:0098743","GO:0098743","cell aggregation","1/35","11/5696",0.0656083305760696,0.359680933516347,0.347589336907888,"Pp3c9_4230V3",1
"GO:2000113","GO:2000113","negative regulation of cellular macromolecule biosynthetic process","3/35","156/5696",0.06969429461281,0.359680933516347,0.347589336907888,"Pp3c27_1350V3/Pp3c5_27150V3/Pp3c4_15350V3",3
"GO:0009086","GO:0009086","methionine biosynthetic process","1/35","12/5696",0.0713609617862436,0.359680933516347,0.347589336907888,"Pp3c23_18410V3",1
"GO:0030048","GO:0030048","actin filament-based movement","1/35","12/5696",0.0713609617862436,0.359680933516347,0.347589336907888,"Pp3c9_4230V3",1
"GO:0032103","GO:0032103","positive regulation of response to external stimulus","1/35","12/5696",0.0713609617862436,0.359680933516347,0.347589336907888,"Pp3c17_13870V3",1
"GO:0070417","GO:0070417","cellular response to cold","1/35","12/5696",0.0713609617862436,0.359680933516347,0.347589336907888,"Pp3c17_13870V3",1
"GO:0071731","GO:0071731","response to nitric oxide","1/35","12/5696",0.0713609617862436,0.359680933516347,0.347589336907888,"Pp3c14_18760V3",1
"GO:0097366","GO:0097366","response to bronchodilator","1/35","12/5696",0.0713609617862436,0.359680933516347,0.347589336907888,"Pp3c14_18760V3",1
"GO:0043207","GO:0043207","response to external biotic stimulus","5/35","369/5696",0.0726950687822098,0.359680933516347,0.347589336907888,"Pp3c27_1350V3/Pp3c16_11020V3/Pp3c14_18760V3/Pp3c3_1500V3/Pp3c4_19160V3",5
"GO:0051707","GO:0051707","response to other organism","5/35","369/5696",0.0726950687822098,0.359680933516347,0.347589336907888,"Pp3c27_1350V3/Pp3c16_11020V3/Pp3c14_18760V3/Pp3c3_1500V3/Pp3c4_19160V3",5
"GO:0009607","GO:0009607","response to biotic stimulus","5/35","370/5696",0.0733686493888175,0.359680933516347,0.347589336907888,"Pp3c27_1350V3/Pp3c16_11020V3/Pp3c14_18760V3/Pp3c3_1500V3/Pp3c4_19160V3",5
"GO:0080134","GO:0080134","regulation of response to stress","3/35","161/5696",0.0751000765583586,0.359680933516347,0.347589336907888,"Pp3c27_1350V3/Pp3c17_13870V3/Pp3c4_15350V3",3
"GO:0051173","GO:0051173","positive regulation of nitrogen compound metabolic process","4/35","264/5696",0.0766536580482346,0.359680933516347,0.347589336907888,"Pp3c5_27150V3/Pp3c1_38880V3/Pp3c17_15260V3/Pp3c2_11380V3",4
"GO:0008360","GO:0008360","regulation of cell shape","1/35","13/5696",0.0770791824648998,0.359680933516347,0.347589336907888,"Pp3c9_4230V3",1
"GO:0030837","GO:0030837","negative regulation of actin filament polymerization","1/35","13/5696",0.0770791824648998,0.359680933516347,0.347589336907888,"Pp3c9_4230V3",1
"GO:0032272","GO:0032272","negative regulation of protein polymerization","1/35","13/5696",0.0770791824648998,0.359680933516347,0.347589336907888,"Pp3c9_4230V3",1
"GO:0046460","GO:0046460","neutral lipid biosynthetic process","1/35","13/5696",0.0770791824648998,0.359680933516347,0.347589336907888,"Pp3c20_8330V3",1
"GO:0046463","GO:0046463","acylglycerol biosynthetic process","1/35","13/5696",0.0770791824648998,0.359680933516347,0.347589336907888,"Pp3c20_8330V3",1
"GO:0048354","GO:0048354","mucilage biosynthetic process involved in seed coat development","1/35","13/5696",0.0770791824648998,0.359680933516347,0.347589336907888,"Pp3c11_10350V3",1
"GO:0055074","GO:0055074","calcium ion homeostasis","1/35","13/5696",0.0770791824648998,0.359680933516347,0.347589336907888,"Pp3c4_15350V3",1
"GO:0071236","GO:0071236","cellular response to antibiotic","1/35","13/5696",0.0770791824648998,0.359680933516347,0.347589336907888,"Pp3c14_18760V3",1
"GO:0071491","GO:0071491","cellular response to red light","1/35","13/5696",0.0770791824648998,0.359680933516347,0.347589336907888,"Pp3c4_15350V3",1
"GO:0010558","GO:0010558","negative regulation of macromolecule biosynthetic process","3/35","164/5696",0.0784322852032528,0.359680933516347,0.347589336907888,"Pp3c27_1350V3/Pp3c5_27150V3/Pp3c4_15350V3",3
"GO:0048583","GO:0048583","regulation of response to stimulus","5/35","378/5696",0.0788840193460866,0.359680933516347,0.347589336907888,"Pp3c27_1350V3/Pp3c17_13870V3/Pp3c14_18760V3/Pp3c17_15260V3/Pp3c4_15350V3",5
"GO:0006928","GO:0006928","movement of cell or subcellular component","2/35","77/5696",0.0806100604685661,0.359680933516347,0.347589336907888,"Pp3c17_15260V3/Pp3c9_4230V3",2
"GO:0009755","GO:0009755","hormone-mediated signaling pathway","3/35","166/5696",0.080690100331549,0.359680933516347,0.347589336907888,"Pp3c27_1350V3/Pp3c14_18760V3/Pp3c4_15350V3",3
"GO:0035556","GO:0035556","intracellular signal transduction","3/35","167/5696",0.0818297941928564,0.359680933516347,0.347589336907888,"Pp3c27_1350V3/Pp3c1_21050V3/Pp3c14_3550V3",3
"GO:0009888","GO:0009888","tissue development","4/35","271/5696",0.0826495604581196,0.359680933516347,0.347589336907888,"Pp3c1_38880V3/Pp3c11_10350V3/Pp3c14_5930V3/Pp3c4_15350V3",4
"GO:0000045","GO:0000045","autophagosome assembly","1/35","14/5696",0.0827631924268438,0.359680933516347,0.347589336907888,"Pp3c14_5930V3",1
"GO:0000097","GO:0000097","sulfur amino acid biosynthetic process","1/35","14/5696",0.0827631924268438,0.359680933516347,0.347589336907888,"Pp3c23_18410V3",1
"GO:0006022","GO:0006022","aminoglycan metabolic process","1/35","14/5696",0.0827631924268438,0.359680933516347,0.347589336907888,"Pp3c4_19160V3",1
"GO:0006833","GO:0006833","water transport","1/35","14/5696",0.0827631924268438,0.359680933516347,0.347589336907888,"Pp3c4_15350V3",1
"GO:0009625","GO:0009625","response to insect","1/35","14/5696",0.0827631924268438,0.359680933516347,0.347589336907888,"Pp3c16_11020V3",1
"GO:0009937","GO:0009937","regulation of gibberellic acid mediated signaling pathway","1/35","14/5696",0.0827631924268438,0.359680933516347,0.347589336907888,"Pp3c17_15260V3",1
"GO:0010215","GO:0010215","cellulose microfibril organization","1/35","14/5696",0.0827631924268438,0.359680933516347,0.347589336907888,"Pp3c17_15260V3",1
"GO:0042044","GO:0042044","fluid transport","1/35","14/5696",0.0827631924268438,0.359680933516347,0.347589336907888,"Pp3c4_15350V3",1
"GO:0060429","GO:0060429","epithelium development","1/35","14/5696",0.0827631924268438,0.359680933516347,0.347589336907888,"Pp3c14_5930V3",1
"GO:0072503","GO:0072503","cellular divalent inorganic cation homeostasis","1/35","14/5696",0.0827631924268438,0.359680933516347,0.347589336907888,"Pp3c4_15350V3",1
"GO:1902170","GO:1902170","cellular response to reactive nitrogen species","1/35","14/5696",0.0827631924268438,0.359680933516347,0.347589336907888,"Pp3c14_18760V3",1
"GO:1905037","GO:1905037","autophagosome organization","1/35","14/5696",0.0827631924268438,0.359680933516347,0.347589336907888,"Pp3c14_5930V3",1
"GO:0031327","GO:0031327","negative regulation of cellular biosynthetic process","3/35","171/5696",0.0864595540872041,0.359680933516347,0.347589336907888,"Pp3c27_1350V3/Pp3c5_27150V3/Pp3c4_15350V3",3
"GO:0010604","GO:0010604","positive regulation of macromolecule metabolic process","4/35","277/5696",0.0879729537609388,0.359680933516347,0.347589336907888,"Pp3c5_27150V3/Pp3c1_38880V3/Pp3c17_15260V3/Pp3c2_11380V3",4
"GO:0008356","GO:0008356","asymmetric cell division","1/35","15/5696",0.0884131903615601,0.359680933516347,0.347589336907888,"Pp3c22_5840V3",1
"GO:0009682","GO:0009682","induced systemic resistance","1/35","15/5696",0.0884131903615601,0.359680933516347,0.347589336907888,"Pp3c27_1350V3",1
"GO:0030198","GO:0030198","extracellular matrix organization","1/35","15/5696",0.0884131903615601,0.359680933516347,0.347589336907888,"Pp3c17_15260V3",1
"GO:0030587","GO:0030587","sorocarp development","1/35","15/5696",0.0884131903615601,0.359680933516347,0.347589336907888,"Pp3c9_4230V3",1
"GO:0030705","GO:0030705","cytoskeleton-dependent intracellular transport","1/35","15/5696",0.0884131903615601,0.359680933516347,0.347589336907888,"Pp3c17_15260V3",1
"GO:0031333","GO:0031333","negative regulation of protein-containing complex assembly","1/35","15/5696",0.0884131903615601,0.359680933516347,0.347589336907888,"Pp3c9_4230V3",1
"GO:0043062","GO:0043062","extracellular structure organization","1/35","15/5696",0.0884131903615601,0.359680933516347,0.347589336907888,"Pp3c17_15260V3",1
"GO:0046351","GO:0046351","disaccharide biosynthetic process","1/35","15/5696",0.0884131903615601,0.359680933516347,0.347589336907888,"Pp3c20_980V3",1
"GO:0051494","GO:0051494","negative regulation of cytoskeleton organization","1/35","15/5696",0.0884131903615601,0.359680933516347,0.347589336907888,"Pp3c9_4230V3",1
"GO:0090307","GO:0090307","mitotic spindle assembly","1/35","15/5696",0.0884131903615601,0.359680933516347,0.347589336907888,"Pp3c17_15260V3",1
"GO:0099120","GO:0099120","socially cooperative development","1/35","15/5696",0.0884131903615601,0.359680933516347,0.347589336907888,"Pp3c9_4230V3",1
"GO:1902904","GO:1902904","negative regulation of supramolecular fiber organization","1/35","15/5696",0.0884131903615601,0.359680933516347,0.347589336907888,"Pp3c9_4230V3",1
"GO:0009890","GO:0009890","negative regulation of biosynthetic process","3/35","174/5696",0.0900052784198431,0.360203316124543,0.348094158285601,"Pp3c27_1350V3/Pp3c5_27150V3/Pp3c4_15350V3",3
"GO:0023052","GO:0023052","signaling","5/35","398/5696",0.0936492042275214,0.360203316124543,0.348094158285601,"Pp3c27_1350V3/Pp3c1_21050V3/Pp3c14_18760V3/Pp3c4_15350V3/Pp3c14_3550V3",5
"GO:0009788","GO:0009788","negative regulation of abscisic acid-activated signaling pathway","1/35","16/5696",0.0940293738393537,0.360203316124543,0.348094158285601,"Pp3c14_18760V3",1
"GO:0010192","GO:0010192","mucilage biosynthetic process","1/35","16/5696",0.0940293738393537,0.360203316124543,0.348094158285601,"Pp3c11_10350V3",1
"GO:0048359","GO:0048359","mucilage metabolic process involved in seed coat development","1/35","16/5696",0.0940293738393537,0.360203316124543,0.348094158285601,"Pp3c11_10350V3",1
"GO:1901420","GO:1901420","negative regulation of response to alcohol","1/35","16/5696",0.0940293738393537,0.360203316124543,0.348094158285601,"Pp3c14_18760V3",1
"GO:1905958","GO:1905958","negative regulation of cellular response to alcohol","1/35","16/5696",0.0940293738393537,0.360203316124543,0.348094158285601,"Pp3c14_18760V3",1
"GO:0002218","GO:0002218","activation of innate immune response","1/35","17/5696",0.0996119393174565,0.360203316124543,0.348094158285601,"Pp3c27_1350V3",1
"GO:0002253","GO:0002253","activation of immune response","1/35","17/5696",0.0996119393174565,0.360203316124543,0.348094158285601,"Pp3c27_1350V3",1
"GO:0006641","GO:0006641","triglyceride metabolic process","1/35","17/5696",0.0996119393174565,0.360203316124543,0.348094158285601,"Pp3c20_8330V3",1
"GO:0010374","GO:0010374","stomatal complex development","1/35","17/5696",0.0996119393174565,0.360203316124543,0.348094158285601,"Pp3c4_15350V3",1
"GO:0010506","GO:0010506","regulation of autophagy","1/35","17/5696",0.0996119393174565,0.360203316124543,0.348094158285601,"Pp3c14_5930V3",1
"GO:0035295","GO:0035295","tube development","1/35","17/5696",0.0996119393174565,0.360203316124543,0.348094158285601,"Pp3c14_5930V3",1
"GO:0048870","GO:0048870","cell motility","1/35","17/5696",0.0996119393174565,0.360203316124543,0.348094158285601,"Pp3c9_4230V3",1
"GO:0051674","GO:0051674","localization of cell","1/35","17/5696",0.0996119393174565,0.360203316124543,0.348094158285601,"Pp3c9_4230V3",1
"GO:1903008","GO:1903008","organelle disassembly","1/35","17/5696",0.0996119393174565,0.360203316124543,0.348094158285601,"Pp3c14_5930V3",1
"GO:0009966","GO:0009966","regulation of signal transduction","3/35","184/5696",0.102263481487671,0.360203316124543,0.348094158285601,"Pp3c27_1350V3/Pp3c14_18760V3/Pp3c17_15260V3",3
"GO:0032774","GO:0032774","RNA biosynthetic process","2/35","89/5696",0.103133360884896,0.360203316124543,0.348094158285601,"Pp3c1_38880V3/Pp3c14_14540V3",2
"GO:0009267","GO:0009267","cellular response to starvation","2/35","90/5696",0.105083270449168,0.360203316124543,0.348094158285601,"Pp3c17_13870V3/Pp3c9_4230V3",2
"GO:0002237","GO:0002237","response to molecule of bacterial origin","1/35","18/5696",0.105161082146104,0.360203316124543,0.348094158285601,"Pp3c14_18760V3",1
"GO:0019252","GO:0019252","starch biosynthetic process","1/35","18/5696",0.105161082146104,0.360203316124543,0.348094158285601,"Pp3c20_980V3",1
"GO:0035821","GO:0035821","modulation of process of another organism","1/35","18/5696",0.105161082146104,0.360203316124543,0.348094158285601,"Pp3c4_19160V3",1
"GO:0051703","GO:0051703","biological process involved in intraspecies interaction between organisms","1/35","18/5696",0.105161082146104,0.360203316124543,0.348094158285601,"Pp3c9_4230V3",1
"GO:0023051","GO:0023051","regulation of signaling","3/35","189/5696",0.108636301851442,0.360203316124543,0.348094158285601,"Pp3c27_1350V3/Pp3c14_18760V3/Pp3c17_15260V3",3
"GO:0000070","GO:0000070","mitotic sister chromatid segregation","1/35","19/5696",0.11067699657458,0.360203316124543,0.348094158285601,"Pp3c17_15260V3",1
"GO:0006890","GO:0006890","retrograde vesicle-mediated transport, Golgi to endoplasmic reticulum","1/35","19/5696",0.11067699657458,0.360203316124543,0.348094158285601,"Pp3c17_15260V3",1
"GO:0009067","GO:0009067","aspartate family amino acid biosynthetic process","1/35","19/5696",0.11067699657458,0.360203316124543,0.348094158285601,"Pp3c23_18410V3",1
"GO:0009312","GO:0009312","oligosaccharide biosynthetic process","1/35","19/5696",0.11067699657458,0.360203316124543,0.348094158285601,"Pp3c20_980V3",1
"GO:0009612","GO:0009612","response to mechanical stimulus","1/35","19/5696",0.11067699657458,0.360203316124543,0.348094158285601,"Pp3c9_4230V3",1
"GO:0016101","GO:0016101","diterpenoid metabolic process","1/35","19/5696",0.11067699657458,0.360203316124543,0.348094158285601,"Pp3c20_8330V3",1
"GO:0017148","GO:0017148","negative regulation of translation","1/35","19/5696",0.11067699657458,0.360203316124543,0.348094158285601,"Pp3c5_27150V3",1
"GO:0034249","GO:0034249","negative regulation of cellular amide metabolic process","1/35","19/5696",0.11067699657458,0.360203316124543,0.348094158285601,"Pp3c5_27150V3",1
"GO:0043087","GO:0043087","regulation of GTPase activity","1/35","19/5696",0.11067699657458,0.360203316124543,0.348094158285601,"Pp3c19_14290V3",1
"GO:0006638","GO:0006638","neutral lipid metabolic process","1/35","20/5696",0.116159875757227,0.369099723559947,0.356691490179464,"Pp3c20_8330V3",1
"GO:0006639","GO:0006639","acylglycerol metabolic process","1/35","20/5696",0.116159875757227,0.369099723559947,0.356691490179464,"Pp3c20_8330V3",1
"GO:0010191","GO:0010191","mucilage metabolic process","1/35","20/5696",0.116159875757227,0.369099723559947,0.356691490179464,"Pp3c11_10350V3",1
"GO:0120031","GO:0120031","plasma membrane bounded cell projection assembly","1/35","20/5696",0.116159875757227,0.369099723559947,0.356691490179464,"Pp3c9_4230V3",1
"GO:0000904","GO:0000904","cell morphogenesis involved in differentiation","2/35","98/5696",0.121037605759565,0.369584374397135,0.357159848236376,"Pp3c1_38880V3/Pp3c11_10350V3",2
"GO:0070925","GO:0070925","organelle assembly","2/35","98/5696",0.121037605759565,0.369584374397135,0.357159848236376,"Pp3c14_5930V3/Pp3c17_15260V3",2
"GO:0005985","GO:0005985","sucrose metabolic process","1/35","21/5696",0.121609911759429,0.369584374397135,0.357159848236376,"Pp3c20_980V3",1
"GO:0010214","GO:0010214","seed coat development","1/35","21/5696",0.121609911759429,0.369584374397135,0.357159848236376,"Pp3c11_10350V3",1
"GO:0016236","GO:0016236","macroautophagy","1/35","21/5696",0.121609911759429,0.369584374397135,0.357159848236376,"Pp3c14_5930V3",1
"GO:0030833","GO:0030833","regulation of actin filament polymerization","1/35","21/5696",0.121609911759429,0.369584374397135,0.357159848236376,"Pp3c9_4230V3",1
"GO:0043547","GO:0043547","positive regulation of GTPase activity","1/35","21/5696",0.121609911759429,0.369584374397135,0.357159848236376,"Pp3c19_14290V3",1
"GO:0007165","GO:0007165","signal transduction","5/35","433/5696",0.122743834684198,0.369584374397135,0.357159848236376,"Pp3c27_1350V3/Pp3c1_21050V3/Pp3c14_18760V3/Pp3c4_15350V3/Pp3c14_3550V3",5
"GO:0000302","GO:0000302","response to reactive oxygen species","2/35","99/5696",0.123073510971755,0.369584374397135,0.357159848236376,"Pp3c14_18760V3/Pp3c9_4230V3",2
"GO:0022402","GO:0022402","cell cycle process","3/35","200/5696",0.123194791465712,0.369584374397135,0.357159848236376,"Pp3c17_15260V3/Pp3c22_5840V3/Pp3c9_4230V3",3
"GO:0042594","GO:0042594","response to starvation","2/35","100/5696",0.125118064510754,0.37227937470792,0.359764249203184,"Pp3c17_13870V3/Pp3c9_4230V3",2
"GO:0030031","GO:0030031","cell projection assembly","1/35","22/5696",0.127027295563556,0.37227937470792,0.359764249203184,"Pp3c9_4230V3",1
"GO:0007049","GO:0007049","cell cycle","3/35","206/5696",0.131430814295388,0.37227937470792,0.359764249203184,"Pp3c17_15260V3/Pp3c22_5840V3/Pp3c9_4230V3",3
"GO:0008064","GO:0008064","regulation of actin polymerization or depolymerization","1/35","23/5696",0.132412217074884,0.37227937470792,0.359764249203184,"Pp3c9_4230V3",1
"GO:0009630","GO:0009630","gravitropism","1/35","23/5696",0.132412217074884,0.37227937470792,0.359764249203184,"Pp3c4_15350V3",1
"GO:0010017","GO:0010017","red or far-red light signaling pathway","1/35","23/5696",0.132412217074884,0.37227937470792,0.359764249203184,"Pp3c4_15350V3",1
"GO:0030832","GO:0030832","regulation of actin filament length","1/35","23/5696",0.132412217074884,0.37227937470792,0.359764249203184,"Pp3c9_4230V3",1
"GO:0032271","GO:0032271","regulation of protein polymerization","1/35","23/5696",0.132412217074884,0.37227937470792,0.359764249203184,"Pp3c9_4230V3",1
"GO:0034614","GO:0034614","cellular response to reactive oxygen species","1/35","23/5696",0.132412217074884,0.37227937470792,0.359764249203184,"Pp3c14_18760V3",1
"GO:0043066","GO:0043066","negative regulation of apoptotic process","1/35","23/5696",0.132412217074884,0.37227937470792,0.359764249203184,"Pp3c14_5930V3",1
"GO:0060627","GO:0060627","regulation of vesicle-mediated transport","1/35","23/5696",0.132412217074884,0.37227937470792,0.359764249203184,"Pp3c19_14290V3",1
"GO:1901136","GO:1901136","carbohydrate derivative catabolic process","1/35","23/5696",0.132412217074884,0.37227937470792,0.359764249203184,"Pp3c4_19160V3",1
"GO:0031669","GO:0031669","cellular response to nutrient levels","2/35","104/5696",0.133379288865377,0.373045198545352,0.360504327909161,"Pp3c17_13870V3/Pp3c9_4230V3",2
"GO:0031347","GO:0031347","regulation of defense response","2/35","106/5696",0.137557323351115,0.377447615170698,0.36475874601422,"Pp3c27_1350V3/Pp3c4_15350V3",2
"GO:0007052","GO:0007052","mitotic spindle organization","1/35","24/5696",0.13776486512748,0.377447615170698,0.36475874601422,"Pp3c17_15260V3",1
"GO:0110053","GO:0110053","regulation of actin filament organization","1/35","24/5696",0.13776486512748,0.377447615170698,0.36475874601422,"Pp3c9_4230V3",1
"GO:1902850","GO:1902850","microtubule cytoskeleton organization involved in mitosis","1/35","24/5696",0.13776486512748,0.377447615170698,0.36475874601422,"Pp3c17_15260V3",1
"GO:0043085","GO:0043085","positive regulation of catalytic activity","2/35","108/5696",0.141765196413344,0.378506771242171,0.365782295839244,"Pp3c14_5930V3/Pp3c19_14290V3",2
"GO:0000819","GO:0000819","sister chromatid segregation","1/35","25/5696",0.143085427490057,0.378506771242171,0.365782295839244,"Pp3c17_15260V3",1
"GO:0006555","GO:0006555","methionine metabolic process","1/35","25/5696",0.143085427490057,0.378506771242171,0.365782295839244,"Pp3c23_18410V3",1
"GO:0032956","GO:0032956","regulation of actin cytoskeleton organization","1/35","25/5696",0.143085427490057,0.378506771242171,0.365782295839244,"Pp3c9_4230V3",1
"GO:0032970","GO:0032970","regulation of actin filament-based process","1/35","25/5696",0.143085427490057,0.378506771242171,0.365782295839244,"Pp3c9_4230V3",1
"GO:0071489","GO:0071489","cellular response to red or far red light","1/35","25/5696",0.143085427490057,0.378506771242171,0.365782295839244,"Pp3c4_15350V3",1
"GO:0072507","GO:0072507","divalent inorganic cation homeostasis","1/35","25/5696",0.143085427490057,0.378506771242171,0.365782295839244,"Pp3c4_15350V3",1
"GO:0006351","GO:0006351","transcription, DNA-templated","2/35","111/5696",0.148130117688749,0.383720320829832,0.37082057859278,"Pp3c1_38880V3/Pp3c14_14540V3",2
"GO:0008285","GO:0008285","negative regulation of cell population proliferation","1/35","26/5696",0.148374090871797,0.383720320829832,0.37082057859278,"Pp3c14_5930V3",1
"GO:0006979","GO:0006979","response to oxidative stress","3/35","220/5696",0.151391335276487,0.383720320829832,0.37082057859278,"Pp3c16_11020V3/Pp3c14_18760V3/Pp3c9_4230V3",3
"GO:1901701","GO:1901701","cellular response to oxygen-containing compound","3/35","220/5696",0.151391335276487,0.383720320829832,0.37082057859278,"Pp3c27_1350V3/Pp3c14_18760V3/Pp3c4_15350V3",3
"GO:0051172","GO:0051172","negative regulation of nitrogen compound metabolic process","3/35","221/5696",0.152854449763137,0.383720320829832,0.37082057859278,"Pp3c27_1350V3/Pp3c5_27150V3/Pp3c4_15350V3",3
"GO:0007015","GO:0007015","actin filament organization","1/35","27/5696",0.153631040928145,0.383720320829832,0.37082057859278,"Pp3c9_4230V3",1
"GO:0009561","GO:0009561","megagametogenesis","1/35","27/5696",0.153631040928145,0.383720320829832,0.37082057859278,"Pp3c10_14800V3",1
"GO:0009629","GO:0009629","response to gravity","1/35","27/5696",0.153631040928145,0.383720320829832,0.37082057859278,"Pp3c4_15350V3",1
"GO:0009873","GO:0009873","ethylene-activated signaling pathway","1/35","27/5696",0.153631040928145,0.383720320829832,0.37082057859278,"Pp3c27_1350V3",1
"GO:0022411","GO:0022411","cellular component disassembly","1/35","27/5696",0.153631040928145,0.383720320829832,0.37082057859278,"Pp3c14_5930V3",1
"GO:0120036","GO:0120036","plasma membrane bounded cell projection organization","1/35","27/5696",0.153631040928145,0.383720320829832,0.37082057859278,"Pp3c9_4230V3",1
"GO:1902903","GO:1902903","regulation of supramolecular fiber organization","1/35","27/5696",0.153631040928145,0.383720320829832,0.37082057859278,"Pp3c9_4230V3",1
"GO:0031668","GO:0031668","cellular response to extracellular stimulus","2/35","115/5696",0.156709199818456,0.38599963908211,0.373023271719063,"Pp3c17_13870V3/Pp3c9_4230V3",2
"GO:0010629","GO:0010629","negative regulation of gene expression","3/35","225/5696",0.15875376063087,0.38599963908211,0.373023271719063,"Pp3c27_1350V3/Pp3c5_27150V3/Pp3c4_15350V3",3
"GO:0006935","GO:0006935","chemotaxis","1/35","28/5696",0.158856462266567,0.38599963908211,0.373023271719063,"Pp3c9_4230V3",1
"GO:0030865","GO:0030865","cortical cytoskeleton organization","1/35","28/5696",0.158856462266567,0.38599963908211,0.373023271719063,"Pp3c9_4230V3",1
"GO:0042330","GO:0042330","taxis","1/35","28/5696",0.158856462266567,0.38599963908211,0.373023271719063,"Pp3c9_4230V3",1
"GO:0042752","GO:0042752","regulation of circadian rhythm","1/35","28/5696",0.158856462266567,0.38599963908211,0.373023271719063,"Pp3c4_15350V3",1
"GO:0005975","GO:0005975","carbohydrate metabolic process","4/35","349/5696",0.163933029558594,0.388084313431184,0.375037864395911,"Pp3c1_25940V3/Pp3c7_27000V3/Pp3c20_980V3/Pp3c4_19160V3",4
"GO:0010029","GO:0010029","regulation of seed germination","1/35","29/5696",0.164050538452288,0.388084313431184,0.375037864395911,"Pp3c4_15350V3",1
"GO:0030030","GO:0030030","cell projection organization","1/35","29/5696",0.164050538452288,0.388084313431184,0.375037864395911,"Pp3c9_4230V3",1
"GO:0045089","GO:0045089","positive regulation of innate immune response","1/35","29/5696",0.164050538452288,0.388084313431184,0.375037864395911,"Pp3c27_1350V3",1
"GO:0046688","GO:0046688","response to copper ion","1/35","29/5696",0.164050538452288,0.388084313431184,0.375037864395911,"Pp3c16_11020V3",1
"GO:0061919","GO:0061919","process utilizing autophagic mechanism","1/35","29/5696",0.164050538452288,0.388084313431184,0.375037864395911,"Pp3c14_5930V3",1
"GO:0031331","GO:0031331","positive regulation of cellular catabolic process","1/35","30/5696",0.169213452013991,0.38966010890289,0.376560685463343,"Pp3c14_5930V3",1
"GO:0051225","GO:0051225","spindle assembly","1/35","30/5696",0.169213452013991,0.38966010890289,0.376560685463343,"Pp3c17_15260V3",1
"GO:0032870","GO:0032870","cellular response to hormone stimulus","3/35","232/5696",0.16925072657091,0.38966010890289,0.376560685463343,"Pp3c27_1350V3/Pp3c14_18760V3/Pp3c4_15350V3",3
"GO:0044093","GO:0044093","positive regulation of molecular function","2/35","121/5696",0.169756343051119,0.38966010890289,0.376560685463343,"Pp3c14_5930V3/Pp3c19_14290V3",2
"GO:0071496","GO:0071496","cellular response to external stimulus","2/35","121/5696",0.169756343051119,0.38966010890289,0.376560685463343,"Pp3c17_13870V3/Pp3c9_4230V3",2
"GO:0009658","GO:0009658","chloroplast organization","2/35","123/5696",0.17414831884061,0.38966010890289,0.376560685463343,"Pp3c1_21050V3/Pp3c14_3550V3",2
"GO:0000096","GO:0000096","sulfur amino acid metabolic process","1/35","31/5696",0.174345384449486,0.38966010890289,0.376560685463343,"Pp3c23_18410V3",1
"GO:0009699","GO:0009699","phenylpropanoid biosynthetic process","1/35","31/5696",0.174345384449486,0.38966010890289,0.376560685463343,"Pp3c11_10350V3",1
"GO:0009896","GO:0009896","positive regulation of catabolic process","1/35","31/5696",0.174345384449486,0.38966010890289,0.376560685463343,"Pp3c14_5930V3",1
"GO:1900140","GO:1900140","regulation of seedling development","1/35","31/5696",0.174345384449486,0.38966010890289,0.376560685463343,"Pp3c4_15350V3",1
"GO:0033043","GO:0033043","regulation of organelle organization","2/35","124/5696",0.176351719534924,0.38966010890289,0.376560685463343,"Pp3c9_4230V3/Pp3c19_14290V3",2
"GO:0019216","GO:0019216","regulation of lipid metabolic process","1/35","32/5696",0.179446516231351,0.38966010890289,0.376560685463343,"Pp3c14_5930V3",1
"GO:0050778","GO:0050778","positive regulation of immune response","1/35","32/5696",0.179446516231351,0.38966010890289,0.376560685463343,"Pp3c27_1350V3",1
"GO:0071368","GO:0071368","cellular response to cytokinin stimulus","1/35","32/5696",0.179446516231351,0.38966010890289,0.376560685463343,"Pp3c14_18760V3",1
"GO:0044255","GO:0044255","cellular lipid metabolic process","3/35","239/5696",0.17995435341458,0.38966010890289,0.376560685463343,"Pp3c11_10350V3/Pp3c20_8330V3/Pp3c4_15350V3",3
"GO:0046677","GO:0046677","response to antibiotic","2/35","127/5696",0.182989927925728,0.38966010890289,0.376560685463343,"Pp3c14_18760V3/Pp3c9_4230V3",2
"GO:0007051","GO:0007051","spindle organization","1/35","33/5696",0.184517026812548,0.38966010890289,0.376560685463343,"Pp3c17_15260V3",1
"GO:0009965","GO:0009965","leaf morphogenesis","1/35","33/5696",0.184517026812548,0.38966010890289,0.376560685463343,"Pp3c5_27150V3",1
"GO:0030036","GO:0030036","actin cytoskeleton organization","1/35","33/5696",0.184517026812548,0.38966010890289,0.376560685463343,"Pp3c9_4230V3",1
"GO:0043069","GO:0043069","negative regulation of programmed cell death","1/35","33/5696",0.184517026812548,0.38966010890289,0.376560685463343,"Pp3c14_5930V3",1
"GO:0071369","GO:0071369","cellular response to ethylene stimulus","1/35","33/5696",0.184517026812548,0.38966010890289,0.376560685463343,"Pp3c27_1350V3",1
"GO:0031324","GO:0031324","negative regulation of cellular metabolic process","3/35","243/5696",0.186157355064703,0.38966010890289,0.376560685463343,"Pp3c27_1350V3/Pp3c5_27150V3/Pp3c4_15350V3",3
"GO:0006357","GO:0006357","regulation of transcription by RNA polymerase II","2/35","129/5696",0.187437396097576,0.38966010890289,0.376560685463343,"Pp3c1_38880V3/Pp3c11_10350V3",2
"GO:1902679","GO:1902679","negative regulation of RNA biosynthetic process","2/35","129/5696",0.187437396097576,0.38966010890289,0.376560685463343,"Pp3c27_1350V3/Pp3c4_15350V3",2
"GO:1903507","GO:1903507","negative regulation of nucleic acid-templated transcription","2/35","129/5696",0.187437396097576,0.38966010890289,0.376560685463343,"Pp3c27_1350V3/Pp3c4_15350V3",2
"GO:0005984","GO:0005984","disaccharide metabolic process","1/35","34/5696",0.189557094632001,0.38966010890289,0.376560685463343,"Pp3c20_980V3",1
"GO:0006417","GO:0006417","regulation of translation","1/35","34/5696",0.189557094632001,0.38966010890289,0.376560685463343,"Pp3c5_27150V3",1
"GO:0009736","GO:0009736","cytokinin-activated signaling pathway","1/35","34/5696",0.189557094632001,0.38966010890289,0.376560685463343,"Pp3c14_18760V3",1
"GO:0016050","GO:0016050","vesicle organization","1/35","34/5696",0.189557094632001,0.38966010890289,0.376560685463343,"Pp3c9_4230V3",1
"GO:0033674","GO:0033674","positive regulation of kinase activity","1/35","34/5696",0.189557094632001,0.38966010890289,0.376560685463343,"Pp3c14_5930V3",1
"GO:0048284","GO:0048284","organelle fusion","1/35","34/5696",0.189557094632001,0.38966010890289,0.376560685463343,"Pp3c10_14800V3",1
"GO:0051345","GO:0051345","positive regulation of hydrolase activity","1/35","34/5696",0.189557094632001,0.38966010890289,0.376560685463343,"Pp3c19_14290V3",1
"GO:0045892","GO:0045892","negative regulation of transcription, DNA-templated","2/35","130/5696",0.189667333413817,0.38966010890289,0.376560685463343,"Pp3c27_1350V3/Pp3c4_15350V3",2
"GO:0031667","GO:0031667","response to nutrient levels","2/35","132/5696",0.194138968898398,0.38966010890289,0.376560685463343,"Pp3c17_13870V3/Pp3c9_4230V3",2
"GO:0006914","GO:0006914","autophagy","1/35","35/5696",0.194566897120147,0.38966010890289,0.376560685463343,"Pp3c14_5930V3",1
"GO:0009645","GO:0009645","response to low light intensity stimulus","1/35","35/5696",0.194566897120147,0.38966010890289,0.376560685463343,"Pp3c4_15350V3",1
"GO:0016036","GO:0016036","cellular response to phosphate starvation","1/35","35/5696",0.194566897120147,0.38966010890289,0.376560685463343,"Pp3c17_13870V3",1
"GO:0034248","GO:0034248","regulation of cellular amide metabolic process","1/35","35/5696",0.194566897120147,0.38966010890289,0.376560685463343,"Pp3c5_27150V3",1
"GO:0051493","GO:0051493","regulation of cytoskeleton organization","1/35","35/5696",0.194566897120147,0.38966010890289,0.376560685463343,"Pp3c9_4230V3",1
"GO:0090333","GO:0090333","regulation of stomatal closure","1/35","35/5696",0.194566897120147,0.38966010890289,0.376560685463343,"Pp3c14_18760V3",1
"GO:0071495","GO:0071495","cellular response to endogenous stimulus","3/35","250/5696",0.197153560643744,0.38966010890289,0.376560685463343,"Pp3c27_1350V3/Pp3c14_18760V3/Pp3c4_15350V3",3
"GO:0007010","GO:0007010","cytoskeleton organization","2/35","134/5696",0.198625440353898,0.38966010890289,0.376560685463343,"Pp3c17_15260V3/Pp3c9_4230V3",2
"GO:0002252","GO:0002252","immune effector process","1/35","36/5696",0.199546610704459,0.38966010890289,0.376560685463343,"Pp3c27_1350V3",1
"GO:0002684","GO:0002684","positive regulation of immune system process","1/35","36/5696",0.199546610704459,0.38966010890289,0.376560685463343,"Pp3c27_1350V3",1
"GO:0007399","GO:0007399","nervous system development","1/35","36/5696",0.199546610704459,0.38966010890289,0.376560685463343,"Pp3c14_5930V3",1
"GO:0009066","GO:0009066","aspartate family amino acid metabolic process","1/35","36/5696",0.199546610704459,0.38966010890289,0.376560685463343,"Pp3c23_18410V3",1
"GO:0022604","GO:0022604","regulation of cell morphogenesis","1/35","36/5696",0.199546610704459,0.38966010890289,0.376560685463343,"Pp3c9_4230V3",1
"GO:0060548","GO:0060548","negative regulation of cell death","1/35","36/5696",0.199546610704459,0.38966010890289,0.376560685463343,"Pp3c14_5930V3",1
"GO:0009636","GO:0009636","response to toxic substance","2/35","136/5696",0.203125752085513,0.390799190774467,0.377661474177814,"Pp3c14_18760V3/Pp3c9_4230V3",2
"GO:0010090","GO:0010090","trichome morphogenesis","1/35","37/5696",0.204496410814944,0.390799190774467,0.377661474177814,"Pp3c11_10350V3",1
"GO:0031349","GO:0031349","positive regulation of defense response","1/35","37/5696",0.204496410814944,0.390799190774467,0.377661474177814,"Pp3c27_1350V3",1
"GO:0042981","GO:0042981","regulation of apoptotic process","1/35","37/5696",0.204496410814944,0.390799190774467,0.377661474177814,"Pp3c14_5930V3",1
"GO:0071241","GO:0071241","cellular response to inorganic substance","1/35","37/5696",0.204496410814944,0.390799190774467,0.377661474177814,"Pp3c14_18760V3",1
"GO:0080135","GO:0080135","regulation of cellular response to stress","1/35","37/5696",0.204496410814944,0.390799190774467,0.377661474177814,"Pp3c17_13870V3",1
"GO:0002376","GO:0002376","immune system process","2/35","137/5696",0.205380792607912,0.391097466774641,0.377949722865623,"Pp3c27_1350V3/Pp3c17_15260V3",2
"GO:0010639","GO:0010639","negative regulation of organelle organization","1/35","39/5696",0.214306967379855,0.400985510393666,0.387505354550774,"Pp3c9_4230V3",1
"GO:0030029","GO:0030029","actin filament-based process","1/35","39/5696",0.214306967379855,0.400985510393666,0.387505354550774,"Pp3c9_4230V3",1
"GO:0040011","GO:0040011","locomotion","1/35","39/5696",0.214306967379855,0.400985510393666,0.387505354550774,"Pp3c9_4230V3",1
"GO:0045017","GO:0045017","glycerolipid biosynthetic process","1/35","39/5696",0.214306967379855,0.400985510393666,0.387505354550774,"Pp3c20_8330V3",1
"GO:0140014","GO:0140014","mitotic nuclear division","1/35","39/5696",0.214306967379855,0.400985510393666,0.387505354550774,"Pp3c17_15260V3",1
"GO:0009991","GO:0009991","response to extracellular stimulus","2/35","143/5696",0.21897194497004,0.405838805030891,0.392195493247533,"Pp3c17_13870V3/Pp3c9_4230V3",2
"GO:0051253","GO:0051253","negative regulation of RNA metabolic process","2/35","143/5696",0.21897194497004,0.405838805030891,0.392195493247533,"Pp3c27_1350V3/Pp3c4_15350V3",2
"GO:0009698","GO:0009698","phenylpropanoid metabolic process","1/35","40/5696",0.219168069755974,0.405838805030891,0.392195493247533,"Pp3c11_10350V3",1
"GO:0009640","GO:0009640","photomorphogenesis","1/35","41/5696",0.223999950512435,0.411945114469786,0.39809652344135,"Pp3c4_15350V3",1
"GO:0051347","GO:0051347","positive regulation of transferase activity","1/35","41/5696",0.223999950512435,0.411945114469786,0.39809652344135,"Pp3c14_5930V3",1
"GO:0048585","GO:0048585","negative regulation of response to stimulus","2/35","147/5696",0.228082316899839,0.41509153024679,0.401137164386293,"Pp3c27_1350V3/Pp3c14_18760V3",2
"GO:0009100","GO:0009100","glycoprotein metabolic process","1/35","42/5696",0.228802780173277,0.41509153024679,0.401137164386293,"Pp3c4_19160V3",1
"GO:0042327","GO:0042327","positive regulation of phosphorylation","1/35","42/5696",0.228802780173277,0.41509153024679,0.401137164386293,"Pp3c14_5930V3",1
"GO:0098813","GO:0098813","nuclear chromosome segregation","1/35","42/5696",0.228802780173277,0.41509153024679,0.401137164386293,"Pp3c17_15260V3",1
"GO:0009664","GO:0009664","plant-type cell wall organization","1/35","43/5696",0.233576728297426,0.418102343652392,0.404046761581161,"Pp3c17_15260V3",1
"GO:0010026","GO:0010026","trichome differentiation","1/35","43/5696",0.233576728297426,0.418102343652392,0.404046761581161,"Pp3c11_10350V3",1
"GO:0043254","GO:0043254","regulation of protein-containing complex assembly","1/35","43/5696",0.233576728297426,0.418102343652392,0.404046761581161,"Pp3c9_4230V3",1
"GO:0044419","GO:0044419","biological process involved in interspecies interaction between organisms","1/35","43/5696",0.233576728297426,0.418102343652392,0.404046761581161,"Pp3c4_19160V3",1
"GO:0030154","GO:0030154","cell differentiation","3/35","273/5696",0.234369546271174,0.418127728729636,0.40407129327396,"Pp3c1_38880V3/Pp3c11_10350V3/Pp3c10_14800V3",3
"GO:0005982","GO:0005982","starch metabolic process","1/35","44/5696",0.23832196348398,0.419602932429171,0.405496904219507,"Pp3c20_980V3",1
"GO:0009311","GO:0009311","oligosaccharide metabolic process","1/35","44/5696",0.23832196348398,0.419602932429171,0.405496904219507,"Pp3c20_980V3",1
"GO:0010562","GO:0010562","positive regulation of phosphorus metabolic process","1/35","44/5696",0.23832196348398,0.419602932429171,0.405496904219507,"Pp3c14_5930V3",1
"GO:0045937","GO:0045937","positive regulation of phosphate metabolic process","1/35","44/5696",0.23832196348398,0.419602932429171,0.405496904219507,"Pp3c14_5930V3",1
"GO:0048584","GO:0048584","positive regulation of response to stimulus","2/35","155/5696",0.246390748211216,0.427304222814437,0.412939295986509,"Pp3c27_1350V3/Pp3c17_13870V3",2
"GO:0000902","GO:0000902","cell morphogenesis","2/35","156/5696",0.248685507348857,0.427304222814437,0.412939295986509,"Pp3c1_38880V3/Pp3c11_10350V3",2
"GO:0033554","GO:0033554","cellular response to stress","4/35","416/5696",0.250316848034344,0.427304222814437,0.412939295986509,"Pp3c17_13870V3/Pp3c14_5930V3/Pp3c14_18760V3/Pp3c9_4230V3",4
"GO:0006970","GO:0006970","response to osmotic stress","3/35","283/5696",0.250972228939235,0.427304222814437,0.412939295986509,"Pp3c5_27150V3/Pp3c11_10350V3/Pp3c9_4230V3",3
"GO:0009787","GO:0009787","regulation of abscisic acid-activated signaling pathway","1/35","47/5696",0.252387063122069,0.427304222814437,0.412939295986509,"Pp3c14_18760V3",1
"GO:0032535","GO:0032535","regulation of cellular component size","1/35","47/5696",0.252387063122069,0.427304222814437,0.412939295986509,"Pp3c9_4230V3",1
"GO:0044550","GO:0044550","secondary metabolite biosynthetic process","1/35","47/5696",0.252387063122069,0.427304222814437,0.412939295986509,"Pp3c11_10350V3",1
"GO:0090626","GO:0090626","plant epidermis morphogenesis","1/35","47/5696",0.252387063122069,0.427304222814437,0.412939295986509,"Pp3c11_10350V3",1
"GO:0097237","GO:0097237","cellular response to toxic substance","1/35","47/5696",0.252387063122069,0.427304222814437,0.412939295986509,"Pp3c14_18760V3",1
"GO:1901419","GO:1901419","regulation of response to alcohol","1/35","47/5696",0.252387063122069,0.427304222814437,0.412939295986509,"Pp3c14_18760V3",1
"GO:1905957","GO:1905957","regulation of cellular response to alcohol","1/35","47/5696",0.252387063122069,0.427304222814437,0.412939295986509,"Pp3c14_18760V3",1
"GO:0010605","GO:0010605","negative regulation of macromolecule metabolic process","3/35","284/5696",0.252643875834542,0.427304222814437,0.412939295986509,"Pp3c27_1350V3/Pp3c5_27150V3/Pp3c4_15350V3",3
"GO:0045934","GO:0045934","negative regulation of nucleobase-containing compound metabolic process","2/35","158/5696",0.253278071936956,0.427304222814437,0.412939295986509,"Pp3c27_1350V3/Pp3c4_15350V3",2
"GO:0009657","GO:0009657","plastid organization","2/35","159/5696",0.25557568569029,0.427304222814437,0.412939295986509,"Pp3c1_21050V3/Pp3c14_3550V3",2
"GO:0071229","GO:0071229","cellular response to acid chemical","2/35","159/5696",0.25557568569029,0.427304222814437,0.412939295986509,"Pp3c27_1350V3/Pp3c4_15350V3",2
"GO:0006875","GO:0006875","cellular metal ion homeostasis","1/35","48/5696",0.257019113536431,0.427304222814437,0.412939295986509,"Pp3c4_15350V3",1
"GO:0044272","GO:0044272","sulfur compound biosynthetic process","1/35","48/5696",0.257019113536431,0.427304222814437,0.412939295986509,"Pp3c23_18410V3",1
"GO:0090066","GO:0090066","regulation of anatomical structure size","1/35","48/5696",0.257019113536431,0.427304222814437,0.412939295986509,"Pp3c9_4230V3",1
"GO:0009250","GO:0009250","glucan biosynthetic process","1/35","49/5696",0.261623279794615,0.43228215769141,0.417749884821847,"Pp3c20_980V3",1
"GO:0045088","GO:0045088","regulation of innate immune response","1/35","49/5696",0.261623279794615,0.43228215769141,0.417749884821847,"Pp3c27_1350V3",1
"GO:0043549","GO:0043549","regulation of kinase activity","1/35","50/5696",0.266199724846358,0.43705814781631,0.42236531779563,"Pp3c14_5930V3",1
"GO:0048193","GO:0048193","Golgi vesicle transport","1/35","50/5696",0.266199724846358,0.43705814781631,0.42236531779563,"Pp3c17_15260V3",1
"GO:0032989","GO:0032989","cellular component morphogenesis","2/35","164/5696",0.267073330990577,0.43705814781631,0.42236531779563,"Pp3c1_38880V3/Pp3c11_10350V3",2
"GO:0006629","GO:0006629","lipid metabolic process","3/35","293/5696",0.267769330785039,0.43705814781631,0.42236531779563,"Pp3c11_10350V3/Pp3c20_8330V3/Pp3c4_15350V3",3
"GO:0032101","GO:0032101","regulation of response to external stimulus","1/35","51/5696",0.270748610717838,0.440581830168118,0.425770542532357,"Pp3c17_13870V3",1
"GO:0051129","GO:0051129","negative regulation of cellular component organization","1/35","52/5696",0.275270098516753,0.446586232336847,0.431573091330129,"Pp3c9_4230V3",1
"GO:0071310","GO:0071310","cellular response to organic substance","3/35","298/5696",0.276227969526175,0.446790420589024,0.431770415270781,"Pp3c27_1350V3/Pp3c14_18760V3/Pp3c4_15350V3",3
"GO:0007059","GO:0007059","chromosome segregation","1/35","53/5696",0.279764348437361,0.451151516849438,0.435984902100898,"Pp3c17_15260V3",1
"GO:0050790","GO:0050790","regulation of catalytic activity","2/35","171/5696",0.283180548518621,0.45529327710928,0.439987426472361,"Pp3c14_5930V3/Pp3c19_14290V3",2
"GO:0097435","GO:0097435","supramolecular fiber organization","1/35","54/5696",0.284231519765501,0.455618883922609,0.440302087177979,"Pp3c9_4230V3",1
"GO:0007346","GO:0007346","regulation of mitotic cell cycle","1/35","55/5696",0.288671770883581,0.458157315100348,0.442755182484508,"Pp3c2_25440V3",1
"GO:0043067","GO:0043067","regulation of programmed cell death","1/35","55/5696",0.288671770883581,0.458157315100348,0.442755182484508,"Pp3c14_5930V3",1
"GO:0018130","GO:0018130","heterocycle biosynthetic process","3/35","306/5696",0.289829271770995,0.458157315100348,0.442755182484508,"Pp3c1_38880V3/Pp3c11_10350V3/Pp3c14_14540V3",3
"GO:0008610","GO:0008610","lipid biosynthetic process","2/35","174/5696",0.290080981627781,0.458157315100348,0.442755182484508,"Pp3c11_10350V3/Pp3c20_8330V3",2
"GO:0048468","GO:0048468","cell development","2/35","174/5696",0.290080981627781,0.458157315100348,0.442755182484508,"Pp3c1_38880V3/Pp3c11_10350V3",2
"GO:0071482","GO:0071482","cellular response to light stimulus","1/35","56/5696",0.293085259275546,0.461544821791695,0.446028809454681,"Pp3c4_15350V3",1
"GO:0051336","GO:0051336","regulation of hydrolase activity","1/35","57/5696",0.297472141531815,0.467083450299954,0.451381242767573,"Pp3c19_14290V3",1
"GO:0032787","GO:0032787","monocarboxylic acid metabolic process","2/35","179/5696",0.30157008888113,0.46845113263353,0.452702946953504,"Pp3c11_10350V3/Pp3c4_15350V3",2
"GO:0007018","GO:0007018","microtubule-based movement","1/35","58/5696",0.301832573354192,0.46845113263353,0.452702946953504,"Pp3c17_15260V3",1
"GO:0034599","GO:0034599","cellular response to oxidative stress","1/35","58/5696",0.301832573354192,0.46845113263353,0.452702946953504,"Pp3c14_18760V3",1
"GO:0050776","GO:0050776","regulation of immune response","1/35","58/5696",0.301832573354192,0.46845113263353,0.452702946953504,"Pp3c27_1350V3",1
"GO:0030003","GO:0030003","cellular cation homeostasis","1/35","59/5696",0.306166709560755,0.46974720866893,0.453955452070533,"Pp3c4_15350V3",1
"GO:0044087","GO:0044087","regulation of cellular component biogenesis","1/35","59/5696",0.306166709560755,0.46974720866893,0.453955452070533,"Pp3c9_4230V3",1
"GO:0071478","GO:0071478","cellular response to radiation","1/35","59/5696",0.306166709560755,0.46974720866893,0.453955452070533,"Pp3c4_15350V3",1
"GO:1901699","GO:1901699","cellular response to nitrogen compound","1/35","59/5696",0.306166709560755,0.46974720866893,0.453955452070533,"Pp3c14_18760V3",1
"GO:0048511","GO:0048511","rhythmic process","1/35","60/5696",0.310474704090713,0.474999760959296,0.459031426350942,"Pp3c4_15350V3",1
"GO:0009892","GO:0009892","negative regulation of metabolic process","3/35","319/5696",0.312063272266241,0.475646514196175,0.459656437319836,"Pp3c27_1350V3/Pp3c5_27150V3/Pp3c4_15350V3",3
"GO:0031329","GO:0031329","regulation of cellular catabolic process","1/35","61/5696",0.314756710009242,0.475646514196175,0.459656437319836,"Pp3c14_5930V3",1
"GO:1901607","GO:1901607","alpha-amino acid biosynthetic process","1/35","61/5696",0.314756710009242,0.475646514196175,0.459656437319836,"Pp3c23_18410V3",1
"GO:2000028","GO:2000028","regulation of photoperiodism, flowering","1/35","61/5696",0.314756710009242,0.475646514196175,0.459656437319836,"Pp3c4_15350V3",1
"GO:1905392","GO:1905392","plant organ morphogenesis","2/35","185/5696",0.315326180733405,0.475646514196175,0.459656437319836,"Pp3c5_27150V3/Pp3c1_38880V3",2
"GO:0009553","GO:0009553","embryo sac development","1/35","62/5696",0.31901287951229,0.477186396373537,0.461144552410376,"Pp3c10_14800V3",1
"GO:0045944","GO:0045944","positive regulation of transcription by RNA polymerase II","1/35","62/5696",0.31901287951229,0.477186396373537,0.461144552410376,"Pp3c1_38880V3",1
"GO:0046486","GO:0046486","glycerolipid metabolic process","1/35","62/5696",0.31901287951229,0.477186396373537,0.461144552410376,"Pp3c20_8330V3",1
"GO:0000160","GO:0000160","phosphorelay signal transduction system","1/35","63/5696",0.323243363931365,0.479507421080505,0.463387549921962,"Pp3c27_1350V3",1
"GO:0051338","GO:0051338","regulation of transferase activity","1/35","63/5696",0.323243363931365,0.479507421080505,0.463387549921962,"Pp3c14_5930V3",1
"GO:0071555","GO:0071555","cell wall organization","1/35","63/5696",0.323243363931365,0.479507421080505,0.463387549921962,"Pp3c17_15260V3",1
"GO:0006873","GO:0006873","cellular ion homeostasis","1/35","64/5696",0.327448313738289,0.481752724595784,0.465557371803825,"Pp3c4_15350V3",1
"GO:0007623","GO:0007623","circadian rhythm","1/35","64/5696",0.327448313738289,0.481752724595784,0.465557371803825,"Pp3c4_15350V3",1
"GO:0009832","GO:0009832","plant-type cell wall biogenesis","1/35","64/5696",0.327448313738289,0.481752724595784,0.465557371803825,"Pp3c17_15260V3",1
"GO:0019438","GO:0019438","aromatic compound biosynthetic process","3/35","329/5696",0.329233846598371,0.483056217550069,0.466817044500998,"Pp3c1_38880V3/Pp3c11_10350V3/Pp3c14_14540V3",3
"GO:0010941","GO:0010941","regulation of cell death","1/35","65/5696",0.331627878549929,0.485242972156164,0.468930285745347,"Pp3c14_5930V3",1
"GO:0016070","GO:0016070","RNA metabolic process","4/35","478/5696",0.33780644433981,0.491320361295151,0.474803367869273,"Pp3c1_38880V3/Pp3c10_14800V3/Pp3c20_980V3/Pp3c14_14540V3",4
"GO:0002682","GO:0002682","regulation of immune system process","1/35","67/5696",0.339911447408281,0.491320361295151,0.474803367869273,"Pp3c27_1350V3",1
"GO:0033692","GO:0033692","cellular polysaccharide biosynthetic process","1/35","67/5696",0.339911447408281,0.491320361295151,0.474803367869273,"Pp3c20_980V3",1
"GO:0045229","GO:0045229","external encapsulating structure organization","1/35","67/5696",0.339911447408281,0.491320361295151,0.474803367869273,"Pp3c17_15260V3",1
"GO:0008652","GO:0008652","cellular amino acid biosynthetic process","1/35","68/5696",0.344015746456195,0.491320361295151,0.474803367869273,"Pp3c23_18410V3",1
"GO:0022603","GO:0022603","regulation of anatomical structure morphogenesis","1/35","68/5696",0.344015746456195,0.491320361295151,0.474803367869273,"Pp3c9_4230V3",1
"GO:0048469","GO:0048469","cell maturation","1/35","68/5696",0.344015746456195,0.491320361295151,0.474803367869273,"Pp3c1_38880V3",1
"GO:0048764","GO:0048764","trichoblast maturation","1/35","68/5696",0.344015746456195,0.491320361295151,0.474803367869273,"Pp3c1_38880V3",1
"GO:0048765","GO:0048765","root hair cell differentiation","1/35","68/5696",0.344015746456195,0.491320361295151,0.474803367869273,"Pp3c1_38880V3",1
"GO:0048869","GO:0048869","cellular developmental process","3/35","341/5696",0.349862430801671,0.496337549585906,0.479651890514264,"Pp3c1_38880V3/Pp3c11_10350V3/Pp3c10_14800V3",3
"GO:0006633","GO:0006633","fatty acid biosynthetic process","1/35","70/5696",0.352150105013464,0.496337549585906,0.479651890514264,"Pp3c11_10350V3",1
"GO:0009894","GO:0009894","regulation of catabolic process","1/35","70/5696",0.352150105013464,0.496337549585906,0.479651890514264,"Pp3c14_5930V3",1
"GO:0010054","GO:0010054","trichoblast differentiation","1/35","70/5696",0.352150105013464,0.496337549585906,0.479651890514264,"Pp3c1_38880V3",1
"GO:0042325","GO:0042325","regulation of phosphorylation","1/35","70/5696",0.352150105013464,0.496337549585906,0.479651890514264,"Pp3c14_5930V3",1
"GO:0000271","GO:0000271","polysaccharide biosynthetic process","1/35","71/5696",0.356180454520134,0.499396616389849,0.482608118945792,"Pp3c20_980V3",1
"GO:0032269","GO:0032269","negative regulation of cellular protein metabolic process","1/35","71/5696",0.356180454520134,0.499396616389849,0.482608118945792,"Pp3c5_27150V3",1
"GO:0007005","GO:0007005","mitochondrion organization","1/35","72/5696",0.36018644280312,0.499793591176423,0.482991748407285,"Pp3c14_5930V3",1
"GO:0009723","GO:0009723","response to ethylene","1/35","72/5696",0.36018644280312,0.499793591176423,0.482991748407285,"Pp3c27_1350V3",1
"GO:0010016","GO:0010016","shoot system morphogenesis","1/35","72/5696",0.36018644280312,0.499793591176423,0.482991748407285,"Pp3c5_27150V3",1
"GO:0055082","GO:0055082","cellular chemical homeostasis","1/35","72/5696",0.36018644280312,0.499793591176423,0.482991748407285,"Pp3c4_15350V3",1
"GO:0009790","GO:0009790","embryo development","2/35","206/5696",0.363001280111964,0.502401256237435,0.485511750122621,"Pp3c14_5930V3/Pp3c22_5840V3",2
"GO:1901617","GO:1901617","organic hydroxy compound biosynthetic process","1/35","73/5696",0.364168212807012,0.502720643386544,0.485820400253977,"Pp3c11_10350V3",1
"GO:0051128","GO:0051128","regulation of cellular component organization","2/35","210/5696",0.371967659216762,0.509683776727321,0.492549450017778,"Pp3c9_4230V3/Pp3c19_14290V3",2
"GO:0019748","GO:0019748","secondary metabolic process","1/35","75/5696",0.372059665692942,0.509683776727321,0.492549450017778,"Pp3c11_10350V3",1
"GO:0055065","GO:0055065","metal ion homeostasis","1/35","75/5696",0.372059665692942,0.509683776727321,0.492549450017778,"Pp3c4_15350V3",1
"GO:0010647","GO:0010647","positive regulation of cell communication","1/35","76/5696",0.375969630414655,0.51242561302708,0.495199112461728,"Pp3c17_13870V3",1
"GO:0051248","GO:0051248","negative regulation of protein metabolic process","1/35","76/5696",0.375969630414655,0.51242561302708,0.495199112461728,"Pp3c5_27150V3",1
"GO:0065009","GO:0065009","regulation of molecular function","2/35","214/5696",0.38088896542887,0.517315690555429,0.499924797498435,"Pp3c14_5930V3/Pp3c19_14290V3",2
"GO:0019752","GO:0019752","carboxylic acid metabolic process","3/35","360/5696",0.382447540317514,0.517315690555429,0.499924797498435,"Pp3c11_10350V3/Pp3c4_15350V3/Pp3c23_18410V3",3
"GO:1901362","GO:1901362","organic cyclic compound biosynthetic process","3/35","360/5696",0.382447540317514,0.517315690555429,0.499924797498435,"Pp3c1_38880V3/Pp3c11_10350V3/Pp3c14_14540V3",3
"GO:0016052","GO:0016052","carbohydrate catabolic process","1/35","78/5696",0.383718735007334,0.517731057032508,0.500326200366611,"Pp3c4_19160V3",1
"GO:0010608","GO:0010608","post-transcriptional regulation of gene expression","1/35","80/5696",0.391374328658794,0.523605055713695,0.506002729524359,"Pp3c5_27150V3",1
"GO:0046777","GO:0046777","protein autophosphorylation","1/35","80/5696",0.391374328658794,0.523605055713695,0.506002729524359,"Pp3c22_5840V3",1
"GO:0016053","GO:0016053","organic acid biosynthetic process","2/35","219/5696",0.391972499808018,0.523605055713695,0.506002729524359,"Pp3c11_10350V3/Pp3c23_18410V3",2
"GO:0046394","GO:0046394","carboxylic acid biosynthetic process","2/35","219/5696",0.391972499808018,0.523605055713695,0.506002729524359,"Pp3c11_10350V3/Pp3c23_18410V3",2
"GO:0022607","GO:0022607","cellular component assembly","3/35","367/5696",0.394394131830509,0.525259640448885,0.50760169115221,"Pp3c14_5930V3/Pp3c17_15260V3/Pp3c9_4230V3",3
"GO:0010218","GO:0010218","response to far red light","1/35","81/5696",0.395167401752978,0.525259640448885,0.50760169115221,"Pp3c4_15350V3",1
"GO:0034654","GO:0034654","nucleobase-containing compound biosynthetic process","2/35","222/5696",0.398584106560916,0.527658722307301,0.509920121724001,"Pp3c1_38880V3/Pp3c14_14540V3",2
"GO:0010053","GO:0010053","root epidermal cell differentiation","1/35","82/5696",0.398937506995836,0.527658722307301,0.509920121724001,"Pp3c1_38880V3",1
"GO:0034637","GO:0034637","cellular carbohydrate biosynthetic process","1/35","83/5696",0.402684779396112,0.529713161807196,0.51190549597363,"Pp3c20_980V3",1
"GO:0008104","GO:0008104","protein localization","2/35","224/5696",0.402975072040108,0.529713161807196,0.51190549597363,"Pp3c9_4230V3/Pp3c19_14290V3",2
"GO:0022622","GO:0022622","root system development","2/35","225/5696",0.405165397702971,0.529713161807196,0.51190549597363,"Pp3c1_38880V3/Pp3c14_18760V3",2
"GO:0048364","GO:0048364","root development","2/35","225/5696",0.405165397702971,0.529713161807196,0.51190549597363,"Pp3c1_38880V3/Pp3c14_18760V3",2
"GO:0000226","GO:0000226","microtubule cytoskeleton organization","1/35","84/5696",0.406409353192858,0.529713161807196,0.51190549597363,"Pp3c17_15260V3",1
"GO:0097659","GO:0097659","nucleic acid-templated transcription","1/35","84/5696",0.406409353192858,0.529713161807196,0.51190549597363,"Pp3c1_38880V3",1
"GO:0071695","GO:0071695","anatomical structure maturation","1/35","85/5696",0.410111361859688,0.533244070989473,0.515317704592395,"Pp3c1_38880V3",1
"GO:0006631","GO:0006631","fatty acid metabolic process","1/35","86/5696",0.413790938109003,0.534620044045372,0.516647420786765,"Pp3c11_10350V3",1
"GO:0010119","GO:0010119","regulation of stomatal movement","1/35","86/5696",0.413790938109003,0.534620044045372,0.516647420786765,"Pp3c14_18760V3",1
"GO:0019220","GO:0019220","regulation of phosphate metabolic process","1/35","87/5696",0.417448213896202,0.534620044045372,0.516647420786765,"Pp3c14_5930V3",1
"GO:0051174","GO:0051174","regulation of phosphorus metabolic process","1/35","87/5696",0.417448213896202,0.534620044045372,0.516647420786765,"Pp3c14_5930V3",1
"GO:0055080","GO:0055080","cation homeostasis","1/35","87/5696",0.417448213896202,0.534620044045372,0.516647420786765,"Pp3c4_15350V3",1
"GO:0006082","GO:0006082","organic acid metabolic process","3/35","381/5696",0.418138581934928,0.534620044045372,0.516647420786765,"Pp3c11_10350V3/Pp3c4_15350V3/Pp3c23_18410V3",3
"GO:0043436","GO:0043436","oxoacid metabolic process","3/35","381/5696",0.418138581934928,0.534620044045372,0.516647420786765,"Pp3c11_10350V3/Pp3c4_15350V3/Pp3c23_18410V3",3
"GO:0042546","GO:0042546","cell wall biogenesis","1/35","88/5696",0.42108332042386,0.53583351437823,0.517820097203699,"Pp3c17_15260V3",1
"GO:0071669","GO:0071669","plant-type cell wall organization or biogenesis","1/35","88/5696",0.42108332042386,0.53583351437823,0.517820097203699,"Pp3c17_15260V3",1
"GO:0000280","GO:0000280","nuclear division","1/35","89/5696",0.424696388145894,0.539153570766773,0.521028541385904,"Pp3c17_15260V3",1
"GO:0009059","GO:0009059","macromolecule biosynthetic process","3/35","387/5696",0.428240242944024,0.539883597691086,0.521734026583761,"Pp3c1_38880V3/Pp3c20_980V3/Pp3c14_14540V3",3
"GO:0010114","GO:0010114","response to red light","1/35","90/5696",0.4282875467717,0.539883597691086,0.521734026583761,"Pp3c4_15350V3",1
"GO:0098771","GO:0098771","inorganic ion homeostasis","1/35","90/5696",0.4282875467717,0.539883597691086,0.521734026583761,"Pp3c4_15350V3",1
"GO:0006073","GO:0006073","cellular glucan metabolic process","1/35","92/5696",0.435404651874292,0.546290416019848,0.527925463290768,"Pp3c20_980V3",1
"GO:0090627","GO:0090627","plant epidermal cell differentiation","1/35","92/5696",0.435404651874292,0.546290416019848,0.527925463290768,"Pp3c1_38880V3",1
"GO:0046907","GO:0046907","intracellular transport","2/35","241/5696",0.439709834564207,0.55040601669226,0.531902707496391,"Pp3c17_15260V3/Pp3c19_14290V3",2
"GO:0070887","GO:0070887","cellular response to chemical stimulus","3/35","396/5696",0.443293244835703,0.553144331186062,0.53454896652892,"Pp3c27_1350V3/Pp3c14_18760V3/Pp3c4_15350V3",3
"GO:0009409","GO:0009409","response to cold","2/35","243/5696",0.443957554452873,0.553144331186062,0.53454896652892,"Pp3c17_13870V3/Pp3c4_15350V3",2
"GO:0021700","GO:0021700","developmental maturation","1/35","95/5696",0.445919191686666,0.554302328554953,0.535668034847773,"Pp3c1_38880V3",1
"GO:0019725","GO:0019725","cellular homeostasis","1/35","96/5696",0.449381578455272,0.557166102536895,0.538435535726138,"Pp3c4_15350V3",1
"GO:0048316","GO:0048316","seed development","2/35","246/5696",0.450298116389222,0.557166102536895,0.538435535726138,"Pp3c11_10350V3/Pp3c22_5840V3",2
"GO:0051276","GO:0051276","chromosome organization","2/35","247/5696",0.45240324656566,0.557720001623373,0.538970814074925,"Pp3c17_15260V3/Pp3c4_15350V3",2
"GO:0009611","GO:0009611","response to wounding","1/35","97/5696",0.452822943589927,0.557720001623373,0.538970814074925,"Pp3c16_11020V3",1
"GO:0071214","GO:0071214","cellular response to abiotic stimulus","1/35","98/5696",0.45624341099024,0.559366921693513,0.540562368705091,"Pp3c4_15350V3",1
"GO:0104004","GO:0104004","cellular response to environmental stimulus","1/35","98/5696",0.45624341099024,0.559366921693513,0.540562368705091,"Pp3c4_15350V3",1
"GO:0009653","GO:0009653","anatomical structure morphogenesis","3/35","406/5696",0.459861178153355,0.562518115417658,0.543607626974234,"Pp3c5_27150V3/Pp3c1_38880V3/Pp3c11_10350V3",3
"GO:0099402","GO:0099402","plant organ development","3/35","411/5696",0.468076647911537,0.571266272564762,0.552061692393272,"Pp3c5_27150V3/Pp3c1_38880V3/Pp3c14_18760V3",3
"GO:0010154","GO:0010154","fruit development","2/35","256/5696",0.471155186988113,0.573719581434505,0.554432526996395,"Pp3c11_10350V3/Pp3c22_5840V3",2
"GO:0016311","GO:0016311","dephosphorylation","1/35","103/5696",0.473036569104594,0.574707324907618,0.555387064940616,"Pp3c16_11020V3",1
"GO:0050801","GO:0050801","ion homeostasis","1/35","104/5696",0.476334212602062,0.577407386382184,0.557996356927211,"Pp3c4_15350V3",1
"GO:0045087","GO:0045087","innate immune response","1/35","105/5696",0.479611806049653,0.580071035695188,0.560570460840396,"Pp3c27_1350V3",1
"GO:0009416","GO:0009416","response to light stimulus","3/35","420/5696",0.482739586741843,0.580796232976562,0.561271278756141,"Pp3c5_27150V3/Pp3c4_15350V3/Pp3c27_6760V3",3
"GO:0044042","GO:0044042","glucan metabolic process","1/35","106/5696",0.482869467789639,0.580796232976562,0.561271278756141,"Pp3c20_980V3",1
"GO:0051649","GO:0051649","establishment of localization in cell","2/35","262/5696",0.483456082198368,0.580796232976562,0.561271278756141,"Pp3c17_15260V3/Pp3c19_14290V3",2
"GO:0044264","GO:0044264","cellular polysaccharide metabolic process","1/35","108/5696",0.489325466132388,0.585228898247422,0.565554928620953,"Pp3c20_980V3",1
"GO:0051049","GO:0051049","regulation of transport","1/35","108/5696",0.489325466132388,0.585228898247422,0.565554928620953,"Pp3c19_14290V3",1
"GO:0006397","GO:0006397","mRNA processing","1/35","111/5696",0.498862895643307,0.592675608319593,0.572751298444691,"Pp3c20_980V3",1
"GO:0006955","GO:0006955","immune response","1/35","111/5696",0.498862895643307,0.592675608319593,0.572751298444691,"Pp3c27_1350V3",1
"GO:1901605","GO:1901605","alpha-amino acid metabolic process","1/35","111/5696",0.498862895643307,0.592675608319593,0.572751298444691,"Pp3c23_18410V3",1
"GO:0033036","GO:0033036","macromolecule localization","2/35","276/5696",0.511504407196257,0.604419230167074,0.584100128339444,"Pp3c9_4230V3/Pp3c19_14290V3",2
"GO:0009314","GO:0009314","response to radiation","3/35","438/5696",0.511537650277022,0.604419230167074,0.584100128339444,"Pp3c5_27150V3/Pp3c4_15350V3/Pp3c27_6760V3",3
"GO:0006790","GO:0006790","sulfur compound metabolic process","1/35","116/5696",0.51437539699507,0.604419230167074,0.584100128339444,"Pp3c23_18410V3",1
"GO:0006820","GO:0006820","anion transport","1/35","116/5696",0.51437539699507,0.604419230167074,0.584100128339444,"Pp3c11_3390V3",1
"GO:0007017","GO:0007017","microtubule-based process","1/35","116/5696",0.51437539699507,0.604419230167074,0.584100128339444,"Pp3c17_15260V3",1
"GO:0016071","GO:0016071","mRNA metabolic process","1/35","123/5696",0.535311614999811,0.626279601862524,0.605225607602125,"Pp3c20_980V3",1
"GO:0032879","GO:0032879","regulation of localization","1/35","123/5696",0.535311614999811,0.626279601862524,0.605225607602125,"Pp3c19_14290V3",1
"GO:0005976","GO:0005976","polysaccharide metabolic process","1/35","125/5696",0.541130553534842,0.630340796633862,0.609150274900507,"Pp3c20_980V3",1
"GO:0048285","GO:0048285","organelle fission","1/35","125/5696",0.541130553534842,0.630340796633862,0.609150274900507,"Pp3c17_15260V3",1
"GO:0051726","GO:0051726","regulation of cell cycle","1/35","127/5696",0.546878682471835,0.635657689366613,0.614288426654396,"Pp3c2_25440V3",1
"GO:0009451","GO:0009451","RNA modification","1/35","128/5696",0.549726455162351,0.637587702855685,0.616153557792518,"Pp3c10_14800V3",1
"GO:0072330","GO:0072330","monocarboxylic acid biosynthetic process","1/35","129/5696",0.552556838436295,0.639489272069591,0.617991200882698,"Pp3c11_10350V3",1
"GO:0010015","GO:0010015","root morphogenesis","1/35","131/5696",0.558165848464984,0.644591528227304,0.622921931620231,"Pp3c1_38880V3",1
"GO:0010035","GO:0010035","response to inorganic substance","3/35","470/5696",0.560757067018219,0.646194302551037,0.624470824576422,"Pp3c16_11020V3/Pp3c14_18760V3/Pp3c9_4230V3",3
"GO:0016051","GO:0016051","carbohydrate biosynthetic process","1/35","134/5696",0.566451500712111,0.651358577906646,0.629461489577529,"Pp3c20_980V3",1
"GO:0014070","GO:0014070","response to organic cyclic compound","1/35","135/5696",0.569179691556245,0.653097210183127,0.63114167327312,"Pp3c9_4230V3",1
"GO:0001101","GO:0001101","response to acid chemical","3/35","477/5696",0.571153423571484,0.653964580933661,0.631979885132402,"Pp3c27_1350V3/Pp3c16_11020V3/Pp3c4_15350V3",3
"GO:0009735","GO:0009735","response to cytokinin","1/35","140/5696",0.582572414548286,0.664372792645013,0.642038198126024,"Pp3c14_18760V3",1
"GO:0044283","GO:0044283","small molecule biosynthetic process","2/35","314/5696",0.582718036007078,0.664372792645013,0.642038198126024,"Pp3c11_10350V3/Pp3c23_18410V3",2
"GO:0009642","GO:0009642","response to light intensity","1/35","141/5696",0.585201997969958,0.664383663657225,0.642048703681294,"Pp3c4_15350V3",1
"GO:0090305","GO:0090305","nucleic acid phosphodiester bond hydrolysis","1/35","141/5696",0.585201997969958,0.664383663657225,0.642048703681294,"Pp3c10_14800V3",1
"GO:0006520","GO:0006520","cellular amino acid metabolic process","1/35","144/5696",0.592994562240084,0.671810295196044,0.64922566996305,"Pp3c23_18410V3",1
"GO:0006952","GO:0006952","defense response","2/35","325/5696",0.601933478956797,0.680501638315368,0.657624831303492,"Pp3c27_1350V3/Pp3c16_11020V3",2
"GO:0048366","GO:0048366","leaf development","1/35","149/5696",0.605667221374469,0.683284239239684,0.660313887964647,"Pp3c5_27150V3",1
"GO:0050793","GO:0050793","regulation of developmental process","2/35","331/5696",0.612144929720724,0.689144291949746,0.665976939980839,"Pp3c9_4230V3/Pp3c4_15350V3",2
"GO:0051641","GO:0051641","cellular localization","2/35","335/5696",0.618846557533576,0.695231383672658,0.671859398511458,"Pp3c17_15260V3/Pp3c19_14290V3",2
"GO:2000241","GO:2000241","regulation of reproductive process","1/35","156/5696",0.622766952714099,0.698175059723322,0.674704115345678,"Pp3c4_15350V3",1
"GO:0048878","GO:0048878","chemical homeostasis","1/35","158/5696",0.627518806229926,0.699996099173969,0.676463935887027,"Pp3c4_15350V3",1
"GO:0032446","GO:0032446","protein modification by small protein conjugation","1/35","159/5696",0.629872876613089,0.699996099173969,0.676463935887027,"Pp3c27_6760V3",1
"GO:0071554","GO:0071554","cell wall organization or biogenesis","1/35","159/5696",0.629872876613089,0.699996099173969,0.676463935887027,"Pp3c17_15260V3",1
"GO:0016192","GO:0016192","vesicle-mediated transport","1/35","160/5696",0.632212491805168,0.699996099173969,0.676463935887027,"Pp3c17_15260V3",1
"GO:0016567","GO:0016567","protein ubiquitination","1/35","160/5696",0.632212491805168,0.699996099173969,0.676463935887027,"Pp3c27_6760V3",1
"GO:0044262","GO:0044262","cellular carbohydrate metabolic process","1/35","160/5696",0.632212491805168,0.699996099173969,0.676463935887027,"Pp3c20_980V3",1
"GO:0009639","GO:0009639","response to red or far red light","1/35","164/5696",0.641428116549759,0.707510717029139,0.68372593059956,"Pp3c4_15350V3",1
"GO:0009266","GO:0009266","response to temperature stimulus","2/35","349/5696",0.641634486393279,0.707510717029139,0.68372593059956,"Pp3c17_13870V3/Pp3c4_15350V3",2
"GO:0006325","GO:0006325","chromatin organization","1/35","167/5696",0.648192228420872,0.710365768697976,0.686485002387733,"Pp3c4_15350V3",1
"GO:0042742","GO:0042742","defense response to bacterium","1/35","167/5696",0.648192228420872,0.710365768697976,0.686485002387733,"Pp3c27_1350V3",1
"GO:0048580","GO:0048580","regulation of post-embryonic development","1/35","167/5696",0.648192228420872,0.710365768697976,0.686485002387733,"Pp3c4_15350V3",1
"GO:0070647","GO:0070647","protein modification by small protein conjugation or removal","1/35","168/5696",0.650419262605222,0.711354672136465,0.687440661302121,"Pp3c27_6760V3",1
"GO:0032268","GO:0032268","regulation of cellular protein metabolic process","1/35","172/5696",0.659191240923295,0.71948312271506,0.695295853177545,"Pp3c5_27150V3",1
"GO:0018193","GO:0018193","peptidyl-amino acid modification","1/35","176/5696",0.667749240523709,0.727345521625216,0.702893937393377,"Pp3c14_18760V3",1
"GO:0034645","GO:0034645","cellular macromolecule biosynthetic process","2/35","368/5696",0.670907271783269,0.72930608288991,0.704788589365335,"Pp3c1_38880V3/Pp3c20_980V3",2
"GO:0015979","GO:0015979","photosynthesis","1/35","184/5696",0.684243466215071,0.742300487590895,0.717346153841637,"Pp3c4_15350V3",1
"GO:0048229","GO:0048229","gametophyte development","1/35","185/5696",0.686248451462254,0.742974633941997,0.717997637034998,"Pp3c10_14800V3",1
"GO:0009793","GO:0009793","embryo development ending in seed dormancy","1/35","186/5696",0.688241066994611,0.743632702165204,0.718633582607949,"Pp3c22_5840V3",1
"GO:0015833","GO:0015833","peptide transport","1/35","190/5696",0.696089307207218,0.749098112164882,0.723915258840119,"Pp3c19_14290V3",1
"GO:0045184","GO:0045184","establishment of protein localization","1/35","190/5696",0.696089307207218,0.749098112164882,0.723915258840119,"Pp3c19_14290V3",1
"GO:0042886","GO:0042886","amide transport","1/35","192/5696",0.699941114870868,0.750236284801708,0.725015168886097,"Pp3c19_14290V3",1
"GO:0051246","GO:0051246","regulation of protein metabolic process","1/35","192/5696",0.699941114870868,0.750236284801708,0.725015168886097,"Pp3c5_27150V3",1
"GO:0034613","GO:0034613","cellular protein localization","1/35","201/5696",0.7166953016885,0.766664097622958,0.74089071866729,"Pp3c19_14290V3",1
"GO:0042592","GO:0042592","homeostatic process","1/35","202/5696",0.718499790212777,0.767066376429943,0.741279473840953,"Pp3c4_15350V3",1
"GO:0048827","GO:0048827","phyllome development","1/35","205/5696",0.72384652053488,0.77124123318895,0.74531398208792,"Pp3c5_27150V3",1
"GO:0006886","GO:0006886","intracellular protein transport","1/35","206/5696",0.72560674121987,0.771585782247664,0.745646948246787,"Pp3c19_14290V3",1
"GO:0015031","GO:0015031","protein transport","1/35","207/5696",0.72735606072029,0.771917400408687,0.745967418213237,"Pp3c19_14290V3",1
"GO:0048608","GO:0048608","reproductive structure development","2/35","415/5696",0.735347491106447,0.777325989614492,0.751194183828177,"Pp3c11_10350V3/Pp3c22_5840V3",2
"GO:0061458","GO:0061458","reproductive system development","2/35","415/5696",0.735347491106447,0.777325989614492,0.751194183828177,"Pp3c11_10350V3/Pp3c22_5840V3",2
"GO:0055085","GO:0055085","transmembrane transport","2/35","429/5696",0.752435981365557,0.793827351656786,0.767140810284809,"Pp3c5_1870V3/Pp3c11_3390V3",2
"GO:0044271","GO:0044271","cellular nitrogen compound biosynthetic process","2/35","433/5696",0.757148241785837,0.797232560468617,0.770431544273308,"Pp3c1_38880V3/Pp3c14_14540V3",2
"GO:0070727","GO:0070727","cellular macromolecule localization","1/35","227/5696",0.760151391353141,0.798828370169544,0.771973706740341,"Pp3c19_14290V3",1
"GO:0009056","GO:0009056","catabolic process","2/35","439/5696",0.764077382501008,0.800504433038778,0.773593424459703,"Pp3c14_5930V3/Pp3c4_19160V3",2
"GO:1901565","GO:1901565","organonitrogen compound catabolic process","1/35","230/5696",0.764727698601291,0.800504433038778,0.773593424459703,"Pp3c4_19160V3",1
"GO:0009737","GO:0009737","response to abscisic acid","1/35","235/5696",0.772167038876871,0.806559890681038,0.779445312370385,"Pp3c27_1350V3",1
"GO:0009057","GO:0009057","macromolecule catabolic process","1/35","237/5696",0.77507834658184,0.806559890681038,0.779445312370385,"Pp3c4_19160V3",1
"GO:0065008","GO:0065008","regulation of biological quality","2/35","450/5696",0.776354041469512,0.806559890681038,0.779445312370385,"Pp3c9_4230V3/Pp3c4_15350V3",2
"GO:0009651","GO:0009651","response to salt stress","1/35","238/5696",0.776520416167778,0.806559890681038,0.779445312370385,"Pp3c5_27150V3",1
"GO:1901135","GO:1901135","carbohydrate derivative metabolic process","1/35","247/5696",0.789101250366504,0.818045118623191,0.79054443493332,"Pp3c4_19160V3",1
"GO:2000026","GO:2000026","regulation of multicellular organismal development","1/35","253/5696",0.797103324009147,0.824748525997904,0.797022490085203,"Pp3c4_15350V3",1
"GO:0097305","GO:0097305","response to alcohol","1/35","258/5696",0.803545713855874,0.828222741536669,0.800379910962614,"Pp3c27_1350V3",1
"GO:0098542","GO:0098542","defense response to other organism","1/35","258/5696",0.803545713855874,0.828222741536669,0.800379910962614,"Pp3c27_1350V3",1
"GO:0071705","GO:0071705","nitrogen compound transport","1/35","261/5696",0.807315292158416,0.829732002200305,0.801838433960111,"Pp3c19_14290V3",1
"GO:0010467","GO:0010467","gene expression","2/35","481/5696",0.808100255401787,0.829732002200305,0.801838433960111,"Pp3c1_38880V3/Pp3c20_980V3",2
"GO:0010038","GO:0010038","response to metal ion","1/35","263/5696",0.809789208115916,0.829879398393601,0.801980875052525,"Pp3c16_11020V3",1
"GO:0003006","GO:0003006","developmental process involved in reproduction","2/35","496/5696",0.82202796649998,0.840817177162837,0.812550952349855,"Pp3c11_10350V3/Pp3c22_5840V3",2
"GO:0065003","GO:0065003","protein-containing complex assembly","1/35","276/5696",0.825133772242393,0.84194159666324,0.813637571606345,"Pp3c9_4230V3",1
"GO:0006811","GO:0006811","ion transport","1/35","277/5696",0.826262982200237,0.84194159666324,0.813637571606345,"Pp3c11_3390V3",1
"GO:0006508","GO:0006508","proteolysis","1/35","280/5696",0.829608274957735,0.84374932509906,0.815384528616753,"Pp3c1_20330V3",1
"GO:0051239","GO:0051239","regulation of multicellular organismal process","1/35","288/5696",0.838226056128196,0.850902442610285,0.822297175746096,"Pp3c4_15350V3",1
"GO:0033993","GO:0033993","response to lipid","1/35","293/5696",0.843395539640157,0.852925432743436,0.824252157880063,"Pp3c27_1350V3",1
"GO:0048367","GO:0048367","shoot system development","1/35","293/5696",0.843395539640157,0.852925432743436,0.824252157880063,"Pp3c5_27150V3",1
"GO:0006396","GO:0006396","RNA processing","1/35","295/5696",0.845418085266545,0.853363743962659,0.824675734144057,"Pp3c20_980V3",1
"GO:0043933","GO:0043933","protein-containing complex organization","1/35","298/5696",0.848404405103767,0.854771417524808,0.826036085150898,"Pp3c9_4230V3",1
"GO:0071702","GO:0071702","organic substance transport","1/35","314/5696",0.863408988650132,0.868259600945919,0.839070828709866,"Pp3c19_14290V3",1
"GO:0044248","GO:0044248","cellular catabolic process","1/35","390/5696",0.917099764141304,0.920528174474542,0.889582260150837,"Pp3c14_5930V3",1
"GO:1901575","GO:1901575","organic substance catabolic process","1/35","394/5696",0.919266164382698,0.920981213196845,0.890020068815142,"Pp3c4_19160V3",1
"GO:1901566","GO:1901566","organonitrogen compound biosynthetic process","1/35","405/5696",0.924944045272716,0.924944045272716,0.893849680132214,"Pp3c23_18410V3",1
