AT5G67030
AT3G11945
AT1G10670
AT2G26170
AT3G04870
AT1G06570
AT5G17230
AT1G08550
AT4G25700
AT4G32810
AT3G24200
AT5G61670
AT3G57180
AT5G06130
AT3G63520
AT1G77300
AT3G10230
AT5G52570
AT1G06820
AT4G32770
AT2G44990
AT4G19170
AT4G22260
AT1G63970
AT3G53130
AT1G57770
AT3G03710
AT5G49650
AT4G00370
AT4G14210
AT2G21860
AT1G67080
AT4G31390
AT1G31800
AT1G28100
AT2G48120
AT2G26670
AT5G57030