nodeName	altName	nodeAttr[nodesPresent, ]
Me1_v2_0007490	NA	darkgreen
Me1_v2_0022740	NA	darkgreen
Me1_v2_0025800	NA	darkgreen
Me1_v2_0026590	NA	darkgreen
Me1_v2_0027640	NA	darkgreen
Me1_v2_0027720	NA	darkgreen
Me1_v2_0028080	NA	darkgreen
Me1_v2_0029430	NA	darkgreen
Me1_v2_0030440	NA	darkgreen
Me1_v2_0035410	NA	darkgreen
Me1_v2_0048620	NA	darkgreen
Me1_v2_0055070	NA	darkgreen
Me1_v2_0058550	NA	darkgreen
Me1_v2_0062370	NA	darkgreen
Me1_v2_0067390	NA	darkgreen
Me1_v2_0067620	NA	darkgreen
Me1_v2_0071770	NA	darkgreen
Me1_v2_0075600	NA	darkgreen
Me1_v2_0075610	NA	darkgreen
Me1_v2_0078880	NA	darkgreen
Me1_v2_0083520	NA	darkgreen
Me1_v2_0083530	NA	darkgreen
Me1_v2_0087450	NA	darkgreen
Me1_v2_0093690	NA	darkgreen
Me1_v2_0094860	NA	darkgreen
Me1_v2_0099280	NA	darkgreen
Me1_v2_0099390	NA	darkgreen
Me1_v2_0107950	NA	darkgreen
Me1_v2_0109730	NA	darkgreen
Me1_v2_0110660	NA	darkgreen
Me1_v2_0116260	NA	darkgreen
Me1_v2_0120970	NA	darkgreen
Me1_v2_0121470	NA	darkgreen
Me1_v2_0122920	NA	darkgreen
Me1_v2_0123430	NA	darkgreen
Me1_v2_0128900	NA	darkgreen
Me1_v2_0129090	NA	darkgreen
Me1_v2_0129260	NA	darkgreen
Me1_v2_0129270	NA	darkgreen
Me1_v2_0129280	NA	darkgreen
Me1_v2_0130300	NA	darkgreen
Me1_v2_0133830	NA	darkgreen
Me1_v2_0134330	NA	darkgreen
Me1_v2_0143530	NA	darkgreen
Me1_v2_0150320	NA	darkgreen
Me1_v2_0151470	NA	darkgreen
Me1_v2_0152720	NA	darkgreen
Me1_v2_0153460	NA	darkgreen
Me1_v2_0165380	NA	darkgreen
Me1_v2_0165400	NA	darkgreen
Me1_v2_0165430	NA	darkgreen
Me1_v2_0166840	NA	darkgreen
Me1_v2_0168510	NA	darkgreen
Me1_v2_0170050	NA	darkgreen
Me1_v2_0173860	NA	darkgreen
Me1_v2_0179030	NA	darkgreen
Me1_v2_0180840	NA	darkgreen
Me1_v2_0184970	NA	darkgreen
Me1_v2_0194380	NA	darkgreen
Me1_v2_0194960	NA	darkgreen
Me1_v2_0196050	NA	darkgreen
Me1_v2_0199620	NA	darkgreen
Me1_v2_0209330	NA	darkgreen
Me1_v2_0215820	NA	darkgreen
Me1_v2_0218650	NA	darkgreen
Me1_v2_0220680	NA	darkgreen
Me1_v2_0225880	NA	darkgreen
Me1_v2_0230070	NA	darkgreen
Me1_v2_0230240	NA	darkgreen
Me1_v2_0230620	NA	darkgreen
Me1_v2_0231360	NA	darkgreen
