Sample	37	42	47	52	57	62	67	72	77	82	87	92	97	102	107	112	117	122	127	132	137	142	147	150
P_1_10_EKRN220057179-1A_HLTJ3DSX5_L4_1	52268.0	63290.0	64212.0	64845.0	66492.0	63635.0	63318.0	65998.0	63385.0	64646.0	65074.0	64490.0	65146.0	64253.0	62899.0	61967.0	64032.0	68686.0	72658.0	80872.0	154113.0	180783.0	2611698.0	24618042.0
P_1_10_EKRN220057179-1A_HLTJ3DSX5_L4_2	36024.0	45647.0	45918.0	44892.0	45485.0	45437.0	46271.0	47879.0	47660.0	48653.0	50900.0	51505.0	53269.0	54653.0	57336.0	54660.0	59325.0	60346.0	61158.0	72680.0	149763.0	174804.0	3993204.0	23519333.0
P_1_11_1	53828.0	65809.0	65995.0	67735.0	68500.0	66880.0	66027.0	67541.0	66455.0	67575.0	68324.0	67672.0	68016.0	66876.0	66083.0	64612.0	67598.0	72688.0	77414.0	88743.0	208370.0	245332.0	2772726.0	25363594.0
P_1_11_2	32959.0	42766.0	42956.0	42731.0	43959.0	43630.0	44391.0	45982.0	46150.0	47850.0	50138.0	50910.0	52771.0	54381.0	56961.0	54847.0	59384.0	60087.0	61362.0	75822.0	200817.0	239146.0	4088238.0	24416155.0
P_1_12_1	59026.0	73144.0	73642.0	75448.0	75979.0	74151.0	73233.0	73228.0	71345.0	72505.0	73565.0	73553.0	73722.0	73356.0	72294.0	71461.0	74579.0	78477.0	81553.0	92124.0	178865.0	207991.0	2842296.0	25519348.0
P_1_12_2	39905.0	51042.0	51307.0	50440.0	51957.0	50699.0	51904.0	53593.0	53752.0	54664.0	57300.0	59078.0	60452.0	62898.0	66406.0	63866.0	68060.0	69204.0	71168.0	84064.0	176417.0	205761.0	4255306.0	24425642.0
P_1_13_1	61858.0	75183.0	75232.0	76626.0	78607.0	75999.0	75718.0	78141.0	77195.0	78472.0	78334.0	76973.0	77857.0	76865.0	76541.0	75848.0	78790.0	84043.0	89228.0	100141.0	186590.0	214594.0	2870404.0	25965303.0
P_1_13_2	42255.0	54191.0	54825.0	53165.0	55344.0	54153.0	55162.0	56914.0	57432.0	58945.0	61770.0	62864.0	64294.0	65542.0	69373.0	67377.0	71586.0	73706.0	76175.0	89262.0	178937.0	208211.0	4007177.0	25165882.0
P_1_14_EKRN220057183-1A_HLTJ3DSX5_L4_1	49709.0	60239.0	60152.0	61273.0	62873.0	60253.0	59612.0	61375.0	60358.0	61103.0	61641.0	61348.0	61830.0	60973.0	59630.0	58428.0	60613.0	63540.0	67651.0	75842.0	178921.0	213528.0	2607806.0	24417556.0
P_1_14_EKRN220057183-1A_HLTJ3DSX5_L4_2	28344.0	36253.0	36544.0	36149.0	37471.0	36835.0	37651.0	39227.0	39279.0	40495.0	42524.0	43274.0	44314.0	45374.0	48693.0	45880.0	49950.0	51612.0	52552.0	64472.0	171131.0	203471.0	3703459.0	23711300.0
P_1_15_EKRN220057184-1A_HKHYCDSX5_L1_1	41823.0	63761.0	63773.0	62211.0	61499.0	62004.0	61510.0	63355.0	64765.0	64511.0	65722.0	64825.0	65139.0	65057.0	66708.0	70112.0	71900.0	75418.0	77158.0	91262.0	193417.0	229862.0	2973616.0	24859193.0
P_1_15_EKRN220057184-1A_HKHYCDSX5_L1_2	38672.0	48111.0	46724.0	46313.0	44891.0	45592.0	47862.0	48666.0	49097.0	50507.0	49976.0	50947.0	53593.0	55778.0	59963.0	63625.0	65756.0	70176.0	69985.0	84044.0	188184.0	233259.0	3440315.0	24626565.0
P_1_16_EKRN220057185-1A_HKHYCDSX5_L1_1	44208.0	66987.0	67818.0	66024.0	64245.0	65896.0	64198.0	65561.0	67327.0	66637.0	67735.0	66174.0	67238.0	66524.0	68593.0	71703.0	74107.0	78378.0	80311.0	94525.0	181143.0	216717.0	3074506.0	25748281.0
P_1_16_EKRN220057185-1A_HKHYCDSX5_L1_2	35188.0	43655.0	43713.0	42605.0	41836.0	42282.0	44497.0	44698.0	45457.0	46362.0	46828.0	47314.0	49313.0	51423.0	55862.0	58558.0	61162.0	64389.0	64719.0	75768.0	168248.0	209048.0	3291969.0	25919942.0
P_1_17_EKRN220057186-1A_HKHYCDSX5_L1_1	42761.0	64104.0	65174.0	63597.0	62058.0	62787.0	61947.0	63705.0	65318.0	64786.0	65177.0	64683.0	64980.0	64609.0	66640.0	70337.0	72125.0	77638.0	79759.0	96639.0	203189.0	243288.0	3002289.0	25041242.0
P_1_17_EKRN220057186-1A_HKHYCDSX5_L1_2	39366.0	48647.0	47560.0	46082.0	45447.0	45915.0	48018.0	48175.0	48571.0	49928.0	50283.0	50649.0	53264.0	55229.0	59794.0	63154.0	65824.0	69671.0	69888.0	83279.0	195931.0	244024.0	3520647.0	24779486.0
P_1_18_EKRN220057187-1A_HKHYCDSX5_L1_1	40075.0	60624.0	60963.0	60224.0	59065.0	60395.0	59500.0	60950.0	62155.0	62560.0	63628.0	62814.0	63151.0	63030.0	64355.0	67600.0	69244.0	73886.0	75371.0	85315.0	130933.0	150156.0	2912335.0	25426613.0
P_1_18_EKRN220057187-1A_HKHYCDSX5_L1_2	46062.0	56881.0	56593.0	54478.0	52740.0	52991.0	55554.0	55618.0	55659.0	57608.0	56956.0	57366.0	60046.0	62345.0	66972.0	70733.0	73702.0	78068.0	77866.0	86151.0	135009.0	164467.0	3504580.0	24856497.0
P_1_19_EKRN220057188-1A_HKHYCDSX5_L1_1	43226.0	64552.0	65166.0	63989.0	62727.0	64264.0	63547.0	65036.0	67031.0	67071.0	68736.0	67905.0	68259.0	68396.0	69993.0	73392.0	74541.0	79004.0	80570.0	90976.0	139321.0	159568.0	2997398.0	25724591.0
P_1_19_EKRN220057188-1A_HKHYCDSX5_L1_2	41943.0	51969.0	51340.0	50194.0	49531.0	49454.0	52484.0	52705.0	53961.0	55345.0	55527.0	55390.0	58317.0	61480.0	65845.0	69573.0	72190.0	76459.0	76270.0	84740.0	136105.0	165569.0	3434894.0	25467974.0
P_1_1_EKRN220057170-1A_H23VJDSX5_L3_1	27264.0	35361.0	37386.0	34484.0	32916.0	36376.0	31450.0	28962.0	27286.0	29201.0	32555.0	33285.0	34430.0	36004.0	36949.0	39055.0	41227.0	45195.0	47427.0	66677.0	161242.0	186263.0	2838371.0	18358183.0
P_1_1_EKRN220057170-1A_H23VJDSX5_L3_2	31540.0	40353.0	39226.0	39662.0	41108.0	42447.0	44287.0	46561.0	49958.0	51062.0	54913.0	57801.0	62083.0	70685.0	75131.0	82764.0	83649.0	91113.0	107918.0	131632.0	240722.0	269731.0	3390265.0	17132938.0
P_1_20_EKRN220057189-1A_HKHYCDSX5_L1_1	41549.0	63291.0	63535.0	61834.0	61732.0	62364.0	62419.0	63226.0	66417.0	66085.0	67570.0	66828.0	67352.0	66752.0	68657.0	71762.0	73067.0	78393.0	79216.0	89406.0	128867.0	145646.0	2822785.0	23553238.0
P_1_20_EKRN220057189-1A_HKHYCDSX5_L1_2	35916.0	44637.0	44133.0	43699.0	43097.0	43728.0	46497.0	46953.0	48553.0	49857.0	49990.0	50813.0	53128.0	55539.0	60296.0	63603.0	66771.0	71006.0	70736.0	78057.0	120932.0	145877.0	3117609.0	23540564.0
P_1_21_EKRN220057190-1A_HKHYCDSX5_L2_1	40974.0	52136.0	51287.0	46674.0	42932.0	45425.0	42822.0	39239.0	36938.0	38187.0	39100.0	39837.0	41034.0	40892.0	42293.0	42745.0	43347.0	47092.0	48700.0	57234.0	99690.0	116450.0	2931944.0	26000274.0
P_1_21_EKRN220057190-1A_HKHYCDSX5_L2_2	31888.0	38863.0	39106.0	38769.0	36556.0	37087.0	38034.0	38519.0	40224.0	40114.0	40144.0	40394.0	43004.0	43186.0	46419.0	46623.0	49422.0	53248.0	55329.0	58713.0	104227.0	124522.0	2997117.0	25945738.0
P_1_22_EKRN220057191-1A_HKHYCDSX5_L1_1	44139.0	67333.0	67686.0	67827.0	67749.0	69486.0	70149.0	72297.0	74857.0	74180.0	76538.0	75805.0	77738.0	76912.0	80125.0	82860.0	84813.0	88073.0	90909.0	102584.0	173202.0	199606.0	2796554.0	23009564.0
P_1_22_EKRN220057191-1A_HKHYCDSX5_L1_2	36894.0	46206.0	46915.0	47053.0	46659.0	47752.0	52100.0	53046.0	54386.0	57023.0	58001.0	58872.0	62213.0	66041.0	71570.0	74651.0	78238.0	82433.0	82441.0	92148.0	164663.0	200190.0	3202518.0	22908973.0
P_1_23_EKRN220057192-1A_HKHYCDSX5_L1_1	54924.0	82521.0	83421.0	83582.0	83711.0	85340.0	85951.0	88182.0	90756.0	91378.0	93328.0	91793.0	94134.0	93711.0	95934.0	99077.0	99889.0	103708.0	104995.0	117578.0	191430.0	218948.0	3003198.0	24184926.0
P_1_23_EKRN220057192-1A_HKHYCDSX5_L1_2	37055.0	46967.0	48624.0	49690.0	50250.0	52088.0	56914.0	59271.0	60979.0	63835.0	65029.0	65482.0	69431.0	74265.0	78800.0	83601.0	87245.0	91654.0	91558.0	100088.0	177784.0	216441.0	3059887.0	24635477.0
P_1_24_EKRN220057193-1A_HKHYCDSX5_L1_1	57842.0	86926.0	89647.0	88349.0	89330.0	92427.0	92150.0	93462.0	97766.0	96333.0	98128.0	96418.0	97964.0	97561.0	100129.0	103969.0	104102.0	110169.0	109924.0	126249.0	220132.0	255574.0	3102134.0	24576242.0
P_1_24_EKRN220057193-1A_HKHYCDSX5_L1_2	43657.0	55822.0	58024.0	59381.0	59869.0	61609.0	66945.0	68459.0	69418.0	72186.0	73418.0	73658.0	77373.0	81274.0	86569.0	91099.0	95042.0	100006.0	99092.0	110095.0	207692.0	254336.0	3260546.0	24857357.0
P_1_25_1	53904.0	79259.0	80061.0	79999.0	78937.0	79125.0	79019.0	80291.0	82024.0	82787.0	83490.0	83220.0	83281.0	83846.0	85307.0	88959.0	90117.0	95134.0	96239.0	111136.0	193104.0	220140.0	3071776.0	25995247.0
P_1_25_2	41877.0	52755.0	53648.0	53884.0	53821.0	55265.0	58329.0	59348.0	61020.0	62809.0	63319.0	64182.0	66925.0	70034.0	74873.0	78067.0	81831.0	85577.0	87011.0	95771.0	184231.0	222489.0	3252262.0	26177074.0
P_1_26_1	56291.0	82583.0	84580.0	84109.0	83536.0	84960.0	85309.0	86056.0	88469.0	89628.0	90818.0	89429.0	91399.0	91136.0	92860.0	95805.0	96520.0	102127.0	103671.0	117874.0	193014.0	218255.0	3041606.0	25535564.0
P_1_26_2	43459.0	55399.0	56493.0	57727.0	57679.0	59445.0	63221.0	64686.0	66347.0	68907.0	69904.0	70622.0	73623.0	76735.0	81952.0	85905.0	88839.0	93711.0	94021.0	102290.0	182537.0	221241.0	3249046.0	25701810.0
P_1_27_EKRN220057196-1A_HKHYCDSX5_L1_1	47930.0	71974.0	73443.0	72727.0	72183.0	73015.0	73658.0	74391.0	76989.0	76888.0	78918.0	78558.0	79577.0	79648.0	81808.0	84622.0	86491.0	92006.0	93577.0	108204.0	173101.0	196813.0	2958030.0	24462144.0
P_1_27_EKRN220057196-1A_HKHYCDSX5_L1_2	41867.0	53123.0	53508.0	52961.0	53325.0	54471.0	57877.0	58823.0	60284.0	62235.0	63957.0	64081.0	66952.0	69959.0	75238.0	79077.0	82721.0	87334.0	87658.0	95865.0	168259.0	205438.0	3335420.0	24336262.0
P_1_28_1	43928.0	55398.0	55947.0	52943.0	49196.0	51103.0	49197.0	46429.0	44889.0	46516.0	47820.0	47913.0	49201.0	49685.0	50638.0	51494.0	52593.0	57373.0	59609.0	71316.0	132230.0	154865.0	2931023.0	25787395.0
P_1_28_2	37362.0	45415.0	46436.0	45729.0	44723.0	45129.0	46125.0	46543.0	48426.0	49479.0	49429.0	49952.0	52595.0	53880.0	56682.0	57701.0	60532.0	64382.0	67367.0	72695.0	137485.0	166163.0	3268222.0	25426249.0
P_1_29_1	48128.0	70747.0	71890.0	71005.0	69612.0	70708.0	69940.0	71660.0	72878.0	72421.0	73963.0	72928.0	73310.0	73635.0	75659.0	78958.0	79471.0	86862.0	87922.0	102087.0	160092.0	182080.0	2999726.0	26164797.0
P_1_29_2	45773.0	56949.0	57065.0	56239.0	55331.0	55996.0	58718.0	58966.0	60596.0	62157.0	62330.0	63184.0	65828.0	67982.0	73139.0	77059.0	80362.0	84436.0	84704.0	92572.0	155666.0	190262.0	3424343.0	25910822.0
P_1_2_EKRN220057171-1A_H23VJDSX5_L3_1	18574.0	23816.0	25159.0	22702.0	21933.0	23933.0	20931.0	19209.0	17930.0	19001.0	21450.0	21356.0	22759.0	23365.0	24116.0	25122.0	26485.0	29184.0	30603.0	41660.0	107438.0	122726.0	1791490.0	11563796.0
P_1_2_EKRN220057171-1A_H23VJDSX5_L3_2	15540.0	19932.0	19610.0	19910.0	20706.0	21235.0	22419.0	23369.0	25421.0	25907.0	27837.0	29436.0	31843.0	36202.0	38111.0	42158.0	42604.0	46347.0	55019.0	67109.0	141110.0	158815.0	1957891.0	11176207.0
P_1_30_EKRN220057199-1A_HKHYCDSX5_L1_1	46229.0	69267.0	70458.0	70244.0	69174.0	70653.0	70417.0	71389.0	73549.0	73315.0	75173.0	73592.0	75640.0	75020.0	80956.0	80110.0	80727.0	85383.0	87254.0	98464.0	139684.0	156288.0	2903978.0	24871751.0
P_1_30_EKRN220057199-1A_HKHYCDSX5_L1_2	39433.0	49487.0	49640.0	49681.0	49073.0	50049.0	52674.0	53767.0	55007.0	56697.0	57224.0	57674.0	60599.0	63702.0	68049.0	76315.0	76416.0	78205.0	78102.0	84397.0	130848.0	158220.0	3106775.0	24966681.0
P_1_31_EKRN220057200-1A_HKHYCDSX5_L1_1	43758.0	66199.0	66916.0	67403.0	66390.0	68929.0	67670.0	69767.0	71335.0	71261.0	72895.0	71523.0	73391.0	72402.0	75600.0	77830.0	79100.0	83944.0	87464.0	96665.0	119246.0	133188.0	2872732.0	24556278.0
P_1_31_EKRN220057200-1A_HKHYCDSX5_L1_2	44782.0	56500.0	56406.0	55978.0	55797.0	56559.0	59825.0	61233.0	61892.0	63728.0	64300.0	64562.0	67954.0	70841.0	75513.0	79371.0	82367.0	87353.0	86384.0	91328.0	118388.0	142525.0	3302586.0	24225714.0
P_1_32_EKRN220057201-1A_HKHYCDSX5_L1_1	44942.0	67808.0	70573.0	71296.0	71451.0	72759.0	72395.0	74857.0	77107.0	77199.0	79461.0	78738.0	79762.0	79821.0	82655.0	84718.0	85880.0	91064.0	94386.0	106548.0	135087.0	147150.0	2866023.0	24503266.0
P_1_32_EKRN220057201-1A_HKHYCDSX5_L1_2	49898.0	61867.0	62164.0	61984.0	61519.0	63242.0	67215.0	68165.0	69245.0	71668.0	72972.0	72682.0	76183.0	79637.0	85885.0	89211.0	92571.0	97204.0	96526.0	102875.0	136065.0	164476.0	3619626.0	23792066.0
P_1_33_EKRN220057202-1A_HKHYCDSX5_L2_1	54277.0	69678.0	71421.0	66831.0	60969.0	62534.0	61424.0	56995.0	56177.0	58375.0	60549.0	61311.0	63882.0	63763.0	66389.0	66154.0	67301.0	71512.0	73108.0	85411.0	147305.0	171884.0	3291894.0	27126685.0
P_1_33_EKRN220057202-1A_HKHYCDSX5_L2_2	37389.0	46966.0	47722.0	48769.0	48628.0	49561.0	52340.0	53650.0	56063.0	57838.0	59051.0	59570.0	63409.0	64884.0	69734.0	69666.0	73385.0	78574.0	81495.0	86526.0	153063.0	182629.0	3359077.0	27135840.0
P_1_34_EKRN220057203-1A_HKHYCDSX5_L2_1	45325.0	57039.0	57162.0	52287.0	48371.0	51039.0	48387.0	45607.0	43440.0	44933.0	46275.0	46538.0	48313.0	48254.0	50283.0	50333.0	51679.0	55924.0	58417.0	72500.0	146426.0	173503.0	3119498.0	26674395.0
P_1_34_EKRN220057203-1A_HKHYCDSX5_L2_2	41022.0	49280.0	50563.0	50553.0	47413.0	47818.0	49463.0	49781.0	51539.0	51861.0	52171.0	52200.0	55596.0	55986.0	59596.0	60741.0	63419.0	68849.0	71030.0	77775.0	156233.0	188081.0	3341615.0	26343343.0
P_1_35_EKRN220057204-1A_HKHYCDSX5_L2_1	48642.0	62259.0	62500.0	58301.0	52581.0	55139.0	52648.0	48932.0	47445.0	49097.0	51055.0	51578.0	53330.0	52571.0	55087.0	55339.0	56209.0	61249.0	63204.0	76620.0	142514.0	166098.0	3185347.0	26990997.0
P_1_35_EKRN220057204-1A_HKHYCDSX5_L2_2	37678.0	46575.0	48094.0	47759.0	45890.0	46563.0	48807.0	48713.0	51636.0	51774.0	53024.0	52949.0	56738.0	57163.0	61648.0	61367.0	64867.0	69645.0	72160.0	76631.0	147085.0	175586.0	3205290.0	26971100.0
P_1_36_EKRN220057205-1A_HKHYCDSX5_L2_1	54520.0	68762.0	70486.0	64265.0	58857.0	61089.0	58857.0	54837.0	53113.0	54686.0	56994.0	56729.0	59724.0	58877.0	61568.0	61804.0	62457.0	66737.0	68051.0	80353.0	147430.0	173318.0	3359037.0	28345243.0
P_1_36_EKRN220057205-1A_HKHYCDSX5_L2_2	35915.0	44490.0	45669.0	46328.0	45423.0	46593.0	48839.0	50105.0	51494.0	52554.0	53974.0	54691.0	57961.0	59629.0	62951.0	64078.0	67240.0	72870.0	75290.0	80857.0	151711.0	182321.0	3340673.0	28466138.0
P_1_37_EKRN220057206-1A_HKHYCDSX5_L1_1	44296.0	66869.0	67934.0	65934.0	64878.0	65924.0	65214.0	66147.0	68138.0	67572.0	68983.0	67581.0	69014.0	69015.0	70958.0	73592.0	74917.0	80721.0	83257.0	96451.0	159710.0	183909.0	2863436.0	24168607.0
P_1_37_EKRN220057206-1A_HKHYCDSX5_L1_2	38499.0	48503.0	48424.0	48080.0	46934.0	48002.0	50522.0	51653.0	52188.0	53838.0	54117.0	54280.0	56922.0	59978.0	64159.0	67602.0	70040.0	74633.0	74349.0	82833.0	151831.0	186596.0	3115846.0	24173228.0
P_1_38_1	51882.0	74771.0	75262.0	74292.0	73018.0	74683.0	73716.0	75336.0	77687.0	77101.0	77951.0	76115.0	77472.0	77933.0	79761.0	83686.0	85436.0	90136.0	92779.0	107197.0	181110.0	209185.0	3085701.0	26255514.0
P_1_38_2	38535.0	48529.0	48961.0	48158.0	48145.0	49259.0	51436.0	52234.0	53446.0	55138.0	55846.0	56586.0	59847.0	61632.0	65879.0	69271.0	71066.0	75564.0	76326.0	85568.0	163838.0	201231.0	3395324.0	26375905.0
P_1_39_EKRN220057208-1A_HKHYCDSX5_L2_1	46739.0	60071.0	61608.0	57132.0	52969.0	55038.0	53306.0	49647.0	48950.0	51359.0	52938.0	53263.0	55572.0	55167.0	56996.0	57066.0	58140.0	62216.0	63651.0	74774.0	138446.0	162363.0	3081473.0	25785665.0
P_1_39_EKRN220057208-1A_HKHYCDSX5_L2_2	40920.0	50077.0	51026.0	51444.0	49587.0	50424.0	52129.0	53846.0	55969.0	56903.0	58037.0	58000.0	62713.0	63667.0	67265.0	67302.0	70745.0	76924.0	79226.0	84300.0	151868.0	180845.0	3322166.0	25439166.0
P_1_3_EKRN220057172-1A_H223VDSX5_L3_1	21022.0	26577.0	27203.0	23732.0	21879.0	21855.0	20778.0	18767.0	17390.0	18961.0	20623.0	21181.0	21536.0	22986.0	24059.0	25275.0	26601.0	29364.0	32223.0	41453.0	110656.0	126173.0	2157193.0	14114983.0
P_1_3_EKRN220057172-1A_H223VDSX5_L3_2	13500.0	17083.0	17518.0	17803.0	18262.0	19844.0	20647.0	22648.0	23833.0	25225.0	28863.0	30565.0	34489.0	37478.0	41062.0	44900.0	50934.0	55225.0	56896.0	71925.0	146609.0	169626.0	2332943.0	13694592.0
P_1_40_EKRN220057209-1A_HKHYCDSX5_L2_1	42117.0	53347.0	53962.0	49057.0	45673.0	47374.0	45525.0	42021.0	40464.0	42215.0	42904.0	42704.0	43899.0	44314.0	45439.0	46249.0	46932.0	51137.0	53491.0	66913.0	144221.0	173187.0	3024860.0	25947513.0
P_1_40_EKRN220057209-1A_HKHYCDSX5_L2_2	36107.0	44060.0	44450.0	43553.0	42066.0	41850.0	43087.0	43156.0	44421.0	44445.0	44818.0	44724.0	47529.0	48741.0	50922.0	51739.0	53866.0	58589.0	60440.0	66129.0	147089.0	179801.0	3217277.0	25736659.0
P_1_41_EKRN220057210-1A_HKHYCDSX5_L2_1	47160.0	59754.0	60783.0	55692.0	52059.0	54214.0	52186.0	48734.0	47678.0	49416.0	50900.0	49956.0	51518.0	51326.0	53216.0	53929.0	55542.0	60209.0	62574.0	79875.0	174009.0	207903.0	3485286.0	29573619.0
P_1_41_EKRN220057210-1A_HKHYCDSX5_L2_2	49717.0	59436.0	59613.0	58871.0	56008.0	56437.0	58675.0	58822.0	60698.0	60511.0	60862.0	61160.0	65349.0	65975.0	69255.0	70062.0	73502.0	79857.0	82764.0	90647.0	190260.0	229653.0	4113915.0	28705489.0
P_1_42_EKRN220057211-1A_HKHYCDSX5_L1_1	43447.0	65547.0	65531.0	64937.0	62913.0	62519.0	62048.0	62963.0	64033.0	63110.0	64672.0	62676.0	62931.0	62655.0	64315.0	67520.0	69991.0	77063.0	79931.0	95200.0	162862.0	189196.0	2893918.0	24610277.0
P_1_42_EKRN220057211-1A_HKHYCDSX5_L1_2	32769.0	40868.0	40233.0	39220.0	38482.0	38508.0	40837.0	40725.0	41165.0	42118.0	41607.0	42439.0	44510.0	45954.0	49105.0	51400.0	53752.0	56998.0	57052.0	65367.0	142781.0	179310.0	3027462.0	24927593.0
P_1_43_1	45405.0	65066.0	66945.0	67069.0	66030.0	65546.0	64543.0	66608.0	67962.0	67569.0	67721.0	66730.0	66800.0	67684.0	68496.0	72544.0	74176.0	85184.0	91559.0	105942.0	170518.0	196917.0	3062661.0	26585567.0
P_1_43_2	52859.0	64321.0	63314.0	61723.0	60336.0	60265.0	61104.0	61451.0	62563.0	64010.0	63363.0	64095.0	66394.0	69020.0	72324.0	76198.0	78225.0	82568.0	83977.0	94326.0	171208.0	211827.0	4021898.0	25657873.0
P_1_44_1	49456.0	72805.0	72915.0	72612.0	69972.0	68589.0	68440.0	69302.0	71051.0	70321.0	71756.0	70091.0	69641.0	69570.0	71183.0	75087.0	77043.0	85339.0	88753.0	105786.0	181189.0	206955.0	3050790.0	25645351.0
P_1_44_2	35947.0	44117.0	44528.0	44146.0	42749.0	43322.0	44642.0	45594.0	46350.0	47449.0	46478.0	47595.0	50059.0	51552.0	54770.0	57010.0	59724.0	63543.0	64355.0	73996.0	159514.0	198631.0	3124478.0	26063448.0
P_1_45_EKRN220057214-1A_HKHYCDSX5_L1_1	47025.0	71053.0	71277.0	71115.0	69609.0	69397.0	68460.0	68980.0	70951.0	70290.0	72259.0	70901.0	70474.0	69975.0	72769.0	76129.0	78474.0	85792.0	90398.0	108261.0	172039.0	197021.0	3216536.0	27250526.0
P_1_45_EKRN220057214-1A_HKHYCDSX5_L1_2	43301.0	54042.0	53931.0	52783.0	51513.0	51610.0	54457.0	54385.0	54680.0	55649.0	55297.0	55316.0	58133.0	59513.0	63935.0	66913.0	69434.0	73237.0	72437.0	83014.0	159215.0	198121.0	3575976.0	27192819.0
P_1_46_EKRN220057215-1A_HKHYCDSX5_L1_1	47923.0	72977.0	73189.0	71688.0	69095.0	69577.0	68772.0	69279.0	71340.0	69739.0	71727.0	69290.0	69168.0	69342.0	71070.0	75049.0	77166.0	84019.0	86806.0	103259.0	181908.0	212801.0	3251368.0	27531378.0
P_1_46_EKRN220057215-1A_HKHYCDSX5_L1_2	38269.0	47674.0	47188.0	45753.0	45125.0	45308.0	47480.0	47752.0	47843.0	49372.0	48863.0	49122.0	51960.0	53788.0	57135.0	60332.0	63050.0	66127.0	66489.0	76813.0	164157.0	206315.0	3491928.0	27720087.0
P_1_47_EKRN220057216-1A_HKHYCDSX5_L1_1	46889.0	70493.0	70774.0	68986.0	67653.0	67686.0	66673.0	67631.0	69725.0	68465.0	70367.0	69025.0	69001.0	68066.0	70515.0	72395.0	75005.0	81056.0	83087.0	96938.0	170843.0	200556.0	3081767.0	26099857.0
P_1_47_EKRN220057216-1A_HKHYCDSX5_L1_2	33077.0	41549.0	41340.0	40588.0	39977.0	40214.0	42391.0	43300.0	43521.0	44361.0	44232.0	45244.0	47700.0	49778.0	52146.0	54453.0	57259.0	60515.0	60446.0	69666.0	151920.0	189279.0	3060538.0	26619959.0
P_1_48_EKRN220057217-1A_HKHYCDSX5_L1_1	47885.0	71578.0	71783.0	70344.0	68672.0	68716.0	67558.0	68126.0	70194.0	69396.0	70200.0	68751.0	68722.0	68403.0	69756.0	73226.0	74988.0	81294.0	83786.0	99461.0	149182.0	171571.0	3063173.0	26273845.0
P_1_48_EKRN220057217-1A_HKHYCDSX5_L1_2	31321.0	39385.0	38839.0	38718.0	37615.0	38458.0	40348.0	40447.0	41555.0	42545.0	42242.0	42129.0	44651.0	46377.0	49322.0	51699.0	53766.0	57080.0	57007.0	63660.0	124929.0	155842.0	3150006.0	26762669.0
P_1_49_EKRN220057218-1A_HKHYCDSX5_L2_1	51584.0	64842.0	65093.0	58918.0	54890.0	56036.0	53876.0	48983.0	47738.0	50275.0	50884.0	50628.0	50844.0	51482.0	53472.0	53937.0	55090.0	60789.0	64421.0	81941.0	147539.0	171412.0	3536172.0	29929163.0
P_1_49_EKRN220057218-1A_HKHYCDSX5_L2_2	40841.0	49006.0	50119.0	49531.0	46796.0	46466.0	48154.0	48069.0	49604.0	49623.0	49958.0	50347.0	53887.0	54076.0	56735.0	57232.0	60474.0	65112.0	67680.0	72948.0	145305.0	174328.0	3605037.0	29918681.0
P_1_4_EKRN220057173-1A_H22CWDSX5_L2_1	29026.0	37581.0	39315.0	36575.0	29766.0	28678.0	27873.0	26796.0	25231.0	26225.0	28828.0	29681.0	31058.0	32762.0	33336.0	35689.0	38901.0	42914.0	41942.0	58972.0	141682.0	167741.0	2735834.0	16642044.0
P_1_4_EKRN220057173-1A_H22CWDSX5_L2_2	30004.0	36572.0	38815.0	38630.0	39577.0	41760.0	42000.0	47840.0	52071.0	53055.0	56816.0	61813.0	67835.0	71170.0	77610.0	86512.0	94902.0	103842.0	128165.0	139252.0	232058.0	280046.0	3848432.0	14699673.0
P_1_50_EKRN220057219-1A_HKHYCDSX5_L1_1	42165.0	63160.0	63865.0	62714.0	60701.0	59529.0	59020.0	59936.0	60987.0	60605.0	61458.0	59794.0	59616.0	59468.0	60681.0	63697.0	65240.0	73714.0	77278.0	93432.0	134358.0	151706.0	2739629.0	23242759.0
P_1_50_EKRN220057219-1A_HKHYCDSX5_L1_2	32335.0	40675.0	39457.0	39359.0	37994.0	38022.0	39916.0	40275.0	40309.0	41124.0	40852.0	41055.0	43301.0	44416.0	47143.0	49357.0	51844.0	55228.0	55177.0	62217.0	114838.0	142483.0	3000382.0	23397753.0
P_1_51_EKRN220057220-1A_HKHYCDSX5_L1_1	39371.0	60055.0	59993.0	59297.0	58630.0	58601.0	57791.0	58907.0	59864.0	60132.0	62267.0	60216.0	59968.0	59820.0	61969.0	64777.0	66674.0	72384.0	74927.0	89469.0	158149.0	183996.0	2784315.0	23493249.0
P_1_51_EKRN220057220-1A_HKHYCDSX5_L1_2	38609.0	47825.0	46805.0	46279.0	45042.0	44627.0	46746.0	46950.0	47178.0	47882.0	47386.0	48292.0	50197.0	51918.0	55122.0	57209.0	60318.0	62982.0	63493.0	72571.0	151095.0	187196.0	3315380.0	23183719.0
P_1_52_1	45433.0	64753.0	65481.0	64719.0	63281.0	62681.0	61813.0	62642.0	64176.0	64167.0	65114.0	63037.0	63431.0	63650.0	64845.0	68599.0	70348.0	76041.0	78457.0	93951.0	181320.0	212424.0	3021704.0	26345882.0
P_1_52_2	38346.0	47440.0	46892.0	45447.0	44931.0	45174.0	46473.0	47117.0	47085.0	48343.0	47901.0	48736.0	51165.0	52669.0	55925.0	58591.0	60493.0	64033.0	65027.0	75572.0	169264.0	210123.0	3412450.0	26258752.0
P_1_53_EKRN220057222-1A_HKHYCDSX5_L2_1	42761.0	54732.0	54223.0	49823.0	45571.0	47817.0	45397.0	42294.0	40373.0	42221.0	43853.0	43356.0	43949.0	44114.0	46038.0	46232.0	47515.0	51751.0	54283.0	67801.0	129107.0	151934.0	2984873.0	25616721.0
P_1_53_EKRN220057222-1A_HKHYCDSX5_L2_2	34423.0	41632.0	42164.0	41861.0	39781.0	39849.0	41150.0	41324.0	42784.0	42862.0	42879.0	43318.0	46157.0	46389.0	49189.0	49016.0	51762.0	55654.0	58019.0	62322.0	129126.0	157565.0	3091492.0	25546021.0
P_1_54_EKRN220057223-1A_HKHYCDSX5_L2_1	52583.0	66986.0	66837.0	60792.0	54901.0	56883.0	54925.0	50864.0	48575.0	49687.0	51774.0	52390.0	53031.0	53170.0	55142.0	55433.0	56555.0	61486.0	63596.0	79627.0	153387.0	181490.0	3498356.0	30250958.0
P_1_54_EKRN220057223-1A_HKHYCDSX5_L2_2	41101.0	49482.0	50589.0	50476.0	48078.0	48028.0	50143.0	50003.0	52057.0	51707.0	52258.0	51952.0	55882.0	56223.0	59176.0	59989.0	62945.0	67622.0	70338.0	75990.0	155959.0	189945.0	3617960.0	30161525.0
P_1_55_1	46952.0	59693.0	59188.0	55544.0	51249.0	52242.0	50342.0	47544.0	45980.0	47295.0	48354.0	48302.0	49019.0	49544.0	50102.0	51030.0	52364.0	57471.0	60855.0	76959.0	138180.0	158189.0	2968906.0	25705330.0
P_1_55_2	37286.0	45949.0	46006.0	45749.0	43799.0	44112.0	44610.0	45311.0	47208.0	47313.0	47400.0	47650.0	50528.0	51085.0	53288.0	53915.0	56249.0	60628.0	63210.0	67836.0	135565.0	164066.0	3075819.0	25656052.0
P_1_56_EKRN220057225-1A_HKHYCDSX5_L2_1	54043.0	67633.0	68186.0	62328.0	56163.0	58133.0	55616.0	51042.0	48627.0	50972.0	53319.0	53173.0	54108.0	53919.0	56045.0	55512.0	56886.0	61968.0	64301.0	81439.0	177098.0	210449.0	3458766.0	29183179.0
P_1_56_EKRN220057225-1A_HKHYCDSX5_L2_2	36805.0	44283.0	45484.0	45227.0	43047.0	43865.0	44756.0	45874.0	46960.0	46990.0	47594.0	47983.0	51070.0	51662.0	54508.0	54998.0	57103.0	61939.0	64271.0	71439.0	174279.0	212436.0	3402533.0	29397799.0
P_1_57_EKRN220057226-1A_HKHYCDSX5_L2_1	56747.0	72645.0	72738.0	65880.0	60943.0	63914.0	61054.0	55832.0	53767.0	56402.0	59131.0	59143.0	59983.0	59859.0	61925.0	61818.0	62693.0	68014.0	70892.0	89261.0	175111.0	205960.0	3745403.0	31177718.0
P_1_57_EKRN220057226-1A_HKHYCDSX5_L2_2	44466.0	54138.0	55121.0	54879.0	52823.0	52966.0	54841.0	55289.0	56613.0	56599.0	57170.0	57522.0	60891.0	61433.0	64966.0	64956.0	68085.0	73204.0	75337.0	81512.0	174068.0	211554.0	3660195.0	31328205.0
P_1_58_EKRN220057227-1A_HKHYCDSX5_L2_1	60013.0	75743.0	75499.0	69081.0	63624.0	66973.0	63437.0	58476.0	55296.0	57816.0	59439.0	60110.0	62232.0	62006.0	64073.0	64088.0	65007.0	70193.0	72604.0	87148.0	188743.0	225885.0	4069719.0	34775007.0
P_1_58_EKRN220057227-1A_HKHYCDSX5_L2_2	40251.0	48756.0	49156.0	49565.0	47142.0	47958.0	50118.0	50717.0	52429.0	53287.0	54047.0	53947.0	58733.0	59748.0	63483.0	63656.0	67565.0	71869.0	75657.0	83770.0	190173.0	231241.0	4029793.0	34979151.0
P_1_59_EKRN220057228-1A_HKHYCDSX5_L2_1	54589.0	67830.0	67884.0	61564.0	56103.0	58500.0	55764.0	51086.0	48423.0	50317.0	51714.0	52298.0	55008.0	54037.0	54439.0	55280.0	56239.0	60881.0	62858.0	77614.0	177894.0	211360.0	3660749.0	31086532.0
P_1_59_EKRN220057228-1A_HKHYCDSX5_L2_2	34157.0	41535.0	42189.0	41899.0	40002.0	40539.0	42013.0	42745.0	44149.0	44634.0	44894.0	45530.0	49885.0	51408.0	52570.0	52690.0	55843.0	60211.0	62728.0	70204.0	175412.0	213375.0	3543629.0	31396722.0
P_1_5_EKRN220057174-1A_HLN7GDSX5_L4_1	54204.0	68548.0	71930.0	71321.0	66504.0	63800.0	63519.0	64012.0	63365.0	65318.0	66804.0	65947.0	67306.0	68749.0	68159.0	70981.0	72414.0	77797.0	82744.0	92173.0	182486.0	213302.0	3181438.0	29482688.0
P_1_5_EKRN220057174-1A_HLN7GDSX5_L4_2	46770.0	58646.0	57097.0	57641.0	58325.0	57261.0	58580.0	61423.0	61647.0	61594.0	61543.0	62948.0	66212.0	69536.0	69298.0	69245.0	68927.0	75565.0	75755.0	86300.0	179309.0	211784.0	4382717.0	28387386.0
P_1_60_EKRN220057229-1A_HKHYCDSX5_L2_1	57519.0	72898.0	72060.0	66642.0	61600.0	64522.0	61964.0	57103.0	53985.0	56132.0	57938.0	58297.0	60234.0	59873.0	61526.0	61842.0	63177.0	68999.0	70868.0	86985.0	175227.0	207660.0	3993418.0	34538632.0
P_1_60_EKRN220057229-1A_HKHYCDSX5_L2_2	45760.0	55941.0	55913.0	55334.0	53792.0	53197.0	55098.0	56209.0	57225.0	57520.0	58050.0	58349.0	62211.0	63156.0	67233.0	68193.0	71039.0	76915.0	79720.0	88032.0	182853.0	220641.0	4236622.0	34310098.0
P_1_61_EKRN220057230-1A_HKHYCDSX5_L2_1	56687.0	71098.0	71000.0	63894.0	58965.0	62638.0	58744.0	54518.0	51221.0	52476.0	54285.0	55200.0	57313.0	57524.0	58401.0	58750.0	58990.0	64200.0	66101.0	79667.0	161862.0	192471.0	3982271.0	34345234.0
P_1_61_EKRN220057230-1A_HKHYCDSX5_L2_2	46278.0	56477.0	56776.0	55880.0	53427.0	53071.0	54910.0	55531.0	56891.0	56742.0	57229.0	57613.0	62342.0	63336.0	66106.0	66621.0	70038.0	76412.0	79254.0	86320.0	173517.0	208106.0	4070865.0	34209768.0
P_1_62_EKRN220057231-1A_HKHYCDSX5_L2_1	51481.0	64332.0	64034.0	57745.0	53429.0	56295.0	53219.0	48918.0	46230.0	47466.0	49359.0	49417.0	50870.0	51061.0	52144.0	52546.0	53123.0	57875.0	59524.0	71041.0	146004.0	174135.0	3447313.0	29773401.0
P_1_62_EKRN220057231-1A_HKHYCDSX5_L2_2	34998.0	42221.0	42677.0	42321.0	40147.0	40704.0	42339.0	42977.0	43976.0	44505.0	45041.0	45530.0	48473.0	48806.0	52132.0	53012.0	55638.0	59863.0	62040.0	68794.0	147440.0	179313.0	3374369.0	29973646.0
P_1_63_EKRN220057232-1A_HKHYCDSX5_L2_1	46623.0	58184.0	58499.0	52438.0	49468.0	51757.0	48829.0	45026.0	43305.0	44389.0	48752.0	48009.0	48285.0	54202.0	48479.0	48749.0	49270.0	53269.0	55273.0	66272.0	156062.0	187454.0	3200953.0	27305970.0
P_1_63_EKRN220057232-1A_HKHYCDSX5_L2_2	33671.0	40623.0	41504.0	40908.0	38917.0	39289.0	40780.0	40446.0	42437.0	43061.0	42794.0	43105.0	46058.0	53400.0	55542.0	49851.0	52564.0	56084.0	58718.0	64913.0	158114.0	193315.0	3133287.0	27460136.0
P_1_64_EKRN220057233-1A_HKHYCDSX5_L2_1	53817.0	68213.0	67651.0	61176.0	56407.0	59183.0	55863.0	51434.0	49039.0	50019.0	51866.0	52607.0	53960.0	53399.0	55575.0	55590.0	56568.0	61018.0	63037.0	76264.0	154594.0	184926.0	3675934.0	31837737.0
P_1_64_EKRN220057233-1A_HKHYCDSX5_L2_2	39355.0	47210.0	48161.0	47787.0	45386.0	45123.0	46674.0	47815.0	48770.0	49058.0	49926.0	49591.0	52929.0	52611.0	56792.0	57346.0	60173.0	64743.0	67807.0	73671.0	156897.0	190844.0	3636152.0	31971056.0
P_1_65_EKRN220057234-1A_HKHYCDSX5_L2_1	51424.0	64655.0	65579.0	58926.0	54570.0	57068.0	54201.0	50605.0	48643.0	49708.0	50930.0	52433.0	53839.0	53482.0	55839.0	55813.0	56608.0	61384.0	63439.0	74420.0	152789.0	183408.0	3453368.0	29128168.0
P_1_65_EKRN220057234-1A_HKHYCDSX5_L2_2	36083.0	43895.0	44036.0	44094.0	41967.0	42458.0	44199.0	44806.0	46962.0	47099.0	47212.0	47512.0	50770.0	51360.0	54668.0	55943.0	59275.0	64084.0	66857.0	72558.0	155846.0	188652.0	3504205.0	29196758.0
P_1_66_1	48983.0	61008.0	61108.0	57243.0	53641.0	54856.0	52818.0	50244.0	48414.0	49163.0	50307.0	50273.0	50828.0	51662.0	51800.0	53252.0	53492.0	57810.0	59378.0	68778.0	118342.0	137071.0	3002741.0	26748541.0
P_1_66_2	56425.0	67339.0	67557.0	65751.0	63405.0	61791.0	62659.0	62409.0	63307.0	62869.0	63085.0	62912.0	65354.0	65845.0	68252.0	70140.0	72361.0	78346.0	80860.0	87504.0	138739.0	160600.0	3504371.0	25939872.0
P_1_67_EKRN220057236-1A_HKHYCDSX5_L2_1	49064.0	61686.0	61763.0	56322.0	52228.0	55102.0	52943.0	48289.0	46323.0	47951.0	49121.0	50105.0	51442.0	51153.0	53597.0	54313.0	55211.0	59836.0	61518.0	75229.0	165189.0	197619.0	3442786.0	29262531.0
P_1_67_EKRN220057236-1A_HKHYCDSX5_L2_2	38600.0	47209.0	47304.0	46411.0	44446.0	45142.0	46777.0	47511.0	48606.0	49322.0	50062.0	49907.0	53179.0	53906.0	57920.0	58350.0	62048.0	67276.0	69550.0	76661.0	170684.0	205907.0	3669231.0	29055312.0
P_1_68_EKRN220057237-1A_HKHYCDSX5_L2_1	53472.0	67484.0	67926.0	61607.0	57087.0	60636.0	57214.0	52631.0	50222.0	51597.0	53554.0	53896.0	55543.0	56227.0	57761.0	58115.0	59147.0	63853.0	65549.0	78408.0	173301.0	206806.0	3701351.0	32015569.0
P_1_68_EKRN220057237-1A_HKHYCDSX5_L2_2	45736.0	54565.0	54852.0	54470.0	52461.0	52158.0	54550.0	54310.0	56434.0	56848.0	56669.0	57000.0	60179.0	60980.0	65303.0	66254.0	69278.0	75461.0	77816.0	85495.0	185427.0	223423.0	3872115.0	31787172.0
P_1_69_EKRN220057238-1A_HKHYCDSX5_L2_1	57784.0	72470.0	72937.0	65890.0	60978.0	64502.0	61448.0	56996.0	54053.0	55518.0	57387.0	58346.0	60056.0	60117.0	61838.0	62286.0	63117.0	68772.0	70885.0	86398.0	181767.0	212738.0	4043463.0	35044501.0
P_1_69_EKRN220057238-1A_HKHYCDSX5_L2_2	45653.0	55124.0	55215.0	54976.0	52700.0	53122.0	55223.0	56098.0	57765.0	58575.0	59309.0	59493.0	63610.0	64039.0	68676.0	69404.0	72850.0	79041.0	81604.0	89931.0	189787.0	228095.0	4363724.0	34720233.0
P_1_6_EKRN220057175-1A_H22CWDSX5_L2_1	30955.0	40232.0	41099.0	37398.0	31154.0	29892.0	29174.0	27647.0	25542.0	27408.0	29486.0	30674.0	31853.0	33551.0	33825.0	36397.0	39753.0	43259.0	42086.0	55922.0	128002.0	149625.0	2690220.0	16427756.0
P_1_6_EKRN220057175-1A_H22CWDSX5_L2_2	24064.0	29552.0	30508.0	31236.0	32069.0	33980.0	33825.0	38902.0	42014.0	43120.0	46466.0	50338.0	54969.0	58330.0	63193.0	70173.0	77265.0	85233.0	104373.0	114688.0	196130.0	235425.0	3623981.0	14973076.0
P_1_70_EKRN220057239-1A_HKHYCDSX5_L2_1	45994.0	58448.0	59075.0	54206.0	50464.0	53324.0	51744.0	47763.0	45547.0	47109.0	48429.0	49375.0	50853.0	50708.0	52602.0	53219.0	53724.0	58240.0	60085.0	71793.0	131017.0	154273.0	3300355.0	28294207.0
P_1_70_EKRN220057239-1A_HKHYCDSX5_L2_2	43640.0	52756.0	53893.0	53493.0	51029.0	51655.0	53408.0	54248.0	55830.0	56507.0	57131.0	57593.0	60684.0	61646.0	65921.0	66475.0	70437.0	75348.0	78608.0	84172.0	145719.0	174499.0	3650273.0	27767589.0
P_1_71_EKRN220057240-1A_HKHYCDSX5_L2_1	64557.0	82490.0	83013.0	75790.0	70519.0	75019.0	72168.0	67092.0	63984.0	65844.0	68566.0	69083.0	71211.0	72305.0	72868.0	73854.0	74083.0	80342.0	82178.0	98400.0	218092.0	260924.0	4687448.0	40943190.0
P_1_71_EKRN220057240-1A_HKHYCDSX5_L2_2	58840.0	71585.0	72345.0	70803.0	68206.0	68357.0	70839.0	71650.0	74320.0	74927.0	74960.0	75381.0	80217.0	82887.0	88325.0	88784.0	93009.0	100572.0	104428.0	114815.0	238719.0	288754.0	5271284.0	40189013.0
P_1_72_EKRN220057241-1A_HKHYCDSX5_L2_1	56445.0	71176.0	72345.0	65837.0	61611.0	65094.0	62364.0	58435.0	55339.0	56740.0	59595.0	61323.0	62278.0	62405.0	64470.0	65722.0	66628.0	72791.0	74977.0	95015.0	248188.0	296708.0	4001624.0	33362275.0
P_1_72_EKRN220057241-1A_HKHYCDSX5_L2_2	51853.0	63484.0	63822.0	63387.0	60484.0	61270.0	63863.0	65317.0	67790.0	67857.0	69667.0	70003.0	74409.0	75564.0	80419.0	81694.0	85557.0	92607.0	96172.0	109489.0	264723.0	318339.0	4380088.0	32791527.0
P_1_73_EKRN220057242-1A_HKHYCDSX5_L2_1	52710.0	66254.0	66171.0	60579.0	56333.0	59989.0	56493.0	52588.0	49944.0	51154.0	53392.0	53783.0	55415.0	55116.0	56906.0	57911.0	57595.0	63461.0	64897.0	78062.0	171909.0	205934.0	3567847.0	30115914.0
P_1_73_EKRN220057242-1A_HKHYCDSX5_L2_2	40676.0	48856.0	49674.0	48688.0	46314.0	46826.0	49056.0	49575.0	51167.0	51577.0	51781.0	52367.0	55278.0	56438.0	60026.0	61865.0	64796.0	69723.0	72784.0	80152.0	178760.0	218601.0	3721572.0	30003805.0
P_1_74_EKRN220057243-1A_HKHYCDSX5_L2_1	53893.0	69160.0	69075.0	63308.0	58854.0	62330.0	59362.0	55916.0	54146.0	55686.0	57376.0	58866.0	60579.0	60145.0	62719.0	62915.0	64249.0	69461.0	71146.0	88383.0	214192.0	259966.0	3661635.0	30602851.0
P_1_74_EKRN220057243-1A_HKHYCDSX5_L2_2	41598.0	50730.0	51126.0	50615.0	49550.0	49372.0	51464.0	52195.0	54026.0	55337.0	56095.0	56735.0	60691.0	62146.0	65730.0	67731.0	70396.0	76702.0	79777.0	89950.0	220458.0	268142.0	3833398.0	30482249.0
P_1_75_EKRN220057244-1A_HKHYCDSX5_L2_1	50651.0	63840.0	64208.0	58828.0	54631.0	57342.0	54921.0	50679.0	48469.0	49763.0	52344.0	52564.0	54304.0	53606.0	55478.0	56269.0	56806.0	61743.0	63301.0	74379.0	143814.0	171955.0	3498560.0	29816474.0
P_1_75_EKRN220057244-1A_HKHYCDSX5_L2_2	40933.0	48964.0	50251.0	49604.0	47443.0	47810.0	49854.0	50156.0	52132.0	52165.0	52655.0	53186.0	56377.0	56992.0	61262.0	61400.0	65571.0	71552.0	73360.0	79192.0	152394.0	185419.0	3688914.0	29617343.0
P_1_76_EKRN220057245-1A_HKHYCDSX5_L2_1	51782.0	65527.0	65943.0	59568.0	55469.0	57968.0	54560.0	50233.0	48989.0	50014.0	51771.0	52087.0	53805.0	53470.0	55497.0	55667.0	56409.0	61141.0	62275.0	74926.0	166483.0	201710.0	3433044.0	28932566.0
P_1_76_EKRN220057245-1A_HKHYCDSX5_L2_2	33590.0	41569.0	42410.0	42166.0	40135.0	40893.0	42674.0	43341.0	45577.0	45828.0	46781.0	46836.0	49788.0	50614.0	54559.0	55271.0	58465.0	63029.0	66125.0	73697.0	168343.0	206351.0	3393609.0	29119253.0
P_1_77_EKRN220057246-1A_HKHYCDSX5_L2_1	44407.0	55966.0	56876.0	51769.0	49018.0	51116.0	49137.0	45329.0	43394.0	44762.0	46691.0	47764.0	49578.0	49471.0	51277.0	51984.0	52794.0	57110.0	58543.0	70713.0	167014.0	198651.0	3109887.0	26128291.0
P_1_77_EKRN220057246-1A_HKHYCDSX5_L2_2	35762.0	43095.0	43993.0	43724.0	41840.0	42751.0	43979.0	44512.0	46692.0	47167.0	47915.0	48294.0	51404.0	51780.0	55695.0	56599.0	60052.0	65139.0	67539.0	75639.0	176487.0	212386.0	3373632.0	25855466.0
P_1_78_EKRN220057247-1A_HKHYCDSX5_L2_1	47640.0	60847.0	61170.0	55815.0	52163.0	54669.0	52365.0	48737.0	47231.0	48346.0	50816.0	51277.0	53025.0	52952.0	55159.0	55284.0	56562.0	60776.0	61565.0	72784.0	155016.0	185838.0	3145857.0	26126108.0
P_1_78_EKRN220057247-1A_HKHYCDSX5_L2_2	34455.0	41670.0	42398.0	42679.0	40891.0	41696.0	43674.0	43761.0	46173.0	46917.0	47798.0	48183.0	51517.0	52388.0	56123.0	56713.0	59825.0	64851.0	67870.0	73777.0	158925.0	192118.0	3108756.0	26248844.0
P_1_79_EKRN220057248-1A_HKHYCDSX5_L2_1	54351.0	68685.0	68640.0	62543.0	58392.0	60755.0	58146.0	54308.0	52083.0	53537.0	57300.0	57138.0	58872.0	59540.0	60489.0	60804.0	61343.0	66755.0	68037.0	81501.0	194884.0	233820.0	3626685.0	30838214.0
P_1_79_EKRN220057248-1A_HKHYCDSX5_L2_2	39443.0	47994.0	48385.0	48491.0	46519.0	47238.0	48982.0	49704.0	51324.0	52075.0	53399.0	53416.0	57708.0	59535.0	63127.0	62200.0	65973.0	71525.0	74013.0	82458.0	199121.0	242324.0	3736169.0	30815699.0
P_1_7_EKRN220057176-1A_HLTJ3DSX5_L4_1	55309.0	66928.0	66592.0	67685.0	69696.0	66419.0	65462.0	66976.0	65918.0	66318.0	66939.0	66188.0	67010.0	66098.0	64650.0	63529.0	65903.0	69908.0	74775.0	83865.0	167574.0	197289.0	2842521.0	26869258.0
P_1_7_EKRN220057176-1A_HLTJ3DSX5_L4_2	43136.0	54390.0	54010.0	52597.0	53812.0	52039.0	52373.0	54747.0	53474.0	54281.0	57365.0	57830.0	59259.0	60806.0	63539.0	60178.0	65506.0	66719.0	67347.0	80268.0	168846.0	196365.0	4405066.0	25488857.0
P_1_80_EKRN220057249-1A_HKHYCDSX5_L2_1	46408.0	58955.0	59689.0	55125.0	51464.0	54652.0	52680.0	49427.0	47811.0	49080.0	50829.0	51135.0	53095.0	53364.0	55006.0	55792.0	56689.0	62018.0	64248.0	77892.0	164496.0	194394.0	3462473.0	28971822.0
P_1_80_EKRN220057249-1A_HKHYCDSX5_L2_2	42482.0	51047.0	51863.0	51281.0	49868.0	49813.0	52743.0	53362.0	55018.0	55671.0	57014.0	57514.0	60987.0	62164.0	66350.0	67457.0	70111.0	76093.0	79082.0	86958.0	177556.0	213016.0	3749042.0	28562052.0
P_1_81_EKRN220057250-1A_HKHYCDSX5_L2_1	57464.0	73268.0	74260.0	68334.0	62979.0	66399.0	64137.0	60446.0	57976.0	59071.0	61273.0	61970.0	63903.0	63979.0	66349.0	67081.0	68264.0	73148.0	75004.0	89666.0	197506.0	235520.0	3809437.0	32466427.0
P_1_81_EKRN220057250-1A_HKHYCDSX5_L2_2	41473.0	50509.0	51184.0	51158.0	49731.0	50902.0	53466.0	54605.0	56091.0	56967.0	58836.0	59676.0	63021.0	64658.0	69117.0	70188.0	73308.0	78873.0	82550.0	91218.0	200906.0	241848.0	3958598.0	32414978.0
P_1_82_EKRN220057251-1A_HKHYCDSX5_L2_1	54422.0	68316.0	68621.0	62473.0	58021.0	61230.0	58286.0	53692.0	51231.0	52682.0	54221.0	54925.0	56416.0	56324.0	58283.0	58989.0	59266.0	64427.0	66424.0	78209.0	159366.0	187723.0	3621062.0	30598439.0
P_1_82_EKRN220057251-1A_HKHYCDSX5_L2_2	39812.0	48144.0	48394.0	48785.0	46665.0	47512.0	49570.0	50335.0	51882.0	52694.0	53516.0	53997.0	57304.0	58281.0	62287.0	63047.0	66462.0	71637.0	74867.0	81500.0	165361.0	199213.0	3628572.0	30643211.0
P_1_83_EKRN220057252-1A_HKHYCDSX5_L2_1	49679.0	63082.0	63224.0	58233.0	53652.0	57123.0	54551.0	50404.0	48147.0	48830.0	51035.0	51438.0	52826.0	52726.0	54618.0	55053.0	56267.0	61091.0	63078.0	74533.0	151043.0	181456.0	3524026.0	30212121.0
P_1_83_EKRN220057252-1A_HKHYCDSX5_L2_2	40736.0	48959.0	49778.0	49440.0	47192.0	47245.0	49389.0	49952.0	51510.0	51964.0	52116.0	52843.0	55722.0	56490.0	60263.0	61292.0	64557.0	69266.0	72616.0	78370.0	157391.0	188848.0	3703908.0	30028389.0
P_1_84_EKRN220057253-1A_HKHYCDSX5_L2_1	54650.0	68771.0	68824.0	62765.0	58109.0	61913.0	58388.0	54049.0	52054.0	52702.0	55093.0	55089.0	55842.0	55764.0	58502.0	58774.0	59181.0	64559.0	65561.0	79262.0	162541.0	192911.0	3760633.0	32646368.0
P_1_84_EKRN220057253-1A_HKHYCDSX5_L2_2	40087.0	49172.0	49752.0	48665.0	47012.0	47064.0	49583.0	49713.0	51410.0	51789.0	52442.0	53236.0	56315.0	57152.0	61124.0	62195.0	65049.0	70768.0	73200.0	80935.0	168033.0	204004.0	3980427.0	32493178.0
P_1_85_EKRN220057254-1A_HKHYCDSX5_L2_1	53998.0	67934.0	67270.0	60909.0	56517.0	58822.0	55680.0	52092.0	48690.0	49813.0	51471.0	52257.0	53839.0	53102.0	55379.0	56108.0	55952.0	60151.0	62012.0	74958.0	171694.0	206846.0	3588273.0	30919269.0
P_1_85_EKRN220057254-1A_HKHYCDSX5_L2_2	31113.0	37919.0	38361.0	38548.0	37032.0	37207.0	38946.0	40016.0	41304.0	41213.0	42170.0	42016.0	45040.0	45652.0	49186.0	49493.0	52103.0	56947.0	58733.0	66413.0	166469.0	204209.0	3287689.0	31485257.0
P_1_86_EKRN220057255-1A_HKHYCDSX5_L2_1	49715.0	62314.0	63570.0	56685.0	53280.0	56300.0	53493.0	49772.0	47420.0	48523.0	50439.0	50900.0	52261.0	51906.0	54076.0	54307.0	55064.0	59665.0	60961.0	74171.0	168584.0	203557.0	3511686.0	30073960.0
P_1_86_EKRN220057255-1A_HKHYCDSX5_L2_2	39534.0	47869.0	48441.0	47710.0	45632.0	45551.0	47589.0	47412.0	49599.0	49042.0	49893.0	50473.0	53311.0	53802.0	57287.0	58445.0	61931.0	66420.0	68770.0	76489.0	173399.0	212382.0	3647151.0	29964477.0
P_1_87_EKRN220057256-1A_HKHYCDSX5_L2_1	39804.0	51162.0	51712.0	46626.0	42469.0	44372.0	43267.0	39822.0	37738.0	40044.0	41577.0	42205.0	44666.0	45150.0	44551.0	45731.0	46535.0	50284.0	52697.0	65137.0	169914.0	202630.0	2924816.0	24899321.0
P_1_87_EKRN220057256-1A_HKHYCDSX5_L2_2	29298.0	34981.0	36105.0	36343.0	34465.0	34905.0	36638.0	36597.0	38823.0	39032.0	39236.0	40101.0	44838.0	47094.0	47872.0	47267.0	49980.0	54761.0	57049.0	64842.0	172621.0	208170.0	2921697.0	24959515.0
P_1_88_EKRN220057257-1A_HKHYCDSX5_L2_1	52181.0	65557.0	66050.0	59492.0	55296.0	57848.0	54975.0	51259.0	50198.0	51711.0	52188.0	53334.0	55129.0	54937.0	57190.0	57281.0	58677.0	63718.0	65733.0	78047.0	174494.0	209275.0	3448247.0	29557152.0
P_1_88_EKRN220057257-1A_HKHYCDSX5_L2_2	34493.0	42398.0	43222.0	42939.0	41088.0	41532.0	43554.0	44207.0	45852.0	47044.0	47056.0	47909.0	51875.0	53741.0	56656.0	57392.0	60235.0	65855.0	68287.0	75274.0	174245.0	210723.0	3371823.0	29782569.0
P_1_89_EKRN220057258-1A_HKHYCDSX5_L2_1	59104.0	74914.0	76034.0	68047.0	62817.0	65968.0	63313.0	58653.0	57198.0	59695.0	61800.0	62339.0	63682.0	63164.0	65469.0	66119.0	67131.0	72313.0	73912.0	88636.0	211755.0	254162.0	3823258.0	31361064.0
P_1_89_EKRN220057258-1A_HKHYCDSX5_L2_2	38344.0	46689.0	47635.0	48483.0	46821.0	47585.0	50037.0	51205.0	53228.0	54189.0	54990.0	56357.0	60717.0	63458.0	65695.0	66231.0	69861.0	74822.0	78364.0	87691.0	215187.0	259358.0	3655947.0	31687653.0
P_1_8_EKRN220057177-1A_HLTJ3DSX5_L3_1	71126.0	86020.0	84179.0	83481.0	83311.0	81400.0	81841.0	82718.0	83497.0	82114.0	81956.0	83491.0	83311.0	81153.0	81778.0	80087.0	83151.0	86686.0	86908.0	101492.0	221363.0	259971.0	2997943.0	23984090.0
P_1_8_EKRN220057177-1A_HLTJ3DSX5_L3_2	40662.0	51081.0	50673.0	49357.0	52196.0	49665.0	53387.0	54591.0	54032.0	54576.0	59658.0	59215.0	62193.0	63340.0	67568.0	62022.0	70011.0	70563.0	73420.0	87855.0	217381.0	253989.0	4137971.0	23337661.0
P_1_90_EKRN220057259-1A_HKHYCDSX5_L2_1	47139.0	60355.0	61523.0	56550.0	51833.0	54959.0	53430.0	50478.0	49127.0	51152.0	53272.0	53275.0	55105.0	54540.0	56767.0	57685.0	58068.0	62592.0	64286.0	77816.0	193142.0	232501.0	3213392.0	26841572.0
P_1_90_EKRN220057259-1A_HKHYCDSX5_L2_2	39055.0	47888.0	48655.0	48533.0	46199.0	47014.0	49167.0	49853.0	51668.0	53116.0	53008.0	53629.0	58486.0	59951.0	61944.0	63296.0	66143.0	71490.0	73870.0	83618.0	201909.0	245373.0	3513550.0	26523144.0
P_1_9_1	52851.0	65191.0	64282.0	65903.0	67519.0	65027.0	64569.0	66462.0	65520.0	65965.0	66705.0	66246.0	66591.0	66769.0	65036.0	65201.0	66922.0	71758.0	75488.0	84502.0	176574.0	203793.0	2776403.0	26260668.0
P_1_9_2	46730.0	59108.0	58805.0	57119.0	58312.0	56816.0	57624.0	59452.0	58910.0	60522.0	62361.0	63448.0	65228.0	66570.0	69756.0	67950.0	73574.0	75002.0	76860.0	90765.0	183834.0	213122.0	4239733.0	24834344.0
