"","ID","Description","GeneRatio","BgRatio","pvalue","p.adjust","qvalue","geneID","Count"
"GO:0016310","GO:0016310","phosphorylation","2/2","353/5486",0.00412938079560104,0.0409611471447499,0.0258701981966842,"Me1_v2_0226090/Me1_v2_0208210",2
"GO:0046835","GO:0046835","carbohydrate phosphorylation","1/2","15/5486",0.00546148628596665,0.0409611471447499,0.0258701981966842,"Me1_v2_0208210",1
"GO:0006972","GO:0006972","hyperosmotic response","1/2","30/5486",0.0109080177902081,0.0545400889510406,0.0344463719690783,"Me1_v2_0226090",1
"GO:0010501","GO:0010501","RNA secondary structure unwinding","1/2","41/5486",0.0148926362987114,0.0558473861201678,0.0352720333390533,"Me1_v2_0226090",1
"GO:0005996","GO:0005996","monosaccharide metabolic process","1/2","53/5486",0.0192303205873173,0.057690961761952,0.0364363969022855,"Me1_v2_0208210",1
"GO:0046777","GO:0046777","protein autophosphorylation","1/2","91/5486",0.0329031784228419,0.0822579460571046,0.0519523869834345,"Me1_v2_0226090",1
"GO:0044262","GO:0044262","cellular carbohydrate metabolic process","1/2","156/5486",0.0560684676433358,0.11043782283635,0.0697502038966424,"Me1_v2_0208210",1
"GO:0032787","GO:0032787","monocarboxylic acid metabolic process","1/2","164/5486",0.0589001721793869,0.11043782283635,0.0697502038966424,"Me1_v2_0208210",1
"GO:0009651","GO:0009651","response to salt stress","1/2","198/5486",0.0708874599502637,0.117904496105276,0.0744659975401744,"Me1_v2_0226090",1
"GO:0006970","GO:0006970","response to osmotic stress","1/2","220/5486",0.0786029974035174,0.117904496105276,0.0744659975401744,"Me1_v2_0226090",1
"GO:0006468","GO:0006468","protein phosphorylation","1/2","291/5486",0.103283704505477,0.139169198732765,0.0878963360417463,"Me1_v2_0226090",1
"GO:0005975","GO:0005975","carbohydrate metabolic process","1/2","330/5486",0.116698143712794,0.139169198732765,0.0878963360417463,"Me1_v2_0208210",1
"GO:0019752","GO:0019752","carboxylic acid metabolic process","1/2","385/5486",0.135444128769311,0.139169198732765,0.0878963360417463,"Me1_v2_0208210",1
"GO:0043436","GO:0043436","oxoacid metabolic process","1/2","395/5486",0.138830888337297,0.139169198732765,0.0878963360417463,"Me1_v2_0208210",1
"GO:0006082","GO:0006082","organic acid metabolic process","1/2","396/5486",0.139169198732765,0.139169198732765,0.0878963360417463,"Me1_v2_0208210",1
