Sample	total_reads	pseudoaligned_reads	not_pseudoaligned_reads	percent_aligned	fragment_length
P_1_10_EKRN220057179-1A_HLTJ3DSX5_L4_1	28866802.0	26468735.0	2398067.0	91.69264749174502	229.004
P_1_11_1	29954393.0	27594028.0	2360365.0	92.1201374369362	219.564
P_1_12_1	30234885.0	27649450.0	2585435.0	91.44883468218913	226.999
P_1_13_1	30804542.0	28020794.0	2783748.0	90.96318977896182	229.456
P_1_14_EKRN220057183-1A_HLTJ3DSX5_L4_1	28646254.0	26480667.0	2165587.0	92.4402436702544	222.16
P_1_15_EKRN220057184-1A_HKHYCDSX5_L1_1	29578601.0	27483488.0	2095113.0	92.91679481392646	227.088
P_1_16_EKRN220057185-1A_HKHYCDSX5_L1_1	30594836.0	28522186.0	2072650.0	93.22549073314202	229.156
P_1_17_EKRN220057186-1A_HKHYCDSX5_L1_1	29828832.0	27716188.0	2112644.0	92.91744309666566	223.143
P_1_18_EKRN220057187-1A_HKHYCDSX5_L1_1	29894942.0	27860729.0	2034213.0	93.19546095791054	246.815
P_1_19_EKRN220057188-1A_HKHYCDSX5_L1_1	30389259.0	28080600.0	2308659.0	92.40304279877309	249.081
P_1_1_EKRN220057170-1A_H23VJDSX5_L3_1	22277549.0	21194296.0	1083253.0	95.1374677708037	233.514
P_1_20_EKRN220057189-1A_HKHYCDSX5_L1_1	27991991.0	25744587.0	2247404.0	91.97126063665854	253.161
P_1_21_EKRN220057190-1A_HKHYCDSX5_L2_1	30027246.0	28271922.0	1755324.0	94.15422912910495	242.339
P_1_22_EKRN220057191-1A_HKHYCDSX5_L1_1	27690986.0	25188085.0	2502901.0	90.96131499253946	230.788
P_1_23_EKRN220057192-1A_HKHYCDSX5_L1_1	29422415.0	26494333.0	2928082.0	90.04812487350206	230.172
P_1_24_EKRN220057193-1A_HKHYCDSX5_L1_1	30082927.0	27006218.0	3076709.0	89.7725743243003	229.991
P_1_25_1	31156402.0	28667156.0	2489246.0	92.01048311034118	233.511
P_1_26_1	30785599.0	28171011.0	2614588.0	91.50710694308725	232.909
P_1_27_EKRN220057196-1A_HKHYCDSX5_L1_1	29366695.0	27094745.0	2271950.0	92.2635148422388	232.497
P_1_28_1	30038701.0	27948212.0	2090489.0	93.04068108670877	234.674
P_1_29_1	31000479.0	28685426.0	2315053.0	92.53220248629061	236.341
P_1_2_EKRN220057171-1A_H23VJDSX5_L3_1	14064738.0	13446890.0	617848.0	95.60711333549192	232.339
P_1_30_EKRN220057199-1A_HKHYCDSX5_L1_1	29568715.0	27149950.0	2418765.0	91.81985081191387	244.112
P_1_31_EKRN220057200-1A_HKHYCDSX5_L1_1	29131886.0	26799622.0	2332264.0	91.99411943325605	256.258
P_1_32_EKRN220057201-1A_HKHYCDSX5_L1_1	29214946.0	26342716.0	2872230.0	90.1686280713988	252.096
P_1_33_EKRN220057202-1A_HKHYCDSX5_L2_1	32035829.0	29477375.0	2558454.0	92.01377307888615	235.678
P_1_34_EKRN220057203-1A_HKHYCDSX5_L2_1	31135928.0	28946600.0	2189328.0	92.96848322619451	232.299
P_1_35_EKRN220057204-1A_HKHYCDSX5_L2_1	31598742.0	29225744.0	2372998.0	92.49021369268435	237.532
P_1_36_EKRN220057205-1A_HKHYCDSX5_L2_1	33257794.0	30785852.0	2471942.0	92.56733023242612	235.423
P_1_37_EKRN220057206-1A_HKHYCDSX5_L1_1	28773057.0	26615792.0	2157265.0	92.50248244390576	233.688
P_1_38_1	31307724.0	29067195.0	2240529.0	92.84352640901012	233.125
P_1_39_EKRN220057208-1A_HKHYCDSX5_L2_1	30294549.0	28095770.0	2198779.0	92.74199790860065	236.451
P_1_3_EKRN220057172-1A_H223VDSX5_L3_1	16992470.0	16223271.0	769199.0	95.47329493593338	236.589
P_1_40_EKRN220057209-1A_HKHYCDSX5_L2_1	30235518.0	28387206.0	1848312.0	93.88695110168113	231.7
P_1_41_EKRN220057210-1A_HKHYCDSX5_L2_1	34537538.0	32145784.0	2391754.0	93.07491460450944	229.976
P_1_42_EKRN220057211-1A_HKHYCDSX5_L1_1	29180255.0	27018464.0	2161791.0	92.5915966121612	230.137
P_1_43_1	31425242.0	28710871.0	2714371.0	91.36244996935903	231.619
P_1_44_1	30553997.0	27949161.0	2604836.0	91.47464732682928	230.472
P_1_45_EKRN220057214-1A_HKHYCDSX5_L1_1	32309711.0	29797651.0	2512060.0	92.22506199451924	232.832
P_1_46_EKRN220057215-1A_HKHYCDSX5_L1_1	32637930.0	30328267.0	2309663.0	92.9233778000014	230.514
P_1_47_EKRN220057216-1A_HKHYCDSX5_L1_1	30973453.0	28916104.0	2057349.0	93.35770215868409	230.157
P_1_48_EKRN220057217-1A_HKHYCDSX5_L1_1	31090610.0	28801648.0	2288962.0	92.63777069668302	239.867
P_1_49_EKRN220057218-1A_HKHYCDSX5_L2_1	34910009.0	32232852.0	2677157.0	92.33126236088911	237.332
P_1_4_EKRN220057173-1A_H22CWDSX5_L2_1	20368450.0	19326410.0	1042040.0	94.8840486144012	232.556
P_1_50_EKRN220057219-1A_HKHYCDSX5_L1_1	27535512.0	25264241.0	2271271.0	91.75148441038613	240.042
P_1_51_EKRN220057220-1A_HKHYCDSX5_L1_1	27864821.0	25970849.0	1893972.0	93.20299958144356	234.159
P_1_52_1	31087949.0	29145126.0	1942823.0	93.75055909928314	229.664
P_1_53_EKRN220057222-1A_HKHYCDSX5_L2_1	29836739.0	27858123.0	1978616.0	93.36852462328406	235.233
P_1_54_EKRN220057223-1A_HKHYCDSX5_L2_1	35229428.0	32977282.0	2252146.0	93.60720247856423	234.437
P_1_55_1	30030634.0	27628409.0	2402225.0	92.00075163248302	232.92
P_1_56_EKRN220057225-1A_HKHYCDSX5_L2_1	34192905.0	31760040.0	2432865.0	92.88488357453103	227.96
P_1_57_EKRN220057226-1A_HKHYCDSX5_L2_1	36576833.0	34023528.0	2553305.0	93.01933822427984	231.786
P_1_58_EKRN220057227-1A_HKHYCDSX5_L2_1	40572212.0	37970912.0	2601300.0	93.5884688761855	229.965
P_1_59_EKRN220057228-1A_HKHYCDSX5_L2_1	36288963.0	33963288.0	2325675.0	93.59123323529526	230.328
P_1_5_EKRN220057174-1A_HLN7GDSX5_L4_1	34445509.0	31831910.0	2613599.0	92.41236644231327	231.728
P_1_60_EKRN220057229-1A_HKHYCDSX5_L2_1	40189101.0	37596268.0	2592833.0	93.54841751747568	233.357
P_1_61_EKRN220057230-1A_HKHYCDSX5_L2_1	39893510.0	37543624.0	2349886.0	94.10960329136243	237.178
P_1_62_EKRN220057231-1A_HKHYCDSX5_L2_1	34630962.0	32600931.0	2030031.0	94.1381039313895	236.692
P_1_63_EKRN220057232-1A_HKHYCDSX5_L2_1	31869517.0	30002681.0	1866836.0	94.14225198329802	227.71
P_1_64_EKRN220057233-1A_HKHYCDSX5_L2_1	37005877.0	34788578.0	2217299.0	94.00825171634224	235.183
P_1_65_EKRN220057234-1A_HKHYCDSX5_L2_1	34051299.0	31893518.0	2157781.0	93.66314630170203	235.871
P_1_66_1	31091753.0	21465647.0	9626106.0	69.03968071533309	237.314
P_1_67_EKRN220057236-1A_HKHYCDSX5_L2_1	34161321.0	31972930.0	2188391.0	93.59395088966261	231.613
P_1_68_EKRN220057237-1A_HKHYCDSX5_L2_1	37278956.0	34927054.0	2351902.0	93.69107332297611	232.337
P_1_69_EKRN220057238-1A_HKHYCDSX5_L2_1	40754247.0	37957102.0	2797145.0	93.13655580484654	238.219
P_1_6_EKRN220057175-1A_H22CWDSX5_L2_1	20092910.0	19059347.0	1033563.0	94.8560810753644	238.0
P_1_70_EKRN220057239-1A_HKHYCDSX5_L2_1	32942554.0	30657242.0	2285312.0	93.06273581580832	243.249
P_1_71_EKRN220057240-1A_HKHYCDSX5_L2_1	47593020.0	44567052.0	3025968.0	93.64199204000923	233.224
P_1_72_EKRN220057241-1A_HKHYCDSX5_L2_1	39219385.0	36333727.0	2885658.0	92.6422660630706	225.951
P_1_73_EKRN220057242-1A_HKHYCDSX5_L2_1	35230357.0	32905995.0	2324362.0	93.40238874105079	229.786
P_1_74_EKRN220057243-1A_HKHYCDSX5_L2_1	35996213.0	33433406.0	2562807.0	92.88034271827428	226.379
P_1_75_EKRN220057244-1A_HKHYCDSX5_L2_1	34764929.0	32445198.0	2319731.0	93.32738174152463	233.54
P_1_76_EKRN220057245-1A_HKHYCDSX5_L2_1	33870904.0	31671632.0	2199272.0	93.50689901869758	229.616
P_1_77_EKRN220057246-1A_HKHYCDSX5_L2_1	30631542.0	28382977.0	2248565.0	92.65931502893325	234.676
P_1_78_EKRN220057247-1A_HKHYCDSX5_L2_1	30712002.0	28396468.0	2315534.0	92.46049150426599	231.542
P_1_79_EKRN220057248-1A_HKHYCDSX5_L2_1	36116822.0	33635768.0	2481054.0	93.1304753225519	228.335
P_1_7_EKRN220057176-1A_HLTJ3DSX5_L4_1	31422810.0	29051045.0	2371765.0	92.45209133110629	229.745
P_1_80_EKRN220057249-1A_HKHYCDSX5_L2_1	33898544.0	31276465.0	2622079.0	92.2649214668335	232.671
P_1_81_EKRN220057250-1A_HKHYCDSX5_L2_1	38043861.0	35282251.0	2761610.0	92.74098388699296	232.72
P_1_82_EKRN220057251-1A_HKHYCDSX5_L2_1	35763048.0	33255471.0	2507577.0	92.98835770373934	234.936
P_1_83_EKRN220057252-1A_HKHYCDSX5_L2_1	35188236.0	32782744.0	2405492.0	93.16393126384625	239.492
P_1_84_EKRN220057253-1A_HKHYCDSX5_L2_1	37962305.0	35333054.0	2629251.0	93.07404805898905	232.182
P_1_85_EKRN220057254-1A_HKHYCDSX5_L2_1	36033036.0	33788341.0	2244695.0	93.77045275896265	231.647
P_1_86_EKRN220057255-1A_HKHYCDSX5_L2_1	35062609.0	32962159.0	2100450.0	94.00943038779573	230.06
P_1_87_EKRN220057256-1A_HKHYCDSX5_L2_1	29112230.0	27048940.0	2063290.0	92.9126349991052	227.012
P_1_88_EKRN220057257-1A_HKHYCDSX5_L2_1	34549969.0	32166774.0	2383195.0	93.10217904971203	230.331
P_1_89_EKRN220057258-1A_HKHYCDSX5_L2_1	36980547.0	34426979.0	2553568.0	93.09483442740854	227.769
P_1_8_EKRN220057177-1A_HLTJ3DSX5_L3_1	29133067.0	26626321.0	2506746.0	91.395530034651	220.438
P_1_90_EKRN220057259-1A_HKHYCDSX5_L2_1	31610559.0	29344852.0	2265707.0	92.8324361489463	223.822
P_1_9_1	30755945.0	28411206.0	2344739.0	92.37630643441454	228.015
