"","x"
"1","Pp3c6_14200V3"
"2","Pp3c22_20660V3"
"3","Pp3c17_13910V3"
"4","Pp3c22_17900V3"
"5","Pp3c2_6810V3"
"6","Pp3c20_23120V3"
"7","Pp3c15_1090V3"
"8","Pp3c12_16890V3"
"9","Pp3c13_22400V3"
"10","Pp3c2_17290V3"
"11","Pp3c23_19260V3"
"12","Pp3c2_13760V3"
"13","Pp3c14_12080V3"
"14","Pp3c24_6510V3"
"15","Pp3c23_9080V3"
"16","Pp3c27_4150V3"
"17","Pp3c9_19720V3"
"18","Pp3c8_17390V3"
"19","Pp3c21_8010V3"
"20","Pp3c5_18880V3"
