Description	time	Count
DNA integration	0.25	2
response to heat	0.25	1
response to antibiotic	0.25	1
response to temperature stimulus	0.25	1
response to oxygen-containing compound	0.25	1
response to alcohol	0.25	1
response to hydrogen peroxide	0.25	1
response to reactive oxygen species	0.25	1
response to inorganic substance	0.25	1
response to acid chemical	0.25	1
protein folding	0.25	1
response to toxic substance	0.25	1
response to copper ion	0.25	1
response to metal ion	0.25	1
carbohydrate metabolic process	0.25	1
response to cold	0.25	1
photosynthesis	0.25	1
photosynthesis, light reaction	0.25	1
generation of precursor metabolites and energy	0.25	1
plant-type cell wall organization	0.25	1
DNA integration	0.5	3
response to heat	0.5	9
response to antibiotic	0.5	8
response to temperature stimulus	0.5	11
response to oxygen-containing compound	0.5	15
response to alcohol	0.5	10
response to hydrogen peroxide	0.5	5
response to reactive oxygen species	0.5	6
response to inorganic substance	0.5	11
response to acid chemical	0.5	11
protein folding	0.5	5
response to toxic substance	0.5	5
response to copper ion	0.5	1
response to metal ion	0.5	1
carbohydrate metabolic process	0.5	1
response to cold	0.5	1
photosynthesis	0.5	1
photosynthesis, light reaction	0.5	1
generation of precursor metabolites and energy	0.5	1
plant-type cell wall organization	0.5	1
DNA integration	2	1
response to heat	2	22
response to antibiotic	2	1
response to temperature stimulus	2	29
response to oxygen-containing compound	2	1
response to alcohol	2	1
response to hydrogen peroxide	2	10
response to reactive oxygen species	2	13
response to inorganic substance	2	39
response to acid chemical	2	1
protein folding	2	19
response to toxic substance	2	14
response to copper ion	2	6
response to metal ion	2	22
carbohydrate metabolic process	2	1
response to cold	2	1
photosynthesis	2	1
photosynthesis, light reaction	2	1
generation of precursor metabolites and energy	2	1
plant-type cell wall organization	2	1
DNA integration	4	1
response to heat	4	21
response to antibiotic	4	14
response to temperature stimulus	4	33
response to oxygen-containing compound	4	1
response to alcohol	4	1
response to hydrogen peroxide	4	9
response to reactive oxygen species	4	13
response to inorganic substance	4	1
response to acid chemical	4	1
protein folding	4	1
response to toxic substance	4	1
response to copper ion	4	6
response to metal ion	4	1
carbohydrate metabolic process	4	31
response to cold	4	18
photosynthesis	4	1
photosynthesis, light reaction	4	1
generation of precursor metabolites and energy	4	1
plant-type cell wall organization	4	1
DNA integration	6	6
response to heat	6	25
response to antibiotic	6	1
response to temperature stimulus	6	42
response to oxygen-containing compound	6	1
response to alcohol	6	1
response to hydrogen peroxide	6	11
response to reactive oxygen species	6	15
response to inorganic substance	6	1
response to acid chemical	6	1
protein folding	6	1
response to toxic substance	6	18
response to copper ion	6	7
response to metal ion	6	1
carbohydrate metabolic process	6	48
response to cold	6	1
photosynthesis	6	21
photosynthesis, light reaction	6	15
generation of precursor metabolites and energy	6	22
plant-type cell wall organization	6	9
