gene	ColdCluster	HeatCluster	HL_no_RCluster	HLt0Cluster	ath	symbol	use_me	module
Me1_v2_0097240	10	6	7	8	AT4G02400	-	AT4G02400	black
Me1_v2_0084280	14	6	7	10	AT3G19210	CHR25, ATRAD54, RAD54	CHR25, ATRAD54, RAD54	black
Me1_v2_0066110	2	6	7	8	AT4G24860	-	AT4G24860	black
Me1_v2_0095600	5	6	7	8	AT1G30590	-	AT1G30590	black
Me1_v2_0136180	5	6	7	8	AT1G77220	LAZ1H1	LAZ1H1	black
Me1_v2_0234500	10	6	7	8	AT5G30495	-	AT5G30495	black
Me1_v2_0128930	2	6	7	8	AT4G25730	TRM7b, AtTRM7b	TRM7b, AtTRM7b	black
Me1_v2_0032520	5	6	7	12	NA	NA	Me1_v2_0032520	black
Me1_v2_0124320	10	6	5	12	AT4G24630	-	AT4G24630	black
Me1_v2_0186220	10	6	7	8	AT2G25720	-	AT2G25720	black
Me1_v2_0057060	10	6	7	12	AT1G68990	RPOTm, MGP3	RPOTm, MGP3	black
Me1_v2_0051770	9	6	7	12	AT3G07400	-	AT3G07400	black
Me1_v2_0228900	11	6	7	12	AT4G21660	-	AT4G21660	black
Me1_v2_0141560	10	6	7	8	AT4G22000	-	AT4G22000	black
Me1_v2_0051780	5	6	7	8	AT3G07400	-	AT3G07400	black
Me1_v2_0229780	10	6	5	8	AT2G34750	-	AT2G34750	black
Me1_v2_0110530	2	6	7	12	AT1G48840	-	AT1G48840	black
Me1_v2_0151130	10	6	7	8	NA	NA	Me1_v2_0151130	black
Me1_v2_0204360	14	6	7	8	AT4G04910	NSF	NSF	black
Me1_v2_0178430	11	6	7	8	AT3G16720	TL2, ATL2	TL2, ATL2	black
Me1_v2_0198870	15	10	1	9	AT1G24340	EMB260, EMB2421	EMB260, EMB2421	blue
Me1_v2_0077100	16	7	2	9	NA	NA	Me1_v2_0077100	blue
Me1_v2_0058020	12	10	1	9	AT4G18230	-	AT4G18230	blue
Me1_v2_0106290	16	7	1	9	AT2G28900	OEP16, OEP16-1, ATOEP16-L, ATOEP16-1	OEP16, OEP16-1, ATOEP16-L, ATOEP16-1	blue
Me1_v2_0175300	16	2	1	9	NA	NA	Me1_v2_0175300	blue
Me1_v2_0111890	16	2	1	9	NA	NA	Me1_v2_0111890	blue
Me1_v2_0069860	12	10	1	9	NA	NA	Me1_v2_0069860	blue
Me1_v2_0131350	12	2	1	9	AT2G35810	-	AT2G35810	blue
Me1_v2_0117250	14	10	1	9	NA	NA	Me1_v2_0117250	blue
Me1_v2_0104830	14	10	1	2	AT1G07980	NF-YC10	NF-YC10	blue
Me1_v2_0195790	12	10	1	9	NA	NA	Me1_v2_0195790	blue
Me1_v2_0122280	16	2	1	9	NA	NA	Me1_v2_0122280	blue
Me1_v2_0184510	16	2	1	9	AT5G54520	PRP17, CDC40	PRP17, CDC40	blue
Me1_v2_0079090	14	2	2	9	AT1G75980	-	AT1G75980	blue
Me1_v2_0055890	14	2	1	9	NA	NA	Me1_v2_0055890	blue
Me1_v2_0162710	12	10	1	9	NA	NA	Me1_v2_0162710	blue
Me1_v2_0119000	12	10	1	9	AT2G31890	ATRAP, RAP	ATRAP, RAP	blue
Me1_v2_0134830	14	10	2	9	AT1G63420	-	AT1G63420	blue
Me1_v2_0150470	8	2	1	9	NA	NA	Me1_v2_0150470	blue
Me1_v2_0082100	12	10	1	9	AT4G32272	UGNT1	UGNT1	blue
Me1_v2_0073950	14	6	7	3	AT3G54360	NCA1	NCA1	brown
Me1_v2_0188950	14	5	7	3	NA	NA	Me1_v2_0188950	brown
Me1_v2_0178910	12	6	7	8	AT5G47120	ATBI1, ATBI-1, BI-1, BI1	ATBI1, ATBI-1, BI-1, BI1	brown
Me1_v2_0165370	5	9	7	12	NA	NA	Me1_v2_0165370	brown
Me1_v2_0179850	5	9	7	8	AT5G44590	-	AT5G44590	brown
Me1_v2_0072170	14	9	7	12	AT2G19480	NFA2, NFA02, NAP1;2	NFA2, NFA02, NAP1;2	brown
Me1_v2_0156950	14	9	7	8	AT3G52210	-	AT3G52210	brown
Me1_v2_0224320	11	5	7	8	AT5G57960	Hflx	Hflx	brown
Me1_v2_0180160	16	9	7	8	AT3G58450	GRUSP, USP	GRUSP, USP	brown
Me1_v2_0031420	9	6	7	8	AT5G15400	MUSE3, UFD2	MUSE3, UFD2	brown
Me1_v2_0214630	10	9	7	3	AT3G12050	-	AT3G12050	brown
Me1_v2_0235170	10	5	7	3	AT2G41835	-	AT2G41835	brown
Me1_v2_0185100	10	6	7	8	AT5G55200	MGE1	MGE1	brown
Me1_v2_0188920	14	9	7	8	AT3G22320	ATRPABC24, NRPD5, NRPB5, RPB5A	ATRPABC24, NRPD5, NRPB5, RPB5A	brown
Me1_v2_0156940	14	5	7	8	NA	NA	Me1_v2_0156940	brown
Me1_v2_0116070	12	9	7	8	NA	NA	Me1_v2_0116070	brown
Me1_v2_0226940	14	5	9	3	AT2G16405	-	AT2G16405	brown
Me1_v2_0231160	11	5	7	8	AT4G12400	Hop3	Hop3	brown
Me1_v2_0197220	14	5	7	8	AT3G07430	ATYLMG1-1, YLMG1-1, EMB1990	ATYLMG1-1, YLMG1-1, EMB1990	brown
Me1_v2_0188910	12	9	7	8	AT1G26550	-	AT1G26550	brown
Me1_v2_0017880	5	3	9	3	NA	NA	Me1_v2_0017880	cyan
Me1_v2_0019530	5	3	9	3	NA	NA	Me1_v2_0019530	cyan
Me1_v2_0038720	5	3	9	4	NA	NA	Me1_v2_0038720	cyan
Me1_v2_0024180	5	3	9	3	NA	NA	Me1_v2_0024180	cyan
Me1_v2_0016730	5	3	9	3	AT4G23050	TES1	TES1	cyan
Me1_v2_0100120	6	3	9	3	NA	NA	Me1_v2_0100120	cyan
Me1_v2_0092670	10	3	9	4	NA	NA	Me1_v2_0092670	cyan
Me1_v2_0153450	5	12	9	3	AT4G10930	-	AT4G10930	cyan
Me1_v2_0100110	5	3	9	8	AT3G06630	-	AT3G06630	cyan
Me1_v2_0153440	14	3	9	3	AT4G10930	-	AT4G10930	cyan
Me1_v2_0034140	2	3	9	3	NA	NA	Me1_v2_0034140	cyan
Me1_v2_0092680	10	3	9	4	NA	NA	Me1_v2_0092680	cyan
Me1_v2_0022290	3	3	9	3	AT2G20560	DNAJ	DNAJ	cyan
Me1_v2_0092700	5	3	9	4	NA	NA	Me1_v2_0092700	cyan
Me1_v2_0143660	3	3	9	3	NA	NA	Me1_v2_0143660	cyan
Me1_v2_0200440	5	3	9	3	AT2G26280	CID7	CID7	cyan
Me1_v2_0100100	5	3	9	3	NA	NA	Me1_v2_0100100	cyan
Me1_v2_0155790	11	3	9	4	AT5G24120	SIGE, ATSIG5, SIG5	SIGE, ATSIG5, SIG5	cyan
Me1_v2_0092690	10	3	9	4	NA	NA	Me1_v2_0092690	cyan
Me1_v2_0163230	16	11	9	3	NA	NA	Me1_v2_0163230	cyan
Me1_v2_0165430	2	11	7	12	AT5G06220	-	AT5G06220	darkgreen
Me1_v2_0122920	1	3	9	10	AT1G06690	-	AT1G06690	darkgreen
Me1_v2_0134330	NA	NA	NA	NA	NA	NA	Me1_v2_0134330	darkgreen
Me1_v2_0165400	2	10	7	17	NA	NA	Me1_v2_0165400	darkgreen
Me1_v2_0025800	1	11	10	14	NA	NA	Me1_v2_0025800	darkgreen
Me1_v2_0230240	1	11	10	2	AT5G51030	-	AT5G51030	darkgreen
Me1_v2_0027640	3	3	10	8	AT5G57050	ABI2, AtABI2	ABI2, AtABI2	darkgreen
Me1_v2_0218650	3	3	10	8	AT4G26080	ABI1, AtABI1	ABI1, AtABI1	darkgreen
Me1_v2_0123430	4	3	9	8	NA	NA	Me1_v2_0123430	darkgreen
Me1_v2_0028080	3	3	7	8	AT1G72770	HAB1, AtHAB1	HAB1, AtHAB1	darkgreen
Me1_v2_0129270	3	3	7	8	NA	NA	Me1_v2_0129270	darkgreen
Me1_v2_0109730	5	1	9	1	AT3G54500	LNK2	LNK2	darkgreen
Me1_v2_0116260	7	3	10	1	AT5G39660	CDF2	CDF2	darkgreen
Me1_v2_0110660	3	11	10	9	AT4G32400	EMB42, EMB104, SHS1, BR1, ATBT1	EMB42, EMB104, SHS1, BR1, ATBT1	darkgreen
Me1_v2_0129260	3	3	10	17	AT5G67030	LOS6, NPQ2, ZEP, ABA1, ATABA1, ATZEP, IBS3	LOS6, NPQ2, ZEP, ABA1, ATABA1, ATZEP, IBS3	darkgreen
Me1_v2_0093690	1	4	9	17	AT3G11960	-	AT3G11960	darkgreen
Me1_v2_0220680	1	10	7	8	NA	NA	Me1_v2_0220680	darkgreen
Me1_v2_0030440	3	5	9	16	NA	NA	Me1_v2_0030440	darkgreen
Me1_v2_0121470	15	11	9	18	AT1G08465	YAB2	YAB2	darkgreen
Me1_v2_0035410	2	3	7	3	NA	NA	Me1_v2_0035410	darkgreen
Me1_v2_0065630	4	3	1	2	NA	NA	Me1_v2_0065630	darkgrey
Me1_v2_0065670	4	3	1	2	NA	NA	Me1_v2_0065670	darkgrey
Me1_v2_0051660	4	3	1	1	NA	NA	Me1_v2_0051660	darkgrey
Me1_v2_0065680	3	3	1	2	NA	NA	Me1_v2_0065680	darkgrey
Me1_v2_0051670	4	3	1	1	NA	NA	Me1_v2_0051670	darkgrey
Me1_v2_0065500	4	3	1	2	NA	NA	Me1_v2_0065500	darkgrey
Me1_v2_0051620	4	3	1	1	NA	NA	Me1_v2_0051620	darkgrey
Me1_v2_0029800	3	3	1	2	NA	NA	Me1_v2_0029800	darkgrey
Me1_v2_0060380	3	1	1	1	NA	NA	Me1_v2_0060380	darkgrey
Me1_v2_0039150	3	1	1	1	NA	NA	Me1_v2_0039150	darkgrey
Me1_v2_0059190	4	1	1	2	AT2G17230	EXL5	EXL5	darkgrey
Me1_v2_0066410	13	3	1	1	NA	NA	Me1_v2_0066410	darkgrey
Me1_v2_0201230	3	3	1	2	NA	NA	Me1_v2_0201230	darkgrey
Me1_v2_0170880	3	3	1	1	NA	NA	Me1_v2_0170880	darkgrey
Me1_v2_0205430	4	3	1	5	AT3G52590	HAP4, ERD16, EMB2167, UBQ1	HAP4, ERD16, EMB2167, UBQ1	darkgrey
Me1_v2_0161450	4	3	1	5	AT3G24540	AtPERK3, PERK3	AtPERK3, PERK3	darkgrey
Me1_v2_0060310	3	1	1	2	NA	NA	Me1_v2_0060310	darkgrey
Me1_v2_0109090	7	1	1	2	AT2G04160	AIR3	AIR3	darkgrey
Me1_v2_0050670	3	1	1	2	NA	NA	Me1_v2_0050670	darkgrey
Me1_v2_0210310	3	3	1	2	NA	NA	Me1_v2_0210310	darkgrey
Me1_v2_0041830	2	7	8	1	NA	NA	Me1_v2_0041830	darkorange
Me1_v2_0037510	2	7	8	1	AT2G07698	-	AT2G07698	darkorange
Me1_v2_0031270	2	7	8	1	ATCG00020	PSBA	PSBA	darkorange
Me1_v2_0031870	2	7	1	11	NA	NA	Me1_v2_0031870	darkorange
Me1_v2_0038100	2	7	8	1	NA	NA	Me1_v2_0038100	darkorange
Me1_v2_0082560	2	7	8	11	AT5G46920	-	AT5G46920	darkorange
Me1_v2_0014700	NA	NA	NA	NA	NA	NA	Me1_v2_0014700	darkorange
Me1_v2_0026930	2	2	1	11	NA	NA	Me1_v2_0026930	darkorange
Me1_v2_0031590	2	7	5	11	NA	NA	Me1_v2_0031590	darkorange
Me1_v2_0082510	2	7	5	11	NA	NA	Me1_v2_0082510	darkorange
Me1_v2_0047100	2	7	8	11	NA	NA	Me1_v2_0047100	darkorange
Me1_v2_0042270	2	4	1	1	ATCG00680	PSBB	PSBB	darkorange
Me1_v2_0034230	2	6	8	11	NA	NA	Me1_v2_0034230	darkorange
Me1_v2_0082520	2	7	8	11	AT2G07687	-	AT2G07687	darkorange
Me1_v2_0027260	2	2	8	11	NA	NA	Me1_v2_0027260	darkorange
Me1_v2_0038090	2	7	8	11	NA	NA	Me1_v2_0038090	darkorange
Me1_v2_0035940	2	7	13	4	NA	NA	Me1_v2_0035940	darkorange
Me1_v2_0026820	6	7	2	11	NA	NA	Me1_v2_0026820	darkorange
Me1_v2_0040250	2	2	1	1	ATCG00490	RBCL	RBCL	darkorange
Me1_v2_0042170	2	4	1	1	ATCG00340	PSAB	PSAB	darkorange
Me1_v2_0053290	NA	NA	NA	NA	AT2G20450	-	AT2G20450	darkred
Me1_v2_0167900	NA	NA	NA	NA	AT5G59850	-	AT5G59850	darkred
Me1_v2_0210360	NA	NA	NA	NA	AT4G34555	-	AT4G34555	darkred
Me1_v2_0070790	NA	NA	NA	NA	AT4G30800	-	AT4G30800	darkred
Me1_v2_0229510	NA	NA	NA	NA	AT3G05590	RPL18	RPL18	darkred
Me1_v2_0234090	NA	NA	NA	NA	AT1G70600	-	AT1G70600	darkred
Me1_v2_0167910	NA	NA	NA	NA	AT1G52300	-	AT1G52300	darkred
Me1_v2_0083170	NA	NA	NA	NA	AT5G04800	-	AT5G04800	darkred
Me1_v2_0166360	NA	NA	NA	NA	AT3G23390	RPL36aA	RPL36aA	darkred
Me1_v2_0124260	NA	NA	NA	NA	AT5G02450	-	AT5G02450	darkred
Me1_v2_0178950	NA	NA	NA	NA	AT3G05560	-	AT3G05560	darkred
Me1_v2_0051090	NA	NA	NA	NA	AT3G09500	-	AT3G09500	darkred
Me1_v2_0102620	15	3	9	8	AT5G27700	EVR1L1, RPS21C	EVR1L1, RPS21C	darkred
Me1_v2_0136190	NA	NA	NA	NA	AT1G77940	RPL30B	RPL30B	darkred
Me1_v2_0086240	NA	NA	NA	NA	AT5G48760	-	AT5G48760	darkred
Me1_v2_0128810	NA	NA	NA	NA	AT2G40590	-	AT2G40590	darkred
Me1_v2_0167700	NA	NA	NA	NA	AT4G31985	-	AT4G31985	darkred
Me1_v2_0123200	NA	NA	NA	NA	AT1G48830	-	AT1G48830	darkred
Me1_v2_0111100	NA	NA	NA	NA	AT3G22230	-	AT3G22230	darkred
Me1_v2_0074940	15	3	9	8	AT3G02080	-	AT3G02080	darkred
Me1_v2_0011250	13	3	11	3	NA	NA	Me1_v2_0011250	darkturquoise
Me1_v2_0085490	13	3	1	4	NA	NA	Me1_v2_0085490	darkturquoise
Me1_v2_0085480	13	3	6	13	NA	NA	Me1_v2_0085480	darkturquoise
Me1_v2_0060490	16	3	6	13	AT1G23010	LPR1	LPR1	darkturquoise
Me1_v2_0233450	13	3	6	3	NA	NA	Me1_v2_0233450	darkturquoise
Me1_v2_0067020	13	3	9	3	AT5G53450	ORG1, FBN11	ORG1, FBN11	darkturquoise
Me1_v2_0187180	13	3	11	4	AT5G01720	RAE1	RAE1	darkturquoise
Me1_v2_0165210	12	3	6	4	NA	NA	Me1_v2_0165210	darkturquoise
Me1_v2_0149410	15	3	9	13	AT5G18150	-	AT5G18150	darkturquoise
Me1_v2_0050210	16	3	11	1	AT1G03800	ERF10, ATERF10	ERF10, ATERF10	darkturquoise
Me1_v2_0158800	4	3	9	4	NA	NA	Me1_v2_0158800	darkturquoise
Me1_v2_0027760	12	3	1	3	NA	NA	Me1_v2_0027760	darkturquoise
Me1_v2_0088320	4	3	9	4	NA	NA	Me1_v2_0088320	darkturquoise
Me1_v2_0048930	5	3	1	4	NA	NA	Me1_v2_0048930	darkturquoise
Me1_v2_0184990	12	3	11	5	NA	NA	Me1_v2_0184990	darkturquoise
Me1_v2_0018260	5	3	1	4	NA	NA	Me1_v2_0018260	darkturquoise
Me1_v2_0108040	13	3	1	3	NA	NA	Me1_v2_0108040	darkturquoise
Me1_v2_0191320	5	3	6	4	NA	NA	Me1_v2_0191320	darkturquoise
Me1_v2_0122970	4	3	9	3	AT2G36810	SGR6	SGR6	darkturquoise
Me1_v2_0170290	16	3	11	4	AT3G56360	-	AT3G56360	darkturquoise
Me1_v2_0157900	12	10	1	2	NA	NA	Me1_v2_0157900	green
Me1_v2_0062000	12	10	1	2	AT2G28305	ATLOG1, LOG1	ATLOG1, LOG1	green
Me1_v2_0060980	12	10	1	2	NA	NA	Me1_v2_0060980	green
Me1_v2_0194240	12	11	1	2	AT1G30540	GNK	GNK	green
Me1_v2_0170340	15	11	1	2	AT4G17190	FPS2	FPS2	green
Me1_v2_0196800	13	10	1	2	AT3G26570	PHT2;1, ORF02	PHT2;1, ORF02	green
Me1_v2_0176070	15	10	1	9	NA	NA	Me1_v2_0176070	green
Me1_v2_0200350	12	10	6	2	AT1G45130	AtBGAL5, BGAL5	AtBGAL5, BGAL5	green
Me1_v2_0122160	12	10	1	9	NA	NA	Me1_v2_0122160	green
Me1_v2_0086800	14	1	1	2	AT1G79990	-	AT1G79990	green
Me1_v2_0112750	14	10	1	2	AT3G56430	AtTIM21L-2	AtTIM21L-2	green
Me1_v2_0091260	16	10	1	2	NA	NA	Me1_v2_0091260	green
Me1_v2_0054410	13	10	6	2	AT4G17760	-	AT4G17760	green
Me1_v2_0159730	12	10	1	2	AT2G20930	tTRAPPC2(L)	tTRAPPC2(L)	green
Me1_v2_0151540	12	11	1	2	AT3G61050	CLB1, SYT7, AtCLB, NTMC2TYPE4, NTMC2T4	CLB1, SYT7, AtCLB, NTMC2TYPE4, NTMC2T4	green
Me1_v2_0132950	14	10	1	9	AT2G33570	GALS1	GALS1	green
Me1_v2_0190910	12	10	1	2	AT3G26115	-	AT3G26115	green
Me1_v2_0066320	12	1	1	9	AT5G38630	ACYB-1, CYB-1	ACYB-1, CYB-1	green
Me1_v2_0160160	14	10	1	2	AT5G14240	-	AT5G14240	green
Me1_v2_0201190	13	11	1	2	NA	NA	Me1_v2_0201190	green
Me1_v2_0165280	5	7	2	6	NA	NA	Me1_v2_0165280	greenyellow
Me1_v2_0119620	10	2	2	6	AT2G29530	TIM10, AtTIM10	TIM10, AtTIM10	greenyellow
Me1_v2_0229820	2	2	2	6	AT3G25470	-	AT3G25470	greenyellow
Me1_v2_0220910	5	2	2	6	AT3G51270	-	AT3G51270	greenyellow
Me1_v2_0147630	10	7	2	6	AT2G39670	-	AT2G39670	greenyellow
Me1_v2_0184590	10	7	2	10	AT5G14520	PES	PES	greenyellow
Me1_v2_0041650	2	2	2	6	AT2G19870	-	AT2G19870	greenyellow
Me1_v2_0147410	10	7	2	6	AT1G31970	STRS1, RH5	STRS1, RH5	greenyellow
Me1_v2_0099540	5	2	2	6	AT5G64420	-	AT5G64420	greenyellow
Me1_v2_0035350	10	2	2	6	NA	NA	Me1_v2_0035350	greenyellow
Me1_v2_0111660	11	7	2	6	AT1G78010	TrmE	TrmE	greenyellow
Me1_v2_0220880	10	2	2	6	AT5G60870	RUG3	RUG3	greenyellow
Me1_v2_0200930	10	2	2	6	AT3G53170	-	AT3G53170	greenyellow
Me1_v2_0122750	10	7	5	10	NA	NA	Me1_v2_0122750	greenyellow
Me1_v2_0219710	2	2	2	6	AT2G19870	-	AT2G19870	greenyellow
Me1_v2_0113500	10	2	1	6	AT3G12080	EngA-1, DER, emb2738	EngA-1, DER, emb2738	greenyellow
Me1_v2_0163380	10	4	5	6	AT2G31060	EMB2785	EMB2785	greenyellow
Me1_v2_0050180	2	2	2	6	AT4G29510	ATPRMT11, PRMT11, PRMT1B, ATPRMT1B	ATPRMT11, PRMT11, PRMT1B, ATPRMT1B	greenyellow
Me1_v2_0114460	10	7	1	6	AT2G40430	SMO4	SMO4	greenyellow
Me1_v2_0054680	10	7	2	6	AT2G37990	ARRS1	ARRS1	greenyellow
Me1_v2_0020250	3	4	2	12	AT1G63050	AtLPLAT2, LPLAT2, LPCAT2	AtLPLAT2, LPLAT2, LPCAT2	grey
Me1_v2_0025840	14	9	7	10	NA	NA	Me1_v2_0025840	grey
Me1_v2_0038350	NA	NA	NA	NA	AT3G45300	IVD, IVDH, ATIVD	IVD, IVDH, ATIVD	grey
Me1_v2_0039990	4	10	1	9	NA	NA	Me1_v2_0039990	grey
Me1_v2_0042650	15	9	7	8	NA	NA	Me1_v2_0042650	grey
Me1_v2_0053620	5	8	9	13	NA	NA	Me1_v2_0053620	grey
Me1_v2_0054630	NA	NA	NA	NA	AT5G64940	OSA1, ATH13, ATOSA1, abc1k8, ATATH13	OSA1, ATH13, ATOSA1, abc1k8, ATATH13	grey
Me1_v2_0055600	NA	NA	NA	NA	AT4G12610	RAP74, ATRAP74	RAP74, ATRAP74	grey
Me1_v2_0059350	4	8	2	6	AT5G59570	BOA	BOA	grey
Me1_v2_0060120	14	2	7	12	AT1G21640	ATNADK2, NADK2	ATNADK2, NADK2	grey
Me1_v2_0061970	2	9	8	8	AT5G63440	CSU4	CSU4	grey
Me1_v2_0063710	3	1	10	14	AT3G48750	CDC2AAT, CDKA;1, CDK2, CDC2, CDKA1, CDC2A	CDC2AAT, CDKA;1, CDK2, CDC2, CDKA1, CDC2A	grey
Me1_v2_0067650	NA	NA	NA	NA	AT2G20300	ALE2	ALE2	grey
Me1_v2_0070640	NA	NA	NA	NA	NA	NA	Me1_v2_0070640	grey
Me1_v2_0071220	NA	NA	NA	NA	AT3G20890	-	AT3G20890	grey
Me1_v2_0071320	1	8	2	9	AT3G26780	MEF14	MEF14	grey
Me1_v2_0073080	NA	NA	NA	NA	AT4G20850	TPP2	TPP2	grey
Me1_v2_0074160	2	11	8	9	AT5G26740	-	AT5G26740	grey
Me1_v2_0074570	7	4	9	11	NA	NA	Me1_v2_0074570	grey
Me1_v2_0077190	NA	NA	NA	NA	AT2G18850	-	AT2G18850	grey
Me1_v2_0059330	14	7	7	17	AT2G40770	-	AT2G40770	grey60
Me1_v2_0031310	5	7	5	17	NA	NA	Me1_v2_0031310	grey60
Me1_v2_0076180	11	7	7	17	NA	NA	Me1_v2_0076180	grey60
Me1_v2_0149080	5	7	5	10	AT4G33240	FAB1A	FAB1A	grey60
Me1_v2_0195270	5	2	7	8	AT1G21580	SOP1	SOP1	grey60
Me1_v2_0078780	2	4	5	12	NA	NA	Me1_v2_0078780	grey60
Me1_v2_0202630	12	2	7	10	NA	NA	Me1_v2_0202630	grey60
Me1_v2_0102180	16	2	5	17	NA	NA	Me1_v2_0102180	grey60
Me1_v2_0200580	10	2	7	10	NA	NA	Me1_v2_0200580	grey60
Me1_v2_0172180	9	2	5	10	AT3G19190	ATG2, ATATG2, PEUP1	ATG2, ATATG2, PEUP1	grey60
Me1_v2_0149060	9	2	5	17	AT3G14270	FAB1B	FAB1B	grey60
Me1_v2_0066760	2	7	5	17	AT5G44800	CHR4, PKR1	CHR4, PKR1	grey60
Me1_v2_0090020	14	2	7	12	AT5G24740	SHBY	SHBY	grey60
Me1_v2_0065430	2	6	5	17	AT2G16920	PFU2, UBC23	PFU2, UBC23	grey60
Me1_v2_0036440	2	6	5	17	NA	NA	Me1_v2_0036440	grey60
Me1_v2_0158950	5	7	5	17	NA	NA	Me1_v2_0158950	grey60
Me1_v2_0149540	10	2	7	8	NA	NA	Me1_v2_0149540	grey60
Me1_v2_0109850	10	6	5	17	AT3G01370	CFM2, ATCFM2	CFM2, ATCFM2	grey60
Me1_v2_0133620	5	2	5	10	AT5G08630	DDW1	DDW1	grey60
Me1_v2_0078790	2	7	5	10	NA	NA	Me1_v2_0078790	grey60
Me1_v2_0057490	3	7	2	9	AT2G23810	TET8	TET8	lightcyan
Me1_v2_0091880	2	6	5	9	AT3G56110	PRA1.B1	PRA1.B1	lightcyan
Me1_v2_0129590	5	8	2	6	AT4G20140	GSO1, SGN3	GSO1, SGN3	lightcyan
Me1_v2_0186650	7	6	2	9	NA	NA	Me1_v2_0186650	lightcyan
Me1_v2_0120570	12	8	5	6	AT2G37110	-	AT2G37110	lightcyan
Me1_v2_0075680	2	8	2	6	NA	NA	Me1_v2_0075680	lightcyan
Me1_v2_0074270	5	6	5	6	AT3G20410	CPK9	CPK9	lightcyan
Me1_v2_0103630	13	4	2	9	NA	NA	Me1_v2_0103630	lightcyan
Me1_v2_0013580	7	8	2	6	NA	NA	Me1_v2_0013580	lightcyan
Me1_v2_0231000	4	6	2	9	AT2G29050	ATRBL1, RBL1	ATRBL1, RBL1	lightcyan
Me1_v2_0097170	2	7	2	6	NA	NA	Me1_v2_0097170	lightcyan
Me1_v2_0105380	12	7	2	9	AT2G24580	-	AT2G24580	lightcyan
Me1_v2_0036660	7	7	2	9	NA	NA	Me1_v2_0036660	lightcyan
Me1_v2_0221770	5	8	5	6	NA	NA	Me1_v2_0221770	lightcyan
Me1_v2_0075690	2	8	2	6	NA	NA	Me1_v2_0075690	lightcyan
Me1_v2_0108480	15	8	2	6	NA	NA	Me1_v2_0108480	lightcyan
Me1_v2_0125470	2	7	2	9	NA	NA	Me1_v2_0125470	lightcyan
Me1_v2_0095020	12	8	5	10	AT2G28260	ATCNGC15, CNGC15	ATCNGC15, CNGC15	lightcyan
Me1_v2_0210380	7	8	1	9	NA	NA	Me1_v2_0210380	lightcyan
Me1_v2_0079330	16	8	1	9	AT2G47960	TRAPPC13	TRAPPC13	lightcyan
Me1_v2_0171940	13	11	9	4	NA	NA	Me1_v2_0171940	lightgreen
Me1_v2_0125520	13	11	11	4	AT1G30420	MRP12, ATMRP12, ABCC11	MRP12, ATMRP12, ABCC11	lightgreen
Me1_v2_0055050	13	3	9	4	AT1G75010	ARC3	ARC3	lightgreen
Me1_v2_0151200	13	11	9	3	AT4G17870	RCAR11, PYR1	RCAR11, PYR1	lightgreen
Me1_v2_0120980	13	3	9	4	NA	NA	Me1_v2_0120980	lightgreen
Me1_v2_0086220	13	3	9	3	AT4G04330	AtRbcX1, RbcX1	AtRbcX1, RbcX1	lightgreen
Me1_v2_0135700	13	11	11	1	AT3G20480	LpxK, AtLpxK	LpxK, AtLpxK	lightgreen
Me1_v2_0206680	12	3	9	4	AT1G70580	GGT2, AOAT2	GGT2, AOAT2	lightgreen
Me1_v2_0231660	13	3	9	3	AT3G56490	HIT3, HINT1	HIT3, HINT1	lightgreen
Me1_v2_0125510	13	3	9	4	AT2G34660	EST4, ATMRP2, MRP2, AtABCC2, ABCC2	EST4, ATMRP2, MRP2, AtABCC2, ABCC2	lightgreen
Me1_v2_0211640	13	11	9	4	AT1G80380	GLYK	GLYK	lightgreen
Me1_v2_0089420	16	3	9	11	AT1G03750	CHR9	CHR9	lightgreen
Me1_v2_0195970	13	3	11	4	AT2G04700	INAP1, FTRB	INAP1, FTRB	lightgreen
Me1_v2_0171950	13	11	9	4	NA	NA	Me1_v2_0171950	lightgreen
Me1_v2_0087140	4	11	9	1	AT2G32040	-	AT2G32040	lightgreen
Me1_v2_0181230	13	11	9	4	AT1G10510	emb2004	emb2004	lightgreen
Me1_v2_0122610	15	3	9	3	NA	NA	Me1_v2_0122610	lightgreen
Me1_v2_0140580	12	3	9	4	AT5G01920	STN8	STN8	lightgreen
Me1_v2_0106310	12	11	9	4	AT5G25350	EBF2	EBF2	lightgreen
Me1_v2_0159770	14	3	9	1	AT3G23920	BMY7, AtBAM1, BAM1, TR-BAMY	BMY7, AtBAM1, BAM1, TR-BAMY	lightgreen
Me1_v2_0123660	3	10	1	1	NA	NA	Me1_v2_0123660	lightyellow
Me1_v2_0025850	3	10	1	5	NA	NA	Me1_v2_0025850	lightyellow
Me1_v2_0045470	3	10	6	1	NA	NA	Me1_v2_0045470	lightyellow
Me1_v2_0017660	3	10	1	5	NA	NA	Me1_v2_0017660	lightyellow
Me1_v2_0205390	3	11	6	4	NA	NA	Me1_v2_0205390	lightyellow
Me1_v2_0155080	3	1	1	2	AT1G77590	LACS9	LACS9	lightyellow
Me1_v2_0220640	3	1	1	2	AT1G45249	AtABF2, ABF2, ATAREB1, AREB1	AtABF2, ABF2, ATAREB1, AREB1	lightyellow
Me1_v2_0004620	3	2	11	1	NA	NA	Me1_v2_0004620	lightyellow
Me1_v2_0096060	3	11	1	1	NA	NA	Me1_v2_0096060	lightyellow
Me1_v2_0201120	3	10	1	2	AT3G44380	-	AT3G44380	lightyellow
Me1_v2_0048440	3	2	11	5	NA	NA	Me1_v2_0048440	lightyellow
Me1_v2_0062990	3	10	1	7	AT3G19830	NTMC2T5, NTMC2TYPE5	NTMC2T5, NTMC2TYPE5	lightyellow
Me1_v2_0204010	3	1	1	2	AT2G30130	PCK1, ASL5, LBD12	PCK1, ASL5, LBD12	lightyellow
Me1_v2_0119560	3	11	1	1	NA	NA	Me1_v2_0119560	lightyellow
Me1_v2_0057590	3	1	1	7	NA	NA	Me1_v2_0057590	lightyellow
Me1_v2_0147910	3	10	1	2	NA	NA	Me1_v2_0147910	lightyellow
Me1_v2_0057600	7	1	1	1	NA	NA	Me1_v2_0057600	lightyellow
Me1_v2_0062980	3	10	1	5	AT1G50260	NTMC2TYPE5, NTMC2T5	NTMC2TYPE5, NTMC2T5	lightyellow
Me1_v2_0030650	3	1	1	7	NA	NA	Me1_v2_0030650	lightyellow
Me1_v2_0230630	3	11	11	1	AT1G67480	-	AT1G67480	lightyellow
Me1_v2_0113360	10	10	2	9	AT2G43350	GPX3, ATGPX3, GPXL3	GPX3, ATGPX3, GPXL3	magenta
Me1_v2_0181740	2	10	1	9	AT3G11170	FAD7, AtFAD7, FADD	FAD7, AtFAD7, FADD	magenta
Me1_v2_0140720	2	8	1	9	NA	NA	Me1_v2_0140720	magenta
Me1_v2_0071550	10	2	6	9	NA	NA	Me1_v2_0071550	magenta
Me1_v2_0193940	5	10	6	9	AT5G58575	SGF11	SGF11	magenta
Me1_v2_0160840	5	2	1	9	NA	NA	Me1_v2_0160840	magenta
Me1_v2_0130430	10	1	2	9	NA	NA	Me1_v2_0130430	magenta
Me1_v2_0153050	10	10	1	9	NA	NA	Me1_v2_0153050	magenta
Me1_v2_0182520	2	2	2	9	NA	NA	Me1_v2_0182520	magenta
Me1_v2_0185160	11	2	1	2	AT1G51510	Y14	Y14	magenta
Me1_v2_0091570	14	2	1	9	AT5G27450	MVK, MK	MVK, MK	magenta
Me1_v2_0198750	10	10	1	2	AT5G20070	ATNUDX19, ATNUDT19, NUDX19	ATNUDX19, ATNUDT19, NUDX19	magenta
Me1_v2_0170060	11	2	1	9	AT1G17270	-	AT1G17270	magenta
Me1_v2_0094460	1	10	1	2	AT5G35790	G6PD1	G6PD1	magenta
Me1_v2_0068580	11	10	1	2	NA	NA	Me1_v2_0068580	magenta
Me1_v2_0155400	2	4	2	9	AT1G79150	NOC3, AtNOC3	NOC3, AtNOC3	magenta
Me1_v2_0214070	10	2	1	9	AT5G23070	TK1b, TK2, AtTK1b	TK1b, TK2, AtTK1b	magenta
Me1_v2_0183520	5	2	1	9	AT1G15440	PWP2, ATPWP2	PWP2, ATPWP2	magenta
Me1_v2_0171240	2	10	1	2	AT3G20410	CPK9	CPK9	magenta
Me1_v2_0058440	1	10	1	2	AT4G37080	-	AT4G37080	magenta
Me1_v2_0138790	2	7	5	17	AT4G17650	-	AT4G17650	midnightblue
Me1_v2_0143700	1	6	5	6	AT5G13740	ZIF1	ZIF1	midnightblue
Me1_v2_0087490	2	7	5	10	AT4G27020	-	AT4G27020	midnightblue
Me1_v2_0205000	2	7	5	6	AT1G16250	-	AT1G16250	midnightblue
Me1_v2_0133770	1	2	5	10	NA	NA	Me1_v2_0133770	midnightblue
Me1_v2_0221750	1	7	5	6	AT3G12350	-	AT3G12350	midnightblue
Me1_v2_0214750	2	2	5	6	AT4G36050	APE2	APE2	midnightblue
Me1_v2_0153560	10	7	5	17	AT3G16760	-	AT3G16760	midnightblue
Me1_v2_0058570	1	6	7	10	AT5G22620	-	AT5G22620	midnightblue
Me1_v2_0057290	1	2	5	10	AT1G16010	MGT2, AtMRS2-1, MRS2-1, AtMGT2	MGT2, AtMRS2-1, MRS2-1, AtMGT2	midnightblue
Me1_v2_0052210	1	2	5	6	NA	NA	Me1_v2_0052210	midnightblue
Me1_v2_0223310	1	2	5	17	AT3G62720	XXT1, AtXXT1, ATXT1, XT1	XXT1, AtXXT1, ATXT1, XT1	midnightblue
Me1_v2_0153470	2	2	2	6	AT5G28500	-	AT5G28500	midnightblue
Me1_v2_0105570	2	2	5	6	AT2G34630	GPS1, GPPS	GPS1, GPPS	midnightblue
Me1_v2_0207430	NA	NA	NA	NA	AT1G08410	DIG6, LSG1-2	DIG6, LSG1-2	midnightblue
Me1_v2_0224520	2	2	7	10	NA	NA	Me1_v2_0224520	midnightblue
Me1_v2_0234260	1	6	5	10	AT3G15850	FADB, AtADS3, ADS3, FAD5, JB67	FADB, AtADS3, ADS3, FAD5, JB67	midnightblue
Me1_v2_0120350	10	2	5	10	AT4G21190	emb1417	emb1417	midnightblue
Me1_v2_0149570	1	2	5	10	AT1G11390	ABC1K10a	ABC1K10a	midnightblue
Me1_v2_0098170	2	6	2	6	AT5G15270	-	AT5G15270	midnightblue
Me1_v2_0055710	1	10	1	1	AT5G44310	-	AT5G44310	orange
Me1_v2_0187120	3	10	1	2	NA	NA	Me1_v2_0187120	orange
Me1_v2_0111910	1	10	1	2	NA	NA	Me1_v2_0111910	orange
Me1_v2_0102570	1	12	1	1	AT3G22840	ELIP1, ELIP	ELIP1, ELIP	orange
Me1_v2_0070540	1	10	1	9	NA	NA	Me1_v2_0070540	orange
Me1_v2_0135150	1	10	1	2	NA	NA	Me1_v2_0135150	orange
Me1_v2_0176580	1	4	1	9	NA	NA	Me1_v2_0176580	orange
Me1_v2_0082180	2	11	6	2	AT3G19340	-	AT3G19340	orange
Me1_v2_0110710	3	11	1	2	AT5G45660	-	AT5G45660	orange
Me1_v2_0073090	1	10	1	2	AT1G20620	SEN2, ROG1, ATCAT3, CAT3	SEN2, ROG1, ATCAT3, CAT3	orange
Me1_v2_0166570	3	1	1	7	AT2G18340	LEA13	LEA13	orange
Me1_v2_0203010	3	10	1	1	AT2G40935	-	AT2G40935	orange
Me1_v2_0070080	7	11	1	4	NA	NA	Me1_v2_0070080	orange
Me1_v2_0162510	3	3	6	2	NA	NA	Me1_v2_0162510	orange
Me1_v2_0197330	1	10	1	5	AT3G60750	AtTKL1, TKL1	AtTKL1, TKL1	orange
Me1_v2_0099620	1	10	1	2	AT4G11560	AIPP3, RVR1, BDT1	AIPP3, RVR1, BDT1	orange
Me1_v2_0102720	1	12	6	1	NA	NA	Me1_v2_0102720	orange
Me1_v2_0087500	1	10	1	9	AT1G32400	TOM2A	TOM2A	orange
Me1_v2_0084020	1	10	1	9	AT5G12290	DGS1	DGS1	orange
Me1_v2_0172370	1	11	11	1	AT2G37770	AKR4C9, ChlAKR	AKR4C9, ChlAKR	orange
Me1_v2_0175620	2	11	1	2	NA	NA	Me1_v2_0175620	pink
Me1_v2_0128890	1	3	11	2	AT5G17170	ENH1	ENH1	pink
Me1_v2_0151790	2	11	6	2	AT1G44575	CP22, PSBS, NPQ4	CP22, PSBS, NPQ4	pink
Me1_v2_0132940	2	11	1	2	NA	NA	Me1_v2_0132940	pink
Me1_v2_0175250	6	11	1	2	AT1G74730	RIQ2	RIQ2	pink
Me1_v2_0156660	10	11	6	2	AT1G12250	TL20	TL20	pink
Me1_v2_0209260	10	11	11	2	AT1G55480	ZKT, MET1	ZKT, MET1	pink
Me1_v2_0068140	3	3	1	2	NA	NA	Me1_v2_0068140	pink
Me1_v2_0061870	1	1	1	2	AT1G77290	-	AT1G77290	pink
Me1_v2_0230890	1	10	2	9	AT4G16650	-	AT4G16650	pink
Me1_v2_0142470	2	3	12	2	AT4G14690	ELIP2	ELIP2	pink
Me1_v2_0114070	7	11	11	2	AT1G44575	CP22, PSBS, NPQ4	CP22, PSBS, NPQ4	pink
Me1_v2_0081130	3	11	6	2	NA	NA	Me1_v2_0081130	pink
Me1_v2_0158060	10	11	1	2	AT3G12345	-	AT3G12345	pink
Me1_v2_0082250	1	3	12	2	AT1G71500	PSB33, LIL8	PSB33, LIL8	pink
Me1_v2_0109190	10	3	1	2	AT1G50320	ATHX, ATX, THX	ATHX, ATX, THX	pink
Me1_v2_0119020	10	11	1	2	AT1G16720	HCF173	HCF173	pink
Me1_v2_0214830	3	3	6	2	AT4G17300	NS1, ATNS1, OVA8	NS1, ATNS1, OVA8	pink
Me1_v2_0109620	2	11	11	2	AT4G20760	-	AT4G20760	pink
Me1_v2_0224290	1	1	1	2	AT4G02900	OSCA1	OSCA1	pink
Me1_v2_0221800	2	2	5	6	NA	NA	Me1_v2_0221800	purple
Me1_v2_0169070	1	9	5	6	AT5G58760	DDB2	DDB2	purple
Me1_v2_0138760	2	2	5	6	AT4G10180	DET1, FUS2, ATDET1	DET1, FUS2, ATDET1	purple
Me1_v2_0129340	10	2	5	6	AT5G56090	COX15	COX15	purple
Me1_v2_0105020	1	2	2	6	AT4G07990	-	AT4G07990	purple
Me1_v2_0130150	1	7	5	6	AT3G51790	AtCCME, ATG1, G1	AtCCME, ATG1, G1	purple
Me1_v2_0221790	1	2	5	6	AT5G10720	HK5, CKI2, AHK5	HK5, CKI2, AHK5	purple
Me1_v2_0105010	2	2	5	6	NA	NA	Me1_v2_0105010	purple
Me1_v2_0169060	1	9	5	6	AT5G58760	DDB2	DDB2	purple
Me1_v2_0137640	2	2	5	6	AT5G64460	-	AT5G64460	purple
Me1_v2_0094620	1	2	2	6	NA	NA	Me1_v2_0094620	purple
Me1_v2_0234710	1	2	5	6	AT5G24810	ABC1K11	ABC1K11	purple
Me1_v2_0114140	10	4	2	6	AT1G30100	NCED5, ATNCED5	NCED5, ATNCED5	purple
Me1_v2_0146310	2	2	5	6	AT5G42310	CRP1	CRP1	purple
Me1_v2_0110820	2	2	2	9	AT5G50840	-	AT5G50840	purple
Me1_v2_0134680	10	2	2	6	AT5G20140	HBP5, AtHBP5	HBP5, AtHBP5	purple
Me1_v2_0067730	2	2	7	6	AT4G11640	SR, ATSR	SR, ATSR	purple
Me1_v2_0221810	2	7	5	6	NA	NA	Me1_v2_0221810	purple
Me1_v2_0176940	2	2	5	6	AT2G40090	ABC1K15, ATH9, ATATH9	ABC1K15, ATH9, ATATH9	purple
Me1_v2_0034150	2	7	5	6	AT5G35750	AHK2, HK2	AHK2, HK2	purple
Me1_v2_0105300	5	10	1	2	AT1G07370	PCNA1, ATPCNA1	PCNA1, ATPCNA1	red
Me1_v2_0101320	14	10	1	2	AT1G67780	DDR3	DDR3	red
Me1_v2_0228340	8	2	1	2	NA	NA	Me1_v2_0228340	red
Me1_v2_0037640	14	10	1	2	NA	NA	Me1_v2_0037640	red
Me1_v2_0070870	14	11	1	2	AT1G67370	ATASY1, ASY1	ATASY1, ASY1	red
Me1_v2_0224940	5	10	1	2	AT1G56710	PGL1	PGL1	red
Me1_v2_0184620	14	10	1	2	AT5G41880	POLA3, POLA4	POLA3, POLA4	red
Me1_v2_0108870	11	4	1	9	AT5G05010	-	AT5G05010	red
Me1_v2_0142810	10	10	1	2	AT5G23420	HMGB6	HMGB6	red
Me1_v2_0204130	11	10	1	9	AT5G39320	UDG4	UDG4	red
Me1_v2_0107320	5	1	1	2	NA	NA	Me1_v2_0107320	red
Me1_v2_0205400	11	10	1	2	AT5G49160	MET2, MET1, DDM2, DMT01, DMT1, METI	MET2, MET1, DDM2, DMT01, DMT1, METI	red
Me1_v2_0137350	5	10	1	2	AT3G46940	DUT1	DUT1	red
Me1_v2_0064590	5	10	1	9	AT3G62110	PGF10, PLY	PGF10, PLY	red
Me1_v2_0115390	12	10	6	2	AT1G58350	ZW18	ZW18	red
Me1_v2_0102350	4	1	1	2	AT4G37900	AtGRDP2, GRDP2	AtGRDP2, GRDP2	red
Me1_v2_0147440	16	1	1	2	NA	NA	Me1_v2_0147440	red
Me1_v2_0154070	12	10	6	2	AT1G52740	HTA9, H2A.Z	HTA9, H2A.Z	red
Me1_v2_0056580	1	1	2	9	AT3G53950	GOXL2	GOXL2	red
Me1_v2_0178040	2	1	1	2	AT5G18990	-	AT5G18990	red
Me1_v2_0096110	16	5	9	3	NA	NA	Me1_v2_0096110	royalblue
Me1_v2_0001420	16	5	9	3	NA	NA	Me1_v2_0001420	royalblue
Me1_v2_0096120	16	5	9	3	NA	NA	Me1_v2_0096120	royalblue
Me1_v2_0134300	12	3	7	3	NA	NA	Me1_v2_0134300	royalblue
Me1_v2_0025960	12	5	9	8	NA	NA	Me1_v2_0025960	royalblue
Me1_v2_0054260	12	5	9	8	AT5G57580	CBP60b	CBP60b	royalblue
Me1_v2_0000840	12	5	9	3	NA	NA	Me1_v2_0000840	royalblue
Me1_v2_0165660	16	3	9	3	AT3G18290	EMB2454, BTS	EMB2454, BTS	royalblue
Me1_v2_0099920	4	8	9	3	NA	NA	Me1_v2_0099920	royalblue
Me1_v2_0178180	16	3	11	3	NA	NA	Me1_v2_0178180	royalblue
Me1_v2_0187190	5	3	9	4	NA	NA	Me1_v2_0187190	royalblue
Me1_v2_0010860	4	3	9	3	NA	NA	Me1_v2_0010860	royalblue
Me1_v2_0084510	14	3	9	4	AT4G34980	SLP2	SLP2	royalblue
Me1_v2_0111060	4	12	9	3	NA	NA	Me1_v2_0111060	royalblue
Me1_v2_0111070	4	3	9	3	AT4G22260	IM1, IM, PTOX	IM1, IM, PTOX	royalblue
Me1_v2_0134290	13	3	7	8	AT2G36670	-	AT2G36670	royalblue
Me1_v2_0085130	12	3	11	3	AT4G36650	PBRP, ATPBRP	PBRP, ATPBRP	royalblue
Me1_v2_0176700	13	12	9	3	AT3G28030	UVR1, UVH3	UVR1, UVH3	royalblue
Me1_v2_0122620	13	3	9	3	NA	NA	Me1_v2_0122620	royalblue
Me1_v2_0063320	NA	NA	NA	NA	AT5G39710	EMB2745	EMB2745	royalblue
Me1_v2_0094000	13	3	11	4	NA	NA	Me1_v2_0094000	salmon
Me1_v2_0166090	4	3	11	1	AT1G68010	HPR, ATHPR1	HPR, ATHPR1	salmon
Me1_v2_0121480	13	11	11	1	AT4G18810	-	AT4G18810	salmon
Me1_v2_0086290	12	11	11	1	AT1G32080	AtLrgB, LrgB, PLGG, PLGG1	AtLrgB, LrgB, PLGG, PLGG1	salmon
Me1_v2_0159930	13	3	11	4	AT5G03455	ACR2, AtACR2, CDC25, ARATH;CDC25	ACR2, AtACR2, CDC25, ARATH;CDC25	salmon
Me1_v2_0122630	12	3	11	4	AT2G45870	VCCN2	VCCN2	salmon
Me1_v2_0161900	16	11	11	1	AT5G63840	GSCIIalpha, PSL5, RSW3	GSCIIalpha, PSL5, RSW3	salmon
Me1_v2_0187280	4	3	6	1	AT4G25290	-	AT4G25290	salmon
Me1_v2_0062510	15	11	6	1	AT3G53180	NodGS	NodGS	salmon
Me1_v2_0086280	12	11	6	1	AT1G32080	AtLrgB, LrgB, PLGG, PLGG1	AtLrgB, LrgB, PLGG, PLGG1	salmon
Me1_v2_0069260	4	3	11	4	AT1G09340	CRB, CSP41B, HIP1	CRB, CSP41B, HIP1	salmon
Me1_v2_0187290	4	3	11	1	AT4G25290	-	AT4G25290	salmon
Me1_v2_0214880	4	3	11	4	AT3G52880	ATMDAR1, MDAR1	ATMDAR1, MDAR1	salmon
Me1_v2_0227990	13	11	11	1	AT5G13720	-	AT5G13720	salmon
Me1_v2_0203620	13	3	6	1	AT3G02720	DJ1D, DJ-1d	DJ1D, DJ-1d	salmon
Me1_v2_0187300	7	3	1	1	NA	NA	Me1_v2_0187300	salmon
Me1_v2_0137260	4	3	6	1	NA	NA	Me1_v2_0137260	salmon
Me1_v2_0145290	4	11	6	1	NA	NA	Me1_v2_0145290	salmon
Me1_v2_0141270	13	3	11	1	AT1G42970	GAPB	GAPB	salmon
Me1_v2_0169660	13	11	11	4	NA	NA	Me1_v2_0169660	salmon
Me1_v2_0217440	5	2	7	3	AT5G44800	CHR4, PKR1	CHR4, PKR1	tan
Me1_v2_0144530	7	6	7	8	AT5G24350	MIP2	MIP2	tan
Me1_v2_0200950	9	2	7	3	AT4G00800	SETH5, VPS8	SETH5, VPS8	tan
Me1_v2_0094300	5	6	9	8	AT3G17850	IREH1	IREH1	tan
Me1_v2_0038810	5	6	7	12	AT5G24350	MIP2	MIP2	tan
Me1_v2_0007070	16	2	9	3	NA	NA	Me1_v2_0007070	tan
Me1_v2_0080630	2	6	7	3	AT2G25320	-	AT2G25320	tan
Me1_v2_0072140	9	6	7	8	AT5G23110	-	AT5G23110	tan
Me1_v2_0182980	5	7	7	3	AT4G31160	DCAF1	DCAF1	tan
Me1_v2_0143450	5	2	7	3	AT2G22010	RKP	RKP	tan
Me1_v2_0150750	2	6	7	3	AT4G17140	-	AT4G17140	tan
Me1_v2_0182970	5	6	9	3	NA	NA	Me1_v2_0182970	tan
Me1_v2_0138290	6	6	9	3	AT5G02310	GED1, PRT6	GED1, PRT6	tan
Me1_v2_0100130	2	7	7	8	AT3G21290	CARP9	CARP9	tan
Me1_v2_0120150	5	7	7	8	AT1G31810	AtFH14, AFH14	AtFH14, AFH14	tan
Me1_v2_0140900	2	6	7	3	AT1G24706	EMB2793, AtTHO2, THO2	EMB2793, AtTHO2, THO2	tan
Me1_v2_0012630	2	9	7	3	AT2G25320	-	AT2G25320	tan
Me1_v2_0157980	5	6	7	8	AT1G33390	ATFAS4, FAS4	ATFAS4, FAS4	tan
Me1_v2_0119330	9	7	9	3	AT1G64790	GCN1, NOXY7, ILA	GCN1, NOXY7, ILA	tan
Me1_v2_0150800	2	2	7	3	AT4G17140	-	AT4G17140	tan
Me1_v2_0141750	14	6	5	6	AT5G05670	-	AT5G05670	turquoise
Me1_v2_0230910	14	7	5	10	AT1G02090	FUS5, CSN7, COP15, ATCSN7	FUS5, CSN7, COP15, ATCSN7	turquoise
Me1_v2_0234330	12	7	5	10	AT4G22140	EBS	EBS	turquoise
Me1_v2_0204960	14	2	5	6	AT5G07960	-	AT5G07960	turquoise
Me1_v2_0199910	11	2	5	6	NA	NA	Me1_v2_0199910	turquoise
Me1_v2_0216150	12	2	5	6	AT1G20270	-	AT1G20270	turquoise
Me1_v2_0219610	14	2	5	6	AT2G46110	PANB1, KPHMT1	PANB1, KPHMT1	turquoise
Me1_v2_0174080	14	2	5	10	AT3G44600	CYP71, AtCYP71	CYP71, AtCYP71	turquoise
Me1_v2_0163530	11	6	5	6	AT1G53530	AtIMP1a	AtIMP1a	turquoise
Me1_v2_0187340	11	7	5	6	AT4G11160	-	AT4G11160	turquoise
Me1_v2_0117130	14	6	7	10	AT4G04950	AtGRXS17, GRXS17	AtGRXS17, GRXS17	turquoise
Me1_v2_0040810	7	2	5	6	AT5G47720	AACT1	AACT1	turquoise
Me1_v2_0110730	14	2	5	6	AT5G06240	emb2735	emb2735	turquoise
Me1_v2_0200840	12	6	5	6	AT5G47720	AACT1	AACT1	turquoise
Me1_v2_0202140	14	2	5	10	AT3G05760	-	AT3G05760	turquoise
Me1_v2_0147920	5	2	5	17	NA	NA	Me1_v2_0147920	turquoise
Me1_v2_0168400	9	2	5	6	AT2G01270	QSOX2, AtQSOX2	QSOX2, AtQSOX2	turquoise
Me1_v2_0205610	14	6	5	6	AT5G16440	IPP1	IPP1	turquoise
Me1_v2_0162490	12	2	2	6	AT5G04490	VTE5	VTE5	turquoise
Me1_v2_0106010	7	2	5	10	AT5G35080	OS9, AtOS9	OS9, AtOS9	turquoise
Me1_v2_0072470	11	10	1	2	AT2G03390	-	AT2G03390	yellow
Me1_v2_0143900	3	1	6	2	NA	NA	Me1_v2_0143900	yellow
Me1_v2_0201920	15	11	6	2	AT1G21080	-	AT1G21080	yellow
Me1_v2_0195230	7	10	1	2	NA	NA	Me1_v2_0195230	yellow
Me1_v2_0096680	2	10	1	2	AT1G69530	AT-EXP1, ATHEXP ALPHA 1, EXP1, ATEXPA1, EXPA1, ATEXP1	AT-EXP1, ATHEXP ALPHA 1, EXP1, ATEXPA1, EXPA1, ATEXP1	yellow
Me1_v2_0211730	11	1	1	2	AT1G77760	NR1, GNR1, NIA1	NR1, GNR1, NIA1	yellow
Me1_v2_0138140	8	1	1	2	AT5G50200	WR3, NRT3, ATNRT3	WR3, NRT3, ATNRT3	yellow
Me1_v2_0197170	7	11	1	2	NA	NA	Me1_v2_0197170	yellow
Me1_v2_0212950	4	11	1	2	AT2G28100	ATFUC1, FUC1	ATFUC1, FUC1	yellow
Me1_v2_0090070	3	1	6	2	NA	NA	Me1_v2_0090070	yellow
Me1_v2_0141440	4	1	1	2	AT5G28680	ANX2	ANX2	yellow
Me1_v2_0088610	3	3	1	2	NA	NA	Me1_v2_0088610	yellow
Me1_v2_0160360	7	11	6	2	NA	NA	Me1_v2_0160360	yellow
Me1_v2_0058400	15	11	6	2	AT1G12940	ATNRT2, NRT2	ATNRT2, NRT2	yellow
Me1_v2_0193480	13	11	6	2	AT3G15730	PLD, PLDALPHA1	PLD, PLDALPHA1	yellow
Me1_v2_0176090	12	11	6	2	AT5G49650	XK2, XK-2	XK2, XK-2	yellow
Me1_v2_0112820	13	11	1	2	NA	NA	Me1_v2_0112820	yellow
Me1_v2_0209040	14	11	6	2	AT3G52390	-	AT3G52390	yellow
Me1_v2_0209240	12	11	1	2	AT2G28130	ASAP1	ASAP1	yellow
Me1_v2_0234580	12	11	1	2	NA	NA	Me1_v2_0234580	yellow
