"","ID","Description","GeneRatio","BgRatio","pvalue","p.adjust","qvalue","geneID","Count"
"GO:0090305","GO:0090305","nucleic acid phosphodiester bond hydrolysis","3/15","43/1957",0.00374165005584389,0.457921478295942,0.457921478295942,"Zci_03586/Zci_04477/Zci_13022",3
"GO:0009057","GO:0009057","macromolecule catabolic process","3/15","83/1957",0.0231394481295056,0.457921478295942,0.457921478295942,"Zci_06970/Zci_05468/Zci_13022",3
"GO:0016192","GO:0016192","vesicle-mediated transport","2/15","54/1957",0.0623822347235736,0.457921478295942,0.457921478295942,"Zci_05662/Zci_05468",2
"GO:0009314","GO:0009314","response to radiation","3/15","123/1957",0.0632836327769831,0.457921478295942,0.457921478295942,"Zci_11373/Zci_04477/Zci_12354",3
"GO:0090304","GO:0090304","nucleic acid metabolic process","4/15","206/1957",0.0642615797971751,0.457921478295942,0.457921478295942,"Zci_03586/Zci_04477/Zci_16574/Zci_13022",4
"GO:0030163","GO:0030163","protein catabolic process","2/15","55/1957",0.064452362769331,0.457921478295942,0.457921478295942,"Zci_06970/Zci_05468",2
"GO:0016070","GO:0016070","RNA metabolic process","3/15","125/1957",0.0658323021836111,0.457921478295942,0.457921478295942,"Zci_03586/Zci_16574/Zci_13022",3
"GO:0009966","GO:0009966","regulation of signal transduction","2/15","57/1957",0.0686639610724128,0.457921478295942,0.457921478295942,"Zci_11373/Zci_04477",2
"GO:0000956","GO:0000956","nuclear-transcribed mRNA catabolic process","1/15","10/1957",0.0742225176528732,0.457921478295942,0.457921478295942,"Zci_13022",1
"GO:0001933","GO:0001933","negative regulation of protein phosphorylation","1/15","10/1957",0.0742225176528732,0.457921478295942,0.457921478295942,"Zci_11373",1
"GO:0006402","GO:0006402","mRNA catabolic process","1/15","10/1957",0.0742225176528732,0.457921478295942,0.457921478295942,"Zci_13022",1
"GO:0009788","GO:0009788","negative regulation of abscisic acid-activated signaling pathway","1/15","10/1957",0.0742225176528732,0.457921478295942,0.457921478295942,"Zci_11373",1
"GO:0010212","GO:0010212","response to ionizing radiation","1/15","10/1957",0.0742225176528732,0.457921478295942,0.457921478295942,"Zci_04477",1
"GO:0010563","GO:0010563","negative regulation of phosphorus metabolic process","1/15","10/1957",0.0742225176528732,0.457921478295942,0.457921478295942,"Zci_11373",1
"GO:0030587","GO:0030587","sorocarp development","1/15","10/1957",0.0742225176528732,0.457921478295942,0.457921478295942,"Zci_05468",1
"GO:0042326","GO:0042326","negative regulation of phosphorylation","1/15","10/1957",0.0742225176528732,0.457921478295942,0.457921478295942,"Zci_11373",1
"GO:0045936","GO:0045936","negative regulation of phosphate metabolic process","1/15","10/1957",0.0742225176528732,0.457921478295942,0.457921478295942,"Zci_11373",1
"GO:0051604","GO:0051604","protein maturation","1/15","10/1957",0.0742225176528732,0.457921478295942,0.457921478295942,"Zci_09252",1
"GO:0099120","GO:0099120","socially cooperative development","1/15","10/1957",0.0742225176528732,0.457921478295942,0.457921478295942,"Zci_05468",1
"GO:1901420","GO:1901420","negative regulation of response to alcohol","1/15","10/1957",0.0742225176528732,0.457921478295942,0.457921478295942,"Zci_11373",1
"GO:1905958","GO:1905958","negative regulation of cellular response to alcohol","1/15","10/1957",0.0742225176528732,0.457921478295942,0.457921478295942,"Zci_11373",1
"GO:0010646","GO:0010646","regulation of cell communication","2/15","60/1957",0.0751533088129037,0.457921478295942,0.457921478295942,"Zci_11373/Zci_04477",2
"GO:0023051","GO:0023051","regulation of signaling","2/15","60/1957",0.0751533088129037,0.457921478295942,0.457921478295942,"Zci_11373/Zci_04477",2
"GO:0044265","GO:0044265","cellular macromolecule catabolic process","2/15","61/1957",0.0773606006389174,0.457921478295942,0.457921478295942,"Zci_05468/Zci_13022",2
"GO:0000075","GO:0000075","cell cycle checkpoint signaling","1/15","11/1957",0.0813548557295076,0.457921478295942,0.457921478295942,"Zci_04477",1
"GO:0006401","GO:0006401","RNA catabolic process","1/15","11/1957",0.0813548557295076,0.457921478295942,0.457921478295942,"Zci_13022",1
"GO:0006888","GO:0006888","endoplasmic reticulum to Golgi vesicle-mediated transport","1/15","11/1957",0.0813548557295076,0.457921478295942,0.457921478295942,"Zci_05662",1
"GO:0016441","GO:0016441","post-transcriptional gene silencing","1/15","11/1957",0.0813548557295076,0.457921478295942,0.457921478295942,"Zci_13022",1
"GO:1901575","GO:1901575","organic substance catabolic process","3/15","139/1957",0.0850242073497515,0.457921478295942,0.457921478295942,"Zci_06970/Zci_05468/Zci_13022",3
"GO:0006897","GO:0006897","endocytosis","1/15","12/1957",0.0884358820214177,0.457921478295942,0.457921478295942,"Zci_05468",1
"GO:0009648","GO:0009648","photoperiodism","1/15","12/1957",0.0884358820214177,0.457921478295942,0.457921478295942,"Zci_12354",1
"GO:0042548","GO:0042548","regulation of photosynthesis, light reaction","1/15","12/1957",0.0884358820214177,0.457921478295942,0.457921478295942,"Zci_11373",1
"GO:0043467","GO:0043467","regulation of generation of precursor metabolites and energy","1/15","12/1957",0.0884358820214177,0.457921478295942,0.457921478295942,"Zci_11373",1
"GO:0006974","GO:0006974","cellular response to DNA damage stimulus","2/15","66/1957",0.0887100373220055,0.457921478295942,0.457921478295942,"Zci_02885/Zci_04477",2
"GO:0019538","GO:0019538","protein metabolic process","5/15","326/1957",0.0888065451858241,0.457921478295942,0.457921478295942,"Zci_11373/Zci_06970/Zci_04888/Zci_09252/Zci_05468",5
"GO:0010016","GO:0010016","shoot system morphogenesis","1/15","13/1957",0.0954659394865482,0.457921478295942,0.457921478295942,"Zci_13022",1
"GO:0031348","GO:0031348","negative regulation of defense response","1/15","13/1957",0.0954659394865482,0.457921478295942,0.457921478295942,"Zci_02885",1
"GO:0031400","GO:0031400","negative regulation of protein modification process","1/15","13/1957",0.0954659394865482,0.457921478295942,0.457921478295942,"Zci_11373",1
"GO:0043086","GO:0043086","negative regulation of catalytic activity","1/15","13/1957",0.0954659394865482,0.457921478295942,0.457921478295942,"Zci_11373",1
"GO:0051703","GO:0051703","biological process involved in intraspecies interaction between organisms","1/15","13/1957",0.0954659394865482,0.457921478295942,0.457921478295942,"Zci_05468",1
"GO:0048856","GO:0048856","anatomical structure development","5/15","338/1957",0.100674589693429,0.457921478295942,0.457921478295942,"Zci_11373/Zci_09252/Zci_12354/Zci_05468/Zci_13022",5
"GO:0009056","GO:0009056","catabolic process","3/15","150/1957",0.101683764212416,0.457921478295942,0.457921478295942,"Zci_06970/Zci_05468/Zci_13022",3
"GO:0044260","GO:0044260","cellular macromolecule metabolic process","6/15","450/1957",0.106985320495603,0.457921478295942,0.457921478295942,"Zci_11373/Zci_04888/Zci_09252/Zci_04477/Zci_05468/Zci_13022",6
"GO:0010109","GO:0010109","regulation of photosynthesis","1/15","15/1957",0.10937450919511,0.457921478295942,0.457921478295942,"Zci_11373",1
"GO:0010228","GO:0010228","vegetative to reproductive phase transition of meristem","1/15","15/1957",0.10937450919511,0.457921478295942,0.457921478295942,"Zci_12354",1
"GO:0045786","GO:0045786","negative regulation of cell cycle","1/15","15/1957",0.10937450919511,0.457921478295942,0.457921478295942,"Zci_04477",1
"GO:0009787","GO:0009787","regulation of abscisic acid-activated signaling pathway","1/15","16/1957",0.116253696817186,0.457921478295942,0.457921478295942,"Zci_11373",1
"GO:0046148","GO:0046148","pigment biosynthetic process","1/15","16/1957",0.116253696817186,0.457921478295942,0.457921478295942,"Zci_12354",1
"GO:1901419","GO:1901419","regulation of response to alcohol","1/15","16/1957",0.116253696817186,0.457921478295942,0.457921478295942,"Zci_11373",1
"GO:1905957","GO:1905957","regulation of cellular response to alcohol","1/15","16/1957",0.116253696817186,0.457921478295942,0.457921478295942,"Zci_11373",1
"GO:0032502","GO:0032502","developmental process","5/15","354/1957",0.117805323290426,0.457921478295942,0.457921478295942,"Zci_11373/Zci_09252/Zci_12354/Zci_05468/Zci_13022",5
"GO:0009553","GO:0009553","embryo sac development","1/15","17/1957",0.123083266393561,0.457921478295942,0.457921478295942,"Zci_09252",1
"GO:0009967","GO:0009967","positive regulation of signal transduction","1/15","17/1957",0.123083266393561,0.457921478295942,0.457921478295942,"Zci_04477",1
"GO:0098657","GO:0098657","import into cell","1/15","17/1957",0.123083266393561,0.457921478295942,0.457921478295942,"Zci_05468",1
"GO:0023056","GO:0023056","positive regulation of signaling","1/15","18/1957",0.129863550416291,0.457921478295942,0.457921478295942,"Zci_04477",1
"GO:0065009","GO:0065009","regulation of molecular function","2/15","85/1957",0.135875007316287,0.457921478295942,0.457921478295942,"Zci_11373/Zci_05662",2
"GO:0010647","GO:0010647","positive regulation of cell communication","1/15","19/1957",0.136594879319723,0.457921478295942,0.457921478295942,"Zci_04477",1
"GO:0044092","GO:0044092","negative regulation of molecular function","1/15","19/1957",0.136594879319723,0.457921478295942,0.457921478295942,"Zci_11373",1
"GO:0045859","GO:0045859","regulation of protein kinase activity","1/15","19/1957",0.136594879319723,0.457921478295942,0.457921478295942,"Zci_11373",1
"GO:1902531","GO:1902531","regulation of intracellular signal transduction","1/15","19/1957",0.136594879319723,0.457921478295942,0.457921478295942,"Zci_04477",1
"GO:0048519","GO:0048519","negative regulation of biological process","3/15","172/1957",0.138759764413921,0.457921478295942,0.457921478295942,"Zci_11373/Zci_04477/Zci_13022",3
"GO:0043549","GO:0043549","regulation of kinase activity","1/15","20/1957",0.143277581492171,0.457921478295942,0.457921478295942,"Zci_11373",1
"GO:1901565","GO:1901565","organonitrogen compound catabolic process","2/15","88/1957",0.143801923558284,0.457921478295942,0.457921478295942,"Zci_06970/Zci_05468",2
"GO:0006139","GO:0006139","nucleobase-containing compound metabolic process","4/15","273/1957",0.145456518114086,0.457921478295942,0.457921478295942,"Zci_03586/Zci_04477/Zci_16574/Zci_13022",4
"GO:0007275","GO:0007275","multicellular organism development","4/15","275/1957",0.148374557358248,0.457921478295942,0.457921478295942,"Zci_11373/Zci_09252/Zci_12354/Zci_13022",4
"GO:0010605","GO:0010605","negative regulation of macromolecule metabolic process","2/15","90/1957",0.149146230323177,0.457921478295942,0.457921478295942,"Zci_11373/Zci_13022",2
"GO:0007346","GO:0007346","regulation of mitotic cell cycle","1/15","21/1957",0.149911983287534,0.457921478295942,0.457921478295942,"Zci_04477",1
"GO:0016072","GO:0016072","rRNA metabolic process","1/15","21/1957",0.149911983287534,0.457921478295942,0.457921478295942,"Zci_16574",1
"GO:0032269","GO:0032269","negative regulation of cellular protein metabolic process","1/15","21/1957",0.149911983287534,0.457921478295942,0.457921478295942,"Zci_11373",1
"GO:0043067","GO:0043067","regulation of programmed cell death","1/15","21/1957",0.149911983287534,0.457921478295942,0.457921478295942,"Zci_04477",1
"GO:0043161","GO:0043161","proteasome-mediated ubiquitin-dependent protein catabolic process","1/15","21/1957",0.149911983287534,0.457921478295942,0.457921478295942,"Zci_05468",1
"GO:0048193","GO:0048193","Golgi vesicle transport","1/15","21/1957",0.149911983287534,0.457921478295942,0.457921478295942,"Zci_05662",1
"GO:0070925","GO:0070925","organelle assembly","1/15","21/1957",0.149911983287534,0.457921478295942,0.457921478295942,"Zci_05468",1
"GO:0010498","GO:0010498","proteasomal protein catabolic process","1/15","22/1957",0.156498409036856,0.457921478295942,0.457921478295942,"Zci_05468",1
"GO:0009892","GO:0009892","negative regulation of metabolic process","2/15","95/1957",0.16269844544802,0.457921478295942,0.457921478295942,"Zci_11373/Zci_13022",2
"GO:0040029","GO:0040029","regulation of gene expression, epigenetic","1/15","23/1957",0.163037181059826,0.457921478295942,0.457921478295942,"Zci_13022",1
"GO:0051338","GO:0051338","regulation of transferase activity","1/15","23/1957",0.163037181059826,0.457921478295942,0.457921478295942,"Zci_11373",1
"GO:0010941","GO:0010941","regulation of cell death","1/15","24/1957",0.169528619676219,0.457921478295942,0.457921478295942,"Zci_04477",1
"GO:0051248","GO:0051248","negative regulation of protein metabolic process","1/15","24/1957",0.169528619676219,0.457921478295942,0.457921478295942,"Zci_11373",1
"GO:0071478","GO:0071478","cellular response to radiation","1/15","24/1957",0.169528619676219,0.457921478295942,0.457921478295942,"Zci_04477",1
"GO:0080135","GO:0080135","regulation of cellular response to stress","1/15","24/1957",0.169528619676219,0.457921478295942,0.457921478295942,"Zci_04477",1
"GO:0043412","GO:0043412","macromolecule modification","4/15","291/1957",0.172624026020416,0.457921478295942,0.457921478295942,"Zci_11373/Zci_03586/Zci_04888/Zci_09252",4
"GO:0010608","GO:0010608","post-transcriptional regulation of gene expression","1/15","25/1957",0.175973043217272,0.457921478295942,0.457921478295942,"Zci_13022",1
"GO:0034655","GO:0034655","nucleobase-containing compound catabolic process","1/15","26/1957",0.182370768037013,0.457921478295942,0.457921478295942,"Zci_13022",1
"GO:0042440","GO:0042440","pigment metabolic process","1/15","26/1957",0.182370768037013,0.457921478295942,0.457921478295942,"Zci_12354",1
"GO:0044267","GO:0044267","cellular protein metabolic process","4/15","299/1957",0.185320005407255,0.457921478295942,0.457921478295942,"Zci_11373/Zci_04888/Zci_09252/Zci_05468",4
"GO:0009968","GO:0009968","negative regulation of signal transduction","1/15","27/1957",0.188722108523521,0.457921478295942,0.457921478295942,"Zci_11373",1
"GO:0018205","GO:0018205","peptidyl-lysine modification","1/15","27/1957",0.188722108523521,0.457921478295942,0.457921478295942,"Zci_09252",1
"GO:0045892","GO:0045892","negative regulation of transcription, DNA-templated","1/15","27/1957",0.188722108523521,0.457921478295942,0.457921478295942,"Zci_02885",1
"GO:0001932","GO:0001932","regulation of protein phosphorylation","1/15","28/1957",0.195027377110125,0.457921478295942,0.457921478295942,"Zci_11373",1
"GO:0006364","GO:0006364","rRNA processing","1/15","28/1957",0.195027377110125,0.457921478295942,0.457921478295942,"Zci_16574",1
"GO:0010648","GO:0010648","negative regulation of cell communication","1/15","28/1957",0.195027377110125,0.457921478295942,0.457921478295942,"Zci_11373",1
"GO:0023057","GO:0023057","negative regulation of signaling","1/15","28/1957",0.195027377110125,0.457921478295942,0.457921478295942,"Zci_11373",1
"GO:0046483","GO:0046483","heterocycle metabolic process","4/15","305/1957",0.195074829193408,0.457921478295942,0.457921478295942,"Zci_03586/Zci_04477/Zci_16574/Zci_13022",4
"GO:0032501","GO:0032501","multicellular organismal process","4/15","307/1957",0.198368977619918,0.457921478295942,0.457921478295942,"Zci_11373/Zci_09252/Zci_12354/Zci_13022",4
"GO:0042325","GO:0042325","regulation of phosphorylation","1/15","29/1957",0.201286884286563,0.457921478295942,0.457921478295942,"Zci_11373",1
"GO:0048507","GO:0048507","meristem development","1/15","29/1957",0.201286884286563,0.457921478295942,0.457921478295942,"Zci_13022",1
"GO:0006725","GO:0006725","cellular aromatic compound metabolic process","4/15","312/1957",0.206694114244996,0.457921478295942,0.457921478295942,"Zci_03586/Zci_04477/Zci_16574/Zci_13022",4
"GO:0009451","GO:0009451","RNA modification","1/15","30/1957",0.207500938610059,0.457921478295942,0.457921478295942,"Zci_03586",1
"GO:0009644","GO:0009644","response to high light intensity","1/15","30/1957",0.207500938610059,0.457921478295942,0.457921478295942,"Zci_11373",1
"GO:0042254","GO:0042254","ribosome biogenesis","1/15","30/1957",0.207500938610059,0.457921478295942,0.457921478295942,"Zci_16574",1
"GO:0006511","GO:0006511","ubiquitin-dependent protein catabolic process","1/15","31/1957",0.213669846716364,0.457921478295942,0.457921478295942,"Zci_05468",1
"GO:0019941","GO:0019941","modification-dependent protein catabolic process","1/15","31/1957",0.213669846716364,0.457921478295942,0.457921478295942,"Zci_05468",1
"GO:0009416","GO:0009416","response to light stimulus","2/15","114/1957",0.21614489271746,0.457921478295942,0.457921478295942,"Zci_11373/Zci_12354",2
"GO:0048608","GO:0048608","reproductive structure development","2/15","114/1957",0.21614489271746,0.457921478295942,0.457921478295942,"Zci_12354/Zci_13022",2
"GO:0061458","GO:0061458","reproductive system development","2/15","114/1957",0.21614489271746,0.457921478295942,0.457921478295942,"Zci_12354/Zci_13022",2
"GO:0034641","GO:0034641","cellular nitrogen compound metabolic process","4/15","318/1957",0.216847229554244,0.457921478295942,0.457921478295942,"Zci_03586/Zci_04477/Zci_16574/Zci_13022",4
"GO:0006470","GO:0006470","protein dephosphorylation","1/15","32/1957",0.219793913330723,0.457921478295942,0.457921478295942,"Zci_11373",1
"GO:0034470","GO:0034470","ncRNA processing","1/15","32/1957",0.219793913330723,0.457921478295942,0.457921478295942,"Zci_16574",1
"GO:0048731","GO:0048731","system development","3/15","214/1957",0.220653828861706,0.457921478295942,0.457921478295942,"Zci_11373/Zci_12354/Zci_13022",3
"GO:0019220","GO:0019220","regulation of phosphate metabolic process","1/15","33/1957",0.225873441278795,0.457921478295942,0.457921478295942,"Zci_11373",1
"GO:0051174","GO:0051174","regulation of phosphorus metabolic process","1/15","33/1957",0.225873441278795,0.457921478295942,0.457921478295942,"Zci_11373",1
"GO:0010467","GO:0010467","gene expression","2/15","119/1957",0.230575703396218,0.457921478295942,0.457921478295942,"Zci_09252/Zci_16574",2
"GO:0048523","GO:0048523","negative regulation of cellular process","2/15","119/1957",0.230575703396218,0.457921478295942,0.457921478295942,"Zci_11373/Zci_04477",2
"GO:1901360","GO:1901360","organic cyclic compound metabolic process","4/15","326/1957",0.230645291403592,0.457921478295942,0.457921478295942,"Zci_03586/Zci_04477/Zci_16574/Zci_13022",4
"GO:0009738","GO:0009738","abscisic acid-activated signaling pathway","1/15","34/1957",0.231908731497515,0.457921478295942,0.457921478295942,"Zci_11373",1
"GO:0071214","GO:0071214","cellular response to abiotic stimulus","1/15","34/1957",0.231908731497515,0.457921478295942,0.457921478295942,"Zci_04477",1
"GO:0104004","GO:0104004","cellular response to environmental stimulus","1/15","34/1957",0.231908731497515,0.457921478295942,0.457921478295942,"Zci_04477",1
"GO:0043632","GO:0043632","modification-dependent macromolecule catabolic process","1/15","35/1957",0.237900083045897,0.465804364283143,0.465804364283143,"Zci_05468",1
"GO:0010119","GO:0010119","regulation of stomatal movement","1/15","36/1957",0.243847793115778,0.469062153529593,0.469062153529593,"Zci_11373",1
"GO:0048583","GO:0048583","regulation of response to stimulus","2/15","124/1957",0.245103744982696,0.469062153529593,0.469062153529593,"Zci_11373/Zci_04477",2
"GO:1901564","GO:1901564","organonitrogen compound metabolic process","5/15","448/1957",0.245603359358843,0.469062153529593,0.469062153529593,"Zci_11373/Zci_06970/Zci_04888/Zci_09252/Zci_05468",5
"GO:0034660","GO:0034660","ncRNA metabolic process","1/15","37/1957",0.249752157042516,0.469292359604082,0.469292359604082,"Zci_16574",1
"GO:0051726","GO:0051726","regulation of cell cycle","1/15","37/1957",0.249752157042516,0.469292359604082,0.469292359604082,"Zci_04477",1
"GO:0019439","GO:0019439","aromatic compound catabolic process","1/15","40/1957",0.267208097693177,0.487966216448568,0.487966216448568,"Zci_13022",1
"GO:0031399","GO:0031399","regulation of protein modification process","1/15","40/1957",0.267208097693177,0.487966216448568,0.487966216448568,"Zci_11373",1
"GO:0006508","GO:0006508","proteolysis","2/15","133/1957",0.271418064873362,0.487966216448568,0.487966216448568,"Zci_06970/Zci_05468",2
"GO:0009642","GO:0009642","response to light intensity","1/15","41/1957",0.272941993642369,0.487966216448568,0.487966216448568,"Zci_11373",1
"GO:0022613","GO:0022613","ribonucleoprotein complex biogenesis","1/15","41/1957",0.272941993642369,0.487966216448568,0.487966216448568,"Zci_16574",1
"GO:0048584","GO:0048584","positive regulation of response to stimulus","1/15","41/1957",0.272941993642369,0.487966216448568,0.487966216448568,"Zci_04477",1
"GO:0044248","GO:0044248","cellular catabolic process","2/15","134/1957",0.274350104526877,0.487966216448568,0.487966216448568,"Zci_05468/Zci_13022",2
"GO:0060255","GO:0060255","regulation of macromolecule metabolic process","3/15","241/1957",0.278534249780272,0.488133235241009,0.488133235241009,"Zci_11373/Zci_04888/Zci_13022",3
"GO:0044270","GO:0044270","cellular nitrogen compound catabolic process","1/15","42/1957",0.278633992648301,0.488133235241009,0.488133235241009,"Zci_13022",1
"GO:1903047","GO:1903047","mitotic cell cycle process","1/15","43/1957",0.284284379128862,0.49431537564944,0.49431537564944,"Zci_04477",1
"GO:0042546","GO:0042546","cell wall biogenesis","1/15","44/1957",0.289893435718761,0.496655665606408,0.496655665606408,"Zci_14484",1
"GO:0046700","GO:0046700","heterocycle catabolic process","1/15","44/1957",0.289893435718761,0.496655665606408,0.496655665606408,"Zci_13022",1
"GO:0000278","GO:0000278","mitotic cell cycle","1/15","45/1957",0.295461443279775,0.497378458526603,0.497378458526603,"Zci_04477",1
"GO:0009791","GO:0009791","post-embryonic development","2/15","143/1957",0.300762052247692,0.497378458526603,0.497378458526603,"Zci_12354/Zci_13022",2
"GO:0016071","GO:0016071","mRNA metabolic process","1/15","46/1957",0.300988680910948,0.497378458526603,0.497378458526603,"Zci_13022",1
"GO:0071215","GO:0071215","cellular response to abscisic acid stimulus","1/15","46/1957",0.300988680910948,0.497378458526603,0.497378458526603,"Zci_11373",1
"GO:0097306","GO:0097306","cellular response to alcohol","1/15","46/1957",0.300988680910948,0.497378458526603,0.497378458526603,"Zci_11373",1
"GO:0051603","GO:0051603","proteolysis involved in cellular protein catabolic process","1/15","47/1957",0.306475425958743,0.497793255399461,0.497793255399461,"Zci_05468",1
"GO:0003006","GO:0003006","developmental process involved in reproduction","2/15","145/1957",0.306629869878773,0.497793255399461,0.497793255399461,"Zci_12354/Zci_13022",2
"GO:0006464","GO:0006464","cellular protein modification process","3/15","255/1957",0.309479095117127,0.497793255399461,0.497793255399461,"Zci_11373/Zci_04888/Zci_09252",3
"GO:0036211","GO:0036211","protein modification process","3/15","256/1957",0.311705304943796,0.497793255399461,0.497793255399461,"Zci_11373/Zci_04888/Zci_09252",3
"GO:1901361","GO:1901361","organic cyclic compound catabolic process","1/15","48/1957",0.31192195402713,0.497793255399461,0.497793255399461,"Zci_13022",1
"GO:0044257","GO:0044257","cellular protein catabolic process","1/15","49/1957",0.317328538987629,0.502976527783113,0.502976527783113,"Zci_05468",1
"GO:0032268","GO:0032268","regulation of cellular protein metabolic process","1/15","52/1957",0.33331134815963,0.518978168217489,0.518978168217489,"Zci_11373",1
"GO:0023052","GO:0023052","signaling","2/15","155/1957",0.335896242322077,0.518978168217489,0.518978168217489,"Zci_11373/Zci_04888",2
"GO:0009793","GO:0009793","embryo development ending in seed dormancy","1/15","53/1957",0.338560865103255,0.518978168217489,0.518978168217489,"Zci_13022",1
"GO:0016311","GO:0016311","dephosphorylation","1/15","53/1957",0.338560865103255,0.518978168217489,0.518978168217489,"Zci_11373",1
"GO:0071396","GO:0071396","cellular response to lipid","1/15","53/1957",0.338560865103255,0.518978168217489,0.518978168217489,"Zci_11373",1
"GO:0009408","GO:0009408","response to heat","1/15","54/1957",0.343771782657589,0.523521734373975,0.523521734373975,"Zci_11373",1
"GO:0048585","GO:0048585","negative regulation of response to stimulus","1/15","56/1957",0.354078872673716,0.535716735928415,0.535716735928415,"Zci_11373",1
"GO:0044085","GO:0044085","cellular component biogenesis","2/15","164/1957",0.362049407764099,0.538171205529901,0.538171205529901,"Zci_05468/Zci_16574",2
"GO:0010629","GO:0010629","negative regulation of gene expression","1/15","58/1957",0.364234707780132,0.538171205529901,0.538171205529901,"Zci_13022",1
"GO:0051246","GO:0051246","regulation of protein metabolic process","1/15","58/1957",0.364234707780132,0.538171205529901,0.538171205529901,"Zci_11373",1
"GO:0007165","GO:0007165","signal transduction","2/15","165/1957",0.364940130788517,0.538171205529901,0.538171205529901,"Zci_11373/Zci_04888",2
"GO:0050790","GO:0050790","regulation of catalytic activity","1/15","60/1957",0.374241351237764,0.540371989738365,0.540371989738365,"Zci_11373",1
"GO:0048229","GO:0048229","gametophyte development","1/15","61/1957",0.379189363747745,0.540371989738365,0.540371989738365,"Zci_09252",1
"GO:0019222","GO:0019222","regulation of metabolic process","3/15","287/1957",0.381195813628823,0.540371989738365,0.540371989738365,"Zci_11373/Zci_04888/Zci_13022",3
"GO:0009414","GO:0009414","response to water deprivation","1/15","63/1957",0.388976031538102,0.540371989738365,0.540371989738365,"Zci_11373",1
"GO:0009415","GO:0009415","response to water","1/15","63/1957",0.388976031538102,0.540371989738365,0.540371989738365,"Zci_11373",1
"GO:0009755","GO:0009755","hormone-mediated signaling pathway","1/15","63/1957",0.388976031538102,0.540371989738365,0.540371989738365,"Zci_11373",1
"GO:0071229","GO:0071229","cellular response to acid chemical","1/15","63/1957",0.388976031538102,0.540371989738365,0.540371989738365,"Zci_11373",1
"GO:0080134","GO:0080134","regulation of response to stress","1/15","63/1957",0.388976031538102,0.540371989738365,0.540371989738365,"Zci_04477",1
"GO:0006281","GO:0006281","DNA repair","1/15","64/1957",0.393815186515361,0.540371989738365,0.540371989738365,"Zci_04477",1
"GO:0048367","GO:0048367","shoot system development","1/15","64/1957",0.393815186515361,0.540371989738365,0.540371989738365,"Zci_13022",1
"GO:0022414","GO:0022414","reproductive process","2/15","176/1957",0.396484771865628,0.540371989738365,0.540371989738365,"Zci_12354/Zci_13022",2
"GO:0035556","GO:0035556","intracellular signal transduction","1/15","65/1957",0.39861855270779,0.540371989738365,0.540371989738365,"Zci_04888",1
"GO:0051172","GO:0051172","negative regulation of nitrogen compound metabolic process","1/15","65/1957",0.39861855270779,0.540371989738365,0.540371989738365,"Zci_11373",1
"GO:0031324","GO:0031324","negative regulation of cellular metabolic process","1/15","66/1957",0.403386376021418,0.540371989738365,0.540371989738365,"Zci_11373",1
"GO:0000003","GO:0000003","reproduction","2/15","179/1957",0.404996285832816,0.540371989738365,0.540371989738365,"Zci_12354/Zci_13022",2
"GO:0007154","GO:0007154","cell communication","2/15","180/1957",0.407823754754504,0.540371989738365,0.540371989738365,"Zci_11373/Zci_04888",2
"GO:0022402","GO:0022402","cell cycle process","1/15","67/1957",0.408118900801787,0.540371989738365,0.540371989738365,"Zci_04477",1
"GO:0022622","GO:0022622","root system development","1/15","68/1957",0.412816369843043,0.540371989738365,0.540371989738365,"Zci_11373",1
"GO:0048316","GO:0048316","seed development","1/15","68/1957",0.412816369843043,0.540371989738365,0.540371989738365,"Zci_13022",1
"GO:0048364","GO:0048364","root development","1/15","68/1957",0.412816369843043,0.540371989738365,0.540371989738365,"Zci_11373",1
"GO:0009790","GO:0009790","embryo development","1/15","69/1957",0.417479024396963,0.540389864145017,0.540389864145017,"Zci_13022",1
"GO:0051716","GO:0051716","cellular response to stimulus","3/15","305/1957",0.42146294964042,0.540389864145017,0.540389864145017,"Zci_11373/Zci_04888/Zci_04477",3
"GO:0007049","GO:0007049","cell cycle","1/15","70/1957",0.422107104181944,0.540389864145017,0.540389864145017,"Zci_04477",1
"GO:0009409","GO:0009409","response to cold","1/15","70/1957",0.422107104181944,0.540389864145017,0.540389864145017,"Zci_11373",1
"GO:0010154","GO:0010154","fruit development","1/15","71/1957",0.426700847391945,0.543285778373351,0.54328577837335,"Zci_13022",1
"GO:0010468","GO:0010468","regulation of gene expression","2/15","191/1957",0.438576570112133,0.55451281687413,0.55451281687413,"Zci_04888/Zci_13022",2
"GO:0032870","GO:0032870","cellular response to hormone stimulus","1/15","74/1957",0.440278416831391,0.55451281687413,0.55451281687413,"Zci_11373",1
"GO:0009628","GO:0009628","response to abiotic stimulus","3/15","317/1957",0.44804473460188,0.561260339581925,0.561260339581925,"Zci_11373/Zci_04477/Zci_12354",3
"GO:0071495","GO:0071495","cellular response to endogenous stimulus","1/15","78/1957",0.457915318008181,0.570557588748162,0.570557588748162,"Zci_11373",1
"GO:0046907","GO:0046907","intracellular transport","1/15","79/1957",0.462242763580229,0.572885978266986,0.572885978266986,"Zci_05662",1
"GO:0006396","GO:0006396","RNA processing","1/15","86/1957",0.491644015762968,0.596630498295685,0.596630498295685,"Zci_16574",1
"GO:0006970","GO:0006970","response to osmotic stress","1/15","86/1957",0.491644015762968,0.596630498295685,0.596630498295685,"Zci_11373",1
"GO:0018193","GO:0018193","peptidyl-amino acid modification","1/15","86/1957",0.491644015762968,0.596630498295685,0.596630498295685,"Zci_09252",1
"GO:1901701","GO:1901701","cellular response to oxygen-containing compound","1/15","86/1957",0.491644015762968,0.596630498295685,0.596630498295685,"Zci_11373",1
"GO:0009888","GO:0009888","tissue development","1/15","88/1957",0.499764588409643,0.600232727316736,0.600232727316736,"Zci_13022",1
"GO:0051649","GO:0051649","establishment of localization in cell","1/15","88/1957",0.499764588409643,0.600232727316736,0.600232727316736,"Zci_05662",1
"GO:0006259","GO:0006259","DNA metabolic process","1/15","91/1957",0.511718722252546,0.608318685126751,0.608318685126751,"Zci_04477",1
"GO:0009737","GO:0009737","response to abscisic acid","1/15","91/1957",0.511718722252546,0.608318685126751,0.608318685126751,"Zci_11373",1
"GO:0071310","GO:0071310","cellular response to organic substance","1/15","99/1957",0.542305857231988,0.63816800371239,0.63816800371239,"Zci_11373",1
"GO:0097305","GO:0097305","response to alcohol","1/15","99/1957",0.542305857231988,0.63816800371239,0.63816800371239,"Zci_11373",1
"GO:0006793","GO:0006793","phosphorus metabolic process","2/15","237/1957",0.558504970618461,0.65392793042262,0.65392793042262,"Zci_11373/Zci_04888",2
"GO:0006796","GO:0006796","phosphate-containing compound metabolic process","2/15","240/1957",0.565765164087963,0.654698887131807,0.654698887131807,"Zci_11373/Zci_04888",2
"GO:0033993","GO:0033993","response to lipid","1/15","106/1957",0.567593026612125,0.654698887131807,0.654698887131807,"Zci_11373",1
"GO:0051641","GO:0051641","cellular localization","1/15","106/1957",0.567593026612125,0.654698887131807,0.654698887131807,"Zci_05662",1
"GO:0099402","GO:0099402","plant organ development","1/15","109/1957",0.578025985444855,0.663448544870203,0.663448544870203,"Zci_11373",1
"GO:0022607","GO:0022607","cellular component assembly","1/15","111/1957",0.584850251073757,0.667990727942086,0.667990727942085,"Zci_05468",1
"GO:0009266","GO:0009266","response to temperature stimulus","1/15","113/1957",0.591571399313647,0.672371395317462,0.672371395317462,"Zci_11373",1
"GO:0006810","GO:0006810","transport","2/15","255/1957",0.600941335500995,0.679705491124912,0.679705491124912,"Zci_05662/Zci_05468",2
"GO:0009653","GO:0009653","anatomical structure morphogenesis","1/15","119/1957",0.611130530062262,0.687890886495203,0.687890886495203,"Zci_13022",1
"GO:0051234","GO:0051234","establishment of localization","2/15","262/1957",0.616703661819954,0.688357257886999,0.688357257886999,"Zci_05662/Zci_05468",2
"GO:0048522","GO:0048522","positive regulation of cellular process","1/15","121/1957",0.617453506001643,0.688357257886999,0.688357257886999,"Zci_04477",1
"GO:0070887","GO:0070887","cellular response to chemical stimulus","1/15","128/1957",0.638836300034697,0.708804085276592,0.708804085276592,"Zci_11373",1
"GO:0051179","GO:0051179","localization","2/15","287/1957",0.6695411692295,0.73935114895959,0.73935114895959,"Zci_05662/Zci_05468",2
"GO:0050794","GO:0050794","regulation of cellular process","3/15","439/1957",0.688319925959006,0.75650256013419,0.75650256013419,"Zci_11373/Zci_04888/Zci_04477",3
"GO:0016310","GO:0016310","phosphorylation","1/15","151/1957",0.701499211381513,0.767367681933768,0.767367681933768,"Zci_04888",1
"GO:0033554","GO:0033554","cellular response to stress","1/15","155/1957",0.711301356983193,0.769521150791919,0.76952115079192,"Zci_04477",1
"GO:0048518","GO:0048518","positive regulation of biological process","1/15","155/1957",0.711301356983193,0.769521150791919,0.76952115079192,"Zci_04477",1
"GO:0009058","GO:0009058","biosynthetic process","2/15","310/1957",0.713375830777058,0.769521150791919,0.76952115079192,"Zci_09252/Zci_12354",2
"GO:0001101","GO:0001101","response to acid chemical","1/15","159/1957",0.720802418359239,0.771818075988369,0.771818075988369,"Zci_11373",1
"GO:0006468","GO:0006468","protein phosphorylation","1/15","160/1957",0.723131652911304,0.771818075988369,0.771818075988369,"Zci_04888",1
"GO:0010035","GO:0010035","response to inorganic substance","1/15","161/1957",0.725442740950441,0.771818075988369,0.771818075988369,"Zci_11373",1
"GO:0009725","GO:0009725","response to hormone","1/15","182/1957",0.770008768750507,0.815509286903946,0.815509286903946,"Zci_11373",1
"GO:0009719","GO:0009719","response to endogenous stimulus","1/15","186/1957",0.777691539232649,0.81991913412311,0.81991913412311,"Zci_11373",1
"GO:0009605","GO:0009605","response to external stimulus","1/15","188/1957",0.781442458624478,0.820162580448214,0.820162580448214,"Zci_12354",1
"GO:0071840","GO:0071840","cellular component organization or biogenesis","2/15","373/1957",0.811085926272622,0.847457492473188,0.847457492473188,"Zci_05468/Zci_16574",2
"GO:1901700","GO:1901700","response to oxygen-containing compound","1/15","213/1957",0.82361000647648,0.856701479950981,0.856701479950981,"Zci_11373",1
"GO:0080090","GO:0080090","regulation of primary metabolic process","1/15","216/1957",0.828124887717754,0.857569328169941,0.857569328169941,"Zci_11373",1
"GO:0051171","GO:0051171","regulation of nitrogen compound metabolic process","1/15","222/1957",0.83683292462667,0.860399809248268,0.860399809248268,"Zci_11373",1
"GO:0006996","GO:0006996","organelle organization","1/15","223/1957",0.838243590984364,0.860399809248268,0.860399809248268,"Zci_05468",1
"GO:0010033","GO:0010033","response to organic substance","1/15","234/1957",0.853027722529875,0.871734470830968,0.871734470830968,"Zci_11373",1
"GO:0006950","GO:0006950","response to stress","2/15","419/1957",0.863946663696065,0.877845642662967,0.877845642662967,"Zci_11373/Zci_04477",2
"GO:0031323","GO:0031323","regulation of cellular metabolic process","1/15","245/1957",0.866542909066449,0.877845642662967,0.877845642662967,"Zci_11373",1
"GO:1901576","GO:1901576","organic substance biosynthetic process","1/15","293/1957",0.913041447683309,0.920946568442472,0.920946568442472,"Zci_12354",1
"GO:0016043","GO:0016043","cellular component organization","1/15","334/1957",0.940283563569922,0.94433650996462,0.94433650996462,"Zci_05468",1
"GO:0042221","GO:0042221","response to chemical","1/15","364/1957",0.95491621267912,0.95491621267912,0.95491621267912,"Zci_11373",1
