"","ID","Description","GeneRatio","BgRatio","pvalue","p.adjust","qvalue","geneID","Count"
"GO:0022904","GO:0022904","respiratory electron transport chain","2/16","16/5486",0.000934562920971483,0.147660941513494,0.137725062037903,"Me1_v2_0031590/Me1_v2_0082520",2
"GO:0045333","GO:0045333","cellular respiration","2/16","40/5486",0.00583180811643009,0.36752599457237,0.34279573111347,"Me1_v2_0031590/Me1_v2_0033430",2
"GO:0015980","GO:0015980","energy derivation by oxidation of organic compounds","2/16","61/5486",0.0132033703779167,0.36752599457237,0.34279573111347,"Me1_v2_0031590/Me1_v2_0033430",2
"GO:0009231","GO:0009231","riboflavin biosynthetic process","1/16","10/5486",0.028808666153615,0.36752599457237,0.34279573111347,"Me1_v2_0196410",1
"GO:0042726","GO:0042726","flavin-containing compound metabolic process","1/16","10/5486",0.028808666153615,0.36752599457237,0.34279573111347,"Me1_v2_0196410",1
"GO:0043488","GO:0043488","regulation of mRNA stability","1/16","10/5486",0.028808666153615,0.36752599457237,0.34279573111347,"Me1_v2_0190120",1
"GO:0006534","GO:0006534","cysteine metabolic process","1/16","11/5486",0.031646332578294,0.36752599457237,0.34279573111347,"Me1_v2_0128640",1
"GO:0061013","GO:0061013","regulation of mRNA catabolic process","1/16","11/5486",0.031646332578294,0.36752599457237,0.34279573111347,"Me1_v2_0190120",1
"GO:0000038","GO:0000038","very long-chain fatty acid metabolic process","1/16","12/5486",0.0344762245744118,0.36752599457237,0.34279573111347,"Me1_v2_0060060",1
"GO:0009070","GO:0009070","serine family amino acid biosynthetic process","1/16","13/5486",0.0372983620254185,0.36752599457237,0.34279573111347,"Me1_v2_0128640",1
"GO:0000097","GO:0000097","sulfur amino acid biosynthetic process","1/16","14/5486",0.0401127647675328,0.36752599457237,0.34279573111347,"Me1_v2_0128640",1
"GO:0043487","GO:0043487","regulation of RNA stability","1/16","14/5486",0.0401127647675328,0.36752599457237,0.34279573111347,"Me1_v2_0190120",1
"GO:1901661","GO:1901661","quinone metabolic process","1/16","14/5486",0.0401127647675328,0.36752599457237,0.34279573111347,"Me1_v2_0146340",1
"GO:1901663","GO:1901663","quinone biosynthetic process","1/16","14/5486",0.0401127647675328,0.36752599457237,0.34279573111347,"Me1_v2_0146340",1
"GO:0031330","GO:0031330","negative regulation of cellular catabolic process","1/16","15/5486",0.0429194525898503,0.36752599457237,0.34279573111347,"Me1_v2_0190120",1
"GO:0044283","GO:0044283","small molecule biosynthetic process","3/16","276/5486",0.0433615182098186,0.36752599457237,0.34279573111347,"Me1_v2_0196410/Me1_v2_0128640/Me1_v2_0146340",3
"GO:0042181","GO:0042181","ketone biosynthetic process","1/16","16/5486",0.0457184452344424,0.36752599457237,0.34279573111347,"Me1_v2_0146340",1
"GO:0055046","GO:0055046","microgametogenesis","1/16","16/5486",0.0457184452344424,0.36752599457237,0.34279573111347,"Me1_v2_0086300",1
"GO:0009451","GO:0009451","RNA modification","2/16","130/5486",0.0538389210019189,0.36752599457237,0.34279573111347,"Me1_v2_0190120/Me1_v2_0196410",2
"GO:0007140","GO:0007140","male meiotic nuclear division","1/16","19/5486",0.0540694488194212,0.36752599457237,0.34279573111347,"Me1_v2_0086300",1
"GO:0009069","GO:0009069","serine family amino acid metabolic process","1/16","21/5486",0.0595986684854805,0.36752599457237,0.34279573111347,"Me1_v2_0128640",1
"GO:0007051","GO:0007051","spindle organization","1/16","23/5486",0.0650975772772556,0.36752599457237,0.34279573111347,"Me1_v2_0086300",1
"GO:0009895","GO:0009895","negative regulation of catabolic process","1/16","23/5486",0.0650975772772556,0.36752599457237,0.34279573111347,"Me1_v2_0190120",1
"GO:0006091","GO:0006091","generation of precursor metabolites and energy","2/16","145/5486",0.0653626526743349,0.36752599457237,0.34279573111347,"Me1_v2_0031590/Me1_v2_0033430",2
"GO:0070192","GO:0070192","chromosome organization involved in meiotic cell cycle","1/16","24/5486",0.067835713605933,0.36752599457237,0.34279573111347,"Me1_v2_0086300",1
"GO:0000096","GO:0000096","sulfur amino acid metabolic process","1/16","26/5486",0.073289446746418,0.36752599457237,0.34279573111347,"Me1_v2_0128640",1
"GO:0042180","GO:0042180","cellular ketone metabolic process","1/16","27/5486",0.0760050820673079,0.36752599457237,0.34279573111347,"Me1_v2_0146340",1
"GO:0009060","GO:0009060","aerobic respiration","1/16","28/5486",0.0787132554849526,0.36752599457237,0.34279573111347,"Me1_v2_0031590",1
"GO:0009144","GO:0009144","purine nucleoside triphosphate metabolic process","1/16","28/5486",0.0787132554849526,0.36752599457237,0.34279573111347,"Me1_v2_0031590",1
"GO:0009205","GO:0009205","purine ribonucleoside triphosphate metabolic process","1/16","28/5486",0.0787132554849526,0.36752599457237,0.34279573111347,"Me1_v2_0031590",1
"GO:0046034","GO:0046034","ATP metabolic process","1/16","28/5486",0.0787132554849526,0.36752599457237,0.34279573111347,"Me1_v2_0031590",1
"GO:1903311","GO:1903311","regulation of mRNA metabolic process","1/16","28/5486",0.0787132554849526,0.36752599457237,0.34279573111347,"Me1_v2_0190120",1
"GO:0009126","GO:0009126","purine nucleoside monophosphate metabolic process","1/16","29/5486",0.0814139861394491,0.36752599457237,0.34279573111347,"Me1_v2_0031590",1
"GO:0009167","GO:0009167","purine ribonucleoside monophosphate metabolic process","1/16","29/5486",0.0814139861394491,0.36752599457237,0.34279573111347,"Me1_v2_0031590",1
"GO:0009199","GO:0009199","ribonucleoside triphosphate metabolic process","1/16","29/5486",0.0814139861394491,0.36752599457237,0.34279573111347,"Me1_v2_0031590",1
"GO:0042364","GO:0042364","water-soluble vitamin biosynthetic process","1/16","30/5486",0.0841072931252966,0.369137564272135,0.344298860746828,"Me1_v2_0196410",1
"GO:0006767","GO:0006767","water-soluble vitamin metabolic process","1/16","31/5486",0.0867931954914977,0.370630402369098,0.345691248045794,"Me1_v2_0196410",1
"GO:0090693","GO:0090693","plant organ senescence","1/16","32/5486",0.08947171224166,0.371926048430776,0.346899712060684,"Me1_v2_0111800",1
"GO:0010150","GO:0010150","leaf senescence","1/16","33/5486",0.0921428623340937,0.371926048430776,0.346899712060684,"Me1_v2_0111800",1
"GO:0009141","GO:0009141","nucleoside triphosphate metabolic process","1/16","34/5486",0.0948066646819126,0.371926048430776,0.346899712060684,"Me1_v2_0031590",1
"GO:0045132","GO:0045132","meiotic chromosome segregation","1/16","35/5486",0.0974631381531321,0.371926048430776,0.346899712060684,"Me1_v2_0086300",1
"GO:0048232","GO:0048232","male gamete generation","1/16","36/5486",0.100112301570771,0.371926048430776,0.346899712060684,"Me1_v2_0086300",1
"GO:0042542","GO:0042542","response to hydrogen peroxide","1/16","38/5486",0.105388773312984,0.371926048430776,0.346899712060684,"Me1_v2_0111800",1
"GO:0022412","GO:0022412","cellular process involved in reproduction in multicellular organism","1/16","39/5486",0.108016119059495,0.371926048430776,0.346899712060684,"Me1_v2_0086300",1
"GO:0009161","GO:0009161","ribonucleoside monophosphate metabolic process","1/16","40/5486",0.110636229596497,0.371926048430776,0.346899712060684,"Me1_v2_0031590",1
"GO:0022900","GO:0022900","electron transport chain","1/16","40/5486",0.110636229596497,0.371926048430776,0.346899712060684,"Me1_v2_0031590",1
"GO:0044272","GO:0044272","sulfur compound biosynthetic process","1/16","40/5486",0.110636229596497,0.371926048430776,0.346899712060684,"Me1_v2_0128640",1
"GO:1902600","GO:1902600","proton transmembrane transport","1/16","44/5486",0.121044690974104,0.398438774456427,0.371628437201197,"Me1_v2_0031590",1
"GO:0007276","GO:0007276","gamete generation","1/16","46/5486",0.126205991888404,0.398810934367358,0.371975555039508,"Me1_v2_0086300",1
"GO:0009110","GO:0009110","vitamin biosynthetic process","1/16","46/5486",0.126205991888404,0.398810934367358,0.371975555039508,"Me1_v2_0196410",1
"GO:0006766","GO:0006766","vitamin metabolic process","1/16","47/5486",0.128775974265203,0.398953018311806,0.372108078372104,"Me1_v2_0196410",1
"GO:0007568","GO:0007568","aging","1/16","50/5486",0.136443468431866,0.414333266088803,0.386453412741056,"Me1_v2_0111800",1
"GO:0009123","GO:0009123","nucleoside monophosphate metabolic process","1/16","51/5486",0.138985209510801,0.414333266088803,0.386453412741056,"Me1_v2_0031590",1
"GO:0009753","GO:0009753","response to jasmonic acid","1/16","58/5486",0.156581988238412,0.434405745325057,0.405175245473071,"Me1_v2_0111800",1
"GO:0031329","GO:0031329","regulation of cellular catabolic process","1/16","59/5486",0.159068113549426,0.434405745325057,0.405175245473071,"Me1_v2_0190120",1
"GO:0098813","GO:0098813","nuclear chromosome segregation","1/16","59/5486",0.159068113549426,0.434405745325057,0.405175245473071,"Me1_v2_0086300",1
"GO:0019637","GO:0019637","organophosphate metabolic process","2/16","247/5486",0.160379531117488,0.434405745325057,0.405175245473071,"Me1_v2_0031590/Me1_v2_0060060",2
"GO:0009150","GO:0009150","purine ribonucleotide metabolic process","1/16","60/5486",0.161547367314528,0.434405745325057,0.405175245473071,"Me1_v2_0031590",1
"GO:0006163","GO:0006163","purine nucleotide metabolic process","1/16","61/5486",0.164019767263472,0.434405745325057,0.405175245473071,"Me1_v2_0031590",1
"GO:0008654","GO:0008654","phospholipid biosynthetic process","1/16","63/5486",0.168944076419561,0.434405745325057,0.405175245473071,"Me1_v2_0060060",1
"GO:0000226","GO:0000226","microtubule cytoskeleton organization","1/16","65/5486",0.173841182007692,0.434405745325057,0.405175245473071,"Me1_v2_0086300",1
"GO:0007059","GO:0007059","chromosome segregation","1/16","66/5486",0.17627957733842,0.434405745325057,0.405175245473071,"Me1_v2_0086300",1
"GO:0019953","GO:0019953","sexual reproduction","1/16","66/5486",0.17627957733842,0.434405745325057,0.405175245473071,"Me1_v2_0086300",1
"GO:0140013","GO:0140013","meiotic nuclear division","1/16","66/5486",0.17627957733842,0.434405745325057,0.405175245473071,"Me1_v2_0086300",1
"GO:1901607","GO:1901607","alpha-amino acid biosynthetic process","1/16","67/5486",0.178711224342587,0.434405745325057,0.405175245473071,"Me1_v2_0128640",1
"GO:0009259","GO:0009259","ribonucleotide metabolic process","1/16","74/5486",0.195545259451619,0.451643814363859,0.421253391145505,"Me1_v2_0031590",1
"GO:0072521","GO:0072521","purine-containing compound metabolic process","1/16","74/5486",0.195545259451619,0.451643814363859,0.421253391145505,"Me1_v2_0031590",1
"GO:0044703","GO:0044703","multi-organism reproductive process","1/16","75/5486",0.197923543976522,0.451643814363859,0.421253391145505,"Me1_v2_0086300",1
"GO:0009894","GO:0009894","regulation of catabolic process","1/16","76/5486",0.200295235585536,0.451643814363859,0.421253391145505,"Me1_v2_0190120",1
"GO:0071103","GO:0071103","DNA conformation change","1/16","77/5486",0.202660351339812,0.451643814363859,0.421253391145505,"Me1_v2_0086300",1
"GO:0019693","GO:0019693","ribose phosphate metabolic process","1/16","78/5486",0.205018908259494,0.451643814363859,0.421253391145505,"Me1_v2_0031590",1
"GO:0048609","GO:0048609","multicellular organismal reproductive process","1/16","79/5486",0.207370923323815,0.451643814363859,0.421253391145505,"Me1_v2_0086300",1
"GO:0000302","GO:0000302","response to reactive oxygen species","1/16","80/5486",0.209716413471183,0.451643814363859,0.421253391145505,"Me1_v2_0111800",1
"GO:0008652","GO:0008652","cellular amino acid biosynthetic process","1/16","81/5486",0.212055395599274,0.451643814363859,0.421253391145505,"Me1_v2_0128640",1
"GO:1903046","GO:1903046","meiotic cell cycle process","1/16","82/5486",0.214387886565123,0.451643814363859,0.421253391145505,"Me1_v2_0086300",1
"GO:0032504","GO:0032504","multicellular organism reproduction","1/16","84/5486",0.219033462235561,0.455359039910771,0.424718624833497,"Me1_v2_0086300",1
"GO:0007017","GO:0007017","microtubule-based process","1/16","86/5486",0.223653274529355,0.456147239597042,0.425453787765396,"Me1_v2_0086300",1
"GO:0051321","GO:0051321","meiotic cell cycle","1/16","87/5486",0.225953561123342,0.456147239597042,0.425453787765396,"Me1_v2_0086300",1
"GO:0098662","GO:0098662","inorganic cation transmembrane transport","1/16","90/5486",0.232816141954743,0.456147239597042,0.425453787765396,"Me1_v2_0031590",1
"GO:0046677","GO:0046677","response to antibiotic","1/16","91/5486",0.235090964365552,0.456147239597042,0.425453787765396,"Me1_v2_0111800",1
"GO:0006644","GO:0006644","phospholipid metabolic process","1/16","92/5486",0.237359461968916,0.456147239597042,0.425453787765396,"Me1_v2_0060060",1
"GO:0010608","GO:0010608","post-transcriptional regulation of gene expression","1/16","92/5486",0.237359461968916,0.456147239597042,0.425453787765396,"Me1_v2_0190120",1
"GO:0006631","GO:0006631","fatty acid metabolic process","1/16","93/5486",0.239621651180725,0.456147239597042,0.425453787765396,"Me1_v2_0060060",1
"GO:0048366","GO:0048366","leaf development","1/16","95/5486",0.244127169895464,0.45919158147004,0.428293280518359,"Me1_v2_0111800",1
"GO:0000280","GO:0000280","nuclear division","1/16","100/5486",0.255281711346731,0.474523651679807,0.442593679115076,"Me1_v2_0086300",1
"GO:0009636","GO:0009636","response to toxic substance","1/16","103/5486",0.261900165078546,0.48116541956291,0.448788532570336,"Me1_v2_0111800",1
"GO:0051253","GO:0051253","negative regulation of RNA metabolic process","1/16","106/5486",0.268463444896062,0.484311763198149,0.451723163542578,"Me1_v2_0190120",1
"GO:0006790","GO:0006790","sulfur compound metabolic process","1/16","107/5486",0.27063901829414,0.484311763198149,0.451723163542578,"Me1_v2_0128640",1
"GO:0007010","GO:0007010","cytoskeleton organization","1/16","108/5486",0.272808524839464,0.484311763198149,0.451723163542578,"Me1_v2_0086300",1
"GO:0098660","GO:0098660","inorganic ion transmembrane transport","1/16","116/5486",0.289948057692226,0.505042925123213,0.471059357210192,"Me1_v2_0031590",1
"GO:0006508","GO:0006508","proteolysis","2/16","367/5486",0.290879153077294,0.505042925123213,0.471059357210192,"Me1_v2_0090090/Me1_v2_0090080",2
"GO:1901605","GO:1901605","alpha-amino acid metabolic process","1/16","118/5486",0.294173369066193,0.505210786004983,0.471215922989325,"Me1_v2_0128640",1
"GO:0006397","GO:0006397","mRNA processing","1/16","122/5486",0.302553372015223,0.506741929195971,0.472644037890979,"Me1_v2_0082560",1
"GO:0098655","GO:0098655","cation transmembrane transport","1/16","122/5486",0.302553372015223,0.506741929195971,0.472644037890979,"Me1_v2_0031590",1
"GO:0019752","GO:0019752","carboxylic acid metabolic process","2/16","385/5486",0.310878738295462,0.506741929195971,0.472644037890979,"Me1_v2_0128640/Me1_v2_0060060",2
"GO:0048285","GO:0048285","organelle fission","1/16","127/5486",0.312897225357626,0.506741929195971,0.472644037890979,"Me1_v2_0086300",1
"GO:0009117","GO:0009117","nucleotide metabolic process","1/16","129/5486",0.316994353834696,0.506741929195971,0.472644037890979,"Me1_v2_0031590",1
"GO:0006753","GO:0006753","nucleoside phosphate metabolic process","1/16","131/5486",0.321068569906235,0.506741929195971,0.472644037890979,"Me1_v2_0031590",1
"GO:0043436","GO:0043436","oxoacid metabolic process","2/16","395/5486",0.321969827429884,0.506741929195971,0.472644037890979,"Me1_v2_0128640/Me1_v2_0060060",2
"GO:0006082","GO:0006082","organic acid metabolic process","2/16","396/5486",0.323077730638859,0.506741929195971,0.472644037890979,"Me1_v2_0128640/Me1_v2_0060060",2
"GO:0009555","GO:0009555","pollen development","1/16","134/5486",0.327137194797399,0.506741929195971,0.472644037890979,"Me1_v2_0086300",1
"GO:0045934","GO:0045934","negative regulation of nucleobase-containing compound metabolic process","1/16","134/5486",0.327137194797399,0.506741929195971,0.472644037890979,"Me1_v2_0190120",1
"GO:0006412","GO:0006412","translation","1/16","143/5486",0.34503936494172,0.522153422159903,0.487018515005905,"Me1_v2_0037300",1
"GO:0051252","GO:0051252","regulation of RNA metabolic process","2/16","417/5486",0.346274488659688,0.522153422159903,0.487018515005905,"Me1_v2_0190120/Me1_v2_0086300",2
"GO:0048827","GO:0048827","phyllome development","1/16","144/5486",0.347000691941708,0.522153422159903,0.487018515005905,"Me1_v2_0111800",1
"GO:0006812","GO:0006812","cation transport","1/16","149/5486",0.356725005889492,0.526752812434951,0.491308419326403,"Me1_v2_0031590",1
"GO:0032446","GO:0032446","protein modification by small protein conjugation","1/16","149/5486",0.356725005889492,0.526752812434951,0.491308419326403,"Me1_v2_0111800",1
"GO:0016567","GO:0016567","protein ubiquitination","1/16","151/5486",0.360576582974606,0.527510186203591,0.492014830569638,"Me1_v2_0111800",1
"GO:1901566","GO:1901566","organonitrogen compound biosynthetic process","2/16","438/5486",0.369294774206163,0.531614199442317,0.495842691018816,"Me1_v2_0196410/Me1_v2_0128640",2
"GO:0010628","GO:0010628","positive regulation of gene expression","1/16","156/5486",0.370111151510474,0.531614199442317,0.495842691018816,"Me1_v2_0190120",1
"GO:0090407","GO:0090407","organophosphate biosynthetic process","1/16","158/5486",0.373887525826505,0.532200261987277,0.496389318309252,"Me1_v2_0060060",1
"GO:0090305","GO:0090305","nucleic acid phosphodiester bond hydrolysis","1/16","161/5486",0.379512309466284,0.535383436568508,0.499358301929321,"Me1_v2_0190120",1
"GO:0032787","GO:0032787","monocarboxylic acid metabolic process","1/16","164/5486",0.385089693508788,0.538443996233526,0.502212921203822,"Me1_v2_0060060",1
"GO:0070647","GO:0070647","protein modification by small protein conjugation or removal","1/16","166/5486",0.388781800744132,0.538837934364675,0.502580351839137,"Me1_v2_0111800",1
"GO:0055086","GO:0055086","nucleobase-containing small molecule metabolic process","1/16","175/5486",0.405140570541288,0.55194622565731,0.51480660620935,"Me1_v2_0031590",1
"GO:0006979","GO:0006979","response to oxidative stress","1/16","176/5486",0.406932653175696,0.55194622565731,0.51480660620935,"Me1_v2_0111800",1
"GO:0006520","GO:0006520","cellular amino acid metabolic process","1/16","177/5486",0.40871967342978,0.55194622565731,0.51480660620935,"Me1_v2_0128640",1
"GO:0019219","GO:0019219","regulation of nucleobase-containing compound metabolic process","2/16","480/5486",0.414574934397791,0.555108810464839,0.517756385510176,"Me1_v2_0190120/Me1_v2_0086300",2
"GO:0048229","GO:0048229","gametophyte development","1/16","186/5486",0.424577240539968,0.563441436280131,0.525528321647024,"Me1_v2_0086300",1
"GO:0016053","GO:0016053","organic acid biosynthetic process","1/16","190/5486",0.431496289809467,0.563441436280131,0.525528321647024,"Me1_v2_0128640",1
"GO:0046394","GO:0046394","carboxylic acid biosynthetic process","1/16","190/5486",0.431496289809467,0.563441436280131,0.525528321647024,"Me1_v2_0128640",1
"GO:0048367","GO:0048367","shoot system development","1/16","196/5486",0.441728766854659,0.571417469821138,0.532967660059689,"Me1_v2_0111800",1
"GO:0008610","GO:0008610","lipid biosynthetic process","1/16","198/5486",0.445101044109176,0.571417469821138,0.532967660059689,"Me1_v2_0060060",1
"GO:0051172","GO:0051172","negative regulation of nitrogen compound metabolic process","1/16","200/5486",0.448454216821653,0.571417469821138,0.532967660059689,"Me1_v2_0190120",1
"GO:0022402","GO:0022402","cell cycle process","1/16","210/5486",0.464937031790828,0.585051007227579,0.545683817534051,"Me1_v2_0086300",1
"GO:0034220","GO:0034220","ion transmembrane transport","1/16","211/5486",0.466559663991614,0.585051007227579,0.545683817534051,"Me1_v2_0031590",1
"GO:0031324","GO:0031324","negative regulation of cellular metabolic process","1/16","214/5486",0.471399924837072,0.586466048222499,0.54700364257928,"Me1_v2_0190120",1
"GO:0007049","GO:0007049","cell cycle","1/16","218/5486",0.477789577833464,0.589771510138182,0.550086685005633,"Me1_v2_0086300",1
"GO:0030154","GO:0030154","cell differentiation","1/16","247/5486",0.521994624079965,0.639342252749104,0.596321887973848,"Me1_v2_0086300",1
"GO:0006811","GO:0006811","ion transport","1/16","253/5486",0.53069116137151,0.644993873051527,0.601593219368513,"Me1_v2_0031590",1
"GO:0010604","GO:0010604","positive regulation of macromolecule metabolic process","1/16","261/5486",0.542055955152793,0.653777411558331,0.609785726969795,"Me1_v2_0190120",1
"GO:1901135","GO:1901135","carbohydrate derivative metabolic process","1/16","270/5486",0.55453275245183,0.663758900662038,0.619095576899969,"Me1_v2_0031590",1
"GO:0044255","GO:0044255","cellular lipid metabolic process","1/16","278/5486",0.565355002411411,0.668187090552663,0.623225800648719,"Me1_v2_0060060",1
"GO:0010605","GO:0010605","negative regulation of macromolecule metabolic process","1/16","279/5486",0.566690317304157,0.668187090552663,0.623225800648719,"Me1_v2_0190120",1
"GO:0051276","GO:0051276","chromosome organization","1/16","284/5486",0.57330939789686,0.670984332353362,0.625834820316261,"Me1_v2_0086300",1
"GO:0009893","GO:0009893","positive regulation of metabolic process","1/16","297/5486",0.590078125510165,0.685531939930928,0.639403541574483,"Me1_v2_0190120",1
"GO:0048869","GO:0048869","cellular developmental process","1/16","307/5486",0.602554569820739,0.694916949136327,0.648157047828686,"Me1_v2_0086300",1
"GO:0009892","GO:0009892","negative regulation of metabolic process","1/16","311/5486",0.607444737273515,0.695480206443589,0.648682404411076,"Me1_v2_0190120",1
"GO:0099402","GO:0099402","plant organ development","1/16","322/5486",0.620603446993231,0.703044763350251,0.655737953824351,"Me1_v2_0111800",1
"GO:0018130","GO:0018130","heterocycle biosynthetic process","1/16","324/5486",0.622951056133134,0.703044763350251,0.655737953824351,"Me1_v2_0196410",1
"GO:0006629","GO:0006629","lipid metabolic process","1/16","334/5486",0.634486216009989,0.710984554110484,0.663143488177666,"Me1_v2_0060060",1
"GO:0016310","GO:0016310","phosphorylation","1/16","353/5486",0.65549716560396,0.72935600116497,0.680278748588246,"Me1_v2_0031590",1
"GO:1901362","GO:1901362","organic cyclic compound biosynthetic process","1/16","366/5486",0.669214765283869,0.737743239644293,0.688101622586283,"Me1_v2_0196410",1
"GO:1903506","GO:1903506","regulation of nucleic acid-templated transcription","1/16","374/5486",0.677400046096487,0.737743239644293,0.688101622586283,"Me1_v2_0086300",1
"GO:2001141","GO:2001141","regulation of RNA biosynthetic process","1/16","374/5486",0.677400046096487,0.737743239644293,0.688101622586283,"Me1_v2_0086300",1
"GO:0048523","GO:0048523","negative regulation of cellular process","1/16","381/5486",0.684406017383631,0.737743239644293,0.688101622586283,"Me1_v2_0190120",1
"GO:0065008","GO:0065008","regulation of biological quality","1/16","383/5486",0.686381368529817,0.737743239644293,0.688101622586283,"Me1_v2_0190120",1
"GO:0010035","GO:0010035","response to inorganic substance","1/16","400/5486",0.702710034850854,0.746147340267698,0.695940224100451,"Me1_v2_0111800",1
"GO:0001101","GO:0001101","response to acid chemical","1/16","401/5486",0.703645276581563,0.746147340267698,0.695940224100451,"Me1_v2_0111800",1
"GO:0055085","GO:0055085","transmembrane transport","1/16","416/5486",0.717347062724255,0.755605572736215,0.70476202653611,"Me1_v2_0031590",1
"GO:0044271","GO:0044271","cellular nitrogen compound biosynthetic process","1/16","436/5486",0.734693793038382,0.765575936214,0.714061499466755,"Me1_v2_0196410",1
"GO:2000112","GO:2000112","regulation of cellular macromolecule biosynthetic process","1/16","443/5486",0.740525611430002,0.765575936214,0.714061499466755,"Me1_v2_0086300",1
"GO:0003006","GO:0003006","developmental process involved in reproduction","1/16","444/5486",0.741348849624949,0.765575936214,0.714061499466755,"Me1_v2_0086300",1
"GO:0010556","GO:0010556","regulation of macromolecule biosynthetic process","1/16","452/5486",0.747847155227672,0.767271756662157,0.715643210744184,"Me1_v2_0086300",1
"GO:0009725","GO:0009725","response to hormone","1/16","468/5486",0.760387248223642,0.774306680844288,0.722204765610928,"Me1_v2_0111800",1
"GO:0006355","GO:0006355","regulation of transcription, DNA-templated","1/16","480/5486",0.769406005649071,0.774306680844288,0.722204765610928,"Me1_v2_0086300",1
"GO:0009719","GO:0009719","response to endogenous stimulus","1/16","480/5486",0.769406005649071,0.774306680844288,0.722204765610928,"Me1_v2_0111800",1
"GO:0031326","GO:0031326","regulation of cellular biosynthetic process","1/16","487/5486",0.774518950272002,0.774518950272002,0.7224027517527,"Me1_v2_0086300",1
