"","x"
"1","Pp3c21_16140V3"
"2","Pp3c4_3900V3"
"3","Pp3c20_8810V3"
"4","Pp3c5_11220V3"
"5","Pp3c13_11140V3"
"6","Pp3c22_22380V3"
"7","Pp3c8_1860V3"
"8","Pp3c5_10280V3"
"9","Pp3c6_5330V3"
"10","Pp3c6_14860V3"
"11","Pp3c8_16040V3"
"12","Pp3c22_2660V3"
"13","Pp3c5_19920V3"
"14","Pp3c21_7940V3"
"15","Pp3c14_26420V3"
"16","Pp3c3_27620V3"
"17","Pp3c23_6580V3"
"18","Pp3c3_22020V3"
"19","Pp3c26_10440V3"
"20","Pp3c11_5230V3"
