GeneID	HOG	OG	Gene Tree Parent Clade	A_agrestis_oxf	A_filiculoides	A_thaliana	B_distachyon	C_braunii	C_melkonianii	C_reinhardtii	Closterium_sp_NIES_67	K_nitens	M_endlicherianum	M_polymorpha	M_viride	O_lucimarinus	O_sativa	P_coloniale	P_margaritaceum	P_patens	S_lycopersicum	S_moellendorffii	S_muscicola	Z_circumcarinatum_SAG698_1a	Z_circumcarinatum_SAG698_1b	Z_circumcarinatum_UTEX1559	Z_circumcarinatum_UTEX1560	Z_mays
Me1_v2_0217440	N0.HOG0028992	OG0026815	-	NA	NA	NA	NA	NA	NA	NA	NA	NA	Me1_v2_0217440, Me1_v2_0217420, Me1_v2_0217430	NA	NA	NA	NA	NA	NA	NA	NA	NA	NA	NA	NA	NA	NA	NA
Me1_v2_0144530	N0.HOG0006594	OG0005336	n0	AagrOXF_evm.TU.utg000027l.59	Azfi_s0004.g008801	AT5G24350	Bradi4g33310	CBR_g48777	Chrsp51S06512	Cre09.g415400_4532	CLOP_g7404, CLOP_g13088	3930	Me1_v2_0029010, Me1_v2_0144530, Me1_v2_0144540, Me1_v2_0153580, Me1_v2_0038810	Mp5g11790	19573	Olucimarinus_18630	LOC_Os12g13150	NA	pm034241g0010	Pp3c1_3140	Solyc03g082680	438861	SM000242S08491, SM000016S01987, SM000137S00438	Zci1a_07019	Zci_06488	UTEX1559_01293	UTEX1560_07933	Zm00001d011447
Me1_v2_0200950	N0.HOG0006276	OG0005035	n0	AagrOXF_evm.TU.utg000045l.196	Azfi_s0580.g078297	AT4G00800	Bradi3g02497	CBR_g34692	Chrsp8S08102, Chrsp8S08103	Cre13.g606350_4532	CLOP_g4852, CLOP_g10681	1536	Me1_v2_0200940, Me1_v2_0014100, Me1_v2_0200950	Mp8g08230, Mp1g08980	19043	Olucimarinus_86096	LOC_Os02g03220	NA	NA	Pp3c7_20800, Pp3c17_2710	Solyc05g044610	441252	SM000259S08746, SM000150S01729, SM000220S07054	Zci1a_25155	Zci_06811	UTEX1559_02229	UTEX1560_11381, UTEX1560_11382	Zm00001d015082
Me1_v2_0094300	N0.HOG0002247	OG0001471	n0	AagrOXF_evm.TU.utg000041l.59, AagrOXF_evm.TU.utg000024l.8, AagrOXF_evm.TU.utg000024l.7, AagrOXF_evm.TU.utg000049l.298	Azfi_s0076.g037745, Azfi_s0107.g045090, Azfi_s0365.g066950, Azfi_s1361.g102165	AT1G45160, AT1G48490, AT3G17850, AT5G62310	Bradi1g11380, Bradi4g01280	CBR_g50951	Chrsp308S00818	Cre06.g306950_4532	CLOP_g9226, CLOP_g4545	2502	Me1_v2_0094290, Me1_v2_0094300	Mp5g17640	24482	Olucimarinus_34630	LOC_Os03g50390, LOC_Os12g42660	NA	pm015480g0030, pm028788g0010, pm003213g0100, pm101918g0010, pm003212g0030, pm020682g0010	Pp3c21_9360, Pp3c22_4930, Pp3c19_17830, Pp3c24_16310, Pp3c8_20800	Solyc04g080170, Solyc06g068920, Solyc03g118530, Solyc03g083590	112057, 89070	SM000019S05025, SM000078S22044, SM000212S06887	Zci1a_06485	Zci_04486	UTEX1559_04681	UTEX1560_09801	Zm00001d033726, Zm00001d013433, Zm00001d013435, Zm00001d013434, Zm00001d013439, Zm00001d041269
Me1_v2_0038810	N0.HOG0006594	OG0005336	n0	AagrOXF_evm.TU.utg000027l.59	Azfi_s0004.g008801	AT5G24350	Bradi4g33310	CBR_g48777	Chrsp51S06512	Cre09.g415400_4532	CLOP_g7404, CLOP_g13088	3930	Me1_v2_0029010, Me1_v2_0144530, Me1_v2_0144540, Me1_v2_0153580, Me1_v2_0038810	Mp5g11790	19573	Olucimarinus_18630	LOC_Os12g13150	NA	pm034241g0010	Pp3c1_3140	Solyc03g082680	438861	SM000242S08491, SM000016S01987, SM000137S00438	Zci1a_07019	Zci_06488	UTEX1559_01293	UTEX1560_07933	Zm00001d011447
Me1_v2_0007070	N0.HOG0039448	OG0037271	-	NA	NA	NA	NA	NA	NA	NA	NA	NA	Me1_v2_0007070, Me1_v2_0029330	NA	NA	NA	NA	NA	NA	NA	NA	NA	NA	NA	NA	NA	NA	NA
Me1_v2_0080630	N0.HOG0004406	OG0003327	n0	AagrOXF_evm.TU.utg000006l.1080	Azfi_s0005.g008977, Azfi_s0042.g026935	AT2G25330, AT2G25320	Bradi3g48647	CBR_g20432	Chrsp3S05628	NA	CLOP_g12351	9182	Me1_v2_0080630, Me1_v2_0044290, Me1_v2_0080620, Me1_v2_0012630, Me1_v2_0001480, Me1_v2_0080580, Me1_v2_0045270, Me1_v2_0080590, Me1_v2_0080600	Mp8g09710	23559, 23560	NA	LOC_Os02g39990	NA	pm000083g0070, pm002218g0010	Pp3c1_12560, Pp3c2_25330, Pp3c2_25350	Solyc06g017970	173767	SM000153S01590, SM000126S26350, SM000002S05653	Zci1a_26814	Zci_01687	UTEX1559_12974	UTEX1560_12919	Zm00001d051075
Me1_v2_0072140	N0.HOG0006263	OG0005022	n0	AagrOXF_evm.TU.utg000038l.175	Azfi_s0051.g031263	AT5G23110	Bradi5g26017	NA	NA	Cre01.g044850_4532	CLOP_g18011, CLOP_g18010	3664	Me1_v2_0072150, Me1_v2_0072140, Me1_v2_0154570	Mp5g01480, MpVg00530	8835	NA	NA	NA	pm002020g0080, pm015745g0010, pm000206g0110, pm014312g0010	Pp3c9_15860	Solyc02g014180, Solyc02g014170, Solyc02g014190	152901	SM000422S15899, SM000395S15205, SM000297S10927, SM000374S13842	Zci1a_13995	Zci_15920	UTEX1559_09574	UTEX1560_11701	Zm00001d001848
Me1_v2_0182980	N0.HOG0016614	OG0014663	n0	NA	NA	NA	NA	NA	NA	NA	NA	NA	Me1_v2_0182980, Me1_v2_0051490, Me1_v2_0116050, Me1_v2_0182970	NA	NA	NA	NA	NA	NA	NA	NA	NA	SM004190S15588, SM004522S16129	NA	NA	UTEX1559_09803	NA	NA
Me1_v2_0143450	N0.HOG0003713	OG0002721	n0	AagrOXF_evm.TU.utg000028l.40, AagrOXF_evm.TU.utg000080l.5	Azfi_s0002.g001170, Azfi_s3707.g116617, Azfi_s0110.g045467, Azfi_s1515.g103939, Azfi_s0043.g026953	AT2G22010	NA	CBR_g4334	Chrsp33S05151	Cre12.g519150_4532	CLOP_g12749	14096	Me1_v2_0197910, Me1_v2_0006410, Me1_v2_0143450, Me1_v2_0043110, Me1_v2_0143420, Me1_v2_0143430, Me1_v2_0003900, Me1_v2_0143440	Mp6g14830	10763, 10761, 10762	NA	LOC_Os07g43380	NA	pm016318g0020, pm017347g0010	Pp3c2_2760, Pp3c17_14550, Pp3c1_33900	Solyc04g054140	149782	SM000038S14362, SM000012S25447, SM000014S00294	Zci1a_21295, Zci1a_03916	Zci_05766	UTEX1559_03638	UTEX1560_00916	Zm00001d022205
Me1_v2_0150750	N0.HOG0000993	OG0000553	n0	AagrOXF_evm.TU.utg000004l.42, AagrOXF_evm.TU.utg000116l.270	Azfi_s0009.g011871, Azfi_s0185.g056668	AT4G17140, AT1G48090	Bradi3g33740, Bradi3g43345	CBR_g4878	Chrsp17S02730	Cre17.g730650_4532, Cre17.g728250_4532, Cre17.g802076_4532, Cre12.g483500_4532	CLOP_g6030	9014, 11129	Me1_v2_0150790, Me1_v2_0150760, Me1_v2_0150750, Me1_v2_0150780, Me1_v2_0043420, Me1_v2_0007810, Me1_v2_0011090, Me1_v2_0150810, Me1_v2_0150800, Me1_v2_0032530, Me1_v2_0172640, Me1_v2_0172660	Mp3g08780, Mp7g07570, Mp3g11440	17845	Olucimarinus_4555	LOC_Os10g41560, LOC_Os02g27110, LOC_Os02g27130	PRCOL_00000265_RA, PRCOL_00002060_RA	pm010085g0010, pm010618g0040, pm007742g0050, pm007742g0040, pm058680g0010, pm010618g0060, pm010618.t2, pm042681.t1, pm021109g0020, pm031133g0030, pm024303.t1, pm049399g0010, pm002600g0020, pm020189g0040, pm031319g0010, pm023775g0010, pm020189.t1, pm006740g0020	Pp3c22_21110, Pp3c18_1370, Pp3c18_1376, Pp3c9_20320	Solyc08g077490, Solyc08g077500, Solyc12g015840, Solyc09g009370, Solyc09g009350.2	81414, 82033, 421223, 444978, 444977, 444980, 440026, 404260	SM000012S25329, SM000009S23509, SM000198S05311, SM000191S05224, SM000173S02996, SM000094S24675, SM000023S07679	Zci1a_30357, Zci1a_30360, Zci1a_30366, Zci1a_29258, Zci1a_30358, Zci1a_30359, Zci1a_30094	Zci_08871, Zci_11027	UTEX1559_04828, UTEX1559_03758	UTEX1560_15365, UTEX1560_17419, UTEX1560_06581, UTEX1560_07331	Zm00001d047074, Zm00001d053262, Zm00001d053260
Me1_v2_0182970	N0.HOG0016614	OG0014663	n0	NA	NA	NA	NA	NA	NA	NA	NA	NA	Me1_v2_0182980, Me1_v2_0051490, Me1_v2_0116050, Me1_v2_0182970	NA	NA	NA	NA	NA	NA	NA	NA	NA	SM004190S15588, SM004522S16129	NA	NA	UTEX1559_09803	NA	NA
Me1_v2_0138290	N0.HOG0003532	OG0002556	n0	NA	Azfi_s0022.g015984	AT5G02310	Bradi2g03180	CBR_g34200	NA	NA	CLOP_g6452, CLOP_g16792, CLOP_g6453, CLOP_g16791	9647, 9646	Me1_v2_0022760, Me1_v2_0138260, Me1_v2_0138240, Me1_v2_0138290	Mp7g16320	24280	NA	LOC_Os01g05500	PRCOL_00001936_RA	pm008568g0010, pm015290g0030	Pp3c10_20380, Pp3c3_24510, Pp3c3_37220, Pp3c22_8160, Pp3c8_2930, Pp3c8_2940	Solyc09g010830, Solyc10g084760	438209, 79007	SM000143S00761, SM000112S23980, SM000205S06204	Zci1a_30025	Zci_09397	UTEX1559_09004	UTEX1560_08689, UTEX1560_14040	Zm00001d039860
Me1_v2_0100130	N0.HOG0005175	OG0004011	n0	AagrOXF_evm.TU.utg000005l.503	Azfi_s0037.g026066, Azfi_s0015.g013704, Azfi_s0371.g067094, Azfi_s1566.g104355, Azfi_s0208.g057948	AT3G21290	Bradi1g72092	CBR_g20995, CBR_g20996	Chrsp127S01957	NA	CLOP_g23562	251	Me1_v2_0100130	Mp2g06020	27433	NA	LOC_Os03g08820	NA	NA	Pp3c17_1670, Pp3c12_1570	Solyc03g121380	426594	SM000013S26422, SM000087S23390, SM000045S16260	Zci1a_05075, Zci1a_05076	Zci_10679	UTEX1559_09237	UTEX1560_07904	Zm00001d006346, Zm00001d049274, Zm00001d033871, Zm00001d015824, Zm00001d027969, Zm00001d048236
Me1_v2_0120150	N0.HOG0000409	OG0000202	n0	AagrOXF_evm.TU.utg000103l.79, AagrOXF_evm.TU.utg000103l.77, AagrOXF_evm.TU.utg000049l.190	Azfi_s0015.g014023, Azfi_s0054.g033781, Azfi_s0083.g038856, Azfi_s0030.g024409, Azfi_s0008.g011470	AT5G07740, AT5G07780, AT5G07770, AT5G07760, AT5G07650, AT3G32410, AT2G25050, AT3G32420, AT3G32400, AT5G58160, AT1G42980, AT1G31810, AT5G67470, AT2G43800, AT3G07540, AT5G48360, AT3G25493, AT3G25500, AT3G05470, AT5G54650, AT1G59910, AT1G70140, AT1G24150	Bradi1g22717, Bradi4g03720, Bradi2g38520, Bradi1g47310, Bradi3g54030, Bradi5g17100, Bradi1g22980, Bradi1g70900, Bradi4g35330, Bradi2g57650, Bradi5g12470, Bradi3g36510, Bradi1g25380, Bradi5g02480, Bradi3g04640, Bradi3g59780	CBR_g37581	Chrsp112S01633	Cre06.g311250_4532, Cre04.g229163_4532, Cre03.g166700_4532	CLOP_g2774, CLOP_g9725, CLOP_g9726	4899, 4901, 3562	Me1_v2_0120160, Me1_v2_0120180, Me1_v2_0120170, Me1_v2_0013040, Me1_v2_0120150, Me1_v2_0013890, Me1_v2_0048710	Mp3g24420, Mp4g12830, Mp5g03400, Mp8g08720	13385, 4189, 4188, 4187, 4190	Olucimarinus_4622	LOC_Os07g40520, LOC_Os04g17130, LOC_Os06g08540, LOC_Os02g55170, LOC_Os02g55150, LOC_Os10g02980, LOC_Os03g31460, LOC_Os04g17120, LOC_Os07g39920, LOC_Os10g20710, LOC_Os07g13500, LOC_Os03g10680, LOC_Os09g34180, LOC_Os01g67240, LOC_Os04g38810, LOC_Os08g33430, LOC_Os07g36150, LOC_Os04g01070, LOC_Os02g06580, LOC_Os02g50570	PRCOL_00001083_RA	pm026919g0010, pm006424g0040, pm097137g0010, pm005197g0030, pm017488g0030, pm005197g0040, pm025777g0010, pm027648.t1	Pp3c8_18830, Pp3c4_16430, Pp3c12_4420, Pp3c8_18820, Pp3c22_15110, Pp3c18_4770, Pp3c23_15670, Pp3c8_18850, Pp3c26_5150	Solyc06g069670, Solyc06g069660, Solyc07g005500.2, Solyc12g010110, Solyc07g005480, Solyc08g075670, Solyc08g075650, Solyc07g052817.1, Solyc03g115680, Solyc07g052840.1, Solyc02g092470, Solyc03g044060, Solyc08g014430, Solyc12g019480, Solyc09g042740, Solyc06g082910, Solyc01g099650, Solyc10g044565.1, Solyc07g052730, Solyc05g046120, Solyc07g064010, Solyc10g006540, Solyc05g006430, Solyc03g113710	402115, 74599, 75640, 119203, 75677, 77222, 103199	SM000189S04074, SM000029S10579, SM000135S27043	Zci1a_16387	Zci_04989	UTEX1559_17366	UTEX1560_04585	Zm00001d022040, Zm00001d017027, Zm00001d006758, Zm00001d030781, Zm00001d030780, Zm00001d041515, Zm00001d030782, Zm00001d050024, Zm00001d045102, Zm00001d018371, Zm00001d032101, Zm00001d021985, Zm00001d032545, Zm00001d013926, Zm00001d028089, Zm00001d048142, Zm00001d021173, Zm00001d006132, Zm00001d042506, Zm00001d012158, Zm00001d003406, Zm00001d032225, Zm00001d006549, Zm00001d024947, Zm00001d004557, Zm00001d015326, Zm00001d017983
Me1_v2_0140900	N0.HOG0004189	OG0003137	n0	AagrOXF_evm.TU.utg000002l.196, AagrOXF_evm.TU.utg000033l.268	Azfi_s0362.g066911	AT1G24706	Bradi1g24950, Bradi2g58697	CBR_g39719	Chrsp50S06470	Cre12.g507700_4532	CLOP_g7622, CLOP_g14564	6121	Me1_v2_0140900, Me1_v2_0140890, Me1_v2_0140910, Me1_v2_0140920	Mp1g20320	28960, 28961	Olucimarinus_30063, Olucimarinus_119527	LOC_Os01g68810	PRCOL_00006124_RA	pm000666g0050, pm011901g0020, pm009335g0020, pm007061g0010	Pp3c11_17570	Solyc05g017890	173562	SM000009S23450, SM000277S10346, SM000067S20355	Zci1a_21625	Zci_06637	UTEX1559_16249	UTEX1560_09382	Zm00001d043861
Me1_v2_0012630	N0.HOG0004406	OG0003327	n0	AagrOXF_evm.TU.utg000006l.1080	Azfi_s0005.g008977, Azfi_s0042.g026935	AT2G25330, AT2G25320	Bradi3g48647	CBR_g20432	Chrsp3S05628	NA	CLOP_g12351	9182	Me1_v2_0080630, Me1_v2_0044290, Me1_v2_0080620, Me1_v2_0012630, Me1_v2_0001480, Me1_v2_0080580, Me1_v2_0045270, Me1_v2_0080590, Me1_v2_0080600	Mp8g09710	23559, 23560	NA	LOC_Os02g39990	NA	pm000083g0070, pm002218g0010	Pp3c1_12560, Pp3c2_25330, Pp3c2_25350	Solyc06g017970	173767	SM000153S01590, SM000126S26350, SM000002S05653	Zci1a_26814	Zci_01687	UTEX1559_12974	UTEX1560_12919	Zm00001d051075
Me1_v2_0157980	N0.HOG0005232	OG0004064	n0	AagrOXF_evm.TU.utg000012l.331, AagrOXF_evm.TU.utg000012l.330, AagrOXF_evm.TU.utg000012l.366	Azfi_s0293.g063447, Azfi_s1775.g106730	AT1G33390	Bradi3g59870	CBR_g66799	Chrsp1S03220	Cre07.g352251_4532	CLOP_g17302, CLOP_g9298	10938	Me1_v2_0031550, Me1_v2_0157970, Me1_v2_0157980	Mp4g04560	2869	Olucimarinus_38526	LOC_Os02g50370	PRCOL_00004828_RA	pm010281g0010, pm010855g0010, pm015659g0010	Pp3c3_18630	Solyc01g095710	74832	SM000079S22490, SM000001S04527, SM000070S21339	Zci1a_24345	Zci_15318	UTEX1559_12706	UTEX1560_14920	Zm00001d017967
Me1_v2_0119330	N0.HOG0004038	OG0002999	n0	AagrOXF_evm.TU.utg000006l.1089	Azfi_s0091.g042824	AT1G64790	Bradi1g10447	CBR_g28040	Chrsp66S07244	Cre01.g015600_4532	CLOP_g22614, CLOP_g1901	1197	Me1_v2_0119270, Me1_v2_0119300, Me1_v2_0119310, Me1_v2_0028530, Me1_v2_0119330	Mp6g12110	26347	Olucimarinus_81	LOC_Os03g51140, LOC_Os02g33540	PRCOL_00002743_RA	pm009027g0030, pm035379g0010, pm006974g0030	Pp3c22_8910	Solyc04g050520, Solyc04g050510	439212, 230367	SM001622S02342, SM000225S07012, SM000155S01668, SM000090S24288	Zci1a_02879	Zci_07500	UTEX1559_04225	UTEX1560_00274	Zm00001d053891, Zm00001d033817, Zm00001d053894
Me1_v2_0150800	N0.HOG0000993	OG0000553	n0	AagrOXF_evm.TU.utg000004l.42, AagrOXF_evm.TU.utg000116l.270	Azfi_s0009.g011871, Azfi_s0185.g056668	AT4G17140, AT1G48090	Bradi3g33740, Bradi3g43345	CBR_g4878	Chrsp17S02730	Cre17.g730650_4532, Cre17.g728250_4532, Cre17.g802076_4532, Cre12.g483500_4532	CLOP_g6030	9014, 11129	Me1_v2_0150790, Me1_v2_0150760, Me1_v2_0150750, Me1_v2_0150780, Me1_v2_0043420, Me1_v2_0007810, Me1_v2_0011090, Me1_v2_0150810, Me1_v2_0150800, Me1_v2_0032530, Me1_v2_0172640, Me1_v2_0172660	Mp3g08780, Mp7g07570, Mp3g11440	17845	Olucimarinus_4555	LOC_Os10g41560, LOC_Os02g27110, LOC_Os02g27130	PRCOL_00000265_RA, PRCOL_00002060_RA	pm010085g0010, pm010618g0040, pm007742g0050, pm007742g0040, pm058680g0010, pm010618g0060, pm010618.t2, pm042681.t1, pm021109g0020, pm031133g0030, pm024303.t1, pm049399g0010, pm002600g0020, pm020189g0040, pm031319g0010, pm023775g0010, pm020189.t1, pm006740g0020	Pp3c22_21110, Pp3c18_1370, Pp3c18_1376, Pp3c9_20320	Solyc08g077490, Solyc08g077500, Solyc12g015840, Solyc09g009370, Solyc09g009350.2	81414, 82033, 421223, 444978, 444977, 444980, 440026, 404260	SM000012S25329, SM000009S23509, SM000198S05311, SM000191S05224, SM000173S02996, SM000094S24675, SM000023S07679	Zci1a_30357, Zci1a_30360, Zci1a_30366, Zci1a_29258, Zci1a_30358, Zci1a_30359, Zci1a_30094	Zci_08871, Zci_11027	UTEX1559_04828, UTEX1559_03758	UTEX1560_15365, UTEX1560_17419, UTEX1560_06581, UTEX1560_07331	Zm00001d047074, Zm00001d053262, Zm00001d053260
Me1_v2_0094310	NA	NA	NA	NA	NA	NA	NA	NA	NA	NA	NA	NA	NA	NA	NA	NA	NA	NA	NA	NA	NA	NA	NA	NA	NA	NA	NA	NA
Me1_v2_0150780	N0.HOG0000993	OG0000553	n0	AagrOXF_evm.TU.utg000004l.42, AagrOXF_evm.TU.utg000116l.270	Azfi_s0009.g011871, Azfi_s0185.g056668	AT4G17140, AT1G48090	Bradi3g33740, Bradi3g43345	CBR_g4878	Chrsp17S02730	Cre17.g730650_4532, Cre17.g728250_4532, Cre17.g802076_4532, Cre12.g483500_4532	CLOP_g6030	9014, 11129	Me1_v2_0150790, Me1_v2_0150760, Me1_v2_0150750, Me1_v2_0150780, Me1_v2_0043420, Me1_v2_0007810, Me1_v2_0011090, Me1_v2_0150810, Me1_v2_0150800, Me1_v2_0032530, Me1_v2_0172640, Me1_v2_0172660	Mp3g08780, Mp7g07570, Mp3g11440	17845	Olucimarinus_4555	LOC_Os10g41560, LOC_Os02g27110, LOC_Os02g27130	PRCOL_00000265_RA, PRCOL_00002060_RA	pm010085g0010, pm010618g0040, pm007742g0050, pm007742g0040, pm058680g0010, pm010618g0060, pm010618.t2, pm042681.t1, pm021109g0020, pm031133g0030, pm024303.t1, pm049399g0010, pm002600g0020, pm020189g0040, pm031319g0010, pm023775g0010, pm020189.t1, pm006740g0020	Pp3c22_21110, Pp3c18_1370, Pp3c18_1376, Pp3c9_20320	Solyc08g077490, Solyc08g077500, Solyc12g015840, Solyc09g009370, Solyc09g009350.2	81414, 82033, 421223, 444978, 444977, 444980, 440026, 404260	SM000012S25329, SM000009S23509, SM000198S05311, SM000191S05224, SM000173S02996, SM000094S24675, SM000023S07679	Zci1a_30357, Zci1a_30360, Zci1a_30366, Zci1a_29258, Zci1a_30358, Zci1a_30359, Zci1a_30094	Zci_08871, Zci_11027	UTEX1559_04828, UTEX1559_03758	UTEX1560_15365, UTEX1560_17419, UTEX1560_06581, UTEX1560_07331	Zm00001d047074, Zm00001d053262, Zm00001d053260
Me1_v2_0133710	N0.HOG0028961	OG0026784	-	NA	NA	NA	NA	NA	NA	NA	NA	NA	Me1_v2_0133720, Me1_v2_0133730, Me1_v2_0133710	NA	NA	NA	NA	NA	NA	NA	NA	NA	NA	NA	NA	NA	NA	NA
Me1_v2_0150790	N0.HOG0000993	OG0000553	n0	AagrOXF_evm.TU.utg000004l.42, AagrOXF_evm.TU.utg000116l.270	Azfi_s0009.g011871, Azfi_s0185.g056668	AT4G17140, AT1G48090	Bradi3g33740, Bradi3g43345	CBR_g4878	Chrsp17S02730	Cre17.g730650_4532, Cre17.g728250_4532, Cre17.g802076_4532, Cre12.g483500_4532	CLOP_g6030	9014, 11129	Me1_v2_0150790, Me1_v2_0150760, Me1_v2_0150750, Me1_v2_0150780, Me1_v2_0043420, Me1_v2_0007810, Me1_v2_0011090, Me1_v2_0150810, Me1_v2_0150800, Me1_v2_0032530, Me1_v2_0172640, Me1_v2_0172660	Mp3g08780, Mp7g07570, Mp3g11440	17845	Olucimarinus_4555	LOC_Os10g41560, LOC_Os02g27110, LOC_Os02g27130	PRCOL_00000265_RA, PRCOL_00002060_RA	pm010085g0010, pm010618g0040, pm007742g0050, pm007742g0040, pm058680g0010, pm010618g0060, pm010618.t2, pm042681.t1, pm021109g0020, pm031133g0030, pm024303.t1, pm049399g0010, pm002600g0020, pm020189g0040, pm031319g0010, pm023775g0010, pm020189.t1, pm006740g0020	Pp3c22_21110, Pp3c18_1370, Pp3c18_1376, Pp3c9_20320	Solyc08g077490, Solyc08g077500, Solyc12g015840, Solyc09g009370, Solyc09g009350.2	81414, 82033, 421223, 444978, 444977, 444980, 440026, 404260	SM000012S25329, SM000009S23509, SM000198S05311, SM000191S05224, SM000173S02996, SM000094S24675, SM000023S07679	Zci1a_30357, Zci1a_30360, Zci1a_30366, Zci1a_29258, Zci1a_30358, Zci1a_30359, Zci1a_30094	Zci_08871, Zci_11027	UTEX1559_04828, UTEX1559_03758	UTEX1560_15365, UTEX1560_17419, UTEX1560_06581, UTEX1560_07331	Zm00001d047074, Zm00001d053262, Zm00001d053260
Me1_v2_0148570	N0.HOG0005046	OG0003893	n0	AagrOXF_evm.TU.utg000080l.15	Azfi_s0074.g037375	AT5G64070, AT5G09350	Bradi4g22690	CBR_g34503	Chrsp175S02412	Cre06.g304650_4532	CLOP_g7219	14201	Me1_v2_0049290, Me1_v2_0148560, Me1_v2_0148570	Mp6g21350	NA	Olucimarinus_40667	LOC_Os11g10420	NA	pm004261g0030, pm012619.t1, pm003590.t1	Pp3c5_11330, Pp3c6_11330	Solyc11g005910	97324, 269945	SM000218S06595, SM000031S11591, SM000092S24482	Zci1a_27860	Zci_01527	UTEX1559_16085	UTEX1560_07311	Zm00001d004249, Zm00001d007520, Zm00001d030412, Zm00001d049076
Me1_v2_0156930	N0.HOG0002541	OG0001705	n0	AagrOXF_evm.TU.utg000006l.486, AagrOXF_evm.TU.utg000010l.177, AagrOXF_evm.TU.utg000063l.523	Azfi_s0003.g007803, Azfi_s0078.g038277	AT5G63370, AT1G67580	Bradi5g13980, Bradi3g47990	CBR_g37685	Chrsp78S07698	Cre13.g575650_4532, Cre07.g355400_4532	CLOP_g3475	13072	Me1_v2_0156930, Me1_v2_0164220, Me1_v2_0202620	Mp7g02920	27639, 128, 129	Olucimarinus_32826, Olucimarinus_13763	LOC_Os04g41100, LOC_Os02g39010	PRCOL_00003448_RA	pm022433g0020, pm025297g0010, pm207358g0010, pm019863g0010, pm013209g0040, pm168659g0010	Pp3c2_25440, Pp3c11_12150	Solyc05g014760	29406, 99910, 81472	SM000044S16021, SM000106S13964, SM000208S06321	Zci1a_30305, Zci1a_20553	Zci_14144, Zci_13306	UTEX1559_09474, UTEX1559_00800	UTEX1560_12599, UTEX1560_12514, UTEX1560_12513	Zm00001d025739, Zm00001d003222, Zm00001d017128
Me1_v2_0217650	NA	NA	NA	NA	NA	NA	NA	NA	NA	NA	NA	NA	NA	NA	NA	NA	NA	NA	NA	NA	NA	NA	NA	NA	NA	NA	NA	NA
Me1_v2_0040460	NA	NA	NA	NA	NA	NA	NA	NA	NA	NA	NA	NA	NA	NA	NA	NA	NA	NA	NA	NA	NA	NA	NA	NA	NA	NA	NA	NA
Me1_v2_0011390	NA	NA	NA	NA	NA	NA	NA	NA	NA	NA	NA	NA	NA	NA	NA	NA	NA	NA	NA	NA	NA	NA	NA	NA	NA	NA	NA	NA
Me1_v2_0210760	N0.HOG0008150	OG0006811	n0	AagrOXF_evm.TU.utg000009l.349, AagrOXF_evm.TU.utg000091l.15	Azfi_s0207.g057902	AT1G55540	Bradi1g17390	NA	Chrsp17S02611	Cre07.g313500_4532	CLOP_g22481	5051	Me1_v2_0210760	Mp3g04100	NA	Olucimarinus_15396	LOC_Os07g48602	NA	pm005531g0030	Pp3c13_12950	Solyc02g032450, Solyc02g032380, Solyc02g032480, Solyc02g032490	NA	SM000043S15780, SM000089S23856, SM000271S10029	Zci1a_02815	Zci_07054	NA	UTEX1560_15351	Zm00001d022527
Me1_v2_0113230	N0.HOG0011818	OG0010217	n0	AagrOXF_evm.TU.utg000059l.392	NA	NA	NA	NA	NA	Cre08.g380151_4532	CLOP_g879	NA	Me1_v2_0113220, Me1_v2_0113230	NA	NA	NA	NA	PRCOL_00006361_RA	pm002978g0020	NA	NA	NA	NA	Zci1a_09933, Zci1a_09934, Zci1a_09935	Zci_06622	UTEX1559_13382	UTEX1560_09003	NA
Me1_v2_0195040	N0.HOG0002233	OG0001459	n0	AagrOXF_evm.TU.utg000005l.296, AagrOXF_evm.TU.utg000008l.331	Azfi_s0006.g010405, Azfi_s0051.g031293, Azfi_s0022.g016035	AT5G48090, AT5G55390	Bradi4g27190, Bradi3g22461, Bradi3g39730, Bradi1g67067, Bradi4g40047, Bradi4g40054, Bradi4g40061	CBR_g27889, CBR_g6344	Chrsp175S02363	NA	CLOP_g19405, CLOP_g21827, CLOP_g18137, CLOP_g11544	9892, 7800, 9893	Me1_v2_0195040	Mp1g03210, Mp3g02940, Mp4g03050, Mp2g00350	NA	NA	LOC_Os01g32710, LOC_Os01g32720, LOC_Os08g24946, LOC_Os08g24930, LOC_Os08g24880, LOC_Os08g39250, LOC_Os03g15990, LOC_Os12g12300	NA	pm008793g0020, pm027224g0010	Pp3c20_7180, Pp3c24_6370, Pp3c8_16830, Pp3c17_12870	Solyc10g051140, Solyc10g051150, Solyc10g006090	99176	NA	Zci1a_12855, Zci1a_12856	Zci_10708	UTEX1559_08849	UTEX1560_11312	Zm00001d019949, Zm00001d005137, Zm00001d019948, Zm00001d007886, Zm00001d052859, Zm00001d041180
Me1_v2_0035650	N0.HOG0039490	OG0037313	-	NA	NA	NA	NA	NA	NA	NA	NA	NA	Me1_v2_0017470, Me1_v2_0035650	NA	NA	NA	NA	NA	NA	NA	NA	NA	NA	NA	NA	NA	NA	NA
Me1_v2_0158320	N0.HOG0004154	OG0003104	n0	NA	Azfi_s0327.g065237	AT3G47910, AT3G47890	Bradi1g74000, Bradi1g74098	CBR_g34786	NA	Cre12.g515500_4532, Cre16.g670850_4532, Cre12.g508250_4532	CLOP_g17011, CLOP_g143, CLOP_g17010, CLOP_g17012	12945, 7629, 7450	Me1_v2_0020150, Me1_v2_0158320	NA	15163, 15164	NA	LOC_Os03g06950	PRCOL_00004010_RA	pm011102g0020, pm023355g0010, pm005679g0020, pm011102g0010	Pp3c27_3670, Pp3c16_3030	Solyc06g071120, Solyc10g050055.1, Solyc03g113370	NA	SM000211S06616, SM000167S02944, SM000184S03758	Zci1a_01030	Zci_13357	UTEX1559_12147	UTEX1560_15676	Zm00001d027807, Zm00001d048442
Me1_v2_0029330	N0.HOG0039448	OG0037271	-	NA	NA	NA	NA	NA	NA	NA	NA	NA	Me1_v2_0007070, Me1_v2_0029330	NA	NA	NA	NA	NA	NA	NA	NA	NA	NA	NA	NA	NA	NA	NA
Me1_v2_0150760	N0.HOG0000993	OG0000553	n0	AagrOXF_evm.TU.utg000004l.42, AagrOXF_evm.TU.utg000116l.270	Azfi_s0009.g011871, Azfi_s0185.g056668	AT4G17140, AT1G48090	Bradi3g33740, Bradi3g43345	CBR_g4878	Chrsp17S02730	Cre17.g730650_4532, Cre17.g728250_4532, Cre17.g802076_4532, Cre12.g483500_4532	CLOP_g6030	9014, 11129	Me1_v2_0150790, Me1_v2_0150760, Me1_v2_0150750, Me1_v2_0150780, Me1_v2_0043420, Me1_v2_0007810, Me1_v2_0011090, Me1_v2_0150810, Me1_v2_0150800, Me1_v2_0032530, Me1_v2_0172640, Me1_v2_0172660	Mp3g08780, Mp7g07570, Mp3g11440	17845	Olucimarinus_4555	LOC_Os10g41560, LOC_Os02g27110, LOC_Os02g27130	PRCOL_00000265_RA, PRCOL_00002060_RA	pm010085g0010, pm010618g0040, pm007742g0050, pm007742g0040, pm058680g0010, pm010618g0060, pm010618.t2, pm042681.t1, pm021109g0020, pm031133g0030, pm024303.t1, pm049399g0010, pm002600g0020, pm020189g0040, pm031319g0010, pm023775g0010, pm020189.t1, pm006740g0020	Pp3c22_21110, Pp3c18_1370, Pp3c18_1376, Pp3c9_20320	Solyc08g077490, Solyc08g077500, Solyc12g015840, Solyc09g009370, Solyc09g009350.2	81414, 82033, 421223, 444978, 444977, 444980, 440026, 404260	SM000012S25329, SM000009S23509, SM000198S05311, SM000191S05224, SM000173S02996, SM000094S24675, SM000023S07679	Zci1a_30357, Zci1a_30360, Zci1a_30366, Zci1a_29258, Zci1a_30358, Zci1a_30359, Zci1a_30094	Zci_08871, Zci_11027	UTEX1559_04828, UTEX1559_03758	UTEX1560_15365, UTEX1560_17419, UTEX1560_06581, UTEX1560_07331	Zm00001d047074, Zm00001d053262, Zm00001d053260
Me1_v2_0146450	N0.HOG0018252	OG0016222	n0	NA	NA	NA	NA	NA	NA	NA	NA	NA	Me1_v2_0146450	NA	NA	NA	NA	NA	NA	NA	NA	NA	NA	Zci1a_29976	Zci_07454	UTEX1559_09714	UTEX1560_02564, UTEX1560_02562	NA
Me1_v2_0172190	N0.HOG0005576	OG0004373	n0	AagrOXF_evm.TU.utg000020l.47	Azfi_s0051.g031459	AT3G19190	Bradi1g43830	NA	Chrsp45S06026	Cre09.g801072_4532	CLOP_g16451, CLOP_g25147, CLOP_g16452	15685, 9483	Me1_v2_0172190, Me1_v2_0172170	Mp6g18570	21292, 21293	Olucimarinus_24424	LOC_Os06g15700	PRCOL_00003309_RA	NA	Pp3c13_15610	Solyc01g108160	113891	SM000185S04049, SM003942S15163, SM000261S09959, SM000280S10720, SM000400S15602	Zci1a_24772	Zci_10115	UTEX1559_16524	UTEX1560_15701, UTEX1560_16956	Zm00001d037321, Zm00001d045692
Me1_v2_0140890	N0.HOG0004189	OG0003137	n0	AagrOXF_evm.TU.utg000002l.196, AagrOXF_evm.TU.utg000033l.268	Azfi_s0362.g066911	AT1G24706	Bradi1g24950, Bradi2g58697	CBR_g39719	Chrsp50S06470	Cre12.g507700_4532	CLOP_g7622, CLOP_g14564	6121	Me1_v2_0140900, Me1_v2_0140890, Me1_v2_0140910, Me1_v2_0140920	Mp1g20320	28960, 28961	Olucimarinus_30063, Olucimarinus_119527	LOC_Os01g68810	PRCOL_00006124_RA	pm000666g0050, pm011901g0020, pm009335g0020, pm007061g0010	Pp3c11_17570	Solyc05g017890	173562	SM000009S23450, SM000277S10346, SM000067S20355	Zci1a_21625	Zci_06637	UTEX1559_16249	UTEX1560_09382	Zm00001d043861
Me1_v2_0229500	N0.HOG0003425	OG0002460	n0	NA	NA	AT1G04860, AT2G32780	Bradi4g34490, Bradi3g43200, Bradi3g40998, Bradi3g40994, Bradi3g41010	CBR_g38465	NA	Cre12.g533250_4532	CLOP_g2088, CLOP_g9306	6039	Me1_v2_0229500	Mp7g16560	NA	NA	LOC_Os09g32740, LOC_Os08g41620, LOC_Os08g41610, LOC_Os08g41630, LOC_Os08g41530, LOC_Os08g41540, LOC_Os08g41550, LOC_Os08g41580, LOC_Os08g41560	PRCOL_00006111_RA	pm027379.t1, pm028299g0010, pm027379g0030, pm003011.t2, pm094511g0010	Pp3c18_14990, Pp3c22_11200, Pp3c9_16631, Pp3c19_20640	Solyc05g053690, Solyc09g091930	NA	SM000006S19335, SM000021S06458, SM000227S07459	Zci1a_09543	Zci_09227	UTEX1559_06487	UTEX1560_10005	Zm00001d006079, Zm00001d049806, Zm00001d035033
Me1_v2_0113220	N0.HOG0011818	OG0010217	n0	AagrOXF_evm.TU.utg000059l.392	NA	NA	NA	NA	NA	Cre08.g380151_4532	CLOP_g879	NA	Me1_v2_0113220, Me1_v2_0113230	NA	NA	NA	NA	PRCOL_00006361_RA	pm002978g0020	NA	NA	NA	NA	Zci1a_09933, Zci1a_09934, Zci1a_09935	Zci_06622	UTEX1559_13382	UTEX1560_09003	NA
Me1_v2_0119300	N0.HOG0004038	OG0002999	n0	AagrOXF_evm.TU.utg000006l.1089	Azfi_s0091.g042824	AT1G64790	Bradi1g10447	CBR_g28040	Chrsp66S07244	Cre01.g015600_4532	CLOP_g22614, CLOP_g1901	1197	Me1_v2_0119270, Me1_v2_0119300, Me1_v2_0119310, Me1_v2_0028530, Me1_v2_0119330	Mp6g12110	26347	Olucimarinus_81	LOC_Os03g51140, LOC_Os02g33540	PRCOL_00002743_RA	pm009027g0030, pm035379g0010, pm006974g0030	Pp3c22_8910	Solyc04g050520, Solyc04g050510	439212, 230367	SM001622S02342, SM000225S07012, SM000155S01668, SM000090S24288	Zci1a_02879	Zci_07500	UTEX1559_04225	UTEX1560_00274	Zm00001d053891, Zm00001d033817, Zm00001d053894
Me1_v2_0138260	N0.HOG0003532	OG0002556	n0	NA	Azfi_s0022.g015984	AT5G02310	Bradi2g03180	CBR_g34200	NA	NA	CLOP_g6452, CLOP_g16792, CLOP_g6453, CLOP_g16791	9647, 9646	Me1_v2_0022760, Me1_v2_0138260, Me1_v2_0138240, Me1_v2_0138290	Mp7g16320	24280	NA	LOC_Os01g05500	PRCOL_00001936_RA	pm008568g0010, pm015290g0030	Pp3c10_20380, Pp3c3_24510, Pp3c3_37220, Pp3c22_8160, Pp3c8_2930, Pp3c8_2940	Solyc09g010830, Solyc10g084760	438209, 79007	SM000143S00761, SM000112S23980, SM000205S06204	Zci1a_30025	Zci_09397	UTEX1559_09004	UTEX1560_08689, UTEX1560_14040	Zm00001d039860
Me1_v2_0138270	NA	NA	NA	NA	NA	NA	NA	NA	NA	NA	NA	NA	NA	NA	NA	NA	NA	NA	NA	NA	NA	NA	NA	NA	NA	NA	NA	NA
Me1_v2_0054050	NA	NA	NA	NA	NA	NA	NA	NA	NA	NA	NA	NA	NA	NA	NA	NA	NA	NA	NA	NA	NA	NA	NA	NA	NA	NA	NA	NA
Me1_v2_0115830	NA	NA	NA	NA	NA	NA	NA	NA	NA	NA	NA	NA	NA	NA	NA	NA	NA	NA	NA	NA	NA	NA	NA	NA	NA	NA	NA	NA
Me1_v2_0020580	NA	NA	NA	NA	NA	NA	NA	NA	NA	NA	NA	NA	NA	NA	NA	NA	NA	NA	NA	NA	NA	NA	NA	NA	NA	NA	NA	NA
Me1_v2_0119310	N0.HOG0004038	OG0002999	n0	AagrOXF_evm.TU.utg000006l.1089	Azfi_s0091.g042824	AT1G64790	Bradi1g10447	CBR_g28040	Chrsp66S07244	Cre01.g015600_4532	CLOP_g22614, CLOP_g1901	1197	Me1_v2_0119270, Me1_v2_0119300, Me1_v2_0119310, Me1_v2_0028530, Me1_v2_0119330	Mp6g12110	26347	Olucimarinus_81	LOC_Os03g51140, LOC_Os02g33540	PRCOL_00002743_RA	pm009027g0030, pm035379g0010, pm006974g0030	Pp3c22_8910	Solyc04g050520, Solyc04g050510	439212, 230367	SM001622S02342, SM000225S07012, SM000155S01668, SM000090S24288	Zci1a_02879	Zci_07500	UTEX1559_04225	UTEX1560_00274	Zm00001d053891, Zm00001d033817, Zm00001d053894
Me1_v2_0124820	NA	NA	NA	NA	NA	NA	NA	NA	NA	NA	NA	NA	NA	NA	NA	NA	NA	NA	NA	NA	NA	NA	NA	NA	NA	NA	NA	NA
Me1_v2_0066620	N0.HOG0039636	OG0037459	-	NA	NA	NA	NA	NA	NA	NA	NA	NA	Me1_v2_0066620	NA	NA	NA	NA	NA	NA	NA	NA	NA	NA	Zci1a_37334	NA	NA	NA	NA
Me1_v2_0099780	N0.HOG0018210	OG0016180	n0	NA	NA	NA	NA	NA	NA	NA	NA	NA	Me1_v2_0020780, Me1_v2_0221490, Me1_v2_0221590, Me1_v2_0112330, Me1_v2_0099780, Me1_v2_0137410	NA	NA	NA	NA	NA	NA	NA	NA	NA	NA	NA	NA	NA	NA	NA
Me1_v2_0176370	N0.HOG0001595	OG0000972	n39	AagrOXF_evm.TU.utg000126l.38	Azfi_s0207.g057909	AT1G66730	Bradi2g46780	CBR_g29902	Chrsp4S06177	Cre06.g278177_4532	CLOP_g11430	13337	Me1_v2_0176360, Me1_v2_0221230, Me1_v2_0176370, Me1_v2_0176340	Mp2g23970	18453	NA	LOC_Os01g49180	PRCOL_00006882_RA	pm010811g0010, pm004122g0010, pm009711.t1	NA	Solyc02g091120	96808	SM000006S19383, SM000009S23624, SM000022S07234	Zci1a_36642, Zci1a_36641	Zci_14421	UTEX1559_10728	UTEX1560_02752	Zm00001d043835, Zm00001d037924, Zm00001d036733
Me1_v2_0099750	NA	NA	NA	NA	NA	NA	NA	NA	NA	NA	NA	NA	NA	NA	NA	NA	NA	NA	NA	NA	NA	NA	NA	NA	NA	NA	NA	NA
Me1_v2_0133730	N0.HOG0028961	OG0026784	-	NA	NA	NA	NA	NA	NA	NA	NA	NA	Me1_v2_0133720, Me1_v2_0133730, Me1_v2_0133710	NA	NA	NA	NA	NA	NA	NA	NA	NA	NA	NA	NA	NA	NA	NA
Me1_v2_0131590	N0.HOG0002880	OG0001990	n0	AagrOXF_evm.TU.utg000058l.465	Azfi_s0035.g025604	AT5G47020, AT5G11700, AT4G32920	Bradi5g00847, Bradi2g05560, Bradi2g33487	CBR_g812, CBR_g48138, CBR_g809	NA	NA	CLOP_g1132, CLOP_g1131	11015, 11014	Me1_v2_0033940, Me1_v2_0131580, Me1_v2_0018800, Me1_v2_0131590	Mp8g11390	5888	NA	LOC_Os04g10380, LOC_Os01g09246, LOC_Os05g09360	NA	pm009934g0030	Pp3c11_4740, Pp3c1_6240, Pp3c27_7260, Pp3c9_7080, Pp3c15_12090	Solyc08g077430, Solyc05g026080, Solyc05g026060, Solyc08g065980, Solyc05g026070.1	98651	SM000083S22730, SM000115S23934, SM000328S12470	Zci1a_26903	Zci_14814	UTEX1559_14494	UTEX1560_14111	Zm00001d025024, Zm00001d008789, Zm00001d039522, Zm00001d039736, Zm00001d004397, Zm00001d032106, Zm00001d037696
Me1_v2_0213410	N0.HOG0009375	OG0007968	n0	AagrOXF_evm.TU.utg000017l.198	Azfi_s0019.g015039, Azfi_s0032.g024707	AT5G02520, AT1G58210	Bradi4g44060, Bradi5g25291, Bradi3g30800	NA	Chrsp31S04799	NA	NA	NA	Me1_v2_0213390, Me1_v2_0213410	Mp6g05060, Mp6g06150	NA	NA	LOC_Os04g28050, LOC_Os04g28040, LOC_Os01g34610	NA	NA	Pp3c10_3430, Pp3c14_3020	Solyc09g010550, Solyc04g015710	NA	NA	NA	NA	NA	NA	Zm00001d020129
Me1_v2_0217660	N0.HOG0001142	OG0000658	n0	AagrOXF_evm.TU.utg000100l.278	Azfi_s0008.g011419, Azfi_s0538.g076313, Azfi_s0132.g049282, Azfi_s0320.g064478	AT3G14270, AT4G33240, AT1G71010, AT1G34260	Bradi1g60357, Bradi3g37350, Bradi3g36397, Bradi1g44047, Bradi2g56547, Bradi3g13177, Bradi5g27540	CBR_g4068	Chrsp17S02689	Cre12.g523050_4532	CLOP_g15787	12971	Me1_v2_0217670, Me1_v2_0217660, Me1_v2_0149040, Me1_v2_0149050, Me1_v2_0001240, Me1_v2_0149070, Me1_v2_0149080, Me1_v2_0025470, Me1_v2_0149060	Mp2g04850	19017	NA	LOC_Os03g28140, LOC_Os08g34950, LOC_Os08g33200, LOC_Os09g23740, LOC_Os06g14750, LOC_Os09g10650, LOC_Os12g13440, LOC_Os08g01390, LOC_Os04g59540	PRCOL_00002135_RA	pm003221g0070, pm008110g0020, pm024458g0020, pm016855g0010, pm127174g0010, pm001205g0010	Pp3c17_4720, Pp3c14_13540, Pp3c17_19810, Pp3c14_12410	Solyc12g049590, Solyc03g123570, Solyc07g017510, Solyc05g008200, Solyc04g007650, Solyc11g013830, Solyc11g013820, Solyc06g065540	144057, 417958	SM000086S23020, SM000002S05547, SM000015S01185	Zci1a_02363, Zci1a_05061	Zci_10288, Zci_10222	UTEX1559_17480, UTEX1559_01749, UTEX1559_15620	UTEX1560_16833, UTEX1560_11184, UTEX1560_16832, UTEX1560_17385, UTEX1560_19472, UTEX1560_15216	Zm00001d029443, Zm00001d050089, Zm00001d032238, Zm00001d020414, Zm00001d037332, Zm00001d042662, Zm00001d049734, Zm00001d035004, Zm00001d022291, Zm00001d037223, Zm00001d032540, Zm00001d002940
Me1_v2_0057170	N0.HOG0003240	OG0002305	n0	AagrOXF_evm.TU.utg000058l.475, AagrOXF_evm.TU.utg000015l.39, AagrOXF_evm.TU.utg000015l.37	Azfi_s2677.g112617, Azfi_s0045.g029801, Azfi_s0108.g045225	AT3G52250	Bradi2g38160	CBR_g49682	NA	Cre06.g264400_4532	NA	7358	Me1_v2_0057170, Me1_v2_0057180	Mp1g21450	11265, 11263, 11264	Olucimarinus_24137	LOC_Os05g03550	NA	pm010238g0060	Pp3c7_16800, Pp3c11_8790, Pp3c11_8780, Pp3c12_21500, Pp3c12_21290, Pp3c4_7100, Pp3c4_6990	Solyc04g049120	78396, 79245, 438226	SM000189S04105, SM000029S10539, SM000135S26993	Zci1a_22446, Zci1a_22447, Zci1a_22449, Zci1a_22448, Zci1a_22445	Zci_12115	UTEX1559_07970	UTEX1560_00745	Zm00001d010967, Zm00001d035470, Zm00001d024608, Zm00001d030437
Me1_v2_0137410	N0.HOG0018210	OG0016180	n0	NA	NA	NA	NA	NA	NA	NA	NA	NA	Me1_v2_0020780, Me1_v2_0221490, Me1_v2_0221590, Me1_v2_0112330, Me1_v2_0099780, Me1_v2_0137410	NA	NA	NA	NA	NA	NA	NA	NA	NA	NA	NA	NA	NA	NA	NA
Me1_v2_0110510	NA	NA	NA	NA	NA	NA	NA	NA	NA	NA	NA	NA	NA	NA	NA	NA	NA	NA	NA	NA	NA	NA	NA	NA	NA	NA	NA	NA
Me1_v2_0066650	N0.HOG0004704	OG0003588	n3	AagrOXF_evm.TU.utg000027l.316	NA	AT2G41700	NA	CBR_g38217	Chrsp94S08294	Cre02.g077951_4532	NA	1956, 2357	Me1_v2_0063090, Me1_v2_0066650, Me1_v2_0066670	Mp3g20090	24979, 24977, 24978, 22593, 22594, 22595, 22255, 23590, 23591	NA	NA	PRCOL_00001457_RA	NA	Pp3c4_27650, Pp3c5_21220	Solyc04g015970	446307	SM000321S12201, SM000142S00525, SM000343S12828, SM000176S03111	Zci1a_37426	Zci_15352	UTEX1559_12673	UTEX1560_17106, UTEX1560_17300	NA
Me1_v2_0023850	NA	NA	NA	NA	NA	NA	NA	NA	NA	NA	NA	NA	NA	NA	NA	NA	NA	NA	NA	NA	NA	NA	NA	NA	NA	NA	NA	NA
Me1_v2_0077700	N0.HOG0008639	OG0007281	n0	AagrOXF_evm.TU.utg000033l.180	NA	NA	NA	CBR_g4736	Chrsp290S04333	NA	CLOP_g2573, CLOP_g2574	12505	Me1_v2_0077700, Me1_v2_0077690	Mp1g25770	NA	NA	NA	NA	pm002768g0120, pm023416g0020, pm023416g0010, pm000167g0020, pm077108g0010, pm000167g0030	Pp3c6_23030, Pp3c10_4050, Pp3c14_4530	NA	NA	SM000049S16681, SM000068S20543	Zci1a_37236	Zci_09449	UTEX1559_07011	UTEX1560_08512	NA
Me1_v2_0037870	N0.HOG0001323	OG0000777	n29	AagrOXF_evm.TU.utg000096l.16, AagrOXF_evm.TU.utg000006l.500	Azfi_s0117.g046546, Azfi_s0061.g035046, Azfi_s0092.g043087, Azfi_s0271.g061215	AT4G27910, AT5G53430, AT3G61740	Bradi2g45430, Bradi2g07082	CBR_g18930	Chrsp12S00102	Cre12.g515050_4532	CLOP_g21244, CLOP_g4366, CLOP_g21245	9780	Me1_v2_0037870, Me1_v2_0071260	Mp4g21720	8382, 8383	Olucimarinus_14486	LOC_Os01g46700, LOC_Os01g11960, LOC_Os01g11952	PRCOL_00007083_RA	pm028843g0010, pm006036g0010, pm013904g0020, pm006036g0040, pm012088.t1	Pp3c13_19810, Pp3c3_23770	Solyc03g083410, Solyc01g095890, Solyc03g112690.1	142359, 164635	SM000085S23199, SM000015S01304, SM000128S26220	Zci1a_00293, Zci1a_28051	Zci_11195	UTEX1559_10526	UTEX1560_00317	Zm00001d011490, Zm00001d044020, Zm00001d039355, Zm00001d008941, Zm00001d003814
Me1_v2_0075920	N0.HOG0005762	OG0004553	n0	NA	Azfi_s0213.g058302	AT1G56290	Bradi1g09200, Bradi1g09173	CBR_g41119	NA	Cre17.g741550_4532	CLOP_g19953	1311	Me1_v2_0075920, Me1_v2_0075930, Me1_v2_0049080	Mp4g02790	5979	Olucimarinus_94779, Olucimarinus_38158	LOC_Os03g52980	PRCOL_00006475_RA	pm004980g0040, pm017976g0010, pm004980g0050, pm016415g0010, pm017976g0020	Pp3c6_28790	Solyc09g083420	82218	SM000090S24343, SM000200S05834, SM002520S09021	Zci1a_39882	Zci_03026	UTEX1559_15434	UTEX1560_05748, UTEX1560_16716	Zm00001d033954
Me1_v2_0010340	N0.HOG0039464	OG0037287	-	NA	NA	NA	NA	NA	NA	NA	NA	NA	Me1_v2_0138200, Me1_v2_0010340	NA	NA	NA	NA	NA	NA	NA	NA	NA	NA	NA	NA	NA	NA	NA
Me1_v2_0124810	NA	NA	NA	NA	NA	NA	NA	NA	NA	NA	NA	NA	NA	NA	NA	NA	NA	NA	NA	NA	NA	NA	NA	NA	NA	NA	NA	NA
Me1_v2_0232680	NA	NA	NA	NA	NA	NA	NA	NA	NA	NA	NA	NA	NA	NA	NA	NA	NA	NA	NA	NA	NA	NA	NA	NA	NA	NA	NA	NA
Me1_v2_0021800	NA	NA	NA	NA	NA	NA	NA	NA	NA	NA	NA	NA	NA	NA	NA	NA	NA	NA	NA	NA	NA	NA	NA	NA	NA	NA	NA	NA
Me1_v2_0115840	N0.HOG0003945	OG0002922	n0	AagrOXF_evm.TU.utg000080l.100	Azfi_s0027.g023559	AT2G46020	Bradi3g01297	CBR_g12457	Chrsp23S03787	Cre07.g325700_4532	CLOP_g9618	5905	Me1_v2_0003100, Me1_v2_0041720, Me1_v2_0031690, Me1_v2_0115840	Mp1g17010	15465, 15463, 15464	Olucimarinus_16250	LOC_Os02g02290	PRCOL_00004212_RA	pm001407.t2, pm042887g0010, pm000701g0010	Pp3c13_14440, Pp3c3_15820	Solyc01g094800	60241	SM000024S07727, SM000100S09425, SM000102S09199, SM004228S15722	Zci1a_15203	Zci_11759, Zci_11788	UTEX1559_03794, UTEX1559_08089, UTEX1559_08090	UTEX1560_12937, UTEX1560_10623	Zm00001d054056, Zm00001d014977
Me1_v2_0012070	NA	NA	NA	NA	NA	NA	NA	NA	NA	NA	NA	NA	NA	NA	NA	NA	NA	NA	NA	NA	NA	NA	NA	NA	NA	NA	NA	NA
Me1_v2_0029900	NA	NA	NA	NA	NA	NA	NA	NA	NA	NA	NA	NA	NA	NA	NA	NA	NA	NA	NA	NA	NA	NA	NA	NA	NA	NA	NA	NA
Me1_v2_0137580	N0.HOG0039736	OG0037559	-	NA	NA	NA	NA	NA	NA	NA	NA	NA	Me1_v2_0137580, Me1_v2_0137570	NA	NA	NA	NA	NA	NA	NA	NA	NA	NA	NA	NA	NA	NA	NA
Me1_v2_0146120	N0.HOG0039757	OG0037580	-	NA	NA	NA	NA	NA	NA	NA	NA	NA	Me1_v2_0146070, Me1_v2_0146120	NA	NA	NA	NA	NA	NA	NA	NA	NA	NA	NA	NA	NA	NA	NA
Me1_v2_0176360	N0.HOG0001595	OG0000972	n39	AagrOXF_evm.TU.utg000126l.38	Azfi_s0207.g057909	AT1G66730	Bradi2g46780	CBR_g29902	Chrsp4S06177	Cre06.g278177_4532	CLOP_g11430	13337	Me1_v2_0176360, Me1_v2_0221230, Me1_v2_0176370, Me1_v2_0176340	Mp2g23970	18453	NA	LOC_Os01g49180	PRCOL_00006882_RA	pm010811g0010, pm004122g0010, pm009711.t1	NA	Solyc02g091120	96808	SM000006S19383, SM000009S23624, SM000022S07234	Zci1a_36642, Zci1a_36641	Zci_14421	UTEX1559_10728	UTEX1560_02752	Zm00001d043835, Zm00001d037924, Zm00001d036733
Me1_v2_0139970	N0.HOG0039741	OG0037564	-	NA	NA	NA	NA	NA	NA	NA	NA	NA	Me1_v2_0139960, Me1_v2_0139970	NA	NA	NA	NA	NA	NA	NA	NA	NA	NA	NA	NA	NA	NA	NA
Me1_v2_0226270	N0.HOG0000628	OG0000328	n2	AagrOXF_evm.TU.utg000049l.730	Azfi_s0103.g044628, Azfi_s0001.g000131, Azfi_s0032.g024633, Azfi_s2728.g112791	AT4G20400, AT1G30810, AT2G34880, AT2G38950, AT1G08620	Bradi2g31107, Bradi3g39457, Bradi2g14600	NA	Chrsp31S04852	Cre03.g169950_4532	CLOP_g11140	NA	Me1_v2_0084320, Me1_v2_0226270	Mp6g20340	28085	Olucimarinus_30668	LOC_Os05g23670, LOC_Os05g10770	PRCOL_00000224_RA	pm014393g0010, pm007877g0020, pm010483g0030, pm014393.t1	Pp3c27_4220, Pp3c16_4220, Pp3c27_4210	Solyc02g069740, Solyc06g008490, Solyc04g009990	170257, 98011	NA	Zci1a_28246, Zci1a_33241, Zci1a_23011	Zci_05271	UTEX1559_13854	UTEX1560_06404	Zm00001d018647, Zm00001d049477, Zm00001d037803, Zm00001d037313, Zm00001d051959, Zm00001d051964, Zm00001d051961, Zm00001d051965, Zm00001d051963, Zm00001d051958
Me1_v2_0011770	N0.HOG0028853	OG0026676	-	NA	NA	NA	NA	NA	NA	NA	NA	NA	Me1_v2_0136330, Me1_v2_0191140, Me1_v2_0011770	NA	NA	NA	NA	NA	NA	NA	NA	NA	NA	NA	NA	NA	NA	NA
Me1_v2_0017470	N0.HOG0039490	OG0037313	-	NA	NA	NA	NA	NA	NA	NA	NA	NA	Me1_v2_0017470, Me1_v2_0035650	NA	NA	NA	NA	NA	NA	NA	NA	NA	NA	NA	NA	NA	NA	NA
Me1_v2_0099090	N0.HOG0023766	OG0021622	n0	NA	NA	NA	NA	NA	NA	NA	NA	NA	Me1_v2_0099090	NA	NA	NA	NA	NA	pm048998.t1, pm048998.t2	NA	NA	NA	SM008264S22696	NA	NA	NA	NA	NA
Me1_v2_0138660	N0.HOG0003225	OG0002291	n0	AagrOXF_evm.TU.utg000009l.474	NA	AT3G05380, AT5G27610, AT3G21430	Bradi2g05824, Bradi3g01340	CBR_g26287, CBR_g26286	Chrsp26S04088	Cre17.g736850_4532, Cre13.g570150_4532	CLOP_g7754	801	Me1_v2_0115400, Me1_v2_0138670, Me1_v2_0138660	Mp8g06450	27955	Olucimarinus_27410, Olucimarinus_27481	LOC_Os01g09760, LOC_Os03g43800	NA	pm003200g0030, pm024894g0010	Pp3c7_2390, Pp3c11_23240	Solyc01g067560, Solyc12g098160	420594	SM000322S12500, SM000194S04833, SM000145S00808, SM002512S08656	Zci1a_21101, Zci1a_21103, Zci1a_21102	Zci_02589	UTEX1559_15780	UTEX1560_02005, UTEX1560_02006, UTEX1560_02009	Zm00001d039475, Zm00001d008800, Zm00001d026362, Zm00001d039537, Zm00001d051349
Me1_v2_0023070	NA	NA	NA	NA	NA	NA	NA	NA	NA	NA	NA	NA	NA	NA	NA	NA	NA	NA	NA	NA	NA	NA	NA	NA	NA	NA	NA	NA
Me1_v2_0043040	NA	NA	NA	NA	NA	NA	NA	NA	NA	NA	NA	NA	NA	NA	NA	NA	NA	NA	NA	NA	NA	NA	NA	NA	NA	NA	NA	NA
Me1_v2_0140850	N0.HOG0003376	OG0002414	n0	AagrOXF_evm.TU.utg000050l.544, AagrOXF_evm.TU.utg000050l.542	Azfi_s0028.g024000, Azfi_s0221.g058736	AT1G50410, AT3G16600, AT3G20010, AT1G11100, AT1G61140	Bradi1g45620, Bradi3g15380, Bradi5g22745, Bradi2g51727	CBR_g39733, CBR_g39735	NA	Cre01.g046237_4532	CLOP_g4602, CLOP_g9680	4905	Me1_v2_0040830, Me1_v2_0140850, Me1_v2_0023360	Mp8g05230	NA	NA	LOC_Os08g08220, LOC_Os04g53720, LOC_Os01g57110	PRCOL_00001862_RA	pm000037g0120, pm000744g0090	Pp3c21_12900, Pp3c18_11770	Solyc02g050280, Solyc03g006570	429547	SM000083S22765	Zci1a_30090	Zci_06760	UTEX1559_13324	UTEX1560_10042, UTEX1560_10041	Zm00001d049455, Zm00001d026366, Zm00001d045663, Zm00001d047956, Zm00001d012624
Me1_v2_0124830	N0.HOG0000004	OG0000004	n2	NA	Azfi_s0079.g038347, Azfi_s0415.g068611	AT3G60966, AT2G44581, AT2G44578, AT1G04790	Bradi2g06845, Bradi3g09430, Bradi5g19690, Bradi3g52050, Bradi1g39048, Bradi2g26393, Bradi1g38420, Bradi1g39044, Bradi2g26390, Bradi5g15450, Bradi4g18307, Bradi2g50200, Bradi2g22650, Bradi2g54020, Bradi2g06840, Bradi3g09410, Bradi1g39010, Bradi2g26370, Bradi2g53640, Bradi3g17130, Bradi3g09395, Bradi3g09390, Bradi3g09407, Bradi1g39040, Bradi2g26383, Bradi2g31670, Bradi2g26375, Bradi2g06850, Bradi3g09424, Bradi3g09416, Bradi2g06870, Bradi2g06880, Bradi2g06886, Bradi1g75050, Bradi2g06860	NA	Chrsp49S06124	Cre01.g051700_4532, Cre01.g009101_4532, Cre07.g350867_4532	CLOP_g7503, CLOP_g24834, CLOP_g1723	NA	Me1_v2_0057580, Me1_v2_0124830, Me1_v2_0115990, Me1_v2_0178440	Mp4g20140, Mp3g00390	23484, 23485	Olucimarinus_17416, Olucimarinus_32341	LOC_Os01g11480, LOC_Os02g15120, LOC_Os04g49700, LOC_Os02g46340, LOC_Os06g34640, LOC_Os04g43220, LOC_Os01g55110, LOC_Os05g39260, LOC_Os01g61470, LOC_Os01g11460, LOC_Os02g15060, LOC_Os06g34400, LOC_Os02g15020, LOC_Os02g15080, LOC_Os09g37050, LOC_Os08g05560, LOC_Os02g15010, LOC_Os02g15000, LOC_Os06g34610, LOC_Os06g34870, LOC_Os06g34860, LOC_Os06g34620, LOC_Os06g34530, LOC_Os06g34880, LOC_Os06g34560, LOC_Os06g34470, LOC_Os05g07140, LOC_Os03g45230, LOC_Os05g15170, LOC_Os06g34430, LOC_Os12g24530, LOC_Os12g24490, LOC_Os01g11490, LOC_Os02g15110, LOC_Os02g15100, LOC_Os06g06150, LOC_Os01g11520, LOC_Os03g05570, LOC_Os12g01750, LOC_Os07g34180, LOC_Os01g11500	PRCOL_00003813_RA	pm019319.t1, pm001160g0050, pm070827g0010, pm022095.t1, pm001592g0020, pm014122g0010, pm001127g0090, pm025548g0010, pm004221g0040, pm007800g0010, pm001505g0030, pm004608g0010, pm030781g0020, pm016253g0010, pm009078g0020, pm020206.t1, pm021560.t1, pm021562g0010, pm008628g0020, pm022026g0010, pm066121g0010, pm007886.t1, pm020866g0010, pm029760.t1, pm036314g0010, pm008062g0020, pm006451g0020, pm025542g0010, pm035637g0010, pm015135g0010, pm024594g0010, pm001810g0030, pm024278g0010, pm014785g0010, pm009175g0020, pm004223g0010	NA	Solyc09g091480	443606, 39820	SM000059S18711, SM000170S02672, SM000148S01013, SM000056S17992, SM000107S14044, SM000003S11079, SM000016S01885, SM000014S00363, SM000038S14294	Zci1a_35363	Zci_01888	UTEX1559_09226	UTEX1560_05521	Zm00001d053433, Zm00001d016136, Zm00001d026032, Zm00001d002519, Zm00001d017653, Zm00001d046152, Zm00001d046154, Zm00001d025837, Zm00001d043422, Zm00001d012720, Zm00001d038420, Zm00001d010587, Zm00001d039377, Zm00001d016104, Zm00001d046143, Zm00001d046145, Zm00001d016142, Zm00001d016140, Zm00001d024632, Zm00001d016143, Zm00001d037019, Zm00001d046151, Zm00001d037533, Zm00001d010042, Zm00001d037023, Zm00001d046147, Zm00001d053434, Zm00001d016137, Zm00001d016139, Zm00001d045308, Zm00001d027685, Zm00001d039375, Zm00001d008914
Me1_v2_0050560	N0.HOG0018221	OG0016191	n0	NA	NA	NA	NA	NA	NA	NA	NA	NA	Me1_v2_0050560	NA	27544	NA	NA	NA	pm010349g0010, pm003396g0010, pm010860g0020, pm032563g0010	NA	NA	NA	NA	NA	NA	NA	NA	NA
Me1_v2_0159510	N0.HOG0039500	OG0037323	-	NA	NA	NA	NA	NA	NA	NA	NA	NA	Me1_v2_0019540, Me1_v2_0159510	NA	NA	NA	NA	NA	NA	NA	NA	NA	NA	NA	NA	NA	NA	NA
Me1_v2_0152280	N0.HOG0002227	OG0001453	n0	AagrOXF_evm.TU.utg000001l.3	Azfi_s0215.g058455, Azfi_s0032.g024963, Azfi_s0149.g053254, Azfi_s0241.g059775	AT1G62050, AT1G62045, AT1G11740, AT1G04780, AT3G24210, AT3G04470	Bradi1g26410, Bradi1g28990, Bradi3g54910	CBR_g48701	Chrsp12S01965	Cre08.g375150_4532	NA	527	Me1_v2_0152290, Me1_v2_0152320, Me1_v2_0152330, Me1_v2_0152280, Me1_v2_0152310	Mp3g08700	20476, 20477	Olucimarinus_93744	LOC_Os07g32790, LOC_Os07g25460, LOC_Os02g56530	PRCOL_00004934_RA	pm001794g0030, pm000109g0030, pm258704g0010	Pp3c17_7170, Pp3c14_11630	Solyc02g080610, Solyc09g091560, Solyc05g054970, Solyc06g036620.1, Solyc06g036630	88989, 135166, 145231, 169694, 110129	SM000296S11300, SM000193S05186, SM000102S09185	Zci1a_41981	Zci_05541	UTEX1559_05339	UTEX1560_03724	Zm00001d021613, Zm00001d019522, Zm00001d005442, Zm00001d051948, Zm00001d018443
Me1_v2_0055570	N0.HOG0004195	OG0003143	n0	AagrOXF_evm.TU.utg000003l.303	Azfi_s0038.g026359	AT4G29380	Bradi3g54140	CBR_g47981	Chrsp26S04158	Cre06.g290500_4532	CLOP_g2806, CLOP_g2807, CLOP_g10217	10412	Me1_v2_0035340, Me1_v2_0055580, Me1_v2_0055570, Me1_v2_0004550, Me1_v2_0055550	Mp1g27200	6047	Olucimarinus_30739	LOC_Os02g55340	PRCOL_00004168_RA	pm044148g0010, pm109708g0010, pm020369g0010	Pp3c9_3860, Pp3c15_10000	Solyc04g012170	230900	SM000022S07150, SM000006S19536, SM000116S24241	Zci1a_22572	Zci_02926	UTEX1559_03047, UTEX1559_03046, UTEX1559_03045	UTEX1560_01765	Zm00001d052028, Zm00001d018382
Me1_v2_0000470	N0.HOG0039417	OG0037240	-	NA	NA	NA	NA	NA	NA	NA	NA	NA	Me1_v2_0000470	NA	NA	NA	NA	NA	NA	NA	NA	NA	SM011095S18755	NA	NA	NA	NA	NA
Me1_v2_0021330	NA	NA	NA	NA	NA	NA	NA	NA	NA	NA	NA	NA	NA	NA	NA	NA	NA	NA	NA	NA	NA	NA	NA	NA	NA	NA	NA	NA
Me1_v2_0226260	N0.HOG0000631	OG0000328	n95	AagrOXF_evm.TU.utg000049l.265, AagrOXF_evm.TU.utg000049l.264	Azfi_s0102.g044616	AT1G63490	Bradi1g29247, Bradi2g14953	NA	NA	NA	CLOP_g5514, CLOP_g15845	8877	Me1_v2_0226260	Mp8g17910	27554, 27556, 27557, 27555	Olucimarinus_19230, Olucimarinus_17878	NA	PRCOL_00007006_RA	pm049956g0010, pm004212g0030, pm010882g0020, pm079841g0010, pm098986g0010	Pp3c21_10100, Pp3c21_10500	Solyc08g081000	956	SM000050S17009, SM000073S21444	Zci1a_29829	Zci_00379	UTEX1559_19149, UTEX1559_07259	UTEX1560_09475, UTEX1560_15344	Zm00001d014900, Zm00001d036236, Zm00001d008571, Zm00001d008572
Me1_v2_0034850	N0.HOG0008695	OG0007336	n0	AagrOXF_evm.TU.utg000103l.145	Azfi_s0098.g043922, Azfi_s1527.g104151	AT1G35660	Bradi2g56490	CBR_g40969	NA	NA	CLOP_g15624	3683	Me1_v2_0034850, Me1_v2_0026310, Me1_v2_0136340	Mp1g09080	NA	NA	LOC_Os01g65320	NA	pm000704g0050	Pp3c15_6380	Solyc06g065360	NA	SM000076S21790, SM000030S11361, SM000028S10181	Zci1a_18494	Zci_07348	UTEX1559_06774	UTEX1560_12046	Zm00001d042670
Me1_v2_0144710	N0.HOG0007340	OG0006046	n0	AagrOXF_evm.TU.utg000049l.594	Azfi_s0064.g035464, Azfi_s0001.g000892, Azfi_s0010.g012042	AT3G50370	Bradi1g60500	NA	Chrsp44S05784	Cre01.g013600_4532	CLOP_g9740, CLOP_g5214, CLOP_g13861	11039, 11038	Me1_v2_0144710, Me1_v2_0144700	Mp3g23710	NA	NA	LOC_Os03g27820	NA	pm017210.t1	Pp3c7_3230, Pp3c11_18520, Pp3c11_18522	Solyc02g090760	440052	NA	Zci1a_44487, Zci1a_35343	Zci_13273	UTEX1559_15692	UTEX1560_07366	Zm00001d029422
Me1_v2_0152310	N0.HOG0002227	OG0001453	n0	AagrOXF_evm.TU.utg000001l.3	Azfi_s0215.g058455, Azfi_s0032.g024963, Azfi_s0149.g053254, Azfi_s0241.g059775	AT1G62050, AT1G62045, AT1G11740, AT1G04780, AT3G24210, AT3G04470	Bradi1g26410, Bradi1g28990, Bradi3g54910	CBR_g48701	Chrsp12S01965	Cre08.g375150_4532	NA	527	Me1_v2_0152290, Me1_v2_0152320, Me1_v2_0152330, Me1_v2_0152280, Me1_v2_0152310	Mp3g08700	20476, 20477	Olucimarinus_93744	LOC_Os07g32790, LOC_Os07g25460, LOC_Os02g56530	PRCOL_00004934_RA	pm001794g0030, pm000109g0030, pm258704g0010	Pp3c17_7170, Pp3c14_11630	Solyc02g080610, Solyc09g091560, Solyc05g054970, Solyc06g036620.1, Solyc06g036630	88989, 135166, 145231, 169694, 110129	SM000296S11300, SM000193S05186, SM000102S09185	Zci1a_41981	Zci_05541	UTEX1559_05339	UTEX1560_03724	Zm00001d021613, Zm00001d019522, Zm00001d005442, Zm00001d051948, Zm00001d018443
Me1_v2_0105750	N0.HOG0039698	OG0037521	-	NA	NA	NA	NA	NA	NA	NA	NA	NA	Me1_v2_0102010, Me1_v2_0105750	NA	NA	NA	NA	NA	NA	NA	NA	NA	NA	NA	NA	NA	NA	NA
Me1_v2_0120960	NA	NA	NA	NA	NA	NA	NA	NA	NA	NA	NA	NA	NA	NA	NA	NA	NA	NA	NA	NA	NA	NA	NA	NA	NA	NA	NA	NA
Me1_v2_0027700	N0.HOG0006678	OG0005416	n0	AagrOXF_evm.TU.utg000077l.439	Azfi_s0144.g051562	AT4G23940	NA	CBR_g32425	Chrsp175S08718	NA	CLOP_g19612, CLOP_g19614, CLOP_g14985	NA	Me1_v2_0057140, Me1_v2_0027700	Mp6g01370	18564, 18565	NA	NA	PRCOL_00004327_RA	pm011627g0010, pm005287g0010, pm001694.t1, pm002864g0010	Pp3c22_8480, Pp3c19_2770	Solyc08g082530	98591	SM000135S26998, SM000029S10548, SM000189S04084	Zci1a_36038	Zci_09127	UTEX1559_19027, UTEX1559_13656	UTEX1560_18267, UTEX1560_05196	NA
Me1_v2_0051300	N0.HOG0003984	OG0002961	n0	NA	Azfi_s0073.g037246	AT1G68580, AT5G55600	Bradi3g36500, Bradi1g21820	CBR_g28580	Chrsp3S05615	NA	CLOP_g5565, CLOP_g4414	2493	Me1_v2_0051300	Mp5g19270, Mp6g20670, Mp6g21030	24504	NA	LOC_Os10g26430, LOC_Os09g24290, LOC_Os08g33420, LOC_Os07g41640	NA	pm006369g0020	Pp3c21_10720, Pp3c18_18970	Solyc04g056747.1, Solyc11g012620, Solyc11g005520, Solyc11g005525.1, Solyc11g005510.1, Solyc07g065370	415282, 444321	NA	NA	Zci_12028	UTEX1559_03891	UTEX1560_14590	Zm00001d032226, Zm00001d050382, Zm00001d024435, Zm00001d025078, Zm00001d028876, Zm00001d003027, Zm00001d047511, Zm00001d022103
Me1_v2_0163210	N0.HOG0008850	OG0007477	n0	AagrOXF_evm.TU.utg000003l.536	Azfi_s0065.g035877	NA	Bradi1g09310	NA	Chrsp178S02490	Cre13.g572050_4532	NA	13914	Me1_v2_0163210, Me1_v2_0035320	Mp4g20990	15295	NA	LOC_Os03g52794	NA	NA	Pp3c10_4250	Solyc01g109080	88215	SM000169S02705, SM000276S10285, SM000407S15248	Zci1a_15117	Zci_07117	UTEX1559_15916	UTEX1560_05977, UTEX1560_05976	Zm00001d033935
Me1_v2_0136340	N0.HOG0008695	OG0007336	n0	AagrOXF_evm.TU.utg000103l.145	Azfi_s0098.g043922, Azfi_s1527.g104151	AT1G35660	Bradi2g56490	CBR_g40969	NA	NA	CLOP_g15624	3683	Me1_v2_0034850, Me1_v2_0026310, Me1_v2_0136340	Mp1g09080	NA	NA	LOC_Os01g65320	NA	pm000704g0050	Pp3c15_6380	Solyc06g065360	NA	SM000076S21790, SM000030S11361, SM000028S10181	Zci1a_18494	Zci_07348	UTEX1559_06774	UTEX1560_12046	Zm00001d042670
Me1_v2_0193710	N0.HOG0039806	OG0037629	-	NA	NA	NA	NA	NA	NA	NA	NA	NA	Me1_v2_0193710, Me1_v2_0193790	NA	NA	NA	NA	NA	NA	NA	NA	NA	NA	NA	NA	NA	NA	NA
Me1_v2_0112290	N0.HOG0013623	OG0011869	n0	NA	NA	NA	NA	CBR_g4230	NA	NA	CLOP_g3071, CLOP_g4796	12723	Me1_v2_0112290	NA	NA	NA	NA	NA	NA	NA	NA	NA	NA	Zci1a_36215, Zci1a_00944	Zci_05739	UTEX1559_11230	UTEX1560_02128	NA
Me1_v2_0158350	N0.HOG0005643	OG0004437	n0	AagrOXF_evm.TU.utg000049l.427	Azfi_s0502.g073896, Azfi_s0010.g012143	AT3G14910	Bradi4g27920	NA	NA	Cre12.g546450_4532	CLOP_g8708, CLOP_g7085, CLOP_g12714, CLOP_g12713	21	Me1_v2_0158350, Me1_v2_0158360, Me1_v2_0097720	Mp1g25210	26518, 26519	NA	LOC_Os05g50440, LOC_Os09g14680	NA	pm010742.t1, pm041154g0010, pm013089g0010, pm000837g0100	Pp3c4_25540	Solyc07g062450	402130	SM000125S26072, SM000081S22662, SM000396S15201	Zci1a_07868	Zci_00833	UTEX1559_04500	UTEX1560_08656	Zm00001d020063
Me1_v2_0050550	N0.HOG0012166	OG0010530	n0	AagrOXF_evm.TU.utg000001l.63	Azfi_s0288.g063188	NA	NA	NA	NA	NA	CLOP_g12710, CLOP_g24930	NA	Me1_v2_0050550	Mp4g10820, Mp5g18800, Mp5g18790	NA	NA	NA	NA	pm002568g0010, pm008544g0010	Pp3c20_5070, Pp3c12_8800	NA	NA	NA	NA	NA	NA	NA	NA
Me1_v2_0194300	NA	NA	NA	NA	NA	NA	NA	NA	NA	NA	NA	NA	NA	NA	NA	NA	NA	NA	NA	NA	NA	NA	NA	NA	NA	NA	NA	NA
Me1_v2_0155320	N0.HOG0007435	OG0006136	n0	AagrOXF_evm.TU.utg000111l.100	Azfi_s0006.g009851	AT3G18790	Bradi3g48020	CBR_g84973	Chrsp94S08339	Cre10.g427150_4532	CLOP_g5546, CLOP_g6860	3005	Me1_v2_0155320	Mp2g12890	23424	Olucimarinus_12466	LOC_Os02g39050	PRCOL_00003362_RA	pm013381g0040, pm023640.t1	Pp3c13_15060	Solyc05g051070	231910, 423378	SM000402S15226, SM000429S16081	Zci1a_01092	Zci_01010	UTEX1559_07901	UTEX1560_09827	Zm00001d017131
Me1_v2_0232760	N0.HOG0039676	OG0037499	-	NA	NA	NA	NA	NA	NA	NA	NA	NA	Me1_v2_0232760, Me1_v2_0088710	NA	NA	NA	NA	NA	NA	NA	NA	NA	NA	NA	NA	NA	NA	NA
Me1_v2_0136330	N0.HOG0028853	OG0026676	-	NA	NA	NA	NA	NA	NA	NA	NA	NA	Me1_v2_0136330, Me1_v2_0191140, Me1_v2_0011770	NA	NA	NA	NA	NA	NA	NA	NA	NA	NA	NA	NA	NA	NA	NA
Me1_v2_0117210	N0.HOG0008228	OG0006889	n0	AagrOXF_evm.TU.utg000095l.56	Azfi_s0006.g010364	NA	NA	CBR_g33936	NA	NA	CLOP_g588	NA	Me1_v2_0117200, Me1_v2_0117210	NA	NA	NA	NA	NA	pm004149g0010, pm000152g0130, pm000152g0140	Pp3c2_930	NA	NA	NA	Zci1a_05292, Zci1a_05291, Zci1a_05290, Zci1a_05293	Zci_07489	UTEX1559_04209, UTEX1559_04210	UTEX1560_10802, UTEX1560_10798, UTEX1560_10799, UTEX1560_10797, UTEX1560_10804, UTEX1560_10801, UTEX1560_10803, UTEX1560_10800, UTEX1560_10805	NA
Me1_v2_0193780	NA	NA	NA	NA	NA	NA	NA	NA	NA	NA	NA	NA	NA	NA	NA	NA	NA	NA	NA	NA	NA	NA	NA	NA	NA	NA	NA	NA
Me1_v2_0194290	NA	NA	NA	NA	NA	NA	NA	NA	NA	NA	NA	NA	NA	NA	NA	NA	NA	NA	NA	NA	NA	NA	NA	NA	NA	NA	NA	NA
Me1_v2_0137770	NA	NA	NA	NA	NA	NA	NA	NA	NA	NA	NA	NA	NA	NA	NA	NA	NA	NA	NA	NA	NA	NA	NA	NA	NA	NA	NA	NA
Me1_v2_0229590	NA	NA	NA	NA	NA	NA	NA	NA	NA	NA	NA	NA	NA	NA	NA	NA	NA	NA	NA	NA	NA	NA	NA	NA	NA	NA	NA	NA
Me1_v2_0031690	N0.HOG0003945	OG0002922	n0	AagrOXF_evm.TU.utg000080l.100	Azfi_s0027.g023559	AT2G46020	Bradi3g01297	CBR_g12457	Chrsp23S03787	Cre07.g325700_4532	CLOP_g9618	5905	Me1_v2_0003100, Me1_v2_0041720, Me1_v2_0031690, Me1_v2_0115840	Mp1g17010	15465, 15463, 15464	Olucimarinus_16250	LOC_Os02g02290	PRCOL_00004212_RA	pm001407.t2, pm042887g0010, pm000701g0010	Pp3c13_14440, Pp3c3_15820	Solyc01g094800	60241	SM000024S07727, SM000100S09425, SM000102S09199, SM004228S15722	Zci1a_15203	Zci_11759, Zci_11788	UTEX1559_03794, UTEX1559_08089, UTEX1559_08090	UTEX1560_12937, UTEX1560_10623	Zm00001d054056, Zm00001d014977
Me1_v2_0158360	N0.HOG0005643	OG0004437	n0	AagrOXF_evm.TU.utg000049l.427	Azfi_s0502.g073896, Azfi_s0010.g012143	AT3G14910	Bradi4g27920	NA	NA	Cre12.g546450_4532	CLOP_g8708, CLOP_g7085, CLOP_g12714, CLOP_g12713	21	Me1_v2_0158350, Me1_v2_0158360, Me1_v2_0097720	Mp1g25210	26518, 26519	NA	LOC_Os05g50440, LOC_Os09g14680	NA	pm010742.t1, pm041154g0010, pm013089g0010, pm000837g0100	Pp3c4_25540	Solyc07g062450	402130	SM000125S26072, SM000081S22662, SM000396S15201	Zci1a_07868	Zci_00833	UTEX1559_04500	UTEX1560_08656	Zm00001d020063
Me1_v2_0118020	N0.HOG0008927	OG0007549	n0	AagrOXF_evm.TU.utg000111l.211, AagrOXF_evm.TU.utg000116l.410, AagrOXF_evm.TU.utg000061l.75	Azfi_s0005.g009110	AT1G26330	Bradi5g00430	CBR_g18674	NA	NA	CLOP_g542	13731	Me1_v2_0118020, Me1_v2_0118030	Mp1g20550, Mp7g15680	NA	NA	LOC_Os09g01360	NA	NA	NA	Solyc05g012060	424199, 424202	NA	Zci1a_21938, Zci1a_37688	Zci_07871	UTEX1559_14798	UTEX1560_08774	Zm00001d005301
Me1_v2_0146040	NA	NA	NA	NA	NA	NA	NA	NA	NA	NA	NA	NA	NA	NA	NA	NA	NA	NA	NA	NA	NA	NA	NA	NA	NA	NA	NA	NA
Me1_v2_0216950	N0.HOG0028955	OG0026778	-	NA	NA	NA	NA	NA	NA	NA	NA	NA	Me1_v2_0136380, Me1_v2_0122070, Me1_v2_0216950	NA	NA	NA	NA	NA	NA	NA	NA	NA	NA	NA	NA	NA	NA	NA
Me1_v2_0007190	N0.HOG0039449	OG0037272	-	NA	NA	NA	NA	NA	NA	NA	NA	NA	Me1_v2_0103880, Me1_v2_0007190	NA	NA	NA	NA	NA	NA	NA	NA	NA	NA	NA	NA	NA	NA	NA
Me1_v2_0033880	N0.HOG0006763	OG0005496	n0	AagrOXF_evm.TU.utg000133l.31	Azfi_s0114.g046135	AT1G72270, AT4G27010	Bradi3g46440	CBR_g48672	NA	Cre02.g074300_4532	CLOP_g18618	11506	Me1_v2_0033880, Me1_v2_0029590, Me1_v2_0030780	Mp2g07950	7046, 7043, 7044	Olucimarinus_13608	LOC_Os04g53380	NA	NA	Pp3c2_30140	Solyc02g065500	442019	SM000092S24484, SM000031S11607, SM000218S06611	Zci1a_02068, Zci1a_02067, Zci1a_02066	Zci_03588	UTEX1559_09177	UTEX1560_05091	NA
Me1_v2_0180520	NA	NA	NA	NA	NA	NA	NA	NA	NA	NA	NA	NA	NA	NA	NA	NA	NA	NA	NA	NA	NA	NA	NA	NA	NA	NA	NA	NA
Me1_v2_0193690	N0.HOG0039753	OG0037576	-	NA	NA	NA	NA	NA	NA	NA	NA	NA	Me1_v2_0144880, Me1_v2_0193690	NA	NA	NA	NA	NA	NA	NA	NA	NA	NA	NA	NA	NA	NA	NA
Me1_v2_0148080	NA	NA	NA	NA	NA	NA	NA	NA	NA	NA	NA	NA	NA	NA	NA	NA	NA	NA	NA	NA	NA	NA	NA	NA	NA	NA	NA	NA
Me1_v2_0108140	N0.HOG0005235	OG0004067	n0	AagrOXF_evm.TU.utg000012l.25	Azfi_s0124.g048470, Azfi_s0006.g010434, Azfi_s0073.g037279, Azfi_s0292.g063363	AT5G18440	Bradi2g53107	CBR_g22941	Chrsp259S03894	Cre17.g729050_4532	CLOP_g6247	11430, 10492	Me1_v2_0108130, Me1_v2_0108140	Mp2g25420	29313	Olucimarinus_30295	LOC_Os01g59860	PRCOL_00006896_RA	pm179089g0010, pm019175g0030, pm001260g0020, pm007219g0020	Pp3c27_4140	Solyc01g096920	NA	SM000054S18152, SM000005S17260, SM000041S15470	NA	Zci_12445, Zci_12443	UTEX1559_17412	UTEX1560_00357, UTEX1560_16118	Zm00001d043108
Me1_v2_0080450	N0.HOG0005361	OG0004181	n0	AagrOXF_evm.TU.utg000084l.113__114__115	Azfi_s0022.g015969	AT1G67140	Bradi1g39436	CBR_g31193	Chrsp3S05591	Cre16.g684100_4532	CLOP_g11147, CLOP_g11146	5413	Me1_v2_0029980, Me1_v2_0080440, Me1_v2_0080450, Me1_v2_0216280	Mp4g20870	29425	Olucimarinus_92899	LOC_Os06g30894, LOC_Os06g30901	PRCOL_00002157_RA	pm038531g0010, pm006903g0030, pm005104g0040	Pp3c9_4980, Pp3c15_3000	Solyc02g085810	445001	SM000198S05319, SM000012S25360, SM000095S24994	Zci1a_03484, Zci1a_03483	NA	UTEX1559_12729	NA	Zm00001d046041, Zm00001d046039
Me1_v2_0074760	N0.HOG0005993	OG0004769	n0	AagrOXF_evm.TU.utg000059l.221	Azfi_s0149.g053158, Azfi_s0163.g054214	AT4G33210	Bradi3g26160	CBR_g11995	Chrsp1S03263	Cre12.g525600_4532	NA	9878	Me1_v2_0074760, Me1_v2_0120970	Mp4g13760, Mp4g21080	14579	NA	LOC_Os10g25680	NA	pm013738g0030, pm012408g0010, pm009652g0010	Pp3c4_12360, Pp3c12_17410, Pp3c5_23900, Pp3c6_6070	Solyc08g061820	133451	SM000018S03617, SM000011S19048, SM000026S08965	Zci1a_17357	Zci_13958	UTEX1559_13700	UTEX1560_16898	Zm00001d033037, Zm00001d014232
Me1_v2_0037820	NA	NA	NA	NA	NA	NA	NA	NA	NA	NA	NA	NA	NA	NA	NA	NA	NA	NA	NA	NA	NA	NA	NA	NA	NA	NA	NA	NA
Me1_v2_0079770	N0.HOG0005158	OG0003994	n0	AagrOXF_evm.TU.utg000002l.274	Azfi_s0017.g014468	AT4G19610, AT5G05720, AT5G08695	Bradi5g21380	CBR_g33926	Chrsp2S08920	Cre16.g685200_4532	CLOP_g12269	5415	Me1_v2_0079730, Me1_v2_0079760, Me1_v2_0079770	Mp8g17720	13131	Olucimarinus_710	LOC_Os04g52200	PRCOL_00005574_RA	pm039309g0010, pm023108g0030, pm013923.t1, pm001615g0120, pm023108g0020	Pp3c7_9260	Solyc02g081940	182522	SM000126S26286, SM000111S18825, SM000312S11984	Zci1a_01576	Zci_01648	UTEX1559_13023	UTEX1560_02539	Zm00001d026280
Me1_v2_0035320	N0.HOG0008850	OG0007477	n0	AagrOXF_evm.TU.utg000003l.536	Azfi_s0065.g035877	NA	Bradi1g09310	NA	Chrsp178S02490	Cre13.g572050_4532	NA	13914	Me1_v2_0163210, Me1_v2_0035320	Mp4g20990	15295	NA	LOC_Os03g52794	NA	NA	Pp3c10_4250	Solyc01g109080	88215	SM000169S02705, SM000276S10285, SM000407S15248	Zci1a_15117	Zci_07117	UTEX1559_15916	UTEX1560_05977, UTEX1560_05976	Zm00001d033935
Me1_v2_0103880	N0.HOG0039449	OG0037272	-	NA	NA	NA	NA	NA	NA	NA	NA	NA	Me1_v2_0103880, Me1_v2_0007190	NA	NA	NA	NA	NA	NA	NA	NA	NA	NA	NA	NA	NA	NA	NA
Me1_v2_0231340	N0.HOG0028999	OG0026822	-	NA	NA	NA	NA	NA	NA	NA	NA	NA	Me1_v2_0231340	NA	NA	NA	NA	NA	pm041776g0010, pm006416.t1	NA	NA	NA	NA	NA	NA	NA	NA	NA
Me1_v2_0193850	NA	NA	NA	NA	NA	NA	NA	NA	NA	NA	NA	NA	NA	NA	NA	NA	NA	NA	NA	NA	NA	NA	NA	NA	NA	NA	NA	NA
Me1_v2_0148100	N0.HOG0028967	OG0026790	-	NA	NA	NA	NA	NA	NA	NA	NA	NA	Me1_v2_0193680, Me1_v2_0193840, Me1_v2_0148100	NA	NA	NA	NA	NA	NA	NA	NA	NA	NA	NA	NA	NA	NA	NA
Me1_v2_0133850	N0.HOG0006566	OG0005309	n0	AagrOXF_evm.TU.utg000011l.169	Azfi_s0015.g014109	AT3G47060, AT5G58870	Bradi3g50240	CBR_g26105, CBR_g26107	NA	Cre02.g078966_4532	CLOP_g4190, CLOP_g12949	NA	Me1_v2_0133850	Mp1g19790	29672	Olucimarinus_26133	LOC_Os02g43350	NA	pm007178g0010, pm023581g0010, pm020256g0020	Pp3c23_7140, Pp3c23_7144	Solyc06g005950	167789	SM000003S11013, SM000002S05575, SM000072S21243	Zci1a_43440	Zci_12805	UTEX1559_12529	UTEX1560_00658	Zm00001d051321, Zm00001d017424
Me1_v2_0078670	N0.HOG0020373	OG0018275	n0	NA	NA	NA	NA	NA	NA	NA	CLOP_g10992	NA	Me1_v2_0078670	NA	NA	NA	NA	NA	NA	NA	NA	NA	NA	NA	Zci_02790	UTEX1559_03216	UTEX1560_05420	NA
Me1_v2_0070580	N0.HOG0006852	OG0005583	n0	AagrOXF_evm.TU.utg000003l.532	Azfi_s0501.g073867	AT5G41190	Bradi3g01370	CBR_g50931	Chrsp86S08009	Cre01.g031750_4532	CLOP_g12123	4672	Me1_v2_0070580	Mp1g16460	28975	Olucimarinus_41444	LOC_Os02g02360	PRCOL_00006831_RA	pm020290g0020, pm040345.t1	Pp3c2_34320	Solyc08g007990	417184	SM000396S15194, SM000125S26060, SM000001S04469, SM000081S22666	NA	Zci_00676	UTEX1559_14310	UTEX1560_10661	Zm00001d054047, Zm00001d030300, Zm00001d014988
Me1_v2_0133800	N0.HOG0001321	OG0000776	n0	AagrOXF_evm.TU.utg000006l.160	Azfi_s0005.g009219, Azfi_s0004.g008888, Azfi_s0034.g025236, Azfi_s0100.g044279, Azfi_s0548.g076441, Azfi_s0114.g046016, Azfi_s0024.g020487, Azfi_s0314.g064244	AT1G62310, AT1G11950, AT3G07610, AT1G09060, AT4G21430, AT4G00990	Bradi1g59042, Bradi3g36181, Bradi4g29622, Bradi1g35168, Bradi3g01060, Bradi4g27417, Bradi4g19168, Bradi1g62640	CBR_g20065, CBR_g3119, CBR_g54325	Chrsp57S06865	Cre10.g446850_4532	CLOP_g11210, CLOP_g3867, CLOP_g3868, CLOP_g8768	2375, 4049	Me1_v2_0100740, Me1_v2_0011230, Me1_v2_0133800	Mp3g05610, Mp5g16950	26426	NA	LOC_Os09g22540, LOC_Os09g22040, LOC_Os02g01940, LOC_Os02g58210, LOC_Os03g31594, LOC_Os03g22540	PRCOL_00001660_RA	pm006704.t1, pm000514g0130, pm001529.t1, pm006704g0020, pm010014g0020	Pp3c16_210, Pp3c17_5410, Pp3c14_6480, Pp3c4_21970	Solyc02g081010, Solyc02g082400, Solyc09g091490, Solyc08g065810.1, Solyc08g065830, Solyc08g065820, Solyc04g049140, Solyc02g078790, Solyc08g065800.1, Solyc02g079300, Solyc03g083240	NA	SM000302S11656, SM000088S23755, SM000247S08271	Zci1a_37778	Zci_15355	UTEX1559_12671	UTEX1560_12891, UTEX1560_12890	Zm00001d020367, Zm00001d046816, Zm00001d046963, Zm00001d054070, Zm00001d051849, Zm00001d033158, Zm00001d047491
Me1_v2_0083470	N0.HOG0013406	OG0011668	n0	AagrOXF_evm.TU.utg000129l.120	Azfi_s0061.g035039	AT1G28530	Bradi3g01087	NA	NA	NA	NA	NA	Me1_v2_0083470	Mp6g01900	NA	NA	LOC_Os02g01970	NA	NA	Pp3c17_22050	Solyc03g006280	NA	NA	NA	NA	NA	NA	Zm00001d014962
Me1_v2_0067630	N0.HOG0001730	OG0001082	n0	AagrOXF_evm.TU.utg000022l.26	NA	AT1G19250, AT5G45180	Bradi1g72500, Bradi5g03710, Bradi3g20960, Bradi4g37120, Bradi4g37110, Bradi4g37130	CBR_g53538	NA	Cre03.g168900_4532, Cre17.g731700_4532, Cre03.g148900_4532, Cre06.g298550_4532, Cre06.g296050_4532, Cre06.g296550_4532, Cre16.g652750_4532, Cre17.g723050_4532, Cre01.g024250_4532, Cre17.g723000_4532, Cre09.g402050_4532, Cre09.g397702_4532, Cre09.g398050_4532, Cre09.g397450_4532, Cre09.g397700_4532, Cre09.g397550_4532, Cre09.g398051_4532, Cre09.g397803_4532, Cre13.g603176_4532	NA	8794	Me1_v2_0067630, Me1_v2_0067620, Me1_v2_0004240	NA	12600	NA	LOC_Os03g08410, LOC_Os04g14710, LOC_Os04g14690, LOC_Os09g37650, LOC_Os09g37620, LOC_Os09g37690, LOC_Os06g10170, LOC_Os06g10190, LOC_Os06g10180	NA	NA	NA	Solyc07g042430.1, Solyc07g007290.1, Solyc01g112100, Solyc01g112130, Solyc01g112140, Solyc01g112120, Solyc01g112105.1	266739	SM000022S07132, SM000006S19534, SM000116S24242	NA	Zci_13903	UTEX1559_09067	UTEX1560_10492	Zm00001d027908, Zm00001d048260, Zm00001d007828, Zm00001d004389, Zm00001d004388, Zm00001d004387, Zm00001d021444, Zm00001d021443, Zm00001d037322, Zm00001d048861, Zm00001d050326
Me1_v2_0152320	N0.HOG0002227	OG0001453	n0	AagrOXF_evm.TU.utg000001l.3	Azfi_s0215.g058455, Azfi_s0032.g024963, Azfi_s0149.g053254, Azfi_s0241.g059775	AT1G62050, AT1G62045, AT1G11740, AT1G04780, AT3G24210, AT3G04470	Bradi1g26410, Bradi1g28990, Bradi3g54910	CBR_g48701	Chrsp12S01965	Cre08.g375150_4532	NA	527	Me1_v2_0152290, Me1_v2_0152320, Me1_v2_0152330, Me1_v2_0152280, Me1_v2_0152310	Mp3g08700	20476, 20477	Olucimarinus_93744	LOC_Os07g32790, LOC_Os07g25460, LOC_Os02g56530	PRCOL_00004934_RA	pm001794g0030, pm000109g0030, pm258704g0010	Pp3c17_7170, Pp3c14_11630	Solyc02g080610, Solyc09g091560, Solyc05g054970, Solyc06g036620.1, Solyc06g036630	88989, 135166, 145231, 169694, 110129	SM000296S11300, SM000193S05186, SM000102S09185	Zci1a_41981	Zci_05541	UTEX1559_05339	UTEX1560_03724	Zm00001d021613, Zm00001d019522, Zm00001d005442, Zm00001d051948, Zm00001d018443
Me1_v2_0201250	N0.HOG0004084	OG0003041	n0	AagrOXF_evm.TU.utg000042l.26	Azfi_s0001.g000809, Azfi_s0002.g003659	AT1G21640	Bradi4g23450	CBR_g27885	Chrsp94S08332	Cre07.g322950_4532	CLOP_g4564, CLOP_g19796, CLOP_g1734	9712	Me1_v2_0201240, Me1_v2_0201250	Mp4g22570	18058, 18056, 18057	Olucimarinus_27373, Olucimarinus_42981, Olucimarinus_43339	LOC_Os11g08670	PRCOL_00000850_RA	pm001782g0020, pm042521g0010, pm008845g0050	Pp3c18_2030	Solyc11g005100, Solyc06g060060	50862, 5352	SM000323S12617, SM000044S16038, SM000085S23226	Zci1a_14706	Zci_03685	UTEX1559_08648	UTEX1560_04234	Zm00001d004716, Zm00001d053076
Me1_v2_0134760	N0.HOG0009150	OG0007755	n0	AagrOXF_evm.TU.utg000024l.262	Azfi_s0003.g007599, Azfi_s0149.g053145	AT1G18900, AT1G74750	Bradi4g00490	NA	NA	NA	NA	NA	Me1_v2_0134760	Mp3g12830, Mp3g21620, Mp4g06330, Mp6g14230	NA	NA	LOC_Os12g44170	NA	NA	Pp3c7_10060, Pp3c3_19780	Solyc03g113380	121207	SM000249S08239, SM000097S24824, SM000014S00410	NA	Zci_16491	NA	NA	Zm00001d041213, Zm00001d031217
Me1_v2_0033640	NA	NA	NA	NA	NA	NA	NA	NA	NA	NA	NA	NA	NA	NA	NA	NA	NA	NA	NA	NA	NA	NA	NA	NA	NA	NA	NA	NA
