nodeName	altName	nodeAttr[nodesPresent, ]
Pp3c1_12020V3	NA	orange
Pp3c1_13640V3	NA	orange
Pp3c1_20630V3	NA	orange
Pp3c1_26720V3	NA	orange
Pp3c1_42020V3	NA	orange
Pp3c1_4990V3	NA	orange
Pp3c1_8190V3	NA	orange
Pp3c10_12000V3	NA	orange
Pp3c10_13960V3	NA	orange
Pp3c10_13970V3	NA	orange
Pp3c10_15340V3	NA	orange
Pp3c10_15390V3	NA	orange
Pp3c10_15660V3	NA	orange
Pp3c10_16080V3	NA	orange
Pp3c11_14620V3	NA	orange
Pp3c11_3010V3	NA	orange
Pp3c11_4080V3	NA	orange
Pp3c11_7910V3	NA	orange
Pp3c12_10330V3	NA	orange
Pp3c12_13630V3	NA	orange
Pp3c12_9200V3	NA	orange
Pp3c13_11520V3	NA	orange
Pp3c13_20480V3	NA	orange
Pp3c14_14450V3	NA	orange
Pp3c14_14570V3	NA	orange
Pp3c14_4440V3	NA	orange
Pp3c15_10670V3	NA	orange
Pp3c15_1670V3	NA	orange
Pp3c15_19830V3	NA	orange
Pp3c15_9320V3	NA	orange
Pp3c16_14590V3	NA	orange
Pp3c16_14640V3	NA	orange
Pp3c16_7020V3	NA	orange
Pp3c17_21890V3	NA	orange
Pp3c17_21920V3	NA	orange
Pp3c17_720V3	NA	orange
Pp3c18_2110V3	NA	orange
Pp3c19_17570V3	NA	orange
Pp3c19_22390V3	NA	orange
Pp3c19_4053V3	NA	orange
Pp3c19_4580V3	NA	orange
Pp3c19_4630V3	NA	orange
Pp3c2_10380V3	NA	orange
Pp3c2_13670V3	NA	orange
Pp3c2_1750V3	NA	orange
Pp3c2_20160V3	NA	orange
Pp3c2_2070V3	NA	orange
Pp3c2_29290V3	NA	orange
Pp3c2_31200V3	NA	orange
Pp3c2_35010V3	NA	orange
Pp3c2_4800V3	NA	orange
Pp3c20_1240V3	NA	orange
Pp3c20_15390V3	NA	orange
Pp3c20_18810V3	NA	orange
Pp3c20_3610V3	NA	orange
Pp3c20_7870V3	NA	orange
Pp3c21_13990V3	NA	orange
Pp3c21_280V3	NA	orange
Pp3c22_12970V3	NA	orange
Pp3c22_19580V3	NA	orange
Pp3c23_9770V3	NA	orange
Pp3c24_20780V3	NA	orange
Pp3c25_14180V3	NA	orange
Pp3c25_8200V3	NA	orange
Pp3c26_130V3	NA	orange
Pp3c26_5846V3	NA	orange
Pp3c3_28310V3	NA	orange
Pp3c3_29110V3	NA	orange
Pp3c3_34180V3	NA	orange
Pp3c3_8370V3	NA	orange
Pp3c3_8580V3	NA	orange
Pp3c4_12390V3	NA	orange
Pp3c4_31800V3	NA	orange
Pp3c4_4410V3	NA	orange
Pp3c5_10150V3	NA	orange
Pp3c5_18804V3	NA	orange
Pp3c5_4460V3	NA	orange
Pp3c6_16600V3	NA	orange
Pp3c6_20120V3	NA	orange
Pp3c6_23040V3	NA	orange
Pp3c6_24130V3	NA	orange
Pp3c7_20860V3	NA	orange
Pp3c7_21030V3	NA	orange
Pp3c8_11180V3	NA	orange
Pp3c8_19940V3	NA	orange
Pp3c8_21790V3	NA	orange
Pp3c9_25280V3	NA	orange
Pp3c9_3810V3	NA	orange
Pp3c9_4120V3	NA	orange
