Sample	Top over-represented sequence	Sum of remaining over-represented sequences
Z_1_10_EKRN220057089-1A_H22HLDSX5_L3_1	0.0	0.0
Z_1_10_EKRN220057089-1A_H22HLDSX5_L3_2	0.0	0.0
Z_1_11_EKRN220057090-1A_HKF3KDSX5_L2_1	0.0	0.0
Z_1_11_EKRN220057090-1A_HKF3KDSX5_L2_2	0.0	0.0
Z_1_12_EKRN220057091-1A_H22HLDSX5_L3_1	0.0	0.0
Z_1_12_EKRN220057091-1A_H22HLDSX5_L3_2	0.0	0.0
Z_1_13_EKRN220057092-1A_H22HLDSX5_L3_1	0.0	0.0
Z_1_13_EKRN220057092-1A_H22HLDSX5_L3_2	0.0	0.0
Z_1_14_EKRN220057093-1A_H22HLDSX5_L3_1	0.0	0.0
Z_1_14_EKRN220057093-1A_H22HLDSX5_L3_2	0.0	0.0
Z_1_15_EKRN220057094-1A_HKF3KDSX5_L2_1	0.0	0.0
Z_1_15_EKRN220057094-1A_HKF3KDSX5_L2_2	0.0	0.0
Z_1_16_EKRN220057095-1A_HKF3KDSX5_L2_1	0.0	0.0
Z_1_16_EKRN220057095-1A_HKF3KDSX5_L2_2	0.0	0.0
Z_1_17_EKRN220057096-1A_HKF3KDSX5_L2_1	0.11129976573572571	0.20665877384129427
Z_1_17_EKRN220057096-1A_HKF3KDSX5_L2_2	0.0	0.0
Z_1_18_EKRN220057097-1A_HKF3KDSX5_L2_1	0.10647333957245694	0.0
Z_1_18_EKRN220057097-1A_HKF3KDSX5_L2_2	0.0	0.0
Z_1_19_EKRN220057098-1A_HLN7GDSX5_L2_1	0.0	0.0
Z_1_19_EKRN220057098-1A_HLN7GDSX5_L2_2	0.0	0.0
Z_1_1_EKRN220057080-1A_HKF3KDSX5_L2_1	0.12071157547904818	0.2220839174004158
Z_1_1_EKRN220057080-1A_HKF3KDSX5_L2_2	0.0	0.0
Z_1_20_EKRN220057099-1A_HLN7GDSX5_L2_1	0.0	0.0
Z_1_20_EKRN220057099-1A_HLN7GDSX5_L2_2	0.0	0.0
Z_1_21_EKRN220057100-1A_HLN7GDSX5_L2_1	0.0	0.0
Z_1_21_EKRN220057100-1A_HLN7GDSX5_L2_2	0.0	0.0
Z_1_22_EKRN220057101-1A_HKHYCDSX5_L1_1	0.0	0.0
Z_1_22_EKRN220057101-1A_HKHYCDSX5_L1_2	0.0	0.0
Z_1_23_EKRN220057102-1A_H22HLDSX5_L3_1	0.0	0.0
Z_1_23_EKRN220057102-1A_H22HLDSX5_L3_2	0.0	0.0
Z_1_24_EKRN220057103-1A_H22FNDSX5_L4_1	0.36056620339396583	0.12668610182256357
Z_1_24_EKRN220057103-1A_H22FNDSX5_L4_2	0.0	0.0
Z_1_25_EKRN220057104-1A_H22HLDSX5_L3_1	0.11319680157431265	0.0
Z_1_25_EKRN220057104-1A_H22HLDSX5_L3_2	0.0	0.0
Z_1_26_EKRN220057105-1A_H22HLDSX5_L3_1	0.0	0.0
Z_1_26_EKRN220057105-1A_H22HLDSX5_L3_2	0.0	0.0
Z_1_27_EKRN220057106-1A_H3MF7DSX5_L4_1	0.1685382974222667	0.0
Z_1_27_EKRN220057106-1A_H3MF7DSX5_L4_2	0.0	0.0
Z_1_28_EKRN220057107-1A_HLN7GDSX5_L2_1	0.0	0.0
Z_1_28_EKRN220057107-1A_HLN7GDSX5_L2_2	0.0	0.0
Z_1_29_EKRN220057108-1A_HLN7GDSX5_L2_1	0.0	0.0
Z_1_29_EKRN220057108-1A_HLN7GDSX5_L2_2	0.0	0.0
Z_1_2_EKRN220057081-1A_H22FNDSX5_L4_1	0.19683410432157072	0.0
Z_1_2_EKRN220057081-1A_H22FNDSX5_L4_2	0.0	0.0
Z_1_30_EKRN220057109-1A_H22HLDSX5_L3_1	0.0	0.0
Z_1_30_EKRN220057109-1A_H22HLDSX5_L3_2	0.0	0.0
Z_1_31_EKRN220057110-1A_H22HLDSX5_L3_1	0.0	0.0
Z_1_31_EKRN220057110-1A_H22HLDSX5_L3_2	0.0	0.0
Z_1_32_EKRN220057111-1A_H22HLDSX5_L3_1	0.10757190366670155	0.0
Z_1_32_EKRN220057111-1A_H22HLDSX5_L3_2	0.0	0.0
Z_1_33_EKRN220057112-1A_HKHYCDSX5_L1_1	0.0	0.0
Z_1_33_EKRN220057112-1A_HKHYCDSX5_L1_2	0.0	0.0
Z_1_34_EKRN220057113-1A_H22HLDSX5_L3_1	0.0	0.0
Z_1_34_EKRN220057113-1A_H22HLDSX5_L3_2	0.0	0.0
Z_1_35_EKRN220057114-1A_HLN7GDSX5_L4_1	0.0	0.0
Z_1_35_EKRN220057114-1A_HLN7GDSX5_L4_2	0.0	0.0
Z_1_36_EKRN220057115-1A_HLN7GDSX5_L4_1	0.20898525853524247	0.21015172440247437
Z_1_36_EKRN220057115-1A_HLN7GDSX5_L4_2	0.0	0.0
Z_1_37_EKRN220057116-1A_H22HLDSX5_L3_1	0.0	0.0
Z_1_37_EKRN220057116-1A_H22HLDSX5_L3_2	0.0	0.0
Z_1_38_EKRN220057117-1A_H22HLDSX5_L3_1	0.0	0.0
Z_1_38_EKRN220057117-1A_H22HLDSX5_L3_2	0.0	0.0
Z_1_39_EKRN220057118-1A_HLN7GDSX5_L4_1	0.0	0.0
Z_1_39_EKRN220057118-1A_HLN7GDSX5_L4_2	0.0	0.0
Z_1_3_EKRN220057082-1A_H22FNDSX5_L4_1	0.1627372209071041	0.0
Z_1_3_EKRN220057082-1A_H22FNDSX5_L4_2	0.0	0.0
Z_1_40_EKRN220057119-1A_HYMV5DSX3_L3_1	0.42516986042514543	0.0
Z_1_40_EKRN220057119-1A_HYMV5DSX3_L3_2	0.0	0.0
Z_1_41_EKRN220057120-1A_HYMV5DSX3_L3_1	0.21414551201132384	0.0
Z_1_41_EKRN220057120-1A_HYMV5DSX3_L3_2	0.0	0.0
Z_1_42_EKRN220057121-1A_HYMV5DSX3_L3_1	1.630674947726821	0.481872096699274
Z_1_42_EKRN220057121-1A_HYMV5DSX3_L3_2	0.0	0.0
Z_1_43_EKRN220057122-1A_HLN7GDSX5_L4_1	0.0	0.0
Z_1_43_EKRN220057122-1A_HLN7GDSX5_L4_2	0.0	0.0
Z_1_44_EKRN220057123-1A_HYMV5DSX3_L3_1	0.2805707202788004	0.0
Z_1_44_EKRN220057123-1A_HYMV5DSX3_L3_2	0.0	0.0
Z_1_45_EKRN220057124-1A_HYMV5DSX3_L3_1	0.0	0.0
Z_1_45_EKRN220057124-1A_HYMV5DSX3_L3_2	0.0	0.0
Z_1_46_EKRN220057125-1A_HLN7GDSX5_L4_1	0.0	0.0
Z_1_46_EKRN220057125-1A_HLN7GDSX5_L4_2	0.0	0.0
Z_1_47_EKRN220057126-1A_H23CGDSX5_L3_1	0.0	0.0
Z_1_47_EKRN220057126-1A_H23CGDSX5_L3_2	0.0	0.0
Z_1_48_EKRN220057127-1A_H23VJDSX5_L3_1	1.27254794948828	1.255999460161853
Z_1_48_EKRN220057127-1A_H23VJDSX5_L3_2	0.3406285560711568	0.222814853992866
Z_1_49_EKRN220057128-1A_HLN7GDSX5_L3_1	0.16544611822416072	0.3656693072633776
Z_1_49_EKRN220057128-1A_HLN7GDSX5_L3_2	0.0	0.0
Z_1_4_EKRN220057083-1A_HKF3KDSX5_L2_1	0.0	0.0
Z_1_4_EKRN220057083-1A_HKF3KDSX5_L2_2	0.0	0.0
Z_1_50_EKRN220057129-1A_HLN7GDSX5_L4_1	0.0	0.0
Z_1_50_EKRN220057129-1A_HLN7GDSX5_L4_2	0.0	0.0
Z_1_51_EKRN220057130-1A_HLN7GDSX5_L4_1	0.12222114404137638	0.0
Z_1_51_EKRN220057130-1A_HLN7GDSX5_L4_2	0.0	0.0
Z_1_52_EKRN220057131-1A_HLN7GDSX5_L4_1	0.0	0.0
Z_1_52_EKRN220057131-1A_HLN7GDSX5_L4_2	0.0	0.0
Z_1_53_EKRN220057132-1A_HLN7GDSX5_L4_1	0.0	0.0
Z_1_53_EKRN220057132-1A_HLN7GDSX5_L4_2	0.0	0.0
Z_1_54_EKRN220057133-1A_HLN7GDSX5_L4_1	0.0	0.0
Z_1_54_EKRN220057133-1A_HLN7GDSX5_L4_2	0.0	0.0
Z_1_55_EKRN220057134-1A_H23VJDSX5_L3_1	0.0	0.0
Z_1_55_EKRN220057134-1A_H23VJDSX5_L3_2	0.0	0.0
Z_1_56_EKRN220057135-1A_HLN7GDSX5_L4_1	0.0	0.0
Z_1_56_EKRN220057135-1A_HLN7GDSX5_L4_2	0.0	0.0
Z_1_57_EKRN220057136-1A_HLN7GDSX5_L3_1	0.0	0.0
Z_1_57_EKRN220057136-1A_HLN7GDSX5_L3_2	0.0	0.0
Z_1_58_EKRN220057137-1A_HLN7GDSX5_L4_1	0.0	0.0
Z_1_58_EKRN220057137-1A_HLN7GDSX5_L4_2	0.0	0.0
Z_1_59_EKRN220057138-1A_HLN7GDSX5_L4_1	0.0	0.0
Z_1_59_EKRN220057138-1A_HLN7GDSX5_L4_2	0.0	0.0
Z_1_5_EKRN220057084-1A_H22HLDSX5_L3_1	0.10105385579167822	0.0
Z_1_5_EKRN220057084-1A_H22HLDSX5_L3_2	0.0	0.0
Z_1_60_EKRN220057139-1A_HLN7GDSX5_L4_1	0.0	0.0
Z_1_60_EKRN220057139-1A_HLN7GDSX5_L4_2	0.0	0.0
Z_1_61_EKRN220057140-1A_HLN7GDSX5_L4_1	0.10947172838750349	0.0
Z_1_61_EKRN220057140-1A_HLN7GDSX5_L4_2	0.0	0.0
Z_1_62_EKRN220057141-1A_HLN7GDSX5_L4_1	0.0	0.0
Z_1_62_EKRN220057141-1A_HLN7GDSX5_L4_2	0.0	0.0
Z_1_63_EKRN220057142-1A_HLN7GDSX5_L4_1	0.0	0.0
Z_1_63_EKRN220057142-1A_HLN7GDSX5_L4_2	0.0	0.0
Z_1_64_EKRN220057143-1A_HLN7GDSX5_L4_1	0.0	0.0
Z_1_64_EKRN220057143-1A_HLN7GDSX5_L4_2	0.0	0.0
Z_1_65_EKRN220057144-1A_HLN7GDSX5_L4_1	0.0	0.0
Z_1_65_EKRN220057144-1A_HLN7GDSX5_L4_2	0.0	0.0
Z_1_66_EKRN220057145-1A_HLN7GDSX5_L4_1	0.0	0.0
Z_1_66_EKRN220057145-1A_HLN7GDSX5_L4_2	0.0	0.0
Z_1_67_EKRN220057146-1A_H23VJDSX5_L3_1	0.0	0.0
Z_1_67_EKRN220057146-1A_H23VJDSX5_L3_2	0.0	0.0
Z_1_68_EKRN220057147-1A_H23VJDSX5_L2_1	0.0	0.0
Z_1_68_EKRN220057147-1A_H23VJDSX5_L2_2	0.0	0.0
Z_1_69_EKRN220057148-1A_HLN7GDSX5_L4_1	0.10408795797716076	0.0
Z_1_69_EKRN220057148-1A_HLN7GDSX5_L4_2	0.0	0.0
Z_1_6_EKRN220057085-1A_H22HLDSX5_L3_1	0.0	0.0
Z_1_6_EKRN220057085-1A_H22HLDSX5_L3_2	0.0	0.0
Z_1_70_EKRN220057149-1A_H23VJDSX5_L3_1	0.0	0.0
Z_1_70_EKRN220057149-1A_H23VJDSX5_L3_2	0.0	0.0
Z_1_71_EKRN220057150-1A_HLN7GDSX5_L4_1	0.13907049343113495	0.0
Z_1_71_EKRN220057150-1A_HLN7GDSX5_L4_2	0.0	0.0
Z_1_72_EKRN220057151-1A_HLN7GDSX5_L4_1	0.0	0.0
Z_1_72_EKRN220057151-1A_HLN7GDSX5_L4_2	0.0	0.0
Z_1_73_EKRN220057152-1A_HLN7GDSX5_L4_1	0.0	0.0
Z_1_73_EKRN220057152-1A_HLN7GDSX5_L4_2	0.0	0.0
Z_1_74_EKRN220057153-1A_H23VJDSX5_L3_1	0.12898300623935777	0.0
Z_1_74_EKRN220057153-1A_H23VJDSX5_L3_2	0.0	0.0
Z_1_75_EKRN220057154-1A_H23VJDSX5_L3_1	0.0	0.0
Z_1_75_EKRN220057154-1A_H23VJDSX5_L3_2	0.0	0.0
Z_1_76_EKRN220057155-1A_H23VJDSX5_L3_1	0.0	0.0
Z_1_76_EKRN220057155-1A_H23VJDSX5_L3_2	0.0	0.0
Z_1_77_EKRN220057156-1A_HLN7GDSX5_L4_1	0.12805194895449126	0.0
Z_1_77_EKRN220057156-1A_HLN7GDSX5_L4_2	0.0	0.0
Z_1_78_EKRN220057157-1A_HLN7GDSX5_L4_1	0.0	0.0
Z_1_78_EKRN220057157-1A_HLN7GDSX5_L4_2	0.0	0.0
Z_1_79_EKRN220057158-1A_HLN7GDSX5_L4_1	0.11422752134768813	0.0
Z_1_79_EKRN220057158-1A_HLN7GDSX5_L4_2	0.0	0.0
Z_1_7_EKRN220057086-1A_H22HLDSX5_L3_1	0.0	0.0
Z_1_7_EKRN220057086-1A_H22HLDSX5_L3_2	0.0	0.0
Z_1_80_EKRN220057159-1A_HLN7GDSX5_L4_1	0.0	0.0
Z_1_80_EKRN220057159-1A_HLN7GDSX5_L4_2	0.0	0.0
Z_1_81_EKRN220057160-1A_HLN7GDSX5_L4_1	0.0	0.0
Z_1_81_EKRN220057160-1A_HLN7GDSX5_L4_2	0.0	0.0
Z_1_82_EKRN220057161-1A_HLN7GDSX5_L4_1	0.0	0.0
Z_1_82_EKRN220057161-1A_HLN7GDSX5_L4_2	0.0	0.0
Z_1_83_EKRN220057162-1A_HLN7GDSX5_L4_1	0.0	0.0
Z_1_83_EKRN220057162-1A_HLN7GDSX5_L4_2	0.0	0.0
Z_1_84_EKRN220057163-1A_HLN7GDSX5_L4_1	0.16981160628096276	0.4503406345206515
Z_1_84_EKRN220057163-1A_HLN7GDSX5_L4_2	0.0	0.0
Z_1_85_EKRN220057164-1A_HLN7GDSX5_L4_1	0.10424976964741275	0.0
Z_1_85_EKRN220057164-1A_HLN7GDSX5_L4_2	0.0	0.0
Z_1_86_EKRN220057165-1A_HLN7GDSX5_L4_1	0.0	0.0
Z_1_86_EKRN220057165-1A_HLN7GDSX5_L4_2	0.0	0.0
Z_1_87_EKRN220057166-1A_HLN7GDSX5_L4_1	0.10398489521014802	0.0
Z_1_87_EKRN220057166-1A_HLN7GDSX5_L4_2	0.0	0.0
Z_1_88_EKRN220057167-1A_HLN7GDSX5_L4_1	0.1126694502232199	0.0
Z_1_88_EKRN220057167-1A_HLN7GDSX5_L4_2	0.0	0.0
Z_1_89_EKRN220057168-1A_HLN7GDSX5_L4_1	0.14172172780331668	0.0
Z_1_89_EKRN220057168-1A_HLN7GDSX5_L4_2	0.0	0.0
Z_1_8_EKRN220057087-1A_H22HLDSX5_L3_1	3.350503285077797	1.199445269521752
Z_1_8_EKRN220057087-1A_H22HLDSX5_L3_2	0.0	0.0
Z_1_90_EKRN220057169-1A_HLN7GDSX5_L4_1	0.15287844076118956	0.35450319306186856
Z_1_90_EKRN220057169-1A_HLN7GDSX5_L4_2	0.0	0.0
Z_1_9_EKRN220057088-1A_H22HLDSX5_L3_1	0.0	0.0
Z_1_9_EKRN220057088-1A_H22HLDSX5_L3_2	0.0	0.0
