================================================================================
JobID = 16836800
User = dadras, Account = all
Partition = medium, Nodelist = amp007
================================================================================
[1;32mFunctional annotation of hits...[0m
[1;34mTime to load the DB into memory: 1555.1735048294067[0m
500 1556.2314701080322 0.32 q/s (% mem usage: 18.70, % mem avail: 81.32)
1000 1557.1696646213531 0.64 q/s (% mem usage: 18.70, % mem avail: 81.32)
1500 1558.0709669589996 0.96 q/s (% mem usage: 18.70, % mem avail: 81.32)
2000 1559.0052092075348 1.28 q/s (% mem usage: 18.70, % mem avail: 81.32)
2500 1559.9921209812164 1.60 q/s (% mem usage: 18.70, % mem avail: 81.32)
3000 1560.9652791023254 1.92 q/s (% mem usage: 18.70, % mem avail: 81.32)
3500 1561.9062094688416 2.24 q/s (% mem usage: 18.70, % mem avail: 81.32)
4000 1562.807269334793 2.56 q/s (% mem usage: 18.70, % mem avail: 81.32)
4500 1563.7187864780426 2.88 q/s (% mem usage: 18.70, % mem avail: 81.32)
5000 1564.7209503650665 3.20 q/s (% mem usage: 18.70, % mem avail: 81.32)
5500 1565.6866626739502 3.51 q/s (% mem usage: 18.70, % mem avail: 81.32)
6000 1566.6541261672974 3.83 q/s (% mem usage: 18.70, % mem avail: 81.32)
6500 1567.6103584766388 4.15 q/s (% mem usage: 18.70, % mem avail: 81.32)
7000 1568.6220843791962 4.46 q/s (% mem usage: 18.70, % mem avail: 81.32)
7500 1569.5719475746155 4.78 q/s (% mem usage: 18.70, % mem avail: 81.32)
8000 1570.5693535804749 5.09 q/s (% mem usage: 18.70, % mem avail: 81.32)
8500 1571.4915835857391 5.41 q/s (% mem usage: 18.70, % mem avail: 81.32)
9000 1572.4522540569305 5.72 q/s (% mem usage: 18.70, % mem avail: 81.32)
9500 1573.474128484726 6.04 q/s (% mem usage: 18.70, % mem avail: 81.32)
10000 1574.41082406044 6.35 q/s (% mem usage: 18.70, % mem avail: 81.32)
10500 1575.3810291290283 6.67 q/s (% mem usage: 18.70, % mem avail: 81.31)
11000 1576.2820372581482 6.98 q/s (% mem usage: 18.70, % mem avail: 81.31)
11025 1589.5408856868744 6.94 q/s (% mem usage: 7.70, % mem avail: 92.31)
#  emapper-2.1.12
# emapper.py  -m diamond --itype proteins --data_dir /usr/users/dadras/eggnog-mapper-data/ --dmnd_iterate yes -i /scratch/users/dadras/stress_profiling/eggnog/SAG698_1b_prot.faa --output zygnema_1b --output_dir /scratch/users/dadras/stress_profiling/eggnog/zygnema --dbmem --cpu 0 --evalue 1e-10 --sensmode ultra-sensitive --tax_scope 33090 --dmnd_db /usr/users/dadras/eggnog-mapper-data/eggnog_proteins_default_viridiplantae.dmnd
[1;33m  /usr/users/dadras/.conda/envs/eggnog/bin/diamond blastp -d '/usr/users/dadras/eggnog-mapper-data/eggnog_proteins_default_viridiplantae.dmnd' -q '/scratch1/users/dadras/stress_profiling/eggnog/SAG698_1b_prot.faa' --threads 96 -o '/scratch1/users/dadras/stress_profiling/eggnog/zygnema/zygnema_1b.emapper.hits' --tmpdir '/scratch1/users/dadras/stress_profiling/eggnog/emappertmp_dmdn_i7rvvqbb' --ultra-sensitive --iterate -e 1e-10 --top 3  --outfmt 6 qseqid sseqid pident length mismatch gapopen qstart qend sstart send evalue bitscore qcovhsp scovhsp[0m
Loading source DB...
[31mWarning: this can take a few minutes and load up to 45GB to RAM. Using --dbmem is recommended to annotate a large number of sequences.[0m
[32mDone[0m
[1;33mResult files:[0m
   /scratch1/users/dadras/stress_profiling/eggnog/zygnema/zygnema_1b.emapper.hits
   /scratch1/users/dadras/stress_profiling/eggnog/zygnema/zygnema_1b.emapper.seed_orthologs
   /scratch1/users/dadras/stress_profiling/eggnog/zygnema/zygnema_1b.emapper.annotations

================================================================================
CITATION:
If you use this software, please cite:

[1] eggNOG-mapper v2: functional annotation, orthology assignments, and domain 
      prediction at the metagenomic scale. Carlos P. Cantalapiedra, 
      Ana Hernandez-Plaza, Ivica Letunic, Peer Bork, Jaime Huerta-Cepas. 2021.
      Molecular Biology and Evolution, msab293, https://doi.org/10.1093/molbev/msab293

[2] eggNOG 5.0: a hierarchical, functionally and phylogenetically annotated
      orthology resource based on 5090 organisms and 2502 viruses. Jaime
      Huerta-Cepas, Damian Szklarczyk, Davide Heller, Ana Hernandez-Plaza,
      Sofia K Forslund, Helen Cook, Daniel R Mende, Ivica Letunic, Thomas
      Rattei, Lars J Jensen, Christian von Mering and Peer Bork. Nucleic Acids
      Research, Volume 47, Issue D1, 8 January 2019, Pages D309-D314,
      https://doi.org/10.1093/nar/gky1085 

[3] Sensitive protein alignments at tree-of-life scale using DIAMOND.
       Buchfink B, Reuter K, Drost HG. 2021.
       Nature Methods 18, 366–368 (2021). https://doi.org/10.1038/s41592-021-01101-x

e.g. Functional annotation was performed using eggNOG-mapper (version emapper-2.1.12) [1]
 based on eggNOG orthology data [2]. Sequence searches were performed using [3].

================================================================================

Total hits processed: 11025
Total time: 1981 secs
FINISHED
