"","x"
"1","Me1_v2_0065630"
"2","Me1_v2_0065670"
"3","Me1_v2_0051660"
"4","Me1_v2_0065680"
"5","Me1_v2_0051670"
"6","Me1_v2_0065500"
"7","Me1_v2_0051620"
"8","Me1_v2_0029800"
"9","Me1_v2_0060380"
"10","Me1_v2_0039150"
"11","Me1_v2_0059190"
"12","Me1_v2_0066410"
"13","Me1_v2_0201230"
"14","Me1_v2_0170880"
"15","Me1_v2_0205430"
"16","Me1_v2_0161450"
"17","Me1_v2_0060310"
"18","Me1_v2_0109090"
"19","Me1_v2_0050670"
"20","Me1_v2_0210310"
