0.9648093841642229	1	1	1	1	1	1	1	1	1
0.9853747714808044	1	1	1	1	1	1	1	1	1
0.9935275080906149	1	1	1	1	1	1	1	1	1
0.9552715654952076	1	1	1	1	1	1	1	1	1
0.9909638554216867	1	1	1	1	1	1	1	1	1
1	NA	NA	NA	NA	NA	NA	NA	NA	NA
0.9878419452887538	1	1	1	1	1	1	1	1	1
0.9985207100591716	1	1	1	1	1	1	1	1	1
1	1	1	1	1	1	1	1	1	1
1	NA	NA	NA	NA	NA	NA	NA	NA	NA
0.9779874213836478	1	1	1	1	1	1	1	1	1
1	NA	NA	NA	NA	NA	NA	NA	NA	NA
