"","ID","Description","GeneRatio","BgRatio","pvalue","p.adjust","qvalue","geneID","Count"
"GO:0009228","GO:0009228","thiamine biosynthetic process","4/42","12/8078",3.03226008756689e-07,9.36968367058169e-05,8.63396161775625e-05,"Pp3c16_8630V3/Pp3c23_6510V3/Pp3c23_6600V3/Pp3c24_10800V3",4
"GO:0042724","GO:0042724","thiamine-containing compound biosynthetic process","4/42","12/8078",3.03226008756689e-07,9.36968367058169e-05,8.63396161775625e-05,"Pp3c16_8630V3/Pp3c23_6510V3/Pp3c23_6600V3/Pp3c24_10800V3",4
"GO:0006772","GO:0006772","thiamine metabolic process","4/42","15/8078",8.26763900590047e-07,0.000127735022641162,0.00011770507111032,"Pp3c16_8630V3/Pp3c23_6510V3/Pp3c23_6600V3/Pp3c24_10800V3",4
"GO:0042723","GO:0042723","thiamine-containing compound metabolic process","4/42","15/8078",8.26763900590047e-07,0.000127735022641162,0.00011770507111032,"Pp3c16_8630V3/Pp3c23_6510V3/Pp3c23_6600V3/Pp3c24_10800V3",4
"GO:0044272","GO:0044272","sulfur compound biosynthetic process","5/42","72/8078",3.21737652775839e-05,0.00397667738830936,0.00366442252951008,"Pp3c14_1450V3/Pp3c16_8630V3/Pp3c23_6510V3/Pp3c23_6600V3/Pp3c24_10800V3",5
"GO:0072528","GO:0072528","pyrimidine-containing compound biosynthetic process","4/42","44/8078",7.37139198259248e-05,0.00759253374207025,0.00699635625014479,"Pp3c16_8630V3/Pp3c23_6510V3/Pp3c23_6600V3/Pp3c24_10800V3",4
"GO:0042364","GO:0042364","water-soluble vitamin biosynthetic process","4/42","47/8078",9.57663677591291e-05,0.00845480218216311,0.0077909180387502,"Pp3c16_8630V3/Pp3c23_6510V3/Pp3c23_6600V3/Pp3c24_10800V3",4
"GO:0006767","GO:0006767","water-soluble vitamin metabolic process","4/42","51/8078",0.000132170221096727,0.0102101495797221,0.00940843284385909,"Pp3c16_8630V3/Pp3c23_6510V3/Pp3c23_6600V3/Pp3c24_10800V3",4
"GO:0072527","GO:0072527","pyrimidine-containing compound metabolic process","4/42","57/8078",0.000204255870404751,0.0140255697677929,0.0129242603378912,"Pp3c16_8630V3/Pp3c23_6510V3/Pp3c23_6600V3/Pp3c24_10800V3",4
"GO:0009110","GO:0009110","vitamin biosynthetic process","4/42","66/8078",0.000360278910957456,0.0222652366971708,0.0205169358766299,"Pp3c16_8630V3/Pp3c23_6510V3/Pp3c23_6600V3/Pp3c24_10800V3",4
"GO:0006766","GO:0006766","vitamin metabolic process","4/42","70/8078",0.000451506425682632,0.0253664519156243,0.0233746388798377,"Pp3c16_8630V3/Pp3c23_6510V3/Pp3c23_6600V3/Pp3c24_10800V3",4
"GO:0005506","GO:0005506","iron ion binding","3/42","33/8078",0.000639790423739217,0.0308635868923671,0.0284401303164207,"Pp3c23_6510V3/Pp3c23_6600V3/Pp3c24_10800V3",3
"GO:0009251","GO:0009251","glucan catabolic process","3/42","34/8078",0.000699175107594077,0.0308635868923671,0.0284401303164207,"Pp3c16_260V3/Pp3c20_17800V3/Pp3c6_24700V3",3
"GO:0044247","GO:0044247","cellular polysaccharide catabolic process","3/42","34/8078",0.000699175107594077,0.0308635868923671,0.0284401303164207,"Pp3c16_260V3/Pp3c20_17800V3/Pp3c6_24700V3",3
"GO:0016651","GO:0016651","oxidoreductase activity, acting on NAD(P)H","4/42","83/8078",0.000861780230730039,0.0355053455060776,0.0327174108649089,"Pp3c1_3150V3/Pp3c10_18810V3/Pp3c2_2120V3/Pp3c5_16850V3",4
"GO:0045454","GO:0045454","cell redox homeostasis","3/42","39/8078",0.00104870095815405,0.0405060745087001,0.0373254748921935,"Pp3c1_3150V3/Pp3c10_18810V3/Pp3c5_16850V3",3
"GO:0016668","GO:0016668","oxidoreductase activity, acting on a sulfur group of donors, NAD(P) as acceptor","3/42","40/8078",0.00112964603372296,0.0410659558141642,0.0378413934516485,"Pp3c1_3150V3/Pp3c10_18810V3/Pp3c5_16850V3",3
"GO:0042592","GO:0042592","homeostatic process","7/42","325/8078",0.00128023569139432,0.0423865266231102,0.0390582709983012,"Pp3c1_3150V3/Pp3c10_18810V3/Pp3c13_21490V3/Pp3c2_25720V3/Pp3c22_9570V3/Pp3c5_16850V3/Pp3c9_5610V3",7
"GO:0015036","GO:0015036","disulfide oxidoreductase activity","3/42","42/8078",0.00130314564051633,0.0423865266231102,0.0390582709983012,"Pp3c1_3150V3/Pp3c10_18810V3/Pp3c5_16850V3",3
"GO:0006826","GO:0006826","iron ion transport","2/42","11/8078",0.00140906498938735,0.0435401081720692,0.0401212715399241,"Pp3c13_21490V3/Pp3c9_5610V3",2
"GO:0000272","GO:0000272","polysaccharide catabolic process","3/42","45/8078",0.00159343276133715,0.044760974841198,0.041246273870019,"Pp3c16_260V3/Pp3c20_17800V3/Pp3c6_24700V3",3
"GO:0044275","GO:0044275","cellular carbohydrate catabolic process","3/42","45/8078",0.00159343276133715,0.044760974841198,0.041246273870019,"Pp3c16_260V3/Pp3c20_17800V3/Pp3c6_24700V3",3
"GO:0005975","GO:0005975","carbohydrate metabolic process","7/42","344/8078",0.00177749339489606,0.0465886094938822,0.0429303998231822,"Pp3c10_23130V3/Pp3c16_260V3/Pp3c17_15940V3/Pp3c20_10460V3/Pp3c20_17800V3/Pp3c6_24700V3/Pp3c6_8620V3",7
"GO:0006790","GO:0006790","sulfur compound metabolic process","5/42","171/8078",0.00180926638811193,0.0465886094938822,0.0429303998231822,"Pp3c14_1450V3/Pp3c16_8630V3/Pp3c23_6510V3/Pp3c23_6600V3/Pp3c24_10800V3",5
"GO:0010319","GO:0010319","stromule","3/42","57/8078",0.00314665433188356,0.0777852950841615,0.0716774734125896,"Pp3c23_6510V3/Pp3c23_6600V3/Pp3c24_10800V3",3
"GO:0009266","GO:0009266","response to temperature stimulus","8/42","492/8078",0.00335878956185859,0.0798358442011004,0.0735670102415182,"Pp3c10_23130V3/Pp3c10_9020V3/Pp3c15_24170V3/Pp3c2_2750V3/Pp3c23_6510V3/Pp3c23_6600V3/Pp3c24_10800V3/Pp3c6_24700V3",8
"GO:0016667","GO:0016667","oxidoreductase activity, acting on a sulfur group of donors","3/42","66/8078",0.00476433166165508,0.108327068793315,0.0998210598146543,"Pp3c1_3150V3/Pp3c10_18810V3/Pp3c5_16850V3",3
"GO:0098655","GO:0098655","cation transmembrane transport","5/42","216/8078",0.00496141678005333,0.108327068793315,0.0998210598146543,"Pp3c13_21490V3/Pp3c22_9570V3/Pp3c27_2550V3/Pp3c6_8930V3/Pp3c9_5610V3",5
"GO:0009501","GO:0009501","amyloplast","2/42","21/8078",0.00520578988078331,0.108327068793315,0.0998210598146543,"Pp3c20_17800V3/Pp3c6_24700V3",2
"GO:0044262","GO:0044262","cellular carbohydrate metabolic process","5/42","219/8078",0.00525859557249103,0.108327068793315,0.0998210598146543,"Pp3c10_23130V3/Pp3c16_260V3/Pp3c20_17800V3/Pp3c6_24700V3/Pp3c6_8620V3",5
"GO:0015980","GO:0015980","energy derivation by oxidation of organic compounds","3/42","71/8078",0.00584478744117515,0.113251219016766,0.104358558146943,"Pp3c2_2120V3/Pp3c20_17800V3/Pp3c6_24700V3",3
"GO:0005977","GO:0005977","glycogen metabolic process","2/42","23/8078",0.00623064958991914,0.113251219016766,0.104358558146943,"Pp3c20_17800V3/Pp3c6_24700V3",2
"GO:0006112","GO:0006112","energy reserve metabolic process","2/42","23/8078",0.00623064958991914,0.113251219016766,0.104358558146943,"Pp3c20_17800V3/Pp3c6_24700V3",2
"GO:0019203","GO:0019203","carbohydrate phosphatase activity","2/42","23/8078",0.00623064958991914,0.113251219016766,0.104358558146943,"Pp3c10_23130V3/Pp3c16_260V3",2
"GO:0005983","GO:0005983","starch catabolic process","2/42","25/8078",0.00733975269293509,0.129599061835254,0.119422743063997,"Pp3c16_260V3/Pp3c20_17800V3",2
"GO:0044283","GO:0044283","small molecule biosynthetic process","7/42","449/8078",0.00776271133392052,0.133259877898969,0.122796106188626,"Pp3c12_14480V3/Pp3c14_1450V3/Pp3c15_5610V3/Pp3c16_8630V3/Pp3c23_6510V3/Pp3c23_6600V3/Pp3c24_10800V3",7
"GO:0019904","GO:0019904","protein domain specific binding","4/42","154/8078",0.00810064792710513,0.134988655191794,0.124389137214718,"Pp3c16_8630V3/Pp3c23_6510V3/Pp3c23_6600V3/Pp3c24_10800V3",4
"GO:0009409","GO:0009409","response to cold","6/42","345/8078",0.00830027329658282,0.134988655191794,0.124389137214718,"Pp3c10_23130V3/Pp3c15_24170V3/Pp3c2_2750V3/Pp3c23_6510V3/Pp3c23_6600V3/Pp3c24_10800V3",6
"GO:0019725","GO:0019725","cellular homeostasis","4/42","158/8078",0.00885148250710309,0.135269405854785,0.124647842901445,"Pp3c1_3150V3/Pp3c10_18810V3/Pp3c22_9570V3/Pp3c5_16850V3",4
"GO:0016491","GO:0016491","oxidoreductase activity","7/42","464/8078",0.00923467938682199,0.135269405854785,0.124647842901445,"Pp3c1_3150V3/Pp3c10_18810V3/Pp3c12_14480V3/Pp3c15_5610V3/Pp3c2_2120V3/Pp3c20_10460V3/Pp3c5_16850V3",7
"GO:0016758","GO:0016758","hexosyltransferase activity","4/42","160/8078",0.00924348251530275,0.135269405854785,0.124647842901445,"Pp3c17_15940V3/Pp3c20_17800V3/Pp3c3_14060V3/Pp3c6_24700V3",4
"GO:0050801","GO:0050801","ion homeostasis","4/42","160/8078",0.00924348251530275,0.135269405854785,0.124647842901445,"Pp3c13_21490V3/Pp3c2_25720V3/Pp3c22_9570V3/Pp3c9_5610V3",4
"GO:0006812","GO:0006812","cation transport","5/42","252/8078",0.00941194895106107,0.135269405854785,0.124647842901445,"Pp3c13_21490V3/Pp3c22_9570V3/Pp3c27_2550V3/Pp3c6_8930V3/Pp3c9_5610V3",5
"GO:0047134","GO:0047134","protein-disulfide reductase (NAD(P)) activity","2/42","29/8078",0.00980362426922767,0.137696359054152,0.126884227982109,"Pp3c1_3150V3/Pp3c10_18810V3",2
"GO:0022890","GO:0022890","inorganic cation transmembrane transporter activity","4/42","165/8078",0.010272867064293,0.140895041607739,0.129831745034555,"Pp3c13_21490V3/Pp3c22_9570V3/Pp3c6_8930V3/Pp3c9_5610V3",4
"GO:0005976","GO:0005976","polysaccharide metabolic process","4/42","166/8078",0.0104873331941036,0.140895041607739,0.129831745034555,"Pp3c16_260V3/Pp3c17_15940V3/Pp3c20_17800V3/Pp3c6_24700V3",4
"GO:0098662","GO:0098662","inorganic cation transmembrane transport","4/42","174/8078",0.0123086179843168,0.161845232219314,0.14913689427806,"Pp3c13_21490V3/Pp3c22_9570V3/Pp3c27_2550V3/Pp3c9_5610V3",4
"GO:0015318","GO:0015318","inorganic molecular entity transmembrane transporter activity","5/42","273/8078",0.013005279915479,0.167442978911792,0.154295097242854,"Pp3c13_21490V3/Pp3c22_9570V3/Pp3c27_2550V3/Pp3c6_8930V3/Pp3c9_5610V3",5
"GO:0042802","GO:0042802","identical protein binding","6/42","396/8078",0.0156901657263072,0.194214047656204,0.178964060265724,"Pp3c23_6510V3/Pp3c23_6600V3/Pp3c24_10800V3/Pp3c24_17430V3/Pp3c6_24700V3/Pp3c7_11570V3",6
"GO:0016052","GO:0016052","carbohydrate catabolic process","3/42","102/8078",0.0157131106517964,0.194214047656204,0.178964060265724,"Pp3c16_260V3/Pp3c20_17800V3/Pp3c6_24700V3",3
"GO:0046873","GO:0046873","metal ion transmembrane transporter activity","3/42","103/8078",0.0161267971889161,0.195418836524513,0.180074247248784,"Pp3c13_21490V3/Pp3c22_9570V3/Pp3c9_5610V3",3
"GO:1990542","GO:1990542","mitochondrial transmembrane transport","2/42","38/8078",0.0164823843635675,0.195886798782398,0.180505464386438,"Pp3c27_2550V3/Pp3c9_5610V3",2
"GO:0008324","GO:0008324","cation transmembrane transporter activity","4/42","191/8078",0.0168268955234437,0.195941430975178,0.180555806774947,"Pp3c13_21490V3/Pp3c22_9570V3/Pp3c6_8930V3/Pp3c9_5610V3",4
"GO:0016757","GO:0016757","glycosyltransferase activity","4/42","192/8078",0.0171210959104524,0.195941430975178,0.180555806774947,"Pp3c17_15940V3/Pp3c20_17800V3/Pp3c3_14060V3/Pp3c6_24700V3",4
"GO:0046915","GO:0046915","transition metal ion transmembrane transporter activity","2/42","40/8078",0.0181685844409797,0.204148821536827,0.188118740336268,"Pp3c13_21490V3/Pp3c9_5610V3",2
"GO:0098660","GO:0098660","inorganic ion transmembrane transport","4/42","197/8078",0.01864075158376,0.205714008549351,0.189561026443875,"Pp3c13_21490V3/Pp3c22_9570V3/Pp3c27_2550V3/Pp3c9_5610V3",4
"GO:0006979","GO:0006979","response to oxidative stress","5/42","301/8078",0.0191161827850061,0.207259665984803,0.190985316467005,"Pp3c10_18810V3/Pp3c12_14480V3/Pp3c15_24170V3/Pp3c22_9570V3/Pp3c5_16850V3",5
"GO:0005984","GO:0005984","disaccharide metabolic process","2/42","42/8078",0.0199247719605277,0.212301880544933,0.19563160854166,"Pp3c10_23130V3/Pp3c20_17800V3",2
"GO:0015075","GO:0015075","ion transmembrane transporter activity","5/42","310/8078",0.0214265492363898,0.224434024204897,0.206811117518053,"Pp3c13_21490V3/Pp3c22_9570V3/Pp3c27_2550V3/Pp3c6_8930V3/Pp3c9_5610V3",5
"GO:0006006","GO:0006006","glucose metabolic process","2/42","45/8078",0.022686872736954,0.233674789190627,0.215326283345476,"Pp3c20_10460V3/Pp3c20_17800V3",2
"GO:0006073","GO:0006073","cellular glucan metabolic process","3/42","118/8078",0.0230716868546545,0.233742663543876,0.215388828099535,"Pp3c16_260V3/Pp3c20_17800V3/Pp3c6_24700V3",3
"GO:0044042","GO:0044042","glucan metabolic process","3/42","121/8078",0.0246279035935721,0.245484587432703,0.226208757964729,"Pp3c16_260V3/Pp3c20_17800V3/Pp3c6_24700V3",3
"GO:0000041","GO:0000041","transition metal ion transport","2/42","49/8078",0.0266002621915587,0.260935905307671,0.240446814463379,"Pp3c13_21490V3/Pp3c9_5610V3",2
"GO:0009311","GO:0009311","oligosaccharide metabolic process","2/42","53/8078",0.0307662687183339,0.297086782311412,0.273759068694386,"Pp3c10_23130V3/Pp3c20_17800V3",2
"GO:0034220","GO:0034220","ion transmembrane transport","5/42","343/8078",0.0314477684909718,0.298995706575701,0.27551810127313,"Pp3c13_21490V3/Pp3c22_9570V3/Pp3c27_2550V3/Pp3c6_8930V3/Pp3c9_5610V3",5
"GO:0008270","GO:0008270","zinc ion binding","3/42","135/8078",0.0326276962228803,0.305513882814243,0.281524460232508,"Pp3c23_6510V3/Pp3c23_6600V3/Pp3c24_10800V3",3
"GO:0000302","GO:0000302","response to reactive oxygen species","3/42","136/8078",0.0332454119304563,0.306651710045105,0.282572943509456,"Pp3c12_14480V3/Pp3c22_9570V3/Pp3c5_16850V3",3
"GO:0055080","GO:0055080","cation homeostasis","3/42","138/8078",0.0344992583936105,0.313537377753695,0.288917937940298,"Pp3c13_21490V3/Pp3c22_9570V3/Pp3c9_5610V3",3
"GO:0030001","GO:0030001","metal ion transport","3/42","140/8078",0.0357776030095244,0.320442879128784,0.295281208667471,"Pp3c13_21490V3/Pp3c22_9570V3/Pp3c9_5610V3",3
"GO:0044264","GO:0044264","cellular polysaccharide metabolic process","3/42","142/8078",0.0370803737413522,0.321563648982564,0.296313973938966,"Pp3c16_260V3/Pp3c20_17800V3/Pp3c6_24700V3",3
"GO:0098771","GO:0098771","inorganic ion homeostasis","3/42","142/8078",0.0370803737413522,0.321563648982564,0.296313973938966,"Pp3c13_21490V3/Pp3c22_9570V3/Pp3c9_5610V3",3
"GO:0005982","GO:0005982","starch metabolic process","2/42","59/8078",0.037463726095056,0.321563648982564,0.296313973938966,"Pp3c16_260V3/Pp3c20_17800V3",2
"GO:0048878","GO:0048878","chemical homeostasis","4/42","248/8078",0.0389943396504956,0.324099730021748,0.298650917972689,"Pp3c13_21490V3/Pp3c2_25720V3/Pp3c22_9570V3/Pp3c9_5610V3",4
"GO:0019318","GO:0019318","hexose metabolic process","2/42","61/8078",0.0398102103657878,0.324099730021748,0.298650917972689,"Pp3c20_10460V3/Pp3c20_17800V3",2
"GO:0016209","GO:0016209","antioxidant activity","2/42","63/8078",0.0422114279194121,0.324099730021748,0.298650917972689,"Pp3c10_18810V3/Pp3c5_16850V3",2
"GO:0098869","GO:0098869","cellular oxidant detoxification","2/42","66/8078",0.0459129792178802,0.324099730021748,0.298650917972689,"Pp3c10_18810V3/Pp3c5_16850V3",2
"GO:1990748","GO:1990748","cellular detoxification","2/42","67/8078",0.0471727703708362,0.324099730021748,0.298650917972689,"Pp3c10_18810V3/Pp3c5_16850V3",2
"GO:0005992","GO:0005992","trehalose biosynthetic process","1/42","10/8078",0.0508209632816187,0.324099730021748,0.298650917972689,"Pp3c10_23130V3",1
"GO:0006108","GO:0006108","malate metabolic process","1/42","10/8078",0.0508209632816187,0.324099730021748,0.298650917972689,"Pp3c2_2120V3",1
"GO:0009313","GO:0009313","oligosaccharide catabolic process","1/42","10/8078",0.0508209632816187,0.324099730021748,0.298650917972689,"Pp3c20_17800V3",1
"GO:0016615","GO:0016615","malate dehydrogenase activity","1/42","10/8078",0.0508209632816187,0.324099730021748,0.298650917972689,"Pp3c2_2120V3",1
"GO:0032481","GO:0032481","positive regulation of type I interferon production","1/42","10/8078",0.0508209632816187,0.324099730021748,0.298650917972689,"Pp3c17_19720V3",1
"GO:0033273","GO:0033273","response to vitamin","1/42","10/8078",0.0508209632816187,0.324099730021748,0.298650917972689,"Pp3c16_8630V3",1
"GO:0045489","GO:0045489","pectin biosynthetic process","1/42","10/8078",0.0508209632816187,0.324099730021748,0.298650917972689,"Pp3c17_15940V3",1
"GO:0051775","GO:0051775","response to redox state","1/42","10/8078",0.0508209632816187,0.324099730021748,0.298650917972689,"Pp3c2_2120V3",1
"GO:0055076","GO:0055076","transition metal ion homeostasis","2/42","71/8078",0.052337371877362,0.324099730021748,0.298650917972689,"Pp3c13_21490V3/Pp3c9_5610V3",2
"GO:1902600","GO:1902600","proton transmembrane transport","2/42","71/8078",0.052337371877362,0.324099730021748,0.298650917972689,"Pp3c22_9570V3/Pp3c27_2550V3",2
"GO:0043094","GO:0043094","cellular metabolic compound salvage","2/42","73/8078",0.0549927381558399,0.324099730021748,0.298650917972689,"Pp3c14_1450V3/Pp3c27_2550V3",2
"GO:0006098","GO:0006098","pentose-phosphate shunt","1/42","11/8078",0.0557621531108417,0.324099730021748,0.298650917972689,"Pp3c20_10460V3",1
"GO:0030247","GO:0030247","polysaccharide binding","1/42","11/8078",0.0557621531108417,0.324099730021748,0.298650917972689,"Pp3c16_260V3",1
"GO:0032042","GO:0032042","mitochondrial DNA metabolic process","1/42","11/8078",0.0557621531108417,0.324099730021748,0.298650917972689,"Pp3c10_9020V3",1
"GO:0032206","GO:0032206","positive regulation of telomere maintenance","1/42","11/8078",0.0557621531108417,0.324099730021748,0.298650917972689,"Pp3c17_19720V3",1
"GO:0032479","GO:0032479","regulation of type I interferon production","1/42","11/8078",0.0557621531108417,0.324099730021748,0.298650917972689,"Pp3c17_19720V3",1
"GO:0051156","GO:0051156","glucose 6-phosphate metabolic process","1/42","11/8078",0.0557621531108417,0.324099730021748,0.298650917972689,"Pp3c20_10460V3",1
"GO:0062014","GO:0062014","negative regulation of small molecule metabolic process","1/42","11/8078",0.0557621531108417,0.324099730021748,0.298650917972689,"Pp3c18_14130V3",1
"GO:0098739","GO:0098739","import across plasma membrane","1/42","11/8078",0.0557621531108417,0.324099730021748,0.298650917972689,"Pp3c22_9570V3",1
"GO:2000117","GO:2000117","negative regulation of cysteine-type endopeptidase activity","1/42","11/8078",0.0557621531108417,0.324099730021748,0.298650917972689,"Pp3c15_24170V3",1
"GO:0046496","GO:0046496","nicotinamide nucleotide metabolic process","2/42","74/8078",0.056338147080989,0.324099730021748,0.298650917972689,"Pp3c2_2120V3/Pp3c20_10460V3",2
"GO:0019362","GO:0019362","pyridine nucleotide metabolic process","2/42","75/8078",0.0576951704773587,0.324099730021748,0.298650917972689,"Pp3c2_2120V3/Pp3c20_10460V3",2
"GO:0046677","GO:0046677","response to antibiotic","3/42","171/8078",0.0586548789308649,0.324099730021748,0.298650917972689,"Pp3c12_14480V3/Pp3c22_9570V3/Pp3c3_14060V3",3
"GO:0097237","GO:0097237","cellular response to toxic substance","2/42","76/8078",0.0590636577978179,0.324099730021748,0.298650917972689,"Pp3c10_18810V3/Pp3c5_16850V3",2
"GO:0006811","GO:0006811","ion transport","5/42","409/8078",0.0593380310551962,0.324099730021748,0.298650917972689,"Pp3c13_21490V3/Pp3c22_9570V3/Pp3c27_2550V3/Pp3c6_8930V3/Pp3c9_5610V3",5
"GO:0001819","GO:0001819","positive regulation of cytokine production","1/42","12/8078",0.0606782296658614,0.324099730021748,0.298650917972689,"Pp3c17_19720V3",1
"GO:0003725","GO:0003725","double-stranded RNA binding","1/42","12/8078",0.0606782296658614,0.324099730021748,0.298650917972689,"Pp3c17_19720V3",1
"GO:0004869","GO:0004869","cysteine-type endopeptidase inhibitor activity","1/42","12/8078",0.0606782296658614,0.324099730021748,0.298650917972689,"Pp3c15_24170V3",1
"GO:0016702","GO:0016702","oxidoreductase activity, acting on single donors with incorporation of molecular oxygen, incorporation of two atoms of oxygen","1/42","12/8078",0.0606782296658614,0.324099730021748,0.298650917972689,"Pp3c12_14480V3",1
"GO:0018196","GO:0018196","peptidyl-asparagine modification","1/42","12/8078",0.0606782296658614,0.324099730021748,0.298650917972689,"Pp3c3_14060V3",1
"GO:0018279","GO:0018279","protein N-linked glycosylation via asparagine","1/42","12/8078",0.0606782296658614,0.324099730021748,0.298650917972689,"Pp3c3_14060V3",1
"GO:0019774","GO:0019774","proteasome core complex, beta-subunit complex","1/42","12/8078",0.0606782296658614,0.324099730021748,0.298650917972689,"Pp3c7_21050V3",1
"GO:0022857","GO:0022857","transmembrane transporter activity","5/42","414/8078",0.0618940995821422,0.324099730021748,0.298650917972689,"Pp3c13_21490V3/Pp3c22_9570V3/Pp3c27_2550V3/Pp3c6_8930V3/Pp3c9_5610V3",5
"GO:0000002","GO:0000002","mitochondrial genome maintenance","1/42","13/8078",0.0655693174856027,0.324099730021748,0.298650917972689,"Pp3c10_9020V3",1
"GO:0002791","GO:0002791","regulation of peptide secretion","1/42","13/8078",0.0655693174856027,0.324099730021748,0.298650917972689,"Pp3c17_19720V3",1
"GO:0004866","GO:0004866","endopeptidase inhibitor activity","1/42","13/8078",0.0655693174856027,0.324099730021748,0.298650917972689,"Pp3c15_24170V3",1
"GO:0050708","GO:0050708","regulation of protein secretion","1/42","13/8078",0.0655693174856027,0.324099730021748,0.298650917972689,"Pp3c17_19720V3",1
"GO:0051084","GO:0051084","'de novo' post-translational protein folding","1/42","13/8078",0.0655693174856027,0.324099730021748,0.298650917972689,"Pp3c3_14060V3",1
"GO:0070034","GO:0070034","telomerase RNA binding","1/42","13/8078",0.0655693174856027,0.324099730021748,0.298650917972689,"Pp3c17_19720V3",1
"GO:0072524","GO:0072524","pyridine-containing compound metabolic process","2/42","81/8078",0.0660728665961153,0.324099730021748,0.298650917972689,"Pp3c2_2120V3/Pp3c20_10460V3",2
"GO:0016616","GO:0016616","oxidoreductase activity, acting on the CH-OH group of donors, NAD or NADP as acceptor","2/42","83/8078",0.0689516597626024,0.324099730021748,0.298650917972689,"Pp3c2_2120V3/Pp3c20_10460V3",2
"GO:0098754","GO:0098754","detoxification","2/42","83/8078",0.0689516597626024,0.324099730021748,0.298650917972689,"Pp3c10_18810V3/Pp3c5_16850V3",2
"GO:0009636","GO:0009636","response to toxic substance","3/42","184/8078",0.0698926754872062,0.324099730021748,0.298650917972689,"Pp3c10_18810V3/Pp3c22_9570V3/Pp3c5_16850V3",3
"GO:0005991","GO:0005991","trehalose metabolic process","1/42","14/8078",0.0704355405067566,0.324099730021748,0.298650917972689,"Pp3c10_23130V3",1
"GO:0009086","GO:0009086","methionine biosynthetic process","1/42","14/8078",0.0704355405067566,0.324099730021748,0.298650917972689,"Pp3c14_1450V3",1
"GO:0015298","GO:0015298","solute:cation antiporter activity","1/42","14/8078",0.0704355405067566,0.324099730021748,0.298650917972689,"Pp3c22_9570V3",1
"GO:0015491","GO:0015491","cation:cation antiporter activity","1/42","14/8078",0.0704355405067566,0.324099730021748,0.298650917972689,"Pp3c22_9570V3",1
"GO:0030414","GO:0030414","peptidase inhibitor activity","1/42","14/8078",0.0704355405067566,0.324099730021748,0.298650917972689,"Pp3c15_24170V3",1
"GO:0030968","GO:0030968","endoplasmic reticulum unfolded protein response","1/42","14/8078",0.0704355405067566,0.324099730021748,0.298650917972689,"Pp3c3_14060V3",1
"GO:0034620","GO:0034620","cellular response to unfolded protein","1/42","14/8078",0.0704355405067566,0.324099730021748,0.298650917972689,"Pp3c3_14060V3",1
"GO:0043489","GO:0043489","RNA stabilization","1/42","14/8078",0.0704355405067566,0.324099730021748,0.298650917972689,"Pp3c17_19720V3",1
"GO:0070696","GO:0070696","transmembrane receptor protein serine/threonine kinase binding","1/42","14/8078",0.0704355405067566,0.324099730021748,0.298650917972689,"Pp3c18_14130V3",1
"GO:1902369","GO:1902369","negative regulation of RNA catabolic process","1/42","14/8078",0.0704355405067566,0.324099730021748,0.298650917972689,"Pp3c17_19720V3",1
"GO:2000116","GO:2000116","regulation of cysteine-type endopeptidase activity","1/42","14/8078",0.0704355405067566,0.324099730021748,0.298650917972689,"Pp3c15_24170V3",1
"GO:0005384","GO:0005384","manganese ion transmembrane transporter activity","1/42","15/8078",0.075277022066617,0.324099730021748,0.298650917972689,"Pp3c13_21490V3",1
"GO:0009626","GO:0009626","plant-type hypersensitive response","1/42","15/8078",0.075277022066617,0.324099730021748,0.298650917972689,"Pp3c3_14060V3",1
"GO:0015919","GO:0015919","peroxisomal membrane transport","1/42","15/8078",0.075277022066617,0.324099730021748,0.298650917972689,"Pp3c10_9020V3",1
"GO:0016558","GO:0016558","protein import into peroxisome matrix","1/42","15/8078",0.075277022066617,0.324099730021748,0.298650917972689,"Pp3c10_9020V3",1
"GO:0016701","GO:0016701","oxidoreductase activity, acting on single donors with incorporation of molecular oxygen","1/42","15/8078",0.075277022066617,0.324099730021748,0.298650917972689,"Pp3c12_14480V3",1
"GO:0034050","GO:0034050","programmed cell death induced by symbiont","1/42","15/8078",0.075277022066617,0.324099730021748,0.298650917972689,"Pp3c3_14060V3",1
"GO:0061135","GO:0061135","endopeptidase regulator activity","1/42","15/8078",0.075277022066617,0.324099730021748,0.298650917972689,"Pp3c15_24170V3",1
"GO:0071421","GO:0071421","manganese ion transmembrane transport","1/42","15/8078",0.075277022066617,0.324099730021748,0.298650917972689,"Pp3c13_21490V3",1
"GO:1902930","GO:1902930","regulation of alcohol biosynthetic process","1/42","15/8078",0.075277022066617,0.324099730021748,0.298650917972689,"Pp3c18_14130V3",1
"GO:0046872","GO:0046872","metal ion binding","5/42","444/8078",0.0785502443974631,0.324099730021748,0.298650917972689,"Pp3c10_23130V3/Pp3c15_24170V3/Pp3c23_6510V3/Pp3c23_6600V3/Pp3c24_10800V3",5
"GO:0000978","GO:0000978","RNA polymerase II cis-regulatory region sequence-specific DNA binding","1/42","16/8078",0.080093884905908,0.324099730021748,0.298650917972689,"Pp3c17_19720V3",1
"GO:0002020","GO:0002020","protease binding","1/42","16/8078",0.080093884905908,0.324099730021748,0.298650917972689,"Pp3c15_24170V3",1
"GO:0006636","GO:0006636","unsaturated fatty acid biosynthetic process","1/42","16/8078",0.080093884905908,0.324099730021748,0.298650917972689,"Pp3c15_5610V3",1
"GO:0006828","GO:0006828","manganese ion transport","1/42","16/8078",0.080093884905908,0.324099730021748,0.298650917972689,"Pp3c13_21490V3",1
"GO:0010951","GO:0010951","negative regulation of endopeptidase activity","1/42","16/8078",0.080093884905908,0.324099730021748,0.298650917972689,"Pp3c15_24170V3",1
"GO:0070417","GO:0070417","cellular response to cold","1/42","16/8078",0.080093884905908,0.324099730021748,0.298650917972689,"Pp3c2_2750V3",1
"GO:0016614","GO:0016614","oxidoreductase activity, acting on CH-OH group of donors","2/42","93/8078",0.0839416629042323,0.324099730021748,0.298650917972689,"Pp3c2_2120V3/Pp3c20_10460V3",2
"GO:0000987","GO:0000987","cis-regulatory region sequence-specific DNA binding","1/42","17/8078",0.0848862511715925,0.324099730021748,0.298650917972689,"Pp3c17_19720V3",1
"GO:0006099","GO:0006099","tricarboxylic acid cycle","1/42","17/8078",0.0848862511715925,0.324099730021748,0.298650917972689,"Pp3c2_2120V3",1
"GO:0006101","GO:0006101","citrate metabolic process","1/42","17/8078",0.0848862511715925,0.324099730021748,0.298650917972689,"Pp3c2_2120V3",1
"GO:0006760","GO:0006760","folic acid-containing compound metabolic process","1/42","17/8078",0.0848862511715925,0.324099730021748,0.298650917972689,"Pp3c17_12060V3",1
"GO:0010466","GO:0010466","negative regulation of peptidase activity","1/42","17/8078",0.0848862511715925,0.324099730021748,0.298650917972689,"Pp3c15_24170V3",1
"GO:0032103","GO:0032103","positive regulation of response to external stimulus","1/42","17/8078",0.0848862511715925,0.324099730021748,0.298650917972689,"Pp3c2_2750V3",1
"GO:0035967","GO:0035967","cellular response to topologically incorrect protein","1/42","17/8078",0.0848862511715925,0.324099730021748,0.298650917972689,"Pp3c3_14060V3",1
"GO:0005996","GO:0005996","monosaccharide metabolic process","2/42","94/8078",0.085492070746495,0.324099730021748,0.298650917972689,"Pp3c20_10460V3/Pp3c20_17800V3",2
"GO:0043169","GO:0043169","cation binding","5/42","460/8078",0.0883500987939323,0.324099730021748,0.298650917972689,"Pp3c10_23130V3/Pp3c15_24170V3/Pp3c23_6510V3/Pp3c23_6600V3/Pp3c24_10800V3",5
"GO:0006839","GO:0006839","mitochondrial transport","2/42","96/8078",0.0886192180162576,0.324099730021748,0.298650917972689,"Pp3c27_2550V3/Pp3c9_5610V3",2
"GO:0006739","GO:0006739","NADP metabolic process","1/42","18/8078",0.0896542424196756,0.324099730021748,0.298650917972689,"Pp3c20_10460V3",1
"GO:0009694","GO:0009694","jasmonic acid metabolic process","1/42","18/8078",0.0896542424196756,0.324099730021748,0.298650917972689,"Pp3c12_14480V3",1
"GO:0009695","GO:0009695","jasmonic acid biosynthetic process","1/42","18/8078",0.0896542424196756,0.324099730021748,0.298650917972689,"Pp3c12_14480V3",1
"GO:0009901","GO:0009901","anther dehiscence","1/42","18/8078",0.0896542424196756,0.324099730021748,0.298650917972689,"Pp3c12_14480V3",1
"GO:0010193","GO:0010193","response to ozone","1/42","18/8078",0.0896542424196756,0.324099730021748,0.298650917972689,"Pp3c12_14480V3",1
"GO:0015081","GO:0015081","sodium ion transmembrane transporter activity","1/42","18/8078",0.0896542424196756,0.324099730021748,0.298650917972689,"Pp3c22_9570V3",1
"GO:0030170","GO:0030170","pyridoxal phosphate binding","1/42","18/8078",0.0896542424196756,0.324099730021748,0.298650917972689,"Pp3c6_24700V3",1
"GO:0030246","GO:0030246","carbohydrate binding","1/42","18/8078",0.0896542424196756,0.324099730021748,0.298650917972689,"Pp3c16_260V3",1
"GO:0033612","GO:0033612","receptor serine/threonine kinase binding","1/42","18/8078",0.0896542424196756,0.324099730021748,0.298650917972689,"Pp3c18_14130V3",1
"GO:0035725","GO:0035725","sodium ion transmembrane transport","1/42","18/8078",0.0896542424196756,0.324099730021748,0.298650917972689,"Pp3c22_9570V3",1
"GO:0061134","GO:0061134","peptidase regulator activity","1/42","18/8078",0.0896542424196756,0.324099730021748,0.298650917972689,"Pp3c15_24170V3",1
"GO:0070279","GO:0070279","vitamin B6 binding","1/42","18/8078",0.0896542424196756,0.324099730021748,0.298650917972689,"Pp3c6_24700V3",1
"GO:0046914","GO:0046914","transition metal ion binding","4/42","329/8078",0.0901707134959117,0.324099730021748,0.298650917972689,"Pp3c15_24170V3/Pp3c23_6510V3/Pp3c23_6600V3/Pp3c24_10800V3",4
"GO:0001817","GO:0001817","regulation of cytokine production","1/42","19/8078",0.0943979796179849,0.324099730021748,0.298650917972689,"Pp3c17_19720V3",1
"GO:0006814","GO:0006814","sodium ion transport","1/42","19/8078",0.0943979796179849,0.324099730021748,0.298650917972689,"Pp3c22_9570V3",1
"GO:0019674","GO:0019674","NAD metabolic process","1/42","19/8078",0.0943979796179849,0.324099730021748,0.298650917972689,"Pp3c2_2120V3",1
"GO:0032204","GO:0032204","regulation of telomere maintenance","1/42","19/8078",0.0943979796179849,0.324099730021748,0.298650917972689,"Pp3c17_19720V3",1
"GO:0042558","GO:0042558","pteridine-containing compound metabolic process","1/42","19/8078",0.0943979796179849,0.324099730021748,0.298650917972689,"Pp3c17_12060V3",1
"GO:0042826","GO:0042826","histone deacetylase binding","1/42","19/8078",0.0943979796179849,0.324099730021748,0.298650917972689,"Pp3c17_19720V3",1
"GO:0051046","GO:0051046","regulation of secretion","1/42","19/8078",0.0943979796179849,0.324099730021748,0.298650917972689,"Pp3c17_19720V3",1
"GO:0072350","GO:0072350","tricarboxylic acid metabolic process","1/42","19/8078",0.0943979796179849,0.324099730021748,0.298650917972689,"Pp3c2_2120V3",1
"GO:1903530","GO:1903530","regulation of secretion by cell","1/42","19/8078",0.0943979796179849,0.324099730021748,0.298650917972689,"Pp3c17_19720V3",1
"GO:0000097","GO:0000097","sulfur amino acid biosynthetic process","1/42","20/8078",0.0991175831489495,0.329626359312201,0.303743587783854,"Pp3c14_1450V3",1
"GO:0009067","GO:0009067","aspartate family amino acid biosynthetic process","1/42","20/8078",0.0991175831489495,0.329626359312201,0.303743587783854,"Pp3c14_1450V3",1
"GO:0045488","GO:0045488","pectin metabolic process","1/42","20/8078",0.0991175831489495,0.329626359312201,0.303743587783854,"Pp3c17_15940V3",1
"GO:0046351","GO:0046351","disaccharide biosynthetic process","1/42","20/8078",0.0991175831489495,0.329626359312201,0.303743587783854,"Pp3c10_23130V3",1
"GO:0060966","GO:0060966","regulation of gene silencing by RNA","1/42","20/8078",0.0991175831489495,0.329626359312201,0.303743587783854,"Pp3c24_17430V3",1
"GO:0042803","GO:0042803","protein homodimerization activity","3/42","214/8078",0.0992079333852255,0.329626359312201,0.303743587783854,"Pp3c23_6510V3/Pp3c23_6600V3/Pp3c24_10800V3",3
"GO:0001676","GO:0001676","long-chain fatty acid metabolic process","1/42","21/8078",0.103813172812358,0.34125819573424,0.314462074420412,"Pp3c15_5610V3",1
"GO:0052548","GO:0052548","regulation of endopeptidase activity","1/42","21/8078",0.103813172812358,0.34125819573424,0.314462074420412,"Pp3c15_24170V3",1
"GO:0006625","GO:0006625","protein targeting to peroxisome","1/42","22/8078",0.108484867828106,0.3420594301927,0.315200394710017,"Pp3c10_9020V3",1
"GO:0019747","GO:0019747","regulation of isoprenoid metabolic process","1/42","22/8078",0.108484867828106,0.3420594301927,0.315200394710017,"Pp3c18_14130V3",1
"GO:0051117","GO:0051117","ATPase binding","1/42","22/8078",0.108484867828106,0.3420594301927,0.315200394710017,"Pp3c24_4810V3",1
"GO:0055081","GO:0055081","anion homeostasis","1/42","22/8078",0.108484867828106,0.3420594301927,0.315200394710017,"Pp3c2_25720V3",1
"GO:0060688","GO:0060688","regulation of morphogenesis of a branching structure","1/42","22/8078",0.108484867828106,0.3420594301927,0.315200394710017,"Pp3c10_23130V3",1
"GO:0072662","GO:0072662","protein localization to peroxisome","1/42","22/8078",0.108484867828106,0.3420594301927,0.315200394710017,"Pp3c10_9020V3",1
"GO:0072663","GO:0072663","establishment of protein localization to peroxisome","1/42","22/8078",0.108484867828106,0.3420594301927,0.315200394710017,"Pp3c10_9020V3",1
"GO:2000032","GO:2000032","regulation of secondary shoot formation","1/42","22/8078",0.108484867828106,0.3420594301927,0.315200394710017,"Pp3c10_23130V3",1
"GO:0097367","GO:0097367","carbohydrate derivative binding","3/42","226/8078",0.112142177534251,0.34441409983478,0.317370172050104,"Pp3c16_260V3/Pp3c7_11570V3/Pp3c7_19020V3",3
"GO:0019200","GO:0019200","carbohydrate kinase activity","1/42","23/8078",0.113132786838932,0.34441409983478,0.317370172050104,"Pp3c6_8620V3",1
"GO:0019682","GO:0019682","glyceraldehyde-3-phosphate metabolic process","1/42","23/8078",0.113132786838932,0.34441409983478,0.317370172050104,"Pp3c20_10460V3",1
"GO:0019842","GO:0019842","vitamin binding","1/42","23/8078",0.113132786838932,0.34441409983478,0.317370172050104,"Pp3c6_24700V3",1
"GO:0043574","GO:0043574","peroxisomal transport","1/42","23/8078",0.113132786838932,0.34441409983478,0.317370172050104,"Pp3c10_9020V3",1
"GO:0045861","GO:0045861","negative regulation of proteolysis","1/42","23/8078",0.113132786838932,0.34441409983478,0.317370172050104,"Pp3c15_24170V3",1
"GO:0060147","GO:0060147","regulation of post-transcriptional gene silencing","1/42","23/8078",0.113132786838932,0.34441409983478,0.317370172050104,"Pp3c24_17430V3",1
"GO:0008378","GO:0008378","galactosyltransferase activity","1/42","24/8078",0.117757047913143,0.351564519856629,0.323959130033105,"Pp3c17_15940V3",1
"GO:0033559","GO:0033559","unsaturated fatty acid metabolic process","1/42","24/8078",0.117757047913143,0.351564519856629,0.323959130033105,"Pp3c15_5610V3",1
"GO:0046283","GO:0046283","anthocyanin-containing compound metabolic process","1/42","24/8078",0.117757047913143,0.351564519856629,0.323959130033105,"Pp3c3_14060V3",1
"GO:0052547","GO:0052547","regulation of peptidase activity","1/42","24/8078",0.117757047913143,0.351564519856629,0.323959130033105,"Pp3c15_24170V3",1
"GO:0055065","GO:0055065","metal ion homeostasis","2/42","115/8078",0.119897904109135,0.35623511893964,0.328262986452641,"Pp3c13_21490V3/Pp3c9_5610V3",2
"GO:0010393","GO:0010393","galacturonan metabolic process","1/42","25/8078",0.122357768547318,0.360081433153537,0.331807282125811,"Pp3c17_15940V3",1
"GO:0031330","GO:0031330","negative regulation of cellular catabolic process","1/42","25/8078",0.122357768547318,0.360081433153537,0.331807282125811,"Pp3c17_19720V3",1
"GO:0046983","GO:0046983","protein dimerization activity","3/42","236/8078",0.123397618230733,0.361420512163947,0.333041214581324,"Pp3c23_6510V3/Pp3c23_6600V3/Pp3c24_10800V3",3
"GO:0009900","GO:0009900","dehiscence","1/42","26/8078",0.126935065669013,0.364864514341629,0.336214788381573,"Pp3c12_14480V3",1
"GO:0016799","GO:0016799","hydrolase activity, hydrolyzing N-glycosyl compounds","1/42","26/8078",0.126935065669013,0.364864514341629,0.336214788381573,"Pp3c14_1450V3",1
"GO:1900618","GO:1900618","regulation of shoot system morphogenesis","1/42","26/8078",0.126935065669013,0.364864514341629,0.336214788381573,"Pp3c10_23130V3",1
"GO:1905428","GO:1905428","regulation of plant organ formation","1/42","26/8078",0.126935065669013,0.364864514341629,0.336214788381573,"Pp3c10_23130V3",1
"GO:0006986","GO:0006986","response to unfolded protein","1/42","27/8078",0.131489055639444,0.36936471084171,0.340361622492531,"Pp3c3_14060V3",1
"GO:0009312","GO:0009312","oligosaccharide biosynthetic process","1/42","27/8078",0.131489055639444,0.36936471084171,0.340361622492531,"Pp3c10_23130V3",1
"GO:0010020","GO:0010020","chloroplast fission","1/42","27/8078",0.131489055639444,0.36936471084171,0.340361622492531,"Pp3c7_11570V3",1
"GO:0043572","GO:0043572","plastid fission","1/42","27/8078",0.131489055639444,0.36936471084171,0.340361622492531,"Pp3c7_11570V3",1
"GO:0046835","GO:0046835","carbohydrate phosphorylation","1/42","27/8078",0.131489055639444,0.36936471084171,0.340361622492531,"Pp3c6_8620V3",1
"GO:0009895","GO:0009895","negative regulation of catabolic process","1/42","28/8078",0.136019854256154,0.371948097036741,0.342742157208102,"Pp3c17_19720V3",1
"GO:0030641","GO:0030641","regulation of cellular pH","1/42","28/8078",0.136019854256154,0.371948097036741,0.342742157208102,"Pp3c22_9570V3",1
"GO:0046890","GO:0046890","regulation of lipid biosynthetic process","1/42","28/8078",0.136019854256154,0.371948097036741,0.342742157208102,"Pp3c18_14130V3",1
"GO:0051213","GO:0051213","dioxygenase activity","1/42","28/8078",0.136019854256154,0.371948097036741,0.342742157208102,"Pp3c12_14480V3",1
"GO:0051453","GO:0051453","regulation of intracellular pH","1/42","28/8078",0.136019854256154,0.371948097036741,0.342742157208102,"Pp3c22_9570V3",1
"GO:0055072","GO:0055072","iron ion homeostasis","1/42","28/8078",0.136019854256154,0.371948097036741,0.342742157208102,"Pp3c9_5610V3",1
"GO:0031329","GO:0031329","regulation of cellular catabolic process","2/42","125/8078",0.137329098923457,0.373873934514081,0.34451677494825,"Pp3c17_19720V3/Pp3c18_14130V3",2
"GO:0015079","GO:0015079","potassium ion transmembrane transporter activity","1/42","29/8078",0.140527576755688,0.380903694890416,0.350994547667715,"Pp3c22_9570V3",1
"GO:0004791","GO:0004791","thioredoxin-disulfide reductase activity","1/42","30/8078",0.145012337816225,0.384624999014708,0.354423649236854,"Pp3c10_18810V3",1
"GO:0006555","GO:0006555","methionine metabolic process","1/42","30/8078",0.145012337816225,0.384624999014708,0.354423649236854,"Pp3c14_1450V3",1
"GO:0006885","GO:0006885","regulation of pH","1/42","30/8078",0.145012337816225,0.384624999014708,0.354423649236854,"Pp3c22_9570V3",1
"GO:0010380","GO:0010380","regulation of chlorophyll biosynthetic process","1/42","30/8078",0.145012337816225,0.384624999014708,0.354423649236854,"Pp3c18_14130V3",1
"GO:0043487","GO:0043487","regulation of RNA stability","1/42","30/8078",0.145012337816225,0.384624999014708,0.354423649236854,"Pp3c17_19720V3",1
"GO:0006091","GO:0006091","generation of precursor metabolites and energy","3/42","256/8078",0.147092361054995,0.38675072857791,0.356382463227132,"Pp3c2_2120V3/Pp3c20_17800V3/Pp3c6_24700V3",3
"GO:0002218","GO:0002218","activation of innate immune response","1/42","31/8078",0.149474251560225,0.38675072857791,0.356382463227132,"Pp3c3_14060V3",1
"GO:0006487","GO:0006487","protein N-linked glycosylation","1/42","31/8078",0.149474251560225,0.38675072857791,0.356382463227132,"Pp3c3_14060V3",1
"GO:0015035","GO:0015035","protein-disulfide reductase activity","1/42","31/8078",0.149474251560225,0.38675072857791,0.356382463227132,"Pp3c10_18810V3",1
"GO:2001252","GO:2001252","positive regulation of chromosome organization","1/42","31/8078",0.149474251560225,0.38675072857791,0.356382463227132,"Pp3c17_19720V3",1
"GO:0005839","GO:0005839","proteasome core complex","1/42","32/8078",0.153913431557053,0.38675072857791,0.356382463227132,"Pp3c7_21050V3",1
"GO:0016485","GO:0016485","protein processing","1/42","32/8078",0.153913431557053,0.38675072857791,0.356382463227132,"Pp3c10_9020V3",1
"GO:0030004","GO:0030004","cellular monovalent inorganic cation homeostasis","1/42","32/8078",0.153913431557053,0.38675072857791,0.356382463227132,"Pp3c22_9570V3",1
"GO:0043455","GO:0043455","regulation of secondary metabolic process","1/42","32/8078",0.153913431557053,0.38675072857791,0.356382463227132,"Pp3c18_14130V3",1
"GO:0051222","GO:0051222","positive regulation of protein transport","1/42","32/8078",0.153913431557053,0.38675072857791,0.356382463227132,"Pp3c17_19720V3",1
"GO:1901463","GO:1901463","regulation of tetrapyrrole biosynthetic process","1/42","32/8078",0.153913431557053,0.38675072857791,0.356382463227132,"Pp3c18_14130V3",1
"GO:0002253","GO:0002253","activation of immune response","1/42","33/8078",0.158329990825584,0.38675072857791,0.356382463227132,"Pp3c3_14060V3",1
"GO:0003333","GO:0003333","amino acid transmembrane transport","1/42","33/8078",0.158329990825584,0.38675072857791,0.356382463227132,"Pp3c27_2550V3",1
"GO:0006865","GO:0006865","amino acid transport","1/42","33/8078",0.158329990825584,0.38675072857791,0.356382463227132,"Pp3c27_2550V3",1
"GO:0015171","GO:0015171","amino acid transmembrane transporter activity","1/42","33/8078",0.158329990825584,0.38675072857791,0.356382463227132,"Pp3c27_2550V3",1
"GO:0035251","GO:0035251","UDP-glucosyltransferase activity","1/42","33/8078",0.158329990825584,0.38675072857791,0.356382463227132,"Pp3c3_14060V3",1
"GO:0035966","GO:0035966","response to topologically incorrect protein","1/42","33/8078",0.158329990825584,0.38675072857791,0.356382463227132,"Pp3c3_14060V3",1
"GO:0050897","GO:0050897","cobalt ion binding","1/42","33/8078",0.158329990825584,0.38675072857791,0.356382463227132,"Pp3c15_24170V3",1
"GO:0051087","GO:0051087","chaperone binding","1/42","33/8078",0.158329990825584,0.38675072857791,0.356382463227132,"Pp3c24_4810V3",1
"GO:0090056","GO:0090056","regulation of chlorophyll metabolic process","1/42","33/8078",0.158329990825584,0.38675072857791,0.356382463227132,"Pp3c18_14130V3",1
"GO:0006974","GO:0006974","cellular response to DNA damage stimulus","3/42","266/8078",0.159475102517529,0.388014225810365,0.357546748702789,"Pp3c23_6510V3/Pp3c23_6600V3/Pp3c24_10800V3",3
"GO:0009894","GO:0009894","regulation of catabolic process","2/42","139/8078",0.162602017057568,0.389780844399805,0.359174649668361,"Pp3c17_19720V3/Pp3c18_14130V3",2
"GO:0006458","GO:0006458","'de novo' protein folding","1/42","34/8078",0.162724041836812,0.389780844399805,0.359174649668361,"Pp3c3_14060V3",1
"GO:0048653","GO:0048653","anther development","1/42","34/8078",0.162724041836812,0.389780844399805,0.359174649668361,"Pp3c12_14480V3",1
"GO:1904951","GO:1904951","positive regulation of establishment of protein localization","1/42","34/8078",0.162724041836812,0.389780844399805,0.359174649668361,"Pp3c17_19720V3",1
"GO:0006813","GO:0006813","potassium ion transport","1/42","35/8078",0.167095696516431,0.392643119570929,0.361812174566296,"Pp3c22_9570V3",1
"GO:0009060","GO:0009060","aerobic respiration","1/42","35/8078",0.167095696516431,0.392643119570929,0.361812174566296,"Pp3c2_2120V3",1
"GO:0034440","GO:0034440","lipid oxidation","1/42","35/8078",0.167095696516431,0.392643119570929,0.361812174566296,"Pp3c12_14480V3",1
"GO:0051054","GO:0051054","positive regulation of DNA metabolic process","1/42","35/8078",0.167095696516431,0.392643119570929,0.361812174566296,"Pp3c17_19720V3",1
"GO:0071805","GO:0071805","potassium ion transmembrane transport","1/42","35/8078",0.167095696516431,0.392643119570929,0.361812174566296,"Pp3c22_9570V3",1
"GO:0010243","GO:0010243","response to organonitrogen compound","2/42","142/8078",0.168127718972177,0.393571705775777,0.362667846746203,"Pp3c16_8630V3/Pp3c3_14060V3",2
"GO:0007584","GO:0007584","response to nutrient","1/42","36/8078",0.171445066247416,0.398319740379334,0.367043058329449,"Pp3c16_8630V3",1
"GO:0008238","GO:0008238","exopeptidase activity","1/42","36/8078",0.171445066247416,0.398319740379334,0.367043058329449,"Pp3c17_12060V3",1
"GO:0009812","GO:0009812","flavonoid metabolic process","1/42","37/8078",0.175772261872584,0.400838589805376,0.369364123802944,"Pp3c3_14060V3",1
"GO:0016671","GO:0016671","oxidoreductase activity, acting on a sulfur group of donors, disulfide as acceptor","1/42","37/8078",0.175772261872584,0.400838589805376,0.369364123802944,"Pp3c10_18810V3",1
"GO:0051536","GO:0051536","iron-sulfur cluster binding","1/42","37/8078",0.175772261872584,0.400838589805376,0.369364123802944,"Pp3c16_8630V3",1
"GO:0051540","GO:0051540","metal cluster binding","1/42","37/8078",0.175772261872584,0.400838589805376,0.369364123802944,"Pp3c16_8630V3",1
"GO:1901401","GO:1901401","regulation of tetrapyrrole metabolic process","1/42","37/8078",0.175772261872584,0.400838589805376,0.369364123802944,"Pp3c18_14130V3",1
"GO:0000287","GO:0000287","magnesium ion binding","1/42","38/8078",0.180077393697152,0.407647726391355,0.375638596453284,"Pp3c10_23130V3",1
"GO:0051346","GO:0051346","negative regulation of hydrolase activity","1/42","38/8078",0.180077393697152,0.407647726391355,0.375638596453284,"Pp3c15_24170V3",1
"GO:0010565","GO:0010565","regulation of cellular ketone metabolic process","1/42","39/8078",0.184360571491272,0.414308484296749,0.381776341346518,"Pp3c18_14130V3",1
"GO:0036503","GO:0036503","ERAD pathway","1/42","39/8078",0.184360571491272,0.414308484296749,0.381776341346518,"Pp3c3_14060V3",1
"GO:0007031","GO:0007031","peroxisome organization","1/42","40/8078",0.188621904492561,0.419390736273169,0.386459527037616,"Pp3c10_9020V3",1
"GO:0005777","GO:0005777","peroxisome","2/42","153/8078",0.188657968744241,0.419390736273169,0.386459527037616,"Pp3c10_9020V3/Pp3c5_16850V3",2
"GO:0042579","GO:0042579","microbody","2/42","153/8078",0.188657968744241,0.419390736273169,0.386459527037616,"Pp3c10_9020V3/Pp3c5_16850V3",2
"GO:0009057","GO:0009057","macromolecule catabolic process","4/42","437/8078",0.190389645671443,0.421723301164702,0.388608935326356,"Pp3c16_260V3/Pp3c20_17800V3/Pp3c3_14060V3/Pp3c6_24700V3",4
"GO:0000096","GO:0000096","sulfur amino acid metabolic process","1/42","42/8078",0.197079470419553,0.433434564837309,0.399400612462927,"Pp3c14_1450V3",1
"GO:0004857","GO:0004857","enzyme inhibitor activity","1/42","42/8078",0.197079470419553,0.433434564837309,0.399400612462927,"Pp3c15_24170V3",1
"GO:0000977","GO:0000977","RNA polymerase II transcription regulatory region sequence-specific DNA binding","1/42","43/8078",0.201275919180427,0.437987739625014,0.403596264924429,"Pp3c17_19720V3",1
"GO:0003697","GO:0003697","single-stranded DNA binding","1/42","43/8078",0.201275919180427,0.437987739625014,0.403596264924429,"Pp3c17_19720V3",1
"GO:0055067","GO:0055067","monovalent inorganic cation homeostasis","1/42","43/8078",0.201275919180427,0.437987739625014,0.403596264924429,"Pp3c22_9570V3",1
"GO:0051082","GO:0051082","unfolded protein binding","1/42","44/8078",0.205450954823789,0.445504175723164,0.410522498835346,"Pp3c3_14060V3",1
"GO:0055086","GO:0055086","nucleobase-containing small molecule metabolic process","3/42","302/8078",0.206491721143559,0.446195397436083,0.411159444750333,"Pp3c2_2120V3/Pp3c20_10460V3/Pp3c3_14060V3",3
"GO:0006869","GO:0006869","lipid transport","1/42","45/8078",0.209604683962127,0.447761347263115,0.412602433775072,"Pp3c24_4350V3",1
"GO:0008094","GO:0008094","ATP-dependent activity, acting on DNA","1/42","45/8078",0.209604683962127,0.447761347263115,0.412602433775072,"Pp3c17_19720V3",1
"GO:0009561","GO:0009561","megagametogenesis","1/42","45/8078",0.209604683962127,0.447761347263115,0.412602433775072,"Pp3c7_19020V3",1
"GO:0016791","GO:0016791","phosphatase activity","2/42","165/8078",0.211441258462081,0.447761347263115,0.412602433775072,"Pp3c10_23130V3/Pp3c16_260V3",2
"GO:0072330","GO:0072330","monocarboxylic acid biosynthetic process","2/42","166/8078",0.213354146609411,0.447761347263115,0.412602433775072,"Pp3c12_14480V3/Pp3c15_5610V3",2
"GO:0009066","GO:0009066","aspartate family amino acid metabolic process","1/42","46/8078",0.213737212690322,0.447761347263115,0.412602433775072,"Pp3c14_1450V3",1
"GO:0009225","GO:0009225","nucleotide-sugar metabolic process","1/42","46/8078",0.213737212690322,0.447761347263115,0.412602433775072,"Pp3c3_14060V3",1
"GO:0009853","GO:0009853","photorespiration","1/42","46/8078",0.213737212690322,0.447761347263115,0.412602433775072,"Pp3c27_2550V3",1
"GO:0015297","GO:0015297","antiporter activity","1/42","46/8078",0.213737212690322,0.447761347263115,0.412602433775072,"Pp3c22_9570V3",1
"GO:0016036","GO:0016036","cellular response to phosphate starvation","1/42","47/8078",0.217848646588106,0.452108500743641,0.416608242041066,"Pp3c2_2750V3",1
"GO:0044743","GO:0044743","protein transmembrane import into intracellular organelle","1/42","47/8078",0.217848646588106,0.452108500743641,0.416608242041066,"Pp3c10_9020V3",1
"GO:0016053","GO:0016053","organic acid biosynthetic process","3/42","311/8078",0.218738578838752,0.452108500743641,0.416608242041066,"Pp3c12_14480V3/Pp3c14_1450V3/Pp3c15_5610V3",3
"GO:0046394","GO:0046394","carboxylic acid biosynthetic process","3/42","311/8078",0.218738578838752,0.452108500743641,0.416608242041066,"Pp3c12_14480V3/Pp3c14_1450V3/Pp3c15_5610V3",3
"GO:0006081","GO:0006081","cellular aldehyde metabolic process","1/42","48/8078",0.221939090722498,0.455675608194365,0.419895254697925,"Pp3c20_10460V3",1
"GO:0045333","GO:0045333","cellular respiration","1/42","48/8078",0.221939090722498,0.455675608194365,0.419895254697925,"Pp3c2_2120V3",1
"GO:0046527","GO:0046527","glucosyltransferase activity","1/42","50/8078",0.230057427420146,0.465637679908382,0.429075089133767,"Pp3c3_14060V3",1
"GO:0016311","GO:0016311","dephosphorylation","2/42","176/8078",0.232574366016303,0.465637679908382,0.429075089133767,"Pp3c10_23130V3/Pp3c16_260V3",2
"GO:0010876","GO:0010876","lipid localization","1/42","51/8078",0.234085527575646,0.465637679908382,0.429075089133767,"Pp3c24_4350V3",1
"GO:0045089","GO:0045089","positive regulation of innate immune response","1/42","51/8078",0.234085527575646,0.465637679908382,0.429075089133767,"Pp3c3_14060V3",1
"GO:0048443","GO:0048443","stamen development","1/42","51/8078",0.234085527575646,0.465637679908382,0.429075089133767,"Pp3c12_14480V3",1
"GO:0048466","GO:0048466","androecium development","1/42","51/8078",0.234085527575646,0.465637679908382,0.429075089133767,"Pp3c12_14480V3",1
"GO:0036094","GO:0036094","small molecule binding","3/42","323/8078",0.235309147761843,0.465637679908382,0.429075089133767,"Pp3c6_24700V3/Pp3c7_11570V3/Pp3c7_19020V3",3
"GO:0016462","GO:0016462","pyrophosphatase activity","4/42","479/8078",0.236612089325254,0.465637679908382,0.429075089133767,"Pp3c16_8630V3/Pp3c17_19720V3/Pp3c24_4350V3/Pp3c7_11570V3",4
"GO:0001882","GO:0001882","nucleoside binding","1/42","52/8078",0.238093053157037,0.465637679908382,0.429075089133767,"Pp3c7_11570V3",1
"GO:0001883","GO:0001883","purine nucleoside binding","1/42","52/8078",0.238093053157037,0.465637679908382,0.429075089133767,"Pp3c7_11570V3",1
"GO:0005525","GO:0005525","GTP binding","1/42","52/8078",0.238093053157037,0.465637679908382,0.429075089133767,"Pp3c7_11570V3",1
"GO:0019001","GO:0019001","guanyl nucleotide binding","1/42","52/8078",0.238093053157037,0.465637679908382,0.429075089133767,"Pp3c7_11570V3",1
"GO:0032549","GO:0032549","ribonucleoside binding","1/42","52/8078",0.238093053157037,0.465637679908382,0.429075089133767,"Pp3c7_11570V3",1
"GO:0032550","GO:0032550","purine ribonucleoside binding","1/42","52/8078",0.238093053157037,0.465637679908382,0.429075089133767,"Pp3c7_11570V3",1
"GO:0032561","GO:0032561","guanyl ribonucleotide binding","1/42","52/8078",0.238093053157037,0.465637679908382,0.429075089133767,"Pp3c7_11570V3",1
"GO:0016818","GO:0016818","hydrolase activity, acting on acid anhydrides, in phosphorus-containing anhydrides","4/42","481/8078",0.238884686149758,0.465712101074292,0.429143666634632,"Pp3c16_8630V3/Pp3c17_19720V3/Pp3c24_4350V3/Pp3c7_11570V3",4
"GO:0016817","GO:0016817","hydrolase activity, acting on acid anhydrides","4/42","483/8078",0.241162935216195,0.467813717426301,0.431080260820352,"Pp3c16_8630V3/Pp3c17_19720V3/Pp3c24_4350V3/Pp3c7_11570V3",4
"GO:0019216","GO:0019216","regulation of lipid metabolic process","1/42","53/8078",0.242080106703935,0.467813717426301,0.431080260820352,"Pp3c18_14130V3",1
"GO:0031667","GO:0031667","response to nutrient levels","2/42","181/8078",0.242233640091288,0.467813717426301,0.431080260820352,"Pp3c16_8630V3/Pp3c2_2750V3",2
"GO:0016051","GO:0016051","carbohydrate biosynthetic process","2/42","182/8078",0.244168420149294,0.468621377802061,0.431824502454292,"Pp3c10_23130V3/Pp3c17_15940V3",2
"GO:0035639","GO:0035639","purine ribonucleoside triphosphate binding","2/42","182/8078",0.244168420149294,0.468621377802061,0.431824502454292,"Pp3c7_11570V3/Pp3c7_19020V3",2
"GO:0003924","GO:0003924","GTPase activity","1/42","54/8078",0.246046790257634,0.470764446994483,0.433799294539287,"Pp3c7_11570V3",1
"GO:0006972","GO:0006972","hyperosmotic response","1/42","55/8078",0.249993205363464,0.47537169512191,0.438044774418248,"Pp3c15_24170V3",1
"GO:0015078","GO:0015078","proton transmembrane transporter activity","1/42","55/8078",0.249993205363464,0.47537169512191,0.438044774418248,"Pp3c22_9570V3",1
"GO:0009707","GO:0009707","chloroplast outer membrane","1/42","56/8078",0.25391945307314,0.481356509200002,0.443559651638905,"Pp3c24_4810V3",1
"GO:0010087","GO:0010087","phloem or xylem histogenesis","1/42","57/8078",0.257825633947104,0.481362863390265,0.443565506888321,"Pp3c14_1450V3",1
"GO:0051050","GO:0051050","positive regulation of transport","1/42","57/8078",0.257825633947104,0.481362863390265,0.443565506888321,"Pp3c17_19720V3",1
"GO:0051223","GO:0051223","regulation of protein transport","1/42","57/8078",0.257825633947104,0.481362863390265,0.443565506888321,"Pp3c17_19720V3",1
"GO:0090087","GO:0090087","regulation of peptide transport","1/42","57/8078",0.257825633947104,0.481362863390265,0.443565506888321,"Pp3c17_19720V3",1
"GO:0042578","GO:0042578","phosphoric ester hydrolase activity","2/42","190/8078",0.259671767243476,0.481362863390265,0.443565506888321,"Pp3c10_23130V3/Pp3c16_260V3",2
"GO:0005743","GO:0005743","mitochondrial inner membrane","2/42","191/8078",0.261611963022812,0.481362863390265,0.443565506888321,"Pp3c27_2550V3/Pp3c9_5610V3",2
"GO:0006486","GO:0006486","protein glycosylation","1/42","58/8078",0.261711848056843,0.481362863390265,0.443565506888321,"Pp3c3_14060V3",1
"GO:0016705","GO:0016705","oxidoreductase activity, acting on paired donors, with incorporation or reduction of molecular oxygen","1/42","58/8078",0.261711848056843,0.481362863390265,0.443565506888321,"Pp3c15_5610V3",1
"GO:0043413","GO:0043413","macromolecule glycosylation","1/42","58/8078",0.261711848056843,0.481362863390265,0.443565506888321,"Pp3c3_14060V3",1
"GO:0050778","GO:0050778","positive regulation of immune response","1/42","58/8078",0.261711848056843,0.481362863390265,0.443565506888321,"Pp3c3_14060V3",1
"GO:0051604","GO:0051604","protein maturation","1/42","59/8078",0.265578194987219,0.485583800302075,0.447455009305778,"Pp3c10_9020V3",1
"GO:0070201","GO:0070201","regulation of establishment of protein localization","1/42","59/8078",0.265578194987219,0.485583800302075,0.447455009305778,"Pp3c17_19720V3",1
"GO:0005769","GO:0005769","early endosome","1/42","60/8078",0.269424773838763,0.488283021209254,0.449942283212752,"Pp3c6_8930V3",1
"GO:0006575","GO:0006575","cellular modified amino acid metabolic process","1/42","60/8078",0.269424773838763,0.488283021209254,0.449942283212752,"Pp3c17_12060V3",1
"GO:0043648","GO:0043648","dicarboxylic acid metabolic process","1/42","60/8078",0.269424773838763,0.488283021209254,0.449942283212752,"Pp3c2_2120V3",1
"GO:0009527","GO:0009527","plastid outer membrane","1/42","61/8078",0.27325168322998,0.491682978129008,0.453075270256844,"Pp3c24_4810V3",1
"GO:0016999","GO:0016999","antibiotic metabolic process","1/42","61/8078",0.27325168322998,0.491682978129008,0.453075270256844,"Pp3c2_2120V3",1
"GO:0014070","GO:0014070","response to organic cyclic compound","2/42","198/8078",0.27519927817455,0.491682978129008,0.453075270256844,"Pp3c16_8630V3/Pp3c3_14060V3",2
"GO:0019899","GO:0019899","enzyme binding","3/42","352/8078",0.276237283845077,0.491682978129008,0.453075270256844,"Pp3c15_24170V3/Pp3c17_19720V3/Pp3c24_4810V3",3
"GO:0005615","GO:0005615","extracellular space","1/42","62/8078",0.277059021299624,0.491682978129008,0.453075270256844,"Pp3c17_12060V3",1
"GO:0017076","GO:0017076","purine nucleotide binding","2/42","199/8078",0.277140538482062,0.491682978129008,0.453075270256844,"Pp3c7_11570V3/Pp3c7_19020V3",2
"GO:0032555","GO:0032555","purine ribonucleotide binding","2/42","199/8078",0.277140538482062,0.491682978129008,0.453075270256844,"Pp3c7_11570V3/Pp3c7_19020V3",2
"GO:0005576","GO:0005576","extracellular region","3/42","353/8078",0.277665630043728,0.491682978129008,0.453075270256844,"Pp3c10_23130V3/Pp3c17_12060V3/Pp3c2_2120V3",3
"GO:0002684","GO:0002684","positive regulation of immune system process","1/42","63/8078",0.280846885708983,0.493386456209141,0.454644988603552,"Pp3c3_14060V3",1
"GO:0031349","GO:0031349","positive regulation of defense response","1/42","63/8078",0.280846885708983,0.493386456209141,0.454644988603552,"Pp3c3_14060V3",1
"GO:0009991","GO:0009991","response to extracellular stimulus","2/42","201/8078",0.28102270644922,0.493386456209141,0.454644988603552,"Pp3c16_8630V3/Pp3c2_2750V3",2
"GO:0062012","GO:0062012","regulation of small molecule metabolic process","1/42","64/8078",0.284615373644132,0.498278472838735,0.459152876521471,"Pp3c18_14130V3",1
"GO:0010501","GO:0010501","RNA secondary structure unwinding","1/42","65/8078",0.288364581818195,0.503416134360579,0.46388712091479,"Pp3c17_19720V3",1
"GO:0016021","GO:0016021","integral component of membrane","3/42","364/8078",0.293430845166396,0.508487493121234,0.468560268742272,"Pp3c27_2550V3/Pp3c6_8930V3/Pp3c9_5610V3",3
"GO:0032553","GO:0032553","ribonucleotide binding","2/42","208/8078",0.294601417609003,0.508487493121234,0.468560268742272,"Pp3c7_11570V3/Pp3c7_19020V3",2
"GO:0042446","GO:0042446","hormone biosynthetic process","1/42","67/8078",0.295805543384233,0.508487493121234,0.468560268742272,"Pp3c12_14480V3",1
"GO:0004888","GO:0004888","transmembrane signaling receptor activity","1/42","68/8078",0.299497487857814,0.508487493121234,0.468560268742272,"Pp3c24_4810V3",1
"GO:0005102","GO:0005102","signaling receptor binding","1/42","68/8078",0.299497487857814,0.508487493121234,0.468560268742272,"Pp3c18_14130V3",1
"GO:0005342","GO:0005342","organic acid transmembrane transporter activity","1/42","68/8078",0.299497487857814,0.508487493121234,0.468560268742272,"Pp3c27_2550V3",1
"GO:0032880","GO:0032880","regulation of protein localization","1/42","68/8078",0.299497487857814,0.508487493121234,0.468560268742272,"Pp3c17_19720V3",1
"GO:0046943","GO:0046943","carboxylic acid transmembrane transporter activity","1/42","68/8078",0.299497487857814,0.508487493121234,0.468560268742272,"Pp3c27_2550V3",1
"GO:1903825","GO:1903825","organic acid transmembrane transport","1/42","68/8078",0.299497487857814,0.508487493121234,0.468560268742272,"Pp3c27_2550V3",1
"GO:1905039","GO:1905039","carboxylic acid transmembrane transport","1/42","68/8078",0.299497487857814,0.508487493121234,0.468560268742272,"Pp3c27_2550V3",1
"GO:0009751","GO:0009751","response to salicylic acid","1/42","69/8078",0.30317053473796,0.513313398542629,0.473007236606306,"Pp3c3_14060V3",1
"GO:0006633","GO:0006633","fatty acid biosynthetic process","1/42","70/8078",0.306824778406459,0.5152655246065,0.474806078712513,"Pp3c15_5610V3",1
"GO:0034976","GO:0034976","response to endoplasmic reticulum stress","1/42","70/8078",0.306824778406459,0.5152655246065,0.474806078712513,"Pp3c3_14060V3",1
"GO:0042542","GO:0042542","response to hydrogen peroxide","1/42","70/8078",0.306824778406459,0.5152655246065,0.474806078712513,"Pp3c22_9570V3",1
"GO:0030176","GO:0030176","integral component of endoplasmic reticulum membrane","1/42","71/8078",0.310460312785447,0.51855263054434,0.477835076008326,"Pp3c6_8930V3",1
"GO:0030258","GO:0030258","lipid modification","1/42","71/8078",0.310460312785447,0.51855263054434,0.477835076008326,"Pp3c12_14480V3",1
"GO:0012501","GO:0012501","programmed cell death","1/42","72/8078",0.314077231339588,0.520972156964683,0.48006461747214,"Pp3c3_14060V3",1
"GO:0009414","GO:0009414","response to water deprivation","2/42","219/8078",0.315880644054996,0.520972156964683,0.48006461747214,"Pp3c15_24170V3/Pp3c6_24700V3",2
"GO:0009101","GO:0009101","glycoprotein biosynthetic process","1/42","73/8078",0.317675627078251,0.520972156964683,0.48006461747214,"Pp3c3_14060V3",1
"GO:0043086","GO:0043086","negative regulation of catalytic activity","1/42","73/8078",0.317675627078251,0.520972156964683,0.48006461747214,"Pp3c15_24170V3",1
"GO:0043621","GO:0043621","protein self-association","1/42","73/8078",0.317675627078251,0.520972156964683,0.48006461747214,"Pp3c7_11570V3",1
"GO:0009117","GO:0009117","nucleotide metabolic process","2/42","220/8078",0.317809875688812,0.520972156964683,0.48006461747214,"Pp3c2_2120V3/Pp3c20_10460V3",2
"GO:0031966","GO:0031966","mitochondrial membrane","2/42","220/8078",0.317809875688812,0.520972156964683,0.48006461747214,"Pp3c27_2550V3/Pp3c9_5610V3",2
"GO:0031227","GO:0031227","intrinsic component of endoplasmic reticulum membrane","1/42","74/8078",0.321255592557665,0.521162664610377,0.480240166162858,"Pp3c6_8930V3",1
"GO:0006753","GO:0006753","nucleoside phosphate metabolic process","2/42","222/8078",0.321665130352054,0.521162664610377,0.480240166162858,"Pp3c2_2120V3/Pp3c20_10460V3",2
"GO:0009415","GO:0009415","response to water","2/42","222/8078",0.321665130352054,0.521162664610377,0.480240166162858,"Pp3c15_24170V3/Pp3c6_24700V3",2
"GO:0000976","GO:0000976","transcription cis-regulatory region binding","1/42","75/8078",0.324817219883075,0.521162664610377,0.480240166162858,"Pp3c17_19720V3",1
"GO:0010150","GO:0010150","leaf senescence","1/42","75/8078",0.324817219883075,0.521162664610377,0.480240166162858,"Pp3c18_14130V3",1
"GO:0015849","GO:0015849","organic acid transport","1/42","75/8078",0.324817219883075,0.521162664610377,0.480240166162858,"Pp3c27_2550V3",1
"GO:0046942","GO:0046942","carboxylic acid transport","1/42","75/8078",0.324817219883075,0.521162664610377,0.480240166162858,"Pp3c27_2550V3",1
"GO:2000377","GO:2000377","regulation of reactive oxygen species metabolic process","1/42","75/8078",0.324817219883075,0.521162664610377,0.480240166162858,"Pp3c22_9570V3",1
"GO:0009555","GO:0009555","pollen development","2/42","224/8078",0.32551583906085,0.521162664610377,0.480240166162858,"Pp3c12_14480V3/Pp3c7_19020V3",2
"GO:0031324","GO:0031324","negative regulation of cellular metabolic process","3/42","388/8078",0.328054380787617,0.523007348554956,0.481940002671149,"Pp3c15_24170V3/Pp3c17_19720V3/Pp3c18_14130V3",3
"GO:0010638","GO:0010638","positive regulation of organelle organization","1/42","76/8078",0.328360600710879,0.523007348554956,0.481940002671149,"Pp3c17_19720V3",1
"GO:0070085","GO:0070085","glycosylation","1/42","77/8078",0.331885826250761,0.52726334350378,0.485861810314333,"Pp3c3_14060V3",1
"GO:1901698","GO:1901698","response to nitrogen compound","2/42","229/8078",0.335120668762647,0.530109632049902,0.488484603881786,"Pp3c16_8630V3/Pp3c3_14060V3",2
"GO:0090693","GO:0090693","plant organ senescence","1/42","78/8078",0.335392987267818,0.530109632049902,0.488484603881786,"Pp3c18_14130V3",1
"GO:0032101","GO:0032101","regulation of response to external stimulus","1/42","79/8078",0.338882174084662,0.532933119719449,0.491086386932758,"Pp3c2_2750V3",1
"GO:0031224","GO:0031224","intrinsic component of membrane","3/42","397/8078",0.341071701270948,0.532933119719449,0.491086386932758,"Pp3c27_2550V3/Pp3c6_8930V3/Pp3c9_5610V3",3
"GO:0000502","GO:0000502","proteasome complex","1/42","80/8078",0.34235347658353,0.532933119719449,0.491086386932758,"Pp3c7_21050V3",1
"GO:0015291","GO:0015291","secondary active transmembrane transporter activity","1/42","80/8078",0.34235347658353,0.532933119719449,0.491086386932758,"Pp3c22_9570V3",1
"GO:0048527","GO:0048527","lateral root development","1/42","80/8078",0.34235347658353,0.532933119719449,0.491086386932758,"Pp3c10_9020V3",1
"GO:1905369","GO:1905369","endopeptidase complex","1/42","80/8078",0.34235347658353,0.532933119719449,0.491086386932758,"Pp3c7_21050V3",1
"GO:0009705","GO:0009705","plant-type vacuole membrane","1/42","81/8078",0.345806984208373,0.536956573469282,0.494793912871541,"Pp3c2_25720V3",1
"GO:0009100","GO:0009100","glycoprotein metabolic process","1/42","82/8078",0.349242785966938,0.540932435407438,0.498457583981305,"Pp3c3_14060V3",1
"GO:0065002","GO:0065002","intracellular protein transmembrane transport","1/42","83/8078",0.352660970432845,0.543502443210718,0.500825790797136,"Pp3c10_9020V3",1
"GO:0098657","GO:0098657","import into cell","1/42","83/8078",0.352660970432845,0.543502443210718,0.500825790797136,"Pp3c22_9570V3",1
"GO:0038023","GO:0038023","signaling receptor activity","1/42","85/8078",0.359444839622875,0.552579380315763,0.509189992762439,"Pp3c24_4810V3",1
"GO:0005740","GO:0005740","mitochondrial envelope","2/42","243/8078",0.361813201932261,0.554840096263368,0.511273193797449,"Pp3c27_2550V3/Pp3c9_5610V3",2
"GO:0080135","GO:0080135","regulation of cellular response to stress","1/42","86/8078",0.362810699342109,0.554989555244125,0.511410917027886,"Pp3c2_2750V3",1
"GO:0048584","GO:0048584","positive regulation of response to stimulus","2/42","244/8078",0.363706747368723,0.554989555244125,0.511410917027886,"Pp3c2_2750V3/Pp3c3_14060V3",2
"GO:0008186","GO:0008186","ATP-dependent activity, acting on RNA","1/42","87/8078",0.366159291762984,0.555986344740846,0.512329437071704,"Pp3c17_19720V3",1
"GO:0045088","GO:0045088","regulation of innate immune response","1/42","87/8078",0.366159291762984,0.555986344740846,0.512329437071704,"Pp3c3_14060V3",1
"GO:0043168","GO:0043168","anion binding","3/42","415/8078",0.367078645623917,0.556016183812697,0.512356933133486,"Pp3c6_24700V3/Pp3c7_11570V3/Pp3c7_19020V3",3
"GO:0003724","GO:0003724","RNA helicase activity","1/42","88/8078",0.369490703319229,0.556939645490936,0.513207883172537,"Pp3c17_19720V3",1
"GO:0071806","GO:0071806","protein transmembrane transport","1/42","88/8078",0.369490703319229,0.556939645490936,0.513207883172537,"Pp3c10_9020V3",1
"GO:0008219","GO:0008219","cell death","1/42","90/8078",0.376102327465297,0.563602200210249,0.519347283791082,"Pp3c3_14060V3",1
"GO:0042445","GO:0042445","hormone metabolic process","1/42","90/8078",0.376102327465297,0.563602200210249,0.519347283791082,"Pp3c12_14480V3",1
"GO:0030162","GO:0030162","regulation of proteolysis","1/42","91/8078",0.379382710821138,0.563602200210249,0.519347283791082,"Pp3c15_24170V3",1
"GO:0031968","GO:0031968","organelle outer membrane","1/42","91/8078",0.379382710821138,0.563602200210249,0.519347283791082,"Pp3c24_4810V3",1
"GO:0034599","GO:0034599","cellular response to oxidative stress","1/42","91/8078",0.379382710821138,0.563602200210249,0.519347283791082,"Pp3c10_18810V3",1
"GO:1905368","GO:1905368","peptidase complex","1/42","91/8078",0.379382710821138,0.563602200210249,0.519347283791082,"Pp3c7_21050V3",1
"GO:0019867","GO:0019867","outer membrane","1/42","92/8078",0.382646254848371,0.56438039497922,0.52006437350325,"Pp3c24_4810V3",1
"GO:0044092","GO:0044092","negative regulation of molecular function","1/42","92/8078",0.382646254848371,0.56438039497922,0.52006437350325,"Pp3c15_24170V3",1
"GO:0048528","GO:0048528","post-embryonic root development","1/42","92/8078",0.382646254848371,0.56438039497922,0.52006437350325,"Pp3c10_9020V3",1
"GO:0008194","GO:0008194","UDP-glycosyltransferase activity","1/42","94/8078",0.389123161882046,0.572566938197868,0.527608096687186,"Pp3c3_14060V3",1
"GO:0030003","GO:0030003","cellular cation homeostasis","1/42","95/8078",0.392336692343087,0.573201124983518,0.528192486145602,"Pp3c22_9570V3",1
"GO:1901607","GO:1901607","alpha-amino acid biosynthetic process","1/42","95/8078",0.392336692343087,0.573201124983518,0.528192486145602,"Pp3c14_1450V3",1
"GO:1990837","GO:1990837","sequence-specific double-stranded DNA binding","1/42","95/8078",0.392336692343087,0.573201124983518,0.528192486145602,"Pp3c17_19720V3",1
"GO:0000271","GO:0000271","polysaccharide biosynthetic process","1/42","96/8078",0.395533718388633,0.5765090518023,0.531240669434584,"Pp3c17_15940V3",1
"GO:0019866","GO:0019866","organelle inner membrane","2/42","262/8078",0.397434246966979,0.577061947178444,0.531750150610694,"Pp3c27_2550V3/Pp3c9_5610V3",2
"GO:0007568","GO:0007568","aging","1/42","97/8078",0.398714322726854,0.577061947178444,0.531750150610694,"Pp3c18_14130V3",1
"GO:0016798","GO:0016798","hydrolase activity, acting on glycosyl bonds","1/42","97/8078",0.398714322726854,0.577061947178444,0.531750150610694,"Pp3c14_1450V3",1
"GO:0042440","GO:0042440","pigment metabolic process","1/42","98/8078",0.401878587661758,0.58028263358637,0.534717943740805,"Pp3c3_14060V3",1
"GO:0032787","GO:0032787","monocarboxylic acid metabolic process","2/42","266/8078",0.404828164511096,0.580757391574901,0.535155422997823,"Pp3c12_14480V3/Pp3c15_5610V3",2
"GO:0006457","GO:0006457","protein folding","1/42","99/8078",0.405026595095117,0.580757391574901,0.535155422997823,"Pp3c3_14060V3",1
"GO:0006873","GO:0006873","cellular ion homeostasis","1/42","99/8078",0.405026595095117,0.580757391574901,0.535155422997823,"Pp3c22_9570V3",1
"GO:0008514","GO:0008514","organic anion transmembrane transporter activity","1/42","100/8078",0.40815842652838,0.583297305485176,0.53749589893967,"Pp3c27_2550V3",1
"GO:0000166","GO:0000166","nucleotide binding","2/42","269/8078",0.410347228955589,0.583297305485176,0.53749589893967,"Pp3c7_11570V3/Pp3c7_19020V3",2
"GO:1901265","GO:1901265","nucleoside phosphate binding","2/42","269/8078",0.410347228955589,0.583297305485176,0.53749589893967,"Pp3c7_11570V3/Pp3c7_19020V3",2
"GO:0060089","GO:0060089","molecular transducer activity","1/42","101/8078",0.411274163064581,0.583297305485176,0.53749589893967,"Pp3c24_4810V3",1
"GO:0017111","GO:0017111","nucleoside-triphosphatase activity","3/42","446/8078",0.411517192866564,0.583297305485176,0.53749589893967,"Pp3c17_19720V3/Pp3c24_4350V3/Pp3c7_11570V3",3
"GO:0004386","GO:0004386","helicase activity","1/42","103/8078",0.417457673877233,0.587673900811229,0.541528837231945,"Pp3c17_19720V3",1
"GO:0050776","GO:0050776","regulation of immune response","1/42","103/8078",0.417457673877233,0.587673900811229,0.541528837231945,"Pp3c3_14060V3",1
"GO:0051336","GO:0051336","regulation of hydrolase activity","1/42","103/8078",0.417457673877233,0.587673900811229,0.541528837231945,"Pp3c15_24170V3",1
"GO:0009553","GO:0009553","embryo sac development","1/42","104/8078",0.420525608384713,0.590647331776711,0.544268789799354,"Pp3c7_19020V3",1
"GO:0006508","GO:0006508","proteolysis","3/42","455/8078",0.424278302144408,0.594566872392844,0.547880562024406,"Pp3c10_9020V3/Pp3c17_12060V3/Pp3c3_14060V3",3
"GO:0033044","GO:0033044","regulation of chromosome organization","1/42","107/8078",0.429635081489486,0.59904213395623,0.552004419128463,"Pp3c17_19720V3",1
"GO:0048438","GO:0048438","floral whorl development","1/42","107/8078",0.429635081489486,0.59904213395623,0.552004419128463,"Pp3c12_14480V3",1
"GO:0080134","GO:0080134","regulation of response to stress","2/42","280/8078",0.430379785560787,0.59904213395623,0.552004419128463,"Pp3c2_2750V3/Pp3c3_14060V3",2
"GO:0008652","GO:0008652","cellular amino acid biosynthetic process","1/42","108/8078",0.432640391560674,0.600835420189881,0.553656893753578,"Pp3c14_1450V3",1
"GO:0042546","GO:0042546","cell wall biogenesis","1/42","109/8078",0.435630241442036,0.603631141729099,0.556233090913716,"Pp3c17_15940V3",1
"GO:0034637","GO:0034637","cellular carbohydrate biosynthetic process","1/42","111/8078",0.441563870662074,0.610484277559646,0.562548107919891,"Pp3c10_23130V3",1
"GO:0005635","GO:0005635","nuclear envelope","1/42","112/8078",0.444507804066391,0.611816977534587,0.563776162231666,"Pp3c2_25720V3",1
"GO:0032269","GO:0032269","negative regulation of cellular protein metabolic process","1/42","112/8078",0.444507804066391,0.611816977534587,0.563776162231666,"Pp3c15_24170V3",1
"GO:0048229","GO:0048229","gametophyte development","2/42","289/8078",0.44651710194113,0.613117094871287,0.564974192344347,"Pp3c12_14480V3/Pp3c7_19020V3",2
"GO:0009644","GO:0009644","response to high light intensity","1/42","113/8078",0.447436585415777,0.613117094871287,0.564974192344347,"Pp3c12_14480V3",1
"GO:0051240","GO:0051240","positive regulation of multicellular organismal process","1/42","114/8078",0.450350290803415,0.615621713180244,0.56728214415008,"Pp3c17_19720V3",1
"GO:0010647","GO:0010647","positive regulation of cell communication","1/42","115/8078",0.453248995949856,0.615621713180244,0.56728214415008,"Pp3c2_2750V3",1
"GO:0022603","GO:0022603","regulation of anatomical structure morphogenesis","1/42","115/8078",0.453248995949856,0.615621713180244,0.56728214415008,"Pp3c10_23130V3",1
"GO:0055082","GO:0055082","cellular chemical homeostasis","1/42","115/8078",0.453248995949856,0.615621713180244,0.56728214415008,"Pp3c22_9570V3",1
"GO:0045944","GO:0045944","positive regulation of transcription by RNA polymerase II","1/42","116/8078",0.456132776204799,0.617311223176172,0.568838991208157,"Pp3c17_19720V3",1
"GO:0006970","GO:0006970","response to osmotic stress","3/42","478/8078",0.456490661798561,0.617311223176172,0.568838991208157,"Pp3c10_23130V3/Pp3c15_24170V3/Pp3c22_9570V3",3
"GO:0002682","GO:0002682","regulation of immune system process","1/42","119/8078",0.464695315591935,0.624308054425687,0.575286420446767,"Pp3c3_14060V3",1
"GO:0051052","GO:0051052","regulation of DNA metabolic process","1/42","119/8078",0.464695315591935,0.624308054425687,0.575286420446767,"Pp3c17_19720V3",1
"GO:0051248","GO:0051248","negative regulation of protein metabolic process","1/42","119/8078",0.464695315591935,0.624308054425687,0.575286420446767,"Pp3c15_24170V3",1
"GO:0009267","GO:0009267","cellular response to starvation","1/42","121/8078",0.470330415609095,0.630508019189633,0.580999554388675,"Pp3c2_2750V3",1
"GO:0046686","GO:0046686","response to cadmium ion","2/42","304/8078",0.472867951752345,0.632537649746643,0.582869815215353,"Pp3c10_23130V3/Pp3c20_10460V3",2
"GO:0015711","GO:0015711","organic anion transport","1/42","124/8078",0.47867464312697,0.638922093849822,0.588752942893465,"Pp3c27_2550V3",1
"GO:0017038","GO:0017038","protein import","1/42","125/8078",0.481427429773772,0.641211533621102,0.590862612313092,"Pp3c10_9020V3",1
"GO:0048827","GO:0048827","phyllome development","2/42","310/8078",0.483207644827709,0.642198547319407,0.591772124169305,"Pp3c12_14480V3/Pp3c18_14130V3",2
"GO:0007005","GO:0007005","mitochondrion organization","1/42","127/8078",0.486890500234493,0.645704568980508,0.595002847587217,"Pp3c10_9020V3",1
"GO:0009753","GO:0009753","response to jasmonic acid","1/42","129/8078",0.492297374404584,0.651477039361955,0.600322054666696,"Pp3c12_14480V3",1
"GO:0000325","GO:0000325","plant-type vacuole","1/42","130/8078",0.494979914381311,0.652965700491348,0.601693823821869,"Pp3c2_25720V3",1
"GO:0005524","GO:0005524","ATP binding","1/42","131/8078",0.497648616393891,0.652965700491348,0.601693823821869,"Pp3c7_19020V3",1
"GO:0006631","GO:0006631","fatty acid metabolic process","1/42","131/8078",0.497648616393891,0.652965700491348,0.601693823821869,"Pp3c15_5610V3",1
"GO:0051130","GO:0051130","positive regulation of cellular component organization","1/42","131/8078",0.497648616393891,0.652965700491348,0.601693823821869,"Pp3c17_19720V3",1
"GO:0090696","GO:0090696","post-embryonic plant organ development","1/42","132/8078",0.500303550093584,0.655058461775074,0.603622258252963,"Pp3c10_9020V3",1
"GO:0008509","GO:0008509","anion transmembrane transporter activity","1/42","137/8078",0.513374107854178,0.667926734008173,0.615480093848444,"Pp3c27_2550V3",1
"GO:0042594","GO:0042594","response to starvation","1/42","137/8078",0.513374107854178,0.667926734008173,0.615480093848444,"Pp3c2_2750V3",1
"GO:0048437","GO:0048437","floral organ development","1/42","137/8078",0.513374107854178,0.667926734008173,0.615480093848444,"Pp3c12_14480V3",1
"GO:0098656","GO:0098656","anion transmembrane transport","1/42","140/8078",0.52105560651736,0.676496564764135,0.623377008239478,"Pp3c27_2550V3",1
"GO:0031669","GO:0031669","cellular response to nutrient levels","1/42","142/8078",0.526110710822234,0.680201713991925,0.626791223419574,"Pp3c2_2750V3",1
"GO:0031969","GO:0031969","chloroplast membrane","1/42","142/8078",0.526110710822234,0.680201713991925,0.626791223419574,"Pp3c24_4810V3",1
"GO:0001067","GO:0001067","transcription regulatory region nucleic acid binding","1/42","143/8078",0.528618693451451,0.68201743748016,0.628464373491341,"Pp3c17_19720V3",1
"GO:0040007","GO:0040007","growth","2/42","341/8078",0.534678745584352,0.688398884939854,0.63434473982705,"Pp3c10_23130V3/Pp3c10_9020V3",2
"GO:0030554","GO:0030554","adenyl nucleotide binding","1/42","148/8078",0.540965527932642,0.693603104278782,0.639140315814718,"Pp3c7_19020V3",1
"GO:0032559","GO:0032559","adenyl ribonucleotide binding","1/42","148/8078",0.540965527932642,0.693603104278782,0.639140315814718,"Pp3c7_19020V3",1
"GO:0009611","GO:0009611","response to wounding","1/42","149/8078",0.543396731946113,0.695277806092543,0.640683517451994,"Pp3c12_14480V3",1
"GO:0005618","GO:0005618","cell wall","2/42","348/8078",0.545830252546466,0.696948545606851,0.642223067915698,"Pp3c10_23130V3/Pp3c17_12060V3",2
"GO:0030312","GO:0030312","external encapsulating structure","2/42","349/8078",0.547408768122917,0.697522925154562,0.642752346292996,"Pp3c10_23130V3/Pp3c17_12060V3",2
"GO:0042170","GO:0042170","plastid membrane","1/42","152/8078",0.550615168432345,0.700164967265822,0.645186931171537,"Pp3c24_4810V3",1
"GO:0051172","GO:0051172","negative regulation of nitrogen compound metabolic process","2/42","354/8078",0.555246386178798,0.701872891809797,0.646760746838869,"Pp3c15_24170V3/Pp3c17_19720V3",2
"GO:0019693","GO:0019693","ribose phosphate metabolic process","1/42","154/8078",0.555365443519402,0.701872891809797,0.646760746838869,"Pp3c20_10460V3",1
"GO:0048609","GO:0048609","multicellular organismal reproductive process","1/42","154/8078",0.555365443519402,0.701872891809797,0.646760746838869,"Pp3c12_14480V3",1
"GO:0003690","GO:0003690","double-stranded DNA binding","1/42","159/8078",0.567027703370137,0.715149225883152,0.658994602627806,"Pp3c17_19720V3",1
"GO:0030234","GO:0030234","enzyme regulator activity","1/42","160/8078",0.56932405852337,0.716583030890922,0.660315823048865,"Pp3c15_24170V3",1
"GO:0031668","GO:0031668","cellular response to extracellular stimulus","1/42","161/8078",0.57160852297677,0.717996071543991,0.661617909564468,"Pp3c2_2750V3",1
"GO:0010498","GO:0010498","proteasomal protein catabolic process","1/42","162/8078",0.573881156807131,0.719388549506708,0.662901048003967,"Pp3c3_14060V3",1
"GO:0045087","GO:0045087","innate immune response","1/42","166/8078",0.582854577104539,0.729158155163168,0.671903529114757,"Pp3c3_14060V3",1
"GO:0009408","GO:0009408","response to heat","1/42","167/8078",0.585068948661871,0.730449717723306,0.673093676185162,"Pp3c10_9020V3",1
"GO:0032504","GO:0032504","multicellular organism reproduction","1/42","168/8078",0.587271843890818,0.731721773234931,0.674265847930672,"Pp3c12_14480V3",1
"GO:0071496","GO:0071496","cellular response to external stimulus","1/42","169/8078",0.589463320825911,0.732974511610489,0.675420219351515,"Pp3c2_2750V3",1
"GO:1901605","GO:1901605","alpha-amino acid metabolic process","1/42","171/8078",0.593812250523163,0.736899539805853,0.67903704826259,"Pp3c14_1450V3",1
"GO:0048831","GO:0048831","regulation of shoot system development","1/42","172/8078",0.59596981792901,0.737796026612024,0.679863141538248,"Pp3c10_23130V3",1
"GO:0016887","GO:0016887","ATP hydrolysis activity","2/42","382/8078",0.597422111261986,0.737796026612024,0.679863141538248,"Pp3c17_19720V3/Pp3c24_4350V3",2
"GO:0006820","GO:0006820","anion transport","1/42","173/8078",0.598116196331107,0.737796026612024,0.679863141538248,"Pp3c27_2550V3",1
"GO:0010608","GO:0010608","post-transcriptional regulation of gene expression","1/42","174/8078",0.600251442346805,0.738954962889095,0.680931076346449,"Pp3c17_19720V3",1
"GO:0006605","GO:0006605","protein targeting","1/42","175/8078",0.602375612314092,0.740095682723874,0.681982225095582,"Pp3c10_9020V3",1
"GO:0009642","GO:0009642","response to light intensity","1/42","179/8078",0.610762648756261,0.747183998223321,0.68851395509933,"Pp3c12_14480V3",1
"GO:0031347","GO:0031347","regulation of defense response","1/42","179/8078",0.610762648756261,0.747183998223321,0.68851395509933,"Pp3c3_14060V3",1
"GO:0019637","GO:0019637","organophosphate metabolic process","2/42","392/8078",0.611772011490292,0.747183998223321,0.68851395509933,"Pp3c2_2120V3/Pp3c20_10460V3",2
"GO:0006955","GO:0006955","immune response","1/42","183/8078",0.618976903736753,0.751527949920065,0.692516812990556,"Pp3c3_14060V3",1
"GO:0008233","GO:0008233","peptidase activity","1/42","183/8078",0.618976903736753,0.751527949920065,0.692516812990556,"Pp3c17_12060V3",1
"GO:0022804","GO:0022804","active transmembrane transporter activity","1/42","183/8078",0.618976903736753,0.751527949920065,0.692516812990556,"Pp3c22_9570V3",1
"GO:0044255","GO:0044255","cellular lipid metabolic process","2/42","400/8078",0.622980407122494,0.754905669807258,0.695629309088276,"Pp3c12_14480V3/Pp3c15_5610V3",2
"GO:0008380","GO:0008380","RNA splicing","1/42","186/8078",0.625026299784836,0.755902648272072,0.696548003262121,"Pp3c9_5610V3",1
"GO:0010817","GO:0010817","regulation of hormone levels","1/42","188/8078",0.629007035063937,0.759231147792018,0.699615143851953,"Pp3c12_14480V3",1
"GO:0051049","GO:0051049","regulation of transport","1/42","191/8078",0.634900898782265,0.764851375141208,0.704794062257526,"Pp3c17_19720V3",1
"GO:0009658","GO:0009658","chloroplast organization","1/42","193/8078",0.638779255680811,0.767437510553552,0.707177130317615,"Pp3c7_11570V3",1
"GO:0009620","GO:0009620","response to fungus","1/42","194/8078",0.64070332305702,0.767437510553552,0.707177130317615,"Pp3c12_14480V3",1
"GO:0010038","GO:0010038","response to metal ion","2/42","414/8078",0.642014875333635,0.767437510553552,0.707177130317615,"Pp3c10_23130V3/Pp3c20_10460V3",2
"GO:1901135","GO:1901135","carbohydrate derivative metabolic process","2/42","414/8078",0.642014875333635,0.767437510553552,0.707177130317615,"Pp3c20_10460V3/Pp3c3_14060V3",2
"GO:0016788","GO:0016788","hydrolase activity, acting on ester bonds","2/42","416/8078",0.644673945327903,0.769128374927884,0.708735225406209,"Pp3c10_23130V3/Pp3c16_260V3",2
"GO:0098772","GO:0098772","molecular function regulator activity","1/42","197/8078",0.646415692435384,0.769312570825494,0.708904957957064,"Pp3c15_24170V3",1
"GO:0016773","GO:0016773","phosphotransferase activity, alcohol group as acceptor","2/42","418/8078",0.647318020759316,0.769312570825494,0.708904957957064,"Pp3c24_17430V3/Pp3c6_8620V3",2
"GO:0004842","GO:0004842","ubiquitin-protein transferase activity","1/42","199/8078",0.65017458265142,0.771095327452516,0.710547729776548,"Pp3c18_14130V3",1
"GO:0048285","GO:0048285","organelle fission","1/42","200/8078",0.652039371016522,0.771095327452516,0.710547729776548,"Pp3c7_11570V3",1
"GO:0009651","GO:0009651","response to salt stress","2/42","422/8078",0.652561256080366,0.771095327452516,0.710547729776548,"Pp3c10_23130V3/Pp3c22_9570V3",2
"GO:0006629","GO:0006629","lipid metabolic process","2/42","435/8078",0.669189941320354,0.789235465144998,0.727263475802152,"Pp3c12_14480V3/Pp3c15_5610V3",2
"GO:0009908","GO:0009908","flower development","1/42","213/8078",0.6754161579656,0.795061305948078,0.732631862575218,"Pp3c12_14480V3",1
"GO:0019787","GO:0019787","ubiquitin-like protein transferase activity","1/42","215/8078",0.678873750818087,0.79761212548589,0.734982387817861,"Pp3c18_14130V3",1
"GO:0009534","GO:0009534","chloroplast thylakoid","2/42","445/8078",0.681555780900825,0.799243781018424,0.736485923234487,"Pp3c12_14480V3/Pp3c7_11570V3",2
"GO:0071554","GO:0071554","cell wall organization or biogenesis","1/42","220/8078",0.687361188852638,0.801924484980492,0.738956134175517,"Pp3c17_15940V3",1
"GO:0031976","GO:0031976","plastid thylakoid","2/42","451/8078",0.688799362343458,0.801924484980492,0.738956134175517,"Pp3c12_14480V3/Pp3c7_11570V3",2
"GO:0032879","GO:0032879","regulation of localization","1/42","221/8078",0.689032203114306,0.801924484980492,0.738956134175517,"Pp3c17_19720V3",1
"GO:0051253","GO:0051253","negative regulation of RNA metabolic process","1/42","221/8078",0.689032203114306,0.801924484980492,0.738956134175517,"Pp3c17_19720V3",1
"GO:0006520","GO:0006520","cellular amino acid metabolic process","1/42","225/8078",0.695629504894481,0.80656479179135,0.743232076918958,"Pp3c14_1450V3",1
"GO:0072594","GO:0072594","establishment of protein localization to organelle","1/42","225/8078",0.695629504894481,0.80656479179135,0.743232076918958,"Pp3c10_9020V3",1
"GO:0048366","GO:0048366","leaf development","1/42","227/8078",0.698876718819482,0.808812382454007,0.745303183286694,"Pp3c18_14130V3",1
"GO:0033043","GO:0033043","regulation of organelle organization","1/42","230/8078",0.703684221569258,0.812679740567166,0.74886687045961,"Pp3c17_19720V3",1
"GO:0090567","GO:0090567","reproductive shoot system development","1/42","231/8078",0.705270009374315,0.812679740567166,0.74886687045961,"Pp3c12_14480V3",1
"GO:0051239","GO:0051239","regulation of multicellular organismal process","2/42","466/8078",0.706337940290525,0.812679740567166,0.74886687045961,"Pp3c10_23130V3/Pp3c17_19720V3",2
"GO:0048367","GO:0048367","shoot system development","2/42","467/8078",0.707478479652323,0.812679740567166,0.74886687045961,"Pp3c12_14480V3/Pp3c18_14130V3",2
"GO:0016301","GO:0016301","kinase activity","2/42","469/8078",0.709748884950934,0.813775159368604,0.7498762752826,"Pp3c24_17430V3/Pp3c6_8620V3",2
"GO:0002376","GO:0002376","immune system process","1/42","235/8078",0.711530725707481,0.814307386087451,0.750366710736349,"Pp3c3_14060V3",1
"GO:0010605","GO:0010605","negative regulation of macromolecule metabolic process","2/42","473/8078",0.714247146851825,0.814816135206355,0.750835512087614,"Pp3c15_24170V3/Pp3c17_19720V3",2
"GO:0006357","GO:0006357","regulation of transcription by RNA polymerase II","1/42","237/8078",0.714612209193923,0.814816135206355,0.750835512087614,"Pp3c17_19720V3",1
"GO:0016567","GO:0016567","protein ubiquitination","1/42","243/8078",0.723665116436669,0.82361886180085,0.758947034975745,"Pp3c18_14130V3",1
"GO:0005789","GO:0005789","endoplasmic reticulum membrane","1/42","246/8078",0.728085828766454,0.827126915767773,0.762179631119682,"Pp3c6_8930V3",1
"GO:0042175","GO:0042175","nuclear outer membrane-endoplasmic reticulum membrane network","1/42","248/8078",0.730994536342888,0.828907565981477,0.763820461924679,"Pp3c6_8930V3",1
"GO:0045934","GO:0045934","negative regulation of nucleobase-containing compound metabolic process","1/42","250/8078",0.733872862115819,0.829128754639079,0.764024282506799,"Pp3c17_19720V3",1
"GO:0140098","GO:0140098","catalytic activity, acting on RNA","1/42","250/8078",0.733872862115819,0.829128754639079,0.764024282506799,"Pp3c17_19720V3",1
"GO:0098827","GO:0098827","endoplasmic reticulum subcompartment","1/42","251/8078",0.735300728721738,0.829226004288383,0.764113895963235,"Pp3c6_8930V3",1
"GO:0051603","GO:0051603","proteolysis involved in cellular protein catabolic process","1/42","254/8078",0.73953960389486,0.832487204384378,0.767119021583969,"Pp3c3_14060V3",1
"GO:0048046","GO:0048046","apoplast","1/42","257/8078",0.743712188933783,0.835662059565596,0.770044582226176,"Pp3c2_2120V3",1
"GO:0045893","GO:0045893","positive regulation of transcription, DNA-templated","1/42","258/8078",0.745088494785309,0.835689092154847,0.77006949217471,"Pp3c17_19720V3",1
"GO:0043565","GO:0043565","sequence-specific DNA binding","1/42","262/8078",0.750521927161631,0.838694014568734,0.772838463433291,"Pp3c17_19720V3",1
"GO:0004674","GO:0004674","protein serine/threonine kinase activity","1/42","263/8078",0.751862520695306,0.838694014568734,0.772838463433291,"Pp3c24_17430V3",1
"GO:0009657","GO:0009657","plastid organization","1/42","264/8078",0.753196081044737,0.838694014568734,0.772838463433291,"Pp3c7_11570V3",1
"GO:0044257","GO:0044257","cellular protein catabolic process","1/42","264/8078",0.753196081044737,0.838694014568734,0.772838463433291,"Pp3c3_14060V3",1
"GO:0033365","GO:0033365","protein localization to organelle","1/42","268/8078",0.758460707969325,0.841454223684948,0.775381936660802,"Pp3c10_9020V3",1
"GO:0008610","GO:0008610","lipid biosynthetic process","1/42","269/8078",0.759759638861167,0.841454223684948,0.775381936660802,"Pp3c15_5610V3",1
"GO:0032446","GO:0032446","protein modification by small protein conjugation","1/42","269/8078",0.759759638861167,0.841454223684948,0.775381936660802,"Pp3c18_14130V3",1
"GO:1901137","GO:1901137","carbohydrate derivative biosynthetic process","1/42","275/8078",0.767411224205087,0.848274683691349,0.781666843599079,"Pp3c3_14060V3",1
"GO:0031327","GO:0031327","negative regulation of cellular biosynthetic process","1/42","276/8078",0.768663143797986,0.848274683691349,0.781666843599079,"Pp3c18_14130V3",1
"GO:0009890","GO:0009890","negative regulation of biosynthetic process","1/42","280/8078",0.773605369503255,0.850153886106111,0.783398488133888,"Pp3c18_14130V3",1
"GO:0050790","GO:0050790","regulation of catalytic activity","1/42","281/8078",0.774824730170203,0.850153886106111,0.783398488133888,"Pp3c15_24170V3",1
"GO:0009617","GO:0009617","response to bacterium","1/42","283/8078",0.777244248624519,0.850153886106111,0.783398488133888,"Pp3c12_14480V3",1
"GO:1902680","GO:1902680","positive regulation of RNA biosynthetic process","1/42","283/8078",0.777244248624519,0.850153886106111,0.783398488133888,"Pp3c17_19720V3",1
"GO:1903508","GO:1903508","positive regulation of nucleic acid-templated transcription","1/42","283/8078",0.777244248624519,0.850153886106111,0.783398488133888,"Pp3c17_19720V3",1
"GO:0018193","GO:0018193","peptidyl-amino acid modification","1/42","297/8078",0.793484463084336,0.866071069550637,0.798065829717075,"Pp3c3_14060V3",1
"GO:0030163","GO:0030163","protein catabolic process","1/42","298/8078",0.794599185170245,0.866071069550637,0.798065829717075,"Pp3c3_14060V3",1
"GO:0051254","GO:0051254","positive regulation of RNA metabolic process","1/42","301/8078",0.797908225107821,0.86814662520534,0.799978409531748,"Pp3c17_19720V3",1
"GO:0070647","GO:0070647","protein modification by small protein conjugation or removal","1/42","306/8078",0.803307998271995,0.872485664204029,0.803976740477568,"Pp3c18_14130V3",1
"GO:0010646","GO:0010646","regulation of cell communication","1/42","319/8078",0.816696769617066,0.885471234426925,0.815942663643274,"Pp3c2_2750V3",1
"GO:0004672","GO:0004672","protein kinase activity","1/42","322/8078",0.819657764132772,0.886643681566956,0.817023048420581,"Pp3c24_17430V3",1
"GO:0010628","GO:0010628","positive regulation of gene expression","1/42","325/8078",0.822572048965078,0.886643681566956,0.817023048420581,"Pp3c17_19720V3",1
"GO:0009793","GO:0009793","embryo development ending in seed dormancy","1/42","326/8078",0.82353322192309,0.886643681566956,0.817023048420581,"Pp3c7_19020V3",1
"GO:0010557","GO:0010557","positive regulation of macromolecule biosynthetic process","1/42","326/8078",0.82353322192309,0.886643681566956,0.817023048420581,"Pp3c17_19720V3",1
"GO:0045935","GO:0045935","positive regulation of nucleobase-containing compound metabolic process","1/42","328/8078",0.825440343264362,0.886643681566956,0.817023048420581,"Pp3c17_19720V3",1
"GO:0032268","GO:0032268","regulation of cellular protein metabolic process","1/42","329/8078",0.826386343984736,0.886643681566956,0.817023048420581,"Pp3c15_24170V3",1
"GO:0022622","GO:0022622","root system development","1/42","340/8078",0.83646762345952,0.894354656224885,0.824128545422693,"Pp3c10_9020V3",1
"GO:0048364","GO:0048364","root development","1/42","340/8078",0.83646762345952,0.894354656224885,0.824128545422693,"Pp3c10_9020V3",1
"GO:0006468","GO:0006468","protein phosphorylation","1/42","346/8078",0.841723239277908,0.89654126188773,0.826143455427119,"Pp3c24_17430V3",1
"GO:0031328","GO:0031328","positive regulation of cellular biosynthetic process","1/42","347/8078",0.842582994056791,0.89654126188773,0.826143455427119,"Pp3c17_19720V3",1
"GO:0006259","GO:0006259","DNA metabolic process","1/42","351/8078",0.845976652934639,0.89654126188773,0.826143455427119,"Pp3c10_9020V3",1
"GO:0006886","GO:0006886","intracellular protein transport","1/42","352/8078",0.846813844674867,0.89654126188773,0.826143455427119,"Pp3c10_9020V3",1
"GO:0044265","GO:0044265","cellular macromolecule catabolic process","1/42","354/8078",0.848474922842078,0.89654126188773,0.826143455427119,"Pp3c3_14060V3",1
"GO:0009737","GO:0009737","response to abscisic acid","1/42","355/8078",0.849298855162201,0.89654126188773,0.826143455427119,"Pp3c3_17780V3",1
"GO:0003700","GO:0003700","DNA-binding transcription factor activity","1/42","356/8078",0.850118413375744,0.89654126188773,0.826143455427119,"Pp3c9_1880V3",1
"GO:0005768","GO:0005768","endosome","1/42","356/8078",0.850118413375744,0.89654126188773,0.826143455427119,"Pp3c6_8930V3",1
"GO:0065009","GO:0065009","regulation of molecular function","1/42","362/8078",0.85494516728097,0.898564818672857,0.828008119403876,"Pp3c15_24170V3",1
"GO:0098796","GO:0098796","membrane protein complex","1/42","362/8078",0.85494516728097,0.898564818672857,0.828008119403876,"Pp3c6_8930V3",1
"GO:0051246","GO:0051246","regulation of protein metabolic process","1/42","364/8078",0.856520106301722,0.898691724438818,0.828125060332823,"Pp3c15_24170V3",1
"GO:0009790","GO:0009790","embryo development","1/42","371/8078",0.861902032222664,0.902805857480688,0.83191614528539,"Pp3c7_19020V3",1
"GO:0009891","GO:0009891","positive regulation of biosynthetic process","1/42","374/8078",0.864147773120995,0.903626605395559,0.832672446804628,"Pp3c17_19720V3",1
"GO:0097305","GO:0097305","response to alcohol","1/42","380/8078",0.868532814489284,0.906677836747259,0.835484090751605,"Pp3c3_17780V3",1
"GO:0042651","GO:0042651","thylakoid membrane","1/42","394/8078",0.878234173606578,0.911693593885984,0.840106002882503,"Pp3c7_11570V3",1
"GO:0034357","GO:0034357","photosynthetic membrane","1/42","396/8078",0.879561742307308,0.911693593885984,0.840106002882503,"Pp3c7_11570V3",1
"GO:0051128","GO:0051128","regulation of cellular component organization","1/42","396/8078",0.879561742307308,0.911693593885984,0.840106002882503,"Pp3c17_19720V3",1
"GO:0015031","GO:0015031","protein transport","1/42","397/8078",0.880220217551137,0.911693593885984,0.840106002882503,"Pp3c10_9020V3",1
"GO:0015833","GO:0015833","peptide transport","1/42","399/8078",0.881526641825659,0.911693593885984,0.840106002882503,"Pp3c10_9020V3",1
"GO:0045184","GO:0045184","establishment of protein localization","1/42","402/8078",0.88346023590961,0.911693593885984,0.840106002882503,"Pp3c10_9020V3",1
"GO:0042886","GO:0042886","amide transport","1/42","404/8078",0.884732147420853,0.911693593885984,0.840106002882503,"Pp3c10_9020V3",1
"GO:1901565","GO:1901565","organonitrogen compound catabolic process","1/42","406/8078",0.885990504317452,0.911693593885984,0.840106002882503,"Pp3c3_14060V3",1
"GO:2000026","GO:2000026","regulation of multicellular organismal development","1/42","407/8078",0.886614643892357,0.911693593885984,0.840106002882503,"Pp3c10_23130V3",1
"GO:0034613","GO:0034613","cellular protein localization","1/42","421/8078",0.895010124227766,0.918797768725514,0.846652346926423,"Pp3c10_9020V3",1
"GO:0140110","GO:0140110","transcription regulator activity","1/42","425/8078",0.897295236557961,0.919616013586765,0.847406341935684,"Pp3c9_1880V3",1
"GO:0048316","GO:0048316","seed development","1/42","432/8078",0.90117790264886,0.921648083717796,0.849278850777257,"Pp3c7_19020V3",1
"GO:0009888","GO:0009888","tissue development","1/42","434/8078",0.902260664481014,0.921648083717796,0.849278850777257,"Pp3c14_1450V3",1
"GO:0033993","GO:0033993","response to lipid","1/42","437/8078",0.903863125010903,0.92176140471409,0.849383273633661,"Pp3c3_17780V3",1
"GO:0010154","GO:0010154","fruit development","1/42","447/8078",0.909021598701806,0.922869421445144,0.850404287177351,"Pp3c7_19020V3",1
"GO:0031410","GO:0031410","cytoplasmic vesicle","1/42","450/8078",0.910515739443452,0.922869421445144,0.850404287177351,"Pp3c6_8930V3",1
"GO:0097708","GO:0097708","intracellular vesicle","1/42","450/8078",0.910515739443452,0.922869421445144,0.850404287177351,"Pp3c6_8930V3",1
"GO:0070727","GO:0070727","cellular macromolecule localization","1/42","455/8078",0.912952907375315,0.922869421445144,0.850404287177351,"Pp3c10_9020V3",1
"GO:0051173","GO:0051173","positive regulation of nitrogen compound metabolic process","1/42","456/8078",0.913432505681787,0.922869421445144,0.850404287177351,"Pp3c17_19720V3",1
"GO:0006952","GO:0006952","defense response","1/42","457/8078",0.91390952414956,0.922869421445144,0.850404287177351,"Pp3c3_14060V3",1
"GO:0071310","GO:0071310","cellular response to organic substance","1/42","462/8078",0.916256390413507,0.92372993356533,0.851197230555005,"Pp3c3_14060V3",1
"GO:0008104","GO:0008104","protein localization","1/42","468/8078",0.918990281466904,0.924977188838024,0.852346549414701,"Pp3c10_9020V3",1
"GO:0031982","GO:0031982","vesicle","1/42","473/8078",0.921201801632782,0.92569546895782,0.853008429068609,"Pp3c6_8930V3",1
"GO:0010604","GO:0010604","positive regulation of macromolecule metabolic process","1/42","483/8078",0.925449454581206,0.928454160602574,0.855550503978866,"Pp3c17_19720V3",1
"GO:0043603","GO:0043603","cellular amide metabolic process","1/42","493/8078",0.929473299000813,0.930979738707459,0.857877769784935,"Pp3c17_12060V3",1
"GO:0046907","GO:0046907","intracellular transport","1/42","498/8078",0.931404915871507,0.931404915871507,0.858269561380489,"Pp3c10_9020V3",1
