GeneID	HOG	OG	Gene Tree Parent Clade	A_agrestis_oxf	A_filiculoides	A_thaliana	B_distachyon	C_braunii	C_melkonianii	C_reinhardtii	Closterium_sp_NIES_67	K_nitens	M_endlicherianum	M_polymorpha	M_viride	O_lucimarinus	O_sativa	P_coloniale	P_margaritaceum	P_patens	S_lycopersicum	S_moellendorffii	S_muscicola	Z_circumcarinatum_SAG698_1a	Z_circumcarinatum_SAG698_1b	Z_circumcarinatum_UTEX1559	Z_circumcarinatum_UTEX1560	Z_mays
Me1_v2_0094000	N0.HOG0010599	OG0009096	n3	NA	NA	NA	NA	NA	NA	NA	NA	10153	Me1_v2_0077030, Me1_v2_0094000, Me1_v2_0094050, Me1_v2_0077830, Me1_v2_0094140, Me1_v2_0077100, Me1_v2_0018350	NA	NA	NA	NA	NA	NA	NA	NA	NA	NA	Zci1a_14133, Zci1a_02548, Zci1a_02547	Zci_01193	UTEX1559_00485	UTEX1560_05883	NA
Me1_v2_0166090	N0.HOG0007413	OG0006117	n0	AagrOXF_evm.TU.utg000091l.603	Azfi_s0113.g045898	AT1G68010	Bradi3g00330	CBR_g49204	Chrsp153S02247	Cre06.g295450_4532	CLOP_g21285, CLOP_g10731	6136, 230	Me1_v2_0166090	Mp2g07580	27822, 15355	NA	LOC_Os02g01150	PRCOL_00005045_RA	pm000106.t3	Pp3c18_12500, Pp3c19_20080	Solyc01g111630	271022, 271148	SM000191S05206	Zci1a_08222	Zci_06458	UTEX1559_04971	UTEX1560_02944	Zm00001d014919
Me1_v2_0121480	N0.HOG0002514	OG0001680	n31	NA	NA	NA	NA	CBR_g23069	Chrsp1S03047	Cre01.g027850_4532, Cre06.g274650_4532	CLOP_g12851	2826	Me1_v2_0121480	NA	21707, 21708, 3378, 3379	Olucimarinus_17110	NA	PRCOL_00004965_RA	pm005565g0040, pm002895.t1, pm005565g0030, pm028175g0010, pm006902g0010	NA	NA	NA	NA	Zci1a_29584, Zci1a_20684	Zci_05241	UTEX1559_13846	UTEX1560_06412, UTEX1560_12947	NA
Me1_v2_0086290	N0.HOG0003271	OG0002333	n4	AagrOXF_evm.TU.utg000081l.316	Azfi_s0006.g010052	AT1G32080	Bradi3g34517	CBR_g23155, CBR_g23153	NA	NA	NA	NA	Me1_v2_0027770, Me1_v2_0016350, Me1_v2_0086280, Me1_v2_0086290	Mp8g12090	11880	NA	LOC_Os01g32830, LOC_Os10g42780	NA	NA	Pp3c1_16500	Solyc08g076290	85667	SM000092S24488, SM000218S06612	NA	NA	NA	NA	Zm00001d030127, Zm00001d030130
Me1_v2_0159930	N0.HOG0006901	OG0005630	n0	AagrOXF_evm.TU.utg000010l.411, AagrOXF_evm.TU.utg000048l.15	NA	AT5G03455	Bradi1g78020, Bradi3g32555	NA	NA	Cre01.g024850_4532, Cre05.g247400_4532, Cre07.g354301_4532, Cre07.g352550_4532	NA	11068	Me1_v2_0159930	Mp1g01430	27961, 27968	NA	LOC_Os03g01770, LOC_Os10g39860	NA	pm000191g0010, pm001090g0040, pm026785g0010	Pp3c1_27510	Solyc01g097140	170430	SM001924S05196, SM001684S02647, SM001559S01742	Zci1a_24482	Zci_06038	UTEX1559_14214	UTEX1560_15914	Zm00001d047396
Me1_v2_0122630	N0.HOG0001278	OG0000749	n0	AagrOXF_evm.TU.utg000100l.403, AagrOXF_evm.TU.utg000080l.43, AagrOXF_evm.TU.utg000042l.477, AagrOXF_evm.TU.utg000116l.141	Azfi_s0056.g034037, Azfi_s0006.g009813	AT2G45870, AT3G61320	Bradi1g78180	CBR_g38187, CBR_g772	Chrsp57S06806, Chrsp57S06813	Cre06.g277650_4532, Cre06.g261750_4532, Cre16.g662600_4532, Cre16.g663400_4532, Cre16.g663450_4532, Cre11.g474700_4532, Cre01.g038100_4532, Cre03.g199600_4532, Cre07.g355300_4532	CLOP_g23704, CLOP_g3045, CLOP_g23705, CLOP_g4716	10688, 7320, 2584	Me1_v2_0122630	Mp5g15730, Mp7g14460	21433, 25081, 25084, 21431, 25083, 11277, 25134, 11335, 11336, 11334, 11333, 11332	Olucimarinus_87902	LOC_Os03g01570	PRCOL_00004398_RA, PRCOL_00003097_RA, PRCOL_00004040_RA, PRCOL_00006054_RA, PRCOL_00003548_RA, PRCOL_00005764_RA	pm008585g0010, pm003156g0010, pm016574g0020, pm022268g0020, pm009964g0030, pm015026g0010, pm009860g0010	Pp3c4_15850, Pp3c3_22870, Pp3c2_13700, Pp3c11_6680, Pp3c6_24250, Pp3c6_17920, Pp3c1_34600, Pp3c14_6660, Pp3c1_34560, Pp3c11_9440, Pp3c1_3670, Pp3c3_14710	Solyc05g049900	65166	SM000389S14643, SM008223S22994, SM000078S22073, SM000019S05049	Zci1a_36274, Zci1a_36271, Zci1a_19111	Zci_14068	UTEX1559_15023	UTEX1560_00579	Zm00001d027298
Me1_v2_0161900	N0.HOG0039774	OG0037597	-	NA	NA	NA	NA	NA	NA	NA	NA	NA	Me1_v2_0162120, Me1_v2_0161900	NA	NA	NA	NA	NA	NA	NA	NA	NA	NA	NA	NA	NA	NA	NA
Me1_v2_0187280	N0.HOG0006542	OG0005286	n0	AagrOXF_evm.TU.utg000009l.71	Azfi_s0003.g008093	AT4G25290	Bradi4g36220	NA	Chrsp27S04228	Cre13.g586350_4532	CLOP_g25142	11019	Me1_v2_0187280, Me1_v2_0187300, Me1_v2_0187290	Mp8g09280	3387	NA	LOC_Os09g36240, LOC_Os09g36244	PRCOL_00004630_RA	pm006584g0050, pm001824g0010, pm006584g0020, pm014938g0010	Pp3c3_8370, Pp3c6_9800	NA	426049	SM000083S22734, SM000130S27086, SM000101S09260, SM000101S09263	NA	Zci_14826	UTEX1559_14501	UTEX1560_13348	Zm00001d021295
Me1_v2_0062510	N0.HOG0004232	OG0003173	n0	AagrOXF_evm.TU.utg000011l.172, AagrOXF_evm.TU.utg000011l.176, AagrOXF_evm.TU.utg000011l.173, AagrOXF_evm.TU.utg000028l.56	Azfi_s0002.g004162	NA	NA	NA	Chrsp78S07729	NA	NA	2641, 2643	Me1_v2_0062510	Mp3g18160, Mp5g11120	1404, 1405	NA	NA	PRCOL_00005521_RA	NA	Pp3c26_11640, Pp3c20_2470	NA	438930	SM000008S22208, SM000042S15386, SM000039S14520, SM000147S01116, SM000417S15261, SM000003S11135, SM000100S09446, SM000018S03722, SM000020S05954, SM000152S01557	Zci1a_17011, Zci1a_42438, Zci1a_15535	Zci_00199, Zci_05604	UTEX1559_07119, UTEX1559_01851	UTEX1560_17697, UTEX1560_14740, UTEX1560_13588, UTEX1560_13587, UTEX1560_13586	NA
Me1_v2_0086280	N0.HOG0003271	OG0002333	n4	AagrOXF_evm.TU.utg000081l.316	Azfi_s0006.g010052	AT1G32080	Bradi3g34517	CBR_g23155, CBR_g23153	NA	NA	NA	NA	Me1_v2_0027770, Me1_v2_0016350, Me1_v2_0086280, Me1_v2_0086290	Mp8g12090	11880	NA	LOC_Os01g32830, LOC_Os10g42780	NA	NA	Pp3c1_16500	Solyc08g076290	85667	SM000092S24488, SM000218S06612	NA	NA	NA	NA	Zm00001d030127, Zm00001d030130
Me1_v2_0069260	N0.HOG0006257	OG0005016	n0	AagrOXF_evm.TU.utg000035l.107	Azfi_s0754.g085340, Azfi_s1450.g103210	AT1G09340	Bradi4g08030	CBR_g216	Chrsp12S02017, Chrsp12S02069	Cre10.g435800_4532	CLOP_g8801, CLOP_g11700	2487	Me1_v2_0069260	Mp1g11680	11617	NA	LOC_Os12g23180	NA	pm005528g0030, pm002937g0040, pm184688g0010	Pp3c22_14530, Pp3c19_13480	Solyc06g073260	107618, 228849	SM000028S10085, SM000027S09607, SM000076S21867	Zci1a_31629	Zci_14482	UTEX1559_10797	UTEX1560_11852	Zm00001d035212
Me1_v2_0187290	N0.HOG0006542	OG0005286	n0	AagrOXF_evm.TU.utg000009l.71	Azfi_s0003.g008093	AT4G25290	Bradi4g36220	NA	Chrsp27S04228	Cre13.g586350_4532	CLOP_g25142	11019	Me1_v2_0187280, Me1_v2_0187300, Me1_v2_0187290	Mp8g09280	3387	NA	LOC_Os09g36240, LOC_Os09g36244	PRCOL_00004630_RA	pm006584g0050, pm001824g0010, pm006584g0020, pm014938g0010	Pp3c3_8370, Pp3c6_9800	NA	426049	SM000083S22734, SM000130S27086, SM000101S09260, SM000101S09263	NA	Zci_14826	UTEX1559_14501	UTEX1560_13348	Zm00001d021295
Me1_v2_0214880	N0.HOG0001337	OG0000788	n0	AagrOXF_evm.TU.utg000071l.58, AagrOXF_evm.TU.utg000081l.349, AagrOXF_evm.TU.utg000081l.218, AagrOXF_evm.TU.utg000083l.209	Azfi_s0076.g037880, Azfi_s0400.g068220, Azfi_s0007.g010829, Azfi_s0288.g063232	AT3G09940, AT5G03630, AT3G52880, AT3G27820, AT1G63940	Bradi4g38430, Bradi3g42760, Bradi3g52862, Bradi3g52856, Bradi3g17120	CBR_g42037	Chrsp57S06804, Chrsp369S00414	Cre17.g712100_4532	CLOP_g6733, CLOP_g8516	7035, 8851, 6385	Me1_v2_0214880, Me1_v2_0160940, Me1_v2_0079650	Mp1g17590, Mp3g07930, Mp7g06510	4852, 23757, 23758, 23759, 17374, 17375	Olucimarinus_15314	LOC_Os09g39380, LOC_Os08g44340, LOC_Os02g47800, LOC_Os02g47790, LOC_Os08g05570	NA	pm010075.t1, pm001154g0060, pm009235g0050	Pp3c2_8410, Pp3c9_450, Pp3c15_710, Pp3c14_26470	Solyc09g009390, Solyc02g086710, Solyc08g081530	145962, 440551, 170362	SM000096S24910, SM000020S06032, SM000068S20571, SM000002S05492, SM000086S23060, SM000413S15646, SM000028S10077, SM000027S09589, SM000180S03500	Zci1a_01617, Zci1a_32310, Zci1a_32708	Zci_02020, Zci_02508	UTEX1559_01878, UTEX1559_12206, UTEX1559_16624	UTEX1560_14299, UTEX1560_13672	Zm00001d005347, Zm00001d049954, Zm00001d017787, Zm00001d017786, Zm00001d024633
Me1_v2_0227990	N0.HOG0001883	OG0001188	n0	AagrOXF_evm.TU.utg000068l.47	Azfi_s0163.g054217, Azfi_s0254.g060418, Azfi_s0495.g073582, Azfi_s0046.g030133	AT5G13720, AT4G19390	Bradi1g19250, Bradi1g09240, Bradi1g34830	CBR_g12790	Chrsp1S08792	NA	CLOP_g9730, CLOP_g13445	7004, 9077, 9863	Me1_v2_0160010, Me1_v2_0053770, Me1_v2_0227990, Me1_v2_0212470	Mp4g10020	29734, 29213	NA	LOC_Os07g46320, LOC_Os07g46330, LOC_Os03g52910, LOC_Os01g09810, LOC_Os06g49640	PRCOL_00005182_RA	pm022154g0010, pm059419g0010, pm007395g0050, pm005280g0030, pm009589g0020, pm029105g0010, pm053291g0010, pm005962.t1, pm008133.t1, pm013510g0010, pm011152g0010, pm014995g0010	Pp3c21_9030, Pp3c26_11180, Pp3c25_610, Pp3c16_6920	Solyc01g087710.2, Solyc01g087680, Solyc04g079760, Solyc08g075280	406519, 83613, 425480, 425478, 91594	SM000106S13954, SM000010S04257, SM000044S16049	Zci1a_04352	NA	UTEX1559_08580	UTEX1560_01313, UTEX1560_01312	Zm00001d022371, Zm00001d007072, Zm00001d014744
Me1_v2_0203620	N0.HOG0005679	OG0004472	n0	AagrOXF_evm.TU.utg000103l.16, AagrOXF_evm.TU.utg000076l.21	Azfi_s0162.g054184	AT3G02720, AT2G38860, AT3G54600	Bradi5g25750	CBR_g29737	NA	NA	CLOP_g6140	656	Me1_v2_0203620	Mp5g05290	NA	NA	LOC_Os04g57590, LOC_Os11g37920	NA	pm004056g0030, pm014215g0010, pm020635g0010, pm098856g0010, pm005918g0020	Pp3c10_15130, Pp3s32_650, Pp3s30_990	Solyc02g081400	271043	SM000039S14491, SM000008S22223, SM000042S15356, SM000008S22238	Zci1a_41370, Zci1a_17795	Zci_01510	UTEX1559_16106	UTEX1560_07211	Zm00001d001881
Me1_v2_0187300	N0.HOG0006542	OG0005286	n0	AagrOXF_evm.TU.utg000009l.71	Azfi_s0003.g008093	AT4G25290	Bradi4g36220	NA	Chrsp27S04228	Cre13.g586350_4532	CLOP_g25142	11019	Me1_v2_0187280, Me1_v2_0187300, Me1_v2_0187290	Mp8g09280	3387	NA	LOC_Os09g36240, LOC_Os09g36244	PRCOL_00004630_RA	pm006584g0050, pm001824g0010, pm006584g0020, pm014938g0010	Pp3c3_8370, Pp3c6_9800	NA	426049	SM000083S22734, SM000130S27086, SM000101S09260, SM000101S09263	NA	Zci_14826	UTEX1559_14501	UTEX1560_13348	Zm00001d021295
Me1_v2_0137260	N0.HOG0008985	OG0007607	n0	NA	Azfi_s0016.g014405	NA	NA	NA	NA	NA	CLOP_g15376, CLOP_g11164	6035	Me1_v2_0137260	Mp7g08280	NA	NA	NA	NA	pm062374g0010, pm015948g0010, pm053567g0010, pm010007g0010, pm013551g0020, pm002214g0020, pm006393.t1	Pp3c10_20360, Pp3c3_24520	NA	441980	SM000019S05033, SM000078S22059, SM000268S09730	Zci1a_23733	Zci_09203	UTEX1559_06469	UTEX1560_03655	NA
Me1_v2_0145290	N0.HOG0008273	OG0006934	n0	NA	Azfi_s0076.g037756	NA	NA	NA	NA	Cre12.g522050_4532	CLOP_g9426, CLOP_g18625	6260	Me1_v2_0145290, Me1_v2_0145300	Mp7g09700	22532, 22534, 22533	NA	NA	PRCOL_00000156_RA	pm009166g0010, pm009166g0020, pm011324g0030, pm004347g0040, pm004892g0020	NA	NA	424592, 425857	SM000038S14334, SM000016S01925, SM000014S00336	Zci1a_16608	Zci_05527	UTEX1559_05354	UTEX1560_03746	NA
Me1_v2_0141270	N0.HOG0001552	OG0000942	n0	AagrOXF_evm.TU.utg000002l.202, AagrOXF_evm.TU.utg000008l.205	Azfi_s0032.g024904, Azfi_s0158.g053908, Azfi_s0074.g037493	AT1G42970, AT1G12900, AT3G26650	Bradi1g76470, Bradi5g12330	CBR_g41156	Chrsp10S01518, Chrsp41S05695, Chrsp208S03297	Cre01.g010900_4532	CLOP_g3938, CLOP_g20624	5718, 4556	Me1_v2_0141270, Me1_v2_0058260, Me1_v2_0052340	Mp2g19370, Mp7g06610	17992, 9852	Olucimarinus_37993, Olucimarinus_26762, Olucimarinus_28757	LOC_Os03g03720, LOC_Os04g38600	NA	pm003432g0030, pm005477g0090, pm006662g0020, pm014579g0020, pm013536g0010, pm006104.t1, pm026978g0010, pm020891.t1, pm028226g0030, pm000266g0030, pm012814g0010, pm003413.t1	Pp3c7_14220, Pp3c2_24270, Pp3c2_24160, Pp3c1_13170, Pp3c11_15790, Pp3c7_14300	Solyc04g082630, Solyc12g094640, Solyc04g009030, Solyc02g020940	271457, 270825	SM000048S16588, SM000011S18983, SM000026S08882, SM000006S19352	Zci1a_22813, Zci1a_16714, Zci1a_16717	Zci_15006, Zci_10058	UTEX1559_13396, UTEX1559_07671	UTEX1560_16481, UTEX1560_09820	Zm00001d027488, Zm00001d025607, Zm00001d025593, Zm00001d025599, Zm00001d003429
Me1_v2_0169660	N0.HOG0008631	OG0007273	n0	AagrOXF_evm.TU.utg000020l.51	Azfi_s0074.g037308	AT4G23330	Bradi1g27745	NA	Chrsp17S02770	NA	CLOP_g4090, CLOP_g8404	6512	Me1_v2_0169660	Mp8g10130	NA	NA	NA	NA	pm005557.t1, pm000497g0060, pm004781.t1	Pp3c11_2200	Solyc08g081130	426939, 438626	SM000062S19949, SM000023S07567, SM000154S01391	Zci1a_42591	Zci_02367	UTEX1559_01151	UTEX1560_00303	NA
Me1_v2_0169650	N0.HOG0002955	OG0002054	n0	AagrOXF_evm.TU.utg000080l.113	NA	AT2G16990, AT2G16970, AT2G16980, AT5G42210	Bradi3g51280, Bradi3g32390, Bradi4g42530, Bradi4g42523	NA	Chrsp66S07262, Chrsp32S08945	Cre16.g656150_4532	CLOP_g14000, CLOP_g12191, CLOP_g12439, CLOP_g12440	7848	Me1_v2_0041040, Me1_v2_0213500, Me1_v2_0213510, Me1_v2_0169650, Me1_v2_0210040, Me1_v2_0210030	Mp4g04950	19930, 9729	NA	LOC_Os02g44730, LOC_Os05g24140, LOC_Os11g05390	NA	pm017007g0010, pm001180g0030	Pp3s914_10	Solyc10g055770, Solyc01g111840, Solyc07g026920.1, Solyc04g081990, Solyc12g094400, Solyc11g007130, Solyc11g007140	167756	SM000013S26598, SM000140S00615, SM000179S03417	NA	Zci_12550	UTEX1559_10959	UTEX1560_11351	Zm00001d017536, Zm00001d029803, Zm00001d052532
Me1_v2_0124600	NA	NA	NA	NA	NA	NA	NA	NA	NA	NA	NA	NA	NA	NA	NA	NA	NA	NA	NA	NA	NA	NA	NA	NA	NA	NA	NA	NA
Me1_v2_0169670	NA	NA	NA	NA	NA	NA	NA	NA	NA	NA	NA	NA	NA	NA	NA	NA	NA	NA	NA	NA	NA	NA	NA	NA	NA	NA	NA	NA
Me1_v2_0000300	N0.HOG0039416	OG0037239	-	NA	NA	NA	NA	NA	NA	NA	NA	NA	Me1_v2_0000300, Me1_v2_0007820	NA	NA	NA	NA	NA	NA	NA	NA	NA	NA	NA	NA	NA	NA	NA
Me1_v2_0106340	N0.HOG0001276	OG0000747	n0	AagrOXF_evm.TU.utg000006l.606, AagrOXF_evm.TU.utg000083l.287	Azfi_s0078.g038222, Azfi_s0001.g000773	AT3G58060, AT1G79520, AT1G16310, AT2G39450	Bradi3g57420, Bradi1g68950, Bradi2g02050, Bradi2g23070, Bradi2g54410	CBR_g12597	Chrsp2S08914	Cre03.g160750_4532, Cre03.g160800_4532, Cre03.g160550_4532	CLOP_g24906, CLOP_g1366, CLOP_g15117, CLOP_g1616, CLOP_g24678	3809, 9737	Me1_v2_0106340, Me1_v2_0058320	Mp5g02190, Mp2g03190	NA	Olucimarinus_33926	LOC_Os02g53490, LOC_Os03g12530, LOC_Os01g03914, LOC_Os05g38670, LOC_Os01g62070	PRCOL_00002887_RA	pm002072g0010, pm000123g0170, pm055165g0010, pm008563g0010, pm001583.t1, pm003263g0070	Pp3c16_11060, Pp3c3_30490, Pp3c11_22440, Pp3c2_25950, Pp3c11_14920, Pp3c7_10280, Pp3c7_10520, Pp3c7_10340, Pp3c7_10350	Solyc12g017340.1, Solyc01g006150, Solyc12g100300, Solyc03g052990, Solyc10g005500, Solyc12g017350, Solyc05g054730	96683, 96962, 173239	SM000140S00593, SM000013S26553, SM000374S13844, SM000004S15122, SM000045S16243, SM000013S26439	Zci1a_04095, Zci1a_38447, Zci1a_05841	Zci_04226, Zci_06405, Zci_01614	UTEX1559_00065, UTEX1559_06041, UTEX1559_13061	UTEX1560_00815, UTEX1560_00472, UTEX1560_02819	Zm00001d018242, Zm00001d028344, Zm00001d040002, Zm00001d042939
Me1_v2_0176100	N0.HOG0005932	OG0004709	n0	AagrOXF_evm.TU.utg000038l.64	Azfi_s0022.g016213	AT3G59780	Bradi2g57590	CBR_g30747	Chrsp6S07493	Cre05.g247450_4532	CLOP_g19874, CLOP_g9665	2747	Me1_v2_0176100	Mp6g15980	3508, 3506, 3509, 3507	Olucimarinus_33072	LOC_Os01g67120, LOC_Os05g37000	NA	pm003425g0020, pm009850g0010, pm008040.t1	Pp3c5_10150	Solyc03g059180, Solyc03g059170.2	NA	SM000255S08757, SM000237S08120, SM000195S05248	Zci1a_24309	Zci_14657	UTEX1559_12654	UTEX1560_06881	Zm00001d042526
Me1_v2_0095290	N0.HOG0000144	OG0000070	n0	AagrOXF_evm.TU.utg000038l.124, AagrOXF_evm.TU.utg000010l.214, AagrOXF_evm.TU.utg000033l.202, AagrOXF_evm.TU.utg000033l.209, AagrOXF_evm.TU.utg000033l.211, AagrOXF_evm.TU.utg000033l.204, AagrOXF_evm.TU.utg000033l.205, AagrOXF_evm.TU.utg000033l.208, AagrOXF_evm.TU.utg000033l.210	Azfi_s0045.g029750	AT1G08080, AT2G28210, AT1G08065, AT5G56330, AT5G04180, AT4G21000, AT4G20990, AT3G52720	Bradi3g38260, Bradi1g36190, Bradi2g14275, Bradi4g25550, Bradi3g44940, Bradi5g09340	CBR_g3232, CBR_g34505, CBR_g12070, CBR_g12072, CBR_g3220, CBR_g54091, CBR_g3213, CBR_g3215	Chrsp109S01440, Chrsp41S05701	Cre09.g415700_4532, Cre04.g223050_4532, Cre04.g223100_4532	CLOP_g25247, CLOP_g25081, CLOP_g3833, CLOP_g25080, CLOP_g3832, CLOP_g23116, CLOP_g1635, CLOP_g13480, CLOP_g6919, CLOP_g6917, CLOP_g13872, CLOP_g5555, CLOP_g5554, CLOP_g13873, CLOP_g1636, CLOP_g13481, CLOP_g23139, CLOP_g23944, CLOP_g12855, CLOP_g17643, CLOP_g7280, CLOP_g11887	7319, 8026, 5531, 1858, 6156	Me1_v2_0095280, Me1_v2_0095260, Me1_v2_0095290, Me1_v2_0123140	Mp4g18060, Mp6g09000, Mp2g17100, Mp8g15470, Mp8g08440, Mp8g11120, Mp8g11240, Mp7g13720, Mp6g03300, Mp6g14480, Mp8g02780, Mp8g02750, Mp8g02730, Mp8g02700, Mp8g02710, Mp8g02770, Mp8g11360, Mp8g09490, Mp8g09470, Mp8g09480, Mp8g09460, Mp8g09450, Mp8g01230	2327, 14727, 14906, 15093, 1690, 17512, 26388, 26389, 26392, 26391, 1685	NA	LOC_Os09g28150, LOC_Os09g28130, LOC_Os08g36630, LOC_Os08g36680, LOC_Os08g32840, LOC_Os08g32750, LOC_Os08g32780, LOC_Os06g40770, LOC_Os11g05520, LOC_Os12g05730, LOC_Os11g05510, LOC_Os02g33030, LOC_Os04g33660	NA	pm025065g0010, pm013702g0010, pm012417g0030, pm036734g0010, pm009259g0010, pm005913g0010, pm008594g0010, pm071846g0010, pm002810g0040, pm013895g0010, pm067681g0010, pm023999g0010, pm031370g0010, pm002358g0080, pm002358g0090, pm012786g0020, pm002358g0070, pm011175g0030, pm000450g0010, pm002200g0010, pm004410g0060, pm018430g0010, pm000854g0080, pm000819g0050, pm002444g0010, pm056204g0010, pm034828g0010, pm027921g0010, pm068120g0010, pm011620g0010, pm001926g0050, pm025546g0010, pm007382g0010, pm014538g0010, pm325515g0010, pm000388g0010, pm014538g0020, pm021202g0020, pm008978g0010, pm000414g0060, pm008978g0030, pm000414g0050, pm008978g0020, pm008527g0020, pm008527.t1, pm006863g0060, pm004110g0030, pm002443g0010, pm022321g0010, pm004110g0010, pm014209g0010, pm001427g0080, pm004110g0040, pm002443g0050, pm038072g0010, pm000175g0100, pm023791g0010, pm002443g0030, pm002443g0040, pm000175g0080, pm006863g0050, pm025438g0020, pm000175g0070, pm002443g0020, pm000175g0060, pm000175g0090, pm002115g0040, pm000414g0040, pm000414g0030, pm017850g0010, pm007393g0010, pm003401g0040, pm003401g0020, pm003401g0010, pm008527g0010, pm001144g0040, pm001144g0030, pm020549g0010, pm003401g0030, pm006914g0010, pm012778g0010, pm015026g0020, pm009964.t1, pm009860g0020	Pp3c18_6840, Pp3c7_9490, Pp3c7_9420, Pp3c7_9630, Pp3c7_9610, Pp3c7_9400, Pp3c7_9540, Pp3c7_9520, Pp3c7_9500, Pp3c3_25570, Pp3c26_6961, Pp3c26_6890, Pp3c26_6990, Pp3c26_6930, Pp3c26_6810, Pp3s775_50, Pp3s775_10	Solyc11g069640, Solyc06g075050, Solyc06g075070, Solyc06g075060, Solyc10g079270, Solyc09g008420, Solyc10g083890, Solyc09g009830.3	416362, 159358, 133488, 36096, 411805, 106066, 113076, 93576, 105891, 105754, 133933, 132930, 429383, 420353, 420339, 429368, 108874, 420338, 420354, 77903	SM000113S24030, SM000050S17023, SM000073S21429	Zci1a_25559, Zci1a_04041, Zci1a_04040, Zci1a_13216, Zci1a_13217, Zci1a_43279, Zci1a_07381, Zci1a_26320, Zci1a_42304, Zci1a_04278, Zci1a_29979, Zci1a_22734, Zci1a_28624, Zci1a_40613, Zci1a_21714, Zci1a_28623, Zci1a_21712, Zci1a_30223, Zci1a_40612, Zci1a_44794, Zci1a_06762	Zci_14809, Zci_14810, Zci_14065, Zci_00059	UTEX1559_14490, UTEX1559_14491, UTEX1559_15019, UTEX1559_14034	UTEX1560_09761, UTEX1560_09760, UTEX1560_00575, UTEX1560_11035	Zm00001d005844, Zm00001d050011, Zm00001d031779, Zm00001d031778, Zm00001d046784, Zm00001d004909, Zm00001d052551, Zm00001d003781, Zm00001d049240
Me1_v2_0209010	N0.HOG0003161	OG0002236	n0	AagrOXF_evm.TU.utg000125l.85	Azfi_s0207.g057939	AT1G18180, AT1G73650	Bradi1g11150	CBR_g19480, CBR_g30737	Chrsp29S00344	Cre09.g401701_4532	CLOP_g13580, CLOP_g16523	8303, 244	Me1_v2_0209010, Me1_v2_0209020	Mp3g23330, Mp4g01590, Mp7g02070	22708	Olucimarinus_34095	LOC_Os03g50070	PRCOL_00001152_RA	pm000128g0100, pm008833g0040, pm006163g0010, pm017992g0020, pm008902g0030	Pp3c10_10850, Pp3c14_25340, Pp3c13_4300	Solyc06g068970, Solyc03g118830	NA	SM000162S02372, SM000010S04184, SM000239S08067, SM000182S03952, SM000015S01289, SM000128S26229	Zci1a_04114, Zci1a_12102	Zci_13092, Zci_05028	UTEX1559_14379, UTEX1559_16050	UTEX1560_09080, UTEX1560_03891	Zm00001d013456
Me1_v2_0215940	N0.HOG0006681	OG0005419	n0	AagrOXF_evm.TU.utg000077l.278	Azfi_s0699.g082607	AT3G63140	Bradi1g54030	CBR_g28014	NA	Cre10.g440050_4532	CLOP_g2583	10357	Me1_v2_0215940	Mp6g11330	16301	Olucimarinus_43341, Olucimarinus_43121	LOC_Os07g11110	NA	pm018855g0010, pm007576g0050, pm002905g0010	Pp3c3_30330	Solyc09g065180	133157, 185868	SM000026S08883, SM000011S18981, SM000048S16593	Zci1a_18812	Zci_08896	UTEX1559_17674, UTEX1559_17673	UTEX1560_17911, UTEX1560_17912	Zm00001d019177
Me1_v2_0096710	N0.HOG0009977	OG0008524	n0	NA	NA	NA	NA	CBR_g38401	Chrsp57S06736	Cre17.g696350_4532	CLOP_g2726, CLOP_g2717	11384, 6591	Me1_v2_0096710	NA	7539	NA	NA	PRCOL_00001507_RA	pm022414g0020, pm009482g0010, pm023188g0020, pm022414g0010, pm004839g0010	NA	NA	NA	NA	Zci1a_41943	Zci_12736	UTEX1559_14769	UTEX1560_01077	NA
Me1_v2_0007820	N0.HOG0039416	OG0037239	-	NA	NA	NA	NA	NA	NA	NA	NA	NA	Me1_v2_0000300, Me1_v2_0007820	NA	NA	NA	NA	NA	NA	NA	NA	NA	NA	NA	NA	NA	NA	NA
Me1_v2_0122690	NA	NA	NA	NA	NA	NA	NA	NA	NA	NA	NA	NA	NA	NA	NA	NA	NA	NA	NA	NA	NA	NA	NA	NA	NA	NA	NA	NA
Me1_v2_0168740	N0.HOG0002476	OG0001652	n0	AagrOXF_evm.TU.utg000020l.145, AagrOXF_evm.TU.utg000063l.200	Azfi_s0028.g023780, Azfi_s0028.g023778, Azfi_s0095.g043588, Azfi_s0001.g000614, Azfi_s0501.g073865	AT1G58180, AT4G33580, AT1G70410, AT1G23730, AT3G01500, AT5G14740	Bradi4g32480, Bradi2g44856, Bradi2g44870	CBR_g24327	Chrsp194S03007, Chrsp78S07695	Cre13.g607350_4532, Cre09.g405750_4532	NA	8652, 8955	Me1_v2_0168740	Mp3g08980, Mp6g07320, Mp8g15740	21353, 6402, 8369	Olucimarinus_8182	LOC_Os09g28910, LOC_Os01g45274	NA	NA	Pp3c2_15140, Pp3c1_19190, Pp3c20_18640, Pp3c24_9430, Pp3c16_19250, Pp3c7_14450	Solyc09g010970, Solyc05g005490, Solyc02g067750, Solyc02g086820	86779, 95906, 25779, 81873, 80889, 102513	NA	NA	NA	NA	NA	Zm00001d020764, Zm00001d005920, Zm00001d044096, Zm00001d011454, Zm00001d044099, Zm00001d044095
Me1_v2_0196110	N0.HOG0007916	OG0006593	n0	AagrOXF_evm.TU.utg000042l.516	Azfi_s0001.g000804	AT1G74880	Bradi2g61410	CBR_g29941	Chrsp115S01683	NA	CLOP_g2455	10723	Me1_v2_0196110	Mp4g21490	10113	NA	LOC_Os01g72950	NA	pm004162g0010, pm001000g0030, pm001129g0030, pm044598g0010, pm032483g0030	Pp3c1_14760	Solyc11g006020	72694	SM000084S23093	Zci1a_06358	Zci_02313	UTEX1559_01217	UTEX1560_12215	Zm00001d011826
Me1_v2_0085790	N0.HOG0005479	OG0004287	n12	AagrOXF_evm.TU.utg000002l.135	Azfi_s0087.g042298	AT1G50450	Bradi4g43280, Bradi4g43257	NA	NA	NA	CLOP_g19795, CLOP_g1733	NA	Me1_v2_0085790	Mp4g00390	NA	NA	LOC_Os12g04260, LOC_Os11g04490	NA	pm031131g0010, pm031794g0010, pm027176g0020, pm047933g0010	Pp3c19_6050	Solyc11g065240	75562	NA	NA	Zci_11582	UTEX1559_14905	UTEX1560_02661	Zm00001d004978
Me1_v2_0124610	N0.HOG0000183	OG0000094	n1	AagrOXF_evm.TU.utg000049l.696, AagrOXF_evm.TU.utg000061l.51, AagrOXF_evm.TU.utg000002l.356	Azfi_s0244.g059925, Azfi_s0492.g073542, Azfi_s0008.g011541, Azfi_s0034.g025408, Azfi_s0018.g014806, Azfi_s0001.g000714, Azfi_s0065.g035758, Azfi_s0144.g051613, Azfi_s0014.g013503, Azfi_s0210.g058099, Azfi_s0083.g038887, Azfi_s0250.g060248, Azfi_s0392.g067758, Azfi_s0244.g059919	AT1G13400, AT1G68480, AT3G23130, AT2G37740, AT5G06070, AT2G42410, AT4G17810, AT3G53820, AT3G09290, AT5G43540, AT3G23140, AT5G27880, AT5G01860, AT5G48890, AT1G80730, AT5G25160, AT5G10970, AT1G24625, AT1G66140, AT5G57520, AT5G14010, AT1G67030, AT1G68360, AT1G10480, AT5G06650, AT3G58070, AT2G41940	Bradi2g02021, Bradi5g00676, Bradi3g18971, Bradi1g59750, Bradi5g19930, Bradi1g52490, Bradi3g55760, Bradi1g75123, Bradi2g31850, Bradi1g06420, Bradi1g58550, Bradi1g76570, Bradi1g76580, Bradi1g58572, Bradi1g58540, Bradi1g58560, Bradi4g01450, Bradi1g68570, Bradi1g22820, Bradi4g03460, Bradi1g14810, Bradi3g19710, Bradi4g37760, Bradi3g42633, Bradi4g30920, Bradi1g31300, Bradi4g30910, Bradi2g58720, Bradi5g11180, Bradi3g06130, Bradi2g02190, Bradi5g01490, Bradi1g69820, Bradi1g46340, Bradi3g57370, Bradi4g31590, Bradi3g37740	CBR_g26503	Chrsp8S08107	NA	CLOP_g13392, CLOP_g3036, CLOP_g3037, CLOP_g3040, CLOP_g3039, CLOP_g13567	3220, 3734, 13054, 8667	Me1_v2_0124610, Me1_v2_0014670	Mp1g25140, Mp3g23440	NA	NA	LOC_Os01g03840, LOC_Os04g08600, LOC_Os02g01090, LOC_Os11g48000, LOC_Os07g01180, LOC_Os05g20930, LOC_Os04g50070, LOC_Os07g23450, LOC_Os02g57550, LOC_Os05g14130, LOC_Os03g05490, LOC_Os03g57240, LOC_Os05g05970, LOC_Os07g05900, LOC_Os12g42250, LOC_Os03g13600, LOC_Os07g40300, LOC_Os12g39220, LOC_Os03g41110, LOC_Os02g08510, LOC_Os08g17640, LOC_Os09g38610, LOC_Os08g44190, LOC_Os09g26210, LOC_Os09g26200, LOC_Os09g26050, LOC_Os09g26100, LOC_Os04g36650, LOC_Os02g35460, LOC_Os01g04120, LOC_Os01g32920, LOC_Os03g11680, LOC_Os06g10470, LOC_Os02g53530, LOC_Os09g27320, LOC_Os08g36110	NA	NA	Pp3c3_21050, Pp3c23_960, Pp3c23_2190, Pp3c20_10790, Pp3c23_861, Pp3c23_800, Pp3c26_13140, Pp3c3_5040, Pp3c2_32900, Pp3c1_8210, Pp3c7_19440, Pp3c11_13030, Pp3c5_6880, Pp3c6_19230, Pp3c17_17640, Pp3c14_21120, Pp3c10_3440	Solyc05g009380, Solyc06g053720, Solyc09g089590.1, Solyc09g011120.1, Solyc08g077000.1, Solyc06g061160.1, Solyc09g089600.1, Solyc09g066250.1, Solyc06g083940.1, Solyc09g011110.1, Solyc10g084910, Solyc03g117070.1, Solyc06g068390.1, Solyc11g011890, Solyc04g014540, Solyc01g005130.2, Solyc10g049870.1, Solyc01g107430.2, Solyc07g006880.1, Solyc00g014800, Solyc05g009180.1, Solyc05g009170, Solyc01g060420.2, Solyc05g006310, Solyc03g113890.1, Solyc10g078990.1, Solyc10g078970.1, Solyc10g080600	424602, 430201, 99518, 76899, 110103, 405772	SM000006S19543, SM000022S07122, SM000116S24263, SM000148S01059, SM000059S18666, SM005561S17879	Zci1a_44212, Zci1a_19090, Zci1a_19092	NA	NA	NA	Zm00001d040006, Zm00001d008532, Zm00001d020430, Zm00001d025051, Zm00001d014917, Zm00001d018605, Zm00001d048590, Zm00001d026034, Zm00001d002494, Zm00001d019487, Zm00001d018510, Zm00001d010415, Zm00001d034359, Zm00001d013118, Zm00001d018816, Zm00001d031079, Zm00001d028371, Zm00001d047968, Zm00001d006754, Zm00001d016069, Zm00001d022022, Zm00001d025350, Zm00001d002745, Zm00001d039773, Zm00001d052006, Zm00001d035262, Zm00001d035257, Zm00001d006367, Zm00001d030850, Zm00001d041332, Zm00001d033363, Zm00001d013743, Zm00001d015525, Zm00001d050143, Zm00001d021386, Zm00001d031985, Zm00001d020577, Zm00001d005788, Zm00001d020575, Zm00001d020574, Zm00001d020573, Zm00001d005787, Zm00001d005786, Zm00001d047169, Zm00001d025485, Zm00001d003573, Zm00001d039977, Zm00001d008562, Zm00001d045738, Zm00001d028222, Zm00001d037136, Zm00001d044980, Zm00001d052118, Zm00001d018247, Zm00001d020653, Zm00001d005837, Zm00001d050111
Me1_v2_0212720	N0.HOG0000756	OG0000417	n0	AagrOXF_evm.TU.utg000100l.237, AagrOXF_evm.TU.utg000042l.299	Azfi_s0001.g000116, Azfi_s0174.g055941, Azfi_s0242.g059839, Azfi_s0065.g035970, Azfi_s0074.g037404	AT5G20710, AT2G04060, AT1G31740, AT2G04062, AT4G38590, AT2G16730, AT4G35010, AT5G63800, AT1G77410, AT5G63810, AT2G28470, AT1G45130, AT4G36360, AT5G56870, AT3G52840, AT4G26140, AT3G13750, AT2G32810	Bradi3g49460, Bradi2g39446, Bradi2g40450, Bradi4g36517, Bradi3g42330, Bradi2g56597, Bradi2g24670, Bradi2g56607, Bradi1g67760, Bradi1g74050, Bradi3g08180, Bradi1g37450, Bradi2g41830, Bradi4g07990	NA	Chrsp33S05000	NA	NA	10233	Me1_v2_0080810, Me1_v2_0145120, Me1_v2_0200370, Me1_v2_0200350, Me1_v2_0200380, Me1_v2_0037280, Me1_v2_0212720, Me1_v2_0145130	Mp4g01390, Mp5g19950, Mp2g15660	7395, 7396	NA	LOC_Os01g34920, LOC_Os10g19960, LOC_Os10g18400, LOC_Os06g42310, LOC_Os09g36810, LOC_Os08g43570, LOC_Os05g35360, LOC_Os01g65460, LOC_Os03g15020, LOC_Os03g06940, LOC_Os02g12730, LOC_Os06g37560, LOC_Os01g39830, LOC_Os12g24170	NA	pm017541g0010	Pp3c9_9350, Pp3c15_7520, Pp3c15_7440, Pp3c23_9010	Solyc07g038130, Solyc03g093750, Solyc07g042220, Solyc10g055470, Solyc01g111540, Solyc11g018490, Solyc11g018500, Solyc03g019890, Solyc02g078950, Solyc11g069270, Solyc04g080840, Solyc01g110000, Solyc02g084720, Solyc07g038120.1, Solyc12g008840, Solyc12g044880, Solyc06g062580, Solyc03g121540, Solyc09g092160.2	413650, 404798, 269483	SM000077S21624, SM000040S14847, SM000055S18294, SM000055S18314, SM000040S14863, SM000077S21595	NA	NA	NA	NA	Zm00001d004481, Zm00001d043393, Zm00001d022621, Zm00001d006243, Zm00001d032022, Zm00001d053225, Zm00001d042656, Zm00001d010212, Zm00001d042654, Zm00001d028474, Zm00001d048783, Zm00001d048440, Zm00001d027803, Zm00001d053585, Zm00001d046357, Zm00001d043977, Zm00001d044290, Zm00001d041880
Me1_v2_0209020	N0.HOG0003161	OG0002236	n0	AagrOXF_evm.TU.utg000125l.85	Azfi_s0207.g057939	AT1G18180, AT1G73650	Bradi1g11150	CBR_g19480, CBR_g30737	Chrsp29S00344	Cre09.g401701_4532	CLOP_g13580, CLOP_g16523	8303, 244	Me1_v2_0209010, Me1_v2_0209020	Mp3g23330, Mp4g01590, Mp7g02070	22708	Olucimarinus_34095	LOC_Os03g50070	PRCOL_00001152_RA	pm000128g0100, pm008833g0040, pm006163g0010, pm017992g0020, pm008902g0030	Pp3c10_10850, Pp3c14_25340, Pp3c13_4300	Solyc06g068970, Solyc03g118830	NA	SM000162S02372, SM000010S04184, SM000239S08067, SM000182S03952, SM000015S01289, SM000128S26229	Zci1a_04114, Zci1a_12102	Zci_13092, Zci_05028	UTEX1559_14379, UTEX1559_16050	UTEX1560_09080, UTEX1560_03891	Zm00001d013456
Me1_v2_0219730	N0.HOG0006054	OG0004821	n7	AagrOXF_evm.TU.utg000100l.86	Azfi_s0314.g064254	AT3G50685	NA	CBR_g37409	Chrsp122S01811	Cre01.g043200_4532	CLOP_g8475	8689	Me1_v2_0219730	Mp2g25140	NA	NA	NA	NA	pm017962g0010, pm036536.t1, pm079529g0010, pm002903g0040, pm012806g0020	Pp3c15_7720	Solyc03g034070.1	69258, 9237	SM000141S00909, SM000010S04392, SM000190S04843	Zci1a_04657	Zci_04057	UTEX1559_05500	UTEX1560_02476	NA
Me1_v2_0037930	NA	NA	NA	NA	NA	NA	NA	NA	NA	NA	NA	NA	NA	NA	NA	NA	NA	NA	NA	NA	NA	NA	NA	NA	NA	NA	NA	NA
Me1_v2_0053360	N0.HOG0004401	OG0003322	n0	AagrOXF_evm.TU.utg000005l.260	Azfi_s0033.g024994, Azfi_s1377.g102416, Azfi_s1377.g102415	AT5G57590	Bradi3g18970	CBR_g30689	Chrsp110S08633, Chrsp110S01539	Cre06.g277200_4532	CLOP_g25084, CLOP_g5421	9750	Me1_v2_0006130, Me1_v2_0053360	Mp1g24220	28704	Olucimarinus_597, Olucimarinus_591	LOC_Os08g14770	NA	pm003528g0060, pm003528g0040, pm042704g0020, pm007162g0020	Pp3c17_24020	Solyc07g006810	413615	SM000095S24982, SM000012S25372, SM000356S13441	Zci1a_18500, Zci1a_03196	Zci_10418	UTEX1559_01769	UTEX1560_11293, UTEX1560_19098, UTEX1560_11292	Zm00001d024159
Me1_v2_0214810	N0.HOG0028991	OG0026814	-	NA	NA	NA	NA	NA	NA	NA	NA	NA	Me1_v2_0214810	NA	NA	NA	NA	NA	pm063518g0010	NA	NA	NA	SM004340S15766	NA	NA	NA	NA	NA
Me1_v2_0209430	N0.HOG0009545	OG0008120	n0	NA	NA	NA	NA	CBR_g51244	Chrsp24S03848	Cre06.g294650_4532	CLOP_g17673, CLOP_g188, CLOP_g17674, CLOP_g189	5660, 4039	Me1_v2_0209430, Me1_v2_0210480	NA	23569	NA	NA	NA	pm011202g0010, pm007418g0040, pm004012g0010, pm005186g0020, pm160543g0010	NA	NA	NA	NA	Zci1a_21572	Zci_02802	UTEX1559_03201	UTEX1560_05407	NA
Me1_v2_0137270	NA	NA	NA	NA	NA	NA	NA	NA	NA	NA	NA	NA	NA	NA	NA	NA	NA	NA	NA	NA	NA	NA	NA	NA	NA	NA	NA	NA
Me1_v2_0096610	N0.HOG0003876	OG0002862	n0	AagrOXF_evm.TU.utg000012l.41	Azfi_s0004.g008649, Azfi_s0821.g087994	AT2G26080, AT4G33010	Bradi2g48010	CBR_g3314	Chrsp17S08742	Cre12.g534800_4532	CLOP_g19605, CLOP_g23784	13346	Me1_v2_0096610, Me1_v2_0094790	Mp7g08890	15288, 15286, 15287	Olucimarinus_26284	LOC_Os01g51410, LOC_Os06g40940	PRCOL_00000289_RA	pm000201g0090, pm012353g0010, pm008730g0020	Pp3c27_5030, Pp3c16_4550, Pp3c16_4520, Pp3c6_5810	Solyc08g065220	153563	SM000055S18247, SM000185S04057, SM000261S09970	Zci1a_14158, Zci1a_31449	Zci_07724	UTEX1559_06873	UTEX1560_12204, UTEX1560_12202	Zm00001d023437
Me1_v2_0126970	N0.HOG0003045	OG0002135	n0	AagrOXF_evm.TU.utg000059l.293	Azfi_s0093.g043340	AT1G32470, AT2G35370, AT2G35120	Bradi3g30500, Bradi3g05240	CBR_g50432	Chrsp22S00251, Chrsp46S06097, Chrsp7S07747	Cre06.g253350_4532	CLOP_g5005	3302	Me1_v2_0126970	Mp3g05780	20858	Olucimarinus_27674	LOC_Os10g37180, LOC_Os06g45670, LOC_Os02g07410	PRCOL_00006134_RA	pm001010g0060, pm004084g0030, pm000330g0060, pm014964g0010	Pp3c8_16640, Pp3c21_11620, Pp3c19_11600	Solyc08g007040, Solyc06g061070, Solyc02g068740	113331	SM000023S07675, SM000001S04440, SM000034S12699	Zci1a_24764, Zci1a_22501	Zci_00928	UTEX1559_07991	UTEX1560_00153	Zm00001d023699, Zm00001d000064, Zm00001d019077, Zm00001d047085, Zm00001d015378, Zm00001d048974, Zm00001d053800
Me1_v2_0083570	N0.HOG0039664	OG0037487	-	NA	NA	NA	NA	NA	NA	NA	NA	NA	Me1_v2_0083610, Me1_v2_0083570	NA	NA	NA	NA	NA	NA	NA	NA	NA	NA	NA	NA	NA	NA	NA
Me1_v2_0040310	N0.HOG0003965	OG0002942	n0	AagrOXF_evm.TU.utg000111l.24	Azfi_s0173.g055869, Azfi_s0202.g057624, Azfi_s0284.g063091	AT1G16880, AT5G04740	Bradi3g18820, Bradi4g42320	CBR_g48396	Chrsp35S00401	Cre01.g061077_4532	CLOP_g2167, CLOP_g8637	13594	Me1_v2_0040310	Mp7g00560	21489	Olucimarinus_6465	LOC_Os08g14440, LOC_Os12g05650	PRCOL_00002694_RA	pm008824g0020, pm011934.t1	Pp3c9_8920, Pp3c15_10370	Solyc06g068670, Solyc03g117890, Solyc11g006970	97374, 101399	SM000136S00174, SM000097S24807, SM000134S26935	Zci1a_20443	Zci_06807	UTEX1559_02233	UTEX1560_06789	Zm00001d014192, Zm00001d023423, Zm00001d000094, Zm00001d044713
Me1_v2_0065050	N0.HOG0002177	OG0001411	n0	AagrOXF_evm.TU.utg000002l.200, AagrOXF_evm.TU.utg000002l.199, AagrOXF_evm.TU.utg000024l.284, AagrOXF_evm.TU.utg000002l.201, AagrOXF_evm.TU.utg000091l.313, AagrOXF_evm.TU.utg000050l.264, AagrOXF_evm.TU.utg000091l.314, AagrOXF_evm.TU.utg000091l.309, AagrOXF_evm.TU.utg000091l.312, AagrOXF_evm.TU.utg000018l.486, AagrOXF_evm.TU.utg000018l.489, AagrOXF_evm.TU.utg000018l.537, AagrOXF_evm.TU.utg000005l.305, AagrOXF_evm.TU.utg000018l.536, AagrOXF_evm.TU.utg000018l.538, AagrOXF_evm.TU.utg000018l.535, AagrOXF_evm.TU.utg000018l.534, AagrOXF_evm.TU.utg000018l.539, AagrOXF_evm.TU.utg000018l.533, AagrOXF_evm.TU.utg000060l.27, AagrOXF_evm.TU.utg000077l.365, AagrOXF_evm.TU.utg000077l.392	Azfi_s0173.g055760, Azfi_s0065.g035744, Azfi_s0065.g035746	NA	NA	NA	NA	Cre06.g256350_4532, Cre17.g703950_4532, Cre17.g704000_4532	CLOP_g14539, CLOP_g9027	NA	Me1_v2_0057450, Me1_v2_0065040, Me1_v2_0065050	Mp1g20460	15133	NA	NA	NA	pm019739g0010, pm014541g0020, pm013553g0010, pm001475g0090, pm001843g0080, pm002919g0030, pm021026g0010, pm006849g0040, pm041381g0010, pm002572g0030, pm015620g0010, pm001766.t1, pm020182g0030	Pp3c17_5070	Solyc01g010690.1, Solyc05g055650	437427, 441782, 442588, 438508, 438505, 405158, 442586, 423793	NA	NA	NA	NA	NA	NA
Me1_v2_0041040	N0.HOG0002955	OG0002054	n0	AagrOXF_evm.TU.utg000080l.113	NA	AT2G16990, AT2G16970, AT2G16980, AT5G42210	Bradi3g51280, Bradi3g32390, Bradi4g42530, Bradi4g42523	NA	Chrsp66S07262, Chrsp32S08945	Cre16.g656150_4532	CLOP_g14000, CLOP_g12191, CLOP_g12439, CLOP_g12440	7848	Me1_v2_0041040, Me1_v2_0213500, Me1_v2_0213510, Me1_v2_0169650, Me1_v2_0210040, Me1_v2_0210030	Mp4g04950	19930, 9729	NA	LOC_Os02g44730, LOC_Os05g24140, LOC_Os11g05390	NA	pm017007g0010, pm001180g0030	Pp3s914_10	Solyc10g055770, Solyc01g111840, Solyc07g026920.1, Solyc04g081990, Solyc12g094400, Solyc11g007130, Solyc11g007140	167756	SM000013S26598, SM000140S00615, SM000179S03417	NA	Zci_12550	UTEX1559_10959	UTEX1560_11351	Zm00001d017536, Zm00001d029803, Zm00001d052532
Me1_v2_0034920	N0.HOG0005197	OG0004030	n0	AagrOXF_evm.TU.utg000006l.496, AagrOXF_evm.TU.utg000049l.764	Azfi_s0003.g007465	AT3G27160, AT5G63300	Bradi3g06530	CBR_g8368	Chrsp50S06436, Chrsp50S06437	NA	CLOP_g15970, CLOP_g21052	NA	Me1_v2_0034920	Mp4g21580, Mp4g00420	NA	Olucimarinus_26982	LOC_Os02g09590	PRCOL_00002490_RA	pm011693g0010, pm000874g0030, pm005884g0010	Pp3c10_22890, Pp3c20_22830, Pp3c23_14280, Pp3c24_1550	Solyc02g068090, Solyc03g110930	444102	SM000010S04181, SM000162S02385	Zci1a_34544	Zci_00232	UTEX1559_07154	UTEX1560_02397	Zm00001d053713, Zm00001d015628
Me1_v2_0170000	N0.HOG0002862	OG0001978	n0	AagrOXF_evm.TU.utg000083l.412, AagrOXF_evm.TU.utg000083l.413, AagrOXF_evm.TU.utg000033l.94, AagrOXF_evm.TU.utg000085l.53	Azfi_s0003.g008118, Azfi_s1152.g098436, Azfi_s2661.g112535	AT2G19930, AT2G19920, AT2G19910	NA	CBR_g52061	NA	Cre03.g206950_4532	CLOP_g21165, CLOP_g16108	2781	Me1_v2_0107120, Me1_v2_0107130, Me1_v2_0169980, Me1_v2_0169990, Me1_v2_0170000, Me1_v2_0190100, Me1_v2_0190060	Mp5g10330, Mp5g10380	NA	NA	LOC_Os01g10130, LOC_Os01g10140	NA	pm030013.t1, pm001836g0010, pm024565.t1, pm021406g0010, pm026171g0010, pm008103.t2, pm016927g0010, pm024529g0010	Pp3c17_9050, Pp3c5_20740, Pp3c6_8520, Pp3c6_8521	Solyc06g051190, Solyc12g008420	413790	NA	Zci1a_07397, Zci1a_07400, Zci1a_07398	Zci_07056	UTEX1559_09611	NA	Zm00001d004416, Zm00001d004418, Zm00001d004415, Zm00001d004419
Me1_v2_0145480	N0.HOG0002232	OG0001458	n0	AagrOXF_evm.TU.utg000063l.199, AagrOXF_evm.TU.utg000005l.242	Azfi_s0061.g034873, Azfi_s0081.g038618, Azfi_s0390.g067700	AT5G16710, AT1G19570, AT1G19550, AT1G75270	Bradi1g45010, Bradi2g37480	CBR_g22068	Chrsp37S09013, Chrsp27S00317	Cre10.g456750_4532	CLOP_g15337	3876, 1582	Me1_v2_0145480, Me1_v2_0201770	Mp2g15490, Mp3g09320	24769	NA	LOC_Os06g12630, LOC_Os05g02530	NA	pm000481g0010, pm002134g0010	Pp3c20_23200, Pp3c22_5470, Pp3c15_21480	Solyc11g011250, Solyc05g054760, Solyc11g039930, Solyc04g064470, Solyc09g056180, Solyc05g013950.1, Solyc06g075520	271409, 233824, 139875, 130267	SM000068S20585, SM000056S17925, SM000217S06840, SM000001S04475, SM000079S22460	Zci1a_06859, Zci1a_24071, Zci1a_42128	Zci_06835	UTEX1559_01830, UTEX1559_05671	UTEX1560_03797, UTEX1560_06018	Zm00001d037240, Zm00001d011035, Zm00001d035595, Zm00001d011034
Me1_v2_0149990	N0.HOG0010116	OG0008646	n0	AagrOXF_evm.TU.utg000003l.149	NA	NA	NA	NA	NA	NA	NA	NA	Me1_v2_0114670, Me1_v2_0149990	Mp4g15740, Mp4g15750, Mp4g15760	NA	NA	NA	NA	NA	Pp3c4_16930, Pp3c13_24110, Pp3c3_25740, Pp3c22_650, Pp3c19_5170	NA	445928	SM000378S14271, SM000003S11162, SM000417S15263	Zci1a_03939	Zci_04930	UTEX1559_04141	NA	NA
Me1_v2_0219540	N0.HOG0002312	OG0001521	n1	AagrOXF_evm.TU.utg000024l.402	Azfi_s0288.g063215, Azfi_s0002.g003227	AT3G25530	Bradi3g46080	NA	NA	Cre11.g467617_4532	NA	5493	Me1_v2_0108150, Me1_v2_0219540	Mp5g18640	NA	NA	LOC_Os02g35500	PRCOL_00004451_RA	NA	Pp3c23_12960	Solyc09g018790	NA	SM000024S07724, SM000003S11114, SM000100S09411	NA	Zci_11800	UTEX1559_03322	UTEX1560_16834	Zm00001d050810
Me1_v2_0113570	N0.HOG0012740	OG0011055	n0	AagrOXF_evm.TU.utg000012l.272	NA	NA	NA	NA	Chrsp122S01807	NA	NA	5450	Me1_v2_0101400, Me1_v2_0113570	Mp1g09070	NA	Olucimarinus_31635	NA	NA	NA	Pp3c13_16550	NA	NA	NA	Zci1a_30038	NA	UTEX1559_16721	UTEX1560_17209	NA
Me1_v2_0079310	N0.HOG0001932	OG0001223	n0	AagrOXF_evm.TU.utg000124l.103, AagrOXF_evm.TU.utg000091l.299	Azfi_s0019.g015014, Azfi_s0008.g011403, Azfi_s0038.g026365	AT3G14420, AT3G14415, AT4G18360, AT3G14130, AT3G14150	Bradi5g22250, Bradi1g06430, Bradi1g58480, Bradi1g20870	CBR_g19595	Chrsp50S06481	Cre03.g171300_4532	CLOP_g20224	12047, 8799	Me1_v2_0079310	Mp1g01210, Mp6g17970	21809, 21810	Olucimarinus_37603	LOC_Os04g53210, LOC_Os04g53214, LOC_Os03g57220, LOC_Os07g05820, LOC_Os07g42440	PRCOL_00005379_RA, PRCOL_00006770_RA	pm008843g0020, pm001225g0010, pm002462g0010, pm046866g0010	Pp3c22_7690, Pp3c10_6670, Pp3c18_20200, Pp3c19_3840, Pp3c4_29460	Solyc07g056540, Solyc10g007600, Solyc08g048250, Solyc03g122170, Solyc03g122130, Solyc03g122150, Solyc03g122140, Solyc03g122160.1	266585, 402239	SM000135S26997, SM000029S10544, SM000189S04115	Zci1a_14802, Zci1a_14989	Zci_09119	UTEX1559_13646	UTEX1560_10896	Zm00001d002261, Zm00001d002260, Zm00001d018810, Zm00001d006868
Me1_v2_0130560	N0.HOG0002816	OG0001936	n0	NA	NA	NA	NA	NA	NA	NA	NA	NA	Me1_v2_0129310, Me1_v2_0097260, Me1_v2_0097310, Me1_v2_0097250, Me1_v2_0097280, Me1_v2_0167150, Me1_v2_0148470, Me1_v2_0105810, Me1_v2_0145900, Me1_v2_0130560, Me1_v2_0139370, Me1_v2_0181010, Me1_v2_0167460, Me1_v2_0167540, Me1_v2_0167560, Me1_v2_0147240, Me1_v2_0147170, Me1_v2_0147180, Me1_v2_0147270, Me1_v2_0147150, Me1_v2_0147440, Me1_v2_0147660, Me1_v2_0070750, Me1_v2_0147160, Me1_v2_0147280, Me1_v2_0147090, Me1_v2_0147110, Me1_v2_0147680, Me1_v2_0147720, Me1_v2_0147450, Me1_v2_0147520, Me1_v2_0147550, Me1_v2_0080970, Me1_v2_0200600, Me1_v2_0091160, Me1_v2_0219400, Me1_v2_0151890, Me1_v2_0075730, Me1_v2_0211900, Me1_v2_0032330, Me1_v2_0129330, Me1_v2_0105900, Me1_v2_0137160, Me1_v2_0137250, Me1_v2_0129320, Me1_v2_0156340, Me1_v2_0108190, Me1_v2_0195710, Me1_v2_0158930, Me1_v2_0167200, Me1_v2_0167160	NA	NA	NA	NA	NA	NA	NA	NA	NA	NA	NA	NA	NA	NA	NA
Me1_v2_0067320	N0.HOG0003094	OG0002180	n0	AagrOXF_evm.TU.utg000032l.7, AagrOXF_evm.TU.utg000003l.602, AagrOXF_evm.TU.utg000003l.598, AagrOXF_evm.TU.utg000045l.133, AagrOXF_evm.TU.utg000045l.138, AagrOXF_evm.TU.utg000100l.194	Azfi_s0045.g029989	AT1G30910, AT5G44720	Bradi4g37990, Bradi4g37993	NA	Chrsp17S02681	Cre09.g389089_4532	CLOP_g16269	10332	Me1_v2_0029070, Me1_v2_0067330, Me1_v2_0026520, Me1_v2_0067320	Mp3g13890	23431	Olucimarinus_18206	LOC_Os09g38772, LOC_Os09g38777	PRCOL_00004579_RA	pm023716g0010, pm028148g0010, pm001608g0010	Pp3c12_23100, Pp3c20_4970	Solyc02g081880, Solyc01g044375.1, Solyc01g044370	228256	SM000001S04496, SM000070S21304, SM000079S22471, SM000116S24249, SM000006S19528, SM000022S07126	Zci1a_10340	Zci_00423	UTEX1559_07307	UTEX1560_01689	Zm00001d006342, Zm00001d006341, Zm00001d006340
Me1_v2_0040090	NA	NA	NA	NA	NA	NA	NA	NA	NA	NA	NA	NA	NA	NA	NA	NA	NA	NA	NA	NA	NA	NA	NA	NA	NA	NA	NA	NA
Me1_v2_0104050	NA	NA	NA	NA	NA	NA	NA	NA	NA	NA	NA	NA	NA	NA	NA	NA	NA	NA	NA	NA	NA	NA	NA	NA	NA	NA	NA	NA
Me1_v2_0132780	NA	NA	NA	NA	NA	NA	NA	NA	NA	NA	NA	NA	NA	NA	NA	NA	NA	NA	NA	NA	NA	NA	NA	NA	NA	NA	NA	NA
Me1_v2_0159820	N0.HOG0000063	OG0000021	n45	NA	NA	NA	Bradi1g30037	NA	NA	NA	CLOP_g10053, CLOP_g21853, CLOP_g637, CLOP_g16924, CLOP_g6901	6924, 6925	Me1_v2_0102110, Me1_v2_0159800, Me1_v2_0159820	NA	NA	NA	NA	NA	pm002980g0070, pm017428g0020, pm021224g0010, pm013590g0020, pm001404.t1, pm005971g0020, pm005060.t1, pm005345.t1, pm005939.t1, pm018859.t1	NA	NA	NA	NA	Zci1a_31501, Zci1a_44604, Zci1a_40602, Zci1a_40600, Zci1a_21698, Zci1a_40599, Zci1a_04589, Zci1a_05207, Zci1a_41991, Zci1a_30834, Zci1a_03990	Zci_02335, Zci_02337, Zci_06491, Zci_06489, Zci_15801, Zci_06466, Zci_06506, Zci_06521, Zci_15171, Zci_06509	UTEX1559_01194, UTEX1559_01192, UTEX1559_01296, UTEX1559_01294, UTEX1559_18884, UTEX1559_01268, UTEX1559_01317, UTEX1559_01338, UTEX1559_11338, UTEX1559_08112, UTEX1559_01321	UTEX1560_19581, UTEX1560_08322, UTEX1560_19478, UTEX1560_18490, UTEX1560_07734, UTEX1560_11731, UTEX1560_01730, UTEX1560_14969, UTEX1560_01712	NA
Me1_v2_0080360	N0.HOG0003521	OG0002545	n0	AagrOXF_evm.TU.utg000113l.71	Azfi_s0042.g026849	AT2G25490, AT5G25350	Bradi3g07397, Bradi1g36530, Bradi4g10715	CBR_g8969	NA	NA	CLOP_g12350	7375	Me1_v2_0037840, Me1_v2_0080360	Mp8g05840	1166, 22613	NA	LOC_Os09g32169, LOC_Os02g10700, LOC_Os06g40360	NA	pm000083g0030, pm000776g0020, pm001826g0050, pm008711g0010, pm002617g0010, pm003393g0030, pm012507g0010, pm003155g0010, pm006313g0020	Pp3c4_4760, Pp3c12_11790	Solyc12g009560, Solyc07g008250, Solyc05g008730.1, Solyc05g008700, Solyc08g060810, Solyc06g049010	233861, 62165	NA	NA	NA	NA	NA	Zm00001d053642, Zm00001d015778, Zm00001d028552, Zm00001d037295, Zm00001d039723, Zm00001d036880, Zm00001d000408
Me1_v2_0115230	NA	NA	NA	NA	NA	NA	NA	NA	NA	NA	NA	NA	NA	NA	NA	NA	NA	NA	NA	NA	NA	NA	NA	NA	NA	NA	NA	NA
Me1_v2_0212800	N0.HOG0010289	OG0008807	n0	NA	NA	NA	NA	CBR_g57530, CBR_g58653	Chrsp31S04863	Cre04.g224100_4532	CLOP_g14526, CLOP_g17490	7054	Me1_v2_0024920, Me1_v2_0014990, Me1_v2_0212800	NA	NA	Olucimarinus_28809	NA	PRCOL_00001770_RA	NA	NA	NA	NA	NA	Zci1a_11630	Zci_14706	UTEX1559_03313, UTEX1559_03310, UTEX1559_03312	UTEX1560_06433	NA
Me1_v2_0031600	NA	NA	NA	NA	NA	NA	NA	NA	NA	NA	NA	NA	NA	NA	NA	NA	NA	NA	NA	NA	NA	NA	NA	NA	NA	NA	NA	NA
Me1_v2_0104850	N0.HOG0003459	OG0002492	n0	AagrOXF_evm.TU.utg000009l.20	Azfi_s0194.g057192, Azfi_s0185.g056622	AT3G10405	Bradi3g32497	CBR_g28804	Chrsp12S02042	Cre10.g464650_4532	CLOP_g8691, CLOP_g25135	7201	Me1_v2_0104850, Me1_v2_0206190	Mp3g12460	1776	Olucimarinus_32585, Olucimarinus_10250	LOC_Os10g39800	PRCOL_00002171_RA	pm013932g0020, pm002086g0030, pm002132g0010, pm003742g0060, pm021524g0030	Pp3c2_18450, Pp3c14_2640	Solyc05g055550, Solyc02g033060	438354	SM000010S04348, SM000001S04694, SM000190S04878, SM000144S00704, SM000015S01226, SM000015S01286	Zci1a_36248, Zci1a_02942, Zci1a_40375	Zci_04026	UTEX1559_04918, UTEX1559_04915, UTEX1559_04916	UTEX1560_03314	Zm00001d029809
Me1_v2_0111480	NA	NA	NA	NA	NA	NA	NA	NA	NA	NA	NA	NA	NA	NA	NA	NA	NA	NA	NA	NA	NA	NA	NA	NA	NA	NA	NA	NA
Me1_v2_0182740	N0.HOG0003499	OG0002523	n0	AagrOXF_evm.TU.utg000050l.691	Azfi_s0007.g010542	AT3G04790, AT2G01290, AT1G71100	Bradi1g55740, Bradi5g05070	CBR_g50124, CBR_g39237, CBR_g28662	Chrsp103S01106	Cre03.g187450_4532	CLOP_g21167	12731	Me1_v2_0182760, Me1_v2_0182740	Mp8g18400	19241	Olucimarinus_12567	LOC_Os07g08030, LOC_Os04g24140	PRCOL_00001287_RA	pm002532g0030, pm009312g0010, pm002142g0010, pm000734g0130	Pp3c5_21490, Pp3c16_10280	Solyc09g059710, Solyc04g047740, Solyc01g097460, Solyc05g008370, Solyc09g059720.1	74055	SM000047S16828, SM000046S16352, SM001185S25540	Zci1a_07387	Zci_01421	UTEX1559_05827	UTEX1560_01146	Zm00001d018936, Zm00001d030701, Zm00001d052482
Me1_v2_0087380	NA	NA	NA	NA	NA	NA	NA	NA	NA	NA	NA	NA	NA	NA	NA	NA	NA	NA	NA	NA	NA	NA	NA	NA	NA	NA	NA	NA
Me1_v2_0115240	N0.HOG0007352	OG0006058	n0	AagrOXF_evm.TU.utg000058l.19	Azfi_s0055.g033944	AT2G40400, AT3G56140	Bradi2g53780, Bradi2g22466	CBR_g38031	Chrsp127S01934	NA	CLOP_g23069, CLOP_g9474, CLOP_g12774, CLOP_g9473, CLOP_g6608	13356	Me1_v2_0115240	Mp6g12840	6472, 6473	NA	LOC_Os01g61120, LOC_Os05g39680	NA	pm021193g0010	Pp3c8_1750, Pp3c2_20491, Pp3c3_35080	Solyc06g050620	177305	NA	Zci1a_29915	NA	NA	NA	Zm00001d043023, Zm00001d010606
Me1_v2_0054570	N0.HOG0005203	OG0004036	n0	AagrOXF_evm.TU.utg000006l.181	Azfi_s0175.g056007	AT1G45170, AT5G42960	Bradi1g01047	CBR_g28516, CBR_g49402	Chrsp17S02530, Chrsp17S02769	NA	CLOP_g3121	13050	Me1_v2_0054570	Mp8g07780	23899	NA	LOC_Os03g63860	NA	pm000166g0060, pm002885.t1, pm002089g0100, pm052856g0010	Pp3c9_25170, Pp3c15_24440	Solyc04g080190, Solyc12g089100	90284, 115557, 231401	SM000085S23207, SM003614S13758, SM000128S26204	Zci1a_14664	Zci_13091	UTEX1559_14380	UTEX1560_09082	Zm00001d034890, Zm00001d012820
Me1_v2_0191530	N0.HOG0010916	OG0009383	n0	NA	NA	NA	NA	NA	NA	NA	CLOP_g2906, CLOP_g15447	NA	Me1_v2_0191530, Me1_v2_0201590, Me1_v2_0230840	Mp4g09470	NA	NA	NA	NA	NA	Pp3c2_16926, Pp3c13_10510	NA	407694	SM000047S16895, SM000046S16427, SM000066S20463	Zci1a_35166	Zci_09610	UTEX1559_09915	UTEX1560_06679	NA
Me1_v2_0156370	NA	NA	NA	NA	NA	NA	NA	NA	NA	NA	NA	NA	NA	NA	NA	NA	NA	NA	NA	NA	NA	NA	NA	NA	NA	NA	NA	NA
Me1_v2_0104040	NA	NA	NA	NA	NA	NA	NA	NA	NA	NA	NA	NA	NA	NA	NA	NA	NA	NA	NA	NA	NA	NA	NA	NA	NA	NA	NA	NA
Me1_v2_0090870	N0.HOG0005969	OG0004746	n0	AagrOXF_evm.TU.utg000050l.690	Azfi_s0069.g036525	AT1G08380	Bradi5g09530	NA	Chrsp91S08169	Cre07.g334550_4532	CLOP_g15190	15317, 8779	Me1_v2_0090870	Mp8g01210	5924	Olucimarinus_14386	LOC_Os04g33830	NA	pm004066g0020, pm010450g0020, pm004441g0040, pm043234g0010, pm014288g0010, pm020205g0010, pm003295.t1, pm013476g0030	Pp3c15_16700, Pp3c15_16690	Solyc06g074200	104218	SM000017S02827, SM000202S05865	Zci1a_21340	Zci_06449	UTEX1559_04985	UTEX1560_07459	Zm00001d003767
Me1_v2_0080650	N0.HOG0000156	OG0000079	n0	AagrOXF_evm.TU.utg000006l.466, AagrOXF_evm.TU.utg000018l.465	Azfi_s0065.g035896, Azfi_s0558.g076910, Azfi_s0006.g009889, Azfi_s0002.g002245	AT1G66340, AT2G40940, AT3G04580, AT3G23150, AT1G04310	Bradi2g35080, Bradi4g00200, Bradi1g11540, Bradi3g55730, Bradi5g00700, Bradi3g57807, Bradi3g56550	CBR_g38370, CBR_g11900, CBR_g20397, CBR_g21948	Chrsp171S08708, Chrsp107S01335, Chrsp10S01505, Chrsp44S05868, Chrsp12S02074	Cre06.g251250_4532	CLOP_g1776, CLOP_g22320, CLOP_g2880, CLOP_g4552, CLOP_g22321, CLOP_g24853, CLOP_g24804, CLOP_g4948, CLOP_g12752, CLOP_g7159, CLOP_g18423, CLOP_g13561, CLOP_g13562, CLOP_g18764, CLOP_g13581, CLOP_g15996, CLOP_g18586, CLOP_g21428, CLOP_g22106, CLOP_g20778, CLOP_g24051, CLOP_g24050, CLOP_g24048, CLOP_g18582, CLOP_g21417, CLOP_g21416, CLOP_g20924, CLOP_g14212, CLOP_g2025, CLOP_g8049, CLOP_g7605	13422, 11894, 7032, 10338, 12710, 167, 2371, 14685, 15197, 8573, 1377, 12424, 7867	Me1_v2_0022500, Me1_v2_0014900, Me1_v2_0191630, Me1_v2_0035000, Me1_v2_0041310, Me1_v2_0116850, Me1_v2_0117320, Me1_v2_0218300, Me1_v2_0218310, Me1_v2_0182790, Me1_v2_0098360, Me1_v2_0084500, Me1_v2_0232970, Me1_v2_0199310, Me1_v2_0210400, Me1_v2_0080650, Me1_v2_0229010	Mp2g01150, Mp1g08860, Mp1g19450, Mp5g01220, Mp2g15100	1431, 13508, 13509, 22688, 6784, 27833, 21951, 21952, 21953, 7365, 26312, 6544	Olucimarinus_9098, Olucimarinus_1394, Olucimarinus_9190	LOC_Os05g06320, LOC_Os03g49500, LOC_Os02g57530, LOC_Os06g38130, LOC_Os04g08740, LOC_Os07g15540	PRCOL_00006692_RA	pm000102.t1, pm004977g0040, pm019014g0020, pm000084g0040, pm011842g0010, pm000448g0040, pm005970g0040, pm003012g0040, pm216759g0010, pm077130g0010, pm007787g0030, pm006870g0010, pm009493g0010, pm009493g0020, pm006870g0020, pm001088g0040, pm003637g0010, pm001088g0050, pm008070g0010, pm000166.t4, pm033887g0010, pm000068g0050, pm006863g0030, pm004565g0030, pm019822g0010, pm011660g0040, pm054011.t1, pm008656g0010, pm001393.t2, pm001393.t1, pm007403g0010, pm002246g0010, pm007826g0010, pm001625g0010, pm003559g0010, pm000568g0070, pm059798g0010, pm004399g0050	Pp3c1_29330, Pp3c27_3830, Pp3c16_13660, Pp3c13_1440, Pp3c3_1510, Pp3c4_27560, Pp3c4_27580	Solyc07g056580, Solyc12g011330, Solyc09g075440, Solyc11g006150.1, Solyc05g055070, Solyc11g006180, Solyc09g089610, Solyc06g053710	100467, 3025, 14315, 84824, 267662, 110685, 230881, 97396, 120989, 7704	SM000070S21373, SM000001S04544, SM000159S01758, SM000110S18896, SM000104S09338, SM000176S03155, SM000145S00822, SM000021S06530, SM000003S11039, SM000237S08150, SM000104S09323, SM000110S18880, SM000176S03138, SM005035S17858, SM000103S09477, SM000051S17543, SM000181S03552, SM013453S27073	Zci1a_44380, Zci1a_39591, Zci1a_42981, Zci1a_14953, Zci1a_12545, Zci1a_05351, Zci1a_22013, Zci1a_15296, Zci1a_34951, Zci1a_42784, Zci1a_00349, Zci1a_15680, Zci1a_16279, Zci1a_10344, Zci1a_35034, Zci1a_12647, Zci1a_10209, Zci1a_21324, Zci1a_35035, Zci1a_26877, Zci1a_38270, Zci1a_24500, Zci1a_20541	Zci_12972, Zci_11060, Zci_15365, Zci_13702, Zci_09934, Zci_05897, Zci_02467, Zci_03802, Zci_13096, Zci_03515	UTEX1559_14692, UTEX1559_01935, UTEX1559_03335, UTEX1559_09736, UTEX1559_04556, UTEX1559_06594, UTEX1559_07538, UTEX1559_12621, UTEX1559_12327, UTEX1559_03392, UTEX1559_10112	UTEX1560_13366, UTEX1560_04753, UTEX1560_18643, UTEX1560_19963, UTEX1560_16417, UTEX1560_07091, UTEX1560_15547, UTEX1560_05932, UTEX1560_02195, UTEX1560_10820, UTEX1560_10822, UTEX1560_05931, UTEX1560_14890, UTEX1560_16035, UTEX1560_18261, UTEX1560_14833, UTEX1560_05475	Zm00001d037604, Zm00001d013486, Zm00001d043247, Zm00001d028026, Zm00001d033642, Zm00001d051889, Zm00001d025050, Zm00001d004372, Zm00001d021687, Zm00001d053594
Me1_v2_0132760	N0.HOG0006921	OG0005646	n0	AagrOXF_evm.TU.utg000013l.71, AagrOXF_evm.TU.utg000013l.72	Azfi_s0008.g011463	AT2G43560	Bradi3g41800	CBR_g49189	Chrsp50S06423	Cre12.g530300_4532	CLOP_g23131	3149	Me1_v2_0132760	Mp6g04000	10509	Olucimarinus_39771	LOC_Os08g42850	PRCOL_00000394_RA	pm000900g0010, pm002012g0040	Pp3c4_8140	Solyc04g015040	99440	SM000033S12411, SM000038S14398, SM000088S23776	Zci1a_11102	Zci_12046	UTEX1559_09456	UTEX1560_02036	Zm00001d031696
Me1_v2_0158430	N0.HOG0003285	OG0002345	n0	AagrOXF_evm.TU.utg000103l.198	Azfi_s1463.g103412, Azfi_s0072.g037047, Azfi_s0644.g080715, Azfi_s0010.g012287, Azfi_s0104.g044819, Azfi_s0102.g044481	AT1G54130, AT3G14050	Bradi3g37620, Bradi4g31460	CBR_g16012	Chrsp1S03112	Cre03.g159800_4532	CLOP_g17303, CLOP_g90	10286	Me1_v2_0158430	Mp6g06980	12566	Olucimarinus_36495	LOC_Os07g42160, LOC_Os08g35620, LOC_Os09g27050	PRCOL_00006039_RA	pm000296g0070, pm001125g0020	Pp3c16_12030, Pp3c5_12900, Pp3c6_16990, Pp3c6_17010	Solyc03g123370	100367	SM000028S10175, SM000030S11380, SM000076S21769	Zci1a_24623	Zci_03479	UTEX1559_10062	UTEX1560_07806, UTEX1560_07807	Zm00001d022122, Zm00001d022119, Zm00001d032060, Zm00001d020639, Zm00001d005826
Me1_v2_0227280	N0.HOG0001731	OG0001083	n0	AagrOXF_evm.TU.utg000084l.210, AagrOXF_evm.TU.utg000035l.145, AagrOXF_evm.TU.utg000025l.9, AagrOXF_evm.TU.utg000107l.34, AagrOXF_evm.TU.utg000025l.10, AagrOXF_evm.TU.utg000107l.35	Azfi_s0004.g008520, Azfi_s0002.g002142, Azfi_s0185.g056588, Azfi_s0038.g026268	AT4G25120, AT5G55620	Bradi1g27110	CBR_g26524, CBR_g46888, CBR_g55305, CBR_g55304	Chrsp175S02356	Cre07.g312250_4532, Cre07.g312150_4532, Cre07.g314400_4532	CLOP_g5976, CLOP_g18348, CLOP_g4053, CLOP_g9162	193, 6381, 11741	Me1_v2_0180070, Me1_v2_0180060, Me1_v2_0061720, Me1_v2_0206880, Me1_v2_0227280	Mp4g23940, Mp7g19290	10878, 10879, 10880, 25297, 27499	Olucimarinus_917	LOC_Os07g30980	PRCOL_00004767_RA	pm008339.t1, pm008339.t2, pm008668g0050, pm064245g0010, pm013160g0010, pm027886g0010, pm015232g0010, pm027886g0020	Pp3s70_120, Pp3c1_29170	Solyc03g093850, Solyc03g093840	409811, 409804, 429070, 440582, 409873, 431024	NA	Zci1a_07974, Zci1a_07973	Zci_14459	UTEX1559_10772	UTEX1560_05160, UTEX1560_05161	Zm00001d006443
Me1_v2_0086080	N0.HOG0039673	OG0037496	-	NA	NA	NA	NA	NA	NA	NA	NA	NA	Me1_v2_0098240, Me1_v2_0086080	NA	NA	NA	NA	NA	NA	NA	NA	NA	NA	NA	NA	NA	NA	NA
Me1_v2_0192590	N0.HOG0007036	OG0005759	n0	AagrOXF_evm.TU.utg000063l.497	Azfi_s0060.g034733, Azfi_s0929.g092989	AT5G57300	Bradi2g62630	CBR_g3967	Chrsp187S02900	Cre05.g245450_4532	CLOP_g16482	5923	Me1_v2_0192590	Mp6g01110	21488	Olucimarinus_39585	LOC_Os01g74520	PRCOL_00006789_RA	pm000091g0130, pm001800g0040, pm009050g0030	Pp3c3_21690	Solyc01g081470	441112	NA	NA	Zci_08589, Zci_08587	UTEX1559_05064	UTEX1560_08918, UTEX1560_08916, UTEX1560_00108	Zm00001d047869, Zm00001d011773
Me1_v2_0210730	N0.HOG0007030	OG0005753	n0	AagrOXF_evm.TU.utg000063l.33	Azfi_s0656.g081121	AT1G68830	Bradi2g17660	CBR_g8256	Chrsp6S07418	Cre02.g120250_4532	CLOP_g7251	5365	Me1_v2_0210730	Mp7g15130	1193	Olucimarinus_50622	LOC_Os05g47560	PRCOL_00001571_RA	pm001132g0050, pm000448.t2, pm017252g0020	Pp3c26_5140, Pp3c4_25980	Solyc12g021280	76749	SM000009S23629, SM000006S19390, SM000022S07238	Zci1a_29208	Zci_04200	UTEX1559_09532	UTEX1560_11465	Zm00001d038894
Me1_v2_0095280	N0.HOG0000144	OG0000070	n0	AagrOXF_evm.TU.utg000038l.124, AagrOXF_evm.TU.utg000010l.214, AagrOXF_evm.TU.utg000033l.202, AagrOXF_evm.TU.utg000033l.209, AagrOXF_evm.TU.utg000033l.211, AagrOXF_evm.TU.utg000033l.204, AagrOXF_evm.TU.utg000033l.205, AagrOXF_evm.TU.utg000033l.208, AagrOXF_evm.TU.utg000033l.210	Azfi_s0045.g029750	AT1G08080, AT2G28210, AT1G08065, AT5G56330, AT5G04180, AT4G21000, AT4G20990, AT3G52720	Bradi3g38260, Bradi1g36190, Bradi2g14275, Bradi4g25550, Bradi3g44940, Bradi5g09340	CBR_g3232, CBR_g34505, CBR_g12070, CBR_g12072, CBR_g3220, CBR_g54091, CBR_g3213, CBR_g3215	Chrsp109S01440, Chrsp41S05701	Cre09.g415700_4532, Cre04.g223050_4532, Cre04.g223100_4532	CLOP_g25247, CLOP_g25081, CLOP_g3833, CLOP_g25080, CLOP_g3832, CLOP_g23116, CLOP_g1635, CLOP_g13480, CLOP_g6919, CLOP_g6917, CLOP_g13872, CLOP_g5555, CLOP_g5554, CLOP_g13873, CLOP_g1636, CLOP_g13481, CLOP_g23139, CLOP_g23944, CLOP_g12855, CLOP_g17643, CLOP_g7280, CLOP_g11887	7319, 8026, 5531, 1858, 6156	Me1_v2_0095280, Me1_v2_0095260, Me1_v2_0095290, Me1_v2_0123140	Mp4g18060, Mp6g09000, Mp2g17100, Mp8g15470, Mp8g08440, Mp8g11120, Mp8g11240, Mp7g13720, Mp6g03300, Mp6g14480, Mp8g02780, Mp8g02750, Mp8g02730, Mp8g02700, Mp8g02710, Mp8g02770, Mp8g11360, Mp8g09490, Mp8g09470, Mp8g09480, Mp8g09460, Mp8g09450, Mp8g01230	2327, 14727, 14906, 15093, 1690, 17512, 26388, 26389, 26392, 26391, 1685	NA	LOC_Os09g28150, LOC_Os09g28130, LOC_Os08g36630, LOC_Os08g36680, LOC_Os08g32840, LOC_Os08g32750, LOC_Os08g32780, LOC_Os06g40770, LOC_Os11g05520, LOC_Os12g05730, LOC_Os11g05510, LOC_Os02g33030, LOC_Os04g33660	NA	pm025065g0010, pm013702g0010, pm012417g0030, pm036734g0010, pm009259g0010, pm005913g0010, pm008594g0010, pm071846g0010, pm002810g0040, pm013895g0010, pm067681g0010, pm023999g0010, pm031370g0010, pm002358g0080, pm002358g0090, pm012786g0020, pm002358g0070, pm011175g0030, pm000450g0010, pm002200g0010, pm004410g0060, pm018430g0010, pm000854g0080, pm000819g0050, pm002444g0010, pm056204g0010, pm034828g0010, pm027921g0010, pm068120g0010, pm011620g0010, pm001926g0050, pm025546g0010, pm007382g0010, pm014538g0010, pm325515g0010, pm000388g0010, pm014538g0020, pm021202g0020, pm008978g0010, pm000414g0060, pm008978g0030, pm000414g0050, pm008978g0020, pm008527g0020, pm008527.t1, pm006863g0060, pm004110g0030, pm002443g0010, pm022321g0010, pm004110g0010, pm014209g0010, pm001427g0080, pm004110g0040, pm002443g0050, pm038072g0010, pm000175g0100, pm023791g0010, pm002443g0030, pm002443g0040, pm000175g0080, pm006863g0050, pm025438g0020, pm000175g0070, pm002443g0020, pm000175g0060, pm000175g0090, pm002115g0040, pm000414g0040, pm000414g0030, pm017850g0010, pm007393g0010, pm003401g0040, pm003401g0020, pm003401g0010, pm008527g0010, pm001144g0040, pm001144g0030, pm020549g0010, pm003401g0030, pm006914g0010, pm012778g0010, pm015026g0020, pm009964.t1, pm009860g0020	Pp3c18_6840, Pp3c7_9490, Pp3c7_9420, Pp3c7_9630, Pp3c7_9610, Pp3c7_9400, Pp3c7_9540, Pp3c7_9520, Pp3c7_9500, Pp3c3_25570, Pp3c26_6961, Pp3c26_6890, Pp3c26_6990, Pp3c26_6930, Pp3c26_6810, Pp3s775_50, Pp3s775_10	Solyc11g069640, Solyc06g075050, Solyc06g075070, Solyc06g075060, Solyc10g079270, Solyc09g008420, Solyc10g083890, Solyc09g009830.3	416362, 159358, 133488, 36096, 411805, 106066, 113076, 93576, 105891, 105754, 133933, 132930, 429383, 420353, 420339, 429368, 108874, 420338, 420354, 77903	SM000113S24030, SM000050S17023, SM000073S21429	Zci1a_25559, Zci1a_04041, Zci1a_04040, Zci1a_13216, Zci1a_13217, Zci1a_43279, Zci1a_07381, Zci1a_26320, Zci1a_42304, Zci1a_04278, Zci1a_29979, Zci1a_22734, Zci1a_28624, Zci1a_40613, Zci1a_21714, Zci1a_28623, Zci1a_21712, Zci1a_30223, Zci1a_40612, Zci1a_44794, Zci1a_06762	Zci_14809, Zci_14810, Zci_14065, Zci_00059	UTEX1559_14490, UTEX1559_14491, UTEX1559_15019, UTEX1559_14034	UTEX1560_09761, UTEX1560_09760, UTEX1560_00575, UTEX1560_11035	Zm00001d005844, Zm00001d050011, Zm00001d031779, Zm00001d031778, Zm00001d046784, Zm00001d004909, Zm00001d052551, Zm00001d003781, Zm00001d049240
Me1_v2_0230650	N0.HOG0000802	OG0000453	n5	NA	NA	NA	NA	CBR_g42071	NA	NA	CLOP_g8329, CLOP_g18260	5652, 2142, 980, 13727, 635	Me1_v2_0230650	NA	NA	NA	NA	NA	pm008099g0030, pm003287g0070, pm013638g0020	NA	Solyc11g065450.1	NA	NA	Zci1a_02262, Zci1a_02264, Zci1a_02261, Zci1a_02263, Zci1a_02267, Zci1a_34812	Zci_01146, Zci_01145	UTEX1559_05572, UTEX1559_05571	UTEX1560_06148, UTEX1560_06149, UTEX1560_06147, UTEX1560_06145, UTEX1560_06146	NA
Me1_v2_0200210	N0.HOG0004698	OG0003583	n0	AagrOXF_evm.TU.utg000024l.217	NA	AT3G12370, AT5G13510	Bradi2g37810, Bradi1g65900	CBR_g32465	Chrsp369S05358	Cre06.g272850_4532	CLOP_g2686, CLOP_g9812	2249	Me1_v2_0200210	Mp4g07300	6883, 6884	Olucimarinus_36113	LOC_Os05g03030, LOC_Os03g17580	PRCOL_00005567_RA	pm004994g0020, pm011155g0010	Pp3c2_35950, Pp3c11_2850, Pp3c1_1330	Solyc04g009540.1	233811, 425112, 49101	SM000028S10162, SM000030S11355, SM000076S21799	Zci1a_10019	Zci_12422	UTEX1559_12253	UTEX1560_14674	Zm00001d010994, Zm00001d028702
Me1_v2_0193110	NA	NA	NA	NA	NA	NA	NA	NA	NA	NA	NA	NA	NA	NA	NA	NA	NA	NA	NA	NA	NA	NA	NA	NA	NA	NA	NA	NA
Me1_v2_0121030	N0.HOG0004271	OG0003207	n0	AagrOXF_evm.TU.utg000049l.659	Azfi_s0006.g009898	AT4G14270, AT2G41430	Bradi1g18780, Bradi1g62300	NA	NA	NA	CLOP_g23097, CLOP_g9171	6631	Me1_v2_0121030	Mp6g20040, Mp1g25290	NA	NA	LOC_Os07g46670, LOC_Os03g23010, LOC_Os01g19500	NA	pm317984g0010, pm004719.t1, pm014712g0010, pm028760g0010, pm001659g0060	Pp3c24_6320, Pp3c8_13720	Solyc04g017690, Solyc10g079820	441682	SM000040S14818, SM000055S18270, SM000139S00093	Zci1a_44615, Zci1a_25886	Zci_08768	UTEX1559_06813	UTEX1560_11225	Zm00001d022416, Zm00001d007097, Zm00001d048165, Zm00001d047470
Me1_v2_0205950	N0.HOG0002413	OG0001606	n2	AagrOXF_evm.TU.utg000050l.595	Azfi_s0006.g009930	AT1G36160, AT1G36180	Bradi3g24417, Bradi5g03860	CBR_g21136	Chrsp164S00134	Cre08.g373050_4532	CLOP_g10230, CLOP_g13253	2087	Me1_v2_0205950	Mp1g28300	26107, 26106, 26108	Olucimarinus_44400	LOC_Os10g21910, LOC_Os05g22940	PRCOL_00001984_RA	pm001997g0010, pm003016g0050, pm012074g0010, pm002110g0010, pm003520g0020, pm004685g0020	Pp3c3_15800, Pp3c13_14480, Pp3c4_17500	Solyc12g056940	126483, 407379, 183371	SM000058S18582, SM000090S24336, SM000050S16960, SM000074S21650, SM000269S09913, SM000149S01349	Zci1a_29271, Zci1a_09759	Zci_14125, Zci_07958	UTEX1559_09501, UTEX1559_12015	UTEX1560_03330, UTEX1560_03329, UTEX1560_03328, UTEX1560_13664, UTEX1560_05495	Zm00001d014294, Zm00001d024998, Zm00001d004125
Me1_v2_0215140	N0.HOG0007098	OG0005821	n0	AagrOXF_evm.TU.utg000111l.222	Azfi_s0027.g023693	AT4G09010	Bradi5g20670	CBR_g39625	NA	Cre05.g233900_4532	CLOP_g3781, CLOP_g12304	4791	Me1_v2_0215140, Me1_v2_0035900	Mp1g12440	18903	Olucimarinus_93205	LOC_Os04g51300	NA	pm013213g0020, pm004403g0010, pm004040g0030	Pp3c2_15430, Pp3c1_18860	Solyc04g074640	126894	SM000020S05997, SM000006S19514, SM000096S24869	Zci1a_17270	Zci_02177	UTEX1559_10921	UTEX1560_01998	Zm00001d002426
Me1_v2_0082810	NA	NA	NA	NA	NA	NA	NA	NA	NA	NA	NA	NA	NA	NA	NA	NA	NA	NA	NA	NA	NA	NA	NA	NA	NA	NA	NA	NA
Me1_v2_0060150	N0.HOG0000500	OG0000257	n63	AagrOXF_evm.TU.utg000116l.152	Azfi_s0114.g046027	AT2G03670	Bradi5g14660	NA	Chrsp180S02862	Cre17.g700300_4532	CLOP_g24555	10503	Me1_v2_0060150	Mp3g20500	20585, 20582, 20583, 20584	Olucimarinus_40257	LOC_Os04g42110, LOC_Os05g31220	PRCOL_00005146_RA	pm008462g0030, pm004426g0050, pm043384g0020	Pp3c21_20700	Solyc05g012190	173081	SM000327S12482, SM000491S17365	Zci1a_28714	Zci_06677	UTEX1559_10643	UTEX1560_05723	Zm00001d025776
Me1_v2_0103990	N0.HOG0003688	OG0002701	n0	AagrOXF_evm.TU.utg000009l.50	Azfi_s0308.g064000	AT4G36850, AT2G41050, AT4G20100	Bradi2g09940	NA	Chrsp1S03235	NA	CLOP_g5465, CLOP_g12322, CLOP_g16388	10933	Me1_v2_0103990, Me1_v2_0103980, Me1_v2_0078750	Mp1g08130, Mp3g15190	6189	NA	LOC_Os01g16170	PRCOL_00003544_RA	pm000294g0060, pm013652g0010, pm006642g0040, pm034063g0010, pm030846.t1, pm021206g0020, pm015816g0010	Pp3c20_8770, Pp3c8_22100	Solyc02g089890	121256	SM000079S22493, SM000001S04526, SM000070S21336	Zci1a_11606, Zci1a_36329	Zci_15310	UTEX1559_08609, UTEX1559_15534	UTEX1560_08269, UTEX1560_09948	Zm00001d040340, Zm00001d008285
Me1_v2_0207200	N0.HOG0005837	OG0004620	n0	AagrOXF_evm.TU.utg000005l.473	Azfi_s0004.g008628	AT5G56850	Bradi2g14392	CBR_g20330	Chrsp9S08550	NA	CLOP_g6317, CLOP_g17021, CLOP_g17022, CLOP_g21359	10433	Me1_v2_0207200, Me1_v2_0207190	Mp7g11290	23049, 28642, 13409, 13410	NA	LOC_Os05g14270	NA	pm000140g0170, pm070754g0010, pm006458.t1, pm000577.t1, pm001163g0040, pm002363g0020	Pp3c15_7000, Pp3c9_2809, Pp3c9_2800	Solyc07g039190	NA	NA	Zci1a_05463	Zci_10829	UTEX1559_08694	UTEX1560_06389	NA
Me1_v2_0184430	N0.HOG0004715	OG0003599	n0	AagrOXF_evm.TU.utg000087l.99, AagrOXF_evm.TU.utg000038l.312, AagrOXF_evm.TU.utg000083l.240, AagrOXF_evm.TU.utg000049l.767	Azfi_s0004.g008492	AT1G48130	Bradi1g20040	CBR_g8949	Chrsp78S07700	NA	CLOP_g8486, CLOP_g16462	14002, 3292, 3296	Me1_v2_0184430, Me1_v2_0059260	Mp2g14680, Mp7g05690	2421, 2423	NA	LOC_Os07g44440, LOC_Os07g44430	PRCOL_00004927_RA	pm004121g0010, pm002678g0020, pm003541.t1, pm006052g0050	Pp3c10_21340, Pp3c20_21100, Pp3c22_8470	Solyc03g096040	148807, 164163	NA	Zci1a_03388	NA	UTEX1559_12881	UTEX1560_17352	Zm00001d022278
Me1_v2_0129850	N0.HOG0001150	OG0000663	n28	AagrOXF_evm.TU.utg000091l.127, AagrOXF_evm.TU.utg000091l.129	Azfi_s0090.g042618, Azfi_s0013.g013345, Azfi_s0412.g068538	AT2G29560, AT2G36530	Bradi1g67090, Bradi3g22550, Bradi1g68080, Bradi1g51540	CBR_g38423, CBR_g48754, CBR_g12313, CBR_g38707, CBR_g38698	Chrsp41S00447	Cre12.g513200_4532	CLOP_g8929, CLOP_g15417	10275, 3218	Me1_v2_0058160, Me1_v2_0042500, Me1_v2_0129850	Mp7g03450, Mp8g05490	13053, 13054	Olucimarinus_28765	LOC_Os03g15950, LOC_Os10g08550, LOC_Os03g14450, LOC_Os06g04510	PRCOL_00003078_RA	pm007610g0020, pm026666g0010, pm003086g0020, pm004020g0010	Pp3c13_23550, Pp3c3_3140, Pp3c3_3160	Solyc06g076650, Solyc09g009020, Solyc10g085550	165356, 78644, 167539	SM000031S11623, SM000226S07409, SM000043S15870	Zci1a_15704	Zci_09941, Zci_08403	UTEX1559_04549, UTEX1559_05229	UTEX1560_10914, UTEX1560_04441	Zm00001d047843, Zm00001d030373, Zm00001d045431, Zm00001d036086
Me1_v2_0104030	N0.HOG0000391	OG0000193	n0	AagrOXF_evm.TU.utg000008l.255, AagrOXF_evm.TU.utg000006l.669, AagrOXF_evm.TU.utg000097l.8, AagrOXF_evm.TU.utg000126l.237, AagrOXF_evm.TU.utg000091l.559	Azfi_s0384.g067490, Azfi_s0219.g058611, Azfi_s0149.g053208	AT5G38420, AT5G38430, AT1G67090, AT5G38410	Bradi5g04080, Bradi4g08500, Bradi4g08800, Bradi3g26386, Bradi3g26391	CBR_g37370, CBR_g19695, CBR_g46359	Chrsp104S01189, Chrsp99S08505, Chrsp369S00855	Cre02.g120200_4532, Cre02.g120150_4532, Cre02.g120100_4532	CLOP_g1646, CLOP_g23736, CLOP_g23735	122, 5048, 4333, 864	Me1_v2_0086980, Me1_v2_0104030	Mp4g15070, Mp4g15080, Mp4g06030, Mp4g06050, Mp4g10850, Mp4g06000, Mp4g05960, Mp4g05980, Mp4g05990, Mp4g06010, Mp4g05970, Mp4g06020, Mp4g06040, Mp4g09890, Mp4g10830, Mp7g08150, Mp7g08130, Mp7g08140, Mp4g14420	406, 6099	Olucimarinus_28400, Olucimarinus_42060, Olucimarinus_89572	LOC_Os02g05830, LOC_Os12g19381, LOC_Os12g17600, LOC_Os12g19470	PRCOL_00004521_RA, PRCOL_00004522_RA, PRCOL_00001220_RA, PRCOL_00001221_RA	pm041018g0020, pm198254g0010, pm009933g0020, pm122155g0010, pm020652g0010, pm010382g0020, pm063461g0010, pm000248g0020, pm002138g0020, pm011932.t1, pm001702g0010, pm000292g0070, pm001630g0080, pm049286g0010, pm035030g0030, pm003899g0050, pm298745g0010, pm026525g0020, pm004551g0030, pm011696g0010, pm240689g0010, pm023554g0030, pm013433g0010, pm015598g0010, pm007764g0030, pm008005.t1, pm000248g0030, pm023175g0010, pm000248g0040, pm003335g0080, pm040294g0010, pm124456g0010, pm006005g0010, pm001936g0070, pm257687g0010, pm014545g0010, pm048277g0010, pm055972.t1, pm238776g0010, pm078982g0010, pm043940g0010, pm003576g0060, pm027331g0040, pm007112.t2, pm001879.t1, pm041479g0010, pm200197g0010, pm066862g0010, pm004551g0010, pm011159.t1, pm010446g0010, pm016340g0020, pm000242g0030, pm001049.t2, pm006679g0020, pm024007g0010	Pp3c3_12330, Pp3c3_12530, Pp3c13_15786, Pp3c13_16000, Pp3c13_15800, Pp3c13_16130, Pp3c13_15980, Pp3c3_18750, Pp3c3_14510, Pp3c3_14480, Pp3c3_20110, Pp3c3_20140, Pp3c2_4100, Pp3c12_7030, Pp3c12_7010, Pp3c15_22730, Pp3c15_22720, Pp3c19_7460, Pp3c4_11770, Pp3c4_13260, Pp3c12_19890, Pp3c12_12340, Pp3c22_7400, Pp3c12_11880, Pp3c4_4820, Pp3c19_1860, Pp3c19_1840, Pp3c19_3190, Pp3c13_15910, Pp3c22_540	Solyc07g017950, Solyc02g085950, Solyc02g085940, Solyc03g034220, Solyc02g063150	17395, 147927	SM000441S16120, SM000736S21523, SM000039S14492, SM000008S22220, SM004483S16473, SM001457S01082	Zci1a_23975, Zci1a_15427, Zci1a_15428, Zci1a_02476, Zci1a_02477, Zci1a_41934, Zci1a_41933	Zci_15633, Zci_08256	UTEX1559_17448, UTEX1559_13237	UTEX1560_15268, UTEX1560_06757	Zm00001d004894, Zm00001d052595
Me1_v2_0222680	NA	NA	NA	NA	NA	NA	NA	NA	NA	NA	NA	NA	NA	NA	NA	NA	NA	NA	NA	NA	NA	NA	NA	NA	NA	NA	NA	NA
Me1_v2_0031180	NA	NA	NA	NA	NA	NA	NA	NA	NA	NA	NA	NA	NA	NA	NA	NA	NA	NA	NA	NA	NA	NA	NA	NA	NA	NA	NA	NA
Me1_v2_0010200	N0.HOG0039428	OG0037251	-	NA	NA	NA	NA	NA	NA	NA	NA	NA	Me1_v2_0010200, Me1_v2_0003740	NA	NA	NA	NA	NA	NA	NA	NA	NA	NA	NA	NA	NA	NA	NA
Me1_v2_0191370	N0.HOG0000342	OG0000165	n13	NA	Azfi_s0005.g009151	NA	NA	NA	Chrsp31S04872, Chrsp22S08813, Chrsp117S01712	Cre17.g715300_4532	CLOP_g9398, CLOP_g9050, CLOP_g9049, CLOP_g9048, CLOP_g9047, CLOP_g4223, CLOP_g21920, CLOP_g4217, CLOP_g15499, CLOP_g5969, CLOP_g5970, CLOP_g15500	NA	Me1_v2_0145980, Me1_v2_0145990, Me1_v2_0089190, Me1_v2_0191370, Me1_v2_0089160, Me1_v2_0146010, Me1_v2_0187530, Me1_v2_0192440, Me1_v2_0187560, Me1_v2_0187480, Me1_v2_0187570, Me1_v2_0030880, Me1_v2_0192430, Me1_v2_0185280, Me1_v2_0185240, Me1_v2_0185250, Me1_v2_0191350, Me1_v2_0033810, Me1_v2_0191400, Me1_v2_0008510, Me1_v2_0019100, Me1_v2_0025830, Me1_v2_0195550, Me1_v2_0049810, Me1_v2_0030350, Me1_v2_0195500, Me1_v2_0154790, Me1_v2_0154710, Me1_v2_0086330, Me1_v2_0034270, Me1_v2_0086320, Me1_v2_0195510, Me1_v2_0195540, Me1_v2_0195520	NA	445, 2312, 2313	NA	NA	PRCOL_00001398_RA	pm002931g0030, pm008378g0020, pm004009.t1, pm007764g0040, pm032010g0020, pm007958g0010, pm006359g0020, pm019435g0020, pm020006g0010, pm002512g0060, pm017639g0010, pm002171.t1, pm027544g0010, pm017639g0020, pm021014g0010, pm009011g0010, pm017639g0030, pm017004g0020, pm020204.t1, pm021960g0010, pm008950g0020, pm021960g0020, pm013864g0010, pm021843g0020, pm022854g0010, pm055263g0010, pm159879g0010, pm000719g0100, pm031207g0010, pm021008.t1, pm021016.t1, pm000719g0090, pm002244g0060, pm037297g0010, pm029730g0010, pm008746g0020, pm018672g0020, pm012426g0010, pm000719g0050, pm002244.t1, pm003687g0070, pm025756g0010, pm030238g0010, pm002230.t1, pm020354g0010, pm002385g0020, pm001648g0030, pm010822g0040, pm006462g0060, pm020354g0020, pm005803g0030, pm041564g0020, pm000719g0020, pm019057g0030, pm006911.t1, pm027193g0010, pm008940.t2, pm003725g0020, pm015907.t1, pm008940.t1, pm015022g0010, pm002229g0020, pm010479g0020, pm002880.t1, pm030301g0010, pm004632g0070, pm017684g0010, pm002880g0040, pm004632.t1, pm021008g0030, pm000176g0010, pm000719g0060, pm030238g0020, pm010524g0020	NA	NA	NA	NA	Zci1a_34993, Zci1a_20226, Zci1a_28868, Zci1a_23409, Zci1a_28883, Zci1a_03526, Zci1a_17349, Zci1a_20233, Zci1a_32436, Zci1a_32434, Zci1a_28708, Zci1a_04201, Zci1a_28878, Zci1a_23405, Zci1a_23406, Zci1a_28876, Zci1a_20176, Zci1a_28880, Zci1a_28881, Zci1a_23407, Zci1a_17352, Zci1a_03524, Zci1a_20173, Zci1a_20175, Zci1a_34991, Zci1a_34992, Zci1a_32171, Zci1a_35870	Zci_08175, Zci_13180, Zci_13170, Zci_13433, Zci_13182, Zci_13183, Zci_10771, Zci_14475	UTEX1559_19131, UTEX1559_11639, UTEX1559_11636, UTEX1559_14148, UTEX1559_19171, UTEX1559_17603, UTEX1559_11464, UTEX1559_14146, UTEX1559_16322, UTEX1559_10789	UTEX1560_17043, UTEX1560_18246, UTEX1560_18914, UTEX1560_13780, UTEX1560_19774, UTEX1560_18352, UTEX1560_08170, UTEX1560_18774, UTEX1560_07403, UTEX1560_18305, UTEX1560_13253, UTEX1560_06262	NA
Me1_v2_0113260	N0.HOG0010605	OG0009102	n0	NA	NA	NA	NA	NA	NA	NA	NA	NA	Me1_v2_0113260	NA	NA	NA	NA	NA	pm007127g0050, pm036817.t1, pm059820g0010, pm029785g0010, pm022987g0010, pm037397g0010, pm039568g0010, pm027733g0010	Pp3c1_2700, Pp3s37_140, Pp3c1_2710	NA	419325	NA	NA	NA	NA	NA	Zm00001d038493, Zm00001d007795, Zm00001d024224, Zm00001d037758
Me1_v2_0113250	N0.HOG0020538	OG0018440	n0	NA	NA	NA	NA	NA	NA	NA	NA	NA	Me1_v2_0113250	NA	NA	NA	NA	NA	NA	NA	NA	NA	NA	NA	NA	NA	NA	Zm00001d027860, Zm00001d011553, Zm00001d007702, Zm00001d041331
Me1_v2_0224550	N0.HOG0002082	OG0001340	n0	AagrOXF_evm.TU.utg000042l.459, AagrOXF_evm.TU.utg000042l.448	Azfi_s0026.g023357, Azfi_s0037.g025894, Azfi_s0003.g007468, Azfi_s0051.g031339, Azfi_s0073.g037267, Azfi_s0218.g058571	AT5G09850, AT3G10820, AT5G05140	Bradi4g41760, Bradi2g25350, Bradi1g19810, Bradi1g61653, Bradi1g61670, Bradi2g21953	NA	Chrsp4S06188	Cre01.g004850_4532	CLOP_g16852	7943	Me1_v2_0224550	Mp1g25310	NA	NA	LOC_Os12g06850, LOC_Os11g06650, LOC_Os01g17990, LOC_Os05g34210, LOC_Os07g44820, LOC_Os08g40070, LOC_Os06g21099, LOC_Os03g24950, LOC_Os12g39290	PRCOL_00004104_RA	NA	Pp3c6_10210	Solyc04g071520, Solyc11g005450, Solyc03g044340.1, Solyc10g078350, Solyc12g062935.1, Solyc10g080930, Solyc12g062930, Solyc03g044350	444137, 440817, 404483	SM000009S23537, SM000084S23124, SM000051S17621	NA	NA	NA	NA	Zm00001d023514, Zm00001d053189, Zm00001d040506, Zm00001d010271, Zm00001d048597, Zm00001d041546, Zm00001d006577, Zm00001d031596, Zm00001d022314, Zm00001d046397, Zm00001d007037, Zm00001d035204, Zm00001d047434
Me1_v2_0091740	N0.HOG0039681	OG0037504	-	NA	NA	NA	NA	NA	NA	NA	NA	NA	Me1_v2_0091740	NA	NA	NA	NA	NA	pm218292g0010	NA	NA	NA	NA	NA	NA	NA	NA	NA
Me1_v2_0088920	N0.HOG0006776	OG0005509	n0	NA	Azfi_s0080.g038456	AT5G18070	Bradi1g54610	CBR_g36832	Chrsp36S05439	Cre08.g379700_4532	CLOP_g9395	13215	Me1_v2_0088920	Mp7g03190	2099	Olucimarinus_40572	LOC_Os07g09720	PRCOL_00000375_RA	pm001475g0080, pm011059g0030, pm004061g0020	Pp3c15_140	Solyc08g077270	105120	SM000122S25757, SM000136S00157, SM000286S10645	Zci1a_16212, Zci1a_27471	Zci_04649	UTEX1559_00206, UTEX1559_02749	UTEX1560_04356, UTEX1560_13895	Zm00001d039361
Me1_v2_0110340	N0.HOG0001336	OG0000787	n0	AagrOXF_evm.TU.utg000050l.592, AagrOXF_evm.TU.utg000050l.593	Azfi_s0008.g011459, Azfi_s0084.g038926, Azfi_s0068.g036277, Azfi_s0075.g037581	AT2G43500, AT3G59580, AT1G76350, AT1G20640, AT4G38340, AT2G17150, AT4G35270, AT1G64530, AT4G24020	Bradi4g20720, Bradi5g23300, Bradi4g37147, Bradi1g76340, Bradi3g03170, Bradi2g08177, Bradi2g31710	CBR_g38148	Chrsp141S02187, Chrsp86S08001, Chrsp26S04136	Cre03.g177700_4532	CLOP_g13611	12359	Me1_v2_0110340	Mp8g12800	11205	NA	LOC_Os11g16290, LOC_Os04g41850, LOC_Os09g37710, LOC_Os03g03900, LOC_Os02g04340, LOC_Os05g10380, LOC_Os11g40110, LOC_Os01g13540	PRCOL_00003311_RA, PRCOL_00003269_RA	pm012302g0020, pm012687g0030	Pp3c17_4370, Pp3c17_4375, Pp3c12_2070, Pp3c19_2670, Pp3c19_2720, Pp3c22_6360, Pp3c22_6370, Pp3c9_14600, Pp3c15_9180	Solyc11g045350, Solyc08g013900, Solyc04g082480, Solyc01g112190, Solyc08g082750, Solyc08g008410	35791, 172537, 118918, 61084	SM000022S07208, SM000017S02910, SM000305S11798	Zci1a_26447	Zci_06570	UTEX1559_01412	UTEX1560_07521, UTEX1560_07522	Zm00001d025757, Zm00001d003176, Zm00001d006293, Zm00001d035704, Zm00001d021442, Zm00001d004951, Zm00001d027510, Zm00001d015201, Zm00001d039266, Zm00001d009017, Zm00001d037786
Me1_v2_0162650	N0.HOG0004032	OG0002994	n0	AagrOXF_evm.TU.utg000005l.495	Azfi_s0001.g000024, Azfi_s0064.g035485, Azfi_s0003.g008046, Azfi_s1677.g105663	AT3G10770, AT5G05100, AT2G40960, AT3G56680	Bradi4g38500, Bradi2g25390	CBR_g20977	Chrsp64S07122	Cre01.g068742_4532	CLOP_g12120	8064	Me1_v2_0162650	Mp1g01650	26242	NA	LOC_Os09g39462, LOC_Os05g34070	NA	pm002107g0010	Pp3c9_1350, Pp3c15_1650	Solyc11g007110, Solyc10g078300	449069	SM000501S17666, SM000184S03767, SM000167S02957	Zci1a_38301	NA	NA	NA	Zm00001d036628, Zm00001d002863, Zm00001d016556, Zm00001d042021, Zm00001d030359, Zm00001d005338, Zm00001d019875, Zm00001d038190, Zm00001d010282
Me1_v2_0144850	N0.HOG0002940	OG0002039	n0	AagrOXF_evm.TU.utg000083l.248, AagrOXF_evm.TU.utg000029l.14	Azfi_s0113.g045894, Azfi_s0230.g059177	AT1G18080, AT1G48630, AT3G18130	Bradi2g46840, Bradi2g17350	CBR_g74640	Chrsp259S03902	Cre06.g278222_4532	NA	1613	Me1_v2_0144850	Mp3g15630	17617	Olucimarinus_25547, Olucimarinus_48240, Olucimarinus_19794	LOC_Os01g49290, LOC_Os05g47890	PRCOL_00006176_RA	pm009638g0020, pm008667g0040, pm107299g0010, pm002301g0030, pm005410g0020, pm008905g0030, pm015716g0020, pm011807g0010, pm000537g0070, pm003345g0030	Pp3c5_770, Pp3c27_6040, Pp3c16_13180	Solyc03g119040, Solyc06g069010, Solyc12g040510	266532	SM000220S07047, SM006054S19560, SM000069S20740, SM000156S02127	Zci1a_37069	Zci_13331	UTEX1559_06183	UTEX1560_10979	Zm00001d038923, Zm00001d009480
Me1_v2_0168030	N0.HOG0002797	OG0001918	n10	AagrOXF_evm.TU.utg000111l.137, AagrOXF_evm.TU.utg000081l.77	Azfi_s0006.g009576, Azfi_s0101.g044406, Azfi_s2786.g113096	AT3G11630, AT5G06290	Bradi5g09650, Bradi3g45140	CBR_g34275	NA	NA	CLOP_g10292	NA	Me1_v2_0168030	Mp1g11790	NA	NA	LOC_Os02g33450, LOC_Os04g33970	NA	pm001434g0040, pm013475g0020, pm013248g0030, pm001209g0060, pm026635g0010, pm021434g0010	Pp3c2_16260, Pp3c1_21230, Pp3c1_21200	Solyc10g082030, Solyc01g007740	36651, 420519, 96390	SM000001S04447, SM000023S07655, SM000117S25465, SM000088S23690, SM000299S10845	Zci1a_35178	Zci_12395	UTEX1559_04742	UTEX1560_10867	Zm00001d050666, Zm00001d016736
Me1_v2_0113240	N0.HOG0012325	OG0010686	n0	NA	Azfi_s4120.g118048	NA	NA	NA	NA	NA	NA	NA	Me1_v2_0198380, Me1_v2_0113240	NA	NA	NA	NA	NA	pm070237g0010, pm007127g0060, pm028443g0010, pm038827g0010	Pp3c1_2830, Pp3s37_130	NA	NA	SM013464S26845, SM013728S00145, SM000131S26731	NA	NA	NA	NA	NA
Me1_v2_0124300	N0.HOG0006783	OG0005516	n0	NA	Azfi_s0284.g063088	AT2G03667	Bradi4g03827	CBR_g50115	Chrsp23S03693	Cre07.g321050_4532	CLOP_g22225, CLOP_g2565	2395	Me1_v2_0124300, Me1_v2_0124290	Mp8g06440	13243, 27131, 27132	Olucimarinus_30120, Olucimarinus_119575	LOC_Os12g38630	PRCOL_00003408_RA	pm008121g0010	Pp3c3_2850, Pp3c13_5080	Solyc05g012200	76505	SM000059S18647, SM000210S06752, SM000360S13675	NA	Zci_13206	UTEX1559_17351	UTEX1560_12256	Zm00001d030760
Me1_v2_0174030	N0.HOG0005453	OG0004264	n0	NA	NA	NA	NA	NA	NA	NA	NA	NA	Me1_v2_0217390, Me1_v2_0217000, Me1_v2_0065570, Me1_v2_0133000, Me1_v2_0170280, Me1_v2_0117760, Me1_v2_0226690, Me1_v2_0101830, Me1_v2_0076630, Me1_v2_0226700, Me1_v2_0197770, Me1_v2_0199760, Me1_v2_0174870, Me1_v2_0222720, Me1_v2_0131050, Me1_v2_0227470, Me1_v2_0050240, Me1_v2_0168790, Me1_v2_0174030, Me1_v2_0203800, Me1_v2_0222770, Me1_v2_0106980, Me1_v2_0143830, Me1_v2_0195820, Me1_v2_0232410, Me1_v2_0122180, Me1_v2_0101640, Me1_v2_0229760, Me1_v2_0208740, Me1_v2_0163860, Me1_v2_0226660, Me1_v2_0149490, Me1_v2_0124640, Me1_v2_0141940, Me1_v2_0211340	NA	NA	NA	NA	NA	NA	NA	NA	NA	NA	NA	NA	NA	NA	NA
Me1_v2_0064820	N0.HOG0009514	OG0008093	n0	NA	NA	AT5G58520, AT5G07140	Bradi1g65300	NA	NA	NA	CLOP_g20869, CLOP_g3431, CLOP_g5248, CLOP_g11921, CLOP_g22, CLOP_g13723	NA	Me1_v2_0064820	Mp7g01400	NA	NA	LOC_Os03g18430	NA	pm006244g0020, pm030808g0010, pm002130g0020, pm007936g0030, pm032522g0010	NA	Solyc06g082190	409667	NA	NA	NA	NA	NA	Zm00001d028774, Zm00001d047719
Me1_v2_0174040	N0.HOG0023689	OG0021546	n0	NA	NA	NA	NA	NA	NA	NA	NA	NA	Me1_v2_0005540, Me1_v2_0174040	NA	NA	NA	NA	NA	NA	NA	NA	NA	NA	Zci1a_25532	NA	UTEX1559_01665	NA	NA
Me1_v2_0138400	N0.HOG0006530	OG0005274	n0	AagrOXF_evm.TU.utg000095l.14, AagrOXF_evm.TU.utg000006l.903	Azfi_s0026.g023377	AT1G72020	Bradi3g45560, Bradi5g10390	CBR_g3658	Chrsp17S02585	Cre07.g349350_4532	CLOP_g14603	12496	Me1_v2_0138400	Mp1g18980, Mp1g15700	NA	NA	LOC_Os04g35300	PRCOL_00002906_RA	pm000164g0060, pm004224g0010, pm009724g0020	Pp3c19_1780, Pp3c7_11470	Solyc06g065180	NA	SM000065S20245, SM000329S12571, SM000233S07973	Zci1a_17832	Zci_01809	UTEX1559_13908	UTEX1560_00832	Zm00001d016787, Zm00001d003653
Me1_v2_0094570	N0.HOG0007705	OG0006392	n0	AagrOXF_evm.TU.utg000100l.137	NA	NA	Bradi4g31517	CBR_g48889, CBR_g17954	Chrsp68S07383	Cre56.g802249_4532, Cre16.g683650_4532	NA	14473, 2532	Me1_v2_0094570	Mp5g22820	6257, 6256, 6258, 29222, 6259	Olucimarinus_5051	LOC_Os09g27150	NA	NA	NA	Solyc04g051242.1, Solyc08g062140.1	118910	SM000111S18785, SM000078S22114, SM000187S03882	NA	Zci_15072	UTEX1559_00652	UTEX1560_14494	Zm00001d005829
Me1_v2_0176400	N0.HOG0001360	OG0000805	n0	AagrOXF_evm.TU.utg000081l.187, AagrOXF_evm.TU.utg000068l.32	Azfi_s0264.g060920, Azfi_s0034.g025327, Azfi_s0375.g067252	AT3G17720, AT3G17760, AT5G17330, AT2G02000, AT2G02010, AT1G65960	Bradi3g37830, Bradi5g11600, Bradi1g68807, Bradi1g10480, Bradi5g11640	CBR_g54059, CBR_g49684, CBR_g12535, CBR_g20356, CBR_g25818, CBR_g25815	Chrsp92S00690, Chrsp92S09262, Chrsp80S07922, Chrsp92S08239	NA	CLOP_g12915, CLOP_g16348, CLOP_g20896	942, 11909	Me1_v2_0176400, Me1_v2_0202070	Mp3g23860	27388	NA	LOC_Os08g36320, LOC_Os04g37460, LOC_Os03g13300, LOC_Os03g51080, LOC_Os04g37500	PRCOL_00005385_RA	pm000229g0030, pm002801g0040, pm074122g0010, pm040381g0010, pm000881g0010, pm014549g0020, pm083293g0010, pm001322g0020, pm004018g0010, pm010503g0010, pm000848g0060, pm060886g0010	Pp3c17_22200, Pp3c14_21530, Pp3c23_8800, Pp3c8_7810	Solyc03g098240, Solyc04g025530, Solyc01g005000, Solyc05g054050, Solyc11g011920	164618	SM000186S04138, SM000006S19450, SM000024S07865	Zci1a_18343, Zci1a_16924	Zci_08365, Zci_01502	UTEX1559_05191, UTEX1559_16117	UTEX1560_15633, UTEX1560_19553, UTEX1560_07771, UTEX1560_07772	Zm00001d031749, Zm00001d003531, Zm00001d047981, Zm00001d033805, Zm00001d003522
Me1_v2_0235310	N0.HOG0000709	OG0000381	n68	AagrOXF_evm.TU.utg000020l.129, AagrOXF_evm.TU.utg000126l.195	Azfi_s0011.g012741	AT5G65685, AT4G18240	Bradi2g18810	CBR_g53508	Chrsp35S05211, Chrsp26S04135	NA	CLOP_g23980, CLOP_g21759, CLOP_g25604	303, 948	Me1_v2_0235310, Me1_v2_0073780	Mp2g08030, Mp1g14910	14742, 28810	NA	LOC_Os02g56320, LOC_Os01g52250, LOC_Os05g45720	PRCOL_00005712_RA	pm004409g0070, pm006028.t1, pm008799g0010, pm015068g0010, pm021688g0010	Pp3c14_21270, Pp3c9_14980, Pp3c15_14300, Pp3c9_14900, Pp3c15_14210, Pp3c7_22420, Pp3c1_8710, Pp3c2_29290	Solyc02g091770, Solyc02g091760.1, Solyc02g071040	92017	SM000031S11600, SM000092S24491, SM000218S06602, SM000090S24330, SM000050S16966, SM000058S18569	Zci1a_37057, Zci1a_28257	Zci_01702	UTEX1559_12815	UTEX1560_08102, UTEX1560_08101, UTEX1560_04223	Zm00001d051976, Zm00001d010821
Me1_v2_0103980	N0.HOG0003688	OG0002701	n0	AagrOXF_evm.TU.utg000009l.50	Azfi_s0308.g064000	AT4G36850, AT2G41050, AT4G20100	Bradi2g09940	NA	Chrsp1S03235	NA	CLOP_g5465, CLOP_g12322, CLOP_g16388	10933	Me1_v2_0103990, Me1_v2_0103980, Me1_v2_0078750	Mp1g08130, Mp3g15190	6189	NA	LOC_Os01g16170	PRCOL_00003544_RA	pm000294g0060, pm013652g0010, pm006642g0040, pm034063g0010, pm030846.t1, pm021206g0020, pm015816g0010	Pp3c20_8770, Pp3c8_22100	Solyc02g089890	121256	SM000079S22493, SM000001S04526, SM000070S21336	Zci1a_11606, Zci1a_36329	Zci_15310	UTEX1559_08609, UTEX1559_15534	UTEX1560_08269, UTEX1560_09948	Zm00001d040340, Zm00001d008285
Me1_v2_0174050	NA	NA	NA	NA	NA	NA	NA	NA	NA	NA	NA	NA	NA	NA	NA	NA	NA	NA	NA	NA	NA	NA	NA	NA	NA	NA	NA	NA
Me1_v2_0233140	N0.HOG0001381	OG0000822	n6	NA	Azfi_s0006.g010089	AT2G06025	Bradi1g72830	CBR_g23316, CBR_g23678	Chrsp52S06596	Cre14.g614750_4532	CLOP_g10565	1044	Me1_v2_0233140	Mp2g11130	NA	Olucimarinus_23942	LOC_Os03g07990	PRCOL_00005114_RA	pm004241g0020, pm021361g0030, pm013252.t1, pm007457.t1	NA	Solyc12g099940, Solyc05g025890	444359	SM000005S17196, SM000054S18083, SM000287S10639	Zci1a_28415	Zci_03293	UTEX1559_03428, UTEX1559_03427	UTEX1560_11621	Zm00001d023656, Zm00001d048286
Me1_v2_0085120	NA	NA	NA	NA	NA	NA	NA	NA	NA	NA	NA	NA	NA	NA	NA	NA	NA	NA	NA	NA	NA	NA	NA	NA	NA	NA	NA	NA
Me1_v2_0076290	N0.HOG0023753	OG0021609	n0	NA	NA	NA	NA	NA	NA	NA	NA	NA	Me1_v2_0076290, Me1_v2_0197520, Me1_v2_0076280, Me1_v2_0076320	NA	NA	NA	NA	NA	NA	NA	NA	NA	NA	NA	NA	NA	NA	NA
Me1_v2_0073920	N0.HOG0001486	OG0000893	n0	AagrOXF_evm.TU.utg000005l.308, AagrOXF_evm.TU.utg000050l.304	Azfi_s0113.g045965, Azfi_s0014.g013670	AT1G28340, AT1G25570	Bradi1g26830, Bradi2g02700	CBR_g10928, CBR_g52007	NA	NA	CLOP_g24573, CLOP_g2316, CLOP_g1774, CLOP_g7848, CLOP_g761, CLOP_g6007, CLOP_g2213, CLOP_g13836	NA	Me1_v2_0173810, Me1_v2_0205490, Me1_v2_0176480, Me1_v2_0073920, Me1_v2_0163480, Me1_v2_0163500	Mp3g11240, Mp8g07230	NA	NA	LOC_Os07g31840, LOC_Os01g04720	NA	pm002208g0010, pm009466g0010, pm007692g0010, pm009466g0030, pm002208g0020, pm002166g0040, pm003836g0020, pm012717g0010, pm017466g0020, pm020319g0010, pm001155g0140, pm012292.t1, pm000365g0080, pm023658g0010	Pp3c9_7920, Pp3c27_5920, Pp3c16_5720, Pp3c7_20780, Pp3c2_37290, Pp3c26_12890, Pp3c13_11270, Pp3c3_10220, Pp3c9_5240, Pp3c15_3950	Solyc02g077850, Solyc03g006330, Solyc05g009800	133089	SM000041S15441, SM000005S17230, SM000054S18109, SM000014S00348, SM000016S01910, SM000038S14318, SM000014S00341, SM000016S01918, SM000038S14310	Zci1a_30913, Zci1a_28854, Zci1a_03503, Zci1a_27830	Zci_07692, Zci_08809	UTEX1559_06913	UTEX1560_02749, UTEX1560_17057	Zm00001d021566, Zm00001d039911
Me1_v2_0145300	N0.HOG0008273	OG0006934	n0	NA	Azfi_s0076.g037756	NA	NA	NA	NA	Cre12.g522050_4532	CLOP_g9426, CLOP_g18625	6260	Me1_v2_0145290, Me1_v2_0145300	Mp7g09700	22532, 22534, 22533	NA	NA	PRCOL_00000156_RA	pm009166g0010, pm009166g0020, pm011324g0030, pm004347g0040, pm004892g0020	NA	NA	424592, 425857	SM000038S14334, SM000016S01925, SM000014S00336	Zci1a_16608	Zci_05527	UTEX1559_05354	UTEX1560_03746	NA
Me1_v2_0235050	N0.HOG0001229	OG0000717	n0	AagrOXF_evm.TU.utg000010l.359, AagrOXF_evm.TU.utg000010l.366, AagrOXF_evm.TU.utg000011l.85	Azfi_s0014.g013585, Azfi_s0082.g038681	AT1G08830, AT5G18100, AT2G28190	Bradi1g18340, Bradi1g69680, Bradi3g43070	CBR_g3018	Chrsp33S05140, Chrsp1S03230, Chrsp1S03249, Chrsp86S08021	NA	CLOP_g7149, CLOP_g7074	8795, 14428, 12800	Me1_v2_0200870, Me1_v2_0080930, Me1_v2_0235050	Mp3g02870	18192	Olucimarinus_32550, Olucimarinus_28559	LOC_Os03g22810, LOC_Os07g46990, LOC_Os03g11960, LOC_Os08g44770	PRCOL_00005582_RA, PRCOL_00005586_RA, PRCOL_00003881_RA	pm018377g0020, pm015821.t1, pm004972g0080, pm134374g0010, pm019053g0010, pm006547.t1, pm031642g0010, pm004834g0030, pm006634g0020, pm018313g0010, pm026054g0010, pm052211g0010, pm012836g0020	Pp3c17_14500, Pp3c24_4100, Pp3c20_17920, Pp3c9_24840, Pp3c9_25690	Solyc01g067740, Solyc03g062890, Solyc11g066390	107342, 233596, 442405, 227735	SM000035S13093, SM000008S22145, SM000035S13094	Zci1a_45028, Zci1a_10291, Zci1a_07478, Zci1a_17744	Zci_04314, Zci_04317, Zci_04542, Zci_10542, Zci_10540	UTEX1559_00699, UTEX1559_04042, UTEX1559_04039, UTEX1559_04608, UTEX1559_00695	UTEX1560_11837, UTEX1560_08202, UTEX1560_01899, UTEX1560_04824	Zm00001d029170, Zm00001d047479, Zm00001d022505, Zm00001d028232, Zm00001d031908
Me1_v2_0157060	NA	NA	NA	NA	NA	NA	NA	NA	NA	NA	NA	NA	NA	NA	NA	NA	NA	NA	NA	NA	NA	NA	NA	NA	NA	NA	NA	NA
Me1_v2_0145190	N0.HOG0007982	OG0006658	n0	AagrOXF_evm.TU.utg000101l.56	Azfi_s0232.g059319, Azfi_s0301.g063716	AT5G64350	Bradi3g58255	CBR_g19026	Chrsp308S00821	NA	CLOP_g15659	10779	Me1_v2_0145190	Mp6g20890	21266, 1714	Olucimarinus_27975	LOC_Os02g52290	PRCOL_00001212_RA	pm001572g0040	Pp3c1_27870	Solyc01g105710	185086	SM000048S16506, SM000049S16746	Zci1a_28937	Zci_05536	UTEX1559_05342	UTEX1560_03729	Zm00001d018134
Me1_v2_0136120	N0.HOG0007293	OG0006003	n0	AagrOXF_evm.TU.utg000018l.358	Azfi_s0293.g063435, Azfi_s0674.g081815	AT2G36145	Bradi2g55750	NA	Chrsp29S04425	Cre03.g189350_4532	CLOP_g20385	13013	Me1_v2_0136120	Mp1g14530	28170	Olucimarinus_17819	LOC_Os01g64270	PRCOL_00001877_RA	pm017165g0010, pm000725g0020, pm008786g0010	Pp3c14_14160	Solyc12g062175.1, Solyc09g010120.2	68901	SM000044S15981, SM000001S04778, SM000127S26650	NA	Zci_08566	UTEX1559_17341	UTEX1560_12577	Zm00001d012287
Me1_v2_0027940	NA	NA	NA	NA	NA	NA	NA	NA	NA	NA	NA	NA	NA	NA	NA	NA	NA	NA	NA	NA	NA	NA	NA	NA	NA	NA	NA	NA
Me1_v2_0111350	N0.HOG0000955	OG0000532	n3	AagrOXF_evm.TU.utg000077l.136	Azfi_s0003.g007524, Azfi_s0015.g013876, Azfi_s0290.g063322, Azfi_s0036.g025736, Azfi_s0083.g038854, Azfi_s0329.g065355, Azfi_s0068.g036360, Azfi_s0109.g045376, Azfi_s0022.g016112, Azfi_s0173.g055851, Azfi_s0385.g067527	AT1G21980, AT1G77740, AT2G26420, AT3G07960, AT2G41210, AT3G56960, AT3G09920, AT1G60890, AT1G10900	Bradi1g11040, Bradi1g67420, Bradi1g19050, Bradi1g62037, Bradi1g62057, Bradi4g26530, Bradi4g43037, Bradi3g56070, Bradi1g29140, Bradi1g11530	NA	NA	NA	CLOP_g6734, CLOP_g20660, CLOP_g20659, CLOP_g1200, CLOP_g20661, CLOP_g6759	NA	Me1_v2_0111350	Mp3g18120	NA	NA	LOC_Os03g49800, LOC_Os03g15550, LOC_Os07g46490, LOC_Os03g24170, LOC_Os03g24160, LOC_Os12g04700, LOC_Os11g04840, LOC_Os02g57660, LOC_Os03g49510	NA	pm068325g0020, pm000382g0040, pm003951g0010, pm029457g0010, pm008373.t1	Pp3c7_5880, Pp3c11_21220	Solyc11g013180, Solyc04g015470, Solyc12g013470, Solyc01g096410, Solyc10g078460, Solyc10g080750, Solyc12g019880.1, Solyc10g086320, Solyc09g008480, Solyc04g017620, Solyc01g104140	449229, 230263, 124004	SM000060S19696, SM000358S13182	Zci1a_26178	Zci_02518	UTEX1559_12190	UTEX1560_01923	Zm00001d033670, Zm00001d013469, Zm00001d028512, Zm00001d022391, Zm00001d007082, Zm00001d029211, Zm00001d047457, Zm00001d029209, Zm00001d004955, Zm00001d032539, Zm00001d013920, Zm00001d014911, Zm00001d033645
Me1_v2_0055090	N0.HOG0005734	OG0004525	n0	AagrOXF_evm.TU.utg000114l.8	Azfi_s0167.g054493	AT1G10500	Bradi1g51010	CBR_g72684	Chrsp41S00446	Cre06.g800733_4532	CLOP_g17504	11643	Me1_v2_0055070, Me1_v2_0055090	Mp8g08510	2434	NA	LOC_Os06g05400	NA	pm020793.t1, pm030081g0010, pm003812g0050, pm001456.t1	Pp3s30_920, Pp3c14_20400, Pp3c2_12660, Pp3c1_29460	Solyc05g051700	173619	SM002578S08835, SM002129S06878	Zci1a_26102, Zci1a_08643, Zci1a_28993	Zci_13076	UTEX1559_15807	UTEX1560_13052	Zm00001d036145, Zm00001d045372
Me1_v2_0154280	N0.HOG0006547	OG0005290	n0	AagrOXF_evm.TU.utg000009l.206	Azfi_s0007.g010794	AT3G03250, AT5G17310	Bradi3g01640, Bradi4g37350	CBR_g4484	NA	Cre04.g229700_4532	CLOP_g17366, CLOP_g14276	3384	Me1_v2_0154280	Mp2g22950	NA	NA	LOC_Os06g20760, LOC_Os01g15910, LOC_Os02g02560, LOC_Os09g38030	NA	pm000296g0030, pm001125g0090, pm003805g0010	Pp3c11_690, Pp3c1_140	Solyc05g054060, Solyc11g011960	165987	SM000011S19079, SM000004S14919, SM000007S20918	NA	NA	NA	NA	Zm00001d015008, Zm00001d021421, Zm00001d006309
Me1_v2_0061250	N0.HOG0007835	OG0006519	n0	AagrOXF_evm.TU.utg000002l.129	Azfi_s0130.g049085, Azfi_s0251.g060284	AT3G20390	Bradi1g26277	CBR_g32332	Chrsp29S04405	Cre16.g669650_4532	CLOP_g21524	4815	Me1_v2_0061250	Mp8g13850	2205	Olucimarinus_8140	LOC_Os07g33240	PRCOL_00004025_RA	pm004131g0030	Pp3c13_21770	Solyc07g064600, Solyc10g006290	100460	SM000172S03069, SM000002S05659, SM000373S13608	Zci1a_22156	NA	UTEX1559_08997	NA	Zm00001d021626
Me1_v2_0040180	N0.HOG0039565	OG0037388	-	NA	NA	NA	NA	NA	NA	NA	NA	NA	Me1_v2_0040180, Me1_v2_0209950	NA	NA	NA	NA	NA	NA	NA	NA	NA	NA	NA	NA	NA	NA	NA
Me1_v2_0226950	N0.HOG0000305	OG0000152	n0	AagrOXF_evm.TU.utg000111l.97, AagrOXF_evm.TU.utg000005l.26, AagrOXF_evm.TU.utg000008l.265, AagrOXF_evm.TU.utg000008l.266, AagrOXF_evm.TU.utg000129l.112, AagrOXF_evm.TU.utg000018l.497, AagrOXF_evm.TU.utg000018l.502, AagrOXF_evm.TU.utg000014l.72, AagrOXF_evm.TU.utg000014l.74, AagrOXF_evm.TU.utg000029l.33, AagrOXF_evm.TU.utg000014l.90, AagrOXF_evm.TU.utg000076l.48, AagrOXF_evm.TU.utg000042l.1, AagrOXF_evm.TU.utg000076l.46, AagrOXF_evm.TU.utg000100l.277	Azfi_s0368.g067024, Azfi_s3133.g114643, Azfi_s0095.g043652, Azfi_s0074.g037455, Azfi_s0045.g029842, Azfi_s0460.g072055, Azfi_s0001.g000070, Azfi_s0074.g037328	AT2G32940, AT2G27040, AT5G21030, AT5G21150, AT1G69440, AT1G31280, AT1G31290, AT2G27880, AT5G43810, AT1G48410	Bradi4g08587, Bradi2g10370, Bradi2g14147, Bradi1g16060, Bradi5g21810, Bradi5g21800, Bradi1g28260, Bradi1g54977, Bradi1g05162, Bradi1g02050, Bradi1g12431, Bradi1g36907, Bradi5g18540, Bradi3g51077, Bradi3g60697, Bradi1g29577	CBR_g29701, CBR_g18986, CBR_g42138, CBR_g3051	Chrsp35S00397, Chrsp6S07414, Chrsp23S03751	Cre16.g689647_4532, Cre04.g214250_4532, Cre02.g141050_4532	CLOP_g15809, CLOP_g2462, CLOP_g7457	11464, 46, 4056, 11133, 3297, 8589	Me1_v2_0171190, Me1_v2_0026800, Me1_v2_0157540, Me1_v2_0226950	Mp1g23190, Mp6g20400, Mp8g08610, Mp1g18110, Mp6g14610	7525, 7526, 19679, 177, 175, 176, 3677, 12955, 28750	NA	LOC_Os02g40320, LOC_Os07g16224, LOC_Os01g16870, LOC_Os04g06770, ChrSy.fgenesh.gene.6, LOC_Os03g33650, LOC_Os04g52540, LOC_Os04g52550, LOC_Os07g28850, LOC_Os07g09020, LOC_Os02g40280, LOC_Os03g57560, LOC_Os03g58600, LOC_Os03g57540, LOC_Os03g47830, LOC_Os03g47820, LOC_Os06g39640, LOC_Os01g16860, LOC_Os02g07310, LOC_Os04g47870, LOC_Os02g45070, LOC_Os02g58490, LOC_Os06g51310	NA	pm000453.t1, pm005933g0040, pm027032g0010, pm015233g0030, pm008472g0040, pm000547g0020, pm000547.t2, pm114187g0010, pm004228g0020, pm016604g0020, pm022578g0010, pm114292g0010, pm001136g0120, pm010718g0020, pm027404g0010, pm008695g0010	Pp3c4_26780, Pp3c19_20670, Pp3c9_18080, Pp3c19_860, Pp3c18_9600, Pp3c17_16550, Pp3c2_4060, Pp3c1_35770, Pp3c17_350	Solyc07g049500, Solyc03g111760, Solyc01g008960, Solyc06g073540, Solyc06g073530, Solyc01g096750.1, Solyc01g010970, Solyc02g069280.2, Solyc02g069260, Solyc02g069270.2, Solyc06g074730, Solyc12g006790, Solyc09g082830, Solyc06g072300, Solyc03g098280	99227, 60551, 232189, 446086, 110151, 109987, 98227	SM000128S26198, SM000188S03828, SM000329S12567, SM000041S15439, SM000005S17232, SM000054S18111	Zci1a_38915, Zci1a_03720, Zci1a_02891	Zci_12659, Zci_07694	UTEX1559_12258, UTEX1559_12259, UTEX1559_06909	UTEX1560_04114, UTEX1560_04115, UTEX1560_02744, UTEX1560_02743	Zm00001d019905, Zm00001d040429, Zm00001d008249, Zm00001d039214, Zm00001d005921, Zm00001d029573, Zm00001d026300, Zm00001d002316, Zm00001d033206, Zm00001d021345, Zm00001d006351, Zm00001d007786, Zm00001d015926, Zm00001d005045, Zm00001d018436, Zm00001d013063, Zm00001d032611, Zm00001d009158, Zm00001d013542, Zm00001d033518, Zm00001d036917, Zm00001d046438, Zm00001d051289, Zm00001d002650, Zm00001d026111, Zm00001d037833, Zm00001d044183, Zm00001d035747, Zm00001d011096, Zm00001d025073, Zm00001d025331, Zm00001d014875
Me1_v2_0199970	N0.HOG0014870	OG0013023	n0	AagrOXF_evm.TU.utg000094l.30	NA	NA	NA	NA	NA	NA	NA	10810	Me1_v2_0199970	NA	NA	NA	NA	NA	NA	Pp3c5_22920, Pp3c6_6830	NA	NA	SM000229S07504, SM000008S22396, SM000024S07791	NA	NA	NA	NA	NA
Me1_v2_0129210	N0.HOG0007390	OG0006096	n0	AagrOXF_evm.TU.utg000081l.160	Azfi_s0495.g073588	AT5G51720	Bradi1g28410	CBR_g49669	NA	Cre01.g050550_4532	CLOP_g2218	6875, 817	Me1_v2_0129210	Mp4g09950	14463	NA	LOC_Os07g28400	NA	pm011483g0030, pm000030g0040, pm001506g0040, pm002069g0020	Pp3c24_720, Pp3c23_14000	Solyc10g012090, Solyc03g007030	NA	SM000129S26126, SM000023S07532, SM000154S01408, SM000062S19934	NA	Zci_03346	UTEX1559_03497	UTEX1560_01631	Zm00001d021360
Me1_v2_0167160	N0.HOG0002816	OG0001936	n0	NA	NA	NA	NA	NA	NA	NA	NA	NA	Me1_v2_0129310, Me1_v2_0097260, Me1_v2_0097310, Me1_v2_0097250, Me1_v2_0097280, Me1_v2_0167150, Me1_v2_0148470, Me1_v2_0105810, Me1_v2_0145900, Me1_v2_0130560, Me1_v2_0139370, Me1_v2_0181010, Me1_v2_0167460, Me1_v2_0167540, Me1_v2_0167560, Me1_v2_0147240, Me1_v2_0147170, Me1_v2_0147180, Me1_v2_0147270, Me1_v2_0147150, Me1_v2_0147440, Me1_v2_0147660, Me1_v2_0070750, Me1_v2_0147160, Me1_v2_0147280, Me1_v2_0147090, Me1_v2_0147110, Me1_v2_0147680, Me1_v2_0147720, Me1_v2_0147450, Me1_v2_0147520, Me1_v2_0147550, Me1_v2_0080970, Me1_v2_0200600, Me1_v2_0091160, Me1_v2_0219400, Me1_v2_0151890, Me1_v2_0075730, Me1_v2_0211900, Me1_v2_0032330, Me1_v2_0129330, Me1_v2_0105900, Me1_v2_0137160, Me1_v2_0137250, Me1_v2_0129320, Me1_v2_0156340, Me1_v2_0108190, Me1_v2_0195710, Me1_v2_0158930, Me1_v2_0167200, Me1_v2_0167160	NA	NA	NA	NA	NA	NA	NA	NA	NA	NA	NA	NA	NA	NA	NA
