AT5G41040
AT4G31940
AT3G17390
AT1G67980
AT4G13555
AT5G05980
AT5G35550
AT5G05340
AT1G79180
AT4G22680
AT5G13930
AT4G13660
AT3G19450
AT1G17260
AT3G16340
AT4G38620
AT1G61810
AT3G27190
AT2G30490
AT5G48930
AT2G37040
AT1G32100
AT5G60020
AT2G22420
AT3G44540
AT5G04230
AT5G03260
AT2G21730
AT3G11980
AT5G13580
AT1G04220
AT5G22500
AT1G61820
AT3G53510
AT4G09820
AT5G23260
AT5G58860
AT4G36220
AT1G72680
AT5G05170
AT4G11180
AT5G52240
AT4G39330
AT3G16920
AT1G64670
AT3G55580
AT5G16600
AT1G17840
AT2G38080
AT4G34050
AT5G04330
AT3G44560
AT1G05850
AT2G46770
AT1G15950
AT4G23690
AT3G12900
AT1G64160
AT1G12840
AT3G59030
AT4G22880
AT4G17785
AT1G16490
AT3G44550
AT4G39230
AT4G34100
AT1G22640
AT5G54160
AT1G63910
AT4G37970
AT5G22420
AT1G66230
AT4G01070
AT1G28680
AT3G21230
AT2G37360
AT5G49660
AT3G53260
AT3G24503
AT5G23190
AT4G37980
AT2G21890
AT5G13420
AT1G80820
AT2G40890
AT4G34230
AT5G20230
AT3G56700
AT5G66390
AT5G48100
AT1G61590
AT1G07890
AT1G32770
AT5G63560
AT1G71030
AT4G37990
AT5G10280
AT3G11430
AT3G10340
AT3G11670
AT2G28670
AT4G33790
AT4G12350
AT3G13610
AT4G39410