"","x"
"1","Zci_05187"
"2","Zci_02421"
"3","Zci_11021"
"4","Zci_12394"
"5","Zci_09313"
"6","Zci_09619"
"7","Zci_07518"
"8","Zci_14500"
"9","Zci_12145"
"10","Zci_01588"
"11","Zci_09179"
"12","Zci_09456"
"13","Zci_08813"
"14","Zci_01098"
"15","Zci_11074"
"16","Zci_08876"
"17","Zci_03379"
"18","Zci_06375"
"19","Zci_07353"
"20","Zci_04510"
