{
	"n_targets": 20030,
	"n_bootstraps": 100,
	"n_processed": 16374394,
	"n_pseudoaligned": 11001654,
	"n_unique": 9617119,
	"p_pseudoaligned": 67.2,
	"p_unique": 58.7,
	"kallisto_version": "0.48.0",
	"index_version": 10,
	"start_time": "Fri Mar  3 13:30:26 2023",
	"call": "kallisto quant --bootstrap-samples 100 --rf-stranded -t 20 -i /scratch/users/dadras/Stress_profiling_of_zygnema_circumcarinatum_1b/kallisto_index/SAG698_1b_CDS.fna.idx -o /scratch/users/dadras/Stress_profiling_of_zygnema_circumcarinatum_1b/kallisto/Z_1_47_EKRN220057126-1A_H23CGDSX5_L3 /scratch/users/dadras/Stress_profiling_of_zygnema_circumcarinatum_1b/trimmed_reads_PE/Z_1_47_EKRN220057126-1A_H23CGDSX5_L3_1.fq.gz /scratch/users/dadras/Stress_profiling_of_zygnema_circumcarinatum_1b/trimmed_reads_PE/Z_1_47_EKRN220057126-1A_H23CGDSX5_L3_2.fq.gz"
}
