0.9797525309336333	0.9641350210970464	0.915	0.9034045922406968	0.8889566809029896	0.9721074380165289	0.9359649122807018	0.9770378874856487	0.9695697796432319	0.9028944911297853	0.984930032292788	0.9662309368191722	0.9708520179372198	0.9518072289156626
0.9793103448275862	0.9599198396793587	0.9215938303341902	0.9698324022346368	0.956989247311828	0.952755905511811	0.9361702127659575	0.985781990521327	0.962	0.9651162790697675	0.9519650655021834	0.9768421052631578	0.9888888888888889	0.9300184162062615
0.9855072463768116	0.9745145631067961	0.976274165202109	0.8465804066543439	0.7988587731811698	0.9662650602409638	0.9906191369606003	0.9906291834002677	0.985594237695078	0.9493927125506073	0.9950124688279302	0.962962962962963	0.9710144927536232	0.9728199320498301
0.9900990099009901	0.9891304347826086	0.9618717504332756	0.971342383107089	0.9686346863468634	0.9754385964912281	0.9880952380952381	0.9946524064171123	0.9927797833935018	0.9783549783549783	0.9915966386554622	0.9707112970711297	0.9858490566037735	0.9728915662650602
0.9900744416873449	0.9634408602150537	0.9886506935687264	0.8978829389788294	0.9019118869492935	0.9772727272727273	0.9785100286532952	0.9844155844155844	0.9766454352441614	0.9403453689167975	1	0.9864559819413092	0.9854368932038835	0.9869646182495344
0.9883495145631068	0.9741824440619621	0.9753914988814317	0.8887652947719689	0.8556618819776715	0.9764705882352941	0.9902319902319903	0.9960238568588469	0.9794520547945206	0.9549668874172186	0.9909420289855072	0.9574074074074074	0.9769230769230769	0.9845679012345679
0.9892761394101877	0.965675057208238	0.9262865090403338	0.9833531510107015	0.9745830023828436	0.9689578713968958	0.8616666666666667	0.988795518207283	0.9364705882352942	0.9477977161500816	0.972636815920398	0.9952038369304557	0.9922077922077922	0.9881889763779528
0.9695652173913043	0.9602272727272727	0.9245049504950495	0.983991462113127	0.9579579579579579	0.9611829944547134	0.8427299703264095	0.9799554565701559	0.9621928166351607	0.9563994374120957	0.9676113360323887	0.9921875	0.9853556485355649	0.973109243697479
0.9832402234636871	0.9954233409610984	0.8429878048780488	0.9976190476190476	0.9800478850758181	0.9750566893424036	0.956386292834891	1	0.9742990654205608	0.9904153354632588	0.8980716253443526	0.9900497512437811	0.9973262032085561	0.8866666666666667
0.9888888888888889	0.9841897233201581	0.9787610619469027	0.9908256880733946	0.9776119402985075	0.973384030418251	0.9812108559498957	0.9625	0.9637096774193549	0.9655172413793104	0.9907407407407407	0.990990990990991	0.9895287958115183	0.9840764331210191
0.9879518072289156	1	1	0.9964285714285714	0.9989969909729187	0.9941520467836258	1	1	1	0.9971509971509972	1	1	0.9893617021276596	1
