Solyc01g014370
Solyc02g082375.1
Solyc02g082390.1
Solyc01g057670.1
Solyc07g054050
Solyc02g032520.1
Solyc01g021685.1
Solyc09g083305.1
Solyc01g020113.1
Solyc04g018080
Solyc12g038950
Solyc01g058060.1
Solyc08g065450
Solyc06g065445.1
Solyc01g103000
Solyc01g107680
Solyc07g021660
Solyc05g054540
Solyc10g062110
Solyc10g038110.1
Solyc03g063860.1
Solyc06g050825.1
Solyc11g027820.1
Solyc02g055390
Solyc10g150127
Solyc06g016823.1
Solyc12g049440
