PCs	condition	treatment	replicate	time_after_t0	temperature	light_intensity
PC_1	4.584766385172881e-11	1.8672191563864186e-10	0.8264274135051868	0.0222270829978829	1.8547249550032506e-26	0.056634111040440895
PC_2	0.00808217776872458	0.02980732226323813	0.7442865468352489	9.510166637324305e-5	0.7326668098845447	0.022041558534962615
PC_3	0.17696984780571254	0.42713620256683815	0.5660460916736827	8.537529579609006e-7	8.258351216594854e-6	0.07520555873192919
PC_4	0.007221394933840854	0.0396391193858249	0.049910511072702994	0.02956520882078498	0.572766523246435	1.040153853345511e-6
