GeneID	HOG	OG	Gene Tree Parent Clade	A_agrestis_oxf	A_filiculoides	A_thaliana	B_distachyon	C_braunii	C_melkonianii	C_reinhardtii	Closterium_sp_NIES_67	K_nitens	M_endlicherianum	M_polymorpha	M_viride	O_lucimarinus	O_sativa	P_coloniale	P_margaritaceum	P_patens	S_lycopersicum	S_moellendorffii	S_muscicola	Z_circumcarinatum_SAG698_1a	Z_circumcarinatum_SAG698_1b	Z_circumcarinatum_UTEX1559	Z_circumcarinatum_UTEX1560	Z_mays
Zci_06386	N0.HOG0018267	OG0016237	n0	NA	NA	NA	NA	NA	NA	NA	NA	NA	Me1_v2_0196070	NA	NA	NA	NA	NA	NA	NA	NA	NA	NA	Zci1a_39831, Zci1a_26617	Zci_06386	UTEX1559_06065	UTEX1560_00508	NA
Zci_07190	N0.HOG0009390	OG0007981	n0	AagrOXF_evm.TU.utg000032l.22	Azfi_s0288.g063245	NA	NA	NA	NA	Cre03.g174950_4532, Cre07.g322900_4532	CLOP_g16409	2230	Me1_v2_0134440, Me1_v2_0073640, Me1_v2_0073650	Mp5g03190	NA	Olucimarinus_28912	NA	NA	pm006542g0020	Pp3c4_30520	NA	NA	SM000090S24315, SM000058S18555, SM000155S01630	Zci1a_10704, Zci1a_10705	Zci_07190	UTEX1559_16284	UTEX1560_04626	NA
Zci_01658	N0.HOG0025380	OG0023234	n0	NA	NA	NA	NA	NA	NA	NA	NA	NA	NA	NA	NA	NA	NA	NA	NA	NA	NA	NA	NA	Zci1a_06095	Zci_01658	UTEX1559_13010	UTEX1560_08850	NA
Zci_12601	N0.HOG0025584	OG0023438	n0	NA	NA	NA	NA	NA	NA	NA	NA	NA	NA	NA	NA	NA	NA	NA	NA	NA	NA	NA	NA	Zci1a_29619	Zci_12601	UTEX1559_02905	UTEX1560_12101	NA
Zci_10731	N0.HOG0003165	OG0002240	n0	NA	Azfi_s0029.g024152, Azfi_s0277.g061484	AT3G03341	Bradi2g45050, Bradi2g45054	NA	NA	Cre13.g575701_4532, Cre03.g207152_4532, Cre03.g207100_4532	CLOP_g14963	NA	Me1_v2_0190320, Me1_v2_0190000	Mp7g14620, Mp7g00660, Mp7g00670	NA	NA	NA	NA	NA	Pp3c4_12160, Pp3c24_9690, Pp3c8_12730, Pp3c8_12731, Pp3c19_9840, Pp3c23_9530, Pp3c21_13210, Pp3c19_5500, Pp3c19_5460	Solyc02g091390	228059, 228058, 172214, 147726, 133730	SM000062S19947, SM000023S07561, SM000154S01426, SM000023S07560, SM000062S19959, SM000154S01433	Zci1a_10198, Zci1a_10195, Zci1a_42418	Zci_10731, Zci_10725, Zci_10730	UTEX1559_08816, UTEX1559_08823, UTEX1559_08817	UTEX1560_04723, UTEX1560_04724	Zm00001d044078
Zci_02940	N0.HOG0033283	OG0031106	-	NA	NA	NA	NA	NA	NA	NA	NA	NA	NA	NA	NA	NA	NA	NA	NA	NA	NA	NA	NA	NA	Zci_02940	UTEX1559_03031	UTEX1560_04199	NA
Zci_12597	N0.HOG0014347	OG0012542	n0	NA	NA	NA	NA	NA	Chrsp1S03111	NA	CLOP_g12840	7847	Me1_v2_0162450, Me1_v2_0210130	NA	NA	NA	NA	NA	pm006499.t1	NA	NA	NA	NA	NA	Zci_12597	UTEX1559_02912	UTEX1560_09911	NA
Zci_09545	N0.HOG0005325	OG0004147	n0	AagrOXF_evm.TU.utg000058l.391	Azfi_s0048.g030540	AT3G12930	Bradi4g34018	CBR_g48397	NA	Cre03.g205600_4532	CLOP_g12240	5102	Me1_v2_0077940	Mp2g04320	27705, 27706	Olucimarinus_10585	LOC_Os09g32030	PRCOL_00002538_RA	pm026809g0010, pm016046g0020, pm021863g0010, pm008613g0010, pm020537.t1, pm201647g0010	Pp3c9_2790, Pp3c15_7010	Solyc07g066460	402255	SM000257S08643, SM000061S19296, SM006438S20495, SM000204S05848	NA	Zci_09545	UTEX1559_17399, UTEX1559_02379	UTEX1560_08889, UTEX1560_13682	Zm00001d020971
Zci_05996	N0.HOG0021500	OG0019397	n0	NA	NA	NA	NA	NA	NA	NA	NA	NA	NA	NA	NA	NA	NA	NA	NA	NA	NA	NA	NA	Zci1a_34975, Zci1a_41902	Zci_05996	UTEX1559_14259	UTEX1560_04058	NA
Zci_04835	N0.HOG0001969	OG0001254	n0	AagrOXF_evm.TU.utg000041l.187, AagrOXF_evm.TU.utg000100l.40	Azfi_s0126.g048639, Azfi_s0032.g024749, Azfi_s0001.g000001, Azfi_s0156.g053739, Azfi_s0052.g031656	AT4G10120, AT5G20280, AT5G11110, AT1G04920	Bradi4g21750, Bradi3g06217, Bradi1g30520, Bradi3g20120, Bradi2g58860	CBR_g48279	Chrsp26S04101	Cre12.g524000_4532	CLOP_g22915	13629	Me1_v2_0180720	Mp3g02650, Mp2g16990	2429, 2428, 2430	NA	LOC_Os11g12810, LOC_Os02g09170, LOC_Os06g43630, LOC_Os08g20660, LOC_Os01g69030	NA	pm025582g0010, pm024710g0010, pm000635g0030	Pp3c15_24340, Pp3c9_24290, Pp3c9_24289, Pp3c9_25200	Solyc11g045110, Solyc07g007790, Solyc08g042000, Solyc09g092130	148419, 20205, 91988, 428419	SM000026S08896, SM000011S18991, SM000048S16583	Zci1a_05566	Zci_04835	UTEX1559_01441	UTEX1560_01193, UTEX1560_01192	Zm00001d048979, Zm00001d015570, Zm00001d036749, Zm00001d046595, Zm00001d016399, Zm00001d050125, Zm00001d042353, Zm00001d012036
Zci_12263	N0.HOG0000883	OG0000501	n5	NA	Azfi_s0013.g013200	AT2G24040, AT4G28088, AT4G30660, AT4G30650, AT1G57550, AT2G38905, AT3G05880, AT3G05890	Bradi1g31072, Bradi1g47270, Bradi4g37720, Bradi1g65780, Bradi2g11135, Bradi1g61460, Bradi2g36766, Bradi1g20220	NA	Chrsp26S08859	Cre03.g196800_4532	CLOP_g9263, CLOP_g24298	9402, 8418, 8417	Me1_v2_0055740	Mp3g18270, Mp1g23330, Mp2g15060, Mp1g07180, Mp1g15610, Mp1g26550	NA	NA	LOC_Os09g15365, LOC_Os01g18375, LOC_Os06g44220, LOC_Os06g08564, LOC_Os09g38560, LOC_Os03g17790, LOC_Os05g03130, LOC_Os03g25460, LOC_Os05g04700, LOC_Os07g44180	NA	pm016543.t1, pm011590g0020, pm002757g0050, pm031584g0010, pm025866.t1, pm005309g0020, pm006306g0030, pm011294g0020, pm028885g0010, pm012039g0030, pm021709g0020, pm000073g0040, pm027361g0020	Pp3c7_16750, Pp3c2_35200, Pp3c22_14960, Pp3c19_16280, Pp3c9_23190	Solyc07g005715.1, Solyc07g005730, Solyc07g005720, Solyc04g049960, Solyc01g150152, Solyc01g102290	136629, 227480	SM000003S11127, SM000262S09875, SM000100S09459, SM000079S22501	Zci1a_16681, Zci1a_27960, Zci1a_31862, Zci1a_31861	Zci_03358, Zci_03357, Zci_04411, Zci_08251, Zci_12263, Zci_12264	UTEX1559_03512, UTEX1559_09168, UTEX1559_13230, UTEX1559_00751, UTEX1559_00752	UTEX1560_15634, UTEX1560_01619, UTEX1560_09097, UTEX1560_06763, UTEX1560_14691, UTEX1560_14692	Zm00001d046834, Zm00001d045096, Zm00001d006329, Zm00001d028718, Zm00001d035505, Zm00001d047419, Zm00001d040544, Zm00001d008200, Zm00001d024778, Zm00001d022264
Zci_12946	N0.HOG0012541	OG0010880	n0	NA	NA	NA	NA	NA	NA	NA	NA	NA	Me1_v2_0085590	NA	NA	NA	NA	NA	NA	NA	NA	NA	SM000056S17989, SM000003S11077, SM000107S14041	Zci1a_18105, Zci1a_14798	Zci_12946, Zci_12947	UTEX1559_14658, UTEX1559_14659	UTEX1560_04852, UTEX1560_04853	NA
Zci_12106	N0.HOG0000645	OG0000339	n0	NA	Azfi_s0124.g048472, Azfi_s0012.g013047, Azfi_s0638.g080506	NA	Bradi3g38500, Bradi2g31690	NA	NA	NA	CLOP_g1278, CLOP_g10300, CLOP_g1293, CLOP_g1483, CLOP_g22195, CLOP_g1898, CLOP_g22616, CLOP_g1903, CLOP_g15040, CLOP_g1068, CLOP_g19314, CLOP_g9751, CLOP_g8281	NA	Me1_v2_0061180, Me1_v2_0128110, Me1_v2_0098180, Me1_v2_0112910, Me1_v2_0201670, Me1_v2_0178730, Me1_v2_0017870, Me1_v2_0178740, Me1_v2_0044970, Me1_v2_0049220, Me1_v2_0071380, Me1_v2_0141580, Me1_v2_0066940, Me1_v2_0201690, Me1_v2_0061190, Me1_v2_0047910, Me1_v2_0162090, Me1_v2_0053720, Me1_v2_0143900, Me1_v2_0184070	Mp2g02610, Mp2g01900, Mp2g10380	NA	Olucimarinus_26901, Olucimarinus_92070	LOC_Os08g37750, LOC_Os10g22520, LOC_Os10g22570, LOC_Os05g15510	NA	pm014646g0010, pm046559g0010, pm015579g0030, pm001729.t1, pm001729g0020, pm153782g0010, pm005796g0010, pm014925.t1, pm004031g0060, pm016439g0010, pm030810.t1, pm005539g0010, pm034376g0010, pm257898g0010, pm001726g0040, pm017974g0010, pm043451g0020, pm017974g0020, pm042896g0010, pm019527g0010, pm043451g0010, pm002294.t1, pm015579g0040	Pp3c2_32790, Pp3c11_9800	Solyc11g010350, Solyc12g056960	404183, 126827, 24801, 426582, 126777	SM000023S07575, SM000001S04456, SM000034S12807, SM000030S11367, SM000076S21780, SM000028S10167, SM000018S03663, SM000026S08890, SM000126S26345, SM000002S05654, SM000172S03072	Zci1a_18179, Zci1a_02754, Zci1a_43860, Zci1a_02465, Zci1a_02464, Zci1a_43861, Zci1a_02466, Zci1a_37616, Zci1a_40767, Zci1a_08077, Zci1a_33479, Zci1a_09166, Zci1a_09122	Zci_00093, Zci_00090, Zci_12714, Zci_11216, Zci_05036, Zci_01533, Zci_03480, Zci_08397, Zci_12106	UTEX1559_11052, UTEX1559_18289, UTEX1559_08280, UTEX1559_10506, UTEX1559_16037, UTEX1559_11564, UTEX1559_10063, UTEX1559_05221, UTEX1559_05637	UTEX1560_08951, UTEX1560_16971, UTEX1560_18161, UTEX1560_00339, UTEX1560_03905, UTEX1560_01391, UTEX1560_07805, UTEX1560_08237, UTEX1560_04434, UTEX1560_06234	Zm00001d044877, Zm00001d010039
Zci_14853	N0.HOG0033603	OG0031426	-	NA	NA	NA	NA	NA	NA	NA	NA	NA	NA	NA	NA	NA	NA	NA	NA	NA	NA	NA	NA	NA	Zci_14853	UTEX1559_14539	UTEX1560_12446	NA
Zci_01717	N0.HOG0007944	OG0006621	n0	AagrOXF_evm.TU.utg000063l.46	Azfi_s0490.g073528	AT3G55760	Bradi4g15010	CBR_g19275	NA	NA	CLOP_g6361	4562	Me1_v2_0206360	Mp6g07520	NA	NA	LOC_Os11g37560, LOC_Os02g45410	PRCOL_00006683_RA	pm020926g0010, pm002033g0030, pm048325g0020	Pp3c25_530	Solyc06g053920	21913	SM000014S00420, SM000097S24828, SM000249S08253	Zci1a_35746, Zci1a_27453	Zci_01717	UTEX1559_12799	UTEX1560_04432	Zm00001d052977
Zci_15298	N0.HOG0033315	OG0031138	-	NA	NA	NA	NA	NA	NA	NA	NA	NA	NA	NA	NA	NA	NA	NA	NA	NA	NA	NA	NA	NA	Zci_15298	UTEX1559_02324	UTEX1560_10633	NA
Zci_11526	N0.HOG0009192	OG0007796	n0	AagrOXF_evm.TU.utg000087l.174, AagrOXF_evm.TU.utg000087l.175	NA	NA	NA	CBR_g20187, CBR_g39529	NA	NA	CLOP_g15316	NA	Me1_v2_0204770, Me1_v2_0204790	Mp3g24550, Mp6g03950	NA	NA	NA	NA	NA	Pp3c26_8220, Pp3c26_10110	NA	440311	SM000020S05970, SM000018S03717, SM000152S01553, SM000024S07809, SM000006S19375, SM000008S22391	Zci1a_35361	Zci_11526	UTEX1559_05144	UTEX1560_07419	NA
Zci_12865	N0.HOG0000912	OG0000518	n1	AagrOXF_evm.TU.utg000083l.41	Azfi_s0217.g058556, Azfi_s2579.g112200, Azfi_s2099.g109275, Azfi_s2099.g109271, Azfi_s2099.g109274, Azfi_s3017.g114137, Azfi_s3017.g114134	AT5G35930	Bradi1g50212	CBR_g4474	Chrsp17S02841	Cre12.g529301_4532	CLOP_g7327	441	Me1_v2_0160220, Me1_v2_0081630, Me1_v2_0068450	Mp4g00620	24774, 24773, 1627, 15376, 15315, 15345, 15319, 15313, 15343, 15346, 15320, 15347, 15314, 15377, 15344, 15316, 10266, 8708, 15375, 15378, 8707, 1628, 1626, 2032, 23661, 16296, 16293, 16295, 16294, 5867, 5858, 5866, 5869, 5864, 5862, 5868, 5863, 5861, 5865	NA	LOC_Os06g02160	NA	pm008779g0060, pm318343g0010	Pp3c10_8470	Solyc01g081050.4	149203	SM000298S10943, SM000099S25251, SM000350S13033, SM000001S04630, SM000004S14930, SM000007S20905, SM000053S17484, SM000160S02548, SM000091S24597, SM004066S15622, SM008316S23429, SM001694S02643, SM002100S06802	Zci1a_35068, Zci1a_35069, Zci1a_22471, Zci1a_16581	Zci_12865, Zci_09655	UTEX1559_09702, UTEX1559_10976, UTEX1559_10975	UTEX1560_02233, UTEX1560_02234, UTEX1560_12490, UTEX1560_15449, UTEX1560_15448, UTEX1560_15447, UTEX1560_08862	Zm00001d045551
Zci_03818	N0.HOG0001105	OG0000631	n1	NA	Azfi_s0168.g054612, Azfi_s0045.g029824	AT1G07180, AT2G29990	Bradi2g53970, Bradi1g24620	CBR_g34649	Chrsp94S00707	Cre16.g691552_4532	CLOP_g2341	12150	Me1_v2_0162970	Mp6g03220	NA	NA	LOC_Os01g61410, LOC_Os07g37730	PRCOL_00003446_RA	pm003230g0060, pm006574g0030	Pp3c10_11280, Pp3c1_33500	Solyc06g007160, Solyc02g078900	231541	SM003566S13161, SM000051S17551, SM000181S03545, SM000103S09472, SM000060S19653, SM000005S17339, SM000041S15493	Zci1a_15299	Zci_03818	UTEX1559_18039	UTEX1560_12182	Zm00001d012464, Zm00001d021804
Zci_10730	N0.HOG0003165	OG0002240	n0	NA	Azfi_s0029.g024152, Azfi_s0277.g061484	AT3G03341	Bradi2g45050, Bradi2g45054	NA	NA	Cre13.g575701_4532, Cre03.g207152_4532, Cre03.g207100_4532	CLOP_g14963	NA	Me1_v2_0190320, Me1_v2_0190000	Mp7g14620, Mp7g00660, Mp7g00670	NA	NA	NA	NA	NA	Pp3c4_12160, Pp3c24_9690, Pp3c8_12730, Pp3c8_12731, Pp3c19_9840, Pp3c23_9530, Pp3c21_13210, Pp3c19_5500, Pp3c19_5460	Solyc02g091390	228059, 228058, 172214, 147726, 133730	SM000062S19947, SM000023S07561, SM000154S01426, SM000023S07560, SM000062S19959, SM000154S01433	Zci1a_10198, Zci1a_10195, Zci1a_42418	Zci_10731, Zci_10725, Zci_10730	UTEX1559_08816, UTEX1559_08823, UTEX1559_08817	UTEX1560_04723, UTEX1560_04724	Zm00001d044078
Zci_09021	N0.HOG0033159	OG0030982	-	NA	NA	NA	NA	NA	NA	NA	NA	NA	NA	NA	NA	NA	NA	NA	NA	NA	NA	NA	NA	NA	Zci_09021	UTEX1559_07754	UTEX1560_10860	NA
Zci_09550	N0.HOG0001193	OG0000700	n1	AagrOXF_evm.TU.utg000001l.77	Azfi_s0385.g067531	AT2G02860	Bradi3g56740, Bradi3g46790, Bradi3g25477, Bradi1g73170	CBR_g135	Chrsp29S04379, Chrsp57S06817, Chrsp57S06827	NA	NA	3120	Me1_v2_0077990	Mp3g10870	11635, 11636	NA	LOC_Os02g58080, LOC_Os02g36700, LOC_Os10g26470, LOC_Os03g07480	PRCOL_00006055_RA	pm004434.t1, pm030151g0010, pm004927g0060, pm002505g0010	Pp3c2_3000, Pp3c1_32060	Solyc05g007190.4	266927	SM000108S14189, SM000012S25280, SM000230S07354	NA	Zci_09550	UTEX1559_02383	UTEX1560_17594	Zm00001d018527, Zm00001d050873, Zm00001d016938, Zm00001d033011, Zm00001d027854, Zm00001d048311
Zci_06450	N0.HOG0003624	OG0002639	n0	AagrOXF_evm.TU.utg000081l.101	Azfi_s0114.g046131	AT1G15110	Bradi2g17230, Bradi2g01370	NA	Chrsp27S04325	NA	CLOP_g19267	11823	Me1_v2_0131000	Mp7g05610	14876, 26381	Olucimarinus_3295	LOC_Os05g48060, LOC_Os01g49024, LOC_Os01g02890	PRCOL_00004560_RA	pm006137.t2	Pp3c26_4170, Pp3c4_15740	Solyc05g008580, Solyc04g007520	92791	SM000022S07196, SM000305S11807, SM000017S02916	Zci1a_04081, Zci1a_04082	Zci_06450	UTEX1559_04984	UTEX1560_07458, UTEX1560_02960	Zm00001d018013, Zm00001d038936, Zm00001d046465, Zm00001d012308, Zm00001d038837, Zm00001d008557, Zm00001d006229, Zm00001d009497, Zm00001d040076, Zm00001d008493, Zm00001d015809
Zci_13883	N0.HOG0007637	OG0006325	n0	AagrOXF_evm.TU.utg000091l.154, AagrOXF_evm.TU.utg000049l.348	Azfi_s0001.g000535	NA	NA	CBR_g2820, CBR_g36668	NA	NA	NA	11286, 446, 443, 444, 445	Me1_v2_0176170	Mp5g01810, Mp5g17310	25407, 8469	NA	NA	PRCOL_00001604_RA, PRCOL_00005961_RA, PRCOL_00001444_RA	NA	Pp3c4_9910	NA	NA	SM000182S03922, SM000015S01249, SM000128S26258	Zci1a_44922	Zci_05070, Zci_13883	UTEX1559_09042	UTEX1560_06464, UTEX1560_07077	NA
Zci_10741	N0.HOG0021519	OG0019416	n0	NA	NA	NA	NA	NA	NA	NA	NA	NA	NA	NA	NA	NA	NA	NA	NA	NA	NA	NA	NA	Zci1a_27087, Zci1a_17949	Zci_10741	UTEX1559_08805	UTEX1560_10248	NA
Zci_01042	N0.HOG0000946	OG0000527	n54	AagrOXF_evm.TU.utg000063l.507__508, AagrOXF_evm.TU.utg000050l.692	Azfi_s0215.g058376, Azfi_s0015.g013820	AT3G46970, AT3G29320	Bradi2g55120, Bradi1g08070	CBR_g12053	Chrsp33S05080	NA	NA	10273, 15059	Me1_v2_0177850, Me1_v2_0167880	Mp3g02670, Mp1g09490	21280, 21279, 21281	Olucimarinus_25192	LOC_Os01g63270, LOC_Os03g55090	PRCOL_00006748_RA	pm010784g0010, pm001480g0050, pm001596g0040	Pp3c1_12800, Pp3c6_14860, Pp3c6_24700	Solyc09g031970, Solyc05g012510, Solyc03g065340	164611, 184206	SM000004S14954, SM000007S20894, SM000106S13976, SM000035S13126, SM000352S13419	Zci1a_18651, Zci1a_16135	Zci_01042, Zci_02351	UTEX1559_07861, UTEX1559_01170	UTEX1560_04053, UTEX1560_00282	Zm00001d042842, Zm00001d034074
Zci_09228	N0.HOG0000840	OG0000478	n0	AagrOXF_evm.TU.utg000011l.170	Azfi_s0221.g058744, Azfi_s0322.g064530, Azfi_s0003.g007597, Azfi_s0003.g007684, Azfi_s1035.g095886, Azfi_s1903.g107957	AT3G47000, AT3G47010, AT3G47050, AT3G47040, AT3G62710, AT5G20940, AT5G20950, AT5G04885	Bradi2g23720, Bradi1g08580, Bradi1g08570, Bradi1g08560, Bradi2g51280, Bradi1g08550	NA	Chrsp6S07475, Chrsp29S00343, Chrsp4S06240, Chrsp35S05194	NA	CLOP_g17897, CLOP_g21384, CLOP_g1353	14105	Me1_v2_0156620, Me1_v2_0011870, Me1_v2_0119430, Me1_v2_0138600, Me1_v2_0119510, Me1_v2_0119480, Me1_v2_0119490, Me1_v2_0103290, Me1_v2_0023570, Me1_v2_0119380, Me1_v2_0015140, Me1_v2_0119440	Mp1g11940, Mp4g13470, Mp4g13480	NA	NA	LOC_Os05g37700, LOC_Os03g53790, LOC_Os02g03870, LOC_Os03g53800, LOC_Os01g56510, LOC_Os03g53860	NA	pm011956g0010, pm090206g0010, pm046627g0010, pm004710.t1, pm004906g0010, pm018320g0020, pm018320g0010, pm084160g0010, pm010388g0010, pm026820g0010, pm010388g0020, pm015909g0010, pm015909g0030, pm003417.t1	Pp3c4_23400, Pp3c26_8580, Pp3c6_240, Pp3c24_19980, Pp3c23_18990	Solyc06g005970.2, Solyc06g076780, Solyc06g073740, Solyc11g071640, Solyc06g073760, Solyc01g009240, Solyc06g073750, Solyc11g071650, Solyc04g015560, Solyc01g097000	74114, 157260	SM000088S23743, SM000247S08269, SM000302S11653, SM000027S09704, SM000236S08009, SM000081S22614	Zci1a_32418, Zci1a_14319, Zci1a_40754	Zci_01580, Zci_09228, Zci_06076	UTEX1559_11506, UTEX1559_11507, UTEX1559_06489, UTEX1559_10482	UTEX1560_08591, UTEX1560_08592, UTEX1560_08593, UTEX1560_10006, UTEX1560_09373	Zm00001d038271, Zm00001d038272, Zm00001d013269, Zm00001d053982, Zm00001d034015, Zm00001d043309, Zm00001d034017, Zm00001d013268
Zci_01508	N0.HOG0003638	OG0002653	n0	AagrOXF_evm.TU.utg000117l.10	Azfi_s0264.g060933	AT5G03880	Bradi3g42820	CBR_g37568	Chrsp123S01850, Chrsp29S04479	Cre06.g261500_4532	CLOP_g22775	3158, 13493	Me1_v2_0118100	Mp6g09140	6681	Olucimarinus_26662, Olucimarinus_29383	LOC_Os08g44400	PRCOL_00000093_RA	pm006838.t1, pm012993g0020, pm016695g0020	Pp3c3_12870	Solyc09g009820	118724, 423867, 424815	SM000017S02805, SM000147S01105	Zci1a_15046, Zci1a_07522	Zci_01508, Zci_11910	UTEX1559_16108, UTEX1559_03717, UTEX1559_16306	UTEX1560_07210, UTEX1560_13088, UTEX1560_09691	Zm00001d031945, Zm00001d049939, Zm00001d031948, Zm00001d031951, Zm00001d031953
Zci_04411	N0.HOG0000883	OG0000501	n5	NA	Azfi_s0013.g013200	AT2G24040, AT4G28088, AT4G30660, AT4G30650, AT1G57550, AT2G38905, AT3G05880, AT3G05890	Bradi1g31072, Bradi1g47270, Bradi4g37720, Bradi1g65780, Bradi2g11135, Bradi1g61460, Bradi2g36766, Bradi1g20220	NA	Chrsp26S08859	Cre03.g196800_4532	CLOP_g9263, CLOP_g24298	9402, 8418, 8417	Me1_v2_0055740	Mp3g18270, Mp1g23330, Mp2g15060, Mp1g07180, Mp1g15610, Mp1g26550	NA	NA	LOC_Os09g15365, LOC_Os01g18375, LOC_Os06g44220, LOC_Os06g08564, LOC_Os09g38560, LOC_Os03g17790, LOC_Os05g03130, LOC_Os03g25460, LOC_Os05g04700, LOC_Os07g44180	NA	pm016543.t1, pm011590g0020, pm002757g0050, pm031584g0010, pm025866.t1, pm005309g0020, pm006306g0030, pm011294g0020, pm028885g0010, pm012039g0030, pm021709g0020, pm000073g0040, pm027361g0020	Pp3c7_16750, Pp3c2_35200, Pp3c22_14960, Pp3c19_16280, Pp3c9_23190	Solyc07g005715.1, Solyc07g005730, Solyc07g005720, Solyc04g049960, Solyc01g150152, Solyc01g102290	136629, 227480	SM000003S11127, SM000262S09875, SM000100S09459, SM000079S22501	Zci1a_16681, Zci1a_27960, Zci1a_31862, Zci1a_31861	Zci_03358, Zci_03357, Zci_04411, Zci_08251, Zci_12263, Zci_12264	UTEX1559_03512, UTEX1559_09168, UTEX1559_13230, UTEX1559_00751, UTEX1559_00752	UTEX1560_15634, UTEX1560_01619, UTEX1560_09097, UTEX1560_06763, UTEX1560_14691, UTEX1560_14692	Zm00001d046834, Zm00001d045096, Zm00001d006329, Zm00001d028718, Zm00001d035505, Zm00001d047419, Zm00001d040544, Zm00001d008200, Zm00001d024778, Zm00001d022264
Zci_12598	N0.HOG0003343	OG0002390	n0	AagrOXF_evm.TU.utg000009l.90, AagrOXF_evm.TU.utg000009l.76	Azfi_s0019.g015172	AT4G10790	Bradi4g33395, Bradi3g31370	CBR_g32537	Chrsp66S07281	Cre03.g200100_4532	CLOP_g10284	7845	Me1_v2_0178090, Me1_v2_0162420, Me1_v2_0178080, Me1_v2_0162410	Mp1g19520	5298	Olucimarinus_34809	LOC_Os09g30411, LOC_Os06g36760, LOC_Os10g37630	PRCOL_00002498_RA	pm002122g0020, pm000722g0010, pm040811g0010, pm137221g0010, pm010385g0010, pm015132g0030	Pp3c4_17110, Pp3c9_5600, Pp3c15_17250, Pp3c4_17090	Solyc03g112630, Solyc08g008510, Solyc08g082970	37553, 164130	NA	Zci1a_11077	Zci_12598	UTEX1559_02910	UTEX1560_09910	Zm00001d020882, Zm00001d048566, Zm00001d029649, Zm00001d032553
Zci_11247	N0.HOG0003973	OG0002950	n0	AagrOXF_evm.TU.utg000150l.11	Azfi_s0022.g016040	NA	Bradi1g10960	CBR_g70703, CBR_g10951, CBR_g31168	Chrsp22S03511	NA	CLOP_g6414, CLOP_g18827, CLOP_g18428, CLOP_g8242	15054	Me1_v2_0160430	Mp3g21780	10868, 23608, 23609	NA	LOC_Os03g49630	NA	pm028255g0010, pm000654.t2, pm027351g0020, pm000654.t3, pm040331g0010, pm025119.t1	Pp3c16_23250, Pp3c6_900, Pp3c6_920, Pp3c6_3110, Pp3c16_21630	Solyc08g080000	446318	SM000186S04146, SM000006S19456, SM000272S10265	Zci1a_29364, Zci1a_29363, Zci1a_31054	Zci_11247	UTEX1559_12848	UTEX1560_12713	Zm00001d033654
Zci_03611	N0.HOG0002397	OG0001591	n0	AagrOXF_evm.TU.utg000013l.170, AagrOXF_evm.TU.utg000049l.733	Azfi_s0388.g067631, Azfi_s0305.g063925, Azfi_s0506.g073961, Azfi_s0292.g063360, Azfi_s0229.g059132, Azfi_s0292.g063361	AT1G79310, AT1G16420, AT1G79340, AT1G79330, AT1G79320, AT5G04200	Bradi2g21110, Bradi2g21100, Bradi2g52470, Bradi2g50480	CBR_g24363, CBR_g38516	Chrsp52S06592	Cre03.g184700_4532	NA	4527	Me1_v2_0231990	Mp6g02940, Mp8g07700, Mp5g11730	1251, 20968	NA	LOC_Os05g41660, LOC_Os05g41670, LOC_Os01g58580, LOC_Os11g04010	NA	NA	Pp3c1_20330, Pp3c2_20840, Pp3c1_20350	Solyc09g098150, Solyc10g081300.1	152567, 270839	SM000027S09560	Zci1a_14703, Zci1a_20539	Zci_03611, Zci_03654	UTEX1559_00534, UTEX1559_02949, UTEX1559_02948	UTEX1560_00373, UTEX1560_09759, UTEX1560_11488	Zm00001d010673, Zm00001d010675, Zm00001d043195, Zm00001d052433
Zci_11367	N0.HOG0000733	OG0000399	n0	AagrOXF_evm.TU.utg000058l.72	Azfi_s0398.g068185, Azfi_s4122.g118060, Azfi_s0006.g010165, Azfi_s0003.g008090, Azfi_s0149.g053235	AT5G51760, AT3G11410, AT5G59220, AT1G07430, AT2G29380, AT1G72770, AT1G17550, AT4G26080, AT5G57050	Bradi2g15840, Bradi2g45470, Bradi5g00673, Bradi4g28098, Bradi2g54810, Bradi1g66920, Bradi2g39533, Bradi2g14420, Bradi2g41950, Bradi2g18510	NA	NA	Cre03.g211073_4532, Cre02.g141250_4532	CLOP_g12842	13526	Me1_v2_0028080, Me1_v2_0141120, Me1_v2_0047120, Me1_v2_0060400	MpUg00130, MpVg00730	28433, 28434, 28435	NA	LOC_Os05g49730, LOC_Os01g46760, LOC_Os09g15670, LOC_Os05g38290, LOC_Os01g62760, LOC_Os03g16170, LOC_Os03g38920, LOC_Os05g51510, LOC_Os01g40094, LOC_Os05g46040	PRCOL_00004502_RA	pm021225g0030, pm022020g0020	Pp3c7_5390, Pp3c11_18330	Solyc08g082260, Solyc06g051940, Solyc03g007230, Solyc03g006930, Solyc03g006960, Solyc03g006940, Solyc03g006950, Solyc05g052980, Solyc03g096670, Solyc06g076400, Solyc03g121880, Solyc08g062640, Solyc12g096020, Solyc08g062650.2, Solyc07g040990	113714, 13309, 54775	SM000009S23482, SM000227S07445, SM000041S15483, SM000060S19644, SM000009S23475, SM000067S20347, SM000137S00470	Zci1a_44793, Zci1a_34128, Zci1a_14091, Zci1a_22231, Zci1a_18037, Zci1a_26463	Zci_11367, Zci_11373, Zci_00934, Zci_00935, Zci_08054, Zci_09733, Zci_03916	UTEX1559_08959, UTEX1559_08953, UTEX1559_07999, UTEX1559_13607, UTEX1559_13732, UTEX1559_17270	UTEX1560_07347, UTEX1560_09712, UTEX1560_04874, UTEX1560_18918, UTEX1560_19670, UTEX1560_18286, UTEX1560_11018, UTEX1560_10451, UTEX1560_10450	Zm00001d009626, Zm00001d044015, Zm00001d011495, Zm00001d025055, Zm00001d004357, Zm00001d020100, Zm00001d005609, Zm00001d042886, Zm00001d012401, Zm00001d028574, Zm00001d039163, Zm00001d009747, Zm00001d044301, Zm00001d011202, Zm00001d038846, Zm00001d011131
Zci_14282	N0.HOG0000086	OG0000036	n99	AagrOXF_evm.TU.utg000049l.391, AagrOXF_evm.TU.utg000003l.102, AagrOXF_evm.TU.utg000017l.183, AagrOXF_evm.TU.utg000091l.316, AagrOXF_evm.TU.utg000091l.46, AagrOXF_evm.TU.utg000044l.28	Azfi_s0032.g024745, Azfi_s0215.g058404, Azfi_s0587.g078546, Azfi_s0187.g056724, Azfi_s0368.g067009, Azfi_s0922.g092744, Azfi_s0009.g011900, Azfi_s0007.g011084, Azfi_s0431.g069343, Azfi_s0020.g015473, Azfi_s0509.g074699	AT2G25810, AT4G17340, AT5G47450, AT3G16240, AT1G52180, AT3G47440, AT2G36830, AT3G26520, AT4G01470, AT1G73190, AT1G17810, AT4G23400, AT2G45960, AT3G61430, AT4G00430, AT1G01620, AT4G35100, AT2G16850, AT2G39010, AT3G54820, AT5G60660, AT3G53420, AT2G37180, AT2G37170	Bradi2g07810, Bradi2g31800, Bradi2g07830, Bradi5g17690, Bradi3g50690, Bradi5g17680, Bradi1g75290, Bradi2g62520, Bradi5g16370, Bradi3g29780, Bradi5g18170, Bradi3g51387, Bradi3g56020, Bradi3g18460, Bradi1g00552, Bradi4g36601, Bradi4g36610, Bradi1g28760, Bradi1g28780, Bradi5g15970, Bradi3g49360	CBR_g8238, CBR_g55164, CBR_g19242, CBR_g19240, CBR_g19238	Chrsp35S05281	Cre17.g711250_4532, Cre12.g549300_4532	CLOP_g23304, CLOP_g1858, CLOP_g1863, CLOP_g22967, CLOP_g1866, CLOP_g1864	3291, 4170, 3453, 3455, 2474, 8337, 8336, 2978, 14884, 12721, 16047	Me1_v2_0128670, Me1_v2_0185120, Me1_v2_0066340, Me1_v2_0008200, Me1_v2_0227850	Mp8g14930, Mp5g09360, Mp1g04190, Mp1g04200, Mp1g20890, Mp6g11800, Mp6g11740, Mp6g11720, Mp6g11730, Mp6g11790, Mp6g11780, Mp6g11750, MpUg00280, Mp4g04740, Mp4g05930, Mp4g04470, MpUg00240, Mp4g05940, Mp4g04460, Mp4g04440, MpUg00250, Mp1g29040, Mp4g03020, Mp4g04450, Mp2g13930, Mp4g17210	3561, 5391	Olucimarinus_25291	LOC_Os01g13120, LOC_Os05g14240, LOC_Os01g13130, LOC_Os02g44080, LOC_Os06g22960, LOC_Os04g46490, LOC_Os03g05290, LOC_Os01g74450, LOC_Os04g44570, LOC_Os10g35050, LOC_Os04g47220, LOC_Os02g44630, LOC_Os02g57720, LOC_Os10g34000, LOC_Os03g64330, LOC_Os04g16450, LOC_Os09g36930, LOC_Os07g26690, LOC_Os07g26660, LOC_Os07g26640, LOC_Os07g26630, LOC_Os04g44060, LOC_Os02g41860	PRCOL_00001670_RA	pm035271g0010, pm011474g0020, pm041306g0010, pm014707g0010, pm008573g0010, pm001399g0070, pm021558g0010, pm001708g0040, pm001822g0060, pm086453g0010, pm050341g0010, pm004462g0030, pm225949g0010, pm027800g0010, pm319711g0010, pm001708g0020, pm004462g0020, pm001708g0050, pm001822g0070, pm254110g0010, pm050341g0020, pm003121g0100, pm015641.t1, pm020765g0030, pm069989g0010, pm000646g0070, pm013044g0010	Pp3c10_21310, Pp3c8_18348, Pp3c8_18350, Pp3c20_15350, Pp3c24_18690, Pp3c8_13980, Pp3c23_15870, Pp3c8_7570, Pp3c3_31900, Pp3c4_510, Pp3c12_22590, Pp3c12_22530, Pp3c13_18810, Pp3c4_30220, Pp3c3_3230, Pp3c18_2300, Pp3c26_11670	Solyc08g066840, Solyc06g060760, Solyc06g066560, Solyc12g044330, Solyc03g093230, Solyc10g083880, Solyc06g074820, Solyc06g075650, Solyc06g072130, Solyc03g019820, Solyc01g094690, Solyc03g096290, Solyc08g008045.1, Solyc08g081190, Solyc12g056220, Solyc05g055990, Solyc10g055630, Solyc01g111660, Solyc02g083510, Solyc11g069430, Solyc06g011350, Solyc10g084120, Solyc09g007770, Solyc09g007760	7799, 87985, 266713, 165030, 165035, 98603, 270916, 271415	SM000090S24350, SM000200S05842, SM004806S16623, SM000022S07242, SM004508S16472, SM004309S15688, SM004806S16624, SM000050S17069, SM000298S10941, SM000007S20799, SM000021S06406, SM000037S13523	Zci1a_05106, Zci1a_17908, Zci1a_04460	Zci_08331, Zci_14282, Zci_01556, Zci_01557	UTEX1559_02590, UTEX1559_14893, UTEX1559_13695, UTEX1559_11537, UTEX1559_11536	UTEX1560_17715, UTEX1560_12253, UTEX1560_19547, UTEX1560_08768, UTEX1560_01363, UTEX1560_01362	Zm00001d039293, Zm00001d037779, Zm00001d020747, Zm00001d019676, Zm00001d015518, Zm00001d010410, Zm00001d039713, Zm00001d026177, Zm00001d002738, Zm00001d051362, Zm00001d017485, Zm00001d026178, Zm00001d027652, Zm00001d011778, Zm00001d002952, Zm00001d048520, Zm00001d032610, Zm00001d013956, Zm00001d020383, Zm00001d017526, Zm00001d051403, Zm00001d002690, Zm00001d051872, Zm00001d014285, Zm00001d022608, Zm00001d019563, Zm00001d005421, Zm00001d019565, Zm00001d005410, Zm00001d003006, Zm00001d051174, Zm00001d017288
Zci_00935	N0.HOG0000733	OG0000399	n0	AagrOXF_evm.TU.utg000058l.72	Azfi_s0398.g068185, Azfi_s4122.g118060, Azfi_s0006.g010165, Azfi_s0003.g008090, Azfi_s0149.g053235	AT5G51760, AT3G11410, AT5G59220, AT1G07430, AT2G29380, AT1G72770, AT1G17550, AT4G26080, AT5G57050	Bradi2g15840, Bradi2g45470, Bradi5g00673, Bradi4g28098, Bradi2g54810, Bradi1g66920, Bradi2g39533, Bradi2g14420, Bradi2g41950, Bradi2g18510	NA	NA	Cre03.g211073_4532, Cre02.g141250_4532	CLOP_g12842	13526	Me1_v2_0028080, Me1_v2_0141120, Me1_v2_0047120, Me1_v2_0060400	MpUg00130, MpVg00730	28433, 28434, 28435	NA	LOC_Os05g49730, LOC_Os01g46760, LOC_Os09g15670, LOC_Os05g38290, LOC_Os01g62760, LOC_Os03g16170, LOC_Os03g38920, LOC_Os05g51510, LOC_Os01g40094, LOC_Os05g46040	PRCOL_00004502_RA	pm021225g0030, pm022020g0020	Pp3c7_5390, Pp3c11_18330	Solyc08g082260, Solyc06g051940, Solyc03g007230, Solyc03g006930, Solyc03g006960, Solyc03g006940, Solyc03g006950, Solyc05g052980, Solyc03g096670, Solyc06g076400, Solyc03g121880, Solyc08g062640, Solyc12g096020, Solyc08g062650.2, Solyc07g040990	113714, 13309, 54775	SM000009S23482, SM000227S07445, SM000041S15483, SM000060S19644, SM000009S23475, SM000067S20347, SM000137S00470	Zci1a_44793, Zci1a_34128, Zci1a_14091, Zci1a_22231, Zci1a_18037, Zci1a_26463	Zci_11367, Zci_11373, Zci_00934, Zci_00935, Zci_08054, Zci_09733, Zci_03916	UTEX1559_08959, UTEX1559_08953, UTEX1559_07999, UTEX1559_13607, UTEX1559_13732, UTEX1559_17270	UTEX1560_07347, UTEX1560_09712, UTEX1560_04874, UTEX1560_18918, UTEX1560_19670, UTEX1560_18286, UTEX1560_11018, UTEX1560_10451, UTEX1560_10450	Zm00001d009626, Zm00001d044015, Zm00001d011495, Zm00001d025055, Zm00001d004357, Zm00001d020100, Zm00001d005609, Zm00001d042886, Zm00001d012401, Zm00001d028574, Zm00001d039163, Zm00001d009747, Zm00001d044301, Zm00001d011202, Zm00001d038846, Zm00001d011131
Zci_06224	N0.HOG0017112	OG0015121	n0	NA	NA	NA	NA	NA	NA	NA	NA	NA	NA	NA	NA	NA	NA	NA	NA	NA	NA	NA	NA	NA	Zci_06226, Zci_06256, Zci_06224	UTEX1559_11819	UTEX1560_14695, UTEX1560_18966, UTEX1560_14598	NA
Zci_10498	N0.HOG0013680	OG0011923	n0	NA	NA	NA	NA	NA	NA	Cre06.g277550_4532	CLOP_g25302	5997	NA	NA	NA	NA	NA	NA	NA	NA	NA	NA	SM000059S18703, SM000148S01028, SM000170S02695	Zci1a_41184	Zci_10498	UTEX1559_12930	UTEX1560_09646	NA
Zci_00805	N0.HOG0004267	OG0003203	n0	AagrOXF_evm.TU.utg000049l.351	Azfi_s0034.g025160, Azfi_s1165.g098694	AT5G14760	Bradi3g03080	CBR_g41133	Chrsp108S01362	Cre12.g528450_4532	CLOP_g23303, CLOP_g1857	9401, 10035	Me1_v2_0166840, Me1_v2_0008650	Mp7g03410	17846, 16856, 16857, 17847	Olucimarinus_24902	LOC_Os02g04170	PRCOL_00002767_RA	pm004771g0050, pm003711.t2, pm004771g0060	Pp3c9_15130	Solyc01g056580, Solyc12g014530	85643	SM000079S22406, SM000088S23767, SM000124S25913	Zci1a_39079	Zci_00805	UTEX1559_04539	UTEX1560_08869, UTEX1560_08868, UTEX1560_08870	Zm00001d015183
Zci_12761	N0.HOG0002146	OG0001385	n3	AagrOXF_evm.TU.utg000033l.212, AagrOXF_evm.TU.utg000125l.130	Azfi_s0059.g034599, Azfi_s0090.g042652	AT3G54660, AT3G24170	Bradi3g26737, Bradi1g74180, Bradi3g55030	CBR_g36558, CBR_g21301	Chrsp29S04580, Chrsp94S08362	Cre09.g396252_4532, Cre06.g262100_4532	CLOP_g17435	804, 7398	Me1_v2_0216010, Me1_v2_0159740	Mp1g20690, Mp1g25390	10786, 10787	NA	LOC_Os10g28000, LOC_Os03g06740, LOC_Os02g56850	PRCOL_00002730_RA	pm013344g0010, pm004521.t1, pm021027g0010, pm019397g0020	Pp3c4_17890, Pp3c5_16850	Solyc09g065900, Solyc09g091840	438142, 164085	SM000003S10964, SM000003S11022, SM000072S21229, SM000270S10362, SM000247S08274, SM000342S12966	Zci1a_05063, Zci1a_05062, Zci1a_17304	Zci_12761, Zci_13391	UTEX1559_14740, UTEX1559_01892	UTEX1560_02694, UTEX1560_02696, UTEX1560_02693, UTEX1560_14564	Zm00001d027769, Zm00001d018454
Zci_06563	N0.HOG0007878	OG0006558	n0	AagrOXF_evm.TU.utg000012l.360, AagrOXF_evm.TU.utg000012l.359, AagrOXF_evm.TU.utg000012l.334	Azfi_s0037.g026087	AT5G39590	Bradi1g24479, Bradi5g25130	NA	Chrsp97S08430	NA	CLOP_g4120	5336	Me1_v2_0196950	Mp1g06490	NA	NA	LOC_Os04g56790	NA	pm019828g0030, pm003960.t1, pm022685g0020	Pp3c5_11350, Pp3c16_7090	Solyc04g081230	99509	SM000095S25014, SM000012S25300, SM000108S14191	NA	Zci_06563	UTEX1559_01403	UTEX1560_07531	Zm00001d001947
Zci_02914	N0.HOG0007691	OG0006378	n0	AagrOXF_evm.TU.utg000091l.682	Azfi_s0056.g034030	AT1G50480	Bradi4g31680	CBR_g29353	Chrsp44S09059	Cre13.g566000_4532	CLOP_g18479, CLOP_g20011	5375	Me1_v2_0052090	Mp7g15390	NA	Olucimarinus_28303	LOC_Os09g27420	PRCOL_00001239_RA	pm006084g0020, pm023460g0020	Pp3c15_21130	Solyc01g006280	437826	SM000004S15062, SM000013S26495, SM000045S16190	Zci1a_14946	Zci_02914	UTEX1559_03067	UTEX1560_02371	Zm00001d020669
Zci_05378	N0.HOG0001054	OG0000602	n28	AagrOXF_evm.TU.utg000042l.233, AagrOXF_evm.TU.utg000050l.590	Azfi_s0150.g053310, Azfi_s0250.g060231, Azfi_s0024.g020345	AT1G07670, AT1G07810, AT4G00900	Bradi2g37570, Bradi1g66150	CBR_g8902, CBR_g40710	Chrsp247S03836	Cre11.g467795_4532, Cre09.g410100_4532, Cre09.g410050_4532, Cre05.g242350_4532	CLOP_g2737, CLOP_g9839	5243, 4911	Me1_v2_0151900, Me1_v2_0011130, Me1_v2_0207280	Mp2g05250, Mp4g15370, Mp8g06730	21044	Olucimarinus_14777, Olucimarinus_29095	LOC_Os05g02940, LOC_Os03g17310	PRCOL_00006536_RA	pm025228g0010, pm004886g0020, pm000613g0010, pm130510g0010, pm001050g0030, pm005870g0020, pm024321g0010, pm140461g0010	Pp3c1_9850, Pp3c11_18120, Pp3c9_16670, Pp3c15_16420	Solyc11g072880, Solyc01g096190	78895, 166180, 170407	SM000109S14167, SM000055S18212, SM000313S11972	Zci1a_08824, Zci1a_37209	Zci_05378, Zci_06593	UTEX1559_10612, UTEX1559_16553	UTEX1560_04301, UTEX1560_04299, UTEX1560_11375, UTEX1560_19608	Zm00001d011013, Zm00001d028687, Zm00001d049009, Zm00001d047769, Zm00001d049655
Zci_15452	N0.HOG0006951	OG0005676	n0	AagrOXF_evm.TU.utg000033l.188	Azfi_s0288.g063261	AT5G51040	Bradi4g17280	NA	Chrsp17S02692	Cre55.g802247_4532, Cre12.g550750_4532	CLOP_g24237, CLOP_g1922	14512	Me1_v2_0043880, Me1_v2_0056060	Mp3g04930	2463	Olucimarinus_28980	LOC_Os11g32480	PRCOL_00003706_RA	pm002583g0050, pm007897g0050	Pp3c16_25170	NA	98920	SM000465S16651, SM000270S10363, SM000342S12969	Zci1a_15465	Zci_15452	UTEX1559_03943	UTEX1560_18964	Zm00001d007390, Zm00001d052678
Zci_10903	N0.HOG0012460	OG0010804	n0	NA	NA	NA	NA	NA	Chrsp51S00511, Chrsp80S00647	NA	NA	6616	Me1_v2_0190370	NA	NA	NA	NA	NA	NA	NA	NA	NA	SM000026S08919, SM000011S19015, SM000018S03660, SM000026S08918	Zci1a_33411	Zci_10903	UTEX1559_01609	UTEX1560_10906	NA
Zci_02540	N0.HOG0025560	OG0023414	n0	NA	NA	NA	NA	NA	NA	NA	NA	NA	NA	NA	NA	NA	NA	NA	NA	NA	NA	NA	NA	Zci1a_40580	Zci_02540	UTEX1559_12162	UTEX1560_02017	NA
Zci_08174	N0.HOG0032920	OG0030743	-	NA	NA	NA	NA	NA	NA	NA	NA	NA	NA	NA	NA	NA	NA	NA	NA	NA	NA	NA	NA	NA	Zci_08174	UTEX1559_11634	UTEX1560_12929	NA
Zci_09657	N0.HOG0033425	OG0031248	-	NA	NA	NA	NA	NA	NA	NA	NA	NA	NA	NA	NA	NA	NA	NA	NA	NA	NA	NA	NA	NA	Zci_09657	UTEX1559_10980	UTEX1560_15151	NA
Zci_01806	N0.HOG0000908	OG0000514	n31	AagrOXF_evm.TU.utg000004l.98, AagrOXF_evm.TU.utg000100l.50	Azfi_s0015.g013790, Azfi_s0401.g068270, Azfi_s0158.g053888, Azfi_s0419.g069128	AT5G25880, AT5G11670, AT2G19900, AT1G79750	Bradi2g48570, Bradi2g05620, Bradi2g33450, Bradi2g49532, Bradi2g49542	CBR_g41782, CBR_g34906	Chrsp23S03681	Cre06.g251400_4532	CLOP_g20315	2486, 1867	Me1_v2_0175370, Me1_v2_0034560, Me1_v2_0206010	Mp3g23500, Mp4g19390	15402, 16690	Olucimarinus_41212, Olucimarinus_28620	LOC_Os01g52500, LOC_Os01g09320, LOC_Os05g09440, LOC_Os02g44550, LOC_Os01g54030	PRCOL_00005984_RA	pm009530g0010, pm153030g0010, pm014169g0040	Pp3c3_3290, Pp3c7_17220, Pp3c1_9600	Solyc05g050120, Solyc12g008430, Solyc08g066360, Solyc12g044600, Solyc03g120990	142026, 130484	SM000059S18721, SM000170S02667, SM002000S05947, SM001414S00930, SM000148S01011, SM000907S24659, SM000026S08929, SM000011S19026, SM000018S03643	Zci1a_28852	Zci_08829, Zci_01806	UTEX1559_18745, UTEX1559_13905	UTEX1560_18319, UTEX1560_00835	Zm00001d034292, Zm00001d043601, Zm00001d000316, Zm00001d037961, Zm00001d037962, Zm00001d037693, Zm00001d010358, Zm00001d012764
Zci_02829	N0.HOG0007376	OG0006082	n0	AagrOXF_evm.TU.utg000063l.490	Azfi_s0113.g045882	AT5G01510	Bradi2g02740	CBR_g48395	Chrsp52S06582	Cre03.g187650_4532	CLOP_g18520, CLOP_g19456	2568	Me1_v2_0219090	Mp7g07710	8824	Olucimarinus_94434	LOC_Os01g04860	PRCOL_00004904_RA	pm019519g0010, pm020563.t1, pm014046g0030, pm020563g0010	NA	Solyc09g005230	75120	SM005873S18332	Zci1a_23503, Zci1a_23502	Zci_02829	UTEX1559_03175	UTEX1560_00539	Zm00001d039903
Zci_06356	N0.HOG0033873	OG0031696	-	NA	NA	NA	NA	NA	NA	NA	NA	NA	NA	NA	NA	NA	NA	NA	NA	NA	NA	NA	NA	NA	Zci_06356	UTEX1559_06106	UTEX1560_11163	NA
Zci_13321	N0.HOG0032659	OG0030482	-	NA	NA	NA	NA	NA	NA	NA	NA	NA	NA	NA	NA	NA	NA	NA	NA	NA	NA	NA	NA	NA	Zci_13321	UTEX1559_06171	UTEX1560_04920	NA
Zci_15614	N0.HOG0006855	OG0005586	n0	AagrOXF_evm.TU.utg000004l.107__108	Azfi_s0048.g030539	AT3G33520	Bradi2g10130	CBR_g55542	Chrsp360S00836	Cre08.g382590_4532	CLOP_g18315, CLOP_g13319	12309	Me1_v2_0096510	Mp2g24340	28971	Olucimarinus_42575	LOC_Os01g16414	PRCOL_00005532_RA	pm001185g0040, pm006758g0010	Pp3c8_11640	Solyc11g039660.1, Solyc05g018600	180402	SM000034S12775, SM000020S06045, SM000023S07595	Zci1a_24300	Zci_15614	UTEX1559_02141	UTEX1560_02344	Zm00001d024059
Zci_07270	N0.HOG0012999	OG0011293	n0	NA	NA	NA	NA	CBR_g50100	NA	Cre01.g047650_4532	NA	NA	Me1_v2_0125450, Me1_v2_0196340	NA	22787	NA	NA	NA	NA	NA	NA	NA	NA	Zci1a_07355, Zci1a_26867, Zci1a_44393	Zci_07270	UTEX1559_02188	UTEX1560_09741	NA
Zci_08721	N0.HOG0004197	OG0003144	n5	AagrOXF_evm.TU.utg000004l.20	Azfi_s0001.g000433	AT5G24300	Bradi1g48610	NA	Chrsp4S06337	Cre12.g521700_4532	CLOP_g20325, CLOP_g6038	13925	Me1_v2_0078020	Mp3g25350	12934, 12935, 12936	Olucimarinus_41777	LOC_Os06g06560	PRCOL_00006594_RA	pm012809g0010, pm001862g0010, pm015562g0010	Pp3c12_3280, Pp3c12_3220	Solyc03g083090	81578, 80176	SM000193S05188, SM000153S01596, SM000102S09174	Zci1a_34656, Zci1a_34655	Zci_08721	UTEX1559_16832	UTEX1560_06515	Zm00001d045261
Zci_00104	N0.HOG0003680	OG0002694	n0	AagrOXF_evm.TU.utg000042l.473, AagrOXF_evm.TU.utg000006l.464, AagrOXF_evm.TU.utg000006l.437	Azfi_s0027.g023476	AT3G49990	Bradi1g61380, Bradi1g20290	CBR_g23809	Chrsp97S08437	Cre02.g146000_4532	CLOP_g23728	421	Me1_v2_0122400	Mp8g15770	345	Olucimarinus_29999	LOC_Os03g25620, LOC_Os07g44050	PRCOL_00001157_RA	pm051899g0010, pm013500g0040, pm073073g0010, pm001499g0120, pm001499g0110, pm001921g0050	Pp3c26_3100	Solyc04g081030	75505	SM000326S12430, SM000025S08432, SM000203S06134	Zci1a_18447	Zci_00104	UTEX1559_11066	UTEX1560_11056	Zm00001d047407, Zm00001d047404, Zm00001d029300, Zm00001d021590, Zm00001d030362, Zm00001d048919, Zm00001d022252
Zci_13220	N0.HOG0004945	OG0003801	n0	AagrOXF_evm.TU.utg000083l.417, AagrOXF_evm.TU.utg000011l.220, AagrOXF_evm.TU.utg000011l.222	Azfi_s0006.g009496	AT1G78800	Bradi5g19840	CBR_g988	Chrsp88S08074	Cre02.g095147_4532	CLOP_g3026	1270	Me1_v2_0136160	Mp1g17740	6902	Olucimarinus_48840, Olucimarinus_119517	LOC_Os04g49960	PRCOL_00006028_RA	pm006184g0010, pm002487.t1, pm003304g0010, pm095525g0010, pm004012g0040, pm004012g0030	Pp3c12_4340	Solyc06g082490	419620	SM001725S03098, SM000127S26643, SM000001S04751, SM000044S15956	Zci1a_21861	Zci_13220	UTEX1559_15365	UTEX1560_05782	Zm00001d002499
Zci_01168	N0.HOG0001286	OG0000752	n21	AagrOXF_evm.TU.utg000050l.743	Azfi_s0006.g010339, Azfi_s0821.g087998	AT5G07460, AT5G07470, AT5G61640, AT4G25130	Bradi5g13660, Bradi3g33544	NA	Chrsp76S07627	Cre01.g012150_4532, Cre08.g380300_4532	CLOP_g22126	12328	Me1_v2_0009250, Me1_v2_0216110, Me1_v2_0173380	Mp7g00200, Mp1g02290	1178	NA	LOC_Os04g40620, LOC_Os04g40600, LOC_Os10g41400	NA	pm020613g0020, pm021749g0010, pm003937g0020, pm001382g0050, pm000084.t1, pm055584g0010	Pp3c10_640, Pp3c2_32520, Pp3c11_4080, Pp3c7_26010, Pp3c11_7270	Solyc03g111720, Solyc06g034020, Solyc03g093690	227932, 89699, 178515, 437743, 187336	SM000008S22275, SM000042S15309, SM000039S14437	Zci1a_29066, Zci1a_10505, Zci1a_29067, Zci1a_10504, Zci1a_42561	Zci_01169, Zci_01168, Zci_12981	UTEX1559_05603, UTEX1559_17630, UTEX1559_05602, UTEX1559_14703	UTEX1560_03842, UTEX1560_18240, UTEX1560_03841, UTEX1560_18105	Zm00001d003271, Zm00001d029965
Zci_01169	N0.HOG0001286	OG0000752	n21	AagrOXF_evm.TU.utg000050l.743	Azfi_s0006.g010339, Azfi_s0821.g087998	AT5G07460, AT5G07470, AT5G61640, AT4G25130	Bradi5g13660, Bradi3g33544	NA	Chrsp76S07627	Cre01.g012150_4532, Cre08.g380300_4532	CLOP_g22126	12328	Me1_v2_0009250, Me1_v2_0216110, Me1_v2_0173380	Mp7g00200, Mp1g02290	1178	NA	LOC_Os04g40620, LOC_Os04g40600, LOC_Os10g41400	NA	pm020613g0020, pm021749g0010, pm003937g0020, pm001382g0050, pm000084.t1, pm055584g0010	Pp3c10_640, Pp3c2_32520, Pp3c11_4080, Pp3c7_26010, Pp3c11_7270	Solyc03g111720, Solyc06g034020, Solyc03g093690	227932, 89699, 178515, 437743, 187336	SM000008S22275, SM000042S15309, SM000039S14437	Zci1a_29066, Zci1a_10505, Zci1a_29067, Zci1a_10504, Zci1a_42561	Zci_01169, Zci_01168, Zci_12981	UTEX1559_05603, UTEX1559_17630, UTEX1559_05602, UTEX1559_14703	UTEX1560_03842, UTEX1560_18240, UTEX1560_03841, UTEX1560_18105	Zm00001d003271, Zm00001d029965
Zci_13665	N0.HOG0004772	OG0003655	n0	AagrOXF_evm.TU.utg000085l.80	Azfi_s0164.g054259	AT4G04950	Bradi3g30080	CBR_g35003	Chrsp115S01674	Cre04.g232602_4532	CLOP_g11529	5791	Me1_v2_0117130	Mp4g08940	13169	Olucimarinus_5638	LOC_Os10g35720	PRCOL_00004770_RA	pm002750g0010, pm000087g0130, pm000592g0070, pm135227g0010	Pp3c14_8810, Pp3c10_4370, Pp3c14_3630	Solyc02g078360	123396	SM000110S18883, SM000104S09337, SM000176S03156	Zci1a_10846	Zci_13665	UTEX1559_09424	UTEX1560_16402	Zm00001d032546, Zm00001d006222, Zm00001d011577, Zm00001d016478, Zm00001d006437, Zm00001d013927
Zci_00501	N0.HOG0000624	OG0000325	n0	AagrOXF_evm.TU.utg000033l.263, AagrOXF_evm.TU.utg000006l.578, AagrOXF_evm.TU.utg000063l.293, AagrOXF_evm.TU.utg000084l.137	Azfi_s0006.g009709, Azfi_s0006.g009710, Azfi_s0390.g067712, Azfi_s0250.g060267, Azfi_s0390.g067709, Azfi_s0250.g060272	AT1G70630	Bradi2g19997	CBR_g25868	NA	Cre04.g217949_4532	CLOP_g23193, CLOP_g11173, CLOP_g12682, CLOP_g2343, CLOP_g2344, CLOP_g2792, CLOP_g23497, CLOP_g23509, CLOP_g24282, CLOP_g4977, CLOP_g23305, CLOP_g1859, CLOP_g19179, CLOP_g22142, CLOP_g19180, CLOP_g22141, CLOP_g13226, CLOP_g16805	640	Me1_v2_0210770, Me1_v2_0210780, Me1_v2_0222560, Me1_v2_0225690, Me1_v2_0229870, Me1_v2_0229880, Me1_v2_0229890, Me1_v2_0129020, Me1_v2_0166820	Mp6g12540	NA	NA	LOC_Os05g43810	NA	pm003552g0010, pm008107g0030, pm008670g0030, pm000138g0090, pm016047g0020, pm004296g0010, pm015669g0020, pm020713g0010, pm014348g0020, pm000027g0010, pm000027g0020, pm032047g0010, pm011635g0050, pm006874g0040, pm008224.t1, pm011635g0040, pm011635g0030, pm008583g0010	Pp3c1_26680, Pp3c18_680	Solyc05g013500	76356	SM000140S00580, SM000013S26522, SM000157S02097, SM000051S17568, SM000009S23556, SM000084S23153, SM000058S18512, SM000142S00555	Zci1a_15955, Zci1a_44277, Zci1a_16291, Zci1a_27893, Zci1a_28188, Zci1a_27891, Zci1a_12694, Zci1a_09835, Zci1a_34519, Zci1a_19386, Zci1a_39701, Zci1a_39866, Zci1a_30333, Zci1a_35364, Zci1a_30331, Zci1a_23138, Zci1a_23140, Zci1a_41187, Zci1a_41186, Zci1a_14794, Zci1a_12693, Zci1a_02581, Zci1a_39867, Zci1a_17544, Zci1a_17768, Zci1a_23165	Zci_10706, Zci_09121, Zci_07312, Zci_03879, Zci_00501, Zci_15658, Zci_11074, Zci_01127, Zci_13955, Zci_04947	UTEX1559_08851, UTEX1559_13648, UTEX1559_06725, UTEX1559_06401, UTEX1559_07364, UTEX1559_17604, UTEX1559_01950, UTEX1559_05557, UTEX1559_16488, UTEX1559_04157	UTEX1560_11310, UTEX1560_11309, UTEX1560_10894, UTEX1560_11867, UTEX1560_11536, UTEX1560_01003, UTEX1560_04529, UTEX1560_06599, UTEX1560_04104, UTEX1560_17658, UTEX1560_18249, UTEX1560_01555	Zm00001d038687, Zm00001d046727
Zci_01158	N0.HOG0002633	OG0001779	n0	AagrOXF_evm.TU.utg000027l.255, AagrOXF_evm.TU.utg000057l.145	Azfi_s0045.g029870, Azfi_s0098.g043912, Azfi_s0032.g024936, Azfi_s0069.g036614	AT1G54390, AT3G24010	Bradi1g08690, Bradi5g17460, Bradi1g75507	CBR_g34558, CBR_g3046, CBR_g51242	Chrsp66S09175, Chrsp33S05055	Cre07.g357650_4532, Cre16.g668200_4532	CLOP_g20470	6601, 9244	Me1_v2_0197320	Mp7g01810	21032, 20875, 20876	Olucimarinus_27695	LOC_Os03g53700, LOC_Os03g04980	NA	pm018632g0020, pm066393g0010	Pp3c17_17740, Pp3c17_6960	Solyc10g078520, Solyc09g091190	92651, 270360	SM000036S13302, SM000002S05693, SM000014S00264	Zci1a_08794, Zci1a_38151	Zci_04784, Zci_01158	UTEX1559_02629, UTEX1559_02628, UTEX1559_05589, UTEX1559_05588	UTEX1560_01487, UTEX1560_03826, UTEX1560_03825	Zm00001d034006, Zm00001d048385
Zci_13497	N0.HOG0008857	OG0007484	n0	AagrOXF_evm.TU.utg000004l.81, AagrOXF_evm.TU.utg000006l.786	NA	NA	NA	NA	Chrsp112S01616	NA	CLOP_g2006	9553	Me1_v2_0018470, Me1_v2_0222080	Mp7g18360	NA	NA	NA	NA	pm006873.t1, pm001761g0090, pm033742g0010	Pp3c10_4210, Pp3c14_4410	NA	444336	SM000107S14099, SM000208S06340, SM000133S26794	Zci1a_08572	Zci_13497	UTEX1559_17095	UTEX1560_04933, UTEX1560_04931, UTEX1560_04932	NA
Zci_02276	N0.HOG0000057	OG0000016	n0	AagrOXF_evm.TU.utg000057l.16, AagrOXF_evm.TU.utg000035l.179, AagrOXF_evm.TU.utg000077l.350, AagrOXF_evm.TU.utg000106l.12, AagrOXF_evm.TU.utg000124l.175, AagrOXF_evm.TU.utg000049l.283, AagrOXF_evm.TU.utg000006l.792, AagrOXF_evm.TU.utg000018l.585, AagrOXF_evm.TU.utg000126l.292	Azfi_s0031.g024531, Azfi_s0068.g036227, Azfi_s0482.g073137, Azfi_s0075.g037605, Azfi_s0005.g008895, Azfi_s0045.g030095, Azfi_s0015.g013709, Azfi_s0194.g057160, Azfi_s2419.g111298, Azfi_s3394.g115537, Azfi_s0056.g034172, Azfi_s3754.g116756, Azfi_s2566.g112182, Azfi_s0003.g008186, Azfi_s0001.g000265, Azfi_s0043.g026959, Azfi_s2419.g111297, Azfi_s0113.g045847, Azfi_s0197.g057308, Azfi_s0087.g042304, Azfi_s1036.g095893, Azfi_s0096.g043765, Azfi_s0054.g033854, Azfi_s0289.g063291, Azfi_s0319.g064443, Azfi_s0090.g042718, Azfi_s0056.g034059, Azfi_s0083.g038807, Azfi_s0010.g012077, Azfi_s0067.g036176, Azfi_s0100.g044254, Azfi_s0276.g061452, Azfi_s0013.g013132, Azfi_s0013.g013357, Azfi_s0038.g026209, Azfi_s0104.g044857, Azfi_s0001.g000030, Azfi_s0093.g043373, Azfi_s0079.g038322, Azfi_s0173.g055808, Azfi_s0191.g057013	AT1G03040, AT4G02590, AT2G24260, AT4G30980, AT5G58010, AT1G02340, AT2G42300, AT3G57800, AT5G62610, AT1G59640, AT3G23690, AT3G07340, AT5G48560, AT1G10120, AT5G50915, AT1G25330, AT1G18400, AT1G73830, AT4G34530, AT2G18300, AT4G36540, AT1G68920, AT1G26260, AT5G38860, AT5G08130, AT1G69010, AT1G66470, AT5G37800, AT1G27740, AT5G43175, AT2G14760, AT4G33880, AT5G09750, AT4G00120, AT3G50330, AT5G67060, AT5G01305, AT3G21330, AT1G51140, AT2G42280, AT1G05805, AT2G43140, AT1G10100, AT3G42310, AT4G36930, AT5G67110, AT2G20180, AT4G28790, AT4G28811, AT4G28815, AT4G28800, AT1G09530, AT2G46970, AT3G62090, AT2G43010, AT3G59060, AT5G61270, AT4G00050	Bradi1g55427, Bradi1g05430, Bradi4g30350, Bradi1g47350, Bradi3g54070, Bradi1g46700, Bradi3g46200, Bradi1g35990, Bradi1g05037, Bradi1g54690, Bradi1g09960, Bradi1g69193, Bradi4g19577, Bradi3g40860, Bradi4g34350, Bradi5g06620, Bradi2g58630, Bradi3g52790, Bradi2g39970, Bradi3g41510, Bradi4g34870, Bradi1g43650, Bradi3g38890, Bradi4g32934, Bradi3g38970, Bradi4g32967, Bradi3g56340, Bradi1g72405, Bradi2g01000, Bradi3g53060, Bradi1g42440, Bradi1g22960, Bradi1g70860, Bradi1g14600, Bradi4g03070, Bradi4g06567, Bradi4g12615, Bradi1g46100, Bradi3g13300, Bradi3g38250, Bradi4g32060, Bradi2g54030, Bradi2g41390, Bradi2g47810, Bradi2g18200, Bradi4g33670, Bradi3g39927, Bradi2g57800, Bradi2g47187, Bradi3g48070, Bradi1g48400, Bradi3g54640, Bradi2g11100, Bradi2g36740, Bradi5g21950, Bradi1g06670, Bradi1g58230, Bradi1g13980, Bradi3g33170	CBR_g50332, CBR_g4800, CBR_g50790, CBR_g19472, CBR_g24268, CBR_g45213, CBR_g7926	Chrsp308S04731, Chrsp99S08485, Chrsp6S07439	Cre14.g620850_4532	CLOP_g6875, CLOP_g3902, CLOP_g20901, CLOP_g12471, CLOP_g3126, CLOP_g6534, CLOP_g23542, CLOP_g15407, CLOP_g15925, CLOP_g15334, CLOP_g749, CLOP_g21391, CLOP_g21617, CLOP_g8287, CLOP_g24151, CLOP_g8719, CLOP_g6199, CLOP_g12704	830, 834, 9915, 839, 4105	Me1_v2_0050590, Me1_v2_0093930, Me1_v2_0063040, Me1_v2_0119780, Me1_v2_0064490, Me1_v2_0183590, Me1_v2_0109540, Me1_v2_0211410, Me1_v2_0066970	Mpzg01410, Mp6g18480, Mp3g11900, Mp6g10690, Mp4g12420, Mp1g01110, Mp3g17930, Mp6g21470, Mp5g09710, Mp5g18910, Mp3g23300, Mp1g19210, Mp8g02290, Mp8g18080, Mp3g17350, Mp2g04190	14286, 22102	NA	LOC_Os07g08440, LOC_Os03g58330, LOC_Os09g25040, LOC_Os06g08500, LOC_Os02g55250, LOC_Os06g09370, LOC_Os02g35660, LOC_Os06g41060, LOC_Os03g58830, LOC_Os07g09590, LOC_Os03g51910, LOC_Os03g12940, LOC_Os11g25560, LOC_Os08g41320, LOC_Os09g32510, LOC_Os04g28280, LOC_Os01g68700, LOC_Os02g47660, LOC_Os05g01256, LOC_Os08g42470, LOC_Os09g33580, LOC_Os06g16400, LOC_Os08g38080, LOC_Os09g29830, LOC_Os08g38210, LOC_Os09g29930, LOC_Os02g49480, LOC_Os01g02110, LOC_Os02g48060, LOC_Os08g21554, LOC_Os06g30090, LOC_Os07g39940, LOC_Os03g10770, LOC_Os03g55550, LOC_Os03g42100, LOC_Os12g39850, LOC_Os12g32400, LOC_Os11g41640, LOC_Os06g10820, LOC_Os08g01700, LOC_Os08g36740, LOC_Os09g28210, LOC_Os01g61480, LOC_Os01g38610, LOC_Os01g51140, LOC_Os05g46370, LOC_Os09g31300, LOC_Os08g39630, LOC_Os01g67480, LOC_Os04g41229, LOC_Os02g39140, LOC_Os06g47980, LOC_Os06g06900, LOC_Os02g56140, LOC_Os05g04740, LOC_Os04g52770, LOC_Os03g56950, LOC_Os07g05010, LOC_Os12g41650, LOC_Os03g43810, LOC_Os10g40740	PRCOL_00006112_RA	pm006507g0010, pm015246g0020, pm025067.t1, pm010146g0010, pm000483g0030, pm006480g0020, pm014392g0020, pm002647g0050, pm012004g0020, pm032149g0010, pm000128g0030, pm253030g0010, pm002324g0060, pm023129g0020, pm002561g0050, pm184738g0010, pm002297g0040, pm049061g0010, pm233876g0010, pm002892g0050, pm000483g0020, pm004189.t1, pm006860g0030, pm004571g0090, pm012787g0030, pm012787.t1	Pp3c17_17000, Pp3c14_15890, Pp3c2_2660, Pp3c1_33270, Pp3c14_24070, Pp3c14_24020, Pp3c27_400, Pp3c16_7710, Pp3c5_18850, Pp3c6_9520, Pp3c10_16180, Pp3c3_19160, Pp3c2_620, Pp3c17_23070, Pp3c20_590, Pp3c14_24040, Pp3c13_22410, Pp3c9_470, Pp3c15_720, Pp3c27_8050, Pp3c16_19970, Pp3c3_8460, Pp3c26_10830, Pp3c4_24380, Pp3c4_4040, Pp3c10_19020, Pp3c3_28970, Pp3c1_40040, Pp3c17_15380, Pp3c14_16620, Pp3c25_13740, Pp3c16_21590, Pp3c9_3300, Pp3c15_4760, Pp3c15_4770, Pp3c21_14114, Pp3c21_14110, Pp3c18_6880, Pp3c19_11400, Pp3c14_20740, Pp3c4_3920, Pp3c12_25990, Pp3c2_8960, Pp3c1_38820, Pp3c17_21890, Pp3c14_23520	Solyc09g083220, Solyc03g005350, Solyc09g065820, Solyc07g005400, Solyc12g010170, Solyc06g065040, Solyc04g005220, Solyc10g079070, Solyc05g006650, Solyc04g005130, Solyc03g113560, Solyc04g077480, Solyc09g057710, Solyc06g083170, Solyc09g097870, Solyc12g098620, Solyc06g072520, Solyc03g097820, Solyc04g007300, Solyc12g036470, Solyc03g119390, Solyc01g109700, Solyc02g062690, Solyc03g034000, Solyc05g010610, Solyc01g010130, Solyc03g114720, Solyc06g069370, Solyc12g027805.1, Solyc04g005280, Solyc05g011810, Solyc02g091440, Solyc04g077960.1, Solyc12g088380.1, Solyc01g107140, Solyc10g049780.1, Solyc10g049770.1, Solyc10g049720, Solyc11g005780, Solyc04g078790, Solyc12g088790, Solyc02g090950.1, Solyc03g044460.1, Solyc09g005070.1, Solyc06g062460, Solyc03g121240.1, Solyc11g056650, Solyc12g100140, Solyc01g086870, Solyc10g079050, Solyc09g098110, Solyc03g046570, Solyc04g078690, Solyc02g093280.2, Solyc09g063010, Solyc06g008030, Solyc01g102300, Solyc07g043580, Solyc04g007430, Solyc10g018510, Solyc06g069600, Solyc03g115540, Solyc01g090790	24892, 444782, 128445, 425336, 72702, 439190, 93546, 413232, 418491, 409967, 419388, 404767, 405220, 403406, 402301, 443113, 118904, 39143, 114141	SM000103S09512, SM000250S08721, SM000081S22634, SM000125S26095, SM000044S16044, SM000010S04242, SM000106S13953, SM000035S13067, SM000008S22189, SM000008S22181, SM000010S04188, SM000162S02378	Zci1a_07104, Zci1a_30719, Zci1a_13478, Zci1a_18847, Zci1a_33928, Zci1a_06951, Zci1a_07991, Zci1a_35996, Zci1a_09534	Zci_02276, Zci_07935, Zci_05723, Zci_14806, Zci_00184, Zci_05935, Zci_01323	UTEX1559_01254, UTEX1559_13133, UTEX1559_18539, UTEX1559_16660, UTEX1559_14485, UTEX1559_09778, UTEX1559_06642, UTEX1559_09333	UTEX1560_04948, UTEX1560_05633, UTEX1560_03504, UTEX1560_09765, UTEX1560_04802, UTEX1560_18414, UTEX1560_01878, UTEX1560_08342	Zm00001d018967, Zm00001d013073, Zm00001d020490, Zm00001d000291, Zm00001d005750, Zm00001d045107, Zm00001d052038, Zm00001d018374, Zm00001d037098, Zm00001d045046, Zm00001d016873, Zm00001d016190, Zm00001d017436, Zm00001d036807, Zm00001d046759, Zm00001d034503, Zm00001d007768, Zm00001d033870, Zm00001d013357, Zm00001d028297, Zm00001d047999, Zm00001d007311, Zm00001d049158, Zm00001d031561, Zm00001d021019, Zm00001d006065, Zm00001d042373, Zm00001d012067, Zm00001d051569, Zm00001d017778, Zm00001d031665, Zm00001d049870, Zm00001d021086, Zm00001d006110, Zm00001d019127, Zm00001d020826, Zm00001d005964, Zm00001d005969, Zm00001d017908, Zm00001d008444, Zm00001d017804, Zm00001d021988, Zm00001d006733, Zm00001d028085, Zm00001d048141, Zm00001d041351, Zm00001d048786, Zm00001d035027, Zm00001d049721, Zm00001d031781, Zm00001d050016, Zm00001d020705, Zm00001d005841, Zm00001d042988, Zm00001d042989, Zm00001d044242, Zm00001d011187, Zm00001d043699, Zm00001d038863, Zm00001d020932, Zm00001d006022, Zm00001d031441, Zm00001d021748, Zm00001d051122, Zm00001d023444, Zm00001d006578, Zm00001d042482, Zm00001d017138, Zm00001d045212, Zm00001d018416, Zm00001d040536, Zm00001d008205, Zm00001d024783, Zm00001d026317, Zm00001d002288, Zm00001d031044, Zm00001d029897, Zm00001d029898
Zci_10504	N0.HOG0025489	OG0023343	n0	NA	NA	NA	NA	NA	NA	NA	NA	NA	NA	NA	NA	NA	NA	NA	NA	NA	NA	NA	NA	Zci1a_11002	Zci_10504	UTEX1559_11436	UTEX1560_12862	NA
Zci_14416	N0.HOG0007653	OG0006341	n0	AagrOXF_evm.TU.utg000058l.279	Azfi_s0029.g024116	AT1G54310	Bradi3g05437	NA	NA	Cre16.g649400_4532, Cre09.g407900_4532	CLOP_g25248	9772	Me1_v2_0204730, Me1_v2_0042390	Mp8g07070	2121	Olucimarinus_41962	LOC_Os02g07740	PRCOL_00003223_RA	pm012961g0040, pm013052g0030	Pp3c22_13410	NA	99851	SM000175S03288, SM000016S01875, SM000101S09261	Zci1a_31876, Zci1a_31877	Zci_14416	UTEX1559_10722	UTEX1560_05902	Zm00001d015400
Zci_01728	N0.HOG0002979	OG0002075	n0	NA	Azfi_s0014.g013479	AT2G20310, AT4G28690, AT5G54150, AT5G54148, AT4G27660	Bradi2g16231, Bradi3g28250, Bradi1g75640, Bradi1g55592	CBR_g29895	NA	Cre03.g212417_4532, Cre03.g211969_4532, Cre03.g211857_4532, Cre03.g212529_4532, Cre10.g464037_4532	NA	NA	Me1_v2_0084200	NA	NA	NA	LOC_Os10g32850, LOC_Os03g04740, LOC_Os10g42270	NA	NA	Pp3c20_15130, Pp3c8_13850	Solyc09g064420, Solyc03g080170	438910	SM000075S21951, SM003540S13224, SM000064S19812, SM000141S00877	Zci1a_07246	Zci_16602, Zci_01859, Zci_01728, Zci_01745, Zci_09988, Zci_02030	UTEX1559_13521, UTEX1559_18927, UTEX1559_18845, UTEX1559_16573, UTEX1559_17125	UTEX1560_18304, UTEX1560_20056, UTEX1560_04416, UTEX1560_13749, UTEX1560_04773	Zm00001d032761, Zm00001d027616, Zm00001d047035
Zci_02034	N0.HOG0025518	OG0023372	n0	NA	NA	NA	NA	NA	NA	NA	NA	NA	NA	NA	NA	NA	NA	NA	NA	NA	NA	NA	NA	Zci1a_02388	Zci_02034	UTEX1559_17130	UTEX1560_06702	NA
Zci_10547	N0.HOG0008365	OG0007021	n0	AagrOXF_evm.TU.utg000003l.123	Azfi_s0116.g046333	AT4G37480	Bradi1g07830	NA	Chrsp234S03553	Cre09.g389001_4532, Cre03.g155550_4532, Cre09.g395732_4532	NA	3283	Me1_v2_0140520	Mp6g20170	NA	NA	LOC_Os03g55360	NA	NA	Pp3c5_10140	Solyc02g064740	NA	SM000260S09934, SM000216S06551, SM000114S24168	Zci1a_01635	Zci_10547	UTEX1559_00704, UTEX1559_00703	UTEX1560_07658, UTEX1560_07657	Zm00001d013218, Zm00001d034115
Zci_12496	N0.HOG0000947	OG0000528	n0	AagrOXF_evm.TU.utg000013l.147, AagrOXF_evm.TU.utg000013l.152, AagrOXF_evm.TU.utg000041l.211	Azfi_s0157.g053816, Azfi_s0252.g060365, Azfi_s0003.g008139, Azfi_s0062.g035250, Azfi_s0126.g048614, Azfi_s0711.g083022, Azfi_s2058.g108931, Azfi_s0020.g015520, Azfi_s0082.g038735	AT4G32600, AT1G80400, AT1G68070, AT2G01735, AT3G61180, AT4G11680, AT1G63170, AT1G12760, AT4G26580, AT5G55970	Bradi1g70460, Bradi2g34010, Bradi2g04970, Bradi4g28050, Bradi3g59936, Bradi1g28430, Bradi3g51530, Bradi3g51535, Bradi2g47600	CBR_g4866	Chrsp27S04269	NA	CLOP_g20251, CLOP_g4694, CLOP_g794, CLOP_g6170, CLOP_g24550, CLOP_g1040	8250, 13824	Me1_v2_0056910, Me1_v2_0145560	Mp2g06960	2145	NA	LOC_Os02g54624, LOC_Os05g08610, LOC_Os01g08340, LOC_Os09g15430, LOC_Os02g50290, LOC_Os07g27950, LOC_Os04g48050, LOC_Os02g45240, LOC_Os01g50750	NA	pm003827g0010, pm027932g0020, pm012530g0010	Pp3c3_10570, Pp3s52_140, Pp3s52_10, Pp3c26_7240, Pp3c4_17150	Solyc12g006940, Solyc08g067770, Solyc10g081110, Solyc04g008020, Solyc04g025933.1, Solyc03g150116, Solyc03g044237.1, Solyc03g150115, Solyc05g051040, Solyc01g091600, Solyc12g056400, Solyc07g065810.2, Solyc12g015800	76977, 66385, 78385	SM000189S04069, SM000135S27015, SM000029S10577	Zci1a_03208, Zci1a_24925, Zci1a_17578	Zci_09087, Zci_12496	UTEX1559_03691, UTEX1559_13403	UTEX1560_14385, UTEX1560_16863	Zm00001d018328, Zm00001d037624, Zm00001d039623, Zm00001d020097, Zm00001d005599, Zm00001d051808, Zm00001d016573, Zm00001d017960, Zm00001d019600, Zm00001d005393, Zm00001d026091, Zm00001d002639, Zm00001d051441
Zci_15083	N0.HOG0007139	OG0005858	n0	NA	Azfi_s0008.g011454	AT2G46580	Bradi1g77505	CBR_g3312	Chrsp26S03975	Cre02.g095100_4532	CLOP_g25599	11962	Me1_v2_0194060	Mp3g09450	23452	Olucimarinus_41681	LOC_Os03g02450	PRCOL_00000497_RA	pm001432g0020, pm003058g0050, pm002711g0030	Pp3c7_90	Solyc05g050530	270695	SM000050S17007, SM000073S21456, SM000113S24056	NA	Zci_10917, Zci_15083	UTEX1559_01622, UTEX1559_07486	UTEX1560_06214, UTEX1560_14970	Zm00001d027352
Zci_11388	N0.HOG0012852	OG0011164	n0	NA	Azfi_s0002.g005771	NA	NA	NA	NA	Cre09.g387319_4532	NA	NA	Me1_v2_0172890	NA	NA	NA	NA	NA	NA	NA	NA	NA	SM000062S19948, SM000023S07565, SM000154S01393	Zci1a_31607	Zci_11388	UTEX1559_08937	UTEX1560_13038, UTEX1560_10499	NA
Zci_06919	N0.HOG0001578	OG0000964	n0	AagrOXF_evm.TU.utg000003l.269, AagrOXF_evm.TU.utg000008l.336, AagrOXF_evm.TU.utg000035l.28	Azfi_s0006.g010112, Azfi_s0040.g026672	AT2G26200, AT1G54650	Bradi1g75560, Bradi5g05210	CBR_g51385, CBR_g24276	Chrsp135S02127, Chrsp58S09140	Cre16.g668100_4532, Cre05.g239050_4532	CLOP_g23957, CLOP_g14484, CLOP_g16615	2989, 12316	Me1_v2_0107330, Me1_v2_0107340, Me1_v2_0180560	Mp7g01200, Mp8g06430	12636, 6868, 21182, 21180, 21181	Olucimarinus_50535, Olucimarinus_7292	LOC_Os03g04940, LOC_Os07g23169	PRCOL_00005531_RA	pm029937g0030, pm005068g0040, pm009144g0040, pm029937g0020, pm086438g0010, pm010689g0020, pm006026g0080, pm011292g0030	Pp3c15_20230, Pp3c10_13860, Pp3c26_7960	Solyc03g121870, Solyc08g062770, Solyc11g006130	447844, 110280, 82799, 75970	SM000034S12694, SM000001S04426, SM000023S07713, SM000001S04435, SM000209S06388, SM009620S24938, SM009623S24933	Zci1a_31016, Zci1a_10558	Zci_10955, Zci_06919	UTEX1559_01657, UTEX1559_01658, UTEX1559_01659, UTEX1559_00309	UTEX1560_08849, UTEX1560_03287	Zm00001d027626, Zm00001d019483
Zci_12855	N0.HOG0010125	OG0008655	n0	AagrOXF_evm.TU.utg000006l.269	NA	AT3G47830	Bradi1g44750	NA	Chrsp269S03951	NA	NA	12230	Me1_v2_0230230	Mp7g03420	NA	NA	LOC_Os06g13070	PRCOL_00005231_RA	NA	Pp3c2_36940	Solyc03g113880	NA	SM000003S11074, SM000056S17971, SM000107S14039	NA	Zci_12855	UTEX1559_09691	UTEX1560_02220	Zm00001d037258
Zci_01145	N0.HOG0000802	OG0000453	n5	NA	NA	NA	NA	CBR_g42071	NA	NA	CLOP_g8329, CLOP_g18260	5652, 2142, 980, 13727, 635	Me1_v2_0230650	NA	NA	NA	NA	NA	pm008099g0030, pm003287g0070, pm013638g0020	NA	Solyc11g065450.1	NA	NA	Zci1a_02262, Zci1a_02264, Zci1a_02261, Zci1a_02263, Zci1a_02267, Zci1a_34812	Zci_01146, Zci_01145	UTEX1559_05572, UTEX1559_05571	UTEX1560_06148, UTEX1560_06149, UTEX1560_06147, UTEX1560_06145, UTEX1560_06146	NA
Zci_00954	N0.HOG0006398	OG0005150	n0	AagrOXF_evm.TU.utg000129l.27	Azfi_s0087.g042274	AT1G09150	Bradi2g11910	CBR_g36436, CBR_g20980	Chrsp80S07862	Cre50.g761397_4532	NA	7650	Me1_v2_0154800	Mp2g00100	21078	Olucimarinus_43572	LOC_Os01g21180	PRCOL_00003880_RA	pm021154g0020, pm001160g0130, pm019347g0020, pm007098g0020	Pp3c25_690	Solyc01g099890	417664	SM000004S14911, SM000007S20921, SM000011S19085, SM002124S06588, SM002133S06711	Zci1a_30742	Zci_00954	UTEX1559_08016	UTEX1560_17247	Zm00001d009074
Zci_13594	N0.HOG0002056	OG0001319	n0	NA	NA	NA	NA	NA	Chrsp46S06093, Chrsp103S00959	Cre09.g411150_4532, Cre02.g114300_4532, Cre09.g387700_4532, Cre02.g113751_4532, Cre02.g113750_4532, Cre03.g149950_4532, Cre02.g106950_4532	CLOP_g9854, CLOP_g17540, CLOP_g21013, CLOP_g2979, CLOP_g13571, CLOP_g10583, CLOP_g10571, CLOP_g15524, CLOP_g3308, CLOP_g4373, CLOP_g11769, CLOP_g18913	13514	Me1_v2_0228540, Me1_v2_0070460, Me1_v2_0198180	NA	4997, 16380, 6849	NA	NA	NA	pm000088.t2, pm030782g0020, pm016393g0020, pm022886.t2, pm023494g0020, pm004173g0020, pm006939g0010, pm015661g0020, pm005087g0050, pm078518g0010, pm008519g0020, pm006169g0030, pm013364g0010, pm006169g0020, pm032491g0020, pm000070g0100, pm024835.t1, pm009114g0010, pm000070.t1, pm012956g0020, pm028834g0010, pm013832.t2, pm015146g0010	NA	NA	NA	NA	Zci1a_38836, Zci1a_20285	Zci_04197, Zci_13594, Zci_13601	UTEX1559_09536, UTEX1559_11774, UTEX1559_11761	UTEX1560_13769, UTEX1560_11278, UTEX1560_10755	NA
Zci_01529	N0.HOG0005543	OG0004341	n0	AagrOXF_evm.TU.utg000010l.337	Azfi_s0807.g087709, Azfi_s0006.g010084, Azfi_s0019.g015086	AT2G31090, AT2G20562	Bradi2g08293, Bradi2g06930	NA	NA	NA	NA	NA	Me1_v2_0203600	Mp6g11390	NA	NA	LOC_Os05g11900, LOC_Os01g11600	NA	pm003119g0010, pm013564g0010, pm000782g0010, pm031593g0010	Pp3c4_17790, Pp3c5_22950, Pp3c3_16420, Pp3c19_1670	Solyc02g077230, Solyc10g008050, Solyc10g008730, Solyc07g062800.1	169207	SM000039S14500, SM000008S22228, SM000042S15387	Zci1a_06271	Zci_01529	UTEX1559_11570	UTEX1560_07314	Zm00001d037722, Zm00001d008923
Zci_14791	N0.HOG0002684	OG0001824	n5	AagrOXF_evm.TU.utg000035l.223, AagrOXF_evm.TU.utg000006l.879	Azfi_s0405.g068387, Azfi_s0004.g008503	AT1G10520	Bradi1g44820	CBR_g48616, CBR_g3482	NA	NA	CLOP_g7946, CLOP_g16749	14009, 1178	Me1_v2_0063650, Me1_v2_0032490, Me1_v2_0069190, Me1_v2_0004540	Mp5g00050, Mp7g05700	20468, 20466, 20467	NA	LOC_Os06g13020	PRCOL_00003580_RA	pm000834.t1, pm021437g0010, pm048979g0010, pm003599g0010, pm021437g0020, pm002006g0070	Pp3c15_19010	Solyc05g006120	155063, 86291, 83116	SM000065S20260, SM000329S12574, SM000233S07962, SM000028S10087, SM000027S09612, SM000076S21871	Zci1a_13735, Zci1a_40571	Zci_14791	UTEX1559_16585, UTEX1559_16586	UTEX1560_13175	Zm00001d044780
Zci_15417	N0.HOG0008188	OG0006849	n0	AagrOXF_evm.TU.utg000042l.474, AagrOXF_evm.TU.utg000100l.361	Azfi_s0100.g044343	AT1G10865	Bradi4g35417	CBR_g23045	Chrsp29S04412	Cre01.g069107_4532	CLOP_g793, CLOP_g6169	11111	Me1_v2_0120500	Mp6g02660	NA	Olucimarinus_30848	LOC_Os09g34310	PRCOL_00003475_RA	pm008365.t3, pm176569g0010	Pp3c10_17250	Solyc03g117900	NA	NA	Zci1a_33733	Zci_15417	UTEX1559_09398	UTEX1560_12593	Zm00001d006143, Zm00001d006148
Zci_09305	N0.HOG0007434	OG0006135	n0	AagrOXF_evm.TU.utg000111l.176	Azfi_s0213.g058314	AT1G73350	Bradi4g10720	CBR_g54189, CBR_g16945	NA	NA	CLOP_g18677, CLOP_g4002	6610	Me1_v2_0120840	Mp1g16150	13969	NA	LOC_Os02g42540	NA	pm018180g0060, pm008029g0030, pm215871g0010, pm027008g0020	Pp3c25_5680, Pp3c16_8600	Solyc06g150131	179712	SM000015S01141, SM000121S26022, SM000258S09093	Zci1a_33407	Zci_09305	UTEX1559_04804	UTEX1560_10998	Zm00001d051233
Zci_16607	N0.HOG0002589	OG0001739	n0	AagrOXF_evm.TU.utg000125l.69	Azfi_s0061.g034938	AT4G00755	Bradi1g77420, Bradi1g76670, Bradi1g77410, Bradi1g00497	CBR_g18757	NA	Cre11.g468383_4532	CLOP_g7492	1272	Me1_v2_0136130	Mp4g09710	12278	NA	LOC_Os03g02560, LOC_Os03g64360	NA	pm008813g0020	Pp3c2_30060, Pp3c17_15230, Pp3c14_19630	Solyc03g026170, Solyc10g017880, Solyc01g091710, Solyc01g091720	76555	SM000085S23229, SM000044S16013, SM000001S04801	Zci1a_42079, Zci1a_32692	Zci_16607, Zci_04964, Zci_16565, Zci_08513, Zci_08532, Zci_08533, Zci_08561	UTEX1559_05086, UTEX1559_17782, UTEX1559_04178, UTEX1559_18946, UTEX1559_12649, UTEX1559_17338	UTEX1560_14923, UTEX1560_18499, UTEX1560_01528, UTEX1560_19205, UTEX1560_17453, UTEX1560_16998, UTEX1560_15869, UTEX1560_16052, UTEX1560_14192	Zm00001d027362, Zm00001d034336
Zci_09764	N0.HOG0004393	OG0003316	n0	AagrOXF_evm.TU.utg000003l.227	Azfi_s0008.g011277	AT1G79880, AT4G32720	Bradi5g14590	CBR_g34646, CBR_g39611	Chrsp10S01483	Cre17.g724200_4532	CLOP_g15902	224	Me1_v2_0077340	Mp1g04820	11804, 11805, 11806	Olucimarinus_87306, Olucimarinus_13922	LOC_Os02g39700, LOC_Os04g42010	PRCOL_00004297_RA	pm018364g0010, pm006876g0010, pm006166g0050	Pp3c21_14880	Solyc08g068310	168828, 70782	SM001215S25885, SM000166S02485, SM000192S04909, SM002322S07992	NA	Zci_09764	UTEX1559_10496	UTEX1560_18923, UTEX1560_10204	Zm00001d017175, Zm00001d025767
Zci_14174	N0.HOG0004670	OG0003557	n0	AagrOXF_evm.TU.utg000009l.210, AagrOXF_evm.TU.utg000116l.78	Azfi_s0045.g029780	AT3G10210, AT4G35750	Bradi2g60740, Bradi3g51230	NA	NA	Cre16.g691500_4532	CLOP_g259	843	Me1_v2_0206230	Mp5g05530	21682	NA	LOC_Os01g71980, LOC_Os04g47330, LOC_Os02g44820	PRCOL_00005681_RA	pm011108.t2, pm001960g0060, pm008483g0030	Pp3c6_21470	Solyc04g040200, Solyc04g082050, Solyc02g083250	168470, 89782	SM001458S01070, SM002762S10255, SM000060S19622, SM001499S01090	Zci1a_10903	Zci_14174	UTEX1559_17156	UTEX1560_17998	Zm00001d042118, Zm00001d011880, Zm00001d017545
Zci_09828	N0.HOG0006072	OG0004839	n0	AagrOXF_evm.TU.utg000116l.338	Azfi_s0301.g063701	AT2G24410, AT3G20550	Bradi4g26200	CBR_g38419	Chrsp73S07514	Cre09.g390430_4532	CLOP_g11267, CLOP_g25226	6508	Me1_v2_0093020	Mp7g08770	8611	Olucimarinus_31788	LOC_Os05g46860, LOC_Os05g46780	PRCOL_00003554_RA	pm007817g0030, pm009619g0020, pm009619g0010, pm004161g0040	Pp3c19_14080	Solyc10g006390	28201	SM000021S06431, SM000037S13516, SM000427S15753	Zci1a_40145	Zci_09828	UTEX1559_14941	UTEX1560_05350	Zm00001d037971
Zci_08344	N0.HOG0008368	OG0007024	n0	AagrOXF_evm.TU.utg000006l.215	Azfi_s0005.g009484	AT5G17290	Bradi3g01650	NA	Chrsp45S05929	Cre14.g630907_4532	CLOP_g22946	8751	Me1_v2_0209890	Mp1g12840	23477	NA	LOC_Os02g02570	NA	pm005658g0040, pm007189g0010	Pp3c4_11110	Solyc02g036380, Solyc06g043140	92777	SM000043S15888, SM000226S07425, SM000031S11618	NA	Zci_08344	UTEX1559_14882	UTEX1560_15169	Zm00001d015009
Zci_07712	N0.HOG0004516	OG0003425	n0	AagrOXF_evm.TU.utg000080l.54	Azfi_s0113.g045969	AT3G48470	Bradi3g47867	CBR_g45764, CBR_g52378	Chrsp31S04785	Cre03.g186550_4532	CLOP_g13569	5835	Me1_v2_0079120, Me1_v2_0009620	Mp2g02540	25452	Olucimarinus_15211	LOC_Os02g38574, LOC_Os02g38680, LOC_Os02g38490	PRCOL_00001784_RA	pm001703g0010, pm005387.t1, pm034987g0010	Pp3c24_17160	Solyc10g006780	437220	SM000076S21759, SM000028S10216, SM000030S11395	Zci1a_43585	Zci_07712	UTEX1559_06886	UTEX1560_04246, UTEX1560_04248, UTEX1560_04247	Zm00001d017114
Zci_05750	N0.HOG0005943	OG0004720	n0	AagrOXF_evm.TU.utg000042l.192	Azfi_s0139.g051210	AT1G63660	Bradi3g20590	CBR_g48399	Chrsp33S05063	Cre02.g092900_4532	CLOP_g25479	5264	Me1_v2_0042400, Me1_v2_0187900	Mp1g25460	1980	Olucimarinus_27778	LOC_Os08g23730	PRCOL_00000667_RA	pm001456g0010, pm031186g0020, pm006459g0020, pm002428g0070	Pp3c3_31480, Pp3c8_7320	Solyc08g081150	93014	SM000823S22591, SM000038S14363, SM000012S25448, SM000014S00295	Zci1a_02251	Zci_05750	UTEX1559_11218	UTEX1560_05171	Zm00001d026685
Zci_13470	N0.HOG0005234	OG0004066	n0	AagrOXF_evm.TU.utg000059l.300, AagrOXF_evm.TU.utg000012l.471, AagrOXF_evm.TU.utg000012l.474	Azfi_s0064.g035631	AT1G48605, AT3G18030	Bradi1g46530	CBR_g28078	NA	Cre10.g423450_4532	CLOP_g1191	7124, 3215	Me1_v2_0128190	Mp6g03370	NA	Olucimarinus_14967	LOC_Os06g09910	PRCOL_00001775_RA	pm029015g0020, pm130260g0010, pm038174g0010	Pp3c4_31830, Pp3c13_11510	Solyc08g080920, Solyc12g056270	97743	SM000068S20554, SM000120S25699	Zci1a_12633, Zci1a_09103	Zci_13470	UTEX1559_17591	UTEX1560_15632	Zm00001d039450, Zm00001d027805, Zm00001d045021
