geneID	cold_0.5h_rep1	cold_0.5h_rep2	cold_0.5h_rep3	cold_1h_rep1	cold_1h_rep2	cold_1h_rep3	cold_2h_rep1	cold_2h_rep2	cold_2h_rep3	cold_4h_rep1	cold_4h_rep2	cold_4h_rep3	cold_6h_rep1	cold_6h_rep2	cold_6h_rep3	cold_24h_rep1	cold_24h_rep2	cold_24h_rep3	control_0h_rep1	control_0h_rep2	control_0h_rep3	control_0h_rep4	control_0h_rep5	control_0h_rep6	control_0.5h_rep1	control_0.5h_rep2	control_0.5h_rep3	control_1h_rep1	control_1h_rep2	control_1h_rep3	control_2h_rep1	control_2h_rep2	control_2h_rep3	control_4h_rep1	control_4h_rep2	control_4h_rep3	control_6h_rep1	control_6h_rep2	control_6h_rep3	control_24h_rep1	control_24h_rep2	control_24h_rep3	heat_0.5h_rep1	heat_0.5h_rep2	heat_0.5h_rep3	heat_1h_rep1	heat_1h_rep2	heat_1h_rep3	heat_2h_rep1	heat_2h_rep2	heat_2h_rep3	heat_4h_rep1	heat_4h_rep2	heat_4h_rep3	heat_6h_rep1	heat_6h_rep2	heat_6h_rep3	heat_24h_rep1	heat_24h_rep2	heat_24h_rep3	high_light_s_0.25_rep1	high_light_s_0.25_rep2	high_light_s_0.25_rep3	high_light_s_0.5_rep1	high_light_s_0.5_rep2	high_light_s_0.5_rep3	high_light_s_2_rep1	high_light_s_2_rep2	high_light_s_2_rep3	high_light_s_4_rep1	high_light_s_4_rep2	high_light_s_4_rep3	high_light_s_6_rep1	high_light_s_6_rep2	high_light_s_6_rep3	high_light_r_0.25h_rep1	high_light_r_0.25h_rep2	high_light_r_0.25h_rep3	high_light_r_0.5h_rep1	high_light_r_0.5h_rep2	high_light_r_0.5h_rep3	high_light_r_1h_rep1	high_light_r_1h_rep2	high_light_r_1h_rep3	high_light_r_2h_rep1	high_light_r_2h_rep2	high_light_r_2h_rep3	high_light_r_4h_rep1	high_light_r_4h_rep2	high_light_r_4h_rep3
Zci_00582	4.157240396648111	4.336236104935456	4.4796782603797	3.9675284734544345	4.4844870634887215	4.558232708839566	3.382729972687618	4.509370723336906	3.6574655351758945	4.604108717281811	4.711150206431559	4.897929226381047	4.197768355905996	4.701713120408718	5.057226946393007	3.929846045200653	4.0716379812693155	4.151049011236186	4.482457449068209	2.7263325823990088	4.551246118053349	4.202631925065518	4.129025817821041	3.394499416159081	3.940138774699048	3.8187015823016783	4.184179563617659	4.485900522876395	4.251795122926034	3.861272494521309	5.2254437993461815	3.521588497369163	4.786117329435096	3.0513336505515407	1.995222737712858	4.383898979759962	4.127407536823679	3.7727513246535622	4.3686354041181605	4.335115240821577	3.230085329720045	4.7493902696802515	4.242991470608465	4.475656797976245	3.9399334691897967	4.455277168495125	4.4294829707597705	4.472266809645908	4.082444337120423	4.830414725334685	4.776982784338297	4.686732671442246	4.093489477663044	4.883574072901834	4.810844702378839	4.784645584921528	4.934063091411079	6.073440366044132	6.856633487245157	6.7641372908947455	1.8538951518119875	1.7861009460443449	3.0262057795208115	3.492166687110284	3.3242625044043397	3.849407467299063	5.359317810811798	3.898863056177909	1.8532834654708537	5.169590168299454	3.7677342915074727	4.577317267149013	4.2054484974304005	3.9512361234738864	4.426817900692675	3.500893401685581	3.621652192357256	4.144089223570669	4.261554613266504	4.187560205997488	3.90733141052244	4.279051039587494	4.0777692567045944	4.115004965014284	4.23761317984709	4.451848393280815	3.3483236065048914	1.987714800169374	4.285736189075821	3.0436393026228905
Zci_00792	3.620045872941626	3.6687995153773176	3.5829606900955757	3.260220070064675	3.2875756111888284	3.4923381162525677	2.5007353180316527	2.7090229306298172	2.332916113927455	3.1236963583731425	3.0768025637872407	2.783943273758974	3.0874574160828567	3.201949123444276	2.6916216279792105	3.1186821311157793	3.2908143144473323	3.80704264883835	3.962711678415934	2.476878820872074	3.901536348877178	3.4864001089015755	3.761433793868207	2.143093947530748	4.01398973167224	2.986125031955698	3.848818999289839	3.3970660389898195	3.992791455754388	2.5892159343452414	4.401356689090142	2.420306477147658	3.5465065774375915	3.710242241008249	2.2862884163760473	3.1326406528142328	3.331197151725947	2.684121273214126	2.6717967119663606	4.057930357476707	2.757967220348084	3.838793377024989	6.952513332659493	6.871566185151112	6.6852261857213815	6.978940676113229	6.5203198877414	6.511367329705726	6.116518567774893	6.0498949296876665	6.325670524246872	5.7186924565287125	4.848337201011783	4.523975445676161	4.983193409976165	5.3112527129549845	5.122415927424103	4.214694482267243	4.982186231957646	3.149993102736072	5.51622936039727	5.3920687782485315	4.581519806985691	6.602213007767368	6.0972887900229855	5.501862543192679	5.818755170828968	4.274571983801927	4.295069001660521	5.137234464899843	3.716770695740761	4.424041883976376	4.105453627291532	3.977877989500964	4.772566877321039	3.453695580563386	3.6756940994701326	3.96614647103519	2.9492027927702797	3.88578826377448	3.6589008579383826	3.6509898226988664	3.555579347727649	3.3318418435095305	3.224347395839304	3.496403752264309	3.357011947924468	2.29926535248994	3.4436025937581376	2.5076517123621676
Zci_01554	3.440408757407251	2.197547075411645	3.2892752936066323	2.939220677794735	1.1780127453532288	3.0937125824818468	0.2242682040539296	0.5187983571078002	2.3302837166245496	0.92115358842308	2.0201037868190173	1.237002677020194	1.629396904845282	0.782523506616031	2.478936918883188	1.8493588189796233	2.6535027183714175	2.567287551489466	2.3087513545966867	2.057718734051163	2.862297434574426	2.814888388872226	2.9839143619970123	3.305977292749765	3.5091039360292884	2.385361004030039	3.709476348641824	2.4013176869338824	2.2868844535107353	3.358414504768882	2.99124817403566	2.15911802787802	3.5063369090643324	2.468718561013356	2.2196887123241154	2.8190753586334996	1.70729403790779	1.5803470179543575	2.48173346832355	3.8839656692054487	2.5396256335084875	3.4594422574365287	8.93595631778985	8.719123230936422	8.641551617720289	8.630053215801178	8.783440913719481	8.59610499467784	7.4576981025413875	7.337371901408771	7.915047653341179	7.687859998217545	7.64629056810209	6.172151679251609	6.6760427925421135	7.871836525945751	7.189951965526647	5.923556057430314	5.97555098997525	6.843580870434251	6.157666990329718	7.482503538163367	5.312762261362697	7.72948327665035	7.414797769512653	6.368279019740056	7.240281236073665	5.049397660460303	6.899193253468854	6.276034172957781	4.78035433619605	5.185792350225907	6.19888066552431	5.85700983309392	5.511864185901796	5.421980983385738	5.114815294428319	4.990878364869611	4.445156477024116	4.724786100343799	4.560317028587103	5.079527922185168	4.163009047798175	4.7082300406945805	5.433100160651815	3.820781304797353	3.786228534649624	4.164517714612177	3.211883617311718	2.6205363778952213
Zci_01714	3.722662621474491	2.0154365691843874	3.504402807070672	3.736289919688551	3.8295134770272425	3.1071283754621604	2.9373314002498865	3.2303537302370837	3.6717610531347966	2.859865989071514	2.5189944175009553	1.787705026332043	1.1664565797610422	1.931603862086227	1.4019687108005527	1.3564102063159245	0.5175062711221261	1.2140797927552478	4.0081271637447555	3.2194640123325553	3.534368118763885	3.3695296811560316	2.625588028471624	3.730485467148777	3.1895243015526153	3.706435956375519	3.463488224150946	3.736810823686485	3.527460176867625	3.9042198083110566	3.752635433303821	3.833994419189071	3.3922185200577815	2.8953279957816234	4.548262674382883	3.915167188456933	3.657718366234346	3.4721131397543914	2.9400090715694245	3.3146606244251164	4.1694357642521815	3.287863635056114	2.268294667014542	1.4400090925439513	1.846971180641716	2.8852305631093143	2.4180449320268385	2.6729756179255353	3.1898327372138384	2.576430910287988	3.1654470145461375	3.919923349636104	3.378645705757333	3.785522629912845	2.898260890687056	3.985170223077855	3.371192442370325	2.1762838129068096	3.534166232003522	3.32238608331146	4.427617754673309	5.0820533717476986	4.05802272811911	4.4059599458979735	4.037740700424829	4.2702569935942165	4.301700553486133	3.988974402584374	4.255959812676462	4.484161529195419	2.927524841703606	4.131204797386878	4.0916693331270455	3.8191865461463976	4.072144666721448	3.103854453864868	3.804592033329908	3.7530290341546664	3.247261212138699	4.013839525972877	3.8592106150251912	3.728797533140375	2.099054880321586	3.420257087092752	3.58335275570941	3.690021850154835	3.2020528676685247	4.3820045450366	4.037477132273015	3.5643751700637423
Zci_01840	3.977762275060608	4.00331872232132	3.903606295417997	4.25911577072007	3.692188461804671	3.822751295722913	4.023421789989655	3.772390528103911	3.8791512338426233	3.181169494315726	3.205057050381066	3.0838210778273183	2.731407438664031	2.8689812726514528	1.9220238000486736	2.4365914139916174	2.512583894413203	2.4083188124429236	4.349316920130061	4.452792008422691	3.4488093794487527	3.772439915811944	3.4193557487944544	4.680845185780221	3.874000236654343	4.084673430094735	3.9556864144915664	4.194431869668393	3.6014688896301092	3.6509620409566206	4.297097841457304	3.9691656168661935	3.892598032112738	3.704918206191351	4.234201878297308	4.168523097215864	4.329399439747615	4.189207601491196	3.828201591541299	3.701800782733841	4.1648996912214225	3.9600917219114207	4.043271709266784	4.500136351052882	4.69522544442646	4.384563404922517	4.526038328378584	4.419925069386892	4.708903466445971	5.256647798502713	4.333962950312823	4.781613201724028	5.218517498418821	5.649090826555368	5.807326746760373	5.144124688873286	5.087301797413347	6.317229679168495	6.082617634923731	6.948976435518138	5.352382184884773	6.2360080606105726	4.650219664866657	5.638709779619347	5.025244922479508	4.754247289139951	4.8367857586770615	4.977859472586197	5.947131920242517	4.525213559510128	4.952453272749184	5.384932617418656	6.225993047806869	5.646676680761112	4.96525842430217	6.027854822380504	5.576171615140002	4.862951478957071	5.115353516327437	4.817773410384623	4.3039482411136545	4.53672588223259	3.843707306836259	3.987851853861684	3.112699478036792	4.149026491860694	3.994047594301811	4.63634441201882	4.323689859409258	3.747293903310021
Zci_02032	7.832425753063005	7.344707640732943	7.362323109623693	7.560053003846766	7.171797674329783	7.56290595279899	7.588097862125752	7.234196954057644	7.3499393972828	7.408158713525022	7.438397895889289	6.7570436541560355	7.391762458890911	7.575150701479317	6.625862656017632	7.024975557347617	7.665378417124561	7.177343277195736	7.482624153591036	7.473173520637609	7.652599702925611	7.207361706572898	7.081728548086022	7.076736029542887	7.526736501705269	7.273895751202401	7.48963127464548	7.261682354070478	7.690675440879115	7.038509492954398	7.821258020003681	7.2598455268393876	7.380771420157251	7.339279601159193	8.06324649527697	7.329384803588685	7.44162709958853	7.586372636469627	6.872156184050057	7.879170860680864	7.67778542239661	7.37955227277026	9.814983480375746	9.984554739440094	10.087618727302248	10.461487160684014	10.992206060381072	10.6430854998934	10.346785559657588	10.481013497649212	10.52661891399447	10.214907476430636	10.049439051687225	9.980784319454388	9.614331321598527	10.05669381654824	9.99014530902445	9.012936583199044	9.42168924401922	9.148011886289137	8.293662177593786	9.21519090454574	7.7335021823884675	9.361289370386334	9.560446624201631	8.84761973257247	10.348260486932023	9.162903186293349	10.026435878799598	9.496080280466748	8.991371737423309	9.210046874136996	9.983930663567444	9.280781728974423	9.285681530701751	9.76284977727546	9.114683738485732	9.048087518597658	9.315091565594924	8.964338584460629	8.766601962054901	8.688006973724312	8.379205497830277	8.402575952744979	8.384169327046385	7.9367566232694	7.576815898619787	5.973789466018119	7.625130938153275	6.367077077709343
Zci_03616	6.180008522709109	6.0418627551687845	5.73105614691219	6.042444514668564	5.728930827798933	6.039038875879751	5.534147194526133	5.352309333325588	5.729327949481307	5.84306155021485	5.29333985583507	4.8917820383982376	5.498276794886907	5.449152919157664	4.884237775063317	4.602602079585052	5.005974669237707	4.766524792983729	5.772067787921977	5.529008707239747	5.75326249903943	5.856437276562671	5.845733098303233	5.89251825798951	6.098033641304268	5.509224824948854	5.994236669493805	6.041074924529864	4.8508488784755555	6.265416996824065	6.474144359999022	4.178852898549958	6.049764390366552	5.557256674384075	4.32437767453175	5.978384309456268	5.250887503407038	4.84599136063754	5.754292319822695	5.989376498216513	5.7666145749151685	6.010199016855355	10.86212213746082	10.902901451632788	11.449082970267012	11.53915950703938	11.820045571073871	11.770383634166228	10.805647581912046	10.615712601226246	10.938342364880077	10.320149151279844	9.851627385194972	9.366822968926558	10.09605254823954	9.944050604943358	9.867472478028033	8.51094186868895	8.968531781339061	8.564423586385859	8.12363269880519	9.428796319527107	6.936779875282323	10.19436366610854	10.40486869285668	8.859708365483629	11.094273338564127	8.516204005271588	10.368185707321436	9.727025517630466	7.772951148390136	8.745426352983742	9.305581994243934	7.575992924707877	8.800684199558185	8.900498132863861	7.340435139299002	7.8457245630193935	8.503928421699747	7.494819264235584	8.026176876227716	8.251906406262293	7.813366049123717	7.846713860138017	7.809504593946205	7.442290397572379	6.954535017739119	5.2497001540180595	6.476182716205301	5.448695029347094
Zci_04356	4.922618729636014	5.113223198432852	4.788782443214523	4.807509665905818	4.397392495943519	4.640127178496395	4.632192730872452	4.378677400884269	4.297774925390704	3.887988624334959	4.265444089882537	3.746567094478056	4.036889724195727	4.585123343542937	3.395229645308131	4.28335731775563	4.9036990370472395	4.904693976138517	4.5813313539890865	4.687044771118445	4.7174679137683135	4.223524878783499	4.154703932718424	4.638607746987263	4.464255949175095	4.062054477986104	4.611159470910491	4.218099212282256	4.3616092181039825	4.583588686910234	4.8847752135136995	5.07833953240267	4.72886924684816	4.486417490246766	5.013821861417086	4.717543600471719	4.635137355970649	4.084351705500851	4.121480031456229	4.902024303845127	4.678630358134903	4.694317526918744	8.113293447320597	8.17515255661148	8.5130018301923709	8.52744610695635	9.10602575749176	8.451948755352413	8.264068212062531	8.16674471922957	8.11204497695765	8.167004785543272	7.660206036363931	7.001001454911754	7.8750644476394385	8.29331298557577	8.08133918161579	6.997283217286485	7.6617534460492225	7.493253329189301	5.747169462671301	6.980211736724732	4.93177560934886	7.104601230436103	7.239159189073015	6.017223524905625	7.519701953677373	5.78324957507023	7.742637859513165	6.948988787544292	5.80451811121698	6.219916326262468	6.660015268439305	6.315703652059355	6.755722475723909	6.677619175615944	5.729635142877642	5.717762229149199	6.031934193254466	5.116172414585409	5.6655639723192515	5.96200809215051	5.7337554427999535	5.936856549237435	5.887350047148144	5.08799879990686	4.717443660103609	4.3063690703988105	4.858570914281597	4.183029571295514
Zci_05013	4.149952562418815	4.323027318994678	4.6336684657298735	4.395338309903363	3.780853469526391	4.1735667237982375	3.444267991965426	3.7665579448276865	4.461525426320456	3.857717198987648	3.5992129237034685	3.5905058261645646	3.5108447656675197	3.860094775758988	3.117114615472619	3.598488947117136	4.079696638818994	4.4767841611315236	3.845229975940433	3.941980524905452	4.0222513787130785	4.14889173865798	3.2821876652034443	4.670535304699306	3.8828606245898984	4.3210563880899295	4.787477927376399	3.982152277440973	4.134529692092055	5.08353059726283	4.080276281495138	4.2126207932460735	4.987397686862903	3.778905343404555	4.309927808935801	4.538684694981667	3.725809027114518	4.0309854966764425	4.163292628665999	4.688884980218007	4.364407519726604	4.265105443030287	7.6545708637226015	7.808058908542592	8.181099242979093	8.220638274811996	8.767808845779781	8.793611736242166	7.965730611869554	7.8377830058705555	8.12239444873762	7.422898014989069	7.395495673506095	7.106044976066676	7.092338459075882	7.455089895670286	7.543985389899835	6.312084975415453	7.355927864415043	7.0838821572761566	5.229738360870046	6.66869168882921	4.521216648130761	6.8165035447602875	6.796062536774689	5.84490598178267	7.886645051550613	6.649618434807627	8.071375978272876	6.590302245282077	5.8975563777306785	6.249829598573604	7.3352594298930365	6.323531714502742	6.660532220651258	7.344863060701059	6.424733874473155	6.20991835509341	6.841328490904966	6.420181000691483	6.003323135157909	6.218094711456367	5.8625676821344	6.099529604613541	6.4086600972556935	4.962919576812581	4.9241390789724395	4.5511649676642705	4.492525546503144	3.9678958634483057
Zci_05859	2.8792597566035725	2.7410249461865113	3.1735007036945695	2.875165900137026	2.3411534664512725	2.792893281131022	2.3428341386878855	1.0609516000913768	3.4016875037236227	2.146338219917196	2.5043053168691327	2.6642948323423545	2.55732674516807	1.3296002030311376	1.9168550738455483	1.5136084836043862	1.5614803729604578	1.9048636592689256	2.143093947530748	2.5597504396782473	0.9498394817583056	0.9498394817583056	1.6358796084744038	3.726630164037871	2.749257975649397	2.3500981995215273	3.632182606509622	2.483972342693257	2.9481529360696266	3.4964786287525618	1.7769503186548017	2.528598239940155	2.9388849167455886	1.305303687005442	2.858351114170828	2.7137688194194127	3.295695489454474	2.109767589793884	3.418504574465517	2.070684690348128	3.066615474437826	3.200929923538302	1.8415472625296927	1.6230365746521238	1.9994169439175624	1.5487793878896547	2.087591414591887	2.0327534664340576	1.2689894808672306	0.5884592478471588	2.4883473703232313	2.232706268679868	2.6456531661911984	1.6104756973690948	3.6110451874924063	2.0258040336408456	2.2754258005003627	1.2222957142790456	3.812850094187853	3.6203816136904527	3.3504456172762525	4.214108026568517	2.8743869196115632	3.783205597253007	3.1850906073086978	2.2873534725718634	2.4477489893738973	2.92342824568274	3.415562341674212	2.242312787312443	1.4431581569926486	2.666241128749	2.887348145237977	2.879982178098194	1.3368500972063266	3.2369590584816472	3.0239339335739306	2.721024895432188	2.8432571909211517	3.0803454937897605	2.0679108944493425	2.3842672747585585	1.5930102654764071	2.023595885174395	1.8417384199258688	2.5056582113768164	2.4572839570610667	3.8868981617522302	2.462752437147367	2.660788277761311
Zci_06059	2.3258315033473527	2.1800134984951383	1.8714739048891784	1.3760446722003428	2.1890225450284	1.8000539769512456	0.5187983571078002	1.577034205097299	1.690931202493979	1.0039948675884025	1.6064769891103794	1.4151096926165494	1.1051836806891282	1.639487217373402	-0.8107952897714962	1.4515013470023903	2.175819679073045	1.4452873270329911	1.2679667875436815	0.3483364489008434	1.8770267682361623	1.641554880024765	2.0284966139379743	2.0468915700951773	1.4975799821262192	0.5553733297903155	1.0160196136780524	1.6047762184003964	1.8461662686992235	-1.2721895063326576	0.993416287128578	1.4059785305111554	2.6406857048112715	1.1884345688304927	0.7529697600190306	1.2447764539802926	1.0131068406709949	1.2337512172706502	1.082509815672391	0.5142552692280346	2.2485639473344334	2.655170237714915	2.077265900827411	2.859106315221997	0.5889604444868958	1.6915119505954497	2.1846070885789493	2.625099551938594	2.835560579296531	3.5583030149851043	3.311561345883933	3.6054950811005257	3.9055397843849535	4.042044778095342	3.9762022156466736	4.166585285846993	4.8307510912414235	2.7848576923153776	2.9332132273733396	3.973604472257136	0.1575606916948091	0.5084453156366937	-0.5237488809801427	0.8776703033338361	1.3135395179762872	0.8214738843844016	3.451328469231059	1.387527937181209	1.9015503240562743	3.7135455084323454	2.6603892043571573	2.9233288146821534	3.19925511917548	2.516063275007629	3.2882058793775033	2.7198964262478644	2.9995501439688197	2.735186908739381	2.4753631248902797	2.4126801557295057	3.419474954234382	2.9090045367687987	3.413806362061859	3.822347318221208	4.068425254432777	2.6125444934041897	2.8031448770193568	2.29015701853717	2.687303605721399	2.339721619350854
Zci_07073	4.492823656398199	2.425919474918144	4.231070552753741	4.123875945254562	2.2114822275649075	4.255504222205833	4.118133915518231	1.701020580900494	3.7438025202264464	4.112824718534075	3.505910247235074	3.2780702307212675	3.7687274422694967	3.303517120041696	3.7121579589993976	4.626696733910346	3.6780663996726193	3.8442386133709503	3.628349918246392	3.1734297928142468	4.1749614595295546	2.512790725371415	1.4804899203166302	3.4246793501637893	3.892114532753431	2.6610833226771584	3.6160490889844863	3.1831842332105182	3.6942665972496913	4.508963832606399	3.5661659261311915	3.3757496113409435	3.698688383709761	3.902920230390219	4.676751484181081	3.444142733959243	4.4255470859835615	3.6150132686704137	3.5794140010252957	3.843370220937196	4.781922746748055	3.4560538543822217	6.617755347884531	6.345518334317174	7.225676033485779	7.059262302665254	7.541259866216274	7.275150048422483	6.168260061802784	5.729188099418102	6.7456736819764505	6.528533885037013	5.713392149697963	5.381987731765339	6.330816394394306	6.719616051067339	6.905107456579229	5.888669627613419	5.042913764791437	6.285060437695244	5.156607950903708	5.761924876331491	4.076889192143477	6.004798905245832	6.110668529354614	4.622666895619175	6.50371427495045	5.145880357412618	6.364847403861155	5.89806943409742	4.10871909162408	5.449005608673463	5.902090929837798	5.127789249286842	5.783151451636306	5.718883830106278	4.743141447390244	5.13023761223496	5.357580494718235	4.677969905905373	4.939389002623128	5.477159011537374	4.805877127760396	5.298464234066086	5.382528230745695	4.369959158921713	4.648539579675696	4.600116849765145	4.7051425167169425	4.122118440734328
Zci_07187	7.152733956230796	7.230006923434453	7.169442072366412	7.520103597547403	7.26868684415384	7.643177708136704	7.893332931484948	7.861361953281573	8.072407384399055	8.051706917991979	7.653738932167942	8.211642539087915	7.948034648555566	7.949407627226062	8.381636594693386	8.070651179033623	7.820888669868846	7.902733752861981	7.0695321954716475	6.952742040927235	7.020364689317434	7.119990740353772	6.822803071868494	7.237623156484952	6.962059233872021	7.002264442190986	7.34513918283347	7.199122255393863	6.6813896053409465	7.089250628400528	7.402118191780615	6.891357063335502	7.218095343374844	6.719086790283805	6.940713823768648	6.961197295977845	6.763112543112299	6.977583575960341	7.14325664080394	7.1880756894174045	7.155493232149668	6.7338071179293895	10.068793409751398	9.8575113476542	10.214748507879744	10.104116389751423	10.037282413195648	10.377239258216346	9.651693302725674	9.7394165067714	9.992406181462716	9.910853351718425	9.627876227817303	8.79510341365711	9.569657898987424	10.013571310529247	9.582502599535974	8.204966226685345	8.976235882756557	8.30431935661624	8.638025659896085	9.357735847619578	7.921375418007195	9.645096331583922	9.35621822961995	8.887865449467144	9.783412408845503	7.788052997439667	9.350068475777912	8.800936479590186	7.666102595581105	8.02551866023667	8.586292572631526	7.83515722603426	8.704360902645822	8.271742507566348	7.576741404992672	7.69824007811696	7.655028098653608	7.202181476099931	7.810713145337777	8.103184831506367	7.8272372039147315	8.153588493489751	8.039475890593655	7.9279110464750415	7.067990241203871	6.963077053201171	7.325424041508534	6.831334643341498
Zci_08001	3.341887501442543	1.5986437733292755	2.3746921897065216	2.805061126219484	1.650904289880098	3.54684568014894	2.3289577486148425	1.999874777751764	1.9562856782706983	2.59366987527501	3.134094131750418	2.0227524986476033	3.4050514188952943	3.8266748974189686	2.3733363101389675	3.0319020206497846	2.8639736526278736	3.2900404830955496	2.174124457036341	1.1879255357909737	2.7471072479094967	2.2924463161793978	2.515214692573716	1.5182115216115144	2.413656376763415	1.9802859404524007	2.475517382970315	2.165498256542526	3.027443853908676	0.7965698686799546	4.137675334378141	1.9001861709674464	3.109384796304606	1.808647797923176	1.353401171107125	2.7841401340936405	1.3696149815836485	1.2205182559792334	2.062008078509596	3.5941583730106044	1.8477996561589216	3.1498260754666116	2.4157366576269417	3.113027757422043	0.7547555621636776	3.8810986281503497	3.403810679969103	3.171774773075343	2.803933899748241	3.2365402526709595	3.697673724776811	3.7461539705941385	3.3272158514870966	1.8434844116588591	2.460478618115991	4.546570079533382	3.51957735314657	2.4132467759299723	4.394130848473889	4.011159612545632	0.9667531677617108	0.01268179004026999	0.09116892278001866	0.5189290175849062	1.0883482020910875	1.808737112973891	2.683409844441618	1.1189786588082002	1.4040858801650944	2.969669663917571	2.2365044123500497	1.9710212204379365	2.387621107685293	2.8851831246957382	3.446133130313628	2.8046198149632775	2.471380433756076	2.6058363923134236	3.3810295563594246	2.422580549073553	2.8198279769739187	2.1074595702321477	2.6547882448157174	2.7465939453207113	2.7790913997917808	2.070174901836558	2.0620947711768114	1.910138634950872	3.0770608520167815	2.633980710024536
Zci_10479	4.372212316985102	3.590347467789755	4.786068893472208	3.872388932498236	4.551426465755716	4.692490004119932	4.160129509118892	3.903273156078158	3.1893728844599476	4.6992402403923546	4.839420269200151	3.5110582971336943	4.458563122307867	4.533568310964343	3.765308332139438	3.719801399474112	4.778333735417358	6.020206128671597	4.786654385303416	3.0160456391511645	4.408288835634669	4.855984732289182	5.158375968926627	4.044631744891099	4.8577639796723435	4.103332406144627	4.555042223994662	4.696116132526899	5.252713577880181	4.66910921135346	6.057923150966629	5.772219583155219	3.9876817467090935	3.625054747443644	5.1916146946652795	4.688168596899991	4.081276059962343	4.263971608136962	4.6701178117855	4.2835385121225045	3.85460746688728	5.256684631377698	4.341379491674036	4.251481031129294	4.1694343333096855	5.90448224208697	4.942917085030589	5.509436884377416	5.931369001333566	5.365227573462648	6.147837875836917	6.073574850446153	5.98783911659784	5.477581171849358	5.8257596999277705	6.1314150226783735	6.566252501903635	5.327523637772686	5.902091577292122	5.766142363064539	2.111394448593764	2.259228008093856	3.2233431409496265	4.056639267959796	3.6714097883427654	4.74961679083171	6.545719112255779	4.133360451683571	3.0393601723583035	5.815632207055087	3.90885626387479	4.049459063118412	4.174495185258844	3.133319893332197	5.438052082228565	3.678145474393009	4.172050420572606	4.971229380124189	4.1992829842361195	4.002797898532784	4.473549744567239	4.207838791596106	4.516300013335255	4.770388033128225	4.0617816575676295	5.156719074861125	4.106396343145645	3.425605477513726	4.916946879161059	3.516728318707482
Zci_10481	7.362323109623693	6.773421796817159	7.090690650525962	6.920692650565489	7.213441407004702	8.004638179503	6.560296947057835	7.197235895558574	6.915892679938908	7.65262936957583	8.117100909097811	7.242976438747378	7.29308918636347	7.956559496749346	7.646742320230056	6.821921166552009	7.534370933917581	7.754648712077819	7.238343198524317	5.761066649867559	7.1191501692599655	7.6767030606917	7.572131963472948	6.5974318839680555	7.1988553609816295	7.596068462978667	8.280532028030256	7.109948278312305	8.609452203285244	7.046453912801765	8.793486256664737	6.32379537719612	7.398388010863706	5.988711195763485	3.790714709313838	8.18522368135943	6.35988409317436	6.883569899078801	7.655794194146376	7.31424228917214	6.015834595991243	8.112743235108356	6.943125382988576	7.593877720908094	6.74103408934004	8.732393580778695	8.466695735478702	8.11808413719897	8.806306392079422	9.298527595742016	9.31549301403403	9.648563008525883	9.60639556686194	9.0596950228039	8.931991381267341	10.21775539683379	10.135489424756924	9.569191234562478	10.078068052645998	9.27462548912814	4.173551198870187	3.566415007944881	6.05434977895315	6.044810011711274	5.9074778643641706	7.124772912076097	8.635934999237898	6.4598528946062395	6.0610223902948475	8.89220624279251	7.251402514980934	7.027464874859892	7.19138889819845	7.1826866519345725	8.614013187635454	6.537712941233855	7.69824007811696	8.242858036077187	6.824813906748681	7.345258722851493	7.683734994917221	7.617742834977109	7.940297969614699	8.30381826385244	7.86004114500626	8.695735074664935	7.443128871130064	6.194547737066119	8.472603937146491	7.046143457437108
Zci_10543	3.875076873803153	4.375147679167064	4.194440759440916	3.788231154281817	4.162520887745112	3.966664822886148	3.802789413155726	3.909572111925733	3.763345872169295	3.4387654407951103	3.6924148376428474	3.697687815584845	3.117114615472619	3.872597270156959	3.3312844487766293	4.063640170767098	4.186162485832055	3.879480874053298	4.119705941997243	3.737542165972428	3.9241650077875776	4.349316920130061	4.273027474930095	4.342052485574245	4.1706219595118466	3.713646234148293	4.4054099286198936	4.285545111304108	4.097128491112518	3.8534393191857705	4.214517170580317	4.511982867960033	4.217111695117669	4.07449014248782	4.309252124015434	4.030710290056156	4.150954467827269	3.8454136592813137	3.888729887246953	4.503554415871982	4.191823031873016	3.949075608182997	7.380417052915751	7.4938376017785044	7.815191680289656	7.208680654742592	7.70129760891228	7.430204108635585	6.3380184089730704	6.38362171059256	6.706248268489131	6.864070344146331	6.437815408103644	5.541926145646078	6.538585690468633	7.043113310990515	6.429138605303316	4.748799421436353	5.458364587633419	4.893436862945569	5.2150902428181345	6.174946412872282	4.379099384739406	6.330087857924314	6.406108058257382	5.074354526815179	6.260764139462713	4.833522859523208	6.1009400867943855	5.868202923832663	4.646058638011636	5.083674607618286	5.219010001438306	5.006588768591082	5.289991463346583	5.231875580656358	4.502700654370954	4.865247648412446	4.717044057973783	4.4081300976418865	4.438856418650475	4.410347737599518	3.9568548378302335	4.56507047204824	4.800335982017847	4.0735022330508315	3.7530164870041034	4.034751027008363	3.8562014328296943	2.6917696323943834
Zci_10622	3.7317523557946743	2.6304383000824663	2.926487107498281	3.42350304020961	2.071670086080375	2.58132389352971	2.7173584464590497	2.1055952720625384	2.544277269386883	2.90494353579136	2.9578709952338595	2.4291823041791796	2.7394102084467176	2.4193922346700956	3.091552603500997	2.4244969169038217	1.934275425451473	2.6660746755818594	3.1544696690222755	3.213491139456766	3.0326154965018812	3.1320247857905197	2.683283945139327	3.010452770329211	3.2422467968166235	2.736459216875899	3.4114381061213463	3.154229985675323	2.55040107306459	3.1206988561874143	3.703389015535602	2.12055388410959	2.982963594647261	2.5427715688129657	1.8631515470103337	3.324670233953219	2.763625136415793	3.0925278809254673	3.328504272231332	3.403809170312018	2.591669531324473	3.063799669209191	5.441249299668806	4.844217553881538	5.821312046372665	5.918439677915125	5.893264054274025	5.972783976225024	5.491487455237835	5.223762056234248	5.294425972061608	5.467542141902141	5.088595560063667	5.065989026092204	4.9913955637844545	5.169353827655756	4.7593142681520835	5.5697739444157435	5.7111698114350995	5.418959410413372	4.261033481134139	5.213826424100785	3.943004254787576	5.87303578204723	5.755114034103077	4.851904533777439	5.730390293331863	4.573959494977268	5.9080517764598195	4.839098397991618	4.254707426063678	4.584363239907647	5.543740747568148	4.292391342097317	4.923671150896314	5.095526219466723	4.56116811630216	4.5845302680773505	4.726828023488535	4.13800168264274	4.168382317260607	4.865633322430258	3.737549662090363	4.246726816019461	4.04307067130225	3.941493865677898	3.31450694487794	3.7765149853542472	3.5557834248023226	3.558434481594221
Zci_11004	6.813908681591546	6.381673260900153	6.787400889194836	6.4604995614265155	6.574527964306368	7.385553782249063	5.826160841787116	6.598477359110594	6.778668153225774	6.806266363338083	7.525092992191686	6.935661173898342	6.499438446400379	7.397620402312654	6.828344001759795	6.341880224643473	7.361701037246821	7.395401948552488	6.452478678886791	5.540358737012659	6.655879152030252	6.725014509380308	6.675185687226306	6.340715003582698	6.330168141393949	6.740271101376152	7.494796442996255	6.492629158678	7.51945961351212	6.52009122524475	7.302400340475016	5.951510963420112	6.748539037593987	5.5125866285797605	5.010406824442551	7.43359092649291	5.6310951763157	6.242580513143415	7.037784283086298	6.389003474349247	5.946252833886693	7.6314530538484036	6.465397921200273	6.938312374127984	6.137542541600491	7.679056673783433	7.551939581614023	6.872252558133407	7.349789270831701	8.12462157230044	7.646674908177531	7.931509503996662	7.619104740921048	7.73781375305237	6.803872079651685	8.370632899503283	8.07973069467592	8.435137417219805	8.1946307151747515	8.119699239634597	4.117485119341068	3.645300535847869	5.607834116082192	5.3115608586453975	5.714993447443247	6.3928356331839975	7.172390266417774	5.8054525012188085	5.294431901357326	7.023368357919685	6.025505114463867	5.778488302435991	5.794045224849825	6.036312818821185	6.823043193784265	5.289314769192581	5.980270946837996	6.5959296331349675	5.357923088635891	6.182161190797767	6.044199478574362	6.106420766758923	6.37363461775427	6.7943841777915335	6.1988926018830135	7.15375977728793	6.248929954802228	5.64229301823749	7.1415194278372836	5.9826488025723075
Zci_11293	5.618450509538343	4.747380433462443	5.474509820119671	6.127578816480231	4.851989010986092	5.9074744967250625	5.272652429133437	5.089531293215571	5.523861888165184	5.7163659077274795	5.381823390481893	5.225121487632559	4.947209532294702	5.244024113521579	5.153157142098902	5.656998891277313	5.292847199496093	5.6290248306133135	5.573706820905101	4.746966377807044	5.6861944945504	5.728138113311017	5.340031310212096	5.455363104027646	5.757495592115304	5.585934355994694	6.069593911719194	5.492636001992473	5.1427961124105375	5.373408798895623	5.640739994842405	4.567305006939094	5.480265116919488	5.233120573405338	4.4904597896278515	5.484530213909812	4.981667874509992	4.374428081369968	5.233275588484976	5.837249146601196	5.073306842217389	5.827866951404722	7.7077558250233444	7.245940105695728	7.74867077972706	8.562822974541424	8.630053215801178	8.928687927425733	9.067279902466645	9.280754155826324	8.913694285247152	8.821925558673854	9.015071169907523	9.027889743023923	8.684463492789328	8.88690270282309	8.799384579072896	9.04758083596609	9.399109861615536	9.527335732346474	6.28353908214411	7.339465826698171	6.385587036632723	7.592430746164717	7.611445829429956	7.330090921986099	9.340867770692338	8.47555020966281	9.57386139363032	8.194992777135592	7.8581333863862275	8.015626893116405	9.565453430652576	8.211365278249252	7.888181981801677	9.817751388302424	8.054134269974375	7.778059187511289	8.960851328970904	7.904619878871381	7.655028098653608	8.639802405360399	7.63985930743696	7.527679802475643	7.517940450656036	6.623415615051197	6.592392059445326	4.733693934420594	5.769577084275479	5.300610336243564
Zci_11539	6.878625335135854	7.0623198013719835	6.511453708564691	6.613693302933871	6.492032012998574	6.589765653878968	6.289418717728169	6.589500994395654	6.146234251910687	6.4339816598158075	6.502665333328946	5.969347596896241	6.29805811715825	6.918299637259746	6.036994741301621	6.501667424712201	7.3014127565135425	6.403330901261127	6.527403517412619	6.065791896045202	6.814815905179713	6.710692954242462	6.6641101592545615	6.365984308577435	6.805520574015867	6.614388296029051	6.6803167808706805	6.814905750378796	6.560788165624746	6.490080909567037	7.740097412507347	6.1591196594913304	6.676232968874284	6.341940647724109	5.61518023635121	6.601814139597073	5.763423526684693	5.460249170510288	6.100398451340531	7.160583182781242	6.454204723321072	6.8408103397784314	11.353995674105692	11.575536917581696	11.536466889367032	11.565875670530511	11.689511611891495	11.50890361086192	10.572820424812242	10.566234199467276	10.96419426130241	10.68005076560786	10.280531759688255	9.14504831760818	10.127072083025716	10.615232671533562	10.013571310529247	8.601938928866666	9.04758083596609	8.313029154477023	8.35587071388271	9.77419744936778	7.595456065441159	10.425086351154564	10.498399292251092	9.130599504962907	10.72898518114832	8.256661620599516	9.539518947853123	9.846632571573751	7.929072206205261	8.492478875676225	8.721649084665735	8.181151886157753	9.166671119756206	8.251545316876012	7.888339346516159	8.266928606341759	8.133919490393112	7.820454509105314	8.21600995238513	8.37219671777781	8.109145116538482	8.446698433612985	8.303195888221497	8.166281480621816	7.552151173512064	6.43403165779453	7.342411575780937	6.356583818952235
Zci_11651	3.8738336046530737	2.904860425689511	3.6314934570078714	3.967917559406714	2.652404644963554	3.2557812393667724	2.579134606142473	3.0058998406970527	3.980316446693464	3.0315233710159317	2.6469252499210967	1.9930586801763257	2.5603632928830975	3.684526669626419	2.226506577878552	3.491400932580565	3.556996059962239	2.9783783651645788	2.7757645913987417	1.731078030027441	3.2956108670304167	3.4015969471446774	2.6982834871513752	2.849551236447677	2.7078512539783413	2.7537112905823276	4.48108651248697	2.9725150698452394	4.007229422862029	4.08606017260243	3.838403981412696	3.0231408877861448	3.8184970392816817	2.562394059884346	4.53508842630627	3.911522095357346	3.1148091191863214	3.103082384516726	2.654508996937124	2.3457567490817866	3.3340480488253723	4.071147381328983	7.785891090824412	7.889196177214876	8.008788525218419	7.835746753099102	8.314919696936258	7.406175998561698	6.783797022837969	6.3934276101711784	6.601695225460035	6.571501354561622	5.75357690973395	5.106937746798153	5.511296120159581	5.877621363371483	5.829122734995143	6.3043326032945	5.3472836877887095	5.190237242078875	4.786333805476581	5.932032739526791	2.801973008447516	6.6933741640165625	6.458030331652795	5.131332737451992	6.30826101722843	4.2525965174857	5.756813134248495	5.010598878887089	3.791326728592187	4.530203641381798	4.649726590144623	3.836471819664959	4.762349032680284	4.185805522599022	3.75594555567304	4.304584165659912	3.8618178280129096	3.773263541312342	3.7404769736891432	4.545779996594592	3.5527913195416865	4.018492868153881	4.135387346761286	3.3092105334701145	4.000755430035632	4.188130137743422	3.3066252277185746	3.611577828681329
Zci_12043	3.629601788573133	2.940091832296141	3.3297908747070077	2.4498524459700253	3.742298742618317	3.527360959282407	2.640942215030287	3.227597453835796	2.226452929541767	4.025055090772563	4.322188201393148	3.8445946145330496	4.596790044716375	3.8448465123958826	4.254541059201821	5.064081312438485	5.043194021962533	4.93622040613239	3.3951520837475546	2.4863592053105297	3.1320247857905197	1.8179222454000623	3.5103940440176724	2.4983128865755737	3.3326176341434	1.5918755481356246	3.115496290620253	2.235208087436193	3.5452857117466294	3.304363113565567	4.851836439306982	2.216285337778832	3.068647996433667	2.768667102671623	2.353398165793215	3.1116515463726517	2.3652221931975475	2.1893876372608516	3.036987034802729	3.2577284915209184	1.6090834944347083	4.766945052430399	2.470548319715084	2.730519022199863	2.1907032720300785	4.488686469856484	3.4965449943158036	4.024952302394557	3.1002591236163566	3.935213158404195	4.387658735234856	4.2458538322224975	3.801831174725815	2.492906594005214	3.9804264920704777	3.6495871330490783	4.3548534994787795	3.760780169055982	5.116573301152792	6.340827034442213	1.2656325736968592	1.0161501490781517	0.6759257114119649	2.14374814435197	2.389391473216502	2.6769773673424946	4.001264287853105	2.2205424110695597	2.079825932520311	3.594356792595257	1.5885085812818491	3.123059243843495	2.47726493007629	2.405993495772964	3.997611763937939	2.62776555568155	1.902270420849321	3.4106812647769393	3.182713210885364	2.88775169351821	2.5916589262454384	3.701504294116232	2.6874158144946785	3.317561214675392	3.7717310103096193	3.9324047281871537	3.219034065996561	2.6251904261940244	3.9030906371755703	2.422050825831123
Zci_12132	7.453354901213163	7.292022325873091	7.571624644723976	7.4428450930539505	7.584041486950861	7.835278843602407	7.734901680662722	7.874356084884981	8.12268180293197	7.982887159961415	7.954605940535165	8.337550553012157	7.835350962982619	8.228218368537904	8.417623340035274	7.59053661171177	7.482752910661069	7.667898182577043	7.622180409754857	6.8991413768082515	7.289604583502164	7.392882684086057	7.082612011469476	7.2717551937042995	7.293172792763468	7.309669123004093	7.419679685969989	7.312316482242211	7.445070142861739	7.201030949400265	7.828900380782299	7.217398086054878	7.225463039270293	7.139706954793459	7.659499484335585	7.45825878756961	7.288872912303457	7.352684880525892	6.909292241005043	7.337464168818961	7.718472917634496	7.398134384701064	9.836931876364234	9.780428204365249	10.1911267349546	10.29490918374658	10.370543930917089	10.308689237975097	9.562144192958526	9.603345513967938	9.929170722523592	9.552482365058792	9.327280100261431	8.90229486255975	9.217964501903392	9.791052028263096	9.607814661385568	8.297853844465926	8.992223517854681	8.568044448537341	8.4526817397726	8.913076041109322	7.871003483149081	9.26654051266248	9.15558181495076	8.669661397089614	10.020554814047864	8.072813000581	9.47414710449368	8.88992101415625	7.749695813848134	8.135321573603479	8.884479088870444	7.731981251667897	8.66201965915104	8.3837287838669	7.670365469148684	8.045444657463765	8.004857782479727	7.511079402504859	7.992349723705129	8.144896777423465	7.888003209194023	8.234363478171048	8.043741264114498	8.122930564064308	7.384936754741262	6.7222365012459475	7.637281891576727	6.966795750207172
Zci_12148	5.419666503425943	4.679540947161909	3.9613532595598815	4.510041307775511	3.862725601402543	4.741209222520242	3.875467282116032	3.76887684907149	3.6642691114174455	4.979006148722271	4.279371363708298	4.2904168655025545	4.94163283235171	5.160262073693691	4.012384967199244	5.333850546072719	5.025013901441273	5.100979583945818	4.84911612416719	4.16299530296793	5.437186907789416	4.285709417966925	3.97319248838713	3.326506882784928	4.789654922132091	4.144260952369699	4.628290543958022	4.840476412454763	4.2239290759809816	4.4201154955081545	5.906651949664354	2.6567374744439856	4.223428084508966	4.052977461956596	1.971121771759306	4.559805536386265	5.102846465277239	3.5290888391511124	3.851348057210576	5.145659732597501	3.650437391302865	4.831488503706221	9.059513642544315	9.278107675970311	9.605838380143732	10.05906007147473	10.537834018795635	10.771350274186863	10.978846277769868	11.160242627456183	11.114182163882164	10.67250047155143	10.628447790238276	10.406531389880598	10.865275584398717	10.596791216446071	10.714890700128148	10.318067862346515	10.310936591935976	10.457543590346273	5.914225324590752	7.612696656569546	4.562927212978806	8.705827608827972	8.770818899883364	7.063374322827658	11.068587332781584	9.940799159623662	11.696811317917131	10.321876904695753	9.095441678261576	9.889502453929907	11.057597024319977	8.714505265871916	10.143258752088247	11.345536173896482	8.900498132863861	9.478436126694383	10.888741600944613	8.61451679243487	9.485334686921629	10.501836379988957	9.469469654491323	9.59634377608182	10.005950334311215	8.800382075643093	8.970177492083652	7.987133111724403	8.464529454342962	7.604797447724988
Zci_12580	4.156659961979005	2.4592281734915673	3.7575470730368856	3.2387786722971392	1.641476680118913	3.5976931458936363	3.0609995014189013	2.7482764112280234	2.7428005095316945	2.7624190721167525	2.6896679079158345	3.161726084201445	3.71407415843212	2.7379872554065146	1.6896612395833477	1.395464537423362	2.2357933583774243	2.9665508268216154	3.4620184915277443	1.9148709663798864	3.385970295697892	3.152448965571075	2.9646219711181176	2.286148637446603	3.499500133320759	3.312093593658943	4.2625292812819024	2.8507170263026023	4.3949295317923305	3.359926139231072	3.3213851392794886	2.783388282618755	3.6723434163013375	3.798168355871392	2.5966073683246624	3.166519429780283	1.830655086736167	2.1341537954926335	3.2138006291983157	3.8551929502538016	3.003836885321783	3.8874909432123586	11.013627573642808	10.72261690388418	11.333375789133871	10.971041479069273	11.213252081166292	10.724185986986866	9.69667303741306	9.174573571246972	9.812652214660126	9.387526835469286	8.760256160576683	7.617698674489428	8.329009169012373	8.938217346988738	8.20769873028676	7.503658333576056	7.230137977309854	8.323673611395238	6.893908089171806	8.890279533790086	5.253824297769473	9.93078798737812	9.424565355829104	7.806925909768012	9.47414710449368	6.549481827812614	8.166067516708255	8.066076698425613	5.884736384623472	6.979385197431725	7.020605460241838	5.582219309461727	7.009262695051147	6.546964140695018	6.311952704428213	6.308037646751355	6.0165051487595695	5.563446492582128	6.194483920525421	6.2368417802769	5.739260894153857	5.820819653063113	6.446733339805549	4.6335044081955115	5.667395314030667	3.4245130858333344	4.089138329831543	3.4173722600108603
Zci_13912	3.91168154474082	3.6062483307377953	3.975363202236859	3.354656993777239	4.031089005418976	3.4506519854051017	2.5247946147060474	3.0627695328066453	3.1800859078438464	2.8891606891712884	3.01440480794281	2.2059208090608444	2.7158631524361723	3.560346982797694	2.298391665514274	3.3318635244032575	4.173600397729077	4.1643988251792905	2.975121274238879	2.700507839646051	3.4457044909799306	2.9701657077824666	3.2152697442378275	2.8106391887507898	3.664333387888828	2.850795795272835	2.7432812882493756	2.703336343244493	2.7251720705863325	3.1097021000910132	3.251573162522207	3.2431203526185013	3.3258380600734236	3.307361108093905	3.548802776363401	3.2286134267369326	3.0520623407939658	3.33888496945754	2.7675666247038224	3.525226615741894	4.368759282868455	3.2658452688684165	6.336421845731605	6.429370429074425	6.884064426110629	6.254362949181164	6.848770065777097	6.312725922052529	5.7347137377556185	5.345226682255552	5.38203870574956	5.781433962478414	5.155692410468485	4.578887336065793	5.680215757528489	5.283212321223504	5.382908528886347	4.645073559743259	4.0046848445335845	4.968779862546032	5.0595075718892	5.317704137821894	3.906302692748056	5.771987276675707	5.958857306111635	4.620913623379603	5.520283414239328	4.028319494156305	5.230166325522515	5.015842188527715	4.00442689544379	4.109093550956652	4.9698657406694355	4.366079552453186	4.7917823291195685	4.605696309449778	3.985457580925768	4.272270546415563	3.827514895834226	3.9035418494768015	3.5189869659373194	3.78885569573129	3.762302155700344	4.094192879532701	3.645681576112254	3.537250790142364	2.996545635360851	2.5421385927938593	3.294845958799883	2.274950557571446
Zci_14241	2.6882881275104817	2.2191779538039578	2.537814117216012	2.0047550347208483	3.0797620161353105	2.3559565750969917	0.7115561460348353	1.3477587019555533	0.699058852503625	3.02920969095224	1.9495229939034355	1.6906995584711442	3.574343459829822	2.778853428751912	2.0875948301901257	1.538769444202987	2.53938993232423	2.1917458481193077	2.347134591705355	1.6358796084744038	2.988396669832986	1.9934334338475497	1.903099023032471	2.0284966139379743	2.385361004030039	1.4915179114569572	2.7935375957159088	2.2421346989965865	4.23232360923614	2.3283138824116527	4.994617218040414	2.3112154180891396	2.5626777480212817	0.9316868697469226	-0.1819876278705123	2.4852287762312324	2.537331199597404	1.7031799036566388	2.090572779565027	3.176232941657541	1.5742687441592709	3.970636502781696	1.9552967184650207	2.154850798187438	1.4610393900208904	3.707200582720123	2.218425702964984	1.7458940112359336	2.3555172388372636	3.03306233593414	1.7694262127095857	3.567048679815004	3.7735017852063337	3.259026837753144	3.37963764505674	4.306989003212214	4.465755819792157	6.012967693908742	6.6018483449682765	4.878435869962338	-0.6011184009734333	1.175569797117897	-0.06353626617535477	2.099529605455728	1.2070174931026074	2.5098631301451637	3.021515822576705	1.4557379861403976	1.7669492024816849	3.4659655601742485	1.51136454365098	0.13949455240072978	1.8795918822362951	2.309069272324344	2.9766655288477986	1.6864994663089463	2.1726135718449884	2.261468091240788	2.6356924761591425	2.925260600488839	1.8402936125051204	2.549752201128597	2.4351788422332454	2.7324014653599167	2.304765690615454	3.357011947924468	1.5270579640041404	1.9428817972476784	3.1171017736102087	1.511669286028796
Zci_14544	4.228582368318569	2.399263520156152	3.635051130910195	3.412581541083786	3.070015445093947	3.8647643590447815	2.951723364254927	3.194118921633239	2.895921636761529	2.099849960467935	2.7436977359845547	1.848403054641987	2.0645116047537577	2.963331916384576	2.0741275492506324	2.852410118934774	2.2151870793810517	1.964458864877327	2.978705993933796	2.260976076741626	3.3700895952516827	3.294926866835735	2.50875484577052	2.5463402233258514	3.384225529062072	2.3764978298419206	3.6375304462181526	3.645123232301017	3.2466947398264474	3.1976087441427934	3.6460648600630328	2.8880133773428476	3.6769820171263174	2.833398163236185	3.0151737763387056	3.252439415435951	2.8995170077690515	1.934174416741044	2.823581461375152	3.781002911184963	3.254649191588221	3.9446099382542017	10.734648783796446	10.400250066869638	11.034416119847116	10.65648441738221	10.587066042259956	10.359067757412095	9.353533944679244	8.455925164029376	9.603345513967938	9.154424359610964	8.301382128578233	7.42138136876778	7.543985389899835	8.567536665378533	8.39285537720261	7.522171709710793	7.666395734276452	8.209789463066356	7.141948365670783	8.57010970074122	4.940668479694487	9.518479980427438	9.045993949098689	7.600939150790766	9.03964124655088	5.716418370939925	7.711247099841554	7.617297053453208	5.5561768021647895	6.686935113316899	6.5850427835563785	5.716263766239379	6.546527189137809	6.18181403964369	4.93627100137047	5.84713439275381	5.766975858953015	5.05925701870638	5.5086093777931096	5.946607718661078	4.750014681919535	5.991656300186566	6.077138497518602	4.450841774997347	5.0050634622417745	4.578686337988815	3.898926040815182	3.5557834248023226
Zci_14561	2.8670800987901233	2.046297490663381	1.0084953744316028	2.088690612284718	1.2873347034109717	2.4102677949570546	1.8427093643597925	1.6114219514185666	1.1559636346267	2.2168777177163914	2.9249924322694527	1.960308890800426	2.506367436709819	1.7360590048446491	2.3249117234346053	2.8980862711077857	1.8493588189796233	1.4039709738639656	2.526428736032737	2.2010964846965986	2.7417835936503185	2.2010964846965986	2.38774372932526	0.3208014535161801	2.723439292904824	1.8278059170274277	1.4692631900623936	2.658821323647676	2.033310399646409	2.670649707614816	3.2685198101478017	1.1622254053652374	1.4632270179176186	2.1167723035547574	1.7388405700675942	1.8722397808322224	2.293129733959378	1.1915455207774552	1.2521406463685645	2.41010110925753	2.126337313114511	1.4888212985702314	4.5964193689159885	4.202501923720396	5.521128953122721	4.796528712896883	4.512691733733649	4.949032101590957	5.023387562155125	4.713834781639684	3.9039547791104554	4.417752168040585	4.3796391961291885	4.056907275514244	5.521584865973296	4.449753219187031	4.4989602482091655	5.0582720128823535	4.246333323499481	4.358762646978334	4.701294596791696	4.073163698494293	3.713111967148196	5.857507557463409	5.315854603426435	4.443942481652725	5.318327461703978	3.392187474508963	4.973972240582537	4.444780254109214	3.123059243843495	4.122894667738602	4.584951852777505	2.9713958277490606	4.361411478014947	4.090400882302274	3.1535370169948576	3.771448350817357	3.9337342029748585	2.4175682894159203	3.5381104343739636	3.5760756172756407	3.1361373529360854	2.9257084140443372	2.5562138831401335	2.333226360299753	2.6306346997356123	2.0616486406588455	2.415837446261493	1.9132244567250432
Zci_15598	4.799689305097245	4.70164689276704	4.647587823691208	4.695696807076947	4.6100090025682565	5.14864014547502	4.839573644973323	4.850230253746864	4.726951381932262	5.259540054566637	4.843271248774911	5.1650824752251685	5.0875386570557755	5.233569784176157	5.123589710172679	5.092758611214237	5.335828465532354	5.258074036364041	5.059726470921919	4.035538075413958	5.617711639927937	4.799656364708922	4.890628969109683	4.397915831583582	5.012289903667018	4.498476068593293	5.035297317135157	5.147104145520342	4.996335342717164	4.018535188838048	5.621759458515669	3.9412198543690415	5.16118017268047	4.85564301139313	3.437024757940244	4.787187962074865	4.236455516707153	4.2825794158717265	4.8883380390814235	5.7425749093127925	4.552839337636232	4.293834232802457	8.545748041169043	8.668573694978361	9.063504675202456	8.658285943826966	9.148232963435971	8.958253266953479	7.830447547969711	7.875289636848567	8.059830040100914	7.676013593651226	7.526861421207246	7.081317818892519	7.726097268575364	7.880893351224547	7.672737970161796	6.196459097249253	6.513962905164999	7.2340385542798336	5.916746168922939	6.7732039105970205	5.357809688999478	7.492476850166036	7.463063796053742	6.409586289518108	7.695330981946992	5.976671591522262	7.5273216332585635	7.222061789019598	5.825766317380535	5.970474598931406	6.563515174278964	5.6968889451158224	6.7045681975784515	6.76373300095458	5.792756684414642	5.821955826202892	6.09962813785642	5.6427676793402215	5.660768565315943	6.360800393500348	5.94489874706897	6.115715149418451	6.119828724545572	5.932200145396933	5.1095361868668725	4.0128301989371415	5.5642387740597865	4.230367467696749
Zci_16304	6.6574861524421545	7.0948412243074985	7.417244003296696	6.311904871786617	7.439824122487592	7.985028385703323	6.232243291090764	7.076734550823873	6.54684688352065	6.728261004016776	8.302430078213154	7.6617622663481715	7.350392047652684	7.5463820510772095	7.702284528869778	6.87971807104408	7.782695860958547	8.059155567145364	7.191123319947598	6.367492631052885	6.5777483688718394	7.104175016679926	7.989149164520274	6.836038278229632	6.887154009865993	7.364747545209587	8.107171400031996	7.157631244108466	8.178875613650975	6.992673819266961	8.453407693047485	6.432667715611858	7.455506722764774	5.983975337390672	3.5181915560186248	8.210626358922552	6.145692741523733	6.040571033287923	7.509185205097776	6.873857903851301	4.943195742681761	8.99675743317284	6.231276147736749	7.276410602590219	6.820089269843693	7.922247436947426	7.344476493189731	7.913922049789813	6.6973450660986	7.4351902025062575	8.077731988381831	8.036549069465773	8.165780819946317	7.818409531309426	8.052764501533703	8.754268028651705	8.967151024781138	9.22013720919762	9.704745135580126	9.49084321593412	4.196822187547803	3.59785087804093	6.150732907820707	6.002771755566993	6.188370458368912	6.860393650110022	7.486006852760717	6.304155870470424	5.566242205085771	7.393782226127067	6.486308686524592	6.8068814796892445	7.379260456890251	7.0957529721430594	7.685148587590679	6.617357455008495	6.958410262867008	7.232576888314539	6.694229190631003	7.012450166334568	7.068354701086259	7.016374477066615	7.009412043349428	7.336174047848784	6.632534352266269	7.769100404802198	6.873024611405846	5.493815978716203	7.649685038713974	6.6157575684039545
Zci_16320	6.6574861524421545	7.0948412243074985	7.417244003296696	6.311904871786617	7.439824122487592	7.985028385703323	6.232243291090764	7.076734550823873	6.54684688352065	6.728261004016776	8.302430078213154	7.6617622663481715	7.350392047652684	7.5463820510772095	7.702284528869778	6.87971807104408	7.782695860958547	8.059155567145364	7.191123319947598	6.367492631052885	6.5777483688718394	7.104175016679926	7.989149164520274	6.836038278229632	6.887154009865993	7.364747545209587	8.107171400031996	7.157631244108466	8.178875613650975	6.992673819266961	8.453407693047485	6.432667715611858	7.455506722764774	5.983975337390672	3.5181915560186248	8.210626358922552	6.145692741523733	6.040571033287923	7.509185205097776	6.873857903851301	4.943195742681761	8.99675743317284	6.231276147736749	7.276410602590219	6.820089269843693	7.922247436947426	7.344476493189731	7.913922049789813	6.6973450660986	7.4351902025062575	8.077731988381831	8.036549069465773	8.165780819946317	7.818409531309426	8.052764501533703	8.754268028651705	8.967151024781138	9.22013720919762	9.704745135580126	9.49084321593412	4.196822187547803	3.59785087804093	6.150732907820707	6.002771755566993	6.188370458368912	6.860393650110022	7.486006852760717	6.304155870470424	5.566242205085771	7.393782226127067	6.486308686524592	6.8068814796892445	7.379260456890251	7.0957529721430594	7.685148587590679	6.617357455008495	6.958410262867008	7.232576888314539	6.694229190631003	7.012450166334568	7.068354701086259	7.016374477066615	7.009412043349428	7.336174047848784	6.632534352266269	7.769100404802198	6.873024611405846	5.493815978716203	7.649685038713974	6.6157575684039545
Zci_16335	8.705736494715365	8.999550151376209	9.170940848539429	8.247858716273436	9.43593211294952	9.884205028538805	8.169989295705303	9.34824536186604	8.400584535283096	8.744541284921649	10.173596028951811	9.551225063032916	9.315828941395656	9.57782621857451	9.698111310264034	8.648337502721724	9.64707140191524	9.969761284878	9.198369798326777	8.121905973879388	8.591355245315365	9.108910567452975	10.042155325942993	8.5558874442339	8.91152598343562	9.211254324698762	9.881779523665426	9.0989357542268	10.14088683082086	8.84625977359137	10.4110698105367	8.310647238439294	9.224343816120887	8.087445681827651	5.862725897057637	10.147179572641551	8.0847384076886	8.096240465466119	9.540141325094469	8.746480368711518	6.794015193000002	10.902580651271434	8.012165345407055	9.063504675202456	8.719123230936422	9.88154183048912	9.05598799252347	9.707496958369315	8.455925164029376	9.27721243866674	9.895270740627907	9.951340079714864	9.963203673791162	9.552482365058792	9.951098354322625	10.504989064436996	10.895425770242303	11.240974754821782	11.91864263970496	11.209332063549704	6.367031885688263	5.140027593696548	8.12363269880519	8.008949969640689	7.955864209052688	8.932418673076478	9.560073183125734	8.151630076676057	7.501315807376307	9.404699688594969	8.469644054272916	8.651856039551323	9.13912359166314	8.833818379817313	9.769675400414457	8.36404457222478	8.974147728955927	9.40051259793572	8.429869350688627	8.943463821713113	9.059147937592693	8.854581797869313	8.96081980953829	9.374101867655527	8.59993463133273	9.7964572225541	8.71416949104717	7.507752682985201	9.78308130670198	8.779184778890606
Zci_16349	6.6574861524421545	7.0948412243074985	7.417244003296696	6.311904871786617	7.439824122487592	7.985028385703323	6.232243291090764	7.076734550823873	6.54684688352065	6.728261004016776	8.302430078213154	7.6617622663481715	7.350392047652684	7.5463820510772095	7.702284528869778	6.87971807104408	7.782695860958547	8.059155567145364	7.191123319947598	6.367492631052885	6.5777483688718394	7.104175016679926	7.989149164520274	6.836038278229632	6.887154009865993	7.364747545209587	8.107171400031996	7.157631244108466	8.178875613650975	6.992673819266961	8.453407693047485	6.432667715611858	7.455506722764774	5.983975337390672	3.5181915560186248	8.210626358922552	6.145692741523733	6.040571033287923	7.509185205097776	6.873857903851301	4.943195742681761	8.99675743317284	6.231276147736749	7.276410602590219	6.820089269843693	7.922247436947426	7.344476493189731	7.913922049789813	6.6973450660986	7.4351902025062575	8.077731988381831	8.036549069465773	8.165780819946317	7.818409531309426	8.052764501533703	8.754268028651705	8.967151024781138	9.22013720919762	9.704745135580126	9.49084321593412	4.196822187547803	3.59785087804093	6.150732907820707	6.002771755566993	6.188370458368912	6.860393650110022	7.486006852760717	6.304155870470424	5.566242205085771	7.393782226127067	6.486308686524592	6.8068814796892445	7.379260456890251	7.0957529721430594	7.685148587590679	6.617357455008495	6.958410262867008	7.232576888314539	6.694229190631003	7.012450166334568	7.068354701086259	7.016374477066615	7.009412043349428	7.336174047848784	6.632534352266269	7.769100404802198	6.873024611405846	5.493815978716203	7.649685038713974	6.6157575684039545
Zci_16369	6.6574861524421545	7.0948412243074985	7.417244003296696	6.311904871786617	7.439824122487592	7.985028385703323	6.232243291090764	7.076734550823873	6.54684688352065	6.728261004016776	8.302430078213154	7.6617622663481715	7.350392047652684	7.5463820510772095	7.702284528869778	6.87971807104408	7.782695860958547	8.059155567145364	7.191123319947598	6.367492631052885	6.5777483688718394	7.104175016679926	7.989149164520274	6.836038278229632	6.887154009865993	7.364747545209587	8.107171400031996	7.157631244108466	8.178875613650975	6.992673819266961	8.453407693047485	6.432667715611858	7.455506722764774	5.983975337390672	3.5181915560186248	8.210626358922552	6.145692741523733	6.040571033287923	7.509185205097776	6.873857903851301	4.943195742681761	8.99675743317284	6.231276147736749	7.276410602590219	6.820089269843693	7.922247436947426	7.344476493189731	7.913922049789813	6.6973450660986	7.4351902025062575	8.077731988381831	8.036549069465773	8.165780819946317	7.818409531309426	8.052764501533703	8.754268028651705	8.967151024781138	9.22013720919762	9.704745135580126	9.49084321593412	4.196822187547803	3.59785087804093	6.150732907820707	6.002771755566993	6.188370458368912	6.860393650110022	7.486006852760717	6.304155870470424	5.566242205085771	7.393782226127067	6.486308686524592	6.8068814796892445	7.379260456890251	7.0957529721430594	7.685148587590679	6.617357455008495	6.958410262867008	7.232576888314539	6.694229190631003	7.012450166334568	7.068354701086259	7.016374477066615	7.009412043349428	7.336174047848784	6.632534352266269	7.769100404802198	6.873024611405846	5.493815978716203	7.649685038713974	6.6157575684039545
Zci_16615	-4.717217952488101	-1.561172767827679	-0.7320125691812897	-3.468429045618964	-1.9936009885329269	-1.2557451964374842	0.2890284041190517	-1.5239726292854705	-4.3246575400401275	-0.1190713579738478	-3.0785052757529416	-1.5917576306347885	-3.145577684614623	-0.6030554037066865	-0.7300351102212937	-0.21880096602460025	-0.34138033686772296	-2.4286038197935373	-1.4308551327731265	-0.9489024740546436	-4.456940065693786	-2.7036408853694347	-4.412848862964074	-2.2597004583312157	-1.614514966429188	-4.343714257622302	-2.2076376816056116	-1.2596801580973038	-1.0809213265450368	-1.2721895063326576	-1.2131212844752135	-2.120570908893077	-3.625209260850084	-1.904254338556733	-0.1819876278705123	-1.5804241882900685	-3.283170286646391	-3.12511244831425	-3.650647865317531	-2.2379727890983956	-0.7355390750420924	0.1098278195966878	4.541530816488215	4.946887637948519	4.692922360804092	5.262138593201367	5.464075860012102	4.121422803247934	3.2251119594769024	2.8981579234672488	3.473127391061189	3.600694857201922	2.4993320433203396	1.7207315809709218	1.0812303504322465	3.7176279417937583	2.2081741391606657	2.1950477013120215	1.811611431358648	2.499344432825633	0.7084024937456065	2.642906154344657	-0.6486042345675804	2.5295920123067557	1.983599538396002	0.17466555164208897	2.9793818914953794	0.4991863518148344	2.480736945244105	1.554423293918152	0.03894594702494106	1.129920515931001	1.521880122418375	-0.18976367056619065	0.7071569744666817	1.0226474398266017	-0.8761309531311275	-0.7866498661170684	0.2234631346579164	-0.15962910086328028	-1.078880812024534	0.929501790463611	-0.4086387593323776	-1.2393090722844384	0.0178539747494831	-1.8454505973259163	-1.5516668478448157	1.3606490171892618	-4.115917831779985	-2.865615813375887
