0.9095966620305981	0.9604628736740598	0.9114238410596026	0.910303928836175	0.8531571218795888	0.9429429429429429	0.891996891996892	0.9922048997772829	0.9988518943742825	0.9702643171806168
0.9230019493177388	0.9153439153439153	0.9323308270676691	0.9543094496365524	0.959280303030303	0.9632867132867133	0.9463894967177243	0.9792147806004619	0.9723618090452262	0.980561555075594
0.8642857142857143	0.959070796460177	0.9584438549955792	0.8788898233809924	0.8779527559055118	0.9509132420091324	0.9417077175697866	0.9854689564068693	0.9972714870395635	0.9847328244274809
0.9894859813084113	0.9919354838709677	0.9765886287625418	0.9690860215053764	0.9650602409638555	0.9738372093023255	0.9521739130434783	0.99	1	0.9779735682819384
0.9001029866117405	0.9660107334525939	0.9497422680412371	0.9293598233995585	0.93158953722334	0.9779411764705882	0.9835345773874863	0.9824120603015075	1	0.9788732394366197
0.9418084153983886	0.9838472834067548	0.9689234184239733	0.9277942631058358	0.8604651162790697	0.9465408805031447	0.9267285861713106	0.9883040935672515	1	0.9776536312849162
0.9461928934010152	0.967984934086629	0.9448924731182796	0.9508928571428571	0.9648946840521565	0.97265625	0.9217809867629362	0.9669421487603306	0.9667673716012084	0.9798488664987406
0.9292452830188679	0.9338842975206612	0.9057071960297767	0.9331275720164609	0.9689497716894977	0.9702479338842975	0.936830835117773	0.971677559912854	0.9766899766899767	0.9858585858585859
0.9729458917835672	0.9691714836223507	0.9157303370786517	0.9501698754246886	0.9830339321357285	0.974	0.89625	0.9802816901408451	0.9782608695652174	0.9656992084432717
0.9605425400739828	0.9525222551928784	0.9685314685314685	0.9780521262002744	0.9927797833935018	0.9877675840978594	0.9869942196531792	0.994413407821229	1	0.9855072463768116
1	1	0.9979633401221996	0.9968992248062015	0.9986449864498645	0.9956896551724138	0.9966722129783694	1	1	1
