Pp3c10_10240V3
Pp3c10_11390V3
Pp3c10_11910V3
Pp3c10_12000V3
Pp3c10_1220V3
Pp3c10_12410V3
Pp3c10_12470V3
Pp3c10_12560V3
Pp3c10_13030V3
Pp3c10_13060V3
Pp3c10_13640V3
Pp3c10_13800V3
Pp3c10_14310V3
Pp3c10_15710V3
Pp3c10_15950V3
Pp3c10_16040V3
Pp3c10_16180V3
Pp3c10_16280V3
Pp3c10_16370V3
Pp3c10_16720V3
Pp3c10_17500V3
Pp3c10_17630V3
Pp3c10_17870V3
Pp3c10_1790V3
Pp3c10_18160V3
Pp3c10_19020V3
Pp3c10_19320V3
Pp3c10_19380V3
Pp3c10_19630V3
Pp3c10_20000V3
Pp3c10_20400V3
Pp3c10_20840V3
Pp3c10_20940V3
Pp3c10_20941V3
Pp3c10_21500V3
Pp3c10_21520V3
Pp3c10_22120V3
Pp3c10_22250V3
Pp3c10_22480V3
Pp3c10_22600V3
Pp3c10_2280V3
Pp3c10_22840V3
Pp3c10_22842V3
Pp3c10_22950V3
Pp3c10_2450V3
Pp3c10_24540V3
Pp3c10_24550V3
Pp3c10_25160V3
Pp3c10_25350V3
Pp3c10_25720V3
Pp3c10_2910V3
Pp3c10_3440V3
Pp3c10_3720V3
Pp3c10_3860V3
Pp3c10_4090V3
Pp3c10_4280V3
Pp3c10_4790V3
Pp3c10_5380V3
Pp3c10_6570V3
Pp3c10_6600V3
Pp3c10_6710V3
Pp3c10_6780V3
Pp3c10_680V3
Pp3c10_7030V3
Pp3c10_7310V3
Pp3c10_8330V3
Pp3c10_9060V3
Pp3c10_9370V3
Pp3c10_9790V3
Pp3c11_10350V3
Pp3c11_10660V3
Pp3c11_11230V3
Pp3c11_11510V3
Pp3c11_11910V3
Pp3c11_11920V3
Pp3c11_12310V3
Pp3c11_12590V3
Pp3c11_12600V3
Pp3c11_12640V3
Pp3c11_12900V3
Pp3c11_13030V3
Pp3c11_13480V3
Pp3c11_13860V3
Pp3c11_13880V3
Pp3c11_14240V3
Pp3c11_14690V3
Pp3c11_14960V3
Pp3c11_14980V3
Pp3c11_15070V3
Pp3c11_15260V3
Pp3c11_15370V3
Pp3c11_15840V3
Pp3c11_16400V3
Pp3c11_17010V3
Pp3c11_17150V3
Pp3c11_17170V3
Pp3c11_17580V3
Pp3c11_17710V3
Pp3c11_1790V3
Pp3c11_18190V3
Pp3c11_18210V3
Pp3c11_18220V3
Pp3c11_18330V3
Pp3c11_18380V3
Pp3c11_1840V3
Pp3c11_18610V3
Pp3c11_18760V3
Pp3c11_18790V3
Pp3c11_18810V3
Pp3c11_18840V3
Pp3c11_18940V3
Pp3c11_19280V3
Pp3c11_20170V3
Pp3c11_20430V3
Pp3c11_20550V3
Pp3c11_20560V3
Pp3c11_20840V3
Pp3c11_20880V3
Pp3c11_21140V3
Pp3c11_21360V3
Pp3c11_21510V3
Pp3c11_21650V3
Pp3c11_21670V3
Pp3c11_21750V3
Pp3c11_21830V3
Pp3c11_21940V3
Pp3c11_21970V3
Pp3c11_22370V3
Pp3c11_22390V3
Pp3c11_2240V3
Pp3c11_22570V3
Pp3c11_22580V3
Pp3c11_22980V3
Pp3c11_22990V3
Pp3c11_23000V3
Pp3c11_23240V3
Pp3c11_23290V3
Pp3c11_23320V3
Pp3c11_23370V3
Pp3c11_23440V3
Pp3c11_2350V3
Pp3c11_23530V3
Pp3c11_23540V3
Pp3c11_23542V3
Pp3c11_23580V3
Pp3c11_23660V3
Pp3c11_23740V3
Pp3c11_23910V3
Pp3c11_23930V3
Pp3c11_24520V3
Pp3c11_24630V3
Pp3c11_24680V3
Pp3c11_24880V3
Pp3c11_24910V3
Pp3c11_25160V3
Pp3c11_25660V3
Pp3c11_25720V3
Pp3c11_2650V3
Pp3c11_26670V3
Pp3c11_26820V3
Pp3c11_2770V3
Pp3c11_2960V3
Pp3c11_3110V3
Pp3c11_3780V3
Pp3c11_3960V3
Pp3c11_480V3
Pp3c11_4840V3
Pp3c11_500V3
Pp3c11_510V3
Pp3c11_5280V3
Pp3c11_5410V3
Pp3c11_5420V3
Pp3c11_5850V3
Pp3c11_6370V3
Pp3c11_7140V3
Pp3c11_7230V3
Pp3c11_7250V3
Pp3c11_8090V3
Pp3c11_840V3
Pp3c11_8520V3
Pp3c11_8530V3
Pp3c11_8780V3
Pp3c11_8790V3
Pp3c12_10330V3
Pp3c12_10360V3
Pp3c12_10790V3
Pp3c12_10900V3
Pp3c12_10V3
Pp3c12_11150V3
Pp3c12_12460V3
Pp3c12_12690V3
Pp3c12_13020V3
Pp3c12_1320V3
Pp3c12_13250V3
Pp3c12_13280V3
Pp3c12_13600V3
Pp3c12_13650V3
Pp3c12_14300V3
Pp3c12_14370V3
Pp3c12_14410V3
Pp3c12_14420V3
Pp3c12_14690V3
Pp3c12_14900V3
Pp3c12_15190V3
Pp3c12_15970V3
Pp3c12_16100V3
Pp3c12_1610V3
Pp3c12_16950V3
Pp3c12_17180V3
Pp3c12_17240V3
Pp3c12_17450V3
Pp3c12_17560V3
Pp3c12_17730V3
Pp3c12_18020V3
Pp3c12_18510V3
Pp3c12_18930V3
Pp3c12_18938V3
Pp3c12_2070V3
Pp3c12_21290V3
Pp3c12_21300V3
Pp3c12_21500V3
Pp3c12_21590V3
Pp3c12_21760V3
Pp3c12_21830V3
Pp3c12_22270V3
Pp3c12_22390V3
Pp3c12_22500V3
Pp3c12_22800V3
Pp3c12_22890V3
Pp3c12_23330V3
Pp3c12_23740V3
Pp3c12_24350V3
Pp3c12_25060V3
Pp3c12_25330V3
Pp3c12_25750V3
Pp3c12_25990V3
Pp3c12_280V3
Pp3c12_3460V3
Pp3c12_3580V3
Pp3c12_3720V3
Pp3c12_4260V3
Pp3c12_4290V3
Pp3c12_4630V3
Pp3c12_4860V3
Pp3c12_5100V3
Pp3c12_5150V3
Pp3c12_5930V3
Pp3c12_5931V3
Pp3c12_7090V3
Pp3c12_8190V3
Pp3c12_870V3
Pp3c12_9400V3
Pp3c12_9430V3
Pp3c13_1060V3
Pp3c13_10800V3
Pp3c13_10830V3
Pp3c13_11550V3
Pp3c13_12060V3
Pp3c13_12620V3
Pp3c13_13090V3
Pp3c13_1310V3
Pp3c13_13130V3
Pp3c13_13210V3
Pp3c13_13320V3
Pp3c13_13930V3
Pp3c13_14120V3
Pp3c13_14180V3
Pp3c13_1440V3
Pp3c13_14440V3
Pp3c13_14680V3
Pp3c13_15010V3
Pp3c13_15030V3
Pp3c13_15090V3
Pp3c13_15520V3
Pp3c13_16160V3
Pp3c13_19170V3
Pp3c13_19440V3
Pp3c13_19680V3
Pp3c13_19810V3
Pp3c13_2000V3
Pp3c13_20600V3
Pp3c13_20650V3
Pp3c13_20770V3
Pp3c13_2080V3
Pp3c13_21190V3
Pp3c13_21340V3
Pp3c13_21390V3
Pp3c13_21530V3
Pp3c13_21910V3
Pp3c13_22280V3
Pp3c13_22410V3
Pp3c13_22780V3
Pp3c13_2290V3
Pp3c13_23370V3
Pp3c13_23373V3
Pp3c13_23440V3
Pp3c13_23600V3
Pp3c13_24020V3
Pp3c13_24240V3
Pp3c13_24380V3
Pp3c13_24550V3
Pp3c13_24590V3
Pp3c13_2780V3
Pp3c13_3710V3
Pp3c13_3830V3
Pp3c13_4270V3
Pp3c13_4470V3
Pp3c13_4600V3
Pp3c13_4720V3
Pp3c13_4760V3
Pp3c13_5000V3
Pp3c13_5070V3
Pp3c13_5760V3
Pp3c13_6210V3
Pp3c13_6470V3
Pp3c13_6760V3
Pp3c13_7150V3
Pp3c13_7380V3
Pp3c13_7440V3
Pp3c13_7700V3
Pp3c13_8050V3
Pp3c13_8290V3
Pp3c13_8760V3
Pp3c13_8880V3
Pp3c13_9170V3
Pp3c13_9880V3
Pp3c14_10320V3
Pp3c14_10960V3
Pp3c14_11190V3
Pp3c14_11320V3
Pp3c14_11620V3
Pp3c14_11960V3
Pp3c14_12200V3
Pp3c14_12310V3
Pp3c14_12390V3
Pp3c14_13110V3
Pp3c14_13400V3
Pp3c14_14030V3
Pp3c14_14040V3
Pp3c14_14460V3
Pp3c14_14900V3
Pp3c14_15890V3
Pp3c14_15980V3
Pp3c14_16050V3
Pp3c14_16170V3
Pp3c14_16620V3
Pp3c14_16890V3
Pp3c14_16990V3
Pp3c14_17020V3
Pp3c14_17210V3
Pp3c14_17330V3
Pp3c14_17810V3
Pp3c14_18250V3
Pp3c14_18810V3
Pp3c14_18840V3
Pp3c14_18960V3
Pp3c14_19250V3
Pp3c14_19410V3
Pp3c14_19470V3
Pp3c14_19990V3
Pp3c14_20020V3
Pp3c14_20090V3
Pp3c14_20620V3
Pp3c14_20740V3
Pp3c14_20800V3
Pp3c14_20850V3
Pp3c14_21120V3
Pp3c14_21500V3
Pp3c14_21560V3
Pp3c14_21620V3
Pp3c14_21680V3
Pp3c14_21750V3
Pp3c14_21766V3
Pp3c14_22150V3
Pp3c14_22180V3
Pp3c14_22210V3
Pp3c14_22330V3
Pp3c14_22334V3
Pp3c14_22340V3
Pp3c14_22560V3
Pp3c14_22690V3
Pp3c14_23220V3
Pp3c14_23300V3
Pp3c14_23340V3
Pp3c14_23520V3
Pp3c14_24020V3
Pp3c14_24040V3
Pp3c14_24070V3
Pp3c14_24090V3
Pp3c14_24190V3
Pp3c14_24440V3
Pp3c14_2481V3
Pp3c14_2500V3
Pp3c14_25560V3
Pp3c14_25570V3
Pp3c14_26270V3
Pp3c14_2650V3
Pp3c14_26560V3
Pp3c14_2780V3
Pp3c14_3280V3
Pp3c14_3310V3
Pp3c14_4440V3
Pp3c14_4880V3
Pp3c14_4980V3
Pp3c14_5270V3
Pp3c14_5700V3
Pp3c14_5930V3
Pp3c14_6480V3
Pp3c14_6810V3
Pp3c14_7060V3
Pp3c14_8280V3
Pp3c14_8460V3
Pp3c14_8650V3
Pp3c14_90V3
Pp3c14_9100V3
Pp3c14_9940V3
Pp3c15_10000V3
Pp3c15_1000V3
Pp3c15_11610V3
Pp3c15_11620V3
Pp3c15_11880V3
Pp3c15_11920V3
Pp3c15_12290V3
Pp3c15_12420V3
Pp3c15_12580V3
Pp3c15_12700V3
Pp3c15_1270V3
Pp3c15_12800V3
Pp3c15_13310V3
Pp3c15_13490V3
Pp3c15_1350V3
Pp3c15_13960V3
Pp3c15_14600V3
Pp3c15_1470V3
Pp3c15_14880V3
Pp3c15_15020V3
Pp3c15_15960V3
Pp3c15_1680V3
Pp3c15_17600V3
Pp3c15_17620V3
Pp3c15_17790V3
Pp3c15_1800V3
Pp3c15_18060V3
Pp3c15_18140V3
Pp3c15_18260V3
Pp3c15_18270V3
Pp3c15_18560V3
Pp3c15_19200V3
Pp3c15_19246V3
Pp3c15_19270V3
Pp3c15_1990V3
Pp3c15_19980V3
Pp3c15_20000V3
Pp3c15_21200V3
Pp3c15_21310V3
Pp3c15_21350V3
Pp3c15_21590V3
Pp3c15_21700V3
Pp3c15_21740V3
Pp3c15_21830V3
Pp3c15_21840V3
Pp3c15_22780V3
Pp3c15_23090V3
Pp3c15_23110V3
Pp3c15_23190V3
Pp3c15_23310V3
Pp3c15_23450V3
Pp3c15_23590V3
Pp3c15_24030V3
Pp3c15_24050V3
Pp3c15_24080V3
Pp3c15_2410V3
Pp3c15_24240V3
Pp3c15_24310V3
Pp3c15_24790V3
Pp3c15_24980V3
Pp3c15_25070V3
Pp3c15_25740V3
Pp3c15_2800V3
Pp3c15_3180V3
Pp3c15_3360V3
Pp3c15_3440V3
Pp3c15_3450V3
Pp3c15_3620V3
Pp3c15_3710V3
Pp3c15_4190V3
Pp3c15_4400V3
Pp3c15_4480V3
Pp3c15_4760V3
Pp3c15_4770V3
Pp3c15_4950V3
Pp3c15_5070V3
Pp3c15_5200V3
Pp3c15_5820V3
Pp3c15_6140V3
Pp3c15_6330V3
Pp3c15_6410V3
Pp3c15_6750V3
Pp3c15_7040V3
Pp3c15_720V3
Pp3c15_7790V3
Pp3c15_7990V3
Pp3c15_8550V3
Pp3c15_8710V3
Pp3c15_9180V3
Pp3c15_9360V3
Pp3c15_9710V3
Pp3c15_9880V3
Pp3c16_10020V3
Pp3c16_10290V3
Pp3c16_10320V3
Pp3c16_1040V3
Pp3c16_1150V3
Pp3c16_11580V3
Pp3c16_11590V3
Pp3c16_11700V3
Pp3c16_11705V3
Pp3c16_1200V3
Pp3c16_12230V3
Pp3c16_1260V3
Pp3c16_12660V3
Pp3c16_12850V3
Pp3c16_13060V3
Pp3c16_13180V3
Pp3c16_13260V3
Pp3c16_13280V3
Pp3c16_13450V3
Pp3c16_13490V3
Pp3c16_13660V3
Pp3c16_14300V3
Pp3c16_14330V3
Pp3c16_14340V3
Pp3c16_14390V3
Pp3c16_14810V3
Pp3c16_15000V3
Pp3c16_15110V3
Pp3c16_15118V3
Pp3c16_15410V3
Pp3c16_15450V3
Pp3c16_15610V3
Pp3c16_15760V3
Pp3c16_16260V3
Pp3c16_16320V3
Pp3c16_16500V3
Pp3c16_16520V3
Pp3c16_16740V3
Pp3c16_16743V3
Pp3c16_16990V3
Pp3c16_17020V3
Pp3c16_17420V3
Pp3c16_17550V3
Pp3c16_17820V3
Pp3c16_18360V3
Pp3c16_18460V3
Pp3c16_18610V3
Pp3c16_18950V3
Pp3c16_19160V3
Pp3c16_19170V3
Pp3c16_19410V3
Pp3c16_19830V3
Pp3c16_19970V3
Pp3c16_210V3
Pp3c16_21410V3
Pp3c16_21590V3
Pp3c16_21680V3
Pp3c16_21950V3
Pp3c16_22100V3
Pp3c16_23260V3
Pp3c16_2870V3
Pp3c16_300V3
Pp3c16_3030V3
Pp3c16_3320V3
Pp3c16_3770V3
Pp3c16_4220V3
Pp3c16_4710V3
Pp3c16_5930V3
Pp3c16_6100V3
Pp3c16_6460V3
Pp3c16_6690V3
Pp3c16_6830V3
Pp3c16_7480V3
Pp3c16_7490V3
Pp3c16_7540V3
Pp3c16_7610V3
Pp3c16_7710V3
Pp3c16_8180V3
Pp3c16_8560V3
Pp3c16_8750V3
Pp3c16_9230V3
Pp3c16_9360V3
Pp3c16_9970V3
Pp3c17_10170V3
Pp3c17_10200V3
Pp3c17_1032V3
Pp3c17_11030V3
Pp3c17_11050V3
Pp3c17_11070V3
Pp3c17_11390V3
Pp3c17_12030V3
Pp3c17_12730V3
Pp3c17_12760V3
Pp3c17_12880V3
Pp3c17_13070V3
Pp3c17_13450V3
Pp3c17_13550V3
Pp3c17_13620V3
Pp3c17_13710V3
Pp3c17_14230V3
Pp3c17_1430V3
Pp3c17_14350V3
Pp3c17_14770V3
Pp3c17_15380V3
Pp3c17_15980V3
Pp3c17_16150V3
Pp3c17_16170V3
Pp3c17_16430V3
Pp3c17_16470V3
Pp3c17_16550V3
Pp3c17_16900V3
Pp3c17_16910V3
Pp3c17_17000V3
Pp3c17_17420V3
Pp3c17_17510V3
Pp3c17_17610V3
Pp3c17_17640V3
Pp3c17_1780V3
Pp3c17_17850V3
Pp3c17_18070V3
Pp3c17_18130V3
Pp3c17_18190V3
Pp3c17_19090V3
Pp3c17_1930V3
Pp3c17_19520V3
Pp3c17_19720V3
Pp3c17_19726V3
Pp3c17_19780V3
Pp3c17_19830V3
Pp3c17_19900V3
Pp3c17_19947V3
Pp3c17_19970V3
Pp3c17_20150V3
Pp3c17_20160V3
Pp3c17_20210V3
Pp3c17_20740V3
Pp3c17_21430V3
Pp3c17_21620V3
Pp3c17_21890V3
Pp3c17_2200V3
Pp3c17_22010V3
Pp3c17_22290V3
Pp3c17_23070V3
Pp3c17_23200V3
Pp3c17_23300V3
Pp3c17_23560V3
Pp3c17_23620V3
Pp3c17_23930V3
Pp3c17_24040V3
Pp3c17_2460V3
Pp3c17_2570V3
Pp3c17_2880V3
Pp3c17_3450V3
Pp3c17_350V3
Pp3c17_3610V3
Pp3c17_3860V3
Pp3c17_3950V3
Pp3c17_4020V3
Pp3c17_4370V3
Pp3c17_4375V3
Pp3c17_470V3
Pp3c17_4970V3
Pp3c17_5410V3
Pp3c17_5920V3
Pp3c17_7580V3
Pp3c17_7730V3
Pp3c17_7930V3
Pp3c17_8040V3
Pp3c17_8330V3
Pp3c17_930V3
Pp3c17_931V3
Pp3c17_9350V3
Pp3c18_10680V3
Pp3c18_11190V3
Pp3c18_11300V3
Pp3c18_11770V3
Pp3c18_12180V3
Pp3c18_12270V3
Pp3c18_1260V3
Pp3c18_12880V3
Pp3c18_13350V3
Pp3c18_13500V3
Pp3c18_14260V3
Pp3c18_1430V3
Pp3c18_14540V3
Pp3c18_14790V3
Pp3c18_14800V3
Pp3c18_14850V3
Pp3c18_15340V3
Pp3c18_16090V3
Pp3c18_16260V3
Pp3c18_16640V3
Pp3c18_17900V3
Pp3c18_1800V3
Pp3c18_18510V3
Pp3c18_18720V3
Pp3c18_18750V3
Pp3c18_19040V3
Pp3c18_19045V3
Pp3c18_1910V3
Pp3c18_19240V3
Pp3c18_19850V3
Pp3c18_20920V3
Pp3c18_21020V3
Pp3c18_2110V3
Pp3c18_21380V3
Pp3c18_21950V3
Pp3c18_22010V3
Pp3c18_2230V3
Pp3c18_2320V3
Pp3c18_340V3
Pp3c18_3810V3
Pp3c18_3900V3
Pp3c18_4140V3
Pp3c18_4200V3
Pp3c18_4220V3
Pp3c18_4620V3
Pp3c18_4650V3
Pp3c18_4810V3
Pp3c18_4830V3
Pp3c18_5460V3
Pp3c18_6090V3
Pp3c18_6750V3
Pp3c18_6751V3
Pp3c18_6880V3
Pp3c18_8170V3
Pp3c18_8470V3
Pp3c18_8490V3
Pp3c18_8640V3
Pp3c18_8650V3
Pp3c18_8710V3
Pp3c18_8920V3
Pp3c18_9360V3
Pp3c18_9600V3
Pp3c18_9980V3
Pp3c19_10050V3
Pp3c19_10210V3
Pp3c19_11080V3
Pp3c19_11400V3
Pp3c19_11580V3
Pp3c19_11620V3
Pp3c19_11650V3
Pp3c19_11780V3
Pp3c19_12410V3
Pp3c19_12460V3
Pp3c19_12480V3
Pp3c19_12500V3
Pp3c19_12520V3
Pp3c19_12930V3
Pp3c19_13580V3
Pp3c19_14080V3
Pp3c19_1420V3
Pp3c19_14710V3
Pp3c19_14950V3
Pp3c19_15660V3
Pp3c19_15700V3
Pp3c19_15710V3
Pp3c19_15730V3
Pp3c19_15790V3
Pp3c19_1580V3
Pp3c19_16060V3
Pp3c19_16350V3
Pp3c19_17160V3
Pp3c19_17660V3
Pp3c19_17670V3
Pp3c19_18240V3
Pp3c19_18560V3
Pp3c19_1870V3
Pp3c19_1880V3
Pp3c19_19050V3
Pp3c19_19230V3
Pp3c19_19400V3
Pp3c19_19610V3
Pp3c19_19910V3
Pp3c19_19960V3
Pp3c19_20410V3
Pp3c19_20650V3
Pp3c19_20670V3
Pp3c19_20750V3
Pp3c19_21390V3
Pp3c19_21960V3
Pp3c19_21980V3
Pp3c19_22680V3
Pp3c19_23130V3
Pp3c19_2450V3
Pp3c19_2670V3
Pp3c19_3000V3
Pp3c19_3420V3
Pp3c19_4130V3
Pp3c19_4900V3
Pp3c19_5620V3
Pp3c19_5900V3
Pp3c19_6370V3
Pp3c19_7090V3
Pp3c19_7390V3
Pp3c19_7560V3
Pp3c19_7620V3
Pp3c19_7630V3
Pp3c19_7660V3
Pp3c19_7760V3
Pp3c19_8310V3
Pp3c19_860V3
Pp3c19_8700V3
Pp3c19_9370V3
Pp3c19_9550V3
Pp3c19_9580V3
Pp3c19_9620V3
Pp3c19_9660V3
Pp3c19_9880V3
Pp3c19_9910V3
Pp3c19_9920V3
Pp3c1_110V3
Pp3c1_11190V3
Pp3c1_1170V3
Pp3c1_12080V3
Pp3c1_12170V3
Pp3c1_12290V3
Pp3c1_12370V3
Pp3c1_12380V3
Pp3c1_12940V3
Pp3c1_12990V3
Pp3c1_1300V3
Pp3c1_13190V3
Pp3c1_13300V3
Pp3c1_13308V3
Pp3c1_14230V3
Pp3c1_14440V3
Pp3c1_14480V3
Pp3c1_14660V3
Pp3c1_14663V3
Pp3c1_15290V3
Pp3c1_15410V3
Pp3c1_15560V3
Pp3c1_15680V3
Pp3c1_1650V3
Pp3c1_16700V3
Pp3c1_16920V3
Pp3c1_1790V3
Pp3c1_18090V3
Pp3c1_18490V3
Pp3c1_19660V3
Pp3c1_20050V3
Pp3c1_20230V3
Pp3c1_20290V3
Pp3c1_20960V3
Pp3c1_21290V3
Pp3c1_21370V3
Pp3c1_21470V3
Pp3c1_21610V3
Pp3c1_21760V3
Pp3c1_22090V3
Pp3c1_22180V3
Pp3c1_22185V3
Pp3c1_22200V3
Pp3c1_22210V3
Pp3c1_22230V3
Pp3c1_22440V3
Pp3c1_22540V3
Pp3c1_22860V3
Pp3c1_23930V3
Pp3c1_24020V3
Pp3c1_24090V3
Pp3c1_24600V3
Pp3c1_24700V3
Pp3c1_24760V3
Pp3c1_24850V3
Pp3c1_24950V3
Pp3c1_24960V3
Pp3c1_2540V3
Pp3c1_25410V3
Pp3c1_25760V3
Pp3c1_25970V3
Pp3c1_26530V3
Pp3c1_26600V3
Pp3c1_27160V3
Pp3c1_27440V3
Pp3c1_27630V3
Pp3c1_27710V3
Pp3c1_28060V3
Pp3c1_28430V3
Pp3c1_28560V3
Pp3c1_28750V3
Pp3c1_28980V3
Pp3c1_29080V3
Pp3c1_29082V3
Pp3c1_29330V3
Pp3c1_29920V3
Pp3c1_30500V3
Pp3c1_31190V3
Pp3c1_32440V3
Pp3c1_32480V3
Pp3c1_3260V3
Pp3c1_32730V3
Pp3c1_32850V3
Pp3c1_33070V3
Pp3c1_33080V3
Pp3c1_33100V3
Pp3c1_33270V3
Pp3c1_3340V3
Pp3c1_33770V3
Pp3c1_34190V3
Pp3c1_35220V3
Pp3c1_35350V3
Pp3c1_35410V3
Pp3c1_35770V3
Pp3c1_35880V3
Pp3c1_3590V3
Pp3c1_35990V3
Pp3c1_36050V3
Pp3c1_36120V3
Pp3c1_36129V3
Pp3c1_36240V3
Pp3c1_36370V3
Pp3c1_36560V3
Pp3c1_36580V3
Pp3c1_36940V3
Pp3c1_3700V3
Pp3c1_37070V3
Pp3c1_37090V3
Pp3c1_37280V3
Pp3c1_37340V3
Pp3c1_3750V3
Pp3c1_3760V3
Pp3c1_3770V3
Pp3c1_38330V3
Pp3c1_38440V3
Pp3c1_38820V3
Pp3c1_38880V3
Pp3c1_39330V3
Pp3c1_39760V3
Pp3c1_39780V3
Pp3c1_39960V3
Pp3c1_40040V3
Pp3c1_40060V3
Pp3c1_40230V3
Pp3c1_40270V3
Pp3c1_40330V3
Pp3c1_40410V3
Pp3c1_40750V3
Pp3c1_4150V3
Pp3c1_41530V3
Pp3c1_41700V3
Pp3c1_42920V3
Pp3c1_43030V3
Pp3c1_4600V3
Pp3c1_4970V3
Pp3c1_5010V3
Pp3c1_5460V3
Pp3c1_6380V3
Pp3c1_6385V3
Pp3c1_6880V3
Pp3c1_6980V3
Pp3c1_7300V3
Pp3c1_7740V3
Pp3c1_7800V3
Pp3c1_8100V3
Pp3c1_8190V3
Pp3c1_8210V3
Pp3c1_8530V3
Pp3c1_8550V3
Pp3c1_860V3
Pp3c1_8740V3
Pp3c1_8820V3
Pp3c1_8890V3
Pp3c1_8930V3
Pp3c1_9270V3
Pp3c1_950V3
Pp3c1_9540V3
Pp3c20_10200V3
Pp3c20_10590V3
Pp3c20_10790V3
Pp3c20_11040V3
Pp3c20_1120V3
Pp3c20_11430V3
Pp3c20_11500V3
Pp3c20_11890V3
Pp3c20_12200V3
Pp3c20_12230V3
Pp3c20_12860V3
Pp3c20_12980V3
Pp3c20_13600V3
Pp3c20_1400V3
Pp3c20_14020V3
Pp3c20_1403V3
Pp3c20_14150V3
Pp3c20_14153V3
Pp3c20_14750V3
Pp3c20_15200V3
Pp3c20_15580V3
Pp3c20_16530V3
Pp3c20_17580V3
Pp3c20_17760V3
Pp3c20_18130V3
Pp3c20_18400V3
Pp3c20_18402V3
Pp3c20_18730V3
Pp3c20_19070V3
Pp3c20_20710V3
Pp3c20_2130V3
Pp3c20_2160V3
Pp3c20_2190V3
Pp3c20_22150V3
Pp3c20_22630V3
Pp3c20_22670V3
Pp3c20_23080V3
Pp3c20_23380V3
Pp3c20_23460V3
Pp3c20_23720V3
Pp3c20_3770V3
Pp3c20_5500V3
Pp3c20_5720V3
Pp3c20_590V3
Pp3c20_6040V3
Pp3c20_6050V3
Pp3c20_6140V3
Pp3c20_6540V3
Pp3c20_6700V3
Pp3c20_6860V3
Pp3c20_7050V3
Pp3c20_7130V3
Pp3c20_7280V3
Pp3c20_7290V3
Pp3c20_7710V3
Pp3c20_8930V3
Pp3c20_8950V3
Pp3c20_9210V3
Pp3c20_9330V3
Pp3c20_9530V3
Pp3c20_9790V3
Pp3c21_10100V3
Pp3c21_10290V3
Pp3c21_10320V3
Pp3c21_10500V3
Pp3c21_10520V3
Pp3c21_10710V3
Pp3c21_10800V3
Pp3c21_11010V3
Pp3c21_11270V3
Pp3c21_11530V3
Pp3c21_11850V3
Pp3c21_11880V3
Pp3c21_1210V3
Pp3c21_12190V3
Pp3c21_12900V3
Pp3c21_13130V3
Pp3c21_13480V3
Pp3c21_13620V3
Pp3c21_14110V3
Pp3c21_14114V3
Pp3c21_14490V3
Pp3c21_14500V3
Pp3c21_15110V3
Pp3c21_15150V3
Pp3c21_16050V3
Pp3c21_16260V3
Pp3c21_1630V3
Pp3c21_16440V3
Pp3c21_16540V3
Pp3c21_1680V3
Pp3c21_17550V3
Pp3c21_17650V3
Pp3c21_18040V3
Pp3c21_18410V3
Pp3c21_18550V3
Pp3c21_18820V3
Pp3c21_19030V3
Pp3c21_19330V3
Pp3c21_19630V3
Pp3c21_20730V3
Pp3c21_21010V3
Pp3c21_21070V3
Pp3c21_21550V3
Pp3c21_2850V3
Pp3c21_3130V3
Pp3c21_3140V3
Pp3c21_3700V3
Pp3c21_440V3
Pp3c21_4750V3
Pp3c21_4760V3
Pp3c21_4764V3
Pp3c21_4780V3
Pp3c21_5060V3
Pp3c21_5350V3
Pp3c21_5710V3
Pp3c21_5770V3
Pp3c21_6770V3
Pp3c21_6840V3
Pp3c21_7130V3
Pp3c21_8000V3
Pp3c21_8120V3
Pp3c21_8330V3
Pp3c21_8710V3
Pp3c21_9040V3
Pp3c22_10160V3
Pp3c22_10880V3
Pp3c22_11040V3
Pp3c22_11080V3
Pp3c22_110V3
Pp3c22_11760V3
Pp3c22_12010V3
Pp3c22_12150V3
Pp3c22_12420V3
Pp3c22_12880V3
Pp3c22_13060V3
Pp3c22_130V3
Pp3c22_13550V3
Pp3c22_13770V3
Pp3c22_13810V3
Pp3c22_13840V3
Pp3c22_1400V3
Pp3c22_1410V3
Pp3c22_14220V3
Pp3c22_14490V3
Pp3c22_15240V3
Pp3c22_16800V3
Pp3c22_17280V3
Pp3c22_17830V3
Pp3c22_17873V3
Pp3c22_17900V3
Pp3c22_17920V3
Pp3c22_17940V3
Pp3c22_1800V3
Pp3c22_18520V3
Pp3c22_18860V3
Pp3c22_20020V3
Pp3c22_20520V3
Pp3c22_21360V3
Pp3c22_2200V3
Pp3c22_22940V3
Pp3c22_23130V3
Pp3c22_2330V3
Pp3c22_2480V3
Pp3c22_2550V3
Pp3c22_3910V3
Pp3c22_4200V3
Pp3c22_4700V3
Pp3c22_4760V3
Pp3c22_5440V3
Pp3c22_550V3
Pp3c22_5850V3
Pp3c22_5870V3
Pp3c22_5950V3
Pp3c22_5980V3
Pp3c22_6360V3
Pp3c22_6370V3
Pp3c22_6390V3
Pp3c22_7230V3
Pp3c22_7840V3
Pp3c22_7900V3
Pp3c22_8210V3
Pp3c22_8217V3
Pp3c22_840V3
Pp3c22_9010V3
Pp3c22_9120V3
Pp3c22_9250V3
Pp3c22_9600V3
Pp3c22_9950V3
Pp3c23_10600V3
Pp3c23_10680V3
Pp3c23_11010V3
Pp3c23_11030V3
Pp3c23_12600V3
Pp3c23_12820V3
Pp3c23_12950V3
Pp3c23_12970V3
Pp3c23_13220V3
Pp3c23_13260V3
Pp3c23_13360V3
Pp3c23_14010V3
Pp3c23_14630V3
Pp3c23_14710V3
Pp3c23_14910V3
Pp3c23_15970V3
Pp3c23_17770V3
Pp3c23_17890V3
Pp3c23_17960V3
Pp3c23_18290V3
Pp3c23_19070V3
Pp3c23_19420V3
Pp3c23_19680V3
Pp3c23_20080V3
Pp3c23_21450V3
Pp3c23_2190V3
Pp3c23_21930V3
Pp3c23_3290V3
Pp3c23_3450V3
Pp3c23_3520V3
Pp3c23_3920V3
Pp3c23_4150V3
Pp3c23_5290V3
Pp3c23_5390V3
Pp3c23_6230V3
Pp3c23_6560V3
Pp3c23_6780V3
Pp3c23_7400V3
Pp3c23_7470V3
Pp3c23_7520V3
Pp3c23_7530V3
Pp3c23_7680V3
Pp3c23_800V3
Pp3c23_8430V3
Pp3c23_861V3
Pp3c23_8630V3
Pp3c23_8710V3
Pp3c23_9360V3
Pp3c23_9520V3
Pp3c23_960V3
Pp3c24_1010V3
Pp3c24_10470V3
Pp3c24_10780V3
Pp3c24_11160V3
Pp3c24_12830V3
Pp3c24_13070V3
Pp3c24_13130V3
Pp3c24_1350V3
Pp3c24_13550V3
Pp3c24_13770V3
Pp3c24_13810V3
Pp3c24_13850V3
Pp3c24_14110V3
Pp3c24_15140V3
Pp3c24_15780V3
Pp3c24_15860V3
Pp3c24_16180V3
Pp3c24_16440V3
Pp3c24_16720V3
Pp3c24_17130V3
Pp3c24_17420V3
Pp3c24_17920V3
Pp3c24_17930V3
Pp3c24_1840V3
Pp3c24_18870V3
Pp3c24_1890V3
Pp3c24_19330V3
Pp3c24_19390V3
Pp3c24_19540V3
Pp3c24_20450V3
Pp3c24_2050V3
Pp3c24_20920V3
Pp3c24_2500V3
Pp3c24_2690V3
Pp3c24_3660V3
Pp3c24_5300V3
Pp3c24_5330V3
Pp3c24_6460V3
Pp3c24_6560V3
Pp3c24_6610V3
Pp3c24_7080V3
Pp3c24_70V3
Pp3c24_7120V3
Pp3c24_7590V3
Pp3c24_7690V3
Pp3c24_8050V3
Pp3c24_8070V3
Pp3c24_8230V3
Pp3c24_8270V3
Pp3c24_8550V3
Pp3c24_8830V3
Pp3c24_9020V3
Pp3c24_9070V3
Pp3c24_9610V3
Pp3c24_9630V3
Pp3c25_10710V3
Pp3c25_1090V3
Pp3c25_1190V3
Pp3c25_12300V3
Pp3c25_1230V3
Pp3c25_12860V3
Pp3c25_12880V3
Pp3c25_13450V3
Pp3c25_13740V3
Pp3c25_13850V3
Pp3c25_14650V3
Pp3c25_1760V3
Pp3c25_3170V3
Pp3c25_3220V3
Pp3c25_3225V3
Pp3c25_330V3
Pp3c25_4250V3
Pp3c25_4520V3
Pp3c25_4920V3
Pp3c25_5040V3
Pp3c25_5110V3
Pp3c25_520V3
Pp3c25_6190V3
Pp3c25_6300V3
Pp3c25_6330V3
Pp3c25_660V3
Pp3c25_6940V3
Pp3c25_7220V3
Pp3c25_7380V3
Pp3c25_7410V3
Pp3c25_8490V3
Pp3c25_850V3
Pp3c25_8540V3
Pp3c25_8610V3
Pp3c25_8630V3
Pp3c26_10480V3
Pp3c26_10830V3
Pp3c26_11480V3
Pp3c26_11550V3
Pp3c26_11890V3
Pp3c26_12270V3
Pp3c26_12400V3
Pp3c26_1300V3
Pp3c26_13140V3
Pp3c26_13260V3
Pp3c26_13450V3
Pp3c26_13600V3
Pp3c26_13780V3
Pp3c26_1390V3
Pp3c26_13950V3
Pp3c26_14400V3
Pp3c26_14480V3
Pp3c26_14710V3
Pp3c26_14860V3
Pp3c26_1490V3
Pp3c26_15000V3
Pp3c26_15770V3
Pp3c26_180V3
Pp3c26_1890V3
Pp3c26_250V3
Pp3c26_2600V3
Pp3c26_2630V3
Pp3c26_2929V3
Pp3c26_3290V3
Pp3c26_370V3
Pp3c26_3820V3
Pp3c26_4140V3
Pp3c26_4390V3
Pp3c26_4450V3
Pp3c26_4660V3
Pp3c26_4890V3
Pp3c26_5090V3
Pp3c26_5095V3
Pp3c26_5120V3
Pp3c26_5950V3
Pp3c26_6730V3
Pp3c26_8130V3
Pp3c26_8280V3
Pp3c26_8569V3
Pp3c26_9700V3
Pp3c26_9880V3
Pp3c27_1350V3
Pp3c27_1430V3
Pp3c27_1440V3
Pp3c27_1520V3
Pp3c27_1720V3
Pp3c27_2010V3
Pp3c27_2730V3
Pp3c27_2840V3
Pp3c27_290V3
Pp3c27_3080V3
Pp3c27_3280V3
Pp3c27_3830V3
Pp3c27_3890V3
Pp3c27_400V3
Pp3c27_4140V3
Pp3c27_4220V3
Pp3c27_4910V3
Pp3c27_5180V3
Pp3c27_5490V3
Pp3c27_5750V3
Pp3c27_5970V3
Pp3c27_600V3
Pp3c27_6030V3
Pp3c27_6040V3
Pp3c27_60V3
Pp3c27_6760V3
Pp3c27_7430V3
Pp3c27_7510V3
Pp3c27_7560V3
Pp3c27_8050V3
Pp3c2_10000V3
Pp3c2_10200V3
Pp3c2_10610V3
Pp3c2_10660V3
Pp3c2_10790V3
Pp3c2_11030V3
Pp3c2_11380V3
Pp3c2_11580V3
Pp3c2_11820V3
Pp3c2_12540V3
Pp3c2_13290V3
Pp3c2_13400V3
Pp3c2_13990V3
Pp3c2_14479V3
Pp3c2_15500V3
Pp3c2_15860V3
Pp3c2_15900V3
Pp3c2_16080V3
Pp3c2_16310V3
Pp3c2_16410V3
Pp3c2_16950V3
Pp3c2_17030V3
Pp3c2_17090V3
Pp3c2_17250V3
Pp3c2_17270V3
Pp3c2_1760V3
Pp3c2_17710V3
Pp3c2_17910V3
Pp3c2_1810V3
Pp3c2_18110V3
Pp3c2_18410V3
Pp3c2_1870V3
Pp3c2_18870V3
Pp3c2_1920V3
Pp3c2_19330V3
Pp3c2_19390V3
Pp3c2_1960V3
Pp3c2_19830V3
Pp3c2_19950V3
Pp3c2_20110V3
Pp3c2_20240V3
Pp3c2_20770V3
Pp3c2_20860V3
Pp3c2_20930V3
Pp3c2_21080V3
Pp3c2_21160V3
Pp3c2_2200V3
Pp3c2_22070V3
Pp3c2_22420V3
Pp3c2_23590V3
Pp3c2_23660V3
Pp3c2_24110V3
Pp3c2_24120V3
Pp3c2_24140V3
Pp3c2_24290V3
Pp3c2_24880V3
Pp3c2_24980V3
Pp3c2_25070V3
Pp3c2_2510V3
Pp3c2_25130V3
Pp3c2_2520V3
Pp3c2_25760V3
Pp3c2_25890V3
Pp3c2_2660V3
Pp3c2_26790V3
Pp3c2_26900V3
Pp3c2_26970V3
Pp3c2_27130V3
Pp3c2_27490V3
Pp3c2_28090V3
Pp3c2_28110V3
Pp3c2_2840V3
Pp3c2_28690V3
Pp3c2_2880V3
Pp3c2_29210V3
Pp3c2_29420V3
Pp3c2_30010V3
Pp3c2_30120V3
Pp3c2_30150V3
Pp3c2_30770V3
Pp3c2_30830V3
Pp3c2_30835V3
Pp3c2_310V3
Pp3c2_31200V3
Pp3c2_31290V3
Pp3c2_31390V3
Pp3c2_31440V3
Pp3c2_31580V3
Pp3c2_31650V3
Pp3c2_31700V3
Pp3c2_31720V3
Pp3c2_31770V3
Pp3c2_32020V3
Pp3c2_32150V3
Pp3c2_32160V3
Pp3c2_32300V3
Pp3c2_32500V3
Pp3c2_32501V3
Pp3c2_32530V3
Pp3c2_32730V3
Pp3c2_32860V3
Pp3c2_32900V3
Pp3c2_33310V3
Pp3c2_3370V3
Pp3c2_33800V3
Pp3c2_33890V3
Pp3c2_34670V3
Pp3c2_34920V3
Pp3c2_3510V3
Pp3c2_35420V3
Pp3c2_35540V3
Pp3c2_35750V3
Pp3c2_35860V3
Pp3c2_360V3
Pp3c2_3650V3
Pp3c2_36690V3
Pp3c2_36790V3
Pp3c2_37040V3
Pp3c2_37790V3
Pp3c2_3880V3
Pp3c2_3980V3
Pp3c2_4060V3
Pp3c2_40V3
Pp3c2_4390V3
Pp3c2_4410V3
Pp3c2_4600V3
Pp3c2_4670V3
Pp3c2_4771V3
Pp3c2_4870V3
Pp3c2_4871V3
Pp3c2_4940V3
Pp3c2_5110V3
Pp3c2_5310V3
Pp3c2_5400V3
Pp3c2_5620V3
Pp3c2_5625V3
Pp3c2_590V3
Pp3c2_5990V3
Pp3c2_6010V3
Pp3c2_6080V3
Pp3c2_6130V3
Pp3c2_6132V3
Pp3c2_620V3
Pp3c2_6210V3
Pp3c2_6520V3
Pp3c2_7400V3
Pp3c2_7410V3
Pp3c2_7590V3
Pp3c2_7596V3
Pp3c2_8360V3
Pp3c2_8880V3
Pp3c2_8960V3
Pp3c2_9310V3
Pp3c2_9470V3
Pp3c2_9560V3
Pp3c2_9580V3
Pp3c2_9700V3
Pp3c2_9730V3
Pp3c2_9850V3
Pp3c3_10370V3
Pp3c3_10430V3
Pp3c3_10940V3
Pp3c3_11210V3
Pp3c3_11220V3
Pp3c3_11280V3
Pp3c3_11450V3
Pp3c3_11670V3
Pp3c3_11980V3
Pp3c3_12080V3
Pp3c3_12740V3
Pp3c3_12890V3
Pp3c3_13510V3
Pp3c3_13590V3
Pp3c3_14260V3
Pp3c3_14470V3
Pp3c3_14670V3
Pp3c3_15040V3
Pp3c3_1510V3
Pp3c3_15310V3
Pp3c3_15480V3
Pp3c3_15820V3
Pp3c3_15850V3
Pp3c3_1630V3
Pp3c3_16700V3
Pp3c3_16820V3
Pp3c3_16960V3
Pp3c3_17070V3
Pp3c3_17110V3
Pp3c3_17230V3
Pp3c3_17260V3
Pp3c3_17380V3
Pp3c3_17480V3
Pp3c3_17580V3
Pp3c3_17650V3
Pp3c3_17780V3
Pp3c3_18450V3
Pp3c3_18600V3
Pp3c3_18630V3
Pp3c3_18790V3
Pp3c3_1910V3
Pp3c3_19160V3
Pp3c3_19360V3
Pp3c3_19510V3
Pp3c3_19550V3
Pp3c3_19630V3
Pp3c3_19680V3
Pp3c3_1980V3
Pp3c3_19940V3
Pp3c3_20570V3
Pp3c3_20640V3
Pp3c3_20980V3
Pp3c3_2100V3
Pp3c3_21050V3
Pp3c3_21060V3
Pp3c3_21440V3
Pp3c3_22160V3
Pp3c3_23050V3
Pp3c3_23200V3
Pp3c3_23680V3
Pp3c3_23690V3
Pp3c3_23770V3
Pp3c3_23940V3
Pp3c3_2420V3
Pp3c3_24240V3
Pp3c3_24450V3
Pp3c3_24540V3
Pp3c3_24660V3
Pp3c3_24664V3
Pp3c3_2470V3
Pp3c3_25240V3
Pp3c3_25610V3
Pp3c3_25870V3
Pp3c3_26050V3
Pp3c3_26370V3
Pp3c3_26410V3
Pp3c3_2660V3
Pp3c3_27280V3
Pp3c3_27330V3
Pp3c3_27440V3
Pp3c3_27480V3
Pp3c3_27530V3
Pp3c3_2760V3
Pp3c3_27790V3
Pp3c3_27900V3
Pp3c3_27940V3
Pp3c3_28590V3
Pp3c3_28970V3
Pp3c3_2900V3
Pp3c3_29290V3
Pp3c3_29680V3
Pp3c3_30010V3
Pp3c3_30220V3
Pp3c3_30710V3
Pp3c3_31080V3
Pp3c3_31091V3
Pp3c3_31350V3
Pp3c3_31490V3
Pp3c3_31500V3
Pp3c3_31770V3
Pp3c3_3180V3
Pp3c3_31810V3
Pp3c3_31980V3
Pp3c3_32860V3
Pp3c3_33220V3
Pp3c3_33360V3
Pp3c3_33370V3
Pp3c3_33930V3
Pp3c3_34000V3
Pp3c3_34180V3
Pp3c3_34200V3
Pp3c3_34250V3
Pp3c3_34580V3
Pp3c3_34700V3
Pp3c3_34860V3
Pp3c3_34900V3
Pp3c3_35020V3
Pp3c3_35530V3
Pp3c3_3580V3
Pp3c3_36750V3
Pp3c3_37320V3
Pp3c3_37540V3
Pp3c3_37640V3
Pp3c3_37710V3
Pp3c3_37880V3
Pp3c3_4210V3
Pp3c3_4950V3
Pp3c3_5010V3
Pp3c3_5040V3
Pp3c3_5470V3
Pp3c3_5480V3
Pp3c3_5520V3
Pp3c3_5580V3
Pp3c3_6250V3
Pp3c3_6420V3
Pp3c3_6830V3
Pp3c3_7020V3
Pp3c3_720V3
Pp3c3_810V3
Pp3c3_8460V3
Pp3c3_8830V3
Pp3c3_8880V3
Pp3c3_9330V3
Pp3c3_9350V3
Pp3c3_9430V3
Pp3c3_950V3
Pp3c3_9874V3
Pp3c3_9950V3
Pp3c3_9960V3
Pp3c3_9970V3
Pp3c4_10850V3
Pp3c4_11490V3
Pp3c4_12320V3
Pp3c4_12430V3
Pp3c4_12510V3
Pp3c4_1260V3
Pp3c4_1261V3
Pp3c4_12970V3
Pp3c4_13010V3
Pp3c4_13250V3
Pp3c4_13590V3
Pp3c4_1360V3
Pp3c4_13790V3
Pp3c4_13840V3
Pp3c4_13990V3
Pp3c4_14090V3
Pp3c4_14370V3
Pp3c4_14410V3
Pp3c4_14760V3
Pp3c4_14810V3
Pp3c4_15559V3
Pp3c4_15820V3
Pp3c4_15830V3
Pp3c4_15980V3
Pp3c4_16130V3
Pp3c4_16270V3
Pp3c4_1630V3
Pp3c4_1631V3
Pp3c4_16540V3
Pp3c4_16880V3
Pp3c4_1710V3
Pp3c4_17160V3
Pp3c4_17230V3
Pp3c4_17700V3
Pp3c4_18330V3
Pp3c4_19510V3
Pp3c4_20150V3
Pp3c4_20160V3
Pp3c4_20290V3
Pp3c4_20390V3
Pp3c4_20430V3
Pp3c4_21200V3
Pp3c4_2120V3
Pp3c4_21970V3
Pp3c4_2250V3
Pp3c4_22830V3
Pp3c4_22880V3
Pp3c4_23130V3
Pp3c4_23550V3
Pp3c4_23600V3
Pp3c4_23930V3
Pp3c4_24380V3
Pp3c4_24710V3
Pp3c4_25130V3
Pp3c4_2530V3
Pp3c4_25840V3
Pp3c4_2590V3
Pp3c4_25990V3
Pp3c4_2660V3
Pp3c4_26780V3
Pp3c4_2680V3
Pp3c4_26880V3
Pp3c4_270V3
Pp3c4_27560V3
Pp3c4_27580V3
Pp3c4_27700V3
Pp3c4_27760V3
Pp3c4_27870V3
Pp3c4_29470V3
Pp3c4_29750V3
Pp3c4_29810V3
Pp3c4_30530V3
Pp3c4_31920V3
Pp3c4_3290V3
Pp3c4_370V3
Pp3c4_3810V3
Pp3c4_3820V3
Pp3c4_3920V3
Pp3c4_4040V3
Pp3c4_5120V3
Pp3c4_5270V3
Pp3c4_5300V3
Pp3c4_540V3
Pp3c4_5410V3
Pp3c4_6000V3
Pp3c4_6770V3
Pp3c4_6860V3
Pp3c4_6870V3
Pp3c4_6930V3
Pp3c4_6990V3
Pp3c4_7080V3
Pp3c4_7100V3
Pp3c4_7260V3
Pp3c4_7320V3
Pp3c4_7328V3
Pp3c4_8230V3
Pp3c4_850V3
Pp3c4_8610V3
Pp3c4_8660V3
Pp3c4_9600V3
Pp3c4_9670V3
Pp3c4_9720V3
Pp3c4_9790V3
Pp3c4_9940V3
Pp3c5_10090V3
Pp3c5_10160V3
Pp3c5_10960V3
Pp3c5_11150V3
Pp3c5_11160V3
Pp3c5_1140V3
Pp3c5_11730V3
Pp3c5_11800V3
Pp3c5_12130V3
Pp3c5_12180V3
Pp3c5_12730V3
Pp3c5_12740V3
Pp3c5_12767V3
Pp3c5_12930V3
Pp3c5_14060V3
Pp3c5_14090V3
Pp3c5_14440V3
Pp3c5_15200V3
Pp3c5_15520V3
Pp3c5_16090V3
Pp3c5_17020V3
Pp3c5_17030V3
Pp3c5_1710V3
Pp3c5_17790V3
Pp3c5_18850V3
Pp3c5_19440V3
Pp3c5_19510V3
Pp3c5_19514V3
Pp3c5_19550V3
Pp3c5_19640V3
Pp3c5_19860V3
Pp3c5_19940V3
Pp3c5_20190V3
Pp3c5_20330V3
Pp3c5_20390V3
Pp3c5_20560V3
Pp3c5_20850V3
Pp3c5_20980V3
Pp3c5_21130V3
Pp3c5_21420V3
Pp3c5_2150V3
Pp3c5_21790V3
Pp3c5_22030V3
Pp3c5_22230V3
Pp3c5_22280V3
Pp3c5_22320V3
Pp3c5_22610V3
Pp3c5_22750V3
Pp3c5_24460V3
Pp3c5_25680V3
Pp3c5_25760V3
Pp3c5_26150V3
Pp3c5_26440V3
Pp3c5_27150V3
Pp3c5_27650V3
Pp3c5_2780V3
Pp3c5_28010V3
Pp3c5_280V3
Pp3c5_28210V3
Pp3c5_28890V3
Pp3c5_2890V3
Pp3c5_28960V3
Pp3c5_2897V3
Pp3c5_28980V3
Pp3c5_2900V3
Pp3c5_29220V3
Pp3c5_3050V3
Pp3c5_3270V3
Pp3c5_3790V3
Pp3c5_3880V3
Pp3c5_3920V3
Pp3c5_3970V3
Pp3c5_4660V3
Pp3c5_4880V3
Pp3c5_4990V3
Pp3c5_5006V3
Pp3c5_5030V3
Pp3c5_570V3
Pp3c5_5710V3
Pp3c5_5830V3
Pp3c5_6070V3
Pp3c5_6300V3
Pp3c5_630V3
Pp3c5_6470V3
Pp3c5_6880V3
Pp3c5_7060V3
Pp3c5_740V3
Pp3c5_7650V3
Pp3c5_770V3
Pp3c5_7880V3
Pp3c5_7920V3
Pp3c5_810V3
Pp3c5_820V3
Pp3c5_8580V3
Pp3c5_860V3
Pp3c5_8700V3
Pp3c5_880V3
Pp3c5_889V3
Pp3c5_9120V3
Pp3c5_9420V3
Pp3c5_9520V3
Pp3c5_9900V3
Pp3c6_10210V3
Pp3c6_10390V3
Pp3c6_10590V3
Pp3c6_1080V3
Pp3c6_10870V3
Pp3c6_10890V3
Pp3c6_11070V3
Pp3c6_11730V3
Pp3c6_1310V3
Pp3c6_13355V3
Pp3c6_13360V3
Pp3c6_13600V3
Pp3c6_13660V3
Pp3c6_13890V3
Pp3c6_13920V3
Pp3c6_14410V3
Pp3c6_14470V3
Pp3c6_14880V3
Pp3c6_15020V3
Pp3c6_15100V3
Pp3c6_15220V3
Pp3c6_15430V3
Pp3c6_1550V3
Pp3c6_15830V3
Pp3c6_16410V3
Pp3c6_16650V3
Pp3c6_16660V3
Pp3c6_17260V3
Pp3c6_17340V3
Pp3c6_17350V3
Pp3c6_1830V3
Pp3c6_19230V3
Pp3c6_19350V3
Pp3c6_19920V3
Pp3c6_20120V3
Pp3c6_20180V3
Pp3c6_20480V3
Pp3c6_21140V3
Pp3c6_21370V3
Pp3c6_21840V3
Pp3c6_22030V3
Pp3c6_22390V3
Pp3c6_22670V3
Pp3c6_23240V3
Pp3c6_23360V3
Pp3c6_23650V3
Pp3c6_23656V3
Pp3c6_24130V3
Pp3c6_24360V3
Pp3c6_24650V3
Pp3c6_26080V3
Pp3c6_26100V3
Pp3c6_26190V3
Pp3c6_26220V3
Pp3c6_26590V3
Pp3c6_26770V3
Pp3c6_26790V3
Pp3c6_26890V3
Pp3c6_26940V3
Pp3c6_2730V3
Pp3c6_27590V3
Pp3c6_27690V3
Pp3c6_28230V3
Pp3c6_28290V3
Pp3c6_28300V3
Pp3c6_28370V3
Pp3c6_28640V3
Pp3c6_29020V3
Pp3c6_29180V3
Pp3c6_29350V3
Pp3c6_3190V3
Pp3c6_3500V3
Pp3c6_3580V3
Pp3c6_4460V3
Pp3c6_5030V3
Pp3c6_5700V3
Pp3c6_5706V3
Pp3c6_6640V3
Pp3c6_6900V3
Pp3c6_7030V3
Pp3c6_7520V3
Pp3c6_7710V3
Pp3c6_8120V3
Pp3c6_8320V3
Pp3c6_8660V3
Pp3c6_950V3
Pp3c6_9520V3
Pp3c6_9830V3
Pp3c7_10140V3
Pp3c7_10240V3
Pp3c7_10780V3
Pp3c7_10800V3
Pp3c7_11120V3
Pp3c7_11360V3
Pp3c7_11520V3
Pp3c7_120V3
Pp3c7_12210V3
Pp3c7_1240V3
Pp3c7_12680V3
Pp3c7_13740V3
Pp3c7_13830V3
Pp3c7_14320V3
Pp3c7_14910V3
Pp3c7_1494V3
Pp3c7_15000V3
Pp3c7_15150V3
Pp3c7_1530V3
Pp3c7_15450V3
Pp3c7_15456V3
Pp3c7_16800V3
Pp3c7_1720V3
Pp3c7_17700V3
Pp3c7_17730V3
Pp3c7_1850V3
Pp3c7_18530V3
Pp3c7_19440V3
Pp3c7_20170V3
Pp3c7_20200V3
Pp3c7_20550V3
Pp3c7_20570V3
Pp3c7_20870V3
Pp3c7_20880V3
Pp3c7_2100V3
Pp3c7_21220V3
Pp3c7_21300V3
Pp3c7_2140V3
Pp3c7_22020V3
Pp3c7_2300V3
Pp3c7_23130V3
Pp3c7_23340V3
Pp3c7_23450V3
Pp3c7_23490V3
Pp3c7_23660V3
Pp3c7_23900V3
Pp3c7_2390V3
Pp3c7_24030V3
Pp3c7_24100V3
Pp3c7_24150V3
Pp3c7_24490V3
Pp3c7_24660V3
Pp3c7_24670V3
Pp3c7_24683V3
Pp3c7_24880V3
Pp3c7_2520V3
Pp3c7_25280V3
Pp3c7_25430V3
Pp3c7_25550V3
Pp3c7_25600V3
Pp3c7_26020V3
Pp3c7_2610V3
Pp3c7_26110V3
Pp3c7_26690V3
Pp3c7_2870V3
Pp3c7_2900V3
Pp3c7_2960V3
Pp3c7_3100V3
Pp3c7_310V3
Pp3c7_3340V3
Pp3c7_3690V3
Pp3c7_3770V3
Pp3c7_3780V3
Pp3c7_3790V3
Pp3c7_4120V3
Pp3c7_4270V3
Pp3c7_4380V3
Pp3c7_4500V3
Pp3c7_4850V3
Pp3c7_5280V3
Pp3c7_5390V3
Pp3c7_5480V3
Pp3c7_5800V3
Pp3c7_5890V3
Pp3c7_5900V3
Pp3c7_5920V3
Pp3c7_5929V3
Pp3c7_5970V3
Pp3c7_6260V3
Pp3c7_6590V3
Pp3c7_6850V3
Pp3c7_6890V3
Pp3c7_70V3
Pp3c7_7390V3
Pp3c7_7470V3
Pp3c7_7550V3
Pp3c7_7640V3
Pp3c7_7720V3
Pp3c7_7950V3
Pp3c7_7980V3
Pp3c7_7990V3
Pp3c7_8530V3
Pp3c7_8560V3
Pp3c7_8710V3
Pp3c7_8840V3
Pp3c7_9340V3
Pp3c7_940V3
Pp3c7_9970V3
Pp3c7_9990V3
Pp3c8_10910V3
Pp3c8_11160V3
Pp3c8_11180V3
Pp3c8_11400V3
Pp3c8_11470V3
Pp3c8_11620V3
Pp3c8_11630V3
Pp3c8_1190V3
Pp3c8_12050V3
Pp3c8_12340V3
Pp3c8_12344V3
Pp3c8_12360V3
Pp3c8_12620V3
Pp3c8_14490V3
Pp3c8_14580V3
Pp3c8_14720V3
Pp3c8_14940V3
Pp3c8_15110V3
Pp3c8_15360V3
Pp3c8_16180V3
Pp3c8_1620V3
Pp3c8_16720V3
Pp3c8_16730V3
Pp3c8_16910V3
Pp3c8_17070V3
Pp3c8_17100V3
Pp3c8_17290V3
Pp3c8_17710V3
Pp3c8_17910V3
Pp3c8_17990V3
Pp3c8_17994V3
Pp3c8_18450V3
Pp3c8_18540V3
Pp3c8_1870V3
Pp3c8_19010V3
Pp3c8_19130V3
Pp3c8_19750V3
Pp3c8_19810V3
Pp3c8_2040V3
Pp3c8_20710V3
Pp3c8_20940V3
Pp3c8_21000V3
Pp3c8_21540V3
Pp3c8_21660V3
Pp3c8_21700V3
Pp3c8_21920V3
Pp3c8_22140V3
Pp3c8_22270V3
Pp3c8_22450V3
Pp3c8_230V3
Pp3c8_24200V3
Pp3c8_250V3
Pp3c8_25400V3
Pp3c8_2690V3
Pp3c8_3310V3
Pp3c8_3980V3
Pp3c8_4000V3
Pp3c8_4400V3
Pp3c8_440V3
Pp3c8_4430V3
Pp3c8_4500V3
Pp3c8_5110V3
Pp3c8_5420V3
Pp3c8_6080V3
Pp3c8_6330V3
Pp3c8_6890V3
Pp3c8_6920V3
Pp3c8_6950V3
Pp3c8_7340V3
Pp3c8_7520V3
Pp3c8_8080V3
Pp3c8_8720V3
Pp3c9_10290V3
Pp3c9_1080V3
Pp3c9_10970V3
Pp3c9_11130V3
Pp3c9_11330V3
Pp3c9_11360V3
Pp3c9_11970V3
Pp3c9_12640V3
Pp3c9_12970V3
Pp3c9_13190V3
Pp3c9_13630V3
Pp3c9_13640V3
Pp3c9_1370V3
Pp3c9_14080V3
Pp3c9_14170V3
Pp3c9_14240V3
Pp3c9_14310V3
Pp3c9_14600V3
Pp3c9_14800V3
Pp3c9_15250V3
Pp3c9_15270V3
Pp3c9_15970V3
Pp3c9_15975V3
Pp3c9_1800V3
Pp3c9_18080V3
Pp3c9_18230V3
Pp3c9_18320V3
Pp3c9_18330V3
Pp3c9_18370V3
Pp3c9_1840V3
Pp3c9_18520V3
Pp3c9_18600V3
Pp3c9_18800V3
Pp3c9_1880V3
Pp3c9_18950V3
Pp3c9_19080V3
Pp3c9_19090V3
Pp3c9_19170V3
Pp3c9_19210V3
Pp3c9_20090V3
Pp3c9_2020V3
Pp3c9_20410V3
Pp3c9_20540V3
Pp3c9_20560V3
Pp3c9_20950V3
Pp3c9_21250V3
Pp3c9_21330V3
Pp3c9_21470V3
Pp3c9_21840V3
Pp3c9_22160V3
Pp3c9_22230V3
Pp3c9_22280V3
Pp3c9_22290V3
Pp3c9_22420V3
Pp3c9_23170V3
Pp3c9_23930V3
Pp3c9_24170V3
Pp3c9_24220V3
Pp3c9_2440V3
Pp3c9_24450V3
Pp3c9_24780V3
Pp3c9_24890V3
Pp3c9_25220V3
Pp3c9_25360V3
Pp3c9_25390V3
Pp3c9_25400V3
Pp3c9_25570V3
Pp3c9_2770V3
Pp3c9_2771V3
Pp3c9_3300V3
Pp3c9_3340V3
Pp3c9_3860V3
Pp3c9_4230V3
Pp3c9_4400V3
Pp3c9_4590V3
Pp3c9_470V3
Pp3c9_4770V3
Pp3c9_4870V3
Pp3c9_4910V3
Pp3c9_5650V3
Pp3c9_6000V3
Pp3c9_60V3
Pp3c9_6339V3
Pp3c9_6350V3
Pp3c9_6780V3
Pp3c9_7400V3
Pp3c9_8270V3
Pp3c9_8580V3
Pp3c9_8840V3
Pp3s121_40V3
Pp3s241_30V3
Pp3s30_1150V3
Pp3s30_210V3
Pp3s30_340V3
Pp3s30_380V3
Pp3s30_381V3
Pp3s30_90V3
Pp3s32_10V3
Pp3s32_220V3
Pp3s32_240V3
Pp3s32_260V3
Pp3s32_300V3
Pp3s32_550V3
Pp3s32_610V3
Pp3s32_630V3
Pp3s32_693V3
Pp3s34_330V3
Pp3s34_420V3
Pp3s405_10V3
Pp3s405_20V3
Pp3s423_10V3
Pp3s423_30V3
Pp3s42_340V3
Pp3s42_344V3
Pp3s46_220V3
Pp3s504_10V3
Pp3s58_140V3
Pp3s62_10V3
Pp3s70_90V3
Pp3s76_20V3
Pp3s92_110V3
Pp3s92_30V3
Pp3s92_50V3
Pp3s93_30V3
