{
	"n_targets": 87533,
	"n_bootstraps": 100,
	"n_processed": 16992470,
	"n_pseudoaligned": 16223271,
	"n_unique": 898815,
	"p_pseudoaligned": 95.5,
	"p_unique": 5.3,
	"kallisto_version": "0.48.0",
	"index_version": 10,
	"start_time": "Fri Mar  3 18:28:59 2023",
	"call": "kallisto quant --bootstrap-samples 100 --rf-stranded -t 20 -i /scratch/users/dadras/Stress_profiling_of_physcomitrium_patens/kallisto_index/Ppatens_318_v3.3.transcript.fa.idx -o /scratch/users/dadras/Stress_profiling_of_physcomitrium_patens/kallisto/P_1_3_EKRN220057172-1A_H223VDSX5_L3 /scratch/users/dadras/Stress_profiling_of_physcomitrium_patens/trimmed_reads_PE/P_1_3_EKRN220057172-1A_H223VDSX5_L3_1.fq.gz /scratch/users/dadras/Stress_profiling_of_physcomitrium_patens/trimmed_reads_PE/P_1_3_EKRN220057172-1A_H223VDSX5_L3_2.fq.gz"
}
