PCs	condition	treatment	replicate	time_after_t0	temperature	light_intensity
PC_1	0.5117729111576739	0.43074013182691806	0.7794484265004755	0.1681928197006378	8.55463866150545e-6	0.21298170239906777
PC_2	6.67881264354832e-5	0.0085191634218164565	0.3821310071953118	4.0441249321208224e-15	0.06710706788006944	0.2838759979451138
PC_3	0.47101426387132683	0.06739266795011016	0.4833266214999221	0.0018460788857448181	0.07363171187323558	0.5085904725328733
PC_4	1.2224654495856738e-4	2.3604231733250804e-4	0.4540102034061232	0.08680383327698578	0.0479711344007726	0.08030723123377542
