"","x"
"1","Zci_08918"
"2","Zci_12483"
"3","Zci_00054"
"4","Zci_04612"
"5","Zci_04283"
"6","Zci_07585"
"7","Zci_06221"
"8","Zci_04459"
"9","Zci_07835"
"10","Zci_06741"
"11","Zci_09671"
"12","Zci_03610"
"13","Zci_07118"
"14","Zci_11476"
"15","Zci_05317"
"16","Zci_15564"
"17","Zci_14212"
"18","Zci_16532"
"19","Zci_07526"
"20","Zci_14322"
