AT1G01010
AT1G01230
AT1G02310
AT1G02930
AT1G03220
AT1G03680
AT1G03850
AT1G04580
AT1G05240
AT1G05250
AT1G05260
AT1G05340
AT1G05680
AT1G05690
AT1G05870
AT1G06800
AT1G07135
AT1G07380
AT1G07400
AT1G07530
AT1G07570
AT1G07890
AT1G08830
AT1G09000
AT1G09080
AT1G09350
AT1G09940
AT1G09970
AT1G10040
AT1G10090
AT1G10140
AT1G10410
AT1G10650
AT1G11050
AT1G11210
AT1G11650
AT1G11760
AT1G12480
AT1G12520
AT1G13340
AT1G13520
AT1G14540
AT1G14550
AT1G14870
AT1G15380
AT1G15520
AT1G16420
AT1G17147
AT1G18150
AT1G18300
AT1G18660
AT1G19020
AT1G19210
AT1G19380
AT1G19570
AT1G20310
AT1G20620
AT1G20630
AT1G21240
AT1G21310
AT1G21520
AT1G22400
AT1G22770
AT1G23710
AT1G24110
AT1G24145
AT1G25390
AT1G25400
AT1G26320
AT1G27100
AT1G27330
AT1G27510
AT1G27730
AT1G28600
AT1G30460
AT1G30757
AT1G30850
AT1G30870
AT1G31130
AT1G31170
AT1G31750
AT1G31770
AT1G32220
AT1G32230
AT1G32540
AT1G32870
AT1G32910
AT1G32970
AT1G34190
AT1G34370
AT1G34420
AT1G34510
AT1G35580
AT1G35720
AT1G35910
AT1G36622
AT1G43850
AT1G44970
AT1G45145
AT1G49300
AT1G49540
AT1G49570
AT1G49670
AT1G50020
AT1G50170
AT1G50290
AT1G51400
AT1G51820
AT1G52100
AT1G52130
AT1G52200
AT1G52245
AT1G52500
AT1G52565
AT1G52760
AT1G52855
AT1G53130
AT1G53540
AT1G53625
AT1G53670
AT1G53990
AT1G54010
AT1G54050
AT1G55230
AT1G56150
AT1G56560
AT1G56600
AT1G56650
AT1G59590
AT1G59860
AT1G59910
AT1G60470
AT1G60740
AT1G61120
AT1G61890
AT1G62380
AT1G63460
AT1G63720
AT1G63830
AT1G64140
AT1G64360
AT1G64610
AT1G64750
AT1G64900
AT1G64950
AT1G65610
AT1G65970
AT1G65980
AT1G65990
AT1G66100
AT1G66160
AT1G66330
AT1G66550
AT1G66730
AT1G66880
AT1G66950
AT1G67000
AT1G67980
AT1G68620
AT1G68850
AT1G69150
AT1G69190
AT1G69610
AT1G69790
AT1G69890
AT1G70420
AT1G70520
AT1G70610
AT1G71520
AT1G71695
AT1G72060
AT1G72520
AT1G73120
AT1G73260
AT1G73510
AT1G73540
AT1G73680
AT1G74430
AT1G74640
AT1G74790
AT1G75100
AT1G75270
AT1G75280
AT1G76080
AT1G76160
AT1G76360
AT1G76410
AT1G77100
AT1G77120
AT1G77145
AT1G77370
AT1G77490
AT1G77640
AT1G77660
AT1G78070
AT1G78380
AT1G78410
AT1G79510
AT1G79600
AT1G80130
AT1G80240
AT1G80300
AT1G80610
AT2G01980
AT2G03050
AT2G03380
AT2G03445
AT2G04795
AT2G05590
AT2G05710
AT2G06050
AT2G07738
AT2G13800
AT2G14290
AT2G15220
AT2G15560
AT2G15760
AT2G16500
AT2G17420
AT2G18030
AT2G18140
AT2G18150
AT2G18170
AT2G18193
AT2G18210
AT2G18690
AT2G18980
AT2G19310
AT2G19590
AT2G19810
AT2G20142
AT2G20270
AT2G21195
AT2G22080
AT2G22170
AT2G22420
AT2G23140
AT2G23320
AT2G24150
AT2G24195
AT2G24550
AT2G24800
AT2G25080
AT2G25460
AT2G25625
AT2G25735
AT2G26150
AT2G26300
AT2G26695
AT2G27290
AT2G27310
AT2G28190
AT2G29450
AT2G29500
AT2G29670
AT2G30100
AT2G30550
AT2G30720
AT2G31320
AT2G31570
AT2G31870
AT2G31990
AT2G32030
AT2G32700
AT2G33710
AT2G34060
AT2G34910
AT2G35380
AT2G35510
AT2G35710
AT2G37040
AT2G37130
AT2G37860
AT2G38000
AT2G38380
AT2G38390
AT2G38790
AT2G39040
AT2G39460
AT2G39650
AT2G39770
AT2G39800
AT2G40000
AT2G40095
AT2G40270
AT2G40300
AT2G40750
AT2G40880
AT2G41090
AT2G41480
AT2G41640
AT2G41680
AT2G41730
AT2G42760
AT2G43320
AT2G43350
AT2G43480
AT2G43790
AT2G44240
AT2G44270
AT2G44500
AT2G44790
AT2G45760
AT2G46140
AT2G46370
AT2G47060
AT2G47180
AT2G47370
AT2G47900
AT2G47950
AT2G48150
AT3G01090
AT3G01190
AT3G01420
AT3G01820
AT3G02790
AT3G02840
AT3G02860
AT3G03080
AT3G03100
AT3G03170
AT3G03190
AT3G03670
AT3G04120
AT3G04640
AT3G05937
AT3G05970
AT3G06050
AT3G06110
AT3G06590
AT3G06620
AT3G06930
AT3G07700
AT3G07930
AT3G08640
AT3G08670
AT3G08760
AT3G09640
AT3G10020
AT3G10920
AT3G10930
AT3G10985
AT3G11050
AT3G11220
AT3G11630
AT3G12260
AT3G12490
AT3G12830
AT3G13600
AT3G13610
AT3G13650
AT3G13910
AT3G14110
AT3G14260
AT3G14430
AT3G14990
AT3G15360
AT3G15518
AT3G15530
AT3G15810
AT3G16510
AT3G16670
AT3G16890
AT3G16990
AT3G17070
AT3G17790
AT3G17800
AT3G18950
AT3G19030
AT3G20340
AT3G20370
AT3G21650
AT3G21770
AT3G22380
AT3G23020
AT3G23400
AT3G23910
AT3G25250
AT3G25530
AT3G25600
AT3G25730
AT3G25882
AT3G26060
AT3G26450
AT3G26690
AT3G26820
AT3G27210
AT3G27350
AT3G28200
AT3G28340
AT3G28580
AT3G29035
AT3G29250
AT3G30775
AT3G32980
AT3G42570
AT3G43270
AT3G44340
AT3G45640
AT3G46090
AT3G46230
AT3G46280
AT3G46930
AT3G47450
AT3G47860
AT3G48090
AT3G48360
AT3G48890
AT3G49110
AT3G49120
AT3G49260
AT3G49570
AT3G49780
AT3G49790
AT3G49845
AT3G49940
AT3G49960
AT3G50310
AT3G50770
AT3G50990
AT3G51610
AT3G52740
AT3G52800
AT3G52960
AT3G53150
AT3G53260
AT3G53990
AT3G54200
AT3G55280
AT3G55430
AT3G55950
AT3G56090
AT3G56240
AT3G56400
AT3G57450
AT3G57460
AT3G57520
AT3G59845
AT3G60200
AT3G60450
AT3G60980
AT3G61280
AT3G61930
AT3G62010
AT3G62030
AT3G62770
AT3G63080
AT3G63380
AT4G00290
AT4G00860
AT4G00955
AT4G01090
AT4G01895
AT4G01970
AT4G02380
AT4G03240
AT4G03520
AT4G04480
AT4G04800
AT4G05010
AT4G08390
AT4G08770
AT4G08780
AT4G08920
AT4G08940
AT4G09010
AT4G09320
AT4G10090
AT4G10250
AT4G11170
AT4G11190
AT4G11280
AT4G11290
AT4G11300
AT4G11600
AT4G11830
AT4G11850
AT4G12000
AT4G12570
AT4G12720
AT4G12735
AT4G13395
AT4G13540
AT4G14030
AT4G15236
AT4G15610
AT4G16270
AT4G17040
AT4G17070
AT4G17410
AT4G17490
AT4G17690
AT4G17900
AT4G18880
AT4G19970
AT4G20190
AT4G20380
AT4G20830
AT4G21830
AT4G21840
AT4G21850
AT4G21860
AT4G21870
AT4G21903
AT4G21910
AT4G21926
AT4G21960
AT4G22690
AT4G22780
AT4G23100
AT4G23140
AT4G23150
AT4G23190
AT4G23220
AT4G23810
AT4G24110
AT4G24380
AT4G24410
AT4G24520
AT4G25100
AT4G25130
AT4G25390
AT4G25980
AT4G26010
AT4G26070
AT4G26860
AT4G26965
AT4G26970
AT4G27652
AT4G27654
AT4G27657
AT4G28088
AT4G28703
AT4G28730
AT4G29780
AT4G30170
AT4G30370
AT4G30470
AT4G30780
AT4G31390
AT4G31510
AT4G31760
AT4G31870
AT4G32320
AT4G32551
AT4G32770
AT4G33420
AT4G33630
AT4G33870
AT4G34540
AT4G34710
AT4G34890
AT4G35000
AT4G35060
AT4G35090
AT4G35460
AT4G35770
AT4G35970
AT4G36430
AT4G36500
AT4G36530
AT4G36670
AT4G37370
AT4G37520
AT4G37530
AT4G37610
AT4G37840
AT4G39640
AT4G39780
AT5G01260
AT5G01410
AT5G01600
AT5G01820
AT5G02230
AT5G02270
AT5G03280
AT5G03380
AT5G04830
AT5G05140
AT5G05300
AT5G05340
AT5G05410
AT5G06290
AT5G06720
AT5G06730
AT5G07460
AT5G07470
AT5G07860
AT5G08240
AT5G09830
AT5G10720
AT5G10750
AT5G11975
AT5G12020
AT5G12030
AT5G12080
AT5G12930
AT5G13210
AT5G13240
AT5G13550
AT5G13650
AT5G13680
AT5G13930
AT5G14130
AT5G14545
AT5G14565
AT5G14700
AT5G15180
AT5G15870
AT5G16200
AT5G16360
AT5G16370
AT5G16470
AT5G16960
AT5G16970
AT5G16980
AT5G16990
AT5G17000
AT5G17305
AT5G17820
AT5G18040
AT5G18100
AT5G18270
AT5G18490
AT5G19120
AT5G19230
AT5G19790
AT5G19875
AT5G19880
AT5G19890
AT5G20140
AT5G20230
AT5G20250
AT5G20500
AT5G21100
AT5G21280
AT5G21940
AT5G21960
AT5G22410
AT5G22545
AT5G23310
AT5G24070
AT5G24110
AT5G24600
AT5G24640
AT5G24770
AT5G24890
AT5G25620
AT5G25930
AT5G26030
AT5G26270
AT5G26280
AT5G27600
AT5G27830
AT5G28030
AT5G36220
AT5G36920
AT5G36925
AT5G37670
AT5G37770
AT5G37940
AT5G37980
AT5G38000
AT5G38200
AT5G39050
AT5G39580
AT5G39610
AT5G40150
AT5G40210
AT5G40370
AT5G40390
AT5G40460
AT5G40690
AT5G40770
AT5G41150
AT5G42000
AT5G42010
AT5G42180
AT5G42380
AT5G42980
AT5G43750
AT5G44380
AT5G44390
AT5G44650
AT5G44660
AT5G45010
AT5G46350
AT5G47000
AT5G47650
AT5G48540
AT5G48657
AT5G49570
AT5G50350
AT5G50361
AT5G50760
AT5G51020
AT5G51440
AT5G51740
AT5G51890
AT5G52310
AT5G53050
AT5G53590
AT5G53760
AT5G54500
AT5G54810
AT5G55120
AT5G55180
AT5G55580
AT5G55970
AT5G56550
AT5G56870
AT5G57010
AT5G57345
AT5G57480
AT5G58070
AT5G58390
AT5G58400
AT5G58940
AT5G58980
AT5G59080
AT5G59490
AT5G59510
AT5G59530
AT5G59720
AT5G59820
AT5G61640
AT5G62140
AT5G62150
AT5G62180
AT5G62770
AT5G63030
AT5G63130
AT5G63160
AT5G63310
AT5G63980
AT5G64100
AT5G64110
AT5G64120
AT5G64260
AT5G64660
AT5G64940
AT5G65660
AT5G65840
AT5G65870
AT5G66390
AT5G66631
AT5G66675
AT5G66790
AT5G67340
AT5G67400
AT5G67480
