"","ID","Description","GeneRatio","BgRatio","pvalue","p.adjust","qvalue","geneID","Count"
"GO:0019915","GO:0019915","lipid storage","1/2","15/5146",0.00582183903487576,0.0883111114636296,0.0782813176408905,"Zci_06909",1
"GO:0051235","GO:0051235","maintenance of location","1/2","28/5146",0.0108536846530295,0.0883111114636296,0.0782813176408905,"Zci_06909",1
"GO:0010876","GO:0010876","lipid localization","1/2","36/5146",0.0139438597047836,0.0883111114636296,0.0782813176408905,"Zci_06909",1
"GO:0042742","GO:0042742","defense response to bacterium","1/2","136/5146",0.0521631338671719,0.14339611809412,0.127110132382599,"Zci_06909",1
"GO:0046686","GO:0046686","response to cadmium ion","1/2","137/5146",0.0525415118576442,0.14339611809412,0.127110132382599,"Zci_06909",1
"GO:0009617","GO:0009617","response to bacterium","1/2","153/5146",0.0585852863159588,0.14339611809412,0.127110132382599,"Zci_06909",1
"GO:0010038","GO:0010038","response to metal ion","1/2","194/5146",0.0739841903115142,0.14339611809412,0.127110132382599,"Zci_06909",1
"GO:0009651","GO:0009651","response to salt stress","1/2","197/5146",0.075105953768993,0.14339611809412,0.127110132382599,"Zci_06909",1
"GO:0006970","GO:0006970","response to osmotic stress","1/2","225/5146",0.0855429618407797,0.14339611809412,0.127110132382599,"Zci_06909",1
"GO:0098542","GO:0098542","defense response to other organism","1/2","226/5146",0.0859146168044698,0.14339611809412,0.127110132382599,"Zci_06909",1
"GO:0006952","GO:0006952","defense response","1/2","256/5146",0.0970291397887231,0.14339611809412,0.127110132382599,"Zci_06909",1
"GO:0033036","GO:0033036","macromolecule localization","1/2","295/5146",0.111376381100439,0.14339611809412,0.127110132382599,"Zci_06909",1
"GO:0043207","GO:0043207","response to external biotic stimulus","1/2","298/5146",0.112475256051007,0.14339611809412,0.127110132382599,"Zci_06909",1
"GO:0051707","GO:0051707","response to other organism","1/2","298/5146",0.112475256051007,0.14339611809412,0.127110132382599,"Zci_06909",1
"GO:0009607","GO:0009607","response to biotic stimulus","1/2","300/5146",0.113207461653252,0.14339611809412,0.127110132382599,"Zci_06909",1
"GO:0010035","GO:0010035","response to inorganic substance","1/2","353/5146",0.132500811106742,0.150111159893417,0.133062524005245,"Zci_06909",1
"GO:0065008","GO:0065008","regulation of biological quality","1/2","358/5146",0.134309985167794,0.150111159893417,0.133062524005245,"Zci_06909",1
"GO:0009605","GO:0009605","response to external stimulus","1/2","446/5146",0.16584234048958,0.169742753578029,0.150464490706286,"Zci_06909",1
"GO:0006355","GO:0006355","regulation of transcription, DNA-templated","1/2","457/5146",0.169742753578029,0.169742753578029,0.150464490706286,"Zci_13650",1
