GeneID	HOG	OG	Gene Tree Parent Clade	A_agrestis_oxf	A_filiculoides	A_thaliana	B_distachyon	C_braunii	C_melkonianii	C_reinhardtii	Closterium_sp_NIES_67	K_nitens	M_endlicherianum	M_polymorpha	M_viride	O_lucimarinus	O_sativa	P_coloniale	P_margaritaceum	P_patens	S_lycopersicum	S_moellendorffii	S_muscicola	Z_circumcarinatum_SAG698_1a	Z_circumcarinatum_SAG698_1b	Z_circumcarinatum_UTEX1559	Z_circumcarinatum_UTEX1560	Z_mays
Me1_v2_0059330	N0.HOG0004478	OG0003391	n0	AagrOXF_evm.TU.utg000042l.32	Azfi_s0015.g013826	AT2G40770	Bradi1g17650	NA	Chrsp64S07159	Cre13.g603400_4532, Cre06.g304000_4532	CLOP_g20108	3451	Me1_v2_0009210, Me1_v2_0059330, Me1_v2_0034900, Me1_v2_0037480, Me1_v2_0059340, Me1_v2_0020180	Mp2g05860	17191	Olucimarinus_15642	LOC_Os07g48270	PRCOL_00006526_RA	pm017339g0010, pm018192.t1, pm018192g0030	Pp3c18_13500	Solyc03g095680, Solyc03g095690	404507, 438275, 6818	SM000084S23148, SM000009S23568, SM000333S12561	Zci1a_03744, Zci1a_37990	Zci_14934	UTEX1559_02969	UTEX1560_07862	Zm00001d022436
Me1_v2_0031310	NA	NA	NA	NA	NA	NA	NA	NA	NA	NA	NA	NA	NA	NA	NA	NA	NA	NA	NA	NA	NA	NA	NA	NA	NA	NA	NA	NA
Me1_v2_0076180	NA	NA	NA	NA	NA	NA	NA	NA	NA	NA	NA	NA	NA	NA	NA	NA	NA	NA	NA	NA	NA	NA	NA	NA	NA	NA	NA	NA
Me1_v2_0149080	N0.HOG0001142	OG0000658	n0	AagrOXF_evm.TU.utg000100l.278	Azfi_s0008.g011419, Azfi_s0538.g076313, Azfi_s0132.g049282, Azfi_s0320.g064478	AT3G14270, AT4G33240, AT1G71010, AT1G34260	Bradi1g60357, Bradi3g37350, Bradi3g36397, Bradi1g44047, Bradi2g56547, Bradi3g13177, Bradi5g27540	CBR_g4068	Chrsp17S02689	Cre12.g523050_4532	CLOP_g15787	12971	Me1_v2_0217670, Me1_v2_0217660, Me1_v2_0149040, Me1_v2_0149050, Me1_v2_0001240, Me1_v2_0149070, Me1_v2_0149080, Me1_v2_0025470, Me1_v2_0149060	Mp2g04850	19017	NA	LOC_Os03g28140, LOC_Os08g34950, LOC_Os08g33200, LOC_Os09g23740, LOC_Os06g14750, LOC_Os09g10650, LOC_Os12g13440, LOC_Os08g01390, LOC_Os04g59540	PRCOL_00002135_RA	pm003221g0070, pm008110g0020, pm024458g0020, pm016855g0010, pm127174g0010, pm001205g0010	Pp3c17_4720, Pp3c14_13540, Pp3c17_19810, Pp3c14_12410	Solyc12g049590, Solyc03g123570, Solyc07g017510, Solyc05g008200, Solyc04g007650, Solyc11g013830, Solyc11g013820, Solyc06g065540	144057, 417958	SM000086S23020, SM000002S05547, SM000015S01185	Zci1a_02363, Zci1a_05061	Zci_10288, Zci_10222	UTEX1559_17480, UTEX1559_01749, UTEX1559_15620	UTEX1560_16833, UTEX1560_11184, UTEX1560_16832, UTEX1560_17385, UTEX1560_19472, UTEX1560_15216	Zm00001d029443, Zm00001d050089, Zm00001d032238, Zm00001d020414, Zm00001d037332, Zm00001d042662, Zm00001d049734, Zm00001d035004, Zm00001d022291, Zm00001d037223, Zm00001d032540, Zm00001d002940
Me1_v2_0195270	N0.HOG0008487	OG0007139	n0	NA	Azfi_s0010.g012372	AT1G21580	Bradi3g44276, Bradi1g30260	CBR_g18950	NA	Cre03.g154900_4532	CLOP_g19692, CLOP_g24926	8455	Me1_v2_0195270	Mp6g05720	19508	NA	LOC_Os06g43120	PRCOL_00003118_RA	NA	Pp3c2_14590	Solyc04g057990	70673	SM000039S14499, SM000008S22224, SM000042S15381	Zci1a_25591	Zci_10571	UTEX1559_13964	UTEX1560_04591	Zm00001d046630
Me1_v2_0078780	NA	NA	NA	NA	NA	NA	NA	NA	NA	NA	NA	NA	NA	NA	NA	NA	NA	NA	NA	NA	NA	NA	NA	NA	NA	NA	NA	NA
Me1_v2_0202630	N0.HOG0018270	OG0016240	n0	NA	NA	NA	NA	NA	NA	NA	NA	NA	Me1_v2_0202630	NA	NA	NA	NA	NA	pm034999g0020	NA	NA	NA	NA	NA	Zci_15026	UTEX1559_17383	UTEX1560_11439, UTEX1560_14432	NA
Me1_v2_0102180	N0.HOG0023040	OG0020899	n0	NA	NA	NA	NA	CBR_g16083	NA	NA	NA	7402, 9585	Me1_v2_0102180	NA	NA	NA	NA	NA	NA	NA	NA	NA	NA	NA	NA	NA	NA	NA
Me1_v2_0200580	N0.HOG0016602	OG0014651	n0	NA	NA	NA	NA	NA	NA	NA	NA	NA	Me1_v2_0058980, Me1_v2_0188930, Me1_v2_0015220, Me1_v2_0064830, Me1_v2_0200580, Me1_v2_0064840, Me1_v2_0218020	NA	NA	NA	NA	NA	NA	NA	NA	NA	NA	NA	NA	NA	NA	NA
Me1_v2_0172180	N0.HOG0039658	OG0037481	-	NA	NA	NA	NA	NA	NA	NA	NA	NA	Me1_v2_0078920, Me1_v2_0172180	NA	NA	NA	NA	NA	NA	NA	NA	NA	NA	NA	NA	NA	NA	NA
Me1_v2_0149060	N0.HOG0001142	OG0000658	n0	AagrOXF_evm.TU.utg000100l.278	Azfi_s0008.g011419, Azfi_s0538.g076313, Azfi_s0132.g049282, Azfi_s0320.g064478	AT3G14270, AT4G33240, AT1G71010, AT1G34260	Bradi1g60357, Bradi3g37350, Bradi3g36397, Bradi1g44047, Bradi2g56547, Bradi3g13177, Bradi5g27540	CBR_g4068	Chrsp17S02689	Cre12.g523050_4532	CLOP_g15787	12971	Me1_v2_0217670, Me1_v2_0217660, Me1_v2_0149040, Me1_v2_0149050, Me1_v2_0001240, Me1_v2_0149070, Me1_v2_0149080, Me1_v2_0025470, Me1_v2_0149060	Mp2g04850	19017	NA	LOC_Os03g28140, LOC_Os08g34950, LOC_Os08g33200, LOC_Os09g23740, LOC_Os06g14750, LOC_Os09g10650, LOC_Os12g13440, LOC_Os08g01390, LOC_Os04g59540	PRCOL_00002135_RA	pm003221g0070, pm008110g0020, pm024458g0020, pm016855g0010, pm127174g0010, pm001205g0010	Pp3c17_4720, Pp3c14_13540, Pp3c17_19810, Pp3c14_12410	Solyc12g049590, Solyc03g123570, Solyc07g017510, Solyc05g008200, Solyc04g007650, Solyc11g013830, Solyc11g013820, Solyc06g065540	144057, 417958	SM000086S23020, SM000002S05547, SM000015S01185	Zci1a_02363, Zci1a_05061	Zci_10288, Zci_10222	UTEX1559_17480, UTEX1559_01749, UTEX1559_15620	UTEX1560_16833, UTEX1560_11184, UTEX1560_16832, UTEX1560_17385, UTEX1560_19472, UTEX1560_15216	Zm00001d029443, Zm00001d050089, Zm00001d032238, Zm00001d020414, Zm00001d037332, Zm00001d042662, Zm00001d049734, Zm00001d035004, Zm00001d022291, Zm00001d037223, Zm00001d032540, Zm00001d002940
Me1_v2_0066760	N0.HOG0002382	OG0001581	n0	AagrOXF_evm.TU.utg000006l.175, AagrOXF_evm.TU.utg000042l.135, AagrOXF_evm.TU.utg000042l.136	Azfi_s0084.g039059, Azfi_s0157.g053791	AT5G08630	Bradi3g45850, Bradi5g10777	CBR_g15970, CBR_g31873, CBR_g31875	Chrsp51S09106	Cre06.g800642_4532	CLOP_g18870	11308, 12934	Me1_v2_0020390, Me1_v2_0039530, Me1_v2_0133620, Me1_v2_0066760, Me1_v2_0066770	Mp1g09390	13531	Olucimarinus_32644	LOC_Os02g35100, LOC_Os04g35864	NA	pm018453g0010, pm009740.t1, pm014034g0010	Pp3c2_17910, Pp3c1_29082, Pp3c1_29080	Solyc05g056530	107792, 100168, 107876	SM000157S02065, SM000059S18677, SM000148S01033, SM000024S07833, SM000006S19412, SM005028S17503, SM003599S13201, SM000008S22340	Zci1a_20818, Zci1a_28196, Zci1a_34873, Zci1a_24773	Zci_01836, Zci_01569	UTEX1559_13947, UTEX1559_11521	UTEX1560_07686, UTEX1560_02277	Zm00001d050753, Zm00001d016827
Me1_v2_0090020	N0.HOG0003167	OG0002242	n0	NA	Azfi_s0359.g066851	AT5G24740	Bradi3g13757	CBR_g4651, CBR_g47049, CBR_g47051	Chrsp94S09266	Cre17.g727600_4532	CLOP_g2593, CLOP_g2592	2945	Me1_v2_0029300, Me1_v2_0090030, Me1_v2_0090010, Me1_v2_0034400, Me1_v2_0090020	Mp7g13250	17523, 17522	Olucimarinus_30879	LOC_Os08g02350, LOC_Os08g02354	PRCOL_00006863_RA	pm025410g0010, pm256493g0010, pm002536.t1, pm002563g0020, pm015239g0020, pm002378g0040	Pp3c15_25690	Solyc11g045160, Solyc11g045140.1	417519, 439148	SM000012S25271, SM000108S14241, SM000230S07331	Zci1a_18821, Zci1a_18822, Zci1a_27423, Zci1a_17286	Zci_09547	UTEX1559_02381	UTEX1560_08886	Zm00001d032729, Zm00001d035088, Zm00001d035089
Me1_v2_0065430	N0.HOG0001267	OG0000740	n32	AagrOXF_evm.TU.utg000091l.529	Azfi_s0155.g053602	AT2G16920, AT2G33770	Bradi2g07970, Bradi2g16950, Bradi2g04101, Bradi2g27322, Bradi3g06517, Bradi2g01840, Bradi2g16960	NA	Chrsp36S05424	NA	CLOP_g4814, CLOP_g10791	5370	Me1_v2_0065430, Me1_v2_0065410, Me1_v2_0065420	Mp7g09720	28420, 28421	NA	LOC_Os01g13280, LOC_Os09g12310, LOC_Os01g48580, LOC_Os05g48380, LOC_Os05g06120, LOC_Os01g03520, LOC_Os05g48390	PRCOL_00003480_RA	pm001376g0050, pm005781g0030, pm003087.t1	Pp3c15_4860, Pp3c14_3350	Solyc01g111680, Solyc02g078210	30432	SM000004S15024, SM000007S20813	Zci1a_04334, Zci1a_17576	Zci_10648	UTEX1559_07243	UTEX1560_03366	Zm00001d051483, Zm00001d049101, Zm00001d015028, Zm00001d047959, Zm00001d039280, Zm00001d038972, Zm00001d009513, Zm00001d040036, Zm00001d008520
Me1_v2_0036440	NA	NA	NA	NA	NA	NA	NA	NA	NA	NA	NA	NA	NA	NA	NA	NA	NA	NA	NA	NA	NA	NA	NA	NA	NA	NA	NA	NA
Me1_v2_0158950	N0.HOG0012520	OG0010860	n0	NA	NA	NA	NA	NA	NA	NA	CLOP_g7399	6725	Me1_v2_0050310, Me1_v2_0217200, Me1_v2_0158940, Me1_v2_0022030, Me1_v2_0031120, Me1_v2_0158950	NA	NA	NA	NA	NA	NA	NA	NA	NA	NA	Zci1a_27030	Zci_09756	UTEX1559_00637	UTEX1560_12487	NA
Me1_v2_0149540	NA	NA	NA	NA	NA	NA	NA	NA	NA	NA	NA	NA	NA	NA	NA	NA	NA	NA	NA	NA	NA	NA	NA	NA	NA	NA	NA	NA
Me1_v2_0109850	N0.HOG0001956	OG0001242	n0	AagrOXF_evm.TU.utg000085l.60, AagrOXF_evm.TU.utg000085l.65, AagrOXF_evm.TU.utg000006l.673	Azfi_s0203.g057681, Azfi_s0004.g008527, Azfi_s0211.g058121, Azfi_s0015.g013833, Azfi_s1010.g095172	AT3G18390, AT5G16180, AT3G23070, AT4G14510, AT4G29750, AT3G01370	Bradi2g17390, Bradi3g21852, Bradi4g14900, Bradi4g28800, Bradi5g12660	CBR_g48995	NA	NA	CLOP_g9596	4387	Me1_v2_0109850, Me1_v2_0047640, Me1_v2_0109840	Mp3g06280	NA	NA	LOC_Os05g47850, LOC_Os08g27150, LOC_Os11g37990, LOC_Os09g19850, LOC_Os04g39060	NA	pm014170g0020, pm029443g0010, pm038928g0020, pm003582g0040	Pp3c7_23880, Pp3c13_17270, Pp3c12_15870	Solyc03g119450, Solyc02g086200, Solyc09g083350, Solyc07g039500, Solyc02g087250, Solyc08g044240.1	120007, 412905, 20706	SM000124S25935, SM000079S22436, SM000088S23713, SM005632S18592, SM005549S17878	Zci1a_22474	Zci_00858	UTEX1559_04462	UTEX1560_01672	Zm00001d038922, Zm00001d023211, Zm00001d032373, Zm00001d007572, Zm00001d020230, Zm00001d025633, Zm00001d025629
Me1_v2_0133620	N0.HOG0002382	OG0001581	n0	AagrOXF_evm.TU.utg000006l.175, AagrOXF_evm.TU.utg000042l.135, AagrOXF_evm.TU.utg000042l.136	Azfi_s0084.g039059, Azfi_s0157.g053791	AT5G08630	Bradi3g45850, Bradi5g10777	CBR_g15970, CBR_g31873, CBR_g31875	Chrsp51S09106	Cre06.g800642_4532	CLOP_g18870	11308, 12934	Me1_v2_0020390, Me1_v2_0039530, Me1_v2_0133620, Me1_v2_0066760, Me1_v2_0066770	Mp1g09390	13531	Olucimarinus_32644	LOC_Os02g35100, LOC_Os04g35864	NA	pm018453g0010, pm009740.t1, pm014034g0010	Pp3c2_17910, Pp3c1_29082, Pp3c1_29080	Solyc05g056530	107792, 100168, 107876	SM000157S02065, SM000059S18677, SM000148S01033, SM000024S07833, SM000006S19412, SM005028S17503, SM003599S13201, SM000008S22340	Zci1a_20818, Zci1a_28196, Zci1a_34873, Zci1a_24773	Zci_01836, Zci_01569	UTEX1559_13947, UTEX1559_11521	UTEX1560_07686, UTEX1560_02277	Zm00001d050753, Zm00001d016827
Me1_v2_0078790	NA	NA	NA	NA	NA	NA	NA	NA	NA	NA	NA	NA	NA	NA	NA	NA	NA	NA	NA	NA	NA	NA	NA	NA	NA	NA	NA	NA
Me1_v2_0158940	N0.HOG0012520	OG0010860	n0	NA	NA	NA	NA	NA	NA	NA	CLOP_g7399	6725	Me1_v2_0050310, Me1_v2_0217200, Me1_v2_0158940, Me1_v2_0022030, Me1_v2_0031120, Me1_v2_0158950	NA	NA	NA	NA	NA	NA	NA	NA	NA	NA	Zci1a_27030	Zci_09756	UTEX1559_00637	UTEX1560_12487	NA
Me1_v2_0065140	N0.HOG0002521	OG0001687	n0	NA	Azfi_s0024.g020370, Azfi_s0213.g058242	AT2G28780, AT3G09450	Bradi4g45370	CBR_g12469	NA	NA	CLOP_g15713	1955, 13716, 8338	Me1_v2_0141470, Me1_v2_0141480, Me1_v2_0065140, Me1_v2_0031520	Mp2g20340, Mpzg01320, Mp3g16900, Mp1g05720, Mp3g24890	5299, 5300, 5301, 15719, 26253, 26252, 26254	NA	LOC_Os12g01020, LOC_Os11g01030, LOC_Os05g41300	NA	NA	NA	Solyc11g066140, Solyc06g075970, Solyc09g010570.1, Solyc10g084720.1	409071, 409072, 404621, 419949	SM000016S01810, SM000108S14223, SM000307S11681, SM000108S14231, SM000301S11772, SM000035S13148, SM000132S26854, SM000269S09897, SM000119S25650, SM000149S01323	Zci1a_36855, Zci1a_01834, Zci1a_02780	Zci_05854	UTEX1559_06546	UTEX1560_03218, UTEX1560_03219	Zm00001d044596
Me1_v2_0114690	N0.HOG0003036	OG0002127	n0	AagrOXF_evm.TU.utg000042l.523	Azfi_s0087.g042229	AT5G12400, AT5G35210, AT5G22760	Bradi1g18770, Bradi4g42780, Bradi4g26627	CBR_g33928	NA	Cre05.g247000_4532	CLOP_g11352	3361, 3254	Me1_v2_0114700, Me1_v2_0114690, Me1_v2_0000490	Mp4g03480	19580	NA	LOC_Os01g58880, LOC_Os07g46690, LOC_Os11g05130	PRCOL_00000281_RA	pm012535g0020, pm013352g0030	Pp3c7_5480	Solyc01g058550.1, Solyc11g065160, Solyc11g066780, Solyc06g074640	441144	SM003191S12255, SM002975S10815, SM000196S05364, SM000084S23117, SM000051S17594, SM003033S11651, SM000058S18477	Zci1a_14291, Zci1a_34893	Zci_14952, Zci_14941	UTEX1559_02976	UTEX1560_09875, UTEX1560_14721	Zm00001d022417, Zm00001d033653, Zm00001d023391, Zm00001d004925
Me1_v2_0151040	NA	NA	NA	NA	NA	NA	NA	NA	NA	NA	NA	NA	NA	NA	NA	NA	NA	NA	NA	NA	NA	NA	NA	NA	NA	NA	NA	NA
Me1_v2_0151030	N0.HOG0009171	OG0007775	n0	AagrOXF_evm.TU.utg000045l.72__73	Azfi_s0001.g000192	AT1G77620	Bradi1g67387	CBR_g29736	Chrsp29S04548	Cre07.g347550_4532	CLOP_g4697	11738	Me1_v2_0151030, Me1_v2_0047020	Mp3g01040	22200	Olucimarinus_15652	LOC_Os03g15580	NA	NA	Pp3c13_19570, Pp3c12_8350	Solyc06g060350	NA	SM000016S01845, SM000175S03301, SM000101S09283	NA	NA	NA	NA	Zm00001d047873
Me1_v2_0076160	N0.HOG0006394	OG0005146	n0	AagrOXF_evm.TU.utg000126l.255	Azfi_s0313.g064213	AT2G40700	Bradi2g39180	CBR_g25740	Chrsp26S04189	Cre03.g188550_4532	CLOP_g5591, CLOP_g14216	1360	Me1_v2_0076150, Me1_v2_0030520, Me1_v2_0076160	Mp6g05260	16962	Olucimarinus_1511	LOC_Os05g01990	PRCOL_00004347_RA	pm001984g0020, pm018886g0010, pm000068.t2, pm001984g0030	Pp3c17_13450	Solyc07g042270	62176	SM000200S05828, SM000214S06780	Zci1a_23079	Zci_12476	UTEX1559_03243	UTEX1560_15134	Zm00001d010225
Me1_v2_0141620	NA	NA	NA	NA	NA	NA	NA	NA	NA	NA	NA	NA	NA	NA	NA	NA	NA	NA	NA	NA	NA	NA	NA	NA	NA	NA	NA	NA
Me1_v2_0149240	N0.HOG0039610	OG0037433	-	NA	NA	NA	NA	NA	NA	NA	NA	NA	Me1_v2_0149240, Me1_v2_0050300	NA	NA	NA	NA	NA	NA	NA	NA	NA	NA	NA	NA	NA	NA	NA
Me1_v2_0047640	N0.HOG0001956	OG0001242	n0	AagrOXF_evm.TU.utg000085l.60, AagrOXF_evm.TU.utg000085l.65, AagrOXF_evm.TU.utg000006l.673	Azfi_s0203.g057681, Azfi_s0004.g008527, Azfi_s0211.g058121, Azfi_s0015.g013833, Azfi_s1010.g095172	AT3G18390, AT5G16180, AT3G23070, AT4G14510, AT4G29750, AT3G01370	Bradi2g17390, Bradi3g21852, Bradi4g14900, Bradi4g28800, Bradi5g12660	CBR_g48995	NA	NA	CLOP_g9596	4387	Me1_v2_0109850, Me1_v2_0047640, Me1_v2_0109840	Mp3g06280	NA	NA	LOC_Os05g47850, LOC_Os08g27150, LOC_Os11g37990, LOC_Os09g19850, LOC_Os04g39060	NA	pm014170g0020, pm029443g0010, pm038928g0020, pm003582g0040	Pp3c7_23880, Pp3c13_17270, Pp3c12_15870	Solyc03g119450, Solyc02g086200, Solyc09g083350, Solyc07g039500, Solyc02g087250, Solyc08g044240.1	120007, 412905, 20706	SM000124S25935, SM000079S22436, SM000088S23713, SM005632S18592, SM005549S17878	Zci1a_22474	Zci_00858	UTEX1559_04462	UTEX1560_01672	Zm00001d038922, Zm00001d023211, Zm00001d032373, Zm00001d007572, Zm00001d020230, Zm00001d025633, Zm00001d025629
Me1_v2_0088410	N0.HOG0007270	OG0005980	n0	AagrOXF_evm.TU.utg000010l.466, AagrOXF_evm.TU.utg000091l.202	Azfi_s0373.g067183	AT5G42670, AT5G52070	Bradi2g13380, Bradi2g36700	CBR_g50140	NA	NA	NA	8077, 8076, 8084, 8105	Me1_v2_0088410	Mp8g07810, Mp1g20800	NA	NA	LOC_Os05g04860	NA	NA	Pp3c1_19590	Solyc09g089570, Solyc03g005440	405024	NA	Zci1a_03902, Zci1a_15132, Zci1a_03903, Zci1a_03904	Zci_07098	UTEX1559_09663	UTEX1560_00072	Zm00001d024788, Zm00001d006787
Me1_v2_0182240	N0.HOG0003280	OG0002340	n0	AagrOXF_evm.TU.utg000085l.89, AagrOXF_evm.TU.utg000100l.382, AagrOXF_evm.TU.utg000100l.372	Azfi_s0246.g060033	AT5G58510	Bradi1g65290	CBR_g32390	NA	NA	CLOP_g12767, CLOP_g9460, CLOP_g6617	13310	Me1_v2_0002680, Me1_v2_0182240, Me1_v2_0182220, Me1_v2_0014170	Mp3g06100	21461	NA	LOC_Os03g18440	NA	pm005189g0020, pm020609.t2, pm016347g0030, pm016347g0020, pm003639g0110, pm326542g0010, pm003639g0100, pm020609.t1, pm011583g0040, pm003639.t1	Pp3c20_20284, Pp3c20_20280, Pp3c22_21020, Pp3c17_9080	Solyc06g082200	102852, 415092, 415113	SM000197S05461, SM000051S17519, SM000103S09503	Zci1a_30571, Zci1a_20467	Zci_05921	UTEX1559_06621	UTEX1560_09427	Zm00001d047717
Me1_v2_0229280	N0.HOG0007572	OG0006260	n0	AagrOXF_evm.TU.utg000006l.212	Azfi_s0032.g024789	AT4G34310	Bradi1g72280	CBR_g45541	Chrsp2S08918	Cre16.g686501_4532	CLOP_g21023	10995	Me1_v2_0053660, Me1_v2_0159640, Me1_v2_0229280	Mp1g15520	274, 275	NA	LOC_Os03g08700	PRCOL_00001182_RA	pm045409g0010, pm002857g0020, pm008253g0020	Pp3c17_5660	Solyc04g079280	100397	NA	Zci1a_19863	Zci_04831	UTEX1559_01437	UTEX1560_01187	Zm00001d027943
Me1_v2_0198690	N0.HOG0000874	OG0000497	n45	AagrOXF_evm.TU.utg000116l.131	Azfi_s0008.g011316, Azfi_s0008.g011315, Azfi_s0111.g045570	AT1G67500	Bradi1g18510	CBR_g26315, CBR_g26314	Chrsp37S00424, Chrsp78S07693	Cre03.g198750_4532, Cre09.g387400_4532	CLOP_g25026, CLOP_g5610	13447, 12170, 12430, 7531, 14535, 7529, 2171, 14023	Me1_v2_0027350, Me1_v2_0157860, Me1_v2_0157850, Me1_v2_0009650, Me1_v2_0198690, Me1_v2_0198700	Mp2g15520	14830, 14828, 14829	NA	LOC_Os07g47280, LOC_Os07g10860, LOC_Os07g47284	PRCOL_00003841_RA	pm001154g0140, pm006512g0020, pm002850g0020, pm002402g0030	Pp3c17_18800, Pp3c2_33440	Solyc01g099220	413713	SM000013S26371, SM000393S14709, SM000091S24579, SM000053S17470, SM000282S10608	Zci1a_43274, Zci1a_41660, Zci1a_37869, Zci1a_37870	Zci_03294, Zci_06363	UTEX1559_03429, UTEX1559_06096, UTEX1559_06095	UTEX1560_11622, UTEX1560_05235, UTEX1560_05234	Zm00001d022491
Me1_v2_0197280	NA	NA	NA	NA	NA	NA	NA	NA	NA	NA	NA	NA	NA	NA	NA	NA	NA	NA	NA	NA	NA	NA	NA	NA	NA	NA	NA	NA
Me1_v2_0163720	N0.HOG0001881	OG0001186	n0	AagrOXF_evm.TU.utg000063l.216	Azfi_s0090.g042796	AT1G58230	Bradi1g32510, Bradi3g04840	CBR_g9087, CBR_g9089, CBR_g9085, CBR_g40583	Chrsp1S08783	NA	CLOP_g4473, CLOP_g11369, CLOP_g3413, CLOP_g3414, CLOP_g1267, CLOP_g9415	9701	Me1_v2_0163730, Me1_v2_0000130, Me1_v2_0035580, Me1_v2_0163720	Mp1g22060	3834	Olucimarinus_15102, Olucimarinus_813	LOC_Os06g46475, LOC_Os06g46480, LOC_Os02g06720, LOC_Os02g06725	PRCOL_00007064_RA	pm000859g0030, pm001378g0050, pm005477g0030, pm005477g0020, pm013198g0020, pm000859g0020, pm011252g0010, pm139916g0010, pm035263g0010, pm001176.t1, pm031074g0010, pm001176g0050, pm028372g0030, pm031074g0020, pm006864g0010	Pp3c20_23460	Solyc04g076510, Solyc04g076500	107448, 107849	SM000011S19112, SM000007S21002, SM000026S08992	Zci1a_01858	Zci_11497	UTEX1559_05114	UTEX1560_13698, UTEX1560_14321, UTEX1560_19722	Zm00001d004825, Zm00001d036583, Zm00001d036579, Zm00001d005623, Zm00001d053827, Zm00001d053826
Me1_v2_0222670	N0.HOG0006212	OG0004974	n0	AagrOXF_evm.TU.utg000012l.259	Azfi_s0669.g081777	AT5G58410	Bradi5g18546, Bradi2g62760	CBR_g30901	NA	Cre06.g252100_4532	CLOP_g22122	15195	Me1_v2_0222670	Mp7g07340	18976	Olucimarinus_18578	LOC_Os01g74610	PRCOL_00002801_RA	pm017244g0040, pm018273g0020	Pp3c11_1040	Solyc09g055260	437336	SM000107S14090, SM000133S26789, SM000208S06310	Zci1a_20452, Zci1a_20451	Zci_12998, Zci_13001	UTEX1559_16468, UTEX1559_16469	UTEX1560_17312, UTEX1560_10030	Zm00001d004979
Me1_v2_0197930	N0.HOG0014338	OG0012533	n0	NA	NA	NA	NA	CBR_g52632	NA	Cre03.g209953_4532, Cre16.g686622_4532	NA	NA	Me1_v2_0007540, Me1_v2_0197930	NA	NA	NA	NA	NA	NA	NA	NA	NA	NA	Zci1a_21246	Zci_05838	UTEX1559_06523	UTEX1560_04685	NA
Me1_v2_0006270	NA	NA	NA	NA	NA	NA	NA	NA	NA	NA	NA	NA	NA	NA	NA	NA	NA	NA	NA	NA	NA	NA	NA	NA	NA	NA	NA	NA
Me1_v2_0207770	N0.HOG0005195	OG0004028	n0	AagrOXF_evm.TU.utg000006l.428	Azfi_s0093.g043288	AT1G01970	Bradi1g18720	CBR_g3283, CBR_g23588	NA	NA	CLOP_g24596, CLOP_g783	5960	Me1_v2_0026720, Me1_v2_0207770, Me1_v2_0171030	Mp4g06140	24537	NA	LOC_Os07g46730	NA	pm003532g0090, pm002558g0050, pm011115g0020, pm029645g0010, pm010709g0020	Pp3c10_14800, Pp3c10_14810	Solyc01g091450	71915, 77859	SM000085S23262, SM000001S04785, SM000044S15989	Zci1a_30437, Zci1a_26774	Zci_07683	UTEX1559_06923	UTEX1560_07699, UTEX1560_07700	Zm00001d022514
Me1_v2_0209290	N0.HOG0000675	OG0000361	n79	AagrOXF_evm.TU.utg000011l.125	Azfi_s0019.g015145, Azfi_s0008.g011482, Azfi_s0152.g053417, Azfi_s0032.g024793, Azfi_s0056.g034212	AT4G17895, AT5G46740, AT5G57990	Bradi3g34176, Bradi3g34174, Bradi3g52210, Bradi3g54040, Bradi1g47320	CBR_g10897	Chrsp17S02645	Cre14.g629300_4532	CLOP_g6786, CLOP_g7577	10410	Me1_v2_0127180, Me1_v2_0127170, Me1_v2_0209290, Me1_v2_0209300, Me1_v2_0018070	Mp3g16110	17422, 17423	Olucimarinus_5433	LOC_Os02g46650, LOC_Os02g55180, LOC_Os06g08530	PRCOL_00003230_RA	pm000997g0070	Pp3c21_10760, Pp3c7_9250	Solyc07g005530	1903	SM000132S26911, SM000019S04987, SM000036S13338	Zci1a_28613	Zci_09250	UTEX1559_16968	UTEX1560_04273	Zm00001d047023, Zm00001d051513, Zm00001d017686, Zm00001d045104
Me1_v2_0149010	N0.HOG0005295	OG0004122	n0	AagrOXF_evm.TU.utg000042l.478	Azfi_s0072.g036883	AT2G04660	Bradi5g13780	CBR_g543, CBR_g545	Chrsp57S06846	Cre10.g460532_4532	CLOP_g18565, CLOP_g19587	4453	Me1_v2_0149030, Me1_v2_0149010, Me1_v2_0149020	Mp2g16080	27084, 27085	Olucimarinus_44236	LOC_Os04g40830	PRCOL_00002008_RA	pm001205g0050, pm004193.t2	Pp3c11_22070	Solyc05g007750	79209	SM000015S01182, SM000002S05544, SM000086S23031	Zci1a_38723	Zci_10187, Zci_10186	UTEX1559_02276	UTEX1560_18059, UTEX1560_13812	Zm00001d014685
Me1_v2_0094930	NA	NA	NA	NA	NA	NA	NA	NA	NA	NA	NA	NA	NA	NA	NA	NA	NA	NA	NA	NA	NA	NA	NA	NA	NA	NA	NA	NA
Me1_v2_0056370	N0.HOG0001132	OG0000649	n37	AagrOXF_evm.TU.utg000041l.74	Azfi_s0006.g009840	AT1G77800	Bradi3g57770, Bradi1g46180	CBR_g22311	Chrsp31S04906	Cre17.g802149_4532, Cre14.g614151_4532, Cre17.g745347_4532	CLOP_g19228	14295	Me1_v2_0056370, Me1_v2_0056380	NA	29762	Olucimarinus_8266	LOC_Os02g52960, LOC_Os06g10690	PRCOL_00001313_RA	NA	Pp3c11_12900	Solyc11g013530	424372, 407186	SM000223S07298, SM000016S01980, SM000137S00445	Zci1a_29490	Zci_07169	UTEX1559_02810, UTEX1559_02811	UTEX1560_04500, UTEX1560_04501, UTEX1560_04499, UTEX1560_04498	Zm00001d018199, Zm00001d025805, Zm00001d035855, Zm00001d033342, Zm00001d052149, Zm00001d037156
Me1_v2_0076670	NA	NA	NA	NA	NA	NA	NA	NA	NA	NA	NA	NA	NA	NA	NA	NA	NA	NA	NA	NA	NA	NA	NA	NA	NA	NA	NA	NA
Me1_v2_0204760	N0.HOG0001852	OG0001166	n0	AagrOXF_evm.TU.utg000004l.75, AagrOXF_evm.TU.utg000005l.283, AagrOXF_evm.TU.utg000004l.76	Azfi_s0682.g082025, Azfi_s0013.g013408	AT3G06290, AT3G54380	Bradi1g19627, Bradi1g62340	CBR_g52314	Chrsp115S01685	Cre02.g143600_4532	CLOP_g11588	1561, 9159	Me1_v2_0204750, Me1_v2_0204760, Me1_v2_0167180	Mp1g09900, Mp6g17060	22774, 22772, 22773	Olucimarinus_28983, Olucimarinus_26211	LOC_Os07g45160, LOC_Os03g22870	PRCOL_00005549_RA	pm206563g0010, pm021646g0010, pm017807g0010, pm003245g0020, pm002028g0030, pm012307g0010	Pp3c3_29590, Pp3c21_2030, Pp3c19_5190	Solyc12g035670, Solyc06g061120	81057, 438035	SM000020S05973, SM000234S07914, SM000234S07909, SM000018S03720, SM000195S05261, SM000237S08131, SM000255S08780	Zci1a_18456, Zci1a_09115	Zci_01491, Zci_14491	UTEX1559_16135, UTEX1559_16134, UTEX1559_01098	UTEX1560_03138, UTEX1560_13213	Zm00001d019076, Zm00001d005112, Zm00001d022346, Zm00001d022344, Zm00001d045881, Zm00001d022343, Zm00001d044309, Zm00001d047474
Me1_v2_0054530	NA	NA	NA	NA	NA	NA	NA	NA	NA	NA	NA	NA	NA	NA	NA	NA	NA	NA	NA	NA	NA	NA	NA	NA	NA	NA	NA	NA
Me1_v2_0026950	N0.HOG0004766	OG0003649	n0	AagrOXF_evm.TU.utg000081l.37	Azfi_s0008.g011517	AT2G34357	Bradi3g60080	CBR_g11186, CBR_g11184	Chrsp26S04132	Cre19.g751197_4532	CLOP_g9232, CLOP_g9229	979	Me1_v2_0211130, Me1_v2_0026950	Mp1g25050	19116	Olucimarinus_27511, Olucimarinus_27432	LOC_Os02g54110	PRCOL_00004092_RA	pm009137g0010, pm011465g0010, pm005157g0080, pm009753g0020	Pp3c2_3190, Pp3c1_37650	Solyc07g042380	78845	SM000091S24574, SM000053S17444, SM000282S10601	Zci1a_12602	Zci_09705	UTEX1559_10679	UTEX1560_08630, UTEX1560_14606	Zm00001d049673, Zm00001d018295
Me1_v2_0122260	NA	NA	NA	NA	NA	NA	NA	NA	NA	NA	NA	NA	NA	NA	NA	NA	NA	NA	NA	NA	NA	NA	NA	NA	NA	NA	NA	NA
Me1_v2_0114020	NA	NA	NA	NA	NA	NA	NA	NA	NA	NA	NA	NA	NA	NA	NA	NA	NA	NA	NA	NA	NA	NA	NA	NA	NA	NA	NA	NA
Me1_v2_0021350	NA	NA	NA	NA	NA	NA	NA	NA	NA	NA	NA	NA	NA	NA	NA	NA	NA	NA	NA	NA	NA	NA	NA	NA	NA	NA	NA	NA
Me1_v2_0217140	N0.HOG0004980	OG0003836	n0	AagrOXF_evm.TU.utg000091l.198, AagrOXF_evm.TU.utg000091l.200, AagrOXF_evm.TU.utg000033l.62, AagrOXF_evm.TU.utg000091l.197	Azfi_s0045.g029829	AT3G01160	Bradi1g25780	CBR_g41392	Chrsp26S00309	Cre10.g452500_4532	CLOP_g5912, CLOP_g5911, CLOP_g12448	9107	Me1_v2_0217140	Mp1g25070	19883, 19884	Olucimarinus_26209	LOC_Os07g34740	PRCOL_00004947_RA	pm004015g0010, pm015237g0010	Pp3c17_7210	Solyc02g083470	268496, 268642	SM000010S04360, SM000001S04698, SM000190S04864	Zci1a_42939	Zci_13417	UTEX1559_13567	UTEX1560_15177, UTEX1560_15421	Zm00001d021676
Me1_v2_0111130	NA	NA	NA	NA	NA	NA	NA	NA	NA	NA	NA	NA	NA	NA	NA	NA	NA	NA	NA	NA	NA	NA	NA	NA	NA	NA	NA	NA
Me1_v2_0031520	N0.HOG0002521	OG0001687	n0	NA	Azfi_s0024.g020370, Azfi_s0213.g058242	AT2G28780, AT3G09450	Bradi4g45370	CBR_g12469	NA	NA	CLOP_g15713	1955, 13716, 8338	Me1_v2_0141470, Me1_v2_0141480, Me1_v2_0065140, Me1_v2_0031520	Mp2g20340, Mpzg01320, Mp3g16900, Mp1g05720, Mp3g24890	5299, 5300, 5301, 15719, 26253, 26252, 26254	NA	LOC_Os12g01020, LOC_Os11g01030, LOC_Os05g41300	NA	NA	NA	Solyc11g066140, Solyc06g075970, Solyc09g010570.1, Solyc10g084720.1	409071, 409072, 404621, 419949	SM000016S01810, SM000108S14223, SM000307S11681, SM000108S14231, SM000301S11772, SM000035S13148, SM000132S26854, SM000269S09897, SM000119S25650, SM000149S01323	Zci1a_36855, Zci1a_01834, Zci1a_02780	Zci_05854	UTEX1559_06546	UTEX1560_03218, UTEX1560_03219	Zm00001d044596
Me1_v2_0154650	N0.HOG0003087	OG0002174	n0	AagrOXF_evm.TU.utg000002l.616, AagrOXF_evm.TU.utg000038l.21	Azfi_s0237.g059579, Azfi_s0237.g059577	AT1G67120	Bradi3g27912	CBR_g741, CBR_g742	Chrsp63S07074	Cre03.g161800_4532	CLOP_g15905	7090	Me1_v2_0037940, Me1_v2_0154650, Me1_v2_0154660	Mp1g16360	19032	Olucimarinus_33, Olucimarinus_40957	LOC_Os10g31864, LOC_Os10g31856	PRCOL_00003697_RA	pm022479g0010, pm008714g0010, pm011089.t1, pm007329g0030, pm011100g0020, pm007329g0020	Pp3c8_22130	Solyc04g072260, Solyc04g072270.1	6518, 102961, 19744, 102694	SM000004S14910, SM000011S19087, SM000007S20931	Zci1a_04929, Zci1a_38823, Zci1a_04931	Zci_00916	UTEX1559_07975, UTEX1559_15852	UTEX1560_08312, UTEX1560_08285	Zm00001d038475
Me1_v2_0050940	N0.HOG0003369	OG0002407	n0	AagrOXF_evm.TU.utg000083l.540, AagrOXF_evm.TU.utg000044l.4, AagrOXF_evm.TU.utg000044l.5	NA	AT2G45540, AT3G60920	Bradi2g58800, Bradi3g50947, Bradi5g17947, Bradi3g42877	CBR_g26196, CBR_g26195	NA	NA	CLOP_g25117, CLOP_g25099	7720	Me1_v2_0028610, Me1_v2_0050940, Me1_v2_0050950	Mp6g16270	13435	Olucimarinus_41455	LOC_Os02g44380, LOC_Os04g46894, LOC_Os04g46892	NA	pm039821g0010, pm013227g0010, pm017566g0010, pm000935g0080, pm074324g0010	Pp3c8_11180, Pp3c25_6190, Pp3c16_14330	Solyc01g094050.1, Solyc01g094060	60006	SM000031S11622, SM000043S15869, SM000226S07410	Zci1a_35323	Zci_08091	UTEX1559_02300	UTEX1560_16491, UTEX1560_16490, UTEX1560_15740	Zm00001d017514, Zm00001d002715
Me1_v2_0083550	N0.HOG0000422	OG0000208	n13	AagrOXF_evm.TU.utg000127l.30, AagrOXF_evm.TU.utg000127l.32, AagrOXF_evm.TU.utg000127l.29, AagrOXF_evm.TU.utg000006l.1211, AagrOXF_evm.TU.utg000006l.1210, AagrOXF_evm.TU.utg000063l.218, AagrOXF_evm.TU.utg000083l.449, AagrOXF_evm.TU.utg000012l.435, AagrOXF_evm.TU.utg000038l.296, AagrOXF_evm.TU.utg000080l.102	Azfi_s0247.g060108, Azfi_s0535.g076102, Azfi_s0009.g011985, Azfi_s0006.g010029, Azfi_s0385.g067508, Azfi_s0250.g060223, Azfi_s0004.g008340, Azfi_s0149.g053163, Azfi_s0127.g048682, Azfi_s0145.g051669, Azfi_s0007.g010972, Azfi_s0206.g057839	AT1G63450, AT5G41250, AT2G20370, AT2G31990, AT2G32740, AT2G32750, AT4G13990, AT2G29040, AT1G68470, AT4G22580, AT5G62220	Bradi1g75450, Bradi3g44863, Bradi3g28040, Bradi1g13110, Bradi3g47480, Bradi4g40070, Bradi3g28006, Bradi3g28012, Bradi3g28031, Bradi3g28020, Bradi3g32980, Bradi5g18939, Bradi5g18927	NA	NA	NA	CLOP_g9485, CLOP_g21463, CLOP_g2888, CLOP_g16250, CLOP_g10728	6154	Me1_v2_0231490, Me1_v2_0108160, Me1_v2_0108200, Me1_v2_0108290, Me1_v2_0072320, Me1_v2_0193040, Me1_v2_0166910, Me1_v2_0072260, Me1_v2_0192990, Me1_v2_0083550, Me1_v2_0083540, Me1_v2_0072300, Me1_v2_0193740	Mp6g07770, Mp7g09200, Mp8g00210, Mp6g05660, Mp7g03580, Mp1g17340	NA	NA	LOC_Os03g05110, LOC_Os10g32170, LOC_Os10g32160, LOC_Os12g38450, LOC_Os12g12290, LOC_Os10g32080, LOC_Os10g32110, LOC_Os03g05060, LOC_Os03g05070, LOC_Os10g40559, LOC_Os04g48480, LOC_Os06g23420	NA	pm015714g0010, pm043394g0030, pm013891.t1, pm012252g0040, pm012252g0020, pm001253g0050, pm000037g0010	Pp3c1_25640, Pp3c6_14300, Pp3c21_22580, Pp3c5_12240, Pp3c17_6760, Pp3c14_11970, Pp3c25_6620, Pp3c16_19330, Pp3c26_14140, Pp3c26_14180, Pp3c3_2340, Pp3c13_15720, Pp3c3_21190, Pp3c13_10590, Pp3c4_25210, Pp3c13_10710, Pp3c18_14230, Pp3c22_13750, Pp3c19_15740, Pp3c3_1830	Solyc08g080930.1, Solyc12g056260.1, Solyc09g064480.1, Solyc09g064470, Solyc03g115750.1, Solyc02g014140.1, Solyc08g079040.1, Solyc02g092840.1, Solyc07g044960.1, Solyc07g049610.1, Solyc04g024720.1	126870, 126225, 64314, 126799, 101237, 85769, 118133, 12319, 79836, 63817	SM000038S14309, SM000016S01901, SM000014S00357, SM000239S08062, SM000010S04187, SM000162S02371, SM000091S24626, SM000053S17437, SM000160S02530	Zci1a_28001, Zci1a_28033	Zci_04968, Zci_00664	UTEX1559_04183, UTEX1559_14296	UTEX1560_07901, UTEX1560_11511	Zm00001d048389, Zm00001d032794, Zm00001d041181, Zm00001d032797, Zm00001d032795, Zm00001d032791, Zm00001d027642, Zm00001d027638, Zm00001d027639, Zm00001d048387, Zm00001d027643, Zm00001d027287, Zm00001d002609, Zm00001d026066
Me1_v2_0198700	N0.HOG0000874	OG0000497	n45	AagrOXF_evm.TU.utg000116l.131	Azfi_s0008.g011316, Azfi_s0008.g011315, Azfi_s0111.g045570	AT1G67500	Bradi1g18510	CBR_g26315, CBR_g26314	Chrsp37S00424, Chrsp78S07693	Cre03.g198750_4532, Cre09.g387400_4532	CLOP_g25026, CLOP_g5610	13447, 12170, 12430, 7531, 14535, 7529, 2171, 14023	Me1_v2_0027350, Me1_v2_0157860, Me1_v2_0157850, Me1_v2_0009650, Me1_v2_0198690, Me1_v2_0198700	Mp2g15520	14830, 14828, 14829	NA	LOC_Os07g47280, LOC_Os07g10860, LOC_Os07g47284	PRCOL_00003841_RA	pm001154g0140, pm006512g0020, pm002850g0020, pm002402g0030	Pp3c17_18800, Pp3c2_33440	Solyc01g099220	413713	SM000013S26371, SM000393S14709, SM000091S24579, SM000053S17470, SM000282S10608	Zci1a_43274, Zci1a_41660, Zci1a_37869, Zci1a_37870	Zci_03294, Zci_06363	UTEX1559_03429, UTEX1559_06096, UTEX1559_06095	UTEX1560_11622, UTEX1560_05235, UTEX1560_05234	Zm00001d022491
Me1_v2_0029160	NA	NA	NA	NA	NA	NA	NA	NA	NA	NA	NA	NA	NA	NA	NA	NA	NA	NA	NA	NA	NA	NA	NA	NA	NA	NA	NA	NA
Me1_v2_0189580	N0.HOG0006963	OG0005686	n0	AagrOXF_evm.TU.utg000038l.139, AagrOXF_evm.TU.utg000085l.45	Azfi_s0003.g007910	NA	Bradi4g19020	CBR_g28759, CBR_g48472	NA	NA	CLOP_g3488	NA	Me1_v2_0189580	Mp7g01070	NA	NA	LOC_Os11g29630	NA	NA	Pp3c15_23580, Pp3c6_25910, Pp3c4_21550, Pp3c12_9330, Pp3c25_10130, Pp3c16_23490	Solyc05g015480	446104, 96710	SM000008S22180, SM000035S13061	Zci1a_02502, Zci1a_02504, Zci1a_23427, Zci1a_02505	Zci_09654	UTEX1559_17899	UTEX1560_16954, UTEX1560_16953	Zm00001d049178
Me1_v2_0036160	N0.HOG0003568	OG0002584	n0	AagrOXF_evm.TU.utg000003l.136, AagrOXF_evm.TU.utg000019l.126, AagrOXF_evm.TU.utg000019l.156, AagrOXF_evm.TU.utg000019l.125, AagrOXF_evm.TU.utg000012l.525	Azfi_s0110.g045554	AT1G52325, AT1G80930	Bradi4g39400, Bradi3g33885	CBR_g25966	Chrsp98S08477, Chrsp98S08483	Cre06.g259800_4532	CLOP_g9693, CLOP_g15361	6195	Me1_v2_0036160, Me1_v2_0113030	Mp2g22570	1211	Olucimarinus_17301	LOC_Os12g15420, LOC_Os11g05394	PRCOL_00000882_RA	pm000267g0170, pm002809g0010, pm010551.t1	Pp3c24_6660	Solyc04g079920, Solyc08g005190, Solyc03g116050.1, Solyc03g122110.1	1121, 145659	SM000084S23105, SM000196S05368	Zci1a_27606	Zci_12133	UTEX1559_06282	UTEX1560_13142	Zm00001d023807, Zm00001d013387
Me1_v2_0024730	NA	NA	NA	NA	NA	NA	NA	NA	NA	NA	NA	NA	NA	NA	NA	NA	NA	NA	NA	NA	NA	NA	NA	NA	NA	NA	NA	NA
Me1_v2_0174720	NA	NA	NA	NA	NA	NA	NA	NA	NA	NA	NA	NA	NA	NA	NA	NA	NA	NA	NA	NA	NA	NA	NA	NA	NA	NA	NA	NA
Me1_v2_0215080	NA	NA	NA	NA	NA	NA	NA	NA	NA	NA	NA	NA	NA	NA	NA	NA	NA	NA	NA	NA	NA	NA	NA	NA	NA	NA	NA	NA
Me1_v2_0066780	NA	NA	NA	NA	NA	NA	NA	NA	NA	NA	NA	NA	NA	NA	NA	NA	NA	NA	NA	NA	NA	NA	NA	NA	NA	NA	NA	NA
Me1_v2_0110590	N0.HOG0001180	OG0000689	n0	AagrOXF_evm.TU.utg000009l.372, AagrOXF_evm.TU.utg000009l.371, AagrOXF_evm.TU.utg000009l.373, AagrOXF_evm.TU.utg000056l.23	Azfi_s0061.g034987, Azfi_s0092.g043156, Azfi_s0367.g066993, Azfi_s0050.g030975	AT1G09730, AT4G33620, AT2G10625, AT1G60220, AT1G10570	Bradi3g60530, Bradi4g02360, Bradi2g49226, Bradi1g42280, Bradi3g11016	CBR_g17607, CBR_g31692, CBR_g324	Chrsp4S06179, Chrsp75S07589	Cre06.g278197_4532	CLOP_g5234, CLOP_g7910, CLOP_g9077, CLOP_g16969, CLOP_g8873	8054, 1054, 7973	Me1_v2_0119460, Me1_v2_0091870, Me1_v2_0110590, Me1_v2_0110600, Me1_v2_0005410	Mp2g26300	506, 505, 507	Olucimarinus_17568	LOC_Os05g11770, LOC_Os12g41380, LOC_Os01g53630, LOC_Os06g29310	PRCOL_00000994_RA	pm007952.t1, pm002053g0010	Pp3c25_3200, Pp3c15_7620, Pp3c9_9780, Pp3c9_9860, Pp3c17_2400, Pp3c9_4420, Pp3c5_19870, Pp3c25_7310	Solyc11g017060, Solyc04g081690, Solyc11g017040, Solyc05g005630, Solyc04g026200, Solyc04g026220	402785, 439571, 404271	SM000042S15357, SM000008S22243, SM000039S14475	Zci1a_29854, Zci1a_29853, Zci1a_21963, Zci1a_21964	Zci_15012, Zci_01833, Zci_01681	UTEX1559_18460, UTEX1559_13942, UTEX1559_12980	UTEX1560_13979, UTEX1560_07689, UTEX1560_07690, UTEX1560_04561	Zm00001d012327, Zm00001d045963, Zm00001d031018, Zm00001d053928, Zm00001d043560
Me1_v2_0113630	N0.HOG0004802	OG0003683	n0	AagrOXF_evm.TU.utg000126l.214	Azfi_s0007.g011043	AT3G11964	Bradi1g38227	CBR_g22381	NA	Cre10.g428750_4532	CLOP_g15927	302	Me1_v2_0206470, Me1_v2_0113610, Me1_v2_0113630, Me1_v2_0020640	Mp1g12810	7028	Olucimarinus_38035	LOC_Os07g10350	PRCOL_00005658_RA	pm011022g0010, pm002159g0040, pm003055g0010, pm002375g0010	Pp3c4_30330	Solyc03g051900	148115	SM000051S17567, SM000014S00403, SM000092S24531	Zci1a_00633, Zci1a_00631, Zci1a_00632	NA	UTEX1559_10109	UTEX1560_05463, UTEX1560_05470, UTEX1560_05471, UTEX1560_05466	Zm00001d019108, Zm00001d019114
Me1_v2_0074510	N0.HOG0006805	OG0005536	n0	NA	NA	NA	NA	CBR_g30755, CBR_g30754	NA	Cre11.g482750_4532	CLOP_g7172, CLOP_g11573	2717	Me1_v2_0048380, Me1_v2_0167400, Me1_v2_0167410, Me1_v2_0167390, Me1_v2_0074510	NA	14581, 14582	Olucimarinus_94049	NA	PRCOL_00002860_RA	pm024497g0010, pm002798g0020, pm002618g0010, pm002798g0030, pm005468g0010, pm003100g0040	NA	NA	NA	SM013283S27072, SM000255S08782, SM000195S05288, SM000206S06253	Zci1a_15644	Zci_14532	UTEX1559_08203, UTEX1559_09977	UTEX1560_14361, UTEX1560_17756	NA
Me1_v2_0179500	N0.HOG0039693	OG0037516	-	NA	NA	NA	NA	NA	NA	NA	NA	NA	Me1_v2_0098560, Me1_v2_0179500	NA	NA	NA	NA	NA	NA	NA	NA	NA	NA	NA	NA	NA	NA	NA
Me1_v2_0169380	NA	NA	NA	NA	NA	NA	NA	NA	NA	NA	NA	NA	NA	NA	NA	NA	NA	NA	NA	NA	NA	NA	NA	NA	NA	NA	NA	NA
Me1_v2_0055500	N0.HOG0006935	OG0005660	n0	AagrOXF_evm.TU.utg000022l.179	Azfi_s0006.g010285	AT3G05510	Bradi2g59710	CBR_g19782	Chrsp29S04518	Cre03.g182650_4532, Cre11.g467850_4532	CLOP_g25208	10413	Me1_v2_0055500	Mp1g26040	26938, 895	Olucimarinus_7284, Olucimarinus_7370	LOC_Os01g70570	PRCOL_00004374_RA	NA	Pp3c12_540	Solyc01g099710	110413	SM000058S18522, SM000142S00549	Zci1a_36767, Zci1a_24123	Zci_15567	UTEX1559_02091	UTEX1560_16500	Zm00001d042876, Zm00001d011927
Me1_v2_0197940	NA	NA	NA	NA	NA	NA	NA	NA	NA	NA	NA	NA	NA	NA	NA	NA	NA	NA	NA	NA	NA	NA	NA	NA	NA	NA	NA	NA
Me1_v2_0189630	NA	NA	NA	NA	NA	NA	NA	NA	NA	NA	NA	NA	NA	NA	NA	NA	NA	NA	NA	NA	NA	NA	NA	NA	NA	NA	NA	NA
Me1_v2_0020390	N0.HOG0002382	OG0001581	n0	AagrOXF_evm.TU.utg000006l.175, AagrOXF_evm.TU.utg000042l.135, AagrOXF_evm.TU.utg000042l.136	Azfi_s0084.g039059, Azfi_s0157.g053791	AT5G08630	Bradi3g45850, Bradi5g10777	CBR_g15970, CBR_g31873, CBR_g31875	Chrsp51S09106	Cre06.g800642_4532	CLOP_g18870	11308, 12934	Me1_v2_0020390, Me1_v2_0039530, Me1_v2_0133620, Me1_v2_0066760, Me1_v2_0066770	Mp1g09390	13531	Olucimarinus_32644	LOC_Os02g35100, LOC_Os04g35864	NA	pm018453g0010, pm009740.t1, pm014034g0010	Pp3c2_17910, Pp3c1_29082, Pp3c1_29080	Solyc05g056530	107792, 100168, 107876	SM000157S02065, SM000059S18677, SM000148S01033, SM000024S07833, SM000006S19412, SM005028S17503, SM003599S13201, SM000008S22340	Zci1a_20818, Zci1a_28196, Zci1a_34873, Zci1a_24773	Zci_01836, Zci_01569	UTEX1559_13947, UTEX1559_11521	UTEX1560_07686, UTEX1560_02277	Zm00001d050753, Zm00001d016827
Me1_v2_0111190	NA	NA	NA	NA	NA	NA	NA	NA	NA	NA	NA	NA	NA	NA	NA	NA	NA	NA	NA	NA	NA	NA	NA	NA	NA	NA	NA	NA
Me1_v2_0154660	N0.HOG0003087	OG0002174	n0	AagrOXF_evm.TU.utg000002l.616, AagrOXF_evm.TU.utg000038l.21	Azfi_s0237.g059579, Azfi_s0237.g059577	AT1G67120	Bradi3g27912	CBR_g741, CBR_g742	Chrsp63S07074	Cre03.g161800_4532	CLOP_g15905	7090	Me1_v2_0037940, Me1_v2_0154650, Me1_v2_0154660	Mp1g16360	19032	Olucimarinus_33, Olucimarinus_40957	LOC_Os10g31864, LOC_Os10g31856	PRCOL_00003697_RA	pm022479g0010, pm008714g0010, pm011089.t1, pm007329g0030, pm011100g0020, pm007329g0020	Pp3c8_22130	Solyc04g072260, Solyc04g072270.1	6518, 102961, 19744, 102694	SM000004S14910, SM000011S19087, SM000007S20931	Zci1a_04929, Zci1a_38823, Zci1a_04931	Zci_00916	UTEX1559_07975, UTEX1559_15852	UTEX1560_08312, UTEX1560_08285	Zm00001d038475
Me1_v2_0200960	N0.HOG0002632	OG0001778	n0	AagrOXF_evm.TU.utg000022l.92	Azfi_s0743.g084800, Azfi_s1394.g102555, Azfi_s0390.g067701, Azfi_s0011.g012478, Azfi_s0002.g001382, Azfi_s0050.g031136	AT4G00830, AT5G28390, AT3G52660	Bradi3g13690, Bradi4g26487, Bradi4g03736	CBR_g66684	Chrsp78S07709	Cre03.g169150_4532	CLOP_g24761	9829, 2460	Me1_v2_0200960	Mp1g12580	29602	NA	LOC_Os11g14430, LOC_Os10g06130, LOC_Os12g04180, LOC_Os11g04390, LOC_Os12g38800, LOC_Os12g38795	NA	pm001923g0010	Pp3c17_1210, Pp3c12_1580	Solyc10g009220, Solyc09g009890, Solyc02g088720	169951	SM000220S07057, SM000150S01731, SM000158S02013	Zci1a_06429, Zci1a_13876	Zci_06559, Zci_01629	UTEX1559_01399, UTEX1559_13042	UTEX1560_00218, UTEX1560_00217, UTEX1560_10488	Zm00001d049680, Zm00001d023260, Zm00001d004986, Zm00001d052453, Zm00001d030774, Zm00001d050274
Me1_v2_0153660	N0.HOG0005023	OG0003872	n0	AagrOXF_evm.TU.utg000058l.417	Azfi_s0002.g001629	AT1G72440	Bradi3g47770	CBR_g4353	Chrsp32S04947	Cre10.g459600_4532	CLOP_g22786	4713	Me1_v2_0153660, Me1_v2_0153650	Mp1g16990	24303, 24304	Olucimarinus_25819	LOC_Os09g02810	PRCOL_00007240_RA	pm011135g0030, pm025974g0020	Pp3c9_25340, Pp3c8_7540	Solyc03g123530	405981	SM000114S24110, SM000385S14619, SM000060S19616	Zci1a_18047, Zci1a_05020, Zci1a_18046, Zci1a_05021	Zci_08215	UTEX1559_14416	UTEX1560_06530, UTEX1560_06529, UTEX1560_06528	Zm00001d028238
Me1_v2_0039840	NA	NA	NA	NA	NA	NA	NA	NA	NA	NA	NA	NA	NA	NA	NA	NA	NA	NA	NA	NA	NA	NA	NA	NA	NA	NA	NA	NA
Me1_v2_0099400	N0.HOG0009200	OG0007804	n0	AagrOXF_evm.TU.utg000100l.235	Azfi_s0032.g024611	AT2G39580	Bradi4g04360	NA	Chrsp187S08764	NA	NA	5208	Me1_v2_0099400	Mp2g02780	NA	NA	LOC_Os12g37890	NA	NA	Pp3c5_14860, Pp3c6_12750	Solyc04g011380	437272	SM000366S13822, SM000013S26577, SM000179S03399	Zci1a_18268	Zci_04245	UTEX1559_00047	UTEX1560_00789, UTEX1560_00790	Zm00001d030666
Me1_v2_0035090	N0.HOG0023714	OG0021571	n0	NA	NA	NA	NA	NA	NA	NA	NA	NA	Me1_v2_0035090	NA	NA	NA	NA	NA	NA	NA	NA	NA	NA	NA	Zci_10241	UTEX1559_03837	UTEX1560_19039	NA
Me1_v2_0082670	N0.HOG0006033	OG0004803	n0	AagrOXF_evm.TU.utg000084l.99	Azfi_s0020.g015492	AT4G09980	Bradi3g27790, Bradi1g75210	CBR_g46623, CBR_g46618	Chrsp123S08669	Cre01.g050600_4532	CLOP_g17931, CLOP_g717	9900	Me1_v2_0082680, Me1_v2_0082670, Me1_v2_0006390	Mp1g04450	NA	NA	LOC_Os10g31030, LOC_Os01g16180, LOC_Os03g05420	NA	pm046176g0010	Pp3c5_5900, Pp3c6_26980	Solyc05g056210, Solyc05g056220	NA	SM000130S27122, SM000037S13575, SM000098S25145, SM000098S25147	Zci1a_03445	Zci_02591	UTEX1559_15778	UTEX1560_12761	Zm00001d027671
Me1_v2_0131500	N0.HOG0011424	OG0009852	n0	AagrOXF_evm.TU.utg000111l.216, AagrOXF_evm.TU.utg000057l.67	Azfi_s0477.g073034, Azfi_s1127.g097859	AT1G70620	NA	NA	Chrsp91S08156	Cre06.g256000_4532	CLOP_g5930	9601	Me1_v2_0131500	Mp2g13510	NA	NA	NA	NA	NA	Pp3c19_16700, Pp3c22_14720, Pp3c19_16707	NA	NA	NA	NA	NA	NA	NA	NA
Me1_v2_0137760	N0.HOG0004086	OG0003043	n0	AagrOXF_evm.TU.utg000044l.3, AagrOXF_evm.TU.utg000083l.538__539	Azfi_s0027.g023548	AT3G54460	Bradi2g60850	CBR_g54197	Chrsp66S07330	Cre05.g230804_4532, Cre05.g230800_4532, Cre07.g340100_4532, Cre05.g800568_4532	CLOP_g25109	11588	Me1_v2_0047960, Me1_v2_0035790, Me1_v2_0137760	Mp6g12400	23710, 23711	Olucimarinus_31894	LOC_Os01g72310	PRCOL_00000400_RA	pm015379g0020, pm005031g0030, pm022519g0010, pm003565g0020	Pp3c16_14340	Solyc11g005250	143427, 426184, 415387	SM000161S02419, SM000297S10932	Zci1a_40922	Zci_08148	UTEX1559_11596	UTEX1560_09634	Zm00001d042080, Zm00001d042078
Me1_v2_0192380	N0.HOG0028909	OG0026732	-	NA	NA	NA	NA	NA	NA	NA	NA	NA	Me1_v2_0045610, Me1_v2_0044010, Me1_v2_0192380	NA	NA	NA	NA	NA	NA	NA	NA	NA	NA	NA	NA	NA	NA	NA
Me1_v2_0128690	N0.HOG0006222	OG0004984	n0	AagrOXF_evm.TU.utg000018l.475	Azfi_s0018.g014861	AT5G23080	Bradi1g42320	CBR_g57132	Chrsp97S08405	Cre13.g568700_4532	CLOP_g1882, CLOP_g22529, CLOP_g12149	426	Me1_v2_0128690, Me1_v2_0173690, Me1_v2_0173740	Mp1g06200	5577, 5578	Olucimarinus_15861	LOC_Os06g29400	NA	pm001909g0050	Pp3c6_280	Solyc03g114410	80512	SM006809S21016, SM000066S20420, SM000046S16382, SM000047S16850	Zci1a_21126	Zci_13578	UTEX1559_11790	UTEX1560_16267	Zm00001d045954
Me1_v2_0130910	N0.HOG0018220	OG0016190	n0	NA	NA	NA	NA	NA	NA	NA	NA	NA	Me1_v2_0208710, Me1_v2_0130770, Me1_v2_0225740, Me1_v2_0130850, Me1_v2_0048090, Me1_v2_0130910	NA	NA	NA	NA	NA	NA	NA	NA	NA	NA	NA	NA	NA	NA	NA
Me1_v2_0079400	N0.HOG0004906	OG0003768	n0	AagrOXF_evm.TU.utg000006l.977	Azfi_s0185.g056629	AT2G11000	Bradi3g54430	CBR_g29413	Chrsp80S07932	Cre06.g300650_4532	CLOP_g14834	1924	Me1_v2_0226720, Me1_v2_0079410, Me1_v2_0079400	Mp1g03680	14465, 14464, 14466	Olucimarinus_26922	LOC_Os02g55950	PRCOL_00001705_RA	pm030408g0010, pm024730g0020, pm003840.t2, pm034124g0010	Pp3c26_8550	Solyc07g007810	416426	SM000030S11475, SM000131S26734, SM000058S18482	Zci1a_39991	Zci_07358	UTEX1559_06787	UTEX1560_02926, UTEX1560_02925	Zm00001d052009
Me1_v2_0127390	N0.HOG0002547	OG0001709	n1	NA	NA	NA	NA	CBR_g2917	Chrsp180S08755	Cre11.g479850_4532	NA	NA	Me1_v2_0127390	NA	12324	Olucimarinus_3507	NA	PRCOL_00005663_RA	pm011130g0020	NA	Solyc12g037990	406528	SM000481S16629, SM000321S12206, SM000125S26043	Zci1a_21571	Zci_02801	UTEX1559_03200	UTEX1560_05406	NA
Me1_v2_0098690	N0.HOG0002180	OG0001413	n0	AagrOXF_evm.TU.utg000002l.544, AagrOXF_evm.TU.utg000101l.27	Azfi_s0158.g053886	AT1G04580, AT2G27150, AT3G43600, AT5G20960	Bradi1g56667, Bradi1g52740, Bradi1g06200, Bradi1g06160, Bradi1g06177	NA	Chrsp52S06619	Cre11.g467688_4532	CLOP_g21181	3686	Me1_v2_0098690, Me1_v2_0055930, Me1_v2_0055920	Mp8g06370	2436	NA	LOC_Os03g58380, LOC_Os07g07050, LOC_Os07g18158, LOC_Os07g18120, LOC_Os07g18154, LOC_Os10g04860, LOC_Os03g57680, LOC_Os03g57690	NA	pm001080g0040, pm041993g0010, pm021690g0010, pm175041g0010	Pp3c19_18920, Pp3c5_19220	Solyc01g009230, Solyc11g071600.2, Solyc11g071580.2, Solyc01g088170.4, Solyc01g088230, Solyc01g088200, Solyc11g071620.3, Solyc11g071610.2	268099, 444239, 419183, 96875, 412427	NA	Zci1a_32847, Zci1a_31845	Zci_01160	UTEX1559_05591	UTEX1560_03828	Zm00001d018869, Zm00001d019376, Zm00001d034385, Zm00001d034388, Zm00001d013098, Zm00001d034387
Me1_v2_0035580	N0.HOG0001881	OG0001186	n0	AagrOXF_evm.TU.utg000063l.216	Azfi_s0090.g042796	AT1G58230	Bradi1g32510, Bradi3g04840	CBR_g9087, CBR_g9089, CBR_g9085, CBR_g40583	Chrsp1S08783	NA	CLOP_g4473, CLOP_g11369, CLOP_g3413, CLOP_g3414, CLOP_g1267, CLOP_g9415	9701	Me1_v2_0163730, Me1_v2_0000130, Me1_v2_0035580, Me1_v2_0163720	Mp1g22060	3834	Olucimarinus_15102, Olucimarinus_813	LOC_Os06g46475, LOC_Os06g46480, LOC_Os02g06720, LOC_Os02g06725	PRCOL_00007064_RA	pm000859g0030, pm001378g0050, pm005477g0030, pm005477g0020, pm013198g0020, pm000859g0020, pm011252g0010, pm139916g0010, pm035263g0010, pm001176.t1, pm031074g0010, pm001176g0050, pm028372g0030, pm031074g0020, pm006864g0010	Pp3c20_23460	Solyc04g076510, Solyc04g076500	107448, 107849	SM000011S19112, SM000007S21002, SM000026S08992	Zci1a_01858	Zci_11497	UTEX1559_05114	UTEX1560_13698, UTEX1560_14321, UTEX1560_19722	Zm00001d004825, Zm00001d036583, Zm00001d036579, Zm00001d005623, Zm00001d053827, Zm00001d053826
Me1_v2_0222440	N0.HOG0028837	OG0026660	-	NA	NA	NA	NA	NA	NA	NA	NA	NA	Me1_v2_0189940, Me1_v2_0003300, Me1_v2_0222440	NA	NA	NA	NA	NA	NA	NA	NA	NA	NA	NA	NA	NA	NA	NA
Me1_v2_0224580	N0.HOG0006227	OG0004989	n0	AagrOXF_evm.TU.utg000018l.158, AagrOXF_evm.TU.utg000018l.164	Azfi_s0032.g024813, Azfi_s0342.g065711	AT4G39420	Bradi2g05242	CBR_g5608	Chrsp44S05856	NA	CLOP_g25256, CLOP_g25258	8310	Me1_v2_0224590, Me1_v2_0033030, Me1_v2_0224580	Mp4g01220	22742	NA	LOC_Os01g08750	NA	NA	Pp3c7_14700, Pp3c10_13600, Pp3c3_30110	Solyc04g051570	92147, 92664	SM000018S03735, SM000101S09247, SM000146S00982	Zci1a_22545	Zci_04894	UTEX1559_01507	UTEX1560_00050	Zm00001d034624, Zm00001d034622
Me1_v2_0072480	N0.HOG0004552	OG0003458	n0	AagrOXF_evm.TU.utg000109l.96, AagrOXF_evm.TU.utg000133l.72	Azfi_s0079.g038369	AT3G55510, AT2G18220	Bradi4g01080, Bradi3g29890	CBR_g20280	NA	Cre09.g391652_4532	CLOP_g23586	4740	Me1_v2_0072480	Mp1g23860	5953, 19231	Olucimarinus_2525	LOC_Os12g06610, LOC_Os10g35280	PRCOL_00006336_RA	pm002224g0050, pm008770g0020, pm008591g0010, pm050843g0010	Pp3c24_4150	Solyc05g023710, Solyc02g081680	144099	SM000004S15083, SM000045S16209, SM000013S26465, SM000045S16208	Zci1a_19306	Zci_06923	UTEX1559_00313	UTEX1560_03197	Zm00001d004982, Zm00001d028140, Zm00001d013940
Me1_v2_0055950	N0.HOG0021928	OG0019791	n0	AagrOXF_evm.TU.utg000028l.163	NA	NA	NA	NA	NA	NA	NA	NA	Me1_v2_0055950	NA	NA	NA	NA	NA	pm233843g0010	NA	Solyc01g088180.2	NA	NA	NA	NA	NA	NA	NA
Me1_v2_0116350	N0.HOG0007690	OG0006377	n0	AagrOXF_evm.TU.utg000087l.200	Azfi_s0081.g038607, Azfi_s0129.g048912	AT3G54230	Bradi2g43127	NA	Chrsp29S04471	Cre03.g184350_4532	CLOP_g21345, CLOP_g21344	8845	Me1_v2_0116350	Mp1g04870	NA	NA	LOC_Os02g07070	NA	pm002351g0070, pm028376.t1	Pp3c10_21700, Pp3c20_21810	Solyc08g077310	402018, 407112	SM000003S11137, SM000100S09428	Zci1a_30420	Zci_12185	UTEX1559_06341	UTEX1560_07994	Zm00001d019561, Zm00001d011742
Me1_v2_0199960	N0.HOG0007894	OG0006572	n0	AagrOXF_evm.TU.utg000022l.173	Azfi_s0006.g009673, Azfi_s0064.g035522	AT3G09850	Bradi3g19870	CBR_g21811	Chrsp127S01938	Cre09.g388986_4532	CLOP_g7201	2813	Me1_v2_0099760, Me1_v2_0199960	Mp7g00840, Mp7g03510	23514	Olucimarinus_33146, Olucimarinus_32548	LOC_Os08g19170	PRCOL_00005204_RA	NA	Pp3c15_19210, Pp3c15_19211	Solyc07g007040	NA	SM000065S20214, SM000013S26415, SM000087S23403	Zci1a_21515	NA	NA	NA	Zm00001d030593
Me1_v2_0134560	N0.HOG0023547	OG0021404	n0	NA	NA	NA	NA	NA	NA	NA	CLOP_g8202	NA	Me1_v2_0134560	NA	NA	NA	NA	NA	pm006412.t1, pm010421g0030	NA	NA	NA	NA	NA	NA	NA	NA	NA
Me1_v2_0194310	N0.HOG0004807	OG0003688	n0	AagrOXF_evm.TU.utg000126l.19	Azfi_s0329.g065325	AT3G12810	Bradi1g57635, Bradi2g42340	CBR_g19274	Chrsp91S08163	Cre14.g618860_4532	CLOP_g20804	7331	Me1_v2_0194310, Me1_v2_0194330	Mp7g15670	13581, 26640	Olucimarinus_119553, Olucimarinus_30094	LOC_Os02g46450	PRCOL_00002928_RA	pm009422.t1, pm009520g0030, pm006317g0010, pm009422g0030	Pp3c10_13800, Pp3c3_30220	Solyc03g063220	NA	SM000021S06418, SM000007S20757, SM000037S13507, SM000007S20758	Zci1a_11972, Zci1a_11970	Zci_15150	UTEX1559_00830	UTEX1560_06665	Zm00001d051507, Zm00001d017660
Me1_v2_0153600	N0.HOG0009694	OG0008259	n0	AagrOXF_evm.TU.utg000104l.40	NA	NA	NA	CBR_g4776	Chrsp175S02395	NA	CLOP_g14347	NA	Me1_v2_0153600, Me1_v2_0037460, Me1_v2_0153570	Mp3g03870	NA	NA	NA	NA	pm024519g0010, pm019478g0010, pm004845g0070	Pp3c14_23710	NA	NA	SM000208S06328, SM001240S25810, SM000106S13993, SM000044S16025	Zci1a_07982	Zci_10240	UTEX1559_19181	UTEX1560_18902	NA
Me1_v2_0017630	NA	NA	NA	NA	NA	NA	NA	NA	NA	NA	NA	NA	NA	NA	NA	NA	NA	NA	NA	NA	NA	NA	NA	NA	NA	NA	NA	NA
Me1_v2_0063880	NA	NA	NA	NA	NA	NA	NA	NA	NA	NA	NA	NA	NA	NA	NA	NA	NA	NA	NA	NA	NA	NA	NA	NA	NA	NA	NA	NA
Me1_v2_0222430	N0.HOG0028872	OG0026695	-	NA	NA	NA	NA	NA	NA	NA	NA	NA	Me1_v2_0189760, Me1_v2_0021820, Me1_v2_0222430	NA	NA	NA	NA	NA	NA	NA	NA	NA	NA	NA	NA	NA	NA	NA
Me1_v2_0081310	N0.HOG0007243	OG0005953	n0	AagrOXF_evm.TU.utg000006l.689	NA	NA	Bradi2g21790	CBR_g10945, CBR_g24449	Chrsp2S04671	NA	CLOP_g6967	NA	Me1_v2_0081330, Me1_v2_0081310	NA	17310, 17311	NA	LOC_Os05g41090	NA	pm002823g0050, pm017716g0010, pm007888g0020, pm008231g0080	Pp3c21_15330, Pp3c19_20580	Solyc01g096820	82473	SM000126S26312, SM000002S05603, SM000008S22292	Zci1a_03985, Zci1a_29354	Zci_01672	UTEX1559_12990	UTEX1560_03547	Zm00001d019620, Zm00001d052944
Me1_v2_0154350	NA	NA	NA	NA	NA	NA	NA	NA	NA	NA	NA	NA	NA	NA	NA	NA	NA	NA	NA	NA	NA	NA	NA	NA	NA	NA	NA	NA
Me1_v2_0033130	N0.HOG0003915	OG0002897	n0	AagrOXF_evm.TU.utg000044l.57	Azfi_s1602.g104556, Azfi_s0423.g069212, Azfi_s1209.g099707	AT1G68100	Bradi3g37910	CBR_g56846	Chrsp22S03481	NA	CLOP_g1613, CLOP_g20412, CLOP_g1936, CLOP_g1614, CLOP_g3133	12419	Me1_v2_0033130, Me1_v2_0185180, Me1_v2_0185170	Mp1g09980	25631	Olucimarinus_27457, Olucimarinus_18031	LOC_Os08g36420	NA	pm002407g0010, pm011457.t1, pm001196g0010	Pp3c12_24640	Solyc04g008340.2	418658, 424032	SM000098S25101, SM000115S23929, SM000188S03831	Zci1a_32480, Zci1a_32481	Zci_07853	UTEX1559_14816, UTEX1559_19099	UTEX1560_19184, UTEX1560_19916, UTEX1560_19639	Zm00001d031764
