family classifications for ZYGCI.fa.domtblout
Gene_ID;TAP_family;Number_of_TAP_families_found;Domains;
Zci_00002.1;ARF;1;Auxin_resp;AUX_IAA;
Zci_00030.1;0_no_family_found;0;WD40;
Zci_00033.1;0_no_family_found;0;WD40;
Zci_00072.1;C3H;1;zf-CCCH;
Zci_00073.1;Trihelix;1;trihelix;
Zci_00083.2;0_no_family_found;0;zf-B_box;
Zci_00096.2;MYB-related;1;Myb_DNA-binding;
Zci_00115.1;GNAT;1;Acetyltransf_1;
Zci_00127.1;0_no_family_found;0;dsrm;
Zci_00133.1;0_no_family_found;0;WD40;
Zci_00156.1;FHA;1;FHA;
Zci_00159.1;SOH1;1;Med31;
Zci_00160.1;GNAT;1;Acetyltransf_1;
Zci_00174.2;0_no_family_found;0;DEAD;Helicase_C;
Zci_00177.1;C2H2;1;zf-C2H2;
Zci_00184.2;bHLH;1;HLH;
Zci_00224.1;0_no_family_found;0;WD40;
Zci_00227.1;NAC;1;NAM;
Zci_00233.1;IWS1;1;Med26;
Zci_00238.1;C3H;1;zf-CCCH;
Zci_00241.2;Trihelix;1;trihelix;
Zci_00255.1;0_no_family_found;0;WD40;
Zci_00283.1;AP2/EREBP;1;AP2;
Zci_00294.1;WRKY;1;WRKY;
Zci_00361.2;Sir2;1;SIR2;
Zci_00368.1;MYB-related;1;Myb_DNA-binding;
Zci_00377.1;TRAF;1;BTB;
Zci_00379.1;PHD;1;zf-C5HC2;PHD;
Zci_00402.1;SWI/SNF_SNF2;1;SNF2_N;Helicase_C;
Zci_00414.1;mTERF;1;mTERF;
Zci_00420.1;FHA;1;FHA;
Zci_00453.1;0_no_family_found;0;Helicase_C;DEAD;
Zci_00454.1;PHD;1;PHD;
Zci_00504.1;0_no_family_found;0;WD40;
Zci_00505.1;GNAT;1;Acetyltransf_1;
Zci_00517.2;C3H;1;zf-CCCH;
Zci_00574.1;bHLH;1;HLH;
Zci_00581.4;0_no_family_found;0;PP2C;
Zci_00583.1;MYB;1;two_or_more_Myb_DNA-binding;Myb_DNA-binding;
Zci_00608.1;DUF246 domain containing/O-FucT;1;O-FucT;
Zci_00666.1;0_no_family_found;0;Response_reg;
Zci_00691.1;C2H2;1;zf-AN1;zf-C2H2;
Zci_00736.1;bZIP;2;bZIP_CDD;bZIP_1;bZIP_2;bZIP_AUREO;
Zci_00765.1;AP2/EREBP;1;AP2;
Zci_00766.1;Trihelix;1;trihelix;
Zci_00798.1;0_no_family_found;0;WD40;
Zci_00808.1;0_no_family_found;0;WD40;
Zci_00836.1;C2C2_Dof;1;zf-Dof;
Zci_00850.1;ABI3/VP1;1;B3;
Zci_00854.1;DUF246 domain containing/O-FucT;1;O-FucT;
Zci_00867.2;Jumonji_Other;1;JmjC;JmjN;zf-C5HC2;
Zci_00872.1;Zinc finger, MIZ type;1;zf-MIZ;
Zci_00880.1;Zinc finger, AN1 and A20 type;1;zf-AN1;
Zci_00884.1;CCAAT_HAP2;1;CBFB_NFYA;
Zci_00924.1;0_no_family_found;0;DEAD;Helicase_C;
Zci_00926.1;NAC;1;NAM;
Zci_00929.1;TFb2;1;Tfb2;
Zci_00934.3;0_no_family_found;0;PP2C;
Zci_00945.1;0_no_family_found;0;WD40;
Zci_00989.2;0_no_family_found;0;Helicase_C;
Zci_01009.1;PcG_FIE;1;FIE_clipped_for_HMM;WD40;
Zci_01015.2;0_no_family_found;0;WD40;
Zci_01020.1;PcG_MSI;1;CAF1C_H4-bd;WD40;
Zci_01038.1;MYB;1;two_or_more_Myb_DNA-binding;Myb_DNA-binding;
Zci_01082.1;0_no_family_found;0;WD40;
Zci_01097.2;0_no_family_found;0;Response_reg;WD40;
Zci_01116.1;NAC;1;NAM;
Zci_01118.1;FHA;1;FHA;
Zci_01120.1;DUF246 domain containing/O-FucT;1;O-FucT;
Zci_01161.1;GARP_G2-like;1;G2-like_Domain;
Zci_01186.1;0_no_family_found;0;WD40;
Zci_01218.1;0_no_family_found;0;DEAD;Helicase_C;
Zci_01268.1;0_no_family_found;0;dsrm;
Zci_01281.1;0_no_family_found;0;WD40;
Zci_01303.1;C3H;1;zf-CCCH;
Zci_01304.1;bHLH;1;HLH;
Zci_01323.1;bHLH;1;HLH;
Zci_01324.2;0_no_family_found;0;Sigma70_r2;
Zci_01328.1;0_no_family_found;0;WD40;
Zci_01351.1;0_no_family_found;0;DEAD;Helicase_C;
Zci_01389.1;RRN3;1;RRN3;
Zci_01413.1;MYB-related;1;Myb_DNA-binding;
Zci_01423.3;DUF246 domain containing/O-FucT;1;O-FucT;
Zci_01425.1;DUF246 domain containing/O-FucT;1;O-FucT;
Zci_01433.1;MYB;1;two_or_more_Myb_DNA-binding;Myb_DNA-binding;
Zci_01441.1;0_no_family_found;0;WD40;
Zci_01448.1;Zinc finger, ZPR1;1;zf-ZPR1;
Zci_01494.1;bZIP;1;bZIP_1;bZIP_CDD;
Zci_01518.1;0_no_family_found;0;zf-B_box;
Zci_01544.1;SWI/SNF_SNF2;1;SNF2_N;Helicase_C;
Zci_01567.1;DUF246 domain containing/O-FucT;1;O-FucT;
Zci_01569.1;0_no_family_found;0;WSD;
Zci_01588.1;MYB-related;1;Myb_DNA-binding;
Zci_01597.1;MYB;1;two_or_more_Myb_DNA-binding;Myb_DNA-binding;
Zci_01599.1;SET;1;SET;
Zci_01635.1;0_no_family_found;0;Helicase_C;
Zci_01683.1;0_no_family_found;0;WD40;
Zci_01701.1;0_no_family_found;0;WD40;
Zci_01705.1;GNAT;1;Acetyltransf_1;
Zci_01725.4;0_no_family_found;0;Response_reg;
Zci_01726.2;0_no_family_found;0;Response_reg;
Zci_01753.2;LUG;1;LUFS_Domain;WD40;
Zci_01755.1;BSD domain containing;1;BSD;
Zci_01758.1;0_no_family_found;0;WD40;
Zci_01786.1;TRAF;1;BTB;
Zci_01807.1;TRAF;1;BTB;
Zci_01808.2;0_no_family_found;0;WD40;
Zci_01811.1;SWI/SNF_SNF2;1;SNF2_N;Helicase_C;
Zci_01818.1;0_no_family_found;0;Helicase_C;dsrm;
Zci_01834.1;FHA;1;FHA;
Zci_01836.2;DDT;1;WSD;DDT;WHIM1;
Zci_01850.1;MYB-related;1;Myb_DNA-binding;
Zci_01869.1;0_no_family_found;0;START;
Zci_01919.1;mTERF;1;mTERF;
Zci_01925.1;GNAT;1;Acetyltransf_1;
Zci_01927.1;0_no_family_found;0;WD40;
Zci_01975.3;PcG_MSI;1;CAF1C_H4-bd;WD40;
Zci_01976.1;AS2/LOB;1;DUF260;
Zci_01977.2;C2C2_GATA;1;GATA;
Zci_01979.3;0_no_family_found;0;WD40;
Zci_01982.1;HMG;1;HMG_box;
Zci_02002.1;mTERF;1;mTERF;
Zci_02039.1;Sir2;1;SIR2;
Zci_02056.1;Zinc finger, AN1 and A20 type;1;zf-AN1;
Zci_02059.1;0_no_family_found;0;DEAD;Helicase_C;
Zci_02077.1;0_no_family_found;0;WD40;
Zci_02081.1;HMG;1;HMG_box;
Zci_02083.1;HMG;1;HMG_box;
Zci_02104.2;C3H;1;zf-CCCH;
Zci_02153.2;C3H;1;zf-CCCH;
Zci_02164.1;0_no_family_found;0;IQ;
Zci_02177.1;PHD;1;PHD;
Zci_02192.1;WRKY;1;WRKY;
Zci_02194.1;WRKY;1;WRKY;
Zci_02195.1;FHA;1;FHA;
Zci_02198.1;WRKY;1;WRKY;
Zci_02210.3;0_no_family_found;0;WD40;
Zci_02214.1;WRKY;1;WRKY;
Zci_02276.1;bHLH;1;HLH;
Zci_02284.1;C2H2;1;zf-C2H2;
Zci_02301.1;WRKY;1;WRKY;
Zci_02303.1;RWP-RK;1;RWP-RK;
Zci_02318.1;0_no_family_found;0;Response_reg;
Zci_02342.1;PcG_MSI;1;CAF1C_H4-bd;WD40;
Zci_02357.1;SWI/SNF_SNF2;1;SNF2_N;Helicase_C;
Zci_02372.1;0_no_family_found;0;WD40;
Zci_02374.1;0_no_family_found;0;WD40;
Zci_02440.1;SET;1;SET;
Zci_02457.1;0_no_family_found;0;WD40;
Zci_02467.1;0_no_family_found;0;Response_reg;
Zci_02496.1;bZIP;2;bZIP_CDD;bZIP_1;bZIP_2;
Zci_02523.1;FHA;1;FHA;
Zci_02530.1;DUF833 domain containing/TANGO2;1;TANGO2;
Zci_02576.1;0_no_family_found;0;IQ;
Zci_02609.1;MYB-related;1;Myb_DNA-binding;
Zci_02619.1;WRKY;1;WRKY;
Zci_02625.1;MYB;1;two_or_more_Myb_DNA-binding;Myb_DNA-binding;
Zci_02640.1;HMG;1;HMG_box;
Zci_02677.1;C2H2;1;zf-C2H2;
Zci_02690.2;0_no_family_found;0;Response_reg;
Zci_02696.1;AP2/EREBP;1;B3;AP2;
Zci_02737.1;0_no_family_found;0;zf-B_box;
Zci_02762.1;MYB-related;1;Myb_DNA-binding;
Zci_02770.1;SET;1;SET;
Zci_02774.2;0_no_family_found;0;Response_reg;
Zci_02790.1;MYB-related;1;PHD;Myb_DNA-binding;
Zci_02796.1;TRAF;1;BTB;
Zci_02814.1;GNAT;1;Acetyltransf_1;
Zci_02845.1;0_no_family_found;0;DEAD;Helicase_C;
Zci_02857.1;MYB;1;two_or_more_Myb_DNA-binding;Myb_DNA-binding;
Zci_02871.1;WRKY;1;WRKY;
Zci_02899.2;GARP_G2-like;1;G2-like_Domain;
Zci_02925.1;GNAT;1;Acetyltransf_1;
Zci_02926.1;0_no_family_found;0;WD40;
Zci_02939.1;HD-other;1;Homeobox;DDT;WSD;
Zci_03005.1;0_no_family_found;0;DEAD;Helicase_C;
Zci_03017.1;0_no_family_found;0;WD40;
Zci_03019.1;0_no_family_found;0;WD40;
Zci_03075.1;0_no_family_found;0;WD40;
Zci_03092.1;HD-other;1;Homeobox;
Zci_03143.1;mTERF;1;mTERF;
Zci_03165.2;C3H;1;zf-CCCH;
Zci_03181.2;C3H;1;zf-CCCH;
Zci_03186.1;GNAT;1;Acetyltransf_1;
Zci_03254.1;CCAAT_HAP5;1;NF-YC;
Zci_03259.1;0_no_family_found;0;PP2C;
Zci_03293.1;GNAT;1;Acetyltransf_1;
Zci_03304.1;0_no_family_found;0;IQ;
Zci_03353.1;0_no_family_found;0;DEAD;
Zci_03371.1;HD-Zip_III;1;START;MEKHLA;Homeobox;
Zci_03410.1;0_no_family_found;0;WD40;
Zci_03449.2;DUF246 domain containing/O-FucT;1;O-FucT;
Zci_03464.1;DUF246 domain containing/O-FucT;1;O-FucT;
Zci_03468.1;0_no_family_found;0;WD40;
Zci_03488.1;C3H;1;zf-CCCH;WD40;
Zci_03503.1;0_no_family_found;0;WD40;
Zci_03527.1;0_no_family_found;0;DEAD;Helicase_C;
Zci_03554.1;TUB;1;Tub;
Zci_03558.2;SWI/SNF_SNF2;1;SNF2_N;Helicase_C;
Zci_03605.1;DBP;1;PP2C;DNC;
Zci_03613.1;0_no_family_found;0;WD40;
Zci_03656.1;0_no_family_found;0;WD40;
Zci_03680.1;TRAF;1;BTB;
Zci_03704.1;bZIP;1;bZIP_1;bZIP_CDD;bZIP_2;
Zci_03793.1;0_no_family_found;0;DEAD;Helicase_C;
Zci_03802.1;0_no_family_found;0;Response_reg;
Zci_03836.1;0_no_family_found;0;Response_reg;
Zci_03881.1;bZIP;1;bZIP_1;bZIP_CDD;bZIP_2;
Zci_03887.1;C2H2;1;zf-C2H2;
Zci_03916.1;0_no_family_found;0;PP2C;
Zci_03981.2;0_no_family_found;0;DEAD;Helicase_C;
Zci_03989.1;GRAS;1;GRAS;
Zci_03997.1;GRAS;1;GRAS;
Zci_03998.1;GRAS;1;GRAS;
Zci_04028.1;mTERF;1;mTERF;
Zci_04030.3;C3H;1;zf-CCCH;
Zci_04042.1;mTERF;1;mTERF;
Zci_04051.1;CPP;1;TCR;
Zci_04059.2;0_no_family_found;0;WD40;
Zci_04077.1;DUF246 domain containing/O-FucT;1;O-FucT;
Zci_04152.1;mTERF;1;mTERF;
Zci_04153.1;mTERF;1;mTERF;
Zci_04177.1;0_no_family_found;0;Response_reg;
Zci_04183.2;0_no_family_found;0;IQ;
Zci_04231.1;0_no_family_found;0;DEAD;Helicase_C;
Zci_04235.1;0_no_family_found;0;IQ;
Zci_04267.2;0_no_family_found;0;WD40;
Zci_04281.1;bHLH;1;HLH;
Zci_04284.1;Sir2;1;SIR2;
Zci_04296.1;MYB-related;1;Myb_DNA-binding;
Zci_04337.1;GNAT;1;Acetyltransf_1;
Zci_04343.1;0_no_family_found;0;WD40;
Zci_04373.1;0_no_family_found;0;Helicase_C;
Zci_04403.1;0_no_family_found;0;LIM;
Zci_04408.1;0_no_family_found;0;DEAD;Helicase_C;
Zci_04439.1;SWI/SNF_SNF2;1;SNF2_N;Helicase_C;
Zci_04452.2;0_no_family_found;0;WD40;
Zci_04509.1;CCAAT_HAP5;1;NF-YC;
Zci_04514.2;Trihelix;1;trihelix;
Zci_04520.2;PHD;1;SNF2_N;Helicase_C;PHD;
Zci_04535.1;GNAT;1;Acetyltransf_1;
Zci_04537.1;Pseudo ARR-B;1;Response_reg;CCT;
Zci_04585.1;FHA;1;FHA;
Zci_04591.1;0_no_family_found;0;WD40;
Zci_04595.1;WRKY;1;WRKY;
Zci_04601.1;0_no_family_found;0;PP2C;
Zci_04642.1;0_no_family_found;0;WD40;
Zci_04708.1;HD_KNOX1;2;KNOX1;KNOX2;Homeobox;
Zci_04714.2;0_no_family_found;0;Response_reg;
Zci_04717.1;0_no_family_found;0;WRC;
Zci_04735.1;0_no_family_found;0;Helicase_C;
Zci_04774.1;0_no_family_found;0;Response_reg;
Zci_04778.1;PHD;1;PHD;
Zci_04784.1;PHD;1;PHD;
Zci_04785.1;0_no_family_found;0;dsrm;
Zci_04791.1;0_no_family_found;0;WD40;
Zci_04806.1;AS2/LOB;1;DUF260;
Zci_04821.1;0_no_family_found;0;WD40;
Zci_04825.2;PHD;1;PHD;
Zci_04839.1;BES1;1;BES1_N;
Zci_04842.1;0_no_family_found;0;WD40;
Zci_04876.1;Trihelix;1;trihelix;
Zci_04903.1;SWI/SNF_SWI3;1;SWIRM;
Zci_04914.1;0_no_family_found;0;WD40;
Zci_04916.1;Trihelix;1;trihelix;
Zci_04922.1;0_no_family_found;0;MEKHLA;
Zci_04945.1;SWI/SNF_SNF2;1;SNF2_N;Helicase_C;
Zci_04967.1;DUF246 domain containing/O-FucT;1;O-FucT;
Zci_04998.1;C2H2;1;zf-C2H2;
Zci_05011.1;MYB-related;1;Myb_DNA-binding;
Zci_05023.1;Sir2;1;SIR2;
Zci_05026.1;0_no_family_found;0;Response_reg;
Zci_05031.1;GRAS;1;GRAS;
Zci_05032.1;PHD;1;PHD;
Zci_05035.2;GRAS;1;GRAS;
Zci_05037.1;GRAS;1;GRAS;
Zci_05041.1;GRAS;1;GRAS;
Zci_05047.1;GRAS;1;GRAS;
Zci_05048.1;GRAS;1;GRAS;
Zci_05060.1;0_no_family_found;0;Response_reg;
Zci_05061.1;MBF1;1;MBF1;
Zci_05074.1;0_no_family_found;0;DEAD;Helicase_C;
Zci_05098.1;DUF632 domain containing;1;DUF632;
Zci_05123.1;0_no_family_found;0;Helicase_C;DEAD;
Zci_05134.2;TRAF;1;BTB;
Zci_05169.1;DUF246 domain containing/O-FucT;1;O-FucT;
Zci_05173.1;bZIP;2;bZIP_CDD;bZIP_1;bZIP_2;
Zci_05186.1;0_no_family_found;0;START;
Zci_05187.1;0_no_family_found;0;WD40;
Zci_05210.1;0_no_family_found;0;WD40;
Zci_05236.2;MYB-related;1;Myb_DNA-binding;
Zci_05250.1;SWI/SNF_SNF2;1;SNF2_N;
Zci_05261.1;0_no_family_found;0;WD40;
Zci_05270.1;SWI/SNF_SNF2;1;SNF2_N;Helicase_C;
Zci_05271.4;Jumonji_PKDM7;2;JmjC;FYRC;FYRN;zf-C5HC2;JmjN;
Zci_05351.1;HD-other;1;Homeobox;
Zci_05353.1;0_no_family_found;0;WD40;
Zci_05371.1;0_no_family_found;0;WD40;
Zci_05401.1;C2H2;1;zf-C2H2;
Zci_05419.1;bZIP;1;bZIP_1;bZIP_CDD;bZIP_2;bZIP_AUREO;
Zci_05441.1;0_no_family_found;0;Helicase_C;
Zci_05468.1;0_no_family_found;0;WD40;
Zci_05504.1;Jumonji_Other;1;JmjC;
Zci_05516.1;0_no_family_found;0;Response_reg;
Zci_05523.1;0_no_family_found;0;WD40;
Zci_05570.1;bHLH;1;HLH;
Zci_05575.1;MYB;1;two_or_more_Myb_DNA-binding;Myb_DNA-binding;
Zci_05578.1;bZIP;1;bZIP_CDD;
Zci_05667.1;Jumonji_Other;1;JmjC;
Zci_05680.1;SWI/SNF_BAF60b;1;SWIB;
Zci_05714.1;MYB-related;1;SWIRM;Myb_DNA-binding;
Zci_05715.1;0_no_family_found;0;WD40;
Zci_05722.1;BSD domain containing;1;BSD;
Zci_05723.1;bHLH;1;HLH;
Zci_05755.1;RWP-RK;1;RWP-RK;
Zci_05762.1;0_no_family_found;0;PP2C;
Zci_05764.1;AS2/LOB;1;DUF260;
Zci_05765.1;WRKY;1;WRKY;
Zci_05814.1;0_no_family_found;0;DEAD;Helicase_C;
Zci_05825.1;Jumonji_Other;1;JmjC;JmjN;
Zci_05828.1;IWS1;1;Med26;
Zci_05838.1;AP2/EREBP;1;AP2;
Zci_05840.1;0_no_family_found;0;WD40;
Zci_05861.1;AP2/EREBP;1;AP2;
Zci_05867.1;HMG;1;HMG_box;
Zci_05868.3;ARID;1;ARID;HMG_box;
Zci_05890.4;SWI/SNF_SNF2;1;SNF2_N;Helicase_C;
Zci_05897.1;0_no_family_found;0;Response_reg;
Zci_05906.1;0_no_family_found;0;Helicase_C;DEAD;
Zci_05935.1;bHLH;1;HLH;
Zci_05938.1;SBP;1;SBP;
Zci_05940.1;0_no_family_found;0;PP2C;
Zci_05985.1;0_no_family_found;0;PP2C;
Zci_06005.1;0_no_family_found;0;PP2C;
Zci_06024.1;DUF246 domain containing/O-FucT;1;O-FucT;
Zci_06095.1;AP2/EREBP;1;AP2;
Zci_06097.1;C3H;1;zf-CCCH;
Zci_06113.1;bZIP;1;bZIP_1;bZIP_CDD;bZIP_2;bZIP_AUREO;
Zci_06253.1;GARP_G2-like;1;G2-like_Domain;
Zci_06254.2;FHA;1;FHA;
Zci_06285.1;GNAT;1;Acetyltransf_1;
Zci_06313.1;0_no_family_found;0;Response_reg;
Zci_06318.1;MYB;1;two_or_more_Myb_DNA-binding;Myb_DNA-binding;
Zci_06334.1;SWI/SNF_BAF60b;1;SWIB;
Zci_06335.1;0_no_family_found;0;WD40;
Zci_06378.1;DUF246 domain containing/O-FucT;1;O-FucT;
Zci_06381.1;0_no_family_found;0;START;
Zci_06390.2;SWI/SNF_SNF2;1;SNF2_N;Helicase_C;
Zci_06445.1;C3H;1;zf-CCCH;
Zci_06483.1;0_no_family_found;0;DEAD;Helicase_C;
Zci_06516.1;GIF;1;SSXT;
Zci_06523.1;C2C2_CO-like;1;CCT;zf-B_box;
Zci_06530.2;AP2/EREBP;1;AP2;
Zci_06551.1;AP2/EREBP;1;AP2;
Zci_06570.1;RWP-RK;1;RWP-RK;
Zci_06573.1;0_no_family_found;0;LIM;
Zci_06584.1;SET;1;SET;
Zci_06622.1;PHD;1;PHD;
Zci_06647.1;C2H2;1;zf-C2H2;
Zci_06653.1;C2H2;1;zf-C2H2;
Zci_06655.1;0_no_family_found;0;WD40;
Zci_06667.1;AP2/EREBP;1;AP2;
Zci_06674.1;RB;1;RB_B;
Zci_06711.1;C3H;1;zf-CCCH;
Zci_06720.1;0_no_family_found;0;Helicase_C;DEAD;dsrm;
Zci_06753.1;MYB-related;1;Myb_DNA-binding;
Zci_06760.1;SWI/SNF_SNF2;1;SNF2_N;Helicase_C;
Zci_06774.1;SET;1;SET;
Zci_06791.1;HD-Zip_I_II;1;Homeobox;HALZ;
Zci_06828.1;AP2/EREBP;1;AP2;
Zci_06838.1;MYB;1;two_or_more_Myb_DNA-binding;Myb_DNA-binding;
Zci_06857.1;0_no_family_found;0;WD40;
Zci_06858.1;mTERF;1;mTERF;
Zci_06902.1;0_no_family_found;0;DEAD;Helicase_C;
Zci_06926.1;TRAF;1;BTB;
Zci_06967.2;TRAF;1;BTB;
Zci_06990.1;EIL;1;EIN3;
Zci_07088.1;TRAF;1;BTB;
Zci_07089.1;0_no_family_found;0;DEAD;Helicase_C;
Zci_07098.1;PHD;2;PHD;AP2;FHA;
Zci_07163.1;0_no_family_found;0;DEAD;Helicase_C;
Zci_07169.1;PHD;1;PHD;
Zci_07248.1;BSD domain containing;1;BSD;
Zci_07328.1;SET;1;SET;FYRN;FYRC;
Zci_07353.1;CCAAT_HAP5;1;NF-YC;
Zci_07355.1;MYB-related;1;Myb_DNA-binding;
Zci_07366.2;0_no_family_found;0;WD40;
Zci_07390.1;GNAT;1;Acetyltransf_1;
Zci_07393.1;MYB-related;1;Myb_DNA-binding;
Zci_07409.1;0_no_family_found;0;WD40;
Zci_07416.1;Dicer;1;Ribonuclease_3;PAZ;Helicase_C;DEAD;dsrm;
Zci_07432.1;GARP_G2-like;1;G2-like_Domain;
Zci_07452.1;TRAF;1;BTB;
Zci_07506.1;CPP;1;TCR;
Zci_07536.1;MYB;1;two_or_more_Myb_DNA-binding;Myb_DNA-binding;
Zci_07570.2;PcG_EZ;1;CXC;SET;
Zci_07575.1;C3H;1;zf-CCCH;
Zci_07579.2;C3H;1;zf-CCCH;
Zci_07595.1;C2C2_GATA;1;GATA;
Zci_07615.1;GNAT;1;Acetyltransf_1;
Zci_07616.1;GNAT;1;Acetyltransf_1;
Zci_07663.1;C2C2_GATA;1;GATA;
Zci_07694.1;Argonaute;1;Piwi;PAZ;
Zci_07699.1;SET;1;SET;
Zci_07707.1;WRKY;1;WRKY;
Zci_07740.1;0_no_family_found;0;DEAD;Helicase_C;
Zci_07768.1;DUF246 domain containing/O-FucT;1;O-FucT;
Zci_07802.1;PcG_MSI;1;CAF1C_H4-bd;WD40;
Zci_07805.1;GNAT;1;Acetyltransf_1;
Zci_07895.1;SWI/SNF_BAF60b;1;SWIB;
Zci_07935.1;bHLH;1;HLH;
Zci_07940.1;0_no_family_found;0;START;
Zci_07951.1;0_no_family_found;0;WD40;
Zci_07982.3;BES1;1;BES1_N;
Zci_08019.1;0_no_family_found;0;DEAD;Helicase_C;
Zci_08049.1;MYB-related;1;Myb_DNA-binding;
Zci_08054.1;0_no_family_found;0;PP2C;
Zci_08088.1;mTERF;1;mTERF;
Zci_08091.1;0_no_family_found;0;WD40;
Zci_08095.1;GNAT;1;Acetyltransf_1;
Zci_08108.1;0_no_family_found;0;WD40;
Zci_08148.3;SWI/SNF_SNF2;1;SNF2_N;Helicase_C;
Zci_08152.1;SET;1;SET;
Zci_08202.1;GRAS;1;GRAS;
Zci_08228.1;SWI/SNF_BAF60b;1;SWIB;
Zci_08239.1;0_no_family_found;0;WD40;
Zci_08264.1;Sir2;1;SIR2;
Zci_08266.1;SWI/SNF_SWI3;1;SWIRM;
Zci_08271.1;0_no_family_found;0;Helicase_C;DEAD;
Zci_08293.3;0_no_family_found;0;DEAD;Helicase_C;
Zci_08444.1;0_no_family_found;0;WD40;
Zci_08450.1;0_no_family_found;0;Ribonuclease_3;
Zci_08573.2;AP2/EREBP;1;AP2;
Zci_08604.1;TRAF;1;BTB;
Zci_08651.4;0_no_family_found;0;WD40;
Zci_08652.1;mTERF;1;mTERF;
Zci_08662.1;SRS;1;DUF702;
Zci_08666.1;MYB;1;two_or_more_Myb_DNA-binding;Myb_DNA-binding;
Zci_08682.1;RWP-RK;1;RWP-RK;
Zci_08692.1;0_no_family_found;0;Sigma70_r2;Sigma70_r4;
Zci_08699.1;GRAS;1;GRAS;
Zci_08747.1;SWI/SNF_SNF2;1;SNF2_N;Helicase_C;
Zci_08748.1;PHD;1;PHD;
Zci_08823.1;DUF246 domain containing/O-FucT;1;O-FucT;
Zci_08858.1;0_no_family_found;0;WD40;
Zci_08859.1;bZIP;1;bZIP_1;bZIP_CDD;bZIP_2;
Zci_08926.2;0_no_family_found;0;DEAD;
Zci_08929.1;AP2/EREBP;1;AP2;
Zci_08934.1;AP2/EREBP;1;AP2;
Zci_08935.1;0_no_family_found;0;Response_reg;
Zci_08943.1;DUF246 domain containing/O-FucT;1;O-FucT;
Zci_08944.1;DUF246 domain containing/O-FucT;1;O-FucT;
Zci_08951.1;AP2/EREBP;1;AP2;
Zci_08954.1;CCAAT_Dr1;1;CCAAT-Dr1_Domain;
Zci_08956.1;AP2/EREBP;1;AP2;
Zci_08958.1;DUF246 domain containing/O-FucT;1;O-FucT;
Zci_08999.1;C2H2;1;zf-C2H2;
Zci_09002.1;SWI/SNF_SNF2;1;SNF2_N;Helicase_C;
Zci_09015.1;0_no_family_found;0;WD40;
Zci_09019.1;HRT;1;HRT;
Zci_09035.1;GNAT;1;Acetyltransf_1;
Zci_09046.2;Trihelix;1;trihelix;
Zci_09049.1;SWI/SNF_SNF2;1;SNF2_N;Helicase_C;
Zci_09051.1;DUF246 domain containing/O-FucT;1;O-FucT;
Zci_09057.1;AP2/EREBP;1;AP2;
Zci_09080.2;C2H2;1;zf-C2H2;
Zci_09098.1;C3H;1;zf-CCCH;
Zci_09105.1;0_no_family_found;0;CCT;
Zci_09122.1;BSD domain containing;1;BSD;
Zci_09146.1;MYB-related;1;Myb_DNA-binding;
Zci_09179.1;MYB-related;1;Myb_DNA-binding;
Zci_09249.2;0_no_family_found;0;Helicase_C;DEAD;
Zci_09304.1;GNAT;1;Acetyltransf_1;
Zci_09312.4;0_no_family_found;0;dsrm;
Zci_09313.1;Pseudo ARR-B;1;Response_reg;CCT;
Zci_09315.1;PLATZ;1;PLATZ;
Zci_09318.1;C2H2;1;zf-C2H2;
Zci_09335.1;0_no_family_found;0;WD40;
Zci_09343.1;0_no_family_found;0;WD40;
Zci_09346.1;C2H2;1;zf-C2H2;
Zci_09359.1;C2H2;1;zf-C2H2;
Zci_09414.1;Alfin-like;1;Alfin-like;
Zci_09421.1;bZIP;1;bZIP_1;bZIP_CDD;
Zci_09432.2;bHLH;1;HLH;
Zci_09453.3;0_no_family_found;0;DEAD;Helicase_C;
Zci_09456.1;C2H2;1;zf-C2H2;
Zci_09457.1;Coactivator p15;1;PC4;
Zci_09461.1;0_no_family_found;0;Sigma70_r2;Sigma70_r4;
Zci_09493.1;MYB;1;two_or_more_Myb_DNA-binding;Myb_DNA-binding;
Zci_09501.1;MYB;1;two_or_more_Myb_DNA-binding;Myb_DNA-binding;
Zci_09542.1;SET;1;SET;
Zci_09567.1;0_no_family_found;0;DEAD;Helicase_C;
Zci_09579.1;MYB-related;1;Myb_DNA-binding;
Zci_09600.1;C3H;1;zf-CCCH;
Zci_09601.1;C3H;1;zf-CCCH;
Zci_09612.1;mTERF;1;mTERF;
Zci_09662.2;0_no_family_found;0;DEAD;
Zci_09674.1;ABI3/VP1;1;B3;
Zci_09675.1;0_no_family_found;0;Helicase_C;DEAD;
Zci_09731.1;0_no_family_found;0;WD40;
Zci_09733.2;0_no_family_found;0;PP2C;
Zci_09760.1;0_no_family_found;0;PP2C;
Zci_09776.1;SWI/SNF_SNF2;1;SNF2_N;Helicase_C;
Zci_09798.1;C3H;1;zf-CCCH;
Zci_09806.3;Trihelix;1;trihelix;
Zci_09809.1;GARP_G2-like;1;G2-like_Domain;
Zci_09826.1;C2H2;1;zf-C2H2;
Zci_09828.1;FHA;1;FHA;
Zci_09879.1;Sigma70-like;1;Sigma70_r2;Sigma70_r4;Sigma70_r3;
Zci_09899.1;bHLH_TCP;1;TCP;
Zci_09901.2;0_no_family_found;0;WD40;
Zci_09910.1;0_no_family_found;0;DEAD;Helicase_C;
Zci_09922.1;DUF246 domain containing/O-FucT;1;O-FucT;
Zci_09934.2;0_no_family_found;0;Response_reg;
Zci_09937.2;MYB;1;two_or_more_Myb_DNA-binding;Myb_DNA-binding;
Zci_09943.1;MYB;1;two_or_more_Myb_DNA-binding;Myb_DNA-binding;
Zci_09967.2;DUF547 domain containing;1;DUF547;
Zci_09971.1;0_no_family_found;0;WD40;
Zci_09973.1;DUF547 domain containing;1;DUF547;
Zci_09974.2;DUF547 domain containing;1;DUF547;
Zci_09978.2;SET;1;SET;
Zci_10005.1;0_no_family_found;0;DEAD;Helicase_C;
Zci_10020.1;GARP_ARR-B;1;G2-like_Domain;Response_reg;
Zci_10022.1;0_no_family_found;0;WD40;
Zci_10044.1;SET;1;SET;
Zci_10052.1;SET;1;SET;
Zci_10061.1;C2H2;1;zf-C2H2;
Zci_10069.1;0_no_family_found;0;WD40;
Zci_10082.2;0_no_family_found;0;CCT;
Zci_10087.2;Jumonji_Other;1;JmjC;JmjN;zf-C5HC2;
Zci_10092.2;SET;1;SET;
Zci_10096.1;MYB;1;two_or_more_Myb_DNA-binding;Myb_DNA-binding;
Zci_10155.1;DUF246 domain containing/O-FucT;1;O-FucT;
Zci_10156.1;bZIP;1;bZIP_1;
Zci_10164.1;MYB;1;two_or_more_Myb_DNA-binding;Myb_DNA-binding;
Zci_10166.1;TUB;1;Tub;
Zci_10248.1;mTERF;1;mTERF;
Zci_10276.4;ABI3/VP1;1;B3;
Zci_10322.1;CSD;1;CSD;
Zci_10336.1;PHD;1;PHD;
Zci_10342.1;SBP;1;SBP;
Zci_10355.2;WRKY;1;WRKY;
Zci_10405.3;0_no_family_found;0;DEAD;Helicase_C;
Zci_10406.2;PHD;1;PHD;
Zci_10413.1;HD_PHD;1;PHD;Homeobox;
Zci_10463.1;TRAF;1;BTB;
Zci_10485.1;0_no_family_found;0;WD40;
Zci_10490.1;ARID;1;ARID;
Zci_10491.1;0_no_family_found;0;CCT;
Zci_10497.2;0_no_family_found;0;WD40;
Zci_10519.1;0_no_family_found;0;PP2C;
Zci_10534.1;0_no_family_found;0;WD40;
Zci_10541.1;bZIP;2;bZIP_CDD;bZIP_2;
Zci_10570.1;GNAT;1;Acetyltransf_1;
Zci_10572.1;HD-other;1;Homeobox;
Zci_10604.1;WRKY;1;WRKY;
Zci_10606.1;WRKY;1;WRKY;
Zci_10625.1;0_no_family_found;0;Helicase_C;
Zci_10627.1;0_no_family_found;0;DEAD;Helicase_C;
Zci_10631.1;C2H2;1;zf-C2H2;
Zci_10644.1;DUF246 domain containing/O-FucT;1;O-FucT;
Zci_10645.1;DUF246 domain containing/O-FucT;1;O-FucT;
Zci_10655.3;HSF;1;HSF_DNA-bind;
Zci_10680.1;0_no_family_found;0;DEAD;Helicase_C;
Zci_10713.1;C2H2;1;zf-C2H2;
Zci_10727.1;mTERF;1;mTERF;
Zci_10783.1;PHD;1;PHD;
Zci_10791.1;SWI/SNF_SNF2;1;SNF2_N;Helicase_C;
Zci_10800.1;AP2/EREBP;1;AP2;
Zci_10812.1;0_no_family_found;0;Response_reg;
Zci_10878.1;0_no_family_found;0;DEAD;
Zci_10883.1;0_no_family_found;0;WD40;
Zci_10889.1;0_no_family_found;0;Response_reg;
Zci_10897.1;0_no_family_found;0;WD40;
Zci_10926.3;C3H;1;zf-CCCH;
Zci_10929.1;0_no_family_found;0;DEAD;
Zci_10934.1;MBF1;1;MBF1;
Zci_10937.1;DUF246 domain containing/O-FucT;1;O-FucT;
Zci_10958.1;bHLH;1;HLH;
Zci_10988.1;DUF246 domain containing/O-FucT;1;O-FucT;
Zci_10996.5;CAMTA;1;CG-1;IQ;
Zci_11010.1;0_no_family_found;0;CG-1;
Zci_11015.1;C2H2;1;SET;zf-C2H2;
Zci_11060.1;0_no_family_found;0;Response_reg;
Zci_11081.1;E2F/DP;1;E2F_TDP;
Zci_11105.2;0_no_family_found;0;PP2C;
Zci_11122.1;0_no_family_found;0;Helicase_C;DEAD;
Zci_11125.1;DUF547 domain containing;1;DUF547;
Zci_11135.1;SET;1;SET;
Zci_11141.1;DUF246 domain containing/O-FucT;1;O-FucT;
Zci_11146.1;0_no_family_found;0;DEAD;Helicase_C;
Zci_11185.1;0_no_family_found;0;WD40;
Zci_11195.1;PHD;1;SET;PHD;
Zci_11212.3;0_no_family_found;0;WD40;
Zci_11222.1;SET;1;SET;
Zci_11254.1;0_no_family_found;0;Helicase_C;
Zci_11262.1;0_no_family_found;0;WD40;
Zci_11292.1;DUF246 domain containing/O-FucT;1;O-FucT;
Zci_11349.1;DDT;1;WHIM1;DDT;
Zci_11367.1;0_no_family_found;0;PP2C;
Zci_11425.1;0_no_family_found;0;WD40;
Zci_11448.1;DUF246 domain containing/O-FucT;1;O-FucT;
Zci_11496.1;TAZ;1;zf-TAZ;
Zci_11497.1;0_no_family_found;0;WD40;
Zci_11529.1;0_no_family_found;0;Helicase_C;DEAD;
Zci_11542.1;CCAAT_HAP5;1;NF-YC;
Zci_11571.1;C3H;1;zf-CCCH;
Zci_11573.3;0_no_family_found;0;WD40;
Zci_11588.1;MYB-related;1;Myb_DNA-binding;
Zci_11621.1;DUF246 domain containing/O-FucT;1;O-FucT;
Zci_11646.1;DUF246 domain containing/O-FucT;1;O-FucT;
Zci_11654.1;0_no_family_found;0;PP2C;
Zci_11674.1;0_no_family_found;0;Response_reg;
Zci_11691.1;C2H2;1;zf-C2H2;
Zci_11737.1;0_no_family_found;0;Response_reg;
Zci_11745.1;0_no_family_found;0;Helicase_C;DEAD;
Zci_11747.1;0_no_family_found;0;DEAD;
Zci_11751.1;MYB-related;1;Myb_DNA-binding;
Zci_11788.1;SWI/SNF_SNF2;1;SNF2_N;
Zci_11832.2;0_no_family_found;0;WD40;
Zci_11838.1;0_no_family_found;0;WD40;
Zci_11848.1;MYB;1;two_or_more_Myb_DNA-binding;Myb_DNA-binding;
Zci_11849.1;WRKY;1;WRKY;
Zci_11854.1;PcG_VEFS;1;VEFS-Box;
Zci_11864.1;bZIP;1;bZIP_1;bZIP_CDD;bZIP_2;
Zci_11890.1;0_no_family_found;0;WD40;
Zci_11896.1;0_no_family_found;0;Helicase_C;DEAD;
Zci_11918.1;0_no_family_found;0;WD40;
Zci_11927.1;HD-other;1;Homeobox;
Zci_11970.1;HD_WOX;1;WOX_HD;Homeobox;
Zci_11989.1;C3H;1;zf-CCCH;
Zci_12025.1;0_no_family_found;0;WD40;
Zci_12041.1;DUF246 domain containing/O-FucT;1;O-FucT;
Zci_12067.1;0_no_family_found;0;PAZ;Ribonuclease_3;dsrm;
Zci_12068.1;C3H;1;zf-CCCH;
Zci_12096.2;Zinc finger, MIZ type;1;zf-MIZ;
Zci_12101.1;C2H2;1;zf-C2H2;
Zci_12105.1;0_no_family_found;0;WD40;
Zci_12108.2;0_no_family_found;0;WD40;
Zci_12145.1;0_no_family_found;0;PP2C;
Zci_12199.1;SET;1;SET;
Zci_12242.1;S1Fa-like;1;S1FA;
Zci_12265.2;mTERF;1;mTERF;
Zci_12313.1;GARP_ARR-B;1;G2-like_Domain;Response_reg;
Zci_12354.1;0_no_family_found;0;WD40;
Zci_12361.1;0_no_family_found;0;Helicase_C;DEAD;
Zci_12389.1;GNAT;1;Acetyltransf_1;
Zci_12445.1;C2H2;1;zf-C2H2;
Zci_12476.1;0_no_family_found;0;DEAD;Helicase_C;
Zci_12480.1;MYB;1;two_or_more_Myb_DNA-binding;Myb_DNA-binding;
Zci_12586.1;SET;1;SET;
Zci_12659.1;Argonaute;1;Piwi;PAZ;
Zci_12709.5;SET;1;SET;
Zci_12737.1;C2C2_GATA;1;GATA;
Zci_12738.1;SWI/SNF_SNF2;1;SNF2_N;Helicase_C;
Zci_12788.3;TRAF;1;BTB;
Zci_12789.1;DUF246 domain containing/O-FucT;1;O-FucT;
Zci_12793.2;DUF547 domain containing;1;DUF547;
Zci_12803.1;0_no_family_found;0;WD40;
Zci_12834.1;IWS1;1;Med26;
Zci_12856.1;GNAT;1;Acetyltransf_1;
Zci_12867.1;DUF547 domain containing;1;DUF547;
Zci_12972.1;0_no_family_found;0;Response_reg;
Zci_12976.1;HMG;1;HMG_box;
Zci_13015.1;ABI3/VP1;1;B3;
Zci_13016.1;C2C2_GATA;1;GATA;
Zci_13018.1;Whirly;1;Whirly;
Zci_13030.2;MYB;1;two_or_more_Myb_DNA-binding;Myb_DNA-binding;
Zci_13031.1;0_no_family_found;0;Response_reg;
Zci_13041.1;FHA;1;PP2C;FHA;
Zci_13047.1;MYB-related;1;Myb_DNA-binding;
Zci_13096.2;0_no_family_found;0;Response_reg;
Zci_13099.1;0_no_family_found;0;WD40;
Zci_13126.1;0_no_family_found;0;Response_reg;
Zci_13127.1;DUF246 domain containing/O-FucT;1;O-FucT;
Zci_13169.1;0_no_family_found;0;IQ;
Zci_13186.4;SBP;1;SBP;
Zci_13191.1;bZIP;1;bZIP_1;bZIP_CDD;bZIP_2;
Zci_13201.1;GRF;1;WRC;QLQ;
Zci_13209.1;0_no_family_found;0;DEAD;Helicase_C;
Zci_13231.1;SWI/SNF_SNF2;1;SNF2_N;Helicase_C;
Zci_13249.1;0_no_family_found;0;WD40;
Zci_13250.1;AS2/LOB;1;DUF260;
Zci_13279.1;Rcd1-like;1;Rcd1;
Zci_13299.1;SBP;1;SBP;
Zci_13309.1;MYB;1;two_or_more_Myb_DNA-binding;Myb_DNA-binding;
Zci_13319.2;SWI/SNF_SNF2;1;SNF2_N;Helicase_C;
Zci_13331.1;0_no_family_found;0;WD40;
Zci_13332.1;AS2/LOB;1;DUF260;
Zci_13343.2;SET;1;SET;
Zci_13377.1;mTERF;1;mTERF;
Zci_13378.1;mTERF;1;mTERF;
Zci_13379.1;mTERF;1;mTERF;
Zci_13382.1;mTERF;1;mTERF;
Zci_13385.1;mTERF;1;mTERF;
Zci_13421.1;DUF246 domain containing/O-FucT;1;O-FucT;
Zci_13474.1;DUF246 domain containing/O-FucT;1;O-FucT;
Zci_13557.1;0_no_family_found;0;WD40;
Zci_13627.1;0_no_family_found;0;Helicase_C;
Zci_13628.1;0_no_family_found;0;DEAD;
Zci_13647.1;WRKY;1;WRKY;
Zci_13649.1;WRKY;1;WRKY;
Zci_13650.2;WRKY;1;WRKY;
Zci_13654.3;GARP_G2-like;1;G2-like_Domain;
Zci_13657.1;SET;1;SET;
Zci_13658.1;NAC;1;NAM;
Zci_13674.1;0_no_family_found;0;Response_reg;
Zci_13743.2;SET;1;SET;
Zci_13776.1;MYB;1;two_or_more_Myb_DNA-binding;Myb_DNA-binding;
Zci_13781.2;0_no_family_found;0;WD40;
Zci_13806.4;MADS;1;SRF-TF;
Zci_13836.1;C3H;1;zf-CCCH;
Zci_13867.1;HMG;1;HMG_box;
Zci_13877.2;0_no_family_found;0;dsrm;
Zci_13914.1;0_no_family_found;0;Helicase_C;
Zci_13937.1;HD_WOX;1;WOX_HD;Homeobox;
Zci_13938.2;0_no_family_found;0;DEAD;Helicase_C;
Zci_13945.2;MYB-related;1;Myb_DNA-binding;
Zci_14013.1;SWI/SNF_SNF2;1;SNF2_N;
Zci_14039.1;mTERF;1;mTERF;
Zci_14047.1;Jumonji_Other;1;JmjC;
Zci_14072.1;Alfin-like;1;Alfin-like;
Zci_14127.1;0_no_family_found;0;WD40;
Zci_14130.1;0_no_family_found;0;WD40;
Zci_14133.1;0_no_family_found;0;WD40;
Zci_14145.1;0_no_family_found;0;WD40;
Zci_14148.1;0_no_family_found;0;DEAD;Helicase_C;
Zci_14172.2;0_no_family_found;0;WD40;
Zci_14180.1;SET;1;SET;
Zci_14248.2;0_no_family_found;0;Helicase_C;
Zci_14275.1;WRKY;1;WRKY;
Zci_14323.1;Med6;1;Med6;
Zci_14380.1;FHA;1;FHA;
Zci_14389.1;0_no_family_found;0;DEAD;Helicase_C;
Zci_14397.1;AP2/EREBP;1;AP2;
Zci_14492.1;Med7;1;Med7;
Zci_14512.1;DUF296 domain containing;1;DUF296;
Zci_14540.1;0_no_family_found;0;DEAD;Helicase_C;
Zci_14589.1;0_no_family_found;0;DEAD;
Zci_14625.1;C2H2;1;zf-C2H2;
Zci_14646.4;0_no_family_found;0;Helicase_C;DEAD;
Zci_14651.1;0_no_family_found;0;WD40;
Zci_14698.1;0_no_family_found;0;PP2C;
Zci_14704.3;0_no_family_found;0;Response_reg;
Zci_14717.1;0_no_family_found;0;Response_reg;
Zci_14738.1;0_no_family_found;0;WD40;
Zci_14740.2;PHD;1;PHD;
Zci_14761.1;bZIP;2;bZIP_CDD;bZIP_1;bZIP_2;
Zci_14802.4;DUF246 domain containing/O-FucT;1;O-FucT;
Zci_14806.1;bHLH;1;HLH;
Zci_14828.1;MYB-related;1;Myb_DNA-binding;
Zci_14903.1;DUF246 domain containing/O-FucT;1;O-FucT;
Zci_14934.1;SWI/SNF_SNF2;1;SNF2_N;
Zci_14941.1;DDT;1;DDT;PHD;
Zci_14980.2;SET;1;SET;
Zci_15064.1;PLATZ;1;PLATZ;
Zci_15078.1;DUF246 domain containing/O-FucT;1;O-FucT;
Zci_15087.1;DUF246 domain containing/O-FucT;1;O-FucT;
Zci_15150.1;SWI/SNF_SNF2;1;SNF2_N;Helicase_C;
Zci_15172.1;0_no_family_found;0;WD40;
Zci_15186.1;RWP-RK;1;RWP-RK;
Zci_15218.1;Coactivator p15;1;PC4;
Zci_15222.1;mTERF;1;mTERF;
Zci_15276.1;WRKY;1;WRKY;
Zci_15306.1;0_no_family_found;0;Helicase_C;DEAD;
Zci_15341.1;0_no_family_found;0;KNOX1;KNOX2;
Zci_15348.1;0_no_family_found;0;PP2C;
Zci_15355.2;0_no_family_found;0;WRC;
Zci_15426.1;0_no_family_found;0;DEAD;Helicase_C;
Zci_15458.1;WRKY;1;WRKY;
Zci_15466.1;WRKY;1;WRKY;
Zci_15467.1;WRKY;1;WRKY;
Zci_15473.1;WRKY;1;WRKY;
Zci_15496.1;C2H2;1;zf-C2H2;
Zci_15503.1;0_no_family_found;0;PP2C;
Zci_15504.2;WRKY;1;WRKY;
Zci_15572.1;GNAT;1;Acetyltransf_1;
Zci_15667.1;DUF246 domain containing/O-FucT;1;O-FucT;
Zci_15680.1;bHLH;1;HLH;
Zci_15708.1;0_no_family_found;0;WD40;
Zci_15756.1;0_no_family_found;0;Helicase_C;
Zci_15759.1;SWI/SNF_SNF2;1;SNF2_N;
Zci_15771.2;FHA;1;FHA;
Zci_15776.1;0_no_family_found;0;IQ;
Zci_15810.1;0_no_family_found;0;DEAD;Helicase_C;
Zci_15928.1;RWP-RK;1;RWP-RK;
Zci_15980.2;SET;1;SET;
Zci_16265.1;IWS1;1;Med26;
Zci_16391.1;0_no_family_found;0;Helicase_C;
Zci_16460.1;NAC;1;NAM;
Zci_16505.1;bZIP;2;bZIP_CDD;bZIP_2;
Zci_16512.2;Trihelix;1;trihelix;
