"","ID","Description","GeneRatio","BgRatio","pvalue","p.adjust","qvalue","geneID","Count"
"GO:0048859","GO:0048859","formation of anatomical boundary","1/6","10/5696",0.0104921688231432,0.211292310677848,0.185344132173551,"Pp3c23_9660V3",1
"GO:0090691","GO:0090691","formation of plant organ boundary","1/6","10/5696",0.0104921688231432,0.211292310677848,0.185344132173551,"Pp3c23_9660V3",1
"GO:0010193","GO:0010193","response to ozone","1/6","11/5696",0.0115363205971603,0.211292310677848,0.185344132173551,"Pp3c9_17220V3",1
"GO:1902456","GO:1902456","regulation of stomatal opening","1/6","12/5696",0.0125795540318863,0.211292310677848,0.185344132173551,"Pp3c9_17220V3",1
"GO:0010215","GO:0010215","cellulose microfibril organization","1/6","14/5696",0.0146632684681745,0.211292310677848,0.185344132173551,"Pp3c2_9820V3",1
"GO:0010074","GO:0010074","maintenance of meristem identity","1/6","20/5696",0.0208924387751244,0.211292310677848,0.185344132173551,"Pp3c23_9660V3",1
"GO:0019827","GO:0019827","stem cell population maintenance","1/6","23/5696",0.0239946960080163,0.211292310677848,0.185344132173551,"Pp3c23_9660V3",1
"GO:0098727","GO:0098727","maintenance of cell number","1/6","23/5696",0.0239946960080163,0.211292310677848,0.185344132173551,"Pp3c23_9660V3",1
"GO:0010200","GO:0010200","response to chitin","1/6","26/5696",0.0270887577792113,0.211292310677848,0.185344132173551,"Pp3c23_21450V3",1
"GO:0030104","GO:0030104","water homeostasis","1/6","26/5696",0.0270887577792113,0.211292310677848,0.185344132173551,"Pp3c9_17220V3",1
"GO:0009073","GO:0009073","aromatic amino acid family biosynthetic process","1/6","29/5696",0.0301746414183131,0.213965639148038,0.187689157147402,"Pp3c1_31930V3",1
"GO:0015698","GO:0015698","inorganic anion transport","1/6","37/5696",0.0383638139712079,0.249364790812851,0.218741044572677,"Pp3c9_17220V3",1
"GO:0010118","GO:0010118","stomatal movement","1/6","46/5696",0.0475076731994453,0.251356319007058,0.220487999128999,"Pp3c9_17220V3",1
"GO:0010073","GO:0010073","meristem maintenance","1/6","52/5696",0.0535632342144245,0.251356319007058,0.220487999128999,"Pp3c23_9660V3",1
"GO:0006873","GO:0006873","cellular ion homeostasis","1/6","64/5696",0.0655781434827424,0.251356319007058,0.220487999128999,"Pp3c9_17220V3",1
"GO:0048438","GO:0048438","floral whorl development","1/6","68/5696",0.0695547537568746,0.251356319007058,0.220487999128999,"Pp3c23_9660V3",1
"GO:0055082","GO:0055082","cellular chemical homeostasis","1/6","72/5696",0.0735172513315697,0.251356319007058,0.220487999128999,"Pp3c9_17220V3",1
"GO:0003002","GO:0003002","regionalization","1/6","76/5696",0.0774656763032503,0.251356319007058,0.220487999128999,"Pp3c23_9660V3",1
"GO:0015711","GO:0015711","organic anion transport","1/6","77/5696",0.0784505883926067,0.251356319007058,0.220487999128999,"Pp3c9_17220V3",1
"GO:0007389","GO:0007389","pattern specification process","1/6","82/5696",0.0833620151306609,0.251356319007058,0.220487999128999,"Pp3c23_9660V3",1
"GO:0097659","GO:0097659","nucleic acid-templated transcription","1/6","84/5696",0.0853204683958754,0.251356319007058,0.220487999128999,"Pp3c23_9660V3",1
"GO:0090698","GO:0090698","post-embryonic plant morphogenesis","1/6","85/5696",0.0862983866406409,0.251356319007058,0.220487999128999,"Pp3c23_9660V3",1
"GO:0010119","GO:0010119","regulation of stomatal movement","1/6","86/5696",0.0872754334558531,0.251356319007058,0.220487999128999,"Pp3c9_17220V3",1
"GO:0010243","GO:0010243","response to organonitrogen compound","1/6","89/5696",0.0902013515359099,0.251356319007058,0.220487999128999,"Pp3c23_21450V3",1
"GO:0032774","GO:0032774","RNA biosynthetic process","1/6","89/5696",0.0902013515359099,0.251356319007058,0.220487999128999,"Pp3c23_9660V3",1
"GO:0048437","GO:0048437","floral organ development","1/6","89/5696",0.0902013515359099,0.251356319007058,0.220487999128999,"Pp3c23_9660V3",1
"GO:0048507","GO:0048507","meristem development","1/6","92/5696",0.0931194490982985,0.251356319007058,0.220487999128999,"Pp3c23_9660V3",1
"GO:0098656","GO:0098656","anion transmembrane transport","1/6","95/5696",0.096029742874374,0.251356319007058,0.220487999128999,"Pp3c9_17220V3",1
"GO:0019725","GO:0019725","cellular homeostasis","1/6","96/5696",0.0969981095129662,0.251356319007058,0.220487999128999,"Pp3c9_17220V3",1
"GO:0000302","GO:0000302","response to reactive oxygen species","1/6","99/5696",0.099898024220754,0.251356319007058,0.220487999128999,"Pp3c9_17220V3",1
"GO:0048646","GO:0048646","anatomical structure formation involved in morphogenesis","1/6","99/5696",0.099898024220754,0.251356319007058,0.220487999128999,"Pp3c23_9660V3",1
"GO:0050801","GO:0050801","ion homeostasis","1/6","104/5696",0.104713968395531,0.255240297964107,0.223894998214129,"Pp3c9_17220V3",1
"GO:0006351","GO:0006351","transcription, DNA-templated","1/6","111/5696",0.111420200828475,0.26335683832185,0.231014770457763,"Pp3c23_9660V3",1
"GO:0006820","GO:0006820","anion transport","1/6","116/5696",0.116184693090414,0.266541354736833,0.233808205909503,"Pp3c9_17220V3",1
"GO:0016071","GO:0016071","mRNA metabolic process","1/6","123/5696",0.122819201804256,0.273711364020914,0.240097687737644,"Pp3c23_9660V3",1
"GO:0046677","GO:0046677","response to antibiotic","1/6","127/5696",0.126591679094375,0.274281971371145,0.240598220501004,"Pp3c9_17220V3",1
"GO:0009908","GO:0009908","flower development","1/6","135/5696",0.134096082836511,0.282689039493185,0.247972841660689,"Pp3c23_9660V3",1
"GO:0090567","GO:0090567","reproductive shoot system development","1/6","143/5696",0.141546677359924,0.290543179844054,0.254862438459697,"Pp3c23_9660V3",1
"GO:1901698","GO:1901698","response to nitrogen compound","1/6","150/5696",0.148022050226291,0.296044100452581,0.259687807414545,"Pp3c23_21450V3",1
"GO:0048878","GO:0048878","chemical homeostasis","1/6","158/5696",0.155372584560041,0.300804857870009,0.263863910412289,"Pp3c9_17220V3",1
"GO:0009415","GO:0009415","response to water","1/6","161/5696",0.158115374008595,0.300804857870009,0.263863910412289,"Pp3c9_17220V3",1
"GO:0035556","GO:0035556","intracellular signal transduction","1/6","167/5696",0.163578690038207,0.303788995785242,0.266481575250212,"Pp3c4_23550V3",1
"GO:0042592","GO:0042592","homeostatic process","1/6","202/5696",0.194862659144185,0.350110323522927,0.307114318879761,"Pp3c9_17220V3",1
"GO:0048827","GO:0048827","phyllome development","1/6","205/5696",0.197498131218061,0.350110323522927,0.307114318879761,"Pp3c23_9660V3",1
"GO:0006979","GO:0006979","response to oxidative stress","1/6","220/5696",0.210567912304387,0.352322794553097,0.309055082941313,"Pp3c9_17220V3",1
"GO:0034220","GO:0034220","ion transmembrane transport","1/6","220/5696",0.210567912304387,0.352322794553097,0.309055082941313,"Pp3c9_17220V3",1
"GO:0034654","GO:0034654","nucleobase-containing compound biosynthetic process","1/6","222/5696",0.212297068512764,0.352322794553097,0.309055082941313,"Pp3c23_9660V3",1
"GO:0009737","GO:0009737","response to abscisic acid","1/6","235/5696",0.223459827922175,0.363122220373534,0.318528263485556,"Pp3c9_17220V3",1
"GO:0097305","GO:0097305","response to alcohol","1/6","258/5696",0.242886414475448,0.386635516920101,0.339153962210615,"Pp3c9_17220V3",1
"GO:0009888","GO:0009888","tissue development","1/6","271/5696",0.253686320275956,0.395547810286583,0.346971763409284,"Pp3c23_9660V3",1
"GO:0006811","GO:0006811","ion transport","1/6","277/5696",0.258627414418151,0.395547810286583,0.346971763409284,"Pp3c9_17220V3",1
"GO:0033993","GO:0033993","response to lipid","1/6","293/5696",0.271670569296619,0.399817064247854,0.350716723024433,"Pp3c9_17220V3",1
"GO:0048367","GO:0048367","shoot system development","1/6","293/5696",0.271670569296619,0.399817064247854,0.350716723024433,"Pp3c23_9660V3",1
"GO:0018130","GO:0018130","heterocycle biosynthetic process","1/6","306/5696",0.282126808158292,0.407516500673089,0.357470614625517,"Pp3c23_9660V3",1
"GO:0071702","GO:0071702","organic substance transport","1/6","314/5696",0.288499012635798,0.409144054283496,0.358898293231137,"Pp3c9_17220V3",1
"GO:0019438","GO:0019438","aromatic compound biosynthetic process","1/6","329/5696",0.30031988234873,0.413103816835254,0.362371769153731,"Pp3c23_9660V3",1
"GO:0050793","GO:0050793","regulation of developmental process","1/6","331/5696",0.301883558456532,0.413103816835254,0.362371769153731,"Pp3c23_9660V3",1
"GO:0016310","GO:0016310","phosphorylation","1/6","347/5696",0.314288455325208,0.413185869216102,0.362443744926406,"Pp3c4_23550V3",1
"GO:1901362","GO:1901362","organic cyclic compound biosynthetic process","1/6","360/5696",0.324231676759391,0.413185869216102,0.362443744926406,"Pp3c23_9660V3",1
"GO:0034645","GO:0034645","cellular macromolecule biosynthetic process","1/6","368/5696",0.330290642037312,0.413185869216102,0.362443744926406,"Pp3c23_9660V3",1
"GO:0009059","GO:0009059","macromolecule biosynthetic process","1/6","387/5696",0.344499475155041,0.413185869216102,0.362443744926406,"Pp3c23_9660V3",1
"GO:0006468","GO:0006468","protein phosphorylation","1/6","390/5696",0.346719836404805,0.413185869216102,0.362443744926406,"Pp3c4_23550V3",1
"GO:0023052","GO:0023052","signaling","1/6","398/5696",0.352610179903713,0.413185869216102,0.362443744926406,"Pp3c4_23550V3",1
"GO:0009653","GO:0009653","anatomical structure morphogenesis","1/6","406/5696",0.358456197843501,0.413185869216102,0.362443744926406,"Pp3c23_9660V3",1
"GO:0099402","GO:0099402","plant organ development","1/6","411/5696",0.362087568780687,0.413185869216102,0.362443744926406,"Pp3c23_9660V3",1
"GO:0048608","GO:0048608","reproductive structure development","1/6","415/5696",0.364980317837326,0.413185869216102,0.362443744926406,"Pp3c23_9660V3",1
"GO:0061458","GO:0061458","reproductive system development","1/6","415/5696",0.364980317837326,0.413185869216102,0.362443744926406,"Pp3c23_9660V3",1
"GO:0009416","GO:0009416","response to light stimulus","1/6","420/5696",0.36858087400706,0.413185869216102,0.362443744926406,"Pp3c23_9660V3",1
"GO:0055085","GO:0055085","transmembrane transport","1/6","429/5696",0.375019006125008,0.413185869216102,0.362443744926406,"Pp3c9_17220V3",1
"GO:0007165","GO:0007165","signal transduction","1/6","433/5696",0.377862786618159,0.413185869216102,0.362443744926406,"Pp3c4_23550V3",1
"GO:0044271","GO:0044271","cellular nitrogen compound biosynthetic process","1/6","433/5696",0.377862786618159,0.413185869216102,0.362443744926406,"Pp3c23_9660V3",1
"GO:0009314","GO:0009314","response to radiation","1/6","438/5696",0.381402340814864,0.413185869216102,0.362443744926406,"Pp3c23_9660V3",1
"GO:0065008","GO:0065008","regulation of biological quality","1/6","450/5696",0.389828859017366,0.416495439502351,0.365346876756448,"Pp3c9_17220V3",1
"GO:0010035","GO:0010035","response to inorganic substance","1/6","470/5696",0.403660437609097,0.416495439502351,0.365346876756448,"Pp3c9_17220V3",1
"GO:0001101","GO:0001101","response to acid chemical","1/6","477/5696",0.408439322068402,0.416495439502351,0.365346876756448,"Pp3c9_17220V3",1
"GO:0016070","GO:0016070","RNA metabolic process","1/6","478/5696",0.409119407155122,0.416495439502351,0.365346876756448,"Pp3c23_9660V3",1
"GO:0010467","GO:0010467","gene expression","1/6","481/5696",0.411155754380526,0.416495439502351,0.365346876756448,"Pp3c23_9660V3",1
"GO:0003006","GO:0003006","developmental process involved in reproduction","1/6","496/5696",0.42124998582433,0.42124998582433,0.369517531424851,"Pp3c23_9660V3",1
