nodeName	altName	nodeAttr[nodesPresent, ]
Me1_v2_0003920	NA	blue
Me1_v2_0010720	NA	blue
Me1_v2_0011670	NA	blue
Me1_v2_0020730	NA	blue
Me1_v2_0024040	NA	blue
Me1_v2_0024240	NA	blue
Me1_v2_0024850	NA	blue
Me1_v2_0026910	NA	blue
Me1_v2_0028060	NA	blue
Me1_v2_0029320	NA	blue
Me1_v2_0031170	NA	blue
Me1_v2_0031680	NA	blue
Me1_v2_0032040	NA	blue
Me1_v2_0033200	NA	blue
Me1_v2_0033990	NA	blue
Me1_v2_0034000	NA	blue
Me1_v2_0034060	NA	blue
Me1_v2_0034240	NA	blue
Me1_v2_0034720	NA	blue
Me1_v2_0035030	NA	blue
Me1_v2_0035240	NA	blue
Me1_v2_0035360	NA	blue
Me1_v2_0035490	NA	blue
Me1_v2_0035680	NA	blue
Me1_v2_0036480	NA	blue
Me1_v2_0036910	NA	blue
Me1_v2_0037130	NA	blue
Me1_v2_0037320	NA	blue
Me1_v2_0037460	NA	blue
Me1_v2_0037560	NA	blue
Me1_v2_0037650	NA	blue
Me1_v2_0037660	NA	blue
Me1_v2_0037800	NA	blue
Me1_v2_0037810	NA	blue
Me1_v2_0037860	NA	blue
Me1_v2_0038120	NA	blue
Me1_v2_0038150	NA	blue
Me1_v2_0038380	NA	blue
Me1_v2_0038860	NA	blue
Me1_v2_0038990	NA	blue
Me1_v2_0039000	NA	blue
Me1_v2_0039250	NA	blue
Me1_v2_0039430	NA	blue
Me1_v2_0039880	NA	blue
Me1_v2_0040120	NA	blue
Me1_v2_0040540	NA	blue
Me1_v2_0040560	NA	blue
Me1_v2_0041070	NA	blue
Me1_v2_0041130	NA	blue
Me1_v2_0041570	NA	blue
Me1_v2_0041980	NA	blue
Me1_v2_0042100	NA	blue
Me1_v2_0050170	NA	blue
Me1_v2_0050490	NA	blue
Me1_v2_0050600	NA	blue
Me1_v2_0050960	NA	blue
Me1_v2_0051020	NA	blue
Me1_v2_0051160	NA	blue
Me1_v2_0051200	NA	blue
Me1_v2_0051270	NA	blue
Me1_v2_0051290	NA	blue
Me1_v2_0051350	NA	blue
Me1_v2_0051390	NA	blue
Me1_v2_0051430	NA	blue
Me1_v2_0051450	NA	blue
Me1_v2_0051500	NA	blue
Me1_v2_0051710	NA	blue
Me1_v2_0051880	NA	blue
Me1_v2_0051890	NA	blue
Me1_v2_0052120	NA	blue
Me1_v2_0052150	NA	blue
Me1_v2_0052160	NA	blue
Me1_v2_0052420	NA	blue
Me1_v2_0052490	NA	blue
Me1_v2_0052720	NA	blue
Me1_v2_0052730	NA	blue
Me1_v2_0052850	NA	blue
Me1_v2_0052870	NA	blue
Me1_v2_0053110	NA	blue
Me1_v2_0053280	NA	blue
Me1_v2_0053810	NA	blue
Me1_v2_0054070	NA	blue
Me1_v2_0054110	NA	blue
Me1_v2_0054250	NA	blue
Me1_v2_0054340	NA	blue
Me1_v2_0054360	NA	blue
Me1_v2_0054600	NA	blue
Me1_v2_0054650	NA	blue
Me1_v2_0054710	NA	blue
Me1_v2_0054830	NA	blue
Me1_v2_0054870	NA	blue
Me1_v2_0054900	NA	blue
Me1_v2_0054920	NA	blue
Me1_v2_0054940	NA	blue
Me1_v2_0055210	NA	blue
Me1_v2_0055230	NA	blue
Me1_v2_0055260	NA	blue
Me1_v2_0055360	NA	blue
Me1_v2_0055430	NA	blue
Me1_v2_0055450	NA	blue
Me1_v2_0055520	NA	blue
Me1_v2_0055740	NA	blue
Me1_v2_0055800	NA	blue
Me1_v2_0055890	NA	blue
Me1_v2_0055920	NA	blue
Me1_v2_0056140	NA	blue
Me1_v2_0056410	NA	blue
Me1_v2_0056900	NA	blue
Me1_v2_0057010	NA	blue
Me1_v2_0057050	NA	blue
Me1_v2_0057430	NA	blue
Me1_v2_0057520	NA	blue
Me1_v2_0057970	NA	blue
Me1_v2_0058020	NA	blue
Me1_v2_0058040	NA	blue
Me1_v2_0058070	NA	blue
Me1_v2_0058160	NA	blue
Me1_v2_0058320	NA	blue
Me1_v2_0058580	NA	blue
Me1_v2_0058670	NA	blue
Me1_v2_0058690	NA	blue
Me1_v2_0058790	NA	blue
Me1_v2_0058900	NA	blue
Me1_v2_0059210	NA	blue
Me1_v2_0059500	NA	blue
Me1_v2_0059510	NA	blue
Me1_v2_0059840	NA	blue
Me1_v2_0059870	NA	blue
Me1_v2_0060050	NA	blue
Me1_v2_0060090	NA	blue
Me1_v2_0060470	NA	blue
Me1_v2_0060480	NA	blue
Me1_v2_0060550	NA	blue
Me1_v2_0060680	NA	blue
Me1_v2_0060790	NA	blue
Me1_v2_0060880	NA	blue
Me1_v2_0061010	NA	blue
Me1_v2_0061200	NA	blue
Me1_v2_0061400	NA	blue
Me1_v2_0061530	NA	blue
Me1_v2_0061750	NA	blue
Me1_v2_0061990	NA	blue
Me1_v2_0062170	NA	blue
Me1_v2_0062280	NA	blue
Me1_v2_0062310	NA	blue
Me1_v2_0062580	NA	blue
Me1_v2_0062590	NA	blue
Me1_v2_0062680	NA	blue
Me1_v2_0062700	NA	blue
Me1_v2_0063270	NA	blue
Me1_v2_0063280	NA	blue
Me1_v2_0063440	NA	blue
Me1_v2_0063450	NA	blue
Me1_v2_0063830	NA	blue
Me1_v2_0063860	NA	blue
Me1_v2_0063930	NA	blue
Me1_v2_0063980	NA	blue
Me1_v2_0063990	NA	blue
Me1_v2_0064260	NA	blue
Me1_v2_0064270	NA	blue
Me1_v2_0064390	NA	blue
Me1_v2_0064580	NA	blue
Me1_v2_0064640	NA	blue
Me1_v2_0064670	NA	blue
Me1_v2_0064790	NA	blue
Me1_v2_0065090	NA	blue
Me1_v2_0065200	NA	blue
Me1_v2_0065240	NA	blue
Me1_v2_0065440	NA	blue
Me1_v2_0065750	NA	blue
Me1_v2_0065760	NA	blue
Me1_v2_0066400	NA	blue
Me1_v2_0066470	NA	blue
Me1_v2_0066690	NA	blue
Me1_v2_0066710	NA	blue
Me1_v2_0066720	NA	blue
Me1_v2_0066790	NA	blue
Me1_v2_0066800	NA	blue
Me1_v2_0067150	NA	blue
Me1_v2_0067210	NA	blue
Me1_v2_0067480	NA	blue
Me1_v2_0067610	NA	blue
Me1_v2_0067880	NA	blue
Me1_v2_0067900	NA	blue
Me1_v2_0068070	NA	blue
Me1_v2_0068120	NA	blue
Me1_v2_0068210	NA	blue
Me1_v2_0068300	NA	blue
Me1_v2_0068500	NA	blue
Me1_v2_0068860	NA	blue
Me1_v2_0069040	NA	blue
Me1_v2_0069090	NA	blue
Me1_v2_0069270	NA	blue
Me1_v2_0069280	NA	blue
Me1_v2_0069410	NA	blue
Me1_v2_0069580	NA	blue
Me1_v2_0069720	NA	blue
Me1_v2_0069850	NA	blue
Me1_v2_0069860	NA	blue
Me1_v2_0069880	NA	blue
Me1_v2_0069920	NA	blue
Me1_v2_0069940	NA	blue
Me1_v2_0070060	NA	blue
Me1_v2_0070170	NA	blue
Me1_v2_0070180	NA	blue
Me1_v2_0070410	NA	blue
Me1_v2_0070470	NA	blue
Me1_v2_0070510	NA	blue
Me1_v2_0070530	NA	blue
Me1_v2_0070620	NA	blue
Me1_v2_0070650	NA	blue
Me1_v2_0070750	NA	blue
Me1_v2_0070760	NA	blue
Me1_v2_0070830	NA	blue
Me1_v2_0070960	NA	blue
Me1_v2_0071000	NA	blue
Me1_v2_0071010	NA	blue
Me1_v2_0071120	NA	blue
Me1_v2_0071410	NA	blue
Me1_v2_0071430	NA	blue
Me1_v2_0071440	NA	blue
Me1_v2_0071450	NA	blue
Me1_v2_0071530	NA	blue
Me1_v2_0071540	NA	blue
Me1_v2_0071780	NA	blue
Me1_v2_0071920	NA	blue
Me1_v2_0072060	NA	blue
Me1_v2_0072250	NA	blue
Me1_v2_0072320	NA	blue
Me1_v2_0072330	NA	blue
Me1_v2_0072710	NA	blue
Me1_v2_0072740	NA	blue
Me1_v2_0072750	NA	blue
Me1_v2_0072770	NA	blue
Me1_v2_0072800	NA	blue
Me1_v2_0072830	NA	blue
Me1_v2_0072910	NA	blue
Me1_v2_0072980	NA	blue
Me1_v2_0073120	NA	blue
Me1_v2_0073590	NA	blue
Me1_v2_0073690	NA	blue
Me1_v2_0073740	NA	blue
Me1_v2_0073830	NA	blue
Me1_v2_0073880	NA	blue
Me1_v2_0073960	NA	blue
Me1_v2_0073970	NA	blue
Me1_v2_0074070	NA	blue
Me1_v2_0074150	NA	blue
Me1_v2_0074210	NA	blue
Me1_v2_0074330	NA	blue
Me1_v2_0074470	NA	blue
Me1_v2_0074600	NA	blue
Me1_v2_0074710	NA	blue
Me1_v2_0074720	NA	blue
Me1_v2_0074950	NA	blue
Me1_v2_0074990	NA	blue
Me1_v2_0075230	NA	blue
Me1_v2_0075480	NA	blue
Me1_v2_0075640	NA	blue
Me1_v2_0075740	NA	blue
Me1_v2_0075770	NA	blue
Me1_v2_0075780	NA	blue
Me1_v2_0075810	NA	blue
Me1_v2_0075840	NA	blue
Me1_v2_0075870	NA	blue
Me1_v2_0075880	NA	blue
Me1_v2_0075890	NA	blue
Me1_v2_0076110	NA	blue
Me1_v2_0076540	NA	blue
Me1_v2_0076690	NA	blue
Me1_v2_0076720	NA	blue
Me1_v2_0076850	NA	blue
Me1_v2_0076860	NA	blue
Me1_v2_0077100	NA	blue
Me1_v2_0077110	NA	blue
Me1_v2_0077240	NA	blue
Me1_v2_0077260	NA	blue
Me1_v2_0077490	NA	blue
Me1_v2_0077780	NA	blue
Me1_v2_0077950	NA	blue
Me1_v2_0078200	NA	blue
Me1_v2_0078310	NA	blue
Me1_v2_0078370	NA	blue
Me1_v2_0078940	NA	blue
Me1_v2_0078990	NA	blue
Me1_v2_0079090	NA	blue
Me1_v2_0079500	NA	blue
Me1_v2_0079560	NA	blue
Me1_v2_0079960	NA	blue
Me1_v2_0080040	NA	blue
Me1_v2_0080050	NA	blue
Me1_v2_0080080	NA	blue
Me1_v2_0080090	NA	blue
Me1_v2_0080400	NA	blue
Me1_v2_0080940	NA	blue
Me1_v2_0080990	NA	blue
Me1_v2_0081460	NA	blue
Me1_v2_0081810	NA	blue
Me1_v2_0081990	NA	blue
Me1_v2_0082100	NA	blue
Me1_v2_0082110	NA	blue
Me1_v2_0082120	NA	blue
Me1_v2_0082220	NA	blue
Me1_v2_0082640	NA	blue
Me1_v2_0082760	NA	blue
Me1_v2_0083330	NA	blue
Me1_v2_0083460	NA	blue
Me1_v2_0083610	NA	blue
Me1_v2_0083760	NA	blue
Me1_v2_0083770	NA	blue
Me1_v2_0083780	NA	blue
Me1_v2_0083890	NA	blue
Me1_v2_0083980	NA	blue
Me1_v2_0083990	NA	blue
Me1_v2_0084060	NA	blue
Me1_v2_0084390	NA	blue
Me1_v2_0084440	NA	blue
Me1_v2_0085040	NA	blue
Me1_v2_0085140	NA	blue
Me1_v2_0085180	NA	blue
Me1_v2_0085230	NA	blue
Me1_v2_0085380	NA	blue
Me1_v2_0085440	NA	blue
Me1_v2_0085590	NA	blue
Me1_v2_0085770	NA	blue
Me1_v2_0085950	NA	blue
Me1_v2_0085970	NA	blue
Me1_v2_0086010	NA	blue
Me1_v2_0086050	NA	blue
Me1_v2_0086120	NA	blue
Me1_v2_0086150	NA	blue
Me1_v2_0086270	NA	blue
Me1_v2_0086310	NA	blue
Me1_v2_0086470	NA	blue
Me1_v2_0086570	NA	blue
Me1_v2_0086640	NA	blue
Me1_v2_0086700	NA	blue
Me1_v2_0086710	NA	blue
Me1_v2_0086880	NA	blue
Me1_v2_0087080	NA	blue
Me1_v2_0087130	NA	blue
Me1_v2_0087170	NA	blue
Me1_v2_0087250	NA	blue
Me1_v2_0087440	NA	blue
Me1_v2_0087610	NA	blue
Me1_v2_0087790	NA	blue
Me1_v2_0088260	NA	blue
Me1_v2_0088390	NA	blue
Me1_v2_0088510	NA	blue
Me1_v2_0088630	NA	blue
Me1_v2_0088900	NA	blue
Me1_v2_0089120	NA	blue
Me1_v2_0089150	NA	blue
Me1_v2_0089280	NA	blue
Me1_v2_0089440	NA	blue
Me1_v2_0089560	NA	blue
Me1_v2_0089620	NA	blue
Me1_v2_0089730	NA	blue
Me1_v2_0089740	NA	blue
Me1_v2_0089870	NA	blue
Me1_v2_0089960	NA	blue
Me1_v2_0090000	NA	blue
Me1_v2_0090060	NA	blue
Me1_v2_0090150	NA	blue
Me1_v2_0090240	NA	blue
Me1_v2_0090310	NA	blue
Me1_v2_0090360	NA	blue
Me1_v2_0090490	NA	blue
Me1_v2_0090510	NA	blue
Me1_v2_0090530	NA	blue
Me1_v2_0090730	NA	blue
Me1_v2_0090920	NA	blue
Me1_v2_0090940	NA	blue
Me1_v2_0090990	NA	blue
Me1_v2_0091020	NA	blue
Me1_v2_0091120	NA	blue
Me1_v2_0091390	NA	blue
Me1_v2_0091450	NA	blue
Me1_v2_0092000	NA	blue
Me1_v2_0092010	NA	blue
Me1_v2_0092040	NA	blue
Me1_v2_0092210	NA	blue
Me1_v2_0092280	NA	blue
Me1_v2_0092520	NA	blue
Me1_v2_0092550	NA	blue
Me1_v2_0092560	NA	blue
Me1_v2_0092880	NA	blue
Me1_v2_0092960	NA	blue
Me1_v2_0093010	NA	blue
Me1_v2_0093090	NA	blue
Me1_v2_0093110	NA	blue
Me1_v2_0093340	NA	blue
Me1_v2_0093350	NA	blue
Me1_v2_0093620	NA	blue
Me1_v2_0093780	NA	blue
Me1_v2_0093790	NA	blue
Me1_v2_0094210	NA	blue
Me1_v2_0094280	NA	blue
Me1_v2_0094350	NA	blue
Me1_v2_0094560	NA	blue
Me1_v2_0094810	NA	blue
Me1_v2_0094990	NA	blue
Me1_v2_0095070	NA	blue
Me1_v2_0095110	NA	blue
Me1_v2_0095790	NA	blue
Me1_v2_0095860	NA	blue
Me1_v2_0095870	NA	blue
Me1_v2_0095880	NA	blue
Me1_v2_0096280	NA	blue
Me1_v2_0096390	NA	blue
Me1_v2_0096530	NA	blue
Me1_v2_0096540	NA	blue
Me1_v2_0096550	NA	blue
Me1_v2_0096730	NA	blue
Me1_v2_0096770	NA	blue
Me1_v2_0096830	NA	blue
Me1_v2_0097150	NA	blue
Me1_v2_0097180	NA	blue
Me1_v2_0097220	NA	blue
Me1_v2_0097360	NA	blue
Me1_v2_0097650	NA	blue
Me1_v2_0097780	NA	blue
Me1_v2_0097800	NA	blue
Me1_v2_0098000	NA	blue
Me1_v2_0098010	NA	blue
Me1_v2_0098150	NA	blue
Me1_v2_0098160	NA	blue
Me1_v2_0098280	NA	blue
Me1_v2_0098300	NA	blue
Me1_v2_0098400	NA	blue
Me1_v2_0099060	NA	blue
Me1_v2_0099450	NA	blue
Me1_v2_0099460	NA	blue
Me1_v2_0099480	NA	blue
Me1_v2_0099490	NA	blue
Me1_v2_0099740	NA	blue
Me1_v2_0100040	NA	blue
Me1_v2_0100080	NA	blue
Me1_v2_0100170	NA	blue
Me1_v2_0100300	NA	blue
Me1_v2_0100470	NA	blue
Me1_v2_0100620	NA	blue
Me1_v2_0101210	NA	blue
Me1_v2_0101220	NA	blue
Me1_v2_0101340	NA	blue
Me1_v2_0101420	NA	blue
Me1_v2_0101850	NA	blue
Me1_v2_0101890	NA	blue
Me1_v2_0101990	NA	blue
Me1_v2_0102040	NA	blue
Me1_v2_0102050	NA	blue
Me1_v2_0102060	NA	blue
Me1_v2_0102120	NA	blue
Me1_v2_0102140	NA	blue
Me1_v2_0102170	NA	blue
Me1_v2_0102280	NA	blue
Me1_v2_0102440	NA	blue
Me1_v2_0102450	NA	blue
Me1_v2_0102670	NA	blue
Me1_v2_0102820	NA	blue
Me1_v2_0102830	NA	blue
Me1_v2_0102840	NA	blue
Me1_v2_0102880	NA	blue
Me1_v2_0103080	NA	blue
Me1_v2_0103140	NA	blue
Me1_v2_0103330	NA	blue
Me1_v2_0103620	NA	blue
Me1_v2_0103790	NA	blue
Me1_v2_0103890	NA	blue
Me1_v2_0104000	NA	blue
Me1_v2_0104170	NA	blue
Me1_v2_0104450	NA	blue
Me1_v2_0104590	NA	blue
Me1_v2_0104670	NA	blue
Me1_v2_0104710	NA	blue
Me1_v2_0104720	NA	blue
Me1_v2_0104820	NA	blue
Me1_v2_0104830	NA	blue
Me1_v2_0104840	NA	blue
Me1_v2_0104920	NA	blue
Me1_v2_0105220	NA	blue
Me1_v2_0105390	NA	blue
Me1_v2_0105620	NA	blue
Me1_v2_0105670	NA	blue
Me1_v2_0105900	NA	blue
Me1_v2_0105960	NA	blue
Me1_v2_0106100	NA	blue
Me1_v2_0106210	NA	blue
Me1_v2_0106290	NA	blue
Me1_v2_0106490	NA	blue
Me1_v2_0106680	NA	blue
Me1_v2_0106720	NA	blue
Me1_v2_0106740	NA	blue
Me1_v2_0106760	NA	blue
Me1_v2_0106770	NA	blue
Me1_v2_0106820	NA	blue
Me1_v2_0107060	NA	blue
Me1_v2_0107070	NA	blue
Me1_v2_0107160	NA	blue
Me1_v2_0107220	NA	blue
Me1_v2_0107260	NA	blue
Me1_v2_0107270	NA	blue
Me1_v2_0107370	NA	blue
Me1_v2_0107550	NA	blue
Me1_v2_0107590	NA	blue
Me1_v2_0107640	NA	blue
Me1_v2_0107790	NA	blue
Me1_v2_0107810	NA	blue
Me1_v2_0107990	NA	blue
Me1_v2_0108160	NA	blue
Me1_v2_0108300	NA	blue
Me1_v2_0108310	NA	blue
Me1_v2_0108540	NA	blue
Me1_v2_0108780	NA	blue
Me1_v2_0108800	NA	blue
Me1_v2_0108860	NA	blue
Me1_v2_0108920	NA	blue
Me1_v2_0108980	NA	blue
Me1_v2_0109390	NA	blue
Me1_v2_0109470	NA	blue
Me1_v2_0109520	NA	blue
Me1_v2_0109550	NA	blue
Me1_v2_0109610	NA	blue
Me1_v2_0109740	NA	blue
Me1_v2_0110050	NA	blue
Me1_v2_0110230	NA	blue
Me1_v2_0110620	NA	blue
Me1_v2_0110670	NA	blue
Me1_v2_0110720	NA	blue
Me1_v2_0110830	NA	blue
Me1_v2_0111410	NA	blue
Me1_v2_0111550	NA	blue
Me1_v2_0111610	NA	blue
Me1_v2_0111630	NA	blue
Me1_v2_0111640	NA	blue
Me1_v2_0111820	NA	blue
Me1_v2_0111890	NA	blue
Me1_v2_0111900	NA	blue
Me1_v2_0112110	NA	blue
Me1_v2_0112170	NA	blue
Me1_v2_0112540	NA	blue
Me1_v2_0112610	NA	blue
Me1_v2_0112720	NA	blue
Me1_v2_0112740	NA	blue
Me1_v2_0112770	NA	blue
Me1_v2_0112780	NA	blue
Me1_v2_0112850	NA	blue
Me1_v2_0112860	NA	blue
Me1_v2_0113050	NA	blue
Me1_v2_0113180	NA	blue
Me1_v2_0113200	NA	blue
Me1_v2_0113270	NA	blue
Me1_v2_0113650	NA	blue
Me1_v2_0113900	NA	blue
Me1_v2_0113970	NA	blue
Me1_v2_0114050	NA	blue
Me1_v2_0114160	NA	blue
Me1_v2_0114190	NA	blue
Me1_v2_0114210	NA	blue
Me1_v2_0114480	NA	blue
Me1_v2_0114610	NA	blue
Me1_v2_0114950	NA	blue
Me1_v2_0115060	NA	blue
Me1_v2_0115180	NA	blue
Me1_v2_0115360	NA	blue
Me1_v2_0115380	NA	blue
Me1_v2_0115540	NA	blue
Me1_v2_0115620	NA	blue
Me1_v2_0115660	NA	blue
Me1_v2_0115780	NA	blue
Me1_v2_0115820	NA	blue
Me1_v2_0115850	NA	blue
Me1_v2_0115900	NA	blue
Me1_v2_0115910	NA	blue
Me1_v2_0115920	NA	blue
Me1_v2_0116150	NA	blue
Me1_v2_0116170	NA	blue
Me1_v2_0116320	NA	blue
Me1_v2_0116500	NA	blue
Me1_v2_0116570	NA	blue
Me1_v2_0116580	NA	blue
Me1_v2_0116800	NA	blue
Me1_v2_0116810	NA	blue
Me1_v2_0117170	NA	blue
Me1_v2_0117190	NA	blue
Me1_v2_0117220	NA	blue
Me1_v2_0117250	NA	blue
Me1_v2_0117340	NA	blue
Me1_v2_0117490	NA	blue
Me1_v2_0117550	NA	blue
Me1_v2_0117630	NA	blue
Me1_v2_0117680	NA	blue
Me1_v2_0117730	NA	blue
Me1_v2_0118010	NA	blue
Me1_v2_0118030	NA	blue
Me1_v2_0118150	NA	blue
Me1_v2_0118170	NA	blue
Me1_v2_0118190	NA	blue
Me1_v2_0118290	NA	blue
Me1_v2_0118300	NA	blue
Me1_v2_0118420	NA	blue
Me1_v2_0118910	NA	blue
Me1_v2_0119000	NA	blue
Me1_v2_0119040	NA	blue
Me1_v2_0119140	NA	blue
Me1_v2_0119240	NA	blue
Me1_v2_0119730	NA	blue
Me1_v2_0119990	NA	blue
Me1_v2_0120000	NA	blue
Me1_v2_0120030	NA	blue
Me1_v2_0120420	NA	blue
Me1_v2_0120530	NA	blue
Me1_v2_0120850	NA	blue
Me1_v2_0120910	NA	blue
Me1_v2_0120930	NA	blue
Me1_v2_0121070	NA	blue
Me1_v2_0121080	NA	blue
Me1_v2_0121240	NA	blue
Me1_v2_0121460	NA	blue
Me1_v2_0121570	NA	blue
Me1_v2_0121720	NA	blue
Me1_v2_0121810	NA	blue
Me1_v2_0121910	NA	blue
Me1_v2_0122240	NA	blue
Me1_v2_0122280	NA	blue
Me1_v2_0122410	NA	blue
Me1_v2_0122510	NA	blue
Me1_v2_0122810	NA	blue
Me1_v2_0123410	NA	blue
Me1_v2_0123510	NA	blue
Me1_v2_0123620	NA	blue
Me1_v2_0123740	NA	blue
Me1_v2_0123760	NA	blue
Me1_v2_0123780	NA	blue
Me1_v2_0123800	NA	blue
Me1_v2_0123900	NA	blue
Me1_v2_0123910	NA	blue
Me1_v2_0124080	NA	blue
Me1_v2_0124250	NA	blue
Me1_v2_0124700	NA	blue
Me1_v2_0124780	NA	blue
Me1_v2_0124990	NA	blue
Me1_v2_0125020	NA	blue
Me1_v2_0125040	NA	blue
Me1_v2_0125050	NA	blue
Me1_v2_0125180	NA	blue
Me1_v2_0125320	NA	blue
Me1_v2_0125350	NA	blue
Me1_v2_0125370	NA	blue
Me1_v2_0125720	NA	blue
Me1_v2_0125760	NA	blue
Me1_v2_0125870	NA	blue
Me1_v2_0125940	NA	blue
Me1_v2_0126040	NA	blue
Me1_v2_0126080	NA	blue
Me1_v2_0126100	NA	blue
Me1_v2_0126180	NA	blue
Me1_v2_0126420	NA	blue
Me1_v2_0126580	NA	blue
Me1_v2_0126960	NA	blue
Me1_v2_0127160	NA	blue
Me1_v2_0127220	NA	blue
Me1_v2_0127320	NA	blue
Me1_v2_0127350	NA	blue
Me1_v2_0127420	NA	blue
Me1_v2_0127440	NA	blue
Me1_v2_0127450	NA	blue
Me1_v2_0127540	NA	blue
Me1_v2_0127550	NA	blue
Me1_v2_0127910	NA	blue
Me1_v2_0127950	NA	blue
Me1_v2_0128020	NA	blue
Me1_v2_0128170	NA	blue
Me1_v2_0128190	NA	blue
Me1_v2_0128200	NA	blue
Me1_v2_0128220	NA	blue
Me1_v2_0128380	NA	blue
Me1_v2_0128470	NA	blue
Me1_v2_0128720	NA	blue
Me1_v2_0128920	NA	blue
Me1_v2_0129130	NA	blue
Me1_v2_0129200	NA	blue
Me1_v2_0129290	NA	blue
Me1_v2_0129300	NA	blue
Me1_v2_0129490	NA	blue
Me1_v2_0129580	NA	blue
Me1_v2_0129860	NA	blue
Me1_v2_0129870	NA	blue
Me1_v2_0129880	NA	blue
Me1_v2_0129980	NA	blue
Me1_v2_0130010	NA	blue
Me1_v2_0130040	NA	blue
Me1_v2_0130070	NA	blue
Me1_v2_0130100	NA	blue
Me1_v2_0130140	NA	blue
Me1_v2_0130200	NA	blue
Me1_v2_0130310	NA	blue
Me1_v2_0130330	NA	blue
Me1_v2_0130340	NA	blue
Me1_v2_0130760	NA	blue
Me1_v2_0131030	NA	blue
Me1_v2_0131110	NA	blue
Me1_v2_0131130	NA	blue
Me1_v2_0131180	NA	blue
Me1_v2_0131350	NA	blue
Me1_v2_0131390	NA	blue
Me1_v2_0131410	NA	blue
Me1_v2_0131520	NA	blue
Me1_v2_0131800	NA	blue
Me1_v2_0131830	NA	blue
Me1_v2_0132060	NA	blue
Me1_v2_0132150	NA	blue
Me1_v2_0132250	NA	blue
Me1_v2_0132460	NA	blue
Me1_v2_0132960	NA	blue
Me1_v2_0132970	NA	blue
Me1_v2_0133030	NA	blue
Me1_v2_0133070	NA	blue
Me1_v2_0133320	NA	blue
Me1_v2_0133440	NA	blue
Me1_v2_0133470	NA	blue
Me1_v2_0133480	NA	blue
Me1_v2_0133610	NA	blue
Me1_v2_0134250	NA	blue
Me1_v2_0134320	NA	blue
Me1_v2_0134360	NA	blue
Me1_v2_0134470	NA	blue
Me1_v2_0134520	NA	blue
Me1_v2_0134830	NA	blue
Me1_v2_0134940	NA	blue
Me1_v2_0134950	NA	blue
Me1_v2_0135070	NA	blue
Me1_v2_0135130	NA	blue
Me1_v2_0135190	NA	blue
Me1_v2_0135220	NA	blue
Me1_v2_0135460	NA	blue
Me1_v2_0135630	NA	blue
Me1_v2_0135740	NA	blue
Me1_v2_0135800	NA	blue
Me1_v2_0135880	NA	blue
Me1_v2_0135940	NA	blue
Me1_v2_0136070	NA	blue
Me1_v2_0137230	NA	blue
Me1_v2_0137250	NA	blue
Me1_v2_0137480	NA	blue
Me1_v2_0137540	NA	blue
Me1_v2_0137910	NA	blue
Me1_v2_0137920	NA	blue
Me1_v2_0137960	NA	blue
Me1_v2_0138160	NA	blue
Me1_v2_0138330	NA	blue
Me1_v2_0138390	NA	blue
Me1_v2_0138490	NA	blue
Me1_v2_0138530	NA	blue
Me1_v2_0138740	NA	blue
Me1_v2_0138750	NA	blue
Me1_v2_0138770	NA	blue
Me1_v2_0138780	NA	blue
Me1_v2_0138800	NA	blue
Me1_v2_0138880	NA	blue
Me1_v2_0138930	NA	blue
Me1_v2_0139020	NA	blue
Me1_v2_0139490	NA	blue
Me1_v2_0139510	NA	blue
Me1_v2_0139600	NA	blue
Me1_v2_0139620	NA	blue
Me1_v2_0139670	NA	blue
Me1_v2_0139680	NA	blue
Me1_v2_0139720	NA	blue
Me1_v2_0139870	NA	blue
Me1_v2_0139880	NA	blue
Me1_v2_0140160	NA	blue
Me1_v2_0140670	NA	blue
Me1_v2_0140980	NA	blue
Me1_v2_0141130	NA	blue
Me1_v2_0141150	NA	blue
Me1_v2_0141280	NA	blue
Me1_v2_0141350	NA	blue
Me1_v2_0141530	NA	blue
Me1_v2_0141720	NA	blue
Me1_v2_0141910	NA	blue
Me1_v2_0141970	NA	blue
Me1_v2_0142030	NA	blue
Me1_v2_0142090	NA	blue
Me1_v2_0142250	NA	blue
Me1_v2_0142270	NA	blue
Me1_v2_0142290	NA	blue
Me1_v2_0142360	NA	blue
Me1_v2_0142370	NA	blue
Me1_v2_0142780	NA	blue
Me1_v2_0142910	NA	blue
Me1_v2_0143350	NA	blue
Me1_v2_0143380	NA	blue
Me1_v2_0143460	NA	blue
Me1_v2_0143500	NA	blue
Me1_v2_0143630	NA	blue
Me1_v2_0143670	NA	blue
Me1_v2_0144490	NA	blue
Me1_v2_0144510	NA	blue
Me1_v2_0144730	NA	blue
Me1_v2_0144740	NA	blue
Me1_v2_0145030	NA	blue
Me1_v2_0145040	NA	blue
Me1_v2_0145090	NA	blue
Me1_v2_0145120	NA	blue
Me1_v2_0145180	NA	blue
Me1_v2_0145200	NA	blue
Me1_v2_0145430	NA	blue
Me1_v2_0145560	NA	blue
Me1_v2_0145680	NA	blue
Me1_v2_0145900	NA	blue
Me1_v2_0146020	NA	blue
Me1_v2_0146170	NA	blue
Me1_v2_0146460	NA	blue
Me1_v2_0146580	NA	blue
Me1_v2_0146630	NA	blue
Me1_v2_0146800	NA	blue
Me1_v2_0146820	NA	blue
Me1_v2_0147110	NA	blue
Me1_v2_0147220	NA	blue
Me1_v2_0147270	NA	blue
Me1_v2_0147300	NA	blue
Me1_v2_0147350	NA	blue
Me1_v2_0147430	NA	blue
Me1_v2_0147550	NA	blue
Me1_v2_0147640	NA	blue
Me1_v2_0147720	NA	blue
Me1_v2_0147870	NA	blue
Me1_v2_0148040	NA	blue
Me1_v2_0148460	NA	blue
Me1_v2_0148690	NA	blue
Me1_v2_0148750	NA	blue
Me1_v2_0148900	NA	blue
Me1_v2_0149140	NA	blue
Me1_v2_0149160	NA	blue
Me1_v2_0149630	NA	blue
Me1_v2_0149680	NA	blue
Me1_v2_0149920	NA	blue
Me1_v2_0150010	NA	blue
Me1_v2_0150020	NA	blue
Me1_v2_0150140	NA	blue
Me1_v2_0150220	NA	blue
Me1_v2_0150230	NA	blue
Me1_v2_0150470	NA	blue
Me1_v2_0150480	NA	blue
Me1_v2_0150610	NA	blue
Me1_v2_0150920	NA	blue
Me1_v2_0151100	NA	blue
Me1_v2_0151110	NA	blue
Me1_v2_0151120	NA	blue
Me1_v2_0151250	NA	blue
Me1_v2_0151460	NA	blue
Me1_v2_0151640	NA	blue
Me1_v2_0151710	NA	blue
Me1_v2_0151800	NA	blue
Me1_v2_0152040	NA	blue
Me1_v2_0152060	NA	blue
Me1_v2_0152150	NA	blue
Me1_v2_0152190	NA	blue
Me1_v2_0152210	NA	blue
Me1_v2_0152400	NA	blue
Me1_v2_0152450	NA	blue
Me1_v2_0152580	NA	blue
Me1_v2_0152620	NA	blue
Me1_v2_0152630	NA	blue
Me1_v2_0153000	NA	blue
Me1_v2_0153080	NA	blue
Me1_v2_0153090	NA	blue
Me1_v2_0153110	NA	blue
Me1_v2_0153380	NA	blue
Me1_v2_0153570	NA	blue
Me1_v2_0153690	NA	blue
Me1_v2_0153720	NA	blue
Me1_v2_0153990	NA	blue
Me1_v2_0154030	NA	blue
Me1_v2_0154050	NA	blue
Me1_v2_0154130	NA	blue
Me1_v2_0154140	NA	blue
Me1_v2_0154190	NA	blue
Me1_v2_0154390	NA	blue
Me1_v2_0154400	NA	blue
Me1_v2_0154610	NA	blue
Me1_v2_0154800	NA	blue
Me1_v2_0154940	NA	blue
Me1_v2_0155230	NA	blue
Me1_v2_0155280	NA	blue
Me1_v2_0155330	NA	blue
Me1_v2_0155460	NA	blue
Me1_v2_0155750	NA	blue
Me1_v2_0155830	NA	blue
Me1_v2_0156280	NA	blue
Me1_v2_0156290	NA	blue
Me1_v2_0156570	NA	blue
Me1_v2_0156680	NA	blue
Me1_v2_0156700	NA	blue
Me1_v2_0156830	NA	blue
Me1_v2_0157400	NA	blue
Me1_v2_0157410	NA	blue
Me1_v2_0157740	NA	blue
Me1_v2_0158080	NA	blue
Me1_v2_0158290	NA	blue
Me1_v2_0158370	NA	blue
Me1_v2_0158390	NA	blue
Me1_v2_0158460	NA	blue
Me1_v2_0158680	NA	blue
Me1_v2_0158690	NA	blue
Me1_v2_0158750	NA	blue
Me1_v2_0158820	NA	blue
Me1_v2_0158890	NA	blue
Me1_v2_0158900	NA	blue
Me1_v2_0158930	NA	blue
Me1_v2_0159000	NA	blue
Me1_v2_0159210	NA	blue
Me1_v2_0159230	NA	blue
Me1_v2_0159400	NA	blue
Me1_v2_0159560	NA	blue
Me1_v2_0159670	NA	blue
Me1_v2_0159700	NA	blue
Me1_v2_0159760	NA	blue
Me1_v2_0159890	NA	blue
Me1_v2_0160190	NA	blue
Me1_v2_0160200	NA	blue
Me1_v2_0160220	NA	blue
Me1_v2_0160580	NA	blue
Me1_v2_0160670	NA	blue
Me1_v2_0160860	NA	blue
Me1_v2_0160890	NA	blue
Me1_v2_0160920	NA	blue
Me1_v2_0160940	NA	blue
Me1_v2_0160980	NA	blue
Me1_v2_0161330	NA	blue
Me1_v2_0161600	NA	blue
Me1_v2_0161830	NA	blue
Me1_v2_0162020	NA	blue
Me1_v2_0162190	NA	blue
Me1_v2_0162200	NA	blue
Me1_v2_0162370	NA	blue
Me1_v2_0162710	NA	blue
Me1_v2_0162940	NA	blue
Me1_v2_0163030	NA	blue
Me1_v2_0163190	NA	blue
Me1_v2_0163320	NA	blue
Me1_v2_0163500	NA	blue
Me1_v2_0163650	NA	blue
Me1_v2_0163660	NA	blue
Me1_v2_0163700	NA	blue
Me1_v2_0163750	NA	blue
Me1_v2_0164020	NA	blue
Me1_v2_0164040	NA	blue
Me1_v2_0164110	NA	blue
Me1_v2_0164330	NA	blue
Me1_v2_0164380	NA	blue
Me1_v2_0164410	NA	blue
Me1_v2_0164420	NA	blue
Me1_v2_0164610	NA	blue
Me1_v2_0164760	NA	blue
Me1_v2_0164770	NA	blue
Me1_v2_0164810	NA	blue
Me1_v2_0164860	NA	blue
Me1_v2_0164960	NA	blue
Me1_v2_0165130	NA	blue
Me1_v2_0165580	NA	blue
Me1_v2_0165600	NA	blue
Me1_v2_0165740	NA	blue
Me1_v2_0165760	NA	blue
Me1_v2_0166010	NA	blue
Me1_v2_0166120	NA	blue
Me1_v2_0166250	NA	blue
Me1_v2_0166270	NA	blue
Me1_v2_0166420	NA	blue
Me1_v2_0166490	NA	blue
Me1_v2_0166590	NA	blue
Me1_v2_0166600	NA	blue
Me1_v2_0166610	NA	blue
Me1_v2_0166670	NA	blue
Me1_v2_0166680	NA	blue
Me1_v2_0166690	NA	blue
Me1_v2_0166710	NA	blue
Me1_v2_0166720	NA	blue
Me1_v2_0166800	NA	blue
Me1_v2_0166920	NA	blue
Me1_v2_0166940	NA	blue
Me1_v2_0167010	NA	blue
Me1_v2_0167130	NA	blue
Me1_v2_0167140	NA	blue
Me1_v2_0167200	NA	blue
Me1_v2_0167210	NA	blue
Me1_v2_0167280	NA	blue
Me1_v2_0167310	NA	blue
Me1_v2_0167380	NA	blue
Me1_v2_0167420	NA	blue
Me1_v2_0167450	NA	blue
Me1_v2_0167460	NA	blue
Me1_v2_0167510	NA	blue
Me1_v2_0167560	NA	blue
Me1_v2_0167830	NA	blue
Me1_v2_0168060	NA	blue
Me1_v2_0168090	NA	blue
Me1_v2_0168180	NA	blue
Me1_v2_0168200	NA	blue
Me1_v2_0168280	NA	blue
Me1_v2_0168390	NA	blue
Me1_v2_0168610	NA	blue
Me1_v2_0168620	NA	blue
Me1_v2_0168700	NA	blue
Me1_v2_0168870	NA	blue
Me1_v2_0168940	NA	blue
Me1_v2_0169340	NA	blue
Me1_v2_0169420	NA	blue
Me1_v2_0169570	NA	blue
Me1_v2_0169810	NA	blue
Me1_v2_0169830	NA	blue
Me1_v2_0169920	NA	blue
Me1_v2_0170400	NA	blue
Me1_v2_0170600	NA	blue
Me1_v2_0170660	NA	blue
Me1_v2_0170830	NA	blue
Me1_v2_0170850	NA	blue
Me1_v2_0170860	NA	blue
Me1_v2_0170870	NA	blue
Me1_v2_0170960	NA	blue
Me1_v2_0171070	NA	blue
Me1_v2_0171100	NA	blue
Me1_v2_0171340	NA	blue
Me1_v2_0171500	NA	blue
Me1_v2_0171600	NA	blue
Me1_v2_0171620	NA	blue
Me1_v2_0171650	NA	blue
Me1_v2_0171670	NA	blue
Me1_v2_0171770	NA	blue
Me1_v2_0171780	NA	blue
Me1_v2_0171790	NA	blue
Me1_v2_0171810	NA	blue
Me1_v2_0172200	NA	blue
Me1_v2_0172460	NA	blue
Me1_v2_0172510	NA	blue
Me1_v2_0172840	NA	blue
Me1_v2_0172920	NA	blue
Me1_v2_0172930	NA	blue
Me1_v2_0173040	NA	blue
Me1_v2_0173170	NA	blue
Me1_v2_0173400	NA	blue
Me1_v2_0173760	NA	blue
Me1_v2_0173830	NA	blue
Me1_v2_0173940	NA	blue
Me1_v2_0174060	NA	blue
Me1_v2_0174070	NA	blue
Me1_v2_0174090	NA	blue
Me1_v2_0174100	NA	blue
Me1_v2_0174110	NA	blue
Me1_v2_0174190	NA	blue
Me1_v2_0174320	NA	blue
Me1_v2_0174480	NA	blue
Me1_v2_0174550	NA	blue
Me1_v2_0174740	NA	blue
Me1_v2_0174790	NA	blue
Me1_v2_0174800	NA	blue
Me1_v2_0175090	NA	blue
Me1_v2_0175300	NA	blue
Me1_v2_0175500	NA	blue
Me1_v2_0175720	NA	blue
Me1_v2_0175750	NA	blue
Me1_v2_0176050	NA	blue
Me1_v2_0176060	NA	blue
Me1_v2_0176160	NA	blue
Me1_v2_0176520	NA	blue
Me1_v2_0176620	NA	blue
Me1_v2_0176650	NA	blue
Me1_v2_0177090	NA	blue
Me1_v2_0177110	NA	blue
Me1_v2_0177310	NA	blue
Me1_v2_0177660	NA	blue
Me1_v2_0177690	NA	blue
Me1_v2_0177750	NA	blue
Me1_v2_0178060	NA	blue
Me1_v2_0178080	NA	blue
Me1_v2_0178190	NA	blue
Me1_v2_0178360	NA	blue
Me1_v2_0178600	NA	blue
Me1_v2_0178620	NA	blue
Me1_v2_0178630	NA	blue
Me1_v2_0178640	NA	blue
Me1_v2_0178680	NA	blue
Me1_v2_0178830	NA	blue
Me1_v2_0179080	NA	blue
Me1_v2_0179930	NA	blue
Me1_v2_0180040	NA	blue
Me1_v2_0180190	NA	blue
Me1_v2_0180270	NA	blue
Me1_v2_0180350	NA	blue
Me1_v2_0180390	NA	blue
Me1_v2_0180410	NA	blue
Me1_v2_0180660	NA	blue
Me1_v2_0180680	NA	blue
Me1_v2_0180700	NA	blue
Me1_v2_0180890	NA	blue
Me1_v2_0181210	NA	blue
Me1_v2_0181720	NA	blue
Me1_v2_0181880	NA	blue
Me1_v2_0181940	NA	blue
Me1_v2_0182060	NA	blue
Me1_v2_0182100	NA	blue
Me1_v2_0182160	NA	blue
Me1_v2_0182340	NA	blue
Me1_v2_0182510	NA	blue
Me1_v2_0182690	NA	blue
Me1_v2_0182990	NA	blue
Me1_v2_0183170	NA	blue
Me1_v2_0183430	NA	blue
Me1_v2_0183620	NA	blue
Me1_v2_0183640	NA	blue
Me1_v2_0183980	NA	blue
Me1_v2_0184190	NA	blue
Me1_v2_0184230	NA	blue
Me1_v2_0184280	NA	blue
Me1_v2_0184410	NA	blue
Me1_v2_0184510	NA	blue
Me1_v2_0184980	NA	blue
Me1_v2_0185070	NA	blue
Me1_v2_0185180	NA	blue
Me1_v2_0185260	NA	blue
Me1_v2_0185310	NA	blue
Me1_v2_0185340	NA	blue
Me1_v2_0185360	NA	blue
Me1_v2_0185370	NA	blue
Me1_v2_0185380	NA	blue
Me1_v2_0185420	NA	blue
Me1_v2_0185810	NA	blue
Me1_v2_0186350	NA	blue
Me1_v2_0186450	NA	blue
Me1_v2_0186510	NA	blue
Me1_v2_0186530	NA	blue
Me1_v2_0186540	NA	blue
Me1_v2_0187060	NA	blue
Me1_v2_0187130	NA	blue
Me1_v2_0187380	NA	blue
Me1_v2_0187390	NA	blue
Me1_v2_0187580	NA	blue
Me1_v2_0187600	NA	blue
Me1_v2_0187700	NA	blue
Me1_v2_0188070	NA	blue
Me1_v2_0188120	NA	blue
Me1_v2_0188240	NA	blue
Me1_v2_0188360	NA	blue
Me1_v2_0188450	NA	blue
Me1_v2_0188460	NA	blue
Me1_v2_0188890	NA	blue
Me1_v2_0189140	NA	blue
Me1_v2_0189150	NA	blue
Me1_v2_0189160	NA	blue
Me1_v2_0189180	NA	blue
Me1_v2_0189390	NA	blue
Me1_v2_0189520	NA	blue
Me1_v2_0189550	NA	blue
Me1_v2_0189560	NA	blue
Me1_v2_0189570	NA	blue
Me1_v2_0189610	NA	blue
Me1_v2_0189790	NA	blue
Me1_v2_0189990	NA	blue
Me1_v2_0190040	NA	blue
Me1_v2_0190200	NA	blue
Me1_v2_0190290	NA	blue
Me1_v2_0190300	NA	blue
Me1_v2_0190870	NA	blue
Me1_v2_0190940	NA	blue
Me1_v2_0191020	NA	blue
Me1_v2_0191070	NA	blue
Me1_v2_0191130	NA	blue
Me1_v2_0191220	NA	blue
Me1_v2_0191270	NA	blue
Me1_v2_0191570	NA	blue
Me1_v2_0191740	NA	blue
Me1_v2_0191810	NA	blue
Me1_v2_0191960	NA	blue
Me1_v2_0191970	NA	blue
Me1_v2_0192020	NA	blue
Me1_v2_0192060	NA	blue
Me1_v2_0192540	NA	blue
Me1_v2_0192550	NA	blue
Me1_v2_0192630	NA	blue
Me1_v2_0192650	NA	blue
Me1_v2_0192660	NA	blue
Me1_v2_0192670	NA	blue
Me1_v2_0192790	NA	blue
Me1_v2_0192810	NA	blue
Me1_v2_0192820	NA	blue
Me1_v2_0192990	NA	blue
Me1_v2_0193580	NA	blue
Me1_v2_0193590	NA	blue
Me1_v2_0193660	NA	blue
Me1_v2_0193750	NA	blue
Me1_v2_0193760	NA	blue
Me1_v2_0194070	NA	blue
Me1_v2_0194150	NA	blue
Me1_v2_0194200	NA	blue
Me1_v2_0194210	NA	blue
Me1_v2_0194260	NA	blue
Me1_v2_0194460	NA	blue
Me1_v2_0194760	NA	blue
Me1_v2_0195070	NA	blue
Me1_v2_0195080	NA	blue
Me1_v2_0195540	NA	blue
Me1_v2_0195790	NA	blue
Me1_v2_0195870	NA	blue
Me1_v2_0195890	NA	blue
Me1_v2_0195900	NA	blue
Me1_v2_0195920	NA	blue
Me1_v2_0196080	NA	blue
Me1_v2_0196120	NA	blue
Me1_v2_0196360	NA	blue
Me1_v2_0196380	NA	blue
Me1_v2_0196610	NA	blue
Me1_v2_0196680	NA	blue
Me1_v2_0197180	NA	blue
Me1_v2_0197360	NA	blue
Me1_v2_0197800	NA	blue
Me1_v2_0198030	NA	blue
Me1_v2_0198040	NA	blue
Me1_v2_0198140	NA	blue
Me1_v2_0198250	NA	blue
Me1_v2_0198550	NA	blue
Me1_v2_0198870	NA	blue
Me1_v2_0198920	NA	blue
Me1_v2_0199020	NA	blue
Me1_v2_0199070	NA	blue
Me1_v2_0199360	NA	blue
Me1_v2_0199610	NA	blue
Me1_v2_0199650	NA	blue
Me1_v2_0199690	NA	blue
Me1_v2_0199880	NA	blue
Me1_v2_0200020	NA	blue
Me1_v2_0200090	NA	blue
Me1_v2_0200190	NA	blue
Me1_v2_0200230	NA	blue
Me1_v2_0200320	NA	blue
Me1_v2_0200330	NA	blue
Me1_v2_0200410	NA	blue
Me1_v2_0200420	NA	blue
Me1_v2_0200540	NA	blue
Me1_v2_0200620	NA	blue
Me1_v2_0200730	NA	blue
Me1_v2_0200740	NA	blue
Me1_v2_0201030	NA	blue
Me1_v2_0201040	NA	blue
Me1_v2_0201310	NA	blue
Me1_v2_0201330	NA	blue
Me1_v2_0201340	NA	blue
Me1_v2_0201370	NA	blue
Me1_v2_0201900	NA	blue
Me1_v2_0201940	NA	blue
Me1_v2_0202470	NA	blue
Me1_v2_0202540	NA	blue
Me1_v2_0202640	NA	blue
Me1_v2_0202720	NA	blue
Me1_v2_0203100	NA	blue
Me1_v2_0203170	NA	blue
Me1_v2_0203380	NA	blue
Me1_v2_0203390	NA	blue
Me1_v2_0203410	NA	blue
Me1_v2_0203680	NA	blue
Me1_v2_0203770	NA	blue
Me1_v2_0204270	NA	blue
Me1_v2_0204390	NA	blue
Me1_v2_0204490	NA	blue
Me1_v2_0204580	NA	blue
Me1_v2_0204680	NA	blue
Me1_v2_0204730	NA	blue
Me1_v2_0204740	NA	blue
Me1_v2_0204780	NA	blue
Me1_v2_0205020	NA	blue
Me1_v2_0205300	NA	blue
Me1_v2_0205470	NA	blue
Me1_v2_0205480	NA	blue
Me1_v2_0205500	NA	blue
Me1_v2_0205550	NA	blue
Me1_v2_0205560	NA	blue
Me1_v2_0205570	NA	blue
Me1_v2_0205820	NA	blue
Me1_v2_0205850	NA	blue
Me1_v2_0206130	NA	blue
Me1_v2_0206170	NA	blue
Me1_v2_0206190	NA	blue
Me1_v2_0206250	NA	blue
Me1_v2_0206440	NA	blue
Me1_v2_0206490	NA	blue
Me1_v2_0206690	NA	blue
Me1_v2_0207210	NA	blue
Me1_v2_0207410	NA	blue
Me1_v2_0207460	NA	blue
Me1_v2_0207660	NA	blue
Me1_v2_0207680	NA	blue
Me1_v2_0207700	NA	blue
Me1_v2_0207730	NA	blue
Me1_v2_0207920	NA	blue
Me1_v2_0208090	NA	blue
Me1_v2_0208120	NA	blue
Me1_v2_0208480	NA	blue
Me1_v2_0208610	NA	blue
Me1_v2_0208710	NA	blue
Me1_v2_0208830	NA	blue
Me1_v2_0209280	NA	blue
Me1_v2_0209310	NA	blue
Me1_v2_0209320	NA	blue
Me1_v2_0209360	NA	blue
Me1_v2_0209380	NA	blue
Me1_v2_0209440	NA	blue
Me1_v2_0209450	NA	blue
Me1_v2_0210120	NA	blue
Me1_v2_0210530	NA	blue
Me1_v2_0210600	NA	blue
Me1_v2_0210630	NA	blue
Me1_v2_0210690	NA	blue
Me1_v2_0210770	NA	blue
Me1_v2_0210780	NA	blue
Me1_v2_0210900	NA	blue
Me1_v2_0210910	NA	blue
Me1_v2_0210990	NA	blue
Me1_v2_0211050	NA	blue
Me1_v2_0211100	NA	blue
Me1_v2_0211330	NA	blue
Me1_v2_0211850	NA	blue
Me1_v2_0211860	NA	blue
Me1_v2_0211880	NA	blue
Me1_v2_0211900	NA	blue
Me1_v2_0211940	NA	blue
Me1_v2_0212440	NA	blue
Me1_v2_0212580	NA	blue
Me1_v2_0212650	NA	blue
Me1_v2_0212880	NA	blue
Me1_v2_0212900	NA	blue
Me1_v2_0212990	NA	blue
Me1_v2_0213060	NA	blue
Me1_v2_0213300	NA	blue
Me1_v2_0213440	NA	blue
Me1_v2_0213730	NA	blue
Me1_v2_0213740	NA	blue
Me1_v2_0213770	NA	blue
Me1_v2_0213860	NA	blue
Me1_v2_0213870	NA	blue
Me1_v2_0214010	NA	blue
Me1_v2_0214020	NA	blue
Me1_v2_0214200	NA	blue
Me1_v2_0214320	NA	blue
Me1_v2_0214480	NA	blue
Me1_v2_0214570	NA	blue
Me1_v2_0214680	NA	blue
Me1_v2_0214690	NA	blue
Me1_v2_0214730	NA	blue
Me1_v2_0215100	NA	blue
Me1_v2_0215110	NA	blue
Me1_v2_0215620	NA	blue
Me1_v2_0215630	NA	blue
Me1_v2_0215780	NA	blue
Me1_v2_0215860	NA	blue
Me1_v2_0215880	NA	blue
Me1_v2_0216200	NA	blue
Me1_v2_0216210	NA	blue
Me1_v2_0216370	NA	blue
Me1_v2_0216420	NA	blue
Me1_v2_0216810	NA	blue
Me1_v2_0216860	NA	blue
Me1_v2_0216870	NA	blue
Me1_v2_0217110	NA	blue
Me1_v2_0217260	NA	blue
Me1_v2_0217290	NA	blue
Me1_v2_0217310	NA	blue
Me1_v2_0217740	NA	blue
Me1_v2_0217750	NA	blue
Me1_v2_0217800	NA	blue
Me1_v2_0218150	NA	blue
Me1_v2_0218160	NA	blue
Me1_v2_0218290	NA	blue
Me1_v2_0218350	NA	blue
Me1_v2_0218360	NA	blue
Me1_v2_0218440	NA	blue
Me1_v2_0218450	NA	blue
Me1_v2_0218580	NA	blue
Me1_v2_0218710	NA	blue
Me1_v2_0219100	NA	blue
Me1_v2_0219220	NA	blue
Me1_v2_0219370	NA	blue
Me1_v2_0219490	NA	blue
Me1_v2_0219720	NA	blue
Me1_v2_0219750	NA	blue
Me1_v2_0220090	NA	blue
Me1_v2_0220110	NA	blue
Me1_v2_0220170	NA	blue
Me1_v2_0220180	NA	blue
Me1_v2_0220190	NA	blue
Me1_v2_0220460	NA	blue
Me1_v2_0220920	NA	blue
Me1_v2_0221100	NA	blue
Me1_v2_0221330	NA	blue
Me1_v2_0221730	NA	blue
Me1_v2_0221740	NA	blue
Me1_v2_0221970	NA	blue
Me1_v2_0221980	NA	blue
Me1_v2_0222220	NA	blue
Me1_v2_0222340	NA	blue
Me1_v2_0222400	NA	blue
Me1_v2_0222480	NA	blue
Me1_v2_0222640	NA	blue
Me1_v2_0222810	NA	blue
Me1_v2_0222820	NA	blue
Me1_v2_0222840	NA	blue
Me1_v2_0222890	NA	blue
Me1_v2_0222960	NA	blue
Me1_v2_0223050	NA	blue
Me1_v2_0223150	NA	blue
Me1_v2_0223160	NA	blue
Me1_v2_0223640	NA	blue
Me1_v2_0223650	NA	blue
Me1_v2_0223730	NA	blue
Me1_v2_0223990	NA	blue
Me1_v2_0224370	NA	blue
Me1_v2_0224390	NA	blue
Me1_v2_0224460	NA	blue
Me1_v2_0224740	NA	blue
Me1_v2_0225040	NA	blue
Me1_v2_0225270	NA	blue
Me1_v2_0225490	NA	blue
Me1_v2_0225710	NA	blue
Me1_v2_0225830	NA	blue
Me1_v2_0225840	NA	blue
Me1_v2_0225990	NA	blue
Me1_v2_0226240	NA	blue
Me1_v2_0226330	NA	blue
Me1_v2_0226480	NA	blue
Me1_v2_0226510	NA	blue
Me1_v2_0226550	NA	blue
Me1_v2_0226560	NA	blue
Me1_v2_0226580	NA	blue
Me1_v2_0227030	NA	blue
Me1_v2_0227190	NA	blue
Me1_v2_0227670	NA	blue
Me1_v2_0227820	NA	blue
Me1_v2_0227840	NA	blue
Me1_v2_0227950	NA	blue
Me1_v2_0227960	NA	blue
Me1_v2_0228040	NA	blue
Me1_v2_0228320	NA	blue
Me1_v2_0228390	NA	blue
Me1_v2_0228460	NA	blue
Me1_v2_0228480	NA	blue
Me1_v2_0228530	NA	blue
Me1_v2_0228690	NA	blue
Me1_v2_0228700	NA	blue
Me1_v2_0228770	NA	blue
Me1_v2_0228780	NA	blue
Me1_v2_0228890	NA	blue
Me1_v2_0229170	NA	blue
Me1_v2_0229330	NA	blue
Me1_v2_0229350	NA	blue
Me1_v2_0229360	NA	blue
Me1_v2_0229620	NA	blue
Me1_v2_0229650	NA	blue
Me1_v2_0229700	NA	blue
Me1_v2_0229710	NA	blue
Me1_v2_0230540	NA	blue
Me1_v2_0230580	NA	blue
Me1_v2_0230670	NA	blue
Me1_v2_0230690	NA	blue
Me1_v2_0230760	NA	blue
Me1_v2_0230810	NA	blue
Me1_v2_0230820	NA	blue
Me1_v2_0231080	NA	blue
Me1_v2_0231090	NA	blue
Me1_v2_0231120	NA	blue
Me1_v2_0231170	NA	blue
Me1_v2_0231330	NA	blue
Me1_v2_0231450	NA	blue
Me1_v2_0231520	NA	blue
Me1_v2_0231550	NA	blue
Me1_v2_0231800	NA	blue
Me1_v2_0231960	NA	blue
Me1_v2_0231980	NA	blue
Me1_v2_0232090	NA	blue
Me1_v2_0232340	NA	blue
Me1_v2_0232540	NA	blue
Me1_v2_0232610	NA	blue
Me1_v2_0232850	NA	blue
Me1_v2_0232930	NA	blue
Me1_v2_0233110	NA	blue
Me1_v2_0233310	NA	blue
Me1_v2_0233320	NA	blue
Me1_v2_0233440	NA	blue
Me1_v2_0233620	NA	blue
Me1_v2_0233630	NA	blue
Me1_v2_0233760	NA	blue
Me1_v2_0233800	NA	blue
Me1_v2_0233910	NA	blue
Me1_v2_0234100	NA	blue
Me1_v2_0234110	NA	blue
Me1_v2_0234310	NA	blue
Me1_v2_0234490	NA	blue
Me1_v2_0234650	NA	blue
Me1_v2_0234810	NA	blue
Me1_v2_0234890	NA	blue
Me1_v2_0235090	NA	blue
Me1_v2_0235100	NA	blue
Me1_v2_0235340	NA	blue
