Me1_v2_0107610.8
Me1_v2_0107610.7
Me1_v2_0129590.3
Me1_v2_0118230.1
Me1_v2_0126440.3
Me1_v2_0126440.2
Me1_v2_0065830.3
Me1_v2_0039730.1
Me1_v2_0107610.2
Me1_v2_0130670.1
Me1_v2_0111420.1
Me1_v2_0129590.2
Me1_v2_0116530.2
Me1_v2_0175800.1
Me1_v2_0220420.1
Me1_v2_0088120.2
Me1_v2_0107610.5
Me1_v2_0088120.4
Me1_v2_0088120.1
Me1_v2_0088120.3
Me1_v2_0213880.1
Me1_v2_0120270.1
Me1_v2_0111410.3
Me1_v2_0181900.1
Me1_v2_0181900.2
Me1_v2_0181900.4
Me1_v2_0181900.3
Me1_v2_0065830.1
Me1_v2_0116530.3
Me1_v2_0116530.7
Me1_v2_0116530.1
Me1_v2_0116530.5
Me1_v2_0164970.2
Me1_v2_0065830.4
Me1_v2_0073610.1
Me1_v2_0073610.2
Me1_v2_0231730.1
Me1_v2_0173240.1
Me1_v2_0081730.2
Me1_v2_0111410.5
Me1_v2_0111410.7
Me1_v2_0211690.1
Me1_v2_0122470.1
Me1_v2_0130660.1
Me1_v2_0073610.3
Me1_v2_0107610.4
Me1_v2_0111420.4
Me1_v2_0082880.5
Me1_v2_0082880.12
Me1_v2_0223070.1
Me1_v2_0065830.5
Me1_v2_0120270.10
Me1_v2_0120270.4
Me1_v2_0120270.5
Me1_v2_0120270.9
Me1_v2_0120270.2
Me1_v2_0120270.7
Me1_v2_0111410.1
Me1_v2_0081730.4
Me1_v2_0073500.1
Me1_v2_0120270.3
Me1_v2_0120270.6
Me1_v2_0120270.8
Me1_v2_0118480.2
Me1_v2_0129590.1
Me1_v2_0164960.1
Me1_v2_0107730.1
Me1_v2_0215820.1
Me1_v2_0171010.1
Me1_v2_0081730.5
Me1_v2_0081730.3
Me1_v2_0081730.6
Me1_v2_0081730.7
Me1_v2_0081730.1
Me1_v2_0111410.4
Me1_v2_0111410.8
Me1_v2_0107610.1
Me1_v2_0107610.6
Me1_v2_0121540.2
Me1_v2_0164970.1
Me1_v2_0157110.1
Me1_v2_0168580.1
Me1_v2_0173240.3
Me1_v2_0173240.2
Me1_v2_0117440.5
Me1_v2_0117440.6
Me1_v2_0117440.4
Me1_v2_0117440.7
Me1_v2_0117440.2
Me1_v2_0117440.1
Me1_v2_0117440.3
Me1_v2_0107610.3
Me1_v2_0073610.4
Me1_v2_0161390.1
Me1_v2_0121540.1
Me1_v2_0073520.1
Me1_v2_0111420.3
Me1_v2_0111420.2
Me1_v2_0213480.1
Me1_v2_0120780.1
Me1_v2_0111410.2
Me1_v2_0116530.6
Me1_v2_0111410.6
Me1_v2_0069150.1
Me1_v2_0111420.5
Me1_v2_0039700.1
