Orthogroup	A_filiculoides	Other
OG0000004	Azfi_s0015.g014084, Azfi_s2433.g111363	CLOP_g5100
OG0000016	Azfi_s0276.g061452	AT1G35460, AT4G09180
OG0000022	Azfi_s0008.g011474, Azfi_s0038.g026325	pm004208g0020
OG0000032	Azfi_s0153.g053480	pm008158g0020, pm003744g0080, pm082185g0010, pm023884g0010, pm017492g0010, pm033144g0010
OG0000032	Azfi_s0153.g053480	Zci1a_36846
OG0000032	Azfi_s0153.g053480	UTEX1559_09274
OG0000032	Azfi_s0153.g053480	UTEX1560_19493, UTEX1560_17786
OG0000032	Azfi_s0153.g053480	Cre08.g369740_4532
OG0000032	Azfi_s0153.g053480	Zci_11622
OG0000032	Azfi_s0153.g053480	Zci1a_19985
OG0000032	Azfi_s0153.g053480	Zci1a_19985
OG0000032	Azfi_s0153.g053480	28441, 28440
OG0000053	Azfi_s0017.g014603, Azfi_s1473.g103487, Azfi_s0043.g026951, Azfi_s1515.g103942, Azfi_s0003.g007525, Azfi_s0405.g068381	UTEX1560_03497
OG0000053	Azfi_s0017.g014603, Azfi_s1473.g103487, Azfi_s0043.g026951, Azfi_s1515.g103942, Azfi_s0003.g007525, Azfi_s0405.g068381	CLOP_g18347
OG0000063	Azfi_s0322.g064520, Azfi_s0202.g057640, Azfi_s0247.g060090	pm003617g0020
OG0000064	Azfi_s0080.g038455	181303
OG0000064	Azfi_s0080.g038455	LOC_Os01g59530
OG0000064	Azfi_s0080.g038455	UTEX1560_06784
OG0000064	Azfi_s0080.g038455	Zci1a_10020
OG0000064	Azfi_s0080.g038455	Zci_06801
OG0000064	Azfi_s0080.g038455	UTEX1559_02239
OG0000064	Azfi_s0110.g045517	Pp3c10_9750, Pp3c14_8590
OG0000071	Azfi_s0003.g007457	Me1_v2_0157640
OG0000071	Azfi_s0003.g007457	Zci1a_38867
OG0000071	Azfi_s0003.g007457	UTEX1560_03830
OG0000071	Azfi_s0003.g007457	UTEX1559_05592
OG0000071	Azfi_s0003.g007457	Zci_16596, Zci_01161
OG0000077	Azfi_s0241.g059757	AagrOXF_evm.TU.utg000098l.19
OG0000077	Azfi_s0241.g059757	Mp7g15970
OG0000077	Azfi_s0241.g059757	Pp3c3_13100, Pp3c13_21890, Pp3c13_19370
OG0000077	Azfi_s0241.g059757	Zci1a_03567
OG0000077	Azfi_s0241.g059757	Zci_10068
OG0000077	Azfi_s0241.g059757	UTEX1559_07657
OG0000077	Azfi_s0241.g059757	UTEX1560_13485
OG0000077	Azfi_s0241.g059757	Me1_v2_0200030
OG0000077	Azfi_s0241.g059757	SM000037S13589, SM000130S27115, SM000098S25132
OG0000077	Azfi_s0241.g059757	pm020923g0010
OG0000077	Azfi_s0038.g026224	18755
OG0000077	Azfi_s0038.g026224	18755
OG0000077	Azfi_s0038.g026224	AT3G19950
OG0000077	Azfi_s0038.g026224	Solyc03g098590, Solyc04g009170
OG0000077	Azfi_s0038.g026224	Zm00001d032646, Zm00001d013971, Zm00001d045625
OG0000077	Azfi_s0038.g026224	Bradi3g29400, Bradi1g52440
OG0000077	Azfi_s0038.g026224	LOC_Os10g34590, LOC_Os06g01200
OG0000077	Azfi_s0038.g026224	6054
OG0000077	Azfi_s0038.g026224	PRCOL_00004260_RA
OG0000077	Azfi_s0038.g026224	Chrsp49S06169
OG0000079	Azfi_s0006.g009889	Zci1a_35794
OG0000098	Azfi_s0279.g062270	Mp3g10640
OG0000134	Azfi_s0045.g029851	Zci1a_02622
OG0000134	Azfi_s0045.g029851	Me1_v2_0180620
OG0000134	Azfi_s0045.g029851	Zci_02593
OG0000134	Azfi_s0045.g029851	UTEX1560_12763
OG0000134	Azfi_s0201.g057556, Azfi_s0079.g038413	Zci1a_10546, Zci1a_32003
OG0000141	Azfi_s0113.g045942, Azfi_s0215.g058412, Azfi_s3003.g114000, Azfi_s0006.g009946, Azfi_s3257.g115118, Azfi_s0001.g000977, Azfi_s1989.g108563, Azfi_s0133.g049315, Azfi_s0145.g051666, Azfi_s0205.g057775, Azfi_s0205.g057784, Azfi_s0022.g015989, Azfi_s0215.g058411	pm112076g0010
OG0000164	Azfi_s0015.g013791	UTEX1560_06203
OG0000168	Azfi_s0019.g015122	CLOP_g22244, CLOP_g17342, CLOP_g6802, CLOP_g3825, CLOP_g7023
OG0000181	Azfi_s0076.g037759, Azfi_s0001.g000267, Azfi_s0074.g037409, Azfi_s0074.g037420	Me1_v2_0206850
OG0000186	Azfi_s0065.g035939, Azfi_s0117.g046515, Azfi_s0998.g094967, Azfi_s2437.g111369, Azfi_s0374.g067233, Azfi_s0080.g038513, Azfi_s3831.g117105	CLOP_g23070, CLOP_g9477, CLOP_g12777, CLOP_g5499, CLOP_g5907, CLOP_g10976
OG0000186	Azfi_s0065.g035939	Me1_v2_0115220
OG0000190	Azfi_s0059.g034525, Azfi_s0019.g015104, Azfi_s0021.g015858, Azfi_s0008.g011534, Azfi_s0349.g066535, Azfi_s0349.g066532	Zci1a_17238
OG0000194	Azfi_s0149.g053211	Me1_v2_0019190
OG0000194	Azfi_s0149.g053211	Zci1a_10051
OG0000195	Azfi_s0104.g044743	Mp5g04120, Mp8g11830
OG0000204	Azfi_s0024.g020294	Me1_v2_0008020
OG0000212	Azfi_s0087.g042383, Azfi_s3749.g116750, Azfi_s0129.g048880, Azfi_s0160.g054011	SM000964S24840, SM000116S24214, SM000251S08807
OG0000212	Azfi_s0087.g042383, Azfi_s3749.g116750, Azfi_s0129.g048880, Azfi_s0160.g054011	Zci1a_16095
OG0000212	Azfi_s0087.g042383, Azfi_s3749.g116750, Azfi_s0129.g048880, Azfi_s0160.g054011	Zci_02857
OG0000212	Azfi_s0087.g042383, Azfi_s3749.g116750, Azfi_s0129.g048880, Azfi_s0160.g054011	UTEX1559_03145
OG0000212	Azfi_s0087.g042383, Azfi_s3749.g116750, Azfi_s0129.g048880, Azfi_s0160.g054011	UTEX1560_00880
OG0000212	Azfi_s0087.g042383, Azfi_s3749.g116750, Azfi_s0129.g048880, Azfi_s0160.g054011	Me1_v2_0209460
OG0000212	Azfi_s0087.g042383, Azfi_s3749.g116750, Azfi_s0129.g048880, Azfi_s0160.g054011	pm011260g0010, pm002720g0010, pm015432g0030, pm001616g0040
OG0000212	Azfi_s0087.g042383, Azfi_s3749.g116750, Azfi_s0129.g048880, Azfi_s0160.g054011	CBR_g34447
OG0000212	Azfi_s0087.g042383, Azfi_s3749.g116750, Azfi_s0129.g048880, Azfi_s0160.g054011	Pp3c26_6730, Pp3c4_17230
OG0000212	Azfi_s0087.g042383, Azfi_s3749.g116750, Azfi_s0129.g048880	Mp2g13020
OG0000212	Azfi_s0087.g042383, Azfi_s3749.g116750, Azfi_s0129.g048880	AagrOXF_evm.TU.utg000003l.224
OG0000212	Azfi_s0160.g054011	Mp5g11830
OG0000231	Azfi_s0619.g079567, Azfi_s0043.g027028, Azfi_s1026.g095464, Azfi_s1506.g103797	CBR_g786
OG0000231	Azfi_s0619.g079567, Azfi_s0043.g027028, Azfi_s1026.g095464, Azfi_s1506.g103797	14391
OG0000231	Azfi_s0619.g079567, Azfi_s0043.g027028, Azfi_s1026.g095464, Azfi_s1506.g103797	pm011257g0040, pm002615.t2, pm002615g0020, pm012144g0010
OG0000231	Azfi_s0619.g079567, Azfi_s0043.g027028, Azfi_s1026.g095464, Azfi_s1506.g103797	145457, 141733
OG0000231	Azfi_s0619.g079567, Azfi_s0043.g027028, Azfi_s1026.g095464, Azfi_s1506.g103797	Me1_v2_0131610
OG0000231	Azfi_s0619.g079567, Azfi_s0043.g027028, Azfi_s1026.g095464, Azfi_s1506.g103797	Zci1a_42746
OG0000231	Azfi_s0619.g079567, Azfi_s0043.g027028, Azfi_s1026.g095464, Azfi_s1506.g103797	Zci_14873
OG0000231	Azfi_s0619.g079567, Azfi_s0043.g027028, Azfi_s1026.g095464, Azfi_s1506.g103797	UTEX1560_09705
OG0000231	Azfi_s0619.g079567, Azfi_s0043.g027028, Azfi_s1026.g095464, Azfi_s1506.g103797	UTEX1559_15527
OG0000231	Azfi_s0619.g079567, Azfi_s0043.g027028, Azfi_s1026.g095464, Azfi_s1506.g103797	CLOP_g2183, CLOP_g9702
OG0000231	Azfi_s0619.g079567, Azfi_s0043.g027028, Azfi_s1026.g095464, Azfi_s1506.g103797	SM000328S12471, SM002466S08262, SM000017S02874, SM002026S05800, SM000083S22718
OG0000231	Azfi_s0619.g079567, Azfi_s0043.g027028, Azfi_s1026.g095464, Azfi_s1506.g103797	LOC_Os08g36600
OG0000231	Azfi_s0619.g079567, Azfi_s0043.g027028, Azfi_s1026.g095464, Azfi_s1506.g103797	LOC_Os08g36600
OG0000281	Azfi_s0006.g010058, Azfi_s0037.g026082, Azfi_s2704.g112759	Me1_v2_0008290
OG0000309	Azfi_s0206.g057798	pm003628g0020
OG0000321	Azfi_s0045.g029770, Azfi_s0188.g056819, Azfi_s0075.g037684, Azfi_s0250.g060237, Azfi_s0074.g037381, Azfi_s0083.g038815, Azfi_s0173.g055885	Mp1g07590
OG0000321	Azfi_s0045.g029770, Azfi_s0188.g056819, Azfi_s0075.g037684, Azfi_s0250.g060237, Azfi_s0074.g037381, Azfi_s0083.g038815, Azfi_s0173.g055885	107780, 68277
OG0000321	Azfi_s0090.g042605, Azfi_s0230.g059138	Pp3c5_20450, Pp3c6_8580, Pp3c20_5650, Pp3c10_12910, Pp3c26_4070, Pp3c4_25820, Pp3c16_11930
OG0000321	Azfi_s0090.g042605, Azfi_s0230.g059138	116000, 80915
OG0000321	Azfi_s0090.g042605, Azfi_s0230.g059138	Mp3g04860
OG0000321	Azfi_s0090.g042605, Azfi_s0230.g059138	AagrOXF_evm.TU.utg000003l.687, AagrOXF_evm.TU.utg000003l.701
OG0000353	Azfi_s0335.g065527	Zci1a_43961
OG0000376	Azfi_s0065.g035747, Azfi_s0040.g026597, Azfi_s0050.g031126, Azfi_s0002.g001390, Azfi_s2773.g113076, Azfi_s0002.g001566, Azfi_s0031.g024440, Azfi_s0065.g035998, Azfi_s0045.g030062, Azfi_s0727.g083855, Azfi_s0061.g035019	Me1_v2_0206830, Me1_v2_0206920
OG0000393	Azfi_s0003.g007607, Azfi_s0304.g063875, Azfi_s1123.g097781, Azfi_s0113.g045978, Azfi_s0003.g007740, Azfi_s0388.g067612, Azfi_s0010.g012188, Azfi_s0032.g024873, Azfi_s0072.g036991	Mp2g05770, Mp2g06120
OG0000393	Azfi_s0003.g007607, Azfi_s0304.g063875, Azfi_s1123.g097781, Azfi_s0113.g045978, Azfi_s0003.g007740, Azfi_s0388.g067612	Pp3c6_180
OG0000393	Azfi_s0010.g012188, Azfi_s0032.g024873, Azfi_s0072.g036991	Pp3c3_32270, Pp3c12_12080
OG0000420	Azfi_s0027.g023718, Azfi_s0104.g044796, Azfi_s0007.g010670, Azfi_s0011.g012737, Azfi_s0682.g082037	AT5G37760
OG0000420	Azfi_s0027.g023718, Azfi_s0104.g044796, Azfi_s0007.g010670, Azfi_s0011.g012737, Azfi_s0682.g082037	Solyc01g057670.1
OG0000441	Azfi_s0006.g009892, Azfi_s0024.g020421, Azfi_s0288.g063204, Azfi_s0005.g008907, Azfi_s0109.g045306, Azfi_s0015.g014162	231160
OG0000448	Azfi_s0111.g045686, Azfi_s0049.g030784	CLOP_g7913, CLOP_g7907, CLOP_g4638, CLOP_g6520, CLOP_g867, CLOP_g5678, CLOP_g5676, CLOP_g16872, CLOP_g18447, CLOP_g16876, CLOP_g2450, CLOP_g10955, CLOP_g18446, CLOP_g16875, CLOP_g16855, CLOP_g16851, CLOP_g5699, CLOP_g17162, CLOP_g5262, CLOP_g10892, CLOP_g12236, CLOP_g17169, CLOP_g17133
OG0000448	Azfi_s0111.g045686, Azfi_s0049.g030784	Zci1a_20004, Zci1a_34958, Zci1a_44478, Zci1a_02095, Zci1a_29478, Zci1a_25382, Zci1a_23119, Zci1a_31696, Zci1a_07856, Zci1a_15788, Zci1a_15783
OG0000448	Azfi_s0111.g045686, Azfi_s0049.g030784	UTEX1560_14368, UTEX1560_16582, UTEX1560_03570, UTEX1560_15775, UTEX1560_07413, UTEX1560_06275, UTEX1560_18983, UTEX1560_18309
OG0000448	Azfi_s0111.g045686, Azfi_s0049.g030784	Zci_08121, Zci_15200, Zci_03934, Zci_10048, Zci_11530, Zci_11536, Zci_14613, Zci_13632
OG0000448	Azfi_s0111.g045686, Azfi_s0049.g030784	UTEX1559_16937, UTEX1559_08148, UTEX1559_14837, UTEX1559_07684, UTEX1559_05149, UTEX1559_05156, UTEX1559_12405, UTEX1559_17371
OG0000448	Azfi_s0111.g045686, Azfi_s0049.g030784	Pp3c3_17360, Pp3c20_21960
OG0000448	Azfi_s0111.g045686	Mp8g18350, Mp8g18360
OG0000448	Azfi_s0049.g030784	Mp8g10530, Mp8g10550, Mp8g04700, Mp8g04820, Mp3g16560, Mpzg00510, Mp4g15520, Mp8g17820, Mp8g01970, Mp8g04710, Mp8g04840
OG0000448	Azfi_s0049.g030784	AagrOXF_evm.TU.utg000026l.2, AagrOXF_evm.TU.utg000060l.3
OG0000553	Azfi_s0185.g056668	Me1_v2_0032560
OG0000557	Azfi_s0084.g038951, Azfi_s0087.g042390, Azfi_s0129.g048877	pm002561g0020
OG0000572	Azfi_s0032.g024628, Azfi_s0120.g046747, Azfi_s0102.g044461, Azfi_s0239.g059661, Azfi_s0214.g058319, Azfi_s0018.g014717, Azfi_s0114.g046153	CLOP_g823
OG0000582	Azfi_s0006.g010104	74687
OG0000582	Azfi_s0006.g010104	LOC_Os06g31220
OG0000582	Azfi_s0006.g010104	CBR_g24242
OG0000582	Azfi_s0006.g010104	SM000229S07501, SM000008S22393, SM000024S07788
OG0000582	Azfi_s0006.g010104	Me1_v2_0162760
OG0000582	Azfi_s0006.g010104	Zci_06991
OG0000582	Azfi_s0006.g010104	UTEX1560_04005, UTEX1560_04004
OG0000582	Azfi_s0006.g010104	UTEX1559_00353, UTEX1559_00352
OG0000582	Azfi_s0006.g010104	Zci1a_40290, Zci1a_31034
OG0000582	Azfi_s0006.g010104	13700
OG0000582	Azfi_s0006.g010104	CLOP_g7262
OG0000582	Azfi_s0006.g010104	pm245279g0010, pm005624g0040, pm003778.t1, pm015919g0030, pm003778.t2
OG0000582	Azfi_s0006.g010104	Pp3c7_11370, Pp3c11_17720
OG0000582	Azfi_s0006.g010104	Mp7g10130, Mp5g03310, Mp5g08860
OG0000582	Azfi_s0006.g010104	74687
OG0000582	Azfi_s0006.g010104	LOC_Os06g31220
OG0000592	Azfi_s0251.g060288	pm006533g0020
OG0000603	Azfi_s0045.g029982	Me1_v2_0064430
OG0000620	Azfi_s0114.g046073, Azfi_s0321.g064501	UTEX1560_03593
OG0000623	Azfi_s0001.g000545, Azfi_s0038.g026203, Azfi_s0096.g043782, Azfi_s0096.g043786, Azfi_s0096.g043790, Azfi_s0410.g068495, Azfi_s0410.g068496	Zci1a_43090
OG0000623	Azfi_s0001.g000545, Azfi_s0038.g026203, Azfi_s0096.g043782, Azfi_s0096.g043786, Azfi_s0096.g043790, Azfi_s0410.g068495, Azfi_s0410.g068496	Me1_v2_0165040
OG0000658	Azfi_s0008.g011419, Azfi_s0538.g076313, Azfi_s0132.g049282, Azfi_s0320.g064478	Zci1a_02920
OG0000688	Azfi_s0261.g060770, Azfi_s1476.g103493, Azfi_s0007.g010844, Azfi_s0010.g012138, Azfi_s0185.g056600	UTEX1560_00651
OG0000696	Azfi_s0037.g026051	UTEX1560_04973
OG0000705	Azfi_s0479.g073086	Zci1a_33409
OG0000713	Azfi_s0076.g037941, Azfi_s0464.g072365, Azfi_s0469.g072866, Azfi_s1387.g102495, Azfi_s0007.g010554, Azfi_s0015.g014034, Azfi_s0054.g033802	pm029093g0020
OG0000737	Azfi_s0054.g033778	Me1_v2_0075880
OG0000747	Azfi_s0004.g008746	Mp2g03190
OG0000747	Azfi_s0004.g008746	Pp3c2_25950, Pp3c11_14920, Pp3c7_10280, Pp3c7_10520, Pp3c7_10340, Pp3c7_10350
OG0000747	Azfi_s0004.g008746	AagrOXF_evm.TU.utg000083l.287
OG0000747	Azfi_s0004.g008746	173239
OG0000768	Azfi_s0099.g044085	Pp3c23_15330
OG0000804	Azfi_s0419.g069133, Azfi_s0493.g073556, Azfi_s0065.g035946, Azfi_s0304.g063827	Me1_v2_0031480
OG0000843	Azfi_s0350.g066565, Azfi_s2342.g110696, Azfi_s0353.g066659, Azfi_s2043.g108825, Azfi_s0012.g012849, Azfi_s0131.g049139	pm025982g0020
OG0000850	Azfi_s0244.g059921, Azfi_s0002.g001618, Azfi_s0038.g026211, Azfi_s0093.g043300	Me1_v2_0002050
OG0000863	Azfi_s0067.g036151, Azfi_s0528.g075763	AagrOXF_evm.TU.utg000012l.216
OG0000882	Azfi_s0009.g011847	Zm00001d014812, Zm00001d042557, Zm00001d042342, Zm00001d003772, Zm00001d025671
OG0000895	Azfi_s0110.g045465, Azfi_s0005.g009060, Azfi_s0048.g030465	AT3G02230, AT5G15650
OG0000930	Azfi_s0389.g067652	pm001869g0020, pm015121g0020, pm018500g0010, pm013514g0020
OG0000938	Azfi_s0064.g035719, Azfi_s0345.g065769	pm026715g0030
OG0000963	Azfi_s0002.g001270	Me1_v2_0025480
OG0000979	Azfi_s0276.g061442	UTEX1560_01384
OG0000980	Azfi_s0006.g009518	pm011409g0060
OG0001005	Azfi_s0078.g038101, Azfi_s0028.g024024, Azfi_s0454.g071295, Azfi_s0034.g025272	444788
OG0001005	Azfi_s0034.g025272	AT3G03170
OG0001019	Azfi_s0049.g030831	SM000032S12158, SM000003S11215, SM000036S13233
OG0001019	Azfi_s0049.g030831	Me1_v2_0223950
OG0001019	Azfi_s0049.g030831	Zci1a_02832, Zci1a_43847
OG0001019	Azfi_s0049.g030831	Zci_04763
OG0001019	Azfi_s0049.g030831	UTEX1559_02658
OG0001019	Azfi_s0049.g030831	UTEX1560_00962, UTEX1560_00963
OG0001019	Azfi_s0049.g030831	pm020503g0010, pm022529g0010, pm000090g0030, pm020503g0020
OG0001019	Azfi_s0049.g030831	CLOP_g20303
OG0001019	Azfi_s0049.g030831	Pp3c23_10530
OG0001019	Azfi_s0049.g030831	Pp3c23_10530
OG0001020	Azfi_s0015.g014103	Mp6g11860
OG0001029	Azfi_s0021.g015863	UTEX1560_04554
OG0001053	Azfi_s0121.g046836, Azfi_s1654.g105347, Azfi_s0004.g008564, Azfi_s0283.g063048, Azfi_s0119.g046707	UTEX1560_03561
OG0001092	Azfi_s0250.g060252, Azfi_s0292.g063366, Azfi_s0121.g046826, Azfi_s0296.g063557, Azfi_s0004.g008557, Azfi_s0047.g030268	AagrOXF_evm.TU.utg000059l.156
OG0001114	Azfi_s0006.g010066, Azfi_s0013.g013174	Me1_v2_0049240
OG0001121	Azfi_s0132.g049278	pm019243g0030
OG0001121	Azfi_s0132.g049278	Me1_v2_0063920, Me1_v2_0039210
OG0001157	Azfi_s0130.g049003	Me1_v2_0031210
OG0001182	Azfi_s0298.g063600, Azfi_s1778.g106736, Azfi_s3335.g115422	pm012763g0030
OG0001185	Azfi_s0001.g000134	Me1_v2_0028450
OG0001209	Azfi_s0035.g025499, Azfi_s0775.g086523, Azfi_s0073.g037095, Azfi_s0078.g038157, Azfi_s0801.g087534	228163
OG0001209	Azfi_s0035.g025499, Azfi_s0775.g086523, Azfi_s0073.g037095, Azfi_s0078.g038157, Azfi_s0801.g087534	228163
OG0001209	Azfi_s0035.g025499, Azfi_s0775.g086523, Azfi_s0073.g037095, Azfi_s0078.g038157, Azfi_s0801.g087534	CLOP_g18289
OG0001209	Azfi_s0035.g025499, Azfi_s0775.g086523, Azfi_s0073.g037095, Azfi_s0078.g038157, Azfi_s0801.g087534	pm000368g0100, pm001663.t1, pm005114g0020, pm010863.t1
OG0001209	Azfi_s0035.g025499, Azfi_s0775.g086523, Azfi_s0073.g037095, Azfi_s0078.g038157, Azfi_s0801.g087534	CBR_g22318
OG0001209	Azfi_s0035.g025499, Azfi_s0775.g086523, Azfi_s0073.g037095, Azfi_s0078.g038157, Azfi_s0801.g087534	Me1_v2_0167900
OG0001209	Azfi_s0035.g025499, Azfi_s0775.g086523, Azfi_s0073.g037095, Azfi_s0078.g038157, Azfi_s0801.g087534	SM000088S23686, SM000117S25480, SM000299S10841
OG0001209	Azfi_s0035.g025499, Azfi_s0775.g086523, Azfi_s0073.g037095, Azfi_s0078.g038157, Azfi_s0801.g087534	14278
OG0001209	Azfi_s0035.g025499, Azfi_s0775.g086523, Azfi_s0073.g037095, Azfi_s0078.g038157, Azfi_s0801.g087534	Zci1a_32415
OG0001209	Azfi_s0035.g025499, Azfi_s0775.g086523, Azfi_s0073.g037095, Azfi_s0078.g038157, Azfi_s0801.g087534	UTEX1559_11502
OG0001209	Azfi_s0035.g025499, Azfi_s0775.g086523, Azfi_s0073.g037095, Azfi_s0078.g038157, Azfi_s0801.g087534	UTEX1560_08584
OG0001209	Azfi_s0035.g025499, Azfi_s0775.g086523, Azfi_s0073.g037095, Azfi_s0078.g038157, Azfi_s0801.g087534	Pp3c11_10490, Pp3c4_27540, Pp3c2_32050, Pp3c3_1140, Pp3c5_5750, Pp3c1_4290
OG0001209	Azfi_s0035.g025499, Azfi_s0775.g086523, Azfi_s0073.g037095, Azfi_s0078.g038157, Azfi_s0801.g087534	Mp8g06510, Mp8g13010
OG0001209	Azfi_s0035.g025499, Azfi_s0775.g086523, Azfi_s0073.g037095, Azfi_s0078.g038157	Zci_01584
OG0001209	Azfi_s0035.g025499, Azfi_s0775.g086523, Azfi_s0073.g037095, Azfi_s0078.g038157	AagrOXF_evm.TU.utg000009l.230
OG0001209	Azfi_s0801.g087534	AagrOXF_evm.TU.utg000041l.201, AagrOXF_evm.TU.utg000050l.192
OG0001215	Azfi_s0004.g008755, Azfi_s0037.g025858	Me1_v2_0016820
OG0001219	Azfi_s0007.g010553, Azfi_s0111.g045616, Azfi_s0117.g046596	Zci1a_11676
OG0001219	Azfi_s0007.g010553, Azfi_s0111.g045616, Azfi_s0117.g046596	pm019373g0010
OG0001297	Azfi_s0206.g057807	Me1_v2_0071170
OG0001297	Azfi_s0206.g057807	pm034676g0010, pm034829g0010
OG0001297	Azfi_s0206.g057807	CLOP_g12468, CLOP_g14385, CLOP_g25441
OG0001297	Azfi_s0206.g057807	SM000200S05804, SM000214S06765
OG0001297	Azfi_s0206.g057807	Zci_11120
OG0001297	Azfi_s0206.g057807	UTEX1559_10565
OG0001297	Azfi_s0206.g057807	UTEX1560_07032
OG0001297	Azfi_s0206.g057807	Zci1a_14220
OG0001332	Azfi_s0352.g066604	Me1_v2_0001390
OG0001333	Azfi_s0015.g014144	CLOP_g3295
OG0001346	Azfi_s0008.g011498, Azfi_s0152.g053396	Zci1a_06332
OG0001369	Azfi_s0102.g044540, Azfi_s1856.g107531, Azfi_s4192.g118292, Azfi_s0003.g007491	pm069289g0010
OG0001389	Azfi_s0071.g036823	Me1_v2_0207560
OG0001418	Azfi_s0065.g035928	pm000765g0040, pm001294g0060
OG0001418	Azfi_s0065.g035928	Me1_v2_0196250
OG0001418	Azfi_s0065.g035928	Zci1a_24064
OG0001418	Azfi_s0065.g035928	UTEX1560_07439
OG0001418	Azfi_s0065.g035928	Zci_07262
OG0001418	Azfi_s0065.g035928	UTEX1559_14395
OG0001591	Azfi_s0388.g067631, Azfi_s0305.g063925, Azfi_s0506.g073961, Azfi_s0292.g063360, Azfi_s0229.g059132, Azfi_s0292.g063361	Zci1a_27575
OG0001600	Azfi_s0414.g068603	CBR_g36923
OG0001600	Azfi_s0414.g068603	Mp5g08240
OG0001600	Azfi_s0414.g068603	AagrOXF_evm.TU.utg000040l.52
OG0001600	Azfi_s0414.g068603	111885, 108195, 85838
OG0001600	Azfi_s0414.g068603	Pp3c18_5360, Pp3c22_23120, Pp3c21_13380
OG0001612	Azfi_s0006.g009864, Azfi_s0396.g067880	UTEX1560_01592
OG0001646	Azfi_s0038.g026220	Zci_06366
OG0001646	Azfi_s0038.g026220	UTEX1559_06090
OG0001646	Azfi_s0038.g026220	UTEX1560_05229
OG0001646	Azfi_s0038.g026220	Zci1a_09363, Zci1a_39257
OG0001649	Azfi_s0130.g049084, Azfi_s0006.g009894, Azfi_s0486.g073417, Azfi_s0486.g073423	Zci1a_13358
OG0001661	Azfi_s0002.g001264, Azfi_s0007.g010851	35059
OG0001671	Azfi_s0252.g060323	pm257782g0010
OG0001677	Azfi_s0028.g024004, Azfi_s0796.g087282	UTEX1560_14056
OG0001683	Azfi_s3966.g117405	Me1_v2_0074150
OG0001683	Azfi_s3966.g117405	SM000050S16953, SM000058S18550, SM000090S24328
OG0001683	Azfi_s3966.g117405	UTEX1560_02989
OG0001683	Azfi_s3966.g117405	Cre10.g461550_4532
OG0001683	Azfi_s3966.g117405	pm003577g0040, pm015594g0030
OG0001683	Azfi_s3966.g117405	Solyc01g103000
OG0001683	Azfi_s3966.g117405	Solyc01g103000
OG0001765	Azfi_s0022.g016065, Azfi_s0117.g046478	Pp3c3_26860, Pp3c12_17640, Pp3c21_6760, Pp3c19_21200
OG0001765	Azfi_s0022.g016065, Azfi_s0117.g046478	49023
OG0001765	Azfi_s0022.g016065, Azfi_s0117.g046478	Mp1g23110
OG0001765	Azfi_s0022.g016065, Azfi_s0117.g046478	AagrOXF_evm.TU.utg000006l.732
OG0001801	Azfi_s0081.g038630, Azfi_s0081.g038629, Azfi_s0081.g038623	pm004571g0010
OG0001846	Azfi_s0006.g009666	UTEX1560_05632
OG0001846	Azfi_s0173.g055831, Azfi_s3195.g114990	UTEX1560_05631
OG0001859	Azfi_s0032.g024782, Azfi_s0306.g063951, Azfi_s2184.g109817	Me1_v2_0057090
OG0001875	Azfi_s0001.g000668, Azfi_s0068.g036426	Zci1a_23050, Zci1a_39578
OG0001876	Azfi_s0002.g001216	SM000387S14696, SM000232S07942, SM000368S13757
OG0001923	Azfi_s0301.g063733	pm000664g0040, pm218145g0010, pm000664.t1
OG0001931	Azfi_s0173.g055846, Azfi_s0217.g058522, Azfi_s1642.g105176	Pp3c11_24190
OG0001980	Azfi_s0304.g063829	Zci_16392
OG0001987	Azfi_s0003.g007793, Azfi_s0005.g009357	AT1G02830
OG0001987	Azfi_s0003.g007793, Azfi_s0005.g009357	Zm00001d033008
OG0001991	Azfi_s2431.g111311	Me1_v2_0030200
OG0001994	Azfi_s0038.g026285, Azfi_s0078.g038191	CLOP_g22753
OG0001994	Azfi_s0038.g026285, Azfi_s0078.g038191	pm000139g0030, pm000043g0020
OG0002044	Azfi_s0144.g051553	Pp3c2_34800
OG0002118	Azfi_s0144.g051628, Azfi_s0033.g025143, Azfi_s1425.g102966	Me1_v2_0006990
OG0002119	Azfi_s0081.g038656	Zci1a_10465
OG0002121	Azfi_s0078.g038145	Zci1a_35149
OG0002144	Azfi_s0001.g000897, Azfi_s0083.g038895	pm012150g0040
OG0002171	Azfi_s0009.g011923, Azfi_s0002.g001508, Azfi_s3359.g115484, Azfi_s0392.g067779	Zm00001d040631
OG0002171	Azfi_s0009.g011923, Azfi_s0002.g001508, Azfi_s3359.g115484, Azfi_s0392.g067779	Solyc05g054540
OG0002205	Azfi_s0037.g026013	Bradi3g07430, Bradi1g36550, Bradi2g04471
OG0002205	Azfi_s0037.g026013	LOC_Os02g10720, LOC_Os01g07750
OG0002205	Azfi_s0037.g026013	Zm00001d053641, Zm00001d015776, Zm00001d046513, Zm00001d008726
OG0002205	Azfi_s0037.g026013	AT5G25360, AT4G32342, AT1G15350, AT3G15770
OG0002205	Azfi_s0037.g026013	Solyc07g008260, Solyc08g060860, Solyc06g066050, Solyc06g068120, Solyc03g116640
OG0002205	Azfi_s0037.g026013	22103, 7452
OG0002208	Azfi_s0003.g008108, Azfi_s1836.g107343, Azfi_s0008.g011365	CLOP_g21770
OG0002286	Azfi_s0102.g044542	CLOP_g15662
OG0002286	Azfi_s0102.g044542	Me1_v2_0029550
OG0002298	Azfi_s0096.g043735, Azfi_s0159.g053968	pm013897g0030
OG0002377	Azfi_s0233.g059397	Me1_v2_0031190, Me1_v2_0127540
OG0002392	Azfi_s0006.g009826, Azfi_s0144.g051581	Me1_v2_0008820
OG0002396	Azfi_s0002.g003643	Me1_v2_0091770
OG0002396	Azfi_s0002.g003643	PRCOL_00001162_RA
OG0002396	Azfi_s0002.g003643	Olucimarinus_26023
OG0002396	Azfi_s0002.g003643	Chrsp104S01219
OG0002396	Azfi_s0002.g003643	18459
OG0002412	Azfi_s0049.g030715	UTEX1560_03052
OG0002416	Azfi_s0029.g024099, Azfi_s0116.g046446	AagrOXF_evm.TU.utg000050l.76
OG0002436	Azfi_s0880.g091023	AT1G11190, AT1G68290, AT4G21585, AT4G21590, AT4G21600
OG0002436	Azfi_s0880.g091023	Bradi5g23280, Bradi2g01967, Bradi2g01980, Bradi5g24140, Bradi5g24430
OG0002436	Azfi_s0880.g091023	Zm00001d032501, Zm00001d040014, Zm00001d008529, Zm00001d002035
OG0002436	Azfi_s0880.g091023	LOC_Os04g54390, LOC_Os01g03740, LOC_Os01g03730, LOC_Os04g55850
OG0002436	Azfi_s0880.g091023	Solyc02g078910, Solyc05g009430, Solyc02g078920
OG0002436	Azfi_s0880.g091023	CBR_g37154
OG0002498	Azfi_s0028.g023816	Me1_v2_0169450
OG0002510	Azfi_s0006.g010443, Azfi_s0099.g044089	84425
OG0002510	Azfi_s0006.g010443, Azfi_s0099.g044089	Me1_v2_0121140
OG0002510	Azfi_s0006.g010443, Azfi_s0099.g044089	SM000011S19119, SM000007S20938, SM000004S14877
OG0002510	Azfi_s0006.g010443, Azfi_s0099.g044089	AagrOXF_evm.TU.utg000029l.45, AagrOXF_evm.TU.utg000049l.410
OG0002510	Azfi_s0006.g010443, Azfi_s0099.g044089	Mp1g06360
OG0002510	Azfi_s0006.g010443, Azfi_s0099.g044089	Pp3c26_8630, Pp3c13_4320, Pp3c3_7030
OG0002540	Azfi_s0686.g082070	Me1_v2_0049700
OG0002615	Azfi_s0045.g030025	UTEX1559_17081
OG0002615	Azfi_s0045.g030025	pm013194g0010
OG0002620	Azfi_s0084.g039043	Me1_v2_0018650, Me1_v2_0149740
OG0002628	Azfi_s0103.g044654, Azfi_s4296.g118638, Azfi_s0103.g044660	Me1_v2_0048320
OG0002633	Azfi_s0005.g009123, Azfi_s0212.g058164	Me1_v2_0162020
OG0002633	Azfi_s0005.g009123, Azfi_s0212.g058164	Pp3c11_17170, Pp3s121_40
OG0002633	Azfi_s0005.g009123, Azfi_s0212.g058164	Zci1a_02381
OG0002633	Azfi_s0005.g009123, Azfi_s0212.g058164	UTEX1559_08996
OG0002633	Azfi_s0005.g009123, Azfi_s0212.g058164	Zci_05814
OG0002633	Azfi_s0005.g009123, Azfi_s0212.g058164	UTEX1560_07295
OG0002699	Azfi_s0020.g015390, Azfi_s0010.g012269, Azfi_s0010.g012270, Azfi_s0073.g037225, Azfi_s0005.g009355, Azfi_s0237.g059612	UTEX1560_05753
OG0002705	Azfi_s0171.g055676	UTEX1560_11698
OG0002725	Azfi_s0006.g010173	pm003306g0020, pm005858g0020
OG0002766	Azfi_s0157.g053841	Me1_v2_0009330
OG0003001	Azfi_s0006.g010065	Zci1a_45171
OG0003035	Azfi_s0245.g059940, Azfi_s0007.g010543	Mp3g01780
OG0003039	Azfi_s0237.g059595, Azfi_s0060.g034830	Zci1a_00384
OG0003039	Azfi_s0237.g059595	pm005059g0010
OG0003043	Azfi_s0027.g023548	Me1_v2_0048410
OG0003053	Azfi_s0005.g008985	pm001756g0020, pm042322g0010
OG0003053	Azfi_s0005.g008985	Zci1a_24882
OG0003060	Azfi_s0262.g060837, Azfi_s0117.g046556, Azfi_s0022.g016089, Azfi_s0111.g045566	Me1_v2_0071350, Me1_v2_0005500
OG0003062	Azfi_s0062.g035253	LOC_Os09g15400
OG0003070	Azfi_s0225.g058936, Azfi_s2015.g108704	Me1_v2_0025720
OG0003137	Azfi_s0362.g066911	Me1_v2_0033650
OG0003156	Azfi_s0006.g010251	Bradi4g06148
OG0003207	Azfi_s0017.g014553, Azfi_s0074.g037295	441682
OG0003207	Azfi_s0017.g014553, Azfi_s0074.g037295	pm317984g0010, pm004719.t1, pm014712g0010, pm028760g0010, pm001659g0060
OG0003207	Azfi_s0017.g014553, Azfi_s0074.g037295	Mp6g20040
OG0003207	Azfi_s0017.g014553, Azfi_s0074.g037295	AagrOXF_evm.TU.utg000049l.659
OG0003215	Azfi_s0003.g007647, Azfi_s0060.g034825	Me1_v2_0108950, Me1_v2_0186240
OG0003215	Azfi_s0003.g007647, Azfi_s0060.g034825	pm026028g0010
OG0003220	Azfi_s0096.g043682	Me1_v2_0190410
OG0003223	Azfi_s0293.g063446	Me1_v2_0138080
OG0003234	Azfi_s0068.g036365	Me1_v2_0033080, Me1_v2_0014410
OG0003234	Azfi_s0068.g036365	pm004741g0090, pm050985g0010
OG0003255	Azfi_s0022.g016233	Me1_v2_0170120
OG0003311	Azfi_s0002.g001593	Me1_v2_0023290
OG0003314	Azfi_s0074.g037483, Azfi_s0158.g053874	pm001589g0020
OG0003371	Azfi_s0006.g009565	Zci1a_08915
OG0003416	Azfi_s0054.g033724, Azfi_s0072.g036985	Me1_v2_0029790
OG0003425	Azfi_s0113.g045969	Me1_v2_0079130, Me1_v2_0033190, Me1_v2_0079210
OG0003428	Azfi_s0004.g008704	pm019986g0010
OG0003444	Azfi_s0074.g037350, Azfi_s0024.g020298	Bradi5g26965
OG0003450	Azfi_s1495.g103612, Azfi_s0097.g043881	pm001157g0010, pm009374g0010
OG0003450	Azfi_s1495.g103612, Azfi_s0097.g043881	CLOP_g16392
OG0003450	Azfi_s1495.g103612, Azfi_s0097.g043881	Me1_v2_0200440
OG0003450	Azfi_s1495.g103612, Azfi_s0097.g043881	Zci1a_29784
OG0003450	Azfi_s1495.g103612, Azfi_s0097.g043881	Zci_01721
OG0003450	Azfi_s1495.g103612, Azfi_s0097.g043881	UTEX1559_12793
OG0003450	Azfi_s1495.g103612, Azfi_s0097.g043881	UTEX1560_04426
OG0003450	Azfi_s1495.g103612, Azfi_s0097.g043881	SM000039S14465, SM000008S22250, SM000042S15346
OG0003450	Azfi_s0015.g013832, Azfi_s1010.g095173	CLOP_g5688
OG0003474	Azfi_s0017.g014488, Azfi_s0159.g053958	pm022631g0020
OG0003480	Azfi_s2531.g112055	Me1_v2_0130380
OG0003480	Azfi_s0075.g037627, Azfi_s0335.g065522, Azfi_s0362.g066918	Me1_v2_0130400
OG0003480	Azfi_s0807.g087714, Azfi_s2531.g112054	Me1_v2_0130390
OG0003582	Azfi_s0409.g068489	Me1_v2_0115540
OG0003608	Azfi_s0208.g058004	Me1_v2_0230000
OG0003608	Azfi_s0208.g058004	CLOP_g17379
OG0003623	Azfi_s1684.g105671	Me1_v2_0107860
OG0003629	Azfi_s0009.g011995, Azfi_s0015.g013702, Azfi_s0191.g056983	Solyc03g063860.1
OG0003633	Azfi_s0176.g056019	pm049817g0010
OG0003671	Azfi_s0245.g060014	SM000168S02637, SM000256S08694, SM000347S12991
OG0003687	Azfi_s0045.g029786	pm020773g0010
OG0003762	Azfi_s0016.g014392, Azfi_s0061.g034872	pm035043g0010
OG0003767	Azfi_s0057.g034252	Solyc06g050825.1
OG0003768	Azfi_s0185.g056629	Me1_v2_0024960
OG0003784	Azfi_s0006.g009981	pm000164g0050, pm005757g0010
OG0003784	Azfi_s0006.g009981	Me1_v2_0065770
OG0003803	Azfi_s0213.g058281, Azfi_s0093.g043198	Me1_v2_0045550
OG0003815	Azfi_s0015.g013879	Zci1a_15953
OG0003819	Azfi_s0059.g034517	pm013124g0030, pm020774g0040
OG0003847	Azfi_s0054.g033710, Azfi_s0015.g014070	LOC_Os08g15600
OG0003901	Azfi_s0102.g044506	Zci1a_23096
OG0003946	Azfi_s0084.g039090	CLOP_g18411
OG0004009	Azfi_s0092.g043105, Azfi_s0271.g061220	Solyc11g027820.1
OG0004073	Azfi_s0116.g046373	pm007154g0040
OG0004110	Azfi_s0189.g056853	Pp3s30_1010
OG0004110	Azfi_s0189.g056853	pm007202g0020
OG0004170	Azfi_s1257.g100498, Azfi_s1446.g103196	AT5G26594
OG0004170	Azfi_s1257.g100498, Azfi_s1446.g103196	AT5G26594
OG0004170	Azfi_s1257.g100498, Azfi_s1446.g103196	Bradi1g09130
OG0004170	Azfi_s1257.g100498, Azfi_s1446.g103196	LOC_Os03g53100
OG0004170	Azfi_s1257.g100498, Azfi_s1446.g103196	Zm00001d033968
OG0004170	Azfi_s1257.g100498, Azfi_s1446.g103196	SM000120S25690, SM000240S08605
OG0004170	Azfi_s1257.g100498, Azfi_s1446.g103196	AagrOXF_evm.TU.utg000081l.76
OG0004170	Azfi_s1257.g100498, Azfi_s1446.g103196	115529
OG0004177	Azfi_s0236.g059494, Azfi_s0076.g037860	AagrOXF_evm.TU.utg000083l.451
OG0004177	Azfi_s0236.g059494, Azfi_s0076.g037860	Mp1g13820
OG0004177	Azfi_s0236.g059494, Azfi_s0076.g037860	Pp3c16_11140, Pp3c11_12280, Pp3c1_12890
OG0004177	Azfi_s0236.g059494, Azfi_s0076.g037860	153129, 110343, 171056, 136874
OG0004198	Azfi_s0087.g042342	Me1_v2_0032820
OG0004201	Azfi_s0120.g046775	Zci1a_28997
OG0004316	Azfi_s0050.g031065, Azfi_s0002.g001202, Azfi_s0376.g067277	pm003822g0030
OG0004369	Azfi_s0114.g046067	Zci1a_39124
OG0004369	Azfi_s0114.g046067	3014, 446215, 99725
OG0004523	Azfi_s0076.g037784	SM000387S14685, SM000368S13747, SM000232S07948
OG0004523	Azfi_s0076.g037784	Zci1a_04215
OG0004523	Azfi_s0076.g037784	Zci_06120
OG0004523	Azfi_s0076.g037784	UTEX1559_02517
OG0004523	Azfi_s0076.g037784	UTEX1560_08218, UTEX1560_08217
OG0004523	Azfi_s0076.g037784	Me1_v2_0107780
OG0004523	Azfi_s0076.g037784	CLOP_g18875
OG0004523	Azfi_s0076.g037784	pm007882g0030, pm015904g0020, pm009368.t1, pm009381g0020, pm007882g0050
OG0004740	Azfi_s0479.g073091	CBR_g20014
OG0004740	Azfi_s0479.g073091	Zci1a_37715
OG0004740	Azfi_s0479.g073091	pm034479g0020
OG0004740	Azfi_s0479.g073091	Me1_v2_0219370
OG0004742	Azfi_s0002.g001389, Azfi_s3536.g116033, Azfi_s2773.g113075	Me1_v2_0102520, Me1_v2_0032810
OG0004841	Azfi_s0055.g033928	Zm00001d012711
OG0004995	Azfi_s0059.g034568	UTEX1559_13281
OG0005001	Azfi_s0309.g064082	pm051168g0010
OG0005006	Azfi_s0007.g010532	Me1_v2_0016290, Me1_v2_0216180
OG0005273	Azfi_s0288.g063238	pm012381g0010
OG0005301	Azfi_s0533.g076060	pm006690g0060
OG0005339	Azfi_s0052.g031620	pm007917g0060
OG0005359	Azfi_s0533.g076056	Zci1a_18622
OG0005391	Azfi_s0099.g044115	Me1_v2_0227820
OG0005405	Azfi_s0032.g024965	Zci1a_17144
OG0005462	Azfi_s0262.g060811	pm001422g0050, pm014735g0020
OG0005496	Azfi_s0114.g046135	Me1_v2_0180530
OG0005518	Azfi_s0370.g067093, Azfi_s0061.g034908	CLOP_g9951
OG0005518	Azfi_s0370.g067093, Azfi_s0061.g034908	pm002702g0010, pm005409g0040
OG0005518	Azfi_s0370.g067093, Azfi_s0061.g034908	Me1_v2_0031590
OG0005518	Azfi_s0370.g067093, Azfi_s0061.g034908	25279
OG0005518	Azfi_s0370.g067093, Azfi_s0061.g034908	pm000764.t1
OG0005518	Azfi_s0370.g067093, Azfi_s0061.g034908	pm000764.t1
OG0005518	Azfi_s0370.g067093, Azfi_s0061.g034908	UTEX1559_02755
OG0005518	Azfi_s0370.g067093, Azfi_s0061.g034908	Pp3c21_4580
OG0005518	Azfi_s0370.g067093, Azfi_s0061.g034908	SM000064S19765, SM000019S05105
OG0005573	Azfi_s0225.g058913	Me1_v2_0137370
OG0005573	Azfi_s0225.g058913	SM000254S08792, SM000074S21675, SM000093S24454
OG0005574	Azfi_s0700.g082613	SM000076S21837
OG0005645	Azfi_s0105.g044997	Mp5g00260, Mp8g12680
OG0005646	Azfi_s0008.g011463	Me1_v2_0050050
OG0005653	Azfi_s0042.g026891, Azfi_s3353.g115480	pm011823g0010
OG0005697	Azfi_s0112.g045813	AagrOXF_evm.TU.utg000042l.127
OG0005727	Azfi_s0408.g068442, Azfi_s0116.g046301, Azfi_s0149.g053135, Azfi_s0038.g026284	Pp3c7_25580
OG0005783	Azfi_s0373.g067163, Azfi_s0373.g067198	Zci1a_22511
OG0005951	Azfi_s0219.g058595, Azfi_s1489.g103560	Me1_v2_0161060
OG0006045	Azfi_s0008.g011499	Me1_v2_0011840
OG0006064	Azfi_s0509.g074709	Me1_v2_0075250
OG0006087	Azfi_s0002.g003108	AagrOXF_evm.TU.utg000124l.102
OG0006087	Azfi_s0002.g003108	AagrOXF_evm.TU.utg000124l.102
OG0006087	Azfi_s0002.g003108	Chrsp127S01943
OG0006087	Azfi_s0002.g003108	SM000151S01523, SM000278S10010, SM000174S03348, SM000174S03362
OG0006087	Azfi_s0002.g003108	UTEX1560_16330
OG0006087	Azfi_s0002.g003108	Zci_04081
OG0006087	Azfi_s0002.g003108	UTEX1559_05471
OG0006087	Azfi_s0002.g003108	24596
OG0006087	Azfi_s0002.g003108	Pp3s30_174
OG0006291	Azfi_s0092.g043053, Azfi_s0054.g033764	pm031040g0010
OG0006593	Azfi_s0001.g000804	UTEX1560_12214
OG0006641	Azfi_s0183.g056487	Zci1a_08864
OG0006682	Azfi_s0003.g007689	Zci_09571
OG0006682	Azfi_s0003.g007689	UTEX1560_15154
OG0006682	Azfi_s0003.g007689	UTEX1559_02407
OG0006682	Azfi_s0003.g007689	CLOP_g4147
OG0006682	Azfi_s0003.g007689	pm067513g0010, pm008462g0010, pm020677.t1
OG0006827	Azfi_s0159.g053931	Me1_v2_0034710
OG0007051	Azfi_s0100.g044261	pm143314g0010, pm012966g0020
OG0007247	Azfi_s0024.g020367	pm011761g0010
OG0007481	Azfi_s0168.g054582	Bradi5g15612
OG0007727	Azfi_s0034.g025348, Azfi_s0024.g020300	Me1_v2_0006190
OG0007837	Azfi_s0101.g044381	Zci1a_18582
OG0008224	Azfi_s1518.g103975, Azfi_s1518.g103973, Azfi_s0052.g031654, Azfi_s1518.g103974	UTEX1559_15621
OG0009194	Azfi_s0250.g060210	Bradi3g60344
