AT2G33540
AT1G15100
AT5G41560
AT1G71960
AT3G59220
AT1G16310
AT5G63470
AT1G48270
AT2G38310
AT5G63910
AT1G52400
AT5G03280
AT1G73580
AT5G58430
AT4G26080
AT4G32870
AT2G03440
AT5G01540
AT5G58670
AT5G23320
AT3G09770
AT1G66140
AT5G47670
AT5G10940
AT2G32460
AT2G43350
AT5G13530
AT2G17290
AT5G60870
AT1G18075
AT5G01550
AT2G29940
AT1G24625
AT1G01720
AT2G01150
AT1G67800
AT2G41940
AT5G65310
AT1G25490
AT1G10430
AT5G66880
AT5G46590
AT1G73000
AT5G05440
AT5G01520
AT5G20720
AT3G26790
AT1G10560
AT1G66600
AT5G66070
AT5G20270
AT5G45830
AT5G43410
AT3G55530
AT3G56860
AT5G25160
AT2G30020
AT2G31470
AT5G60410
AT2G40180
AT4G37790
AT5G26920
AT1G35670
AT3G18040
AT3G59380
AT3G17980
AT1G04120
AT3G48360
AT5G18190
AT1G08720
AT3G02140
AT5G40280
AT3G57530
AT3G51550
AT4G21670
AT4G17788
AT5G13610
AT5G11310
AT2G22430
AT3G45640
AT5G35980
AT1G76260
AT3G11410
AT5G45860
AT3G26000
AT5G62880
AT1G73687
AT1G09950
AT3G50310
AT1G54160
AT4G18620
AT4G33780
AT5G59220
AT3G63060
AT4G15230
AT5G45870
AT2G25170
AT4G06634
AT2G39550
AT1G66360
AT3G21220
AT1G64060
AT5G22090
AT2G41070
AT1G54830
AT3G17410
AT1G18890
AT1G15380
AT5G20910
AT5G46845
AT1G05100
AT1G08970
AT5G57050
AT4G35987
AT3G03940
AT3G19290
AT1G52920
AT4G11890
AT2G01540
AT5G05860
AT1G07430
AT5G08335
AT3G01090
AT2G26040
AT3G48040
AT4G17870
AT2G31650
AT5G47710
AT5G63980
AT1G70800
AT2G33150
AT3G01650
AT4G23650
AT1G51940
AT4G09570
AT1G18470
AT4G20940
AT1G42550
AT1G15080
AT1G69935
AT1G55660
AT1G13300
AT1G69260
AT1G70810
AT1G69270
AT5G53160
AT4G17615
AT2G26980
AT2G40330
AT3G50360
AT5G01810
AT4G01026
AT1G67890
AT1G51800
AT5G49470
AT1G53300
AT1G49720
AT1G74740
AT3G46550
AT2G40220
AT2G25760
AT1G80730
AT1G45249
AT2G46680
AT2G28350
AT1G21970
AT4G27920
AT1G48590
AT3G26744
AT2G19430
AT5G10970
AT2G18470
AT4G33360
AT1G70790
AT5G13680
AT5G11260
AT1G02340
AT1G62810
AT1G67710
AT2G17800
AT5G52300
AT5G40440
AT5G64750
AT2G39175
AT1G67030
AT4G23450
AT2G43790
AT4G35790
AT1G01360
AT1G24020
AT5G11270
AT3G50500
AT3G15730
AT4G34220
AT1G15520
AT2G32510
AT1G12490
AT5G46790
AT1G23140
AT5G01560
AT2G26300
AT5G41790
AT5G62470
AT5G23580
AT5G10720
AT4G16830
AT5G06100
AT5G08520
AT5G37740
AT1G07000
AT4G33950
AT4G34000