cluster	gene	probability
1	Zci_00002	0.5714
1	Zci_00005	0.5740
1	Zci_00012	0.6907
1	Zci_00028	0.5992
1	Zci_00049	0.6144
1	Zci_00066	0.7292
1	Zci_00082	0.6151
1	Zci_00090	0.4901
1	Zci_00094	0.6612
1	Zci_00118	0.7162
1	Zci_00169	0.7307
1	Zci_00174	0.4063
1	Zci_00215	0.6494
1	Zci_00228	0.7371
1	Zci_00230	0.7191
1	Zci_00307	0.6860
1	Zci_00391	0.4427
1	Zci_00414	0.7230
1	Zci_00417	0.5926
1	Zci_00419	0.5366
1	Zci_00426	0.5859
1	Zci_00439	0.6710
1	Zci_00440	0.6674
1	Zci_00498	0.6490
1	Zci_00513	0.5717
1	Zci_00525	0.7377
1	Zci_00588	0.4591
1	Zci_00614	0.7289
1	Zci_00616	0.7154
1	Zci_00666	0.7226
1	Zci_00722	0.4999
1	Zci_00725	0.6915
1	Zci_00733	0.7050
1	Zci_00761	0.6017
1	Zci_00771	0.7152
1	Zci_00818	0.5854
1	Zci_00823	0.6962
1	Zci_00845	0.6742
1	Zci_00872	0.7113
1	Zci_00888	0.7365
1	Zci_00890	0.6279
1	Zci_00891	0.6020
1	Zci_00893	0.6094
1	Zci_00933	0.6921
1	Zci_00934	0.6868
1	Zci_00935	0.6705
1	Zci_00942	0.6304
1	Zci_00977	0.5588
1	Zci_00994	0.7527
1	Zci_00996	0.6429
1	Zci_01021	0.6712
1	Zci_01028	0.6869
1	Zci_01033	0.7209
1	Zci_01042	0.6796
1	Zci_01051	0.7211
1	Zci_01066	0.6723
1	Zci_01085	0.7250
1	Zci_01118	0.7264
1	Zci_01133	0.6372
1	Zci_01149	0.7290
1	Zci_01268	0.6298
1	Zci_01282	0.7183
1	Zci_01286	0.6001
1	Zci_01330	0.7323
1	Zci_01338	0.6264
1	Zci_01359	0.6562
1	Zci_01375	0.7076
1	Zci_01383	0.5996
1	Zci_01387	0.7516
1	Zci_01391	0.7217
1	Zci_01403	0.7292
1	Zci_01413	0.6708
1	Zci_01414	0.6474
1	Zci_01443	0.6556
1	Zci_01447	0.7456
1	Zci_01458	0.6320
1	Zci_01463	0.7061
1	Zci_01468	0.6487
1	Zci_01475	0.7000
1	Zci_01533	0.6694
1	Zci_01544	0.7388
1	Zci_01551	0.6450
1	Zci_01567	0.4823
1	Zci_01580	0.7114
1	Zci_01590	0.6363
1	Zci_01594	0.7200
1	Zci_01602	0.7208
1	Zci_01612	0.6300
1	Zci_01613	0.7296
1	Zci_01617	0.7301
1	Zci_01618	0.6558
1	Zci_01652	0.6667
1	Zci_01653	0.6679
1	Zci_01656	0.7038
1	Zci_01662	0.5118
1	Zci_01664	0.6290
1	Zci_01670	0.7104
1	Zci_01681	0.6773
1	Zci_01702	0.7207
1	Zci_01715	0.7132
1	Zci_01725	0.7362
1	Zci_01726	0.6229
1	Zci_01745	0.5706
1	Zci_01748	0.6375
1	Zci_01749	0.6461
1	Zci_01752	0.5970
1	Zci_01762	0.6507
1	Zci_01767	0.5931
1	Zci_01773	0.7294
1	Zci_01783	0.6511
1	Zci_01784	0.6219
1	Zci_01796	0.6783
1	Zci_01808	0.6168
1	Zci_01826	0.5750
1	Zci_01854	0.7493
1	Zci_01859	0.6769
1	Zci_01867	0.7170
1	Zci_01925	0.6880
1	Zci_01930	0.7485
1	Zci_01937	0.5913
1	Zci_01972	0.5521
1	Zci_01979	0.6820
1	Zci_01986	0.6988
1	Zci_02008	0.7179
1	Zci_02028	0.6839
1	Zci_02031	0.5266
1	Zci_02051	0.7139
1	Zci_02061	0.7328
1	Zci_02062	0.7428
1	Zci_02096	0.7265
1	Zci_02097	0.7494
1	Zci_02108	0.5139
1	Zci_02119	0.7130
1	Zci_02188	0.7191
1	Zci_02209	0.6330
1	Zci_02211	0.7218
1	Zci_02228	0.7386
1	Zci_02284	0.7390
1	Zci_02303	0.6940
1	Zci_02304	0.5445
1	Zci_02328	0.5269
1	Zci_02329	0.6885
1	Zci_02333	0.7212
1	Zci_02340	0.7245
1	Zci_02345	0.7319
1	Zci_02346	0.6811
1	Zci_02347	0.6835
1	Zci_02348	0.7370
1	Zci_02361	0.7027
1	Zci_02421	0.6355
1	Zci_02426	0.7056
1	Zci_02431	0.7027
1	Zci_02452	0.7045
1	Zci_02470	0.6902
1	Zci_02479	0.7330
1	Zci_02514	0.6713
1	Zci_02533	0.7417
1	Zci_02539	0.7341
1	Zci_02565	0.7287
1	Zci_02572	0.7022
1	Zci_02606	0.6838
1	Zci_02630	0.7362
1	Zci_02660	0.6766
1	Zci_02701	0.7303
1	Zci_02741	0.6077
1	Zci_02774	0.7313
1	Zci_02787	0.7251
1	Zci_02828	0.6647
1	Zci_02863	0.6029
1	Zci_02877	0.4773
1	Zci_02879	0.7074
1	Zci_02921	0.5770
1	Zci_02945	0.6704
1	Zci_03048	0.7200
1	Zci_03061	0.6867
1	Zci_03077	0.6715
1	Zci_03092	0.6868
1	Zci_03098	0.6739
1	Zci_03110	0.6725
1	Zci_03140	0.6947
1	Zci_03194	0.6130
1	Zci_03211	0.6766
1	Zci_03215	0.6422
1	Zci_03265	0.7358
1	Zci_03271	0.7392
1	Zci_03280	0.7046
1	Zci_03293	0.7196
1	Zci_03339	0.7269
1	Zci_03379	0.6404
1	Zci_03398	0.5839
1	Zci_03400	0.7266
1	Zci_03423	0.4463
1	Zci_03428	0.6779
1	Zci_03458	0.7456
1	Zci_03462	0.6918
1	Zci_03464	0.6947
1	Zci_03479	0.7374
1	Zci_03500	0.6149
1	Zci_03508	0.6905
1	Zci_03515	0.6988
1	Zci_03531	0.7232
1	Zci_03574	0.7010
1	Zci_03585	0.6126
1	Zci_03618	0.6133
1	Zci_03622	0.6562
1	Zci_03688	0.7302
1	Zci_03698	0.5697
1	Zci_03703	0.6956
1	Zci_03719	0.7264
1	Zci_03737	0.7154
1	Zci_03745	0.7136
1	Zci_03755	0.7120
1	Zci_03792	0.6887
1	Zci_03793	0.7332
1	Zci_03794	0.6173
1	Zci_03799	0.7424
1	Zci_03847	0.7154
1	Zci_03872	0.7284
1	Zci_03877	0.7439
1	Zci_03916	0.6848
1	Zci_03935	0.7201
1	Zci_03940	0.6583
1	Zci_03960	0.6458
1	Zci_03966	0.5484
1	Zci_03987	0.7331
1	Zci_03988	0.6367
1	Zci_03999	0.7092
1	Zci_04046	0.4911
1	Zci_04060	0.6405
1	Zci_04073	0.7332
1	Zci_04085	0.7186
1	Zci_04128	0.6592
1	Zci_04182	0.7202
1	Zci_04223	0.7096
1	Zci_04232	0.6570
1	Zci_04261	0.7126
1	Zci_04267	0.7368
1	Zci_04269	0.6874
1	Zci_04281	0.7314
1	Zci_04283	0.7249
1	Zci_04284	0.6464
1	Zci_04295	0.6033
1	Zci_04306	0.7475
1	Zci_04309	0.7188
1	Zci_04314	0.7335
1	Zci_04323	0.7129
1	Zci_04363	0.6771
1	Zci_04365	0.7149
1	Zci_04381	0.7227
1	Zci_04389	0.6623
1	Zci_04429	0.7167
1	Zci_04468	0.7254
1	Zci_04477	0.6566
1	Zci_04583	0.6451
1	Zci_04612	0.7172
1	Zci_04631	0.5670
1	Zci_04644	0.5669
1	Zci_04687	0.6156
1	Zci_04714	0.6847
1	Zci_04716	0.7372
1	Zci_04731	0.7326
1	Zci_04735	0.7160
1	Zci_04738	0.6746
1	Zci_04749	0.6950
1	Zci_04765	0.4857
1	Zci_04774	0.6369
1	Zci_04785	0.6822
1	Zci_04794	0.7199
1	Zci_04830	0.6526
1	Zci_04845	0.6777
1	Zci_04888	0.7162
1	Zci_04890	0.7024
1	Zci_04893	0.6310
1	Zci_04898	0.5093
1	Zci_04952	0.6815
1	Zci_04960	0.7524
1	Zci_04994	0.6981
1	Zci_05002	0.5580
1	Zci_05044	0.6806
1	Zci_05062	0.5965
1	Zci_05092	0.6666
1	Zci_05111	0.5255
1	Zci_05117	0.6438
1	Zci_05184	0.7223
1	Zci_05198	0.6699
1	Zci_05217	0.6171
1	Zci_05263	0.6528
1	Zci_05326	0.5590
1	Zci_05336	0.7228
1	Zci_05378	0.7000
1	Zci_05410	0.6988
1	Zci_05428	0.5484
1	Zci_05429	0.4082
1	Zci_05443	0.5920
1	Zci_05472	0.7029
1	Zci_05509	0.6744
1	Zci_05530	0.7230
1	Zci_05541	0.6117
1	Zci_05543	0.6970
1	Zci_05545	0.7010
1	Zci_05606	0.5417
1	Zci_05686	0.5374
1	Zci_05687	0.7249
1	Zci_05705	0.7373
1	Zci_05721	0.6027
1	Zci_05722	0.6313
1	Zci_05745	0.6596
1	Zci_05759	0.7458
1	Zci_05761	0.7155
1	Zci_05779	0.7448
1	Zci_05866	0.7078
1	Zci_05928	0.7339
1	Zci_05944	0.6612
1	Zci_05955	0.6877
1	Zci_05996	0.6414
1	Zci_06052	0.6238
1	Zci_06069	0.6148
1	Zci_06073	0.7192
1	Zci_06099	0.7329
1	Zci_06104	0.5010
1	Zci_06178	0.6053
1	Zci_06183	0.6932
1	Zci_06217	0.5189
1	Zci_06221	0.7174
1	Zci_06278	0.6432
1	Zci_06289	0.6958
1	Zci_06294	0.6697
1	Zci_06300	0.6893
1	Zci_06301	0.7112
1	Zci_06307	0.6751
1	Zci_06310	0.6372
1	Zci_06358	0.6921
1	Zci_06368	0.7105
1	Zci_06373	0.5566
1	Zci_06386	0.6060
1	Zci_06392	0.7199
1	Zci_06418	0.6990
1	Zci_06420	0.7250
1	Zci_06422	0.6435
1	Zci_06424	0.7198
1	Zci_06456	0.6058
1	Zci_06461	0.6104
1	Zci_06462	0.6988
1	Zci_06466	0.6999
1	Zci_06482	0.6583
1	Zci_06537	0.6224
1	Zci_06542	0.5811
1	Zci_06561	0.6713
1	Zci_06563	0.4401
1	Zci_06565	0.6720
1	Zci_06586	0.7473
1	Zci_06621	0.6604
1	Zci_06624	0.6295
1	Zci_06628	0.7321
1	Zci_06656	0.6309
1	Zci_06706	0.7011
1	Zci_06738	0.7042
1	Zci_06753	0.5400
1	Zci_06772	0.6605
1	Zci_06808	0.7249
1	Zci_06813	0.7571
1	Zci_06823	0.5502
1	Zci_06826	0.6250
1	Zci_06828	0.6546
1	Zci_06836	0.6617
1	Zci_06863	0.4871
1	Zci_06891	0.6044
1	Zci_07010	0.5744
1	Zci_07056	0.5954
1	Zci_07069	0.7386
1	Zci_07120	0.6726
1	Zci_07131	0.6046
1	Zci_07159	0.5603
1	Zci_07167	0.7101
1	Zci_07168	0.6972
1	Zci_07183	0.6318
1	Zci_07202	0.6011
1	Zci_07208	0.6437
1	Zci_07247	0.6048
1	Zci_07277	0.7137
1	Zci_07396	0.6305
1	Zci_07403	0.5905
1	Zci_07436	0.5694
1	Zci_07451	0.6758
1	Zci_07453	0.6549
1	Zci_07461	0.5958
1	Zci_07518	0.6414
1	Zci_07564	0.6462
1	Zci_07582	0.7216
1	Zci_07616	0.4901
1	Zci_07618	0.5233
1	Zci_07620	0.6952
1	Zci_07623	0.5899
1	Zci_07640	0.7237
1	Zci_07672	0.7202
1	Zci_07675	0.5527
1	Zci_07692	0.7102
1	Zci_07766	0.5369
1	Zci_07769	0.5986
1	Zci_07802	0.5640
1	Zci_07835	0.6999
1	Zci_07889	0.7164
1	Zci_07893	0.6264
1	Zci_07923	0.6344
1	Zci_07951	0.6886
1	Zci_07954	0.7404
1	Zci_07956	0.7238
1	Zci_07972	0.7233
1	Zci_07999	0.7432
1	Zci_08020	0.7223
1	Zci_08044	0.6761
1	Zci_08052	0.6819
1	Zci_08079	0.7182
1	Zci_08152	0.5723
1	Zci_08183	0.7260
1	Zci_08230	0.5465
1	Zci_08287	0.6944
1	Zci_08308	0.6315
1	Zci_08318	0.6930
1	Zci_08330	0.6342
1	Zci_08345	0.6953
1	Zci_08361	0.7413
1	Zci_08363	0.6392
1	Zci_08399	0.7156
1	Zci_08401	0.6096
1	Zci_08407	0.7024
1	Zci_08466	0.6618
1	Zci_08495	0.7259
1	Zci_08534	0.7364
1	Zci_08536	0.7300
1	Zci_08717	0.4997
1	Zci_08748	0.7088
1	Zci_08762	0.6483
1	Zci_08788	0.6955
1	Zci_08806	0.6742
1	Zci_08845	0.6306
1	Zci_08878	0.6945
1	Zci_08889	0.6348
1	Zci_08924	0.7296
1	Zci_08929	0.6739
1	Zci_08939	0.7338
1	Zci_08943	0.7041
1	Zci_08960	0.6794
1	Zci_08961	0.6348
1	Zci_08973	0.7141
1	Zci_08990	0.7031
1	Zci_09029	0.7042
1	Zci_09051	0.6014
1	Zci_09062	0.6242
1	Zci_09079	0.6958
1	Zci_09152	0.6219
1	Zci_09212	0.6910
1	Zci_09235	0.6611
1	Zci_09257	0.7271
1	Zci_09283	0.6900
1	Zci_09313	0.6167
1	Zci_09314	0.6629
1	Zci_09322	0.5658
1	Zci_09345	0.6580
1	Zci_09384	0.6102
1	Zci_09440	0.7315
1	Zci_09456	0.6150
1	Zci_09460	0.6830
1	Zci_09475	0.7114
1	Zci_09542	0.6730
1	Zci_09553	0.7331
1	Zci_09557	0.7353
1	Zci_09560	0.6520
1	Zci_09607	0.7417
1	Zci_09623	0.7012
1	Zci_09655	0.6758
1	Zci_09664	0.7034
1	Zci_09666	0.6142
1	Zci_09670	0.6909
1	Zci_09732	0.6799
1	Zci_09781	0.5601
1	Zci_09822	0.6053
1	Zci_09882	0.6349
1	Zci_09886	0.4992
1	Zci_09888	0.6354
1	Zci_09905	0.6413
1	Zci_09909	0.7221
1	Zci_09918	0.6781
1	Zci_09922	0.7201
1	Zci_09930	0.7360
1	Zci_09959	0.6686
1	Zci_10010	0.6392
1	Zci_10032	0.7179
1	Zci_10054	0.5232
1	Zci_10065	0.7298
1	Zci_10067	0.7006
1	Zci_10143	0.7031
1	Zci_10155	0.6196
1	Zci_10209	0.6478
1	Zci_10210	0.6164
1	Zci_10218	0.6080
1	Zci_10350	0.6115
1	Zci_10355	0.6980
1	Zci_10407	0.6780
1	Zci_10512	0.7149
1	Zci_10519	0.5523
1	Zci_10568	0.6425
1	Zci_10572	0.7243
1	Zci_10581	0.6661
1	Zci_10595	0.6925
1	Zci_10596	0.7097
1	Zci_10608	0.6893
1	Zci_10612	0.6128
1	Zci_10623	0.6935
1	Zci_10628	0.4837
1	Zci_10629	0.6366
1	Zci_10632	0.6616
1	Zci_10649	0.5543
1	Zci_10660	0.7195
1	Zci_10663	0.6547
1	Zci_10684	0.6903
1	Zci_10706	0.7375
1	Zci_10708	0.7259
1	Zci_10709	0.6646
1	Zci_10712	0.6929
1	Zci_10713	0.6820
1	Zci_10714	0.4874
1	Zci_10716	0.7111
1	Zci_10725	0.6577
1	Zci_10726	0.5581
1	Zci_10730	0.6687
1	Zci_10731	0.6118
1	Zci_10749	0.6555
1	Zci_10756	0.7167
1	Zci_10757	0.6001
1	Zci_10775	0.7324
1	Zci_10778	0.6326
1	Zci_10822	0.6023
1	Zci_10833	0.6067
1	Zci_10852	0.6758
1	Zci_10858	0.6914
1	Zci_10881	0.7245
1	Zci_10894	0.7159
1	Zci_10907	0.6393
1	Zci_10961	0.4605
1	Zci_10962	0.7229
1	Zci_10965	0.6032
1	Zci_11037	0.6549
1	Zci_11041	0.6876
1	Zci_11047	0.5794
1	Zci_11069	0.6973
1	Zci_11103	0.7298
1	Zci_11140	0.5670
1	Zci_11180	0.6341
1	Zci_11181	0.5949
1	Zci_11197	0.7061
1	Zci_11238	0.7206
1	Zci_11265	0.6939
1	Zci_11354	0.6624
1	Zci_11387	0.7180
1	Zci_11406	0.5412
1	Zci_11438	0.7452
1	Zci_11526	0.7138
1	Zci_11544	0.7148
1	Zci_11551	0.6569
1	Zci_11561	0.7137
1	Zci_11583	0.7298
1	Zci_11669	0.7203
1	Zci_11691	0.5965
1	Zci_11737	0.7169
1	Zci_11792	0.5975
1	Zci_11803	0.7123
1	Zci_11813	0.7130
1	Zci_11849	0.7134
1	Zci_11854	0.4513
1	Zci_11863	0.7366
1	Zci_11864	0.6647
1	Zci_11865	0.6205
1	Zci_11866	0.5435
1	Zci_11872	0.7383
1	Zci_11878	0.5906
1	Zci_11945	0.5388
1	Zci_11976	0.5716
1	Zci_11983	0.7178
1	Zci_11985	0.6859
1	Zci_12012	0.6793
1	Zci_12024	0.7346
1	Zci_12055	0.5272
1	Zci_12061	0.6561
1	Zci_12073	0.6433
1	Zci_12087	0.7169
1	Zci_12106	0.6654
1	Zci_12117	0.6409
1	Zci_12119	0.6523
1	Zci_12128	0.5733
1	Zci_12159	0.5656
1	Zci_12167	0.7193
1	Zci_12169	0.6985
1	Zci_12174	0.7253
1	Zci_12183	0.6764
1	Zci_12187	0.7169
1	Zci_12202	0.6459
1	Zci_12210	0.6748
1	Zci_12220	0.7057
1	Zci_12227	0.6774
1	Zci_12265	0.6776
1	Zci_12310	0.7371
1	Zci_12345	0.6837
1	Zci_12347	0.6516
1	Zci_12368	0.7019
1	Zci_12370	0.6163
1	Zci_12385	0.7052
1	Zci_12394	0.6282
1	Zci_12403	0.6659
1	Zci_12479	0.7231
1	Zci_12488	0.5813
1	Zci_12550	0.6466
1	Zci_12591	0.5965
1	Zci_12601	0.7267
1	Zci_12642	0.5928
1	Zci_12734	0.6846
1	Zci_12755	0.7039
1	Zci_12790	0.5436
1	Zci_12793	0.6743
1	Zci_12794	0.6696
1	Zci_12799	0.6350
1	Zci_12827	0.4236
1	Zci_12830	0.7046
1	Zci_12848	0.7042
1	Zci_12855	0.5461
1	Zci_12869	0.7272
1	Zci_12937	0.7293
1	Zci_12940	0.5700
1	Zci_12986	0.4544
1	Zci_13022	0.6796
1	Zci_13031	0.6071
1	Zci_13041	0.6885
1	Zci_13043	0.5705
1	Zci_13047	0.6417
1	Zci_13048	0.7263
1	Zci_13054	0.7211
1	Zci_13118	0.6987
1	Zci_13203	0.4671
1	Zci_13205	0.4770
1	Zci_13215	0.7425
1	Zci_13241	0.6878
1	Zci_13261	0.7168
1	Zci_13283	0.7205
1	Zci_13311	0.7029
1	Zci_13312	0.6150
1	Zci_13321	0.6805
1	Zci_13339	0.6140
1	Zci_13400	0.7450
1	Zci_13421	0.5576
1	Zci_13434	0.7071
1	Zci_13491	0.6336
1	Zci_13492	0.6128
1	Zci_13578	0.7253
1	Zci_13592	0.7410
1	Zci_13601	0.7423
1	Zci_13630	0.7119
1	Zci_13669	0.6072
1	Zci_13684	0.5676
1	Zci_13740	0.6932
1	Zci_13745	0.6922
1	Zci_13786	0.7179
1	Zci_13818	0.7059
1	Zci_13832	0.6668
1	Zci_13835	0.6862
1	Zci_13837	0.5668
1	Zci_13849	0.6983
1	Zci_13898	0.5840
1	Zci_13910	0.6079
1	Zci_13913	0.7162
1	Zci_13923	0.7085
1	Zci_14014	0.6820
1	Zci_14053	0.5970
1	Zci_14055	0.6200
1	Zci_14068	0.7363
1	Zci_14106	0.5144
1	Zci_14186	0.7070
1	Zci_14187	0.7066
1	Zci_14256	0.7361
1	Zci_14266	0.7205
1	Zci_14344	0.5037
1	Zci_14348	0.6369
1	Zci_14352	0.6310
1	Zci_14455	0.7203
1	Zci_14496	0.6325
1	Zci_14500	0.6855
1	Zci_14516	0.7193
1	Zci_14578	0.7005
1	Zci_14579	0.6931
1	Zci_14622	0.7205
1	Zci_14624	0.7146
1	Zci_14634	0.7054
1	Zci_14637	0.5672
1	Zci_14681	0.7446
1	Zci_14716	0.6246
1	Zci_14723	0.5322
1	Zci_14738	0.6700
1	Zci_14807	0.6248
1	Zci_14843	0.6411
1	Zci_14858	0.6894
1	Zci_14878	0.5257
1	Zci_14901	0.7227
1	Zci_14919	0.7329
1	Zci_14942	0.6773
1	Zci_14950	0.6196
1	Zci_14951	0.7075
1	Zci_15016	0.6962
1	Zci_15019	0.7042
1	Zci_15028	0.7071
1	Zci_15070	0.7378
1	Zci_15170	0.4960
1	Zci_15214	0.7359
1	Zci_15283	0.7185
1	Zci_15284	0.6127
1	Zci_15297	0.6726
1	Zci_15327	0.6853
1	Zci_15348	0.7222
1	Zci_15356	0.7012
1	Zci_15415	0.7131
1	Zci_15423	0.6287
1	Zci_15426	0.7454
1	Zci_15458	0.6967
1	Zci_15526	0.7007
1	Zci_15570	0.7162
1	Zci_15586	0.7076
1	Zci_15627	0.7270
1	Zci_15629	0.6863
1	Zci_15649	0.5378
1	Zci_15716	0.6055
1	Zci_15717	0.7446
1	Zci_15786	0.7353
1	Zci_15872	0.6707
1	Zci_15887	0.6658
1	Zci_15911	0.7212
1	Zci_15988	0.7440
1	Zci_16407	0.7314
1	Zci_16469	0.7023
1	Zci_16475	0.7284
1	Zci_16602	0.6452
2	Zci_00008	0.5344
2	Zci_00041	0.6129
2	Zci_00170	0.4393
2	Zci_00173	0.5663
2	Zci_00335	0.4534
2	Zci_00506	0.6173
2	Zci_00528	0.5798
2	Zci_00595	0.4964
2	Zci_00836	0.3783
2	Zci_00837	0.3542
2	Zci_00849	0.5221
2	Zci_00850	0.4305
2	Zci_00968	0.5140
2	Zci_01004	0.4596
2	Zci_01005	0.5658
2	Zci_01158	0.4241
2	Zci_01170	0.5098
2	Zci_01329	0.5508
2	Zci_01365	0.6112
2	Zci_01466	0.6141
2	Zci_01503	0.4980
2	Zci_01510	0.5105
2	Zci_01529	0.6185
2	Zci_01588	0.5536
2	Zci_01633	0.6124
2	Zci_01666	0.4802
2	Zci_01671	0.4862
2	Zci_01673	0.5993
2	Zci_01708	0.5664
2	Zci_01728	0.5743
2	Zci_01729	0.5126
2	Zci_01934	0.4199
2	Zci_02035	0.5712
2	Zci_02137	0.5419
2	Zci_02141	0.4834
2	Zci_02190	0.5550
2	Zci_02234	0.5535
2	Zci_02260	0.4589
2	Zci_02368	0.5854
2	Zci_02401	0.5454
2	Zci_02433	0.5620
2	Zci_02465	0.5404
2	Zci_02576	0.5944
2	Zci_02678	0.5883
2	Zci_02699	0.5830
2	Zci_02710	0.4507
2	Zci_02745	0.5508
2	Zci_02779	0.5734
2	Zci_02890	0.5743
2	Zci_02932	0.5167
2	Zci_02941	0.2241
2	Zci_03087	0.3262
2	Zci_03166	0.5080
2	Zci_03195	0.5958
2	Zci_03267	0.5660
2	Zci_03269	0.5378
2	Zci_03302	0.4523
2	Zci_03308	0.5811
2	Zci_03403	0.5879
2	Zci_03454	0.5326
2	Zci_03582	0.5343
2	Zci_03611	0.5129
2	Zci_03841	0.6035
2	Zci_03844	0.4743
2	Zci_04123	0.4542
2	Zci_04275	0.4182
2	Zci_04278	0.5241
2	Zci_04340	0.5829
2	Zci_04488	0.5658
2	Zci_04609	0.5556
2	Zci_04641	0.2996
2	Zci_04710	0.4890
2	Zci_04753	0.5663
2	Zci_04796	0.5276
2	Zci_04798	0.5443
2	Zci_04921	0.5542
2	Zci_04923	0.6065
2	Zci_04930	0.6200
2	Zci_04953	0.4936
2	Zci_04959	0.6004
2	Zci_05075	0.5649
2	Zci_05094	0.6062
2	Zci_05103	0.5842
2	Zci_05112	0.4238
2	Zci_05187	0.5697
2	Zci_05251	0.5606
2	Zci_05282	0.5774
2	Zci_05289	0.4304
2	Zci_05348	0.5991
2	Zci_05352	0.4357
2	Zci_05363	0.5872
2	Zci_05367	0.4286
2	Zci_05370	0.4193
2	Zci_05415	0.5682
2	Zci_05520	0.5590
2	Zci_05529	0.6198
2	Zci_05547	0.5869
2	Zci_05548	0.6001
2	Zci_05586	0.5574
2	Zci_05622	0.6052
2	Zci_05727	0.5743
2	Zci_05749	0.4945
2	Zci_05751	0.5607
2	Zci_05767	0.4742
2	Zci_05846	0.5797
2	Zci_05867	0.5136
2	Zci_05893	0.5851
2	Zci_05937	0.5512
2	Zci_05959	0.6116
2	Zci_06010	0.5978
2	Zci_06038	0.5652
2	Zci_06055	0.5288
2	Zci_06224	0.5251
2	Zci_06236	0.5882
2	Zci_06290	0.6000
2	Zci_06333	0.3911
2	Zci_06339	0.6052
2	Zci_06356	0.5848
2	Zci_06499	0.2706
2	Zci_06524	0.4006
2	Zci_06678	0.4928
2	Zci_06694	0.6063
2	Zci_06725	0.3299
2	Zci_06748	0.4695
2	Zci_06805	0.5272
2	Zci_06866	0.6076
2	Zci_06867	0.5253
2	Zci_06881	0.5720
2	Zci_06926	0.4946
2	Zci_07058	0.6194
2	Zci_07097	0.4559
2	Zci_07124	0.5177
2	Zci_07156	0.4740
2	Zci_07333	0.4443
2	Zci_07463	0.4872
2	Zci_07671	0.4707
2	Zci_07695	0.5836
2	Zci_07709	0.5639
2	Zci_08001	0.4093
2	Zci_08126	0.3922
2	Zci_08127	0.5430
2	Zci_08163	0.5878
2	Zci_08180	0.3604
2	Zci_08213	0.5767
2	Zci_08214	0.5146
2	Zci_08260	0.5524
2	Zci_08367	0.5699
2	Zci_08400	0.6129
2	Zci_08484	0.3862
2	Zci_08813	0.5840
2	Zci_08949	0.6176
2	Zci_08950	0.5880
2	Zci_08951	0.4928
2	Zci_08956	0.5842
2	Zci_09005	0.5603
2	Zci_09161	0.5877
2	Zci_09224	0.5136
2	Zci_09229	0.5994
2	Zci_09435	0.4651
2	Zci_09446	0.4711
2	Zci_09452	0.6096
2	Zci_09618	0.6138
2	Zci_09659	0.5872
2	Zci_09683	0.4457
2	Zci_09733	0.6026
2	Zci_09757	0.3620
2	Zci_09828	0.5085
2	Zci_09940	0.5662
2	Zci_10014	0.5240
2	Zci_10080	0.6007
2	Zci_10167	0.3835
2	Zci_10171	0.5793
2	Zci_10177	0.3648
2	Zci_10272	0.4672
2	Zci_10415	0.5305
2	Zci_10481	0.3526
2	Zci_10677	0.5711
2	Zci_10711	0.5532
2	Zci_10744	0.5912
2	Zci_10843	0.6039
2	Zci_11021	0.5754
2	Zci_11074	0.5578
2	Zci_11098	0.5642
2	Zci_11109	0.3209
2	Zci_11188	0.5432
2	Zci_11210	0.3999
2	Zci_11247	0.3511
2	Zci_11433	0.3779
2	Zci_11744	0.3568
2	Zci_11750	0.5931
2	Zci_11880	0.5023
2	Zci_11913	0.4655
2	Zci_11937	0.5742
2	Zci_12152	0.4495
2	Zci_12176	0.5596
2	Zci_12230	0.5979
2	Zci_12240	0.4782
2	Zci_12313	0.5012
2	Zci_12338	0.5560
2	Zci_12344	0.5586
2	Zci_12362	0.6090
2	Zci_12366	0.5916
2	Zci_12414	0.5328
2	Zci_12460	0.4416
2	Zci_12482	0.6009
2	Zci_12597	0.5935
2	Zci_12752	0.5254
2	Zci_12797	0.5569
2	Zci_12892	0.5372
2	Zci_12904	0.6069
2	Zci_12946	0.5716
2	Zci_13051	0.3767
2	Zci_13243	0.5741
2	Zci_13246	0.5672
2	Zci_13259	0.5567
2	Zci_13284	0.4396
2	Zci_13367	0.5461
2	Zci_13385	0.6098
2	Zci_13390	0.5942
2	Zci_13485	0.5500
2	Zci_13489	0.5278
2	Zci_13660	0.5249
2	Zci_13759	0.5943
2	Zci_13766	0.6043
2	Zci_13959	0.5539
2	Zci_14069	0.4561
2	Zci_14289	0.5856
2	Zci_14394	0.3857
2	Zci_14494	0.5752
2	Zci_14535	0.5523
2	Zci_14538	0.4185
2	Zci_14615	0.3817
2	Zci_14694	0.5768
2	Zci_14719	0.4694
2	Zci_14806	0.5604
2	Zci_14881	0.5745
2	Zci_15239	0.4628
2	Zci_15298	0.5392
2	Zci_15801	0.5117
2	Zci_15929	0.5012
2	Zci_15953	0.5639
2	Zci_15984	0.3914
2	Zci_16320	0.3344
2	Zci_16335	0.4147
2	Zci_16451	0.6004
2	Zci_16480	0.5807
2	Zci_16531	0.5274
2	Zci_16583	0.4758
3	Zci_00038	0.3986
3	Zci_00097	0.1256
3	Zci_00104	0.1474
3	Zci_00127	0.4031
3	Zci_00128	0.4366
3	Zci_00134	0.0437
3	Zci_00145	0.1531
3	Zci_00158	0.1728
3	Zci_00182	0.3458
3	Zci_00213	0.4353
3	Zci_00234	0.3320
3	Zci_00238	0.4627
3	Zci_00266	0.4676
3	Zci_00287	0.3988
3	Zci_00310	0.0896
3	Zci_00311	0.3228
3	Zci_00316	0.4641
3	Zci_00372	0.4566
3	Zci_00455	0.3853
3	Zci_00486	0.1611
3	Zci_00504	0.4447
3	Zci_00523	0.4089
3	Zci_00568	0.3266
3	Zci_00573	0.0564
3	Zci_00608	0.3214
3	Zci_00617	0.2709
3	Zci_00741	0.2252
3	Zci_00742	0.4433
3	Zci_00766	0.2103
3	Zci_00781	0.2752
3	Zci_00805	0.4273
3	Zci_00825	0.1730
3	Zci_00838	0.4532
3	Zci_00861	0.2106
3	Zci_00926	0.4212
3	Zci_00936	0.3646
3	Zci_00962	0.1001
3	Zci_00969	0.4341
3	Zci_00979	0.1176
3	Zci_01012	0.3893
3	Zci_01093	0.4471
3	Zci_01156	0.4025
3	Zci_01168	0.3651
3	Zci_01169	0.4554
3	Zci_01200	0.0687
3	Zci_01296	0.0794
3	Zci_01312	0.2955
3	Zci_01376	0.3853
3	Zci_01534	0.4554
3	Zci_01543	0.2287
3	Zci_01565	0.4224
3	Zci_01578	0.1757
3	Zci_01616	0.4539
3	Zci_01668	0.4546
3	Zci_01678	0.3118
3	Zci_01684	0.0408
3	Zci_01686	0.3771
3	Zci_01705	0.4312
3	Zci_01706	0.4442
3	Zci_01751	0.1390
3	Zci_01760	0.4574
3	Zci_01817	0.3811
3	Zci_01869	0.1190
3	Zci_01870	0.4540
3	Zci_01892	0.2538
3	Zci_02012	0.1067
3	Zci_02054	0.0487
3	Zci_02056	0.3226
3	Zci_02163	0.3926
3	Zci_02173	0.4249
3	Zci_02199	0.2969
3	Zci_02331	0.4182
3	Zci_02357	0.0812
3	Zci_02432	0.4640
3	Zci_02453	0.2033
3	Zci_02570	0.0797
3	Zci_02573	0.3969
3	Zci_02600	0.4430
3	Zci_02667	0.4182
3	Zci_02695	0.2138
3	Zci_02704	0.3239
3	Zci_02707	0.1987
3	Zci_02737	0.4232
3	Zci_02768	0.4167
3	Zci_02791	0.4397
3	Zci_02831	0.4029
3	Zci_02882	0.0895
3	Zci_02929	0.2973
3	Zci_02946	0.2358
3	Zci_02963	0.4382
3	Zci_02999	0.4446
3	Zci_03008	0.4670
3	Zci_03010	0.3891
3	Zci_03053	0.4723
3	Zci_03060	0.3819
3	Zci_03071	0.0322
3	Zci_03144	0.4576
3	Zci_03205	0.2996
3	Zci_03208	0.2784
3	Zci_03228	0.4204
3	Zci_03272	0.4283
3	Zci_03310	0.3920
3	Zci_03316	0.4066
3	Zci_03351	0.0541
3	Zci_03443	0.3248
3	Zci_03448	0.3784
3	Zci_03452	0.3143
3	Zci_03563	0.3519
3	Zci_03595	0.0760
3	Zci_03680	0.3332
3	Zci_03694	0.4555
3	Zci_03825	0.4595
3	Zci_03835	0.3731
3	Zci_03868	0.4413
3	Zci_03912	0.0289
3	Zci_03961	0.4651
3	Zci_04053	0.4067
3	Zci_04074	0.2028
3	Zci_04077	0.4216
3	Zci_04083	0.2511
3	Zci_04172	0.2912
3	Zci_04247	0.1307
3	Zci_04293	0.3661
3	Zci_04335	0.3326
3	Zci_04337	0.4351
3	Zci_04354	0.4656
3	Zci_04366	0.3111
3	Zci_04370	0.3832
3	Zci_04380	0.4553
3	Zci_04432	0.3772
3	Zci_04440	0.4450
3	Zci_04479	0.2398
3	Zci_04505	0.1392
3	Zci_04537	0.3321
3	Zci_04551	0.0467
3	Zci_04624	0.3068
3	Zci_04640	0.2863
3	Zci_04643	0.2715
3	Zci_04662	0.1262
3	Zci_04668	0.3521
3	Zci_04670	0.4280
3	Zci_04694	0.3513
3	Zci_04734	0.4456
3	Zci_04831	0.3987
3	Zci_04842	0.3673
3	Zci_04889	0.2335
3	Zci_04946	0.1570
3	Zci_04965	0.4612
3	Zci_04973	0.4087
3	Zci_05065	0.2803
3	Zci_05102	0.1684
3	Zci_05134	0.4095
3	Zci_05212	0.4487
3	Zci_05235	0.4067
3	Zci_05265	0.2404
3	Zci_05276	0.0647
3	Zci_05283	0.2307
3	Zci_05284	0.3884
3	Zci_05338	0.4312
3	Zci_05340	0.1865
3	Zci_05350	0.0803
3	Zci_05374	0.0882
3	Zci_05385	0.4293
3	Zci_05418	0.1237
3	Zci_05445	0.4657
3	Zci_05575	0.0865
3	Zci_05618	0.3732
3	Zci_05653	0.2226
3	Zci_05678	0.3763
3	Zci_05683	0.4388
3	Zci_05693	0.3569
3	Zci_05702	0.4567
3	Zci_05707	0.4242
3	Zci_05816	0.3994
3	Zci_05838	0.3202
3	Zci_05868	0.0877
3	Zci_05888	0.4188
3	Zci_05950	0.3631
3	Zci_05961	0.4263
3	Zci_06000	0.3746
3	Zci_06005	0.4122
3	Zci_06009	0.4615
3	Zci_06019	0.3339
3	Zci_06041	0.2726
3	Zci_06056	0.1539
3	Zci_06059	0.3905
3	Zci_06075	0.2212
3	Zci_06095	0.3244
3	Zci_06102	0.4193
3	Zci_06123	0.0625
3	Zci_06187	0.4307
3	Zci_06312	0.0433
3	Zci_06336	0.1390
3	Zci_06369	0.4014
3	Zci_06425	0.1666
3	Zci_06426	0.0726
3	Zci_06449	0.0513
3	Zci_06454	0.3928
3	Zci_06487	0.1694
3	Zci_06492	0.3398
3	Zci_06496	0.2519
3	Zci_06530	0.4074
3	Zci_06543	0.4065
3	Zci_06589	0.4044
3	Zci_06637	0.4464
3	Zci_06720	0.3997
3	Zci_06721	0.3047
3	Zci_06744	0.2846
3	Zci_06785	0.1146
3	Zci_06872	0.1287
3	Zci_06909	0.4337
3	Zci_06917	0.3952
3	Zci_06995	0.4595
3	Zci_06996	0.4195
3	Zci_06997	0.3711
3	Zci_07005	0.4461
3	Zci_07009	0.2346
3	Zci_07012	0.4345
3	Zci_07075	0.2916
3	Zci_07078	0.2975
3	Zci_07172	0.4309
3	Zci_07175	0.3381
3	Zci_07178	0.4256
3	Zci_07179	0.4011
3	Zci_07210	0.2677
3	Zci_07256	0.4634
3	Zci_07285	0.4132
3	Zci_07290	0.4535
3	Zci_07351	0.1425
3	Zci_07395	0.2666
3	Zci_07420	0.4247
3	Zci_07456	0.2290
3	Zci_07494	0.0492
3	Zci_07545	0.4546
3	Zci_07565	0.2862
3	Zci_07572	0.1977
3	Zci_07663	0.4360
3	Zci_07691	0.1355
3	Zci_07699	0.4451
3	Zci_07700	0.3019
3	Zci_07701	0.2459
3	Zci_07721	0.4456
3	Zci_07732	0.0633
3	Zci_07754	0.4030
3	Zci_07833	0.4209
3	Zci_07850	0.4275
3	Zci_07878	0.2599
3	Zci_07881	0.2886
3	Zci_07904	0.2046
3	Zci_07916	0.4280
3	Zci_07940	0.1813
3	Zci_07961	0.4334
3	Zci_07973	0.2889
3	Zci_07983	0.3289
3	Zci_07986	0.4705
3	Zci_07992	0.2362
3	Zci_08019	0.3719
3	Zci_08040	0.2907
3	Zci_08056	0.4617
3	Zci_08094	0.4343
3	Zci_08096	0.0873
3	Zci_08097	0.2323
3	Zci_08165	0.4217
3	Zci_08174	0.2483
3	Zci_08182	0.1607
3	Zci_08212	0.3144
3	Zci_08224	0.1642
3	Zci_08236	0.0898
3	Zci_08266	0.1303
3	Zci_08333	0.0526
3	Zci_08373	0.2164
3	Zci_08414	0.4110
3	Zci_08513	0.2123
3	Zci_08514	0.4199
3	Zci_08524	0.3748
3	Zci_08548	0.2896
3	Zci_08570	0.1432
3	Zci_08572	0.3649
3	Zci_08670	0.4589
3	Zci_08725	0.1529
3	Zci_08826	0.0632
3	Zci_08946	0.4323
3	Zci_08958	0.0763
3	Zci_09014	0.0471
3	Zci_09019	0.4606
3	Zci_09052	0.3053
3	Zci_09081	0.2714
3	Zci_09090	0.0820
3	Zci_09102	0.3543
3	Zci_09166	0.2934
3	Zci_09184	0.3982
3	Zci_09228	0.2295
3	Zci_09234	0.3716
3	Zci_09268	0.2162
3	Zci_09343	0.4237
3	Zci_09382	0.3705
3	Zci_09385	0.3907
3	Zci_09477	0.1956
3	Zci_09482	0.1442
3	Zci_09544	0.0592
3	Zci_09550	0.4411
3	Zci_09600	0.1256
3	Zci_09610	0.0806
3	Zci_09639	0.0451
3	Zci_09715	0.0253
3	Zci_09792	0.1849
3	Zci_09833	0.3777
3	Zci_09877	0.1966
3	Zci_10001	0.4601
3	Zci_10002	0.4629
3	Zci_10033	0.1518
3	Zci_10039	0.4684
3	Zci_10060	0.0823
3	Zci_10082	0.3134
3	Zci_10142	0.3640
3	Zci_10172	0.3894
3	Zci_10315	0.3618
3	Zci_10332	0.4585
3	Zci_10347	0.3245
3	Zci_10434	0.1855
3	Zci_10498	0.4732
3	Zci_10507	0.2674
3	Zci_10542	0.4604
3	Zci_10554	0.4615
3	Zci_10586	0.4252
3	Zci_10769	0.3848
3	Zci_10810	0.0615
3	Zci_10868	0.4125
3	Zci_10873	0.0485
3	Zci_10899	0.4663
3	Zci_10900	0.1783
3	Zci_10928	0.4596
3	Zci_10987	0.1172
3	Zci_11004	0.1649
3	Zci_11016	0.4209
3	Zci_11018	0.4223
3	Zci_11056	0.0910
3	Zci_11119	0.3188
3	Zci_11132	0.4313
3	Zci_11144	0.4177
3	Zci_11177	0.4591
3	Zci_11185	0.4489
3	Zci_11189	0.3511
3	Zci_11190	0.3964
3	Zci_11236	0.3624
3	Zci_11302	0.2908
3	Zci_11367	0.3544
3	Zci_11373	0.3803
3	Zci_11380	0.4540
3	Zci_11401	0.4485
3	Zci_11500	0.2700
3	Zci_11597	0.3261
3	Zci_11609	0.4406
3	Zci_11627	0.4390
3	Zci_11650	0.3205
3	Zci_11787	0.4312
3	Zci_11790	0.3217
3	Zci_11797	0.0648
3	Zci_11829	0.2103
3	Zci_11859	0.0169
3	Zci_11879	0.0520
3	Zci_11902	0.3562
3	Zci_11943	0.4509
3	Zci_11962	0.4652
3	Zci_11970	0.4516
3	Zci_11986	0.3029
3	Zci_12001	0.4182
3	Zci_12004	0.4391
3	Zci_12006	0.4205
3	Zci_12007	0.4619
3	Zci_12008	0.4607
3	Zci_12066	0.4633
3	Zci_12082	0.1321
3	Zci_12157	0.4437
3	Zci_12221	0.4419
3	Zci_12228	0.1624
3	Zci_12357	0.3978
3	Zci_12364	0.0385
3	Zci_12433	0.1483
3	Zci_12480	0.2763
3	Zci_12543	0.4681
3	Zci_12708	0.4124
3	Zci_12709	0.4402
3	Zci_12712	0.3832
3	Zci_12725	0.1037
3	Zci_12738	0.4193
3	Zci_12795	0.3984
3	Zci_12863	0.2974
3	Zci_12879	0.3396
3	Zci_12918	0.0839
3	Zci_12938	0.0375
3	Zci_12972	0.0878
3	Zci_12981	0.4409
3	Zci_13003	0.1268
3	Zci_13092	0.4383
3	Zci_13096	0.4367
3	Zci_13202	0.3975
3	Zci_13207	0.3679
3	Zci_13208	0.2006
3	Zci_13287	0.3493
3	Zci_13376	0.1925
3	Zci_13378	0.3073
3	Zci_13467	0.1154
3	Zci_13493	0.1142
3	Zci_13582	0.3267
3	Zci_13597	0.4036
3	Zci_13613	0.4073
3	Zci_13619	0.2813
3	Zci_13627	0.4107
3	Zci_13629	0.3539
3	Zci_13647	0.1381
3	Zci_13650	0.3003
3	Zci_13654	0.4184
3	Zci_13659	0.2668
3	Zci_13690	0.3990
3	Zci_13701	0.2984
3	Zci_13702	0.3319
3	Zci_13895	0.0261
3	Zci_13900	0.0536
3	Zci_13922	0.3860
3	Zci_13965	0.3636
3	Zci_14050	0.4648
3	Zci_14052	0.4380
3	Zci_14063	0.4673
3	Zci_14122	0.1384
3	Zci_14241	0.2098
3	Zci_14284	0.4074
3	Zci_14324	0.3170
3	Zci_14336	0.4052
3	Zci_14350	0.3239
3	Zci_14397	0.3566
3	Zci_14462	0.4468
3	Zci_14463	0.4168
3	Zci_14468	0.0676
3	Zci_14540	0.4502
3	Zci_14614	0.0373
3	Zci_14684	0.2844
3	Zci_14698	0.3820
3	Zci_14747	0.2797
3	Zci_14749	0.3824
3	Zci_14842	0.3663
3	Zci_14907	0.3548
3	Zci_14909	0.2465
3	Zci_14976	0.4109
3	Zci_14985	0.4585
3	Zci_15061	0.4155
3	Zci_15082	0.3813
3	Zci_15190	0.3611
3	Zci_15243	0.4420
3	Zci_15249	0.3109
3	Zci_15278	0.4426
3	Zci_15291	0.1529
3	Zci_15322	0.3827
3	Zci_15362	0.4464
3	Zci_15366	0.1081
3	Zci_15433	0.3023
3	Zci_15504	0.4325
3	Zci_15613	0.1367
3	Zci_15679	0.1135
3	Zci_15688	0.4226
3	Zci_15718	0.4314
3	Zci_15755	0.1372
3	Zci_15784	0.1117
3	Zci_15794	0.3105
3	Zci_15818	0.4162
3	Zci_15831	0.3004
3	Zci_15877	0.2358
3	Zci_15913	0.1994
3	Zci_15942	0.2373
3	Zci_15975	0.1318
3	Zci_16014	0.4127
3	Zci_16302	0.4515
3	Zci_16304	0.4117
3	Zci_16322	0.4811
3	Zci_16336	0.4479
3	Zci_16359	0.4299
3	Zci_16368	0.4436
3	Zci_16369	0.4067
3	Zci_16449	0.4058
3	Zci_16488	0.2691
3	Zci_16507	0.3879
3	Zci_16525	0.2513
3	Zci_16574	0.1811
3	Zci_16592	0.3850
3	Zci_16607	0.0521
4	Zci_00010	0.4755
4	Zci_00034	0.5268
4	Zci_00039	0.4741
4	Zci_00045	0.5091
4	Zci_00048	0.5201
4	Zci_00069	0.4635
4	Zci_00112	0.1616
4	Zci_00144	0.3077
4	Zci_00161	0.5070
4	Zci_00167	0.4135
4	Zci_00197	0.4206
4	Zci_00198	0.4452
4	Zci_00203	0.4367
4	Zci_00209	0.5092
4	Zci_00232	0.5215
4	Zci_00247	0.5290
4	Zci_00396	0.4887
4	Zci_00507	0.4594
4	Zci_00509	0.4998
4	Zci_00511	0.3788
4	Zci_00544	0.2500
4	Zci_00548	0.4267
4	Zci_00549	0.3553
4	Zci_00554	0.4668
4	Zci_00581	0.4933
4	Zci_00612	0.2751
4	Zci_00615	0.5197
4	Zci_00646	0.2208
4	Zci_00727	0.5198
4	Zci_00747	0.4815
4	Zci_00773	0.4667
4	Zci_00783	0.5102
4	Zci_00804	0.3165
4	Zci_00851	0.1285
4	Zci_00901	0.5272
4	Zci_00921	0.4988
4	Zci_00981	0.4256
4	Zci_01020	0.5239
4	Zci_01151	0.4168
4	Zci_01196	0.5106
4	Zci_01215	0.0167
4	Zci_01222	0.5185
4	Zci_01232	0.5476
4	Zci_01300	0.4788
4	Zci_01301	0.4422
4	Zci_01304	0.4091
4	Zci_01313	0.4379
4	Zci_01373	0.1982
4	Zci_01374	0.2371
4	Zci_01380	0.4140
4	Zci_01388	0.4498
4	Zci_01396	0.4845
4	Zci_01423	0.4907
4	Zci_01453	0.3880
4	Zci_01457	0.1377
4	Zci_01488	0.2100
4	Zci_01501	0.4766
4	Zci_01519	0.4900
4	Zci_01520	0.3802
4	Zci_01585	0.4899
4	Zci_01599	0.2595
4	Zci_01651	0.0258
4	Zci_01654	0.5405
4	Zci_01675	0.5030
4	Zci_01692	0.4330
4	Zci_01696	0.3935
4	Zci_01698	0.3441
4	Zci_01703	0.1838
4	Zci_01707	0.5114
4	Zci_01724	0.3811
4	Zci_01735	0.4297
4	Zci_01737	0.1194
4	Zci_01786	0.5068
4	Zci_01799	0.4162
4	Zci_01812	0.5040
4	Zci_01832	0.4945
4	Zci_01850	0.1957
4	Zci_01871	0.5034
4	Zci_01886	0.3320
4	Zci_01891	0.4138
4	Zci_01959	0.4151
4	Zci_01960	0.4719
4	Zci_01985	0.5276
4	Zci_02004	0.4499
4	Zci_02023	0.4886
4	Zci_02044	0.0558
4	Zci_02067	0.5166
4	Zci_02073	0.5360
4	Zci_02095	0.4567
4	Zci_02153	0.4537
4	Zci_02157	0.4705
4	Zci_02192	0.1317
4	Zci_02219	0.2509
4	Zci_02225	0.2777
4	Zci_02229	0.4138
4	Zci_02277	0.5140
4	Zci_02291	0.5039
4	Zci_02300	0.4612
4	Zci_02341	0.5243
4	Zci_02351	0.4970
4	Zci_02370	0.5045
4	Zci_02422	0.4891
4	Zci_02439	0.4463
4	Zci_02466	0.3596
4	Zci_02531	0.5144
4	Zci_02636	0.4831
4	Zci_02661	0.5339
4	Zci_02742	0.5146
4	Zci_02744	0.2141
4	Zci_02747	0.3097
4	Zci_02797	0.5332
4	Zci_02826	0.5009
4	Zci_02837	0.4359
4	Zci_02870	0.1159
4	Zci_02892	0.2573
4	Zci_02898	0.0855
4	Zci_02952	0.3664
4	Zci_02974	0.4484
4	Zci_03021	0.5002
4	Zci_03050	0.4550
4	Zci_03090	0.5169
4	Zci_03184	0.5061
4	Zci_03197	0.3938
4	Zci_03201	0.4982
4	Zci_03210	0.0143
4	Zci_03226	0.2291
4	Zci_03238	0.3940
4	Zci_03258	0.4600
4	Zci_03259	0.4845
4	Zci_03286	0.5238
4	Zci_03294	0.4969
4	Zci_03319	0.4219
4	Zci_03327	0.4882
4	Zci_03359	0.4258
4	Zci_03361	0.4927
4	Zci_03364	0.3968
4	Zci_03378	0.3470
4	Zci_03393	0.4450
4	Zci_03405	0.5199
4	Zci_03408	0.0924
4	Zci_03424	0.5140
4	Zci_03427	0.4431
4	Zci_03438	0.3150
4	Zci_03470	0.4862
4	Zci_03504	0.4713
4	Zci_03520	0.4044
4	Zci_03524	0.2833
4	Zci_03554	0.3788
4	Zci_03575	0.4762
4	Zci_03612	0.3984
4	Zci_03630	0.1739
4	Zci_03648	0.5330
4	Zci_03704	0.5329
4	Zci_03740	0.4561
4	Zci_03744	0.5320
4	Zci_03769	0.4686
4	Zci_03788	0.5083
4	Zci_03801	0.1675
4	Zci_03873	0.4666
4	Zci_03878	0.5065
4	Zci_03880	0.0613
4	Zci_03909	0.4464
4	Zci_03921	0.5146
4	Zci_04006	0.4184
4	Zci_04011	0.4330
4	Zci_04020	0.4967
4	Zci_04052	0.2178
4	Zci_04059	0.4720
4	Zci_04095	0.4271
4	Zci_04108	0.2243
4	Zci_04120	0.2746
4	Zci_04124	0.1528
4	Zci_04148	0.2218
4	Zci_04156	0.4124
4	Zci_04158	0.4387
4	Zci_04187	0.5076
4	Zci_04198	0.5251
4	Zci_04222	0.4558
4	Zci_04242	0.3187
4	Zci_04248	0.4465
4	Zci_04260	0.3980
4	Zci_04298	0.1004
4	Zci_04301	0.2139
4	Zci_04333	0.3953
4	Zci_04386	0.4222
4	Zci_04388	0.0523
4	Zci_04406	0.1564
4	Zci_04481	0.4379
4	Zci_04538	0.4787
4	Zci_04596	0.5070
4	Zci_04626	0.3991
4	Zci_04633	0.5232
4	Zci_04634	0.5319
4	Zci_04654	0.4919
4	Zci_04685	0.5193
4	Zci_04725	0.3814
4	Zci_04763	0.4409
4	Zci_04767	0.5008
4	Zci_04771	0.4624
4	Zci_04786	0.4991
4	Zci_04792	0.2068
4	Zci_04802	0.4940
4	Zci_04827	0.5093
4	Zci_04879	0.2236
4	Zci_04925	0.5067
4	Zci_04937	0.2220
4	Zci_04950	0.4801
4	Zci_05003	0.5277
4	Zci_05017	0.3710
4	Zci_05031	0.3977
4	Zci_05089	0.4669
4	Zci_05095	0.5115
4	Zci_05144	0.4648
4	Zci_05168	0.2350
4	Zci_05170	0.3100
4	Zci_05172	0.5149
4	Zci_05177	0.4900
4	Zci_05197	0.4275
4	Zci_05255	0.5186
4	Zci_05256	0.5281
4	Zci_05271	0.2909
4	Zci_05330	0.4579
4	Zci_05337	0.5246
4	Zci_05361	0.2093
4	Zci_05438	0.4967
4	Zci_05468	0.5223
4	Zci_05486	0.1446
4	Zci_05491	0.3515
4	Zci_05522	0.2680
4	Zci_05602	0.4790
4	Zci_05630	0.4342
4	Zci_05672	0.5318
4	Zci_05680	0.4546
4	Zci_05689	0.1298
4	Zci_05728	0.2704
4	Zci_05764	0.4913
4	Zci_05826	0.3406
4	Zci_05836	0.4708
4	Zci_05859	0.2557
4	Zci_05861	0.4505
4	Zci_05870	0.5080
4	Zci_05890	0.2945
4	Zci_05907	0.4445
4	Zci_05918	0.2583
4	Zci_05949	0.4066
4	Zci_05951	0.5129
4	Zci_05980	0.5148
4	Zci_05981	0.4771
4	Zci_06013	0.3639
4	Zci_06016	0.5122
4	Zci_06026	0.1231
4	Zci_06034	0.4441
4	Zci_06053	0.5064
4	Zci_06083	0.1294
4	Zci_06089	0.4665
4	Zci_06096	0.4191
4	Zci_06116	0.5242
4	Zci_06118	0.3308
4	Zci_06182	0.4442
4	Zci_06184	0.3981
4	Zci_06199	0.3969
4	Zci_06201	0.3798
4	Zci_06233	0.4480
4	Zci_06248	0.3456
4	Zci_06261	0.1418
4	Zci_06295	0.3406
4	Zci_06299	0.4072
4	Zci_06311	0.4218
4	Zci_06319	0.3250
4	Zci_06326	0.4948
4	Zci_06379	0.3515
4	Zci_06382	0.2355
4	Zci_06390	0.2459
4	Zci_06399	0.4366
4	Zci_06400	0.5244
4	Zci_06403	0.5057
4	Zci_06409	0.4620
4	Zci_06450	0.1504
4	Zci_06493	0.5416
4	Zci_06506	0.4191
4	Zci_06507	0.4914
4	Zci_06512	0.2105
4	Zci_06526	0.5376
4	Zci_06544	0.4753
4	Zci_06564	0.5267
4	Zci_06566	0.5207
4	Zci_06579	0.5125
4	Zci_06634	0.3180
4	Zci_06645	0.0531
4	Zci_06676	0.0196
4	Zci_06727	0.4524
4	Zci_06728	0.3374
4	Zci_06741	0.2531
4	Zci_06747	0.3332
4	Zci_06751	0.2970
4	Zci_06787	0.4185
4	Zci_06817	0.3912
4	Zci_06880	0.5333
4	Zci_06920	0.4195
4	Zci_07001	0.3864
4	Zci_07017	0.4874
4	Zci_07042	0.5065
4	Zci_07062	0.4256
4	Zci_07067	0.5032
4	Zci_07076	0.5232
4	Zci_07084	0.1165
4	Zci_07129	0.4571
4	Zci_07204	0.5335
4	Zci_07209	0.3669
4	Zci_07248	0.5019
4	Zci_07279	0.5357
4	Zci_07317	0.5113
4	Zci_07326	0.0858
4	Zci_07340	0.4333
4	Zci_07414	0.5113
4	Zci_07509	0.4494
4	Zci_07577	0.1417
4	Zci_07583	0.4368
4	Zci_07604	0.5047
4	Zci_07611	0.5211
4	Zci_07646	0.5117
4	Zci_07647	0.5067
4	Zci_07679	0.4836
4	Zci_07707	0.3258
4	Zci_07708	0.4434
4	Zci_07728	0.5175
4	Zci_07737	0.4349
4	Zci_07739	0.3357
4	Zci_07745	0.4916
4	Zci_07751	0.3034
4	Zci_07755	0.3970
4	Zci_07756	0.2955
4	Zci_07757	0.4714
4	Zci_07806	0.4208
4	Zci_07847	0.5107
4	Zci_07853	0.4120
4	Zci_07862	0.5084
4	Zci_07868	0.1697
4	Zci_07924	0.5276
4	Zci_07955	0.4209
4	Zci_07958	0.5086
4	Zci_07976	0.5527
4	Zci_08011	0.4674
4	Zci_08035	0.4718
4	Zci_08108	0.3503
4	Zci_08109	0.1689
4	Zci_08120	0.3102
4	Zci_08206	0.4881
4	Zci_08235	0.5289
4	Zci_08357	0.4325
4	Zci_08394	0.2854
4	Zci_08408	0.1213
4	Zci_08456	0.3164
4	Zci_08460	0.5365
4	Zci_08489	0.4626
4	Zci_08525	0.4506
4	Zci_08543	0.3006
4	Zci_08544	0.1676
4	Zci_08591	0.4357
4	Zci_08652	0.5285
4	Zci_08771	0.4479
4	Zci_08785	0.4970
4	Zci_08879	0.3017
4	Zci_08880	0.5151
4	Zci_08927	0.3609
4	Zci_08931	0.5007
4	Zci_08935	0.4656
4	Zci_08974	0.4019
4	Zci_08999	0.3233
4	Zci_09048	0.2837
4	Zci_09057	0.2343
4	Zci_09077	0.3779
4	Zci_09082	0.4708
4	Zci_09083	0.4607
4	Zci_09088	0.5024
4	Zci_09109	0.0841
4	Zci_09242	0.3194
4	Zci_09251	0.4160
4	Zci_09282	0.3550
4	Zci_09309	0.0394
4	Zci_09312	0.4322
4	Zci_09421	0.2946
4	Zci_09422	0.5247
4	Zci_09426	0.4899
4	Zci_09493	0.3888
4	Zci_09498	0.2503
4	Zci_09504	0.2284
4	Zci_09513	0.2731
4	Zci_09602	0.4730
4	Zci_09613	0.5207
4	Zci_09626	0.4180
4	Zci_09627	0.4528
4	Zci_09644	0.5051
4	Zci_09657	0.4254
4	Zci_09667	0.5345
4	Zci_09673	0.5137
4	Zci_09678	0.4023
4	Zci_09688	0.5089
4	Zci_09697	0.2191
4	Zci_09731	0.4603
4	Zci_09753	0.5221
4	Zci_09754	0.4961
4	Zci_09887	0.5231
4	Zci_09896	0.4725
4	Zci_09916	0.3858
4	Zci_09960	0.5201
4	Zci_09970	0.5105
4	Zci_10058	0.2468
4	Zci_10063	0.4178
4	Zci_10070	0.5323
4	Zci_10085	0.2698
4	Zci_10118	0.2375
4	Zci_10189	0.3830
4	Zci_10241	0.3584
4	Zci_10242	0.4174
4	Zci_10248	0.1011
4	Zci_10289	0.5213
4	Zci_10330	0.2662
4	Zci_10379	0.4002
4	Zci_10409	0.1426
4	Zci_10412	0.4963
4	Zci_10441	0.4681
4	Zci_10476	0.4789
4	Zci_10480	0.2035
4	Zci_10504	0.4775
4	Zci_10532	0.5260
4	Zci_10558	0.3265
4	Zci_10601	0.5100
4	Zci_10607	0.5126
4	Zci_10614	0.4075
4	Zci_10724	0.4104
4	Zci_10805	0.2971
4	Zci_10819	0.4077
4	Zci_10829	0.0872
4	Zci_10836	0.4122
4	Zci_10884	0.4891
4	Zci_10889	0.5166
4	Zci_10917	0.4651
4	Zci_10922	0.4767
4	Zci_10943	0.4807
4	Zci_10951	0.4645
4	Zci_10978	0.1286
4	Zci_11013	0.5098
4	Zci_11023	0.4940
4	Zci_11024	0.5213
4	Zci_11042	0.4970
4	Zci_11061	0.5151
4	Zci_11081	0.4482
4	Zci_11082	0.4444
4	Zci_11091	0.5107
4	Zci_11207	0.5200
4	Zci_11222	0.4569
4	Zci_11294	0.5342
4	Zci_11351	0.5322
4	Zci_11370	0.5046
4	Zci_11379	0.5312
4	Zci_11398	0.4966
4	Zci_11410	0.4845
4	Zci_11426	0.2265
4	Zci_11429	0.3158
4	Zci_11453	0.2421
4	Zci_11467	0.1306
4	Zci_11470	0.4090
4	Zci_11473	0.5138
4	Zci_11474	0.4536
4	Zci_11521	0.3239
4	Zci_11572	0.5445
4	Zci_11578	0.4002
4	Zci_11593	0.4522
4	Zci_11641	0.2569
4	Zci_11660	0.4020
4	Zci_11741	0.3177
4	Zci_11743	0.0209
4	Zci_11746	0.5330
4	Zci_11747	0.5018
4	Zci_11769	0.3710
4	Zci_11825	0.5076
4	Zci_11835	0.5443
4	Zci_11837	0.2633
4	Zci_11847	0.5140
4	Zci_11857	0.5265
4	Zci_11873	0.2725
4	Zci_11881	0.0189
4	Zci_11897	0.4484
4	Zci_11909	0.5306
4	Zci_11918	0.4085
4	Zci_11933	0.4982
4	Zci_11974	0.5150
4	Zci_11980	0.4026
4	Zci_11998	0.5068
4	Zci_12016	0.4157
4	Zci_12039	0.4903
4	Zci_12043	0.1959
4	Zci_12089	0.3939
4	Zci_12095	0.4946
4	Zci_12101	0.3606
4	Zci_12104	0.3276
4	Zci_12131	0.4927
4	Zci_12137	0.4307
4	Zci_12142	0.2060
4	Zci_12156	0.4676
4	Zci_12273	0.5245
4	Zci_12319	0.3159
4	Zci_12323	0.5198
4	Zci_12365	0.5198
4	Zci_12393	0.3210
4	Zci_12442	0.1167
4	Zci_12483	0.5294
4	Zci_12515	0.4610
4	Zci_12593	0.5024
4	Zci_12612	0.5122
4	Zci_12631	0.5207
4	Zci_12714	0.4492
4	Zci_12732	0.4508
4	Zci_12760	0.1123
4	Zci_12777	0.4797
4	Zci_12847	0.4234
4	Zci_12907	0.5198
4	Zci_12963	0.0393
4	Zci_13004	0.5048
4	Zci_13010	0.4665
4	Zci_13020	0.5124
4	Zci_13042	0.2328
4	Zci_13055	0.5112
4	Zci_13103	0.5176
4	Zci_13111	0.5197
4	Zci_13123	0.3284
4	Zci_13140	0.2264
4	Zci_13159	0.3683
4	Zci_13189	0.5046
4	Zci_13201	0.4470
4	Zci_13204	0.3500
4	Zci_13220	0.4870
4	Zci_13379	0.2166
4	Zci_13394	0.4826
4	Zci_13405	0.4806
4	Zci_13408	0.3880
4	Zci_13452	0.4701
4	Zci_13471	0.3835
4	Zci_13472	0.2447
4	Zci_13503	0.5124
4	Zci_13533	0.5280
4	Zci_13604	0.4952
4	Zci_13641	0.5186
4	Zci_13708	0.5080
4	Zci_13709	0.4618
4	Zci_13782	0.2000
4	Zci_13796	0.5123
4	Zci_13810	0.5002
4	Zci_13816	0.1868
4	Zci_13883	0.5001
4	Zci_13896	0.5207
4	Zci_13955	0.2930
4	Zci_13968	0.5202
4	Zci_14056	0.4849
4	Zci_14070	0.4675
4	Zci_14112	0.5154
4	Zci_14124	0.5172
4	Zci_14136	0.5011
4	Zci_14282	0.1745
4	Zci_14335	0.5361
4	Zci_14349	0.5152
4	Zci_14419	0.4931
4	Zci_14423	0.5297
4	Zci_14476	0.4306
4	Zci_14484	0.4933
4	Zci_14485	0.4636
4	Zci_14497	0.2640
4	Zci_14509	0.5023
4	Zci_14513	0.5106
4	Zci_14518	0.5256
4	Zci_14522	0.5043
4	Zci_14531	0.4281
4	Zci_14558	0.4944
4	Zci_14600	0.5216
4	Zci_14646	0.2455
4	Zci_14656	0.4904
4	Zci_14691	0.5296
4	Zci_14709	0.4923
4	Zci_14775	0.1779
4	Zci_14825	0.3282
4	Zci_14856	0.1224
4	Zci_14886	0.4979
4	Zci_14889	0.5075
4	Zci_14891	0.1602
4	Zci_14937	0.4951
4	Zci_14977	0.4684
4	Zci_15037	0.3218
4	Zci_15039	0.5071
4	Zci_15051	0.4988
4	Zci_15078	0.3256
4	Zci_15099	0.4950
4	Zci_15169	0.4488
4	Zci_15175	0.4828
4	Zci_15178	0.5190
4	Zci_15219	0.5105
4	Zci_15253	0.4927
4	Zci_15269	0.3823
4	Zci_15276	0.2022
4	Zci_15289	0.4224
4	Zci_15294	0.4216
4	Zci_15329	0.5259
4	Zci_15330	0.4878
4	Zci_15333	0.3215
4	Zci_15334	0.4958
4	Zci_15335	0.1391
4	Zci_15338	0.4568
4	Zci_15375	0.2126
4	Zci_15381	0.4306
4	Zci_15406	0.0328
4	Zci_15417	0.3377
4	Zci_15424	0.3915
4	Zci_15566	0.4172
4	Zci_15599	0.5282
4	Zci_15617	0.4348
4	Zci_15667	0.5019
4	Zci_15697	0.1980
4	Zci_15708	0.0790
4	Zci_15787	0.2570
4	Zci_15788	0.4888
4	Zci_15795	0.3894
4	Zci_15804	0.5143
4	Zci_15838	0.4981
4	Zci_15854	0.3798
4	Zci_15859	0.5231
4	Zci_15890	0.4287
4	Zci_15923	0.5016
4	Zci_15965	0.4158
4	Zci_15968	0.3996
4	Zci_15971	0.2261
4	Zci_15974	0.4482
4	Zci_15985	0.4229
4	Zci_16264	0.3855
4	Zci_16400	0.1855
4	Zci_16406	0.4103
4	Zci_16424	0.4344
4	Zci_16538	0.3945
4	Zci_16563	0.2097
4	Zci_16578	0.2528
4	Zci_16605	0.3173
5	Zci_00024	0.4476
5	Zci_00047	0.5594
5	Zci_00053	0.4923
5	Zci_00054	0.2497
5	Zci_00172	0.4833
5	Zci_00187	0.5352
5	Zci_00196	0.5613
5	Zci_00254	0.4188
5	Zci_00289	0.4291
5	Zci_00322	0.0477
5	Zci_00333	0.5144
5	Zci_00339	0.5355
5	Zci_00374	0.5670
5	Zci_00383	0.4523
5	Zci_00495	0.5385
5	Zci_00500	0.5345
5	Zci_00546	0.5449
5	Zci_00576	0.4551
5	Zci_00586	0.4118
5	Zci_00596	0.4793
5	Zci_00645	0.2813
5	Zci_00669	0.4537
5	Zci_00671	0.4615
5	Zci_00683	0.1107
5	Zci_00688	0.2521
5	Zci_00731	0.4436
5	Zci_00734	0.4828
5	Zci_00768	0.5167
5	Zci_00780	0.4538
5	Zci_00788	0.4823
5	Zci_00842	0.5379
5	Zci_00846	0.5288
5	Zci_00871	0.5637
5	Zci_00876	0.4680
5	Zci_00887	0.1984
5	Zci_00889	0.4829
5	Zci_00944	0.4670
5	Zci_00960	0.4882
5	Zci_01007	0.4767
5	Zci_01017	0.5870
5	Zci_01025	0.4657
5	Zci_01050	0.4101
5	Zci_01052	0.5288
5	Zci_01109	0.3770
5	Zci_01160	0.4602
5	Zci_01185	0.3626
5	Zci_01194	0.2439
5	Zci_01269	0.5001
5	Zci_01320	0.5372
5	Zci_01321	0.5809
5	Zci_01324	0.4766
5	Zci_01348	0.5615
5	Zci_01366	0.4581
5	Zci_01371	0.5440
5	Zci_01382	0.4544
5	Zci_01425	0.5274
5	Zci_01442	0.5503
5	Zci_01444	0.4409
5	Zci_01455	0.4412
5	Zci_01469	0.2279
5	Zci_01471	0.4394
5	Zci_01472	0.5461
5	Zci_01481	0.2612
5	Zci_01489	0.4840
5	Zci_01497	0.5447
5	Zci_01525	0.4633
5	Zci_01548	0.5358
5	Zci_01552	0.4805
5	Zci_01569	0.2898
5	Zci_01572	0.4323
5	Zci_01604	0.3480
5	Zci_01667	0.5428
5	Zci_01693	0.5215
5	Zci_01714	0.4001
5	Zci_01722	0.4740
5	Zci_01766	0.4615
5	Zci_01787	0.3017
5	Zci_01831	0.5461
5	Zci_01843	0.5601
5	Zci_01855	0.2593
5	Zci_01889	0.4846
5	Zci_01910	0.3379
5	Zci_01926	0.4998
5	Zci_01948	0.4487
5	Zci_01964	0.5634
5	Zci_01966	0.3879
5	Zci_01971	0.5606
5	Zci_01983	0.5285
5	Zci_01989	0.5305
5	Zci_01995	0.5343
5	Zci_02039	0.5315
5	Zci_02064	0.3493
5	Zci_02102	0.5417
5	Zci_02136	0.5635
5	Zci_02151	0.3760
5	Zci_02156	0.5618
5	Zci_02183	0.5163
5	Zci_02201	0.5510
5	Zci_02214	0.3734
5	Zci_02240	0.5334
5	Zci_02259	0.5228
5	Zci_02262	0.3389
5	Zci_02263	0.5600
5	Zci_02288	0.5445
5	Zci_02343	0.5115
5	Zci_02358	0.5719
5	Zci_02359	0.4985
5	Zci_02435	0.4462
5	Zci_02437	0.4463
5	Zci_02442	0.2865
5	Zci_02460	0.5616
5	Zci_02471	0.3070
5	Zci_02488	0.5746
5	Zci_02493	0.2733
5	Zci_02563	0.5431
5	Zci_02603	0.5306
5	Zci_02607	0.3687
5	Zci_02632	0.5108
5	Zci_02638	0.5348
5	Zci_02647	0.4042
5	Zci_02800	0.5463
5	Zci_02818	0.4817
5	Zci_02839	0.5619
5	Zci_02871	0.3487
5	Zci_02873	0.3488
5	Zci_02881	0.3735
5	Zci_02885	0.4717
5	Zci_02891	0.2561
5	Zci_02903	0.4900
5	Zci_02973	0.3266
5	Zci_03030	0.4869
5	Zci_03039	0.1155
5	Zci_03041	0.5736
5	Zci_03057	0.5159
5	Zci_03062	0.4927
5	Zci_03065	0.4342
5	Zci_03113	0.5622
5	Zci_03136	0.5342
5	Zci_03146	0.5769
5	Zci_03168	0.2648
5	Zci_03181	0.4943
5	Zci_03186	0.4982
5	Zci_03220	0.5713
5	Zci_03225	0.2274
5	Zci_03234	0.4600
5	Zci_03270	0.5565
5	Zci_03288	0.5408
5	Zci_03315	0.5584
5	Zci_03321	0.5162
5	Zci_03344	0.5237
5	Zci_03354	0.5032
5	Zci_03375	0.5564
5	Zci_03412	0.4430
5	Zci_03421	0.3495
5	Zci_03459	0.4778
5	Zci_03473	0.1253
5	Zci_03480	0.5630
5	Zci_03489	0.2021
5	Zci_03494	0.4849
5	Zci_03495	0.4658
5	Zci_03523	0.5294
5	Zci_03569	0.4860
5	Zci_03572	0.5011
5	Zci_03586	0.1253
5	Zci_03619	0.3451
5	Zci_03651	0.5296
5	Zci_03664	0.4738
5	Zci_03691	0.3716
5	Zci_03711	0.2288
5	Zci_03721	0.5735
5	Zci_03733	0.2864
5	Zci_03738	0.3570
5	Zci_03757	0.5222
5	Zci_03767	0.4774
5	Zci_03774	0.5940
5	Zci_03783	0.4210
5	Zci_03790	0.4347
5	Zci_03796	0.4714
5	Zci_03820	0.5110
5	Zci_03829	0.3981
5	Zci_03849	0.4186
5	Zci_03857	0.3081
5	Zci_03939	0.4927
5	Zci_03957	0.5742
5	Zci_03980	0.5052
5	Zci_04009	0.5598
5	Zci_04017	0.4413
5	Zci_04039	0.3663
5	Zci_04042	0.4014
5	Zci_04056	0.5011
5	Zci_04090	0.4864
5	Zci_04099	0.2842
5	Zci_04173	0.5612
5	Zci_04176	0.5579
5	Zci_04178	0.5754
5	Zci_04189	0.5020
5	Zci_04224	0.2315
5	Zci_04225	0.4030
5	Zci_04226	0.4359
5	Zci_04237	0.5366
5	Zci_04241	0.1551
5	Zci_04271	0.5654
5	Zci_04279	0.4045
5	Zci_04288	0.5391
5	Zci_04308	0.5494
5	Zci_04414	0.3094
5	Zci_04415	0.5555
5	Zci_04416	0.5689
5	Zci_04433	0.5392
5	Zci_04462	0.5410
5	Zci_04480	0.5067
5	Zci_04491	0.1327
5	Zci_04496	0.4138
5	Zci_04507	0.5677
5	Zci_04521	0.4812
5	Zci_04536	0.0512
5	Zci_04600	0.5749
5	Zci_04601	0.3069
5	Zci_04615	0.2841
5	Zci_04616	0.5354
5	Zci_04617	0.4669
5	Zci_04646	0.4004
5	Zci_04672	0.4995
5	Zci_04676	0.4712
5	Zci_04690	0.5050
5	Zci_04695	0.4403
5	Zci_04701	0.5382
5	Zci_04741	0.1504
5	Zci_04746	0.4863
5	Zci_04751	0.5630
5	Zci_04761	0.3616
5	Zci_04773	0.5530
5	Zci_04788	0.2806
5	Zci_04821	0.5405
5	Zci_04822	0.5045
5	Zci_04860	0.3022
5	Zci_04904	0.4021
5	Zci_04914	0.3585
5	Zci_04931	0.5004
5	Zci_04945	0.5560
5	Zci_04969	0.1931
5	Zci_04986	0.5430
5	Zci_04993	0.2257
5	Zci_04996	0.4125
5	Zci_05059	0.5319
5	Zci_05060	0.5633
5	Zci_05093	0.5648
5	Zci_05106	0.4614
5	Zci_05119	0.5457
5	Zci_05145	0.5175
5	Zci_05148	0.5702
5	Zci_05157	0.5594
5	Zci_05160	0.5491
5	Zci_05169	0.5212
5	Zci_05180	0.5619
5	Zci_05202	0.5674
5	Zci_05231	0.5654
5	Zci_05239	0.4219
5	Zci_05245	0.5160
5	Zci_05247	0.4960
5	Zci_05252	0.4188
5	Zci_05264	0.1550
5	Zci_05272	0.3562
5	Zci_05278	0.4629
5	Zci_05311	0.5505
5	Zci_05327	0.3844
5	Zci_05331	0.5583
5	Zci_05379	0.4279
5	Zci_05425	0.4173
5	Zci_05437	0.5245
5	Zci_05467	0.4581
5	Zci_05471	0.5548
5	Zci_05477	0.4499
5	Zci_05485	0.5131
5	Zci_05516	0.5893
5	Zci_05524	0.5649
5	Zci_05546	0.5737
5	Zci_05616	0.5589
5	Zci_05660	0.4509
5	Zci_05681	0.5120
5	Zci_05724	0.4984
5	Zci_05725	0.4181
5	Zci_05754	0.4714
5	Zci_05776	0.4879
5	Zci_05790	0.0807
5	Zci_05831	0.4749
5	Zci_05832	0.4750
5	Zci_05856	0.5434
5	Zci_05857	0.5471
5	Zci_05891	0.3872
5	Zci_05925	0.5588
5	Zci_05935	0.5268
5	Zci_05953	0.5016
5	Zci_06020	0.1147
5	Zci_06023	0.4780
5	Zci_06043	0.4822
5	Zci_06048	0.3200
5	Zci_06049	0.2471
5	Zci_06051	0.5218
5	Zci_06066	0.5382
5	Zci_06105	0.2819
5	Zci_06108	0.4526
5	Zci_06113	0.4525
5	Zci_06170	0.5511
5	Zci_06172	0.5639
5	Zci_06176	0.5730
5	Zci_06177	0.5311
5	Zci_06185	0.4869
5	Zci_06191	0.2356
5	Zci_06192	0.3670
5	Zci_06206	0.5627
5	Zci_06223	0.4947
5	Zci_06226	0.3735
5	Zci_06258	0.5377
5	Zci_06293	0.5755
5	Zci_06313	0.5334
5	Zci_06318	0.2469
5	Zci_06340	0.3529
5	Zci_06344	0.5749
5	Zci_06350	0.4429
5	Zci_06351	0.4891
5	Zci_06376	0.0852
5	Zci_06377	0.5709
5	Zci_06405	0.4186
5	Zci_06414	0.5170
5	Zci_06455	0.5200
5	Zci_06458	0.2679
5	Zci_06477	0.4172
5	Zci_06520	0.5208
5	Zci_06527	0.1752
5	Zci_06548	0.4232
5	Zci_06550	0.5370
5	Zci_06582	0.4434
5	Zci_06641	0.2719
5	Zci_06652	0.4569
5	Zci_06714	0.3241
5	Zci_06764	0.5426
5	Zci_06776	0.3620
5	Zci_06792	0.2508
5	Zci_06869	0.4091
5	Zci_06878	0.5248
5	Zci_06883	0.3955
5	Zci_06885	0.5377
5	Zci_06887	0.5164
5	Zci_06913	0.4539
5	Zci_06952	0.4954
5	Zci_06970	0.5577
5	Zci_06988	0.0865
5	Zci_07018	0.3405
5	Zci_07028	0.5416
5	Zci_07065	0.5584
5	Zci_07070	0.1857
5	Zci_07085	0.5324
5	Zci_07118	0.5476
5	Zci_07164	0.4151
5	Zci_07198	0.1759
5	Zci_07215	0.5455
5	Zci_07222	0.2958
5	Zci_07224	0.3654
5	Zci_07251	0.5771
5	Zci_07252	0.4985
5	Zci_07260	0.4406
5	Zci_07276	0.5774
5	Zci_07291	0.4748
5	Zci_07298	0.2258
5	Zci_07307	0.5130
5	Zci_07355	0.5399
5	Zci_07367	0.5282
5	Zci_07384	0.2754
5	Zci_07388	0.4893
5	Zci_07391	0.5666
5	Zci_07433	0.4164
5	Zci_07467	0.5376
5	Zci_07496	0.4366
5	Zci_07536	0.3543
5	Zci_07558	0.4965
5	Zci_07574	0.5650
5	Zci_07585	0.4289
5	Zci_07587	0.4228
5	Zci_07619	0.4585
5	Zci_07622	0.4661
5	Zci_07669	0.2124
5	Zci_07711	0.4589
5	Zci_07715	0.5696
5	Zci_07724	0.5458
5	Zci_07727	0.5505
5	Zci_07733	0.1332
5	Zci_07749	0.5762
5	Zci_07767	0.3284
5	Zci_07830	0.5547
5	Zci_07836	0.4553
5	Zci_07837	0.5444
5	Zci_07848	0.2516
5	Zci_07867	0.3647
5	Zci_07908	0.2904
5	Zci_07918	0.5670
5	Zci_07929	0.4512
5	Zci_07970	0.2633
5	Zci_08007	0.5129
5	Zci_08055	0.1367
5	Zci_08075	0.1943
5	Zci_08145	0.4803
5	Zci_08149	0.5007
5	Zci_08178	0.5234
5	Zci_08222	0.5206
5	Zci_08223	0.4295
5	Zci_08229	0.2318
5	Zci_08232	0.2473
5	Zci_08239	0.3857
5	Zci_08256	0.5815
5	Zci_08317	0.1503
5	Zci_08358	0.3543
5	Zci_08366	0.3936
5	Zci_08388	0.3033
5	Zci_08390	0.4105
5	Zci_08409	0.5561
5	Zci_08413	0.5224
5	Zci_08463	0.5370
5	Zci_08518	0.5410
5	Zci_08538	0.5458
5	Zci_08555	0.5321
5	Zci_08565	0.3802
5	Zci_08585	0.4491
5	Zci_08659	0.4980
5	Zci_08681	0.4386
5	Zci_08682	0.3114
5	Zci_08742	0.4873
5	Zci_08770	0.5734
5	Zci_08807	0.4671
5	Zci_08808	0.5509
5	Zci_08824	0.4437
5	Zci_08844	0.2697
5	Zci_08872	0.2526
5	Zci_08885	0.5575
5	Zci_08911	0.4685
5	Zci_08912	0.3239
5	Zci_08918	0.3342
5	Zci_08993	0.5614
5	Zci_09105	0.5433
5	Zci_09121	0.4109
5	Zci_09127	0.5645
5	Zci_09130	0.5155
5	Zci_09131	0.5697
5	Zci_09149	0.1002
5	Zci_09175	0.4450
5	Zci_09178	0.5379
5	Zci_09180	0.3083
5	Zci_09196	0.4056
5	Zci_09203	0.1965
5	Zci_09205	0.5359
5	Zci_09221	0.4543
5	Zci_09255	0.1743
5	Zci_09279	0.2696
5	Zci_09318	0.4480
5	Zci_09327	0.4738
5	Zci_09359	0.5289
5	Zci_09412	0.5561
5	Zci_09432	0.5544
5	Zci_09471	0.5486
5	Zci_09473	0.5605
5	Zci_09514	0.5691
5	Zci_09519	0.1761
5	Zci_09532	0.3186
5	Zci_09614	0.5029
5	Zci_09621	0.4886
5	Zci_09671	0.4811
5	Zci_09685	0.4904
5	Zci_09704	0.4850
5	Zci_09728	0.3649
5	Zci_09738	0.3270
5	Zci_09749	0.5475
5	Zci_09772	0.4841
5	Zci_09820	0.2838
5	Zci_09832	0.3990
5	Zci_09904	0.3984
5	Zci_09987	0.3086
5	Zci_10020	0.3475
5	Zci_10062	0.5628
5	Zci_10192	0.5317
5	Zci_10211	0.5516
5	Zci_10240	0.5667
5	Zci_10278	0.5172
5	Zci_10287	0.5503
5	Zci_10290	0.5548
5	Zci_10362	0.5585
5	Zci_10363	0.4267
5	Zci_10393	0.5562
5	Zci_10399	0.2094
5	Zci_10421	0.2519
5	Zci_10428	0.5091
5	Zci_10438	0.3953
5	Zci_10447	0.5633
5	Zci_10458	0.3444
5	Zci_10484	0.5626
5	Zci_10501	0.4078
5	Zci_10517	0.5242
5	Zci_10555	0.5119
5	Zci_10571	0.4182
5	Zci_10695	0.4972
5	Zci_10723	0.3511
5	Zci_10752	0.4042
5	Zci_10763	0.5432
5	Zci_10779	0.5814
5	Zci_10795	0.5084
5	Zci_10808	0.5822
5	Zci_10835	0.5035
5	Zci_10839	0.5626
5	Zci_10911	0.4986
5	Zci_10913	0.3395
5	Zci_10930	0.5074
5	Zci_10933	0.5017
5	Zci_10953	0.5666
5	Zci_10968	0.4146
5	Zci_10972	0.4424
5	Zci_10989	0.4743
5	Zci_10996	0.4701
5	Zci_10997	0.5001
5	Zci_11012	0.4651
5	Zci_11059	0.5361
5	Zci_11072	0.3046
5	Zci_11105	0.2727
5	Zci_11110	0.4364
5	Zci_11114	0.4852
5	Zci_11123	0.4410
5	Zci_11138	0.4868
5	Zci_11154	0.2094
5	Zci_11157	0.2237
5	Zci_11160	0.4972
5	Zci_11174	0.5280
5	Zci_11187	0.5055
5	Zci_11212	0.5264
5	Zci_11216	0.5162
5	Zci_11226	0.5219
5	Zci_11239	0.3914
5	Zci_11256	0.0990
5	Zci_11349	0.3431
5	Zci_11356	0.0902
5	Zci_11368	0.5536
5	Zci_11487	0.4737
5	Zci_11496	0.4599
5	Zci_11498	0.1835
5	Zci_11512	0.1845
5	Zci_11530	0.5216
5	Zci_11532	0.3475
5	Zci_11534	0.5109
5	Zci_11536	0.4691
5	Zci_11538	0.5562
5	Zci_11547	0.5710
5	Zci_11548	0.5703
5	Zci_11576	0.5459
5	Zci_11585	0.1771
5	Zci_11586	0.5162
5	Zci_11614	0.0918
5	Zci_11637	0.2596
5	Zci_11704	0.4742
5	Zci_11716	0.4254
5	Zci_11748	0.3881
5	Zci_11827	0.4508
5	Zci_11862	0.5025
5	Zci_11889	0.5400
5	Zci_11968	0.5400
5	Zci_11990	0.3925
5	Zci_12009	0.4699
5	Zci_12038	0.3075
5	Zci_12094	0.5207
5	Zci_12112	0.4779
5	Zci_12116	0.4951
5	Zci_12165	0.4413
5	Zci_12182	0.4214
5	Zci_12193	0.4698
5	Zci_12196	0.5510
5	Zci_12214	0.2494
5	Zci_12224	0.4376
5	Zci_12244	0.5796
5	Zci_12289	0.5364
5	Zci_12307	0.2209
5	Zci_12374	0.4008
5	Zci_12410	0.5573
5	Zci_12470	0.3754
5	Zci_12473	0.5532
5	Zci_12475	0.5558
5	Zci_12495	0.4982
5	Zci_12533	0.5310
5	Zci_12549	0.4831
5	Zci_12551	0.2867
5	Zci_12581	0.0758
5	Zci_12613	0.4461
5	Zci_12729	0.4848
5	Zci_12780	0.1002
5	Zci_12789	0.5065
5	Zci_12798	0.5160
5	Zci_12835	0.5566
5	Zci_12889	0.1877
5	Zci_12915	0.1639
5	Zci_12916	0.5154
5	Zci_12923	0.4978
5	Zci_12951	0.2822
5	Zci_12955	0.5536
5	Zci_12961	0.5027
5	Zci_12980	0.5073
5	Zci_13046	0.4785
5	Zci_13049	0.4365
5	Zci_13127	0.5506
5	Zci_13130	0.5042
5	Zci_13177	0.4574
5	Zci_13197	0.2092
5	Zci_13211	0.4127
5	Zci_13224	0.5591
5	Zci_13249	0.5255
5	Zci_13252	0.5796
5	Zci_13308	0.3665
5	Zci_13320	0.4522
5	Zci_13323	0.5631
5	Zci_13327	0.3088
5	Zci_13353	0.5431
5	Zci_13368	0.5092
5	Zci_13370	0.5643
5	Zci_13398	0.3861
5	Zci_13440	0.5335
5	Zci_13445	0.5199
5	Zci_13446	0.5282
5	Zci_13464	0.4601
5	Zci_13476	0.4870
5	Zci_13484	0.4757
5	Zci_13486	0.4913
5	Zci_13494	0.4205
5	Zci_13507	0.5019
5	Zci_13586	0.5486
5	Zci_13598	0.4345
5	Zci_13632	0.5516
5	Zci_13653	0.4355
5	Zci_13664	0.2600
5	Zci_13671	0.5220
5	Zci_13683	0.5746
5	Zci_13692	0.5358
5	Zci_13696	0.5314
5	Zci_13725	0.4769
5	Zci_13748	0.5055
5	Zci_13764	0.5105
5	Zci_13781	0.5473
5	Zci_13838	0.3654
5	Zci_13850	0.1593
5	Zci_13853	0.4644
5	Zci_13856	0.4462
5	Zci_13858	0.4988
5	Zci_13868	0.5026
5	Zci_13903	0.5671
5	Zci_13919	0.4017
5	Zci_13937	0.4970
5	Zci_13954	0.1928
5	Zci_13971	0.4850
5	Zci_13973	0.1798
5	Zci_14015	0.4701
5	Zci_14048	0.5656
5	Zci_14061	0.5398
5	Zci_14065	0.4294
5	Zci_14066	0.5376
5	Zci_14083	0.5476
5	Zci_14107	0.5059
5	Zci_14138	0.5352
5	Zci_14168	0.4724
5	Zci_14176	0.3585
5	Zci_14322	0.4016
5	Zci_14346	0.0560
5	Zci_14390	0.3120
5	Zci_14396	0.2201
5	Zci_14457	0.4703
5	Zci_14460	0.2583
5	Zci_14580	0.4137
5	Zci_14589	0.2038
5	Zci_14596	0.4988
5	Zci_14613	0.2030
5	Zci_14657	0.3977
5	Zci_14660	0.5447
5	Zci_14661	0.5317
5	Zci_14705	0.5383
5	Zci_14717	0.5746
5	Zci_14730	0.5266
5	Zci_14735	0.5792
5	Zci_14739	0.4744
5	Zci_14762	0.0350
5	Zci_14776	0.4149
5	Zci_14796	0.5635
5	Zci_14808	0.4895
5	Zci_14826	0.5465
5	Zci_14846	0.4571
5	Zci_14874	0.2711
5	Zci_14876	0.4321
5	Zci_14888	0.5431
5	Zci_14890	0.1707
5	Zci_14980	0.3469
5	Zci_14982	0.4308
5	Zci_15006	0.5096
5	Zci_15152	0.5664
5	Zci_15240	0.3390
5	Zci_15250	0.4424
5	Zci_15264	0.5687
5	Zci_15272	0.4947
5	Zci_15277	0.5520
5	Zci_15285	0.2104
5	Zci_15301	0.5578
5	Zci_15304	0.4287
5	Zci_15305	0.5463
5	Zci_15315	0.4201
5	Zci_15332	0.5453
5	Zci_15357	0.1244
5	Zci_15377	0.2115
5	Zci_15379	0.4996
5	Zci_15386	0.3454
5	Zci_15394	0.5083
5	Zci_15436	0.5524
5	Zci_15445	0.5758
5	Zci_15491	0.4411
5	Zci_15508	0.4853
5	Zci_15564	0.5202
5	Zci_15619	0.5608
5	Zci_15633	0.5760
5	Zci_15645	0.5416
5	Zci_15656	0.5183
5	Zci_15737	0.5274
5	Zci_15778	0.3247
5	Zci_15782	0.3974
5	Zci_15802	0.4715
5	Zci_15880	0.5596
5	Zci_15926	0.5640
5	Zci_15977	0.2852
5	Zci_15979	0.4683
5	Zci_16272	0.4184
5	Zci_16360	0.3098
5	Zci_16425	0.5000
5	Zci_16532	0.5738
5	Zci_16587	0.4986
6	Zci_00059	0.6623
6	Zci_00260	0.5776
6	Zci_00321	0.6500
6	Zci_00368	0.6403
6	Zci_00403	0.4618
6	Zci_00422	0.6068
6	Zci_00502	0.4162
6	Zci_00668	0.4925
6	Zci_00705	0.5085
6	Zci_00732	0.6150
6	Zci_00792	0.6490
6	Zci_00946	0.4542
6	Zci_01192	0.2779
6	Zci_01326	0.6331
6	Zci_01485	0.5682
6	Zci_01518	0.4529
6	Zci_01531	0.5801
6	Zci_01554	0.5907
6	Zci_01573	0.4464
6	Zci_01636	0.3358
6	Zci_01645	0.6319
6	Zci_01861	0.5981
6	Zci_01981	0.3771
6	Zci_02011	0.6372
6	Zci_02017	0.6171
6	Zci_02046	0.5794
6	Zci_02077	0.6492
6	Zci_02078	0.6244
6	Zci_02114	0.6533
6	Zci_02194	0.3803
6	Zci_02195	0.6564
6	Zci_02339	0.5932
6	Zci_02355	0.6215
6	Zci_02815	0.6113
6	Zci_02858	0.5663
6	Zci_02978	0.5835
6	Zci_03040	0.5738
6	Zci_03064	0.6014
6	Zci_03174	0.6323
6	Zci_03191	0.4965
6	Zci_03207	0.5889
6	Zci_03287	0.6439
6	Zci_03410	0.5915
6	Zci_03474	0.3963
6	Zci_03616	0.5222
6	Zci_03652	0.6556
6	Zci_03760	0.5793
6	Zci_03827	0.4019
6	Zci_03874	0.4955
6	Zci_03903	0.6257
6	Zci_04076	0.5154
6	Zci_04177	0.5908
6	Zci_04240	0.5806
6	Zci_04257	0.6455
6	Zci_04294	0.5927
6	Zci_04375	0.5982
6	Zci_04387	0.3292
6	Zci_04401	0.5670
6	Zci_04485	0.6417
6	Zci_04490	0.6197
6	Zci_04502	0.5212
6	Zci_04539	0.5675
6	Zci_04610	0.5246
6	Zci_04869	0.6219
6	Zci_04988	0.5568
6	Zci_05011	0.5372
6	Zci_05029	0.5694
6	Zci_05048	0.3879
6	Zci_05063	0.5120
6	Zci_05086	0.4917
6	Zci_05098	0.6223
6	Zci_05158	0.3975
6	Zci_05161	0.5805
6	Zci_05260	0.6307
6	Zci_05290	0.3367
6	Zci_05572	0.5413
6	Zci_05574	0.4385
6	Zci_05615	0.4665
6	Zci_05696	0.6247
6	Zci_05855	0.5320
6	Zci_05936	0.5945
6	Zci_05960	0.4415
6	Zci_05966	0.6304
6	Zci_05967	0.5739
6	Zci_05968	0.5026
6	Zci_05974	0.4432
6	Zci_05983	0.5194
6	Zci_06035	0.5998
6	Zci_06076	0.6002
6	Zci_06077	0.5049
6	Zci_06106	0.3798
6	Zci_06174	0.3444
6	Zci_06219	0.6380
6	Zci_06285	0.5798
6	Zci_06361	0.6445
6	Zci_06440	0.5205
6	Zci_06457	0.5163
6	Zci_06666	0.5866
6	Zci_06672	0.5514
6	Zci_06786	0.6029
6	Zci_06918	0.4685
6	Zci_06978	0.4821
6	Zci_07014	0.6405
6	Zci_07020	0.5473
6	Zci_07025	0.6203
6	Zci_07046	0.6158
6	Zci_07052	0.5107
6	Zci_07110	0.3392
6	Zci_07187	0.6543
6	Zci_07254	0.6585
6	Zci_07278	0.5414
6	Zci_07348	0.6275
6	Zci_07376	0.5274
6	Zci_07635	0.5682
6	Zci_07668	0.6277
6	Zci_07775	0.6310
6	Zci_07827	0.5028
6	Zci_07843	0.6412
6	Zci_07865	0.5983
6	Zci_07915	0.5840
6	Zci_07978	0.6015
6	Zci_08051	0.5987
6	Zci_08166	0.6394
6	Zci_08303	0.6088
6	Zci_08331	0.6493
6	Zci_08451	0.4689
6	Zci_08643	0.6228
6	Zci_08660	0.4307
6	Zci_08759	0.4619
6	Zci_08890	0.4366
6	Zci_09087	0.5142
6	Zci_09193	0.3521
6	Zci_09315	0.5796
6	Zci_09344	0.4896
6	Zci_09351	0.6124
6	Zci_09654	0.5569
6	Zci_09703	0.5960
6	Zci_09868	0.5258
6	Zci_09937	0.6313
6	Zci_09969	0.4398
6	Zci_09986	0.6462
6	Zci_09999	0.5028
6	Zci_10048	0.5840
6	Zci_10077	0.3726
6	Zci_10128	0.5330
6	Zci_10139	0.6288
6	Zci_10212	0.4861
6	Zci_10308	0.6626
6	Zci_10342	0.6028
6	Zci_10361	0.6317
6	Zci_10387	0.3740
6	Zci_10392	0.6328
6	Zci_10535	0.6351
6	Zci_10543	0.5761
6	Zci_10617	0.3490
6	Zci_10622	0.5325
6	Zci_10666	0.6252
6	Zci_10949	0.5418
6	Zci_11040	0.6091
6	Zci_11051	0.6188
6	Zci_11118	0.5061
6	Zci_11134	0.5879
6	Zci_11163	0.4167
6	Zci_11364	0.5171
6	Zci_11397	0.5290
6	Zci_11535	0.4945
6	Zci_11539	0.6172
6	Zci_11581	0.6259
6	Zci_11602	0.5998
6	Zci_11651	0.6136
6	Zci_11728	0.4576
6	Zci_11757	0.4933
6	Zci_11800	0.6188
6	Zci_11901	0.3804
6	Zci_11919	0.3445
6	Zci_12097	0.5440
6	Zci_12132	0.6162
6	Zci_12353	0.5754
6	Zci_12358	0.5985
6	Zci_12439	0.4687
6	Zci_12465	0.5385
6	Zci_12580	0.6031
6	Zci_12632	0.2955
6	Zci_12949	0.4633
6	Zci_13028	0.5831
6	Zci_13029	0.6439
6	Zci_13078	0.5992
6	Zci_13192	0.5557
6	Zci_13337	0.6530
6	Zci_13355	0.3505
6	Zci_13540	0.4860
6	Zci_13611	0.5625
6	Zci_13680	0.5882
6	Zci_13812	0.6238
6	Zci_13912	0.5605
6	Zci_14291	0.4826
6	Zci_14334	0.5613
6	Zci_14391	0.4928
6	Zci_14443	0.5318
6	Zci_14479	0.5818
6	Zci_14544	0.6491
6	Zci_14562	0.5994
6	Zci_14573	0.2664
6	Zci_14575	0.6060
6	Zci_14617	0.3399
6	Zci_14746	0.6160
6	Zci_14885	0.5798
6	Zci_14898	0.4448
6	Zci_14932	0.5781
6	Zci_15002	0.6261
6	Zci_15024	0.3228
6	Zci_15241	0.5630
6	Zci_15256	0.6077
6	Zci_15594	0.5153
6	Zci_15598	0.5535
6	Zci_15601	0.5285
6	Zci_15658	0.4018
6	Zci_15680	0.6185
6	Zci_15849	0.4604
6	Zci_15852	0.5788
6	Zci_15853	0.5912
6	Zci_15856	0.5976
6	Zci_16415	0.5026
6	Zci_16567	0.5744
6	Zci_16615	0.5489
6	Zci_16617	0.6299
7	Zci_00040	0.5461
7	Zci_00057	0.2597
7	Zci_00086	0.3694
7	Zci_00159	0.2807
7	Zci_00162	0.6491
7	Zci_00180	0.6332
7	Zci_00183	0.6579
7	Zci_00217	0.5116
7	Zci_00223	0.6088
7	Zci_00275	0.5416
7	Zci_00288	0.3271
7	Zci_00303	0.5864
7	Zci_00348	0.6418
7	Zci_00353	0.2919
7	Zci_00361	0.2808
7	Zci_00369	0.2522
7	Zci_00373	0.4929
7	Zci_00400	0.5579
7	Zci_00402	0.4872
7	Zci_00421	0.6007
7	Zci_00484	0.1454
7	Zci_00490	0.6364
7	Zci_00558	0.5725
7	Zci_00579	0.6187
7	Zci_00582	0.2436
7	Zci_00590	0.6559
7	Zci_00598	0.5234
7	Zci_00678	0.6598
7	Zci_00723	0.5525
7	Zci_00786	0.4009
7	Zci_00801	0.4568
7	Zci_00833	0.6132
7	Zci_00862	0.6542
7	Zci_00879	0.2555
7	Zci_00880	0.4850
7	Zci_00896	0.5455
7	Zci_00905	0.3909
7	Zci_00907	0.6164
7	Zci_00918	0.3454
7	Zci_00947	0.4404
7	Zci_00991	0.5801
7	Zci_01044	0.6094
7	Zci_01129	0.5163
7	Zci_01201	0.4858
7	Zci_01216	0.4213
7	Zci_01267	0.3627
7	Zci_01353	0.4858
7	Zci_01354	0.5981
7	Zci_01386	0.5566
7	Zci_01419	0.5829
7	Zci_01429	0.2936
7	Zci_01492	0.6565
7	Zci_01575	0.2491
7	Zci_01623	0.6407
7	Zci_01685	0.6475
7	Zci_01750	0.4773
7	Zci_01757	0.4461
7	Zci_01765	0.5363
7	Zci_01769	0.6178
7	Zci_01818	0.4506
7	Zci_01834	0.6038
7	Zci_01840	0.2953
7	Zci_01877	0.3478
7	Zci_01973	0.5984
7	Zci_01977	0.5862
7	Zci_02009	0.4971
7	Zci_02014	0.1268
7	Zci_02032	0.6202
7	Zci_02063	0.4419
7	Zci_02069	0.3036
7	Zci_02100	0.5572
7	Zci_02101	0.4806
7	Zci_02115	0.4409
7	Zci_02159	0.6230
7	Zci_02162	0.5436
7	Zci_02218	0.3873
7	Zci_02220	0.5284
7	Zci_02226	0.4327
7	Zci_02245	0.6258
7	Zci_02249	0.5859
7	Zci_02285	0.6275
7	Zci_02314	0.5028
7	Zci_02338	0.2462
7	Zci_02362	0.5458
7	Zci_02367	0.5907
7	Zci_02428	0.6114
7	Zci_02468	0.4867
7	Zci_02509	0.4056
7	Zci_02516	0.6252
7	Zci_02525	0.3347
7	Zci_02595	0.5976
7	Zci_02605	0.5828
7	Zci_02622	0.5323
7	Zci_02674	0.3832
7	Zci_02679	0.5903
7	Zci_02683	0.4658
7	Zci_02688	0.6190
7	Zci_02770	0.5641
7	Zci_02771	0.6407
7	Zci_02801	0.5827
7	Zci_02829	0.4375
7	Zci_02841	0.6023
7	Zci_02875	0.2301
7	Zci_02893	0.4170
7	Zci_02894	0.6408
7	Zci_02911	0.1875
7	Zci_02912	0.6638
7	Zci_02935	0.5319
7	Zci_02951	0.5017
7	Zci_02959	0.5999
7	Zci_02962	0.5155
7	Zci_02982	0.3094
7	Zci_03011	0.2920
7	Zci_03016	0.4986
7	Zci_03029	0.6533
7	Zci_03035	0.4815
7	Zci_03043	0.6659
7	Zci_03044	0.6333
7	Zci_03045	0.6064
7	Zci_03054	0.4504
7	Zci_03063	0.6494
7	Zci_03129	0.4220
7	Zci_03145	0.5820
7	Zci_03165	0.4704
7	Zci_03192	0.6505
7	Zci_03298	0.6534
7	Zci_03318	0.4518
7	Zci_03356	0.4568
7	Zci_03396	0.4139
7	Zci_03422	0.5001
7	Zci_03433	0.3119
7	Zci_03487	0.6112
7	Zci_03517	0.5847
7	Zci_03578	0.6117
7	Zci_03588	0.6398
7	Zci_03596	0.5114
7	Zci_03653	0.6552
7	Zci_03708	0.4927
7	Zci_03715	0.6395
7	Zci_03764	0.6273
7	Zci_03833	0.5663
7	Zci_03870	0.3551
7	Zci_03906	0.2192
7	Zci_03911	0.4909
7	Zci_03913	0.1821
7	Zci_03959	0.3951
7	Zci_03969	0.3418
7	Zci_03976	0.6085
7	Zci_03982	0.6467
7	Zci_04024	0.4854
7	Zci_04064	0.2190
7	Zci_04150	0.2405
7	Zci_04166	0.2858
7	Zci_04184	0.4263
7	Zci_04193	0.6272
7	Zci_04291	0.4836
7	Zci_04292	0.4583
7	Zci_04296	0.5008
7	Zci_04311	0.6121
7	Zci_04313	0.3063
7	Zci_04319	0.4279
7	Zci_04321	0.3183
7	Zci_04324	0.3764
7	Zci_04327	0.2985
7	Zci_04341	0.5555
7	Zci_04345	0.4867
7	Zci_04356	0.5513
7	Zci_04368	0.3204
7	Zci_04382	0.5217
7	Zci_04397	0.6565
7	Zci_04398	0.6101
7	Zci_04402	0.6086
7	Zci_04436	0.4811
7	Zci_04486	0.3844
7	Zci_04511	0.5515
7	Zci_04589	0.5707
7	Zci_04639	0.6154
7	Zci_04699	0.6276
7	Zci_04700	0.5683
7	Zci_04762	0.6475
7	Zci_04770	0.6133
7	Zci_04776	0.4846
7	Zci_04820	0.6047
7	Zci_04846	0.4411
7	Zci_04876	0.2729
7	Zci_04880	0.6339
7	Zci_04916	0.5898
7	Zci_04936	0.5701
7	Zci_04967	0.6144
7	Zci_04995	0.6413
7	Zci_04999	0.6668
7	Zci_05013	0.6480
7	Zci_05028	0.6475
7	Zci_05054	0.2295
7	Zci_05069	0.6459
7	Zci_05079	0.5829
7	Zci_05108	0.6185
7	Zci_05155	0.2662
7	Zci_05186	0.4263
7	Zci_05221	0.5224
7	Zci_05259	0.6616
7	Zci_05286	0.2735
7	Zci_05317	0.5528
7	Zci_05364	0.6663
7	Zci_05384	0.4358
7	Zci_05395	0.5234
7	Zci_05419	0.6433
7	Zci_05501	0.6120
7	Zci_05502	0.6355
7	Zci_05525	0.4982
7	Zci_05534	0.5502
7	Zci_05580	0.3902
7	Zci_05617	0.4527
7	Zci_05662	0.4982
7	Zci_05663	0.5876
7	Zci_05685	0.5564
7	Zci_05701	0.4606
7	Zci_05737	0.5987
7	Zci_05741	0.5057
7	Zci_05742	0.6461
7	Zci_05848	0.5887
7	Zci_05916	0.3064
7	Zci_05917	0.5376
7	Zci_05919	0.6384
7	Zci_05952	0.4163
7	Zci_05982	0.5966
7	Zci_05995	0.6022
7	Zci_06004	0.5979
7	Zci_06046	0.6498
7	Zci_06062	0.6242
7	Zci_06081	0.5228
7	Zci_06085	0.6440
7	Zci_06088	0.6025
7	Zci_06114	0.5473
7	Zci_06282	0.5648
7	Zci_06303	0.4754
7	Zci_06349	0.6208
7	Zci_06363	0.6417
7	Zci_06391	0.5167
7	Zci_06412	0.3335
7	Zci_06522	0.4819
7	Zci_06523	0.6541
7	Zci_06555	0.3140
7	Zci_06593	0.6025
7	Zci_06718	0.5480
7	Zci_06730	0.6096
7	Zci_06733	0.4906
7	Zci_06812	0.4950
7	Zci_06827	0.6500
7	Zci_06846	0.6032
7	Zci_06850	0.6413
7	Zci_06854	0.4668
7	Zci_06876	0.6470
7	Zci_06877	0.4382
7	Zci_06906	0.2603
7	Zci_06907	0.6501
7	Zci_06925	0.6316
7	Zci_06983	0.5963
7	Zci_07019	0.2772
7	Zci_07026	0.6374
7	Zci_07030	0.6184
7	Zci_07061	0.5434
7	Zci_07073	0.4773
7	Zci_07169	0.2217
7	Zci_07185	0.5461
7	Zci_07192	0.3447
7	Zci_07227	0.6181
7	Zci_07255	0.5324
7	Zci_07262	0.5744
7	Zci_07286	0.5895
7	Zci_07315	0.6228
7	Zci_07318	0.3951
7	Zci_07354	0.3888
7	Zci_07386	0.6645
7	Zci_07387	0.5880
7	Zci_07392	0.6676
7	Zci_07432	0.5914
7	Zci_07446	0.5265
7	Zci_07447	0.5161
7	Zci_07479	0.6330
7	Zci_07546	0.4664
7	Zci_07556	0.4813
7	Zci_07560	0.4105
7	Zci_07566	0.3914
7	Zci_07702	0.6343
7	Zci_07758	0.3561
7	Zci_07763	0.2815
7	Zci_07813	0.4946
7	Zci_07857	0.4196
7	Zci_07964	0.6243
7	Zci_07988	0.2804
7	Zci_08000	0.2409
7	Zci_08002	0.5614
7	Zci_08017	0.3486
7	Zci_08029	0.3453
7	Zci_08041	0.4369
7	Zci_08042	0.2826
7	Zci_08054	0.6367
7	Zci_08070	0.5866
7	Zci_08076	0.5251
7	Zci_08091	0.4058
7	Zci_08098	0.3922
7	Zci_08104	0.4386
7	Zci_08130	0.5673
7	Zci_08137	0.6387
7	Zci_08143	0.5782
7	Zci_08144	0.5956
7	Zci_08150	0.6293
7	Zci_08243	0.5839
7	Zci_08270	0.6509
7	Zci_08282	0.6555
7	Zci_08283	0.3085
7	Zci_08293	0.6667
7	Zci_08315	0.6265
7	Zci_08319	0.5960
7	Zci_08355	0.5976
7	Zci_08375	0.4821
7	Zci_08402	0.2896
7	Zci_08406	0.3831
7	Zci_08450	0.5841
7	Zci_08533	0.6067
7	Zci_08546	0.3173
7	Zci_08549	0.6539
7	Zci_08629	0.6045
7	Zci_08630	0.5864
7	Zci_08662	0.6101
7	Zci_08663	0.6417
7	Zci_08692	0.6425
7	Zci_08697	0.6199
7	Zci_08744	0.6550
7	Zci_08761	0.4748
7	Zci_08767	0.3340
7	Zci_08768	0.4202
7	Zci_08791	0.4328
7	Zci_08812	0.3721
7	Zci_08835	0.3223
7	Zci_08867	0.6652
7	Zci_08869	0.6410
7	Zci_08922	0.5319
7	Zci_08925	0.5885
7	Zci_08988	0.6319
7	Zci_08995	0.5256
7	Zci_08996	0.5639
7	Zci_09047	0.4507
7	Zci_09049	0.3703
7	Zci_09100	0.5745
7	Zci_09120	0.5734
7	Zci_09158	0.6569
7	Zci_09226	0.6082
7	Zci_09269	0.3340
7	Zci_09319	0.4312
7	Zci_09395	0.5872
7	Zci_09403	0.4448
7	Zci_09408	0.5820
7	Zci_09413	0.6553
7	Zci_09414	0.6484
7	Zci_09424	0.3405
7	Zci_09425	0.3782
7	Zci_09447	0.6564
7	Zci_09451	0.3394
7	Zci_09490	0.5720
7	Zci_09510	0.5150
7	Zci_09535	0.6394
7	Zci_09547	0.5656
7	Zci_09662	0.4963
7	Zci_09706	0.5771
7	Zci_09719	0.4879
7	Zci_09756	0.5311
7	Zci_09775	0.5848
7	Zci_09783	0.6078
7	Zci_09787	0.4022
7	Zci_09789	0.5319
7	Zci_09800	0.6572
7	Zci_09838	0.5663
7	Zci_09854	0.3420
7	Zci_09865	0.6536
7	Zci_09870	0.6237
7	Zci_09878	0.5488
7	Zci_09973	0.4561
7	Zci_09982	0.6635
7	Zci_09984	0.4452
7	Zci_09998	0.4969
7	Zci_10009	0.5106
7	Zci_10090	0.5158
7	Zci_10094	0.3571
7	Zci_10141	0.5880
7	Zci_10146	0.5213
7	Zci_10181	0.6040
7	Zci_10203	0.6307
7	Zci_10208	0.6199
7	Zci_10292	0.5005
7	Zci_10306	0.5593
7	Zci_10326	0.2568
7	Zci_10333	0.6458
7	Zci_10336	0.5605
7	Zci_10426	0.6515
7	Zci_10429	0.3934
7	Zci_10430	0.4352
7	Zci_10453	0.5509
7	Zci_10454	0.6066
7	Zci_10462	0.4602
7	Zci_10499	0.5855
7	Zci_10513	0.6003
7	Zci_10538	0.3634
7	Zci_10550	0.6243
7	Zci_10593	0.3922
7	Zci_10636	0.6436
7	Zci_10644	0.4355
7	Zci_10682	0.3086
7	Zci_10742	0.6099
7	Zci_10764	0.6289
7	Zci_10767	0.6339
7	Zci_10841	0.4508
7	Zci_10842	0.3459
7	Zci_10856	0.5917
7	Zci_10877	0.5006
7	Zci_10898	0.4641
7	Zci_10910	0.6554
7	Zci_10926	0.1503
7	Zci_10934	0.6274
7	Zci_10944	0.4543
7	Zci_10946	0.3736
7	Zci_10969	0.3333
7	Zci_10971	0.4219
7	Zci_11113	0.4320
7	Zci_11120	0.5977
7	Zci_11125	0.6178
7	Zci_11137	0.3697
7	Zci_11149	0.6146
7	Zci_11152	0.5309
7	Zci_11175	0.4743
7	Zci_11182	0.6087
7	Zci_11206	0.4967
7	Zci_11273	0.4051
7	Zci_11292	0.4595
7	Zci_11293	0.6602
7	Zci_11319	0.4025
7	Zci_11362	0.4748
7	Zci_11381	0.4674
7	Zci_11394	0.6330
7	Zci_11427	0.6387
7	Zci_11437	0.5780
7	Zci_11451	0.3247
7	Zci_11468	0.2825
7	Zci_11481	0.6181
7	Zci_11486	0.6325
7	Zci_11497	0.6493
7	Zci_11520	0.6523
7	Zci_11554	0.4780
7	Zci_11666	0.5239
7	Zci_11706	0.6363
7	Zci_11783	0.6506
7	Zci_11789	0.6182
7	Zci_11798	0.5838
7	Zci_11838	0.6602
7	Zci_11842	0.3594
7	Zci_11852	0.6013
7	Zci_11900	0.3404
7	Zci_11967	0.3153
7	Zci_11996	0.5876
7	Zci_11997	0.5275
7	Zci_12002	0.5779
7	Zci_12003	0.5739
7	Zci_12005	0.6461
7	Zci_12011	0.5699
7	Zci_12064	0.6031
7	Zci_12147	0.6035
7	Zci_12148	0.4897
7	Zci_12153	0.6119
7	Zci_12186	0.4147
7	Zci_12190	0.6246
7	Zci_12192	0.6011
7	Zci_12208	0.6358
7	Zci_12222	0.6255
7	Zci_12242	0.3233
7	Zci_12257	0.6292
7	Zci_12309	0.6318
7	Zci_12354	0.6503
7	Zci_12387	0.6353
7	Zci_12402	0.6610
7	Zci_12405	0.0972
7	Zci_12461	0.2753
7	Zci_12508	0.4873
7	Zci_12516	0.5343
7	Zci_12578	0.2429
7	Zci_12614	0.6415
7	Zci_12620	0.4285
7	Zci_12747	0.4872
7	Zci_12831	0.3042
7	Zci_12859	0.6473
7	Zci_12866	0.5581
7	Zci_12867	0.4713
7	Zci_12881	0.5852
7	Zci_12884	0.5589
7	Zci_12885	0.6320
7	Zci_12891	0.5836
7	Zci_12973	0.4492
7	Zci_12974	0.6500
7	Zci_12992	0.6197
7	Zci_12994	0.5416
7	Zci_13026	0.2372
7	Zci_13032	0.3567
7	Zci_13084	0.5875
7	Zci_13107	0.3047
7	Zci_13122	0.5862
7	Zci_13126	0.5230
7	Zci_13180	0.5881
7	Zci_13186	0.6517
7	Zci_13365	0.6234
7	Zci_13392	0.4092
7	Zci_13463	0.5917
7	Zci_13614	0.6624
7	Zci_13686	0.6362
7	Zci_13756	0.6355
7	Zci_13788	0.6579
7	Zci_13791	0.6232
7	Zci_13840	0.3028
7	Zci_13865	0.3984
7	Zci_13888	0.2293
7	Zci_13901	0.4789
7	Zci_14037	0.5027
7	Zci_14058	0.5773
7	Zci_14164	0.6442
7	Zci_14179	0.4535
7	Zci_14216	0.6520
7	Zci_14218	0.6027
7	Zci_14248	0.3996
7	Zci_14250	0.3708
7	Zci_14257	0.1934
7	Zci_14277	0.5675
7	Zci_14285	0.5249
7	Zci_14332	0.5002
7	Zci_14415	0.6318
7	Zci_14442	0.4251
7	Zci_14444	0.3431
7	Zci_14466	0.5188
7	Zci_14469	0.6182
7	Zci_14503	0.1124
7	Zci_14557	0.5800
7	Zci_14561	0.3729
7	Zci_14588	0.5957
7	Zci_14616	0.6400
7	Zci_14629	0.5087
7	Zci_14645	0.4002
7	Zci_14659	0.6561
7	Zci_14704	0.5474
7	Zci_14737	0.6580
7	Zci_14753	0.6321
7	Zci_14755	0.4963
7	Zci_14847	0.6212
7	Zci_14883	0.6546
7	Zci_14893	0.5537
7	Zci_14903	0.2433
7	Zci_14915	0.3103
7	Zci_14917	0.5866
7	Zci_14959	0.6571
7	Zci_14960	0.6551
7	Zci_15036	0.3837
7	Zci_15057	0.4464
7	Zci_15097	0.6075
7	Zci_15196	0.4357
7	Zci_15198	0.5431
7	Zci_15210	0.1425
7	Zci_15225	0.4578
7	Zci_15232	0.6524
7	Zci_15265	0.4794
7	Zci_15281	0.6429
7	Zci_15324	0.6548
7	Zci_15347	0.5365
7	Zci_15407	0.3593
7	Zci_15465	0.3169
7	Zci_15503	0.4611
7	Zci_15569	0.6371
7	Zci_15592	0.2487
7	Zci_15609	0.6344
7	Zci_15684	0.5237
7	Zci_15687	0.5024
7	Zci_15689	0.3448
7	Zci_15771	0.6128
7	Zci_15781	0.5972
7	Zci_15837	0.5607
7	Zci_15851	0.6372
7	Zci_15867	0.4987
7	Zci_15892	0.5862
7	Zci_15893	0.1149
7	Zci_15915	0.5067
7	Zci_15916	0.5494
7	Zci_15924	0.2756
7	Zci_15925	0.3606
7	Zci_15970	0.5913
7	Zci_15976	0.2810
7	Zci_16420	0.3599
7	Zci_16518	0.6027
7	Zci_16533	0.4070
7	Zci_16572	0.5766
7	Zci_16616	0.5700
8	Zci_00460	0.3140
8	Zci_00591	0.3673
8	Zci_00769	0.3098
8	Zci_00826	0.3895
8	Zci_00839	0.2585
8	Zci_00875	0.3356
8	Zci_00898	0.3580
8	Zci_01546	0.3884
8	Zci_01660	0.3910
8	Zci_01772	0.2721
8	Zci_01790	0.3362
8	Zci_01804	0.3859
8	Zci_01883	0.3640
8	Zci_01978	0.3896
8	Zci_02116	0.2609
8	Zci_02216	0.1278
8	Zci_02310	0.3865
8	Zci_02311	0.3670
8	Zci_02769	0.3213
8	Zci_02942	0.3607
8	Zci_03290	0.3781
8	Zci_03527	0.1844
8	Zci_03831	0.2619
8	Zci_04346	0.1600
8	Zci_04458	0.3182
8	Zci_04459	0.1879
8	Zci_04806	0.3756
8	Zci_04913	0.3294
8	Zci_05143	0.3909
8	Zci_05539	0.3893
8	Zci_05703	0.3211
8	Zci_05717	0.2448
8	Zci_05852	0.2289
8	Zci_06042	0.0671
8	Zci_06120	0.3427
8	Zci_06375	0.3496
8	Zci_06696	0.3627
8	Zci_06830	0.3904
8	Zci_06882	0.4044
8	Zci_07191	0.3733
8	Zci_07595	0.4080
8	Zci_07598	0.3605
8	Zci_08128	0.2646
8	Zci_08385	0.1319
8	Zci_08700	0.3633
8	Zci_09179	0.3851
8	Zci_09252	0.2265
8	Zci_09401	0.1434
8	Zci_10269	0.3720
8	Zci_10520	0.3567
8	Zci_10534	0.2612
8	Zci_10575	0.2906
8	Zci_10741	0.3989
8	Zci_11172	0.3713
8	Zci_11173	0.3634
8	Zci_11476	0.2112
8	Zci_11959	0.3489
8	Zci_12105	0.3242
8	Zci_12263	0.3832
8	Zci_12404	0.2315
8	Zci_12519	0.2538
8	Zci_12546	0.3437
8	Zci_13276	0.3104
8	Zci_13374	0.0733
8	Zci_13443	0.2381
8	Zci_13691	0.3524
8	Zci_13758	0.2987
8	Zci_14422	0.3488
8	Zci_14532	0.3394
8	Zci_15343	0.1065
8	Zci_16349	0.2816
8	Zci_16494	0.2863
8	Zci_16540	0.3445
8	Zci_16565	0.3461
8	Zci_16599	0.3250
9	Zci_00060	0.6495
9	Zci_00255	0.6819
9	Zci_00317	0.6786
9	Zci_01709	0.5277
9	Zci_01952	0.2403
9	Zci_02026	0.5626
9	Zci_02475	0.1715
9	Zci_02645	0.6455
9	Zci_02676	0.4149
9	Zci_02832	0.6088
9	Zci_03177	0.6271
9	Zci_05674	0.6389
9	Zci_05675	0.6531
9	Zci_05895	0.0983
9	Zci_05908	0.3901
9	Zci_06347	0.4945
9	Zci_06712	0.6609
9	Zci_06810	0.5115
9	Zci_07402	0.4864
9	Zci_07504	0.5029
9	Zci_07876	0.6244
9	Zci_08661	0.6643
9	Zci_08830	0.2749
9	Zci_08920	0.5904
9	Zci_09021	0.3747
9	Zci_09974	0.5746
9	Zci_10479	0.6231
9	Zci_10718	0.1946
9	Zci_10799	0.5686
9	Zci_11019	0.3564
9	Zci_11815	0.5677
9	Zci_12158	0.6528
9	Zci_12275	0.5035
9	Zci_13098	0.6442
9	Zci_13244	0.3427
9	Zci_13479	0.2519
9	Zci_13624	0.6738
9	Zci_14110	0.4863
9	Zci_14853	0.1260
9	Zci_14961	0.6156
9	Zci_15062	0.5071
9	Zci_15064	0.3607
10	Zci_00171	0.4727
10	Zci_00204	0.3471
10	Zci_00337	0.4383
10	Zci_00411	0.4136
10	Zci_00412	0.3358
10	Zci_00571	0.4239
10	Zci_00677	0.2886
10	Zci_01041	0.1820
10	Zci_01421	0.4305
10	Zci_01800	0.3383
10	Zci_01814	0.1815
10	Zci_01820	0.2825
10	Zci_01882	0.4686
10	Zci_02016	0.4320
10	Zci_02160	0.4776
10	Zci_02230	0.4792
10	Zci_02280	0.1522
10	Zci_02301	0.3833
10	Zci_02352	0.4351
10	Zci_03055	0.4605
10	Zci_03203	0.4477
10	Zci_03297	0.3755
10	Zci_03530	0.2459
10	Zci_03583	0.4652
10	Zci_03607	0.2947
10	Zci_03805	0.4906
10	Zci_03828	0.4562
10	Zci_03866	0.3913
10	Zci_04030	0.4479
10	Zci_04088	0.4492
10	Zci_04127	0.2984
10	Zci_04339	0.3853
10	Zci_04376	0.0502
10	Zci_04407	0.2906
10	Zci_04503	0.4594
10	Zci_04782	0.3957
10	Zci_04856	0.0573
10	Zci_05040	0.3566
10	Zci_05649	0.1304
10	Zci_05694	0.1661
10	Zci_05975	0.3027
10	Zci_05987	0.2017
10	Zci_06087	0.3411
10	Zci_06109	0.3796
10	Zci_06259	0.4399
10	Zci_06342	0.2125
10	Zci_06354	0.2798
10	Zci_06504	0.3064
10	Zci_06509	0.4192
10	Zci_06657	0.2792
10	Zci_06992	0.4491
10	Zci_07037	0.2736
10	Zci_07415	0.3993
10	Zci_07735	0.2095
10	Zci_07831	0.1924
10	Zci_07931	0.1474
10	Zci_07982	0.2737
10	Zci_08036	0.2358
10	Zci_08059	0.3878
10	Zci_08171	0.4375
10	Zci_08323	0.2385
10	Zci_08496	0.2051
10	Zci_08604	0.4605
10	Zci_08607	0.4202
10	Zci_08915	0.3382
10	Zci_09277	0.2858
10	Zci_09496	0.3431
10	Zci_09546	0.4478
10	Zci_09717	0.4188
10	Zci_09913	0.4711
10	Zci_10401	0.3863
10	Zci_10411	0.3526
10	Zci_10486	0.3121
10	Zci_10820	0.3453
10	Zci_10993	0.1760
10	Zci_11070	0.4353
10	Zci_11077	0.4190
10	Zci_11092	0.0388
10	Zci_11372	0.4646
10	Zci_11436	0.4355
10	Zci_11531	0.2191
10	Zci_11992	0.3925
10	Zci_12326	0.2421
10	Zci_12386	0.1395
10	Zci_12420	0.4490
10	Zci_12463	0.4724
10	Zci_12888	0.4681
10	Zci_13095	0.2418
10	Zci_13375	0.2889
10	Zci_13409	0.2640
10	Zci_13481	0.1927
10	Zci_14380	0.4435
10	Zci_14514	0.4681
10	Zci_14760	0.3151
10	Zci_14908	0.4320
10	Zci_15177	0.3358
10	Zci_15336	0.4995
10	Zci_15419	0.4616
10	Zci_15616	0.4135
10	Zci_15634	0.3073
10	Zci_15653	0.3553
10	Zci_15964	0.4256
10	Zci_16512	0.0468
10	Zci_16517	0.5033
10	Zci_16610	0.4475
