"","x"
"1","Me1_v2_0096110"
"2","Me1_v2_0001420"
"3","Me1_v2_0096120"
"4","Me1_v2_0134300"
"5","Me1_v2_0025960"
"6","Me1_v2_0054260"
"7","Me1_v2_0000840"
"8","Me1_v2_0165660"
"9","Me1_v2_0099920"
"10","Me1_v2_0178180"
"11","Me1_v2_0187190"
"12","Me1_v2_0010860"
"13","Me1_v2_0084510"
"14","Me1_v2_0111060"
"15","Me1_v2_0111070"
"16","Me1_v2_0134290"
"17","Me1_v2_0085130"
"18","Me1_v2_0176700"
"19","Me1_v2_0122620"
"20","Me1_v2_0063320"
