{
	"n_targets": 20030,
	"n_bootstraps": 100,
	"n_processed": 27569771,
	"n_pseudoaligned": 17885795,
	"n_unique": 15159048,
	"p_pseudoaligned": 64.9,
	"p_unique": 55.0,
	"kallisto_version": "0.48.0",
	"index_version": 10,
	"start_time": "Fri Mar  3 13:17:45 2023",
	"call": "kallisto quant --bootstrap-samples 100 --rf-stranded -t 20 -i /scratch/users/dadras/Stress_profiling_of_zygnema_circumcarinatum_1b/kallisto_index/SAG698_1b_CDS.fna.idx -o /scratch/users/dadras/Stress_profiling_of_zygnema_circumcarinatum_1b/kallisto/Z_1_17_EKRN220057096-1A_HKF3KDSX5_L2 /scratch/users/dadras/Stress_profiling_of_zygnema_circumcarinatum_1b/trimmed_reads_PE/Z_1_17_EKRN220057096-1A_HKF3KDSX5_L2_1.fq.gz /scratch/users/dadras/Stress_profiling_of_zygnema_circumcarinatum_1b/trimmed_reads_PE/Z_1_17_EKRN220057096-1A_HKF3KDSX5_L2_2.fq.gz"
}
