nodeName	altName	nodeAttr[nodesPresent, ]
Zci_00127	NA	darkred
Zci_00132	NA	darkred
Zci_00154	NA	darkred
Zci_00158	NA	darkred
Zci_00173	NA	darkred
Zci_00326	NA	darkred
Zci_00646	NA	darkred
Zci_00766	NA	darkred
Zci_00837	NA	darkred
Zci_01045	NA	darkred
Zci_01117	NA	darkred
Zci_01367	NA	darkred
Zci_01392	NA	darkred
Zci_01510	NA	darkred
Zci_01571	NA	darkred
Zci_01628	NA	darkred
Zci_01678	NA	darkred
Zci_01708	NA	darkred
Zci_01718	NA	darkred
Zci_01839	NA	darkred
Zci_01932	NA	darkred
Zci_02092	NA	darkred
Zci_02261	NA	darkred
Zci_02319	NA	darkred
Zci_02342	NA	darkred
Zci_02432	NA	darkred
Zci_02465	NA	darkred
Zci_02468	NA	darkred
Zci_02472	NA	darkred
Zci_02594	NA	darkred
Zci_02710	NA	darkred
Zci_02756	NA	darkred
Zci_02766	NA	darkred
Zci_02928	NA	darkred
Zci_02999	NA	darkred
Zci_03112	NA	darkred
Zci_03195	NA	darkred
Zci_03573	NA	darkred
Zci_03680	NA	darkred
Zci_03835	NA	darkred
Zci_04057	NA	darkred
Zci_04154	NA	darkred
Zci_04197	NA	darkred
Zci_04275	NA	darkred
Zci_04311	NA	darkred
Zci_04313	NA	darkred
Zci_04405	NA	darkred
Zci_04593	NA	darkred
Zci_04608	NA	darkred
Zci_04641	NA	darkred
Zci_04643	NA	darkred
Zci_04707	NA	darkred
Zci_04732	NA	darkred
Zci_04796	NA	darkred
Zci_04843	NA	darkred
Zci_05348	NA	darkred
Zci_05536	NA	darkred
Zci_05628	NA	darkred
Zci_05658	NA	darkred
Zci_05707	NA	darkred
Zci_05740	NA	darkred
Zci_05959	NA	darkred
Zci_06036	NA	darkred
Zci_06038	NA	darkred
Zci_06110	NA	darkred
Zci_06117	NA	darkred
Zci_06333	NA	darkred
Zci_06339	NA	darkred
Zci_06524	NA	darkred
Zci_06705	NA	darkred
Zci_06877	NA	darkred
Zci_07012	NA	darkred
Zci_07036	NA	darkred
Zci_07285	NA	darkred
Zci_07288	NA	darkred
Zci_07398	NA	darkred
Zci_07440	NA	darkred
Zci_07566	NA	darkred
Zci_07671	NA	darkred
Zci_07683	NA	darkred
Zci_07695	NA	darkred
Zci_07709	NA	darkred
Zci_07820	NA	darkred
Zci_08126	NA	darkred
Zci_08216	NA	darkred
Zci_08425	NA	darkred
Zci_09132	NA	darkred
Zci_09348	NA	darkred
Zci_09783	NA	darkred
Zci_09807	NA	darkred
Zci_09927	NA	darkred
Zci_10236	NA	darkred
Zci_10440	NA	darkred
Zci_10540	NA	darkred
Zci_10583	NA	darkred
Zci_10662	NA	darkred
Zci_10685	NA	darkred
Zci_10707	NA	darkred
Zci_10800	NA	darkred
Zci_10875	NA	darkred
Zci_11052	NA	darkred
Zci_11210	NA	darkred
Zci_11594	NA	darkred
Zci_11793	NA	darkred
Zci_12001	NA	darkred
Zci_12004	NA	darkred
Zci_12006	NA	darkred
Zci_12008	NA	darkred
Zci_12056	NA	darkred
Zci_12620	NA	darkred
Zci_12797	NA	darkred
Zci_12803	NA	darkred
Zci_12825	NA	darkred
Zci_12881	NA	darkred
Zci_12904	NA	darkred
Zci_12960	NA	darkred
Zci_12977	NA	darkred
Zci_13051	NA	darkred
Zci_13092	NA	darkred
Zci_13690	NA	darkred
Zci_13866	NA	darkred
Zci_14049	NA	darkred
Zci_14321	NA	darkred
Zci_14462	NA	darkred
Zci_14628	NA	darkred
Zci_14641	NA	darkred
Zci_14683	NA	darkred
Zci_14708	NA	darkred
Zci_14731	NA	darkred
Zci_14806	NA	darkred
Zci_14841	NA	darkred
Zci_15087	NA	darkred
Zci_15089	NA	darkred
Zci_15378	NA	darkred
Zci_15807	NA	darkred
Zci_16451	NA	darkred
