regulator	target	weight
ENOC, ENO3	RPP2D	0.004688272778444062
FAD7, AtFAD7, FADD	ETR, EIN1, RDO3, ETR1, AtETR1	0.00455586076155545
ADH2, HOT5, ATGSNOR1, PAR2, GSNOR	LCBK2	0.004519455196011214
ICU9, AGO1, AtAGO1	AtPUB4, PUB4	0.004305993385268513
ATPUB13, PUB13	ATCRE1, CRE1, WOL1, AHK4, WOL	0.0042753506276256336
NQR	AT5G62140	0.004170125608667735
SULTR1;1	SKI8, VIP3	0.004148246212129437
chr13, SRCAP, PIE1	HY3, PHYB, OOP1	0.004119671776120862
HSP17C	PCK1, ASL5, LBD12	0.004085704985372172
NAA50	PFD6	0.004053040261686388
UP9	CP12, CP12-1	0.004046921834984828
PDE332, ATPD	DegP7, DEG7	0.004029224922564437
VHA-E1, VHAE1, emb2448, TUF, TUFF	FTSH5, VAR1	0.00401759316783377
MYBS2	AtGRXS17, GRXS17	0.003982450358103876
NTMC2T1, NTMC2TYPE1, SYT2, ATSYTB, SYTB	KEA3, ATKEA3	0.003952992898869887
LHCB2, DEG13, LHCB2, LHCB2	LHCB2, LHCB2	0.003916190236433087
SULTR4;2	AT1G32220	0.003915130618116897
AT5G21105	WTF1, AtWTF1	0.00388328244423173
AtSAC9, MUR11, SAC9	ACD1, LLS1, PAO	0.0038656139578240865
ETR, EIN1, RDO3, ETR1, AtETR1	EMB1135, FGT1	0.0038411560244208383
TAPX	HK5, CKI2, AHK5	0.0038302162080209217
FTSH5, VAR1	AHK3, HK3	0.003813732127469732
AT2G38820	ILR3, bHLH105	0.0037815891357850127
TIL, ATTIL	LHCB2, DEG13, LHCB2, LHCB2	0.0037690905614510984
BBX18	VDAC3, AtVDAC-3, ATVDAC3	0.003750104771634463
TPPA, ATTPPA	ATXR3, SDG2	0.003731690747339
NF-YB3	APRF1, S2La	0.0037283908091109235
ASG1	AT1G16250	0.0036816000687499182
AT5G35735	PBL34	0.00367833477201916
AT1G50450	AT5G63630	0.003652102763347607
PGKp2, cPGK2, PGK2	AT5G19440	0.003650302431748461
ATHSP101, HSP101, HOT1	PES1	0.0036443505691406797
CEV1, IXR1, ELI1, ATH-B, CESA3, MRE1, ATCESA3	ATERF-9, ERF9, ATERF9	0.0036441667176496614
epsilon1-COP	AtYY1, YY1	0.003640940087821058
ACO3	ABI1, AtABI1	0.00363749648490377
AT5G19440	UP9	0.00362554398514973
RECG, RECG1	TMT2	0.003615292469746475
APX4, TL29	AT3G62010	0.0036132921473330383
SIGA, SIGB, ATSIG1, ATSIG2, SIG1, SIG2, ABC1	AtYY1, YY1	0.0036083898128765088
AT1G11360	PDX1, ATPDX1, ATPDX1, PDX1, RSR4	0.00360589797834037
AT2G35920	AT1G01180	0.0036011353037467215
ATB' GAMMA	AT2G43320	0.0035739488023653725
AT4G34150	ATU2AF35B, U2AF35B	0.0035675802301633336
AtSAP60, EMB2776, PRP4, LIS, AtPRP4	SIP2, RS2, AtSIP2	0.0035271268594833714
UVH6, ATXPD	AtRH3, RH3, emb1138	0.0035217418279000663
AT3G07670	ATU2AF35B, U2AF35B	0.0035168211018893154
GBSS1	AT5G48790	0.003516353861728648
INO80, ATINO80	ATXR7, SDG25	0.00350497278220519
EFM, HHO4	BCHA1, SPI	0.003501215069857913
ERD4, OSCA3	UAP56a	0.0034917988733324783
AT5G01260	CEV1, IXR1, ELI1, ATH-B, CESA3, MRE1, ATCESA3	0.0034768124431737196
atPEIP2, AtPEP2	AT3G05670	0.003474927696172288
AtFH14, AFH14	MAGL13	0.003474789493861
AT3G08505	AT2G38820	0.003464041388156455
LHCA3	CHA18, CHR18	0.0034591134638646084
AT-ACC1, 115D-4A, ACC1, PAS3, EMB22, GSD1, SFR3, GK	AT3G07670	0.0034506276677188745
AT4G03030	DegP7, DEG7	0.0034229127548922496
ATPK19, ATS6K2, ATPK2, S6K2	ATGRAS2, GRAS2, SCL14	0.003412707062133855
atg16	AtPUB4, PUB4	0.0034123482982288335
ATCOP1, COP1, DET340, EMB168, FUS1	cpLEPA	0.003410459727215446
HUP26	DDW1	0.00340006237094839
AT5G26749	chr13, SRCAP, PIE1	0.0033945229704261033
WDR55	ATCPN21, CPN20, CPN21, CHCPN10, CPN10	0.00339314415501903
HK5, CKI2, AHK5	SIGA, SIGB, ATSIG1, ATSIG2, SIG1, SIG2, ABC1	0.0033878772382539184
ET2, ATET2	CRL, CAA33	0.0033828562615942654
HIT4	AT5G41020	0.0033820078195154167
UPL5	AHK2, HK2	0.00338169898905619
PFD5	HK5, CKI2, AHK5	0.00337855249148069
AT4G39780	RR1, ARR1	0.00337671255870732
CR88, EMB1956, AtHsp90, HSP90C, AtHsp90C, Hsp88, HSP90	alpha1-COP	0.0033763310255623233
AtHMP14, ATX1, ATATX1	LCBK2	0.0033750949758881337
SCA1, RPS5, EMB3113, PRPS5	HSP17C	0.0033730483802898534
HIT1, VPS53, ATVPS53	AT1G11360	0.0033698733191547168
CHO1, PLT5, EMK, AIL5	AT5G48790	0.0033651086442470267
HB-4, ATWOX13, WOX13	CSD2, CZSOD2, SOD2, AtSOD2	0.003364661516929977
EIF4A-2	PHOT2, AtPHOT2, NPL1	0.00336372718142537
ACD1, LLS1, PAO	AtCDC20, CDC20	0.0033619729537298715
AtPUB4, PUB4	CHY1	0.0033582723391328367
SES1	ETR, EIN1, RDO3, ETR1, AtETR1	0.0033566343334046336
CLI186, LAZ2, EFS, SDG8, CCR1, ASHH2	GSTF10, ATGSTF10, ERD13, ATGSTF4	0.0033563509613378268
PBL27	HUP26	0.003356069170409095
SUVR5	FAS2, NFB01, MUB3, NFB1	0.0033483120643449183
APD6	SUVR5	0.0033462339422364864
BRR2a, emb1507, BRR2	ACD1, LLS1, PAO	0.0033417421986432216
NTRC	TBL16	0.0033411975767248334
OWL1	AT5G12010	0.0033389929139678743
PRK	UBC5	0.003337003367067561
APG6, AtCLPB3, CLPB3, CLPB-P	HIRA	0.0033368091200489634
MSRB2	FIS3, FIE1, FIE	0.0033301441757772133
SIR	ERF10, ATERF10	0.0033275023850920767
ABC1K3	AHK2, HK2	0.003326808213208552
ATBPM2, BPM2	ERD4, OSCA3	0.0033162941031183633
NPU	AHK3, HK3	0.003305583922241485
AtRH3, RH3, emb1138	ATCPN21, CPN20, CPN21, CHCPN10, CPN10	0.0033031205481646904
AT1G74250	AHK3, HK3	0.0033029127693808813
PBL34	IWS1, ATIWS1, HNI9	0.0032970557091748336
LHCA2	BBX18	0.0032930478827095603
HSP21	emb1967	0.00328862058340196
ABHD11	RECG, RECG1	0.0032879051235890815
AT5G16610	XUT1, RHS8	0.003286725276752907
PIFI	HON5, CLPR4	0.0032834357974224366
CHR12, ATCHR12	AT2G47410	0.00328295451928258
ATHK1, HK1, AHK1	ATNHX7, ATSOS1, SOS1	0.0032782249956838684
RAD23-3, RAD23C	PHOT2, AtPHOT2, NPL1	0.0032743079073468614
APRR7, PRR7	RR1, ARR1	0.0032714410202412817
RGD3, CHA16, BTAF1, ATBTAF1, CHR16	AtOCT4, OCT4	0.0032648404716938534
HY5, TED 5	NOT9a	0.003263870905557891
AT3G27640	AHK2, HK2	0.00325452688683973
RHS17	AT1G33270	0.00325325188586578
PWP2, ATPWP2	MSBP2, MAPR3, ATMAPR3, ATMP2	0.003251597515671885
AT2G37220	ATPK19, ATS6K2, ATPK2, S6K2	0.0032485821975831667
TAP46	AtRH7, PRH75	0.00324823477221929
LARP1a, AtLARP1a	AT4G14270	0.0032441540784334403
mTERF9	H3, HTR8	0.0032373502549995553
CHR25, ATRAD54, RAD54	IWS1, ATIWS1, HNI9	0.0032361152314459986
bZIP44, AtbZIP44	CHA2, BRM, ATBRM, FFO3, CHR2	0.0032335493075957215
SAR1, NUP160, ATNUP160	ATNHX7, ATSOS1, SOS1	0.0032230351570720216
NAA20	LCBK2	0.003219109179007768
AtPEIP1, BOP1, AtPEP1	MTHSC70-2, HSC70-5	0.003217440499663314
LFG5, AtLFG5	ET2, ATET2	0.0032161266132069532
AHK3, HK3	AT3G06980	0.0032110499421942403
ESD6, HOS1	GNAT1, SNAT2	0.0032107439738322248
SNAT1, NSI, ATNSI, GNAT2, SNAT	GSTF10, ATGSTF10, ERD13, ATGSTF4	0.003207358831816191
ATNCED1, ATCCD1, CCD1, NCED1	AT1G16250	0.0032013211444298245
ATPGMP, PGM, PGM1, STF1	AT1G01180	0.0032006702385849388
SEU	atPEIP2, AtPEP2	0.0031991842695757566
AtACDO1, PGR6, ACDO1, ABC1K1	ATXIE, XIE	0.003196273529933072
CDF2	PWP2, ATPWP2	0.003195392211341235
AVDE1, NPQ1	A/N-InvE, At-A/N-InvE, INV-E	0.003193706877733073
ATVT-1, HVT1	SIGA, SIGB, ATSIG1, ATSIG2, SIG1, SIG2, ABC1	0.0031929977769023436
EMB1789	AT1G62780	0.003191925340609705
CHR4, PKR1	CAT2	0.0031910795189958735
RH10	AT3G60450	0.0031909048627431135
GDS1	AtXRN3, XRN3	0.00319088985788752
SIP2, RS2, AtSIP2	ATCYSB, ATCYS6, CYSB	0.0031905459520560234
ARID5	CHA2, BRM, ATBRM, FFO3, CHR2	0.00318508060242725
AT5G62140	ATERF-9, ERF9, ATERF9	0.00316092102740122
PSAF	APX4, TL29	0.0031561986824078345
AT3G63540	AHK2, HK2	0.0031542506073352966
COBL1	mTERF9	0.0031511727856060366
AT5G51280	WTF1, AtWTF1	0.003150101963449183
PES1	HK5, CKI2, AHK5	0.0031499381215431134
emb1220, PRP31	RBGA4, GRP4, AtGRP4, GR-RBP4	0.0031466205518442965
AT4G14290	AT4G17080	0.003146103836629785
ATERDJ3A, TMS1	emb1579, RSA1	0.00313731348228963
ATHDA15, HDA15	POB1, ATPOB1, AHT1, LRB2	0.0031297229238807286
MSBP2, MAPR3, ATMAPR3, ATMP2	ATXR7, SDG25	0.0031278044796257533
HY3, PHYB, OOP1	AT1G75460	0.0031270410563709796
ASHR1, SDG37	TIC55-IV, ACD1-LIKE, PTC52	0.0031234030829705843
AOR	RECG, RECG1	0.0031231748284814833
ATXIE, XIE	BRR2c	0.0031198973683424585
RBGA4, GRP4, AtGRP4, GR-RBP4	LOS6, NPQ2, ZEP, ABA1, ATABA1, ATZEP, IBS3	0.0031194681778979666
AT1G75460	AT2G43110	0.003118574665922951
AT2G15560	AT1G74790	0.0031180276553709934
AT3G06980	ATHSP101, HSP101, HOT1	0.0031154797842730835
AtSTOP1, STOP1	OHP1, PDE335, OHP	0.0031150542170493454
AT5G50970	SCA1, RPS5, EMB3113, PRPS5	0.0031132907146597566
H3, HTR8	TAP1, ABCB26, ATTAP1	0.003112585550330227
AT5G52450	ERF71, AtERF71, HRE2	0.0031121588043282484
CCR2, CRTISO	PBL34	0.0031104806831559317
AT2G42770	POB1, ATPOB1, AHT1, LRB2	0.003109307682713522
AT3G18860	EIF4A-2	0.0031072926775340417
PRL1	AT3G07670	0.003107054917320155
TEB, POLQ	CLI186, LAZ2, EFS, SDG8, CCR1, ASHH2	0.0031019280099969632
LOS5, SIR3, ACI2, ABA3, ATABA3, AtLOS5, GIN5	SMN2, SOP3, HEN2	0.003101821964455513
EIF4A-III, RH2	ICU9, AGO1, AtAGO1	0.0030987165506649664
RABA4D, ATRABA4D	RGD3, CHA16, BTAF1, ATBTAF1, CHR16	0.003095924942775113
RR1, ARR1	ALBA1, Atalba1, ALBA4	0.003095804239644673
DegP7, DEG7	HK5, CKI2, AHK5	0.003094035500507435
LRB1	AT3G11320	0.003092122701057021
RAG1, KAPP	EMB93, SOLDAT10	0.0030890587187452734
PPH1, TAP38	OOP2, BLU1, ATCRY1, CRY1, HY4	0.0030853422938106542
LHCB3, LHCB31	AT5G35735	0.003083992025348548
AT5G17370	LRS1	0.0030836780376527454
PERK8, AtPERK8	FBN1b	0.003081475336890825
SIZ1, ATSIZ1	ASG2	0.0030808479788310117
CRB, CSP41B, HIP1	AtGNA1, GNA1	0.0030730051200678656
RH18	UGT80A2, SGT	0.0030687011793174984
ABI1, AtABI1	ATR1, AR1, AtCPR1	0.0030686096663637055
RCA	TIL, ATTIL	0.00306818572598521
AT3G48200	HCF106	0.003065725578087657
ATJ2, J2	AT5G12010	0.0030647715722816903
PRE2	CYT1, EMB101, GMP1, VTC1, SOZ1	0.0030546716194532566
OOP2, BLU1, ATCRY1, CRY1, HY4	ATXIE, XIE	0.0030523841391480733
ROL5	KCS4	0.0030498321673116434
MAGL15	AT2G21860	0.0030475487281543443
STRS1, RH5	ATFPG-1, ATMMH-1, ATMMH-2, ATFPG-2, MMH-1, MMH-2, FPG-2, FPG-1, MMH	0.003047366088389127
PSY	SEU	0.0030444156054652226
FADC, SFD4, FAD6	TBL16	0.0030437223303011185
JMJ17	WDR55	0.003039082435526529
MED7B	ERD4, OSCA3	0.0030348832507600502
HSI2-L1, HSL1, VAL2	LBD25	0.0030327828916665825
FIS3, FIE1, FIE	SUVR5	0.0030316884818849216
RPN12a	AT1G50020	0.0030285829525640716
MPK16	AT1G74070	0.003026296952838053
AtbZIP16, bZIP16	AT2G36145	0.0030242278155790067
RH57, AtRH57	GNAT1, SNAT2	0.0030240592735473835
SAGL1	PERK8, AtPERK8	0.0030232181049994495
MSRA4, PMSR4	AT5G16610	0.0030228884506799236
ATCPN21, CPN20, CPN21, CHCPN10, CPN10	HTD1	0.003022399738493624
AT2G35040	AtXRN3, XRN3	0.0030218997112265063
EBS	AT1G71840	0.003018447273950839
ATPDR3, ABCG31, PDR3	AT5G19210	0.003015810791424505
MGE2, AR192	FBX2	0.003014449422539619
AT5G04830	ATNCED1, ATCCD1, CCD1, NCED1	0.003014218222041107
AT2G47410	AT4G14270	0.003013478967427133
AT5G03370	MAGL15	0.00301345171548104
AtMYB109, MYB109	MYBS2	0.003012999467205843
MBF1B, ATMBF1B	MIZ2, VAN7, EMB30, 112A-2A, GNOM, GN	0.00301099879753266
SPE2, ADC2, ATADC2	ATCRE1, CRE1, WOL1, AHK4, WOL	0.003007264932969705
ATRBR1, RBR1, RB1, RB, RBR	TRM82, AtTRM82	0.0030002007814295866
AT5G14580	MYBS2	0.003000077428775308
AtRH7, PRH75	AtSAC9, MUR11, SAC9	0.0029970235885713767
AT5G51980	ATFPG-1, ATMMH-1, ATMMH-2, ATFPG-2, MMH-1, MMH-2, FPG-2, FPG-1, MMH	0.00299654702723714
LOS1	AT1G26300	0.002992811824592112
LOS6, NPQ2, ZEP, ABA1, ATABA1, ATZEP, IBS3	AT1G57770	0.002986854524824792
RAD5, RAD5A	RID1	0.0029794557174613566
PCAT2, ATHAC1, ATHPCAT2, HAC1	LOS1	0.002977530555019294
PHOT2, AtPHOT2, NPL1	NTMC2T1, NTMC2TYPE1, SYT2, ATSYTB, SYTB	0.0029769255284288884
AT4G35785	ATB' GAMMA	0.0029764459787457076
CHR24	SUVH4, KYP, SDG33	0.0029732460697665633
SSL2, CHR6, CHD3, GYM, HRB2, EPP1, LWR1, CKH2, PKL	AT1G32220	0.0029722723902072903
BolA3, BolA2	RPP2D	0.0029683012907001888
AT1G71730	JMJ17	0.0029654983856056867
SUF4	emb1345, CIA1	0.0029653257341229395
AT5G41380	MUM5, MUCI21	0.0029643431266833838
UGT80A2, SGT	ACD1, LLS1, PAO	0.0029624759183193897
AT2G16405	UP9	0.0029622326382113136
ATNTT1, NTT1	ACO3	0.0029603376138589766
BCHB	HK5, CKI2, AHK5	0.0029596694381845636
TFIIS, RDO2	mTERF9	0.002958999341232853
HVA22E, ATHVA22E	ETR, EIN1, RDO3, ETR1, AtETR1	0.0029548281059876965
GAPA-2	AT1G75340	0.0029490916614858848
AtOCT4, OCT4	ATNCED1, ATCCD1, CCD1, NCED1	0.0029460777992150766
AtNUFIP, NUFIP	HSP17C	0.002944402545489433
MED31	HON5, CLPR4	0.0029423712849956834
AT3G20300	BUB3	0.00294231284692574
GNAT5	RBGA4, GRP4, AtGRP4, GR-RBP4	0.002932278034625268
AT3G27320	RH36, AtRH36, SWA3	0.002931765667351952
bZIP23, AtbZIP23	AT2G04740	0.002927412423562722
MSH1, ATMSH1, CHM, CHM1	HSP21	0.0029272296241970768
AT2G21860	RAD23-3, RAD23C	0.0029226246966768447
AtHip1, HIP1, TPR11	AT1G27350	0.0029097340702459408
ACR12	SUVR5	0.0028991239491914463
ATGRAS2, GRAS2, SCL14	AT2G27290	0.0028984261157440063
WIN2	HK5, CKI2, AHK5	0.002883798662633058
CAD2, GSHA, RAX1, AtGSH1, PAD2, RML1, ATECS1, GSH1	alpha1-COP	0.0028814369295462284
SECE1	UPL5	0.00287777526317709
SCD1	AT3G15610	0.0028740413254749464
CYT1, EMB101, GMP1, VTC1, SOZ1	SCA1, RPS5, EMB3113, PRPS5	0.0028711645766620712
FdC1	GWD, GWD1, SOP1, SOP, SEX1	0.0028672190245688724
YCF32, PSBY	APD6	0.0028617848990739867
AT5G61510	AT3G54460	0.0028595902620703866
LHCA1	AT5G41380	0.002859032316548715
AT3G63220	NF-YA7	0.0028586233786356404
ALBA1, Atalba1, ALBA4	AT2G36320	0.002858240662213605
AKR2B	ALX8, SUPO1, AtFRY1, HOS2, ATSAL1, SAL1, RON1, FRY1	0.0028511362181784265
AtcPT4, cPT4, CPT7, AtCPT7	MED18	0.002848915445992205
ATAN11, LWD1	CHY1	0.0028481386764223665
LUT2	OHP1, PDE335, OHP	0.002843940091604362
CP12, CP12-1	ACR12	0.00284267682750457
ARA12, SBT1	TBL16	0.0028392697289813433
AT4G34910	ATJ2, J2	0.002838883934109087
AtMTR4, MTR4	IM1, IM, PTOX	0.0028213092629470866
CHY1	MUM5, MUCI21	0.002821266513014562
PDI2, ATPDIL1-4, ATPDI2, PDIL1-4	SEP1	0.002819144024876515
ATCRM1, ATXPO1, XPO1, HIT2, XPO1A	AT4G17080	0.0028173083739298148
AT4G33625	AT2G47410	0.0028147866265121517
AT2G29670	EMB2785	0.0028135294669201834
AT5G64730	APG6, AtCLPB3, CLPB3, CLPB-P	0.002813387113625133
AT4G11630	SUF4	0.0028124302270484697
HPPD, PDS1, HPD	BIL2	0.0028118178795826067
AT2G20050	cpLEPA	0.002810879382999083
SDG38, ATXR4	AHK3, HK3	0.0028103593865291708
ATFD2, FD2, FED A	PRL1	0.0028091470211192983
ATBAG4, BAG4	PFD5	0.0028090058565519846
LUX, PCL1	AT3G18860	0.002802912978678975
CSTF50	CEV1, IXR1, ELI1, ATH-B, CESA3, MRE1, ATCESA3	0.002800156933324009
NAA10	LOS1	0.00279883899620365
RER3	AT3G06980	0.00279460290464294
AT4G27270	ATMDAR1, MDAR1	0.0027898525421378834
XDH1, ATXDH1	AT5G53050	0.0027884715104493684
AtYY1, YY1	ABA4	0.002788273696890085
MPK4, ATMPK4, MAPK4	PGSIP8	0.0027876176199381876
GTE01, IMB1, GTE1	AVDE1, NPQ1	0.0027872089601766233
APP, PP, PARP2	AT1G32220	0.002786320550874072
ZKT, MET1	AT3G03100	0.002784968032866135
AT2G47330	APRF1, S2La	0.0027847879057609467
PAT1	RH10	0.0027845963520165933
AT1G62780	ATTRB1, TRB1	0.002784384769324623
PSAD-2	TPPA, ATTPPA	0.0027817252600100453
REIL1	AtXRN3, XRN3	0.002780018876903617
ATMBD9, MBD9	AT4G30600	0.0027799677446804687
AT1G27350	CHR8	0.0027772250933918614
Oma1	CP12, CP12-1	0.0027758611827567335
GIN2, HXK1, ATHXK1	ETR, EIN1, RDO3, ETR1, AtETR1	0.002773200737173422
ISE1, EMB1586	EMB2728, RPE	0.00277056533354476
BCHA1, SPI	AT1G11360	0.002768923408473553
AHK2, HK2	PAC	0.0027685154653173103
AT2G36145	ICU9, AGO1, AtAGO1	0.002767765220835005
RH39	OWL1	0.0027648867184416667
abc1k7, SIA1, AtSIA1	AT2G35040	0.0027635582529902483
AT5G15270	AHK2, HK2	0.0027634069006751633
UAP56a	ATHK1, HK1, AHK1	0.00276075472070001
AtRH20, RH20	CHR4, PKR1	0.0027582001842127416
BAF60, SWP73B, CHC1	AtSAP60, EMB2776, PRP4, LIS, AtPRP4	0.0027563370814374303
GRXC1	AT1G78995	0.0027548898923645633
PrxIIE	CHO1, PLT5, EMK, AIL5	0.002753438881367817
MAF1	ATXR7, SDG25	0.002748012387934424
TCX5	DRB2, AtDRB2	0.0027443324721876184
AtDSE1, TAN, ALT2, EMB2757, DSE1	LSMT-L	0.002742277348723608
Lhca5	SIGA, SIGB, ATSIG1, ATSIG2, SIG1, SIG2, ABC1	0.002740776441362849
MTHSC70-2, HSC70-5	ATU2AF35B, U2AF35B	0.0027397760608202
AtTEX1, TEX1, THO3, RAE2	AVDE1, NPQ1	0.0027380487362400636
AT3G62310	FBH1, CFLAP2	0.002737644273992672
FLD, RSI1	ATFPG-1, ATMMH-1, ATMMH-2, ATFPG-2, MMH-1, MMH-2, FPG-2, FPG-1, MMH	0.0027354375337283834
HSP91, AtHsp70-14	ADH2, HOT5, ATGSNOR1, PAR2, GSNOR	0.002733918683600535
KU80, ATKU80	CP12, CP12-1	0.0027333103985616065
AT2G45460	CHR12, ATCHR12	0.0027320959400377485
FH, ATFH	ATCRM1, ATXPO1, XPO1, HIT2, XPO1A	0.0027295480540820366
AT3G05670	AtMYB109, MYB109	0.002728077322385302
DJA6	ATCRE1, CRE1, WOL1, AHK4, WOL	0.0027273597206958333
PNP, RIF10, PDE326	GAPA-2	0.002727334297791893
HCF106	AT3G21540	0.0027264125398799733
AT5G55060	HK5, CKI2, AHK5	0.0027251203336984367
ATERF-9, ERF9, ATERF9	AHK3, HK3	0.0027222359017362602
GF14 IOTA, GRF12	ATPGMP, PGM, PGM1, STF1	0.0027215382586402537
ATCDC5, ATMYBCDC5, CDC5	FdC1	0.0027213021664086933
DJC26, J20	RAG1, KAPP	0.0027187137990909967
ATABCG40, ABCG40, PDR12, ATPDR12	AtPUB4, PUB4	0.002716163726294825
AAT3, ATAAT1, ASP5	EMB76, SIN1, SUS1, ATDCL1, DCL1, ASU1, EMB60, CAF	0.0027155690321916167
ATPRX Q, PRXQ	CHR25, ATRAD54, RAD54	0.0027142291849141
AT1G27900	ETR, EIN1, RDO3, ETR1, AtETR1	0.0027134344897422127
VTC4, GPP	AtHBP1, SOUL1, cHBP1, HBP1	0.002712555847356033
MED18	BZIP28	0.002711815101860327
MTV11, AtVPS15, VPS15	CEV1, IXR1, ELI1, ATH-B, CESA3, MRE1, ATCESA3	0.0027112528718585
AT3G30390	FBH1, CFLAP2	0.0027109087773025133
ATG9, ATAPG9, APG9	FBS4, AtFBS4	0.0027087754265938332
AT3G62010	PBL34	0.0027079812915736636
STR10	AT2G38905	0.0027077788645088396
ATMDAR4, MDAR4	DJC26, J20	0.0027069006143575
AT4G28450	CHR25, ATRAD54, RAD54	0.002706702761567523
SUS3, ATSUS3	FZR2, CCS52A1	0.0027066882806045943
P5CR, AT-P5C1, AT-P5R, EMB2772	MAGL13	0.0027065027506018866
SEP2	ACO3	0.002705816287178127
FAS2, NFB01, MUB3, NFB1	GWD, GWD1, SOP1, SOP, SEX1	0.0027039095016446915
TAG1, DGAT1, AtDGAT1, ATDGAT, AS11, RDS1, ABX45	CR88, EMB1956, AtHsp90, HSP90C, AtHsp90C, Hsp88, HSP90	0.0027038785044734464
ALE2	HK5, CKI2, AHK5	0.002700961828955992
AT1G64650	MIZ2, VAN7, EMB30, 112A-2A, GNOM, GN	0.0026986634797683106
AT3G61180	CR88, EMB1956, AtHsp90, HSP90C, AtHsp90C, Hsp88, HSP90	0.0026983413298256307
AT2G27290	AT3G27640	0.0026975124818238464
AT4G02010	ATMRP6, ABCC8, MRP6	0.002697061215078051
ATPEX7, PEX7	mTERF9	0.00269608412719422
HUA1	APD6	0.0026950282504494298
SSRP1, HMG, ATHMG, NFD	AT1G16250	0.002694659798258187
ISPF, MECPS	HY3, PHYB, OOP1	0.002694587269555663
GIF3	AT4G17080	0.002693865450084352
RPL23A2, RPL23AB	AtMYB109, MYB109	0.0026937894739723833
TMT2	AT3G30390	0.00269358127368032
HAC8, ELO3, AtELP3, HAG3, EAST1, ELP3	VTE1, ATSDX1	0.00269271847089445
KCS4	AT4G33625	0.00269143553543539
SMN2, SOP3, HEN2	ATCOP1, COP1, DET340, EMB168, FUS1	0.002690188843748715
BCHC2	MAGL15	0.002688050555952088
RID1	PINP1, CUV, PRP16, EMB3011, FEY	0.0026849339453561116
AT1G73470	AtCDC20, CDC20	0.002684828702527288
ATPAP3, PAP3	RAG1, KAPP	0.0026841755304253885
AT1G01180	ATCOP1, COP1, DET340, EMB168, FUS1	0.002682811411086862
DPB, ATDPB	ALX8, SUPO1, AtFRY1, HOS2, ATSAL1, SAL1, RON1, FRY1	0.0026820257305296756
RH17	PGSIP8	0.0026808624383340336
HCEF1, cfbp1	AT5G48790	0.0026805708991501733
AT1G10580	AT5G35735	0.00267994094546934
PNG1, AtPNG1	HUA1	0.0026769760073997602
OPR2, ATOPR2	AT5G50970	0.002676374702044317
mTERF16	AT3G21540	0.002675940381790402
CSD2, CZSOD2, SOD2, AtSOD2	RH39	0.002674528235191658
ALNS, TTL	AtPUB4, PUB4	0.0026732767465685835
AT3G11320	ATNDK1, NDPK1, NDK1	0.00267327548372249
AT4G14500	PP7, PSI2, ATPP7	0.0026725491869430515
AT5G53050	RCA	0.002671541665123657
SMU1	AT2G01060	0.0026699067691328135
HOS15, OLI1	UBC5	0.0026674441471343444
CHA19, CHR19, ETL1	VTE1, ATSDX1	0.002665796883236363
AtRbcX1, RbcX1	BCHA1, SPI	0.002664883395785465
AT1G28100	ATHK1, HK1, AHK1	0.002663800971495785
AT3G61870	RPP2D	0.0026616253067426555
SWP, ATMED14, MED14	ATCOP1, COP1, DET340, EMB168, FUS1	0.00266144745906499
LBD25	ATMDAR4, MDAR4	0.00266012967853288
TWD40-2	RH39	0.0026595473351493366
FUM1	PRK	0.0026572284537019664
STM, SHMT1, SHM1	HY3, PHYB, OOP1	0.0026571570487659533
MAGL13	ATCRE1, CRE1, WOL1, AHK4, WOL	0.0026571198112188277
alpha1-COP	CHR3, SYD	0.0026563164826333267
ATHO1, HY1, HY6, HO1, GUN2, TED4	ETR, EIN1, RDO3, ETR1, AtETR1	0.0026555368472231515
EMB2728, RPE	cpLEPA	0.0026522854733432998
CAT2	GIN2, HXK1, ATHXK1	0.0026518563109787082
NOS1, RIF1, SVR10, ATNOA1, ATNOS1, NOA1	AT5G51280	0.00265144017932331
AtSRT2, SRT2	AT-ACC1, 115D-4A, ACC1, PAS3, EMB22, GSD1, SFR3, GK	0.0026499523720485995
EMB2219	PBL27	0.0026467720818875626
ATSGS1, RECQ4A, ATRECQ4A	AHK2, HK2	0.0026444909145342276
HBP5, AtHBP5	EDM1, RPR1, ATSGT1B, SGT1B, ETA3	0.0026444398724539595
XUT1, RHS8	TMT2	0.002643926847969922
FY, WDR33	ATXR3, SDG2	0.0026423567640915017
CDSP32, TRXL1, ATCDSP32	AT1G71840	0.0026408798235237774
LOS2, ENO2	PFD3	0.0026389447143416
FBS4, AtFBS4	ADH2, HOT5, ATGSNOR1, PAR2, GSNOR	0.0026361909432047097
AT1G32127	CEV1, IXR1, ELI1, ATH-B, CESA3, MRE1, ATCESA3	0.0026359566661167517
AT1G55750	CLI186, LAZ2, EFS, SDG8, CCR1, ASHH2	0.002635812944345863
JMJ22	MED6	0.0026344086434229586
ISE2, EMB25, PDE317, 115J-4A	PBL34	0.0026330898599904
GGP, VTC2	AT-ACC1, 115D-4A, ACC1, PAS3, EMB22, GSD1, SFR3, GK	0.0026326777925798966
IM1, IM, PTOX	DJA6	0.0026289765353640533
VIP4	MAF1	0.0026248187708785473
RH29	AT1G24610	0.002623451109729187
AtHBP1, SOUL1, cHBP1, HBP1	UPL5	0.0026164399590711766
AT2G21530	PHOT2, AtPHOT2, NPL1	0.0026159039947485133
AT1G22460	SIGA, SIGB, ATSIG1, ATSIG2, SIG1, SIG2, ABC1	0.0026145578324325664
CRLK1	ATSAC1, SAC1	0.002613312835642599
PP7, PSI2, ATPP7	AT3G18060	0.002611528975412311
NOT9a	Oma1	0.00261071978029043
TRFL6	NAA10	0.002607694603820347
SECA1, AGY1, AtcpSecA	ASG1	0.0026069540952842344
AT1G24610	AtMYB4R1, MYB4R1	0.0026064503898744263
RH36, AtRH36, SWA3	TBL16	0.002604694132546067
AT5G63630	SRF8	0.002604378386788345
AT3G59780	BCHA1, SPI	0.0026040857358041163
AT2G38905	AtFKBP16-1, FKBP16-1	0.0026027372326872934
CHR8	NQR	0.002601305821424407
AT1G71840	PDI2, ATPDIL1-4, ATPDI2, PDIL1-4	0.002601267925150303
CSDP1, AtCSP1, CSP1	AT2G43320	0.002601089812310485
FIB4, FBN4	AT5G17370	0.0025986462810210966
FTSH2, VAR2	SWA1, EDA13, EDA19	0.002596517918853122
ATMSD1, MEE33, MSD1, AtSOD1	cpLEPA	0.0025955935699715584
VRLK1	ATCPSF30, OXT6, CPSF30	0.0025947381201729485
KEA3, ATKEA3	NF-YC11	0.002593568928825257
ALKBH6	AT5G35735	0.0025917545617390432
OHP1, PDE335, OHP	POB1, ATPOB1, AHT1, LRB2	0.002591072233685271
HAC07, HAC7, HAG2, HAG02	LOS4	0.0025903401976838584
MSRB1, ATMSRB1	EMB2728, RPE	0.0025867243777970817
TRM2a, AtTRM2a	CHA19, CHR19, ETL1	0.0025830062325622512
EMB3126, PRPL1	RLT2	0.0025818306079925498
RID3	ABAR, CHLH, GUN5, CCH, CCH1	0.00258036215762648
KIN10, SNRK1, AKIN10, SnRK1	EMB2785	0.0025802651000002832
HEMA1, GluTR, AtHEMA1	ATRX, CHR20	0.00258020010534619
TOZ	ATPUB13, PUB13	0.0025761654208429183
FBH1, CFLAP2	AT1G26300	0.0025755241447834956
EMB76, SIN1, SUS1, ATDCL1, DCL1, ASU1, EMB60, CAF	AT5G35735	0.002573561663635588
AT2G43110	MAPKKK3, MAP3KA	0.002573144010001877
SIRB, ATSIRB	AT2G43320	0.0025681958906975623
VTE1, ATSDX1	AT1G11360	0.002559117158597501
CLF, ICU1, SET1, SDG1	LOS5, SIR3, ACI2, ABA3, ATABA3, AtLOS5, GIN5	0.002557155899997327
AT2G34750	LOS6, NPQ2, ZEP, ABA1, ATABA1, ATZEP, IBS3	0.002554720487920035
ATSAC1, SAC1	PGSIP8	0.00255247268444412
CYR1, VEF2, EMF2, AtEMF2	REIL1	0.0025519570004517017
ARS1	LHCB2, DEG13, LHCB2, LHCB2	0.0025518387775029052
AT3G24190	AT2G30050	0.0025489774181778713
AT1G11930	LSMT-L	0.0025486023955365936
SKB1, AtPMRT5, CAU1, PRMT5	AtOCT4, OCT4	0.0025477669878508687
ATMPK1, MPK1	ATNDK1, NDPK1, NDK1	0.002547388799784488
AtRABG3d, RABG3d	ACG1, NFC4, ATMSI4, MSI4, FVE, NFC04	0.0025461502306930316
AT2G43770	RID3	0.0025435458844839036
HTD1	AtHMP14, ATX1, ATATX1	0.0025407230960949123
SVR3	AT4G17020	0.0025347767692828534
PDH2	ATPRX Q, PRXQ	0.0025298353003215166
ATXR7, SDG25	HK5, CKI2, AHK5	0.002527915313535476
ATXR3, SDG2	ORM2, AtORM2	0.0025244965220408777
AT3G03100	AAT3, ATAAT1, ASP5	0.002523475619552403
AT5G12010	ROL5	0.0025229761654815366
ATTRB1, TRB1	HTD1	0.0025159715422209254
OASB, CPACS1, ACS1, ATCS-B	GTE01, IMB1, GTE1	0.0025157777973817117
RER1	XUT1, RHS8	0.002515560418976745
MAPKKK3, MAP3KA	CHR12, ATCHR12	0.00251512596836559
PINP1, CUV, PRP16, EMB3011, FEY	ORM2, AtORM2	0.0025151135636791075
AtTLP3, TLP3	PSY	0.002515009110331613
RLT2	LSMT-L	0.0025139993680316085
VDAC3, AtVDAC-3, ATVDAC3	AtGRXS17, GRXS17	0.0025138595836671686
AtCDC20, CDC20	CHR8	0.0025113046923896484
CRL, CAA33	CHY1	0.002511220153973219
AT1G32220	AT1G58060	0.00250940697848154
AT4G04940	EDM1, RPR1, ATSGT1B, SGT1B, ETA3	0.0025092979330877912
ATCYSB, ATCYS6, CYSB	SIZ1, ATSIZ1	0.002508854908175589
UBAC2A	AtYY1, YY1	0.002508175799468693
ACG1, NFC4, ATMSI4, MSI4, FVE, NFC04	CHR4, PKR1	0.002508014380463603
AT5G19210	HSP17C	0.00250689750392305
ASHR2, SDG39	AT4G04940	0.0025065747253047465
AT2G30050	SIR	0.002506460762902557
AT4G30600	AT1G11360	0.0025053885355542684
HAB1, AtHAB1	HK5, CKI2, AHK5	0.00250237608689123
FC2, FC-II, ATFC-II	MBP1, RPN10, ATMCB1, MCB1	0.0024994284359564425
ABCC5, ATABCC5, MRP5, ATMRP5	EMB1135, FGT1	0.0024989548918145227
SWA1, EDA13, EDA19	AT2G43110	0.0024975819572876988
CLC-F, ATCLC-F, CLCF	CHR12, ATCHR12	0.0024947236878522395
TAP1, ABCB26, ATTAP1	AT3G28880	0.0024938974320154322
TRR14	GIN2, HXK1, ATHXK1	0.0024911069311401245
PDX1, ATPDX1, ATPDX1, PDX1, RSR4	GAPA-2	0.002488498785585491
FADB, AtADS3, ADS3, FAD5, JB67	NQR	0.0024837837312903666
AtHsp70-1, HSP70-1, HSC70-1, HSC70, AT-HSC70-1	WRAP53	0.0024824852843009877
AT3G19970	ARA12, SBT1	0.00247918011705178
AtHMGB15, HMGBD15	XK2, XK-2	0.0024788216758817013
AT4G01860	FIB4, FBN4	0.0024783460769898335
DDW1	ATHO1, HY1, HY6, HO1, GUN2, TED4	0.002476237028364611
AT2G46290	BZIP28	0.0024757427570963647
TPR9	AT-ACC1, 115D-4A, ACC1, PAS3, EMB22, GSD1, SFR3, GK	0.0024753371216353166
AtWDR5a, WDR5a	AT1G62780	0.0024717671583525456
AT5G14050	mTERF16	0.002471373046507517
AT3G54460	DegP7, DEG7	0.0024713555596810317
AT4G17080	PDH2	0.0024707051582334933
NDPK2, NDPK IA, NDPK IA IA, NDPK1A, ATNDPK2	HY5, TED 5	0.0024698182836473018
ARIA	SRF8	0.0024675800075001568
ATNDK1, NDPK1, NDK1	JMJ22	0.0024675784739291487
ATMDAR1, MDAR1	SEU	0.00246442328886646
CHA2, BRM, ATBRM, FFO3, CHR2	ET2, ATET2	0.0024637961798977598
AT-ACA8, ACA8	HVA22E, ATHVA22E	0.00245364621944601
PHS1, PyrR	UVH1, RAD1, ATRAD1	0.0024519636519451577
VTC3	AtABCC13, MRP11, ABCC13, ATMRP11	0.00245185090854784
DDL	AT4G18905	0.002449679730409485
POB1, ATPOB1, AHT1, LRB2	AtHMGB15, HMGBD15	0.0024489242940475783
STA1, EMB2770	CHR4, PKR1	0.00244820676397369
AT2G01060	AT3G54460	0.0024435297886384465
FdC2	SAGL1	0.0024406044713618518
AT1G28140	KEA3, ATKEA3	0.0024404913556462533
AT4G36530	AtFH14, AFH14	0.0024402797019872436
AT1G27880	ORM2, AtORM2	0.0024378779597530468
cpLEPA	AT2G37220	0.0024374687861313327
LOS4	STA1, EMB2770	0.0024368531462942216
AT2G02370	HAC8, ELO3, AtELP3, HAG3, EAST1, ELP3	0.002432667820088982
PDF2	APRR7, PRR7	0.002426639466477235
emb1579, RSA1	DPB, ATDPB	0.002426017800734135
AT1G78995	ROL5	0.0024239871767702615
LRS1	FTSH2, VAR2	0.0024211793469967897
UVR1, UVH3	ADH2, HOT5, ATGSNOR1, PAR2, GSNOR	0.002420187582038749
IQD6	AT2G38820	0.002420029784817855
AT1G18335	SIGA, SIGB, ATSIG1, ATSIG2, SIG1, SIG2, ABC1	0.0024125989094062965
AtXRN3, XRN3	CCR2, CRTISO	0.002410407858075052
WTF1, AtWTF1	AT1G27880	0.0024078165824344714
AtGRXS17, GRXS17	AT2G42770	0.002405363420252547
HON5, CLPR4	HPPD, PDS1, HPD	0.00240390431539409
EMB93, SOLDAT10	POB1, ATPOB1, AHT1, LRB2	0.0024023643727824613
ATG18C, ATATG18C	TIL, ATTIL	0.002400441944815963
ATAOX1A, AOX1A, HSR3, AtHSR3	AT2G30050	0.0024004164183970386
RPP2D	CHR12, ATCHR12	0.0023988563402410016
TRM82, AtTRM82	AT3G54460	0.002398569921078218
AT1G33270	ATVT-1, HVT1	0.0023982118427882393
AT3G16840	UBC5	0.0023978851098682887
RH1, ATRH1	FBX2	0.002395625636670318
SCL5	ATGRAS2, GRAS2, SCL14	0.002392365952367123
SFR2, ATSFR2	POB1, ATPOB1, AHT1, LRB2	0.0023900864149592267
ATU2AF35B, U2AF35B	AT3G11320	0.0023884283701172083
AtGLYR1, GLYR1, ATGHBDH, GHBDH, GR1	APG6, AtCLPB3, CLPB3, CLPB-P	0.002385129065374235
AT2G36320	RGD3, CHA16, BTAF1, ATBTAF1, CHR16	0.00238383886833763
ATCPSF30, OXT6, CPSF30	AT1G74250	0.0023832869246337607
APE1	SEP2	0.002378780195889708
ATR1, AR1, AtCPR1	ATSGS1, RECQ4A, ATRECQ4A	0.0023766823699186567
DRB2, AtDRB2	AT5G50970	0.0023766519189149546
HSP60, HSP60-3B	MAPKKK3, MAP3KA	0.002374648339124597
ATPDR7, ABCG35, PDR7	WIN2	0.0023743225235019877
AT3G18060	AtDSE1, TAN, ALT2, EMB2757, DSE1	0.00237184987043716
FZR2, CCS52A1	AT5G51280	0.0023707283043423793
RH8, ATRH8	APRR7, PRR7	0.002369394566961164
BUB3	AtRABG3d, RABG3d	0.002369230794780747
HS3, EMB3108, RH22	IQD6	0.002369189611589918
GNAT1, SNAT2	AT1G28140	0.002368583574042432
XK2, XK-2	ATMRP6, ABCC8, MRP6	0.002368562145004133
MUM5, MUCI21	PRXIIF, ATPRXIIF	0.002368135663928493
ATRX, CHR20	ABAR, CHLH, GUN5, CCH, CCH1	0.00236551916377637
AT2G43320	RER1	0.002364626941357872
LCBK2	ATNDK1, NDPK1, NDK1	0.0023630142476925766
DA1	ATPDR7, ABCG35, PDR7	0.0023600223361291486
CHR1, DDM1, SOM4, CHA1, SOM1, CHR01, ATDDM1	CEV1, IXR1, ELI1, ATH-B, CESA3, MRE1, ATCESA3	0.002358210243992957
AtELP2, ELP2	ATCRM1, ATXPO1, XPO1, HIT2, XPO1A	0.00235548938525784
NF-YC11	MUM5, MUCI21	0.0023534959425433283
ABAR, CHLH, GUN5, CCH, CCH1	CAT2	0.0023518983975594635
BRR2c	HY3, PHYB, OOP1	0.0023508016363606053
AT4G24140	ALBA1, Atalba1, ALBA4	0.0023482316029650027
IWS1, ATIWS1, HNI9	AT3G18860	0.0023479687223718565
CDC2AAT, CDKA;1, CDK2, CDC2, CDKA1, CDC2A	Lhca5	0.0023453602091160117
EMB1135, FGT1	NF-YA7	0.0023402390758289525
EMB2785	ATNCED1, ATCCD1, CCD1, NCED1	0.0023374618194361868
PMSR3, ATMSRA3	AtRH20, RH20	0.002336878371627328
AT1G74790	MSBP2, MAPR3, ATMAPR3, ATMP2	0.002328352965630438
DJA7	AT4G14290	0.002326376202653633
BZIP28	SEP1	0.0023222532055386953
AT1G57770	SIGA, SIGB, ATSIG1, ATSIG2, SIG1, SIG2, ABC1	0.0023214189143841834
SMA1	SIGE, ATSIG5, SIG5	0.0023200739008481285
EDR2	LSMT-L	0.002317572440693162
AT2G04740	AT4G33625	0.002317532583065965
AT5G05130	LHCA2	0.002313557825031853
ATFPG-1, ATMMH-1, ATMMH-2, ATFPG-2, MMH-1, MMH-2, FPG-2, FPG-1, MMH	UVR1, UVH3	0.0023129916518134903
IRP6, RH14, DRH1, ATDRH1	AT5G54910	0.002311693591135984
LUT1, CYP97C1	CHR4, PKR1	0.0023084776977527854
MBP1, RPN10, ATMCB1, MCB1	AT5G41380	0.0023082878123101736
AtMYB4R1, MYB4R1	PGR5, AtPGR5	0.0023063754099916997
AtPARK13, PARK13, DEG14	OOP2, BLU1, ATCRY1, CRY1, HY4	0.0023059325320224267
SRF8	FADC, SFD4, FAD6	0.002299792508787443
HSFA1B, HSF3, ATHSF3, ATHSFA1B	LRB1	0.0022973044695909534
AT3G21540	IM1, IM, PTOX	0.002294087909052615
CSU2	bZIP23, AtbZIP23	0.0022917579690954
AT4G03020	RER1	0.0022821730316845566
AT1G16250	ACD1, LLS1, PAO	0.002282060180132838
AT2G38250	RER1	0.00228009727526113
ATMAK3	OWL1	0.002280043652992411
PRXIIF, ATPRXIIF	CHR4, PKR1	0.002279756605960522
LHCB2, LHCB2	ATNHX7, ATSOS1, SOS1	0.00227539076954866
AT1G75340	LHCB3, LHCB31	0.00227406223343805
FBX2	LBD25	0.0022736447448673714
RPN2, HAP6	UVH6, ATXPD	0.0022736436075126852
emb1967	ATPRX Q, PRXQ	0.002267285859151357
MIZ2, VAN7, EMB30, 112A-2A, GNOM, GN	LUT2	0.0022648048703661416
AT3G28880	MED18	0.0022595728843560533
EDM1, RPR1, ATSGT1B, SGT1B, ETA3	SIR	0.002257085942550442
CGE1, EMB1241	ATRX, CHR20	0.002250625398045902
ATNBS1, NBS1	AT5G15270	0.002249862346436121
PFD3	LHCA3	0.0022492167255043
AT3G15610	AT4G04940	0.0022491501488816766
CHR3, SYD	CSTF50	0.0022473252024060217
SEC31B	AT5G52450	0.0022436723225929297
PDS3, PDE226, PDS	epsilon1-COP	0.0022421205376529367
ALDH5F1, ENF1, SSADH1, SSADH	LHCB2, LHCB2	0.0022416689943223433
ILR3, bHLH105	AT2G16405	0.0022399275865881848
ATCLC-E, CLC-E, CLCE	ATERF-9, ERF9, ATERF9	0.0022337854489656115
LSMT-L	RP1, ATRP1	0.002229415170210338
BIL2	YCF32, PSBY	0.0022279359764418834
NLE, AtNLE	AT5G05130	0.002220663664703634
TOR	FdC2	0.0022184580641376166
LST8-1	AtMYB109, MYB109	0.0022163688467208083
PRPL11	HY5, TED 5	0.00221078167268178
ERF10, ATERF10	AT4G39780	0.0022071651394210035
GSTF10, ATGSTF10, ERD13, ATGSTF4	PIFI	0.00220405314593871
AT4G03150	TPR9	0.0022019651102965477
AT4G14270	ATPEX7, PEX7	0.002199888105119312
RVE1	AT1G32220	0.0021979063974926767
PCK1, ASL5, LBD12	AT3G16840	0.00219769353193815
AT2G44020	AtNCER1	0.0021895500865514424
AT1G50020	AT3G59780	0.0021869161985578916
AtHMP03, ATCCS, CCS	RPL23A2, RPL23AB	0.002185131507113368
AtGLYI6	CP12, CP12-1	0.0021793557936625207
AtGNA1, GNA1	GF14 IOTA, GRF12	0.00217162540085297
IEN1, AtSFR6, YID1, MED16, GLH2, SFR6	AT5G20500	0.002164283671378103
GWD, GWD1, SOP1, SOP, SEX1	SSRP1, HMG, ATHMG, NFD	0.0021541190205351135
BCH1, chy1, B1, BETA-OHASE 1	VIP4	0.002152817774819147
AT3G60450	PAC	0.00215155564242704
HIRA	EMB93, SOLDAT10	0.002145231114839692
SUVH4, KYP, SDG33	AtSTOP1, STOP1	0.0021448421313588384
AT4G18905	ADH2, HOT5, ATGSNOR1, PAR2, GSNOR	0.0021435236503423768
RP1, ATRP1	SUVH4, KYP, SDG33	0.00214249833743513
AtHSBP, HSBP	ESD6, HOS1	0.0021399653451157066
AT3G23510	PAT1	0.0021379037629092445
SKI8, VIP3	AtCDC20, CDC20	0.0021359618522897856
ELP6, MOP2	CSTF50	0.00212921798206586
AKR4C9, ChlAKR	STM, SHMT1, SHM1	0.0021278614257952146
AT3G18470	ATCRM1, ATXPO1, XPO1, HIT2, XPO1A	0.0021278454847622834
EMB2733, GSM1, ESP3, RSW12	AT5G15870	0.002127378507426255
AT5G41020	AtPUB4, PUB4	0.00212515632624838
ALDH11A3	HCEF1, cfbp1	0.0021229066745154465
AT5G07810	LHCB2, LHCB2	0.0021218515597964853
HLP1, HKL	AT5G63630	0.002117112523116624
ABA4	chr13, SRCAP, PIE1	0.0021095913034548447
AT5G54860	AT2G42770	0.0021085300015537874
AT2G40116	ATPK19, ATS6K2, ATPK2, S6K2	0.00210611437908123
A/N-InvE, At-A/N-InvE, INV-E	AT4G04940	0.0020899160432807633
PLDDELTA, ATPLDDELTA	AT4G03150	0.0020770484654032842
ERF71, AtERF71, HRE2	DDL	0.002075433646848515
MED6	AT3G26560	0.002069808230639157
WRAP53	HEMA1, GluTR, AtHEMA1	0.0020673025100390006
BMY4, BAM7	SSL2, CHR6, CHD3, GYM, HRB2, EPP1, LWR1, CKH2, PKL	0.002067247450362517
AT5G54910	ATSGS1, RECQ4A, ATRECQ4A	0.0020628334308200233
ORM2, AtORM2	EMB3126, PRPL1	0.0020624888072899934
PHYLLO	AtRH3, RH3, emb1138	0.0020612628940997794
CHA18, CHR18	DJA6	0.0020586208164863336
ASG2	AT2G04740	0.0020583449559351897
ABCI20, NAP9, ATNAP9	LFG5, AtLFG5	0.00205668605872834
FLU	RAD5, RAD5A	0.0020507411553099208
PGR5, AtPGR5	STM, SHMT1, SHM1	0.0020402107146038967
emb1345, CIA1	ATSGS1, RECQ4A, ATRECQ4A	0.002037326230387055
PRP17, CDC40	CSDP1, AtCSP1, CSP1	0.00203637938259157
UVH1, RAD1, ATRAD1	ATCOP1, COP1, DET340, EMB168, FUS1	0.002033390109136203
BKK1, ATSERK4, SERK4, BAK7	ATG9, ATAPG9, APG9	0.0020308853711413334
PSE1	AtHMP14, ATX1, ATATX1	0.0020166919426372085
AT3G18600	RAD5, RAD5A	0.0020143854075133742
NF-YA7	ATSGS1, RECQ4A, ATRECQ4A	0.0020049366849770617
AT3G44620	Lhca5	0.002004839473532777
OSCA1	ATSGS1, RECQ4A, ATRECQ4A	0.001996793084344912
AtCEST, CEST, Y3IP1	TBL16	0.001991363478724837
AT2G45010	PAT1	0.0019906160270965834
UBC5	SEP2	0.001989516574603481
TRAPPC2	ATMRP6, ABCC8, MRP6	0.001987068551864207
AT5G20500	PSY	0.0019842258286676185
AT1G35340	AT3G27320	0.001983608450162273
PAC	OHP1, PDE335, OHP	0.0019758368781997355
AtFKBP16-1, FKBP16-1	AT2G45010	0.0019692701939228027
AT5G47790	PGSIP8	0.0019669412281792275
APX6	SEU	0.0019510793130389965
AT1G26300	ALKBH6	0.0019462080202867233
TIC55-IV, ACD1-LIKE, PTC52	VTE1, ATSDX1	0.0019420621548561375
FBN1b	AtHMGB15, HMGBD15	0.0019380269753470757
AT1G74070	NQR	0.0019321261331029333
AT3G26560	ATCPN21, CPN20, CPN21, CHCPN10, CPN10	0.0019314732592332457
APRF1, S2La	RH18	0.001918951979854085
AtABCC13, MRP11, ABCC13, ATMRP11	CDC2AAT, CDKA;1, CDK2, CDC2, CDKA1, CDC2A	0.0018966776353540478
RCF1	bZIP44, AtbZIP44	0.0018857315927674541
AtNCER1	EDM1, RPR1, ATSGT1B, SGT1B, ETA3	0.0018846674622135095
AT4G17020	AT5G35735	0.0018665173399937966
PGSIP8	ATABCG40, ABCG40, PDR12, ATPDR12	0.0018652502968035504
GEMIN2	AT5G39840	0.0018523294885066258
Fes1A	SUVH4, KYP, SDG33	0.0018489084912685877
ALX8, SUPO1, AtFRY1, HOS2, ATSAL1, SAL1, RON1, FRY1	RH1, ATRH1	0.0018405403290878983
OZS3	CHA2, BRM, ATBRM, FFO3, CHR2	0.0018399209194340062
AT5G39840	POB1, ATPOB1, AHT1, LRB2	0.001838718577572759
SIGE, ATSIG5, SIG5	SEU	0.0018362246339236029
ATNHX7, ATSOS1, SOS1	AT1G33270	0.0018257020380041645
AT2G18900	AT1G74070	0.001819738363633261
TBL16	ATHSP101, HSP101, HOT1	0.0018176671646518293
AT1G58060	RH8, ATRH8	0.001797648687188512
CYP71, AtCYP71	SWA1, EDA13, EDA19	0.0017856401957548607
MSI1, MEE70, ATMSI1	AtHSBP, HSBP	0.0017777739103287179
PIAL2	POB1, ATPOB1, AHT1, LRB2	0.0017752402674691252
AT2G40770	bZIP23, AtbZIP23	0.0017718303181725042
AT5G15870	AT3G59780	0.00174221710834071
LHCB1, AB140, CAB140, CAB1	CLF, ICU1, SET1, SDG1	0.0017306239019242219
SEP1	UVR1, UVH3	0.001720960718873919
AT5G42700	ATAN11, LWD1	0.0017122170811846502
PFD6	AtRH3, RH3, emb1138	0.0016995662657186784
MKK9, ATMKK9	ATCPSF30, OXT6, CPSF30	0.0016693274772505199
ATMRP6, ABCC8, MRP6	SECE1	0.001667381095234598
AAE7, BZU1, ACN1	HPPD, PDS1, HPD	0.0016419299069159936
AtSLD2, SLD2	LHCB3, LHCB31	0.001641588032571858
ATX3, SDG14	VDAC3, AtVDAC-3, ATVDAC3	0.0016275210422844267
LSM1B	ERF71, AtERF71, HRE2	0.0016203438816851006
RAE1	AT1G75460	0.0016169676974287157
AT1G10320	AT4G24140	0.0015917381564420111
HIL1	AT5G39840	0.0014930993646074277
PSBQ-2, PSBQ, PSII-Q	APX4, TL29	0.001458763318229025
AT5G48790	AT3G24190	0.0014296241807781897
EML3, AtEML3	HSFA1B, HSF3, ATHSF3, ATHSFA1B	0.001376568457345537
