nodeName	altName	nodeAttr[nodesPresent, ]
Pp3c1_12080V3	NA	cyan
Pp3c1_15740V3	NA	cyan
Pp3c1_16440V3	NA	cyan
Pp3c1_18200V3	NA	cyan
Pp3c1_20900V3	NA	cyan
Pp3c1_21360V3	NA	cyan
Pp3c1_22620V3	NA	cyan
Pp3c1_23970V3	NA	cyan
Pp3c1_28340V3	NA	cyan
Pp3c1_30380V3	NA	cyan
Pp3c1_32230V3	NA	cyan
Pp3c1_33220V3	NA	cyan
Pp3c1_33440V3	NA	cyan
Pp3c1_35130V3	NA	cyan
Pp3c1_35675V3	NA	cyan
Pp3c1_36570V3	NA	cyan
Pp3c1_37450V3	NA	cyan
Pp3c1_42090V3	NA	cyan
Pp3c1_42450V3	NA	cyan
Pp3c1_470V3	NA	cyan
Pp3c1_7520V3	NA	cyan
Pp3c1_7800V3	NA	cyan
Pp3c1_7870V3	NA	cyan
Pp3c10_1440V3	NA	cyan
Pp3c10_16860V3	NA	cyan
Pp3c10_17630V3	NA	cyan
Pp3c10_21600V3	NA	cyan
Pp3c10_21640V3	NA	cyan
Pp3c10_2240V3	NA	cyan
Pp3c10_25030V3	NA	cyan
Pp3c10_2540V3	NA	cyan
Pp3c10_25720V3	NA	cyan
Pp3c10_6330V3	NA	cyan
Pp3c10_7760V3	NA	cyan
Pp3c10_9120V3	NA	cyan
Pp3c11_15420V3	NA	cyan
Pp3c11_16970V3	NA	cyan
Pp3c11_18730V3	NA	cyan
Pp3c11_18990V3	NA	cyan
Pp3c11_22280V3	NA	cyan
Pp3c11_2240V3	NA	cyan
Pp3c11_22530V3	NA	cyan
Pp3c11_23810V3	NA	cyan
Pp3c11_3190V3	NA	cyan
Pp3c11_5340V3	NA	cyan
Pp3c11_5580V3	NA	cyan
Pp3c11_7720V3	NA	cyan
Pp3c12_10030V3	NA	cyan
Pp3c12_11350V3	NA	cyan
Pp3c12_11410V3	NA	cyan
Pp3c12_14430V3	NA	cyan
Pp3c12_21020V3	NA	cyan
Pp3c12_21300V3	NA	cyan
Pp3c12_23330V3	NA	cyan
Pp3c12_23490V3	NA	cyan
Pp3c13_1250V3	NA	cyan
Pp3c13_12610V3	NA	cyan
Pp3c13_13199V3	NA	cyan
Pp3c13_13900V3	NA	cyan
Pp3c13_14800V3	NA	cyan
Pp3c13_15420V3	NA	cyan
Pp3c13_16980V3	NA	cyan
Pp3c13_17110V3	NA	cyan
Pp3c13_17480V3	NA	cyan
Pp3c13_19370V3	NA	cyan
Pp3c13_19650V3	NA	cyan
Pp3c13_20930V3	NA	cyan
Pp3c13_21460V3	NA	cyan
Pp3c13_8200V3	NA	cyan
Pp3c13_8710V3	NA	cyan
Pp3c13_8760V3	NA	cyan
Pp3c14_11360V3	NA	cyan
Pp3c14_14690V3	NA	cyan
Pp3c14_15540V3	NA	cyan
Pp3c14_15830V3	NA	cyan
Pp3c14_16580V3	NA	cyan
Pp3c14_17190V3	NA	cyan
Pp3c14_1880V3	NA	cyan
Pp3c14_21060V3	NA	cyan
Pp3c14_21120V3	NA	cyan
Pp3c14_21300V3	NA	cyan
Pp3c14_23580V3	NA	cyan
Pp3c14_24090V3	NA	cyan
Pp3c14_5410V3	NA	cyan
Pp3c14_5830V3	NA	cyan
Pp3c14_6050V3	NA	cyan
Pp3c15_1050V3	NA	cyan
Pp3c15_10550V3	NA	cyan
Pp3c15_12130V3	NA	cyan
Pp3c15_12290V3	NA	cyan
Pp3c15_12690V3	NA	cyan
Pp3c15_1340V3	NA	cyan
Pp3c15_14440V3	NA	cyan
Pp3c15_17120V3	NA	cyan
Pp3c15_20130V3	NA	cyan
Pp3c15_21890V3	NA	cyan
Pp3c15_22980V3	NA	cyan
Pp3c15_23950V3	NA	cyan
Pp3c15_4380V3	NA	cyan
Pp3c15_5280V3	NA	cyan
Pp3c15_5450V3	NA	cyan
Pp3c15_5630V3	NA	cyan
Pp3c15_5890V3	NA	cyan
Pp3c15_6750V3	NA	cyan
Pp3c15_9330V3	NA	cyan
Pp3c16_10100V3	NA	cyan
Pp3c16_10640V3	NA	cyan
Pp3c16_11480V3	NA	cyan
Pp3c16_12520V3	NA	cyan
Pp3c16_13960V3	NA	cyan
Pp3c16_16520V3	NA	cyan
Pp3c16_16780V3	NA	cyan
Pp3c16_17450V3	NA	cyan
Pp3c16_17510V3	NA	cyan
Pp3c16_18430V3	NA	cyan
Pp3c16_18760V3	NA	cyan
Pp3c16_18850V3	NA	cyan
Pp3c16_18860V3	NA	cyan
Pp3c16_19110V3	NA	cyan
Pp3c16_20720V3	NA	cyan
Pp3c16_20923V3	NA	cyan
Pp3c16_20970V3	NA	cyan
Pp3c16_25330V3	NA	cyan
Pp3c16_2550V3	NA	cyan
Pp3c16_25880V3	NA	cyan
Pp3c16_4660V3	NA	cyan
Pp3c16_5370V3	NA	cyan
Pp3c16_590V3	NA	cyan
Pp3c17_15560V3	NA	cyan
Pp3c17_20650V3	NA	cyan
Pp3c17_2560V3	NA	cyan
Pp3c17_2620V3	NA	cyan
Pp3c17_5710V3	NA	cyan
Pp3c17_7620V3	NA	cyan
Pp3c17_7960V3	NA	cyan
Pp3c17_9270V3	NA	cyan
Pp3c18_11800V3	NA	cyan
Pp3c18_1290V3	NA	cyan
Pp3c18_13680V3	NA	cyan
Pp3c18_13990V3	NA	cyan
Pp3c18_14260V3	NA	cyan
Pp3c18_17600V3	NA	cyan
Pp3c18_18780V3	NA	cyan
Pp3c18_19000V3	NA	cyan
Pp3c18_21320V3	NA	cyan
Pp3c18_8170V3	NA	cyan
Pp3c19_11580V3	NA	cyan
Pp3c19_14040V3	NA	cyan
Pp3c19_15000V3	NA	cyan
Pp3c19_1580V3	NA	cyan
Pp3c19_17300V3	NA	cyan
Pp3c19_20160V3	NA	cyan
Pp3c19_21190V3	NA	cyan
Pp3c19_21680V3	NA	cyan
Pp3c19_21980V3	NA	cyan
Pp3c19_22330V3	NA	cyan
Pp3c19_3420V3	NA	cyan
Pp3c19_3590V3	NA	cyan
Pp3c19_4220V3	NA	cyan
Pp3c19_4690V3	NA	cyan
Pp3c19_8620V3	NA	cyan
Pp3c2_10220V3	NA	cyan
Pp3c2_10530V3	NA	cyan
Pp3c2_1090V3	NA	cyan
Pp3c2_11160V3	NA	cyan
Pp3c2_12150V3	NA	cyan
Pp3c2_12240V3	NA	cyan
Pp3c2_16660V3	NA	cyan
Pp3c2_17250V3	NA	cyan
Pp3c2_17560V3	NA	cyan
Pp3c2_1820V3	NA	cyan
Pp3c2_1860V3	NA	cyan
Pp3c2_20180V3	NA	cyan
Pp3c2_24721V3	NA	cyan
Pp3c2_24980V3	NA	cyan
Pp3c2_25680V3	NA	cyan
Pp3c2_30270V3	NA	cyan
Pp3c2_350V3	NA	cyan
Pp3c2_35800V3	NA	cyan
Pp3c2_7400V3	NA	cyan
Pp3c20_11960V3	NA	cyan
Pp3c20_13310V3	NA	cyan
Pp3c20_14400V3	NA	cyan
Pp3c20_16230V3	NA	cyan
Pp3c20_18520V3	NA	cyan
Pp3c20_19210V3	NA	cyan
Pp3c20_23490V3	NA	cyan
Pp3c20_4050V3	NA	cyan
Pp3c20_7130V3	NA	cyan
Pp3c20_7710V3	NA	cyan
Pp3c20_9240V3	NA	cyan
Pp3c21_10720V3	NA	cyan
Pp3c21_14920V3	NA	cyan
Pp3c21_14960V3	NA	cyan
Pp3c21_15780V3	NA	cyan
Pp3c21_19280V3	NA	cyan
Pp3c21_19940V3	NA	cyan
Pp3c21_5400V3	NA	cyan
Pp3c21_6390V3	NA	cyan
Pp3c22_12260V3	NA	cyan
Pp3c22_13190V3	NA	cyan
Pp3c22_1800V3	NA	cyan
Pp3c22_20130V3	NA	cyan
Pp3c22_20230V3	NA	cyan
Pp3c22_23000V3	NA	cyan
Pp3c22_23120V3	NA	cyan
Pp3c22_3230V3	NA	cyan
Pp3c22_3260V3	NA	cyan
Pp3c22_5250V3	NA	cyan
Pp3c22_5440V3	NA	cyan
Pp3c22_7870V3	NA	cyan
Pp3c22_7880V3	NA	cyan
Pp3c22_810V3	NA	cyan
Pp3c22_840V3	NA	cyan
Pp3c22_9250V3	NA	cyan
Pp3c23_13140V3	NA	cyan
Pp3c23_15410V3	NA	cyan
Pp3c23_16880V3	NA	cyan
Pp3c23_19630V3	NA	cyan
Pp3c23_20720V3	NA	cyan
Pp3c23_21390V3	NA	cyan
Pp3c23_21860V3	NA	cyan
Pp3c23_3440V3	NA	cyan
Pp3c23_5150V3	NA	cyan
Pp3c23_5660V3	NA	cyan
Pp3c23_7680V3	NA	cyan
Pp3c23_8390V3	NA	cyan
Pp3c23_8600V3	NA	cyan
Pp3c23_9480V3	NA	cyan
Pp3c24_12180V3	NA	cyan
Pp3c24_12294V3	NA	cyan
Pp3c24_14510V3	NA	cyan
Pp3c24_16150V3	NA	cyan
Pp3c24_16310V3	NA	cyan
Pp3c24_17380V3	NA	cyan
Pp3c24_17620V3	NA	cyan
Pp3c24_18710V3	NA	cyan
Pp3c24_19480V3	NA	cyan
Pp3c24_2460V3	NA	cyan
Pp3c24_4880V3	NA	cyan
Pp3c24_5140V3	NA	cyan
Pp3c24_6160V3	NA	cyan
Pp3c24_9110V3	NA	cyan
Pp3c25_1050V3	NA	cyan
Pp3c25_11300V3	NA	cyan
Pp3c25_12650V3	NA	cyan
Pp3c25_330V3	NA	cyan
Pp3c25_4880V3	NA	cyan
Pp3c25_50V3	NA	cyan
Pp3c25_5890V3	NA	cyan
Pp3c25_6480V3	NA	cyan
Pp3c25_950V3	NA	cyan
Pp3c25_9990V3	NA	cyan
Pp3c26_12660V3	NA	cyan
Pp3c26_13490V3	NA	cyan
Pp3c26_2050V3	NA	cyan
Pp3c26_2600V3	NA	cyan
Pp3c26_3360V3	NA	cyan
Pp3c26_3830V3	NA	cyan
Pp3c26_8300V3	NA	cyan
Pp3c27_2050V3	NA	cyan
Pp3c27_2200V3	NA	cyan
Pp3c27_2580V3	NA	cyan
Pp3c27_2910V3	NA	cyan
Pp3c27_5100V3	NA	cyan
Pp3c27_5110V3	NA	cyan
Pp3c27_70V3	NA	cyan
Pp3c3_1210V3	NA	cyan
Pp3c3_15310V3	NA	cyan
Pp3c3_15340V3	NA	cyan
Pp3c3_17970V3	NA	cyan
Pp3c3_2100V3	NA	cyan
Pp3c3_22300V3	NA	cyan
Pp3c3_23160V3	NA	cyan
Pp3c3_23360V3	NA	cyan
Pp3c3_23920V3	NA	cyan
Pp3c3_27350V3	NA	cyan
Pp3c3_31560V3	NA	cyan
Pp3c3_33210V3	NA	cyan
Pp3c3_35160V3	NA	cyan
Pp3c3_35340V3	NA	cyan
Pp3c3_5540V3	NA	cyan
Pp3c3_6980V3	NA	cyan
Pp3c3_9180V3	NA	cyan
Pp3c3_9350V3	NA	cyan
Pp3c3_9650V3	NA	cyan
Pp3c4_12430V3	NA	cyan
Pp3c4_1360V3	NA	cyan
Pp3c4_16470V3	NA	cyan
Pp3c4_16910V3	NA	cyan
Pp3c4_17110V3	NA	cyan
Pp3c4_17910V3	NA	cyan
Pp3c4_18030V3	NA	cyan
Pp3c4_18280V3	NA	cyan
Pp3c4_19410V3	NA	cyan
Pp3c4_19960V3	NA	cyan
Pp3c4_22080V3	NA	cyan
Pp3c4_24420V3	NA	cyan
Pp3c4_2590V3	NA	cyan
Pp3c4_27320V3	NA	cyan
Pp3c4_27650V3	NA	cyan
Pp3c4_29040V3	NA	cyan
Pp3c4_30040V3	NA	cyan
Pp3c4_3420V3	NA	cyan
Pp3c4_3530V3	NA	cyan
Pp3c4_3810V3	NA	cyan
Pp3c4_6340V3	NA	cyan
Pp3c4_7130V3	NA	cyan
Pp3c4_7965V3	NA	cyan
Pp3c4_810V3	NA	cyan
Pp3c5_10370V3	NA	cyan
Pp3c5_15380V3	NA	cyan
Pp3c5_18730V3	NA	cyan
Pp3c5_20400V3	NA	cyan
Pp3c5_21760V3	NA	cyan
Pp3c5_22400V3	NA	cyan
Pp3c5_22540V3	NA	cyan
Pp3c5_22610V3	NA	cyan
Pp3c5_24050V3	NA	cyan
Pp3c5_25080V3	NA	cyan
Pp3c5_25220V3	NA	cyan
Pp3c5_25610V3	NA	cyan
Pp3c5_4510V3	NA	cyan
Pp3c5_6120V3	NA	cyan
Pp3c5_6660V3	NA	cyan
Pp3c5_8740V3	NA	cyan
Pp3c6_10500V3	NA	cyan
Pp3c6_16010V3	NA	cyan
Pp3c6_16520V3	NA	cyan
Pp3c6_16630V3	NA	cyan
Pp3c6_1770V3	NA	cyan
Pp3c6_17860V3	NA	cyan
Pp3c6_18720V3	NA	cyan
Pp3c6_21010V3	NA	cyan
Pp3c6_22250V3	NA	cyan
Pp3c6_23270V3	NA	cyan
Pp3c6_23420V3	NA	cyan
Pp3c6_25320V3	NA	cyan
Pp3c6_2960V3	NA	cyan
Pp3c6_3910V3	NA	cyan
Pp3c6_520V3	NA	cyan
Pp3c6_560V3	NA	cyan
Pp3c6_8560V3	NA	cyan
Pp3c7_12670V3	NA	cyan
Pp3c7_13060V3	NA	cyan
Pp3c7_14590V3	NA	cyan
Pp3c7_16840V3	NA	cyan
Pp3c7_20170V3	NA	cyan
Pp3c7_23660V3	NA	cyan
Pp3c7_23900V3	NA	cyan
Pp3c7_25750V3	NA	cyan
Pp3c7_2800V3	NA	cyan
Pp3c7_2840V3	NA	cyan
Pp3c7_5840V3	NA	cyan
Pp3c7_8990V3	NA	cyan
Pp3c7_9260V3	NA	cyan
Pp3c8_10210V3	NA	cyan
Pp3c8_13750V3	NA	cyan
Pp3c8_14060V3	NA	cyan
Pp3c8_19850V3	NA	cyan
Pp3c8_25400V3	NA	cyan
Pp3c8_4660V3	NA	cyan
Pp3c8_7050V3	NA	cyan
Pp3c8_7230V3	NA	cyan
Pp3c9_11070V3	NA	cyan
Pp3c9_13290V3	NA	cyan
Pp3c9_13510V3	NA	cyan
Pp3c9_14080V3	NA	cyan
Pp3c9_18580V3	NA	cyan
Pp3c9_18900V3	NA	cyan
Pp3c9_19040V3	NA	cyan
Pp3c9_20540V3	NA	cyan
Pp3c9_23430V3	NA	cyan
Pp3c9_24070V3	NA	cyan
Pp3c9_3410V3	NA	cyan
Pp3c9_4480V3	NA	cyan
Pp3c9_5720V3	NA	cyan
Pp3c9_5820V3	NA	cyan
Pp3c9_6890V3	NA	cyan
Pp3c9_8440V3	NA	cyan
Pp3c9_8740V3	NA	cyan
Pp3s1097_10V3	NA	cyan
