{
	"n_targets": 20030,
	"n_bootstraps": 100,
	"n_processed": 35376153,
	"n_pseudoaligned": 24319761,
	"n_unique": 21072988,
	"p_pseudoaligned": 68.7,
	"p_unique": 59.6,
	"kallisto_version": "0.48.0",
	"index_version": 10,
	"start_time": "Fri Mar  3 13:31:26 2023",
	"call": "kallisto quant --bootstrap-samples 100 --rf-stranded -t 20 -i /scratch/users/dadras/Stress_profiling_of_zygnema_circumcarinatum_1b/kallisto_index/SAG698_1b_CDS.fna.idx -o /scratch/users/dadras/Stress_profiling_of_zygnema_circumcarinatum_1b/kallisto/Z_1_35_EKRN220057114-1A_HLN7GDSX5_L4 /scratch/users/dadras/Stress_profiling_of_zygnema_circumcarinatum_1b/trimmed_reads_PE/Z_1_35_EKRN220057114-1A_HLN7GDSX5_L4_1.fq.gz /scratch/users/dadras/Stress_profiling_of_zygnema_circumcarinatum_1b/trimmed_reads_PE/Z_1_35_EKRN220057114-1A_HLN7GDSX5_L4_2.fq.gz"
}
