geneID	cold_0.5h_rep1	cold_0.5h_rep2	cold_0.5h_rep3	cold_1h_rep1	cold_1h_rep2	cold_1h_rep3	cold_2h_rep1	cold_2h_rep2	cold_2h_rep3	cold_4h_rep1	cold_4h_rep2	cold_4h_rep3	cold_6h_rep1	cold_6h_rep2	cold_6h_rep3	cold_24h_rep1	cold_24h_rep2	cold_24h_rep3	control_0h_rep1	control_0h_rep2	control_0h_rep3	control_0h_rep4	control_0h_rep5	control_0h_rep6	control_0.5h_rep1	control_0.5h_rep2	control_0.5h_rep3	control_1h_rep1	control_1h_rep2	control_1h_rep3	control_2h_rep1	control_2h_rep2	control_2h_rep3	control_4h_rep1	control_4h_rep2	control_4h_rep3	control_6h_rep1	control_6h_rep2	control_6h_rep3	control_24h_rep1	control_24h_rep2	control_24h_rep3	heat_0.5h_rep1	heat_0.5h_rep2	heat_0.5h_rep3	heat_1h_rep1	heat_1h_rep2	heat_1h_rep3	heat_2h_rep1	heat_2h_rep2	heat_2h_rep3	heat_4h_rep1	heat_4h_rep2	heat_4h_rep3	heat_6h_rep1	heat_6h_rep2	heat_6h_rep3	heat_24h_rep1	heat_24h_rep2	heat_24h_rep3	high_light_s_0.25_rep1	high_light_s_0.25_rep2	high_light_s_0.25_rep3	high_light_s_0.5_rep1	high_light_s_0.5_rep2	high_light_s_0.5_rep3	high_light_s_2_rep1	high_light_s_2_rep2	high_light_s_2_rep3	high_light_s_4_rep1	high_light_s_4_rep2	high_light_s_4_rep3	high_light_s_6_rep1	high_light_s_6_rep2	high_light_s_6_rep3	high_light_r_0.25h_rep1	high_light_r_0.25h_rep2	high_light_r_0.25h_rep3	high_light_r_0.5h_rep1	high_light_r_0.5h_rep2	high_light_r_0.5h_rep3	high_light_r_1h_rep1	high_light_r_1h_rep2	high_light_r_1h_rep3	high_light_r_2h_rep1	high_light_r_2h_rep2	high_light_r_2h_rep3	high_light_r_4h_rep1	high_light_r_4h_rep2	high_light_r_4h_rep3
Zci_01554	3.440408757407251	2.197547075411645	3.2892752936066323	2.939220677794735	1.1780127453532288	3.0937125824818468	0.2242682040539296	0.5187983571078002	2.3302837166245496	0.92115358842308	2.0201037868190173	1.237002677020194	1.629396904845282	0.782523506616031	2.478936918883188	1.8493588189796233	2.6535027183714175	2.567287551489466	2.3087513545966867	2.057718734051163	2.862297434574426	2.814888388872226	2.9839143619970123	3.305977292749765	3.5091039360292884	2.385361004030039	3.709476348641824	2.4013176869338824	2.2868844535107353	3.358414504768882	2.99124817403566	2.15911802787802	3.5063369090643324	2.468718561013356	2.2196887123241154	2.8190753586334996	1.70729403790779	1.5803470179543575	2.48173346832355	3.8839656692054487	2.5396256335084875	3.4594422574365287	8.93595631778985	8.719123230936422	8.641551617720289	8.630053215801178	8.783440913719481	8.59610499467784	7.4576981025413875	7.337371901408771	7.915047653341179	7.687859998217545	7.64629056810209	6.172151679251609	6.6760427925421135	7.871836525945751	7.189951965526647	5.923556057430314	5.97555098997525	6.843580870434251	6.157666990329718	7.482503538163367	5.312762261362697	7.72948327665035	7.414797769512653	6.368279019740056	7.240281236073665	5.049397660460303	6.899193253468854	6.276034172957781	4.78035433619605	5.185792350225907	6.19888066552431	5.85700983309392	5.511864185901796	5.421980983385738	5.114815294428319	4.990878364869611	4.445156477024116	4.724786100343799	4.560317028587103	5.079527922185168	4.163009047798175	4.7082300406945805	5.433100160651815	3.820781304797353	3.786228534649624	4.164517714612177	3.211883617311718	2.6205363778952213
Zci_03664	4.2478194087924095	4.281372965854159	4.369301085329383	4.584369478699576	3.4979950135810665	4.715495655192155	5.0373671967356275	4.592721078575696	5.4987287616125595	4.558098036039092	4.4540199267556355	4.315056398968762	4.131758540444382	4.511524791349673	4.058758702754517	4.170962050050171	4.227296267690018	4.134290750452328	3.731669516091825	3.5218738448427698	3.8418689270916007	3.628349918246392	3.2630706041785844	4.141302312887141	4.055144432970418	3.8052851003054946	3.9730204048736346	4.424117518098757	3.0651699465288567	3.438781129672175	3.747362820718689	3.88063957470497	4.276131775678634	4.02294146715047	4.153692047267848	4.253033976286179	4.441223042966201	4.2413148958088085	3.7184457466695218	4.257100013814449	4.147000319196015	3.538660304370682	5.810926880549555	5.629613472808675	5.833392556130365	5.870034903596327	6.181265143623372	6.6358057370475505	4.977753854459686	5.298129965687678	5.794591527176808	4.719599760451432	5.246369809117733	5.59862859817516	4.7468223964383265	5.102094711962228	4.489935185696769	5.0412225205993835	6.259136787216613	4.810815992508441	3.867724042753564	4.715321392858358	3.9167038749125167	4.363982959115897	4.574180223775575	3.881473546751476	4.890387130794441	3.643527811436311	4.60318560882839	3.636540950578447	3.468706899735264	2.751429350765705	4.19444381134057	3.60283482912736	3.3806635898354465	4.1159840152045835	3.4781645558010545	3.244607196295452	4.305768719612342	4.186749143159344	3.61394366562381	3.9258431504053632	2.9243981837338286	3.5305705731538475	3.8600965144568704	3.2957775401020526	3.8106833188943976	4.077322778466501	4.1531461255261055	4.206343775719943
Zci_06909	3.555436788798122	3.764589495860723	2.861531980919631	2.54558486868151	2.7895460680188093	2.8127403403634026	3.25848683090774	2.658709169010281	1.6449202313838016	2.627773755519771	2.1230143757131006	2.5591810687509975	2.793896147594002	2.7489008833343647	3.3384493779652997	3.398885440688532	2.6778187213239524	3.639720161188015	3.446317012018084	3.625918914841539	2.642471497658062	3.4367949048514017	3.2511669439732653	3.565888543918951	3.4083881437876227	3.2648735419289316	2.7118021905578753	3.1309199549251874	3.987115963732208	2.702136997711878	3.781365695255599	3.7513834411888	3.3957391754827837	3.280286965489735	2.9757308565098333	2.9409278081654264	3.067777677972528	3.5359498115116597	2.3853686666286884	2.941958200732988	2.876581913641532	3.80266805427501	4.02826508462196	3.6106761998229664	4.1655884321003205	3.996181579644616	3.677463060356608	3.648616923460166	4.055506247871445	3.6821818159751896	4.199914464911521	3.9001348600613217	4.191917504998498	3.9001348600613217	3.5434657101557954	3.8193292209228353	3.4595497392766505	2.9100171318456147	3.32735047765317	2.323404724542583	3.137532658494735	3.2057611146506773	2.966796373505584	3.4207405146311247	3.618431735513553	3.384488703896576	3.5609717791587214	3.4554715841647323	3.720553606610736	3.9239965769256746	3.429727119525585	3.3865589948347803	4.17824457908681	3.5111469330967777	3.8933772334502503	3.800509019381911	3.4293776132812903	3.944731974888334	4.0516138180157	3.677204650093632	3.4865884119405153	3.7063801044817266	3.16800837004684	3.5527913195416865	3.888762772182474	3.4767465977717027	3.5607394979515155	4.002031211087711	2.966106983956249	3.2915587911316697
Zci_07198	4.1159959888832445	3.3564009341842485	3.805339680350454	3.915883391743248	3.6431957668589225	3.7030294101661463	2.9045502009148954	2.8517667596687346	3.342883209873271	3.3240020118988256	3.832560102183866	3.046642313529449	2.1081078572453817	3.158410314620567	3.060453397617877	3.496077608239297	3.5835489392409663	3.62653576971281	3.9544187534832327	3.642264829297967	4.169797125897015	3.774377942583913	3.8323271201819655	4.305866895361582	4.438252653553346	4.114556376953941	4.073582034714353	3.869025457798831	4.3688229125901845	4.49915141439949	4.426614944014263	3.68849391002623	4.027016060076968	3.7546048891102894	4.011915973360293	4.028747333505017	4.114610874759653	3.452098741695683	4.171841149218885	4.251718551460032	3.860973350293616	4.2105866257004685	3.9578169149421782	4.27031488273538	4.7361459037066975	4.178907102170636	4.449210851230253	4.474320817812878	4.674429234516091	4.183261665546419	3.9642617879557585	4.570651955697947	4.4848047026729105	4.80852383601047	4.278900954533478	5.0678974039022275	4.403279760642871	4.915221651932206	5.3946040547075675	5.814281652442298	4.132928680172809	4.752951588021908	3.999383963332587	4.634425158347733	4.633415176793303	4.335454164307277	4.59275888066917	4.109795286347726	4.298680754612576	4.305125421305801	4.136461342208489	4.739971793889761	4.6158352051234255	4.186371065169218	4.5153473390547765	4.398703466735686	4.145596725913927	4.284117845783959	3.880586680574989	4.008119757044565	4.020712965274898	3.975434538190248	4.078151817905124	4.177479317373691	3.795534654062404	4.103413023971191	4.091264476875606	4.160010241093691	4.201715513762726	4.049776506998521
Zci_09738	3.962331399259104	4.408361464296667	4.266019563960564	3.749109185676496	3.893768542441911	3.91063689428753	1.6139102566548176	3.094641610011596	3.3347304673657647	2.058373826140673	3.4119616246972138	3.066724559785391	3.2160826049163527	2.9977121687495005	2.534098497432419	2.989948200533496	3.4864675390632036	3.298942121574846	4.056620762132678	3.82061403377551	3.8829161663157312	3.690894748186446	4.021144668863116	4.281351713642651	3.731080514403963	3.8259488900250247	4.263947910177107	3.892754177744116	3.978763753445541	4.381312796661172	3.429384187927586	4.159614466895125	4.17679626827531	3.972655974944265	4.788540619649269	3.449936593558338	4.1379077093348755	4.072882148882645	3.9117983418076143	3.733361640338156	4.229787092051291	4.178854580539252	4.282377869551425	4.23839229184986	4.935551594366752	4.168941634003853	4.996193276101476	3.7224889173351743	4.086668764169941	3.469192122239229	3.350466093754634	4.086619942697103	3.35315122550803	3.236995778046059	3.5440487503647096	4.228495619170126	3.758606916139856	4.035784164750957	4.469162933733094	5.306550902786647	4.337108879849032	4.558424142333691	4.109013207099148	4.675246371276878	4.421705098679856	3.8267357955484784	3.4384613100208297	4.433006930378735	4.298252429219598	3.4716561154571024	3.8196699275952417	4.117155510757553	4.084673593697709	4.145233995870048	3.613980923503607	4.275240191664509	3.5431153916975684	3.736809138218874	4.1363163388754	4.246438715979849	3.5855527579645514	2.9158330717394816	3.779903982719735	3.668845574265129	3.751575498943672	3.2087757969567385	3.612091888747522	4.452440037067174	3.559071656882113	4.225947994896325
Zci_11189	5.025655789505612	4.347654315016499	4.406614128479701	3.7616641584563615	4.149342344495223	4.439905028537382	3.983250997307786	3.626296006814102	3.2039197115940694	4.059823652579007	4.247859985667802	3.4216956588452985	4.054015543704195	4.831434837042082	4.247983951990035	4.225414261588104	4.972204768466144	4.997821963244322	5.01132398309227	4.694896401248151	4.68911430625213	4.068782768467138	4.960365630099938	4.303706705449932	4.717046755696622	3.950014374881596	4.3188606402733205	4.704646542428699	4.437219654732169	3.743748345549665	5.123449473262297	5.174564418808177	4.752840553628701	4.523545585564067	5.133083748468476	4.421494797038511	5.698114215144679	4.663817255595189	4.182419043809873	4.485121372560388	4.692528348474613	4.991192987563852	5.460198419687235	6.25284910025313	5.489825852414205	5.611432185499918	6.5084099431058435	6.190376123940813	6.036592138776641	6.78776401053223	6.5918386353777025	6.475695279079028	7.0496824802894995	7.480255529879336	7.036519494169145	7.021720827155967	7.710450063367304	6.151571545040116	6.9754866564128815	6.835199071972146	5.26413122817406	5.799800172004074	4.953014904978582	5.544592702370493	5.731559079685982	5.217991042453881	6.401786682808308	5.866434737973759	7.4804196772057185	6.113431316716442	5.848175581329261	6.0985497154954	7.52007514438858	6.604814726677541	6.840145891332582	7.254349404181674	6.066740302095664	6.288271636927883	6.450725470200411	5.713298177972828	6.2364423220615	5.8814759759332675	6.261235833819004	5.91810014488801	6.033641175174181	5.6029427882982334	5.772345256457556	5.392407070068505	5.809943448976213	5.660784881453538
Zci_11641	3.352742945634096	3.2495753437723343	2.559755499679212	2.885904835359704	2.853496971107216	3.1883326978825854	2.385778599236816	3.2175728462777604	1.0249029395518665	2.415691062299246	2.739770385028683	1.6133969005040945	1.888156269106912	1.837001687257937	-0.255994518768242	2.896884461534602	3.3631598977254136	3.0178126518220068	3.752709311666084	3.267435612897704	3.6590938799058974	3.635838243850312	4.139405810113027	2.5934358936988273	3.971922690069557	3.941156200986111	3.2013536531933555	3.775113454781466	3.3443717674345623	3.4369692549243283	3.8426968205945498	2.97709339951425	3.454701801789735	3.318720391471443	3.03960486971694	3.1013370288027406	2.9935857963802195	3.133309120296337	3.887399338557596	3.100008516247996	3.0166059818958493	2.0279356666234194	3.3647579090874498	1.97380630848624	2.8457181010920527	3.1781450465396706	3.368118025084134	3.0199532545910985	3.4618367933016176	3.4871717222697964	3.1464079887891274	3.643107098948201	3.3650817312568435	4.6054789173183055	3.3648854214786645	2.521022882267463	2.6289467094012267	4.417650985894207	4.0011065093589915	4.326609276108466	2.4840292446475836	2.9934136634002018	3.5374028086121228	3.0701763119901444	3.8911081167096113	3.801672468192368	4.480585624227666	3.953084112833345	3.006289810696196	4.620149980227649	3.6695809294819575	3.80505567374256	3.577688333856947	3.846627041425428	3.6607081917345305	2.921401910001376	2.851068750346364	3.8125874582729744	3.570851949608611	3.718500537482435	3.9584776463097584	3.2195645171307787	3.834086837660763	3.876671995604625	4.228053681809581	4.2156206575324315	3.892056425928182	3.556372263543411	3.980734650104311	3.431822085380536
Zci_12888	-0.08017769821592038	0.6885021510774807	2.071844482955082	-0.1993488794124998	0.10869585410017396	0.8017840099487	-0.42522034590623	-0.5349779912198619	0.8062718460105056	-1.4714802906872575	-0.1709833971150617	-0.1190713579738478	-0.2867522201286848	-2.819020058439849	-1.2650672157143468	1.4338106096338	2.8278771635807023	3.2174625039261593	1.6764134013783778	2.229504411524279	1.8637651167675544	2.438177286503552	1.8337060497029347	3.2100375242640924	1.2898160386215611	0.5998414285618056	2.035772651655069	0.6611037547453718	0.4715871500469836	1.0821282958612124	1.7140179938449307	3.383450355811307	1.7388318142086998	0.9488244434742972	4.02210760884418	1.9858146796922045	1.5086052490775057	1.6321357979569509	1.152399652154374	1.5465054436123926	2.755983484249176	2.4965974310083494	2.4478033694791876	3.528087944166477	3.7035524136903657	2.207257746176462	2.710524272108971	1.8986231550724049	2.232911318532791	2.6541258714586218	2.745341946258385	2.131169438997599	2.4290111146297515	4.177561702360351	2.8276228962849346	2.470347136925081	3.970909480808109	3.20158497765523	1.0380338059132102	3.047402913638659	2.4523507902093735	2.8555324581156656	0.6647547226073693	2.7046749836789594	1.8260236056186017	2.0128093208806326	2.1790852681814847	0.6516350824736117	3.385432821697691	2.551682080587622	2.182949534496448	2.365399324567663	2.847752354788396	1.9579755726401031	1.918474713801056	2.947925487481354	0.7133320998141202	0.11330832794288294	2.0622333228646226	1.510414862402197	0.17535993714661974	0.908246357452586	1.3233471737647495	1.5356669208191451	1.1369960474553953	1.6331881911913282	0.6537803746516329	2.13506493629402	1.2059752653559614	0.5807457786957113
Zci_12889	2.2951026687031355	3.321226683413489	4.063917766490703	2.5852665487655453	3.2094177808817412	2.48690683996447	-0.2374556529473172	0.7248682185056081	1.7526389720639604	0.12165175907363242	0.1655200040477395	1.2558049638210738	-3.145577684614623	-0.4351918129193394	-3.290121491018432	2.6466896473847683	3.878830875179613	4.694142580213927	4.586953458816244	4.8205286882181895	3.4433779116623184	4.71493208063211	4.000406681820229	4.506628260133938	3.430044870119026	2.559317522074366	3.407740269705577	3.62785469124514	4.035605448057252	3.938366356837733	3.892082054452067	5.508834212585081	3.6563491304225217	3.1632127196173028	5.841513088382889	3.364073073300806	2.8112460706920395	4.654551537310596	3.671543739118915	2.1907121902201703	4.244452916191572	3.918180014325235	4.579283755477657	4.73245386574571	5.812406467591324	3.2700337149829135	4.373758918568043	4.175392225562896	4.127514615802437	4.511617168322729	3.946586417790732	3.9153173316133096	3.1475197033916644	5.507394130300785	4.525032399726471	4.532847511943013	4.967109098012008	5.470769546424322	4.456213916505413	5.9390724288307135	4.407593891913003	4.934971091403551	3.882075704210001	4.450154916750847	4.631233147553673	4.130609716416695	4.5334178062174795	3.3777494375046953	4.839100145201598	4.736334772740491	3.913152726051703	3.4175597771772166	4.9421019704970925	3.39298666329212	4.366594399605485	5.023049805118887	2.6206997832708523	2.621963463500176	3.278584821058021	2.842224842940912	3.332620641091082	2.444931532618033	3.058218445211374	2.861456028209538	2.479646652862978	3.2804347244212053	2.2674811436491784	3.5878106002705494	3.5537898247470108	3.4135227467694027
Zci_13650	2.338979814021014	2.166229556807328	2.904860425689511	2.103346355019123	2.714346206880138	1.7300241139928778	2.0210307655295994	1.4523224542426647	1.0511637419443929	1.9906866973221995	1.728651313765026	1.5380345738980523	2.1330272158646624	2.34802717295891	1.5329380748228325	2.036784590297357	0.96119188589648	2.6453663147147424	2.4640670662175017	2.9033946457928135	2.272582795450771	2.6958285400495683	2.796359732691077	2.1887238802930193	2.788336794808592	3.1562961521614064	3.0383057692341904	2.593045037418604	3.426423578828315	2.8904720279705702	3.587497789711257	2.3203964658451453	2.446655093905118	3.0679417525980037	2.6337223000728867	2.553161468631359	2.8889113416365095	3.106463377157354	2.0203549411679687	2.380654780011767	2.7333785421290746	3.3173265235053075	3.223857366289013	3.6030700930397552	4.096394876101711	2.530816021706129	3.705252195072338	3.2774999064019683	3.047959822108293	3.4214732201472953	2.8887608854545372	2.984148136706992	3.812719163252283	4.513206180508149	3.338880146726002	3.449112076619711	3.0710779633415837	4.290436633046042	3.750168488316805	4.813827969056512	2.208705995040642	1.3091974615559974	2.0885142100901297	2.4662541896738506	2.0038553316494205	2.3732106013809102	2.2359823377735255	1.681824739097413	2.2781427377863546	3.0417843709840033	2.8684964086584857	2.810128858665951	3.3813433450386543	2.162599858729252	3.1024186286621616	4.068929281352386	4.618444580999192	3.806776025539689	5.532964062850398	3.272966118167679	4.9101899387984504	4.27460245225737	3.3670091789595493	3.841546433527352	3.4828305806515627	3.658187242443765	3.5861890639323493	2.8646675202822003	2.9462314338627715	3.1443692206117664
Zci_14241	2.6882881275104817	2.2191779538039578	2.537814117216012	2.0047550347208483	3.0797620161353105	2.3559565750969917	0.7115561460348353	1.3477587019555533	0.699058852503625	3.02920969095224	1.9495229939034355	1.6906995584711442	3.574343459829822	2.778853428751912	2.0875948301901257	1.538769444202987	2.53938993232423	2.1917458481193077	2.347134591705355	1.6358796084744038	2.988396669832986	1.9934334338475497	1.903099023032471	2.0284966139379743	2.385361004030039	1.4915179114569572	2.7935375957159088	2.2421346989965865	4.23232360923614	2.3283138824116527	4.994617218040414	2.3112154180891396	2.5626777480212817	0.9316868697469226	-0.1819876278705123	2.4852287762312324	2.537331199597404	1.7031799036566388	2.090572779565027	3.176232941657541	1.5742687441592709	3.970636502781696	1.9552967184650207	2.154850798187438	1.4610393900208904	3.707200582720123	2.218425702964984	1.7458940112359336	2.3555172388372636	3.03306233593414	1.7694262127095857	3.567048679815004	3.7735017852063337	3.259026837753144	3.37963764505674	4.306989003212214	4.465755819792157	6.012967693908742	6.6018483449682765	4.878435869962338	-0.6011184009734333	1.175569797117897	-0.06353626617535477	2.099529605455728	1.2070174931026074	2.5098631301451637	3.021515822576705	1.4557379861403976	1.7669492024816849	3.4659655601742485	1.51136454365098	0.13949455240072978	1.8795918822362951	2.309069272324344	2.9766655288477986	1.6864994663089463	2.1726135718449884	2.261468091240788	2.6356924761591425	2.925260600488839	1.8402936125051204	2.549752201128597	2.4351788422332454	2.7324014653599167	2.304765690615454	3.357011947924468	1.5270579640041404	1.9428817972476784	3.1171017736102087	1.511669286028796
Zci_15175	1.6066688749931144	1.2372060068824589	0.3981374227123457	0.821594739661873	1.8577934939780825	1.5796504602942252	2.369587057954506	2.6860649465455366	0.4991321899189449	1.266820552151496	2.0951985173690804	-0.09295511214795268	1.6038322084878731	2.0135473048906887	0.4049427553860562	2.401658069392494	2.854692737430774	2.2151870793810517	0.7176058958132174	3.1853734229079316	0.23470518939267565	3.5218738448427698	2.2742823925083484	2.178428542874629	1.8002310115123812	1.507191462300191	1.636330967373134	3.649452349121853	3.34681165617187	3.2454029613032325	-2.9666302752803433	-0.05401836483420546	-0.2345799326670641	1.3307422425586737	-0.1819876278705123	-0.12584538664708178	1.931500083860065	0.8558030797968172	-3.650647865317531	2.181874352504406	1.9452464070754685	-3.65828398606318	1.9878587883772876	1.7722572711803504	1.3650290976090167	2.748274707682776	1.664472328220089	2.0979314078015285	1.9101728707996208	0.7082991445532477	2.3148089057438836	2.675122898552708	3.446441745461998	0.5443605337346565	0.8437518968800524	2.3749499286345825	0.5309884366929376	2.0942742551220683	2.3132753832216912	3.2625478189799946	1.3221353737563466	1.8307951682499428	2.6717217574105563	2.8969967921672612	3.325131737672665	2.0780587079578567	2.5869464337437176	2.985845187513372	1.2653493140382936	0.30162883841539023	0.7573752013023273	3.611589818984063	1.3701804063433247	-0.06029520245600876	2.470831037021896	1.8604684372788456	2.7821456086232716	1.1296697743091224	2.14216376435725	1.5431251879094554	1.1610570435790926	2.2689829794348455	2.8933458590805903	1.914450849484066	2.3175167351132786	-0.3848781378045112	3.158273476807604	2.338333917446722	3.1848676512460403	3.4107900431378075
Zci_15269	1.7961022391846078	2.719091024028659	2.194341029961155	2.0844028100491534	3.249366156025308	0.3964424458326711	-2.322890796343964	1.2344081131889004	1.3757203071088495	0.30525265134269297	0.09108738228140764	1.266820552151496	-3.145577684614623	-0.376786898279208	-1.032660860206032	0.8080307628859261	0.4527830432697562	0.00366819799055811	2.354550880874588	3.722239077509307	2.0191186366063687	3.3496835055224796	3.5011745084504327	3.2717889139085816	2.5372957037801176	2.940587192711082	1.6617509606760117	3.43082256247977	2.368164496947239	2.729771206025977	1.1949301102587286	3.1296402522363267	1.841987727223196	1.991955841673111	3.2900860899812345	1.2671903635641857	3.1991341925128824	3.404262153543768	3.0179703942875964	2.0995608451280905	1.1927737044244693	1.992962349217186	-0.7946740736062009	0.9953716149037728	1.833442427061192	0.03437155584367466	-0.04254765340301458	1.312746968767784	0.7269368121208332	1.0943497500629251	-0.5638279259060291	1.072883295258115	1.38189967675934	2.537807873062737	2.3547993254771935	1.90028909635771	2.2891493896592077	3.3923915090663206	2.092716636498571	2.7581211624294566	1.741715397124795	2.193641648678642	2.1892581755986575	0.8896531565146475	1.744028708651426	1.2598242861338345	0.08271368666478092	0.936595807016124	1.4513507634290612	0.47455765774410646	1.36553848531742	1.6539598791056	1.582221710978708	1.9329258514464756	0.921908826337724	1.9695302379123525	1.7071202047462757	1.394474826759614	1.9204798539285417	2.292629683124584	0.4970495784563978	0.1904135819341329	1.7963040085773037	1.6828969198464152	0.2424940348777075	1.9506028323914064	1.005544897656624	2.8944004412919178	2.1105869667104322	2.076419188073702
