"","ID","Description","GeneRatio","BgRatio","pvalue","p.adjust","qvalue","geneID","Count"
"GO:0009723","GO:0009723","response to ethylene","4/33","48/5146",0.000223623838670194,0.0388742507345431,0.0342035539424077,"Zci_01850/Zci_09179/Zci_10677/Zci_12313",4
"GO:0009736","GO:0009736","cytokinin-activated signaling pathway","3/33","20/5146",0.000254354859368673,0.0388742507345431,0.0342035539424077,"Zci_04537/Zci_09313/Zci_12313",3
"GO:0000160","GO:0000160","phosphorelay signal transduction system","4/33","52/5146",0.000305565705615993,0.0388742507345431,0.0342035539424077,"Zci_01725/Zci_04537/Zci_09313/Zci_12313",4
"GO:0006355","GO:0006355","regulation of transcription, DNA-templated","10/33","457/5146",0.000392669199338819,0.0388742507345431,0.0342035539424077,"Zci_00781/Zci_00836/Zci_01850/Zci_04537/Zci_07595/Zci_09179/Zci_09313/Zci_09421/Zci_10677/Zci_12313",10
"GO:0051239","GO:0051239","regulation of multicellular organismal process","7/33","241/5146",0.000679304030524101,0.042922334320924,0.037765264912881,"Zci_02946/Zci_04537/Zci_09179/Zci_10677/Zci_11741/Zci_12313/Zci_15697",7
"GO:2000241","GO:2000241","regulation of reproductive process","5/33","114/5146",0.000706461019880133,0.042922334320924,0.037765264912881,"Zci_02946/Zci_04537/Zci_09179/Zci_11741/Zci_12313",5
"GO:0048511","GO:0048511","rhythmic process","3/33","29/5146",0.000783822418314447,0.042922334320924,0.037765264912881,"Zci_04537/Zci_09179/Zci_09313",3
"GO:0007623","GO:0007623","circadian rhythm","3/33","30/5146",0.000867117865069172,0.042922334320924,0.037765264912881,"Zci_04537/Zci_09179/Zci_09313",3
"GO:0007165","GO:0007165","signal transduction","8/33","359/5146",0.00153306418098409,0.0674548239632999,0.0593502039655828,"Zci_01725/Zci_02946/Zci_04537/Zci_09179/Zci_10677/Zci_11741/Zci_12313/Zci_15697",8
"GO:0080092","GO:0080092","regulation of pollen tube growth","2/33","10/5146",0.00173800955045635,0.0688251781980714,0.0605559117053738,"Zci_02946/Zci_11741",2
"GO:0010769","GO:0010769","regulation of cell morphogenesis involved in differentiation","2/33","12/5146",0.00252870197940744,0.0910332712586679,0.0800957277687907,"Zci_02946/Zci_11741",2
"GO:0048638","GO:0048638","regulation of developmental growth","3/33","47/5146",0.00321561396085603,0.091309435693991,0.0803387113628682,"Zci_02946/Zci_11741/Zci_12313",3
"GO:0009753","GO:0009753","response to jasmonic acid","3/33","48/5146",0.00341507996900175,0.091309435693991,0.0803387113628682,"Zci_01850/Zci_09179/Zci_09882",3
"GO:0051510","GO:0051510","regulation of unidimensional cell growth","2/33","14/5146",0.00345869074598451,0.091309435693991,0.0803387113628682,"Zci_02946/Zci_11741",2
"GO:1904062","GO:1904062","regulation of cation transmembrane transport","2/33","14/5146",0.00345869074598451,0.091309435693991,0.0803387113628682,"Zci_02946/Zci_11741",2
"GO:0006468","GO:0006468","protein phosphorylation","7/33","323/5146",0.00371648019684585,0.0919828848719348,0.0809312463918406,"Zci_02946/Zci_06747/Zci_07691/Zci_10272/Zci_10677/Zci_11741/Zci_14122",7
"GO:2000112","GO:2000112","regulation of cellular macromolecule biosynthetic process","8/33","423/5146",0.0043157903482624,0.100532528112465,0.0884536597693408,"Zci_00781/Zci_00836/Zci_01850/Zci_04537/Zci_08682/Zci_09179/Zci_09313/Zci_12313",8
"GO:0023052","GO:0023052","signaling","7/33","339/5146",0.00486114471104056,0.103788900746445,0.0913187829534114,"Zci_02946/Zci_04537/Zci_09179/Zci_10677/Zci_11741/Zci_12313/Zci_15697",7
"GO:0010556","GO:0010556","regulation of macromolecule biosynthetic process","8/33","433/5146",0.00497977049035974,0.103788900746445,0.0913187829534114,"Zci_00781/Zci_00836/Zci_01850/Zci_04537/Zci_08682/Zci_09179/Zci_09313/Zci_12313",8
"GO:0010959","GO:0010959","regulation of metal ion transport","2/33","18/5146",0.0057227231837993,0.113309919039226,0.0996958617809246,"Zci_02946/Zci_11741",2
"GO:0050793","GO:0050793","regulation of developmental process","6/33","271/5146",0.00670812906627038,0.119910858561886,0.105503705964871,"Zci_02946/Zci_04537/Zci_09179/Zci_10677/Zci_11741/Zci_12313",6
"GO:1903506","GO:1903506","regulation of nucleic acid-templated transcription","7/33","364/5146",0.00716608687186442,0.119910858561886,0.105503705964871,"Zci_00781/Zci_00836/Zci_01850/Zci_04537/Zci_09179/Zci_09313/Zci_12313",7
"GO:2001141","GO:2001141","regulation of RNA biosynthetic process","7/33","364/5146",0.00716608687186442,0.119910858561886,0.105503705964871,"Zci_00781/Zci_00836/Zci_01850/Zci_04537/Zci_09179/Zci_09313/Zci_12313",7
"GO:0031326","GO:0031326","regulation of cellular biosynthetic process","8/33","461/5146",0.00726732476132644,0.119910858561886,0.105503705964871,"Zci_00781/Zci_00836/Zci_01850/Zci_04537/Zci_08682/Zci_09179/Zci_09313/Zci_12313",8
"GO:2000280","GO:2000280","regulation of root development","2/33","21/5146",0.00776100779278881,0.122934363437775,0.108163940185815,"Zci_10677/Zci_12313",2
"GO:0009889","GO:0009889","regulation of biosynthetic process","8/33","474/5146",0.00857077007504614,0.13053942114301,0.114855258900416,"Zci_00781/Zci_00836/Zci_01850/Zci_04537/Zci_08682/Zci_09179/Zci_09313/Zci_12313",8
"GO:0009755","GO:0009755","hormone-mediated signaling pathway","4/33","131/5146",0.00926366559244196,0.130796505293713,0.115081454684261,"Zci_02946/Zci_09179/Zci_11741/Zci_12313",4
"GO:0047484","GO:0047484","regulation of response to osmotic stress","2/33","24/5146",0.0100786248723475,0.130796505293713,0.115081454684261,"Zci_09229/Zci_11741",2
"GO:0022898","GO:0022898","regulation of transmembrane transporter activity","2/33","25/5146",0.0109113684032049,0.130796505293713,0.115081454684261,"Zci_02946/Zci_11741",2
"GO:0032409","GO:0032409","regulation of transporter activity","2/33","25/5146",0.0109113684032049,0.130796505293713,0.115081454684261,"Zci_02946/Zci_11741",2
"GO:0032412","GO:0032412","regulation of ion transmembrane transporter activity","2/33","25/5146",0.0109113684032049,0.130796505293713,0.115081454684261,"Zci_02946/Zci_11741",2
"GO:0048580","GO:0048580","regulation of post-embryonic development","4/33","142/5146",0.0122166027854942,0.130796505293713,0.115081454684261,"Zci_04537/Zci_09179/Zci_10677/Zci_12313",4
"GO:0051252","GO:0051252","regulation of RNA metabolic process","7/33","404/5146",0.0124496959000783,0.130796505293713,0.115081454684261,"Zci_00781/Zci_00836/Zci_01850/Zci_04537/Zci_09179/Zci_09313/Zci_12313",7
"GO:0048583","GO:0048583","regulation of response to stimulus","6/33","310/5146",0.0126572213153906,0.130796505293713,0.115081454684261,"Zci_01850/Zci_04537/Zci_09229/Zci_10677/Zci_11741/Zci_13189",6
"GO:0022604","GO:0022604","regulation of cell morphogenesis","2/33","27/5146",0.01266480714117,0.130796505293713,0.115081454684261,"Zci_02946/Zci_11741",2
"GO:0046777","GO:0046777","protein autophosphorylation","3/33","77/5146",0.0127333912353668,0.130796505293713,0.115081454684261,"Zci_02946/Zci_10677/Zci_11741",3
"GO:0035556","GO:0035556","intracellular signal transduction","4/33","146/5146",0.0134250834149005,0.130796505293713,0.115081454684261,"Zci_02946/Zci_11741/Zci_12313/Zci_15697",4
"GO:0034765","GO:0034765","regulation of ion transmembrane transport","2/33","28/5146",0.013584729679923,0.130796505293713,0.115081454684261,"Zci_02946/Zci_11741",2
"GO:0060284","GO:0060284","regulation of cell development","2/33","28/5146",0.013584729679923,0.130796505293713,0.115081454684261,"Zci_02946/Zci_11741",2
"GO:0071310","GO:0071310","cellular response to organic substance","5/33","227/5146",0.0138062993596076,0.130796505293713,0.115081454684261,"Zci_02946/Zci_09179/Zci_10677/Zci_11741/Zci_12313",5
"GO:0009725","GO:0009725","response to hormone","7/33","413/5146",0.0139540803051842,0.130796505293713,0.115081454684261,"Zci_01850/Zci_02946/Zci_09179/Zci_09882/Zci_10677/Zci_11741/Zci_12313",7
"GO:0007154","GO:0007154","cell communication","7/33","415/5146",0.0143056665503326,0.130796505293713,0.115081454684261,"Zci_02946/Zci_04537/Zci_09179/Zci_10677/Zci_11741/Zci_12313/Zci_15697",7
"GO:0009739","GO:0009739","response to gibberellin","2/33","29/5146",0.0145329450326348,0.130796505293713,0.115081454684261,"Zci_01850/Zci_09179",2
"GO:2000028","GO:2000028","regulation of photoperiodism, flowering","2/33","29/5146",0.0145329450326348,0.130796505293713,0.115081454684261,"Zci_04537/Zci_15627",2
"GO:0009719","GO:0009719","response to endogenous stimulus","7/33","424/5146",0.0159682217613821,0.136230162627246,0.11986226429989,"Zci_01850/Zci_02946/Zci_09179/Zci_09882/Zci_10677/Zci_11741/Zci_12313",7
"GO:0040008","GO:0040008","regulation of growth","3/33","84/5146",0.0160909174806904,0.136230162627246,0.11986226429989,"Zci_02946/Zci_11741/Zci_12313",3
"GO:0032870","GO:0032870","cellular response to hormone stimulus","4/33","155/5146",0.0164186585450132,0.136230162627246,0.11986226429989,"Zci_02946/Zci_09179/Zci_11741/Zci_12313",4
"GO:0034762","GO:0034762","regulation of transmembrane transport","2/33","31/5146",0.0165127469851207,0.136230162627246,0.11986226429989,"Zci_02946/Zci_11741",2
"GO:0071495","GO:0071495","cellular response to endogenous stimulus","4/33","167/5146",0.0210244610445857,0.169911970890937,0.14949724179931,"Zci_02946/Zci_09179/Zci_11741/Zci_12313",4
"GO:0019219","GO:0019219","regulation of nucleobase-containing compound metabolic process","7/33","457/5146",0.0232698389473085,0.182763119969401,0.160804340004976,"Zci_00781/Zci_00836/Zci_01850/Zci_04537/Zci_09179/Zci_09313/Zci_12313",7
"GO:0046677","GO:0046677","response to antibiotic","3/33","97/5146",0.0235376745415138,0.182763119969401,0.160804340004976,"Zci_01850/Zci_09179/Zci_09882",3
"GO:0043269","GO:0043269","regulation of ion transport","2/33","38/5146",0.024278864673708,0.184892892515161,0.162678222813712,"Zci_02946/Zci_11741",2
"GO:0009751","GO:0009751","response to salicylic acid","2/33","40/5146",0.0267250450437616,0.199681468628861,0.175689968410826,"Zci_01850/Zci_09179",2
"GO:0001558","GO:0001558","regulation of cell growth","2/33","41/5146",0.0279842778076762,0.205218037256292,0.18056132464602,"Zci_02946/Zci_11741",2
"GO:0065009","GO:0065009","regulation of molecular function","4/33","189/5146",0.0313868096188998,0.225596225734007,0.198491097070591,"Zci_02946/Zci_05187/Zci_11741/Zci_15697",4
"GO:0018105","GO:0018105","peptidyl-serine phosphorylation","2/33","44/5146",0.0319024965684454,0.225596225734007,0.198491097070591,"Zci_02946/Zci_11741",2
"GO:0018209","GO:0018209","peptidyl-serine modification","2/33","45/5146",0.033254302806123,0.227046619159047,0.199767227383425,"Zci_02946/Zci_11741",2
"GO:0048509","GO:0048509","regulation of meristem development","2/33","45/5146",0.033254302806123,0.227046619159047,0.199767227383425,"Zci_10677/Zci_12313",2
"GO:0009737","GO:0009737","response to abscisic acid","4/33","197/5146",0.0357922068660349,0.240232439304234,0.21136878630968,"Zci_01850/Zci_02946/Zci_09179/Zci_11741",4
"GO:0048585","GO:0048585","negative regulation of response to stimulus","3/33","119/5146",0.0397588351287742,0.258960239437734,0.227846462663184,"Zci_04537/Zci_10677/Zci_11741",3
"GO:0022603","GO:0022603","regulation of anatomical structure morphogenesis","2/33","50/5146",0.0403417345192348,0.258960239437734,0.227846462663184,"Zci_02946/Zci_11741",2
"GO:2000026","GO:2000026","regulation of multicellular organismal development","4/33","205/5146",0.0405442799119684,0.258960239437734,0.227846462663184,"Zci_04537/Zci_09179/Zci_10677/Zci_12313",4
"GO:0097305","GO:0097305","response to alcohol","4/33","208/5146",0.0424161812791805,0.266615996611992,0.234582389363555,"Zci_01850/Zci_02946/Zci_09179/Zci_11741",4
"GO:0070887","GO:0070887","cellular response to chemical stimulus","5/33","311/5146",0.045988351636715,0.28260312375266,0.248648681451702,"Zci_02946/Zci_09179/Zci_10677/Zci_11741/Zci_12313",5
"GO:0045595","GO:0045595","regulation of cell differentiation","2/33","54/5146",0.0463868763735426,0.28260312375266,0.248648681451702,"Zci_02946/Zci_11741",2
"GO:0016310","GO:0016310","phosphorylation","5/33","321/5146",0.051527056145824,0.309162336874944,0.272016835474765,"Zci_01725/Zci_02946/Zci_09229/Zci_10677/Zci_11741",5
"GO:0042742","GO:0042742","defense response to bacterium","3/33","136/5146",0.0553476361617871,0.313294293569059,0.275652342294946,"Zci_01850/Zci_09882/Zci_13189",3
"GO:0009639","GO:0009639","response to red or far red light","2/33","60/5146",0.0560344436959486,0.313294293569059,0.275652342294946,"Zci_04537/Zci_05187",2
"GO:0010119","GO:0010119","regulation of stomatal movement","2/33","60/5146",0.0560344436959486,0.313294293569059,0.275652342294946,"Zci_05187/Zci_12313",2
"GO:0033993","GO:0033993","response to lipid","4/33","235/5146",0.0614738672376793,0.313294293569059,0.275652342294946,"Zci_01850/Zci_02946/Zci_09179/Zci_11741",4
"GO:0001819","GO:0001819","positive regulation of cytokine production","1/33","10/5146",0.0623612073510361,0.313294293569059,0.275652342294946,"Zci_15697",1
"GO:0007160","GO:0007160","cell-matrix adhesion","1/33","10/5146",0.0623612073510361,0.313294293569059,0.275652342294946,"Zci_11614",1
"GO:0009734","GO:0009734","auxin-activated signaling pathway","1/33","10/5146",0.0623612073510361,0.313294293569059,0.275652342294946,"Zci_09179",1
"GO:0015749","GO:0015749","monosaccharide transmembrane transport","1/33","10/5146",0.0623612073510361,0.313294293569059,0.275652342294946,"Zci_10716",1
"GO:0032350","GO:0032350","regulation of hormone metabolic process","1/33","10/5146",0.0623612073510361,0.313294293569059,0.275652342294946,"Zci_09179",1
"GO:0009738","GO:0009738","abscisic acid-activated signaling pathway","2/33","66/5146",0.0663224511912399,0.313294293569059,0.275652342294946,"Zci_02946/Zci_11741",2
"GO:0009733","GO:0009733","response to auxin","2/33","67/5146",0.0680951832557275,0.313294293569059,0.275652342294946,"Zci_01850/Zci_09179",2
"GO:0001817","GO:0001817","regulation of cytokine production","1/33","11/5146",0.0683857556682899,0.313294293569059,0.275652342294946,"Zci_15697",1
"GO:0010193","GO:0010193","response to ozone","1/33","11/5146",0.0683857556682899,0.313294293569059,0.275652342294946,"Zci_09882",1
"GO:0016101","GO:0016101","diterpenoid metabolic process","1/33","11/5146",0.0683857556682899,0.313294293569059,0.275652342294946,"Zci_10677",1
"GO:0023051","GO:0023051","regulation of signaling","3/33","152/5146",0.0723274064409004,0.313294293569059,0.275652342294946,"Zci_01850/Zci_10677/Zci_15697",3
"GO:0009617","GO:0009617","response to bacterium","3/33","153/5146",0.0734595550675804,0.313294293569059,0.275652342294946,"Zci_01850/Zci_09882/Zci_13189",3
"GO:0010075","GO:0010075","regulation of meristem growth","1/33","12/5146",0.0743727605490972,0.313294293569059,0.275652342294946,"Zci_12313",1
"GO:0010105","GO:0010105","negative regulation of ethylene-activated signaling pathway","1/33","12/5146",0.0743727605490972,0.313294293569059,0.275652342294946,"Zci_10677",1
"GO:0019674","GO:0019674","NAD metabolic process","1/33","12/5146",0.0743727605490972,0.313294293569059,0.275652342294946,"Zci_00805",1
"GO:0070298","GO:0070298","negative regulation of phosphorelay signal transduction system","1/33","12/5146",0.0743727605490972,0.313294293569059,0.275652342294946,"Zci_10677",1
"GO:0071365","GO:0071365","cellular response to auxin stimulus","1/33","12/5146",0.0743727605490972,0.313294293569059,0.275652342294946,"Zci_09179",1
"GO:2001023","GO:2001023","regulation of response to drug","1/33","12/5146",0.0743727605490972,0.313294293569059,0.275652342294946,"Zci_01850",1
"GO:2001038","GO:2001038","regulation of cellular response to drug","1/33","12/5146",0.0743727605490972,0.313294293569059,0.275652342294946,"Zci_01850",1
"GO:0001101","GO:0001101","response to acid chemical","5/33","362/5146",0.0782722049535509,0.313294293569059,0.275652342294946,"Zci_01850/Zci_02946/Zci_09179/Zci_09882/Zci_11741",5
"GO:0080134","GO:0080134","regulation of response to stress","3/33","158/5146",0.0792409912650314,0.313294293569059,0.275652342294946,"Zci_09229/Zci_11741/Zci_13189",3
"GO:0000097","GO:0000097","sulfur amino acid biosynthetic process","1/33","13/5146",0.0803224486873675,0.313294293569059,0.275652342294946,"Zci_01804",1
"GO:0006893","GO:0006893","Golgi to plasma membrane transport","1/33","13/5146",0.0803224486873675,0.313294293569059,0.275652342294946,"Zci_15697",1
"GO:0009070","GO:0009070","serine family amino acid biosynthetic process","1/33","13/5146",0.0803224486873675,0.313294293569059,0.275652342294946,"Zci_01804",1
"GO:0009646","GO:0009646","response to absence of light","1/33","13/5146",0.0803224486873675,0.313294293569059,0.275652342294946,"Zci_05187",1
"GO:0009812","GO:0009812","flavonoid metabolic process","1/33","13/5146",0.0803224486873675,0.313294293569059,0.275652342294946,"Zci_05187",1
"GO:0010017","GO:0010017","red or far-red light signaling pathway","1/33","13/5146",0.0803224486873675,0.313294293569059,0.275652342294946,"Zci_04537",1
"GO:0042545","GO:0042545","cell wall modification","1/33","13/5146",0.0803224486873675,0.313294293569059,0.275652342294946,"Zci_09882",1
"GO:0048506","GO:0048506","regulation of timing of meristematic phase transition","1/33","13/5146",0.0803224486873675,0.313294293569059,0.275652342294946,"Zci_10677",1
"GO:0048510","GO:0048510","regulation of timing of transition from vegetative to reproductive phase","1/33","13/5146",0.0803224486873675,0.313294293569059,0.275652342294946,"Zci_10677",1
"GO:0080050","GO:0080050","regulation of seed development","1/33","13/5146",0.0803224486873675,0.313294293569059,0.275652342294946,"Zci_12313",1
"GO:0016053","GO:0016053","organic acid biosynthetic process","3/33","161/5146",0.0828048531306952,0.313294293569059,0.275652342294946,"Zci_01804/Zci_09882/Zci_10677",3
"GO:0046394","GO:0046394","carboxylic acid biosynthetic process","3/33","161/5146",0.0828048531306952,0.313294293569059,0.275652342294946,"Zci_01804/Zci_09882/Zci_10677",3
"GO:0010817","GO:0010817","regulation of hormone levels","2/33","76/5146",0.0847332590679309,0.313294293569059,0.275652342294946,"Zci_09179/Zci_10677",2
"GO:0006534","GO:0006534","cysteine metabolic process","1/33","14/5146",0.0862350454520896,0.313294293569059,0.275652342294946,"Zci_01804",1
"GO:0010104","GO:0010104","regulation of ethylene-activated signaling pathway","1/33","14/5146",0.0862350454520896,0.313294293569059,0.275652342294946,"Zci_10677",1
"GO:0010214","GO:0010214","seed coat development","1/33","14/5146",0.0862350454520896,0.313294293569059,0.275652342294946,"Zci_09229",1
"GO:0070297","GO:0070297","regulation of phosphorelay signal transduction system","1/33","14/5146",0.0862350454520896,0.313294293569059,0.275652342294946,"Zci_10677",1
"GO:0098876","GO:0098876","vesicle-mediated transport to the plasma membrane","1/33","14/5146",0.0862350454520896,0.313294293569059,0.275652342294946,"Zci_15697",1
"GO:1901700","GO:1901700","response to oxygen-containing compound","6/33","492/5146",0.0892231331080731,0.321203279189063,0.282611072332748,"Zci_01850/Zci_02946/Zci_09179/Zci_09882/Zci_10677/Zci_11741",6
"GO:0040034","GO:0040034","regulation of development, heterochronic","1/33","15/5146",0.0921107748948176,0.324132997236137,0.285188788105161,"Zci_10677",1
"GO:0071215","GO:0071215","cellular response to abscisic acid stimulus","2/33","80/5146",0.0924924966860695,0.324132997236137,0.285188788105161,"Zci_02946/Zci_11741",2
"GO:0097306","GO:0097306","cellular response to alcohol","2/33","80/5146",0.0924924966860695,0.324132997236137,0.285188788105161,"Zci_02946/Zci_11741",2
"GO:0010200","GO:0010200","response to chitin","1/33","16/5146",0.0979498597571195,0.331522602254866,0.291690540527274,"Zci_01850",1
"GO:0042752","GO:0042752","regulation of circadian rhythm","1/33","16/5146",0.0979498597571195,0.331522602254866,0.291690540527274,"Zci_05187",1
"GO:0071281","GO:0071281","cellular response to iron ion","1/33","16/5146",0.0979498597571195,0.331522602254866,0.291690540527274,"Zci_10677",1
"GO:0071369","GO:0071369","cellular response to ethylene stimulus","1/33","16/5146",0.0979498597571195,0.331522602254866,0.291690540527274,"Zci_12313",1
"GO:0007032","GO:0007032","endosome organization","1/33","17/5146",0.10375252147798,0.336770479551477,0.296307891365069,"Zci_15697",1
"GO:0009873","GO:0009873","ethylene-activated signaling pathway","1/33","17/5146",0.10375252147798,0.336770479551477,0.296307891365069,"Zci_12313",1
"GO:0035601","GO:0035601","protein deacylation","1/33","17/5146",0.10375252147798,0.336770479551477,0.296307891365069,"Zci_13189",1
"GO:0048586","GO:0048586","regulation of long-day photoperiodism, flowering","1/33","17/5146",0.10375252147798,0.336770479551477,0.296307891365069,"Zci_04537",1
"GO:0098732","GO:0098732","macromolecule deacylation","1/33","17/5146",0.10375252147798,0.336770479551477,0.296307891365069,"Zci_13189",1
"GO:0010928","GO:0010928","regulation of auxin mediated signaling pathway","1/33","18/5146",0.109518980201167,0.349754162577922,0.307731599716353,"Zci_01850",1
"GO:0034219","GO:0034219","carbohydrate transmembrane transport","1/33","18/5146",0.109518980201167,0.349754162577922,0.307731599716353,"Zci_10716",1
"GO:0071368","GO:0071368","cellular response to cytokinin stimulus","1/33","19/5146",0.115249454782556,0.362212572173748,0.318693145639316,"Zci_12313",1
"GO:1901000","GO:1901000","regulation of response to salt stress","1/33","19/5146",0.115249454782556,0.362212572173748,0.318693145639316,"Zci_11741",1
"GO:0043207","GO:0043207","response to external biotic stimulus","4/33","298/5146",0.120837055278306,0.368639080418143,0.324347516263704,"Zci_01850/Zci_09882/Zci_10716/Zci_13189",4
"GO:0051707","GO:0051707","response to other organism","4/33","298/5146",0.120837055278306,0.368639080418143,0.324347516263704,"Zci_01850/Zci_09882/Zci_10716/Zci_13189",4
"GO:0071489","GO:0071489","cellular response to red or far red light","1/33","20/5146",0.120944162797414,0.368639080418143,0.324347516263704,"Zci_04537",1
"GO:0009607","GO:0009607","response to biotic stimulus","4/33","300/5146",0.12303794050003,0.368639080418143,0.324347516263704,"Zci_01850/Zci_09882/Zci_10716/Zci_13189",4
"GO:1901701","GO:1901701","cellular response to oxygen-containing compound","3/33","194/5146",0.126331271284079,0.368639080418143,0.324347516263704,"Zci_02946/Zci_10677/Zci_11741",3
"GO:0000096","GO:0000096","sulfur amino acid metabolic process","1/33","21/5146",0.126603320547645,0.368639080418143,0.324347516263704,"Zci_01804",1
"GO:0006635","GO:0006635","fatty acid beta-oxidation","1/33","21/5146",0.126603320547645,0.368639080418143,0.324347516263704,"Zci_12460",1
"GO:0006892","GO:0006892","post-Golgi vesicle-mediated transport","1/33","21/5146",0.126603320547645,0.368639080418143,0.324347516263704,"Zci_15697",1
"GO:0009069","GO:0009069","serine family amino acid metabolic process","1/33","21/5146",0.126603320547645,0.368639080418143,0.324347516263704,"Zci_01804",1
"GO:0019359","GO:0019359","nicotinamide nucleotide biosynthetic process","1/33","21/5146",0.126603320547645,0.368639080418143,0.324347516263704,"Zci_00805",1
"GO:0051049","GO:0051049","regulation of transport","2/33","98/5146",0.129711446492417,0.374932356284652,0.329884662228123,"Zci_02946/Zci_11741",2
"GO:0008643","GO:0008643","carbohydrate transport","1/33","22/5146",0.132227143068997,0.37637982261198,0.331158217130689,"Zci_10716",1
"GO:0019363","GO:0019363","pyridine nucleotide biosynthetic process","1/33","22/5146",0.132227143068997,0.37637982261198,0.331158217130689,"Zci_00805",1
"GO:0014070","GO:0014070","response to organic cyclic compound","2/33","101/5146",0.136225058200432,0.37637982261198,0.331158217130689,"Zci_01850/Zci_09179",2
"GO:0071396","GO:0071396","cellular response to lipid","2/33","101/5146",0.136225058200432,0.37637982261198,0.331158217130689,"Zci_02946/Zci_11741",2
"GO:0006006","GO:0006006","glucose metabolic process","1/33","23/5146",0.137815844138225,0.37637982261198,0.331158217130689,"Zci_09882",1
"GO:0009640","GO:0009640","photomorphogenesis","1/33","23/5146",0.137815844138225,0.37637982261198,0.331158217130689,"Zci_05187",1
"GO:0042157","GO:0042157","lipoprotein metabolic process","1/33","23/5146",0.137815844138225,0.37637982261198,0.331158217130689,"Zci_13189",1
"GO:1902532","GO:1902532","negative regulation of intracellular signal transduction","1/33","23/5146",0.137815844138225,0.37637982261198,0.331158217130689,"Zci_10677",1
"GO:0090150","GO:0090150","establishment of protein localization to membrane","1/33","24/5146",0.143369636280219,0.388865588814841,0.34214383279562,"Zci_15697",1
"GO:0046474","GO:0046474","glycerophospholipid biosynthetic process","1/33","25/5146",0.148888730775094,0.390680071863442,0.343740307779902,"Zci_13189",1
"GO:0048573","GO:0048573","photoperiodism, flowering","1/33","25/5146",0.148888730775094,0.390680071863442,0.343740307779902,"Zci_05187",1
"GO:0071248","GO:0071248","cellular response to metal ion","1/33","25/5146",0.148888730775094,0.390680071863442,0.343740307779902,"Zci_10677",1
"GO:0009605","GO:0009605","response to external stimulus","5/33","446/5146",0.15263784715146,0.390680071863442,0.343740307779902,"Zci_01850/Zci_05187/Zci_09882/Zci_10716/Zci_13189",5
"GO:0009756","GO:0009756","carbohydrate mediated signaling","1/33","26/5146",0.154373337665238,0.390680071863442,0.343740307779902,"Zci_10677",1
"GO:0010039","GO:0010039","response to iron ion","1/33","26/5146",0.154373337665238,0.390680071863442,0.343740307779902,"Zci_10677",1
"GO:0010182","GO:0010182","sugar mediated signaling pathway","1/33","26/5146",0.154373337665238,0.390680071863442,0.343740307779902,"Zci_10677",1
"GO:0009668","GO:0009668","plastid membrane organization","1/33","27/5146",0.159823665762317,0.390680071863442,0.343740307779902,"Zci_07224",1
"GO:0009746","GO:0009746","response to hexose","1/33","27/5146",0.159823665762317,0.390680071863442,0.343740307779902,"Zci_10677",1
"GO:0009845","GO:0009845","seed germination","1/33","27/5146",0.159823665762317,0.390680071863442,0.343740307779902,"Zci_09179",1
"GO:0010027","GO:0010027","thylakoid membrane organization","1/33","27/5146",0.159823665762317,0.390680071863442,0.343740307779902,"Zci_07224",1
"GO:0010218","GO:0010218","response to far red light","1/33","27/5146",0.159823665762317,0.390680071863442,0.343740307779902,"Zci_05187",1
"GO:0042446","GO:0042446","hormone biosynthetic process","1/33","27/5146",0.159823665762317,0.390680071863442,0.343740307779902,"Zci_10677",1
"GO:0046364","GO:0046364","monosaccharide biosynthetic process","1/33","27/5146",0.159823665762317,0.390680071863442,0.343740307779902,"Zci_09882",1
"GO:0051302","GO:0051302","regulation of cell division","1/33","27/5146",0.159823665762317,0.390680071863442,0.343740307779902,"Zci_10677",1
"GO:0072525","GO:0072525","pyridine-containing compound biosynthetic process","1/33","27/5146",0.159823665762317,0.390680071863442,0.343740307779902,"Zci_00805",1
"GO:0010114","GO:0010114","response to red light","1/33","28/5146",0.165239922654258,0.396575814370219,0.348927683563377,"Zci_05187",1
"GO:0034284","GO:0034284","response to monosaccharide","1/33","28/5146",0.165239922654258,0.396575814370219,0.348927683563377,"Zci_10677",1
"GO:0042364","GO:0042364","water-soluble vitamin biosynthetic process","1/33","28/5146",0.165239922654258,0.396575814370219,0.348927683563377,"Zci_09882",1
"GO:0009561","GO:0009561","megagametogenesis","1/33","29/5146",0.170622314712173,0.402181170392979,0.353859562466975,"Zci_15697",1
"GO:0016114","GO:0016114","terpenoid biosynthetic process","1/33","29/5146",0.170622314712173,0.402181170392979,0.353859562466975,"Zci_10677",1
"GO:0071241","GO:0071241","cellular response to inorganic substance","1/33","29/5146",0.170622314712173,0.402181170392979,0.353859562466975,"Zci_10677",1
"GO:0098542","GO:0098542","defense response to other organism","3/33","226/5146",0.174918389753404,0.407511898541026,0.358549809721105,"Zci_01850/Zci_09882/Zci_13189",3
"GO:0001666","GO:0001666","response to hypoxia","1/33","30/5146",0.175971047097261,0.407511898541026,0.358549809721105,"Zci_10677",1
"GO:0072657","GO:0072657","protein localization to membrane","1/33","30/5146",0.175971047097261,0.407511898541026,0.358549809721105,"Zci_15697",1
"GO:0006767","GO:0006767","water-soluble vitamin metabolic process","1/33","31/5146",0.181286323767666,0.407894228477249,0.358886203152497,"Zci_09882",1
"GO:0009624","GO:0009624","response to nematode","1/33","31/5146",0.181286323767666,0.407894228477249,0.358886203152497,"Zci_10716",1
"GO:0009648","GO:0009648","photoperiodism","1/33","31/5146",0.181286323767666,0.407894228477249,0.358886203152497,"Zci_05187",1
"GO:0044272","GO:0044272","sulfur compound biosynthetic process","1/33","31/5146",0.181286323767666,0.407894228477249,0.358886203152497,"Zci_01804",1
"GO:2000242","GO:2000242","negative regulation of reproductive process","1/33","31/5146",0.181286323767666,0.407894228477249,0.358886203152497,"Zci_04537",1
"GO:0032879","GO:0032879","regulation of localization","2/33","123/5146",0.18595718211801,0.410450364467646,0.361135222325335,"Zci_02946/Zci_11741",2
"GO:0010150","GO:0010150","leaf senescence","1/33","32/5146",0.186568347485294,0.410450364467646,0.361135222325335,"Zci_12313",1
"GO:0019318","GO:0019318","hexose metabolic process","1/33","32/5146",0.186568347485294,0.410450364467646,0.361135222325335,"Zci_09882",1
"GO:0090693","GO:0090693","plant organ senescence","1/33","32/5146",0.186568347485294,0.410450364467646,0.361135222325335,"Zci_12313",1
"GO:0010224","GO:0010224","response to UV-B","1/33","33/5146",0.191817319822601,0.417111817266312,0.366996309184341,"Zci_05187",1
"GO:0090351","GO:0090351","seedling development","1/33","33/5146",0.191817319822601,0.417111817266312,0.366996309184341,"Zci_09179",1
"GO:0044283","GO:0044283","small molecule biosynthetic process","3/33","237/5146",0.19275621858519,0.417111817266312,0.366996309184341,"Zci_01804/Zci_09882/Zci_10677",3
"GO:0009657","GO:0009657","plastid organization","2/33","127/5146",0.195287101974688,0.418019958821494,0.367795338569683,"Zci_05187/Zci_07224",2
"GO:0071229","GO:0071229","cellular response to acid chemical","2/33","127/5146",0.195287101974688,0.418019958821494,0.367795338569683,"Zci_02946/Zci_11741",2
"GO:0006887","GO:0006887","exocytosis","1/33","35/5146",0.202216910739252,0.425946258791189,0.374769302657851,"Zci_15697",1
"GO:0036293","GO:0036293","response to decreased oxygen levels","1/33","35/5146",0.202216910739252,0.425946258791189,0.374769302657851,"Zci_10677",1
"GO:0046496","GO:0046496","nicotinamide nucleotide metabolic process","1/33","35/5146",0.202216910739252,0.425946258791189,0.374769302657851,"Zci_00805",1
"GO:0019362","GO:0019362","pyridine nucleotide metabolic process","1/33","36/5146",0.207367926576779,0.429935596462852,0.378279325968112,"Zci_00805",1
"GO:0042445","GO:0042445","hormone metabolic process","1/33","36/5146",0.207367926576779,0.429935596462852,0.378279325968112,"Zci_10677",1
"GO:0070482","GO:0070482","response to oxygen levels","1/33","36/5146",0.207367926576779,0.429935596462852,0.378279325968112,"Zci_10677",1
"GO:0010073","GO:0010073","meristem maintenance","1/33","37/5146",0.212486685563661,0.438253788975051,0.38559809715774,"Zci_12313",1
"GO:0090407","GO:0090407","organophosphate biosynthetic process","2/33","135/5146",0.214130201303429,0.439355231689938,0.386567202789392,"Zci_00805/Zci_13189",2
"GO:0006400","GO:0006400","tRNA modification","1/33","38/5146",0.217573383425552,0.439587039982237,0.386771159580331,"Zci_10799",1
"GO:0006721","GO:0006721","terpenoid metabolic process","1/33","38/5146",0.217573383425552,0.439587039982237,0.386771159580331,"Zci_10677",1
"GO:0009110","GO:0009110","vitamin biosynthetic process","1/33","38/5146",0.217573383425552,0.439587039982237,0.386771159580331,"Zci_09882",1
"GO:0009744","GO:0009744","response to sucrose","1/33","39/5146",0.222628214738582,0.439673403292264,0.386847146437372,"Zci_10677",1
"GO:0010256","GO:0010256","endomembrane system organization","1/33","39/5146",0.222628214738582,0.439673403292264,0.386847146437372,"Zci_15697",1
"GO:0034285","GO:0034285","response to disaccharide","1/33","39/5146",0.222628214738582,0.439673403292264,0.386847146437372,"Zci_10677",1
"GO:0045088","GO:0045088","regulation of innate immune response","1/33","39/5146",0.222628214738582,0.439673403292264,0.386847146437372,"Zci_13189",1
"GO:0006952","GO:0006952","defense response","3/33","256/5146",0.224626568121182,0.439673403292264,0.386847146437372,"Zci_01850/Zci_09882/Zci_13189",3
"GO:0008299","GO:0008299","isoprenoid biosynthetic process","1/33","40/5146",0.227651372935885,0.439673403292264,0.386847146437372,"Zci_10677",1
"GO:0071322","GO:0071322","cellular response to carbohydrate stimulus","1/33","40/5146",0.227651372935885,0.439673403292264,0.386847146437372,"Zci_10677",1
"GO:0006650","GO:0006650","glycerophospholipid metabolic process","1/33","41/5146",0.23264305031409,0.439673403292264,0.386847146437372,"Zci_13189",1
"GO:0006766","GO:0006766","vitamin metabolic process","1/33","41/5146",0.23264305031409,0.439673403292264,0.386847146437372,"Zci_09882",1
"GO:0032940","GO:0032940","secretion by cell","1/33","41/5146",0.23264305031409,0.439673403292264,0.386847146437372,"Zci_15697",1
"GO:0045017","GO:0045017","glycerolipid biosynthetic process","1/33","41/5146",0.23264305031409,0.439673403292264,0.386847146437372,"Zci_13189",1
"GO:0071555","GO:0071555","cell wall organization","1/33","41/5146",0.23264305031409,0.439673403292264,0.386847146437372,"Zci_09882",1
"GO:0072524","GO:0072524","pyridine-containing compound metabolic process","1/33","41/5146",0.23264305031409,0.439673403292264,0.386847146437372,"Zci_00805",1
"GO:0009966","GO:0009966","regulation of signal transduction","2/33","143/5146",0.233160138109534,0.439673403292264,0.386847146437372,"Zci_01850/Zci_10677",2
"GO:0007568","GO:0007568","aging","1/33","42/5146",0.237603438039777,0.441741603116206,0.388666854416438,"Zci_12313",1
"GO:0009967","GO:0009967","positive regulation of signal transduction","1/33","42/5146",0.237603438039777,0.441741603116206,0.388666854416438,"Zci_01850",1
"GO:0016050","GO:0016050","vesicle organization","1/33","42/5146",0.237603438039777,0.441741603116206,0.388666854416438,"Zci_15697",1
"GO:0046903","GO:0046903","secretion","1/33","43/5146",0.242532726155899,0.44879887643802,0.394876204415163,"Zci_15697",1
"GO:0023056","GO:0023056","positive regulation of signaling","1/33","44/5146",0.247431103588166,0.453623689911637,0.399121322064732,"Zci_01850",1
"GO:0048581","GO:0048581","negative regulation of post-embryonic development","1/33","44/5146",0.247431103588166,0.453623689911637,0.399121322064732,"Zci_04537",1
"GO:0006812","GO:0006812","cation transport","2/33","150/5146",0.249914285209482,0.453972738270435,0.399428432662185,"Zci_06375/Zci_10716",2
"GO:0010646","GO:0010646","regulation of cell communication","2/33","150/5146",0.249914285209482,0.453972738270435,0.399428432662185,"Zci_01850/Zci_10677",2
"GO:0006633","GO:0006633","fatty acid biosynthetic process","1/33","46/5146",0.257135876555825,0.460750258443923,0.405391641533595,"Zci_07224",1
"GO:0008654","GO:0008654","phospholipid biosynthetic process","1/33","46/5146",0.257135876555825,0.460750258443923,0.405391641533595,"Zci_13189",1
"GO:0010647","GO:0010647","positive regulation of cell communication","1/33","46/5146",0.257135876555825,0.460750258443923,0.405391641533595,"Zci_01850",1
"GO:0009791","GO:0009791","post-embryonic development","4/33","409/5146",0.265013807711674,0.469432992834552,0.413031155311634,"Zci_05187/Zci_09179/Zci_09229/Zci_12313",4
"GO:0006720","GO:0006720","isoprenoid metabolic process","1/33","48/5146",0.266719246244031,0.469432992834552,0.413031155311634,"Zci_10677",1
"GO:1902531","GO:1902531","regulation of intracellular signal transduction","1/33","48/5146",0.266719246244031,0.469432992834552,0.413031155311634,"Zci_10677",1
"GO:0008610","GO:0008610","lipid biosynthetic process","2/33","157/5146",0.266723291383268,0.469432992834552,0.413031155311634,"Zci_10677/Zci_13189",2
"GO:0042440","GO:0042440","pigment metabolic process","1/33","49/5146",0.271465865481761,0.471493345310426,0.414843958792534,"Zci_05187",1
"GO:0050776","GO:0050776","regulation of immune response","1/33","49/5146",0.271465865481761,0.471493345310426,0.414843958792534,"Zci_13189",1
"GO:1902600","GO:1902600","proton transmembrane transport","1/33","49/5146",0.271465865481761,0.471493345310426,0.414843958792534,"Zci_10716",1
"GO:0005996","GO:0005996","monosaccharide metabolic process","1/33","50/5146",0.276182684480996,0.477591017705129,0.420209002818707,"Zci_09882",1
"GO:0031401","GO:0031401","positive regulation of protein modification process","1/33","51/5146",0.280869884522622,0.481491230610209,0.423640609601221,"Zci_08682",1
"GO:1901607","GO:1901607","alpha-amino acid biosynthetic process","1/33","51/5146",0.280869884522622,0.481491230610209,0.423640609601221,"Zci_01804",1
"GO:0045229","GO:0045229","external encapsulating structure organization","1/33","52/5146",0.28552764582012,0.485274453840205,0.42696928288439,"Zci_09882",1
"GO:0071482","GO:0071482","cellular response to light stimulus","1/33","52/5146",0.28552764582012,0.485274453840205,0.42696928288439,"Zci_04537",1
"GO:0010228","GO:0010228","vegetative to reproductive phase transition of meristem","1/33","53/5146",0.290156147525644,0.491033480428012,0.432036369010293,"Zci_05187",1
"GO:0002682","GO:0002682","regulation of immune system process","1/33","54/5146",0.294755567736061,0.492502973938734,0.433329304555346,"Zci_13189",1
"GO:0009611","GO:0009611","response to wounding","1/33","54/5146",0.294755567736061,0.492502973938734,0.433329304555346,"Zci_09229",1
"GO:0080135","GO:0080135","regulation of cellular response to stress","1/33","54/5146",0.294755567736061,0.492502973938734,0.433329304555346,"Zci_13189",1
"GO:0006281","GO:0006281","DNA repair","2/33","170/5146",0.297964325142378,0.495772574606645,0.43620606644019,"Zci_05187/Zci_13740",2
"GO:0009909","GO:0009909","regulation of flower development","1/33","55/5146",0.299326083498965,0.495954514918787,0.436366146831788,"Zci_09179",1
"GO:0071478","GO:0071478","cellular response to radiation","1/33","58/5146",0.312865958964712,0.516228832291775,0.454204528146139,"Zci_04537",1
"GO:0043067","GO:0043067","regulation of programmed cell death","1/33","59/5146",0.317322606636521,0.521409760282417,0.458762973560553,"Zci_13189",1
"GO:0019752","GO:0019752","carboxylic acid metabolic process","3/33","310/5146",0.319806167109257,0.523319182542421,0.460442980918505,"Zci_01804/Zci_09882/Zci_10677",3
"GO:0043436","GO:0043436","oxoacid metabolic process","3/33","311/5146",0.321601764816351,0.524091764885905,0.461122738376487,"Zci_01804/Zci_09882/Zci_10677",3
"GO:0006082","GO:0006082","organic acid metabolic process","3/33","312/5146",0.323397771156036,0.524858677777828,0.461797507561035,"Zci_01804/Zci_09882/Zci_10677",3
"GO:0009553","GO:0009553","embryo sac development","1/33","62/5146",0.330525023705428,0.527539090625099,0.464155871868441,"Zci_15697",1
"GO:0051240","GO:0051240","positive regulation of multicellular organismal process","1/33","62/5146",0.330525023705428,0.527539090625099,0.464155871868441,"Zci_15697",1
"GO:0006974","GO:0006974","cellular response to DNA damage stimulus","2/33","184/5146",0.331447528800161,0.527539090625099,0.464155871868441,"Zci_05187/Zci_13740",2
"GO:0010629","GO:0010629","negative regulation of gene expression","2/33","184/5146",0.331447528800161,0.527539090625099,0.464155871868441,"Zci_04537/Zci_09313",2
"GO:0009968","GO:0009968","negative regulation of signal transduction","1/33","63/5146",0.334870553645971,0.527539090625099,0.464155871868441,"Zci_10677",1
"GO:0046486","GO:0046486","glycerolipid metabolic process","1/33","63/5146",0.334870553645971,0.527539090625099,0.464155871868441,"Zci_13189",1
"GO:0009411","GO:0009411","response to UV","1/33","64/5146",0.339188726325429,0.527539090625099,0.464155871868441,"Zci_05187",1
"GO:0051241","GO:0051241","negative regulation of multicellular organismal process","1/33","64/5146",0.339188726325429,0.527539090625099,0.464155871868441,"Zci_04537",1
"GO:0008652","GO:0008652","cellular amino acid biosynthetic process","1/33","65/5146",0.343479708622016,0.527539090625099,0.464155871868441,"Zci_01804",1
"GO:0048193","GO:0048193","Golgi vesicle transport","1/33","65/5146",0.343479708622016,0.527539090625099,0.464155871868441,"Zci_15697",1
"GO:0048507","GO:0048507","meristem development","1/33","65/5146",0.343479708622016,0.527539090625099,0.464155871868441,"Zci_12313",1
"GO:0051093","GO:0051093","negative regulation of developmental process","1/33","65/5146",0.343479708622016,0.527539090625099,0.464155871868441,"Zci_04537",1
"GO:0034654","GO:0034654","nucleobase-containing compound biosynthetic process","2/33","190/5146",0.345692966916958,0.527539090625099,0.464155871868441,"Zci_00805/Zci_09313",2
"GO:0010243","GO:0010243","response to organonitrogen compound","1/33","66/5146",0.347743666428644,0.527539090625099,0.464155871868441,"Zci_01850",1
"GO:0010648","GO:0010648","negative regulation of cell communication","1/33","66/5146",0.347743666428644,0.527539090625099,0.464155871868441,"Zci_10677",1
"GO:0010941","GO:0010941","regulation of cell death","1/33","66/5146",0.347743666428644,0.527539090625099,0.464155871868441,"Zci_13189",1
"GO:0023057","GO:0023057","negative regulation of signaling","1/33","66/5146",0.347743666428644,0.527539090625099,0.464155871868441,"Zci_10677",1
"GO:0048608","GO:0048608","reproductive structure development","3/33","327/5146",0.350360557662629,0.527539090625099,0.464155871868441,"Zci_05187/Zci_09229/Zci_12313",3
"GO:0061458","GO:0061458","reproductive system development","3/33","327/5146",0.350360557662629,0.527539090625099,0.464155871868441,"Zci_05187/Zci_09229/Zci_12313",3
"GO:0006644","GO:0006644","phospholipid metabolic process","1/33","67/5146",0.351980764658536,0.527971146987805,0.464536017153012,"Zci_13189",1
"GO:0010038","GO:0010038","response to metal ion","2/33","194/5146",0.355143615243705,0.530705175986819,0.466941555692815,"Zci_01850/Zci_10677",2
"GO:0048519","GO:0048519","negative regulation of biological process","4/33","471/5146",0.357338790176721,0.531978048533765,0.468061494058151,"Zci_04537/Zci_09313/Zci_10677/Zci_11741",4
"GO:0009651","GO:0009651","response to salt stress","2/33","197/5146",0.362204309069503,0.537201896597466,0.472657702747903,"Zci_01850/Zci_09179",2
"GO:0000302","GO:0000302","response to reactive oxygen species","1/33","71/5146",0.368663826098784,0.540706944944883,0.47574162354268,"Zci_09882",1
"GO:0097659","GO:0097659","nucleic acid-templated transcription","1/33","71/5146",0.368663826098784,0.540706944944883,0.47574162354268,"Zci_09313",1
"GO:1901293","GO:1901293","nucleoside phosphate biosynthetic process","1/33","71/5146",0.368663826098784,0.540706944944883,0.47574162354268,"Zci_00805",1
"GO:0009743","GO:0009743","response to carbohydrate","1/33","73/5146",0.376848416030304,0.550671486154982,0.484508936515947,"Zci_10677",1
"GO:0009165","GO:0009165","nucleotide biosynthetic process","1/33","74/5146",0.380902033667008,0.554548549015202,0.487920174705029,"Zci_00805",1
"GO:0051128","GO:0051128","regulation of cellular component organization","2/33","207/5146",0.385548711562809,0.559257471717481,0.49206332572697,"Zci_02946/Zci_11741",2
"GO:0045087","GO:0045087","innate immune response","1/33","76/5146",0.388932700660513,0.560063088951139,0.492772148970832,"Zci_13189",1
"GO:0048831","GO:0048831","regulation of shoot system development","1/33","76/5146",0.388932700660513,0.560063088951139,0.492772148970832,"Zci_09179",1
"GO:0032774","GO:0032774","RNA biosynthetic process","1/33","77/5146",0.392910061780475,0.563622937379574,0.495904285679529,"Zci_09313",1
"GO:0019637","GO:0019637","organophosphate metabolic process","2/33","211/5146",0.394795173121231,0.563622937379574,0.495904285679529,"Zci_00805/Zci_13189",2
"GO:0010035","GO:0010035","response to inorganic substance","3/33","353/5146",0.396925162323224,0.563622937379574,0.495904285679529,"Zci_01850/Zci_09882/Zci_10677",3
"GO:0018193","GO:0018193","peptidyl-amino acid modification","2/33","212/5146",0.397097978608336,0.563622937379574,0.495904285679529,"Zci_02946/Zci_11741",2
"GO:0009642","GO:0009642","response to light intensity","1/33","80/5146",0.404692106895709,0.569696129475721,0.501247790687038,"Zci_05187",1
"GO:0031347","GO:0031347","regulation of defense response","1/33","80/5146",0.404692106895709,0.569696129475721,0.501247790687038,"Zci_13189",1
"GO:0048316","GO:0048316","seed development","2/33","216/5146",0.406272489234585,0.569696129475721,0.501247790687038,"Zci_09229/Zci_12313",2
"GO:0006955","GO:0006955","immune response","1/33","81/5146",0.408569951442184,0.569696129475721,0.501247790687038,"Zci_13189",1
"GO:0032270","GO:0032270","positive regulation of cellular protein metabolic process","1/33","81/5146",0.408569951442184,0.569696129475721,0.501247790687038,"Zci_08682",1
"GO:0010154","GO:0010154","fruit development","2/33","219/5146",0.413113512733071,0.574010354534372,0.50504366653609,"Zci_09229/Zci_12313",2
"GO:0051247","GO:0051247","positive regulation of protein metabolic process","1/33","83/5146",0.416252291386959,0.574722432757601,0.50567018937471,"Zci_08682",1
"GO:0045892","GO:0045892","negative regulation of transcription, DNA-templated","1/33","84/5146",0.420057085853526,0.574722432757601,0.50567018937471,"Zci_04537",1
"GO:0071214","GO:0071214","cellular response to abiotic stimulus","1/33","84/5146",0.420057085853526,0.574722432757601,0.50567018937471,"Zci_04537",1
"GO:0104004","GO:0104004","cellular response to environmental stimulus","1/33","84/5146",0.420057085853526,0.574722432757601,0.50567018937471,"Zci_04537",1
"GO:0006790","GO:0006790","sulfur compound metabolic process","1/33","85/5146",0.423837827885694,0.574722432757601,0.50567018937471,"Zci_01804",1
"GO:1902679","GO:1902679","negative regulation of RNA biosynthetic process","1/33","85/5146",0.423837827885694,0.574722432757601,0.50567018937471,"Zci_04537",1
"GO:1903507","GO:1903507","negative regulation of nucleic acid-templated transcription","1/33","85/5146",0.423837827885694,0.574722432757601,0.50567018937471,"Zci_04537",1
"GO:0006259","GO:0006259","DNA metabolic process","2/33","225/5146",0.42668786674428,0.574722432757601,0.50567018937471,"Zci_05187/Zci_13740",2
"GO:0006970","GO:0006970","response to osmotic stress","2/33","225/5146",0.42668786674428,0.574722432757601,0.50567018937471,"Zci_01850/Zci_09179",2
"GO:0044255","GO:0044255","cellular lipid metabolic process","2/33","227/5146",0.431179514303068,0.578803686996661,0.509261085581857,"Zci_10677/Zci_13189",2
"GO:1901605","GO:1901605","alpha-amino acid metabolic process","1/33","89/5146",0.438723205152028,0.586940504189875,0.516420273489763,"Zci_01804",1
"GO:0009735","GO:0009735","response to cytokinin","1/33","90/5146",0.442385877532883,0.589847836710511,0.518978293331151,"Zci_12313",1
"GO:0061024","GO:0061024","membrane organization","1/33","91/5146",0.446025368442973,0.59270485202489,0.521492041521102,"Zci_07224",1
"GO:0010015","GO:0010015","root morphogenesis","1/33","93/5146",0.45323537365238,0.598260722218536,0.526380380261391,"Zci_12313",1
"GO:0003006","GO:0003006","developmental process involved in reproduction","3/33","386/5146",0.454938296912388,0.598260722218536,0.526380380261391,"Zci_05187/Zci_09229/Zci_12313",3
"GO:0009658","GO:0009658","chloroplast organization","1/33","94/5146",0.456806169747664,0.598260722218536,0.526380380261391,"Zci_05187",1
"GO:0098662","GO:0098662","inorganic cation transmembrane transport","1/33","94/5146",0.456806169747664,0.598260722218536,0.526380380261391,"Zci_10716",1
"GO:0070727","GO:0070727","cellular macromolecule localization","2/33","239/5146",0.457760098061152,0.598260722218536,0.526380380261391,"Zci_09882/Zci_15697",2
"GO:0048366","GO:0048366","leaf development","1/33","95/5146",0.460354347973777,0.599672111176368,0.52762219244917,"Zci_12313",1
"GO:0006351","GO:0006351","transcription, DNA-templated","1/33","96/5146",0.463880047145598,0.600315355129598,0.528188151376653,"Zci_09313",1
"GO:0051253","GO:0051253","negative regulation of RNA metabolic process","1/33","96/5146",0.463880047145598,0.600315355129598,0.528188151376653,"Zci_04537",1
"GO:0050832","GO:0050832","defense response to fungus","1/33","98/5146",0.47086455946739,0.607369268889532,0.534394545461018,"Zci_01850",1
"GO:0009408","GO:0009408","response to heat","1/33","102/5146",0.484569852359081,0.620561129377381,0.546001418989668,"Zci_09882",1
"GO:0031399","GO:0031399","regulation of protein modification process","1/33","102/5146",0.484569852359081,0.620561129377381,0.546001418989668,"Zci_08682",1
"GO:0010605","GO:0010605","negative regulation of macromolecule metabolic process","2/33","252/5146",0.485792803300475,0.620561129377381,0.546001418989668,"Zci_04537/Zci_09313",2
"GO:0009416","GO:0009416","response to light stimulus","2/33","255/5146",0.492142726920018,0.626651189261502,0.551359765139706,"Zci_04537/Zci_05187",2
"GO:0033554","GO:0033554","cellular response to stress","3/33","409/5146",0.494174959121477,0.627222063500336,0.551862049491258,"Zci_05187/Zci_09882/Zci_13740",3
"GO:0016051","GO:0016051","carbohydrate biosynthetic process","1/33","107/5146",0.501218005443719,0.632109331706091,0.556162118008283,"Zci_09882",1
"GO:1901698","GO:1901698","response to nitrogen compound","1/33","107/5146",0.501218005443719,0.632109331706091,0.556162118008283,"Zci_01850",1
"GO:0098660","GO:0098660","inorganic ion transmembrane transport","1/33","108/5146",0.504484488043512,0.634209070683272,0.558009575747376,"Zci_10716",1
"GO:0048584","GO:0048584","positive regulation of response to stimulus","1/33","109/5146",0.507730222837987,0.636269519758996,0.559822464221764,"Zci_01850",1
"GO:0009620","GO:0009620","response to fungus","1/33","112/5146",0.517344213505283,0.646148143127678,0.568514182284055,"Zci_01850",1
"GO:0019438","GO:0019438","aromatic compound biosynthetic process","2/33","268/5146",0.519118918472527,0.646148143127678,0.568514182284055,"Zci_00805/Zci_09313",2
"GO:0002376","GO:0002376","immune system process","1/33","113/5146",0.520508226408407,0.646148143127678,0.568514182284055,"Zci_13189",1
"GO:0071554","GO:0071554","cell wall organization or biogenesis","1/33","114/5146",0.523652122400563,0.647326287182238,0.569550773677089,"Zci_09882",1
"GO:0009117","GO:0009117","nucleotide metabolic process","1/33","115/5146",0.526776025413437,0.647326287182238,0.569550773677089,"Zci_00805",1
"GO:0018130","GO:0018130","heterocycle biosynthetic process","2/33","272/5146",0.527238221157699,0.647326287182238,0.569550773677089,"Zci_00805/Zci_09313",2
"GO:0006753","GO:0006753","nucleoside phosphate metabolic process","1/33","116/5146",0.529880058639705,0.647326287182238,0.569550773677089,"Zci_00805",1
"GO:0009314","GO:0009314","response to radiation","2/33","274/5146",0.531265260945019,0.647326287182238,0.569550773677089,"Zci_04537/Zci_05187",2
"GO:0009892","GO:0009892","negative regulation of metabolic process","2/33","274/5146",0.531265260945019,0.647326287182238,0.569550773677089,"Zci_04537/Zci_09313",2
"GO:2000113","GO:2000113","negative regulation of cellular macromolecule biosynthetic process","1/33","117/5146",0.532964344537298,0.647404541217086,0.569619625579095,"Zci_04537",1
"GO:0006629","GO:0006629","lipid metabolic process","2/33","279/5146",0.541236790080887,0.654486503153489,0.575850697883586,"Zci_10677/Zci_13189",2
"GO:0045934","GO:0045934","negative regulation of nucleobase-containing compound metabolic process","1/33","120/5146",0.54209993190491,0.654486503153489,0.575850697883586,"Zci_04537",1
"GO:0010558","GO:0010558","negative regulation of macromolecule biosynthetic process","1/33","122/5146",0.548093799222197,0.659711685385988,0.58044808044328,"Zci_04537",1
"GO:0048827","GO:0048827","phyllome development","1/33","124/5146",0.554011554733209,0.664813865679851,0.584937239606674,"Zci_12313",1
"GO:1905392","GO:1905392","plant organ morphogenesis","1/33","125/5146",0.556942183704496,0.666311494703868,0.586254930215259,"Zci_12313",1
"GO:0098655","GO:0098655","cation transmembrane transport","1/33","126/5146",0.559854135096201,0.667777823789445,0.587545081537231,"Zci_10716",1
"GO:0031327","GO:0031327","negative regulation of cellular biosynthetic process","1/33","129/5146",0.568479073747068,0.674654437733033,0.593595478175529,"Zci_04537",1
"GO:0009414","GO:0009414","response to water deprivation","1/33","130/5146",0.571317461342512,0.674654437733033,0.593595478175529,"Zci_01850",1
"GO:0033036","GO:0033036","macromolecule localization","2/33","295/5146",0.572207586071162,0.674654437733033,0.593595478175529,"Zci_09882/Zci_15697",2
"GO:0009415","GO:0009415","response to water","1/33","131/5146",0.574137741202101,0.674654437733033,0.593595478175529,"Zci_01850",1
"GO:0009890","GO:0009890","negative regulation of biosynthetic process","1/33","131/5146",0.574137741202101,0.674654437733033,0.593595478175529,"Zci_04537",1
"GO:0005975","GO:0005975","carbohydrate metabolic process","2/33","299/5146",0.579723636210974,0.679202840057828,0.597597395159864,"Zci_09882/Zci_14122",2
"GO:0032446","GO:0032446","protein modification by small protein conjugation","1/33","134/5146",0.582491050342674,0.680432023409141,0.598678893536485,"Zci_05187",1
"GO:0006357","GO:0006357","regulation of transcription by RNA polymerase II","1/33","136/5146",0.587971418729093,0.682628544679889,0.600611505287197,"Zci_01850",1
"GO:0022414","GO:0022414","reproductive process","3/33","468/5146",0.588477772689669,0.682628544679889,0.600611505287197,"Zci_05187/Zci_09229/Zci_12313",3
"GO:0046686","GO:0046686","response to cadmium ion","1/33","137/5146",0.590685379444051,0.682628544679889,0.600611505287197,"Zci_01850",1
"GO:1901362","GO:1901362","organic cyclic compound biosynthetic process","2/33","306/5146",0.592656069914043,0.682628544679889,0.600611505287197,"Zci_00805/Zci_09313",2
"GO:0000003","GO:0000003","reproduction","3/33","471/5146",0.592990452954247,0.682628544679889,0.600611505287197,"Zci_05187/Zci_09229/Zci_12313",3
"GO:0006520","GO:0006520","cellular amino acid metabolic process","1/33","139/5146",0.596061393778943,0.684174817207135,0.601971994937697,"Zci_01804",1
"GO:0048518","GO:0048518","positive regulation of biological process","3/33","478/5146",0.603405130169691,0.689287925433583,0.606470769055067,"Zci_01850/Zci_08682/Zci_15697",3
"GO:0016567","GO:0016567","protein ubiquitination","1/33","142/5146",0.603997247791549,0.689287925433583,0.606470769055067,"Zci_05187",1
"GO:0006979","GO:0006979","response to oxidative stress","1/33","154/5146",0.634255616991012,0.719671129880919,0.633203466216332,"Zci_09882",1
"GO:0070647","GO:0070647","protein modification by small protein conjugation or removal","1/33","154/5146",0.634255616991012,0.719671129880919,0.633203466216332,"Zci_05187",1
"GO:0071702","GO:0071702","organic substance transport","2/33","337/5146",0.646527390801033,0.728967892366972,0.64138323331597,"Zci_10716/Zci_15697",2
"GO:0048523","GO:0048523","negative regulation of cellular process","2/33","338/5146",0.648172718143754,0.728967892366972,0.64138323331597,"Zci_04537/Zci_10677",2
"GO:0055086","GO:0055086","nucleobase-containing small molecule metabolic process","1/33","160/5146",0.648531697098294,0.728967892366972,0.64138323331597,"Zci_00805",1
"GO:0051641","GO:0051641","cellular localization","2/33","339/5146",0.649812287892781,0.728967892366972,0.64138323331597,"Zci_09882/Zci_15697",2
"GO:0048229","GO:0048229","gametophyte development","1/33","164/5146",0.657747289712155,0.7357851037458,0.647381364539766,"Zci_15697",1
"GO:0030163","GO:0030163","protein catabolic process","1/33","166/5146",0.66226678376685,0.738753933441331,0.649993492740778,"Zci_13189",1
"GO:0009793","GO:0009793","embryo development ending in seed dormancy","1/33","167/5146",0.664504774958756,0.739168232819291,0.650358014522024,"Zci_12313",1
"GO:0032268","GO:0032268","regulation of cellular protein metabolic process","1/33","170/5146",0.671132804955838,0.742708255413784,0.653472707448066,"Zci_08682",1
"GO:0022622","GO:0022622","root system development","1/33","171/5146",0.67331379720593,0.742708255413784,0.653472707448066,"Zci_12313",1
"GO:0048364","GO:0048364","root development","1/33","171/5146",0.67331379720593,0.742708255413784,0.653472707448066,"Zci_12313",1
"GO:0065008","GO:0065008","regulation of biological quality","2/33","358/5146",0.679876080546763,0.74786368860144,0.658008721230932,"Zci_09179/Zci_10677",2
"GO:0048367","GO:0048367","shoot system development","1/33","178/5146",0.688192804560348,0.754915098631296,0.664212912405526,"Zci_12313",1
"GO:0051172","GO:0051172","negative regulation of nitrogen compound metabolic process","1/33","181/5146",0.694366406122974,0.759583140399717,0.668320094291085,"Zci_04537",1
"GO:0048522","GO:0048522","positive regulation of cellular process","2/33","372/5146",0.700720924362974,0.76442282657779,0.672578297706668,"Zci_01850/Zci_08682",2
"GO:0051246","GO:0051246","regulation of protein metabolic process","1/33","186/5146",0.704393276707098,0.766317960373656,0.674245733343116,"Zci_08682",1
"GO:0031324","GO:0031324","negative regulation of cellular metabolic process","1/33","190/5146",0.712184399597919,0.772671293810344,0.679835721029304,"Zci_04537",1
"GO:0034220","GO:0034220","ion transmembrane transport","1/33","198/5146",0.727173739264466,0.784460198938527,0.69020820268116,"Zci_10716",1
"GO:0044271","GO:0044271","cellular nitrogen compound biosynthetic process","2/33","392/5146",0.728621718671613,0.784460198938527,0.69020820268116,"Zci_00805/Zci_09313",2
"GO:0009790","GO:0009790","embryo development","1/33","199/5146",0.728993316185298,0.784460198938527,0.69020820268116,"Zci_12313",1
"GO:0015833","GO:0015833","peptide transport","1/33","208/5146",0.744848615204584,0.799349733390285,0.703308776587412,"Zci_15697",1
"GO:0042886","GO:0042886","amide transport","1/33","212/5146",0.751603151045391,0.803619270214173,0.707065333442029,"Zci_15697",1
"GO:0045184","GO:0045184","establishment of protein localization","1/33","213/5146",0.753264500055424,0.803619270214173,0.707065333442029,"Zci_15697",1
"GO:0009888","GO:0009888","tissue development","1/33","214/5146",0.754915072019375,0.803619270214173,0.707065333442029,"Zci_12313",1
"GO:0016192","GO:0016192","vesicle-mediated transport","1/33","216/5146",0.758184155352652,0.80493545715724,0.708223382028299,"Zci_15697",1
"GO:1901566","GO:1901566","organonitrogen compound biosynthetic process","2/33","424/5146",0.768854053933537,0.809691593688768,0.712408074191872,"Zci_00805/Zci_01804",2
"GO:0009266","GO:0009266","response to temperature stimulus","1/33","224/5146",0.77084275459764,0.809691593688768,0.712408074191872,"Zci_09882",1
"GO:0015031","GO:0015031","protein transport","1/33","224/5146",0.77084275459764,0.809691593688768,0.712408074191872,"Zci_15697",1
"GO:0034613","GO:0034613","cellular protein localization","1/33","224/5146",0.77084275459764,0.809691593688768,0.712408074191872,"Zci_15697",1
"GO:0051173","GO:0051173","positive regulation of nitrogen compound metabolic process","1/33","236/5146",0.788633888188239,0.825492274764677,0.726310321496832,"Zci_08682",1
"GO:1901565","GO:1901565","organonitrogen compound catabolic process","1/33","237/5146",0.790054475090436,0.825492274764677,0.726310321496832,"Zci_13189",1
"GO:0006811","GO:0006811","ion transport","1/33","241/5146",0.795644802878586,0.829052481946475,0.729442773855085,"Zci_10716",1
"GO:0008104","GO:0008104","protein localization","1/33","243/5146",0.798385565019664,0.829052481946475,0.729442773855085,"Zci_15697",1
"GO:0030154","GO:0030154","cell differentiation","1/33","244/5146",0.799742545716044,0.829052481946475,0.729442773855085,"Zci_01850",1
"GO:0009057","GO:0009057","macromolecule catabolic process","1/33","250/5146",0.807700354729061,0.835115771469212,0.73477756607206,"Zci_13189",1
"GO:0010604","GO:0010604","positive regulation of macromolecule metabolic process","1/33","261/5146",0.821500586439937,0.846212314283589,0.744540871950739,"Zci_08682",1
"GO:0031325","GO:0031325","positive regulation of cellular metabolic process","1/33","262/5146",0.822706416664601,0.846212314283589,0.744540871950739,"Zci_08682",1
"GO:0071705","GO:0071705","nitrogen compound transport","1/33","279/5146",0.842036738359286,0.863851161632842,0.760060431952341,"Zci_15697",1
"GO:0099402","GO:0099402","plant organ development","1/33","288/5146",0.851426335346352,0.871226947796268,0.766550025838821,"Zci_12313",1
"GO:0009893","GO:0009893","positive regulation of metabolic process","1/33","294/5146",0.857382933050521,0.873798856608412,0.768812922746901,"Zci_08682",1
"GO:0048869","GO:0048869","cellular developmental process","1/33","295/5146",0.85835291722392,0.873798856608412,0.768812922746901,"Zci_01850",1
"GO:0009653","GO:0009653","anatomical structure morphogenesis","1/33","302/5146",0.864965918968713,0.878273086952847,0.772749579429539,"Zci_12313",1
"GO:0006508","GO:0006508","proteolysis","1/33","364/5146",0.911853252789114,0.923513780318386,0.81255465519773,"Zci_11614",1
"GO:1901575","GO:1901575","organic substance catabolic process","1/33","398/5146",0.930401655355064,0.939895549797463,0.826968173798406,"Zci_13189",1
"GO:0034645","GO:0034645","cellular macromolecule biosynthetic process","1/33","403/5146",0.932787904106867,0.939908422458827,0.826979499824221,"Zci_09313",1
"GO:0055085","GO:0055085","transmembrane transport","1/33","423/5146",0.941563949080832,0.945167345507985,0.831606569280019,"Zci_10716",1
"GO:0009059","GO:0009059","macromolecule biosynthetic process","1/33","426/5146",0.942780559281955,0.945167345507985,0.831606569280019,"Zci_09313",1
"GO:0009056","GO:0009056","catabolic process","1/33","440/5146",0.94814078824361,0.94814078824361,0.83422275626963,"Zci_13189",1
