AT5G67030
AT3G06010
AT1G71960
AT5G56010
AT2G41160
AT4G13550
AT5G03280
AT1G51670
AT5G10010
AT4G26080
AT1G74310
AT4G17230
AT2G03440
AT1G79440
AT5G03720
AT5G54070
AT5G55160
AT4G13670
AT4G04950
AT1G64520
AT3G28030
AT5G47550
AT1G21910
AT4G28140
AT2G39770
AT4G21870
AT3G47220
AT1G54490
AT3G17830
AT1G59860
AT5G66080
AT5G41340
AT3G25230
AT1G32583
AT3G23610
AT1G12610
AT5G65790
AT2G30250
AT5G10230
AT4G19630
AT1G36390
AT5G09920
AT5G56030
AT2G41140
AT4G39960
AT4G38630
AT3G53110
AT1G59870
AT3G56740
AT1G35720
AT1G32330
AT1G16540
AT5G62390
AT4G26780
AT5G60410
AT2G21320
AT4G10250
AT1G73130
AT1G28520
AT5G06780
AT2G26330
AT3G12960
AT5G45710
AT1G76080
AT1G79350
AT5G02500
AT3G51780
AT3G09440
AT1G56410
AT3G23990
AT3G19130
AT5G18620
AT5G09590
AT2G38470
AT1G33930
AT3G16770
AT1G28210
AT5G28540
AT4G18880
AT1G14980
AT1G66340
AT1G56300
AT4G15802
AT2G33590
AT1G64280
AT4G13980
AT1G43160
AT5G10220
AT1G68090
AT5G64910
AT4G29040
AT2G25140
AT2G29500
AT3G47020
AT5G47910
AT1G54050
AT4G18870
AT5G18040
AT5G44650
AT5G15450
AT1G17780
AT3G62410
AT5G48570
AT4G21320
AT1G33910
AT3G24500
AT1G48050
AT5G14800
AT4G39960
AT1G49130
AT4G12400
AT5G53000
AT5G02490
AT3G17880
AT3G09350
AT1G77000
AT1G54280
AT2G32120
AT3G06400
AT1G07890
AT2G47180
AT2G16575
AT2G38340
AT5G27660
AT4G02270
AT5G61780
AT4G24280
AT4G27670
AT2G43130
AT5G08000
AT5G51190
AT1G33900
AT4G37910
AT1G79550
AT1G47500
AT1G13080
AT5G05410
AT2G27580
AT4G19020
AT5G57050
AT1G07400
AT5G01820
AT5G19350
AT1G78080
AT4G35987
AT5G46170
AT5G63870
AT3G17830
AT4G25380
AT3G24520
AT1G50500
AT5G04890
AT5G12030
AT4G17750
AT2G22360
AT2G40350
AT3G08720
AT3G04120
AT5G42020
AT3G10800
AT1G03190
AT1G80030
AT1G11270
AT5G67300
AT2G17690
AT3G44110
AT4G38580
AT3G47860
AT2G22360
AT5G05630
AT2G26150
AT2G42540
AT3G51910
AT3G02990
AT3G08970
AT1G08550
AT5G22060
AT5G17710
AT4G29520
AT1G09080
AT4G29760
AT2G47400
AT2G20880
AT5G07100
AT1G52340
AT5G59820
AT5G37670
AT2G04030
AT3G53990
AT5G49910
AT5G17020
AT5G52640
AT3G02885
AT4G29770
AT5G65020
AT5G07350
AT1G53540
AT3G10140
AT1G16030
AT5G12020
AT5G12140
AT1G77570
AT5G12380
AT1G49600
AT4G14690
AT2G40340
AT3G16920
AT5G53170
AT5G18340
AT1G33890
AT5G48030
AT3G24320
AT2G19310
AT2G38750
AT4G36990
AT5G59720
AT5G37770
AT5G58070
AT5G43940
AT1G05850
AT4G37840
AT3G15840
AT5G53060
AT1G56260
AT4G26840
AT1G33880
AT5G42980
AT1G13930
AT1G47490
AT4G02450
AT2G19540
AT1G09090
AT2G38760
AT4G14675
AT1G79930
AT3G12580
AT2G46020
AT3G61190
AT4G14670
AT4G26850
AT1G15520
AT5G53400
AT1G16970
AT5G16820
AT3G22840
AT4G23100
AT5G57560
AT1G66080
AT3G11020
AT5G43840
AT4G17250
AT1G21760
AT1G58340
AT1G68820
AT1G67970
AT5G21160
AT3G03773
AT3G22830
AT1G71790
AT5G56000
AT3G63350
AT5G60970
AT3G46230
AT1G20440
AT1G76560
AT2G46240
AT4G11260