1	NA	1	1	NA	1	NA	1	1	1	1	NA	NA	NA	1	NA	NA	NA	1	1	NA	1
1	NA	1	1	NA	1	NA	1	1	1	1	NA	NA	NA	1	NA	NA	NA	1	1	NA	1
0.9946380697050938	1	0.9751098096632503	0.9966555183946488	1	0.9959404600811907	1	0.9925093632958801	0.9852017937219731	1	0.9963898916967509	1	1	1	0.99375	1	1	1	1	1	1	1
1	NA	1	1	NA	1	NA	1	1	1	1	NA	NA	NA	1	NA	NA	NA	1	1	NA	1
1	1	1	1	1	1	1	1	0.9995007488766849	1	1	1	1	1	1	1	1	1	1	1	1	1
1	NA	1	1	NA	1	NA	1	1	1	1	NA	NA	NA	1	NA	NA	NA	1	1	NA	1
1	NA	1	1	NA	1	NA	1	1	1	1	NA	NA	NA	1	NA	NA	NA	1	1	NA	1
1	NA	1	1	NA	1	NA	1	1	1	1	NA	NA	NA	1	NA	NA	NA	1	1	NA	1
1	NA	1	1	NA	1	NA	1	1	1	1	NA	NA	NA	1	NA	NA	NA	1	1	NA	1
0.9900332225913622	1	0.9936	1	1	0.9863701578192252	1	0.9776195320447609	0.985654789449329	0.9777777777777777	1	1	1	1	1	1	1	1	1	1	1	1
1	1	1	1	1	0.9975688816855753	1	0.998792270531401	0.9995037220843672	1	1	1	1	1	1	1	1	1	1	1	1	1
1	NA	1	1	NA	1	NA	1	1	1	1	NA	NA	NA	1	NA	NA	NA	1	1	NA	1
0.9724409448818898	1	0.9916666666666667	0.9909706546275395	1	0.9838006230529595	1	0.9900908340214699	0.9762107051826678	0.9953379953379954	0.9952718676122931	1	1	1	0.9892241379310345	1	1	1	1	1	1	1
1	NA	1	1	NA	1	NA	1	1	1	1	NA	NA	NA	1	NA	NA	NA	1	1	NA	1
1	NA	1	1	NA	1	NA	1	1	1	1	NA	NA	NA	1	NA	NA	NA	1	1	NA	1
1	NA	1	1	NA	1	NA	1	1	1	1	NA	NA	NA	1	NA	NA	NA	1	1	NA	1
