nodeName	altName	nodeAttr[nodesPresent, ]
Me1_v2_0000110	NA	brown
Me1_v2_0000450	NA	brown
Me1_v2_0000750	NA	brown
Me1_v2_0000880	NA	brown
Me1_v2_0001440	NA	brown
Me1_v2_0001480	NA	brown
Me1_v2_0001990	NA	brown
Me1_v2_0002420	NA	brown
Me1_v2_0003490	NA	brown
Me1_v2_0003840	NA	brown
Me1_v2_0004130	NA	brown
Me1_v2_0004950	NA	brown
Me1_v2_0005390	NA	brown
Me1_v2_0005690	NA	brown
Me1_v2_0005940	NA	brown
Me1_v2_0005960	NA	brown
Me1_v2_0007700	NA	brown
Me1_v2_0007980	NA	brown
Me1_v2_0008700	NA	brown
Me1_v2_0008730	NA	brown
Me1_v2_0008920	NA	brown
Me1_v2_0009750	NA	brown
Me1_v2_0010310	NA	brown
Me1_v2_0010400	NA	brown
Me1_v2_0010570	NA	brown
Me1_v2_0010630	NA	brown
Me1_v2_0011130	NA	brown
Me1_v2_0011300	NA	brown
Me1_v2_0011450	NA	brown
Me1_v2_0012100	NA	brown
Me1_v2_0012430	NA	brown
Me1_v2_0012780	NA	brown
Me1_v2_0013610	NA	brown
Me1_v2_0013710	NA	brown
Me1_v2_0014120	NA	brown
Me1_v2_0014250	NA	brown
Me1_v2_0014400	NA	brown
Me1_v2_0014480	NA	brown
Me1_v2_0014490	NA	brown
Me1_v2_0014620	NA	brown
Me1_v2_0015640	NA	brown
Me1_v2_0015690	NA	brown
Me1_v2_0015930	NA	brown
Me1_v2_0016270	NA	brown
Me1_v2_0016410	NA	brown
Me1_v2_0016700	NA	brown
Me1_v2_0017450	NA	brown
Me1_v2_0018640	NA	brown
Me1_v2_0018900	NA	brown
Me1_v2_0019040	NA	brown
Me1_v2_0019280	NA	brown
Me1_v2_0019440	NA	brown
Me1_v2_0019500	NA	brown
Me1_v2_0019820	NA	brown
Me1_v2_0020190	NA	brown
Me1_v2_0020420	NA	brown
Me1_v2_0020700	NA	brown
Me1_v2_0020990	NA	brown
Me1_v2_0021420	NA	brown
Me1_v2_0021680	NA	brown
Me1_v2_0021830	NA	brown
Me1_v2_0022170	NA	brown
Me1_v2_0022430	NA	brown
Me1_v2_0022660	NA	brown
Me1_v2_0023280	NA	brown
Me1_v2_0023770	NA	brown
Me1_v2_0024370	NA	brown
Me1_v2_0024440	NA	brown
Me1_v2_0024450	NA	brown
Me1_v2_0025420	NA	brown
Me1_v2_0025730	NA	brown
Me1_v2_0025790	NA	brown
Me1_v2_0026300	NA	brown
Me1_v2_0026310	NA	brown
Me1_v2_0026510	NA	brown
Me1_v2_0026670	NA	brown
Me1_v2_0026830	NA	brown
Me1_v2_0027150	NA	brown
Me1_v2_0027240	NA	brown
Me1_v2_0027330	NA	brown
Me1_v2_0027480	NA	brown
Me1_v2_0027620	NA	brown
Me1_v2_0028350	NA	brown
Me1_v2_0028440	NA	brown
Me1_v2_0028520	NA	brown
Me1_v2_0029020	NA	brown
Me1_v2_0029230	NA	brown
Me1_v2_0029380	NA	brown
Me1_v2_0029710	NA	brown
Me1_v2_0030480	NA	brown
Me1_v2_0030540	NA	brown
Me1_v2_0030780	NA	brown
Me1_v2_0031140	NA	brown
Me1_v2_0031420	NA	brown
Me1_v2_0031430	NA	brown
Me1_v2_0031480	NA	brown
Me1_v2_0031880	NA	brown
Me1_v2_0031920	NA	brown
Me1_v2_0032030	NA	brown
Me1_v2_0032420	NA	brown
Me1_v2_0032470	NA	brown
Me1_v2_0032620	NA	brown
Me1_v2_0032680	NA	brown
Me1_v2_0032850	NA	brown
Me1_v2_0032870	NA	brown
Me1_v2_0032980	NA	brown
Me1_v2_0033940	NA	brown
Me1_v2_0034390	NA	brown
Me1_v2_0034480	NA	brown
Me1_v2_0034640	NA	brown
Me1_v2_0034680	NA	brown
Me1_v2_0034890	NA	brown
Me1_v2_0035110	NA	brown
Me1_v2_0035300	NA	brown
Me1_v2_0035330	NA	brown
Me1_v2_0035420	NA	brown
Me1_v2_0035610	NA	brown
Me1_v2_0035860	NA	brown
Me1_v2_0035880	NA	brown
Me1_v2_0036150	NA	brown
Me1_v2_0036230	NA	brown
Me1_v2_0036250	NA	brown
Me1_v2_0036460	NA	brown
Me1_v2_0036520	NA	brown
Me1_v2_0036990	NA	brown
Me1_v2_0037200	NA	brown
Me1_v2_0037370	NA	brown
Me1_v2_0037690	NA	brown
Me1_v2_0038050	NA	brown
Me1_v2_0038060	NA	brown
Me1_v2_0038110	NA	brown
Me1_v2_0038160	NA	brown
Me1_v2_0038330	NA	brown
Me1_v2_0039100	NA	brown
Me1_v2_0039390	NA	brown
Me1_v2_0039680	NA	brown
Me1_v2_0039710	NA	brown
Me1_v2_0040060	NA	brown
Me1_v2_0040190	NA	brown
Me1_v2_0040380	NA	brown
Me1_v2_0040480	NA	brown
Me1_v2_0040900	NA	brown
Me1_v2_0040940	NA	brown
Me1_v2_0040960	NA	brown
Me1_v2_0041060	NA	brown
Me1_v2_0041370	NA	brown
Me1_v2_0041390	NA	brown
Me1_v2_0042030	NA	brown
Me1_v2_0042070	NA	brown
Me1_v2_0042760	NA	brown
Me1_v2_0043630	NA	brown
Me1_v2_0044150	NA	brown
Me1_v2_0044360	NA	brown
Me1_v2_0045740	NA	brown
Me1_v2_0046690	NA	brown
Me1_v2_0048510	NA	brown
Me1_v2_0049130	NA	brown
Me1_v2_0049470	NA	brown
Me1_v2_0049590	NA	brown
Me1_v2_0049960	NA	brown
Me1_v2_0050020	NA	brown
Me1_v2_0050340	NA	brown
Me1_v2_0050360	NA	brown
Me1_v2_0050370	NA	brown
Me1_v2_0050700	NA	brown
Me1_v2_0050730	NA	brown
Me1_v2_0050790	NA	brown
Me1_v2_0050850	NA	brown
Me1_v2_0050970	NA	brown
Me1_v2_0051030	NA	brown
Me1_v2_0051180	NA	brown
Me1_v2_0051190	NA	brown
Me1_v2_0051260	NA	brown
Me1_v2_0051920	NA	brown
Me1_v2_0051930	NA	brown
Me1_v2_0052180	NA	brown
Me1_v2_0052220	NA	brown
Me1_v2_0052260	NA	brown
Me1_v2_0052460	NA	brown
Me1_v2_0052660	NA	brown
Me1_v2_0052670	NA	brown
Me1_v2_0052750	NA	brown
Me1_v2_0052760	NA	brown
Me1_v2_0052770	NA	brown
Me1_v2_0052920	NA	brown
Me1_v2_0052930	NA	brown
Me1_v2_0052950	NA	brown
Me1_v2_0052960	NA	brown
Me1_v2_0052970	NA	brown
Me1_v2_0053200	NA	brown
Me1_v2_0053230	NA	brown
Me1_v2_0053300	NA	brown
Me1_v2_0053390	NA	brown
Me1_v2_0053400	NA	brown
Me1_v2_0053440	NA	brown
Me1_v2_0053730	NA	brown
Me1_v2_0053740	NA	brown
Me1_v2_0053820	NA	brown
Me1_v2_0053940	NA	brown
Me1_v2_0054040	NA	brown
Me1_v2_0054130	NA	brown
Me1_v2_0054290	NA	brown
Me1_v2_0054450	NA	brown
Me1_v2_0054540	NA	brown
Me1_v2_0054560	NA	brown
Me1_v2_0054640	NA	brown
Me1_v2_0054800	NA	brown
Me1_v2_0055120	NA	brown
Me1_v2_0055780	NA	brown
Me1_v2_0055900	NA	brown
Me1_v2_0055910	NA	brown
Me1_v2_0056270	NA	brown
Me1_v2_0056280	NA	brown
Me1_v2_0056320	NA	brown
Me1_v2_0056770	NA	brown
Me1_v2_0056800	NA	brown
Me1_v2_0056870	NA	brown
Me1_v2_0056890	NA	brown
Me1_v2_0056910	NA	brown
Me1_v2_0057110	NA	brown
Me1_v2_0057130	NA	brown
Me1_v2_0057180	NA	brown
Me1_v2_0057210	NA	brown
Me1_v2_0057230	NA	brown
Me1_v2_0057260	NA	brown
Me1_v2_0057510	NA	brown
Me1_v2_0057530	NA	brown
Me1_v2_0059050	NA	brown
Me1_v2_0059060	NA	brown
Me1_v2_0059360	NA	brown
Me1_v2_0059390	NA	brown
Me1_v2_0059660	NA	brown
Me1_v2_0059750	NA	brown
Me1_v2_0059760	NA	brown
Me1_v2_0059770	NA	brown
Me1_v2_0059780	NA	brown
Me1_v2_0059790	NA	brown
Me1_v2_0059920	NA	brown
Me1_v2_0060060	NA	brown
Me1_v2_0060670	NA	brown
Me1_v2_0060930	NA	brown
Me1_v2_0061110	NA	brown
Me1_v2_0061120	NA	brown
Me1_v2_0061150	NA	brown
Me1_v2_0061160	NA	brown
Me1_v2_0062100	NA	brown
Me1_v2_0062110	NA	brown
Me1_v2_0062120	NA	brown
Me1_v2_0062130	NA	brown
Me1_v2_0062180	NA	brown
Me1_v2_0062390	NA	brown
Me1_v2_0063010	NA	brown
Me1_v2_0063030	NA	brown
Me1_v2_0063150	NA	brown
Me1_v2_0063410	NA	brown
Me1_v2_0063430	NA	brown
Me1_v2_0063560	NA	brown
Me1_v2_0063760	NA	brown
Me1_v2_0063780	NA	brown
Me1_v2_0064000	NA	brown
Me1_v2_0064080	NA	brown
Me1_v2_0064160	NA	brown
Me1_v2_0064500	NA	brown
Me1_v2_0065380	NA	brown
Me1_v2_0065390	NA	brown
Me1_v2_0065790	NA	brown
Me1_v2_0065860	NA	brown
Me1_v2_0066260	NA	brown
Me1_v2_0066350	NA	brown
Me1_v2_0066370	NA	brown
Me1_v2_0066380	NA	brown
Me1_v2_0066480	NA	brown
Me1_v2_0066490	NA	brown
Me1_v2_0067010	NA	brown
Me1_v2_0067050	NA	brown
Me1_v2_0067070	NA	brown
Me1_v2_0067160	NA	brown
Me1_v2_0067170	NA	brown
Me1_v2_0067240	NA	brown
Me1_v2_0067260	NA	brown
Me1_v2_0067270	NA	brown
Me1_v2_0067580	NA	brown
Me1_v2_0067750	NA	brown
Me1_v2_0067760	NA	brown
Me1_v2_0067770	NA	brown
Me1_v2_0067840	NA	brown
Me1_v2_0067850	NA	brown
Me1_v2_0068090	NA	brown
Me1_v2_0068680	NA	brown
Me1_v2_0068700	NA	brown
Me1_v2_0068890	NA	brown
Me1_v2_0069000	NA	brown
Me1_v2_0069220	NA	brown
Me1_v2_0069310	NA	brown
Me1_v2_0069320	NA	brown
Me1_v2_0069480	NA	brown
Me1_v2_0069490	NA	brown
Me1_v2_0069800	NA	brown
Me1_v2_0070150	NA	brown
Me1_v2_0070240	NA	brown
Me1_v2_0070260	NA	brown
Me1_v2_0070280	NA	brown
Me1_v2_0070800	NA	brown
Me1_v2_0070980	NA	brown
Me1_v2_0071050	NA	brown
Me1_v2_0071100	NA	brown
Me1_v2_0071110	NA	brown
Me1_v2_0071130	NA	brown
Me1_v2_0071150	NA	brown
Me1_v2_0071170	NA	brown
Me1_v2_0071180	NA	brown
Me1_v2_0071190	NA	brown
Me1_v2_0071200	NA	brown
Me1_v2_0071360	NA	brown
Me1_v2_0071390	NA	brown
Me1_v2_0071400	NA	brown
Me1_v2_0071930	NA	brown
Me1_v2_0072120	NA	brown
Me1_v2_0072170	NA	brown
Me1_v2_0072200	NA	brown
Me1_v2_0072260	NA	brown
Me1_v2_0072510	NA	brown
Me1_v2_0072840	NA	brown
Me1_v2_0073140	NA	brown
Me1_v2_0073170	NA	brown
Me1_v2_0073200	NA	brown
Me1_v2_0073330	NA	brown
Me1_v2_0073350	NA	brown
Me1_v2_0073430	NA	brown
Me1_v2_0073840	NA	brown
Me1_v2_0073850	NA	brown
Me1_v2_0073860	NA	brown
Me1_v2_0073910	NA	brown
Me1_v2_0073950	NA	brown
Me1_v2_0074130	NA	brown
Me1_v2_0074420	NA	brown
Me1_v2_0074430	NA	brown
Me1_v2_0074440	NA	brown
Me1_v2_0074480	NA	brown
Me1_v2_0074610	NA	brown
Me1_v2_0074620	NA	brown
Me1_v2_0074700	NA	brown
Me1_v2_0075090	NA	brown
Me1_v2_0075330	NA	brown
Me1_v2_0075730	NA	brown
Me1_v2_0075910	NA	brown
Me1_v2_0076190	NA	brown
Me1_v2_0076230	NA	brown
Me1_v2_0076270	NA	brown
Me1_v2_0076280	NA	brown
Me1_v2_0076710	NA	brown
Me1_v2_0076770	NA	brown
Me1_v2_0077270	NA	brown
Me1_v2_0077330	NA	brown
Me1_v2_0077570	NA	brown
Me1_v2_0077800	NA	brown
Me1_v2_0078010	NA	brown
Me1_v2_0078240	NA	brown
Me1_v2_0078330	NA	brown
Me1_v2_0078340	NA	brown
Me1_v2_0078480	NA	brown
Me1_v2_0078540	NA	brown
Me1_v2_0078720	NA	brown
Me1_v2_0079210	NA	brown
Me1_v2_0079220	NA	brown
Me1_v2_0079230	NA	brown
Me1_v2_0079490	NA	brown
Me1_v2_0079540	NA	brown
Me1_v2_0079550	NA	brown
Me1_v2_0079660	NA	brown
Me1_v2_0079970	NA	brown
Me1_v2_0080160	NA	brown
Me1_v2_0080190	NA	brown
Me1_v2_0080300	NA	brown
Me1_v2_0080310	NA	brown
Me1_v2_0080430	NA	brown
Me1_v2_0080570	NA	brown
Me1_v2_0080580	NA	brown
Me1_v2_0080590	NA	brown
Me1_v2_0080600	NA	brown
Me1_v2_0080620	NA	brown
Me1_v2_0080640	NA	brown
Me1_v2_0080720	NA	brown
Me1_v2_0080730	NA	brown
Me1_v2_0080850	NA	brown
Me1_v2_0081070	NA	brown
Me1_v2_0081080	NA	brown
Me1_v2_0081530	NA	brown
Me1_v2_0081540	NA	brown
Me1_v2_0081550	NA	brown
Me1_v2_0081580	NA	brown
Me1_v2_0081610	NA	brown
Me1_v2_0081620	NA	brown
Me1_v2_0081630	NA	brown
Me1_v2_0081640	NA	brown
Me1_v2_0081650	NA	brown
Me1_v2_0081670	NA	brown
Me1_v2_0081950	NA	brown
Me1_v2_0082010	NA	brown
Me1_v2_0082140	NA	brown
Me1_v2_0082150	NA	brown
Me1_v2_0082300	NA	brown
Me1_v2_0082310	NA	brown
Me1_v2_0083210	NA	brown
Me1_v2_0083370	NA	brown
Me1_v2_0083380	NA	brown
Me1_v2_0083390	NA	brown
Me1_v2_0083500	NA	brown
Me1_v2_0083660	NA	brown
Me1_v2_0083960	NA	brown
Me1_v2_0083970	NA	brown
Me1_v2_0084070	NA	brown
Me1_v2_0084150	NA	brown
Me1_v2_0084410	NA	brown
Me1_v2_0084710	NA	brown
Me1_v2_0084720	NA	brown
Me1_v2_0084730	NA	brown
Me1_v2_0084810	NA	brown
Me1_v2_0084830	NA	brown
Me1_v2_0084850	NA	brown
Me1_v2_0084890	NA	brown
Me1_v2_0084900	NA	brown
Me1_v2_0084940	NA	brown
Me1_v2_0085050	NA	brown
Me1_v2_0085360	NA	brown
Me1_v2_0085420	NA	brown
Me1_v2_0085430	NA	brown
Me1_v2_0085680	NA	brown
Me1_v2_0085750	NA	brown
Me1_v2_0085990	NA	brown
Me1_v2_0086130	NA	brown
Me1_v2_0086460	NA	brown
Me1_v2_0086590	NA	brown
Me1_v2_0086860	NA	brown
Me1_v2_0087040	NA	brown
Me1_v2_0087050	NA	brown
Me1_v2_0087470	NA	brown
Me1_v2_0087730	NA	brown
Me1_v2_0087740	NA	brown
Me1_v2_0087750	NA	brown
Me1_v2_0087760	NA	brown
Me1_v2_0087900	NA	brown
Me1_v2_0087990	NA	brown
Me1_v2_0088050	NA	brown
Me1_v2_0088160	NA	brown
Me1_v2_0088170	NA	brown
Me1_v2_0088280	NA	brown
Me1_v2_0088330	NA	brown
Me1_v2_0088360	NA	brown
Me1_v2_0088460	NA	brown
Me1_v2_0088550	NA	brown
Me1_v2_0088600	NA	brown
Me1_v2_0088830	NA	brown
Me1_v2_0089030	NA	brown
Me1_v2_0089050	NA	brown
Me1_v2_0089070	NA	brown
Me1_v2_0089290	NA	brown
Me1_v2_0089350	NA	brown
Me1_v2_0089360	NA	brown
Me1_v2_0089370	NA	brown
Me1_v2_0089430	NA	brown
Me1_v2_0089930	NA	brown
Me1_v2_0090440	NA	brown
Me1_v2_0090580	NA	brown
Me1_v2_0090750	NA	brown
Me1_v2_0090810	NA	brown
Me1_v2_0091060	NA	brown
Me1_v2_0091100	NA	brown
Me1_v2_0091150	NA	brown
Me1_v2_0091280	NA	brown
Me1_v2_0091370	NA	brown
Me1_v2_0091430	NA	brown
Me1_v2_0091480	NA	brown
Me1_v2_0091830	NA	brown
Me1_v2_0091850	NA	brown
Me1_v2_0091870	NA	brown
Me1_v2_0092060	NA	brown
Me1_v2_0092190	NA	brown
Me1_v2_0092850	NA	brown
Me1_v2_0092930	NA	brown
Me1_v2_0093290	NA	brown
Me1_v2_0093310	NA	brown
Me1_v2_0093900	NA	brown
Me1_v2_0093910	NA	brown
Me1_v2_0093930	NA	brown
Me1_v2_0094090	NA	brown
Me1_v2_0094290	NA	brown
Me1_v2_0094450	NA	brown
Me1_v2_0094520	NA	brown
Me1_v2_0094660	NA	brown
Me1_v2_0094710	NA	brown
Me1_v2_0094740	NA	brown
Me1_v2_0095090	NA	brown
Me1_v2_0095530	NA	brown
Me1_v2_0095540	NA	brown
Me1_v2_0095700	NA	brown
Me1_v2_0095810	NA	brown
Me1_v2_0095910	NA	brown
Me1_v2_0095920	NA	brown
Me1_v2_0095930	NA	brown
Me1_v2_0096010	NA	brown
Me1_v2_0096020	NA	brown
Me1_v2_0096240	NA	brown
Me1_v2_0096310	NA	brown
Me1_v2_0096720	NA	brown
Me1_v2_0096820	NA	brown
Me1_v2_0096990	NA	brown
Me1_v2_0097710	NA	brown
Me1_v2_0097790	NA	brown
Me1_v2_0098040	NA	brown
Me1_v2_0098450	NA	brown
Me1_v2_0098530	NA	brown
Me1_v2_0098580	NA	brown
Me1_v2_0098590	NA	brown
Me1_v2_0099300	NA	brown
Me1_v2_0099560	NA	brown
Me1_v2_0099590	NA	brown
Me1_v2_0100060	NA	brown
Me1_v2_0100070	NA	brown
Me1_v2_0100090	NA	brown
Me1_v2_0100140	NA	brown
Me1_v2_0100390	NA	brown
Me1_v2_0100400	NA	brown
Me1_v2_0101060	NA	brown
Me1_v2_0101090	NA	brown
Me1_v2_0101690	NA	brown
Me1_v2_0101760	NA	brown
Me1_v2_0101900	NA	brown
Me1_v2_0101910	NA	brown
Me1_v2_0102270	NA	brown
Me1_v2_0102320	NA	brown
Me1_v2_0102710	NA	brown
Me1_v2_0102770	NA	brown
Me1_v2_0102850	NA	brown
Me1_v2_0103200	NA	brown
Me1_v2_0103210	NA	brown
Me1_v2_0103440	NA	brown
Me1_v2_0103450	NA	brown
Me1_v2_0103510	NA	brown
Me1_v2_0103560	NA	brown
Me1_v2_0103810	NA	brown
Me1_v2_0103900	NA	brown
Me1_v2_0103950	NA	brown
Me1_v2_0103960	NA	brown
Me1_v2_0104070	NA	brown
Me1_v2_0104120	NA	brown
Me1_v2_0104140	NA	brown
Me1_v2_0104480	NA	brown
Me1_v2_0104610	NA	brown
Me1_v2_0104620	NA	brown
Me1_v2_0104630	NA	brown
Me1_v2_0104660	NA	brown
Me1_v2_0104790	NA	brown
Me1_v2_0104800	NA	brown
Me1_v2_0104890	NA	brown
Me1_v2_0104900	NA	brown
Me1_v2_0104910	NA	brown
Me1_v2_0105070	NA	brown
Me1_v2_0105150	NA	brown
Me1_v2_0105170	NA	brown
Me1_v2_0105200	NA	brown
Me1_v2_0105550	NA	brown
Me1_v2_0105560	NA	brown
Me1_v2_0105630	NA	brown
Me1_v2_0105760	NA	brown
Me1_v2_0105970	NA	brown
Me1_v2_0106040	NA	brown
Me1_v2_0106590	NA	brown
Me1_v2_0106840	NA	brown
Me1_v2_0107000	NA	brown
Me1_v2_0107460	NA	brown
Me1_v2_0107470	NA	brown
Me1_v2_0107480	NA	brown
Me1_v2_0107490	NA	brown
Me1_v2_0107620	NA	brown
Me1_v2_0107910	NA	brown
Me1_v2_0107920	NA	brown
Me1_v2_0108200	NA	brown
Me1_v2_0108290	NA	brown
Me1_v2_0108320	NA	brown
Me1_v2_0108410	NA	brown
Me1_v2_0108680	NA	brown
Me1_v2_0108690	NA	brown
Me1_v2_0108700	NA	brown
Me1_v2_0108710	NA	brown
Me1_v2_0108750	NA	brown
Me1_v2_0109010	NA	brown
Me1_v2_0109060	NA	brown
Me1_v2_0109330	NA	brown
Me1_v2_0109530	NA	brown
Me1_v2_0109540	NA	brown
Me1_v2_0109680	NA	brown
Me1_v2_0109870	NA	brown
Me1_v2_0109910	NA	brown
Me1_v2_0109920	NA	brown
Me1_v2_0110010	NA	brown
Me1_v2_0110170	NA	brown
Me1_v2_0110200	NA	brown
Me1_v2_0110210	NA	brown
Me1_v2_0110220	NA	brown
Me1_v2_0110460	NA	brown
Me1_v2_0110490	NA	brown
Me1_v2_0110890	NA	brown
Me1_v2_0111210	NA	brown
Me1_v2_0111270	NA	brown
Me1_v2_0111750	NA	brown
Me1_v2_0111840	NA	brown
Me1_v2_0111930	NA	brown
Me1_v2_0111940	NA	brown
Me1_v2_0111960	NA	brown
Me1_v2_0111970	NA	brown
Me1_v2_0111980	NA	brown
Me1_v2_0112040	NA	brown
Me1_v2_0112150	NA	brown
Me1_v2_0112210	NA	brown
Me1_v2_0112220	NA	brown
Me1_v2_0112230	NA	brown
Me1_v2_0112320	NA	brown
Me1_v2_0112330	NA	brown
Me1_v2_0112490	NA	brown
Me1_v2_0112680	NA	brown
Me1_v2_0113120	NA	brown
Me1_v2_0113390	NA	brown
Me1_v2_0113940	NA	brown
Me1_v2_0113960	NA	brown
Me1_v2_0114540	NA	brown
Me1_v2_0114810	NA	brown
Me1_v2_0114940	NA	brown
Me1_v2_0115130	NA	brown
Me1_v2_0115300	NA	brown
Me1_v2_0115450	NA	brown
Me1_v2_0115560	NA	brown
Me1_v2_0115740	NA	brown
Me1_v2_0115750	NA	brown
Me1_v2_0115800	NA	brown
Me1_v2_0116040	NA	brown
Me1_v2_0116070	NA	brown
Me1_v2_0116490	NA	brown
Me1_v2_0116920	NA	brown
Me1_v2_0117050	NA	brown
Me1_v2_0117060	NA	brown
Me1_v2_0117200	NA	brown
Me1_v2_0117510	NA	brown
Me1_v2_0117560	NA	brown
Me1_v2_0117660	NA	brown
Me1_v2_0117710	NA	brown
Me1_v2_0117760	NA	brown
Me1_v2_0117930	NA	brown
Me1_v2_0118000	NA	brown
Me1_v2_0118250	NA	brown
Me1_v2_0118310	NA	brown
Me1_v2_0118380	NA	brown
Me1_v2_0118390	NA	brown
Me1_v2_0118400	NA	brown
Me1_v2_0118410	NA	brown
Me1_v2_0118750	NA	brown
Me1_v2_0119050	NA	brown
Me1_v2_0119070	NA	brown
Me1_v2_0119180	NA	brown
Me1_v2_0119270	NA	brown
Me1_v2_0119370	NA	brown
Me1_v2_0119470	NA	brown
Me1_v2_0119740	NA	brown
Me1_v2_0119750	NA	brown
Me1_v2_0119820	NA	brown
Me1_v2_0119830	NA	brown
Me1_v2_0119840	NA	brown
Me1_v2_0119900	NA	brown
Me1_v2_0120290	NA	brown
Me1_v2_0120510	NA	brown
Me1_v2_0120600	NA	brown
Me1_v2_0120700	NA	brown
Me1_v2_0121260	NA	brown
Me1_v2_0121310	NA	brown
Me1_v2_0121420	NA	brown
Me1_v2_0121780	NA	brown
Me1_v2_0121860	NA	brown
Me1_v2_0122120	NA	brown
Me1_v2_0122910	NA	brown
Me1_v2_0123080	NA	brown
Me1_v2_0123220	NA	brown
Me1_v2_0123310	NA	brown
Me1_v2_0123670	NA	brown
Me1_v2_0123930	NA	brown
Me1_v2_0123940	NA	brown
Me1_v2_0124090	NA	brown
Me1_v2_0124240	NA	brown
Me1_v2_0124340	NA	brown
Me1_v2_0124520	NA	brown
Me1_v2_0124620	NA	brown
Me1_v2_0125300	NA	brown
Me1_v2_0125340	NA	brown
Me1_v2_0125420	NA	brown
Me1_v2_0125540	NA	brown
Me1_v2_0125550	NA	brown
Me1_v2_0125560	NA	brown
Me1_v2_0125580	NA	brown
Me1_v2_0125590	NA	brown
Me1_v2_0125600	NA	brown
Me1_v2_0125630	NA	brown
Me1_v2_0125830	NA	brown
Me1_v2_0125950	NA	brown
Me1_v2_0126220	NA	brown
Me1_v2_0126230	NA	brown
Me1_v2_0126430	NA	brown
Me1_v2_0126770	NA	brown
Me1_v2_0126780	NA	brown
Me1_v2_0126800	NA	brown
Me1_v2_0126840	NA	brown
Me1_v2_0126860	NA	brown
Me1_v2_0126940	NA	brown
Me1_v2_0127050	NA	brown
Me1_v2_0127110	NA	brown
Me1_v2_0127260	NA	brown
Me1_v2_0127300	NA	brown
Me1_v2_0127340	NA	brown
Me1_v2_0127640	NA	brown
Me1_v2_0127790	NA	brown
Me1_v2_0127800	NA	brown
Me1_v2_0127980	NA	brown
Me1_v2_0128090	NA	brown
Me1_v2_0128430	NA	brown
Me1_v2_0128450	NA	brown
Me1_v2_0128490	NA	brown
Me1_v2_0128520	NA	brown
Me1_v2_0128650	NA	brown
Me1_v2_0128750	NA	brown
Me1_v2_0128760	NA	brown
Me1_v2_0128840	NA	brown
Me1_v2_0128860	NA	brown
Me1_v2_0128910	NA	brown
Me1_v2_0129080	NA	brown
Me1_v2_0129150	NA	brown
Me1_v2_0129180	NA	brown
Me1_v2_0129310	NA	brown
Me1_v2_0129480	NA	brown
Me1_v2_0129730	NA	brown
Me1_v2_0130540	NA	brown
Me1_v2_0130690	NA	brown
Me1_v2_0130880	NA	brown
Me1_v2_0130890	NA	brown
Me1_v2_0131150	NA	brown
Me1_v2_0131170	NA	brown
Me1_v2_0131270	NA	brown
Me1_v2_0131320	NA	brown
Me1_v2_0131330	NA	brown
Me1_v2_0131340	NA	brown
Me1_v2_0131580	NA	brown
Me1_v2_0131700	NA	brown
Me1_v2_0132130	NA	brown
Me1_v2_0132140	NA	brown
Me1_v2_0132160	NA	brown
Me1_v2_0132200	NA	brown
Me1_v2_0132270	NA	brown
Me1_v2_0132280	NA	brown
Me1_v2_0132540	NA	brown
Me1_v2_0132550	NA	brown
Me1_v2_0132640	NA	brown
Me1_v2_0133010	NA	brown
Me1_v2_0133020	NA	brown
Me1_v2_0133060	NA	brown
Me1_v2_0133270	NA	brown
Me1_v2_0133450	NA	brown
Me1_v2_0133580	NA	brown
Me1_v2_0133670	NA	brown
Me1_v2_0133690	NA	brown
Me1_v2_0133740	NA	brown
Me1_v2_0133840	NA	brown
Me1_v2_0133860	NA	brown
Me1_v2_0134000	NA	brown
Me1_v2_0134090	NA	brown
Me1_v2_0134410	NA	brown
Me1_v2_0134420	NA	brown
Me1_v2_0134630	NA	brown
Me1_v2_0135160	NA	brown
Me1_v2_0135170	NA	brown
Me1_v2_0135210	NA	brown
Me1_v2_0135250	NA	brown
Me1_v2_0135260	NA	brown
Me1_v2_0135270	NA	brown
Me1_v2_0135310	NA	brown
Me1_v2_0135410	NA	brown
Me1_v2_0135440	NA	brown
Me1_v2_0135480	NA	brown
Me1_v2_0135730	NA	brown
Me1_v2_0135860	NA	brown
Me1_v2_0135950	NA	brown
Me1_v2_0136020	NA	brown
Me1_v2_0136130	NA	brown
Me1_v2_0136250	NA	brown
Me1_v2_0137150	NA	brown
Me1_v2_0137340	NA	brown
Me1_v2_0137560	NA	brown
Me1_v2_0137590	NA	brown
Me1_v2_0137600	NA	brown
Me1_v2_0137830	NA	brown
Me1_v2_0137840	NA	brown
Me1_v2_0138240	NA	brown
Me1_v2_0138250	NA	brown
Me1_v2_0138410	NA	brown
Me1_v2_0138520	NA	brown
Me1_v2_0138540	NA	brown
Me1_v2_0138550	NA	brown
Me1_v2_0138570	NA	brown
Me1_v2_0138610	NA	brown
Me1_v2_0138850	NA	brown
Me1_v2_0139190	NA	brown
Me1_v2_0139200	NA	brown
Me1_v2_0139310	NA	brown
Me1_v2_0139460	NA	brown
Me1_v2_0139500	NA	brown
Me1_v2_0139740	NA	brown
Me1_v2_0139760	NA	brown
Me1_v2_0139800	NA	brown
Me1_v2_0139960	NA	brown
Me1_v2_0140050	NA	brown
Me1_v2_0140180	NA	brown
Me1_v2_0140310	NA	brown
Me1_v2_0140380	NA	brown
Me1_v2_0140460	NA	brown
Me1_v2_0140590	NA	brown
Me1_v2_0140860	NA	brown
Me1_v2_0140880	NA	brown
Me1_v2_0141040	NA	brown
Me1_v2_0141060	NA	brown
Me1_v2_0141180	NA	brown
Me1_v2_0141200	NA	brown
Me1_v2_0141360	NA	brown
Me1_v2_0141460	NA	brown
Me1_v2_0141490	NA	brown
Me1_v2_0141950	NA	brown
Me1_v2_0142550	NA	brown
Me1_v2_0143120	NA	brown
Me1_v2_0143210	NA	brown
Me1_v2_0143240	NA	brown
Me1_v2_0143250	NA	brown
Me1_v2_0143290	NA	brown
Me1_v2_0143420	NA	brown
Me1_v2_0143430	NA	brown
Me1_v2_0143440	NA	brown
Me1_v2_0143470	NA	brown
Me1_v2_0143650	NA	brown
Me1_v2_0143740	NA	brown
Me1_v2_0143750	NA	brown
Me1_v2_0144040	NA	brown
Me1_v2_0144180	NA	brown
Me1_v2_0144580	NA	brown
Me1_v2_0144600	NA	brown
Me1_v2_0144630	NA	brown
Me1_v2_0144640	NA	brown
Me1_v2_0144720	NA	brown
Me1_v2_0144770	NA	brown
Me1_v2_0144780	NA	brown
Me1_v2_0145320	NA	brown
Me1_v2_0145330	NA	brown
Me1_v2_0145450	NA	brown
Me1_v2_0146280	NA	brown
Me1_v2_0146350	NA	brown
Me1_v2_0146670	NA	brown
Me1_v2_0146850	NA	brown
Me1_v2_0147570	NA	brown
Me1_v2_0147600	NA	brown
Me1_v2_0147900	NA	brown
Me1_v2_0148010	NA	brown
Me1_v2_0148130	NA	brown
Me1_v2_0148140	NA	brown
Me1_v2_0148160	NA	brown
Me1_v2_0148180	NA	brown
Me1_v2_0148250	NA	brown
Me1_v2_0148260	NA	brown
Me1_v2_0148320	NA	brown
Me1_v2_0148330	NA	brown
Me1_v2_0148360	NA	brown
Me1_v2_0148710	NA	brown
Me1_v2_0148730	NA	brown
Me1_v2_0148800	NA	brown
Me1_v2_0148820	NA	brown
Me1_v2_0148940	NA	brown
Me1_v2_0149430	NA	brown
Me1_v2_0149550	NA	brown
Me1_v2_0150190	NA	brown
Me1_v2_0150810	NA	brown
Me1_v2_0150850	NA	brown
Me1_v2_0150860	NA	brown
Me1_v2_0151170	NA	brown
Me1_v2_0151410	NA	brown
Me1_v2_0151920	NA	brown
Me1_v2_0151970	NA	brown
Me1_v2_0152050	NA	brown
Me1_v2_0152090	NA	brown
Me1_v2_0152130	NA	brown
Me1_v2_0152230	NA	brown
Me1_v2_0152340	NA	brown
Me1_v2_0152440	NA	brown
Me1_v2_0152600	NA	brown
Me1_v2_0152640	NA	brown
Me1_v2_0152650	NA	brown
Me1_v2_0152660	NA	brown
Me1_v2_0152830	NA	brown
Me1_v2_0152840	NA	brown
Me1_v2_0152920	NA	brown
Me1_v2_0153130	NA	brown
Me1_v2_0153200	NA	brown
Me1_v2_0153300	NA	brown
Me1_v2_0153790	NA	brown
Me1_v2_0154000	NA	brown
Me1_v2_0154330	NA	brown
Me1_v2_0154430	NA	brown
Me1_v2_0154440	NA	brown
Me1_v2_0154470	NA	brown
Me1_v2_0154670	NA	brown
Me1_v2_0155270	NA	brown
Me1_v2_0155290	NA	brown
Me1_v2_0155420	NA	brown
Me1_v2_0155430	NA	brown
Me1_v2_0155590	NA	brown
Me1_v2_0155880	NA	brown
Me1_v2_0155920	NA	brown
Me1_v2_0156040	NA	brown
Me1_v2_0156520	NA	brown
Me1_v2_0156530	NA	brown
Me1_v2_0156620	NA	brown
Me1_v2_0156750	NA	brown
Me1_v2_0156940	NA	brown
Me1_v2_0156950	NA	brown
Me1_v2_0156960	NA	brown
Me1_v2_0156970	NA	brown
Me1_v2_0156990	NA	brown
Me1_v2_0157000	NA	brown
Me1_v2_0157160	NA	brown
Me1_v2_0157280	NA	brown
Me1_v2_0157430	NA	brown
Me1_v2_0157580	NA	brown
Me1_v2_0157670	NA	brown
Me1_v2_0157910	NA	brown
Me1_v2_0157920	NA	brown
Me1_v2_0158000	NA	brown
Me1_v2_0158010	NA	brown
Me1_v2_0158030	NA	brown
Me1_v2_0158240	NA	brown
Me1_v2_0158250	NA	brown
Me1_v2_0158560	NA	brown
Me1_v2_0158610	NA	brown
Me1_v2_0158620	NA	brown
Me1_v2_0158650	NA	brown
Me1_v2_0159120	NA	brown
Me1_v2_0159130	NA	brown
Me1_v2_0159180	NA	brown
Me1_v2_0159260	NA	brown
Me1_v2_0159340	NA	brown
Me1_v2_0159350	NA	brown
Me1_v2_0159720	NA	brown
Me1_v2_0159910	NA	brown
Me1_v2_0160180	NA	brown
Me1_v2_0160260	NA	brown
Me1_v2_0160270	NA	brown
Me1_v2_0160470	NA	brown
Me1_v2_0160530	NA	brown
Me1_v2_0160690	NA	brown
Me1_v2_0160700	NA	brown
Me1_v2_0161020	NA	brown
Me1_v2_0161060	NA	brown
Me1_v2_0161070	NA	brown
Me1_v2_0162250	NA	brown
Me1_v2_0162260	NA	brown
Me1_v2_0162410	NA	brown
Me1_v2_0162450	NA	brown
Me1_v2_0162530	NA	brown
Me1_v2_0162540	NA	brown
Me1_v2_0162550	NA	brown
Me1_v2_0162570	NA	brown
Me1_v2_0162600	NA	brown
Me1_v2_0162640	NA	brown
Me1_v2_0162860	NA	brown
Me1_v2_0163020	NA	brown
Me1_v2_0163040	NA	brown
Me1_v2_0163050	NA	brown
Me1_v2_0163630	NA	brown
Me1_v2_0163640	NA	brown
Me1_v2_0163790	NA	brown
Me1_v2_0163800	NA	brown
Me1_v2_0163810	NA	brown
Me1_v2_0163820	NA	brown
Me1_v2_0163830	NA	brown
Me1_v2_0163840	NA	brown
Me1_v2_0163850	NA	brown
Me1_v2_0164100	NA	brown
Me1_v2_0164430	NA	brown
Me1_v2_0164740	NA	brown
Me1_v2_0164950	NA	brown
Me1_v2_0164980	NA	brown
Me1_v2_0165090	NA	brown
Me1_v2_0165370	NA	brown
Me1_v2_0165440	NA	brown
Me1_v2_0165640	NA	brown
Me1_v2_0166190	NA	brown
Me1_v2_0166330	NA	brown
Me1_v2_0166440	NA	brown
Me1_v2_0166960	NA	brown
Me1_v2_0167100	NA	brown
Me1_v2_0167110	NA	brown
Me1_v2_0167170	NA	brown
Me1_v2_0167290	NA	brown
Me1_v2_0167340	NA	brown
Me1_v2_0167350	NA	brown
Me1_v2_0167370	NA	brown
Me1_v2_0167640	NA	brown
Me1_v2_0167990	NA	brown
Me1_v2_0168040	NA	brown
Me1_v2_0168220	NA	brown
Me1_v2_0168230	NA	brown
Me1_v2_0168240	NA	brown
Me1_v2_0168300	NA	brown
Me1_v2_0168430	NA	brown
Me1_v2_0168630	NA	brown
Me1_v2_0168950	NA	brown
Me1_v2_0169270	NA	brown
Me1_v2_0169450	NA	brown
Me1_v2_0169460	NA	brown
Me1_v2_0169470	NA	brown
Me1_v2_0169480	NA	brown
Me1_v2_0169490	NA	brown
Me1_v2_0169580	NA	brown
Me1_v2_0169590	NA	brown
Me1_v2_0169600	NA	brown
Me1_v2_0169760	NA	brown
Me1_v2_0169790	NA	brown
Me1_v2_0169860	NA	brown
Me1_v2_0170020	NA	brown
Me1_v2_0170110	NA	brown
Me1_v2_0170120	NA	brown
Me1_v2_0170170	NA	brown
Me1_v2_0170330	NA	brown
Me1_v2_0170440	NA	brown
Me1_v2_0170480	NA	brown
Me1_v2_0170530	NA	brown
Me1_v2_0170610	NA	brown
Me1_v2_0170640	NA	brown
Me1_v2_0170800	NA	brown
Me1_v2_0171010	NA	brown
Me1_v2_0171400	NA	brown
Me1_v2_0171420	NA	brown
Me1_v2_0172110	NA	brown
Me1_v2_0172150	NA	brown
Me1_v2_0172210	NA	brown
Me1_v2_0172220	NA	brown
Me1_v2_0172230	NA	brown
Me1_v2_0172340	NA	brown
Me1_v2_0172530	NA	brown
Me1_v2_0172910	NA	brown
Me1_v2_0173110	NA	brown
Me1_v2_0173230	NA	brown
Me1_v2_0173280	NA	brown
Me1_v2_0173310	NA	brown
Me1_v2_0173320	NA	brown
Me1_v2_0173510	NA	brown
Me1_v2_0174020	NA	brown
Me1_v2_0174620	NA	brown
Me1_v2_0174760	NA	brown
Me1_v2_0174850	NA	brown
Me1_v2_0174900	NA	brown
Me1_v2_0175260	NA	brown
Me1_v2_0175290	NA	brown
Me1_v2_0175390	NA	brown
Me1_v2_0175640	NA	brown
Me1_v2_0175650	NA	brown
Me1_v2_0175660	NA	brown
Me1_v2_0175900	NA	brown
Me1_v2_0175920	NA	brown
Me1_v2_0175980	NA	brown
Me1_v2_0175990	NA	brown
Me1_v2_0176110	NA	brown
Me1_v2_0176340	NA	brown
Me1_v2_0176820	NA	brown
Me1_v2_0176830	NA	brown
Me1_v2_0177380	NA	brown
Me1_v2_0177490	NA	brown
Me1_v2_0177500	NA	brown
Me1_v2_0177650	NA	brown
Me1_v2_0177710	NA	brown
Me1_v2_0177810	NA	brown
Me1_v2_0177820	NA	brown
Me1_v2_0177860	NA	brown
Me1_v2_0177880	NA	brown
Me1_v2_0178270	NA	brown
Me1_v2_0178480	NA	brown
Me1_v2_0178880	NA	brown
Me1_v2_0178910	NA	brown
Me1_v2_0179070	NA	brown
Me1_v2_0179300	NA	brown
Me1_v2_0179310	NA	brown
Me1_v2_0179320	NA	brown
Me1_v2_0179450	NA	brown
Me1_v2_0179540	NA	brown
Me1_v2_0179610	NA	brown
Me1_v2_0179730	NA	brown
Me1_v2_0179850	NA	brown
Me1_v2_0179950	NA	brown
Me1_v2_0180110	NA	brown
Me1_v2_0180140	NA	brown
Me1_v2_0180150	NA	brown
Me1_v2_0180160	NA	brown
Me1_v2_0180490	NA	brown
Me1_v2_0180530	NA	brown
Me1_v2_0180780	NA	brown
Me1_v2_0180920	NA	brown
Me1_v2_0180960	NA	brown
Me1_v2_0181010	NA	brown
Me1_v2_0181220	NA	brown
Me1_v2_0181290	NA	brown
Me1_v2_0181350	NA	brown
Me1_v2_0181370	NA	brown
Me1_v2_0181380	NA	brown
Me1_v2_0181400	NA	brown
Me1_v2_0181850	NA	brown
Me1_v2_0181980	NA	brown
Me1_v2_0182120	NA	brown
Me1_v2_0182130	NA	brown
Me1_v2_0182180	NA	brown
Me1_v2_0182220	NA	brown
Me1_v2_0182270	NA	brown
Me1_v2_0182280	NA	brown
Me1_v2_0182350	NA	brown
Me1_v2_0182370	NA	brown
Me1_v2_0182410	NA	brown
Me1_v2_0182960	NA	brown
Me1_v2_0183180	NA	brown
Me1_v2_0183580	NA	brown
Me1_v2_0183680	NA	brown
Me1_v2_0183780	NA	brown
Me1_v2_0184010	NA	brown
Me1_v2_0184110	NA	brown
Me1_v2_0184130	NA	brown
Me1_v2_0184140	NA	brown
Me1_v2_0184160	NA	brown
Me1_v2_0184180	NA	brown
Me1_v2_0184380	NA	brown
Me1_v2_0184480	NA	brown
Me1_v2_0184730	NA	brown
Me1_v2_0184740	NA	brown
Me1_v2_0185100	NA	brown
Me1_v2_0185110	NA	brown
Me1_v2_0185170	NA	brown
Me1_v2_0185230	NA	brown
Me1_v2_0185450	NA	brown
Me1_v2_0185670	NA	brown
Me1_v2_0185890	NA	brown
Me1_v2_0186110	NA	brown
Me1_v2_0186320	NA	brown
Me1_v2_0186370	NA	brown
Me1_v2_0186960	NA	brown
Me1_v2_0187240	NA	brown
Me1_v2_0187810	NA	brown
Me1_v2_0187990	NA	brown
Me1_v2_0188130	NA	brown
Me1_v2_0188180	NA	brown
Me1_v2_0188220	NA	brown
Me1_v2_0188560	NA	brown
Me1_v2_0188910	NA	brown
Me1_v2_0188920	NA	brown
Me1_v2_0188950	NA	brown
Me1_v2_0189090	NA	brown
Me1_v2_0189230	NA	brown
Me1_v2_0189250	NA	brown
Me1_v2_0189810	NA	brown
Me1_v2_0190120	NA	brown
Me1_v2_0190130	NA	brown
Me1_v2_0190150	NA	brown
Me1_v2_0190260	NA	brown
Me1_v2_0190370	NA	brown
Me1_v2_0190480	NA	brown
Me1_v2_0190490	NA	brown
Me1_v2_0190590	NA	brown
Me1_v2_0190780	NA	brown
Me1_v2_0190950	NA	brown
Me1_v2_0191470	NA	brown
Me1_v2_0191610	NA	brown
Me1_v2_0192760	NA	brown
Me1_v2_0193000	NA	brown
Me1_v2_0193050	NA	brown
Me1_v2_0193090	NA	brown
Me1_v2_0193520	NA	brown
Me1_v2_0193960	NA	brown
Me1_v2_0194480	NA	brown
Me1_v2_0194820	NA	brown
Me1_v2_0194830	NA	brown
Me1_v2_0194840	NA	brown
Me1_v2_0194850	NA	brown
Me1_v2_0195020	NA	brown
Me1_v2_0195030	NA	brown
Me1_v2_0195670	NA	brown
Me1_v2_0195690	NA	brown
Me1_v2_0195700	NA	brown
Me1_v2_0195820	NA	brown
Me1_v2_0195930	NA	brown
Me1_v2_0196370	NA	brown
Me1_v2_0196700	NA	brown
Me1_v2_0196830	NA	brown
Me1_v2_0197220	NA	brown
Me1_v2_0197450	NA	brown
Me1_v2_0197630	NA	brown
Me1_v2_0197660	NA	brown
Me1_v2_0197710	NA	brown
Me1_v2_0197720	NA	brown
Me1_v2_0197760	NA	brown
Me1_v2_0197950	NA	brown
Me1_v2_0197960	NA	brown
Me1_v2_0198050	NA	brown
Me1_v2_0198230	NA	brown
Me1_v2_0198280	NA	brown
Me1_v2_0198290	NA	brown
Me1_v2_0198390	NA	brown
Me1_v2_0198660	NA	brown
Me1_v2_0198710	NA	brown
Me1_v2_0198740	NA	brown
Me1_v2_0198950	NA	brown
Me1_v2_0198970	NA	brown
Me1_v2_0199000	NA	brown
Me1_v2_0199060	NA	brown
Me1_v2_0199310	NA	brown
Me1_v2_0199320	NA	brown
Me1_v2_0199540	NA	brown
Me1_v2_0199790	NA	brown
Me1_v2_0199820	NA	brown
Me1_v2_0199940	NA	brown
Me1_v2_0200080	NA	brown
Me1_v2_0200630	NA	brown
Me1_v2_0200830	NA	brown
Me1_v2_0201400	NA	brown
Me1_v2_0201410	NA	brown
Me1_v2_0201420	NA	brown
Me1_v2_0201850	NA	brown
Me1_v2_0201870	NA	brown
Me1_v2_0202030	NA	brown
Me1_v2_0202120	NA	brown
Me1_v2_0202130	NA	brown
Me1_v2_0202350	NA	brown
Me1_v2_0202390	NA	brown
Me1_v2_0202420	NA	brown
Me1_v2_0202440	NA	brown
Me1_v2_0202450	NA	brown
Me1_v2_0202530	NA	brown
Me1_v2_0202650	NA	brown
Me1_v2_0202700	NA	brown
Me1_v2_0202870	NA	brown
Me1_v2_0203400	NA	brown
Me1_v2_0203730	NA	brown
Me1_v2_0203750	NA	brown
Me1_v2_0203760	NA	brown
Me1_v2_0203830	NA	brown
Me1_v2_0203840	NA	brown
Me1_v2_0203860	NA	brown
Me1_v2_0203870	NA	brown
Me1_v2_0203930	NA	brown
Me1_v2_0204060	NA	brown
Me1_v2_0204070	NA	brown
Me1_v2_0204150	NA	brown
Me1_v2_0204370	NA	brown
Me1_v2_0204440	NA	brown
Me1_v2_0204480	NA	brown
Me1_v2_0204900	NA	brown
Me1_v2_0204930	NA	brown
Me1_v2_0205250	NA	brown
Me1_v2_0205270	NA	brown
Me1_v2_0205370	NA	brown
Me1_v2_0205650	NA	brown
Me1_v2_0205960	NA	brown
Me1_v2_0206110	NA	brown
Me1_v2_0206240	NA	brown
Me1_v2_0206520	NA	brown
Me1_v2_0206970	NA	brown
Me1_v2_0207060	NA	brown
Me1_v2_0207170	NA	brown
Me1_v2_0207220	NA	brown
Me1_v2_0207230	NA	brown
Me1_v2_0207240	NA	brown
Me1_v2_0207280	NA	brown
Me1_v2_0207330	NA	brown
Me1_v2_0207510	NA	brown
Me1_v2_0207610	NA	brown
Me1_v2_0207790	NA	brown
Me1_v2_0207810	NA	brown
Me1_v2_0207940	NA	brown
Me1_v2_0207950	NA	brown
Me1_v2_0208360	NA	brown
Me1_v2_0208380	NA	brown
Me1_v2_0208550	NA	brown
Me1_v2_0208760	NA	brown
Me1_v2_0208950	NA	brown
Me1_v2_0209370	NA	brown
Me1_v2_0209470	NA	brown
Me1_v2_0209770	NA	brown
Me1_v2_0209890	NA	brown
Me1_v2_0209960	NA	brown
Me1_v2_0209970	NA	brown
Me1_v2_0210170	NA	brown
Me1_v2_0210180	NA	brown
Me1_v2_0210190	NA	brown
Me1_v2_0210210	NA	brown
Me1_v2_0210220	NA	brown
Me1_v2_0210300	NA	brown
Me1_v2_0210890	NA	brown
Me1_v2_0211440	NA	brown
Me1_v2_0211550	NA	brown
Me1_v2_0211660	NA	brown
Me1_v2_0211700	NA	brown
Me1_v2_0211710	NA	brown
Me1_v2_0211720	NA	brown
Me1_v2_0211800	NA	brown
Me1_v2_0211810	NA	brown
Me1_v2_0211820	NA	brown
Me1_v2_0211960	NA	brown
Me1_v2_0212260	NA	brown
Me1_v2_0212280	NA	brown
Me1_v2_0212320	NA	brown
Me1_v2_0212450	NA	brown
Me1_v2_0212500	NA	brown
Me1_v2_0214160	NA	brown
Me1_v2_0214180	NA	brown
Me1_v2_0214630	NA	brown
Me1_v2_0214840	NA	brown
Me1_v2_0214870	NA	brown
Me1_v2_0215000	NA	brown
Me1_v2_0215220	NA	brown
Me1_v2_0215360	NA	brown
Me1_v2_0215390	NA	brown
Me1_v2_0215840	NA	brown
Me1_v2_0216040	NA	brown
Me1_v2_0216060	NA	brown
Me1_v2_0216100	NA	brown
Me1_v2_0216920	NA	brown
Me1_v2_0217180	NA	brown
Me1_v2_0217210	NA	brown
Me1_v2_0217420	NA	brown
Me1_v2_0217710	NA	brown
Me1_v2_0217770	NA	brown
Me1_v2_0217920	NA	brown
Me1_v2_0218040	NA	brown
Me1_v2_0218200	NA	brown
Me1_v2_0218260	NA	brown
Me1_v2_0218550	NA	brown
Me1_v2_0218560	NA	brown
Me1_v2_0218620	NA	brown
Me1_v2_0218630	NA	brown
Me1_v2_0218750	NA	brown
Me1_v2_0218760	NA	brown
Me1_v2_0218860	NA	brown
Me1_v2_0218970	NA	brown
Me1_v2_0219000	NA	brown
Me1_v2_0219010	NA	brown
Me1_v2_0219060	NA	brown
Me1_v2_0219150	NA	brown
Me1_v2_0219400	NA	brown
Me1_v2_0219450	NA	brown
Me1_v2_0219470	NA	brown
Me1_v2_0219520	NA	brown
Me1_v2_0219530	NA	brown
Me1_v2_0219990	NA	brown
Me1_v2_0220000	NA	brown
Me1_v2_0220010	NA	brown
Me1_v2_0220020	NA	brown
Me1_v2_0220030	NA	brown
Me1_v2_0220520	NA	brown
Me1_v2_0220760	NA	brown
Me1_v2_0221150	NA	brown
Me1_v2_0221160	NA	brown
Me1_v2_0221340	NA	brown
Me1_v2_0221400	NA	brown
Me1_v2_0221410	NA	brown
Me1_v2_0221420	NA	brown
Me1_v2_0221540	NA	brown
Me1_v2_0221840	NA	brown
Me1_v2_0221910	NA	brown
Me1_v2_0222100	NA	brown
Me1_v2_0222380	NA	brown
Me1_v2_0222450	NA	brown
Me1_v2_0222460	NA	brown
Me1_v2_0222590	NA	brown
Me1_v2_0222720	NA	brown
Me1_v2_0222730	NA	brown
Me1_v2_0223500	NA	brown
Me1_v2_0223660	NA	brown
Me1_v2_0223670	NA	brown
Me1_v2_0223700	NA	brown
Me1_v2_0223790	NA	brown
Me1_v2_0223800	NA	brown
Me1_v2_0223890	NA	brown
Me1_v2_0223940	NA	brown
Me1_v2_0224250	NA	brown
Me1_v2_0224300	NA	brown
Me1_v2_0224320	NA	brown
Me1_v2_0224430	NA	brown
Me1_v2_0225130	NA	brown
Me1_v2_0225170	NA	brown
Me1_v2_0225370	NA	brown
Me1_v2_0225400	NA	brown
Me1_v2_0225450	NA	brown
Me1_v2_0225730	NA	brown
Me1_v2_0225740	NA	brown
Me1_v2_0225790	NA	brown
Me1_v2_0225800	NA	brown
Me1_v2_0225810	NA	brown
Me1_v2_0225910	NA	brown
Me1_v2_0226080	NA	brown
Me1_v2_0226890	NA	brown
Me1_v2_0226940	NA	brown
Me1_v2_0227180	NA	brown
Me1_v2_0227210	NA	brown
Me1_v2_0227220	NA	brown
Me1_v2_0227340	NA	brown
Me1_v2_0227380	NA	brown
Me1_v2_0227440	NA	brown
Me1_v2_0227900	NA	brown
Me1_v2_0227920	NA	brown
Me1_v2_0228090	NA	brown
Me1_v2_0228250	NA	brown
Me1_v2_0228260	NA	brown
Me1_v2_0228630	NA	brown
Me1_v2_0228760	NA	brown
Me1_v2_0229110	NA	brown
Me1_v2_0229120	NA	brown
Me1_v2_0229130	NA	brown
Me1_v2_0229550	NA	brown
Me1_v2_0229580	NA	brown
Me1_v2_0229600	NA	brown
Me1_v2_0229610	NA	brown
Me1_v2_0229660	NA	brown
Me1_v2_0229840	NA	brown
Me1_v2_0229910	NA	brown
Me1_v2_0229990	NA	brown
Me1_v2_0230290	NA	brown
Me1_v2_0230300	NA	brown
Me1_v2_0230330	NA	brown
Me1_v2_0230360	NA	brown
Me1_v2_0230370	NA	brown
Me1_v2_0230420	NA	brown
Me1_v2_0230600	NA	brown
Me1_v2_0230740	NA	brown
Me1_v2_0230750	NA	brown
Me1_v2_0230770	NA	brown
Me1_v2_0231030	NA	brown
Me1_v2_0231140	NA	brown
Me1_v2_0231160	NA	brown
Me1_v2_0231300	NA	brown
Me1_v2_0231410	NA	brown
Me1_v2_0231420	NA	brown
Me1_v2_0231560	NA	brown
Me1_v2_0231600	NA	brown
Me1_v2_0231630	NA	brown
Me1_v2_0231850	NA	brown
Me1_v2_0232000	NA	brown
Me1_v2_0232010	NA	brown
Me1_v2_0232280	NA	brown
Me1_v2_0232400	NA	brown
Me1_v2_0232440	NA	brown
Me1_v2_0232480	NA	brown
Me1_v2_0232570	NA	brown
Me1_v2_0232580	NA	brown
Me1_v2_0232690	NA	brown
Me1_v2_0232970	NA	brown
Me1_v2_0232990	NA	brown
Me1_v2_0233080	NA	brown
Me1_v2_0233280	NA	brown
Me1_v2_0233290	NA	brown
Me1_v2_0233300	NA	brown
Me1_v2_0233330	NA	brown
Me1_v2_0233500	NA	brown
Me1_v2_0233580	NA	brown
Me1_v2_0233600	NA	brown
Me1_v2_0234130	NA	brown
Me1_v2_0234340	NA	brown
Me1_v2_0234370	NA	brown
Me1_v2_0234460	NA	brown
Me1_v2_0234510	NA	brown
Me1_v2_0235040	NA	brown
Me1_v2_0235060	NA	brown
Me1_v2_0235170	NA	brown
Me1_v2_0235180	NA	brown
