nodeName	altName	nodeAttr[nodesPresent, ]
Zci_00009	NA	black
Zci_00038	NA	black
Zci_00068	NA	black
Zci_00096	NA	black
Zci_00105	NA	black
Zci_00162	NA	black
Zci_00164	NA	black
Zci_00190	NA	black
Zci_00191	NA	black
Zci_00238	NA	black
Zci_00246	NA	black
Zci_00256	NA	black
Zci_00275	NA	black
Zci_00276	NA	black
Zci_00286	NA	black
Zci_00294	NA	black
Zci_00310	NA	black
Zci_00315	NA	black
Zci_00346	NA	black
Zci_00369	NA	black
Zci_00379	NA	black
Zci_00402	NA	black
Zci_00457	NA	black
Zci_00486	NA	black
Zci_00523	NA	black
Zci_00524	NA	black
Zci_00558	NA	black
Zci_00579	NA	black
Zci_00584	NA	black
Zci_00686	NA	black
Zci_00741	NA	black
Zci_00777	NA	black
Zci_00833	NA	black
Zci_00884	NA	black
Zci_01004	NA	black
Zci_01019	NA	black
Zci_01032	NA	black
Zci_01058	NA	black
Zci_01333	NA	black
Zci_01376	NA	black
Zci_01389	NA	black
Zci_01435	NA	black
Zci_01487	NA	black
Zci_01515	NA	black
Zci_01600	NA	black
Zci_01614	NA	black
Zci_01633	NA	black
Zci_01687	NA	black
Zci_01720	NA	black
Zci_01753	NA	black
Zci_01758	NA	black
Zci_01779	NA	black
Zci_01811	NA	black
Zci_01818	NA	black
Zci_01827	NA	black
Zci_01862	NA	black
Zci_01888	NA	black
Zci_01899	NA	black
Zci_01987	NA	black
Zci_02009	NA	black
Zci_02021	NA	black
Zci_02037	NA	black
Zci_02093	NA	black
Zci_02141	NA	black
Zci_02279	NA	black
Zci_02310	NA	black
Zci_02367	NA	black
Zci_02402	NA	black
Zci_02473	NA	black
Zci_02494	NA	black
Zci_02507	NA	black
Zci_02589	NA	black
Zci_02597	NA	black
Zci_02600	NA	black
Zci_02679	NA	black
Zci_02688	NA	black
Zci_02699	NA	black
Zci_02739	NA	black
Zci_02743	NA	black
Zci_02779	NA	black
Zci_02857	NA	black
Zci_02898	NA	black
Zci_02907	NA	black
Zci_02911	NA	black
Zci_02926	NA	black
Zci_02939	NA	black
Zci_02941	NA	black
Zci_02959	NA	black
Zci_02960	NA	black
Zci_03012	NA	black
Zci_03029	NA	black
Zci_03056	NA	black
Zci_03177	NA	black
Zci_03207	NA	black
Zci_03208	NA	black
Zci_03272	NA	black
Zci_03408	NA	black
Zci_03558	NA	black
Zci_03588	NA	black
Zci_03665	NA	black
Zci_03785	NA	black
Zci_03841	NA	black
Zci_03989	NA	black
Zci_04123	NA	black
Zci_04183	NA	black
Zci_04196	NA	black
Zci_04200	NA	black
Zci_04255	NA	black
Zci_04293	NA	black
Zci_04294	NA	black
Zci_04298	NA	black
Zci_04318	NA	black
Zci_04329	NA	black
Zci_04335	NA	black
Zci_04337	NA	black
Zci_04341	NA	black
Zci_04343	NA	black
Zci_04355	NA	black
Zci_04382	NA	black
Zci_04408	NA	black
Zci_04423	NA	black
Zci_04440	NA	black
Zci_04486	NA	black
Zci_04670	NA	black
Zci_04671	NA	black
Zci_04846	NA	black
Zci_04977	NA	black
Zci_04983	NA	black
Zci_05016	NA	black
Zci_05026	NA	black
Zci_05069	NA	black
Zci_05108	NA	black
Zci_05112	NA	black
Zci_05211	NA	black
Zci_05220	NA	black
Zci_05221	NA	black
Zci_05235	NA	black
Zci_05257	NA	black
Zci_05259	NA	black
Zci_05323	NA	black
Zci_05333	NA	black
Zci_05338	NA	black
Zci_05341	NA	black
Zci_05353	NA	black
Zci_05376	NA	black
Zci_05383	NA	black
Zci_05416	NA	black
Zci_05419	NA	black
Zci_05482	NA	black
Zci_05503	NA	black
Zci_05533	NA	black
Zci_05603	NA	black
Zci_05608	NA	black
Zci_05618	NA	black
Zci_05619	NA	black
Zci_05689	NA	black
Zci_05712	NA	black
Zci_05713	NA	black
Zci_05735	NA	black
Zci_05755	NA	black
Zci_05823	NA	black
Zci_05828	NA	black
Zci_05901	NA	black
Zci_05950	NA	black
Zci_05978	NA	black
Zci_06064	NA	black
Zci_06083	NA	black
Zci_06264	NA	black
Zci_06286	NA	black
Zci_06384	NA	black
Zci_06389	NA	black
Zci_06395	NA	black
Zci_06412	NA	black
Zci_06555	NA	black
Zci_06570	NA	black
Zci_06622	NA	black
Zci_06637	NA	black
Zci_06703	NA	black
Zci_06720	NA	black
Zci_06726	NA	black
Zci_06795	NA	black
Zci_06811	NA	black
Zci_06815	NA	black
Zci_06976	NA	black
Zci_06986	NA	black
Zci_07054	NA	black
Zci_07096	NA	black
Zci_07117	NA	black
Zci_07119	NA	black
Zci_07120	NA	black
Zci_07169	NA	black
Zci_07175	NA	black
Zci_07181	NA	black
Zci_07200	NA	black
Zci_07211	NA	black
Zci_07225	NA	black
Zci_07262	NA	black
Zci_07267	NA	black
Zci_07284	NA	black
Zci_07315	NA	black
Zci_07334	NA	black
Zci_07366	NA	black
Zci_07489	NA	black
Zci_07500	NA	black
Zci_07527	NA	black
Zci_07680	NA	black
Zci_07697	NA	black
Zci_07701	NA	black
Zci_07719	NA	black
Zci_07752	NA	black
Zci_07758	NA	black
Zci_07817	NA	black
Zci_07824	NA	black
Zci_07850	NA	black
Zci_07878	NA	black
Zci_07953	NA	black
Zci_07973	NA	black
Zci_07984	NA	black
Zci_07986	NA	black
Zci_07996	NA	black
Zci_08002	NA	black
Zci_08018	NA	black
Zci_08019	NA	black
Zci_08063	NA	black
Zci_08077	NA	black
Zci_08096	NA	black
Zci_08101	NA	black
Zci_08148	NA	black
Zci_08164	NA	black
Zci_08175	NA	black
Zci_08212	NA	black
Zci_08218	NA	black
Zci_08283	NA	black
Zci_08293	NA	black
Zci_08341	NA	black
Zci_08348	NA	black
Zci_08350	NA	black
Zci_08353	NA	black
Zci_08355	NA	black
Zci_08371	NA	black
Zci_08375	NA	black
Zci_08485	NA	black
Zci_08520	NA	black
Zci_08551	NA	black
Zci_08553	NA	black
Zci_08561	NA	black
Zci_08572	NA	black
Zci_08599	NA	black
Zci_08605	NA	black
Zci_08607	NA	black
Zci_08638	NA	black
Zci_08639	NA	black
Zci_08663	NA	black
Zci_08669	NA	black
Zci_08670	NA	black
Zci_08676	NA	black
Zci_08720	NA	black
Zci_08760	NA	black
Zci_08792	NA	black
Zci_08794	NA	black
Zci_08795	NA	black
Zci_08831	NA	black
Zci_08947	NA	black
Zci_08976	NA	black
Zci_09038	NA	black
Zci_09049	NA	black
Zci_09081	NA	black
Zci_09107	NA	black
Zci_09120	NA	black
Zci_09160	NA	black
Zci_09184	NA	black
Zci_09187	NA	black
Zci_09202	NA	black
Zci_09226	NA	black
Zci_09267	NA	black
Zci_09271	NA	black
Zci_09284	NA	black
Zci_09291	NA	black
Zci_09296	NA	black
Zci_09339	NA	black
Zci_09343	NA	black
Zci_09350	NA	black
Zci_09368	NA	black
Zci_09371	NA	black
Zci_09397	NA	black
Zci_09427	NA	black
Zci_09445	NA	black
Zci_09446	NA	black
Zci_09463	NA	black
Zci_09483	NA	black
Zci_09496	NA	black
Zci_09535	NA	black
Zci_09547	NA	black
Zci_09567	NA	black
Zci_09597	NA	black
Zci_09599	NA	black
Zci_09697	NA	black
Zci_09736	NA	black
Zci_09773	NA	black
Zci_09775	NA	black
Zci_09782	NA	black
Zci_09794	NA	black
Zci_09808	NA	black
Zci_09874	NA	black
Zci_09926	NA	black
Zci_09962	NA	black
Zci_09973	NA	black
Zci_10025	NA	black
Zci_10036	NA	black
Zci_10052	NA	black
Zci_10082	NA	black
Zci_10093	NA	black
Zci_10142	NA	black
Zci_10164	NA	black
Zci_10167	NA	black
Zci_10177	NA	black
Zci_10288	NA	black
Zci_10306	NA	black
Zci_10312	NA	black
Zci_10315	NA	black
Zci_10336	NA	black
Zci_10341	NA	black
Zci_10413	NA	black
Zci_10430	NA	black
Zci_10506	NA	black
Zci_10586	NA	black
Zci_10593	NA	black
Zci_10625	NA	black
Zci_10652	NA	black
Zci_10721	NA	black
Zci_10753	NA	black
Zci_10773	NA	black
Zci_10796	NA	black
Zci_10900	NA	black
Zci_10926	NA	black
Zci_10928	NA	black
Zci_10956	NA	black
Zci_10970	NA	black
Zci_11010	NA	black
Zci_11015	NA	black
Zci_11058	NA	black
Zci_11109	NA	black
Zci_11119	NA	black
Zci_11139	NA	black
Zci_11199	NA	black
Zci_11236	NA	black
Zci_11246	NA	black
Zci_11289	NA	black
Zci_11394	NA	black
Zci_11404	NA	black
Zci_11432	NA	black
Zci_11443	NA	black
Zci_11448	NA	black
Zci_11451	NA	black
Zci_11468	NA	black
Zci_11497	NA	black
Zci_11622	NA	black
Zci_11627	NA	black
Zci_11641	NA	black
Zci_11789	NA	black
Zci_11881	NA	black
Zci_11894	NA	black
Zci_11911	NA	black
Zci_11941	NA	black
Zci_11944	NA	black
Zci_12096	NA	black
Zci_12200	NA	black
Zci_12257	NA	black
Zci_12271	NA	black
Zci_12279	NA	black
Zci_12316	NA	black
Zci_12317	NA	black
Zci_12321	NA	black
Zci_12330	NA	black
Zci_12339	NA	black
Zci_12361	NA	black
Zci_12371	NA	black
Zci_12384	NA	black
Zci_12393	NA	black
Zci_12414	NA	black
Zci_12474	NA	black
Zci_12480	NA	black
Zci_12709	NA	black
Zci_12816	NA	black
Zci_12866	NA	black
Zci_12879	NA	black
Zci_12976	NA	black
Zci_12981	NA	black
Zci_13017	NA	black
Zci_13024	NA	black
Zci_13026	NA	black
Zci_13096	NA	black
Zci_13165	NA	black
Zci_13183	NA	black
Zci_13186	NA	black
Zci_13198	NA	black
Zci_13208	NA	black
Zci_13232	NA	black
Zci_13234	NA	black
Zci_13287	NA	black
Zci_13301	NA	black
Zci_13306	NA	black
Zci_13319	NA	black
Zci_13327	NA	black
Zci_13367	NA	black
Zci_13418	NA	black
Zci_13462	NA	black
Zci_13467	NA	black
Zci_13597	NA	black
Zci_13614	NA	black
Zci_13628	NA	black
Zci_13654	NA	black
Zci_13658	NA	black
Zci_13659	NA	black
Zci_13672	NA	black
Zci_13680	NA	black
Zci_13716	NA	black
Zci_13718	NA	black
Zci_13737	NA	black
Zci_13743	NA	black
Zci_13757	NA	black
Zci_13805	NA	black
Zci_13862	NA	black
Zci_13901	NA	black
Zci_13914	NA	black
Zci_13958	NA	black
Zci_14037	NA	black
Zci_14060	NA	black
Zci_14144	NA	black
Zci_14146	NA	black
Zci_14164	NA	black
Zci_14191	NA	black
Zci_14213	NA	black
Zci_14248	NA	black
Zci_14250	NA	black
Zci_14277	NA	black
Zci_14284	NA	black
Zci_14285	NA	black
Zci_14290	NA	black
Zci_14324	NA	black
Zci_14332	NA	black
Zci_14336	NA	black
Zci_14393	NA	black
Zci_14397	NA	black
Zci_14441	NA	black
Zci_14470	NA	black
Zci_14480	NA	black
Zci_14531	NA	black
Zci_14589	NA	black
Zci_14604	NA	black
Zci_14625	NA	black
Zci_14636	NA	black
Zci_14645	NA	black
Zci_14677	NA	black
Zci_14698	NA	black
Zci_14702	NA	black
Zci_14703	NA	black
Zci_14736	NA	black
Zci_14740	NA	black
Zci_14748	NA	black
Zci_14915	NA	black
Zci_14946	NA	black
Zci_14959	NA	black
Zci_14960	NA	black
Zci_15054	NA	black
Zci_15065	NA	black
Zci_15073	NA	black
Zci_15091	NA	black
Zci_15098	NA	black
Zci_15167	NA	black
Zci_15168	NA	black
Zci_15174	NA	black
Zci_15187	NA	black
Zci_15226	NA	black
Zci_15288	NA	black
Zci_15347	NA	black
Zci_15355	NA	black
Zci_15358	NA	black
Zci_15387	NA	black
Zci_15407	NA	black
Zci_15421	NA	black
Zci_15465	NA	black
Zci_15503	NA	black
Zci_15612	NA	black
Zci_15658	NA	black
Zci_15679	NA	black
Zci_15684	NA	black
Zci_15687	NA	black
Zci_15692	NA	black
Zci_15698	NA	black
Zci_15699	NA	black
Zci_15762	NA	black
Zci_15824	NA	black
Zci_15825	NA	black
Zci_15835	NA	black
Zci_15865	NA	black
Zci_15897	NA	black
Zci_15898	NA	black
Zci_15916	NA	black
Zci_15917	NA	black
Zci_15924	NA	black
Zci_15925	NA	black
Zci_15953	NA	black
Zci_15962	NA	black
Zci_15987	NA	black
Zci_16400	NA	black
Zci_16525	NA	black
Zci_16552	NA	black
Zci_16568	NA	black
Zci_16581	NA	black
Zci_16583	NA	black
