"","ID","Description","GeneRatio","BgRatio","pvalue","p.adjust","qvalue","geneID","Count"
"GO:0010162","GO:0010162","seed dormancy process","2/5","20/9629",4.08358317413191e-05,0.00149050785855815,0.000773731548782889,"Pp3c16_17210V3/Pp3c22_8470V3",2
"GO:0022611","GO:0022611","dormancy process","2/5","20/9629",4.08358317413191e-05,0.00149050785855815,0.000773731548782889,"Pp3c16_17210V3/Pp3c22_8470V3",2
"GO:0010431","GO:0010431","seed maturation","2/5","35/9629",0.000127482187670541,0.00310206656664982,0.00161030131794367,"Pp3c16_17210V3/Pp3c22_8470V3",2
"GO:0071695","GO:0071695","anatomical structure maturation","2/5","140/9629",0.00203952457518837,0.0299569151217568,0.0155508139060309,"Pp3c16_17210V3/Pp3c22_8470V3",2
"GO:0021700","GO:0021700","developmental maturation","2/5","154/9629",0.00246221220178823,0.0299569151217568,0.0155508139060309,"Pp3c16_17210V3/Pp3c22_8470V3",2
"GO:0048609","GO:0048609","multicellular organismal reproductive process","2/5","154/9629",0.00246221220178823,0.0299569151217568,0.0155508139060309,"Pp3c16_17210V3/Pp3c22_8470V3",2
"GO:0032504","GO:0032504","multicellular organism reproduction","2/5","168/9629",0.00292324608726258,0.0302558388349441,0.0157059869943474,"Pp3c16_17210V3/Pp3c22_8470V3",2
"GO:0009636","GO:0009636","response to toxic substance","2/5","184/9629",0.00349664662128515,0.0302558388349441,0.0157059869943474,"Pp3c22_8470V3/Pp3c8_9230V3",2
"GO:0009414","GO:0009414","response to water deprivation","2/5","219/9629",0.00492144335467826,0.0302558388349441,0.0157059869943474,"Pp3c16_17210V3/Pp3c22_8470V3",2
"GO:0009415","GO:0009415","response to water","2/5","223/9629",0.00509899600236678,0.0302558388349441,0.0157059869943474,"Pp3c16_17210V3/Pp3c22_8470V3",2
"GO:0009687","GO:0009687","abscisic acid metabolic process","1/5","11/9629",0.00570005781086635,0.0302558388349441,0.0157059869943474,"Pp3c16_17210V3",1
"GO:0043288","GO:0043288","apocarotenoid metabolic process","1/5","11/9629",0.00570005781086635,0.0302558388349441,0.0157059869943474,"Pp3c16_17210V3",1
"GO:1902644","GO:1902644","tertiary alcohol metabolic process","1/5","11/9629",0.00570005781086635,0.0302558388349441,0.0157059869943474,"Pp3c16_17210V3",1
"GO:0006714","GO:0006714","sesquiterpenoid metabolic process","1/5","12/9629",0.0062169531852625,0.0302558388349441,0.0157059869943474,"Pp3c16_17210V3",1
"GO:0045471","GO:0045471","response to ethanol","1/5","12/9629",0.0062169531852625,0.0302558388349441,0.0157059869943474,"Pp3c8_9230V3",1
"GO:0046685","GO:0046685","response to arsenic-containing substance","1/5","21/9629",0.0108593449446339,0.0495457613098923,0.0257195011846593,"Pp3c8_9230V3",1
"GO:0010167","GO:0010167","response to nitrate","1/5","25/9629",0.0129170531486542,0.0554673458736328,0.0287934311672787,"Pp3c22_21950V3",1
"GO:0042538","GO:0042538","hyperosmotic salinity response","1/5","29/9629",0.0149713354085286,0.0607170824901437,0.0315186008600602,"Pp3c16_17210V3",1
"GO:0009269","GO:0009269","response to desiccation","1/5","34/9629",0.0175343770190166,0.0637840615985685,0.033110688068471,"Pp3c22_8470V3",1
"GO:0046688","GO:0046688","response to copper ion","1/5","35/9629",0.0180463445140564,0.0637840615985685,0.033110688068471,"Pp3c8_9230V3",1
"GO:0048316","GO:0048316","seed development","2/5","432/9629",0.0183488396379444,0.0637840615985685,0.033110688068471,"Pp3c16_17210V3/Pp3c22_8470V3",2
"GO:0010154","GO:0010154","fruit development","2/5","447/9629",0.0195841843262812,0.0649838843553875,0.0337335232414412,"Pp3c16_17210V3/Pp3c22_8470V3",2
"GO:0046165","GO:0046165","alcohol biosynthetic process","1/5","42/9629",0.021624144026976,0.0686331527812716,0.0356278803190451,"Pp3c16_17210V3",1
"GO:0010286","GO:0010286","heat acclimation","1/5","45/9629",0.02315429054819,0.0704276337507445,0.036559406128721,"Pp3c8_9230V3",1
"GO:0015698","GO:0015698","inorganic anion transport","1/5","48/9629",0.024682521992656,0.0720729642185554,0.0374135070204469,"Pp3c22_21950V3",1
"GO:0006972","GO:0006972","hyperosmotic response","1/5","55/9629",0.0282409579412494,0.0792919203735078,0.0411609103597157,"Pp3c16_17210V3",1
"GO:0016114","GO:0016114","terpenoid biosynthetic process","1/5","59/9629",0.0302696817910968,0.0817399412458282,0.0424316926438329,"Pp3c16_17210V3",1
"GO:0051260","GO:0051260","protein homooligomerization","1/5","64/9629",0.0328008203642735,0.0817399412458282,0.0424316926438329,"Pp3c8_9230V3",1
"GO:0009624","GO:0009624","response to nematode","1/5","65/9629",0.0333064132443758,0.0817399412458282,0.0424316926438329,"Pp3c22_23000V3",1
"GO:1990748","GO:1990748","cellular detoxification","1/5","67/9629",0.0343169647009288,0.0817399412458282,0.0424316926438329,"Pp3c22_8470V3",1
"GO:0098869","GO:0098869","cellular oxidant detoxification","1/5","68/9629",0.0348219234100372,0.0817399412458282,0.0424316926438329,"Pp3c22_8470V3",1
"GO:0042542","GO:0042542","response to hydrogen peroxide","1/5","70/9629",0.0358312071214589,0.0817399412458282,0.0424316926438329,"Pp3c8_9230V3",1
"GO:0006066","GO:0006066","alcohol metabolic process","1/5","76/9629",0.0388539933728004,0.0820875679945428,0.0426121477693373,"Pp3c16_17210V3",1
"GO:0097237","GO:0097237","cellular response to toxic substance","1/5","76/9629",0.0388539933728004,0.0820875679945428,0.0426121477693373,"Pp3c22_8470V3",1
"GO:0008299","GO:0008299","isoprenoid biosynthetic process","1/5","77/9629",0.0393570531480685,0.0820875679945428,0.0426121477693373,"Pp3c16_17210V3",1
"GO:0006721","GO:0006721","terpenoid metabolic process","1/5","81/9629",0.0413671862952918,0.0835968185473459,0.0433956087628616,"Pp3c16_17210V3",1
"GO:0098754","GO:0098754","detoxification","1/5","83/9629",0.0423709902226274,0.0835968185473459,0.0433956087628616,"Pp3c22_8470V3",1
"GO:0006720","GO:0006720","isoprenoid metabolic process","1/5","101/9629",0.0513674413048418,0.0970811171361568,0.0503953888522227,"Pp3c16_17210V3",1
"GO:0051259","GO:0051259","protein complex oligomerization","1/5","102/9629",0.0518652543604126,0.0970811171361568,0.0503953888522227,"Pp3c8_9230V3",1
"GO:1901617","GO:1901617","organic hydroxy compound biosynthetic process","1/5","105/9629",0.0533574397216172,0.0973773274919514,0.0505491534204795,"Pp3c16_17210V3",1
"GO:0009644","GO:0009644","response to high light intensity","1/5","115/9629",0.0583178279854714,0.103834181535108,0.0539009449929902,"Pp3c8_9230V3",1
"GO:0007389","GO:0007389","pattern specification process","1/5","131/9629",0.066211179849633,0.115081336405314,0.0597394103906463,"Pp3c22_23000V3",1
"GO:0000302","GO:0000302","response to reactive oxygen species","1/5","136/9629",0.0686669665198497,0.116574152463931,0.060514340139892,"Pp3c8_9230V3",1
"GO:0098656","GO:0098656","anion transmembrane transport","1/5","141/9629",0.071117583659091,0.11799053652531,0.0612495935819923,"Pp3c22_21950V3",1
"GO:0009611","GO:0009611","response to wounding","1/5","150/9629",0.0755156933515791,0.122503235881451,0.0635921628223824,"Pp3c22_21950V3",1
"GO:0050832","GO:0050832","defense response to fungus","1/5","158/9629",0.0794111237163725,0.12602200068033,0.0654187746862565,"Pp3c22_8470V3",1
"GO:1901615","GO:1901615","organic hydroxy compound metabolic process","1/5","164/9629",0.082324070108905,0.126552302892944,0.065694057738226,"Pp3c16_17210V3",1
"GO:0072330","GO:0072330","monocarboxylic acid biosynthetic process","1/5","166/9629",0.083293411894501,0.126552302892944,0.065694057738226,"Pp3c16_17210V3",1
"GO:0046677","GO:0046677","response to antibiotic","1/5","171/9629",0.0857131830298387,0.126552302892944,0.065694057738226,"Pp3c8_9230V3",1
"GO:0006820","GO:0006820","anion transport","1/5","173/9629",0.0866796595157149,0.126552302892944,0.065694057738226,"Pp3c22_21950V3",1
"GO:0009642","GO:0009642","response to light intensity","1/5","179/9629",0.0895741861136299,0.127776244569726,0.0663294131868802,"Pp3c8_9230V3",1
"GO:0009408","GO:0009408","response to heat","1/5","182/9629",0.0910186947619968,0.127776244569726,0.0663294131868802,"Pp3c8_9230V3",1
"GO:0009620","GO:0009620","response to fungus","1/5","194/9629",0.0967784057976044,0.133298558928776,0.0691960796169565,"Pp3c22_8470V3",1
"GO:1901698","GO:1901698","response to nitrogen compound","1/5","229/9629",0.11341099072733,0.153314857835094,0.0795866601595296,"Pp3c22_21950V3",1
"GO:0032787","GO:0032787","monocarboxylic acid metabolic process","1/5","266/9629",0.130726649064071,0.173509916030494,0.0900700357187857,"Pp3c16_17210V3",1
"GO:0008610","GO:0008610","lipid biosynthetic process","1/5","276/9629",0.135359797928372,0.176451165156628,0.0915968557410039,"Pp3c16_17210V3",1
"GO:0046686","GO:0046686","response to cadmium ion","1/5","304/9629",0.148227605955404,0.187350781404821,0.0972549117602531,"Pp3c8_9230V3",1
"GO:0016053","GO:0016053","organic acid biosynthetic process","1/5","311/9629",0.151420494560061,0.187350781404821,0.0972549117602531,"Pp3c16_17210V3",1
"GO:0046394","GO:0046394","carboxylic acid biosynthetic process","1/5","311/9629",0.151420494560061,0.187350781404821,0.0972549117602531,"Pp3c16_17210V3",1
"GO:0006979","GO:0006979","response to oxidative stress","1/5","318/9629",0.154603801084667,0.188101291319678,0.0976445059482104,"Pp3c8_9230V3",1
"GO:0034220","GO:0034220","ion transmembrane transport","1/5","343/9629",0.165894858794965,0.198529912984138,0.103058065860548,"Pp3c22_21950V3",1
"GO:0097305","GO:0097305","response to alcohol","1/5","380/9629",0.182383914374544,0.214742350795834,0.111474039346071,"Pp3c8_9230V3",1
"GO:0098542","GO:0098542","defense response to other organism","1/5","392/9629",0.187675339395917,0.217465075807967,0.112887422193032,"Pp3c22_8470V3",1
"GO:0044255","GO:0044255","cellular lipid metabolic process","1/5","400/9629",0.191187709786309,0.218073481475008,0.113203249215577,"Pp3c16_17210V3",1
"GO:0010038","GO:0010038","response to metal ion","1/5","415/9629",0.19774065386553,0.218764790631135,0.113562111935413,"Pp3c8_9230V3",1
"GO:0006811","GO:0006811","ion transport","1/5","422/9629",0.200784122908028,0.218764790631135,0.113562111935413,"Pp3c22_21950V3",1
"GO:0009651","GO:0009651","response to salt stress","1/5","422/9629",0.200784122908028,0.218764790631135,0.113562111935413,"Pp3c16_17210V3",1
"GO:0044283","GO:0044283","small molecule biosynthetic process","1/5","449/9629",0.212436817318006,0.228057171532566,0.118385842468239,"Pp3c16_17210V3",1
"GO:0006970","GO:0006970","response to osmotic stress","1/5","478/9629",0.224800870449231,0.230713879800686,0.11976495562833,"Pp3c16_17210V3",1
"GO:0005975","GO:0005975","carbohydrate metabolic process","1/5","482/9629",0.226493998879716,0.230713879800686,0.11976495562833,"Pp3c22_23000V3",1
"GO:0006952","GO:0006952","defense response","1/5","485/9629",0.227761902693303,0.230713879800686,0.11976495562833,"Pp3c22_8470V3",1
"GO:0006629","GO:0006629","lipid metabolic process","1/5","487/9629",0.228606247807981,0.230713879800686,0.11976495562833,"Pp3c16_17210V3",1
"GO:0009266","GO:0009266","response to temperature stimulus","1/5","492/9629",0.230713879800686,0.230713879800686,0.11976495562833,"Pp3c8_9230V3",1
