Sample	Unique Reads	Duplicate Reads
P_1_10_EKRN220057179-1A_HLTJ3DSX5_L4_1	3217138.0	26480802.0
P_1_10_EKRN220057179-1A_HLTJ3DSX5_L4_2	3633100.0	26064840.0
P_1_11_1	4197294.0	26524420.0
P_1_11_2	3511104.0	27210610.0
P_1_12_1	6578805.0	24566994.0
P_1_12_2	4887512.0	26258287.0
P_1_13_1	3080392.0	28718053.0
P_1_13_2	3508664.0	28289781.0
P_1_14_EKRN220057183-1A_HLTJ3DSX5_L4_1	3470686.0	25855476.0
P_1_14_EKRN220057183-1A_HLTJ3DSX5_L4_2	3688188.0	25637974.0
P_1_15_EKRN220057184-1A_HKHYCDSX5_L1_1	5021988.0	25491464.0
P_1_15_EKRN220057184-1A_HKHYCDSX5_L1_2	5600723.0	24912729.0
P_1_16_EKRN220057185-1A_HKHYCDSX5_L1_1	5428890.0	26064441.0
P_1_16_EKRN220057185-1A_HKHYCDSX5_L1_2	5932909.0	25560422.0
P_1_17_EKRN220057186-1A_HKHYCDSX5_L1_1	4789858.0	25985233.0
P_1_17_EKRN220057186-1A_HKHYCDSX5_L1_2	5460221.0	25314870.0
P_1_18_EKRN220057187-1A_HKHYCDSX5_L1_1	4804104.0	26116808.0
P_1_18_EKRN220057187-1A_HKHYCDSX5_L1_2	5596867.0	25324045.0
P_1_19_EKRN220057188-1A_HKHYCDSX5_L1_1	3934069.0	27441267.0
P_1_19_EKRN220057188-1A_HKHYCDSX5_L1_2	4506204.0	26869132.0
P_1_1_EKRN220057170-1A_H23VJDSX5_L3_1	4118355.0	18831650.0
P_1_1_EKRN220057170-1A_H23VJDSX5_L3_2	4475230.0	18474775.0
P_1_20_EKRN220057189-1A_HKHYCDSX5_L1_1	4204475.0	24645843.0
P_1_20_EKRN220057189-1A_HKHYCDSX5_L1_2	4766068.0	24084250.0
P_1_21_EKRN220057190-1A_HKHYCDSX5_L2_1	7557512.0	23258551.0
P_1_21_EKRN220057190-1A_HKHYCDSX5_L2_2	8174783.0	22641280.0
P_1_22_EKRN220057191-1A_HKHYCDSX5_L1_1	4925554.0	23572216.0
P_1_22_EKRN220057191-1A_HKHYCDSX5_L1_2	5415019.0	23082751.0
P_1_23_EKRN220057192-1A_HKHYCDSX5_L1_1	4388301.0	25920078.0
P_1_23_EKRN220057192-1A_HKHYCDSX5_L1_2	4733844.0	25574535.0
P_1_24_EKRN220057193-1A_HKHYCDSX5_L1_1	4983251.0	26069173.0
P_1_24_EKRN220057193-1A_HKHYCDSX5_L1_2	5453169.0	25599255.0
P_1_25_1	8449772.0	23696878.0
P_1_25_2	9245055.0	22901595.0
P_1_26_1	8123694.0	23648681.0
P_1_26_2	8947671.0	22824704.0
P_1_27_EKRN220057196-1A_HKHYCDSX5_L1_1	8237767.0	22057665.0
P_1_27_EKRN220057196-1A_HKHYCDSX5_L1_2	9282163.0	21013269.0
P_1_28_1	7507459.0	23362036.0
P_1_28_2	8256680.0	22612815.0
P_1_29_1	7560978.0	24484352.0
P_1_29_2	8375510.0	23669820.0
P_1_2_EKRN220057171-1A_H23VJDSX5_L3_1	3598858.0	10822636.0
P_1_2_EKRN220057171-1A_H23VJDSX5_L3_2	3667700.0	10753794.0
P_1_30_EKRN220057199-1A_HKHYCDSX5_L1_1	5997044.0	24497877.0
P_1_30_EKRN220057199-1A_HKHYCDSX5_L1_2	6667042.0	23827879.0
P_1_31_EKRN220057200-1A_HKHYCDSX5_L1_1	6844177.0	23251637.0
P_1_31_EKRN220057200-1A_HKHYCDSX5_L1_2	7940825.0	22154989.0
P_1_32_EKRN220057201-1A_HKHYCDSX5_L1_1	6887559.0	23309801.0
P_1_32_EKRN220057201-1A_HKHYCDSX5_L1_2	7778621.0	22418739.0
P_1_33_EKRN220057202-1A_HKHYCDSX5_L2_1	8226746.0	24663102.0
P_1_33_EKRN220057202-1A_HKHYCDSX5_L2_2	8921245.0	23968603.0
P_1_34_EKRN220057203-1A_HKHYCDSX5_L2_1	7051914.0	25026478.0
P_1_34_EKRN220057203-1A_HKHYCDSX5_L2_2	8109689.0	23968703.0
P_1_35_EKRN220057204-1A_HKHYCDSX5_L2_1	7263860.0	25218333.0
P_1_35_EKRN220057204-1A_HKHYCDSX5_L2_2	7996929.0	24485264.0
P_1_36_EKRN220057205-1A_HKHYCDSX5_L2_1	6460371.0	27673823.0
P_1_36_EKRN220057205-1A_HKHYCDSX5_L2_2	6986306.0	27147888.0
P_1_37_EKRN220057206-1A_HKHYCDSX5_L1_1	7266630.0	22433526.0
P_1_37_EKRN220057206-1A_HKHYCDSX5_L1_2	8001565.0	21698591.0
P_1_38_1	7318696.0	24935249.0
P_1_38_2	7870319.0	24383626.0
P_1_39_EKRN220057208-1A_HKHYCDSX5_L2_1	7641974.0	23565125.0
P_1_39_EKRN220057208-1A_HKHYCDSX5_L2_2	8551303.0	22655796.0
P_1_3_EKRN220057172-1A_H223VDSX5_L3_1	3253948.0	14170531.0
P_1_3_EKRN220057172-1A_H223VDSX5_L3_2	3426658.0	13997821.0
P_1_40_EKRN220057209-1A_HKHYCDSX5_L2_1	7427189.0	23672852.0
P_1_40_EKRN220057209-1A_HKHYCDSX5_L2_2	8167438.0	22932603.0
P_1_41_EKRN220057210-1A_HKHYCDSX5_L2_1	7048420.0	28561166.0
P_1_41_EKRN220057210-1A_HKHYCDSX5_L2_2	7990755.0	27618831.0
P_1_42_EKRN220057211-1A_HKHYCDSX5_L1_1	5996558.0	24025767.0
P_1_42_EKRN220057211-1A_HKHYCDSX5_L1_2	6459605.0	23562720.0
P_1_43_1	6929468.0	25618475.0
P_1_43_2	8026719.0	24521224.0
P_1_44_1	7688769.0	23763400.0
P_1_44_2	8224773.0	23227396.0
P_1_45_EKRN220057214-1A_HKHYCDSX5_L1_1	7763014.0	25545575.0
P_1_45_EKRN220057214-1A_HKHYCDSX5_L1_2	8552278.0	24756311.0
P_1_46_EKRN220057215-1A_HKHYCDSX5_L1_1	6340096.0	27291928.0
P_1_46_EKRN220057215-1A_HKHYCDSX5_L1_2	7076489.0	26555535.0
P_1_47_EKRN220057216-1A_HKHYCDSX5_L1_1	6094770.0	25753446.0
P_1_47_EKRN220057216-1A_HKHYCDSX5_L1_2	6652331.0	25195885.0
P_1_48_EKRN220057217-1A_HKHYCDSX5_L1_1	6080450.0	25860602.0
P_1_48_EKRN220057217-1A_HKHYCDSX5_L1_2	6533523.0	25407529.0
P_1_49_EKRN220057218-1A_HKHYCDSX5_L2_1	8058154.0	27831194.0
P_1_49_EKRN220057218-1A_HKHYCDSX5_L2_2	8904373.0	26984975.0
P_1_4_EKRN220057173-1A_H22CWDSX5_L2_1	4143290.0	16854558.0
P_1_4_EKRN220057173-1A_H22CWDSX5_L2_2	4432037.0	16565811.0
P_1_50_EKRN220057219-1A_HKHYCDSX5_L1_1	7201345.0	21149454.0
P_1_50_EKRN220057219-1A_HKHYCDSX5_L1_2	7790704.0	20560095.0
P_1_51_EKRN220057220-1A_HKHYCDSX5_L1_1	7192711.0	21526345.0
P_1_51_EKRN220057220-1A_HKHYCDSX5_L1_2	7977113.0	20741943.0
P_1_52_1	6789763.0	25222030.0
P_1_52_2	7591715.0	24420078.0
P_1_53_EKRN220057222-1A_HKHYCDSX5_L2_1	6645762.0	24013729.0
P_1_53_EKRN220057222-1A_HKHYCDSX5_L2_2	7293870.0	23365621.0
P_1_54_EKRN220057223-1A_HKHYCDSX5_L2_1	7320290.0	28899211.0
P_1_54_EKRN220057223-1A_HKHYCDSX5_L2_2	7994969.0	28224532.0
P_1_55_1	6722059.0	24194579.0
P_1_55_2	7434030.0	23482608.0
P_1_56_EKRN220057225-1A_HKHYCDSX5_L2_1	7644574.0	27475002.0
P_1_56_EKRN220057225-1A_HKHYCDSX5_L2_2	8456356.0	26663220.0
P_1_57_EKRN220057226-1A_HKHYCDSX5_L2_1	8515916.0	29114421.0
P_1_57_EKRN220057226-1A_HKHYCDSX5_L2_2	9356807.0	28273530.0
P_1_58_EKRN220057227-1A_HKHYCDSX5_L2_1	7197329.0	34388016.0
P_1_58_EKRN220057227-1A_HKHYCDSX5_L2_2	8129937.0	33455408.0
P_1_59_EKRN220057228-1A_HKHYCDSX5_L2_1	7146210.0	30053601.0
P_1_59_EKRN220057228-1A_HKHYCDSX5_L2_2	7771453.0	29428358.0
P_1_5_EKRN220057174-1A_HLN7GDSX5_L4_1	8333035.0	27049678.0
P_1_5_EKRN220057174-1A_HLN7GDSX5_L4_2	14620786.0	20761927.0
P_1_60_EKRN220057229-1A_HKHYCDSX5_L2_1	7636984.0	33672547.0
P_1_60_EKRN220057229-1A_HKHYCDSX5_L2_2	8479485.0	32830046.0
P_1_61_EKRN220057230-1A_HKHYCDSX5_L2_1	7126426.0	33904508.0
P_1_61_EKRN220057230-1A_HKHYCDSX5_L2_2	7920433.0	33110501.0
P_1_62_EKRN220057231-1A_HKHYCDSX5_L2_1	6706138.0	28820924.0
P_1_62_EKRN220057231-1A_HKHYCDSX5_L2_2	7322487.0	28204575.0
P_1_63_EKRN220057232-1A_HKHYCDSX5_L2_1	6663294.0	26059035.0
P_1_63_EKRN220057232-1A_HKHYCDSX5_L2_2	7313971.0	25408358.0
P_1_64_EKRN220057233-1A_HKHYCDSX5_L2_1	7414491.0	30573096.0
P_1_64_EKRN220057233-1A_HKHYCDSX5_L2_2	8257364.0	29730223.0
P_1_65_EKRN220057234-1A_HKHYCDSX5_L2_1	6953795.0	28016974.0
P_1_65_EKRN220057234-1A_HKHYCDSX5_L2_2	7556729.0	27414040.0
P_1_66_1	6985876.0	25051774.0
P_1_66_2	9302635.0	22735015.0
P_1_67_EKRN220057236-1A_HKHYCDSX5_L2_1	6604992.0	28497039.0
P_1_67_EKRN220057236-1A_HKHYCDSX5_L2_2	7399974.0	27702057.0
P_1_68_EKRN220057237-1A_HKHYCDSX5_L2_1	6813733.0	31540664.0
P_1_68_EKRN220057237-1A_HKHYCDSX5_L2_2	7571753.0	30782644.0
P_1_69_EKRN220057238-1A_HKHYCDSX5_L2_1	6536292.0	35310839.0
P_1_69_EKRN220057238-1A_HKHYCDSX5_L2_2	7401185.0	34445946.0
P_1_6_EKRN220057175-1A_H22CWDSX5_L2_1	3655539.0	17014882.0
P_1_6_EKRN220057175-1A_H22CWDSX5_L2_2	3831244.0	16839177.0
P_1_70_EKRN220057239-1A_HKHYCDSX5_L2_1	6500553.0	27433578.0
P_1_70_EKRN220057239-1A_HKHYCDSX5_L2_2	7558791.0	26375340.0
P_1_71_EKRN220057240-1A_HKHYCDSX5_L2_1	5775646.0	43161336.0
P_1_71_EKRN220057240-1A_HKHYCDSX5_L2_2	6670318.0	42266664.0
P_1_72_EKRN220057241-1A_HKHYCDSX5_L2_1	4322615.0	36082215.0
P_1_72_EKRN220057241-1A_HKHYCDSX5_L2_2	5255652.0	35149178.0
P_1_73_EKRN220057242-1A_HKHYCDSX5_L2_1	6644487.0	29581679.0
P_1_73_EKRN220057242-1A_HKHYCDSX5_L2_2	7384953.0	28841213.0
P_1_74_EKRN220057243-1A_HKHYCDSX5_L2_1	5928267.0	31059137.0
P_1_74_EKRN220057243-1A_HKHYCDSX5_L2_2	6671270.0	30316134.0
P_1_75_EKRN220057244-1A_HKHYCDSX5_L2_1	6462071.0	29285033.0
P_1_75_EKRN220057244-1A_HKHYCDSX5_L2_2	7176040.0	28571064.0
P_1_76_EKRN220057245-1A_HKHYCDSX5_L2_1	6090787.0	28654128.0
P_1_76_EKRN220057245-1A_HKHYCDSX5_L2_2	6635864.0	28109051.0
P_1_77_EKRN220057246-1A_HKHYCDSX5_L2_1	5958897.0	25513610.0
P_1_77_EKRN220057246-1A_HKHYCDSX5_L2_2	6568946.0	24903561.0
P_1_78_EKRN220057247-1A_HKHYCDSX5_L2_1	6028961.0	25541489.0
P_1_78_EKRN220057247-1A_HKHYCDSX5_L2_2	6508551.0	25061899.0
P_1_79_EKRN220057248-1A_HKHYCDSX5_L2_1	5719431.0	31376040.0
P_1_79_EKRN220057248-1A_HKHYCDSX5_L2_2	6317580.0	30777891.0
P_1_7_EKRN220057176-1A_HLTJ3DSX5_L4_1	5819530.0	26584051.0
P_1_7_EKRN220057176-1A_HLTJ3DSX5_L4_2	6455374.0	25948207.0
P_1_80_EKRN220057249-1A_HKHYCDSX5_L2_1	4858272.0	29972774.0
P_1_80_EKRN220057249-1A_HKHYCDSX5_L2_2	5701624.0	29129422.0
P_1_81_EKRN220057250-1A_HKHYCDSX5_L2_1	5109151.0	33933951.0
P_1_81_EKRN220057250-1A_HKHYCDSX5_L2_2	5634446.0	33408656.0
P_1_82_EKRN220057251-1A_HKHYCDSX5_L2_1	5651459.0	31097870.0
P_1_82_EKRN220057251-1A_HKHYCDSX5_L2_2	6337768.0	30411561.0
P_1_83_EKRN220057252-1A_HKHYCDSX5_L2_1	5340441.0	30831534.0
P_1_83_EKRN220057252-1A_HKHYCDSX5_L2_2	5966739.0	30205236.0
P_1_84_EKRN220057253-1A_HKHYCDSX5_L2_1	5469947.0	33506972.0
P_1_84_EKRN220057253-1A_HKHYCDSX5_L2_2	6053537.0	32923382.0
P_1_85_EKRN220057254-1A_HKHYCDSX5_L2_1	6939495.0	29952167.0
P_1_85_EKRN220057254-1A_HKHYCDSX5_L2_2	7461320.0	29430342.0
P_1_86_EKRN220057255-1A_HKHYCDSX5_L2_1	7161308.0	28868730.0
P_1_86_EKRN220057255-1A_HKHYCDSX5_L2_2	7965396.0	28064642.0
P_1_87_EKRN220057256-1A_HKHYCDSX5_L2_1	5680628.0	24133398.0
P_1_87_EKRN220057256-1A_HKHYCDSX5_L2_2	6388784.0	23425242.0
P_1_88_EKRN220057257-1A_HKHYCDSX5_L2_1	6129380.0	29301170.0
P_1_88_EKRN220057257-1A_HKHYCDSX5_L2_2	6729984.0	28700566.0
P_1_89_EKRN220057258-1A_HKHYCDSX5_L2_1	3810484.0	34167582.0
P_1_89_EKRN220057258-1A_HKHYCDSX5_L2_2	4261565.0	33716501.0
P_1_8_EKRN220057177-1A_HLTJ3DSX5_L3_1	2259628.0	27992404.0
P_1_8_EKRN220057177-1A_HLTJ3DSX5_L3_2	2743980.0	27508052.0
P_1_90_EKRN220057259-1A_HKHYCDSX5_L2_1	3002981.0	29552518.0
P_1_90_EKRN220057259-1A_HKHYCDSX5_L2_2	3475598.0	29079901.0
P_1_9_1	4498568.0	27268238.0
P_1_9_2	5154013.0	26612793.0
