"","x"
"1","Me1_v2_0157900"
"2","Me1_v2_0062000"
"3","Me1_v2_0060980"
"4","Me1_v2_0194240"
"5","Me1_v2_0170340"
"6","Me1_v2_0196800"
"7","Me1_v2_0176070"
"8","Me1_v2_0200350"
"9","Me1_v2_0122160"
"10","Me1_v2_0086800"
"11","Me1_v2_0112750"
"12","Me1_v2_0091260"
"13","Me1_v2_0054410"
"14","Me1_v2_0159730"
"15","Me1_v2_0151540"
"16","Me1_v2_0132950"
"17","Me1_v2_0190910"
"18","Me1_v2_0066320"
"19","Me1_v2_0160160"
"20","Me1_v2_0201190"
