	25.0	26.0	27.0	28.0	29.0	30.0	31.0	32.0	33.0	34.0	35.0	36.0	37.0
M_1_10_1	8.0	120.0	993.0	5802.0	24218.0	72491.0	175678.0	345424.0	611683.0	1051660.0	2434322.0	27565048.0	5044471.0
	23.0	24.0	25.0	26.0	27.0	28.0	29.0	30.0	31.0	32.0	33.0	34.0	35.0	36.0	37.0
M_1_10_2	1.0	16.0	149.0	1260.0	6598.0	21920.0	57596.0	126028.0	252558.0	476571.0	925918.0	2070134.0	7337041.0	25178739.0	877389.0
	25.0	26.0	27.0	28.0	29.0	30.0	31.0	32.0	33.0	34.0	35.0	36.0	37.0
M_1_11_1	10.0	136.0	1198.0	6812.0	27908.0	81369.0	194476.0	376591.0	659869.0	1125197.0	2574899.0	29670685.0	5614807.0
	23.0	24.0	25.0	26.0	27.0	28.0	29.0	30.0	31.0	32.0	33.0	34.0	35.0	36.0	37.0
M_1_11_2	3.0	13.0	199.0	1508.0	7728.0	25567.0	66818.0	142844.0	285110.0	533666.0	1025179.0	2286345.0	8055270.0	26957939.0	945768.0
	25.0	26.0	27.0	28.0	29.0	30.0	31.0	32.0	33.0	34.0	35.0	36.0	37.0
M_1_12_1	17.0	207.0	1776.0	10027.0	40607.0	115641.0	261805.0	479908.0	795764.0	1276167.0	2550354.0	26539439.0	4899838.0
	23.0	24.0	25.0	26.0	27.0	28.0	29.0	30.0	31.0	32.0	33.0	34.0	35.0	36.0	37.0
M_1_12_2	1.0	14.0	115.0	922.0	4750.0	16399.0	46315.0	105926.0	220018.0	407488.0	734213.0	1398245.0	4120205.0	27135907.0	2781032.0
	25.0	26.0	27.0	28.0	29.0	30.0	31.0	32.0	33.0	34.0	35.0	36.0	37.0
M_1_13_1	7.0	183.0	1762.0	10145.0	40866.0	120671.0	276663.0	513148.0	852109.0	1368871.0	2756254.0	28795377.0	5339246.0
	22.0	23.0	24.0	25.0	26.0	27.0	28.0	29.0	30.0	31.0	32.0	33.0	34.0	35.0	36.0	37.0
M_1_13_2	1.0	1.0	13.0	145.0	1036.0	5104.0	17671.0	49961.0	114915.0	240918.0	450209.0	816159.0	1565053.0	4651813.0	29385831.0	2776472.0
	25.0	26.0	27.0	28.0	29.0	30.0	31.0	32.0	33.0	34.0	35.0	36.0	37.0
M_1_14_1	10.0	179.0	1729.0	9943.0	40029.0	116557.0	270316.0	520798.0	908630.0	1452695.0	2636070.0	24585965.0	4486185.0
	23.0	24.0	25.0	26.0	27.0	28.0	29.0	30.0	31.0	32.0	33.0	34.0	35.0	36.0	37.0
M_1_14_2	2.0	9.0	96.0	731.0	3614.0	12924.0	37649.0	88348.0	192527.0	386803.0	751953.0	1437580.0	3912989.0	25548881.0	2655000.0
	25.0	26.0	27.0	28.0	29.0	30.0	31.0	32.0	33.0	34.0	35.0	36.0	37.0
M_1_15_1	12.0	134.0	1518.0	8387.0	34045.0	99241.0	223116.0	398086.0	642923.0	1010814.0	2017449.0	21569914.0	4227014.0
	23.0	24.0	25.0	26.0	27.0	28.0	29.0	30.0	31.0	32.0	33.0	34.0	35.0	36.0	37.0
M_1_15_2	1.0	11.0	82.0	536.0	2796.0	9606.0	28000.0	66397.0	141461.0	270838.0	498622.0	956695.0	2818346.0	22577206.0	2862056.0
	25.0	26.0	27.0	28.0	29.0	30.0	31.0	32.0	33.0	34.0	35.0	36.0	37.0
M_1_16_1	4.0	140.0	1114.0	6124.0	26176.0	78668.0	189722.0	370742.0	656925.0	1313525.0	3717908.0	26938771.0	4657216.0
	24.0	25.0	26.0	27.0	28.0	29.0	30.0	31.0	32.0	33.0	34.0	35.0	36.0	37.0
M_1_16_2	18.0	158.0	1230.0	6041.0	20302.0	54932.0	118487.0	241704.0	462156.0	916471.0	2229218.0	7667269.0	25332980.0	906069.0
	25.0	26.0	27.0	28.0	29.0	30.0	31.0	32.0	33.0	34.0	35.0	36.0	37.0
M_1_17_1	10.0	129.0	1501.0	8255.0	34944.0	101754.0	237945.0	441174.0	736865.0	1227599.0	2649514.0	24526323.0	4380847.0
	23.0	24.0	25.0	26.0	27.0	28.0	29.0	30.0	31.0	32.0	33.0	34.0	35.0	36.0	37.0
M_1_17_2	1.0	9.0	122.0	841.0	4323.0	15299.0	43023.0	99270.0	209415.0	388834.0	712088.0	1401865.0	4120608.0	25096754.0	2254408.0
	25.0	26.0	27.0	28.0	29.0	30.0	31.0	32.0	33.0	34.0	35.0	36.0	37.0
M_1_18_1	12.0	159.0	1593.0	9282.0	37911.0	110454.0	255285.0	472657.0	785855.0	1295576.0	2749772.0	26657276.0	4994341.0
	23.0	24.0	25.0	26.0	27.0	28.0	29.0	30.0	31.0	32.0	33.0	34.0	35.0	36.0	37.0
M_1_18_2	1.0	8.0	123.0	900.0	4629.0	16309.0	46694.0	108860.0	228099.0	425547.0	774637.0	1524528.0	4634771.0	27146330.0	2458737.0
	25.0	26.0	27.0	28.0	29.0	30.0	31.0	32.0	33.0	34.0	35.0	36.0	37.0
M_1_19_1	8.0	189.0	1863.0	10500.0	42150.0	118609.0	269405.0	493468.0	819550.0	1354307.0	2932924.0	25334358.0	3818060.0
	24.0	25.0	26.0	27.0	28.0	29.0	30.0	31.0	32.0	33.0	34.0	35.0	36.0	37.0
M_1_19_2	8.0	125.0	737.0	3833.0	13329.0	38502.0	90016.0	194162.0	371985.0	702509.0	1420050.0	4219693.0	25539614.0	2600828.0
	24.0	25.0	26.0	27.0	28.0	29.0	30.0	31.0	32.0	33.0	34.0	35.0	36.0	37.0
M_1_1_1	3.0	28.0	344.0	2660.0	13674.0	52804.0	148136.0	329918.0	595582.0	972858.0	1527830.0	3036989.0	26505659.0	4742093.0
	23.0	24.0	25.0	26.0	27.0	28.0	29.0	30.0	31.0	32.0	33.0	34.0	35.0	36.0	37.0
M_1_1_2	1.0	12.0	158.0	893.0	4676.0	15785.0	45427.0	106702.0	224005.0	421299.0	766387.0	1484841.0	4568829.0	27836951.0	2452612.0
	25.0	26.0	27.0	28.0	29.0	30.0	31.0	32.0	33.0	34.0	35.0	36.0	37.0
M_1_20_1	13.0	198.0	1784.0	10226.0	40879.0	116741.0	264858.0	480146.0	786153.0	1258618.0	2587915.0	26936220.0	4873386.0
	24.0	25.0	26.0	27.0	28.0	29.0	30.0	31.0	32.0	33.0	34.0	35.0	36.0	37.0
M_1_20_2	11.0	153.0	1044.0	5103.0	17559.0	48992.0	112060.0	230602.0	426436.0	767291.0	1478541.0	4464463.0	27235718.0	2569164.0
	24.0	25.0	26.0	27.0	28.0	29.0	30.0	31.0	32.0	33.0	34.0	35.0	36.0	37.0
M_1_21_1	2.0	49.0	466.0	3291.0	17766.0	68979.0	194059.0	434319.0	786122.0	1287517.0	2078475.0	4292542.0	36969362.0	6568803.0
	24.0	25.0	26.0	27.0	28.0	29.0	30.0	31.0	32.0	33.0	34.0	35.0	36.0	37.0
M_1_21_2	21.0	216.0	1571.0	8115.0	27664.0	77476.0	177977.0	366568.0	661721.0	1170249.0	2252507.0	6989938.0	38001347.0	2966382.0
	24.0	25.0	26.0	27.0	28.0	29.0	30.0	31.0	32.0	33.0	34.0	35.0	36.0	37.0
M_1_22_1	3.0	25.0	407.0	2723.0	14539.0	57710.0	165003.0	375599.0	682984.0	1117139.0	1783405.0	3734290.0	32300581.0	5716334.0
	23.0	24.0	25.0	26.0	27.0	28.0	29.0	30.0	31.0	32.0	33.0	34.0	35.0	36.0	37.0
M_1_22_2	1.0	20.0	211.0	1420.0	6902.0	24027.0	68017.0	155458.0	321298.0	586921.0	1038076.0	1997569.0	6105301.0	33062073.0	2583448.0
	24.0	25.0	26.0	27.0	28.0	29.0	30.0	31.0	32.0	33.0	34.0	35.0	36.0	37.0
M_1_23_1	2.0	37.0	445.0	3439.0	17175.0	66777.0	185531.0	410581.0	730992.0	1182049.0	1884361.0	3873004.0	33374220.0	5929669.0
	23.0	24.0	25.0	26.0	27.0	28.0	29.0	30.0	31.0	32.0	33.0	34.0	35.0	36.0	37.0
M_1_23_2	2.0	14.0	173.0	1211.0	6170.0	21576.0	61849.0	143933.0	298860.0	549673.0	982173.0	1893702.0	5881073.0	34839787.0	2978086.0
	25.0	26.0	27.0	28.0	29.0	30.0	31.0	32.0	33.0	34.0	35.0	36.0	37.0
M_1_24_1	15.0	173.0	1698.0	10011.0	39492.0	111742.0	249691.0	450896.0	736160.0	1176623.0	2389332.0	24987780.0	4686508.0
	23.0	24.0	25.0	26.0	27.0	28.0	29.0	30.0	31.0	32.0	33.0	34.0	35.0	36.0	37.0
M_1_24_2	1.0	11.0	101.0	785.0	3893.0	13904.0	39423.0	91582.0	191491.0	355904.0	642227.0	1219479.0	3549428.0	25780116.0	2951776.0
	24.0	25.0	26.0	27.0	28.0	29.0	30.0	31.0	32.0	33.0	34.0	35.0	36.0	37.0
M_1_25_1	2.0	38.0	345.0	2871.0	14603.0	57739.0	165435.0	374854.0	678967.0	1110842.0	1787448.0	3721025.0	32133841.0	5613153.0
	23.0	24.0	25.0	26.0	27.0	28.0	29.0	30.0	31.0	32.0	33.0	34.0	35.0	36.0	37.0
M_1_25_2	1.0	17.0	203.0	1496.0	7215.0	24544.0	69058.0	159137.0	325758.0	592181.0	1049045.0	2054734.0	6502653.0	32547281.0	2327840.0
	25.0	26.0	27.0	28.0	29.0	30.0	31.0	32.0	33.0	34.0	35.0	36.0	37.0
M_1_26_1	12.0	167.0	1656.0	9188.0	37967.0	108284.0	243687.0	435054.0	702633.0	1112001.0	2284152.0	24443931.0	4350135.0
	24.0	25.0	26.0	27.0	28.0	29.0	30.0	31.0	32.0	33.0	34.0	35.0	36.0	37.0
M_1_26_2	12.0	114.0	796.0	4075.0	14540.0	40694.0	94286.0	197100.0	362756.0	653704.0	1264045.0	3863992.0	24779337.0	2453416.0
	25.0	26.0	27.0	28.0	29.0	30.0	31.0	32.0	33.0	34.0	35.0	36.0	37.0
M_1_27_1	11.0	170.0	1495.0	8481.0	33824.0	99243.0	226024.0	409711.0	668281.0	1064324.0	2178791.0	22928502.0	4237295.0
	23.0	24.0	25.0	26.0	27.0	28.0	29.0	30.0	31.0	32.0	33.0	34.0	35.0	36.0	37.0
M_1_27_2	1.0	12.0	104.0	731.0	3795.0	12910.0	37556.0	87093.0	182771.0	342625.0	617630.0	1195211.0	3620335.0	23449388.0	2305990.0
	25.0	26.0	27.0	28.0	29.0	30.0	31.0	32.0	33.0	34.0	35.0	36.0	37.0
M_1_28_1	10.0	165.0	1511.0	8796.0	36585.0	108991.0	252911.0	464414.0	766088.0	1243414.0	2577914.0	25308833.0	4352126.0
	24.0	25.0	26.0	27.0	28.0	29.0	30.0	31.0	32.0	33.0	34.0	35.0	36.0	37.0
M_1_28_2	24.0	109.0	1030.0	4875.0	16808.0	47968.0	109732.0	226936.0	420089.0	757417.0	1466104.0	4466056.0	25510611.0	2093999.0
	24.0	25.0	26.0	27.0	28.0	29.0	30.0	31.0	32.0	33.0	34.0	35.0	36.0	37.0
M_1_29_1	1.0	9.0	152.0	1539.0	9300.0	38740.0	114473.0	269182.0	501968.0	840448.0	1371904.0	2848609.0	27840288.0	4817440.0
	23.0	24.0	25.0	26.0	27.0	28.0	29.0	30.0	31.0	32.0	33.0	34.0	35.0	36.0	37.0
M_1_29_2	4.0	21.0	232.0	1613.0	7592.0	25851.0	71215.0	157371.0	314812.0	568091.0	1014228.0	2001800.0	6114066.0	26584118.0	1793039.0
	25.0	26.0	27.0	28.0	29.0	30.0	31.0	32.0	33.0	34.0	35.0	36.0	37.0
M_1_2_1	18.0	120.0	1035.0	5559.0	22825.0	66791.0	156894.0	300604.0	521218.0	887506.0	2046208.0	23679050.0	4641042.0
	23.0	24.0	25.0	26.0	27.0	28.0	29.0	30.0	31.0	32.0	33.0	34.0	35.0	36.0	37.0
M_1_2_2	3.0	12.0	134.0	1168.0	5708.0	19132.0	50549.0	109545.0	220416.0	413456.0	796431.0	1780605.0	6283225.0	21827061.0	821425.0
	24.0	25.0	26.0	27.0	28.0	29.0	30.0	31.0	32.0	33.0	34.0	35.0	36.0	37.0
M_1_30_1	1.0	20.0	184.0	1782.0	10249.0	42379.0	123900.0	290356.0	546777.0	928341.0	1495039.0	2927461.0	26707275.0	4874416.0
	23.0	24.0	25.0	26.0	27.0	28.0	29.0	30.0	31.0	32.0	33.0	34.0	35.0	36.0	37.0
M_1_30_2	1.0	19.0	183.0	1113.0	5361.0	18339.0	51034.0	116346.0	243710.0	460501.0	853892.0	1613864.0	4514766.0	27510644.0	2558407.0
	25.0	26.0	27.0	28.0	29.0	30.0	31.0	32.0	33.0	34.0	35.0	36.0	37.0
M_1_31_1	15.0	190.0	1642.0	9715.0	40171.0	119729.0	280497.0	526595.0	892964.0	1518086.0	3256653.0	29072893.0	4865184.0
	24.0	25.0	26.0	27.0	28.0	29.0	30.0	31.0	32.0	33.0	34.0	35.0	36.0	37.0
M_1_31_2	17.0	153.0	1122.0	5475.0	19624.0	55849.0	129587.0	272255.0	512007.0	947533.0	1901843.0	5691014.0	28774170.0	2273685.0
	25.0	26.0	27.0	28.0	29.0	30.0	31.0	32.0	33.0	34.0	35.0	36.0	37.0
M_1_32_1	10.0	135.0	1401.0	8007.0	32419.0	92527.0	212522.0	384070.0	625668.0	999036.0	2060798.0	21098932.0	3701206.0
	24.0	25.0	26.0	27.0	28.0	29.0	30.0	31.0	32.0	33.0	34.0	35.0	36.0	37.0
M_1_32_2	9.0	106.0	719.0	3659.0	12613.0	36432.0	83262.0	174627.0	324185.0	586804.0	1131504.0	3428390.0	21418330.0	2016091.0
	24.0	25.0	26.0	27.0	28.0	29.0	30.0	31.0	32.0	33.0	34.0	35.0	36.0	37.0
M_1_33_1	1.0	19.0	153.0	1373.0	8011.0	33299.0	97007.0	224479.0	410903.0	678842.0	1095717.0	2287497.0	22756819.0	3934648.0
	24.0	25.0	26.0	27.0	28.0	29.0	30.0	31.0	32.0	33.0	34.0	35.0	36.0	37.0
M_1_33_2	5.0	101.0	677.0	3543.0	12454.0	35523.0	82849.0	176182.0	332303.0	611387.0	1211288.0	3773695.0	23136104.0	2152657.0
	25.0	26.0	27.0	28.0	29.0	30.0	31.0	32.0	33.0	34.0	35.0	36.0	37.0
M_1_34_1	11.0	213.0	1941.0	10463.0	44603.0	131222.0	305649.0	568197.0	956524.0	1584046.0	3307117.0	24000713.0	4535749.0
	23.0	24.0	25.0	26.0	27.0	28.0	29.0	30.0	31.0	32.0	33.0	34.0	35.0	36.0	37.0
M_1_34_2	1.0	15.0	184.0	1260.0	6770.0	24093.0	68093.0	160475.0	338569.0	637203.0	1172056.0	2278158.0	6187395.0	23025908.0	1546268.0
	25.0	26.0	27.0	28.0	29.0	30.0	31.0	32.0	33.0	34.0	35.0	36.0	37.0
M_1_35_1	15.0	190.0	1882.0	10553.0	42069.0	121362.0	275337.0	498061.0	815170.0	1301152.0	2650283.0	26165423.0	4735798.0
	23.0	24.0	25.0	26.0	27.0	28.0	29.0	30.0	31.0	32.0	33.0	34.0	35.0	36.0	37.0
M_1_35_2	1.0	15.0	134.0	788.0	4080.0	14253.0	41160.0	95539.0	202245.0	379855.0	691627.0	1323566.0	3833517.0	26921792.0	3108723.0
	25.0	26.0	27.0	28.0	29.0	30.0	31.0	32.0	33.0	34.0	35.0	36.0	37.0
M_1_36_1	11.0	161.0	1332.0	7957.0	32426.0	94798.0	221342.0	416251.0	704437.0	1144047.0	2309283.0	22620286.0	4114574.0
	24.0	25.0	26.0	27.0	28.0	29.0	30.0	31.0	32.0	33.0	34.0	35.0	36.0	37.0
M_1_36_2	7.0	121.0	771.0	4158.0	14549.0	41412.0	94892.0	199093.0	373951.0	682816.0	1311676.0	3835068.0	23039189.0	2069202.0
	25.0	26.0	27.0	28.0	29.0	30.0	31.0	32.0	33.0	34.0	35.0	36.0	37.0
M_1_37_1	7.0	151.0	1193.0	6743.0	28409.0	84244.0	197926.0	366109.0	610538.0	997164.0	2062655.0	21680269.0	3897014.0
	24.0	25.0	26.0	27.0	28.0	29.0	30.0	31.0	32.0	33.0	34.0	35.0	36.0	37.0
M_1_37_2	8.0	116.0	728.0	3786.0	13161.0	37320.0	86722.0	181952.0	336528.0	608826.0	1174352.0	3544291.0	21942339.0	2002293.0
	25.0	26.0	27.0	28.0	29.0	30.0	31.0	32.0	33.0	34.0	35.0	36.0	37.0
M_1_38_1	3.0	167.0	1455.0	8690.0	36786.0	109357.0	253972.0	463401.0	758190.0	1211501.0	2475522.0	26320954.0	4873867.0
	24.0	25.0	26.0	27.0	28.0	29.0	30.0	31.0	32.0	33.0	34.0	35.0	36.0	37.0
M_1_38_2	10.0	116.0	772.0	3944.0	14157.0	40825.0	95314.0	202821.0	380470.0	695864.0	1353513.0	4129426.0	26874681.0	2721952.0
	24.0	25.0	26.0	27.0	28.0	29.0	30.0	31.0	32.0	33.0	34.0	35.0	36.0	37.0
M_1_39_1	2.0	14.0	126.0	1282.0	7834.0	32727.0	98097.0	230839.0	430863.0	711159.0	1142223.0	2350887.0	24578499.0	4540898.0
	23.0	24.0	25.0	26.0	27.0	28.0	29.0	30.0	31.0	32.0	33.0	34.0	35.0	36.0	37.0
M_1_39_2	1.0	8.0	139.0	902.0	4581.0	16394.0	46525.0	107959.0	225243.0	416393.0	750919.0	1465442.0	4563989.0	24564729.0	1962226.0
	24.0	25.0	26.0	27.0	28.0	29.0	30.0	31.0	32.0	33.0	34.0	35.0	36.0	37.0
M_1_3_1	2.0	40.0	329.0	2788.0	14257.0	56232.0	158908.0	358650.0	650866.0	1063628.0	1704904.0	3528858.0	30739465.0	5407716.0
	24.0	25.0	26.0	27.0	28.0	29.0	30.0	31.0	32.0	33.0	34.0	35.0	36.0	37.0
M_1_3_2	10.0	182.0	1336.0	6625.0	23658.0	67231.0	153724.0	315620.0	569760.0	1007933.0	1946003.0	6012145.0	31231833.0	2350583.0
	25.0	26.0	27.0	28.0	29.0	30.0	31.0	32.0	33.0	34.0	35.0	36.0	37.0
M_1_40_1	11.0	159.0	1291.0	7746.0	33240.0	100431.0	239971.0	455508.0	774559.0	1264838.0	2652360.0	24052409.0	4004134.0
	24.0	25.0	26.0	27.0	28.0	29.0	30.0	31.0	32.0	33.0	34.0	35.0	36.0	37.0
M_1_40_2	12.0	166.0	1065.0	5473.0	18611.0	51869.0	118116.0	244140.0	455989.0	843698.0	1655927.0	4842813.0	23568485.0	1780293.0
	25.0	26.0	27.0	28.0	29.0	30.0	31.0	32.0	33.0	34.0	35.0	36.0	37.0
M_1_41_1	14.0	192.0	1701.0	9622.0	41111.0	125624.0	314181.0	636682.0	1137205.0	1831438.0	3433504.0	21276522.0	3888047.0
	23.0	24.0	25.0	26.0	27.0	28.0	29.0	30.0	31.0	32.0	33.0	34.0	35.0	36.0	37.0
M_1_41_2	1.0	10.0	128.0	903.0	4692.0	16530.0	49134.0	120137.0	271249.0	555367.0	1089646.0	2085717.0	5103630.0	21605544.0	1793155.0
	24.0	25.0	26.0	27.0	28.0	29.0	30.0	31.0	32.0	33.0	34.0	35.0	36.0	37.0
M_1_42_1	1.0	20.0	240.0	2070.0	11772.0	50183.0	150083.0	359724.0	708063.0	1239745.0	1996216.0	3786882.0	24478936.0	4936245.0
	23.0	24.0	25.0	26.0	27.0	28.0	29.0	30.0	31.0	32.0	33.0	34.0	35.0	36.0	37.0
M_1_42_2	2.0	25.0	215.0	1500.0	7836.0	26848.0	76573.0	178651.0	385627.0	747800.0	1386996.0	2574364.0	6424753.0	24277514.0	1631476.0
	25.0	26.0	27.0	28.0	29.0	30.0	31.0	32.0	33.0	34.0	35.0	36.0	37.0
M_1_43_1	21.0	267.0	2222.0	12683.0	52275.0	152891.0	357402.0	674569.0	1147517.0	1874396.0	3663827.0	25912047.0	5381498.0
	24.0	25.0	26.0	27.0	28.0	29.0	30.0	31.0	32.0	33.0	34.0	35.0	36.0	37.0
M_1_43_2	8.0	180.0	1218.0	6287.0	22509.0	65982.0	156183.0	338070.0	652418.0	1220400.0	2345996.0	6162898.0	26259369.0	2000097.0
	24.0	25.0	26.0	27.0	28.0	29.0	30.0	31.0	32.0	33.0	34.0	35.0	36.0	37.0
M_1_44_1	1.0	35.0	399.0	2822.0	14890.0	58098.0	165773.0	388473.0	747126.0	1295626.0	2054933.0	3709117.0	27682830.0	4878646.0
	24.0	25.0	26.0	27.0	28.0	29.0	30.0	31.0	32.0	33.0	34.0	35.0	36.0	37.0
M_1_44_2	8.0	184.0	1368.0	6788.0	23008.0	64912.0	149334.0	317850.0	610187.0	1140000.0	2198300.0	6255748.0	28243780.0	1987302.0
	24.0	25.0	26.0	27.0	28.0	29.0	30.0	31.0	32.0	33.0	34.0	35.0	36.0	37.0
M_1_45_1	4.0	24.0	294.0	2525.0	13190.0	51856.0	149583.0	353163.0	681715.0	1177387.0	1856634.0	3456994.0	26383624.0	4344368.0
	23.0	24.0	25.0	26.0	27.0	28.0	29.0	30.0	31.0	32.0	33.0	34.0	35.0	36.0	37.0
M_1_45_2	1.0	17.0	204.0	1387.0	6745.0	23300.0	64924.0	148021.0	308549.0	581738.0	1066404.0	2052987.0	6035010.0	26461362.0	1720712.0
	24.0	25.0	26.0	27.0	28.0	29.0	30.0	31.0	32.0	33.0	34.0	35.0	36.0	37.0
M_1_46_1	1.0	15.0	176.0	1603.0	9333.0	39420.0	118910.0	282200.0	530498.0	899453.0	1491784.0	3109652.0	22231371.0	4301902.0
	23.0	24.0	25.0	26.0	27.0	28.0	29.0	30.0	31.0	32.0	33.0	34.0	35.0	36.0	37.0
M_1_46_2	1.0	15.0	113.0	898.0	4376.0	15823.0	46424.0	112625.0	246554.0	480097.0	907353.0	1786273.0	4882891.0	22603746.0	1929129.0
	24.0	25.0	26.0	27.0	28.0	29.0	30.0	31.0	32.0	33.0	34.0	35.0	36.0	37.0
M_1_47_1	4.0	33.0	384.0	2786.0	14503.0	57565.0	163348.0	373468.0	690096.0	1155983.0	1852965.0	3694112.0	29069080.0	5162027.0
	23.0	24.0	25.0	26.0	27.0	28.0	29.0	30.0	31.0	32.0	33.0	34.0	35.0	36.0	37.0
M_1_47_2	2.0	20.0	200.0	1294.0	6461.0	22648.0	64209.0	147987.0	306601.0	568333.0	1029430.0	1988108.0	5917807.0	30019220.0	2164034.0
	24.0	25.0	26.0	27.0	28.0	29.0	30.0	31.0	32.0	33.0	34.0	35.0	36.0	37.0
M_1_48_1	2.0	17.0	221.0	2185.0	12528.0	52679.0	157165.0	369933.0	695048.0	1177380.0	1940070.0	3959608.0	28244544.0	5803747.0
	24.0	25.0	26.0	27.0	28.0	29.0	30.0	31.0	32.0	33.0	34.0	35.0	36.0	37.0
M_1_48_2	12.0	160.0	1297.0	6549.0	23608.0	69057.0	164846.0	356179.0	688931.0	1287052.0	2518364.0	6882050.0	28353537.0	2063485.0
	24.0	25.0	26.0	27.0	28.0	29.0	30.0	31.0	32.0	33.0	34.0	35.0	36.0	37.0
M_1_49_1	2.0	12.0	188.0	1897.0	10766.0	45168.0	134704.0	315949.0	592372.0	1002996.0	1680914.0	3454012.0	25381038.0	5262718.0
	23.0	24.0	25.0	26.0	27.0	28.0	29.0	30.0	31.0	32.0	33.0	34.0	35.0	36.0	37.0
M_1_49_2	1.0	12.0	138.0	940.0	4914.0	17478.0	52242.0	127195.0	278943.0	546941.0	1039463.0	2059925.0	5711175.0	25979759.0	2063610.0
	24.0	25.0	26.0	27.0	28.0	29.0	30.0	31.0	32.0	33.0	34.0	35.0	36.0	37.0
M_1_4_1	2.0	10.0	123.0	1215.0	6922.0	29713.0	90701.0	216463.0	409291.0	695967.0	1145142.0	2405186.0	23339771.0	3925695.0
	24.0	25.0	26.0	27.0	28.0	29.0	30.0	31.0	32.0	33.0	34.0	35.0	36.0	37.0
M_1_4_2	10.0	132.0	878.0	4486.0	14987.0	42318.0	98966.0	206219.0	385135.0	713785.0	1439653.0	4508491.0	22953473.0	1897668.0
	25.0	26.0	27.0	28.0	29.0	30.0	31.0	32.0	33.0	34.0	35.0	36.0	37.0
M_1_50_1	17.0	165.0	1520.0	8982.0	37543.0	112802.0	266342.0	503485.0	859646.0	1448572.0	2961104.0	20966315.0	4185662.0
	23.0	24.0	25.0	26.0	27.0	28.0	29.0	30.0	31.0	32.0	33.0	34.0	35.0	36.0	37.0
M_1_50_2	2.0	10.0	117.0	960.0	4984.0	17387.0	50621.0	120198.0	258170.0	501666.0	943474.0	1851875.0	4993365.0	21015086.0	1594240.0
	25.0	26.0	27.0	28.0	29.0	30.0	31.0	32.0	33.0	34.0	35.0	36.0	37.0
M_1_51_1	13.0	178.0	1880.0	10598.0	42995.0	126000.0	289597.0	527651.0	865397.0	1404076.0	3063134.0	25702833.0	4506096.0
	24.0	25.0	26.0	27.0	28.0	29.0	30.0	31.0	32.0	33.0	34.0	35.0	36.0	37.0
M_1_51_2	25.0	257.0	1579.0	7842.0	25499.0	67964.0	146327.0	292113.0	532140.0	986999.0	2083251.0	6600493.0	24432786.0	1363173.0
	24.0	25.0	26.0	27.0	28.0	29.0	30.0	31.0	32.0	33.0	34.0	35.0	36.0	37.0
M_1_52_1	1.0	14.0	209.0	1788.0	10124.0	40608.0	118199.0	270375.0	489226.0	812803.0	1409775.0	3062817.0	23077229.0	3863695.0
	24.0	25.0	26.0	27.0	28.0	29.0	30.0	31.0	32.0	33.0	34.0	35.0	36.0	37.0
M_1_52_2	11.0	184.0	1186.0	5612.0	19256.0	53362.0	118093.0	240849.0	458080.0	902286.0	1918615.0	5701097.0	22430946.0	1307286.0
	25.0	26.0	27.0	28.0	29.0	30.0	31.0	32.0	33.0	34.0	35.0	36.0	37.0
M_1_53_1	11.0	211.0	1751.0	9647.0	39145.0	115184.0	269680.0	502246.0	855049.0	1432908.0	3422833.0	21623966.0	3510901.0
	23.0	24.0	25.0	26.0	27.0	28.0	29.0	30.0	31.0	32.0	33.0	34.0	35.0	36.0	37.0
M_1_53_2	1.0	26.0	230.0	1570.0	7515.0	24443.0	64768.0	140307.0	282982.0	533205.0	1063439.0	2390123.0	6689724.0	19710207.0	874992.0
	25.0	26.0	27.0	28.0	29.0	30.0	31.0	32.0	33.0	34.0	35.0	36.0	37.0
M_1_54_1	11.0	207.0	1869.0	10171.0	41094.0	118334.0	275706.0	516688.0	883287.0	1427535.0	2902285.0	22040792.0	3890141.0
	23.0	24.0	25.0	26.0	27.0	28.0	29.0	30.0	31.0	32.0	33.0	34.0	35.0	36.0	37.0
M_1_54_2	2.0	26.0	194.0	1361.0	6515.0	21799.0	57988.0	125299.0	254733.0	481767.0	921468.0	1902974.0	5740262.0	21367502.0	1226230.0
	25.0	26.0	27.0	28.0	29.0	30.0	31.0	32.0	33.0	34.0	35.0	36.0	37.0
M_1_55_1	18.0	157.0	1827.0	10360.0	43502.0	131215.0	315696.0	610566.0	1058642.0	1716922.0	3406478.0	23518841.0	4568342.0
	23.0	24.0	25.0	26.0	27.0	28.0	29.0	30.0	31.0	32.0	33.0	34.0	35.0	36.0	37.0
M_1_55_2	1.0	17.0	185.0	1386.0	7071.0	25129.0	71260.0	166950.0	355715.0	677810.0	1261331.0	2468469.0	6550144.0	22425091.0	1372007.0
	25.0	26.0	27.0	28.0	29.0	30.0	31.0	32.0	33.0	34.0	35.0	36.0	37.0
M_1_56_1	6.0	185.0	1553.0	9248.0	38150.0	115940.0	275039.0	529757.0	912839.0	1472890.0	2926704.0	19657237.0	3660953.0
	23.0	24.0	25.0	26.0	27.0	28.0	29.0	30.0	31.0	32.0	33.0	34.0	35.0	36.0	37.0
M_1_56_2	2.0	9.0	111.0	761.0	3927.0	13969.0	40656.0	98304.0	216248.0	431478.0	832325.0	1635043.0	4346620.0	20313456.0	1667592.0
	25.0	26.0	27.0	28.0	29.0	30.0	31.0	32.0	33.0	34.0	35.0	36.0	37.0
M_1_57_1	10.0	170.0	1589.0	8883.0	38333.0	114187.0	269102.0	501931.0	844251.0	1401459.0	3108784.0	27534793.0	5454351.0
	23.0	24.0	25.0	26.0	27.0	28.0	29.0	30.0	31.0	32.0	33.0	34.0	35.0	36.0	37.0
M_1_57_2	2.0	15.0	187.0	1192.0	5915.0	20424.0	55443.0	123859.0	255285.0	485906.0	948154.0	1997112.0	6021608.0	27627666.0	1735075.0
	25.0	26.0	27.0	28.0	29.0	30.0	31.0	32.0	33.0	34.0	35.0	36.0	37.0
M_1_58_1	8.0	171.0	1513.0	9150.0	38280.0	115784.0	271807.0	507318.0	855157.0	1448328.0	3161850.0	27453676.0	5082252.0
	24.0	25.0	26.0	27.0	28.0	29.0	30.0	31.0	32.0	33.0	34.0	35.0	36.0	37.0
M_1_58_2	15.0	164.0	1112.0	5181.0	18139.0	49762.0	111612.0	234538.0	447532.0	864563.0	1825392.0	5769409.0	27737610.0	1880265.0
	25.0	26.0	27.0	28.0	29.0	30.0	31.0	32.0	33.0	34.0	35.0	36.0	37.0
M_1_59_1	11.0	112.0	1069.0	6334.0	27271.0	83393.0	204536.0	397277.0	694453.0	1157136.0	2460782.0	24597465.0	4904723.0
	23.0	24.0	25.0	26.0	27.0	28.0	29.0	30.0	31.0	32.0	33.0	34.0	35.0	36.0	37.0
M_1_59_2	2.0	17.0	181.0	1437.0	6925.0	23095.0	61922.0	136480.0	275428.0	515784.0	985584.0	2099462.0	6591246.0	22790478.0	1046521.0
	24.0	25.0	26.0	27.0	28.0	29.0	30.0	31.0	32.0	33.0	34.0	35.0	36.0	37.0
M_1_5_1	1.0	7.0	158.0	1397.0	8202.0	34161.0	98952.0	227738.0	419639.0	698002.0	1121692.0	2258814.0	23308868.0	4168682.0
	23.0	24.0	25.0	26.0	27.0	28.0	29.0	30.0	31.0	32.0	33.0	34.0	35.0	36.0	37.0
M_1_5_2	1.0	10.0	132.0	849.0	3928.0	13963.0	39964.0	92228.0	193243.0	360333.0	654079.0	1245167.0	3641769.0	23677709.0	2422938.0
	25.0	26.0	27.0	28.0	29.0	30.0	31.0	32.0	33.0	34.0	35.0	36.0	37.0
M_1_60_1	7.0	133.0	1343.0	7406.0	31834.0	95562.0	229923.0	442213.0	761835.0	1287662.0	2641218.0	25871802.0	5240408.0
	24.0	25.0	26.0	27.0	28.0	29.0	30.0	31.0	32.0	33.0	34.0	35.0	36.0	37.0
M_1_60_2	18.0	151.0	1128.0	5720.0	19297.0	52072.0	116930.0	240984.0	454057.0	860580.0	1787318.0	5596797.0	25835241.0	1641053.0
	25.0	26.0	27.0	28.0	29.0	30.0	31.0	32.0	33.0	34.0	35.0	36.0	37.0
M_1_61_1	15.0	177.0	1693.0	9880.0	40440.0	119225.0	279867.0	520916.0	886699.0	1465529.0	2947529.0	28010042.0	5891220.0
	24.0	25.0	26.0	27.0	28.0	29.0	30.0	31.0	32.0	33.0	34.0	35.0	36.0	37.0
M_1_61_2	18.0	196.0	1246.0	5859.0	19938.0	54865.0	122272.0	250578.0	475575.0	910557.0	1855377.0	5592935.0	28806888.0	2076928.0
	25.0	26.0	27.0	28.0	29.0	30.0	31.0	32.0	33.0	34.0	35.0	36.0	37.0
M_1_62_1	7.0	133.0	1480.0	8307.0	34603.0	103211.0	245611.0	464985.0	794805.0	1336495.0	2744159.0	27208233.0	5294141.0
	23.0	24.0	25.0	26.0	27.0	28.0	29.0	30.0	31.0	32.0	33.0	34.0	35.0	36.0	37.0
M_1_62_2	1.0	16.0	149.0	1057.0	5339.0	18178.0	49355.0	111242.0	230708.0	440185.0	853597.0	1792993.0	5665540.0	27186280.0	1881530.0
	25.0	26.0	27.0	28.0	29.0	30.0	31.0	32.0	33.0	34.0	35.0	36.0	37.0
M_1_63_1	9.0	127.0	1212.0	7386.0	31304.0	94520.0	223990.0	426006.0	726195.0	1214625.0	2498959.0	25072243.0	5120712.0
	23.0	24.0	25.0	26.0	27.0	28.0	29.0	30.0	31.0	32.0	33.0	34.0	35.0	36.0	37.0
M_1_63_2	1.0	8.0	113.0	941.0	4980.0	16738.0	46611.0	104819.0	215398.0	410715.0	781677.0	1615433.0	5068613.0	25350135.0	1801106.0
	24.0	25.0	26.0	27.0	28.0	29.0	30.0	31.0	32.0	33.0	34.0	35.0	36.0	37.0
M_1_65_1	1.0	8.0	149.0	1312.0	7949.0	34637.0	106797.0	266595.0	530420.0	950738.0	1562792.0	3050303.0	31025819.0	6149205.0
	24.0	25.0	26.0	27.0	28.0	29.0	30.0	31.0	32.0	33.0	34.0	35.0	36.0	37.0
M_1_65_2	19.0	186.0	1355.0	6684.0	22595.0	62130.0	140036.0	295186.0	572971.0	1092882.0	2218008.0	6898631.0	30582601.0	1793441.0
	25.0	26.0	27.0	28.0	29.0	30.0	31.0	32.0	33.0	34.0	35.0	36.0	37.0
M_1_66_1	8.0	196.0	1657.0	9833.0	40479.0	121679.0	291582.0	564786.0	983323.0	1581147.0	2986866.0	28538663.0	5482568.0
	24.0	25.0	26.0	27.0	28.0	29.0	30.0	31.0	32.0	33.0	34.0	35.0	36.0	37.0
M_1_66_2	18.0	152.0	1017.0	5661.0	19233.0	53237.0	121067.0	257647.0	502607.0	967679.0	1958932.0	6079659.0	28818491.0	1817387.0
	25.0	26.0	27.0	28.0	29.0	30.0	31.0	32.0	33.0	34.0	35.0	36.0	37.0
M_1_67_1	8.0	108.0	1235.0	7258.0	32260.0	102899.0	260325.0	521940.0	935708.0	1557881.0	3106289.0	30150829.0	5891839.0
	24.0	25.0	26.0	27.0	28.0	29.0	30.0	31.0	32.0	33.0	34.0	35.0	36.0	37.0
M_1_67_2	21.0	135.0	953.0	4591.0	16108.0	45086.0	104250.0	224484.0	447811.0	880549.0	1831811.0	5823292.0	31008724.0	2180764.0
	24.0	25.0	26.0	27.0	28.0	29.0	30.0	31.0	32.0	33.0	34.0	35.0	36.0	37.0
M_1_68_1	1.0	11.0	149.0	1375.0	7726.0	32822.0	97519.0	228184.0	425793.0	710679.0	1149369.0	2348568.0	23108642.0	4446893.0
	23.0	24.0	25.0	26.0	27.0	28.0	29.0	30.0	31.0	32.0	33.0	34.0	35.0	36.0	37.0
M_1_68_2	1.0	13.0	120.0	852.0	4193.0	13977.0	39034.0	87812.0	182087.0	348684.0	659718.0	1341102.0	4226839.0	23808211.0	1845088.0
	25.0	26.0	27.0	28.0	29.0	30.0	31.0	32.0	33.0	34.0	35.0	36.0	37.0
M_1_69_1	15.0	167.0	1615.0	9427.0	39969.0	119596.0	284846.0	535252.0	904087.0	1465306.0	3023404.0	31763984.0	6032231.0
	23.0	24.0	25.0	26.0	27.0	28.0	29.0	30.0	31.0	32.0	33.0	34.0	35.0	36.0	37.0
M_1_69_2	1.0	10.0	149.0	1184.0	5582.0	19970.0	55294.0	125000.0	260600.0	498074.0	946464.0	1963546.0	6439633.0	31845387.0	2019005.0
	25.0	26.0	27.0	28.0	29.0	30.0	31.0	32.0	33.0	34.0	35.0	36.0	37.0
M_1_6_1	8.0	131.0	1320.0	7581.0	30994.0	90168.0	208728.0	390209.0	661277.0	1067959.0	2114350.0	21412941.0	4024486.0
	23.0	24.0	25.0	26.0	27.0	28.0	29.0	30.0	31.0	32.0	33.0	34.0	35.0	36.0	37.0
M_1_6_2	2.0	16.0	154.0	1063.0	5513.0	18899.0	51760.0	116691.0	236125.0	430785.0	768172.0	1497894.0	4545422.0	20876046.0	1461610.0
	25.0	26.0	27.0	28.0	29.0	30.0	31.0	32.0	33.0	34.0	35.0	36.0	37.0
M_1_70_1	8.0	118.0	1108.0	6287.0	27372.0	84826.0	206736.0	406278.0	708464.0	1167992.0	2364656.0	24072691.0	4616466.0
	24.0	25.0	26.0	27.0	28.0	29.0	30.0	31.0	32.0	33.0	34.0	35.0	36.0	37.0
M_1_70_2	13.0	140.0	893.0	4622.0	15432.0	43365.0	98337.0	204552.0	395237.0	757113.0	1561479.0	4981523.0	24095446.0	1504850.0
	25.0	26.0	27.0	28.0	29.0	30.0	31.0	32.0	33.0	34.0	35.0	36.0	37.0
M_1_71_1	10.0	164.0	1366.0	7950.0	33811.0	103017.0	248812.0	479091.0	831383.0	1376794.0	2834658.0	29386209.0	5854829.0
	23.0	24.0	25.0	26.0	27.0	28.0	29.0	30.0	31.0	32.0	33.0	34.0	35.0	36.0	37.0
M_1_71_2	2.0	24.0	254.0	1677.0	8293.0	28009.0	75692.0	166550.0	337471.0	631054.0	1196251.0	2573086.0	8210601.0	26785384.0	1143746.0
	24.0	25.0	26.0	27.0	28.0	29.0	30.0	31.0	32.0	33.0	34.0	35.0	36.0	37.0
M_1_72_1	1.0	10.0	164.0	1571.0	8871.0	37442.0	112372.0	273193.0	529987.0	926479.0	1517891.0	2991771.0	29829319.0	6204077.0
	23.0	24.0	25.0	26.0	27.0	28.0	29.0	30.0	31.0	32.0	33.0	34.0	35.0	36.0	37.0
M_1_72_2	2.0	15.0	156.0	1131.0	5634.0	19600.0	54052.0	121909.0	257045.0	499699.0	963349.0	1974808.0	6188859.0	30303937.0	2042952.0
	25.0	26.0	27.0	28.0	29.0	30.0	31.0	32.0	33.0	34.0	35.0	36.0	37.0
M_1_73_1	10.0	176.0	1497.0	8903.0	37291.0	114389.0	277957.0	542804.0	950529.0	1578205.0	3221699.0	32520324.0	6471479.0
	23.0	24.0	25.0	26.0	27.0	28.0	29.0	30.0	31.0	32.0	33.0	34.0	35.0	36.0	37.0
M_1_73_2	1.0	18.0	194.0	1290.0	6556.0	22581.0	62530.0	139642.0	290995.0	556134.0	1064549.0	2219835.0	7177636.0	32257786.0	1925516.0
	25.0	26.0	27.0	28.0	29.0	30.0	31.0	32.0	33.0	34.0	35.0	36.0	37.0
M_1_74_1	12.0	183.0	1750.0	9977.0	40642.0	119547.0	280456.0	534954.0	919409.0	1487822.0	2901392.0	28935528.0	5774443.0
	23.0	24.0	25.0	26.0	27.0	28.0	29.0	30.0	31.0	32.0	33.0	34.0	35.0	36.0	37.0
M_1_74_2	1.0	14.0	140.0	1060.0	5336.0	18133.0	49361.0	111734.0	235246.0	453112.0	867146.0	1743361.0	5414212.0	29886935.0	2220324.0
	25.0	26.0	27.0	28.0	29.0	30.0	31.0	32.0	33.0	34.0	35.0	36.0	37.0
M_1_75_1	11.0	181.0	1602.0	9262.0	39778.0	119326.0	287136.0	553624.0	977239.0	1612240.0	3130628.0	28054525.0	5041419.0
	23.0	24.0	25.0	26.0	27.0	28.0	29.0	30.0	31.0	32.0	33.0	34.0	35.0	36.0	37.0
M_1_75_2	1.0	12.0	117.0	784.0	3826.0	13096.0	36959.0	85546.0	185559.0	375657.0	756080.0	1565747.0	4862983.0	29510007.0	2430597.0
	24.0	25.0	26.0	27.0	28.0	29.0	30.0	31.0	32.0	33.0	34.0	35.0	36.0	37.0
M_1_76_1	1.0	7.0	126.0	1382.0	7799.0	33347.0	103494.0	245850.0	463090.0	777499.0	1272041.0	2665340.0	26600892.0	4744573.0
	23.0	24.0	25.0	26.0	27.0	28.0	29.0	30.0	31.0	32.0	33.0	34.0	35.0	36.0	37.0
M_1_76_2	1.0	11.0	138.0	965.0	4651.0	15970.0	44489.0	100848.0	209692.0	401413.0	761033.0	1576300.0	5094252.0	26845970.0	1859708.0
	25.0	26.0	27.0	28.0	29.0	30.0	31.0	32.0	33.0	34.0	35.0	36.0	37.0
M_1_77_1	11.0	174.0	1727.0	10195.0	41994.0	125028.0	290941.0	538585.0	894916.0	1454930.0	3042445.0	31740550.0	6441612.0
	24.0	25.0	26.0	27.0	28.0	29.0	30.0	31.0	32.0	33.0	34.0	35.0	36.0	37.0
M_1_77_2	9.0	138.0	1062.0	5401.0	18184.0	51324.0	115554.0	241032.0	459456.0	870558.0	1796271.0	5837471.0	32781240.0	2405408.0
	25.0	26.0	27.0	28.0	29.0	30.0	31.0	32.0	33.0	34.0	35.0	36.0	37.0
M_1_78_1	13.0	140.0	1169.0	7219.0	31186.0	96171.0	231380.0	442792.0	756806.0	1245359.0	2593592.0	27261000.0	5239409.0
	23.0	24.0	25.0	26.0	27.0	28.0	29.0	30.0	31.0	32.0	33.0	34.0	35.0	36.0	37.0
M_1_78_2	1.0	9.0	138.0	1039.0	5264.0	18137.0	50436.0	111939.0	233266.0	440787.0	835794.0	1732126.0	5592641.0	27078808.0	1805851.0
	25.0	26.0	27.0	28.0	29.0	30.0	31.0	32.0	33.0	34.0	35.0	36.0	37.0
M_1_79_1	12.0	193.0	1615.0	9316.0	39293.0	118542.0	279589.0	524916.0	881549.0	1433034.0	2934458.0	30277639.0	6238070.0
	23.0	24.0	25.0	26.0	27.0	28.0	29.0	30.0	31.0	32.0	33.0	34.0	35.0	36.0	37.0
M_1_79_2	1.0	15.0	146.0	1021.0	5193.0	17657.0	48928.0	112247.0	234416.0	447897.0	844860.0	1713450.0	5431385.0	31420956.0	2460054.0
	24.0	25.0	26.0	27.0	28.0	29.0	30.0	31.0	32.0	33.0	34.0	35.0	36.0	37.0
M_1_7_1	1.0	8.0	109.0	1106.0	6408.0	26070.0	77111.0	184670.0	358843.0	636256.0	1094450.0	2480434.0	26754897.0	4856928.0
	24.0	25.0	26.0	27.0	28.0	29.0	30.0	31.0	32.0	33.0	34.0	35.0	36.0	37.0
M_1_7_2	20.0	212.0	1332.0	6591.0	22205.0	58675.0	125033.0	251337.0	473293.0	916588.0	2018617.0	6987258.0	24731272.0	884858.0
	25.0	26.0	27.0	28.0	29.0	30.0	31.0	32.0	33.0	34.0	35.0	36.0	37.0
M_1_80_1	8.0	160.0	1500.0	8862.0	37048.0	111300.0	263250.0	494371.0	841277.0	1371914.0	2818742.0	28802851.0	5676284.0
	23.0	24.0	25.0	26.0	27.0	28.0	29.0	30.0	31.0	32.0	33.0	34.0	35.0	36.0	37.0
M_1_80_2	2.0	15.0	185.0	1274.0	5856.0	20323.0	55892.0	124563.0	253914.0	476288.0	887290.0	1787865.0	5629398.0	29161216.0	2023486.0
	25.0	26.0	27.0	28.0	29.0	30.0	31.0	32.0	33.0	34.0	35.0	36.0	37.0
M_1_81_1	7.0	109.0	1149.0	6541.0	27224.0	81999.0	191494.0	353542.0	589016.0	955931.0	1972148.0	21180663.0	4382149.0
	24.0	25.0	26.0	27.0	28.0	29.0	30.0	31.0	32.0	33.0	34.0	35.0	36.0	37.0
M_1_81_2	11.0	114.0	810.0	4145.0	14082.0	38953.0	87045.0	178735.0	335297.0	626914.0	1277544.0	4082492.0	21494623.0	1601207.0
	24.0	25.0	26.0	27.0	28.0	29.0	30.0	31.0	32.0	33.0	34.0	35.0	36.0	37.0
M_1_82_1	1.0	9.0	220.0	1835.0	10847.0	44365.0	133423.0	320738.0	631028.0	1122386.0	1841347.0	3514476.0	32368034.0	6141651.0
	23.0	24.0	25.0	26.0	27.0	28.0	29.0	30.0	31.0	32.0	33.0	34.0	35.0	36.0	37.0
M_1_82_2	2.0	19.0	192.0	1362.0	6567.0	22618.0	62621.0	139710.0	294816.0	572533.0	1103812.0	2209451.0	6685450.0	32765215.0	2265992.0
	25.0	26.0	27.0	28.0	29.0	30.0	31.0	32.0	33.0	34.0	35.0	36.0	37.0
M_1_83_1	10.0	196.0	1500.0	8554.0	36833.0	110375.0	267351.0	526937.0	937897.0	1546848.0	3036487.0	27976800.0	5247728.0
	23.0	24.0	25.0	26.0	27.0	28.0	29.0	30.0	31.0	32.0	33.0	34.0	35.0	36.0	37.0
M_1_83_2	2.0	10.0	177.0	1109.0	5763.0	19560.0	53985.0	122245.0	258099.0	503474.0	971309.0	1976932.0	6078455.0	27903762.0	1802634.0
	24.0	25.0	26.0	27.0	28.0	29.0	30.0	31.0	32.0	33.0	34.0	35.0	36.0	37.0
M_1_84_1	1.0	17.0	222.0	1930.0	11500.0	48099.0	142579.0	336533.0	636784.0	1094517.0	1776950.0	3511316.0	34920537.0	7061126.0
	23.0	24.0	25.0	26.0	27.0	28.0	29.0	30.0	31.0	32.0	33.0	34.0	35.0	36.0	37.0
M_1_84_2	2.0	12.0	202.0	1315.0	6596.0	22564.0	61782.0	138225.0	288811.0	555561.0	1056425.0	2133081.0	6659385.0	35917503.0	2700647.0
	24.0	25.0	26.0	27.0	28.0	29.0	30.0	31.0	32.0	33.0	34.0	35.0	36.0	37.0
M_1_85_1	1.0	12.0	198.0	1760.0	10233.0	43193.0	128834.0	314818.0	628560.0	1128595.0	1833750.0	3326651.0	29614771.0	5944861.0
	23.0	24.0	25.0	26.0	27.0	28.0	29.0	30.0	31.0	32.0	33.0	34.0	35.0	36.0	37.0
M_1_85_2	1.0	10.0	196.0	1314.0	6627.0	22872.0	62078.0	140549.0	297279.0	583615.0	1118256.0	2211820.0	6549369.0	29986412.0	1995839.0
	24.0	25.0	26.0	27.0	28.0	29.0	30.0	31.0	32.0	33.0	34.0	35.0	36.0	37.0
M_1_86_1	1.0	5.0	209.0	1873.0	10057.0	42194.0	127046.0	307191.0	603483.0	1063209.0	1709092.0	3166575.0	29861511.0	5952450.0
	23.0	24.0	25.0	26.0	27.0	28.0	29.0	30.0	31.0	32.0	33.0	34.0	35.0	36.0	37.0
M_1_86_2	1.0	21.0	142.0	997.0	5188.0	17642.0	49720.0	113823.0	244691.0	488512.0	945060.0	1861334.0	5530776.0	31095601.0	2491388.0
	25.0	26.0	27.0	28.0	29.0	30.0	31.0	32.0	33.0	34.0	35.0	36.0	37.0
M_1_87_1	8.0	144.0	1368.0	7801.0	33128.0	99769.0	242728.0	477494.0	846008.0	1391624.0	2696820.0	26306173.0	5301425.0
	23.0	24.0	25.0	26.0	27.0	28.0	29.0	30.0	31.0	32.0	33.0	34.0	35.0	36.0	37.0
M_1_87_2	1.0	27.0	179.0	1315.0	6622.0	22746.0	61702.0	137902.0	284517.0	543672.0	1035806.0	2168704.0	6812182.0	25006764.0	1322351.0
	24.0	25.0	26.0	27.0	28.0	29.0	30.0	31.0	32.0	33.0	34.0	35.0	36.0	37.0
M_1_88_1	1.0	21.0	239.0	2398.0	13151.0	54413.0	160023.0	375180.0	710216.0	1198279.0	1894940.0	3627339.0	23030117.0	3655782.0
	23.0	24.0	25.0	26.0	27.0	28.0	29.0	30.0	31.0	32.0	33.0	34.0	35.0	36.0	37.0
M_1_88_2	1.0	12.0	166.0	1172.0	6004.0	21093.0	62340.0	149302.0	327517.0	637060.0	1187141.0	2285763.0	6052578.0	22362551.0	1629399.0
	25.0	26.0	27.0	28.0	29.0	30.0	31.0	32.0	33.0	34.0	35.0	36.0	37.0
M_1_89_1	6.0	163.0	1345.0	8427.0	35795.0	110617.0	270595.0	532508.0	930636.0	1523674.0	2983648.0	22904191.0	4544040.0
	24.0	25.0	26.0	27.0	28.0	29.0	30.0	31.0	32.0	33.0	34.0	35.0	36.0	37.0
M_1_89_2	9.0	121.0	871.0	4547.0	16395.0	47773.0	116093.0	253281.0	495008.0	924995.0	1797151.0	4998280.0	23234001.0	1957120.0
	25.0	26.0	27.0	28.0	29.0	30.0	31.0	32.0	33.0	34.0	35.0	36.0	37.0
M_1_8_1	12.0	145.0	1268.0	7270.0	29361.0	87334.0	203215.0	383300.0	648261.0	1045314.0	2066064.0	20990578.0	3845334.0
	23.0	24.0	25.0	26.0	27.0	28.0	29.0	30.0	31.0	32.0	33.0	34.0	35.0	36.0	37.0
M_1_8_2	2.0	12.0	112.0	782.0	3815.0	12979.0	36910.0	84621.0	176863.0	331762.0	607811.0	1151748.0	3288361.0	21473437.0	2138241.0
	25.0	26.0	27.0	28.0	29.0	30.0	31.0	32.0	33.0	34.0	35.0	36.0	37.0
M_1_90_1	9.0	228.0	2207.0	12671.0	52056.0	154123.0	357938.0	665104.0	1106829.0	1779136.0	3579452.0	24009509.0	3876749.0
	24.0	25.0	26.0	27.0	28.0	29.0	30.0	31.0	32.0	33.0	34.0	35.0	36.0	37.0
M_1_90_2	8.0	167.0	1297.0	6509.0	23599.0	69283.0	165667.0	357540.0	680044.0	1251710.0	2449660.0	6628676.0	22525582.0	1436269.0
	24.0	25.0	26.0	27.0	28.0	29.0	30.0	31.0	32.0	33.0	34.0	35.0	36.0	37.0
M_1_91_1	1.0	33.0	439.0	3313.0	18034.0	69956.0	197475.0	448614.0	828152.0	1384990.0	2217556.0	4389355.0	30449278.0	5234512.0
	24.0	25.0	26.0	27.0	28.0	29.0	30.0	31.0	32.0	33.0	34.0	35.0	36.0	37.0
M_1_91_2	19.0	233.0	1593.0	8085.0	27857.0	80119.0	187155.0	400384.0	763666.0	1414267.0	2771230.0	7616893.0	30032224.0	1937983.0
	24.0	25.0	26.0	27.0	28.0	29.0	30.0	31.0	32.0	33.0	34.0	35.0	36.0	37.0
M_1_92_1	2.0	19.0	217.0	1934.0	10657.0	42416.0	123983.0	297140.0	583769.0	1042186.0	1770548.0	3692058.0	20139541.0	2490642.0
	24.0	25.0	26.0	27.0	28.0	29.0	30.0	31.0	32.0	33.0	34.0	35.0	36.0	37.0
M_1_92_2	10.0	128.0	1187.0	5754.0	20629.0	60175.0	146002.0	321610.0	633136.0	1196356.0	2294516.0	5714096.0	18787953.0	1013560.0
	24.0	25.0	26.0	27.0	28.0	29.0	30.0	31.0	32.0	33.0	34.0	35.0	36.0	37.0
M_1_93_1	1.0	26.0	245.0	2119.0	11710.0	46251.0	132408.0	308832.0	587007.0	1008600.0	1621262.0	3144193.0	20977355.0	3546647.0
	23.0	24.0	25.0	26.0	27.0	28.0	29.0	30.0	31.0	32.0	33.0	34.0	35.0	36.0	37.0
M_1_93_2	1.0	12.0	161.0	1254.0	6280.0	22308.0	63814.0	148422.0	316935.0	604532.0	1120335.0	2154706.0	5751590.0	20148121.0	1048185.0
	25.0	26.0	27.0	28.0	29.0	30.0	31.0	32.0	33.0	34.0	35.0	36.0	37.0
M_1_94_1	13.0	209.0	1957.0	10245.0	40840.0	115707.0	265690.0	491318.0	825496.0	1365134.0	2924712.0	21087782.0	3517699.0
	24.0	25.0	26.0	27.0	28.0	29.0	30.0	31.0	32.0	33.0	34.0	35.0	36.0	37.0
M_1_94_2	14.0	210.0	1478.0	7423.0	25675.0	71586.0	163639.0	338616.0	623164.0	1127732.0	2215308.0	6084502.0	19121387.0	866068.0
	24.0	25.0	26.0	27.0	28.0	29.0	30.0	31.0	32.0	33.0	34.0	35.0	36.0	37.0
M_1_95_1	1.0	26.0	291.0	2372.0	13080.0	51785.0	146662.0	334215.0	621597.0	1046090.0	1685222.0	3387433.0	23972507.0	4109096.0
	23.0	24.0	25.0	26.0	27.0	28.0	29.0	30.0	31.0	32.0	33.0	34.0	35.0	36.0	37.0
M_1_95_2	2.0	14.0	226.0	1548.0	7791.0	26783.0	75127.0	174582.0	365226.0	682539.0	1245783.0	2413563.0	6544422.0	22590431.0	1242340.0
	25.0	26.0	27.0	28.0	29.0	30.0	31.0	32.0	33.0	34.0	35.0	36.0	37.0
M_1_96_1	14.0	287.0	2249.0	11961.0	47302.0	135749.0	311681.0	583091.0	984258.0	1590329.0	3195605.0	22874512.0	3848569.0
	23.0	24.0	25.0	26.0	27.0	28.0	29.0	30.0	31.0	32.0	33.0	34.0	35.0	36.0	37.0
M_1_96_2	1.0	7.0	196.0	1307.0	6829.0	23176.0	65889.0	153574.0	326051.0	619934.0	1149064.0	2260395.0	6226779.0	21653685.0	1098720.0
	25.0	26.0	27.0	28.0	29.0	30.0	31.0	32.0	33.0	34.0	35.0	36.0	37.0
M_1_9_1	7.0	137.0	1290.0	7369.0	30284.0	88967.0	208809.0	391714.0	666074.0	1094885.0	2314074.0	21864824.0	3456059.0
	23.0	24.0	25.0	26.0	27.0	28.0	29.0	30.0	31.0	32.0	33.0	34.0	35.0	36.0	37.0
M_1_9_2	2.0	10.0	90.0	615.0	3104.0	10635.0	31364.0	74178.0	160759.0	313353.0	593654.0	1189183.0	3572477.0	22035576.0	2139493.0

