"","x"
"1","Me1_v2_0198870"
"2","Me1_v2_0077100"
"3","Me1_v2_0058020"
"4","Me1_v2_0106290"
"5","Me1_v2_0175300"
"6","Me1_v2_0111890"
"7","Me1_v2_0069860"
"8","Me1_v2_0131350"
"9","Me1_v2_0117250"
"10","Me1_v2_0104830"
"11","Me1_v2_0195790"
"12","Me1_v2_0122280"
"13","Me1_v2_0184510"
"14","Me1_v2_0079090"
"15","Me1_v2_0055890"
"16","Me1_v2_0162710"
"17","Me1_v2_0119000"
"18","Me1_v2_0134830"
"19","Me1_v2_0150470"
"20","Me1_v2_0082100"
