"","ID","Description","GeneRatio","BgRatio","pvalue","p.adjust","qvalue","geneID","Count"
"GO:2000241","GO:2000241","regulation of reproductive process","6/48","117/5486",0.000488810474399993,0.285954127523996,0.267044880224839,"Me1_v2_0078310/Me1_v2_0066970/Me1_v2_0063710/Me1_v2_0184480/Me1_v2_0200960/Me1_v2_0085580",6
"GO:0048580","GO:0048580","regulation of post-embryonic development","6/48","144/5486",0.00145748486349816,0.335929327792846,0.313715377641902,"Me1_v2_0073320/Me1_v2_0083360/Me1_v2_0066970/Me1_v2_0200960/Me1_v2_0064910/Me1_v2_0085580",6
"GO:0001101","GO:0001101","response to acid chemical","10/48","401/5486",0.00205018160049802,0.335929327792846,0.313715377641902,"Me1_v2_0073320/Me1_v2_0227320/Me1_v2_0164270/Me1_v2_0083360/Me1_v2_0066970/Me1_v2_0158440/Me1_v2_0160920/Me1_v2_0123010/Me1_v2_0200960/Me1_v2_0085580",10
"GO:0051445","GO:0051445","regulation of meiotic cell cycle","2/48","11/5486",0.00392103567001119,0.335929327792846,0.313715377641902,"Me1_v2_0078310/Me1_v2_0063710",2
"GO:0010162","GO:0010162","seed dormancy process","2/48","13/5486",0.00549905964252117,0.335929327792846,0.313715377641902,"Me1_v2_0184480/Me1_v2_0085580",2
"GO:0022611","GO:0022611","dormancy process","2/48","13/5486",0.00549905964252117,0.335929327792846,0.313715377641902,"Me1_v2_0184480/Me1_v2_0085580",2
"GO:0010029","GO:0010029","regulation of seed germination","3/48","42/5486",0.00568176260925797,0.335929327792846,0.313715377641902,"Me1_v2_0073320/Me1_v2_0083360/Me1_v2_0064910",3
"GO:0040008","GO:0040008","regulation of growth","4/48","89/5486",0.00731097389327112,0.335929327792846,0.313715377641902,"Me1_v2_0096270/Me1_v2_0066970/Me1_v2_0218130/Me1_v2_0123010",4
"GO:0019432","GO:0019432","triglyceride biosynthetic process","2/48","15/5486",0.0073205633294621,0.335929327792846,0.313715377641902,"Me1_v2_0137310/Me1_v2_0137320",2
"GO:1900140","GO:1900140","regulation of seedling development","3/48","47/5486",0.00778407808439884,0.335929327792846,0.313715377641902,"Me1_v2_0073320/Me1_v2_0083360/Me1_v2_0064910",3
"GO:2000026","GO:2000026","regulation of multicellular organismal development","6/48","203/5486",0.00799796877385487,0.335929327792846,0.313715377641902,"Me1_v2_0073320/Me1_v2_0083360/Me1_v2_0066970/Me1_v2_0200960/Me1_v2_0064910/Me1_v2_0085580",6
"GO:0017148","GO:0017148","negative regulation of translation","2/48","16/5486",0.00831992216875783,0.335929327792846,0.313715377641902,"Me1_v2_0122770/Me1_v2_0200960",2
"GO:0034249","GO:0034249","negative regulation of cellular amide metabolic process","2/48","16/5486",0.00831992216875783,0.335929327792846,0.313715377641902,"Me1_v2_0122770/Me1_v2_0200960",2
"GO:0032446","GO:0032446","protein modification by small protein conjugation","5/48","149/5486",0.00924360961902314,0.335929327792846,0.313715377641902,"Me1_v2_0096270/Me1_v2_0083360/Me1_v2_0228890/Me1_v2_0182390/Me1_v2_0210670",5
"GO:0046460","GO:0046460","neutral lipid biosynthetic process","2/48","17/5486",0.00937694054181622,0.335929327792846,0.313715377641902,"Me1_v2_0137310/Me1_v2_0137320",2
"GO:0046463","GO:0046463","acylglycerol biosynthetic process","2/48","17/5486",0.00937694054181622,0.335929327792846,0.313715377641902,"Me1_v2_0137310/Me1_v2_0137320",2
"GO:0016567","GO:0016567","protein ubiquitination","5/48","151/5486",0.00976204884184339,0.335929327792846,0.313715377641902,"Me1_v2_0096270/Me1_v2_0083360/Me1_v2_0228890/Me1_v2_0182390/Me1_v2_0210670",5
"GO:0010214","GO:0010214","seed coat development","2/48","18/5486",0.0104905762708186,0.340943728801605,0.318398192079232,"Me1_v2_0137240/Me1_v2_0064910",2
"GO:0010030","GO:0010030","positive regulation of seed germination","2/48","19/5486",0.0116598003403539,0.358999115742474,0.33525963305505,"Me1_v2_0073320/Me1_v2_0064910",2
"GO:0051128","GO:0051128","regulation of cellular component organization","6/48","224/5486",0.0126625924589474,0.370380829424213,0.345888709799669,"Me1_v2_0096270/Me1_v2_0078310/Me1_v2_0063710/Me1_v2_0123010/Me1_v2_0200960/Me1_v2_0210670",6
"GO:0070647","GO:0070647","protein modification by small protein conjugation or removal","5/48","166/5486",0.0143060598546414,0.377491859037372,0.352529509384428,"Me1_v2_0096270/Me1_v2_0083360/Me1_v2_0228890/Me1_v2_0182390/Me1_v2_0210670",5
"GO:0048523","GO:0048523","negative regulation of cellular process","8/48","381/5486",0.0163057509433655,0.377491859037372,0.352529509384428,"Me1_v2_0096270/Me1_v2_0078310/Me1_v2_0122770/Me1_v2_0066970/Me1_v2_0158440/Me1_v2_0182390/Me1_v2_0200960/Me1_v2_0210670",8
"GO:0006641","GO:0006641","triglyceride metabolic process","2/48","23/5486",0.0168724524402498,0.377491859037372,0.352529509384428,"Me1_v2_0137310/Me1_v2_0137320",2
"GO:0010431","GO:0010431","seed maturation","2/48","23/5486",0.0168724524402498,0.377491859037372,0.352529509384428,"Me1_v2_0184480/Me1_v2_0085580",2
"GO:0009725","GO:0009725","response to hormone","9/48","468/5486",0.0184360718612909,0.377491859037372,0.352529509384428,"Me1_v2_0073320/Me1_v2_0066970/Me1_v2_0158440/Me1_v2_0218130/Me1_v2_0160920/Me1_v2_0123010/Me1_v2_0200960/Me1_v2_0064910/Me1_v2_0085580",9
"GO:0009791","GO:0009791","post-embryonic development","9/48","468/5486",0.0184360718612909,0.377491859037372,0.352529509384428,"Me1_v2_0164270/Me1_v2_0066970/Me1_v2_0137240/Me1_v2_0218130/Me1_v2_0063710/Me1_v2_0184480/Me1_v2_0182390/Me1_v2_0064910/Me1_v2_0085580",9
"GO:0010154","GO:0010154","fruit development","6/48","248/5486",0.0200477178598499,0.377491859037372,0.352529509384428,"Me1_v2_0164270/Me1_v2_0137240/Me1_v2_0063710/Me1_v2_0184480/Me1_v2_0064910/Me1_v2_0085580",6
"GO:0051239","GO:0051239","regulation of multicellular organismal process","6/48","248/5486",0.0200477178598499,0.377491859037372,0.352529509384428,"Me1_v2_0073320/Me1_v2_0083360/Me1_v2_0066970/Me1_v2_0200960/Me1_v2_0064910/Me1_v2_0085580",6
"GO:0009247","GO:0009247","glycolipid biosynthetic process","2/48","26/5486",0.0213171038294569,0.377491859037372,0.352529509384428,"Me1_v2_0137310/Me1_v2_0137320",2
"GO:0009914","GO:0009914","hormone transport","2/48","26/5486",0.0213171038294569,0.377491859037372,0.352529509384428,"Me1_v2_0083360/Me1_v2_0218130",2
"GO:0051783","GO:0051783","regulation of nuclear division","2/48","26/5486",0.0213171038294569,0.377491859037372,0.352529509384428,"Me1_v2_0078310/Me1_v2_0063710",2
"GO:0060918","GO:0060918","auxin transport","2/48","26/5486",0.0213171038294569,0.377491859037372,0.352529509384428,"Me1_v2_0083360/Me1_v2_0218130",2
"GO:0009719","GO:0009719","response to endogenous stimulus","9/48","480/5486",0.0214179299678337,0.377491859037372,0.352529509384428,"Me1_v2_0073320/Me1_v2_0066970/Me1_v2_0158440/Me1_v2_0218130/Me1_v2_0160920/Me1_v2_0123010/Me1_v2_0200960/Me1_v2_0064910/Me1_v2_0085580",9
"GO:0006664","GO:0006664","glycolipid metabolic process","2/48","27/5486",0.0228955230670666,0.377491859037372,0.352529509384428,"Me1_v2_0137310/Me1_v2_0137320",2
"GO:1903509","GO:1903509","liposaccharide metabolic process","2/48","27/5486",0.0228955230670666,0.377491859037372,0.352529509384428,"Me1_v2_0137310/Me1_v2_0137320",2
"GO:0006638","GO:0006638","neutral lipid metabolic process","2/48","28/5486",0.0245208387067011,0.377491859037372,0.352529509384428,"Me1_v2_0137310/Me1_v2_0137320",2
"GO:0006639","GO:0006639","acylglycerol metabolic process","2/48","28/5486",0.0245208387067011,0.377491859037372,0.352529509384428,"Me1_v2_0137310/Me1_v2_0137320",2
"GO:0009739","GO:0009739","response to gibberellin","2/48","28/5486",0.0245208387067011,0.377491859037372,0.352529509384428,"Me1_v2_0066970/Me1_v2_0085580",2
"GO:2000113","GO:2000113","negative regulation of cellular macromolecule biosynthetic process","4/48","129/5486",0.0255789337929375,0.383684006894063,0.358312189973942,"Me1_v2_0122770/Me1_v2_0158440/Me1_v2_0182390/Me1_v2_0200960",4
"GO:0050793","GO:0050793","regulation of developmental process","6/48","268/5486",0.0281256045640533,0.402669155917623,0.376041910789467,"Me1_v2_0073320/Me1_v2_0083360/Me1_v2_0066970/Me1_v2_0200960/Me1_v2_0064910/Me1_v2_0085580",6
"GO:0010558","GO:0010558","negative regulation of macromolecule biosynthetic process","4/48","133/5486",0.0282212570814061,0.402669155917623,0.376041910789467,"Me1_v2_0122770/Me1_v2_0158440/Me1_v2_0182390/Me1_v2_0200960",4
"GO:0010629","GO:0010629","negative regulation of gene expression","5/48","201/5486",0.029997466208747,0.417821850764691,0.390192605572424,"Me1_v2_0122770/Me1_v2_0158440/Me1_v2_0160920/Me1_v2_0182390/Me1_v2_0200960",5
"GO:0048609","GO:0048609","multicellular organismal reproductive process","3/48","79/5486",0.0312637353453493,0.420425337530737,0.392623931945034,"Me1_v2_0164130/Me1_v2_0184480/Me1_v2_0085580",3
"GO:0031327","GO:0031327","negative regulation of cellular biosynthetic process","4/48","139/5486",0.0324823393484684,0.420425337530737,0.392623931945034,"Me1_v2_0122770/Me1_v2_0158440/Me1_v2_0182390/Me1_v2_0200960",4
"GO:0009890","GO:0009890","negative regulation of biosynthetic process","4/48","142/5486",0.0347480622038233,0.420425337530737,0.392623931945034,"Me1_v2_0122770/Me1_v2_0158440/Me1_v2_0182390/Me1_v2_0200960",4
"GO:0048581","GO:0048581","negative regulation of post-embryonic development","2/48","34/5486",0.0352076854928384,0.420425337530737,0.392623931945034,"Me1_v2_0083360/Me1_v2_0085580",2
"GO:0048582","GO:0048582","positive regulation of post-embryonic development","2/48","34/5486",0.0352076854928384,0.420425337530737,0.392623931945034,"Me1_v2_0073320/Me1_v2_0064910",2
"GO:2000112","GO:2000112","regulation of cellular macromolecule biosynthetic process","8/48","443/5486",0.0364449285871043,0.420425337530737,0.392623931945034,"Me1_v2_0172600/Me1_v2_0078310/Me1_v2_0122770/Me1_v2_0066970/Me1_v2_0158440/Me1_v2_0182390/Me1_v2_0200960/Me1_v2_0085580",8
"GO:0032504","GO:0032504","multicellular organism reproduction","3/48","84/5486",0.0365516201083927,0.420425337530737,0.392623931945034,"Me1_v2_0164130/Me1_v2_0184480/Me1_v2_0085580",3
"GO:0003006","GO:0003006","developmental process involved in reproduction","8/48","444/5486",0.0368675970918825,0.420425337530737,0.392623931945034,"Me1_v2_0164270/Me1_v2_0137240/Me1_v2_0063710/Me1_v2_0164130/Me1_v2_0184480/Me1_v2_0182390/Me1_v2_0064910/Me1_v2_0085580",8
"GO:0000911","GO:0000911","cytokinesis by cell plate formation","2/48","36/5486",0.0391054501130863,0.420425337530737,0.392623931945034,"Me1_v2_0063710/Me1_v2_0097180",2
"GO:0006417","GO:0006417","regulation of translation","2/48","36/5486",0.0391054501130863,0.420425337530737,0.392623931945034,"Me1_v2_0122770/Me1_v2_0200960",2
"GO:1902410","GO:1902410","mitotic cytokinetic process","2/48","36/5486",0.0391054501130863,0.420425337530737,0.392623931945034,"Me1_v2_0063710/Me1_v2_0097180",2
"GO:0010556","GO:0010556","regulation of macromolecule biosynthetic process","8/48","452/5486",0.0403709126214725,0.420425337530737,0.392623931945034,"Me1_v2_0172600/Me1_v2_0078310/Me1_v2_0122770/Me1_v2_0066970/Me1_v2_0158440/Me1_v2_0182390/Me1_v2_0200960/Me1_v2_0085580",8
"GO:0034248","GO:0034248","regulation of cellular amide metabolic process","2/48","37/5486",0.0411134809942401,0.420425337530737,0.392623931945034,"Me1_v2_0122770/Me1_v2_0200960",2
"GO:0044550","GO:0044550","secondary metabolite biosynthetic process","2/48","37/5486",0.0411134809942401,0.420425337530737,0.392623931945034,"Me1_v2_0206300/Me1_v2_0123010",2
"GO:1903506","GO:1903506","regulation of nucleic acid-templated transcription","7/48","374/5486",0.0422664713931257,0.420425337530737,0.392623931945034,"Me1_v2_0172600/Me1_v2_0078310/Me1_v2_0066970/Me1_v2_0158440/Me1_v2_0182390/Me1_v2_0200960/Me1_v2_0085580",7
"GO:2001141","GO:2001141","regulation of RNA biosynthetic process","7/48","374/5486",0.0422664713931257,0.420425337530737,0.392623931945034,"Me1_v2_0172600/Me1_v2_0078310/Me1_v2_0066970/Me1_v2_0158440/Me1_v2_0182390/Me1_v2_0200960/Me1_v2_0085580",7
"GO:0032506","GO:0032506","cytokinetic process","2/48","38/5486",0.0431598680045087,0.420425337530737,0.392623931945034,"Me1_v2_0063710/Me1_v2_0097180",2
"GO:0048608","GO:0048608","reproductive structure development","7/48","377/5486",0.0438392232297008,0.420425337530737,0.392623931945034,"Me1_v2_0164270/Me1_v2_0137240/Me1_v2_0063710/Me1_v2_0184480/Me1_v2_0182390/Me1_v2_0064910/Me1_v2_0085580",7
"GO:0061458","GO:0061458","reproductive system development","7/48","377/5486",0.0438392232297008,0.420425337530737,0.392623931945034,"Me1_v2_0164270/Me1_v2_0137240/Me1_v2_0063710/Me1_v2_0184480/Me1_v2_0182390/Me1_v2_0064910/Me1_v2_0085580",7
"GO:0010608","GO:0010608","post-transcriptional regulation of gene expression","3/48","92/5486",0.0459097932183032,0.426305222741387,0.398114998835411,"Me1_v2_0122770/Me1_v2_0160920/Me1_v2_0200960",3
"GO:0010817","GO:0010817","regulation of hormone levels","3/48","92/5486",0.0459097932183032,0.426305222741387,0.398114998835411,"Me1_v2_0083360/Me1_v2_0218130/Me1_v2_0123010",3
"GO:1990748","GO:1990748","cellular detoxification","2/48","40/5486",0.0473645450180401,0.432941544305523,0.404312481321757,"Me1_v2_0227320/Me1_v2_0116120",2
"GO:0010501","GO:0010501","RNA secondary structure unwinding","2/48","41/5486",0.0495212783157307,0.438938603253067,0.409912973618249,"Me1_v2_0202750/Me1_v2_0029520",2
"GO:0098869","GO:0098869","cellular oxidant detoxification","2/48","41/5486",0.0495212783157307,0.438938603253067,0.409912973618249,"Me1_v2_0227320/Me1_v2_0116120",2
"GO:0043648","GO:0043648","dicarboxylic acid metabolic process","2/48","42/5486",0.0517132541010543,0.44326523624166,0.413953499971968,"Me1_v2_0152960/Me1_v2_0064910",2
"GO:0046467","GO:0046467","membrane lipid biosynthetic process","2/48","44/5486",0.0561999316117924,0.44326523624166,0.413953499971968,"Me1_v2_0137310/Me1_v2_0137320",2
"GO:0048316","GO:0048316","seed development","5/48","241/5486",0.0579085645192115,0.44326523624166,0.413953499971968,"Me1_v2_0137240/Me1_v2_0063710/Me1_v2_0184480/Me1_v2_0064910/Me1_v2_0085580",5
"GO:0031326","GO:0031326","regulation of cellular biosynthetic process","8/48","487/5486",0.0583505805017736,0.44326523624166,0.413953499971968,"Me1_v2_0172600/Me1_v2_0078310/Me1_v2_0122770/Me1_v2_0066970/Me1_v2_0158440/Me1_v2_0182390/Me1_v2_0200960/Me1_v2_0085580",8
"GO:0009636","GO:0009636","response to toxic substance","3/48","103/5486",0.0605269814120926,0.44326523624166,0.413953499971968,"Me1_v2_0227320/Me1_v2_0116120/Me1_v2_0123010",3
"GO:0001558","GO:0001558","regulation of cell growth","2/48","47/5486",0.0631757668462628,0.44326523624166,0.413953499971968,"Me1_v2_0096270/Me1_v2_0123010",2
"GO:0098754","GO:0098754","detoxification","2/48","47/5486",0.0631757668462628,0.44326523624166,0.413953499971968,"Me1_v2_0227320/Me1_v2_0116120",2
"GO:0051253","GO:0051253","negative regulation of RNA metabolic process","3/48","106/5486",0.0648524971481218,0.44326523624166,0.413953499971968,"Me1_v2_0158440/Me1_v2_0182390/Me1_v2_0200960",3
"GO:0006643","GO:0006643","membrane lipid metabolic process","2/48","49/5486",0.0679818769810563,0.44326523624166,0.413953499971968,"Me1_v2_0137310/Me1_v2_0137320",2
"GO:0045017","GO:0045017","glycerolipid biosynthetic process","2/48","49/5486",0.0679818769810563,0.44326523624166,0.413953499971968,"Me1_v2_0137310/Me1_v2_0137320",2
"GO:0051093","GO:0051093","negative regulation of developmental process","2/48","49/5486",0.0679818769810563,0.44326523624166,0.413953499971968,"Me1_v2_0083360/Me1_v2_0085580",2
"GO:0051241","GO:0051241","negative regulation of multicellular organismal process","2/48","49/5486",0.0679818769810563,0.44326523624166,0.413953499971968,"Me1_v2_0083360/Me1_v2_0085580",2
"GO:0097237","GO:0097237","cellular response to toxic substance","2/48","49/5486",0.0679818769810563,0.44326523624166,0.413953499971968,"Me1_v2_0227320/Me1_v2_0116120",2
"GO:0051252","GO:0051252","regulation of RNA metabolic process","7/48","417/5486",0.0685426011511844,0.44326523624166,0.413953499971968,"Me1_v2_0172600/Me1_v2_0078310/Me1_v2_0066970/Me1_v2_0158440/Me1_v2_0182390/Me1_v2_0200960/Me1_v2_0085580",7
"GO:0009966","GO:0009966","regulation of signal transduction","4/48","178/5486",0.0690348020070217,0.44326523624166,0.413953499971968,"Me1_v2_0096270/Me1_v2_0066970/Me1_v2_0218130/Me1_v2_0182390",4
"GO:0048229","GO:0048229","gametophyte development","4/48","186/5486",0.0784102004564511,0.44326523624166,0.413953499971968,"Me1_v2_0063710/Me1_v2_0164130/Me1_v2_0132240/Me1_v2_0206470",4
"GO:0048583","GO:0048583","regulation of response to stimulus","6/48","346/5486",0.0791673052680426,0.44326523624166,0.413953499971968,"Me1_v2_0096270/Me1_v2_0083360/Me1_v2_0066970/Me1_v2_0218130/Me1_v2_0182390/Me1_v2_0200960",6
"GO:0009414","GO:0009414","response to water deprivation","3/48","117/5486",0.0818923102004055,0.44326523624166,0.413953499971968,"Me1_v2_0227320/Me1_v2_0164270/Me1_v2_0083360",3
"GO:0023051","GO:0023051","regulation of signaling","4/48","189/5486",0.0820850985400564,0.44326523624166,0.413953499971968,"Me1_v2_0096270/Me1_v2_0066970/Me1_v2_0218130/Me1_v2_0182390",4
"GO:0010646","GO:0010646","regulation of cell communication","4/48","190/5486",0.0833290933388045,0.44326523624166,0.413953499971968,"Me1_v2_0096270/Me1_v2_0066970/Me1_v2_0218130/Me1_v2_0182390",4
"GO:0009415","GO:0009415","response to water","3/48","118/5486",0.0835300070084568,0.44326523624166,0.413953499971968,"Me1_v2_0227320/Me1_v2_0164270/Me1_v2_0083360",3
"GO:0033993","GO:0033993","response to lipid","5/48","269/5486",0.0841827802585809,0.44326523624166,0.413953499971968,"Me1_v2_0073320/Me1_v2_0066970/Me1_v2_0158440/Me1_v2_0123010/Me1_v2_0085580",5
"GO:0006775","GO:0006775","fat-soluble vitamin metabolic process","1/48","10/5486",0.0841960361532877,0.44326523624166,0.413953499971968,"Me1_v2_0123010",1
"GO:0006900","GO:0006900","vesicle budding from membrane","1/48","10/5486",0.0841960361532877,0.44326523624166,0.413953499971968,"Me1_v2_0206300",1
"GO:0010017","GO:0010017","red or far-red light signaling pathway","1/48","10/5486",0.0841960361532877,0.44326523624166,0.413953499971968,"Me1_v2_0066970",1
"GO:0016144","GO:0016144","S-glycoside biosynthetic process","1/48","10/5486",0.0841960361532877,0.44326523624166,0.413953499971968,"Me1_v2_0123010",1
"GO:0019758","GO:0019758","glycosinolate biosynthetic process","1/48","10/5486",0.0841960361532877,0.44326523624166,0.413953499971968,"Me1_v2_0123010",1
"GO:0019761","GO:0019761","glucosinolate biosynthetic process","1/48","10/5486",0.0841960361532877,0.44326523624166,0.413953499971968,"Me1_v2_0123010",1
"GO:0030422","GO:0030422","production of siRNA involved in post-transcriptional gene silencing by RNA","1/48","10/5486",0.0841960361532877,0.44326523624166,0.413953499971968,"Me1_v2_0160920",1
"GO:0042362","GO:0042362","fat-soluble vitamin biosynthetic process","1/48","10/5486",0.0841960361532877,0.44326523624166,0.413953499971968,"Me1_v2_0123010",1
"GO:0043488","GO:0043488","regulation of mRNA stability","1/48","10/5486",0.0841960361532877,0.44326523624166,0.413953499971968,"Me1_v2_0200960",1
"GO:0045492","GO:0045492","xylan biosynthetic process","1/48","10/5486",0.0841960361532877,0.44326523624166,0.413953499971968,"Me1_v2_0137240",1
"GO:0045926","GO:0045926","negative regulation of growth","1/48","10/5486",0.0841960361532877,0.44326523624166,0.413953499971968,"Me1_v2_0096270",1
"GO:1902584","GO:1902584","positive regulation of response to water deprivation","1/48","10/5486",0.0841960361532877,0.44326523624166,0.413953499971968,"Me1_v2_0083360",1
"GO:0019748","GO:0019748","secondary metabolic process","2/48","56/5486",0.0856974643109726,0.44326523624166,0.413953499971968,"Me1_v2_0206300/Me1_v2_0123010",2
"GO:0009753","GO:0009753","response to jasmonic acid","2/48","58/5486",0.0909931247977994,0.44326523624166,0.413953499971968,"Me1_v2_0123010/Me1_v2_0200960",2
"GO:0000266","GO:0000266","mitochondrial fission","1/48","11/5486",0.0922235362016149,0.44326523624166,0.413953499971968,"Me1_v2_0096270",1
"GO:0006265","GO:0006265","DNA topological change","1/48","11/5486",0.0922235362016149,0.44326523624166,0.413953499971968,"Me1_v2_0069690",1
"GO:0006368","GO:0006368","transcription elongation from RNA polymerase II promoter","1/48","11/5486",0.0922235362016149,0.44326523624166,0.413953499971968,"Me1_v2_0085580",1
"GO:0010216","GO:0010216","maintenance of DNA methylation","1/48","11/5486",0.0922235362016149,0.44326523624166,0.413953499971968,"Me1_v2_0160920",1
"GO:0010374","GO:0010374","stomatal complex development","1/48","11/5486",0.0922235362016149,0.44326523624166,0.413953499971968,"Me1_v2_0063710",1
"GO:0030100","GO:0030100","regulation of endocytosis","1/48","11/5486",0.0922235362016149,0.44326523624166,0.413953499971968,"Me1_v2_0210670",1
"GO:0034097","GO:0034097","response to cytokine","1/48","11/5486",0.0922235362016149,0.44326523624166,0.413953499971968,"Me1_v2_0200960",1
"GO:0043903","GO:0043903","regulation of biological process involved in symbiotic interaction","1/48","11/5486",0.0922235362016149,0.44326523624166,0.413953499971968,"Me1_v2_0145730",1
"GO:0051272","GO:0051272","positive regulation of cellular component movement","1/48","11/5486",0.0922235362016149,0.44326523624166,0.413953499971968,"Me1_v2_0210670",1
"GO:0051607","GO:0051607","defense response to virus","1/48","11/5486",0.0922235362016149,0.44326523624166,0.413953499971968,"Me1_v2_0160920",1
"GO:0061013","GO:0061013","regulation of mRNA catabolic process","1/48","11/5486",0.0922235362016149,0.44326523624166,0.413953499971968,"Me1_v2_0200960",1
"GO:0098586","GO:0098586","cellular response to virus","1/48","11/5486",0.0922235362016149,0.44326523624166,0.413953499971968,"Me1_v2_0160920",1
"GO:1901570","GO:1901570","fatty acid derivative biosynthetic process","1/48","11/5486",0.0922235362016149,0.44326523624166,0.413953499971968,"Me1_v2_0160920",1
"GO:0009909","GO:0009909","regulation of flower development","2/48","59/5486",0.0936768511385591,0.44326523624166,0.413953499971968,"Me1_v2_0200960/Me1_v2_0085580",2
"GO:0031329","GO:0031329","regulation of cellular catabolic process","2/48","59/5486",0.0936768511385591,0.44326523624166,0.413953499971968,"Me1_v2_0145730/Me1_v2_0200960",2
"GO:0010605","GO:0010605","negative regulation of macromolecule metabolic process","5/48","279/5486",0.0948981076751952,0.44326523624166,0.413953499971968,"Me1_v2_0122770/Me1_v2_0158440/Me1_v2_0160920/Me1_v2_0182390/Me1_v2_0200960",5
"GO:0051172","GO:0051172","negative regulation of nitrogen compound metabolic process","4/48","200/5486",0.0962829021233915,0.44326523624166,0.413953499971968,"Me1_v2_0122770/Me1_v2_0158440/Me1_v2_0182390/Me1_v2_0200960",4
"GO:0000281","GO:0000281","mitotic cytokinesis","2/48","61/5486",0.0991131085060869,0.44326523624166,0.413953499971968,"Me1_v2_0063710/Me1_v2_0097180",2
"GO:0000038","GO:0000038","very long-chain fatty acid metabolic process","1/48","12/5486",0.100182124377382,0.44326523624166,0.413953499971968,"Me1_v2_0206300",1
"GO:0000291","GO:0000291","nuclear-transcribed mRNA catabolic process, exonucleolytic","1/48","12/5486",0.100182124377382,0.44326523624166,0.413953499971968,"Me1_v2_0122770",1
"GO:0000466","GO:0000466","maturation of 5.8S rRNA from tricistronic rRNA transcript (SSU-rRNA, 5.8S rRNA, LSU-rRNA)","1/48","12/5486",0.100182124377382,0.44326523624166,0.413953499971968,"Me1_v2_0206470",1
"GO:0008356","GO:0008356","asymmetric cell division","1/48","12/5486",0.100182124377382,0.44326523624166,0.413953499971968,"Me1_v2_0063710",1
"GO:0016054","GO:0016054","organic acid catabolic process","2/48","62/5486",0.101864469200534,0.44326523624166,0.413953499971968,"Me1_v2_0123010/Me1_v2_0064910",2
"GO:0046395","GO:0046395","carboxylic acid catabolic process","2/48","62/5486",0.101864469200534,0.44326523624166,0.413953499971968,"Me1_v2_0123010/Me1_v2_0064910",2
"GO:0008654","GO:0008654","phospholipid biosynthetic process","2/48","63/5486",0.104637217835967,0.44326523624166,0.413953499971968,"Me1_v2_0137310/Me1_v2_0137320",2
"GO:0051094","GO:0051094","positive regulation of developmental process","2/48","63/5486",0.104637217835967,0.44326523624166,0.413953499971968,"Me1_v2_0073320/Me1_v2_0064910",2
"GO:0033692","GO:0033692","cellular polysaccharide biosynthetic process","2/48","64/5486",0.107430789341446,0.44326523624166,0.413953499971968,"Me1_v2_0141160/Me1_v2_0137240",2
"GO:0051240","GO:0051240","positive regulation of multicellular organismal process","2/48","64/5486",0.107430789341446,0.44326523624166,0.413953499971968,"Me1_v2_0073320/Me1_v2_0064910",2
"GO:0061640","GO:0061640","cytoskeleton-dependent cytokinesis","2/48","64/5486",0.107430789341446,0.44326523624166,0.413953499971968,"Me1_v2_0063710/Me1_v2_0097180",2
"GO:0007032","GO:0007032","endosome organization","1/48","13/5486",0.108072379771954,0.44326523624166,0.413953499971968,"Me1_v2_0206300",1
"GO:0009834","GO:0009834","plant-type secondary cell wall biogenesis","1/48","13/5486",0.108072379771954,0.44326523624166,0.413953499971968,"Me1_v2_0137240",1
"GO:0016556","GO:0016556","mRNA modification","1/48","13/5486",0.108072379771954,0.44326523624166,0.413953499971968,"Me1_v2_0210670",1
"GO:0034243","GO:0034243","regulation of transcription elongation from RNA polymerase II promoter","1/48","13/5486",0.108072379771954,0.44326523624166,0.413953499971968,"Me1_v2_0085580",1
"GO:0044003","GO:0044003","modulation by symbiont of host process","1/48","13/5486",0.108072379771954,0.44326523624166,0.413953499971968,"Me1_v2_0160920",1
"GO:0045047","GO:0045047","protein targeting to ER","1/48","13/5486",0.108072379771954,0.44326523624166,0.413953499971968,"Me1_v2_0101400",1
"GO:0000226","GO:0000226","microtubule cytoskeleton organization","2/48","65/5486",0.110244626519964,0.44326523624166,0.413953499971968,"Me1_v2_0063710/Me1_v2_0097180",2
"GO:0009555","GO:0009555","pollen development","3/48","134/5486",0.111590232261815,0.44326523624166,0.413953499971968,"Me1_v2_0063710/Me1_v2_0164130/Me1_v2_0132240",3
"GO:0045934","GO:0045934","negative regulation of nucleobase-containing compound metabolic process","3/48","134/5486",0.111590232261815,0.44326523624166,0.413953499971968,"Me1_v2_0158440/Me1_v2_0182390/Me1_v2_0200960",3
"GO:0000910","GO:0000910","cytokinesis","2/48","66/5486",0.113078179958689,0.44326523624166,0.413953499971968,"Me1_v2_0063710/Me1_v2_0097180",2
"GO:0032269","GO:0032269","negative regulation of cellular protein metabolic process","2/48","66/5486",0.113078179958689,0.44326523624166,0.413953499971968,"Me1_v2_0122770/Me1_v2_0200960",2
"GO:0090501","GO:0090501","RNA phosphodiester bond hydrolysis","2/48","66/5486",0.113078179958689,0.44326523624166,0.413953499971968,"Me1_v2_0122770/Me1_v2_0160920",2
"GO:0065008","GO:0065008","regulation of biological quality","6/48","383/5486",0.114937801034334,0.44326523624166,0.413953499971968,"Me1_v2_0227320/Me1_v2_0083360/Me1_v2_0218130/Me1_v2_0184480/Me1_v2_0123010/Me1_v2_0200960",6
"GO:0000077","GO:0000077","DNA damage checkpoint signaling","1/48","14/5486",0.115894876715302,0.44326523624166,0.413953499971968,"Me1_v2_0078310",1
"GO:0009850","GO:0009850","auxin metabolic process","1/48","14/5486",0.115894876715302,0.44326523624166,0.413953499971968,"Me1_v2_0123010",1
"GO:0042335","GO:0042335","cuticle development","1/48","14/5486",0.115894876715302,0.44326523624166,0.413953499971968,"Me1_v2_0083360",1
"GO:0043487","GO:0043487","regulation of RNA stability","1/48","14/5486",0.115894876715302,0.44326523624166,0.413953499971968,"Me1_v2_0200960",1
"GO:0045491","GO:0045491","xylan metabolic process","1/48","14/5486",0.115894876715302,0.44326523624166,0.413953499971968,"Me1_v2_0137240",1
"GO:0045824","GO:0045824","negative regulation of innate immune response","1/48","14/5486",0.115894876715302,0.44326523624166,0.413953499971968,"Me1_v2_0200960",1
"GO:0052547","GO:0052547","regulation of peptidase activity","1/48","14/5486",0.115894876715302,0.44326523624166,0.413953499971968,"Me1_v2_0096270",1
"GO:0031324","GO:0031324","negative regulation of cellular metabolic process","4/48","214/5486",0.115929382424658,0.44326523624166,0.413953499971968,"Me1_v2_0122770/Me1_v2_0158440/Me1_v2_0182390/Me1_v2_0200960",4
"GO:0043067","GO:0043067","regulation of programmed cell death","2/48","67/5486",0.115930907940126,0.44326523624166,0.413953499971968,"Me1_v2_0096270/Me1_v2_0132240",2
"GO:0033043","GO:0033043","regulation of organelle organization","3/48","139/5486",0.121026921129212,0.449287938610931,0.419577939971342,"Me1_v2_0078310/Me1_v2_0063710/Me1_v2_0200960",3
"GO:0006355","GO:0006355","regulation of transcription, DNA-templated","7/48","480/5486",0.121964409632052,0.449287938610931,0.419577939971342,"Me1_v2_0172600/Me1_v2_0078310/Me1_v2_0066970/Me1_v2_0158440/Me1_v2_0182390/Me1_v2_0200960/Me1_v2_0085580",7
"GO:0019219","GO:0019219","regulation of nucleobase-containing compound metabolic process","7/48","480/5486",0.121964409632052,0.449287938610931,0.419577939971342,"Me1_v2_0172600/Me1_v2_0078310/Me1_v2_0066970/Me1_v2_0158440/Me1_v2_0182390/Me1_v2_0200960/Me1_v2_0085580",7
"GO:0019252","GO:0019252","starch biosynthetic process","1/48","15/5486",0.12365018481429,0.449287938610931,0.419577939971342,"Me1_v2_0141160",1
"GO:0031330","GO:0031330","negative regulation of cellular catabolic process","1/48","15/5486",0.12365018481429,0.449287938610931,0.419577939971342,"Me1_v2_0200960",1
"GO:0032784","GO:0032784","regulation of DNA-templated transcription, elongation","1/48","15/5486",0.12365018481429,0.449287938610931,0.419577939971342,"Me1_v2_0085580",1
"GO:0043065","GO:0043065","positive regulation of apoptotic process","1/48","15/5486",0.12365018481429,0.449287938610931,0.419577939971342,"Me1_v2_0096270",1
"GO:0090503","GO:0090503","RNA phosphodiester bond hydrolysis, exonucleolytic","1/48","15/5486",0.12365018481429,0.449287938610931,0.419577939971342,"Me1_v2_0122770",1
"GO:0010564","GO:0010564","regulation of cell cycle process","2/48","72/5486",0.130463733545886,0.455922245780228,0.425773541268445,"Me1_v2_0078310/Me1_v2_0063710",2
"GO:0055046","GO:0055046","microgametogenesis","1/48","16/5486",0.13133886899066,0.455922245780228,0.425773541268445,"Me1_v2_0164130",1
"GO:0060147","GO:0060147","regulation of post-transcriptional gene silencing","1/48","16/5486",0.13133886899066,0.455922245780228,0.425773541268445,"Me1_v2_0160920",1
"GO:0009892","GO:0009892","negative regulation of metabolic process","5/48","311/5486",0.133651027911418,0.455922245780228,0.425773541268445,"Me1_v2_0122770/Me1_v2_0158440/Me1_v2_0160920/Me1_v2_0182390/Me1_v2_0200960",5
"GO:0000271","GO:0000271","polysaccharide biosynthetic process","2/48","74/5486",0.136392962548243,0.455922245780228,0.425773541268445,"Me1_v2_0141160/Me1_v2_0137240",2
"GO:0034637","GO:0034637","cellular carbohydrate biosynthetic process","2/48","74/5486",0.136392962548243,0.455922245780228,0.425773541268445,"Me1_v2_0141160/Me1_v2_0137240",2
"GO:0000288","GO:0000288","nuclear-transcribed mRNA catabolic process, deadenylation-dependent decay","1/48","17/5486",0.138961489518712,0.455922245780228,0.425773541268445,"Me1_v2_0122770",1
"GO:0006536","GO:0006536","glutamate metabolic process","1/48","17/5486",0.138961489518712,0.455922245780228,0.425773541268445,"Me1_v2_0152960",1
"GO:0009910","GO:0009910","negative regulation of flower development","1/48","17/5486",0.138961489518712,0.455922245780228,0.425773541268445,"Me1_v2_0085580",1
"GO:0019915","GO:0019915","lipid storage","1/48","17/5486",0.138961489518712,0.455922245780228,0.425773541268445,"Me1_v2_0184480",1
"GO:0030334","GO:0030334","regulation of cell migration","1/48","17/5486",0.138961489518712,0.455922245780228,0.425773541268445,"Me1_v2_0210670",1
"GO:0031570","GO:0031570","DNA integrity checkpoint signaling","1/48","17/5486",0.138961489518712,0.455922245780228,0.425773541268445,"Me1_v2_0078310",1
"GO:0035821","GO:0035821","modulation of process of another organism","1/48","17/5486",0.138961489518712,0.455922245780228,0.425773541268445,"Me1_v2_0160920",1
"GO:0040012","GO:0040012","regulation of locomotion","1/48","17/5486",0.138961489518712,0.455922245780228,0.425773541268445,"Me1_v2_0210670",1
"GO:0043255","GO:0043255","regulation of carbohydrate biosynthetic process","1/48","17/5486",0.138961489518712,0.455922245780228,0.425773541268445,"Me1_v2_0200960",1
"GO:2000070","GO:2000070","regulation of response to water deprivation","1/48","17/5486",0.138961489518712,0.455922245780228,0.425773541268445,"Me1_v2_0083360",1
"GO:2000145","GO:2000145","regulation of cell motility","1/48","17/5486",0.138961489518712,0.455922245780228,0.425773541268445,"Me1_v2_0210670",1
"GO:0009894","GO:0009894","regulation of catabolic process","2/48","76/5486",0.14238262836809,0.455922245780228,0.425773541268445,"Me1_v2_0145730/Me1_v2_0200960",2
"GO:0048831","GO:0048831","regulation of shoot system development","2/48","76/5486",0.14238262836809,0.455922245780228,0.425773541268445,"Me1_v2_0200960/Me1_v2_0085580",2
"GO:0051248","GO:0051248","negative regulation of protein metabolic process","2/48","76/5486",0.14238262836809,0.455922245780228,0.425773541268445,"Me1_v2_0122770/Me1_v2_0200960",2
"GO:0048522","GO:0048522","positive regulation of cellular process","6/48","408/5486",0.143156511199888,0.455922245780228,0.425773541268445,"Me1_v2_0096270/Me1_v2_0063710/Me1_v2_0160920/Me1_v2_0200960/Me1_v2_0085580/Me1_v2_0210670",6
"GO:0016071","GO:0016071","mRNA metabolic process","3/48","151/5486",0.144823910564609,0.455922245780228,0.425773541268445,"Me1_v2_0122770/Me1_v2_0200960/Me1_v2_0210670",3
"GO:0010311","GO:0010311","lateral root formation","1/48","18/5486",0.146518602062706,0.455922245780228,0.425773541268445,"Me1_v2_0218130",1
"GO:0034754","GO:0034754","cellular hormone metabolic process","1/48","18/5486",0.146518602062706,0.455922245780228,0.425773541268445,"Me1_v2_0123010",1
"GO:0042435","GO:0042435","indole-containing compound biosynthetic process","1/48","18/5486",0.146518602062706,0.455922245780228,0.425773541268445,"Me1_v2_0123010",1
"GO:0044770","GO:0044770","cell cycle phase transition","1/48","18/5486",0.146518602062706,0.455922245780228,0.425773541268445,"Me1_v2_0063710",1
"GO:0050777","GO:0050777","negative regulation of immune response","1/48","18/5486",0.146518602062706,0.455922245780228,0.425773541268445,"Me1_v2_0200960",1
"GO:0071695","GO:0071695","anatomical structure maturation","2/48","79/5486",0.151472200059422,0.457341590165784,0.42709902887277,"Me1_v2_0184480/Me1_v2_0085580",2
"GO:0000460","GO:0000460","maturation of 5.8S rRNA","1/48","19/5486",0.154010757713948,0.457341590165784,0.42709902887277,"Me1_v2_0206470",1
"GO:0009699","GO:0009699","phenylpropanoid biosynthetic process","1/48","19/5486",0.154010757713948,0.457341590165784,0.42709902887277,"Me1_v2_0206300",1
"GO:0010332","GO:0010332","response to gamma radiation","1/48","19/5486",0.154010757713948,0.457341590165784,0.42709902887277,"Me1_v2_0078310",1
"GO:0010506","GO:0010506","regulation of autophagy","1/48","19/5486",0.154010757713948,0.457341590165784,0.42709902887277,"Me1_v2_0145730",1
"GO:0016143","GO:0016143","S-glycoside metabolic process","1/48","19/5486",0.154010757713948,0.457341590165784,0.42709902887277,"Me1_v2_0123010",1
"GO:0019757","GO:0019757","glycosinolate metabolic process","1/48","19/5486",0.154010757713948,0.457341590165784,0.42709902887277,"Me1_v2_0123010",1
"GO:0019760","GO:0019760","glucosinolate metabolic process","1/48","19/5486",0.154010757713948,0.457341590165784,0.42709902887277,"Me1_v2_0123010",1
"GO:0044772","GO:0044772","mitotic cell cycle phase transition","1/48","19/5486",0.154010757713948,0.457341590165784,0.42709902887277,"Me1_v2_0063710",1
"GO:0046486","GO:0046486","glycerolipid metabolic process","2/48","82/5486",0.160676954192846,0.460318862669889,0.429879423707913,"Me1_v2_0137310/Me1_v2_0137320",2
"GO:0006303","GO:0006303","double-strand break repair via nonhomologous end joining","1/48","20/5486",0.161438503027599,0.460318862669889,0.429879423707913,"Me1_v2_0228890",1
"GO:0010675","GO:0010675","regulation of cellular carbohydrate metabolic process","1/48","20/5486",0.161438503027599,0.460318862669889,0.429879423707913,"Me1_v2_0200960",1
"GO:0051270","GO:0051270","regulation of cellular component movement","1/48","20/5486",0.161438503027599,0.460318862669889,0.429879423707913,"Me1_v2_0210670",1
"GO:0051701","GO:0051701","biological process involved in interaction with host","1/48","20/5486",0.161438503027599,0.460318862669889,0.429879423707913,"Me1_v2_0160920",1
"GO:0071395","GO:0071395","cellular response to jasmonic acid stimulus","1/48","20/5486",0.161438503027599,0.460318862669889,0.429879423707913,"Me1_v2_0200960",1
"GO:0071489","GO:0071489","cellular response to red or far red light","1/48","20/5486",0.161438503027599,0.460318862669889,0.429879423707913,"Me1_v2_0066970",1
"GO:1901568","GO:1901568","fatty acid derivative metabolic process","1/48","20/5486",0.161438503027599,0.460318862669889,0.429879423707913,"Me1_v2_0160920",1
"GO:0010941","GO:0010941","regulation of cell death","2/48","83/5486",0.163768750101603,0.460318862669889,0.429879423707913,"Me1_v2_0096270/Me1_v2_0132240",2
"GO:0021700","GO:0021700","developmental maturation","2/48","84/5486",0.166871606930706,0.460318862669889,0.429879423707913,"Me1_v2_0184480/Me1_v2_0085580",2
"GO:0042546","GO:0042546","cell wall biogenesis","2/48","84/5486",0.166871606930706,0.460318862669889,0.429879423707913,"Me1_v2_0164270/Me1_v2_0137240",2
"GO:0002683","GO:0002683","negative regulation of immune system process","1/48","21/5486",0.16880238005919,0.460318862669889,0.429879423707913,"Me1_v2_0200960",1
"GO:0009640","GO:0009640","photomorphogenesis","1/48","21/5486",0.16880238005919,0.460318862669889,0.429879423707913,"Me1_v2_0066970",1
"GO:0009926","GO:0009926","auxin polar transport","1/48","21/5486",0.16880238005919,0.460318862669889,0.429879423707913,"Me1_v2_0083360",1
"GO:0043068","GO:0043068","positive regulation of programmed cell death","1/48","21/5486",0.16880238005919,0.460318862669889,0.429879423707913,"Me1_v2_0096270",1
"GO:0050821","GO:0050821","protein stabilization","1/48","21/5486",0.16880238005919,0.460318862669889,0.429879423707913,"Me1_v2_0200960",1
"GO:1902533","GO:1902533","positive regulation of intracellular signal transduction","1/48","21/5486",0.16880238005919,0.460318862669889,0.429879423707913,"Me1_v2_0096270",1
"GO:0007017","GO:0007017","microtubule-based process","2/48","86/5486",0.173108839930879,0.460318862669889,0.429879423707913,"Me1_v2_0063710/Me1_v2_0097180",2
"GO:0000462","GO:0000462","maturation of SSU-rRNA from tricistronic rRNA transcript (SSU-rRNA, 5.8S rRNA, LSU-rRNA)","1/48","22/5486",0.176102926400847,0.460318862669889,0.429879423707913,"Me1_v2_0206470",1
"GO:0010411","GO:0010411","xyloglucan metabolic process","1/48","22/5486",0.176102926400847,0.460318862669889,0.429879423707913,"Me1_v2_0164270",1
"GO:0010928","GO:0010928","regulation of auxin mediated signaling pathway","1/48","22/5486",0.176102926400847,0.460318862669889,0.429879423707913,"Me1_v2_0218130",1
"GO:0030865","GO:0030865","cortical cytoskeleton organization","1/48","22/5486",0.176102926400847,0.460318862669889,0.429879423707913,"Me1_v2_0097180",1
"GO:0045454","GO:0045454","cell redox homeostasis","1/48","22/5486",0.176102926400847,0.460318862669889,0.429879423707913,"Me1_v2_0227320",1
"GO:0045862","GO:0045862","positive regulation of proteolysis","1/48","22/5486",0.176102926400847,0.460318862669889,0.429879423707913,"Me1_v2_0096270",1
"GO:0070592","GO:0070592","cell wall polysaccharide biosynthetic process","1/48","22/5486",0.176102926400847,0.460318862669889,0.429879423707913,"Me1_v2_0137240",1
"GO:0072330","GO:0072330","monocarboxylic acid biosynthetic process","2/48","88/5486",0.179385387628477,0.460318862669889,0.429879423707913,"Me1_v2_0206300/Me1_v2_0123010",2
"GO:0045087","GO:0045087","innate immune response","2/48","89/5486",0.182537410430944,0.460318862669889,0.429879423707913,"Me1_v2_0160920/Me1_v2_0200960",2
"GO:0002252","GO:0002252","immune effector process","1/48","23/5486",0.183340675217238,0.460318862669889,0.429879423707913,"Me1_v2_0160920",1
"GO:0008284","GO:0008284","positive regulation of cell population proliferation","1/48","23/5486",0.183340675217238,0.460318862669889,0.429879423707913,"Me1_v2_0063710",1
"GO:0009698","GO:0009698","phenylpropanoid metabolic process","1/48","23/5486",0.183340675217238,0.460318862669889,0.429879423707913,"Me1_v2_0206300",1
"GO:0009846","GO:0009846","pollen germination","1/48","23/5486",0.183340675217238,0.460318862669889,0.429879423707913,"Me1_v2_0184480",1
"GO:0009895","GO:0009895","negative regulation of catabolic process","1/48","23/5486",0.183340675217238,0.460318862669889,0.429879423707913,"Me1_v2_0200960",1
"GO:0010942","GO:0010942","positive regulation of cell death","1/48","23/5486",0.183340675217238,0.460318862669889,0.429879423707913,"Me1_v2_0096270",1
"GO:0042538","GO:0042538","hyperosmotic salinity response","1/48","23/5486",0.183340675217238,0.460318862669889,0.429879423707913,"Me1_v2_0123010",1
"GO:0044038","GO:0044038","cell wall macromolecule biosynthetic process","1/48","23/5486",0.183340675217238,0.460318862669889,0.429879423707913,"Me1_v2_0137240",1
"GO:0070589","GO:0070589","cellular component macromolecule biosynthetic process","1/48","23/5486",0.183340675217238,0.460318862669889,0.429879423707913,"Me1_v2_0137240",1
"GO:0006109","GO:0006109","regulation of carbohydrate metabolic process","1/48","24/5486",0.190516155281227,0.462452280306278,0.431871765144325,"Me1_v2_0200960",1
"GO:0009072","GO:0009072","aromatic amino acid family metabolic process","1/48","24/5486",0.190516155281227,0.462452280306278,0.431871765144325,"Me1_v2_0123010",1
"GO:0010102","GO:0010102","lateral root morphogenesis","1/48","24/5486",0.190516155281227,0.462452280306278,0.431871765144325,"Me1_v2_0218130",1
"GO:0031647","GO:0031647","regulation of protein stability","1/48","24/5486",0.190516155281227,0.462452280306278,0.431871765144325,"Me1_v2_0200960",1
"GO:0042430","GO:0042430","indole-containing compound metabolic process","1/48","24/5486",0.190516155281227,0.462452280306278,0.431871765144325,"Me1_v2_0123010",1
"GO:0044786","GO:0044786","cell cycle DNA replication","1/48","24/5486",0.190516155281227,0.462452280306278,0.431871765144325,"Me1_v2_0063710",1
"GO:0006644","GO:0006644","phospholipid metabolic process","2/48","92/5486",0.192043844785705,0.462452280306278,0.431871765144325,"Me1_v2_0137310/Me1_v2_0137320",2
"GO:0044282","GO:0044282","small molecule catabolic process","2/48","92/5486",0.192043844785705,0.462452280306278,0.431871765144325,"Me1_v2_0123010/Me1_v2_0064910",2
"GO:0051301","GO:0051301","cell division","2/48","92/5486",0.192043844785705,0.462452280306278,0.431871765144325,"Me1_v2_0063710/Me1_v2_0097180",2
"GO:0045892","GO:0045892","negative regulation of transcription, DNA-templated","2/48","93/5486",0.195228192505322,0.462452280306278,0.431871765144325,"Me1_v2_0158440/Me1_v2_0182390",2
"GO:0000075","GO:0000075","cell cycle checkpoint signaling","1/48","25/5486",0.197629891009257,0.462452280306278,0.431871765144325,"Me1_v2_0078310",1
"GO:0009615","GO:0009615","response to virus","1/48","25/5486",0.197629891009257,0.462452280306278,0.431871765144325,"Me1_v2_0160920",1
"GO:0010101","GO:0010101","post-embryonic root morphogenesis","1/48","25/5486",0.197629891009257,0.462452280306278,0.431871765144325,"Me1_v2_0218130",1
"GO:0031060","GO:0031060","regulation of histone methylation","1/48","25/5486",0.197629891009257,0.462452280306278,0.431871765144325,"Me1_v2_0200960",1
"GO:2000242","GO:2000242","negative regulation of reproductive process","1/48","25/5486",0.197629891009257,0.462452280306278,0.431871765144325,"Me1_v2_0085580",1
"GO:0006955","GO:0006955","immune response","2/48","94/5486",0.19841969633654,0.462452280306278,0.431871765144325,"Me1_v2_0160920/Me1_v2_0200960",2
"GO:1902679","GO:1902679","negative regulation of RNA biosynthetic process","2/48","94/5486",0.19841969633654,0.462452280306278,0.431871765144325,"Me1_v2_0158440/Me1_v2_0182390",2
"GO:1903507","GO:1903507","negative regulation of nucleic acid-templated transcription","2/48","94/5486",0.19841969633654,0.462452280306278,0.431871765144325,"Me1_v2_0158440/Me1_v2_0182390",2
"GO:0070887","GO:0070887","cellular response to chemical stimulus","5/48","358/5486",0.20143041523476,0.467606321080694,0.436684985408691,"Me1_v2_0227320/Me1_v2_0066970/Me1_v2_0160920/Me1_v2_0116120/Me1_v2_0200960",5
"GO:0009066","GO:0009066","aspartate family amino acid metabolic process","1/48","26/5486",0.20468240249645,0.471414194726075,0.440241056343379,"Me1_v2_0152960",1
"GO:0010051","GO:0010051","xylem and phloem pattern formation","1/48","26/5486",0.20468240249645,0.471414194726075,0.440241056343379,"Me1_v2_0137240",1
"GO:0050832","GO:0050832","defense response to fungus","2/48","98/5486",0.211250177546241,0.484632760253141,0.452585519696591,"Me1_v2_0200960/Me1_v2_0064910",2
"GO:0006952","GO:0006952","defense response","4/48","274/5486",0.216797254040624,0.489978543534686,0.457577803139005,"Me1_v2_0164130/Me1_v2_0160920/Me1_v2_0200960/Me1_v2_0064910",4
"GO:0009064","GO:0009064","glutamine family amino acid metabolic process","1/48","28/5486",0.21860581173086,0.489978543534686,0.457577803139005,"Me1_v2_0152960",1
"GO:0030490","GO:0030490","maturation of SSU-rRNA","1/48","28/5486",0.21860581173086,0.489978543534686,0.457577803139005,"Me1_v2_0206470",1
"GO:0051235","GO:0051235","maintenance of location","1/48","28/5486",0.21860581173086,0.489978543534686,0.457577803139005,"Me1_v2_0184480",1
"GO:0090502","GO:0090502","RNA phosphodiester bond hydrolysis, endonucleolytic","1/48","28/5486",0.21860581173086,0.489978543534686,0.457577803139005,"Me1_v2_0160920",1
"GO:1903311","GO:1903311","regulation of mRNA metabolic process","1/48","28/5486",0.21860581173086,0.489978543534686,0.457577803139005,"Me1_v2_0200960",1
"GO:0032268","GO:0032268","regulation of cellular protein metabolic process","3/48","186/5486",0.221559363386202,0.492822158102389,0.460233378416806,"Me1_v2_0096270/Me1_v2_0122770/Me1_v2_0200960",3
"GO:1901137","GO:1901137","carbohydrate derivative biosynthetic process","3/48","186/5486",0.221559363386202,0.492822158102389,0.460233378416806,"Me1_v2_0137310/Me1_v2_0137320/Me1_v2_0123010",3
"GO:0048443","GO:0048443","stamen development","1/48","29/5486",0.225477728373754,0.494024236324518,0.461355966985919,"Me1_v2_0164270",1
"GO:0048466","GO:0048466","androecium development","1/48","29/5486",0.225477728373754,0.494024236324518,0.461355966985919,"Me1_v2_0164270",1
"GO:0070918","GO:0070918","primary sncRNA processing","1/48","29/5486",0.225477728373754,0.494024236324518,0.461355966985919,"Me1_v2_0160920",1
"GO:1901987","GO:1901987","regulation of cell cycle phase transition","1/48","29/5486",0.225477728373754,0.494024236324518,0.461355966985919,"Me1_v2_0063710",1
"GO:0006972","GO:0006972","hyperosmotic response","1/48","30/5486",0.232290458635448,0.497765268504531,0.464849616471168,"Me1_v2_0123010",1
"GO:0010087","GO:0010087","phloem or xylem histogenesis","1/48","30/5486",0.232290458635448,0.497765268504531,0.464849616471168,"Me1_v2_0164270",1
"GO:0010410","GO:0010410","hemicellulose metabolic process","1/48","30/5486",0.232290458635448,0.497765268504531,0.464849616471168,"Me1_v2_0137240",1
"GO:0060627","GO:0060627","regulation of vesicle-mediated transport","1/48","30/5486",0.232290458635448,0.497765268504531,0.464849616471168,"Me1_v2_0210670",1
"GO:0062012","GO:0062012","regulation of small molecule metabolic process","1/48","30/5486",0.232290458635448,0.497765268504531,0.464849616471168,"Me1_v2_0200960",1
"GO:0071359","GO:0071359","cellular response to dsRNA","1/48","30/5486",0.232290458635448,0.497765268504531,0.464849616471168,"Me1_v2_0160920",1
"GO:0043331","GO:0043331","response to dsRNA","1/48","31/5486",0.239044501521353,0.504841275776143,0.471457709631701,"Me1_v2_0160920",1
"GO:0051170","GO:0051170","import into nucleus","1/48","31/5486",0.239044501521353,0.504841275776143,0.471457709631701,"Me1_v2_0164130",1
"GO:1901606","GO:1901606","alpha-amino acid catabolic process","1/48","31/5486",0.239044501521353,0.504841275776143,0.471457709631701,"Me1_v2_0123010",1
"GO:1901659","GO:1901659","glycosyl compound biosynthetic process","1/48","31/5486",0.239044501521353,0.504841275776143,0.471457709631701,"Me1_v2_0123010",1
"GO:0006351","GO:0006351","transcription, DNA-templated","2/48","108/5486",0.243660881197814,0.506190513638917,0.472717726637153,"Me1_v2_0006640/Me1_v2_0085580",2
"GO:0007010","GO:0007010","cytoskeleton organization","2/48","108/5486",0.243660881197814,0.506190513638917,0.472717726637153,"Me1_v2_0063710/Me1_v2_0097180",2
"GO:0048367","GO:0048367","shoot system development","3/48","196/5486",0.24491763516664,0.506190513638917,0.472717726637153,"Me1_v2_0164270/Me1_v2_0083360/Me1_v2_0137240",3
"GO:0019752","GO:0019752","carboxylic acid metabolic process","5/48","385/5486",0.244993801666186,0.506190513638917,0.472717726637153,"Me1_v2_0152960/Me1_v2_0206300/Me1_v2_0123010/Me1_v2_0155610/Me1_v2_0064910",5
"GO:0006606","GO:0006606","protein import into nucleus","1/48","32/5486",0.245740351920431,0.506190513638917,0.472717726637153,"Me1_v2_0164130",1
"GO:0042274","GO:0042274","ribosomal small subunit biogenesis","1/48","32/5486",0.245740351920431,0.506190513638917,0.472717726637153,"Me1_v2_0206470",1
"GO:0044403","GO:0044403","biological process involved in symbiotic interaction","1/48","32/5486",0.245740351920431,0.506190513638917,0.472717726637153,"Me1_v2_0160920",1
"GO:0008610","GO:0008610","lipid biosynthetic process","3/48","198/5486",0.249641695973626,0.511732621258452,0.477893352106409,"Me1_v2_0137310/Me1_v2_0206300/Me1_v2_0137320",3
"GO:0019439","GO:0019439","aromatic compound catabolic process","2/48","110/5486",0.250180392615243,0.511732621258452,0.477893352106409,"Me1_v2_0122770/Me1_v2_0123010",2
"GO:0016051","GO:0016051","carbohydrate biosynthetic process","2/48","112/5486",0.256706942222363,0.520588553752425,0.486163669631144,"Me1_v2_0141160/Me1_v2_0137240",2
"GO:0044264","GO:0044264","cellular polysaccharide metabolic process","2/48","112/5486",0.256706942222363,0.520588553752425,0.486163669631144,"Me1_v2_0141160/Me1_v2_0137240",2
"GO:0006887","GO:0006887","exocytosis","1/48","34/5486",0.258959434430693,0.520588553752425,0.486163669631144,"Me1_v2_0145730",1
"GO:0016050","GO:0016050","vesicle organization","1/48","34/5486",0.258959434430693,0.520588553752425,0.486163669631144,"Me1_v2_0206300",1
"GO:0051050","GO:0051050","positive regulation of transport","1/48","34/5486",0.258959434430693,0.520588553752425,0.486163669631144,"Me1_v2_0210670",1
"GO:0009893","GO:0009893","positive regulation of metabolic process","4/48","297/5486",0.260721124559431,0.522335129682422,0.487794749986823,"Me1_v2_0096270/Me1_v2_0066970/Me1_v2_0200960/Me1_v2_0085580",4
"GO:0031056","GO:0031056","regulation of histone modification","1/48","35/5486",0.265483636035119,0.526467549425575,0.49165390580634,"Me1_v2_0200960",1
"GO:0042446","GO:0042446","hormone biosynthetic process","1/48","35/5486",0.265483636035119,0.526467549425575,0.49165390580634,"Me1_v2_0123010",1
"GO:0044419","GO:0044419","biological process involved in interspecies interaction between organisms","1/48","35/5486",0.265483636035119,0.526467549425575,0.49165390580634,"Me1_v2_0160920",1
"GO:0009620","GO:0009620","response to fungus","2/48","115/5486",0.266505225194452,0.526707961955252,0.491878420611382,"Me1_v2_0200960/Me1_v2_0064910",2
"GO:0051246","GO:0051246","regulation of protein metabolic process","3/48","206/5486",0.268680473047336,0.529219113578085,0.494223517673462,"Me1_v2_0096270/Me1_v2_0122770/Me1_v2_0200960",3
"GO:0009063","GO:0009063","cellular amino acid catabolic process","1/48","36/5486",0.27195158420432,0.530305589198424,0.495238148077341,"Me1_v2_0123010",1
"GO:0048232","GO:0048232","male gamete generation","1/48","36/5486",0.27195158420432,0.530305589198424,0.495238148077341,"Me1_v2_0164130",1
"GO:0051345","GO:0051345","positive regulation of hydrolase activity","1/48","36/5486",0.27195158420432,0.530305589198424,0.495238148077341,"Me1_v2_0096270",1
"GO:1901605","GO:1901605","alpha-amino acid metabolic process","2/48","118/5486",0.276307423217675,0.535667091897009,0.500245111461175,"Me1_v2_0152960/Me1_v2_0123010",2
"GO:0001510","GO:0001510","RNA methylation","1/48","37/5486",0.278363753737933,0.535667091897009,0.500245111461175,"Me1_v2_0210670",1
"GO:0009751","GO:0009751","response to salicylic acid","1/48","37/5486",0.278363753737933,0.535667091897009,0.500245111461175,"Me1_v2_0160920",1
"GO:0034504","GO:0034504","protein localization to nucleus","1/48","37/5486",0.278363753737933,0.535667091897009,0.500245111461175,"Me1_v2_0164130",1
"GO:1901361","GO:1901361","organic cyclic compound catabolic process","2/48","120/5486",0.282841074602805,0.539034175003203,0.50338953994901,"Me1_v2_0122770/Me1_v2_0123010",2
"GO:0005982","GO:0005982","starch metabolic process","1/48","38/5486",0.284720615514512,0.539034175003203,0.50338953994901,"Me1_v2_0141160",1
"GO:0009744","GO:0009744","response to sucrose","1/48","38/5486",0.284720615514512,0.539034175003203,0.50338953994901,"Me1_v2_0158440",1
"GO:0032940","GO:0032940","secretion by cell","1/48","38/5486",0.284720615514512,0.539034175003203,0.50338953994901,"Me1_v2_0145730",1
"GO:0034285","GO:0034285","response to disaccharide","1/48","38/5486",0.284720615514512,0.539034175003203,0.50338953994901,"Me1_v2_0158440",1
"GO:0000956","GO:0000956","nuclear-transcribed mRNA catabolic process","1/48","39/5486",0.291022636523195,0.54003633466054,0.504325429939398,"Me1_v2_0122770",1
"GO:0010212","GO:0010212","response to ionizing radiation","1/48","39/5486",0.291022636523195,0.54003633466054,0.504325429939398,"Me1_v2_0078310",1
"GO:0010256","GO:0010256","endomembrane system organization","1/48","39/5486",0.291022636523195,0.54003633466054,0.504325429939398,"Me1_v2_0206300",1
"GO:0022412","GO:0022412","cellular process involved in reproduction in multicellular organism","1/48","39/5486",0.291022636523195,0.54003633466054,0.504325429939398,"Me1_v2_0164130",1
"GO:0035194","GO:0035194","post-transcriptional gene silencing by RNA","1/48","39/5486",0.291022636523195,0.54003633466054,0.504325429939398,"Me1_v2_0160920",1
"GO:0046903","GO:0046903","secretion","1/48","39/5486",0.291022636523195,0.54003633466054,0.504325429939398,"Me1_v2_0145730",1
"GO:0045893","GO:0045893","positive regulation of transcription, DNA-templated","2/48","123/5486",0.29263507365366,0.54003633466054,0.504325429939398,"Me1_v2_0200960/Me1_v2_0085580",2
"GO:1903047","GO:1903047","mitotic cell cycle process","2/48","123/5486",0.29263507365366,0.54003633466054,0.504325429939398,"Me1_v2_0063710/Me1_v2_0097180",2
"GO:0002376","GO:0002376","immune system process","2/48","124/5486",0.295897097075548,0.544338999337093,0.508343572930187,"Me1_v2_0160920/Me1_v2_0200960",2
"GO:0044272","GO:0044272","sulfur compound biosynthetic process","1/48","40/5486",0.297270279895122,0.545150826766917,0.509101716764786,"Me1_v2_0123010",1
"GO:0048584","GO:0048584","positive regulation of response to stimulus","2/48","125/5486",0.299157428961378,0.54689717482002,0.510732584312353,"Me1_v2_0096270/Me1_v2_0083360",2
"GO:0031348","GO:0031348","negative regulation of defense response","1/48","41/5486",0.303464004934607,0.5496174702376,0.513272995147664,"Me1_v2_0200960",1
"GO:0042981","GO:0042981","regulation of apoptotic process","1/48","41/5486",0.303464004934607,0.5496174702376,0.513272995147664,"Me1_v2_0096270",1
"GO:0048527","GO:0048527","lateral root development","1/48","41/5486",0.303464004934607,0.5496174702376,0.513272995147664,"Me1_v2_0218130",1
"GO:0009737","GO:0009737","response to abscisic acid","3/48","224/5486",0.312101982914132,0.557295446946523,0.520443251399452,"Me1_v2_0073320/Me1_v2_0158440/Me1_v2_0123010",3
"GO:0005976","GO:0005976","polysaccharide metabolic process","2/48","129/5486",0.312177570921807,0.557295446946523,0.520443251399452,"Me1_v2_0141160/Me1_v2_0137240",2
"GO:0009451","GO:0009451","RNA modification","2/48","130/5486",0.315426274819779,0.557295446946523,0.520443251399452,"Me1_v2_0200960/Me1_v2_0210670",2
"GO:0015074","GO:0015074","DNA integration","1/48","43/5486",0.315691518284666,0.557295446946523,0.520443251399452,"Me1_v2_0087610",1
"GO:0030162","GO:0030162","regulation of proteolysis","1/48","43/5486",0.315691518284666,0.557295446946523,0.520443251399452,"Me1_v2_0096270",1
"GO:1905393","GO:1905393","plant organ formation","1/48","43/5486",0.315691518284666,0.557295446946523,0.520443251399452,"Me1_v2_0218130",1
"GO:0097305","GO:0097305","response to alcohol","3/48","226/5486",0.316956193403626,0.557295446946523,0.520443251399452,"Me1_v2_0073320/Me1_v2_0158440/Me1_v2_0123010",3
"GO:1902680","GO:1902680","positive regulation of RNA biosynthetic process","2/48","131/5486",0.31867204468849,0.557295446946523,0.520443251399452,"Me1_v2_0200960/Me1_v2_0085580",2
"GO:1903508","GO:1903508","positive regulation of nucleic acid-templated transcription","2/48","131/5486",0.31867204468849,0.557295446946523,0.520443251399452,"Me1_v2_0200960/Me1_v2_0085580",2
"GO:0009845","GO:0009845","seed germination","1/48","44/5486",0.321726206346825,0.557295446946523,0.520443251399452,"Me1_v2_0085580",1
"GO:0010876","GO:0010876","lipid localization","1/48","44/5486",0.321726206346825,0.557295446946523,0.520443251399452,"Me1_v2_0184480",1
"GO:0045786","GO:0045786","negative regulation of cell cycle","1/48","44/5486",0.321726206346825,0.557295446946523,0.520443251399452,"Me1_v2_0078310",1
"GO:0090697","GO:0090697","post-embryonic plant organ morphogenesis","1/48","44/5486",0.321726206346825,0.557295446946523,0.520443251399452,"Me1_v2_0218130",1
"GO:0006974","GO:0006974","cellular response to DNA damage stimulus","3/48","229/5486",0.324242671042429,0.557295446946523,0.520443251399452,"Me1_v2_0078310/Me1_v2_0063710/Me1_v2_0228890",3
"GO:0000278","GO:0000278","mitotic cell cycle","2/48","133/5486",0.325154007899948,0.557295446946523,0.520443251399452,"Me1_v2_0063710/Me1_v2_0097180",2
"GO:0005975","GO:0005975","carbohydrate metabolic process","4/48","330/5486",0.326503163423779,0.557295446946523,0.520443251399452,"Me1_v2_0164270/Me1_v2_0141160/Me1_v2_0137240/Me1_v2_0229090",4
"GO:0009250","GO:0009250","glucan biosynthetic process","1/48","45/5486",0.327708775640349,0.557295446946523,0.520443251399452,"Me1_v2_0141160",1
"GO:0010016","GO:0010016","shoot system morphogenesis","1/48","45/5486",0.327708775640349,0.557295446946523,0.520443251399452,"Me1_v2_0083360",1
"GO:0010383","GO:0010383","cell wall polysaccharide metabolic process","1/48","45/5486",0.327708775640349,0.557295446946523,0.520443251399452,"Me1_v2_0137240",1
"GO:0016441","GO:0016441","post-transcriptional gene silencing","1/48","45/5486",0.327708775640349,0.557295446946523,0.520443251399452,"Me1_v2_0160920",1
"GO:1902275","GO:1902275","regulation of chromatin organization","1/48","45/5486",0.327708775640349,0.557295446946523,0.520443251399452,"Me1_v2_0200960",1
"GO:0051726","GO:0051726","regulation of cell cycle","2/48","135/5486",0.331621946227674,0.55765487164209,0.520778908470076,"Me1_v2_0078310/Me1_v2_0063710",2
"GO:0007276","GO:0007276","gamete generation","1/48","46/5486",0.333639666794413,0.55765487164209,0.520778908470076,"Me1_v2_0164130",1
"GO:0009110","GO:0009110","vitamin biosynthetic process","1/48","46/5486",0.333639666794413,0.55765487164209,0.520778908470076,"Me1_v2_0123010",1
"GO:0022603","GO:0022603","regulation of anatomical structure morphogenesis","1/48","46/5486",0.333639666794413,0.55765487164209,0.520778908470076,"Me1_v2_0083360",1
"GO:0048509","GO:0048509","regulation of meristem development","1/48","46/5486",0.333639666794413,0.55765487164209,0.520778908470076,"Me1_v2_0083360",1
"GO:0048638","GO:0048638","regulation of developmental growth","1/48","46/5486",0.333639666794413,0.55765487164209,0.520778908470076,"Me1_v2_0066970",1
"GO:0006629","GO:0006629","lipid metabolic process","4/48","334/5486",0.334604416496731,0.557674027494551,0.520796797606247,"Me1_v2_0137310/Me1_v2_0134440/Me1_v2_0206300/Me1_v2_0137320",4
"GO:0006766","GO:0006766","vitamin metabolic process","1/48","47/5486",0.339519316793285,0.562659491003037,0.525452588089206,"Me1_v2_0123010",1
"GO:0090351","GO:0090351","seedling development","1/48","47/5486",0.339519316793285,0.562659491003037,0.525452588089206,"Me1_v2_0085580",1
"GO:0006402","GO:0006402","mRNA catabolic process","1/48","48/5486",0.34534815900581,0.567162868479044,0.529658171373142,"Me1_v2_0122770",1
"GO:0031047","GO:0031047","gene silencing by RNA","1/48","48/5486",0.34534815900581,0.567162868479044,0.529658171373142,"Me1_v2_0160920",1
"GO:0048528","GO:0048528","post-embryonic root development","1/48","48/5486",0.34534815900581,0.567162868479044,0.529658171373142,"Me1_v2_0218130",1
"GO:0098542","GO:0098542","defense response to other organism","3/48","238/5486",0.34611477614875,0.567162868479044,0.529658171373142,"Me1_v2_0160920/Me1_v2_0200960/Me1_v2_0064910",3
"GO:0048585","GO:0048585","negative regulation of response to stimulus","2/48","140/5486",0.347720981743996,0.568203280224127,0.530629783960993,"Me1_v2_0066970/Me1_v2_0200960",2
"GO:0051173","GO:0051173","positive regulation of nitrogen compound metabolic process","3/48","240/5486",0.350972994010761,0.570580762723821,0.532850051018737,"Me1_v2_0096270/Me1_v2_0200960/Me1_v2_0085580",3
"GO:0045088","GO:0045088","regulation of innate immune response","1/48","49/5486",0.351126623214659,0.570580762723821,0.532850051018737,"Me1_v2_0200960",1
"GO:0006400","GO:0006400","tRNA modification","1/48","50/5486",0.356855135645356,0.578283253054108,0.540043199883189,"Me1_v2_0170690",1
"GO:0010228","GO:0010228","vegetative to reproductive phase transition of meristem","1/48","51/5486",0.362534118995065,0.581047834553735,0.542624968301194,"Me1_v2_0182390",1
"GO:0042127","GO:0042127","regulation of cell population proliferation","1/48","51/5486",0.362534118995065,0.581047834553735,0.542624968301194,"Me1_v2_0063710",1
"GO:0042445","GO:0042445","hormone metabolic process","1/48","51/5486",0.362534118995065,0.581047834553735,0.542624968301194,"Me1_v2_0123010",1
"GO:0044036","GO:0044036","cell wall macromolecule metabolic process","1/48","51/5486",0.362534118995065,0.581047834553735,0.542624968301194,"Me1_v2_0137240",1
"GO:0071229","GO:0071229","cellular response to acid chemical","2/48","146/5486",0.366882282557069,0.585260694537446,0.546559245101097,"Me1_v2_0066970/Me1_v2_0200960",2
"GO:0009611","GO:0009611","response to wounding","1/48","52/5486",0.368163992461163,0.585260694537446,0.546559245101097,"Me1_v2_0123010",1
"GO:0009967","GO:0009967","positive regulation of signal transduction","1/48","52/5486",0.368163992461163,0.585260694537446,0.546559245101097,"Me1_v2_0096270",1
"GO:0051254","GO:0051254","positive regulation of RNA metabolic process","2/48","147/5486",0.370056924448497,0.586675611930544,0.547880598456054,"Me1_v2_0200960/Me1_v2_0085580",2
"GO:0006633","GO:0006633","fatty acid biosynthetic process","1/48","53/5486",0.373745171769566,0.587744423347301,0.548878732734592,"Me1_v2_0206300",1
"GO:0045944","GO:0045944","positive regulation of transcription by RNA polymerase II","1/48","53/5486",0.373745171769566,0.587744423347301,0.548878732734592,"Me1_v2_0085580",1
"GO:0071407","GO:0071407","cellular response to organic cyclic compound","1/48","53/5486",0.373745171769566,0.587744423347301,0.548878732734592,"Me1_v2_0160920",1
"GO:0007005","GO:0007005","mitochondrion organization","1/48","54/5486",0.379278069202855,0.59010018745657,0.551078717570778,"Me1_v2_0096270",1
"GO:0009832","GO:0009832","plant-type cell wall biogenesis","1/48","54/5486",0.379278069202855,0.59010018745657,0.551078717570778,"Me1_v2_0137240",1
"GO:0023056","GO:0023056","positive regulation of signaling","1/48","54/5486",0.379278069202855,0.59010018745657,0.551078717570778,"Me1_v2_0096270",1
"GO:0045595","GO:0045595","regulation of cell differentiation","1/48","54/5486",0.379278069202855,0.59010018745657,0.551078717570778,"Me1_v2_0200960",1
"GO:0010557","GO:0010557","positive regulation of macromolecule biosynthetic process","2/48","153/5486",0.388978235463015,0.60109303396615,0.56134464170658,"Me1_v2_0200960/Me1_v2_0085580",2
"GO:0007034","GO:0007034","vacuolar transport","1/48","56/5486",0.390200650524838,0.60109303396615,0.56134464170658,"Me1_v2_0206300",1
"GO:0009409","GO:0009409","response to cold","2/48","155/5486",0.395233931993677,0.60109303396615,0.56134464170658,"Me1_v2_0063710/Me1_v2_0182390",2
"GO:0006401","GO:0006401","RNA catabolic process","1/48","57/5486",0.395591142011911,0.60109303396615,0.56134464170658,"Me1_v2_0122770",1
"GO:0010647","GO:0010647","positive regulation of cell communication","1/48","57/5486",0.395591142011911,0.60109303396615,0.56134464170658,"Me1_v2_0096270",1
"GO:0034599","GO:0034599","cellular response to oxidative stress","1/48","57/5486",0.395591142011911,0.60109303396615,0.56134464170658,"Me1_v2_0227320",1
"GO:0048438","GO:0048438","floral whorl development","1/48","57/5486",0.395591142011911,0.60109303396615,0.56134464170658,"Me1_v2_0164270",1
"GO:0051640","GO:0051640","organelle localization","1/48","57/5486",0.395591142011911,0.60109303396615,0.56134464170658,"Me1_v2_0096270",1
"GO:0090698","GO:0090698","post-embryonic plant morphogenesis","1/48","57/5486",0.395591142011911,0.60109303396615,0.56134464170658,"Me1_v2_0218130",1
"GO:0010628","GO:0010628","positive regulation of gene expression","2/48","156/5486",0.398351571286932,0.602159351945362,0.562340447430757,"Me1_v2_0200960/Me1_v2_0085580",2
"GO:0044262","GO:0044262","cellular carbohydrate metabolic process","2/48","156/5486",0.398351571286932,0.602159351945362,0.562340447430757,"Me1_v2_0141160/Me1_v2_0137240",2
"GO:0010604","GO:0010604","positive regulation of macromolecule metabolic process","3/48","261/5486",0.401709893510783,0.605670844597444,0.565619736115292,"Me1_v2_0096270/Me1_v2_0200960/Me1_v2_0085580",3
"GO:0090407","GO:0090407","organophosphate biosynthetic process","2/48","158/5486",0.404565834102162,0.608408773649782,0.568176614528541,"Me1_v2_0137310/Me1_v2_0137320",2
"GO:0051336","GO:0051336","regulation of hydrolase activity","1/48","59/5486",0.406232520594916,0.609348780892373,0.569054462047939,"Me1_v2_0096270",1
"GO:0071310","GO:0071310","cellular response to organic substance","3/48","265/5486",0.411281082168743,0.612514641964914,0.572010974682484,"Me1_v2_0066970/Me1_v2_0160920/Me1_v2_0200960",3
"GO:0050776","GO:0050776","regulation of immune response","1/48","60/5486",0.411484195371301,0.612514641964914,0.572010974682484,"Me1_v2_0200960",1
"GO:0071482","GO:0071482","cellular response to light stimulus","1/48","60/5486",0.411484195371301,0.612514641964914,0.572010974682484,"Me1_v2_0066970",1
"GO:0031328","GO:0031328","positive regulation of cellular biosynthetic process","2/48","161/5486",0.413832970365589,0.612891867503468,0.572363255482321,"Me1_v2_0200960/Me1_v2_0085580",2
"GO:0090305","GO:0090305","nucleic acid phosphodiester bond hydrolysis","2/48","161/5486",0.413832970365589,0.612891867503468,0.572363255482321,"Me1_v2_0122770/Me1_v2_0160920",2
"GO:1901617","GO:1901617","organic hydroxy compound biosynthetic process","1/48","61/5486",0.416690380152388,0.614014791912209,0.573411924430835,"Me1_v2_0123010",1
"GO:1901657","GO:1901657","glycosyl compound metabolic process","1/48","61/5486",0.416690380152388,0.614014791912209,0.573411924430835,"Me1_v2_0123010",1
"GO:0080134","GO:0080134","regulation of response to stress","2/48","163/5486",0.419973609362212,0.617297893158026,0.576477924514648,"Me1_v2_0083360/Me1_v2_0200960",2
"GO:1901699","GO:1901699","cellular response to nitrogen compound","1/48","62/5486",0.421851460659796,0.617366863926958,0.576542334463502,"Me1_v2_0160920",1
"GO:0032787","GO:0032787","monocarboxylic acid metabolic process","2/48","164/5486",0.423032378445486,0.617366863926958,0.576542334463502,"Me1_v2_0206300/Me1_v2_0123010",2
"GO:1901135","GO:1901135","carbohydrate derivative metabolic process","3/48","270/5486",0.42318651698241,0.617366863926958,0.576542334463502,"Me1_v2_0137310/Me1_v2_0137320/Me1_v2_0123010",3
"GO:0031325","GO:0031325","positive regulation of cellular metabolic process","3/48","271/5486",0.425559113099809,0.618257857321252,0.57737440926627,"Me1_v2_0096270/Me1_v2_0200960/Me1_v2_0085580",3
"GO:0003002","GO:0003002","regionalization","1/48","63/5486",0.426967819415018,0.618257857321252,0.57737440926627,"Me1_v2_0137240",1
"GO:0009639","GO:0009639","response to red or far red light","1/48","63/5486",0.426967819415018,0.618257857321252,0.57737440926627,"Me1_v2_0066970",1
"GO:0009891","GO:0009891","positive regulation of biosynthetic process","2/48","168/5486",0.435188137225395,0.628605087103348,0.5870374092787,"Me1_v2_0200960/Me1_v2_0085580",2
"GO:0042592","GO:0042592","homeostatic process","2/48","170/5486",0.441217107332994,0.630772854562462,0.58906182909207,"Me1_v2_0227320/Me1_v2_0218130",2
"GO:0017038","GO:0017038","protein import","1/48","66/5486",0.442052342924486,0.630772854562462,0.58906182909207,"Me1_v2_0164130",1
"GO:0019953","GO:0019953","sexual reproduction","1/48","66/5486",0.442052342924486,0.630772854562462,0.58906182909207,"Me1_v2_0164130",1
"GO:0090627","GO:0090627","plant epidermal cell differentiation","1/48","66/5486",0.442052342924486,0.630772854562462,0.58906182909207,"Me1_v2_0063710",1
"GO:0044255","GO:0044255","cellular lipid metabolic process","3/48","278/5486",0.44208012029164,0.630772854562462,0.58906182909207,"Me1_v2_0137310/Me1_v2_0206300/Me1_v2_0137320",3
"GO:0002682","GO:0002682","regulation of immune system process","1/48","67/5486",0.446993576787885,0.633019169527008,0.591159602311322,"Me1_v2_0200960",1
"GO:0090696","GO:0090696","post-embryonic plant organ development","1/48","67/5486",0.446993576787885,0.633019169527008,0.591159602311322,"Me1_v2_0218130",1
"GO:1902531","GO:1902531","regulation of intracellular signal transduction","1/48","68/5486",0.451891954406298,0.633019169527008,0.591159602311322,"Me1_v2_0096270",1
"GO:0032870","GO:0032870","cellular response to hormone stimulus","2/48","174/5486",0.453173697506161,0.633019169527008,0.591159602311322,"Me1_v2_0066970/Me1_v2_0200960",2
"GO:0007346","GO:0007346","regulation of mitotic cell cycle","1/48","69/5486",0.456747839638579,0.633019169527008,0.591159602311322,"Me1_v2_0063710",1
"GO:0009553","GO:0009553","embryo sac development","1/48","69/5486",0.456747839638579,0.633019169527008,0.591159602311322,"Me1_v2_0206470",1
"GO:0009743","GO:0009743","response to carbohydrate","1/48","69/5486",0.456747839638579,0.633019169527008,0.591159602311322,"Me1_v2_0158440",1
"GO:0071669","GO:0071669","plant-type cell wall organization or biogenesis","1/48","69/5486",0.456747839638579,0.633019169527008,0.591159602311322,"Me1_v2_0137240",1
"GO:0043436","GO:0043436","oxoacid metabolic process","4/48","395/5486",0.457914360826392,0.633019169527008,0.591159602311322,"Me1_v2_0152960/Me1_v2_0206300/Me1_v2_0123010/Me1_v2_0064910",4
"GO:0006082","GO:0006082","organic acid metabolic process","4/48","396/5486",0.459898432526621,0.633019169527008,0.591159602311322,"Me1_v2_0152960/Me1_v2_0206300/Me1_v2_0123010/Me1_v2_0064910",4
"GO:0006261","GO:0006261","DNA-templated DNA replication","1/48","70/5486",0.46156159332094,0.633019169527008,0.591159602311322,"Me1_v2_0063710",1
"GO:0007389","GO:0007389","pattern specification process","1/48","70/5486",0.46156159332094,0.633019169527008,0.591159602311322,"Me1_v2_0137240",1
"GO:0048437","GO:0048437","floral organ development","1/48","70/5486",0.46156159332094,0.633019169527008,0.591159602311322,"Me1_v2_0164270",1
"GO:0051169","GO:0051169","nuclear transport","1/48","70/5486",0.46156159332094,0.633019169527008,0.591159602311322,"Me1_v2_0164130",1
"GO:0071478","GO:0071478","cellular response to radiation","1/48","70/5486",0.46156159332094,0.633019169527008,0.591159602311322,"Me1_v2_0066970",1
"GO:0006520","GO:0006520","cellular amino acid metabolic process","2/48","177/5486",0.462049889552192,0.633019169527008,0.591159602311322,"Me1_v2_0152960/Me1_v2_0123010",2
"GO:0045935","GO:0045935","positive regulation of nucleobase-containing compound metabolic process","2/48","177/5486",0.462049889552192,0.633019169527008,0.591159602311322,"Me1_v2_0200960/Me1_v2_0085580",2
"GO:0006913","GO:0006913","nucleocytoplasmic transport","1/48","71/5486",0.466333573291508,0.635909418124783,0.593858727857422,"Me1_v2_0164130",1
"GO:0009733","GO:0009733","response to auxin","1/48","71/5486",0.466333573291508,0.635909418124783,0.593858727857422,"Me1_v2_0218130",1
"GO:0010035","GO:0010035","response to inorganic substance","4/48","400/5486",0.467812964860871,0.636443219636301,0.594357230753468,"Me1_v2_0227320/Me1_v2_0164270/Me1_v2_0083360/Me1_v2_0064910",4
"GO:0016192","GO:0016192","vesicle-mediated transport","2/48","183/5486",0.479558947410515,0.650909476183646,0.607866879243027,"Me1_v2_0145730/Me1_v2_0206300",2
"GO:0019725","GO:0019725","cellular homeostasis","1/48","75/5486",0.485010809244228,0.65375880969556,0.610527795289241,"Me1_v2_0227320",1
"GO:0033044","GO:0033044","regulation of chromosome organization","1/48","75/5486",0.485010809244228,0.65375880969556,0.610527795289241,"Me1_v2_0200960",1
"GO:0044703","GO:0044703","multi-organism reproductive process","1/48","75/5486",0.485010809244228,0.65375880969556,0.610527795289241,"Me1_v2_0164130",1
"GO:0043161","GO:0043161","proteasome-mediated ubiquitin-dependent protein catabolic process","1/48","76/5486",0.489579184989243,0.658399593606223,0.61486169875237,"Me1_v2_0228890",1
"GO:0070925","GO:0070925","organelle assembly","1/48","77/5486",0.494107872442204,0.662799110150276,0.618970289101202,"Me1_v2_0184480",1
"GO:0006259","GO:0006259","DNA metabolic process","3/48","302/5486",0.497332996152738,0.662799110150276,0.618970289101202,"Me1_v2_0063710/Me1_v2_0160920/Me1_v2_0228890",3
"GO:0009314","GO:0009314","response to radiation","3/48","302/5486",0.497332996152738,0.662799110150276,0.618970289101202,"Me1_v2_0083360/Me1_v2_0078310/Me1_v2_0066970",3
"GO:0016053","GO:0016053","organic acid biosynthetic process","2/48","190/5486",0.499560365686201,0.662799110150276,0.618970289101202,"Me1_v2_0206300/Me1_v2_0123010",2
"GO:0046394","GO:0046394","carboxylic acid biosynthetic process","2/48","190/5486",0.499560365686201,0.662799110150276,0.618970289101202,"Me1_v2_0206300/Me1_v2_0123010",2
"GO:0044248","GO:0044248","cellular catabolic process","4/48","418/5486",0.502941008021046,0.662799110150276,0.618970289101202,"Me1_v2_0122770/Me1_v2_0228890/Me1_v2_0123010/Me1_v2_0064910",4
"GO:0010498","GO:0010498","proteasomal protein catabolic process","1/48","79/5486",0.503047529755081,0.662799110150276,0.618970289101202,"Me1_v2_0228890",1
"GO:0051130","GO:0051130","positive regulation of cellular component organization","1/48","79/5486",0.503047529755081,0.662799110150276,0.618970289101202,"Me1_v2_0210670",1
"GO:0097659","GO:0097659","nucleic acid-templated transcription","1/48","79/5486",0.503047529755081,0.662799110150276,0.618970289101202,"Me1_v2_0085580",1
"GO:0033036","GO:0033036","macromolecule localization","3/48","306/5486",0.506298281744621,0.665583134428322,0.621570214607826,"Me1_v2_0164130/Me1_v2_0184480/Me1_v2_0228890",3
"GO:0071495","GO:0071495","cellular response to endogenous stimulus","2/48","193/5486",0.507987483360872,0.666306452390382,0.622245701827455,"Me1_v2_0066970/Me1_v2_0200960",2
"GO:0006302","GO:0006302","double-strand break repair","1/48","81/5486",0.511832447800746,0.666864102368455,0.622766476165953,"Me1_v2_0228890",1
"GO:0009968","GO:0009968","negative regulation of signal transduction","1/48","81/5486",0.511832447800746,0.666864102368455,0.622766476165953,"Me1_v2_0066970",1
"GO:0034655","GO:0034655","nucleobase-containing compound catabolic process","1/48","81/5486",0.511832447800746,0.666864102368455,0.622766476165953,"Me1_v2_0122770",1
"GO:0022622","GO:0022622","root system development","2/48","197/5486",0.519085204747752,0.674810766172077,0.630187652079727,"Me1_v2_0218130/Me1_v2_0123010",2
"GO:0048364","GO:0048364","root development","2/48","198/5486",0.521834628306672,0.675382211593692,0.630721309612463,"Me1_v2_0218130/Me1_v2_0123010",2
"GO:0034645","GO:0034645","cellular macromolecule biosynthetic process","4/48","429/5486",0.523954933401847,0.675382211593692,0.630721309612463,"Me1_v2_0141160/Me1_v2_0137240/Me1_v2_0063710/Me1_v2_0085580",4
"GO:0044265","GO:0044265","cellular macromolecule catabolic process","2/48","199/5486",0.524573969850575,0.675382211593692,0.630721309612463,"Me1_v2_0122770/Me1_v2_0228890",2
"GO:0009856","GO:0009856","pollination","1/48","84/5486",0.524725413349732,0.675382211593692,0.630721309612463,"Me1_v2_0184480",1
"GO:0000375","GO:0000375","RNA splicing, via transesterification reactions","1/48","85/5486",0.528948512231481,0.675382211593692,0.630721309612463,"Me1_v2_0200960",1
"GO:0000377","GO:0000377","RNA splicing, via transesterification reactions with bulged adenosine as nucleophile","1/48","85/5486",0.528948512231481,0.675382211593692,0.630721309612463,"Me1_v2_0200960",1
"GO:0032270","GO:0032270","positive regulation of cellular protein metabolic process","1/48","85/5486",0.528948512231481,0.675382211593692,0.630721309612463,"Me1_v2_0096270",1
"GO:0044706","GO:0044706","multi-multicellular organism process","1/48","85/5486",0.528948512231481,0.675382211593692,0.630721309612463,"Me1_v2_0184480",1
"GO:0010648","GO:0010648","negative regulation of cell communication","1/48","86/5486",0.533134861317371,0.675382211593692,0.630721309612463,"Me1_v2_0066970",1
"GO:0023057","GO:0023057","negative regulation of signaling","1/48","86/5486",0.533134861317371,0.675382211593692,0.630721309612463,"Me1_v2_0066970",1
"GO:0031668","GO:0031668","cellular response to extracellular stimulus","1/48","86/5486",0.533134861317371,0.675382211593692,0.630721309612463,"Me1_v2_0123010",1
"GO:1901575","GO:1901575","organic substance catabolic process","4/48","434/5486",0.533378772232967,0.675382211593692,0.630721309612463,"Me1_v2_0122770/Me1_v2_0228890/Me1_v2_0123010/Me1_v2_0064910",4
"GO:0051247","GO:0051247","positive regulation of protein metabolic process","1/48","87/5486",0.537284773661216,0.676748199634462,0.631996969159309,"Me1_v2_0096270",1
"GO:0015833","GO:0015833","peptide transport","2/48","205/5486",0.5407963103126,0.676748199634462,0.631996969159309,"Me1_v2_0164130/Me1_v2_0228890",2
"GO:0099402","GO:0099402","plant organ development","3/48","322/5486",0.541360628090497,0.676748199634462,0.631996969159309,"Me1_v2_0164270/Me1_v2_0218130/Me1_v2_0123010",3
"GO:0006260","GO:0006260","DNA replication","1/48","88/5486",0.54139855970757,0.676748199634462,0.631996969159309,"Me1_v2_0063710",1
"GO:0032774","GO:0032774","RNA biosynthetic process","1/48","88/5486",0.54139855970757,0.676748199634462,0.631996969159309,"Me1_v2_0085580",1
"GO:0051049","GO:0051049","regulation of transport","1/48","88/5486",0.54139855970757,0.676748199634462,0.631996969159309,"Me1_v2_0210670",1
"GO:0061024","GO:0061024","membrane organization","1/48","89/5486",0.545476527312986,0.677196339002505,0.632415474480072,"Me1_v2_0206300",1
"GO:0071496","GO:0071496","cellular response to external stimulus","1/48","89/5486",0.545476527312986,0.677196339002505,0.632415474480072,"Me1_v2_0123010",1
"GO:0042886","GO:0042886","amide transport","2/48","208/5486",0.548768664823113,0.677196339002505,0.632415474480072,"Me1_v2_0164130/Me1_v2_0228890",2
"GO:0019438","GO:0019438","aromatic compound biosynthetic process","3/48","327/5486",0.552039641547136,0.677196339002505,0.632415474480072,"Me1_v2_0206300/Me1_v2_0123010/Me1_v2_0085580",3
"GO:0051707","GO:0051707","response to other organism","3/48","327/5486",0.552039641547136,0.677196339002505,0.632415474480072,"Me1_v2_0160920/Me1_v2_0200960/Me1_v2_0064910",3
"GO:0006073","GO:0006073","cellular glucan metabolic process","1/48","91/5486",0.553526225813672,0.677196339002505,0.632415474480072,"Me1_v2_0141160",1
"GO:0046677","GO:0046677","response to antibiotic","1/48","91/5486",0.553526225813672,0.677196339002505,0.632415474480072,"Me1_v2_0160920",1
"GO:0022402","GO:0022402","cell cycle process","2/48","210/5486",0.554031641844145,0.677196339002505,0.632415474480072,"Me1_v2_0063710/Me1_v2_0097180",2
"GO:1901701","GO:1901701","cellular response to oxygen-containing compound","2/48","210/5486",0.554031641844145,0.677196339002505,0.632415474480072,"Me1_v2_0066970/Me1_v2_0200960",2
"GO:0043207","GO:0043207","response to external biotic stimulus","3/48","328/5486",0.554158846307245,0.677196339002505,0.632415474480072,"Me1_v2_0160920/Me1_v2_0200960/Me1_v2_0064910",3
"GO:0009607","GO:0009607","response to biotic stimulus","3/48","329/5486",0.556272450293552,0.677196339002505,0.632415474480072,"Me1_v2_0160920/Me1_v2_0200960/Me1_v2_0064910",3
"GO:0045184","GO:0045184","establishment of protein localization","2/48","211/5486",0.556647479735218,0.677196339002505,0.632415474480072,"Me1_v2_0164130/Me1_v2_0228890",2
"GO:0000398","GO:0000398","mRNA splicing, via spliceosome","1/48","92/5486",0.557498559671122,0.677196339002505,0.632415474480072,"Me1_v2_0200960",1
"GO:0065009","GO:0065009","regulation of molecular function","2/48","212/5486",0.559252854274726,0.677196339002505,0.632415474480072,"Me1_v2_0096270/Me1_v2_0228890",2
"GO:0006631","GO:0006631","fatty acid metabolic process","1/48","93/5486",0.561436281053359,0.677196339002505,0.632415474480072,"Me1_v2_0206300",1
"GO:0071214","GO:0071214","cellular response to abiotic stimulus","1/48","93/5486",0.561436281053359,0.677196339002505,0.632415474480072,"Me1_v2_0066970",1
"GO:0104004","GO:0104004","cellular response to environmental stimulus","1/48","93/5486",0.561436281053359,0.677196339002505,0.632415474480072,"Me1_v2_0066970",1
"GO:0044042","GO:0044042","glucan metabolic process","1/48","94/5486",0.565339685190099,0.678611104981534,0.633736686433497,"Me1_v2_0141160",1
"GO:0006281","GO:0006281","DNA repair","2/48","215/5486",0.567005995822794,0.678611104981534,0.633736686433497,"Me1_v2_0063710/Me1_v2_0228890",2
"GO:0009888","GO:0009888","tissue development","2/48","215/5486",0.567005995822794,0.678611104981534,0.633736686433497,"Me1_v2_0164270/Me1_v2_0063710",2
"GO:0009059","GO:0009059","macromolecule biosynthetic process","4/48","453/5486",0.568387268597571,0.678611104981534,0.633736686433497,"Me1_v2_0141160/Me1_v2_0137240/Me1_v2_0063710/Me1_v2_0085580",4
"GO:0031347","GO:0031347","regulation of defense response","1/48","95/5486",0.56920906484716,0.678611104981534,0.633736686433497,"Me1_v2_0200960",1
"GO:0006886","GO:0006886","intracellular protein transport","2/48","216/5486",0.569569320591339,0.678611104981534,0.633736686433497,"Me1_v2_0164130/Me1_v2_0228890",2
"GO:0007049","GO:0007049","cell cycle","2/48","218/5486",0.574664286867511,0.68328985328759,0.638106043825927,"Me1_v2_0063710/Me1_v2_0097180",2
"GO:0048646","GO:0048646","anatomical structure formation involved in morphogenesis","1/48","97/5486",0.57684690958653,0.684493797379554,0.639230374880771,"Me1_v2_0218130",1
"GO:0009735","GO:0009735","response to cytokinin","1/48","98/5486",0.580615948061172,0.685475096324213,0.640146783611815,"Me1_v2_0064910",1
"GO:0040029","GO:0040029","regulation of gene expression, epigenetic","1/48","98/5486",0.580615948061172,0.685475096324213,0.640146783611815,"Me1_v2_0160920",1
"GO:0051641","GO:0051641","cellular localization","3/48","341/5486",0.58118914149882,0.685475096324213,0.640146783611815,"Me1_v2_0096270/Me1_v2_0164130/Me1_v2_0228890",3
"GO:0015031","GO:0015031","protein transport","2/48","223/5486",0.587216243509025,0.689403945052624,0.643815829927686,"Me1_v2_0164130/Me1_v2_0228890",2
"GO:0033554","GO:0033554","cellular response to stress","4/48","464/5486",0.588028901311405,0.689403945052624,0.643815829927686,"Me1_v2_0227320/Me1_v2_0078310/Me1_v2_0063710/Me1_v2_0228890",4
"GO:0043414","GO:0043414","macromolecule methylation","1/48","100/5486",0.588055672788477,0.689403945052624,0.643815829927686,"Me1_v2_0210670",1
"GO:0006396","GO:0006396","RNA processing","3/48","346/5486",0.591321617923159,0.689562245295373,0.643963662273142,"Me1_v2_0160920/Me1_v2_0200960/Me1_v2_0206470",3
"GO:0006310","GO:0006310","DNA recombination","1/48","101/5486",0.591726918185089,0.689562245295373,0.643963662273142,"Me1_v2_0087610",1
"GO:0016570","GO:0016570","histone modification","1/48","101/5486",0.591726918185089,0.689562245295373,0.643963662273142,"Me1_v2_0063710",1
"GO:0043085","GO:0043085","positive regulation of catalytic activity","1/48","103/5486",0.598973555426788,0.695850781872998,0.649836357700559,"Me1_v2_0096270",1
"GO:0034613","GO:0034613","cellular protein localization","2/48","228/5486",0.599502212075198,0.695850781872998,0.649836357700559,"Me1_v2_0164130/Me1_v2_0228890",2
"GO:0009908","GO:0009908","flower development","1/48","104/5486",0.602549492513824,0.698002877466509,0.65184614197952,"Me1_v2_0164270",1
"GO:1901615","GO:1901615","organic hydroxy compound metabolic process","1/48","105/5486",0.60609420161069,0.70072155719813,0.654385043969104,"Me1_v2_0123010",1
"GO:0008380","GO:0008380","RNA splicing","1/48","106/5486",0.609607949672888,0.702931144141873,0.656448517876081,"Me1_v2_0200960",1
"GO:0009266","GO:0009266","response to temperature stimulus","2/48","233/5486",0.611521385752176,0.702931144141873,0.656448517876081,"Me1_v2_0063710/Me1_v2_0182390",2
"GO:0006790","GO:0006790","sulfur compound metabolic process","1/48","107/5486",0.613091001423019,0.702931144141873,0.656448517876081,"Me1_v2_0123010",1
"GO:0019941","GO:0019941","modification-dependent protein catabolic process","1/48","107/5486",0.613091001423019,0.702931144141873,0.656448517876081,"Me1_v2_0228890",1
"GO:0009056","GO:0009056","catabolic process","4/48","479/5486",0.614013358387174,0.702931144141873,0.656448517876081,"Me1_v2_0122770/Me1_v2_0228890/Me1_v2_0123010/Me1_v2_0064910",4
"GO:0090567","GO:0090567","reproductive shoot system development","1/48","108/5486",0.616543619369049,0.704449252599401,0.657866238594853,"Me1_v2_0164270",1
"GO:0010015","GO:0010015","root morphogenesis","1/48","109/5486",0.61996606382243,0.705046775307295,0.658424249004923,"Me1_v2_0218130",1
"GO:0090558","GO:0090558","plant epidermis development","1/48","109/5486",0.61996606382243,0.705046775307295,0.658424249004923,"Me1_v2_0063710",1
"GO:0006511","GO:0006511","ubiquitin-dependent protein catabolic process","1/48","110/5486",0.623358592916074,0.705046775307295,0.658424249004923,"Me1_v2_0228890",1
"GO:0009991","GO:0009991","response to extracellular stimulus","1/48","110/5486",0.623358592916074,0.705046775307295,0.658424249004923,"Me1_v2_0123010",1
"GO:0032879","GO:0032879","regulation of localization","1/48","110/5486",0.623358592916074,0.705046775307295,0.658424249004923,"Me1_v2_0210670",1
"GO:0044093","GO:0044093","positive regulation of molecular function","1/48","111/5486",0.626721462622181,0.705046775307295,0.658424249004923,"Me1_v2_0096270",1
"GO:0044270","GO:0044270","cellular nitrogen compound catabolic process","1/48","111/5486",0.626721462622181,0.705046775307295,0.658424249004923,"Me1_v2_0122770",1
"GO:0046700","GO:0046700","heterocycle catabolic process","1/48","111/5486",0.626721462622181,0.705046775307295,0.658424249004923,"Me1_v2_0122770",1
"GO:0009605","GO:0009605","response to external stimulus","4/48","488/5486",0.629140380162435,0.705046775307295,0.658424249004923,"Me1_v2_0160920/Me1_v2_0123010/Me1_v2_0200960/Me1_v2_0064910",4
"GO:0014070","GO:0014070","response to organic cyclic compound","1/48","112/5486",0.630054926769927,0.705046775307295,0.658424249004923,"Me1_v2_0160920",1
"GO:1901362","GO:1901362","organic cyclic compound biosynthetic process","3/48","366/5486",0.630323869206351,0.705046775307295,0.658424249004923,"Me1_v2_0206300/Me1_v2_0123010/Me1_v2_0085580",3
"GO:0070727","GO:0070727","cellular macromolecule localization","2/48","243/5486",0.634758822994532,0.708652502770613,0.661791541048939,"Me1_v2_0164130/Me1_v2_0228890",2
"GO:0008104","GO:0008104","protein localization","2/48","246/5486",0.641522224222058,0.713251765890938,0.666086669361038,"Me1_v2_0164130/Me1_v2_0228890",2
"GO:0071396","GO:0071396","cellular response to lipid","1/48","116/5486",0.643099730333703,0.713251765890938,0.666086669361038,"Me1_v2_0066970",1
"GO:0019637","GO:0019637","organophosphate metabolic process","2/48","247/5486",0.643755439983616,0.713251765890938,0.666086669361038,"Me1_v2_0137310/Me1_v2_0137320",2
"GO:0030154","GO:0030154","cell differentiation","2/48","247/5486",0.643755439983616,0.713251765890938,0.666086669361038,"Me1_v2_0063710/Me1_v2_0164130",2
"GO:0043632","GO:0043632","modification-dependent macromolecule catabolic process","1/48","117/5486",0.646289900341893,0.714706222495288,0.667444947323535,"Me1_v2_0228890",1
"GO:0048878","GO:0048878","chemical homeostasis","1/48","118/5486",0.649452143736117,0.71684812091628,0.669445208736931,"Me1_v2_0218130",1
"GO:1901565","GO:1901565","organonitrogen compound catabolic process","2/48","252/5486",0.654762587670168,0.721016685083649,0.673338118863542,"Me1_v2_0228890/Me1_v2_0123010",2
"GO:0016072","GO:0016072","rRNA metabolic process","1/48","120/5486",0.655693805922224,0.721016685083649,0.673338118863542,"Me1_v2_0206470",1
"GO:0072594","GO:0072594","establishment of protein localization to organelle","1/48","121/5486",0.658773697334027,0.722329412932125,0.67456404014714,"Me1_v2_0164130",1
"GO:0046907","GO:0046907","intracellular transport","2/48","255/5486",0.661240160816994,0.722329412932125,0.67456404014714,"Me1_v2_0164130/Me1_v2_0228890",2
"GO:0006397","GO:0006397","mRNA processing","1/48","122/5486",0.661826607404477,0.722329412932125,0.67456404014714,"Me1_v2_0200960",1
"GO:0031399","GO:0031399","regulation of protein modification process","1/48","122/5486",0.661826607404477,0.722329412932125,0.67456404014714,"Me1_v2_0200960",1
"GO:1901698","GO:1901698","response to nitrogen compound","1/48","126/5486",0.673773032917993,0.733998555413455,0.685461538928625,"Me1_v2_0160920",1
"GO:0048285","GO:0048285","organelle fission","1/48","127/5486",0.6766944684441,0.735810899702227,0.687154038588315,"Me1_v2_0096270",1
"GO:0009057","GO:0009057","macromolecule catabolic process","2/48","267/5486",0.686209019757719,0.744772312724055,0.695522861545272,"Me1_v2_0122770/Me1_v2_0228890",2
"GO:0009416","GO:0009416","response to light stimulus","2/48","268/5486",0.688222376052123,0.745574240723133,0.696271760567353,"Me1_v2_0083360/Me1_v2_0066970",2
"GO:0071705","GO:0071705","nitrogen compound transport","2/48","270/5486",0.692218285424852,0.748516999951087,0.699019924380773,"Me1_v2_0164130/Me1_v2_0228890",2
"GO:0006357","GO:0006357","regulation of transcription by RNA polymerase II","1/48","135/5486",0.699161812864188,0.754630369973339,0.70472903646633,"Me1_v2_0085580",1
"GO:0006364","GO:0006364","rRNA processing","1/48","136/5486",0.701860417420816,0.754939699292672,0.70501791081043,"Me1_v2_0206470",1
"GO:0051649","GO:0051649","establishment of localization in cell","2/48","275/5486",0.702029395581562,0.754939699292672,0.70501791081043,"Me1_v2_0164130/Me1_v2_0228890",2
"GO:0044283","GO:0044283","small molecule biosynthetic process","2/48","276/5486",0.703961171971231,0.755628046978293,0.705660740228042,"Me1_v2_0206300/Me1_v2_0123010",2
"GO:0051603","GO:0051603","proteolysis involved in cellular protein catabolic process","1/48","138/5486",0.707186708309826,0.757700044617671,0.707595723178716,"Me1_v2_0228890",1
"GO:0071554","GO:0071554","cell wall organization or biogenesis","1/48","139/5486",0.709814800681017,0.759125518095786,0.708926934577981,"Me1_v2_0137240",1
"GO:0032259","GO:0032259","methylation","1/48","141/5486",0.71500188159216,0.761887250876892,0.711506042654263,"Me1_v2_0210670",1
"GO:1905392","GO:1905392","plant organ morphogenesis","1/48","141/5486",0.71500188159216,0.761887250876892,0.711506042654263,"Me1_v2_0218130",1
"GO:0044257","GO:0044257","cellular protein catabolic process","1/48","143/5486",0.720098140860676,0.765812372234465,0.71517160807861,"Me1_v2_0228890",1
"GO:0033365","GO:0033365","protein localization to organelle","1/48","144/5486",0.722612699954572,0.765812372234465,0.71517160807861,"Me1_v2_0164130",1
"GO:0048827","GO:0048827","phyllome development","1/48","144/5486",0.722612699954572,0.765812372234465,0.71517160807861,"Me1_v2_0164270",1
"GO:0042742","GO:0042742","defense response to bacterium","1/48","145/5486",0.725105135447305,0.767064202959627,0.716340659174173,"Me1_v2_0200960",1
"GO:0009755","GO:0009755","hormone-mediated signaling pathway","1/48","149/5486",0.734857428243627,0.775977609246429,0.724664649930539,"Me1_v2_0066970",1
"GO:0042254","GO:0042254","ribosome biogenesis","1/48","156/5486",0.751115132026377,0.791715949973749,0.739362263673191,"Me1_v2_0206470",1
"GO:0048869","GO:0048869","cellular developmental process","2/48","307/5486",0.758971909561142,0.798558573908756,0.745752406403318,"Me1_v2_0063710/Me1_v2_0164130",2
"GO:0006325","GO:0006325","chromatin organization","1/48","170/5486",0.780756045761974,0.820004105513025,0.765779812435915,"Me1_v2_0063710",1
"GO:0009617","GO:0009617","response to bacterium","1/48","171/5486",0.782735675145613,0.820295726478971,0.766052149424356,"Me1_v2_0200960",1
"GO:0046686","GO:0046686","response to cadmium ion","1/48","172/5486",0.784697798869604,0.820295726478971,0.766052149424356,"Me1_v2_0064910",1
"GO:0018130","GO:0018130","heterocycle biosynthetic process","2/48","324/5486",0.785326318968275,0.820295726478971,0.766052149424356,"Me1_v2_0123010/Me1_v2_0085580",2
"GO:0030163","GO:0030163","protein catabolic process","1/48","173/5486",0.786642568469577,0.820295726478971,0.766052149424356,"Me1_v2_0228890",1
"GO:0050790","GO:0050790","regulation of catalytic activity","1/48","174/5486",0.78857013419769,0.820842577412186,0.766562838824875,"Me1_v2_0096270",1
"GO:0009653","GO:0009653","anatomical structure morphogenesis","2/48","328/5486",0.791158180250091,0.821877545187178,0.76752936743526,"Me1_v2_0083360/Me1_v2_0218130",2
"GO:0006979","GO:0006979","response to oxidative stress","1/48","176/5486",0.79237424869328,0.821877545187178,0.76752936743526,"Me1_v2_0227320",1
"GO:0009793","GO:0009793","embryo development ending in seed dormancy","1/48","178/5486",0.796111319105958,0.824292250755727,0.769784396117359,"Me1_v2_0063710",1
"GO:0034470","GO:0034470","ncRNA processing","1/48","184/5486",0.806931737343531,0.834019551847995,0.778868461374916,"Me1_v2_0206470",1
"GO:0022613","GO:0022613","ribonucleoprotein complex biogenesis","1/48","185/5486",0.808679620521107,0.834351989426539,0.779178915901707,"Me1_v2_0206470",1
"GO:0071702","GO:0071702","organic substance transport","2/48","345/5486",0.814451642960956,0.838827836500281,0.783358789282314,"Me1_v2_0164130/Me1_v2_0228890",2
"GO:0022607","GO:0022607","cellular component assembly","2/48","349/5486",0.819593553648584,0.842640121062252,0.786918979453547,"Me1_v2_0184480/Me1_v2_0097180",2
"GO:0009651","GO:0009651","response to salt stress","1/48","198/5486",0.830039693927112,0.851882843767299,0.795550509968922,"Me1_v2_0123010",1
"GO:0009790","GO:0009790","embryo development","1/48","206/5486",0.842004345045862,0.862648934941907,0.805604673387044,"Me1_v2_0063710",1
"GO:0006970","GO:0006970","response to osmotic stress","1/48","220/5486",0.860988818364054,0.880556746054146,0.822328297259743,"Me1_v2_0123010",1
"GO:0034660","GO:0034660","ncRNA metabolic process","1/48","231/5486",0.874320809876821,0.892631193329739,0.833604299303885,"Me1_v2_0206470",1
"GO:0034654","GO:0034654","nucleobase-containing compound biosynthetic process","1/48","235/5486",0.878851447470917,0.895693548380639,0.836464150444537,"Me1_v2_0085580",1
"GO:0010038","GO:0010038","response to metal ion","1/48","244/5486",0.888468639494612,0.902830984954985,0.843129610781174,"Me1_v2_0064910",1
"GO:0055085","GO:0055085","transmembrane transport","2/48","416/5486",0.888941277494139,0.902830984954985,0.843129610781174,"Me1_v2_0218130/Me1_v2_0117660",2
"GO:0044271","GO:0044271","cellular nitrogen compound biosynthetic process","2/48","436/5486",0.904381924232505,0.916921015036422,0.856287911478008,"Me1_v2_0123010/Me1_v2_0085580",2
"GO:0007154","GO:0007154","cell communication","2/48","453/5486",0.915942842809364,0.927035576199789,0.865733628515863,"Me1_v2_0066970/Me1_v2_0123010",2
"GO:0051276","GO:0051276","chromosome organization","1/48","284/5486",0.922910733359452,0.932474575155923,0.870812963573412,"Me1_v2_0063710",1
"GO:0006468","GO:0006468","protein phosphorylation","1/48","291/5486",0.927756955968915,0.93575486076175,0.873876334206655,"Me1_v2_0063710",1
"GO:0016310","GO:0016310","phosphorylation","1/48","353/5486",0.959508470170995,0.966114380464771,0.902228274334172,"Me1_v2_0063710",1
"GO:0006508","GO:0006508","proteolysis","1/48","367/5486",0.964505008153505,0.969453239792342,0.905346345393119,"Me1_v2_0228890",1
"GO:0023052","GO:0023052","signaling","1/48","372/5486",0.96613886974177,0.969453239792342,0.905346345393119,"Me1_v2_0066970",1
"GO:0007165","GO:0007165","signal transduction","1/48","391/5486",0.971702485129196,0.973366359247568,0.909000702563181,"Me1_v2_0066970",1
"GO:1901566","GO:1901566","organonitrogen compound biosynthetic process","1/48","438/5486",0.981900981228022,0.981900981228022,0.916970956828328,"Me1_v2_0123010",1
