Description	time	Count
photosynthesis, light harvesting in photosystem I	0.5	1
photosynthesis, light harvesting	0.5	1
photosynthesis	0.5	1
response to high light intensity	0.5	1
response to low light intensity stimulus	0.5	1
response to cold	0.5	1
response to light stimulus	0.5	1
photosynthesis, light reaction	0.5	1
response to far red light	0.5	1
response to radiation	0.5	1
response to red light	0.5	1
response to light intensity	0.5	1
regulation of stomatal movement	0.5	1
cellular response to far red light	0.5	1
cellular response to blue light	0.5	1
response to red or far red light	0.5	1
response to karrikin	0.5	1
cellular response to red or far red light	0.5	1
transmembrane transport	0.5	1
ion transmembrane transport	0.5	1
photosynthesis, light harvesting in photosystem I	1	1
photosynthesis, light harvesting	1	1
photosynthesis	1	1
response to high light intensity	1	1
response to low light intensity stimulus	1	1
response to cold	1	1
response to light stimulus	1	1
photosynthesis, light reaction	1	1
response to far red light	1	1
response to radiation	1	1
response to red light	1	1
response to light intensity	1	1
regulation of stomatal movement	1	1
cellular response to far red light	1	1
cellular response to blue light	1	1
response to red or far red light	1	1
response to karrikin	1	1
cellular response to red or far red light	1	1
transmembrane transport	1	1
ion transmembrane transport	1	1
photosynthesis, light harvesting in photosystem I	2	1
photosynthesis, light harvesting	2	1
photosynthesis	2	1
response to high light intensity	2	1
response to low light intensity stimulus	2	1
response to cold	2	1
response to light stimulus	2	1
photosynthesis, light reaction	2	1
response to far red light	2	1
response to radiation	2	1
response to red light	2	1
response to light intensity	2	1
regulation of stomatal movement	2	1
cellular response to far red light	2	1
cellular response to blue light	2	1
response to red or far red light	2	1
response to karrikin	2	1
cellular response to red or far red light	2	1
transmembrane transport	2	1
ion transmembrane transport	2	1
photosynthesis, light harvesting in photosystem I	4	1
photosynthesis, light harvesting	4	1
photosynthesis	4	1
response to high light intensity	4	1
response to low light intensity stimulus	4	1
response to cold	4	1
response to light stimulus	4	1
photosynthesis, light reaction	4	1
response to far red light	4	1
response to radiation	4	1
response to red light	4	1
response to light intensity	4	1
regulation of stomatal movement	4	1
cellular response to far red light	4	1
cellular response to blue light	4	1
response to red or far red light	4	1
response to karrikin	4	1
cellular response to red or far red light	4	1
transmembrane transport	4	1
ion transmembrane transport	4	1
photosynthesis, light harvesting in photosystem I	6	10
photosynthesis, light harvesting	6	11
photosynthesis	6	18
response to high light intensity	6	12
response to low light intensity stimulus	6	5
response to cold	6	18
response to light stimulus	6	26
photosynthesis, light reaction	6	11
response to far red light	6	7
response to radiation	6	26
response to red light	6	7
response to light intensity	6	12
regulation of stomatal movement	6	10
cellular response to far red light	6	1
cellular response to blue light	6	1
response to red or far red light	6	1
response to karrikin	6	1
cellular response to red or far red light	6	1
transmembrane transport	6	1
ion transmembrane transport	6	1
photosynthesis, light harvesting in photosystem I	24	6
photosynthesis, light harvesting	24	7
photosynthesis	24	1
response to high light intensity	24	12
response to low light intensity stimulus	24	1
response to cold	24	1
response to light stimulus	24	30
photosynthesis, light reaction	24	1
response to far red light	24	8
response to radiation	24	31
response to red light	24	8
response to light intensity	24	15
regulation of stomatal movement	24	1
cellular response to far red light	24	5
cellular response to blue light	24	6
response to red or far red light	24	11
response to karrikin	24	9
cellular response to red or far red light	24	6
transmembrane transport	24	40
ion transmembrane transport	24	23
