"","x"
"1","Pp3c21_20850V3"
"2","Pp3c21_1350V3"
"3","Pp3c26_12650V3"
"4","Pp3c22_8560V3"
"5","Pp3c1_31280V3"
"6","Pp3c10_14590V3"
"7","Pp3c18_19780V3"
"8","Pp3c5_3740V3"
"9","Pp3c4_5730V3"
"10","Pp3c19_9150V3"
"11","Pp3c13_12670V3"
"12","Pp3c1_25080V3"
"13","Pp3c23_2010V3"
"14","Pp3c20_1460V3"
"15","Pp3c3_5070V3"
"16","Pp3c3_25560V3"
"17","Pp3c3_23410V3"
"18","Pp3c13_22210V3"
"19","Pp3c12_2810V3"
"20","Pp3c21_15670V3"
