Orthogroup	P_margaritaceum	Other
OG0000006	pm013832g0010, pm028834g0030, pm015146.t2, pm036857g0020	Pp3c4_27870
OG0000008	pm011871g0030, pm001980g0030, pm008823g0020	UTEX1560_18370
OG0000012	pm006626g0030, pm022123g0020	Bradi1g13207
OG0000012	pm006626g0030, pm022123g0020	Zm00001d033471, Zm00001d013630
OG0000012	pm006626g0030, pm022123g0020	LOC_Os03g45450
OG0000012	pm006626g0030, pm022123g0020	SM000055S18217, SM000313S11960, SM000109S14155, SM000976S25178, SM000183S03966, SM000677S20274, SM000082S22869, SM000291S10854, SM000057S18399
OG0000016	pm025067.t1	AagrOXF_evm.TU.utg000058l.175, AagrOXF_evm.TU.utg000091l.110
OG0000016	pm002561g0050, pm184738g0010, pm002297g0040, pm049061g0010, pm233876g0010, pm002892g0050	AT1G35460, AT4G09180
OG0000022	pm006022g0060, pm001140g0130, pm015066g0010, pm001140g0110, pm012040g0010, pm013106g0010, pm025803g0010	Bradi2g03905
OG0000022	pm004208g0020	AagrOXF_evm.TU.utg000094l.94
OG0000022	pm004208g0020	Mp3g22080
OG0000022	pm004208g0020	152133
OG0000022	pm004208g0020	Azfi_s0008.g011474, Azfi_s0038.g026325
OG0000022	pm004208g0020	LOC_Os07g33110
OG0000022	pm004208g0020	Zm00001d021623, Zm00001d006479
OG0000022	pm004208g0020	Bradi1g26310
OG0000022	pm004208g0020	AT1G50700, AT3G20410
OG0000022	pm004208g0020	Solyc07g064610, Solyc12g005040, Solyc12g005030
OG0000032	pm008158g0020, pm003744g0080, pm082185g0010, pm023884g0010, pm017492g0010, pm033144g0010	Azfi_s0153.g053480
OG0000063	pm003617g0020	Pp3c3_4980, Pp3c2_34270, Pp3c4_26640, Pp3c11_26130
OG0000063	pm003617g0020	AagrOXF_evm.TU.utg000049l.25, AagrOXF_evm.TU.utg000091l.609, AagrOXF_evm.TU.utg000091l.608, AagrOXF_evm.TU.utg000049l.35, AagrOXF_evm.TU.utg000024l.92, AagrOXF_evm.TU.utg000049l.29
OG0000063	pm003617g0020	Mp5g05310
OG0000063	pm003617g0020	Solyc11g008720
OG0000063	pm003617g0020	AT5G36890
OG0000063	pm003617g0020	Bradi2g57640
OG0000063	pm003617g0020	LOC_Os01g67220
OG0000063	pm003617g0020	Zm00001d042507, Zm00001d012159
OG0000063	pm003617g0020	Azfi_s0322.g064520, Azfi_s0202.g057640, Azfi_s0247.g060090
OG0000063	pm003617g0020	268319, 98083
OG0000064	pm030753.t1, pm001918.t1, pm001464g0050, pm000179g0020, pm010861g0010, pm066473g0010, pm001919.t1	Pp3c10_9750, Pp3c14_8590
OG0000077	pm020923g0010	Azfi_s0241.g059757
OG0000099	pm007313g0030	427382
OG0000134	pm003255g0010, pm025617g0020, pm041297g0010, pm066949g0010	Zci1a_10546, Zci1a_32003
OG0000141	pm112076g0010	AT1G11370, AT5G20860, AT1G53840, AT3G14300, AT3G10710, AT5G04960, AT3G05610, AT5G27870, AT4G15980, AT3G06830, AT5G49180, AT2G26450, AT4G33230, AT2G43050, AT3G59010, AT3G49220, AT5G53370, AT3G60730, AT1G23200, AT4G00190, AT2G45220, AT3G47400, AT5G51490, AT5G51500, AT1G53830, AT3G14310, AT4G02320, AT4G02300, AT3G05620, AT3G43270, AT4G33220, AT2G26440, AT3G10720, AT5G04970, AT2G47550, AT1G02810, AT4G02330
OG0000141	pm112076g0010	Solyc03g123620.4, Solyc02g014300, Solyc02g081990, Solyc01g099940, Solyc05g054360, Solyc01g066360, Solyc12g099410, Solyc01g066410.1, Solyc01g066420, Solyc01g066390, Solyc01g057220, Solyc07g017560, Solyc06g051960, Solyc03g083360, Solyc01g091050, Solyc03g083870, Solyc06g034360, Solyc03g083840, Solyc03g123630, Solyc09g075350, Solyc06g009190, Solyc02g080220, Solyc02g080200, Solyc07g064190.3, Solyc07g064170.3, Solyc07g064180, Solyc01g099960, Solyc07g017600, Solyc05g047590, Solyc01g098940, Solyc01g099950.1, Solyc09g075330, Solyc06g009180
OG0000141	pm112076g0010	Zm00001d028819, Zm00001d022567, Zm00001d007211, Zm00001d025588, Zm00001d003431, Zm00001d032100, Zm00001d020586, Zm00001d005792, Zm00001d007290, Zm00001d015934, Zm00001d022460, Zm00001d040650, Zm00001d008334, Zm00001d050082, Zm00001d045048, Zm00001d040649, Zm00001d009899
OG0000141	pm112076g0010	Bradi1g64860, Bradi1g16780, Bradi5g23550, Bradi5g12300, Bradi4g30980, Bradi1g17940, Bradi2g11860, Bradi2g52140, Bradi2g09090, Bradi3g37340, Bradi2g11850, Bradi2g27930
OG0000141	pm112076g0010	LOC_Os03g18860, LOC_Os07g49100, LOC_Os04g54850, LOC_Os04g38560, LOC_Os08g34910, LOC_Os09g26360, LOC_Os11g07090, LOC_Os02g54190, LOC_Os01g13320, LOC_Os02g18650, LOC_Os07g47830, LOC_Os01g21034, LOC_Os01g57854, LOC_Os01g15039, LOC_Os09g37360, LOC_Os08g34900, LOC_Os06g09340, LOC_Os01g20980, LOC_Os05g29790
OG0000141	pm112076g0010	Azfi_s0113.g045942, Azfi_s0215.g058412, Azfi_s3003.g114000, Azfi_s0006.g009946, Azfi_s3257.g115118, Azfi_s0001.g000977, Azfi_s1989.g108563, Azfi_s0133.g049315, Azfi_s0145.g051666, Azfi_s0205.g057775, Azfi_s0205.g057784, Azfi_s0022.g015989, Azfi_s0215.g058411
OG0000141	pm112076g0010	AagrOXF_evm.TU.utg000006l.1079, AagrOXF_evm.TU.utg000009l.14, AagrOXF_evm.TU.utg000009l.2, AagrOXF_evm.TU.utg000009l.11, AagrOXF_evm.TU.utg000009l.12
OG0000141	pm112076g0010	266995, 154356
OG0000141	pm112076g0010	Pp3c9_11010, Pp3c2_35260
OG0000144	pm001158g0050, pm009480g0010, pm001908g0030, pm000171g0070, pm000508g0060, pm018167g0010, pm060359g0010, pm021460g0010, pm021460g0020	425757
OG0000171	pm000105g0040, pm009271g0010, pm009185g0010	PRCOL_00007022_RA
OG0000171	pm000105g0040, pm009271g0010, pm009185g0010	Cre09.g407700_4532, Cre05.g247851_4532
OG0000171	pm000105g0040, pm009271g0010, pm009185g0010	Olucimarinus_7559
OG0000171	pm000105g0040, pm009271g0010, pm009185g0010	Chrsp45S06034
OG0000171	pm000105g0040, pm009271g0010, pm009185g0010	3488
OG0000176	pm039307g0010, pm001219g0010, pm015308g0010	Me1_v2_0068980
OG0000176	pm039307g0010, pm001219g0010, pm015308g0010	Zci_07402
OG0000176	pm039307g0010, pm001219g0010, pm015308g0010	UTEX1559_08480
OG0000176	pm039307g0010, pm001219g0010, pm015308g0010	UTEX1560_07318
OG0000176	pm039307g0010, pm001219g0010, pm015308g0010	Zci1a_07828, Zci1a_07830
OG0000182	pm003960.t2	LOC_Os09g31420
OG0000185	pm030383g0020, pm000784g0040, pm013126g0010, pm040159g0010, pm008926g0010	Solyc01g014370
OG0000194	pm030200g0020, pm000720g0030, pm000430g0040, pm001448.t3, pm002685g0010	AagrOXF_evm.TU.utg000006l.773
OG0000212	pm011260g0010, pm002720g0010, pm015432g0030, pm001616g0040	Azfi_s0087.g042383, Azfi_s3749.g116750, Azfi_s0129.g048880, Azfi_s0160.g054011
OG0000220	pm001926g0020	Zm00001d011197
OG0000220	pm001926g0020	Bradi2g41973
OG0000220	pm001926g0020	LOC_Os01g40200
OG0000220	pm001926g0020	AT5G20450
OG0000220	pm001926g0020	CBR_g66753
OG0000231	pm011257g0040, pm002615.t2, pm002615g0020, pm012144g0010	Azfi_s0619.g079567, Azfi_s0043.g027028, Azfi_s1026.g095464, Azfi_s1506.g103797
OG0000231	pm011257g0040	LOC_Os08g36600
OG0000252	pm003442g0060, pm008420g0010	Olucimarinus_93385, Olucimarinus_32666
OG0000252	pm003442g0060, pm008420g0010	7677
OG0000252	pm003442g0060, pm008420g0010	Chrsp3S05609
OG0000252	pm003442g0060, pm008420g0010	SM000002S05598, SM000008S22307, SM000126S26308
OG0000252	pm003442g0060, pm008420g0010	Me1_v2_0054590
OG0000252	pm003442g0060, pm008420g0010	Me1_v2_0054590
OG0000252	pm003442g0060, pm008420g0010	LOC_Os11g04120
OG0000268	pm010292g0010, pm001135g0050, pm012043g0010, pm021838g0010	230177
OG0000268	pm010292g0010, pm001135g0050, pm012043g0010, pm021838g0010	Mp6g06660
OG0000292	pm006177g0020, pm007368g0020	LOC_Os03g45350
OG0000309	pm003628g0020	Solyc08g082810
OG0000309	pm003628g0020	Bradi2g08187
OG0000309	pm003628g0020	Zm00001d039265, Zm00001d009016
OG0000309	pm003628g0020	LOC_Os01g13550
OG0000309	pm003628g0020	Azfi_s0206.g057798
OG0000313	pm000070g0030, pm008850g0050	27571
OG0000313	pm000070g0030, pm008850g0050	Chrsp4S06396
OG0000313	pm000070g0030, pm008850g0050	Olucimarinus_31565
OG0000313	pm000070g0030, pm008850g0050	PRCOL_00005942_RA
OG0000313	pm000070g0030, pm008850g0050	SM000019S05106, SM000029S10463
OG0000338	pm060627g0010	Chrsp22S03456
OG0000338	pm060627g0010	Cre12.g560150_4532
OG0000338	pm060627g0010	PRCOL_00006036_RA
OG0000338	pm060627g0010	Olucimarinus_12689
OG0000338	pm060627g0010	24765
OG0000360	pm001083g0010, pm002168g0020, pm006239g0010, pm002993.t1, pm000675g0030, pm001375.t2, pm002526g0020, pm006823g0020, pm003898.t1, pm006941g0020, pm010769g0020, pm008603g0010, pm008603g0020, pm018821g0010, pm009256g0010, pm012474g0030, pm009256g0020, pm012474g0020, pm021423g0010, pm008445g0010, pm005842g0020, pm023754g0010, pm015847g0010, pm000626g0010, pm001197g0010, pm003129g0030, pm004734g0010, pm000626g0030, pm001197.t1, pm001197g0020, pm014761g0020, pm003129g0010, pm000626g0040, pm014761g0010, pm051693g0010, pm010835g0030, pm001850g0020, pm016429g0060	Mp5g18310
OG0000401	pm000532g0010, pm008214g0010, pm009991g0020, pm000532g0040, pm014980g0010, pm000532g0050, pm006126g0010, pm000532g0060	Pp3c10_22860
OG0000420	pm000177g0040, pm009294g0010, pm000949g0070, pm041917g0010	Solyc01g057670.1
OG0000420	pm000177g0040, pm009294g0010, pm000949g0070, pm041917g0010	AT5G37760
OG0000441	pm011636g0040, pm006627g0040, pm012829g0020, pm016284g0040, pm043429.t1	231160
OG0000482	pm017987.t1, pm004066g0040	UTEX1560_13535
OG0000516	pm008498g0050	AagrOXF_evm.TU.utg000083l.271
OG0000516	pm001112g0010	AagrOXF_evm.TU.utg000083l.268
OG0000532	pm008373g0050	Chrsp98S08478
OG0000532	pm008373g0050	12009
OG0000532	pm008373g0050	Olucimarinus_14387
OG0000532	pm008373g0050	PRCOL_00006043_RA
OG0000557	pm002561g0020	Pp3c25_13970, Pp3c6_170, Pp3c6_80
OG0000557	pm002561g0020	LOC_Os02g07490, LOC_Os06g45590
OG0000557	pm002561g0020	Zm00001d015383, Zm00001d053798
OG0000557	pm002561g0020	Bradi3g05300, Bradi1g32087
OG0000557	pm002561g0020	Solyc10g005510
OG0000557	pm002561g0020	AT1G16300, AT1G79530
OG0000557	pm002561g0020	Azfi_s0084.g038951, Azfi_s0087.g042390, Azfi_s0129.g048877
OG0000557	pm002561g0020	439282, 234134
OG0000557	pm002561g0020	Mp6g02860, Mp6g02290
OG0000582	pm245279g0010, pm005624g0040, pm003778.t1, pm015919g0030, pm003778.t2	Azfi_s0006.g010104
OG0000582	pm245279g0010, pm005624g0040, pm003778.t1, pm015919g0030, pm003778.t2	74687
OG0000582	pm245279g0010, pm005624g0040, pm003778.t1, pm015919g0030, pm003778.t2	LOC_Os06g31220
OG0000592	pm174419g0010	AagrOXF_evm.TU.utg000018l.552, AagrOXF_evm.TU.utg000059l.120, AagrOXF_evm.TU.utg000002l.448
OG0000592	pm006533g0020	84611, 4561
OG0000592	pm006533g0020	Pp3c26_8569, Pp3c9_13640, Pp3c15_20000
OG0000592	pm006533g0020	AagrOXF_evm.TU.utg000087l.119, AagrOXF_evm.TU.utg000091l.293
OG0000592	pm006533g0020	Mp1g11660
OG0000592	pm006533g0020	Azfi_s0251.g060288
OG0000592	pm006533g0020	LOC_Os01g60270
OG0000592	pm006533g0020	Bradi2g53390, Bradi1g69185
OG0000592	pm006533g0020	Zm00001d043076, Zm00001d012516
OG0000592	pm006533g0020	Solyc02g082670
OG0000592	pm006533g0020	AT1G20710, AT1G20700, AT4G35550
OG0000620	pm001653g0020	UTEX1560_03593
OG0000624	pm000001g0060, pm001201g0040, pm014404g0010, pm020113g0010, pm014404g0020, pm035006g0010, pm010976g0010, pm028248g0020	111216
OG0000624	pm000001g0060, pm001201g0040, pm014404g0010, pm020113g0010, pm014404g0020, pm035006g0010, pm010976g0010, pm028248g0020	Pp3c21_20830
OG0000634	pm012105g0030, pm023963g0030, pm001685g0050, pm182935g0010, pm032732g0010, pm017200g0030, pm030615g0010	LOC_Os11g25870
OG0000642	pm000882g0060, pm004883g0040, pm010965g0040, pm000376g0040, pm005111.t1, pm000726g0150	AagrOXF_evm.TU.utg000008l.330
OG0000642	pm000882g0060, pm004883g0040, pm010965g0040, pm000376g0040, pm005111.t1, pm000726g0150	SM000014S00400, SM000249S08258, SM000097S24817
OG0000713	pm029093g0020	Mp6g16390, Mp6g16430
OG0000713	pm029093g0020	AagrOXF_evm.TU.utg000005l.239, AagrOXF_evm.TU.utg000010l.570, AagrOXF_evm.TU.utg000005l.238
OG0000713	pm029093g0020	141864, 148275
OG0000713	pm029093g0020	LOC_Os01g73000, LOC_Os08g04130, LOC_Os08g38600, LOC_Os06g40650, LOC_Os01g68060, LOC_Os12g19030
OG0000713	pm029093g0020	Bradi2g61442, Bradi3g14420, Bradi3g39190, Bradi1g36250, Bradi2g58190, Bradi4g39040
OG0000713	pm029093g0020	Zm00001d006136, Zm00001d011821, Zm00001d035211, Zm00001d036831, Zm00001d046554, Zm00001d042437, Zm00001d048784, Zm00001d034150, Zm00001d017623, Zm00001d012101, Zm00001d041073
OG0000713	pm029093g0020	AT5G63970, AT1G79380, AT1G67800, AT3G01650, AT5G14420
OG0000713	pm029093g0020	Solyc09g065870, Solyc05g053870, Solyc02g093520, Solyc03g111870
OG0000713	pm029093g0020	Azfi_s0076.g037941, Azfi_s0464.g072365, Azfi_s0469.g072866, Azfi_s1387.g102495, Azfi_s0007.g010554, Azfi_s0015.g014034, Azfi_s0054.g033802
OG0000768	pm009045g0020, pm018167.t1, pm000676.t1, pm006892g0020	Pp3c23_15330
OG0000843	pm025982g0020	AagrOXF_evm.TU.utg000041l.168
OG0000843	pm025982g0020	Mp2g20380, Mp6g17870
OG0000843	pm025982g0020	Pp3c5_14240, Pp3c25_8700, Pp3c10_9510, Pp3c1_21730, Pp3c2_16160
OG0000843	pm025982g0020	92029, 141352
OG0000843	pm025982g0020	Azfi_s0350.g066565, Azfi_s2342.g110696, Azfi_s0353.g066659, Azfi_s2043.g108825, Azfi_s0012.g012849, Azfi_s0131.g049139
OG0000843	pm025982g0020	Bradi1g15490, Bradi1g15486, Bradi1g24610, Bradi2g20570, Bradi2g51770, Bradi3g16285, Bradi5g20280, Bradi3g52390
OG0000843	pm025982g0020	Zm00001d033090, Zm00001d013787, Zm00001d013788, Zm00001d006605, Zm00001d021805, Zm00001d038623, Zm00001d010703, Zm00001d043272, Zm00001d049506, Zm00001d026214, Zm00001d017709
OG0000843	pm025982g0020	LOC_Os03g38590, LOC_Os03g38600, LOC_Os07g37740, LOC_Os05g42330, LOC_Os01g57220, LOC_Os08g06440, LOC_Os04g50890, LOC_Os02g47010
OG0000843	pm025982g0020	AT1G03550, AT2G20840, AT1G11180, AT1G61250, AT1G32050
OG0000843	pm025982g0020	Solyc07g054490, Solyc12g010750, Solyc10g008550, Solyc02g078840, Solyc10g009180, Solyc08g076210
OG0000863	pm007742g0060, pm011172g0020, pm025276g0030, pm333121g0010, pm011389g0010, pm010197g0010, pm009303g0030, pm036770g0020, pm018440g0010, pm029380g0010, pm054328g0010, pm006990g0040, pm020759g0020, pm004244g0160, pm011323g0010, pm013130g0010, pm002903g0020, pm005922g0020, pm296178g0010, pm296272g0010, pm032886g0010, pm009615g0020, pm009601.t2, pm008186g0020, pm003438g0020, pm007447g0010, pm056417g0020, pm012581g0020, pm001641g0010, pm000090g0050, pm066624g0010, pm011828g0010, pm004463g0050, pm092388.t1, pm014364.t1, pm013961g0010, pm003716g0020, pm026076g0010, pm039077g0010, pm006889g0010, pm009805g0040, pm013256g0010, pm024931g0010	AagrOXF_evm.TU.utg000012l.216
OG0000864	pm019306g0010, pm020186g0030, pm008974g0020, pm000475g0010, pm000743g0010	Solyc07g054050
OG0000864	pm019306g0010, pm020186g0030, pm008974g0020, pm000475g0010, pm000743g0010	Zm00001d053255
OG0000865	pm008512g0020, pm008448g0030, pm029319g0010, pm010895g0010, pm008448g0040, pm005896g0040, pm008179g0080	Me1_v2_0196670
OG0000865	pm008512g0020, pm008448g0030, pm029319g0010, pm010895g0010, pm008448g0040, pm005896g0040, pm008179g0080	Zci1a_11672
OG0000865	pm008512g0020, pm008448g0030, pm029319g0010, pm010895g0010, pm008448g0040, pm005896g0040, pm008179g0080	UTEX1559_04046
OG0000865	pm008512g0020, pm008448g0030, pm029319g0010, pm010895g0010, pm008448g0040, pm005896g0040, pm008179g0080	Zci_04311
OG0000865	pm008512g0020, pm008448g0030, pm029319g0010, pm010895g0010, pm008448g0040, pm005896g0040, pm008179g0080	UTEX1560_04174
OG0000865	pm008512g0020, pm008448g0030, pm029319g0010, pm010895g0010, pm008448g0040, pm005896g0040, pm008179g0080	SM000131S26740, SM000030S11447, SM000058S18465
OG0000895	pm003034g0020, pm008640.t1	AT3G02230, AT5G15650
OG0000916	pm000272g0100, pm000128g0090, pm015537g0010, pm013897g0010, pm002643g0090, pm031720g0010	CBR_g21997
OG0000922	pm010265g0040, pm001625g0070, pm008822g0040, pm004730g0050	LOC_Os11g13500
OG0000930	pm001869g0020, pm015121g0020, pm018500g0010, pm013514g0020	Azfi_s0389.g067652
OG0000930	pm001869g0020, pm015121g0020, pm018500g0010, pm013514g0020	Pp3c25_9130, Pp3c16_10870, Pp3c7_4630
OG0000930	pm001869g0020, pm015121g0020, pm018500g0010, pm013514g0020	Me1_v2_0207750
OG0000930	pm001869g0020, pm015121g0020, pm018500g0010, pm013514g0020	Zci1a_37989
OG0000930	pm001869g0020, pm015121g0020, pm018500g0010, pm013514g0020	UTEX1559_08882
OG0000930	pm001869g0020, pm015121g0020, pm018500g0010, pm013514g0020	Zci_15002
OG0000930	pm001869g0020, pm015121g0020, pm018500g0010, pm013514g0020	UTEX1560_18551, UTEX1560_13731
OG0000931	pm007860.t1, pm012907g0020, pm002154.t3, pm009426g0040, pm052777g0010	405265
OG0000938	pm026715g0030	AagrOXF_evm.TU.utg000116l.268
OG0000938	pm026715g0030	Mp8g05930
OG0000938	pm026715g0030	271276
OG0000938	pm026715g0030	Pp3c2_18630, Pp3c4_20780, Pp3c1_18390
OG0000938	pm026715g0030	Azfi_s0064.g035719, Azfi_s0345.g065769
OG0000938	pm026715g0030	AT5G50000, AT3G01490
OG0000938	pm026715g0030	Solyc06g071410, Solyc03g114210, Solyc12g062280
OG0000938	pm026715g0030	Bradi2g15560, Bradi2g44910
OG0000938	pm026715g0030	LOC_Os05g50190, LOC_Os01g45380
OG0000938	pm026715g0030	Zm00001d009660, Zm00001d044091, Zm00001d011458
OG0000979	pm009273g0020, pm007543g0030, pm015060g0010	UTEX1560_01384
OG0000980	pm011409g0060	Azfi_s0006.g009518
OG0000980	pm011409g0060	Zm00001d043434, Zm00001d012755, Zm00001d032471, Zm00001d032470, Zm00001d013863, Zm00001d034850, Zm00001d053040, Zm00001d048510, Zm00001d027334
OG0000980	pm011409g0060	Bradi4g35977, Bradi3g30620, Bradi1g77760
OG0000980	pm011409g0060	LOC_Os09g36090, LOC_Os10g36810, LOC_Os03g02160
OG0000980	pm011409g0060	MpVg00230
OG0000980	pm011409g0060	Solyc11g062220
OG0000980	pm011409g0060	AT2G16485
OG0000982	pm000074g0040, pm000015g0010, pm002199g0040, pm052551g0010, pm000074g0030	Solyc02g032520.1
OG0001001	pm004489g0030, pm000842g0080, pm010131g0050, pm001587g0060, pm027960g0010, pm013179.t1, pm088258g0010, pm017600.t1, pm005152g0010, pm008995g0010, pm003467g0030	Pp3c24_9790
OG0001005	pm003351g0040, pm004967g0020	444788
OG0001005	pm003351g0040, pm004967g0020	AT3G03170
OG0001019	pm020503g0010, pm022529g0010, pm000090g0030, pm020503g0020	Azfi_s0049.g030831
OG0001019	pm020503g0010, pm022529g0010, pm000090g0030, pm020503g0020	Pp3c23_10530
OG0001020	pm160066g0010	Mp6g11860
OG0001029	pm014753g0020, pm003507g0060, pm014753.t2, pm063942g0010	UTEX1560_04554
OG0001047	pm013691g0020, pm014196g0040, pm005446g0050, pm044340g0010, pm035123g0020	AagrOXF_evm.TU.utg000028l.32
OG0001121	pm019243g0030	AagrOXF_evm.TU.utg000050l.167
OG0001121	pm019243g0030	419085, 428295
OG0001121	pm019243g0030	Mp8g15810
OG0001121	pm019243g0030	Pp3c16_2020
OG0001121	pm019243g0030	Me1_v2_0063920, Me1_v2_0039210
OG0001121	pm019243g0030	Azfi_s0132.g049278
OG0001121	pm019243g0030	Bradi2g38100
OG0001121	pm019243g0030	Zm00001d035475, Zm00001d010970
OG0001121	pm019243g0030	LOC_Os05g03480
OG0001121	pm019243g0030	AT3G45300
OG0001121	pm019243g0030	Solyc11g069180, Solyc06g073560
OG0001121	pm019243g0030	Me1_v2_0063920, Me1_v2_0039210
OG0001121	pm019243g0030	SM000290S10898, SM000151S01486, SM000083S22772
OG0001182	pm012763g0030	AagrOXF_evm.TU.utg000024l.280
OG0001182	pm012763g0030	Mp1g14790
OG0001182	pm012763g0030	Pp3c3_5410
OG0001182	pm012763g0030	Solyc10g005490
OG0001182	pm012763g0030	AT1G79350
OG0001182	pm012763g0030	LOC_Os08g12680, LOC_Os04g52020, LOC_Os04g52030
OG0001182	pm012763g0030	Bradi3g18077, Bradi5g21150
OG0001182	pm012763g0030	Zm00001d024327, Zm00001d026270
OG0001182	pm012763g0030	Azfi_s0298.g063600, Azfi_s1778.g106736, Azfi_s3335.g115422
OG0001209	pm000368g0100, pm001663.t1, pm005114g0020, pm010863.t1	228163
OG0001209	pm000368g0100, pm001663.t1, pm005114g0020, pm010863.t1	Azfi_s0035.g025499, Azfi_s0775.g086523, Azfi_s0073.g037095, Azfi_s0078.g038157, Azfi_s0801.g087534
OG0001219	pm019373g0010	Zci1a_11676
OG0001219	pm019373g0010	CBR_g45841, CBR_g57642
OG0001219	pm019373g0010	Zci1a_11676
OG0001219	pm019373g0010	2803
OG0001219	pm019373g0010	Mp1g08630
OG0001219	pm019373g0010	AagrOXF_evm.TU.utg000033l.139
OG0001219	pm019373g0010	Pp3c24_14210, Pp3c8_17900
OG0001219	pm019373g0010	447511
OG0001219	pm019373g0010	Azfi_s0007.g010553, Azfi_s0111.g045616, Azfi_s0117.g046596
OG0001219	pm019373g0010	AT4G39840
OG0001219	pm019373g0010	Solyc04g055090.1, Solyc03g078640.1
OG0001219	pm019373g0010	LOC_Os09g20540
OG0001219	pm019373g0010	Zm00001d030847, Zm00001d030001, Zm00001d028206, Zm00001d014411, Zm00001d036378, Zm00001d036375, Zm00001d009386, Zm00001d036374, Zm00001d048999, Zm00001d038951, Zm00001d003849, Zm00001d020135
OG0001283	pm033217g0020, pm028129g0010, pm005357g0040, pm016224g0010	Mp8g07560
OG0001283	pm033217g0020, pm028129g0010, pm005357g0040, pm016224g0010	Solyc04g018080
OG0001297	pm034676g0010, pm034829g0010	Azfi_s0206.g057807
OG0001346	pm004984g0010	Zci1a_06332
OG0001369	pm069289g0010	Zm00001d016926
OG0001369	pm069289g0010	Bradi3g46737
OG0001369	pm069289g0010	LOC_Os02g36570
OG0001369	pm069289g0010	AT5G64940
OG0001369	pm069289g0010	Solyc04g054190
OG0001369	pm069289g0010	CBR_g22914
OG0001369	pm069289g0010	78366
OG0001369	pm069289g0010	AagrOXF_evm.TU.utg000006l.105
OG0001369	pm069289g0010	Mp1g20880
OG0001369	pm069289g0010	Azfi_s0102.g044540, Azfi_s1856.g107531, Azfi_s4192.g118292, Azfi_s0003.g007491
OG0001373	pm011542g0020	79275, 410492, 71495
OG0001373	pm011542g0020	Mp1g15050
OG0001373	pm011542g0020	AagrOXF_evm.TU.utg000116l.147
OG0001373	pm011542g0020	Pp3c2_31650, Pp3c2_31720, Pp3c1_3700, Pp3c1_3770, Pp3c1_3750, Pp3c2_31710
OG0001391	pm028323g0010, pm015768g0010, pm006342.t1, pm007877.t2, pm007877.t1, pm010483.t1, pm002482.t1	Chrsp31S04793
OG0001391	pm028323g0010, pm015768g0010	Solyc06g068710, Solyc11g020150.1, Solyc11g020490, Solyc11g020350.1
OG0001391	pm028323g0010, pm015768g0010	SM000004S14982, SM000007S20849
OG0001391	pm006342.t1	AagrOXF_evm.TU.utg000165l.12
OG0001391	pm007877.t2, pm007877.t1, pm010483.t1, pm002482.t1	Pp3c11_17310
OG0001418	pm000765g0040, pm001294g0060	Azfi_s0065.g035928
OG0001438	pm004033g0050, pm105911g0010, pm010870g0010, pm000639.t1, pm077979g0010, pm013562g0030, pm108168g0010, pm012674g0010, pm059285g0010, pm094315g0010, pm011190g0020	Zm00001d018914
OG0001460	pm004871g0040, pm009448.t1, pm012767g0020, pm024226g0010, pm010618g0030, pm000926g0110, pm003546g0020, pm013904g0010, pm006116g0020, pm028021g0020, pm004831g0050, pm014392g0010	Solyc01g058060.1, Solyc12g038950
OG0001464	pm077632g0010, pm020933.t2, pm015206.t1, pm009282g0030, pm014196g0010, pm213122g0010, pm068872g0010	Bradi3g04120, Bradi1g34581, Bradi1g14260
OG0001464	pm077632g0010, pm020933.t2, pm015206.t1, pm009282g0030, pm014196g0010, pm213122g0010, pm068872g0010	Pp3c12_14790, Pp3c1_28790
OG0001466	pm024095g0010, pm021914g0020, pm024095g0030, pm000992g0060, pm003926g0020	Solyc08g065450
OG0001471	pm015480g0030, pm028788g0010, pm003213g0100, pm101918g0010, pm003212g0030, pm020682g0010	LOC_Os05g04710
OG0001503	pm001587g0030, pm003816g0030, pm020495g0010, pm162829g0010, pm028398g0010, pm004662g0020, pm009907g0010, pm025956g0010, pm007693g0020, pm004662g0030, pm012073g0010	Zm00001d039289
OG0001546	pm157067g0010	Solyc06g065445.1
OG0001549	pm000618.t1, pm020108g0020, pm007237g0010, pm009639g0010, pm005082g0040, pm002257g0040, pm021046g0010, pm030662g0010, pm000621g0040, pm013912g0020, pm015784g0010, pm018835g0050, pm010068g0060, pm023427g0040, pm016360g0030	Zm00001d042320
OG0001612	pm028009g0010, pm018208g0020, pm012918g0010	UTEX1560_01592
OG0001671	pm257782g0010	Pp3c1_24120, Pp3c14_15670, Pp3c14_15700, Pp3c14_17310, Pp3c14_15680, Pp3c17_17600
OG0001671	pm257782g0010	36118
OG0001671	pm257782g0010	Mp2g26290
OG0001671	pm257782g0010	Azfi_s0252.g060323
OG0001671	pm257782g0010	AagrOXF_evm.TU.utg000077l.387, AagrOXF_evm.TU.utg000096l.50
OG0001671	pm257782g0010	Solyc06g072120, Solyc03g019780
OG0001671	pm257782g0010	AT1G72370, AT3G04770
OG0001671	pm257782g0010	LOC_Os03g28410
OG0001671	pm257782g0010	Bradi1g60310
OG0001677	pm000350g0040, pm000835g0020	LOC_Os01g52470
OG0001683	pm028484g0010, pm000910.t1, pm001582g0080	Solyc01g107680
OG0001683	pm003577g0040, pm015594g0030	Azfi_s3966.g117405
OG0001683	pm003577g0040, pm015594g0030	Solyc01g103000
OG0001801	pm004571g0010	Pp3c23_11630
OG0001801	pm004571g0010	Mp2g17860
OG0001801	pm004571g0010	Zm00001d037333
OG0001801	pm004571g0010	Bradi1g44060
OG0001801	pm004571g0010	LOC_Os06g14740
OG0001801	pm004571g0010	AT1G18270
OG0001801	pm004571g0010	Solyc03g118640
OG0001801	pm004571g0010	Azfi_s0081.g038630, Azfi_s0081.g038629, Azfi_s0081.g038623
OG0001874	pm021334g0010, pm083303g0010	Zm00001d035330
OG0001915	pm000851g0020, pm000193g0070, pm005263g0010	AT3G05365
OG0001923	pm000664g0040, pm218145g0010, pm000664.t1	Mp1g16760
OG0001923	pm000664g0040, pm218145g0010, pm000664.t1	AagrOXF_evm.TU.utg000096l.24
OG0001923	pm000664g0040, pm218145g0010, pm000664.t1	Azfi_s0301.g063733
OG0001923	pm000664g0040, pm218145g0010, pm000664.t1	Solyc01g088720, Solyc08g068840
OG0001923	pm000664g0040, pm218145g0010, pm000664.t1	AT3G09360, AT2G01280, AT1G30455, AT2G45100
OG0001923	pm000664g0040, pm218145g0010, pm000664.t1	LOC_Os05g23940
OG0001923	pm000664g0040, pm218145g0010, pm000664.t1	Bradi1g41802, Bradi4g39279, Bradi1g57222, Bradi1g41809
OG0001923	pm000664g0040, pm218145g0010, pm000664.t1	Zm00001d006056, Zm00001d040671, Zm00001d019350, Zm00001d038868, Zm00001d021081, Zm00001d003092, Zm00001d009424
OG0001923	pm000664g0040, pm218145g0010, pm000664.t1	402495, 410325, 444750
OG0001923	pm000664g0040, pm218145g0010, pm000664.t1	Me1_v2_0096910
OG0001923	pm000664g0040, pm218145g0010, pm000664.t1	Zci1a_12385
OG0001957	pm010990.t1, pm001379g0010, pm018183g0010	Me1_v2_0050120
OG0001957	pm010990.t1, pm001379g0010, pm018183g0010	Solyc07g021660
OG0001980	pm000765g0020, pm007667g0010	AagrOXF_evm.TU.utg000042l.78, AagrOXF_evm.TU.utg000038l.147, AagrOXF_evm.TU.utg000042l.73
OG0001987	pm009204g0010, pm044765g0010, pm135918g0010, pm004771g0040, pm003711g0020, pm010543.t1	AT1G02830
OG0001987	pm009204g0010, pm044765g0010, pm135918g0010, pm004771g0040, pm003711g0020, pm010543.t1	Zm00001d033008
OG0001994	pm000139g0030, pm000043g0020	CLOP_g22753
OG0001994	pm000139g0030, pm000043g0020	CLOP_g22753
OG0001994	pm000139g0030, pm000043g0020	Zci_06981
OG0001994	pm000139g0030, pm000043g0020	UTEX1559_00341
OG0001994	pm000139g0030, pm000043g0020	UTEX1560_11233
OG0001994	pm000139g0030, pm000043g0020	Zci1a_22818, Zci1a_13870
OG0001994	pm000139g0030, pm000043g0020	SM000196S05359, SM000009S23582, SM000067S20311
OG0001994	pm000139g0030, pm000043g0020	Mp3g02740
OG0001994	pm000139g0030, pm000043g0020	AagrOXF_evm.TU.utg000077l.220, AagrOXF_evm.TU.utg000111l.57
OG0001994	pm000139g0030, pm000043g0020	Pp3c24_12530, Pp3c20_16950, Pp3c23_6090
OG0001994	pm000139g0030, pm000043g0020	Azfi_s0038.g026285, Azfi_s0078.g038191
OG0001994	pm000139g0030, pm000043g0020	8180, 7731
OG0001994	pm000139g0030, pm000043g0020	LOC_Os02g11030, LOC_Os02g32400, LOC_Os02g43600
OG0001994	pm000139g0030, pm000043g0020	Zm00001d049703, Zm00001d017449
OG0001994	pm000139g0030, pm000043g0020	Bradi3g43320, Bradi1g36880, Bradi3g50390
OG0001994	pm000139g0030, pm000043g0020	Solyc01g008340, Solyc08g078010
OG0001994	pm000139g0030, pm000043g0020	AT5G11750, AT1G24240, AT4G11630, AT4G17560, AT5G47190
OG0002044	pm025924g0030, pm005410g0030, pm004767g0030, pm008395g0020, pm010541g0010, pm008062g0050, pm129927g0010, pm007869g0020	Pp3c2_34800
OG0002105	pm036121g0010, pm011756g0040, pm000933g0130, pm008775g0030, pm011756g0050, pm000933g0140, pm053249g0010, pm008775g0040	Bradi1g69265
OG0002117	pm016382g0020	AT1G14850
OG0002117	pm016382g0020	Solyc07g008160
OG0002117	pm016382g0020	Bradi1g69510
OG0002117	pm016382g0020	Zm00001d029605, Zm00001d053074, Zm00001d048047, Zm00001d036825, Zm00001d015707, Zm00001d028262, Zm00001d045266, Zm00001d018084
OG0002117	pm016382g0020	LOC_Os06g20090
OG0002117	pm016382g0020	AagrOXF_evm.TU.utg000027l.258
OG0002117	pm016382g0020	Mp6g03580
OG0002117	pm016382g0020	Pp3c3_36410, Pp3c8_3720, Pp3c3_36400, Pp3c17_5940, Pp3c5_16790
OG0002144	pm012150g0040	Bradi2g17040, Bradi2g46580
OG0002144	pm012150g0040	LOC_Os05g48320
OG0002144	pm012150g0040	Zm00001d004009, Zm00001d053863, Zm00001d009509
OG0002144	pm012150g0040	AT3G60245, AT3G10950
OG0002144	pm012150g0040	Azfi_s0001.g000897, Azfi_s0083.g038895
OG0002144	pm012150g0040	Cre06.g257150_4532
OG0002144	pm012150g0040	Olucimarinus_13231
OG0002144	pm012150g0040	Solyc10g061970, Solyc08g077720, Solyc08g007140, Solyc08g077710
OG0002144	pm004431.t1	CBR_g25964
OG0002144	pm004431.t1	Chrsp175S02393
OG0002144	pm004431.t1	SM000042S15383, SM000008S22204, SM000039S14495
OG0002144	pm004431.t1	227221
OG0002144	pm004431.t1	Mp5g08340, Mp5g09590
OG0002144	pm004431.t1	Pp3c7_21150, Pp3c2_34770, Pp3c3_1620, Pp3c1_1530, Pp3c11_2550, Pp3c6_19330, Pp3c26_15390
OG0002144	pm004431.t1	AagrOXF_evm.TU.utg000084l.102, AagrOXF_evm.TU.utg000116l.185, AagrOXF_evm.TU.utg000091l.308
OG0002144	pm004431.t1	Me1_v2_0101270
OG0002144	pm004431.t1	LOC_Os01g48770
OG0002144	pm004431.t1	Zm00001d015301
OG0002177	pm083588g0010, pm005157.t3, pm011465g0020, pm009137g0020, pm009753g0010	Me1_v2_0025050, Me1_v2_0081880
OG0002185	pm010439g0020, pm010566g0040, pm034671g0010	Me1_v2_0128650
OG0002185	pm010439g0020, pm010566g0040, pm034671g0010	Zci1a_25630, Zci1a_34181
OG0002197	pm001854g0040, pm020509g0010, pm011396g0010, pm003877.t1	Zm00001d028202
OG0002241	pm005839g0030, pm022535g0010	AT4G18110, AT4G13490
OG0002264	pm002926g0050	267755, 168373
OG0002264	pm002926g0050	AagrOXF_evm.TU.utg000080l.3, AagrOXF_evm.TU.utg000002l.614, AagrOXF_evm.TU.utg000002l.615
OG0002264	pm002926g0050	Mp6g04750
OG0002264	pm002926g0050	Pp3c24_16870, Pp3c8_17380
OG0002264	pm002926g0050	Solyc09g011220, Solyc06g051270, Solyc03g096730
OG0002264	pm002926g0050	AT4G30570, AT2G39770, AT3G55590
OG0002264	pm002926g0050	Bradi1g66930, Bradi2g54870
OG0002264	pm002926g0050	LOC_Os03g16150, LOC_Os08g13930, LOC_Os01g62840
OG0002264	pm002926g0050	Zm00001d028572, Zm00001d042874, Zm00001d012395
OG0002279	pm003047g0010, pm005165g0010	Solyc10g062110
OG0002279	pm006860g0010, pm015835g0020, pm093376g0010	Zci1a_34500, Zci1a_31504
OG0002279	pm006860g0010, pm015835g0020, pm093376g0010	Zci_02222
OG0002279	pm006860g0010, pm015835g0020, pm093376g0010	UTEX1559_10867
OG0002279	pm006860g0010, pm015835g0020, pm093376g0010	UTEX1560_00457
OG0002279	pm006860g0010, pm015835g0020, pm093376g0010	Solyc10g062110
OG0002279	pm006860g0010, pm015835g0020, pm093376g0010	Solyc10g062110
OG0002298	pm013897g0030	Azfi_s0096.g043735, Azfi_s0159.g053968
OG0002298	pm013897g0030	Zm00001d000040, Zm00001d027267, Zm00001d000041
OG0002298	pm013897g0030	LOC_Os10g41340, LOC_Os03g01150
OG0002298	pm013897g0030	Bradi1g78560, Bradi3g33500
OG0002298	pm013897g0030	Solyc08g078250, Solyc08g078260.1
OG0002298	pm013897g0030	AT5G47350, AT5G47330, AT5G47340, AT4G17470, AT4G17480, AT4G17483
OG0002308	pm004382g0010, pm020758g0020, pm020758g0010, pm003787g0010	Pp3c10_24660
OG0002337	pm031519g0020, pm038706g0010, pm008896g0030, pm133058g0010, pm000825.t1, pm008896g0010, pm019123g0010, pm001772g0050, pm007891g0040	108762
OG0002394	pm018953g0010, pm032278g0010	Zm00001d039998
OG0002405	pm000899g0010	Mp1g09410
OG0002446	pm027896g0020	Pp3c23_11320
OG0002475	pm248612g0010	Zci1a_24707
OG0002475	pm248612g0010	Zci_04789
OG0002475	pm248612g0010	UTEX1560_01480
OG0002475	pm248612g0010	UTEX1559_02622, UTEX1559_02623
OG0002475	pm248612g0010	Me1_v2_0174080
OG0002503	pm005763.t1	AagrOXF_evm.TU.utg000018l.210
OG0002540	pm027394g0010, pm009626g0010, pm002790g0010, pm004484g0020, pm001177.t2, pm006141g0040	Mp2g23300
OG0002556	pm010116g0020	CBR_g34200
OG0002556	pm010116g0020	9646
OG0002556	pm010116g0020	Me1_v2_0138250, Me1_v2_0138180, Me1_v2_0138190, Me1_v2_0138270
OG0002556	pm010116g0020	Me1_v2_0138250, Me1_v2_0138180, Me1_v2_0138190, Me1_v2_0138270
OG0002556	pm010116g0020	Zci1a_30025
OG0002556	pm010116g0020	UTEX1559_09004
OG0002556	pm010116g0020	UTEX1560_08689, UTEX1560_14040
OG0002556	pm010116g0020	Zci_09397
OG0002556	pm010116g0020	SM000143S00761, SM000112S23980, SM000205S06204
OG0002615	pm013194g0010	UTEX1559_17081
OG0002615	pm013194g0010	CBR_g33922
OG0002615	pm013194g0010	UTEX1559_17081
OG0002615	pm013194g0010	Azfi_s0045.g030025
OG0002615	pm013194g0010	114132
OG0002615	pm013194g0010	Pp3c20_13230, Pp3c23_3410
OG0002615	pm013194g0010	Mp6g18400
OG0002615	pm013194g0010	AagrOXF_evm.TU.utg000025l.29, AagrOXF_evm.TU.utg000069l.41
OG0002615	pm013194g0010	LOC_Os02g33230, LOC_Os04g33770
OG0002615	pm013194g0010	Zm00001d050658, Zm00001d050660
OG0002615	pm013194g0010	Bradi3g45040, Bradi5g09491
OG0002615	pm013194g0010	AT5G06180
OG0002615	pm013194g0010	Solyc09g010320
OG0002725	pm003306g0020, pm005858g0020	SM000142S00508, SM000104S09313, SM000176S03133
OG0002725	pm003306g0020, pm005858g0020	428898, 424531
OG0002725	pm003306g0020, pm005858g0020	11031
OG0002725	pm003306g0020, pm005858g0020	Pp3c4_14060
OG0002725	pm003306g0020, pm005858g0020	Mp2g10940
OG0002725	pm003306g0020, pm005858g0020	Azfi_s0006.g010173
OG0002725	pm003306g0020, pm005858g0020	AagrOXF_evm.TU.utg000035l.327
OG0002725	pm003306g0020, pm005858g0020	Zm00001d025192, Zm00001d001987, Zm00001d051973
OG0002725	pm003306g0020, pm005858g0020	Bradi5g26782
OG0002725	pm003306g0020, pm005858g0020	LOC_Os04g58690
OG0002725	pm003306g0020, pm005858g0020	AT1G01760
OG0002725	pm003306g0020, pm005858g0020	Solyc05g048810
OG0002725	pm003306g0020, pm005858g0020	Chrsp31S04905
OG0002725	pm003306g0020, pm005858g0020	18079, 18078, 18080, 18081
OG0002734	pm002208g0040, pm000695.t1, pm000695.t2, pm037106g0010	AagrOXF_evm.TU.utg000042l.531
OG0002765	pm017954g0020, pm001911g0010, pm012865g0030	Pp3c16_9080
OG0002876	pm013912g0010, pm000019g0120, pm010068g0070, pm015784.t2	Solyc10g038110.1
OG0002878	pm294920g0010	143627
OG0002878	pm294920g0010	Zm00001d025948, Zm00001d002822
OG0002878	pm294920g0010	Bradi5g16980
OG0002878	pm294920g0010	LOC_Os04g45490
OG0002878	pm294920g0010	AT1G62750
OG0002878	pm294920g0010	Solyc08g079180, Solyc12g062900.1
OG0002885	pm006421g0020, pm013006.t1, pm023749g0010	Zm00001d029929
OG0003035	pm009030.t1, pm006708g0010, pm010185g0020	Mp3g01780
OG0003036	pm012670g0020, pm001831g0060, pm009019.t1	Pp3c5_12860
OG0003039	pm005059g0010	CBR_g22390
OG0003039	pm005059g0010	229483
OG0003039	pm005059g0010	Zci1a_00384
OG0003039	pm005059g0010	Zci1a_00384
OG0003039	pm005059g0010	AagrOXF_evm.TU.utg000038l.331
OG0003039	pm005059g0010	Mp1g19390
OG0003039	pm005059g0010	Pp3c17_23840, Pp3c14_23100
OG0003039	pm005059g0010	Azfi_s0237.g059595
OG0003039	pm005059g0010	LOC_Os02g46150
OG0003039	pm005059g0010	Bradi3g52006, Bradi5g06636
OG0003039	pm005059g0010	Zm00001d051498, Zm00001d033400
OG0003039	pm005059g0010	Solyc11g020870
OG0003039	pm005059g0010	AT3G49320, AT5G41970
OG0003053	pm001756g0020, pm042322g0010	Azfi_s0005.g008985
OG0003053	pm001756g0020, pm042322g0010	Zm00001d022502
OG0003053	pm001756g0020, pm042322g0010	Bradi3g20450
OG0003053	pm001756g0020, pm042322g0010	LOC_Os08g22864
OG0003053	pm001756g0020, pm042322g0010	AT3G10380
OG0003053	pm001756g0020, pm042322g0010	Solyc11g008340
OG0003053	pm001756g0020, pm042322g0010	105848
OG0003053	pm001756g0020, pm042322g0010	AagrOXF_evm.TU.utg000050l.112
OG0003053	pm001756g0020, pm042322g0010	Mp6g16690
OG0003053	pm001756g0020, pm042322g0010	Pp3c16_24260, Pp3c3_21120, Pp3c12_15420
OG0003053	pm001756g0020, pm042322g0010	Zci1a_24882
OG0003053	pm001756g0020, pm042322g0010	Zci1a_24882
OG0003062	pm032489g0010, pm016253g0020, pm000568g0010, pm012903g0020, pm032704g0010, pm016769g0010, pm012149g0020	LOC_Os09g15400
OG0003067	pm033124g0010	6302
OG0003067	pm033124g0010	PRCOL_00001779_RA
OG0003207	pm317984g0010, pm004719.t1, pm014712g0010, pm028760g0010, pm001659g0060	Azfi_s0017.g014553, Azfi_s0074.g037295
OG0003215	pm026028g0010, pm008934g0060	Me1_v2_0108950, Me1_v2_0186240
OG0003215	pm026028g0010, pm008934g0060	Me1_v2_0108950, Me1_v2_0186240
OG0003215	pm026028g0010	440019
OG0003215	pm026028g0010	Zm00001d017982
OG0003215	pm026028g0010	Bradi3g59790
OG0003215	pm026028g0010	LOC_Os02g50560
OG0003215	pm026028g0010	AT1G70070
OG0003215	pm026028g0010	Solyc05g006530
OG0003215	pm026028g0010	Azfi_s0003.g007647, Azfi_s0060.g034825
OG0003215	pm026028g0010	Pp3c13_6210, Pp3c17_9310, Pp3c4_20390
OG0003215	pm026028g0010	AagrOXF_evm.TU.utg000058l.409
OG0003215	pm026028g0010	Mp4g01470
OG0003215	pm026028g0010	CBR_g49409
OG0003229	pm001379g0060, pm005887g0010, pm002748g0030	Zm00001d032202
OG0003234	pm004741g0090, pm050985g0010	Me1_v2_0033080, Me1_v2_0014410
OG0003234	pm004741g0090, pm050985g0010	14312
OG0003234	pm004741g0090, pm050985g0010	Chrsp78S07720
OG0003234	pm004741g0090, pm050985g0010	8692, 8693
OG0003234	pm004741g0090, pm050985g0010	Me1_v2_0033080, Me1_v2_0014410
OG0003234	pm004741g0090, pm050985g0010	AT5G16750
OG0003234	pm004741g0090, pm050985g0010	Solyc03g097160
OG0003234	pm004741g0090, pm050985g0010	Zm00001d043471, Zm00001d002483, Zm00001d026195
OG0003234	pm004741g0090, pm050985g0010	Bradi5g20040
OG0003234	pm004741g0090, pm050985g0010	LOC_Os04g50660
OG0003234	pm004741g0090, pm050985g0010	80645
OG0003234	pm004741g0090, pm050985g0010	Mp8g08070
OG0003234	pm004741g0090, pm050985g0010	Pp3c19_12460
OG0003234	pm004741g0090, pm050985g0010	AagrOXF_evm.TU.utg000087l.66
OG0003234	pm004741g0090, pm050985g0010	Azfi_s0068.g036365
OG0003305	pm006084g0030, pm014140.t1	AagrOXF_evm.TU.utg000005l.154
OG0003314	pm001589g0020	440021
OG0003314	pm001589g0020	Pp3c26_14310
OG0003314	pm001589g0020	Mp5g22240
OG0003314	pm001589g0020	AagrOXF_evm.TU.utg000003l.402
OG0003314	pm001589g0020	Azfi_s0074.g037483, Azfi_s0158.g053874
OG0003345	pm022242g0010, pm006330.t1, pm049563g0010, pm006213g0030	Pp3c14_5230
OG0003428	pm019986g0010	CBR_g17690
OG0003428	pm019986g0010	145221
OG0003428	pm019986g0010	Pp3c14_22730, Pp3c2_3550, Pp3c1_39910
OG0003428	pm019986g0010	AagrOXF_evm.TU.utg000083l.325
OG0003428	pm019986g0010	Mp7g03840
OG0003428	pm019986g0010	AT3G12070, AT5G12210
OG0003428	pm019986g0010	Solyc12g040810, Solyc03g118570
OG0003428	pm019986g0010	LOC_Os08g40140, LOC_Os11g32090
OG0003428	pm019986g0010	Zm00001d031480
OG0003428	pm019986g0010	Bradi3g40170
OG0003428	pm019986g0010	Azfi_s0004.g008704
OG0003450	pm001157g0010, pm009374g0010	Azfi_s1495.g103612, Azfi_s0097.g043881
OG0003474	pm022631g0020	Mp6g08800
OG0003474	pm022631g0020	Pp3c5_14160, Pp3c16_5830
OG0003474	pm022631g0020	Azfi_s0017.g014488, Azfi_s0159.g053958
OG0003474	pm022631g0020	AT3G52140
OG0003474	pm022631g0020	Solyc01g086750
OG0003474	pm022631g0020	Bradi3g53420
OG0003474	pm022631g0020	LOC_Os02g48620
OG0003474	pm022631g0020	Zm00001d051644, Zm00001d017848, Zm00001d003753, Zm00001d047158, Zm00001d024013
OG0003474	pm022631g0020	417343
OG0003568	pm004677g0030, pm012320g0070, pm016603g0020, pm002100g0040	LOC_Os01g54360
OG0003607	pm061221g0010	Pp3c25_3020
OG0003607	pm061221g0010	85320
OG0003607	pm061221g0010	AT4G04770, AT5G44316
OG0003607	pm061221g0010	Solyc02g080440, Solyc03g031700
OG0003607	pm061221g0010	Bradi2g53960
OG0003607	pm061221g0010	LOC_Os01g61400
OG0003607	pm061221g0010	Zm00001d012465
OG0003633	pm049817g0010	Mp4g07410
OG0003633	pm049817g0010	227744
OG0003633	pm049817g0010	Azfi_s0176.g056019
OG0003633	pm049817g0010	Solyc05g055260, Solyc11g006820
OG0003633	pm049817g0010	AT2G23930, AT3G11500
OG0003633	pm049817g0010	Bradi1g21720
OG0003633	pm049817g0010	Zm00001d047271, Zm00001d028673, Zm00001d037942, Zm00001d052555
OG0003633	pm049817g0010	LOC_Os03g29740, LOC_Os07g41790
OG0003633	pm049817g0010	SM000017S02929, SM000305S11817, SM000022S07191
OG0003687	pm020773g0010	Pp3c20_18840
OG0003687	pm020773g0010	Mp3g07040, Mp3g18180
OG0003687	pm020773g0010	96980
OG0003687	pm020773g0010	AagrOXF_evm.TU.utg000126l.233
OG0003687	pm020773g0010	Azfi_s0045.g029786
OG0003687	pm020773g0010	Solyc10g081530
OG0003687	pm020773g0010	AT3G28715, AT3G28710
OG0003687	pm020773g0010	Bradi2g42100
OG0003687	pm020773g0010	LOC_Os01g40470
OG0003687	pm020773g0010	Zm00001d011238
OG0003754	pm004558g0080	AT4G20440, AT5G44500
OG0003754	pm004558g0080	Solyc05g049950, Solyc01g094540
OG0003754	pm004558g0080	LOC_Os07g07220
OG0003754	pm004558g0080	Bradi1g56546
OG0003754	pm004558g0080	Zm00001d018882, Zm00001d007898
OG0003762	pm035043g0010	Azfi_s0016.g014392, Azfi_s0061.g034872
OG0003762	pm035043g0010	LOC_Os07g34730
OG0003762	pm035043g0010	Bradi1g25790
OG0003762	pm035043g0010	Zm00001d021675, Zm00001d047666
OG0003762	pm035043g0010	AT5G60620
OG0003762	pm035043g0010	Solyc08g082340
OG0003762	pm035043g0010	AagrOXF_evm.TU.utg000005l.497, AagrOXF_evm.TU.utg000006l.40, AagrOXF_evm.TU.utg000006l.44
OG0003762	pm035043g0010	Mp1g03080, Mp1g04840
OG0003762	pm035043g0010	Pp3c11_26030, Pp3c14_5980
OG0003762	pm035043g0010	LOC_Os02g24340
OG0003762	pm035043g0010	LOC_Os02g24340
OG0003767	pm001457g0040, pm006556g0010, pm013181g0070, pm071300g0010	Solyc06g050825.1
OG0003784	pm000164g0050, pm005757g0010	SM000067S20326, SM000009S23494, SM000366S13815
OG0003784	pm000164g0050, pm005757g0010	Zci1a_17652
OG0003784	pm000164g0050, pm005757g0010	Zci_11810
OG0003784	pm000164g0050, pm005757g0010	UTEX1559_10814
OG0003784	pm000164g0050, pm005757g0010	UTEX1560_12973
OG0003784	pm000164g0050, pm005757g0010	Azfi_s0006.g009981
OG0003784	pm000164g0050, pm005757g0010	Mp6g13940
OG0003784	pm000164g0050, pm005757g0010	AagrOXF_evm.TU.utg000008l.108
OG0003784	pm000164g0050, pm005757g0010	Pp3c7_1420
OG0003784	pm000164g0050, pm005757g0010	109656
OG0003784	pm000164g0050, pm005757g0010	AT1G56590
OG0003784	pm000164g0050, pm005757g0010	Solyc01g100820
OG0003784	pm000164g0050, pm005757g0010	Bradi2g26790
OG0003784	pm000164g0050, pm005757g0010	LOC_Os05g31780
OG0003784	pm000164g0050, pm005757g0010	Zm00001d049311, Zm00001d039203, Zm00001d006386, Zm00001d021311, Zm00001d032192, Zm00001d002305, Zm00001d044264, Zm00001d054005
OG0003784	pm000164g0050, pm005757g0010	CBR_g50247
OG0003784	pm000164g0050, pm005757g0010	3444
OG0003784	pm000164g0050, pm005757g0010	Me1_v2_0065770
OG0003784	pm000164g0050, pm005757g0010	Me1_v2_0065770
OG0003819	pm013124g0030, pm020774g0040	AagrOXF_evm.TU.utg000022l.67, AagrOXF_evm.TU.utg000057l.249
OG0003819	pm013124g0030, pm020774g0040	Pp3c7_2280
OG0003819	pm013124g0030, pm020774g0040	Mp4g23600
OG0003819	pm013124g0030, pm020774g0040	402189
OG0003819	pm013124g0030, pm020774g0040	Azfi_s0059.g034517
OG0003819	pm013124g0030, pm020774g0040	AT5G06360
OG0003819	pm013124g0030, pm020774g0040	Zm00001d022466, Zm00001d007145
OG0003819	pm013124g0030, pm020774g0040	Bradi1g18120
OG0003819	pm013124g0030, pm020774g0040	LOC_Os07g47580
OG0003833	pm017272g0040, pm003857g0020	Zm00001d051916
OG0003847	pm000200g0040	LOC_Os08g15600
OG0003868	pm011566g0020, pm004967.t1, pm003351g0020, pm004854g0050	Zm00001d016569, Zm00001d016571
OG0003893	pm003590.t1	Zm00001d034450
OG0004009	pm000885g0060, pm043170g0010, pm000461g0010, pm004935g0010	Solyc11g027820.1
OG0004047	pm009355g0010, pm115136g0010, pm015578g0010, pm002063g0010, pm009355g0030	AagrOXF_evm.TU.utg000024l.213
OG0004073	pm007154g0040	AagrOXF_evm.TU.utg000017l.165
OG0004073	pm007154g0040	Mp7g18580
OG0004073	pm007154g0040	82681
OG0004073	pm007154g0040	Azfi_s0116.g046373
OG0004073	pm007154g0040	Bradi3g45535
OG0004073	pm007154g0040	LOC_Os02g34540
OG0004073	pm007154g0040	Zm00001d016767
OG0004073	pm007154g0040	AT4G39820
OG0004073	pm007154g0040	Solyc05g051840.1
OG0004073	pm007154g0040	Pp3c10_9400, Pp3c14_5890, Pp3c22_3810, Pp3c19_5060
OG0004092	pm001947g0030, pm009352.t1, pm009352g0060, pm005252g0040, pm016307g0010, pm033729g0010	CBR_g29588
OG0004110	pm007202g0020	154058
OG0004110	pm007202g0020	Zm00001d026476, Zm00001d002034
OG0004110	pm007202g0020	LOC_Os04g42000
OG0004110	pm007202g0020	Bradi1g10780, Bradi3g48435
OG0004110	pm007202g0020	AT2G44050
OG0004110	pm007202g0020	Solyc08g015660, Solyc12g096590
OG0004110	pm007202g0020	AagrOXF_evm.TU.utg000038l.297
OG0004110	pm007202g0020	Pp3c27_2710, Pp3c16_5700
OG0004110	pm007202g0020	Mp4g08400
OG0004110	pm007202g0020	Cre02.g088850_4532
OG0004110	pm007202g0020	9218
OG0004110	pm007202g0020	Pp3s30_1010
OG0004110	pm007202g0020	Pp3s30_1010
OG0004110	pm007202g0020	Azfi_s0189.g056853
OG0004316	pm003822g0030	Zci1a_23723
OG0004316	pm003822g0030	270168
OG0004316	pm003822g0030	Azfi_s0050.g031065, Azfi_s0002.g001202, Azfi_s0376.g067277
OG0004316	pm003822g0030	AT5G11770
OG0004316	pm003822g0030	Solyc11g070030
OG0004316	pm003822g0030	LOC_Os01g52214, LOC_Os05g45730
OG0004316	pm003822g0030	Zm00001d043620, Zm00001d011732, Zm00001d043619
OG0004316	pm003822g0030	Bradi2g48410, Bradi2g18790
OG0004322	pm000381g0060, pm004490g0010	Zm00001d035019
OG0004481	pm006098g0020, pm037628g0010, pm001790g0020, pm004411g0010, pm004411g0020	419450
OG0004523	pm007882g0030, pm015904g0020, pm009368.t1, pm009381g0020, pm007882g0050	Azfi_s0076.g037784
OG0004740	pm034479g0020	Azfi_s0479.g073091
OG0004841	pm014342g0010, pm000777g0100, pm007070g0010	Zm00001d012711
OG0004946	pm000823.t3, pm000823.t1, pm009412.t1	Solyc10g150127
OG0004994	pm004148g0010, pm008860g0010, pm005242g0030, pm005050g0020	LOC_Os05g39640
OG0005001	pm051168g0010	Bradi2g14400
OG0005001	pm051168g0010	LOC_Os05g51530
OG0005001	pm051168g0010	Zm00001d039157, Zm00001d044665
OG0005001	pm051168g0010	AT1G12840
OG0005001	pm051168g0010	Solyc03g097800
OG0005001	pm051168g0010	AagrOXF_evm.TU.utg000024l.350
OG0005001	pm051168g0010	Azfi_s0309.g064082
OG0005001	pm051168g0010	Mp4g19810
OG0005001	pm051168g0010	Pp3c13_14220, Pp3c9_8980
OG0005001	pm051168g0010	111716
OG0005273	pm012381g0010	Bradi2g58967
OG0005273	pm012381g0010	Zm00001d012029
OG0005273	pm012381g0010	LOC_Os01g69120
OG0005273	pm012381g0010	AT3G27180
OG0005273	pm012381g0010	Solyc03g005010
OG0005273	pm012381g0010	Azfi_s0288.g063238
OG0005273	pm012381g0010	AagrOXF_evm.TU.utg000006l.602
OG0005273	pm012381g0010	Mp6g03570
OG0005273	pm012381g0010	Pp3c10_19430
OG0005273	pm012381g0010	CBR_g38076
OG0005273	pm012381g0010	77358
OG0005301	pm006690g0060	Pp3c14_12180
OG0005301	pm006690g0060	75051, 270535
OG0005301	pm006690g0060	Mp3g24370
OG0005301	pm006690g0060	Azfi_s0533.g076060
OG0005301	pm006690g0060	AT5G67290
OG0005301	pm006690g0060	Solyc03g044190
OG0005301	pm006690g0060	Bradi1g57360
OG0005301	pm006690g0060	Zm00001d018820
OG0005301	pm006690g0060	LOC_Os07g06080, LOC_Os01g41160
OG0005330	pm009512g0010, pm013123g0010, pm262147g0010	LOC_Os08g03510
OG0005330	pm009512g0010, pm013123g0010, pm262147g0010	CBR_g31679
OG0005339	pm007917g0060	AagrOXF_evm.TU.utg000033l.104
OG0005339	pm007917g0060	Mp1g03810
OG0005339	pm007917g0060	Pp3c18_11860
OG0005339	pm007917g0060	100915
OG0005339	pm007917g0060	Azfi_s0052.g031620
OG0005339	pm007917g0060	AT1G15370
OG0005339	pm007917g0060	Solyc11g008330, Solyc06g068080, Solyc03g116600
OG0005339	pm007917g0060	Bradi1g01014
OG0005339	pm007917g0060	Zm00001d034893, Zm00001d005061
OG0005350	pm001475g0020	AagrOXF_evm.TU.utg000038l.66
OG0005462	pm001422g0050, pm014735g0020	Zm00001d011199
OG0005462	pm001422g0050, pm014735g0020	Bradi2g41957
OG0005462	pm001422g0050, pm014735g0020	LOC_Os01g40110, LOC_Os01g40120
OG0005462	pm001422g0050, pm014735g0020	AT2G19385, AT2G19380, AT2G22100
OG0005462	pm001422g0050, pm014735g0020	Solyc07g041020
OG0005462	pm001422g0050, pm014735g0020	Chrsp1S03058
OG0005462	pm001422g0050, pm014735g0020	Azfi_s0262.g060811
OG0005462	pm001422g0050, pm014735g0020	Mp8g13930
OG0005462	pm001422g0050, pm014735g0020	419577
OG0005462	pm001422g0050, pm014735g0020	AagrOXF_evm.TU.utg000109l.203
OG0005462	pm001422g0050, pm014735g0020	CBR_g39727
OG0005518	pm002702g0010, pm005409g0040	Azfi_s0370.g067093, Azfi_s0061.g034908
OG0005518	pm000764.t1	Azfi_s0370.g067093, Azfi_s0061.g034908
OG0005518	pm000764.t1	UTEX1559_02755
OG0005518	pm000764.t1	SM000064S19765, SM000019S05105
OG0005518	pm000764.t1	Pp3c21_4580
OG0005518	pm000764.t1	Azfi_s0370.g067093, Azfi_s0061.g034908
OG0005653	pm011823g0010	AagrOXF_evm.TU.utg000018l.319
OG0005653	pm011823g0010	Pp3c18_21620
OG0005653	pm011823g0010	Mp4g03740
OG0005653	pm011823g0010	Bradi5g17390
OG0005653	pm011823g0010	Zm00001d002791
OG0005653	pm011823g0010	LOC_Os04g46050
OG0005653	pm011823g0010	AT1G02145
OG0005653	pm011823g0010	Solyc01g089900
OG0005653	pm011823g0010	91475
OG0005653	pm011823g0010	Azfi_s0042.g026891, Azfi_s3353.g115480
OG0005720	pm027723g0010, pm012848g0010, pm019388g0010	LOC_Os01g57500
OG0005803	pm113734g0010	Solyc09g091500
OG0005803	pm113734g0010	Bradi2g26720
OG0005803	pm113734g0010	LOC_Os05g32310
OG0005803	pm113734g0010	Zm00001d038088, Zm00001d010461
OG0005803	pm113734g0010	SM000018S03675, SM000072S21185, SM000146S00957
OG0006291	pm005234g0010	Mp2g15830
OG0006291	pm031040g0010	Mp5g08400
OG0006291	pm031040g0010	AT5G15530, AT5G16390
OG0006291	pm031040g0010	Solyc06g069530, Solyc05g056290
OG0006291	pm031040g0010	80734
OG0006291	pm031040g0010	Pp3c27_4050, Pp3c16_12600
OG0006291	pm031040g0010	Azfi_s0092.g043053, Azfi_s0054.g033764
OG0006554	pm000354g0020, pm038051g0010	AagrOXF_evm.TU.utg000010l.207
OG0006671	pm015840g0020	Pp3c23_14510
OG0006682	pm067513g0010, pm008462g0010, pm020677.t1	Azfi_s0003.g007689
OG0007051	pm143314g0010, pm012966g0020	Azfi_s0100.g044261
OG0007051	pm143314g0010, pm012966g0020	Zm00001d033543, Zm00001d013536
OG0007051	pm143314g0010, pm012966g0020	Bradi1g12280
OG0007051	pm143314g0010, pm012966g0020	LOC_Os03g48030
OG0007051	pm143314g0010, pm012966g0020	Solyc03g113280
OG0007051	pm143314g0010, pm012966g0020	AT3G47980, AT5G62720
OG0007051	pm143314g0010, pm012966g0020	AagrOXF_evm.TU.utg000024l.333
OG0007051	pm143314g0010	81871
OG0007247	pm011761g0010	AagrOXF_evm.TU.utg000005l.137
OG0007247	pm011761g0010	Pp3c22_3310
OG0007247	pm011761g0010	405094
OG0007247	pm011761g0010	Azfi_s0024.g020367
OG0007481	pm022155g0010, pm016630g0010, pm024677g0020	Bradi5g15612
OG0007617	pm040404g0010	Me1_v2_0180890
OG0007884	pm002480g0040, pm008888g0030	UTEX1559_06535
OG0007949	pm002950g0050	Solyc12g049440
