Me1_v2_0000310
Me1_v2_0000490
Me1_v2_0001480
Me1_v2_0001610
Me1_v2_0005540
Me1_v2_0007640
Me1_v2_0008740
Me1_v2_0011430
Me1_v2_0011450
Me1_v2_0011500
Me1_v2_0013520
Me1_v2_0013560
Me1_v2_0014670
Me1_v2_0017900
Me1_v2_0020390
Me1_v2_0022180
Me1_v2_0024640
Me1_v2_0026300
Me1_v2_0026800
Me1_v2_0026910
Me1_v2_0028520
Me1_v2_0029220
Me1_v2_0031690
Me1_v2_0032540
Me1_v2_0032870
Me1_v2_0033080
Me1_v2_0033340
Me1_v2_0033480
Me1_v2_0034130
Me1_v2_0035190
Me1_v2_0035790
Me1_v2_0036050
Me1_v2_0036070
Me1_v2_0037960
Me1_v2_0039250
Me1_v2_0039300
Me1_v2_0039530
Me1_v2_0039640
Me1_v2_0039910
Me1_v2_0040020
Me1_v2_0040570
Me1_v2_0040630
Me1_v2_0040830
Me1_v2_0041960
Me1_v2_0041990
Me1_v2_0042020
Me1_v2_0042120
Me1_v2_0042490
Me1_v2_0043310
Me1_v2_0044980
Me1_v2_0045750
Me1_v2_0045790
Me1_v2_0045870
Me1_v2_0046500
Me1_v2_0050170
Me1_v2_0050210
Me1_v2_0050220
Me1_v2_0050590
Me1_v2_0050950
Me1_v2_0051440
Me1_v2_0051460
Me1_v2_0051870
Me1_v2_0051910
Me1_v2_0052000
Me1_v2_0052160
Me1_v2_0052840
Me1_v2_0052860
Me1_v2_0052880
Me1_v2_0053230
Me1_v2_0053400
Me1_v2_0053420
Me1_v2_0053500
Me1_v2_0053520
Me1_v2_0053550
Me1_v2_0053580
Me1_v2_0053610
Me1_v2_0053890
Me1_v2_0054040
Me1_v2_0054240
Me1_v2_0054420
Me1_v2_0054460
Me1_v2_0054510
Me1_v2_0054730
Me1_v2_0055010
Me1_v2_0055110
Me1_v2_0055210
Me1_v2_0055440
Me1_v2_0055550
Me1_v2_0055900
Me1_v2_0056370
Me1_v2_0056860
Me1_v2_0056900
Me1_v2_0057000
Me1_v2_0057510
Me1_v2_0058150
Me1_v2_0058440
Me1_v2_0058520
Me1_v2_0058680
Me1_v2_0058750
Me1_v2_0058800
Me1_v2_0058960
Me1_v2_0059150
Me1_v2_0059270
Me1_v2_0059330
Me1_v2_0059350
Me1_v2_0059560
Me1_v2_0059820
Me1_v2_0059840
Me1_v2_0059940
Me1_v2_0060050
Me1_v2_0060540
Me1_v2_0060600
Me1_v2_0060710
Me1_v2_0060720
Me1_v2_0060830
Me1_v2_0060870
Me1_v2_0060980
Me1_v2_0061060
Me1_v2_0061350
Me1_v2_0061640
Me1_v2_0061940
Me1_v2_0061980
Me1_v2_0062170
Me1_v2_0062440
Me1_v2_0062580
Me1_v2_0062820
Me1_v2_0063020
Me1_v2_0063040
Me1_v2_0063050
Me1_v2_0063130
Me1_v2_0063330
Me1_v2_0063680
Me1_v2_0063700
Me1_v2_0063750
Me1_v2_0063770
Me1_v2_0063780
Me1_v2_0064490
Me1_v2_0064570
Me1_v2_0064580
Me1_v2_0064870
Me1_v2_0064920
Me1_v2_0065250
Me1_v2_0065260
Me1_v2_0065750
Me1_v2_0065880
Me1_v2_0065970
Me1_v2_0066260
Me1_v2_0066310
Me1_v2_0066440
Me1_v2_0066480
Me1_v2_0066490
Me1_v2_0066500
Me1_v2_0066720
Me1_v2_0066760
Me1_v2_0066900
Me1_v2_0066910
Me1_v2_0066970
Me1_v2_0067100
Me1_v2_0067340
Me1_v2_0067680
Me1_v2_0067840
Me1_v2_0068010
Me1_v2_0068460
Me1_v2_0068480
Me1_v2_0069380
Me1_v2_0069580
Me1_v2_0069700
Me1_v2_0069710
Me1_v2_0069960
Me1_v2_0070060
Me1_v2_0070450
Me1_v2_0070480
Me1_v2_0070490
Me1_v2_0070560
Me1_v2_0070980
Me1_v2_0071010
Me1_v2_0071090
Me1_v2_0071140
Me1_v2_0071260
Me1_v2_0071870
Me1_v2_0071910
Me1_v2_0071950
Me1_v2_0072010
Me1_v2_0072290
Me1_v2_0072570
Me1_v2_0072710
Me1_v2_0073020
Me1_v2_0073260
Me1_v2_0073360
Me1_v2_0073450
Me1_v2_0073730
Me1_v2_0073790
Me1_v2_0073880
Me1_v2_0073980
Me1_v2_0074010
Me1_v2_0074310
Me1_v2_0074570
Me1_v2_0074980
Me1_v2_0075110
Me1_v2_0075210
Me1_v2_0075320
Me1_v2_0076150
Me1_v2_0076160
Me1_v2_0076260
Me1_v2_0076550
Me1_v2_0077040
Me1_v2_0077190
Me1_v2_0077220
Me1_v2_0077440
Me1_v2_0077520
Me1_v2_0077590
Me1_v2_0077620
Me1_v2_0077730
Me1_v2_0077950
Me1_v2_0078160
Me1_v2_0078170
Me1_v2_0078220
Me1_v2_0078310
Me1_v2_0078560
Me1_v2_0078610
Me1_v2_0078670
Me1_v2_0078730
Me1_v2_0079020
Me1_v2_0079320
Me1_v2_0079490
Me1_v2_0080180
Me1_v2_0080250
Me1_v2_0080310
Me1_v2_0080650
Me1_v2_0081140
Me1_v2_0081160
Me1_v2_0081250
Me1_v2_0081260
Me1_v2_0081300
Me1_v2_0081450
Me1_v2_0081740
Me1_v2_0081950
Me1_v2_0082110
Me1_v2_0083590
Me1_v2_0083600
Me1_v2_0083750
Me1_v2_0083940
Me1_v2_0084290
Me1_v2_0084300
Me1_v2_0084320
Me1_v2_0084410
Me1_v2_0084500
Me1_v2_0084870
Me1_v2_0085060
Me1_v2_0085110
Me1_v2_0085580
Me1_v2_0085610
Me1_v2_0085720
Me1_v2_0085740
Me1_v2_0085760
Me1_v2_0085800
Me1_v2_0085860
Me1_v2_0085900
Me1_v2_0085930
Me1_v2_0085980
Me1_v2_0086010
Me1_v2_0086040
Me1_v2_0086300
Me1_v2_0086500
Me1_v2_0086660
Me1_v2_0086800
Me1_v2_0087080
Me1_v2_0087240
Me1_v2_0087540
Me1_v2_0087670
Me1_v2_0087750
Me1_v2_0087790
Me1_v2_0087840
Me1_v2_0087950
Me1_v2_0088370
Me1_v2_0088430
Me1_v2_0088440
Me1_v2_0088500
Me1_v2_0088620
Me1_v2_0089130
Me1_v2_0089140
Me1_v2_0089240
Me1_v2_0089420
Me1_v2_0089620
Me1_v2_0089630
Me1_v2_0089720
Me1_v2_0089740
Me1_v2_0089780
Me1_v2_0090040
Me1_v2_0090310
Me1_v2_0090360
Me1_v2_0090430
Me1_v2_0090460
Me1_v2_0090470
Me1_v2_0090550
Me1_v2_0090720
Me1_v2_0090890
Me1_v2_0090940
Me1_v2_0091010
Me1_v2_0091070
Me1_v2_0091610
Me1_v2_0092380
Me1_v2_0092630
Me1_v2_0092640
Me1_v2_0092780
Me1_v2_0092870
Me1_v2_0093020
Me1_v2_0093050
Me1_v2_0093150
Me1_v2_0093170
Me1_v2_0093230
Me1_v2_0093570
Me1_v2_0093610
Me1_v2_0093710
Me1_v2_0093930
Me1_v2_0094100
Me1_v2_0094440
Me1_v2_0094660
Me1_v2_0095210
Me1_v2_0095400
Me1_v2_0095600
Me1_v2_0095670
Me1_v2_0096040
Me1_v2_0096370
Me1_v2_0096770
Me1_v2_0096790
Me1_v2_0096820
Me1_v2_0096990
Me1_v2_0097090
Me1_v2_0097220
Me1_v2_0097440
Me1_v2_0097450
Me1_v2_0097650
Me1_v2_0097760
Me1_v2_0097780
Me1_v2_0097990
Me1_v2_0098360
Me1_v2_0098620
Me1_v2_0098640
Me1_v2_0098820
Me1_v2_0099090
Me1_v2_0099190
Me1_v2_0099270
Me1_v2_0099350
Me1_v2_0099660
Me1_v2_0099700
Me1_v2_0099830
Me1_v2_0099840
Me1_v2_0100210
Me1_v2_0100300
Me1_v2_0100470
Me1_v2_0100720
Me1_v2_0100910
Me1_v2_0101060
Me1_v2_0101140
Me1_v2_0101150
Me1_v2_0101320
Me1_v2_0101360
Me1_v2_0101420
Me1_v2_0101560
Me1_v2_0101700
Me1_v2_0102780
Me1_v2_0103150
Me1_v2_0103170
Me1_v2_0103390
Me1_v2_0103420
Me1_v2_0103610
Me1_v2_0103750
Me1_v2_0103890
Me1_v2_0103960
Me1_v2_0104350
Me1_v2_0104580
Me1_v2_0104640
Me1_v2_0104720
Me1_v2_0104740
Me1_v2_0104830
Me1_v2_0104870
Me1_v2_0104900
Me1_v2_0105310
Me1_v2_0105500
Me1_v2_0105870
Me1_v2_0105950
Me1_v2_0106050
Me1_v2_0106070
Me1_v2_0106350
Me1_v2_0106450
Me1_v2_0106940
Me1_v2_0107020
Me1_v2_0107310
Me1_v2_0107920
Me1_v2_0108130
Me1_v2_0108230
Me1_v2_0108410
Me1_v2_0108540
Me1_v2_0108810
Me1_v2_0108920
Me1_v2_0109250
Me1_v2_0109340
Me1_v2_0109490
Me1_v2_0109600
Me1_v2_0109650
Me1_v2_0110000
Me1_v2_0110220
Me1_v2_0110340
Me1_v2_0110650
Me1_v2_0110750
Me1_v2_0110870
Me1_v2_0110900
Me1_v2_0110920
Me1_v2_0111640
Me1_v2_0111740
Me1_v2_0112420
Me1_v2_0112610
Me1_v2_0112630
Me1_v2_0112660
Me1_v2_0112710
Me1_v2_0112770
Me1_v2_0112880
Me1_v2_0113220
Me1_v2_0113230
Me1_v2_0113640
Me1_v2_0113650
Me1_v2_0113700
Me1_v2_0114010
Me1_v2_0114530
Me1_v2_0114640
Me1_v2_0114650
Me1_v2_0114690
Me1_v2_0115120
Me1_v2_0115480
Me1_v2_0115710
Me1_v2_0115840
Me1_v2_0115850
Me1_v2_0115870
Me1_v2_0116020
Me1_v2_0116080
Me1_v2_0116260
Me1_v2_0116310
Me1_v2_0116520
Me1_v2_0116850
Me1_v2_0117320
Me1_v2_0117510
Me1_v2_0117610
Me1_v2_0117620
Me1_v2_0117850
Me1_v2_0118140
Me1_v2_0118170
Me1_v2_0118640
Me1_v2_0118780
Me1_v2_0118860
Me1_v2_0119110
Me1_v2_0119350
Me1_v2_0119360
Me1_v2_0119370
Me1_v2_0119520
Me1_v2_0119570
Me1_v2_0119710
Me1_v2_0119780
Me1_v2_0120340
Me1_v2_0120390
Me1_v2_0120420
Me1_v2_0120990
Me1_v2_0121460
Me1_v2_0121470
Me1_v2_0121620
Me1_v2_0122440
Me1_v2_0122500
Me1_v2_0122810
Me1_v2_0122860
Me1_v2_0123250
Me1_v2_0123310
Me1_v2_0123610
Me1_v2_0123670
Me1_v2_0123720
Me1_v2_0123820
Me1_v2_0123980
Me1_v2_0124010
Me1_v2_0124020
Me1_v2_0124120
Me1_v2_0124190
Me1_v2_0124270
Me1_v2_0124400
Me1_v2_0124610
Me1_v2_0124650
Me1_v2_0124670
Me1_v2_0124800
Me1_v2_0124980
Me1_v2_0125140
Me1_v2_0125250
Me1_v2_0125280
Me1_v2_0125400
Me1_v2_0125410
Me1_v2_0125440
Me1_v2_0125580
Me1_v2_0125600
Me1_v2_0126250
Me1_v2_0126500
Me1_v2_0126570
Me1_v2_0126580
Me1_v2_0126690
Me1_v2_0126710
Me1_v2_0126850
Me1_v2_0127270
Me1_v2_0127380
Me1_v2_0127590
Me1_v2_0128030
Me1_v2_0128090
Me1_v2_0128270
Me1_v2_0128340
Me1_v2_0128360
Me1_v2_0128460
Me1_v2_0128540
Me1_v2_0128560
Me1_v2_0128580
Me1_v2_0128680
Me1_v2_0128860
Me1_v2_0128870
Me1_v2_0129100
Me1_v2_0129260
Me1_v2_0129450
Me1_v2_0129470
Me1_v2_0129580
Me1_v2_0129690
Me1_v2_0129710
Me1_v2_0129770
Me1_v2_0131630
Me1_v2_0131850
Me1_v2_0131880
Me1_v2_0132190
Me1_v2_0132230
Me1_v2_0132270
Me1_v2_0132540
Me1_v2_0132790
Me1_v2_0132880
Me1_v2_0133100
Me1_v2_0133210
Me1_v2_0133230
Me1_v2_0133250
Me1_v2_0133270
Me1_v2_0133320
Me1_v2_0133360
Me1_v2_0133420
Me1_v2_0133450
Me1_v2_0133620
Me1_v2_0133650
Me1_v2_0133740
Me1_v2_0133750
Me1_v2_0133780
Me1_v2_0133800
Me1_v2_0133860
Me1_v2_0133950
Me1_v2_0133980
Me1_v2_0134080
Me1_v2_0134700
Me1_v2_0134810
Me1_v2_0135010
Me1_v2_0135050
Me1_v2_0135070
Me1_v2_0135100
Me1_v2_0135230
Me1_v2_0135240
Me1_v2_0135600
Me1_v2_0135620
Me1_v2_0135680
Me1_v2_0135800
Me1_v2_0135900
Me1_v2_0135990
Me1_v2_0136040
Me1_v2_0136470
Me1_v2_0136900
Me1_v2_0136920
Me1_v2_0137100
Me1_v2_0137110
Me1_v2_0137330
Me1_v2_0137760
Me1_v2_0138430
Me1_v2_0138440
Me1_v2_0138660
Me1_v2_0138870
Me1_v2_0138950
Me1_v2_0139710
Me1_v2_0139950
Me1_v2_0140100
Me1_v2_0140170
Me1_v2_0140320
Me1_v2_0140350
Me1_v2_0140380
Me1_v2_0140810
Me1_v2_0140850
Me1_v2_0141120
Me1_v2_0141410
Me1_v2_0141660
Me1_v2_0141790
Me1_v2_0142130
Me1_v2_0142530
Me1_v2_0142540
Me1_v2_0142600
Me1_v2_0142710
Me1_v2_0142810
Me1_v2_0143050
Me1_v2_0143110
Me1_v2_0143230
Me1_v2_0143340
Me1_v2_0143370
Me1_v2_0143560
Me1_v2_0143780
Me1_v2_0143840
Me1_v2_0144090
Me1_v2_0144230
Me1_v2_0144430
Me1_v2_0144660
Me1_v2_0144790
Me1_v2_0144850
Me1_v2_0144890
Me1_v2_0144970
Me1_v2_0144990
Me1_v2_0145260
Me1_v2_0145350
Me1_v2_0145370
Me1_v2_0145400
Me1_v2_0145410
Me1_v2_0145540
Me1_v2_0145610
Me1_v2_0145690
Me1_v2_0145780
Me1_v2_0146180
Me1_v2_0146320
Me1_v2_0146470
Me1_v2_0146550
Me1_v2_0146710
Me1_v2_0146830
Me1_v2_0147380
Me1_v2_0147410
Me1_v2_0147940
Me1_v2_0147980
Me1_v2_0148280
Me1_v2_0148290
Me1_v2_0148410
Me1_v2_0148420
Me1_v2_0148430
Me1_v2_0148610
Me1_v2_0148830
Me1_v2_0149170
Me1_v2_0149280
Me1_v2_0149350
Me1_v2_0149480
Me1_v2_0149510
Me1_v2_0149930
Me1_v2_0149980
Me1_v2_0150020
Me1_v2_0150060
Me1_v2_0150120
Me1_v2_0150380
Me1_v2_0150530
Me1_v2_0150890
Me1_v2_0150970
Me1_v2_0150980
Me1_v2_0151070
Me1_v2_0151100
Me1_v2_0151470
Me1_v2_0151520
Me1_v2_0151850
Me1_v2_0152000
Me1_v2_0152050
Me1_v2_0152200
Me1_v2_0152410
Me1_v2_0152470
Me1_v2_0152570
Me1_v2_0152650
Me1_v2_0152660
Me1_v2_0152980
Me1_v2_0153040
Me1_v2_0153740
Me1_v2_0153840
Me1_v2_0153970
Me1_v2_0154360
Me1_v2_0154430
Me1_v2_0155040
Me1_v2_0155290
Me1_v2_0155450
Me1_v2_0155700
Me1_v2_0155720
Me1_v2_0155790
Me1_v2_0155800
Me1_v2_0155860
Me1_v2_0155980
Me1_v2_0156160
Me1_v2_0156300
Me1_v2_0157010
Me1_v2_0157220
Me1_v2_0157280
Me1_v2_0157540
Me1_v2_0157590
Me1_v2_0157640
Me1_v2_0157660
Me1_v2_0157870
Me1_v2_0157920
Me1_v2_0158150
Me1_v2_0158420
Me1_v2_0158440
Me1_v2_0159360
Me1_v2_0159480
Me1_v2_0159500
Me1_v2_0159690
Me1_v2_0159700
Me1_v2_0159710
Me1_v2_0159720
Me1_v2_0159790
Me1_v2_0159940
Me1_v2_0160090
Me1_v2_0160380
Me1_v2_0160630
Me1_v2_0160830
Me1_v2_0160920
Me1_v2_0161050
Me1_v2_0161200
Me1_v2_0161350
Me1_v2_0161980
Me1_v2_0162020
Me1_v2_0162130
Me1_v2_0162600
Me1_v2_0162810
Me1_v2_0163020
Me1_v2_0163100
Me1_v2_0163260
Me1_v2_0163390
Me1_v2_0163570
Me1_v2_0163730
Me1_v2_0164070
Me1_v2_0164460
Me1_v2_0164670
Me1_v2_0164750
Me1_v2_0164860
Me1_v2_0164930
Me1_v2_0165230
Me1_v2_0165250
Me1_v2_0165730
Me1_v2_0165740
Me1_v2_0165890
Me1_v2_0165900
Me1_v2_0166030
Me1_v2_0166350
Me1_v2_0166380
Me1_v2_0166590
Me1_v2_0166750
Me1_v2_0166940
Me1_v2_0167430
Me1_v2_0167570
Me1_v2_0167970
Me1_v2_0168160
Me1_v2_0168230
Me1_v2_0168250
Me1_v2_0168310
Me1_v2_0168630
Me1_v2_0168640
Me1_v2_0169210
Me1_v2_0169570
Me1_v2_0169690
Me1_v2_0169830
Me1_v2_0169840
Me1_v2_0169900
Me1_v2_0170310
Me1_v2_0170320
Me1_v2_0170600
Me1_v2_0170930
Me1_v2_0170950
Me1_v2_0171040
Me1_v2_0171190
Me1_v2_0171320
Me1_v2_0171620
Me1_v2_0171660
Me1_v2_0171670
Me1_v2_0171770
Me1_v2_0171780
Me1_v2_0171790
Me1_v2_0171810
Me1_v2_0172120
Me1_v2_0172160
Me1_v2_0172260
Me1_v2_0172310
Me1_v2_0172460
Me1_v2_0172600
Me1_v2_0172910
Me1_v2_0172950
Me1_v2_0173070
Me1_v2_0173450
Me1_v2_0173860
Me1_v2_0174040
Me1_v2_0174270
Me1_v2_0174280
Me1_v2_0174760
Me1_v2_0175290
Me1_v2_0175690
Me1_v2_0175760
Me1_v2_0176030
Me1_v2_0176080
Me1_v2_0176490
Me1_v2_0176520
Me1_v2_0176650
Me1_v2_0176660
Me1_v2_0176800
Me1_v2_0176900
Me1_v2_0176910
Me1_v2_0177230
Me1_v2_0177360
Me1_v2_0177860
Me1_v2_0177880
Me1_v2_0178000
Me1_v2_0178230
Me1_v2_0178450
Me1_v2_0178620
Me1_v2_0178840
Me1_v2_0178850
Me1_v2_0179240
Me1_v2_0179260
Me1_v2_0179510
Me1_v2_0179580
Me1_v2_0179780
Me1_v2_0180370
Me1_v2_0181150
Me1_v2_0181160
Me1_v2_0181170
Me1_v2_0181180
Me1_v2_0181270
Me1_v2_0181290
Me1_v2_0181320
Me1_v2_0181330
Me1_v2_0181340
Me1_v2_0181510
Me1_v2_0181590
Me1_v2_0181600
Me1_v2_0182410
Me1_v2_0182460
Me1_v2_0182480
Me1_v2_0182560
Me1_v2_0182660
Me1_v2_0182790
Me1_v2_0182930
Me1_v2_0183030
Me1_v2_0183470
Me1_v2_0183520
Me1_v2_0183590
Me1_v2_0183650
Me1_v2_0183860
Me1_v2_0184440
Me1_v2_0184510
Me1_v2_0185080
Me1_v2_0185290
Me1_v2_0185420
Me1_v2_0185680
Me1_v2_0185790
Me1_v2_0185810
Me1_v2_0185950
Me1_v2_0186010
Me1_v2_0186040
Me1_v2_0186070
Me1_v2_0186140
Me1_v2_0186230
Me1_v2_0186300
Me1_v2_0186440
Me1_v2_0186600
Me1_v2_0186710
Me1_v2_0186730
Me1_v2_0187210
Me1_v2_0187490
Me1_v2_0187520
Me1_v2_0187620
Me1_v2_0187680
Me1_v2_0187710
Me1_v2_0187720
Me1_v2_0187750
Me1_v2_0187770
Me1_v2_0187960
Me1_v2_0188410
Me1_v2_0188810
Me1_v2_0188860
Me1_v2_0189050
Me1_v2_0189570
Me1_v2_0189660
Me1_v2_0189680
Me1_v2_0189700
Me1_v2_0189710
Me1_v2_0190620
Me1_v2_0190670
Me1_v2_0190780
Me1_v2_0190950
Me1_v2_0191100
Me1_v2_0191630
Me1_v2_0191840
Me1_v2_0191860
Me1_v2_0192020
Me1_v2_0192140
Me1_v2_0192150
Me1_v2_0192210
Me1_v2_0192330
Me1_v2_0192350
Me1_v2_0192410
Me1_v2_0192540
Me1_v2_0193130
Me1_v2_0193320
Me1_v2_0193370
Me1_v2_0193460
Me1_v2_0193520
Me1_v2_0193590
Me1_v2_0194090
Me1_v2_0194310
Me1_v2_0194330
Me1_v2_0194380
Me1_v2_0194480
Me1_v2_0194700
Me1_v2_0195280
Me1_v2_0195330
Me1_v2_0195470
Me1_v2_0195650
Me1_v2_0195750
Me1_v2_0196000
Me1_v2_0196290
Me1_v2_0196370
Me1_v2_0196440
Me1_v2_0196890
Me1_v2_0196900
Me1_v2_0197200
Me1_v2_0197270
Me1_v2_0197450
Me1_v2_0197600
Me1_v2_0197700
Me1_v2_0197730
Me1_v2_0197930
Me1_v2_0198050
Me1_v2_0198310
Me1_v2_0198800
Me1_v2_0198810
Me1_v2_0198960
Me1_v2_0199060
Me1_v2_0199310
Me1_v2_0199460
Me1_v2_0199480
Me1_v2_0199920
Me1_v2_0200110
Me1_v2_0200180
Me1_v2_0200330
Me1_v2_0200500
Me1_v2_0200510
Me1_v2_0200530
Me1_v2_0201270
Me1_v2_0201550
Me1_v2_0202140
Me1_v2_0202520
Me1_v2_0202550
Me1_v2_0202610
Me1_v2_0202750
Me1_v2_0202790
Me1_v2_0202940
Me1_v2_0203130
Me1_v2_0203690
Me1_v2_0203870
Me1_v2_0203890
Me1_v2_0204010
Me1_v2_0204470
Me1_v2_0204480
Me1_v2_0204550
Me1_v2_0204710
Me1_v2_0205700
Me1_v2_0206070
Me1_v2_0206170
Me1_v2_0206370
Me1_v2_0206450
Me1_v2_0206560
Me1_v2_0206600
Me1_v2_0206960
Me1_v2_0207050
Me1_v2_0207090
Me1_v2_0207610
Me1_v2_0207800
Me1_v2_0207810
Me1_v2_0208120
Me1_v2_0208260
Me1_v2_0208300
Me1_v2_0208900
Me1_v2_0209140
Me1_v2_0209460
Me1_v2_0209540
Me1_v2_0209840
Me1_v2_0209930
Me1_v2_0210300
Me1_v2_0210400
Me1_v2_0210700
Me1_v2_0210810
Me1_v2_0210990
Me1_v2_0211150
Me1_v2_0211410
Me1_v2_0211490
Me1_v2_0211940
Me1_v2_0212830
Me1_v2_0213340
Me1_v2_0213680
Me1_v2_0213770
Me1_v2_0214150
Me1_v2_0214420
Me1_v2_0214490
Me1_v2_0214510
Me1_v2_0215020
Me1_v2_0215430
Me1_v2_0216070
Me1_v2_0216370
Me1_v2_0216510
Me1_v2_0216620
Me1_v2_0216820
Me1_v2_0217420
Me1_v2_0217440
Me1_v2_0217710
Me1_v2_0218160
Me1_v2_0218300
Me1_v2_0218350
Me1_v2_0218420
Me1_v2_0218430
Me1_v2_0218810
Me1_v2_0218870
Me1_v2_0219010
Me1_v2_0219020
Me1_v2_0219080
Me1_v2_0219310
Me1_v2_0219450
Me1_v2_0219960
Me1_v2_0220640
Me1_v2_0220840
Me1_v2_0220970
Me1_v2_0221640
Me1_v2_0221760
Me1_v2_0221790
Me1_v2_0221950
Me1_v2_0222500
Me1_v2_0222580
Me1_v2_0222710
Me1_v2_0223110
Me1_v2_0223160
Me1_v2_0223390
Me1_v2_0223860
Me1_v2_0223940
Me1_v2_0224110
Me1_v2_0224550
Me1_v2_0224670
Me1_v2_0225230
Me1_v2_0225250
Me1_v2_0225270
Me1_v2_0225420
Me1_v2_0225880
Me1_v2_0225910
Me1_v2_0226090
Me1_v2_0226260
Me1_v2_0226270
Me1_v2_0226390
Me1_v2_0226500
Me1_v2_0226760
Me1_v2_0226940
Me1_v2_0226950
Me1_v2_0226970
Me1_v2_0226990
Me1_v2_0227600
Me1_v2_0227620
Me1_v2_0227710
Me1_v2_0227870
Me1_v2_0227960
Me1_v2_0228580
Me1_v2_0228750
Me1_v2_0228930
Me1_v2_0229010
Me1_v2_0229370
Me1_v2_0229400
Me1_v2_0229540
Me1_v2_0229570
Me1_v2_0229780
Me1_v2_0230510
Me1_v2_0230620
Me1_v2_0230880
Me1_v2_0230890
Me1_v2_0230900
Me1_v2_0230940
Me1_v2_0231290
Me1_v2_0231720
Me1_v2_0231740
Me1_v2_0232290
Me1_v2_0232840
Me1_v2_0232870
Me1_v2_0232970
Me1_v2_0233140
Me1_v2_0233550
Me1_v2_0233670
Me1_v2_0233680
Me1_v2_0233820
Me1_v2_0234310
Me1_v2_0234330
Me1_v2_0234430
Me1_v2_0234450
Me1_v2_0234460
Me1_v2_0234510
Me1_v2_0234550
Me1_v2_0235170