"","ID","Description","GeneRatio","BgRatio","pvalue","p.adjust","qvalue","geneID","Count"
"GO:0032446","GO:0032446","protein modification by small protein conjugation","3/20","35/1957",0.00485220141468605,0.451343028129098,0.44276141640661,"Zci_11302/Zci_06041/Zci_06656",3
"GO:0016567","GO:0016567","protein ubiquitination","3/20","36/1957",0.00525882455971876,0.451343028129098,0.44276141640661,"Zci_11302/Zci_06041/Zci_06656",3
"GO:0070647","GO:0070647","protein modification by small protein conjugation or removal","3/20","40/1957",0.00708915750988112,0.451343028129098,0.44276141640661,"Zci_11302/Zci_06041/Zci_06656",3
"GO:1901565","GO:1901565","organonitrogen compound catabolic process","4/20","88/1957",0.0106407610071422,0.50809633809104,0.498435647176661,"Zci_11302/Zci_06656/Zci_14107/Zci_12831",4
"GO:0006302","GO:0006302","double-strand break repair","2/20","20/1957",0.0168892564692683,0.524256591441239,0.514288637511935,"Zci_06656/Zci_11436",2
"GO:0043161","GO:0043161","proteasome-mediated ubiquitin-dependent protein catabolic process","2/20","21/1957",0.0185533317987549,0.524256591441239,0.514288637511935,"Zci_11302/Zci_06656",2
"GO:0010498","GO:0010498","proteasomal protein catabolic process","2/20","22/1957",0.0202843655312203,0.524256591441239,0.514288637511935,"Zci_11302/Zci_06656",2
"GO:0009605","GO:0009605","response to external stimulus","5/20","188/1957",0.0363722043143154,0.524256591441239,0.514288637511935,"Zci_05276/Zci_06041/Zci_10080/Zci_12831/Zci_12963",5
"GO:0006511","GO:0006511","ubiquitin-dependent protein catabolic process","2/20","31/1957",0.0386523874179823,0.524256591441239,0.514288637511935,"Zci_11302/Zci_06656",2
"GO:0019941","GO:0019941","modification-dependent protein catabolic process","2/20","31/1957",0.0386523874179823,0.524256591441239,0.514288637511935,"Zci_11302/Zci_06656",2
"GO:0044248","GO:0044248","cellular catabolic process","4/20","134/1957",0.0431428845025238,0.524256591441239,0.514288637511935,"Zci_11302/Zci_06656/Zci_14107/Zci_12831",4
"GO:0043632","GO:0043632","modification-dependent macromolecule catabolic process","2/20","35/1957",0.0482705172342897,0.524256591441239,0.514288637511935,"Zci_11302/Zci_06656",2
"GO:1901575","GO:1901575","organic substance catabolic process","4/20","139/1957",0.0483936193388202,0.524256591441239,0.514288637511935,"Zci_11302/Zci_06656/Zci_14107/Zci_12831",4
"GO:0009056","GO:0009056","catabolic process","4/20","150/1957",0.0611844563201661,0.524256591441239,0.514288637511935,"Zci_11302/Zci_06656/Zci_14107/Zci_12831",4
"GO:0046700","GO:0046700","heterocycle catabolic process","2/20","44/1957",0.072672801851507,0.524256591441239,0.514288637511935,"Zci_14107/Zci_12831",2
"GO:0051603","GO:0051603","proteolysis involved in cellular protein catabolic process","2/20","47/1957",0.081551972120958,0.524256591441239,0.514288637511935,"Zci_11302/Zci_06656",2
"GO:1901361","GO:1901361","organic cyclic compound catabolic process","2/20","48/1957",0.0845856034720465,0.524256591441239,0.514288637511935,"Zci_14107/Zci_12831",2
"GO:0044257","GO:0044257","cellular protein catabolic process","2/20","49/1957",0.0876545673996415,0.524256591441239,0.514288637511935,"Zci_11302/Zci_06656",2
"GO:0030587","GO:0030587","sorocarp development","1/20","10/1957",0.097838057277985,0.524256591441239,0.514288637511935,"Zci_12963",1
"GO:0040011","GO:0040011","locomotion","1/20","10/1957",0.097838057277985,0.524256591441239,0.514288637511935,"Zci_05276",1
"GO:0060548","GO:0060548","negative regulation of cell death","1/20","10/1957",0.097838057277985,0.524256591441239,0.514288637511935,"Zci_06041",1
"GO:0099120","GO:0099120","socially cooperative development","1/20","10/1957",0.097838057277985,0.524256591441239,0.514288637511935,"Zci_12963",1
"GO:2000241","GO:2000241","regulation of reproductive process","2/20","53/1957",0.100264927891052,0.524256591441239,0.514288637511935,"Zci_06041/Zci_12963",2
"GO:0030163","GO:0030163","protein catabolic process","2/20","55/1957",0.10675802173867,0.524256591441239,0.514288637511935,"Zci_11302/Zci_06656",2
"GO:0000075","GO:0000075","cell cycle checkpoint signaling","1/20","11/1957",0.10710525751139,0.524256591441239,0.514288637511935,"Zci_11436",1
"GO:0009063","GO:0009063","cellular amino acid catabolic process","1/20","11/1957",0.10710525751139,0.524256591441239,0.514288637511935,"Zci_14107",1
"GO:0009112","GO:0009112","nucleobase metabolic process","1/20","11/1957",0.10710525751139,0.524256591441239,0.514288637511935,"Zci_12831",1
"GO:0009615","GO:0009615","response to virus","1/20","11/1957",0.10710525751139,0.524256591441239,0.514288637511935,"Zci_12963",1
"GO:0090626","GO:0090626","plant epidermis morphogenesis","1/20","11/1957",0.10710525751139,0.524256591441239,0.514288637511935,"Zci_11436",1
"GO:0006464","GO:0006464","cellular protein modification process","5/20","255/1957",0.107999975971857,0.524256591441239,0.514288637511935,"Zci_11302/Zci_12790/Zci_06041/Zci_06656/Zci_12963",5
"GO:0036211","GO:0036211","protein modification process","5/20","256/1957",0.109410814697029,0.524256591441239,0.514288637511935,"Zci_11302/Zci_12790/Zci_06041/Zci_06656/Zci_12963",5
"GO:0006664","GO:0006664","glycolipid metabolic process","1/20","12/1957",0.116281976344778,0.524256591441239,0.514288637511935,"Zci_10080",1
"GO:0043648","GO:0043648","dicarboxylic acid metabolic process","1/20","12/1957",0.116281976344778,0.524256591441239,0.514288637511935,"Zci_14107",1
"GO:1903509","GO:1903509","liposaccharide metabolic process","1/20","12/1957",0.116281976344778,0.524256591441239,0.514288637511935,"Zci_10080",1
"GO:0000724","GO:0000724","double-strand break repair via homologous recombination","1/20","13/1957",0.125369051138147,0.524256591441239,0.514288637511935,"Zci_11436",1
"GO:0051703","GO:0051703","biological process involved in intraspecies interaction between organisms","1/20","13/1957",0.125369051138147,0.524256591441239,0.514288637511935,"Zci_12963",1
"GO:2000028","GO:2000028","regulation of photoperiodism, flowering","1/20","13/1957",0.125369051138147,0.524256591441239,0.514288637511935,"Zci_06041",1
"GO:0044265","GO:0044265","cellular macromolecule catabolic process","2/20","61/1957",0.12690541533998,0.524256591441239,0.514288637511935,"Zci_11302/Zci_06656",2
"GO:0015833","GO:0015833","peptide transport","2/20","62/1957",0.130352049498057,0.524256591441239,0.514288637511935,"Zci_06656/Zci_09731",2
"GO:0034613","GO:0034613","cellular protein localization","2/20","62/1957",0.130352049498057,0.524256591441239,0.514288637511935,"Zci_06656/Zci_09731",2
"GO:0006886","GO:0006886","intracellular protein transport","2/20","63/1957",0.133821910681603,0.524256591441239,0.514288637511935,"Zci_06656/Zci_09731",2
"GO:0000725","GO:0000725","recombinational repair","1/20","14/1957",0.134367311928907,0.524256591441239,0.514288637511935,"Zci_11436",1
"GO:0006366","GO:0006366","transcription by RNA polymerase II","1/20","14/1957",0.134367311928907,0.524256591441239,0.514288637511935,"Zci_05217",1
"GO:0016054","GO:0016054","organic acid catabolic process","1/20","14/1957",0.134367311928907,0.524256591441239,0.514288637511935,"Zci_14107",1
"GO:0046395","GO:0046395","carboxylic acid catabolic process","1/20","14/1957",0.134367311928907,0.524256591441239,0.514288637511935,"Zci_14107",1
"GO:0006281","GO:0006281","DNA repair","2/20","64/1957",0.137314228983549,0.524256591441239,0.514288637511935,"Zci_06656/Zci_11436",2
"GO:0045184","GO:0045184","establishment of protein localization","2/20","64/1957",0.137314228983549,0.524256591441239,0.514288637511935,"Zci_06656/Zci_09731",2
"GO:0015031","GO:0015031","protein transport","2/20","65/1957",0.140828246342688,0.524256591441239,0.514288637511935,"Zci_06656/Zci_09731",2
"GO:0042886","GO:0042886","amide transport","2/20","65/1957",0.140828246342688,0.524256591441239,0.514288637511935,"Zci_06656/Zci_09731",2
"GO:0045786","GO:0045786","negative regulation of cell cycle","1/20","15/1957",0.143277581492171,0.524256591441239,0.514288637511935,"Zci_11436",1
"GO:0006974","GO:0006974","cellular response to DNA damage stimulus","2/20","66/1957",0.144363216401791,0.524256591441239,0.514288637511935,"Zci_06656/Zci_11436",2
"GO:0043207","GO:0043207","response to external biotic stimulus","3/20","132/1957",0.147846983647991,0.524256591441239,0.514288637511935,"Zci_06041/Zci_10080/Zci_12963",3
"GO:0051707","GO:0051707","response to other organism","3/20","132/1957",0.147846983647991,0.524256591441239,0.514288637511935,"Zci_06041/Zci_10080/Zci_12963",3
"GO:0009607","GO:0009607","response to biotic stimulus","3/20","133/1957",0.150286493441203,0.524256591441239,0.514288637511935,"Zci_06041/Zci_10080/Zci_12963",3
"GO:1901564","GO:1901564","organonitrogen compound metabolic process","7/20","448/1957",0.151738061719758,0.524256591441239,0.514288637511935,"Zci_11302/Zci_12790/Zci_06041/Zci_06656/Zci_14107/Zci_12831/Zci_12963",7
"GO:0008104","GO:0008104","protein localization","2/20","70/1957",0.15869809830899,0.524256591441239,0.514288637511935,"Zci_06656/Zci_09731",2
"GO:0009553","GO:0009553","embryo sac development","1/20","17/1957",0.160837402083741,0.524256591441239,0.514288637511935,"Zci_05276",1
"GO:0072527","GO:0072527","pyrimidine-containing compound metabolic process","1/20","17/1957",0.160837402083741,0.524256591441239,0.514288637511935,"Zci_12831",1
"GO:0070727","GO:0070727","cellular macromolecule localization","2/20","71/1957",0.162327036399374,0.524256591441239,0.514288637511935,"Zci_06656/Zci_09731",2
"GO:0043412","GO:0043412","macromolecule modification","5/20","291/1957",0.164687934484159,0.524256591441239,0.514288637511935,"Zci_11302/Zci_12790/Zci_06041/Zci_06656/Zci_12963",5
"GO:0006643","GO:0006643","membrane lipid metabolic process","1/20","19/1957",0.178054952130044,0.54673779585906,0.536342395496901,"Zci_10080",1
"GO:0044267","GO:0044267","cellular protein metabolic process","5/20","299/1957",0.178826140401671,0.54673779585906,0.536342395496901,"Zci_11302/Zci_12790/Zci_06041/Zci_06656/Zci_12963",5
"GO:0050776","GO:0050776","regulation of immune response","1/20","20/1957",0.186537357164822,0.54673779585906,0.536342395496901,"Zci_06041",1
"GO:0046907","GO:0046907","intracellular transport","2/20","79/1957",0.191905380219124,0.54673779585906,0.536342395496901,"Zci_06656/Zci_09731",2
"GO:0007346","GO:0007346","regulation of mitotic cell cycle","1/20","21/1957",0.194936558433125,0.54673779585906,0.536342395496901,"Zci_11436",1
"GO:0043067","GO:0043067","regulation of programmed cell death","1/20","21/1957",0.194936558433125,0.54673779585906,0.536342395496901,"Zci_06041",1
"GO:0002682","GO:0002682","regulation of immune system process","1/20","22/1957",0.203253329523692,0.54673779585906,0.536342395496901,"Zci_06041",1
"GO:0048868","GO:0048868","pollen tube development","1/20","22/1957",0.203253329523692,0.54673779585906,0.536342395496901,"Zci_05276",1
"GO:0009057","GO:0009057","macromolecule catabolic process","2/20","83/1957",0.20699417539319,0.54673779585906,0.536342395496901,"Zci_11302/Zci_06656",2
"GO:0006793","GO:0006793","phosphorus metabolic process","4/20","237/1957",0.216670727678681,0.54673779585906,0.536342395496901,"Zci_12790/Zci_10080/Zci_09229/Zci_12963",4
"GO:0006644","GO:0006644","phospholipid metabolic process","1/20","24/1957",0.21964264160086,0.54673779585906,0.536342395496901,"Zci_10080",1
"GO:0010941","GO:0010941","regulation of cell death","1/20","24/1957",0.21964264160086,0.54673779585906,0.536342395496901,"Zci_06041",1
"GO:0018105","GO:0018105","peptidyl-serine phosphorylation","1/20","24/1957",0.21964264160086,0.54673779585906,0.536342395496901,"Zci_12963",1
"GO:0018209","GO:0018209","peptidyl-serine modification","1/20","24/1957",0.21964264160086,0.54673779585906,0.536342395496901,"Zci_12963",1
"GO:0044282","GO:0044282","small molecule catabolic process","1/20","24/1957",0.21964264160086,0.54673779585906,0.536342395496901,"Zci_14107",1
"GO:0006796","GO:0006796","phosphate-containing compound metabolic process","4/20","240/1957",0.223418154126558,0.54673779585906,0.536342395496901,"Zci_12790/Zci_10080/Zci_09229/Zci_12963",4
"GO:0051649","GO:0051649","establishment of localization in cell","2/20","88/1957",0.226062105623156,0.54673779585906,0.536342395496901,"Zci_06656/Zci_09731",2
"GO:0009611","GO:0009611","response to wounding","1/20","25/1957",0.227716696007473,0.54673779585906,0.536342395496901,"Zci_09229",1
"GO:0019538","GO:0019538","protein metabolic process","5/20","326/1957",0.230085259430571,0.54673779585906,0.536342395496901,"Zci_11302/Zci_12790/Zci_06041/Zci_06656/Zci_12963",5
"GO:0006310","GO:0006310","DNA recombination","1/20","26/1957",0.23571134718752,0.54673779585906,0.536342395496901,"Zci_11436",1
"GO:0006605","GO:0006605","protein targeting","1/20","26/1957",0.23571134718752,0.54673779585906,0.536342395496901,"Zci_09731",1
"GO:0045595","GO:0045595","regulation of cell differentiation","1/20","26/1957",0.23571134718752,0.54673779585906,0.536342395496901,"Zci_12963",1
"GO:0006259","GO:0006259","DNA metabolic process","2/20","91/1957",0.237587628567026,0.54673779585906,0.536342395496901,"Zci_06656/Zci_11436",2
"GO:0051301","GO:0051301","cell division","1/20","27/1957",0.243627335305723,0.547324469736002,0.53691791464871,"Zci_11436",1
"GO:0080167","GO:0080167","response to karrikin","1/20","27/1957",0.243627335305723,0.547324469736002,0.53691791464871,"Zci_11302",1
"GO:0048856","GO:0048856","anatomical structure development","5/20","338/1957",0.254389483078837,0.547324469736002,0.53691791464871,"Zci_05276/Zci_11436/Zci_09229/Zci_12192/Zci_12963",5
"GO:0009856","GO:0009856","pollination","1/20","29/1957",0.259226250471633,0.547324469736002,0.53691791464871,"Zci_05276",1
"GO:0031669","GO:0031669","cellular response to nutrient levels","1/20","29/1957",0.259226250471633,0.547324469736002,0.53691791464871,"Zci_12831",1
"GO:0044706","GO:0044706","multi-multicellular organism process","1/20","29/1957",0.259226250471633,0.547324469736002,0.53691791464871,"Zci_05276",1
"GO:0033036","GO:0033036","macromolecule localization","2/20","97/1957",0.260767155738095,0.547324469736002,0.53691791464871,"Zci_06656/Zci_09731",2
"GO:0071705","GO:0071705","nitrogen compound transport","2/20","97/1957",0.260767155738095,0.547324469736002,0.53691791464871,"Zci_06656/Zci_09731",2
"GO:0000904","GO:0000904","cell morphogenesis involved in differentiation","1/20","31/1957",0.274519233401699,0.558553404868577,0.547933348396841,"Zci_11436",1
"GO:0007154","GO:0007154","cell communication","3/20","180/1957",0.277264298568578,0.558553404868577,0.547933348396841,"Zci_05276/Zci_12831/Zci_12963",3
"GO:0006470","GO:0006470","protein dephosphorylation","1/20","32/1957",0.282052782379874,0.558553404868577,0.547933348396841,"Zci_12790",1
"GO:1901605","GO:1901605","alpha-amino acid metabolic process","1/20","32/1957",0.282052782379874,0.558553404868577,0.547933348396841,"Zci_14107",1
"GO:0032502","GO:0032502","developmental process","5/20","354/1957",0.287970889158111,0.558553404868577,0.547933348396841,"Zci_05276/Zci_11436/Zci_09229/Zci_12192/Zci_12963",5
"GO:0031668","GO:0031668","cellular response to extracellular stimulus","1/20","33/1957",0.289511974251252,0.558553404868577,0.547933348396841,"Zci_12831",1
"GO:0048646","GO:0048646","anatomical structure formation involved in morphogenesis","1/20","33/1957",0.289511974251252,0.558553404868577,0.547933348396841,"Zci_12192",1
"GO:0071496","GO:0071496","cellular response to external stimulus","1/20","33/1957",0.289511974251252,0.558553404868577,0.547933348396841,"Zci_12831",1
"GO:0051641","GO:0051641","cellular localization","2/20","106/1957",0.295676637647265,0.561459637533744,0.550784323400422,"Zci_06656/Zci_09731",2
"GO:0090558","GO:0090558","plant epidermis development","1/20","34/1957",0.296897504664441,0.561459637533744,0.550784323400422,"Zci_11436",1
"GO:0044260","GO:0044260","cellular macromolecule metabolic process","6/20","450/1957",0.30268784203856,0.56679782185652,0.556021010143072,"Zci_11302/Zci_12790/Zci_06041/Zci_06656/Zci_11436/Zci_12963",6
"GO:0072594","GO:0072594","establishment of protein localization to organelle","1/20","36/1957",0.31145033301298,0.577543821412419,0.566562690611246,"Zci_09731",1
"GO:0051726","GO:0051726","regulation of cell cycle","1/20","37/1957",0.318618991701028,0.585156032835542,0.574030167234646,"Zci_11436",1
"GO:0031667","GO:0031667","response to nutrient levels","1/20","38/1957",0.325716710537475,0.592494206787217,0.581228816798703,"Zci_12831",1
"GO:0050793","GO:0050793","regulation of developmental process","2/20","116/1957",0.334350087283761,0.600959524640656,0.589533179311307,"Zci_06041/Zci_12963",2
"GO:0033365","GO:0033365","protein localization to organelle","1/20","40/1957",0.339701984388496,0.600959524640656,0.589533179311307,"Zci_09731",1
"GO:0009653","GO:0009653","anatomical structure morphogenesis","2/20","119/1957",0.345879100718669,0.600959524640656,0.589533179311307,"Zci_11436/Zci_12192",2
"GO:0048523","GO:0048523","negative regulation of cellular process","2/20","119/1957",0.345879100718669,0.600959524640656,0.589533179311307,"Zci_06041/Zci_11436",2
"GO:0006486","GO:0006486","protein glycosylation","1/20","42/1957",0.353411407349121,0.600959524640656,0.589533179311307,"Zci_09918",1
"GO:0009991","GO:0009991","response to extracellular stimulus","1/20","42/1957",0.353411407349121,0.600959524640656,0.589533179311307,"Zci_12831",1
"GO:0044270","GO:0044270","cellular nitrogen compound catabolic process","1/20","42/1957",0.353411407349121,0.600959524640656,0.589533179311307,"Zci_12831",1
"GO:1903047","GO:1903047","mitotic cell cycle process","1/20","43/1957",0.360164290823282,0.600959524640656,0.589533179311307,"Zci_11436",1
"GO:0048583","GO:0048583","regulation of response to stimulus","2/20","124/1957",0.364982886890012,0.600959524640656,0.589533179311307,"Zci_06041/Zci_09229",2
"GO:0006520","GO:0006520","cellular amino acid metabolic process","1/20","44/1957",0.366850139404021,0.600959524640656,0.589533179311307,"Zci_14107",1
"GO:0046777","GO:0046777","protein autophosphorylation","1/20","44/1957",0.366850139404021,0.600959524640656,0.589533179311307,"Zci_12963",1
"GO:0071702","GO:0071702","organic substance transport","2/20","125/1957",0.368784485025746,0.600959524640656,0.589533179311307,"Zci_06656/Zci_09731",2
"GO:0000278","GO:0000278","mitotic cell cycle","1/20","45/1957",0.37346958384308,0.600959524640656,0.589533179311307,"Zci_11436",1
"GO:0000902","GO:0000902","cell morphogenesis","1/20","46/1957",0.380023249284052,0.600959524640656,0.589533179311307,"Zci_11436",1
"GO:0046483","GO:0046483","heterocycle metabolic process","4/20","305/1957",0.380712578437274,0.600959524640656,0.589533179311307,"Zci_06656/Zci_11436/Zci_14107/Zci_12831",4
"GO:0051716","GO:0051716","cellular response to stimulus","4/20","305/1957",0.380712578437274,0.600959524640656,0.589533179311307,"Zci_06656/Zci_11436/Zci_12831/Zci_12963",4
"GO:0006508","GO:0006508","proteolysis","2/20","133/1957",0.398925097390504,0.624546668865462,0.612671849314148,"Zci_11302/Zci_06656",2
"GO:0009620","GO:0009620","response to fungus","1/20","50/1957",0.405592430272902,0.629822391724588,0.617847262204335,"Zci_06041",1
"GO:0016311","GO:0016311","dephosphorylation","1/20","53/1957",0.424108451298687,0.650935484757586,0.638558921393499,"Zci_12790",1
"GO:0006950","GO:0006950","response to stress","5/20","419/1957",0.432271730451157,0.650935484757586,0.638558921393499,"Zci_06041/Zci_06656/Zci_11436/Zci_14107/Zci_09229",5
"GO:1901360","GO:1901360","organic cyclic compound metabolic process","4/20","326/1957",0.433245958199991,0.650935484757586,0.638558921393499,"Zci_06656/Zci_11436/Zci_14107/Zci_12831",4
"GO:0032989","GO:0032989","cellular component morphogenesis","1/20","55/1957",0.436146615800843,0.650935484757586,0.638558921393499,"Zci_11436",1
"GO:0048468","GO:0048468","cell development","1/20","56/1957",0.442075673468552,0.650935484757586,0.638558921393499,"Zci_11436",1
"GO:0048585","GO:0048585","negative regulation of response to stimulus","1/20","56/1957",0.442075673468552,0.650935484757586,0.638558921393499,"Zci_06041",1
"GO:0003006","GO:0003006","developmental process involved in reproduction","2/20","145/1957",0.443045094337624,0.650935484757586,0.638558921393499,"Zci_05276/Zci_09229",2
"GO:0006325","GO:0006325","chromatin organization","1/20","59/1957",0.459509530739682,0.669971911231139,0.657233398727708,"Zci_11436",1
"GO:0016310","GO:0016310","phosphorylation","2/20","151/1957",0.464526473855118,0.671916953079428,0.659141458518259,"Zci_09229/Zci_12963",2
"GO:0048229","GO:0048229","gametophyte development","1/20","61/1957",0.470843223956456,0.671916953079428,0.659141458518259,"Zci_05276",1
"GO:0048580","GO:0048580","regulation of post-embryonic development","1/20","62/1957",0.47642504648856,0.671916953079428,0.659141458518259,"Zci_06041",1
"GO:0023052","GO:0023052","signaling","2/20","155/1957",0.47861027091789,0.671916953079428,0.659141458518259,"Zci_12790/Zci_12963",2
"GO:0033554","GO:0033554","cellular response to stress","2/20","155/1957",0.47861027091789,0.671916953079428,0.659141458518259,"Zci_06656/Zci_11436",2
"GO:0080134","GO:0080134","regulation of response to stress","1/20","63/1957",0.481950903517705,0.671916953079428,0.659141458518259,"Zci_09229",1
"GO:0035556","GO:0035556","intracellular signal transduction","1/20","65/1957",0.492836843807076,0.674863925662768,0.662032398831483,"Zci_12963",1
"GO:0006468","GO:0006468","protein phosphorylation","2/20","160/1957",0.495933660517862,0.674863925662768,0.662032398831483,"Zci_11902/Zci_12963",2
"GO:0042742","GO:0042742","defense response to bacterium","1/20","66/1957",0.498197976536389,0.674863925662768,0.662032398831483,"Zci_06041",1
"GO:0055086","GO:0055086","nucleobase-containing small molecule metabolic process","1/20","66/1957",0.498197976536389,0.674863925662768,0.662032398831483,"Zci_12831",1
"GO:0022402","GO:0022402","cell cycle process","1/20","67/1957",0.503505242781376,0.67725000965664,0.66437311501175,"Zci_11436",1
"GO:0048316","GO:0048316","seed development","1/20","68/1957",0.508759155556177,0.679531459519089,0.666611186521895,"Zci_09229",1
"GO:0009651","GO:0009651","response to salt stress","1/20","69/1957",0.51396022325807,0.681711129460357,0.668749413303629,"Zci_14107",1
"GO:0007049","GO:0007049","cell cycle","1/20","70/1957",0.519108949706607,0.683791788923876,0.670790512143565,"Zci_11436",1
"GO:0010154","GO:0010154","fruit development","1/20","71/1957",0.524205834182425,0.685776125540022,0.672737119570813,"Zci_09229",1
"GO:0009617","GO:0009617","response to bacterium","1/20","72/1957",0.529251371465751,0.6876667479589,0.674591794635901,"Zci_06041",1
"GO:0048519","GO:0048519","negative regulation of biological process","2/20","172/1957",0.536158143436815,0.691933820246159,0.678777734934232,"Zci_06041/Zci_11436",2
"GO:0006139","GO:0006139","nucleobase-containing compound metabolic process","3/20","273/1957",0.543257273534672,0.696390196275989,0.68314937964798,"Zci_06656/Zci_11436/Zci_12831",3
"GO:0022414","GO:0022414","reproductive process","2/20","176/1957",0.549122713117206,0.699216254702576,0.685921704806054,"Zci_05276/Zci_09229",2
"GO:0000003","GO:0000003","reproduction","2/20","179/1957",0.558695922607158,0.706694842503094,0.69325809845991,"Zci_05276/Zci_09229",2
"GO:0019637","GO:0019637","organophosphate metabolic process","1/20","80/1957",0.567825089270016,0.713517052964296,0.699950594806529,"Zci_10080",1
"GO:0065009","GO:0065009","regulation of molecular function","1/20","85/1957",0.590387928551496,0.720289205370399,0.706593984876996,"Zci_06656",1
"GO:0006970","GO:0006970","response to osmotic stress","1/20","86/1957",0.594764125896031,0.720289205370399,0.706593984876996,"Zci_14107",1
"GO:0018193","GO:0018193","peptidyl-amino acid modification","1/20","86/1957",0.594764125896031,0.720289205370399,0.706593984876996,"Zci_12963",1
"GO:0044281","GO:0044281","small molecule metabolic process","2/20","191/1957",0.595672443186574,0.720289205370399,0.706593984876996,"Zci_14107/Zci_12831",2
"GO:0030154","GO:0030154","cell differentiation","1/20","87/1957",0.599095882968228,0.720289205370399,0.706593984876996,"Zci_11436",1
"GO:0009888","GO:0009888","tissue development","1/20","88/1957",0.603383627535412,0.720289205370399,0.706593984876996,"Zci_11436",1
"GO:0044255","GO:0044255","cellular lipid metabolic process","1/20","88/1957",0.603383627535412,0.720289205370399,0.706593984876996,"Zci_10080",1
"GO:2000026","GO:2000026","regulation of multicellular organismal development","1/20","88/1957",0.603383627535412,0.720289205370399,0.706593984876996,"Zci_06041",1
"GO:0090304","GO:0090304","nucleic acid metabolic process","2/20","206/1957",0.638867030856056,0.75528698630085,0.740926335417754,"Zci_06656/Zci_11436",2
"GO:0006725","GO:0006725","cellular aromatic compound metabolic process","3/20","312/1957",0.640609904611192,0.75528698630085,0.740926335417754,"Zci_06656/Zci_11436/Zci_12831",3
"GO:0098542","GO:0098542","defense response to other organism","1/20","100/1957",0.651554081966437,0.762134463812108,0.747643618399312,"Zci_06041",1
"GO:0034641","GO:0034641","cellular nitrogen compound metabolic process","3/20","318/1957",0.654398178351758,0.762134463812108,0.747643618399312,"Zci_06656/Zci_11436/Zci_12831",3
"GO:0051239","GO:0051239","regulation of multicellular organismal process","1/20","104/1957",0.666336197394626,0.768468262370475,0.753856989263955,"Zci_06041",1
"GO:0019752","GO:0019752","carboxylic acid metabolic process","1/20","106/1957",0.673501923119886,0.768468262370475,0.753856989263955,"Zci_14107",1
"GO:0006629","GO:0006629","lipid metabolic process","1/20","107/1957",0.67702972513912,0.768468262370475,0.753856989263955,"Zci_10080",1
"GO:0006082","GO:0006082","organic acid metabolic process","1/20","109/1957",0.683976987450161,0.768468262370475,0.753856989263955,"Zci_14107",1
"GO:0043436","GO:0043436","oxoacid metabolic process","1/20","109/1957",0.683976987450161,0.768468262370475,0.753856989263955,"Zci_14107",1
"GO:0048869","GO:0048869","cellular developmental process","1/20","109/1957",0.683976987450161,0.768468262370475,0.753856989263955,"Zci_11436",1
"GO:0006952","GO:0006952","defense response","1/20","113/1957",0.697447908156888,0.773637643835747,0.758928082682628,"Zci_06041",1
"GO:0048608","GO:0048608","reproductive structure development","1/20","114/1957",0.700729384207247,0.773637643835747,0.758928082682628,"Zci_09229",1
"GO:0061458","GO:0061458","reproductive system development","1/20","114/1957",0.700729384207247,0.773637643835747,0.758928082682628,"Zci_09229",1
"GO:1901135","GO:1901135","carbohydrate derivative metabolic process","1/20","116/1957",0.707191177940853,0.776284568889097,0.761524680420277,"Zci_10080",1
"GO:0065008","GO:0065008","regulation of biological quality","1/20","128/1957",0.743264262668656,0.811219852398362,0.795795721834712,"Zci_11436",1
"GO:0006810","GO:0006810","transport","2/20","255/1957",0.756583740632415,0.821065309436314,0.805453982252213,"Zci_06656/Zci_09731",2
"GO:0051234","GO:0051234","establishment of localization","2/20","262/1957",0.770599677634025,0.83155106456553,0.815740366451719,"Zci_06656/Zci_09731",2
"GO:0009791","GO:0009791","post-embryonic development","1/20","143/1957",0.782438458408237,0.839582840202097,0.823619429903407,"Zci_09229",1
"GO:0007275","GO:0007275","multicellular organism development","2/20","275/1957",0.794901561515969,0.848191051673464,0.832063969125801,"Zci_05276/Zci_09229",2
"GO:0005975","GO:0005975","carbohydrate metabolic process","1/20","157/1957",0.813821207063479,0.860477349541473,0.844116661440519,"Zci_15856",1
"GO:0051179","GO:0051179","localization","2/20","287/1957",0.815426179408411,0.860477349541473,0.844116661440519,"Zci_06656/Zci_09731",2
"GO:0007165","GO:0007165","signal transduction","1/20","165/1957",0.829770795916344,0.870803417692427,0.854246394870499,"Zci_12963",1
"GO:0032501","GO:0032501","multicellular organismal process","2/20","307/1957",0.845836084588371,0.882812525444693,0.866027167424389,"Zci_05276/Zci_09229",2
"GO:0009628","GO:0009628","response to abiotic stimulus","2/20","317/1957",0.859383882949762,0.888253015369807,0.871364214581569,"Zci_11302/Zci_14107",2
"GO:0050794","GO:0050794","regulation of cellular process","3/20","439/1957",0.860349779284892,0.888253015369807,0.871364214581569,"Zci_06041/Zci_11436/Zci_12963",3
"GO:0016043","GO:0016043","cellular component organization","2/20","334/1957",0.880091933593971,0.903750318905637,0.886566860100322,"Zci_09731/Zci_11436",2
"GO:0048731","GO:0048731","system development","1/20","214/1957",0.902519530492682,0.921810067369843,0.904283229494803,"Zci_09229",1
"GO:0042221","GO:0042221","response to chemical","2/20","364/1957",0.910272141898684,0.921810067369843,0.904283229494803,"Zci_05276/Zci_06041",2
"GO:0006996","GO:0006996","organelle organization","1/20","223/1957",0.912157605931415,0.921810067369843,0.904283229494803,"Zci_09731",1
"GO:0071840","GO:0071840","cellular component organization or biogenesis","2/20","373/1957",0.917923908888456,0.922710279034426,0.905166324982794,"Zci_09731/Zci_11436",2
"GO:0010033","GO:0010033","response to organic substance","1/20","234/1957",0.922710279034426,0.922710279034426,0.905166324982794,"Zci_06041",1
