"","ID","Description","GeneRatio","BgRatio","pvalue","p.adjust","qvalue","geneID","Count"
"GO:0010109","GO:0010109","regulation of photosynthesis","5/26","37/5461",6.40326909267125e-07,0.000145523387935148,0.000105666028915121,"Me1_v2_0027640/Me1_v2_0028080/Me1_v2_0099280/Me1_v2_0153460/Me1_v2_0218650",5
"GO:0010205","GO:0010205","photoinhibition","4/26","18/5461",1.18118744559256e-06,0.000145523387935148,0.000105666028915121,"Me1_v2_0027640/Me1_v2_0028080/Me1_v2_0099280/Me1_v2_0218650",4
"GO:0043155","GO:0043155","negative regulation of photosynthesis, light reaction","4/26","18/5461",1.18118744559256e-06,0.000145523387935148,0.000105666028915121,"Me1_v2_0027640/Me1_v2_0028080/Me1_v2_0099280/Me1_v2_0218650",4
"GO:0009414","GO:0009414","response to water deprivation","7/26","128/5461",1.49732494570142e-06,0.000145523387935148,0.000105666028915121,"Me1_v2_0027640/Me1_v2_0028080/Me1_v2_0129260/Me1_v2_0129280/Me1_v2_0153460/Me1_v2_0173860/Me1_v2_0218650",7
"GO:0009415","GO:0009415","response to water","7/26","129/5461",1.57834477153089e-06,0.000145523387935148,0.000105666028915121,"Me1_v2_0027640/Me1_v2_0028080/Me1_v2_0129260/Me1_v2_0129280/Me1_v2_0153460/Me1_v2_0173860/Me1_v2_0218650",7
"GO:1905156","GO:1905156","negative regulation of photosynthesis","4/26","21/5461",2.28797683233251e-06,0.000175792886617548,0.000127645023277498,"Me1_v2_0027640/Me1_v2_0028080/Me1_v2_0099280/Me1_v2_0218650",4
"GO:0042548","GO:0042548","regulation of photosynthesis, light reaction","4/26","24/5461",4.02297336535671e-06,0.000264941531632777,0.000192376771456155,"Me1_v2_0027640/Me1_v2_0028080/Me1_v2_0099280/Me1_v2_0218650",4
"GO:0043467","GO:0043467","regulation of generation of precursor metabolites and energy","4/26","26/5461",5.62356456107745e-06,0.000324057907832088,0.000235301780318767,"Me1_v2_0027640/Me1_v2_0028080/Me1_v2_0099280/Me1_v2_0218650",4
"GO:0009416","GO:0009416","response to light stimulus","9/26","307/5461",6.66460901212557e-06,0.000341376083843321,0.000247876686065021,"Me1_v2_0027640/Me1_v2_0028080/Me1_v2_0099280/Me1_v2_0129260/Me1_v2_0129280/Me1_v2_0153460/Me1_v2_0218650/Me1_v2_0225880/Me1_v2_0230620",9
"GO:0009408","GO:0009408","response to heat","6/26","109/5461",9.16257946760096e-06,0.000422394913456404,0.000306705291652327,"Me1_v2_0027640/Me1_v2_0028080/Me1_v2_0129260/Me1_v2_0129280/Me1_v2_0199620/Me1_v2_0218650",6
"GO:1902456","GO:1902456","regulation of stomatal opening","3/26","10/5461",1.12488078006089e-05,0.000471427308734611,0.000342308218238626,"Me1_v2_0027640/Me1_v2_0028080/Me1_v2_0218650",3
"GO:0009314","GO:0009314","response to radiation","9/26","343/5461",1.64712345857919e-05,0.000608286473014372,0.000441683065232493,"Me1_v2_0027640/Me1_v2_0028080/Me1_v2_0099280/Me1_v2_0129260/Me1_v2_0129280/Me1_v2_0153460/Me1_v2_0218650/Me1_v2_0225880/Me1_v2_0230620",9
"GO:0010114","GO:0010114","response to red light","4/26","35/5461",1.91310278831308e-05,0.000608286473014372,0.000441683065232493,"Me1_v2_0129260/Me1_v2_0129280/Me1_v2_0153460/Me1_v2_0230620",4
"GO:0006469","GO:0006469","negative regulation of protein kinase activity","3/26","12/5461",2.04927276550572e-05,0.000608286473014372,0.000441683065232493,"Me1_v2_0027640/Me1_v2_0028080/Me1_v2_0218650",3
"GO:0033673","GO:0033673","negative regulation of kinase activity","3/26","12/5461",2.04927276550572e-05,0.000608286473014372,0.000441683065232493,"Me1_v2_0027640/Me1_v2_0028080/Me1_v2_0218650",3
"GO:0009266","GO:0009266","response to temperature stimulus","8/26","268/5461",2.18652923939459e-05,0.000608286473014372,0.000441683065232493,"Me1_v2_0027640/Me1_v2_0028080/Me1_v2_0107950/Me1_v2_0129260/Me1_v2_0129280/Me1_v2_0173860/Me1_v2_0199620/Me1_v2_0218650",8
"GO:0009639","GO:0009639","response to red or far red light","5/26","75/5461",2.24313883758011e-05,0.000608286473014372,0.000441683065232493,"Me1_v2_0129260/Me1_v2_0129280/Me1_v2_0153460/Me1_v2_0225880/Me1_v2_0230620",5
"GO:0001933","GO:0001933","negative regulation of protein phosphorylation","3/26","16/5461",5.1507432136962e-05,0.00118724631075697,0.00086207175892389,"Me1_v2_0027640/Me1_v2_0028080/Me1_v2_0218650",3
"GO:0042326","GO:0042326","negative regulation of phosphorylation","3/26","16/5461",5.1507432136962e-05,0.00118724631075697,0.00086207175892389,"Me1_v2_0027640/Me1_v2_0028080/Me1_v2_0218650",3
"GO:0051348","GO:0051348","negative regulation of transferase activity","3/26","16/5461",5.1507432136962e-05,0.00118724631075697,0.00086207175892389,"Me1_v2_0027640/Me1_v2_0028080/Me1_v2_0218650",3
"GO:0019901","GO:0019901","protein kinase binding","4/26","46/5461",5.75410772669919e-05,0.00126316364857539,0.000917196118842277,"Me1_v2_0027640/Me1_v2_0028080/Me1_v2_0173860/Me1_v2_0218650",4
"GO:0004722","GO:0004722","protein serine/threonine phosphatase activity","3/26","17/5461",6.23472373238983e-05,0.00130645801846896,0.000948632606172232,"Me1_v2_0027640/Me1_v2_0028080/Me1_v2_0218650",3
"GO:0070887","GO:0070887","cellular response to chemical stimulus","9/26","408/5461",6.59118366707596e-05,0.00132110246544436,0.000959266089762085,"Me1_v2_0027640/Me1_v2_0028080/Me1_v2_0067620/Me1_v2_0107950/Me1_v2_0129260/Me1_v2_0129280/Me1_v2_0173860/Me1_v2_0199620/Me1_v2_0218650",9
"GO:0007165","GO:0007165","signal transduction","9/26","412/5461",7.11730846087336e-05,0.00136711633352609,0.000992677232700758,"Me1_v2_0027640/Me1_v2_0028080/Me1_v2_0067620/Me1_v2_0107950/Me1_v2_0129260/Me1_v2_0129280/Me1_v2_0173860/Me1_v2_0218650/Me1_v2_0230620",9
"GO:0009642","GO:0009642","response to light intensity","5/26","97/5461",7.80152532600788e-05,0.00143860127011585,0.00104458318049284,"Me1_v2_0027640/Me1_v2_0028080/Me1_v2_0099280/Me1_v2_0218650/Me1_v2_0225880",5
"GO:0023052","GO:0023052","signaling","9/26","419/5461",8.12411256900339e-05,0.00144046765165791,0.00104593837932918,"Me1_v2_0027640/Me1_v2_0028080/Me1_v2_0067620/Me1_v2_0107950/Me1_v2_0129260/Me1_v2_0129280/Me1_v2_0173860/Me1_v2_0218650/Me1_v2_0230620",9
"GO:0019900","GO:0019900","kinase binding","4/26","54/5461",0.000108667248423176,0.00185539264900311,0.00134721968805341,"Me1_v2_0027640/Me1_v2_0028080/Me1_v2_0173860/Me1_v2_0218650",4
"GO:0010119","GO:0010119","regulation of stomatal movement","4/26","56/5461",0.000125391464077945,0.00206448089071187,0.00149904081115738,"Me1_v2_0027640/Me1_v2_0028080/Me1_v2_0218650/Me1_v2_0225880",4
"GO:0009644","GO:0009644","response to high light intensity","4/26","63/5461",0.000198807563362279,0.0031603547141383,0.00229476606712177,"Me1_v2_0027640/Me1_v2_0028080/Me1_v2_0099280/Me1_v2_0218650",4
"GO:0004497","GO:0004497","monooxygenase activity","3/26","26/5461",0.000231698803389245,0.00356043827874806,0.00258527085886947,"Me1_v2_0067620/Me1_v2_0129260/Me1_v2_0129280",3
"GO:0010563","GO:0010563","negative regulation of phosphorus metabolic process","3/26","27/5461",0.000259838619224987,0.00374330010820996,0.00271804871426137,"Me1_v2_0027640/Me1_v2_0028080/Me1_v2_0218650",3
"GO:0045936","GO:0045936","negative regulation of phosphate metabolic process","3/26","27/5461",0.000259838619224987,0.00374330010820996,0.00271804871426137,"Me1_v2_0027640/Me1_v2_0028080/Me1_v2_0218650",3
"GO:0042440","GO:0042440","pigment metabolic process","4/26","69/5461",0.000282990464509167,0.00395329103450685,0.0028705252859303,"Me1_v2_0129260/Me1_v2_0129280/Me1_v2_0153460/Me1_v2_0225880",4
"GO:0071310","GO:0071310","cellular response to organic substance","7/26","301/5461",0.000382007752890843,0.00491266616374574,0.00356713743594279,"Me1_v2_0027640/Me1_v2_0028080/Me1_v2_0129260/Me1_v2_0129280/Me1_v2_0173860/Me1_v2_0199620/Me1_v2_0218650",7
"GO:0009788","GO:0009788","negative regulation of abscisic acid-activated signaling pathway","3/26","31/5461",0.000394292078218205,0.00491266616374574,0.00356713743594279,"Me1_v2_0027640/Me1_v2_0028080/Me1_v2_0218650",3
"GO:1901420","GO:1901420","negative regulation of response to alcohol","3/26","31/5461",0.000394292078218205,0.00491266616374574,0.00356713743594279,"Me1_v2_0027640/Me1_v2_0028080/Me1_v2_0218650",3
"GO:1905958","GO:1905958","negative regulation of cellular response to alcohol","3/26","31/5461",0.000394292078218205,0.00491266616374574,0.00356713743594279,"Me1_v2_0027640/Me1_v2_0028080/Me1_v2_0218650",3
"GO:0031461","GO:0031461","cullin-RING ubiquitin ligase complex","4/26","79/5461",0.000476189018409995,0.00577692467071073,0.00419468442809913,"Me1_v2_0093690/Me1_v2_0199620/Me1_v2_0225880/Me1_v2_0230620",4
"GO:0004721","GO:0004721","phosphoprotein phosphatase activity","3/26","36/5461",0.000616491309988941,0.00728724343345903,0.00529134241771885,"Me1_v2_0027640/Me1_v2_0028080/Me1_v2_0218650",3
"GO:0031400","GO:0031400","negative regulation of protein modification process","3/26","37/5461",0.000668772098939207,0.00763149586835425,0.00554130765187042,"Me1_v2_0027640/Me1_v2_0028080/Me1_v2_0218650",3
"GO:1901701","GO:1901701","cellular response to oxygen-containing compound","6/26","236/5461",0.000678723059875324,0.00763149586835425,0.00554130765187042,"Me1_v2_0027640/Me1_v2_0028080/Me1_v2_0129260/Me1_v2_0129280/Me1_v2_0173860/Me1_v2_0218650",6
"GO:0006470","GO:0006470","protein dephosphorylation","3/26","40/5461",0.000842364044821392,0.00924594820625385,0.00671357810158403,"Me1_v2_0027640/Me1_v2_0028080/Me1_v2_0218650",3
"GO:0016123","GO:0016123","xanthophyll biosynthetic process","2/26","10/5461",0.000958233237853701,0.0102088010360315,0.00741271544573126,"Me1_v2_0129260/Me1_v2_0129280",2
"GO:0071215","GO:0071215","cellular response to abscisic acid stimulus","4/26","96/5461",0.000996520708506325,0.0102088010360315,0.00741271544573126,"Me1_v2_0027640/Me1_v2_0028080/Me1_v2_0173860/Me1_v2_0218650",4
"GO:0097306","GO:0097306","cellular response to alcohol","4/26","96/5461",0.000996520708506325,0.0102088010360315,0.00741271544573126,"Me1_v2_0027640/Me1_v2_0028080/Me1_v2_0173860/Me1_v2_0218650",4
"GO:0045834","GO:0045834","positive regulation of lipid metabolic process","2/26","11/5461",0.00116774767972566,0.011702862616381,0.00849756892798076,"Me1_v2_0058550/Me1_v2_0153460",2
"GO:0009409","GO:0009409","response to cold","5/26","178/5461",0.00131039559678175,0.0128530291514125,0.00933271668032689,"Me1_v2_0027640/Me1_v2_0028080/Me1_v2_0107950/Me1_v2_0173860/Me1_v2_0218650",5
"GO:0000151","GO:0000151","ubiquitin ligase complex","4/26","104/5461",0.00134412015842197,0.012909154021511,0.00937346952583744,"Me1_v2_0093690/Me1_v2_0199620/Me1_v2_0225880/Me1_v2_0230620",4
"GO:0016709","GO:0016709","oxidoreductase activity, acting on paired donors, with incorporation or reduction of molecular oxygen, NAD(P)H as one donor, and incorporation of one atom of oxygen","2/26","12/5461",0.00139719867013978,0.0131450732027436,0.0095447728701278,"Me1_v2_0129260/Me1_v2_0129280",2
"GO:0016791","GO:0016791","phosphatase activity","4/26","109/5461",0.00160016257174561,0.0140836931018288,0.0102263144340257,"Me1_v2_0027640/Me1_v2_0028080/Me1_v2_0170050/Me1_v2_0218650",4
"GO:0009787","GO:0009787","regulation of abscisic acid-activated signaling pathway","3/26","50/5461",0.00161916645205408,0.0140836931018288,0.0102263144340257,"Me1_v2_0027640/Me1_v2_0028080/Me1_v2_0218650",3
"GO:1901419","GO:1901419","regulation of response to alcohol","3/26","50/5461",0.00161916645205408,0.0140836931018288,0.0102263144340257,"Me1_v2_0027640/Me1_v2_0028080/Me1_v2_0218650",3
"GO:1905957","GO:1905957","regulation of cellular response to alcohol","3/26","50/5461",0.00161916645205408,0.0140836931018288,0.0102263144340257,"Me1_v2_0027640/Me1_v2_0028080/Me1_v2_0218650",3
"GO:0043086","GO:0043086","negative regulation of catalytic activity","3/26","52/5461",0.00181420964552212,0.0153234705245263,0.0111265295736942,"Me1_v2_0027640/Me1_v2_0028080/Me1_v2_0218650",3
"GO:0016311","GO:0016311","dephosphorylation","4/26","113/5461",0.0018281797805834,0.0153234705245263,0.0111265295736942,"Me1_v2_0027640/Me1_v2_0028080/Me1_v2_0170050/Me1_v2_0218650",4
"GO:0016122","GO:0016122","xanthophyll metabolic process","2/26","14/5461",0.001915192031629,0.0157661344032316,0.0114479523695117,"Me1_v2_0129260/Me1_v2_0129280",2
"GO:0032870","GO:0032870","cellular response to hormone stimulus","5/26","196/5461",0.00201135105679834,0.0160823701113597,0.0116775743701619,"Me1_v2_0027640/Me1_v2_0028080/Me1_v2_0173860/Me1_v2_0199620/Me1_v2_0218650",5
"GO:0045859","GO:0045859","regulation of protein kinase activity","3/26","54/5461",0.00202337845218842,0.0160823701113597,0.0116775743701619,"Me1_v2_0027640/Me1_v2_0028080/Me1_v2_0218650",3
"GO:0071396","GO:0071396","cellular response to lipid","4/26","121/5461",0.0023505391324354,0.0183660769500461,0.0133357973972249,"Me1_v2_0027640/Me1_v2_0028080/Me1_v2_0173860/Me1_v2_0218650",4
"GO:0043549","GO:0043549","regulation of kinase activity","3/26","59/5461",0.00261042608271401,0.0200567737355193,0.014563429724615,"Me1_v2_0027640/Me1_v2_0028080/Me1_v2_0218650",3
"GO:0009812","GO:0009812","flavonoid metabolic process","2/26","17/5461",0.0028372470334697,0.0214421456135989,0.0155693624960028,"Me1_v2_0225880/Me1_v2_0230070",2
"GO:0042578","GO:0042578","phosphoric ester hydrolase activity","4/26","128/5461",0.00288559735897818,0.0214558126207894,0.0155792862505104,"Me1_v2_0027640/Me1_v2_0028080/Me1_v2_0170050/Me1_v2_0218650",4
"GO:0071495","GO:0071495","cellular response to endogenous stimulus","5/26","219/5461",0.00326843020797642,0.0237216467831264,0.0172245317434278,"Me1_v2_0027640/Me1_v2_0028080/Me1_v2_0173860/Me1_v2_0199620/Me1_v2_0218650",5
"GO:0044092","GO:0044092","negative regulation of molecular function","3/26","64/5461",0.00329324380503274,0.0237216467831264,0.0172245317434278,"Me1_v2_0027640/Me1_v2_0028080/Me1_v2_0218650",3
"GO:0016109","GO:0016109","tetraterpenoid biosynthetic process","2/26","19/5461",0.00354661514528239,0.0247725694238664,0.0179876174832504,"Me1_v2_0129260/Me1_v2_0129280",2
"GO:0016117","GO:0016117","carotenoid biosynthetic process","2/26","19/5461",0.00354661514528239,0.0247725694238664,0.0179876174832504,"Me1_v2_0129260/Me1_v2_0129280",2
"GO:0001101","GO:0001101","response to acid chemical","7/26","442/5461",0.00367625791467803,0.0252948492338294,0.0183668502257284,"Me1_v2_0027640/Me1_v2_0028080/Me1_v2_0129260/Me1_v2_0129280/Me1_v2_0153460/Me1_v2_0173860/Me1_v2_0218650",7
"GO:0001932","GO:0001932","regulation of protein phosphorylation","3/26","71/5461",0.00441915288511575,0.0299149093791103,0.0217215234217538,"Me1_v2_0027640/Me1_v2_0028080/Me1_v2_0218650",3
"GO:0048878","GO:0048878","chemical homeostasis","4/26","145/5461",0.00452296683959755,0.0299149093791103,0.0217215234217538,"Me1_v2_0058550/Me1_v2_0120970/Me1_v2_0129260/Me1_v2_0129280",4
"GO:0010035","GO:0010035","response to inorganic substance","7/26","459/5461",0.00454239404888877,0.0299149093791103,0.0217215234217538,"Me1_v2_0027640/Me1_v2_0028080/Me1_v2_0129260/Me1_v2_0129280/Me1_v2_0153460/Me1_v2_0173860/Me1_v2_0218650",7
"GO:0032269","GO:0032269","negative regulation of cellular protein metabolic process","3/26","73/5461",0.00477872091065257,0.0310280329550822,0.0225297739004821,"Me1_v2_0027640/Me1_v2_0028080/Me1_v2_0218650",3
"GO:0042325","GO:0042325","regulation of phosphorylation","3/26","77/5461",0.00555000985984548,0.0346753840437968,0.0251781530447024,"Me1_v2_0027640/Me1_v2_0028080/Me1_v2_0218650",3
"GO:0048585","GO:0048585","negative regulation of response to stimulus","4/26","154/5461",0.00560355251480593,0.0346753840437968,0.0251781530447024,"Me1_v2_0027640/Me1_v2_0028080/Me1_v2_0218650/Me1_v2_0230620",4
"GO:0016108","GO:0016108","tetraterpenoid metabolic process","2/26","24/5461",0.00564133146048755,0.0346753840437968,0.0251781530447024,"Me1_v2_0129260/Me1_v2_0129280",2
"GO:0016116","GO:0016116","carotenoid metabolic process","2/26","24/5461",0.00564133146048755,0.0346753840437968,0.0251781530447024,"Me1_v2_0129260/Me1_v2_0129280",2
"GO:0051338","GO:0051338","regulation of transferase activity","3/26","78/5461",0.00575386856387264,0.0349017553677012,0.025342523591572,"Me1_v2_0027640/Me1_v2_0028080/Me1_v2_0218650",3
"GO:0071229","GO:0071229","cellular response to acid chemical","4/26","156/5461",0.00586530933754661,0.0351156831767401,0.0254978587742969,"Me1_v2_0027640/Me1_v2_0028080/Me1_v2_0173860/Me1_v2_0218650",4
"GO:0009738","GO:0009738","abscisic acid-activated signaling pathway","3/26","80/5461",0.00617502520863899,0.0363610550077798,0.0264021360714099,"Me1_v2_0027640/Me1_v2_0028080/Me1_v2_0218650",3
"GO:0044248","GO:0044248","cellular catabolic process","7/26","486/5461",0.006231070164023,0.0363610550077798,0.0264021360714099,"Me1_v2_0058550/Me1_v2_0062370/Me1_v2_0093690/Me1_v2_0099280/Me1_v2_0107950/Me1_v2_0153460/Me1_v2_0199620",7
"GO:0051248","GO:0051248","negative regulation of protein metabolic process","3/26","84/5461",0.007071829362764,0.0407514167029275,0.0295900228599862,"Me1_v2_0027640/Me1_v2_0028080/Me1_v2_0218650",3
"GO:0009755","GO:0009755","hormone-mediated signaling pathway","4/26","168/5461",0.00761012045413088,0.0414166997813732,0.0300730917467215,"Me1_v2_0027640/Me1_v2_0028080/Me1_v2_0173860/Me1_v2_0218650",4
"GO:0009640","GO:0009640","photomorphogenesis","2/26","28/5461",0.00763648477530742,0.0414166997813732,0.0300730917467215,"Me1_v2_0225880/Me1_v2_0230620",2
"GO:0046165","GO:0046165","alcohol biosynthetic process","2/26","28/5461",0.00763648477530742,0.0414166997813732,0.0300730917467215,"Me1_v2_0129260/Me1_v2_0129280",2
"GO:0048573","GO:0048573","photoperiodism, flowering","2/26","28/5461",0.00763648477530742,0.0414166997813732,0.0300730917467215,"Me1_v2_0225880/Me1_v2_0230620",2
"GO:0090056","GO:0090056","regulation of chlorophyll metabolic process","2/26","28/5461",0.00763648477530742,0.0414166997813732,0.0300730917467215,"Me1_v2_0153460/Me1_v2_0173860",2
"GO:0009968","GO:0009968","negative regulation of signal transduction","3/26","88/5461",0.00804259709455231,0.043112061169635,0.0313041110901791,"Me1_v2_0027640/Me1_v2_0028080/Me1_v2_0218650",3
"GO:1901401","GO:1901401","regulation of tetrapyrrole metabolic process","2/26","30/5461",0.00873690002691656,0.0462955277288337,0.0336156589057407,"Me1_v2_0153460/Me1_v2_0173860",2
"GO:0010648","GO:0010648","negative regulation of cell communication","3/26","93/5461",0.00936224638824999,0.0484943324155421,0.0352122336069012,"Me1_v2_0027640/Me1_v2_0028080/Me1_v2_0218650",3
"GO:0023057","GO:0023057","negative regulation of signaling","3/26","93/5461",0.00936224638824999,0.0484943324155421,0.0352122336069012,"Me1_v2_0027640/Me1_v2_0028080/Me1_v2_0218650",3
"GO:0009756","GO:0009756","carbohydrate mediated signaling","2/26","32/5461",0.00990415522072428,0.0501737973269659,0.0364317103550066,"Me1_v2_0129260/Me1_v2_0129280",2
"GO:0010182","GO:0010182","sugar mediated signaling pathway","2/26","32/5461",0.00990415522072428,0.0501737973269659,0.0364317103550066,"Me1_v2_0129260/Me1_v2_0129280",2
"GO:0009648","GO:0009648","photoperiodism","2/26","34/5461",0.0111369818754431,0.0558059635280354,0.0405212841692323,"Me1_v2_0225880/Me1_v2_0230620",2
"GO:0019220","GO:0019220","regulation of phosphate metabolic process","3/26","100/5461",0.0114123498362395,0.0559690773883662,0.0406397228210993,"Me1_v2_0027640/Me1_v2_0028080/Me1_v2_0218650",3
"GO:0051174","GO:0051174","regulation of phosphorus metabolic process","3/26","100/5461",0.0114123498362395,0.0559690773883662,0.0406397228210993,"Me1_v2_0027640/Me1_v2_0028080/Me1_v2_0218650",3
"GO:1901565","GO:1901565","organonitrogen compound catabolic process","5/26","296/5461",0.0116128868039604,0.0563530612276395,0.0409185374366694,"Me1_v2_0062370/Me1_v2_0093690/Me1_v2_0099280/Me1_v2_0153460/Me1_v2_0199620",5
"GO:0050790","GO:0050790","regulation of catalytic activity","4/26","192/5461",0.0120679312901416,0.0579512117162009,0.0420789709458885,"Me1_v2_0027640/Me1_v2_0028080/Me1_v2_0153460/Me1_v2_0218650",4
"GO:0019216","GO:0019216","regulation of lipid metabolic process","2/26","36/5461",0.0124341279789553,0.059094154621633,0.0429088735464763,"Me1_v2_0058550/Me1_v2_0153460",2
"GO:0044550","GO:0044550","secondary metabolite biosynthetic process","2/26","37/5461",0.013106434029242,0.0616537355865361,0.0447674116143818,"Me1_v2_0129260/Me1_v2_0129280",2
"GO:0016788","GO:0016788","hydrolase activity, acting on ester bonds","5/26","313/5461",0.0145523970975809,0.0677641925453012,0.0492042772677378,"Me1_v2_0027640/Me1_v2_0028080/Me1_v2_0058550/Me1_v2_0170050/Me1_v2_0218650",5
"GO:0071322","GO:0071322","cellular response to carbohydrate stimulus","2/26","40/5461",0.0152164517530447,0.0701478425815362,0.0509350700786129,"Me1_v2_0129260/Me1_v2_0129280",2
"GO:0042592","GO:0042592","homeostatic process","4/26","208/5461",0.0158227996019531,0.0716980082069952,0.0520606612851341,"Me1_v2_0058550/Me1_v2_0120970/Me1_v2_0129260/Me1_v2_0129280",4
"GO:0009636","GO:0009636","response to toxic substance","3/26","113/5461",0.0158637675425456,0.0716980082069952,0.0520606612851341,"Me1_v2_0107950/Me1_v2_0153460/Me1_v2_0173860",3
"GO:0022622","GO:0022622","root system development","4/26","211/5461",0.0166008544330192,0.0735864797463641,0.0534318998957502,"Me1_v2_0027640/Me1_v2_0028080/Me1_v2_0199620/Me1_v2_0218650",4
"GO:0048364","GO:0048364","root development","4/26","211/5461",0.0166008544330192,0.0735864797463641,0.0534318998957502,"Me1_v2_0027640/Me1_v2_0028080/Me1_v2_0199620/Me1_v2_0218650",4
"GO:0016705","GO:0016705","oxidoreductase activity, acting on paired donors, with incorporation or reduction of molecular oxygen","2/26","43/5461",0.0174629591579794,0.0766707063983667,0.0556713885938592,"Me1_v2_0129260/Me1_v2_0129280",2
"GO:0042802","GO:0042802","identical protein binding","4/26","216/5461",0.0179510291979473,0.0780700420778652,0.0566874606250968,"Me1_v2_0062370/Me1_v2_0173860/Me1_v2_0225880/Me1_v2_0230620",4
"GO:1901615","GO:1901615","organic hydroxy compound metabolic process","3/26","119/5461",0.0182065415516835,0.078441267806786,0.0569570114455028,"Me1_v2_0129260/Me1_v2_0129280/Me1_v2_0230070",3
"GO:0009735","GO:0009735","response to cytokinin","3/26","120/5461",0.0186149093657882,0.0794580853484106,0.0576953331220335,"Me1_v2_0099280/Me1_v2_0107950/Me1_v2_0173860",3
"GO:0009637","GO:0009637","response to blue light","2/26","45/5461",0.0190344817358454,0.0797717825474977,0.0579231118851564,"Me1_v2_0153460/Me1_v2_0230620",2
"GO:0016114","GO:0016114","terpenoid biosynthetic process","2/26","45/5461",0.0190344817358454,0.0797717825474977,0.0579231118851564,"Me1_v2_0129260/Me1_v2_0129280",2
"GO:0048581","GO:0048581","negative regulation of post-embryonic development","2/26","47/5461",0.0206637241374563,0.0858196110573637,0.0623145023775355,"Me1_v2_0199620/Me1_v2_0230620",2
"GO:1905393","GO:1905393","plant organ formation","2/26","48/5461",0.0214996305321617,0.0884940149582729,0.0642564145604082,"Me1_v2_0120970/Me1_v2_0199620",2
"GO:0046148","GO:0046148","pigment biosynthetic process","2/26","49/5461",0.022349537096466,0.0911782000130163,0.0662054289396944,"Me1_v2_0129260/Me1_v2_0129280",2
"GO:0080008","GO:0080008","Cul4-RING E3 ubiquitin ligase complex","2/26","51/5461",0.0240907865095665,0.0973565644777165,0.0706916029316448,"Me1_v2_0225880/Me1_v2_0230620",2
"GO:0031399","GO:0031399","regulation of protein modification process","3/26","133/5461",0.0243924240005927,0.0973565644777165,0.0706916029316448,"Me1_v2_0027640/Me1_v2_0028080/Me1_v2_0218650",3
"GO:0019899","GO:0019899","enzyme binding","4/26","238/5461",0.0247087159303532,0.0973565644777165,0.0706916029316448,"Me1_v2_0027640/Me1_v2_0028080/Me1_v2_0173860/Me1_v2_0218650",4
"GO:0065009","GO:0065009","regulation of molecular function","4/26","238/5461",0.0247087159303532,0.0973565644777165,0.0706916029316448,"Me1_v2_0027640/Me1_v2_0028080/Me1_v2_0153460/Me1_v2_0218650",4
"GO:0031324","GO:0031324","negative regulation of cellular metabolic process","4/26","245/5461",0.0271460802010183,0.106053754005673,0.0770067217120769,"Me1_v2_0027640/Me1_v2_0028080/Me1_v2_0099280/Me1_v2_0218650",4
"GO:0009737","GO:0009737","response to abscisic acid","4/26","248/5461",0.0282340590789857,0.109377321305986,0.0794199981169168,"Me1_v2_0027640/Me1_v2_0028080/Me1_v2_0173860/Me1_v2_0218650",4
"GO:0097305","GO:0097305","response to alcohol","4/26","251/5461",0.0293482693736946,0.112746268177277,0.0818662250950428,"Me1_v2_0027640/Me1_v2_0028080/Me1_v2_0173860/Me1_v2_0218650",4
"GO:0008299","GO:0008299","isoprenoid biosynthetic process","2/26","57/5461",0.0296360363902715,0.112910849387729,0.081985729204927,"Me1_v2_0129260/Me1_v2_0129280",2
"GO:0019748","GO:0019748","secondary metabolic process","2/26","58/5461",0.0306056978008204,0.115649399067034,0.0839742182973329,"Me1_v2_0129260/Me1_v2_0129280",2
"GO:0006066","GO:0006066","alcohol metabolic process","2/26","59/5461",0.0315879880365434,0.118390751909321,0.0859647427952145,"Me1_v2_0129260/Me1_v2_0129280",2
"GO:0006721","GO:0006721","terpenoid metabolic process","2/26","60/5461",0.032582774949358,0.121134348803661,0.0879568967223755,"Me1_v2_0129260/Me1_v2_0129280",2
"GO:0048583","GO:0048583","regulation of response to stimulus","5/26","388/5461",0.0335532773103284,0.123744486720491,0.0898521447131319,"Me1_v2_0027640/Me1_v2_0028080/Me1_v2_0067620/Me1_v2_0218650/Me1_v2_0230620",5
"GO:0006970","GO:0006970","response to osmotic stress","4/26","267/5461",0.0357384431943799,0.130757319941342,0.0949442350527386,"Me1_v2_0027640/Me1_v2_0028080/Me1_v2_0173860/Me1_v2_0218650",4
"GO:0010287","GO:0010287","plastoglobule","2/26","65/5461",0.0377395962710644,0.13699176284221,0.0994711281740446,"Me1_v2_0122920/Me1_v2_0153460",2
"GO:0010228","GO:0010228","vegetative to reproductive phase transition of meristem","2/26","66/5461",0.0388066374405646,0.137614306616156,0.099923163612142,"Me1_v2_0225880/Me1_v2_0230620",2
"GO:0051093","GO:0051093","negative regulation of developmental process","2/26","66/5461",0.0388066374405646,0.137614306616156,0.099923163612142,"Me1_v2_0199620/Me1_v2_0230620",2
"GO:0051241","GO:0051241","negative regulation of multicellular organismal process","2/26","66/5461",0.0388066374405646,0.137614306616156,0.099923163612142,"Me1_v2_0199620/Me1_v2_0230620",2
"GO:0019684","GO:0019684","photosynthesis, light reaction","2/26","67/5461",0.0398852747999755,0.140114131810707,0.101738312400513,"Me1_v2_0099280/Me1_v2_0153460",2
"GO:1990234","GO:1990234","transferase complex","4/26","277/5461",0.0401194477202024,0.140114131810707,0.101738312400513,"Me1_v2_0093690/Me1_v2_0199620/Me1_v2_0225880/Me1_v2_0230620",4
"GO:1901617","GO:1901617","organic hydroxy compound biosynthetic process","2/26","69/5461",0.0420768381672254,0.145845281166097,0.105899758901287,"Me1_v2_0129260/Me1_v2_0129280",2
"GO:0048580","GO:0048580","regulation of post-embryonic development","3/26","170/5461",0.0456014052889797,0.153581366772904,0.111517010238117,"Me1_v2_0173860/Me1_v2_0199620/Me1_v2_0230620",3
"GO:0008198","GO:0008198","ferrous iron binding","1/26","10/5461",0.0466407621436151,0.153581366772904,0.111517010238117,"Me1_v2_0055070",1
"GO:0009074","GO:0009074","aromatic amino acid family catabolic process","1/26","10/5461",0.0466407621436151,0.153581366772904,0.111517010238117,"Me1_v2_0062370",1
"GO:0009626","GO:0009626","plant-type hypersensitive response","1/26","10/5461",0.0466407621436151,0.153581366772904,0.111517010238117,"Me1_v2_0067620",1
"GO:0046283","GO:0046283","anthocyanin-containing compound metabolic process","1/26","10/5461",0.0466407621436151,0.153581366772904,0.111517010238117,"Me1_v2_0225880",1
"GO:0046503","GO:0046503","glycerolipid catabolic process","1/26","10/5461",0.0466407621436151,0.153581366772904,0.111517010238117,"Me1_v2_0058550",1
"GO:0051537","GO:0051537","2 iron, 2 sulfur cluster binding","1/26","10/5461",0.0466407621436151,0.153581366772904,0.111517010238117,"Me1_v2_0055070",1
"GO:0006720","GO:0006720","isoprenoid metabolic process","2/26","74/5461",0.0477500197087952,0.15501943018137,0.112561202871734,"Me1_v2_0129260/Me1_v2_0129280",2
"GO:0031329","GO:0031329","regulation of cellular catabolic process","2/26","74/5461",0.0477500197087952,0.15501943018137,0.112561202871734,"Me1_v2_0058550/Me1_v2_0173860",2
"GO:0044257","GO:0044257","cellular protein catabolic process","3/26","174/5461",0.0483102896410034,0.15574156310841,0.113085551018322,"Me1_v2_0093690/Me1_v2_0099280/Me1_v2_0199620",3
"GO:0033993","GO:0033993","response to lipid","4/26","298/5461",0.0502994437378024,0.159443900776971,0.115773856483792,"Me1_v2_0027640/Me1_v2_0028080/Me1_v2_0173860/Me1_v2_0218650",4
"GO:0006570","GO:0006570","tyrosine metabolic process","1/26","11/5461",0.0511880635900038,0.159443900776971,0.115773856483792,"Me1_v2_0062370",1
"GO:0034050","GO:0034050","programmed cell death induced by symbiont","1/26","11/5461",0.0511880635900038,0.159443900776971,0.115773856483792,"Me1_v2_0067620",1
"GO:0036294","GO:0036294","cellular response to decreased oxygen levels","1/26","11/5461",0.0511880635900038,0.159443900776971,0.115773856483792,"Me1_v2_0067620",1
"GO:0071453","GO:0071453","cellular response to oxygen levels","1/26","11/5461",0.0511880635900038,0.159443900776971,0.115773856483792,"Me1_v2_0067620",1
"GO:0009813","GO:0009813","flavonoid biosynthetic process","1/26","12/5461",0.0557145058554464,0.16464350768821,0.119549344548124,"Me1_v2_0230070",1
"GO:0010019","GO:0010019","chloroplast-nucleus signaling pathway","1/26","12/5461",0.0557145058554464,0.16464350768821,0.119549344548124,"Me1_v2_0107950",1
"GO:0010206","GO:0010206","photosystem II repair","1/26","12/5461",0.0557145058554464,0.16464350768821,0.119549344548124,"Me1_v2_0099280",1
"GO:0017001","GO:0017001","antibiotic catabolic process","1/26","12/5461",0.0557145058554464,0.16464350768821,0.119549344548124,"Me1_v2_0107950",1
"GO:0019747","GO:0019747","regulation of isoprenoid metabolic process","1/26","12/5461",0.0557145058554464,0.16464350768821,0.119549344548124,"Me1_v2_0153460",1
"GO:0031146","GO:0031146","SCF-dependent proteasomal ubiquitin-dependent protein catabolic process","1/26","12/5461",0.0557145058554464,0.16464350768821,0.119549344548124,"Me1_v2_0199620",1
"GO:0042744","GO:0042744","hydrogen peroxide catabolic process","1/26","12/5461",0.0557145058554464,0.16464350768821,0.119549344548124,"Me1_v2_0107950",1
"GO:0048564","GO:0048564","photosystem I assembly","1/26","12/5461",0.0557145058554464,0.16464350768821,0.119549344548124,"Me1_v2_0099280",1
"GO:0009743","GO:0009743","response to carbohydrate","2/26","83/5461",0.0586209515459269,0.172129036067976,0.124984663705027,"Me1_v2_0129260/Me1_v2_0129280",2
"GO:0010252","GO:0010252","auxin homeostasis","1/26","13/5461",0.0602201808137428,0.174600650032298,0.126779328028932,"Me1_v2_0120970",1
"GO:0051781","GO:0051781","positive regulation of cell division","1/26","13/5461",0.0602201808137428,0.174600650032298,0.126779328028932,"Me1_v2_0199620",1
"GO:0004601","GO:0004601","peroxidase activity","1/26","14/5461",0.0647051799508284,0.178365877003608,0.129513298064043,"Me1_v2_0107950",1
"GO:0009627","GO:0009627","systemic acquired resistance","1/26","14/5461",0.0647051799508284,0.178365877003608,0.129513298064043,"Me1_v2_0067620",1
"GO:0009646","GO:0009646","response to absence of light","1/26","14/5461",0.0647051799508284,0.178365877003608,0.129513298064043,"Me1_v2_0225880",1
"GO:0010017","GO:0010017","red or far-red light signaling pathway","1/26","14/5461",0.0647051799508284,0.178365877003608,0.129513298064043,"Me1_v2_0230620",1
"GO:0016684","GO:0016684","oxidoreductase activity, acting on peroxide as acceptor","1/26","14/5461",0.0647051799508284,0.178365877003608,0.129513298064043,"Me1_v2_0107950",1
"GO:0019674","GO:0019674","NAD metabolic process","1/26","14/5461",0.0647051799508284,0.178365877003608,0.129513298064043,"Me1_v2_0166840",1
"GO:0030091","GO:0030091","protein repair","1/26","14/5461",0.0647051799508284,0.178365877003608,0.129513298064043,"Me1_v2_0099280",1
"GO:0015979","GO:0015979","photosynthesis","2/26","88/5461",0.0650010137453497,0.178365877003608,0.129513298064043,"Me1_v2_0099280/Me1_v2_0153460",2
"GO:0043161","GO:0043161","proteasome-mediated ubiquitin-dependent protein catabolic process","2/26","88/5461",0.0650010137453497,0.178365877003608,0.129513298064043,"Me1_v2_0093690/Me1_v2_0199620",2
"GO:0009966","GO:0009966","regulation of signal transduction","3/26","198/5461",0.0661990280383595,0.180578413761442,0.131119843763303,"Me1_v2_0027640/Me1_v2_0028080/Me1_v2_0218650",3
"GO:0005811","GO:0005811","lipid droplet","1/26","15/5461",0.0691695943663373,0.183259672430353,0.133066733263734,"Me1_v2_0058550",1
"GO:0015996","GO:0015996","chlorophyll catabolic process","1/26","15/5461",0.0691695943663373,0.183259672430353,0.133066733263734,"Me1_v2_0153460",1
"GO:0046149","GO:0046149","pigment catabolic process","1/26","15/5461",0.0691695943663373,0.183259672430353,0.133066733263734,"Me1_v2_0153460",1
"GO:0071365","GO:0071365","cellular response to auxin stimulus","1/26","15/5461",0.0691695943663373,0.183259672430353,0.133066733263734,"Me1_v2_0199620",1
"GO:2000069","GO:2000069","regulation of post-embryonic root development","1/26","15/5461",0.0691695943663373,0.183259672430353,0.133066733263734,"Me1_v2_0199620",1
"GO:0016604","GO:0016604","nuclear body","2/26","92/5461",0.0702682860510906,0.184433860387778,0.133919323217978,"Me1_v2_0225880/Me1_v2_0230620",2
"GO:0030163","GO:0030163","protein catabolic process","3/26","204/5461",0.0710957161404541,0.184433860387778,0.133919323217978,"Me1_v2_0093690/Me1_v2_0099280/Me1_v2_0199620",3
"GO:0009894","GO:0009894","regulation of catabolic process","2/26","93/5461",0.0716068803293948,0.184433860387778,0.133919323217978,"Me1_v2_0058550/Me1_v2_0173860",2
"GO:0010498","GO:0010498","proteasomal protein catabolic process","2/26","94/5461",0.0729539747203974,0.184433860387778,0.133919323217978,"Me1_v2_0093690/Me1_v2_0199620",2
"GO:0006787","GO:0006787","porphyrin-containing compound catabolic process","1/26","16/5461",0.0736135147751651,0.184433860387778,0.133919323217978,"Me1_v2_0153460",1
"GO:0015020","GO:0015020","glucuronosyltransferase activity","1/26","16/5461",0.0736135147751651,0.184433860387778,0.133919323217978,"Me1_v2_0230070",1
"GO:0033015","GO:0033015","tetrapyrrole catabolic process","1/26","16/5461",0.0736135147751651,0.184433860387778,0.133919323217978,"Me1_v2_0153460",1
"GO:0043562","GO:0043562","cellular response to nitrogen levels","1/26","16/5461",0.0736135147751651,0.184433860387778,0.133919323217978,"Me1_v2_0153460",1
"GO:0051051","GO:0051051","negative regulation of transport","1/26","16/5461",0.0736135147751651,0.184433860387778,0.133919323217978,"Me1_v2_0173860",1
"GO:2000030","GO:2000030","regulation of response to red or far red light","1/26","16/5461",0.0736135147751651,0.184433860387778,0.133919323217978,"Me1_v2_0230620",1
"GO:0006629","GO:0006629","lipid metabolic process","4/26","341/5461",0.0752815189156978,0.186298765258767,0.135273449828263,"Me1_v2_0058550/Me1_v2_0129260/Me1_v2_0129280/Me1_v2_0230070",4
"GO:0010646","GO:0010646","regulation of cell communication","3/26","210/5461",0.0761557247732677,0.186298765258767,0.135273449828263,"Me1_v2_0027640/Me1_v2_0028080/Me1_v2_0218650",3
"GO:0023051","GO:0023051","regulation of signaling","3/26","210/5461",0.0761557247732677,0.186298765258767,0.135273449828263,"Me1_v2_0027640/Me1_v2_0028080/Me1_v2_0218650",3
"GO:0009535","GO:0009535","chloroplast thylakoid membrane","3/26","211/5461",0.077014689249329,0.186298765258767,0.135273449828263,"Me1_v2_0099280/Me1_v2_0107950/Me1_v2_0122920",3
"GO:0010959","GO:0010959","regulation of metal ion transport","1/26","17/5461",0.0780370315090213,0.186298765258767,0.135273449828263,"Me1_v2_0173860",1
"GO:0042743","GO:0042743","hydrogen peroxide metabolic process","1/26","17/5461",0.0780370315090213,0.186298765258767,0.135273449828263,"Me1_v2_0107950",1
"GO:0042752","GO:0042752","regulation of circadian rhythm","1/26","17/5461",0.0780370315090213,0.186298765258767,0.135273449828263,"Me1_v2_0225880",1
"GO:0043424","GO:0043424","protein histidine kinase binding","1/26","17/5461",0.0780370315090213,0.186298765258767,0.135273449828263,"Me1_v2_0173860",1
"GO:0055088","GO:0055088","lipid homeostasis","1/26","17/5461",0.0780370315090213,0.186298765258767,0.135273449828263,"Me1_v2_0058550",1
"GO:0032268","GO:0032268","regulation of cellular protein metabolic process","3/26","213/5461",0.0787458630429418,0.186298765258767,0.135273449828263,"Me1_v2_0027640/Me1_v2_0028080/Me1_v2_0218650",3
"GO:0072330","GO:0072330","monocarboxylic acid biosynthetic process","2/26","99/5461",0.0798133372930333,0.186298765258767,0.135273449828263,"Me1_v2_0129260/Me1_v2_0129280",2
"GO:0055035","GO:0055035","plastid thylakoid membrane","3/26","216/5461",0.0813754768063952,0.186298765258767,0.135273449828263,"Me1_v2_0099280/Me1_v2_0107950/Me1_v2_0122920",3
"GO:0009631","GO:0009631","cold acclimation","1/26","18/5461",0.0824402345179791,0.186298765258767,0.135273449828263,"Me1_v2_0107950",1
"GO:0010214","GO:0010214","seed coat development","1/26","18/5461",0.0824402345179791,0.186298765258767,0.135273449828263,"Me1_v2_0230070",1
"GO:0010311","GO:0010311","lateral root formation","1/26","18/5461",0.0824402345179791,0.186298765258767,0.135273449828263,"Me1_v2_0199620",1
"GO:0016226","GO:0016226","iron-sulfur cluster assembly","1/26","18/5461",0.0824402345179791,0.186298765258767,0.135273449828263,"Me1_v2_0055070",1
"GO:0019915","GO:0019915","lipid storage","1/26","18/5461",0.0824402345179791,0.186298765258767,0.135273449828263,"Me1_v2_0058550",1
"GO:0030145","GO:0030145","manganese ion binding","1/26","18/5461",0.0824402345179791,0.186298765258767,0.135273449828263,"Me1_v2_0170050",1
"GO:0031163","GO:0031163","metallo-sulfur cluster assembly","1/26","18/5461",0.0824402345179791,0.186298765258767,0.135273449828263,"Me1_v2_0055070",1
"GO:0070417","GO:0070417","cellular response to cold","1/26","18/5461",0.0824402345179791,0.186298765258767,0.135273449828263,"Me1_v2_0173860",1
"GO:0099402","GO:0099402","plant organ development","4/26","357/5461",0.0859688479549429,0.190597625545238,0.138394896502765,"Me1_v2_0027640/Me1_v2_0028080/Me1_v2_0199620/Me1_v2_0218650",4
"GO:0004673","GO:0004673","protein histidine kinase activity","1/26","19/5461",0.0868232133720175,0.190597625545238,0.138394896502765,"Me1_v2_0173860",1
"GO:0009736","GO:0009736","cytokinin-activated signaling pathway","1/26","19/5461",0.0868232133720175,0.190597625545238,0.138394896502765,"Me1_v2_0173860",1
"GO:0016775","GO:0016775","phosphotransferase activity, nitrogenous group as acceptor","1/26","19/5461",0.0868232133720175,0.190597625545238,0.138394896502765,"Me1_v2_0173860",1
"GO:0018106","GO:0018106","peptidyl-histidine phosphorylation","1/26","19/5461",0.0868232133720175,0.190597625545238,0.138394896502765,"Me1_v2_0173860",1
"GO:0046890","GO:0046890","regulation of lipid biosynthetic process","1/26","19/5461",0.0868232133720175,0.190597625545238,0.138394896502765,"Me1_v2_0153460",1
"GO:0009892","GO:0009892","negative regulation of metabolic process","4/26","361/5461",0.0887553180628081,0.192829231183669,0.14001528831238,"Me1_v2_0027640/Me1_v2_0028080/Me1_v2_0099280/Me1_v2_0218650",4
"GO:0034357","GO:0034357","photosynthetic membrane","3/26","225/5461",0.089496398863559,0.192829231183669,0.14001528831238,"Me1_v2_0099280/Me1_v2_0107950/Me1_v2_0122920",3
"GO:0042651","GO:0042651","thylakoid membrane","3/26","225/5461",0.089496398863559,0.192829231183669,0.14001528831238,"Me1_v2_0099280/Me1_v2_0107950/Me1_v2_0122920",3
"GO:0002218","GO:0002218","activation of innate immune response","1/26","20/5461",0.0911860572625591,0.192829231183669,0.14001528831238,"Me1_v2_0067620",1
"GO:0009767","GO:0009767","photosynthetic electron transport chain","1/26","20/5461",0.0911860572625591,0.192829231183669,0.14001528831238,"Me1_v2_0153460",1
"GO:0019359","GO:0019359","nicotinamide nucleotide biosynthetic process","1/26","20/5461",0.0911860572625591,0.192829231183669,0.14001528831238,"Me1_v2_0166840",1
"GO:0035251","GO:0035251","UDP-glucosyltransferase activity","1/26","20/5461",0.0911860572625591,0.192829231183669,0.14001528831238,"Me1_v2_0230070",1
"GO:0071368","GO:0071368","cellular response to cytokinin stimulus","1/26","20/5461",0.0911860572625591,0.192829231183669,0.14001528831238,"Me1_v2_0173860",1
"GO:0048646","GO:0048646","anatomical structure formation involved in morphogenesis","2/26","108/5461",0.0926489312867098,0.195028115630928,0.141611920928497,"Me1_v2_0120970/Me1_v2_0199620",2
"GO:0051172","GO:0051172","negative regulation of nitrogen compound metabolic process","3/26","231/5461",0.095098822337632,0.198372982688484,0.144040663306172,"Me1_v2_0027640/Me1_v2_0028080/Me1_v2_0218650",3
"GO:0019005","GO:0019005","SCF ubiquitin ligase complex","1/26","21/5461",0.0955288550039989,0.198372982688484,0.144040663306172,"Me1_v2_0199620",1
"GO:0019363","GO:0019363","pyridine nucleotide biosynthetic process","1/26","21/5461",0.0955288550039989,0.198372982688484,0.144040663306172,"Me1_v2_0166840",1
"GO:0016491","GO:0016491","oxidoreductase activity","4/26","374/5461",0.0981215370350241,0.202838457830234,0.147283090740985,"Me1_v2_0067620/Me1_v2_0107950/Me1_v2_0129260/Me1_v2_0129280",4
"GO:0002253","GO:0002253","activation of immune response","1/26","22/5461",0.0998516950352295,0.202838457830234,0.147283090740985,"Me1_v2_0067620",1
"GO:0010286","GO:0010286","heat acclimation","1/26","22/5461",0.0998516950352295,0.202838457830234,0.147283090740985,"Me1_v2_0199620",1
"GO:0010380","GO:0010380","regulation of chlorophyll biosynthetic process","1/26","22/5461",0.0998516950352295,0.202838457830234,0.147283090740985,"Me1_v2_0153460",1
"GO:0051246","GO:0051246","regulation of protein metabolic process","3/26","236/5461",0.0998792406235644,0.202838457830234,0.147283090740985,"Me1_v2_0027640/Me1_v2_0028080/Me1_v2_0218650",3
"GO:0044265","GO:0044265","cellular macromolecule catabolic process","3/26","240/5461",0.103774969242373,0.207858444844829,0.150928154950692,"Me1_v2_0093690/Me1_v2_0099280/Me1_v2_0199620",3
"GO:0016125","GO:0016125","sterol metabolic process","1/26","23/5461",0.104154665421162,0.207858444844829,0.150928154950692,"Me1_v2_0230070",1
"GO:0018202","GO:0018202","peptidyl-histidine modification","1/26","23/5461",0.104154665421162,0.207858444844829,0.150928154950692,"Me1_v2_0173860",1
"GO:1901463","GO:1901463","regulation of tetrapyrrole biosynthetic process","1/26","23/5461",0.104154665421162,0.207858444844829,0.150928154950692,"Me1_v2_0153460",1
"GO:0005506","GO:0005506","iron ion binding","1/26","24/5461",0.108437853854235,0.213631840285479,0.155120276768541,"Me1_v2_0055070",1
"GO:0010102","GO:0010102","lateral root morphogenesis","1/26","24/5461",0.108437853854235,0.213631840285479,0.155120276768541,"Me1_v2_0199620",1
"GO:0071489","GO:0071489","cellular response to red or far red light","1/26","24/5461",0.108437853854235,0.213631840285479,0.155120276768541,"Me1_v2_0230620",1
"GO:0009658","GO:0009658","chloroplast organization","2/26","120/5461",0.110636097306823,0.215582245931043,0.156536486370754,"Me1_v2_0153460/Me1_v2_0230620",2
"GO:2000026","GO:2000026","regulation of multicellular organismal development","3/26","248/5461",0.11175143316965,0.215582245931043,0.156536486370754,"Me1_v2_0173860/Me1_v2_0199620/Me1_v2_0230620",3
"GO:0004176","GO:0004176","ATP-dependent peptidase activity","1/26","25/5461",0.112701347655925,0.215582245931043,0.156536486370754,"Me1_v2_0099280",1
"GO:0006641","GO:0006641","triglyceride metabolic process","1/26","25/5461",0.112701347655925,0.215582245931043,0.156536486370754,"Me1_v2_0058550",1
"GO:0010101","GO:0010101","post-embryonic root morphogenesis","1/26","25/5461",0.112701347655925,0.215582245931043,0.156536486370754,"Me1_v2_0199620",1
"GO:0051536","GO:0051536","iron-sulfur cluster binding","1/26","25/5461",0.112701347655925,0.215582245931043,0.156536486370754,"Me1_v2_0055070",1
"GO:0051540","GO:0051540","metal cluster binding","1/26","25/5461",0.112701347655925,0.215582245931043,0.156536486370754,"Me1_v2_0055070",1
"GO:0072525","GO:0072525","pyridine-containing compound biosynthetic process","1/26","26/5461",0.116945233778247,0.221859064904412,0.161094149194207,"Me1_v2_0166840",1
"GO:2000028","GO:2000028","regulation of photoperiodism, flowering","1/26","26/5461",0.116945233778247,0.221859064904412,0.161094149194207,"Me1_v2_0230620",1
"GO:0009765","GO:0009765","photosynthesis, light harvesting","1/26","27/5461",0.121169598805251,0.228931086267299,0.166229216652588,"Me1_v2_0099280",1
"GO:0019439","GO:0019439","aromatic compound catabolic process","2/26","128/5461",0.12311225986823,0.231652048160221,0.168204935072383,"Me1_v2_0062370/Me1_v2_0153460",2
"GO:0009534","GO:0009534","chloroplast thylakoid","3/26","260/5461",0.124159216376947,0.232672352641351,0.168945788651558,"Me1_v2_0099280/Me1_v2_0107950/Me1_v2_0122920",3
"GO:0031976","GO:0031976","plastid thylakoid","3/26","263/5461",0.127340686094128,0.237668244086612,0.172573356820511,"Me1_v2_0099280/Me1_v2_0107950/Me1_v2_0122920",3
"GO:0004842","GO:0004842","ubiquitin-protein transferase activity","2/26","131/5461",0.127880054866612,0.237712521344791,0.172605506993135,"Me1_v2_0199620/Me1_v2_0225880",2
"GO:0045089","GO:0045089","positive regulation of innate immune response","1/26","29/5461",0.129560110078599,0.239056399572947,0.173581310798487,"Me1_v2_0067620",1
"GO:0006511","GO:0006511","ubiquitin-dependent protein catabolic process","2/26","133/5461",0.131083869010679,0.239056399572947,0.173581310798487,"Me1_v2_0093690/Me1_v2_0199620",2
"GO:0032879","GO:0032879","regulation of localization","2/26","134/5461",0.132693124357883,0.239056399572947,0.173581310798487,"Me1_v2_0058550/Me1_v2_0173860",2
"GO:0009941","GO:0009941","chloroplast envelope","4/26","418/5461",0.133175335733214,0.239056399572947,0.173581310798487,"Me1_v2_0099280/Me1_v2_0122920/Me1_v2_0129260/Me1_v2_0129280",4
"GO:0003684","GO:0003684","damaged DNA binding","1/26","30/5461",0.133726427666587,0.239056399572947,0.173581310798487,"Me1_v2_0093690",1
"GO:0006638","GO:0006638","neutral lipid metabolic process","1/26","30/5461",0.133726427666587,0.239056399572947,0.173581310798487,"Me1_v2_0058550",1
"GO:0006639","GO:0006639","acylglycerol metabolic process","1/26","30/5461",0.133726427666587,0.239056399572947,0.173581310798487,"Me1_v2_0058550",1
"GO:0016298","GO:0016298","lipase activity","1/26","30/5461",0.133726427666587,0.239056399572947,0.173581310798487,"Me1_v2_0058550",1
"GO:0043269","GO:0043269","regulation of ion transport","1/26","30/5461",0.133726427666587,0.239056399572947,0.173581310798487,"Me1_v2_0173860",1
"GO:0019941","GO:0019941","modification-dependent protein catabolic process","2/26","135/5461",0.134307174597383,0.239056399572947,0.173581310798487,"Me1_v2_0093690/Me1_v2_0199620",2
"GO:2000241","GO:2000241","regulation of reproductive process","2/26","135/5461",0.134307174597383,0.239056399572947,0.173581310798487,"Me1_v2_0173860/Me1_v2_0230620",2
"GO:0009072","GO:0009072","aromatic amino acid family metabolic process","1/26","31/5461",0.1378735668455,0.243523809638986,0.17682514320173,"Me1_v2_0062370",1
"GO:0010027","GO:0010027","thylakoid membrane organization","1/26","31/5461",0.1378735668455,0.243523809638986,0.17682514320173,"Me1_v2_0153460",1
"GO:0009668","GO:0009668","plastid membrane organization","1/26","32/5461",0.142001612381783,0.248742094085432,0.180614193216503,"Me1_v2_0153460",1
"GO:2000280","GO:2000280","regulation of root development","1/26","32/5461",0.142001612381783,0.248742094085432,0.180614193216503,"Me1_v2_0199620",1
"GO:1901361","GO:1901361","organic cyclic compound catabolic process","2/26","140/5461",0.142446665593393,0.248742094085432,0.180614193216503,"Me1_v2_0062370/Me1_v2_0153460",2
"GO:0019787","GO:0019787","ubiquitin-like protein transferase activity","2/26","141/5461",0.14408788299551,0.250598486957773,0.18196213917701,"Me1_v2_0199620/Me1_v2_0225880",2
"GO:0010218","GO:0010218","response to far red light","1/26","33/5461",0.146110648682772,0.250598486957773,0.18196213917701,"Me1_v2_0230620",1
"GO:0050778","GO:0050778","positive regulation of immune response","1/26","33/5461",0.146110648682772,0.250598486957773,0.18196213917701,"Me1_v2_0067620",1
"GO:0052689","GO:0052689","carboxylic ester hydrolase activity","1/26","33/5461",0.146110648682772,0.250598486957773,0.18196213917701,"Me1_v2_0058550",1
"GO:0048523","GO:0048523","negative regulation of cellular process","4/26","433/5461",0.146227750524167,0.250598486957773,0.18196213917701,"Me1_v2_0027640/Me1_v2_0028080/Me1_v2_0099280/Me1_v2_0218650",4
"GO:0008202","GO:0008202","steroid metabolic process","1/26","34/5461",0.150200759798145,0.253541054998923,0.1840987681006,"Me1_v2_0230070",1
"GO:0031349","GO:0031349","positive regulation of defense response","1/26","34/5461",0.150200759798145,0.253541054998923,0.1840987681006,"Me1_v2_0067620",1
"GO:0051235","GO:0051235","maintenance of location","1/26","34/5461",0.150200759798145,0.253541054998923,0.1840987681006,"Me1_v2_0058550",1
"GO:0009526","GO:0009526","plastid envelope","4/26","438/5461",0.150694007858694,0.253541054998923,0.1840987681006,"Me1_v2_0099280/Me1_v2_0122920/Me1_v2_0129260/Me1_v2_0129280",4
"GO:0043632","GO:0043632","modification-dependent macromolecule catabolic process","2/26","145/5461",0.150694683448384,0.253541054998923,0.1840987681006,"Me1_v2_0093690/Me1_v2_0199620",2
"GO:0048608","GO:0048608","reproductive structure development","4/26","440/5461",0.152496202023421,0.254712859176801,0.184949627167993,"Me1_v2_0093690/Me1_v2_0225880/Me1_v2_0230070/Me1_v2_0230620",4
"GO:0061458","GO:0061458","reproductive system development","4/26","440/5461",0.152496202023421,0.254712859176801,0.184949627167993,"Me1_v2_0093690/Me1_v2_0225880/Me1_v2_0230070/Me1_v2_0230620",4
"GO:0010087","GO:0010087","phloem or xylem histogenesis","1/26","35/5461",0.154272029421372,0.256748756546038,0.186427913190181,"Me1_v2_0173860",1
"GO:0002684","GO:0002684","positive regulation of immune system process","1/26","36/5461",0.158324540891155,0.261604348927679,0.189953608765846,"Me1_v2_0067620",1
"GO:0015994","GO:0015994","chlorophyll metabolic process","1/26","36/5461",0.158324540891155,0.261604348927679,0.189953608765846,"Me1_v2_0153460",1
"GO:0072593","GO:0072593","reactive oxygen species metabolic process","1/26","37/5461",0.162358377192875,0.266579361639982,0.193566016672027,"Me1_v2_0107950",1
"GO:0065008","GO:0065008","regulation of biological quality","4/26","451/5461",0.162564479339989,0.266579361639982,0.193566016672027,"Me1_v2_0058550/Me1_v2_0120970/Me1_v2_0129260/Me1_v2_0129280",4
"GO:0051239","GO:0051239","regulation of multicellular organismal process","3/26","295/5461",0.163070238573698,0.266579361639982,0.193566016672027,"Me1_v2_0173860/Me1_v2_0199620/Me1_v2_0230620",3
"GO:0016567","GO:0016567","protein ubiquitination","2/26","153/5461",0.164094674586753,0.267241251785953,0.194046621915591,"Me1_v2_0199620/Me1_v2_0225880",2
"GO:0006289","GO:0006289","nucleotide-excision repair","1/26","38/5461",0.166373620960018,0.267241251785953,0.194046621915591,"Me1_v2_0093690",1
"GO:0031331","GO:0031331","positive regulation of cellular catabolic process","1/26","38/5461",0.166373620960018,0.267241251785953,0.194046621915591,"Me1_v2_0058550",1
"GO:0046527","GO:0046527","glucosyltransferase activity","1/26","38/5461",0.166373620960018,0.267241251785953,0.194046621915591,"Me1_v2_0230070",1
"GO:1901606","GO:1901606","alpha-amino acid catabolic process","1/26","38/5461",0.166373620960018,0.267241251785953,0.194046621915591,"Me1_v2_0062370",1
"GO:0001666","GO:0001666","response to hypoxia","1/26","39/5461",0.170370354475607,0.272710879907135,0.198018175158052,"Me1_v2_0067620",1
"GO:0004888","GO:0004888","transmembrane signaling receptor activity","1/26","41/5461",0.178308618140415,0.282475164820382,0.205108122874487,"Me1_v2_0173860",1
"GO:0009896","GO:0009896","positive regulation of catabolic process","1/26","41/5461",0.178308618140415,0.282475164820382,0.205108122874487,"Me1_v2_0058550",1
"GO:0046496","GO:0046496","nicotinamide nucleotide metabolic process","1/26","41/5461",0.178308618140415,0.282475164820382,0.205108122874487,"Me1_v2_0166840",1
"GO:0009657","GO:0009657","plastid organization","2/26","162/5461",0.179429984738544,0.283278160837222,0.205691186542383,"Me1_v2_0153460/Me1_v2_0230620",2
"GO:0044255","GO:0044255","cellular lipid metabolic process","3/26","311/5461",0.182025096136847,0.283842545353154,0.206100991944978,"Me1_v2_0058550/Me1_v2_0129260/Me1_v2_0129280",3
"GO:0009063","GO:0009063","cellular amino acid catabolic process","1/26","42/5461",0.182250311116125,0.283842545353154,0.206100991944978,"Me1_v2_0062370",1
"GO:0019362","GO:0019362","pyridine nucleotide metabolic process","1/26","42/5461",0.182250311116125,0.283842545353154,0.206100991944978,"Me1_v2_0166840",1
"GO:0051302","GO:0051302","regulation of cell division","1/26","42/5461",0.182250311116125,0.283842545353154,0.206100991944978,"Me1_v2_0199620",1
"GO:0006091","GO:0006091","generation of precursor metabolites and energy","2/26","164/5461",0.182870690163823,0.283849791803105,0.206106253666828,"Me1_v2_0099280/Me1_v2_0153460",2
"GO:0009057","GO:0009057","macromolecule catabolic process","3/26","313/5461",0.184439094823596,0.285323566153281,0.207176376382563,"Me1_v2_0093690/Me1_v2_0099280/Me1_v2_0199620",3
"GO:0051603","GO:0051603","proteolysis involved in cellular protein catabolic process","2/26","166/5461",0.1863222520332,0.287272769857208,0.20859171324259,"Me1_v2_0093690/Me1_v2_0199620",2
"GO:0016209","GO:0016209","antioxidant activity","1/26","44/5461",0.190079223832201,0.289196442860214,0.209988511998055,"Me1_v2_0107950",1
"GO:0036293","GO:0036293","response to decreased oxygen levels","1/26","44/5461",0.190079223832201,0.289196442860214,0.209988511998055,"Me1_v2_0067620",1
"GO:0044242","GO:0044242","cellular lipid catabolic process","1/26","44/5461",0.190079223832201,0.289196442860214,0.209988511998055,"Me1_v2_0058550",1
"GO:0048527","GO:0048527","lateral root development","1/26","44/5461",0.190079223832201,0.289196442860214,0.209988511998055,"Me1_v2_0199620",1
"GO:0032446","GO:0032446","protein modification by small protein conjugation","2/26","169/5461",0.191518882047982,0.290428304684604,0.210882979540368,"Me1_v2_0199620/Me1_v2_0225880",2
"GO:1902494","GO:1902494","catalytic complex","4/26","483/5461",0.193255650976886,0.290649820832946,0.211043824694319,"Me1_v2_0093690/Me1_v2_0199620/Me1_v2_0225880/Me1_v2_0230620",4
"GO:0070482","GO:0070482","response to oxygen levels","1/26","45/5461",0.193966604334392,0.290649820832946,0.211043824694319,"Me1_v2_0067620",1
"GO:0098869","GO:0098869","cellular oxidant detoxification","1/26","45/5461",0.193966604334392,0.290649820832946,0.211043824694319,"Me1_v2_0107950",1
"GO:0050793","GO:0050793","regulation of developmental process","3/26","321/5461",0.194186865111816,0.290649820832946,0.211043824694319,"Me1_v2_0173860/Me1_v2_0199620/Me1_v2_0230620",3
"GO:0010029","GO:0010029","regulation of seed germination","1/26","46/5461",0.19783604087193,0.293255353189581,0.212935728540442,"Me1_v2_0173860",1
"GO:0090697","GO:0090697","post-embryonic plant organ morphogenesis","1/26","46/5461",0.19783604087193,0.293255353189581,0.212935728540442,"Me1_v2_0199620",1
"GO:1990748","GO:1990748","cellular detoxification","1/26","46/5461",0.19783604087193,0.293255353189581,0.212935728540442,"Me1_v2_0107950",1
"GO:0010605","GO:0010605","negative regulation of macromolecule metabolic process","3/26","325/5461",0.199113430413268,0.293305960824629,0.212972475264829,"Me1_v2_0027640/Me1_v2_0028080/Me1_v2_0218650",3
"GO:0009579","GO:0009579","thylakoid","3/26","327/5461",0.20158928931149,0.293305960824629,0.212972475264829,"Me1_v2_0099280/Me1_v2_0107950/Me1_v2_0122920",3
"GO:0006778","GO:0006778","porphyrin-containing compound metabolic process","1/26","47/5461",0.201687612974853,0.293305960824629,0.212972475264829,"Me1_v2_0153460",1
"GO:0016042","GO:0016042","lipid catabolic process","1/26","47/5461",0.201687612974853,0.293305960824629,0.212972475264829,"Me1_v2_0058550",1
"GO:0051604","GO:0051604","protein maturation","1/26","47/5461",0.201687612974853,0.293305960824629,0.212972475264829,"Me1_v2_0055070",1
"GO:0072524","GO:0072524","pyridine-containing compound metabolic process","1/26","47/5461",0.201687612974853,0.293305960824629,0.212972475264829,"Me1_v2_0166840",1
"GO:0033013","GO:0033013","tetrapyrrole metabolic process","1/26","48/5461",0.205521399835336,0.297941400390219,0.216338315616143,"Me1_v2_0153460",1
"GO:0016999","GO:0016999","antibiotic metabolic process","1/26","49/5461",0.209337480309062,0.301576807570243,0.218978022165401,"Me1_v2_0107950",1
"GO:0031977","GO:0031977","thylakoid lumen","1/26","49/5461",0.209337480309062,0.301576807570243,0.218978022165401,"Me1_v2_0099280",1
"GO:0032787","GO:0032787","monocarboxylic acid metabolic process","2/26","180/5461",0.21074700099076,0.302661580862119,0.21976568721122,"Me1_v2_0129260/Me1_v2_0129280",2
"GO:0009845","GO:0009845","seed germination","1/26","50/5461",0.213135932916594,0.305141817001708,0.221566612185279,"Me1_v2_0230070",1
"GO:0008237","GO:0008237","metallopeptidase activity","1/26","51/5461",0.216916835844735,0.306744359890867,0.222730235061756,"Me1_v2_0099280",1
"GO:0012501","GO:0012501","programmed cell death","1/26","51/5461",0.216916835844735,0.306744359890867,0.222730235061756,"Me1_v2_0067620",1
"GO:0022900","GO:0022900","electron transport chain","1/26","51/5461",0.216916835844735,0.306744359890867,0.222730235061756,"Me1_v2_0153460",1
"GO:0048528","GO:0048528","post-embryonic root development","1/26","51/5461",0.216916835844735,0.306744359890867,0.222730235061756,"Me1_v2_0199620",1
"GO:0010876","GO:0010876","lipid localization","1/26","52/5461",0.220680266947884,0.310163423972483,0.225212852661833,"Me1_v2_0058550",1
"GO:1900140","GO:1900140","regulation of seedling development","1/26","52/5461",0.220680266947884,0.310163423972483,0.225212852661833,"Me1_v2_0173860",1
"GO:0048509","GO:0048509","regulation of meristem development","1/26","53/5461",0.224426303749392,0.313516745540817,0.227647733946752,"Me1_v2_0173860",1
"GO:0098754","GO:0098754","detoxification","1/26","53/5461",0.224426303749392,0.313516745540817,0.227647733946752,"Me1_v2_0107950",1
"GO:0006508","GO:0006508","proteolysis","3/26","346/5461",0.225493226399975,0.314055520756461,0.228038944172976,"Me1_v2_0093690/Me1_v2_0099280/Me1_v2_0199620",3
"GO:0045088","GO:0045088","regulation of innate immune response","1/26","54/5461",0.228155023442905,0.316805619901141,0.230035819450994,"Me1_v2_0067620",1
"GO:0097237","GO:0097237","cellular response to toxic substance","1/26","55/5461",0.231866502893706,0.320171316756779,0.232479686559323,"Me1_v2_0107950",1
"GO:0006979","GO:0006979","response to oxidative stress","2/26","192/5461",0.231967938821614,0.320171316756779,0.232479686559323,"Me1_v2_0107950/Me1_v2_0153460",2
"GO:0070647","GO:0070647","protein modification by small protein conjugation or removal","2/26","194/5461",0.235523449399563,0.322236016003161,0.233978885920779,"Me1_v2_0199620/Me1_v2_0225880",2
"GO:0038023","GO:0038023","signaling receptor activity","1/26","56/5461",0.235560818640055,0.322236016003161,0.233978885920779,"Me1_v2_0173860",1
"GO:0090351","GO:0090351","seedling development","1/26","56/5461",0.235560818640055,0.322236016003161,0.233978885920779,"Me1_v2_0230070",1
"GO:0046914","GO:0046914","transition metal ion binding","2/26","198/5461",0.242646914221494,0.330947418509198,0.240304324890798,"Me1_v2_0055070/Me1_v2_0170050",2
"GO:0090698","GO:0090698","post-embryonic plant morphogenesis","1/26","60/5461",0.250167963974589,0.340198912661609,0.247021929960935,"Me1_v2_0199620",1
"GO:0060089","GO:0060089","molecular transducer activity","1/26","61/5461",0.253777597919536,0.344092566590901,0.249849152131308,"Me1_v2_0173860",1
"GO:0006281","GO:0006281","DNA repair","2/26","206/5461",0.256933084580717,0.346923421037595,0.251904664664814,"Me1_v2_0093690/Me1_v2_0225880",2
"GO:0008194","GO:0008194","UDP-glycosyltransferase activity","1/26","62/5461",0.25737052059622,0.346923421037595,0.251904664664814,"Me1_v2_0230070",1
"GO:0034599","GO:0034599","cellular response to oxidative stress","1/26","63/5461",0.2609468062907,0.350718593877588,0.254660378703215,"Me1_v2_0107950",1
"GO:0016053","GO:0016053","organic acid biosynthetic process","2/26","210/5461",0.264089994098174,0.352420548717717,0.255896185619897,"Me1_v2_0129260/Me1_v2_0129280",2
"GO:0046394","GO:0046394","carboxylic acid biosynthetic process","2/26","210/5461",0.264089994098174,0.352420548717717,0.255896185619897,"Me1_v2_0129260/Me1_v2_0129280",2
"GO:0008219","GO:0008219","cell death","1/26","64/5461",0.264506528972516,0.352420548717717,0.255896185619897,"Me1_v2_0067620",1
"GO:0050776","GO:0050776","regulation of immune response","1/26","65/5461",0.268049762295976,0.356112220226066,0.258576746276719,"Me1_v2_0067620",1
"GO:0008610","GO:0008610","lipid biosynthetic process","2/26","214/5461",0.271252416834186,0.359331506208505,0.260914302943954,"Me1_v2_0129260/Me1_v2_0129280",2
"GO:0005654","GO:0005654","nucleoplasm","3/26","386/5461",0.277594954545723,0.36667986832544,0.266250024266445,"Me1_v2_0058550/Me1_v2_0225880/Me1_v2_0230620",3
"GO:0071482","GO:0071482","cellular response to light stimulus","1/26","68/5461",0.278581257957806,0.366931314052996,0.266432601595736,"Me1_v2_0230620",1
"GO:0009267","GO:0009267","cellular response to starvation","1/26","71/5461",0.288966970956331,0.378448220485422,0.274795145825697,"Me1_v2_0153460",1
"GO:0009909","GO:0009909","regulation of flower development","1/26","71/5461",0.288966970956331,0.378448220485422,0.274795145825697,"Me1_v2_0173860",1
"GO:0061630","GO:0061630","ubiquitin protein ligase activity","1/26","72/5461",0.292396814881217,0.380776643108025,0.276485837443434,"Me1_v2_0225880",1
"GO:0090696","GO:0090696","post-embryonic plant organ development","1/26","72/5461",0.292396814881217,0.380776643108025,0.276485837443434,"Me1_v2_0199620",1
"GO:0004672","GO:0004672","protein kinase activity","2/26","227/5461",0.294536831595416,0.380918308914949,0.276588702443096,"Me1_v2_0153460/Me1_v2_0173860",2
"GO:0005759","GO:0005759","mitochondrial matrix","1/26","73/5461",0.295810747487097,0.380918308914949,0.276588702443096,"Me1_v2_0055070",1
"GO:0016054","GO:0016054","organic acid catabolic process","1/26","73/5461",0.295810747487097,0.380918308914949,0.276588702443096,"Me1_v2_0062370",1
"GO:0046395","GO:0046395","carboxylic acid catabolic process","1/26","73/5461",0.295810747487097,0.380918308914949,0.276588702443096,"Me1_v2_0062370",1
"GO:0002682","GO:0002682","regulation of immune system process","1/26","74/5461",0.299208839648444,0.384220821944102,0.27898669112507,"Me1_v2_0067620",1
"GO:0061659","GO:0061659","ubiquitin-like protein ligase activity","1/26","76/5461",0.305957784623655,0.391795940865291,0.284487062895679,"Me1_v2_0225880",1
"GO:0071478","GO:0071478","cellular response to radiation","1/26","79/5461",0.315964153280695,0.403488849480333,0.292977404120895,"Me1_v2_0230620",1
"GO:0006468","GO:0006468","protein phosphorylation","2/26","240/5461",0.317767286047418,0.40467049411011,0.293835408441637,"Me1_v2_0153460/Me1_v2_0173860",2
"GO:0019752","GO:0019752","carboxylic acid metabolic process","3/26","417/5461",0.318992812925928,0.405112084735131,0.294156051936915,"Me1_v2_0062370/Me1_v2_0129260/Me1_v2_0129280",3
"GO:0006974","GO:0006974","cellular response to DNA damage stimulus","2/26","248/5461",0.332003044719725,0.419742286430676,0.304779191882532,"Me1_v2_0093690/Me1_v2_0225880",2
"GO:0031669","GO:0031669","cellular response to nutrient levels","1/26","84/5461",0.332333914419082,0.419742286430676,0.304779191882532,"Me1_v2_0153460",1
"GO:0009733","GO:0009733","response to auxin","1/26","86/5461",0.338775779855942,0.425546688047927,0.308993827604157,"Me1_v2_0199620",1
"GO:0042594","GO:0042594","response to starvation","1/26","86/5461",0.338775779855942,0.425546688047927,0.308993827604157,"Me1_v2_0153460",1
"GO:0043436","GO:0043436","oxoacid metabolic process","3/26","433/5461",0.340512054612634,0.426565372762022,0.309733505053826,"Me1_v2_0062370/Me1_v2_0129260/Me1_v2_0129280",3
"GO:0006082","GO:0006082","organic acid metabolic process","3/26","434/5461",0.341858195493256,0.427091133123011,0.310115265060207,"Me1_v2_0062370/Me1_v2_0129260/Me1_v2_0129280",3
"GO:0009165","GO:0009165","nucleotide biosynthetic process","1/26","89/5461",0.348326647907257,0.432826373814678,0.314279682322337,"Me1_v2_0166840",1
"GO:1901293","GO:1901293","nucleoside phosphate biosynthetic process","1/26","89/5461",0.348326647907257,0.432826373814678,0.314279682322337,"Me1_v2_0166840",1
"GO:0000302","GO:0000302","response to reactive oxygen species","1/26","91/5461",0.354620048616127,0.439461941967835,0.31909783661553,"Me1_v2_0107950",1
"GO:0046486","GO:0046486","glycerolipid metabolic process","1/26","93/5461",0.360854987965463,0.445989676815224,0.323837692036171,"Me1_v2_0058550",1
"GO:0048831","GO:0048831","regulation of shoot system development","1/26","96/5461",0.370098921581999,0.456191451468721,0.331245305553267,"Me1_v2_0173860",1
"GO:0046872","GO:0046872","metal ion binding","2/26","271/5461",0.372517357482515,0.457948004798505,0.332520756994918,"Me1_v2_0055070/Me1_v2_0170050",2
"GO:0031668","GO:0031668","cellular response to extracellular stimulus","1/26","98/5461",0.376189979509864,0.461232927005445,0.334905972799935,"Me1_v2_0153460",1
"GO:0048522","GO:0048522","positive regulation of cellular process","3/26","462/5461",0.379512951713062,0.464072866683611,0.336968082213468,"Me1_v2_0058550/Me1_v2_0153460/Me1_v2_0199620",3
"GO:0048316","GO:0048316","seed development","2/26","278/5461",0.384690210712705,0.467333285719052,0.339335506013605,"Me1_v2_0093690/Me1_v2_0230070",2
"GO:0045087","GO:0045087","innate immune response","1/26","101/5461",0.385220495820476,0.467333285719052,0.339335506013605,"Me1_v2_0067620",1
"GO:0071496","GO:0071496","cellular response to external stimulus","1/26","101/5461",0.385220495820476,0.467333285719052,0.339335506013605,"Me1_v2_0153460",1
"GO:0071214","GO:0071214","cellular response to abiotic stimulus","1/26","103/5461",0.391170862764666,0.472067454802385,0.342773034883339,"Me1_v2_0230620",1
"GO:0104004","GO:0104004","cellular response to environmental stimulus","1/26","103/5461",0.391170862764666,0.472067454802385,0.342773034883339,"Me1_v2_0230620",1
"GO:0031347","GO:0031347","regulation of defense response","1/26","104/5461",0.394125240810228,0.474390955648864,0.344460152748804,"Me1_v2_0067620",1
"GO:0010154","GO:0010154","fruit development","2/26","285/5461",0.396775000940973,0.476336654775491,0.345872944899204,"Me1_v2_0093690/Me1_v2_0230070",2
"GO:0051049","GO:0051049","regulation of transport","1/26","106/5461",0.39999269628674,0.477971706545692,0.347060172808608,"Me1_v2_0173860",1
"GO:0043169","GO:0043169","cation binding","2/26","287/5461",0.400210582921121,0.477971706545692,0.347060172808608,"Me1_v2_0055070/Me1_v2_0170050",2
"GO:0006955","GO:0006955","immune response","1/26","108/5461",0.405805494824925,0.483094371476251,0.3507797925093,"Me1_v2_0067620",1
"GO:0044282","GO:0044282","small molecule catabolic process","1/26","109/5461",0.40869155070659,0.483094371476251,0.3507797925093,"Me1_v2_0062370",1
"GO:0050832","GO:0050832","defense response to fungus","1/26","109/5461",0.40869155070659,0.483094371476251,0.3507797925093,"Me1_v2_0067620",1
"GO:0061024","GO:0061024","membrane organization","1/26","109/5461",0.40869155070659,0.483094371476251,0.3507797925093,"Me1_v2_0153460",1
"GO:0031667","GO:0031667","response to nutrient levels","1/26","112/5461",0.417269072735713,0.491971975783027,0.357225912316481,"Me1_v2_0153460",1
"GO:0016773","GO:0016773","phosphotransferase activity, alcohol group as acceptor","2/26","301/5461",0.424028258485516,0.498665885616895,0.362086429104173,"Me1_v2_0153460/Me1_v2_0173860",2
"GO:0010015","GO:0010015","root morphogenesis","1/26","115/5461",0.425726887942784,0.49938955557665,0.362611893306027,"Me1_v2_0199620",1
"GO:0006790","GO:0006790","sulfur compound metabolic process","1/26","116/5461",0.428519836112161,0.500770130256502,0.363614342782435,"Me1_v2_0055070",1
"GO:0044283","GO:0044283","small molecule biosynthetic process","2/26","304/5461",0.429076358896569,0.500770130256502,0.363614342782435,"Me1_v2_0129260/Me1_v2_0129280",2
"GO:0031325","GO:0031325","positive regulation of cellular metabolic process","2/26","306/5461",0.432430285702432,0.503410004315205,0.365531182491689,"Me1_v2_0058550/Me1_v2_0153460",2
"GO:0003677","GO:0003677","DNA binding","2/26","316/5461",0.449057416703356,0.521449544333116,0.378629878063548,"Me1_v2_0093690/Me1_v2_0116260",2
"GO:0009991","GO:0009991","response to extracellular stimulus","1/26","126/5461",0.455740429871235,0.527880246659898,0.383299277172845,"Me1_v2_0153460",1
"GO:0009620","GO:0009620","response to fungus","1/26","128/5461",0.461032871164957,0.531340384017613,0.385811718501201,"Me1_v2_0067620",1
"GO:0044270","GO:0044270","cellular nitrogen compound catabolic process","1/26","128/5461",0.461032871164957,0.531340384017613,0.385811718501201,"Me1_v2_0153460",1
"GO:0016758","GO:0016758","hexosyltransferase activity","1/26","129/5461",0.463660500144839,0.531710175539231,0.386080227928931,"Me1_v2_0230070",1
"GO:0046700","GO:0046700","heterocycle catabolic process","1/26","129/5461",0.463660500144839,0.531710175539231,0.386080227928931,"Me1_v2_0153460",1
"GO:0006259","GO:0006259","DNA metabolic process","2/26","327/5461",0.467059789749459,0.534279312839951,0.387945704950576,"Me1_v2_0093690/Me1_v2_0225880",2
"GO:0043565","GO:0043565","sequence-specific DNA binding","1/26","132/5461",0.471469688158647,0.53666055862009,0.389674752006367,"Me1_v2_0116260",1
"GO:1901605","GO:1901605","alpha-amino acid metabolic process","1/26","132/5461",0.471469688158647,0.53666055862009,0.389674752006367,"Me1_v2_0062370",1
"GO:0009893","GO:0009893","positive regulation of metabolic process","2/26","336/5461",0.481552917093568,0.546787918177672,0.397028331956844,"Me1_v2_0058550/Me1_v2_0153460",2
"GO:0016301","GO:0016301","kinase activity","2/26","337/5461",0.483149724896567,0.547253128199797,0.39736612573932,"Me1_v2_0153460/Me1_v2_0173860",2
"GO:0048584","GO:0048584","positive regulation of response to stimulus","1/26","139/5461",0.48926825808953,0.552825164164885,0.401412038370667,"Me1_v2_0067620",1
"GO:0002376","GO:0002376","immune system process","1/26","145/5461",0.504064183878755,0.566764850653917,0.411533788121808,"Me1_v2_0067620",1
"GO:0005198","GO:0005198","structural molecule activity","1/26","145/5461",0.504064183878755,0.566764850653917,0.411533788121808,"Me1_v2_0055070",1
"GO:0009117","GO:0009117","nucleotide metabolic process","1/26","149/5461",0.513698216118997,0.576191916376783,0.41837887751528,"Me1_v2_0166840",1
"GO:0006753","GO:0006753","nucleoside phosphate metabolic process","1/26","152/5461",0.520805380345651,0.582745826066371,0.423137738758091,"Me1_v2_0166840",1
"GO:1905392","GO:1905392","plant organ morphogenesis","1/26","153/5461",0.523152161304591,0.583954349543381,0.4240152600863,"Me1_v2_0199620",1
"GO:0009653","GO:0009653","anatomical structure morphogenesis","2/26","366/5461",0.528221779790006,0.588188986674379,0.427090073666977,"Me1_v2_0120970/Me1_v2_0199620",2
"GO:0016310","GO:0016310","phosphorylation","2/26","372/5461",0.537238086701605,0.59678736860106,0.433333447231732,"Me1_v2_0153460/Me1_v2_0173860",2
"GO:0003700","GO:0003700","DNA-binding transcription factor activity","1/26","168/5461",0.557055112584615,0.617313478128624,0.448237666502803,"Me1_v2_0116260",1
"GO:0016757","GO:0016757","glycosyltransferase activity","1/26","169/5461",0.559230923480667,0.61823850293666,0.448909336531243,"Me1_v2_0230070",1
"GO:0042742","GO:0042742","defense response to bacterium","1/26","170/5461",0.561396455602644,0.619147765628753,0.449569561525159,"Me1_v2_0067620",1
"GO:0090407","GO:0090407","organophosphate biosynthetic process","1/26","172/5461",0.565696869819923,0.622401567988029,0.451932180888671,"Me1_v2_0166840",1
"GO:0080134","GO:0080134","regulation of response to stress","1/26","180/5461",0.582496601973373,0.639359365499345,0.464245412099079,"Me1_v2_0067620",1
"GO:0031328","GO:0031328","positive regulation of cellular biosynthetic process","1/26","187/5461",0.59668225243651,0.653374152905537,0.474421693398701,"Me1_v2_0153460",1
"GO:0008233","GO:0008233","peptidase activity","1/26","192/5461",0.606529881905094,0.662583591370257,0.481108761401397,"Me1_v2_0099280",1
"GO:0006520","GO:0006520","cellular amino acid metabolic process","1/26","194/5461",0.610403842285875,0.663670215315539,0.481897770225691,"Me1_v2_0062370",1
"GO:0009891","GO:0009891","positive regulation of biosynthetic process","1/26","194/5461",0.610403842285875,0.663670215315539,0.481897770225691,"Me1_v2_0153460",1
"GO:0022607","GO:0022607","cellular component assembly","2/26","427/5461",0.614664629019823,0.66673033877209,0.484119757345643,"Me1_v2_0055070/Me1_v2_0099280",2
"GO:0009617","GO:0009617","response to bacterium","1/26","198/5461",0.618042031262487,0.667253808927415,0.484499854410134,"Me1_v2_0067620",1
"GO:0055086","GO:0055086","nucleobase-containing small molecule metabolic process","1/26","198/5461",0.618042031262487,0.667253808927415,0.484499854410134,"Me1_v2_0166840",1
"GO:0040007","GO:0040007","growth","1/26","201/5461",0.623675964424732,0.671763129906078,0.487774118758152,"Me1_v2_0173860",1
"GO:0016772","GO:0016772","transferase activity, transferring phosphorus-containing groups","2/26","437/5461",0.627706866009353,0.67452882338068,0.489782317239539,"Me1_v2_0153460/Me1_v2_0173860",2
"GO:0009793","GO:0009793","embryo development ending in seed dormancy","1/26","208/5461",0.636512771408021,0.682400901439762,0.495498314094861,"Me1_v2_0093690",1
"GO:0140110","GO:0140110","transcription regulator activity","1/26","213/5461",0.645423019056723,0.690348055185961,0.501268824178869,"Me1_v2_0116260",1
"GO:0009651","GO:0009651","response to salt stress","1/26","240/5461",0.690024380753969,0.736223666569474,0.534579577506777,"Me1_v2_0173860",1
"GO:0009790","GO:0009790","embryo development","1/26","242/5461",0.693104276119635,0.736223666569474,0.534579577506777,"Me1_v2_0093690",1
"GO:0009888","GO:0009888","tissue development","1/26","242/5461",0.693104276119635,0.736223666569474,0.534579577506777,"Me1_v2_0173860",1
"GO:0018193","GO:0018193","peptidyl-amino acid modification","1/26","266/5461",0.727842618703814,0.769576713812978,0.558797568198486,"Me1_v2_0173860",1
"GO:0034654","GO:0034654","nucleobase-containing compound biosynthetic process","1/26","266/5461",0.727842618703814,0.769576713812978,0.558797568198486,"Me1_v2_0166840",1
"GO:0051173","GO:0051173","positive regulation of nitrogen compound metabolic process","1/26","273/5461",0.737240672582865,0.776945664015645,0.564148238741808,"Me1_v2_0153460",1
"GO:0005774","GO:0005774","vacuolar membrane","1/26","274/5461",0.738557508071077,0.776945664015645,0.564148238741808,"Me1_v2_0230070",1
"GO:0098542","GO:0098542","defense response to other organism","1/26","275/5461",0.739867996752425,0.776945664015645,0.564148238741808,"Me1_v2_0067620",1
"GO:0019637","GO:0019637","organophosphate metabolic process","1/26","280/5461",0.746326261528791,0.781946378556301,0.567779309009941,"Me1_v2_0166840",1
"GO:0065003","GO:0065003","protein-containing complex assembly","1/26","294/5461",0.763599684539887,0.798230055720835,0.57960305450217,"Me1_v2_0099280",1
"GO:0016887","GO:0016887","ATP hydrolysis activity","1/26","300/5461",0.770651172135155,0.803778711208838,0.5836319903286,"Me1_v2_0099280",1
"GO:0006952","GO:0006952","defense response","1/26","315/5461",0.787406228730914,0.819400161275285,0.594974885912868,"Me1_v2_0067620",1
"GO:0043933","GO:0043933","protein-containing complex organization","1/26","334/5461",0.806945256232344,0.837841808835835,0.608365555907742,"Me1_v2_0099280",1
"GO:0017111","GO:0017111","nucleoside-triphosphatase activity","1/26","348/5461",0.820225038768563,0.849716276117545,0.61698772874844,"Me1_v2_0099280",1
"GO:0018130","GO:0018130","heterocycle biosynthetic process","1/26","368/5461",0.837682477152283,0.862917114896325,0.626572993576964,"Me1_v2_0166840",1
"GO:0019438","GO:0019438","aromatic compound biosynthetic process","1/26","370/5461",0.839335685704934,0.862917114896325,0.626572993576964,"Me1_v2_0166840",1
"GO:0033036","GO:0033036","macromolecule localization","1/26","372/5461",0.840972697547294,0.862917114896325,0.626572993576964,"Me1_v2_0058550",1
"GO:0051707","GO:0051707","response to other organism","1/26","373/5461",0.841785177379043,0.862917114896325,0.626572993576964,"Me1_v2_0067620",1
"GO:0043207","GO:0043207","response to external biotic stimulus","1/26","374/5461",0.842593665073254,0.862917114896325,0.626572993576964,"Me1_v2_0067620",1
"GO:0009607","GO:0009607","response to biotic stimulus","1/26","376/5461",0.844198739302044,0.862917114896325,0.626572993576964,"Me1_v2_0067620",1
"GO:0016462","GO:0016462","pyrophosphatase activity","1/26","382/5461",0.848920092026301,0.864699112403322,0.627866920297423,"Me1_v2_0099280",1
"GO:0016818","GO:0016818","hydrolase activity, acting on acid anhydrides, in phosphorus-containing anhydrides","1/26","383/5461",0.849693487893069,0.864699112403322,0.627866920297423,"Me1_v2_0099280",1
"GO:0016817","GO:0016817","hydrolase activity, acting on acid anhydrides","1/26","387/5461",0.852749175134035,0.865897290169142,0.628736929498315,"Me1_v2_0099280",1
"GO:1901362","GO:1901362","organic cyclic compound biosynthetic process","1/26","415/5461",0.872526701482333,0.884032548095287,0.641905126827951,"Me1_v2_0166840",1
"GO:0006355","GO:0006355","regulation of transcription, DNA-templated","1/26","429/5461",0.881431539787926,0.891096359303145,0.647034232808312,"Me1_v2_0116260",1
"GO:1903506","GO:1903506","regulation of nucleic acid-templated transcription","1/26","436/5461",0.885656561438604,0.891457805290822,0.647296682458001,"Me1_v2_0116260",1
"GO:2001141","GO:2001141","regulation of RNA biosynthetic process","1/26","436/5461",0.885656561438604,0.891457805290822,0.647296682458001,"Me1_v2_0116260",1
"GO:0005773","GO:0005773","vacuole","1/26","443/5461",0.889736621554012,0.893613469578213,0.64886193247145,"Me1_v2_0230070",1
"GO:0098588","GO:0098588","bounding membrane of organelle","1/26","470/5461",0.904201579902023,0.906167235510505,0.657977351049985,"Me1_v2_0230070",1
"GO:0051252","GO:0051252","regulation of RNA metabolic process","1/26","491/5461",0.914172248573236,0.914172248573236,0.663789873378899,"Me1_v2_0116260",1
