Clusters_Mesotaenium	Clusters_Zygnema	Clusters_Physcomitrium
11	4	6
11	4	8
10	1	7
10	1	3
10	1	4
10	1	6
3	1	6
10	4	7
10	4	3
10	4	4
10	4	6
1	4	9
11	1	6
2	1	7
2	1	3
4	1	7
4	4	7
2	4	7
2	4	3
7	4	7
3	4	6
3	4	8
3	4	2
11	5	8
