{
	"n_targets": 44734,
	"n_bootstraps": 100,
	"n_processed": 42568579,
	"n_pseudoaligned": 34349638,
	"n_unique": 15584808,
	"p_pseudoaligned": 80.7,
	"p_unique": 36.6,
	"kallisto_version": "0.48.0",
	"index_version": 10,
	"start_time": "Tue Aug 23 10:47:03 2022",
	"call": "kallisto quant --bootstrap-samples 100 --rf-stranded -t 20 -i /scratch/users/dadras/Stress_profiling_of_mesotaenium_endlicherianum/kallisto_index/Me1_v2.release.gff3.cdna.idx -o /scratch/users/dadras/Stress_profiling_of_mesotaenium_endlicherianum/kallisto/M_1_67 /scratch/users/dadras/Stress_profiling_of_mesotaenium_endlicherianum/trimmed_reads_PE/M_1_67_1.fq.gz /scratch/users/dadras/Stress_profiling_of_mesotaenium_endlicherianum/trimmed_reads_PE/M_1_67_2.fq.gz"
}
