	A_agrestis_oxf	A_filiculoides	A_thaliana	B_distachyon	C_braunii	C_melkonianii	C_reinhardtii	Closterium_sp_NIES_67	K_nitens	M_endlicherianum	M_polymorpha	M_viride	O_lucimarinus	O_sativa	P_coloniale	P_margaritaceum	P_patens	S_lycopersicum	S_moellendorffii	S_muscicola	Z_circumcarinatum_SAG698_1a	Z_circumcarinatum_SAG698_1b	Z_circumcarinatum_UTEX1559	Z_circumcarinatum_UTEX1560	Z_mays
A_agrestis_oxf	0.0	2377.0	2408.0	2409.0	2718.0	3446.0	2980.0	2030.0	3525.0	2822.0	3622.0	2682.0	2424.0	1666.0	3439.0	490.0	1938.0	1623.0	3286.0	171.0	2528.0	2821.0	2830.0	2560.0	1181.0
A_filiculoides	6785.0	0.0	2933.0	3109.0	5413.0	6119.0	5192.0	3867.0	7211.0	6231.0	7034.0	4372.0	4083.0	3251.0	5691.0	1087.0	3346.0	3289.0	6047.0	514.0	4950.0	5993.0	6068.0	5379.0	2045.0
A_thaliana	6999.0	4416.0	0.0	4957.0	5921.0	6611.0	5952.0	4441.0	8116.0	7130.0	8057.0	5060.0	4830.0	4648.0	6520.0	1208.0	2673.0	5480.0	6327.0	345.0	5755.0	6870.0	7022.0	6335.0	2997.0
B_distachyon	6579.0	4253.0	4460.0	0.0	5592.0	6364.0	5825.0	4338.0	7775.0	6788.0	7542.0	4675.0	4541.0	4216.0	6273.0	1242.0	2521.0	4407.0	6177.0	407.0	5562.0	6485.0	6681.0	5997.0	3474.0
C_braunii	1837.0	1096.0	874.0	926.0	0.0	2194.0	2428.0	1993.0	2864.0	2045.0	1743.0	2217.0	4175.0	869.0	2026.0	442.0	1209.0	1644.0	1275.0	118.0	2331.0	2321.0	1995.0	1550.0	1319.0
C_melkonianii	403.0	335.0	249.0	275.0	426.0	0.0	676.0	304.0	644.0	452.0	427.0	492.0	606.0	262.0	820.0	71.0	241.0	265.0	337.0	25.0	351.0	464.0	454.0	394.0	181.0
C_reinhardtii	928.0	710.0	504.0	518.0	852.0	1223.0	0.0	722.0	1335.0	831.0	884.0	986.0	1264.0	682.0	1797.0	178.0	527.0	522.0	649.0	61.0	720.0	894.0	916.0	857.0	359.0
Closterium_sp_NIES_67	4111.0	3060.0	2777.0	2811.0	4071.0	4493.0	4743.0	0.0	5586.0	5575.0	4823.0	3370.0	4163.0	2712.0	4210.0	1004.0	2567.0	2677.0	3438.0	333.0	4646.0	5415.0	5341.0	4685.0	1946.0
K_nitens	670.0	650.0	351.0	382.0	738.0	1143.0	1345.0	536.0	0.0	927.0	847.0	807.0	949.0	372.0	1481.0	186.0	447.0	308.0	544.0	41.0	690.0	813.0	843.0	740.0	266.0
M_endlicherianum	2654.0	2016.0	1846.0	1902.0	3215.0	3367.0	3502.0	2330.0	3845.0	0.0	2851.0	2457.0	3258.0	1833.0	3615.0	573.0	2126.0	1812.0	2171.0	150.0	2607.0	3043.0	2914.0	2520.0	1347.0
M_polymorpha	1631.0	935.0	709.0	778.0	1361.0	1888.0	1615.0	997.0	2035.0	1628.0	0.0	1171.0	1358.0	778.0	1891.0	286.0	818.0	715.0	1288.0	104.0	1312.0	1550.0	1583.0	1448.0	605.0
M_viride	3109.0	2641.0	2205.0	2255.0	3126.0	4350.0	4276.0	2518.0	4569.0	3287.0	3548.0	0.0	3199.0	2194.0	3950.0	507.0	2019.0	2259.0	2623.0	148.0	2819.0	3480.0	3358.0	2924.0	1623.0
O_lucimarinus	659.0	487.0	449.0	460.0	587.0	800.0	871.0	557.0	843.0	663.0	751.0	624.0	0.0	456.0	1053.0	97.0	403.0	462.0	577.0	24.0	590.0	752.0	740.0	667.0	319.0
O_sativa	7168.0	4733.0	5297.0	5746.0	6030.0	6821.0	6286.0	4685.0	8442.0	7377.0	8248.0	5108.0	4924.0	0.0	6837.0	1350.0	2769.0	5336.0	6749.0	449.0	6143.0	7132.0	7256.0	6508.0	4651.0
P_coloniale	418.0	324.0	238.0	239.0	357.0	484.0	485.0	309.0	533.0	443.0	442.0	408.0	538.0	232.0	0.0	69.0	243.0	215.0	345.0	24.0	388.0	485.0	483.0	430.0	169.0
P_margaritaceum	14752.0	11853.0	10417.0	11031.0	14328.0	16581.0	15674.0	14962.0	19959.0	19003.0	17196.0	12583.0	12510.0	10477.0	14808.0	0.0	8643.0	10355.0	13528.0	821.0	15377.0	18644.0	18807.0	17225.0	7724.0
P_patens	9560.0	5822.0	4559.0	4953.0	7681.0	8255.0	7459.0	5798.0	10182.0	8881.0	11036.0	6217.0	6029.0	4956.0	7444.0	1371.0	0.0	4686.0	8065.0	426.0	7348.0	8934.0	9067.0	8143.0	3216.0
S_lycopersicum	7695.0	5059.0	6217.0	5508.0	6534.0	7246.0	6818.0	4894.0	8866.0	8011.0	8964.0	5563.0	5239.0	5506.0	7215.0	1607.0	3382.0	0.0	7343.0	543.0	6433.0	7624.0	8080.0	6976.0	3645.0
S_moellendorffii	4518.0	3176.0	2229.0	2432.0	3425.0	4402.0	3877.0	2705.0	5003.0	3973.0	4537.0	3194.0	3086.0	2400.0	4285.0	681.0	2290.0	2253.0	0.0	228.0	3394.0	4010.0	4010.0	3599.0	1663.0
S_muscicola	13013.0	10369.0	9250.0	9688.0	12154.0	13702.0	12488.0	10818.0	17019.0	15335.0	15136.0	10314.0	10030.0	9322.0	11532.0	2281.0	8114.0	9177.0	11426.0	0.0	12971.0	15824.0	15806.0	14277.0	6843.0
Z_circumcarinatum_SAG698_1a	4374.0	2804.0	1646.0	1854.0	2481.0	3506.0	3031.0	3384.0	4100.0	3639.0	4031.0	2162.0	2594.0	1551.0	3587.0	944.0	2376.0	1723.0	2488.0	682.0	0.0	4212.0	3921.0	3703.0	1254.0
Z_circumcarinatum_SAG698_1b	755.0	535.0	331.0	364.0	709.0	865.0	878.0	563.0	1261.0	902.0	778.0	577.0	868.0	337.0	1115.0	176.0	394.0	362.0	508.0	103.0	699.0	0.0	2027.0	1455.0	284.0
Z_circumcarinatum_UTEX1559	1429.0	1188.0	938.0	991.0	1412.0	1771.0	1690.0	1237.0	2195.0	1848.0	1672.0	1203.0	1330.0	918.0	1950.0	325.0	908.0	967.0	1193.0	143.0	1564.0	2325.0	0.0	2103.0	719.0
Z_circumcarinatum_UTEX1560	2294.0	1821.0	1529.0	1639.0	2216.0	2696.0	2636.0	1979.0	3353.0	2827.0	2705.0	1925.0	1993.0	1503.0	2696.0	503.0	1441.0	1492.0	1911.0	181.0	2626.0	3574.0	3672.0	0.0	1122.0
Z_mays	11499.0	7886.0	8879.0	15584.0	9736.0	10664.0	9731.0	7584.0	13148.0	11581.0	13189.0	8044.0	7566.0	14877.0	10053.0	2188.0	4760.0	9222.0	10456.0	573.0	9394.0	11330.0	11470.0	10362.0	0.0
