nodeName	altName	nodeAttr[nodesPresent, ]
Pp3c1_10010V3	NA	blue
Pp3c1_10830V3	NA	blue
Pp3c1_11070V3	NA	blue
Pp3c1_1160V3	NA	blue
Pp3c1_12370V3	NA	blue
Pp3c1_1330V3	NA	blue
Pp3c1_14120V3	NA	blue
Pp3c1_14330V3	NA	blue
Pp3c1_14750V3	NA	blue
Pp3c1_14910V3	NA	blue
Pp3c1_15110V3	NA	blue
Pp3c1_15220V3	NA	blue
Pp3c1_15390V3	NA	blue
Pp3c1_15490V3	NA	blue
Pp3c1_15560V3	NA	blue
Pp3c1_17220V3	NA	blue
Pp3c1_18390V3	NA	blue
Pp3c1_18470V3	NA	blue
Pp3c1_18860V3	NA	blue
Pp3c1_20230V3	NA	blue
Pp3c1_21120V3	NA	blue
Pp3c1_21530V3	NA	blue
Pp3c1_21660V3	NA	blue
Pp3c1_21740V3	NA	blue
Pp3c1_22130V3	NA	blue
Pp3c1_22180V3	NA	blue
Pp3c1_22450V3	NA	blue
Pp3c1_23370V3	NA	blue
Pp3c1_23520V3	NA	blue
Pp3c1_24570V3	NA	blue
Pp3c1_25660V3	NA	blue
Pp3c1_25950V3	NA	blue
Pp3c1_26270V3	NA	blue
Pp3c1_26750V3	NA	blue
Pp3c1_26980V3	NA	blue
Pp3c1_27170V3	NA	blue
Pp3c1_27180V3	NA	blue
Pp3c1_27360V3	NA	blue
Pp3c1_27970V3	NA	blue
Pp3c1_28010V3	NA	blue
Pp3c1_28200V3	NA	blue
Pp3c1_28930V3	NA	blue
Pp3c1_29390V3	NA	blue
Pp3c1_29830V3	NA	blue
Pp3c1_3040V3	NA	blue
Pp3c1_30660V3	NA	blue
Pp3c1_30970V3	NA	blue
Pp3c1_31230V3	NA	blue
Pp3c1_31680V3	NA	blue
Pp3c1_32020V3	NA	blue
Pp3c1_32300V3	NA	blue
Pp3c1_33500V3	NA	blue
Pp3c1_33530V3	NA	blue
Pp3c1_34410V3	NA	blue
Pp3c1_35350V3	NA	blue
Pp3c1_35770V3	NA	blue
Pp3c1_36000V3	NA	blue
Pp3c1_36280V3	NA	blue
Pp3c1_36370V3	NA	blue
Pp3c1_37278V3	NA	blue
Pp3c1_37320V3	NA	blue
Pp3c1_37710V3	NA	blue
Pp3c1_38030V3	NA	blue
Pp3c1_38250V3	NA	blue
Pp3c1_38440V3	NA	blue
Pp3c1_38630V3	NA	blue
Pp3c1_38750V3	NA	blue
Pp3c1_38880V3	NA	blue
Pp3c1_3890V3	NA	blue
Pp3c1_39250V3	NA	blue
Pp3c1_39910V3	NA	blue
Pp3c1_39920V3	NA	blue
Pp3c1_40270V3	NA	blue
Pp3c1_4090V3	NA	blue
Pp3c1_41090V3	NA	blue
Pp3c1_41400V3	NA	blue
Pp3c1_42010V3	NA	blue
Pp3c1_4260V3	NA	blue
Pp3c1_42870V3	NA	blue
Pp3c1_43050V3	NA	blue
Pp3c1_4350V3	NA	blue
Pp3c1_4600V3	NA	blue
Pp3c1_5300V3	NA	blue
Pp3c1_5570V3	NA	blue
Pp3c1_6110V3	NA	blue
Pp3c1_6360V3	NA	blue
Pp3c1_6990V3	NA	blue
Pp3c1_7380V3	NA	blue
Pp3c1_7460V3	NA	blue
Pp3c1_8270V3	NA	blue
Pp3c1_8530V3	NA	blue
Pp3c1_890V3	NA	blue
Pp3c1_900V3	NA	blue
Pp3c1_9790V3	NA	blue
Pp3c1_9860V3	NA	blue
Pp3c10_10240V3	NA	blue
Pp3c10_11210V3	NA	blue
Pp3c10_11280V3	NA	blue
Pp3c10_12270V3	NA	blue
Pp3c10_12280V3	NA	blue
Pp3c10_12450V3	NA	blue
Pp3c10_12740V3	NA	blue
Pp3c10_13240V3	NA	blue
Pp3c10_13600V3	NA	blue
Pp3c10_15140V3	NA	blue
Pp3c10_15380V3	NA	blue
Pp3c10_15900V3	NA	blue
Pp3c10_15980V3	NA	blue
Pp3c10_16170V3	NA	blue
Pp3c10_16540V3	NA	blue
Pp3c10_17110V3	NA	blue
Pp3c10_18670V3	NA	blue
Pp3c10_1880V3	NA	blue
Pp3c10_18970V3	NA	blue
Pp3c10_19240V3	NA	blue
Pp3c10_19260V3	NA	blue
Pp3c10_19570V3	NA	blue
Pp3c10_19630V3	NA	blue
Pp3c10_21170V3	NA	blue
Pp3c10_22760V3	NA	blue
Pp3c10_22780V3	NA	blue
Pp3c10_22900V3	NA	blue
Pp3c10_23080V3	NA	blue
Pp3c10_230V3	NA	blue
Pp3c10_23140V3	NA	blue
Pp3c10_24280V3	NA	blue
Pp3c10_25760V3	NA	blue
Pp3c10_25830V3	NA	blue
Pp3c10_2600V3	NA	blue
Pp3c10_3130V3	NA	blue
Pp3c10_3720V3	NA	blue
Pp3c10_380V3	NA	blue
Pp3c10_4250V3	NA	blue
Pp3c10_4910V3	NA	blue
Pp3c10_5020V3	NA	blue
Pp3c10_5130V3	NA	blue
Pp3c10_5410V3	NA	blue
Pp3c10_640V3	NA	blue
Pp3c10_6770V3	NA	blue
Pp3c10_6810V3	NA	blue
Pp3c10_6970V3	NA	blue
Pp3c10_6980V3	NA	blue
Pp3c10_7010V3	NA	blue
Pp3c10_7470V3	NA	blue
Pp3c10_7720V3	NA	blue
Pp3c10_8000V3	NA	blue
Pp3c10_8220V3	NA	blue
Pp3c10_8870V3	NA	blue
Pp3c10_9330V3	NA	blue
Pp3c10_9630V3	NA	blue
Pp3c10_9990V3	NA	blue
Pp3c11_10350V3	NA	blue
Pp3c11_10680V3	NA	blue
Pp3c11_11990V3	NA	blue
Pp3c11_1230V3	NA	blue
Pp3c11_12310V3	NA	blue
Pp3c11_12600V3	NA	blue
Pp3c11_13640V3	NA	blue
Pp3c11_14950V3	NA	blue
Pp3c11_16200V3	NA	blue
Pp3c11_17610V3	NA	blue
Pp3c11_18380V3	NA	blue
Pp3c11_18580V3	NA	blue
Pp3c11_18610V3	NA	blue
Pp3c11_18640V3	NA	blue
Pp3c11_18720V3	NA	blue
Pp3c11_19710V3	NA	blue
Pp3c11_20220V3	NA	blue
Pp3c11_2120V3	NA	blue
Pp3c11_21430V3	NA	blue
Pp3c11_21580V3	NA	blue
Pp3c11_2170V3	NA	blue
Pp3c11_22600V3	NA	blue
Pp3c11_22720V3	NA	blue
Pp3c11_23240V3	NA	blue
Pp3c11_23340V3	NA	blue
Pp3c11_23680V3	NA	blue
Pp3c11_23720V3	NA	blue
Pp3c11_23930V3	NA	blue
Pp3c11_24230V3	NA	blue
Pp3c11_24240V3	NA	blue
Pp3c11_24700V3	NA	blue
Pp3c11_24870V3	NA	blue
Pp3c11_25080V3	NA	blue
Pp3c11_25340V3	NA	blue
Pp3c11_25640V3	NA	blue
Pp3c11_25650V3	NA	blue
Pp3c11_25820V3	NA	blue
Pp3c11_25840V3	NA	blue
Pp3c11_25890V3	NA	blue
Pp3c11_26710V3	NA	blue
Pp3c11_26750V3	NA	blue
Pp3c11_2790V3	NA	blue
Pp3c11_2880V3	NA	blue
Pp3c11_2920V3	NA	blue
Pp3c11_2970V3	NA	blue
Pp3c11_4850V3	NA	blue
Pp3c11_6350V3	NA	blue
Pp3c11_6560V3	NA	blue
Pp3c11_6580V3	NA	blue
Pp3c11_6640V3	NA	blue
Pp3c11_8260V3	NA	blue
Pp3c11_830V3	NA	blue
Pp3c11_8780V3	NA	blue
Pp3c11_9520V3	NA	blue
Pp3c12_10250V3	NA	blue
Pp3c12_10460V3	NA	blue
Pp3c12_11280V3	NA	blue
Pp3c12_12140V3	NA	blue
Pp3c12_12990V3	NA	blue
Pp3c12_13250V3	NA	blue
Pp3c12_14030V3	NA	blue
Pp3c12_14500V3	NA	blue
Pp3c12_14910V3	NA	blue
Pp3c12_16120V3	NA	blue
Pp3c12_1640V3	NA	blue
Pp3c12_16620V3	NA	blue
Pp3c12_17000V3	NA	blue
Pp3c12_17410V3	NA	blue
Pp3c12_17420V3	NA	blue
Pp3c12_18260V3	NA	blue
Pp3c12_1850V3	NA	blue
Pp3c12_18750V3	NA	blue
Pp3c12_190V3	NA	blue
Pp3c12_20160V3	NA	blue
Pp3c12_20510V3	NA	blue
Pp3c12_20620V3	NA	blue
Pp3c12_22070V3	NA	blue
Pp3c12_22290V3	NA	blue
Pp3c12_22440V3	NA	blue
Pp3c12_22500V3	NA	blue
Pp3c12_22830V3	NA	blue
Pp3c12_23480V3	NA	blue
Pp3c12_23520V3	NA	blue
Pp3c12_23720V3	NA	blue
Pp3c12_23740V3	NA	blue
Pp3c12_2390V3	NA	blue
Pp3c12_24590V3	NA	blue
Pp3c12_24970V3	NA	blue
Pp3c12_25000V3	NA	blue
Pp3c12_26190V3	NA	blue
Pp3c12_3220V3	NA	blue
Pp3c12_3620V3	NA	blue
Pp3c12_4560V3	NA	blue
Pp3c12_6460V3	NA	blue
Pp3c12_6510V3	NA	blue
Pp3c12_660V3	NA	blue
Pp3c12_7550V3	NA	blue
Pp3c12_7620V3	NA	blue
Pp3c12_8120V3	NA	blue
Pp3c12_8190V3	NA	blue
Pp3c12_8550V3	NA	blue
Pp3c12_9330V3	NA	blue
Pp3c12_9350V3	NA	blue
Pp3c12_9500V3	NA	blue
Pp3c12_9640V3	NA	blue
Pp3c12_9830V3	NA	blue
Pp3c12_9890V3	NA	blue
Pp3c13_10420V3	NA	blue
Pp3c13_10500V3	NA	blue
Pp3c13_11410V3	NA	blue
Pp3c13_12520V3	NA	blue
Pp3c13_12620V3	NA	blue
Pp3c13_1360V3	NA	blue
Pp3c13_13940V3	NA	blue
Pp3c13_15000V3	NA	blue
Pp3c13_15890V3	NA	blue
Pp3c13_16630V3	NA	blue
Pp3c13_16700V3	NA	blue
Pp3c13_16820V3	NA	blue
Pp3c13_17120V3	NA	blue
Pp3c13_1900V3	NA	blue
Pp3c13_19440V3	NA	blue
Pp3c13_19680V3	NA	blue
Pp3c13_19740V3	NA	blue
Pp3c13_19950V3	NA	blue
Pp3c13_23570V3	NA	blue
Pp3c13_24540V3	NA	blue
Pp3c13_4190V3	NA	blue
Pp3c13_4400V3	NA	blue
Pp3c13_6130V3	NA	blue
Pp3c13_6210V3	NA	blue
Pp3c13_7410V3	NA	blue
Pp3c13_7510V3	NA	blue
Pp3c13_7750V3	NA	blue
Pp3c13_7880V3	NA	blue
Pp3c13_8060V3	NA	blue
Pp3c13_8320V3	NA	blue
Pp3c13_8400V3	NA	blue
Pp3c13_8670V3	NA	blue
Pp3c13_8720V3	NA	blue
Pp3c13_8820V3	NA	blue
Pp3c13_8870V3	NA	blue
Pp3c13_8930V3	NA	blue
Pp3c13_910V3	NA	blue
Pp3c14_10510V3	NA	blue
Pp3c14_11490V3	NA	blue
Pp3c14_11740V3	NA	blue
Pp3c14_11830V3	NA	blue
Pp3c14_12030V3	NA	blue
Pp3c14_12090V3	NA	blue
Pp3c14_12270V3	NA	blue
Pp3c14_12310V3	NA	blue
Pp3c14_12590V3	NA	blue
Pp3c14_14040V3	NA	blue
Pp3c14_14050V3	NA	blue
Pp3c14_140V3	NA	blue
Pp3c14_14860V3	NA	blue
Pp3c14_15170V3	NA	blue
Pp3c14_15790V3	NA	blue
Pp3c14_16830V3	NA	blue
Pp3c14_16910V3	NA	blue
Pp3c14_17150V3	NA	blue
Pp3c14_17210V3	NA	blue
Pp3c14_17330V3	NA	blue
Pp3c14_17403V3	NA	blue
Pp3c14_17710V3	NA	blue
Pp3c14_17740V3	NA	blue
Pp3c14_17810V3	NA	blue
Pp3c14_18180V3	NA	blue
Pp3c14_19700V3	NA	blue
Pp3c14_20020V3	NA	blue
Pp3c14_20420V3	NA	blue
Pp3c14_20740V3	NA	blue
Pp3c14_20870V3	NA	blue
Pp3c14_22050V3	NA	blue
Pp3c14_22160V3	NA	blue
Pp3c14_22340V3	NA	blue
Pp3c14_22510V3	NA	blue
Pp3c14_22810V3	NA	blue
Pp3c14_23100V3	NA	blue
Pp3c14_23400V3	NA	blue
Pp3c14_23410V3	NA	blue
Pp3c14_23570V3	NA	blue
Pp3c14_23720V3	NA	blue
Pp3c14_2440V3	NA	blue
Pp3c14_24560V3	NA	blue
Pp3c14_24690V3	NA	blue
Pp3c14_25130V3	NA	blue
Pp3c14_25570V3	NA	blue
Pp3c14_26050V3	NA	blue
Pp3c14_26140V3	NA	blue
Pp3c14_26340V3	NA	blue
Pp3c14_26600V3	NA	blue
Pp3c14_26790V3	NA	blue
Pp3c14_2780V3	NA	blue
Pp3c14_3090V3	NA	blue
Pp3c14_3830V3	NA	blue
Pp3c14_3850V3	NA	blue
Pp3c14_4200V3	NA	blue
Pp3c14_4820V3	NA	blue
Pp3c14_5150V3	NA	blue
Pp3c14_5280V3	NA	blue
Pp3c14_5730V3	NA	blue
Pp3c14_5780V3	NA	blue
Pp3c14_5800V3	NA	blue
Pp3c14_6070V3	NA	blue
Pp3c14_6250V3	NA	blue
Pp3c14_6330V3	NA	blue
Pp3c14_7210V3	NA	blue
Pp3c14_8280V3	NA	blue
Pp3c14_8410V3	NA	blue
Pp3c14_8740V3	NA	blue
Pp3c14_9100V3	NA	blue
Pp3c15_10030V3	NA	blue
Pp3c15_10770V3	NA	blue
Pp3c15_10850V3	NA	blue
Pp3c15_10930V3	NA	blue
Pp3c15_11070V3	NA	blue
Pp3c15_11750V3	NA	blue
Pp3c15_12240V3	NA	blue
Pp3c15_12420V3	NA	blue
Pp3c15_1370V3	NA	blue
Pp3c15_1410V3	NA	blue
Pp3c15_14240V3	NA	blue
Pp3c15_14630V3	NA	blue
Pp3c15_16120V3	NA	blue
Pp3c15_170V3	NA	blue
Pp3c15_17560V3	NA	blue
Pp3c15_17690V3	NA	blue
Pp3c15_18160V3	NA	blue
Pp3c15_19030V3	NA	blue
Pp3c15_19180V3	NA	blue
Pp3c15_1990V3	NA	blue
Pp3c15_200V3	NA	blue
Pp3c15_20540V3	NA	blue
Pp3c15_20640V3	NA	blue
Pp3c15_21130V3	NA	blue
Pp3c15_21140V3	NA	blue
Pp3c15_22112V3	NA	blue
Pp3c15_22190V3	NA	blue
Pp3c15_22730V3	NA	blue
Pp3c15_22960V3	NA	blue
Pp3c15_23520V3	NA	blue
Pp3c15_23530V3	NA	blue
Pp3c15_23870V3	NA	blue
Pp3c15_23960V3	NA	blue
Pp3c15_25170V3	NA	blue
Pp3c15_25330V3	NA	blue
Pp3c15_25560V3	NA	blue
Pp3c15_25940V3	NA	blue
Pp3c15_2800V3	NA	blue
Pp3c15_2850V3	NA	blue
Pp3c15_3110V3	NA	blue
Pp3c15_3340V3	NA	blue
Pp3c15_4060V3	NA	blue
Pp3c15_4200V3	NA	blue
Pp3c15_4210V3	NA	blue
Pp3c15_5020V3	NA	blue
Pp3c15_5590V3	NA	blue
Pp3c15_6540V3	NA	blue
Pp3c15_8230V3	NA	blue
Pp3c15_8358V3	NA	blue
Pp3c15_8520V3	NA	blue
Pp3c15_8550V3	NA	blue
Pp3c15_9100V3	NA	blue
Pp3c15_9140V3	NA	blue
Pp3c16_10130V3	NA	blue
Pp3c16_1020V3	NA	blue
Pp3c16_10240V3	NA	blue
Pp3c16_10250V3	NA	blue
Pp3c16_10320V3	NA	blue
Pp3c16_10580V3	NA	blue
Pp3c16_1070V3	NA	blue
Pp3c16_11700V3	NA	blue
Pp3c16_11740V3	NA	blue
Pp3c16_12240V3	NA	blue
Pp3c16_1230V3	NA	blue
Pp3c16_12310V3	NA	blue
Pp3c16_12870V3	NA	blue
Pp3c16_12920V3	NA	blue
Pp3c16_12990V3	NA	blue
Pp3c16_1350V3	NA	blue
Pp3c16_13830V3	NA	blue
Pp3c16_13851V3	NA	blue
Pp3c16_14030V3	NA	blue
Pp3c16_14110V3	NA	blue
Pp3c16_14910V3	NA	blue
Pp3c16_15040V3	NA	blue
Pp3c16_15270V3	NA	blue
Pp3c16_16060V3	NA	blue
Pp3c16_16120V3	NA	blue
Pp3c16_16500V3	NA	blue
Pp3c16_16680V3	NA	blue
Pp3c16_1670V3	NA	blue
Pp3c16_16760V3	NA	blue
Pp3c16_16950V3	NA	blue
Pp3c16_17780V3	NA	blue
Pp3c16_18590V3	NA	blue
Pp3c16_2080V3	NA	blue
Pp3c16_20850V3	NA	blue
Pp3c16_20890V3	NA	blue
Pp3c16_22650V3	NA	blue
Pp3c16_24350V3	NA	blue
Pp3c16_24530V3	NA	blue
Pp3c16_25520V3	NA	blue
Pp3c16_2830V3	NA	blue
Pp3c16_3750V3	NA	blue
Pp3c16_5230V3	NA	blue
Pp3c16_5240V3	NA	blue
Pp3c16_550V3	NA	blue
Pp3c16_5890V3	NA	blue
Pp3c16_6080V3	NA	blue
Pp3c16_6370V3	NA	blue
Pp3c16_6440V3	NA	blue
Pp3c16_6520V3	NA	blue
Pp3c16_6690V3	NA	blue
Pp3c16_6720V3	NA	blue
Pp3c16_680V3	NA	blue
Pp3c16_6920V3	NA	blue
Pp3c16_7000V3	NA	blue
Pp3c16_7490V3	NA	blue
Pp3c16_7630V3	NA	blue
Pp3c16_7870V3	NA	blue
Pp3c16_8270V3	NA	blue
Pp3c16_880V3	NA	blue
Pp3c17_10150V3	NA	blue
Pp3c17_10760V3	NA	blue
Pp3c17_11070V3	NA	blue
Pp3c17_11300V3	NA	blue
Pp3c17_11510V3	NA	blue
Pp3c17_11550V3	NA	blue
Pp3c17_12000V3	NA	blue
Pp3c17_1300V3	NA	blue
Pp3c17_13330V3	NA	blue
Pp3c17_13420V3	NA	blue
Pp3c17_13570V3	NA	blue
Pp3c17_13630V3	NA	blue
Pp3c17_13880V3	NA	blue
Pp3c17_14090V3	NA	blue
Pp3c17_15920V3	NA	blue
Pp3c17_16180V3	NA	blue
Pp3c17_16690V3	NA	blue
Pp3c17_16790V3	NA	blue
Pp3c17_16900V3	NA	blue
Pp3c17_16910V3	NA	blue
Pp3c17_17000V3	NA	blue
Pp3c17_17040V3	NA	blue
Pp3c17_17150V3	NA	blue
Pp3c17_17420V3	NA	blue
Pp3c17_17770V3	NA	blue
Pp3c17_1780V3	NA	blue
Pp3c17_17840V3	NA	blue
Pp3c17_18010V3	NA	blue
Pp3c17_18250V3	NA	blue
Pp3c17_18410V3	NA	blue
Pp3c17_18640V3	NA	blue
Pp3c17_19090V3	NA	blue
Pp3c17_19110V3	NA	blue
Pp3c17_19290V3	NA	blue
Pp3c17_19570V3	NA	blue
Pp3c17_19630V3	NA	blue
Pp3c17_19810V3	NA	blue
Pp3c17_19900V3	NA	blue
Pp3c17_20400V3	NA	blue
Pp3c17_20550V3	NA	blue
Pp3c17_22570V3	NA	blue
Pp3c17_22760V3	NA	blue
Pp3c17_23300V3	NA	blue
Pp3c17_2340V3	NA	blue
Pp3c17_2480V3	NA	blue
Pp3c17_2880V3	NA	blue
Pp3c17_3180V3	NA	blue
Pp3c17_3830V3	NA	blue
Pp3c17_5920V3	NA	blue
Pp3c17_5990V3	NA	blue
Pp3c17_7560V3	NA	blue
Pp3c17_7790V3	NA	blue
Pp3c17_7930V3	NA	blue
Pp3c17_8050V3	NA	blue
Pp3c17_80V3	NA	blue
Pp3c17_930V3	NA	blue
Pp3c17_9890V3	NA	blue
Pp3c18_10000V3	NA	blue
Pp3c18_11300V3	NA	blue
Pp3c18_11500V3	NA	blue
Pp3c18_12130V3	NA	blue
Pp3c18_12190V3	NA	blue
Pp3c18_12670V3	NA	blue
Pp3c18_12780V3	NA	blue
Pp3c18_13090V3	NA	blue
Pp3c18_13220V3	NA	blue
Pp3c18_13530V3	NA	blue
Pp3c18_14340V3	NA	blue
Pp3c18_14350V3	NA	blue
Pp3c18_14800V3	NA	blue
Pp3c18_15360V3	NA	blue
Pp3c18_16140V3	NA	blue
Pp3c18_16190V3	NA	blue
Pp3c18_1690V3	NA	blue
Pp3c18_18090V3	NA	blue
Pp3c18_18290V3	NA	blue
Pp3c18_18400V3	NA	blue
Pp3c18_18670V3	NA	blue
Pp3c18_19140V3	NA	blue
Pp3c18_19500V3	NA	blue
Pp3c18_19520V3	NA	blue
Pp3c18_19590V3	NA	blue
Pp3c18_20030V3	NA	blue
Pp3c18_200V3	NA	blue
Pp3c18_20510V3	NA	blue
Pp3c18_20600V3	NA	blue
Pp3c18_21020V3	NA	blue
Pp3c18_21210V3	NA	blue
Pp3c18_21250V3	NA	blue
Pp3c18_21360V3	NA	blue
Pp3c18_21840V3	NA	blue
Pp3c18_21960V3	NA	blue
Pp3c18_22300V3	NA	blue
Pp3c18_3220V3	NA	blue
Pp3c18_3270V3	NA	blue
Pp3c18_4320V3	NA	blue
Pp3c18_4430V3	NA	blue
Pp3c18_4800V3	NA	blue
Pp3c18_4950V3	NA	blue
Pp3c18_50V3	NA	blue
Pp3c18_6360V3	NA	blue
Pp3c18_6751V3	NA	blue
Pp3c18_6870V3	NA	blue
Pp3c18_7090V3	NA	blue
Pp3c18_8230V3	NA	blue
Pp3c18_8240V3	NA	blue
Pp3c18_8280V3	NA	blue
Pp3c18_8290V3	NA	blue
Pp3c18_9840V3	NA	blue
Pp3c18_9860V3	NA	blue
Pp3c19_10090V3	NA	blue
Pp3c19_10280V3	NA	blue
Pp3c19_10980V3	NA	blue
Pp3c19_11600V3	NA	blue
Pp3c19_11630V3	NA	blue
Pp3c19_11650V3	NA	blue
Pp3c19_12890V3	NA	blue
Pp3c19_13120V3	NA	blue
Pp3c19_13650V3	NA	blue
Pp3c19_13810V3	NA	blue
Pp3c19_14130V3	NA	blue
Pp3c19_14810V3	NA	blue
Pp3c19_1490V3	NA	blue
Pp3c19_15630V3	NA	blue
Pp3c19_16670V3	NA	blue
Pp3c19_1730V3	NA	blue
Pp3c19_18360V3	NA	blue
Pp3c19_18510V3	NA	blue
Pp3c19_1880V3	NA	blue
Pp3c19_18920V3	NA	blue
Pp3c19_19340V3	NA	blue
Pp3c19_19400V3	NA	blue
Pp3c19_19960V3	NA	blue
Pp3c19_20750V3	NA	blue
Pp3c19_21200V3	NA	blue
Pp3c19_21230V3	NA	blue
Pp3c19_2670V3	NA	blue
Pp3c19_2740V3	NA	blue
Pp3c19_2770V3	NA	blue
Pp3c19_2860V3	NA	blue
Pp3c19_3770V3	NA	blue
Pp3c19_4130V3	NA	blue
Pp3c19_4310V3	NA	blue
Pp3c19_4730V3	NA	blue
Pp3c19_4880V3	NA	blue
Pp3c19_6050V3	NA	blue
Pp3c19_6730V3	NA	blue
Pp3c19_7020V3	NA	blue
Pp3c19_7220V3	NA	blue
Pp3c19_7240V3	NA	blue
Pp3c19_7350V3	NA	blue
Pp3c19_7430V3	NA	blue
Pp3c19_7680V3	NA	blue
Pp3c19_7700V3	NA	blue
Pp3c19_8230V3	NA	blue
Pp3c19_8700V3	NA	blue
Pp3c2_10100V3	NA	blue
Pp3c2_11360V3	NA	blue
Pp3c2_12620V3	NA	blue
Pp3c2_1270V3	NA	blue
Pp3c2_1280V3	NA	blue
Pp3c2_13140V3	NA	blue
Pp3c2_13270V3	NA	blue
Pp3c2_14430V3	NA	blue
Pp3c2_15400V3	NA	blue
Pp3c2_16770V3	NA	blue
Pp3c2_17090V3	NA	blue
Pp3c2_17980V3	NA	blue
Pp3c2_18140V3	NA	blue
Pp3c2_18480V3	NA	blue
Pp3c2_18540V3	NA	blue
Pp3c2_19940V3	NA	blue
Pp3c2_200V3	NA	blue
Pp3c2_20320V3	NA	blue
Pp3c2_21250V3	NA	blue
Pp3c2_21310V3	NA	blue
Pp3c2_21370V3	NA	blue
Pp3c2_21590V3	NA	blue
Pp3c2_21760V3	NA	blue
Pp3c2_21780V3	NA	blue
Pp3c2_22000V3	NA	blue
Pp3c2_22070V3	NA	blue
Pp3c2_220V3	NA	blue
Pp3c2_23140V3	NA	blue
Pp3c2_23200V3	NA	blue
Pp3c2_23210V3	NA	blue
Pp3c2_23830V3	NA	blue
Pp3c2_23840V3	NA	blue
Pp3c2_23890V3	NA	blue
Pp3c2_24120V3	NA	blue
Pp3c2_24150V3	NA	blue
Pp3c2_24640V3	NA	blue
Pp3c2_24670V3	NA	blue
Pp3c2_25170V3	NA	blue
Pp3c2_25970V3	NA	blue
Pp3c2_26110V3	NA	blue
Pp3c2_26540V3	NA	blue
Pp3c2_26700V3	NA	blue
Pp3c2_27330V3	NA	blue
Pp3c2_27590V3	NA	blue
Pp3c2_2760V3	NA	blue
Pp3c2_28420V3	NA	blue
Pp3c2_28440V3	NA	blue
Pp3c2_28590V3	NA	blue
Pp3c2_29040V3	NA	blue
Pp3c2_29140V3	NA	blue
Pp3c2_29430V3	NA	blue
Pp3c2_2980V3	NA	blue
Pp3c2_30390V3	NA	blue
Pp3c2_30720V3	NA	blue
Pp3c2_30980V3	NA	blue
Pp3c2_32100V3	NA	blue
Pp3c2_33000V3	NA	blue
Pp3c2_33420V3	NA	blue
Pp3c2_33530V3	NA	blue
Pp3c2_3370V3	NA	blue
Pp3c2_33790V3	NA	blue
Pp3c2_34930V3	NA	blue
Pp3c2_35433V3	NA	blue
Pp3c2_35640V3	NA	blue
Pp3c2_35910V3	NA	blue
Pp3c2_35950V3	NA	blue
Pp3c2_36080V3	NA	blue
Pp3c2_360V3	NA	blue
Pp3c2_36840V3	NA	blue
Pp3c2_37310V3	NA	blue
Pp3c2_38010V3	NA	blue
Pp3c2_5310V3	NA	blue
Pp3c2_5530V3	NA	blue
Pp3c2_5560V3	NA	blue
Pp3c2_6650V3	NA	blue
Pp3c2_6750V3	NA	blue
Pp3c2_6800V3	NA	blue
Pp3c2_7230V3	NA	blue
Pp3c2_7850V3	NA	blue
Pp3c2_7940V3	NA	blue
Pp3c2_8410V3	NA	blue
Pp3c2_8420V3	NA	blue
Pp3c2_8880V3	NA	blue
Pp3c2_9200V3	NA	blue
Pp3c2_9350V3	NA	blue
Pp3c20_11340V3	NA	blue
Pp3c20_12300V3	NA	blue
Pp3c20_12670V3	NA	blue
Pp3c20_12770V3	NA	blue
Pp3c20_13303V3	NA	blue
Pp3c20_16550V3	NA	blue
Pp3c20_16950V3	NA	blue
Pp3c20_16980V3	NA	blue
Pp3c20_17250V3	NA	blue
Pp3c20_17290V3	NA	blue
Pp3c20_17570V3	NA	blue
Pp3c20_18210V3	NA	blue
Pp3c20_18250V3	NA	blue
Pp3c20_2130V3	NA	blue
Pp3c20_22080V3	NA	blue
Pp3c20_22440V3	NA	blue
Pp3c20_22450V3	NA	blue
Pp3c20_22500V3	NA	blue
Pp3c20_22730V3	NA	blue
Pp3c20_22830V3	NA	blue
Pp3c20_23430V3	NA	blue
Pp3c20_2350V3	NA	blue
Pp3c20_23560V3	NA	blue
Pp3c20_23570V3	NA	blue
Pp3c20_23930V3	NA	blue
Pp3c20_2420V3	NA	blue
Pp3c20_2980V3	NA	blue
Pp3c20_3140V3	NA	blue
Pp3c20_5750V3	NA	blue
Pp3c20_6140V3	NA	blue
Pp3c20_6190V3	NA	blue
Pp3c20_6830V3	NA	blue
Pp3c20_6850V3	NA	blue
Pp3c20_7050V3	NA	blue
Pp3c20_727V3	NA	blue
Pp3c20_7850V3	NA	blue
Pp3c20_8270V3	NA	blue
Pp3c20_8330V3	NA	blue
Pp3c20_8530V3	NA	blue
Pp3c20_9200V3	NA	blue
Pp3c21_10290V3	NA	blue
Pp3c21_10970V3	NA	blue
Pp3c21_11840V3	NA	blue
Pp3c21_12020V3	NA	blue
Pp3c21_13710V3	NA	blue
Pp3c21_14450V3	NA	blue
Pp3c21_14540V3	NA	blue
Pp3c21_14550V3	NA	blue
Pp3c21_14930V3	NA	blue
Pp3c21_14940V3	NA	blue
Pp3c21_16170V3	NA	blue
Pp3c21_16490V3	NA	blue
Pp3c21_17170V3	NA	blue
Pp3c21_17450V3	NA	blue
Pp3c21_17500V3	NA	blue
Pp3c21_17550V3	NA	blue
Pp3c21_18240V3	NA	blue
Pp3c21_19830V3	NA	blue
Pp3c21_20640V3	NA	blue
Pp3c21_22170V3	NA	blue
Pp3c21_22610V3	NA	blue
Pp3c21_2290V3	NA	blue
Pp3c21_243V3	NA	blue
Pp3c21_270V3	NA	blue
Pp3c21_4710V3	NA	blue
Pp3c21_5260V3	NA	blue
Pp3c21_5280V3	NA	blue
Pp3c21_5430V3	NA	blue
Pp3c21_5560V3	NA	blue
Pp3c21_6410V3	NA	blue
Pp3c21_6450V3	NA	blue
Pp3c21_6740V3	NA	blue
Pp3c21_6820V3	NA	blue
Pp3c21_6850V3	NA	blue
Pp3c21_8200V3	NA	blue
Pp3c21_8340V3	NA	blue
Pp3c21_8650V3	NA	blue
Pp3c21_9030V3	NA	blue
Pp3c21_9280V3	NA	blue
Pp3c22_11040V3	NA	blue
Pp3c22_11240V3	NA	blue
Pp3c22_11760V3	NA	blue
Pp3c22_1230V3	NA	blue
Pp3c22_12930V3	NA	blue
Pp3c22_13970V3	NA	blue
Pp3c22_14060V3	NA	blue
Pp3c22_14790V3	NA	blue
Pp3c22_15340V3	NA	blue
Pp3c22_15420V3	NA	blue
Pp3c22_17090V3	NA	blue
Pp3c22_17340V3	NA	blue
Pp3c22_1930V3	NA	blue
Pp3c22_21030V3	NA	blue
Pp3c22_21270V3	NA	blue
Pp3c22_21400V3	NA	blue
Pp3c22_21870V3	NA	blue
Pp3c22_22050V3	NA	blue
Pp3c22_22930V3	NA	blue
Pp3c22_2370V3	NA	blue
Pp3c22_4170V3	NA	blue
Pp3c22_4480V3	NA	blue
Pp3c22_4620V3	NA	blue
Pp3c22_5470V3	NA	blue
Pp3c22_5980V3	NA	blue
Pp3c22_6000V3	NA	blue
Pp3c22_6120V3	NA	blue
Pp3c22_6140V3	NA	blue
Pp3c22_630V3	NA	blue
Pp3c22_6760V3	NA	blue
Pp3c22_7200V3	NA	blue
Pp3c22_7290V3	NA	blue
Pp3c22_7510V3	NA	blue
Pp3c22_7650V3	NA	blue
Pp3c22_7690V3	NA	blue
Pp3c22_8010V3	NA	blue
Pp3c22_8300V3	NA	blue
Pp3c22_8800V3	NA	blue
Pp3c22_9340V3	NA	blue
Pp3c23_10010V3	NA	blue
Pp3c23_10780V3	NA	blue
Pp3c23_1080V3	NA	blue
Pp3c23_11120V3	NA	blue
Pp3c23_11170V3	NA	blue
Pp3c23_1160V3	NA	blue
Pp3c23_11620V3	NA	blue
Pp3c23_11640V3	NA	blue
Pp3c23_12600V3	NA	blue
Pp3c23_12650V3	NA	blue
Pp3c23_12760V3	NA	blue
Pp3c23_13490V3	NA	blue
Pp3c23_1379V3	NA	blue
Pp3c23_1470V3	NA	blue
Pp3c23_15450V3	NA	blue
Pp3c23_16310V3	NA	blue
Pp3c23_16910V3	NA	blue
Pp3c23_17660V3	NA	blue
Pp3c23_18090V3	NA	blue
Pp3c23_1810V3	NA	blue
Pp3c23_18410V3	NA	blue
Pp3c23_19130V3	NA	blue
Pp3c23_19210V3	NA	blue
Pp3c23_19710V3	NA	blue
Pp3c23_20800V3	NA	blue
Pp3c23_21930V3	NA	blue
Pp3c23_22360V3	NA	blue
Pp3c23_3390V3	NA	blue
Pp3c23_380V3	NA	blue
Pp3c23_4510V3	NA	blue
Pp3c23_5870V3	NA	blue
Pp3c23_5970V3	NA	blue
Pp3c23_6090V3	NA	blue
Pp3c23_6560V3	NA	blue
Pp3c23_7400V3	NA	blue
Pp3c23_7830V3	NA	blue
Pp3c23_8620V3	NA	blue
Pp3c23_8640V3	NA	blue
Pp3c23_9030V3	NA	blue
Pp3c23_9240V3	NA	blue
Pp3c23_9730V3	NA	blue
Pp3c23_9990V3	NA	blue
Pp3c24_10460V3	NA	blue
Pp3c24_11660V3	NA	blue
Pp3c24_11870V3	NA	blue
Pp3c24_12430V3	NA	blue
Pp3c24_12440V3	NA	blue
Pp3c24_12450V3	NA	blue
Pp3c24_12830V3	NA	blue
Pp3c24_1340V3	NA	blue
Pp3c24_13760V3	NA	blue
Pp3c24_14040V3	NA	blue
Pp3c24_14260V3	NA	blue
Pp3c24_15550V3	NA	blue
Pp3c24_1560V3	NA	blue
Pp3c24_16180V3	NA	blue
Pp3c24_16460V3	NA	blue
Pp3c24_16870V3	NA	blue
Pp3c24_16880V3	NA	blue
Pp3c24_17080V3	NA	blue
Pp3c24_17170V3	NA	blue
Pp3c24_17290V3	NA	blue
Pp3c24_17310V3	NA	blue
Pp3c24_17350V3	NA	blue
Pp3c24_17730V3	NA	blue
Pp3c24_17740V3	NA	blue
Pp3c24_18230V3	NA	blue
Pp3c24_1880V3	NA	blue
Pp3c24_18980V3	NA	blue
Pp3c24_19230V3	NA	blue
Pp3c24_19330V3	NA	blue
Pp3c24_20180V3	NA	blue
Pp3c24_3660V3	NA	blue
Pp3c24_4490V3	NA	blue
Pp3c24_4640V3	NA	blue
Pp3c24_4980V3	NA	blue
Pp3c24_5190V3	NA	blue
Pp3c24_5960V3	NA	blue
Pp3c24_5980V3	NA	blue
Pp3c24_6610V3	NA	blue
Pp3c24_6660V3	NA	blue
Pp3c24_7310V3	NA	blue
Pp3c24_8100V3	NA	blue
Pp3c24_8583V3	NA	blue
Pp3c24_9330V3	NA	blue
Pp3c24_9600V3	NA	blue
Pp3c24_960V3	NA	blue
Pp3c24_9660V3	NA	blue
Pp3c25_10040V3	NA	blue
Pp3c25_1010V3	NA	blue
Pp3c25_10190V3	NA	blue
Pp3c25_10320V3	NA	blue
Pp3c25_10770V3	NA	blue
Pp3c25_11910V3	NA	blue
Pp3c25_12020V3	NA	blue
Pp3c25_12260V3	NA	blue
Pp3c25_14010V3	NA	blue
Pp3c25_1440V3	NA	blue
Pp3c25_14501V3	NA	blue
Pp3c25_1450V3	NA	blue
Pp3c25_15200V3	NA	blue
Pp3c25_15260V3	NA	blue
Pp3c25_15300V3	NA	blue
Pp3c25_15330V3	NA	blue
Pp3c25_15340V3	NA	blue
Pp3c25_2010V3	NA	blue
Pp3c25_2350V3	NA	blue
Pp3c25_2420V3	NA	blue
Pp3c25_310V3	NA	blue
Pp3c25_3300V3	NA	blue
Pp3c25_3500V3	NA	blue
Pp3c25_4050V3	NA	blue
Pp3c25_4190V3	NA	blue
Pp3c25_4540V3	NA	blue
Pp3c25_4850V3	NA	blue
Pp3c25_4890V3	NA	blue
Pp3c25_5070V3	NA	blue
Pp3c25_5150V3	NA	blue
Pp3c25_5230V3	NA	blue
Pp3c25_540V3	NA	blue
Pp3c25_5600V3	NA	blue
Pp3c25_5630V3	NA	blue
Pp3c25_5940V3	NA	blue
Pp3c25_7000V3	NA	blue
Pp3c25_7010V3	NA	blue
Pp3c25_7050V3	NA	blue
Pp3c25_7380V3	NA	blue
Pp3c25_9030V3	NA	blue
Pp3c25_930V3	NA	blue
Pp3c26_10100V3	NA	blue
Pp3c26_10610V3	NA	blue
Pp3c26_10770V3	NA	blue
Pp3c26_10990V3	NA	blue
Pp3c26_1110V3	NA	blue
Pp3c26_11480V3	NA	blue
Pp3c26_12100V3	NA	blue
Pp3c26_13330V3	NA	blue
Pp3c26_13440V3	NA	blue
Pp3c26_14500V3	NA	blue
Pp3c26_14620V3	NA	blue
Pp3c26_14940V3	NA	blue
Pp3c26_15000V3	NA	blue
Pp3c26_2200V3	NA	blue
Pp3c26_280V3	NA	blue
Pp3c26_3570V3	NA	blue
Pp3c26_400V3	NA	blue
Pp3c26_4540V3	NA	blue
Pp3c26_4940V3	NA	blue
Pp3c26_5010V3	NA	blue
Pp3c26_5160V3	NA	blue
Pp3c26_6700V3	NA	blue
Pp3c26_8020V3	NA	blue
Pp3c26_8120V3	NA	blue
Pp3c26_8310V3	NA	blue
Pp3c26_8730V3	NA	blue
Pp3c26_8740V3	NA	blue
Pp3c27_1350V3	NA	blue
Pp3c27_1440V3	NA	blue
Pp3c27_1950V3	NA	blue
Pp3c27_2000V3	NA	blue
Pp3c27_2160V3	NA	blue
Pp3c27_2250V3	NA	blue
Pp3c27_2640V3	NA	blue
Pp3c27_2840V3	NA	blue
Pp3c27_3380V3	NA	blue
Pp3c27_3630V3	NA	blue
Pp3c27_4160V3	NA	blue
Pp3c27_4290V3	NA	blue
Pp3c27_4930V3	NA	blue
Pp3c27_6040V3	NA	blue
Pp3c27_6280V3	NA	blue
Pp3c27_6350V3	NA	blue
Pp3c27_6610V3	NA	blue
Pp3c27_6870V3	NA	blue
Pp3c27_7220V3	NA	blue
Pp3c27_8140V3	NA	blue
Pp3c3_10180V3	NA	blue
Pp3c3_10770V3	NA	blue
Pp3c3_11010V3	NA	blue
Pp3c3_11040V3	NA	blue
Pp3c3_11980V3	NA	blue
Pp3c3_12310V3	NA	blue
Pp3c3_13555V3	NA	blue
Pp3c3_14130V3	NA	blue
Pp3c3_14390V3	NA	blue
Pp3c3_14850V3	NA	blue
Pp3c3_16290V3	NA	blue
Pp3c3_16770V3	NA	blue
Pp3c3_16790V3	NA	blue
Pp3c3_16990V3	NA	blue
Pp3c3_17050V3	NA	blue
Pp3c3_1850V3	NA	blue
Pp3c3_18690V3	NA	blue
Pp3c3_19120V3	NA	blue
Pp3c3_19290V3	NA	blue
Pp3c3_19300V3	NA	blue
Pp3c3_19490V3	NA	blue
Pp3c3_19880V3	NA	blue
Pp3c3_20030V3	NA	blue
Pp3c3_20370V3	NA	blue
Pp3c3_20420V3	NA	blue
Pp3c3_20490V3	NA	blue
Pp3c3_20740V3	NA	blue
Pp3c3_2090V3	NA	blue
Pp3c3_20920V3	NA	blue
Pp3c3_20960V3	NA	blue
Pp3c3_21060V3	NA	blue
Pp3c3_21670V3	NA	blue
Pp3c3_21690V3	NA	blue
Pp3c3_21830V3	NA	blue
Pp3c3_22310V3	NA	blue
Pp3c3_2270V3	NA	blue
Pp3c3_22850V3	NA	blue
Pp3c3_23080V3	NA	blue
Pp3c3_23200V3	NA	blue
Pp3c3_23650V3	NA	blue
Pp3c3_23690V3	NA	blue
Pp3c3_23790V3	NA	blue
Pp3c3_23960V3	NA	blue
Pp3c3_24130V3	NA	blue
Pp3c3_24780V3	NA	blue
Pp3c3_24910V3	NA	blue
Pp3c3_24970V3	NA	blue
Pp3c3_25300V3	NA	blue
Pp3c3_25680V3	NA	blue
Pp3c3_26480V3	NA	blue
Pp3c3_26520V3	NA	blue
Pp3c3_26540V3	NA	blue
Pp3c3_26950V3	NA	blue
Pp3c3_27330V3	NA	blue
Pp3c3_27420V3	NA	blue
Pp3c3_2760V3	NA	blue
Pp3c3_27940V3	NA	blue
Pp3c3_30140V3	NA	blue
Pp3c3_30240V3	NA	blue
Pp3c3_30300V3	NA	blue
Pp3c3_3050V3	NA	blue
Pp3c3_30990V3	NA	blue
Pp3c3_31660V3	NA	blue
Pp3c3_31980V3	NA	blue
Pp3c3_32350V3	NA	blue
Pp3c3_32490V3	NA	blue
Pp3c3_33410V3	NA	blue
Pp3c3_33470V3	NA	blue
Pp3c3_33480V3	NA	blue
Pp3c3_34050V3	NA	blue
Pp3c3_3440V3	NA	blue
Pp3c3_34460V3	NA	blue
Pp3c3_36260V3	NA	blue
Pp3c3_36750V3	NA	blue
Pp3c3_38170V3	NA	blue
Pp3c3_4090V3	NA	blue
Pp3c3_4850V3	NA	blue
Pp3c3_4970V3	NA	blue
Pp3c3_5450V3	NA	blue
Pp3c3_5580V3	NA	blue
Pp3c3_5740V3	NA	blue
Pp3c3_5760V3	NA	blue
Pp3c3_5990V3	NA	blue
Pp3c3_7180V3	NA	blue
Pp3c3_7440V3	NA	blue
Pp3c3_7980V3	NA	blue
Pp3c3_8520V3	NA	blue
Pp3c3_8860V3	NA	blue
Pp3c3_8880V3	NA	blue
Pp3c3_9440V3	NA	blue
Pp3c3_9750V3	NA	blue
Pp3c3_9950V3	NA	blue
Pp3c3_9990V3	NA	blue
Pp3c4_10010V3	NA	blue
Pp3c4_10290V3	NA	blue
Pp3c4_10300V3	NA	blue
Pp3c4_10730V3	NA	blue
Pp3c4_11130V3	NA	blue
Pp3c4_11270V3	NA	blue
Pp3c4_11854V3	NA	blue
Pp3c4_13850V3	NA	blue
Pp3c4_13980V3	NA	blue
Pp3c4_14520V3	NA	blue
Pp3c4_170V3	NA	blue
Pp3c4_17200V3	NA	blue
Pp3c4_17280V3	NA	blue
Pp3c4_17380V3	NA	blue
Pp3c4_17700V3	NA	blue
Pp3c4_17920V3	NA	blue
Pp3c4_18720V3	NA	blue
Pp3c4_18960V3	NA	blue
Pp3c4_19160V3	NA	blue
Pp3c4_20210V3	NA	blue
Pp3c4_20470V3	NA	blue
Pp3c4_20560V3	NA	blue
Pp3c4_20570V3	NA	blue
Pp3c4_20580V3	NA	blue
Pp3c4_20900V3	NA	blue
Pp3c4_2110V3	NA	blue
Pp3c4_21970V3	NA	blue
Pp3c4_22960V3	NA	blue
Pp3c4_25780V3	NA	blue
Pp3c4_26860V3	NA	blue
Pp3c4_26900V3	NA	blue
Pp3c4_27740V3	NA	blue
Pp3c4_28170V3	NA	blue
Pp3c4_2840V3	NA	blue
Pp3c4_28860V3	NA	blue
Pp3c4_30740V3	NA	blue
Pp3c4_31070V3	NA	blue
Pp3c4_31680V3	NA	blue
Pp3c4_3650V3	NA	blue
Pp3c4_3730V3	NA	blue
Pp3c4_4630V3	NA	blue
Pp3c4_5170V3	NA	blue
Pp3c4_7610V3	NA	blue
Pp3c4_770V3	NA	blue
Pp3c4_8110V3	NA	blue
Pp3c4_8350V3	NA	blue
Pp3c5_10000V3	NA	blue
Pp3c5_10200V3	NA	blue
Pp3c5_10250V3	NA	blue
Pp3c5_10320V3	NA	blue
Pp3c5_1040V3	NA	blue
Pp3c5_10560V3	NA	blue
Pp3c5_10610V3	NA	blue
Pp3c5_10700V3	NA	blue
Pp3c5_12660V3	NA	blue
Pp3c5_12770V3	NA	blue
Pp3c5_12900V3	NA	blue
Pp3c5_13270V3	NA	blue
Pp3c5_1370V3	NA	blue
Pp3c5_13790V3	NA	blue
Pp3c5_14640V3	NA	blue
Pp3c5_14660V3	NA	blue
Pp3c5_15740V3	NA	blue
Pp3c5_15990V3	NA	blue
Pp3c5_16120V3	NA	blue
Pp3c5_16280V3	NA	blue
Pp3c5_1630V3	NA	blue
Pp3c5_1690V3	NA	blue
Pp3c5_16950V3	NA	blue
Pp3c5_17020V3	NA	blue
Pp3c5_1800V3	NA	blue
Pp3c5_18490V3	NA	blue
Pp3c5_19480V3	NA	blue
Pp3c5_19530V3	NA	blue
Pp3c5_20370V3	NA	blue
Pp3c5_2080V3	NA	blue
Pp3c5_20920V3	NA	blue
Pp3c5_21370V3	NA	blue
Pp3c5_21410V3	NA	blue
Pp3c5_21920V3	NA	blue
Pp3c5_22300V3	NA	blue
Pp3c5_22340V3	NA	blue
Pp3c5_24760V3	NA	blue
Pp3c5_25280V3	NA	blue
Pp3c5_25700V3	NA	blue
Pp3c5_26190V3	NA	blue
Pp3c5_28020V3	NA	blue
Pp3c5_28500V3	NA	blue
Pp3c5_28520V3	NA	blue
Pp3c5_28560V3	NA	blue
Pp3c5_28640V3	NA	blue
Pp3c5_3160V3	NA	blue
Pp3c5_3210V3	NA	blue
Pp3c5_3400V3	NA	blue
Pp3c5_3550V3	NA	blue
Pp3c5_4230V3	NA	blue
Pp3c5_4430V3	NA	blue
Pp3c5_5150V3	NA	blue
Pp3c5_6070V3	NA	blue
Pp3c5_6160V3	NA	blue
Pp3c5_6270V3	NA	blue
Pp3c5_6600V3	NA	blue
Pp3c5_6620V3	NA	blue
Pp3c5_6730V3	NA	blue
Pp3c5_8420V3	NA	blue
Pp3c5_8430V3	NA	blue
Pp3c5_9520V3	NA	blue
Pp3c6_10010V3	NA	blue
Pp3c6_10060V3	NA	blue
Pp3c6_10550V3	NA	blue
Pp3c6_10610V3	NA	blue
Pp3c6_10690V3	NA	blue
Pp3c6_1100V3	NA	blue
Pp3c6_11160V3	NA	blue
Pp3c6_11210V3	NA	blue
Pp3c6_12580V3	NA	blue
Pp3c6_12750V3	NA	blue
Pp3c6_1360V3	NA	blue
Pp3c6_14770V3	NA	blue
Pp3c6_14800V3	NA	blue
Pp3c6_15020V3	NA	blue
Pp3c6_15270V3	NA	blue
Pp3c6_15290V3	NA	blue
Pp3c6_15900V3	NA	blue
Pp3c6_15940V3	NA	blue
Pp3c6_15960V3	NA	blue
Pp3c6_16850V3	NA	blue
Pp3c6_16870V3	NA	blue
Pp3c6_17840V3	NA	blue
Pp3c6_18080V3	NA	blue
Pp3c6_18200V3	NA	blue
Pp3c6_18240V3	NA	blue
Pp3c6_18950V3	NA	blue
Pp3c6_19380V3	NA	blue
Pp3c6_19470V3	NA	blue
Pp3c6_19520V3	NA	blue
Pp3c6_19550V3	NA	blue
Pp3c6_19740V3	NA	blue
Pp3c6_1990V3	NA	blue
Pp3c6_19920V3	NA	blue
Pp3c6_19930V3	NA	blue
Pp3c6_20400V3	NA	blue
Pp3c6_20800V3	NA	blue
Pp3c6_21060V3	NA	blue
Pp3c6_21250V3	NA	blue
Pp3c6_21370V3	NA	blue
Pp3c6_22110V3	NA	blue
Pp3c6_22700V3	NA	blue
Pp3c6_22710V3	NA	blue
Pp3c6_23240V3	NA	blue
Pp3c6_24940V3	NA	blue
Pp3c6_250V3	NA	blue
Pp3c6_25390V3	NA	blue
Pp3c6_25660V3	NA	blue
Pp3c6_25960V3	NA	blue
Pp3c6_26510V3	NA	blue
Pp3c6_26590V3	NA	blue
Pp3c6_270V3	NA	blue
Pp3c6_27130V3	NA	blue
Pp3c6_27570V3	NA	blue
Pp3c6_27580V3	NA	blue
Pp3c6_28490V3	NA	blue
Pp3c6_28770V3	NA	blue
Pp3c6_28830V3	NA	blue
Pp3c6_29110V3	NA	blue
Pp3c6_29180V3	NA	blue
Pp3c6_29310V3	NA	blue
Pp3c6_29320V3	NA	blue
Pp3c6_29690V3	NA	blue
Pp3c6_3950V3	NA	blue
Pp3c6_4010V3	NA	blue
Pp3c6_4090V3	NA	blue
Pp3c6_4230V3	NA	blue
Pp3c6_4660V3	NA	blue
Pp3c6_5010V3	NA	blue
Pp3c6_6030V3	NA	blue
Pp3c6_720V3	NA	blue
Pp3c6_7260V3	NA	blue
Pp3c6_7520V3	NA	blue
Pp3c6_8290V3	NA	blue
Pp3c6_8810V3	NA	blue
Pp3c6_9210V3	NA	blue
Pp3c6_9280V3	NA	blue
Pp3c7_10050V3	NA	blue
Pp3c7_10260V3	NA	blue
Pp3c7_11180V3	NA	blue
Pp3c7_11290V3	NA	blue
Pp3c7_11350V3	NA	blue
Pp3c7_11370V3	NA	blue
Pp3c7_11410V3	NA	blue
Pp3c7_11500V3	NA	blue
Pp3c7_11740V3	NA	blue
Pp3c7_120V3	NA	blue
Pp3c7_12220V3	NA	blue
Pp3c7_13340V3	NA	blue
Pp3c7_13640V3	NA	blue
Pp3c7_13710V3	NA	blue
Pp3c7_14130V3	NA	blue
Pp3c7_14300V3	NA	blue
Pp3c7_15410V3	NA	blue
Pp3c7_15540V3	NA	blue
Pp3c7_16670V3	NA	blue
Pp3c7_17790V3	NA	blue
Pp3c7_18530V3	NA	blue
Pp3c7_19190V3	NA	blue
Pp3c7_21310V3	NA	blue
Pp3c7_2140V3	NA	blue
Pp3c7_22070V3	NA	blue
Pp3c7_22150V3	NA	blue
Pp3c7_22170V3	NA	blue
Pp3c7_22420V3	NA	blue
Pp3c7_22430V3	NA	blue
Pp3c7_22920V3	NA	blue
Pp3c7_23000V3	NA	blue
Pp3c7_23730V3	NA	blue
Pp3c7_24100V3	NA	blue
Pp3c7_24650V3	NA	blue
Pp3c7_24683V3	NA	blue
Pp3c7_24690V3	NA	blue
Pp3c7_2590V3	NA	blue
Pp3c7_26970V3	NA	blue
Pp3c7_27020V3	NA	blue
Pp3c7_27080V3	NA	blue
Pp3c7_3290V3	NA	blue
Pp3c7_3340V3	NA	blue
Pp3c7_370V3	NA	blue
Pp3c7_3770V3	NA	blue
Pp3c7_4040V3	NA	blue
Pp3c7_4070V3	NA	blue
Pp3c7_4400V3	NA	blue
Pp3c7_551V3	NA	blue
Pp3c7_5520V3	NA	blue
Pp3c7_5560V3	NA	blue
Pp3c7_6520V3	NA	blue
Pp3c7_6620V3	NA	blue
Pp3c7_6670V3	NA	blue
Pp3c7_7090V3	NA	blue
Pp3c7_7450V3	NA	blue
Pp3c7_7460V3	NA	blue
Pp3c7_7640V3	NA	blue
Pp3c7_80V3	NA	blue
Pp3c7_8450V3	NA	blue
Pp3c7_8590V3	NA	blue
Pp3c7_90V3	NA	blue
Pp3c8_11630V3	NA	blue
Pp3c8_12290V3	NA	blue
Pp3c8_12300V3	NA	blue
Pp3c8_12890V3	NA	blue
Pp3c8_13050V3	NA	blue
Pp3c8_15860V3	NA	blue
Pp3c8_16200V3	NA	blue
Pp3c8_16290V3	NA	blue
Pp3c8_1640V3	NA	blue
Pp3c8_16430V3	NA	blue
Pp3c8_16890V3	NA	blue
Pp3c8_16910V3	NA	blue
Pp3c8_17250V3	NA	blue
Pp3c8_17380V3	NA	blue
Pp3c8_18060V3	NA	blue
Pp3c8_18220V3	NA	blue
Pp3c8_18240V3	NA	blue
Pp3c8_18320V3	NA	blue
Pp3c8_2040V3	NA	blue
Pp3c8_2050V3	NA	blue
Pp3c8_20940V3	NA	blue
Pp3c8_20970V3	NA	blue
Pp3c8_21590V3	NA	blue
Pp3c8_21780V3	NA	blue
Pp3c8_24280V3	NA	blue
Pp3c8_2430V3	NA	blue
Pp3c8_24320V3	NA	blue
Pp3c8_3026V3	NA	blue
Pp3c8_3260V3	NA	blue
Pp3c8_3720V3	NA	blue
Pp3c8_3750V3	NA	blue
Pp3c8_4400V3	NA	blue
Pp3c8_4810V3	NA	blue
Pp3c8_4960V3	NA	blue
Pp3c8_5760V3	NA	blue
Pp3c8_6290V3	NA	blue
Pp3c8_6680V3	NA	blue
Pp3c8_7470V3	NA	blue
Pp3c8_7530V3	NA	blue
Pp3c8_8000V3	NA	blue
Pp3c8_810V3	NA	blue
Pp3c9_1000V3	NA	blue
Pp3c9_10120V3	NA	blue
Pp3c9_10940V3	NA	blue
Pp3c9_11020V3	NA	blue
Pp3c9_11840V3	NA	blue
Pp3c9_12360V3	NA	blue
Pp3c9_12820V3	NA	blue
Pp3c9_1490V3	NA	blue
Pp3c9_1530V3	NA	blue
Pp3c9_15430V3	NA	blue
Pp3c9_1650V3	NA	blue
Pp3c9_1669V3	NA	blue
Pp3c9_17180V3	NA	blue
Pp3c9_17550V3	NA	blue
Pp3c9_1790V3	NA	blue
Pp3c9_18000V3	NA	blue
Pp3c9_19820V3	NA	blue
Pp3c9_19950V3	NA	blue
Pp3c9_20180V3	NA	blue
Pp3c9_2020V3	NA	blue
Pp3c9_20530V3	NA	blue
Pp3c9_21410V3	NA	blue
Pp3c9_21440V3	NA	blue
Pp3c9_21880V3	NA	blue
Pp3c9_22260V3	NA	blue
Pp3c9_22950V3	NA	blue
Pp3c9_23280V3	NA	blue
Pp3c9_23630V3	NA	blue
Pp3c9_23740V3	NA	blue
Pp3c9_24380V3	NA	blue
Pp3c9_2440V3	NA	blue
Pp3c9_24450V3	NA	blue
Pp3c9_24510V3	NA	blue
Pp3c9_24780V3	NA	blue
Pp3c9_24880V3	NA	blue
Pp3c9_25980V3	NA	blue
Pp3c9_26090V3	NA	blue
Pp3c9_26100V3	NA	blue
Pp3c9_2745V3	NA	blue
Pp3c9_3020V3	NA	blue
Pp3c9_3340V3	NA	blue
Pp3c9_410V3	NA	blue
Pp3c9_4143V3	NA	blue
Pp3c9_4440V3	NA	blue
Pp3c9_4530V3	NA	blue
Pp3c9_4620V3	NA	blue
Pp3c9_4700V3	NA	blue
Pp3c9_5260V3	NA	blue
Pp3c9_5480V3	NA	blue
Pp3c9_5600V3	NA	blue
Pp3c9_570V3	NA	blue
Pp3c9_5880V3	NA	blue
Pp3c9_5950V3	NA	blue
Pp3c9_6480V3	NA	blue
Pp3c9_6760V3	NA	blue
Pp3c9_6880V3	NA	blue
Pp3c9_710V3	NA	blue
Pp3c9_8810V3	NA	blue
Pp3c9_8950V3	NA	blue
Pp3c9_9050V3	NA	blue
Pp3c9_9120V3	NA	blue
Pp3c9_9180V3	NA	blue
Pp3c9_9200V3	NA	blue
Pp3s121_40V3	NA	blue
Pp3s152_10V3	NA	blue
Pp3s318_20V3	NA	blue
Pp3s375_10V3	NA	blue
Pp3s383_30V3	NA	blue
Pp3s48_50V3	NA	blue
Pp3s775_50V3	NA	blue
