{
	"n_targets": 20030,
	"n_bootstraps": 100,
	"n_processed": 23232922,
	"n_pseudoaligned": 14698414,
	"n_unique": 12751226,
	"p_pseudoaligned": 63.3,
	"p_unique": 54.9,
	"kallisto_version": "0.48.0",
	"index_version": 10,
	"start_time": "Fri Mar  3 13:25:36 2023",
	"call": "kallisto quant --bootstrap-samples 100 --rf-stranded -t 20 -i /scratch/users/dadras/Stress_profiling_of_zygnema_circumcarinatum_1b/kallisto_index/SAG698_1b_CDS.fna.idx -o /scratch/users/dadras/Stress_profiling_of_zygnema_circumcarinatum_1b/kallisto/Z_1_38_EKRN220057117-1A_H22HLDSX5_L3 /scratch/users/dadras/Stress_profiling_of_zygnema_circumcarinatum_1b/trimmed_reads_PE/Z_1_38_EKRN220057117-1A_H22HLDSX5_L3_1.fq.gz /scratch/users/dadras/Stress_profiling_of_zygnema_circumcarinatum_1b/trimmed_reads_PE/Z_1_38_EKRN220057117-1A_H22HLDSX5_L3_2.fq.gz"
}
