"","x"
"1","Pp3c3_26370V3"
"2","Pp3c5_26150V3"
"3","Pp3c8_14050V3"
"4","Pp3c11_6300V3"
"5","Pp3c14_22720V3"
"6","Pp3c13_6620V3"
"7","Pp3c4_22170V3"
"8","Pp3c13_6560V3"
"9","Pp3c9_20230V3"
"10","Pp3c5_20450V3"
"11","Pp3c6_5030V3"
"12","Pp3c1_6980V3"
"13","Pp3c2_30120V3"
"14","Pp3c8_24740V3"
"15","Pp3c19_5540V3"
"16","Pp3c2_6630V3"
"17","Pp3c3_24618V3"
"18","Pp3c19_15510V3"
"19","Pp3c7_5280V3"
"20","Pp3c22_21630V3"
