"","ID","Description","GeneRatio","BgRatio","pvalue","p.adjust","qvalue","geneID","Count"
"GO:0019252","GO:0019252","starch biosynthetic process","2/12","18/5696",0.000611029401301129,0.1081522040303,0.0881168715560576,"Pp3c19_7710V3/Pp3c18_20850V3",2
"GO:0005982","GO:0005982","starch metabolic process","2/12","44/5696",0.00366471027323299,0.215296004519282,0.175412147601199,"Pp3c19_7710V3/Pp3c18_20850V3",2
"GO:0009250","GO:0009250","glucan biosynthetic process","2/12","49/5696",0.0045291198671003,0.215296004519282,0.175412147601199,"Pp3c19_7710V3/Pp3c18_20850V3",2
"GO:0033692","GO:0033692","cellular polysaccharide biosynthetic process","2/12","67/5696",0.0083376954733538,0.215296004519282,0.175412147601199,"Pp3c19_7710V3/Pp3c18_20850V3",2
"GO:0000271","GO:0000271","polysaccharide biosynthetic process","2/12","71/5696",0.00932719329595625,0.215296004519282,0.175412147601199,"Pp3c19_7710V3/Pp3c18_20850V3",2
"GO:0034637","GO:0034637","cellular carbohydrate biosynthetic process","2/12","83/5696",0.0125947476635237,0.215296004519282,0.175412147601199,"Pp3c19_7710V3/Pp3c18_20850V3",2
"GO:0006073","GO:0006073","cellular glucan metabolic process","2/12","92/5696",0.0153304539454628,0.215296004519282,0.175412147601199,"Pp3c19_7710V3/Pp3c18_20850V3",2
"GO:0044042","GO:0044042","glucan metabolic process","2/12","106/5696",0.0200498572462113,0.215296004519282,0.175412147601199,"Pp3c19_7710V3/Pp3c18_20850V3",2
"GO:0044264","GO:0044264","cellular polysaccharide metabolic process","2/12","108/5696",0.0207686459016105,0.215296004519282,0.175412147601199,"Pp3c19_7710V3/Pp3c18_20850V3",2
"GO:0009585","GO:0009585","red, far-red light phototransduction","1/12","10/5696",0.0208851564403324,0.215296004519282,0.175412147601199,"Pp3c16_18760V3",1
"GO:0048354","GO:0048354","mucilage biosynthetic process involved in seed coat development","1/12","13/5696",0.0270722778208868,0.215296004519282,0.175412147601199,"Pp3c4_19720V3",1
"GO:0005976","GO:0005976","polysaccharide metabolic process","2/12","125/5696",0.0273088178865931,0.215296004519282,0.175412147601199,"Pp3c19_7710V3/Pp3c18_20850V3",2
"GO:0006760","GO:0006760","folic acid-containing compound metabolic process","1/12","14/5696",0.0291266738557546,0.215296004519282,0.175412147601199,"Pp3c1_39510V3",1
"GO:0009903","GO:0009903","chloroplast avoidance movement","1/12","14/5696",0.0291266738557546,0.215296004519282,0.175412147601199,"Pp3c16_18760V3",1
"GO:0030150","GO:0030150","protein import into mitochondrial matrix","1/12","14/5696",0.0291266738557546,0.215296004519282,0.175412147601199,"Pp3c1_40570V3",1
"GO:0042558","GO:0042558","pteridine-containing compound metabolic process","1/12","14/5696",0.0291266738557546,0.215296004519282,0.175412147601199,"Pp3c1_39510V3",1
"GO:0045037","GO:0045037","protein import into chloroplast stroma","1/12","14/5696",0.0291266738557546,0.215296004519282,0.175412147601199,"Pp3c1_40570V3",1
"GO:0016051","GO:0016051","carbohydrate biosynthetic process","2/12","134/5696",0.0310713885799281,0.215296004519282,0.175412147601199,"Pp3c19_7710V3/Pp3c18_20850V3",2
"GO:0009902","GO:0009902","chloroplast relocation","1/12","15/5696",0.0311770927071674,0.215296004519282,0.175412147601199,"Pp3c16_18760V3",1
"GO:0051667","GO:0051667","establishment of plastid localization","1/12","15/5696",0.0311770927071674,0.215296004519282,0.175412147601199,"Pp3c16_18760V3",1
"GO:0005975","GO:0005975","carbohydrate metabolic process","3/12","349/5696",0.0331631952594028,0.215296004519282,0.175412147601199,"Pp3c19_7710V3/Pp3c18_20850V3/Pp3c25_15030V3",3
"GO:0010192","GO:0010192","mucilage biosynthetic process","1/12","16/5696",0.0332235413759782,0.215296004519282,0.175412147601199,"Pp3c4_19720V3",1
"GO:0048359","GO:0048359","mucilage metabolic process involved in seed coat development","1/12","16/5696",0.0332235413759782,0.215296004519282,0.175412147601199,"Pp3c4_19720V3",1
"GO:0019750","GO:0019750","chloroplast localization","1/12","18/5696",0.0373045561137469,0.215296004519282,0.175412147601199,"Pp3c16_18760V3",1
"GO:0051644","GO:0051644","plastid localization","1/12","18/5696",0.0373045561137469,0.215296004519282,0.175412147601199,"Pp3c16_18760V3",1
"GO:0010191","GO:0010191","mucilage metabolic process","1/12","20/5696",0.0413697738542915,0.215296004519282,0.175412147601199,"Pp3c4_19720V3",1
"GO:0010224","GO:0010224","response to UV-B","1/12","20/5696",0.0413697738542915,0.215296004519282,0.175412147601199,"Pp3c8_6950V3",1
"GO:0044262","GO:0044262","cellular carbohydrate metabolic process","2/12","160/5696",0.0430263246993983,0.215296004519282,0.175412147601199,"Pp3c19_7710V3/Pp3c18_20850V3",2
"GO:0006865","GO:0006865","amino acid transport","1/12","21/5696",0.0433964762351496,0.215296004519282,0.175412147601199,"Pp3c1_40570V3",1
"GO:0010214","GO:0010214","seed coat development","1/12","21/5696",0.0433964762351496,0.215296004519282,0.175412147601199,"Pp3c4_19720V3",1
"GO:0009789","GO:0009789","positive regulation of abscisic acid-activated signaling pathway","1/12","22/5696",0.0454192502061059,0.215296004519282,0.175412147601199,"Pp3c2_21270V3",1
"GO:1901421","GO:1901421","positive regulation of response to alcohol","1/12","22/5696",0.0454192502061059,0.215296004519282,0.175412147601199,"Pp3c2_21270V3",1
"GO:1905959","GO:1905959","positive regulation of cellular response to alcohol","1/12","22/5696",0.0454192502061059,0.215296004519282,0.175412147601199,"Pp3c2_21270V3",1
"GO:0003333","GO:0003333","amino acid transmembrane transport","1/12","23/5696",0.0474381026906892,0.215296004519282,0.175412147601199,"Pp3c1_40570V3",1
"GO:0006626","GO:0006626","protein targeting to mitochondrion","1/12","23/5696",0.0474381026906892,0.215296004519282,0.175412147601199,"Pp3c1_40570V3",1
"GO:0009749","GO:0009749","response to glucose","1/12","23/5696",0.0474381026906892,0.215296004519282,0.175412147601199,"Pp3c1_40570V3",1
"GO:0009853","GO:0009853","photorespiration","1/12","23/5696",0.0474381026906892,0.215296004519282,0.175412147601199,"Pp3c1_39510V3",1
"GO:0070585","GO:0070585","protein localization to mitochondrion","1/12","23/5696",0.0474381026906892,0.215296004519282,0.175412147601199,"Pp3c1_40570V3",1
"GO:0072655","GO:0072655","establishment of protein localization to mitochondrion","1/12","23/5696",0.0474381026906892,0.215296004519282,0.175412147601199,"Pp3c1_40570V3",1
"GO:1990542","GO:1990542","mitochondrial transmembrane transport","1/12","24/5696",0.0494530406014445,0.218829704661392,0.17829122532626,"Pp3c1_40570V3",1
"GO:0009746","GO:0009746","response to hexose","1/12","27/5696",0.0554744358517456,0.226063551869068,0.184184993196922,"Pp3c1_40570V3",1
"GO:0044743","GO:0044743","protein transmembrane import into intracellular organelle","1/12","27/5696",0.0554744358517456,0.226063551869068,0.184184993196922,"Pp3c1_40570V3",1
"GO:0045036","GO:0045036","protein targeting to chloroplast","1/12","28/5696",0.0574737843734919,0.226063551869068,0.184184993196922,"Pp3c1_40570V3",1
"GO:0072596","GO:0072596","establishment of protein localization to chloroplast","1/12","28/5696",0.0574737843734919,0.226063551869068,0.184184993196922,"Pp3c1_40570V3",1
"GO:0072598","GO:0072598","protein localization to chloroplast","1/12","28/5696",0.0574737843734919,0.226063551869068,0.184184993196922,"Pp3c1_40570V3",1
"GO:0034284","GO:0034284","response to monosaccharide","1/12","29/5696",0.059469252719913,0.226588525844842,0.184612715080246,"Pp3c1_40570V3",1
"GO:0006887","GO:0006887","exocytosis","1/12","32/5696",0.0654324451225222,0.226588525844842,0.184612715080246,"Pp3c25_15030V3",1
"GO:2000024","GO:2000024","regulation of leaf development","1/12","33/5696",0.0674124611286182,0.226588525844842,0.184612715080246,"Pp3c8_6950V3",1
"GO:0009744","GO:0009744","response to sucrose","1/12","34/5696",0.069388631085612,0.226588525844842,0.184612715080246,"Pp3c1_40570V3",1
"GO:0032940","GO:0032940","secretion by cell","1/12","34/5696",0.069388631085612,0.226588525844842,0.184612715080246,"Pp3c25_15030V3",1
"GO:0034285","GO:0034285","response to disaccharide","1/12","34/5696",0.069388631085612,0.226588525844842,0.184612715080246,"Pp3c1_40570V3",1
"GO:0046903","GO:0046903","secretion","1/12","34/5696",0.069388631085612,0.226588525844842,0.184612715080246,"Pp3c25_15030V3",1
"GO:0090333","GO:0090333","regulation of stomatal closure","1/12","35/5696",0.0713609617862434,0.226588525844842,0.184612715080246,"Pp3c2_21270V3",1
"GO:0002252","GO:0002252","immune effector process","1/12","36/5696",0.0733294600124513,0.226588525844842,0.184612715080246,"Pp3c25_15030V3",1
"GO:0012501","GO:0012501","programmed cell death","1/12","38/5696",0.0772549861154564,0.226588525844842,0.184612715080246,"Pp3c2_21270V3",1
"GO:0006575","GO:0006575","cellular modified amino acid metabolic process","1/12","40/5696",0.0811652634347421,0.226588525844842,0.184612715080246,"Pp3c1_39510V3",1
"GO:0065002","GO:0065002","intracellular protein transmembrane transport","1/12","40/5696",0.0811652634347421,0.226588525844842,0.184612715080246,"Pp3c1_40570V3",1
"GO:0006650","GO:0006650","glycerophospholipid metabolic process","1/12","41/5696",0.0831147006410334,0.226588525844842,0.184612715080246,"Pp3c2_21270V3",1
"GO:1903825","GO:1903825","organic acid transmembrane transport","1/12","41/5696",0.0831147006410334,0.226588525844842,0.184612715080246,"Pp3c1_40570V3",1
"GO:1905039","GO:1905039","carboxylic acid transmembrane transport","1/12","41/5696",0.0831147006410334,0.226588525844842,0.184612715080246,"Pp3c1_40570V3",1
"GO:0009100","GO:0009100","glycoprotein metabolic process","1/12","42/5696",0.0850603458386122,0.226588525844842,0.184612715080246,"Pp3c25_15030V3",1
"GO:0043094","GO:0043094","cellular metabolic compound salvage","1/12","42/5696",0.0850603458386122,0.226588525844842,0.184612715080246,"Pp3c1_39510V3",1
"GO:0071806","GO:0071806","protein transmembrane transport","1/12","42/5696",0.0850603458386122,0.226588525844842,0.184612715080246,"Pp3c1_40570V3",1
"GO:0009664","GO:0009664","plant-type cell wall organization","1/12","43/5696",0.08700220573425,0.226588525844842,0.184612715080246,"Pp3c4_19720V3",1
"GO:0015849","GO:0015849","organic acid transport","1/12","43/5696",0.08700220573425,0.226588525844842,0.184612715080246,"Pp3c1_40570V3",1
"GO:0046942","GO:0046942","carboxylic acid transport","1/12","43/5696",0.08700220573425,0.226588525844842,0.184612715080246,"Pp3c1_40570V3",1
"GO:0009311","GO:0009311","oligosaccharide metabolic process","1/12","44/5696",0.0889402870240409,0.226588525844842,0.184612715080246,"Pp3c25_15030V3",1
"GO:0009409","GO:0009409","response to cold","2/12","243/5696",0.090284746389151,0.226588525844842,0.184612715080246,"Pp3c1_40570V3/Pp3c2_21270V3",2
"GO:0008219","GO:0008219","cell death","1/12","45/5696",0.0908745963934163,0.226588525844842,0.184612715080246,"Pp3c2_21270V3",1
"GO:1901135","GO:1901135","carbohydrate derivative metabolic process","2/12","247/5696",0.0928544387028527,0.226588525844842,0.184612715080246,"Pp3c19_7710V3/Pp3c25_15030V3",2
"GO:0009787","GO:0009787","regulation of abscisic acid-activated signaling pathway","1/12","47/5696",0.0947319260594255,0.226588525844842,0.184612715080246,"Pp3c2_21270V3",1
"GO:0019318","GO:0019318","hexose metabolic process","1/12","47/5696",0.0947319260594255,0.226588525844842,0.184612715080246,"Pp3c25_15030V3",1
"GO:1901419","GO:1901419","regulation of response to alcohol","1/12","47/5696",0.0947319260594255,0.226588525844842,0.184612715080246,"Pp3c2_21270V3",1
"GO:1905957","GO:1905957","regulation of cellular response to alcohol","1/12","47/5696",0.0947319260594255,0.226588525844842,0.184612715080246,"Pp3c2_21270V3",1
"GO:0009411","GO:0009411","response to UV","1/12","51/5696",0.102401615325424,0.236055850741412,0.19232620607537,"Pp3c8_6950V3",1
"GO:0051656","GO:0051656","establishment of organelle localization","1/12","51/5696",0.102401615325424,0.236055850741412,0.19232620607537,"Pp3c16_18760V3",1
"GO:0051649","GO:0051649","establishment of localization in cell","2/12","262/5696",0.102690963316885,0.236055850741412,0.19232620607537,"Pp3c1_40570V3/Pp3c16_18760V3",2
"GO:0006839","GO:0006839","mitochondrial transport","1/12","57/5696",0.113794518041945,0.258226021710566,0.210389324854877,"Pp3c1_40570V3",1
"GO:0017038","GO:0017038","protein import","1/12","60/5696",0.119441120125134,0.267608585596819,0.218033756923962,"Pp3c1_40570V3",1
"GO:0009743","GO:0009743","response to carbohydrate","1/12","61/5696",0.121315979344172,0.268411604298981,0.218688015396731,"Pp3c1_40570V3",1
"GO:0046486","GO:0046486","glycerolipid metabolic process","1/12","62/5696",0.12318717867831,0.269186797852604,0.219319603364893,"Pp3c2_21270V3",1
"GO:0071555","GO:0071555","cell wall organization","1/12","63/5696",0.125054724623618,0.269935198272931,0.219929361661561,"Pp3c4_19720V3",1
"GO:0045229","GO:0045229","external encapsulating structure organization","1/12","67/5696",0.132488504074946,0.282535725557415,0.230195625342645,"Pp3c4_19720V3",1
"GO:0009967","GO:0009967","positive regulation of signal transduction","1/12","68/5696",0.134337880154374,0.283069104611002,0.230630195252497,"Pp3c2_21270V3",1
"GO:0005996","GO:0005996","monosaccharide metabolic process","1/12","69/5696",0.136183641603938,0.283582406634083,0.231048407427115,"Pp3c25_15030V3",1
"GO:0006644","GO:0006644","phospholipid metabolic process","1/12","70/5696",0.138025794847363,0.284076345209107,0.2314508432569,"Pp3c2_21270V3",1
"GO:0023056","GO:0023056","positive regulation of signaling","1/12","71/5696",0.139864346298097,0.284551601089233,0.231838057384626,"Pp3c2_21270V3",1
"GO:0007005","GO:0007005","mitochondrion organization","1/12","72/5696",0.141699302359328,0.285008824063649,0.232210579225215,"Pp3c1_40570V3",1
"GO:0051640","GO:0051640","organelle localization","1/12","74/5696",0.145358453874807,0.28908366669484,0.235530552109385,"Pp3c16_18760V3",1
"GO:0009909","GO:0009909","regulation of flower development","1/12","76/5696",0.149003300414619,0.289819606300962,0.236130157973427,"Pp3c8_6950V3",1
"GO:0010647","GO:0010647","positive regulation of cell communication","1/12","76/5696",0.149003300414619,0.289819606300962,0.236130157973427,"Pp3c2_21270V3",1
"GO:0015711","GO:0015711","organic anion transport","1/12","77/5696",0.150820375218004,0.290165287104203,0.236411800971013,"Pp3c1_40570V3",1
"GO:0016052","GO:0016052","carbohydrate catabolic process","1/12","78/5696",0.152633892836331,0.290496763785276,0.236681871178013,"Pp3c25_15030V3",1
"GO:0051641","GO:0051641","cellular localization","2/12","335/5696",0.15436911416166,0.290673757517169,0.236826076597396,"Pp3c1_40570V3/Pp3c16_18760V3",2
"GO:0009266","GO:0009266","response to temperature stimulus","2/12","349/5696",0.164864207814287,0.304641790278391,0.248206513637464,"Pp3c1_40570V3/Pp3c2_21270V3",2
"GO:0009753","GO:0009753","response to jasmonic acid","1/12","85/5696",0.165229445574721,0.304641790278391,0.248206513637464,"Pp3c1_40570V3",1
"GO:0010119","GO:0010119","regulation of stomatal movement","1/12","86/5696",0.167014732805714,0.304758842336199,0.248301881653638,"Pp3c2_21270V3",1
"GO:0071669","GO:0071669","plant-type cell wall organization or biogenesis","1/12","88/5696",0.170574811819082,0.308078996856913,0.251006973353536,"Pp3c4_19720V3",1
"GO:0006605","GO:0006605","protein targeting","1/12","90/5696",0.174120938457398,0.311307132393529,0.253637092702429,"Pp3c1_40570V3",1
"GO:0034645","GO:0034645","cellular macromolecule biosynthetic process","2/12","368/5696",0.179340814092559,0.317433240943829,0.258628331901901,"Pp3c19_7710V3/Pp3c18_20850V3",2
"GO:0098656","GO:0098656","anion transmembrane transport","1/12","95/5696",0.182925539358084,0.320572479865157,0.261186022845831,"Pp3c1_40570V3",1
"GO:0009611","GO:0009611","response to wounding","1/12","97/5696",0.186423223243662,0.323499122687531,0.263570501386808,"Pp3c1_40570V3",1
"GO:0009059","GO:0009059","macromolecule biosynthetic process","2/12","387/5696",0.194051287387782,0.333466775413955,0.271691633849015,"Pp3c19_7710V3/Pp3c18_20850V3",2
"GO:0009826","GO:0009826","unidimensional cell growth","1/12","107/5696",0.203706672769402,0.345855845254178,0.281785612844617,"Pp3c4_19720V3",1
"GO:0072594","GO:0072594","establishment of protein localization to organelle","1/12","108/5696",0.205416373955083,0.345855845254178,0.281785612844617,"Pp3c1_40570V3",1
"GO:0048831","GO:0048831","regulation of shoot system development","1/12","109/5696",0.207122709587248,0.345855845254178,0.281785612844617,"Pp3c8_6950V3",1
"GO:0006955","GO:0006955","immune response","1/12","111/5696",0.210525308276932,0.348252145467448,0.283737995415048,"Pp3c25_15030V3",1
"GO:0006820","GO:0006820","anion transport","1/12","116/5696",0.218973328300522,0.358872954714744,0.292391286327208,"Pp3c1_40570V3",1
"GO:0009658","GO:0009658","chloroplast organization","1/12","123/5696",0.230661381099574,0.374560224354355,0.305172469441252,"Pp3c16_18760V3",1
"GO:0033365","GO:0033365","protein localization to organelle","1/12","129/5696",0.240551862168818,0.387069814580735,0.315364642269169,"Pp3c1_40570V3",1
"GO:0002376","GO:0002376","immune system process","1/12","137/5696",0.253557885589694,0.40432203377816,0.329420866057734,"Pp3c25_15030V3",1
"GO:0060560","GO:0060560","developmental growth involved in morphogenesis","1/12","144/5696",0.264770328727331,0.418431680220872,0.340916682665831,"Pp3c4_19720V3",1
"GO:0006281","GO:0006281","DNA repair","1/12","149/5696",0.272684460770441,0.422460031576948,0.344198776842355,"Pp3c8_6950V3",1
"GO:0048584","GO:0048584","positive regulation of response to stimulus","1/12","155/5696",0.282078309799282,0.422460031576948,0.344198776842355,"Pp3c2_21270V3",1
"GO:0000902","GO:0000902","cell morphogenesis","1/12","156/5696",0.283633094185206,0.422460031576948,0.344198776842355,"Pp3c4_19720V3",1
"GO:2000241","GO:2000241","regulation of reproductive process","1/12","156/5696",0.283633094185206,0.422460031576948,0.344198776842355,"Pp3c8_6950V3",1
"GO:0006974","GO:0006974","cellular response to DNA damage stimulus","1/12","157/5696",0.285184791454119,0.422460031576948,0.344198776842355,"Pp3c8_6950V3",1
"GO:0009657","GO:0009657","plastid organization","1/12","159/5696",0.28827894692553,0.422460031576948,0.344198776842355,"Pp3c16_18760V3",1
"GO:0071554","GO:0071554","cell wall organization or biogenesis","1/12","159/5696",0.28827894692553,0.422460031576948,0.344198776842355,"Pp3c4_19720V3",1
"GO:1901137","GO:1901137","carbohydrate derivative biosynthetic process","1/12","159/5696",0.28827894692553,0.422460031576948,0.344198776842355,"Pp3c19_7710V3",1
"GO:0016192","GO:0016192","vesicle-mediated transport","1/12","160/5696",0.289821416247707,0.422460031576948,0.344198776842355,"Pp3c25_15030V3",1
"GO:0009415","GO:0009415","response to water","1/12","161/5696",0.291360820692257,0.422460031576948,0.344198776842355,"Pp3c5_11880V3",1
"GO:0016049","GO:0016049","cell growth","1/12","163/5696",0.29443045708854,0.422460031576948,0.344198776842355,"Pp3c4_19720V3",1
"GO:0032989","GO:0032989","cellular component morphogenesis","1/12","164/5696",0.295960700087806,0.422460031576948,0.344198776842355,"Pp3c4_19720V3",1
"GO:0048580","GO:0048580","regulation of post-embryonic development","1/12","167/5696",0.300533194386728,0.425555003251607,0.346720401103004,"Pp3c8_6950V3",1
"GO:0043603","GO:0043603","cellular amide metabolic process","1/12","171/5696",0.306587510619803,0.430682455394486,0.350897986256584,"Pp3c1_39510V3",1
"GO:0048589","GO:0048589","developmental growth","1/12","174/5696",0.311096681810863,0.433575690397817,0.353255245819215,"Pp3c4_19720V3",1
"GO:0009966","GO:0009966","regulation of signal transduction","1/12","184/5696",0.325933839178976,0.450705386989678,0.367211644469734,"Pp3c2_21270V3",1
"GO:0023051","GO:0023051","regulation of signaling","1/12","189/5696",0.333242041184678,0.452221402998315,0.368446816596902,"Pp3c2_21270V3",1
"GO:0015833","GO:0015833","peptide transport","1/12","190/5696",0.334694936682369,0.452221402998315,0.368446816596902,"Pp3c1_40570V3",1
"GO:0045184","GO:0045184","establishment of protein localization","1/12","190/5696",0.334694936682369,0.452221402998315,0.368446816596902,"Pp3c1_40570V3",1
"GO:0042886","GO:0042886","amide transport","1/12","192/5696",0.337592025076968,0.452680215444117,0.368820633457294,"Pp3c1_40570V3",1
"GO:0010646","GO:0010646","regulation of cell communication","1/12","194/5696",0.340477545112133,0.453116732968779,0.369176285558863,"Pp3c2_21270V3",1
"GO:0034613","GO:0034613","cellular protein localization","1/12","201/5696",0.350486369677619,0.462955876365213,0.377192715206864,"Pp3c1_40570V3",1
"GO:0006886","GO:0006886","intracellular protein transport","1/12","206/5696",0.357550072711357,0.467168509323594,0.380624952585979,"Pp3c1_40570V3",1
"GO:0015031","GO:0015031","protein transport","1/12","207/5696",0.358954334847507,0.467168509323594,0.380624952585979,"Pp3c1_40570V3",1
"GO:0006259","GO:0006259","DNA metabolic process","1/12","211/5696",0.364543293102581,0.470979291088736,0.383729782213243,"Pp3c8_6950V3",1
"GO:0040007","GO:0040007","growth","1/12","216/5696",0.371466670783161,0.476446382091446,0.388184087698651,"Pp3c4_19720V3",1
"GO:0034220","GO:0034220","ion transmembrane transport","1/12","220/5696",0.376955512867904,0.478339870314128,0.389726804835181,"Pp3c1_40570V3",1
"GO:0008104","GO:0008104","protein localization","1/12","224/5696",0.382400384493731,0.478339870314128,0.389726804835181,"Pp3c1_40570V3",1
"GO:0022622","GO:0022622","root system development","1/12","225/5696",0.383754769615455,0.478339870314128,0.389726804835181,"Pp3c8_6950V3",1
"GO:0048364","GO:0048364","root development","1/12","225/5696",0.383754769615455,0.478339870314128,0.389726804835181,"Pp3c8_6950V3",1
"GO:0070727","GO:0070727","cellular macromolecule localization","1/12","227/5696",0.386455375451528,0.478339870314128,0.389726804835181,"Pp3c1_40570V3",1
"GO:0019637","GO:0019637","organophosphate metabolic process","1/12","232/5696",0.39315949607975,0.483258547264692,0.393734290664661,"Pp3c2_21270V3",1
"GO:0044255","GO:0044255","cellular lipid metabolic process","1/12","239/5696",0.402432486799439,0.491063407436969,0.400093290626612,"Pp3c2_21270V3",1
"GO:0046907","GO:0046907","intracellular transport","1/12","241/5696",0.405057951897161,0.491063407436969,0.400093290626612,"Pp3c1_40570V3",1
"GO:0048316","GO:0048316","seed development","1/12","246/5696",0.411575421439008,0.495570405406153,0.403765361526274,"Pp3c4_19720V3",1
"GO:2000026","GO:2000026","regulation of multicellular organismal development","1/12","253/5696",0.420589960363764,0.50300285800261,0.409820942886456,"Pp3c8_6950V3",1
"GO:0010154","GO:0010154","fruit development","1/12","256/5696",0.424414436776588,0.504170169862121,0.410772008748799,"Pp3c4_19720V3",1
"GO:0071705","GO:0071705","nitrogen compound transport","1/12","261/5696",0.430737175864045,0.508269867519573,0.414112232234205,"Pp3c1_40570V3",1
"GO:0033036","GO:0033036","macromolecule localization","1/12","276/5696",0.449325375655518,0.524647308680656,0.427455731723163,"Pp3c1_40570V3",1
"GO:0006811","GO:0006811","ion transport","1/12","277/5696",0.450544581465874,0.524647308680656,0.427455731723163,"Pp3c1_40570V3",1
"GO:0051239","GO:0051239","regulation of multicellular organismal process","1/12","288/5696",0.463793505827924,0.536545428310735,0.437149709655491,"Pp3c8_6950V3",1
"GO:0006629","GO:0006629","lipid metabolic process","1/12","293/5696",0.469718381675414,0.539871126990574,0.439859318452028,"Pp3c2_21270V3",1
"GO:0071702","GO:0071702","organic substance transport","1/12","314/5696",0.493953349933012,0.564062857665439,0.459569500447012,"Pp3c1_40570V3",1
"GO:0050793","GO:0050793","regulation of developmental process","1/12","331/5696",0.512823816508433,0.581857791807645,0.47406790055098,"Pp3c8_6950V3",1
"GO:0048869","GO:0048869","cellular developmental process","1/12","341/5696",0.523620522245524,0.590323773486992,0.480965548425322,"Pp3c4_19720V3",1
"GO:0016310","GO:0016310","phosphorylation","1/12","347/5696",0.529992807483654,0.593726119775992,0.483737605764561,"Pp3c4_19720V3",1
"GO:0019752","GO:0019752","carboxylic acid metabolic process","1/12","360/5696",0.543532242982697,0.605064195018475,0.492975288239851,"Pp3c1_39510V3",1
"GO:0048583","GO:0048583","regulation of response to stimulus","1/12","378/5696",0.561689329767212,0.616932759913075,0.502645186488798,"Pp3c2_21270V3",1
"GO:0006082","GO:0006082","organic acid metabolic process","1/12","381/5696",0.564650322632306,0.616932759913075,0.502645186488798,"Pp3c1_39510V3",1
"GO:0043436","GO:0043436","oxoacid metabolic process","1/12","381/5696",0.564650322632306,0.616932759913075,0.502645186488798,"Pp3c1_39510V3",1
"GO:0006468","GO:0006468","protein phosphorylation","1/12","390/5696",0.573423636414769,0.622674746290884,0.507323462633667,"Pp3c4_19720V3",1
"GO:1901575","GO:1901575","organic substance catabolic process","1/12","394/5696",0.57727061352529,0.623029869475465,0.507612798799517,"Pp3c25_15030V3",1
"GO:0009653","GO:0009653","anatomical structure morphogenesis","1/12","406/5696",0.588621546025275,0.626167856477943,0.510169469744146,"Pp3c4_19720V3",1
"GO:0099402","GO:0099402","plant organ development","1/12","411/5696",0.593268092645434,0.626167856477943,0.510169469744146,"Pp3c8_6950V3",1
"GO:0048608","GO:0048608","reproductive structure development","1/12","415/5696",0.596950636609336,0.626167856477943,0.510169469744146,"Pp3c4_19720V3",1
"GO:0061458","GO:0061458","reproductive system development","1/12","415/5696",0.596950636609336,0.626167856477943,0.510169469744146,"Pp3c4_19720V3",1
"GO:0033554","GO:0033554","cellular response to stress","1/12","416/5696",0.597866484433742,0.626167856477943,0.510169469744146,"Pp3c8_6950V3",1
"GO:0009416","GO:0009416","response to light stimulus","1/12","420/5696",0.601510831681069,0.62627892475029,0.510259962478678,"Pp3c8_6950V3",1
"GO:0055085","GO:0055085","transmembrane transport","1/12","429/5696",0.609600186141032,0.629073891598884,0.512537158186424,"Pp3c1_40570V3",1
"GO:0007165","GO:0007165","signal transduction","1/12","433/5696",0.613146901486212,0.629073891598884,0.512537158186424,"Pp3c16_18760V3",1
"GO:0009314","GO:0009314","response to radiation","1/12","438/5696",0.617538755201904,0.629073891598884,0.512537158186424,"Pp3c8_6950V3",1
"GO:0009056","GO:0009056","catabolic process","1/12","439/5696",0.618411622249751,0.629073891598884,0.512537158186424,"Pp3c25_15030V3",1
"GO:0048522","GO:0048522","positive regulation of cellular process","1/12","452/5696",0.629593947767372,0.636789307170428,0.518823283272963,"Pp3c2_21270V3",1
"GO:0001101","GO:0001101","response to acid chemical","1/12","477/5696",0.650258459299061,0.653953109635987,0.532807469640977,"Pp3c1_40570V3",1
"GO:0003006","GO:0003006","developmental process involved in reproduction","1/12","496/5696",0.665250695585636,0.665250695585636,0.542012163516099,"Pp3c4_19720V3",1
