PCs	condition	treatment	replicate	time_after_t0	temperature	light_intensity
PC_1	9.220773780233685e-12	5.29020991327105e-11	0.06479467149712094	0.005606639539794741	2.9360824024349005e-13	0.008101282691312378
PC_2	0.5377719366917888	0.9380406045765624	0.005404821436723582	0.003753367669947945	1.0458200631292126e-4	0.006258203506260636
PC_3	1.340243806097022e-7	1.4178377148452783e-9	0.3380482856747843	0.20526608166052457	0.05070592541370605	1.6740649438122345e-5
PC_4	0.10135671467126507	0.6642755550892767	0.43189686381112646	2.6767821735939105e-10	0.014363056043418657	0.18624198913044612
