{
	"n_targets": 20030,
	"n_bootstraps": 100,
	"n_processed": 23991335,
	"n_pseudoaligned": 15154795,
	"n_unique": 13062890,
	"p_pseudoaligned": 63.2,
	"p_unique": 54.4,
	"kallisto_version": "0.48.0",
	"index_version": 10,
	"start_time": "Fri Mar  3 13:34:39 2023",
	"call": "kallisto quant --bootstrap-samples 100 --rf-stranded -t 20 -i /scratch/users/dadras/Stress_profiling_of_zygnema_circumcarinatum_1b/kallisto_index/SAG698_1b_CDS.fna.idx -o /scratch/users/dadras/Stress_profiling_of_zygnema_circumcarinatum_1b/kallisto/Z_1_1_EKRN220057080-1A_HKF3KDSX5_L2 /scratch/users/dadras/Stress_profiling_of_zygnema_circumcarinatum_1b/trimmed_reads_PE/Z_1_1_EKRN220057080-1A_HKF3KDSX5_L2_1.fq.gz /scratch/users/dadras/Stress_profiling_of_zygnema_circumcarinatum_1b/trimmed_reads_PE/Z_1_1_EKRN220057080-1A_HKF3KDSX5_L2_2.fq.gz"
}
