-134544.4286604231
-134991.5313551195
-134878.4467235307
-134758.2985787319
-134282.3721487405
-133636.8109561647
-133664.9399433190
-133746.2675569455
-134403.6404767701
-134377.7014471158
-134475.9918366124
-134884.8139459405
-134750.9581384196
-134611.0587865676
-134394.5149590277
-134538.0774026743
-135487.7155785017
-135277.0932229329
-134958.5132522361
-134600.0136297062
-134474.4447316014
-134380.6283366315
-134333.1407049669
-134190.8777436939
-134356.2599710080
-135561.9300485207
-135221.6315831759
-134870.1389703185
-134640.8015013025
-134422.2798646734
-134239.8497413473
-134007.1272792922
-134104.2112390219
-134101.9663746277
-133982.1985041311
-135082.1534249393
-135205.4483616136
-135276.4679599576
-135520.9988060131
-135168.6744086101
-133139.3565848900
-132989.8577466703
-133029.3800583269
-132832.7043209104
-133035.5446555284
-133195.3340914080
-133395.3003500496
-133685.6865012817
-133841.1454729433
-134112.2160077927
-134332.5835005146
-133892.7088659234
-133362.9310244918
-132862.3958360986
-132837.9411817351
-132852.4878240215
-133254.3621335431
-132995.1041930126
-133230.3489210891
-133667.1755470253
-134013.6507751292
-134650.1122924428
-135123.3563620627
-134530.5864197307
-133796.5561073943
-133528.3206985139
-133658.8469773561
-134020.4675640812
-134021.5494051432
-134590.3808241822
-134401.7558266812
-134195.2907144401
-134247.8190045278
-133307.6502713269
-132927.7705574798
-133234.9231896858
-133323.8927232632
-132989.0519293922
-133327.1847803532
-133707.1977823854
-133630.0466566564
-133787.3932355099
-134184.4608616024
-133813.3379032144
-133693.7923243893
-133979.4318516570
-134644.8066577342
-135185.0711855297
-135081.3705798780
-134893.9453780009
-134752.7357561843
-134013.5791126375
-133870.4635698842
-133834.2550917949
-134058.2454202217
-134456.1868470657
-134244.0074873447
-134167.9527260991
-134256.2733344715
-134046.7449764115
-133969.0967042391
-133220.8898926476
-133828.3634275660
-133878.3453093630
-134182.2768115489
-134311.6849784317
-134124.3445117070
-133834.6777199518
-133619.3268406047
-133136.7894289587
-132994.0369818981
-133189.4180874214
-133410.8816454909
-133849.4706877716
-132824.4228725228
-133028.6883919689
-132750.7622266245
-132067.7887767756
-132392.1760385888
-133080.3577176828
-133550.9695488652
-133588.1477580182
-133636.2185831604
-133764.1025509820
-134208.3882272699
-134215.2349076390
-134683.1135612270
-134594.1615884508
-133882.7516252092
-133555.5261746578
-133440.1054050596
-133413.7334103330
-133623.7825202110
-134230.4426329366
-133942.1311716184
-133394.9063287692
-133871.0558850844
-133876.7640408240
-133894.2250275571
-133875.8014486828
-134141.9585005708
-134840.9067768860
-134842.2811502123
-135038.6377477820
-135275.3935297739
-135006.7940059316
-134707.5439809384
-134235.9272743221
-134245.1098105827
-133935.3368609571
-133900.6862875632
-134210.4569402379
-135018.3740024618
-135264.9554793159
-135185.9690617781
-134679.0230290293
-133387.6214243011
-133088.6428852181
-132828.9326190752
-132842.5906943950
-132978.1130050289
-132567.4364842945
-132513.5226055992
-132986.0707099751
-133492.6453986416
-133584.3109557333
-134072.7683559135
-134336.7899797075
-134247.6764713679
-133759.0023629892
-133282.9828235713
-133382.1367980845
-133441.9134046429
-133683.9302752464
