geneID	cold_0.5h_rep1	cold_0.5h_rep2	cold_0.5h_rep3	cold_1h_rep1	cold_1h_rep2	cold_1h_rep3	cold_2h_rep1	cold_2h_rep2	cold_2h_rep3	cold_4h_rep1	cold_4h_rep2	cold_4h_rep3	cold_6h_rep1	cold_6h_rep2	cold_6h_rep3	cold_24h_rep1	cold_24h_rep2	cold_24h_rep3	control_0h_rep1	control_0h_rep2	control_0h_rep3	control_0h_rep4	control_0h_rep5	control_0h_rep6	control_0.5h_rep1	control_0.5h_rep2	control_0.5h_rep3	control_1h_rep1	control_1h_rep2	control_1h_rep3	control_2h_rep1	control_2h_rep2	control_2h_rep3	control_4h_rep1	control_4h_rep2	control_4h_rep3	control_6h_rep1	control_6h_rep2	control_6h_rep3	control_24h_rep1	control_24h_rep2	control_24h_rep3	heat_0.5h_rep1	heat_0.5h_rep2	heat_0.5h_rep3	heat_1h_rep1	heat_1h_rep2	heat_1h_rep3	heat_2h_rep1	heat_2h_rep2	heat_2h_rep3	heat_4h_rep1	heat_4h_rep2	heat_4h_rep3	heat_6h_rep1	heat_6h_rep2	heat_6h_rep3	heat_24h_rep1	heat_24h_rep2	heat_24h_rep3	high_light_s_0.25_rep1	high_light_s_0.25_rep2	high_light_s_0.25_rep3	high_light_s_0.5_rep1	high_light_s_0.5_rep2	high_light_s_0.5_rep3	high_light_s_2_rep1	high_light_s_2_rep2	high_light_s_2_rep3	high_light_s_4_rep1	high_light_s_4_rep2	high_light_s_4_rep3	high_light_s_6_rep1	high_light_s_6_rep2	high_light_s_6_rep3	high_light_r_0.25h_rep1	high_light_r_0.25h_rep2	high_light_r_0.25h_rep3	high_light_r_0.5h_rep1	high_light_r_0.5h_rep2	high_light_r_0.5h_rep3	high_light_r_1h_rep1	high_light_r_1h_rep2	high_light_r_1h_rep3	high_light_r_2h_rep1	high_light_r_2h_rep2	high_light_r_2h_rep3	high_light_r_4h_rep1	high_light_r_4h_rep2	high_light_r_4h_rep3
Zci_00781	6.9957153640180065	7.113609063129584	6.79137752169348	8.31791752042754	7.9295816470145555	8.118417190997887	8.611392773626713	8.649863168050034	8.980958989678504	8.076604641406066	8.280646221135818	8.164445113762739	7.686028422599108	7.984945826134925	7.86078856672938	7.630894602898175	7.715625139761048	7.725403724682322	5.3988823914011	5.069812637709058	5.983088083381157	5.48337704985947	6.070855455916715	5.308077048983647	5.723372966478907	6.422644811420075	6.534013937055654	5.742032378406909	6.849797698180585	5.271786330557966	5.631354631465706	6.240601986440869	5.998521436756015	5.663504229966614	6.256315084757559	6.137299002835339	5.193973887579429	5.925891215004688	5.471169585110807	5.970039121624839	5.10534445738908	6.55397750615335	4.889039696771443	5.347405340831659	3.2306216649875656	5.671437685499365	5.456773039628601	5.866934551720265	4.930291430604112	5.156025067408438	5.649764643356155	5.39719221398748	5.519756789558905	4.62178943717246	4.715756654673042	5.721223203042246	5.545259698128561	5.013571625294982	5.135555288412706	5.812495978488557	3.053244614466514	2.5358755638154906	4.997933354432562	3.456328214968535	3.271759072066952	4.656919253591942	4.389435332093762	4.1102240463093445	4.024618508108668	5.010973217680718	4.774506358155894	4.255269571860756	4.631217443574504	4.519866751557895	4.374929078531266	6.534024582240675	5.713836964380023	5.288602400614554	6.790078850003849	5.917329837692656	6.161314965706802	6.467529666844174	5.813457774873177	6.272681193283808	5.907999760831955	5.658080549959668	5.082886895013204	4.7565100911045635	5.507694756906342	5.024859496836024
Zci_00839	5.848812466007919	7.702928525594243	6.221150019388859	6.431209039990339	6.663442258864842	6.032418593913333	7.133459615077874	7.3068922109057874	7.264960624127587	7.150657118014492	7.539542150375516	8.86084101678744	7.826327376218559	7.824389614130692	8.278539412763836	7.14080883939722	7.37866023393576	8.628884287635996	5.82922689591028	6.76842345844457	5.452426512007415	6.814815905179713	6.292241024456671	6.863166537883303	5.50672717419956	4.980760282947523	5.996408643289116	5.668914639725754	5.223783067407542	5.626453166987894	5.589791495809681	6.575767290154817	5.850538752352478	5.616282848164426	5.3233629718258095	5.698007109599536	5.977792920544731	5.7273683455703575	6.312165640824527	5.2263792708236725	5.550180149642362	6.313321501288413	6.036228243303553	6.599345930697674	7.69833793944794	5.82321946597205	6.903040596905327	6.222805128901499	6.272968899641408	6.997733622171407	6.36065606697979	5.715424969202065	6.139385847393352	7.703362653486667	6.850028619556823	6.099629034564401	6.742435731459819	6.69667127446491	6.476833186266253	5.577159642029444	5.193183021782841	4.853633310557941	5.245239183627224	5.505779702584089	6.587719355415122	5.239925265735177	6.118950512912533	7.231566724238176	7.101220692534327	6.265248803448185	7.737991578338343	7.410067620355703	7.374327489319493	6.739502954797276	6.669181963768452	8.341661095047655	7.570404309478536	6.656299933010533	7.743872038221367	6.738418807715099	7.077324296773931	7.68683880082412	8.841567667187897	7.116356983384713	7.045750117656868	7.155289857681817	7.058783251149357	6.657931433853366	6.502321036894878	6.402907142076403
Zci_00851	2.6170681724369262	3.2651811179397763	2.6239266969202157	2.3210355465086256	2.905667788856219	2.1890225450284	2.4760190667265616	2.916710345155122	2.882411805920376	3.699715326649604	3.631977102890319	4.192387686372171	3.881696635269879	3.576712123273325	4.06988476540959	3.821574427403947	4.064728076295795	3.636853031967413	2.4420358988170783	3.469050427652334	2.7580110581226513	3.1059132001542396	2.8354671114953933	2.6195539954914624	1.9967402657902575	2.076868001817162	2.9054070553336695	2.5843106635356916	2.168352912517573	2.4429070742859333	3.4287645606706376	2.575684652457815	2.4312392363293474	1.962833942545413	2.8974203102990974	2.291650444678997	2.916466564566311	2.725250063620112	2.15780484629391	2.3020466803079347	2.1772019178959496	2.674984218491462	2.019283826035118	2.5835906892107374	2.643226811672468	3.035693414938768	2.340653605279789	2.5830955765740136	2.767847809644626	2.6072836094313847	3.247610329718036	2.1100846701128053	2.413107861919624	2.853805776718631	3.393230311330421	1.355563855643437	3.2558106169917505	3.841392407049818	4.019403408095411	2.809377654205987	1.3743588994642622	1.80457006545636	2.039720118503407	2.561100278316515	2.8544427542770276	2.3319053262149576	2.506904028451891	1.7758849736790738	2.896514464020277	2.4612766845133236	2.042826023318118	2.31853126699952	3.3440071039990813	2.913272536578323	3.1321793327357716	3.2419011081895492	1.1660004896693528	2.493131475509694	2.928573175141087	2.137637568436429	1.776220781203273	3.1203815148737384	2.2494898543119337	2.439933498248278	2.6506450101622736	2.560649608350805	2.3196541673478612	2.0884214294494723	1.8908527307445415	2.2153666372956944
Zci_00889	3.5822017222336484	3.8581786914003344	3.5808825562149234	3.2525981119704124	3.749109185676496	4.518186425698205	3.9560760672188913	4.101383286036306	3.5453720810542557	4.528430793318904	4.859662880067273	3.8336169278922143	4.357194083267264	4.843587256019843	4.518592270543979	3.847445937432013	4.269584105239611	3.984382170528598	3.550111505766024	2.278524897835514	3.548724451147826	3.408140468460437	4.3324749854678	2.7902085827786713	3.855229964172086	3.765563489518131	3.6212892473079408	3.4654480934340697	3.895334416694253	3.00976428772105	4.921016792403621	3.5370931131882526	3.379552074105947	3.711514792336689	1.7615743314418997	3.5986331709913375	3.2662092840032275	2.6313571768275565	3.195029727613666	4.00314105873263	2.702105520581015	4.280163169311293	3.575467412332496	3.9500256992324783	2.695056229752861	4.496328963186743	3.87204758552084	4.056821717883294	3.2119481377024086	3.5258182577477424	4.459037982557217	3.774983240434839	3.3643419225066435	1.7561466776752626	2.700018259973984	3.742799436510888	2.3353624382538443	1.0186866947793107	1.6077976164937955	3.610035153641548	1.38598765067406	1.4602041621739967	2.5146858754295605	3.1527425231913275	2.867827345396755	3.4039737897145703	3.3563372983765727	1.9869661293642584	0.4844791638864184	3.2089733747195464	2.023004121074628	2.4019917991176616	1.5710508201120523	2.1736039794510327	3.3358829612634087	1.176797715232387	2.239679484259231	2.662752782904361	2.445777552733171	2.4058468686050154	1.7426419495930214	2.316064768694793	1.5787196738358744	1.9249563322542973	2.4334512570423295	3.417282266624514	1.8330891847894335	1.780081732126883	3.1583542921399834	1.1910879073772287
Zci_00981	2.823843852481528	2.531185739997612	1.1719181022329022	2.652404644963554	2.84998087173651	3.029453198642551	3.2309196999884127	2.6818289153719053	1.9972555058749768	3.6471191186916454	3.158943243381093	2.8200031922620914	2.988035493627968	4.010241643920955	3.845298653877512	4.077128759556019	4.497992841782423	4.406253700272133	1.6588231120709909	-1.055056069403834	2.854303139958205	1.946018711648424	3.2125246694573257	1.0725930552775955	2.720134149595827	2.6549355492264386	3.101033873445664	1.5085479623708662	3.4945935302663997	0.7638744623632071	3.4226347649250877	1.991903367236501	3.279084138040177	2.7841401340936405	-0.1819876278705123	3.128117115148469	1.152399652154374	1.4530846865854146	1.7799982363346705	3.284057194304802	1.8936544545933096	3.276299632553741	2.6781083400968537	2.952493125909339	1.042529100397234	3.3703860939801293	3.012082575502168	3.110461906679636	2.526968194895564	1.5934431284574393	3.479715201893527	2.3766851501032344	3.1916700751545934	-0.3265460777657257	0.7127694063270775	3.545229191286454	2.245045725281286	0.2185103442644293	-0.0253844890271581	1.193570264898319	-1.5500236060757089	-1.9957464705332824	0.6230269701974046	-0.4740502680455329	0.7299215901968736	2.138776515268722	0.23194625679236952	0.6642814387924735	0.756719388016274	1.20750095177844	-1.5119139105421548	0.08989231038180327	-2.5430353846125557	0.7331414589982889	-0.09361969390401832	0.4799818370675832	0.11330832794288294	0.6901569826620595	-0.8356330845793978	0.96874186502461	0.8007785602528935	1.6382009046222614	1.3327199939276433	1.2592204083555123	0.9653702062974108	1.4449056963248883	-0.24911113418397757	-0.5873466404229588	0.8499759781554954	0.3014292140047273
Zci_01012	6.239003220962836	5.6158429972910415	5.169181086522414	5.824900196960959	5.830790195442339	5.676007065824629	5.571275323721057	5.192733287465933	4.363665510862618	6.641717396003586	6.287474431227273	5.290585049091338	6.482232551523002	6.220266215378385	5.5676115297083895	5.319004579708159	5.481654866764005	5.5640476260377	5.8246053393563235	4.445528788074878	6.735364901491355	5.990621237352581	5.437630632892462	4.25396094450285	6.110358205929525	5.223279790337225	5.436938793100558	6.318285458981236	6.960149980636691	4.489074662620558	7.493512416233691	4.772050416971645	5.227545199579604	5.73946198547014	3.8559406731070727	5.456805882237156	5.680603909854505	4.953763646389642	5.084149660908623	6.790217119432598	5.440157378916449	5.704710341958115	5.2639211242868	5.34032225521642	4.387923953899736	6.532998348549631	5.120495844489515	5.3933081046226015	5.702631586797326	5.511849053204837	5.785150697684965	6.263701126227962	6.317392192733854	3.839870882004956	6.138454026176035	5.543378874447922	4.925144981602731	5.390125578930559	4.52539262898802	5.001876987334523	3.802671223958328	2.6006294691061216	5.334816312328047	4.854742481405538	5.269827450891628	5.895593057989632	5.982773363562924	5.199450439909004	5.270671892114694	6.425515000792306	5.332605477244637	5.69951290859714	4.832938280857497	5.416274195067943	6.434235586627949	5.491685679869119	5.61269066864325	6.193840823092428	5.67700020299956	5.079740692662129	5.861149141628295	5.620146805945685	5.593608297401767	5.83955162819778	5.543948973988361	6.237879759939937	5.519029340196017	4.624522369985108	5.935678609125983	4.92244182448404
Zci_01463	6.83748352383916	6.802377100854843	5.9185344108817866	6.830181995995111	6.714955385796114	6.79096453099429	6.845082978098367	7.04391914574069	6.666791219189791	7.315075314459315	7.447052636708728	7.408158713525022	7.400879800842305	7.137591298455155	7.368191527036794	6.961706968580491	6.7167806963330445	6.827189527031566	6.258729255980784	5.964322121297656	6.657202123733395	6.261067667003788	6.74239446631365	5.725386289037041	6.620090811563304	6.71235530597425	6.610762847032817	6.599629632705913	6.737460272519128	5.998205139217418	6.7339801588630435	6.393574290536289	6.804425832855938	6.484150639036614	4.545022814958109	6.749669080295816	6.271003040101118	5.671414861224377	6.4378422386195595	6.498260873244374	5.672832719768118	7.196270618078262	5.5230415630355925	5.758976136246014	5.02258362560148	5.636050150480053	5.582449253372612	5.99029926415847	4.941979061099553	5.625535800534148	5.665550556399555	5.0756360529903315	5.104579881122897	5.644767755896687	4.821411811321348	4.373147664436502	5.01353000786617	5.994860229084736	5.306550902786647	6.015387996188385	4.916694124352369	4.125501791230007	6.245161162364058	4.913773394229553	5.33826233634626	5.855507392357186	4.96075815706347	4.850588518468686	3.814877199065516	4.97489208602641	5.0470981147385165	4.842898190981771	4.357079993040117	4.720169103082224	4.729816268101773	5.1880320274778935	4.621936920062327	4.944693163142836	6.050552740297307	5.451877528396242	5.21006410251307	6.324710473324199	5.965499613956844	5.667291667817995	6.42032068758205	6.172481463374214	6.040067095569196	5.749685608259976	5.975253335119315	5.927597289381372
Zci_01551	4.642698666672114	5.716461415187586	4.950551679977668	5.96951180514344	5.979756460266314	5.571655692162124	6.718291459313046	6.425635136191214	6.66951500928966	6.102540862812592	5.973942268643845	6.488946620505958	5.764859743438769	5.3411032581376245	5.865635709731296	4.840412168594624	4.337308779957736	4.198682086518475	4.266603539908088	4.245362656123077	4.4666899899561905	3.845664844751003	3.881702175221932	4.399162288206394	3.696410353961983	4.178828913547401	3.710996740850501	4.210539417260692	4.197588420614047	3.2022371739238125	4.141231536362449	4.752464161442161	3.907562726236754	4.266669007863283	3.807966406196044	3.4660853667511993	5.224462480736206	3.943236689788439	4.337406903875881	2.996876518437414	4.938082149654894	4.369998466257396	2.186393782684949	2.2164525161106936	1.3210290867695742	2.042044588297496	2.188517947726647	0.579386132031447	2.043584530053817	1.7931273433805277	1.2639778860529187	2.711497822989658	2.9077053320187143	1.6417457750408684	2.1878528305002347	2.2138127849431584	-0.4856529644667976	1.7662384180474384	2.2494006144836893	1.193570264898319	3.222641100481057	2.3705582529036175	3.2512224982837226	2.4427732132959887	0.06191255780898323	2.292927748603916	2.551069153589695	3.1517421011868314	2.341345409306706	2.986044773559588	2.0288775518876587	2.1390657143982272	1.5288124058993071	1.9934300662215616	2.7288584075132305	2.2836102917476224	2.2973255667001244	3.008093543865283	3.3706169916986197	2.4392046192684425	4.080540795906371	4.182573282596548	3.4631471555255025	3.6553936388028223	4.426327584699787	3.977011628585521	4.155165167022697	4.035779203448937	4.637167473898448	4.544139470089407
Zci_01959	5.226312571568525	5.355472624411526	3.748787745864204	5.088648552986828	5.263727511949475	4.885834366455711	5.324037634867608	5.91734683988483	3.949281883103842	5.4215436243819095	6.209997940548812	4.589700722807643	5.290363478213445	5.9224229409345455	5.58697500617982	6.151753531746433	6.3306192469891105	6.164759990913026	4.283407302012378	3.750840218503291	4.674623483713764	4.986656101679301	5.937341557407148	3.411384042392474	5.004168479137983	5.336571156600617	4.92778805387057	4.679784245575534	5.721490035121603	2.7518697661940443	5.144004347566786	4.304211691258084	4.794813229392726	4.313254633558835	2.202590795094468	5.153635759839369	3.3205739318463143	4.148035623910935	4.343644448072291	4.4538925022017155	3.056646123588239	5.508890402214309	4.106340383007371	4.968492180705096	3.903402149201197	5.049909905810788	4.8438056613672975	4.356942267127792	3.616923568977872	4.811238603308544	4.427213184170255	4.187758233741502	4.3696049515893645	3.742855103667988	4.360779028814573	4.313687843912704	3.614075065502653	2.4835727808566017	2.8492705296102225	3.0609812934365546	1.9207757246373165	1.7121481184180265	4.0763664392727454	2.578013580216754	3.2216989593097805	3.5405376645783355	4.056667529065667	2.336774062716265	2.2940633395856764	3.7596498491661703	3.0678204508363383	3.1353062109978747	3.0664228668238387	2.538838546793491	3.2178724918583916	3.831751193168458	1.0107437848558951	2.7402607736317814	2.5817351242130826	2.451678306364379	2.9542858338154705	3.357399055737624	3.347085996928106	3.09740943383944	3.018796393919837	3.745296484813192	3.1698027238820337	1.9951965668499831	3.967032195938216	3.2168727517878972
Zci_02051	5.197222992111396	5.754979967352081	5.319110325460205	5.56219886985764	6.022613460289522	5.534252101688224	4.909126351409953	5.719652443634086	5.630084530455947	5.428947855068927	5.645169172144485	5.757099446433818	5.94170773904887	5.706534477045557	5.523097530051035	4.137478934885717	5.5223410057026445	5.573290913956463	5.272644180577487	4.843175973222542	5.405639351223588	5.772067787921977	6.036968603507985	5.117164868943985	5.251882708676331	5.807652035571052	5.520133284104576	5.631686072109764	5.8978617530444115	4.773176436248631	5.580483917393938	6.736867183702336	5.719763159400504	5.257734635734426	5.533937512942083	5.501463266014318	5.9675409349410335	5.549519584399918	5.25693181226469	5.134869369656003	5.318061718633032	5.6636571849642605	4.633882191728691	5.050602416284577	4.268467461023007	4.787325763723577	4.189607400428949	4.623597105154729	4.051546739892747	4.538486436369666	4.469206800712362	4.6643653095819415	5.098289888182529	5.498839239878103	4.564758881518768	5.192297641308502	4.806337075027434	5.653383884301468	5.5716855315592975	5.536405596837824	4.112660768257386	3.477693653425332	5.1356056777382	4.167932563352849	4.566368806941064	4.91225800206814	4.650096782710239	4.199361535671403	2.855104079376871	5.379867930034646	4.910627042517174	4.470395481729846	3.8976808358543984	4.494700817474124	4.653370827255146	3.793331279489476	4.345088685632799	4.912636651122286	4.28737337982337	4.512028712809889	5.071140237638337	4.927961533677932	5.696276345880601	5.769396457057895	7.694102486699292	5.96546867549349	6.330037212715945	6.115648951693209	5.550884114738717	6.543495044240729
Zci_02368	5.484773986325542	5.49633697732935	5.304595326077393	6.243091992339034	6.041410493860073	5.9137685550748	6.6889251310603575	6.5009761951080485	6.505615637947204	6.028171767345993	6.129472873406023	5.449614884338503	5.620387582230573	5.456659051551656	5.369912334115584	5.7807575143986725	5.471615793701904	5.335828465532354	5.61599283289297	4.9623453485941065	5.981036595952645	5.367930414093838	5.347076641648021	4.802823697130087	5.63103440015344	5.051042738841349	5.307663323950245	5.4133743371940675	5.282876088520704	4.925443717094071	5.806055323703676	5.101695183742446	5.075494683173371	5.523362881943191	4.486043226797584	4.939945703887947	5.514883777947263	5.768653862963973	5.180887746743297	5.364819339596417	5.305296368452089	4.983523340956367	4.322367857386089	4.3517579341282095	3.6230217895864354	4.7790092666375745	4.657563281569564	4.209510728070378	5.1785175635889376	5.090752671884729	4.404268266604776	5.218517498418821	4.590743807273386	4.418323979440549	5.5501890499335005	5.206646464676852	4.75970638236151	4.528349270851283	4.868457116413452	4.012004931309322	4.89763239457019	2.8754134298067613	5.236046848614899	4.305461215044644	4.828709569202517	4.845609738203021	5.354733265495043	4.3552775188822865	4.7577499431291965	5.346151324273628	4.752022919774231	5.061297157148309	5.383998674456884	4.598322419839023	5.684894655757178	5.686213690873614	5.1783246643857606	5.277131188838896	6.659750752712034	5.285202695609947	5.961038104957939	6.358967423893664	5.890740824815586	5.945726835803	6.002425753609095	6.123997713502231	6.294478751421756	5.549193945064989	5.7101229081135285	6.058660228548269
Zci_02442	4.1447107466158135	4.202175210879989	2.568842088614614	3.3955815933262135	4.56738353718035	4.5736693312978405	3.606447149902473	4.546058675383789	2.673005919425922	4.052264061763445	5.639897661222241	3.0549131866858272	3.4713005183778045	5.496124861688581	4.486595555479641	4.6001929701975754	6.0132107814444815	5.986852553013312	3.092237751997412	1.2742333558762766	3.4814722725746603	3.8934386854782574	4.603245169293246	2.742771174393667	3.698171313186065	4.702110348368378	4.6952199402362265	3.796565290765215	4.756310742095448	1.919022957192445	4.795865132813475	3.939010226442275	4.440632308959177	2.912859129367436	-0.1819876278705123	5.282533550805536	1.553515911767935	2.7002266634630536	3.761171174676579	3.571824533179607	3.1788062674389375	5.014157013952133	3.819548299504772	4.794821050720377	1.9390795320372145	5.1660872165116505	4.776245415772981	4.713271492664604	4.121593436696079	4.338923215677778	5.417304459841654	3.9982291219499864	4.24473149826747	1.368536982704489	2.8712551336378684	4.984356190985045	4.051263355114741	0.9675259721023516	3.486231378277611	1.193570264898319	-0.29385915357764375	-0.5590166527851497	1.714863366977883	2.0726181183297863	1.808737112973891	3.5359419915103407	3.920115287497308	1.146540160611847	0.7111073061913578	3.4682263090218033	1.4160369624913347	1.8460584382856997	0.9319840409916674	1.8114951532619996	2.4961997446685955	1.158746544429356	0.530175455827614	1.8165332065807496	1.847435660096131	1.4213186403111735	2.6654324846064683	2.005742564033835	1.9225369493530484	1.95768480575442	0.9100796046794964	2.6345204428024487	1.297356472501526	0.08809485370974644	3.4455862917849487	0.6689516157650417
Zci_02645	4.084729118511406	3.8982007490067487	3.506861913303621	3.530890255300252	4.479940841928325	4.4634609535774095	3.8981880449121022	4.616909688291869	3.828882140352784	5.041229224162374	5.453408211597703	4.924954227942759	4.753542082773312	4.431562717953522	4.716425321778018	4.379526709883654	4.208968741775384	4.083786503954377	4.571899186268045	2.6958285400495683	4.873231268103419	4.90390879182995	4.748356767604727	4.059061356719141	4.4766312191863005	4.677619657675384	4.973188310059311	4.28446936999178	5.94166937362143	3.567892486866576	5.690582598287255	3.086013261940374	3.5612023302290345	3.784152375037727	1.2671903635641857	4.591581685157683	4.041599223816331	4.165133118498265	5.009265846895677	3.6290723833553793	2.7082462382486416	4.553288476285601	3.8516169231688	3.950478045291523	3.978859043928688	5.002475331229752	4.177375098441779	3.5192256801741397	5.268013461475196	5.713460105320094	4.487849941430074	5.305146503505955	4.1580722708363975	5.523863907067526	5.286183757188587	5.065898697685822	4.502788002450808	6.256182739395893	6.290541291113197	4.275992845493783	1.818772214885203	-0.01779998470313438	4.227669524769718	3.7652359484290847	3.7673731348280786	4.761626307387179	5.566061604111114	4.136527910003688	3.9710797250153593	5.660939989020857	4.47564608414853	3.923557476324108	4.484235035513214	2.813223871277623	5.121168910292134	3.635271250072408	2.388875111033902	4.926552540070335	3.9779156235533337	2.6126643401492387	4.81681930229074	4.248281515861189	5.091697305384389	5.038724181132113	2.9122421382713615	5.442418173229351	3.988291933511982	2.4300058872542993	5.222214133873792	3.7250301571474376
Zci_03090	6.0776941181774795	7.35784716965011	5.699376788293091	6.037102545994346	6.988034426389774	6.371818826823843	6.254416194077809	6.883868158653059	5.68359515901466	6.537474238516088	7.19291425061625	6.657829494722336	6.789756946126737	6.24583050655109	6.483278267872712	6.282556971107602	5.956495641405498	6.651069061376466	6.553425190761434	7.041312491774915	5.844150737175212	7.034173962638682	7.130144106879742	5.912425117243379	6.541617273371975	6.430564952916597	5.845637853242031	6.6065456496486235	7.153541301826537	5.529109064846338	7.144756433151469	6.6463597927513725	5.551216736357931	6.270503803160597	5.746535340581584	6.1377770103351414	7.138492693114484	5.938716839979912	6.167867883671659	5.770310977428465	5.113524342917579	6.709868986127827	5.921882732052779	6.125014821102287	7.049751841571855	6.359525150278699	6.077601043604004	5.649949329733897	6.143990843493982	6.429899878998887	5.891576922294783	5.935828174323163	5.61656345875579	6.2089429656606185	5.861382318804093	5.604064169844917	5.952069066924592	4.778089723132741	5.375860035467502	4.183621754406606	5.339926241348739	4.289775074454135	5.797324825945464	5.9744039517764	5.950356656642008	6.109008570169828	6.622912383500669	5.485491454140429	4.573959494977268	6.374385934186024	5.648896062514445	5.558866052415306	5.196038271170128	4.396290856886577	5.714200382871299	5.637208874996303	4.805150803231875	5.664583070567587	5.3123935534577464	5.125615909437779	5.4340136567016195	5.600889392357134	5.9092015694244555	5.897383559831413	5.564183760509252	6.455755740379842	5.9713950669422795	5.625914164260562	6.393562003105535	6.011753771772842
Zci_03211	3.156093515158362	4.341606210527411	2.9375449464330563	2.6163375128443382	3.568769470632509	3.702510467057213	3.0291691211627256	3.367981674373906	2.6860649465455366	3.311964251916395	4.326928471000639	4.153447875855025	3.919930976218632	4.4235261994080055	4.104472988808108	2.29531159034049	3.49253632031113	3.629166995724996	2.4590139852847837	3.569617125709454	2.636040712675724	3.17986746634349	4.205040922632759	2.633151429505241	2.8847055746741166	3.2175934773287467	3.812591001980904	3.234963749282594	3.6630188500644834	2.3919157418259607	4.154447052723615	3.1214804252079724	2.349075002639148	2.6891383447445016	-0.1819876278705123	3.586214607221381	3.704759401116533	2.4492563775663188	2.600798433274252	2.7045225551598704	1.6382671860907554	4.202426830286274	2.199347378785561	3.1472029581526324	2.555646705946216	3.4876042331333243	3.1341644552721912	3.833921223870876	2.8887608854545372	3.024624376981051	3.105181052686404	3.350283075515243	3.5247312789784897	2.562618631654495	2.894493707144328	3.883942687382006	2.8663307875616835	1.5546550049160837	3.6631224164500904	2.6546939194595156	1.030118297828814	1.60390603662166	1.638831604499536	2.082256427263573	2.514603099867198	2.7280337919098754	3.656284989217165	2.44671766731558	-0.3129745629333702	3.323330253306505	1.8416868944515088	2.8390827625242654	1.7184034969999908	1.6141650689775922	3.270723446928016	1.115470066253577	2.508448884906542	3.4241211381129912	2.1871887124920475	2.0172735838017304	2.7389267861267337	1.9798206151759112	3.010853898406031	2.7382581844379374	2.66923951768612	3.3506762684245768	2.487356949348399	2.067560601850163	3.532114731708891	2.063332838228785
Zci_03578	4.827842621319011	5.66728263544774	5.481945291126252	5.078511630559425	5.907909726140876	5.686753933331601	4.876216581736303	5.471962522668192	5.809314511742455	4.977879528944954	5.528232866224742	6.141193104144136	5.131064627480917	5.423243496215585	5.715137961859719	5.033798909265829	5.438189599136098	5.861712253551408	4.973380803978254	5.182854387969739	5.455759434926886	5.715651675383257	5.263322567798358	5.793101355137086	5.074179081623356	5.399862796126719	5.924972639199805	5.229183786722772	4.74815213016636	5.571713899165449	5.192502753652393	4.425638926783387	5.849587245944015	5.172345743546425	3.1854785366165	5.54902978531584	4.584092619959014	4.380657740523519	5.739147420820729	5.421462547523091	4.210106404383481	5.310516739351055	5.369265990775315	5.996120522769288	5.786057773252642	5.325327975207268	5.853978175949104	5.9423182067113265	5.386577344753749	5.71252869621802	6.059423612039257	5.35734036696213	5.531316425729541	5.589342113882228	5.015706663981429	5.826629972344853	5.796968654624124	3.6225323902486126	5.259190519510673	4.86310436687066	4.364721216072051	3.727600451147117	4.880101670158588	4.525279227204731	4.947677226145538	5.093589581589245	5.143407454455816	5.335019602762153	4.754898427609686	5.1423385416986696	4.913947061201033	4.936285980731762	4.310601942386517	4.525478039617299	5.33275034301923	4.051648005569643	5.1236537671489515	4.770054539193974	4.0115394899806915	5.043765036710413	4.759696118689182	3.982802894753797	4.347413309445103	4.935963261412603	4.3422954547835	4.781252212363379	4.092380215099235	3.2654849491128655	4.30497052985745	3.6280112029045144
Zci_04257	6.293906617949507	5.956060483280941	5.089872588392242	5.715481235298309	6.070184413350247	6.445595515882792	6.151671037476634	6.456471101416784	5.248834693896031	6.766686086794012	6.8192268408515995	5.5569155850408025	6.805771866425496	6.314985263540854	5.944255121775627	5.422905402739471	5.707920336794592	5.49645899406266	5.471656423868379	3.5388303538798307	6.068809904515861	5.336913125668059	6.397218590713422	3.874416964885149	6.578307256390182	5.986866987308217	6.0546971710448085	5.415102654588965	6.540692434994217	4.315797159251236	6.576330086816407	5.007433557798092	5.358746620556262	6.1637054802341265	3.0249588026059686	5.855828031767205	4.809434127964004	4.23071566031144	5.35877471410112	6.313801028537453	4.2013507159914365	6.473609317218039	5.816412633462078	5.297737408746095	4.685568020133586	6.046557045546145	5.963029262992651	5.962337007460878	5.989030273937579	5.402621317250174	5.88374665959182	5.8091476727775	5.400390238642082	3.178061842079968	5.2307420910051095	5.575760291618691	4.622896480439931	2.5586971403283507	2.9355812727659725	3.845739673733774	2.3295767302617683	1.303518648661404	5.183757260151467	4.512266649566493	5.208132149811027	5.732067978896347	5.903204030563782	4.552480294575236	3.756008829069672	5.4148660113976526	4.485195199888147	5.322187722803982	2.865593349093784	3.9792924206073694	5.382790598610108	3.397565565518735	3.7185117899523026	5.271687659607	4.187242500201015	4.289708814504549	4.724786100343799	4.1266791575660715	3.8593938094553937	4.0777692567045944	2.8739146468941916	4.908667979145183	4.265295951745497	2.4559388326464213	5.2716867414285105	3.45903448798701
Zci_04856	3.258052555658766	3.4987984124442595	3.375216908051262	3.470041133986566	4.061668797339197	3.575431049781766	3.5031306501599264	4.258541366429261	3.7829739155462665	3.5649897797161274	4.033781704777137	4.064548919996516	2.0560984751437053	3.952859179867834	3.5108447656675197	3.3822202224793725	4.126850838010948	4.3714671595930215	3.1174941869066664	3.1445365065921975	4.110688029893061	3.854840281002677	3.702728812260964	3.5684671322230153	3.1548944635536964	3.659814021998894	3.729759178504122	3.656616967245343	4.261951438410811	2.4536433374752917	4.058663986921878	3.4281493348037264	3.683751490611793	3.473746449550436	1.8407459102050692	3.5981281200402857	2.4758019256471853	2.342096180043197	3.4789784413399167	3.428075432118642	2.831268694758762	4.177872418011318	3.0594150540165677	3.908514178618895	3.491822193550795	3.2642893055129707	3.979969997297348	3.325358785659922	3.166905469126239	3.8554444702510944	4.16339338602473	3.867195693688895	3.5755203828635556	3.3591316830467073	2.7134378944052773	3.8206331692962343	2.4098808302967476	1.8525842239336263	2.3732090171132714	1.193570264898319	1.5629921859186342	0.5519741070898407	3.037527499490286	0.9193519410788216	2.00683827887502	2.6983868156176984	2.883154203310209	2.569539337201915	2.0227607448713107	2.9924867328825724	2.9924867328825724	2.351693721549472	1.143274659483307	1.5090130136176962	3.6441146305233607	0.8783964350620177	2.5407705206672393	2.942939340117596	1.86595674522376	2.087667868546746	2.589234329862941	1.583308401777242	2.1546359869467024	2.9475012351372687	2.004338572815401	2.7518604831345836	1.9666881903666935	1.481383097427646	3.0066758747015965	1.6998001945326906
Zci_05672	4.991623455197647	3.95042742930669	4.879841074187453	4.514426387016975	4.93970825463986	5.388734376177578	4.0951306688186015	4.54087248078514	4.217584302460377	5.02637825766764	5.276089703090243	5.107333158294234	4.987573173975715	5.096017416544918	5.492117002643282	4.1630729574927035	4.651118112955072	4.531343177225387	4.739950537713088	3.51600711296325	4.780929269254004	4.612009688076762	5.162848703159	3.6678341596706385	4.829915208958005	4.528999343488319	5.165971709054616	4.688914250361904	5.873559143996961	3.0493277429578582	6.119858705991016	3.920260242665184	4.6499107506415065	3.788741748893135	2.5129886398089507	5.0247128342531235	4.316384952031486	3.599162888139807	4.872211957466011	4.820916114986223	3.6772955941833847	5.445839797641474	4.288894908954558	3.8452575397974553	4.252661196841142	5.837052593579807	5.081942570384076	4.541063950313659	5.2501595686928155	5.371425859796538	5.380378413575781	5.20516305946315	5.451073840076642	4.277693055933487	4.713486140313333	5.1500227998870685	5.000044029737034	5.343879454939805	4.692758185926008	5.4458703708783585	2.0560718268593545	2.33232718318761	3.5617808411563927	3.692852191095643	3.807253790133816	4.69526124380621	5.580164708660554	3.9657028428128656	1.9837561030047917	4.861574428436079	3.238706516045103	3.6771797193732705	3.578906145965903	3.580846728179597	4.681688764580479	3.065661745081372	3.249609064284978	4.351601564761777	3.6026485944541027	3.89284295578227	3.738783063324645	3.579608126541887	3.9340047328787255	3.952896437265865	3.6203469852301873	5.203356041407817	4.046602599173062	3.500180027823737	5.123623771249646	3.6099928622877377
Zci_05674	8.300707311153872	8.018575336943844	7.519518574964151	8.205515118060957	8.449316631640555	8.69848377864109	8.212169532036391	8.558809735980242	7.701620253043723	9.065373703502484	9.340720829938816	8.605202644312294	8.518876481384087	8.373008570915601	8.845992418149695	7.795027401265472	7.813133153570536	8.438891575105872	8.323796034655743	6.867779195638429	8.858750691462985	8.858750691462985	8.61617027918845	7.506343378955351	8.502967571527444	8.797929799383835	8.972230281802329	8.670727845986532	9.564787123663894	7.586604843227329	9.912108623341569	7.4650760734055694	8.286789871401226	7.9075631317128225	4.304596691584976	8.722642778506923	7.496699973833537	8.06620725716582	9.20641775807407	8.591280891082297	6.632184574030447	8.902180534255516	7.648967488304979	7.841928125742161	7.625826287406967	8.519667148577154	7.923080516197514	9.000665557909201	8.516424771526554	9.100706489410792	9.499731623447532	8.777670514271616	9.703711170842771	8.780645652141944	9.045040022664809	9.530990414304544	9.63216367388585	9.404712621847777	10.084335697182606	8.968531781339061	6.1544056972249646	4.44462484004389	7.936607691967612	7.584312102390448	7.35560681975845	8.559306543929063	9.120595065622709	7.639372183964476	7.099001646053684	9.193053460991534	8.079461165952909	7.843258061535261	7.583526551541123	7.513826171775241	9.010467844564012	7.491975978903086	7.870737726748468	8.575349396667821	7.188527262562719	7.84774948503654	8.638511619496407	7.9127374949778595	8.39713316948367	8.803797465145525	7.960065163764517	9.39792064834071	7.529703810607803	6.246058430951372	9.13648473363783	7.540160295678772
Zci_05675	6.199616157128863	6.266840387061855	5.991719426650923	6.264463966492297	6.872903586055732	6.886582904969475	6.41898518461819	7.0008231764848965	6.316706760774428	7.491682137625392	7.488028996679788	7.2018890836632	6.891849649988247	6.951938512899054	7.128722306584571	6.632175783582868	6.453011490343827	6.646204759817484	6.581898361110072	5.356186207027618	6.977210053409567	7.171557211745279	6.826698920301188	6.1030474164072235	6.720556659362165	7.242635986273164	7.368945522970145	6.7895377729691795	8.04443497821991	6.246097445969977	7.696883491408351	5.396808474571797	6.098600498366879	6.174920614191531	4.342835871011344	6.8972958172688426	5.735738820154498	6.621360575902698	7.420677497048676	5.535088626031508	5.646193579887404	6.72759413084405	5.850204724709616	5.888934743917198	5.87255730804322	7.034565919227131	6.380505573954314	5.987235930439417	7.102016469412015	7.717672312871826	6.756370716571615	7.138896435328887	6.435794078508035	7.208237489552647	7.346189035403916	7.0149063151968125	7.013062449523238	8.002773165777763	7.512031842449119	6.309501889945624	4.418989293342552	2.931358017232789	6.195860372396803	5.729665117162441	5.490017263191834	6.59378259271582	7.345712348653562	5.694814712267898	5.392742602517531	7.276415471154528	6.4525233312584245	6.289677116670977	5.577824942621932	5.597982404263228	6.747196892406758	5.393871861411377	5.2011712477378005	6.702538950572226	5.329216636792784	5.205731763178935	6.651873990553184	5.811019249658222	6.949570088711215	6.902658520077453	5.421179005770653	7.428909720181126	5.859201994847028	4.185856984424372	7.410826455614975	5.840020774754127
Zci_05703	0.2789236604773595	2.033807409868624	1.2811843909009413	1.128333882061685	2.238253332298437	2.605609356229804	-1.1355309349852087	2.4769989096262632	1.8450644076199627	3.2240382251410935	3.487535871268714	2.766708345486149	2.7450725336585915	2.55732674516807	2.5155527409953047	0.162684456054613	1.658742771619509	2.389950478388696	1.565664605951092	0.9498394817583056	2.7037367852002196	2.630596156303727	2.5033079535288048	1.5574340912815363	2.5664152322356046	2.0975835614657043	3.196426189958832	1.118576183490602	3.4483675579236053	1.82325393263046	3.3817736329072625	-0.2877067020874789	0.6627936648400435	-0.10521819077837816	1.8563443988115749	1.4937651188236585	1.320572826077974	2.320981713226072	2.947624669322254	1.1286764609323063	0.16103652928783563	2.297520380581373	1.2611510756879591	1.03545755623144	1.5043515756351784	2.6729756179255353	1.9496768731337808	1.3055805879648186	3.759640251593644	4.346226088392703	2.4096554592193096	3.4799493950708076	2.3569506193526344	3.449362704710749	3.4019498860942137	2.6718260021577223	2.5935581142620263	4.368879976622568	4.020697463009123	2.055362189885315	-0.3282277744104871	-1.9957464705332824	1.6118864455103594	-0.17501375902341187	0.21504419456077764	0.9537623446603172	3.524421840797066	-0.2723406631573666	0.15815222429462042	3.387678108958129	2.0960318388834622	1.1029909205105888	2.157826157326345	0.7245415424289575	3.0903712107889856	1.49620990784217	0.8783964350620177	2.7515994868675495	0.6176806867199153	0.2876702424115382	2.3879917119995144	2.116985837429415	2.7455596649432135	2.8152950558130256	0.6963559907508675	3.1014726752272472	1.4492475630483332	0.9720950699803812	2.3491707892649316	2.515607738125713
Zci_05861	4.240975773667136	3.3073165590720075	2.0090129063750486	3.713211929136701	3.3093734003186683	3.8469585706243414	3.082301614709363	4.00592132421935	2.249410201424804	4.076637032702242	4.830546376738974	2.3290585703777302	3.803923371207885	4.318931119171276	3.912624125547513	3.8508037786543623	3.9252544300900714	4.363463134060482	2.694737452806811	1.2082330326037634	3.590747334721456	3.023377489065316	3.986009678859292	2.3207845634343283	3.400125641634718	3.828776179203223	3.867050262551671	2.5940857658918337	4.5589437485943485	1.8054317904825463	4.148072709036885	3.131141982077152	3.482381263122806	2.5899219090343517	-0.1819876278705123	3.8885076831637986	2.0393753989576986	2.7784133639505546	2.1125847516180514	3.413723809096847	1.922677156597341	4.0742815988788355	2.965407865331995	2.948805227994038	0.920756418126194	3.9005481637382178	3.6754952164268393	3.983240457386071	3.526779343827643	3.3362995203483674	3.5536613621167463	3.5619978249931084	3.481022345311626	-0.07619605802000638	2.1732564340824103	2.283287811940515	2.4740459391387697	2.3057606090623457	-0.0253844890271581	2.3959878503571934	-1.4527858453005889	0.38845050512541784	1.303518648661404	1.5116337679201886	2.4555354043281796	2.6264864189984887	2.7646240464485294	1.5149887899674432	-0.6778651428131963	3.729581473295625	1.504098351682574	2.6856339556463493	1.3933370751539136	0.34497397248609357	2.2045271622751303	1.4867762595317824	-0.25796715329100894	1.952954057371589	1.6076265872469602	1.9541764632675416	2.4392046192684425	2.1949310789997063	1.2427804999691665	2.288211344266037	1.977736835375572	2.3802364922821924	1.6671455163606923	1.1716925928222544	2.484328632034359	1.679605587126999
Zci_05895	5.825066976842398	6.143488778836492	6.2563335960650415	5.805535822702176	6.625600659242534	6.754847626498654	5.419221203406671	6.439212638785985	6.234704272519944	6.065655809638288	6.425916648422549	6.614687090273611	5.620840285888221	6.6865301313190075	5.861939436961524	5.880077963932343	6.304721407417217	6.736855113256864	5.7851153256124155	5.7812669296604	6.039144213924603	6.634829666993748	6.650841847597373	6.011084052532361	6.008192334547703	5.994798595116654	6.389694057772333	6.029658452422894	6.039348968995708	5.8886765525083815	6.436946145082332	5.778555639646823	6.3131585068157	6.012666364176524	5.145905401512539	6.5257742420157205	5.555454654153556	5.46663522025081	5.960741766898514	6.030215546630561	5.475796373719506	6.691409727344277	6.162411338795235	6.698524457790793	6.734505412572552	6.322829969537361	6.479726670984481	6.408918959064689	5.777942932685493	6.276900071967814	6.570796953193377	6.100327573296004	6.19271548445927	5.733537984104913	5.377491867517766	6.252825595916272	6.0719339713380736	4.449587634564881	5.190237242078875	4.628944019326564	4.9403479655131175	4.189179510641581	6.00190316275943	5.339125976335842	5.700383695043773	5.9843254382724105	6.262819769882245	5.615824420517774	5.190516578146313	6.073183908936852	5.653251395762164	5.636314516055693	5.054505741290068	4.808662448402313	6.238662088187521	4.7301959675076874	5.216386900343005	5.804794874712776	4.922704403926518	5.515800923468237	5.73330390353579	5.009514750316305	5.629618812910059	6.019077491488753	5.398932789546084	5.735816111460434	5.276539676458682	4.550650031548665	5.648274917143377	4.7575373369426845
Zci_05907	6.024348027848743	5.02650664682541	5.218311043081646	5.36991748690598	5.64764761993884	6.033351714796609	5.725583507183904	5.900025744401042	4.759980414640049	6.439941168757832	6.550645313355379	5.816492561447827	6.440690252448329	6.080041424461202	5.946778613213196	5.706530287689345	5.589159105288948	5.519436734373863	6.016578422901311	4.546649733520573	5.89251825798951	5.585535020515295	5.8560316434984045	4.059731398614245	5.86319010093616	5.307663323950245	5.602093337066331	5.3525282386127255	6.9268384036945445	4.676580204349892	6.802196785172287	4.792326797977712	5.026430374782702	5.352951774101568	2.8962417141138603	5.296399139110747	5.49217659519499	5.249243931425727	5.321760973452392	5.938121105000353	4.328422046409793	6.243699766958916	5.006969826784541	5.032638239739773	5.035240164841348	5.952516455806626	5.585062800970981	5.301508175897096	5.691055273777726	5.552821828053148	5.51555626621197	5.4697867817837045	4.960944873372201	4.844367267737284	4.920189186309163	5.442943598266056	5.304328068497878	5.5716855315592975	5.254755739238413	4.08971657469728	3.7949297618413977	3.0159393872618026	4.935428109313709	4.69101924580991	4.471067619209757	5.775921494647967	6.199393023789035	4.786001004485479	4.07814331405623	5.478484719571659	4.602665331175468	4.510167101339064	4.654463612551595	4.084252459839178	5.464534643084147	4.613613099586847	4.6320527251257015	5.171504726800723	4.958637423957266	4.348648985009421	5.00750190152522	5.177488522398559	5.1655254207388275	5.247213728174374	4.7488049003717014	6.256062753606815	5.380207798829803	4.41343180473239	6.100011408218887	4.642205824510904
Zci_06753	5.764157136001681	5.947160806509373	5.211805932292798	6.224491469723117	6.304315170761307	6.283260255359568	7.285389194660885	6.82368356756072	6.794929020075458	6.926577882120171	6.633746526168038	6.661021423241674	6.689235150311626	6.548010012780148	6.1737841279680294	6.799847633990036	6.542127649678458	6.7591216569130195	5.14064622011285	5.1664330872042425	5.7587645645384935	5.529556150287091	5.869429920873467	5.170130485275288	5.573143702990317	5.926436467041567	5.321507392814993	5.801272682076614	6.232201013362767	4.664723137854357	5.383285170284673	6.179478574049419	5.581745158102441	5.59534629527065	5.86880199573338	5.584633255149477	5.227393845857499	5.447271660577531	5.681009485260372	5.537891554935746	5.458479942141815	5.788719197449919	4.680007851045172	5.050157467743327	4.232336202969997	5.093789044518761	5.343012048679205	4.93028236031433	4.830414725334685	4.731931597061782	5.067683391904615	4.225007399070753	5.122820928245661	4.97674645435493	4.899422746852542	4.829405473941468	4.69810303462313	4.840163387851879	4.813827969056512	4.50651757884869	4.299895649908627	3.260728354286711	5.156607950903708	3.7565873754706383	4.014154029144423	4.727012175197803	4.441694939562689	4.137129504186472	2.766682489350399	4.466807217191934	3.8172656095109425	4.054012539913489	4.423430067674771	4.164715838417317	4.322053678532506	4.806351982703481	4.659791004035231	4.804755354817342	5.9793447031976195	5.30637746551317	5.8752234811633635	6.33965088953381	6.031204896378369	6.378728521131983	5.632686949556575	5.497357440218545	5.5616849212392685	5.105392735356535	5.29067152904057	5.8999092607529615
Zci_08145	4.358282208028921	4.125572290747126	3.044184803591793	4.3805867722259615	4.769181097907425	4.839070911168452	4.24785893075884	4.725679281653843	4.007110268278132	5.0562340149787355	5.344958472374165	4.896490123764442	5.455023058295946	6.0166802019695185	5.080328659763436	6.4438941755250365	7.0550444294865615	6.577591632970373	3.906160770699927	1.8367687658263243	4.078103777244242	4.122106553821699	4.978922241415386	3.1853734229079316	4.274380253759142	4.243517696623806	4.633493603450947	4.398954440340253	4.837879889488275	2.7952074327500727	4.533768295537508	3.192789753876618	4.309667465861561	4.141907418043689	2.006817586153151	4.658381342933205	2.873028644838663	2.97079874997925	3.5514031356375786	4.163752560018751	3.905302072106774	4.084858871812001	4.037731927655106	4.381166768320013	2.0665304964587192	3.895012227912329	3.785074362010284	4.272372561397353	2.3335446309192887	3.614318749842688	3.731029179119014	2.6135096099940336	2.945084744933105	2.4899351267299976	0.1550416696822077	2.72981387078933	2.7532869595026392	-1.34908707108409	-0.0253844890271581	3.3516093638666167	1.484987472580525	0.07420114418119997	2.9703631219837363	1.0425673682858545	2.7046749836789594	3.0775136970034724	2.48863808408092	1.0724724319124188	-0.34015646238222536	0.6605005260194708	1.1991745611425435	0.7573752013023273	-0.30451466083727696	1.1885606343687194	0.6373449189079672	0.29059951745123136	-1.131522476211048	0.3806508426795056	-0.00114266150906695	1.8494004045352073	-0.5502323903371469	-0.6600603798138511	1.3165108973431343	-0.2967670481755708	2.8376922691667725	2.2039009517010193	1.9323458315855129	1.9468224312639744	3.112469567889128	2.193995657623522
Zci_09052	3.044184803591793	3.23130616043274	2.8396974774318005	2.681730861488843	3.530347992658948	3.1639176710266876	3.145587357952971	3.7245760033142288	3.0455502778895114	3.484810936595922	3.148619701893428	2.802093838977012	3.614427980056108	3.549250810107942	2.3802088361996026	2.8832853394225615	3.077657181455219	3.110134222733325	3.0894001426187407	3.005792419063964	2.4882094719061048	2.892630510221638	4.0545620490027465	2.767264229484108	2.8700636321933612	2.8692915500879494	2.9556330866727603	3.0493277429578582	3.6158836464801487	3.3070282796514214	3.802963961526974	2.2889696084693782	2.519949472644048	3.1473130541317436	2.279626961800814	3.3474666007507756	2.5275648691573682	2.353369174191525	3.09898407662912	3.3218358799057492	1.932612252370586	4.368759282868455	3.4003644594826388	3.0519313255167217	3.625867869114201	3.376429288002677	2.7753181998211596	3.4183123045173778	3.3362995203483674	3.3559599734830745	3.59419058306215	3.1536208339074734	3.4225353672875407	2.596385208211139	3.0248292481652657	3.5628074183056992	3.539376884038887	3.0219676842702836	2.2778625056901896	3.533171168553069	1.9437745099769568	1.685335996680628	2.375292848274592	2.327842306653594	2.542201916801191	2.6859592979666194	2.800267629734391	1.8659238987837807	1.7591347894982392	3.0341386764634244	2.428144987340177	2.297539552436668	2.3910456716842847	2.460566767179673	2.956212916445265	2.697094195569232	2.2083046134867206	3.0128545879161193	2.1651127737035956	3.1706834447630707	2.333636906924275	2.238009427957978	2.536472183247715	2.545738860499399	2.114842533087608	2.3455164118177594	2.4490227951964747	1.7655981228279598	2.407603785640396	2.2854308644649
Zci_10718	6.085794894590526	4.563702989877367	5.446668074160353	5.910312010783875	5.713162782205987	5.972828978909802	5.104271618179252	4.816821176675133	4.1584704930529455	6.6385575395153475	6.161433482028627	5.16876987543657	6.387822302031475	5.408193816395968	5.835985458500916	5.088772370304206	5.229690063391454	5.600117199647122	6.231254578728586	4.48126982468365	6.540342079095673	5.583404894951532	5.099641779109832	4.62397380082648	6.085827763082349	4.951343335289135	5.952923701550367	5.876125921398615	6.885842588436807	5.7155211544796805	7.2084054985671315	3.94471442443466	5.282489688042972	5.268792697658798	1.703929804715869	5.290975972849875	5.198169349297439	4.6216718358139754	5.305594920629554	6.866491627069063	3.610469046666736	5.756689480644628	4.577779871972231	4.264300095489937	3.982199683420717	6.019799221760206	4.889602624843468	6.093638087518246	5.159538548234783	5.220839890291895	5.536610366970424	6.237743681185432	6.099907505673735	4.772748459191791	5.168166761422446	4.913592825412904	5.454832208889347	6.704355182750601	7.251012468450922	6.42729161860836	4.028940453100776	1.6885771393578686	5.133895492389881	5.558119942104473	4.684026384424912	6.000753463434137	6.420614524159357	4.912940722325491	4.730101784400074	6.777982271432666	5.099173747902738	5.5525122721078075	5.024318973681038	4.578155292929983	6.238218678237951	4.393462083658684	5.662208638447356	6.18181403964369	4.6037530379945055	5.546278838793518	5.16978376188039	5.908691962796845	5.532840976297046	6.215527212424606	6.460004377058061	6.413708660357432	4.894041281074541	5.002488064299303	6.667342316870116	4.8910950826981265
Zci_10805	3.964956334716105	4.143270871499369	2.985541389801625	3.502765569304716	3.9830427488146	3.560095622867773	3.419240659977311	4.156009737745652	3.417782357700475	3.798429346122768	4.295841028631365	3.233061485787307	3.694380276377276	4.017680565880092	4.158496378107498	3.97758739096267	4.488443197632951	3.6965381656711456	1.8337060497029347	3.106631802012678	3.504170514040793	3.8211535309176896	4.046150050520652	3.1457361595245317	3.8908207398939583	3.734149676677604	3.787181010353627	3.6129841150190463	4.547676901916952	2.1444602144068763	4.260922430452387	3.013016616470514	3.8319259072967977	3.239161007098097	2.315956041669601	3.5372755052506464	2.1316566243023924	2.3616898916897613	3.553016499942486	3.70405426236372	2.8345586228266546	4.158165110536771	2.6862031016956	3.5204845633818858	2.62058487998058	4.040437339109805	3.786815718767151	4.071781149231698	3.634995788904946	2.9707339888251343	3.1785162643859626	3.631813885680446	2.648768229760905	1.227242824438298	1.820366408736523	2.655080976538355	1.905312730136341	0.9221366823974004	-0.0253844890271581	1.193570264898319	1.4524313199646153	0.5334640507278698	2.7068855995697514	0.9420110417752444	1.950516714503929	3.0709356780830985	3.137666543044502	2.049048816596404	1.3921568325813056	2.7757321889220874	1.7259737165823603	1.6158476487169582	1.3464568797400849	0.5267986689116452	1.592201546037656	1.5979533887494932	2.117995248044491	1.883559598234519	0.8084630369513823	1.5871339026514577	1.9437221068146584	1.788777873614451	1.1248051126893128	2.8508752442540053	1.3139440817617236	2.2635902805163095	1.3139440817617236	1.3033059043513353	2.262092887273901	2.0474601464703044
Zci_11132	3.4847983071378956	2.443728664652331	1.5494047039076788	3.089527781784711	1.626669483124949	2.9104815374289807	2.737587804085307	1.2670515766757076	1.662489753459238	2.902229313233662	3.088740064497192	1.0626321635108078	2.697812151424906	3.275739157924329	2.4995933307252645	2.3152690291665037	2.973482141997848	2.00616579300694	2.2469389711858345	1.1818845009080698	3.634629262238679	1.4523025759473691	1.743983070747926	1.6588231120709909	2.9029655937295766	1.965099574001038	2.3915006305026645	2.40974155336855	3.545862622688789	2.175760457592848	3.724941777129872	1.5586705503660845	3.0435864389660554	2.1204762164858213	-0.1819876278705123	2.5790566227617595	1.3047849906220377	1.1039518646544555	1.5716331139132236	3.220992209344986	0.4914990808832866	2.808985963475867	2.411641725375685	1.5043515756351784	-0.8730627424728719	3.817956090325374	2.56141850546038	2.4788432952519392	2.3204171263993216	2.9891930298217027	3.2874460646820296	3.415031449265005	4.001582058359575	0.9420855999182508	2.225793855822892	3.982008937744741	3.248738123521909	2.6586480066107274	1.5906555001030045	1.193570264898319	-0.01779998470313438	-1.9957464705332824	1.7186477477531648	0.5361782532921344	1.634442901537152	2.618121832662076	3.1964234462707095	1.7591347894982392	1.7794648569410774	3.897358341320621	1.9090474082066444	2.285274786664718	1.4877748922932588	1.6061194215646457	2.705259717461478	1.864965512224332	2.3436558368258287	3.1706193366722473	2.101972454573993	2.9638900763883456	2.483236818092738	1.983073986986665	2.3369345711271388	2.3305523183227774	2.956180915792306	2.4303855289283676	3.2079874792702907	1.459962999212554	2.2854308644649	1.391266308965058
Zci_11137	3.38309070679144	3.710905050389588	4.5232739116630585	3.362013502817683	4.062928588123702	3.978676523159612	4.944941169603342	3.4223075140459116	3.7596484901929808	4.464094012287748	3.992646565229488	4.698519864434533	4.702648034650792	3.954066899521554	5.517325904783286	4.867864989851176	4.006187156385972	4.340307020591541	3.350669567000193	3.912601668041275	3.4073890805609257	3.937724078265576	4.399162288206394	3.764359536856776	3.152638442209692	3.097918797749587	4.2645733735455424	4.215803570626846	3.222644039598553	4.720922094967479	3.767919522311941	3.663190060727747	3.743888119593126	4.312198320450209	3.58328039948538	4.127233728921273	3.7219322753053663	3.0243894793349417	4.281604462608811	3.8541514453611208	2.508942587255156	3.923830759978206	3.405359809697521	4.175710285094184	4.040369607192889	3.5464692613154396	3.3800877428659133	3.5003570180151145	3.2457910612458885	2.3712659017826176	3.1036949269570147	2.7178463994127204	2.8026164821062824	2.6301772134915664	3.0234810434574806	2.47894473373539	2.580571484694683	2.345437039730084	1.7253517404055376	2.8320958009371098	1.4459418369794708	2.9565665008756628	3.637280955688583	2.7256743848512888	3.2193274940856376	2.8990158435122937	3.7221016568966334	4.201709822131233	3.340393465617724	3.8372281763264944	3.1570596292964233	4.006457043706352	3.512323998010507	2.0493646547458244	4.116145367202535	3.5032639522829183	3.3127564450301255	3.4293776132812903	3.870027491568041	2.9450017884334088	3.072327224608086	2.8666208853602733	2.8905410706398578	3.523071855755973	4.120133249678405	2.8528155267000455	3.495487313248555	2.3885781429006823	2.7288929398766553	2.9110860152717843
Zci_11842	2.6079952573788145	2.8301122372679792	1.6946529672058577	1.4821838298188346	2.89352011189573	3.2325330637717107	3.146433338713094	3.4988979645103373	2.339488195340225	2.873175789936144	3.4879761609434383	2.8573862502704093	3.528665352936182	3.1540351031310614	3.263985400541295	2.994206964325033	2.4598571586863702	3.1706684156917677	2.1084412783639155	1.5725191465071786	2.489584763951762	3.0978416582593846	3.648959061031461	2.278524897835514	2.966449302003492	3.0389419406668434	2.934487549665336	1.4784087639888197	3.6313936152231414	1.5907960755012291	3.8373390825897182	2.0948716629196444	2.745855249857043	2.920168210337668	1.402197757169832	3.103019155558243	1.1430212111308318	0.7366332448769719	2.2807258247569515	2.5462533914706835	0.8777887190264119	3.4637142799949863	1.8014497802468428	1.7893514871115486	2.325897858985621	2.8324449539455916	2.0240177062917692	2.817020663539781	2.4679828531099157	3.0198680758555625	3.136874296131203	2.331285375268685	2.6054229421565944	2.52457474062464	2.692896845086916	3.322940813423377	2.919316721999117	3.18958046474784	3.6567423388412017	2.408855118291497	0.8871418792375552	0.09116892278001866	1.8505943420370143	1.3473255358217762	1.8612778572854063	2.298699770907494	3.214564015539093	1.9412901158059344	2.2093957181566655	3.3460138857331456	2.743451025548883	2.5316141743673057	3.129858609857011	2.041611259361506	3.613527275189096	2.4988444341722116	2.574507521731087	2.81134772401358	2.9821419188963265	2.221616173380184	2.383920171995689	2.591130570822303	2.3530083199923317	2.895498551362191	2.270404992753845	2.9166312125560356	2.052912028249343	1.4374441180265072	2.1451187167622505	1.5665637385017066
Zci_13098	4.710499366642305	8.672687557247206	6.623241092129918	5.156251633774824	8.364500752292233	5.7405457121926515	5.729327949481307	7.624455195262891	5.1776855662040715	4.777668497501218	7.127455698355293	6.4177656159046075	5.383382484144542	7.090821007017808	5.663566927103338	4.064057366912314	5.639646849317749	7.498565012398904	5.294341922684474	8.071159398322669	4.474482926592614	8.342837189762877	8.516092043768287	7.573595672205732	4.95525429673947	5.379638082223043	5.984364271648627	6.1684343285890755	5.613427031819979	5.78920345626573	5.2454635942070125	4.968491808154803	5.705869802046165	5.828406565444542	2.4998753447713784	5.609831811665847	4.988667511743719	4.130150522731686	5.114771814127274	5.772969889481756	3.225373725042296	6.115112850988564	4.990129156411813	7.843369899116672	8.13450867994257	4.620731291991609	7.899063363630574	5.564001758138686	5.0728403733303224	7.439230725969134	6.366884863523574	5.168140459908086	5.0569496267632	6.857022496108885	5.154208861735226	6.803289915757533	7.682151451974398	7.262886846275758	7.309744784572903	6.47391567414753	3.6593592198661153	3.6505109467844745	4.243339630449878	4.065931210123007	5.823777929958076	4.333613533870502	5.012802154106517	5.691844839184836	4.441694939562689	4.919047394940307	5.606968398033427	4.737147141404993	4.11516702809777	4.626476102225357	4.469932691895944	4.1207114770580455	5.745053169755975	4.546173420801269	4.79971791572635	3.626347678909884	5.089007529563102	4.646739290842594	6.124605276135108	5.011794316916434	4.522758339466302	5.8828479982107345	4.725149319965084	3.8107932101740234	4.654507508262847	3.943125428346804
Zci_13207	2.0638717866101097	1.5262376188791729	1.0796385814812108	1.6307384398804026	2.803184104321304	3.1275336446774347	3.0634766723142395	3.396340818189133	1.6517043727969818	3.1391027367424904	3.656051415939958	2.627773755519771	3.675049059007527	2.473371381223207	2.882165154698409	1.4417611533593164	1.489519185675141	1.7404383733883066	2.4191902208846736	0.1043314015997739	2.2010964846965986	2.013275028395859	3.4870204088971573	0.39667816108358434	3.1972063047041126	2.51194543574236	2.9508693443123626	2.772141101620957	1.3939958741123664	-1.2721895063326576	3.731809496217464	1.9259077714026784	2.12055388410959	2.1717640783724055	0.9316868697469226	2.3459845349091704	0.3693488285688836	1.347580385977173	1.3127375555429026	2.8484856883565746	0.33558016386206296	2.148908277455848	2.6332418927106453	2.100327621945308	2.3977637839764516	3.7540726488607974	3.010341692979132	3.5790165428186405	4.415167448499249	4.634311195347769	3.897888033060928	4.265828304210184	4.022497438284251	2.838038873382173	4.522969551565848	4.4168336952957175	3.0450024850483537	1.3649066732710913	2.0385384172640943	1.193570264898319	-0.254679431047532	-1.9957464705332824	1.3091974615559974	1.644254038730908	2.019389842616208	2.5513971489627045	4.381966985940892	2.877006086943758	1.9792006985392083	4.486303033456943	2.9761985611228092	3.1337050627242005	3.0196305058834443	2.257309080862812	4.0495103007218365	2.2973255667001244	2.465057970882014	3.654734882732864	3.084020258961204	3.025192197506085	4.029894632789839	2.361370763219393	3.4132715430730634	3.674157804488583	2.075559770059669	3.481626026109122	3.388471741239796	1.374835864747736	3.527975067597681	1.4708585165879076
Zci_13479	3.3707167201308654	5.87924608663001	4.274339149981752	3.08392899891006	5.204296247501655	3.5591652435488577	3.553313130528659	4.349049025414914	3.135201093025316	2.9456869935343546	4.243057941929873	4.567108732627749	3.852367488379364	6.059975083157345	2.2290817127353413	2.504443465179589	4.197878437446886	4.370215363494171	3.248216379562344	2.6045433011464216	2.9929082424662936	3.7462008745773065	6.053268438512218	3.149452038959492	2.9373320218734364	3.245962259963107	3.5258312764146384	3.977806935140526	3.471145949522035	4.5185285177591	4.020841373789014	3.868205050544258	3.252152807152677	3.442758901607418	2.880670227053132	2.994949815337279	2.513321499939978	2.575790901829541	2.7590961841691177	4.377712349218859	3.8576472505149866	4.537573594417566	3.506317044739454	5.719785190296632	4.580542301322092	2.819659135807409	5.763447762136231	2.5506000123762753	3.9804885970006496	5.16230910101713	4.658262143004844	3.317323643772069	2.9490611756848812	3.607507601009792	3.863625465163417	4.336073985953693	4.822808429761279	2.272834738374654	3.854220216748853	3.0460253504590904	-0.12670111056128228	0.22058801005571743	1.582084971345471	1.7044001453641473	2.308710197691515	1.395786644076033	2.694908184171176	2.414086103793544	1.3176038795603282	2.636348369559996	1.9760870830218045	2.436628746583295	0.46134371142063735	-0.00154798024570668	1.7293886194517485	1.0848187122972035	1.9917245985014136	1.879392951573727	1.7786828137494883	0.6756804684911069	2.1917915894459625	2.2206574092382505	2.255890324150415	1.1903708393545531	2.4235622653764595	2.655870008807752	1.5659311318470812	1.1876525408398555	1.332878975745378	1.3799293384296134
Zci_13481	3.3707167201308654	5.87924608663001	4.274339149981752	3.08392899891006	5.204296247501655	3.5591652435488577	3.553313130528659	4.349049025414914	3.135201093025316	2.9456869935343546	4.243057941929873	4.567108732627749	3.852367488379364	6.059975083157345	2.2290817127353413	2.504443465179589	4.197878437446886	4.370215363494171	3.248216379562344	2.6045433011464216	2.9929082424662936	3.7462008745773065	6.053268438512218	3.149452038959492	2.9373320218734364	3.245962259963107	3.5258312764146384	3.977806935140526	3.471145949522035	4.5185285177591	4.020841373789014	3.868205050544258	3.252152807152677	3.442758901607418	2.880670227053132	2.994949815337279	2.513321499939978	2.575790901829541	2.7590961841691177	4.377712349218859	3.8576472505149866	4.537573594417566	3.506317044739454	5.719785190296632	4.580542301322092	2.819659135807409	5.763447762136231	2.5506000123762753	3.9804885970006496	5.16230910101713	4.658262143004844	3.317323643772069	2.9490611756848812	3.607507601009792	3.863625465163417	4.336073985953693	4.822808429761279	2.272834738374654	3.854220216748853	3.0460253504590904	-0.12670111056128228	0.22058801005571743	1.582084971345471	1.7044001453641473	2.308710197691515	1.395786644076033	2.694908184171176	2.414086103793544	1.3176038795603282	2.636348369559996	1.9760870830218045	2.436628746583295	0.46134371142063735	-0.00154798024570668	1.7293886194517485	1.0848187122972035	1.9917245985014136	1.879392951573727	1.7786828137494883	0.6756804684911069	2.1917915894459625	2.2206574092382505	2.255890324150415	1.1903708393545531	2.4235622653764595	2.655870008807752	1.5659311318470812	1.1876525408398555	1.332878975745378	1.3799293384296134
Zci_13653	3.8126135625780697	5.0287771948285975	4.485479161310419	4.133964026894456	4.375557016166868	4.40785397195827	4.094184987468946	4.576317988939975	4.629365023759051	4.654935644606695	4.349407284850385	5.376226541115043	4.515206294452018	4.2734613711137	4.712841942773302	4.315026055306475	4.411047346887229	4.566137259367199	3.530239425433178	4.823739482175092	4.274099471547923	4.670161751935953	4.368489561963153	4.756245207205244	4.059231571211877	3.8915322730650734	4.632283139453473	4.638584674158986	4.155595049744975	5.121212976699457	3.9417733266501713	3.951930431856184	4.104167516796232	4.273512050124885	3.2349803708207863	4.334428577500668	4.283628169166277	3.494390793775087	4.56847113490593	3.4795579179767477	3.949075608182997	4.4045437245076196	3.93813110401617	4.084871918826841	4.7822204822308665	3.29518655778099	4.2728621863532075	3.567416149220857	2.97693518097077	3.908743412705994	3.7997451113268927	3.59269008289047	4.106966231298696	2.898581977464401	2.9365472965331	3.827422840572261	2.897065258965087	3.3315226647910614	3.799454148500298	3.231455007935692	2.862992270393649	2.6417199005261582	3.888405148248575	3.4116216723701545	3.561632383344904	3.8384548239145055	3.5049732811964898	3.2820948634820977	2.917541167809665	3.6864626152858904	3.2225160961340795	2.659609136136186	2.3935784666016797	1.952534346640754	3.358149858246136	2.5785469464626747	2.5452170669460323	3.233792092100334	3.0887139302422133	3.0575549429883653	3.583495858738924	3.162537169208509	3.1552170850639483	3.5617204094953068	2.3113871129352006	3.554059961057089	3.1802156990772468	2.40413096392949	3.0603609700742513	3.129388608793477
Zci_14124	4.26064356945459	3.5010342615449312	2.775339958737389	3.331883138661211	4.1809969514310374	4.053330005212495	3.3407549460145876	4.549552377528496	2.8413784424626236	3.917720406740431	5.570862175307833	3.8742927623283343	4.255387006676842	4.845584797137629	4.73179039653038	4.8145492245181085	4.60446380399368	4.704429353689754	2.412215224505443	1.420402331601214	3.3467035000152907	3.970812348437628	4.075701344639571	2.759201377753716	3.3910767384517264	4.116913699968307	4.382927533002064	3.515045351777524	4.841480311288661	2.4550478689759156	3.9751050408171977	3.7904122307072545	3.554789385663146	3.145497481903525	1.5815012929699777	4.617295494827995	2.413765747072668	2.4805933819906243	3.896947303121701	3.7078307592844655	1.535232650646195	4.641772390469681	2.331364831646693	3.6247015228190778	2.4353684633579027	3.951628942700651	3.878030623339537	4.4242488574463765	2.5226490660806133	3.9655978664777978	3.945226463482792	3.2702912982525976	3.674305105957691	0.4689611678468843	2.5344300367306136	3.5633555046602017	3.747467128343253	2.895718945590082	3.495724283641998	3.242128823833915	0.496683716536848	-1.9957464705332824	2.3659939545378763	0.7457829342543426	0.4111189900975848	2.628317116772537	2.8212071206469296	1.2536144301332053	0.8995063675842933	2.9005686797828205	0.7182308228726122	1.0060955369745093	1.1979980910834112	-1.3675494864040871	2.0493646547458244	0.911364328432592	2.103117016856083	0.5420039160028869	1.661376981675028	1.124233414188179	1.3439878371004557	1.283964091398467	1.1643745014130498	1.364166336762897	0.39919632348717227	1.8086714021297183	2.0013886989983547	1.2059752653559614	3.0653033941013317	2.005928607565917
Zci_14463	3.1571573811617033	4.789270020501946	4.552859426266169	3.122036135271618	4.185613009713469	3.707216994590256	2.9812062701266218	3.704361210080032	3.7641787527164703	2.3290585703777302	3.6683096356754983	4.469062838954823	3.1628462700848603	4.049862765275942	3.29429491913132	2.7216265362646865	4.6975304050805535	5.398130720829531	3.385386138326236	4.737567584529593	2.453284925579327	4.299778765109851	4.5265237280789075	4.835969217531774	2.534146088098793	3.107405353813262	3.975289055347966	3.499199390182	3.8508454304373623	4.314959848302628	3.5894776504383032	3.977671830469101	3.804319032197573	3.1798738634635484	5.557256674384075	3.771017831922813	4.497356006760117	3.501502180396256	3.223108113768876	2.557488490019999	3.7469078423274462	4.190610056250963	3.0361475945310645	4.546773201852942	4.299291041297549	3.3428433816887257	3.882976378513337	3.43063090107291	2.918273130264834	3.5242807127454756	3.858894682048138	3.0248939380687445	4.220041754663777	4.195266722642349	4.080083467287925	3.9183703626858746	4.9530131169729925	3.1251372406126627	1.9362550683337096	2.962465349825859	2.3659939545378763	2.463427242423873	2.576561441515382	2.3493415836246765	3.0775136970034724	3.0315899352199316	3.5799158855741577	2.874378804832277	2.0067089816940573	3.4077167358738283	3.440811909418769	2.993901625473434	2.8770418198648344	3.1187716852057674	2.6767202506475476	3.685495412439512	3.3180972958712656	2.9619299966406025	3.377994699375478	3.5568776204911554	2.5175243127527875	3.3970511598181146	3.343303425678061	3.2777160346075975	3.2435896392290067	2.9915029359019147	2.479646652862978	3.206837192664015	3.0778910807441995	2.8335925523381085
Zci_14746	2.4939744605126624	3.175089907961278	3.210553801028331	2.598689048359986	2.757867615406249	3.063501697793763	2.643104480129212	2.6889792732671394	2.9234434827054305	2.874712809790045	2.26402910517212	2.8961195720975237	3.23763279824907	2.5919312618295702	2.0840406249770274	0.8620643117713623	2.734595991456317	1.7028919122537254	1.5820980219836172	1.9206090531371125	2.0074569295221885	2.622614700457365	3.247148424564766	2.3313942246909787	2.398488421736039	2.2035940382575467	2.692710102867616	2.099961845431044	3.4162635886263764	2.374047632202488	2.6139717156574314	1.876167913765754	2.192827185805224	2.821609171292786	1.7537545404362582	2.2481331763942785	0.6752227180557386	1.6657549444005035	2.6980632069168933	2.34416639988888	1.7103961569037005	3.2635114263747367	3.426399699418229	3.3856558856110883	3.1630825330152588	3.613933572209687	3.728269865439089	2.838362058099424	3.392289410455091	2.7904907507386403	3.465024332350571	3.5321094889667832	3.1871795619819054	1.4189093261673682	2.931700900768796	3.9251426344051423	2.190206956712508	2.1497898581038637	0.9370187660464964	1.193570264898319	0.7889376768809074	-0.3282277744104871	2.2962478064778837	2.168087020668234	2.505196015693822	2.2199129241151416	3.4796087305834944	2.183029067372216	2.3886756099337476	3.004540732016202	2.542560100968586	2.32034311989992	1.497081820529225	2.157826157326345	2.47726493007629	1.1094251374295132	2.1610285793758948	2.0651374651473176	1.8086929349246756	2.864493408861769	1.2086591746113604	2.07953867044255	1.6010531743909262	2.163688149985445	0.8980601801334218	1.336250046876639	1.9232769144966169	2.153337722876136	2.514489192461233	0.38639684995348905
Zci_15289	3.2725434422897837	2.4836496045305196	2.836440059120208	2.9825570126367595	3.178188257455973	3.862725601402543	3.794803624701797	3.4881277481935693	3.4281687498411517	4.11857172962548	3.7893940820864778	3.2981689332381325	4.293004681490052	3.4998240105880343	3.1684242634380935	3.320401084820332	3.142866196759776	2.8469639274485017	2.4828171974342363	1.854607477860993	2.8106391887507898	3.255286562772456	2.9679562938325543	2.3486185919443607	3.0775416378625464	2.1366095830057485	2.8585846650528324	2.3039687524287515	3.154229985675323	2.5951625111595993	3.658183467203939	1.5786046773703952	2.8266508045689416	2.5350465410767704	2.2976218226588414	2.8562875171096236	1.1915455207774552	2.2308250238363376	3.0000196756066315	3.0320767167912814	1.5147934274738473	2.828303700240408	2.885179092397153	2.4215471343654476	1.878162971524657	3.857455981098871	2.819299062324658	2.1189140745404895	2.3701686253141214	3.39124531591203	2.9655330484800597	3.289531642507748	3.44188530691372	2.736852771541809	2.4284174608615214	2.574649959814581	1.7615285035197117	1.4920784142944217	2.51592325128611	1.193570264898319	1.2106045413249285	0.13302064930017973	2.2488690301877585	2.1731298768263363	1.7504472756766378	2.8618596196015083	4.207223356660138	2.3871879645928225	1.7456335185227287	3.003135238854598	1.7718057291573044	2.116443754941062	1.752946821677127	1.8205326437938043	3.58016156427369	1.0502642209125597	1.9695302379123525	3.0401459876817363	2.1586029796948205	2.2328299054703913	2.8013407492008	3.233430259151334	2.0772255520235374	2.884486601579055	2.6215337069344784	3.627552144215597	2.1580440627335884	2.329033183803136	3.6747688814611656	2.3795229744950728
Zci_15291	2.4760588901179763	2.5836692026221777	1.4723852294260216	2.384694549023106	2.808035833464424	1.974014855141137	3.2303537302370837	2.7797660789895886	1.597409643159665	3.429788945984022	3.3841028678087968	3.033339191435517	3.42995171501125	2.74422241138893	2.5919312618295702	3.0766792666959804	2.0127832688410128	2.694305524798654	2.494244916286951	1.8585527161675977	3.3956960680997432	2.788527360712932	2.3644698654638208	1.6100803808518382	3.1833585896967613	2.1727965703294254	1.7948298527547513	2.829709031072937	3.4220035581267925	1.540430655091237	4.063485448893048	1.841987727223196	2.1046017275714703	2.012627457479348	1.5927892512209283	1.8022725592126152	2.6442676603830573	2.513895153602188	2.433707382444242	3.1078657833561287	1.6126627430892997	2.263175060198103	1.850782733402441	1.003714691820835	1.7507283590874985	2.7296145122353876	1.456125838384827	2.4820750397612565	1.695986388079444	2.9744753011185177	3.0643760956505037	2.372156898333624	1.2380157266105638	2.575021975132742	2.897065258965087	3.040999785790534	2.6958257624739552	2.9750531522969803	3.884685211446296	1.193570264898319	1.4783417388213589	-0.14257366959233367	0.7889376768809074	2.2541686383695696	1.230565119694805	2.7644232978709695	3.4899346296060294	2.7171311940923086	2.803884808242762	3.1130986230470112	2.033585651873695	2.496683468150278	3.2556460310809805	0.30895898581905507	3.525476688043665	3.3856604730817828	1.7687141537296105	2.753862087111407	3.8072066124710022	2.2950786634372964	3.6026485944541027	3.8328440330644233	3.1373291793725806	3.587040865232708	3.4739918139625092	3.839084966548004	2.862450203953137	2.7061151652154005	3.509368578271801	2.8201227900432286
Zci_15586	3.586825247585495	5.181105457987003	4.724604139185419	3.269289350224574	5.0200008861738015	3.667443313594325	3.5406064581199903	4.750222421096075	4.043264199913	2.8200031922620914	2.852220554231154	3.7036479003685288	2.4638060038366225	1.5174445862359325	0.7596467304635933	2.854692737430774	4.22476027480174	5.683732217693458	4.3106877595361235	4.974184526855253	3.9228389084057578	5.103447909695761	4.809098362284855	4.5878797635015705	3.559896225763864	3.7368464674792015	3.6692705265590138	4.538546326217461	4.405748177201788	3.472327445024634	3.3752601231137676	6.201739382000179	4.169454177359877	4.035698664096691	6.180171596641403	4.073252464929698	4.637268976088366	4.62521197249761	4.526733842336373	2.688176285214691	4.264130794515058	4.157541472213697	1.226873440316551	2.4733039957117695	2.993825532826281	-0.13240099398394237	-0.0957368362689343	-0.1938863716566535	0.7942770491396594	1.4974115394893277	1.9575928452781288	1.7778377293169343	2.2999908699689446	3.542301453687976	1.5364925073496971	1.8838157940421036	2.659278799417443	3.1179559242428834	3.2886728792498205	2.009602865441661	3.5135713307587033	2.325147244365686	3.417715156257284	1.744028708651426	1.8387677115249697	2.2388302114682865	1.706744281290296	0.90902998707293	-0.03831604583536967	2.494982493855842	1.7303707766686989	1.0582304740258024	0.7533383282004643	2.295235228996407	1.9989166475956903	2.0156290259496297	2.2349269020360607	2.169687913545943	2.720363069627066	2.1454434288758804	2.15598509487749	3.0380483256362725	3.2828592789758626	3.2711705936431796	2.8346381688192204	3.7034072759511902	3.4366927494907005	4.5432041561727825	2.985689910640171	3.9618516580736016
Zci_16424	4.235874125784231	4.372758931143742	3.4737570669957587	3.3657327427433743	4.935755995697156	5.032917651690855	4.531692998350621	5.252772480300981	3.5094185668301106	4.795306731511277	6.085741907788035	4.052264061763445	4.893592377657002	5.461628839250688	4.4436321723387975	4.962348697034873	4.917796156158127	4.858672518352516	3.7533501543843046	3.0219272799275276	3.116733808441236	3.9027899788089866	5.1327023337461775	2.9315539948543825	4.581988987970608	4.6667073633889284	4.589389567878349	3.789683553122458	5.2576847270484555	3.500134021339001	4.962560771624183	3.346493185973372	3.9618451367881833	3.1965618840353502	2.2412661117292414	5.227237850312923	2.090572779565027	2.7334168523252034	3.404262153543768	4.15702062769451	3.259499103786392	5.239527494732256	3.592223745589993	4.498024643839071	2.4600498813683953	5.291176497966164	4.580003020118147	4.809997384232231	4.25022815348773	4.708109303323195	4.615071987196815	4.145758062319453	4.983018726334002	3.021089981948358	3.1233419029591385	5.156711391731224	4.949451413566528	3.1550236863192067	3.102020002120235	3.064373666542697	1.7121481184180265	0.582993503456668	2.4045538881585187	3.375608815987387	3.190758739132692	3.4643821645487103	4.069477983381694	2.118913002774566	1.0935159042696498	3.500638750323865	2.7504122556674147	3.27117987183032	2.769358877996365	3.11692926952008	3.6851026353223366	2.2521426516020377	2.726983413082887	3.232887659186022	3.141581918791454	3.3733890381244915	2.7662277364784824	3.260199665621653	2.280768413595053	3.7270708546050546	3.242795681340585	3.671918049109962	3.6332013482158225	2.3202444558516757	4.083695692321618	2.4104025750727027
