nodeName	altName	nodeAttr[nodesPresent, ]
Pp3c1_1240V3	NA	royalblue
Pp3c1_13170V3	NA	royalblue
Pp3c1_15680V3	NA	royalblue
Pp3c1_170V3	NA	royalblue
Pp3c1_19210V3	NA	royalblue
Pp3c1_20690V3	NA	royalblue
Pp3c1_20V3	NA	royalblue
Pp3c1_28730V3	NA	royalblue
Pp3c1_33600V3	NA	royalblue
Pp3c1_34000V3	NA	royalblue
Pp3c1_560V3	NA	royalblue
Pp3c1_8850V3	NA	royalblue
Pp3c10_4400V3	NA	royalblue
Pp3c11_10290V3	NA	royalblue
Pp3c11_15160V3	NA	royalblue
Pp3c11_20720V3	NA	royalblue
Pp3c11_21830V3	NA	royalblue
Pp3c11_2350V3	NA	royalblue
Pp3c11_23980V3	NA	royalblue
Pp3c11_3710V3	NA	royalblue
Pp3c11_4830V3	NA	royalblue
Pp3c11_6970V3	NA	royalblue
Pp3c11_910V3	NA	royalblue
Pp3c12_1270V3	NA	royalblue
Pp3c12_19020V3	NA	royalblue
Pp3c12_23540V3	NA	royalblue
Pp3c12_25950V3	NA	royalblue
Pp3c13_11180V3	NA	royalblue
Pp3c13_11650V3	NA	royalblue
Pp3c13_17100V3	NA	royalblue
Pp3c13_21430V3	NA	royalblue
Pp3c13_21590V3	NA	royalblue
Pp3c13_23280V3	NA	royalblue
Pp3c13_4300V3	NA	royalblue
Pp3c13_4850V3	NA	royalblue
Pp3c13_6960V3	NA	royalblue
Pp3c13_8600V3	NA	royalblue
Pp3c14_11420V3	NA	royalblue
Pp3c14_19550V3	NA	royalblue
Pp3c14_22730V3	NA	royalblue
Pp3c14_23320V3	NA	royalblue
Pp3c14_25550V3	NA	royalblue
Pp3c14_4320V3	NA	royalblue
Pp3c14_4940V3	NA	royalblue
Pp3c14_7840V3	NA	royalblue
Pp3c14_9410V3	NA	royalblue
Pp3c15_10270V3	NA	royalblue
Pp3c15_14620V3	NA	royalblue
Pp3c15_14640V3	NA	royalblue
Pp3c15_14890V3	NA	royalblue
Pp3c15_15270V3	NA	royalblue
Pp3c15_16860V3	NA	royalblue
Pp3c15_18500V3	NA	royalblue
Pp3c15_19210V3	NA	royalblue
Pp3c15_22920V3	NA	royalblue
Pp3c15_23090V3	NA	royalblue
Pp3c15_23590V3	NA	royalblue
Pp3c15_24030V3	NA	royalblue
Pp3c15_24210V3	NA	royalblue
Pp3c15_4340V3	NA	royalblue
Pp3c15_9710V3	NA	royalblue
Pp3c16_10470V3	NA	royalblue
Pp3c16_10870V3	NA	royalblue
Pp3c16_11171V3	NA	royalblue
Pp3c16_11630V3	NA	royalblue
Pp3c16_13660V3	NA	royalblue
Pp3c16_14810V3	NA	royalblue
Pp3c16_16050V3	NA	royalblue
Pp3c16_16550V3	NA	royalblue
Pp3c16_16830V3	NA	royalblue
Pp3c16_18460V3	NA	royalblue
Pp3c16_23730V3	NA	royalblue
Pp3c16_25870V3	NA	royalblue
Pp3c16_6100V3	NA	royalblue
Pp3c16_7170V3	NA	royalblue
Pp3c16_7480V3	NA	royalblue
Pp3c16_8260V3	NA	royalblue
Pp3c16_830V3	NA	royalblue
Pp3c16_9240V3	NA	royalblue
Pp3c17_14660V3	NA	royalblue
Pp3c17_15380V3	NA	royalblue
Pp3c17_15490V3	NA	royalblue
Pp3c17_16830V3	NA	royalblue
Pp3c17_18190V3	NA	royalblue
Pp3c17_19510V3	NA	royalblue
Pp3c17_19890V3	NA	royalblue
Pp3c17_2240V3	NA	royalblue
Pp3c17_5580V3	NA	royalblue
Pp3c17_7570V3	NA	royalblue
Pp3c18_17830V3	NA	royalblue
Pp3c18_19660V3	NA	royalblue
Pp3c18_19690V3	NA	royalblue
Pp3c18_2040V3	NA	royalblue
Pp3c18_21050V3	NA	royalblue
Pp3c18_6350V3	NA	royalblue
Pp3c19_14460V3	NA	royalblue
Pp3c19_16000V3	NA	royalblue
Pp3c19_19860V3	NA	royalblue
Pp3c19_3524V3	NA	royalblue
Pp3c19_4180V3	NA	royalblue
Pp3c19_4640V3	NA	royalblue
Pp3c19_5110V3	NA	royalblue
Pp3c19_5280V3	NA	royalblue
Pp3c2_13790V3	NA	royalblue
Pp3c2_15970V3	NA	royalblue
Pp3c2_20930V3	NA	royalblue
Pp3c2_26060V3	NA	royalblue
Pp3c2_28030V3	NA	royalblue
Pp3c2_29420V3	NA	royalblue
Pp3c2_34520V3	NA	royalblue
Pp3c2_34670V3	NA	royalblue
Pp3c2_36100V3	NA	royalblue
Pp3c2_36860V3	NA	royalblue
Pp3c2_37270V3	NA	royalblue
Pp3c2_4740V3	NA	royalblue
Pp3c2_520V3	NA	royalblue
Pp3c2_5250V3	NA	royalblue
Pp3c2_5790V3	NA	royalblue
Pp3c2_6600V3	NA	royalblue
Pp3c2_90V3	NA	royalblue
Pp3c2_9150V3	NA	royalblue
Pp3c20_15450V3	NA	royalblue
Pp3c20_16000V3	NA	royalblue
Pp3c20_1800V3	NA	royalblue
Pp3c20_18840V3	NA	royalblue
Pp3c20_20250V3	NA	royalblue
Pp3c20_2280V3	NA	royalblue
Pp3c20_22810V3	NA	royalblue
Pp3c20_23180V3	NA	royalblue
Pp3c20_5060V3	NA	royalblue
Pp3c21_10950V3	NA	royalblue
Pp3c21_11130V3	NA	royalblue
Pp3c21_12360V3	NA	royalblue
Pp3c21_14060V3	NA	royalblue
Pp3c21_15140V3	NA	royalblue
Pp3c21_16130V3	NA	royalblue
Pp3c21_180V3	NA	royalblue
Pp3c21_18980V3	NA	royalblue
Pp3c21_7810V3	NA	royalblue
Pp3c21_880V3	NA	royalblue
Pp3c22_12150V3	NA	royalblue
Pp3c22_13740V3	NA	royalblue
Pp3c22_14460V3	NA	royalblue
Pp3c22_14560V3	NA	royalblue
Pp3c22_17230V3	NA	royalblue
Pp3c22_1840V3	NA	royalblue
Pp3c22_470V3	NA	royalblue
Pp3c22_9200V3	NA	royalblue
Pp3c22_9580V3	NA	royalblue
Pp3c23_10600V3	NA	royalblue
Pp3c23_11560V3	NA	royalblue
Pp3c23_13420V3	NA	royalblue
Pp3c23_1399V3	NA	royalblue
Pp3c23_17650V3	NA	royalblue
Pp3c23_20850V3	NA	royalblue
Pp3c23_21090V3	NA	royalblue
Pp3c23_21570V3	NA	royalblue
Pp3c23_21740V3	NA	royalblue
Pp3c23_2890V3	NA	royalblue
Pp3c23_4310V3	NA	royalblue
Pp3c23_5320V3	NA	royalblue
Pp3c23_8670V3	NA	royalblue
Pp3c23_9660V3	NA	royalblue
Pp3c24_14900V3	NA	royalblue
Pp3c24_16380V3	NA	royalblue
Pp3c24_17830V3	NA	royalblue
Pp3c24_18410V3	NA	royalblue
Pp3c24_19680V3	NA	royalblue
Pp3c24_6190V3	NA	royalblue
Pp3c25_10350V3	NA	royalblue
Pp3c25_13870V3	NA	royalblue
Pp3c25_1840V3	NA	royalblue
Pp3c25_2880V3	NA	royalblue
Pp3c25_2890V3	NA	royalblue
Pp3c25_760V3	NA	royalblue
Pp3c26_10570V3	NA	royalblue
Pp3c26_3900V3	NA	royalblue
Pp3c26_7470V3	NA	royalblue
Pp3c26_7930V3	NA	royalblue
Pp3c27_1880V3	NA	royalblue
Pp3c27_2570V3	NA	royalblue
Pp3c27_2650V3	NA	royalblue
Pp3c27_3080V3	NA	royalblue
Pp3c27_3130V3	NA	royalblue
Pp3c27_3440V3	NA	royalblue
Pp3c27_3830V3	NA	royalblue
Pp3c27_4920V3	NA	royalblue
Pp3c27_5480V3	NA	royalblue
Pp3c27_5490V3	NA	royalblue
Pp3c27_60V3	NA	royalblue
Pp3c27_6310V3	NA	royalblue
Pp3c27_7710V3	NA	royalblue
Pp3c3_1160V3	NA	royalblue
Pp3c3_11900V3	NA	royalblue
Pp3c3_14330V3	NA	royalblue
Pp3c3_14980V3	NA	royalblue
Pp3c3_17650V3	NA	royalblue
Pp3c3_18760V3	NA	royalblue
Pp3c3_19510V3	NA	royalblue
Pp3c3_23880V3	NA	royalblue
Pp3c3_24530V3	NA	royalblue
Pp3c3_25080V3	NA	royalblue
Pp3c3_26120V3	NA	royalblue
Pp3c3_27720V3	NA	royalblue
Pp3c3_2990V3	NA	royalblue
Pp3c3_30210V3	NA	royalblue
Pp3c3_32250V3	NA	royalblue
Pp3c3_32420V3	NA	royalblue
Pp3c3_37260V3	NA	royalblue
Pp3c3_37470V3	NA	royalblue
Pp3c3_5910V3	NA	royalblue
Pp3c3_5940V3	NA	royalblue
Pp3c3_7450V3	NA	royalblue
Pp3c3_8960V3	NA	royalblue
Pp3c4_10940V3	NA	royalblue
Pp3c4_12350V3	NA	royalblue
Pp3c4_13140V3	NA	royalblue
Pp3c4_15510V3	NA	royalblue
Pp3c4_17890V3	NA	royalblue
Pp3c4_20230V3	NA	royalblue
Pp3c4_23550V3	NA	royalblue
Pp3c4_25760V3	NA	royalblue
Pp3c4_26460V3	NA	royalblue
Pp3c4_26740V3	NA	royalblue
Pp3c4_27460V3	NA	royalblue
Pp3c4_28250V3	NA	royalblue
Pp3c4_32350V3	NA	royalblue
Pp3c4_4360V3	NA	royalblue
Pp3c4_540V3	NA	royalblue
Pp3c4_6590V3	NA	royalblue
Pp3c4_8340V3	NA	royalblue
Pp3c5_10730V3	NA	royalblue
Pp3c5_11390V3	NA	royalblue
Pp3c5_1250V3	NA	royalblue
Pp3c5_14300V3	NA	royalblue
Pp3c5_21130V3	NA	royalblue
Pp3c6_14880V3	NA	royalblue
Pp3c6_15170V3	NA	royalblue
Pp3c6_15520V3	NA	royalblue
Pp3c6_17340V3	NA	royalblue
Pp3c6_17550V3	NA	royalblue
Pp3c6_19010V3	NA	royalblue
Pp3c6_19880V3	NA	royalblue
Pp3c6_20760V3	NA	royalblue
Pp3c6_20960V3	NA	royalblue
Pp3c6_24770V3	NA	royalblue
Pp3c6_260V3	NA	royalblue
Pp3c6_26200V3	NA	royalblue
Pp3c6_26340V3	NA	royalblue
Pp3c6_27380V3	NA	royalblue
Pp3c6_2930V3	NA	royalblue
Pp3c6_4830V3	NA	royalblue
Pp3c6_690V3	NA	royalblue
Pp3c6_8040V3	NA	royalblue
Pp3c6_8850V3	NA	royalblue
Pp3c7_12200V3	NA	royalblue
Pp3c7_12990V3	NA	royalblue
Pp3c7_14950V3	NA	royalblue
Pp3c7_20020V3	NA	royalblue
Pp3c7_21340V3	NA	royalblue
Pp3c7_23020V3	NA	royalblue
Pp3c7_23520V3	NA	royalblue
Pp3c7_25280V3	NA	royalblue
Pp3c7_7030V3	NA	royalblue
Pp3c7_800V3	NA	royalblue
Pp3c8_13930V3	NA	royalblue
Pp3c8_15640V3	NA	royalblue
Pp3c8_15800V3	NA	royalblue
Pp3c8_16590V3	NA	royalblue
Pp3c8_1940V3	NA	royalblue
Pp3c8_21830V3	NA	royalblue
Pp3c8_22340V3	NA	royalblue
Pp3c8_24330V3	NA	royalblue
Pp3c8_25010V3	NA	royalblue
Pp3c8_3670V3	NA	royalblue
Pp3c8_9650V3	NA	royalblue
Pp3c9_11700V3	NA	royalblue
Pp3c9_12070V3	NA	royalblue
Pp3c9_23190V3	NA	royalblue
Pp3c9_25750V3	NA	royalblue
Pp3c9_5060V3	NA	royalblue
Pp3c9_5280V3	NA	royalblue
Pp3c9_8480V3	NA	royalblue
