1	NA	NA	1	NA	NA	1	1	NA	NA	NA	1	NA
1	NA	NA	1	NA	NA	1	1	NA	NA	NA	1	NA
0.9824272377814388	1	1	0.9453471196454948	1	1	0.934092758340114	1	1	1	1	0.9617834394904459	1
0.9918495297805643	1	1	0.962280701754386	1	1	0.9660194174757282	1	1	1	1	0.9736540664375716	1
1	NA	NA	1	NA	NA	1	1	NA	NA	NA	1	NA
0.9639289678135405	1	1	0.981638418079096	1	1	0.9791827293754819	1	1	1	1	0.9641255605381166	1
1	NA	NA	1	NA	NA	1	1	NA	NA	NA	1	NA
1	NA	NA	1	NA	NA	1	1	NA	NA	NA	1	NA
1	NA	NA	1	NA	NA	1	1	NA	NA	NA	1	NA
0.9943622269203665	1	1	0.999000999000999	1	1	1	1	1	1	1	1	1
0.9611081513052744	1	1	0.97719651240778	1	1	0.9357034795763994	1	1	1	1	0.9802306425041186	1
1	NA	NA	1	NA	NA	1	1	NA	NA	NA	1	NA
0.97911227154047	1	1	0.9938162544169611	1	1	0.9980372914622179	1	1	1	1	0.9893238434163701	1
