"","x"
"1","Me1_v2_0097240"
"2","Me1_v2_0084280"
"3","Me1_v2_0066110"
"4","Me1_v2_0095600"
"5","Me1_v2_0136180"
"6","Me1_v2_0234500"
"7","Me1_v2_0128930"
"8","Me1_v2_0032520"
"9","Me1_v2_0124320"
"10","Me1_v2_0186220"
"11","Me1_v2_0057060"
"12","Me1_v2_0051770"
"13","Me1_v2_0228900"
"14","Me1_v2_0141560"
"15","Me1_v2_0051780"
"16","Me1_v2_0229780"
"17","Me1_v2_0110530"
"18","Me1_v2_0151130"
"19","Me1_v2_0204360"
"20","Me1_v2_0178430"
