"0","# Temperature"
"0","pca.res.df <- pca.res$x[,1:6] %>% # note that this is the first time you've seen the 'pipe' operator from the magrittr package"
"0","  as_tibble() %>%"
"0","  add_column(sample = sampleLabels,"
"0","             time_meaning = time_meaning)"
"0","  "
"0","pca.pivot <- pivot_longer(pca.res.df, # dataframe to be pivoted"
"0","                          cols = PC1:PC6, # column names to be stored as a SINGLE variable"
"0","                          names_to = ""PC"", # name of that new variable (column)"
"0","                          values_to = ""loadings"") # name of new variable (column) storing all the values (data)"
"0",""
"0","ggplot(pca.pivot) +"
"0","  aes(x=sample, y=loadings, fill=time_meaning) + # you could iteratively 'paint' different covariates onto this plot using the 'fill' aes"
"0","  geom_bar(stat=""identity"") +"
"0","  facet_wrap(~PC) +"
"0","  labs(title=""PCA 'small multiples' plot - Time"","
"0","       caption=paste0(""produced on "", Sys.time())) +"
"0","  theme_bw() +"
"0","  coord_flip()+"
"0","    theme(axis.text.y = element_text(size=2))"
