nodeName	altName	nodeAttr[nodesPresent, ]
Pp3c1_120V3	NA	purple
Pp3c1_14300V3	NA	purple
Pp3c1_1530V3	NA	purple
Pp3c1_15830V3	NA	purple
Pp3c1_16170V3	NA	purple
Pp3c1_18400V3	NA	purple
Pp3c1_20190V3	NA	purple
Pp3c1_22300V3	NA	purple
Pp3c1_22490V3	NA	purple
Pp3c1_24020V3	NA	purple
Pp3c1_24280V3	NA	purple
Pp3c1_24600V3	NA	purple
Pp3c1_25330V3	NA	purple
Pp3c1_26280V3	NA	purple
Pp3c1_27980V3	NA	purple
Pp3c1_28770V3	NA	purple
Pp3c1_28780V3	NA	purple
Pp3c1_29770V3	NA	purple
Pp3c1_30130V3	NA	purple
Pp3c1_30360V3	NA	purple
Pp3c1_31520V3	NA	purple
Pp3c1_3170V3	NA	purple
Pp3c1_31750V3	NA	purple
Pp3c1_31760V3	NA	purple
Pp3c1_32310V3	NA	purple
Pp3c1_32330V3	NA	purple
Pp3c1_32490V3	NA	purple
Pp3c1_32570V3	NA	purple
Pp3c1_3480V3	NA	purple
Pp3c1_35460V3	NA	purple
Pp3c1_36180V3	NA	purple
Pp3c1_36220V3	NA	purple
Pp3c1_37420V3	NA	purple
Pp3c1_37460V3	NA	purple
Pp3c1_3770V3	NA	purple
Pp3c1_39960V3	NA	purple
Pp3c1_41760V3	NA	purple
Pp3c1_4290V3	NA	purple
Pp3c1_4400V3	NA	purple
Pp3c1_5330V3	NA	purple
Pp3c1_6180V3	NA	purple
Pp3c1_6650V3	NA	purple
Pp3c1_7010V3	NA	purple
Pp3c1_70V3	NA	purple
Pp3c1_7500V3	NA	purple
Pp3c1_7710V3	NA	purple
Pp3c1_8290V3	NA	purple
Pp3c1_8820V3	NA	purple
Pp3c1_9780V3	NA	purple
Pp3c10_11120V3	NA	purple
Pp3c10_14250V3	NA	purple
Pp3c10_15180V3	NA	purple
Pp3c10_15670V3	NA	purple
Pp3c10_16090V3	NA	purple
Pp3c10_16400V3	NA	purple
Pp3c10_16880V3	NA	purple
Pp3c10_1896V3	NA	purple
Pp3c10_20040V3	NA	purple
Pp3c10_20240V3	NA	purple
Pp3c10_20400V3	NA	purple
Pp3c10_22840V3	NA	purple
Pp3c10_2350V3	NA	purple
Pp3c10_25371V3	NA	purple
Pp3c10_2900V3	NA	purple
Pp3c10_3010V3	NA	purple
Pp3c10_360V3	NA	purple
Pp3c10_5730V3	NA	purple
Pp3c10_5840V3	NA	purple
Pp3c10_7370V3	NA	purple
Pp3c10_7980V3	NA	purple
Pp3c10_8030V3	NA	purple
Pp3c10_8090V3	NA	purple
Pp3c10_8510V3	NA	purple
Pp3c11_1100V3	NA	purple
Pp3c11_11070V3	NA	purple
Pp3c11_11980V3	NA	purple
Pp3c11_13140V3	NA	purple
Pp3c11_13480V3	NA	purple
Pp3c11_13860V3	NA	purple
Pp3c11_17260V3	NA	purple
Pp3c11_17280V3	NA	purple
Pp3c11_21740V3	NA	purple
Pp3c11_21750V3	NA	purple
Pp3c11_22030V3	NA	purple
Pp3c11_22199V3	NA	purple
Pp3c11_22580V3	NA	purple
Pp3c11_23050V3	NA	purple
Pp3c11_23480V3	NA	purple
Pp3c11_23610V3	NA	purple
Pp3c11_2530V3	NA	purple
Pp3c11_2540V3	NA	purple
Pp3c11_2550V3	NA	purple
Pp3c11_26740V3	NA	purple
Pp3c11_2820V3	NA	purple
Pp3c11_2840V3	NA	purple
Pp3c11_2940V3	NA	purple
Pp3c11_3050V3	NA	purple
Pp3c11_3360V3	NA	purple
Pp3c11_3390V3	NA	purple
Pp3c11_500V3	NA	purple
Pp3c11_5840V3	NA	purple
Pp3c11_6420V3	NA	purple
Pp3c11_8070V3	NA	purple
Pp3c11_8940V3	NA	purple
Pp3c11_980V3	NA	purple
Pp3c12_10200V3	NA	purple
Pp3c12_10760V3	NA	purple
Pp3c12_10870V3	NA	purple
Pp3c12_14250V3	NA	purple
Pp3c12_15480V3	NA	purple
Pp3c12_1680V3	NA	purple
Pp3c12_17690V3	NA	purple
Pp3c12_18020V3	NA	purple
Pp3c12_18350V3	NA	purple
Pp3c12_19360V3	NA	purple
Pp3c12_22870V3	NA	purple
Pp3c12_22890V3	NA	purple
Pp3c12_23570V3	NA	purple
Pp3c12_23580V3	NA	purple
Pp3c12_24790V3	NA	purple
Pp3c12_25030V3	NA	purple
Pp3c12_25070V3	NA	purple
Pp3c12_25120V3	NA	purple
Pp3c12_3390V3	NA	purple
Pp3c12_3430V3	NA	purple
Pp3c12_4340V3	NA	purple
Pp3c12_4490V3	NA	purple
Pp3c12_5640V3	NA	purple
Pp3c12_5760V3	NA	purple
Pp3c12_7770V3	NA	purple
Pp3c12_8281V3	NA	purple
Pp3c12_8780V3	NA	purple
Pp3c12_910V3	NA	purple
Pp3c12_9180V3	NA	purple
Pp3c12_9600V3	NA	purple
Pp3c13_10550V3	NA	purple
Pp3c13_10770V3	NA	purple
Pp3c13_10810V3	NA	purple
Pp3c13_10840V3	NA	purple
Pp3c13_13850V3	NA	purple
Pp3c13_19470V3	NA	purple
Pp3c13_19780V3	NA	purple
Pp3c13_20020V3	NA	purple
Pp3c13_20320V3	NA	purple
Pp3c13_20520V3	NA	purple
Pp3c13_20961V3	NA	purple
Pp3c13_21710V3	NA	purple
Pp3c13_22220V3	NA	purple
Pp3c13_2360V3	NA	purple
Pp3c13_23630V3	NA	purple
Pp3c13_4310V3	NA	purple
Pp3c13_5200V3	NA	purple
Pp3c13_5831V3	NA	purple
Pp3c13_6570V3	NA	purple
Pp3c13_7030V3	NA	purple
Pp3c13_7350V3	NA	purple
Pp3c13_8000V3	NA	purple
Pp3c13_8360V3	NA	purple
Pp3c14_10480V3	NA	purple
Pp3c14_10580V3	NA	purple
Pp3c14_13110V3	NA	purple
Pp3c14_13580V3	NA	purple
Pp3c14_14060V3	NA	purple
Pp3c14_14670V3	NA	purple
Pp3c14_15670V3	NA	purple
Pp3c14_15700V3	NA	purple
Pp3c14_17310V3	NA	purple
Pp3c14_1810V3	NA	purple
Pp3c14_19960V3	NA	purple
Pp3c14_20090V3	NA	purple
Pp3c14_21790V3	NA	purple
Pp3c14_22920V3	NA	purple
Pp3c14_25160V3	NA	purple
Pp3c14_25170V3	NA	purple
Pp3c14_26060V3	NA	purple
Pp3c14_4100V3	NA	purple
Pp3c14_4160V3	NA	purple
Pp3c14_5500V3	NA	purple
Pp3c14_5880V3	NA	purple
Pp3c14_7880V3	NA	purple
Pp3c14_9070V3	NA	purple
Pp3c14_9190V3	NA	purple
Pp3c14_9430V3	NA	purple
Pp3c14_9600V3	NA	purple
Pp3c14_9650V3	NA	purple
Pp3c14_9970V3	NA	purple
Pp3c15_100V3	NA	purple
Pp3c15_1150V3	NA	purple
Pp3c15_12830V3	NA	purple
Pp3c15_14110V3	NA	purple
Pp3c15_14410V3	NA	purple
Pp3c15_14860V3	NA	purple
Pp3c15_15980V3	NA	purple
Pp3c15_19270V3	NA	purple
Pp3c15_21470V3	NA	purple
Pp3c15_21510V3	NA	purple
Pp3c15_21670V3	NA	purple
Pp3c15_21800V3	NA	purple
Pp3c15_22240V3	NA	purple
Pp3c15_23260V3	NA	purple
Pp3c15_23760V3	NA	purple
Pp3c15_24010V3	NA	purple
Pp3c15_3750V3	NA	purple
Pp3c15_3940V3	NA	purple
Pp3c15_4420V3	NA	purple
Pp3c15_4550V3	NA	purple
Pp3c15_4620V3	NA	purple
Pp3c15_5240V3	NA	purple
Pp3c15_5860V3	NA	purple
Pp3c16_10400V3	NA	purple
Pp3c16_11400V3	NA	purple
Pp3c16_11440V3	NA	purple
Pp3c16_11470V3	NA	purple
Pp3c16_1360V3	NA	purple
Pp3c16_14220V3	NA	purple
Pp3c16_16070V3	NA	purple
Pp3c16_16970V3	NA	purple
Pp3c16_1720V3	NA	purple
Pp3c16_18300V3	NA	purple
Pp3c16_20070V3	NA	purple
Pp3c16_20180V3	NA	purple
Pp3c16_21700V3	NA	purple
Pp3c16_22430V3	NA	purple
Pp3c16_22830V3	NA	purple
Pp3c16_23890V3	NA	purple
Pp3c16_25170V3	NA	purple
Pp3c16_2730V3	NA	purple
Pp3c16_2860V3	NA	purple
Pp3c16_2870V3	NA	purple
Pp3c16_3760V3	NA	purple
Pp3c16_410V3	NA	purple
Pp3c16_5320V3	NA	purple
Pp3c16_5480V3	NA	purple
Pp3c16_6640V3	NA	purple
Pp3c16_7980V3	NA	purple
Pp3c16_8580V3	NA	purple
Pp3c16_9210V3	NA	purple
Pp3c17_11570V3	NA	purple
Pp3c17_12510V3	NA	purple
Pp3c17_13300V3	NA	purple
Pp3c17_14060V3	NA	purple
Pp3c17_15200V3	NA	purple
Pp3c17_15280V3	NA	purple
Pp3c17_15690V3	NA	purple
Pp3c17_18800V3	NA	purple
Pp3c17_19100V3	NA	purple
Pp3c17_20170V3	NA	purple
Pp3c17_22180V3	NA	purple
Pp3c17_22190V3	NA	purple
Pp3c17_23590V3	NA	purple
Pp3c17_4670V3	NA	purple
Pp3c17_5110V3	NA	purple
Pp3c17_6410V3	NA	purple
Pp3c17_8370V3	NA	purple
Pp3c17_8470V3	NA	purple
Pp3c18_10200V3	NA	purple
Pp3c18_11930V3	NA	purple
Pp3c18_13160V3	NA	purple
Pp3c18_13930V3	NA	purple
Pp3c18_14440V3	NA	purple
Pp3c18_15190V3	NA	purple
Pp3c18_17510V3	NA	purple
Pp3c18_1920V3	NA	purple
Pp3c18_2090V3	NA	purple
Pp3c18_2100V3	NA	purple
Pp3c18_21900V3	NA	purple
Pp3c18_3000V3	NA	purple
Pp3c18_640V3	NA	purple
Pp3c18_6860V3	NA	purple
Pp3c18_7140V3	NA	purple
Pp3c18_7850V3	NA	purple
Pp3c18_8640V3	NA	purple
Pp3c18_8730V3	NA	purple
Pp3c18_9710V3	NA	purple
Pp3c19_10130V3	NA	purple
Pp3c19_10240V3	NA	purple
Pp3c19_10330V3	NA	purple
Pp3c19_14290V3	NA	purple
Pp3c19_1440V3	NA	purple
Pp3c19_14710V3	NA	purple
Pp3c19_1630V3	NA	purple
Pp3c19_17380V3	NA	purple
Pp3c19_1800V3	NA	purple
Pp3c19_19270V3	NA	purple
Pp3c19_19830V3	NA	purple
Pp3c19_22480V3	NA	purple
Pp3c19_4900V3	NA	purple
Pp3c19_6490V3	NA	purple
Pp3c19_7610V3	NA	purple
Pp3c19_9550V3	NA	purple
Pp3c19_9960V3	NA	purple
Pp3c2_10610V3	NA	purple
Pp3c2_11210V3	NA	purple
Pp3c2_11250V3	NA	purple
Pp3c2_1200V3	NA	purple
Pp3c2_12269V3	NA	purple
Pp3c2_14140V3	NA	purple
Pp3c2_14570V3	NA	purple
Pp3c2_14610V3	NA	purple
Pp3c2_14930V3	NA	purple
Pp3c2_15080V3	NA	purple
Pp3c2_15480V3	NA	purple
Pp3c2_15910V3	NA	purple
Pp3c2_16228V3	NA	purple
Pp3c2_16490V3	NA	purple
Pp3c2_17370V3	NA	purple
Pp3c2_18620V3	NA	purple
Pp3c2_18930V3	NA	purple
Pp3c2_19600V3	NA	purple
Pp3c2_20020V3	NA	purple
Pp3c2_21110V3	NA	purple
Pp3c2_23290V3	NA	purple
Pp3c2_26900V3	NA	purple
Pp3c2_27320V3	NA	purple
Pp3c2_28500V3	NA	purple
Pp3c2_28510V3	NA	purple
Pp3c2_29010V3	NA	purple
Pp3c2_29600V3	NA	purple
Pp3c2_31480V3	NA	purple
Pp3c2_32050V3	NA	purple
Pp3c2_32510V3	NA	purple
Pp3c2_33280V3	NA	purple
Pp3c2_34080V3	NA	purple
Pp3c2_34770V3	NA	purple
Pp3c2_35190V3	NA	purple
Pp3c2_3780V3	NA	purple
Pp3c2_38210V3	NA	purple
Pp3c2_3870V3	NA	purple
Pp3c2_5820V3	NA	purple
Pp3c2_6100V3	NA	purple
Pp3c2_6336V3	NA	purple
Pp3c2_6360V3	NA	purple
Pp3c2_6470V3	NA	purple
Pp3c2_670V3	NA	purple
Pp3c2_9590V3	NA	purple
Pp3c2_9650V3	NA	purple
Pp3c2_9710V3	NA	purple
Pp3c20_1270V3	NA	purple
Pp3c20_1360V3	NA	purple
Pp3c20_17540V3	NA	purple
Pp3c20_18740V3	NA	purple
Pp3c20_18970V3	NA	purple
Pp3c20_23660V3	NA	purple
Pp3c20_2550V3	NA	purple
Pp3c20_2640V3	NA	purple
Pp3c20_2830V3	NA	purple
Pp3c20_2850V3	NA	purple
Pp3c20_6720V3	NA	purple
Pp3c20_7110V3	NA	purple
Pp3c20_7570V3	NA	purple
Pp3c20_7770V3	NA	purple
Pp3c20_790V3	NA	purple
Pp3c20_860V3	NA	purple
Pp3c20_9330V3	NA	purple
Pp3c20_9510V3	NA	purple
Pp3c20_9770V3	NA	purple
Pp3c21_10520V3	NA	purple
Pp3c21_10580V3	NA	purple
Pp3c21_11200V3	NA	purple
Pp3c21_11230V3	NA	purple
Pp3c21_11350V3	NA	purple
Pp3c21_13430V3	NA	purple
Pp3c21_13550V3	NA	purple
Pp3c21_15030V3	NA	purple
Pp3c21_16500V3	NA	purple
Pp3c21_16780V3	NA	purple
Pp3c21_19110V3	NA	purple
Pp3c21_370V3	NA	purple
Pp3c21_3840V3	NA	purple
Pp3c21_3930V3	NA	purple
Pp3c21_4860V3	NA	purple
Pp3c21_4900V3	NA	purple
Pp3c21_5680V3	NA	purple
Pp3c21_6940V3	NA	purple
Pp3c21_8100V3	NA	purple
Pp3c22_12680V3	NA	purple
Pp3c22_12850V3	NA	purple
Pp3c22_13020V3	NA	purple
Pp3c22_13730V3	NA	purple
Pp3c22_13810V3	NA	purple
Pp3c22_14720V3	NA	purple
Pp3c22_16320V3	NA	purple
Pp3c22_16330V3	NA	purple
Pp3c22_17190V3	NA	purple
Pp3c22_17940V3	NA	purple
Pp3c22_18190V3	NA	purple
Pp3c22_18300V3	NA	purple
Pp3c22_1860V3	NA	purple
Pp3c22_21290V3	NA	purple
Pp3c22_21700V3	NA	purple
Pp3c22_23110V3	NA	purple
Pp3c22_2920V3	NA	purple
Pp3c22_3300V3	NA	purple
Pp3c22_3770V3	NA	purple
Pp3c22_3800V3	NA	purple
Pp3c22_5950V3	NA	purple
Pp3c23_10300V3	NA	purple
Pp3c23_13310V3	NA	purple
Pp3c23_14890V3	NA	purple
Pp3c23_15540V3	NA	purple
Pp3c23_15560V3	NA	purple
Pp3c23_15980V3	NA	purple
Pp3c23_17260V3	NA	purple
Pp3c23_1780V3	NA	purple
Pp3c23_18800V3	NA	purple
Pp3c23_19000V3	NA	purple
Pp3c23_19050V3	NA	purple
Pp3c23_21640V3	NA	purple
Pp3c23_400V3	NA	purple
Pp3c23_6150V3	NA	purple
Pp3c23_8410V3	NA	purple
Pp3c23_9380V3	NA	purple
Pp3c24_10090V3	NA	purple
Pp3c24_11150V3	NA	purple
Pp3c24_15780V3	NA	purple
Pp3c24_15930V3	NA	purple
Pp3c24_18340V3	NA	purple
Pp3c24_18560V3	NA	purple
Pp3c24_20210V3	NA	purple
Pp3c24_20290V3	NA	purple
Pp3c24_2610V3	NA	purple
Pp3c24_3690V3	NA	purple
Pp3c24_5780V3	NA	purple
Pp3c24_7350V3	NA	purple
Pp3c24_8160V3	NA	purple
Pp3c24_8570V3	NA	purple
Pp3c24_9930V3	NA	purple
Pp3c25_10780V3	NA	purple
Pp3c25_1230V3	NA	purple
Pp3c25_1240V3	NA	purple
Pp3c25_1300V3	NA	purple
Pp3c25_14670V3	NA	purple
Pp3c25_8060V3	NA	purple
Pp3c25_8800V3	NA	purple
Pp3c25_9320V3	NA	purple
Pp3c26_10390V3	NA	purple
Pp3c26_11230V3	NA	purple
Pp3c26_11390V3	NA	purple
Pp3c26_11700V3	NA	purple
Pp3c26_11720V3	NA	purple
Pp3c26_14640V3	NA	purple
Pp3c26_180V3	NA	purple
Pp3c26_3000V3	NA	purple
Pp3c26_3340V3	NA	purple
Pp3c26_360V3	NA	purple
Pp3c26_4450V3	NA	purple
Pp3c26_4810V3	NA	purple
Pp3c26_7270V3	NA	purple
Pp3c26_8990V3	NA	purple
Pp3c26_9050V3	NA	purple
Pp3c27_2180V3	NA	purple
Pp3c27_2280V3	NA	purple
Pp3c27_2780V3	NA	purple
Pp3c27_4710V3	NA	purple
Pp3c27_660V3	NA	purple
Pp3c27_6840V3	NA	purple
Pp3c27_7810V3	NA	purple
Pp3c27_8190V3	NA	purple
Pp3c27_860V3	NA	purple
Pp3c3_10260V3	NA	purple
Pp3c3_16720V3	NA	purple
Pp3c3_17430V3	NA	purple
Pp3c3_18440V3	NA	purple
Pp3c3_19100V3	NA	purple
Pp3c3_19700V3	NA	purple
Pp3c3_23220V3	NA	purple
Pp3c3_24390V3	NA	purple
Pp3c3_25480V3	NA	purple
Pp3c3_26020V3	NA	purple
Pp3c3_2800V3	NA	purple
Pp3c3_29950V3	NA	purple
Pp3c3_30930V3	NA	purple
Pp3c3_32710V3	NA	purple
Pp3c3_34380V3	NA	purple
Pp3c3_3480V3	NA	purple
Pp3c3_34910V3	NA	purple
Pp3c3_35180V3	NA	purple
Pp3c3_36580V3	NA	purple
Pp3c3_36670V3	NA	purple
Pp3c3_5550V3	NA	purple
Pp3c3_5600V3	NA	purple
Pp3c3_6080V3	NA	purple
Pp3c3_9770V3	NA	purple
Pp3c4_11590V3	NA	purple
Pp3c4_11700V3	NA	purple
Pp3c4_12690V3	NA	purple
Pp3c4_14160V3	NA	purple
Pp3c4_15150V3	NA	purple
Pp3c4_15350V3	NA	purple
Pp3c4_16040V3	NA	purple
Pp3c4_16120V3	NA	purple
Pp3c4_17570V3	NA	purple
Pp3c4_18320V3	NA	purple
Pp3c4_19060V3	NA	purple
Pp3c4_19180V3	NA	purple
Pp3c4_21940V3	NA	purple
Pp3c4_22190V3	NA	purple
Pp3c4_22880V3	NA	purple
Pp3c4_23750V3	NA	purple
Pp3c4_24610V3	NA	purple
Pp3c4_24700V3	NA	purple
Pp3c4_25170V3	NA	purple
Pp3c4_26070V3	NA	purple
Pp3c4_26620V3	NA	purple
Pp3c4_26640V3	NA	purple
Pp3c4_27250V3	NA	purple
Pp3c4_27270V3	NA	purple
Pp3c4_27290V3	NA	purple
Pp3c4_27540V3	NA	purple
Pp3c4_29150V3	NA	purple
Pp3c4_29930V3	NA	purple
Pp3c4_3120V3	NA	purple
Pp3c4_6140V3	NA	purple
Pp3c4_7240V3	NA	purple
Pp3c4_7880V3	NA	purple
Pp3c4_9730V3	NA	purple
Pp3c5_16070V3	NA	purple
Pp3c5_16080V3	NA	purple
Pp3c5_17000V3	NA	purple
Pp3c5_17300V3	NA	purple
Pp3c5_19450V3	NA	purple
Pp3c5_20870V3	NA	purple
Pp3c5_22730V3	NA	purple
Pp3c5_22940V3	NA	purple
Pp3c5_26410V3	NA	purple
Pp3c5_27080V3	NA	purple
Pp3c5_3870V3	NA	purple
Pp3c5_4280V3	NA	purple
Pp3c5_5210V3	NA	purple
Pp3c5_5280V3	NA	purple
Pp3c5_5330V3	NA	purple
Pp3c5_8110V3	NA	purple
Pp3c6_14680V3	NA	purple
Pp3c6_15160V3	NA	purple
Pp3c6_15220V3	NA	purple
Pp3c6_15470V3	NA	purple
Pp3c6_16040V3	NA	purple
Pp3c6_16360V3	NA	purple
Pp3c6_1680V3	NA	purple
Pp3c6_17640V3	NA	purple
Pp3c6_17680V3	NA	purple
Pp3c6_20310V3	NA	purple
Pp3c6_20660V3	NA	purple
Pp3c6_21480V3	NA	purple
Pp3c6_21770V3	NA	purple
Pp3c6_24550V3	NA	purple
Pp3c6_24680V3	NA	purple
Pp3c6_2550V3	NA	purple
Pp3c6_27040V3	NA	purple
Pp3c6_29020V3	NA	purple
Pp3c6_330V3	NA	purple
Pp3c6_3420V3	NA	purple
Pp3c6_3470V3	NA	purple
Pp3c6_7500V3	NA	purple
Pp3c6_7720V3	NA	purple
Pp3c6_8910V3	NA	purple
Pp3c6_950V3	NA	purple
Pp3c6_9570V3	NA	purple
Pp3c7_10150V3	NA	purple
Pp3c7_11880V3	NA	purple
Pp3c7_14070V3	NA	purple
Pp3c7_14200V3	NA	purple
Pp3c7_1420V3	NA	purple
Pp3c7_15470V3	NA	purple
Pp3c7_1610V3	NA	purple
Pp3c7_17860V3	NA	purple
Pp3c7_17970V3	NA	purple
Pp3c7_18290V3	NA	purple
Pp3c7_20010V3	NA	purple
Pp3c7_20110V3	NA	purple
Pp3c7_20160V3	NA	purple
Pp3c7_20890V3	NA	purple
Pp3c7_21140V3	NA	purple
Pp3c7_21150V3	NA	purple
Pp3c7_21950V3	NA	purple
Pp3c7_21970V3	NA	purple
Pp3c7_2390V3	NA	purple
Pp3c7_2400V3	NA	purple
Pp3c7_25220V3	NA	purple
Pp3c7_2610V3	NA	purple
Pp3c7_26650V3	NA	purple
Pp3c7_26720V3	NA	purple
Pp3c7_27360V3	NA	purple
Pp3c7_2960V3	NA	purple
Pp3c7_4170V3	NA	purple
Pp3c7_5070V3	NA	purple
Pp3c7_5630V3	NA	purple
Pp3c7_6024V3	NA	purple
Pp3c7_6680V3	NA	purple
Pp3c7_6740V3	NA	purple
Pp3c7_7210V3	NA	purple
Pp3c7_7440V3	NA	purple
Pp3c7_870V3	NA	purple
Pp3c8_10910V3	NA	purple
Pp3c8_12030V3	NA	purple
Pp3c8_12060V3	NA	purple
Pp3c8_12080V3	NA	purple
Pp3c8_12230V3	NA	purple
Pp3c8_13030V3	NA	purple
Pp3c8_13880V3	NA	purple
Pp3c8_14510V3	NA	purple
Pp3c8_16130V3	NA	purple
Pp3c8_16820V3	NA	purple
Pp3c8_17050V3	NA	purple
Pp3c8_17731V3	NA	purple
Pp3c8_18010V3	NA	purple
Pp3c8_18450V3	NA	purple
Pp3c8_18650V3	NA	purple
Pp3c8_19000V3	NA	purple
Pp3c8_19190V3	NA	purple
Pp3c8_2220V3	NA	purple
Pp3c8_23290V3	NA	purple
Pp3c8_24130V3	NA	purple
Pp3c8_2740V3	NA	purple
Pp3c8_3780V3	NA	purple
Pp3c8_5480V3	NA	purple
Pp3c9_12170V3	NA	purple
Pp3c9_12300V3	NA	purple
Pp3c9_13230V3	NA	purple
Pp3c9_14720V3	NA	purple
Pp3c9_15370V3	NA	purple
Pp3c9_15380V3	NA	purple
Pp3c9_15840V3	NA	purple
Pp3c9_17460V3	NA	purple
Pp3c9_17560V3	NA	purple
Pp3c9_17580V3	NA	purple
Pp3c9_18780V3	NA	purple
Pp3c9_19700V3	NA	purple
Pp3c9_24240V3	NA	purple
Pp3c9_24800V3	NA	purple
Pp3c9_3350V3	NA	purple
Pp3c9_4180V3	NA	purple
Pp3c9_5580V3	NA	purple
Pp3s128_20V3	NA	purple
Pp3s177_60V3	NA	purple
Pp3s62_110V3	NA	purple
Pp3s877_36V3	NA	purple
