"","x"
"1","Me1_v2_0017880"
"2","Me1_v2_0019530"
"3","Me1_v2_0038720"
"4","Me1_v2_0024180"
"5","Me1_v2_0016730"
"6","Me1_v2_0100120"
"7","Me1_v2_0092670"
"8","Me1_v2_0153450"
"9","Me1_v2_0100110"
"10","Me1_v2_0153440"
"11","Me1_v2_0034140"
"12","Me1_v2_0092680"
"13","Me1_v2_0022290"
"14","Me1_v2_0092700"
"15","Me1_v2_0143660"
"16","Me1_v2_0200440"
"17","Me1_v2_0100100"
"18","Me1_v2_0155790"
"19","Me1_v2_0092690"
"20","Me1_v2_0163230"
