{
	"n_targets": 44734,
	"n_bootstraps": 100,
	"n_processed": 49542111,
	"n_pseudoaligned": 41769850,
	"n_unique": 16564942,
	"p_pseudoaligned": 84.3,
	"p_unique": 33.4,
	"kallisto_version": "0.48.0",
	"index_version": 10,
	"start_time": "Tue Aug 23 10:49:35 2022",
	"call": "kallisto quant --bootstrap-samples 100 --rf-stranded -t 20 -i /scratch/users/dadras/Stress_profiling_of_mesotaenium_endlicherianum/kallisto_index/Me1_v2.release.gff3.cdna.idx -o /scratch/users/dadras/Stress_profiling_of_mesotaenium_endlicherianum/kallisto/M_1_84 /scratch/users/dadras/Stress_profiling_of_mesotaenium_endlicherianum/trimmed_reads_PE/M_1_84_1.fq.gz /scratch/users/dadras/Stress_profiling_of_mesotaenium_endlicherianum/trimmed_reads_PE/M_1_84_2.fq.gz"
}
