"","ID","Description","GeneRatio","BgRatio","pvalue","p.adjust","qvalue","geneID","Count"
"GO:0071554","GO:0071554","cell wall organization or biogenesis","9/75","114/5146",3.45558263132402e-05,0.0205607166563779,0.0193148881814006,"Zci_00169/Zci_02209/Zci_06420/Zci_06456/Zci_06561/Zci_06808/Zci_09882/Zci_09930/Zci_13832",9
"GO:0071669","GO:0071669","plant-type cell wall organization or biogenesis","6/75","60/5146",0.000210125958134979,0.042559782812464,0.0399809724430224,"Zci_00169/Zci_02209/Zci_06456/Zci_06808/Zci_09930/Zci_13832",6
"GO:0008643","GO:0008643","carbohydrate transport","4/75","22/5146",0.000249567845993178,0.042559782812464,0.0399809724430224,"Zci_02945/Zci_04278/Zci_06420/Zci_10716",4
"GO:0071555","GO:0071555","cell wall organization","5/75","41/5146",0.000286116186974548,0.042559782812464,0.0399809724430224,"Zci_00169/Zci_02209/Zci_06420/Zci_06808/Zci_09882",5
"GO:0045229","GO:0045229","external encapsulating structure organization","5/75","52/5146",0.000876038142649728,0.104248538975318,0.0979318428941065,"Zci_00169/Zci_02209/Zci_06420/Zci_06808/Zci_09882",5
"GO:0042546","GO:0042546","cell wall biogenesis","6/75","87/5146",0.00155386387743164,0.13756829692754,0.129232668144226,"Zci_00169/Zci_06456/Zci_06808/Zci_09930/Zci_11872/Zci_13832",6
"GO:0009605","GO:0009605","response to external stimulus","15/75","446/5146",0.00161845055208871,0.13756829692754,0.129232668144226,"Zci_00614/Zci_01028/Zci_01066/Zci_02787/Zci_04845/Zci_05187/Zci_06178/Zci_06300/Zci_06808/Zci_09882/Zci_10596/Zci_10716/Zci_13189/Zci_13832/Zci_14637",15
"GO:0006468","GO:0006468","protein phosphorylation","12/75","323/5146",0.00220440471272243,0.163952600508731,0.154018276638896,"Zci_01028/Zci_02774/Zci_04763/Zci_06294/Zci_06373/Zci_06747/Zci_12061/Zci_12345/Zci_12937/Zci_14122/Zci_14622/Zci_14637",12
"GO:0005976","GO:0005976","polysaccharide metabolic process","6/75","101/5146",0.00332135118744316,0.201993941682022,0.189754591832205,"Zci_00169/Zci_01042/Zci_02209/Zci_08956/Zci_09930/Zci_10596",6
"GO:0018105","GO:0018105","peptidyl-serine phosphorylation","4/75","44/5146",0.00363561148885859,0.201993941682022,0.189754591832205,"Zci_01028/Zci_12061/Zci_12345/Zci_12937",4
"GO:0018209","GO:0018209","peptidyl-serine modification","4/75","45/5146",0.00394681399880574,0.201993941682022,0.189754591832205,"Zci_01028/Zci_12061/Zci_12345/Zci_12937",4
"GO:0046777","GO:0046777","protein autophosphorylation","5/75","77/5146",0.00502313950345191,0.201993941682022,0.189754591832205,"Zci_01028/Zci_12061/Zci_12345/Zci_12937/Zci_14637",5
"GO:0007165","GO:0007165","signal transduction","12/75","359/5146",0.0052462611925363,0.201993941682022,0.189754591832205,"Zci_01028/Zci_01725/Zci_01986/Zci_02774/Zci_06294/Zci_06373/Zci_08956/Zci_09440/Zci_12061/Zci_12345/Zci_12937/Zci_14637",12
"GO:0009832","GO:0009832","plant-type cell wall biogenesis","4/75","49/5146",0.00537200756784971,0.201993941682022,0.189754591832205,"Zci_00169/Zci_06456/Zci_09930/Zci_13832",4
"GO:0044247","GO:0044247","cellular polysaccharide catabolic process","3/75","25/5146",0.00543176986035691,0.201993941682022,0.189754591832205,"Zci_01042/Zci_08956/Zci_10596",3
"GO:0048598","GO:0048598","embryonic morphogenesis","3/75","25/5146",0.00543176986035691,0.201993941682022,0.189754591832205,"Zci_01458/Zci_03531/Zci_04898",3
"GO:0016310","GO:0016310","phosphorylation","11/75","321/5146",0.00628966638401838,0.205431105838467,0.19298348907603,"Zci_01028/Zci_01725/Zci_02774/Zci_06294/Zci_06373/Zci_10596/Zci_12061/Zci_12345/Zci_12937/Zci_14266/Zci_14637",11
"GO:0044264","GO:0044264","cellular polysaccharide metabolic process","5/75","84/5146",0.00725494457515499,0.205431105838467,0.19298348907603,"Zci_00169/Zci_01042/Zci_08956/Zci_09930/Zci_10596",5
"GO:0009251","GO:0009251","glucan catabolic process","3/75","28/5146",0.00749874281404226,0.205431105838467,0.19298348907603,"Zci_01042/Zci_08956/Zci_10596",3
"GO:0044262","GO:0044262","cellular carbohydrate metabolic process","6/75","123/5146",0.00865953543818921,0.205431105838467,0.19298348907603,"Zci_00169/Zci_01042/Zci_07867/Zci_08956/Zci_09930/Zci_10596",6
"GO:0001578","GO:0001578","microtubule bundle formation","2/75","10/5146",0.00874472131302124,0.205431105838467,0.19298348907603,"Zci_01458/Zci_04898",2
"GO:0035295","GO:0035295","tube development","2/75","10/5146",0.00874472131302124,0.205431105838467,0.19298348907603,"Zci_01458/Zci_04898",2
"GO:0009664","GO:0009664","plant-type cell wall organization","3/75","30/5146",0.00910203593696549,0.205431105838467,0.19298348907603,"Zci_00169/Zci_02209/Zci_06808",3
"GO:0023052","GO:0023052","signaling","11/75","339/5146",0.00936641501055741,0.205431105838467,0.19298348907603,"Zci_01028/Zci_01986/Zci_02774/Zci_06294/Zci_06373/Zci_08956/Zci_09440/Zci_12061/Zci_12345/Zci_12937/Zci_14637",11
"GO:0000272","GO:0000272","polysaccharide catabolic process","3/75","31/5146",0.00997310492280817,0.205431105838467,0.19298348907603,"Zci_01042/Zci_08956/Zci_10596",3
"GO:0044275","GO:0044275","cellular carbohydrate catabolic process","3/75","31/5146",0.00997310492280817,0.205431105838467,0.19298348907603,"Zci_01042/Zci_08956/Zci_10596",3
"GO:0071229","GO:0071229","cellular response to acid chemical","6/75","127/5146",0.0100642824025439,0.205431105838467,0.19298348907603,"Zci_00614/Zci_01028/Zci_08956/Zci_09440/Zci_12345/Zci_12937",6
"GO:0043207","GO:0043207","response to external biotic stimulus","10/75","298/5146",0.0105676794673742,0.205431105838467,0.19298348907603,"Zci_01028/Zci_01066/Zci_04845/Zci_06178/Zci_06300/Zci_09882/Zci_10596/Zci_10716/Zci_13189/Zci_13832",10
"GO:0051707","GO:0051707","response to other organism","10/75","298/5146",0.0105676794673742,0.205431105838467,0.19298348907603,"Zci_01028/Zci_01066/Zci_04845/Zci_06178/Zci_06300/Zci_09882/Zci_10596/Zci_10716/Zci_13189/Zci_13832",10
"GO:0060271","GO:0060271","cilium assembly","2/75","11/5146",0.0105877320931375,0.205431105838467,0.19298348907603,"Zci_01458/Zci_04898",2
"GO:0005975","GO:0005975","carbohydrate metabolic process","10/75","299/5146",0.010805987145355,0.205431105838467,0.19298348907603,"Zci_00169/Zci_01042/Zci_02209/Zci_06808/Zci_07867/Zci_08956/Zci_09882/Zci_09930/Zci_10596/Zci_14122",10
"GO:0009607","GO:0009607","response to biotic stimulus","10/75","300/5146",0.0110483956081192,0.205431105838467,0.19298348907603,"Zci_01028/Zci_01066/Zci_04845/Zci_06178/Zci_06300/Zci_09882/Zci_10596/Zci_10716/Zci_13189/Zci_13832",10
"GO:0009755","GO:0009755","hormone-mediated signaling pathway","6/75","131/5146",0.0116249784368374,0.209601883936917,0.196901548643084,"Zci_01028/Zci_02774/Zci_08956/Zci_09440/Zci_12345/Zci_12937",6
"GO:0060429","GO:0060429","epithelium development","2/75","12/5146",0.0125862233542559,0.220258908699479,0.206912835947675,"Zci_01458/Zci_04898",2
"GO:0044782","GO:0044782","cilium organization","2/75","13/5146",0.0147353959163243,0.240909031087597,0.226311712529879,"Zci_01458/Zci_04898",2
"GO:0120031","GO:0120031","plasma membrane bounded cell projection assembly","2/75","13/5146",0.0147353959163243,0.240909031087597,0.226311712529879,"Zci_01458/Zci_04898",2
"GO:0009738","GO:0009738","abscisic acid-activated signaling pathway","4/75","66/5146",0.0151814325553622,0.240909031087597,0.226311712529879,"Zci_01028/Zci_08956/Zci_12345/Zci_12937",4
"GO:0071396","GO:0071396","cellular response to lipid","5/75","101/5146",0.0153857868593759,0.240909031087597,0.226311712529879,"Zci_01028/Zci_08956/Zci_09440/Zci_12345/Zci_12937",5
"GO:0007154","GO:0007154","cell communication","12/75","415/5146",0.0158738410256741,0.24217783103272,0.227503632513709,"Zci_00614/Zci_01028/Zci_01986/Zci_02774/Zci_06294/Zci_06373/Zci_08956/Zci_09440/Zci_12061/Zci_12345/Zci_12937/Zci_14637",12
"GO:0035556","GO:0035556","intracellular signal transduction","6/75","146/5146",0.0190097973871637,0.269370398256258,0.253048529808179,"Zci_01028/Zci_06373/Zci_12061/Zci_12345/Zci_12937/Zci_14637",6
"GO:0019915","GO:0019915","lipid storage","2/75","15/5146",0.0194671044117968,0.269370398256258,0.253048529808179,"Zci_01066/Zci_04845",2
"GO:0030031","GO:0030031","cell projection assembly","2/75","15/5146",0.0194671044117968,0.269370398256258,0.253048529808179,"Zci_01458/Zci_04898",2
"GO:0052546","GO:0052546","cell wall pectin metabolic process","2/75","15/5146",0.0194671044117968,0.269370398256258,0.253048529808179,"Zci_00169/Zci_02209",2
"GO:0051270","GO:0051270","regulation of cellular component movement","2/75","16/5146",0.0220405523992653,0.29804837903552,0.279988835502629,"Zci_01458/Zci_04898",2
"GO:0015711","GO:0015711","organic anion transport","4/75","76/5146",0.024247359314058,0.313280185187365,0.294297706031828,"Zci_00614/Zci_01387/Zci_05630/Zci_13832",4
"GO:0032870","GO:0032870","cellular response to hormone stimulus","6/75","155/5146",0.0247238944702292,0.313280185187365,0.294297706031828,"Zci_01028/Zci_02774/Zci_08956/Zci_09440/Zci_12345/Zci_12937",6
"GO:0009895","GO:0009895","negative regulation of catabolic process","2/75","17/5146",0.0247465020232036,0.313280185187365,0.294297706031828,"Zci_06178/Zci_06300",2
"GO:0034219","GO:0034219","carbohydrate transmembrane transport","2/75","18/5146",0.0275806531988316,0.32447475121048,0.304813963543149,"Zci_04278/Zci_10716",2
"GO:0070592","GO:0070592","cell wall polysaccharide biosynthetic process","2/75","18/5146",0.0275806531988316,0.32447475121048,0.304813963543149,"Zci_00169/Zci_09930",2
"GO:0031347","GO:0031347","regulation of defense response","4/75","80/5146",0.0286255135683649,0.32447475121048,0.304813963543149,"Zci_06178/Zci_06294/Zci_06420/Zci_13189",4
"GO:0071215","GO:0071215","cellular response to abscisic acid stimulus","4/75","80/5146",0.0286255135683649,0.32447475121048,0.304813963543149,"Zci_01028/Zci_08956/Zci_12345/Zci_12937",4
"GO:0097306","GO:0097306","cellular response to alcohol","4/75","80/5146",0.0286255135683649,0.32447475121048,0.304813963543149,"Zci_01028/Zci_08956/Zci_12345/Zci_12937",4
"GO:0005983","GO:0005983","starch catabolic process","2/75","19/5146",0.0305388001139275,0.32447475121048,0.304813963543149,"Zci_08956/Zci_10596",2
"GO:0044038","GO:0044038","cell wall macromolecule biosynthetic process","2/75","19/5146",0.0305388001139275,0.32447475121048,0.304813963543149,"Zci_00169/Zci_09930",2
"GO:0070589","GO:0070589","cellular component macromolecule biosynthetic process","2/75","19/5146",0.0305388001139275,0.32447475121048,0.304813963543149,"Zci_00169/Zci_09930",2
"GO:0071368","GO:0071368","cellular response to cytokinin stimulus","2/75","19/5146",0.0305388001139275,0.32447475121048,0.304813963543149,"Zci_02774/Zci_09440",2
"GO:0006952","GO:0006952","defense response","8/75","256/5146",0.0317019037356804,0.33032399685374,0.310308787844911,"Zci_01028/Zci_01066/Zci_04845/Zci_06178/Zci_06294/Zci_06300/Zci_09882/Zci_13189",8
"GO:0098656","GO:0098656","anion transmembrane transport","4/75","83/5146",0.0321996501134738,0.33032399685374,0.310308787844911,"Zci_00614/Zci_01387/Zci_05630/Zci_13832",4
"GO:0009736","GO:0009736","cytokinin-activated signaling pathway","2/75","20/5146",0.0336168294539032,0.337150030888207,0.316721214332841,"Zci_02774/Zci_09440",2
"GO:0071495","GO:0071495","cellular response to endogenous stimulus","6/75","167/5146",0.0339983224425083,0.337150030888207,0.316721214332841,"Zci_01028/Zci_02774/Zci_08956/Zci_09440/Zci_12345/Zci_12937",6
"GO:0009767","GO:0009767","photosynthetic electron transport chain","2/75","21/5146",0.0368107186575291,0.359055370511964,0.337299251201863,"Zci_07867/Zci_10519",2
"GO:0006006","GO:0006006","glucose metabolic process","2/75","23/5146",0.0435304299225067,0.411120727045897,0.386209829387654,"Zci_07867/Zci_09882",2
"GO:0120036","GO:0120036","plasma membrane bounded cell projection organization","2/75","23/5146",0.0435304299225067,0.411120727045897,0.386209829387654,"Zci_01458/Zci_04898",2
"GO:0045488","GO:0045488","pectin metabolic process","2/75","24/5146",0.047048645348864,0.43740537472772,0.410901820398796,"Zci_00169/Zci_02209",2
"GO:0010393","GO:0010393","galacturonan metabolic process","2/75","25/5146",0.0506675040869951,0.45065900167611,0.423352374860706,"Zci_00169/Zci_02209",2
"GO:0030030","GO:0030030","cell projection organization","2/75","25/5146",0.0506675040869951,0.45065900167611,0.423352374860706,"Zci_01458/Zci_04898",2
"GO:1901700","GO:1901700","response to oxygen-containing compound","12/75","492/5146",0.0507464758189905,0.45065900167611,0.423352374860706,"Zci_00614/Zci_01028/Zci_01042/Zci_01656/Zci_06300/Zci_06808/Zci_08956/Zci_09440/Zci_09882/Zci_12061/Zci_12345/Zci_12937",12
"GO:0016052","GO:0016052","carbohydrate catabolic process","3/75","58/5146",0.0518465589404007,0.453657390728506,0.426169083550352,"Zci_01042/Zci_08956/Zci_10596",3
"GO:0033993","GO:0033993","response to lipid","7/75","235/5146",0.0539384015106198,0.465120998533605,0.436938080886943,"Zci_01028/Zci_06300/Zci_06808/Zci_08956/Zci_09440/Zci_12345/Zci_12937",7
"GO:0010119","GO:0010119","regulation of stomatal movement","3/75","60/5146",0.0563385088331949,0.478877325082157,0.449860875044008,"Zci_05187/Zci_08956/Zci_14637",3
"GO:0046364","GO:0046364","monosaccharide biosynthetic process","2/75","27/5146",0.0581928567210094,0.487247566080035,0.457723940890754,"Zci_07867/Zci_09882",2
"GO:0006820","GO:0006820","anion transport","4/75","101/5146",0.0589610500130462,0.487247566080035,0.457723940890754,"Zci_00614/Zci_01387/Zci_05630/Zci_13832",4
"GO:0051235","GO:0051235","maintenance of location","2/75","28/5146",0.0620924039446223,0.501753963451167,0.471351357085484,"Zci_01066/Zci_04845",2
"GO:1901701","GO:1901701","cellular response to oxygen-containing compound","6/75","194/5146",0.0624030139418259,0.501753963451167,0.471351357085484,"Zci_00614/Zci_01028/Zci_08956/Zci_09440/Zci_12345/Zci_12937",6
"GO:0034637","GO:0034637","cellular carbohydrate biosynthetic process","3/75","63/5146",0.0634128264492282,0.503075089830544,0.472592432905827,"Zci_00169/Zci_07867/Zci_09930",3
"GO:0006073","GO:0006073","cellular glucan metabolic process","3/75","64/5146",0.0658588049423588,0.51060812149463,0.479669018157715,"Zci_01042/Zci_08956/Zci_10596",3
"GO:0007018","GO:0007018","microtubule-based movement","2/75","29/5146",0.0660786980757756,0.51060812149463,0.479669018157715,"Zci_01458/Zci_04898",2
"GO:0044042","GO:0044042","glucan metabolic process","3/75","65/5146",0.0683479143355283,0.514041837817731,0.482894676481584,"Zci_01042/Zci_08956/Zci_10596",3
"GO:0016051","GO:0016051","carbohydrate biosynthetic process","4/75","107/5146",0.0698958579939655,0.514041837817731,0.482894676481584,"Zci_00169/Zci_07867/Zci_09882/Zci_09930",4
"GO:0010383","GO:0010383","cell wall polysaccharide metabolic process","2/75","30/5146",0.0701484596571192,0.514041837817731,0.482894676481584,"Zci_00169/Zci_09930",2
"GO:0009057","GO:0009057","macromolecule catabolic process","7/75","250/5146",0.0704785394022443,0.514041837817731,0.482894676481584,"Zci_01042/Zci_01338/Zci_06178/Zci_06183/Zci_08956/Zci_10596/Zci_13189",7
"GO:0009617","GO:0009617","response to bacterium","5/75","153/5146",0.0713589481850844,0.514041837817731,0.482894676481584,"Zci_01066/Zci_04845/Zci_06300/Zci_09882/Zci_13189",5
"GO:0009152","GO:0009152","purine ribonucleotide biosynthetic process","2/75","31/5146",0.0742984841215545,0.514041837817731,0.482894676481584,"Zci_06294/Zci_14266",2
"GO:0009624","GO:0009624","response to nematode","2/75","31/5146",0.0742984841215545,0.514041837817731,0.482894676481584,"Zci_10716/Zci_13832",2
"GO:0009648","GO:0009648","photoperiodism","2/75","31/5146",0.0742984841215545,0.514041837817731,0.482894676481584,"Zci_01656/Zci_05187",2
"GO:0048513","GO:0048513","animal organ development","2/75","31/5146",0.0742984841215545,0.514041837817731,0.482894676481584,"Zci_01458/Zci_04898",2
"GO:0007015","GO:0007015","actin filament organization","2/75","32/5146",0.0785256403538135,0.529840959211342,0.49773648711406,"Zci_01533/Zci_12106",2
"GO:0019318","GO:0019318","hexose metabolic process","2/75","32/5146",0.0785256403538135,0.529840959211342,0.49773648711406,"Zci_07867/Zci_09882",2
"GO:0080134","GO:0080134","regulation of response to stress","5/75","158/5146",0.0794930653184378,0.529840959211342,0.49773648711406,"Zci_01028/Zci_06178/Zci_06294/Zci_06420/Zci_13189",5
"GO:0048583","GO:0048583","regulation of response to stimulus","8/75","310/5146",0.0801440106370097,0.529840959211342,0.49773648711406,"Zci_01028/Zci_02787/Zci_03531/Zci_06178/Zci_06294/Zci_06420/Zci_09440/Zci_13189",8
"GO:0009606","GO:0009606","tropism","2/75","33/5146",0.0828268692771876,0.535673774129637,0.503215876272158,"Zci_02787/Zci_14637",2
"GO:0010224","GO:0010224","response to UV-B","2/75","33/5146",0.0828268692771876,0.535673774129637,0.503215876272158,"Zci_03531/Zci_05187",2
"GO:0005982","GO:0005982","starch metabolic process","2/75","34/5146",0.0871991824649905,0.541803027882804,0.508973742248154,"Zci_08956/Zci_10596",2
"GO:0006164","GO:0006164","purine nucleotide biosynthetic process","2/75","34/5146",0.0871991824649905,0.541803027882804,0.508973742248154,"Zci_06294/Zci_14266",2
"GO:0072522","GO:0072522","purine-containing compound biosynthetic process","2/75","34/5146",0.0871991824649905,0.541803027882804,0.508973742248154,"Zci_06294/Zci_14266",2
"GO:0018193","GO:0018193","peptidyl-amino acid modification","6/75","212/5146",0.0874169591205869,0.541803027882804,0.508973742248154,"Zci_01028/Zci_02774/Zci_07616/Zci_12061/Zci_12345/Zci_12937",6
"GO:0009888","GO:0009888","tissue development","6/75","214/5146",0.0904970997850515,0.555111076001089,0.521475420356618,"Zci_01458/Zci_02774/Zci_03531/Zci_04898/Zci_06178/Zci_08956",6
"GO:0044036","GO:0044036","cell wall macromolecule metabolic process","2/75","35/5146",0.0916396607763526,0.556383654713569,0.522670890142247,"Zci_00169/Zci_09930",2
"GO:0009894","GO:0009894","regulation of catabolic process","3/75","74/5146",0.0926040629384469,0.556559772205817,0.522836336207499,"Zci_06178/Zci_06300/Zci_08956",3
"GO:0010876","GO:0010876","lipid localization","2/75","36/5146",0.0961454530159423,0.572065445444857,0.537402479489109,"Zci_01066/Zci_04845",2
"GO:0032879","GO:0032879","regulation of localization","4/75","123/5146",0.103735019635243,0.60267725266898,0.566159435943792,"Zci_01458/Zci_04898/Zci_08956/Zci_14637",4
"GO:0009110","GO:0009110","vitamin biosynthetic process","2/75","38/5146",0.105341906348864,0.60267725266898,0.566159435943792,"Zci_06420/Zci_09882",2
"GO:1903825","GO:1903825","organic acid transmembrane transport","2/75","38/5146",0.105341906348864,0.60267725266898,0.566159435943792,"Zci_01387/Zci_05630",2
"GO:1905039","GO:1905039","carboxylic acid transmembrane transport","2/75","38/5146",0.105341906348864,0.60267725266898,0.566159435943792,"Zci_01387/Zci_05630",2
"GO:0009266","GO:0009266","response to temperature stimulus","6/75","224/5146",0.106782342689434,0.605099941906794,0.568435328000898,"Zci_01149/Zci_06420/Zci_06808/Zci_07867/Zci_09882/Zci_10596",6
"GO:0098542","GO:0098542","defense response to other organism","6/75","226/5146",0.110213684379533,0.612631511783782,0.575510540039254,"Zci_01028/Zci_01066/Zci_04845/Zci_06178/Zci_09882/Zci_13189",6
"GO:0071310","GO:0071310","cellular response to organic substance","6/75","227/5146",0.111950789713654,0.612631511783782,0.575510540039254,"Zci_01028/Zci_02774/Zci_08956/Zci_09440/Zci_12345/Zci_12937",6
"GO:0006766","GO:0006766","vitamin metabolic process","2/75","41/5146",0.119558923509534,0.612631511783782,0.575510540039254,"Zci_06420/Zci_09882",2
"GO:0015849","GO:0015849","organic acid transport","2/75","41/5146",0.119558923509534,0.612631511783782,0.575510540039254,"Zci_01387/Zci_05630",2
"GO:0046942","GO:0046942","carboxylic acid transport","2/75","41/5146",0.119558923509534,0.612631511783782,0.575510540039254,"Zci_01387/Zci_05630",2
"GO:0009260","GO:0009260","ribonucleotide biosynthetic process","2/75","42/5146",0.12440036614185,0.612631511783782,0.575510540039254,"Zci_06294/Zci_14266",2
"GO:0022900","GO:0022900","electron transport chain","2/75","42/5146",0.12440036614185,0.612631511783782,0.575510540039254,"Zci_07867/Zci_10519",2
"GO:0046390","GO:0046390","ribose phosphate biosynthetic process","2/75","42/5146",0.12440036614185,0.612631511783782,0.575510540039254,"Zci_06294/Zci_14266",2
"GO:0000281","GO:0000281","mitotic cytokinesis","2/75","44/5146",0.134222349165543,0.612631511783782,0.575510540039254,"Zci_06456/Zci_13832",2
"GO:0042742","GO:0042742","defense response to bacterium","4/75","136/5146",0.135823434859586,0.612631511783782,0.575510540039254,"Zci_01066/Zci_04845/Zci_09882/Zci_13189",4
"GO:0006002","GO:0006002","fructose 6-phosphate metabolic process","1/75","10/5146",0.136659631673522,0.612631511783782,0.575510540039254,"Zci_07867",1
"GO:0009785","GO:0009785","blue light signaling pathway","1/75","10/5146",0.136659631673522,0.612631511783782,0.575510540039254,"Zci_14637",1
"GO:0010225","GO:0010225","response to UV-C","1/75","10/5146",0.136659631673522,0.612631511783782,0.575510540039254,"Zci_03531",1
"GO:0015749","GO:0015749","monosaccharide transmembrane transport","1/75","10/5146",0.136659631673522,0.612631511783782,0.575510540039254,"Zci_10716",1
"GO:0045491","GO:0045491","xylan metabolic process","1/75","10/5146",0.136659631673522,0.612631511783782,0.575510540039254,"Zci_09930",1
"GO:0046351","GO:0046351","disaccharide biosynthetic process","1/75","10/5146",0.136659631673522,0.612631511783782,0.575510540039254,"Zci_07867",1
"GO:0071370","GO:0071370","cellular response to gibberellin stimulus","1/75","10/5146",0.136659631673522,0.612631511783782,0.575510540039254,"Zci_09440",1
"GO:0090481","GO:0090481","pyrimidine nucleotide-sugar transmembrane transport","1/75","10/5146",0.136659631673522,0.612631511783782,0.575510540039254,"Zci_13832",1
"GO:0044092","GO:0044092","negative regulation of molecular function","2/75","45/5146",0.139198240180335,0.612631511783782,0.575510540039254,"Zci_03531/Zci_14637",2
"GO:0009735","GO:0009735","response to cytokinin","3/75","90/5146",0.142957456531789,0.612631511783782,0.575510540039254,"Zci_02774/Zci_07867/Zci_09440",3
"GO:0006633","GO:0006633","fatty acid biosynthetic process","2/75","46/5146",0.144214391652447,0.612631511783782,0.575510540039254,"Zci_06420/Zci_13898",2
"GO:0009725","GO:0009725","response to hormone","9/75","413/5146",0.144411910265695,0.612631511783782,0.575510540039254,"Zci_01028/Zci_02774/Zci_06808/Zci_07867/Zci_08956/Zci_09440/Zci_09882/Zci_12345/Zci_12937",9
"GO:0009409","GO:0009409","response to cold","4/75","140/5146",0.146436757910003,0.612631511783782,0.575510540039254,"Zci_01149/Zci_06808/Zci_07867/Zci_10596",4
"GO:0009699","GO:0009699","phenylpropanoid biosynthetic process","1/75","11/5146",0.149266821631561,0.612631511783782,0.575510540039254,"Zci_01832",1
"GO:0010193","GO:0010193","response to ozone","1/75","11/5146",0.149266821631561,0.612631511783782,0.575510540039254,"Zci_09882",1
"GO:0031330","GO:0031330","negative regulation of cellular catabolic process","1/75","11/5146",0.149266821631561,0.612631511783782,0.575510540039254,"Zci_06300",1
"GO:0090480","GO:0090480","purine nucleotide-sugar transmembrane transport","1/75","11/5146",0.149266821631561,0.612631511783782,0.575510540039254,"Zci_13832",1
"GO:0000910","GO:0000910","cytokinesis","2/75","47/5146",0.149268617790635,0.612631511783782,0.575510540039254,"Zci_06456/Zci_13832",2
"GO:0061640","GO:0061640","cytoskeleton-dependent cytokinesis","2/75","47/5146",0.149268617790635,0.612631511783782,0.575510540039254,"Zci_06456/Zci_13832",2
"GO:0006928","GO:0006928","movement of cell or subcellular component","2/75","48/5146",0.154358786394943,0.612631511783782,0.575510540039254,"Zci_01458/Zci_04898",2
"GO:0001101","GO:0001101","response to acid chemical","8/75","362/5146",0.154808986802516,0.612631511783782,0.575510540039254,"Zci_00614/Zci_01028/Zci_01042/Zci_08956/Zci_09440/Zci_09882/Zci_12345/Zci_12937",8
"GO:0048868","GO:0048868","pollen tube development","2/75","49/5146",0.15948281779382,0.612631511783782,0.575510540039254,"Zci_00169/Zci_01359",2
"GO:0055085","GO:0055085","transmembrane transport","9/75","423/5146",0.159969430341339,0.612631511783782,0.575510540039254,"Zci_00614/Zci_01387/Zci_04278/Zci_05630/Zci_07518/Zci_10716/Zci_12550/Zci_13832/Zci_16407",9
"GO:0034220","GO:0034220","ion transmembrane transport","5/75","198/5146",0.160962355626152,0.612631511783782,0.575510540039254,"Zci_00614/Zci_01387/Zci_05630/Zci_10716/Zci_13832",5
"GO:0009719","GO:0009719","response to endogenous stimulus","9/75","424/5146",0.161569856967499,0.612631511783782,0.575510540039254,"Zci_01028/Zci_02774/Zci_06808/Zci_07867/Zci_08956/Zci_09440/Zci_09882/Zci_12345/Zci_12937",9
"GO:0006379","GO:0006379","mRNA cleavage","1/75","12/5146",0.161692330565861,0.612631511783782,0.575510540039254,"Zci_06300",1
"GO:0033559","GO:0033559","unsaturated fatty acid metabolic process","1/75","12/5146",0.161692330565861,0.612631511783782,0.575510540039254,"Zci_06420",1
"GO:0042631","GO:0042631","cellular response to water deprivation","1/75","12/5146",0.161692330565861,0.612631511783782,0.575510540039254,"Zci_00614",1
"GO:0043271","GO:0043271","negative regulation of ion transport","1/75","12/5146",0.161692330565861,0.612631511783782,0.575510540039254,"Zci_14637",1
"GO:0071462","GO:0071462","cellular response to water stimulus","1/75","12/5146",0.161692330565861,0.612631511783782,0.575510540039254,"Zci_00614",1
"GO:0005996","GO:0005996","monosaccharide metabolic process","2/75","50/5146",0.164638683800171,0.612631511783782,0.575510540039254,"Zci_07867/Zci_09882",2
"GO:0070887","GO:0070887","cellular response to chemical stimulus","7/75","311/5146",0.165652888542223,0.612631511783782,0.575510540039254,"Zci_00614/Zci_01028/Zci_02774/Zci_08956/Zci_09440/Zci_12345/Zci_12937",7
"GO:0050832","GO:0050832","defense response to fungus","3/75","98/5146",0.170946878455737,0.612631511783782,0.575510540039254,"Zci_01028/Zci_01391/Zci_06178",3
"GO:0002237","GO:0002237","response to molecule of bacterial origin","1/75","13/5146",0.173938741786656,0.612631511783782,0.575510540039254,"Zci_06300",1
"GO:0005985","GO:0005985","sucrose metabolic process","1/75","13/5146",0.173938741786656,0.612631511783782,0.575510540039254,"Zci_07867",1
"GO:0006469","GO:0006469","negative regulation of protein kinase activity","1/75","13/5146",0.173938741786656,0.612631511783782,0.575510540039254,"Zci_03531",1
"GO:0009646","GO:0009646","response to absence of light","1/75","13/5146",0.173938741786656,0.612631511783782,0.575510540039254,"Zci_05187",1
"GO:0009773","GO:0009773","photosynthetic electron transport in photosystem I","1/75","13/5146",0.173938741786656,0.612631511783782,0.575510540039254,"Zci_07867",1
"GO:0009812","GO:0009812","flavonoid metabolic process","1/75","13/5146",0.173938741786656,0.612631511783782,0.575510540039254,"Zci_05187",1
"GO:0009834","GO:0009834","plant-type secondary cell wall biogenesis","1/75","13/5146",0.173938741786656,0.612631511783782,0.575510540039254,"Zci_09930",1
"GO:0010411","GO:0010411","xyloglucan metabolic process","1/75","13/5146",0.173938741786656,0.612631511783782,0.575510540039254,"Zci_06808",1
"GO:0019319","GO:0019319","hexose biosynthetic process","1/75","13/5146",0.173938741786656,0.612631511783782,0.575510540039254,"Zci_07867",1
"GO:0030148","GO:0030148","sphingolipid biosynthetic process","1/75","13/5146",0.173938741786656,0.612631511783782,0.575510540039254,"Zci_01149",1
"GO:0033673","GO:0033673","negative regulation of kinase activity","1/75","13/5146",0.173938741786656,0.612631511783782,0.575510540039254,"Zci_03531",1
"GO:0042545","GO:0042545","cell wall modification","1/75","13/5146",0.173938741786656,0.612631511783782,0.575510540039254,"Zci_09882",1
"GO:0043488","GO:0043488","regulation of mRNA stability","1/75","13/5146",0.173938741786656,0.612631511783782,0.575510540039254,"Zci_06300",1
"GO:0070417","GO:0070417","cellular response to cold","1/75","13/5146",0.173938741786656,0.612631511783782,0.575510540039254,"Zci_01149",1
"GO:0072348","GO:0072348","sulfur compound transport","1/75","13/5146",0.173938741786656,0.612631511783782,0.575510540039254,"Zci_05630",1
"GO:1901002","GO:1901002","positive regulation of response to salt stress","1/75","13/5146",0.173938741786656,0.612631511783782,0.575510540039254,"Zci_01028",1
"GO:0016311","GO:0016311","dephosphorylation","3/75","99/5146",0.174553423825012,0.612631511783782,0.575510540039254,"Zci_03531/Zci_07867/Zci_10519",3
"GO:0000160","GO:0000160","phosphorelay signal transduction system","2/75","52/5146",0.175038058175653,0.612631511783782,0.575510540039254,"Zci_01725/Zci_02774",2
"GO:0000226","GO:0000226","microtubule cytoskeleton organization","2/75","52/5146",0.175038058175653,0.612631511783782,0.575510540039254,"Zci_01458/Zci_04898",2
"GO:0033692","GO:0033692","cellular polysaccharide biosynthetic process","2/75","52/5146",0.175038058175653,0.612631511783782,0.575510540039254,"Zci_00169/Zci_09930",2
"GO:0003002","GO:0003002","regionalization","2/75","53/5146",0.180277758456351,0.612631511783782,0.575510540039254,"Zci_01458/Zci_04898",2
"GO:0097305","GO:0097305","response to alcohol","5/75","208/5146",0.18532857113594,0.612631511783782,0.575510540039254,"Zci_01028/Zci_08956/Zci_12061/Zci_12345/Zci_12937",5
"GO:0005977","GO:0005977","glycogen metabolic process","1/75","14/5146",0.186008602368382,0.612631511783782,0.575510540039254,"Zci_01042",1
"GO:0006094","GO:0006094","gluconeogenesis","1/75","14/5146",0.186008602368382,0.612631511783782,0.575510540039254,"Zci_07867",1
"GO:0006112","GO:0006112","energy reserve metabolic process","1/75","14/5146",0.186008602368382,0.612631511783782,0.575510540039254,"Zci_01042",1
"GO:0010214","GO:0010214","seed coat development","1/75","14/5146",0.186008602368382,0.612631511783782,0.575510540039254,"Zci_13832",1
"GO:0030522","GO:0030522","intracellular receptor signaling pathway","1/75","14/5146",0.186008602368382,0.612631511783782,0.575510540039254,"Zci_14637",1
"GO:0032204","GO:0032204","regulation of telomere maintenance","1/75","14/5146",0.186008602368382,0.612631511783782,0.575510540039254,"Zci_03703",1
"GO:0043408","GO:0043408","regulation of MAPK cascade","1/75","14/5146",0.186008602368382,0.612631511783782,0.575510540039254,"Zci_03531",1
"GO:0043967","GO:0043967","histone H4 acetylation","1/75","14/5146",0.186008602368382,0.612631511783782,0.575510540039254,"Zci_07616",1
"GO:0061013","GO:0061013","regulation of mRNA catabolic process","1/75","14/5146",0.186008602368382,0.612631511783782,0.575510540039254,"Zci_06300",1
"GO:1904062","GO:1904062","regulation of cation transmembrane transport","1/75","14/5146",0.186008602368382,0.612631511783782,0.575510540039254,"Zci_14637",1
"GO:0009150","GO:0009150","purine ribonucleotide metabolic process","2/75","55/5146",0.190828022646126,0.612631511783782,0.575510540039254,"Zci_06294/Zci_14266",2
"GO:0008610","GO:0008610","lipid biosynthetic process","4/75","157/5146",0.194865171844432,0.612631511783782,0.575510540039254,"Zci_01149/Zci_06420/Zci_13189/Zci_13898",4
"GO:0006470","GO:0006470","protein dephosphorylation","2/75","56/5146",0.196135060591126,0.612631511783782,0.575510540039254,"Zci_03531/Zci_10519",2
"GO:0009312","GO:0009312","oligosaccharide biosynthetic process","1/75","15/5146",0.197904423650996,0.612631511783782,0.575510540039254,"Zci_07867",1
"GO:0009698","GO:0009698","phenylpropanoid metabolic process","1/75","15/5146",0.197904423650996,0.612631511783782,0.575510540039254,"Zci_01832",1
"GO:0033865","GO:0033865","nucleoside bisphosphate metabolic process","1/75","15/5146",0.197904423650996,0.612631511783782,0.575510540039254,"Zci_14266",1
"GO:0033875","GO:0033875","ribonucleoside bisphosphate metabolic process","1/75","15/5146",0.197904423650996,0.612631511783782,0.575510540039254,"Zci_14266",1
"GO:0034032","GO:0034032","purine nucleoside bisphosphate metabolic process","1/75","15/5146",0.197904423650996,0.612631511783782,0.575510540039254,"Zci_14266",1
"GO:0051348","GO:0051348","negative regulation of transferase activity","1/75","15/5146",0.197904423650996,0.612631511783782,0.575510540039254,"Zci_03531",1
"GO:0006163","GO:0006163","purine nucleotide metabolic process","2/75","57/5146",0.201461093542453,0.612631511783782,0.575510540039254,"Zci_06294/Zci_14266",2
"GO:0016053","GO:0016053","organic acid biosynthetic process","4/75","161/5146",0.206937773726442,0.612631511783782,0.575510540039254,"Zci_02209/Zci_06420/Zci_09882/Zci_13898",4
"GO:0046394","GO:0046394","carboxylic acid biosynthetic process","4/75","161/5146",0.206937773726442,0.612631511783782,0.575510540039254,"Zci_02209/Zci_06420/Zci_09882/Zci_13898",4
"GO:0010359","GO:0010359","regulation of anion channel activity","1/75","16/5146",0.209628681734445,0.612631511783782,0.575510540039254,"Zci_14637",1
"GO:0031146","GO:0031146","SCF-dependent proteasomal ubiquitin-dependent protein catabolic process","1/75","16/5146",0.209628681734445,0.612631511783782,0.575510540039254,"Zci_06178",1
"GO:0042752","GO:0042752","regulation of circadian rhythm","1/75","16/5146",0.209628681734445,0.612631511783782,0.575510540039254,"Zci_05187",1
"GO:0043487","GO:0043487","regulation of RNA stability","1/75","16/5146",0.209628681734445,0.612631511783782,0.575510540039254,"Zci_06300",1
"GO:0044550","GO:0044550","secondary metabolite biosynthetic process","1/75","16/5146",0.209628681734445,0.612631511783782,0.575510540039254,"Zci_01832",1
"GO:1903959","GO:1903959","regulation of anion transmembrane transport","1/75","16/5146",0.209628681734445,0.612631511783782,0.575510540039254,"Zci_14637",1
"GO:0071702","GO:0071702","organic substance transport","7/75","337/5146",0.218329805217174,0.612631511783782,0.575510540039254,"Zci_00614/Zci_01387/Zci_04278/Zci_05630/Zci_06420/Zci_10716/Zci_13832",7
"GO:0015780","GO:0015780","nucleotide-sugar transmembrane transport","1/75","17/5146",0.221183817966397,0.612631511783782,0.575510540039254,"Zci_13832",1
"GO:0018106","GO:0018106","peptidyl-histidine phosphorylation","1/75","17/5146",0.221183817966397,0.612631511783782,0.575510540039254,"Zci_02774",1
"GO:0035601","GO:0035601","protein deacylation","1/75","17/5146",0.221183817966397,0.612631511783782,0.575510540039254,"Zci_13189",1
"GO:0045489","GO:0045489","pectin biosynthetic process","1/75","17/5146",0.221183817966397,0.612631511783782,0.575510540039254,"Zci_00169",1
"GO:0051051","GO:0051051","negative regulation of transport","1/75","17/5146",0.221183817966397,0.612631511783782,0.575510540039254,"Zci_14637",1
"GO:0098732","GO:0098732","macromolecule deacylation","1/75","17/5146",0.221183817966397,0.612631511783782,0.575510540039254,"Zci_13189",1
"GO:1901575","GO:1901575","organic substance catabolic process","8/75","398/5146",0.221184808105069,0.612631511783782,0.575510540039254,"Zci_00307/Zci_01042/Zci_01338/Zci_06178/Zci_06183/Zci_08956/Zci_10596/Zci_13189",8
"GO:0030163","GO:0030163","protein catabolic process","4/75","166/5146",0.222332181406358,0.612631511783782,0.575510540039254,"Zci_01338/Zci_06178/Zci_06183/Zci_13189",4
"GO:0000271","GO:0000271","polysaccharide biosynthetic process","2/75","61/5146",0.222922779128758,0.612631511783782,0.575510540039254,"Zci_00169/Zci_09930",2
"GO:0019684","GO:0019684","photosynthesis, light reaction","2/75","61/5146",0.222922779128758,0.612631511783782,0.575510540039254,"Zci_07867/Zci_10519",2
"GO:0009620","GO:0009620","response to fungus","3/75","112/5146",0.223200300558355,0.612631511783782,0.575510540039254,"Zci_01028/Zci_06178/Zci_10596",3
"GO:0006970","GO:0006970","response to osmotic stress","5/75","225/5146",0.229606185763638,0.612631511783782,0.575510540039254,"Zci_01066/Zci_03531/Zci_04845/Zci_06178/Zci_08956",5
"GO:0001933","GO:0001933","negative regulation of protein phosphorylation","1/75","18/5146",0.232572239423313,0.612631511783782,0.575510540039254,"Zci_03531",1
"GO:0006378","GO:0006378","mRNA polyadenylation","1/75","18/5146",0.232572239423313,0.612631511783782,0.575510540039254,"Zci_06300",1
"GO:0006906","GO:0006906","vesicle fusion","1/75","18/5146",0.232572239423313,0.612631511783782,0.575510540039254,"Zci_06456",1
"GO:0008064","GO:0008064","regulation of actin polymerization or depolymerization","1/75","18/5146",0.232572239423313,0.612631511783782,0.575510540039254,"Zci_02787",1
"GO:0009741","GO:0009741","response to brassinosteroid","1/75","18/5146",0.232572239423313,0.612631511783782,0.575510540039254,"Zci_06808",1
"GO:0010928","GO:0010928","regulation of auxin mediated signaling pathway","1/75","18/5146",0.232572239423313,0.612631511783782,0.575510540039254,"Zci_02787",1
"GO:0018202","GO:0018202","peptidyl-histidine modification","1/75","18/5146",0.232572239423313,0.612631511783782,0.575510540039254,"Zci_02774",1
"GO:0030832","GO:0030832","regulation of actin filament length","1/75","18/5146",0.232572239423313,0.612631511783782,0.575510540039254,"Zci_02787",1
"GO:0042326","GO:0042326","negative regulation of phosphorylation","1/75","18/5146",0.232572239423313,0.612631511783782,0.575510540039254,"Zci_03531",1
"GO:0043631","GO:0043631","RNA polyadenylation","1/75","18/5146",0.232572239423313,0.612631511783782,0.575510540039254,"Zci_06300",1
"GO:0044070","GO:0044070","regulation of anion transport","1/75","18/5146",0.232572239423313,0.612631511783782,0.575510540039254,"Zci_14637",1
"GO:0071483","GO:0071483","cellular response to blue light","1/75","18/5146",0.232572239423313,0.612631511783782,0.575510540039254,"Zci_14637",1
"GO:0090174","GO:0090174","organelle membrane fusion","1/75","18/5146",0.232572239423313,0.612631511783782,0.575510540039254,"Zci_06456",1
"GO:0110053","GO:0110053","regulation of actin filament organization","1/75","18/5146",0.232572239423313,0.612631511783782,0.575510540039254,"Zci_02787",1
"GO:0009968","GO:0009968","negative regulation of signal transduction","2/75","63/5146",0.23372664399146,0.612631511783782,0.575510540039254,"Zci_03531/Zci_09440",2
"GO:0031329","GO:0031329","regulation of cellular catabolic process","2/75","63/5146",0.23372664399146,0.612631511783782,0.575510540039254,"Zci_06300/Zci_08956",2
"GO:0007389","GO:0007389","pattern specification process","2/75","64/5146",0.239141735573689,0.617271532059755,0.579869409152994,"Zci_01458/Zci_04898",2
"GO:0009411","GO:0009411","response to UV","2/75","64/5146",0.239141735573689,0.617271532059755,0.579869409152994,"Zci_03531/Zci_05187",2
"GO:0010410","GO:0010410","hemicellulose metabolic process","1/75","19/5146",0.243796319384945,0.617271532059755,0.579869409152994,"Zci_09930",1
"GO:0032956","GO:0032956","regulation of actin cytoskeleton organization","1/75","19/5146",0.243796319384945,0.617271532059755,0.579869409152994,"Zci_02787",1
"GO:0032970","GO:0032970","regulation of actin filament-based process","1/75","19/5146",0.243796319384945,0.617271532059755,0.579869409152994,"Zci_02787",1
"GO:0071900","GO:0071900","regulation of protein serine/threonine kinase activity","1/75","19/5146",0.243796319384945,0.617271532059755,0.579869409152994,"Zci_03531",1
"GO:1901000","GO:1901000","regulation of response to salt stress","1/75","19/5146",0.243796319384945,0.617271532059755,0.579869409152994,"Zci_01028",1
"GO:1902903","GO:1902903","regulation of supramolecular fiber organization","1/75","19/5146",0.243796319384945,0.617271532059755,0.579869409152994,"Zci_02787",1
"GO:0009259","GO:0009259","ribonucleotide metabolic process","2/75","66/5146",0.249991390084791,0.621716249381468,0.584044809237611,"Zci_06294/Zci_14266",2
"GO:0010648","GO:0010648","negative regulation of cell communication","2/75","66/5146",0.249991390084791,0.621716249381468,0.584044809237611,"Zci_03531/Zci_09440",2
"GO:0023057","GO:0023057","negative regulation of signaling","2/75","66/5146",0.249991390084791,0.621716249381468,0.584044809237611,"Zci_03531/Zci_09440",2
"GO:0048585","GO:0048585","negative regulation of response to stimulus","3/75","119/5146",0.250453275085321,0.621716249381468,0.584044809237611,"Zci_03531/Zci_06178/Zci_09440",3
"GO:1901137","GO:1901137","carbohydrate derivative biosynthetic process","4/75","175/5146",0.250776302271517,0.621716249381468,0.584044809237611,"Zci_00169/Zci_02209/Zci_06294/Zci_14266",4
"GO:0009226","GO:0009226","nucleotide-sugar biosynthetic process","1/75","20/5146",0.254858397802369,0.628752341054651,0.590654565413569,"Zci_02209",1
"GO:0051248","GO:0051248","negative regulation of protein metabolic process","2/75","68/5146",0.26085830658428,0.628752341054651,0.590654565413569,"Zci_03531/Zci_06178",2
"GO:0006091","GO:0006091","generation of precursor metabolites and energy","3/75","122/5146",0.262293223059401,0.628752341054651,0.590654565413569,"Zci_01042/Zci_07867/Zci_10519",3
"GO:0044283","GO:0044283","small molecule biosynthetic process","5/75","237/5146",0.262608535901627,0.628752341054651,0.590654565413569,"Zci_02209/Zci_06420/Zci_07867/Zci_09882/Zci_13898",5
"GO:1901565","GO:1901565","organonitrogen compound catabolic process","5/75","237/5146",0.262608535901627,0.628752341054651,0.590654565413569,"Zci_00307/Zci_01338/Zci_06178/Zci_06183/Zci_13189",5
"GO:0001522","GO:0001522","pseudouridine synthesis","1/75","21/5146",0.26576078175961,0.628752341054651,0.590654565413569,"Zci_01042",1
"GO:0005984","GO:0005984","disaccharide metabolic process","1/75","21/5146",0.26576078175961,0.628752341054651,0.590654565413569,"Zci_07867",1
"GO:0006334","GO:0006334","nucleosome assembly","1/75","21/5146",0.26576078175961,0.628752341054651,0.590654565413569,"Zci_01413",1
"GO:0006665","GO:0006665","sphingolipid metabolic process","1/75","21/5146",0.26576078175961,0.628752341054651,0.590654565413569,"Zci_01149",1
"GO:0009749","GO:0009749","response to glucose","1/75","21/5146",0.26576078175961,0.628752341054651,0.590654565413569,"Zci_08956",1
"GO:0032200","GO:0032200","telomere organization","1/75","21/5146",0.26576078175961,0.628752341054651,0.590654565413569,"Zci_03703",1
"GO:0007017","GO:0007017","microtubule-based process","2/75","69/5146",0.266295109152558,0.628752341054651,0.590654565413569,"Zci_01458/Zci_04898",2
"GO:0006811","GO:0006811","ion transport","5/75","241/5146",0.273863883945712,0.630368417652389,0.592172719634531,"Zci_00614/Zci_01387/Zci_05630/Zci_10716/Zci_13832",5
"GO:0008285","GO:0008285","negative regulation of cell population proliferation","1/75","22/5146",0.276505745928982,0.630368417652389,0.592172719634531,"Zci_04633",1
"GO:0000302","GO:0000302","response to reactive oxygen species","2/75","71/5146",0.277169446295401,0.630368417652389,0.592172719634531,"Zci_01656/Zci_09882",2
"GO:0072521","GO:0072521","purine-containing compound metabolic process","2/75","71/5146",0.277169446295401,0.630368417652389,0.592172719634531,"Zci_06294/Zci_14266",2
"GO:1901293","GO:1901293","nucleoside phosphate biosynthetic process","2/75","71/5146",0.277169446295401,0.630368417652389,0.592172719634531,"Zci_06294/Zci_14266",2
"GO:0019693","GO:0019693","ribose phosphate metabolic process","2/75","72/5146",0.282604698066716,0.630368417652389,0.592172719634531,"Zci_06294/Zci_14266",2
"GO:0072330","GO:0072330","monocarboxylic acid biosynthetic process","2/75","72/5146",0.282604698066716,0.630368417652389,0.592172719634531,"Zci_06420/Zci_13898",2
"GO:0003333","GO:0003333","amino acid transmembrane transport","1/75","23/5146",0.287095533020185,0.630368417652389,0.592172719634531,"Zci_01387",1
"GO:0009640","GO:0009640","photomorphogenesis","1/75","23/5146",0.287095533020185,0.630368417652389,0.592172719634531,"Zci_05187",1
"GO:0042157","GO:0042157","lipoprotein metabolic process","1/75","23/5146",0.287095533020185,0.630368417652389,0.592172719634531,"Zci_13189",1
"GO:0051493","GO:0051493","regulation of cytoskeleton organization","1/75","23/5146",0.287095533020185,0.630368417652389,0.592172719634531,"Zci_02787",1
"GO:0060249","GO:0060249","anatomical structure homeostasis","1/75","23/5146",0.287095533020185,0.630368417652389,0.592172719634531,"Zci_03703",1
"GO:1902532","GO:1902532","negative regulation of intracellular signal transduction","1/75","23/5146",0.287095533020185,0.630368417652389,0.592172719634531,"Zci_03531",1
"GO:2000377","GO:2000377","regulation of reactive oxygen species metabolic process","1/75","23/5146",0.287095533020185,0.630368417652389,0.592172719634531,"Zci_09440",1
"GO:0009856","GO:0009856","pollination","2/75","73/5146",0.288037203953676,0.630368417652389,0.592172719634531,"Zci_00169/Zci_01359",2
"GO:0044706","GO:0044706","multi-multicellular organism process","2/75","73/5146",0.288037203953676,0.630368417652389,0.592172719634531,"Zci_00169/Zci_01359",2
"GO:0051301","GO:0051301","cell division","2/75","73/5146",0.288037203953676,0.630368417652389,0.592172719634531,"Zci_06456/Zci_13832",2
"GO:0009165","GO:0009165","nucleotide biosynthetic process","2/75","74/5146",0.29346590231521,0.630368417652389,0.592172719634531,"Zci_06294/Zci_14266",2
"GO:0009414","GO:0009414","response to water deprivation","3/75","130/5146",0.294193078003466,0.630368417652389,0.592172719634531,"Zci_00614/Zci_01042/Zci_08956",3
"GO:0065009","GO:0065009","regulation of molecular function","4/75","189/5146",0.296443740476781,0.630368417652389,0.592172719634531,"Zci_02787/Zci_03531/Zci_05187/Zci_14637",4
"GO:0000723","GO:0000723","telomere maintenance","1/75","24/5146",0.297532354223286,0.630368417652389,0.592172719634531,"Zci_03703",1
"GO:0006865","GO:0006865","amino acid transport","1/75","24/5146",0.297532354223286,0.630368417652389,0.592172719634531,"Zci_01387",1
"GO:0009072","GO:0009072","aromatic amino acid family metabolic process","1/75","24/5146",0.297532354223286,0.630368417652389,0.592172719634531,"Zci_00307",1
"GO:0010563","GO:0010563","negative regulation of phosphorus metabolic process","1/75","24/5146",0.297532354223286,0.630368417652389,0.592172719634531,"Zci_03531",1
"GO:0031124","GO:0031124","mRNA 3'-end processing","1/75","24/5146",0.297532354223286,0.630368417652389,0.592172719634531,"Zci_06300",1
"GO:0045936","GO:0045936","negative regulation of phosphate metabolic process","1/75","24/5146",0.297532354223286,0.630368417652389,0.592172719634531,"Zci_03531",1
"GO:0047484","GO:0047484","regulation of response to osmotic stress","1/75","24/5146",0.297532354223286,0.630368417652389,0.592172719634531,"Zci_01028",1
"GO:0009415","GO:0009415","response to water","3/75","131/5146",0.298204693778754,0.630368417652389,0.592172719634531,"Zci_00614/Zci_01042/Zci_08956",3
"GO:0006631","GO:0006631","fatty acid metabolic process","2/75","76/5146",0.304307782759686,0.630368417652389,0.592172719634531,"Zci_06420/Zci_13898",2
"GO:0045087","GO:0045087","innate immune response","2/75","76/5146",0.304307782759686,0.630368417652389,0.592172719634531,"Zci_06294/Zci_13189",2
"GO:0009225","GO:0009225","nucleotide-sugar metabolic process","1/75","25/5146",0.307818389645632,0.630368417652389,0.592172719634531,"Zci_02209",1
"GO:0022898","GO:0022898","regulation of transmembrane transporter activity","1/75","25/5146",0.307818389645632,0.630368417652389,0.592172719634531,"Zci_14637",1
"GO:0032409","GO:0032409","regulation of transporter activity","1/75","25/5146",0.307818389645632,0.630368417652389,0.592172719634531,"Zci_14637",1
"GO:0032412","GO:0032412","regulation of ion transmembrane transporter activity","1/75","25/5146",0.307818389645632,0.630368417652389,0.592172719634531,"Zci_14637",1
"GO:0046474","GO:0046474","glycerophospholipid biosynthetic process","1/75","25/5146",0.307818389645632,0.630368417652389,0.592172719634531,"Zci_13189",1
"GO:0048573","GO:0048573","photoperiodism, flowering","1/75","25/5146",0.307818389645632,0.630368417652389,0.592172719634531,"Zci_05187",1
"GO:0048767","GO:0048767","root hair elongation","1/75","25/5146",0.307818389645632,0.630368417652389,0.592172719634531,"Zci_06178",1
"GO:0009056","GO:0009056","catabolic process","8/75","440/5146",0.309779011781689,0.630368417652389,0.592172719634531,"Zci_00307/Zci_01042/Zci_01338/Zci_06178/Zci_06183/Zci_08956/Zci_10596/Zci_13189",8
"GO:1901135","GO:1901135","carbohydrate derivative metabolic process","5/75","254/5146",0.311119245560313,0.630368417652389,0.592172719634531,"Zci_00169/Zci_02209/Zci_06294/Zci_07867/Zci_14266",5
"GO:0009416","GO:0009416","response to light stimulus","5/75","255/5146",0.314019913902688,0.630368417652389,0.592172719634531,"Zci_01656/Zci_03531/Zci_05187/Zci_12061/Zci_14637",5
"GO:0090407","GO:0090407","organophosphate biosynthetic process","3/75","135/5146",0.314283466155444,0.630368417652389,0.592172719634531,"Zci_06294/Zci_13189/Zci_14266",3
"GO:0043161","GO:0043161","proteasome-mediated ubiquitin-dependent protein catabolic process","2/75","78/5146",0.31512244872094,0.630368417652389,0.592172719634531,"Zci_01338/Zci_06178",2
"GO:0009756","GO:0009756","carbohydrate mediated signaling","1/75","26/5146",0.317955788742796,0.630368417652389,0.592172719634531,"Zci_08956",1
"GO:0010182","GO:0010182","sugar mediated signaling pathway","1/75","26/5146",0.317955788742796,0.630368417652389,0.592172719634531,"Zci_08956",1
"GO:0015698","GO:0015698","inorganic anion transport","1/75","26/5146",0.317955788742796,0.630368417652389,0.592172719634531,"Zci_05630",1
"GO:0061025","GO:0061025","membrane fusion","1/75","26/5146",0.317955788742796,0.630368417652389,0.592172719634531,"Zci_06456",1
"GO:0046686","GO:0046686","response to cadmium ion","3/75","137/5146",0.322335661743198,0.630368417652389,0.592172719634531,"Zci_01042/Zci_01066/Zci_04845",3
"GO:0009651","GO:0009651","response to salt stress","4/75","197/5146",0.323049078821758,0.630368417652389,0.592172719634531,"Zci_01066/Zci_03531/Zci_04845/Zci_06178",4
"GO:0009737","GO:0009737","response to abscisic acid","4/75","197/5146",0.323049078821758,0.630368417652389,0.592172719634531,"Zci_01028/Zci_08956/Zci_12345/Zci_12937",4
"GO:0010498","GO:0010498","proteasomal protein catabolic process","2/75","80/5146",0.325902470279438,0.630368417652389,0.592172719634531,"Zci_01338/Zci_06178",2
"GO:0009630","GO:0009630","gravitropism","1/75","27/5146",0.327946670743634,0.630368417652389,0.592172719634531,"Zci_02787",1
"GO:0009746","GO:0009746","response to hexose","1/75","27/5146",0.327946670743634,0.630368417652389,0.592172719634531,"Zci_08956",1
"GO:0010218","GO:0010218","response to far red light","1/75","27/5146",0.327946670743634,0.630368417652389,0.592172719634531,"Zci_05187",1
"GO:0022604","GO:0022604","regulation of cell morphogenesis","1/75","27/5146",0.327946670743634,0.630368417652389,0.592172719634531,"Zci_02787",1
"GO:0042446","GO:0042446","hormone biosynthetic process","1/75","27/5146",0.327946670743634,0.630368417652389,0.592172719634531,"Zci_06300",1
"GO:1901606","GO:1901606","alpha-amino acid catabolic process","1/75","27/5146",0.327946670743634,0.630368417652389,0.592172719634531,"Zci_00307",1
"GO:0009790","GO:0009790","embryo development","4/75","199/5146",0.32973578988244,0.630368417652389,0.592172719634531,"Zci_01458/Zci_01656/Zci_03531/Zci_04898",4
"GO:0006955","GO:0006955","immune response","2/75","81/5146",0.331277288745481,0.630368417652389,0.592172719634531,"Zci_06294/Zci_13189",2
"GO:0070925","GO:0070925","organelle assembly","2/75","82/5146",0.336640858825395,0.630368417652389,0.592172719634531,"Zci_01458/Zci_04898",2
"GO:0000911","GO:0000911","cytokinesis by cell plate formation","1/75","28/5146",0.337793125069523,0.630368417652389,0.592172719634531,"Zci_06456",1
"GO:0010114","GO:0010114","response to red light","1/75","28/5146",0.337793125069523,0.630368417652389,0.592172719634531,"Zci_05187",1
"GO:0034284","GO:0034284","response to monosaccharide","1/75","28/5146",0.337793125069523,0.630368417652389,0.592172719634531,"Zci_08956",1
"GO:0034765","GO:0034765","regulation of ion transmembrane transport","1/75","28/5146",0.337793125069523,0.630368417652389,0.592172719634531,"Zci_14637",1
"GO:0042364","GO:0042364","water-soluble vitamin biosynthetic process","1/75","28/5146",0.337793125069523,0.630368417652389,0.592172719634531,"Zci_09882",1
"GO:0140014","GO:0140014","mitotic nuclear division","1/75","28/5146",0.337793125069523,0.630368417652389,0.592172719634531,"Zci_06456",1
"GO:1902410","GO:1902410","mitotic cytokinetic process","1/75","28/5146",0.337793125069523,0.630368417652389,0.592172719634531,"Zci_06456",1
"GO:0009966","GO:0009966","regulation of signal transduction","3/75","143/5146",0.346500283135486,0.630368417652389,0.592172719634531,"Zci_02787/Zci_03531/Zci_09440",3
"GO:0071214","GO:0071214","cellular response to abiotic stimulus","2/75","84/5146",0.347331048324614,0.630368417652389,0.592172719634531,"Zci_00614/Zci_14637",2
"GO:0104004","GO:0104004","cellular response to environmental stimulus","2/75","84/5146",0.347331048324614,0.630368417652389,0.592172719634531,"Zci_00614/Zci_14637",2
"GO:0009739","GO:0009739","response to gibberellin","1/75","29/5146",0.347497211747872,0.630368417652389,0.592172719634531,"Zci_09440",1
"GO:0019216","GO:0019216","regulation of lipid metabolic process","1/75","29/5146",0.347497211747872,0.630368417652389,0.592172719634531,"Zci_08956",1
"GO:0031348","GO:0031348","negative regulation of defense response","1/75","29/5146",0.347497211747872,0.630368417652389,0.592172719634531,"Zci_06178",1
"GO:0032506","GO:0032506","cytokinetic process","1/75","29/5146",0.347497211747872,0.630368417652389,0.592172719634531,"Zci_06456",1
"GO:0048284","GO:0048284","organelle fusion","1/75","29/5146",0.347497211747872,0.630368417652389,0.592172719634531,"Zci_06456",1
"GO:0048511","GO:0048511","rhythmic process","1/75","29/5146",0.347497211747872,0.630368417652389,0.592172719634531,"Zci_14637",1
"GO:2000028","GO:2000028","regulation of photoperiodism, flowering","1/75","29/5146",0.347497211747872,0.630368417652389,0.592172719634531,"Zci_15627",1
"GO:0044248","GO:0044248","cellular catabolic process","7/75","396/5146",0.355086425655949,0.639913470731566,0.601139412575783,"Zci_00307/Zci_01042/Zci_01338/Zci_06178/Zci_06183/Zci_08956/Zci_10596",7
"GO:0006855","GO:0006855","xenobiotic transmembrane transport","1/75","30/5146",0.357060961819966,0.639913470731566,0.601139412575783,"Zci_05630",1
"GO:0007623","GO:0007623","circadian rhythm","1/75","30/5146",0.357060961819966,0.639913470731566,0.601139412575783,"Zci_14637",1
"GO:1903311","GO:1903311","regulation of mRNA metabolic process","1/75","30/5146",0.357060961819966,0.639913470731566,0.601139412575783,"Zci_06300",1
"GO:0044257","GO:0044257","cellular protein catabolic process","3/75","147/5146",0.362582677313831,0.643243052381214,0.604267246022866,"Zci_01338/Zci_06178/Zci_06183",3
"GO:0006767","GO:0006767","water-soluble vitamin metabolic process","1/75","31/5146",0.366486377743247,0.643243052381214,0.604267246022866,"Zci_09882",1
"GO:0009629","GO:0009629","response to gravity","1/75","31/5146",0.366486377743247,0.643243052381214,0.604267246022866,"Zci_02787",1
"GO:0010109","GO:0010109","regulation of photosynthesis","1/75","31/5146",0.366486377743247,0.643243052381214,0.604267246022866,"Zci_10519",1
"GO:0031400","GO:0031400","negative regulation of protein modification process","1/75","31/5146",0.366486377743247,0.643243052381214,0.604267246022866,"Zci_03531",1
"GO:0032880","GO:0032880","regulation of protein localization","1/75","31/5146",0.366486377743247,0.643243052381214,0.604267246022866,"Zci_08956",1
"GO:0034762","GO:0034762","regulation of transmembrane transport","1/75","31/5146",0.366486377743247,0.643243052381214,0.604267246022866,"Zci_14637",1
"GO:0009314","GO:0009314","response to radiation","5/75","274/5146",0.369695884320639,0.644341161682709,0.605298817962881,"Zci_01656/Zci_03531/Zci_05187/Zci_12061/Zci_14637",5
"GO:0019637","GO:0019637","organophosphate metabolic process","4/75","211/5146",0.369989848841678,0.644341161682709,0.605298817962881,"Zci_06294/Zci_07867/Zci_13189/Zci_14266",4
"GO:0010646","GO:0010646","regulation of cell communication","3/75","150/5146",0.374611791271313,0.644341161682709,0.605298817962881,"Zci_02787/Zci_03531/Zci_09440",3
"GO:0040007","GO:0040007","growth","3/75","150/5146",0.374611791271313,0.644341161682709,0.605298817962881,"Zci_02774/Zci_06178/Zci_08956",3
"GO:0009063","GO:0009063","cellular amino acid catabolic process","1/75","32/5146",0.375775433788067,0.644341161682709,0.605298817962881,"Zci_00307",1
"GO:0009311","GO:0009311","oligosaccharide metabolic process","1/75","32/5146",0.375775433788067,0.644341161682709,0.605298817962881,"Zci_07867",1
"GO:0010150","GO:0010150","leaf senescence","1/75","32/5146",0.375775433788067,0.644341161682709,0.605298817962881,"Zci_06300",1
"GO:0090693","GO:0090693","plant organ senescence","1/75","32/5146",0.375775433788067,0.644341161682709,0.605298817962881,"Zci_06300",1
"GO:0051603","GO:0051603","proteolysis involved in cellular protein catabolic process","3/75","151/5146",0.378613237289912,0.646986992868006,0.607784331203735,"Zci_01338/Zci_06178/Zci_06183",3
"GO:0023051","GO:0023051","regulation of signaling","3/75","152/5146",0.382609941284085,0.646986992868006,0.607784331203735,"Zci_02787/Zci_03531/Zci_09440",3
"GO:0006629","GO:0006629","lipid metabolic process","5/75","279/5146",0.384437321188198,0.646986992868006,0.607784331203735,"Zci_01149/Zci_02539/Zci_06420/Zci_13189/Zci_13898",5
"GO:0016573","GO:0016573","histone acetylation","1/75","33/5146",0.384930076429032,0.646986992868006,0.607784331203735,"Zci_07616",1
"GO:0018393","GO:0018393","internal peptidyl-lysine acetylation","1/75","33/5146",0.384930076429032,0.646986992868006,0.607784331203735,"Zci_07616",1
"GO:0018394","GO:0018394","peptidyl-lysine acetylation","1/75","33/5146",0.384930076429032,0.646986992868006,0.607784331203735,"Zci_07616",1
"GO:0032535","GO:0032535","regulation of cellular component size","1/75","33/5146",0.384930076429032,0.646986992868006,0.607784331203735,"Zci_02787",1
"GO:0006475","GO:0006475","internal protein amino acid acetylation","1/75","34/5146",0.393952224730973,0.654752999203712,0.615079774572616,"Zci_07616",1
"GO:0019748","GO:0019748","secondary metabolic process","1/75","34/5146",0.393952224730973,0.654752999203712,0.615079774572616,"Zci_01832",1
"GO:0048527","GO:0048527","lateral root development","1/75","34/5146",0.393952224730973,0.654752999203712,0.615079774572616,"Zci_08956",1
"GO:0090066","GO:0090066","regulation of anatomical structure size","1/75","34/5146",0.393952224730973,0.654752999203712,0.615079774572616,"Zci_02787",1
"GO:0007010","GO:0007010","cytoskeleton organization","2/75","94/5146",0.399856561126745,0.660874038528926,0.620829923854683,"Zci_01458/Zci_04898",2
"GO:0009658","GO:0009658","chloroplast organization","2/75","94/5146",0.399856561126745,0.660874038528926,0.620829923854683,"Zci_05187/Zci_14637",2
"GO:0006887","GO:0006887","exocytosis","1/75","35/5146",0.402843770729638,0.662034064285286,0.621919660566982,"Zci_06456",1
"GO:0043086","GO:0043086","negative regulation of catalytic activity","1/75","35/5146",0.402843770729638,0.662034064285286,0.621919660566982,"Zci_03531",1
"GO:0015979","GO:0015979","photosynthesis","2/75","95/5146",0.405009074621587,0.662034064285286,0.621919660566982,"Zci_07867/Zci_10519",2
"GO:0048366","GO:0048366","leaf development","2/75","95/5146",0.405009074621587,0.662034064285286,0.621919660566982,"Zci_01656/Zci_06300",2
"GO:0010035","GO:0010035","response to inorganic substance","6/75","353/5146",0.410369082265774,0.663701666626741,0.623486218449889,"Zci_00614/Zci_01042/Zci_01066/Zci_04845/Zci_08956/Zci_09882",6
"GO:0010087","GO:0010087","phloem or xylem histogenesis","1/75","36/5146",0.411606579807172,0.663701666626741,0.623486218449889,"Zci_02774",1
"GO:0042176","GO:0042176","regulation of protein catabolic process","1/75","36/5146",0.411606579807172,0.663701666626741,0.623486218449889,"Zci_06178",1
"GO:0042445","GO:0042445","hormone metabolic process","1/75","36/5146",0.411606579807172,0.663701666626741,0.623486218449889,"Zci_06300",1
"GO:1901264","GO:1901264","carbohydrate derivative transport","1/75","36/5146",0.411606579807172,0.663701666626741,0.623486218449889,"Zci_13832",1
"GO:0055086","GO:0055086","nucleobase-containing small molecule metabolic process","3/75","160/5146",0.414371090199945,0.665970614346401,0.625617684596088,"Zci_02209/Zci_06294/Zci_14266",3
"GO:0046677","GO:0046677","response to antibiotic","2/75","97/5146",0.415252265415991,0.665970614346401,0.625617684596088,"Zci_09882/Zci_12061",2
"GO:0006473","GO:0006473","protein acetylation","1/75","37/5146",0.420242491062449,0.672162048876766,0.631433963650708,"Zci_07616",1
"GO:0044255","GO:0044255","cellular lipid metabolic process","4/75","227/5146",0.423470524456281,0.675509281639375,0.634578378682899,"Zci_01149/Zci_06420/Zci_13189/Zci_13898",4
"GO:0043269","GO:0043269","regulation of ion transport","1/75","38/5146",0.428753317676329,0.679109149156115,0.637960120657934,"Zci_14637",1
"GO:0043543","GO:0043543","protein acylation","1/75","38/5146",0.428753317676329,0.679109149156115,0.637960120657934,"Zci_07616",1
"GO:0014070","GO:0014070","response to organic cyclic compound","2/75","101/5146",0.43547793717616,0.679109149156115,0.637960120657934,"Zci_06808/Zci_12061",2
"GO:1903047","GO:1903047","mitotic cell cycle process","2/75","101/5146",0.43547793717616,0.679109149156115,0.637960120657934,"Zci_06456/Zci_13832",2
"GO:0009744","GO:0009744","response to sucrose","1/75","39/5146",0.43714084727192,0.679109149156115,0.637960120657934,"Zci_08956",1
"GO:0015980","GO:0015980","energy derivation by oxidation of organic compounds","1/75","39/5146",0.43714084727192,0.679109149156115,0.637960120657934,"Zci_01042",1
"GO:0031123","GO:0031123","RNA 3'-end processing","1/75","39/5146",0.43714084727192,0.679109149156115,0.637960120657934,"Zci_06300",1
"GO:0034285","GO:0034285","response to disaccharide","1/75","39/5146",0.43714084727192,0.679109149156115,0.637960120657934,"Zci_08956",1
"GO:0045088","GO:0045088","regulation of innate immune response","1/75","39/5146",0.43714084727192,0.679109149156115,0.637960120657934,"Zci_13189",1
"GO:0080147","GO:0080147","root hair cell development","1/75","39/5146",0.43714084727192,0.679109149156115,0.637960120657934,"Zci_06178",1
"GO:0009408","GO:0009408","response to heat","2/75","102/5146",0.440477463080451,0.682510652429344,0.641155517806248,"Zci_06808/Zci_09882",2
"GO:0009637","GO:0009637","response to blue light","1/75","40/5146",0.445406842269884,0.686572723188034,0.644971456900214,"Zci_14637",1
"GO:0071322","GO:0071322","cellular response to carbohydrate stimulus","1/75","40/5146",0.445406842269884,0.686572723188034,0.644971456900214,"Zci_08956",1
"GO:0010628","GO:0010628","positive regulation of gene expression","3/75","170/5146",0.45335971042127,0.688428721791177,0.646714995614534,"Zci_06113/Zci_06300/Zci_08956",3
"GO:0006650","GO:0006650","glycerophospholipid metabolic process","1/75","41/5146",0.453553040238893,0.688428721791177,0.646714995614534,"Zci_13189",1
"GO:0032940","GO:0032940","secretion by cell","1/75","41/5146",0.453553040238893,0.688428721791177,0.646714995614534,"Zci_06456",1
"GO:0045017","GO:0045017","glycerolipid biosynthetic process","1/75","41/5146",0.453553040238893,0.688428721791177,0.646714995614534,"Zci_13189",1
"GO:0046467","GO:0046467","membrane lipid biosynthetic process","1/75","41/5146",0.453553040238893,0.688428721791177,0.646714995614534,"Zci_01149",1
"GO:0048528","GO:0048528","post-embryonic root development","1/75","41/5146",0.453553040238893,0.688428721791177,0.646714995614534,"Zci_08956",1
"GO:0000278","GO:0000278","mitotic cell cycle","2/75","106/5146",0.460236127051543,0.691790394895591,0.649872976009834,"Zci_06456/Zci_13832",2
"GO:0007568","GO:0007568","aging","1/75","42/5146",0.46158115424126,0.691790394895591,0.649872976009834,"Zci_06300",1
"GO:0016050","GO:0016050","vesicle organization","1/75","42/5146",0.46158115424126,0.691790394895591,0.649872976009834,"Zci_06456",1
"GO:0051656","GO:0051656","establishment of organelle localization","1/75","42/5146",0.46158115424126,0.691790394895591,0.649872976009834,"Zci_14637",1
"GO:0080167","GO:0080167","response to karrikin","1/75","42/5146",0.46158115424126,0.691790394895591,0.649872976009834,"Zci_06678",1
"GO:1901362","GO:1901362","organic cyclic compound biosynthetic process","5/75","306/5146",0.463493725101431,0.692911473455657,0.650926125439989,"Zci_01832/Zci_02209/Zci_06294/Zci_06420/Zci_14266",5
"GO:0045859","GO:0045859","regulation of protein kinase activity","1/75","43/5146",0.469492873173843,0.697332377807781,0.655079155446142,"Zci_03531",1
"GO:0046903","GO:0046903","secretion","1/75","43/5146",0.469492873173843,0.697332377807781,0.655079155446142,"Zci_06456",1
"GO:0098660","GO:0098660","inorganic ion transmembrane transport","2/75","108/5146",0.469966863026757,0.697332377807781,0.655079155446142,"Zci_05630/Zci_10716",2
"GO:0019752","GO:0019752","carboxylic acid metabolic process","5/75","310/5146",0.475018422353489,0.703074530597826,0.660473375935331,"Zci_00307/Zci_02209/Zci_06420/Zci_09882/Zci_13898",5
"GO:0043436","GO:0043436","oxoacid metabolic process","5/75","311/5146",0.477888464885575,0.705567336493591,0.662815136095704,"Zci_00307/Zci_02209/Zci_06420/Zci_09882/Zci_13898",5
"GO:0006082","GO:0006082","organic acid metabolic process","5/75","312/5146",0.480753808912022,0.70804088193726,0.665138802845971,"Zci_00307/Zci_02209/Zci_06420/Zci_09882/Zci_13898",5
"GO:0048764","GO:0048764","trichoblast maturation","1/75","45/5146",0.48497376260254,0.710737410710619,0.667671941773266,"Zci_06178",1
"GO:0048765","GO:0048765","root hair cell differentiation","1/75","45/5146",0.48497376260254,0.710737410710619,0.667671941773266,"Zci_06178",1
"GO:0019941","GO:0019941","modification-dependent protein catabolic process","2/75","112/5146",0.48911866857028,0.714792646037849,0.671481459612734,"Zci_01338/Zci_06178",2
"GO:0008654","GO:0008654","phospholipid biosynthetic process","1/75","46/5146",0.492546193068098,0.714792646037849,0.671481459612734,"Zci_13189",1
"GO:0010054","GO:0010054","trichoblast differentiation","1/75","46/5146",0.492546193068098,0.714792646037849,0.671481459612734,"Zci_06178",1
"GO:0043549","GO:0043549","regulation of kinase activity","1/75","46/5146",0.492546193068098,0.714792646037849,0.671481459612734,"Zci_03531",1
"GO:0002376","GO:0002376","immune system process","2/75","113/5146",0.493840509685676,0.714901641764008,0.671583850998122,"Zci_06294/Zci_13189",2
"GO:0051172","GO:0051172","negative regulation of nitrogen compound metabolic process","3/75","181/5146",0.495024330095414,0.714901641764008,0.671583850998122,"Zci_03531/Zci_06178/Zci_06300",3
"GO:0003006","GO:0003006","developmental process involved in reproduction","6/75","386/5146",0.497337079242836,0.716502571790526,0.673087776418875,"Zci_00169/Zci_01359/Zci_01656/Zci_05187/Zci_08956/Zci_13832",6
"GO:0042127","GO:0042127","regulation of cell population proliferation","1/75","47/5146",0.500008749052391,0.71688001370162,0.673442348121292,"Zci_04633",1
"GO:0048469","GO:0048469","cell maturation","1/75","47/5146",0.500008749052391,0.71688001370162,0.673442348121292,"Zci_06178",1
"GO:0009117","GO:0009117","nucleotide metabolic process","2/75","115/5146",0.50320314919137,0.717736075024939,0.674246538413521,"Zci_06294/Zci_14266",2
"GO:0006643","GO:0006643","membrane lipid metabolic process","1/75","48/5146",0.507363003577017,0.717736075024939,0.674246538413521,"Zci_01149",1
"GO:0006839","GO:0006839","mitochondrial transport","1/75","48/5146",0.507363003577017,0.717736075024939,0.674246538413521,"Zci_05630",1
"GO:0009753","GO:0009753","response to jasmonic acid","1/75","48/5146",0.507363003577017,0.717736075024939,0.674246538413521,"Zci_09882",1
"GO:1902531","GO:1902531","regulation of intracellular signal transduction","1/75","48/5146",0.507363003577017,0.717736075024939,0.674246538413521,"Zci_03531",1
"GO:0006753","GO:0006753","nucleoside phosphate metabolic process","2/75","116/5146",0.507843508547058,0.717736075024939,0.674246538413521,"Zci_06294/Zci_14266",2
"GO:0042440","GO:0042440","pigment metabolic process","1/75","49/5146",0.5146105074475,0.722153896064298,0.678396671933025,"Zci_05187",1
"GO:0050776","GO:0050776","regulation of immune response","1/75","49/5146",0.5146105074475,0.722153896064298,0.678396671933025,"Zci_13189",1
"GO:1902600","GO:1902600","proton transmembrane transport","1/75","49/5146",0.5146105074475,0.722153896064298,0.678396671933025,"Zci_10716",1
"GO:0022603","GO:0022603","regulation of anatomical structure morphogenesis","1/75","50/5146",0.521752789562752,0.730453905387853,0.686193761629279,"Zci_02787",1
"GO:0034654","GO:0034654","nucleobase-containing compound biosynthetic process","3/75","190/5146",0.527958345972647,0.737406609985271,0.692725183374045,"Zci_02209/Zci_06294/Zci_14266",3
"GO:0033043","GO:0033043","regulation of organelle organization","2/75","121/5146",0.530627968400622,0.737672058874697,0.692974548009666,"Zci_02787/Zci_03703",2
"GO:0048589","GO:0048589","developmental growth","2/75","121/5146",0.530627968400622,0.737672058874697,0.692974548009666,"Zci_06178/Zci_08956",2
"GO:0043632","GO:0043632","modification-dependent macromolecule catabolic process","2/75","122/5146",0.535100214156309,0.739577678348625,0.694764700934312,"Zci_01338/Zci_06178",2
"GO:0010053","GO:0010053","root epidermal cell differentiation","1/75","52/5146",0.535727696417239,0.739577678348625,0.694764700934312,"Zci_06178",1
"GO:0071482","GO:0071482","cellular response to light stimulus","1/75","52/5146",0.535727696417239,0.739577678348625,0.694764700934312,"Zci_14637",1
"GO:0010038","GO:0010038","response to metal ion","3/75","194/5146",0.542224040011126,0.742126774546248,0.697159340617528,"Zci_01042/Zci_01066/Zci_04845",3
"GO:0008219","GO:0008219","cell death","1/75","53/5146",0.542563272147257,0.742126774546248,0.697159340617528,"Zci_06300",1
"GO:0010228","GO:0010228","vegetative to reproductive phase transition of meristem","1/75","53/5146",0.542563272147257,0.742126774546248,0.697159340617528,"Zci_05187",1
"GO:0090501","GO:0090501","RNA phosphodiester bond hydrolysis","1/75","53/5146",0.542563272147257,0.742126774546248,0.697159340617528,"Zci_06300",1
"GO:0048827","GO:0048827","phyllome development","2/75","124/5146",0.543958900805268,0.742329233897098,0.697349532418149,"Zci_01656/Zci_06300",2
"GO:0002682","GO:0002682","regulation of immune system process","1/75","54/5146",0.549299528693292,0.744494805404348,0.699383886191435,"Zci_13189",1
"GO:0080135","GO:0080135","regulation of cellular response to stress","1/75","54/5146",0.549299528693292,0.744494805404348,0.699383886191435,"Zci_13189",1
"GO:1901617","GO:1901617","organic hydroxy compound biosynthetic process","1/75","54/5146",0.549299528693292,0.744494805404348,0.699383886191435,"Zci_06420",1
"GO:0006511","GO:0006511","ubiquitin-dependent protein catabolic process","2/75","126/5146",0.552702380504397,0.747404355454809,0.702117138870418,"Zci_01338/Zci_06178",2
"GO:0019438","GO:0019438","aromatic compound biosynthetic process","4/75","268/5146",0.554082144364696,0.747571147158716,0.702273824221634,"Zci_01832/Zci_02209/Zci_06294/Zci_14266",4
"GO:0009657","GO:0009657","plastid organization","2/75","127/5146",0.557030652652167,0.749848955493302,0.704413614094548,"Zci_05187/Zci_14637",2
"GO:0090627","GO:0090627","plant epidermal cell differentiation","1/75","56/5146",0.562479759540483,0.753773551636458,0.708100408525359,"Zci_06178",1
"GO:0090696","GO:0090696","post-embryonic plant organ development","1/75","56/5146",0.562479759540483,0.753773551636458,0.708100408525359,"Zci_08956",1
"GO:0018130","GO:0018130","heterocycle biosynthetic process","4/75","272/5146",0.566041407335396,0.755605536278608,0.709821388348414,"Zci_02209/Zci_06294/Zci_06420/Zci_14266",4
"GO:0044265","GO:0044265","cellular macromolecule catabolic process","3/75","201/5146",0.566601052338149,0.755605536278608,0.709821388348414,"Zci_01338/Zci_06178/Zci_06183",3
"GO:0048588","GO:0048588","developmental cell growth","1/75","57/5146",0.568926521433305,0.755605536278608,0.709821388348414,"Zci_06178",1
"GO:0051338","GO:0051338","regulation of transferase activity","1/75","57/5146",0.568926521433305,0.755605536278608,0.709821388348414,"Zci_03531",1
"GO:0071478","GO:0071478","cellular response to radiation","1/75","58/5146",0.575279539883394,0.762341483809843,0.716149186913802,"Zci_14637",1
"GO:0001932","GO:0001932","regulation of protein phosphorylation","1/75","59/5146",0.58154015987332,0.763259944989329,0.717011996089047,"Zci_03531",1
"GO:0016054","GO:0016054","organic acid catabolic process","1/75","59/5146",0.58154015987332,0.763259944989329,0.717011996089047,"Zci_00307",1
"GO:0043067","GO:0043067","regulation of programmed cell death","1/75","59/5146",0.58154015987332,0.763259944989329,0.717011996089047,"Zci_13189",1
"GO:0046395","GO:0046395","carboxylic acid catabolic process","1/75","59/5146",0.58154015987332,0.763259944989329,0.717011996089047,"Zci_00307",1
"GO:0032787","GO:0032787","monocarboxylic acid metabolic process","2/75","133/5146",0.582386579874211,0.763259944989329,0.717011996089047,"Zci_06420/Zci_13898",2
"GO:0032446","GO:0032446","protein modification by small protein conjugation","2/75","134/5146",0.586509711763829,0.76518003473247,0.71881574249083,"Zci_05187/Zci_06178",2
"GO:0045893","GO:0045893","positive regulation of transcription, DNA-templated","2/75","134/5146",0.586509711763829,0.76518003473247,0.71881574249083,"Zci_06113/Zci_08956",2
"GO:0009639","GO:0009639","response to red or far red light","1/75","60/5146",0.587709707349141,0.76518003473247,0.71881574249083,"Zci_05187",1
"GO:0032269","GO:0032269","negative regulation of cellular protein metabolic process","1/75","61/5146",0.593789489486147,0.769727116000561,0.723087304018219,"Zci_03531",1
"GO:0071695","GO:0071695","anatomical structure maturation","1/75","61/5146",0.593789489486147,0.769727116000561,0.723087304018219,"Zci_06178",1
"GO:0009553","GO:0009553","embryo sac development","1/75","62/5146",0.599780794950953,0.77244496319441,0.725640469626239,"Zci_02774",1
"GO:0042325","GO:0042325","regulation of phosphorylation","1/75","62/5146",0.599780794950953,0.77244496319441,0.725640469626239,"Zci_03531",1
"GO:0051640","GO:0051640","organelle localization","1/75","62/5146",0.599780794950953,0.77244496319441,0.725640469626239,"Zci_14637",1
"GO:0065008","GO:0065008","regulation of biological quality","5/75","358/5146",0.605669507876859,0.776686448330143,0.72962495190324,"Zci_01066/Zci_02787/Zci_03703/Zci_04845/Zci_06300",5
"GO:0046486","GO:0046486","glycerolipid metabolic process","1/75","63/5146",0.605684894159977,0.776686448330143,0.72962495190324,"Zci_13189",1
"GO:0043413","GO:0043413","macromolecule glycosylation","1/75","64/5146",0.611503039534363,0.781573148852659,0.73421555425168,"Zci_00169",1
"GO:0099402","GO:0099402","plant organ development","4/75","288/5146",0.612122835908133,0.781573148852659,0.73421555425168,"Zci_01656/Zci_06178/Zci_06300/Zci_08956",4
"GO:0048316","GO:0048316","seed development","3/75","216/5146",0.616159846042634,0.784576876678821,0.737037278224598,"Zci_01656/Zci_08956/Zci_13832",3
"GO:0048507","GO:0048507","meristem development","1/75","65/5146",0.617236465751388,0.784576876678821,0.737037278224598,"Zci_08956",1
"GO:0016567","GO:0016567","protein ubiquitination","2/75","142/5146",0.618431185146835,0.784576876678821,0.737037278224598,"Zci_05187/Zci_06178",2
"GO:0010243","GO:0010243","response to organonitrogen compound","1/75","66/5146",0.622886389992413,0.785567515234259,0.737967891356729,"Zci_12061",1
"GO:0010941","GO:0010941","regulation of cell death","1/75","66/5146",0.622886389992413,0.785567515234259,0.737967891356729,"Zci_13189",1
"GO:0010154","GO:0010154","fruit development","3/75","219/5146",0.625614725512236,0.785567515234259,0.737967891356729,"Zci_01656/Zci_08956/Zci_13832",3
"GO:1902680","GO:1902680","positive regulation of RNA biosynthetic process","2/75","144/5146",0.626116022842785,0.785567515234259,0.737967891356729,"Zci_06113/Zci_08956",2
"GO:1903508","GO:1903508","positive regulation of nucleic acid-templated transcription","2/75","144/5146",0.626116022842785,0.785567515234259,0.737967891356729,"Zci_06113/Zci_08956",2
"GO:0006644","GO:0006644","phospholipid metabolic process","1/75","67/5146",0.628454012187407,0.785567515234259,0.737967891356729,"Zci_13189",1
"GO:0009733","GO:0009733","response to auxin","1/75","67/5146",0.628454012187407,0.785567515234259,0.737967891356729,"Zci_06808",1
"GO:0033044","GO:0033044","regulation of chromosome organization","1/75","69/5146",0.639347065345868,0.797508393880067,0.749185240425149,"Zci_03703",1
"GO:0021700","GO:0021700","developmental maturation","1/75","70/5146",0.644674812066188,0.802471784894104,0.753847886384377,"Zci_06178",1
"GO:0009653","GO:0009653","anatomical structure morphogenesis","4/75","302/5146",0.649970736341963,0.807374923013503,0.758453930332012,"Zci_01458/Zci_03531/Zci_04898/Zci_06178",4
"GO:0000280","GO:0000280","nuclear division","1/75","72/5146",0.655098412532075,0.810360822155061,0.761258905907718,"Zci_06456",1
"GO:0009101","GO:0009101","glycoprotein biosynthetic process","1/75","72/5146",0.655098412532075,0.810360822155061,0.761258905907718,"Zci_00169",1
"GO:0009743","GO:0009743","response to carbohydrate","1/75","73/5146",0.660196484873441,0.814164456476133,0.764832067914775,"Zci_08956",1
"GO:0006979","GO:0006979","response to oxidative stress","2/75","154/5146",0.662778244749986,0.814164456476133,0.764832067914775,"Zci_01656/Zci_09882",2
"GO:0070647","GO:0070647","protein modification by small protein conjugation or removal","2/75","154/5146",0.662778244749986,0.814164456476133,0.764832067914775,"Zci_05187/Zci_06178",2
"GO:0048646","GO:0048646","anatomical structure formation involved in morphogenesis","1/75","74/5146",0.665220191483828,0.814164456476133,0.764832067914775,"Zci_03531",1
"GO:0051052","GO:0051052","regulation of DNA metabolic process","1/75","74/5146",0.665220191483828,0.814164456476133,0.764832067914775,"Zci_03703",1
"GO:0006355","GO:0006355","regulation of transcription, DNA-templated","6/75","457/5146",0.666383345048533,0.814164456476133,0.764832067914775,"Zci_06113/Zci_08956/Zci_10355/Zci_10572/Zci_14637/Zci_15458",6
"GO:0015931","GO:0015931","nucleobase-containing compound transport","1/75","75/5146",0.670170602690199,0.816369959970428,0.766903934089867,"Zci_13832",1
"GO:0051254","GO:0051254","positive regulation of RNA metabolic process","2/75","157/5146",0.673209834968221,0.816369959970428,0.766903934089867,"Zci_06113/Zci_08956",2
"GO:0010817","GO:0010817","regulation of hormone levels","1/75","76/5146",0.675048773622606,0.816369959970428,0.766903934089867,"Zci_06300",1
"GO:0019220","GO:0019220","regulation of phosphate metabolic process","1/75","76/5146",0.675048773622606,0.816369959970428,0.766903934089867,"Zci_03531",1
"GO:0051174","GO:0051174","regulation of phosphorus metabolic process","1/75","76/5146",0.675048773622606,0.816369959970428,0.766903934089867,"Zci_03531",1
"GO:0070085","GO:0070085","glycosylation","1/75","77/5146",0.679855744427005,0.820515553618799,0.770798335199615,"Zci_00169",1
"GO:0018205","GO:0018205","peptidyl-lysine modification","1/75","78/5146",0.684592540475136,0.824559841260538,0.774597568702956,"Zci_07616",1
"GO:0022414","GO:0022414","reproductive process","6/75","468/5146",0.689286984494842,0.827241283866946,0.777116535574256,"Zci_00169/Zci_01359/Zci_01656/Zci_05187/Zci_08956/Zci_13832",6
"GO:0009642","GO:0009642","response to light intensity","1/75","80/5146",0.693859637157474,0.827241283866946,0.777116535574256,"Zci_05187",1
"GO:0000003","GO:0000003","reproduction","6/75","471/5146",0.695358487288083,0.827241283866946,0.777116535574256,"Zci_00169/Zci_01359/Zci_01656/Zci_05187/Zci_08956/Zci_13832",6
"GO:0048519","GO:0048519","negative regulation of biological process","6/75","471/5146",0.695358487288083,0.827241283866946,0.777116535574256,"Zci_03531/Zci_04633/Zci_06178/Zci_06300/Zci_09440/Zci_14637",6
"GO:0010557","GO:0010557","positive regulation of macromolecule biosynthetic process","2/75","164/5146",0.696551064230823,0.827241283866946,0.777116535574256,"Zci_06113/Zci_08956",2
"GO:0022402","GO:0022402","cell cycle process","2/75","164/5146",0.696551064230823,0.827241283866946,0.777116535574256,"Zci_06456/Zci_13832",2
"GO:0048229","GO:0048229","gametophyte development","2/75","164/5146",0.696551064230823,0.827241283866946,0.777116535574256,"Zci_02774/Zci_06178",2
"GO:0009100","GO:0009100","glycoprotein metabolic process","1/75","81/5146",0.698391916512624,0.827775279531895,0.777618175022443,"Zci_00169",1
"GO:0044282","GO:0044282","small molecule catabolic process","1/75","82/5146",0.702857978953207,0.831412519835304,0.781035025267663,"Zci_00307",1
"GO:0048608","GO:0048608","reproductive structure development","4/75","327/5146",0.711422111829048,0.836030451313949,0.78537314400302,"Zci_01656/Zci_05187/Zci_08956/Zci_13832",4
"GO:0061458","GO:0061458","reproductive system development","4/75","327/5146",0.711422111829048,0.836030451313949,0.78537314400302,"Zci_01656/Zci_05187/Zci_08956/Zci_13832",4
"GO:0010608","GO:0010608","post-transcriptional regulation of gene expression","1/75","84/5146",0.711595257711125,0.836030451313949,0.78537314400302,"Zci_06300",1
"GO:0007049","GO:0007049","cell cycle","2/75","169/5146",0.712382250111214,0.836030451313949,0.78537314400302,"Zci_06456/Zci_13832",2
"GO:0022622","GO:0022622","root system development","2/75","171/5146",0.718522194196642,0.837410699705035,0.78666975947523,"Zci_06178/Zci_08956",2
"GO:0031328","GO:0031328","positive regulation of cellular biosynthetic process","2/75","171/5146",0.718522194196642,0.837410699705035,0.78666975947523,"Zci_06113/Zci_08956",2
"GO:0048364","GO:0048364","root development","2/75","171/5146",0.718522194196642,0.837410699705035,0.78666975947523,"Zci_06178/Zci_08956",2
"GO:0010605","GO:0010605","negative regulation of macromolecule metabolic process","3/75","252/5146",0.719188012687853,0.837410699705035,0.78666975947523,"Zci_03531/Zci_06178/Zci_06300",3
"GO:0045935","GO:0045935","positive regulation of nucleobase-containing compound metabolic process","2/75","175/5146",0.730477544362292,0.847397941559149,0.796051847798157,"Zci_06113/Zci_08956",2
"GO:0031668","GO:0031668","cellular response to extracellular stimulus","1/75","89/5146",0.732344837910287,0.847397941559149,0.796051847798157,"Zci_00614",1
"GO:1901605","GO:1901605","alpha-amino acid metabolic process","1/75","89/5146",0.732344837910287,0.847397941559149,0.796051847798157,"Zci_00307",1
"GO:0048523","GO:0048523","negative regulation of cellular process","4/75","338/5146",0.735910991492107,0.847397941559149,0.796051847798157,"Zci_03531/Zci_04633/Zci_06300/Zci_09440",4
"GO:0048367","GO:0048367","shoot system development","2/75","178/5146",0.739164262927567,0.847397941559149,0.796051847798157,"Zci_01656/Zci_06300",2
"GO:0061024","GO:0061024","membrane organization","1/75","91/5146",0.740225887488578,0.847397941559149,0.796051847798157,"Zci_06456",1
"GO:0071496","GO:0071496","cellular response to external stimulus","1/75","91/5146",0.740225887488578,0.847397941559149,0.796051847798157,"Zci_00614",1
"GO:1901615","GO:1901615","organic hydroxy compound metabolic process","1/75","91/5146",0.740225887488578,0.847397941559149,0.796051847798157,"Zci_06420",1
"GO:0010604","GO:0010604","positive regulation of macromolecule metabolic process","3/75","261/5146",0.741390737827799,0.847397941559149,0.796051847798157,"Zci_06113/Zci_06300/Zci_08956",3
"GO:0009891","GO:0009891","positive regulation of biosynthetic process","2/75","179/5146",0.742007273197171,0.847397941559149,0.796051847798157,"Zci_06113/Zci_08956",2
"GO:0009636","GO:0009636","response to toxic substance","1/75","92/5146",0.744080102807738,0.848137281936024,0.796746389576344,"Zci_12061",1
"GO:0006486","GO:0006486","protein glycosylation","1/75","93/5146",0.747877885215617,0.849046668978844,0.797600674440984,"Zci_00169",1
"GO:0010015","GO:0010015","root morphogenesis","1/75","93/5146",0.747877885215617,0.849046668978844,0.797600674440984,"Zci_06178",1
"GO:0016570","GO:0016570","histone modification","1/75","94/5146",0.751620049990766,0.849046668978844,0.797600674440984,"Zci_07616",1
"GO:0098662","GO:0098662","inorganic cation transmembrane transport","1/75","94/5146",0.751620049990766,0.849046668978844,0.797600674440984,"Zci_10716",1
"GO:1901566","GO:1901566","organonitrogen compound biosynthetic process","5/75","424/5146",0.752012763952691,0.849046668978844,0.797600674440984,"Zci_00169/Zci_01149/Zci_02209/Zci_06294/Zci_14266",5
"GO:0048285","GO:0048285","organelle fission","1/75","96/5146",0.758940729824551,0.853628987231773,0.801905337850635,"Zci_06456",1
"GO:0051253","GO:0051253","negative regulation of RNA metabolic process","1/75","96/5146",0.758940729824551,0.853628987231773,0.801905337850635,"Zci_06300",1
"GO:0051246","GO:0051246","regulation of protein metabolic process","2/75","186/5146",0.761187152834157,0.854425398695493,0.802653492626815,"Zci_03531/Zci_06178",2
"GO:0090558","GO:0090558","plant epidermis development","1/75","97/5146",0.762520817995474,0.854425398695493,0.802653492626815,"Zci_06178",1
"GO:0051049","GO:0051049","regulation of transport","1/75","98/5146",0.766048435078132,0.85515725867071,0.803341007260764,"Zci_14637",1
"GO:0060560","GO:0060560","developmental growth involved in morphogenesis","1/75","98/5146",0.766048435078132,0.85515725867071,0.803341007260764,"Zci_06178",1
"GO:0009892","GO:0009892","negative regulation of metabolic process","3/75","274/5146",0.771026560379593,0.858127290796968,0.806131077245803,"Zci_03531/Zci_06178/Zci_06300",3
"GO:0031324","GO:0031324","negative regulation of cellular metabolic process","2/75","190/5146",0.771593446346853,0.858127290796968,0.806131077245803,"Zci_03531/Zci_06300",2
"GO:0031399","GO:0031399","regulation of protein modification process","1/75","102/5146",0.779649206934218,0.865468802473619,0.813027747215377,"Zci_03531",1
"GO:0006508","GO:0006508","proteolysis","4/75","364/5146",0.78766306803242,0.872736546516368,0.81985511932807,"Zci_01338/Zci_06178/Zci_06183/Zci_08536",4
"GO:0019439","GO:0019439","aromatic compound catabolic process","1/75","106/5146",0.792469232497519,0.876429727390379,0.823324520556022,"Zci_00307",1
"GO:1901698","GO:1901698","response to nitrogen compound","1/75","107/5146",0.795557487966306,0.878212811391377,0.824999562757755,"Zci_12061",1
"GO:0016049","GO:0016049","cell growth","1/75","109/5146",0.801598598759132,0.881610288838602,0.828191178015564,"Zci_06178",1
"GO:0048584","GO:0048584","positive regulation of response to stimulus","1/75","109/5146",0.801598598759132,0.881610288838602,0.828191178015564,"Zci_01028",1
"GO:0009991","GO:0009991","response to extracellular stimulus","1/75","110/5146",0.804552758992022,0.883226737269839,0.829709681539646,"Zci_00614",1
"GO:0009893","GO:0009893","positive regulation of metabolic process","3/75","294/5146",0.81125434117997,0.887671565755765,0.83388518605274,"Zci_06113/Zci_06300/Zci_08956",3
"GO:0051128","GO:0051128","regulation of cellular component organization","2/75","207/5146",0.811585431548128,0.887671565755765,0.83388518605274,"Zci_02787/Zci_03703",2
"GO:0033036","GO:0033036","macromolecule localization","3/75","295/5146",0.813102712355123,0.887699291470271,0.833911231792506,"Zci_01066/Zci_04845/Zci_09882",3
"GO:1901361","GO:1901361","organic cyclic compound catabolic process","1/75","117/5146",0.824051049335503,0.898004348634843,0.84359187815144,"Zci_00307",1
"GO:0016192","GO:0016192","vesicle-mediated transport","2/75","216/5146",0.830168092960976,0.901503897220152,0.84687937978576,"Zci_02787/Zci_06456",2
"GO:0009555","GO:0009555","pollen development","1/75","120/5146",0.831807797603132,0.901503897220152,0.84687937978576,"Zci_06178",1
"GO:0045934","GO:0045934","negative regulation of nucleobase-containing compound metabolic process","1/75","120/5146",0.831807797603132,0.901503897220152,0.84687937978576,"Zci_06300",1
"GO:1905392","GO:1905392","plant organ morphogenesis","1/75","125/5146",0.843992682169531,0.913046628892493,0.857722706664155,"Zci_06178",1
"GO:0098655","GO:0098655","cation transmembrane transport","1/75","126/5146",0.846323004582853,0.913098038406866,0.8577710011394,"Zci_10716",1
"GO:0006259","GO:0006259","DNA metabolic process","2/75","225/5146",0.847109440673261,0.913098038406866,0.8577710011394,"Zci_03703/Zci_05187",2
"GO:0006397","GO:0006397","mRNA processing","1/75","128/5146",0.850881094942086,0.915504975570599,0.860032095582465,"Zci_06300",1
"GO:0009791","GO:0009791","post-embryonic development","4/75","409/5146",0.85817355642026,0.920023902828928,0.864277209026379,"Zci_01656/Zci_05187/Zci_08956/Zci_13832",4
"GO:0033554","GO:0033554","cellular response to stress","4/75","409/5146",0.85817355642026,0.920023902828928,0.864277209026379,"Zci_00614/Zci_01149/Zci_05187/Zci_09882",4
"GO:0090305","GO:0090305","nucleic acid phosphodiester bond hydrolysis","1/75","134/5146",0.863770013123151,0.923705060511407,0.867735315579934,"Zci_06300",1
"GO:0051173","GO:0051173","positive regulation of nitrogen compound metabolic process","2/75","236/5146",0.865754516484393,0.923705060511407,0.867735315579934,"Zci_06113/Zci_08956",2
"GO:0065003","GO:0065003","protein-containing complex assembly","2/75","237/5146",0.867343598612944,0.923705060511407,0.867735315579934,"Zci_01458/Zci_04898",2
"GO:0050790","GO:0050790","regulation of catalytic activity","1/75","136/5146",0.867817023236768,0.923705060511407,0.867735315579934,"Zci_03531",1
"GO:0006520","GO:0006520","cellular amino acid metabolic process","1/75","139/5146",0.873666110309187,0.928270242203511,0.872023880778531,"Zci_00307",1
"GO:0048468","GO:0048468","cell development","1/75","142/5146",0.879259675402689,0.929443694835174,0.873126230796068,"Zci_06178",1
"GO:0022607","GO:0022607","cellular component assembly","3/75","338/5146",0.879414057307148,0.929443694835174,0.873126230796068,"Zci_01458/Zci_04898/Zci_06456",3
"GO:0051276","GO:0051276","chromosome organization","2/75","245/5146",0.87945680704572,0.929443694835174,0.873126230796068,"Zci_03703/Zci_07616",2
"GO:0006812","GO:0006812","cation transport","1/75","150/5146",0.893008946905534,0.942092772001406,0.885008866754085,"Zci_10716",1
"GO:0042254","GO:0042254","ribosome biogenesis","1/75","152/5146",0.896197453514079,0.943754479910264,0.886569887363734,"Zci_01042",1
"GO:0006325","GO:0006325","chromatin organization","1/75","153/5146",0.897756362402033,0.943754479910264,0.886569887363734,"Zci_07616",1
"GO:0031325","GO:0031325","positive regulation of cellular metabolic process","2/75","262/5146",0.90192401335665,0.946463470806361,0.889114733300624,"Zci_06113/Zci_08956",2
"GO:0043933","GO:0043933","protein-containing complex organization","2/75","264/5146",0.904298217874681,0.947284224710274,0.889885755543839,"Zci_01458/Zci_04898",2
"GO:0016071","GO:0016071","mRNA metabolic process","1/75","160/5146",0.908040390031782,0.949532569541143,0.891997867185045,"Zci_06300",1
"GO:0019219","GO:0019219","regulation of nucleobase-containing compound metabolic process","4/75","457/5146",0.910746797707162,0.950691832694318,0.893086887502314,"Zci_03703/Zci_06113/Zci_06300/Zci_08956",4
"GO:0009793","GO:0009793","embryo development ending in seed dormancy","1/75","167/5146",0.917302423734542,0.954678773675029,0.896832249131252,"Zci_01656",1
"GO:0071705","GO:0071705","nitrogen compound transport","2/75","279/5146",0.920487188764183,0.954678773675029,0.896832249131252,"Zci_01387/Zci_13832",2
"GO:0006281","GO:0006281","DNA repair","1/75","170/5146",0.920984228721792,0.954678773675029,0.896832249131252,"Zci_05187",1
"GO:0032268","GO:0032268","regulation of cellular protein metabolic process","1/75","170/5146",0.920984228721792,0.954678773675029,0.896832249131252,"Zci_03531",1
"GO:0048518","GO:0048518","positive regulation of biological process","4/75","478/5146",0.92781412800167,0.96008592375825,0.901911765618099,"Zci_01028/Zci_06113/Zci_06300/Zci_08956",4
"GO:0042592","GO:0042592","homeostatic process","1/75","178/5146",0.93003014156805,0.960708219154496,0.902496354482154,"Zci_03703",1
"GO:0044271","GO:0044271","cellular nitrogen compound biosynthetic process","3/75","392/5146",0.932986308499655,0.962091600619228,0.903795913186749,"Zci_02209/Zci_06294/Zci_14266",3
"GO:0006974","GO:0006974","cellular response to DNA damage stimulus","1/75","184/5146",0.936136509345366,0.963669936090818,0.905278613116717,"Zci_05187",1
"GO:0051252","GO:0051252","regulation of RNA metabolic process","3/75","404/5146",0.941481114490857,0.96749786376867,0.908874596481492,"Zci_06113/Zci_06300/Zci_08956",3
"GO:0009059","GO:0009059","macromolecule biosynthetic process","3/75","426/5146",0.954554801079503,0.979241563176387,0.919906713925982,"Zci_00169/Zci_02209/Zci_09930",3
"GO:0051641","GO:0051641","cellular localization","2/75","339/5146",0.96302495454111,0.986230375132463,0.926472055188567,"Zci_09882/Zci_14637",2
"GO:0070727","GO:0070727","cellular macromolecule localization","1/75","239/5146",0.972492572118622,0.991078147660131,0.931026088292844,"Zci_09882",1
"GO:1903506","GO:1903506","regulation of nucleic acid-templated transcription","2/75","364/5146",0.973398933228896,0.991078147660131,0.931026088292844,"Zci_06113/Zci_08956",2
"GO:2001141","GO:2001141","regulation of RNA biosynthetic process","2/75","364/5146",0.973398933228896,0.991078147660131,0.931026088292844,"Zci_06113/Zci_08956",2
"GO:0030154","GO:0030154","cell differentiation","1/75","244/5146",0.974532250156802,0.991078147660131,0.931026088292844,"Zci_06178",1
"GO:0048522","GO:0048522","positive regulation of cellular process","2/75","372/5146",0.976087049628297,0.991078147660131,0.931026088292844,"Zci_06113/Zci_08956",2
"GO:0050793","GO:0050793","regulation of developmental process","1/75","271/5146",0.983223034080972,0.994117393967286,0.933881178587579,"Zci_02787",1
"GO:0051649","GO:0051649","establishment of localization in cell","1/75","275/5146",0.984232184274321,0.994117393967286,0.933881178587579,"Zci_14637",1
"GO:0034645","GO:0034645","cellular macromolecule biosynthetic process","2/75","403/5146",0.984253785426195,0.994117393967286,0.933881178587579,"Zci_00169/Zci_09930",2
"GO:2000112","GO:2000112","regulation of cellular macromolecule biosynthetic process","2/75","423/5146",0.988022809504534,0.994117393967286,0.933881178587579,"Zci_06113/Zci_08956",2
"GO:0048869","GO:0048869","cellular developmental process","1/75","295/5146",0.98844614784153,0.994117393967286,0.933881178587579,"Zci_06178",1
"GO:0010556","GO:0010556","regulation of macromolecule biosynthetic process","2/75","433/5146",0.989565978905399,0.994117393967286,0.933881178587579,"Zci_06113/Zci_08956",2
"GO:0031326","GO:0031326","regulation of cellular biosynthetic process","2/75","461/5146",0.992936154696918,0.994117393967286,0.933881178587579,"Zci_06113/Zci_08956",2
"GO:0006396","GO:0006396","RNA processing","1/75","327/5146",0.992993779178585,0.994117393967286,0.933881178587579,"Zci_06300",1
"GO:0009889","GO:0009889","regulation of biosynthetic process","2/75","474/5146",0.994117393967286,0.994117393967286,0.933881178587579,"Zci_06113/Zci_08956",2
