{
	"n_targets": 20030,
	"n_bootstraps": 100,
	"n_processed": 19549663,
	"n_pseudoaligned": 13718446,
	"n_unique": 11892597,
	"p_pseudoaligned": 70.2,
	"p_unique": 60.8,
	"kallisto_version": "0.48.0",
	"index_version": 10,
	"start_time": "Fri Mar  3 13:38:39 2023",
	"call": "kallisto quant --bootstrap-samples 100 --rf-stranded -t 20 -i /scratch/users/dadras/Stress_profiling_of_zygnema_circumcarinatum_1b/kallisto_index/SAG698_1b_CDS.fna.idx -o /scratch/users/dadras/Stress_profiling_of_zygnema_circumcarinatum_1b/kallisto/Z_1_40_EKRN220057119-1A_HYMV5DSX3_L3 /scratch/users/dadras/Stress_profiling_of_zygnema_circumcarinatum_1b/trimmed_reads_PE/Z_1_40_EKRN220057119-1A_HYMV5DSX3_L3_1.fq.gz /scratch/users/dadras/Stress_profiling_of_zygnema_circumcarinatum_1b/trimmed_reads_PE/Z_1_40_EKRN220057119-1A_HYMV5DSX3_L3_2.fq.gz"
}
