{
	"n_targets": 20030,
	"n_bootstraps": 100,
	"n_processed": 17370349,
	"n_pseudoaligned": 12798204,
	"n_unique": 11154099,
	"p_pseudoaligned": 73.7,
	"p_unique": 64.2,
	"kallisto_version": "0.48.0",
	"index_version": 10,
	"start_time": "Fri Mar  3 13:22:16 2023",
	"call": "kallisto quant --bootstrap-samples 100 --rf-stranded -t 20 -i /scratch/users/dadras/Stress_profiling_of_zygnema_circumcarinatum_1b/kallisto_index/SAG698_1b_CDS.fna.idx -o /scratch/users/dadras/Stress_profiling_of_zygnema_circumcarinatum_1b/kallisto/Z_1_67_EKRN220057146-1A_H23VJDSX5_L3 /scratch/users/dadras/Stress_profiling_of_zygnema_circumcarinatum_1b/trimmed_reads_PE/Z_1_67_EKRN220057146-1A_H23VJDSX5_L3_1.fq.gz /scratch/users/dadras/Stress_profiling_of_zygnema_circumcarinatum_1b/trimmed_reads_PE/Z_1_67_EKRN220057146-1A_H23VJDSX5_L3_2.fq.gz"
}
