{
	"n_targets": 87533,
	"n_bootstraps": 100,
	"n_processed": 32035829,
	"n_pseudoaligned": 29477375,
	"n_unique": 1873635,
	"p_pseudoaligned": 92.0,
	"p_unique": 5.8,
	"kallisto_version": "0.48.0",
	"index_version": 10,
	"start_time": "Fri Mar  3 18:32:10 2023",
	"call": "kallisto quant --bootstrap-samples 100 --rf-stranded -t 20 -i /scratch/users/dadras/Stress_profiling_of_physcomitrium_patens/kallisto_index/Ppatens_318_v3.3.transcript.fa.idx -o /scratch/users/dadras/Stress_profiling_of_physcomitrium_patens/kallisto/P_1_33_EKRN220057202-1A_HKHYCDSX5_L2 /scratch/users/dadras/Stress_profiling_of_physcomitrium_patens/trimmed_reads_PE/P_1_33_EKRN220057202-1A_HKHYCDSX5_L2_1.fq.gz /scratch/users/dadras/Stress_profiling_of_physcomitrium_patens/trimmed_reads_PE/P_1_33_EKRN220057202-1A_HKHYCDSX5_L2_2.fq.gz"
}
