"","ID","Description","GeneRatio","BgRatio","pvalue","p.adjust","qvalue","geneID","Count"
"GO:0009642","GO:0009642","response to light intensity","8/52","179/9629",4.56582549843789e-06,0.00186964954569437,0.0017025213072739,"Pp3c1_3260V3/Pp3c11_14810V3/Pp3c19_22640V3/Pp3c4_3890V3/Pp3c5_26150V3/Pp3c5_7110V3/Pp3c6_5030V3/Pp3c8_9230V3",8
"GO:0009641","GO:0009641","shade avoidance","4/52","24/9629",7.41924422894589e-06,0.00186964954569437,0.0017025213072739,"Pp3c1_3260V3/Pp3c5_26150V3/Pp3c6_5030V3/Pp3c8_1870V3",4
"GO:0009408","GO:0009408","response to heat","7/52","182/9629",5.00935157109337e-05,0.00841571063943687,0.0076634290701639,"Pp3c11_14810V3/Pp3c19_22640V3/Pp3c20_5060V3/Pp3c3_3840V3/Pp3c7_15240V3/Pp3c7_5280V3/Pp3c8_9230V3",7
"GO:0009649","GO:0009649","entrainment of circadian clock","3/52","17/9629",9.57664707293643e-05,0.00961649620936277,0.00875687624745649,"Pp3c1_3260V3/Pp3c5_26150V3/Pp3c6_5030V3",3
"GO:0009639","GO:0009639","response to red or far red light","7/52","206/9629",0.000109500786119644,0.00961649620936277,0.00875687624745649,"Pp3c1_3260V3/Pp3c22_18520V3/Pp3c3_3840V3/Pp3c5_26150V3/Pp3c5_7110V3/Pp3c6_5030V3/Pp3c8_1870V3",7
"GO:0071483","GO:0071483","cellular response to blue light","3/52","18/9629",0.000114482097730509,0.00961649620936277,0.00875687624745649,"Pp3c22_18520V3/Pp3c7_12190V3/Pp3c7_5280V3",3
"GO:0009647","GO:0009647","skotomorphogenesis","3/52","19/9629",0.000135429832467588,0.00975094793766634,0.00887930931667194,"Pp3c1_3260V3/Pp3c5_26150V3/Pp3c6_5030V3",3
"GO:0009266","GO:0009266","response to temperature stimulus","10/52","492/9629",0.000251644803118052,0.0155420840556869,0.0141527749546355,"Pp3c11_14810V3/Pp3c19_22640V3/Pp3c20_5060V3/Pp3c21_5760V3/Pp3c3_3840V3/Pp3c5_7110V3/Pp3c7_15240V3/Pp3c7_5280V3/Pp3c8_6510V3/Pp3c8_9230V3",10
"GO:0046283","GO:0046283","anthocyanin-containing compound metabolic process","3/52","24/9629",0.000277537215280123,0.0155420840556869,0.0141527749546355,"Pp3c1_3260V3/Pp3c5_26150V3/Pp3c6_5030V3",3
"GO:0010119","GO:0010119","regulation of stomatal movement","5/52","117/9629",0.000400566301166396,0.0201885415787864,0.0183838849798472,"Pp3c1_3260V3/Pp3c5_26150V3/Pp3c5_7110V3/Pp3c6_5030V3/Pp3c7_12190V3",5
"GO:0042542","GO:0042542","response to hydrogen peroxide","4/52","70/9629",0.00053301176670569,0.0244216300381516,0.0222385770606393,"Pp3c11_14810V3/Pp3c19_22640V3/Pp3c20_5060V3/Pp3c8_9230V3",4
"GO:0009765","GO:0009765","photosynthesis, light harvesting","4/52","77/9629",0.000765109858587405,0.032134614060671,0.0292620963459744,"Pp3c10_25360V3/Pp3c10_25410V3/Pp3c20_23270V3/Pp3c5_7110V3",4
"GO:0009812","GO:0009812","flavonoid metabolic process","3/52","37/9629",0.00101400267303038,0.0393121036313317,0.0357979891045544,"Pp3c1_3260V3/Pp3c5_26150V3/Pp3c6_5030V3",3
"GO:0009646","GO:0009646","response to absence of light","3/52","41/9629",0.00137016369812505,0.0493258931325018,0.0449166445400392,"Pp3c1_3260V3/Pp3c5_26150V3/Pp3c6_5030V3",3
"GO:0010286","GO:0010286","heat acclimation","3/52","45/9629",0.00179638624120531,0.0551339995863164,0.0502055635330701,"Pp3c19_22640V3/Pp3c7_5280V3/Pp3c8_9230V3",3
"GO:0045471","GO:0045471","response to ethanol","2/52","12/9629",0.00182373195513956,0.0551339995863164,0.0502055635330701,"Pp3c19_22640V3/Pp3c8_9230V3",2
"GO:0048578","GO:0048578","positive regulation of long-day photoperiodism, flowering","2/52","13/9629",0.00214788358222392,0.0551339995863164,0.0502055635330701,"Pp3c7_10610V3/Pp3c7_10630V3",2
"GO:0048587","GO:0048587","regulation of short-day photoperiodism, flowering","2/52","13/9629",0.00214788358222392,0.0551339995863164,0.0502055635330701,"Pp3c7_10610V3/Pp3c7_10630V3",2
"GO:0090354","GO:0090354","regulation of auxin metabolic process","2/52","13/9629",0.00214788358222392,0.0551339995863164,0.0502055635330701,"Pp3c20_20860V3/Pp3c3_37540V3",2
"GO:0046677","GO:0046677","response to antibiotic","5/52","171/9629",0.00220581754982499,0.0551339995863164,0.0502055635330701,"Pp3c11_14810V3/Pp3c19_22640V3/Pp3c20_5060V3/Pp3c3_37540V3/Pp3c8_9230V3",5
"GO:0042752","GO:0042752","regulation of circadian rhythm","3/52","49/9629",0.00229724998276318,0.0551339995863164,0.0502055635330701,"Pp3c1_3260V3/Pp3c5_26150V3/Pp3c6_5030V3",3
"GO:0009636","GO:0009636","response to toxic substance","5/52","184/9629",0.0030313679735089,0.0664989067533811,0.0605545600344072,"Pp3c11_14810V3/Pp3c19_22640V3/Pp3c20_5060V3/Pp3c4_3890V3/Pp3c8_9230V3",5
"GO:0048582","GO:0048582","positive regulation of post-embryonic development","3/52","54/9629",0.00303467233199954,0.0664989067533811,0.0605545600344072,"Pp3c7_10610V3/Pp3c7_10630V3/Pp3c8_25010V3",3
"GO:0009644","GO:0009644","response to high light intensity","4/52","115/9629",0.00336199356022508,0.0706018647647267,0.0642907540464094,"Pp3c11_14810V3/Pp3c19_22640V3/Pp3c5_7110V3/Pp3c8_9230V3",4
"GO:0009640","GO:0009640","photomorphogenesis","3/52","63/9629",0.00469568583120808,0.0929078399559223,0.0846027949473311,"Pp3c1_3260V3/Pp3c5_26150V3/Pp3c6_5030V3",3
"GO:0009637","GO:0009637","response to blue light","4/52","127/9629",0.00479286475963091,0.0929078399559223,0.0846027949473311,"Pp3c22_18520V3/Pp3c5_7110V3/Pp3c7_12190V3/Pp3c7_5280V3",4
"GO:0046685","GO:0046685","response to arsenic-containing substance","2/52","21/9629",0.00562532484277313,0.105006063731765,0.0956195567816408,"Pp3c19_22640V3/Pp3c8_9230V3",2
"GO:0048573","GO:0048573","photoperiodism, flowering","3/52","69/9629",0.0060564220719896,0.106050317011159,0.0965704641120834,"Pp3c1_3260V3/Pp3c5_26150V3/Pp3c6_5030V3",3
"GO:0000302","GO:0000302","response to reactive oxygen species","4/52","136/9629",0.00610210157405481,0.106050317011159,0.0965704641120834,"Pp3c11_14810V3/Pp3c19_22640V3/Pp3c20_5060V3/Pp3c8_9230V3",4
"GO:0009414","GO:0009414","response to water deprivation","5/52","219/9629",0.00634049841654285,0.10652037339792,0.0969985020916731,"Pp3c16_17210V3/Pp3c16_2800V3/Pp3c3_3840V3/Pp3c5_7110V3/Pp3c8_6510V3",5
"GO:0009415","GO:0009415","response to water","5/52","223/9629",0.00683549475381094,0.110482799314138,0.10060672619249,"Pp3c16_17210V3/Pp3c16_2800V3/Pp3c3_3840V3/Pp3c5_7110V3/Pp3c8_6510V3",5
"GO:0006979","GO:0006979","response to oxidative stress","6/52","318/9629",0.00701478090883418,0.110482799314138,0.10060672619249,"Pp3c11_14810V3/Pp3c16_2800V3/Pp3c19_22640V3/Pp3c20_5060V3/Pp3c4_3890V3/Pp3c8_9230V3",6
"GO:0007623","GO:0007623","circadian rhythm","3/52","82/9629",0.00974680932302268,0.146524840373412,0.133426964082722,"Pp3c3_2690V3/Pp3c3_37540V3/Pp3c7_12190V3",3
"GO:0032350","GO:0032350","regulation of hormone metabolic process","2/52","28/9629",0.00988461224741269,0.146524840373412,0.133426964082722,"Pp3c20_20860V3/Pp3c3_37540V3",2
"GO:0009648","GO:0009648","photoperiodism","3/52","85/9629",0.0107483084578824,0.154775641793506,0.140940225192082,"Pp3c1_3260V3/Pp3c5_26150V3/Pp3c6_5030V3",3
"GO:0071482","GO:0071482","cellular response to light stimulus","3/52","88/9629",0.0118074840197459,0.165304776276443,0.150528158848223,"Pp3c22_18520V3/Pp3c7_12190V3/Pp3c7_5280V3",3
"GO:0048580","GO:0048580","regulation of post-embryonic development","5/52","263/9629",0.0133642297525276,0.177247266276321,0.161403107970919,"Pp3c3_37540V3/Pp3c7_10610V3/Pp3c7_10630V3/Pp3c7_5280V3/Pp3c8_25010V3",5
"GO:0010218","GO:0010218","response to far red light","3/52","93/9629",0.0137024349265535,0.177247266276321,0.161403107970919,"Pp3c1_3260V3/Pp3c22_18520V3/Pp3c5_7110V3",3
"GO:0006970","GO:0006970","response to osmotic stress","7/52","478/9629",0.013715562271382,0.177247266276321,0.161403107970919,"Pp3c16_17210V3/Pp3c16_2800V3/Pp3c20_5060V3/Pp3c22_18520V3/Pp3c3_37540V3/Pp3c3_3840V3/Pp3c8_6510V3",7
"GO:0071478","GO:0071478","cellular response to radiation","3/52","96/9629",0.0149179597146024,0.186723163875477,0.170031953737903,"Pp3c22_18520V3/Pp3c7_12190V3/Pp3c7_5280V3",3
"GO:0046688","GO:0046688","response to copper ion","2/52","35/9629",0.0151897811882829,0.186723163875477,0.170031953737903,"Pp3c19_22640V3/Pp3c8_9230V3",2
"GO:0042440","GO:0042440","pigment metabolic process","3/52","98/9629",0.015761282886724,0.189135394640689,0.172228554852423,"Pp3c1_3260V3/Pp3c5_26150V3/Pp3c6_5030V3",3
"GO:0009734","GO:0009734","auxin-activated signaling pathway","2/52","37/9629",0.0168862365371561,0.195597432830589,0.178112950530779,"Pp3c20_20860V3/Pp3c3_37540V3",2
"GO:0010114","GO:0010114","response to red light","3/52","101/9629",0.0170759663582261,0.195597432830589,0.178112950530779,"Pp3c1_3260V3/Pp3c22_18520V3/Pp3c5_7110V3",3
"GO:0010565","GO:0010565","regulation of cellular ketone metabolic process","2/52","39/9629",0.01865963644758,0.208987928212896,0.19030646762912,"Pp3c20_20860V3/Pp3c4_1450V3",2
"GO:0046165","GO:0046165","alcohol biosynthetic process","2/52","42/9629",0.0214601046679138,0.232250097852769,0.211489228621152,"Pp3c16_17210V3/Pp3c21_5760V3",2
"GO:2000026","GO:2000026","regulation of multicellular organismal development","6/52","407/9629",0.0216582432521432,0.232250097852769,0.211489228621152,"Pp3c3_37540V3/Pp3c7_10610V3/Pp3c7_10630V3/Pp3c7_5280V3/Pp3c8_25010V3/Pp3c9_903V3",6
"GO:2000243","GO:2000243","positive regulation of reproductive process","2/52","44/9629",0.0234181068727787,0.23692614008886,0.215747278777658,"Pp3c7_10610V3/Pp3c7_10630V3",2
"GO:0051240","GO:0051240","positive regulation of multicellular organismal process","3/52","114/9629",0.02346707478258,0.23692614008886,0.215747278777658,"Pp3c7_10610V3/Pp3c7_10630V3/Pp3c8_25010V3",3
"GO:0046686","GO:0046686","response to cadmium ion","5/52","304/9629",0.0235045773897678,0.23692614008886,0.215747278777658,"Pp3c19_22640V3/Pp3c20_5060V3/Pp3c7_15240V3/Pp3c8_6510V3/Pp3c8_9230V3",5
"GO:0009651","GO:0009651","response to salt stress","6/52","422/9629",0.0253479440641816,0.250497329575441,0.228105337708631,"Pp3c16_17210V3/Pp3c20_5060V3/Pp3c22_18520V3/Pp3c3_37540V3/Pp3c3_3840V3/Pp3c8_6510V3",6
"GO:0048586","GO:0048586","regulation of long-day photoperiodism, flowering","2/52","47/9629",0.0264873511245518,0.25484192094158,0.232061565435524,"Pp3c7_10610V3/Pp3c7_10630V3",2
"GO:0010228","GO:0010228","vegetative to reproductive phase transition of meristem","3/52","120/9629",0.0267988527974281,0.25484192094158,0.232061565435524,"Pp3c1_3260V3/Pp3c5_26150V3/Pp3c6_5030V3",3
"GO:0009768","GO:0009768","photosynthesis, light harvesting in photosystem I","2/52","48/9629",0.027544853344541,0.257085297882383,0.23410440659298,"Pp3c20_23270V3/Pp3c5_7110V3",2
"GO:0051094","GO:0051094","positive regulation of developmental process","3/52","125/9629",0.0297595257652076,0.27270547246663,0.248328291552737,"Pp3c7_10610V3/Pp3c7_10630V3/Pp3c8_25010V3",3
"GO:0006109","GO:0006109","regulation of carbohydrate metabolic process","2/52","52/9629",0.0319414551576634,0.277560231025213,0.252749082554288,"Pp3c4_1450V3/Pp3c4_3890V3",2
"GO:0046364","GO:0046364","monosaccharide biosynthetic process","2/52","52/9629",0.0319414551576634,0.277560231025213,0.252749082554288,"Pp3c20_5060V3/Pp3c21_5760V3",2
"GO:0071365","GO:0071365","cellular response to auxin stimulus","2/52","52/9629",0.0319414551576634,0.277560231025213,0.252749082554288,"Pp3c20_20860V3/Pp3c3_37540V3",2
"GO:0019684","GO:0019684","photosynthesis, light reaction","3/52","134/9629",0.0355084346869963,0.303326289529596,0.276211909429623,"Pp3c20_23270V3/Pp3c22_18520V3/Pp3c5_7110V3",3
"GO:0009409","GO:0009409","response to cold","5/52","347/9629",0.0384888109487595,0.316943817028675,0.288612164211576,"Pp3c21_5760V3/Pp3c3_3840V3/Pp3c5_7110V3/Pp3c7_15240V3/Pp3c8_6510V3",5
"GO:0051239","GO:0051239","regulation of multicellular organismal process","6/52","466/9629",0.0385514684870162,0.316943817028675,0.288612164211576,"Pp3c3_37540V3/Pp3c7_10610V3/Pp3c7_10630V3/Pp3c7_5280V3/Pp3c8_25010V3/Pp3c9_903V3",6
"GO:0006281","GO:0006281","DNA repair","4/52","246/9629",0.0432889462871339,0.316943817028675,0.288612164211576,"Pp3c1_3260V3/Pp3c19_5540V3/Pp3c5_26150V3/Pp3c6_5030V3",4
"GO:0046434","GO:0046434","organophosphate catabolic process","2/52","62/9629",0.0440293500026455,0.316943817028675,0.288612164211576,"Pp3c20_5060V3/Pp3c21_5760V3",2
"GO:0051260","GO:0051260","protein homooligomerization","2/52","64/9629",0.0466225577183455,0.316943817028675,0.288612164211576,"Pp3c19_22640V3/Pp3c8_9230V3",2
"GO:0062012","GO:0062012","regulation of small molecule metabolic process","2/52","64/9629",0.0466225577183455,0.316943817028675,0.288612164211576,"Pp3c20_20860V3/Pp3c4_1450V3",2
"GO:0071214","GO:0071214","cellular response to abiotic stimulus","3/52","152/9629",0.0485986120788714,0.316943817028675,0.288612164211576,"Pp3c22_18520V3/Pp3c7_12190V3/Pp3c7_5280V3",3
"GO:0104004","GO:0104004","cellular response to environmental stimulus","3/52","152/9629",0.0485986120788714,0.316943817028675,0.288612164211576,"Pp3c22_18520V3/Pp3c7_12190V3/Pp3c7_5280V3",3
"GO:0006091","GO:0006091","generation of precursor metabolites and energy","4/52","256/9629",0.0488779315747349,0.316943817028675,0.288612164211576,"Pp3c20_23270V3/Pp3c20_5060V3/Pp3c22_18520V3/Pp3c5_7110V3",4
"GO:0010030","GO:0010030","positive regulation of seed germination","1/52","10/9629",0.0527339343145283,0.316943817028675,0.288612164211576,"Pp3c8_25010V3",1
"GO:0010600","GO:0010600","regulation of auxin biosynthetic process","1/52","10/9629",0.0527339343145283,0.316943817028675,0.288612164211576,"Pp3c3_37540V3",1
"GO:0010977","GO:0010977","negative regulation of neuron projection development","1/52","10/9629",0.0527339343145283,0.316943817028675,0.288612164211576,"Pp3c9_903V3",1
"GO:0019375","GO:0019375","galactolipid biosynthetic process","1/52","10/9629",0.0527339343145283,0.316943817028675,0.288612164211576,"Pp3c7_3610V3",1
"GO:0031345","GO:0031345","negative regulation of cell projection organization","1/52","10/9629",0.0527339343145283,0.316943817028675,0.288612164211576,"Pp3c9_903V3",1
"GO:0031407","GO:0031407","oxylipin metabolic process","1/52","10/9629",0.0527339343145283,0.316943817028675,0.288612164211576,"Pp3c7_3610V3",1
"GO:0043271","GO:0043271","negative regulation of ion transport","1/52","10/9629",0.0527339343145283,0.316943817028675,0.288612164211576,"Pp3c7_12190V3",1
"GO:0045489","GO:0045489","pectin biosynthetic process","1/52","10/9629",0.0527339343145283,0.316943817028675,0.288612164211576,"Pp3c1_12470V3",1
"GO:0045665","GO:0045665","negative regulation of neuron differentiation","1/52","10/9629",0.0527339343145283,0.316943817028675,0.288612164211576,"Pp3c9_903V3",1
"GO:0046855","GO:0046855","inositol phosphate dephosphorylation","1/52","10/9629",0.0527339343145283,0.316943817028675,0.288612164211576,"Pp3c21_5760V3",1
"GO:0050768","GO:0050768","negative regulation of neurogenesis","1/52","10/9629",0.0527339343145283,0.316943817028675,0.288612164211576,"Pp3c9_903V3",1
"GO:0051775","GO:0051775","response to redox state","1/52","10/9629",0.0527339343145283,0.316943817028675,0.288612164211576,"Pp3c20_5060V3",1
"GO:0071545","GO:0071545","inositol phosphate catabolic process","1/52","10/9629",0.0527339343145283,0.316943817028675,0.288612164211576,"Pp3c21_5760V3",1
"GO:0006974","GO:0006974","cellular response to DNA damage stimulus","4/52","269/9629",0.0567182155895548,0.316943817028675,0.288612164211576,"Pp3c1_3260V3/Pp3c19_5540V3/Pp3c5_26150V3/Pp3c6_5030V3",4
"GO:0006521","GO:0006521","regulation of cellular amino acid metabolic process","1/52","11/9629",0.0578548237433296,0.316943817028675,0.288612164211576,"Pp3c20_20860V3",1
"GO:0009687","GO:0009687","abscisic acid metabolic process","1/52","11/9629",0.0578548237433296,0.316943817028675,0.288612164211576,"Pp3c16_17210V3",1
"GO:0010721","GO:0010721","negative regulation of cell development","1/52","11/9629",0.0578548237433296,0.316943817028675,0.288612164211576,"Pp3c9_903V3",1
"GO:0033238","GO:0033238","regulation of cellular amine metabolic process","1/52","11/9629",0.0578548237433296,0.316943817028675,0.288612164211576,"Pp3c20_20860V3",1
"GO:0034059","GO:0034059","response to anoxia","1/52","11/9629",0.0578548237433296,0.316943817028675,0.288612164211576,"Pp3c20_5060V3",1
"GO:0043288","GO:0043288","apocarotenoid metabolic process","1/52","11/9629",0.0578548237433296,0.316943817028675,0.288612164211576,"Pp3c16_17210V3",1
"GO:0043393","GO:0043393","regulation of protein binding","1/52","11/9629",0.0578548237433296,0.316943817028675,0.288612164211576,"Pp3c1_3260V3",1
"GO:0046838","GO:0046838","phosphorylated carbohydrate dephosphorylation","1/52","11/9629",0.0578548237433296,0.316943817028675,0.288612164211576,"Pp3c21_5760V3",1
"GO:1902644","GO:1902644","tertiary alcohol metabolic process","1/52","11/9629",0.0578548237433296,0.316943817028675,0.288612164211576,"Pp3c16_17210V3",1
"GO:1903034","GO:1903034","regulation of response to wounding","1/52","11/9629",0.0578548237433296,0.316943817028675,0.288612164211576,"Pp3c9_903V3",1
"GO:0072330","GO:0072330","monocarboxylic acid biosynthetic process","3/52","166/9629",0.0602011769093023,0.326251539379445,0.297087867939511,"Pp3c16_17210V3/Pp3c20_5060V3/Pp3c7_3610V3",3
"GO:0006714","GO:0006714","sesquiterpenoid metabolic process","1/52","12/9629",0.062948559360438,0.328841755264519,0.299446544058752,"Pp3c16_17210V3",1
"GO:0019374","GO:0019374","galactolipid metabolic process","1/52","12/9629",0.062948559360438,0.328841755264519,0.299446544058752,"Pp3c7_3610V3",1
"GO:0070555","GO:0070555","response to interleukin-1","1/52","12/9629",0.062948559360438,0.328841755264519,0.299446544058752,"Pp3c9_903V3",1
"GO:0006066","GO:0006066","alcohol metabolic process","2/52","76/9629",0.0632889886124174,0.328841755264519,0.299446544058752,"Pp3c16_17210V3/Pp3c21_5760V3",2
"GO:0048511","GO:0048511","rhythmic process","2/52","78/9629",0.0662383893039797,0.335435425962727,0.305450805596802,"Pp3c3_37540V3/Pp3c7_12190V3",2
"GO:2000028","GO:2000028","regulation of photoperiodism, flowering","2/52","78/9629",0.0662383893039797,0.335435425962727,0.305450805596802,"Pp3c7_10610V3/Pp3c7_10630V3",2
"GO:0008645","GO:0008645","hexose transmembrane transport","1/52","13/9629",0.0680152823419564,0.335435425962727,0.305450805596802,"Pp3c8_25010V3",1
"GO:0046323","GO:0046323","glucose import","1/52","13/9629",0.0680152823419564,0.335435425962727,0.305450805596802,"Pp3c8_25010V3",1
"GO:1904659","GO:1904659","glucose transmembrane transport","1/52","13/9629",0.0680152823419564,0.335435425962727,0.305450805596802,"Pp3c8_25010V3",1
"GO:0006457","GO:0006457","protein folding","3/52","176/9629",0.0692168339288167,0.335435425962727,0.305450805596802,"Pp3c4_1450V3/Pp3c7_15240V3/Pp3c8_6510V3",3
"GO:0009826","GO:0009826","unidimensional cell growth","3/52","176/9629",0.0692168339288167,0.335435425962727,0.305450805596802,"Pp3c20_20860V3/Pp3c3_3840V3/Pp3c9_903V3",3
"GO:0010038","GO:0010038","response to metal ion","5/52","415/9629",0.0721344610246632,0.342142597918968,0.311558422499311,"Pp3c19_22640V3/Pp3c20_5060V3/Pp3c7_15240V3/Pp3c8_6510V3/Pp3c8_9230V3",5
"GO:0010315","GO:0010315","auxin export across the plasma membrane","1/52","14/9629",0.0730551331445993,0.342142597918968,0.311558422499311,"Pp3c20_20860V3",1
"GO:0015749","GO:0015749","monosaccharide transmembrane transport","1/52","14/9629",0.0730551331445993,0.342142597918968,0.311558422499311,"Pp3c8_25010V3",1
"GO:0016051","GO:0016051","carbohydrate biosynthetic process","3/52","182/9629",0.0749062423514614,0.342142597918968,0.311558422499311,"Pp3c1_12470V3/Pp3c20_5060V3/Pp3c21_5760V3",3
"GO:0006020","GO:0006020","inositol metabolic process","1/52","15/9629",0.0780682515092883,0.342142597918968,0.311558422499311,"Pp3c21_5760V3",1
"GO:0009785","GO:0009785","blue light signaling pathway","1/52","15/9629",0.0780682515092883,0.342142597918968,0.311558422499311,"Pp3c7_12190V3",1
"GO:0009809","GO:0009809","lignin biosynthetic process","1/52","15/9629",0.0780682515092883,0.342142597918968,0.311558422499311,"Pp3c7_3610V3",1
"GO:0019852","GO:0019852","L-ascorbic acid metabolic process","1/52","15/9629",0.0780682515092883,0.342142597918968,0.311558422499311,"Pp3c21_5760V3",1
"GO:0019853","GO:0019853","L-ascorbic acid biosynthetic process","1/52","15/9629",0.0780682515092883,0.342142597918968,0.311558422499311,"Pp3c21_5760V3",1
"GO:0030166","GO:0030166","proteoglycan biosynthetic process","1/52","15/9629",0.0780682515092883,0.342142597918968,0.311558422499311,"Pp3c9_903V3",1
"GO:0051961","GO:0051961","negative regulation of nervous system development","1/52","15/9629",0.0780682515092883,0.342142597918968,0.311558422499311,"Pp3c9_903V3",1
"GO:0062013","GO:0062013","positive regulation of small molecule metabolic process","1/52","16/9629",0.0830547764647194,0.36085868395016,0.328601474942084,"Pp3c20_20860V3",1
"GO:0009658","GO:0009658","chloroplast organization","3/52","193/9629",0.0858605341119443,0.3639053437899,0.331375793426057,"Pp3c1_3260V3/Pp3c22_18520V3/Pp3c7_12190V3",3
"GO:0016053","GO:0016053","organic acid biosynthetic process","4/52","311/9629",0.0863956744619113,0.3639053437899,0.331375793426057,"Pp3c16_17210V3/Pp3c20_5060V3/Pp3c21_5760V3/Pp3c7_3610V3",4
"GO:0046394","GO:0046394","carboxylic acid biosynthetic process","4/52","311/9629",0.0863956744619113,0.3639053437899,0.331375793426057,"Pp3c16_17210V3/Pp3c20_5060V3/Pp3c21_5760V3/Pp3c7_3610V3",4
"GO:0046174","GO:0046174","polyol catabolic process","1/52","17/9629",0.0880148463309247,0.3639053437899,0.331375793426057,"Pp3c21_5760V3",1
"GO:1904062","GO:1904062","regulation of cation transmembrane transport","1/52","17/9629",0.0880148463309247,0.3639053437899,0.331375793426057,"Pp3c7_12190V3",1
"GO:0044092","GO:0044092","negative regulation of molecular function","2/52","92/9629",0.0880881982983487,0.3639053437899,0.331375793426057,"Pp3c4_3890V3/Pp3c7_12190V3",2
"GO:0005996","GO:0005996","monosaccharide metabolic process","2/52","94/9629",0.0913670071381753,0.368866879970834,0.335893817183132,"Pp3c20_5060V3/Pp3c21_5760V3",2
"GO:0010359","GO:0010359","regulation of anion channel activity","1/52","18/9629",0.0929485987228093,0.368866879970834,0.335893817183132,"Pp3c7_12190V3",1
"GO:0042593","GO:0042593","glucose homeostasis","1/52","18/9629",0.0929485987228093,0.368866879970834,0.335893817183132,"Pp3c8_25010V3",1
"GO:0046164","GO:0046164","alcohol catabolic process","1/52","18/9629",0.0929485987228093,0.368866879970834,0.335893817183132,"Pp3c21_5760V3",1
"GO:1903959","GO:1903959","regulation of anion transmembrane transport","1/52","18/9629",0.0929485987228093,0.368866879970834,0.335893817183132,"Pp3c7_12190V3",1
"GO:0009834","GO:0009834","plant-type secondary cell wall biogenesis","1/52","19/9629",0.0978561705536712,0.372516545406541,0.33921723850721,"Pp3c20_20860V3",1
"GO:0034605","GO:0034605","cellular response to heat","1/52","19/9629",0.0978561705536712,0.372516545406541,0.33921723850721,"Pp3c7_5280V3",1
"GO:0046885","GO:0046885","regulation of hormone biosynthetic process","1/52","19/9629",0.0978561705536712,0.372516545406541,0.33921723850721,"Pp3c3_37540V3",1
"GO:0051098","GO:0051098","regulation of binding","1/52","19/9629",0.0978561705536712,0.372516545406541,0.33921723850721,"Pp3c1_3260V3",1
"GO:0002790","GO:0002790","peptide secretion","1/52","20/9629",0.102737698038709,0.372516545406541,0.33921723850721,"Pp3c8_6510V3",1
"GO:0009808","GO:0009808","lignin metabolic process","1/52","20/9629",0.102737698038709,0.372516545406541,0.33921723850721,"Pp3c7_3610V3",1
"GO:0010075","GO:0010075","regulation of meristem growth","1/52","20/9629",0.102737698038709,0.372516545406541,0.33921723850721,"Pp3c8_6510V3",1
"GO:0010162","GO:0010162","seed dormancy process","1/52","20/9629",0.102737698038709,0.372516545406541,0.33921723850721,"Pp3c16_17210V3",1
"GO:0022611","GO:0022611","dormancy process","1/52","20/9629",0.102737698038709,0.372516545406541,0.33921723850721,"Pp3c16_17210V3",1
"GO:0033500","GO:0033500","carbohydrate homeostasis","1/52","20/9629",0.102737698038709,0.372516545406541,0.33921723850721,"Pp3c8_25010V3",1
"GO:0045488","GO:0045488","pectin metabolic process","1/52","20/9629",0.102737698038709,0.372516545406541,0.33921723850721,"Pp3c1_12470V3",1
"GO:0046854","GO:0046854","phosphatidylinositol phosphate biosynthetic process","1/52","20/9629",0.102737698038709,0.372516545406541,0.33921723850721,"Pp3c21_5760V3",1
"GO:0051259","GO:0051259","protein complex oligomerization","2/52","102/9629",0.104829731460113,0.376064254428042,0.342447817315427,"Pp3c19_22640V3/Pp3c8_9230V3",2
"GO:0006029","GO:0006029","proteoglycan metabolic process","1/52","21/9629",0.107593316698505,0.376064254428042,0.342447817315427,"Pp3c9_903V3",1
"GO:0009903","GO:0009903","chloroplast avoidance movement","1/52","21/9629",0.107593316698505,0.376064254428042,0.342447817315427,"Pp3c7_12190V3",1
"GO:1901617","GO:1901617","organic hydroxy compound biosynthetic process","2/52","105/9629",0.110011889574073,0.376064254428042,0.342447817315427,"Pp3c16_17210V3/Pp3c21_5760V3",2
"GO:0032870","GO:0032870","cellular response to hormone stimulus","4/52","340/9629",0.110565652035256,0.376064254428042,0.342447817315427,"Pp3c20_20860V3/Pp3c3_37540V3/Pp3c5_7110V3/Pp3c7_3610V3",4
"GO:0009306","GO:0009306","protein secretion","1/52","22/9629",0.112423161362502,0.376064254428042,0.342447817315427,"Pp3c8_6510V3",1
"GO:0010207","GO:0010207","photosystem II assembly","1/52","22/9629",0.112423161362502,0.376064254428042,0.342447817315427,"Pp3c22_18520V3",1
"GO:0019747","GO:0019747","regulation of isoprenoid metabolic process","1/52","22/9629",0.112423161362502,0.376064254428042,0.342447817315427,"Pp3c4_1450V3",1
"GO:0030522","GO:0030522","intracellular receptor signaling pathway","1/52","22/9629",0.112423161362502,0.376064254428042,0.342447817315427,"Pp3c7_12190V3",1
"GO:1903428","GO:1903428","positive regulation of reactive oxygen species biosynthetic process","1/52","22/9629",0.112423161362502,0.376064254428042,0.342447817315427,"Pp3c5_7110V3",1
"GO:0009769","GO:0009769","photosynthesis, light harvesting in photosystem II","1/52","23/9629",0.117227366172447,0.376064254428042,0.342447817315427,"Pp3c5_7110V3",1
"GO:0009902","GO:0009902","chloroplast relocation","1/52","23/9629",0.117227366172447,0.376064254428042,0.342447817315427,"Pp3c7_12190V3",1
"GO:0022898","GO:0022898","regulation of transmembrane transporter activity","1/52","23/9629",0.117227366172447,0.376064254428042,0.342447817315427,"Pp3c7_12190V3",1
"GO:0032409","GO:0032409","regulation of transporter activity","1/52","23/9629",0.117227366172447,0.376064254428042,0.342447817315427,"Pp3c7_12190V3",1
"GO:0032412","GO:0032412","regulation of ion transmembrane transporter activity","1/52","23/9629",0.117227366172447,0.376064254428042,0.342447817315427,"Pp3c7_12190V3",1
"GO:0051667","GO:0051667","establishment of plastid localization","1/52","23/9629",0.117227366172447,0.376064254428042,0.342447817315427,"Pp3c7_12190V3",1
"GO:0060560","GO:0060560","developmental growth involved in morphogenesis","3/52","224/9629",0.120082689180615,0.376064254428042,0.342447817315427,"Pp3c20_20860V3/Pp3c3_3840V3/Pp3c9_903V3",3
"GO:0006259","GO:0006259","DNA metabolic process","4/52","352/9629",0.121381063925683,0.376064254428042,0.342447817315427,"Pp3c1_3260V3/Pp3c19_5540V3/Pp3c5_26150V3/Pp3c6_5030V3",4
"GO:0034219","GO:0034219","carbohydrate transmembrane transport","1/52","24/9629",0.122006064585839,0.376064254428042,0.342447817315427,"Pp3c8_25010V3",1
"GO:0043647","GO:0043647","inositol phosphate metabolic process","1/52","24/9629",0.122006064585839,0.376064254428042,0.342447817315427,"Pp3c21_5760V3",1
"GO:1901616","GO:1901616","organic hydroxy compound catabolic process","1/52","24/9629",0.122006064585839,0.376064254428042,0.342447817315427,"Pp3c21_5760V3",1
"GO:0006536","GO:0006536","glutamate metabolic process","1/52","25/9629",0.126759389379335,0.376064254428042,0.342447817315427,"Pp3c16_2800V3",1
"GO:0006879","GO:0006879","cellular iron ion homeostasis","1/52","25/9629",0.126759389379335,0.376064254428042,0.342447817315427,"Pp3c11_20170V3",1
"GO:0010099","GO:0010099","regulation of photomorphogenesis","1/52","25/9629",0.126759389379335,0.376064254428042,0.342447817315427,"Pp3c7_5280V3",1
"GO:0010167","GO:0010167","response to nitrate","1/52","25/9629",0.126759389379335,0.376064254428042,0.342447817315427,"Pp3c22_21950V3",1
"GO:0010393","GO:0010393","galacturonan metabolic process","1/52","25/9629",0.126759389379335,0.376064254428042,0.342447817315427,"Pp3c1_12470V3",1
"GO:0010975","GO:0010975","regulation of neuron projection development","1/52","25/9629",0.126759389379335,0.376064254428042,0.342447817315427,"Pp3c9_903V3",1
"GO:0032102","GO:0032102","negative regulation of response to external stimulus","1/52","25/9629",0.126759389379335,0.376064254428042,0.342447817315427,"Pp3c9_903V3",1
"GO:0051051","GO:0051051","negative regulation of transport","1/52","25/9629",0.126759389379335,0.376064254428042,0.342447817315427,"Pp3c7_12190V3",1
"GO:0065009","GO:0065009","regulation of molecular function","4/52","362/9629",0.130736038061275,0.376064254428042,0.342447817315427,"Pp3c1_3260V3/Pp3c4_1450V3/Pp3c4_3890V3/Pp3c7_12190V3",4
"GO:0009909","GO:0009909","regulation of flower development","2/52","117/9629",0.131380735510046,0.376064254428042,0.342447817315427,"Pp3c21_16210V3/Pp3c3_37540V3",2
"GO:0009638","GO:0009638","phototropism","1/52","26/9629",0.131487472652167,0.376064254428042,0.342447817315427,"Pp3c7_12190V3",1
"GO:0010223","GO:0010223","secondary shoot formation","1/52","26/9629",0.131487472652167,0.376064254428042,0.342447817315427,"Pp3c8_1870V3",1
"GO:0010346","GO:0010346","shoot axis formation","1/52","26/9629",0.131487472652167,0.376064254428042,0.342447817315427,"Pp3c8_1870V3",1
"GO:0019750","GO:0019750","chloroplast localization","1/52","26/9629",0.131487472652167,0.376064254428042,0.342447817315427,"Pp3c7_12190V3",1
"GO:0044070","GO:0044070","regulation of anion transport","1/52","26/9629",0.131487472652167,0.376064254428042,0.342447817315427,"Pp3c7_12190V3",1
"GO:0051644","GO:0051644","plastid localization","1/52","26/9629",0.131487472652167,0.376064254428042,0.342447817315427,"Pp3c7_12190V3",1
"GO:2000241","GO:2000241","regulation of reproductive process","3/52","234/9629",0.132070184590801,0.376064254428042,0.342447817315427,"Pp3c3_37540V3/Pp3c7_10610V3/Pp3c7_10630V3",3
"GO:0071495","GO:0071495","cellular response to endogenous stimulus","4/52","367/9629",0.135525862087428,0.379226434796001,0.345327329931195,"Pp3c20_20860V3/Pp3c3_37540V3/Pp3c5_7110V3/Pp3c7_3610V3",4
"GO:0019319","GO:0019319","hexose biosynthetic process","1/52","27/9629",0.136190445829516,0.379226434796001,0.345327329931195,"Pp3c20_5060V3",1
"GO:0045596","GO:0045596","negative regulation of cell differentiation","1/52","27/9629",0.136190445829516,0.379226434796001,0.345327329931195,"Pp3c9_903V3",1
"GO:2000142","GO:2000142","regulation of DNA-templated transcription, initiation","1/52","27/9629",0.136190445829516,0.379226434796001,0.345327329931195,"Pp3c22_18520V3",1
"GO:0008643","GO:0008643","carbohydrate transport","1/52","28/9629",0.140868439665891,0.385857030389179,0.35136521564261,"Pp3c8_25010V3",1
"GO:0045664","GO:0045664","regulation of neuron differentiation","1/52","28/9629",0.140868439665891,0.385857030389179,0.35136521564261,"Pp3c9_903V3",1
"GO:0046890","GO:0046890","regulation of lipid biosynthetic process","1/52","28/9629",0.140868439665891,0.385857030389179,0.35136521564261,"Pp3c4_1450V3",1
"GO:0042546","GO:0042546","cell wall biogenesis","2/52","124/9629",0.144260231994983,0.389658752256746,0.354827101052509,"Pp3c1_12470V3/Pp3c20_20860V3",2
"GO:0042538","GO:0042538","hyperosmotic salinity response","1/52","29/9629",0.145521584248473,0.389658752256746,0.354827101052509,"Pp3c16_17210V3",1
"GO:0046173","GO:0046173","polyol biosynthetic process","1/52","29/9629",0.145521584248473,0.389658752256746,0.354827101052509,"Pp3c21_5760V3",1
"GO:1903426","GO:1903426","regulation of reactive oxygen species biosynthetic process","1/52","29/9629",0.145521584248473,0.389658752256746,0.354827101052509,"Pp3c5_7110V3",1
"GO:0051241","GO:0051241","negative regulation of multicellular organismal process","2/52","125/9629",0.14612203209628,0.389658752256746,0.354827101052509,"Pp3c7_5280V3/Pp3c9_903V3",2
"GO:0097305","GO:0097305","response to alcohol","4/52","380/9629",0.148315312036976,0.392101577907938,0.357051562171806,"Pp3c19_22640V3/Pp3c3_37540V3/Pp3c5_7110V3/Pp3c8_9230V3",4
"GO:0010675","GO:0010675","regulation of cellular carbohydrate metabolic process","1/52","30/9629",0.15015000900046,0.392101577907938,0.357051562171806,"Pp3c4_1450V3",1
"GO:0030104","GO:0030104","water homeostasis","1/52","30/9629",0.15015000900046,0.392101577907938,0.357051562171806,"Pp3c5_7110V3",1
"GO:0050767","GO:0050767","regulation of neurogenesis","1/52","30/9629",0.15015000900046,0.392101577907938,0.357051562171806,"Pp3c9_903V3",1
"GO:0015979","GO:0015979","photosynthesis","3/52","250/9629",0.152087899552616,0.395114955538756,0.35979557354824,"Pp3c20_23270V3/Pp3c22_18520V3/Pp3c5_7110V3",3
"GO:0009753","GO:0009753","response to jasmonic acid","2/52","129/9629",0.153619577706994,0.39521376699414,0.359885552233595,"Pp3c3_37540V3/Pp3c7_3610V3",2
"GO:0006094","GO:0006094","gluconeogenesis","1/52","31/9629",0.154753842684383,0.39521376699414,0.359885552233595,"Pp3c20_5060V3",1
"GO:0009755","GO:0009755","hormone-mediated signaling pathway","3/52","255/9629",0.158537525891145,0.39521376699414,0.359885552233595,"Pp3c20_20860V3/Pp3c3_37540V3/Pp3c7_3610V3",3
"GO:0051093","GO:0051093","negative regulation of developmental process","2/52","132/9629",0.159292666278454,0.39521376699414,0.359885552233595,"Pp3c7_5280V3/Pp3c9_903V3",2
"GO:0001763","GO:0001763","morphogenesis of a branching structure","1/52","32/9629",0.15933321340541,0.39521376699414,0.359885552233595,"Pp3c8_1870V3",1
"GO:0034765","GO:0034765","regulation of ion transmembrane transport","1/52","32/9629",0.15933321340541,0.39521376699414,0.359885552233595,"Pp3c7_12190V3",1
"GO:0051960","GO:0051960","regulation of nervous system development","1/52","32/9629",0.15933321340541,0.39521376699414,0.359885552233595,"Pp3c9_903V3",1
"GO:2000030","GO:2000030","regulation of response to red or far red light","1/52","32/9629",0.15933321340541,0.39521376699414,0.359885552233595,"Pp3c7_5280V3",1
"GO:2000379","GO:2000379","positive regulation of reactive oxygen species metabolic process","1/52","32/9629",0.15933321340541,0.39521376699414,0.359885552233595,"Pp3c5_7110V3",1
"GO:0016049","GO:0016049","cell growth","3/52","257/9629",0.161141536083703,0.39521376699414,0.359885552233595,"Pp3c20_20860V3/Pp3c3_3840V3/Pp3c9_903V3",3
"GO:0044282","GO:0044282","small molecule catabolic process","2/52","134/9629",0.163096965209276,0.39521376699414,0.359885552233595,"Pp3c16_2800V3/Pp3c21_5760V3",2
"GO:0009699","GO:0009699","phenylpropanoid biosynthetic process","1/52","33/9629",0.163888248614633,0.39521376699414,0.359885552233595,"Pp3c7_3610V3",1
"GO:0031344","GO:0031344","regulation of cell projection organization","1/52","33/9629",0.163888248614633,0.39521376699414,0.359885552233595,"Pp3c9_903V3",1
"GO:0034097","GO:0034097","response to cytokine","1/52","33/9629",0.163888248614633,0.39521376699414,0.359885552233595,"Pp3c9_903V3",1
"GO:0120035","GO:0120035","regulation of plasma membrane bounded cell projection organization","1/52","33/9629",0.163888248614633,0.39521376699414,0.359885552233595,"Pp3c9_903V3",1
"GO:0009247","GO:0009247","glycolipid biosynthetic process","1/52","34/9629",0.168419075112345,0.396650532040289,0.361193884648216,"Pp3c7_3610V3",1
"GO:0009269","GO:0009269","response to desiccation","1/52","34/9629",0.168419075112345,0.396650532040289,0.361193884648216,"Pp3c5_7110V3",1
"GO:0010928","GO:0010928","regulation of auxin mediated signaling pathway","1/52","34/9629",0.168419075112345,0.396650532040289,0.361193884648216,"Pp3c20_20860V3",1
"GO:0032875","GO:0032875","regulation of DNA endoreduplication","1/52","34/9629",0.168419075112345,0.396650532040289,0.361193884648216,"Pp3c8_24740V3",1
"GO:0071472","GO:0071472","cellular response to salt stress","1/52","34/9629",0.168419075112345,0.396650532040289,0.361193884648216,"Pp3c22_18520V3",1
"GO:0009657","GO:0009657","plastid organization","3/52","264/9629",0.170359593564389,0.399354582123033,0.363656219310031,"Pp3c1_3260V3/Pp3c22_18520V3/Pp3c7_12190V3",3
"GO:0010431","GO:0010431","seed maturation","1/52","35/9629",0.172925819051288,0.401857533172421,0.36593543120964,"Pp3c16_17210V3",1
"GO:0032787","GO:0032787","monocarboxylic acid metabolic process","3/52","266/9629",0.173021993449237,0.401857533172421,0.36593543120964,"Pp3c16_17210V3/Pp3c20_5060V3/Pp3c7_3610V3",3
"GO:0016567","GO:0016567","protein ubiquitination","3/52","268/9629",0.175696669308463,0.406197804272778,0.369887724859923,"Pp3c1_3260V3/Pp3c5_26150V3/Pp3c6_5030V3",3
"GO:0032446","GO:0032446","protein modification by small protein conjugation","3/52","269/9629",0.177038531568451,0.407431141143832,0.371010813572913,"Pp3c1_3260V3/Pp3c5_26150V3/Pp3c6_5030V3",3
"GO:0009064","GO:0009064","glutamine family amino acid metabolic process","1/52","37/9629",0.18186756064553,0.416051785650173,0.378860857442514,"Pp3c16_2800V3",1
"GO:0048589","GO:0048589","developmental growth","3/52","273/9629",0.182435406009302,0.416051785650173,0.378860857442514,"Pp3c20_20860V3/Pp3c3_3840V3/Pp3c9_903V3",3
"GO:1901137","GO:1901137","carbohydrate derivative biosynthetic process","3/52","275/9629",0.185151057708724,0.419738396396097,0.382217921530281,"Pp3c20_5060V3/Pp3c7_3610V3/Pp3c9_903V3",3
"GO:0034762","GO:0034762","regulation of transmembrane transport","1/52","38/9629",0.18630280739766,0.419738396396097,0.382217921530281,"Pp3c7_12190V3",1
"GO:0000902","GO:0000902","cell morphogenesis","3/52","278/9629",0.189245347542345,0.419738396396097,0.382217921530281,"Pp3c20_20860V3/Pp3c3_3840V3/Pp3c9_903V3",3
"GO:0006757","GO:0006757","ATP generation from ADP","1/52","39/9629",0.190714469791084,0.419738396396097,0.382217921530281,"Pp3c20_5060V3",1
"GO:0042548","GO:0042548","regulation of photosynthesis, light reaction","1/52","39/9629",0.190714469791084,0.419738396396097,0.382217921530281,"Pp3c7_3610V3",1
"GO:0042866","GO:0042866","pyruvate biosynthetic process","1/52","39/9629",0.190714469791084,0.419738396396097,0.382217921530281,"Pp3c20_5060V3",1
"GO:0045454","GO:0045454","cell redox homeostasis","1/52","39/9629",0.190714469791084,0.419738396396097,0.382217921530281,"Pp3c4_3890V3",1
"GO:1901606","GO:1901606","alpha-amino acid catabolic process","1/52","39/9629",0.190714469791084,0.419738396396097,0.382217921530281,"Pp3c16_2800V3",1
"GO:0006664","GO:0006664","glycolipid metabolic process","1/52","40/9629",0.195102670789088,0.42567855444892,0.38762708801113,"Pp3c7_3610V3",1
"GO:1903509","GO:1903509","liposaccharide metabolic process","1/52","40/9629",0.195102670789088,0.42567855444892,0.38762708801113,"Pp3c7_3610V3",1
"GO:0009645","GO:0009645","response to low light intensity stimulus","1/52","41/9629",0.199467532726618,0.431466251048134,0.392897421589362,"Pp3c5_7110V3",1
"GO:0046031","GO:0046031","ADP metabolic process","1/52","41/9629",0.199467532726618,0.431466251048134,0.392897421589362,"Pp3c20_5060V3",1
"GO:0010224","GO:0010224","response to UV-B","1/52","42/9629",0.203809177313415,0.438973612675048,0.399733699094237,"Pp3c1_3260V3",1
"GO:0032989","GO:0032989","cellular component morphogenesis","3/52","291/9629",0.207256469938109,0.444476159835282,0.404744372782337,"Pp3c20_20860V3/Pp3c3_3840V3/Pp3c9_903V3",3
"GO:0006165","GO:0006165","nucleoside diphosphate phosphorylation","1/52","43/9629",0.208127725637156,0.444476159835282,0.404744372782337,"Pp3c20_5060V3",1
"GO:0009166","GO:0009166","nucleotide catabolic process","1/52","44/9629",0.21242329816656,0.451735621417495,0.411354910062715,"Pp3c20_5060V3",1
"GO:0009698","GO:0009698","phenylpropanoid metabolic process","1/52","45/9629",0.216696014754493,0.453949486616559,0.413370877537218,"Pp3c7_3610V3",1
"GO:1901292","GO:1901292","nucleoside phosphate catabolic process","1/52","45/9629",0.216696014754493,0.453949486616559,0.413370877537218,"Pp3c20_5060V3",1
"GO:0009063","GO:0009063","cellular amino acid catabolic process","1/52","46/9629",0.220945994641051,0.453949486616559,0.413370877537218,"Pp3c16_2800V3",1
"GO:0009135","GO:0009135","purine nucleoside diphosphate metabolic process","1/52","46/9629",0.220945994641051,0.453949486616559,0.413370877537218,"Pp3c20_5060V3",1
"GO:0009179","GO:0009179","purine ribonucleoside diphosphate metabolic process","1/52","46/9629",0.220945994641051,0.453949486616559,0.413370877537218,"Pp3c20_5060V3",1
"GO:0009185","GO:0009185","ribonucleoside diphosphate metabolic process","1/52","46/9629",0.220945994641051,0.453949486616559,0.413370877537218,"Pp3c20_5060V3",1
"GO:0071470","GO:0071470","cellular response to osmotic stress","1/52","46/9629",0.220945994641051,0.453949486616559,0.413370877537218,"Pp3c22_18520V3",1
"GO:0090333","GO:0090333","regulation of stomatal closure","1/52","46/9629",0.220945994641051,0.453949486616559,0.413370877537218,"Pp3c5_7110V3",1
"GO:1901615","GO:1901615","organic hydroxy compound metabolic process","2/52","164/9629",0.221771562494278,0.453949486616559,0.413370877537218,"Pp3c16_17210V3/Pp3c21_5760V3",2
"GO:0044283","GO:0044283","small molecule biosynthetic process","4/52","449/9629",0.223137088011327,0.453949486616559,0.413370877537218,"Pp3c16_17210V3/Pp3c20_5060V3/Pp3c21_5760V3/Pp3c7_3610V3",4
"GO:0006352","GO:0006352","DNA-templated transcription, initiation","1/52","47/9629",0.225173356456627,0.453949486616559,0.413370877537218,"Pp3c22_18520V3",1
"GO:0042364","GO:0042364","water-soluble vitamin biosynthetic process","1/52","47/9629",0.225173356456627,0.453949486616559,0.413370877537218,"Pp3c21_5760V3",1
"GO:0043467","GO:0043467","regulation of generation of precursor metabolites and energy","1/52","47/9629",0.225173356456627,0.453949486616559,0.413370877537218,"Pp3c7_3610V3",1
"GO:0070647","GO:0070647","protein modification by small protein conjugation or removal","3/52","306/9629",0.228515745808485,0.456943169902705,0.416096955049246,"Pp3c1_3260V3/Pp3c5_26150V3/Pp3c6_5030V3",3
"GO:0010029","GO:0010029","regulation of seed germination","1/52","48/9629",0.229378218224969,0.456943169902705,0.416096955049246,"Pp3c8_25010V3",1
"GO:0015698","GO:0015698","inorganic anion transport","1/52","48/9629",0.229378218224969,0.456943169902705,0.416096955049246,"Pp3c22_21950V3",1
"GO:0019359","GO:0019359","nicotinamide nucleotide biosynthetic process","1/52","49/9629",0.233560697366217,0.45982262293974,0.418719013370356,"Pp3c20_5060V3",1
"GO:0019751","GO:0019751","polyol metabolic process","1/52","49/9629",0.233560697366217,0.45982262293974,0.418719013370356,"Pp3c21_5760V3",1
"GO:0046939","GO:0046939","nucleotide phosphorylation","1/52","49/9629",0.233560697366217,0.45982262293974,0.418719013370356,"Pp3c20_5060V3",1
"GO:0019363","GO:0019363","pyridine nucleotide biosynthetic process","1/52","50/9629",0.237720910699929,0.465255431762732,0.423666182641084,"Pp3c20_5060V3",1
"GO:0071310","GO:0071310","cellular response to organic substance","4/52","462/9629",0.238286567836974,0.465255431762732,0.423666182641084,"Pp3c20_20860V3/Pp3c3_37540V3/Pp3c5_7110V3/Pp3c7_3610V3",4
"GO:0006767","GO:0006767","water-soluble vitamin metabolic process","1/52","51/9629",0.241858974448087,0.465255431762732,0.423666182641084,"Pp3c21_5760V3",1
"GO:0009132","GO:0009132","nucleoside diphosphate metabolic process","1/52","51/9629",0.241858974448087,0.465255431762732,0.423666182641084,"Pp3c20_5060V3",1
"GO:0009846","GO:0009846","pollen germination","1/52","51/9629",0.241858974448087,0.465255431762732,0.423666182641084,"Pp3c3_3840V3",1
"GO:0060918","GO:0060918","auxin transport","1/52","51/9629",0.241858974448087,0.465255431762732,0.423666182641084,"Pp3c20_20860V3",1
"GO:0043269","GO:0043269","regulation of ion transport","1/52","52/9629",0.245975004238095,0.469588644454545,0.427612048834966,"Pp3c7_12190V3",1
"GO:1900140","GO:1900140","regulation of seedling development","1/52","52/9629",0.245975004238095,0.469588644454545,0.427612048834966,"Pp3c8_25010V3",1
"GO:0019216","GO:0019216","regulation of lipid metabolic process","1/52","53/9629",0.250069115105759,0.473838174174767,0.431481712489971,"Pp3c4_1450V3",1
"GO:0009733","GO:0009733","response to auxin","2/52","181/9629",0.255818462844238,0.473838174174767,0.431481712489971,"Pp3c20_20860V3/Pp3c3_37540V3",2
"GO:0042592","GO:0042592","homeostatic process","3/52","325/9629",0.256027959735799,0.473838174174767,0.431481712489971,"Pp3c4_3890V3/Pp3c5_7110V3/Pp3c8_25010V3",3
"GO:0006972","GO:0006972","hyperosmotic response","1/52","55/9629",0.258192037277059,0.473838174174767,0.431481712489971,"Pp3c16_17210V3",1
"GO:0048699","GO:0048699","generation of neurons","1/52","55/9629",0.258192037277059,0.473838174174767,0.431481712489971,"Pp3c9_903V3",1
"GO:0005975","GO:0005975","carbohydrate metabolic process","4/52","482/9629",0.262072259440203,0.473838174174767,0.431481712489971,"Pp3c1_12470V3/Pp3c20_5060V3/Pp3c21_5760V3/Pp3c22_23000V3",4
"GO:0072525","GO:0072525","pyridine-containing compound biosynthetic process","1/52","56/9629",0.262221075720927,0.473838174174767,0.431481712489971,"Pp3c20_5060V3",1
"GO:0046700","GO:0046700","heterocycle catabolic process","2/52","186/9629",0.265872606575661,0.473838174174767,0.431481712489971,"Pp3c16_2800V3/Pp3c20_5060V3",2
"GO:0006006","GO:0006006","glucose metabolic process","1/52","57/9629",0.266228649528773,0.473838174174767,0.431481712489971,"Pp3c20_5060V3",1
"GO:0006754","GO:0006754","ATP biosynthetic process","1/52","57/9629",0.266228649528773,0.473838174174767,0.431481712489971,"Pp3c20_5060V3",1
"GO:0009744","GO:0009744","response to sucrose","1/52","57/9629",0.266228649528773,0.473838174174767,0.431481712489971,"Pp3c20_5060V3",1
"GO:0009914","GO:0009914","hormone transport","1/52","57/9629",0.266228649528773,0.473838174174767,0.431481712489971,"Pp3c20_20860V3",1
"GO:0034285","GO:0034285","response to disaccharide","1/52","57/9629",0.266228649528773,0.473838174174767,0.431481712489971,"Pp3c20_5060V3",1
"GO:0045036","GO:0045036","protein targeting to chloroplast","1/52","57/9629",0.266228649528773,0.473838174174767,0.431481712489971,"Pp3c7_15240V3",1
"GO:0072596","GO:0072596","establishment of protein localization to chloroplast","1/52","57/9629",0.266228649528773,0.473838174174767,0.431481712489971,"Pp3c7_15240V3",1
"GO:0010817","GO:0010817","regulation of hormone levels","2/52","188/9629",0.269895840137876,0.473838174174767,0.431481712489971,"Pp3c20_20860V3/Pp3c3_37540V3",2
"GO:0009867","GO:0009867","jasmonic acid mediated signaling pathway","1/52","58/9629",0.2702148708226,0.473838174174767,0.431481712489971,"Pp3c7_3610V3",1
"GO:0036293","GO:0036293","response to decreased oxygen levels","1/52","58/9629",0.2702148708226,0.473838174174767,0.431481712489971,"Pp3c20_5060V3",1
"GO:0044550","GO:0044550","secondary metabolite biosynthetic process","1/52","58/9629",0.2702148708226,0.473838174174767,0.431481712489971,"Pp3c7_3610V3",1
"GO:0061077","GO:0061077","chaperone-mediated protein folding","1/52","58/9629",0.2702148708226,0.473838174174767,0.431481712489971,"Pp3c4_1450V3",1
"GO:0072598","GO:0072598","protein localization to chloroplast","1/52","58/9629",0.2702148708226,0.473838174174767,0.431481712489971,"Pp3c7_15240V3",1
"GO:0006090","GO:0006090","pyruvate metabolic process","1/52","59/9629",0.274179851150384,0.473838174174767,0.431481712489971,"Pp3c20_5060V3",1
"GO:0009739","GO:0009739","response to gibberellin","1/52","59/9629",0.274179851150384,0.473838174174767,0.431481712489971,"Pp3c3_37540V3",1
"GO:0016114","GO:0016114","terpenoid biosynthetic process","1/52","59/9629",0.274179851150384,0.473838174174767,0.431481712489971,"Pp3c16_17210V3",1
"GO:0060284","GO:0060284","regulation of cell development","1/52","59/9629",0.274179851150384,0.473838174174767,0.431481712489971,"Pp3c9_903V3",1
"GO:0070482","GO:0070482","response to oxygen levels","1/52","59/9629",0.274179851150384,0.473838174174767,0.431481712489971,"Pp3c20_5060V3",1
"GO:0009145","GO:0009145","purine nucleoside triphosphate biosynthetic process","1/52","60/9629",0.278123701488961,0.473838174174767,0.431481712489971,"Pp3c20_5060V3",1
"GO:0009201","GO:0009201","ribonucleoside triphosphate biosynthetic process","1/52","60/9629",0.278123701488961,0.473838174174767,0.431481712489971,"Pp3c20_5060V3",1
"GO:0009206","GO:0009206","purine ribonucleoside triphosphate biosynthetic process","1/52","60/9629",0.278123701488961,0.473838174174767,0.431481712489971,"Pp3c20_5060V3",1
"GO:0010118","GO:0010118","stomatal movement","1/52","60/9629",0.278123701488961,0.473838174174767,0.431481712489971,"Pp3c7_12190V3",1
"GO:0043648","GO:0043648","dicarboxylic acid metabolic process","1/52","60/9629",0.278123701488961,0.473838174174767,0.431481712489971,"Pp3c16_2800V3",1
"GO:0040007","GO:0040007","growth","3/52","341/9629",0.279569869307814,0.473838174174767,0.431481712489971,"Pp3c20_20860V3/Pp3c3_3840V3/Pp3c9_903V3",3
"GO:0010109","GO:0010109","regulation of photosynthesis","1/52","61/9629",0.282046532246885,0.473838174174767,0.431481712489971,"Pp3c7_3610V3",1
"GO:0019318","GO:0019318","hexose metabolic process","1/52","61/9629",0.282046532246885,0.473838174174767,0.431481712489971,"Pp3c20_5060V3",1
"GO:0048509","GO:0048509","regulation of meristem development","1/52","61/9629",0.282046532246885,0.473838174174767,0.431481712489971,"Pp3c8_6510V3",1
"GO:0071395","GO:0071395","cellular response to jasmonic acid stimulus","1/52","61/9629",0.282046532246885,0.473838174174767,0.431481712489971,"Pp3c7_3610V3",1
"GO:0022008","GO:0022008","neurogenesis","1/52","62/9629",0.285948453267282,0.478797410121961,0.435997641631527,"Pp3c9_903V3",1
"GO:0009127","GO:0009127","purine nucleoside monophosphate biosynthetic process","1/52","63/9629",0.289829573830688,0.480506925035088,0.437554342763781,"Pp3c20_5060V3",1
"GO:0009142","GO:0009142","nucleoside triphosphate biosynthetic process","1/52","63/9629",0.289829573830688,0.480506925035088,0.437554342763781,"Pp3c20_5060V3",1
"GO:0080167","GO:0080167","response to karrikin","1/52","63/9629",0.289829573830688,0.480506925035088,0.437554342763781,"Pp3c21_5760V3",1
"GO:0046467","GO:0046467","membrane lipid biosynthetic process","1/52","64/9629",0.293690002657868,0.485310692916608,0.441928701152132,"Pp3c7_3610V3",1
"GO:0009168","GO:0009168","purine ribonucleoside monophosphate biosynthetic process","1/52","65/9629",0.297529847912629,0.488452909928225,0.444790034938818,"Pp3c20_5060V3",1
"GO:0009624","GO:0009624","response to nematode","1/52","65/9629",0.297529847912629,0.488452909928225,0.444790034938818,"Pp3c22_23000V3",1
"GO:1901361","GO:1901361","organic cyclic compound catabolic process","2/52","203/9629",0.300045053445682,0.490982814729297,0.447093791190421,"Pp3c16_2800V3/Pp3c20_5060V3",2
"GO:0009110","GO:0009110","vitamin biosynthetic process","1/52","66/9629",0.301349217204614,0.491521053304613,0.447583916543048,"Pp3c21_5760V3",1
"GO:0006096","GO:0006096","glycolytic process","1/52","67/9629",0.305148217592082,0.494516725615465,0.450311805280582,"Pp3c20_5060V3",1
"GO:1990748","GO:1990748","cellular detoxification","1/52","67/9629",0.305148217592082,0.494516725615465,0.450311805280582,"Pp3c4_3890V3",1
"GO:0098869","GO:0098869","cellular oxidant detoxification","1/52","68/9629",0.308926955584679,0.499035851329097,0.454426965704859,"Pp3c4_3890V3",1
"GO:0009751","GO:0009751","response to salicylic acid","1/52","69/9629",0.312685537146189,0.50189016153401,0.457026128715181,"Pp3c3_37540V3",1
"GO:0009845","GO:0009845","seed germination","1/52","69/9629",0.312685537146189,0.50189016153401,0.457026128715181,"Pp3c3_37540V3",1
"GO:0006766","GO:0006766","vitamin metabolic process","1/52","70/9629",0.316424067697277,0.504676361137429,0.459563269540349,"Pp3c21_5760V3",1
"GO:0010073","GO:0010073","meristem maintenance","1/52","70/9629",0.316424067697277,0.504676361137429,0.459563269540349,"Pp3c8_6510V3",1
"GO:0009860","GO:0009860","pollen tube growth","1/52","71/9629",0.320142652118214,0.507395901470377,0.462039709776701,"Pp3c3_3840V3",1
"GO:0034404","GO:0034404","nucleobase-containing small molecule biosynthetic process","1/52","71/9629",0.320142652118214,0.507395901470377,0.462039709776701,"Pp3c20_5060V3",1
"GO:0007399","GO:0007399","nervous system development","1/52","73/9629",0.327520399405034,0.512640625155706,0.466815606866933,"Pp3c9_903V3",1
"GO:0009101","GO:0009101","glycoprotein biosynthetic process","1/52","73/9629",0.327520399405034,0.512640625155706,0.466815606866933,"Pp3c9_903V3",1
"GO:0034976","GO:0034976","response to endoplasmic reticulum stress","1/52","73/9629",0.327520399405034,0.512640625155706,0.466815606866933,"Pp3c8_6510V3",1
"GO:0043086","GO:0043086","negative regulation of catalytic activity","1/52","73/9629",0.327520399405034,0.512640625155706,0.466815606866933,"Pp3c4_3890V3",1
"GO:0009891","GO:0009891","positive regulation of biosynthetic process","3/52","374/9629",0.328721168602113,0.512927148530851,0.467076517876882,"Pp3c22_18520V3/Pp3c5_7110V3/Pp3c8_1870V3",3
"GO:0046496","GO:0046496","nicotinamide nucleotide metabolic process","1/52","74/9629",0.331179769353856,0.515168530105998,0.469117542034701,"Pp3c20_5060V3",1
"GO:0071554","GO:0071554","cell wall organization or biogenesis","2/52","220/9629",0.334000748712187,0.516052238841769,0.469922255921076,"Pp3c1_12470V3/Pp3c20_20860V3",2
"GO:0019362","GO:0019362","pyridine nucleotide metabolic process","1/52","75/9629",0.334819607343767,0.516052238841769,0.469922255921076,"Pp3c20_5060V3",1
"GO:2000377","GO:2000377","regulation of reactive oxygen species metabolic process","1/52","75/9629",0.334819607343767,0.516052238841769,0.469922255921076,"Pp3c5_7110V3",1
"GO:0090351","GO:0090351","seedling development","1/52","76/9629",0.338440015593518,0.518461300483687,0.472115971200684,"Pp3c3_37540V3",1
"GO:0097237","GO:0097237","cellular response to toxic substance","1/52","76/9629",0.338440015593518,0.518461300483687,0.472115971200684,"Pp3c4_3890V3",1
"GO:0008299","GO:0008299","isoprenoid biosynthetic process","1/52","77/9629",0.342041095797552,0.522390037218079,0.475693517600423,"Pp3c16_17210V3",1
"GO:0006643","GO:0006643","membrane lipid metabolic process","1/52","78/9629",0.345622949128637,0.524680621568775,0.477779346290697,"Pp3c7_3610V3",1
"GO:0009156","GO:0009156","ribonucleoside monophosphate biosynthetic process","1/52","78/9629",0.345622949128637,0.524680621568775,0.477779346290697,"Pp3c20_5060V3",1
"GO:0009124","GO:0009124","nucleoside monophosphate biosynthetic process","1/52","79/9629",0.349185676240491,0.526914912650321,0.479813913775146,"Pp3c20_5060V3",1
"GO:0032101","GO:0032101","regulation of response to external stimulus","1/52","79/9629",0.349185676240491,0.526914912650321,0.479813913775146,"Pp3c9_903V3",1
"GO:0071229","GO:0071229","cellular response to acid chemical","2/52","229/9629",0.351811637976059,0.529292732955027,0.481979180385112,"Pp3c5_7110V3/Pp3c7_3610V3",2
"GO:0006721","GO:0006721","terpenoid metabolic process","1/52","81/9629",0.356254151841748,0.532795526790032,0.485168858981734,"Pp3c16_17210V3",1
"GO:0072524","GO:0072524","pyridine-containing compound metabolic process","1/52","81/9629",0.356254151841748,0.532795526790032,0.485168858981734,"Pp3c20_5060V3",1
"GO:0009100","GO:0009100","glycoprotein metabolic process","1/52","82/9629",0.35976009906674,0.536447011626145,0.488493937069756,"Pp3c9_903V3",1
"GO:0048585","GO:0048585","negative regulation of response to stimulus","2/52","234/9629",0.361642367179804,0.536447805737297,0.488494660195199,"Pp3c7_5280V3/Pp3c9_903V3",2
"GO:0098754","GO:0098754","detoxification","1/52","83/9629",0.363247317548832,0.536447805737297,0.488494660195199,"Pp3c4_3890V3",1
"GO:0009606","GO:0009606","tropism","1/52","84/9629",0.366715905385356,0.536447805737297,0.488494660195199,"Pp3c7_12190V3",1
"GO:0009199","GO:0009199","ribonucleoside triphosphate metabolic process","1/52","85/9629",0.370165960170056,0.536447805737297,0.488494660195199,"Pp3c20_5060V3",1
"GO:0009205","GO:0009205","purine ribonucleoside triphosphate metabolic process","1/52","85/9629",0.370165960170056,0.536447805737297,0.488494660195199,"Pp3c20_5060V3",1
"GO:0009411","GO:0009411","response to UV","1/52","85/9629",0.370165960170056,0.536447805737297,0.488494660195199,"Pp3c1_3260V3",1
"GO:0009144","GO:0009144","purine nucleoside triphosphate metabolic process","1/52","86/9629",0.373597578995618,0.536447805737297,0.488494660195199,"Pp3c20_5060V3",1
"GO:0016054","GO:0016054","organic acid catabolic process","1/52","86/9629",0.373597578995618,0.536447805737297,0.488494660195199,"Pp3c16_2800V3",1
"GO:0046034","GO:0046034","ATP metabolic process","1/52","86/9629",0.373597578995618,0.536447805737297,0.488494660195199,"Pp3c20_5060V3",1
"GO:0046395","GO:0046395","carboxylic acid catabolic process","1/52","86/9629",0.373597578995618,0.536447805737297,0.488494660195199,"Pp3c16_2800V3",1
"GO:0048581","GO:0048581","negative regulation of post-embryonic development","1/52","86/9629",0.373597578995618,0.536447805737297,0.488494660195199,"Pp3c7_5280V3",1
"GO:0051656","GO:0051656","establishment of organelle localization","1/52","86/9629",0.373597578995618,0.536447805737297,0.488494660195199,"Pp3c7_12190V3",1
"GO:0080135","GO:0080135","regulation of cellular response to stress","1/52","86/9629",0.373597578995618,0.536447805737297,0.488494660195199,"Pp3c9_903V3",1
"GO:0009126","GO:0009126","purine nucleoside monophosphate metabolic process","1/52","87/9629",0.377010858456188,0.53676122220881,0.488780060323812,"Pp3c20_5060V3",1
"GO:0009167","GO:0009167","purine ribonucleoside monophosphate metabolic process","1/52","87/9629",0.377010858456188,0.53676122220881,0.488780060323812,"Pp3c20_5060V3",1
"GO:0032940","GO:0032940","secretion by cell","1/52","87/9629",0.377010858456188,0.53676122220881,0.488780060323812,"Pp3c8_6510V3",1
"GO:0046903","GO:0046903","secretion","1/52","88/9629",0.380405894649888,0.539598110692845,0.491363358943359,"Pp3c8_6510V3",1
"GO:0048584","GO:0048584","positive regulation of response to stimulus","2/52","244/9629",0.381144697235422,0.539598110692845,0.491363358943359,"Pp3c7_10610V3/Pp3c7_10630V3",2
"GO:1902600","GO:1902600","proton transmembrane transport","1/52","90/9629",0.38714161916396,0.543869078377624,0.495252544220225,"Pp3c8_25010V3",1
"GO:0048878","GO:0048878","chemical homeostasis","2/52","248/9629",0.388880376788076,0.543869078377624,0.495252544220225,"Pp3c5_7110V3/Pp3c8_25010V3",2
"GO:0009141","GO:0009141","nucleoside triphosphate metabolic process","1/52","91/9629",0.390482497222821,0.543869078377624,0.495252544220225,"Pp3c20_5060V3",1
"GO:0009832","GO:0009832","plant-type cell wall biogenesis","1/52","91/9629",0.390482497222821,0.543869078377624,0.495252544220225,"Pp3c20_20860V3",1
"GO:0009932","GO:0009932","cell tip growth","1/52","91/9629",0.390482497222821,0.543869078377624,0.495252544220225,"Pp3c3_3840V3",1
"GO:0009152","GO:0009152","purine ribonucleotide biosynthetic process","1/52","92/9629",0.393805511496716,0.543869078377624,0.495252544220225,"Pp3c20_5060V3",1
"GO:0048638","GO:0048638","regulation of developmental growth","1/52","92/9629",0.393805511496716,0.543869078377624,0.495252544220225,"Pp3c8_6510V3",1
"GO:0051129","GO:0051129","negative regulation of cellular component organization","1/52","92/9629",0.393805511496716,0.543869078377624,0.495252544220225,"Pp3c9_903V3",1
"GO:0042742","GO:0042742","defense response to bacterium","2/52","251/9629",0.39465583636136,0.543869078377624,0.495252544220225,"Pp3c16_2800V3/Pp3c20_5060V3",2
"GO:1901135","GO:1901135","carbohydrate derivative metabolic process","3/52","419/9629",0.39575556545272,0.543869078377624,0.495252544220225,"Pp3c20_5060V3/Pp3c7_3610V3/Pp3c9_903V3",3
"GO:0019748","GO:0019748","secondary metabolic process","1/52","93/9629",0.397110755640804,0.543869078377624,0.495252544220225,"Pp3c7_3610V3",1
"GO:1905393","GO:1905393","plant organ formation","1/52","93/9629",0.397110755640804,0.543869078377624,0.495252544220225,"Pp3c8_1870V3",1
"GO:0034599","GO:0034599","cellular response to oxidative stress","1/52","95/9629",0.403668305756418,0.551351832252669,0.502066413663667,"Pp3c4_3890V3",1
"GO:0000271","GO:0000271","polysaccharide biosynthetic process","1/52","96/9629",0.406920796641741,0.554292112182263,0.504743861552771,"Pp3c1_12470V3",1
"GO:0006164","GO:0006164","purine nucleotide biosynthetic process","1/52","97/9629",0.41015588722966,0.55569507302083,0.506021411522727,"Pp3c20_5060V3",1
"GO:0072522","GO:0072522","purine-containing compound biosynthetic process","1/52","97/9629",0.41015588722966,0.55569507302083,0.506021411522727,"Pp3c20_5060V3",1
"GO:0045893","GO:0045893","positive regulation of transcription, DNA-templated","2/52","264/9629",0.419402962814218,0.564154305248746,0.513724471780396,"Pp3c22_18520V3/Pp3c8_1870V3",2
"GO:0071215","GO:0071215","cellular response to abscisic acid stimulus","1/52","100/9629",0.419757667595793,0.564154305248746,0.513724471780396,"Pp3c5_7110V3",1
"GO:0097306","GO:0097306","cellular response to alcohol","1/52","100/9629",0.419757667595793,0.564154305248746,0.513724471780396,"Pp3c5_7110V3",1
"GO:0006720","GO:0006720","isoprenoid metabolic process","1/52","101/9629",0.422924065044111,0.565394506053666,0.514853810859228,"Pp3c16_17210V3",1
"GO:0051338","GO:0051338","regulation of transferase activity","1/52","101/9629",0.422924065044111,0.565394506053666,0.514853810859228,"Pp3c4_1450V3",1
"GO:0006633","GO:0006633","fatty acid biosynthetic process","1/52","102/9629",0.426073513891477,0.566282397791826,0.515662333828814,"Pp3c7_3610V3",1
"GO:0016052","GO:0016052","carbohydrate catabolic process","1/52","102/9629",0.426073513891477,0.566282397791826,0.515662333828814,"Pp3c20_5060V3",1
"GO:0009161","GO:0009161","ribonucleoside monophosphate metabolic process","1/52","103/9629",0.429206103088249,0.566282397791826,0.515662333828814,"Pp3c20_5060V3",1
"GO:0043254","GO:0043254","regulation of protein-containing complex assembly","1/52","103/9629",0.429206103088249,0.566282397791826,0.515662333828814,"Pp3c22_18520V3",1
"GO:0045595","GO:0045595","regulation of cell differentiation","1/52","103/9629",0.429206103088249,0.566282397791826,0.515662333828814,"Pp3c9_903V3",1
"GO:0009553","GO:0009553","embryo sac development","1/52","104/9629",0.432321921127238,0.56890404242331,0.51804962927436,"Pp3c22_18520V3",1
"GO:0048868","GO:0048868","pollen tube development","1/52","106/9629",0.43850359542922,0.575377396505912,0.52394432931616,"Pp3c3_3840V3",1
"GO:0009260","GO:0009260","ribonucleotide biosynthetic process","1/52","107/9629",0.44156962641081,0.575377396505912,0.52394432931616,"Pp3c20_5060V3",1
"GO:0046390","GO:0046390","ribose phosphate biosynthetic process","1/52","107/9629",0.44156962641081,0.575377396505912,0.52394432931616,"Pp3c20_5060V3",1
"GO:0008610","GO:0008610","lipid biosynthetic process","2/52","276/9629",0.441807643745611,0.575377396505912,0.52394432931616,"Pp3c16_17210V3/Pp3c7_3610V3",2
"GO:0009723","GO:0009723","response to ethylene","1/52","108/9629",0.444619235676367,0.577546636033219,0.525919660214042,"Pp3c3_37540V3",1
"GO:0051173","GO:0051173","positive regulation of nitrogen compound metabolic process","3/52","456/9629",0.449734418603455,0.581197493828629,0.52924416731262,"Pp3c20_20860V3/Pp3c22_18520V3/Pp3c8_1870V3",3
"GO:0006470","GO:0006470","protein dephosphorylation","1/52","110/9629",0.450669533573304,0.581197493828629,0.52924416731262,"Pp3c2_32860V3",1
"GO:0034637","GO:0034637","cellular carbohydrate biosynthetic process","1/52","111/9629",0.453670393354183,0.581197493828629,0.52924416731262,"Pp3c21_5760V3",1
"GO:0009617","GO:0009617","response to bacterium","2/52","283/9629",0.454666725884576,0.581197493828629,0.52924416731262,"Pp3c16_2800V3/Pp3c20_5060V3",2
"GO:1902680","GO:1902680","positive regulation of RNA biosynthetic process","2/52","283/9629",0.454666725884576,0.581197493828629,0.52924416731262,"Pp3c22_18520V3/Pp3c8_1870V3",2
"GO:1903508","GO:1903508","positive regulation of nucleic acid-templated transcription","2/52","283/9629",0.454666725884576,0.581197493828629,0.52924416731262,"Pp3c22_18520V3/Pp3c8_1870V3",2
"GO:0050790","GO:0050790","regulation of catalytic activity","2/52","284/9629",0.456490562491189,0.581197493828629,0.52924416731262,"Pp3c4_1450V3/Pp3c4_3890V3",2
"GO:0009743","GO:0009743","response to carbohydrate","1/52","112/9629",0.456655173722494,0.581197493828629,0.52924416731262,"Pp3c20_5060V3",1
"GO:0022603","GO:0022603","regulation of anatomical structure morphogenesis","1/52","115/9629",0.465513880952421,0.589552326298746,0.536852160121665,"Pp3c8_6510V3",1
"GO:0048229","GO:0048229","gametophyte development","2/52","289/9629",0.465559178307343,0.589552326298746,0.536852160121665,"Pp3c22_18520V3/Pp3c3_3840V3",2
"GO:0046777","GO:0046777","protein autophosphorylation","1/52","116/9629",0.468435184104668,0.591707600974317,0.538814774487892,"Pp3c7_12190V3",1
"GO:0009123","GO:0009123","nucleoside monophosphate metabolic process","1/52","117/9629",0.471340825902897,0.593889440637651,0.540801579193851,"Pp3c20_5060V3",1
"GO:0051254","GO:0051254","positive regulation of RNA metabolic process","2/52","301/9629",0.486970117277914,0.612052217227103,0.557340782604464,"Pp3c22_18520V3/Pp3c8_1870V3",2
"GO:0071669","GO:0071669","plant-type cell wall organization or biogenesis","1/52","123/9629",0.488450368843184,0.612385537057126,0.557644306927541,"Pp3c20_20860V3",1
"GO:0048588","GO:0048588","developmental cell growth","1/52","124/9629",0.491248662638697,0.614365573126311,0.559447347291294,"Pp3c3_3840V3",1
"GO:0010016","GO:0010016","shoot system morphogenesis","1/52","126/9629",0.496800285669401,0.619770653409352,0.564369266680196,"Pp3c8_1870V3",1
"GO:0009150","GO:0009150","purine ribonucleotide metabolic process","1/52","127/9629",0.499553772478324,0.620135717559299,0.564701697693931,"Pp3c20_5060V3",1
"GO:0051640","GO:0051640","organelle localization","1/52","127/9629",0.499553772478324,0.620135717559299,0.564701697693931,"Pp3c7_12190V3",1
"GO:0007389","GO:0007389","pattern specification process","1/52","131/9629",0.51042070780581,0.632068886324639,0.575568158808569,"Pp3c22_23000V3",1
"GO:0044087","GO:0044087","regulation of cellular component biogenesis","1/52","132/9629",0.513101074535026,0.633830739131503,0.577172519342806,"Pp3c22_18520V3",1
"GO:0006163","GO:0006163","purine nucleotide metabolic process","1/52","133/9629",0.515767047381628,0.634016077756928,0.577341290522182,"Pp3c20_5060V3",1
"GO:0006631","GO:0006631","fatty acid metabolic process","1/52","133/9629",0.515767047381628,0.634016077756928,0.577341290522182,"Pp3c7_3610V3",1
"GO:0048507","GO:0048507","meristem development","1/52","135/9629",0.521056114192623,0.638959322513581,0.581842657927989,"Pp3c8_6510V3",1
"GO:0010628","GO:0010628","positive regulation of gene expression","2/52","325/9629",0.528214034973964,0.64616474181281,0.588403983772735,"Pp3c22_18520V3/Pp3c8_1870V3",2
"GO:0010557","GO:0010557","positive regulation of macromolecule biosynthetic process","2/52","326/9629",0.529885166692337,0.646639525455055,0.58883632643777,"Pp3c22_18520V3/Pp3c8_1870V3",2
"GO:0045935","GO:0045935","positive regulation of nucleobase-containing compound metabolic process","2/52","328/9629",0.533215820338985,0.648559521711656,0.590584693956311,"Pp3c22_18520V3/Pp3c8_1870V3",2
"GO:0071695","GO:0071695","anatomical structure maturation","1/52","140/9629",0.534032145853844,0.648559521711656,0.590584693956311,"Pp3c16_17210V3",1
"GO:0098656","GO:0098656","anion transmembrane transport","1/52","141/9629",0.536585663444275,0.650094169172872,0.591982159063016,"Pp3c22_21950V3",1
"GO:0009259","GO:0009259","ribonucleotide metabolic process","1/52","143/9629",0.541651593878696,0.654555446582608,0.596044642251497,"Pp3c20_5060V3",1
"GO:0019220","GO:0019220","regulation of phosphate metabolic process","1/52","144/9629",0.544164151028001,0.654555446582608,0.596044642251497,"Pp3c4_1450V3",1
"GO:0051174","GO:0051174","regulation of phosphorus metabolic process","1/52","144/9629",0.544164151028001,0.654555446582608,0.596044642251497,"Pp3c4_1450V3",1
"GO:0034655","GO:0034655","nucleobase-containing compound catabolic process","1/52","145/9629",0.546663198381353,0.655995838057624,0.597356276927995,"Pp3c20_5060V3",1
"GO:1901701","GO:1901701","cellular response to oxygen-containing compound","2/52","337/9629",0.548010774759373,0.656050903749939,0.597406420290253,"Pp3c5_7110V3/Pp3c7_3610V3",2
"GO:0097659","GO:0097659","nucleic acid-templated transcription","1/52","148/9629",0.554079992068885,0.66174482465099,0.602591360793299,"Pp3c22_18520V3",1
"GO:1901293","GO:1901293","nucleoside phosphate biosynthetic process","1/52","149/9629",0.556525708808935,0.662858746303282,0.603605708830892,"Pp3c20_5060V3",1
"GO:0034220","GO:0034220","ion transmembrane transport","2/52","343/9629",0.557697008076361,0.662858746303282,0.603605708830892,"Pp3c22_21950V3/Pp3c8_25010V3",2
"GO:0009611","GO:0009611","response to wounding","1/52","150/9629",0.558958268212093,0.662858746303282,0.603605708830892,"Pp3c22_21950V3",1
"GO:0031328","GO:0031328","positive regulation of cellular biosynthetic process","2/52","347/9629",0.564075107374296,0.663527288594062,0.604214490031351,"Pp3c22_18520V3/Pp3c8_1870V3",2
"GO:0009856","GO:0009856","pollination","1/52","154/9629",0.568558315135816,0.663527288594062,0.604214490031351,"Pp3c3_3840V3",1
"GO:0019693","GO:0019693","ribose phosphate metabolic process","1/52","154/9629",0.568558315135816,0.663527288594062,0.604214490031351,"Pp3c20_5060V3",1
"GO:0021700","GO:0021700","developmental maturation","1/52","154/9629",0.568558315135816,0.663527288594062,0.604214490031351,"Pp3c16_17210V3",1
"GO:0044706","GO:0044706","multi-multicellular organism process","1/52","154/9629",0.568558315135816,0.663527288594062,0.604214490031351,"Pp3c3_3840V3",1
"GO:0048609","GO:0048609","multicellular organismal reproductive process","1/52","154/9629",0.568558315135816,0.663527288594062,0.604214490031351,"Pp3c16_17210V3",1
"GO:0009165","GO:0009165","nucleotide biosynthetic process","1/52","156/9629",0.573281182084902,0.663527288594062,0.604214490031351,"Pp3c20_5060V3",1
"GO:0032774","GO:0032774","RNA biosynthetic process","1/52","156/9629",0.573281182084902,0.663527288594062,0.604214490031351,"Pp3c22_18520V3",1
"GO:0072521","GO:0072521","purine-containing compound metabolic process","1/52","157/9629",0.575623563435222,0.663527288594062,0.604214490031351,"Pp3c20_5060V3",1
"GO:0009737","GO:0009737","response to abscisic acid","2/52","355/9629",0.576639519114469,0.663527288594062,0.604214490031351,"Pp3c3_37540V3/Pp3c5_7110V3",2
"GO:0019725","GO:0019725","cellular homeostasis","1/52","158/9629",0.577953332723796,0.663527288594062,0.604214490031351,"Pp3c4_3890V3",1
"GO:0048646","GO:0048646","anatomical structure formation involved in morphogenesis","1/52","158/9629",0.577953332723796,0.663527288594062,0.604214490031351,"Pp3c8_1870V3",1
"GO:0050832","GO:0050832","defense response to fungus","1/52","158/9629",0.577953332723796,0.663527288594062,0.604214490031351,"Pp3c21_15570V3",1
"GO:0071396","GO:0071396","cellular response to lipid","1/52","158/9629",0.577953332723796,0.663527288594062,0.604214490031351,"Pp3c5_7110V3",1
"GO:0040008","GO:0040008","regulation of growth","1/52","162/9629",0.587147615753873,0.672550905318072,0.612431484374853,"Pp3c8_6510V3",1
"GO:0005976","GO:0005976","polysaccharide metabolic process","1/52","166/9629",0.596145370802832,0.681308995203237,0.620406687361344,"Pp3c1_12470V3",1
"GO:0032504","GO:0032504","multicellular organism reproduction","1/52","168/9629",0.600571841209737,0.684814950157709,0.623599244504514,"Pp3c16_17210V3",1
"GO:0034654","GO:0034654","nucleobase-containing compound biosynthetic process","2/52","375/9629",0.606923096713852,0.689166042310649,0.627561391911953,"Pp3c20_5060V3/Pp3c22_18520V3",2
"GO:1901605","GO:1901605","alpha-amino acid metabolic process","1/52","171/9629",0.607122465845096,0.689166042310649,0.627561391911953,"Pp3c16_2800V3",1
"GO:0048831","GO:0048831","regulation of shoot system development","1/52","172/9629",0.609282503038589,0.690063778722357,0.62837887953832,"Pp3c3_37540V3",1
"GO:0006820","GO:0006820","anion transport","1/52","173/9629",0.611430891517175,0.690944325840037,0.629180714424094,"Pp3c22_21950V3",1
"GO:0098662","GO:0098662","inorganic cation transmembrane transport","1/52","174/9629",0.61356769287516,0.691807868476691,0.629967064861815,"Pp3c8_25010V3",1
"GO:0043085","GO:0043085","positive regulation of catalytic activity","1/52","180/9629",0.626148580754702,0.703472175414951,0.64058869774628,"Pp3c4_3890V3",1
"GO:0016311","GO:0016311","dephosphorylation","1/52","181/9629",0.62820597029865,0.703472175414951,0.64058869774628,"Pp3c21_5760V3",1
"GO:0019637","GO:0019637","organophosphate metabolic process","2/52","392/9629",0.631391874902349,0.703472175414951,0.64058869774628,"Pp3c20_5060V3/Pp3c21_5760V3",2
"GO:0098542","GO:0098542","defense response to other organism","2/52","392/9629",0.631391874902349,0.703472175414951,0.64058869774628,"Pp3c16_2800V3/Pp3c20_5060V3",2
"GO:0006605","GO:0006605","protein targeting","1/52","183/9629",0.632287490997962,0.703472175414951,0.64058869774628,"Pp3c7_15240V3",1
"GO:0044270","GO:0044270","cellular nitrogen compound catabolic process","1/52","183/9629",0.632287490997962,0.703472175414951,0.64058869774628,"Pp3c20_5060V3",1
"GO:0000904","GO:0000904","cell morphogenesis involved in differentiation","1/52","185/9629",0.636325057516814,0.705577258870149,0.64250560749245,"Pp3c3_3840V3",1
"GO:0051128","GO:0051128","regulation of cellular component organization","2/52","396/9629",0.636979469813329,0.705577258870149,0.64250560749245,"Pp3c22_18520V3/Pp3c9_903V3",2
"GO:0015833","GO:0015833","peptide transport","2/52","399/9629",0.641127846306692,0.707033416269126,0.643831598774727,"Pp3c7_15240V3/Pp3c8_6510V3",2
"GO:0019439","GO:0019439","aromatic compound catabolic process","1/52","188/9629",0.64230000724693,0.707033416269126,0.643831598774727,"Pp3c20_5060V3",1
"GO:0044255","GO:0044255","cellular lipid metabolic process","2/52","400/9629",0.64250258859377,0.707033416269126,0.643831598774727,"Pp3c16_17210V3/Pp3c7_3610V3",2
"GO:0045184","GO:0045184","establishment of protein localization","2/52","402/9629",0.645240012144971,0.707103981426029,0.643895856102232,"Pp3c7_15240V3/Pp3c8_6510V3",2
"GO:0042886","GO:0042886","amide transport","2/52","404/9629",0.647961370869717,0.707103981426029,0.643895856102232,"Pp3c7_15240V3/Pp3c8_6510V3",2
"GO:0009451","GO:0009451","RNA modification","1/52","191/9629",0.648178649640526,0.707103981426029,0.643895856102232,"Pp3c12_8330V3",1
"GO:0051049","GO:0051049","regulation of transport","1/52","191/9629",0.648178649640526,0.707103981426029,0.643895856102232,"Pp3c7_12190V3",1
"GO:0006351","GO:0006351","transcription, DNA-templated","1/52","192/9629",0.65011705928438,0.70768682047371,0.644426595084665,"Pp3c22_18520V3",1
"GO:0044093","GO:0044093","positive regulation of molecular function","1/52","196/9629",0.657766494816736,0.713444531068085,0.649669623111289,"Pp3c4_3890V3",1
"GO:0032259","GO:0032259","methylation","1/52","197/9629",0.659653078328825,0.713444531068085,0.649669623111289,"Pp3c8_2950V3",1
"GO:0098660","GO:0098660","inorganic ion transmembrane transport","1/52","197/9629",0.659653078328825,0.713444531068085,0.649669623111289,"Pp3c8_25010V3",1
"GO:0014070","GO:0014070","response to organic cyclic compound","1/52","198/9629",0.66152946084864,0.713941859245642,0.650122495052422,"Pp3c3_37540V3",1
"GO:0006811","GO:0006811","ion transport","2/52","422/9629",0.671734607529968,0.723406500416889,0.658741090605187,"Pp3c22_21950V3/Pp3c8_25010V3",2
"GO:0048316","GO:0048316","seed development","2/52","432/9629",0.684387799520486,0.735461515902612,0.669718506544567,"Pp3c16_17210V3/Pp3c20_5060V3",2
"GO:0033993","GO:0033993","response to lipid","2/52","437/9629",0.69056771174761,0.740523673874032,0.674328157495986,"Pp3c3_37540V3/Pp3c5_7110V3",2
"GO:0098655","GO:0098655","cation transmembrane transport","1/52","216/9629",0.693620290639711,0.742217890620838,0.675870927967179,"Pp3c8_25010V3",1
"GO:0015031","GO:0015031","protein transport","2/52","442/9629",0.696650647589911,0.743881199968889,0.677385553856381,"Pp3c7_15240V3/Pp3c8_6510V3",2
"GO:0044262","GO:0044262","cellular carbohydrate metabolic process","1/52","219/9629",0.698670403182118,0.744460641022806,0.677913198592196,"Pp3c21_5760V3",1
"GO:0032879","GO:0032879","regulation of localization","1/52","221/9629",0.701991693933777,0.745029369197676,0.678431088074743,"Pp3c7_12190V3",1
"GO:0010154","GO:0010154","fruit development","2/52","447/9629",0.702637262979336,0.745029369197676,0.678431088074743,"Pp3c16_17210V3/Pp3c20_5060V3",2
"GO:0006753","GO:0006753","nucleoside phosphate metabolic process","1/52","222/9629",0.703638848686694,0.745029369197676,0.678431088074743,"Pp3c20_5060V3",1
"GO:0009555","GO:0009555","pollen development","1/52","224/9629",0.706906415540493,0.74550640679808,0.678865483216297,"Pp3c3_3840V3",1
"GO:0009117","GO:0009117","nucleotide metabolic process","1/52","225/9629",0.708526922333889,0.74550640679808,0.678865483216297,"Pp3c20_5060V3",1
"GO:0072594","GO:0072594","establishment of protein localization to organelle","1/52","225/9629",0.708526922333889,0.74550640679808,0.678865483216297,"Pp3c7_15240V3",1
"GO:0009735","GO:0009735","response to cytokinin","1/52","227/9629",0.711741617537646,0.747328698414528,0.680524879926345,"Pp3c7_12190V3",1
"GO:1901698","GO:1901698","response to nitrogen compound","1/52","229/9629",0.714921531892467,0.749106968968407,0.68214419062286,"Pp3c22_21950V3",1
"GO:0006520","GO:0006520","cellular amino acid metabolic process","1/52","235/9629",0.724256260768029,0.757313600471134,0.689617230170039,"Pp3c16_2800V3",1
"GO:0008104","GO:0008104","protein localization","2/52","468/9629",0.72674536669059,0.758342991329311,0.690554603633208,"Pp3c7_15240V3/Pp3c8_6510V3",2
"GO:0030154","GO:0030154","cell differentiation","2/52","471/9629",0.730054938876651,0.758922340212479,0.691082164437428,"Pp3c3_3840V3/Pp3c9_903V3",2
"GO:0090305","GO:0090305","nucleic acid phosphodiester bond hydrolysis","1/52","239/9629",0.730312172625103,0.758922340212479,0.691082164437428,"Pp3c12_8330V3",1
"GO:0010604","GO:0010604","positive regulation of macromolecule metabolic process","2/52","483/9629",0.742964192074471,0.770481384373525,0.701607943999284,"Pp3c22_18520V3/Pp3c8_1870V3",2
"GO:0006952","GO:0006952","defense response","2/52","485/9629",0.74506509775223,0.771073530322637,0.702147157937906,"Pp3c16_2800V3/Pp3c20_5060V3",2
"GO:0006629","GO:0006629","lipid metabolic process","2/52","487/9629",0.747151686115563,0.771648462709516,0.702670697037069,"Pp3c16_17210V3/Pp3c7_3610V3",2
"GO:0090407","GO:0090407","organophosphate biosynthetic process","1/52","256/9629",0.754626876895695,0.777774940604152,0.708249528202611,"Pp3c20_5060V3",1
"GO:0006812","GO:0006812","cation transport","1/52","264/9629",0.76531200397759,0.787178061234092,0.716812102543994,"Pp3c8_25010V3",1
"GO:0035556","GO:0035556","intracellular signal transduction","1/52","266/9629",0.76791115881567,0.788242818825047,0.717781681302674,"Pp3c7_12190V3",1
"GO:0033365","GO:0033365","protein localization to organelle","1/52","268/9629",0.770482075725435,0.789274321474836,0.718720977784103,"Pp3c7_15240V3",1
"GO:0080134","GO:0080134","regulation of response to stress","1/52","280/9629",0.785331209240732,0.802853812286672,0.731086595983686,"Pp3c9_903V3",1
"GO:0048468","GO:0048468","cell development","1/52","300/9629",0.8080125245331,0.824369053369803,0.750678586610764,"Pp3c3_3840V3",1
"GO:0055086","GO:0055086","nucleobase-containing small molecule metabolic process","1/52","302/9629",0.81014695634663,0.824876901007478,0.751141037675983,"Pp3c20_5060V3",1
"GO:0009966","GO:0009966","regulation of signal transduction","1/52","306/9629",0.814346233996733,0.827480850674099,0.753512219912087,"Pp3c20_20860V3",1
"GO:0023051","GO:0023051","regulation of signaling","1/52","317/9629",0.825430146455389,0.837055923166029,0.762231375314095,"Pp3c20_20860V3",1
"GO:0010646","GO:0010646","regulation of cell communication","1/52","319/9629",0.827374470232734,0.837342837343971,0.762492642192923,"Pp3c20_20860V3",1
"GO:1901565","GO:1901565","organonitrogen compound catabolic process","1/52","406/9629",0.894198746621392,0.903158653902167,0.822425173561706,"Pp3c16_2800V3",1
"GO:0034613","GO:0034613","cellular protein localization","1/52","421/9629",0.902808111451317,0.910030576342927,0.828682813879524,"Pp3c7_15240V3",1
"GO:0009888","GO:0009888","tissue development","1/52","434/9629",0.909710912784495,0.915158283519731,0.833352154583548,"Pp3c8_6510V3",1
"GO:0006886","GO:0006886","intracellular protein transport","1/52","447/9629",0.916132226973415,0.919782156164545,0.837562698595951,"Pp3c7_15240V3",1
"GO:0070727","GO:0070727","cellular macromolecule localization","1/52","455/9629",0.919858867184044,0.921687612446835,0.839297825870551,"Pp3c7_15240V3",1
"GO:0048367","GO:0048367","shoot system development","1/52","467/9629",0.925146237206817,0.925146237206817,0.842447283672039,"Pp3c8_1870V3",1
