"","ID","Description","GeneRatio","BgRatio","pvalue","p.adjust","qvalue","geneID","Count"
"GO:0009641","GO:0009641","shade avoidance","2/33","24/9629",0.00299891555738774,0.272843997910469,0.246307816202604,"Pp3c1_950V3/Pp3c4_7080V3",2
"GO:0010223","GO:0010223","secondary shoot formation","2/33","26/9629",0.00351625208863049,0.272843997910469,0.246307816202604,"Pp3c1_950V3/Pp3c4_7080V3",2
"GO:0010346","GO:0010346","shoot axis formation","2/33","26/9629",0.00351625208863049,0.272843997910469,0.246307816202604,"Pp3c1_950V3/Pp3c4_7080V3",2
"GO:1905393","GO:1905393","plant organ formation","3/33","93/9629",0.0038585472086856,0.272843997910469,0.246307816202604,"Pp3c1_950V3/Pp3c10_19020V3/Pp3c4_7080V3",3
"GO:0010675","GO:0010675","regulation of cellular carbohydrate metabolic process","2/33","30/9629",0.00466628294891706,0.272843997910469,0.246307816202604,"Pp3c12_8390V3/Pp3c9_2771V3",2
"GO:0001763","GO:0001763","morphogenesis of a branching structure","2/33","32/9629",0.00529794170699941,0.272843997910469,0.246307816202604,"Pp3c1_950V3/Pp3c4_7080V3",2
"GO:0045893","GO:0045893","positive regulation of transcription, DNA-templated","4/33","264/9629",0.0120960380930425,0.274413355152223,0.247724541356972,"Pp3c1_950V3/Pp3c10_19020V3/Pp3c4_7080V3/Pp3c9_2771V3",4
"GO:0006109","GO:0006109","regulation of carbohydrate metabolic process","2/33","52/9629",0.0135720867102552,0.274413355152223,0.247724541356972,"Pp3c12_8390V3/Pp3c9_2771V3",2
"GO:1902680","GO:1902680","positive regulation of RNA biosynthetic process","4/33","283/9629",0.0152850600255012,0.274413355152223,0.247724541356972,"Pp3c1_950V3/Pp3c10_19020V3/Pp3c4_7080V3/Pp3c9_2771V3",4
"GO:1903508","GO:1903508","positive regulation of nucleic acid-templated transcription","4/33","283/9629",0.0152850600255012,0.274413355152223,0.247724541356972,"Pp3c1_950V3/Pp3c10_19020V3/Pp3c4_7080V3/Pp3c9_2771V3",4
"GO:0009664","GO:0009664","plant-type cell wall organization","2/33","56/9629",0.0156288963180836,0.274413355152223,0.247724541356972,"Pp3c14_18440V3/Pp3c4_19720V3",2
"GO:0048646","GO:0048646","anatomical structure formation involved in morphogenesis","3/33","158/9629",0.0164964356036323,0.274413355152223,0.247724541356972,"Pp3c1_950V3/Pp3c10_19020V3/Pp3c4_7080V3",3
"GO:0051254","GO:0051254","positive regulation of RNA metabolic process","4/33","301/9629",0.0187595594521748,0.274413355152223,0.247724541356972,"Pp3c1_950V3/Pp3c10_19020V3/Pp3c4_7080V3/Pp3c9_2771V3",4
"GO:0051345","GO:0051345","positive regulation of hydrolase activity","2/33","62/9629",0.0189479186216568,0.274413355152223,0.247724541356972,"Pp3c19_14290V3/Pp3c26_11770V3",2
"GO:0009826","GO:0009826","unidimensional cell growth","3/33","176/9629",0.021916298404214,0.274413355152223,0.247724541356972,"Pp3c19_3030V3/Pp3c3_3840V3/Pp3c4_19720V3",3
"GO:0010628","GO:0010628","positive regulation of gene expression","4/33","325/9629",0.0241099597701668,0.274413355152223,0.247724541356972,"Pp3c1_950V3/Pp3c10_19020V3/Pp3c4_7080V3/Pp3c9_2771V3",4
"GO:0010557","GO:0010557","positive regulation of macromolecule biosynthetic process","4/33","326/9629",0.0243511630778149,0.274413355152223,0.247724541356972,"Pp3c1_950V3/Pp3c10_19020V3/Pp3c4_7080V3/Pp3c9_2771V3",4
"GO:0009860","GO:0009860","pollen tube growth","2/33","71/9629",0.0244288364924697,0.274413355152223,0.247724541356972,"Pp3c19_3030V3/Pp3c3_3840V3",2
"GO:0045935","GO:0045935","positive regulation of nucleobase-containing compound metabolic process","4/33","328/9629",0.0248380159682265,0.274413355152223,0.247724541356972,"Pp3c1_950V3/Pp3c10_19020V3/Pp3c4_7080V3/Pp3c9_2771V3",4
"GO:0010817","GO:0010817","regulation of hormone levels","3/33","188/9629",0.0260117548213221,0.274413355152223,0.247724541356972,"Pp3c19_3030V3/Pp3c21_900V3/Pp3c26_11770V3",3
"GO:0031328","GO:0031328","positive regulation of cellular biosynthetic process","4/33","347/9629",0.0297616208494761,0.274413355152223,0.247724541356972,"Pp3c1_950V3/Pp3c10_19020V3/Pp3c4_7080V3/Pp3c9_2771V3",4
"GO:0009639","GO:0009639","response to red or far red light","3/33","206/9629",0.0328791597848675,0.274413355152223,0.247724541356972,"Pp3c1_950V3/Pp3c3_3840V3/Pp3c4_7080V3",3
"GO:0009313","GO:0009313","oligosaccharide catabolic process","1/33","10/9629",0.0337632720985419,0.274413355152223,0.247724541356972,"Pp3c16_7830V3",1
"GO:0010970","GO:0010970","transport along microtubule","1/33","11/9629",0.0370781501545507,0.274413355152223,0.247724541356972,"Pp3c26_11770V3",1
"GO:0032781","GO:0032781","positive regulation of ATP-dependent activity","1/33","11/9629",0.0370781501545507,0.274413355152223,0.247724541356972,"Pp3c26_11770V3",1
"GO:0034059","GO:0034059","response to anoxia","1/33","11/9629",0.0370781501545507,0.274413355152223,0.247724541356972,"Pp3c3_15510V3",1
"GO:0043462","GO:0043462","regulation of ATP-dependent activity","1/33","11/9629",0.0370781501545507,0.274413355152223,0.247724541356972,"Pp3c26_11770V3",1
"GO:0009891","GO:0009891","positive regulation of biosynthetic process","4/33","374/9629",0.0377030699311027,0.274413355152223,0.247724541356972,"Pp3c1_950V3/Pp3c10_19020V3/Pp3c4_7080V3/Pp3c9_2771V3",4
"GO:0009932","GO:0009932","cell tip growth","2/33","91/9629",0.0385883137435243,0.274413355152223,0.247724541356972,"Pp3c19_3030V3/Pp3c3_3840V3",2
"GO:0071554","GO:0071554","cell wall organization or biogenesis","3/33","220/9629",0.0388172974633737,0.274413355152223,0.247724541356972,"Pp3c1_13060V3/Pp3c18_3000V3/Pp3c4_19720V3",3
"GO:0047484","GO:0047484","regulation of response to osmotic stress","1/33","12/9629",0.0403819992962534,0.274413355152223,0.247724541356972,"Pp3c7_10130V3",1
"GO:0099111","GO:0099111","microtubule-based transport","1/33","12/9629",0.0403819992962534,0.274413355152223,0.247724541356972,"Pp3c26_11770V3",1
"GO:0060560","GO:0060560","developmental growth involved in morphogenesis","3/33","224/9629",0.0406088722852172,0.274413355152223,0.247724541356972,"Pp3c19_3030V3/Pp3c3_3840V3/Pp3c4_19720V3",3
"GO:0002791","GO:0002791","regulation of peptide secretion","1/33","13/9629",0.0436748550748978,0.274413355152223,0.247724541356972,"Pp3c26_11770V3",1
"GO:0042136","GO:0042136","neurotransmitter biosynthetic process","1/33","13/9629",0.0436748550748978,0.274413355152223,0.247724541356972,"Pp3c26_11770V3",1
"GO:0048445","GO:0048445","carpel morphogenesis","1/33","13/9629",0.0436748550748978,0.274413355152223,0.247724541356972,"Pp3c10_19020V3",1
"GO:0050708","GO:0050708","regulation of protein secretion","1/33","13/9629",0.0436748550748978,0.274413355152223,0.247724541356972,"Pp3c26_11770V3",1
"GO:0071326","GO:0071326","cellular response to monosaccharide stimulus","1/33","13/9629",0.0436748550748978,0.274413355152223,0.247724541356972,"Pp3c9_2771V3",1
"GO:0071331","GO:0071331","cellular response to hexose stimulus","1/33","13/9629",0.0436748550748978,0.274413355152223,0.247724541356972,"Pp3c9_2771V3",1
"GO:0071333","GO:0071333","cellular response to glucose stimulus","1/33","13/9629",0.0436748550748978,0.274413355152223,0.247724541356972,"Pp3c9_2771V3",1
"GO:2000904","GO:2000904","regulation of starch metabolic process","1/33","13/9629",0.0436748550748978,0.274413355152223,0.247724541356972,"Pp3c9_2771V3",1
"GO:0046500","GO:0046500","S-adenosylmethionine metabolic process","1/33","14/9629",0.0469567529308181,0.274413355152223,0.247724541356972,"Pp3c11_2820V3",1
"GO:0016052","GO:0016052","carbohydrate catabolic process","2/33","102/9629",0.0474264540120143,0.274413355152223,0.247724541356972,"Pp3c1_13060V3/Pp3c16_7830V3",2
"GO:0051336","GO:0051336","regulation of hydrolase activity","2/33","103/9629",0.048263851594972,0.274413355152223,0.247724541356972,"Pp3c19_14290V3/Pp3c26_11770V3",2
"GO:0005991","GO:0005991","trehalose metabolic process","1/33","15/9629",0.0502277281937702,0.274413355152223,0.247724541356972,"Pp3c16_7830V3",1
"GO:0008608","GO:0008608","attachment of spindle microtubules to kinetochore","1/33","15/9629",0.0502277281937702,0.274413355152223,0.247724541356972,"Pp3c9_22120V3",1
"GO:0009809","GO:0009809","lignin biosynthetic process","1/33","15/9629",0.0502277281937702,0.274413355152223,0.247724541356972,"Pp3c19_3030V3",1
"GO:2001057","GO:2001057","reactive nitrogen species metabolic process","1/33","15/9629",0.0502277281937702,0.274413355152223,0.247724541356972,"Pp3c26_11770V3",1
"GO:0048868","GO:0048868","pollen tube development","2/33","106/9629",0.0508086136080966,0.274413355152223,0.247724541356972,"Pp3c19_3030V3/Pp3c3_3840V3",2
"GO:0010962","GO:0010962","regulation of glucan biosynthetic process","1/33","16/9629",0.0534878160832648,0.274413355152223,0.247724541356972,"Pp3c9_2771V3",1
"GO:0032881","GO:0032881","regulation of polysaccharide metabolic process","1/33","16/9629",0.0534878160832648,0.274413355152223,0.247724541356972,"Pp3c9_2771V3",1
"GO:0032885","GO:0032885","regulation of polysaccharide biosynthetic process","1/33","16/9629",0.0534878160832648,0.274413355152223,0.247724541356972,"Pp3c9_2771V3",1
"GO:0007283","GO:0007283","spermatogenesis","1/33","17/9629",0.0567370517089028,0.274413355152223,0.247724541356972,"Pp3c26_11770V3",1
"GO:0042631","GO:0042631","cellular response to water deprivation","1/33","17/9629",0.0567370517089028,0.274413355152223,0.247724541356972,"Pp3c17_930V3",1
"GO:0048354","GO:0048354","mucilage biosynthetic process involved in seed coat development","1/33","17/9629",0.0567370517089028,0.274413355152223,0.247724541356972,"Pp3c4_19720V3",1
"GO:0071462","GO:0071462","cellular response to water stimulus","1/33","17/9629",0.0567370517089028,0.274413355152223,0.247724541356972,"Pp3c17_930V3",1
"GO:0016049","GO:0016049","cell growth","3/33","257/9629",0.056964148977545,0.274413355152223,0.247724541356972,"Pp3c19_3030V3/Pp3c3_3840V3/Pp3c4_19720V3",3
"GO:0055082","GO:0055082","cellular chemical homeostasis","2/33","115/9629",0.0587257245349474,0.274413355152223,0.247724541356972,"Pp3c7_10130V3/Pp3c9_2771V3",2
"GO:0030705","GO:0030705","cytoskeleton-dependent intracellular transport","1/33","18/9629",0.059975470070701,0.274413355152223,0.247724541356972,"Pp3c26_11770V3",1
"GO:0042593","GO:0042593","glucose homeostasis","1/33","18/9629",0.059975470070701,0.274413355152223,0.247724541356972,"Pp3c9_2771V3",1
"GO:1903409","GO:1903409","reactive oxygen species biosynthetic process","1/33","18/9629",0.059975470070701,0.274413355152223,0.247724541356972,"Pp3c26_11770V3",1
"GO:0001678","GO:0001678","cellular glucose homeostasis","1/33","19/9629",0.0632031060594296,0.274413355152223,0.247724541356972,"Pp3c9_2771V3",1
"GO:0031338","GO:0031338","regulation of vesicle fusion","1/33","19/9629",0.0632031060594296,0.274413355152223,0.247724541356972,"Pp3c19_14290V3",1
"GO:0051046","GO:0051046","regulation of secretion","1/33","19/9629",0.0632031060594296,0.274413355152223,0.247724541356972,"Pp3c26_11770V3",1
"GO:1903530","GO:1903530","regulation of secretion by cell","1/33","19/9629",0.0632031060594296,0.274413355152223,0.247724541356972,"Pp3c26_11770V3",1
"GO:0048589","GO:0048589","developmental growth","3/33","273/9629",0.0658743406125902,0.274413355152223,0.247724541356972,"Pp3c19_3030V3/Pp3c3_3840V3/Pp3c4_19720V3",3
"GO:0071669","GO:0071669","plant-type cell wall organization or biogenesis","2/33","123/9629",0.0660998787305883,0.274413355152223,0.247724541356972,"Pp3c18_3000V3/Pp3c4_19720V3",2
"GO:0009808","GO:0009808","lignin metabolic process","1/33","20/9629",0.0664199944569359,0.274413355152223,0.247724541356972,"Pp3c19_3030V3",1
"GO:0033500","GO:0033500","carbohydrate homeostasis","1/33","20/9629",0.0664199944569359,0.274413355152223,0.247724541356972,"Pp3c9_2771V3",1
"GO:0045491","GO:0045491","xylan metabolic process","1/33","20/9629",0.0664199944569359,0.274413355152223,0.247724541356972,"Pp3c1_13060V3",1
"GO:0048449","GO:0048449","floral organ formation","1/33","20/9629",0.0664199944569359,0.274413355152223,0.247724541356972,"Pp3c10_19020V3",1
"GO:0048588","GO:0048588","developmental cell growth","2/33","124/9629",0.067042804640768,0.274413355152223,0.247724541356972,"Pp3c19_3030V3/Pp3c3_3840V3",2
"GO:0051173","GO:0051173","positive regulation of nitrogen compound metabolic process","4/33","456/9629",0.0687434072579984,0.274413355152223,0.247724541356972,"Pp3c1_950V3/Pp3c10_19020V3/Pp3c4_7080V3/Pp3c9_2771V3",4
"GO:0000902","GO:0000902","cell morphogenesis","3/33","278/9629",0.0687851545028362,0.274413355152223,0.247724541356972,"Pp3c19_3030V3/Pp3c3_3840V3/Pp3c4_19720V3",3
"GO:0010016","GO:0010016","shoot system morphogenesis","2/33","126/9629",0.0689423136145343,0.274413355152223,0.247724541356972,"Pp3c1_950V3/Pp3c4_7080V3",2
"GO:0010192","GO:0010192","mucilage biosynthetic process","1/33","21/9629",0.0696261699364777,0.274413355152223,0.247724541356972,"Pp3c4_19720V3",1
"GO:0030244","GO:0030244","cellulose biosynthetic process","1/33","21/9629",0.0696261699364777,0.274413355152223,0.247724541356972,"Pp3c15_7150V3",1
"GO:0090630","GO:0090630","activation of GTPase activity","1/33","21/9629",0.0696261699364777,0.274413355152223,0.247724541356972,"Pp3c19_14290V3",1
"GO:0050790","GO:0050790","regulation of catalytic activity","3/33","284/9629",0.0723558206852993,0.274413355152223,0.247724541356972,"Pp3c12_8390V3/Pp3c19_14290V3/Pp3c26_11770V3",3
"GO:0019747","GO:0019747","regulation of isoprenoid metabolic process","1/33","22/9629",0.0728216670630496,0.274413355152223,0.247724541356972,"Pp3c12_8390V3",1
"GO:0042133","GO:0042133","neurotransmitter metabolic process","1/33","22/9629",0.0728216670630496,0.274413355152223,0.247724541356972,"Pp3c26_11770V3",1
"GO:0048359","GO:0048359","mucilage metabolic process involved in seed coat development","1/33","22/9629",0.0728216670630496,0.274413355152223,0.247724541356972,"Pp3c4_19720V3",1
"GO:0060271","GO:0060271","cilium assembly","1/33","23/9629",0.0760065202937059,0.281877957472188,0.254463153568829,"Pp3c26_11770V3",1
"GO:0032989","GO:0032989","cellular component morphogenesis","3/33","291/9629",0.076627017565255,0.281877957472188,0.254463153568829,"Pp3c19_3030V3/Pp3c3_3840V3/Pp3c4_19720V3",3
"GO:0010604","GO:0010604","positive regulation of macromolecule metabolic process","4/33","483/9629",0.0812181740070357,0.289141245438086,0.261020030799158,"Pp3c1_950V3/Pp3c10_19020V3/Pp3c4_7080V3/Pp3c9_2771V3",4
"GO:0048468","GO:0048468","cell development","3/33","300/9629",0.0822819661254286,0.289141245438086,0.261020030799158,"Pp3c19_3030V3/Pp3c26_11770V3/Pp3c3_3840V3",3
"GO:0044782","GO:0044782","cilium organization","1/33","25/9629",0.082344432357772,0.289141245438086,0.261020030799158,"Pp3c26_11770V3",1
"GO:0051651","GO:0051651","maintenance of location in cell","1/33","25/9629",0.082344432357772,0.289141245438086,0.261020030799158,"Pp3c7_10130V3",1
"GO:0001505","GO:0001505","regulation of neurotransmitter levels","1/33","27/9629",0.0886401796387487,0.304331283426371,0.274732720517759,"Pp3c26_11770V3",1
"GO:0043255","GO:0043255","regulation of carbohydrate biosynthetic process","1/33","27/9629",0.0886401796387487,0.304331283426371,0.274732720517759,"Pp3c9_2771V3",1
"GO:0010191","GO:0010191","mucilage metabolic process","1/33","28/9629",0.0917723264906463,0.304920955759244,0.275265042671435,"Pp3c4_19720V3",1
"GO:0046890","GO:0046890","regulation of lipid biosynthetic process","1/33","28/9629",0.0917723264906463,0.304920955759244,0.275265042671435,"Pp3c12_8390V3",1
"GO:0120031","GO:0120031","plasma membrane bounded cell projection assembly","1/33","28/9629",0.0917723264906463,0.304920955759244,0.275265042671435,"Pp3c26_11770V3",1
"GO:0009856","GO:0009856","pollination","2/33","154/9629",0.0972795837878056,0.312202564236399,0.281838458602098,"Pp3c19_3030V3/Pp3c3_3840V3",2
"GO:0044706","GO:0044706","multi-multicellular organism process","2/33","154/9629",0.0972795837878056,0.312202564236399,0.281838458602098,"Pp3c19_3030V3/Pp3c3_3840V3",2
"GO:0030031","GO:0030031","cell projection assembly","1/33","30/9629",0.098005335698805,0.312202564236399,0.281838458602098,"Pp3c26_11770V3",1
"GO:0071281","GO:0071281","cellular response to iron ion","1/33","30/9629",0.098005335698805,0.312202564236399,0.281838458602098,"Pp3c19_3030V3",1
"GO:0051235","GO:0051235","maintenance of location","1/33","31/9629",0.101106265370848,0.315655182795535,0.284955283395731,"Pp3c7_10130V3",1
"GO:0019725","GO:0019725","cellular homeostasis","2/33","158/9629",0.101566731470791,0.315655182795535,0.284955283395731,"Pp3c7_10130V3/Pp3c9_2771V3",2
"GO:0006555","GO:0006555","methionine metabolic process","1/33","32/9629",0.104196856456779,0.315655182795535,0.284955283395731,"Pp3c19_3030V3",1
"GO:0030004","GO:0030004","cellular monovalent inorganic cation homeostasis","1/33","32/9629",0.104196856456779,0.315655182795535,0.284955283395731,"Pp3c7_10130V3",1
"GO:0051222","GO:0051222","positive regulation of protein transport","1/33","32/9629",0.104196856456779,0.315655182795535,0.284955283395731,"Pp3c26_11770V3",1
"GO:0009699","GO:0009699","phenylpropanoid biosynthetic process","1/33","33/9629",0.10727714235205,0.318666087022837,0.287673353980759,"Pp3c19_3030V3",1
"GO:0010214","GO:0010214","seed coat development","1/33","33/9629",0.10727714235205,0.318666087022837,0.287673353980759,"Pp3c4_19720V3",1
"GO:0040007","GO:0040007","growth","3/33","341/9629",0.110235000519691,0.318666087022837,0.287673353980759,"Pp3c19_3030V3/Pp3c3_3840V3/Pp3c4_19720V3",3
"GO:0071472","GO:0071472","cellular response to salt stress","1/33","34/9629",0.110347156347714,0.318666087022837,0.287673353980759,"Pp3c17_930V3",1
"GO:1904951","GO:1904951","positive regulation of establishment of protein localization","1/33","34/9629",0.110347156347714,0.318666087022837,0.287673353980759,"Pp3c26_11770V3",1
"GO:0006790","GO:0006790","sulfur compound metabolic process","2/33","174/9629",0.119224132985089,0.327804425467611,0.295922918579176,"Pp3c11_2820V3/Pp3c19_3030V3",2
"GO:0009749","GO:0009749","response to glucose","1/33","37/9629",0.119495898288098,0.327804425467611,0.295922918579176,"Pp3c9_2771V3",1
"GO:0035670","GO:0035670","plant-type ovary development","1/33","38/9629",0.122525155518758,0.327804425467611,0.295922918579176,"Pp3c10_19020V3",1
"GO:0008285","GO:0008285","negative regulation of cell population proliferation","1/33","39/9629",0.125544305750005,0.327804425467611,0.295922918579176,"Pp3c22_21500V3",1
"GO:0010565","GO:0010565","regulation of cellular ketone metabolic process","1/33","39/9629",0.125544305750005,0.327804425467611,0.295922918579176,"Pp3c12_8390V3",1
"GO:0048444","GO:0048444","floral organ morphogenesis","1/33","39/9629",0.125544305750005,0.327804425467611,0.295922918579176,"Pp3c10_19020V3",1
"GO:0065009","GO:0065009","regulation of molecular function","3/33","362/9629",0.125830849366446,0.327804425467611,0.295922918579176,"Pp3c12_8390V3/Pp3c19_14290V3/Pp3c26_11770V3",3
"GO:0043085","GO:0043085","positive regulation of catalytic activity","2/33","180/9629",0.126037128048143,0.327804425467611,0.295922918579176,"Pp3c19_14290V3/Pp3c26_11770V3",2
"GO:0010410","GO:0010410","hemicellulose metabolic process","1/33","40/9629",0.128553381653055,0.327804425467611,0.295922918579176,"Pp3c1_13060V3",1
"GO:0071368","GO:0071368","cellular response to cytokinin stimulus","1/33","41/9629",0.131552415796912,0.327804425467611,0.295922918579176,"Pp3c21_900V3",1
"GO:0000904","GO:0000904","cell morphogenesis involved in differentiation","2/33","185/9629",0.131786761177123,0.327804425467611,0.295922918579176,"Pp3c19_3030V3/Pp3c3_3840V3",2
"GO:0000096","GO:0000096","sulfur amino acid metabolic process","1/33","42/9629",0.134541440648675,0.327804425467611,0.295922918579176,"Pp3c19_3030V3",1
"GO:0005984","GO:0005984","disaccharide metabolic process","1/33","42/9629",0.134541440648675,0.327804425467611,0.295922918579176,"Pp3c16_7830V3",1
"GO:0009873","GO:0009873","ethylene-activated signaling pathway","1/33","42/9629",0.134541440648675,0.327804425467611,0.295922918579176,"Pp3c7_20170V3",1
"GO:0010039","GO:0010039","response to iron ion","1/33","42/9629",0.134541440648675,0.327804425467611,0.295922918579176,"Pp3c19_3030V3",1
"GO:0010224","GO:0010224","response to UV-B","1/33","42/9629",0.134541440648675,0.327804425467611,0.295922918579176,"Pp3c4_6840V3",1
"GO:0055067","GO:0055067","monovalent inorganic cation homeostasis","1/33","43/9629",0.137520488573844,0.327804425467611,0.295922918579176,"Pp3c7_10130V3",1
"GO:0120036","GO:0120036","plasma membrane bounded cell projection organization","1/33","43/9629",0.137520488573844,0.327804425467611,0.295922918579176,"Pp3c26_11770V3",1
"GO:0051049","GO:0051049","regulation of transport","2/33","191/9629",0.138767366022297,0.327804425467611,0.295922918579176,"Pp3c19_14290V3/Pp3c26_11770V3",2
"GO:0009736","GO:0009736","cytokinin-activated signaling pathway","1/33","44/9629",0.14048959183663,0.327804425467611,0.295922918579176,"Pp3c21_900V3",1
"GO:0043547","GO:0043547","positive regulation of GTPase activity","1/33","44/9629",0.14048959183663,0.327804425467611,0.295922918579176,"Pp3c19_14290V3",1
"GO:0009698","GO:0009698","phenylpropanoid metabolic process","1/33","45/9629",0.14344878260026,0.327804425467611,0.295922918579176,"Pp3c19_3030V3",1
"GO:0009746","GO:0009746","response to hexose","1/33","45/9629",0.14344878260026,0.327804425467611,0.295922918579176,"Pp3c9_2771V3",1
"GO:0010411","GO:0010411","xyloglucan metabolic process","1/33","45/9629",0.14344878260026,0.327804425467611,0.295922918579176,"Pp3c1_13060V3",1
"GO:0030030","GO:0030030","cell projection organization","1/33","45/9629",0.14344878260026,0.327804425467611,0.295922918579176,"Pp3c26_11770V3",1
"GO:0044275","GO:0044275","cellular carbohydrate catabolic process","1/33","45/9629",0.14344878260026,0.327804425467611,0.295922918579176,"Pp3c16_7830V3",1
"GO:0044093","GO:0044093","positive regulation of molecular function","2/33","196/9629",0.144647873745311,0.327804425467611,0.295922918579176,"Pp3c19_14290V3/Pp3c26_11770V3",2
"GO:0009066","GO:0009066","aspartate family amino acid metabolic process","1/33","46/9629",0.146398092927283,0.327804425467611,0.295922918579176,"Pp3c19_3030V3",1
"GO:0051225","GO:0051225","spindle assembly","1/33","46/9629",0.146398092927283,0.327804425467611,0.295922918579176,"Pp3c9_9870V3",1
"GO:0071248","GO:0071248","cellular response to metal ion","1/33","46/9629",0.146398092927283,0.327804425467611,0.295922918579176,"Pp3c19_3030V3",1
"GO:0071470","GO:0071470","cellular response to osmotic stress","1/33","46/9629",0.146398092927283,0.327804425467611,0.295922918579176,"Pp3c17_930V3",1
"GO:0034284","GO:0034284","response to monosaccharide","1/33","47/9629",0.149337554779876,0.32902492871486,0.297024718478753,"Pp3c9_2771V3",1
"GO:0043087","GO:0043087","regulation of GTPase activity","1/33","47/9629",0.149337554779876,0.32902492871486,0.297024718478753,"Pp3c19_14290V3",1
"GO:0000272","GO:0000272","polysaccharide catabolic process","1/33","48/9629",0.152267200020145,0.32902492871486,0.297024718478753,"Pp3c1_13060V3",1
"GO:0001666","GO:0001666","response to hypoxia","1/33","48/9629",0.152267200020145,0.32902492871486,0.297024718478753,"Pp3c3_15510V3",1
"GO:0048440","GO:0048440","carpel development","1/33","48/9629",0.152267200020145,0.32902492871486,0.297024718478753,"Pp3c10_19020V3",1
"GO:0010383","GO:0010383","cell wall polysaccharide metabolic process","1/33","49/9629",0.155187060410432,0.333005567130719,0.300618209128395,"Pp3c1_13060V3",1
"GO:0009846","GO:0009846","pollen germination","1/33","51/9629",0.160997553193395,0.34130551058048,0.308110919106889,"Pp3c3_3840V3",1
"GO:0019216","GO:0019216","regulation of lipid metabolic process","1/33","53/9629",0.16676928524361,0.34130551058048,0.308110919106889,"Pp3c12_8390V3",1
"GO:0071322","GO:0071322","cellular response to carbohydrate stimulus","1/33","53/9629",0.16676928524361,0.34130551058048,0.308110919106889,"Pp3c9_2771V3",1
"GO:0009414","GO:0009414","response to water deprivation","2/33","219/9629",0.172340762525844,0.34130551058048,0.308110919106889,"Pp3c17_930V3/Pp3c3_3840V3",2
"GO:0044262","GO:0044262","cellular carbohydrate metabolic process","2/33","219/9629",0.172340762525844,0.34130551058048,0.308110919106889,"Pp3c1_13060V3/Pp3c16_7830V3",2
"GO:0071241","GO:0071241","cellular response to inorganic substance","1/33","55/9629",0.172502507098896,0.34130551058048,0.308110919106889,"Pp3c19_3030V3",1
"GO:0009651","GO:0009651","response to salt stress","3/33","422/9629",0.174388818098824,0.34130551058048,0.308110919106889,"Pp3c17_930V3/Pp3c19_3030V3/Pp3c3_3840V3",3
"GO:0032879","GO:0032879","regulation of localization","2/33","221/9629",0.174792273492774,0.34130551058048,0.308110919106889,"Pp3c19_14290V3/Pp3c26_11770V3",2
"GO:0009311","GO:0009311","oligosaccharide metabolic process","1/33","56/9629",0.175354754567638,0.34130551058048,0.308110919106889,"Pp3c16_7830V3",1
"GO:0009415","GO:0009415","response to water","2/33","223/9629",0.177249845635808,0.34130551058048,0.308110919106889,"Pp3c17_930V3/Pp3c3_3840V3",2
"GO:0009914","GO:0009914","hormone transport","1/33","57/9629",0.17819746772958,0.34130551058048,0.308110919106889,"Pp3c21_900V3",1
"GO:0010051","GO:0010051","xylem and phloem pattern formation","1/33","57/9629",0.17819746772958,0.34130551058048,0.308110919106889,"Pp3c18_3000V3",1
"GO:0051050","GO:0051050","positive regulation of transport","1/33","57/9629",0.17819746772958,0.34130551058048,0.308110919106889,"Pp3c26_11770V3",1
"GO:0051223","GO:0051223","regulation of protein transport","1/33","57/9629",0.17819746772958,0.34130551058048,0.308110919106889,"Pp3c26_11770V3",1
"GO:0090087","GO:0090087","regulation of peptide transport","1/33","57/9629",0.17819746772958,0.34130551058048,0.308110919106889,"Pp3c26_11770V3",1
"GO:0036293","GO:0036293","response to decreased oxygen levels","1/33","58/9629",0.181030677462647,0.34130551058048,0.308110919106889,"Pp3c3_15510V3",1
"GO:0044550","GO:0044550","secondary metabolite biosynthetic process","1/33","58/9629",0.181030677462647,0.34130551058048,0.308110919106889,"Pp3c19_3030V3",1
"GO:0060627","GO:0060627","regulation of vesicle-mediated transport","1/33","58/9629",0.181030677462647,0.34130551058048,0.308110919106889,"Pp3c19_14290V3",1
"GO:0061077","GO:0061077","chaperone-mediated protein folding","1/33","58/9629",0.181030677462647,0.34130551058048,0.308110919106889,"Pp3c12_8390V3",1
"GO:0009735","GO:0009735","response to cytokinin","2/33","227/9629",0.182182418256269,0.34130551058048,0.308110919106889,"Pp3c19_3030V3/Pp3c21_900V3",2
"GO:0070201","GO:0070201","regulation of establishment of protein localization","1/33","59/9629",0.183854414547982,0.34130551058048,0.308110919106889,"Pp3c26_11770V3",1
"GO:0070482","GO:0070482","response to oxygen levels","1/33","59/9629",0.183854414547982,0.34130551058048,0.308110919106889,"Pp3c3_15510V3",1
"GO:0071229","GO:0071229","cellular response to acid chemical","2/33","229/9629",0.184657046512587,0.34130551058048,0.308110919106889,"Pp3c17_930V3/Pp3c9_2771V3",2
"GO:0042545","GO:0042545","cell wall modification","1/33","60/9629",0.18666870967023,0.34130551058048,0.308110919106889,"Pp3c5_12750V3",1
"GO:0044036","GO:0044036","cell wall macromolecule metabolic process","1/33","60/9629",0.18666870967023,0.34130551058048,0.308110919106889,"Pp3c1_13060V3",1
"GO:0048467","GO:0048467","gynoecium development","1/33","61/9629",0.18947359341784,0.344396119800662,0.310900942759924,"Pp3c10_19020V3",1
"GO:0062012","GO:0062012","regulation of small molecule metabolic process","1/33","64/9629",0.197832080860433,0.357486040853064,0.322717768101046,"Pp3c12_8390V3",1
"GO:0048232","GO:0048232","male gamete generation","1/33","66/9629",0.203357905434643,0.361164059407053,0.32603807100279,"Pp3c26_11770V3",1
"GO:0072593","GO:0072593","reactive oxygen species metabolic process","1/33","66/9629",0.203357905434643,0.361164059407053,0.32603807100279,"Pp3c26_11770V3",1
"GO:0048584","GO:0048584","positive regulation of response to stimulus","2/33","244/9629",0.203373936365137,0.361164059407053,0.32603807100279,"Pp3c26_11770V3/Pp3c7_10130V3",2
"GO:0042446","GO:0042446","hormone biosynthetic process","1/33","67/9629",0.206106957941248,0.363926000021974,0.328531391605598,"Pp3c19_3030V3",1
"GO:0048878","GO:0048878","chemical homeostasis","2/33","248/9629",0.208406178351858,0.364596974303087,0.329137108466422,"Pp3c7_10130V3/Pp3c9_2771V3",2
"GO:0032880","GO:0032880","regulation of protein localization","1/33","68/9629",0.208846810523128,0.364596974303087,0.329137108466422,"Pp3c26_11770V3",1
"GO:0048367","GO:0048367","shoot system development","3/33","467/9629",0.21389738330525,0.371316244052373,0.335202877444656,"Pp3c1_950V3/Pp3c10_19020V3/Pp3c4_7080V3",3
"GO:0006875","GO:0006875","cellular metal ion homeostasis","1/33","71/9629",0.217011466545392,0.373390596345311,0.337075482989295,"Pp3c7_10130V3",1
"GO:0030154","GO:0030154","cell differentiation","3/33","471/9629",0.217509085249696,0.373390596345311,0.337075482989295,"Pp3c19_3030V3/Pp3c26_11770V3/Pp3c3_3840V3",3
"GO:0022412","GO:0022412","cellular process involved in reproduction in multicellular organism","1/33","72/9629",0.219714816786447,0.375093250756973,0.338612541136426,"Pp3c26_11770V3",1
"GO:0043086","GO:0043086","negative regulation of catalytic activity","1/33","73/9629",0.222409115315907,0.377606684794589,0.340881524341905,"Pp3c26_11770V3",1
"GO:0006970","GO:0006970","response to osmotic stress","3/33","478/9629",0.223863200028071,0.377998518080186,0.341235248820471,"Pp3c17_930V3/Pp3c19_3030V3/Pp3c3_3840V3",3
"GO:0007018","GO:0007018","microtubule-based movement","1/33","74/9629",0.225094391497843,0.378011777026268,0.341247218231855,"Pp3c26_11770V3",1
"GO:0005975","GO:0005975","carbohydrate metabolic process","3/33","482/9629",0.227512505480171,0.380007374018232,0.343048728035535,"Pp3c1_13060V3/Pp3c16_7830V3/Pp3c8_20680V3",3
"GO:0007276","GO:0007276","gamete generation","1/33","77/9629",0.233096378217964,0.385169951173,0.347709204772083,"Pp3c26_11770V3",1
"GO:0009765","GO:0009765","photosynthesis, light harvesting","1/33","77/9629",0.233096378217964,0.385169951173,0.347709204772083,"Pp3c10_25410V3",1
"GO:0060341","GO:0060341","regulation of cellular localization","1/33","83/9629",0.248860671152742,0.409031635032965,0.369250155965715,"Pp3c26_11770V3",1
"GO:0009606","GO:0009606","tropism","1/33","84/9629",0.251457318738324,0.410994689192956,0.371022287978652,"Pp3c18_14150V3",1
"GO:0009411","GO:0009411","response to UV","1/33","85/9629",0.254045260957458,0.410994689192956,0.371022287978652,"Pp3c4_6840V3",1
"GO:0090697","GO:0090697","post-embryonic plant organ morphogenesis","1/33","85/9629",0.254045260957458,0.410994689192956,0.371022287978652,"Pp3c10_19020V3",1
"GO:0071555","GO:0071555","cell wall organization","1/33","88/9629",0.261757137732222,0.421265393537794,0.380294087165783,"Pp3c4_19720V3",1
"GO:0042445","GO:0042445","hormone metabolic process","1/33","90/9629",0.266855378111718,0.427245139049331,0.38569225633818,"Pp3c19_3030V3",1
"GO:0009832","GO:0009832","plant-type cell wall biogenesis","1/33","91/9629",0.26939167882692,0.428689368915429,0.386996023718578,"Pp3c18_3000V3",1
"GO:0009152","GO:0009152","purine ribonucleotide biosynthetic process","1/33","92/9629",0.271919470250563,0.428689368915429,0.386996023718578,"Pp3c4_29300V3",1
"GO:0044092","GO:0044092","negative regulation of molecular function","1/33","92/9629",0.271919470250563,0.428689368915429,0.386996023718578,"Pp3c26_11770V3",1
"GO:0019748","GO:0019748","secondary metabolic process","1/33","93/9629",0.274438780042084,0.430464888492405,0.388598860332098,"Pp3c19_3030V3",1
"GO:0030003","GO:0030003","cellular cation homeostasis","1/33","95/9629",0.279452064931684,0.434553732295734,0.3922900325613,"Pp3c7_10130V3",1
"GO:0046686","GO:0046686","response to cadmium ion","2/33","304/9629",0.279858228889486,0.434553732295734,0.3922900325613,"Pp3c1_13060V3/Pp3c19_3030V3",2
"GO:0006164","GO:0006164","purine nucleotide biosynthetic process","1/33","97/9629",0.284431753035648,0.435096097465422,0.392779648538024,"Pp3c4_29300V3",1
"GO:0045229","GO:0045229","external encapsulating structure organization","1/33","97/9629",0.284431753035648,0.435096097465422,0.392779648538024,"Pp3c4_19720V3",1
"GO:0072522","GO:0072522","purine-containing compound biosynthetic process","1/33","97/9629",0.284431753035648,0.435096097465422,0.392779648538024,"Pp3c4_29300V3",1
"GO:0071215","GO:0071215","cellular response to abscisic acid stimulus","1/33","100/9629",0.291838768069087,0.441436815235184,0.398503682634385,"Pp3c9_2771V3",1
"GO:0097306","GO:0097306","cellular response to alcohol","1/33","100/9629",0.291838768069087,0.441436815235184,0.398503682634385,"Pp3c9_2771V3",1
"GO:0006873","GO:0006873","cellular ion homeostasis","1/33","101/9629",0.294291210156789,0.441436815235184,0.398503682634385,"Pp3c7_10130V3",1
"GO:0051338","GO:0051338","regulation of transferase activity","1/33","101/9629",0.294291210156789,0.441436815235184,0.398503682634385,"Pp3c12_8390V3",1
"GO:0042592","GO:0042592","homeostatic process","2/33","325/9629",0.306767924934889,0.454426920645413,0.410230400173852,"Pp3c7_10130V3/Pp3c9_2771V3",2
"GO:0009260","GO:0009260","ribonucleotide biosynthetic process","1/33","107/9629",0.308833829564844,0.454426920645413,0.410230400173852,"Pp3c4_29300V3",1
"GO:0046390","GO:0046390","ribose phosphate biosynthetic process","1/33","107/9629",0.308833829564844,0.454426920645413,0.410230400173852,"Pp3c4_29300V3",1
"GO:0048438","GO:0048438","floral whorl development","1/33","107/9629",0.308833829564844,0.454426920645413,0.410230400173852,"Pp3c10_19020V3",1
"GO:0023056","GO:0023056","positive regulation of signaling","1/33","109/9629",0.31361647062022,0.459277201050465,0.414608953426582,"Pp3c26_11770V3",1
"GO:0006928","GO:0006928","movement of cell or subcellular component","1/33","110/9629",0.315995741257777,0.460578698342703,0.415783870076022,"Pp3c26_11770V3",1
"GO:0009743","GO:0009743","response to carbohydrate","1/33","112/9629",0.320730313417949,0.465071028649714,0.419839286636601,"Pp3c9_2771V3",1
"GO:1901701","GO:1901701","cellular response to oxygen-containing compound","2/33","337/9629",0.322088026314041,0.465071028649714,0.419839286636601,"Pp3c17_930V3/Pp3c9_2771V3",2
"GO:0032870","GO:0032870","cellular response to hormone stimulus","2/33","340/9629",0.325908240530493,0.466736153298078,0.421342465079172,"Pp3c21_900V3/Pp3c9_2771V3",2
"GO:0010647","GO:0010647","positive regulation of cell communication","1/33","115/9629",0.327772638400269,0.466736153298078,0.421342465079172,"Pp3c26_11770V3",1
"GO:0055065","GO:0055065","metal ion homeostasis","1/33","115/9629",0.327772638400269,0.466736153298078,0.421342465079172,"Pp3c7_10130V3",1
"GO:0003002","GO:0003002","regionalization","1/33","116/9629",0.330104307827722,0.467900142746634,0.422393247582551,"Pp3c18_3000V3",1
"GO:0006073","GO:0006073","cellular glucan metabolic process","1/33","118/9629",0.33474414231,0.468119417598713,0.422591196265232,"Pp3c1_13060V3",1
"GO:0019953","GO:0019953","sexual reproduction","1/33","118/9629",0.33474414231,0.468119417598713,0.422591196265232,"Pp3c26_11770V3",1
"GO:0009409","GO:0009409","response to cold","2/33","347/9629",0.334803855305228,0.468119417598713,0.422591196265232,"Pp3c19_3030V3/Pp3c3_3840V3",2
"GO:0044703","GO:0044703","multi-organism reproductive process","1/33","122/9629",0.343930506694133,0.476567383715188,0.430217532565236,"Pp3c26_11770V3",1
"GO:0090698","GO:0090698","post-embryonic plant morphogenesis","1/33","122/9629",0.343930506694133,0.476567383715188,0.430217532565236,"Pp3c10_19020V3",1
"GO:0042546","GO:0042546","cell wall biogenesis","1/33","124/9629",0.348477441088241,0.480712184358333,0.433959219400301,"Pp3c18_3000V3",1
"GO:0009150","GO:0009150","purine ribonucleotide metabolic process","1/33","127/9629",0.355240596826899,0.487863752975607,0.440415242849722,"Pp3c4_29300V3",1
"GO:0009753","GO:0009753","response to jasmonic acid","1/33","129/9629",0.359711493275539,0.490112723842318,0.442445483965983,"Pp3c4_29300V3",1
"GO:0071495","GO:0071495","cellular response to endogenous stimulus","2/33","367/9629",0.360050447612318,0.490112723842318,0.442445483965983,"Pp3c21_900V3/Pp3c9_2771V3",2
"GO:0007389","GO:0007389","pattern specification process","1/33","131/9629",0.364152320731191,0.492198737563836,0.444328616775393,"Pp3c18_3000V3",1
"GO:0044042","GO:0044042","glucan metabolic process","1/33","132/9629",0.366361519869522,0.492198737563836,0.444328616775393,"Pp3c1_13060V3",1
"GO:0090696","GO:0090696","post-embryonic plant organ development","1/33","132/9629",0.366361519869522,0.492198737563836,0.444328616775393,"Pp3c10_19020V3",1
"GO:0006163","GO:0006163","purine nucleotide metabolic process","1/33","133/9629",0.368563275144272,0.493013212205975,0.445063877481122,"Pp3c4_29300V3",1
"GO:0048437","GO:0048437","floral organ development","1/33","137/9629",0.377296342471862,0.502519697516402,0.453645783825061,"Pp3c10_19020V3",1
"GO:0055080","GO:0055080","cation homeostasis","1/33","138/9629",0.379461241407642,0.503234006845328,0.454290621066299,"Pp3c7_10130V3",1
"GO:0044264","GO:0044264","cellular polysaccharide metabolic process","1/33","142/9629",0.388048083147793,0.509328313980141,0.459792209861139,"Pp3c1_13060V3",1
"GO:0098771","GO:0098771","inorganic ion homeostasis","1/33","142/9629",0.388048083147793,0.509328313980141,0.459792209861139,"Pp3c7_10130V3",1
"GO:0009259","GO:0009259","ribonucleotide metabolic process","1/33","143/9629",0.390176723735558,0.509328313980141,0.459792209861139,"Pp3c4_29300V3",1
"GO:0019220","GO:0019220","regulation of phosphate metabolic process","1/33","144/9629",0.39229818358341,0.509328313980141,0.459792209861139,"Pp3c12_8390V3",1
"GO:0051174","GO:0051174","regulation of phosphorus metabolic process","1/33","144/9629",0.39229818358341,0.509328313980141,0.459792209861139,"Pp3c12_8390V3",1
"GO:1901293","GO:1901293","nucleoside phosphate biosynthetic process","1/33","149/9629",0.40279859054349,0.520773073129449,0.470123877974124,"Pp3c4_29300V3",1
"GO:0009611","GO:0009611","response to wounding","1/33","150/9629",0.404877456209319,0.521279724869499,0.470581253927498,"Pp3c4_29300V3",1
"GO:0071214","GO:0071214","cellular response to abiotic stimulus","1/33","152/9629",0.409014156469905,0.522253613013226,0.471460423943127,"Pp3c17_930V3",1
"GO:0104004","GO:0104004","cellular response to environmental stimulus","1/33","152/9629",0.409014156469905,0.522253613013226,0.471460423943127,"Pp3c17_930V3",1
"GO:0019693","GO:0019693","ribose phosphate metabolic process","1/33","154/9629",0.413122967966144,0.523176217629256,0.472293298149388,"Pp3c4_29300V3",1
"GO:0048609","GO:0048609","multicellular organismal reproductive process","1/33","154/9629",0.413122967966144,0.523176217629256,0.472293298149388,"Pp3c26_11770V3",1
"GO:0009165","GO:0009165","nucleotide biosynthetic process","1/33","156/9629",0.417204072880997,0.524471462943204,0.473462570873613,"Pp3c4_29300V3",1
"GO:0072521","GO:0072521","purine-containing compound metabolic process","1/33","157/9629",0.419234291987397,0.524471462943204,0.473462570873613,"Pp3c4_29300V3",1
"GO:0010038","GO:0010038","response to metal ion","2/33","415/9629",0.419237706624503,0.524471462943204,0.473462570873613,"Pp3c1_13060V3/Pp3c19_3030V3",2
"GO:0071396","GO:0071396","cellular response to lipid","1/33","158/9629",0.421257652245465,0.524873445741325,0.473825457746385,"Pp3c9_2771V3",1
"GO:0050801","GO:0050801","ion homeostasis","1/33","160/9629",0.42528388594563,0.527761930751806,0.476433015326959,"Pp3c7_10130V3",1
"GO:0031668","GO:0031668","cellular response to extracellular stimulus","1/33","161/9629",0.427286804074661,0.528126489836281,0.476762118230674,"Pp3c17_930V3",1
"GO:0005976","GO:0005976","polysaccharide metabolic process","1/33","166/9629",0.437200294894122,0.538226657857704,0.485879967066229,"Pp3c1_13060V3",1
"GO:0045087","GO:0045087","innate immune response","1/33","167/9629",0.439162927280098,0.538497398926787,0.486124376479641,"Pp3c4_29300V3",1
"GO:0032504","GO:0032504","multicellular organism reproduction","1/33","168/9629",0.441118922143737,0.538757893053023,0.486359535544375,"Pp3c26_11770V3",1
"GO:0071496","GO:0071496","cellular response to external stimulus","1/33","169/9629",0.443068301233608,0.5390082877212,0.486585577401185,"Pp3c17_930V3",1
"GO:1901605","GO:1901605","alpha-amino acid metabolic process","1/33","171/9629",0.446947298741666,0.541594962004607,0.488920677674062,"Pp3c19_3030V3",1
"GO:0007017","GO:0007017","microtubule-based process","1/33","173/9629",0.450800092417211,0.544129799050461,0.491208982280267,"Pp3c26_11770V3",1
"GO:0006457","GO:0006457","protein folding","1/33","176/9629",0.456530525646204,0.548902460796409,0.495517465886726,"Pp3c12_8390V3",1
"GO:0009408","GO:0009408","response to heat","1/33","182/9629",0.467817964979922,0.56029360922014,0.505800737330394,"Pp3c3_3840V3",1
"GO:0006955","GO:0006955","immune response","1/33","183/9629",0.469676968595426,0.560348198054002,0.505850016979426,"Pp3c4_29300V3",1
"GO:0071310","GO:0071310","cellular response to organic substance","2/33","462/9629",0.474637021800899,0.564087845140299,0.509225954563717,"Pp3c21_900V3/Pp3c9_2771V3",2
"GO:0009658","GO:0009658","chloroplast organization","1/33","193/9629",0.487924019995602,0.577657173098241,0.521475560793848,"Pp3c18_14150V3",1
"GO:0032259","GO:0032259","methylation","1/33","197/9629",0.495051076109617,0.583857948541495,0.527073263033542,"Pp3c11_2820V3",1
"GO:0009991","GO:0009991","response to extracellular stimulus","1/33","201/9629",0.50208190335041,0.589898510020063,0.532526333351445,"Pp3c17_930V3",1
"GO:0009266","GO:0009266","response to temperature stimulus","2/33","492/9629",0.508414615198723,0.595076197334869,0.537200450668507,"Pp3c19_3030V3/Pp3c3_3840V3",2
"GO:0009908","GO:0009908","flower development","1/33","215/9629",0.52595003264504,0.61327758523516,0.553631613310568,"Pp3c10_19020V3",1
"GO:0070925","GO:0070925","organelle assembly","1/33","218/9629",0.5309183327992,0.616743476823131,0.556760420228682,"Pp3c26_11770V3",1
"GO:0006753","GO:0006753","nucleoside phosphate metabolic process","1/33","222/9629",0.537464250158133,0.622009188385255,0.561514000756575,"Pp3c4_29300V3",1
"GO:0009555","GO:0009555","pollen development","1/33","224/9629",0.540703904795354,0.622487997761409,0.561946242230534,"Pp3c3_3840V3",1
"GO:0009117","GO:0009117","nucleotide metabolic process","1/33","225/9629",0.542315470041686,0.622487997761409,0.561946242230534,"Pp3c4_29300V3",1
"GO:0007010","GO:0007010","cytoskeleton organization","1/33","226/9629",0.543921551442008,0.622487997761409,0.561946242230534,"Pp3c18_3000V3",1
"GO:0033043","GO:0033043","regulation of organelle organization","1/33","230/9629",0.550291399304027,0.626940928077998,0.56596609075343,"Pp3c19_14290V3",1
"GO:0090567","GO:0090567","reproductive shoot system development","1/33","231/9629",0.551870331512024,0.626940928077998,0.56596609075343,"Pp3c10_19020V3",1
"GO:0002376","GO:0002376","immune system process","1/33","235/9629",0.558132475096461,0.629426769360607,0.568210164811994,"Pp3c4_29300V3",1
"GO:0006520","GO:0006520","cellular amino acid metabolic process","1/33","235/9629",0.558132475096461,0.629426769360607,0.568210164811994,"Pp3c19_3030V3",1
"GO:0042742","GO:0042742","defense response to bacterium","1/33","251/9629",0.582343220110321,0.654342018233051,0.590702213700421,"Pp3c4_29300V3",1
"GO:0009755","GO:0009755","hormone-mediated signaling pathway","1/33","255/9629",0.588191919997489,0.657759084745206,0.593786944157655,"Pp3c21_900V3",1
"GO:0090407","GO:0090407","organophosphate biosynthetic process","1/33","256/9629",0.589641639075799,0.657759084745206,0.593786944157655,"Pp3c4_29300V3",1
"GO:0009657","GO:0009657","plastid organization","1/33","264/9629",0.601062580820797,0.668087544869159,0.603110881929236,"Pp3c18_14150V3",1
"GO:0016567","GO:0016567","protein ubiquitination","1/33","268/9629",0.606656857391449,0.67101942947791,0.605757618162651,"Pp3c17_930V3",1
"GO:0006974","GO:0006974","cellular response to DNA damage stimulus","1/33","269/9629",0.608043495967038,0.67101942947791,0.605757618162651,"Pp3c4_6840V3",1
"GO:1901137","GO:1901137","carbohydrate derivative biosynthetic process","1/33","275/9629",0.61626432171178,0.677671442736442,0.611762671862228,"Pp3c4_29300V3",1
"GO:1905392","GO:1905392","plant organ morphogenesis","1/33","277/9629",0.618967254051886,0.678230076248343,0.612266973959499,"Pp3c10_19020V3",1
"GO:0080134","GO:0080134","regulation of response to stress","1/33","280/9629",0.622987067510038,0.680222628482691,0.614065735131709,"Pp3c7_10130V3",1
"GO:0009617","GO:0009617","response to bacterium","1/33","283/9629",0.626965744735922,0.682156391279577,0.615811424592363,"Pp3c4_29300V3",1
"GO:0048229","GO:0048229","gametophyte development","1/33","289/9629",0.634801318325567,0.68825827144772,0.621319849884673,"Pp3c3_3840V3",1
"GO:0055086","GO:0055086","nucleobase-containing small molecule metabolic process","1/33","302/9629",0.65123473947998,0.703606763983615,0.635175583224861,"Pp3c4_29300V3",1
"GO:0048827","GO:0048827","phyllome development","1/33","310/9629",0.660988743348172,0.711656870015976,0.642442754400387,"Pp3c10_19020V3",1
"GO:0023051","GO:0023051","regulation of signaling","1/33","317/9629",0.669306078234942,0.718109646439574,0.648267948582821,"Pp3c26_11770V3",1
"GO:0010646","GO:0010646","regulation of cell communication","1/33","319/9629",0.671645886378873,0.718126570557341,0.648283226699695,"Pp3c26_11770V3",1
"GO:0009737","GO:0009737","response to abscisic acid","1/33","355/9629",0.711117537858841,0.757707997235799,0.684015054564765,"Pp3c9_2771V3",1
"GO:0034654","GO:0034654","nucleobase-containing compound biosynthetic process","1/33","375/9629",0.731015699750909,0.776233165714883,0.700738507628833,"Pp3c4_29300V3",1
"GO:0097305","GO:0097305","response to alcohol","1/33","380/9629",0.735778662546803,0.778615091530692,0.702888772800659,"Pp3c9_2771V3",1
"GO:0019637","GO:0019637","organophosphate metabolic process","1/33","392/9629",0.746878509032614,0.784984555411828,0.708638757227507,"Pp3c4_29300V3",1
"GO:0098542","GO:0098542","defense response to other organism","1/33","392/9629",0.746878509032614,0.784984555411828,0.708638757227507,"Pp3c4_29300V3",1
"GO:0051128","GO:0051128","regulation of cellular component organization","1/33","396/9629",0.750476948016158,0.785487961338203,0.709093203047603,"Pp3c19_14290V3",1
"GO:0015833","GO:0015833","peptide transport","1/33","399/9629",0.753143172764509,0.785487961338203,0.709093203047603,"Pp3c19_14290V3",1
"GO:0045184","GO:0045184","establishment of protein localization","1/33","402/9629",0.755781762502239,0.785487961338203,0.709093203047603,"Pp3c19_14290V3",1
"GO:0042886","GO:0042886","amide transport","1/33","404/9629",0.757525606727458,0.785487961338203,0.709093203047603,"Pp3c19_14290V3",1
"GO:1901135","GO:1901135","carbohydrate derivative metabolic process","1/33","419/9629",0.77022502424663,0.79502482209719,0.717702530593614,"Pp3c4_29300V3",1
"GO:0034613","GO:0034613","cellular protein localization","1/33","421/9629",0.771868759317661,0.79502482209719,0.717702530593614,"Pp3c19_14290V3",1
"GO:0048316","GO:0048316","seed development","1/33","432/9629",0.780707483967177,0.799993817019939,0.722188252462217,"Pp3c4_19720V3",1
"GO:0009057","GO:0009057","macromolecule catabolic process","1/33","437/9629",0.784614442060739,0.799993817019939,0.722188252462217,"Pp3c1_13060V3",1
"GO:0033993","GO:0033993","response to lipid","1/33","437/9629",0.784614442060739,0.799993817019939,0.722188252462217,"Pp3c9_2771V3",1
"GO:0015031","GO:0015031","protein transport","1/33","442/9629",0.788453865821932,0.799993817019939,0.722188252462217,"Pp3c19_14290V3",1
"GO:0006886","GO:0006886","intracellular protein transport","1/33","447/9629",0.792226886757609,0.799993817019939,0.722188252462217,"Pp3c19_14290V3",1
"GO:0010154","GO:0010154","fruit development","1/33","447/9629",0.792226886757609,0.799993817019939,0.722188252462217,"Pp3c4_19720V3",1
"GO:0070727","GO:0070727","cellular macromolecule localization","1/33","455/9629",0.798128374028193,0.803327907409484,0.725198076864293,"Pp3c19_14290V3",1
"GO:0008104","GO:0008104","protein localization","1/33","468/9629",0.80737325345024,0.809994595182221,0.731216377868468,"Pp3c19_14290V3",1
"GO:0006952","GO:0006952","defense response","1/33","485/9629",0.818845146867887,0.818845146867887,0.73920614518818,"Pp3c4_29300V3",1
