sample_name	Me1_v2_0074180	Me1_v2_0076450	Me1_v2_0085920	Me1_v2_0105030	Me1_v2_0109270	Me1_v2_0109290	Me1_v2_0141650	Me1_v2_0179690	Me1_v2_0203870	Me1_v2_0222170	Me1_v2_0231160	treatment	condition	time	viol_micromol_per_mgDW	9_cis_neo_micromol_per_mgDW	anthera_micromol_per_mgDW	Chlb_micromol_per_mgDW	Lut_micromol_per_mgDW	Zeax_micromol_per_mgDW	Chla_micromol_per_mgDW	alpha_car_micromol_per_mgDW	11_cis_micromol_per_mgDW	beta_car_micromol_per_mgDW	9_cis_micromol_per_mgDW	6MHO_nmol_per_mgDW	beta_CC_nmol_per_mgDW	beta_Io_nmol_per_mgDW	DHA_nmol_per_mgDW	DHA_per_beta_Io	Chla_per_b	beta_car_per_9_cis_neox	V_A_Z_per_Chla_b	A_Z_per_V_A_Z	beta_Car_per_beta_CC	beta_Car_per_beta_Io	beta_Car_per_DHA	beta_Car_per_beta_CC_beta_Io_DHA
control_0_rep1	8.170671781733711	6.364446309873399	4.431623516605153	6.562818831506856	3.390291237426178	1.6789337212863606	6.073242608366684	8.411032359280236	2.485138189892546	5.651182163185137	6.8929185565618125	standard_growth	standard_growth_0	0	0.007520531	0.005243604	0.002251673	0.007002923	0.021643248	0.001356382	0.008822534	2.54055e-4	0.001423234	0.024024728	0.002090149	1.84277e-4	2.39e-5	2.95e-6	2.16e-5	7.32	1.259836018	4.581720619	0.70320786	0.324215046	1006294.88	8132965.809	1112771.161	496189.7
control_0_rep2	8.297805230322474	6.47600430932906	4.859538751967416	6.866829837851317	3.653816044526274	2.741181017613987	6.041513960436575	8.377987717305603	3.045106705820644	5.748452957729445	6.863238000533735	standard_growth	standard_growth_0	0	0.004584298	0.003464978	0.001597101	0.004099334	0.014630563	0.001146436	0.005336263	1.80112e-4	7.02589e-4	0.01481728	0.001158175	7.65e-5	1.95e-5	2.41e-6	1.16e-5	4.81	1.301739057	4.27629914	0.77661605	0.374399419	760610.3447	6157602.923	1282709.715	443118.2203
control_0_rep3	8.064368863370076	6.5429975816216865	4.983153564683107	6.743841539988515	3.712203321549465	2.276408151380545	6.38881783216629	8.085173509169087	3.7719617936908776	5.548447178844826	6.775247386890471	standard_growth	standard_growth_0	0	0.005810034	0.004814732	0.002373858	0.006307133	0.019750737	0.001547913	0.008227493	2.33506e-4	9.36645e-4	0.018552004	0.001441001	3.5e-5	4.02e-5	5.23e-6	3.03e-5	5.79	1.304474283	3.853174858	0.669560043	0.402984948	462058.3484	3548688.269	612208.5035	245130.8718
control_0_rep4	7.635753547216312	6.217642718937309	3.591373440106047	5.020226404600543	1.94489303940888	0.8992088715927616	4.84806544136797	8.255770876144043	4.275822400690931	5.344778098760209	6.938990771407734	standard_growth	standard_growth_0	0	NA	NA	NA	NA	NA	NA	NA	NA	NA	NA	NA	NA	NA	NA	NA	NA	NA	NA	NA	NA	NA	NA	NA	NA
control_0_rep5	7.734953282658848	6.501128455730961	4.559271106388182	6.2426788014865195	2.9237701494975172	2.5486085542289727	5.974975789723061	8.149971413905861	3.635155514351584	5.540357445278563	7.102201864496454	standard_growth	standard_growth_0	0	NA	NA	NA	NA	NA	NA	NA	NA	NA	NA	NA	NA	NA	NA	NA	NA	NA	NA	NA	NA	NA	NA	NA	NA
control_0_rep6	7.672498533641897	6.284004664990961	4.03448475443332	5.418818345059349	2.417059918796371	1.53477580534267	4.963346352431668	8.211750663039076	4.691392558719039	5.4208694209287485	7.079783829109202	standard_growth	standard_growth_0	0	NA	NA	NA	NA	NA	NA	NA	NA	NA	NA	NA	NA	NA	NA	NA	NA	NA	NA	NA	NA	NA	NA	NA	NA
control_0.5_rep1	7.983120080314938	6.335041329485192	4.474923028231997	6.057986339204035	3.253884596981144	2.072508058094691	5.969166128536005	8.208767423530636	3.8246280450044847	5.545406533333395	7.047543734505266	standard_growth	standard_growth_0.5	0.5	0.007075857	0.004740693	0.00198547	0.006678775	0.021088671	0.001550495	0.009734629	2.63317e-4	9.59215e-4	0.022273373	0.001421842	7.79e-5	7.68e-5	3.64e-6	9e-6	2.47	1.457547126	4.69833691	0.646533914	0.333210035	289882.5124	6119186.713	2473994.871	248923.5058
control_0.5_rep2	6.443720988318493	6.42020679755287	6.051826125933367	6.793365027940025	4.081984676756004	3.263514862451774	6.123217581378154	7.850264335536957	3.2104206353901277	5.3289662578601265	7.266864586981052	standard_growth	standard_growth_0.5	0.5	0.002766204	0.001729439	6.51001e-4	0.002667594	0.009297638	0.00118821	0.003689477	9.36e-5	3.25998e-4	0.008180103	5.05598e-4	0	5.94e-5	2.97e-6	9.8199999999999992e-06	3.31	1.383072687	4.729916968	0.724455484	0.399358373	137627.3197	2758147.715	833214.2505	113266.5368
control_0.5_rep3	6.982735934017159	6.467017271829697	6.092952576050287	6.934248924078781	4.104968275730882	3.0973935754506634	6.078563780130521	7.924655292996099	3.050195579808727	5.377942371943448	7.149893413025239	standard_growth	standard_growth_0.5	0.5	0.00394355	0.002293955	7.9471e-4	0.003305829	0.01229097	0.001418813	0.004489738	1.07522e-4	3.06239e-4	0.009186886	5.43628e-4	0	6.8e-5	2.82e-6	9.31e-6	3.3	1.358127662	4.004823708	0.789817376	0.359508995	135151.7895	3252086.213	986584.9236	114676.5249
control_1_rep1	7.88395592597418	6.389265661560012	4.290332418968963	6.110576293674986	3.035569212302621	2.203105070898199	5.89689485008728	8.193626969738293	3.552345498076056	5.51690652071374	7.050269992810065	standard_growth	standard_growth_1	1	0.004857912	0.003267817	0.001257342	0.00462907	0.014627078	0.001176196	0.006503302	1.63783e-4	5.78675e-4	0.014710864	9.05683e-4	3.32452e-4	1.0528e-4	4.57e-6	1.55e-5	3.39	1.404883077	4.501740145	0.654977194	0.33375223	139730.6901	3217245.921	950273.6348	117373.9607
control_1_rep2	6.522087719389906	6.402827892696264	6.073728639996977	7.008052051085842	4.045064656836061	3.190813973888168	6.247192786667114	7.797542723560103	3.4234571620951515	5.53185040643458	7.442355058723622	standard_growth	standard_growth_1	1	0.005461714	0.003093479	0.001108568	0.004369459	0.016994835	0.001973118	0.006199322	1.76277e-4	6.33299e-4	0.01515205	9.30301e-4	0	5.97e-5	3.09e-6	1.19e-5	3.85	1.418784894	4.898061357	0.808361839	0.36070954	253901.6326	4907801.505	1272800.998	202923.7597
control_1_rep3	7.358899035372846	6.415724227307236	5.634831838084816	6.721311020851943	4.1211442449952225	2.724685790165937	5.959808122609876	8.00400162502296	3.1734739011903517	5.350410622686064	7.290972387786018	standard_growth	standard_growth_1	1	0.003963199	0.002410014	9.0309e-4	0.003498383	0.013390909	0.00167599	0.004549694	1.11914e-4	3.35544e-4	0.009498609	6.2282e-4	0	3.68e-5	2.05e-6	9.43e-6	4.6	1.30051334	3.941308276	0.812899719	0.394217367	258264.5899	4625644.597	1006743.11	196792.8188
control_2_rep1	7.527318817073321	6.341928286861911	4.946621010395551	5.740305658759244	3.1962349169411084	2.310156143307601	5.766369434902705	7.999610289081851	3.990884279111339	5.307789741887226	6.923818471469464	standard_growth	standard_growth_2	2	0.005078247	0.003505502	0.001254772	0.004938911	0.015169143	0.001386828	0.006859035	2.00028e-4	7.46003e-4	0.016269933	9.80095e-4	2.77444e-4	6.34e-5	2.4e-6	6.63e-6	2.76	1.388774822	4.641255941	0.654338259	0.342182948	256424.3743	6792894.848	2453150.308	224485.1811
control_2_rep2	6.468229668582335	6.44292541703711	5.898059840010936	6.629030284546664	4.019212554654862	3.1643525629361955	6.152328527103625	7.793507271142365	3.286660589813028	5.428209238455252	7.414031381318753	standard_growth	standard_growth_2	2	0.005743693	0.002973266	8.96084e-4	0.004538488	0.015386967	0.001646546	0.006257434	1.57598e-4	4.89404e-4	0.013713906	8.23379e-4	0	7.96e-5	3.04e-6	6.58e-6	2.16	1.378748474	4.612404921	0.767541995	0.306846613	172374.4352	4506966.097	2083937.189	153773.6682
control_2_rep3	6.877106486617011	6.441976400408195	5.889073848738694	6.882163912456784	4.349523932091772	3.149372075543299	6.327492330907327	7.950014135400386	3.2191218764279346	5.6456746212802615	7.499745072079774	standard_growth	standard_growth_2	2	0.007105847	0.003955498	0.001043935	0.005873055	0.020232506	0.002116805	0.008052885	1.36481e-4	3.82459e-4	0.010483789	6.7298e-4	0	5.4e-5	2.76e-6	1.16e-5	4.2	1.371157817	2.650434584	0.737227578	0.307866651	194202.3371	3799141.922	907312.3486	153500.3712
control_4_rep1	7.011701422487509	6.536242461150534	6.192839297926682	5.900871012300479	3.836523211815788	2.642469370176388	6.022634026208922	7.594345881127569	3.778572832262318	4.916836941253139	6.590375944991014	standard_growth	standard_growth_4	4	0.005133546	0.003518849	0.00144371	0.005179751	0.015493987	0.00102938	0.007438406	2.09024e-4	8.09464e-4	0.018095929	0.001144414	1.42002e-4	5.82e-5	2.82e-6	9.92e-6	3.52	1.43605483	5.142569826	0.602832562	0.325122738	311096.0373	6419814.994	1823931.647	255201.2993
control_4_rep2	6.407283117358242	6.55741979620027	6.220471998492053	6.976045948435489	3.999471465605599	3.373389667052133	6.079666014929834	7.822929102291504	3.232025541651922	5.360729388479266	7.386863197290403	standard_growth	standard_growth_4	4	0.003850395	0.002674947	0.001127238	0.004104428	0.016141018	0.002568256	0.006072906	1.65383e-4	6.83887e-4	0.014026318	8.50592e-4	0	6.49e-5	3.06e-6	9.02e-6	2.95	1.47959855	5.243587379	0.741440644	0.489736025	216107.9092	4580482.798	1554980.155	182191.4909
control_4_rep3	7.00069448621478	6.3586484156063126	6.224358604754093	6.90941552080216	4.257840222962555	3.133156502909975	6.222826204497771	7.941063037993494	3.4053560262156384	5.530509263053513	7.310926443434115	standard_growth	standard_growth_4	4	0.006900796	0.003763204	0.001218107	0.005450525	0.020900559	0.002420504	0.007926696	1.45549e-4	4.77067e-4	0.011587622	7.8646e-4	0	5.54e-5	2.85e-6	1.04e-5	3.65	1.454299537	3.079190174	0.787862193	0.345238637	209222.6695	4069074.177	1114106.704	168835.2703
control_6_rep1	6.2909969751559425	6.894645310954039	6.472762626387943	6.160457226721605	3.5052961802041813	3.026564173029582	6.073218911270451	7.618192323574341	3.8629553810694777	4.53653879304592	6.764109543747957	standard_growth	standard_growth_6	6	0.006512639	0.006776629	0.003270134	0.009680037	0.029420037	0.002710241	0.013866393	4.21807e-4	0.001489823	0.033032958	0.00205834	9.44e-5	5.51e-5	4.52e-6	2.01e-5	4.45	1.432473163	4.874540952	0.530569324	0.478697509	599090.4273	7313281.306	1641554.016	414059.2188
control_6_rep2	6.355245999843703	6.615583656673029	6.348753749921622	7.2931043126831	4.533067841929451	3.446265804252374	6.366200341178079	7.884555688073156	3.218490841645108	5.698804994334377	7.2945758662064435	standard_growth	standard_growth_6	6	0.005373241	0.003177896	0.00121896	0.004426265	0.018326966	0.002334536	0.006713248	1.99737e-4	8.47115e-4	0.01640445	9.86923e-4	0	1.0189e-4	3.22e-6	9.88e-6	3.07	1.516684525	5.162047093	0.801357936	0.398073287	161000.877	5094702.267	1660994.41	142663.9839
control_6_rep3	6.83704342375028	6.4974556351148784	6.069081575924101	6.977857788971147	4.255810923137859	3.4881278858420752	6.2909969751559425	7.965459177672239	3.152375002504541	5.449131228269635	7.348880672853879	standard_growth	standard_growth_6	6	0.005994441	0.003267825	9.99143e-4	0.004698788	0.017136326	0.001816927	0.0066653	1.39628e-4	4.89581e-4	0.011764709	7.55382e-4	0	8.03e-5	3.06e-6	9.97e-6	3.26	1.41851481	3.600165148	0.775294114	0.31962617	146433.5594	3842477.51	1180219.177	125998.7817
control_24_rep1	8.084750955291854	6.536582434490658	4.472655780991132	6.22138584580571	3.1425703010738357	2.4953325557138224	5.970494984794279	8.22065330538637	3.8417534714505313	5.718112250803515	6.836079774857636	standard_growth	standard_growth_24	24	0.006803941	0.0046288	0.001855643	0.006875912	0.02115862	0.001595514	0.010168396	2.44971e-4	9.69014e-4	0.022119547	0.001695791	0	4.32e-5	3.02e-6	2.41e-5	7.98	1.47884328	4.77867887	0.60167289	0.336530812	512516.3326	7326996.996	917982.616	314763.9256
control_24_rep2	6.676103623095129	6.355723161974286	5.188619586181941	6.053077114521451	3.364623960215459	2.2450059387861976	5.890012981365729	7.812282891356873	3.3731609159048452	4.931454683342565	7.197032979218849	standard_growth	standard_growth_24	24	0.006791228	0.00333793	9.39263e-4	0.005025775	0.017987613	0.001599583	0.007071579	1.77101e-4	5.05769e-4	0.015541405	9.44365e-4	0	5.31e-5	2.23e-6	6.81e-6	3.05	1.407062547	4.656000643	0.771249153	0.27211424	292783.2755	6978198.627	2280750.43	250171.9134
control_24_rep3	7.052978254589527	6.521198146750162	5.906959694643824	6.88610287882611	3.8692697794187145	2.8797816324050487	6.096192769742006	7.855714024563739	3.3220964501137407	5.18334730272286	7.308309447117401	standard_growth	standard_growth_24	24	0.0066890990000000004	0.003904031	0.001293438	0.005995251	0.021005046	0.00244974	0.008219043	1.43969e-4	3.75821e-4	0.011924332	7.40331e-4	0	6.63e-5	2.08e-6	6.52e-6	3.13	1.370925643	3.054363969	0.733928606	0.358807365	179910.9688	5740212.462	1828532.736	159250.8599
cold_0.5_rep1	7.907113894350047	6.2075881387910075	4.794478598982767	6.178360634723034	3.507103566881312	1.986184754137726	5.778282112666076	8.22489233476321	3.6838966738548504	5.359748205798489	6.930761954845489	cold	cold_0.5	0.5	0.004675419	0.00410296	0.00137529	0.004362066	0.015782709	0.001645694	0.005598707	2.07036e-4	9.98722e-4	0.016281981	0.001219714	6.63e-6	2.13e-5	3.43e-6	2.74e-5	7.99	1.283498934	3.968349981	0.772671242	0.392518977	763702.7682	4740249.82	593367.012	311947.5712
cold_0.5_rep2	7.974472493604147	6.370994107592967	5.229707655452582	6.231000900589128	3.6281512121465314	1.7396958098693749	5.8112328719965465	8.042282984315001	2.8630159078478292	5.0303781333663355	6.500015217471417	cold	cold_0.5	0.5	0.004208359	0.006818346	0.002450133	0.009378626	0.025167914	0.004717661	0.011979134	2.91055e-4	0.001418552	0.025195961	0.002074115	4.61701e-4	1.26263e-4	5.23e-6	5.17e-5	9.89	1.277280213	3.695318705	0.532647277	0.6300719	199551.2978	4818303.323	487507.9681	137550.9529
cold_0.5_rep3	8.181413648788565	6.320410724949544	4.410269724908804	6.55908158573513	3.522948650608148	2.370347509986098	6.464024853085584	8.20789123486402	4.073523196631983	5.695198911968179	6.818488097494841	cold	cold_0.5	0.5	0.00524216	0.006596942	0.002732276	0.008614164	0.027245755	0.003831315	0.012621222	3.43008e-4	0.001607853	0.029443694	0.002044888	4.07e-5	3.33e-5	3.22e-6	6.37e-6	1.98	1.465170821	4.46323384	0.555947112	0.555965541	884263.4757	9149709.038	4623122.008	686585.9911
cold_1_rep1	8.071403093194483	6.207406693274449	5.1130151013571625	6.293940364976099	3.441879636157909	1.7479649974886111	5.941069303307761	8.111452701562435	3.60711475575464	5.181609313244923	6.667538914222396	cold	cold_1	1	0.005594815	0.00492287	0.002069855	0.00615289	0.018786073	0.001892401	0.007787504	2.43201e-4	0.001164081	0.017889425	0.001342199	4.78e-5	2.8e-5	3.77e-6	2.29e-5	6.07	1.26566622	3.633942469	0.685566766	0.414588891	639493.4967	4741818.064	782534.3252	327597.4996
cold_1_rep2	8.127537140347604	6.4023988154972535	5.3017142986317225	6.350137101196275	3.504018968811557	1.4447013037759084	5.927918511133619	7.863266750046866	3.1214698852793266	5.21423861613948	6.332031297055792	cold	cold_1	1	0.004036985	0.00568447	0.002337109	0.007549471	0.021044963	0.003385379	0.009488278	2.99884e-4	0.001526597	0.020770762	0.001655307	1.9257e-4	7.49e-5	5.15e-6	3.48e-5	6.76	1.256813665	3.653948542	0.57281466	0.586352155	277492.5828	4030585.018	596831.0832	180919.544
cold_1_rep3	8.012031397267041	6.344133541638042	4.430407992104471	6.053028813182974	2.908376959513415	2.2954038431719965	5.799975011832407	8.138562935245758	4.366523774903515	5.696532244025225	6.8194340452250675	cold	cold_1	1	0.005003744	0.005273555	0.002033695	0.006790153	0.02174995	0.002929842	0.010074099	2.43937e-4	0.001257108	0.023166853	0.001597115	1.68763e-4	8.7e-5	5.16e-6	3.57e-5	6.92	1.483633503	4.393023697	0.591030105	0.497983071	266362.555	4486612.906	649531.1086	181266.5094
cold_2_rep1	8.610755600590032	6.179604465368952	4.723324192424875	6.27522515183646	3.258975879623904	1.3825630241001563	6.033670755766822	8.020136602312679	3.712566098864433	5.53846392816413	6.549384342067705	cold	cold_2	2	0.007049109	0.005393344	0.002047116	0.006759852	0.021293721	0.001935421	0.008432335	2.21677e-4	0.001235221	0.021246331	0.001958429	9.61e-5	2.84e-5	2.55e-6	1.58e-5	6.2	1.247414202	3.93936164	0.726139522	0.361010243	746842.7612	8322708.05	1342907.942	453766.6648
cold_2_rep2	8.459796618502056	6.27114852605264	5.262315649390749	6.926443553475772	4.078082869588872	1.994581550140203	6.462339353420544	7.844899370003817	3.138154378353451	5.294294791410104	6.375157627101629	cold	cold_2	2	0.005179232	0.006601365	0.003130369	0.00969301	0.024218509	0.003356141	0.011956111	2.73475e-4	0.001735065	0.022847921	0.002072198	1.87337e-4	9.46e-5	4.6e-6	3.04e-5	6.61	1.233477606	3.461090458	0.538855197	0.556030638	241502.6259	4972177.459	751436.4707	176284.5973
cold_2_rep3	8.484193769291451	6.2236709816052205	4.185842829525425	6.469249887231675	2.2235210242193784	2.112133206867242	5.921405731630355	8.078254586879115	3.730273046789602	5.708669927784902	6.699427680942819	cold	cold_2	2	0.004096344	0.005741757	0.002394382	0.005657949	0.024009982	0.003648571	0.008404411	2.7241e-4	0.001256171	0.024747735	0.001690221	1.5174e-4	6.07e-5	3.08e-6	2.73e-5	8.86	1.485416521	4.310133084	0.721023845	0.59599331	407661.0107	8023405.757	906133.6513	271647.3159
cold_4_rep1	8.714448290082274	5.953116595564787	5.433325585529917	7.39744576896942	3.435593156272465	1.747246969456466	7.001539443540836	8.127858454668065	3.8122907424971646	4.951140011700828	6.311796165235632	cold	cold_4	4	0.003365929	0.004073121	0.00149193	0.005360213	0.015648252	0.002255974	0.006595344	2.07989e-4	9.48727e-4	0.015623949	0.001159503	3e-5	2.68e-5	3.32e-6	2.04e-5	6.14	1.230425738	3.835867095	0.595023113	0.526847313	582342.7438	4705948.476	767285.7327	309310.7888
cold_4_rep2	8.770086089902177	6.023376968112817	5.581131166596463	7.53077332343678	3.0992996155380177	2.597536130362005	6.832131998927177	8.107853881870879	4.015549697674932	4.980057617887298	5.87493928739834	cold	cold_4	4	0.004339521	0.006205708	0.00284314	0.008933958	0.024291493	0.003514181	0.010914696	2.92143e-4	0.001275921	0.022789788	0.001666602	2.88184e-4	1.16657e-4	5.02e-6	4.07e-5	8.11	1.221708875	3.672391235	0.538920254	0.594317536	195357.6722	4543056.239	559834.1534	140347.4194
cold_4_rep3	8.908238851199814	6.257890222251882	5.55394710533978	7.162935631843338	3.0509547292374495	1.2293871511870276	7.058458101524033	8.01600771468276	3.460509133335176	5.056298551809017	6.082138451160615	cold	cold_4	4	0.003201265	0.005063549	0.002203589	0.007114389	0.02067481	0.003285026	0.010169071	2.00164e-4	9.65437e-4	0.021921455	0.00176355	4.35884e-4	2.20967e-4	1.08e-5	1e-4	9.26	1.429366603	4.329266611	0.502785946	0.631609969	99206.98143	2020799.052	219267.4469	66070.14128
cold_6_rep1	9.18307171904782	5.920192939335097	4.702294040712673	7.441001055046815	2.5754915614412983	1.4091264480290708	6.788935607966065	8.226748365193533	3.768780286258458	4.872561817322465	6.134158314084139	cold	cold_6	6	0.003453398	0.004502861	0.001850942	0.005410863	0.019399973	0.003206215	0.007170775	2.27665e-4	0.001026152	0.018728028	0.001573522	5e-5	2.24e-5	2.29e-6	1.63e-5	7.12	1.325255323	4.159139526	0.676426635	0.594221742	834504.262	8171308.424	1146341.994	455988.9348
cold_6_rep3	9.136292792457564	6.149344990148227	5.204615599873493	7.60363788702481	2.2295532718890527	1.209859814531344	6.984546364731523	8.069321606892663	3.7398297320853233	5.1418717513604975	5.956539170263078	cold	cold_6	6	0.001714776	0.002664203	0.001216487	0.002757422	0.011116137	0.001965246	0.003396595	1.10779e-4	5.27739e-4	0.01199245	9.58704e-4	4.70044e-4	5.51e-5	3.14e-6	7.39e-5	23.5	1.231800753	4.501328186	0.795660694	0.64979617	217794.9722	3817027.166	162373.7157	90809.27957
cold_6_rep2	9.210868918909558	5.862827589346853	5.610470773697353	7.854742739126327	2.667838612599318	1.6540496127366466	7.115842364162853	8.177322552445833	3.9479321446945135	4.67639426914729	5.843295172221787	cold	cold_6	6	0.001649985	0.003048161	0.00108781	0.003549278	0.012818519	0.002425196	0.004827763	1.30658e-4	5.38254e-4	0.013624381	9.74082e-4	1.62401e-4	9.11e-5	5.59e-6	3.87e-5	6.92	1.360210011	4.46970506	0.616326394	0.680420734	149593.3722	2439461.223	352447.8945	100684.5183
cold_24_rep1	9.328425462692095	5.598807264923176	5.175833832550452	8.763750137282823	3.5336132213952016	2.5672912876643337	6.927781210809956	8.733590890352852	5.117098833870557	6.265215590591231	7.117306895349607	cold	cold_24	24	0.001308566	0.003639791	0.001284316	0.004974101	0.016269834	0.003674916	0.00641237	2.02941e-4	8.69691e-4	0.016459315	0.001378588	1.11165e-4	6.23e-5	4.23e-6	2.57e-5	6.08	1.289151656	4.522049155	0.550460064	0.791223935	264403.6939	3893418.147	639232.0817	178465.7452
cold_24_rep2	9.09840294430872	5.476368698667747	5.764815542158319	9.042428441709228	3.712623841442416	3.120143486867082	6.867186281949395	8.89628691141685	5.282583605266162	6.504580913073818	7.621155857073001	cold	cold_24	24	0.001334058	0.002948807	0.001177638	0.002701884	0.012840554	0.002596903	0.003524259	1.51746e-4	6.45505e-4	0.013163379	9.82578e-4	2.56573e-4	5.97e-5	4.68e-6	1.9e-5	4.06	1.304370898	4.463968448	0.82050778	0.73886025	220627.1645	2814881.862	692114.2592	157912.117
cold_24_rep3	9.19617567620316	5.5875554620145245	5.355904966579461	8.872694700364956	3.4763988494436098	2.6747315019863658	6.920869679463442	8.557994421363404	5.349270130555023	6.369543548052208	7.338170024781177	cold	cold_24	24	6.69572e-4	0.001704204	6.41841e-4	0.001338189	0.007968094	0.001749259	0.00182143	8.33e-5	3.20285e-4	0.007955674	5.50333e-4	1.83759e-4	2.07e-5	3.05e-6	3.56e-5	11.7	1.3611157	4.66826333	0.968683683	0.781233606	384235.1062	2606258.186	223602.7331	134075.5341
heat_0.5_rep1	7.1386281932874125	6.197331996712921	4.107864426951101	5.0336450846123055	2.0186755531825864	1.4681999146503524	5.023996155168686	8.098951094081887	5.140555079296333	4.714079361529266	9.314271939107488	heat	heat_0.5	0.5	0.006224998	0.004498144	0.00175246	0.006014523	0.018625067	0.001532136	0.007655908	1.99189e-4	6.4708e-4	0.016186161	0.001240194	1.55916e-4	7.47e-5	3.97e-6	3.25e-5	8.19	1.272903696	3.598409114	0.695632278	0.345398104	216578.8613	4073006.121	498483.382	145584.5738
heat_0.5_rep2	7.517696122693269	6.200515062375911	4.626149341918826	6.261039664617194	3.1894856407162964	2.5983487676708505	5.9491582714482	8.020491036646744	5.479844874753582	5.149230783509554	8.991094979508238	heat	heat_0.5	0.5	0.008086804	0.006628463	0.002504194	0.008098352	0.026117328	0.002715922	0.011036696	NA	NA	NA	NA	9.87e-5	3.25e-5	4.15e-6	2.63e-5	6.34	1.36283229	NA	0.695421318	0.392285828	NA	NA	NA	NA
heat_0.5_rep3	7.183690935754486	6.428491848321978	4.197526364745466	5.041636865571435	2.792057905589069	1.9087144576060928	5.237830631898343	8.220645075258474	4.938446874033314	5.140555079296333	8.839005774953687	heat	heat_0.5	0.5	9.79501e-4	7.0863e-4	2.25586e-4	0.001229815	0.002961418	3.47565e-4	0.001526126	3.23e-5	1.32888e-4	0.002570934	2.23287e-4	5.41742e-4	1.72e-5	3.56e-6	2.18773e-4	61.5	1.240939261	3.628033513	0.563383769	0.369143415	149869.7854	721670.4292	11751.58661	10735.02436
heat_1_rep1	6.383837585978749	5.868939607348231	3.688900895110436	5.002138948501273	1.87905504057318	1.3678690574143728	5.213180169918252	8.146736263786572	6.378970313017622	3.910621315118292	10.024420300431418	heat	heat_1	1	0.005391448	0.00438459	0.001850455	0.0052091	0.017974071	0.001838674	0.006530745	2.04988e-4	7.05507e-4	0.016851746	0.001289646	2.57e-5	2.93e-5	2.2e-6	1.55e-5	7.05	1.253718339	3.84340291	0.77348354	0.406265933	575227.0927	7667827.499	1085719.752	358434.9026
heat_1_rep2	6.744771622517701	5.963363256520801	3.740565664951758	5.647381507305597	2.43982491488247	1.9664261203776512	5.437934026996119	8.056578493681055	6.445003570491349	4.236296742829664	10.072193938427608	heat	heat_1	1	0.002545566	0.00229581	8.88863e-4	0.003314326	0.010560751	0.001349446	0.004273956	1.26943e-4	5.26581e-4	0.011221419	9.41434e-4	7.6e-5	2.59e-5	4.35e-6	1.12721e-4	25.9	1.289540209	4.887781764	0.630429394	0.467886293	432715.7042	2577866.324	99550.36028	78467.86212
heat_1_rep3	6.629967025259927	5.785725156469574	3.2149456691716387	4.7656479307647555	2.044778018939237	1.1486012808215973	4.915676471188847	8.150422414432706	6.5170843321536935	4.208628073165756	9.99776944248309	heat	heat_1	1	7.89585e-4	6.28129e-4	1.86821e-4	0.001113543	0.002554276	3.53122e-4	0.001297203	2.48e-5	8.73e-5	0.001991896	1.72347e-4	4.06948e-4	2.13e-5	3.6e-6	1.54564e-4	42.9	1.164932282	3.171156739	0.551500698	0.406116106	93720.0575	553569.3213	12887.21244	11102.12668
heat_2_rep1	5.113278975433681	3.8150892172423	3.1529077344369663	1.682533619022878	1.0047350053222983	-0.31113825793100097	2.175995584283572	8.002984571307454	5.3202646117163495	3.264533966966282	10.087004404316954	heat	heat_2	2	0.004249917	0.003795974	0.001502989	0.005459673	0.017018153	0.0021704	0.007154755	1.71966e-4	7.23717e-4	0.01680068	0.001540488	9.52e-5	7.78e-5	4.15e-6	1.83e-5	4.41	1.310473021	4.425921147	0.628114611	0.463618238	216012.8592	4044832.187	915636.5155	167540.1229
heat_2_rep2	5.03910594646108	4.618049447037958	3.242890330777447	2.883227979137565	1.1898352555809868	0.5067843916406989	3.895514703125555	8.090839007253397	6.280934027093022	2.9200827982433544	10.379752105780057	heat	heat_2	2	0.001432228	0.002035946	6.89513e-4	0.003613703	0.008717508	0.001597711	0.004477089	1.02861e-4	3.77674e-4	0.007526185	5.98864e-4	0	5.71e-5	4.26e-6	2.19e-5	5.14	1.238919952	3.696651714	0.459714089	0.614935681	131803.5855	1765702.249	344018.8859	90414.18767
heat_2_rep3	5.609485986159516	4.590799780455336	2.657818096316411	3.0874831951194412	1.1135836657381455	0.46147273572386965	4.013726436899372	8.032772226337165	6.848803653190179	2.8783328207326395	10.425177937976274	heat	heat_2	2	0.001139421	0.001517802	5.17763e-4	0.001848976	0.006590074	0.00130631	0.002272152	6.56e-5	1.98006e-4	0.005559724	4.67704e-4	4.05838e-4	2.79e-5	4.13e-6	1.0308e-4	25	1.228871006	3.663009161	0.719097732	0.615514395	199494.929	1346134.284	53936.09034	41159.05875
heat_4_rep1	5.121562421363054	4.046802819949965	3.279524515781699	1.6819872652553187	0.801061336926686	-0.7567672318222172	2.78479194073914	7.908449881128181	5.9033897366528345	2.9511357941562784	10.143928532466488	heat	heat_4	4	0.002535122	0.004245451	0.0011875	0.005222127	0.018836588	0.003729228	0.006934304	2.29158e-4	7.47314e-4	0.017271436	0.001397756	9.28e-5	5.16e-5	2.78e-6	1.56e-5	5.61	1.3278696	4.068221447	0.612996466	0.659799693	334472.5409	6203608.652	1105582.923	246580.0108
heat_4_rep2	5.393439325831446	2.1321276115679786	4.1070715208978	1.2465095079778492	2.0872691850030827	0.45657662388958975	0.18270366310845856	8.280881175598644	4.891264339066906	3.6584251179741663	9.668053629503683	heat	heat_4	4	0.001633378	0.00259019	8.57952e-4	0.004109324	0.012617066	0.002512362	0.005195234	1.5319e-4	5.15549e-4	0.012287847	0.001067326	0	4.33e-5	4.65e-6	1.44e-5	3.1	1.26425503	4.743993817	0.537767723	0.673565465	283974.873	2642624.789	855964.4216	197311.7137
heat_4_rep3	6.058319272162003	2.7815527290581734	2.5040549363122566	0.8530836464825979	-1.6259519758994458	-4.053237035637185	0.6551646018633771	7.819180248292881	5.458826623075124	2.234981794504101	9.86333490906492	heat	heat_4	4	2.61197e-4	6.18337e-4	1.20285e-4	7.86448e-4	0.002647065	7.38571e-4	8.86052e-4	2.36e-5	0	0.001995077	1.60369e-4	3.22092e-4	2.08e-5	3.05e-6	1.06788e-4	35	1.126650327	3.226522709	0.669687635	0.766799767	95965.93492	653812.3972	18682.57997	15272.85266
heat_6_rep1	5.661650864205038	3.617549158239976	4.506415393999083	1.6241079570157608	2.53096734272693	1.0841825043911502	0.2070466533824091	7.834196128805001	4.965344941303886	4.2041126595219405	9.517136741891722	heat	heat_6	6	7.28776e-4	0.001255472	3.50102e-4	0.001579609	0.006020568	0.001378229	0.001943431	7.15e-5	1.80885e-4	0.005592847	4.90403e-4	2.79748e-4	2.78e-5	2.59e-6	1.77e-5	6.83	1.2303241	4.45477552	0.697439098	0.703400832	201305.0623	2156690.219	316584.7952	116414.8446
heat_6_rep2	5.78027304614707	3.0368263319706585	4.852271486222876	1.9076440316518035	3.453417004185084	2.4153370769106135	1.9252710184483488	8.353448282136998	4.9867748670668295	4.336875196237569	9.713561464307295	heat	heat_6	6	7.36574e-4	0.002012421	4.9622e-4	0.003852451	0.009249922	0.002265084	0.004698248	1.02439e-4	2.63566e-4	0.007485622	6.70256e-4	1.45381e-4	2.45e-5	5.32e-6	6.87e-5	12.9	1.219547661	3.719709403	0.409075149	0.789422553	305040.1711	1406005.663	108916.5031	75925.32171
heat_6_rep3	6.332383611156419	3.2457632840065243	4.302590743319433	0.5271610729104466	2.2837812287860713	1.2089487210023393	0.9885253835003736	7.957709763955193	5.6492178424946555	3.5662589234501105	9.878632755051164	heat	heat_6	6	7.01156e-4	0.001414585	3.34981e-4	0.001862597	0.006146717	0.001486884	0.002142129	6.3e-5	1.21215e-4	0.004976221	4.36163e-4	6.16862e-4	3.25e-5	4.04e-6	1.12149e-4	27.8	1.150076377	3.517796243	0.630010715	0.722096712	153272.5376	1231378.587	44371.34485	33474.49354
heat_24_rep1	6.675559109454525	4.545919219618165	4.442898261382736	2.935138994670327	2.650460985368228	1.7123738981719918	3.987322937190841	7.625735872680073	5.281315603056714	4.1334887714259585	9.544384681297558	heat	heat_24	24	7.59419e-4	0.002193593	5.88557e-4	0.00270511	0.012464428	0.003673017	0.003089465	1.14681e-4	2.09852e-4	0.009005442	8.35801e-4	6.94e-5	4.91e-5	4.53e-6	1.06e-5	2.34	1.142084667	4.105337694	0.866498843	0.848751266	183534.8722	1989610.269	846594.3462	140205.8483
heat_24_rep2	6.300929423573353	4.63602695721857	4.534013992756977	2.505659868218717	2.821922942392433	2.039121574045508	3.9198386583952423	7.823805065414934	4.534302001598436	4.14136710457246	9.334915778358122	heat	heat_24	24	5.05889e-4	9.38487e-4	3.51288e-4	0.00179511	0.004857816	0.001126939	0.002108957	4.63e-5	6.45e-5	0.003732131	3.46462e-4	1.19858e-4	3.76e-5	5.66e-6	4.81e-5	8.5	1.174834266	3.976751797	0.508217602	0.745030446	99349.92086	659953.8075	77608.03953	40873.12542
heat_24_rep3	6.498931456816044	4.474868720885649	4.348228819577648	2.043891816192024	2.4554448357961247	1.3042037807928035	3.086880971798059	7.585546947502986	5.179367963903155	3.5758978835727264	9.481696836719586	heat	heat_24	24	0.001432547	0.001445503	5.80972e-4	0.00170697	0.007603284	0.001479289	0.001882778	7.79e-5	1.0935e-4	0.00655804	6.05432e-4	4.15521e-4	4.56e-5	6.39e-6	1.07574e-4	16.8	1.102994556	4.53685575	0.972995135	0.589858019	143720.5697	1026248.163	60963.3318	41091.94044
hl_s_0.25_rep1	6.32370514264176	6.6152464844738805	5.973395485813216	7.128417660985239	4.276443067388594	3.3136976399622804	6.189956654014645	7.717458953245576	4.65570424968043	5.4980409152652765	8.592504019854456	high_light_s	high_light_s_0.25	0.25	6.1911e-4	0.001187421	2.09652e-4	0.001300856	0.005502371	0.001359092	0.001672383	5.03e-5	2.15303e-4	0.005132456	3.8077e-4	0	2.14e-5	3.74e-6	1.86e-5	4.97	1.285602561	4.322355515	0.735848579	0.7170242	240231.142	1372144.874	275297.2857	117317.459
hl_s_0.25_rep2	6.456938302684627	6.532015086791392	6.045543783101006	7.052972333918173	4.259242195503339	3.3192479284186063	6.321006745188929	7.779623716801048	4.541807431086297	5.449227866795689	8.371127105997694	high_light_s	high_light_s_0.25	0.25	7.35578e-4	0.002001999	3.26399e-4	0.00247583	0.010297353	0.002872135	0.003025137	1.02558e-4	3.23081e-4	0.008377071	5.57342e-4	0	5.97e-5	5.33e-6	9.17e-6	1.72	1.221867666	4.184353171	0.715167349	0.81302562	140298.6682	1571914.26	913498.7125	112885.7922
hl_s_0.25_rep3	6.514728754748778	6.556859640547482	6.081124865775638	6.984287691272822	4.1264489551811865	3.267099597137909	6.434815501022525	7.778292095855953	3.784548256169446	5.381071731942417	7.814693582716441	high_light_s	high_light_s_0.25	0.25	0.001279856	0.001602297	4.06232e-4	0.00197493	0.00882256	0.001988913	0.002575551	8.97e-5	3.27331e-4	0.007861643	5.21748e-4	0	6.9e-5	4.8e-6	1.65e-5	3.44	1.304122569	4.906482151	0.807607185	0.651739858	113877.685	1638989.898	477550.9027	87066.29209
hl_s_0.5_rep1	6.617635162513596	6.701136021323655	5.978196860840969	7.025405861922018	4.072161252028763	3.306323259329882	6.447670705621288	7.830340242042577	4.688489657574691	5.502421191678127	8.753182674368693	high_light_s	high_light_s_0.5	0.5	4.71014e-4	0.001518591	2.02877e-4	0.002322293	0.007960025	0.002205786	0.003059576	6.75e-5	2.90792e-4	0.007328145	6.03568e-4	0	6.59e-5	4.73e-6	4.52e-6	0.956	1.31748084	4.825621293	0.535070169	0.836435127	111255.2475	1548013.584	1620809.706	97548.55777
hl_s_0.5_rep2	6.358182798660065	6.287091766437642	5.845540318521683	6.388385256199238	3.7486723574439176	3.2757934065285084	6.045617223968399	7.894323821215768	4.838469225316586	5.2882979236872325	9.062288296287292	high_light_s	high_light_s_0.5	0.5	8.8505e-4	0.003438562	4.29743e-4	0.005310994	0.017863457	0.00517549	0.006636707	1.74534e-4	6.84901e-4	0.014946147	0.001078776	0	8.3e-5	4.3e-6	3.98e-6	0.926	1.249616841	4.346627544	0.543224436	0.863634612	180156.6183	3477659.754	3759051.328	163818.944
hl_s_0.5_rep3	6.583709058771569	6.300530534118591	5.6105247621800745	6.317117444728495	3.672428927984646	2.7906121423950836	5.853848906801662	7.822203713707452	4.406131403127909	4.993788658419072	8.840154901498831	high_light_s	high_light_s_0.5	0.5	7.05415e-4	0.001355927	2.87039e-4	0.001596146	0.006572663	0.00220775	0.002060354	7.76e-5	1.51729e-4	0.006451012	4.52415e-4	0	7.16e-5	3.93e-6	9.24e-6	2.35	1.290830711	4.757639335	0.875209899	0.77957196	90068.84247	1642912.247	697921.1764	76079.64432
hl_s_2_rep1	4.91390817743336	5.120812361349032	4.631229004596137	4.488961049079875	2.4135369250976515	1.6505942957878743	4.46409343900112	7.927427575621137	5.737559933015766	4.009071896330675	10.306021593025523	high_light_s	high_light_s_2	2	2.17178e-4	0.0013725950000000001	1.14366e-4	0.001856112	0.007304821	0.002244401	0.002389607	7e-5	2.12471e-4	0.006429672	4.79101e-4	2.69e-5	8.33e-5	5.59e-6	4.96e-6	0.887	1.287426604	4.684318874	0.606715924	0.915690138	77167.51778	1149462.802	1296842.605	68493.64065
hl_s_2_rep2	5.346631032627297	5.573115638874795	5.495093596972836	5.349302188630709	2.797468941600811	1.7249975956102406	4.929566720159976	7.739823386746669	5.574937722472548	3.881170374613491	10.417938834875146	high_light_s	high_light_s_2	2	3.41165e-4	0.002025265	1.67036e-4	0.002637699	0.010477819	0.00325145	0.003248577	1.09575e-4	2.78879e-4	0.00862746	6.54188e-4	0	4.26e-5	2.67e-6	7.72e-6	2.89	1.231595249	4.259917392	0.638714871	0.909256241	202530.175	3232067.281	1117266.801	162814.0332
hl_s_2_rep3	6.137411527899686	5.754884795754752	4.894983715779312	4.901516235946364	2.0636593998692994	1.4128032094719212	4.568690352496	7.79044896916507	6.241977480343281	3.5096637160746877	10.417938834875146	high_light_s	high_light_s_2	2	4.09564e-4	0.002130099	1.71013e-4	0.003052209	0.01143301	0.003442087	0.003927889	1.09737e-4	2.35091e-4	0.009412295	6.91401e-4	0	1.13299e-4	4e-6	9.6e-6	2.4	1.286900588	4.418712483	0.576304764	0.898185982	83074.48949	2354119.776	980164.0591	74170.69244
hl_s_4_rep1	5.606380018555003	4.049197033913341	4.536569112599799	3.7388781061110063	2.49867036111676	1.9071948706805684	3.8514342558602865	8.343799603356135	4.670366579812045	4.461458339480181	9.861214840232437	high_light_s	high_light_s_4	4	2.87229e-4	0.00220698	1.78084e-4	0.003690163	0.012875158	0.004191109	0.004525709	1.32891e-4	3.54697e-4	0.011279078	8.92498e-4	0	9.48e-5	4.78e-6	8.74e-6	1.83	1.226425183	5.110639231	0.566759322	0.938315577	118985.7919	2357557.332	1290002.293	104126.2629
hl_s_4_rep2	5.208580135475514	4.958364761534734	4.854557893945644	3.83852515730756	1.6777413397641197	0.9875991100542468	3.84393610286469	8.116638148765453	6.299529172508929	3.0988249718615877	10.89425572008247	high_light_s	high_light_s_4	4	2.36164e-4	0.001759675	1.23797e-4	0.002661811	0.008950412	0.002734444	0.003071859	9.3e-5	2.26793e-4	0.007009271	5.58727e-4	0	6.45e-5	2.95e-6	2.37e-6	0.803	1.154048237	3.983275041	0.53969005	0.923680419	108675.6423	2379038.119	2958138.116	100400.7761
hl_s_4_rep3	5.959644631264427	5.857080329401603	4.939921178365486	4.661359718136679	1.994093355969356	1.7140442617185545	4.848653639106724	7.931715851664764	6.469285260010654	3.001657909109346	10.55402132008799	high_light_s	high_light_s_4	4	3.93601e-4	0.002420137	1.91092e-4	0.003662017	0.012508305	0.0046293	0.004760329	1.87e-5	4.90592e-4	0.010910071	0.001019548	3.34e-5	1.26433e-4	7.19e-6	2.26e-5	3.14	1.29992013	4.508038207	0.619066615	0.924510651	86291.13908	1516567.386	482686.6283	69833.39347
hl_s_6_rep1	6.365740786148299	3.8630647393631614	4.167865457985875	2.6496609010857735	2.3595990796311894	1.4613092644648822	2.285969751709693	8.309886659892989	4.746695288498483	4.388468070412645	9.823572003516384	high_light_s	high_light_s_6	6	1.9067e-4	0.001587231	9.38e-5	0.002853831	0.008826618	0.002771626	0.003328586	7.01e-5	1.78769e-4	0.006733672	6.06146e-4	0	6.97e-5	4.46e-6	1.38e-5	3.09	1.166357	4.242402463	0.494313607	0.937608933	96676.44901	1508249.481	489240.1372	76623.7308
hl_s_6_rep2	5.432192471063806	4.460372179733472	4.9371044456843745	3.57848824317504	2.0810982258026027	0.7758856141691141	3.626018074113362	8.020924584523286	5.933189799096971	2.9425256935946424	10.416638063440557	high_light_s	high_light_s_6	6	4.23189e-4	0.003416851	2.70978e-4	0.005714719	0.019706814	0.005930873	0.006695646	2.22823e-4	4.95598e-4	0.014537023	0.001293432	2.94508e-4	2.60673e-4	1.3e-5	6.41e-5	4.93	1.171649088	4.254509457	0.533831257	0.936122742	55767.37972	1114713.941	226951.7283	43038.62297
hl_s_6_rep3	5.737605708558881	3.9777586144940016	4.8791251863874185	2.9287862663872124	2.847577807376259	0.9759939278849132	3.7150103632920977	8.1040902621258315	4.984601756204418	4.281794389762422	9.90361404848751	high_light_s	high_light_s_6	6	4.39687e-4	0.002647866	2.19323e-4	0.004081002	0.013165436	0.003833304	0.004175612	9.47e-5	1.18004e-4	0.008065639	7.99575e-4	0	1.54311e-4	1.57e-5	4.29e-5	2.73	1.023183005	3.046090273	0.544086854	0.902124535	52268.62503	514645.8955	188134.1378	37892.6011
hl_r_0.25_rep1	6.450527023102618	5.068351458382555	5.077257807851478	4.521819281777993	3.497162097564763	2.5063667063056907	4.897659143269622	8.259488965168266	4.778761747133346	5.191419963945329	9.299493958695216	high_light_r	high_light_r_0.25	6.25	1.37443e-4	8.8096e-4	1.51768e-4	0.001402476	0.005203686	0.001571145	0.001663143	4.57e-5	1.30576e-4	0.004360188	0.00037423000000000003	1.73759e-4	9.24e-5	4.53e-6	1.61e-5	3.55	1.185862125	4.949359314	0.606845459	0.926119971	47192.03651	963225.5638	271552.6415	38594.06233
hl_r_0.25_rep2	6.339928421579107	5.139489532484891	5.441611180945993	5.343313602478821	3.6322522225053153	2.5497614347888433	5.899121320344861	8.282505254297579	4.310964726842944	5.211268784329597	9.277640776491946	high_light_r	high_light_r_0.25	6.25	4.90511e-4	0.001981143	8.01424e-4	0.003496856	0.012147945	0.003237377	0.004153191	1.34271e-4	3.6158e-4	0.009389353	6.55111e-4	0	6.27e-5	5.8e-6	3.88e-5	6.69	1.187692884	4.739362117	0.592063289	0.891702948	149801.5211	1618794.002	241952.17310000001	87517.45772
hl_r_0.25_rep3	6.2576238449962	4.566003870500346	4.935438688467546	4.022293854706013	3.311669396687696	1.6676809605954863	4.577082115013138	8.254486451858757	4.884309129684543	4.91620076245408	9.589015789704924	high_light_r	high_light_r_0.25	6.25	3.52837e-4	0.001901695	3.86174e-4	0.0026773500000000002	0.011341393	0.003524237	0.003405586	1.18806e-4	2.35118e-4	0.009252317	6.98467e-4	4.55e-5	1.34775e-4	5.82e-6	2.41e-5	4.14	1.27199884	4.865300775	0.700853626	0.917237618	68649.95583	1589868.145	383713.7763	56174.27168
hl_r_0.5_rep1	6.095421286545388	5.1787517312970195	5.378605022074045	5.652430451834804	4.100944498930324	2.991696913002705	6.089534216397785	8.260940844849582	4.339243240420173	5.536323476993894	9.196120474961928	high_light_r	high_light_r_0.5	6.5	3.29174e-4	0.001342736	4.22906e-4	0.002023629	0.007399595	0.002020365	0.002484128	7.87e-5	1.7052e-4	0.006238988	4.91115e-4	1.04252e-4	9.67e-5	5.24e-6	1.48e-5	2.82	1.227561148	4.646474172	0.615038549	0.881269535	64533.50099	1190281.629	420386.5208	53433.85153
hl_r_0.5_rep2	6.37166075418691	4.91509082599193	5.296736808628026	5.020596745939503	3.7580277471940793	2.5868644183144416	5.379173774467166	8.119528527825915	4.83883590000402	5.186736602254343	9.250672885788912	high_light_r	high_light_r_0.5	6.5	6.9125e-4	0.00279928	9.99488e-4	0.004424615	0.016950071	0.004577395	0.005037085	1.99553e-4	4.54209e-4	0.013485139	9.40277e-4	0	4.89e-5	4.5e-6	1.11e-5	2.47	1.138423385	4.817360628	0.662474281	0.889719929	275954.8797	2996882.003	1210281.335	209042.5482
hl_r_0.5_rep3	6.4900684246737255	4.917570203991566	5.274690579471442	4.772073941173524	3.7184613840844176	2.8961435401796978	5.544722646650271	8.231660696351828	4.5696337950785395	5.481701453507474	9.20335817088808	high_light_r	high_light_r_0.5	6.5	4.52474e-4	0.001891346	6.5394e-4	0.0027913	0.011945679	0.003411949	0.003590945	1.32547e-4	2.98053e-4	0.010231595	7.21882e-4	5.71e-5	1.10958e-4	5.98e-6	3.21e-5	5.37	1.286477326	5.409690016	0.707958277	0.899858805	92211.42702	1712332.507	318903.0991	68660.61476
hl_r_1_rep1	6.632196660846083	5.23382574792767	5.7448562950643085	5.810324004534846	4.059323763883912	3.2349215315213766	5.9263436131534055	8.362311248767755	4.219651726965004	5.719473491032991	9.004173607561436	high_light_r	high_light_r_1	7	0.001106782	0.002164323	7.8334e-4	0.003525753	0.012756053	0.00309282	0.004450755	1.28272e-4	2.98352e-4	0.010628868	8.52547e-4	7.07e-5	1.24924e-4	7.04e-6	3.85e-5	5.47	1.2623558	4.910943495	0.624702249	0.77788582	85082.92207	1508824.31	276110.012	62352.87662
hl_r_1_rep2	6.584981235373859	4.592142930577655	5.166185459246165	4.292618742837029	3.4330739227355176	2.499799553752486	4.660508804525725	8.325618992140873	4.935424515142747	5.02638709340697	9.39511467646405	high_light_r	high_light_r_1	7	4.01603e-4	0.001535951	4.41801e-4	0.002182098	0.009541896	0.002758022	0.002620599	1.08341e-4	2.10429e-4	0.007418089	5.37919e-4	2.37006e-4	1.2381e-4	6.03e-6	3.47e-5	5.75	1.200953783	4.82963788	0.749875827	0.888487738	59915.13597	1229589.969	213744.1931	45081.5117
hl_r_1_rep3	6.4622279597317975	4.875296874771696	5.159456225394465	4.593026137943251	3.491621425028751	2.065547377363377	4.951902642554312	8.262979758705908	4.964319485610523	5.068872914473653	9.497080474765127	high_light_r	high_light_r_1	7	0.00101478	0.003019639	8.93599e-4	0.004060592	0.018061898	0.004886834	0.00497846	1.83879e-4	3.69476e-4	0.014616687	0.001087895	3.87e-5	1.40081e-4	7.31e-6	8.63e-6	1.18	1.226042755	4.840541601	0.751761591	0.850662572	104344.2023	1999718.774	1692922.916	93681.81001
hl_r_2_rep1	6.689072902990659	6.221611520224133	6.0585662337657835	6.697660002551625	4.571787015532667	3.559208993792442	6.200366745294462	7.892723568578979	4.327505748640282	5.987883654566298	7.543519417765611	high_light_r	high_light_r_2	8	8.76328e-4	0.001164432	4.47081e-4	0.001468609	0.006211269	0.001259579	0.001781206	6.23e-5	1.39649e-4	0.005209404	3.71814e-4	1.40738e-4	5.51e-5	5.43e-6	4.79e-5	8.82	1.212852359	4.473771004	0.794810836	0.66073085	94540.5245	958638.2005	108650.6682	48020.5219
hl_r_2_rep2	6.970619801783747	5.842433936984638	6.155843752968083	6.821450154309929	4.501648939420608	3.73556681663993	6.645720733297324	8.241359059598693	4.06231483193807	5.998152684211898	8.033990161561745	high_light_r	high_light_r_2	8	8.42272e-4	8.39213e-4	3.89383e-4	9.5987e-4	0.005482369	0.00115846	0.001283549	6.01e-5	1.33135e-4	0.004617492	3.08117e-4	0	6.32e-5	4.54e-6	4.81e-6	1.06	1.3372122340000001	5.502167975	1.065389546	0.647602031	73051.10863	1016319.6	959765.4256	63633.83605
hl_r_2_rep3	7.071320083656944	5.101912970447769	5.550438709137755	5.592277956361174	3.824197900411489	2.9645966741808234	5.837316501661716	8.30455698992862	4.634461882966737	5.566761323563296	9.09487003386454	high_light_r	high_light_r_2	8	6.31992e-4	0.001843061	4.55343e-4	0.002100675	0.010723456	0.002984389	0.002444599	1.11985e-4	1.94522e-4	0.008539793	6.59232e-4	0	1.33125e-4	8.18e-6	9.93e-6	1.21	1.163720529	4.633484013	0.895814657	0.844785235	64148.56958	1044176.421	859836.3469	56466.81476
hl_r_4_rep1	6.736355852378837	6.40949496640789	6.2056332515513715	7.1141939538624985	4.555007205488408	3.692831534044952	6.266572325786708	7.809193511589584	4.447123105669828	5.779013699864905	7.836940725753417	high_light_r	high_light_r_4	10	0.001256052	0.001172787	5.0392e-4	0.001230784	0.006794024	0.001294079	0.001494312	6.68e-5	1.72134e-4	0.00585103	4.06882e-4	1.62753e-4	4.54e-5	4.34e-6	2.8e-5	6.45	1.214114191	4.988997828	1.120713109	0.588725873	128912.8874	1346924.256	209306.6031	75316.58165
hl_r_4_rep2	7.4257641448598	6.506637260120345	6.687054639642461	7.741029718970977	4.872528504883098	3.910407024141761	7.15492885431789	8.04720236807645	3.6079039509545687	5.722775129098743	7.661725257589993	high_light_r	high_light_r_4	10	0.003239071	0.002057252	8.03177e-4	0.00236643	0.012261004	0.002014915	0.002840756	1.25202e-4	3.44555e-4	0.009948892	6.79945e-4	0	5.68e-5	4.37e-6	2.85e-6	0.652	1.200439537	4.836009645	1.163231553	0.465249516	175135.6668	2277475.63	3487575.591	155383.881
hl_r_4_rep3	7.803847211343352	5.770957866428071	5.964542707736128	6.502972419437322	4.172690683989341	3.486959864023034	6.768502622362904	8.146424249140189	4.183608805752355	5.573580045629631	8.29636719370626	high_light_r	high_light_r_4	10	5.26402e-4	0.001575388	3.23717e-4	0.002199972	0.00933539	0.002596557	0.002616056	8.97e-5	1.59717e-4	0.006806202	5.54987e-4	0	1.17165e-4	9.08e-6	1.49e-5	1.64	1.189131016	4.32033457	0.715667699	0.847272608	58090.80007	749909.9934	456117.2831	48215.21327
