{
	"n_targets": 87533,
	"n_bootstraps": 100,
	"n_processed": 39219385,
	"n_pseudoaligned": 36333727,
	"n_unique": 2191845,
	"p_pseudoaligned": 92.6,
	"p_unique": 5.6,
	"kallisto_version": "0.48.0",
	"index_version": 10,
	"start_time": "Fri Mar  3 18:21:28 2023",
	"call": "kallisto quant --bootstrap-samples 100 --rf-stranded -t 20 -i /scratch/users/dadras/Stress_profiling_of_physcomitrium_patens/kallisto_index/Ppatens_318_v3.3.transcript.fa.idx -o /scratch/users/dadras/Stress_profiling_of_physcomitrium_patens/kallisto/P_1_72_EKRN220057241-1A_HKHYCDSX5_L2 /scratch/users/dadras/Stress_profiling_of_physcomitrium_patens/trimmed_reads_PE/P_1_72_EKRN220057241-1A_HKHYCDSX5_L2_1.fq.gz /scratch/users/dadras/Stress_profiling_of_physcomitrium_patens/trimmed_reads_PE/P_1_72_EKRN220057241-1A_HKHYCDSX5_L2_2.fq.gz"
}
