{
	"n_targets": 20030,
	"n_bootstraps": 100,
	"n_processed": 36629114,
	"n_pseudoaligned": 24566501,
	"n_unique": 21276245,
	"p_pseudoaligned": 67.1,
	"p_unique": 58.1,
	"kallisto_version": "0.48.0",
	"index_version": 10,
	"start_time": "Fri Mar  3 13:41:48 2023",
	"call": "kallisto quant --bootstrap-samples 100 --rf-stranded -t 20 -i /scratch/users/dadras/Stress_profiling_of_zygnema_circumcarinatum_1b/kallisto_index/SAG698_1b_CDS.fna.idx -o /scratch/users/dadras/Stress_profiling_of_zygnema_circumcarinatum_1b/kallisto/Z_1_39_EKRN220057118-1A_HLN7GDSX5_L4 /scratch/users/dadras/Stress_profiling_of_zygnema_circumcarinatum_1b/trimmed_reads_PE/Z_1_39_EKRN220057118-1A_HLN7GDSX5_L4_1.fq.gz /scratch/users/dadras/Stress_profiling_of_zygnema_circumcarinatum_1b/trimmed_reads_PE/Z_1_39_EKRN220057118-1A_HLN7GDSX5_L4_2.fq.gz"
}
