"","ID","Description","GeneRatio","BgRatio","pvalue","p.adjust","qvalue","geneID","Count"
"GO:0009769","GO:0009769","photosynthesis, light harvesting in photosystem II","3/39","20/5696",0.000312194915832485,0.0642086460385152,0.0609201692411686,"Pp3c5_7110V3/Pp3c10_3020V3/Pp3c13_7900V3",3
"GO:1903428","GO:1903428","positive regulation of reactive oxygen species biosynthetic process","3/39","20/5696",0.000312194915832485,0.0642086460385152,0.0609201692411686,"Pp3c5_7110V3/Pp3c10_3020V3/Pp3c13_7900V3",3
"GO:1903426","GO:1903426","regulation of reactive oxygen species biosynthetic process","3/39","23/5696",0.000478152038780556,0.0642086460385152,0.0609201692411686,"Pp3c5_7110V3/Pp3c10_3020V3/Pp3c13_7900V3",3
"GO:0030104","GO:0030104","water homeostasis","3/39","26/5696",0.000692071178108845,0.0642086460385152,0.0609201692411686,"Pp3c5_7110V3/Pp3c10_3020V3/Pp3c13_7900V3",3
"GO:0009269","GO:0009269","response to desiccation","3/39","27/5696",0.000774903080385207,0.0642086460385152,0.0609201692411686,"Pp3c5_7110V3/Pp3c10_3020V3/Pp3c13_7900V3",3
"GO:2000379","GO:2000379","positive regulation of reactive oxygen species metabolic process","3/39","28/5696",0.00086379344446433,0.0642086460385152,0.0609201692411686,"Pp3c5_7110V3/Pp3c10_3020V3/Pp3c13_7900V3",3
"GO:0009645","GO:0009645","response to low light intensity stimulus","3/39","35/5696",0.00166954521909623,0.0930771459646151,0.0883101550100903,"Pp3c5_7110V3/Pp3c10_3020V3/Pp3c13_7900V3",3
"GO:0090333","GO:0090333","regulation of stomatal closure","3/39","35/5696",0.00166954521909623,0.0930771459646151,0.0883101550100903,"Pp3c5_7110V3/Pp3c10_3020V3/Pp3c13_7900V3",3
"GO:0010218","GO:0010218","response to far red light","4/39","81/5696",0.00213863752151475,0.10598137051062,0.100553483467711,"Pp3c5_7110V3/Pp3c10_3020V3/Pp3c13_7900V3/Pp3c2_31580V3",4
"GO:0010119","GO:0010119","regulation of stomatal movement","4/39","86/5696",0.0026635999263328,0.114872153125546,0.108988920359852,"Pp3c5_7110V3/Pp3c10_3020V3/Pp3c13_7900V3/Pp3c1_6272V3",4
"GO:0009768","GO:0009768","photosynthesis, light harvesting in photosystem I","3/39","42/5696",0.00283316969592153,0.114872153125546,0.108988920359852,"Pp3c5_7110V3/Pp3c10_3020V3/Pp3c13_7900V3",3
"GO:0010114","GO:0010114","response to red light","4/39","90/5696",0.00314278798639478,0.116806953494339,0.110824628993921,"Pp3c5_7110V3/Pp3c10_3020V3/Pp3c13_7900V3/Pp3c2_31580V3",4
"GO:0048878","GO:0048878","chemical homeostasis","5/39","158/5696",0.00414133760842859,0.142079736412242,0.134803054136704,"Pp3c21_15220V3/Pp3c5_7110V3/Pp3c10_3020V3/Pp3c21_18160V3/Pp3c13_7900V3",5
"GO:0010099","GO:0010099","regulation of photomorphogenesis","2/39","15/5696",0.00453444232394796,0.144273375474495,0.136884344915617,"Pp3c12_6520V3/Pp3c2_31580V3",2
"GO:0009639","GO:0009639","response to red or far red light","5/39","164/5696",0.00485416499239166,0.144273375474495,0.136884344915617,"Pp3c5_7110V3/Pp3c10_3020V3/Pp3c12_6520V3/Pp3c13_7900V3/Pp3c2_31580V3",5
"GO:0009648","GO:0009648","photoperiodism","3/39","53/5696",0.00548917557062154,0.144273375474495,0.136884344915617,"Pp3c12_6520V3/Pp3c1_15310V3/Pp3c2_31580V3",3
"GO:2000377","GO:2000377","regulation of reactive oxygen species metabolic process","3/39","54/5696",0.00578476578196335,0.144273375474495,0.136884344915617,"Pp3c5_7110V3/Pp3c10_3020V3/Pp3c13_7900V3",3
"GO:0046890","GO:0046890","regulation of lipid biosynthetic process","2/39","17/5696",0.005822692283724,0.144273375474495,0.136884344915617,"Pp3c12_8390V3/Pp3c1_6272V3",2
"GO:2000030","GO:2000030","regulation of response to red or far red light","2/39","21/5696",0.00883719687450175,0.207441568738304,0.196817348673114,"Pp3c12_6520V3/Pp3c2_31580V3",2
"GO:0009765","GO:0009765","photosynthesis, light harvesting","3/39","66/5696",0.0100865860806622,0.213987258608979,0.203027797877767,"Pp3c5_7110V3/Pp3c10_3020V3/Pp3c13_7900V3",3
"GO:0010017","GO:0010017","red or far-red light signaling pathway","2/39","23/5696",0.0105554253125505,0.213987258608979,0.203027797877767,"Pp3c12_6520V3/Pp3c2_31580V3",2
"GO:0010565","GO:0010565","regulation of cellular ketone metabolic process","2/39","23/5696",0.0105554253125505,0.213987258608979,0.203027797877767,"Pp3c12_8390V3/Pp3c1_6272V3",2
"GO:0042592","GO:0042592","homeostatic process","5/39","202/5696",0.0115223977100776,0.223434320812809,0.211991024231176,"Pp3c21_15220V3/Pp3c5_7110V3/Pp3c10_3020V3/Pp3c21_18160V3/Pp3c13_7900V3",5
"GO:0071489","GO:0071489","cellular response to red or far red light","2/39","25/5696",0.0124090828847274,0.230602123607851,0.21879172454651,"Pp3c12_6520V3/Pp3c2_31580V3",2
"GO:0071215","GO:0071215","cellular response to abscisic acid stimulus","3/39","75/5696",0.0142687006124112,0.244763095120592,0.232227435068393,"Pp3c5_7110V3/Pp3c10_3020V3/Pp3c13_7900V3",3
"GO:0097306","GO:0097306","cellular response to alcohol","3/39","75/5696",0.0142687006124112,0.244763095120592,0.232227435068393,"Pp3c5_7110V3/Pp3c10_3020V3/Pp3c13_7900V3",3
"GO:0044248","GO:0044248","cellular catabolic process","7/39","390/5696",0.0152310739176141,0.251594776565033,0.238709228650326,"Pp3c13_8810V3/Pp3c20_17800V3/Pp3c16_2020V3/Pp3c5_19510V3/Pp3c15_3570V3/Pp3c5_16470V3/Pp3c16_17130V3",7
"GO:1901575","GO:1901575","organic substance catabolic process","7/39","394/5696",0.016041153347683,0.255512656895237,0.242426452848442,"Pp3c13_8810V3/Pp3c20_17800V3/Pp3c16_2020V3/Pp3c5_19510V3/Pp3c15_3570V3/Pp3c5_16470V3/Pp3c16_17130V3",7
"GO:0019216","GO:0019216","regulation of lipid metabolic process","2/39","32/5696",0.0199088877068446,0.306184962663886,0.290503552020019,"Pp3c12_8390V3/Pp3c1_6272V3",2
"GO:0044275","GO:0044275","cellular carbohydrate catabolic process","2/39","33/5696",0.021102688492593,0.311165167709524,0.295228693460535,"Pp3c20_17800V3/Pp3c5_16470V3",2
"GO:0009416","GO:0009416","response to light stimulus","7/39","420/5696",0.0220809391724443,0.311165167709524,0.295228693460535,"Pp3c5_7110V3/Pp3c10_3020V3/Pp3c12_6520V3/Pp3c1_15310V3/Pp3c13_7900V3/Pp3c2_31580V3/Pp3c4_26000V3",7
"GO:0005984","GO:0005984","disaccharide metabolic process","2/39","34/5696",0.0223257519432842,0.311165167709524,0.295228693460535,"Pp3c20_17800V3/Pp3c5_16470V3",2
"GO:0062012","GO:0062012","regulation of small molecule metabolic process","2/39","35/5696",0.0235776432599017,0.318655421027762,0.302335329839888,"Pp3c12_8390V3/Pp3c1_6272V3",2
"GO:0019684","GO:0019684","photosynthesis, light reaction","3/39","92/5696",0.0245075789936991,0.321481771505582,0.30501692741384,"Pp3c5_7110V3/Pp3c10_3020V3/Pp3c13_7900V3",3
"GO:0006091","GO:0006091","generation of precursor metabolites and energy","4/39","165/5696",0.0253926777023805,0.321658591742459,0.305184691716943,"Pp3c5_7110V3/Pp3c20_17800V3/Pp3c10_3020V3/Pp3c13_7900V3",4
"GO:0009314","GO:0009314","response to radiation","7/39","438/5696",0.0271053204679313,0.321658591742459,0.305184691716943,"Pp3c5_7110V3/Pp3c10_3020V3/Pp3c12_6520V3/Pp3c1_15310V3/Pp3c13_7900V3/Pp3c2_31580V3/Pp3c4_26000V3",7
"GO:0009644","GO:0009644","response to high light intensity","3/39","96/5696",0.0273680387214808,0.321658591742459,0.305184691716943,"Pp3c5_7110V3/Pp3c10_3020V3/Pp3c13_7900V3",3
"GO:0009056","GO:0009056","catabolic process","7/39","439/5696",0.0274058889825414,0.321658591742459,0.305184691716943,"Pp3c13_8810V3/Pp3c20_17800V3/Pp3c16_2020V3/Pp3c5_19510V3/Pp3c15_3570V3/Pp3c5_16470V3/Pp3c16_17130V3",7
"GO:0009637","GO:0009637","response to blue light","3/39","106/5696",0.0352706374148826,0.392396067097228,0.372299313129775,"Pp3c5_7110V3/Pp3c10_3020V3/Pp3c13_7900V3",3
"GO:0015979","GO:0015979","photosynthesis","4/39","184/5696",0.0359443066399647,0.392396067097228,0.372299313129775,"Pp3c5_7110V3/Pp3c10_3020V3/Pp3c27_2320V3/Pp3c13_7900V3",4
"GO:0009311","GO:0009311","oligosaccharide metabolic process","2/39","44/5696",0.0360722841950366,0.392396067097228,0.372299313129775,"Pp3c20_17800V3/Pp3c5_16470V3",2
"GO:0071396","GO:0071396","cellular response to lipid","3/39","111/5696",0.0396211310002242,0.408750053168103,0.387815721910733,"Pp3c5_7110V3/Pp3c10_3020V3/Pp3c13_7900V3",3
"GO:0006790","GO:0006790","sulfur compound metabolic process","3/39","116/5696",0.0442341288584731,0.408750053168103,0.387815721910733,"Pp3c23_6580V3/Pp3c16_2020V3/Pp3c14_19650V3",3
"GO:0030162","GO:0030162","regulation of proteolysis","2/39","50/5696",0.0455325887713023,0.408750053168103,0.387815721910733,"Pp3c5_19510V3/Pp3c19_20280V3",2
"GO:0016054","GO:0016054","organic acid catabolic process","2/39","53/5696",0.050570677262563,0.408750053168103,0.387815721910733,"Pp3c16_2020V3/Pp3c16_17130V3",2
"GO:0046395","GO:0046395","carboxylic acid catabolic process","2/39","53/5696",0.050570677262563,0.408750053168103,0.387815721910733,"Pp3c16_2020V3/Pp3c16_17130V3",2
"GO:0009658","GO:0009658","chloroplast organization","3/39","123/5696",0.0511263508392881,0.408750053168103,0.387815721910733,"Pp3c14_19650V3/Pp3c22_17580V3/Pp3c2_31580V3",3
"GO:0071482","GO:0071482","cellular response to light stimulus","2/39","56/5696",0.0558009046010818,0.408750053168103,0.387815721910733,"Pp3c12_6520V3/Pp3c2_31580V3",2
"GO:0009117","GO:0009117","nucleotide metabolic process","3/39","130/5696",0.058513999687602,0.408750053168103,0.387815721910733,"Pp3c5_4840V3/Pp3c16_2020V3/Pp3c10_2540V3",3
"GO:0071478","GO:0071478","cellular response to radiation","2/39","59/5696",0.0612137804140598,0.408750053168103,0.387815721910733,"Pp3c12_6520V3/Pp3c2_31580V3",2
"GO:0009891","GO:0009891","positive regulation of biosynthetic process","4/39","222/5696",0.0637368931014824,0.408750053168103,0.387815721910733,"Pp3c5_7110V3/Pp3c10_3020V3/Pp3c13_7900V3/Pp3c1_10880V3",4
"GO:0006637","GO:0006637","acyl-CoA metabolic process","1/39","10/5696",0.0664484579547067,0.408750053168103,0.387815721910733,"Pp3c16_2020V3",1
"GO:0006772","GO:0006772","thiamine metabolic process","1/39","10/5696",0.0664484579547067,0.408750053168103,0.387815721910733,"Pp3c23_6580V3",1
"GO:0009228","GO:0009228","thiamine biosynthetic process","1/39","10/5696",0.0664484579547067,0.408750053168103,0.387815721910733,"Pp3c23_6580V3",1
"GO:0009583","GO:0009583","detection of light stimulus","1/39","10/5696",0.0664484579547067,0.408750053168103,0.387815721910733,"Pp3c12_6520V3",1
"GO:0009585","GO:0009585","red, far-red light phototransduction","1/39","10/5696",0.0664484579547067,0.408750053168103,0.387815721910733,"Pp3c12_6520V3",1
"GO:0015718","GO:0015718","monocarboxylic acid transport","1/39","10/5696",0.0664484579547067,0.408750053168103,0.387815721910733,"Pp3c21_18160V3",1
"GO:0031670","GO:0031670","cellular response to nutrient","1/39","10/5696",0.0664484579547067,0.408750053168103,0.387815721910733,"Pp3c1_10880V3",1
"GO:0035383","GO:0035383","thioester metabolic process","1/39","10/5696",0.0664484579547067,0.408750053168103,0.387815721910733,"Pp3c16_2020V3",1
"GO:0042723","GO:0042723","thiamine-containing compound metabolic process","1/39","10/5696",0.0664484579547067,0.408750053168103,0.387815721910733,"Pp3c23_6580V3",1
"GO:0006952","GO:0006952","defense response","5/39","325/5696",0.0687911268354776,0.408750053168103,0.387815721910733,"Pp3c13_8810V3/Pp3c14_19650V3/Pp3c15_3570V3/Pp3c20_10270V3/Pp3c10_2540V3",5
"GO:1901565","GO:1901565","organonitrogen compound catabolic process","4/39","230/5696",0.0707214086709081,0.408750053168103,0.387815721910733,"Pp3c13_8810V3/Pp3c16_2020V3/Pp3c5_19510V3/Pp3c15_3570V3",4
"GO:0009642","GO:0009642","response to light intensity","3/39","141/5696",0.071089784767339,0.408750053168103,0.387815721910733,"Pp3c5_7110V3/Pp3c10_3020V3/Pp3c13_7900V3",3
"GO:0009960","GO:0009960","endosperm development","1/39","11/5696",0.0728516429951159,0.408750053168103,0.387815721910733,"Pp3c8_2900V3",1
"GO:0010161","GO:0010161","red light signaling pathway","1/39","11/5696",0.0728516429951159,0.408750053168103,0.387815721910733,"Pp3c2_31580V3",1
"GO:0031570","GO:0031570","DNA integrity checkpoint signaling","1/39","11/5696",0.0728516429951159,0.408750053168103,0.387815721910733,"Pp3c22_17580V3",1
"GO:0051304","GO:0051304","chromosome separation","1/39","11/5696",0.0728516429951159,0.408750053168103,0.387815721910733,"Pp3c8_2900V3",1
"GO:0090068","GO:0090068","positive regulation of cell cycle process","1/39","11/5696",0.0728516429951159,0.408750053168103,0.387815721910733,"Pp3c8_2900V3",1
"GO:0005991","GO:0005991","trehalose metabolic process","1/39","12/5696",0.0792120275022733,0.408750053168103,0.387815721910733,"Pp3c5_16470V3",1
"GO:0033045","GO:0033045","regulation of sister chromatid segregation","1/39","12/5696",0.0792120275022733,0.408750053168103,0.387815721910733,"Pp3c8_2900V3",1
"GO:0046885","GO:0046885","regulation of hormone biosynthetic process","1/39","12/5696",0.0792120275022733,0.408750053168103,0.387815721910733,"Pp3c1_6272V3",1
"GO:0048587","GO:0048587","regulation of short-day photoperiodism, flowering","1/39","12/5696",0.0792120275022733,0.408750053168103,0.387815721910733,"Pp3c2_31580V3",1
"GO:0072523","GO:0072523","purine-containing compound catabolic process","1/39","12/5696",0.0792120275022733,0.408750053168103,0.387815721910733,"Pp3c16_2020V3",1
"GO:0009409","GO:0009409","response to cold","4/39","243/5696",0.0828892226344616,0.408750053168103,0.387815721910733,"Pp3c23_6580V3/Pp3c5_7110V3/Pp3c10_3020V3/Pp3c13_7900V3",4
"GO:0065008","GO:0065008","regulation of biological quality","6/39","450/5696",0.0831341284620193,0.408750053168103,0.387815721910733,"Pp3c21_15220V3/Pp3c5_7110V3/Pp3c10_3020V3/Pp3c21_18160V3/Pp3c13_7900V3/Pp3c1_6272V3",6
"GO:0006635","GO:0006635","fatty acid beta-oxidation","1/39","13/5696",0.0855298900862658,0.408750053168103,0.387815721910733,"Pp3c16_17130V3",1
"GO:0010229","GO:0010229","inflorescence development","1/39","13/5696",0.0855298900862658,0.408750053168103,0.387815721910733,"Pp3c1_15310V3",1
"GO:0016226","GO:0016226","iron-sulfur cluster assembly","1/39","13/5696",0.0855298900862658,0.408750053168103,0.387815721910733,"Pp3c14_19650V3",1
"GO:0019395","GO:0019395","fatty acid oxidation","1/39","13/5696",0.0855298900862658,0.408750053168103,0.387815721910733,"Pp3c16_17130V3",1
"GO:0042391","GO:0042391","regulation of membrane potential","1/39","13/5696",0.0855298900862658,0.408750053168103,0.387815721910733,"Pp3c1_6272V3",1
"GO:0051983","GO:0051983","regulation of chromosome segregation","1/39","13/5696",0.0855298900862658,0.408750053168103,0.387815721910733,"Pp3c8_2900V3",1
"GO:0055088","GO:0055088","lipid homeostasis","1/39","13/5696",0.0855298900862658,0.408750053168103,0.387815721910733,"Pp3c21_18160V3",1
"GO:0071491","GO:0071491","cellular response to red light","1/39","13/5696",0.0855298900862658,0.408750053168103,0.387815721910733,"Pp3c2_31580V3",1
"GO:0071495","GO:0071495","cellular response to endogenous stimulus","4/39","250/5696",0.0898512674168675,0.408750053168103,0.387815721910733,"Pp3c5_7110V3/Pp3c10_3020V3/Pp3c13_7900V3/Pp3c1_10880V3",4
"GO:0006739","GO:0006739","NADP metabolic process","1/39","14/5696",0.0918055075922721,0.408750053168103,0.387815721910733,"Pp3c10_2540V3",1
"GO:0006833","GO:0006833","water transport","1/39","14/5696",0.0918055075922721,0.408750053168103,0.387815721910733,"Pp3c21_15660V3",1
"GO:0009081","GO:0009081","branched-chain amino acid metabolic process","1/39","14/5696",0.0918055075922721,0.408750053168103,0.387815721910733,"Pp3c16_2020V3",1
"GO:0010951","GO:0010951","negative regulation of endopeptidase activity","1/39","14/5696",0.0918055075922721,0.408750053168103,0.387815721910733,"Pp3c19_20280V3",1
"GO:0019722","GO:0019722","calcium-mediated signaling","1/39","14/5696",0.0918055075922721,0.408750053168103,0.387815721910733,"Pp3c1_6272V3",1
"GO:0033865","GO:0033865","nucleoside bisphosphate metabolic process","1/39","14/5696",0.0918055075922721,0.408750053168103,0.387815721910733,"Pp3c16_2020V3",1
"GO:0033875","GO:0033875","ribonucleoside bisphosphate metabolic process","1/39","14/5696",0.0918055075922721,0.408750053168103,0.387815721910733,"Pp3c16_2020V3",1
"GO:0034032","GO:0034032","purine nucleoside bisphosphate metabolic process","1/39","14/5696",0.0918055075922721,0.408750053168103,0.387815721910733,"Pp3c16_2020V3",1
"GO:0042044","GO:0042044","fluid transport","1/39","14/5696",0.0918055075922721,0.408750053168103,0.387815721910733,"Pp3c21_15660V3",1
"GO:0009414","GO:0009414","response to water deprivation","3/39","158/5696",0.0927131094119806,0.408750053168103,0.387815721910733,"Pp3c5_7110V3/Pp3c10_3020V3/Pp3c13_7900V3",3
"GO:0009657","GO:0009657","plastid organization","3/39","159/5696",0.094063116181522,0.408750053168103,0.387815721910733,"Pp3c14_19650V3/Pp3c22_17580V3/Pp3c2_31580V3",3
"GO:0071229","GO:0071229","cellular response to acid chemical","3/39","159/5696",0.094063116181522,0.408750053168103,0.387815721910733,"Pp3c5_7110V3/Pp3c10_3020V3/Pp3c13_7900V3",3
"GO:0009415","GO:0009415","response to water","3/39","161/5696",0.096787995528544,0.408750053168103,0.387815721910733,"Pp3c5_7110V3/Pp3c10_3020V3/Pp3c13_7900V3",3
"GO:0010466","GO:0010466","negative regulation of peptidase activity","1/39","15/5696",0.0980391551114382,0.408750053168103,0.387815721910733,"Pp3c19_20280V3",1
"GO:0019747","GO:0019747","regulation of isoprenoid metabolic process","1/39","15/5696",0.0980391551114382,0.408750053168103,0.387815721910733,"Pp3c12_8390V3",1
"GO:0030198","GO:0030198","extracellular matrix organization","1/39","15/5696",0.0980391551114382,0.408750053168103,0.387815721910733,"Pp3c21_18160V3",1
"GO:0034219","GO:0034219","carbohydrate transmembrane transport","1/39","15/5696",0.0980391551114382,0.408750053168103,0.387815721910733,"Pp3c3_21530V3",1
"GO:0043062","GO:0043062","extracellular structure organization","1/39","15/5696",0.0980391551114382,0.408750053168103,0.387815721910733,"Pp3c21_18160V3",1
"GO:0044273","GO:0044273","sulfur compound catabolic process","1/39","15/5696",0.0980391551114382,0.408750053168103,0.387815721910733,"Pp3c16_2020V3",1
"GO:1901568","GO:1901568","fatty acid derivative metabolic process","1/39","15/5696",0.0980391551114382,0.408750053168103,0.387815721910733,"Pp3c16_2020V3",1
"GO:0098542","GO:0098542","defense response to other organism","4/39","258/5696",0.0981499115717592,0.408750053168103,0.387815721910733,"Pp3c13_8810V3/Pp3c15_3570V3/Pp3c20_10270V3/Pp3c10_2540V3",4
"GO:0016052","GO:0016052","carbohydrate catabolic process","2/39","78/5696",0.0991670911780217,0.408750053168103,0.387815721910733,"Pp3c20_17800V3/Pp3c5_16470V3",2
"GO:0009062","GO:0009062","fatty acid catabolic process","1/39","16/5696",0.10423110599168,0.408750053168103,0.387815721910733,"Pp3c16_17130V3",1
"GO:0010927","GO:0010927","cellular component assembly involved in morphogenesis","1/39","16/5696",0.10423110599168,0.408750053168103,0.387815721910733,"Pp3c21_18160V3",1
"GO:0052548","GO:0052548","regulation of endopeptidase activity","1/39","16/5696",0.10423110599168,0.408750053168103,0.387815721910733,"Pp3c19_20280V3",1
"GO:0072329","GO:0072329","monocarboxylic acid catabolic process","1/39","16/5696",0.10423110599168,0.408750053168103,0.387815721910733,"Pp3c16_17130V3",1
"GO:0043207","GO:0043207","response to external biotic stimulus","5/39","369/5696",0.104873974090506,0.408750053168103,0.387815721910733,"Pp3c13_8810V3/Pp3c15_3570V3/Pp3c3_21530V3/Pp3c20_10270V3/Pp3c10_2540V3",5
"GO:0051707","GO:0051707","response to other organism","5/39","369/5696",0.104873974090506,0.408750053168103,0.387815721910733,"Pp3c13_8810V3/Pp3c15_3570V3/Pp3c3_21530V3/Pp3c20_10270V3/Pp3c10_2540V3",5
"GO:0009607","GO:0009607","response to biotic stimulus","5/39","370/5696",0.105788982367836,0.408750053168103,0.387815721910733,"Pp3c13_8810V3/Pp3c15_3570V3/Pp3c3_21530V3/Pp3c20_10270V3/Pp3c10_2540V3",5
"GO:0044282","GO:0044282","small molecule catabolic process","2/39","82/5696",0.107844512487221,0.408750053168103,0.387815721910733,"Pp3c16_2020V3/Pp3c16_17130V3",2
"GO:0000075","GO:0000075","cell cycle checkpoint signaling","1/39","17/5696",0.110381631848427,0.408750053168103,0.387815721910733,"Pp3c22_17580V3",1
"GO:0005977","GO:0005977","glycogen metabolic process","1/39","17/5696",0.110381631848427,0.408750053168103,0.387815721910733,"Pp3c20_17800V3",1
"GO:0006112","GO:0006112","energy reserve metabolic process","1/39","17/5696",0.110381631848427,0.408750053168103,0.387815721910733,"Pp3c20_17800V3",1
"GO:0008643","GO:0008643","carbohydrate transport","1/39","17/5696",0.110381631848427,0.408750053168103,0.387815721910733,"Pp3c3_21530V3",1
"GO:0010675","GO:0010675","regulation of cellular carbohydrate metabolic process","1/39","17/5696",0.110381631848427,0.408750053168103,0.387815721910733,"Pp3c12_8390V3",1
"GO:2001252","GO:2001252","positive regulation of chromosome organization","1/39","17/5696",0.110381631848427,0.408750053168103,0.387815721910733,"Pp3c8_2900V3",1
"GO:0006812","GO:0006812","cation transport","3/39","171/5696",0.110894072720494,0.408750053168103,0.387815721910733,"Pp3c21_15220V3/Pp3c3_21530V3/Pp3c1_6272V3",3
"GO:0032350","GO:0032350","regulation of hormone metabolic process","1/39","18/5696",0.1164910025753,0.418991831843418,0.397532962947968,"Pp3c1_6272V3",1
"GO:0045861","GO:0045861","negative regulation of proteolysis","1/39","18/5696",0.1164910025753,0.418991831843418,0.397532962947968,"Pp3c19_20280V3",1
"GO:0048571","GO:0048571","long-day photoperiodism","1/39","18/5696",0.1164910025753,0.418991831843418,0.397532962947968,"Pp3c2_31580V3",1
"GO:0006811","GO:0006811","ion transport","4/39","277/5696",0.119262619778152,0.423732797784545,0.40203111803018,"Pp3c21_15220V3/Pp3c21_18160V3/Pp3c3_21530V3/Pp3c1_6272V3",4
"GO:0009581","GO:0009581","detection of external stimulus","1/39","19/5696",0.122559486354723,0.423732797784545,0.40203111803018,"Pp3c12_6520V3",1
"GO:0009582","GO:0009582","detection of abiotic stimulus","1/39","19/5696",0.122559486354723,0.423732797784545,0.40203111803018,"Pp3c12_6520V3",1
"GO:0034440","GO:0034440","lipid oxidation","1/39","19/5696",0.122559486354723,0.423732797784545,0.40203111803018,"Pp3c16_17130V3",1
"GO:0052547","GO:0052547","regulation of peptidase activity","1/39","19/5696",0.122559486354723,0.423732797784545,0.40203111803018,"Pp3c19_20280V3",1
"GO:0005983","GO:0005983","starch catabolic process","1/39","21/5696",0.134574857308173,0.461695279688041,0.438049333100289,"Pp3c20_17800V3",1
"GO:0071214","GO:0071214","cellular response to abiotic stimulus","2/39","98/5696",0.144380492484719,0.480203793597307,0.455609924536506,"Pp3c12_6520V3/Pp3c2_31580V3",2
"GO:0104004","GO:0104004","cellular response to environmental stimulus","2/39","98/5696",0.144380492484719,0.480203793597307,0.455609924536506,"Pp3c12_6520V3/Pp3c2_31580V3",2
"GO:0071310","GO:0071310","cellular response to organic substance","4/39","298/5696",0.144738856843895,0.480203793597307,0.455609924536506,"Pp3c5_7110V3/Pp3c10_3020V3/Pp3c13_7900V3/Pp3c1_10880V3",4
"GO:0015994","GO:0015994","chlorophyll metabolic process","1/39","23/5696",0.146429856343573,0.480203793597307,0.455609924536506,"Pp3c15_3570V3",1
"GO:0045132","GO:0045132","meiotic chromosome segregation","1/39","23/5696",0.146429856343573,0.480203793597307,0.455609924536506,"Pp3c8_2900V3",1
"GO:1901136","GO:1901136","carbohydrate derivative catabolic process","1/39","23/5696",0.146429856343573,0.480203793597307,0.455609924536506,"Pp3c16_2020V3",1
"GO:0010876","GO:0010876","lipid localization","1/39","24/5696",0.15229786896522,0.486375513791843,0.461465557102481,"Pp3c21_18160V3",1
"GO:0042744","GO:0042744","hydrogen peroxide catabolic process","1/39","24/5696",0.15229786896522,0.486375513791843,0.461465557102481,"Pp3c3_30190V3",1
"GO:0048579","GO:0048579","negative regulation of long-day photoperiodism, flowering","1/39","24/5696",0.15229786896522,0.486375513791843,0.461465557102481,"Pp3c2_31580V3",1
"GO:0044270","GO:0044270","cellular nitrogen compound catabolic process","2/39","102/5696",0.153893943608024,0.486375513791843,0.461465557102481,"Pp3c16_2020V3/Pp3c15_3570V3",2
"GO:0006869","GO:0006869","lipid transport","1/39","25/5696",0.158126568385241,0.486375513791843,0.461465557102481,"Pp3c21_18160V3",1
"GO:0010043","GO:0010043","response to zinc ion","1/39","25/5696",0.158126568385241,0.486375513791843,0.461465557102481,"Pp3c10_2540V3",1
"GO:0051346","GO:0051346","negative regulation of hydrolase activity","1/39","25/5696",0.158126568385241,0.486375513791843,0.461465557102481,"Pp3c19_20280V3",1
"GO:0071417","GO:0071417","cellular response to organonitrogen compound","1/39","25/5696",0.158126568385241,0.486375513791843,0.461465557102481,"Pp3c1_10880V3",1
"GO:0072528","GO:0072528","pyrimidine-containing compound biosynthetic process","1/39","25/5696",0.158126568385241,0.486375513791843,0.461465557102481,"Pp3c23_6580V3",1
"GO:0046700","GO:0046700","heterocycle catabolic process","2/39","105/5696",0.161110646762985,0.487377534336062,0.462416258680899,"Pp3c16_2020V3/Pp3c15_3570V3",2
"GO:0098662","GO:0098662","inorganic cation transmembrane transport","2/39","106/5696",0.163530646942756,0.487377534336062,0.462416258680899,"Pp3c3_21530V3/Pp3c1_6272V3",2
"GO:0019932","GO:0019932","second-messenger-mediated signaling","1/39","26/5696",0.163916211099573,0.487377534336062,0.462416258680899,"Pp3c1_6272V3",1
"GO:0044247","GO:0044247","cellular polysaccharide catabolic process","1/39","26/5696",0.163916211099573,0.487377534336062,0.462416258680899,"Pp3c20_17800V3",1
"GO:0070588","GO:0070588","calcium ion transmembrane transport","1/39","26/5696",0.163916211099573,0.487377534336062,0.462416258680899,"Pp3c1_6272V3",1
"GO:0019439","GO:0019439","aromatic compound catabolic process","2/39","107/5696",0.165957524301673,0.488203259233037,0.463199693678737,"Pp3c16_2020V3/Pp3c15_3570V3",2
"GO:0030001","GO:0030001","metal ion transport","2/39","108/5696",0.168391078877116,0.488203259233037,0.463199693678737,"Pp3c21_15220V3/Pp3c1_6272V3",2
"GO:0031325","GO:0031325","positive regulation of cellular metabolic process","4/39","317/5696",0.169528376144148,0.488203259233037,0.463199693678737,"Pp3c5_7110V3/Pp3c10_3020V3/Pp3c13_7900V3/Pp3c1_10880V3",4
"GO:0045787","GO:0045787","positive regulation of cell cycle","1/39","27/5696",0.169667051975607,0.488203259233037,0.463199693678737,"Pp3c8_2900V3",1
"GO:1901606","GO:1901606","alpha-amino acid catabolic process","1/39","27/5696",0.169667051975607,0.488203259233037,0.463199693678737,"Pp3c16_2020V3",1
"GO:0007584","GO:0007584","response to nutrient","1/39","28/5696",0.175379344262245,0.498211385611219,0.47269524903401,"Pp3c1_10880V3",1
"GO:0009251","GO:0009251","glucan catabolic process","1/39","28/5696",0.175379344262245,0.498211385611219,0.47269524903401,"Pp3c20_17800V3",1
"GO:0006778","GO:0006778","porphyrin-containing compound metabolic process","1/39","29/5696",0.18105333959989,0.51107461684526,0.484899683671925,"Pp3c15_3570V3",1
"GO:0006816","GO:0006816","calcium ion transport","1/39","30/5696",0.186689288030383,0.512934908032898,0.486664699148513,"Pp3c1_6272V3",1
"GO:0033013","GO:0033013","tetrapyrrole metabolic process","1/39","30/5696",0.186689288030383,0.512934908032898,0.486664699148513,"Pp3c15_3570V3",1
"GO:0051606","GO:0051606","detection of stimulus","1/39","30/5696",0.186689288030383,0.512934908032898,0.486664699148513,"Pp3c12_6520V3",1
"GO:0072527","GO:0072527","pyrimidine-containing compound metabolic process","1/39","30/5696",0.186689288030383,0.512934908032898,0.486664699148513,"Pp3c23_6580V3",1
"GO:1901361","GO:1901361","organic cyclic compound catabolic process","2/39","116/5696",0.188076643791559,0.512934908032898,0.486664699148513,"Pp3c16_2020V3/Pp3c15_3570V3",2
"GO:0034220","GO:0034220","ion transmembrane transport","3/39","220/5696",0.18976291440679,0.512934908032898,0.486664699148513,"Pp3c21_18160V3/Pp3c3_21530V3/Pp3c1_6272V3",3
"GO:1901701","GO:1901701","cellular response to oxygen-containing compound","3/39","220/5696",0.18976291440679,0.512934908032898,0.486664699148513,"Pp3c5_7110V3/Pp3c10_3020V3/Pp3c13_7900V3",3
"GO:2000243","GO:2000243","positive regulation of reproductive process","1/39","31/5696",0.192287438006878,0.516024703134672,0.489596248902852,"Pp3c2_31580V3",1
"GO:0048522","GO:0048522","positive regulation of cellular process","5/39","452/5696",0.193596468806206,0.516024703134672,0.489596248902852,"Pp3c5_7110V3/Pp3c8_2900V3/Pp3c10_3020V3/Pp3c13_7900V3/Pp3c1_10880V3",5
"GO:0006109","GO:0006109","regulation of carbohydrate metabolic process","1/39","32/5696",0.197848036403652,0.516024703134672,0.489596248902852,"Pp3c12_8390V3",1
"GO:0006887","GO:0006887","exocytosis","1/39","32/5696",0.197848036403652,0.516024703134672,0.489596248902852,"Pp3c8_2900V3",1
"GO:0045786","GO:0045786","negative regulation of cell cycle","1/39","32/5696",0.197848036403652,0.516024703134672,0.489596248902852,"Pp3c22_17580V3",1
"GO:0046916","GO:0046916","cellular transition metal ion homeostasis","1/39","32/5696",0.197848036403652,0.516024703134672,0.489596248902852,"Pp3c21_15220V3",1
"GO:0009063","GO:0009063","cellular amino acid catabolic process","1/39","33/5696",0.203371328525873,0.518849388082997,0.492276266248206,"Pp3c16_2020V3",1
"GO:0044242","GO:0044242","cellular lipid catabolic process","1/39","33/5696",0.203371328525873,0.518849388082997,0.492276266248206,"Pp3c16_17130V3",1
"GO:0009893","GO:0009893","positive regulation of metabolic process","4/39","345/5696",0.2086352052423,0.518849388082997,0.492276266248206,"Pp3c5_7110V3/Pp3c10_3020V3/Pp3c13_7900V3/Pp3c1_10880V3",4
"GO:0009166","GO:0009166","nucleotide catabolic process","1/39","34/5696",0.208857558119285,0.518849388082997,0.492276266248206,"Pp3c16_2020V3",1
"GO:0032940","GO:0032940","secretion by cell","1/39","34/5696",0.208857558119285,0.518849388082997,0.492276266248206,"Pp3c8_2900V3",1
"GO:0046903","GO:0046903","secretion","1/39","34/5696",0.208857558119285,0.518849388082997,0.492276266248206,"Pp3c8_2900V3",1
"GO:0098660","GO:0098660","inorganic ion transmembrane transport","2/39","125/5696",0.210600106761441,0.518849388082997,0.492276266248206,"Pp3c3_21530V3/Pp3c1_6272V3",2
"GO:0032870","GO:0032870","cellular response to hormone stimulus","3/39","232/5696",0.210988063648523,0.518849388082997,0.492276266248206,"Pp3c5_7110V3/Pp3c10_3020V3/Pp3c13_7900V3",3
"GO:0015980","GO:0015980","energy derivation by oxidation of organic compounds","1/39","35/5696",0.214306967379855,0.518849388082997,0.492276266248206,"Pp3c20_17800V3",1
"GO:0016042","GO:0016042","lipid catabolic process","1/39","35/5696",0.214306967379855,0.518849388082997,0.492276266248206,"Pp3c16_17130V3",1
"GO:1901292","GO:1901292","nucleoside phosphate catabolic process","1/39","35/5696",0.214306967379855,0.518849388082997,0.492276266248206,"Pp3c16_2020V3",1
"GO:0009266","GO:0009266","response to temperature stimulus","4/39","349/5696",0.214438763653017,0.518849388082997,0.492276266248206,"Pp3c23_6580V3/Pp3c5_7110V3/Pp3c10_3020V3/Pp3c13_7900V3",4
"GO:0006753","GO:0006753","nucleoside phosphate metabolic process","2/39","127/5696",0.215647509155927,0.518849388082997,0.492276266248206,"Pp3c16_2020V3/Pp3c10_2540V3",2
"GO:0051726","GO:0051726","regulation of cell cycle","2/39","127/5696",0.215647509155927,0.518849388082997,0.492276266248206,"Pp3c8_2900V3/Pp3c22_17580V3",2
"GO:0009737","GO:0009737","response to abscisic acid","3/39","235/5696",0.216381134940443,0.518849388082997,0.492276266248206,"Pp3c5_7110V3/Pp3c10_3020V3/Pp3c13_7900V3",3
"GO:0042364","GO:0042364","water-soluble vitamin biosynthetic process","1/39","36/5696",0.219719796963353,0.519139386043492,0.492551411823186,"Pp3c23_6580V3",1
"GO:0048586","GO:0048586","regulation of long-day photoperiodism, flowering","1/39","36/5696",0.219719796963353,0.519139386043492,0.492551411823186,"Pp3c2_31580V3",1
"GO:0009057","GO:0009057","macromolecule catabolic process","3/39","237/5696",0.219994044758341,0.519139386043492,0.492551411823186,"Pp3c13_8810V3/Pp3c20_17800V3/Pp3c5_19510V3",3
"GO:0006767","GO:0006767","water-soluble vitamin metabolic process","1/39","37/5696",0.225096285994878,0.520170691988164,0.493529898936139,"Pp3c23_6580V3",1
"GO:0010638","GO:0010638","positive regulation of organelle organization","1/39","37/5696",0.225096285994878,0.520170691988164,0.493529898936139,"Pp3c8_2900V3",1
"GO:0030258","GO:0030258","lipid modification","1/39","37/5696",0.225096285994878,0.520170691988164,0.493529898936139,"Pp3c16_17130V3",1
"GO:0080135","GO:0080135","regulation of cellular response to stress","1/39","37/5696",0.225096285994878,0.520170691988164,0.493529898936139,"Pp3c15_3570V3",1
"GO:1902600","GO:1902600","proton transmembrane transport","1/39","39/5696",0.235741191305776,0.5419617078473,0.514204877400554,"Pp3c3_21530V3",1
"GO:0000272","GO:0000272","polysaccharide catabolic process","1/39","40/5696",0.241010078266899,0.548507250967001,0.520415187370155,"Pp3c20_17800V3",1
"GO:0098655","GO:0098655","cation transmembrane transport","2/39","137/5696",0.241048029572942,0.548507250967001,0.520415187370155,"Pp3c3_21530V3/Pp3c1_6272V3",2
"GO:0051603","GO:0051603","proteolysis involved in cellular protein catabolic process","2/39","139/5696",0.246152556621067,0.549123152309785,0.520999545028401,"Pp3c13_8810V3/Pp3c5_19510V3",2
"GO:0048582","GO:0048582","positive regulation of post-embryonic development","1/39","41/5696",0.2462435660582,0.549123152309785,0.520999545028401,"Pp3c2_31580V3",1
"GO:1903825","GO:1903825","organic acid transmembrane transport","1/39","41/5696",0.2462435660582,0.549123152309785,0.520999545028401,"Pp3c21_18160V3",1
"GO:1905039","GO:1905039","carboxylic acid transmembrane transport","1/39","41/5696",0.2462435660582,0.549123152309785,0.520999545028401,"Pp3c21_18160V3",1
"GO:0000278","GO:0000278","mitotic cell cycle","2/39","141/5696",0.251262598461984,0.54972098669783,0.521566761039716,"Pp3c5_21110V3/Pp3c8_2900V3",2
"GO:0044257","GO:0044257","cellular protein catabolic process","2/39","141/5696",0.251262598461984,0.54972098669783,0.521566761039716,"Pp3c13_8810V3/Pp3c5_19510V3",2
"GO:0098813","GO:0098813","nuclear chromosome segregation","1/39","42/5696",0.251441886292281,0.54972098669783,0.521566761039716,"Pp3c8_2900V3",1
"GO:2000242","GO:2000242","negative regulation of reproductive process","1/39","42/5696",0.251441886292281,0.54972098669783,0.521566761039716,"Pp3c2_31580V3",1
"GO:0090567","GO:0090567","reproductive shoot system development","2/39","143/5696",0.256377084854079,0.550220913566039,0.522041083912079,"Pp3c1_15310V3/Pp3c2_31580V3",2
"GO:0009664","GO:0009664","plant-type cell wall organization","1/39","43/5696",0.256605269107032,0.550220913566039,0.522041083912079,"Pp3c21_18160V3",1
"GO:0015849","GO:0015849","organic acid transport","1/39","43/5696",0.256605269107032,0.550220913566039,0.522041083912079,"Pp3c21_18160V3",1
"GO:0046942","GO:0046942","carboxylic acid transport","1/39","43/5696",0.256605269107032,0.550220913566039,0.522041083912079,"Pp3c21_18160V3",1
"GO:0097305","GO:0097305","response to alcohol","3/39","258/5696",0.258650165861915,0.551952028585712,0.523683539040492,"Pp3c5_7110V3/Pp3c10_3020V3/Pp3c13_7900V3",3
"GO:0005982","GO:0005982","starch metabolic process","1/39","44/5696",0.261733943174752,0.553238571829097,0.524904191350713,"Pp3c20_17800V3",1
"GO:0061077","GO:0061077","chaperone-mediated protein folding","1/39","44/5696",0.261733943174752,0.553238571829097,0.524904191350713,"Pp3c12_8390V3",1
"GO:0048573","GO:0048573","photoperiodism, flowering","1/39","45/5696",0.266828135711232,0.556248074900034,0.527759561269327,"Pp3c12_6520V3",1
"GO:0000911","GO:0000911","cytokinesis by cell plate formation","1/39","46/5696",0.27188807248477,0.556248074900034,0.527759561269327,"Pp3c8_2900V3",1
"GO:0006006","GO:0006006","glucose metabolic process","1/39","46/5696",0.27188807248477,0.556248074900034,0.527759561269327,"Pp3c20_17800V3",1
"GO:0009110","GO:0009110","vitamin biosynthetic process","1/39","46/5696",0.27188807248477,0.556248074900034,0.527759561269327,"Pp3c23_6580V3",1
"GO:0009845","GO:0009845","seed germination","1/39","46/5696",0.27188807248477,0.556248074900034,0.527759561269327,"Pp3c1_6272V3",1
"GO:0090351","GO:0090351","seedling development","1/39","46/5696",0.27188807248477,0.556248074900034,0.527759561269327,"Pp3c1_6272V3",1
"GO:1902410","GO:1902410","mitotic cytokinetic process","1/39","46/5696",0.27188807248477,0.556248074900034,0.527759561269327,"Pp3c8_2900V3",1
"GO:0006766","GO:0006766","vitamin metabolic process","1/39","47/5696",0.276913977825141,0.556322676171229,0.527830341800411,"Pp3c23_6580V3",1
"GO:0008654","GO:0008654","phospholipid biosynthetic process","1/39","47/5696",0.276913977825141,0.556322676171229,0.527830341800411,"Pp3c14_26200V3",1
"GO:0019318","GO:0019318","hexose metabolic process","1/39","47/5696",0.276913977825141,0.556322676171229,0.527830341800411,"Pp3c20_17800V3",1
"GO:0046434","GO:0046434","organophosphate catabolic process","1/39","47/5696",0.276913977825141,0.556322676171229,0.527830341800411,"Pp3c16_2020V3",1
"GO:0006875","GO:0006875","cellular metal ion homeostasis","1/39","48/5696",0.281906074632508,0.558800485715994,0.530181249133419,"Pp3c21_15220V3",1
"GO:0032506","GO:0032506","cytokinetic process","1/39","48/5696",0.281906074632508,0.558800485715994,0.530181249133419,"Pp3c8_2900V3",1
"GO:0044272","GO:0044272","sulfur compound biosynthetic process","1/39","48/5696",0.281906074632508,0.558800485715994,0.530181249133419,"Pp3c23_6580V3",1
"GO:0070887","GO:0070887","cellular response to chemical stimulus","4/39","396/5696",0.285692655636804,0.561147388755628,0.532407954401139,"Pp3c5_7110V3/Pp3c10_3020V3/Pp3c13_7900V3/Pp3c1_10880V3",4
"GO:0045088","GO:0045088","regulation of innate immune response","1/39","49/5696",0.286864584386285,0.561147388755628,0.532407954401139,"Pp3c15_3570V3",1
"GO:0055076","GO:0055076","transition metal ion homeostasis","1/39","49/5696",0.286864584386285,0.561147388755628,0.532407954401139,"Pp3c21_15220V3",1
"GO:0023052","GO:0023052","signaling","4/39","398/5696",0.288822627001849,0.562510443855129,0.533701199975836,"Pp3c5_21110V3/Pp3c12_6520V3/Pp3c2_31580V3/Pp3c1_6272V3",4
"GO:0043086","GO:0043086","negative regulation of catalytic activity","1/39","50/5696",0.291789727153938,0.564196802167894,0.535301190633687,"Pp3c19_20280V3",1
"GO:0006974","GO:0006974","cellular response to DNA damage stimulus","2/39","157/5696",0.292218523095927,0.564196802167894,0.535301190633687,"Pp3c23_6580V3/Pp3c19_20280V3",2
"GO:0048581","GO:0048581","negative regulation of post-embryonic development","1/39","51/5696",0.29668172159974,0.570345033765017,0.541134537582103,"Pp3c2_31580V3",1
"GO:0044262","GO:0044262","cellular carbohydrate metabolic process","2/39","160/5696",0.299888984880702,0.571283233330547,0.542024686804059,"Pp3c20_17800V3/Pp3c5_16470V3",2
"GO:0006508","GO:0006508","proteolysis","3/39","280/5696",0.300149499649595,0.571283233330547,0.542024686804059,"Pp3c13_8810V3/Pp3c8_2900V3/Pp3c5_19510V3",3
"GO:0140013","GO:0140013","meiotic nuclear division","1/39","52/5696",0.30154078499347,0.571283233330547,0.542024686804059,"Pp3c8_2900V3",1
"GO:0030163","GO:0030163","protein catabolic process","2/39","162/5696",0.304997226370294,0.571283233330547,0.542024686804059,"Pp3c13_8810V3/Pp3c5_19510V3",2
"GO:0007059","GO:0007059","chromosome segregation","1/39","53/5696",0.306367133219065,0.571283233330547,0.542024686804059,"Pp3c8_2900V3",1
"GO:0034404","GO:0034404","nucleobase-containing small molecule biosynthetic process","1/39","53/5696",0.306367133219065,0.571283233330547,0.542024686804059,"Pp3c16_2020V3",1
"GO:0032989","GO:0032989","cellular component morphogenesis","2/39","164/5696",0.310100195827088,0.571283233330547,0.542024686804059,"Pp3c8_2900V3/Pp3c21_18160V3",2
"GO:0048608","GO:0048608","reproductive structure development","4/39","415/5696",0.315640312471564,0.571283233330547,0.542024686804059,"Pp3c8_2900V3/Pp3c12_6520V3/Pp3c1_15310V3/Pp3c2_31580V3",4
"GO:0061458","GO:0061458","reproductive system development","4/39","415/5696",0.315640312471564,0.571283233330547,0.542024686804059,"Pp3c8_2900V3/Pp3c12_6520V3/Pp3c1_15310V3/Pp3c2_31580V3",4
"GO:0009624","GO:0009624","response to nematode","1/39","55/5696",0.315922540823876,0.571283233330547,0.542024686804059,"Pp3c3_21530V3",1
"GO:0043067","GO:0043067","regulation of programmed cell death","1/39","55/5696",0.315922540823876,0.571283233330547,0.542024686804059,"Pp3c15_3570V3",1
"GO:0035556","GO:0035556","intracellular signal transduction","2/39","167/5696",0.317743039253953,0.571283233330547,0.542024686804059,"Pp3c5_21110V3/Pp3c1_6272V3",2
"GO:0042742","GO:0042742","defense response to bacterium","2/39","167/5696",0.317743039253953,0.571283233330547,0.542024686804059,"Pp3c13_8810V3/Pp3c10_2540V3",2
"GO:0048580","GO:0048580","regulation of post-embryonic development","2/39","167/5696",0.317743039253953,0.571283233330547,0.542024686804059,"Pp3c12_6520V3/Pp3c2_31580V3",2
"GO:0010564","GO:0010564","regulation of cell cycle process","1/39","56/5696",0.320652025118837,0.571283233330547,0.542024686804059,"Pp3c8_2900V3",1
"GO:0019362","GO:0019362","pyridine nucleotide metabolic process","1/39","56/5696",0.320652025118837,0.571283233330547,0.542024686804059,"Pp3c10_2540V3",1
"GO:0046496","GO:0046496","nicotinamide nucleotide metabolic process","1/39","56/5696",0.320652025118837,0.571283233330547,0.542024686804059,"Pp3c10_2540V3",1
"GO:0033993","GO:0033993","response to lipid","3/39","293/5696",0.324924260597707,0.571283233330547,0.542024686804059,"Pp3c5_7110V3/Pp3c10_3020V3/Pp3c13_7900V3",3
"GO:0048367","GO:0048367","shoot system development","3/39","293/5696",0.324924260597707,0.571283233330547,0.542024686804059,"Pp3c12_6520V3/Pp3c1_15310V3/Pp3c2_31580V3",3
"GO:0042440","GO:0042440","pigment metabolic process","1/39","57/5696",0.325349644094078,0.571283233330547,0.542024686804059,"Pp3c15_3570V3",1
"GO:0051130","GO:0051130","positive regulation of cellular component organization","1/39","57/5696",0.325349644094078,0.571283233330547,0.542024686804059,"Pp3c8_2900V3",1
"GO:0051336","GO:0051336","regulation of hydrolase activity","1/39","57/5696",0.325349644094078,0.571283233330547,0.542024686804059,"Pp3c19_20280V3",1
"GO:0050790","GO:0050790","regulation of catalytic activity","2/39","171/5696",0.327907835762938,0.573517234314786,0.544144272349644,"Pp3c12_8390V3/Pp3c19_20280V3",2
"GO:0050776","GO:0050776","regulation of immune response","1/39","58/5696",0.330015606832211,0.574949065027993,0.545502771161796,"Pp3c15_3570V3",1
"GO:0030003","GO:0030003","cellular cation homeostasis","1/39","59/5696",0.3346501210808,0.578503697682313,0.548875351589072,"Pp3c21_15220V3",1
"GO:1901699","GO:1901699","cellular response to nitrogen compound","1/39","59/5696",0.3346501210808,0.578503697682313,0.548875351589072,"Pp3c1_10880V3",1
"GO:2000028","GO:2000028","regulation of photoperiodism, flowering","1/39","61/5696",0.343825628474076,0.590668387912472,0.560417021337772,"Pp3c2_31580V3",1
"GO:0007165","GO:0007165","signal transduction","4/39","433/5696",0.344335831518482,0.590668387912472,0.560417021337772,"Pp3c5_21110V3/Pp3c12_6520V3/Pp3c2_31580V3/Pp3c1_6272V3",4
"GO:0044265","GO:0044265","cellular macromolecule catabolic process","2/39","179/5696",0.348127966705216,0.590766903455558,0.56051049135977,"Pp3c13_8810V3/Pp3c5_19510V3",2
"GO:0044092","GO:0044092","negative regulation of molecular function","1/39","62/5696",0.348367030513031,0.590766903455558,0.56051049135977,"Pp3c19_20280V3",1
"GO:0072524","GO:0072524","pyridine-containing compound metabolic process","1/39","62/5696",0.348367030513031,0.590766903455558,0.56051049135977,"Pp3c10_2540V3",1
"GO:0055086","GO:0055086","nucleobase-containing small molecule metabolic process","2/39","180/5696",0.350643572332887,0.591667291852702,0.561364765930579,"Pp3c16_2020V3/Pp3c10_2540V3",2
"GO:0051338","GO:0051338","regulation of transferase activity","1/39","63/5696",0.352877801867307,0.591667291852702,0.561364765930579,"Pp3c12_8390V3",1
"GO:0071555","GO:0071555","cell wall organization","1/39","63/5696",0.352877801867307,0.591667291852702,0.561364765930579,"Pp3c21_18160V3",1
"GO:0006873","GO:0006873","cellular ion homeostasis","1/39","64/5696",0.357358143732596,0.592497145370773,0.562152118100191,"Pp3c21_15220V3",1
"GO:0009832","GO:0009832","plant-type cell wall biogenesis","1/39","64/5696",0.357358143732596,0.592497145370773,0.562152118100191,"Pp3c21_18160V3",1
"GO:0033044","GO:0033044","regulation of chromosome organization","1/39","64/5696",0.357358143732596,0.592497145370773,0.562152118100191,"Pp3c8_2900V3",1
"GO:0010941","GO:0010941","regulation of cell death","1/39","65/5696",0.361808256018539,0.597653637719513,0.567044518204494,"Pp3c15_3570V3",1
"GO:0048229","GO:0048229","gametophyte development","2/39","185/5696",0.363176354022804,0.597699829867787,0.5670883445996,"Pp3c22_17580V3/Pp3c21_18160V3",2
"GO:0002682","GO:0002682","regulation of immune system process","1/39","67/5696",0.370618585108597,0.601075959848852,0.570291564454186,"Pp3c15_3570V3",1
"GO:0009150","GO:0009150","purine ribonucleotide metabolic process","1/39","67/5696",0.370618585108597,0.601075959848852,0.570291564454186,"Pp3c16_2020V3",1
"GO:0045229","GO:0045229","external encapsulating structure organization","1/39","67/5696",0.370618585108597,0.601075959848852,0.570291564454186,"Pp3c21_18160V3",1
"GO:1903046","GO:1903046","meiotic cell cycle process","1/39","67/5696",0.370618585108597,0.601075959848852,0.570291564454186,"Pp3c8_2900V3",1
"GO:0009617","GO:0009617","response to bacterium","2/39","189/5696",0.373143838833677,0.602978812028334,0.572096961140878,"Pp3c13_8810V3/Pp3c10_2540V3",2
"GO:0005996","GO:0005996","monosaccharide metabolic process","1/39","69/5696",0.379310362996112,0.610574360478536,0.579303499911191,"Pp3c20_17800V3",1
"GO:0051246","GO:0051246","regulation of protein metabolic process","2/39","192/5696",0.380582224692899,0.610574360478536,0.579303499911191,"Pp3c5_19510V3/Pp3c19_20280V3",2
"GO:0000281","GO:0000281","mitotic cytokinesis","1/39","71/5696",0.387885143469477,0.613463737543925,0.582044896135609,"Pp3c8_2900V3",1
"GO:0006163","GO:0006163","purine nucleotide metabolic process","1/39","71/5696",0.387885143469477,0.613463737543925,0.582044896135609,"Pp3c16_2020V3",1
"GO:0032269","GO:0032269","negative regulation of cellular protein metabolic process","1/39","71/5696",0.387885143469477,0.613463737543925,0.582044896135609,"Pp3c19_20280V3",1
"GO:0051321","GO:0051321","meiotic cell cycle","1/39","71/5696",0.387885143469477,0.613463737543925,0.582044896135609,"Pp3c8_2900V3",1
"GO:0055082","GO:0055082","cellular chemical homeostasis","1/39","72/5696",0.392129139808089,0.617984439414868,0.586334068078303,"Pp3c21_15220V3",1
"GO:0006260","GO:0006260","DNA replication","1/39","73/5696",0.396344460495764,0.622428272468699,0.590550308077454,"Pp3c22_17580V3",1
"GO:0010228","GO:0010228","vegetative to reproductive phase transition of meristem","1/39","74/5696",0.400531294221651,0.62428319704692,0.592310231798116,"Pp3c12_6520V3",1
"GO:0010035","GO:0010035","response to inorganic substance","4/39","470/5696",0.40360725577628,0.62428319704692,0.592310231798116,"Pp3c5_7110V3/Pp3c10_3020V3/Pp3c13_7900V3/Pp3c10_2540V3",4
"GO:0055065","GO:0055065","metal ion homeostasis","1/39","75/5696",0.404689828466645,0.62428319704692,0.592310231798116,"Pp3c21_15220V3",1
"GO:0009259","GO:0009259","ribonucleotide metabolic process","1/39","76/5696",0.408820249510908,0.62428319704692,0.592310231798116,"Pp3c16_2020V3",1
"GO:0009909","GO:0009909","regulation of flower development","1/39","76/5696",0.408820249510908,0.62428319704692,0.592310231798116,"Pp3c2_31580V3",1
"GO:0051240","GO:0051240","positive regulation of multicellular organismal process","1/39","76/5696",0.408820249510908,0.62428319704692,0.592310231798116,"Pp3c2_31580V3",1
"GO:0051241","GO:0051241","negative regulation of multicellular organismal process","1/39","76/5696",0.408820249510908,0.62428319704692,0.592310231798116,"Pp3c2_31580V3",1
"GO:0051248","GO:0051248","negative regulation of protein metabolic process","1/39","76/5696",0.408820249510908,0.62428319704692,0.592310231798116,"Pp3c19_20280V3",1
"GO:0000910","GO:0000910","cytokinesis","1/39","77/5696",0.412922742441348,0.62428319704692,0.592310231798116,"Pp3c8_2900V3",1
"GO:0015711","GO:0015711","organic anion transport","1/39","77/5696",0.412922742441348,0.62428319704692,0.592310231798116,"Pp3c21_18160V3",1
"GO:0061640","GO:0061640","cytoskeleton-dependent cytokinesis","1/39","77/5696",0.412922742441348,0.62428319704692,0.592310231798116,"Pp3c8_2900V3",1
"GO:0007049","GO:0007049","cell cycle","2/39","206/5696",0.414819620881922,0.625032266599112,0.593020937391652,"Pp3c5_21110V3/Pp3c8_2900V3",2
"GO:0034655","GO:0034655","nucleobase-containing compound catabolic process","1/39","78/5696",0.416997491159053,0.626198252716963,0.59412720696771,"Pp3c16_2020V3",1
"GO:0043161","GO:0043161","proteasome-mediated ubiquitin-dependent protein catabolic process","1/39","80/5696",0.425064485675787,0.636170337622151,0.603588566731425,"Pp3c5_19510V3",1
"GO:0006259","GO:0006259","DNA metabolic process","2/39","211/5696",0.426837603825955,0.636687529452763,0.604079270332808,"Pp3c22_17580V3/Pp3c19_20280V3",2
"GO:0005975","GO:0005975","carbohydrate metabolic process","3/39","349/5696",0.43106563498259,0.640850910674117,0.608029421975443,"Pp3c20_17800V3/Pp3c5_16470V3/Pp3c22_2470V3",3
"GO:0065009","GO:0065009","regulation of molecular function","2/39","214/5696",0.433990870634616,0.643056240209431,0.610121804494197,"Pp3c12_8390V3/Pp3c19_20280V3",2
"GO:0051093","GO:0051093","negative regulation of developmental process","1/39","83/5696",0.436961426014246,0.645313894047529,0.612263831501313,"Pp3c2_31580V3",1
"GO:0010498","GO:0010498","proteasomal protein catabolic process","1/39","85/5696",0.444759096287865,0.646004341474986,0.612918917330527,"Pp3c5_19510V3",1
"GO:0019693","GO:0019693","ribose phosphate metabolic process","1/39","85/5696",0.444759096287865,0.646004341474986,0.612918917330527,"Pp3c16_2020V3",1
"GO:0051094","GO:0051094","positive regulation of developmental process","1/39","85/5696",0.444759096287865,0.646004341474986,0.612918917330527,"Pp3c2_31580V3",1
"GO:0003006","GO:0003006","developmental process involved in reproduction","4/39","496/5696",0.444923007120566,0.646004341474986,0.612918917330527,"Pp3c8_2900V3/Pp3c12_6520V3/Pp3c1_15310V3/Pp3c2_31580V3",4
"GO:0006631","GO:0006631","fatty acid metabolic process","1/39","86/5696",0.448618371861698,0.646004341474986,0.612918917330527,"Pp3c16_17130V3",1
"GO:0051172","GO:0051172","negative regulation of nitrogen compound metabolic process","2/39","221/5696",0.450506076872907,0.646004341474986,0.612918917330527,"Pp3c2_31580V3/Pp3c19_20280V3",2
"GO:0019752","GO:0019752","carboxylic acid metabolic process","3/39","360/5696",0.451418411497602,0.646004341474986,0.612918917330527,"Pp3c16_2020V3/Pp3c10_2540V3/Pp3c16_17130V3",3
"GO:0019220","GO:0019220","regulation of phosphate metabolic process","1/39","87/5696",0.452451506174959,0.646004341474986,0.612918917330527,"Pp3c12_8390V3",1
"GO:0051174","GO:0051174","regulation of phosphorus metabolic process","1/39","87/5696",0.452451506174959,0.646004341474986,0.612918917330527,"Pp3c12_8390V3",1
"GO:0055080","GO:0055080","cation homeostasis","1/39","87/5696",0.452451506174959,0.646004341474986,0.612918917330527,"Pp3c21_15220V3",1
"GO:0042546","GO:0042546","cell wall biogenesis","1/39","88/5696",0.456258671669553,0.646004341474986,0.612918917330527,"Pp3c21_18160V3",1
"GO:0071669","GO:0071669","plant-type cell wall organization or biogenesis","1/39","88/5696",0.456258671669553,0.646004341474986,0.612918917330527,"Pp3c21_18160V3",1
"GO:0072521","GO:0072521","purine-containing compound metabolic process","1/39","88/5696",0.456258671669553,0.646004341474986,0.612918917330527,"Pp3c16_2020V3",1
"GO:0000280","GO:0000280","nuclear division","1/39","89/5696",0.46004003968041,0.647248762452564,0.614099604687115,"Pp3c8_2900V3",1
"GO:0010243","GO:0010243","response to organonitrogen compound","1/39","89/5696",0.46004003968041,0.647248762452564,0.614099604687115,"Pp3c1_10880V3",1
"GO:0098771","GO:0098771","inorganic ion homeostasis","1/39","90/5696",0.463795780442397,0.650480874456947,0.617166182515206,"Pp3c21_15220V3",1
"GO:0006073","GO:0006073","cellular glucan metabolic process","1/39","92/5696",0.471231055700078,0.656778283881984,0.623141067077077,"Pp3c20_17800V3",1
"GO:0009165","GO:0009165","nucleotide biosynthetic process","1/39","92/5696",0.471231055700078,0.656778283881984,0.623141067077077,"Pp3c7_7230V3",1
"GO:0019637","GO:0019637","organophosphate metabolic process","2/39","232/5696",0.47593339413762,0.661265712727036,0.62739867008796,"Pp3c16_2020V3/Pp3c10_2540V3",2
"GO:0098656","GO:0098656","anion transmembrane transport","1/39","95/5696",0.482195957597047,0.667660409944576,0.633465859801084,"Pp3c21_18160V3",1
"GO:0048583","GO:0048583","regulation of response to stimulus","3/39","378/5696",0.484132034987031,0.667660409944576,0.633465859801084,"Pp3c12_6520V3/Pp3c15_3570V3/Pp3c2_31580V3",3
"GO:0019725","GO:0019725","cellular homeostasis","1/39","96/5696",0.485801449054593,0.667660409944576,0.633465859801084,"Pp3c21_15220V3",1
"GO:0006082","GO:0006082","organic acid metabolic process","3/39","381/5696",0.489504115000096,0.667660409944576,0.633465859801084,"Pp3c16_2020V3/Pp3c10_2540V3/Pp3c16_17130V3",3
"GO:0043436","GO:0043436","oxoacid metabolic process","3/39","381/5696",0.489504115000096,0.667660409944576,0.633465859801084,"Pp3c16_2020V3/Pp3c10_2540V3/Pp3c16_17130V3",3
"GO:0009651","GO:0009651","response to salt stress","2/39","238/5696",0.489517834197032,0.667660409944576,0.633465859801084,"Pp3c13_8810V3/Pp3c10_2540V3",2
"GO:0048646","GO:0048646","anatomical structure formation involved in morphogenesis","1/39","99/5696",0.496471774090706,0.675080522086753,0.640505947318562,"Pp3c21_18160V3",1
"GO:0031324","GO:0031324","negative regulation of cellular metabolic process","2/39","243/5696",0.500678372338713,0.678731167364942,0.643969623036834,"Pp3c2_31580V3/Pp3c19_20280V3",2
"GO:0006468","GO:0006468","protein phosphorylation","3/39","390/5696",0.505470042429695,0.683150420980739,0.648162542445733,"Pp3c5_21110V3/Pp3c22_17580V3/Pp3c1_15310V3",3
"GO:0051276","GO:0051276","chromosome organization","2/39","247/5696",0.509499817848612,0.686062920355676,0.650925876759456,"Pp3c5_21110V3/Pp3c22_17580V3",2
"GO:0016570","GO:0016570","histone modification","1/39","104/5696",0.513778061432277,0.686062920355676,0.650925876759456,"Pp3c5_21110V3",1
"GO:0031669","GO:0031669","cellular response to nutrient levels","1/39","104/5696",0.513778061432277,0.686062920355676,0.650925876759456,"Pp3c1_10880V3",1
"GO:0050801","GO:0050801","ion homeostasis","1/39","104/5696",0.513778061432277,0.686062920355676,0.650925876759456,"Pp3c21_15220V3",1
"GO:0045087","GO:0045087","innate immune response","1/39","105/5696",0.517169094265636,0.688529600126786,0.65326622433554,"Pp3c15_3570V3",1
"GO:0031347","GO:0031347","regulation of defense response","1/39","106/5696",0.520537079478235,0.688900704591373,0.653618322505858,"Pp3c15_3570V3",1
"GO:0044042","GO:0044042","glucan metabolic process","1/39","106/5696",0.520537079478235,0.688900704591373,0.653618322505858,"Pp3c20_17800V3",1
"GO:2000026","GO:2000026","regulation of multicellular organismal development","2/39","253/5696",0.522550197229433,0.689237308705454,0.653937687277773,"Pp3c12_6520V3/Pp3c2_31580V3",2
"GO:0009826","GO:0009826","unidimensional cell growth","1/39","107/5696",0.52388216962141,0.689237308705454,0.653937687277773,"Pp3c8_2900V3",1
"GO:0044264","GO:0044264","cellular polysaccharide metabolic process","1/39","108/5696",0.52720451626388,0.690722809113291,0.655347107065242,"Pp3c20_17800V3",1
"GO:0048523","GO:0048523","negative regulation of cellular process","3/39","403/5696",0.528108694860162,0.690722809113291,0.655347107065242,"Pp3c22_17580V3/Pp3c2_31580V3/Pp3c19_20280V3",3
"GO:0048831","GO:0048831","regulation of shoot system development","1/39","109/5696",0.530504269997901,0.691827205903695,0.656394941640985,"Pp3c2_31580V3",1
"GO:0051301","GO:0051301","cell division","1/39","110/5696",0.533781580445382,0.694071676031022,0.658524460147441,"Pp3c8_2900V3",1
"GO:0006955","GO:0006955","immune response","1/39","111/5696",0.53703659626397,0.694256005605016,0.658699349193336,"Pp3c15_3570V3",1
"GO:1901605","GO:1901605","alpha-amino acid metabolic process","1/39","111/5696",0.53703659626397,0.694256005605016,0.658699349193336,"Pp3c16_2020V3",1
"GO:0019941","GO:0019941","modification-dependent protein catabolic process","1/39","113/5696",0.543480333859931,0.700555574859911,0.664676282968337,"Pp3c5_19510V3",1
"GO:0031668","GO:0031668","cellular response to extracellular stimulus","1/39","115/5696",0.549836652990333,0.704657562632965,0.668568185457758,"Pp3c1_10880V3",1
"GO:0050832","GO:0050832","defense response to fungus","1/39","115/5696",0.549836652990333,0.704657562632965,0.668568185457758,"Pp3c20_10270V3",1
"GO:0006820","GO:0006820","anion transport","1/39","116/5696",0.552982392200757,0.704657562632965,0.668568185457758,"Pp3c21_18160V3",1
"GO:0043632","GO:0043632","modification-dependent macromolecule catabolic process","1/39","116/5696",0.552982392200757,0.704657562632965,0.668568185457758,"Pp3c5_19510V3",1
"GO:0071496","GO:0071496","cellular response to external stimulus","1/39","121/5696",0.568392577080415,0.722231023868562,0.685241613394293,"Pp3c1_10880V3",1
"GO:0055085","GO:0055085","transmembrane transport","3/39","429/5696",0.571737900391933,0.724417907882961,0.687316495088389,"Pp3c21_18160V3/Pp3c3_21530V3/Pp3c1_6272V3",3
"GO:0033043","GO:0033043","regulation of organelle organization","1/39","124/5696",0.577388911882662,0.727063795529241,0.68982687232182,"Pp3c8_2900V3",1
"GO:0005976","GO:0005976","polysaccharide metabolic process","1/39","125/5696",0.580346886117511,0.727063795529241,0.68982687232182,"Pp3c20_17800V3",1
"GO:0006457","GO:0006457","protein folding","1/39","125/5696",0.580346886117511,0.727063795529241,0.68982687232182,"Pp3c12_8390V3",1
"GO:0048285","GO:0048285","organelle fission","1/39","125/5696",0.580346886117511,0.727063795529241,0.68982687232182,"Pp3c8_2900V3",1
"GO:0006970","GO:0006970","response to osmotic stress","2/39","283/5696",0.584405948059918,0.73009818721211,0.692705856170093,"Pp3c13_8810V3/Pp3c10_2540V3",2
"GO:0010605","GO:0010605","negative regulation of macromolecule metabolic process","2/39","284/5696",0.586367972563758,0.730503116657642,0.693090046958632,"Pp3c2_31580V3/Pp3c19_20280V3",2
"GO:0006511","GO:0006511","ubiquitin-dependent protein catabolic process","1/39","128/5696",0.589100285343138,0.730846289302064,0.693415643850436,"Pp3c5_19510V3",1
"GO:1902679","GO:1902679","negative regulation of RNA biosynthetic process","1/39","129/5696",0.591978354465196,0.730846289302064,0.693415643850436,"Pp3c2_31580V3",1
"GO:1903507","GO:1903507","negative regulation of nucleic acid-templated transcription","1/39","129/5696",0.591978354465196,0.730846289302064,0.693415643850436,"Pp3c2_31580V3",1
"GO:0051239","GO:0051239","regulation of multicellular organismal process","2/39","288/5696",0.594150741733923,0.730846289302064,0.693415643850436,"Pp3c12_6520V3/Pp3c2_31580V3",2
"GO:0045892","GO:0045892","negative regulation of transcription, DNA-templated","1/39","130/5696",0.594836778064236,0.730846289302064,0.693415643850436,"Pp3c2_31580V3",1
"GO:0031667","GO:0031667","response to nutrient levels","1/39","132/5696",0.600495210223122,0.735771603734925,0.698088705927401,"Pp3c1_10880V3",1
"GO:0010817","GO:0010817","regulation of hormone levels","1/39","133/5696",0.603295477441185,0.737177487503475,0.699422586680191,"Pp3c1_6272V3",1
"GO:1903047","GO:1903047","mitotic cell cycle process","1/39","134/5696",0.606076616463258,0.738552379624626,0.700727063037762,"Pp3c8_2900V3",1
"GO:0009908","GO:0009908","flower development","1/39","135/5696",0.608838754535522,0.739896688073141,0.702002522080252,"Pp3c2_31580V3",1
"GO:0002376","GO:0002376","immune system process","1/39","137/5696",0.614306532701787,0.744512808654883,0.706382225818416,"Pp3c15_3570V3",1
"GO:0009620","GO:0009620","response to fungus","1/39","138/5696",0.617012423190118,0.745765693069898,0.707570943153408,"Pp3c20_10270V3",1
"GO:0090305","GO:0090305","nucleic acid phosphodiester bond hydrolysis","1/39","141/5696",0.625019585667644,0.752685711169157,0.714136549185748,"Pp3c20_10270V3",1
"GO:0018130","GO:0018130","heterocycle biosynthetic process","2/39","306/5696",0.627875236994024,0.752685711169157,0.714136549185748,"Pp3c23_6580V3/Pp3c16_2020V3",2
"GO:0009991","GO:0009991","response to extracellular stimulus","1/39","143/5696",0.630266825006333,0.752685711169157,0.714136549185748,"Pp3c1_10880V3",1
"GO:0051253","GO:0051253","negative regulation of RNA metabolic process","1/39","143/5696",0.630266825006333,0.752685711169157,0.714136549185748,"Pp3c2_31580V3",1
"GO:0006520","GO:0006520","cellular amino acid metabolic process","1/39","144/5696",0.632863546386623,0.752685711169157,0.714136549185748,"Pp3c16_2020V3",1
"GO:0060560","GO:0060560","developmental growth involved in morphogenesis","1/39","144/5696",0.632863546386623,0.752685711169157,0.714136549185748,"Pp3c8_2900V3",1
"GO:0009555","GO:0009555","pollen development","1/39","145/5696",0.635442494817985,0.75374295927878,0.715139649823153,"Pp3c21_18160V3",1
"GO:0048585","GO:0048585","negative regulation of response to stimulus","1/39","147/5696",0.640547545925427,0.754037297091876,0.715418912983087,"Pp3c2_31580V3",1
"GO:0044283","GO:0044283","small molecule biosynthetic process","2/39","314/5696",0.642181669512398,0.754037297091876,0.715418912983087,"Pp3c23_6580V3/Pp3c16_2020V3",2
"GO:0071702","GO:0071702","organic substance transport","2/39","314/5696",0.642181669512398,0.754037297091876,0.715418912983087,"Pp3c21_18160V3/Pp3c3_21530V3",2
"GO:0006281","GO:0006281","DNA repair","1/39","149/5696",0.645582916856499,0.754037297091876,0.715418912983087,"Pp3c19_20280V3",1
"GO:0048366","GO:0048366","leaf development","1/39","149/5696",0.645582916856499,0.754037297091876,0.715418912983087,"Pp3c12_6520V3",1
"GO:0001101","GO:0001101","response to acid chemical","3/39","477/5696",0.645834635625777,0.754037297091876,0.715418912983087,"Pp3c5_7110V3/Pp3c10_3020V3/Pp3c13_7900V3",3
"GO:1901698","GO:1901698","response to nitrogen compound","1/39","150/5696",0.64807476222203,0.75467713825333,0.716025984370636,"Pp3c1_10880V3",1
"GO:0009892","GO:0009892","negative regulation of metabolic process","2/39","319/5696",0.65091069689138,0.7560056531603,0.717286458745435,"Pp3c2_31580V3/Pp3c19_20280V3",2
"GO:0048584","GO:0048584","positive regulation of response to stimulus","1/39","155/5696",0.660280152679088,0.756930391609451,0.718163836268585,"Pp3c2_31580V3",1
"GO:0000902","GO:0000902","cell morphogenesis","1/39","156/5696",0.662671250684053,0.756930391609451,0.718163836268585,"Pp3c8_2900V3",1
"GO:2000113","GO:2000113","negative regulation of cellular macromolecule biosynthetic process","1/39","156/5696",0.662671250684053,0.756930391609451,0.718163836268585,"Pp3c2_31580V3",1
"GO:2000241","GO:2000241","regulation of reproductive process","1/39","156/5696",0.662671250684053,0.756930391609451,0.718163836268585,"Pp3c2_31580V3",1
"GO:0045934","GO:0045934","negative regulation of nucleobase-containing compound metabolic process","1/39","158/5696",0.667404353151606,0.756930391609451,0.718163836268585,"Pp3c2_31580V3",1
"GO:0019438","GO:0019438","aromatic compound biosynthetic process","2/39","329/5696",0.667881113692264,0.756930391609451,0.718163836268585,"Pp3c23_6580V3/Pp3c16_2020V3",2
"GO:0032446","GO:0032446","protein modification by small protein conjugation","1/39","159/5696",0.669746576016736,0.756930391609451,0.718163836268585,"Pp3c12_6520V3",1
"GO:0045893","GO:0045893","positive regulation of transcription, DNA-templated","1/39","159/5696",0.669746576016736,0.756930391609451,0.718163836268585,"Pp3c1_10880V3",1
"GO:0071554","GO:0071554","cell wall organization or biogenesis","1/39","159/5696",0.669746576016736,0.756930391609451,0.718163836268585,"Pp3c21_18160V3",1
"GO:0050793","GO:0050793","regulation of developmental process","2/39","331/5696",0.671197595326842,0.756930391609451,0.718163836268585,"Pp3c12_6520V3/Pp3c2_31580V3",2
"GO:0016192","GO:0016192","vesicle-mediated transport","1/39","160/5696",0.672072724388661,0.756930391609451,0.718163836268585,"Pp3c8_2900V3",1
"GO:0016567","GO:0016567","protein ubiquitination","1/39","160/5696",0.672072724388661,0.756930391609451,0.718163836268585,"Pp3c12_6520V3",1
"GO:0080134","GO:0080134","regulation of response to stress","1/39","161/5696",0.674382905701674,0.757619082979714,0.718817255977921,"Pp3c15_3570V3",1
"GO:0016049","GO:0016049","cell growth","1/39","163/5696",0.678955793398762,0.760839909185547,0.721873126015081,"Pp3c8_2900V3",1
"GO:0010558","GO:0010558","negative regulation of macromolecule biosynthetic process","1/39","164/5696",0.681218711175275,0.761314932807836,0.722323821073283,"Pp3c2_31580V3",1
"GO:0048869","GO:0048869","cellular developmental process","2/39","341/5696",0.687395330833432,0.761314932807836,0.722323821073283,"Pp3c8_2900V3/Pp3c21_18160V3",2
"GO:0006325","GO:0006325","chromatin organization","1/39","167/5696",0.687914614173897,0.761314932807836,0.722323821073283,"Pp3c5_21110V3",1
"GO:1902680","GO:1902680","positive regulation of RNA biosynthetic process","1/39","167/5696",0.687914614173897,0.761314932807836,0.722323821073283,"Pp3c1_10880V3",1
"GO:1903508","GO:1903508","positive regulation of nucleic acid-templated transcription","1/39","167/5696",0.687914614173897,0.761314932807836,0.722323821073283,"Pp3c1_10880V3",1
"GO:0070647","GO:0070647","protein modification by small protein conjugation or removal","1/39","168/5696",0.690115976092367,0.761860706280187,0.722841642493829,"Pp3c12_6520V3",1
"GO:0031327","GO:0031327","negative regulation of cellular biosynthetic process","1/39","171/5696",0.696629672164466,0.763579172976651,0.72447209708901,"Pp3c2_31580V3",1
"GO:0043603","GO:0043603","cellular amide metabolic process","1/39","171/5696",0.696629672164466,0.763579172976651,0.72447209708901,"Pp3c16_2020V3",1
"GO:0016310","GO:0016310","phosphorylation","2/39","347/5696",0.696808796864343,0.763579172976651,0.72447209708901,"Pp3c5_21110V3/Pp3c22_17580V3",2
"GO:0032268","GO:0032268","regulation of cellular protein metabolic process","1/39","172/5696",0.698771109772716,0.763852732741744,0.7247316463587,"Pp3c19_20280V3",1
"GO:0009890","GO:0009890","negative regulation of biosynthetic process","1/39","174/5696",0.703009890358926,0.764737588048978,0.725571183374296,"Pp3c2_31580V3",1
"GO:0048589","GO:0048589","developmental growth","1/39","174/5696",0.703009890358926,0.764737588048978,0.725571183374296,"Pp3c8_2900V3",1
"GO:0018193","GO:0018193","peptidyl-amino acid modification","1/39","176/5696",0.707190532808414,0.767413570882123,0.728110114455071,"Pp3c5_21110V3",1
"GO:0032787","GO:0032787","monocarboxylic acid metabolic process","1/39","179/5696",0.713354183754244,0.771807964841842,0.732279447407176,"Pp3c16_17130V3",1
"GO:0051254","GO:0051254","positive regulation of RNA metabolic process","1/39","180/5696",0.715380500019168,0.771807964841842,0.732279447407176,"Pp3c1_10880V3",1
"GO:1901362","GO:1901362","organic cyclic compound biosynthetic process","2/39","360/5696",0.716431608620006,0.771807964841842,0.732279447407176,"Pp3c23_6580V3/Pp3c16_2020V3",2
"GO:0010557","GO:0010557","positive regulation of macromolecule biosynthetic process","1/39","185/5696",0.725304554347951,0.77782454212605,0.737987882781855,"Pp3c1_10880V3",1
"GO:0022607","GO:0022607","cellular component assembly","2/39","367/5696",0.726566564099383,0.77782454212605,0.737987882781855,"Pp3c14_19650V3/Pp3c21_18160V3",2
"GO:0009793","GO:0009793","embryo development ending in seed dormancy","1/39","186/5696",0.727248506875701,0.77782454212605,0.737987882781855,"Pp3c8_2900V3",1
"GO:0010628","GO:0010628","positive regulation of gene expression","1/39","189/5696",0.733000284624718,0.782100782159388,0.742045113117947,"Pp3c1_10880V3",1
"GO:0046686","GO:0046686","response to cadmium ion","1/39","194/5696",0.742324980478539,0.790159764423456,0.749691350715671,"Pp3c10_2540V3",1
"GO:0045935","GO:0045935","positive regulation of nucleobase-containing compound metabolic process","1/39","195/5696",0.74415146644025,0.790217985791314,0.749746590248072,"Pp3c1_10880V3",1
"GO:0031328","GO:0031328","positive regulation of cellular biosynthetic process","1/39","198/5696",0.749555560902173,0.794065986133894,0.753397513395859,"Pp3c1_10880V3",1
"GO:0022402","GO:0022402","cell cycle process","1/39","200/5696",0.753096329550395,0.795926452558,0.755162695134095,"Pp3c8_2900V3",1
"GO:0048827","GO:0048827","phyllome development","1/39","205/5696",0.761736210756535,0.803040342252118,0.76191224353399,"Pp3c12_6520V3",1
"GO:0009790","GO:0009790","embryo development","1/39","206/5696",0.763428486804704,0.803040342252118,0.76191224353399,"Pp3c8_2900V3",1
"GO:0051128","GO:0051128","regulation of cellular component organization","1/39","210/5696",0.770081244120298,0.808132317359183,0.76674343067829,"Pp3c8_2900V3",1
"GO:0009653","GO:0009653","anatomical structure morphogenesis","2/39","406/5696",0.777743271573693,0.814257040192176,0.772554472875277,"Pp3c8_2900V3/Pp3c21_18160V3",2
"GO:0040007","GO:0040007","growth","1/39","216/5696",0.779719869560676,0.814414664693352,0.772704024561548,"Pp3c8_2900V3",1
"GO:0006979","GO:0006979","response to oxidative stress","1/39","220/5696",0.785925674228517,0.81886496411715,0.776926399752406,"Pp3c3_30190V3",1
"GO:0034654","GO:0034654","nucleobase-containing compound biosynthetic process","1/39","222/5696",0.788964361357072,0.81886496411715,0.776926399752406,"Pp3c16_2020V3",1
"GO:0033554","GO:0033554","cellular response to stress","2/39","416/5696",0.789488642534472,0.81886496411715,0.776926399752406,"Pp3c23_6580V3/Pp3c19_20280V3",2
"GO:0010629","GO:0010629","negative regulation of gene expression","1/39","225/5696",0.793443740420233,0.82105779171096,0.779006920622625,"Pp3c2_31580V3",1
"GO:0044271","GO:0044271","cellular nitrogen compound biosynthetic process","2/39","433/5696",0.808246292263182,0.834439459142081,0.791703239497561,"Pp3c23_6580V3/Pp3c16_2020V3",2
"GO:0044255","GO:0044255","cellular lipid metabolic process","1/39","239/5696",0.81315173823944,0.837565069872495,0.794668770565832,"Pp3c16_17130V3",1
"GO:0048316","GO:0048316","seed development","1/39","246/5696",0.822306169055765,0.844403843348853,0.801157292957845,"Pp3c8_2900V3",1
"GO:1901135","GO:1901135","carbohydrate derivative metabolic process","1/39","247/5696",0.823577739589128,0.844403843348853,0.801157292957845,"Pp3c16_2020V3",1
"GO:0010154","GO:0010154","fruit development","1/39","256/5696",0.834629975305965,0.853772864647845,0.810046475309024,"Pp3c8_2900V3",1
"GO:0010038","GO:0010038","response to metal ion","1/39","263/5696",0.842756892185078,0.859299075283656,0.815289658399882,"Pp3c10_2540V3",1
"GO:0051173","GO:0051173","positive regulation of nitrogen compound metabolic process","1/39","264/5696",0.843885638955698,0.859299075283656,0.815289658399882,"Pp3c1_10880V3",1
"GO:0009888","GO:0009888","tissue development","1/39","271/5696",0.851568759307014,0.865147304444028,0.82083836768114,"Pp3c8_2900V3",1
"GO:0033036","GO:0033036","macromolecule localization","1/39","276/5696",0.85682982677134,0.867586322114297,0.823152469884229,"Pp3c21_18160V3",1
"GO:0010604","GO:0010604","positive regulation of macromolecule metabolic process","1/39","277/5696",0.85786001805472,0.867586322114297,0.823152469884229,"Pp3c1_10880V3",1
"GO:0006629","GO:0006629","lipid metabolic process","1/39","293/5696",0.873393383890394,0.881297396414289,0.836161324896258,"Pp3c16_17130V3",1
"GO:0034645","GO:0034645","cellular macromolecule biosynthetic process","1/39","368/5696",0.92674207062588,0.933017976296032,0.885233010316274,"Pp3c22_17580V3",1
"GO:0009059","GO:0009059","macromolecule biosynthetic process","1/39","387/5696",0.936301488133169,0.940519062404039,0.892349924678839,"Pp3c22_17580V3",1
"GO:1901566","GO:1901566","organonitrogen compound biosynthetic process","1/39","405/5696",0.944230278378849,0.946352144172959,0.897884262349609,"Pp3c23_6580V3",1
"GO:0099402","GO:0099402","plant organ development","1/39","411/5696",0.946652869643603,0.946652869643603,0.898169586020128,"Pp3c12_6520V3",1
