regulator	target	weight
N0.HOG0005670	N0.HOG0000003	0.007767105093333735
N0.HOG0000003	N0.HOG0000095	0.007414762887461853
N0.HOG0000511	N0.HOG0000289	0.007361024306236143
N0.HOG0000225	N0.HOG0000059	0.007170487017434253
N0.HOG0007120	N0.HOG0000080	0.007145200506010645
N0.HOG0003336	N0.HOG0000003	0.00689037196628383
N0.HOG0004781	N0.HOG0000059	0.00676029206181526
N0.HOG0003685	N0.HOG0000003	0.006754103546597176
N0.HOG0001097	N0.HOG0000057	0.006752969707739873
N0.HOG0003683	N0.HOG0000003	0.00672197178424213
N0.HOG0000466	N0.HOG0000003	0.006681286655317297
N0.HOG0000164	N0.HOG0000059	0.006653385524084324
N0.HOG0005951	N0.HOG0000003	0.0066103395327867295
N0.HOG0002310	N0.HOG0000003	0.006581635215616703
N0.HOG0000163	N0.HOG0000717	0.0065383244229074
N0.HOG0000409	N0.HOG0000240	0.00653527889246322
N0.HOG0000730	N0.HOG0000003	0.006463463464367233
N0.HOG0006952	N0.HOG0000003	0.00636378720600646
N0.HOG0004708	N0.HOG0000428	0.006292289897433894
N0.HOG0001530	N0.HOG0000978	0.00628526253288139
A_Z_per_V_A_Z	N0.HOG0000003	0.0062685775722260886
N0.HOG0002184	N0.HOG0000059	0.006238639577604933
N0.HOG0000128	N0.HOG0000156	0.006223961414630227
N0.HOG0001875	N0.HOG0000003	0.006208934378038677
N0.HOG0008640	N0.HOG0000003	0.006195010636538493
N0.HOG0000294	N0.HOG0001148	0.006189827999877944
N0.HOG0001272	N0.HOG0000003	0.006180784760708076
N0.HOG0000628	N0.HOG0000452	0.006166665587327708
N0.HOG0002689	N0.HOG0000738	0.006161817520759847
N0.HOG0000240	N0.HOG0000095	0.00613011716636819
N0.HOG0008502	N0.HOG0000003	0.0061171212771584035
N0.HOG0000226	N0.HOG0000511	0.006110071586177577
N0.HOG0000694	N0.HOG0000003	0.006087889923895777
N0.HOG0000669	N0.HOG0003690	0.00605721612585381
N0.HOG0004710	N0.HOG0002194	0.006040038147661401
N0.HOG0001321	N0.HOG0001041	0.006017510672098904
N0.HOG0000621	N0.HOG0003286	0.006015254140361873
N0.HOG0000187	N0.HOG0000128	0.006005612684871665
N0.HOG0000468	N0.HOG0000099	0.0059632602850316066
N0.HOG0005238	N0.HOG0000511	0.0059503293037641404
N0.HOG0000712	N0.HOG0000003	0.005938265111264108
N0.HOG0000481	N0.HOG0000391	0.005934199485901192
N0.HOG0000059	N0.HOG0009414	0.005933155994070048
N0.HOG0002198	N0.HOG0004508	0.005929159532913783
N0.HOG0000832	N0.HOG0000095	0.005919349687286137
N0.HOG0000507	N0.HOG0000054	0.00591270907035543
N0.HOG0001148	N0.HOG0000469	0.00591204689813567
N0.HOG0000122	N0.HOG0000094	0.00588861848238212
N0.HOG0000742	N0.HOG0000107	0.005886589851250825
N0.HOG0000049	N0.HOG0000631	0.005870035278180144
N0.HOG0000080	N0.HOG0000209	0.005860000491795917
N0.HOG0000369	N0.HOG0001166	0.0058130338172321105
N0.HOG0001086	N0.HOG0000422	0.00576621759157319
N0.HOG0003712	N0.HOG0006768	0.0057543623490324
N0.HOG0001694	N0.HOG0001743	0.005710456805007333
N0.HOG0003377	N0.HOG0000003	0.00571040797236941
N0.HOG0000770	N0.HOG0000083	0.005688851117011683
N0.HOG0000348	N0.HOG0000779	0.005668367804662613
N0.HOG0001273	N0.HOG0003279	0.005655070431228164
N0.HOG0004271	N0.HOG0006851	0.005644790787671793
N0.HOG0005745	N0.HOG0000103	0.005636977771509833
N0.HOG0000099	N0.HOG0002071	0.005631124413637694
N0.HOG0001421	N0.HOG0000550	0.005626902002323483
N0.HOG0001676	N0.HOG0000003	0.005587803533132793
N0.HOG0000599	N0.HOG0000422	0.0055717033888020365
N0.HOG0006712	N0.HOG0000003	0.0055621408591201935
N0.HOG0001758	N0.HOG0000003	0.005556027125452121
N0.HOG0000509	N0.HOG0000227	0.00555158599016827
N0.HOG0001132	N0.HOG0000003	0.00554062498834743
N0.HOG0005661	N0.HOG0001359	0.005539890217309567
N0.HOG0000227	N0.HOG0004801	0.00553833280056152
N0.HOG0003344	N0.HOG0000003	0.005536229133342047
N0.HOG0001635	N0.HOG0000294	0.005534560678134896
N0.HOG0004426	N0.HOG0000107	0.005533733268168187
N0.HOG0000744	N0.HOG0003376	0.00552734381804264
N0.HOG0008602	N0.HOG0000128	0.005521002477085857
V_A_Z_per_Chla_b	N0.HOG0000003	0.005520342949356626
N0.HOG0000723	N0.HOG0000049	0.0055128278612242235
N0.HOG0006523	N0.HOG0000003	0.005507373334928367
N0.HOG0009392	N0.HOG0000128	0.005505294820889794
N0.HOG0000108	N0.HOG0004824	0.005500252344593357
N0.HOG0004761	N0.HOG0000909	0.00549025956408568
N0.HOG0003202	N0.HOG0000003	0.0054901844464606735
N0.HOG0004520	N0.HOG0000138	0.005486974081253122
N0.HOG0006168	N0.HOG0001327	0.005475971395288052
N0.HOG0007234	N0.HOG0000128	0.0054649908743985365
N0.HOG0001081	N0.HOG0000422	0.005454817194934377
N0.HOG0000156	N0.HOG0001131	0.0054481614668536295
N0.HOG0009149	N0.HOG0000128	0.0054462669911635704
N0.HOG0004334	N0.HOG0000031	0.00543939834555908
N0.HOG0003621	N0.HOG0000240	0.005438651441952333
N0.HOG0004432	N0.HOG0001498	0.005438053174653194
N0.HOG0002194	N0.HOG0000003	0.00543800670537633
N0.HOG0005383	N0.HOG0000054	0.0054343450555234245
beta_Car_per_beta_Io	N0.HOG0000059	0.005427297668038407
N0.HOG0003580	N0.HOG0000057	0.005426913009667663
N0.HOG0004772	N0.HOG0000128	0.0054230806714985974
N0.HOG0003744	N0.HOG0000054	0.00541946473901793
N0.HOG0000411	N0.HOG0004405	0.00541889496311114
N0.HOG0001232	N0.HOG0000049	0.00541079854293491
N0.HOG0001183	N0.HOG0000511	0.0054032601272844165
N0.HOG0000210	N0.HOG0000003	0.00540270463743577
N0.HOG0002185	N0.HOG0000095	0.005396503891112053
N0.HOG0003146	N0.HOG0000003	0.0053933818838346964
N0.HOG0004398	N0.HOG0000003	0.005390609804234018
N0.HOG0001326	N0.HOG0001125	0.005389255122271397
N0.HOG0007451	N0.HOG0000080	0.005388622353401873
N0.HOG0001166	N0.HOG0004405	0.005387360974899266
N0.HOG0000136	N0.HOG0000156	0.005384595111219743
N0.HOG0002950	N0.HOG0000281	0.00538380195275021
N0.HOG0004803	N0.HOG0002702	0.00538253147943972
N0.HOG0006651	N0.HOG0000115	0.005382054605342267
N0.HOG0000784	N0.HOG0001081	0.005378915380789897
N0.HOG0005471	N0.HOG0001326	0.00537728685876834
N0.HOG0007128	N0.HOG0000616	0.0053753904279133635
N0.HOG0006909	N0.HOG0000128	0.005373925989083053
N0.HOG0005047	N0.HOG0000059	0.0053700345158020765
9_cis	N0.HOG0000049	0.005369592568405987
N0.HOG0006926	N0.HOG0000031	0.005369311068950456
N0.HOG0005848	N0.HOG0000156	0.005367699643077783
N0.HOG0001596	N0.HOG0000616	0.005367689286056297
N0.HOG0006608	N0.HOG0000003	0.005367199866010687
N0.HOG0003040	N0.HOG0003879	0.005365803824919913
N0.HOG0002748	N0.HOG0005221	0.005365019529376963
N0.HOG0003520	N0.HOG0000031	0.00536202162840167
N0.HOG0008608	N0.HOG0005013	0.005359642791246687
N0.HOG0005597	N0.HOG0000127	0.0053580814584218706
N0.HOG0002722	N0.HOG0000164	0.005357605418052363
N0.HOG0007890	N0.HOG0000003	0.00535719748013053
N0.HOG0002974	N0.HOG0003407	0.005353800186725817
N0.HOG0000788	N0.HOG0000139	0.005350579168305662
N0.HOG0001440	N0.HOG0000226	0.005349330579402135
N0.HOG0003955	N0.HOG0000107	0.005349324513242843
N0.HOG0005037	N0.HOG0000226	0.005348585338140441
N0.HOG0001419	N0.HOG0000369	0.005336166905942076
N0.HOG0001083	N0.HOG0000268	0.0053210656803141364
N0.HOG0001498	N0.HOG0000348	0.0053179422306557
N0.HOG0003879	N0.HOG0000080	0.00531420292240272
N0.HOG0002266	N0.HOG0000080	0.005311349651839903
N0.HOG0002971	N0.HOG0000677	0.005310288266000542
N0.HOG0008507	N0.HOG0003520	0.005292320043556583
N0.HOG0006738	N0.HOG0000003	0.005289243353135883
N0.HOG0000605	N0.HOG0007387	0.0052843064794284265
N0.HOG0000114	N0.HOG0000744	0.005272641738795595
N0.HOG0002769	N0.HOG0000883	0.00526036877716285
N0.HOG0003346	N0.HOG0005919	0.005259941000914814
N0.HOG0002801	N0.HOG0000240	0.0052598025016639734
N0.HOG0006851	N0.HOG0000752	0.005258772020466356
N0.HOG0004106	N0.HOG0000616	0.005258526607496413
N0.HOG0004985	N0.HOG0002455	0.005257807287868898
beta_Car_per_beta_CC	N0.HOG0000057	0.005255154996691033
N0.HOG0004695	N0.HOG0000950	0.0052528922158219
N0.HOG0000054	N0.HOG0000314	0.00525227377113682
N0.HOG0005306	N0.HOG0000054	0.005239731745058228
N0.HOG0006683	N0.HOG0000156	0.005230437379572933
N0.HOG0002061	N0.HOG0005258	0.005176157420050327
N0.HOG0003100	N0.HOG0001175	0.005173190995910602
N0.HOG0004955	N0.HOG0003332	0.00516785189833616
N0.HOG0001338	N0.HOG0003740	0.005166705967082389
N0.HOG0001565	N0.HOG0000057	0.005166362774237607
N0.HOG0007293	N0.HOG0000003	0.005139801433470352
N0.HOG0000598	N0.HOG0000997	0.005139352407644237
N0.HOG0000422	N0.HOG0007031	0.005132146656327557
N0.HOG0003945	N0.HOG0000909	0.005131230153178451
N0.HOG0001017	N0.HOG0004781	0.0051143590341798766
N0.HOG0004549	N0.HOG0000240	0.0051031962890137035
N0.HOG0000681	N0.HOG0007031	0.005095878500804443
N0.HOG0000950	N0.HOG0005893	0.0050953994902118585
N0.HOG0000438	N0.HOG0001821	0.00505616959063254
N0.HOG0001705	N0.HOG0001904	0.00500043527569324
N0.HOG0000127	N0.HOG0000278	0.004990982141506462
N0.HOG0007694	N0.HOG0000003	0.004897252349131403
N0.HOG0008139	N0.HOG0001685	0.004896295668832822
N0.HOG0002928	N0.HOG0007291	0.00488802853727907
N0.HOG0000382	N0.HOG0000511	0.004885200069455167
N0.HOG0002948	N0.HOG0007035	0.004856422226571705
N0.HOG0000305	N0.HOG0000289	0.00485236589179391
N0.HOG0000083	N0.HOG0000438	0.004841772445963458
N0.HOG0000103	N0.HOG0000095	0.0048363570853710534
N0.HOG0002236	N0.HOG0005935	0.004834186978412135
N0.HOG0000924	N0.HOG0000054	0.004828793784520683
N0.HOG0006392	N0.HOG0000095	0.004827447899674173
N0.HOG0003633	N0.HOG0006573	0.004822658630693145
N0.HOG0000458	N0.HOG0000737	0.004818001339186317
N0.HOG0004983	N0.HOG0004052	0.004816802707638287
N0.HOG0003332	N0.HOG0003344	0.004812035299840174
N0.HOG0000057	N0.HOG0000022	0.004811129916538843
N0.HOG0000231	N0.HOG0008640	0.00480524687806413
N0.HOG0003126	N0.HOG0000003	0.004802581355011329
N0.HOG0000391	N0.HOG0005082	0.004799199075316294
N0.HOG0002729	N0.HOG0002892	0.004798700828467037
N0.HOG0000794	N0.HOG0004710	0.004798272450731187
N0.HOG0002010	N0.HOG0000543	0.004792157203228443
N0.HOG0003335	N0.HOG0000059	0.004788509131063525
N0.HOG0003749	N0.HOG0000156	0.00478477608915217
N0.HOG0005171	N0.HOG0000722	0.00478477415836648
N0.HOG0005847	N0.HOG0007120	0.004783186852208923
N0.HOG0000543	N0.HOG0005367	0.004772756761134477
N0.HOG0002942	N0.HOG0000197	0.004772742770962022
N0.HOG0000269	N0.HOG0000059	0.004772534609661322
N0.HOG0000452	N0.HOG0000681	0.004770975665162333
N0.HOG0001420	N0.HOG0000292	0.004768444541334236
N0.HOG0000923	N0.HOG0000003	0.004763074312875603
9_cis_neo	N0.HOG0006036	0.004761065110829777
N0.HOG0005725	N0.HOG0000104	0.004760184030201697
N0.HOG0001150	N0.HOG0000373	0.00476014316003459
N0.HOG0001721	N0.HOG0005280	0.004759572556109794
N0.HOG0002204	N0.HOG0001200	0.004759166691185235
N0.HOG0004559	N0.HOG0000003	0.00475704750343608
N0.HOG0003164	N0.HOG0006036	0.004752587217366279
N0.HOG0002940	N0.HOG0000411	0.0047507263428882085
N0.HOG0003845	N0.HOG0007035	0.004750243804907754
N0.HOG0000614	N0.HOG0000209	0.004747898376083973
N0.HOG0000273	N0.HOG0009880	0.004747061745641356
N0.HOG0007291	N0.HOG0002351	0.00474583754444285
N0.HOG0002033	N0.HOG0002065	0.004740781427219273
N0.HOG0007659	N0.HOG0000226	0.0047355783267776135
N0.HOG0003155	N0.HOG0000339	0.004730170535906656
N0.HOG0000997	N0.HOG0001904	0.0047298521596072
N0.HOG0006899	N0.HOG0000003	0.0047258805892791
N0.HOG0001793	N0.HOG0000227	0.004725280207332047
N0.HOG0002797	N0.HOG0000468	0.00472333371677735
N0.HOG0005309	N0.HOG0002065	0.004722201854530527
N0.HOG0002927	N0.HOG0000511	0.0047190982722004095
N0.HOG0000486	N0.HOG0003712	0.004718111116708813
beta_car_per_9_cis_neox	N0.HOG0001685	0.004715248865837883
N0.HOG0006996	N0.HOG0001319	0.00471409051543829
N0.HOG0006355	N0.HOG0002394	0.004713770201053365
N0.HOG0000360	N0.HOG0005847	0.004708954425513013
N0.HOG0006170	N0.HOG0000059	0.004707534925474707
N0.HOG0007031	N0.HOG0000138	0.004706512669227833
N0.HOG0006988	N0.HOG0000104	0.004699347775687333
N0.HOG0007958	N0.HOG0000156	0.0046989833255756995
N0.HOG0002301	N0.HOG0000883	0.004696264281124277
N0.HOG0000367	N0.HOG0001291	0.0046945424467030004
N0.HOG0000145	N0.HOG0000054	0.00469020538065857
N0.HOG0001878	N0.HOG0002610	0.004688559873191209
N0.HOG0003029	N0.HOG0000947	0.0046854469368345615
N0.HOG0002382	N0.HOG0000921	0.004684521747458833
N0.HOG0000126	N0.HOG0004332	0.004682673200911886
N0.HOG0006774	N0.HOG0000677	0.0046808771851872015
N0.HOG0001199	N0.HOG0003054	0.0046738120469586265
N0.HOG0007861	N0.HOG0003371	0.0046734593130331094
N0.HOG0000724	anthera	0.004666297505380287
N0.HOG0002499	N0.HOG0001049	0.00466511334052187
N0.HOG0000737	N0.HOG0000413	0.004665019032928443
N0.HOG0002393	N0.HOG0006072	0.004664033368038087
N0.HOG0003361	N0.HOG0000422	0.004663086191321115
N0.HOG0006979	N0.HOG0007035	0.00466248321069575
N0.HOG0005281	N0.HOG0000128	0.004661877255426455
N0.HOG0004045	N0.HOG0001056	0.00466176401044953
N0.HOG0004011	N0.HOG0007480	0.00465833468043713
N0.HOG0001913	N0.HOG0000127	0.00465572507660417
Chla	N0.HOG0000057	0.004655533635701115
DHA_per_beta_Io	N0.HOG0001696	0.004651721153261493
N0.HOG0000104	N0.HOG0001596	0.0046470383665666295
N0.HOG0000683	N0.HOG0007838	0.004646948866356877
N0.HOG0007297	N0.HOG0002729	0.004645543774449215
N0.HOG0003593	N0.HOG0001983	0.004642428097609203
N0.HOG0000086	N0.HOG0003164	0.004642415569082973
N0.HOG0008597	N0.HOG0000227	0.004639952121972444
N0.HOG0000733	N0.HOG0002702	0.00463101901716643
N0.HOG0005082	N0.HOG0004260	0.004630235201161697
N0.HOG0008637	N0.HOG0002970	0.004627488007908647
N0.HOG0007035	N0.HOG0000305	0.004624465358759057
N0.HOG0000580	N0.HOG0000103	0.00462279925122815
N0.HOG0003728	N0.HOG0007078	0.004622187984618537
N0.HOG0001062	N0.HOG0000126	0.004621117381426055
N0.HOG0008410	N0.HOG0000794	0.0046124350474323235
N0.HOG0000488	N0.HOG0000294	0.004612398897424613
N0.HOG0000768	N0.HOG0000031	0.0046023657815516235
N0.HOG0004415	N0.HOG0000422	0.004600377557875027
N0.HOG0001959	N0.HOG0000754	0.004596226569329953
N0.HOG0005574	N0.HOG0005156	0.004593578899907656
N0.HOG0000150	N0.HOG0001183	0.004591767852040344
N0.HOG0002159	N0.HOG0000054	0.00459162331982804
N0.HOG0003215	N0.HOG0000614	0.004587832109853877
N0.HOG0000616	N0.HOG0006341	0.00458693204709066
N0.HOG0000656	N0.HOG0001230	0.00458353289988028
N0.HOG0000289	N0.HOG0000700	0.004580580204532412
N0.HOG0006012	N0.HOG0002010	0.0045792139985590735
N0.HOG0002248	6MHO	0.004579011608133197
N0.HOG0005481	N0.HOG0000354	0.004577995588972693
N0.HOG0000846	N0.HOG0008433	0.004577325010673063
N0.HOG0002755	N0.HOG0000413	0.004571011897032096
N0.HOG0004086	N0.HOG0000413	0.004570090262684223
N0.HOG0002130	N0.HOG0002640	0.004568776670915257
N0.HOG0000267	N0.HOG0006588	0.0045672012376647
N0.HOG0005183	N0.HOG0001179	0.004564060586681
N0.HOG0001271	N0.HOG0006253	0.00455621581571525
N0.HOG0000094	N0.HOG0004576	0.00455152881357741
N0.HOG0000550	N0.HOG0005670	0.00455047277729092
N0.HOG0004078	N0.HOG0001097	0.0045463736507897
N0.HOG0001072	N0.HOG0000163	0.00454129020813738
N0.HOG0009880	N0.HOG0002185	0.004537889522925673
6MHO	N0.HOG0000294	0.004536478745929027
N0.HOG0002702	N0.HOG0000099	0.004530371102505188
N0.HOG0000095	N0.HOG0002703	0.004526660973214622
N0.HOG0005833	N0.HOG0003392	0.004525211256612013
N0.HOG0001653	N0.HOG0003845	0.0045202251203766385
N0.HOG0000413	N0.HOG0002971	0.00451852827920842
N0.HOG0000206	N0.HOG0000742	0.004516974022954043
N0.HOG0005304	N0.HOG0004402	0.00451543258118821
N0.HOG0000738	N0.HOG0002640	0.004509084319874603
N0.HOG0007480	N0.HOG0000003	0.004507284028881928
beta_Car_per_beta_CC_beta_Io_DHA	N0.HOG0000273	0.004499810668257897
N0.HOG0001880	N0.HOG0006651	0.004498668379163793
N0.HOG0002321	N0.HOG0002382	0.00448571189359348
N0.HOG0008216	N0.HOG0001685	0.004483981874603626
N0.HOG0006902	N0.HOG0001017	0.004481703551163286
N0.HOG0000646	N0.HOG0005304	0.004473422653427176
N0.HOG0007643	N0.HOG0000128	0.004471473881423776
N0.HOG0003054	N0.HOG0001148	0.004462240362661612
N0.HOG0004973	N0.HOG0000028	0.0044532673109084
N0.HOG0000113	N0.HOG0002713	0.00445065288908574
N0.HOG0001881	N0.HOG0000156	0.004438351667512287
N0.HOG0001125	N0.HOG0000507	0.004433057630083353
N0.HOG0000722	N0.HOG0000108	0.00441718437262363
N0.HOG0004091	N0.HOG0000054	0.00441347276580496
N0.HOG0000117	N0.HOG0006195	0.0044052610919538895
N0.HOG0004452	N0.HOG0001565	0.004400213555939063
N0.HOG0000373	N0.HOG0002132	0.004393247937159758
N0.HOG0010441	N0.HOG0000003	0.004386977790460825
N0.HOG0004997	N0.HOG0000289	0.004382384079491369
N0.HOG0002515	N0.HOG0005481	0.0043787048503393065
N0.HOG0000976	N0.HOG0001323	0.004367632973688812
N0.HOG0004332	N0.HOG0000496	0.004357498044014529
N0.HOG0005243	N0.HOG0000681	0.004348924067260195
N0.HOG0004340	N0.HOG0001758	0.004341891226378744
N0.HOG0000182	N0.HOG0001280	0.004337343146801363
N0.HOG0002210	N0.HOG0003520	0.0043316684575636305
N0.HOG0002094	N0.HOG0001230	0.00432906478574289
N0.HOG0002458	N0.HOG0002237	0.0043257441945536695
N0.HOG0000866	N0.HOG0002369	0.004322769439845974
N0.HOG0001336	N0.HOG0002266	0.004307110619134732
N0.HOG0003031	N0.HOG0000128	0.004294687809647817
N0.HOG0001197	N0.HOG0000003	0.00429406606165978
N0.HOG0004693	N0.HOG0007890	0.00429055371842322
N0.HOG0002847	N0.HOG0008597	0.004289842638795027
N0.HOG0006930	N0.HOG0003227	0.004287574798084893
N0.HOG0001280	N0.HOG0000807	0.004287096729225625
N0.HOG0000909	N0.HOG0000003	0.00428530471675229
N0.HOG0007369	N0.HOG0004915	0.004284564317368337
N0.HOG0002415	N0.HOG0000656	0.0042838562113370286
N0.HOG0005641	N0.HOG0000614	0.00428212764575197
N0.HOG0001403	N0.HOG0003484	0.004276492399343037
N0.HOG0000346	N0.HOG0000646	0.00427648869540121
N0.HOG0000816	N0.HOG0000481	0.00427454204409389
N0.HOG0002562	N0.HOG0000057	0.004271240178429506
N0.HOG0001634	N0.HOG0000621	0.004262624509678987
N0.HOG0000107	N0.HOG0000669	0.004261837038748358
N0.HOG0009672	N0.HOG0000049	0.004261055598527095
N0.HOG0000339	N0.HOG0000694	0.00426014606015859
N0.HOG0001041	N0.HOG0000694	0.004257143491818527
N0.HOG0001771	N0.HOG0000742	0.0042504689459154305
N0.HOG0007069	N0.HOG0006489	0.004249649293904397
N0.HOG0003562	N0.HOG0000095	0.004248640197858558
N0.HOG0000658	N0.HOG0000080	0.004244014393944703
N0.HOG0004282	N0.HOG0000103	0.0042417334943304335
N0.HOG0000516	N0.HOG0001337	0.004238395811622538
N0.HOG0002826	N0.HOG0002321	0.004236135915287637
N0.HOG0003981	N0.HOG0000095	0.0042354524929834134
N0.HOG0000700	N0.HOG0000281	0.00423514787058967
N0.HOG0002713	N0.HOG0002210	0.004232748336844585
N0.HOG0001927	N0.HOG0004659	0.004230685856579796
N0.HOG0000139	N0.HOG0000054	0.0042300642553391565
N0.HOG0005545	N0.HOG0000128	0.004230021585064883
N0.HOG0002472	N0.HOG0000003	0.004229235195674637
N0.HOG0002176	N0.HOG0000616	0.004228210896826053
N0.HOG0001049	N0.HOG0000156	0.00422768221196782
N0.HOG0000138	N0.HOG0001403	0.004227438272705667
N0.HOG0007985	N0.HOG0000621	0.004226220789008018
N0.HOG0008379	N0.HOG0000080	0.00422460070586055
N0.HOG0000473	N0.HOG0000481	0.004224003124378413
N0.HOG0008135	N0.HOG0000240	0.0042203899371483135
N0.HOG0003773	N0.HOG0002413	0.004219689547125463
N0.HOG0001337	N0.HOG0001685	0.0042161132875212
N0.HOG0004219	N0.HOG0003297	0.00421510268251286
N0.HOG0003874	N0.HOG0000275	0.004213743553005197
N0.HOG0001231	N0.HOG0000138	0.004212713499210878
N0.HOG0001179	N0.HOG0000107	0.004210306258221417
N0.HOG0001582	N0.HOG0000054	0.004210064191521255
N0.HOG0002770	N0.HOG0000031	0.00420922900680997
N0.HOG0002209	N0.HOG0000292	0.004206982710357885
N0.HOG0002237	N0.HOG0002586	0.004205360964493463
N0.HOG0000727	N0.HOG0000187	0.004204155126207752
N0.HOG0005004	N0.HOG0000049	0.00420044010669592
N0.HOG0008406	N0.HOG0000108	0.00419977992291814
N0.HOG0001319	N0.HOG0000103	0.0041966539833858535
N0.HOG0004725	N0.HOG0000107	0.004196420043435106
N0.HOG0006180	N0.HOG0000108	0.004195503408729618
N0.HOG0005677	N0.HOG0000391	0.004194385546811917
N0.HOG0003468	N0.HOG0001097	0.00419437109259999
N0.HOG0000677	N0.HOG0005395	0.00419384588928415
N0.HOG0001339	N0.HOG0004402	0.0041937864120766
N0.HOG0000978	N0.HOG0001026	0.00419369214798332
N0.HOG0005258	N0.HOG0007031	0.004191569436514064
N0.HOG0007482	N0.HOG0000128	0.004189742487614827
N0.HOG0003012	N0.HOG0000883	0.00418943996117017
N0.HOG0000515	N0.HOG0000092	0.004187987842463945
N0.HOG0000555	N0.HOG0000742	0.004187754703246974
N0.HOG0000469	N0.HOG0000640	0.004186587072848012
N0.HOG0000372	N0.HOG0001337	0.004183113727509453
N0.HOG0004684	N0.HOG0005013	0.004182013786966697
N0.HOG0000115	N0.HOG0000128	0.00418149344672253
N0.HOG0003190	N0.HOG0001049	0.004180822889327649
N0.HOG0000275	N0.HOG0000156	0.004180188277431764
N0.HOG0005172	N0.HOG0000163	0.0041786792383112096
N0.HOG0003208	N0.HOG0000095	0.004177670441644477
N0.HOG0002498	N0.HOG0000059	0.00417390284437491
N0.HOG0007926	N0.HOG0000054	0.004173611945932955
N0.HOG0001552	N0.HOG0002382	0.004173482768724323
N0.HOG0006129	N0.HOG0000656	0.0041719024590046935
N0.HOG0000292	N0.HOG0004298	0.004170711103177531
N0.HOG0000883	N0.HOG0001685	0.004169190522627057
N0.HOG0006759	N0.HOG0000054	0.004168865668026697
N0.HOG0004155	N0.HOG0003332	0.004166636330229457
N0.HOG0001467	N0.HOG0002393	0.00416538006655957
N0.HOG0005811	N0.HOG0000156	0.004164614145636853
N0.HOG0001175	N0.HOG0000108	0.004164004341092285
N0.HOG0003286	N0.HOG0000156	0.004163663614176752
N0.HOG0003369	N0.HOG0000614	0.004161720985261935
N0.HOG0002455	N0.HOG0002397	0.004161460871184893
N0.HOG0003802	N0.HOG0000481	0.00416138571982843
N0.HOG0007936	N0.HOG0002065	0.004160056813666287
N0.HOG0002021	N0.HOG0000094	0.004159847338318323
N0.HOG0002312	N0.HOG0000003	0.00415961781952939
N0.HOG0006492	N0.HOG0000080	0.004159058953427855
N0.HOG0001725	N0.HOG0000458	0.004158221794125706
N0.HOG0002654	N0.HOG0002132	0.004155960065429863
N0.HOG0001726	N0.HOG0005304	0.004154485898908567
N0.HOG0000031	N0.HOG0002974	0.0041543763133251735
N0.HOG0002181	N0.HOG0000226	0.0041534305490906
N0.HOG0000354	N0.HOG0000103	0.004153328494851673
N0.HOG0000290	N0.HOG0006512	0.004152692591377517
N0.HOG0000778	N0.HOG0000305	0.00415242949309177
N0.HOG0006768	N0.HOG0000128	0.004152182839509945
N0.HOG0005196	N0.HOG0001056	0.004152104301209994
N0.HOG0004631	N0.HOG0000289	0.004150440822245124
N0.HOG0004293	N0.HOG0000104	0.004150118173613337
N0.HOG0003279	N0.HOG0005499	0.004150039895642966
N0.HOG0001027	N0.HOG0000683	0.0041498748435488736
N0.HOG0005728	N0.HOG0000273	0.0041497043162541
N0.HOG0004110	N0.HOG0000128	0.00414850589355799
N0.HOG0000157	N0.HOG0006516	0.004148394894947593
N0.HOG0001487	N0.HOG0000677	0.00414834934452734
N0.HOG0004126	N0.HOG0000411	0.0041474199676757965
N0.HOG0003378	N0.HOG0000104	0.004147403811194745
N0.HOG0005178	N0.HOG0000059	0.0041460417516390865
N0.HOG0003746	N0.HOG0001582	0.004145483632089686
N0.HOG0001396	N0.HOG0000049	0.00414537840290902
N0.HOG0008530	N0.HOG0000738	0.004145156017984447
N0.HOG0000092	N0.HOG0002826	0.0041448433583038
N0.HOG0010155	N0.HOG0004340	0.0041443912296790664
N0.HOG0003284	N0.HOG0004631	0.004142609941204892
N0.HOG0001685	N0.HOG0003376	0.004140433543733147
N0.HOG0004127	N0.HOG0000779	0.00414037972950387
N0.HOG0009905	N0.HOG0000150	0.004140363441790929
N0.HOG0001229	N0.HOG0000468	0.004137720600204737
N0.HOG0003407	N0.HOG0007078	0.004137205235013963
N0.HOG0000022	N0.HOG0000080	0.004137116589136816
N0.HOG0001085	N0.HOG0000662	0.004136367750462787
N0.HOG0007698	N0.HOG0000156	0.0041363431059001435
N0.HOG0007595	N0.HOG0000752	0.004136296884820947
N0.HOG0004053	N0.HOG0004415	0.00413535320177091
N0.HOG0006341	N0.HOG0000292	0.004134282121738587
N0.HOG0001369	N0.HOG0001253	0.00413345648751104
N0.HOG0003723	N0.HOG0000289	0.0041328930964321265
N0.HOG0003735	N0.HOG0000294	0.00413146378219022
N0.HOG0000205	N0.HOG0003378	0.004131050955550437
N0.HOG0001743	N0.HOG0008913	0.004130310251086229
N0.HOG0000754	N0.HOG0001323	0.004129768768653616
N0.HOG0008024	N0.HOG0001230	0.004128250056118604
N0.HOG0004085	N0.HOG0001851	0.00412785769591286
N0.HOG0003036	N0.HOG0000733	0.004127315886707987
N0.HOG0000281	N0.HOG0001721	0.004125826771637629
N0.HOG0004678	N0.HOG0000413	0.004125555494433514
DHA	N0.HOG0000794	0.00412480282105508
N0.HOG0005324	N0.HOG0000028	0.004123880193537166
N0.HOG0005733	N0.HOG0001403	0.004122808920320067
N0.HOG0000717	N0.HOG0001904	0.004121323237868257
N0.HOG0000679	N0.HOG0000128	0.0041207548657781045
N0.HOG0003371	N0.HOG0000027	0.004119593496454757
N0.HOG0004446	N0.HOG0000163	0.0041189341104637366
N0.HOG0003138	N0.HOG0004126	0.004116925834529053
N0.HOG0009121	N0.HOG0000373	0.004116251798541968
N0.HOG0004288	N0.HOG0000094	0.0041160959367293115
N0.HOG0000841	N0.HOG0000265	0.004114822964439675
N0.HOG0003334	N0.HOG0002198	0.004114273214927483
N0.HOG0005280	N0.HOG0003852	0.0041131656199891444
N0.HOG0000027	N0.HOG0000616	0.00411306689052847
N0.HOG0007466	N0.HOG0001771	0.004112944990426625
N0.HOG0006489	N0.HOG0000511	0.004112906830904596
N0.HOG0002504	N0.HOG0000054	0.004111854442860214
N0.HOG0007759	N0.HOG0000057	0.00411180690849423
N0.HOG0001538	N0.HOG0002210	0.004111171613837777
N0.HOG0000428	N0.HOG0000265	0.004110732511408774
N0.HOG0004714	N0.HOG0000003	0.004110570857816616
N0.HOG0007314	N0.HOG0008406	0.00410999101295404
N0.HOG0003701	N0.HOG0000486	0.004108620956839103
N0.HOG0001286	N0.HOG0001086	0.00410787643875266
N0.HOG0005025	N0.HOG0007108	0.00410712192934723
N0.HOG0007728	N0.HOG0000080	0.004106444751966003
N0.HOG0004264	N0.HOG0003014	0.004105654000004925
N0.HOG0005837	N0.HOG0006531	0.004104907685047878
N0.HOG0004143	N0.HOG0001369	0.004104864139553709
N0.HOG0001439	N0.HOG0002321	0.00410417777916367
N0.HOG0001718	N0.HOG0003633	0.00410416613093791
N0.HOG0005245	N0.HOG0000289	0.0041021748777221164
N0.HOG0000198	N0.HOG0001272	0.004101496309380587
N0.HOG0002092	N0.HOG0003852	0.004101305773673534
N0.HOG0003476	N0.HOG0000462	0.004100009264601054
N0.HOG0002017	N0.HOG0000511	0.004099922469600986
N0.HOG0003522	N0.HOG0006979	0.004099407236397113
N0.HOG0001751	N0.HOG0000103	0.004097122822893603
N0.HOG0003869	N0.HOG0002422	0.0040964580694177665
N0.HOG0000297	N0.HOG0001878	0.004095662629377653
N0.HOG0001026	N0.HOG0000031	0.004094663734503771
N0.HOG0003411	N0.HOG0004807	0.004094342688101667
N0.HOG0001686	N0.HOG0000550	0.004093762111865063
N0.HOG0001291	N0.HOG0000422	0.004093197747457873
N0.HOG0004283	N0.HOG0000054	0.004092818257139904
N0.HOG0008433	N0.HOG0000150	0.004092179903771473
N0.HOG0002388	N0.HOG0005013	0.004088808319536437
N0.HOG0003778	N0.HOG0000083	0.004088640552896714
N0.HOG0006849	N0.HOG0002393	0.0040857940187692164
N0.HOG0002405	N0.HOG0000031	0.004085595267280483
N0.HOG0004402	N0.HOG0004824	0.004085118277740973
N0.HOG0004298	N0.HOG0000240	0.0040847083665995305
N0.HOG0005528	N0.HOG0001274	0.004082363743242195
N0.HOG0006891	N0.HOG0000225	0.0040822971517609705
N0.HOG0006684	N0.HOG0000107	0.00408221919734053
N0.HOG0005013	N0.HOG0006651	0.004082134414711443
N0.HOG0004659	N0.HOG0000057	0.0040821143096346265
N0.HOG0000073	N0.HOG0004659	0.00408170201987987
N0.HOG0002071	N0.HOG0000059	0.004081572043115893
N0.HOG0008603	N0.HOG0000696	0.0040799381311762365
N0.HOG0001828	N0.HOG0000107	0.004079184848005494
N0.HOG0006394	N0.HOG0000846	0.004078348621604873
N0.HOG0007159	N0.HOG0001793	0.004078062132478006
N0.HOG0001885	N0.HOG0004340	0.004077511406849933
N0.HOG0002124	N0.HOG0000794	0.004076825679397017
N0.HOG0007832	N0.HOG0000411	0.004076542578239385
N0.HOG0005699	N0.HOG0001685	0.004076351773261637
N0.HOG0000921	N0.HOG0000754	0.00407446223309096
N0.HOG0002422	N0.HOG0003744	0.0040733308966380095
N0.HOG0002609	N0.HOG0000712	0.00407300198822141
N0.HOG0012821	N0.HOG0000226	0.004072428438228343
N0.HOG0002283	N0.HOG0000543	0.0040723675904166465
N0.HOG0007392	N0.HOG0000059	0.00407189428628271
N0.HOG0001347	N0.HOG0000515	0.004071630794936345
N0.HOG0007106	N0.HOG0000107	0.004071609050386265
N0.HOG0001696	N0.HOG0004293	0.004070379976077767
N0.HOG0005204	N0.HOG0004187	0.00406982127304412
N0.HOG0002397	N0.HOG0000556	0.004068511173017878
N0.HOG0004807	N0.HOG0003202	0.00406809367804395
N0.HOG0004405	N0.HOG0000054	0.004067534049061963
N0.HOG0006195	N0.HOG0000413	0.004067372634503905
N0.HOG0006897	N0.HOG0001024	0.00406679212323551
N0.HOG0000812	N0.HOG0003975	0.004066413733672421
beta_car	N0.HOG0000678	0.00406560430722599
N0.HOG0000783	N0.HOG0000027	0.004065341169377397
N0.HOG0002293	N0.HOG0002962	0.004065087958255873
N0.HOG0006417	N0.HOG0000128	0.0040640524619863765
N0.HOG0001304	N0.HOG0001721	0.004064014780025425
N0.HOG0001218	N0.HOG0000511	0.00406371963674711
N0.HOG0004424	N0.HOG0000339	0.00406368271716256
N0.HOG0000890	N0.HOG0000267	0.00406303028789194
N0.HOG0001230	N0.HOG0000422	0.004062869135589344
N0.HOG0001323	N0.HOG0003279	0.00406259787539917
N0.HOG0000123	N0.HOG0004057	0.004062309648484385
N0.HOG0001160	N0.HOG0000103	0.00406202306575443
N0.HOG0002343	N0.HOG0000226	0.00406194383811426
N0.HOG0003774	N0.HOG0007369	0.004061716660185905
N0.HOG0006914	N0.HOG0001420	0.004061389718792677
N0.HOG0003394	N0.HOG0000422	0.004060379439904517
N0.HOG0001200	N0.HOG0002610	0.004060346312714778
N0.HOG0004462	N0.HOG0000511	0.004060073367437483
N0.HOG0005603	N0.HOG0000054	0.004059554765588137
N0.HOG0007967	N0.HOG0002382	0.004059348673685434
N0.HOG0001141	N0.HOG0001086	0.004059297817671615
N0.HOG0000268	N0.HOG0005293	0.004058912250933252
N0.HOG0004738	N0.HOG0000156	0.0040582701810066065
N0.HOG0004801	N0.HOG0000647	0.004057696760608144
N0.HOG0005298	N0.HOG0002485	0.00405677781779843
alpha_car	N0.HOG0000883	0.004055766702394211
N0.HOG0002716	N0.HOG0000422	0.004055748208728217
N0.HOG0006291	N0.HOG0000226	0.0040555256587141795
N0.HOG0000752	N0.HOG0002248	0.004055106104472325
N0.HOG0001600	N0.HOG0000273	0.00405490733405901
N0.HOG0000984	N0.HOG0000694	0.004054888218457585
N0.HOG0007866	N0.HOG0000473	0.004053835705256783
N0.HOG0004111	N0.HOG0000468	0.004053682028085363
N0.HOG0007105	N0.HOG0000103	0.00405322114485981
N0.HOG0006573	N0.HOG0000054	0.004053159498784183
N0.HOG0005515	N0.HOG0000031	0.00405277105409737
N0.HOG0000947	N0.HOG0000123	0.004052414620802673
N0.HOG0001839	N0.HOG0000737	0.004051931402720994
N0.HOG0005293	N0.HOG0000413	0.0040511850752927
N0.HOG0002200	N0.HOG0000136	0.0040506737674493665
N0.HOG0002369	N0.HOG0005919	0.004049907141207963
N0.HOG0004824	N0.HOG0007322	0.004049690798205856
N0.HOG0007394	N0.HOG0002393	0.0040488860058691765
N0.HOG0008861	N0.HOG0000027	0.004048607587839217
N0.HOG0003047	N0.HOG0000683	0.004048474119427924
N0.HOG0006666	N0.HOG0000059	0.004048465087194555
viol	N0.HOG0001359	0.00404806765335191
N0.HOG0006072	N0.HOG0000080	0.004048017173737833
N0.HOG0003041	N0.HOG0000516	0.00404781919789035
N0.HOG0001802	N0.HOG0002499	0.004047506614155857
N0.HOG0000028	N0.HOG0005254	0.004047439953646612
N0.HOG0004915	N0.HOG0000054	0.004047010936736365
N0.HOG0006190	N0.HOG0000346	0.004047009328699463
N0.HOG0001274	N0.HOG0000452	0.00404697640414642
N0.HOG0003484	N0.HOG0000305	0.004046698608868313
N0.HOG0006698	N0.HOG0000268	0.004046306542227181
N0.HOG0004383	N0.HOG0000294	0.004046221495342877
N0.HOG0002070	N0.HOG0000733	0.004046143399676201
N0.HOG0004068	N0.HOG0000226	0.004045587111039266
N0.HOG0002851	N0.HOG0000580	0.004043717693435794
N0.HOG0000556	N0.HOG0007387	0.004043574977109172
N0.HOG0002413	N0.HOG0001875	0.004043570636283434
N0.HOG0002586	N0.HOG0004415	0.004043363574493876
N0.HOG0002892	N0.HOG0000292	0.0040427774454835615
N0.HOG0001851	N0.HOG0005551	0.004042575061226419
N0.HOG0005893	N0.HOG0000156	0.004040778554645339
N0.HOG0002065	N0.HOG0002236	0.00403994566439542
N0.HOG0002488	N0.HOG0003773	0.00403967906759405
N0.HOG0000427	N0.HOG0000031	0.0040394079227770935
N0.HOG0000283	N0.HOG0001125	0.004039406483908855
N0.HOG0007838	N0.HOG0003062	0.00403817156167126
N0.HOG0006046	N0.HOG0000816	0.004037996493238646
N0.HOG0005221	N0.HOG0000103	0.004037794220283763
N0.HOG0003714	Chla_per_b	0.004037664327905237
N0.HOG0000595	N0.HOG0008507	0.004037539893337404
N0.HOG0001186	N0.HOG0005528	0.004037337441982808
N0.HOG0005805	N0.HOG0001530	0.00403731666392789
N0.HOG0001056	N0.HOG0004955	0.004037004105547026
N0.HOG0000462	N0.HOG0001725	0.004036984780507504
N0.HOG0002394	N0.HOG0005258	0.00403663462638885
N0.HOG0007099	N0.HOG0002836	0.0040343628578922664
N0.HOG0008009	N0.HOG0001396	0.004034110753997083
N0.HOG0002610	N0.HOG0000139	0.004033956762438873
N0.HOG0001934	N0.HOG0000486	0.004033268406285606
N0.HOG0003014	N0.HOG0007047	0.00403229079456163
N0.HOG0007322	N0.HOG0007482	0.004032172013630659
N0.HOG0000844	N0.HOG0003368	0.00403032905097533
N0.HOG0002858	N0.HOG0000054	0.004029216961808397
N0.HOG0007440	N0.HOG0000054	0.004028659232913423
N0.HOG0005551	N0.HOG0000413	0.004028191660050512
N0.HOG0001416	N0.HOG0004693	0.004028064265618133
N0.HOG0000828	N0.HOG0000794	0.00402792343771159
N0.HOG0002351	N0.HOG0001319	0.004027793891623183
N0.HOG0003592	N0.HOG0000890	0.004027628948660265
N0.HOG0000662	N0.HOG0000126	0.0040264635964991765
N0.HOG0004041	N0.HOG0007159	0.004025192759836204
N0.HOG0002320	N0.HOG0006698	0.004025178369274543
N0.HOG0005584	N0.HOG0000080	0.00402329184731767
N0.HOG0000640	N0.HOG0002637	0.004023190035063974
N0.HOG0009473	N0.HOG0000976	0.0040229188378473535
beta_Io	N0.HOG0005603	0.004022753591311591
N0.HOG0005729	N0.HOG0001530	0.004021929815345744
N0.HOG0006560	N0.HOG0001596	0.00402138293324246
N0.HOG0006588	N0.HOG0000646	0.0040204791554878366
N0.HOG0001031	N0.HOG0000509	0.00402002556490024
N0.HOG0001584	N0.HOG0000683	0.004019481584409299
N0.HOG0003843	N0.HOG0000656	0.004018772369736553
N0.HOG0002180	N0.HOG0000909	0.0040181702677817965
N0.HOG0001529	N0.HOG0000094	0.0040178847588529815
N0.HOG0005482	N0.HOG0007293	0.004017377923812173
N0.HOG0005235	N0.HOG0001725	0.004016611937615726
N0.HOG0003984	N0.HOG0004027	0.004016534201561583
N0.HOG0007606	N0.HOG0002382	0.004015718437504293
N0.HOG0001583	N0.HOG0000722	0.00401568645380658
N0.HOG0001234	N0.HOG0000744	0.004015506913641123
N0.HOG0001438	N0.HOG0000031	0.004015386218082166
N0.HOG0005469	N0.HOG0003712	0.00401508605730987
N0.HOG0000663	N0.HOG0000768	0.004014933722821456
N0.HOG0005962	N0.HOG0000150	0.0040147872998207434
N0.HOG0004052	N0.HOG0000631	0.004014280093456597
N0.HOG0001039	N0.HOG0006492	0.004013702769379213
N0.HOG0005499	N0.HOG0000054	0.004013665723267593
N0.HOG0000353	N0.HOG0003375	0.004013051592478243
N0.HOG0001262	N0.HOG0000413	0.00401304090999979
N0.HOG0004195	N0.HOG0000054	0.004011278132312403
N0.HOG0001904	N0.HOG0002797	0.004010917284504173
N0.HOG0004187	N0.HOG0000694	0.004010864435398987
N0.HOG0007047	N0.HOG0000663	0.004010721580322063
N0.HOG0003227	N0.HOG0003346	0.00401061942396951
N0.HOG0002232	N0.HOG0001635	0.00401021283137148
N0.HOG0003852	N0.HOG0000683	0.00400983130878972
N0.HOG0007717	N0.HOG0001721	0.00400962177002207
N0.HOG0002403	N0.HOG0003361	0.004008890732359403
N0.HOG0006025	N0.HOG0003376	0.0040085914107743995
N0.HOG0002132	N0.HOG0003850	0.004008158584008377
N0.HOG0004484	N0.HOG0000080	0.004007004973053246
N0.HOG0004664	N0.HOG0003036	0.00400662454878597
N0.HOG0005297	N0.HOG0000226	0.004006119224571352
N0.HOG0007320	N0.HOG0000057	0.004005862684091443
N0.HOG0003690	N0.HOG0007322	0.004005568989881916
N0.HOG0006931	N0.HOG0000027	0.004005002400414415
N0.HOG0000631	N0.HOG0000094	0.004004021380859871
N0.HOG0000208	N0.HOG0003601	0.0040037280880757635
N0.HOG0002726	N0.HOG0002065	0.00400288842895446
N0.HOG0002032	N0.HOG0000028	0.00400283224052669
N0.HOG0005435	N0.HOG0000267	0.00400266534452196
N0.HOG0004509	N0.HOG0000511	0.004002210146119465
N0.HOG0006591	N0.HOG0000816	0.003999966875223884
N0.HOG0004067	N0.HOG0005013	0.003999856664539697
N0.HOG0000204	N0.HOG0007466	0.00399920881373341
N0.HOG0002617	N0.HOG0003368	0.003999074438202537
N0.HOG0001131	N0.HOG0000369	0.00399894984256105
N0.HOG0008729	N0.HOG0000080	0.003998227643547837
N0.HOG0005708	N0.HOG0002184	0.00399818591502451
N0.HOG0000766	N0.HOG0000031	0.003996476901194147
N0.HOG0008709	N0.HOG0005172	0.0039964702028724396
N0.HOG0003561	N0.HOG0001271	0.0039961821208187465
N0.HOG0006559	N0.HOG0003286	0.003995875690556862
N0.HOG0007998	N0.HOG0000507	0.003995492384822656
N0.HOG0004674	N0.HOG0000656	0.003995231628100913
N0.HOG0007131	N0.HOG0000031	0.0039950921050481555
N0.HOG0005752	N0.HOG0000027	0.003994765343091445
N0.HOG0006098	N0.HOG0000054	0.003994007801619789
N0.HOG0000807	N0.HOG0005482	0.003993952475386403
N0.HOG0001359	N0.HOG0002403	0.0039938330332427215
N0.HOG0002970	N0.HOG0006039	0.003993800338129103
N0.HOG0006885	N0.HOG0006195	0.0039934505625736794
N0.HOG0000858	N0.HOG0004015	0.003993343519498607
N0.HOG0007463	N0.HOG0000208	0.003992750493280423
N0.HOG0002048	N0.HOG0008530	0.003992439256557246
Zeax	N0.HOG0003945	0.00399220248367604
N0.HOG0005059	N0.HOG0006897	0.003991841986770677
N0.HOG0001253	N0.HOG0001436	0.003991619908866886
N0.HOG0007223	N0.HOG0005258	0.0039910005321909135
N0.HOG0007368	N0.HOG0000683	0.003990755716175545
N0.HOG0006743	N0.HOG0000621	0.0039903222270952715
N0.HOG0002485	N0.HOG0000828	0.003989321686963993
N0.HOG0001327	N0.HOG0002760	0.003987345448258297
N0.HOG0004984	N0.HOG0000481	0.003987260102153423
N0.HOG0001470	N0.HOG0001530	0.003987218339289147
N0.HOG0006257	N0.HOG0000314	0.003986525826852046
N0.HOG0006621	N0.HOG0000422	0.0039857753092209436
N0.HOG0002640	N0.HOG0005355	0.00398532543327978
N0.HOG0005334	N0.HOG0001743	0.003984955774389557
N0.HOG0004478	N0.HOG0000297	0.00398452190318653
N0.HOG0004576	N0.HOG0000182	0.003983677492270133
N0.HOG0005919	N0.HOG0000128	0.003983081843874
N0.HOG0008383	N0.HOG0005919	0.0039830685694415896
N0.HOG0005367	N0.HOG0008406	0.003982811361426104
N0.HOG0003357	N0.HOG0000737	0.00398264018961615
N0.HOG0000886	N0.HOG0003208	0.00398245143614481
N0.HOG0001983	N0.HOG0000128	0.0039823772500237565
N0.HOG0003368	N0.HOG0006930	0.003981948031798683
N0.HOG0000750	N0.HOG0000737	0.003981935378486751
N0.HOG0003702	N0.HOG0007131	0.003980752143158694
N0.HOG0002637	N0.HOG0004415	0.003980425108619273
N0.HOG0006161	N0.HOG0001230	0.0039785195493394765
N0.HOG0002760	N0.HOG0009121	0.003978384467033477
N0.HOG0004925	N0.HOG0002061	0.003977877016840554
N0.HOG0006512	N0.HOG0000909	0.00397661500049633
beta_Car_per_DHA	N0.HOG0002198	0.003976308950163886
N0.HOG0006252	N0.HOG0000346	0.003975682388020253
N0.HOG0007108	N0.HOG0000486	0.00397534686855469
N0.HOG0006846	N0.HOG0000294	0.0039740250362369665
N0.HOG0000799	N0.HOG0002048	0.00397304528972001
N0.HOG0005935	N0.HOG0000294	0.00397228563347231
N0.HOG0005048	N0.HOG0006979	0.00397198700857643
N0.HOG0003414	N0.HOG0005004	0.00397056141482126
N0.HOG0001063	N0.HOG0002181	0.00396965764010852
N0.HOG0009414	N0.HOG0000614	0.003969415697275417
N0.HOG0007387	N0.HOG0007322	0.003969235891062964
N0.HOG0001821	N0.HOG0001031	0.003968885694631013
N0.HOG0002164	N0.HOG0000511	0.003968618685193687
N0.HOG0003899	N0.HOG0000598	0.003968249937206523
N0.HOG0006741	N0.HOG0004781	0.0039678994126813695
N0.HOG0003618	N0.HOG0000724	0.003967577796018267
N0.HOG0003297	N0.HOG0000737	0.003967347674656906
N0.HOG0000314	N0.HOG0000621	0.00396603246432356
N0.HOG0005989	N0.HOG0000080	0.003964405171016743
N0.HOG0000711	N0.HOG0000240	0.00396437273918639
N0.HOG0006703	N0.HOG0002562	0.003962578084265078
N0.HOG0003740	N0.HOG0002092	0.003961979655569783
N0.HOG0003382	N0.HOG0000086	0.003961475506979985
N0.HOG0006036	N0.HOG0001470	0.003960380921702801
N0.HOG0001660	N0.HOG0000057	0.003960281931065973
N0.HOG0006296	N0.HOG0007330	0.003959743222157812
N0.HOG0005355	N0.HOG0000409	0.0039590482739973835
N0.HOG0003375	N0.HOG0000054	0.003957610612675874
N0.HOG0005533	N0.HOG0002713	0.00395760553943526
N0.HOG0005569	N0.HOG0000226	0.003957134327337133
N0.HOG0003376	N0.HOG0005545	0.003956801287288383
N0.HOG0006199	N0.HOG0003369	0.003955365685223585
N0.HOG0009222	N0.HOG0000314	0.003954931173526884
N0.HOG0005326	N0.HOG0000360	0.003953921977553628
N0.HOG0010131	N0.HOG0000292	0.00395366570065365
N0.HOG0000478	N0.HOG0000923	0.003953471149524483
N0.HOG0001747	N0.HOG0000846	0.00395258328508851
N0.HOG0003496	N0.HOG0002858	0.003951228176245258
N0.HOG0001644	N0.HOG0000909	0.003950990926299322
N0.HOG0001524	N0.HOG0006170	0.0039508170179887465
N0.HOG0003975	N0.HOG0000909	0.003949582584723047
N0.HOG0006057	N0.HOG0000225	0.003944863804673613
N0.HOG0003392	N0.HOG0001081	0.00394465582323566
N0.HOG0001024	N0.HOG0002194	0.003944452609021297
N0.HOG0001325	N0.HOG0005221	0.003943911550585803
N0.HOG0000779	N0.HOG0001024	0.003943329307078653
N0.HOG0007577	N0.HOG0002504	0.003942537437780273
N0.HOG0005932	N0.HOG0001179	0.003942267847380397
N0.HOG0000496	N0.HOG0006492	0.0039419630040560365
N0.HOG0001087	N0.HOG0001875	0.0039387961462453765
N0.HOG0005044	N0.HOG0001758	0.003938696845852873
N0.HOG0005600	N0.HOG0000722	0.00393785924988878
N0.HOG0007296	N0.HOG0000123	0.0039378113479237205
N0.HOG0005291	N0.HOG0002209	0.00393713220740417
N0.HOG0007098	N0.HOG0005334	0.0039367206699218536
N0.HOG0007475	N0.HOG0001231	0.00393671179854609
N0.HOG0007078	N0.HOG0006712	0.003936658986308849
N0.HOG0002836	N0.HOG0000103	0.003936524991208106
N0.HOG0006229	N0.HOG0000107	0.003936524017662071
N0.HOG0006336	N0.HOG0001273	0.00393523541890195
N0.HOG0000265	N0.HOG0003155	0.003934890327850063
N0.HOG0001322	N0.HOG0000909	0.003934278941173416
N0.HOG0002269	N0.HOG0001253	0.003933657101771238
N0.HOG0004015	N0.HOG0007606	0.00393143576801277
N0.HOG0004820	N0.HOG0004462	0.00393134638100668
Lut	N0.HOG0000128	0.003930972086084315
N0.HOG0006143	N0.HOG0005569	0.00392826506652099
N0.HOG0000696	N0.HOG0002176	0.003926944764953556
N0.HOG0003062	N0.HOG0000080	0.00392599896395056
N0.HOG0006682	N0.HOG0003407	0.003925239508037174
N0.HOG0004260	N0.HOG0000452	0.003924885855423885
N0.HOG0001330	N0.HOG0002132	0.003922020259720178
N0.HOG0001064	N0.HOG0000080	0.003919873784069503
N0.HOG0004027	N0.HOG0004985	0.003919391136803689
N0.HOG0006039	N0.HOG0001530	0.00391837179423055
N0.HOG0005395	N0.HOG0000909	0.003917776571097924
N0.HOG0006321	N0.HOG0000198	0.003914656673980953
N0.HOG0006957	N0.HOG0000057	0.00391206351007116
N0.HOG0004508	N0.HOG0000080	0.00391125083101926
N0.HOG0000943	N0.HOG0003899	0.003907721990128517
N0.HOG0003917	N0.HOG0000428	0.0039053473972955966
N0.HOG0006531	N0.HOG0000516	0.00390493190173995
N0.HOG0000277	N0.HOG0000556	0.003903468977161933
N0.HOG0003333	N0.HOG0001085	0.0039015052867440118
N0.HOG0004239	N0.HOG0006897	0.003899787349008785
N0.HOG0001060	N0.HOG0000663	0.0038983761938843403
N0.HOG0002996	N0.HOG0001271	0.0038979606229102666
N0.HOG0000197	N0.HOG0000297	0.00389752995451648
N0.HOG0000278	N0.HOG0005204	0.0038938172494386697
N0.HOG0005006	N0.HOG0003190	0.0038929565091748
N0.HOG0005316	N0.HOG0005837	0.003891561275571013
N0.HOG0001436	N0.HOG0000511	0.0038908291682387968
N0.HOG0000678	N0.HOG0001747	0.0038857686116957
N0.HOG0006726	N0.HOG0002755	0.0038850158465113032
N0.HOG0003588	N0.HOG0003981	0.0038831873016980634
N0.HOG0005742	N0.HOG0000832	0.0038808956398912655
Chla_per_b	N0.HOG0006891	0.00387753151846941
N0.HOG0006379	N0.HOG0000265	0.00387480188802335
N0.HOG0005999	N0.HOG0001199	0.0038729832810515848
N0.HOG0003736	N0.HOG0003561	0.00387243418531096
N0.HOG0005479	N0.HOG0004824	0.0038717099131790732
N0.HOG0001043	N0.HOG0000226	0.00386799037461012
N0.HOG0006238	N0.HOG0001175	0.0038677385827106067
N0.HOG0000647	N0.HOG0001758	0.0038635187494975797
N0.HOG0003850	N0.HOG0002928	0.0038604773743315182
N0.HOG0004057	N0.HOG0000909	0.0038594130711687635
N0.HOG0002884	N0.HOG0006851	0.0038551841182042483
N0.HOG0007330	N0.HOG0000080	0.0038548675333826034
N0.HOG0003578	N0.HOG0000373	0.0038524228937109155
N0.HOG0006500	N0.HOG0001416	0.0038515778898480534
N0.HOG0002508	N0.HOG0000277	0.0038504270336273583
N0.HOG0000576	N0.HOG0000150	0.0038501196370173334
N0.HOG0003882	N0.HOG0000054	0.0038481828941273324
N0.HOG0000975	N0.HOG0007098	0.0038473677827834665
N0.HOG0002962	N0.HOG0002760	0.0038459037300964103
N0.HOG0005254	N0.HOG0000292	0.0038437859565724963
N0.HOG0002392	N0.HOG0004807	0.00383960863673294
N0.HOG0000345	N0.HOG0007159	0.003835834862143553
N0.HOG0003563	N0.HOG0001530	0.0038321980811427017
N0.HOG0001441	N0.HOG0000346	0.0038300999883758868
N0.HOG0006092	N0.HOG0003723	0.003822809761673903
N0.HOG0008394	N0.HOG0002293	0.003822731336762412
N0.HOG0006613	N0.HOG0006682	0.0038198245589691586
N0.HOG0002246	N0.HOG0000391	0.003819511874285107
N0.HOG0004560	N0.HOG0000663	0.0038188734564910485
N0.HOG0003686	N0.HOG0008433	0.00381882900787545
beta_CC	N0.HOG0001686	0.0038163145856919215
N0.HOG0005062	N0.HOG0001530	0.0038110822189532825
N0.HOG0005758	N0.HOG0007482	0.003806147829890113
N0.HOG0009728	N0.HOG0005371	0.003804165211073174
N0.HOG0005371	N0.HOG0000422	0.0038036413966086114
N0.HOG0008018	N0.HOG0003850	0.003799048310862177
N0.HOG0008913	N0.HOG0005280	0.0037956653048331216
N0.HOG0003038	N0.HOG0001718	0.0037953627997701065
N0.HOG0001661	N0.HOG0000145	0.00379245267450773
N0.HOG0005550	N0.HOG0006743	0.0037879829806999467
N0.HOG0008429	N0.HOG0001086	0.0037878050275331966
N0.HOG0002264	N0.HOG0006899	0.0037834769889581103
N0.HOG0002268	N0.HOG0004219	0.0037764146042720435
N0.HOG0006537	N0.HOG0003712	0.0037734124172003097
N0.HOG0005671	N0.HOG0000059	0.003770826115778417
N0.HOG0004530	N0.HOG0001081	0.003769609804593248
N0.HOG0006516	N0.HOG0000028	0.0037694762684270734
anthera	N0.HOG0000462	0.0037557658810579483
N0.HOG0002075	N0.HOG0000742	0.003748427385761187
N0.HOG0006253	N0.HOG0000289	0.00374448042027906
Chlb	N0.HOG0000681	0.0037429474952620214
N0.HOG0000875	N0.HOG0002748	0.00373982367715455
N0.HOG0002459	N0.HOG0002393	0.0037131121818425534
N0.HOG0003601	N0.HOG0000373	0.0037072497744958816
N0.HOG0004397	N0.HOG0000391	0.003707203874495248
N0.HOG0005027	N0.HOG0006846	0.0037065881146715867
N0.HOG0002019	N0.HOG0001232	0.0037020199402501316
N0.HOG0003329	N0.HOG0000669	0.0036990152580247252
N0.HOG0001515	N0.HOG0009414	0.0036773886925060167
N0.HOG0000209	N0.HOG0005059	0.0036767264717426002
N0.HOG0007007	N0.HOG0006492	0.0036759467769003217
N0.HOG0003965	N0.HOG0003414	0.003672237957149025
N0.HOG0003134	N0.HOG0004781	0.003657211150761437
N0.HOG0002703	N0.HOG0002770	0.00364290274116623
N0.HOG0006300	N0.HOG0002488	0.0036335319639094047
N0.HOG0005156	N0.HOG0001072	0.0036195259308396815
N0.HOG0007096	N0.HOG0004383	0.0035711476429972533
