GeneID	HOG	OG	Gene Tree Parent Clade	A_agrestis_oxf	A_filiculoides	A_thaliana	B_distachyon	C_braunii	C_melkonianii	C_reinhardtii	Closterium_sp_NIES_67	K_nitens	M_endlicherianum	M_polymorpha	M_viride	O_lucimarinus	O_sativa	P_coloniale	P_margaritaceum	P_patens	S_lycopersicum	S_moellendorffii	S_muscicola	Z_circumcarinatum_SAG698_1a	Z_circumcarinatum_SAG698_1b	Z_circumcarinatum_UTEX1559	Z_circumcarinatum_UTEX1560	Z_mays
Zci_12035	N0.HOG0005829	OG0004612	n0	AagrOXF_evm.TU.utg000003l.341	Azfi_s0050.g031123	AT5G03070	Bradi2g00320	CBR_g52325	Chrsp35S05278	Cre03.g161100_4532	CLOP_g12809	8229	Me1_v2_0054540	Mp6g06520	26582, 26581, 26578, 26579, 26580	NA	LOC_Os01g06470	NA	pm004337g0020, pm032177g0010	Pp3c21_840, Pp3c18_21610	Solyc10g084270	105015	SM000063S20065, SM000033S12380, SM000201S05913	Zci1a_13603, Zci1a_13604, Zci1a_13605	Zci_12035	UTEX1559_17262	UTEX1560_13977	Zm00001d008640
Zci_04285	N0.HOG0001146	OG0000660	n4	AagrOXF_evm.TU.utg000001l.271	Azfi_s0020.g015454, Azfi_s0005.g009152, Azfi_s0050.g031042	AT5G59880, AT3G46010, AT5G59890, AT3G45990, AT3G46000, AT1G01750, AT4G00680, AT4G25590, AT5G52360, AT2G31200, AT4G34970, AT2G16700	Bradi1g03750, Bradi1g03760, Bradi2g37310, Bradi1g27720, Bradi5g17960, Bradi3g50967, Bradi1g06821, Bradi3g31420, Bradi1g68280	CBR_g38860, CBR_g564, CBR_g50088	Chrsp45S05980	NA	CLOP_g20189, CLOP_g25374, CLOP_g8348	7435	Me1_v2_0151660	Mp3g20570, Mp8g17810, Mp2g12970, Mp1g17660	28197	NA	LOC_Os03g60580, LOC_Os07g30090, LOC_Os04g46910, LOC_Os02g44470, LOC_Os03g56790, LOC_Os12g43340, LOC_Os10g37670, LOC_Os07g20170, LOC_Os03g13950	PRCOL_00005947_RA	pm008205.t1, pm020729g0010, pm004321g0060, pm011632g0040	Pp3c26_7930	Solyc09g010440, Solyc06g005360, Solyc10g084660, Solyc10g017550, Solyc01g094400, Solyc03g025750, Solyc09g072600, Solyc09g072590, Solyc09g090110, Solyc01g111380	146459, 230142	SM000177S03174, SM000063S20018, SM000087S23332	Zci1a_06053	Zci_04285	UTEX1559_04090	UTEX1560_09280	Zm00001d034644, Zm00001d012966, Zm00001d034643, Zm00001d035629, Zm00001d035625, Zm00001d051388, Zm00001d017516, Zm00001d013141, Zm00001d034326, Zm00001d034024, Zm00001d029656, Zm00001d028392, Zm00001d047942
Zci_06402	N0.HOG0003615	OG0002630	n0	AagrOXF_evm.TU.utg000050l.518, AagrOXF_evm.TU.utg000124l.126	Azfi_s0063.g035333	AT3G07920, AT5G20920	Bradi1g63310	CBR_g38393, CBR_g16943	Chrsp51S06505	Cre12.g531550_4532	CLOP_g6258, CLOP_g13086	10942	Me1_v2_0144630	Mp3g17920	634	Olucimarinus_88846	LOC_Os07g48300, LOC_Os03g21550	PRCOL_00005604_RA	pm004812g0010, pm000577g0020, pm001163g0050, pm002363g0040, pm023944g0020	Pp3c5_20500, Pp3c6_8630, Pp3c27_190, Pp3c16_18789	Solyc06g082580	170980	SM000031S11631, SM000247S08267, SM000088S23739, SM000302S11652	Zci1a_27835, Zci1a_00351	Zci_06402	UTEX1559_06044	UTEX1560_00479	Zm00001d022433, Zm00001d007179, Zm00001d029048
Zci_02457	N0.HOG0003983	OG0002960	n0	NA	Azfi_s0060.g034750	NA	Bradi4g42217	CBR_g29779, CBR_g49555, CBR_g34581, CBR_g34582, CBR_g34583, CBR_g44392	Chrsp23S03799	NA	CLOP_g1694, CLOP_g22801	504	Me1_v2_0052040, Me1_v2_0117610, Me1_v2_0119360, Me1_v2_0206740, Me1_v2_0081820, Me1_v2_0081830, Me1_v2_0081800, Me1_v2_0081810, Me1_v2_0081770, Me1_v2_0080240, Me1_v2_0080180	NA	26210, 15534, 4726, 16973	NA	LOC_Os12g05920	NA	pm004109g0070, pm007879g0040	NA	Solyc09g031650	NA	NA	Zci1a_24149, Zci1a_24285	Zci_06228, Zci_02457	UTEX1559_11814, UTEX1559_07550	UTEX1560_19837, UTEX1560_02207	Zm00001d044139, Zm00001d011427
Zci_01638	N0.HOG0003766	OG0002766	n0	AagrOXF_evm.TU.utg000087l.191, AagrOXF_evm.TU.utg000087l.95	Azfi_s0157.g053841	AT5G61970	Bradi3g07210	CBR_g20988	Chrsp104S00017	Cre06.g267100_4532	CLOP_g7210	12808, 11365	Me1_v2_0200420, Me1_v2_0200430, Me1_v2_0200410	Mp1g14730	16493, 16494	Olucimarinus_32815	LOC_Os08g23360	PRCOL_00003443_RA	pm026639g0020, pm042862.t1, pm025696g0010, pm014126g0010, pm025696g0030, pm025696g0020	Pp3c15_22190	Solyc04g048930.1, Solyc03g093970, Solyc02g062810, Solyc02g062830, Solyc02g062840.1	81908	SM000008S22158, SM000035S13092	Zci1a_29785	Zci_01638	UTEX1559_13034	UTEX1560_02522, UTEX1560_02521	Zm00001d022115
Zci_10014	N0.HOG0008187	OG0006848	n0	AagrOXF_evm.TU.utg000042l.249	NA	NA	NA	CBR_g20049, CBR_g49763	Chrsp82S07960	NA	CLOP_g24840	13946	Me1_v2_0052370, Me1_v2_0052390, Me1_v2_0040730	Mp7g18370	25197, 4036, 10482	NA	NA	PRCOL_00006244_RA	pm003516g0030, pm011580.t1, pm034471g0010	Pp3c20_17110	NA	NA	SM000158S02009, SM000150S01715, SM000220S07056, SM000150S01716	Zci1a_00680	Zci_10014	UTEX1559_07718	UTEX1560_05450	NA
Zci_03574	N0.HOG0009384	OG0007977	n0	AagrOXF_evm.TU.utg000082l.20, AagrOXF_evm.TU.utg000024l.248, AagrOXF_evm.TU.utg000038l.284	Azfi_s0375.g067263	AT3G10572	Bradi1g34360	NA	Chrsp259S03934	NA	NA	5823	NA	Mp2g15620	7158	NA	LOC_Os06g48970	NA	NA	Pp3c9_5270	Solyc07g017290, Solyc12g017470	437393	NA	Zci1a_08125	Zci_03574	UTEX1559_14113	UTEX1560_07008, UTEX1560_07007	Zm00001d014696
Zci_01654	N0.HOG0001859	OG0001172	n0	AagrOXF_evm.TU.utg000080l.169, AagrOXF_evm.TU.utg000041l.83, AagrOXF_evm.TU.utg000009l.273	Azfi_s0596.g078823, Azfi_s0797.g087288	AT3G02800, AT5G16480, AT1G05000, AT2G32960, AT4G03960	Bradi4g08025, Bradi1g46220, Bradi3g57630	CBR_g29374, CBR_g23883, CBR_g23885	NA	NA	NA	5398	Me1_v2_0092560	Mp3g20030, Mp2g18490, Mp3g10950	23019, 1724, 1725, 13576	NA	LOC_Os09g05020, LOC_Os12g23190, LOC_Os06g10650, LOC_Os02g53160	PRCOL_00000518_RA	NA	Pp3c20_2620, Pp3c20_2950, Pp3c24_18350, Pp3c23_18160, Pp3c12_21270, Pp3c2_3020, Pp3c1_32070	Solyc11g011970, Solyc05g052770.1, Solyc05g055740, Solyc04g056340, Solyc07g049560	161459, 6925, 412771, 267170, 231635	NA	Zci1a_02419, Zci1a_08715, Zci1a_44783, Zci1a_01573	Zci_00292, Zci_14836, Zci_01654	UTEX1559_07227, UTEX1559_14513, UTEX1559_13015	UTEX1560_05270, UTEX1560_13569, UTEX1560_08855	Zm00001d005270, Zm00001d037150, Zm00001d044970, Zm00001d052137, Zm00001d018209
Zci_06510	N0.HOG0002859	OG0001975	n0	AagrOXF_evm.TU.utg000020l.186	Azfi_s0368.g067043, Azfi_s2388.g111091, Azfi_s0271.g061214	AT4G18040, AT1G29590, AT1G29550, AT5G35620	Bradi2g61950, Bradi3g28340	CBR_g48778	Chrsp187S02965	Cre03.g199900_4532	CLOP_g14300, CLOP_g24164, CLOP_g14808	3937	Me1_v2_0070400	Mp1g06030	3517	Olucimarinus_35895, Olucimarinus_119552	LOC_Os01g73880, LOC_Os10g32970	PRCOL_00004626_RA	pm000123.t1, pm001600g0010, pm014371g0010	Pp3c11_1600, Pp3c2_32310, Pp3c1_5840, Pp3c1_5850	Solyc02g021550, Solyc03g005870, Solyc09g090580	119068, 125743	SM000137S00450, SM000016S01984, SM000223S07301	Zci1a_18808	Zci_06510	UTEX1559_01323, UTEX1559_16209	UTEX1560_01714, UTEX1560_08451	Zm00001d041682, Zm00001d041973, Zm00001d032775, Zm00001d014065
Zci_11379	N0.HOG0015825	OG0013907	n0	AagrOXF_evm.TU.utg000019l.63, AagrOXF_evm.TU.utg000124l.98, AagrOXF_evm.TU.utg000042l.87, AagrOXF_evm.TU.utg000109l.101	NA	NA	NA	NA	NA	NA	NA	NA	NA	NA	NA	NA	NA	NA	NA	NA	NA	NA	NA	NA	Zci_11379	UTEX1559_08947	UTEX1560_12280	NA
Zci_00241	N0.HOG0000623	OG0000324	n0	AagrOXF_evm.TU.utg000091l.36, AagrOXF_evm.TU.utg000004l.99, AagrOXF_evm.TU.utg000111l.218, AagrOXF_evm.TU.utg000059l.45, AagrOXF_evm.TU.utg000109l.141, AagrOXF_evm.TU.utg000049l.792, AagrOXF_evm.TU.utg000063l.551, AagrOXF_evm.TU.utg000109l.30, AagrOXF_evm.TU.utg000058l.366, AagrOXF_evm.TU.utg000038l.304, AagrOXF_evm.TU.utg000091l.286, AagrOXF_evm.TU.utg000018l.129, AagrOXF_evm.TU.utg000126l.128	Azfi_s0061.g034940, Azfi_s0098.g043983, Azfi_s0003.g007698, Azfi_s0143.g051446, Azfi_s0008.g011266, Azfi_s0242.g059843, Azfi_s0006.g009993, Azfi_s0083.g038891	AT1G31310, AT2G35640, AT2G33550	Bradi1g12900, Bradi5g25700, Bradi2g59440, Bradi3g44370, Bradi5g08600	CBR_g12750, CBR_g40490, CBR_g4075, CBR_g5721, CBR_g51499, CBR_g34459, CBR_g41720, CBR_g1188, CBR_g38122, CBR_g7998, CBR_g8001, CBR_g34996, CBR_g11155, CBR_g44372	Chrsp115S01654	NA	CLOP_g10050	1245, 12978, 5327, 601, 3376, 14258, 15471, 16116	NA	Mp7g11500, Mp1g23310, Mp1g26740, Mp1g03040, Mp1g27060, Mp5g08810, Mp3g01790, Mp4g10590, Mp3g18590, Mp6g15470, Mp1g16790, Mp1g06180, Mp5g14820, Mp4g10710, Mp3g10970, Mp1g19730, Mp3g16630, Mp8g06550, Mp2g02150	NA	NA	LOC_Os03g46350, LOC_Os04g57530, LOC_Os01g70230, LOC_Os02g31160, LOC_Os04g32590	NA	pm098379g0010	Pp3c7_23130, Pp3c17_6370, Pp3c9_20560, Pp3c15_21740, Pp3c19_13320, Pp3c22_15410, Pp3c21_18170, Pp3c26_2630, Pp3c26_2600, Pp3c4_22830, Pp3c4_22880, Pp3c15_4190, Pp3c24_20450	Solyc02g030460.2, Solyc02g069390, Solyc04g045430, Solyc09g015150.1, Solyc01g065900, Solyc03g118230	402580, 73941, 441102, 407102	NA	Zci1a_25861, Zci1a_38934, Zci1a_10100, Zci1a_11082, Zci1a_20380, Zci1a_15910, Zci1a_05644, Zci1a_05038	Zci_09806, Zci_00241, Zci_00069, Zci_00073, Zci_09046, Zci_16512	UTEX1559_11209, UTEX1559_07164, UTEX1559_07438, UTEX1559_07436, UTEX1559_07432, UTEX1559_07464	UTEX1560_06735, UTEX1560_02386, UTEX1560_13851, UTEX1560_09271, UTEX1560_18857	Zm00001d034953, Zm00001d013588, Zm00001d001894, Zm00001d042271, Zm00001d050583, Zm00001d016604, Zm00001d025275, Zm00001d003889
Zci_09254	N0.HOG0005946	OG0004723	n0	AagrOXF_evm.TU.utg000045l.227	Azfi_s0008.g011451	AT3G63410	Bradi3g04930, Bradi4g01640	CBR_g22976	Chrsp17S02651	Cre14.g625450_4532	CLOP_g10810	11107	Me1_v2_0184760	Mp7g10390	23865	NA	LOC_Os12g42090, LOC_Os07g08200	NA	pm001175g0070, pm003611g0010, pm009662g0020	Pp3c4_15470, Pp3c3_23880	Solyc09g065730, Solyc03g005230, Solyc09g015085.1	230434	SM000036S13318, SM000019S04982, SM000069S20665	Zci1a_15712, Zci1a_06731	Zci_09254	UTEX1559_16974	UTEX1560_04269	Zm00001d031071
Zci_08581	N0.HOG0011413	OG0009841	n0	AagrOXF_evm.TU.utg000042l.129	NA	NA	NA	CBR_g39970	NA	Cre11.g801306_4532	CLOP_g23460, CLOP_g24742	NA	NA	NA	NA	NA	NA	NA	NA	NA	NA	NA	NA	NA	Zci_08581, Zci_00061, Zci_05747, Zci_03861	UTEX1559_05058, UTEX1559_11222, UTEX1559_05791	UTEX1560_12799, UTEX1560_19351	NA
Zci_07116	N0.HOG0007077	OG0005800	n0	AagrOXF_evm.TU.utg000095l.25	Azfi_s0197.g057373, Azfi_s0241.g059752	AT5G51410	Bradi1g00510, Bradi1g28650	CBR_g19666	Chrsp111S01606	Cre14.g621300_4532	CLOP_g14960	NA	Me1_v2_0088260	Mp2g06220, Mp8g04110	11803	Olucimarinus_29564	LOC_Os07g27300	NA	NA	Pp3c2_28450, Pp3c15_9680	Solyc03g093160	149618	SM000005S17254, SM000041S15471, SM000054S18161	Zci1a_15125, Zci1a_09707	Zci_07116	UTEX1559_15915	UTEX1560_05975	Zm00001d019579, Zm00001d005406
Zci_00243	N0.HOG0016637	OG0014686	n0	NA	NA	NA	NA	NA	NA	NA	NA	NA	Me1_v2_0210080	NA	NA	NA	NA	NA	NA	NA	NA	NA	NA	Zci1a_04785, Zci1a_04783, Zci1a_04479	Zci_00243	UTEX1559_07166	UTEX1560_02384	NA
Zci_09213	N0.HOG0003162	OG0002237	n0	AagrOXF_evm.TU.utg000133l.60	Azfi_s0149.g053201, Azfi_s0090.g042665	AT3G16270	Bradi2g09000, Bradi2g08986, Bradi2g07860	CBR_g25753, CBR_g31940, CBR_g36315	Chrsp44S05879	Cre12.g545150_4532, Cre12.g545300_4532	CLOP_g4095, CLOP_g8812	15465	Me1_v2_0221340	Mp3g04350, MpVg00590	23763, 23761, 23762	Olucimarinus_29866	LOC_Os01g13160	PRCOL_00002233_RA	pm000400g0050, pm014232g0010, pm019892g0030, pm011780g0030	Pp3c13_8800, Pp3c1_18430, Pp3c2_17390, Pp3c2_19000	Solyc04g047770	440067	SM000036S13344, SM000019S04981, SM000132S26917	Zci1a_21477	Zci_09213	UTEX1559_06478	UTEX1560_03644, UTEX1560_03645, UTEX1560_03643	Zm00001d009005, Zm00001d039287, Zm00001d017318
Zci_03655	N0.HOG0003217	OG0002285	n0	AagrOXF_evm.TU.utg000008l.337, AagrOXF_evm.TU.utg000008l.339	Azfi_s0104.g044800, Azfi_s0093.g043168	AT1G21065	Bradi1g30273	CBR_g570	Chrsp35S08988	Cre17.g739300_4532, Cre01.g043100_4532	CLOP_g17634, CLOP_g18860	1301, 266	Me1_v2_0095760, Me1_v2_0060080	Mp1g28460, Mp1g22760	21801	Olucimarinus_10571	LOC_Os02g09460, LOC_Os06g43140	PRCOL_00001425_RA	pm001002.t2, pm019962g0010	Pp3c1_31360, Pp3c2_25680	Solyc12g095770	236221, 110368	SM000071S21140, SM000032S12129, SM000308S11834	Zci1a_28263, Zci1a_28262	Zci_15382, Zci_03655	UTEX1559_09600, UTEX1559_02950	UTEX1560_14765, UTEX1560_09757, UTEX1560_09755, UTEX1560_09756, UTEX1560_11489	Zm00001d015612, Zm00001d046628
Zci_07524	N0.HOG0012462	OG0010806	n0	NA	NA	NA	NA	NA	Chrsp62S07044	NA	NA	6581	Me1_v2_0167130	NA	NA	NA	NA	NA	pm014908.t1, pm007688g0030	NA	NA	NA	SM000195S05281, SM000206S06269, SM000222S07000	Zci1a_02316	Zci_07524	UTEX1559_04251	UTEX1560_03107	NA
Zci_14130	N0.HOG0005533	OG0004332	n0	AagrOXF_evm.TU.utg000091l.719, AagrOXF_evm.TU.utg000009l.514, AagrOXF_evm.TU.utg000140l.49	Azfi_s0166.g054428	AT1G10580	Bradi1g60420, Bradi1g60431	CBR_g42136	Chrsp26S04042	Cre04.g226450_4532	CLOP_g5988, CLOP_g15765	10208	Me1_v2_0176660	Mp1g17450	18345	Olucimarinus_17027	LOC_Os03g27970	PRCOL_00001031_RA	pm021400g0020, pm003607g0030, pm005139g0020	Pp3c5_27650	Solyc02g078970	78344	SM000022S07264, SM000009S23598, SM000102S09205	Zci1a_35875	Zci_14130	UTEX1559_09495	UTEX1560_03337	Zm00001d029435, Zm00001d047245
Zci_05046	N0.HOG0006608	OG0005347	n0	AagrOXF_evm.TU.utg000038l.73	Azfi_s0188.g056827, Azfi_s0480.g073099	AT5G13240	Bradi1g54400, Bradi2g02687	NA	Chrsp26S04086	Cre08.g364250_4532	CLOP_g15893	10240	Me1_v2_0099390	Mp8g03790	25545	Olucimarinus_38480	LOC_Os04g56730	PRCOL_00004209_RA	pm000476.t1, pm048631g0010	Pp3c7_4620, Pp3c11_22300	Solyc05g008400	NA	SM000388S14671, SM000012S25318, SM000095S25023	Zci1a_21671, Zci1a_09983	Zci_05046	UTEX1559_16024	UTEX1560_06966	Zm00001d017103, Zm00001d013771
Zci_13669	N0.HOG0005683	OG0004476	n0	AagrOXF_evm.TU.utg000077l.47	Azfi_s0026.g023426	AT4G26430, AT5G56280	Bradi3g39500	CBR_g38485	Chrsp57S06799	Cre11.g467645_4532, Cre11.g467647_4532	CLOP_g12676	2612	Me1_v2_0117140	Mp8g14630	5542, 5543	Olucimarinus_32030	LOC_Os08g39070	PRCOL_00003462_RA	pm014892.t2, pm007806g0050, pm014892g0040	Pp3c17_21990, Pp3c14_22830	Solyc10g005660	74712	SM000110S18918, SM000057S18444, SM000104S09359	Zci1a_17761	Zci_13669	UTEX1559_09429	UTEX1560_11357	Zm00001d031323, Zm00001d052848
Zci_13022	N0.HOG0005169	OG0004005	n0	AagrOXF_evm.TU.utg000003l.333	Azfi_s0174.g055948	AT5G13570	Bradi3g54700	CBR_g38931, CBR_g39890	Chrsp33S05009	Cre07.g344850_4532	CLOP_g25036, CLOP_g6843	8771	Me1_v2_0199350	Mp8g16420	20848	Olucimarinus_5662	LOC_Os02g56210	PRCOL_00003742_RA	pm000237g0010, pm020124g0020, pm000545g0080, pm029347g0010, pm004601g0040, pm012416g0050	Pp3c10_5620, Pp3c2_16830, Pp3c1_22690	Solyc05g056110	438877	SM000015S01290	Zci1a_01297	Zci_13022	UTEX1559_03390	UTEX1560_15510	Zm00001d036540, Zm00001d019468
Zci_01774	N0.HOG0005598	OG0004395	n0	AagrOXF_evm.TU.utg000038l.119	Azfi_s0007.g011146	AT1G66590, AT1G69750	Bradi2g11780, Bradi2g16920	CBR_g27938	Chrsp29S00329	Cre10.g454550_4532	CLOP_g21933, CLOP_g22631	4799	Me1_v2_0080640	Mp2g02620	68	Olucimarinus_9533	LOC_Os02g20940	PRCOL_00001792_RA	pm001036g0030, pm002470g0020	Pp3c14_6840	Solyc12g044380, Solyc03g120820	49815	SM000126S26310, SM000008S22308, SM000002S05619	Zci1a_41396, Zci1a_03485	Zci_01774	UTEX1559_12732	UTEX1560_02439	Zm00001d027469, Zm00001d038976
Zci_12479	N0.HOG0008460	OG0007112	n0	AagrOXF_evm.TU.utg000097l.49	Azfi_s0168.g054610	AT2G45520	Bradi1g49890, Bradi1g49820	NA	Chrsp4S06395	NA	NA	3836	Me1_v2_0206420	Mp5g18330	25098	NA	LOC_Os06g03090, LOC_Os06g03920	NA	pm003223g0040, pm003437g0040	Pp3c22_10350	Solyc05g048750	414490, 85495	SM000041S15473, SM000054S18160	NA	Zci_12479	UTEX1559_03246	UTEX1560_10223	Zm00001d036022, Zm00001d045487
Zci_02158	N0.HOG0005723	OG0004514	n0	AagrOXF_evm.TU.utg000103l.185	NA	AT3G42725	NA	CBR_g8990, CBR_g85947	NA	NA	CLOP_g1547, CLOP_g3245, CLOP_g6747, CLOP_g1174, CLOP_g10768	4241, 8202	Me1_v2_0215060	Mp1g18910, Mp6g18820	NA	NA	NA	NA	pm000035g0090, pm010259g0030, pm000492g0030, pm006077g0030, pm002634g0040, pm004844g0040	Pp3c10_8870, Pp3c22_19630, Pp3c19_10180	Solyc07g041770.1	405133	SM000096S24842, SM013941S00144, SM000020S05983, SM000153S01613	Zci1a_15183	Zci_02158	UTEX1559_10942	UTEX1560_01977	Zm00001d027883
Zci_00922	N0.HOG0005831	OG0004614	n0	AagrOXF_evm.TU.utg000003l.67, AagrOXF_evm.TU.utg000005l.499	Azfi_s0009.g011841	AT1G06380, AT2G42650, AT3G58660	Bradi2g16930	CBR_g22367	Chrsp58S06904	Cre07.g314100_4532	CLOP_g102	6810	Me1_v2_0215550	Mp1g11260	16921	Olucimarinus_15606	LOC_Os05g48422	PRCOL_00002093_RA	pm009300.t1, pm001466.t1, pm003335g0010	Pp3c8_1610, Pp3c12_11430	Solyc04g008790.1, Solyc01g111420	66060	SM000004S14962, SM000007S20879	Zci1a_00531	Zci_00922	UTEX1559_07983	UTEX1560_08320	Zm00001d038975
Zci_03167	N0.HOG0006061	OG0004828	n0	AagrOXF_evm.TU.utg000103l.195, AagrOXF_evm.TU.utg000116l.240	NA	AT2G15400, AT2G15430	Bradi4g08350	CBR_g49328	Chrsp123S01840	Cre10.g419750_4532	CLOP_g18098, CLOP_g17062	9351	Me1_v2_0221430	Mp5g06030	16215	Olucimarinus_119616, Olucimarinus_48787	LOC_Os09g02284	PRCOL_00001769_RA	pm003322g0050, pm004417g0020, pm008121g0030	Pp3c14_9440, Pp3c5_19460	Solyc05g010300	75337	SM000030S11487, SM000131S26682, SM000240S08620	Zci1a_23234	Zci_03167	UTEX1559_11256	UTEX1560_10165	Zm00001d005295
Zci_06644	N0.HOG0004320	OG0003253	n0	AagrOXF_evm.TU.utg000109l.209, AagrOXF_evm.TU.utg000116l.330	Azfi_s0001.g000684, Azfi_s0068.g036408	AT4G11860, AT4G22960	Bradi1g34980	CBR_g38139	Chrsp29S00340	Cre06.g304850_4532	CLOP_g394	10618	Me1_v2_0109950	Mp8g13860	22870, 22873, 22869, 22871, 22872	Olucimarinus_17998	LOC_Os06g49800, LOC_Os07g15440	PRCOL_00006333_RA	pm011329g0010, pm031482g0010, pm004211g0040, pm004211.t2, pm035911g0010	Pp3c17_3230, Pp3c12_2860	Solyc08g080110	437710	NA	Zci1a_23047	Zci_06644	UTEX1559_03933	UTEX1560_12843	Zm00001d036428, Zm00001d042915, Zm00001d014761
Zci_12534	N0.HOG0000686	OG0000369	n0	NA	NA	AT3G46860, AT5G43570, AT5G43580, AT2G38870, AT2G38900	Bradi3g36050, Bradi2g15329, Bradi4g40616, Bradi3g02393, Bradi3g02398, Bradi3g02397, Bradi3g02394, Bradi3g02396, Bradi3g02395, Bradi3g02371, Bradi3g02390, Bradi2g19344, Bradi2g46176, Bradi2g46170, Bradi3g02381, Bradi3g02392, Bradi3g02391, Bradi1g46405, Bradi4g17850, Bradi1g46400, Bradi1g46410, Bradi2g39265, Bradi2g39272, Bradi2g35540, Bradi2g35500, Bradi2g39260, Bradi2g39280, Bradi2g39290, Bradi1g09487	CBR_g37573	Chrsp66S07268	NA	CLOP_g21655, CLOP_g18334, CLOP_g19107, CLOP_g21653	6583	Me1_v2_0220240, Me1_v2_0220470	Mp3g24290	NA	NA	LOC_Os05g25630, LOC_Os06g21540, LOC_Os01g42860, LOC_Os02g03180, LOC_Os02g03170, LOC_Os02g03140, LOC_Os02g03150, LOC_Os08g34258, LOC_Os08g34249, LOC_Os12g36220, LOC_Os12g36210, LOC_Os12g36240, LOC_Os05g01920, LOC_Os11g17790	NA	pm000515g0060, pm002982g0060, pm014405g0010, pm024865g0010, pm012182g0010, pm000562.t1, pm004613.t1, pm247107g0010, pm007515g0020, pm016367.t1, pm007515.t1, pm010443g0020, pm016367g0020, pm022051.t1, pm008801g0010, pm021511g0010	Pp3c23_22180	Solyc01g108390, Solyc01g108380, Solyc11g007050.1, Solyc08g080020.1, Solyc08g080630, Solyc10g086100, Solyc10g086090, Solyc09g089500, Solyc09g089540, Solyc09g089490, Solyc09g089520, Solyc09g089530, Solyc09g083435.1, Solyc09g084440.2, Solyc09g084470, Solyc09g084480, Solyc09g084450, Solyc09g084490, Solyc09g084460, Solyc09g083430	84301	SM000065S20184, SM000227S07455, SM000243S08602	Zci1a_27163, Zci1a_37578	Zci_12535, Zci_12534	UTEX1559_15836, UTEX1559_15839, UTEX1559_15837	UTEX1560_09204, UTEX1560_09207, UTEX1560_09205	Zm00001d041830, Zm00001d053933, Zm00001d015079, Zm00001d015076, Zm00001d015072, Zm00001d015077, Zm00001d015070, Zm00001d015075, Zm00001d015068, Zm00001d053934, Zm00001d011079, Zm00001d011080, Zm00001d035683, Zm00001d035684, Zm00001d035681, Zm00001d035680, Zm00001d037969, Zm00001d010025
Zci_02735	N0.HOG0002525	OG0001690	n0	NA	Azfi_s0002.g007253	NA	NA	NA	NA	NA	NA	NA	NA	NA	NA	Olucimarinus_28822	NA	PRCOL_00003815_RA	NA	NA	NA	NA	NA	Zci1a_08377, Zci1a_07814, Zci1a_25380, Zci1a_21744, Zci1a_03335, Zci1a_21746, Zci1a_03338, Zci1a_03336, Zci1a_13444, Zci1a_31732, Zci1a_16453, Zci1a_07538, Zci1a_08986, Zci1a_41038, Zci1a_14389, Zci1a_15353, Zci1a_15354	Zci_08222, Zci_14606, Zci_10141, Zci_06283, Zci_03874, Zci_02735, Zci_05005, Zci_05841, Zci_13259, Zci_13906	UTEX1559_14423, UTEX1559_12411, UTEX1559_15348, UTEX1559_05153, UTEX1559_05419, UTEX1559_03405, UTEX1559_06394, UTEX1559_09490, UTEX1559_07835, UTEX1559_16078, UTEX1559_06531, UTEX1559_09071	UTEX1560_06519, UTEX1560_13370, UTEX1560_15659, UTEX1560_07410, UTEX1560_18331, UTEX1560_13491, UTEX1560_17517, UTEX1560_03344, UTEX1560_01847, UTEX1560_06638, UTEX1560_04606, UTEX1560_06369, UTEX1560_10496	NA
Zci_01341	N0.HOG0004199	OG0003146	n0	AagrOXF_evm.TU.utg000012l.497, AagrOXF_evm.TU.utg000012l.527, AagrOXF_evm.TU.utg000018l.108, AagrOXF_evm.TU.utg000005l.381	Azfi_s0018.g014921	AT5G09920	Bradi3g56497, Bradi3g01560	CBR_g17935	Chrsp1S03226	Cre07.g313185_4532	CLOP_g17893	3185	Me1_v2_0177300	Mp6g06730	4724	Olucimarinus_93190, Olucimarinus_29798	LOC_Os02g49150, LOC_Os02g02510	PRCOL_00001299_RA	pm005839g0040, pm018059g0020, pm013114.t1, pm019310g0010	Pp3c15_14900, Pp3c9_19820	Solyc04g015180, Solyc06g073870	144908	SM000159S01778, SM000001S04564, SM000070S21375	Zci1a_05619	Zci_01341	UTEX1559_09306	UTEX1560_08816	Zm00001d051682, Zm00001d054033
Zci_01352	N0.HOG0007331	OG0006037	n0	AagrOXF_evm.TU.utg000042l.421	Azfi_s0705.g082692	AT2G44510, AT5G03830	Bradi1g01070	NA	Chrsp1S03092	Cre03.g200991_4532	CLOP_g4908	3194	Me1_v2_0059170	Mp3g06290	1694	Olucimarinus_38561	LOC_Os03g63690	PRCOL_00004527_RA	pm003791.t1, pm008072g0020	Pp3c25_10280, Pp3c16_23330	Solyc04g007850	426584	SM000037S13569, SM000130S27116, SM000098S25131	Zci1a_11529	Zci_01352	UTEX1559_09299	UTEX1560_08517	Zm00001d012830
Zci_12167	N0.HOG0013655	OG0011898	n0	NA	NA	NA	NA	CBR_g42130	NA	NA	NA	9317	Me1_v2_0089670	NA	21312	NA	NA	NA	NA	NA	NA	NA	SM000013S26397, SM000190S04875	Zci1a_36345	Zci_12167	UTEX1559_06317	UTEX1560_10967	NA
Zci_05487	N0.HOG0007456	OG0006156	n0	AagrOXF_evm.TU.utg000129l.20, AagrOXF_evm.TU.utg000129l.19	Azfi_s0003.g007949	AT2G39960, AT4G04200	Bradi5g10990	CBR_g48322	Chrsp33S05162	Cre12.g524200_4532	CLOP_g16186	4050	Me1_v2_0114210	Mp1g06520	16096	NA	LOC_Os02g35720, LOC_Os04g36859	PRCOL_00000631_RA	pm000992g0120, pm023899g0010	Pp3c8_24950, Pp3c24_20710	Solyc04g072032.1, Solyc04g072110	NA	NA	Zci1a_17500	Zci_05487	UTEX1559_05404	UTEX1560_10100	Zm00001d020624, Zm00001d013600
Zci_13283	N0.HOG0032654	OG0030477	-	NA	NA	NA	NA	NA	NA	NA	NA	NA	NA	NA	NA	NA	NA	NA	NA	NA	NA	NA	NA	NA	Zci_13283	UTEX1559_15680	UTEX1560_14470	NA
Zci_03173	N0.HOG0004057	OG0003018	n0	AagrOXF_evm.TU.utg000012l.261	Azfi_s0087.g042286, Azfi_s0292.g063415, Azfi_s0045.g029753	AT4G17150, AT3G23540, AT4G14290	Bradi1g36220, Bradi3g07220, Bradi1g61890	CBR_g17709	Chrsp103S01006	Cre07.g328950_4532	CLOP_g24356	8233	Me1_v2_0168510	Mp6g09710	28327, 28328	NA	LOC_Os06g40730, LOC_Os02g10440, LOC_Os03g24450	PRCOL_00003839_RA	pm015834g0020, pm029901g0010	Pp3c4_3670, Pp3c12_23220	Solyc04g015300, Solyc01g080270	170125	NA	Zci1a_17698, Zci1a_17699	Zci_03173	UTEX1559_00941	UTEX1560_15007, UTEX1560_15005, UTEX1560_15006	Zm00001d036829, Zm00001d015811, Zm00001d029227
Zci_04928	N0.HOG0006370	OG0005124	n0	AagrOXF_evm.TU.utg000116l.402	Azfi_s0486.g073431	AT2G30710	Bradi3g38690	CBR_g4869, CBR_g39554	Chrsp77S00619	Cre12.g486400_4532	CLOP_g4234	8802	Me1_v2_0143260	Mp7g15660	17169, 12985, 12986	NA	LOC_Os09g34040	NA	pm000265.t1, pm003987g0010	Pp3c9_25750	Solyc11g005010	232091	SM000005S17090, SM000060S19689, SM000112S24003	Zci1a_31499, Zci1a_03935	Zci_04928	UTEX1559_04139, UTEX1559_11216	UTEX1560_05653, UTEX1560_06746	Zm00001d051910
Zci_06763	N0.HOG0008624	OG0007266	n0	AagrOXF_evm.TU.utg000012l.141	Azfi_s0487.g073461	AT1G11240	Bradi1g62290	NA	NA	Cre03.g183500_4532	CLOP_g3556, CLOP_g14628	5454	Me1_v2_0125150	Mp4g07270	24073	NA	LOC_Os03g23020	NA	pm001081g0100, pm005448g0050, pm008781g0040	Pp3c20_8900	Solyc10g009200	446470	NA	Zci1a_07900, Zci1a_15051	Zci_06763	UTEX1559_13328	UTEX1560_15056	Zm00001d047469
Zci_03585	N0.HOG0007937	OG0006614	n0	AagrOXF_evm.TU.utg000058l.327	Azfi_s1448.g103208, Azfi_s0243.g059897	AT2G31410	Bradi3g47671	CBR_g4589	Chrsp103S01130	Cre12.g499000_4532	CLOP_g12156	14067	Me1_v2_0199660	Mp5g07720	NA	Olucimarinus_14346	LOC_Os02g38190	PRCOL_00003958_RA	NA	Pp3c11_25830	Solyc02g094490, Solyc03g083260.1	NA	SM001998S05393, SM000019S05015, SM001602S02407	Zci1a_16062	Zci_03585	UTEX1559_14128	UTEX1560_05093	Zm00001d050964, Zm00001d017090
Zci_02515	N0.HOG0007457	OG0006157	n0	AagrOXF_evm.TU.utg000129l.52	Azfi_s0035.g025639, Azfi_s0073.g037071, Azfi_s1142.g098081	AT1G48540, AT3G17920	Bradi1g69590	CBR_g38780	Chrsp57S06815, Chrsp57S06814	NA	NA	9573, 307	Me1_v2_0098160	Mp1g22450	22722, 22723	NA	LOC_Os03g12160	PRCOL_00002225_RA	NA	Pp3c14_22990, Pp3c10_10590	Solyc03g118620	NA	SM000086S23078, SM000002S05497, SM000134S26922	Zci1a_13501	Zci_02515	UTEX1559_12193	UTEX1560_01926	Zm00001d028244
Zci_03798	N0.HOG0004765	OG0003648	n0	AagrOXF_evm.TU.utg000081l.45	Azfi_s0004.g008572, Azfi_s0150.g053293	AT1G52600, AT3G15710	Bradi2g27080, Bradi1g04820, Bradi2g49610	CBR_g8987	Chrsp37S05474	Cre09.g406800_4532	CLOP_g8092	7419	Me1_v2_0120690	Mp6g18210	9769	Olucimarinus_87247	LOC_Os06g16260, LOC_Os05g23260	PRCOL_00004556_RA	pm001547g0060, pm007669.t1, pm033951g0010	Pp3c10_16090, Pp3c14_17270	Solyc12g006540	109521	SM000041S15485, SM000060S19660, SM000213S06804	Zci1a_37086	Zci_03798	UTEX1559_12617	UTEX1560_05028	Zm00001d051850, Zm00001d037926, Zm00001d009866
Zci_03629	N0.HOG0006154	OG0004917	n0	AagrOXF_evm.TU.utg000005l.112, AagrOXF_evm.TU.utg000113l.161	Azfi_s0006.g010267	AT1G31410	Bradi5g20690	CBR_g37675, CBR_g19872	Chrsp94S08337	Cre06.g292100_4532	CLOP_g22832	268	Me1_v2_0101880, Me1_v2_0139720	Mp3g07640	1275, 18541	Olucimarinus_28311	LOC_Os04g51310	PRCOL_00001501_RA	pm001892g0030	Pp3c1_19230	Solyc08g005860	132900	SM000136S00185, SM000097S24822, SM000249S08232	Zci1a_44354	Zci_03629	UTEX1559_00559	UTEX1560_00399	Zm00001d026244, Zm00001d002425
Zci_05366	N0.HOG0025311	OG0023165	n0	NA	NA	NA	NA	NA	NA	NA	NA	NA	NA	NA	NA	NA	NA	NA	NA	NA	NA	NA	NA	Zci1a_14204	Zci_05366	UTEX1559_00571	UTEX1560_07779	NA
Zci_10809	N0.HOG0003293	OG0002351	n0	AagrOXF_evm.TU.utg000114l.4	Azfi_s0005.g009222	ATCG00650, AT1G07210	Bradi4g17766, Bradi1g05747, Bradi1g05752, Bradi2g58736, Bradi3g30060	CBR_g41534	Chrsp127S01903	CreCp.g802300_4532, Cre09.g388282_4532	CLOP_g12025, CLOP_g14659	9297	Me1_v2_0051890, Me1_v2_0051880	Mp7g00310	28705	Olucimarinus_29387	LOC_Os10g21312, LOC_Os08g15308, LOC_Os06g39716, LOC_Os10g35690	NA	pm013283g0010, pm014294g0020, pm016810g0080, pm001524g0040, pm027311g0010	Pp3c9_1670	Solyc00g500022, Solyc01g017085.1, Solyc01g058530, Solyc10g084700	9213, 438838	SM000004S15002, SM000007S20830	Zci1a_03446	Zci_10809	UTEX1559_08718	UTEX1560_00734	GRMZM5G815606, Zm00001d028672, Zm00001d042233
Zci_02061	N0.HOG0016586	OG0014637	n0	NA	NA	NA	NA	NA	NA	NA	NA	2806	Me1_v2_0233150	Mp1g13980	NA	NA	NA	NA	NA	NA	NA	NA	NA	Zci1a_01647	Zci_02061	UTEX1559_15147	UTEX1560_04310	NA
Zci_02365	N0.HOG0001138	OG0000654	n0	AagrOXF_evm.TU.utg000059l.327, AagrOXF_evm.TU.utg000061l.123, AagrOXF_evm.TU.utg000050l.724, AagrOXF_evm.TU.utg000116l.282	Azfi_s0101.g044410, Azfi_s1817.g107159, Azfi_s0187.g056749	AT1G76340, AT5G19980	Bradi3g31990, Bradi1g69910, Bradi1g69925, Bradi3g21710, Bradi4g27872	CBR_g21763	Chrsp251S03859, Chrsp29S04504	Cre11.g467754_4532, Cre18.g748997_4532, Cre06.g305900_4532	CLOP_g18786, CLOP_g22861, CLOP_g9261	11891, 10676, 13302	Me1_v2_0223490	Mp4g09680, Mp1g28740	5914, 23207, 7883, 11598	Olucimarinus_33750, Olucimarinus_18795, Olucimarinus_5957	LOC_Os03g11590, LOC_Os02g06010, LOC_Os08g10350, LOC_Os09g14520	PRCOL_00005725_RA, PRCOL_00006568_RA	pm019794.t1, pm043694g0010, pm022265g0020, pm000070g0110, pm007443g0020, pm000776g0030, pm028696g0010, pm068154g0010, pm007917g0030, pm001101.t1	Pp3c8_16270, Pp3c14_9050, Pp3c20_17530, Pp3c23_5440	Solyc06g071950, Solyc03g110970.2, Solyc09g065600	82176, 102595	SM000064S19714, SM000029S10488, SM000337S12893, SM002684S09762, SM003297S12608, SM000074S21723, SM007826S22554, SM000133S26828, SM000168S02607, SM000022S07179, SM000017S02851, SM000202S05898	Zci1a_09373, Zci1a_19526, Zci1a_16872, Zci1a_31312, Zci1a_03718	Zci_02365, Zci_10067, Zci_12400	UTEX1559_01153, UTEX1559_07658, UTEX1559_02265	UTEX1560_00300, UTEX1560_13486, UTEX1560_16507	Zm00001d028214, Zm00001d048084, Zm00001d052692, Zm00001d020052
Zci_01281	N0.HOG0003493	OG0002519	n0	AagrOXF_evm.TU.utg000042l.365	Azfi_s0005.g008901, Azfi_s0005.g009117	AT1G69670, AT1G26830	Bradi5g23640, Bradi3g59330, Bradi5g23651, Bradi3g15900	CBR_g35043	Chrsp1S03176	Cre07.g324050_4532	CLOP_g6191	4080	Me1_v2_0139060	Mp4g12190	27684	Olucimarinus_33783	LOC_Os04g55000, LOC_Os02g51180, LOC_Os04g55030, LOC_Os08g02904, LOC_Os08g07400	PRCOL_00004875_RA	pm011191.t1, pm005056g0010, pm016669g0010	Pp3c7_5730, Pp3c11_21000	Solyc02g087900, Solyc01g010820	98006, 98222	SM000070S21378, SM000159S01802, SM000001S04567, SM002495S08157	Zci1a_15764	Zci_01281	UTEX1559_09388	UTEX1560_02265	Zm00001d018043, Zm00001d024466, Zm00001d049487
Zci_02431	N0.HOG0005383	OG0004197	n0	AagrOXF_evm.TU.utg000097l.26	Azfi_s0010.g012183	AT5G07840, AT5G61230	Bradi3g00400	CBR_g49668	NA	Cre12.g553500_4532	CLOP_g17485	8373	Me1_v2_0127420, Me1_v2_0207410	Mp5g11190	NA	Olucimarinus_42708	LOC_Os02g01245, LOC_Os02g01240	NA	pm031990g0010, pm006936g0010, pm311616g0010, pm002660g0070, pm311926g0010, pm011562g0010	Pp3c6_1190	Solyc08g005910, Solyc12g096260	7202, 167008	SM000121S26001, SM000015S01158, SM000258S09089	Zci1a_08960, Zci1a_25203	Zci_02431	UTEX1559_07575	UTEX1560_06907	Zm00001d014925
Zci_10556	N0.HOG0008637	OG0007279	n0	AagrOXF_evm.TU.utg000033l.179	Azfi_s0006.g009763, Azfi_s0078.g038173	AT3G01200, AT4G21210	Bradi1g25816	CBR_g38977	NA	Cre12.g514600_4532	CLOP_g4301	NA	Me1_v2_0195070	Mp5g04170	NA	Olucimarinus_33216	LOC_Os07g34640	NA	pm005152g0020, pm000842g0050, pm078910g0010	Pp3c11_19190	Solyc10g005370	33587	NA	NA	Zci_10556	UTEX1559_00717	UTEX1560_09365	Zm00001d021672, Zm00001d006520
Zci_09259	N0.HOG0002950	OG0002049	n0	AagrOXF_evm.TU.utg000058l.23	Azfi_s0998.g094968, Azfi_s1496.g103627	AT5G10010, AT5G64910	Bradi5g24902, Bradi5g24895	CBR_g49135, CBR_g53615	Chrsp1S03242	NA	CLOP_g18797, CLOP_g22334, CLOP_g22330	9194	Me1_v2_0221080	Mp4g19620	638	NA	LOC_Os02g31960, LOC_Os04g56590	NA	pm084874g0010, pm003121g0010, pm055249g0010, pm003183.t1, pm026552g0040	Pp3c9_21820, Pp3c15_14660	Solyc04g054180	75402	SM000150S01699, SM000070S21283, SM000158S02036	Zci1a_02801, Zci1a_38192	Zci_09395, Zci_10693, Zci_09242, Zci_09259	UTEX1559_01079, UTEX1559_09246, UTEX1559_15759, UTEX1559_16978	UTEX1560_06545, UTEX1560_10270, UTEX1560_13887, UTEX1560_03997	Zm00001d025740, Zm00001d007874, Zm00001d003220, Zm00001d016096
Zci_05793	N0.HOG0004279	OG0003212	n0	AagrOXF_evm.TU.utg000058l.25	Azfi_s0093.g043271, Azfi_s0315.g064288	AT1G66070, AT5G37475	Bradi3g02180	CBR_g41674	Chrsp33S05190	Cre06.g308850_4532	CLOP_g22706	2327	Me1_v2_0094090	Mp6g18380	4706	Olucimarinus_26180	LOC_Os05g41630, LOC_Os02g02990	PRCOL_00000087_RA	pm003458g0060, pm010249g0030, pm001250g0010, pm002817g0020, pm055326g0010	Pp3c24_9310, Pp3c13_8920, Pp3c3_11040, Pp3c4_20470, Pp3c12_15100	Solyc02g079060	118934	SM000001S04726, SM000044S15938, SM000127S26601	Zci1a_08119	Zci_05793	UTEX1559_11166, UTEX1559_11168	UTEX1560_06803	Zm00001d015061
Zci_00843	N0.HOG0003415	OG0002451	n0	AagrOXF_evm.TU.utg000124l.78	Azfi_s0004.g008702, Azfi_s0037.g025939	AT2G26430	Bradi1g29543, Bradi1g55310, Bradi1g29537	CBR_g41142	Chrsp64S07168	Cre07.g321650_4532	CLOP_g10108, CLOP_g17413, CLOP_g24312	13685	Me1_v2_0158460	Mp3g11260	21736	Olucimarinus_42531	LOC_Os01g27940	PRCOL_00003844_RA	pm007374g0040, pm025177g0020, pm028214g0010, pm027216g0010	Pp3c15_25980, Pp3c9_26180, Pp3c14_26890	Solyc01g098350	417161, 236447	SM000298S10942, SM000050S17068, SM000172S03091	Zci1a_30692, Zci1a_30693	Zci_00843	UTEX1559_04487, UTEX1559_04486	UTEX1560_01652, UTEX1560_01650, UTEX1560_01651	Zm00001d019684, Zm00001d033023, Zm00001d019681, Zm00001d033021
Zci_15783	N0.HOG0012543	OG0010882	n0	NA	NA	NA	NA	NA	NA	NA	NA	NA	Me1_v2_0126600	NA	NA	NA	NA	NA	NA	NA	NA	NA	NA	Zci1a_21125	Zci_03004, Zci_15783, Zci_15784	UTEX1559_00882, UTEX1559_17233, UTEX1559_11130, UTEX1559_17229	UTEX1560_08429, UTEX1560_10358, UTEX1560_08431	NA
Zci_04403	N0.HOG0001644	OG0001013	n0	AagrOXF_evm.TU.utg000001l.241	Azfi_s0327.g065256, Azfi_s0007.g010765	AT2G39900, AT3G55770, AT1G01780, AT2G45800, AT3G61230, AT1G10200	Bradi1g67100, Bradi3g30200, Bradi5g16666, Bradi3g49950, Bradi4g06510, Bradi1g44810	CBR_g19916	NA	NA	CLOP_g16841, CLOP_g24438	1472	Me1_v2_0090360	Mp4g02460	26099	Olucimarinus_26910	LOC_Os03g15940, LOC_Os10g35930, LOC_Os04g45010, LOC_Os02g42820, LOC_Os12g32620, LOC_Os06g13030	NA	pm005251g0030, pm000750g0040, pm011787g0020, pm002065g0020, pm004961g0070, pm061633g0010, pm010824g0010, pm009234g0030, pm010613.t1	Pp3c7_3100, Pp3c11_18380, Pp3c17_20150	Solyc05g052780, Solyc08g007940, Solyc08g080740, Solyc10g017520, Solyc05g049870, Solyc01g094320, Solyc06g071310, Solyc03g114000, Solyc04g077780, Solyc12g088320, Solyc11g044740	441295, 229974, 143123	SM000337S12894, SM000029S10492, SM000100S09415	Zci1a_33846	Zci_04403	UTEX1559_17571	UTEX1560_11878	Zm00001d028550, Zm00001d025926, Zm00001d002844, Zm00001d051262, Zm00001d017382, Zm00001d035304, Zm00001d041725, Zm00001d037252
Zci_04516	N0.HOG0001404	OG0000838	n0	AagrOXF_evm.TU.utg000010l.35, AagrOXF_evm.TU.utg000041l.210, AagrOXF_evm.TU.utg000109l.88	Azfi_s0370.g067087, Azfi_s1437.g103127, Azfi_s0129.g048920	AT4G00500, AT3G49050, AT5G37710	Bradi1g27790, Bradi4g38651, Bradi4g38641, Bradi2g00831, Bradi1g44137	CBR_g23955	NA	NA	CLOP_g13052, CLOP_g13051, CLOP_g24421, CLOP_g4549	13135, 13668, 6747, 9354	Me1_v2_0125880, Me1_v2_0132370	Mp5g01430	NA	NA	LOC_Os07g29794, LOC_Os09g39580, LOC_Os06g14490	NA	pm004093g0030, pm024473.t1, pm001024g0090, pm001024.t1, pm189950g0010, pm018326g0010, pm004093g0020, pm017970g0010, pm024968g0010, pm004093g0040, pm029014g0010, pm033241.t1	Pp3c23_4180, Pp3c20_5230, Pp3c20_5490	Solyc01g094570, Solyc03g025510, Solyc05g051280, Solyc11g011120	442731, 439431, 266956	SM000019S05010, SM000078S22026, SM000117S25519, SM000354S13409, SM000318S12232	Zci1a_30601, Zci1a_33163, Zci1a_14872, Zci1a_11101, Zci1a_17850, Zci1a_32622	Zci_04516, Zci_04698, Zci_12043, Zci_14700	UTEX1559_04641, UTEX1559_00153, UTEX1559_09452, UTEX1559_09799	UTEX1560_06705, UTEX1560_06620, UTEX1560_00210, UTEX1560_09007	Zm00001d021490, Zm00001d005328, Zm00001d037354
Zci_09405	N0.HOG0000953	OG0000531	n1	AagrOXF_evm.TU.utg000049l.641	Azfi_s0001.g000346, Azfi_s0093.g043375	AT2G19470, AT4G08800, AT1G72710, AT4G26100, AT5G57015	Bradi2g14310, Bradi2g47850	CBR_g6317, CBR_g8872	Chrsp44S05903	Cre01.g800046_4532, Cre12.g549750_4532	CLOP_g4045, CLOP_g12926, CLOP_g16779	9436	Me1_v2_0138470	Mp6g17600	23916	Olucimarinus_14134	LOC_Os01g38950, LOC_Os05g51560, LOC_Os01g51200	PRCOL_00002166_RA	pm021429.t1, pm001964g0020, pm013502g0010, pm003377.t2, pm009404g0010	Pp3c13_5790, Pp3c4_21820, Pp3c13_5910	Solyc09g090230, Solyc06g062790, Solyc03g121820, Solyc07g040720, Solyc05g016410	113824, 231975	SM000421S16084, SM000036S13315, SM000069S20677	Zci1a_15652	Zci_09405	UTEX1559_09013	UTEX1560_08698	Zm00001d039162, Zm00001d009756, Zm00001d043693, Zm00001d011696
Zci_03395	N0.HOG0003725	OG0002732	n0	AagrOXF_evm.TU.utg000042l.500, AagrOXF_evm.TU.utg000081l.309, AagrOXF_evm.TU.utg000081l.313	Azfi_s0006.g009848, Azfi_s0581.g078320	AT1G05360, AT4G14950	Bradi2g51700, Bradi1g24090	CBR_g41708	Chrsp66S07309	Cre06.g272000_4532	CLOP_g2043	4823	Me1_v2_0061240	Mp1g15000	12859	Olucimarinus_10211	LOC_Os01g57066, LOC_Os07g38380	PRCOL_00002912_RA	pm029812g0010, pm000677g0010, pm008643g0010, pm017593g0010	Pp3c5_24130, Pp3c16_21940	Solyc09g075850, Solyc01g099140	155951	SM000002S05665, SM000126S26358, SM000172S03055	Zci1a_09336	Zci_03395	UTEX1559_05980	UTEX1560_06541	Zm00001d043275, Zm00001d048902, Zm00001d021861, Zm00001d040150, Zm00001d016727
Zci_01190	N0.HOG0000531	OG0000274	n0	AagrOXF_evm.TU.utg000006l.967	Azfi_s0433.g069570, Azfi_s1498.g103675, Azfi_s0018.g014720	AT4G01240, AT3G05390, AT1G29790, AT3G27230, AT5G40830	Bradi1g41890, Bradi5g11160, Bradi3g51872, Bradi3g51866, Bradi3g34510	NA	NA	NA	CLOP_g1520, CLOP_g2073, CLOP_g6824, CLOP_g3266, CLOP_g2241, CLOP_g23496, CLOP_g9502, CLOP_g10087, CLOP_g17772, CLOP_g19247, CLOP_g9624, CLOP_g4642, CLOP_g18149, CLOP_g4429, CLOP_g13894, CLOP_g9623, CLOP_g2130	NA	Me1_v2_0079960, Me1_v2_0185310, Me1_v2_0132530, Me1_v2_0173000, Me1_v2_0223510, Me1_v2_0137940, Me1_v2_0137960	Mp5g15060, Mp3g07630	NA	NA	LOC_Os06g27980, LOC_Os04g36710, LOC_Os08g02150, LOC_Os10g42770	NA	pm010033g0020, pm019019g0010, pm010546g0020, pm059633g0020, pm000294g0030, pm000802g0050, pm013652g0030, pm000294.t2, pm006045g0010, pm005349g0020, pm005967g0030, pm002179g0010, pm014856g0010, pm010100g0030, pm004757g0030, pm002179g0020, pm004176g0010, pm003893g0020, pm000271.t2, pm007354g0040, pm004138g0060, pm014921g0050, pm002336.t1, pm023768g0020, pm002439g0020, pm009847g0010, pm002597g0030	Pp3c13_19490, Pp3c3_20680, Pp3c4_15100, Pp3c1_20859, Pp3c20_13850	Solyc01g095190, Solyc03g026030.1, Solyc05g051210, Solyc10g052600.1, Solyc02g071160	52690, 135385, 101023, 12874, 84529	SM000119S25639, SM000019S05079, SM000178S03455, SM000087S23359, SM000065S20175, SM000243S08571, SM000032S12038, SM000017S02814, SM000122S25750, SM000017S02809, SM000122S25745, SM000032S12045, SM000109S14129, SM000281S10755, SM000053S17487, SM000091S24613, SM000160S02536, SM000238S08037, SM000242S08485, SM000002S05773, SM000577S18750, SM003106S12284, SM003271S12605	Zci1a_01604, Zci1a_00565, Zci1a_07624, Zci1a_02550, Zci1a_15403, Zci1a_14312, Zci1a_01038, Zci1a_41296	Zci_01952, Zci_08072, Zci_04483, Zci_06191, Zci_08894, Zci_01190	UTEX1559_01973, UTEX1559_08923, UTEX1559_04685, UTEX1559_08409, UTEX1559_16360, UTEX1559_17677, UTEX1559_00482	UTEX1560_08493, UTEX1560_14592, UTEX1560_08931, UTEX1560_07709, UTEX1560_09344, UTEX1560_14917, UTEX1560_05886	Zm00001d035018, Zm00001d042581, Zm00001d025489, Zm00001d003563, Zm00001d049688, Zm00001d020192, Zm00001d037467, Zm00001d035067, Zm00001d013422, Zm00001d030129
Zci_04202	N0.HOG0005366	OG0004186	n0	AagrOXF_evm.TU.utg000087l.138	Azfi_s0215.g058419	AT3G03490, AT5G17550	Bradi3g50800	CBR_g22421	Chrsp44S09053	Cre02.g119000_4532	CLOP_g20824	3039	Me1_v2_0091450	Mp6g19710	26665	NA	LOC_Os02g44220	PRCOL_00005614_RA	pm028950g0020, pm008845.t1, pm000786g0070, pm028950g0010	Pp3c2_16800, Pp3c1_22650	Solyc06g060720	99133, 88136	SM000141S00876, SM000010S04378, SM000883S23793	Zci1a_36337	Zci_04202	UTEX1559_09528, UTEX1559_09529	UTEX1560_16074	Zm00001d051374, Zm00001d017501, Zm00001d051373
Zci_09663	N0.HOG0003527	OG0002551	n0	AagrOXF_evm.TU.utg000126l.83	Azfi_s0015.g013991, Azfi_s0061.g035013, Azfi_s0037.g025922, Azfi_s0054.g033582	AT2G16460, AT3G51090	Bradi1g35040	CBR_g41121	Chrsp56S06672	Cre09.g388400_4532	CLOP_g4044, CLOP_g9396	6721	Me1_v2_0063430, Me1_v2_0081650	Mp1g21230	3578	Olucimarinus_42864	LOC_Os06g49890	PRCOL_00003952_RA	pm019982g0010, pm009183g0010, pm001545g0020, pm179418g0010, pm004498g0010	Pp3c19_15990, Pp3c18_7440, Pp3c2_10980, Pp3c14_20750	Solyc02g084560, Solyc10g054320, Solyc01g110320	68264, 439685	SM000053S17458, SM000091S24590, SM000160S02558	Zci1a_22408, Zci1a_12613	Zci_09663	UTEX1559_10988	UTEX1560_03573	Zm00001d036417
Zci_09431	N0.HOG0009890	OG0008444	n0	AagrOXF_evm.TU.utg000077l.249	Azfi_s0033.g025019	AT2G33180	Bradi4g33377	CBR_g50773	Chrsp44S05843	NA	NA	NA	Me1_v2_0234280	NA	NA	NA	LOC_Os09g30410	NA	NA	Pp3c11_15670, Pp3c11_15610	Solyc10g007670	NA	SM000019S05003, SM000036S13320, SM000069S20667	Zci1a_00744	Zci_09431	UTEX1559_07030	UTEX1560_05697	Zm00001d006002
Zci_10822	N0.HOG0005515	OG0004314	n0	AagrOXF_evm.TU.utg000006l.1042	Azfi_s0652.g081078, Azfi_s3557.g116195, Azfi_s3130.g114638	AT1G29990	Bradi3g09300	CBR_g48714	Chrsp64S07153	Cre12.g502750_4532	CLOP_g15085	10837	Me1_v2_0190040, Me1_v2_0040850	Mp3g06090	19088	Olucimarinus_29026	LOC_Os02g14860	PRCOL_00000028_RA	pm004322g0020	Pp3c22_1770	Solyc08g016420	74672	SM000146S00948, SM000072S21200, SM000048S16566, SM000701S21273	Zci1a_13966	Zci_10822	UTEX1559_08702	UTEX1560_06382	Zm00001d052826, Zm00001d009796, Zm00001d016158, Zm00001d016159
Zci_03446	N0.HOG0010865	OG0009335	n0	NA	NA	NA	NA	CBR_g88566	Chrsp17S08726	NA	CLOP_g18311	8998	NA	NA	NA	NA	NA	PRCOL_00005357_RA	pm000348.t1, pm007911.t1	NA	NA	NA	SM000023S07594, SM000020S06043, SM000034S12789	Zci1a_37499	Zci_03446	UTEX1559_05914, UTEX1559_05915	UTEX1560_13818, UTEX1560_13819	NA
Zci_14448	N0.HOG0005307	OG0004130	n0	AagrOXF_evm.TU.utg000049l.649	Azfi_s0661.g081442	AT2G18040	Bradi5g01720, Bradi5g25153	CBR_g552	Chrsp75S07545	Cre16.g671900_4532	CLOP_g25587, CLOP_g2991	9758	Me1_v2_0222330	NA	23713	Olucimarinus_31808, Olucimarinus_27955	LOC_Os04g56800	PRCOL_00002510_RA	pm007485.t1, pm127240g0010, pm000770.t1, pm017653.t1	Pp3c10_25090, Pp3c20_23120	Solyc01g110530, Solyc02g062250	232038	SM000013S26483, SM000004S15054, SM000045S16176	Zci1a_35395	Zci_14448	UTEX1559_10759	UTEX1560_10625	Zm00001d025062, Zm00001d006586
Zci_05409	N0.HOG0004188	OG0003136	n0	AagrOXF_evm.TU.utg000002l.131	Azfi_s0173.g055855	AT4G02980	Bradi4g06030	CBR_g38020	NA	NA	CLOP_g22671, CLOP_g2727, CLOP_g17380	5239	Me1_v2_0197290, Me1_v2_0039980	NA	NA	NA	LOC_Os12g34450, LOC_Os12g34460	NA	pm014370g0040, pm004041g0010, pm006779g0010, pm002790g0020, pm004798g0010, pm012356g0020, pm006448g0040, pm010877.t1	Pp3c4_12750, Pp3c4_12660	Solyc06g084390	109785	SM000080S22954, SM000048S16540, SM000049S16780, SM001371S00485, SM000124S25942, SM000079S22454, SM001331S26848	Zci1a_10274	Zci_05409	UTEX1559_05291	UTEX1560_16407	Zm00001d023904, Zm00001d023908, Zm00001d041711
Zci_14940	N0.HOG0004324	OG0003257	n0	AagrOXF_evm.TU.utg000111l.220	Azfi_s0002.g001151	AT1G18070	Bradi5g05200, Bradi3g12030	CBR_g45508, CBR_g45513, CBR_g45510	Chrsp103S01013	Cre06.g284750_4532	CLOP_g8504	831	Me1_v2_0082750, Me1_v2_0046260	Mp1g00820	29459	Olucimarinus_14961	LOC_Os04g20220, LOC_Os02g25870	PRCOL_00006751_RA	pm001158g0070, pm000535g0010, pm013322g0020, pm003496.t1	Pp3c27_2160	Solyc06g069020	115313	SM000046S16402, SM000066S20437, SM000045S16248, SM000047S16885	Zci1a_19539	Zci_14940	UTEX1559_02975	UTEX1560_09878, UTEX1560_09877, UTEX1560_09876	Zm00001d025100, Zm00001d004172
Zci_00136	N0.HOG0002411	OG0001605	n0	AagrOXF_evm.TU.utg000049l.159	Azfi_s0237.g059592, Azfi_s0198.g057436, Azfi_s0272.g061272, Azfi_s0501.g073885	AT2G23070, AT3G50000, AT5G67380, AT2G23080	Bradi1g70690, Bradi1g07810, Bradi1g59010, Bradi1g07750	CBR_g29313	Chrsp409S05666, Chrsp45S05977	Cre16.g665600_4532, Cre14.g619166_4532, Cre12.g549800_4532	CLOP_g23218, CLOP_g10044, CLOP_g15807	3504	Me1_v2_0122800	Mp8g05810	11721, 27519	Olucimarinus_13142	LOC_Os03g10940, LOC_Os03g55389, LOC_Os07g02350, LOC_Os03g55490	PRCOL_00002286_RA	pm000506.t1, pm017038g0010	Pp3c2_21130, Pp3c1_15310, Pp3c1_15460, Pp3c2_21250	Solyc02g064700, Solyc03g044140, Solyc02g092640, Solyc09g056270	146942	SM000073S21405, SM000203S06146, SM000311S11919	Zci1a_17342	Zci_00136	UTEX1559_11104	UTEX1560_04991	Zm00001d034125, Zm00001d013217, Zm00001d007951, Zm00001d018669, Zm00001d034137
Zci_03768	N0.HOG0003909	OG0002891	n0	AagrOXF_evm.TU.utg000042l.70	Azfi_s0114.g046034	AT3G12180, AT1G62880, AT1G12340, AT1G12390, AT4G12090	Bradi4g06710, Bradi1g51550	CBR_g18650	Chrsp118S01737	Cre01.g036550_4532	CLOP_g4573	10046	Me1_v2_0147820	Mp5g03040	25653	Olucimarinus_9005	LOC_Os12g32180, LOC_Os06g04500	PRCOL_00001064_RA	pm015018g0010, pm000013g0030, pm015018.t1	Pp3c7_11500, Pp3c11_17020	Solyc03g063970, Solyc05g051030, Solyc08g007510, Solyc06g060550	93931	SM000027S09664, SM000081S22660, SM000125S26081	Zci1a_17002, Zci1a_17003	Zci_03768	UTEX1559_05777	UTEX1560_05209	Zm00001d035235, Zm00001d041744
Zci_04267	N0.HOG0004260	OG0003196	n0	AagrOXF_evm.TU.utg000042l.376	Azfi_s0560.g076954, Azfi_s0017.g014449	AT5G66240, AT5G14530	Bradi4g20090, Bradi2g18000	CBR_g30894	Chrsp409S05658	Cre02.g800220_4532	CLOP_g1237, CLOP_g15828	9885	Me1_v2_0216070	Mp2g16850	16712	Olucimarinus_12699	LOC_Os07g40030, LOC_Os05g46570	PRCOL_00003574_RA	pm011533g0040, pm008497g0050, pm021993g0010	Pp3c21_4780, Pp3c19_4130	Solyc02g083940, Solyc12g035360	83551, 106210, 106429	SM000003S11025, SM000003S10967, SM000072S21231	NA	Zci_04267	UTEX1559_14853	UTEX1560_00639	Zm00001d002504, Zm00001d038877, Zm00001d009430
Zci_07637	N0.HOG0007952	OG0006629	n0	AagrOXF_evm.TU.utg000077l.96	Azfi_s0292.g063414	AT1G72420, AT1G17350	Bradi2g48720	CBR_g33997	Chrsp12S02009	Cre02.g076750_4532	CLOP_g1170	3702	Me1_v2_0068090	Mp2g09550	17884	Olucimarinus_7625, Olucimarinus_119688	LOC_Os01g52720	NA	pm003839g0040	Pp3c3_21840	Solyc11g005060	109371	SM000069S20713, SM000040S14775, SM000094S24723	NA	Zci_07637	UTEX1559_04396	UTEX1560_09921	Zm00001d011750
Zci_13766	N0.HOG0001471	OG0000884	n47	AagrOXF_evm.TU.utg000085l.41	Azfi_s0292.g063378	AT1G68185	Bradi2g43070	CBR_g17172	Chrsp57S09119, Chrsp66S07274	NA	CLOP_g4943, CLOP_g4940	9973	Me1_v2_0181190, Me1_v2_0219220, Me1_v2_0034060, Me1_v2_0181200	Mp4g00580	7156	NA	NA	PRCOL_00002533_RA	pm002386g0010, pm002386g0020	Pp3c2_12120, Pp3c14_19600	Solyc03g013030	NA	NA	Zci1a_19959	Zci_13766	UTEX1559_03368	UTEX1560_15016	Zm00001d012044, Zm00001d011308, Zm00001d021887
Zci_07287	N0.HOG0007687	OG0006374	n0	AagrOXF_evm.TU.utg000083l.326	Azfi_s0005.g009243	AT1G75980	Bradi3g01887	CBR_g54848	Chrsp17S02679	Cre09.g392400_4532	CLOP_g22819	14514	Me1_v2_0079090	Mp1g19740	9765	NA	LOC_Os02g02810	PRCOL_00005216_RA	pm012843g0010, pm030305g0010, pm002890g0010, pm025286g0010	Pp3c20_3890	Solyc04g081850	74174	SM000066S20395, SM000043S15809, SM005907S19190	Zci1a_16813	Zci_07287	UTEX1559_02172	UTEX1560_13825	NA
Zci_06738	N0.HOG0010872	OG0009342	n0	NA	NA	NA	NA	CBR_g30025	Chrsp51S06511	NA	CLOP_g2411	13261	NA	Mp2g11340	4937	NA	NA	NA	pm011991.t1, pm003078g0020, pm014009g0020, pm037483g0010, pm011991g0020	Pp3c5_27080	NA	NA	NA	Zci1a_39007	Zci_06738	UTEX1559_13294	UTEX1560_04522	NA
Zci_05067	N0.HOG0005206	OG0004039	n0	AagrOXF_evm.TU.utg000006l.1243	Azfi_s0148.g053088, Azfi_s1862.g107544	AT1G30890, AT3G59500	Bradi3g06880, Bradi1g35840, Bradi5g00570	CBR_g12765	Chrsp97S08415	Cre17.g704550_4532	CLOP_g4963	3151	Me1_v2_0179520	Mp5g20490	NA	Olucimarinus_14378	LOC_Os06g41590, LOC_Os04g08320	PRCOL_00006975_RA	pm007931g0020, pm003991.t1, pm024039g0030	Pp3c2_23300, Pp3c23_1060	Solyc07g005670, Solyc06g083630	110732	NA	Zci1a_19165, Zci1a_31007	Zci_05067	UTEX1559_12061	UTEX1560_08178	Zm00001d053686, Zm00001d041267, Zm00001d012393
Zci_00175	N0.HOG0003980	OG0002957	n0	NA	Azfi_s0008.g011597, Azfi_s0392.g067782, Azfi_s0022.g015996, Azfi_s0026.g023445	AT4G26630, AT5G55660, AT3G48710, AT5G63550	Bradi1g15140, Bradi1g15713, Bradi2g59267	CBR_g5759	NA	Cre12.g513150_4532	NA	6494	Me1_v2_0092810	Mp7g19100	29438	Olucimarinus_32956	LOC_Os03g40010, LOC_Os01g70020	PRCOL_00002049_RA	pm012612g0010, pm036138g0010	Pp3c14_4960	Solyc07g065490, Solyc10g006000, Solyc06g072660, Solyc03g097490	438416	SM000098S25143, SM000037S13582, SM000130S27123	Zci1a_10984, Zci1a_28548	Zci_00175	UTEX1559_09787	UTEX1560_04814	Zm00001d033159, Zm00001d013757, Zm00001d038602, Zm00001d042302
Zci_00760	N0.HOG0008246	OG0006907	n0	AagrOXF_evm.TU.utg000125l.37	Azfi_s0378.g067316	AT5G37290	Bradi1g53960, Bradi3g34120	CBR_g12236	Chrsp17S08747	NA	CLOP_g24255, CLOP_g11831	NA	Me1_v2_0212510	Mp2g00830	18828, 10672	NA	LOC_Os11g34364	NA	pm006509g0010, pm039151.t1	NA	Solyc04g014610, Solyc04g071330	168321	SM000121S25976, SM000098S25078, SM000115S23906	NA	Zci_00760	UTEX1559_11335	UTEX1560_03501	Zm00001d051605
Zci_13213	N0.HOG0007049	OG0005772	n0	AagrOXF_evm.TU.utg000080l.74	NA	AT1G64880	Bradi3g00387	CBR_g50476	Chrsp97S08428	Cre09.g407100_4532	CLOP_g13585	6997	Me1_v2_0018980, Me1_v2_0030940, Me1_v2_0087550, Me1_v2_0087560	Mp4g01640	16143	Olucimarinus_8413	LOC_Os02g01230	PRCOL_00002029_RA	pm000762.t2, pm011617.t1	Pp3c8_16260	Solyc11g008710	404176	SM000041S15490, SM000005S17277, SM000054S18148	Zci1a_25885	Zci_13213	UTEX1559_15356	UTEX1560_05791	Zm00001d014924
Zci_00737	N0.HOG0003440	OG0002475	n0	AagrOXF_evm.TU.utg000129l.104, AagrOXF_evm.TU.utg000001l.485	Azfi_s0001.g000397, Azfi_s0331.g065401	AT2G36130	Bradi3g42920	NA	NA	Cre12.g499400_4532	CLOP_g20298, CLOP_g4579	4676	Me1_v2_0143330, Me1_v2_0174080	Mp2g01200, Mp4g21320	27741	Olucimarinus_14660	LOC_Os08g44520	PRCOL_00001329_RA	pm002107.t1, pm003493g0020, pm018351g0030	Pp3c22_5330, Pp3c8_17970, Pp3c20_2420, Pp3c23_17310, Pp3c3_7350	Solyc09g010190	270779, 229819	SM000396S15196, SM000808S22989, SM000081S22667, SM000125S26061	Zci1a_17034, Zci1a_24707	Zci_00737, Zci_04789	UTEX1559_13777, UTEX1559_02622, UTEX1559_02623	UTEX1560_06940, UTEX1560_01480	Zm00001d031937
Zci_03193	N0.HOG0006282	OG0005041	n0	AagrOXF_evm.TU.utg000050l.741	Azfi_s0251.g060285, Azfi_s2379.g111035	AT5G20890	Bradi2g16500	CBR_g20448	Chrsp38S05530	Cre09.g416750_4532	CLOP_g22791	12696	Me1_v2_0168760	Mp5g16030	8214	Olucimarinus_42602	LOC_Os05g48290, LOC_Os03g42220	PRCOL_00000789_RA	pm000788g0050, pm008427.t1	Pp3c5_16830, Pp3c6_15940	Solyc11g069000	171093	SM000267S09850, SM000177S03198, SM000063S19982	Zci1a_30093	Zci_03193	UTEX1559_00916	UTEX1560_14162	Zm00001d040257, Zm00001d008369
Zci_15189	N0.HOG0010468	OG0008969	n0	NA	Azfi_s0004.g008583	AT5G52380	Bradi5g17970	CBR_g18775	NA	NA	CLOP_g10847	NA	Me1_v2_0177810	Mp3g05940	NA	NA	LOC_Os04g46920	NA	pm004233.t2, pm019759g0010	Pp3c16_20170	Solyc03g025740	NA	NA	Zci1a_31889	Zci_15189	UTEX1559_08134	UTEX1560_10166	Zm00001d002713
Zci_07331	N0.HOG0003160	OG0002235	n0	AagrOXF_evm.TU.utg000119l.45	Azfi_s0002.g001428, Azfi_s0102.g044598, Azfi_s0282.g063032, Azfi_s1087.g097168	AT2G14120, AT4G33650	Bradi5g07690, Bradi2g58980	CBR_g56849	NA	Cre17.g724150_4532	CLOP_g19378, CLOP_g22094	1915	Me1_v2_0079430	Mp2g24350	3891, 3892	Olucimarinus_29011	LOC_Os04g31190, LOC_Os01g69130	PRCOL_00001753_RA	pm008720.t1, pm023591g0010	Pp3c23_1630, Pp3c23_18740, Pp3c20_4300, Pp3c8_23990, Pp3c24_19870	Solyc08g006600, Solyc11g043210, Solyc01g108050, Solyc01g106050, Solyc01g108040.1, Solyc01g150170	101670, 404911, 437242	SM000131S26724, SM000058S18488, SM000030S11493	Zci1a_19348	Zci_07331	UTEX1559_06747	UTEX1560_03788	Zm00001d042338, Zm00001d012027
Zci_09877	N0.HOG0002803	OG0001924	n0	AagrOXF_evm.TU.utg000116l.49	Azfi_s0052.g031532, Azfi_s2690.g112653, Azfi_s0114.g046046, Azfi_s0058.g034469, Azfi_s2966.g113887	AT2G03350, AT5G37070, AT3G08890, AT5G01610	Bradi1g70440, Bradi2g40720, Bradi2g41360, Bradi1g65157	NA	NA	NA	CLOP_g2577	10865	Me1_v2_0053330	Mp4g09130	NA	NA	LOC_Os03g11210, LOC_Os05g27950, LOC_Os01g38500, LOC_Os03g18560	NA	pm002801.t1	Pp3c10_12290, Pp3c3_23220	Solyc03g115640, Solyc05g012680, Solyc09g015420, Solyc10g076420, Solyc10g085300	80486	SM000073S21460, SM000050S16996, SM000113S24065, SM000118S25582	Zci1a_33855, Zci1a_00331	Zci_09877, Zci_09837, Zci_08201	UTEX1559_11201, UTEX1559_14925, UTEX1559_14398	UTEX1560_15503, UTEX1560_05364, UTEX1560_05809	Zm00001d028025, Zm00001d048117, Zm00001d038012, Zm00001d044230, Zm00001d028785
Zci_09354	N0.HOG0009620	OG0008188	n0	AagrOXF_evm.TU.utg000003l.520	Azfi_s0003.g007866, Azfi_s0005.g009276	AT4G17420, AT5G47420	Bradi1g08760	NA	NA	NA	CLOP_g5124	NA	NA	Mp3g07480	NA	Olucimarinus_39292	LOC_Os03g53600	NA	NA	NA	Solyc08g007320	230257	SM000024S07741, SM000049S16702, SM000039S14532	NA	Zci_09354	UTEX1559_10334	UTEX1560_14579, UTEX1560_14580	Zm00001d034001
Zci_09214	N0.HOG0007795	OG0006481	n0	NA	NA	NA	NA	NA	NA	NA	CLOP_g740	NA	NA	NA	NA	NA	NA	NA	NA	Pp3s1176_20, Pp3s1176_21, Pp3c20_160, Pp3s877_36, Pp3s877_30, Pp3s1097_10, Pp3s1097_21, Pp3s1078_10, Pp3s1078_11, Pp3s1034_30, Pp3s1034_40	Solyc01g022760.1, Solyc01g022785.1	NA	NA	NA	Zci_09214, Zci_09006, Zci_16330	UTEX1559_08360, UTEX1559_04502, UTEX1559_08225, UTEX1559_18578	UTEX1560_03642, UTEX1560_12745, UTEX1560_17243, UTEX1560_19371, UTEX1560_03214, UTEX1560_06955, UTEX1560_02061	NA
Zci_04733	N0.HOG0003574	OG0002589	n0	AagrOXF_evm.TU.utg000006l.283, AagrOXF_evm.TU.utg000087l.201	Azfi_s0076.g037883, Azfi_s0039.g026396, Azfi_s0185.g056599	AT1G36310, AT1G31600	Bradi3g59110, Bradi5g20800	CBR_g58096, CBR_g15981	Chrsp29S04535	Cre04.g224002_4532	CLOP_g21999	8143	Me1_v2_0072740	Mp5g06530	21227	Olucimarinus_88555, Olucimarinus_36712, Olucimarinus_41621	LOC_Os02g51490, LOC_Os04g51360	PRCOL_00005291_RA	pm238367g0010, pm001742g0020, pm010980g0050, pm024134g0030	Pp3c8_16200	Solyc04g072390, Solyc12g096230	78643, 78730	SM000071S21037, SM000032S12052, SM000119S25663	Zci1a_29389	Zci_04733	UTEX1559_02691, UTEX1559_02692	UTEX1560_03467	Zm00001d018070, Zm00001d002420
Zci_12742	N0.HOG0003926	OG0002908	n0	AagrOXF_evm.TU.utg000050l.597	Azfi_s0087.g042391	AT4G19150	Bradi3g21630	CBR_g41202	Chrsp110S01571, Chrsp1S08787	Cre09.g396549_4532	CLOP_g4207	489, 13772	Me1_v2_0039590	Mp7g16970, Mp8g13350	20284, 2088	Olucimarinus_7246, Olucimarinus_26723, Olucimarinus_9238	LOC_Os10g43040	PRCOL_00001417_RA	pm015469g0020, pm026190g0030, pm019173g0020, pm006297g0010, pm015985g0060, pm015985g0050, pm040414g0010	Pp3c7_14210	Solyc08g005520	7078	NA	Zci1a_14762	Zci_12742, Zci_09469	UTEX1559_14762, UTEX1559_06983, UTEX1559_06984	UTEX1560_01068, UTEX1560_04135	Zm00001d030167, Zm00001d041589
Zci_02035	N0.HOG0008362	OG0007018	n0	AagrOXF_evm.TU.utg000002l.256	Azfi_s0209.g058040	NA	Bradi1g01810	CBR_g2798	NA	Cre02.g105150_4532	CLOP_g23986	6571	Me1_v2_0162050	Mp2g19760	NA	NA	LOC_Os03g63074	PRCOL_00000420_RA	pm002364g0020, pm006775.t1, pm006775g0020	Pp3c15_21680	Solyc07g015980, Solyc07g032590.1	NA	SM000048S16546, SM000049S16772, SM000080S22961	Zci1a_02387	Zci_02035	UTEX1559_17131	UTEX1560_06701	Zm00001d034838
Zci_05532	N0.HOG0004009	OG0002979	n0	AagrOXF_evm.TU.utg000001l.103, AagrOXF_evm.TU.utg000050l.480	Azfi_s0102.g044427, Azfi_s0008.g011497, Azfi_s0057.g034308, Azfi_s0019.g015161	AT3G20650	Bradi1g55497, Bradi3g15420	CBR_g12774	Chrsp64S00561	Cre03.g204752_4532	CLOP_g23937, CLOP_g1968	3788	Me1_v2_0075300, Me1_v2_0075310	Mp6g06920	8725, 8726	Olucimarinus_34792	LOC_Os08g08200	PRCOL_00001408_RA	pm002435g0050, pm182888g0010, pm004249g0020, pm004941g0020	Pp3c23_20110	Solyc09g005300, Solyc03g118250	424575, 417520, 84950	SM000200S05815, SM000214S06796	Zci1a_02759	Zci_05532	UTEX1559_05349	UTEX1560_03738	Zm00001d033708
Zci_00828	N0.HOG0004900	OG0003762	n0	AagrOXF_evm.TU.utg000005l.497, AagrOXF_evm.TU.utg000006l.40, AagrOXF_evm.TU.utg000006l.44	Azfi_s0016.g014392, Azfi_s0061.g034872	AT5G60620	Bradi1g25790	CBR_g18671	Chrsp118S01717	Cre06.g273250_4532	CLOP_g18094	5643	Me1_v2_0158210	Mp1g03080, Mp1g04840	10753	Olucimarinus_51690	LOC_Os07g34730	PRCOL_00006733_RA	pm002710g0050, pm007626.t1	Pp3c11_26030, Pp3c14_5980	Solyc08g082340	152980	SM000117S25497, SM000085S23299, SM000006S19493	Zci1a_14524	Zci_00828	UTEX1559_04508	UTEX1560_03167	Zm00001d021675, Zm00001d047666
Zci_02697	N0.HOG0007676	OG0006363	n0	AagrOXF_evm.TU.utg000077l.46	Azfi_s0003.g007661, Azfi_s3272.g115221	AT4G05400, AT4G21140	Bradi3g28570	CBR_g40874	Chrsp127S01939	Cre10.g428350_4532	CLOP_g15186	702	Me1_v2_0181220	Mp3g02790	28714	Olucimarinus_25995	LOC_Os01g32790	PRCOL_00005619_RA	pm024646g0010, pm040691g0020, pm007961g0030, pm000949g0080	Pp3c17_23470	Solyc01g095420	NA	NA	Zci1a_35607	Zci_02697	UTEX1559_00990	UTEX1560_01606	Zm00001d017529
Zci_07359	N0.HOG0006632	OG0005370	n0	AagrOXF_evm.TU.utg000049l.448	Azfi_s0016.g014216, Azfi_s1622.g104770	AT5G01470	Bradi1g03150, Bradi1g03290	CBR_g4113	Chrsp57S06745	NA	CLOP_g18075, CLOP_g16731	1933	Me1_v2_0079240	Mp1g00630	NA	NA	LOC_Os03g61140	NA	pm022599g0020, pm022646.t1, pm029695.t1, pm001181g0050, pm019257g0030, pm029695g0020	Pp3c17_21930	Solyc10g085160	89173	SM000076S21774, SM000028S10208, SM000030S11383	Zci1a_19278	Zci_07359	UTEX1559_06788	UTEX1560_02927	Zm00001d034717
Zci_00014	N0.HOG0004525	OG0003432	n0	AagrOXF_evm.TU.utg000083l.67	Azfi_s0212.g058193	AT3G05710, AT5G26980, AT4G02195	Bradi1g50610	CBR_g24125, CBR_g45822, CBR_g50624	Chrsp369S00408	Cre12.g507450_4532	CLOP_g24679, CLOP_g1617	87	Me1_v2_0142820	Mp2g14140	25032	Olucimarinus_5512	LOC_Os06g02570	PRCOL_00002987_RA	pm004909g0070, pm002649g0040, pm014508g0010, pm106960g0010	Pp3c9_13620	Solyc01g100170, Solyc09g075530	234811	SM000031S11517, SM000025S08345, SM000207S06175	Zci1a_12133	Zci_00014	UTEX1559_04403	UTEX1560_12726	Zm00001d045530, Zm00001d013996, Zm00001d039404
Zci_03343	N0.HOG0006552	OG0005295	n0	AagrOXF_evm.TU.utg000010l.471	Azfi_s0826.g088229	AT4G34070, AT5G06260	Bradi4g42110	NA	Chrsp2S08905	Cre10.g436950_4532	CLOP_g18193, CLOP_g19435	4421	Me1_v2_0081110, Me1_v2_0081100	Mp1g25880	312, 313	NA	LOC_Os12g06100	NA	pm009311g0010, pm004836.t2, pm004723g0010, pm004723.t1	Pp3c10_6920	Solyc10g083160	404996	SM000002S05647, SM000126S26353, SM000153S01584	Zci1a_18333	Zci_03343	UTEX1559_03493	UTEX1560_01636	Zm00001d023452
Zci_04498	N0.HOG0009621	OG0008189	n0	AagrOXF_evm.TU.utg000003l.542, AagrOXF_evm.TU.utg000049l.132, AagrOXF_evm.TU.utg000116l.422	NA	NA	NA	CBR_g12838	Chrsp111S01599	NA	CLOP_g970	NA	Me1_v2_0196870	Mp3g17820	19338	NA	NA	NA	pm056936g0020	Pp3c15_4830	NA	NA	SM000044S16006, SM000085S23242, SM000323S12626	Zci1a_36554, Zci1a_36553	Zci_04498	UTEX1559_04664	UTEX1560_11261, UTEX1560_11262	NA
Zci_05815	N0.HOG0005743	OG0004534	n0	AagrOXF_evm.TU.utg000119l.59	Azfi_s0021.g015765	AT1G52380, AT3G15970	Bradi1g33117, Bradi1g33130	CBR_g38869	Chrsp187S02947	Cre15.g641000_4532	CLOP_g25456	12198	Me1_v2_0053840	Mp5g18610	5115	Olucimarinus_25876	LOC_Os05g28190	PRCOL_00002651_RA	pm007207g0050, pm006344.t2, pm003150g0030, pm007863g0020	Pp3c3_6060, Pp3c3_6080	Solyc06g066740, Solyc03g120280.1	NA	SM000074S21641, SM000149S01342, SM000269S09894	Zci1a_05384	Zci_05815	UTEX1559_09000	UTEX1560_07297	Zm00001d043757, Zm00001d011648
Zci_08112	N0.HOG0000717	OG0000387	n31	NA	Azfi_s0005.g009454, Azfi_s0303.g063796, Azfi_s0257.g060598	AT4G24960, AT5G50720, AT5G62490, AT1G69700, AT1G74520, AT2G42820	Bradi3g37920, Bradi4g31810, Bradi4g18820, Bradi3g59310, Bradi1g45240, Bradi4g14170, Bradi2g48770	CBR_g50751	Chrsp112S01631, Chrsp187S02939	Cre03.g176930_4532, Cre03.g177500_4532	CLOP_g13941, CLOP_g18564	5350, 10359	Me1_v2_0225480, Me1_v2_0155410, Me1_v2_0096100	Mp1g15330, Mp3g15420	NA	Olucimarinus_94638	LOC_Os08g36440, LOC_Os09g27730, LOC_Os11g30500, LOC_Os02g51290, LOC_Os06g12220, LOC_Os11g38920, LOC_Os01g52780	PRCOL_00002133_RA	pm004918g0050, pm008639g0010, pm008115g0020, pm023598g0020, pm018652g0020, pm010284.t1	Pp3c26_3490, Pp3c13_20961, Pp3c13_20960, Pp3c4_23200, Pp3c26_3510, Pp3c13_20970, Pp3c3_14030	Solyc11g010930, Solyc06g072680, Solyc04g014420, Solyc03g097420, Solyc05g007300, Solyc03g116350, Solyc10g047670, Solyc10g007820	417586, 405070, 38761, 406963	SM000101S09298, SM000016S01837, SM000108S14217, SM000170S02668, SM000059S18722, SM000148S01010, SM000074S21717, SM000093S24430, SM000168S02585	Zci1a_19476, Zci1a_03080	Zci_05094, Zci_08112	UTEX1559_12102, UTEX1559_16926	UTEX1560_10233, UTEX1560_04039	Zm00001d031773, Zm00001d005867, Zm00001d007343, Zm00001d007341, Zm00001d018047, Zm00001d018049, Zm00001d037220, Zm00001d045640, Zm00001d044838, Zm00001d048899, Zm00001d011753
Zci_14151	N0.HOG0007698	OG0006385	n0	AagrOXF_evm.TU.utg000098l.24	Azfi_s0002.g001516	AT2G05310, AT4G13500	Bradi1g15170	NA	Chrsp52S06621	Cre03.g151200_4532	CLOP_g24431, CLOP_g790, CLOP_g6166	11719	Me1_v2_0176690	Mp2g22260	NA	Olucimarinus_31079	LOC_Os03g39830	NA	pm002154g0040, pm004348g0030, pm012421g0040	Pp3c21_15030	Solyc05g024430	69660	SM000009S23604, SM002760S10035	Zci1a_26142	Zci_14151	UTEX1559_09467	UTEX1560_10570	Zm00001d033150
Zci_11041	N0.HOG0002410	OG0001604	n0	AagrOXF_evm.TU.utg000058l.311, AagrOXF_evm.TU.utg000049l.754	Azfi_s0288.g063209, Azfi_s0441.g070336, Azfi_s0072.g036888, Azfi_s0015.g014183, Azfi_s0021.g015653, Azfi_s0305.g063906, Azfi_s0027.g023752, Azfi_s0405.g068369	AT2G41060, AT3G56860, AT3G15010, AT2G18830	Bradi2g09820, Bradi2g43460	CBR_g19053	Chrsp26S04184	NA	CLOP_g14903, CLOP_g20490	5934	Me1_v2_0104690	Mp4g08960, Mp2g22090	NA	NA	LOC_Os01g16090, LOC_Os01g42820	NA	pm006924g0030, pm004210g0010, pm005715g0010, pm013932g0010, pm002086g0020, pm002132g0020	Pp3c4_4670, Pp3c12_14110, Pp3c14_2740, Pp3c1_25150	Solyc10g081330, Solyc01g008970, Solyc02g021560, Solyc12g014210	70937, 169811, 27842, 163608	NA	Zci1a_41619, Zci1a_32085	Zci_06300, Zci_11041	UTEX1559_12125, UTEX1559_16400, UTEX1559_16399	UTEX1560_09045, UTEX1560_12068	Zm00001d040344, Zm00001d044469, Zm00001d011336
Zci_02762	N0.HOG0021566	OG0019463	n0	NA	NA	NA	NA	NA	NA	NA	NA	NA	NA	NA	NA	NA	NA	NA	NA	NA	NA	NA	NA	Zci1a_24143, Zci1a_35776	Zci_02762	UTEX1559_07798	UTEX1560_07585	NA
Zci_08205	N0.HOG0002317	OG0001525	n0	AagrOXF_evm.TU.utg000038l.60, AagrOXF_evm.TU.utg000140l.3, AagrOXF_evm.TU.utg000187l.1	Azfi_s0002.g001214, Azfi_s0110.g045560, Azfi_s0069.g036538	AT1G26670, AT3G29100, AT5G39510	Bradi2g12660, Bradi2g41330, Bradi2g18180, Bradi2g47800	CBR_g22935	Chrsp12S02028	Cre13.g577500_4532	CLOP_g20914, CLOP_g19870, CLOP_g12038	3570	Me1_v2_0074440	Mp1g12970	25040	Olucimarinus_31153	LOC_Os01g37980, LOC_Os01g51120	PRCOL_00002322_RA	pm004329g0050, pm016916g0030, pm012202g0020, pm014937g0020, pm001226g0090, pm006394g0010	Pp3c1_4490, Pp3c7_23690, Pp3c11_5240, Pp3c17_17260, Pp3c2_9440	Solyc05g013050, Solyc03g115760	76204, 146421	SM000185S04018, SM000245S08185, SM000351S13208, SM012354S25738	Zci1a_27716, Zci1a_16719, Zci1a_30800	Zci_08205	UTEX1559_14404	UTEX1560_05813	Zm00001d011179, Zm00001d011688, Zm00001d029400, Zm00001d043700, Zm00001d009421
Zci_03519	N0.HOG0002568	OG0001725	n0	AagrOXF_evm.TU.utg000050l.387	Azfi_s0035.g025597, Azfi_s0481.g073123, Azfi_s0127.g048679	AT5G65260, AT5G10350, AT5G51120	Bradi3g34110, Bradi3g58600, Bradi1g45640	CBR_g472, CBR_g11173	Chrsp103S00012, Chrsp147S02215	Cre06.g274500_4532	CLOP_g21010	12194, 15315	Me1_v2_0110450	Mp8g03090	17645	Olucimarinus_7571	LOC_Os02g52140, LOC_Os06g11620	PRCOL_00002117_RA	pm005270.t1	Pp3c22_11600, Pp3c19_20770, Pp3c21_17360, Pp3c18_12120, Pp3c18_12110	Solyc03g094080, Solyc03g094060, Solyc03g094040, Solyc10g047360, Solyc11g009090, Solyc03g094090	102545, 74095	SM001244S25886, SM000109S14173, SM000174S03346, SM001244S25887	Zci1a_16028, Zci1a_43578, Zci1a_02071, Zci1a_43579	Zci_03519	UTEX1559_10116	UTEX1560_11431	Zm00001d052198, Zm00001d018112, Zm00001d037200, Zm00001d044869
Zci_01415	N0.HOG0000179	OG0000091	n1	AagrOXF_evm.TU.utg000010l.23, AagrOXF_evm.TU.utg000057l.166, AagrOXF_evm.TU.utg000020l.68, AagrOXF_evm.TU.utg000035l.82, AagrOXF_evm.TU.utg000063l.256, AagrOXF_evm.TU.utg000063l.264, AagrOXF_evm.TU.utg000063l.263, AagrOXF_evm.TU.utg000081l.75	Azfi_s0393.g067830, Azfi_s0212.g058222, Azfi_s0212.g058217, Azfi_s1072.g096895, Azfi_s0393.g067831, Azfi_s0237.g059566	NA	NA	CBR_g31959, CBR_g22908, CBR_g31969, CBR_g31967, CBR_g30622	NA	NA	CLOP_g20475, CLOP_g12213, CLOP_g11154, CLOP_g17113, CLOP_g17138, CLOP_g17123, CLOP_g17284, CLOP_g18921, CLOP_g10031, CLOP_g11516, CLOP_g15399, CLOP_g20679, CLOP_g10036, CLOP_g9975, CLOP_g9976, CLOP_g1797, CLOP_g18304, CLOP_g23515, CLOP_g18410, CLOP_g19331	694, 7481	Me1_v2_0191560, Me1_v2_0031840, Me1_v2_0034970, Me1_v2_0184870, Me1_v2_0028340, Me1_v2_0184880, Me1_v2_0184900, Me1_v2_0068240, Me1_v2_0183070, Me1_v2_0184830, Me1_v2_0022270, Me1_v2_0184860, Me1_v2_0051200	Mp2g21110, Mp4g10040, Mp2g22100, Mp7g07390, Mp7g07400, Mp6g10590, Mp7g18170, Mp7g06430, Mp2g18250, Mp7g11200, Mp2g20270, Mp2g12440, Mp6g19640	NA	NA	LOC_Os02g17590, LOC_Os03g50800	NA	pm004195.t1, pm011528g0020, pm001665g0010, pm030044.t1, pm000441g0070, pm030044g0010, pm024771g0010, pm062691g0010, pm001348g0010	Pp3c7_13890, Pp3c22_16360, Pp3c22_19990, Pp3c13_8950, Pp3c4_27790, Pp3c10_6470, Pp3c1_6290, Pp3c1_6320, Pp3c1_34020	NA	97987, 441628, 412985, 91761, 427741, 430640	NA	Zci1a_23660, Zci1a_03320, Zci1a_27347, Zci1a_16230, Zci1a_28914, Zci1a_16229, Zci1a_28913, Zci1a_07849, Zci1a_32107, Zci1a_19638, Zci1a_35463, Zci1a_43174, Zci1a_16247, Zci1a_08969, Zci1a_29284, Zci1a_02565, Zci1a_42428, Zci1a_01104, Zci1a_29934, Zci1a_07508, Zci1a_19459, Zci1a_17834	Zci_08551, Zci_05539, Zci_11872, Zci_12884, Zci_08372, Zci_01415, Zci_04083, Zci_14484, Zci_04085, Zci_01111	UTEX1559_05340, UTEX1559_10007, UTEX1559_12283, UTEX1559_05198, UTEX1559_05834, UTEX1559_05469, UTEX1559_01092, UTEX1559_05467, UTEX1559_05537	UTEX1560_01964, UTEX1560_17669, UTEX1560_03725, UTEX1560_02646, UTEX1560_17121, UTEX1560_17961, UTEX1560_01155, UTEX1560_16328, UTEX1560_16432, UTEX1560_06749, UTEX1560_01963, UTEX1560_01965, UTEX1560_01966	NA
Zci_08168	N0.HOG0002567	OG0001724	n0	AagrOXF_evm.TU.utg000049l.697	Azfi_s0048.g030478, Azfi_s0072.g037030, Azfi_s0034.g025275, Azfi_s0149.g053203	AT3G23190, AT3G23180, AT4G14420, AT1G04340, AT5G43460, AT3G23175	Bradi5g00790, Bradi3g27720, Bradi1g75100	CBR_g34891	Chrsp9S08564	Cre03.g187250_4532	CLOP_g21096, CLOP_g12479	5717	Me1_v2_0141280	Mp6g08770	13845, 13846	Olucimarinus_30674	LOC_Os04g10240, LOC_Os10g30860, LOC_Os03g05520	NA	pm011635g0060, pm006874g0050, pm008224g0030, pm036300g0010	Pp3c24_9580, Pp3c17_14590, Pp3c14_24740	Solyc09g089670, Solyc03g005470, Solyc06g053660	85994, 169212	SM000011S18968, SM000048S16604, SM000026S08875	Zci1a_14823	Zci_08168	UTEX1559_11625, UTEX1559_11624	UTEX1560_06089	Zm00001d025020, Zm00001d048402, Zm00001d027680, Zm00001d018662, Zm00001d032568, Zm00001d032483
Zci_02229	N0.HOG0003112	OG0002195	n0	AagrOXF_evm.TU.utg000010l.308	Azfi_s0006.g010107	AT4G24730	Bradi4g38330, Bradi4g38340	CBR_g48132	Chrsp58S06899	NA	CLOP_g6894, CLOP_g7771, CLOP_g4714	10236, 7110	Me1_v2_0230990, Me1_v2_0197460	Mp1g14560, Mp1g07280	NA	Olucimarinus_5767, Olucimarinus_5807	LOC_Os07g48840	PRCOL_00003021_RA	pm016681g0030, pm007275g0020, pm012064g0010, pm030553g0010, pm003415g0070, pm003033g0040	Pp3c15_10910, Pp3c23_9280, Pp3c2_17660, Pp3c23_9300	Solyc03g112080.1	78013	SM000186S04126, SM000342S12977, SM000146S00943, SM000048S16564, SM000072S21189	Zci1a_00993, Zci1a_38275	Zci_02229, Zci_05525	UTEX1559_10856, UTEX1559_05362	UTEX1560_10954, UTEX1560_06498	Zm00001d049960, Zm00001d019656
Zci_09426	N0.HOG0009865	OG0008419	n0	AagrOXF_evm.TU.utg000020l.30	Azfi_s0024.g020473	AT2G35900	Bradi2g51240	CBR_g18624	Chrsp44S05885	NA	CLOP_g9393	7819	Me1_v2_0138380	Mp3g23530	NA	NA	LOC_Os01g56470	NA	NA	Pp3c9_17430	Solyc10g081750.1	NA	NA	Zci1a_40298, Zci1a_43026	Zci_09426	UTEX1559_07038	UTEX1560_06251	Zm00001d043314
Zci_03226	N0.HOG0000377	OG0000187	n88	AagrOXF_evm.TU.utg000008l.69	Azfi_s0064.g035615	AT5G25970, AT5G11730, AT1G51770, AT3G21310, AT1G10280, AT1G68380, AT1G68390, AT1G73810, AT5G16170, AT1G10880	Bradi4g00775, Bradi1g09800, Bradi1g09770, Bradi3g13450, Bradi1g00400, Bradi2g56630, Bradi3g10830, Bradi3g22875, Bradi2g02262, Bradi2g02270, Bradi2g02280	CBR_g20286, CBR_g12603	NA	NA	CLOP_g24492	8557	Me1_v2_0204050, Me1_v2_0203200	Mp4g14550	NA	NA	LOC_Os12g43880, LOC_Os03g52120, LOC_Os08g01890, LOC_Os04g20420, LOC_Os01g65490, LOC_Os02g22160, LOC_Os10g08280, LOC_Os01g04210, LOC_Os01g04220	NA	pm001515g0010, pm002560g0030, pm003355g0030	Pp3c6_8790, Pp3c2_14300, Pp3c18_2040, Pp3c2_20630, Pp3c11_17210, Pp3c24_6500, Pp3c6_8780	Solyc08g065860, Solyc06g062490, Solyc03g121280, Solyc01g103150, Solyc12g036400.1, Solyc03g119260, Solyc05g009110, Solyc05g009120, Solyc05g009130	102845	SM000011S19163, SM000018S03578, SM000026S09005	Zci1a_27088, Zci1a_36255, Zci1a_02172, Zci1a_02173, Zci1a_03262	Zci_10743, Zci_06096, Zci_06093, Zci_03226	UTEX1559_08803, UTEX1559_02547, UTEX1559_02551, UTEX1559_00868, UTEX1559_11526	UTEX1560_15707, UTEX1560_13843, UTEX1560_10246, UTEX1560_05324, UTEX1560_05329, UTEX1560_03174	Zm00001d031187, Zm00001d041221, Zm00001d033892, Zm00001d027417, Zm00001d033891, Zm00001d033890, Zm00001d035039, Zm00001d026711, Zm00001d042652, Zm00001d053393, Zm00001d016103, Zm00001d039970, Zm00001d039969, Zm00001d008568
Zci_00414	N0.HOG0000511	OG0000265	n0	NA	Azfi_s0045.g030001, Azfi_s0002.g001111, Azfi_s0035.g025484	NA	NA	CBR_g51013	NA	NA	CLOP_g10144, CLOP_g11614, CLOP_g18088, CLOP_g16743, CLOP_g3891, CLOP_g5344, CLOP_g5975	1600, 3061, 34	Me1_v2_0081260, Me1_v2_0204710, Me1_v2_0060600, Me1_v2_0039250, Me1_v2_0107530, Me1_v2_0132790, Me1_v2_0060980, Me1_v2_0184190, Me1_v2_0184210, Me1_v2_0171670, Me1_v2_0171620, Me1_v2_0171780, Me1_v2_0171790, Me1_v2_0171660, Me1_v2_0171600, Me1_v2_0171760, Me1_v2_0109600, Me1_v2_0026300, Me1_v2_0026910, Me1_v2_0038240, Me1_v2_0063270, Me1_v2_0206560, Me1_v2_0075210, Me1_v2_0097650, Me1_v2_0114250, Me1_v2_0171810, Me1_v2_0171770, Me1_v2_0172460, Me1_v2_0130970, Me1_v2_0131030, Me1_v2_0170600, Me1_v2_0018740, Me1_v2_0020370	Mp1g21970	NA	NA	NA	NA	pm025533g0010, pm015019g0010, pm013425g0020	Pp3c1_22860	Solyc03g081300	NA	NA	Zci1a_30197, Zci1a_08135, Zci1a_35150, Zci1a_18638, Zci1a_08577, Zci1a_02213, Zci1a_00054, Zci1a_17301, Zci1a_17300, Zci1a_30028, Zci1a_30027, Zci1a_30026, Zci1a_17302, Zci1a_38595, Zci1a_41221, Zci1a_06664, Zci1a_19337, Zci1a_00056, Zci1a_15717, Zci1a_00048, Zci1a_15716, Zci1a_00050, Zci1a_18637, Zci1a_19338, Zci1a_20239, Zci1a_00063, Zci1a_05010, Zci1a_19334, Zci1a_05007, Zci1a_05008, Zci1a_19329, Zci1a_19332, Zci1a_20236, Zci1a_38594, Zci1a_15720, Zci1a_00045, Zci1a_00060, Zci1a_25762, Zci1a_20238, Zci1a_44946, Zci1a_34448, Zci1a_00061, Zci1a_20240, Zci1a_34450, Zci1a_00046, Zci1a_17236, Zci1a_00051, Zci1a_15719	Zci_10727, Zci_08087, Zci_08088, Zci_13385, Zci_13379, Zci_13378, Zci_13377, Zci_13382, Zci_00414, Zci_12265, Zci_10248, Zci_04042, Zci_08652, Zci_07771, Zci_04152, Zci_04028, Zci_12423, Zci_04153	UTEX1559_08821, UTEX1559_02304, UTEX1559_02303, UTEX1559_01900, UTEX1559_01906, UTEX1559_01901, UTEX1559_07299, UTEX1559_00753, UTEX1559_09027, UTEX1559_05518, UTEX1559_17066, UTEX1559_02451, UTEX1559_04920, UTEX1559_12254, UTEX1559_13200	UTEX1560_04729, UTEX1560_10773, UTEX1560_13678, UTEX1560_13676, UTEX1560_03874, UTEX1560_03880, UTEX1560_03876, UTEX1560_14693, UTEX1560_15488, UTEX1560_08673, UTEX1560_12438, UTEX1560_13401, UTEX1560_03436, UTEX1560_03319, UTEX1560_14673, UTEX1560_17230	NA
Zci_11961	N0.HOG0002840	OG0001957	n0	AagrOXF_evm.TU.utg000083l.366, AagrOXF_evm.TU.utg000006l.1006	Azfi_s0093.g043310	AT3G57870	Bradi1g77010, Bradi3g32080, Bradi5g19200	CBR_g18677	Chrsp99S08529	Cre02.g142000_4532, Cre03.g167000_4532, Cre01.g019450_4532	CLOP_g212	5772, 7803	Me1_v2_0118340	Mp6g00100	22640	Olucimarinus_33350, Olucimarinus_24651	LOC_Os03g03130, LOC_Os10g39120, LOC_Os04g49130	PRCOL_00000706_RA	pm010990.t1, pm001379g0010, pm018183g0010	Pp3c24_19480, Pp3c8_18320	Solyc02g093110, Solyc03g044260, Solyc07g021670, Solyc04g078620, Solyc12g088680, Solyc03g112720	178439	SM000033S12327, SM000063S20047, SM000201S05941	Zci1a_03507	Zci_11961	UTEX1559_08336	UTEX1560_10793	Zm00001d027427, Zm00001d048473, Zm00001d029740, Zm00001d047354, Zm00001d002570
Zci_09562	N0.HOG0004255	OG0003192	n0	AagrOXF_evm.TU.utg000038l.142, AagrOXF_evm.TU.utg000116l.165	Azfi_s0057.g034273	AT1G30825, AT2G33385	Bradi1g76356, Bradi5g15480	CBR_g9158	Chrsp22S03530	Cre17.g747047_4532, Cre17.g747197_4532	CLOP_g293	367	Me1_v2_0196880	Mp1g13680	17274, 17275	Olucimarinus_8144	LOC_Os01g46580, LOC_Os04g43290	NA	pm018226g0010, pm003430.t2, pm001470g0050, pm001074g0060, pm004819g0030	Pp3c14_19930, Pp3c1_32330	Solyc11g068610, Solyc09g090550	90552	SM000095S25022, SM000012S25321, SM000198S05312	Zci1a_02474	Zci_09562	UTEX1559_02397	UTEX1560_14873	Zm00001d007806, Zm00001d003039
Zci_03404	N0.HOG0004885	OG0003748	n0	AagrOXF_evm.TU.utg000095l.8, AagrOXF_evm.TU.utg000010l.338, AagrOXF_evm.TU.utg000002l.182, AagrOXF_evm.TU.utg000005l.476	NA	NA	Bradi3g28050	NA	Chrsp30S04762	Cre10.g418851_4532	CLOP_g7086	1471	Me1_v2_0090190, Me1_v2_0090210, Me1_v2_0170070, Me1_v2_0062790, Me1_v2_0090220	Mp4g03400	NA	NA	LOC_Os07g07520	NA	NA	Pp3c4_1040	Solyc09g091150.2, Solyc09g091160.1	438803, 442625, 438547	SM000029S10489, SM000064S19730, SM000337S12890, SM000047S16842, SM000046S16374, SM000221S06952	Zci1a_07095	Zci_03404, Zci_02251	UTEX1559_05970, UTEX1559_06252	UTEX1560_10527, UTEX1560_05766	Zm00001d014091
Zci_05730	N0.HOG0006387	OG0005139	n0	AagrOXF_evm.TU.utg000124l.169	Azfi_s0004.g008812	AT3G28720	Bradi1g37270	CBR_g8886	Chrsp33S05043	Cre02.g081650_4532	CLOP_g6649, CLOP_g14082	11336	Me1_v2_0145030	Mp7g17090	5509	NA	LOC_Os06g38550	PRCOL_00001393_RA	pm011550g0050, pm010448g0050, pm001580g0040, pm011550g0040	Pp3c3_25440	Solyc02g087720.1	132777, 449406, 429438, 429441, 429443	NA	Zci1a_10814, Zci1a_10813	Zci_05730	UTEX1559_11240	UTEX1560_02147	Zm00001d046396
Zci_05436	N0.HOG0006909	OG0005634	n0	AagrOXF_evm.TU.utg000011l.130	Azfi_s0560.g076955, Azfi_s0193.g057140, Azfi_s0032.g024971	AT5G61150	Bradi1g59300	NA	NA	Cre16.g694204_4532	CLOP_g2333	5295	Me1_v2_0152810	Mp1g21810	4084	Olucimarinus_28553	LOC_Os03g54930, LOC_Os07g01880, LOC_Os12g38970	NA	pm004293g0030, pm026124g0010	Pp3c14_2440	Solyc03g115240	446684	SM000256S08698, SM000168S02640, SM000234S07911	Zci1a_14004	Zci_05436	UTEX1559_17394	UTEX1560_14052	Zm00001d018664, Zm00001d007947
Zci_06868	N0.HOG0005662	OG0004455	n0	AagrOXF_evm.TU.utg000058l.163	Azfi_s0084.g038918	AT4G21770	Bradi1g18900	NA	Chrsp127S01917	Cre10.g462500_4532, Cre11.g474850_4532	CLOP_g7245, CLOP_g7246, CLOP_g7248	2789	Me1_v2_0104180	Mp7g08400, Mp7g18790	16671	Olucimarinus_30653	LOC_Os07g46600	PRCOL_00006623_RA	pm001947g0040, pm005111g0080, pm009352.t3, pm085226g0010	Pp3c5_11180	Solyc02g080320	112010, 111763	SM000087S23408, SM000013S26417, SM000045S16252	Zci1a_18233	Zci_06868	UTEX1559_05712	UTEX1560_02710	Zm00001d007090
Zci_10943	N0.HOG0006333	OG0005087	n0	AagrOXF_evm.TU.utg000080l.105	Azfi_s0007.g010817	AT3G60360	Bradi5g03100, Bradi2g52910	CBR_g26482	Chrsp30S04760	Cre13.g573050_4532	CLOP_g20422	10533	Me1_v2_0022520	Mp7g03440	6435	Olucimarinus_32092	LOC_Os01g59500	PRCOL_00003072_RA	pm009990.t2, pm024189g0020	Pp3c3_27620, Pp3s222_10	Solyc10g079430	73763	SM000047S16820, SM000191S05227, SM000344S13016	Zci1a_18787	Zci_10943	UTEX1559_01647	UTEX1560_09289	Zm00001d050595, Zm00001d041650, Zm00001d012549
Zci_06804	N0.HOG0004056	OG0003017	n0	AagrOXF_evm.TU.utg000011l.11, AagrOXF_evm.TU.utg000026l.5	Azfi_s0373.g067189	AT1G20580, AT1G76300	Bradi3g00420, Bradi1g68516	CBR_g39570	Chrsp23S03709	Cre10.g455300_4532	CLOP_g23033	14763	Me1_v2_0054000	Mp1g11210	18043	Olucimarinus_9203	LOC_Os03g13760, LOC_Os02g01250	PRCOL_00004720_RA	pmUn.t15, pm000179g0010, pm019291g0020, pm002187g0020	Pp3c22_5760, Pp3c19_21580, Pp3c18_21750, Pp3c18_21790, Pp3c18_21880, Pp3c10_12880	Solyc02g062240, Solyc03g033600, Solyc02g084020	112116	NA	Zci1a_10787	Zci_06804	UTEX1559_02236	UTEX1560_06787	Zm00001d014926, Zm00001d028377, Zm00001d047962
Zci_15408	N0.HOG0007623	OG0006311	n0	AagrOXF_evm.TU.utg000041l.205	Azfi_s0529.g075790	AT3G17170	Bradi4g04560	CBR_g38487	Chrsp10S01521	NA	CLOP_g10364	11079	Me1_v2_0093420	Mp1g05580	23770	NA	LOC_Os12g37610	PRCOL_00004690_RA	pm010704.t2, pm024713g0010	Pp3c14_11414, Pp3c14_11410	Solyc01g058190	7735	SM000021S06426, SM000006S19371, SM000037S13497	Zci1a_02094, Zci1a_25375	Zci_15408	UTEX1559_14725	UTEX1560_18844	Zm00001d041595
Zci_14111	N0.HOG0005620	OG0004417	n0	AagrOXF_evm.TU.utg000044l.59	Azfi_s0114.g046061, Azfi_s0083.g038860	AT4G22740, AT2G45380	Bradi3g13860, Bradi1g51610	CBR_g33932	NA	Cre10.g419000_4532	CLOP_g3468	NA	Me1_v2_0105150	Mp2g01840, Mp2g21950	14372	NA	LOC_Os08g02460, LOC_Os06g04390	NA	pm003315g0020	Pp3c13_1670, Pp3c3_1164	Solyc01g091260, Solyc08g079500, Solyc01g091270	NA	SM000022S07278, SM000096S24912	Zci1a_43089, Zci1a_24878	Zci_14111	UTEX1559_03271	UTEX1560_13972, UTEX1560_13970, UTEX1560_13971	Zm00001d035098, Zm00001d049662, Zm00001d045435
Zci_13437	N0.HOG0004511	OG0003421	n0	AagrOXF_evm.TU.utg000076l.6	Azfi_s0006.g010365, Azfi_s0051.g031249	AT3G51100	Bradi4g35988, Bradi1g35060	CBR_g12214, CBR_g17049	Chrsp17S02782	Cre17.g698400_4532	NA	8763	Me1_v2_0172900	Mp7g03520	15988	Olucimarinus_26173	LOC_Os09g36100, LOC_Os06g49980	NA	pm002447g0060, pm020194g0020, pm022925g0010, pm020194g0010	Pp3c26_11470, Pp3c3_3130, Pp3c14_16330, Pp3c1_40190	Solyc02g084550, Solyc03g033650	37179, 129780	SM000094S24678, SM000173S02997	Zci1a_15034	Zci_13437	UTEX1559_11460	UTEX1560_08166	Zm00001d021282, Zm00001d006204, Zm00001d014770
Zci_10385	N0.HOG0005225	OG0004057	n0	AagrOXF_evm.TU.utg000010l.253	Azfi_s0113.g045972	AT1G18730	Bradi3g59490	CBR_g30507	Chrsp158S02275	NA	CLOP_g18969	8492	Me1_v2_0068200	Mp3g20430	6882	NA	LOC_Os02g51020	NA	pm002159.t1, pm003550g0040	Pp3c16_3930	Solyc12g036170	NA	SM001369S00002, SM001013S09164, SM001284S26263	Zci1a_11800, Zci1a_07049	Zci_10362, Zci_10385, Zci_14084	UTEX1559_16496, UTEX1559_01971, UTEX1559_01806, UTEX1559_15041	UTEX1560_05008, UTEX1560_13337, UTEX1560_08491, UTEX1560_00602, UTEX1560_01241, UTEX1560_00601	Zm00001d018030
Zci_05380	N0.HOG0009292	OG0007891	n0	NA	NA	NA	NA	NA	Chrsp33S05061	Cre06.g286300_4532, Cre06.g286350_4532	NA	9840, 9588, 212, 9589	Me1_v2_0151880, Me1_v2_0219810	NA	NA	Olucimarinus_4986	NA	PRCOL_00002129_RA, PRCOL_00001996_RA	pm001908g0010, pm009778g0020, pm006196g0020, pm005227g0010, pm006196g0030, pm009476.t1	NA	NA	NA	NA	Zci1a_08822	Zci_05380	UTEX1559_10614	UTEX1560_04296	NA
Zci_06819	N0.HOG0005634	OG0004430	n0	AagrOXF_evm.TU.utg000049l.350	Azfi_s0373.g067177	AT1G14270	Bradi4g30170, Bradi3g37080	CBR_g52133	Chrsp58S06912	Cre06.g310050_4532	CLOP_g9512	32	Me1_v2_0060210	Mp1g15690	21833	Olucimarinus_15071	LOC_Os09g24670, LOC_Os08g33900	PRCOL_00002500_RA	pm038526g0020, pm025183g0020, pm021794g0020	Pp3c21_22610	Solyc05g007500	49325, 58140	SM000102S09178, SM000193S05173, SM000153S01601	Zci1a_37757, Zci1a_36313	Zci_06819	UTEX1559_02219	UTEX1560_02897	Zm00001d020445, Zm00001d032183
Zci_03797	N0.HOG0025361	OG0023215	n0	NA	NA	NA	NA	NA	NA	NA	NA	NA	NA	NA	NA	NA	NA	NA	NA	NA	NA	NA	NA	Zci1a_36920	Zci_03797	UTEX1559_12616	UTEX1560_05029	NA
Zci_06616	N0.HOG0000059	OG0000018	n0	AagrOXF_evm.TU.utg000012l.139, AagrOXF_evm.TU.utg000042l.362, AagrOXF_evm.TU.utg000005l.417, AagrOXF_evm.TU.utg000058l.473, AagrOXF_evm.TU.utg000042l.451, AagrOXF_evm.TU.utg000125l.43	Azfi_s0046.g030218, Azfi_s0014.g013456, Azfi_s0078.g038245, Azfi_s0002.g001420, Azfi_s0061.g034871, Azfi_s0003.g008036, Azfi_s0108.g045179, Azfi_s0395.g067865, Azfi_s0111.g045700, Azfi_s0105.g044977, Azfi_s0121.g046854, Azfi_s0027.g023519, Azfi_s0245.g059974, Azfi_s0118.g046643, Azfi_s0056.g034028, Azfi_s0064.g035459, Azfi_s0006.g010175, Azfi_s0132.g049190, Azfi_s0242.g059826, Azfi_s0027.g023523, Azfi_s0220.g058643, Azfi_s1381.g102473, Azfi_s0056.g034184, Azfi_s0056.g034193, Azfi_s0003.g008163	AT4G25360, AT5G51640, AT1G01430, AT4G01080, AT4G23790, AT4G11090, AT5G15890, AT5G15900, AT3G02440, AT3G28150, AT5G40180, AT1G70230, AT5G20680, AT2G37720, AT5G64020, AT2G14530, AT5G64470, AT5G20590, AT1G60790, AT3G12060, AT5G06700, AT5G49340, AT3G62390, AT3G06080, AT5G19160, AT3G11570, AT5G06230, AT1G48880, AT3G54260, AT2G40160, AT2G40150, AT3G55990, AT2G40320, AT3G11030, AT2G38320, AT5G01620, AT1G73140, AT5G01360, AT2G30010, AT5G58600, AT1G78710, AT2G30900, AT3G14850, AT1G29050, AT2G34070, AT2G42570, AT2G31110	Bradi1g39670, Bradi2g58580, Bradi2g58570, Bradi2g32220, Bradi1g38400, Bradi1g43740, Bradi1g43730, Bradi2g45350, Bradi2g45360, Bradi3g56217, Bradi3g56210, Bradi1g43717, Bradi5g12722, Bradi1g44920, Bradi4g29271, Bradi1g44900, Bradi1g44890, Bradi3g37610, Bradi4g05130, Bradi3g47317, Bradi4g41440, Bradi1g26890, Bradi3g01660, Bradi1g31440, Bradi5g15190, Bradi3g57480, Bradi1g46280, Bradi1g64470, Bradi1g19320, Bradi4g42860, Bradi5g15020, Bradi4g40210, Bradi3g23050, Bradi2g24750, Bradi2g56824, Bradi2g43447, Bradi2g54010, Bradi4g44997, Bradi2g28400, Bradi1g65530, Bradi1g16610, Bradi2g28100, Bradi1g03947, Bradi1g03940, Bradi1g03972, Bradi4g44860, Bradi1g65550, Bradi2g45320, Bradi1g32150, Bradi2g07000	CBR_g5626, CBR_g18886, CBR_g17922, CBR_g17575, CBR_g32172, CBR_g32175, CBR_g32173	NA	NA	CLOP_g16476, CLOP_g13721, CLOP_g14844, CLOP_g12831, CLOP_g11946, CLOP_g24323, CLOP_g12693, CLOP_g15474, CLOP_g15573, CLOP_g5398, CLOP_g20635, CLOP_g20634, CLOP_g15580, CLOP_g20633, CLOP_g15581, CLOP_g21712, CLOP_g5198, CLOP_g4741, CLOP_g13125, CLOP_g23732, CLOP_g3299, CLOP_g13128, CLOP_g6245, CLOP_g19101, CLOP_g14100, CLOP_g866, CLOP_g25526, CLOP_g2668, CLOP_g18893, CLOP_g6115, CLOP_g18891, CLOP_g18892, CLOP_g16854, CLOP_g24509, CLOP_g9214, CLOP_g1107, CLOP_g1105, CLOP_g22882, CLOP_g22887, CLOP_g22885, CLOP_g9603, CLOP_g22884, CLOP_g22883, CLOP_g18925, CLOP_g2878, CLOP_g7535, CLOP_g12177, CLOP_g25447	3163, 719	Me1_v2_0084240, Me1_v2_0200980, Me1_v2_0126900, Me1_v2_0200920, Me1_v2_0126910, Me1_v2_0189510, Me1_v2_0074360, Me1_v2_0171370, Me1_v2_0021130, Me1_v2_0112200, Me1_v2_0171460, Me1_v2_0012640, Me1_v2_0154930, Me1_v2_0074500, Me1_v2_0080470, Me1_v2_0154940, Me1_v2_0231420, Me1_v2_0059670, Me1_v2_0035960, Me1_v2_0060270, Me1_v2_0052450, Me1_v2_0086270, Me1_v2_0025200	Mp1g28350, Mp8g08270, Mp5g00500, Mp4g16930, Mp2g21170, Mp2g11180, Mp3g20830	NA	NA	LOC_Os02g05530, LOC_Os01g68630, LOC_Os05g12380, LOC_Os06g33330, LOC_Os11g37630, LOC_Os06g16150, LOC_Os06g16160, LOC_Os06g15560, LOC_Os06g16170, LOC_Os06g16200, LOC_Os06g16240, LOC_Os01g46400, LOC_Os01g46410, LOC_Os02g49650, LOC_Os02g49660, LOC_Os06g16250, LOC_Os04g39130, LOC_Os06g12800, LOC_Os06g12810, LOC_Os06g12820, LOC_Os09g20850, LOC_Os06g12830, LOC_Os06g12850, LOC_Os06g12860, LOC_Os07g15230, LOC_Os07g15320, LOC_Os06g12840, LOC_Os06g12870, LOC_Os01g46680, LOC_Os11g13800, LOC_Os12g36750, LOC_Os12g33194, LOC_Os09g23360, LOC_Os07g31550, LOC_Os02g02580, LOC_Os06g44900, LOC_Os04g42900, LOC_Os02g53380, LOC_Os06g10560, LOC_Os03g19470, LOC_Os07g46230, LOC_Os12g05080, LOC_Os11g05080, LOC_Os01g30970, LOC_Os05g35190, LOC_Os01g65800, LOC_Os05g51020, LOC_Os01g42810, LOC_Os05g39350, LOC_Os01g61460, LOC_Os12g01380, LOC_Os11g01370, LOC_Os05g28630, LOC_Os03g18140, LOC_Os07g49280, LOC_Os05g28830, LOC_Os03g60340, LOC_Os04g58340, LOC_Os03g60350, LOC_Os03g60300, LOC_Os12g01560, LOC_Os11g01570, LOC_Os03g18120, LOC_Os03g18110, LOC_Os01g46350, LOC_Os06g34060, LOC_Os01g11810	PRCOL_00002503_RA	pm035141g0010, pm082813g0010, pm000091.t3, pm321410g0010, pm057827g0010, pm234258g0010, pm001167g0030, pm000407g0030, pm012367g0040, pm000136.t2, pm005628g0020, pm000439g0050, pm014994g0010, pm001440g0030, pm063520g0010, pm000489g0020, pm004596g0010, pm074668g0010, pm006642.t1, pm015457g0010, pm000206g0120, pm030439g0010, pm005190.t1, pm079551g0010, pm002028g0010, pm008270g0010, pm013754g0020, pm003700g0020, pm072766g0010, pm007505g0010, pm014315g0020	Pp3c4_25789, Pp3c1_40460, Pp3c16_2250, Pp3c7_23520, Pp3c2_37020, Pp3c5_23290, Pp3c5_27060, Pp3c25_3230, Pp3c16_10090, Pp3c24_18900, Pp3c20_4820, Pp3c5_14230, Pp3c7_1960, Pp3c25_13870, Pp3c16_21350, Pp3c5_27320, Pp3c6_110, Pp3c12_24680	Solyc02g089670, Solyc03g007120, Solyc10g009590, Solyc01g095610, Solyc08g082060, Solyc02g089700, Solyc02g089710, Solyc02g065600, Solyc03g046270, Solyc02g089690, Solyc02g089680, Solyc03g046300, Solyc02g065610, Solyc02g087120, Solyc01g008050, Solyc07g042020, Solyc12g009150, Solyc07g008820, Solyc01g106590, Solyc01g106370, Solyc07g006920, Solyc05g005100, Solyc01g016380, Solyc10g078910, Solyc10g080550, Solyc01g016390, Solyc01g060270.1, Solyc01g079400, Solyc09g065030, Solyc06g084290, Solyc01g079850, Solyc04g064740, Solyc11g005790, Solyc11g006990, Solyc07g053330, Solyc06g051350, Solyc03g096030, Solyc05g052540, Solyc06g050920, Solyc03g095810, Solyc05g052440, Solyc05g052430, Solyc05g052450, Solyc10g076400, Solyc09g015350, Solyc02g082950, Solyc02g082940, Solyc10g085320, Solyc12g014200, Solyc09g005630, Solyc10g076570, Solyc06g007170, Solyc06g082070, Solyc10g007450, Solyc12g044450, Solyc07g055730, Solyc07g055800.2, Solyc07g055790, Solyc07g055780, Solyc07g062210, Solyc07g062220, Solyc12g014360, Solyc01g068440, Solyc01g068430, Solyc01g068420, Solyc02g077080, Solyc03g006220, Solyc07g053350, Solyc10g008030, Solyc03g046310.1	2086, 75504, 80675, 110577, 418889, 98686, 404468, 113525, 99678, 65030, 65031, 80669, 53072, 64159, 54250, 23173	SM000002S05613, SM000126S26326, SM000075S21920, SM000156S02141, SM000077S21566, SM000128S26193, SM000188S03834, SM000053S17401, SM000005S17346, SM000194S04808, SM000090S24322, SM000058S18560, SM000155S01632, SM000082S22866, SM000057S18375, SM000290S10889, SM000057S18363, SM000290S10896, SM000082S22852, SM000010S04285, SM000052S17726, SM000163S02311, SM000114S24154, SM000216S06569, SM000260S09935	Zci1a_33072, Zci1a_05145, Zci1a_10456, Zci1a_33176, Zci1a_37014, Zci1a_07442, Zci1a_30291, Zci1a_30297, Zci1a_22322, Zci1a_23682, Zci1a_01072, Zci1a_01597, Zci1a_02371	Zci_05282, Zci_06616, Zci_06561, Zci_13490, Zci_01430, Zci_13882, Zci_07983, Zci_12214, Zci_09536, Zci_01969	UTEX1559_13511, UTEX1559_13373, UTEX1559_01400, UTEX1559_17103, UTEX1559_08584, UTEX1559_05818, UTEX1559_09041, UTEX1559_15500, UTEX1559_02371, UTEX1559_17285, UTEX1559_18512, UTEX1559_02368, UTEX1559_02367, UTEX1559_10391	UTEX1560_09253, UTEX1560_12548, UTEX1560_00216, UTEX1560_07622, UTEX1560_01317, UTEX1560_01137, UTEX1560_07076, UTEX1560_18660, UTEX1560_08289	Zm00001d012074, Zm00001d010443, Zm00001d046073, Zm00001d045720, Zm00001d032911, Zm00001d045721, Zm00001d044033, Zm00001d044031, Zm00001d017918, Zm00001d017919, Zm00001d045722, Zm00001d037248, Zm00001d005680, Zm00001d005678, Zm00001d037249, Zm00001d037250, Zm00001d044784, Zm00001d048608, Zm00001d006891, Zm00001d050103, Zm00001d036994, Zm00001d028200, Zm00001d038482, Zm00001d052128, Zm00001d046337, Zm00001d020399, Zm00001d021534, Zm00001d006419, Zm00001d015010, Zm00001d029832, Zm00001d036688, Zm00001d025821, Zm00001d052124, Zm00001d000460, Zm00001d018237, Zm00001d044987, Zm00001d047637, Zm00001d022357, Zm00001d022361, Zm00001d023378, Zm00001d044695, Zm00001d001977, Zm00001d038228, Zm00001d010222, Zm00001d012223, Zm00001d011335, Zm00001d042993, Zm00001d030940, Zm00001d023217, Zm00001d005092, Zm00001d036814, Zm00001d037978, Zm00001d010033, Zm00001d028751, Zm00001d022582, Zm00001d034621, Zm00001d034620, Zm00001d012983, Zm00001d035385, Zm00001d023225, Zm00001d052318, Zm00001d047737, Zm00001d047738, Zm00001d044037, Zm00001d037032, Zm00001d040652, Zm00001d039366
Zci_05798	N0.HOG0009111	OG0007719	n0	AagrOXF_evm.TU.utg000003l.195, AagrOXF_evm.TU.utg000018l.211	Azfi_s0245.g059973	NA	NA	NA	Chrsp7S07760	Cre08.g361800_4532	CLOP_g23545	14633	Me1_v2_0093910	Mp7g16390	446	NA	NA	NA	pm001978g0010, pm007316g0030	Pp3c20_22330	NA	407201	SM000072S21188, SM000048S16563, SM000146S00944	Zci1a_16923	Zci_05798	UTEX1559_11175	UTEX1560_06797, UTEX1560_06796	NA
Zci_00540	N0.HOG0010597	OG0009095	n0	NA	NA	NA	NA	NA	NA	NA	CLOP_g8558, CLOP_g10712	NA	Me1_v2_0206980, Me1_v2_0058270	NA	NA	NA	NA	NA	pm004131g0010, pm057051g0010	NA	NA	NA	SM000037S13491, SM000006S19345, SM000021S06453	Zci1a_16715, Zci1a_16716	Zci_00540, Zci_10060	UTEX1559_07406, UTEX1559_07670	UTEX1560_10938, UTEX1560_09823	NA
Zci_04684	N0.HOG0002162	OG0001397	n0	AagrOXF_evm.TU.utg000113l.145	Azfi_s0010.g012299, Azfi_s0020.g015359, Azfi_s1196.g099363, Azfi_s0552.g076628	AT2G29210, AT1G23360	Bradi1g66870, Bradi1g21164, Bradi5g15167	CBR_g50691	Chrsp2S04643, Chrsp7S00632	Cre16.g678050_4532, Cre02.g084300_4532	CLOP_g4458, CLOP_g1709, CLOP_g24009, CLOP_g14237	13212, 6124	Me1_v2_0197300, Me1_v2_0134650	Mp8g09170, Mp5g06240	14302, 9262	Olucimarinus_26974, Olucimarinus_12765	LOC_Os04g42870	PRCOL_00003490_RA	pm011781g0010, pm010726g0010, pm019054g0010, pm299037g0010, pm005377g0070	Pp3c10_18390, Pp3c3_30241, Pp3c3_30240, Pp3c5_15050	Solyc09g030390, Solyc12g019010	100233, 141944	SM000061S19251, SM000003S11192, SM000036S13268, SM000036S13286, SM000061S19239, SM000014S00279	Zci1a_37796, Zci1a_11893, Zci1a_37795, Zci1a_06679	Zci_04684	UTEX1559_00164	UTEX1560_01099	Zm00001d028579, Zm00001d047831, Zm00001d025819
Zci_10518	N0.HOG0005114	OG0003953	n0	NA	Azfi_s0011.g012708	AT5G04120, AT3G50520	Bradi3g38010, Bradi4g43370	NA	Chrsp75S07558	Cre10.g460300_4532	CLOP_g7216, CLOP_g20467, CLOP_g24625	5068	Me1_v2_0064760	Mp5g06900	20915	Olucimarinus_30400	LOC_Os08g37140, LOC_Os12g04120, LOC_Os11g04320, LOC_Os02g22000	NA	pm000101g0160, pm006122g0010, pm002945g0070, pm000889g0120, pm073208g0010, pm074850g0010	Pp3c24_9340, Pp3c8_13210	Solyc02g065080	121295	SM000008S22147, SM000035S13079	Zci1a_29727	Zci_10518	UTEX1559_11418	UTEX1560_05503	Zm00001d031809
Zci_04487	N0.HOG0005140	OG0003977	n0	NA	NA	NA	NA	NA	NA	NA	CLOP_g3675, CLOP_g3674	4432, 9374, 9375, 9569	Me1_v2_0114860, Me1_v2_0065810	NA	NA	Olucimarinus_30383	NA	PRCOL_00004195_RA	pm008597g0010, pm165067.t1, pm036624g0010, pm004529g0030, pm008797g0010	NA	NA	NA	NA	Zci1a_36551, Zci1a_00560, Zci1a_40844, Zci1a_26300, Zci1a_13366, Zci1a_06054	Zci_04490, Zci_04487, Zci_01492, Zci_12307, Zci_04284	UTEX1559_04676, UTEX1559_16132, UTEX1559_01862, UTEX1559_14603, UTEX1559_04091	UTEX1560_09117, UTEX1560_15830, UTEX1560_03136, UTEX1560_15111, UTEX1560_09281	NA
Zci_04784	N0.HOG0002633	OG0001779	n0	AagrOXF_evm.TU.utg000027l.255, AagrOXF_evm.TU.utg000057l.145	Azfi_s0045.g029870, Azfi_s0098.g043912, Azfi_s0032.g024936, Azfi_s0069.g036614	AT1G54390, AT3G24010	Bradi1g08690, Bradi5g17460, Bradi1g75507	CBR_g34558, CBR_g3046, CBR_g51242	Chrsp66S09175, Chrsp33S05055	Cre07.g357650_4532, Cre16.g668200_4532	CLOP_g20470	6601, 9244	Me1_v2_0197320	Mp7g01810	21032, 20875, 20876	Olucimarinus_27695	LOC_Os03g53700, LOC_Os03g04980	NA	pm018632g0020, pm066393g0010	Pp3c17_17740, Pp3c17_6960	Solyc10g078520, Solyc09g091190	92651, 270360	SM000036S13302, SM000002S05693, SM000014S00264	Zci1a_08794, Zci1a_38151	Zci_04784, Zci_01158	UTEX1559_02629, UTEX1559_02628, UTEX1559_05589, UTEX1559_05588	UTEX1560_01487, UTEX1560_03826, UTEX1560_03825	Zm00001d034006, Zm00001d048385
Zci_00578	N0.HOG0014439	OG0012631	n0	NA	NA	NA	NA	NA	NA	NA	CLOP_g24595, CLOP_g782	NA	NA	NA	NA	NA	NA	NA	NA	NA	NA	NA	SM000207S06173, SM000025S08337, SM000031S11515	Zci1a_05827, Zci1a_15214	Zci_00578	UTEX1559_16902	NA	NA
Zci_05796	N0.HOG0007017	OG0005740	n0	AagrOXF_evm.TU.utg000058l.14	Azfi_s0007.g010642	AT2G20830	Bradi1g15507, Bradi4g06942	CBR_g20108	NA	Cre06.g267000_4532	CLOP_g6094	NA	Me1_v2_0115350	Mp3g09890	648	Olucimarinus_88189	LOC_Os03g38540, LOC_Os06g03740, LOC_Os06g02610	PRCOL_00005805_RA	pm000728.t1, pm002704g0050, pm008165g0040	Pp3c2_17510	Solyc07g054430, Solyc07g054420.2	438865	NA	Zci1a_08117	Zci_05796	UTEX1559_11171	UTEX1560_06800	Zm00001d013786, Zm00001d045527, Zm00001d052979
Zci_06852	N0.HOG0007310	OG0006019	n0	AagrOXF_evm.TU.utg000033l.128	Azfi_s0116.g046401	AT2G40780	Bradi1g77690	NA	Chrsp6S07423	Cre03.g155800_4532	CLOP_g18018, CLOP_g18511	5161	Me1_v2_0146820	Mp1g10260	9440	Olucimarinus_32230	LOC_Os03g02310	NA	pm023541g0010, pm011035g0010, pm002043g0010	Pp3c16_8280	Solyc05g052180	407703	SM000013S26469, SM000004S15073, SM000045S16199, SM000084S23102	Zci1a_13572	Zci_06852	UTEX1559_05690	UTEX1560_02733	Zm00001d027339
Zci_10409	N0.HOG0013014	OG0011308	n0	NA	NA	NA	NA	NA	Chrsp64S07098	NA	CLOP_g22440	11378	Me1_v2_0053180	NA	NA	NA	NA	NA	pm000123g0050, pm004544g0070, pm010361g0020	NA	NA	NA	NA	Zci1a_11293	Zci_10409	UTEX1559_01780	UTEX1560_01210	NA
Zci_05582	N0.HOG0008262	OG0006923	n0	NA	Azfi_s0017.g014480, Azfi_s0159.g053960	AT1G10310	Bradi3g45920	NA	Chrsp22S03508	NA	CLOP_g23543	11421	Me1_v2_0204210	NA	NA	NA	LOC_Os02g35170	NA	pm005742.t1, pm031316g0010	NA	Solyc01g103100	113925	SM000032S12087, SM000045S16294, SM000071S21067	Zci1a_04534	Zci_05582	UTEX1559_12915, UTEX1559_12914	UTEX1560_02177, UTEX1560_02176	Zm00001d045543, Zm00001d036898, Zm00001d016834, Zm00001d050775
Zci_10057	N0.HOG0000994	OG0000554	n0	AagrOXF_evm.TU.utg000077l.371, AagrOXF_evm.TU.utg000006l.837, AagrOXF_evm.TU.utg000006l.853	Azfi_s0046.g030244, Azfi_s0149.g053266, Azfi_s0065.g035855, Azfi_s0154.g053559, Azfi_s0116.g046445, Azfi_s0245.g059982, Azfi_s0092.g043018, Azfi_s0200.g057525, Azfi_s0336.g065538, Azfi_s0032.g024692, Azfi_s0121.g046846	AT1G57870, AT1G09840, AT3G05840, AT5G26751, AT5G14640, AT4G18710, AT1G06390, AT2G30980, AT3G61160, AT4G00720	Bradi1g02160, Bradi2g08890, Bradi2g38590, Bradi2g11370, Bradi2g06490, Bradi2g32620, Bradi3g09067, Bradi3g31480	CBR_g22080	Chrsp77S07678	Cre12.g511850_4532	CLOP_g23461, CLOP_g24743	9975	Me1_v2_0003860, Me1_v2_0145420	Mp7g04170	28873	Olucimarinus_49296	LOC_Os03g62500, LOC_Os01g14860, LOC_Os05g04340, LOC_Os01g19150, LOC_Os01g10840, LOC_Os05g11730, LOC_Os02g14130, LOC_Os06g35530, LOC_Os10g37740	PRCOL_00002982_RA	pm010771g0030, pm077747g0010, pm001591g0010, pm006728g0010	Pp3c12_11200, Pp3c13_8870, Pp3c3_11010, Pp3c26_3170, Pp3c26_3360, Pp3c4_23480, Pp3c4_23360	Solyc01g103430, Solyc01g101000, Solyc02g086670, Solyc12g062870, Solyc02g072300, Solyc10g037910, Solyc06g082640, Solyc03g006070, Solyc07g055200, Solyc05g051050, Solyc01g091620	132906, 159063	SM000007S20801, SM000090S24347, SM000037S13557	Zci1a_33747	Zci_10057	UTEX1559_07675	UTEX1560_09818	Zm00001d012869, Zm00001d040263, Zm00001d039730, Zm00001d008357, Zm00001d024729, Zm00001d009055, Zm00001d044362, Zm00001d006088, Zm00001d053206, Zm00001d039407, Zm00001d008893, Zm00001d053548, Zm00001d016188, Zm00001d037010, Zm00001d029664, Zm00001d048564
Zci_04717	N0.HOG0010707	OG0009192	n0	AagrOXF_evm.TU.utg000006l.166	NA	NA	NA	CBR_g4637	NA	NA	NA	16032	NA	NA	NA	Olucimarinus_14618	NA	NA	pm001843g0040	NA	NA	NA	SM000078S22122, SM000111S18790, SM000187S03890	Zci1a_06716, Zci1a_30602	Zci_04717, Zci_04638	UTEX1559_07615, UTEX1559_00219	UTEX1560_02068, UTEX1560_04343	NA
Zci_02510	N0.HOG0007014	OG0005737	n0	AagrOXF_evm.TU.utg000058l.16	Azfi_s0176.g056087	AT1G64570	Bradi1g46804, Bradi4g16700	CBR_g32188	Chrsp57S06763	NA	CLOP_g2800	7297	Me1_v2_0045900, Me1_v2_0152570, Me1_v2_0177400	Mp1g01390	2876, 2875, 2874	NA	LOC_Os03g46950, LOC_Os12g05720	NA	NA	Pp3c26_140, Pp3c12_10531	Solyc06g072270	76966	SM000086S23075, SM000369S13622, SM000391S15188	Zci1a_27772	Zci_02510	UTEX1559_12204	UTEX1560_01940	Zm00001d020204
Zci_05139	N0.HOG0005921	OG0004698	n0	AagrOXF_evm.TU.utg000117l.50, AagrOXF_evm.TU.utg000033l.102, AagrOXF_evm.TU.utg000071l.9	Azfi_s0042.g026902	AT3G13940	Bradi4g13720	CBR_g45967	Chrsp37S00871	Cre01.g070567_4532	CLOP_g20590	11954	Me1_v2_0056470	Mp8g08640	1280, 1352, 1279, 1353, 28211	Olucimarinus_17613	LOC_Os11g40090	NA	pm016447g0030, pm020889g0010	Pp3c8_24340	Solyc06g053330	18694	SM000030S11485, SM000131S26699, SM000058S18504	Zci1a_16105	Zci_05139	UTEX1559_09824	UTEX1560_11960	Zm00001d048834
Zci_06743	N0.HOG0004740	OG0003624	n0	AagrOXF_evm.TU.utg000050l.568	Azfi_s0099.g044124, Azfi_s0173.g055868	AT5G23130, AT5G08200	Bradi1g29481, Bradi3g29280, Bradi1g77920	CBR_g51238	Chrsp50S06433	Cre07.g339600_4532	CLOP_g6134	7170	Me1_v2_0131700	Mp8g03730	16516	NA	LOC_Os06g51360, LOC_Os10g34420, LOC_Os03g01990	NA	pm012639g0010, pm001372g0040, pm008426g0010	Pp3c15_20580, Pp3c7_23420, Pp3c2_37160	Solyc11g039960, Solyc02g014090	448329	NA	Zci1a_25737	Zci_06743	UTEX1559_13305	UTEX1560_10591	Zm00001d036338, Zm00001d032656, Zm00001d013983, Zm00001d027325, Zm00001d048521
Zci_12181	N0.HOG0014051	OG0012262	n0	NA	Azfi_s0003.g007676, Azfi_s0908.g092257	NA	NA	CBR_g22247	NA	NA	NA	NA	Me1_v2_0116210	NA	NA	NA	NA	NA	NA	NA	NA	126210	NA	Zci1a_32321	Zci_12181	UTEX1559_06335	UTEX1560_07999	NA
Zci_09205	N0.HOG0000873	OG0000497	n1	AagrOXF_evm.TU.utg000038l.207	Azfi_s0001.g000975, Azfi_s1989.g108567, Azfi_s1989.g108568	AT5G63960	Bradi4g23600	CBR_g38906	Chrsp64S09160	Cre01.g015250_4532	CLOP_g5892, CLOP_g13848	2240	Me1_v2_0044820, Me1_v2_0234700	Mp4g05690	14963, 14961, 14962	Olucimarinus_44713	LOC_Os11g08330	PRCOL_00002177_RA	pm006958g0010, pm118010g0010, pm007904.t1, pm016102g0010, pm018466g0010, pm002730g0010, pm048257g0010, pm010711g0010, pm018048g0010, pm006958g0030	Pp3c27_3350, Pp3c6_19160	Solyc10g081250	155333	SM000003S11097, SM000324S12586, SM000143S00770, SM001060S14104	Zci1a_43273	Zci_09205	UTEX1559_06471	UTEX1560_03651, UTEX1560_03652	Zm00001d053070
Zci_00736	N0.HOG0004397	OG0003319	n0	AagrOXF_evm.TU.utg000005l.457	Azfi_s0102.g044574	AT2G40950, AT3G56660, AT3G10800	Bradi2g25400, Bradi1g19702	CBR_g40793	Chrsp32S04954	NA	CLOP_g4590	8069	Me1_v2_0032270, Me1_v2_0162600	Mp2g02230	17230	NA	LOC_Os05g34050, LOC_Os07g44950	NA	NA	Pp3c13_15030, Pp3c3_16820	Solyc04g150153, Solyc04g056510.1, Solyc04g056490, Solyc04g051040.1, Solyc04g051060, Solyc04g056460, Solyc03g013450, Solyc04g056470.1, Solyc08g074850	409591	SM000167S02958, SM000184S03778, SM000239S08057	Zci1a_07208, Zci1a_38300	Zci_00736	UTEX1559_13778	UTEX1560_06941	Zm00001d007042
Zci_06969	N0.HOG0004029	OG0002991	n2	AagrOXF_evm.TU.utg000003l.226	Azfi_s0010.g012105, Azfi_s0006.g009842	AT1G78180, AT5G64970	Bradi1g71800	NA	Chrsp234S03567	Cre09.g404450_4532	CLOP_g7313	6644	Me1_v2_0146570	Mp7g12450	26486	Olucimarinus_33920	LOC_Os03g09110	PRCOL_00000967_RA	pm007485g0020, pm000770g0040, pm004539g0020	NA	Solyc04g074130, Solyc05g051560, Solyc04g056260	70839	SM000141S00886, SM000010S04347, SM000190S04850	Zci1a_08162	Zci_06969	UTEX1559_00330, UTEX1559_00329	UTEX1560_14640	Zm00001d028009, Zm00001d028008, Zm00001d009318, Zm00001d014170, Zm00001d014331, Zm00001d052515, Zm00001d048218
Zci_10420	N0.HOG0004329	OG0003262	n0	AagrOXF_evm.TU.utg000118l.115	Azfi_s0063.g035320	AT3G05550, AT5G27760	Bradi3g47500, Bradi1g18030	NA	Chrsp66S07195	NA	CLOP_g20750, CLOP_g21399	14231	Me1_v2_0200760	Mp5g17300	NA	Olucimarinus_30214	LOC_Os02g37930, LOC_Os07g47670, LOC_Os12g02040, LOC_Os11g02080	NA	pm010827g0020, pm004522g0060, pm001524g0020, pm026322g0010	Pp3c23_8640, Pp3c8_8060	Solyc01g066720, Solyc01g099820, Solyc06g050870	409480	SM000319S12277, SM000065S20202, SM000125S26041	Zci1a_07539	Zci_10420	UTEX1559_01767	NA	Zm00001d050935, Zm00001d017060, Zm00001d007153, Zm00001d052333, Zm00001d036839, Zm00001d045833
