AT1G11660
AT4G27720
AT3G06010
AT1G71960
AT5G61290
AT4G13550
AT4G32070
AT5G03280
AT1G48700
AT2G03440
AT1G79440
AT4G13670
AT4G23493
AT4G04950
AT3G28030
AT5G20970
AT2G39650
AT2G38560
AT2G39770
AT5G64310
AT5G25180
AT3G44990
AT1G54490
AT4G10270
AT4G25200
AT1G59860
AT5G41340
AT5G19730
AT5G41100
AT1G72950
AT1G32583
AT3G23610
AT1G12610
AT5G65790
AT4G24110
AT4G36690
AT5G53680
AT1G77280
AT4G39960
AT4G38630
AT3G53110
AT1G59870
AT3G56740
AT5G66631
AT1G35720
AT1G32330
AT5G62390
AT1G68580
AT4G26780
AT4G10250
AT5G06780
AT2G26330
AT3G12960
AT5G45710
AT1G76080
AT1G79350
AT5G43660
AT3G09440
AT1G56410
AT3G23990
AT1G15825
AT3G19130
AT5G18620
AT2G38470
AT3G23510
AT2G20940
AT5G28540
AT3G07030
AT1G76010
AT1G14980
AT5G17760
AT1G66340
AT5G25020
AT1G56300
AT4G15802
AT1G64280
AT4G13980
AT1G43160
AT2G25140
AT3G10680
AT1G80510
AT2G29500
AT5G47910
AT1G54050
AT5G44650
AT5G15450
AT3G24500
AT5G65470
AT3G48700
AT4G12400
AT5G53000
AT5G02490
AT5G38200
AT3G09350
AT1G77000
AT2G27470
AT1G54280
AT3G12510
AT5G46720
AT1G55230
AT2G47180
AT2G16575
AT2G07623
AT2G38340
AT5G27660
AT4G24280
AT4G27670
AT5G51190
AT2G30500
AT1G79550
AT1G47500
AT5G05410
AT5G11090
AT2G27580
AT4G19020
AT5G01820
AT3G26020
AT5G19350
AT5G46170
AT5G36925
AT5G63870
AT4G25380
AT2G18790
AT5G36920
AT2G40350
AT3G08720
AT3G04120
AT3G10800
AT1G03190
AT3G03270
AT1G03070
AT1G06460
AT3G05690
AT4G08230
AT3G18520
AT2G17690
AT3G19970
AT5G63500
AT4G38580
AT1G22600
AT2G26150
AT3G25290
AT2G42540
AT1G22960
AT3G08970
AT2G07675
AT1G08550
AT1G17100
AT4G29520
AT4G29760
AT1G54400
AT2G20880
AT2G22820
AT5G07100
AT1G52340
AT1G07330
AT2G04030
AT3G53990
AT5G17020
AT3G07770
AT5G52640
AT5G54940
AT4G29770
AT1G10960
AT5G07350
AT1G53540
AT1G16030
AT1G77570
AT2G27140
AT2G40340
AT5G18340
AT1G33890
AT5G48030
AT2G19310
AT1G76770
AT3G14075
AT5G51440
AT5G44910
AT5G58070
AT1G09530
AT5G43940
AT1G33880
AT1G64200
AT5G42980
AT1G13930
AT2G19540
AT2G20770
AT1G79930
AT1G20220
AT1G76780
AT3G61190
AT5G16380
AT4G32610
AT5G53400
AT1G55620
AT3G22840
AT4G39360
AT5G43840
AT4G17250
AT1G21760
AT1G68820
AT5G40460
AT1G67970
AT3G22830
AT3G63350
AT5G54860
AT1G20440
AT1G76560
AT1G01940
AT5G67030
AT5G23570
AT5G56010
AT2G41160
AT5G38820
AT2G47820
AT5G11100
AT1G53730
AT1G51670
AT1G32928
AT5G10010
AT4G26080
AT2G46735
AT1G74310
AT4G17230
AT5G03720
AT5G54070
AT5G55160
AT1G64520
AT5G47550
AT1G21910
AT4G28140
AT4G21870
AT3G13470
AT3G48430
AT3G47220
AT3G14200
AT3G17830
AT3G14205
AT2G43110
AT1G67920
AT5G66080
AT1G14590
AT3G25230
AT2G30250
AT2G46830
AT5G10230
AT4G19630
AT1G36390
AT1G73480
AT5G56030
AT2G41140
AT1G12060
AT4G24920
AT1G16540
AT3G07930
AT5G60410
AT2G21320
AT1G73130
AT2G23980
AT1G28520
AT1G04570
AT5G02500
AT3G51780
AT5G09590
AT1G33930
AT3G16770
AT1G75600
AT1G28210
AT1G71000
AT1G52560
AT4G18880
AT5G47229
AT1G04000
AT4G30490
AT1G18300
AT1G30650
AT1G69295
AT2G33590
AT5G10220
AT1G68090
AT5G64910
AT4G29040
AT1G07980
AT4G14270
AT3G47020
AT4G18870
AT5G18040
AT5G51740
AT1G17780
AT3G62410
AT5G48570
AT4G21320
AT1G33910
AT4G20350
AT1G48050
AT2G31260
AT5G14800
AT3G15340
AT1G49130
AT3G17880
AT5G59580
AT3G24190
AT2G32120
AT3G06400
AT1G07890
AT3G01070
AT1G26270
AT4G02270
AT5G61780
AT1G30630
AT2G43130
AT5G08000
AT1G33900
AT5G09330
AT1G04130
AT4G37910
AT1G15380
AT3G53830
AT1G13080
AT5G57050
AT1G07400
AT2G43010
AT1G78080
AT1G13440
AT4G35987
AT3G24520
AT1G50500
AT5G04890
AT2G01300
AT1G73740
AT5G57500
AT3G11320
AT5G12030
AT2G20180
AT4G17750
AT2G22360
AT1G35460
AT5G42020
AT1G80030
AT1G11270
AT3G23540
AT5G67300
AT3G44110
AT5G56420
AT3G47860
AT1G71330
AT5G05630
ATMG00490
AT3G51910
AT1G33270
AT3G02990
AT5G22060
AT5G17710
AT1G09080
AT1G75945
AT2G47400
AT1G22370
AT5G59820
AT5G37670
AT2G23110
AT5G05965
AT1G61667
AT5G49910
AT3G02885
AT5G16610
AT5G65020
AT3G10140
AT5G12020
AT5G12140
AT5G06820
AT5G12380
AT1G49600
AT4G14690
AT3G16920
AT5G53170
AT3G24320
AT2G13570
AT2G38750
AT4G16500
AT4G36990
AT5G59720
AT5G37770
AT1G05850
AT1G02340
AT4G37840
AT3G15840
AT5G53060
AT1G56260
AT4G26840
AT2G38880
AT4G02450
AT1G47490
AT1G09090
AT2G38760
AT3G12580
AT2G21180
AT3G13310
AT5G35460
AT2G46020
AT4G14670
AT4G26850
AT1G15520
AT3G56250
AT1G16970
AT5G16820
AT4G23100
AT4G14540
AT5G57560
AT1G66080
AT3G11020
AT2G28840
AT1G58340
AT5G20190
AT5G21160
AT3G03773
AT1G71790
AT1G50630
AT4G34480
AT5G56000
AT5G60970
AT3G46230
AT2G46240
AT4G11260
AT5G23570
AT5G46170
AT2G38470
AT1G50500
AT3G16770
AT2G41160
AT5G11100
AT5G04890
AT1G51670
AT5G10010
AT2G20940
AT5G59720
AT5G47229
AT5G58070
AT5G43940
AT3G15840
AT5G53060
AT2G40350
AT4G26840
AT5G42980
AT1G11270
AT4G15802
AT4G38580
AT2G21180
AT3G48430
AT3G47220
AT3G47020
AT3G14200
AT2G26150
AT1G54490
AT2G42540
AT5G18040
AT4G25200
AT5G44650
AT3G25230
AT1G17780
AT5G53400
AT5G48570
AT4G21320
AT4G29760
AT2G30250
AT1G66080
AT4G12400
AT3G11020
AT3G17880
AT5G07100
AT1G77000
AT4G17250
AT1G54280
AT5G56030
AT2G41140
AT3G56740
AT1G12060
AT2G16575
AT5G66631
AT3G02885
AT4G29770
AT4G02270
AT5G21160
AT4G26780
AT5G60410
AT2G21320
AT1G73130
AT2G26330
AT1G20440
AT1G13080
AT5G05410
AT5G11090
AT1G76080
AT1G79350
AT2G40340
AT5G02500
AT3G26020
AT5G19350
AT4G25380
AT3G24520
AT5G56010
AT5G10010
AT1G74310
AT5G03720
AT4G17750
AT5G54070
AT5G20970
AT5G47550
AT1G21910
AT1G06460
AT3G14200
AT2G26150
AT1G54490
AT3G51910
AT1G33270
AT3G02990
AT3G08970
AT5G66080
AT3G25230
AT5G17710
AT3G23610
AT5G65790
AT2G30250
AT2G47400
AT1G54400
AT2G20880
AT5G53680
AT5G07100
AT4G19630
AT5G56030
AT2G04030
AT3G07770
AT5G52640
AT1G32330
AT5G62390
AT3G07930
AT2G21320
AT5G07350
AT5G12140
AT2G26330
AT1G77570
AT5G45710
AT1G49600
AT2G27140
AT1G79350
AT4G14690
AT5G18340
AT1G33890
AT3G19130
AT5G18620
AT2G38470
AT1G33930
AT1G76770
AT4G18880
AT3G07030
AT5G47229
AT1G76010
AT3G15840
AT1G33880
AT1G56300
AT4G15802
AT1G47490
AT2G19540
AT4G13980
AT1G43160
AT5G64910
AT2G25140
AT3G10680
AT1G20220
AT1G80510
AT1G76780
AT2G46020
AT4G18870
AT4G14670
AT5G51740
AT5G15450
AT3G62410
AT5G48570
AT1G33910
AT5G16820
AT3G22840
AT5G43840
AT3G06400
AT1G67970
AT2G38340
AT5G27660
AT5G61780
AT5G21160
AT3G22830
AT1G33900
AT3G63350
AT5G56000
AT1G76560
AT1G47500
AT1G01940
AT4G19020
AT2G21320
AT5G07100
AT3G25230
AT2G26330
AT5G48570
AT4G15802
AT5G21160
AT2G38470
AT1G54490
AT3G15840
AT2G30250