0.7412367073651044	0.9996124031007751	0.9980557355800389	0.9775320970042796	0.864903502501787	0.9869773817683345	0.9786680541103018	0.9765670767428236	0.9851804123711341	1	0.9640718562874252	0.9994484280198566	1
0.9896975739448322	0.7881059470264867	0.9816849816849816	0.9314150571541191	0.9993011879804332	0.968798751950078	0.9813979706877114	0.9372077488309953	0.9978813559322034	0.9893503727369543	1	0.9446212603437301	0.9989795918367347
0.9295287505404237	0.994054054054054	0.9939098660170523	0.9776190476190476	0.965435041716329	0.9728997289972899	0.9752679307502061	0.9791252485089463	0.9748201438848921	0.9973958333333334	0.9792099792099792	0.9990850869167429	1
0.9659781287970839	0.9680511182108626	0.918562874251497	0.9670227589410125	0.9592511013215859	0.9716748768472906	0.9830508474576272	0.9475691134413727	1	1	0.9857142857142858	0.9939862542955327	0.9979716024340771
0.9652904640116916	0.9872087711283691	0.9408602150537635	0.9303418803418804	0.8780934922089826	0.9637209302325581	0.9304347826086956	0.9785819793205317	1	1	0.9465174129353234	0.9930555555555556	0.9934895833333334
0.9853951890034365	0.9843023255813953	0.995768688293371	0.9742684157416751	0.979702300405954	0.9662921348314607	0.9792043399638336	0.9457274826789839	0.9722607489597781	1	0.9946666666666667	0.9979550102249489	1
0.9810765349032801	0.9518840579710145	1	0.9654150197628458	0.997539975399754	0.9737991266375546	0.9688041594454073	0.9864724245577523	0.992462311557789	1	1	0.9672619047619048	1
0.9968051118210862	0.8901795142555439	0.878177966101695	0.865016501650165	0.986391365556077	0.9881539980256664	0.9189765458422174	0.9633437639696022	1	0.9970095693779905	0.9988770353733858	0.8490110950313555	0.9741896758703481
0.8040219378427788	0.9889607917776931	1	0.9741980474198048	0.9810049019607843	0.9789612097304405	0.957544757033248	0.9462116830537883	0.8129496402877698	1	0.9937402190923318	0.9957469431153642	1
0.973328025477707	0.9646810753821824	0.9479048697621744	0.9549465861588481	0.9864300626304802	0.9563636363636363	0.9393223010244287	0.991971454058876	1	0.997946611909651	0.9880749574105622	0.9645328719723183	0.9980732177263969
0.9995893223819302	0.9821129122414757	0.9923076923076923	0.9358585858585858	0.9951456310679612	0.9801136363636364	0.9400881057268723	0.9866529774127311	0.9987714987714987	1	0.9955456570155902	0.9522862823061631	0.9919786096256684
0.9797979797979798	0.8788759689922481	1	0.9477944152165115	0.9984836997725549	0.9622964867180805	0.9696233292831106	0.9197080291970803	0.8934010152284264	0.9964071856287425	1	0.973457199734572	1
0.9864349300551081	0.9886104783599089	1	0.9617321248741189	0.9831168831168832	0.9646153846153847	0.9453551912568307	0.9957356076759062	0.9650537634408602	1	0.9824561403508771	0.9869477911646586	1
0.9967228464419475	0.9986893840104849	0.9979674796747967	0.9955703211517165	0.99812734082397	1	0.994475138121547	0.9985569985569985	0.9980806142034548	1	1	1	1
0.8724048442906575	0.9784615384615385	0.9968553459119497	0.978017048003589	0.9919273461150353	0.9638694638694638	0.9882179675994109	0.9669937555753791	0.992849846782431	0.9980582524271845	0.998389694041868	1	1
1	0.940563086548488	0.9888438133874239	0.9158091674462114	0.9980713596914176	0.9835886214442013	0.966374269005848	0.9830220713073005	0.998046875	0.9909255898366606	1	0.8844797178130511	0.9931506849315068
