"","ID","Description","GeneRatio","BgRatio","pvalue","p.adjust","qvalue","geneID","Count"
"GO:0000398","GO:0000398","mRNA splicing, via spliceosome","6/49","26/1957",2.83919233741789e-05,0.0134293797559866,0.0121636976982008,"Zci_06676/Zci_12357/Zci_14540/Zci_14531/Zci_14063/Zci_09224",6
"GO:0000377","GO:0000377","RNA splicing, via transesterification reactions with bulged adenosine as nucleophile","5/49","22/1957",0.000152906958552871,0.0226708179474729,0.0205341557908567,"Zci_06676/Zci_14540/Zci_14531/Zci_14063/Zci_09224",5
"GO:0006397","GO:0006397","mRNA processing","6/49","35/1957",0.000168580957575377,0.0226708179474729,0.0205341557908567,"Zci_06676/Zci_09282/Zci_14540/Zci_14531/Zci_14063/Zci_09224",6
"GO:0000375","GO:0000375","RNA splicing, via transesterification reactions","5/49","23/1957",0.000191719390676304,0.0226708179474729,0.0205341557908567,"Zci_06676/Zci_14540/Zci_14531/Zci_14063/Zci_09224",5
"GO:0008380","GO:0008380","RNA splicing","5/49","27/1957",0.000426458154830836,0.0342243766427353,0.0309988233973367,"Zci_06676/Zci_14540/Zci_14531/Zci_14063/Zci_09224",5
"GO:0010629","GO:0010629","negative regulation of gene expression","7/49","58/1957",0.000452172028463734,0.0342243766427353,0.0309988233973367,"Zci_08094/Zci_09600/Zci_09313/Zci_02911/Zci_14531/Zci_14063/Zci_09224",7
"GO:0022618","GO:0022618","ribonucleoprotein complex assembly","4/49","16/1957",0.000506491831922086,0.0342243766427353,0.0309988233973367,"Zci_09282/Zci_14531/Zci_14063/Zci_09224",4
"GO:0071826","GO:0071826","ribonucleoprotein complex subunit organization","4/49","17/1957",0.000650182588572489,0.0384420455493484,0.0348189886248688,"Zci_09282/Zci_14531/Zci_14063/Zci_09224",4
"GO:0016071","GO:0016071","mRNA metabolic process","6/49","46/1957",0.000788667599652815,0.0414488638484202,0.0375424225799644,"Zci_06676/Zci_09282/Zci_14540/Zci_14531/Zci_14063/Zci_09224",6
"GO:0010605","GO:0010605","negative regulation of macromolecule metabolic process","8/49","90/1957",0.00139632152432826,0.0660460081007266,0.0598213537264843,"Zci_11373/Zci_08094/Zci_09600/Zci_09313/Zci_02911/Zci_14531/Zci_14063/Zci_09224",8
"GO:0005984","GO:0005984","disaccharide metabolic process","3/49","10/1957",0.00156525979846213,0.0673061713338718,0.0609627500453674,"Zci_04380/Zci_13243/Zci_02211",3
"GO:0009892","GO:0009892","negative regulation of metabolic process","8/49","95/1957",0.00198953448096853,0.0784208174581762,0.0710298713819466,"Zci_11373/Zci_08094/Zci_09600/Zci_09313/Zci_02911/Zci_14531/Zci_14063/Zci_09224",8
"GO:1903311","GO:1903311","regulation of mRNA metabolic process","3/49","12/1957",0.00276981165003873,0.100778531574486,0.0912804325154463,"Zci_09600/Zci_09282/Zci_14531",3
"GO:0005982","GO:0005982","starch metabolic process","3/49","13/1957",0.00353764833702865,0.119521975958182,0.108257358885012,"Zci_13243/Zci_02211/Zci_01267",3
"GO:0009311","GO:0009311","oligosaccharide metabolic process","3/49","14/1957",0.00442361926925786,0.139491460957265,0.126344774918453,"Zci_04380/Zci_13243/Zci_02211",3
"GO:0010468","GO:0010468","regulation of gene expression","11/49","191/1957",0.0060189936308453,0.174441056765024,0.158000467571747,"Zci_04296/Zci_08094/Zci_09600/Zci_09313/Zci_09282/Zci_14540/Zci_02911/Zci_14531/Zci_14063/Zci_09224/Zci_15818",11
"GO:0044275","GO:0044275","cellular carbohydrate catabolic process","3/49","16/1957",0.00656961702014882,0.174441056765024,0.158000467571747,"Zci_04380/Zci_13243/Zci_01267",3
"GO:0016052","GO:0016052","carbohydrate catabolic process","4/49","31/1957",0.00663834888323557,0.174441056765024,0.158000467571747,"Zci_04380/Zci_13243/Zci_11120/Zci_01267",4
"GO:0006575","GO:0006575","cellular modified amino acid metabolic process","3/49","17/1957",0.00783806725548661,0.185370290592258,0.167899651209634,"Zci_06450/Zci_02791/Zci_11937",3
"GO:0009932","GO:0009932","cell tip growth","3/49","17/1957",0.00783806725548661,0.185370290592258,0.167899651209634,"Zci_02516/Zci_04108/Zci_03487",3
"GO:0034641","GO:0034641","cellular nitrogen compound metabolic process","15/49","318/1957",0.00827782270942617,0.18644810197898,0.168875881841426,"Zci_11986/Zci_08094/Zci_06676/Zci_02791/Zci_09313/Zci_09282/Zci_14540/Zci_12780/Zci_10411/Zci_14646/Zci_14531/Zci_14063/Zci_09224/Zci_15818/Zci_11937",15
"GO:0016192","GO:0016192","vesicle-mediated transport","5/49","54/1957",0.0100420464463911,0.215903998597409,0.195555641324458,"Zci_03184/Zci_07386/Zci_02911/Zci_02516/Zci_03487",5
"GO:0090304","GO:0090304","nucleic acid metabolic process","11/49","206/1957",0.0106080155654359,0.21815614619353,0.19759553021201,"Zci_08094/Zci_06676/Zci_09313/Zci_09282/Zci_14540/Zci_12780/Zci_14646/Zci_14531/Zci_14063/Zci_09224/Zci_15818",11
"GO:0060255","GO:0060255","regulation of macromolecule metabolic process","12/49","241/1957",0.0128881410613964,0.250328707785845,0.226735916476775,"Zci_11373/Zci_04296/Zci_08094/Zci_09600/Zci_09313/Zci_09282/Zci_14540/Zci_02911/Zci_14531/Zci_14063/Zci_09224/Zci_15818",12
"GO:0046483","GO:0046483","heterocycle metabolic process","14/49","305/1957",0.0139961319945691,0.250328707785845,0.226735916476775,"Zci_11986/Zci_08094/Zci_06676/Zci_02791/Zci_09313/Zci_09282/Zci_14540/Zci_12780/Zci_10411/Zci_14646/Zci_14531/Zci_14063/Zci_09224/Zci_15818",14
"GO:0032269","GO:0032269","negative regulation of cellular protein metabolic process","3/49","21/1957",0.0142893765543717,0.250328707785845,0.226735916476775,"Zci_11373/Zci_09600/Zci_02911",3
"GO:0048193","GO:0048193","Golgi vesicle transport","3/49","21/1957",0.0142893765543717,0.250328707785845,0.226735916476775,"Zci_14350/Zci_02516/Zci_03487",3
"GO:0060560","GO:0060560","developmental growth involved in morphogenesis","4/49","39/1957",0.0149824501470927,0.253096389984816,0.229242752250629,"Zci_02911/Zci_02516/Zci_04108/Zci_03487",4
"GO:0048868","GO:0048868","pollen tube development","3/49","22/1957",0.0162579347145577,0.26517252137882,0.240180741518148,"Zci_02516/Zci_04108/Zci_04376",3
"GO:0048869","GO:0048869","cellular developmental process","7/49","109/1957",0.0168715214125643,0.26600765427143,0.240937165435567,"Zci_06450/Zci_09600/Zci_02911/Zci_02516/Zci_04108/Zci_15818/Zci_03487",7
"GO:0022613","GO:0022613","ribonucleoprotein complex biogenesis","4/49","41/1957",0.0177834723430763,0.270664716815795,0.245155312660573,"Zci_09282/Zci_14531/Zci_14063/Zci_09224",4
"GO:0006396","GO:0006396","RNA processing","6/49","86/1957",0.0184791234509199,0.270664716815795,0.245155312660573,"Zci_06676/Zci_09282/Zci_14540/Zci_14531/Zci_14063/Zci_09224",6
"GO:0016049","GO:0016049","cell growth","4/49","42/1957",0.0192990444278262,0.270664716815795,0.245155312660573,"Zci_02911/Zci_02516/Zci_04108/Zci_03487",4
"GO:0030154","GO:0030154","cell differentiation","6/49","87/1957",0.0194743932631006,0.270664716815795,0.245155312660573,"Zci_09600/Zci_02911/Zci_02516/Zci_04108/Zci_15818/Zci_03487",6
"GO:0048588","GO:0048588","developmental cell growth","3/49","24/1957",0.0206320665433663,0.270664716815795,0.245155312660573,"Zci_02911/Zci_02516/Zci_04108",3
"GO:0051248","GO:0051248","negative regulation of protein metabolic process","3/49","24/1957",0.0206320665433663,0.270664716815795,0.245155312660573,"Zci_11373/Zci_09600/Zci_02911",3
"GO:0051172","GO:0051172","negative regulation of nitrogen compound metabolic process","5/49","65/1957",0.0213375976637689,0.270664716815795,0.245155312660573,"Zci_11373/Zci_08094/Zci_09600/Zci_02911/Zci_14531",5
"GO:0032502","GO:0032502","developmental process","15/49","354/1957",0.0217447341205078,0.270664716815795,0.245155312660573,"Zci_03184/Zci_11373/Zci_06450/Zci_02211/Zci_08094/Zci_09600/Zci_02911/Zci_03841/Zci_06645/Zci_02516/Zci_04108/Zci_09224/Zci_15818/Zci_03487/Zci_04376",15
"GO:0031324","GO:0031324","negative regulation of cellular metabolic process","5/49","66/1957",0.0226583104538413,0.274804637042742,0.248905056807379,"Zci_11373/Zci_08094/Zci_09600/Zci_02911/Zci_14531",5
"GO:0040011","GO:0040011","locomotion","2/49","10/1957",0.0243156791586543,0.275295286788438,0.249349464165782,"Zci_02911/Zci_04376",2
"GO:1901360","GO:1901360","organic cyclic compound metabolic process","14/49","326/1957",0.0243341814382797,0.275295286788438,0.249349464165782,"Zci_11986/Zci_08094/Zci_06676/Zci_02791/Zci_09313/Zci_09282/Zci_14540/Zci_12780/Zci_10411/Zci_14646/Zci_14531/Zci_14063/Zci_09224/Zci_15818",14
"GO:0019953","GO:0019953","sexual reproduction","3/49","26/1957",0.02559306082245,0.275295286788438,0.249349464165782,"Zci_06450/Zci_02911/Zci_02516",3
"GO:0000902","GO:0000902","cell morphogenesis","4/49","46/1957",0.0261533941094679,0.275295286788438,0.249349464165782,"Zci_02911/Zci_02516/Zci_04108/Zci_03487",4
"GO:0048589","GO:0048589","developmental growth","4/49","46/1957",0.0261533941094679,0.275295286788438,0.249349464165782,"Zci_02911/Zci_02516/Zci_04108/Zci_03487",4
"GO:0010467","GO:0010467","gene expression","7/49","119/1957",0.0261908835210987,0.275295286788438,0.249349464165782,"Zci_06676/Zci_09313/Zci_09282/Zci_14540/Zci_14531/Zci_14063/Zci_09224",7
"GO:0051252","GO:0051252","regulation of RNA metabolic process","8/49","147/1957",0.0268582925249323,0.276173312267239,0.250144738161269,"Zci_04296/Zci_08094/Zci_09600/Zci_09313/Zci_09282/Zci_02911/Zci_14531/Zci_09224",8
"GO:0016043","GO:0016043","cellular component organization","14/49","334/1957",0.0295340734008322,0.294810253412204,0.267025198929046,"Zci_08094/Zci_09282/Zci_12780/Zci_07386/Zci_02911/Zci_03044/Zci_14646/Zci_02516/Zci_14531/Zci_04108/Zci_14063/Zci_09224/Zci_15818/Zci_03487",14
"GO:0009056","GO:0009056","catabolic process","8/49","150/1957",0.0299173195851708,0.294810253412204,0.267025198929046,"Zci_03184/Zci_04380/Zci_13243/Zci_11120/Zci_11986/Zci_01267/Zci_02911/Zci_14063",8
"GO:0016070","GO:0016070","RNA metabolic process","7/49","125/1957",0.0332381494174745,0.302590195930826,0.274071903291079,"Zci_06676/Zci_09313/Zci_09282/Zci_14540/Zci_14531/Zci_14063/Zci_09224",7
"GO:0032501","GO:0032501","multicellular organismal process","13/49","307/1957",0.0337561865219734,0.302590195930826,0.274071903291079,"Zci_03184/Zci_11373/Zci_06450/Zci_02211/Zci_08094/Zci_09313/Zci_02911/Zci_03841/Zci_02516/Zci_04108/Zci_09224/Zci_03487/Zci_04376",13
"GO:0009856","GO:0009856","pollination","3/49","29/1957",0.0341348458374125,0.302590195930826,0.274071903291079,"Zci_02516/Zci_04108/Zci_04376",3
"GO:0044703","GO:0044703","multi-organism reproductive process","3/49","29/1957",0.0341348458374125,0.302590195930826,0.274071903291079,"Zci_06450/Zci_02911/Zci_02516",3
"GO:0044706","GO:0044706","multi-multicellular organism process","3/49","29/1957",0.0341348458374125,0.302590195930826,0.274071903291079,"Zci_02516/Zci_04108/Zci_04376",3
"GO:0009739","GO:0009739","response to gibberellin","2/49","12/1957",0.034545180930792,0.302590195930826,0.274071903291079,"Zci_13243/Zci_04296",2
"GO:0006073","GO:0006073","cellular glucan metabolic process","3/49","30/1957",0.0372732542737507,0.31482587984793,0.2851544076958,"Zci_13243/Zci_02211/Zci_01267",3
"GO:0009826","GO:0009826","unidimensional cell growth","3/49","30/1957",0.0372732542737507,0.31482587984793,0.2851544076958,"Zci_02516/Zci_04108/Zci_03487",3
"GO:0006725","GO:0006725","cellular aromatic compound metabolic process","13/49","312/1957",0.0379895720190963,0.315246799386536,0.285535656727095,"Zci_11986/Zci_08094/Zci_06676/Zci_02791/Zci_09313/Zci_09282/Zci_14540/Zci_12780/Zci_14646/Zci_14531/Zci_14063/Zci_09224/Zci_15818",13
"GO:0044247","GO:0044247","cellular polysaccharide catabolic process","2/49","13/1957",0.040182914129658,0.319713041875414,0.28958096816133,"Zci_13243/Zci_01267",2
"GO:0000904","GO:0000904","cell morphogenesis involved in differentiation","3/49","31/1957",0.0405555655655916,0.319713041875414,0.28958096816133,"Zci_02911/Zci_02516/Zci_04108",3
"GO:0044042","GO:0044042","glucan metabolic process","3/49","31/1957",0.0405555655655916,0.319713041875414,0.28958096816133,"Zci_13243/Zci_02211/Zci_01267",3
"GO:0019222","GO:0019222","regulation of metabolic process","12/49","287/1957",0.045347864466143,0.3325388148415,0.301197947347258,"Zci_11373/Zci_04296/Zci_08094/Zci_09600/Zci_09313/Zci_09282/Zci_14540/Zci_02911/Zci_14531/Zci_14063/Zci_09224/Zci_15818",12
"GO:0044248","GO:0044248","cellular catabolic process","7/49","134/1957",0.0460590937610033,0.3325388148415,0.301197947347258,"Zci_03184/Zci_04380/Zci_13243/Zci_11986/Zci_01267/Zci_02911/Zci_14063",7
"GO:0006403","GO:0006403","RNA localization","2/49","14/1957",0.0461427966063915,0.3325388148415,0.301197947347258,"Zci_14063/Zci_09224",2
"GO:0009860","GO:0009860","pollen tube growth","2/49","14/1957",0.0461427966063915,0.3325388148415,0.301197947347258,"Zci_02516/Zci_04108",2
"GO:0032989","GO:0032989","cellular component morphogenesis","4/49","55/1957",0.0464007648616047,0.3325388148415,0.301197947347258,"Zci_02911/Zci_02516/Zci_04108/Zci_03487",4
"GO:0045935","GO:0045935","positive regulation of nucleobase-containing compound metabolic process","4/49","55/1957",0.0464007648616047,0.3325388148415,0.301197947347258,"Zci_09600/Zci_09282/Zci_02911/Zci_09224",4
"GO:0051253","GO:0051253","negative regulation of RNA metabolic process","3/49","34/1957",0.0512515559734807,0.361820686200841,0.32772008297261,"Zci_08094/Zci_02911/Zci_14531",3
"GO:1901607","GO:1901607","alpha-amino acid biosynthetic process","2/49","15/1957",0.0524058759231661,0.364529107524376,0.330173243045334,"Zci_05289/Zci_11937",2
"GO:0019219","GO:0019219","regulation of nucleobase-containing compound metabolic process","8/49","168/1957",0.0534912716278165,0.366686543187786,0.332127346338998,"Zci_04296/Zci_08094/Zci_09600/Zci_09313/Zci_09282/Zci_02911/Zci_14531/Zci_09224",8
"GO:1901575","GO:1901575","organic substance catabolic process","7/49","139/1957",0.0544143937772942,0.367685832238002,0.333032455148252,"Zci_04380/Zci_13243/Zci_11120/Zci_11986/Zci_01267/Zci_02911/Zci_14063",7
"GO:0044262","GO:0044262","cellular carbohydrate metabolic process","4/49","59/1957",0.0575888629747375,0.377582632123303,0.341996508899932,"Zci_04380/Zci_13243/Zci_02211/Zci_01267",4
"GO:0009251","GO:0009251","glucan catabolic process","2/49","16/1957",0.0589539129093114,0.377582632123303,0.341996508899932,"Zci_13243/Zci_01267",2
"GO:0043603","GO:0043603","cellular amide metabolic process","3/49","36/1957",0.0590721242645337,0.377582632123303,0.341996508899932,"Zci_02791/Zci_10411/Zci_11937",3
"GO:2000113","GO:2000113","negative regulation of cellular macromolecule biosynthetic process","3/49","36/1957",0.0590721242645337,0.377582632123303,0.341996508899932,"Zci_08094/Zci_09600/Zci_02911",3
"GO:0048519","GO:0048519","negative regulation of biological process","8/49","172/1957",0.0600297767705059,0.37858779216599,0.342906935376785,"Zci_11373/Zci_08094/Zci_09600/Zci_09313/Zci_02911/Zci_14531/Zci_14063/Zci_09224",8
"GO:0000272","GO:0000272","polysaccharide catabolic process","2/49","17/1957",0.0657693589964881,0.380023309669976,0.344207159309403,"Zci_13243/Zci_01267",2
"GO:0007034","GO:0007034","vacuolar transport","2/49","17/1957",0.0657693589964881,0.380023309669976,0.344207159309403,"Zci_03184/Zci_02516",2
"GO:0043604","GO:0043604","amide biosynthetic process","2/49","17/1957",0.0657693589964881,0.380023309669976,0.344207159309403,"Zci_10411/Zci_11937",2
"GO:0048856","GO:0048856","anatomical structure development","13/49","338/1957",0.0664375042090372,0.380023309669976,0.344207159309403,"Zci_03184/Zci_11373/Zci_06450/Zci_02211/Zci_08094/Zci_02911/Zci_03841/Zci_06645/Zci_02516/Zci_04108/Zci_09224/Zci_03487/Zci_04376",13
"GO:0040007","GO:0040007","growth","4/49","62/1957",0.0668580719978056,0.380023309669976,0.344207159309403,"Zci_02911/Zci_02516/Zci_04108/Zci_03487",4
"GO:0009890","GO:0009890","negative regulation of biosynthetic process","3/49","38/1957",0.067425111208046,0.380023309669976,0.344207159309403,"Zci_08094/Zci_09600/Zci_02911",3
"GO:0010558","GO:0010558","negative regulation of macromolecule biosynthetic process","3/49","38/1957",0.067425111208046,0.380023309669976,0.344207159309403,"Zci_08094/Zci_09600/Zci_02911",3
"GO:0031327","GO:0031327","negative regulation of cellular biosynthetic process","3/49","38/1957",0.067425111208046,0.380023309669976,0.344207159309403,"Zci_08094/Zci_09600/Zci_02911",3
"GO:0071840","GO:0071840","cellular component organization or biogenesis","14/49","373/1957",0.067488283324055,0.380023309669976,0.344207159309403,"Zci_08094/Zci_09282/Zci_12780/Zci_07386/Zci_02911/Zci_03044/Zci_14646/Zci_02516/Zci_14531/Zci_04108/Zci_14063/Zci_09224/Zci_15818/Zci_03487",14
"GO:0006139","GO:0006139","nucleobase-containing compound metabolic process","11/49","273/1957",0.0691074822540672,0.381188030860714,0.34526210873553,"Zci_08094/Zci_06676/Zci_09313/Zci_09282/Zci_14540/Zci_12780/Zci_14646/Zci_14531/Zci_14063/Zci_09224/Zci_15818",11
"GO:0009414","GO:0009414","response to water deprivation","4/49","63/1957",0.0701128090589473,0.381188030860714,0.34526210873553,"Zci_11373/Zci_02211/Zci_14646/Zci_04108",4
"GO:0009415","GO:0009415","response to water","4/49","63/1957",0.0701128090589473,0.381188030860714,0.34526210873553,"Zci_11373/Zci_02211/Zci_14646/Zci_04108",4
"GO:0006259","GO:0006259","DNA metabolic process","5/49","91/1957",0.0739921007333913,0.397707541441978,0.360224700938878,"Zci_08094/Zci_12780/Zci_14646/Zci_09224/Zci_15818",5
"GO:0008652","GO:0008652","cellular amino acid biosynthetic process","2/49","19/1957",0.0801356057770337,0.425889230702662,0.385750343598494,"Zci_05289/Zci_11937",2
"GO:0080090","GO:0080090","regulation of primary metabolic process","9/49","216/1957",0.0829701783832138,0.436054381947335,0.394957457332959,"Zci_11373/Zci_04296/Zci_08094/Zci_09600/Zci_09313/Zci_09282/Zci_02911/Zci_14531/Zci_09224",9
"GO:0003002","GO:0003002","regionalization","2/49","20/1957",0.0876545673996415,0.450658808478592,0.408185456883914,"Zci_03184/Zci_02911",2
"GO:0006302","GO:0006302","double-strand break repair","2/49","20/1957",0.0876545673996415,0.450658808478592,0.408185456883914,"Zci_12780/Zci_14646",2
"GO:0044264","GO:0044264","cellular polysaccharide metabolic process","3/49","43/1957",0.0905064373876851,0.460317686928764,0.416934012640496,"Zci_13243/Zci_02211/Zci_01267",3
"GO:0051171","GO:0051171","regulation of nitrogen compound metabolic process","9/49","222/1957",0.0949969338619259,0.474878153883769,0.430122195684197,"Zci_11373/Zci_04296/Zci_08094/Zci_09600/Zci_09313/Zci_09282/Zci_02911/Zci_14531/Zci_09224",9
"GO:0007389","GO:0007389","pattern specification process","2/49","21/1957",0.0953772190675646,0.474878153883769,0.430122195684197,"Zci_03184/Zci_02911",2
"GO:0097305","GO:0097305","response to alcohol","5/49","99/1957",0.098135712832222,0.483522835100427,0.437952139503447,"Zci_04965/Zci_11373/Zci_13243/Zci_04296/Zci_04108",5
"GO:0045934","GO:0045934","negative regulation of nucleobase-containing compound metabolic process","3/49","45/1957",0.100560450528797,0.490361784537329,0.444146536790237,"Zci_08094/Zci_02911/Zci_14531",3
"GO:0002682","GO:0002682","regulation of immune system process","2/49","22/1957",0.103289147502865,0.498528232335258,0.451543319373428,"Zci_09282/Zci_02911",2
"GO:0051254","GO:0051254","positive regulation of RNA metabolic process","3/49","47/1957",0.111048155765568,0.525602156630329,0.47606560086468,"Zci_09600/Zci_09282/Zci_09224",3
"GO:0065003","GO:0065003","protein-containing complex assembly","4/49","74/1957",0.111120963346793,0.525602156630329,0.47606560086468,"Zci_09282/Zci_14531/Zci_14063/Zci_09224",4
"GO:0051173","GO:0051173","positive regulation of nitrogen compound metabolic process","4/49","75/1957",0.115297762706839,0.539958829310244,0.489069196682473,"Zci_09600/Zci_09282/Zci_02911/Zci_09224",4
"GO:0051641","GO:0051641","cellular localization","5/49","106/1957",0.122206787214659,0.566704023064056,0.513293729580663,"Zci_03184/Zci_02911/Zci_02516/Zci_14063/Zci_03487",5
"GO:0010608","GO:0010608","post-transcriptional regulation of gene expression","2/49","25/1957",0.128024866410088,0.582266940499729,0.527389884907955,"Zci_09600/Zci_09282",2
"GO:0048609","GO:0048609","multicellular organismal reproductive process","2/49","25/1957",0.128024866410088,0.582266940499729,0.527389884907955,"Zci_02211/Zci_02911",2
"GO:0046907","GO:0046907","intracellular transport","4/49","79/1957",0.132692317223728,0.585177718386499,0.530026329995115,"Zci_03184/Zci_02911/Zci_02516/Zci_03487",4
"GO:0044260","GO:0044260","cellular macromolecule metabolic process","15/49","450/1957",0.134181223146104,0.585177718386499,0.530026329995115,"Zci_11373/Zci_13243/Zci_11120/Zci_01168/Zci_02211/Zci_08094/Zci_01267/Zci_09313/Zci_12780/Zci_02911/Zci_03841/Zci_14646/Zci_14063/Zci_09224/Zci_15818",15
"GO:0006310","GO:0006310","DNA recombination","2/49","26/1957",0.136560850209058,0.585177718386499,0.530026329995115,"Zci_12780/Zci_14646",2
"GO:0045595","GO:0045595","regulation of cell differentiation","2/49","26/1957",0.136560850209058,0.585177718386499,0.530026329995115,"Zci_09282/Zci_04376",2
"GO:0061024","GO:0061024","membrane organization","2/49","26/1957",0.136560850209058,0.585177718386499,0.530026329995115,"Zci_07386/Zci_03044",2
"GO:0032268","GO:0032268","regulation of cellular protein metabolic process","3/49","52/1957",0.138999072212359,0.585177718386499,0.530026329995115,"Zci_11373/Zci_09600/Zci_02911",3
"GO:0007275","GO:0007275","multicellular organism development","10/49","275/1957",0.139105110476132,0.585177718386499,0.530026329995115,"Zci_03184/Zci_11373/Zci_06450/Zci_02211/Zci_08094/Zci_02911/Zci_03841/Zci_09224/Zci_03487/Zci_04376",10
"GO:0009791","GO:0009791","post-embryonic development","6/49","143/1957",0.143076718909234,0.585177718386499,0.530026329995115,"Zci_02211/Zci_08094/Zci_02911/Zci_03841/Zci_09224/Zci_04376",6
"GO:0022414","GO:0022414","reproductive process","7/49","176/1957",0.144977288623133,0.585177718386499,0.530026329995115,"Zci_06450/Zci_02211/Zci_02911/Zci_03841/Zci_02516/Zci_04108/Zci_04376",7
"GO:0045892","GO:0045892","negative regulation of transcription, DNA-templated","2/49","27/1957",0.145222199363046,0.585177718386499,0.530026329995115,"Zci_08094/Zci_02911",2
"GO:1902679","GO:1902679","negative regulation of RNA biosynthetic process","2/49","27/1957",0.145222199363046,0.585177718386499,0.530026329995115,"Zci_08094/Zci_02911",2
"GO:1903507","GO:1903507","negative regulation of nucleic acid-templated transcription","2/49","27/1957",0.145222199363046,0.585177718386499,0.530026329995115,"Zci_08094/Zci_02911",2
"GO:0009266","GO:0009266","response to temperature stimulus","5/49","113/1957",0.148833438509448,0.585177718386499,0.530026329995115,"Zci_04965/Zci_11373/Zci_12780/Zci_04108/Zci_09224",5
"GO:0003006","GO:0003006","developmental process involved in reproduction","6/49","145/1957",0.15001987561651,0.585177718386499,0.530026329995115,"Zci_06450/Zci_02211/Zci_03841/Zci_02516/Zci_04108/Zci_04376",6
"GO:0031323","GO:0031323","regulation of cellular metabolic process","9/49","245/1957",0.150319893105889,0.585177718386499,0.530026329995115,"Zci_11373/Zci_04296/Zci_08094/Zci_09600/Zci_09313/Zci_09282/Zci_02911/Zci_14531/Zci_09224",9
"GO:0005976","GO:0005976","polysaccharide metabolic process","3/49","54/1957",0.150804104887797,0.585177718386499,0.530026329995115,"Zci_13243/Zci_02211/Zci_01267",3
"GO:0009408","GO:0009408","response to heat","3/49","54/1957",0.150804104887797,0.585177718386499,0.530026329995115,"Zci_04965/Zci_11373/Zci_12780",3
"GO:0009057","GO:0009057","macromolecule catabolic process","4/49","83/1957",0.151123222859872,0.585177718386499,0.530026329995115,"Zci_13243/Zci_01267/Zci_02911/Zci_14063",4
"GO:0032504","GO:0032504","multicellular organism reproduction","2/49","28/1957",0.153997640820556,0.585177718386499,0.530026329995115,"Zci_02211/Zci_02911",2
"GO:0000003","GO:0000003","reproduction","7/49","179/1957",0.154474666150758,0.585177718386499,0.530026329995115,"Zci_06450/Zci_02211/Zci_02911/Zci_03841/Zci_02516/Zci_04108/Zci_04376",7
"GO:0031325","GO:0031325","positive regulation of cellular metabolic process","4/49","84/1957",0.155882436610357,0.585177718386499,0.530026329995115,"Zci_09600/Zci_09282/Zci_02911/Zci_09224",4
"GO:0043933","GO:0043933","protein-containing complex organization","4/49","84/1957",0.155882436610357,0.585177718386499,0.530026329995115,"Zci_09282/Zci_14531/Zci_14063/Zci_09224",4
"GO:0010604","GO:0010604","positive regulation of macromolecule metabolic process","4/49","85/1957",0.160699339511324,0.598510138494931,0.542102206225519,"Zci_09600/Zci_09282/Zci_02911/Zci_09224",4
"GO:0048468","GO:0048468","cell development","3/49","56/1957",0.162926767025899,0.602065318775391,0.545322320555434,"Zci_02911/Zci_02516/Zci_04108",3
"GO:0006970","GO:0006970","response to osmotic stress","4/49","86/1957",0.165572443378361,0.607098959053991,0.54988155410031,"Zci_11373/Zci_04296/Zci_01168/Zci_04108",4
"GO:2000112","GO:2000112","regulation of cellular macromolecule biosynthetic process","6/49","150/1957",0.168049382722068,0.610313347906377,0.552792995655715,"Zci_04296/Zci_08094/Zci_09600/Zci_09313/Zci_02911/Zci_09224",6
"GO:0000160","GO:0000160","phosphorelay signal transduction system","2/49","30/1957",0.171848017239228,0.610313347906377,0.552792995655715,"Zci_13031/Zci_09313",2
"GO:0007010","GO:0007010","cytoskeleton organization","2/49","30/1957",0.171848017239228,0.610313347906377,0.552792995655715,"Zci_15818/Zci_03487",2
"GO:0048523","GO:0048523","negative regulation of cellular process","5/49","119/1957",0.173507183786995,0.610313347906377,0.552792995655715,"Zci_11373/Zci_08094/Zci_09600/Zci_02911/Zci_14531",5
"GO:0051246","GO:0051246","regulation of protein metabolic process","3/49","58/1957",0.175340820500551,0.610313347906377,0.552792995655715,"Zci_11373/Zci_09600/Zci_02911",3
"GO:0009888","GO:0009888","tissue development","4/49","88/1957",0.175481216311347,0.610313347906377,0.552792995655715,"Zci_03841/Zci_06645/Zci_03487/Zci_04376",4
"GO:0051649","GO:0051649","establishment of localization in cell","4/49","88/1957",0.175481216311347,0.610313347906377,0.552792995655715,"Zci_03184/Zci_02911/Zci_02516/Zci_03487",4
"GO:0010556","GO:0010556","regulation of macromolecule biosynthetic process","6/49","153/1957",0.179306975668573,0.619067149571057,0.560721775621276,"Zci_04296/Zci_08094/Zci_09600/Zci_09313/Zci_02911/Zci_09224",6
"GO:0006996","GO:0006996","organelle organization","8/49","223/1957",0.187187819799279,0.630546971774242,0.571119656196988,"Zci_08094/Zci_12780/Zci_07386/Zci_02911/Zci_03044/Zci_14646/Zci_15818/Zci_03487",8
"GO:0006470","GO:0006470","protein dephosphorylation","2/49","32/1957",0.190030817486588,0.630546971774242,0.571119656196988,"Zci_11373/Zci_01267",2
"GO:1901605","GO:1901605","alpha-amino acid metabolic process","2/49","32/1957",0.190030817486588,0.630546971774242,0.571119656196988,"Zci_05289/Zci_11937",2
"GO:0009737","GO:0009737","response to abscisic acid","4/49","91/1957",0.190727772078676,0.630546971774242,0.571119656196988,"Zci_11373/Zci_13243/Zci_04296/Zci_04108",4
"GO:0005975","GO:0005975","carbohydrate metabolic process","6/49","157/1957",0.194799106028349,0.630546971774242,0.571119656196988,"Zci_04380/Zci_13243/Zci_11120/Zci_02211/Zci_01267/Zci_06645",6
"GO:1901566","GO:1901566","organonitrogen compound biosynthetic process","5/49","124/1957",0.195238303780436,0.630546971774242,0.571119656196988,"Zci_06450/Zci_11120/Zci_10411/Zci_05289/Zci_11937",5
"GO:0001101","GO:0001101","response to acid chemical","6/49","159/1957",0.20274105983119,0.630546971774242,0.571119656196988,"Zci_11373/Zci_13243/Zci_04296/Zci_02211/Zci_14646/Zci_04108",6
"GO:0071229","GO:0071229","cellular response to acid chemical","3/49","63/1957",0.207480401827505,0.630546971774242,0.571119656196988,"Zci_11373/Zci_14646/Zci_04108",3
"GO:0009738","GO:0009738","abscisic acid-activated signaling pathway","2/49","34/1957",0.20847160188641,0.630546971774242,0.571119656196988,"Zci_11373/Zci_04108",2
"GO:0010035","GO:0010035","response to inorganic substance","6/49","161/1957",0.210807004293063,0.630546971774242,0.571119656196988,"Zci_04965/Zci_11373/Zci_04296/Zci_02211/Zci_14646/Zci_04108",6
"GO:0070887","GO:0070887","cellular response to chemical stimulus","5/49","128/1957",0.213307883609445,0.630546971774242,0.571119656196988,"Zci_11373/Zci_01168/Zci_02911/Zci_14646/Zci_04108",5
"GO:0006281","GO:0006281","DNA repair","3/49","64/1957",0.214072105865354,0.630546971774242,0.571119656196988,"Zci_12780/Zci_14646/Zci_15818",3
"GO:0016053","GO:0016053","organic acid biosynthetic process","3/49","64/1957",0.214072105865354,0.630546971774242,0.571119656196988,"Zci_10411/Zci_05289/Zci_11937",3
"GO:0046394","GO:0046394","carboxylic acid biosynthetic process","3/49","64/1957",0.214072105865354,0.630546971774242,0.571119656196988,"Zci_10411/Zci_05289/Zci_11937",3
"GO:0031326","GO:0031326","regulation of cellular biosynthetic process","6/49","163/1957",0.218991824701118,0.630546971774242,0.571119656196988,"Zci_04296/Zci_08094/Zci_09600/Zci_09313/Zci_02911/Zci_09224",6
"GO:0051276","GO:0051276","chromosome organization","4/49","97/1957",0.222446183892657,0.630546971774242,0.571119656196988,"Zci_08094/Zci_12780/Zci_14646/Zci_15818",4
"GO:0010033","GO:0010033","response to organic substance","8/49","234/1957",0.224372025109187,0.630546971774242,0.571119656196988,"Zci_04965/Zci_11373/Zci_13243/Zci_04296/Zci_01168/Zci_02211/Zci_02911/Zci_04108",8
"GO:0000956","GO:0000956","nuclear-transcribed mRNA catabolic process","1/49","10/1957",0.2244351087159,0.630546971774242,0.571119656196988,"Zci_14063",1
"GO:0001933","GO:0001933","negative regulation of protein phosphorylation","1/49","10/1957",0.2244351087159,0.630546971774242,0.571119656196988,"Zci_11373",1
"GO:0006402","GO:0006402","mRNA catabolic process","1/49","10/1957",0.2244351087159,0.630546971774242,0.571119656196988,"Zci_14063",1
"GO:0009788","GO:0009788","negative regulation of abscisic acid-activated signaling pathway","1/49","10/1957",0.2244351087159,0.630546971774242,0.571119656196988,"Zci_11373",1
"GO:0009896","GO:0009896","positive regulation of catabolic process","1/49","10/1957",0.2244351087159,0.630546971774242,0.571119656196988,"Zci_09600",1
"GO:0010563","GO:0010563","negative regulation of phosphorus metabolic process","1/49","10/1957",0.2244351087159,0.630546971774242,0.571119656196988,"Zci_11373",1
"GO:0036065","GO:0036065","fucosylation","1/49","10/1957",0.2244351087159,0.630546971774242,0.571119656196988,"Zci_11120",1
"GO:0042326","GO:0042326","negative regulation of phosphorylation","1/49","10/1957",0.2244351087159,0.630546971774242,0.571119656196988,"Zci_11373",1
"GO:0045936","GO:0045936","negative regulation of phosphate metabolic process","1/49","10/1957",0.2244351087159,0.630546971774242,0.571119656196988,"Zci_11373",1
"GO:0046474","GO:0046474","glycerophospholipid biosynthetic process","1/49","10/1957",0.2244351087159,0.630546971774242,0.571119656196988,"Zci_06450",1
"GO:0046688","GO:0046688","response to copper ion","1/49","10/1957",0.2244351087159,0.630546971774242,0.571119656196988,"Zci_04965",1
"GO:0048513","GO:0048513","animal organ development","1/49","10/1957",0.2244351087159,0.630546971774242,0.571119656196988,"Zci_02911",1
"GO:1901420","GO:1901420","negative regulation of response to alcohol","1/49","10/1957",0.2244351087159,0.630546971774242,0.571119656196988,"Zci_11373",1
"GO:1905958","GO:1905958","negative regulation of cellular response to alcohol","1/49","10/1957",0.2244351087159,0.630546971774242,0.571119656196988,"Zci_11373",1
"GO:0006974","GO:0006974","cellular response to DNA damage stimulus","3/49","66/1957",0.227394317855446,0.630546971774242,0.571119656196988,"Zci_12780/Zci_14646/Zci_15818",3
"GO:0009893","GO:0009893","positive regulation of metabolic process","4/49","98/1957",0.227872944312095,0.630546971774242,0.571119656196988,"Zci_09600/Zci_09282/Zci_02911/Zci_09224",4
"GO:0006979","GO:0006979","response to oxidative stress","3/49","67/1957",0.234118731808551,0.630546971774242,0.571119656196988,"Zci_04965/Zci_01168/Zci_03841",3
"GO:0043414","GO:0043414","macromolecule methylation","2/49","37/1957",0.236469008032183,0.630546971774242,0.571119656196988,"Zci_08094/Zci_09224",2
"GO:1903506","GO:1903506","regulation of nucleic acid-templated transcription","5/49","133/1957",0.236650968920586,0.630546971774242,0.571119656196988,"Zci_04296/Zci_08094/Zci_09313/Zci_02911/Zci_09224",5
"GO:2001141","GO:2001141","regulation of RNA biosynthetic process","5/49","133/1957",0.236650968920586,0.630546971774242,0.571119656196988,"Zci_04296/Zci_08094/Zci_09313/Zci_02911/Zci_09224",5
"GO:0048316","GO:0048316","seed development","3/49","68/1957",0.240881352037107,0.630546971774242,0.571119656196988,"Zci_02211/Zci_03841/Zci_04376",3
"GO:0003333","GO:0003333","amino acid transmembrane transport","1/49","11/1957",0.243953690982423,0.630546971774242,0.571119656196988,"Zci_10094",1
"GO:0006401","GO:0006401","RNA catabolic process","1/49","11/1957",0.243953690982423,0.630546971774242,0.571119656196988,"Zci_14063",1
"GO:0006767","GO:0006767","water-soluble vitamin metabolic process","1/49","11/1957",0.243953690982423,0.630546971774242,0.571119656196988,"Zci_10411",1
"GO:0006888","GO:0006888","endoplasmic reticulum to Golgi vesicle-mediated transport","1/49","11/1957",0.243953690982423,0.630546971774242,0.571119656196988,"Zci_03487",1
"GO:0016050","GO:0016050","vesicle organization","1/49","11/1957",0.243953690982423,0.630546971774242,0.571119656196988,"Zci_07386",1
"GO:0043094","GO:0043094","cellular metabolic compound salvage","1/49","11/1957",0.243953690982423,0.630546971774242,0.571119656196988,"Zci_10094",1
"GO:0045814","GO:0045814","negative regulation of gene expression, epigenetic","1/49","11/1957",0.243953690982423,0.630546971774242,0.571119656196988,"Zci_08094",1
"GO:0048511","GO:0048511","rhythmic process","1/49","11/1957",0.243953690982423,0.630546971774242,0.571119656196988,"Zci_09313",1
"GO:0009651","GO:0009651","response to salt stress","3/49","69/1957",0.247679229842613,0.63466664166789,0.574851058548639,"Zci_04296/Zci_01168/Zci_04108",3
"GO:0009409","GO:0009409","response to cold","3/49","70/1957",0.254509459046099,0.63466664166789,0.574851058548639,"Zci_11373/Zci_04108/Zci_09224",3
"GO:0009889","GO:0009889","regulation of biosynthetic process","6/49","172/1957",0.257152085046561,0.63466664166789,0.574851058548639,"Zci_04296/Zci_08094/Zci_09600/Zci_09313/Zci_02911/Zci_09224",6
"GO:0010154","GO:0010154","fruit development","3/49","71/1957",0.261369177533686,0.63466664166789,0.574851058548639,"Zci_02211/Zci_03841/Zci_04376",3
"GO:0000723","GO:0000723","telomere maintenance","1/49","12/1957",0.262990828259844,0.63466664166789,0.574851058548639,"Zci_12780",1
"GO:0006487","GO:0006487","protein N-linked glycosylation","1/49","12/1957",0.262990828259844,0.63466664166789,0.574851058548639,"Zci_11120",1
"GO:0006897","GO:0006897","endocytosis","1/49","12/1957",0.262990828259844,0.63466664166789,0.574851058548639,"Zci_02911",1
"GO:0007623","GO:0007623","circadian rhythm","1/49","12/1957",0.262990828259844,0.63466664166789,0.574851058548639,"Zci_09313",1
"GO:0009110","GO:0009110","vitamin biosynthetic process","1/49","12/1957",0.262990828259844,0.63466664166789,0.574851058548639,"Zci_10411",1
"GO:0022604","GO:0022604","regulation of cell morphogenesis","1/49","12/1957",0.262990828259844,0.63466664166789,0.574851058548639,"Zci_04376",1
"GO:0042548","GO:0042548","regulation of photosynthesis, light reaction","1/49","12/1957",0.262990828259844,0.63466664166789,0.574851058548639,"Zci_11373",1
"GO:0043467","GO:0043467","regulation of generation of precursor metabolites and energy","1/49","12/1957",0.262990828259844,0.63466664166789,0.574851058548639,"Zci_11373",1
"GO:0051656","GO:0051656","establishment of organelle localization","1/49","12/1957",0.262990828259844,0.63466664166789,0.574851058548639,"Zci_02911",1
"GO:0019439","GO:0019439","aromatic compound catabolic process","2/49","40/1957",0.264689146787335,0.635522672235581,0.575626410592815,"Zci_11986/Zci_14063",2
"GO:0019752","GO:0019752","carboxylic acid metabolic process","4/49","106/1957",0.272444942912514,0.635620782927485,0.575715274622202,"Zci_02791/Zci_10411/Zci_05289/Zci_11937",4
"GO:0033993","GO:0033993","response to lipid","4/49","106/1957",0.272444942912514,0.635620782927485,0.575715274622202,"Zci_11373/Zci_13243/Zci_04296/Zci_04108",4
"GO:1901700","GO:1901700","response to oxygen-containing compound","7/49","213/1957",0.280081447870384,0.635620782927485,0.575715274622202,"Zci_04965/Zci_11373/Zci_13243/Zci_04296/Zci_02211/Zci_14646/Zci_04108",7
"GO:0000724","GO:0000724","double-strand break repair via homologous recombination","1/49","13/1957",0.28155815443736,0.635620782927485,0.575715274622202,"Zci_14646",1
"GO:0031400","GO:0031400","negative regulation of protein modification process","1/49","13/1957",0.28155815443736,0.635620782927485,0.575715274622202,"Zci_11373",1
"GO:0043086","GO:0043086","negative regulation of catalytic activity","1/49","13/1957",0.28155815443736,0.635620782927485,0.575715274622202,"Zci_11373",1
"GO:0044272","GO:0044272","sulfur compound biosynthetic process","1/49","13/1957",0.28155815443736,0.635620782927485,0.575715274622202,"Zci_10411",1
"GO:0045944","GO:0045944","positive regulation of transcription by RNA polymerase II","1/49","13/1957",0.28155815443736,0.635620782927485,0.575715274622202,"Zci_09224",1
"GO:0006486","GO:0006486","protein glycosylation","2/49","42/1957",0.283536902035914,0.635620782927485,0.575715274622202,"Zci_09838/Zci_11120",2
"GO:0044270","GO:0044270","cellular nitrogen compound catabolic process","2/49","42/1957",0.283536902035914,0.635620782927485,0.575715274622202,"Zci_11986/Zci_14063",2
"GO:0006355","GO:0006355","regulation of transcription, DNA-templated","6/49","178/1957",0.283624446069474,0.635620782927485,0.575715274622202,"Zci_04296/Zci_13378/Zci_08094/Zci_09313/Zci_02911/Zci_09224",6
"GO:0006082","GO:0006082","organic acid metabolic process","4/49","109/1957",0.289586601828685,0.635620782927485,0.575715274622202,"Zci_02791/Zci_10411/Zci_05289/Zci_11937",4
"GO:0043436","GO:0043436","oxoacid metabolic process","4/49","109/1957",0.289586601828685,0.635620782927485,0.575715274622202,"Zci_02791/Zci_10411/Zci_05289/Zci_11937",4
"GO:0006357","GO:0006357","regulation of transcription by RNA polymerase II","2/49","43/1957",0.292953022262657,0.635620782927485,0.575715274622202,"Zci_02911/Zci_09224",2
"GO:0050794","GO:0050794","regulation of cellular process","13/49","439/1957",0.292998060123428,0.635620782927485,0.575715274622202,"Zci_11373/Zci_04296/Zci_08094/Zci_09600/Zci_09313/Zci_09282/Zci_02911/Zci_03841/Zci_14531/Zci_04108/Zci_09224/Zci_15818/Zci_04376",13
"GO:0000725","GO:0000725","recombinational repair","1/49","14/1957",0.299667028116665,0.635620782927485,0.575715274622202,"Zci_14646",1
"GO:0006650","GO:0006650","glycerophospholipid metabolic process","1/49","14/1957",0.299667028116665,0.635620782927485,0.575715274622202,"Zci_06450",1
"GO:0006766","GO:0006766","vitamin metabolic process","1/49","14/1957",0.299667028116665,0.635620782927485,0.575715274622202,"Zci_10411",1
"GO:0006778","GO:0006778","porphyrin-containing compound metabolic process","1/49","14/1957",0.299667028116665,0.635620782927485,0.575715274622202,"Zci_11986",1
"GO:0006865","GO:0006865","amino acid transport","1/49","14/1957",0.299667028116665,0.635620782927485,0.575715274622202,"Zci_10094",1
"GO:0015994","GO:0015994","chlorophyll metabolic process","1/49","14/1957",0.299667028116665,0.635620782927485,0.575715274622202,"Zci_11986",1
"GO:0031047","GO:0031047","gene silencing by RNA","1/49","14/1957",0.299667028116665,0.635620782927485,0.575715274622202,"Zci_09224",1
"GO:0033013","GO:0033013","tetrapyrrole metabolic process","1/49","14/1957",0.299667028116665,0.635620782927485,0.575715274622202,"Zci_11986",1
"GO:0048699","GO:0048699","generation of neurons","1/49","14/1957",0.299667028116665,0.635620782927485,0.575715274622202,"Zci_02911",1
"GO:0120036","GO:0120036","plasma membrane bounded cell projection organization","1/49","14/1957",0.299667028116665,0.635620782927485,0.575715274622202,"Zci_02911",1
"GO:0022607","GO:0022607","cellular component assembly","4/49","111/1957",0.301110452015485,0.635620782927485,0.575715274622202,"Zci_09282/Zci_14531/Zci_14063/Zci_09224",4
"GO:0006520","GO:0006520","cellular amino acid metabolic process","2/49","44/1957",0.302356609214977,0.635620782927485,0.575715274622202,"Zci_05289/Zci_11937",2
"GO:0046700","GO:0046700","heterocycle catabolic process","2/49","44/1957",0.302356609214977,0.635620782927485,0.575715274622202,"Zci_11986/Zci_14063",2
"GO:0071495","GO:0071495","cellular response to endogenous stimulus","3/49","78/1957",0.309982333501792,0.646310615470598,0.58539761988769,"Zci_11373/Zci_02911/Zci_04108",3
"GO:0007276","GO:0007276","gamete generation","1/49","15/1957",0.317328538987629,0.646310615470598,0.58539761988769,"Zci_02911",1
"GO:0010109","GO:0010109","regulation of photosynthesis","1/49","15/1957",0.317328538987629,0.646310615470598,0.58539761988769,"Zci_11373",1
"GO:0022008","GO:0022008","neurogenesis","1/49","15/1957",0.317328538987629,0.646310615470598,0.58539761988769,"Zci_02911",1
"GO:0022412","GO:0022412","cellular process involved in reproduction in multicellular organism","1/49","15/1957",0.317328538987629,0.646310615470598,0.58539761988769,"Zci_02911",1
"GO:0030030","GO:0030030","cell projection organization","1/49","15/1957",0.317328538987629,0.646310615470598,0.58539761988769,"Zci_02911",1
"GO:0051259","GO:0051259","protein complex oligomerization","1/49","15/1957",0.317328538987629,0.646310615470598,0.58539761988769,"Zci_09282",1
"GO:0009719","GO:0009719","response to endogenous stimulus","6/49","186/1957",0.31990139479763,0.646310615470598,0.58539761988769,"Zci_11373/Zci_13243/Zci_04296/Zci_01168/Zci_02911/Zci_04108",6
"GO:0071215","GO:0071215","cellular response to abscisic acid stimulus","2/49","46/1957",0.321105696903997,0.646310615470598,0.58539761988769,"Zci_11373/Zci_04108",2
"GO:0097306","GO:0097306","cellular response to alcohol","2/49","46/1957",0.321105696903997,0.646310615470598,0.58539761988769,"Zci_11373/Zci_04108",2
"GO:0032259","GO:0032259","methylation","2/49","47/1957",0.33044158762126,0.653900050207238,0.592271771301537,"Zci_08094/Zci_09224",2
"GO:0001558","GO:0001558","regulation of cell growth","1/49","16/1957",0.334553514059517,0.653900050207238,0.592271771301537,"Zci_04376",1
"GO:0009751","GO:0009751","response to salicylic acid","1/49","16/1957",0.334553514059517,0.653900050207238,0.592271771301537,"Zci_04296",1
"GO:0009787","GO:0009787","regulation of abscisic acid-activated signaling pathway","1/49","16/1957",0.334553514059517,0.653900050207238,0.592271771301537,"Zci_11373",1
"GO:0097659","GO:0097659","nucleic acid-templated transcription","1/49","16/1957",0.334553514059517,0.653900050207238,0.592271771301537,"Zci_09313",1
"GO:1901419","GO:1901419","regulation of response to alcohol","1/49","16/1957",0.334553514059517,0.653900050207238,0.592271771301537,"Zci_11373",1
"GO:1905957","GO:1905957","regulation of cellular response to alcohol","1/49","16/1957",0.334553514059517,0.653900050207238,0.592271771301537,"Zci_11373",1
"GO:1901361","GO:1901361","organic cyclic compound catabolic process","2/49","48/1957",0.339745706982679,0.661315717707026,0.598988532562056,"Zci_11986/Zci_14063",2
"GO:0009653","GO:0009653","anatomical structure morphogenesis","4/49","119/1957",0.347718554201524,0.662110532805587,0.59970843852648,"Zci_02911/Zci_02516/Zci_04108/Zci_03487",4
"GO:0046677","GO:0046677","response to antibiotic","2/49","49/1957",0.349013843046411,0.662110532805587,0.59970843852648,"Zci_04965/Zci_04296",2
"GO:0008654","GO:0008654","phospholipid biosynthetic process","1/49","17/1957",0.351352523750956,0.662110532805587,0.59970843852648,"Zci_06450",1
"GO:0009736","GO:0009736","cytokinin-activated signaling pathway","1/49","17/1957",0.351352523750956,0.662110532805587,0.59970843852648,"Zci_09313",1
"GO:0019318","GO:0019318","hexose metabolic process","1/49","17/1957",0.351352523750956,0.662110532805587,0.59970843852648,"Zci_11120",1
"GO:0045017","GO:0045017","glycerolipid biosynthetic process","1/49","17/1957",0.351352523750956,0.662110532805587,0.59970843852648,"Zci_06450",1
"GO:0060284","GO:0060284","regulation of cell development","1/49","17/1957",0.351352523750956,0.662110532805587,0.59970843852648,"Zci_04376",1
"GO:0098657","GO:0098657","import into cell","1/49","17/1957",0.351352523750956,0.662110532805587,0.59970843852648,"Zci_02911",1
"GO:0048522","GO:0048522","positive regulation of cellular process","4/49","121/1957",0.359442003472078,0.674666935088465,0.611081434474252,"Zci_09600/Zci_09282/Zci_02911/Zci_09224",4
"GO:1901701","GO:1901701","cellular response to oxygen-containing compound","3/49","86/1957",0.366005324170414,0.678888864044766,0.614905458253521,"Zci_11373/Zci_14646/Zci_04108",3
"GO:0007005","GO:0007005","mitochondrion organization","1/49","18/1957",0.367735887841783,0.678888864044766,0.614905458253521,"Zci_03044",1
"GO:0034599","GO:0034599","cellular response to oxidative stress","1/49","18/1957",0.367735887841783,0.678888864044766,0.614905458253521,"Zci_01168",1
"GO:0051640","GO:0051640","organelle localization","1/49","18/1957",0.367735887841783,0.678888864044766,0.614905458253521,"Zci_02911",1
"GO:0006839","GO:0006839","mitochondrial transport","1/49","19/1957",0.383713681289824,0.678888864044766,0.614905458253521,"Zci_10094",1
"GO:0006928","GO:0006928","movement of cell or subcellular component","1/49","19/1957",0.383713681289824,0.678888864044766,0.614905458253521,"Zci_02911",1
"GO:0007399","GO:0007399","nervous system development","1/49","19/1957",0.383713681289824,0.678888864044766,0.614905458253521,"Zci_02911",1
"GO:0032774","GO:0032774","RNA biosynthetic process","1/49","19/1957",0.383713681289824,0.678888864044766,0.614905458253521,"Zci_09313",1
"GO:0044092","GO:0044092","negative regulation of molecular function","1/49","19/1957",0.383713681289824,0.678888864044766,0.614905458253521,"Zci_11373",1
"GO:0045859","GO:0045859","regulation of protein kinase activity","1/49","19/1957",0.383713681289824,0.678888864044766,0.614905458253521,"Zci_11373",1
"GO:0010628","GO:0010628","positive regulation of gene expression","2/49","53/1957",0.385649915845059,0.678888864044766,0.614905458253521,"Zci_09282/Zci_09224",2
"GO:0016311","GO:0016311","dephosphorylation","2/49","53/1957",0.385649915845059,0.678888864044766,0.614905458253521,"Zci_11373/Zci_01267",2
"GO:0071396","GO:0071396","cellular response to lipid","2/49","53/1957",0.385649915845059,0.678888864044766,0.614905458253521,"Zci_11373/Zci_04108",2
"GO:2000241","GO:2000241","regulation of reproductive process","2/49","53/1957",0.385649915845059,0.678888864044766,0.614905458253521,"Zci_15818/Zci_04376",2
"GO:0044085","GO:0044085","cellular component biogenesis","5/49","164/1957",0.392773816559711,0.678888864044766,0.614905458253521,"Zci_09282/Zci_14531/Zci_14063/Zci_09224/Zci_03487",5
"GO:0009628","GO:0009628","response to abiotic stimulus","9/49","317/1957",0.397061016357358,0.678888864044766,0.614905458253521,"Zci_04965/Zci_11373/Zci_04296/Zci_01168/Zci_02211/Zci_12780/Zci_14646/Zci_04108/Zci_09224",9
"GO:0007165","GO:0007165","signal transduction","5/49","165/1957",0.397945176745105,0.678888864044766,0.614905458253521,"Zci_13031/Zci_11373/Zci_02911/Zci_03841/Zci_04108",5
"GO:0000226","GO:0000226","microtubule cytoskeleton organization","1/49","20/1957",0.399295739915624,0.678888864044766,0.614905458253521,"Zci_15818",1
"GO:0010087","GO:0010087","phloem or xylem histogenesis","1/49","20/1957",0.399295739915624,0.678888864044766,0.614905458253521,"Zci_06645",1
"GO:0043549","GO:0043549","regulation of kinase activity","1/49","20/1957",0.399295739915624,0.678888864044766,0.614905458253521,"Zci_11373",1
"GO:0050776","GO:0050776","regulation of immune response","1/49","20/1957",0.399295739915624,0.678888864044766,0.614905458253521,"Zci_02911",1
"GO:1903825","GO:1903825","organic acid transmembrane transport","1/49","20/1957",0.399295739915624,0.678888864044766,0.614905458253521,"Zci_10094",1
"GO:1905039","GO:1905039","carboxylic acid transmembrane transport","1/49","20/1957",0.399295739915624,0.678888864044766,0.614905458253521,"Zci_10094",1
"GO:0007178","GO:0007178","transmembrane receptor protein serine/threonine kinase signaling pathway","1/49","21/1957",0.414491665958026,0.678888864044766,0.614905458253521,"Zci_02911",1
"GO:0007346","GO:0007346","regulation of mitotic cell cycle","1/49","21/1957",0.414491665958026,0.678888864044766,0.614905458253521,"Zci_15818",1
"GO:0009723","GO:0009723","response to ethylene","1/49","21/1957",0.414491665958026,0.678888864044766,0.614905458253521,"Zci_04296",1
"GO:0015849","GO:0015849","organic acid transport","1/49","21/1957",0.414491665958026,0.678888864044766,0.614905458253521,"Zci_10094",1
"GO:0031329","GO:0031329","regulation of cellular catabolic process","1/49","21/1957",0.414491665958026,0.678888864044766,0.614905458253521,"Zci_09600",1
"GO:0046942","GO:0046942","carboxylic acid transport","1/49","21/1957",0.414491665958026,0.678888864044766,0.614905458253521,"Zci_10094",1
"GO:1902600","GO:1902600","proton transmembrane transport","1/49","21/1957",0.414491665958026,0.678888864044766,0.614905458253521,"Zci_10094",1
"GO:0009966","GO:0009966","regulation of signal transduction","2/49","57/1957",0.421427725131718,0.678888864044766,0.614905458253521,"Zci_11373/Zci_02911",2
"GO:0044283","GO:0044283","small molecule biosynthetic process","3/49","94/1957",0.42143701398443,0.678888864044766,0.614905458253521,"Zci_10411/Zci_05289/Zci_11937",3
"GO:0042221","GO:0042221","response to chemical","10/49","364/1957",0.428629499008478,0.678888864044766,0.614905458253521,"Zci_04965/Zci_11373/Zci_13243/Zci_04296/Zci_01168/Zci_02211/Zci_02911/Zci_14646/Zci_04108/Zci_04376",10
"GO:0007167","GO:0007167","enzyme-linked receptor protein signaling pathway","1/49","22/1957",0.42931083350351,0.678888864044766,0.614905458253521,"Zci_02911",1
"GO:0010053","GO:0010053","root epidermal cell differentiation","1/49","22/1957",0.42931083350351,0.678888864044766,0.614905458253521,"Zci_03487",1
"GO:0022603","GO:0022603","regulation of anatomical structure morphogenesis","1/49","22/1957",0.42931083350351,0.678888864044766,0.614905458253521,"Zci_04376",1
"GO:0042542","GO:0042542","response to hydrogen peroxide","1/49","22/1957",0.42931083350351,0.678888864044766,0.614905458253521,"Zci_04965",1
"GO:0046486","GO:0046486","glycerolipid metabolic process","1/49","22/1957",0.42931083350351,0.678888864044766,0.614905458253521,"Zci_06450",1
"GO:0048638","GO:0048638","regulation of developmental growth","1/49","22/1957",0.42931083350351,0.678888864044766,0.614905458253521,"Zci_04376",1
"GO:0051094","GO:0051094","positive regulation of developmental process","1/49","22/1957",0.42931083350351,0.678888864044766,0.614905458253521,"Zci_09282",1
"GO:1903046","GO:1903046","meiotic cell cycle process","1/49","22/1957",0.42931083350351,0.678888864044766,0.614905458253521,"Zci_06450",1
"GO:0046686","GO:0046686","response to cadmium ion","2/49","58/1957",0.43021654315426,0.678888864044766,0.614905458253521,"Zci_04965/Zci_04296",2
"GO:0051179","GO:0051179","localization","8/49","287/1957",0.431030310967161,0.678888864044766,0.614905458253521,"Zci_03184/Zci_10094/Zci_07386/Zci_02911/Zci_02516/Zci_14063/Zci_09224/Zci_03487",8
"GO:0006325","GO:0006325","chromatin organization","2/49","59/1957",0.438938212700644,0.678888864044766,0.614905458253521,"Zci_08094/Zci_15818",2
"GO:0033036","GO:0033036","macromolecule localization","3/49","97/1957",0.441876061722107,0.678888864044766,0.614905458253521,"Zci_02911/Zci_14063/Zci_09224",3
"GO:0044271","GO:0044271","cellular nitrogen compound biosynthetic process","3/49","97/1957",0.441876061722107,0.678888864044766,0.614905458253521,"Zci_09313/Zci_10411/Zci_11937",3
"GO:0009753","GO:0009753","response to jasmonic acid","1/49","23/1957",0.443762393792052,0.678888864044766,0.614905458253521,"Zci_04296",1
"GO:0009832","GO:0009832","plant-type cell wall biogenesis","1/49","23/1957",0.443762393792052,0.678888864044766,0.614905458253521,"Zci_03487",1
"GO:0040029","GO:0040029","regulation of gene expression, epigenetic","1/49","23/1957",0.443762393792052,0.678888864044766,0.614905458253521,"Zci_08094",1
"GO:0051338","GO:0051338","regulation of transferase activity","1/49","23/1957",0.443762393792052,0.678888864044766,0.614905458253521,"Zci_11373",1
"GO:0071103","GO:0071103","DNA conformation change","1/49","23/1957",0.443762393792052,0.678888864044766,0.614905458253521,"Zci_14646",1
"GO:0090627","GO:0090627","plant epidermal cell differentiation","1/49","23/1957",0.443762393792052,0.678888864044766,0.614905458253521,"Zci_03487",1
"GO:0043412","GO:0043412","macromolecule modification","8/49","291/1957",0.447362260922275,0.678888864044766,0.614905458253521,"Zci_11373/Zci_11120/Zci_01168/Zci_08094/Zci_02911/Zci_03841/Zci_09224/Zci_15818",8
"GO:0010646","GO:0010646","regulation of cell communication","2/49","60/1957",0.447590558268494,0.678888864044766,0.614905458253521,"Zci_11373/Zci_02911",2
"GO:0023051","GO:0023051","regulation of signaling","2/49","60/1957",0.447590558268494,0.678888864044766,0.614905458253521,"Zci_11373/Zci_02911",2
"GO:1901564","GO:1901564","organonitrogen compound metabolic process","12/49","448/1957",0.449547418693777,0.678888864044766,0.614905458253521,"Zci_11373/Zci_06450/Zci_11120/Zci_01168/Zci_11986/Zci_02791/Zci_02911/Zci_10411/Zci_05289/Zci_03841/Zci_15818/Zci_11937",12
"GO:0048731","GO:0048731","system development","6/49","214/1957",0.450726578676027,0.678888864044766,0.614905458253521,"Zci_11373/Zci_02211/Zci_02911/Zci_03841/Zci_03487/Zci_04376",6
"GO:0071310","GO:0071310","cellular response to organic substance","3/49","99/1957",0.45536213272593,0.678888864044766,0.614905458253521,"Zci_11373/Zci_02911/Zci_04108",3
"GO:0044265","GO:0044265","cellular macromolecule catabolic process","2/49","61/1957",0.456171550182857,0.678888864044766,0.614905458253521,"Zci_02911/Zci_14063",2
"GO:0005996","GO:0005996","monosaccharide metabolic process","1/49","24/1957",0.457855280402284,0.678888864044766,0.614905458253521,"Zci_11120",1
"GO:0006351","GO:0006351","transcription, DNA-templated","1/49","24/1957",0.457855280402284,0.678888864044766,0.614905458253521,"Zci_09313",1
"GO:0006644","GO:0006644","phospholipid metabolic process","1/49","24/1957",0.457855280402284,0.678888864044766,0.614905458253521,"Zci_06450",1
"GO:0007166","GO:0007166","cell surface receptor signaling pathway","1/49","24/1957",0.457855280402284,0.678888864044766,0.614905458253521,"Zci_02911",1
"GO:0009733","GO:0009733","response to auxin","1/49","24/1957",0.457855280402284,0.678888864044766,0.614905458253521,"Zci_04296",1
"GO:0044282","GO:0044282","small molecule catabolic process","1/49","24/1957",0.457855280402284,0.678888864044766,0.614905458253521,"Zci_11120",1
"GO:0051240","GO:0051240","positive regulation of multicellular organismal process","1/49","24/1957",0.457855280402284,0.678888864044766,0.614905458253521,"Zci_09282",1
"GO:0051321","GO:0051321","meiotic cell cycle","1/49","24/1957",0.457855280402284,0.678888864044766,0.614905458253521,"Zci_06450",1
"GO:0009755","GO:0009755","hormone-mediated signaling pathway","2/49","63/1957",0.473112049650624,0.699318748389829,0.633409882262513,"Zci_11373/Zci_04108",2
"GO:0007154","GO:0007154","cell communication","5/49","180/1957",0.474864210329655,0.699722029551174,0.633775155285029,"Zci_11373/Zci_02911/Zci_03841/Zci_14646/Zci_04108",5
"GO:0009725","GO:0009725","response to hormone","5/49","182/1957",0.484949890403209,0.702750836282313,0.636518505323025,"Zci_11373/Zci_13243/Zci_04296/Zci_01168/Zci_04108",5
"GO:0006605","GO:0006605","protein targeting","1/49","26/1957",0.484999708883008,0.702750836282313,0.636518505323025,"Zci_02911",1
"GO:0009894","GO:0009894","regulation of catabolic process","1/49","26/1957",0.484999708883008,0.702750836282313,0.636518505323025,"Zci_09600",1
"GO:0034655","GO:0034655","nucleobase-containing compound catabolic process","1/49","26/1957",0.484999708883008,0.702750836282313,0.636518505323025,"Zci_14063",1
"GO:0042440","GO:0042440","pigment metabolic process","1/49","26/1957",0.484999708883008,0.702750836282313,0.636518505323025,"Zci_11986",1
"GO:0006950","GO:0006950","response to stress","11/49","419/1957",0.485834087662403,0.702750836282313,0.636518505323025,"Zci_04965/Zci_11373/Zci_04296/Zci_01168/Zci_02211/Zci_12780/Zci_03841/Zci_14646/Zci_04108/Zci_09224/Zci_15818",11
"GO:0009968","GO:0009968","negative regulation of signal transduction","1/49","27/1957",0.498068074633776,0.713897573641746,0.646614693384201,"Zci_11373",1
"GO:0043413","GO:0043413","macromolecule glycosylation","1/49","27/1957",0.498068074633776,0.713897573641746,0.646614693384201,"Zci_11120",1
"GO:0080167","GO:0080167","response to karrikin","1/49","27/1957",0.498068074633776,0.713897573641746,0.646614693384201,"Zci_01168",1
"GO:0051716","GO:0051716","cellular response to stimulus","8/49","305/1957",0.504066557185917,0.714833738367478,0.64746262716271,"Zci_11373/Zci_01168/Zci_12780/Zci_02911/Zci_03841/Zci_14646/Zci_04108/Zci_15818",8
"GO:0022402","GO:0022402","cell cycle process","2/49","67/1957",0.506062396318592,0.714833738367478,0.64746262716271,"Zci_06450/Zci_15818",2
"GO:0001932","GO:0001932","regulation of protein phosphorylation","1/49","28/1957",0.510811424034266,0.714833738367478,0.64746262716271,"Zci_11373",1
"GO:0009743","GO:0009743","response to carbohydrate","1/49","28/1957",0.510811424034266,0.714833738367478,0.64746262716271,"Zci_02211",1
"GO:0010648","GO:0010648","negative regulation of cell communication","1/49","28/1957",0.510811424034266,0.714833738367478,0.64746262716271,"Zci_11373",1
"GO:0023057","GO:0023057","negative regulation of signaling","1/49","28/1957",0.510811424034266,0.714833738367478,0.64746262716271,"Zci_11373",1
"GO:0071669","GO:0071669","plant-type cell wall organization or biogenesis","1/49","28/1957",0.510811424034266,0.714833738367478,0.64746262716271,"Zci_03487",1
"GO:0071695","GO:0071695","anatomical structure maturation","1/49","28/1957",0.510811424034266,0.714833738367478,0.64746262716271,"Zci_02211",1
"GO:0022622","GO:0022622","root system development","2/49","68/1957",0.514098185539243,0.7152012992943,0.647795546484433,"Zci_11373/Zci_03487",2
"GO:0048364","GO:0048364","root development","2/49","68/1957",0.514098185539243,0.7152012992943,0.647795546484433,"Zci_11373/Zci_03487",2
"GO:0007017","GO:0007017","microtubule-based process","1/49","29/1957",0.52323767609353,0.723659125123508,0.655456245521905,"Zci_15818",1
"GO:0042325","GO:0042325","regulation of phosphorylation","1/49","29/1957",0.52323767609353,0.723659125123508,0.655456245521905,"Zci_11373",1
"GO:0044281","GO:0044281","small molecule metabolic process","5/49","191/1957",0.529547308933202,0.726614147434201,0.658132765117881,"Zci_11120/Zci_02791/Zci_10411/Zci_05289/Zci_11937",5
"GO:0007049","GO:0007049","cell cycle","2/49","70/1957",0.529919858749868,0.726614147434201,0.658132765117881,"Zci_06450/Zci_15818",2
"GO:0016310","GO:0016310","phosphorylation","4/49","151/1957",0.530941505751416,0.726614147434201,0.658132765117881,"Zci_13031/Zci_05289/Zci_03841/Zci_15818",4
"GO:0009644","GO:0009644","response to high light intensity","1/49","30/1957",0.535354560881609,0.726614147434201,0.658132765117881,"Zci_11373",1
"GO:0051052","GO:0051052","regulation of DNA metabolic process","1/49","30/1957",0.535354560881609,0.726614147434201,0.658132765117881,"Zci_02911",1
"GO:0072330","GO:0072330","monocarboxylic acid biosynthetic process","1/49","30/1957",0.535354560881609,0.726614147434201,0.658132765117881,"Zci_10411",1
"GO:0070727","GO:0070727","cellular macromolecule localization","2/49","71/1957",0.537703936466279,0.726614147434201,0.658132765117881,"Zci_02911/Zci_14063",2
"GO:0006511","GO:0006511","ubiquitin-dependent protein catabolic process","1/49","31/1957",0.547169623941704,0.726614147434201,0.658132765117881,"Zci_02911",1
"GO:0019941","GO:0019941","modification-dependent protein catabolic process","1/49","31/1957",0.547169623941704,0.726614147434201,0.658132765117881,"Zci_02911",1
"GO:0045087","GO:0045087","innate immune response","1/49","31/1957",0.547169623941704,0.726614147434201,0.658132765117881,"Zci_03841",1
"GO:0044249","GO:0044249","cellular biosynthetic process","7/49","276/1957",0.549001684713558,0.726614147434201,0.658132765117881,"Zci_06450/Zci_11120/Zci_09313/Zci_10411/Zci_05289/Zci_14646/Zci_11937",7
"GO:0048608","GO:0048608","reproductive structure development","3/49","114/1957",0.551874610454275,0.726614147434201,0.658132765117881,"Zci_02211/Zci_03841/Zci_04376",3
"GO:0061458","GO:0061458","reproductive system development","3/49","114/1957",0.551874610454275,0.726614147434201,0.658132765117881,"Zci_02211/Zci_03841/Zci_04376",3
"GO:0023052","GO:0023052","signaling","4/49","155/1957",0.552392185416219,0.726614147434201,0.658132765117881,"Zci_11373/Zci_02911/Zci_03841/Zci_04108",4
"GO:0033554","GO:0033554","cellular response to stress","4/49","155/1957",0.552392185416219,0.726614147434201,0.658132765117881,"Zci_01168/Zci_12780/Zci_14646/Zci_15818",4
"GO:0048518","GO:0048518","positive regulation of biological process","4/49","155/1957",0.552392185416219,0.726614147434201,0.658132765117881,"Zci_09600/Zci_09282/Zci_02911/Zci_09224",4
"GO:0006793","GO:0006793","phosphorus metabolic process","6/49","237/1957",0.555319999085445,0.726614147434201,0.658132765117881,"Zci_11373/Zci_06450/Zci_01267/Zci_05289/Zci_03841/Zci_15818",6
"GO:0000302","GO:0000302","response to reactive oxygen species","1/49","32/1957",0.558690230601546,0.726614147434201,0.658132765117881,"Zci_04965",1
"GO:0009101","GO:0009101","glycoprotein biosynthetic process","1/49","32/1957",0.558690230601546,0.726614147434201,0.658132765117881,"Zci_11120",1
"GO:0040008","GO:0040008","regulation of growth","1/49","32/1957",0.558690230601546,0.726614147434201,0.658132765117881,"Zci_04376",1
"GO:0032870","GO:0032870","cellular response to hormone stimulus","2/49","74/1957",0.560540243779203,0.726614147434201,0.658132765117881,"Zci_11373/Zci_04108",2
"GO:0006796","GO:0006796","phosphate-containing compound metabolic process","6/49","240/1957",0.568394802079234,0.726614147434201,0.658132765117881,"Zci_11373/Zci_06450/Zci_01267/Zci_05289/Zci_03841/Zci_15818",6
"GO:0006955","GO:0006955","immune response","1/49","33/1957",0.569923570186234,0.726614147434201,0.658132765117881,"Zci_03841",1
"GO:0019220","GO:0019220","regulation of phosphate metabolic process","1/49","33/1957",0.569923570186234,0.726614147434201,0.658132765117881,"Zci_11373",1
"GO:0021700","GO:0021700","developmental maturation","1/49","33/1957",0.569923570186234,0.726614147434201,0.658132765117881,"Zci_02211",1
"GO:0031668","GO:0031668","cellular response to extracellular stimulus","1/49","33/1957",0.569923570186234,0.726614147434201,0.658132765117881,"Zci_14646",1
"GO:0048646","GO:0048646","anatomical structure formation involved in morphogenesis","1/49","33/1957",0.569923570186234,0.726614147434201,0.658132765117881,"Zci_02911",1
"GO:0051174","GO:0051174","regulation of phosphorus metabolic process","1/49","33/1957",0.569923570186234,0.726614147434201,0.658132765117881,"Zci_11373",1
"GO:0071496","GO:0071496","cellular response to external stimulus","1/49","33/1957",0.569923570186234,0.726614147434201,0.658132765117881,"Zci_14646",1
"GO:0010015","GO:0010015","root morphogenesis","1/49","34/1957",0.580876660134713,0.730730479371594,0.661861144106462,"Zci_03487",1
"GO:0070085","GO:0070085","glycosylation","1/49","34/1957",0.580876660134713,0.730730479371594,0.661861144106462,"Zci_11120",1
"GO:0071214","GO:0071214","cellular response to abiotic stimulus","1/49","34/1957",0.580876660134713,0.730730479371594,0.661861144106462,"Zci_14646",1
"GO:0090558","GO:0090558","plant epidermis development","1/49","34/1957",0.580876660134713,0.730730479371594,0.661861144106462,"Zci_03487",1
"GO:0104004","GO:0104004","cellular response to environmental stimulus","1/49","34/1957",0.580876660134713,0.730730479371594,0.661861144106462,"Zci_14646",1
"GO:0034645","GO:0034645","cellular macromolecule biosynthetic process","3/49","120/1957",0.587725895994949,0.736331983053795,0.666934721493033,"Zci_11120/Zci_09313/Zci_14646",3
"GO:0006260","GO:0006260","DNA replication","1/49","35/1957",0.591556350022076,0.736331983053795,0.666934721493033,"Zci_14646",1
"GO:0016570","GO:0016570","histone modification","1/49","35/1957",0.591556350022076,0.736331983053795,0.666934721493033,"Zci_15818",1
"GO:0043632","GO:0043632","modification-dependent macromolecule catabolic process","1/49","35/1957",0.591556350022076,0.736331983053795,0.666934721493033,"Zci_02911",1
"GO:0010119","GO:0010119","regulation of stomatal movement","1/49","36/1957",0.601969325489776,0.743424258372491,0.673358569394912,"Zci_11373",1
"GO:0015711","GO:0015711","organic anion transport","1/49","36/1957",0.601969325489776,0.743424258372491,0.673358569394912,"Zci_10094",1
"GO:0072594","GO:0072594","establishment of protein localization to organelle","1/49","36/1957",0.601969325489776,0.743424258372491,0.673358569394912,"Zci_02911",1
"GO:0048583","GO:0048583","regulation of response to stimulus","3/49","124/1957",0.610637647252184,0.752035737705436,0.681158440516552,"Zci_11373/Zci_02911/Zci_09224",3
"GO:0051726","GO:0051726","regulation of cell cycle","1/49","37/1957",0.61212211208582,0.752035737705436,0.681158440516552,"Zci_15818",1
"GO:1901576","GO:1901576","organic substance biosynthetic process","7/49","293/1957",0.616858976087655,0.755891957744718,0.684651222437076,"Zci_06450/Zci_11120/Zci_09313/Zci_10411/Zci_05289/Zci_14646/Zci_11937",7
"GO:0006790","GO:0006790","sulfur compound metabolic process","1/49","38/1957",0.622021079016963,0.758288583440782,0.686821972761541,"Zci_10411",1
"GO:0009100","GO:0009100","glycoprotein metabolic process","1/49","38/1957",0.622021079016963,0.758288583440782,0.686821972761541,"Zci_11120",1
"GO:0010038","GO:0010038","response to metal ion","2/49","83/1957",0.624303406886327,0.75911442533993,0.687569981336045,"Zci_04965/Zci_04296",2
"GO:0006464","GO:0006464","cellular protein modification process","6/49","255/1957",0.631068671283361,0.761889231518283,0.690083269673843,"Zci_11373/Zci_11120/Zci_01168/Zci_02911/Zci_03841/Zci_15818",6
"GO:0006810","GO:0006810","transport","6/49","255/1957",0.631068671283361,0.761889231518283,0.690083269673843,"Zci_03184/Zci_10094/Zci_07386/Zci_02911/Zci_02516/Zci_03487",6
"GO:0036211","GO:0036211","protein modification process","6/49","256/1957",0.635071287528286,0.761889231518283,0.690083269673843,"Zci_11373/Zci_11120/Zci_01168/Zci_02911/Zci_03841/Zci_15818",6
"GO:0002376","GO:0002376","immune system process","1/49","40/1957",0.641082270918133,0.761889231518283,0.690083269673843,"Zci_03841",1
"GO:0009735","GO:0009735","response to cytokinin","1/49","40/1957",0.641082270918133,0.761889231518283,0.690083269673843,"Zci_01168",1
"GO:0014070","GO:0014070","response to organic cyclic compound","1/49","40/1957",0.641082270918133,0.761889231518283,0.690083269673843,"Zci_04296",1
"GO:0031399","GO:0031399","regulation of protein modification process","1/49","40/1957",0.641082270918133,0.761889231518283,0.690083269673843,"Zci_11373",1
"GO:0033365","GO:0033365","protein localization to organelle","1/49","40/1957",0.641082270918133,0.761889231518283,0.690083269673843,"Zci_02911",1
"GO:0070647","GO:0070647","protein modification by small protein conjugation or removal","1/49","40/1957",0.641082270918133,0.761889231518283,0.690083269673843,"Zci_02911",1
"GO:0009642","GO:0009642","response to light intensity","1/49","41/1957",0.650256485172181,0.764220610937803,0.69219492300364,"Zci_11373",1
"GO:0048584","GO:0048584","positive regulation of response to stimulus","1/49","41/1957",0.650256485172181,0.764220610937803,0.69219492300364,"Zci_09224",1
"GO:0018130","GO:0018130","heterocycle biosynthetic process","2/49","87/1957",0.650337106488484,0.764220610937803,0.69219492300364,"Zci_09313/Zci_10411",2
"GO:1901565","GO:1901565","organonitrogen compound catabolic process","2/49","88/1957",0.656624981900706,0.764220610937803,0.69219492300364,"Zci_11986/Zci_02911",2
"GO:0051234","GO:0051234","establishment of localization","6/49","262/1957",0.658586465804976,0.764220610937803,0.69219492300364,"Zci_03184/Zci_10094/Zci_07386/Zci_02911/Zci_02516/Zci_03487",6
"GO:0006508","GO:0006508","proteolysis","3/49","133/1957",0.659150269391194,0.764220610937803,0.69219492300364,"Zci_00455/Zci_02791/Zci_02911",3
"GO:0009059","GO:0009059","macromolecule biosynthetic process","3/49","133/1957",0.659150269391194,0.764220610937803,0.69219492300364,"Zci_11120/Zci_09313/Zci_14646",3
"GO:0009636","GO:0009636","response to toxic substance","1/49","42/1957",0.659200865248675,0.764220610937803,0.69219492300364,"Zci_04965",1
"GO:0009991","GO:0009991","response to extracellular stimulus","1/49","42/1957",0.659200865248675,0.764220610937803,0.69219492300364,"Zci_14646",1
"GO:0045893","GO:0045893","positive regulation of transcription, DNA-templated","1/49","42/1957",0.659200865248675,0.764220610937803,0.69219492300364,"Zci_09224",1
"GO:1902680","GO:1902680","positive regulation of RNA biosynthetic process","1/49","43/1957",0.667921051986438,0.768677999001424,0.696232214517813,"Zci_09224",1
"GO:1903047","GO:1903047","mitotic cell cycle process","1/49","43/1957",0.667921051986438,0.768677999001424,0.696232214517813,"Zci_15818",1
"GO:1903508","GO:1903508","positive regulation of nucleic acid-templated transcription","1/49","43/1957",0.667921051986438,0.768677999001424,0.696232214517813,"Zci_09224",1
"GO:0042546","GO:0042546","cell wall biogenesis","1/49","44/1957",0.676422550655541,0.772820933478433,0.699984688829914,"Zci_03487",1
"GO:0046777","GO:0046777","protein autophosphorylation","1/49","44/1957",0.676422550655541,0.772820933478433,0.699984688829914,"Zci_03841",1
"GO:1905392","GO:1905392","plant organ morphogenesis","1/49","44/1957",0.676422550655541,0.772820933478433,0.699984688829914,"Zci_03487",1
"GO:0009058","GO:0009058","biosynthetic process","7/49","310/1957",0.679343216407716,0.774287569544216,0.701313098485581,"Zci_06450/Zci_11120/Zci_09313/Zci_10411/Zci_05289/Zci_14646/Zci_11937",7
"GO:0000278","GO:0000278","mitotic cell cycle","1/49","45/1957",0.68471073414633,0.774804251797163,0.701781084859119,"Zci_15818",1
"GO:0032787","GO:0032787","monocarboxylic acid metabolic process","1/49","45/1957",0.68471073414633,0.774804251797163,0.701781084859119,"Zci_10411",1
"GO:0098662","GO:0098662","inorganic cation transmembrane transport","1/49","45/1957",0.68471073414633,0.774804251797163,0.701781084859119,"Zci_10094",1
"GO:0009555","GO:0009555","pollen development","1/49","46/1957",0.692790846085049,0.782076539852573,0.708367979793028,"Zci_06450",1
"GO:0051603","GO:0051603","proteolysis involved in cellular protein catabolic process","1/49","47/1957",0.70066800387774,0.78721132027119,0.713018821298262,"Zci_02911",1
"GO:0098656","GO:0098656","anion transmembrane transport","1/49","47/1957",0.70066800387774,0.78721132027119,0.713018821298262,"Zci_10094",1
"GO:0071705","GO:0071705","nitrogen compound transport","2/49","97/1957",0.709320047197553,0.795043560010528,0.720112894011983,"Zci_10094/Zci_02911",2
"GO:0044257","GO:0044257","cellular protein catabolic process","1/49","49/1957",0.715833313322301,0.800447180145268,0.725007237830475,"Zci_02911",1
"GO:0031328","GO:0031328","positive regulation of cellular biosynthetic process","1/49","50/1957",0.723131095108049,0.806700490533272,0.730671190935889,"Zci_09224",1
"GO:0010557","GO:0010557","positive regulation of macromolecule biosynthetic process","1/49","51/1957",0.73024518862651,0.812719939341975,0.736123323271801,"Zci_09224",1
"GO:0019538","GO:0019538","protein metabolic process","7/49","326/1957",0.732395101043411,0.813199255383881,0.736557465096783,"Zci_11373/Zci_11120/Zci_01168/Zci_02791/Zci_02911/Zci_03841/Zci_15818",7
"GO:0090407","GO:0090407","organophosphate biosynthetic process","1/49","52/1957",0.737180123441464,0.816595312383635,0.739633453076977,"Zci_06450",1
"GO:0098660","GO:0098660","inorganic ion transmembrane transport","1/49","53/1957",0.743940319741395,0.820184601670344,0.742884461733237,"Zci_10094",1
"GO:0051239","GO:0051239","regulation of multicellular organismal process","2/49","104/1957",0.745622365154858,0.820184601670344,0.742884461733237,"Zci_09282/Zci_04376",2
"GO:1901362","GO:1901362","organic cyclic compound biosynthetic process","2/49","104/1957",0.745622365154858,0.820184601670344,0.742884461733237,"Zci_09313/Zci_10411",2
"GO:0006820","GO:0006820","anion transport","1/49","54/1957",0.75053009092452,0.82366759398445,0.746039191613823,"Zci_10094",1
"GO:0030163","GO:0030163","protein catabolic process","1/49","55/1957",0.756953646124047,0.828794154205264,0.750682587652259,"Zci_02911",1
"GO:0006629","GO:0006629","lipid metabolic process","2/49","107/1957",0.759987124097451,0.829886755943166,0.751672214685364,"Zci_06450/Zci_13092",2
"GO:0048585","GO:0048585","negative regulation of response to stimulus","1/49","56/1957",0.763215092675004,0.829886755943166,0.751672214685364,"Zci_11373",1
"GO:0071554","GO:0071554","cell wall organization or biogenesis","1/49","56/1957",0.763215092675004,0.829886755943166,0.751672214685364,"Zci_03487",1
"GO:0099402","GO:0099402","plant organ development","2/49","109/1957",0.769180531668866,0.834455026328839,0.755809938168103,"Zci_11373/Zci_03487",2
"GO:0009891","GO:0009891","positive regulation of biosynthetic process","1/49","58/1957",0.77526759458311,0.839134032580803,0.7600479609667,"Zci_09224",1
"GO:0044267","GO:0044267","cellular protein metabolic process","6/49","299/1957",0.782967336520178,0.845533219575443,0.765844042210315,"Zci_11373/Zci_11120/Zci_01168/Zci_02911/Zci_03841/Zci_15818",6
"GO:0050790","GO:0050790","regulation of catalytic activity","1/49","60/1957",0.78671850955073,0.845722397767034,0.766015390878342,"Zci_11373",1
"GO:0098655","GO:0098655","cation transmembrane transport","1/49","60/1957",0.78671850955073,0.845722397767034,0.766015390878342,"Zci_10094",1
"GO:0009416","GO:0009416","response to light stimulus","2/49","114/1957",0.790868945331813,0.84779110153962,0.767889125017526,"Zci_11373/Zci_01168",2
"GO:0048229","GO:0048229","gametophyte development","1/49","61/1957",0.792227625540194,0.84779110153962,0.767889125017526,"Zci_06450",1
"GO:0015833","GO:0015833","peptide transport","1/49","62/1957",0.797597270238786,0.84932011139579,0.769274029905612,"Zci_02911",1
"GO:0034613","GO:0034613","cellular protein localization","1/49","62/1957",0.797597270238786,0.84932011139579,0.769274029905612,"Zci_02911",1
"GO:0050793","GO:0050793","regulation of developmental process","2/49","116/1957",0.799043233765596,0.84932011139579,0.769274029905612,"Zci_09282/Zci_04376",2
"GO:0006886","GO:0006886","intracellular protein transport","1/49","63/1957",0.802830902828918,0.849528002322323,0.769462327684845,"Zci_02911",1
"GO:0051128","GO:0051128","regulation of cellular component organization","1/49","63/1957",0.802830902828918,0.849528002322323,0.769462327684845,"Zci_04376",1
"GO:0034654","GO:0034654","nucleobase-containing compound biosynthetic process","1/49","64/1957",0.807931898479067,0.850671193166515,0.770497775940295,"Zci_09313",1
"GO:0045184","GO:0045184","establishment of protein localization","1/49","64/1957",0.807931898479067,0.850671193166515,0.770497775940295,"Zci_02911",1
"GO:0015031","GO:0015031","protein transport","1/49","65/1957",0.812903550340941,0.850671193166515,0.770497775940295,"Zci_02911",1
"GO:0035556","GO:0035556","intracellular signal transduction","1/49","65/1957",0.812903550340941,0.850671193166515,0.770497775940295,"Zci_04108",1
"GO:0042886","GO:0042886","amide transport","1/49","65/1957",0.812903550340941,0.850671193166515,0.770497775940295,"Zci_02911",1
"GO:0042592","GO:0042592","homeostatic process","1/49","66/1957",0.817749071500187,0.853852783266199,0.773379509935113,"Zci_12780",1
"GO:0009314","GO:0009314","response to radiation","2/49","123/1957",0.825520002292266,0.859793603422791,0.778760424152834,"Zci_11373/Zci_01168",2
"GO:0006812","GO:0006812","cation transport","1/49","68/1957",0.827074185110718,0.859793603422791,0.778760424152834,"Zci_10094",1
"GO:0009790","GO:0009790","embryo development","1/49","69/1957",0.831559820330186,0.861428232703223,0.780240994125318,"Zci_02911",1
"GO:0071702","GO:0071702","organic substance transport","2/49","125/1957",0.832502905931071,0.861428232703223,0.780240994125318,"Zci_10094/Zci_02911",2
"GO:0008104","GO:0008104","protein localization","1/49","70/1957",0.835931413976278,0.861428232703223,0.780240994125318,"Zci_02911",1
"GO:0008610","GO:0008610","lipid biosynthetic process","1/49","70/1957",0.835931413976278,0.861428232703223,0.780240994125318,"Zci_06450",1
"GO:0065008","GO:0065008","regulation of biological quality","2/49","128/1957",0.842517467581113,0.86632774383884,0.784678739829549,"Zci_09600/Zci_12780",2
"GO:1901137","GO:1901137","carbohydrate derivative biosynthetic process","1/49","75/1957",0.856175784492625,0.878462355889396,0.795669698112795,"Zci_11120",1
"GO:0019637","GO:0019637","organophosphate metabolic process","1/49","80/1957",0.87396694727527,0.894775684115158,0.810445540079825,"Zci_06450",1
"GO:0065009","GO:0065009","regulation of molecular function","1/49","85/1957",0.889596732297318,0.908810484614754,0.823157599283866,"Zci_11373",1
"GO:0044255","GO:0044255","cellular lipid metabolic process","1/49","88/1957",0.898045669662675,0.913495917742893,0.827401443243257,"Zci_06450",1
"GO:2000026","GO:2000026","regulation of multicellular organismal development","1/49","88/1957",0.898045669662675,0.913495917742893,0.827401443243257,"Zci_09282",1
"GO:0019438","GO:0019438","aromatic compound biosynthetic process","1/49","92/1957",0.908332277991128,0.921976754269964,0.835082984283689,"Zci_09313",1
"GO:0006468","GO:0006468","protein phosphorylation","2/49","160/1957",0.920522670671842,0.932349514406384,0.844478140343604,"Zci_03841/Zci_15818",2
"GO:0034220","GO:0034220","ion transmembrane transport","1/49","99/1957",0.923942291770445,0.933813470101326,0.845804122245999,"Zci_10094",1
"GO:0006811","GO:0006811","ion transport","1/49","111/1957",0.944863664707658,0.952922203425847,0.863111910079715,"Zci_10094",1
"GO:0006952","GO:0006952","defense response","1/49","113/1957",0.947752653460488,0.953802138482576,0.863908913680669,"Zci_03841",1
"GO:1901135","GO:1901135","carbohydrate derivative metabolic process","1/49","116/1957",0.951810153556468,0.955851810259468,0.86576540953734,"Zci_11120",1
"GO:0009605","GO:0009605","response to external stimulus","2/49","188/1957",0.957787174630196,0.959696716134986,0.869247943622876,"Zci_14646/Zci_04376",2
"GO:0055085","GO:0055085","transmembrane transport","2/49","190/1957",0.959696716134986,0.959696716134986,0.869247943622876,"Zci_10094/Zci_01492",2
