"","ID","Description","GeneRatio","BgRatio","pvalue","p.adjust","qvalue","geneID","Count"
"GO:0006997","GO:0006997","nucleus organization","2/12","33/5486",0.00223050362325076,0.235948458791083,0.199306690336847,"Me1_v2_0164240/Me1_v2_0180580",2
"GO:0001578","GO:0001578","microtubule bundle formation","1/12","10/5486",0.0216774147636132,0.235948458791083,0.199306690336847,"Me1_v2_0118110",1
"GO:0006458","GO:0006458","'de novo' protein folding","1/12","10/5486",0.0216774147636132,0.235948458791083,0.199306690336847,"Me1_v2_0216520",1
"GO:0016973","GO:0016973","poly(A)+ mRNA export from nucleus","1/12","10/5486",0.0216774147636132,0.235948458791083,0.199306690336847,"Me1_v2_0180580",1
"GO:0060271","GO:0060271","cilium assembly","1/12","10/5486",0.0216774147636132,0.235948458791083,0.199306690336847,"Me1_v2_0118110",1
"GO:0032879","GO:0032879","regulation of localization","2/12","110/5486",0.0230640114468379,0.235948458791083,0.199306690336847,"Me1_v2_0216520/Me1_v2_0118110",2
"GO:0032210","GO:0032210","regulation of telomere maintenance via telomerase","1/12","11/5486",0.0238212918678568,0.235948458791083,0.199306690336847,"Me1_v2_0216520",1
"GO:0032886","GO:0032886","regulation of microtubule-based process","1/12","11/5486",0.0238212918678568,0.235948458791083,0.199306690336847,"Me1_v2_0118110",1
"GO:0044782","GO:0044782","cilium organization","1/12","11/5486",0.0238212918678568,0.235948458791083,0.199306690336847,"Me1_v2_0118110",1
"GO:0048729","GO:0048729","tissue morphogenesis","1/12","11/5486",0.0238212918678568,0.235948458791083,0.199306690336847,"Me1_v2_0118110",1
"GO:2000573","GO:2000573","positive regulation of DNA biosynthetic process","1/12","11/5486",0.0238212918678568,0.235948458791083,0.199306690336847,"Me1_v2_0216520",1
"GO:0072359","GO:0072359","circulatory system development","1/12","12/5486",0.025960861639105,0.235948458791083,0.199306690336847,"Me1_v2_0118110",1
"GO:0120031","GO:0120031","plasma membrane bounded cell projection assembly","1/12","12/5486",0.025960861639105,0.235948458791083,0.199306690336847,"Me1_v2_0118110",1
"GO:1904356","GO:1904356","regulation of telomere maintenance via telomere lengthening","1/12","12/5486",0.025960861639105,0.235948458791083,0.199306690336847,"Me1_v2_0216520",1
"GO:0009887","GO:0009887","animal organ morphogenesis","1/12","13/5486",0.0280961319460707,0.235948458791083,0.199306690336847,"Me1_v2_0118110",1
"GO:0035239","GO:0035239","tube morphogenesis","1/12","13/5486",0.0280961319460707,0.235948458791083,0.199306690336847,"Me1_v2_0118110",1
"GO:0030031","GO:0030031","cell projection assembly","1/12","14/5486",0.0302271106445265,0.235948458791083,0.199306690336847,"Me1_v2_0118110",1
"GO:1903829","GO:1903829","positive regulation of protein localization","1/12","14/5486",0.0302271106445265,0.235948458791083,0.199306690336847,"Me1_v2_0216520",1
"GO:0046173","GO:0046173","polyol biosynthetic process","1/12","15/5486",0.0323538055773235,0.235948458791083,0.199306690336847,"Me1_v2_0067070",1
"GO:0046835","GO:0046835","carbohydrate phosphorylation","1/12","15/5486",0.0323538055773235,0.235948458791083,0.199306690336847,"Me1_v2_0208210",1
"GO:0060429","GO:0060429","epithelium development","1/12","16/5486",0.0344762245744122,0.235948458791083,0.199306690336847,"Me1_v2_0118110",1
"GO:0035295","GO:0035295","tube development","1/12","17/5486",0.0365943754528595,0.235948458791083,0.199306690336847,"Me1_v2_0118110",1
"GO:1904951","GO:1904951","positive regulation of establishment of protein localization","1/12","17/5486",0.0365943754528595,0.235948458791083,0.199306690336847,"Me1_v2_0216520",1
"GO:2000278","GO:2000278","regulation of DNA biosynthetic process","1/12","17/5486",0.0365943754528595,0.235948458791083,0.199306690336847,"Me1_v2_0216520",1
"GO:0032204","GO:0032204","regulation of telomere maintenance","1/12","18/5486",0.0387082660168684,0.235948458791083,0.199306690336847,"Me1_v2_0216520",1
"GO:0048598","GO:0048598","embryonic morphogenesis","1/12","18/5486",0.0387082660168684,0.235948458791083,0.199306690336847,"Me1_v2_0118110",1
"GO:0051270","GO:0051270","regulation of cellular component movement","1/12","20/5486",0.0429232973541767,0.235948458791083,0.199306690336847,"Me1_v2_0118110",1
"GO:0044262","GO:0044262","cellular carbohydrate metabolic process","2/12","156/5486",0.0439886939388739,0.235948458791083,0.199306690336847,"Me1_v2_0067070/Me1_v2_0208210",2
"GO:0050821","GO:0050821","protein stabilization","1/12","21/5486",0.0450244536717302,0.235948458791083,0.199306690336847,"Me1_v2_0216520",1
"GO:0120036","GO:0120036","plasma membrane bounded cell projection organization","1/12","22/5486",0.0471213807633937,0.235948458791083,0.199306690336847,"Me1_v2_0118110",1
"GO:0046165","GO:0046165","alcohol biosynthetic process","1/12","23/5486",0.0492140863693304,0.235948458791083,0.199306690336847,"Me1_v2_0067070",1
"GO:0061077","GO:0061077","chaperone-mediated protein folding","1/12","23/5486",0.0492140863693304,0.235948458791083,0.199306690336847,"Me1_v2_0216520",1
"GO:0030030","GO:0030030","cell projection organization","1/12","24/5486",0.0513025782169541,0.235948458791083,0.199306690336847,"Me1_v2_0118110",1
"GO:0031647","GO:0031647","regulation of protein stability","1/12","24/5486",0.0513025782169541,0.235948458791083,0.199306690336847,"Me1_v2_0216520",1
"GO:0070201","GO:0070201","regulation of establishment of protein localization","1/12","26/5486",0.0554669514832681,0.235948458791083,0.199306690336847,"Me1_v2_0216520",1
"GO:0016579","GO:0016579","protein deubiquitination","1/12","27/5486",0.0575428482931954,0.235948458791083,0.199306690336847,"Me1_v2_0158320",1
"GO:0019751","GO:0019751","polyol metabolic process","1/12","28/5486",0.0596145621273192,0.235948458791083,0.199306690336847,"Me1_v2_0067070",1
"GO:2001252","GO:2001252","positive regulation of chromosome organization","1/12","29/5486",0.0616821006495748,0.235948458791083,0.199306690336847,"Me1_v2_0216520",1
"GO:0006972","GO:0006972","hyperosmotic response","1/12","30/5486",0.0637454715112579,0.235948458791083,0.199306690336847,"Me1_v2_0226090",1
"GO:0007018","GO:0007018","microtubule-based movement","1/12","31/5486",0.0658046823510428,0.235948458791083,0.199306690336847,"Me1_v2_0118110",1
"GO:0051170","GO:0051170","import into nucleus","1/12","31/5486",0.0658046823510428,0.235948458791083,0.199306690336847,"Me1_v2_0180580",1
"GO:2000112","GO:2000112","regulation of cellular macromolecule biosynthetic process","3/12","443/5486",0.0664976903223376,0.235948458791083,0.199306690336847,"Me1_v2_0145260/Me1_v2_0216520/Me1_v2_0064720",3
"GO:0006606","GO:0006606","protein import into nucleus","1/12","32/5486",0.0678597407949998,0.235948458791083,0.199306690336847,"Me1_v2_0180580",1
"GO:0032880","GO:0032880","regulation of protein localization","1/12","32/5486",0.0678597407949998,0.235948458791083,0.199306690336847,"Me1_v2_0216520",1
"GO:0051054","GO:0051054","positive regulation of DNA metabolic process","1/12","32/5486",0.0678597407949998,0.235948458791083,0.199306690336847,"Me1_v2_0216520",1
"GO:0010556","GO:0010556","regulation of macromolecule biosynthetic process","3/12","452/5486",0.0698458141537408,0.235948458791083,0.199306690336847,"Me1_v2_0145260/Me1_v2_0216520/Me1_v2_0064720",3
"GO:0006406","GO:0006406","mRNA export from nucleus","1/12","33/5486",0.0699106544566173,0.235948458791083,0.199306690336847,"Me1_v2_0180580",1
"GO:0051028","GO:0051028","mRNA transport","1/12","33/5486",0.0699106544566173,0.235948458791083,0.199306690336847,"Me1_v2_0180580",1
"GO:0009790","GO:0009790","embryo development","2/12","206/5486",0.072311524433463,0.238446482701258,0.20141678200886,"Me1_v2_0164240/Me1_v2_0118110",2
"GO:0034504","GO:0034504","protein localization to nucleus","1/12","37/5486",0.0780730131100078,0.238446482701258,0.20141678200886,"Me1_v2_0180580",1
"GO:0051302","GO:0051302","regulation of cell division","1/12","37/5486",0.0780730131100078,0.238446482701258,0.20141678200886,"Me1_v2_0164240",1
"GO:0060341","GO:0060341","regulation of cellular localization","1/12","37/5486",0.0780730131100078,0.238446482701258,0.20141678200886,"Me1_v2_0216520",1
"GO:0019219","GO:0019219","regulation of nucleobase-containing compound metabolic process","3/12","480/5486",0.0807739661011576,0.238446482701258,0.20141678200886,"Me1_v2_0145260/Me1_v2_0216520/Me1_v2_0064720",3
"GO:0031326","GO:0031326","regulation of cellular biosynthetic process","3/12","487/5486",0.0836247069367321,0.238446482701258,0.20141678200886,"Me1_v2_0145260/Me1_v2_0216520/Me1_v2_0064720",3
"GO:0071166","GO:0071166","ribonucleoprotein complex localization","1/12","40/5486",0.0841516330811423,0.238446482701258,0.20141678200886,"Me1_v2_0180580",1
"GO:0010501","GO:0010501","RNA secondary structure unwinding","1/12","41/5486",0.0861696610655396,0.238446482701258,0.20141678200886,"Me1_v2_0226090",1
"GO:0048513","GO:0048513","animal organ development","1/12","43/5486",0.0901934940503565,0.238446482701258,0.20141678200886,"Me1_v2_0118110",1
"GO:0065003","GO:0065003","protein-containing complex assembly","2/12","234/5486",0.0902509415842105,0.238446482701258,0.20141678200886,"Me1_v2_0180580/Me1_v2_0118110",2
"GO:0006405","GO:0006405","RNA export from nucleus","1/12","44/5486",0.092199314015706,0.238446482701258,0.20141678200886,"Me1_v2_0180580",1
"GO:0006611","GO:0006611","protein export from nucleus","1/12","44/5486",0.092199314015706,0.238446482701258,0.20141678200886,"Me1_v2_0180580",1
"GO:0031503","GO:0031503","protein-containing complex localization","1/12","45/5486",0.094201079585682,0.238446482701258,0.20141678200886,"Me1_v2_0180580",1
"GO:0050657","GO:0050657","nucleic acid transport","1/12","45/5486",0.094201079585682,0.238446482701258,0.20141678200886,"Me1_v2_0180580",1
"GO:0050658","GO:0050658","RNA transport","1/12","45/5486",0.094201079585682,0.238446482701258,0.20141678200886,"Me1_v2_0180580",1
"GO:0051236","GO:0051236","establishment of RNA localization","1/12","45/5486",0.094201079585682,0.238446482701258,0.20141678200886,"Me1_v2_0180580",1
"GO:0006928","GO:0006928","movement of cell or subcellular component","1/12","49/5486",0.102167746758307,0.248120514769548,0.209588479012614,"Me1_v2_0118110",1
"GO:0051168","GO:0051168","nuclear export","1/12","49/5486",0.102167746758307,0.248120514769548,0.209588479012614,"Me1_v2_0180580",1
"GO:0006066","GO:0006066","alcohol metabolic process","1/12","50/5486",0.104149351878576,0.248120514769548,0.209588479012614,"Me1_v2_0067070",1
"GO:0006403","GO:0006403","RNA localization","1/12","50/5486",0.104149351878576,0.248120514769548,0.209588479012614,"Me1_v2_0180580",1
"GO:0009611","GO:0009611","response to wounding","1/12","52/5486",0.108100539885322,0.253801267556843,0.214387035623065,"Me1_v2_0145260",1
"GO:0005996","GO:0005996","monosaccharide metabolic process","1/12","53/5486",0.110070137515314,0.254733746821156,0.215174704917156,"Me1_v2_0208210",1
"GO:0043933","GO:0043933","protein-containing complex organization","2/12","268/5486",0.11368164211919,0.256494097790509,0.216661681044615,"Me1_v2_0180580/Me1_v2_0118110",2
"GO:0010638","GO:0010638","positive regulation of organelle organization","1/12","55/5486",0.113997376795782,0.256494097790509,0.216661681044615,"Me1_v2_0216520",1
"GO:1901617","GO:1901617","organic hydroxy compound biosynthetic process","1/12","61/5486",0.125683973841318,0.278915120031418,0.235600816140899,"Me1_v2_0067070",1
"GO:0003002","GO:0003002","regionalization","1/12","63/5486",0.129547993569503,0.283605067003506,0.239562434765795,"Me1_v2_0118110",1
"GO:0000226","GO:0000226","microtubule cytoskeleton organization","1/12","65/5486",0.133396353660573,0.284688026759586,0.240477215586395,"Me1_v2_0118110",1
"GO:0017038","GO:0017038","protein import","1/12","66/5486",0.135314679385729,0.284688026759586,0.240477215586395,"Me1_v2_0180580",1
"GO:0019953","GO:0019953","sexual reproduction","1/12","66/5486",0.135314679385729,0.284688026759586,0.240477215586395,"Me1_v2_0216520",1
"GO:0007389","GO:0007389","pattern specification process","1/12","70/5486",0.142949121261789,0.293136172714048,0.247613401252932,"Me1_v2_0118110",1
"GO:0051169","GO:0051169","nuclear transport","1/12","70/5486",0.142949121261789,0.293136172714048,0.247613401252932,"Me1_v2_0180580",1
"GO:0006913","GO:0006913","nucleocytoplasmic transport","1/12","71/5486",0.144848052307737,0.293317305923168,0.247766405263235,"Me1_v2_0180580",1
"GO:0034637","GO:0034637","cellular carbohydrate biosynthetic process","1/12","74/5486",0.150521729067823,0.293924454889777,0.248279266638538,"Me1_v2_0067070",1
"GO:0015931","GO:0015931","nucleobase-containing compound transport","1/12","75/5486",0.15240527290581,0.293924454889777,0.248279266638538,"Me1_v2_0180580",1
"GO:0033044","GO:0033044","regulation of chromosome organization","1/12","75/5486",0.15240527290581,0.293924454889777,0.248279266638538,"Me1_v2_0216520",1
"GO:0044703","GO:0044703","multi-organism reproductive process","1/12","75/5486",0.15240527290581,0.293924454889777,0.248279266638538,"Me1_v2_0216520",1
"GO:0070925","GO:0070925","organelle assembly","1/12","77/5486",0.156160880513573,0.297624266390575,0.251404513520304,"Me1_v2_0118110",1
"GO:0051130","GO:0051130","positive regulation of cellular component organization","1/12","79/5486",0.159901228489683,0.298054702477603,0.251768104756909,"Me1_v2_0216520",1
"GO:0005975","GO:0005975","carbohydrate metabolic process","2/12","330/5486",0.160066414293527,0.298054702477603,0.251768104756909,"Me1_v2_0067070/Me1_v2_0208210",2
"GO:0007017","GO:0007017","microtubule-based process","1/12","86/5486",0.172873089196735,0.318243641475808,0.26882178942076,"Me1_v2_0118110",1
"GO:0022607","GO:0022607","cellular component assembly","2/12","349/5486",0.175012629321428,0.318562314045745,0.269090973527919,"Me1_v2_0180580/Me1_v2_0118110",2
"GO:0016310","GO:0016310","phosphorylation","2/12","353/5486",0.178194273974088,0.320749693153358,0.270938662182824,"Me1_v2_0226090/Me1_v2_0208210",2
"GO:0046777","GO:0046777","protein autophosphorylation","1/12","91/5486",0.182026008629425,0.32372779288644,0.273454275992445,"Me1_v2_0226090",1
"GO:0051052","GO:0051052","regulation of DNA metabolic process","1/12","92/5486",0.183845413244151,0.32372779288644,0.273454275992445,"Me1_v2_0216520",1
"GO:0006457","GO:0006457","protein folding","1/12","95/5486",0.189281392693389,0.329715974369129,0.278512518960278,"Me1_v2_0216520",1
"GO:1903506","GO:1903506","regulation of nucleic acid-templated transcription","2/12","374/5486",0.1950744963405,0.331556188168549,0.280066955567975,"Me1_v2_0145260/Me1_v2_0064720",2
"GO:2001141","GO:2001141","regulation of RNA biosynthetic process","2/12","374/5486",0.1950744963405,0.331556188168549,0.280066955567975,"Me1_v2_0145260/Me1_v2_0064720",2
"GO:0016311","GO:0016311","dephosphorylation","1/12","99/5486",0.196477741136918,0.331556188168549,0.280066955567975,"Me1_v2_0067070",1
"GO:1901615","GO:1901615","organic hydroxy compound metabolic process","1/12","105/5486",0.207162527187993,0.345982777365515,0.292253158268466,"Me1_v2_0067070",1
"GO:0007010","GO:0007010","cytoskeleton organization","1/12","108/5486",0.212455935036217,0.351202668121093,0.296662422714374,"Me1_v2_0118110",1
"GO:0016051","GO:0016051","carbohydrate biosynthetic process","1/12","112/5486",0.219463420787182,0.359121961288115,0.303351884129012,"Me1_v2_0067070",1
"GO:0051252","GO:0051252","regulation of RNA metabolic process","2/12","417/5486",0.230386109656798,0.373225497644012,0.315265202688249,"Me1_v2_0145260/Me1_v2_0064720",2
"GO:0072594","GO:0072594","establishment of protein localization to organelle","1/12","121/5486",0.23502177911412,0.376965625905816,0.318424505313555,"Me1_v2_0180580",1
"GO:0033043","GO:0033043","regulation of organelle organization","1/12","139/5486",0.26528898117137,0.421341323036882,0.355908849868711,"Me1_v2_0216520",1
"GO:0033365","GO:0033365","protein localization to organelle","1/12","144/5486",0.273499489889801,0.430164246234444,0.363361611504078,"Me1_v2_0180580",1
"GO:0006355","GO:0006355","regulation of transcription, DNA-templated","2/12","480/5486",0.283207077556581,0.441149486193906,0.372640891521818,"Me1_v2_0145260/Me1_v2_0064720",2
"GO:0010557","GO:0010557","positive regulation of macromolecule biosynthetic process","1/12","153/5486",0.288066784830991,0.444445896596386,0.375425383739638,"Me1_v2_0216520",1
"GO:0031328","GO:0031328","positive regulation of cellular biosynthetic process","1/12","161/5486",0.300790194369873,0.459698221584145,0.388309089057432,"Me1_v2_0216520",1
"GO:0032787","GO:0032787","monocarboxylic acid metabolic process","1/12","164/5486",0.305507486056156,0.46254404430932,0.39071296790261,"Me1_v2_0208210",1
"GO:0009891","GO:0009891","positive regulation of biosynthetic process","1/12","168/5486",0.311751830093764,0.467627745140645,0.395007192126601,"Me1_v2_0216520",1
"GO:0046686","GO:0046686","response to cadmium ion","1/12","172/5486",0.317944669855014,0.472541619417543,0.399157963120732,"Me1_v2_0216520",1
"GO:0045935","GO:0045935","positive regulation of nucleobase-containing compound metabolic process","1/12","177/5486",0.325613880205359,0.477444945941773,0.403299824382264,"Me1_v2_0216520",1
"GO:0009793","GO:0009793","embryo development ending in seed dormancy","1/12","178/5486",0.327138203700844,0.477444945941773,0.403299824382264,"Me1_v2_0164240",1
"GO:0022622","GO:0022622","root system development","1/12","197/5486",0.355506891936847,0.507271959242818,0.428494832368852,"Me1_v2_0064720",1
"GO:0009651","GO:0009651","response to salt stress","1/12","198/5486",0.356969156504205,0.507271959242818,0.428494832368852,"Me1_v2_0226090",1
"GO:0048364","GO:0048364","root development","1/12","198/5486",0.356969156504205,0.507271959242818,0.428494832368852,"Me1_v2_0064720",1
"GO:0010629","GO:0010629","negative regulation of gene expression","1/12","201/5486",0.361337722555145,0.509014878729857,0.429967084047312,"Me1_v2_0145260",1
"GO:0015833","GO:0015833","peptide transport","1/12","205/5486",0.367120160254892,0.512702292769763,0.433081858739891,"Me1_v2_0180580",1
"GO:0042886","GO:0042886","amide transport","1/12","208/5486",0.371425450581425,0.513576286990053,0.433820125462683,"Me1_v2_0180580",1
"GO:0045184","GO:0045184","establishment of protein localization","1/12","211/5486",0.375703878714873,0.513576286990053,0.433820125462683,"Me1_v2_0180580",1
"GO:0009888","GO:0009888","tissue development","1/12","215/5486",0.381366927311515,0.513576286990053,0.433820125462683,"Me1_v2_0118110",1
"GO:0006886","GO:0006886","intracellular protein transport","1/12","216/5486",0.382775312223726,0.513576286990053,0.433820125462683,"Me1_v2_0180580",1
"GO:0006970","GO:0006970","response to osmotic stress","1/12","220/5486",0.38837951058882,0.513576286990053,0.433820125462683,"Me1_v2_0226090",1
"GO:0015031","GO:0015031","protein transport","1/12","223/5486",0.392552006700488,0.513576286990053,0.433820125462683,"Me1_v2_0180580",1
"GO:0009737","GO:0009737","response to abscisic acid","1/12","224/5486",0.393937029675899,0.513576286990053,0.433820125462683,"Me1_v2_0145260",1
"GO:0051128","GO:0051128","regulation of cellular component organization","1/12","224/5486",0.393937029675899,0.513576286990053,0.433820125462683,"Me1_v2_0216520",1
"GO:0097305","GO:0097305","response to alcohol","1/12","226/5486",0.39669839512514,0.513576286990053,0.433820125462683,"Me1_v2_0145260",1
"GO:0034613","GO:0034613","cellular protein localization","1/12","228/5486",0.399448223214486,0.513576286990053,0.433820125462683,"Me1_v2_0180580",1
"GO:0051173","GO:0051173","positive regulation of nitrogen compound metabolic process","1/12","240/5486",0.415707351707944,0.52321277458385,0.441960108485383,"Me1_v2_0216520",1
"GO:0048316","GO:0048316","seed development","1/12","241/5486",0.417043896080705,0.52321277458385,0.441960108485383,"Me1_v2_0164240",1
"GO:0070727","GO:0070727","cellular macromolecule localization","1/12","243/5486",0.419708581026709,0.52321277458385,0.441960108485383,"Me1_v2_0180580",1
"GO:0010038","GO:0010038","response to metal ion","1/12","244/5486",0.421036732281273,0.52321277458385,0.441960108485383,"Me1_v2_0216520",1
"GO:0008104","GO:0008104","protein localization","1/12","246/5486",0.423684678988097,0.52321277458385,0.441960108485383,"Me1_v2_0180580",1
"GO:0010154","GO:0010154","fruit development","1/12","248/5486",0.426321520031285,0.52321277458385,0.441960108485383,"Me1_v2_0164240",1
"GO:0046907","GO:0046907","intracellular transport","1/12","255/5486",0.435463616837922,0.530414330283785,0.44804329393692,"Me1_v2_0180580",1
"GO:0010604","GO:0010604","positive regulation of macromolecule metabolic process","1/12","261/5486",0.443193197951087,0.535800731851314,0.452593210790583,"Me1_v2_0216520",1
"GO:0033993","GO:0033993","response to lipid","1/12","269/5486",0.453348416190259,0.538556364651284,0.4549209058133,"Me1_v2_0145260",1
"GO:0071705","GO:0071705","nitrogen compound transport","1/12","270/5486",0.454605809137492,0.538556364651284,0.4549209058133,"Me1_v2_0180580",1
"GO:0031325","GO:0031325","positive regulation of cellular metabolic process","1/12","271/5486",0.455860550374139,0.538556364651284,0.4549209058133,"Me1_v2_0216520",1
"GO:0051649","GO:0051649","establishment of localization in cell","1/12","275/5486",0.460853099778804,0.538556364651284,0.4549209058133,"Me1_v2_0180580",1
"GO:0044283","GO:0044283","small molecule biosynthetic process","1/12","276/5486",0.462094658558818,0.538556364651284,0.4549209058133,"Me1_v2_0067070",1
"GO:0010605","GO:0010605","negative regulation of macromolecule metabolic process","1/12","279/5486",0.465803627019527,0.539001339836881,0.455296778289763,"Me1_v2_0145260",1
"GO:0006468","GO:0006468","protein phosphorylation","1/12","291/5486",0.480406282588663,0.55195615446357,0.466239766603405,"Me1_v2_0226090",1
"GO:0009893","GO:0009893","positive regulation of metabolic process","1/12","297/5486",0.487569551445694,0.556241319254947,0.469859463958045,"Me1_v2_0216520",1
"GO:0033036","GO:0033036","macromolecule localization","1/12","306/5486",0.49814485085148,0.564331928936641,0.476693637178449,"Me1_v2_0180580",1
"GO:0009892","GO:0009892","negative regulation of metabolic process","1/12","311/5486",0.503933199345676,0.566924849263885,0.47888388826709,"Me1_v2_0145260",1
"GO:0099402","GO:0099402","plant organ development","1/12","322/5486",0.5164527692957,0.577002404316575,0.487396442892494,"Me1_v2_0064720",1
"GO:0009653","GO:0009653","anatomical structure morphogenesis","1/12","328/5486",0.523158896249791,0.58049137803059,0.490343594177886,"Me1_v2_0118110",1
"GO:0051641","GO:0051641","cellular localization","1/12","341/5486",0.537397348190407,0.592233812291469,0.50026247951846,"Me1_v2_0180580",1
"GO:0071702","GO:0071702","organic substance transport","1/12","345/5486",0.541699349082918,0.592941179401572,0.50085999559587,"Me1_v2_0180580",1
"GO:0048608","GO:0048608","reproductive structure development","1/12","377/5486",0.574817789111417,0.62080321224033,0.524395176031468,"Me1_v2_0164240",1
"GO:0061458","GO:0061458","reproductive system development","1/12","377/5486",0.574817789111417,0.62080321224033,0.524395176031468,"Me1_v2_0164240",1
"GO:0065008","GO:0065008","regulation of biological quality","1/12","383/5486",0.580777612304755,0.621085765807742,0.524633850259951,"Me1_v2_0216520",1
"GO:0019752","GO:0019752","carboxylic acid metabolic process","1/12","385/5486",0.582747138288746,0.621085765807742,0.524633850259951,"Me1_v2_0208210",1
"GO:0043436","GO:0043436","oxoacid metabolic process","1/12","395/5486",0.592468153826777,0.62120837559323,0.524737419279532,"Me1_v2_0208210",1
"GO:0006082","GO:0006082","organic acid metabolic process","1/12","396/5486",0.593428747453584,0.62120837559323,0.524737419279532,"Me1_v2_0208210",1
"GO:0010035","GO:0010035","response to inorganic substance","1/12","400/5486",0.597250403326665,0.62120837559323,0.524737419279532,"Me1_v2_0216520",1
"GO:0001101","GO:0001101","response to acid chemical","1/12","401/5486",0.598200657978666,0.62120837559323,0.524737419279532,"Me1_v2_0145260",1
"GO:0048522","GO:0048522","positive regulation of cellular process","1/12","408/5486",0.604795109253161,0.624056099993708,0.527142904478116,"Me1_v2_0216520",1
"GO:0055085","GO:0055085","transmembrane transport","1/12","416/5486",0.612210055253425,0.627709043994018,0.530228562178183,"Me1_v2_0086570",1
"GO:0003006","GO:0003006","developmental process involved in reproduction","1/12","444/5486",0.637169586197607,0.649191653861713,0.548375016257457,"Me1_v2_0164240",1
"GO:0009725","GO:0009725","response to hormone","1/12","468/5486",0.657381948844144,0.661465066538828,0.558742421377827,"Me1_v2_0145260",1
"GO:0009791","GO:0009791","post-embryonic development","1/12","468/5486",0.657381948844144,0.661465066538828,0.558742421377827,"Me1_v2_0164240",1
"GO:0009719","GO:0009719","response to endogenous stimulus","1/12","480/5486",0.667096174095316,0.667096174095316,0.563499042445686,"Me1_v2_0145260",1
