"","ID","Description","GeneRatio","BgRatio","pvalue","p.adjust","qvalue","geneID","Count"
"GO:0006325","GO:0006325","chromatin organization","6/46","59/1957",0.00212776692930719,0.524066706888199,0.50989590264593,"Zci_12385/Zci_11436/Zci_09644/Zci_02300/Zci_12855/Zci_05011",6
"GO:0090501","GO:0090501","RNA phosphodiester bond hydrolysis","3/46","15/1957",0.00453887249251764,0.524066706888199,0.50989590264593,"Zci_07025/Zci_11041/Zci_09385",3
"GO:0070727","GO:0070727","cellular macromolecule localization","6/46","71/1957",0.00546584703110249,0.524066706888199,0.50989590264593,"Zci_07865/Zci_07025/Zci_03755/Zci_13818/Zci_09678/Zci_02768",6
"GO:0033036","GO:0033036","macromolecule localization","7/46","97/1957",0.00644311296673002,0.524066706888199,0.50989590264593,"Zci_07865/Zci_07025/Zci_03755/Zci_13818/Zci_09678/Zci_02768/Zci_08079",7
"GO:0016570","GO:0016570","histone modification","4/46","35/1957",0.00821176818836685,0.524066706888199,0.50989590264593,"Zci_12385/Zci_09644/Zci_02300/Zci_05011",4
"GO:2000113","GO:2000113","negative regulation of cellular macromolecule biosynthetic process","4/46","36/1957",0.00908110794852499,0.524066706888199,0.50989590264593,"Zci_00238/Zci_07025/Zci_12855/Zci_05011",4
"GO:0009890","GO:0009890","negative regulation of biosynthetic process","4/46","38/1957",0.0109961473398668,0.524066706888199,0.50989590264593,"Zci_00238/Zci_07025/Zci_12855/Zci_05011",4
"GO:0010558","GO:0010558","negative regulation of macromolecule biosynthetic process","4/46","38/1957",0.0109961473398668,0.524066706888199,0.50989590264593,"Zci_00238/Zci_07025/Zci_12855/Zci_05011",4
"GO:0031327","GO:0031327","negative regulation of cellular biosynthetic process","4/46","38/1957",0.0109961473398668,0.524066706888199,0.50989590264593,"Zci_00238/Zci_07025/Zci_12855/Zci_05011",4
"GO:0016072","GO:0016072","rRNA metabolic process","3/46","21/1957",0.0120198785983532,0.524066706888199,0.50989590264593,"Zci_07025/Zci_09385/Zci_15170",3
"GO:0034613","GO:0034613","cellular protein localization","5/46","62/1957",0.0136698557224466,0.541823372271521,0.527172426425454,"Zci_07865/Zci_03755/Zci_13818/Zci_09678/Zci_02768",5
"GO:0090304","GO:0090304","nucleic acid metabolic process","10/46","206/1957",0.0182515496696687,0.605603631523386,0.589228062539653,"Zci_07025/Zci_12414/Zci_11436/Zci_11041/Zci_09644/Zci_15426/Zci_09385/Zci_02300/Zci_12855/Zci_15170",10
"GO:0008104","GO:0008104","protein localization","5/46","70/1957",0.0222292518280182,0.605603631523386,0.589228062539653,"Zci_07865/Zci_03755/Zci_13818/Zci_09678/Zci_02768",5
"GO:0051254","GO:0051254","positive regulation of RNA metabolic process","4/46","47/1957",0.0227807881963055,0.605603631523386,0.589228062539653,"Zci_00238/Zci_12414/Zci_12855/Zci_15170",4
"GO:0010556","GO:0010556","regulation of macromolecule biosynthetic process","8/46","153/1957",0.023459689346715,0.605603631523386,0.589228062539653,"Zci_00238/Zci_12385/Zci_07025/Zci_12414/Zci_12402/Zci_12855/Zci_15170/Zci_05011",8
"GO:0016070","GO:0016070","RNA metabolic process","7/46","125/1957",0.0242732070108733,0.605603631523386,0.589228062539653,"Zci_07025/Zci_12414/Zci_11041/Zci_15426/Zci_09385/Zci_02300/Zci_15170",7
"GO:0010639","GO:0010639","negative regulation of organelle organization","2/46","11/1957",0.0259806609017759,0.605603631523386,0.589228062539653,"Zci_07025/Zci_12855",2
"GO:0006364","GO:0006364","rRNA processing","3/46","28/1957",0.0264014573586487,0.605603631523386,0.589228062539653,"Zci_07025/Zci_09385/Zci_15170",3
"GO:0042254","GO:0042254","ribosome biogenesis","3/46","30/1957",0.031669957400916,0.605603631523386,0.589228062539653,"Zci_07025/Zci_09385/Zci_15170",3
"GO:0031326","GO:0031326","regulation of cellular biosynthetic process","8/46","163/1957",0.0329286032262544,0.605603631523386,0.589228062539653,"Zci_00238/Zci_12385/Zci_07025/Zci_12414/Zci_12402/Zci_12855/Zci_15170/Zci_05011",8
"GO:0051641","GO:0051641","cellular localization","6/46","106/1957",0.0350210190632926,0.605603631523386,0.589228062539653,"Zci_07865/Zci_07025/Zci_03755/Zci_13818/Zci_09678/Zci_02768",6
"GO:0034470","GO:0034470","ncRNA processing","3/46","32/1957",0.0374512287204363,0.605603631523386,0.589228062539653,"Zci_07025/Zci_09385/Zci_15170",3
"GO:0045935","GO:0045935","positive regulation of nucleobase-containing compound metabolic process","4/46","55/1957",0.0380122891885235,0.605603631523386,0.589228062539653,"Zci_00238/Zci_12414/Zci_12855/Zci_15170",4
"GO:0006403","GO:0006403","RNA localization","2/46","14/1957",0.0411094995590479,0.605603631523386,0.589228062539653,"Zci_07865/Zci_07025",2
"GO:0051129","GO:0051129","negative regulation of cellular component organization","2/46","14/1957",0.0411094995590479,0.605603631523386,0.589228062539653,"Zci_07025/Zci_12855",2
"GO:0009057","GO:0009057","macromolecule catabolic process","5/46","83/1957",0.0425106811537347,0.605603631523386,0.589228062539653,"Zci_06970/Zci_07025/Zci_13261/Zci_09644/Zci_11175",5
"GO:0009889","GO:0009889","regulation of biosynthetic process","8/46","172/1957",0.0434830885562864,0.605603631523386,0.589228062539653,"Zci_00238/Zci_12385/Zci_07025/Zci_12414/Zci_12402/Zci_12855/Zci_15170/Zci_05011",8
"GO:0009908","GO:0009908","flower development","3/46","34/1957",0.0437385938420322,0.605603631523386,0.589228062539653,"Zci_13095/Zci_07865/Zci_06303",3
"GO:0010629","GO:0010629","negative regulation of gene expression","4/46","58/1957",0.0449388556725702,0.605603631523386,0.589228062539653,"Zci_00238/Zci_07025/Zci_12855/Zci_05011",4
"GO:0033043","GO:0033043","regulation of organelle organization","3/46","35/1957",0.0470692337470633,0.605603631523386,0.589228062539653,"Zci_07025/Zci_13818/Zci_12855",3
"GO:0043632","GO:0043632","modification-dependent macromolecule catabolic process","3/46","35/1957",0.0470692337470633,0.605603631523386,0.589228062539653,"Zci_07025/Zci_09644/Zci_11175",3
"GO:0090567","GO:0090567","reproductive shoot system development","3/46","35/1957",0.0470692337470633,0.605603631523386,0.589228062539653,"Zci_13095/Zci_07865/Zci_06303",3
"GO:0006396","GO:0006396","RNA processing","5/46","86/1957",0.0483983893934089,0.605603631523386,0.589228062539653,"Zci_07025/Zci_12414/Zci_11041/Zci_09385/Zci_15170",5
"GO:0034660","GO:0034660","ncRNA metabolic process","3/46","37/1957",0.0540974605470996,0.605603631523386,0.589228062539653,"Zci_07025/Zci_09385/Zci_15170",3
"GO:0015833","GO:0015833","peptide transport","4/46","62/1957",0.0552150742962022,0.605603631523386,0.589228062539653,"Zci_07865/Zci_03755/Zci_13818/Zci_02768",4
"GO:0010467","GO:0010467","gene expression","6/46","119/1957",0.056627131436141,0.605603631523386,0.589228062539653,"Zci_07025/Zci_12414/Zci_11041/Zci_09385/Zci_02300/Zci_15170",6
"GO:0048523","GO:0048523","negative regulation of cellular process","6/46","119/1957",0.056627131436141,0.605603631523386,0.589228062539653,"Zci_00238/Zci_10415/Zci_07025/Zci_11436/Zci_12855/Zci_05011",6
"GO:0009056","GO:0009056","catabolic process","7/46","150/1957",0.0573383532844716,0.605603631523386,0.589228062539653,"Zci_06970/Zci_05395/Zci_07025/Zci_13261/Zci_09644/Zci_11175/Zci_12402",7
"GO:2000112","GO:2000112","regulation of cellular macromolecule biosynthetic process","7/46","150/1957",0.0573383532844716,0.605603631523386,0.589228062539653,"Zci_00238/Zci_12385/Zci_07025/Zci_12402/Zci_12855/Zci_15170/Zci_05011",7
"GO:0006886","GO:0006886","intracellular protein transport","4/46","63/1957",0.0579692727673678,0.605603631523386,0.589228062539653,"Zci_07865/Zci_03755/Zci_13818/Zci_02768",4
"GO:0045184","GO:0045184","establishment of protein localization","4/46","64/1957",0.0607970522536555,0.605603631523386,0.589228062539653,"Zci_07865/Zci_03755/Zci_13818/Zci_02768",4
"GO:0048367","GO:0048367","shoot system development","4/46","64/1957",0.0607970522536555,0.605603631523386,0.589228062539653,"Zci_13095/Zci_00238/Zci_07865/Zci_06303",4
"GO:0015031","GO:0015031","protein transport","4/46","65/1957",0.0636980773336618,0.605603631523386,0.589228062539653,"Zci_07865/Zci_03755/Zci_13818/Zci_02768",4
"GO:0042886","GO:0042886","amide transport","4/46","65/1957",0.0636980773336618,0.605603631523386,0.589228062539653,"Zci_07865/Zci_03755/Zci_13818/Zci_02768",4
"GO:0051172","GO:0051172","negative regulation of nitrogen compound metabolic process","4/46","65/1957",0.0636980773336618,0.605603631523386,0.589228062539653,"Zci_00238/Zci_07025/Zci_12855/Zci_05011",4
"GO:0007005","GO:0007005","mitochondrion organization","2/46","18/1957",0.0651468717836964,0.605603631523386,0.589228062539653,"Zci_03755/Zci_02768",2
"GO:0033365","GO:0033365","protein localization to organelle","3/46","40/1957",0.0655323620561577,0.605603631523386,0.589228062539653,"Zci_03755/Zci_09678/Zci_02768",3
"GO:0031324","GO:0031324","negative regulation of cellular metabolic process","4/46","66/1957",0.0666719594337672,0.605603631523386,0.589228062539653,"Zci_00238/Zci_07025/Zci_12855/Zci_05011",4
"GO:0022613","GO:0022613","ribonucleoprotein complex biogenesis","3/46","41/1957",0.0695746019927759,0.619071968752047,0.602332214889123,"Zci_07025/Zci_09385/Zci_15170",3
"GO:0006839","GO:0006839","mitochondrial transport","2/46","19/1957",0.071746512697349,0.619927586697541,0.603164696859268,"Zci_03755/Zci_02768",2
"GO:0051276","GO:0051276","chromosome organization","5/46","97/1957",0.0739995047358848,0.619927586697541,0.603164696859268,"Zci_12385/Zci_09644/Zci_02300/Zci_12855/Zci_05011",5
"GO:0090305","GO:0090305","nucleic acid phosphodiester bond hydrolysis","3/46","43/1957",0.0779926948475917,0.619927586697541,0.603164696859268,"Zci_07025/Zci_11041/Zci_09385",3
"GO:1902680","GO:1902680","positive regulation of RNA biosynthetic process","3/46","43/1957",0.0779926948475917,0.619927586697541,0.603164696859268,"Zci_12414/Zci_12855/Zci_15170",3
"GO:1903508","GO:1903508","positive regulation of nucleic acid-templated transcription","3/46","43/1957",0.0779926948475917,0.619927586697541,0.603164696859268,"Zci_12414/Zci_12855/Zci_15170",3
"GO:0007178","GO:0007178","transmembrane receptor protein serine/threonine kinase signaling pathway","2/46","21/1957",0.0855582979889188,0.619927586697541,0.603164696859268,"Zci_06073/Zci_09678",2
"GO:0033044","GO:0033044","regulation of chromosome organization","2/46","21/1957",0.0855582979889188,0.619927586697541,0.603164696859268,"Zci_07025/Zci_12855",2
"GO:0045934","GO:0045934","negative regulation of nucleobase-containing compound metabolic process","3/46","45/1957",0.0868408381671,0.619927586697541,0.603164696859268,"Zci_07025/Zci_12855/Zci_05011",3
"GO:1903506","GO:1903506","regulation of nucleic acid-templated transcription","6/46","133/1957",0.0874414573207414,0.619927586697541,0.603164696859268,"Zci_00238/Zci_12385/Zci_12414/Zci_12855/Zci_15170/Zci_05011",6
"GO:2001141","GO:2001141","regulation of RNA biosynthetic process","6/46","133/1957",0.0874414573207414,0.619927586697541,0.603164696859268,"Zci_00238/Zci_12385/Zci_12414/Zci_12855/Zci_15170/Zci_05011",6
"GO:0044248","GO:0044248","cellular catabolic process","6/46","134/1957",0.0899450981157383,0.619927586697541,0.603164696859268,"Zci_05395/Zci_07025/Zci_13261/Zci_09644/Zci_11175/Zci_12402",6
"GO:0016071","GO:0016071","mRNA metabolic process","3/46","46/1957",0.0914203788676744,0.619927586697541,0.603164696859268,"Zci_07025/Zci_12414/Zci_11041",3
"GO:0007167","GO:0007167","enzyme-linked receptor protein signaling pathway","2/46","22/1957",0.0927450071566333,0.619927586697541,0.603164696859268,"Zci_06073/Zci_09678",2
"GO:0048437","GO:0048437","floral organ development","2/46","22/1957",0.0927450071566333,0.619927586697541,0.603164696859268,"Zci_13095/Zci_06303",2
"GO:0048638","GO:0048638","regulation of developmental growth","2/46","22/1957",0.0927450071566333,0.619927586697541,0.603164696859268,"Zci_13095/Zci_09678",2
"GO:0019219","GO:0019219","regulation of nucleobase-containing compound metabolic process","7/46","168/1957",0.0934519855678897,0.619927586697541,0.603164696859268,"Zci_00238/Zci_12385/Zci_07025/Zci_12414/Zci_12855/Zci_15170/Zci_05011",7
"GO:0032259","GO:0032259","methylation","3/46","47/1957",0.0961003509589041,0.619927586697541,0.603164696859268,"Zci_12385/Zci_05395/Zci_12855",3
"GO:0051173","GO:0051173","positive regulation of nitrogen compound metabolic process","4/46","75/1957",0.0966270167614979,0.619927586697541,0.603164696859268,"Zci_00238/Zci_12414/Zci_12855/Zci_15170",4
"GO:0006139","GO:0006139","nucleobase-containing compound metabolic process","10/46","273/1957",0.0966859538886073,0.619927586697541,0.603164696859268,"Zci_07025/Zci_12414/Zci_11436/Zci_11041/Zci_09644/Zci_15426/Zci_09385/Zci_02300/Zci_12855/Zci_15170",10
"GO:0040029","GO:0040029","regulation of gene expression, epigenetic","2/46","23/1957",0.100102740017351,0.63253325576181,0.615429507658159,"Zci_07025/Zci_12855",2
"GO:0048519","GO:0048519","negative regulation of biological process","7/46","172/1957",0.102932847885736,0.632875636903408,0.615762630787237,"Zci_00238/Zci_10415/Zci_07025/Zci_11436/Zci_09678/Zci_12855/Zci_05011",7
"GO:1901575","GO:1901575","organic substance catabolic process","6/46","139/1957",0.103060023440693,0.632875636903408,0.615762630787237,"Zci_06970/Zci_05395/Zci_07025/Zci_13261/Zci_09644/Zci_11175",6
"GO:0007166","GO:0007166","cell surface receptor signaling pathway","2/46","24/1957",0.107619912327574,0.636546762641697,0.619334489001941,"Zci_06073/Zci_09678",2
"GO:0031328","GO:0031328","positive regulation of cellular biosynthetic process","3/46","50/1957",0.110717876612834,0.636546762641697,0.619334489001941,"Zci_12414/Zci_12855/Zci_15170",3
"GO:0046907","GO:0046907","intracellular transport","4/46","79/1957",0.111698424412843,0.636546762641697,0.619334489001941,"Zci_07865/Zci_03755/Zci_13818/Zci_02768",4
"GO:0034641","GO:0034641","cellular nitrogen compound metabolic process","11/46","318/1957",0.113441206697583,0.636546762641697,0.619334489001941,"Zci_07025/Zci_12414/Zci_11436/Zci_11041/Zci_09644/Zci_15426/Zci_09385/Zci_02300/Zci_12855/Zci_15170/Zci_04182",11
"GO:0010557","GO:0010557","positive regulation of macromolecule biosynthetic process","3/46","51/1957",0.115774392132854,0.636546762641697,0.619334489001941,"Zci_12414/Zci_12855/Zci_15170",3
"GO:0006355","GO:0006355","regulation of transcription, DNA-templated","7/46","178/1957",0.118131725366877,0.636546762641697,0.619334489001941,"Zci_00238/Zci_12385/Zci_00879/Zci_13378/Zci_12855/Zci_15170/Zci_05011",7
"GO:0006952","GO:0006952","defense response","5/46","113/1957",0.122279950826655,0.636546762641697,0.619334489001941,"Zci_05395/Zci_03841/Zci_09678/Zci_12855/Zci_08079",5
"GO:0006605","GO:0006605","protein targeting","2/46","26/1957",0.123088369447554,0.636546762641697,0.619334489001941,"Zci_03755/Zci_02768",2
"GO:0051252","GO:0051252","regulation of RNA metabolic process","6/46","147/1957",0.12606649860677,0.636546762641697,0.619334489001941,"Zci_00238/Zci_12385/Zci_12414/Zci_12855/Zci_15170/Zci_05011",6
"GO:0080090","GO:0080090","regulation of primary metabolic process","8/46","216/1957",0.126573323282462,0.636546762641697,0.619334489001941,"Zci_00238/Zci_12385/Zci_07025/Zci_12414/Zci_12402/Zci_12855/Zci_15170/Zci_05011",8
"GO:0050794","GO:0050794","regulation of cellular process","14/46","439/1957",0.128931835855558,0.636546762641697,0.619334489001941,"Zci_00238/Zci_10415/Zci_12385/Zci_07025/Zci_12414/Zci_11436/Zci_06073/Zci_12402/Zci_13818/Zci_03841/Zci_09678/Zci_12855/Zci_15170/Zci_05011",14
"GO:1901360","GO:1901360","organic cyclic compound metabolic process","11/46","326/1957",0.129570823601253,0.636546762641697,0.619334489001941,"Zci_07025/Zci_12414/Zci_11436/Zci_11041/Zci_09644/Zci_08785/Zci_15426/Zci_09385/Zci_02300/Zci_12855/Zci_15170",11
"GO:0045892","GO:0045892","negative regulation of transcription, DNA-templated","2/46","27/1957",0.13101857812256,0.636546762641697,0.619334489001941,"Zci_12855/Zci_05011",2
"GO:1902679","GO:1902679","negative regulation of RNA biosynthetic process","2/46","27/1957",0.13101857812256,0.636546762641697,0.619334489001941,"Zci_12855/Zci_05011",2
"GO:1903507","GO:1903507","negative regulation of nucleic acid-templated transcription","2/46","27/1957",0.13101857812256,0.636546762641697,0.619334489001941,"Zci_12855/Zci_05011",2
"GO:0031325","GO:0031325","positive regulation of cellular metabolic process","4/46","84/1957",0.131940055866589,0.636546762641697,0.619334489001941,"Zci_00238/Zci_12414/Zci_12855/Zci_15170",4
"GO:0010604","GO:0010604","positive regulation of macromolecule metabolic process","4/46","85/1957",0.136165042686646,0.636546762641697,0.619334489001941,"Zci_00238/Zci_12414/Zci_12855/Zci_15170",4
"GO:0030163","GO:0030163","protein catabolic process","3/46","55/1957",0.136850429340001,0.636546762641697,0.619334489001941,"Zci_06970/Zci_09644/Zci_11175",3
"GO:0051171","GO:0051171","regulation of nitrogen compound metabolic process","8/46","222/1957",0.142068292502603,0.636546762641697,0.619334489001941,"Zci_00238/Zci_12385/Zci_07025/Zci_12414/Zci_12402/Zci_12855/Zci_15170/Zci_05011",8
"GO:0048507","GO:0048507","meristem development","2/46","29/1957",0.147221214941404,0.636546762641697,0.619334489001941,"Zci_13095/Zci_07865",2
"GO:0009888","GO:0009888","tissue development","4/46","88/1957",0.149173273789344,0.636546762641697,0.619334489001941,"Zci_13095/Zci_07865/Zci_11436/Zci_03841",4
"GO:0051649","GO:0051649","establishment of localization in cell","4/46","88/1957",0.149173273789344,0.636546762641697,0.619334489001941,"Zci_07865/Zci_03755/Zci_13818/Zci_02768",4
"GO:1901565","GO:1901565","organonitrogen compound catabolic process","4/46","88/1957",0.149173273789344,0.636546762641697,0.619334489001941,"Zci_06970/Zci_05395/Zci_09644/Zci_11175",4
"GO:0071840","GO:0071840","cellular component organization or biogenesis","12/46","373/1957",0.149726159925139,0.636546762641697,0.619334489001941,"Zci_12385/Zci_07025/Zci_11436/Zci_03755/Zci_09644/Zci_11185/Zci_09385/Zci_02300/Zci_02768/Zci_12855/Zci_15170/Zci_05011",12
"GO:0009891","GO:0009891","positive regulation of biosynthetic process","3/46","58/1957",0.153474876345166,0.636546762641697,0.619334489001941,"Zci_12414/Zci_12855/Zci_15170",3
"GO:0010605","GO:0010605","negative regulation of macromolecule metabolic process","4/46","90/1957",0.15811144073202,0.636546762641697,0.619334489001941,"Zci_00238/Zci_07025/Zci_12855/Zci_05011",4
"GO:0006511","GO:0006511","ubiquitin-dependent protein catabolic process","2/46","31/1957",0.163818188546458,0.636546762641697,0.619334489001941,"Zci_09644/Zci_11175",2
"GO:0019941","GO:0019941","modification-dependent protein catabolic process","2/46","31/1957",0.163818188546458,0.636546762641697,0.619334489001941,"Zci_09644/Zci_11175",2
"GO:0046483","GO:0046483","heterocycle metabolic process","10/46","305/1957",0.167302009894065,0.636546762641697,0.619334489001941,"Zci_07025/Zci_12414/Zci_11436/Zci_11041/Zci_09644/Zci_15426/Zci_09385/Zci_02300/Zci_12855/Zci_15170",10
"GO:0044265","GO:0044265","cellular macromolecule catabolic process","3/46","61/1957",0.1707188852747,0.636546762641697,0.619334489001941,"Zci_07025/Zci_09644/Zci_11175",3
"GO:0040008","GO:0040008","regulation of growth","2/46","32/1957",0.17224265253486,0.636546762641697,0.619334489001941,"Zci_13095/Zci_09678",2
"GO:0065008","GO:0065008","regulation of biological quality","5/46","128/1957",0.178229895650864,0.636546762641697,0.619334489001941,"Zci_00238/Zci_07025/Zci_11436/Zci_12402/Zci_08079",5
"GO:0009892","GO:0009892","negative regulation of metabolic process","4/46","95/1957",0.181316926827733,0.636546762641697,0.619334489001941,"Zci_00238/Zci_07025/Zci_12855/Zci_05011",4
"GO:0051128","GO:0051128","regulation of cellular component organization","3/46","63/1957",0.182523094791292,0.636546762641697,0.619334489001941,"Zci_07025/Zci_13818/Zci_12855",3
"GO:0006725","GO:0006725","cellular aromatic compound metabolic process","10/46","312/1957",0.185607608473885,0.636546762641697,0.619334489001941,"Zci_07025/Zci_12414/Zci_11436/Zci_11041/Zci_09644/Zci_15426/Zci_09385/Zci_02300/Zci_12855/Zci_15170",10
"GO:0006281","GO:0006281","DNA repair","3/46","64/1957",0.188509621473471,0.636546762641697,0.619334489001941,"Zci_11436/Zci_09644/Zci_12855",3
"GO:0051253","GO:0051253","negative regulation of RNA metabolic process","2/46","34/1957",0.189302696964188,0.636546762641697,0.619334489001941,"Zci_12855/Zci_05011",2
"GO:0071705","GO:0071705","nitrogen compound transport","4/46","97/1957",0.190916764671451,0.636546762641697,0.619334489001941,"Zci_07865/Zci_03755/Zci_13818/Zci_02768",4
"GO:0009893","GO:0009893","positive regulation of metabolic process","4/46","98/1957",0.195779623938503,0.636546762641697,0.619334489001941,"Zci_00238/Zci_12414/Zci_12855/Zci_15170",4
"GO:0060255","GO:0060255","regulation of macromolecule metabolic process","8/46","241/1957",0.19718814572037,0.636546762641697,0.619334489001941,"Zci_00238/Zci_12385/Zci_07025/Zci_12414/Zci_12402/Zci_12855/Zci_15170/Zci_05011",8
"GO:0006397","GO:0006397","mRNA processing","2/46","35/1957",0.197922906856135,0.636546762641697,0.619334489001941,"Zci_12414/Zci_11041",2
"GO:0032446","GO:0032446","protein modification by small protein conjugation","2/46","35/1957",0.197922906856135,0.636546762641697,0.619334489001941,"Zci_01546/Zci_09644",2
"GO:0006974","GO:0006974","cellular response to DNA damage stimulus","3/46","66/1957",0.200638267371849,0.636546762641697,0.619334489001941,"Zci_11436/Zci_09644/Zci_12855",3
"GO:0016567","GO:0016567","protein ubiquitination","2/46","36/1957",0.206593507275393,0.636546762641697,0.619334489001941,"Zci_01546/Zci_09644",2
"GO:0072594","GO:0072594","establishment of protein localization to organelle","2/46","36/1957",0.206593507275393,0.636546762641697,0.619334489001941,"Zci_03755/Zci_02768",2
"GO:0006979","GO:0006979","response to oxidative stress","3/46","67/1957",0.206775142794978,0.636546762641697,0.619334489001941,"Zci_00238/Zci_12414/Zci_03841",3
"GO:0031323","GO:0031323","regulation of cellular metabolic process","8/46","245/1957",0.209867559355589,0.636546762641697,0.619334489001941,"Zci_00238/Zci_12385/Zci_07025/Zci_12414/Zci_12402/Zci_12855/Zci_15170/Zci_05011",8
"GO:0000956","GO:0000956","nuclear-transcribed mRNA catabolic process","1/46","10/1957",0.212124780546638,0.636546762641697,0.619334489001941,"Zci_07025",1
"GO:0006402","GO:0006402","mRNA catabolic process","1/46","10/1957",0.212124780546638,0.636546762641697,0.619334489001941,"Zci_07025",1
"GO:0006405","GO:0006405","RNA export from nucleus","1/46","10/1957",0.212124780546638,0.636546762641697,0.619334489001941,"Zci_07865",1
"GO:0006611","GO:0006611","protein export from nucleus","1/46","10/1957",0.212124780546638,0.636546762641697,0.619334489001941,"Zci_07865",1
"GO:0009896","GO:0009896","positive regulation of catabolic process","1/46","10/1957",0.212124780546638,0.636546762641697,0.619334489001941,"Zci_00238",1
"GO:0016125","GO:0016125","sterol metabolic process","1/46","10/1957",0.212124780546638,0.636546762641697,0.619334489001941,"Zci_08785",1
"GO:0034504","GO:0034504","protein localization to nucleus","1/46","10/1957",0.212124780546638,0.636546762641697,0.619334489001941,"Zci_09678",1
"GO:0040011","GO:0040011","locomotion","1/46","10/1957",0.212124780546638,0.636546762641697,0.619334489001941,"Zci_06303",1
"GO:0048443","GO:0048443","stamen development","1/46","10/1957",0.212124780546638,0.636546762641697,0.619334489001941,"Zci_06303",1
"GO:0048466","GO:0048466","androecium development","1/46","10/1957",0.212124780546638,0.636546762641697,0.619334489001941,"Zci_06303",1
"GO:0050657","GO:0050657","nucleic acid transport","1/46","10/1957",0.212124780546638,0.636546762641697,0.619334489001941,"Zci_07865",1
"GO:0050658","GO:0050658","RNA transport","1/46","10/1957",0.212124780546638,0.636546762641697,0.619334489001941,"Zci_07865",1
"GO:0051236","GO:0051236","establishment of RNA localization","1/46","10/1957",0.212124780546638,0.636546762641697,0.619334489001941,"Zci_07865",1
"GO:0060548","GO:0060548","negative regulation of cell death","1/46","10/1957",0.212124780546638,0.636546762641697,0.619334489001941,"Zci_10415",1
"GO:0070417","GO:0070417","cellular response to cold","1/46","10/1957",0.212124780546638,0.636546762641697,0.619334489001941,"Zci_01149",1
"GO:0072348","GO:0072348","sulfur compound transport","1/46","10/1957",0.212124780546638,0.636546762641697,0.619334489001941,"Zci_02600",1
"GO:0043414","GO:0043414","macromolecule methylation","2/46","37/1957",0.215307567088438,0.636546762641697,0.619334489001941,"Zci_12385/Zci_12855",2
"GO:0009651","GO:0009651","response to salt stress","3/46","69/1957",0.219181055705661,0.636546762641697,0.619334489001941,"Zci_13725/Zci_15239/Zci_08079",3
"GO:0051179","GO:0051179","localization","9/46","287/1957",0.223103190737367,0.636546762641697,0.619334489001941,"Zci_07865/Zci_07025/Zci_13725/Zci_03755/Zci_02600/Zci_13818/Zci_09678/Zci_02768/Zci_08079",9
"GO:0006790","GO:0006790","sulfur compound metabolic process","2/46","38/1957",0.224058439769907,0.636546762641697,0.619334489001941,"Zci_05395/Zci_11185",2
"GO:0019538","GO:0019538","protein metabolic process","10/46","326/1957",0.224976781628455,0.636546762641697,0.619334489001941,"Zci_01546/Zci_12385/Zci_06970/Zci_06073/Zci_09644/Zci_11175/Zci_03841/Zci_09678/Zci_02300/Zci_05011",10
"GO:0008610","GO:0008610","lipid biosynthetic process","3/46","70/1957",0.225444990513601,0.636546762641697,0.619334489001941,"Zci_01149/Zci_02358/Zci_08785",3
"GO:0000075","GO:0000075","cell cycle checkpoint signaling","1/46","11/1957",0.230739192511125,0.636546762641697,0.619334489001941,"Zci_11436",1
"GO:0006401","GO:0006401","RNA catabolic process","1/46","11/1957",0.230739192511125,0.636546762641697,0.619334489001941,"Zci_07025",1
"GO:0006475","GO:0006475","internal protein amino acid acetylation","1/46","11/1957",0.230739192511125,0.636546762641697,0.619334489001941,"Zci_02300",1
"GO:0008202","GO:0008202","steroid metabolic process","1/46","11/1957",0.230739192511125,0.636546762641697,0.619334489001941,"Zci_08785",1
"GO:0009615","GO:0009615","response to virus","1/46","11/1957",0.230739192511125,0.636546762641697,0.619334489001941,"Zci_09678",1
"GO:0016573","GO:0016573","histone acetylation","1/46","11/1957",0.230739192511125,0.636546762641697,0.619334489001941,"Zci_02300",1
"GO:0018393","GO:0018393","internal peptidyl-lysine acetylation","1/46","11/1957",0.230739192511125,0.636546762641697,0.619334489001941,"Zci_02300",1
"GO:0018394","GO:0018394","peptidyl-lysine acetylation","1/46","11/1957",0.230739192511125,0.636546762641697,0.619334489001941,"Zci_02300",1
"GO:0045814","GO:0045814","negative regulation of gene expression, epigenetic","1/46","11/1957",0.230739192511125,0.636546762641697,0.619334489001941,"Zci_12855",1
"GO:0051053","GO:0051053","negative regulation of DNA metabolic process","1/46","11/1957",0.230739192511125,0.636546762641697,0.619334489001941,"Zci_07025",1
"GO:0051168","GO:0051168","nuclear export","1/46","11/1957",0.230739192511125,0.636546762641697,0.619334489001941,"Zci_07865",1
"GO:0051235","GO:0051235","maintenance of location","1/46","11/1957",0.230739192511125,0.636546762641697,0.619334489001941,"Zci_08079",1
"GO:0090626","GO:0090626","plant epidermis morphogenesis","1/46","11/1957",0.230739192511125,0.636546762641697,0.619334489001941,"Zci_11436",1
"GO:0098754","GO:0098754","detoxification","1/46","11/1957",0.230739192511125,0.636546762641697,0.619334489001941,"Zci_12402",1
"GO:0043085","GO:0043085","positive regulation of catalytic activity","2/46","39/1957",0.232839754341891,0.636546762641697,0.619334489001941,"Zci_12402/Zci_13818",2
"GO:0048827","GO:0048827","phyllome development","2/46","39/1957",0.232839754341891,0.636546762641697,0.619334489001941,"Zci_00238/Zci_06303",2
"GO:0043412","GO:0043412","macromolecule modification","9/46","291/1957",0.235605923983465,0.636546762641697,0.619334489001941,"Zci_01546/Zci_12385/Zci_06073/Zci_09644/Zci_03841/Zci_09678/Zci_02300/Zci_12855/Zci_05011",9
"GO:1901564","GO:1901564","organonitrogen compound metabolic process","13/46","448/1957",0.237333812470547,0.636546762641697,0.619334489001941,"Zci_01149/Zci_01546/Zci_12385/Zci_06970/Zci_05395/Zci_06073/Zci_09644/Zci_11175/Zci_03841/Zci_09678/Zci_02300/Zci_05011/Zci_04182",13
"GO:0002376","GO:0002376","immune system process","2/46","40/1957",0.241645406567456,0.636546762641697,0.619334489001941,"Zci_03841/Zci_09678",2
"GO:0070647","GO:0070647","protein modification by small protein conjugation or removal","2/46","40/1957",0.241645406567456,0.636546762641697,0.619334489001941,"Zci_01546/Zci_09644",2
"GO:0044260","GO:0044260","cellular macromolecule metabolic process","13/46","450/1957",0.242665256515965,0.636546762641697,0.619334489001941,"Zci_01546/Zci_12385/Zci_07025/Zci_13261/Zci_11436/Zci_06073/Zci_09644/Zci_11175/Zci_03841/Zci_09678/Zci_02300/Zci_12855/Zci_05011",13
"GO:0006464","GO:0006464","cellular protein modification process","8/46","255/1957",0.242994561232832,0.636546762641697,0.619334489001941,"Zci_01546/Zci_12385/Zci_06073/Zci_09644/Zci_03841/Zci_09678/Zci_02300/Zci_05011",8
"GO:0036211","GO:0036211","protein modification process","8/46","256/1957",0.246411031553113,0.636546762641697,0.619334489001941,"Zci_01546/Zci_12385/Zci_06073/Zci_09644/Zci_03841/Zci_09678/Zci_02300/Zci_05011",8
"GO:0006473","GO:0006473","protein acetylation","1/46","12/1957",0.248923158155774,0.636546762641697,0.619334489001941,"Zci_02300",1
"GO:0007623","GO:0007623","circadian rhythm","1/46","12/1957",0.248923158155774,0.636546762641697,0.619334489001941,"Zci_00879",1
"GO:0043543","GO:0043543","protein acylation","1/46","12/1957",0.248923158155774,0.636546762641697,0.619334489001941,"Zci_02300",1
"GO:1903311","GO:1903311","regulation of mRNA metabolic process","1/46","12/1957",0.248923158155774,0.636546762641697,0.619334489001941,"Zci_00238",1
"GO:0044093","GO:0044093","positive regulation of molecular function","2/46","42/1957",0.259306589624653,0.636546762641697,0.619334489001941,"Zci_12402/Zci_13818",2
"GO:0045893","GO:0045893","positive regulation of transcription, DNA-templated","2/46","42/1957",0.259306589624653,0.636546762641697,0.619334489001941,"Zci_12855/Zci_15170",2
"GO:0044267","GO:0044267","cellular protein metabolic process","9/46","299/1957",0.261416174666015,0.636546762641697,0.619334489001941,"Zci_01546/Zci_12385/Zci_06073/Zci_09644/Zci_11175/Zci_03841/Zci_09678/Zci_02300/Zci_05011",9
"GO:0006996","GO:0006996","organelle organization","7/46","223/1957",0.264868503735537,0.636546762641697,0.619334489001941,"Zci_12385/Zci_03755/Zci_09644/Zci_02300/Zci_02768/Zci_12855/Zci_05011",7
"GO:0000724","GO:0000724","double-strand break repair via homologous recombination","1/46","13/1957",0.266686415083709,0.636546762641697,0.619334489001941,"Zci_11436",1
"GO:0001934","GO:0001934","positive regulation of protein phosphorylation","1/46","13/1957",0.266686415083709,0.636546762641697,0.619334489001941,"Zci_12414",1
"GO:0005982","GO:0005982","starch metabolic process","1/46","13/1957",0.266686415083709,0.636546762641697,0.619334489001941,"Zci_13261",1
"GO:0009250","GO:0009250","glucan biosynthetic process","1/46","13/1957",0.266686415083709,0.636546762641697,0.619334489001941,"Zci_13261",1
"GO:0031123","GO:0031123","RNA 3'-end processing","1/46","13/1957",0.266686415083709,0.636546762641697,0.619334489001941,"Zci_11041",1
"GO:0031348","GO:0031348","negative regulation of defense response","1/46","13/1957",0.266686415083709,0.636546762641697,0.619334489001941,"Zci_10415",1
"GO:0044247","GO:0044247","cellular polysaccharide catabolic process","1/46","13/1957",0.266686415083709,0.636546762641697,0.619334489001941,"Zci_13261",1
"GO:0046165","GO:0046165","alcohol biosynthetic process","1/46","13/1957",0.266686415083709,0.636546762641697,0.619334489001941,"Zci_08785",1
"GO:0051345","GO:0051345","positive regulation of hydrolase activity","1/46","13/1957",0.266686415083709,0.636546762641697,0.619334489001941,"Zci_13818",1
"GO:0090056","GO:0090056","regulation of chlorophyll metabolic process","1/46","13/1957",0.266686415083709,0.636546762641697,0.619334489001941,"Zci_12402",1
"GO:0097237","GO:0097237","cellular response to toxic substance","1/46","13/1957",0.266686415083709,0.636546762641697,0.619334489001941,"Zci_12402",1
"GO:0006950","GO:0006950","response to stress","12/46","419/1957",0.267174443952822,0.636546762641697,0.619334489001941,"Zci_01149/Zci_00238/Zci_05395/Zci_12414/Zci_11436/Zci_13725/Zci_15239/Zci_09644/Zci_03841/Zci_09678/Zci_12855/Zci_08079",12
"GO:0046777","GO:0046777","protein autophosphorylation","2/46","44/1957",0.276998170610749,0.641662070890082,0.624311478920095,"Zci_03841/Zci_09678",2
"GO:0048608","GO:0048608","reproductive structure development","4/46","114/1957",0.278165289814119,0.641662070890082,0.624311478920095,"Zci_13095/Zci_07865/Zci_06303/Zci_03841",4
"GO:0061458","GO:0061458","reproductive system development","4/46","114/1957",0.278165289814119,0.641662070890082,0.624311478920095,"Zci_13095/Zci_07865/Zci_06303/Zci_03841",4
"GO:0051716","GO:0051716","cellular response to stimulus","9/46","305/1957",0.281409983923747,0.641662070890082,0.624311478920095,"Zci_01149/Zci_00238/Zci_11436/Zci_06073/Zci_09644/Zci_12402/Zci_03841/Zci_09678/Zci_12855",9
"GO:0000725","GO:0000725","recombinational repair","1/46","14/1957",0.284038485508683,0.641662070890082,0.624311478920095,"Zci_11436",1
"GO:0006366","GO:0006366","transcription by RNA polymerase II","1/46","14/1957",0.284038485508683,0.641662070890082,0.624311478920095,"Zci_02300",1
"GO:0010150","GO:0010150","leaf senescence","1/46","14/1957",0.284038485508683,0.641662070890082,0.624311478920095,"Zci_00238",1
"GO:0042327","GO:0042327","positive regulation of phosphorylation","1/46","14/1957",0.284038485508683,0.641662070890082,0.624311478920095,"Zci_12414",1
"GO:0044087","GO:0044087","regulation of cellular component biogenesis","1/46","14/1957",0.284038485508683,0.641662070890082,0.624311478920095,"Zci_15170",1
"GO:0090693","GO:0090693","plant organ senescence","1/46","14/1957",0.284038485508683,0.641662070890082,0.624311478920095,"Zci_00238",1
"GO:0010468","GO:0010468","regulation of gene expression","6/46","191/1957",0.289225588289418,0.646458447670805,0.628978161302111,"Zci_00238/Zci_12385/Zci_07025/Zci_12855/Zci_15170/Zci_05011",6
"GO:0010073","GO:0010073","meristem maintenance","1/46","15/1957",0.300988680910948,0.646458447670805,0.628978161302111,"Zci_13095",1
"GO:0010562","GO:0010562","positive regulation of phosphorus metabolic process","1/46","15/1957",0.300988680910948,0.646458447670805,0.628978161302111,"Zci_12414",1
"GO:0045088","GO:0045088","regulation of innate immune response","1/46","15/1957",0.300988680910948,0.646458447670805,0.628978161302111,"Zci_10415",1
"GO:0045786","GO:0045786","negative regulation of cell cycle","1/46","15/1957",0.300988680910948,0.646458447670805,0.628978161302111,"Zci_11436",1
"GO:0045937","GO:0045937","positive regulation of phosphate metabolic process","1/46","15/1957",0.300988680910948,0.646458447670805,0.628978161302111,"Zci_12414",1
"GO:0048438","GO:0048438","floral whorl development","1/46","15/1957",0.300988680910948,0.646458447670805,0.628978161302111,"Zci_06303",1
"GO:0065002","GO:0065002","intracellular protein transmembrane transport","1/46","15/1957",0.300988680910948,0.646458447670805,0.628978161302111,"Zci_03755",1
"GO:0071806","GO:0071806","protein transmembrane transport","1/46","15/1957",0.300988680910948,0.646458447670805,0.628978161302111,"Zci_03755",1
"GO:1901401","GO:1901401","regulation of tetrapyrrole metabolic process","1/46","15/1957",0.300988680910948,0.646458447670805,0.628978161302111,"Zci_12402",1
"GO:0051603","GO:0051603","proteolysis involved in cellular protein catabolic process","2/46","47/1957",0.30350584137977,0.648669347262646,0.63112927799818,"Zci_09644/Zci_11175",2
"GO:0048522","GO:0048522","positive regulation of cellular process","4/46","121/1957",0.316083184913059,0.662440681700218,0.644528234488623,"Zci_00238/Zci_12414/Zci_12855/Zci_15170",4
"GO:0009251","GO:0009251","glucan catabolic process","1/46","16/1957",0.317546106594829,0.662440681700218,0.644528234488623,"Zci_13261",1
"GO:0044275","GO:0044275","cellular carbohydrate catabolic process","1/46","16/1957",0.317546106594829,0.662440681700218,0.644528234488623,"Zci_13261",1
"GO:0065004","GO:0065004","protein-DNA complex assembly","1/46","16/1957",0.317546106594829,0.662440681700218,0.644528234488623,"Zci_02300",1
"GO:0097659","GO:0097659","nucleic acid-templated transcription","1/46","16/1957",0.317546106594829,0.662440681700218,0.644528234488623,"Zci_02300",1
"GO:0044257","GO:0044257","cellular protein catabolic process","2/46","49/1957",0.321105696903996,0.664391664116033,0.646426462189187,"Zci_09644/Zci_11175",2
"GO:0006970","GO:0006970","response to osmotic stress","3/46","86/1957",0.32913304149358,0.664391664116033,0.646426462189187,"Zci_13725/Zci_15239/Zci_08079",3
"GO:0000272","GO:0000272","polysaccharide catabolic process","1/46","17/1957",0.333719666150026,0.664391664116033,0.646426462189187,"Zci_13261",1
"GO:0006913","GO:0006913","nucleocytoplasmic transport","1/46","17/1957",0.333719666150026,0.664391664116033,0.646426462189187,"Zci_07865",1
"GO:0009553","GO:0009553","embryo sac development","1/46","17/1957",0.333719666150026,0.664391664116033,0.646426462189187,"Zci_06303",1
"GO:0009967","GO:0009967","positive regulation of signal transduction","1/46","17/1957",0.333719666150026,0.664391664116033,0.646426462189187,"Zci_12414",1
"GO:0015698","GO:0015698","inorganic anion transport","1/46","17/1957",0.333719666150026,0.664391664116033,0.646426462189187,"Zci_02600",1
"GO:0019318","GO:0019318","hexose metabolic process","1/46","17/1957",0.333719666150026,0.664391664116033,0.646426462189187,"Zci_02358",1
"GO:0031401","GO:0031401","positive regulation of protein modification process","1/46","17/1957",0.333719666150026,0.664391664116033,0.646426462189187,"Zci_12414",1
"GO:0051169","GO:0051169","nuclear transport","1/46","17/1957",0.333719666150026,0.664391664116033,0.646426462189187,"Zci_07865",1
"GO:0071702","GO:0071702","organic substance transport","4/46","125/1957",0.338013780794163,0.665766196584268,0.647763827193288,"Zci_07865/Zci_03755/Zci_13818/Zci_02768",4
"GO:0044085","GO:0044085","cellular component biogenesis","5/46","164/1957",0.340877948488608,0.665766196584268,0.647763827193288,"Zci_07025/Zci_11185/Zci_09385/Zci_02300/Zci_15170",5
"GO:0044255","GO:0044255","cellular lipid metabolic process","3/46","88/1957",0.342300873826648,0.665766196584268,0.647763827193288,"Zci_01149/Zci_02358/Zci_08785",3
"GO:0032268","GO:0032268","regulation of cellular protein metabolic process","2/46","52/1957",0.347318206677498,0.665766196584268,0.647763827193288,"Zci_00238/Zci_12414",2
"GO:0007568","GO:0007568","aging","1/46","18/1957",0.349518065818634,0.665766196584268,0.647763827193288,"Zci_00238",1
"GO:0010876","GO:0010876","lipid localization","1/46","18/1957",0.349518065818634,0.665766196584268,0.647763827193288,"Zci_08079",1
"GO:0016571","GO:0016571","histone methylation","1/46","18/1957",0.349518065818634,0.665766196584268,0.647763827193288,"Zci_12385",1
"GO:0023056","GO:0023056","positive regulation of signaling","1/46","18/1957",0.349518065818634,0.665766196584268,0.647763827193288,"Zci_12414",1
"GO:0046467","GO:0046467","membrane lipid biosynthetic process","1/46","18/1957",0.349518065818634,0.665766196584268,0.647763827193288,"Zci_01149",1
"GO:0010628","GO:0010628","positive regulation of gene expression","2/46","53/1957",0.355991558261713,0.665766196584268,0.647763827193288,"Zci_12855/Zci_15170",2
"GO:0032879","GO:0032879","regulation of localization","2/46","53/1957",0.355991558261713,0.665766196584268,0.647763827193288,"Zci_07025/Zci_13818",2
"GO:0098660","GO:0098660","inorganic ion transmembrane transport","2/46","53/1957",0.355991558261713,0.665766196584268,0.647763827193288,"Zci_13725/Zci_02600",2
"GO:0019222","GO:0019222","regulation of metabolic process","8/46","287/1957",0.359301139038555,0.665766196584268,0.647763827193288,"Zci_00238/Zci_12385/Zci_07025/Zci_12414/Zci_12402/Zci_12855/Zci_15170/Zci_05011",8
"GO:0006259","GO:0006259","DNA metabolic process","3/46","91/1957",0.362034091020457,0.665766196584268,0.647763827193288,"Zci_11436/Zci_09644/Zci_12855",3
"GO:0006066","GO:0006066","alcohol metabolic process","1/46","19/1957",0.364949818769816,0.665766196584268,0.647763827193288,"Zci_08785",1
"GO:0006643","GO:0006643","membrane lipid metabolic process","1/46","19/1957",0.364949818769816,0.665766196584268,0.647763827193288,"Zci_01149",1
"GO:0010647","GO:0010647","positive regulation of cell communication","1/46","19/1957",0.364949818769816,0.665766196584268,0.647763827193288,"Zci_12414",1
"GO:0019748","GO:0019748","secondary metabolic process","1/46","19/1957",0.364949818769816,0.665766196584268,0.647763827193288,"Zci_05395",1
"GO:0032774","GO:0032774","RNA biosynthetic process","1/46","19/1957",0.364949818769816,0.665766196584268,0.647763827193288,"Zci_02300",1
"GO:0051336","GO:0051336","regulation of hydrolase activity","1/46","19/1957",0.364949818769816,0.665766196584268,0.647763827193288,"Zci_13818",1
"GO:0006302","GO:0006302","double-strand break repair","1/46","20/1957",0.380023249284052,0.680838163332148,0.662428246795885,"Zci_11436",1
"GO:0050776","GO:0050776","regulation of immune response","1/46","20/1957",0.380023249284052,0.680838163332148,0.662428246795885,"Zci_10415",1
"GO:0071824","GO:0071824","protein-DNA complex subunit organization","1/46","20/1957",0.380023249284052,0.680838163332148,0.662428246795885,"Zci_02300",1
"GO:0016043","GO:0016043","cellular component organization","9/46","334/1957",0.383590171331441,0.680838163332148,0.662428246795885,"Zci_12385/Zci_11436/Zci_03755/Zci_09644/Zci_11185/Zci_02300/Zci_02768/Zci_12855/Zci_05011",9
"GO:0006633","GO:0006633","fatty acid biosynthetic process","1/46","21/1957",0.394746496848808,0.680838163332148,0.662428246795885,"Zci_02358",1
"GO:0007346","GO:0007346","regulation of mitotic cell cycle","1/46","21/1957",0.394746496848808,0.680838163332148,0.662428246795885,"Zci_11436",1
"GO:0008213","GO:0008213","protein alkylation","1/46","21/1957",0.394746496848808,0.680838163332148,0.662428246795885,"Zci_12385",1
"GO:0031329","GO:0031329","regulation of cellular catabolic process","1/46","21/1957",0.394746496848808,0.680838163332148,0.662428246795885,"Zci_00238",1
"GO:0032269","GO:0032269","negative regulation of cellular protein metabolic process","1/46","21/1957",0.394746496848808,0.680838163332148,0.662428246795885,"Zci_00238",1
"GO:0032270","GO:0032270","positive regulation of cellular protein metabolic process","1/46","21/1957",0.394746496848808,0.680838163332148,0.662428246795885,"Zci_12414",1
"GO:0043067","GO:0043067","regulation of programmed cell death","1/46","21/1957",0.394746496848808,0.680838163332148,0.662428246795885,"Zci_10415",1
"GO:0043161","GO:0043161","proteasome-mediated ubiquitin-dependent protein catabolic process","1/46","21/1957",0.394746496848808,0.680838163332148,0.662428246795885,"Zci_09644",1
"GO:0048509","GO:0048509","regulation of meristem development","1/46","21/1957",0.394746496848808,0.680838163332148,0.662428246795885,"Zci_13095",1
"GO:0016051","GO:0016051","carbohydrate biosynthetic process","2/46","58/1957",0.398738091891031,0.680838163332148,0.662428246795885,"Zci_13261/Zci_02358",2
"GO:0046686","GO:0046686","response to cadmium ion","2/46","58/1957",0.398738091891031,0.680838163332148,0.662428246795885,"Zci_02358/Zci_08079",2
"GO:0051246","GO:0051246","regulation of protein metabolic process","2/46","58/1957",0.398738091891031,0.680838163332148,0.662428246795885,"Zci_00238/Zci_12414",2
"GO:0044262","GO:0044262","cellular carbohydrate metabolic process","2/46","59/1957",0.407144423290523,0.680838163332148,0.662428246795885,"Zci_13261/Zci_02358",2
"GO:0000377","GO:0000377","RNA splicing, via transesterification reactions with bulged adenosine as nucleophile","1/46","22/1957",0.409127520167483,0.680838163332148,0.662428246795885,"Zci_12414",1
"GO:0002682","GO:0002682","regulation of immune system process","1/46","22/1957",0.409127520167483,0.680838163332148,0.662428246795885,"Zci_10415",1
"GO:0006479","GO:0006479","protein methylation","1/46","22/1957",0.409127520167483,0.680838163332148,0.662428246795885,"Zci_12385",1
"GO:0010498","GO:0010498","proteasomal protein catabolic process","1/46","22/1957",0.409127520167483,0.680838163332148,0.662428246795885,"Zci_09644",1
"GO:0048868","GO:0048868","pollen tube development","1/46","22/1957",0.409127520167483,0.680838163332148,0.662428246795885,"Zci_06303",1
"GO:1901617","GO:1901617","organic hydroxy compound biosynthetic process","1/46","22/1957",0.409127520167483,0.680838163332148,0.662428246795885,"Zci_08785",1
"GO:0050790","GO:0050790","regulation of catalytic activity","2/46","60/1957",0.415497453399029,0.681825217502097,0.663388610944822,"Zci_12402/Zci_13818",2
"GO:0098542","GO:0098542","defense response to other organism","3/46","100/1957",0.420675119316833,0.681825217502097,0.663388610944822,"Zci_09678/Zci_12855/Zci_08079",3
"GO:0000375","GO:0000375","RNA splicing, via transesterification reactions","1/46","23/1957",0.423174101083398,0.681825217502097,0.663388610944822,"Zci_12414",1
"GO:0009753","GO:0009753","response to jasmonic acid","1/46","23/1957",0.423174101083398,0.681825217502097,0.663388610944822,"Zci_00238",1
"GO:0015931","GO:0015931","nucleobase-containing compound transport","1/46","23/1957",0.423174101083398,0.681825217502097,0.663388610944822,"Zci_07865",1
"GO:0017038","GO:0017038","protein import","1/46","23/1957",0.423174101083398,0.681825217502097,0.663388610944822,"Zci_03755",1
"GO:0051247","GO:0051247","positive regulation of protein metabolic process","1/46","23/1957",0.423174101083398,0.681825217502097,0.663388610944822,"Zci_12414",1
"GO:1901657","GO:1901657","glycosyl compound metabolic process","1/46","23/1957",0.423174101083398,0.681825217502097,0.663388610944822,"Zci_05395",1
"GO:0048229","GO:0048229","gametophyte development","2/46","61/1957",0.423795031979515,0.681825217502097,0.663388610944822,"Zci_13095/Zci_06303",2
"GO:0005996","GO:0005996","monosaccharide metabolic process","1/46","24/1957",0.436893848420608,0.682762859918791,0.664300899438128,"Zci_02358",1
"GO:0006351","GO:0006351","transcription, DNA-templated","1/46","24/1957",0.436893848420608,0.682762859918791,0.664300899438128,"Zci_02300",1
"GO:0006631","GO:0006631","fatty acid metabolic process","1/46","24/1957",0.436893848420608,0.682762859918791,0.664300899438128,"Zci_02358",1
"GO:0010941","GO:0010941","regulation of cell death","1/46","24/1957",0.436893848420608,0.682762859918791,0.664300899438128,"Zci_10415",1
"GO:0051241","GO:0051241","negative regulation of multicellular organismal process","1/46","24/1957",0.436893848420608,0.682762859918791,0.664300899438128,"Zci_09678",1
"GO:0051248","GO:0051248","negative regulation of protein metabolic process","1/46","24/1957",0.436893848420608,0.682762859918791,0.664300899438128,"Zci_00238",1
"GO:0080135","GO:0080135","regulation of cellular response to stress","1/46","24/1957",0.436893848420608,0.682762859918791,0.664300899438128,"Zci_10415",1
"GO:0009791","GO:0009791","post-embryonic development","4/46","143/1957",0.436905591553538,0.682762859918791,0.664300899438128,"Zci_13095/Zci_07865/Zci_06303/Zci_03841",4
"GO:0003006","GO:0003006","developmental process involved in reproduction","4/46","145/1957",0.44775166779337,0.693739476890649,0.674980707839043,"Zci_13095/Zci_07865/Zci_06303/Zci_03841",4
"GO:0006813","GO:0006813","potassium ion transport","1/46","25/1957",0.450294201743242,0.693739476890649,0.674980707839043,"Zci_13725",1
"GO:0010608","GO:0010608","post-transcriptional regulation of gene expression","1/46","25/1957",0.450294201743242,0.693739476890649,0.674980707839043,"Zci_00238",1
"GO:0051093","GO:0051093","negative regulation of developmental process","1/46","25/1957",0.450294201743242,0.693739476890649,0.674980707839043,"Zci_09678",1
"GO:0000398","GO:0000398","mRNA splicing, via spliceosome","1/46","26/1957",0.46338243503507,0.701203811580664,0.682243206342365,"Zci_12414",1
"GO:0006310","GO:0006310","DNA recombination","1/46","26/1957",0.46338243503507,0.701203811580664,0.682243206342365,"Zci_11436",1
"GO:0009894","GO:0009894","regulation of catabolic process","1/46","26/1957",0.46338243503507,0.701203811580664,0.682243206342365,"Zci_00238",1
"GO:0034655","GO:0034655","nucleobase-containing compound catabolic process","1/46","26/1957",0.46338243503507,0.701203811580664,0.682243206342365,"Zci_07025",1
"GO:0061024","GO:0061024","membrane organization","1/46","26/1957",0.46338243503507,0.701203811580664,0.682243206342365,"Zci_03755",1
"GO:0006629","GO:0006629","lipid metabolic process","3/46","107/1957",0.465183413181394,0.701203811580664,0.682243206342365,"Zci_01149/Zci_02358/Zci_08785",3
"GO:0008380","GO:0008380","RNA splicing","1/46","27/1957",0.476165660300936,0.701203811580664,0.682243206342365,"Zci_12414",1
"GO:0018205","GO:0018205","peptidyl-lysine modification","1/46","27/1957",0.476165660300936,0.701203811580664,0.682243206342365,"Zci_02300",1
"GO:0033692","GO:0033692","cellular polysaccharide biosynthetic process","1/46","27/1957",0.476165660300936,0.701203811580664,0.682243206342365,"Zci_13261",1
"GO:0048366","GO:0048366","leaf development","1/46","27/1957",0.476165660300936,0.701203811580664,0.682243206342365,"Zci_00238",1
"GO:0051301","GO:0051301","cell division","1/46","27/1957",0.476165660300936,0.701203811580664,0.682243206342365,"Zci_11436",1
"GO:0006082","GO:0006082","organic acid metabolic process","3/46","109/1957",0.477654889998755,0.701203811580664,0.682243206342365,"Zci_05395/Zci_02358/Zci_04182",3
"GO:0043436","GO:0043436","oxoacid metabolic process","3/46","109/1957",0.477654889998755,0.701203811580664,0.682243206342365,"Zci_05395/Zci_02358/Zci_04182",3
"GO:0099402","GO:0099402","plant organ development","3/46","109/1957",0.477654889998755,0.701203811580664,0.682243206342365,"Zci_13095/Zci_00238/Zci_06303",3
"GO:0016310","GO:0016310","phosphorylation","4/46","151/1957",0.47993404764185,0.702185385140425,0.683198238077236,"Zci_06073/Zci_02358/Zci_03841/Zci_09678",4
"GO:0001932","GO:0001932","regulation of protein phosphorylation","1/46","28/1957",0.488650831091691,0.71017254118659,0.690969420806847,"Zci_12414",1
"GO:0019725","GO:0019725","cellular homeostasis","1/46","28/1957",0.488650831091691,0.71017254118659,0.690969420806847,"Zci_12402",1
"GO:0009856","GO:0009856","pollination","1/46","29/1957",0.500844745954201,0.713887850019757,0.69458426740213,"Zci_06303",1
"GO:0042325","GO:0042325","regulation of phosphorylation","1/46","29/1957",0.500844745954201,0.713887850019757,0.69458426740213,"Zci_12414",1
"GO:0044706","GO:0044706","multi-multicellular organism process","1/46","29/1957",0.500844745954201,0.713887850019757,0.69458426740213,"Zci_06303",1
"GO:0023052","GO:0023052","signaling","4/46","155/1957",0.501031380977169,0.713887850019757,0.69458426740213,"Zci_00238/Zci_06073/Zci_03841/Zci_09678",4
"GO:0033554","GO:0033554","cellular response to stress","4/46","155/1957",0.501031380977169,0.713887850019757,0.69458426740213,"Zci_01149/Zci_11436/Zci_09644/Zci_12855",4
"GO:0048518","GO:0048518","positive regulation of biological process","4/46","155/1957",0.501031380977169,0.713887850019757,0.69458426740213,"Zci_00238/Zci_12414/Zci_12855/Zci_15170",4
"GO:0006796","GO:0006796","phosphate-containing compound metabolic process","6/46","240/1957",0.503330785291295,0.714828085951155,0.695499079281303,"Zci_06399/Zci_06073/Zci_02358/Zci_03841/Zci_09678/Zci_08079",6
"GO:0006073","GO:0006073","cellular glucan metabolic process","1/46","30/1957",0.512754051807991,0.721163763188013,0.701663439316198,"Zci_13261",1
"GO:0051052","GO:0051052","regulation of DNA metabolic process","1/46","30/1957",0.512754051807991,0.721163763188013,0.701663439316198,"Zci_07025",1
"GO:0072330","GO:0072330","monocarboxylic acid biosynthetic process","1/46","30/1957",0.512754051807991,0.721163763188013,0.701663439316198,"Zci_02358",1
"GO:0050793","GO:0050793","regulation of developmental process","3/46","116/1957",0.520274699923872,0.725815770796883,0.706189656279923,"Zci_13095/Zci_01546/Zci_09678",3
"GO:0000904","GO:0000904","cell morphogenesis involved in differentiation","1/46","31/1957",0.524385247250042,0.725815770796883,0.706189656279923,"Zci_11436",1
"GO:0016052","GO:0016052","carbohydrate catabolic process","1/46","31/1957",0.524385247250042,0.725815770796883,0.706189656279923,"Zci_13261",1
"GO:0044042","GO:0044042","glucan metabolic process","1/46","31/1957",0.524385247250042,0.725815770796883,0.706189656279923,"Zci_13261",1
"GO:0045087","GO:0045087","innate immune response","1/46","31/1957",0.524385247250042,0.725815770796883,0.706189656279923,"Zci_03841",1
"GO:0006468","GO:0006468","protein phosphorylation","4/46","160/1957",0.526923214260516,0.727020637397421,0.707361943194497,"Zci_13095/Zci_06073/Zci_03841/Zci_09678",4
"GO:1901605","GO:1901605","alpha-amino acid metabolic process","1/46","32/1957",0.535744685789241,0.736860198751133,0.716935442049026,"Zci_04182",1
"GO:0000271","GO:0000271","polysaccharide biosynthetic process","1/46","33/1957",0.54683857901194,0.742746481150174,0.722662558917238,"Zci_13261",1
"GO:0006955","GO:0006955","immune response","1/46","33/1957",0.54683857901194,0.742746481150174,0.722662558917238,"Zci_03841",1
"GO:0019220","GO:0019220","regulation of phosphate metabolic process","1/46","33/1957",0.54683857901194,0.742746481150174,0.722662558917238,"Zci_12414",1
"GO:0051174","GO:0051174","regulation of phosphorus metabolic process","1/46","33/1957",0.54683857901194,0.742746481150174,0.722662558917238,"Zci_12414",1
"GO:0007165","GO:0007165","signal transduction","4/46","165/1957",0.552211469922329,0.747714909584272,0.727496640662631,"Zci_00238/Zci_06073/Zci_03841/Zci_09678",4
"GO:0034637","GO:0034637","cellular carbohydrate biosynthetic process","1/46","34/1957",0.557672999680053,0.750448851421306,0.730156656501175,"Zci_13261",1
"GO:0090558","GO:0090558","plant epidermis development","1/46","34/1957",0.557672999680053,0.750448851421306,0.730156656501175,"Zci_11436",1
"GO:0006810","GO:0006810","transport","6/46","255/1957",0.566355174225944,0.757671846350813,0.737184341089758,"Zci_07865/Zci_13725/Zci_03755/Zci_02600/Zci_13818/Zci_02768",6
"GO:0048583","GO:0048583","regulation of response to stimulus","3/46","124/1957",0.566743185806213,0.757671846350813,0.737184341089758,"Zci_10415/Zci_01546/Zci_12414",3
"GO:0031347","GO:0031347","regulation of defense response","1/46","35/1957",0.56825388476311,0.757671846350813,0.737184341089758,"Zci_10415",1
"GO:0048731","GO:0048731","system development","5/46","214/1957",0.577274394773626,0.766759722628719,0.746026480491004,"Zci_13095/Zci_00238/Zci_07865/Zci_06303/Zci_03841",5
"GO:1901615","GO:1901615","organic hydroxy compound metabolic process","1/46","36/1957",0.578587038405616,0.766759722628719,0.746026480491004,"Zci_08785",1
"GO:0051726","GO:0051726","regulation of cell cycle","1/46","37/1957",0.588678134831093,0.776281115850127,0.755290414504107,"Zci_11436",1
"GO:0010038","GO:0010038","response to metal ion","2/46","83/1957",0.589332681987138,0.776281115850127,0.755290414504107,"Zci_02358/Zci_08079",2
"GO:0051234","GO:0051234","establishment of localization","6/46","262/1957",0.59458428828235,0.780839607503327,0.759725644190828,"Zci_07865/Zci_13725/Zci_03755/Zci_02600/Zci_13818/Zci_02768",6
"GO:0065009","GO:0065009","regulation of molecular function","2/46","85/1957",0.602589134351996,0.784911230084068,0.763687169782422,"Zci_12402/Zci_13818",2
"GO:0022414","GO:0022414","reproductive process","4/46","176/1957",0.605412814446849,0.784911230084068,0.763687169782422,"Zci_13095/Zci_07865/Zci_06303/Zci_03841",4
"GO:0018193","GO:0018193","peptidyl-amino acid modification","2/46","86/1957",0.609099993705768,0.784911230084068,0.763687169782422,"Zci_12385/Zci_02300",2
"GO:0009058","GO:0009058","biosynthetic process","7/46","310/1957",0.610141636390546,0.784911230084068,0.763687169782422,"Zci_01149/Zci_13261/Zci_02358/Zci_08785/Zci_02300/Zci_14336/Zci_04182",7
"GO:0043207","GO:0043207","response to external biotic stimulus","3/46","132/1957",0.610519247310881,0.784911230084068,0.763687169782422,"Zci_09678/Zci_12855/Zci_08079",3
"GO:0051707","GO:0051707","response to other organism","3/46","132/1957",0.610519247310881,0.784911230084068,0.763687169782422,"Zci_09678/Zci_12855/Zci_08079",3
"GO:0006508","GO:0006508","proteolysis","3/46","133/1957",0.615790585022163,0.784911230084068,0.763687169782422,"Zci_06970/Zci_09644/Zci_11175",3
"GO:0009607","GO:0009607","response to biotic stimulus","3/46","133/1957",0.615790585022163,0.784911230084068,0.763687169782422,"Zci_09678/Zci_12855/Zci_08079",3
"GO:0019439","GO:0019439","aromatic compound catabolic process","1/46","40/1957",0.61755393348445,0.784911230084068,0.763687169782422,"Zci_07025",1
"GO:0030001","GO:0030001","metal ion transport","1/46","40/1957",0.61755393348445,0.784911230084068,0.763687169782422,"Zci_13725",1
"GO:0031399","GO:0031399","regulation of protein modification process","1/46","40/1957",0.61755393348445,0.784911230084068,0.763687169782422,"Zci_12414",1
"GO:0000003","GO:0000003","reproduction","4/46","179/1957",0.61928775951587,0.784911230084068,0.763687169782422,"Zci_13095/Zci_07865/Zci_06303/Zci_03841",4
"GO:0007154","GO:0007154","cell communication","4/46","180/1957",0.623849004364139,0.78747762182977,0.766184166097048,"Zci_00238/Zci_06073/Zci_03841/Zci_09678",4
"GO:0048584","GO:0048584","positive regulation of response to stimulus","1/46","41/1957",0.626731043061766,0.78747762182977,0.766184166097048,"Zci_12414",1
"GO:0051049","GO:0051049","regulation of transport","1/46","41/1957",0.626731043061766,0.78747762182977,0.766184166097048,"Zci_13818",1
"GO:0009636","GO:0009636","response to toxic substance","1/46","42/1957",0.635692615096818,0.794160401668231,0.772686243052383,"Zci_12402",1
"GO:0044270","GO:0044270","cellular nitrogen compound catabolic process","1/46","42/1957",0.635692615096818,0.794160401668231,0.772686243052383,"Zci_07025",1
"GO:0006357","GO:0006357","regulation of transcription by RNA polymerase II","1/46","43/1957",0.644443601888226,0.798231279611552,0.776647044141612,"Zci_05011",1
"GO:0044264","GO:0044264","cellular polysaccharide metabolic process","1/46","43/1957",0.644443601888226,0.798231279611552,0.776647044141612,"Zci_13261",1
"GO:1903047","GO:1903047","mitotic cell cycle process","1/46","43/1957",0.644443601888226,0.798231279611552,0.776647044141612,"Zci_11436",1
"GO:0044249","GO:0044249","cellular biosynthetic process","6/46","276/1957",0.648269946302603,0.798729143315466,0.777131445572508,"Zci_01149/Zci_13261/Zci_02358/Zci_08785/Zci_02300/Zci_04182",6
"GO:0006520","GO:0006520","cellular amino acid metabolic process","1/46","44/1957",0.652988844476074,0.798729143315466,0.777131445572508,"Zci_04182",1
"GO:0046700","GO:0046700","heterocycle catabolic process","1/46","44/1957",0.652988844476074,0.798729143315466,0.777131445572508,"Zci_07025",1
"GO:0044283","GO:0044283","small molecule biosynthetic process","2/46","94/1957",0.658372609621549,0.798729143315466,0.777131445572508,"Zci_02358/Zci_08785",2
"GO:0009605","GO:0009605","response to external stimulus","4/46","188/1957",0.659155661557682,0.798729143315466,0.777131445572508,"Zci_06303/Zci_09678/Zci_12855/Zci_08079",4
"GO:0000278","GO:0000278","mitotic cell cycle","1/46","45/1957",0.661333075084595,0.798729143315466,0.777131445572508,"Zci_11436",1
"GO:0032787","GO:0032787","monocarboxylic acid metabolic process","1/46","45/1957",0.661333075084595,0.798729143315466,0.777131445572508,"Zci_02358",1
"GO:0050832","GO:0050832","defense response to fungus","1/46","45/1957",0.661333075084595,0.798729143315466,0.777131445572508,"Zci_12855",1
"GO:0098662","GO:0098662","inorganic cation transmembrane transport","1/46","45/1957",0.661333075084595,0.798729143315466,0.777131445572508,"Zci_13725",1
"GO:0000902","GO:0000902","cell morphogenesis","1/46","46/1957",0.669480919512476,0.804114823436473,0.782371496486959,"Zci_11436",1
"GO:0009555","GO:0009555","pollen development","1/46","46/1957",0.669480919512476,0.804114823436473,0.782371496486959,"Zci_06303",1
"GO:0044281","GO:0044281","small molecule metabolic process","4/46","191/1957",0.671840008550351,0.804731438813058,0.782971438536123,"Zci_05395/Zci_02358/Zci_08785/Zci_04182",4
"GO:0044271","GO:0044271","cellular nitrogen compound biosynthetic process","2/46","97/1957",0.675570194836274,0.806982479311275,0.78516161072536,"Zci_02300/Zci_04182",2
"GO:0098656","GO:0098656","anion transmembrane transport","1/46","47/1957",0.677436899471883,0.807001333797106,0.785179955384437,"Zci_02600",1
"GO:1901361","GO:1901361","organic cyclic compound catabolic process","1/46","48/1957",0.685205434877272,0.813534956641981,0.791536908562816,"Zci_07025",1
"GO:0034220","GO:0034220","ion transmembrane transport","2/46","99/1957",0.686653357899654,0.813534956641981,0.791536908562816,"Zci_13725/Zci_02600",2
"GO:0009620","GO:0009620","response to fungus","1/46","50/1957",0.700197356085094,0.827333461390518,0.804962300676916,"Zci_12855",1
"GO:1901576","GO:1901576","organic substance biosynthetic process","6/46","293/1957",0.707804388273467,0.834061387262788,0.811508302913818,"Zci_01149/Zci_13261/Zci_02358/Zci_08785/Zci_02300/Zci_04182",6
"GO:0051239","GO:0051239","regulation of multicellular organismal process","2/46","104/1957",0.713047670772476,0.835722538862364,0.813124536845806,"Zci_01546/Zci_09678",2
"GO:1901362","GO:1901362","organic cyclic compound biosynthetic process","2/46","104/1957",0.713047670772476,0.835722538862364,0.813124536845806,"Zci_08785/Zci_02300",2
"GO:0019752","GO:0019752","carboxylic acid metabolic process","2/46","106/1957",0.723089640170247,0.844460330041971,0.821626057476857,"Zci_02358/Zci_04182",2
"GO:0005976","GO:0005976","polysaccharide metabolic process","1/46","54/1957",0.728115554780528,0.844460330041971,0.821626057476857,"Zci_13261",1
"GO:0006820","GO:0006820","anion transport","1/46","54/1957",0.728115554780528,0.844460330041971,0.821626057476857,"Zci_02600",1
"GO:0005975","GO:0005975","carbohydrate metabolic process","3/46","157/1957",0.728250192880232,0.844460330041971,0.821626057476857,"Zci_13261/Zci_02358/Zci_11945",3
"GO:0032989","GO:0032989","cellular component morphogenesis","1/46","55/1957",0.734687643314473,0.849665285106393,0.826690270154216,"Zci_11436",1
"GO:0048468","GO:0048468","cell development","1/46","56/1957",0.741104240794775,0.852563189938052,0.829509815415343,"Zci_11436",1
"GO:0048585","GO:0048585","negative regulation of response to stimulus","1/46","56/1957",0.741104240794775,0.852563189938052,0.829509815415343,"Zci_10415",1
"GO:0006811","GO:0006811","ion transport","2/46","111/1957",0.746941886098106,0.853017959506016,0.829952287979055,"Zci_13725/Zci_02600",2
"GO:0022607","GO:0022607","cellular component assembly","2/46","111/1957",0.746941886098106,0.853017959506016,0.829952287979055,"Zci_11185/Zci_02300",2
"GO:0009966","GO:0009966","regulation of signal transduction","1/46","57/1957",0.747368946172702,0.853017959506016,0.829952287979055,"Zci_12414",1
"GO:0010646","GO:0010646","regulation of cell communication","1/46","60/1957",0.765286488225282,0.866662100951229,0.843227490785479,"Zci_12414",1
"GO:0023051","GO:0023051","regulation of signaling","1/46","60/1957",0.765286488225282,0.866662100951229,0.843227490785479,"Zci_12414",1
"GO:0098655","GO:0098655","cation transmembrane transport","1/46","60/1957",0.765286488225282,0.866662100951229,0.843227490785479,"Zci_13725",1
"GO:0048580","GO:0048580","regulation of post-embryonic development","1/46","62/1957",0.776534453121141,0.871175094919132,0.847618453047827,"Zci_01546",1
"GO:0009653","GO:0009653","anatomical structure morphogenesis","2/46","119/1957",0.781537421647861,0.871175094919132,0.847618453047827,"Zci_07865/Zci_11436",2
"GO:0009755","GO:0009755","hormone-mediated signaling pathway","1/46","63/1957",0.781958946607382,0.871175094919132,0.847618453047827,"Zci_00238",1
"GO:0071229","GO:0071229","cellular response to acid chemical","1/46","63/1957",0.781958946607382,0.871175094919132,0.847618453047827,"Zci_00238",1
"GO:0080134","GO:0080134","regulation of response to stress","1/46","63/1957",0.781958946607382,0.871175094919132,0.847618453047827,"Zci_10415",1
"GO:0034645","GO:0034645","cellular macromolecule biosynthetic process","2/46","120/1957",0.785566388502923,0.871175094919132,0.847618453047827,"Zci_13261/Zci_02300",2
"GO:0016053","GO:0016053","organic acid biosynthetic process","1/46","64/1957",0.78725455825261,0.871175094919132,0.847618453047827,"Zci_02358",1
"GO:0034654","GO:0034654","nucleobase-containing compound biosynthetic process","1/46","64/1957",0.78725455825261,0.871175094919132,0.847618453047827,"Zci_02300",1
"GO:0046394","GO:0046394","carboxylic acid biosynthetic process","1/46","64/1957",0.78725455825261,0.871175094919132,0.847618453047827,"Zci_02358",1
"GO:0007275","GO:0007275","multicellular organism development","5/46","275/1957",0.796438295835933,0.875812035432572,0.852130010331547,"Zci_13095/Zci_00238/Zci_07865/Zci_06303/Zci_03841",5
"GO:0042592","GO:0042592","homeostatic process","1/46","66/1957",0.797471050611769,0.875812035432572,0.852130010331547,"Zci_12402",1
"GO:0042742","GO:0042742","defense response to bacterium","1/46","66/1957",0.797471050611769,0.875812035432572,0.852130010331547,"Zci_08079",1
"GO:1901566","GO:1901566","organonitrogen compound biosynthetic process","2/46","124/1957",0.801054474584392,0.87680552853991,0.853096639308507,"Zci_01149/Zci_04182",2
"GO:0022402","GO:0022402","cell cycle process","1/46","67/1957",0.802397719925285,0.87680552853991,0.853096639308507,"Zci_11436",1
"GO:0006812","GO:0006812","cation transport","1/46","68/1957",0.807207087588479,0.877661571542586,0.853929534842255,"Zci_13725",1
"GO:0048316","GO:0048316","seed development","1/46","68/1957",0.807207087588479,0.877661571542586,0.853929534842255,"Zci_03841",1
"GO:0070887","GO:0070887","cellular response to chemical stimulus","2/46","128/1957",0.815570930652789,0.881156847012021,0.857330297792961,"Zci_00238/Zci_12402",2
"GO:0007049","GO:0007049","cell cycle","1/46","70/1957",0.816484784846001,0.881156847012021,0.857330297792961,"Zci_11436",1
"GO:0009409","GO:0009409","response to cold","1/46","70/1957",0.816484784846001,0.881156847012021,0.857330297792961,"Zci_01149",1
"GO:0010154","GO:0010154","fruit development","1/46","71/1957",0.820958393694482,0.883797184322949,0.859899240179016,"Zci_03841",1
"GO:0009617","GO:0009617","response to bacterium","1/46","72/1957",0.825325262140958,0.884463327512878,0.860547370805625,"Zci_08079",1
"GO:0006793","GO:0006793","phosphorus metabolic process","4/46","237/1957",0.827333838199159,0.884463327512878,0.860547370805625,"Zci_06073/Zci_02358/Zci_03841/Zci_09678",4
"GO:0048856","GO:0048856","anatomical structure development","6/46","338/1957",0.832405292248758,0.884463327512878,0.860547370805625,"Zci_13095/Zci_00238/Zci_07865/Zci_11436/Zci_06303/Zci_03841",6
"GO:0009059","GO:0009059","macromolecule biosynthetic process","2/46","133/1957",0.832417506896602,0.884463327512878,0.860547370805625,"Zci_13261/Zci_02300",2
"GO:0032870","GO:0032870","cellular response to hormone stimulus","1/46","74/1957",0.833748687173837,0.884463327512878,0.860547370805625,"Zci_00238",1
"GO:0065003","GO:0065003","protein-containing complex assembly","1/46","74/1957",0.833748687173837,0.884463327512878,0.860547370805625,"Zci_02300",1
"GO:0055085","GO:0055085","transmembrane transport","3/46","190/1957",0.839985417576032,0.888916606949393,0.864880233222128,"Zci_13725/Zci_03755/Zci_02600",3
"GO:0071495","GO:0071495","cellular response to endogenous stimulus","1/46","78/1957",0.849420540949446,0.89672483257617,0.872477323824714,"Zci_00238",1
"GO:0032502","GO:0032502","developmental process","6/46","354/1957",0.86539553203549,0.911382734220951,0.886738874676589,"Zci_13095/Zci_00238/Zci_07865/Zci_11436/Zci_06303/Zci_03841",6
"GO:0043933","GO:0043933","protein-containing complex organization","1/46","84/1957",0.870254392302822,0.912748781797575,0.888067984221204,"Zci_02300",1
"GO:0032501","GO:0032501","multicellular organismal process","5/46","307/1957",0.870879571623374,0.912748781797575,0.888067984221204,"Zci_13095/Zci_00238/Zci_07865/Zci_06303/Zci_03841",5
"GO:1901701","GO:1901701","cellular response to oxygen-containing compound","1/46","86/1957",0.876550776289646,0.914742348321038,0.890007644551855,"Zci_00238",1
"GO:0018130","GO:0018130","heterocycle biosynthetic process","1/46","87/1957",0.879585872115769,0.914742348321038,0.890007644551855,"Zci_02300",1
"GO:0030154","GO:0030154","cell differentiation","1/46","87/1957",0.879585872115769,0.914742348321038,0.890007644551855,"Zci_11436",1
"GO:2000026","GO:2000026","regulation of multicellular organismal development","1/46","88/1957",0.882547930876557,0.914742348321038,0.890007644551855,"Zci_01546",1
"GO:0042221","GO:0042221","response to chemical","6/46","364/1957",0.88327185468614,0.914742348321038,0.890007644551855,"Zci_00238/Zci_06303/Zci_02358/Zci_12402/Zci_05011/Zci_08079",6
"GO:0009737","GO:0009737","response to abscisic acid","1/46","91/1957",0.891012882142883,0.920572551218713,0.895680198312751,"Zci_05011",1
"GO:0019438","GO:0019438","aromatic compound biosynthetic process","1/46","92/1957",0.893699595659189,0.921165540679448,0.896257153292655,"Zci_02300",1
"GO:0001101","GO:0001101","response to acid chemical","2/46","159/1957",0.899957849296003,0.925428354464758,0.900404700263876,"Zci_00238/Zci_05011",2
"GO:0010035","GO:0010035","response to inorganic substance","2/46","161/1957",0.903960283036186,0.927356902126534,0.902281099847884,"Zci_02358/Zci_08079",2
"GO:0071310","GO:0071310","cellular response to organic substance","1/46","99/1957",0.91077470360799,0.929971360124318,0.904824862699421,"Zci_00238",1
"GO:0097305","GO:0097305","response to alcohol","1/46","99/1957",0.91077470360799,0.929971360124318,0.904824862699421,"Zci_05011",1
"GO:0033993","GO:0033993","response to lipid","1/46","106/1957",0.925157122141195,0.942449778629816,0.91696586380448,"Zci_05011",1
"GO:0048869","GO:0048869","cellular developmental process","1/46","109/1957",0.930602330468493,0.945786983879401,0.920212830766293,"Zci_11436",1
"GO:0009266","GO:0009266","response to temperature stimulus","1/46","113/1957",0.937263523304839,0.948885391307576,0.923227457018235,"Zci_01149",1
"GO:0009725","GO:0009725","response to hormone","2/46","182/1957",0.938003678104507,0.948885391307576,0.923227457018235,"Zci_00238/Zci_05011",2
"GO:1901135","GO:1901135","carbohydrate derivative metabolic process","1/46","116/1957",0.941844828079803,0.94959767288432,0.923920478446115,"Zci_05395",1
"GO:0009719","GO:0009719","response to endogenous stimulus","2/46","186/1957",0.943063743942456,0.94959767288432,0.923920478446115,"Zci_00238/Zci_05011",2
"GO:0009628","GO:0009628","response to abiotic stimulus","4/46","317/1957",0.95516976411558,0.95957146809768,0.933624581466356,"Zci_01149/Zci_13725/Zci_15239/Zci_08079",4
"GO:1901700","GO:1901700","response to oxygen-containing compound","2/46","213/1957",0.96838967204519,0.970615855199316,0.944370327487505,"Zci_00238/Zci_05011",2
"GO:0010033","GO:0010033","response to organic substance","2/46","234/1957",0.980306479947409,0.980306479947409,0.953798916993737,"Zci_00238/Zci_05011",2
