"","ID","Description","GeneRatio","BgRatio","pvalue","p.adjust","qvalue","geneID","Count"
"GO:0031329","GO:0031329","regulation of cellular catabolic process","2/4","21/1957",0.000649824517713099,0.0846888159813772,0.0706839074525353,"Zci_04741/Zci_12972",2
"GO:0009894","GO:0009894","regulation of catabolic process","2/4","26/1957",0.00100223450865535,0.0846888159813772,0.0706839074525353,"Zci_04741/Zci_12972",2
"GO:0033554","GO:0033554","cellular response to stress","3/4","155/1957",0.00183819113341859,0.103551433849247,0.0864272322379265,"Zci_06656/Zci_04741/Zci_12972",3
"GO:0006974","GO:0006974","cellular response to DNA damage stimulus","2/4","66/1957",0.0064343677462169,0.232717446951948,0.194233185247967,"Zci_06656/Zci_04741",2
"GO:0051716","GO:0051716","cellular response to stimulus","3/4","305/1957",0.0132758733793744,0.232717446951948,0.194233185247967,"Zci_06656/Zci_04741/Zci_12972",3
"GO:0070417","GO:0070417","cellular response to cold","1/4","10/1957",0.020298762824665,0.232717446951948,0.194233185247967,"Zci_12972",1
"GO:0000075","GO:0000075","cell cycle checkpoint signaling","1/4","11/1957",0.0223115029113117,0.232717446951948,0.194233185247967,"Zci_04741",1
"GO:0008285","GO:0008285","negative regulation of cell population proliferation","1/4","11/1957",0.0223115029113117,0.232717446951948,0.194233185247967,"Zci_04741",1
"GO:0043271","GO:0043271","negative regulation of ion transport","1/4","11/1957",0.0223115029113117,0.232717446951948,0.194233185247967,"Zci_12972",1
"GO:0018106","GO:0018106","peptidyl-histidine phosphorylation","1/4","12/1957",0.0243211401098495,0.232717446951948,0.194233185247967,"Zci_12972",1
"GO:0018202","GO:0018202","peptidyl-histidine modification","1/4","12/1957",0.0243211401098495,0.232717446951948,0.194233185247967,"Zci_12972",1
"GO:0051051","GO:0051051","negative regulation of transport","1/4","12/1957",0.0243211401098495,0.232717446951948,0.194233185247967,"Zci_12972",1
"GO:1903311","GO:1903311","regulation of mRNA metabolic process","1/4","12/1957",0.0243211401098495,0.232717446951948,0.194233185247967,"Zci_04741",1
"GO:0090056","GO:0090056","regulation of chlorophyll metabolic process","1/4","13/1957",0.026327677610909,0.232717446951948,0.194233185247967,"Zci_12972",1
"GO:0010959","GO:0010959","regulation of metal ion transport","1/4","15/1957",0.030331466274908,0.232717446951948,0.194233185247967,"Zci_12972",1
"GO:0045786","GO:0045786","negative regulation of cell cycle","1/4","15/1957",0.030331466274908,0.232717446951948,0.194233185247967,"Zci_04741",1
"GO:0071368","GO:0071368","cellular response to cytokinin stimulus","1/4","15/1957",0.030331466274908,0.232717446951948,0.194233185247967,"Zci_12972",1
"GO:1901401","GO:1901401","regulation of tetrapyrrole metabolic process","1/4","15/1957",0.030331466274908,0.232717446951948,0.194233185247967,"Zci_12972",1
"GO:0042127","GO:0042127","regulation of cell population proliferation","1/4","16/1957",0.0323287238109019,0.232717446951948,0.194233185247967,"Zci_04741",1
"GO:0006950","GO:0006950","response to stress","3/4","419/1957",0.0328041286632121,0.232717446951948,0.194233185247967,"Zci_06656/Zci_04741/Zci_12972",3
"GO:0023052","GO:0023052","signaling","2/4","155/1957",0.0336245784990353,0.232717446951948,0.194233185247967,"Zci_04741/Zci_12972",2
"GO:0009736","GO:0009736","cytokinin-activated signaling pathway","1/4","17/1957",0.0343228943955265,0.232717446951948,0.194233185247967,"Zci_12972",1
"GO:0007165","GO:0007165","signal transduction","2/4","165/1957",0.0378463980066464,0.232717446951948,0.194233185247967,"Zci_04741/Zci_12972",2
"GO:0006302","GO:0006302","double-strand break repair","1/4","20/1957",0.0402869162572187,0.232717446951948,0.194233185247967,"Zci_06656",1
"GO:0010087","GO:0010087","phloem or xylem histogenesis","1/4","20/1957",0.0402869162572187,0.232717446951948,0.194233185247967,"Zci_12972",1
"GO:0048519","GO:0048519","negative regulation of biological process","2/4","172/1957",0.0409298600835397,0.232717446951948,0.194233185247967,"Zci_04741/Zci_12972",2
"GO:0007346","GO:0007346","regulation of mitotic cell cycle","1/4","21/1957",0.042268770844194,0.232717446951948,0.194233185247967,"Zci_04741",1
"GO:0010564","GO:0010564","regulation of cell cycle process","1/4","21/1957",0.042268770844194,0.232717446951948,0.194233185247967,"Zci_04741",1
"GO:0043161","GO:0043161","proteasome-mediated ubiquitin-dependent protein catabolic process","1/4","21/1957",0.042268770844194,0.232717446951948,0.194233185247967,"Zci_06656",1
"GO:0048509","GO:0048509","regulation of meristem development","1/4","21/1957",0.042268770844194,0.232717446951948,0.194233185247967,"Zci_12972",1
"GO:0010498","GO:0010498","proteasomal protein catabolic process","1/4","22/1957",0.0442475543755076,0.232717446951948,0.194233185247967,"Zci_06656",1
"GO:0007154","GO:0007154","cell communication","2/4","180/1957",0.0445802852422678,0.232717446951948,0.194233185247967,"Zci_04741/Zci_12972",2
"GO:0010029","GO:0010029","regulation of seed germination","1/4","23/1957",0.0462232700253773,0.232717446951948,0.194233185247967,"Zci_12972",1
"GO:0009909","GO:0009909","regulation of flower development","1/4","24/1957",0.0481959209663798,0.232717446951948,0.194233185247967,"Zci_12972",1
"GO:1900140","GO:1900140","regulation of seedling development","1/4","24/1957",0.0481959209663798,0.232717446951948,0.194233185247967,"Zci_12972",1
"GO:0010608","GO:0010608","post-transcriptional regulation of gene expression","1/4","25/1957",0.0501655103694497,0.235499201456583,0.196554923669774,"Zci_04741",1
"GO:0043269","GO:0043269","regulation of ion transport","1/4","26/1957",0.0521320414038815,0.236389950602971,0.197298370481458,"Zci_12972",1
"GO:0048366","GO:0048366","leaf development","1/4","27/1957",0.0540955172373279,0.236389950602971,0.197298370481458,"Zci_00396",1
"GO:0006364","GO:0006364","rRNA processing","1/4","28/1957",0.0560559410357997,0.236389950602971,0.197298370481458,"Zci_00396",1
"GO:0000160","GO:0000160","phosphorelay signal transduction system","1/4","30/1957",0.0599676451836597,0.236389950602971,0.197298370481458,"Zci_12972",1
"GO:0006511","GO:0006511","ubiquitin-dependent protein catabolic process","1/4","31/1957",0.0619189318568643,0.236389950602971,0.197298370481458,"Zci_06656",1
"GO:0019941","GO:0019941","modification-dependent protein catabolic process","1/4","31/1957",0.0619189318568643,0.236389950602971,0.197298370481458,"Zci_06656",1
"GO:0048831","GO:0048831","regulation of shoot system development","1/4","31/1957",0.0619189318568643,0.236389950602971,0.197298370481458,"Zci_12972",1
"GO:0051171","GO:0051171","regulation of nitrogen compound metabolic process","2/4","222/1957",0.0658482557016902,0.236389950602971,0.197298370481458,"Zci_04741/Zci_12972",2
"GO:0051253","GO:0051253","negative regulation of RNA metabolic process","1/4","34/1957",0.0677545681820086,0.236389950602971,0.197298370481458,"Zci_04741",1
"GO:0032446","GO:0032446","protein modification by small protein conjugation","1/4","35/1957",0.0696937162461124,0.236389950602971,0.197298370481458,"Zci_06656",1
"GO:0043632","GO:0043632","modification-dependent macromolecule catabolic process","1/4","35/1957",0.0696937162461124,0.236389950602971,0.197298370481458,"Zci_06656",1
"GO:0016567","GO:0016567","protein ubiquitination","1/4","36/1957",0.0716298375442477,0.236389950602971,0.197298370481458,"Zci_06656",1
"GO:0051726","GO:0051726","regulation of cell cycle","1/4","37/1957",0.0735629352276537,0.236389950602971,0.197298370481458,"Zci_04741",1
"GO:0048827","GO:0048827","phyllome development","1/4","39/1957",0.0774200723470319,0.236389950602971,0.197298370481458,"Zci_00396",1
"GO:0031323","GO:0031323","regulation of cellular metabolic process","2/4","245/1957",0.0788938430390387,0.236389950602971,0.197298370481458,"Zci_04741/Zci_12972",2
"GO:0009735","GO:0009735","response to cytokinin","1/4","40/1957",0.079344118077278,0.236389950602971,0.197298370481458,"Zci_12972",1
"GO:0070647","GO:0070647","protein modification by small protein conjugation or removal","1/4","40/1957",0.079344118077278,0.236389950602971,0.197298370481458,"Zci_06656",1
"GO:0051049","GO:0051049","regulation of transport","1/4","41/1957",0.0812651527813422,0.236389950602971,0.197298370481458,"Zci_12972",1
"GO:0009636","GO:0009636","response to toxic substance","1/4","42/1957",0.0831831796022581,0.236389950602971,0.197298370481458,"Zci_12972",1
"GO:0006464","GO:0006464","cellular protein modification process","2/4","255/1957",0.0848527034323012,0.236389950602971,0.197298370481458,"Zci_06656/Zci_12972",2
"GO:1903047","GO:1903047","mitotic cell cycle process","1/4","43/1957",0.0850982016814177,0.236389950602971,0.197298370481458,"Zci_04741",1
"GO:0036211","GO:0036211","protein modification process","2/4","256/1957",0.0854578264378597,0.236389950602971,0.197298370481458,"Zci_06656/Zci_12972",2
"GO:0000278","GO:0000278","mitotic cell cycle","1/4","45/1957",0.0889192441718321,0.236389950602971,0.197298370481458,"Zci_04741",1
"GO:0045934","GO:0045934","negative regulation of nucleobase-containing compound metabolic process","1/4","45/1957",0.0889192441718321,0.236389950602971,0.197298370481458,"Zci_04741",1
"GO:0071215","GO:0071215","cellular response to abscisic acid stimulus","1/4","46/1957",0.0908252708576652,0.236389950602971,0.197298370481458,"Zci_12972",1
"GO:0097306","GO:0097306","cellular response to alcohol","1/4","46/1957",0.0908252708576652,0.236389950602971,0.197298370481458,"Zci_12972",1
"GO:0051603","GO:0051603","proteolysis involved in cellular protein catabolic process","1/4","47/1957",0.0927283053508987,0.236389950602971,0.197298370481458,"Zci_06656",1
"GO:0006139","GO:0006139","nucleobase-containing compound metabolic process","2/4","273/1957",0.0959945120536582,0.236389950602971,0.197298370481458,"Zci_00396/Zci_06656",2
"GO:0044257","GO:0044257","cellular protein catabolic process","1/4","49/1957",0.0965254102906703,0.236389950602971,0.197298370481458,"Zci_06656",1
"GO:0010628","GO:0010628","positive regulation of gene expression","1/4","53/1957",0.104083851609237,0.236389950602971,0.197298370481458,"Zci_04741",1
"GO:0032879","GO:0032879","regulation of localization","1/4","53/1957",0.104083851609237,0.236389950602971,0.197298370481458,"Zci_12972",1
"GO:0071396","GO:0071396","cellular response to lipid","1/4","53/1957",0.104083851609237,0.236389950602971,0.197298370481458,"Zci_12972",1
"GO:2000241","GO:2000241","regulation of reproductive process","1/4","53/1957",0.104083851609237,0.236389950602971,0.197298370481458,"Zci_12972",1
"GO:0019222","GO:0019222","regulation of metabolic process","2/4","287/1957",0.105013970608827,0.236389950602971,0.197298370481458,"Zci_04741/Zci_12972",2
"GO:0043412","GO:0043412","macromolecule modification","2/4","291/1957",0.107645602592631,0.236389950602971,0.197298370481458,"Zci_06656/Zci_12972",2
"GO:0030163","GO:0030163","protein catabolic process","1/4","55/1957",0.107845238000837,0.236389950602971,0.197298370481458,"Zci_06656",1
"GO:0044267","GO:0044267","cellular protein metabolic process","2/4","299/1957",0.112979642549418,0.236389950602971,0.197298370481458,"Zci_06656/Zci_12972",2
"GO:0044265","GO:0044265","cellular macromolecule catabolic process","1/4","61/1957",0.119058359630258,0.236389950602971,0.197298370481458,"Zci_06656",1
"GO:0015833","GO:0015833","peptide transport","1/4","62/1957",0.120916886297705,0.236389950602971,0.197298370481458,"Zci_06656",1
"GO:0034613","GO:0034613","cellular protein localization","1/4","62/1957",0.120916886297705,0.236389950602971,0.197298370481458,"Zci_06656",1
"GO:0040007","GO:0040007","growth","1/4","62/1957",0.120916886297705,0.236389950602971,0.197298370481458,"Zci_12972",1
"GO:0048580","GO:0048580","regulation of post-embryonic development","1/4","62/1957",0.120916886297705,0.236389950602971,0.197298370481458,"Zci_12972",1
"GO:0006886","GO:0006886","intracellular protein transport","1/4","63/1957",0.122772470706575,0.236389950602971,0.197298370481458,"Zci_06656",1
"GO:0009414","GO:0009414","response to water deprivation","1/4","63/1957",0.122772470706575,0.236389950602971,0.197298370481458,"Zci_12972",1
"GO:0009415","GO:0009415","response to water","1/4","63/1957",0.122772470706575,0.236389950602971,0.197298370481458,"Zci_12972",1
"GO:0009755","GO:0009755","hormone-mediated signaling pathway","1/4","63/1957",0.122772470706575,0.236389950602971,0.197298370481458,"Zci_12972",1
"GO:0071229","GO:0071229","cellular response to acid chemical","1/4","63/1957",0.122772470706575,0.236389950602971,0.197298370481458,"Zci_12972",1
"GO:0006281","GO:0006281","DNA repair","1/4","64/1957",0.124625115963795,0.236389950602971,0.197298370481458,"Zci_06656",1
"GO:0045184","GO:0045184","establishment of protein localization","1/4","64/1957",0.124625115963795,0.236389950602971,0.197298370481458,"Zci_06656",1
"GO:0048367","GO:0048367","shoot system development","1/4","64/1957",0.124625115963795,0.236389950602971,0.197298370481458,"Zci_00396",1
"GO:0015031","GO:0015031","protein transport","1/4","65/1957",0.126474825174648,0.236389950602971,0.197298370481458,"Zci_06656",1
"GO:0035556","GO:0035556","intracellular signal transduction","1/4","65/1957",0.126474825174648,0.236389950602971,0.197298370481458,"Zci_04741",1
"GO:0042886","GO:0042886","amide transport","1/4","65/1957",0.126474825174648,0.236389950602971,0.197298370481458,"Zci_06656",1
"GO:0051172","GO:0051172","negative regulation of nitrogen compound metabolic process","1/4","65/1957",0.126474825174648,0.236389950602971,0.197298370481458,"Zci_04741",1
"GO:0031324","GO:0031324","negative regulation of cellular metabolic process","1/4","66/1957",0.128321601442778,0.236389950602971,0.197298370481458,"Zci_04741",1
"GO:0022402","GO:0022402","cell cycle process","1/4","67/1957",0.130165447870186,0.236389950602971,0.197298370481458,"Zci_04741",1
"GO:0019538","GO:0019538","protein metabolic process","2/4","326/1957",0.131648380693862,0.236389950602971,0.197298370481458,"Zci_06656/Zci_12972",2
"GO:0009651","GO:0009651","response to salt stress","1/4","69/1957",0.133844363602638,0.236389950602971,0.197298370481458,"Zci_12972",1
"GO:0007049","GO:0007049","cell cycle","1/4","70/1957",0.135679439103481,0.236389950602971,0.197298370481458,"Zci_04741",1
"GO:0008104","GO:0008104","protein localization","1/4","70/1957",0.135679439103481,0.236389950602971,0.197298370481458,"Zci_06656",1
"GO:0009409","GO:0009409","response to cold","1/4","70/1957",0.135679439103481,0.236389950602971,0.197298370481458,"Zci_12972",1
"GO:0070727","GO:0070727","cellular macromolecule localization","1/4","71/1957",0.137511597155195,0.237137346114572,0.197922169911882,"Zci_06656",1
"GO:0048856","GO:0048856","anatomical structure development","2/4","338/1957",0.14025771895803,0.239429843473808,0.199835559174652,"Zci_00396/Zci_12972",2
"GO:0032870","GO:0032870","cellular response to hormone stimulus","1/4","74/1957",0.142990597545327,0.241654109851602,0.201692000748145,"Zci_12972",1
"GO:0071495","GO:0071495","cellular response to endogenous stimulus","1/4","78/1957",0.150255274613665,0.249503403190114,0.208243263951886,"Zci_12972",1
"GO:0032502","GO:0032502","developmental process","2/4","354/1957",0.152015906177222,0.249503403190114,0.208243263951886,"Zci_00396/Zci_12972",2
"GO:0046907","GO:0046907","intracellular transport","1/4","79/1957",0.152064204311135,0.249503403190114,0.208243263951886,"Zci_06656",1
"GO:0009057","GO:0009057","macromolecule catabolic process","1/4","83/1957",0.159271057242512,0.251578045023584,0.209974824248896,"Zci_06656",1
"GO:0010604","GO:0010604","positive regulation of macromolecule metabolic process","1/4","85/1957",0.162857207259226,0.251578045023584,0.209974824248896,"Zci_04741",1
"GO:0065009","GO:0065009","regulation of molecular function","1/4","85/1957",0.162857207259226,0.251578045023584,0.209974824248896,"Zci_06656",1
"GO:0006970","GO:0006970","response to osmotic stress","1/4","86/1957",0.164645973910382,0.251578045023584,0.209974824248896,"Zci_12972",1
"GO:0018193","GO:0018193","peptidyl-amino acid modification","1/4","86/1957",0.164645973910382,0.251578045023584,0.209974824248896,"Zci_12972",1
"GO:1901701","GO:1901701","cellular response to oxygen-containing compound","1/4","86/1957",0.164645973910382,0.251578045023584,0.209974824248896,"Zci_12972",1
"GO:0009888","GO:0009888","tissue development","1/4","88/1957",0.168214905844172,0.251578045023584,0.209974824248896,"Zci_12972",1
"GO:0051649","GO:0051649","establishment of localization in cell","1/4","88/1957",0.168214905844172,0.251578045023584,0.209974824248896,"Zci_06656",1
"GO:1901565","GO:1901565","organonitrogen compound catabolic process","1/4","88/1957",0.168214905844172,0.251578045023584,0.209974824248896,"Zci_06656",1
"GO:2000026","GO:2000026","regulation of multicellular organismal development","1/4","88/1957",0.168214905844172,0.251578045023584,0.209974824248896,"Zci_12972",1
"GO:0010605","GO:0010605","negative regulation of macromolecule metabolic process","1/4","90/1957",0.171772389728629,0.252839801954499,0.211027925642497,"Zci_04741",1
"GO:0006259","GO:0006259","DNA metabolic process","1/4","91/1957",0.173546846311964,0.252839801954499,0.211027925642497,"Zci_06656",1
"GO:0009737","GO:0009737","response to abscisic acid","1/4","91/1957",0.173546846311964,0.252839801954499,0.211027925642497,"Zci_12972",1
"GO:0009892","GO:0009892","negative regulation of metabolic process","1/4","95/1957",0.180616174989493,0.259927615909139,0.216943634580035,"Zci_04741",1
"GO:0033036","GO:0033036","macromolecule localization","1/4","97/1957",0.184133783525165,0.259927615909139,0.216943634580035,"Zci_06656",1
"GO:0071705","GO:0071705","nitrogen compound transport","1/4","97/1957",0.184133783525165,0.259927615909139,0.216943634580035,"Zci_06656",1
"GO:0009893","GO:0009893","positive regulation of metabolic process","1/4","98/1957",0.185888334528337,0.259927615909139,0.216943634580035,"Zci_04741",1
"GO:0071310","GO:0071310","cellular response to organic substance","1/4","99/1957",0.187640054088254,0.259927615909139,0.216943634580035,"Zci_12972",1
"GO:0097305","GO:0097305","response to alcohol","1/4","99/1957",0.187640054088254,0.259927615909139,0.216943634580035,"Zci_12972",1
"GO:0051239","GO:0051239","regulation of multicellular organismal process","1/4","104/1957",0.196356286855981,0.269790345354966,0.225175373887047,"Zci_12972",1
"GO:0033993","GO:0033993","response to lipid","1/4","106/1957",0.19982306640831,0.270160785784036,0.225484554936535,"Zci_12972",1
"GO:0051641","GO:0051641","cellular localization","1/4","106/1957",0.19982306640831,0.270160785784036,0.225484554936535,"Zci_06656",1
"GO:0099402","GO:0099402","plant organ development","1/4","109/1957",0.205002190020796,0.274963254869162,0.22949284430064,"Zci_00396",1
"GO:0009266","GO:0009266","response to temperature stimulus","1/4","113/1957",0.211868530188634,0.281935288203773,0.235311919148587,"Zci_12972",1
"GO:0050793","GO:0050793","regulation of developmental process","1/4","116/1957",0.216989022784247,0.286493319144826,0.239116192870799,"Zci_12972",1
"GO:0050794","GO:0050794","regulation of cellular process","2/4","439/1957",0.219080800286944,0.287012831383671,0.239549793867405,"Zci_04741/Zci_12972",2
"GO:0048523","GO:0048523","negative regulation of cellular process","1/4","119/1957",0.222084523870756,0.288709881031983,0.240966204037905,"Zci_04741",1
"GO:0048522","GO:0048522","positive regulation of cellular process","1/4","121/1957",0.225467680650919,0.290015861005051,0.242056215351459,"Zci_04741",1
"GO:1901564","GO:1901564","organonitrogen compound metabolic process","2/4","448/1957",0.226565593856901,0.290015861005051,0.242056215351459,"Zci_06656/Zci_12972",2
"GO:0044260","GO:0044260","cellular macromolecule metabolic process","2/4","450/1957",0.228237334400424,0.290015861005051,0.242056215351459,"Zci_06656/Zci_12972",2
"GO:0071702","GO:0071702","organic substance transport","1/4","125/1957",0.232200877182341,0.292850360028474,0.244421975981411,"Zci_06656",1
"GO:0065008","GO:0065008","regulation of biological quality","1/4","128/1957",0.237221891907997,0.294783086268026,0.246035089130585,"Zci_04741",1
"GO:0070887","GO:0070887","cellular response to chemical stimulus","1/4","128/1957",0.237221891907997,0.294783086268026,0.246035089130585,"Zci_12972",1
"GO:0006508","GO:0006508","proteolysis","1/4","133/1957",0.245535475286944,0.30271819177774,0.25265797382882,"Zci_06656",1
"GO:0044248","GO:0044248","cellular catabolic process","1/4","134/1957",0.24719000275342,0.30271819177774,0.25265797382882,"Zci_06656",1
"GO:1901575","GO:1901575","organic substance catabolic process","1/4","139/1957",0.255421858510981,0.310548878333494,0.259193707235679,"Zci_06656",1
"GO:0051252","GO:0051252","regulation of RNA metabolic process","1/4","147/1957",0.268452175374483,0.324060125987769,0.270470612783314,"Zci_04741",1
"GO:0009056","GO:0009056","catabolic process","1/4","150/1957",0.273294175981057,0.327173076847704,0.273068777935798,"Zci_06656",1
"GO:0016310","GO:0016310","phosphorylation","1/4","151/1957",0.27490282196671,0.327173076847704,0.273068777935798,"Zci_12972",1
"GO:0048518","GO:0048518","positive regulation of biological process","1/4","155/1957",0.281310713815529,0.332458116327443,0.277479835489738,"Zci_04741",1
"GO:0001101","GO:0001101","response to acid chemical","1/4","159/1957",0.28767604025794,0.336660501954032,0.28098727662311,"Zci_12972",1
"GO:0006468","GO:0006468","protein phosphorylation","1/4","160/1957",0.289260743171716,0.336660501954032,0.28098727662311,"Zci_12972",1
"GO:0010035","GO:0010035","response to inorganic substance","1/4","161/1957",0.290842800504667,0.336660501954032,0.28098727662311,"Zci_12972",1
"GO:0019219","GO:0019219","regulation of nucleobase-containing compound metabolic process","1/4","168/1957",0.301843372836255,0.347017210947804,0.289631306552511,"Zci_04741",1
"GO:0009725","GO:0009725","response to hormone","1/4","182/1957",0.323460078302387,0.369356440764213,0.30827631929246,"Zci_12972",1
"GO:0009719","GO:0009719","response to endogenous stimulus","1/4","186/1957",0.32954300854344,0.373776969421754,0.31196582935232,"Zci_12972",1
"GO:0010468","GO:0010468","regulation of gene expression","1/4","191/1957",0.337088878952024,0.37978680361928,0.316981823014535,"Zci_04741",1
"GO:0090304","GO:0090304","nucleic acid metabolic process","1/4","206/1957",0.359344682293989,0.402180472236319,0.335672272062701,"Zci_06656",1
"GO:1901700","GO:1901700","response to oxygen-containing compound","1/4","213/1957",0.369536726984169,0.409778324702302,0.342013674930604,"Zci_12972",1
"GO:0048731","GO:0048731","system development","1/4","214/1957",0.370982743665398,0.409778324702302,0.342013674930604,"Zci_00396",1
"GO:0080090","GO:0080090","regulation of primary metabolic process","1/4","216/1957",0.373867313361997,0.410282960767386,0.342434859812082,"Zci_04741",1
"GO:0010033","GO:0010033","response to organic substance","1/4","234/1957",0.39938421124699,0.435457623875751,0.363446412951421,"Zci_12972",1
"GO:0006793","GO:0006793","phosphorus metabolic process","1/4","237/1957",0.403559973232714,0.437189971002106,0.364892283489768,"Zci_12972",1
"GO:0006796","GO:0006796","phosphate-containing compound metabolic process","1/4","240/1957",0.407713923394145,0.437574949244836,0.365213598248571,"Zci_12972",1
"GO:0060255","GO:0060255","regulation of macromolecule metabolic process","1/4","241/1957",0.409093739530675,0.437574949244836,0.365213598248571,"Zci_04741",1
"GO:0006810","GO:0006810","transport","1/4","255/1957",0.428159155252475,0.455087404010492,0.379830035113086,"Zci_06656",1
"GO:0051234","GO:0051234","establishment of localization","1/4","262/1957",0.437516965184942,0.462127294476594,0.385705745623567,"Zci_06656",1
"GO:0007275","GO:0007275","multicellular organism development","1/4","275/1957",0.454590515971138,0.477178864590822,0.398268251978637,"Zci_00396",1
"GO:0051179","GO:0051179","localization","1/4","287/1957",0.470002944584339,0.490311713794774,0.409229334465896,"Zci_06656",1
"GO:0046483","GO:0046483","heterocycle metabolic process","1/4","305/1957",0.492506225713781,0.510051882231569,0.425705090121646,"Zci_06656",1
"GO:0032501","GO:0032501","multicellular organismal process","1/4","307/1957",0.494961589857854,0.510051882231569,0.425705090121646,"Zci_00396",1
"GO:0006725","GO:0006725","cellular aromatic compound metabolic process","1/4","312/1957",0.501061020434411,0.513207954263124,0.428339245538827,"Zci_06656",1
"GO:0009628","GO:0009628","response to abiotic stimulus","1/4","317/1957",0.507105035635868,0.514394730074292,0.429329765368765,"Zci_12972",1
"GO:0034641","GO:0034641","cellular nitrogen compound metabolic process","1/4","318/1957",0.50830721847578,0.514394730074292,0.429329765368765,"Zci_06656",1
"GO:1901360","GO:1901360","organic cyclic compound metabolic process","1/4","326/1957",0.5178456902352,0.520928105058028,0.434782722377925,"Zci_06656",1
"GO:0042221","GO:0042221","response to chemical","1/4","364/1957",0.561272208499823,0.561272208499823,0.468455160006081,"Zci_12972",1
