"","x"
"1","Pp3c1_28340V3"
"2","Pp3c2_17250V3"
"3","Pp3c20_14400V3"
"4","Pp3c22_810V3"
"5","Pp3c23_8390V3"
"6","Pp3c4_18030V3"
"7","Pp3c17_2620V3"
"8","Pp3c2_10530V3"
"9","Pp3c6_17860V3"
"10","Pp3c19_15000V3"
"11","Pp3c11_7720V3"
"12","Pp3c22_9250V3"
"13","Pp3c4_24420V3"
"14","Pp3c24_12180V3"
"15","Pp3c5_21760V3"
"16","Pp3c5_20400V3"
"17","Pp3c5_10370V3"
"18","Pp3c10_1440V3"
"19","Pp3c8_14060V3"
"20","Pp3c2_12240V3"
