{
	"n_targets": 87533,
	"n_bootstraps": 100,
	"n_processed": 29836739,
	"n_pseudoaligned": 27858123,
	"n_unique": 2024818,
	"p_pseudoaligned": 93.4,
	"p_unique": 6.8,
	"kallisto_version": "0.48.0",
	"index_version": 10,
	"start_time": "Fri Mar  3 18:18:12 2023",
	"call": "kallisto quant --bootstrap-samples 100 --rf-stranded -t 20 -i /scratch/users/dadras/Stress_profiling_of_physcomitrium_patens/kallisto_index/Ppatens_318_v3.3.transcript.fa.idx -o /scratch/users/dadras/Stress_profiling_of_physcomitrium_patens/kallisto/P_1_53_EKRN220057222-1A_HKHYCDSX5_L2 /scratch/users/dadras/Stress_profiling_of_physcomitrium_patens/trimmed_reads_PE/P_1_53_EKRN220057222-1A_HKHYCDSX5_L2_1.fq.gz /scratch/users/dadras/Stress_profiling_of_physcomitrium_patens/trimmed_reads_PE/P_1_53_EKRN220057222-1A_HKHYCDSX5_L2_2.fq.gz"
}
