"","ID","Description","GeneRatio","BgRatio","pvalue","p.adjust","qvalue","geneID","Count"
"GO:0051260","GO:0051260","protein homooligomerization","1/5","10/1957",0.0253151542080512,0.313424784008746,0.284518876840388,"Zci_10058",1
"GO:0006475","GO:0006475","internal protein amino acid acetylation","1/5","11/1957",0.0278181969553339,0.313424784008746,0.284518876840388,"Zci_00361",1
"GO:0016573","GO:0016573","histone acetylation","1/5","11/1957",0.0278181969553339,0.313424784008746,0.284518876840388,"Zci_00361",1
"GO:0018393","GO:0018393","internal peptidyl-lysine acetylation","1/5","11/1957",0.0278181969553339,0.313424784008746,0.284518876840388,"Zci_00361",1
"GO:0018394","GO:0018394","peptidyl-lysine acetylation","1/5","11/1957",0.0278181969553339,0.313424784008746,0.284518876840388,"Zci_00361",1
"GO:0006006","GO:0006006","glucose metabolic process","1/5","12/1957",0.0303160947021084,0.313424784008746,0.284518876840388,"Zci_10058",1
"GO:0006473","GO:0006473","protein acetylation","1/5","12/1957",0.0303160947021084,0.313424784008746,0.284518876840388,"Zci_00361",1
"GO:0043543","GO:0043543","protein acylation","1/5","12/1957",0.0303160947021084,0.313424784008746,0.284518876840388,"Zci_00361",1
"GO:0006778","GO:0006778","porphyrin-containing compound metabolic process","1/5","14/1957",0.0352964869289023,0.313424784008746,0.284518876840388,"Zci_00502",1
"GO:0015994","GO:0015994","chlorophyll metabolic process","1/5","14/1957",0.0352964869289023,0.313424784008746,0.284518876840388,"Zci_00502",1
"GO:0033013","GO:0033013","tetrapyrrole metabolic process","1/5","14/1957",0.0352964869289023,0.313424784008746,0.284518876840388,"Zci_00502",1
"GO:0010228","GO:0010228","vegetative to reproductive phase transition of meristem","1/5","15/1957",0.0377789972558994,0.313424784008746,0.284518876840388,"Zci_10181",1
"GO:0051259","GO:0051259","protein complex oligomerization","1/5","15/1957",0.0377789972558994,0.313424784008746,0.284518876840388,"Zci_10058",1
"GO:0046148","GO:0046148","pigment biosynthetic process","1/5","16/1957",0.0402563942763527,0.313424784008746,0.284518876840388,"Zci_00502",1
"GO:0042221","GO:0042221","response to chemical","3/5","364/1957",0.0475094143145877,0.316050900918174,0.286902797550057,"Zci_10058/Zci_03939/Zci_10181",3
"GO:0009744","GO:0009744","response to sucrose","1/5","21/1957",0.0525669561039337,0.316050900918174,0.286902797550057,"Zci_10058",1
"GO:0034285","GO:0034285","response to disaccharide","1/5","21/1957",0.0525669561039337,0.316050900918174,0.286902797550057,"Zci_10058",1
"GO:0010035","GO:0010035","response to inorganic substance","2/5","161/1957",0.0569988494166002,0.316050900918174,0.286902797550057,"Zci_03939/Zci_10181",2
"GO:0010029","GO:0010029","regulation of seed germination","1/5","23/1957",0.0574556636707518,0.316050900918174,0.286902797550057,"Zci_10181",1
"GO:1900140","GO:1900140","regulation of seedling development","1/5","24/1957",0.0598924380666391,0.316050900918174,0.286902797550057,"Zci_10181",1
"GO:0042440","GO:0042440","pigment metabolic process","1/5","26/1957",0.0647508672735687,0.316050900918174,0.286902797550057,"Zci_00502",1
"GO:0018205","GO:0018205","peptidyl-lysine modification","1/5","27/1957",0.0671725377363506,0.316050900918174,0.286902797550057,"Zci_00361",1
"GO:0006950","GO:0006950","response to stress","3/5","419/1957",0.0690763850493112,0.316050900918174,0.286902797550057,"Zci_10058/Zci_00502/Zci_10181",3
"GO:0009743","GO:0009743","response to carbohydrate","1/5","28/1957",0.0695891891929925,0.316050900918174,0.286902797550057,"Zci_10058",1
"GO:0009738","GO:0009738","abscisic acid-activated signaling pathway","1/5","34/1957",0.0839841353513947,0.362072308989025,0.32867983626237,"Zci_10181",1
"GO:0016570","GO:0016570","histone modification","1/5","35/1957",0.0863658718689418,0.362072308989025,0.32867983626237,"Zci_00361",1
"GO:1901700","GO:1901700","response to oxygen-containing compound","2/5","213/1957",0.0944959135640519,0.381483502906728,0.34630081384097,"Zci_10058/Zci_10181",2
"GO:0010033","GO:0010033","response to organic substance","2/5","234/1957",0.1115314829967,0.392828357560593,0.356599378181513,"Zci_10058/Zci_10181",2
"GO:0071215","GO:0071215","cellular response to abscisic acid stimulus","1/5","46/1957",0.112239524590664,0.392828357560593,0.356599378181513,"Zci_10181",1
"GO:0097306","GO:0097306","cellular response to alcohol","1/5","46/1957",0.112239524590664,0.392828357560593,0.356599378181513,"Zci_10181",1
"GO:0071396","GO:0071396","cellular response to lipid","1/5","53/1957",0.128396988252714,0.392828357560593,0.356599378181513,"Zci_10181",1
"GO:0015979","GO:0015979","photosynthesis","1/5","54/1957",0.130685861707933,0.392828357560593,0.356599378181513,"Zci_10058",1
"GO:0016051","GO:0016051","carbohydrate biosynthetic process","1/5","58/1957",0.139793320528416,0.392828357560593,0.356599378181513,"Zci_10058",1
"GO:0046686","GO:0046686","response to cadmium ion","1/5","58/1957",0.139793320528416,0.392828357560593,0.356599378181513,"Zci_03939",1
"GO:0006325","GO:0006325","chromatin organization","1/5","59/1957",0.142058214365887,0.392828357560593,0.356599378181513,"Zci_00361",1
"GO:0048580","GO:0048580","regulation of post-embryonic development","1/5","62/1957",0.148824286732698,0.392828357560593,0.356599378181513,"Zci_10181",1
"GO:0009414","GO:0009414","response to water deprivation","1/5","63/1957",0.151070132941847,0.392828357560593,0.356599378181513,"Zci_10181",1
"GO:0009415","GO:0009415","response to water","1/5","63/1957",0.151070132941847,0.392828357560593,0.356599378181513,"Zci_10181",1
"GO:0009755","GO:0009755","hormone-mediated signaling pathway","1/5","63/1957",0.151070132941847,0.392828357560593,0.356599378181513,"Zci_10181",1
"GO:0071229","GO:0071229","cellular response to acid chemical","1/5","63/1957",0.151070132941847,0.392828357560593,0.356599378181513,"Zci_10181",1
"GO:0006979","GO:0006979","response to oxidative stress","1/5","67/1957",0.160006162152161,0.392828357560593,0.356599378181513,"Zci_00502",1
"GO:1901576","GO:1901576","organic substance biosynthetic process","2/5","293/1957",0.164083295073249,0.392828357560593,0.356599378181513,"Zci_10058/Zci_00502",2
"GO:0009651","GO:0009651","response to salt stress","1/5","69/1957",0.164445868421593,0.392828357560593,0.356599378181513,"Zci_10181",1
"GO:0009409","GO:0009409","response to cold","1/5","70/1957",0.166658670676832,0.392828357560593,0.356599378181513,"Zci_10058",1
"GO:0032870","GO:0032870","cellular response to hormone stimulus","1/5","74/1957",0.17546304802236,0.392828357560593,0.356599378181513,"Zci_10181",1
"GO:0065003","GO:0065003","protein-containing complex assembly","1/5","74/1957",0.17546304802236,0.392828357560593,0.356599378181513,"Zci_10058",1
"GO:0009058","GO:0009058","biosynthetic process","2/5","310/1957",0.180296435626414,0.392828357560593,0.356599378181513,"Zci_10058/Zci_00502",2
"GO:0071495","GO:0071495","cellular response to endogenous stimulus","1/5","78/1957",0.184192851971644,0.392828357560593,0.356599378181513,"Zci_10181",1
"GO:0009628","GO:0009628","response to abiotic stimulus","2/5","317/1957",0.187089257441439,0.392828357560593,0.356599378181513,"Zci_10058/Zci_10181",2
"GO:0010038","GO:0010038","response to metal ion","1/5","83/1957",0.195000961107782,0.392828357560593,0.356599378181513,"Zci_03939",1
"GO:0043933","GO:0043933","protein-containing complex organization","1/5","84/1957",0.197148770709949,0.392828357560593,0.356599378181513,"Zci_10058",1
"GO:0006970","GO:0006970","response to osmotic stress","1/5","86/1957",0.201430636605572,0.392828357560593,0.356599378181513,"Zci_10181",1
"GO:0018193","GO:0018193","peptidyl-amino acid modification","1/5","86/1957",0.201430636605572,0.392828357560593,0.356599378181513,"Zci_00361",1
"GO:1901701","GO:1901701","cellular response to oxygen-containing compound","1/5","86/1957",0.201430636605572,0.392828357560593,0.356599378181513,"Zci_10181",1
"GO:0018130","GO:0018130","heterocycle biosynthetic process","1/5","87/1957",0.20356470759273,0.392828357560593,0.356599378181513,"Zci_00502",1
"GO:0016043","GO:0016043","cellular component organization","2/5","334/1957",0.203844257244961,0.392828357560593,0.356599378181513,"Zci_10058/Zci_00361",2
"GO:2000026","GO:2000026","regulation of multicellular organismal development","1/5","88/1957",0.205694213722161,0.392828357560593,0.356599378181513,"Zci_10181",1
"GO:0009737","GO:0009737","response to abscisic acid","1/5","91/1957",0.212055416197069,0.392828357560593,0.356599378181513,"Zci_10181",1
"GO:0019438","GO:0019438","aromatic compound biosynthetic process","1/5","92/1957",0.21416673608936,0.392828357560593,0.356599378181513,"Zci_00502",1
"GO:0044271","GO:0044271","cellular nitrogen compound biosynthetic process","1/5","97/1957",0.224655556693654,0.392828357560593,0.356599378181513,"Zci_00502",1
"GO:0051276","GO:0051276","chromosome organization","1/5","97/1957",0.224655556693654,0.392828357560593,0.356599378181513,"Zci_00361",1
"GO:0071310","GO:0071310","cellular response to organic substance","1/5","99/1957",0.22881959051696,0.392828357560593,0.356599378181513,"Zci_10181",1
"GO:0097305","GO:0097305","response to alcohol","1/5","99/1957",0.22881959051696,0.392828357560593,0.356599378181513,"Zci_10181",1
"GO:0051239","GO:0051239","regulation of multicellular organismal process","1/5","104/1957",0.23915144618367,0.392828357560593,0.356599378181513,"Zci_10181",1
"GO:1901362","GO:1901362","organic cyclic compound biosynthetic process","1/5","104/1957",0.23915144618367,0.392828357560593,0.356599378181513,"Zci_00502",1
"GO:0033993","GO:0033993","response to lipid","1/5","106/1957",0.24325304846705,0.392828357560593,0.356599378181513,"Zci_10181",1
"GO:0071840","GO:0071840","cellular component organization or biogenesis","2/5","373/1957",0.243462557540087,0.392828357560593,0.356599378181513,"Zci_10058/Zci_00361",2
"GO:0022607","GO:0022607","cellular component assembly","1/5","111/1957",0.253429707555463,0.392828357560593,0.356599378181513,"Zci_10058",1
"GO:0009266","GO:0009266","response to temperature stimulus","1/5","113/1957",0.257469582973419,0.392828357560593,0.356599378181513,"Zci_10058",1
"GO:0009416","GO:0009416","response to light stimulus","1/5","114/1957",0.259482951783144,0.392828357560593,0.356599378181513,"Zci_10058",1
"GO:0048608","GO:0048608","reproductive structure development","1/5","114/1957",0.259482951783144,0.392828357560593,0.356599378181513,"Zci_10181",1
"GO:0061458","GO:0061458","reproductive system development","1/5","114/1957",0.259482951783144,0.392828357560593,0.356599378181513,"Zci_10181",1
"GO:0050793","GO:0050793","regulation of developmental process","1/5","116/1957",0.263496587227169,0.393440109695362,0.35715471087749,"Zci_10181",1
"GO:0009314","GO:0009314","response to radiation","1/5","123/1957",0.277407484089099,0.406028596404848,0.368582212091315,"Zci_10058",1
"GO:1901566","GO:1901566","organonitrogen compound biosynthetic process","1/5","124/1957",0.279377474590492,0.406028596404848,0.368582212091315,"Zci_00502",1
"GO:0070887","GO:0070887","cellular response to chemical stimulus","1/5","128/1957",0.287214517527954,0.411926084349302,0.373935798443597,"Zci_10181",1
"GO:0009791","GO:0009791","post-embryonic development","1/5","143/1957",0.315998483128442,0.445316791146385,0.404247014657269,"Zci_10181",1
"GO:0003006","GO:0003006","developmental process involved in reproduction","1/5","145/1957",0.319765004433456,0.445316791146385,0.404247014657269,"Zci_10181",1
"GO:1901564","GO:1901564","organonitrogen compound metabolic process","2/5","448/1957",0.322752536702426,0.445316791146385,0.404247014657269,"Zci_00502/Zci_00361",2
"GO:0023052","GO:0023052","signaling","1/5","155/1957",0.338349546052391,0.459486337268987,0.417109760533894,"Zci_10181",1
"GO:0005975","GO:0005975","carbohydrate metabolic process","1/5","157/1957",0.342017224714855,0.459486337268987,0.417109760533894,"Zci_10058",1
"GO:0001101","GO:0001101","response to acid chemical","1/5","159/1957",0.34566862069777,0.459486337268987,0.417109760533894,"Zci_10181",1
"GO:0044085","GO:0044085","cellular component biogenesis","1/5","164/1957",0.354726229818197,0.462634480530954,0.419967563205308,"Zci_10058",1
"GO:0007165","GO:0007165","signal transduction","1/5","165/1957",0.356525654721102,0.462634480530954,0.419967563205308,"Zci_10181",1
"GO:0022414","GO:0022414","reproductive process","1/5","176/1957",0.376055711232369,0.478741388862208,0.434588996166563,"Zci_10181",1
"GO:0000003","GO:0000003","reproduction","1/5","179/1957",0.38129891410931,0.478741388862208,0.434588996166563,"Zci_10181",1
"GO:0007154","GO:0007154","cell communication","1/5","180/1957",0.383038793428463,0.478741388862208,0.434588996166563,"Zci_10181",1
"GO:0009725","GO:0009725","response to hormone","1/5","182/1957",0.386506809356645,0.478741388862208,0.434588996166563,"Zci_10181",1
"GO:0009719","GO:0009719","response to endogenous stimulus","1/5","186/1957",0.393396055348827,0.481799663292383,0.437365218247069,"Zci_10181",1
"GO:0048731","GO:0048731","system development","1/5","214/1957",0.439907317580198,0.532776640180462,0.483640793596943,"Zci_10181",1
"GO:0006996","GO:0006996","organelle organization","1/5","223/1957",0.454235259907226,0.544083992636128,0.493905314416185,"Zci_00361",1
"GO:0006796","GO:0006796","phosphate-containing compound metabolic process","1/5","240/1957",0.480498694712836,0.56928649699673,0.516783493169412,"Zci_03939",1
"GO:0006464","GO:0006464","cellular protein modification process","1/5","255/1957",0.502823474459141,0.584754897499379,0.53082530531088,"Zci_00361",1
"GO:0036211","GO:0036211","protein modification process","1/5","256/1957",0.504284040045336,0.584754897499379,0.53082530531088,"Zci_00361",1
"GO:0007275","GO:0007275","multicellular organism development","1/5","275/1957",0.531389086430911,0.604929679919525,0.549139448695658,"Zci_10181",1
"GO:0044249","GO:0044249","cellular biosynthetic process","1/5","276/1957",0.532782103415361,0.604929679919525,0.549139448695658,"Zci_00502",1
"GO:0043412","GO:0043412","macromolecule modification","1/5","291/1957",0.553282892016036,0.619843747282713,0.562678051613472,"Zci_00361",1
"GO:0044267","GO:0044267","cellular protein metabolic process","1/5","299/1957",0.56391853311241,0.619843747282713,0.562678051613472,"Zci_00361",1
"GO:0046483","GO:0046483","heterocycle metabolic process","1/5","305/1957",0.571761525845525,0.619843747282713,0.562678051613472,"Zci_00502",1
"GO:0051716","GO:0051716","cellular response to stimulus","1/5","305/1957",0.571761525845525,0.619843747282713,0.562678051613472,"Zci_10181",1
"GO:0032501","GO:0032501","multicellular organismal process","1/5","307/1957",0.574350628216092,0.619843747282713,0.562678051613472,"Zci_10181",1
"GO:0006725","GO:0006725","cellular aromatic compound metabolic process","1/5","312/1957",0.580768630073153,0.620625300764448,0.56338752556116,"Zci_00502",1
"GO:0034641","GO:0034641","cellular nitrogen compound metabolic process","1/5","318/1957",0.588367794269278,0.621121635790511,0.563838085604133,"Zci_00502",1
"GO:0019538","GO:0019538","protein metabolic process","1/5","326/1957",0.598328181266088,0.621121635790511,0.563838085604133,"Zci_00361",1
"GO:1901360","GO:1901360","organic cyclic compound metabolic process","1/5","326/1957",0.598328181266088,0.621121635790511,0.563838085604133,"Zci_00502",1
"GO:0048856","GO:0048856","anatomical structure development","1/5","338/1957",0.612906366534971,0.630252773135017,0.572127094878721,"Zci_10181",1
"GO:0032502","GO:0032502","developmental process","1/5","354/1957",0.631682315305536,0.643489461386014,0.584143016613088,"Zci_10181",1
"GO:0050794","GO:0050794","regulation of cellular process","1/5","439/1957",0.719610451608859,0.726273511345978,0.659292226620203,"Zci_10181",1
"GO:0044260","GO:0044260","cellular macromolecule metabolic process","1/5","450/1957",0.729636350306688,0.729636350306688,0.662344924469616,"Zci_00361",1
