Number of species	25
Number of genes	679139
Number of genes in orthogroups	584999
Number of unassigned genes	94140
Percentage of genes in orthogroups	86.1
Percentage of unassigned genes	13.9
Number of orthogroups	46253
Number of species-specific orthogroups	23699
Number of genes in species-specific orthogroups	131345
Percentage of genes in species-specific orthogroups	19.3
Mean orthogroup size	12.6
Median orthogroup size	4.0
G50 (assigned genes)	35
G50 (all genes)	31
O50 (assigned genes)	3997
O50 (all genes)	5419
Number of orthogroups with all species present	1485
Number of single-copy orthogroups	0
Date	2023-11-20
Orthogroups file	Orthogroups.tsv
Unassigned genes file	Orthogroups_UnassignedGenes.tsv
Per-species statistics	Statistics_PerSpecies.tsv
Overall statistics	Statistics_Overall.tsv
Orthogroups shared between species	Orthogroups_SpeciesOverlaps.tsv

Average number of genes per-species in orthogroup	Number of orthogroups	Percentage of orthogroups	Number of genes	Percentage of genes
<1	39025	84.4	194713	33.3
'1	5205	11.3	178604	30.5
'2	1102	2.4	65455	11.2
'3	358	0.8	30609	5.2
'4	183	0.4	20345	3.5
'5	112	0.2	15191	2.6
'6	56	0.1	8952	1.5
'7	46	0.1	8496	1.5
'8	42	0.1	8881	1.5
'9	26	0.1	6158	1.1
'10	22	0.0	5720	1.0
11-15	43	0.1	14048	2.4
16-20	12	0.0	5559	1.0
21-50	17	0.0	12646	2.2
51-100	3	0.0	4730	0.8
101-150	0	0.0	0	0.0
151-200	1	0.0	4892	0.8
201-500	0	0.0	0	0.0
501-1000	0	0.0	0	0.0
'1001+	0	0.0	0	0.0

Number of species in orthogroup	Number of orthogroups
1	23699
2	6642
3	4460
4	1319
5	1243
6	468
7	372
8	331
9	291
10	335
11	279
12	196
13	201
14	214
15	195
16	213
17	206
18	273
19	328
20	421
21	487
22	595
23	790
24	1210
25	1485
