﻿condition,sample_name,μmol/mgDW,μmol/mgDW,μmol/mgDW,μmol/mgDW,μmol/mgDW,μmol/mgDW,μmol/mgDW,μmol/mgDW,μmol/mgDW,μmol/mgDW,μmol/mgDW,6MHO,beta-CC,beta-Io,DHA,x,Chla/b,beta-car/9-cis-neox,(V+A+Z)/(Chla+b),(A+Z)/(V+A+Z),beta-Car/beta-CC,beta-Car/beta-Io,beta-Car/DHA,beta-Car/(beta-CC+beta-Io+DHA)
0.1 K,,0.000522721,0.000366905,0.000290434,0.000634523,0.003199435,0.000619162,0.00103556,2.52E-05,0,0.00211136,0.000163501,0.000564138,7.30E-05,2.13E-06,1.61E-05,7.54E+00,1.632028407,5.754520742,0.857632019,0.635052334,28918.24699,989764.9177,131252.5909,23143.06907
0.2 K,,0.00051701,0.000335836,0.000350548,0.000573647,0.003078246,0.000503947,0.00099458,2.42E-05,0,0.002255016,0.000170385,0.000125568,0.000123603,2.47E-06,1.07E-05,4.32E+00,1.733784117,6.71463963,0.874557669,0.623034431,18244.05195,912166.3535,211336.354,16490.6374
0.3 K,,0.000247563,0.000337307,0.000211259,0.00060027,0.003273333,0.000881692,0.001087147,2.94E-05,0,0.002317847,0.000189477,1.51E-05,2.65E-05,7.37E-07,1.64E-06,2.23E+00,1.811097286,6.871622939,0.794417635,0.815322365,87503.07641,3146777.451,1411681.296,80293.35831
3.4 K,,5.91E-05,0.000123319,4.75E-05,0.000237528,0.001260077,0.000423759,0.000366819,0,0,0.000412686,0,0.000351564,7.04E-05,2.07E-06,9.22E-06,4.46E+00,1.544316739,3.346496881,0.877499074,0.888546537,5865.733419,199732.0046,44773.13565,5055.018938
5.4 K,,0.000249451,0.000251791,0.000185141,0.000473477,0.002255701,0.000582485,0.000737179,2.06E-05,0,0.001626674,0.000132388,0,6.50E-05,1.66E-06,1.41E-05,8.46E+00,1.556947097,6.460414756,0.840104963,0.754737441,25030.46698,979005.2416,115673.9659,20154.08006
6.4 K,,0.000168049,0.000236175,0.000133199,0.000483297,0.002725963,0.001212299,0.000762546,2.08E-05,0,0.001674236,0.000140593,2.47E-05,5.91E-05,2.37E-06,7.45E-06,3.14E+00,1.577799785,7.088951414,1.214878289,0.888970086,28348.09007,705446.6428,224775.0171,24305.95572
3.5 K,,0.000609396,0.000590009,0.000431776,0.00112182,0.00406894,0.000667632,0.001674378,3.30E-05,4.05E-05,0.003387461,0.000244857,3.56E-05,8.23E-05,2.16E-06,1.21E-05,5.60E+00,1.492555272,5.741375354,0.611117006,0.643378682,41169.81041,1571582.989,280821.8231,35103.82889
5.5 K,,0.000630501,0.000709117,0.000486137,0.001341188,0.005119044,0.000938086,0.002033531,3.58E-05,6.95E-05,0.004055281,0.000321259,3.49E-05,9.35E-05,2.60E-06,9.65E-06,3.71E+00,1.516216098,5.718777663,0.608857496,0.69314559,43383.67982,1559465.303,420067.9607,38355.38983
6.5 K,,0.000643041,0.00073486,0.000506778,0.001343156,0.004594788,0.000598476,0.001924576,4.13E-05,6.17E-05,0.00383433,0.000235375,2.61E-05,7.82E-05,1.85E-06,4.05E-06,2.18E+00,1.43287582,5.217769987,0.535018088,0.632189706,49010.05874,2069220.008,947355.7853,45572.99744
3.6 K,,0.000255658,0.000451174,0.000251629,0.001102521,0.00482503,0.001620204,0.001614684,0,0,0.003448557,0.000340081,0,2.91E-05,1.54E-06,5.17E-06,3.36E+00,1.46453855,7.643520334,0.782970244,0.879831405,118509.6512,2237039.215,666516.134,96288.19102
5.6 K GC-MS crashed,,0.000104947,0.000247604,0.000147247,0.000494577,0.002366674,0.000734965,0.000768443,1.88E-05,0,0.001750713,0.000141246,,,,,,1.553737688,7.070611738,0.781584949,0.89368819,,,,
6.6 K GC-MS crashed,,0.000165126,0.000338191,0.000180283,0.000712842,0.003116446,0.000956703,0.001111233,2.35E-05,0,0.002377019,0.000214276,,,,,,1.5588766,7.028628923,0.713847565,0.873186204,,,,
3.4 c,,9.70E-05,0.000305562,0.000118845,0.000598217,0.003275498,0.001170293,0.000984738,2.89E-05,0,0.002098172,0.000152195,0.00047385,6.63E-05,1.95E-06,8.01E-06,4.11E+00,1.646120561,6.86661211,0.875646888,0.930040197,31624.30103,1075829.628,261830.4655,27495.16361
5.4 c,,2.99E-05,0.000126124,3.71E-05,0.000249972,0.001312942,0.000496479,0.000383271,1.15E-05,0,0.00082673,6.00E-05,0.00092269,0.000168735,2.87E-06,2.45E-05,8.55E+00,1.533258617,6.554913286,0.889770435,0.947015026,4899.576276,288037.6573,33693.14524,4214.951078
6.4 c,,5.50E-05,0.000314431,0.000105418,0.00064841,0.003514409,0.00133279,0.001076818,3.12E-05,0,0.002346139,0.00017748,4.65E-05,6.36E-05,1.98E-06,6.76E-06,3.41E+00,1.660705343,7.461529445,0.865525171,0.963153941,36891.04395,1182841.368,347079.6982,32432.30479
3.5 c,,6.83E-05,0.000218914,7.40E-05,0.000443749,0.002691429,0.001010497,0.000787857,2.32E-05,0,0.001785955,0.000132959,2.91E-05,7.45E-05,2.44E-06,8.56E-06,3.50E+00,1.7754551,8.158238152,0.935978105,0.940768273,23963.90272,731529.5669,208755.7686,20882.61828
5.5 c,,5.03E-05,0.00026716,6.77E-05,0.0005576,0.00333468,0.001292039,0.000986329,2.97E-05,0,0.00222232,0.000159497,0.000405967,8.39E-05,2.09E-06,6.45E-06,3.09E+00,1.768882595,8.318312439,0.913332242,0.964298476,26480.51015,1065532.707,344446.8091,24035.38403
6.5 c,,7.50E-05,0.000251675,9.42E-05,0.000510385,0.003109894,0.001173585,0.000841747,2.52E-05,0,0.002020008,0.000144361,0.000347535,9.03E-05,2.42E-06,6.69E-06,2.77E+00,1.649238201,8.026257982,0.993069017,0.944137665,22368.22695,835605.8676,301830.4469,20318.54393
3.6 c,,3.85E-05,0.000153188,5.73E-05,0.000331165,0.001756535,0.000645737,0.000522682,1.44E-05,0,0.001206924,8.80E-05,1.26E-05,4.12E-05,1.72E-06,1.80E-06,1.04E+00,1.578313683,7.878723324,0.868491007,0.948071241,29266.87533,701414.6545,671427.4803,26966.26138
5.6 c,,7.78E-05,0.000414341,0.000124894,0.000891259,0.004332113,0.001546951,0.001405081,3.33E-05,0,0.003011684,0.000238473,1.32E-05,5.07E-05,1.84E-06,3.92E-06,2.13E+00,1.576512654,7.268608338,0.761920072,0.955543376,59417.50851,1633916.425,768190.306,53350.85163
6.6 c,,6.06E-05,0.000268163,9.29E-05,0.000574113,0.003096277,0.001162438,0.000958337,2.47E-05,0,0.002118307,0.000166553,9.00E-06,4.23E-05,2.10E-06,1.23E-06,5.83E-01,1.669248293,7.899326242,0.858756469,0.953916837,50041.9583,1006412.796,1727517.388,46391.38964
3.4 h,,0.000149526,0.000316051,0.000219242,0.000632124,0.003386358,0.001072373,0.001061729,3.21E-05,0,0.00231984,0.000235931,1.92E-05,6.57E-05,1.47E-06,9.84E-06,6.71E+00,1.679620769,7.340072268,0.850806255,0.89624475,35296.75956,1581901.452,235660.838,30114.35957
5.4 h,,0.000217989,0.000273243,0.000190293,0.000538052,0.002669135,0.000761899,0.000853097,2.20E-05,0,0.001603846,0.000190703,0.000204146,7.84E-05,2.68E-06,9.37E-06,3.50E+00,1.585529173,5.869680215,0.841162708,0.813713302,20459.81575,598499.7101,171174.0761,17733.90923
6.4 h,,0.000689384,0.000351939,0.000263187,0.000676504,0.003013983,0.000625566,0.000905839,1.93E-05,0,0.001816302,0.000223213,2.68E-05,9.89E-05,2.75E-06,2.06E-05,7.48E+00,1.338999049,5.160843666,0.997341836,0.563166192,18370.4275,661333.5488,88357.90129,14866.56857
3.5 h,,9.74E-05,0.000240108,0.000107169,0.000486808,0.003358931,0.001293883,0.000883943,3.41E-05,0,0.00208758,0.000196898,2.71E-05,8.04E-05,2.61E-06,1.75E-06,6.69E-01,1.815794123,8.694324937,1.093150151,0.935008757,25951.75672,798361.8988,1193089.835,24616.13503
5.5 h,,0.000315474,0.000339582,0.000268129,0.000667829,0.004196184,0.001267623,0.001184728,4.22E-05,0,0.002834453,0.000256581,3.26E-05,7.51E-05,2.86E-06,1.99E-06,6.94E-01,1.773999985,8.346900891,0.99928192,0.829586342,37737.24454,990109.1023,1426364.523,35448.30591
6.5 h,,0.000457037,0.000336471,0.000245925,0.000715185,0.003102583,0.00076721,0.000937873,2.24E-05,0,0.001827652,0.000239386,2.87E-05,0.000100888,3.91E-06,7.28E-06,1.87E+00,1.311371686,5.431832226,0.88936523,0.689126963,18115.57404,467982.9219,250883.9739,16306.86715
3.6 h,,0.000161123,0.000410037,0.000275956,0.000827329,0.004172931,0.00133841,0.001374609,3.38E-05,0,0.003117071,0.000330914,1.77E-05,4.51E-05,2.01E-06,3.99E-06,1.98E+00,1.661501485,7.601931164,0.806330202,0.909251344,69179.79562,1548272.39,780579.866,61042.3559
5.6 h,,0.000241027,0.00033161,0.000217835,0.000703366,0.003480812,0.001085496,0.001106667,2.90E-05,0,0.002425967,0.000268866,8.04E-06,3.13E-05,1.94E-06,2.49E-06,1.28E+00,1.573386837,7.31571205,0.853220428,0.843930437,77542.59033,1250562.524,974686.524,67926.7083
6.6 h,,0.000437836,0.000345402,0.000215981,0.000725519,0.002490163,0.000489648,0.000825975,2.29E-05,0,0.001657155,0.000154896,1.33E-05,6.28E-05,4.18E-06,5.32E-06,1.27E+00,1.138461207,4.797756489,0.737008361,0.617097163,26389.56958,396130.2816,311493.4394,22920.78569
1.1 HL,,0.000984172,0.001105738,0.00081805,0.001318542,0.007244597,0.001565867,0.002348692,5.50E-05,6.00E-05,0.005106524,0.000426807,0.000164546,0.000111153,1.52E-06,5.39E-06,3.54E+00,1.781280581,4.618204936,0.918427513,0.707795134,45941.49195,3352692.776,947549.2184,43251.77611
3.1 HL,,3.08E-05,0.000231262,4.59E-05,0.000461353,0.002308109,0.000817312,0.000741741,2.32E-05,0,0.001506706,0.00013525,3.63E-05,4.36E-05,1.44E-06,1.36E-05,9.49E+00,1.607751932,6.515157967,0.743072207,0.965536737,34519.24438,1047290.77,110414.7072,25653.55177
5.1 HL,,6.57E-05,0.000414743,0.00016837,0.000793452,0.00398628,0.0012476,0.001276306,3.92E-05,0,0.002897935,0.000235183,0.000126374,7.92E-05,1.83E-06,4.29E-06,2.35E+00,1.608548974,6.987308512,0.715862346,0.955663633,36602.23813,1585357.676,675772.0132,33977.43776
6.1 HL,,0.000127677,0.000521957,0.000368219,0.000929223,0.004654359,0.001207757,0.001544988,4.36E-05,6.36E-05,0.003632734,0.00029041,0.000135658,0.000114285,1.90E-06,4.35E-06,2.29E+00,1.66266667,6.959837711,0.68856452,0.925056965,31786.51809,1916441.109,835794.2987,30140.32209
10.1 HL,,0.001245211,0.000705577,0.000759913,0.00113864,0.005966593,0.000754074,0.001968222,5.20E-05,4.25E-05,0.004278067,0.000298972,0.000352409,0.000128757,1.84E-06,1.57E-05,8.54E+00,1.728571878,6.06322034,0.888097968,0.548705561,33225.92878,2325152.834,272150.4121,29238.48839
1.2 HL,,0.000719216,0.000783028,0.000462209,0.001264824,0.005718565,0.000930732,0.00214591,4.68E-05,8.61E-05,0.004412319,0.000334427,0.000204144,0.000107717,2.00E-06,7.63E-06,3.82E+00,1.696607462,5.634944713,0.619267884,0.659487397,40961.9862,2210047.577,578510.1985,37602.55773
3.2 HL,,5.72E-05,0.000348895,8.67E-05,0.000636522,0.003776632,0.001278971,0.001156898,3.05E-05,0,0.002506031,0.000214477,5.12E-05,9.11E-05,1.57E-06,1.35E-06,8.59E-01,1.817530323,7.18276799,0.793370143,0.959817343,27497.07748,1596303.557,1858851.578,26643.99079
5.2 HL,,4.34E-05,0.000340909,0.00010162,0.000654356,0.003654797,0.001240484,0.001120298,3.56E-05,3.59E-05,0.002551097,0.000185047,0.000103759,0.000120764,1.81E-06,1.01E-06,5.58E-01,1.712062605,7.483230976,0.780737311,0.968651005,21124.63003,1409880.552,2524913.308,20642.62971
6.2 HL,,2.99E-05,0.000256592,9.61E-05,0.000501965,0.003119955,0.001089746,0.000933619,2.81E-05,2.82E-05,0.00227076,0.000196673,7.44E-05,0.000126863,2.79E-06,1.14E-06,4.10E-01,1.85992973,8.849695993,0.846868194,0.975387832,17899.35726,813285.0264,1985781.649,17360.78285
10.2 HL,,0.000271872,0.000283434,0.00020126,0.000501369,0.002685522,0.000660276,0.00088268,2.54E-05,0,0.001867345,0.000138835,0.000245102,8.56E-05,1.39E-06,8.74E-07,6.27E-01,1.760541029,6.588279944,0.818907768,0.760129157,21812.77704,1340266.969,2136739.513,21250.00489
1.3 HL,,0.000209711,0.000472762,0.000210164,0.000818037,0.004804085,0.001510665,0.001507089,3.73E-05,0,0.00322338,0.000276377,5.88E-05,8.10E-05,1.01E-06,1.40E-06,1.39E+00,1.84232336,6.818192851,0.830294467,0.891372031,39813.97536,3195101.059,2305296.463,38664.42039
3.3 HL,,0.000114743,0.000508534,0.000219407,0.000857893,0.004684959,0.001351,0.001537728,4.76E-05,6.78E-05,0.003426017,0.000253409,0.000188974,0.000148185,1.27E-06,6.40E-07,5.03E-01,1.792446455,6.737049344,0.703428938,0.931909316,23119.7887,2691764.955,5351383.417,22825.12952
5.3 HL,,4.26E-05,0.00041098,8.85E-05,0.000750343,0.004018261,0.001439414,0.001278034,4.33E-05,0,0.002627946,0.000211206,5.60E-05,9.03E-05,2.10E-06,1.82E-06,8.70E-01,1.703266931,6.3943338,0.77425736,0.972887944,29114.50708,1252738.812,1440017.482,27901.92175
6.3 HL,,5.12E-05,0.00041128,0.000160422,0.000750095,0.004167902,0.001355942,0.001303859,4.32E-05,3.72E-05,0.002919421,0.00021777,4.64E-05,8.17E-05,1.45E-06,2.11E-06,1.46E+00,1.738259504,7.098385577,0.763209698,0.967317329,35750.43526,2012621.651,1380690.392,34254.98996
10(.3) R HL,,0.000454549,0.000404546,0.000318011,0.000704752,0.003836613,0.000880833,0.001223039,4.07E-05,0,0.002715837,0.000188337,0.00012455,8.99E-05,2.13E-06,1.09E-05,5.13E+00,1.735418374,6.713303726,0.857661896,0.725081327,30222.95639,1274000.609,248171.4731,26383.94858
5.2 K as repeat for Z_1_11,,0.001872378,0.001343534,0.000809863,0.002255966,0.007722836,0.000535291,0.003376627,7.47E-05,0.000210223,0.006488857,0.000433765,0.000560363,0.000140411,3.78E-06,5.46E-06,1.44E+00,1.496754431,4.829693012,0.571234553,0.418070142,46213.28554,1716213.25,1188370.849,43359.55861
6.2 K as repeat for Z_1_12,,0.001484701,0.001040643,0.000671131,0.001799134,0.007045461,0.00067247,0.002754487,6.71E-05,0.00016413,0.005261031,0.000409637,0.001136193,0.000214722,5.81E-06,1.19E-05,2.05E+00,1.531006549,5.055558315,0.621110442,0.475055725,24501.54246,905171.7169,441110.1578,22631.84496