"","ID","Description","GeneRatio","BgRatio","pvalue","p.adjust","qvalue","geneID","Count"
"GO:0045471","GO:0045471","response to ethanol","9/89","12/9629",6.99831637288302e-17,3.88406558695007e-14,3.34445856135673e-14,"Pp3c12_24560V3/Pp3c19_14230V3/Pp3c19_22640V3/Pp3c21_19080V3/Pp3c8_6770V3/Pp3c8_8490V3/Pp3c8_8860V3/Pp3c8_9230V3/Pp3c8_9380V3",9
"GO:0042542","GO:0042542","response to hydrogen peroxide","14/89","70/9629",1.4627027236334e-15,4.05900005808268e-13,3.49508966594507e-13,"Pp3c1_7030V3/Pp3c11_14810V3/Pp3c12_24560V3/Pp3c19_14230V3/Pp3c19_22640V3/Pp3c19_4790V3/Pp3c21_19080V3/Pp3c21_6480V3/Pp3c21_6510V3/Pp3c8_6770V3/Pp3c8_8490V3/Pp3c8_8860V3/Pp3c8_9230V3/Pp3c8_9380V3",14
"GO:0009408","GO:0009408","response to heat","19/89","182/9629",2.49911942863323e-15,4.62337094297148e-13,3.98105340561224e-13,"Pp3c1_7030V3/Pp3c11_14810V3/Pp3c12_24560V3/Pp3c19_14230V3/Pp3c19_22640V3/Pp3c19_4790V3/Pp3c21_19080V3/Pp3c21_6480V3/Pp3c21_6510V3/Pp3c26_10600V3/Pp3c3_8110V3/Pp3c4_21500V3/Pp3c4_27990V3/Pp3c4_810V3/Pp3c8_6770V3/Pp3c8_8490V3/Pp3c8_8860V3/Pp3c8_9230V3/Pp3c8_9380V3",19
"GO:0000302","GO:0000302","response to reactive oxygen species","17/89","136/9629",4.10648858601102e-15,5.58250014652316e-13,4.80693232152018e-13,"Pp3c1_7030V3/Pp3c11_14810V3/Pp3c11_17240V3/Pp3c12_24560V3/Pp3c19_14230V3/Pp3c19_22640V3/Pp3c19_4790V3/Pp3c21_19080V3/Pp3c21_6480V3/Pp3c21_6510V3/Pp3c22_19580V3/Pp3c5_14800V3/Pp3c8_6770V3/Pp3c8_8490V3/Pp3c8_8860V3/Pp3c8_9230V3/Pp3c8_9380V3",17
"GO:0009644","GO:0009644","response to high light intensity","16/89","115/9629",5.02927941128213e-15,5.58250014652316e-13,4.80693232152018e-13,"Pp3c1_7030V3/Pp3c11_14810V3/Pp3c12_24560V3/Pp3c19_14230V3/Pp3c19_22640V3/Pp3c19_4790V3/Pp3c21_19080V3/Pp3c21_6480V3/Pp3c21_6510V3/Pp3c3_4140V3/Pp3c3_8110V3/Pp3c8_6770V3/Pp3c8_8490V3/Pp3c8_8860V3/Pp3c8_9230V3/Pp3c8_9380V3",16
"GO:0046677","GO:0046677","response to antibiotic","18/89","171/9629",1.27651229374323e-14,1.18077387171249e-12,1.01673084449022e-12,"Pp3c1_7030V3/Pp3c11_14810V3/Pp3c11_17240V3/Pp3c12_24560V3/Pp3c14_11870V3/Pp3c19_14230V3/Pp3c19_22640V3/Pp3c19_4790V3/Pp3c21_19080V3/Pp3c21_6480V3/Pp3c21_6510V3/Pp3c3_37540V3/Pp3c8_300V3/Pp3c8_6770V3/Pp3c8_8490V3/Pp3c8_8860V3/Pp3c8_9230V3/Pp3c8_9380V3",18
"GO:0046685","GO:0046685","response to arsenic-containing substance","9/89","21/9629",8.73870662775246e-14,6.92854596914659e-12,5.9659741488716e-12,"Pp3c12_24560V3/Pp3c19_14230V3/Pp3c19_22640V3/Pp3c21_19080V3/Pp3c8_6770V3/Pp3c8_8490V3/Pp3c8_8860V3/Pp3c8_9230V3/Pp3c8_9380V3",9
"GO:0009636","GO:0009636","response to toxic substance","17/89","184/9629",6.5699871016426e-13,4.55792855176455e-11,3.92470282124439e-11,"Pp3c1_6260V3/Pp3c1_7030V3/Pp3c11_14810V3/Pp3c12_24560V3/Pp3c14_11870V3/Pp3c19_14230V3/Pp3c19_22640V3/Pp3c19_4790V3/Pp3c21_19080V3/Pp3c21_6480V3/Pp3c21_6510V3/Pp3c22_8470V3/Pp3c8_6770V3/Pp3c8_8490V3/Pp3c8_8860V3/Pp3c8_9230V3/Pp3c8_9380V3",17
"GO:0009642","GO:0009642","response to light intensity","16/89","179/9629",5.62119008678442e-12,3.46640055351706e-10,2.98481906362588e-10,"Pp3c1_7030V3/Pp3c11_14810V3/Pp3c12_24560V3/Pp3c19_14230V3/Pp3c19_22640V3/Pp3c19_4790V3/Pp3c21_19080V3/Pp3c21_6480V3/Pp3c21_6510V3/Pp3c3_4140V3/Pp3c3_8110V3/Pp3c8_6770V3/Pp3c8_8490V3/Pp3c8_8860V3/Pp3c8_9230V3/Pp3c8_9380V3",16
"GO:0009266","GO:0009266","response to temperature stimulus","24/89","492/9629",8.35166000735196e-12,4.63517130408034e-10,3.9912143614082e-10,"Pp3c1_7030V3/Pp3c11_14810V3/Pp3c12_24560V3/Pp3c13_13170V3/Pp3c16_24460V3/Pp3c19_14230V3/Pp3c19_22640V3/Pp3c19_4790V3/Pp3c21_19080V3/Pp3c21_6480V3/Pp3c21_6510V3/Pp3c22_7570V3/Pp3c22_7600V3/Pp3c26_10600V3/Pp3c3_4140V3/Pp3c3_8110V3/Pp3c4_21500V3/Pp3c4_27990V3/Pp3c4_810V3/Pp3c8_6770V3/Pp3c8_8490V3/Pp3c8_8860V3/Pp3c8_9230V3/Pp3c8_9380V3",24
"GO:0046688","GO:0046688","response to copper ion","9/89","35/9629",1.88956538046665e-11,9.533716237809e-10,8.20921227494602e-10,"Pp3c12_24560V3/Pp3c19_14230V3/Pp3c19_22640V3/Pp3c21_19080V3/Pp3c8_6770V3/Pp3c8_8490V3/Pp3c8_8860V3/Pp3c8_9230V3/Pp3c8_9380V3",9
"GO:0010286","GO:0010286","heat acclimation","9/89","45/9629",2.19979279650551e-10,1.0174041683838e-08,8.76057832994298e-09,"Pp3c12_24560V3/Pp3c19_14230V3/Pp3c19_22640V3/Pp3c21_19080V3/Pp3c8_6770V3/Pp3c8_8490V3/Pp3c8_8860V3/Pp3c8_9230V3/Pp3c8_9380V3",9
"GO:0006979","GO:0006979","response to oxidative stress","18/89","318/9629",4.88755698385557e-10,2.08661086618449e-08,1.79672135276958e-08,"Pp3c1_7030V3/Pp3c11_14810V3/Pp3c11_17240V3/Pp3c12_24560V3/Pp3c19_14230V3/Pp3c19_22640V3/Pp3c19_4790V3/Pp3c21_19080V3/Pp3c21_6480V3/Pp3c21_6510V3/Pp3c22_19580V3/Pp3c23_12960V3/Pp3c5_14800V3/Pp3c8_6770V3/Pp3c8_8490V3/Pp3c8_8860V3/Pp3c8_9230V3/Pp3c8_9380V3",18
"GO:0051259","GO:0051259","protein complex oligomerization","11/89","102/9629",2.004999333118e-09,7.94839021343208e-08,6.8441330619216e-08,"Pp3c12_24560V3/Pp3c19_14230V3/Pp3c19_22640V3/Pp3c21_19080V3/Pp3c22_7570V3/Pp3c22_7600V3/Pp3c8_6770V3/Pp3c8_8490V3/Pp3c8_8860V3/Pp3c8_9230V3/Pp3c8_9380V3",11
"GO:0051260","GO:0051260","protein homooligomerization","9/89","64/9629",5.92661098643267e-09,2.19284606498009e-07,1.88819746515118e-07,"Pp3c12_24560V3/Pp3c19_14230V3/Pp3c19_22640V3/Pp3c21_19080V3/Pp3c8_6770V3/Pp3c8_8490V3/Pp3c8_8860V3/Pp3c8_9230V3/Pp3c8_9380V3",9
"GO:0010038","GO:0010038","response to metal ion","17/89","415/9629",1.91406571684702e-07,6.63941545531312e-06,5.7170120753194e-06,"Pp3c12_24560V3/Pp3c16_14400V3/Pp3c19_14230V3/Pp3c19_22640V3/Pp3c21_19080V3/Pp3c22_19580V3/Pp3c22_7570V3/Pp3c22_7600V3/Pp3c26_10600V3/Pp3c3_28310V3/Pp3c4_27990V3/Pp3c5_14800V3/Pp3c8_6770V3/Pp3c8_8490V3/Pp3c8_8860V3/Pp3c8_9230V3/Pp3c8_9380V3",17
"GO:0006457","GO:0006457","protein folding","11/89","176/9629",5.90606333979875e-07,1.928155972699e-05,1.66028034443878e-05,"Pp3c15_12510V3/Pp3c15_6622V3/Pp3c16_4660V3/Pp3c21_6480V3/Pp3c21_6510V3/Pp3c22_7570V3/Pp3c22_7600V3/Pp3c24_12180V3/Pp3c26_10600V3/Pp3c4_27990V3/Pp3c4_810V3",11
"GO:0046686","GO:0046686","response to cadmium ion","14/89","304/9629",6.55199967933333e-07,2.02019990112778e-05,1.7395367569692e-05,"Pp3c12_24560V3/Pp3c19_14230V3/Pp3c19_22640V3/Pp3c21_19080V3/Pp3c22_7570V3/Pp3c22_7600V3/Pp3c26_10600V3/Pp3c3_28310V3/Pp3c4_27990V3/Pp3c8_6770V3/Pp3c8_8490V3/Pp3c8_8860V3/Pp3c8_9230V3/Pp3c8_9380V3",14
"GO:0097305","GO:0097305","response to alcohol","15/89","380/9629",1.76149883304989e-06,5.14543080180363e-05,4.43058432246344e-05,"Pp3c12_24560V3/Pp3c14_11870V3/Pp3c15_1990V3/Pp3c19_14230V3/Pp3c19_22640V3/Pp3c21_19080V3/Pp3c3_37540V3/Pp3c3_4140V3/Pp3c4_510V3/Pp3c8_300V3/Pp3c8_6770V3/Pp3c8_8490V3/Pp3c8_8860V3/Pp3c8_9230V3/Pp3c8_9380V3",15
"GO:0090354","GO:0090354","regulation of auxin metabolic process","3/89","13/9629",0.000204173840259549,0.00566582406720248,0.00487868018304395,"Pp3c20_20860V3/Pp3c3_37540V3/Pp3c8_300V3",3
"GO:0009723","GO:0009723","response to ethylene","6/89","108/9629",0.000473300892143615,0.0125086664352241,0.0107708573951479,"Pp3c15_1990V3/Pp3c18_15140V3/Pp3c22_19580V3/Pp3c3_37540V3/Pp3c5_14800V3/Pp3c8_300V3",6
"GO:0010162","GO:0010162","seed dormancy process","3/89","20/9629",0.000776603411124998,0.0187397779641032,0.0161362905560984,"Pp3c16_17210V3/Pp3c22_8470V3/Pp3c25_4810V3",3
"GO:0022611","GO:0022611","dormancy process","3/89","20/9629",0.000776603411124998,0.0187397779641032,0.0161362905560984,"Pp3c16_17210V3/Pp3c22_8470V3/Pp3c25_4810V3",3
"GO:0006972","GO:0006972","hyperosmotic response","4/89","55/9629",0.00162363569088759,0.0375465753517756,0.0323302896343407,"Pp3c16_17210V3/Pp3c21_6480V3/Pp3c21_6510V3/Pp3c25_4810V3",4
"GO:0044550","GO:0044550","secondary metabolite biosynthetic process","4/89","58/9629",0.00197777747220853,0.0439066598830293,0.0378067777845335,"Pp3c1_6260V3/Pp3c14_11870V3/Pp3c22_19580V3/Pp3c5_14800V3",4
"GO:0032350","GO:0032350","regulation of hormone metabolic process","3/89","28/9629",0.00211572863189019,0.0451626688730406,0.0388882914525565,"Pp3c20_20860V3/Pp3c3_37540V3/Pp3c8_300V3",3
"GO:2000379","GO:2000379","positive regulation of reactive oxygen species metabolic process","3/89","32/9629",0.00311914601001477,0.0579236443149523,0.049876404967261,"Pp3c22_7570V3/Pp3c22_7600V3/Pp3c3_4140V3",3
"GO:0010600","GO:0010600","regulation of auxin biosynthetic process","2/89","10/9629",0.00362262081691774,0.0579236443149523,0.049876404967261,"Pp3c3_37540V3/Pp3c8_300V3",2
"GO:1902884","GO:1902884","positive regulation of response to oxidative stress","2/89","10/9629",0.00362262081691774,0.0579236443149523,0.049876404967261,"Pp3c22_7570V3/Pp3c22_7600V3",2
"GO:0006458","GO:0006458","'de novo' protein folding","3/89","34/9629",0.00371339756891377,0.0579236443149523,0.049876404967261,"Pp3c16_4660V3/Pp3c22_7570V3/Pp3c22_7600V3",3
"GO:0009968","GO:0009968","negative regulation of signal transduction","5/89","112/9629",0.00372096440610223,0.0579236443149523,0.049876404967261,"Pp3c13_18320V3/Pp3c15_1990V3/Pp3c22_7570V3/Pp3c22_7600V3/Pp3c4_13960V3",5
"GO:0010431","GO:0010431","seed maturation","3/89","35/9629",0.00403463410565199,0.0579236443149523,0.049876404967261,"Pp3c16_17210V3/Pp3c22_8470V3/Pp3c25_4810V3",3
"GO:0009414","GO:0009414","response to water deprivation","7/89","219/9629",0.00406541700862179,0.0579236443149523,0.049876404967261,"Pp3c16_14400V3/Pp3c16_17210V3/Pp3c22_8470V3/Pp3c25_4810V3/Pp3c3_4140V3/Pp3c4_510V3/Pp3c4_810V3",7
"GO:0010648","GO:0010648","negative regulation of cell communication","5/89","116/9629",0.00432259021908171,0.0579236443149523,0.049876404967261,"Pp3c13_18320V3/Pp3c15_1990V3/Pp3c22_7570V3/Pp3c22_7600V3/Pp3c4_13960V3",5
"GO:0023057","GO:0023057","negative regulation of signaling","5/89","116/9629",0.00432259021908171,0.0579236443149523,0.049876404967261,"Pp3c13_18320V3/Pp3c15_1990V3/Pp3c22_7570V3/Pp3c22_7600V3/Pp3c4_13960V3",5
"GO:0009687","GO:0009687","abscisic acid metabolic process","2/89","11/9629",0.00440111830809007,0.0579236443149523,0.049876404967261,"Pp3c16_17210V3/Pp3c25_4810V3",2
"GO:0034755","GO:0034755","iron ion transmembrane transport","2/89","11/9629",0.00440111830809007,0.0579236443149523,0.049876404967261,"Pp3c15_10680V3/Pp3c21_8300V3",2
"GO:0042026","GO:0042026","protein refolding","2/89","11/9629",0.00440111830809007,0.0579236443149523,0.049876404967261,"Pp3c16_4660V3/Pp3c24_12180V3",2
"GO:0043288","GO:0043288","apocarotenoid metabolic process","2/89","11/9629",0.00440111830809007,0.0579236443149523,0.049876404967261,"Pp3c16_17210V3/Pp3c25_4810V3",2
"GO:1900407","GO:1900407","regulation of cellular response to oxidative stress","2/89","11/9629",0.00440111830809007,0.0579236443149523,0.049876404967261,"Pp3c22_7570V3/Pp3c22_7600V3",2
"GO:1900458","GO:1900458","negative regulation of brassinosteroid mediated signaling pathway","2/89","11/9629",0.00440111830809007,0.0579236443149523,0.049876404967261,"Pp3c13_18320V3/Pp3c4_13960V3",2
"GO:1902644","GO:1902644","tertiary alcohol metabolic process","2/89","11/9629",0.00440111830809007,0.0579236443149523,0.049876404967261,"Pp3c16_17210V3/Pp3c25_4810V3",2
"GO:0009415","GO:0009415","response to water","7/89","223/9629",0.00448777784782513,0.0579236443149523,0.049876404967261,"Pp3c16_14400V3/Pp3c16_17210V3/Pp3c22_8470V3/Pp3c25_4810V3/Pp3c3_4140V3/Pp3c4_510V3/Pp3c4_810V3",7
"GO:0009734","GO:0009734","auxin-activated signaling pathway","3/89","37/9629",0.00472659360321926,0.0596195329496975,0.0513366865038647,"Pp3c20_20860V3/Pp3c3_37540V3/Pp3c8_300V3",3
"GO:0006714","GO:0006714","sesquiterpenoid metabolic process","2/89","12/9629",0.00524971942549489,0.0633390061119492,0.0545394192030819,"Pp3c16_17210V3/Pp3c25_4810V3",2
"GO:0051085","GO:0051085","chaperone cofactor-dependent protein refolding","2/89","12/9629",0.00524971942549489,0.0633390061119492,0.0545394192030819,"Pp3c22_7570V3/Pp3c22_7600V3",2
"GO:0051084","GO:0051084","'de novo' post-translational protein folding","2/89","13/9629",0.00616709135008314,0.0713069937353363,0.0614004270381085,"Pp3c22_7570V3/Pp3c22_7600V3",2
"GO:0071732","GO:0071732","cellular response to nitric oxide","2/89","13/9629",0.00616709135008314,0.0713069937353363,0.0614004270381085,"Pp3c22_19580V3/Pp3c5_14800V3",2
"GO:0051353","GO:0051353","positive regulation of oxidoreductase activity","2/89","14/9629",0.0071519194309052,0.0793863056830477,0.0683572930869676,"Pp3c22_7570V3/Pp3c22_7600V3",2
"GO:1900457","GO:1900457","regulation of brassinosteroid mediated signaling pathway","2/89","14/9629",0.0071519194309052,0.0793863056830477,0.0683572930869676,"Pp3c13_18320V3/Pp3c4_13960V3",2
"GO:0098876","GO:0098876","vesicle-mediated transport to the plasma membrane","2/89","15/9629",0.00820290696926284,0.0892669287831545,0.0768652170081595,"Pp3c13_18320V3/Pp3c4_13960V3",2
"GO:0051291","GO:0051291","protein heterooligomerization","2/89","16/9629",0.00931877500522974,0.0940349114164092,0.080970791433001,"Pp3c22_7570V3/Pp3c22_7600V3",2
"GO:0062013","GO:0062013","positive regulation of small molecule metabolic process","2/89","16/9629",0.00931877500522974,0.0940349114164092,0.080970791433001,"Pp3c14_9180V3/Pp3c20_20860V3",2
"GO:0071731","GO:0071731","response to nitric oxide","2/89","16/9629",0.00931877500522974,0.0940349114164092,0.080970791433001,"Pp3c22_19580V3/Pp3c5_14800V3",2
"GO:0097366","GO:0097366","response to bronchodilator","2/89","16/9629",0.00931877500522974,0.0940349114164092,0.080970791433001,"Pp3c22_19580V3/Pp3c5_14800V3",2
"GO:0071369","GO:0071369","cellular response to ethylene stimulus","3/89","48/9629",0.00978219360757463,0.0969485259322128,0.0834796221398286,"Pp3c15_1990V3/Pp3c22_19580V3/Pp3c5_14800V3",3
"GO:0051341","GO:0051341","regulation of oxidoreductase activity","2/89","17/9629",0.0104982621065157,0.100305064970231,0.0863698425727547,"Pp3c22_7570V3/Pp3c22_7600V3",2
"GO:1902882","GO:1902882","regulation of response to oxidative stress","2/89","17/9629",0.0104982621065157,0.100305064970231,0.0863698425727547,"Pp3c22_7570V3/Pp3c22_7600V3",2
"GO:0019748","GO:0019748","secondary metabolic process","4/89","93/9629",0.0106630609607993,0.100305064970231,0.0863698425727547,"Pp3c1_6260V3/Pp3c14_11870V3/Pp3c22_19580V3/Pp3c5_14800V3",4
"GO:1902170","GO:1902170","cellular response to reactive nitrogen species","2/89","18/9629",0.0117401241596507,0.108596148476769,0.093509059096165,"Pp3c22_19580V3/Pp3c5_14800V3",2
"GO:0071365","GO:0071365","cellular response to auxin stimulus","3/89","52/9629",0.0121734583703623,0.110758514681165,0.0953710112190589,"Pp3c20_20860V3/Pp3c3_37540V3/Pp3c8_300V3",3
"GO:0034605","GO:0034605","cellular response to heat","2/89","19/9629",0.0130431341634639,0.114903800963849,0.0989403995022992,"Pp3c19_4790V3/Pp3c3_8110V3",2
"GO:0046885","GO:0046885","regulation of hormone biosynthetic process","2/89","19/9629",0.0130431341634639,0.114903800963849,0.0989403995022992,"Pp3c3_37540V3/Pp3c8_300V3",2
"GO:0045036","GO:0045036","protein targeting to chloroplast","3/89","57/9629",0.0155950521804007,0.133157753232652,0.114658359350638,"Pp3c26_10600V3/Pp3c4_27990V3/Pp3c4_810V3",3
"GO:0072596","GO:0072596","establishment of protein localization to chloroplast","3/89","57/9629",0.0155950521804007,0.133157753232652,0.114658359350638,"Pp3c26_10600V3/Pp3c4_27990V3/Pp3c4_810V3",3
"GO:0061077","GO:0061077","chaperone-mediated protein folding","3/89","58/9629",0.0163378126190293,0.135335611993452,0.116533651673831,"Pp3c16_4660V3/Pp3c22_7570V3/Pp3c22_7600V3",3
"GO:0072598","GO:0072598","protein localization to chloroplast","3/89","58/9629",0.0163378126190293,0.135335611993452,0.116533651673831,"Pp3c26_10600V3/Pp3c4_27990V3/Pp3c4_810V3",3
"GO:0009739","GO:0009739","response to gibberellin","3/89","59/9629",0.0171001878001994,0.137544988827691,0.118436083314882,"Pp3c14_11870V3/Pp3c3_37540V3/Pp3c8_300V3",3
"GO:0016114","GO:0016114","terpenoid biosynthetic process","3/89","59/9629",0.0171001878001994,0.137544988827691,0.118436083314882,"Pp3c16_17210V3/Pp3c24_8730V3/Pp3c25_4810V3",3
"GO:0019674","GO:0019674","NAD metabolic process","2/89","23/9629",0.0188427012173631,0.149395702509093,0.128640396280945,"Pp3c14_16940V3/Pp3c19_15510V3",2
"GO:0043085","GO:0043085","positive regulation of catalytic activity","5/89","180/9629",0.0254030864918744,0.194549895913114,0.167521389747849,"Pp3c13_13170V3/Pp3c19_14410V3/Pp3c19_15510V3/Pp3c22_7570V3/Pp3c22_7600V3",5
"GO:0006986","GO:0006986","response to unfolded protein","2/89","27/9629",0.0255267876299591,0.194549895913114,0.167521389747849,"Pp3c22_7570V3/Pp3c22_7600V3",2
"GO:0009845","GO:0009845","seed germination","3/89","69/9629",0.0258092739558465,0.194549895913114,0.167521389747849,"Pp3c12_11700V3/Pp3c3_37540V3/Pp3c8_300V3",3
"GO:0009733","GO:0009733","response to auxin","5/89","181/9629",0.0259399861217485,0.194549895913114,0.167521389747849,"Pp3c20_20860V3/Pp3c22_19580V3/Pp3c3_37540V3/Pp3c5_14800V3/Pp3c8_300V3",5
"GO:0009788","GO:0009788","negative regulation of abscisic acid-activated signaling pathway","2/89","29/9629",0.0291782642892654,0.207614572827466,0.178771011974717,"Pp3c22_7570V3/Pp3c22_7600V3",2
"GO:0042538","GO:0042538","hyperosmotic salinity response","2/89","29/9629",0.0291782642892654,0.207614572827466,0.178771011974717,"Pp3c16_17210V3/Pp3c25_4810V3",2
"GO:1901420","GO:1901420","negative regulation of response to alcohol","2/89","29/9629",0.0291782642892654,0.207614572827466,0.178771011974717,"Pp3c22_7570V3/Pp3c22_7600V3",2
"GO:1905958","GO:1905958","negative regulation of cellular response to alcohol","2/89","29/9629",0.0291782642892654,0.207614572827466,0.178771011974717,"Pp3c22_7570V3/Pp3c22_7600V3",2
"GO:0010380","GO:0010380","regulation of chlorophyll biosynthetic process","2/89","30/9629",0.0310776137682039,0.21152897931378,0.182141596222771,"Pp3c14_9180V3/Pp3c3_8110V3",2
"GO:0071281","GO:0071281","cellular response to iron ion","2/89","30/9629",0.0310776137682039,0.21152897931378,0.182141596222771,"Pp3c22_19580V3/Pp3c5_14800V3",2
"GO:0009753","GO:0009753","response to jasmonic acid","4/89","129/9629",0.0313556286967536,0.21152897931378,0.182141596222771,"Pp3c13_13170V3/Pp3c15_1990V3/Pp3c3_37540V3/Pp3c8_300V3",4
"GO:0007033","GO:0007033","vacuole organization","3/89","75/9629",0.0319827842256512,0.21152897931378,0.182141596222771,"Pp3c13_18320V3/Pp3c25_8060V3/Pp3c4_13960V3",3
"GO:2000377","GO:2000377","regulation of reactive oxygen species metabolic process","3/89","75/9629",0.0319827842256512,0.21152897931378,0.182141596222771,"Pp3c22_7570V3/Pp3c22_7600V3/Pp3c3_4140V3",3
"GO:0006970","GO:0006970","response to osmotic stress","9/89","478/9629",0.0320151968691126,0.21152897931378,0.182141596222771,"Pp3c1_6260V3/Pp3c12_21760V3/Pp3c16_17210V3/Pp3c21_6480V3/Pp3c21_6510V3/Pp3c25_4810V3/Pp3c3_37540V3/Pp3c4_810V3/Pp3c8_300V3",9
"GO:0090351","GO:0090351","seedling development","3/89","76/9629",0.0330804147640917,0.215946491993867,0.185945390925017,"Pp3c12_11700V3/Pp3c3_37540V3/Pp3c8_300V3",3
"GO:0008299","GO:0008299","isoprenoid biosynthetic process","3/89","77/9629",0.0341975626126006,0.215946491993867,0.185945390925017,"Pp3c16_17210V3/Pp3c24_8730V3/Pp3c25_4810V3",3
"GO:0006952","GO:0006952","defense response","9/89","485/9629",0.0346733320231416,0.215946491993867,0.185945390925017,"Pp3c1_9290V3/Pp3c11_17240V3/Pp3c13_13170V3/Pp3c14_11360V3/Pp3c15_1990V3/Pp3c18_15140V3/Pp3c2_32750V3/Pp3c22_8470V3/Pp3c7_700V3",9
"GO:0044093","GO:0044093","positive regulation of molecular function","5/89","196/9629",0.0348786917480619,0.215946491993867,0.185945390925017,"Pp3c13_13170V3/Pp3c19_14410V3/Pp3c19_15510V3/Pp3c22_7570V3/Pp3c22_7600V3",5
"GO:0051262","GO:0051262","protein tetramerization","2/89","32/9629",0.0350183500530595,0.215946491993867,0.185945390925017,"Pp3c22_7570V3/Pp3c22_7600V3",2
"GO:1901463","GO:1901463","regulation of tetrapyrrole biosynthetic process","2/89","32/9629",0.0350183500530595,0.215946491993867,0.185945390925017,"Pp3c14_9180V3/Pp3c3_8110V3",2
"GO:0009699","GO:0009699","phenylpropanoid biosynthetic process","2/89","33/9629",0.037057706642648,0.22115082996419,0.190426698537207,"Pp3c1_6260V3/Pp3c14_11870V3",2
"GO:0035966","GO:0035966","response to topologically incorrect protein","2/89","33/9629",0.037057706642648,0.22115082996419,0.190426698537207,"Pp3c22_7570V3/Pp3c22_7600V3",2
"GO:0090056","GO:0090056","regulation of chlorophyll metabolic process","2/89","33/9629",0.037057706642648,0.22115082996419,0.190426698537207,"Pp3c14_9180V3/Pp3c3_8110V3",2
"GO:0032870","GO:0032870","cellular response to hormone stimulus","7/89","340/9629",0.037535898017343,0.221621525527929,0.190832001118407,"Pp3c15_1990V3/Pp3c20_20860V3/Pp3c22_19580V3/Pp3c3_37540V3/Pp3c3_4140V3/Pp3c5_14800V3/Pp3c8_300V3",7
"GO:0006721","GO:0006721","terpenoid metabolic process","3/89","81/9629",0.038860204988055,0.223955236161493,0.192841493062717,"Pp3c16_17210V3/Pp3c24_8730V3/Pp3c25_4810V3",3
"GO:0009269","GO:0009269","response to desiccation","2/89","34/9629",0.0391417259597564,0.223955236161493,0.192841493062717,"Pp3c22_8470V3/Pp3c3_4140V3",2
"GO:0034614","GO:0034614","cellular response to reactive oxygen species","2/89","34/9629",0.0391417259597564,0.223955236161493,0.192841493062717,"Pp3c22_19580V3/Pp3c5_14800V3",2
"GO:0009409","GO:0009409","response to cold","7/89","347/9629",0.0411824932178564,0.229045328154847,0.197224426708962,"Pp3c13_13170V3/Pp3c16_24460V3/Pp3c22_7570V3/Pp3c22_7600V3/Pp3c26_10600V3/Pp3c3_4140V3/Pp3c3_8110V3",7
"GO:0009060","GO:0009060","aerobic respiration","2/89","35/9629",0.0412694284963688,0.229045328154847,0.197224426708962,"Pp3c14_16940V3/Pp3c19_15510V3",2
"GO:0016226","GO:0016226","iron-sulfur cluster assembly","2/89","35/9629",0.0412694284963688,0.229045328154847,0.197224426708962,"Pp3c19_15510V3/Pp3c25_3020V3",2
"GO:1901401","GO:1901401","regulation of tetrapyrrole metabolic process","2/89","37/9629",0.0456520346789602,0.250860190562603,0.216008585140677,"Pp3c14_9180V3/Pp3c3_8110V3",2
"GO:0071495","GO:0071495","cellular response to endogenous stimulus","7/89","367/9629",0.0528557330677518,0.287597371103944,0.247641927892253,"Pp3c15_1990V3/Pp3c20_20860V3/Pp3c22_19580V3/Pp3c3_37540V3/Pp3c3_4140V3/Pp3c5_14800V3/Pp3c8_300V3",7
"GO:0010039","GO:0010039","response to iron ion","2/89","42/9629",0.0573070808966942,0.305821441323705,0.263334157156874,"Pp3c22_19580V3/Pp3c5_14800V3",2
"GO:0046165","GO:0046165","alcohol biosynthetic process","2/89","42/9629",0.0573070808966942,0.305821441323705,0.263334157156874,"Pp3c16_17210V3/Pp3c25_4810V3",2
"GO:0009966","GO:0009966","regulation of signal transduction","6/89","306/9629",0.0635895247033894,0.336116059146487,0.289419992133722,"Pp3c13_18320V3/Pp3c15_1990V3/Pp3c20_20860V3/Pp3c22_7570V3/Pp3c22_7600V3/Pp3c4_13960V3",6
"GO:0009698","GO:0009698","phenylpropanoid metabolic process","2/89","45/9629",0.0647432850107365,0.33856698261599,0.291530412721972,"Pp3c1_6260V3/Pp3c14_11870V3",2
"GO:0048585","GO:0048585","negative regulation of response to stimulus","5/89","234/9629",0.0652732741259657,0.33856698261599,0.291530412721972,"Pp3c13_18320V3/Pp3c15_1990V3/Pp3c22_7570V3/Pp3c22_7600V3/Pp3c4_13960V3",5
"GO:0006720","GO:0006720","isoprenoid metabolic process","3/89","101/9629",0.0666706037087238,0.339512274291144,0.29234437653519,"Pp3c16_17210V3/Pp3c24_8730V3/Pp3c25_4810V3",3
"GO:0071248","GO:0071248","cellular response to metal ion","2/89","46/9629",0.0672907210306771,0.339512274291144,0.29234437653519,"Pp3c22_19580V3/Pp3c5_14800V3",2
"GO:0090333","GO:0090333","regulation of stomatal closure","2/89","46/9629",0.0672907210306771,0.339512274291144,0.29234437653519,"Pp3c16_14400V3/Pp3c3_4140V3",2
"GO:0098542","GO:0098542","defense response to other organism","7/89","392/9629",0.0701426922340045,0.350713461170023,0.301989400419517,"Pp3c11_17240V3/Pp3c13_13170V3/Pp3c15_1990V3/Pp3c18_15140V3/Pp3c2_32750V3/Pp3c22_8470V3/Pp3c7_700V3",7
"GO:0009630","GO:0009630","gravitropism","2/89","48/9629",0.0724836879767712,0.357406431697289,0.30775252724622,"Pp3c16_14400V3/Pp3c18_15140V3",2
"GO:0023051","GO:0023051","regulation of signaling","6/89","317/9629",0.0727692374446733,0.357406431697289,0.30775252724622,"Pp3c13_18320V3/Pp3c15_1990V3/Pp3c20_20860V3/Pp3c22_7570V3/Pp3c22_7600V3/Pp3c4_13960V3",6
"GO:0010646","GO:0010646","regulation of cell communication","6/89","319/9629",0.0745166915546068,0.362778629936901,0.312378374568712,"Pp3c13_18320V3/Pp3c15_1990V3/Pp3c20_20860V3/Pp3c22_7570V3/Pp3c22_7600V3/Pp3c4_13960V3",6
"GO:0045333","GO:0045333","cellular respiration","2/89","50/9629",0.0778021001795295,0.375479700866425,0.323314906009212,"Pp3c14_16940V3/Pp3c19_15510V3",2
"GO:0060918","GO:0060918","auxin transport","2/89","51/9629",0.080506386750394,0.385181419366109,0.331668780260244,"Pp3c16_14400V3/Pp3c20_20860V3",2
"GO:0009629","GO:0009629","response to gravity","2/89","53/9629",0.0860012984327419,0.397134230419868,0.341961006373865,"Pp3c16_14400V3/Pp3c18_15140V3",2
"GO:0006531","GO:0006531","aspartate metabolic process","1/89","10/9629",0.0887177045394916,0.397134230419868,0.341961006373865,"Pp3c19_15510V3",1
"GO:0010030","GO:0010030","positive regulation of seed germination","1/89","10/9629",0.0887177045394916,0.397134230419868,0.341961006373865,"Pp3c3_8110V3",1
"GO:0044057","GO:0044057","regulation of system process","1/89","10/9629",0.0887177045394916,0.397134230419868,0.341961006373865,"Pp3c25_8060V3",1
"GO:0051775","GO:0051775","response to redox state","1/89","10/9629",0.0887177045394916,0.397134230419868,0.341961006373865,"Pp3c14_16940V3",1
"GO:0071484","GO:0071484","cellular response to light intensity","1/89","10/9629",0.0887177045394916,0.397134230419868,0.341961006373865,"Pp3c3_8110V3",1
"GO:0071241","GO:0071241","cellular response to inorganic substance","2/89","55/9629",0.0916063628120964,0.397134230419868,0.341961006373865,"Pp3c22_19580V3/Pp3c5_14800V3",2
"GO:0009664","GO:0009664","plant-type cell wall organization","2/89","56/9629",0.0944483815856127,0.397134230419868,0.341961006373865,"Pp3c14_18440V3/Pp3c18_19660V3",2
"GO:0009651","GO:0009651","response to salt stress","7/89","422/9629",0.0949156436856261,0.397134230419868,0.341961006373865,"Pp3c1_6260V3/Pp3c12_21760V3/Pp3c16_17210V3/Pp3c25_4810V3/Pp3c3_37540V3/Pp3c4_810V3/Pp3c8_300V3",7
"GO:0010817","GO:0010817","regulation of hormone levels","4/89","188/9629",0.0960663587589318,0.397134230419868,0.341961006373865,"Pp3c16_14400V3/Pp3c20_20860V3/Pp3c3_37540V3/Pp3c8_300V3",4
"GO:0006521","GO:0006521","regulation of cellular amino acid metabolic process","1/89","11/9629",0.0971493631626319,0.397134230419868,0.341961006373865,"Pp3c20_20860V3",1
"GO:0009435","GO:0009435","NAD biosynthetic process","1/89","11/9629",0.0971493631626319,0.397134230419868,0.341961006373865,"Pp3c19_15510V3",1
"GO:0033238","GO:0033238","regulation of cellular amine metabolic process","1/89","11/9629",0.0971493631626319,0.397134230419868,0.341961006373865,"Pp3c20_20860V3",1
"GO:0042819","GO:0042819","vitamin B6 biosynthetic process","1/89","11/9629",0.0971493631626319,0.397134230419868,0.341961006373865,"Pp3c5_13160V3",1
"GO:0042823","GO:0042823","pyridoxal phosphate biosynthetic process","1/89","11/9629",0.0971493631626319,0.397134230419868,0.341961006373865,"Pp3c5_13160V3",1
"GO:0045828","GO:0045828","positive regulation of isoprenoid metabolic process","1/89","11/9629",0.0971493631626319,0.397134230419868,0.341961006373865,"Pp3c14_9180V3",1
"GO:0046889","GO:0046889","positive regulation of lipid biosynthetic process","1/89","11/9629",0.0971493631626319,0.397134230419868,0.341961006373865,"Pp3c14_9180V3",1
"GO:1901403","GO:1901403","positive regulation of tetrapyrrole metabolic process","1/89","11/9629",0.0971493631626319,0.397134230419868,0.341961006373865,"Pp3c14_9180V3",1
"GO:1901465","GO:1901465","positive regulation of tetrapyrrole biosynthetic process","1/89","11/9629",0.0971493631626319,0.397134230419868,0.341961006373865,"Pp3c14_9180V3",1
"GO:0009914","GO:0009914","hormone transport","2/89","57/9629",0.0973157753821659,0.397134230419868,0.341961006373865,"Pp3c16_14400V3/Pp3c20_20860V3",2
"GO:0009240","GO:0009240","isopentenyl diphosphate biosynthetic process","1/89","12/9629",0.105503876229644,0.420465113968815,0.362050567552095,"Pp3c24_8730V3",1
"GO:0009864","GO:0009864","induced systemic resistance, jasmonic acid mediated signaling pathway","1/89","12/9629",0.105503876229644,0.420465113968815,0.362050567552095,"Pp3c15_1990V3",1
"GO:0046490","GO:0046490","isopentenyl diphosphate metabolic process","1/89","12/9629",0.105503876229644,0.420465113968815,0.362050567552095,"Pp3c24_8730V3",1
"GO:0043648","GO:0043648","dicarboxylic acid metabolic process","2/89","60/9629",0.106063271992133,0.420465113968815,0.362050567552095,"Pp3c14_16940V3/Pp3c19_15510V3",2
"GO:0045017","GO:0045017","glycerolipid biosynthetic process","2/89","61/9629",0.109025282864113,0.426682281136029,0.367403993619264,"Pp3c2_32750V3/Pp3c25_8060V3",2
"GO:0008610","GO:0008610","lipid biosynthetic process","5/89","276/9629",0.111881687809374,0.426682281136029,0.367403993619264,"Pp3c16_17210V3/Pp3c2_32750V3/Pp3c24_8730V3/Pp3c25_4810V3/Pp3c25_8060V3",5
"GO:0009637","GO:0009637","response to blue light","3/89","127/9629",0.112883777129314,0.426682281136029,0.367403993619264,"Pp3c12_21760V3/Pp3c3_4140V3/Pp3c3_8110V3",3
"GO:0006559","GO:0006559","L-phenylalanine catabolic process","1/89","13/9629",0.113781941636274,0.426682281136029,0.367403993619264,"Pp3c14_11870V3",1
"GO:0010976","GO:0010976","positive regulation of neuron projection development","1/89","13/9629",0.113781941636274,0.426682281136029,0.367403993619264,"Pp3c25_8060V3",1
"GO:0042762","GO:0042762","regulation of sulfur metabolic process","1/89","13/9629",0.113781941636274,0.426682281136029,0.367403993619264,"Pp3c19_15510V3",1
"GO:0046898","GO:0046898","response to cycloheximide","1/89","13/9629",0.113781941636274,0.426682281136029,0.367403993619264,"Pp3c14_11870V3",1
"GO:0060992","GO:0060992","response to fungicide","1/89","13/9629",0.113781941636274,0.426682281136029,0.367403993619264,"Pp3c14_11870V3",1
"GO:0080167","GO:0080167","response to karrikin","2/89","63/9629",0.115014611911674,0.42841013161731,0.368891796594137,"Pp3c16_14400V3/Pp3c3_8110V3",2
"GO:0062012","GO:0062012","regulation of small molecule metabolic process","2/89","64/9629",0.118040644754965,0.43675038559337,0.376073352412309,"Pp3c14_9180V3/Pp3c20_20860V3",2
"GO:0010315","GO:0010315","auxin export across the plasma membrane","1/89","14/9629",0.121984251036687,0.437644253143201,0.376843036371765,"Pp3c20_20860V3",1
"GO:0010540","GO:0010540","basipetal auxin transport","1/89","14/9629",0.121984251036687,0.437644253143201,0.376843036371765,"Pp3c16_14400V3",1
"GO:0071491","GO:0071491","cellular response to red light","1/89","14/9629",0.121984251036687,0.437644253143201,0.376843036371765,"Pp3c3_8110V3",1
"GO:0071596","GO:0071596","ubiquitin-dependent protein catabolic process via the N-end rule pathway","1/89","14/9629",0.121984251036687,0.437644253143201,0.376843036371765,"Pp3c7_700V3",1
"GO:0050790","GO:0050790","regulation of catalytic activity","5/89","284/9629",0.122224971598552,0.437644253143201,0.376843036371765,"Pp3c13_13170V3/Pp3c19_14410V3/Pp3c19_15510V3/Pp3c22_7570V3/Pp3c22_7600V3",5
"GO:0009639","GO:0009639","response to red or far red light","4/89","206/9629",0.123051937826966,0.437780932653628,0.376960727216211,"Pp3c3_4140V3/Pp3c3_8110V3/Pp3c4_810V3/Pp3c8_1870V3",4
"GO:0006817","GO:0006817","phosphate ion transport","1/89","15/9629",0.130111489898646,0.443210014305416,0.38163555522932,"Pp3c16_25600V3",1
"GO:0009809","GO:0009809","lignin biosynthetic process","1/89","15/9629",0.130111489898646,0.443210014305416,0.38163555522932,"Pp3c1_6260V3",1
"GO:0045666","GO:0045666","positive regulation of neuron differentiation","1/89","15/9629",0.130111489898646,0.443210014305416,0.38163555522932,"Pp3c25_8060V3",1
"GO:0051961","GO:0051961","negative regulation of nervous system development","1/89","15/9629",0.130111489898646,0.443210014305416,0.38163555522932,"Pp3c25_8060V3",1
"GO:1902930","GO:1902930","regulation of alcohol biosynthetic process","1/89","15/9629",0.130111489898646,0.443210014305416,0.38163555522932,"Pp3c14_9180V3",1
"GO:0009751","GO:0009751","response to salicylic acid","2/89","69/9629",0.133459656292087,0.443210014305416,0.38163555522932,"Pp3c3_37540V3/Pp3c8_300V3",2
"GO:0071310","GO:0071310","cellular response to organic substance","7/89","462/9629",0.134648687080759,0.443210014305416,0.38163555522932,"Pp3c15_1990V3/Pp3c20_20860V3/Pp3c22_19580V3/Pp3c3_37540V3/Pp3c3_4140V3/Pp3c5_14800V3/Pp3c8_300V3",7
"GO:0006000","GO:0006000","fructose metabolic process","1/89","16/9629",0.138164337558207,0.443210014305416,0.38163555522932,"Pp3c25_1530V3",1
"GO:0006108","GO:0006108","malate metabolic process","1/89","16/9629",0.138164337558207,0.443210014305416,0.38163555522932,"Pp3c14_16940V3",1
"GO:0006833","GO:0006833","water transport","1/89","16/9629",0.138164337558207,0.443210014305416,0.38163555522932,"Pp3c4_510V3",1
"GO:0009704","GO:0009704","de-etiolation","1/89","16/9629",0.138164337558207,0.443210014305416,0.38163555522932,"Pp3c4_810V3",1
"GO:0042044","GO:0042044","fluid transport","1/89","16/9629",0.138164337558207,0.443210014305416,0.38163555522932,"Pp3c4_510V3",1
"GO:0055069","GO:0055069","zinc ion homeostasis","1/89","16/9629",0.138164337558207,0.443210014305416,0.38163555522932,"Pp3c16_14400V3",1
"GO:0071695","GO:0071695","anatomical structure maturation","3/89","140/9629",0.139541163125595,0.443210014305416,0.38163555522932,"Pp3c16_17210V3/Pp3c22_8470V3/Pp3c25_4810V3",3
"GO:0009787","GO:0009787","regulation of abscisic acid-activated signaling pathway","2/89","71/9629",0.139750905411618,0.443210014305416,0.38163555522932,"Pp3c22_7570V3/Pp3c22_7600V3",2
"GO:0015980","GO:0015980","energy derivation by oxidation of organic compounds","2/89","71/9629",0.139750905411618,0.443210014305416,0.38163555522932,"Pp3c14_16940V3/Pp3c19_15510V3",2
"GO:0055076","GO:0055076","transition metal ion homeostasis","2/89","71/9629",0.139750905411618,0.443210014305416,0.38163555522932,"Pp3c16_14400V3/Pp3c25_3020V3",2
"GO:1901419","GO:1901419","regulation of response to alcohol","2/89","71/9629",0.139750905411618,0.443210014305416,0.38163555522932,"Pp3c22_7570V3/Pp3c22_7600V3",2
"GO:1905957","GO:1905957","regulation of cellular response to alcohol","2/89","71/9629",0.139750905411618,0.443210014305416,0.38163555522932,"Pp3c22_7570V3/Pp3c22_7600V3",2
"GO:0006101","GO:0006101","citrate metabolic process","1/89","17/9629",0.146143467273938,0.445657276577119,0.383742823264129,"Pp3c14_16940V3",1
"GO:0031346","GO:0031346","positive regulation of cell projection organization","1/89","17/9629",0.146143467273938,0.445657276577119,0.383742823264129,"Pp3c25_8060V3",1
"GO:0043473","GO:0043473","pigmentation","1/89","17/9629",0.146143467273938,0.445657276577119,0.383742823264129,"Pp3c25_8060V3",1
"GO:0043650","GO:0043650","dicarboxylic acid biosynthetic process","1/89","17/9629",0.146143467273938,0.445657276577119,0.383742823264129,"Pp3c19_15510V3",1
"GO:0045834","GO:0045834","positive regulation of lipid metabolic process","1/89","17/9629",0.146143467273938,0.445657276577119,0.383742823264129,"Pp3c14_9180V3",1
"GO:0050769","GO:0050769","positive regulation of neurogenesis","1/89","17/9629",0.146143467273938,0.445657276577119,0.383742823264129,"Pp3c25_8060V3",1
"GO:0051962","GO:0051962","positive regulation of nervous system development","1/89","17/9629",0.146143467273938,0.445657276577119,0.383742823264129,"Pp3c25_8060V3",1
"GO:0012501","GO:0012501","programmed cell death","2/89","74/9629",0.149305947136149,0.447630880553752,0.385442237593937,"Pp3c13_18320V3/Pp3c4_13960V3",2
"GO:0046496","GO:0046496","nicotinamide nucleotide metabolic process","2/89","74/9629",0.149305947136149,0.447630880553752,0.385442237593937,"Pp3c14_16940V3/Pp3c19_15510V3",2
"GO:0019362","GO:0019362","pyridine nucleotide metabolic process","2/89","75/9629",0.152520280366573,0.447630880553752,0.385442237593937,"Pp3c14_16940V3/Pp3c19_15510V3",2
"GO:0007029","GO:0007029","endoplasmic reticulum organization","1/89","18/9629",0.15404954628066,0.447630880553752,0.385442237593937,"Pp3c2_6336V3",1
"GO:0007610","GO:0007610","behavior","1/89","18/9629",0.15404954628066,0.447630880553752,0.385442237593937,"Pp3c25_8060V3",1
"GO:0009682","GO:0009682","induced systemic resistance","1/89","18/9629",0.15404954628066,0.447630880553752,0.385442237593937,"Pp3c15_1990V3",1
"GO:0009958","GO:0009958","positive gravitropism","1/89","18/9629",0.15404954628066,0.447630880553752,0.385442237593937,"Pp3c18_15140V3",1
"GO:0010193","GO:0010193","response to ozone","1/89","18/9629",0.15404954628066,0.447630880553752,0.385442237593937,"Pp3c11_17240V3",1
"GO:0071483","GO:0071483","cellular response to blue light","1/89","18/9629",0.15404954628066,0.447630880553752,0.385442237593937,"Pp3c3_8110V3",1
"GO:0006066","GO:0006066","alcohol metabolic process","2/89","76/9629",0.155748384842316,0.45021017493482,0.387663194728133,"Pp3c16_17210V3/Pp3c25_4810V3",2
"GO:1901698","GO:1901698","response to nitrogen compound","4/89","229/9629",0.16165807464277,0.457082882380303,0.393581087910208,"Pp3c14_11870V3/Pp3c15_1990V3/Pp3c22_19580V3/Pp3c5_14800V3",4
"GO:0009834","GO:0009834","plant-type secondary cell wall biogenesis","1/89","19/9629",0.161883235842727,0.457082882380303,0.393581087910208,"Pp3c20_20860V3",1
"GO:0031338","GO:0031338","regulation of vesicle fusion","1/89","19/9629",0.161883235842727,0.457082882380303,0.393581087910208,"Pp3c19_14410V3",1
"GO:0072350","GO:0072350","tricarboxylic acid metabolic process","1/89","19/9629",0.161883235842727,0.457082882380303,0.393581087910208,"Pp3c14_16940V3",1
"GO:0048511","GO:0048511","rhythmic process","2/89","78/9629",0.162243833925981,0.457082882380303,0.393581087910208,"Pp3c3_37540V3/Pp3c8_300V3",2
"GO:0009808","GO:0009808","lignin metabolic process","1/89","20/9629",0.169645191306827,0.470408807851852,0.405055663849674,"Pp3c1_6260V3",1
"GO:0045491","GO:0045491","xylan metabolic process","1/89","20/9629",0.169645191306827,0.470408807851852,0.405055663849674,"Pp3c3_28310V3",1
"GO:0021700","GO:0021700","developmental maturation","3/89","154/9629",0.170364270951752,0.470408807851852,0.405055663849674,"Pp3c16_17210V3/Pp3c22_8470V3/Pp3c25_4810V3",3
"GO:0048609","GO:0048609","multicellular organismal reproductive process","3/89","154/9629",0.170364270951752,0.470408807851852,0.405055663849674,"Pp3c16_17210V3/Pp3c22_8470V3/Pp3c25_4810V3",3
"GO:0072524","GO:0072524","pyridine-containing compound metabolic process","2/89","81/9629",0.172077546040078,0.472787317090312,0.407103730600288,"Pp3c14_16940V3/Pp3c19_15510V3",2
"GO:0007623","GO:0007623","circadian rhythm","2/89","82/9629",0.175377633136049,0.477774342211918,0.411397916290585,"Pp3c3_37540V3/Pp3c8_300V3",2
"GO:0010720","GO:0010720","positive regulation of cell development","1/89","21/9629",0.177336062154334,0.477774342211918,0.411397916290585,"Pp3c25_8060V3",1
"GO:0072488","GO:0072488","ammonium transmembrane transport","1/89","21/9629",0.177336062154334,0.477774342211918,0.411397916290585,"Pp3c16_22550V3",1
"GO:0090630","GO:0090630","activation of GTPase activity","1/89","21/9629",0.177336062154334,0.477774342211918,0.411397916290585,"Pp3c19_14410V3",1
"GO:0008654","GO:0008654","phospholipid biosynthetic process","2/89","84/9629",0.182008234828811,0.479109645716145,0.412547708212669,"Pp3c24_8730V3/Pp3c25_8060V3",2
"GO:0009606","GO:0009606","tropism","2/89","84/9629",0.182008234828811,0.479109645716145,0.412547708212669,"Pp3c16_14400V3/Pp3c18_15140V3",2
"GO:0008356","GO:0008356","asymmetric cell division","1/89","22/9629",0.184956492053196,0.479109645716145,0.412547708212669,"Pp3c12_23920V3",1
"GO:0019747","GO:0019747","regulation of isoprenoid metabolic process","1/89","22/9629",0.184956492053196,0.479109645716145,0.412547708212669,"Pp3c14_9180V3",1
"GO:0031163","GO:0031163","metallo-sulfur cluster assembly","1/89","22/9629",0.184956492053196,0.479109645716145,0.412547708212669,"Pp3c19_15510V3",1
"GO:1903428","GO:1903428","positive regulation of reactive oxygen species biosynthetic process","1/89","22/9629",0.184956492053196,0.479109645716145,0.412547708212669,"Pp3c3_4140V3",1
"GO:1901699","GO:1901699","cellular response to nitrogen compound","2/89","85/9629",0.185337827104466,0.479109645716145,0.412547708212669,"Pp3c22_19580V3/Pp3c5_14800V3",2
"GO:0080135","GO:0080135","regulation of cellular response to stress","2/89","86/9629",0.188676344575956,0.479109645716145,0.412547708212669,"Pp3c22_7570V3/Pp3c22_7600V3",2
"GO:0006002","GO:0006002","fructose 6-phosphate metabolic process","1/89","23/9629",0.19250711890937,0.479109645716145,0.412547708212669,"Pp3c25_1530V3",1
"GO:0006661","GO:0006661","phosphatidylinositol biosynthetic process","1/89","23/9629",0.19250711890937,0.479109645716145,0.412547708212669,"Pp3c25_8060V3",1
"GO:0009769","GO:0009769","photosynthesis, light harvesting in photosystem II","1/89","23/9629",0.19250711890937,0.479109645716145,0.412547708212669,"Pp3c3_4140V3",1
"GO:0019682","GO:0019682","glyceraldehyde-3-phosphate metabolic process","1/89","23/9629",0.19250711890937,0.479109645716145,0.412547708212669,"Pp3c24_8730V3",1
"GO:0034250","GO:0034250","positive regulation of cellular amide metabolic process","1/89","23/9629",0.19250711890937,0.479109645716145,0.412547708212669,"Pp3c19_4790V3",1
"GO:0045727","GO:0045727","positive regulation of translation","1/89","23/9629",0.19250711890937,0.479109645716145,0.412547708212669,"Pp3c19_4790V3",1
"GO:0046856","GO:0046856","phosphatidylinositol dephosphorylation","1/89","23/9629",0.19250711890937,0.479109645716145,0.412547708212669,"Pp3c25_8060V3",1
"GO:0070298","GO:0070298","negative regulation of phosphorelay signal transduction system","1/89","23/9629",0.19250711890937,0.479109645716145,0.412547708212669,"Pp3c15_1990V3",1
"GO:1901654","GO:1901654","response to ketone","1/89","23/9629",0.19250711890937,0.479109645716145,0.412547708212669,"Pp3c14_11870V3",1
"GO:1901615","GO:1901615","organic hydroxy compound metabolic process","3/89","164/9629",0.19348392919556,0.479390985283643,0.412789961723611,"Pp3c16_17210V3/Pp3c25_4810V3/Pp3c9_1480V3",3
"GO:0006417","GO:0006417","regulation of translation","2/89","88/9629",0.195378391875041,0.481933366625102,0.414979134087807,"Pp3c12_21760V3/Pp3c19_4790V3",2
"GO:0009641","GO:0009641","shade avoidance","1/89","24/9629",0.199988574917809,0.485499478842806,0.418049812033445,"Pp3c8_1870V3",1
"GO:0010927","GO:0010927","cellular component assembly involved in morphogenesis","1/89","24/9629",0.199988574917809,0.485499478842806,0.418049812033445,"Pp3c25_8060V3",1
"GO:0048666","GO:0048666","neuron development","1/89","24/9629",0.199988574917809,0.485499478842806,0.418049812033445,"Pp3c25_8060V3",1
"GO:0008219","GO:0008219","cell death","2/89","90/9629",0.202110922154159,0.485499478842806,0.418049812033445,"Pp3c13_18320V3/Pp3c4_13960V3",2
"GO:0034248","GO:0034248","regulation of cellular amide metabolic process","2/89","90/9629",0.202110922154159,0.485499478842806,0.418049812033445,"Pp3c12_21760V3/Pp3c19_4790V3",2
"GO:0042742","GO:0042742","defense response to bacterium","4/89","251/9629",0.202184209245156,0.485499478842806,0.418049812033445,"Pp3c11_17240V3/Pp3c13_13170V3/Pp3c15_1990V3/Pp3c18_15140V3",4
"GO:0032504","GO:0032504","multicellular organism reproduction","3/89","168/9629",0.202947529894651,0.485499478842806,0.418049812033445,"Pp3c16_17210V3/Pp3c22_8470V3/Pp3c25_4810V3",3
"GO:0009832","GO:0009832","plant-type cell wall biogenesis","2/89","91/9629",0.205487569823334,0.485687025612723,0.418211303230301,"Pp3c20_20860V3/Pp3c25_8060V3",2
"GO:0006879","GO:0006879","cellular iron ion homeostasis","1/89","25/9629",0.207401486613001,0.485687025612723,0.418211303230301,"Pp3c25_3020V3",1
"GO:0010105","GO:0010105","negative regulation of ethylene-activated signaling pathway","1/89","25/9629",0.207401486613001,0.485687025612723,0.418211303230301,"Pp3c15_1990V3",1
"GO:0010975","GO:0010975","regulation of neuron projection development","1/89","25/9629",0.207401486613001,0.485687025612723,0.418211303230301,"Pp3c25_8060V3",1
"GO:0043562","GO:0043562","cellular response to nitrogen levels","1/89","25/9629",0.207401486613001,0.485687025612723,0.418211303230301,"Pp3c18_15140V3",1
"GO:0009755","GO:0009755","hormone-mediated signaling pathway","4/89","255/9629",0.209866545390516,0.489394675175363,0.421403854963707,"Pp3c15_1990V3/Pp3c20_20860V3/Pp3c3_37540V3/Pp3c8_300V3",4
"GO:0010218","GO:0010218","response to far red light","2/89","93/9629",0.212259593539832,0.492497080909425,0.424075248426513,"Pp3c3_4140V3/Pp3c3_8110V3",2
"GO:0010223","GO:0010223","secondary shoot formation","1/89","26/9629",0.214746474919065,0.492497080909425,0.424075248426513,"Pp3c8_1870V3",1
"GO:0010346","GO:0010346","shoot axis formation","1/89","26/9629",0.214746474919065,0.492497080909425,0.424075248426513,"Pp3c8_1870V3",1
"GO:0034644","GO:0034644","cellular response to UV","1/89","26/9629",0.214746474919065,0.492497080909425,0.424075248426513,"Pp3c3_8110V3",1
"GO:0033993","GO:0033993","response to lipid","6/89","437/9629",0.216678644672379,0.494883324251729,0.426129974794281,"Pp3c14_11870V3/Pp3c15_1990V3/Pp3c3_37540V3/Pp3c3_4140V3/Pp3c4_510V3/Pp3c8_300V3",6
"GO:0034599","GO:0034599","cellular response to oxidative stress","2/89","95/9629",0.219053951636519,0.498257963763393,0.429035781030973,"Pp3c22_19580V3/Pp3c5_14800V3",2
"GO:0010104","GO:0010104","regulation of ethylene-activated signaling pathway","1/89","27/9629",0.222024155199415,0.49888018678411,0.42957155960168,"Pp3c15_1990V3",1
"GO:0050821","GO:0050821","protein stabilization","1/89","27/9629",0.222024155199415,0.49888018678411,0.42957155960168,"Pp3c16_24460V3",1
"GO:0070297","GO:0070297","regulation of phosphorelay signal transduction system","1/89","27/9629",0.222024155199415,0.49888018678411,0.42957155960168,"Pp3c15_1990V3",1
"GO:0030182","GO:0030182","neuron differentiation","1/89","28/9629",0.229235137305982,0.506874506792111,0.436455241505203,"Pp3c25_8060V3",1
"GO:0045664","GO:0045664","regulation of neuron differentiation","1/89","28/9629",0.229235137305982,0.506874506792111,0.436455241505203,"Pp3c25_8060V3",1
"GO:0046890","GO:0046890","regulation of lipid biosynthetic process","1/89","28/9629",0.229235137305982,0.506874506792111,0.436455241505203,"Pp3c14_9180V3",1
"GO:0055072","GO:0055072","iron ion homeostasis","1/89","28/9629",0.229235137305982,0.506874506792111,0.436455241505203,"Pp3c25_3020V3",1
"GO:0009737","GO:0009737","response to abscisic acid","5/89","355/9629",0.230851591038906,0.508423146930925,0.437788731544125,"Pp3c15_1990V3/Pp3c3_37540V3/Pp3c3_4140V3/Pp3c4_510V3/Pp3c8_300V3",5
"GO:1903426","GO:1903426","regulation of reactive oxygen species biosynthetic process","1/89","29/9629",0.236380025628007,0.518541162938909,0.446501067755836,"Pp3c3_4140V3",1
"GO:0006605","GO:0006605","protein targeting","3/89","183/9629",0.239321837971502,0.521353564079876,0.448922746500263,"Pp3c26_10600V3/Pp3c4_27990V3/Pp3c4_810V3",3
"GO:0010114","GO:0010114","response to red light","2/89","101/9629",0.239540826739402,0.521353564079876,0.448922746500263,"Pp3c3_4140V3/Pp3c3_8110V3",2
"GO:0065009","GO:0065009","regulation of molecular function","5/89","362/9629",0.242866754404721,0.523720843499728,0.450961143573023,"Pp3c13_13170V3/Pp3c19_14410V3/Pp3c19_15510V3/Pp3c22_7570V3/Pp3c22_7600V3",5
"GO:0030104","GO:0030104","water homeostasis","1/89","30/9629",0.243459419140414,0.523720843499728,0.450961143573023,"Pp3c3_4140V3",1
"GO:0050767","GO:0050767","regulation of neurogenesis","1/89","30/9629",0.243459419140414,0.523720843499728,0.450961143573023,"Pp3c25_8060V3",1
"GO:0046486","GO:0046486","glycerolipid metabolic process","2/89","104/9629",0.249824974819984,0.530584049067637,0.456870854958192,"Pp3c2_32750V3/Pp3c25_8060V3",2
"GO:0002218","GO:0002218","activation of innate immune response","1/89","31/9629",0.250473911451749,0.530584049067637,0.456870854958192,"Pp3c15_1990V3",1
"GO:0010074","GO:0010074","maintenance of meristem identity","1/89","31/9629",0.250473911451749,0.530584049067637,0.456870854958192,"Pp3c18_15140V3",1
"GO:0031647","GO:0031647","regulation of protein stability","1/89","31/9629",0.250473911451749,0.530584049067637,0.456870854958192,"Pp3c16_24460V3",1
"GO:1901617","GO:1901617","organic hydroxy compound biosynthetic process","2/89","105/9629",0.253256795834629,0.53443924596281,0.460190455508991,"Pp3c16_17210V3/Pp3c25_4810V3",2
"GO:0001763","GO:0001763","morphogenesis of a branching structure","1/89","32/9629",0.257424090851706,0.535095020309727,0.460755124173762,"Pp3c8_1870V3",1
"GO:0016125","GO:0016125","sterol metabolic process","1/89","32/9629",0.257424090851706,0.535095020309727,0.460755124173762,"Pp3c9_1480V3",1
"GO:0051960","GO:0051960","regulation of nervous system development","1/89","32/9629",0.257424090851706,0.535095020309727,0.460755124173762,"Pp3c25_8060V3",1
"GO:2000030","GO:2000030","regulation of response to red or far red light","1/89","32/9629",0.257424090851706,0.535095020309727,0.460755124173762,"Pp3c25_3020V3",1
"GO:0009891","GO:0009891","positive regulation of biosynthetic process","5/89","374/9629",0.26385030400412,0.539310109922144,0.464384618121675,"Pp3c12_21760V3/Pp3c14_9180V3/Pp3c19_4790V3/Pp3c3_4140V3/Pp3c8_1870V3",5
"GO:0009658","GO:0009658","chloroplast organization","3/89","193/9629",0.264170334164649,0.539310109922144,0.464384618121675,"Pp3c1_7030V3/Pp3c11_17240V3/Pp3c12_11700V3",3
"GO:0002253","GO:0002253","activation of immune response","1/89","33/9629",0.26431054035824,0.539310109922144,0.464384618121675,"Pp3c15_1990V3",1
"GO:0031344","GO:0031344","regulation of cell projection organization","1/89","33/9629",0.26431054035824,0.539310109922144,0.464384618121675,"Pp3c25_8060V3",1
"GO:0120035","GO:0120035","regulation of plasma membrane bounded cell projection organization","1/89","33/9629",0.26431054035824,0.539310109922144,0.464384618121675,"Pp3c25_8060V3",1
"GO:0009617","GO:0009617","response to bacterium","4/89","283/9629",0.265723627844954,0.540207375289193,0.465157227845033,"Pp3c11_17240V3/Pp3c13_13170V3/Pp3c15_1990V3/Pp3c18_15140V3",4
"GO:0009926","GO:0009926","auxin polar transport","1/89","34/9629",0.271133837764254,0.545214782460729,0.469468963939632,"Pp3c16_14400V3",1
"GO:0010928","GO:0010928","regulation of auxin mediated signaling pathway","1/89","34/9629",0.271133837764254,0.545214782460729,0.469468963939632,"Pp3c20_20860V3",1
"GO:0045037","GO:0045037","protein import into chloroplast stroma","1/89","34/9629",0.271133837764254,0.545214782460729,0.469468963939632,"Pp3c4_810V3",1
"GO:0014070","GO:0014070","response to organic cyclic compound","3/89","198/9629",0.276721527175185,0.554442049033312,0.477414301111662,"Pp3c14_11870V3/Pp3c3_37540V3/Pp3c8_300V3",3
"GO:0051240","GO:0051240","positive regulation of multicellular organismal process","2/89","114/9629",0.284167267953388,0.560103759528849,0.482289439214978,"Pp3c25_8060V3/Pp3c3_8110V3",2
"GO:0010043","GO:0010043","response to zinc ion","1/89","36/9629",0.284593261598442,0.560103759528849,0.482289439214978,"Pp3c16_14400V3",1
"GO:0010200","GO:0010200","response to chitin","1/89","36/9629",0.284593261598442,0.560103759528849,0.482289439214978,"Pp3c15_1990V3",1
"GO:0045597","GO:0045597","positive regulation of cell differentiation","1/89","36/9629",0.284593261598442,0.560103759528849,0.482289439214978,"Pp3c25_8060V3",1
"GO:0071489","GO:0071489","cellular response to red or far red light","1/89","36/9629",0.284593261598442,0.560103759528849,0.482289439214978,"Pp3c3_8110V3",1
"GO:0055065","GO:0055065","metal ion homeostasis","2/89","115/9629",0.287599075258706,0.564019387874848,0.485661075571704,"Pp3c16_14400V3/Pp3c25_3020V3",2
"GO:0009909","GO:0009909","regulation of flower development","2/89","117/9629",0.294457767217908,0.571614698779249,0.492201182068808,"Pp3c3_37540V3/Pp3c8_300V3",2
"GO:0010119","GO:0010119","regulation of stomatal movement","2/89","117/9629",0.294457767217908,0.571614698779249,0.492201182068808,"Pp3c16_14400V3/Pp3c3_4140V3",2
"GO:0006629","GO:0006629","lipid metabolic process","6/89","487/9629",0.294561808740297,0.571614698779249,0.492201182068808,"Pp3c16_17210V3/Pp3c2_32750V3/Pp3c24_8730V3/Pp3c25_4810V3/Pp3c25_8060V3/Pp3c9_1480V3",6
"GO:0019637","GO:0019637","organophosphate metabolic process","5/89","392/9629",0.296080000157661,0.571912870171994,0.492457928986411,"Pp3c14_16940V3/Pp3c19_15510V3/Pp3c24_8730V3/Pp3c25_1530V3/Pp3c25_8060V3",5
"GO:0019827","GO:0019827","stem cell population maintenance","1/89","38/9629",0.297806881945417,0.571912870171994,0.492457928986411,"Pp3c18_15140V3",1
"GO:0098727","GO:0098727","maintenance of cell number","1/89","38/9629",0.297806881945417,0.571912870171994,0.492457928986411,"Pp3c18_15140V3",1
"GO:0010565","GO:0010565","regulation of cellular ketone metabolic process","1/89","39/9629",0.304322906083343,0.580409666241428,0.499774278755066,"Pp3c20_20860V3",1
"GO:0071805","GO:0071805","potassium ion transmembrane transport","1/89","39/9629",0.304322906083343,0.580409666241428,0.499774278755066,"Pp3c16_14400V3",1
"GO:0044255","GO:0044255","cellular lipid metabolic process","5/89","400/9629",0.310631991150188,0.584686174347327,0.503456658423302,"Pp3c16_17210V3/Pp3c2_32750V3/Pp3c24_8730V3/Pp3c25_4810V3/Pp3c25_8060V3",5
"GO:0006099","GO:0006099","tricarboxylic acid cycle","1/89","40/9629",0.310779137716147,0.584686174347327,0.503456658423302,"Pp3c14_16940V3",1
"GO:0009627","GO:0009627","systemic acquired resistance","1/89","40/9629",0.310779137716147,0.584686174347327,0.503456658423302,"Pp3c2_32750V3",1
"GO:0010410","GO:0010410","hemicellulose metabolic process","1/89","40/9629",0.310779137716147,0.584686174347327,0.503456658423302,"Pp3c3_28310V3",1
"GO:0071669","GO:0071669","plant-type cell wall organization or biogenesis","2/89","123/9629",0.314976211028608,0.588738281708794,0.506945812983959,"Pp3c20_20860V3/Pp3c25_8060V3",2
"GO:0009645","GO:0009645","response to low light intensity stimulus","1/89","41/9629",0.317176119335008,0.588738281708794,0.506945812983959,"Pp3c3_4140V3",1
"GO:0034249","GO:0034249","negative regulation of cellular amide metabolic process","1/89","41/9629",0.317176119335008,0.588738281708794,0.506945812983959,"Pp3c12_21760V3",1
"GO:0072507","GO:0072507","divalent inorganic cation homeostasis","1/89","41/9629",0.317176119335008,0.588738281708794,0.506945812983959,"Pp3c16_14400V3",1
"GO:0042546","GO:0042546","cell wall biogenesis","2/89","124/9629",0.318385008660199,0.589012266021369,0.507181733093791,"Pp3c20_20860V3/Pp3c25_8060V3",2
"GO:0051094","GO:0051094","positive regulation of developmental process","2/89","125/9629",0.321790065438786,0.59062659754504,0.508571788118441,"Pp3c25_8060V3/Pp3c3_8110V3",2
"GO:0009873","GO:0009873","ethylene-activated signaling pathway","1/89","42/9629",0.323514388565211,0.59062659754504,0.508571788118441,"Pp3c15_1990V3",1
"GO:0010224","GO:0010224","response to UV-B","1/89","42/9629",0.323514388565211,0.59062659754504,0.508571788118441,"Pp3c3_8110V3",1
"GO:0046474","GO:0046474","glycerophospholipid biosynthetic process","1/89","42/9629",0.323514388565211,0.59062659754504,0.508571788118441,"Pp3c25_8060V3",1
"GO:0010016","GO:0010016","shoot system morphogenesis","2/89","126/9629",0.325191160954166,0.59174129288381,0.509531620614983,"Pp3c12_21760V3/Pp3c8_1870V3",2
"GO:0006644","GO:0006644","phospholipid metabolic process","2/89","127/9629",0.328588079095363,0.594272517552438,0.511711186285077,"Pp3c24_8730V3/Pp3c25_8060V3",2
"GO:0009073","GO:0009073","aromatic amino acid family biosynthetic process","1/89","43/9629",0.329794478209281,0.594272517552438,0.511711186285077,"Pp3c1_31930V3",1
"GO:0017148","GO:0017148","negative regulation of translation","1/89","43/9629",0.329794478209281,0.594272517552438,0.511711186285077,"Pp3c12_21760V3",1
"GO:0071554","GO:0071554","cell wall organization or biogenesis","3/89","220/9629",0.332479125971591,0.597171245677129,0.514207198743322,"Pp3c20_20860V3/Pp3c25_8060V3/Pp3c3_28310V3",3
"GO:0043547","GO:0043547","positive regulation of GTPase activity","1/89","44/9629",0.33601691628975,0.601578672712294,0.518002308983179,"Pp3c19_14410V3",1
"GO:0010411","GO:0010411","xyloglucan metabolic process","1/89","45/9629",0.342182226091545,0.60868953679746,0.524125272083541,"Pp3c3_28310V3",1
"GO:0046488","GO:0046488","phosphatidylinositol metabolic process","1/89","45/9629",0.342182226091545,0.60868953679746,0.524125272083541,"Pp3c25_8060V3",1
"GO:0072594","GO:0072594","establishment of protein localization to organelle","3/89","225/9629",0.345186467063316,0.611713493807674,0.526729115578348,"Pp3c26_10600V3/Pp3c4_27990V3/Pp3c4_810V3",3
"GO:0006414","GO:0006414","translational elongation","1/89","46/9629",0.348290926204009,0.611713493807674,0.526729115578348,"Pp3c12_11700V3",1
"GO:0008202","GO:0008202","steroid metabolic process","1/89","46/9629",0.348290926204009,0.611713493807674,0.526729115578348,"Pp3c9_1480V3",1
"GO:0009066","GO:0009066","aspartate family amino acid metabolic process","1/89","46/9629",0.348290926204009,0.611713493807674,0.526729115578348,"Pp3c19_15510V3",1
"GO:0043087","GO:0043087","regulation of GTPase activity","1/89","47/9629",0.354343530562544,0.620380629218334,0.53419213971574,"Pp3c19_14410V3",1
"GO:0000272","GO:0000272","polysaccharide catabolic process","1/89","48/9629",0.360340548489901,0.621083864633215,0.53479767575814,"Pp3c3_28310V3",1
"GO:0009768","GO:0009768","photosynthesis, light harvesting in photosystem I","1/89","48/9629",0.360340548489901,0.621083864633215,0.53479767575814,"Pp3c3_4140V3",1
"GO:0010029","GO:0010029","regulation of seed germination","1/89","48/9629",0.360340548489901,0.621083864633215,0.53479767575814,"Pp3c3_8110V3",1
"GO:0046916","GO:0046916","cellular transition metal ion homeostasis","1/89","48/9629",0.360340548489901,0.621083864633215,0.53479767575814,"Pp3c25_3020V3",1
"GO:1902532","GO:1902532","negative regulation of intracellular signal transduction","1/89","48/9629",0.360340548489901,0.621083864633215,0.53479767575814,"Pp3c15_1990V3",1
"GO:0055080","GO:0055080","cation homeostasis","2/89","138/9629",0.365620793814619,0.625497781627968,0.538598374317871,"Pp3c16_14400V3/Pp3c25_3020V3",2
"GO:0010383","GO:0010383","cell wall polysaccharide metabolic process","1/89","49/9629",0.366282484737098,0.625497781627968,0.538598374317871,"Pp3c3_28310V3",1
"GO:0019359","GO:0019359","nicotinamide nucleotide biosynthetic process","1/89","49/9629",0.366282484737098,0.625497781627968,0.538598374317871,"Pp3c19_15510V3",1
"GO:0006081","GO:0006081","cellular aldehyde metabolic process","1/89","50/9629",0.372169839523988,0.629738600414065,0.542250022926478,"Pp3c24_8730V3",1
"GO:0006813","GO:0006813","potassium ion transport","1/89","50/9629",0.372169839523988,0.629738600414065,0.542250022926478,"Pp3c16_14400V3",1
"GO:0019363","GO:0019363","pyridine nucleotide biosynthetic process","1/89","50/9629",0.372169839523988,0.629738600414065,0.542250022926478,"Pp3c19_15510V3",1
"GO:0045089","GO:0045089","positive regulation of innate immune response","1/89","51/9629",0.37800310857946,0.633577968550651,0.545555993782827,"Pp3c15_1990V3",1
"GO:0010243","GO:0010243","response to organonitrogen compound","2/89","142/9629",0.378906098293031,0.633577968550651,0.545555993782827,"Pp3c14_11870V3/Pp3c15_1990V3",2
"GO:0098771","GO:0098771","inorganic ion homeostasis","2/89","142/9629",0.378906098293031,0.633577968550651,0.545555993782827,"Pp3c16_14400V3/Pp3c25_3020V3",2
"GO:1901701","GO:1901701","cellular response to oxygen-containing compound","4/89","337/9629",0.379005199205074,0.633577968550651,0.545555993782827,"Pp3c15_1990V3/Pp3c22_19580V3/Pp3c3_4140V3/Pp3c5_14800V3",4
"GO:1900140","GO:1900140","regulation of seedling development","1/89","52/9629",0.3837827831813,0.639637971968834,0.550774090609484,"Pp3c3_8110V3",1
"GO:0019216","GO:0019216","regulation of lipid metabolic process","1/89","53/9629",0.389509350195695,0.647238590894045,0.557318767692549,"Pp3c14_9180V3",1
"GO:0048584","GO:0048584","positive regulation of response to stimulus","3/89","244/9629",0.393219850740136,0.651453782569479,0.560948349524028,"Pp3c15_1990V3/Pp3c22_7570V3/Pp3c22_7600V3",3
"GO:0048582","GO:0048582","positive regulation of post-embryonic development","1/89","54/9629",0.395183292116391,0.652758116442253,0.56207147437607,"Pp3c3_8110V3",1
"GO:0031328","GO:0031328","positive regulation of cellular biosynthetic process","4/89","347/9629",0.40011288030932,0.656185319594238,0.565022541670525,"Pp3c12_21760V3/Pp3c14_9180V3/Pp3c19_4790V3/Pp3c8_1870V3",4
"GO:0045814","GO:0045814","negative regulation of gene expression, epigenetic","1/89","55/9629",0.400805087103508,0.656185319594238,0.565022541670525,"Pp3c4_4790V3",1
"GO:0048699","GO:0048699","generation of neurons","1/89","55/9629",0.400805087103508,0.656185319594238,0.565022541670525,"Pp3c25_8060V3",1
"GO:0048878","GO:0048878","chemical homeostasis","3/89","248/9629",0.403240205788186,0.656300041678719,0.565121325599125,"Pp3c16_14400V3/Pp3c25_3020V3/Pp3c3_4140V3",3
"GO:2000113","GO:2000113","negative regulation of cellular macromolecule biosynthetic process","3/89","248/9629",0.403240205788186,0.656300041678719,0.565121325599125,"Pp3c12_21760V3/Pp3c15_1990V3/Pp3c4_4790V3",3
"GO:0072525","GO:0072525","pyridine-containing compound biosynthetic process","1/89","56/9629",0.406375209022015,0.659468540956778,0.567849630335472,"Pp3c19_15510V3",1
"GO:0010087","GO:0010087","phloem or xylem histogenesis","1/89","57/9629",0.411894127479869,0.666410503176564,0.573827156836719,"Pp3c18_15140V3",1
"GO:0051173","GO:0051173","positive regulation of nitrogen compound metabolic process","5/89","456/9629",0.414185221335206,0.666410503176564,0.573827156836719,"Pp3c12_21760V3/Pp3c14_9180V3/Pp3c19_4790V3/Pp3c20_20860V3/Pp3c8_1870V3",5
"GO:0009867","GO:0009867","jasmonic acid mediated signaling pathway","1/89","58/9629",0.417362307865817,0.666410503176564,0.573827156836719,"Pp3c15_1990V3",1
"GO:0050778","GO:0050778","positive regulation of immune response","1/89","58/9629",0.417362307865817,0.666410503176564,0.573827156836719,"Pp3c15_1990V3",1
"GO:0060627","GO:0060627","regulation of vesicle-mediated transport","1/89","58/9629",0.417362307865817,0.666410503176564,0.573827156836719,"Pp3c19_14410V3",1
"GO:0006090","GO:0006090","pyruvate metabolic process","1/89","59/9629",0.422780211386864,0.666410503176564,0.573827156836719,"Pp3c24_8730V3",1
"GO:0060284","GO:0060284","regulation of cell development","1/89","59/9629",0.422780211386864,0.666410503176564,0.573827156836719,"Pp3c25_8060V3",1
"GO:0006091","GO:0006091","generation of precursor metabolites and energy","3/89","256/9629",0.423142397641015,0.666410503176564,0.573827156836719,"Pp3c14_16940V3/Pp3c19_15510V3/Pp3c3_4140V3",3
"GO:0090407","GO:0090407","organophosphate biosynthetic process","3/89","256/9629",0.423142397641015,0.666410503176564,0.573827156836719,"Pp3c19_15510V3/Pp3c24_8730V3/Pp3c25_8060V3",3
"GO:0044036","GO:0044036","cell wall macromolecule metabolic process","1/89","60/9629",0.428148295105419,0.666410503176564,0.573827156836719,"Pp3c3_28310V3",1
"GO:0048646","GO:0048646","anatomical structure formation involved in morphogenesis","2/89","158/9629",0.430822759233784,0.666410503176564,0.573827156836719,"Pp3c25_8060V3/Pp3c8_1870V3",2
"GO:0050832","GO:0050832","defense response to fungus","2/89","158/9629",0.430822759233784,0.666410503176564,0.573827156836719,"Pp3c22_8470V3/Pp3c7_700V3",2
"GO:0010558","GO:0010558","negative regulation of macromolecule biosynthetic process","3/89","260/9629",0.433014302567576,0.666410503176564,0.573827156836719,"Pp3c12_21760V3/Pp3c15_1990V3/Pp3c4_4790V3",3
"GO:0002252","GO:0002252","immune effector process","1/89","61/9629",0.433467011976107,0.666410503176564,0.573827156836719,"Pp3c15_1990V3",1
"GO:0009965","GO:0009965","leaf morphogenesis","1/89","61/9629",0.433467011976107,0.666410503176564,0.573827156836719,"Pp3c12_21760V3",1
"GO:0016999","GO:0016999","antibiotic metabolic process","1/89","61/9629",0.433467011976107,0.666410503176564,0.573827156836719,"Pp3c14_16940V3",1
"GO:0019318","GO:0019318","hexose metabolic process","1/89","61/9629",0.433467011976107,0.666410503176564,0.573827156836719,"Pp3c25_1530V3",1
"GO:0048467","GO:0048467","gynoecium development","1/89","61/9629",0.433467011976107,0.666410503176564,0.573827156836719,"Pp3c18_15140V3",1
"GO:0071395","GO:0071395","cellular response to jasmonic acid stimulus","1/89","61/9629",0.433467011976107,0.666410503176564,0.573827156836719,"Pp3c15_1990V3",1
"GO:0050801","GO:0050801","ion homeostasis","2/89","160/9629",0.437157481283435,0.667741912880823,0.574973595918243,"Pp3c16_14400V3/Pp3c25_3020V3",2
"GO:0022008","GO:0022008","neurogenesis","1/89","62/9629",0.438736810882266,0.667741912880823,0.574973595918243,"Pp3c25_8060V3",1
"GO:0051345","GO:0051345","positive regulation of hydrolase activity","1/89","62/9629",0.438736810882266,0.667741912880823,0.574973595918243,"Pp3c19_14410V3",1
"GO:0048580","GO:0048580","regulation of post-embryonic development","3/89","263/9629",0.440379741085404,0.667741912880823,0.574973595918243,"Pp3c3_37540V3/Pp3c3_8110V3/Pp3c8_300V3",3
"GO:0009657","GO:0009657","plastid organization","3/89","264/9629",0.442827184601858,0.667741912880823,0.574973595918243,"Pp3c1_7030V3/Pp3c11_17240V3/Pp3c12_11700V3",3
"GO:0002684","GO:0002684","positive regulation of immune system process","1/89","63/9629",0.443958136672114,0.667741912880823,0.574973595918243,"Pp3c15_1990V3",1
"GO:0009640","GO:0009640","photomorphogenesis","1/89","63/9629",0.443958136672114,0.667741912880823,0.574973595918243,"Pp3c4_810V3",1
"GO:0031349","GO:0031349","positive regulation of defense response","1/89","63/9629",0.443958136672114,0.667741912880823,0.574973595918243,"Pp3c15_1990V3",1
"GO:0032787","GO:0032787","monocarboxylic acid metabolic process","3/89","266/9629",0.447710113429311,0.671565170143966,0.578265694159053,"Pp3c16_17210V3/Pp3c24_8730V3/Pp3c25_4810V3",3
"GO:0009615","GO:0009615","response to virus","1/89","64/9629",0.449131430194609,0.671881250021585,0.578537861564342,"Pp3c4_21500V3",1
"GO:0033365","GO:0033365","protein localization to organelle","3/89","268/9629",0.452576660602172,0.675215179124208,0.581408613224069,"Pp3c26_10600V3/Pp3c4_27990V3/Pp3c4_810V3",3
"GO:0009624","GO:0009624","response to nematode","1/89","65/9629",0.454257128334983,0.675905378621758,0.582002924408303,"Pp3c16_14400V3",1
"GO:0072330","GO:0072330","monocarboxylic acid biosynthetic process","2/89","166/9629",0.455934196188845,0.676586841937991,0.582589713114932,"Pp3c16_17210V3/Pp3c25_4810V3",2
"GO:0045087","GO:0045087","innate immune response","2/89","167/9629",0.459029506577182,0.67936366973423,0.58498076066257,"Pp3c15_1990V3/Pp3c2_32750V3",2
"GO:0005975","GO:0005975","carbohydrate metabolic process","5/89","482/9629",0.461935891951659,0.681846861790348,0.587118966814259,"Pp3c2_32750V3/Pp3c25_1530V3/Pp3c3_28310V3/Pp3c5_4460V3/Pp3c9_1480V3",5
"GO:1990748","GO:1990748","cellular detoxification","1/89","67/9629",0.464367466402747,0.683617888205635,0.588643947359617,"Pp3c22_8470V3",1
"GO:0098869","GO:0098869","cellular oxidant detoxification","1/89","68/9629",0.469352960597492,0.689129346909016,0.593389707912173,"Pp3c22_8470V3",1
"GO:0031327","GO:0031327","negative regulation of cellular biosynthetic process","3/89","276/9629",0.471868986862323,0.690989116673208,0.594991102834778,"Pp3c12_21760V3/Pp3c15_1990V3/Pp3c4_4790V3",3
"GO:0010256","GO:0010256","endomembrane system organization","1/89","69/9629",0.474292568013748,0.690989116673208,0.594991102834778,"Pp3c2_6336V3",1
"GO:0048831","GO:0048831","regulation of shoot system development","2/89","172/9629",0.474354690905392,0.690989116673208,0.594991102834778,"Pp3c3_37540V3/Pp3c8_300V3",2
"GO:0010073","GO:0010073","meristem maintenance","1/89","70/9629",0.479186706240398,0.693972262933299,0.597559805351764,"Pp3c18_15140V3",1
"GO:0010608","GO:0010608","post-transcriptional regulation of gene expression","2/89","174/9629",0.480412708422481,0.693972262933299,0.597559805351764,"Pp3c12_21760V3/Pp3c19_4790V3",2
"GO:0009890","GO:0009890","negative regulation of biosynthetic process","3/89","280/9629",0.481404182395171,0.693972262933299,0.597559805351764,"Pp3c12_21760V3/Pp3c15_1990V3/Pp3c4_4790V3",3
"GO:0080134","GO:0080134","regulation of response to stress","3/89","280/9629",0.481404182395171,0.693972262933299,0.597559805351764,"Pp3c15_1990V3/Pp3c22_7570V3/Pp3c22_7600V3",3
"GO:0006875","GO:0006875","cellular metal ion homeostasis","1/89","71/9629",0.484035789109381,0.695958194185768,0.599269834348674,"Pp3c25_3020V3",1
"GO:0009826","GO:0009826","unidimensional cell growth","2/89","176/9629",0.486428705572178,0.697591554502737,0.600676274526775,"Pp3c20_20860V3/Pp3c25_8060V3",2
"GO:0006650","GO:0006650","glycerophospholipid metabolic process","1/89","73/9629",0.493600425517538,0.704237110956899,0.606398574441786,"Pp3c25_8060V3",1
"GO:0007399","GO:0007399","nervous system development","1/89","73/9629",0.493600425517538,0.704237110956899,0.606398574441786,"Pp3c25_8060V3",1
"GO:0015833","GO:0015833","peptide transport","4/89","399/9629",0.507011173508209,0.716867371794867,0.617274133323603,"Pp3c19_14410V3/Pp3c26_10600V3/Pp3c4_27990V3/Pp3c4_810V3",4
"GO:0006955","GO:0006955","immune response","2/89","183/9629",0.507146615740944,0.716867371794867,0.617274133323603,"Pp3c15_1990V3/Pp3c2_32750V3",2
"GO:0010150","GO:0010150","leaf senescence","1/89","76/9629",0.507619598406095,0.716867371794867,0.617274133323603,"Pp3c13_13170V3",1
"GO:0097237","GO:0097237","cellular response to toxic substance","1/89","76/9629",0.507619598406095,0.716867371794867,0.617274133323603,"Pp3c22_8470V3",1
"GO:0009765","GO:0009765","photosynthesis, light harvesting","1/89","77/9629",0.512206833383783,0.72072970351256,0.62059987746743,"Pp3c3_4140V3",1
"GO:0045184","GO:0045184","establishment of protein localization","4/89","402/9629",0.512951770968399,0.72072970351256,0.62059987746743,"Pp3c19_14410V3/Pp3c26_10600V3/Pp3c4_27990V3/Pp3c4_810V3",4
"GO:0090693","GO:0090693","plant organ senescence","1/89","78/9629",0.516751807402716,0.722611124067701,0.622219915271192,"Pp3c13_13170V3",1
"GO:0042886","GO:0042886","amide transport","4/89","404/9629",0.516894804062842,0.722611124067701,0.622219915271192,"Pp3c19_14410V3/Pp3c26_10600V3/Pp3c4_27990V3/Pp3c4_810V3",4
"GO:2000026","GO:2000026","regulation of multicellular organismal development","4/89","407/9629",0.522782657774461,0.729005967499562,0.627726333323473,"Pp3c25_8060V3/Pp3c3_37540V3/Pp3c3_8110V3/Pp3c8_300V3",4
"GO:0048527","GO:0048527","lateral root development","1/89","80/9629",0.525716508916953,0.731259805636364,0.629667049329368,"Pp3c18_15140V3",1
"GO:0022900","GO:0022900","electron transport chain","1/89","81/9629",0.530136995952915,0.735565081884669,0.633374200427956,"Pp3c17_18910V3",1
"GO:0045892","GO:0045892","negative regulation of transcription, DNA-templated","2/89","192/9629",0.532988544983221,0.736613655902339,0.634277097732881,"Pp3c15_1990V3/Pp3c4_4790V3",2
"GO:0009620","GO:0009620","response to fungus","2/89","194/9629",0.538606818296477,0.736613655902339,0.634277097732881,"Pp3c22_8470V3/Pp3c7_700V3",2
"GO:1902679","GO:1902679","negative regulation of RNA biosynthetic process","2/89","194/9629",0.538606818296477,0.736613655902339,0.634277097732881,"Pp3c15_1990V3/Pp3c4_4790V3",2
"GO:1903507","GO:1903507","negative regulation of nucleic acid-templated transcription","2/89","194/9629",0.538606818296477,0.736613655902339,0.634277097732881,"Pp3c15_1990V3/Pp3c4_4790V3",2
"GO:0065002","GO:0065002","intracellular protein transmembrane transport","1/89","83/9629",0.538856115849278,0.736613655902339,0.634277097732881,"Pp3c4_810V3",1
"GO:0098754","GO:0098754","detoxification","1/89","83/9629",0.538856115849278,0.736613655902339,0.634277097732881,"Pp3c22_8470V3",1
"GO:0009411","GO:0009411","response to UV","1/89","85/9629",0.547415221966972,0.746475302682234,0.642768681683707,"Pp3c3_8110V3",1
"GO:0034613","GO:0034613","cellular protein localization","4/89","421/9629",0.549812859857267,0.747764504923212,0.643878777117379,"Pp3c19_14410V3/Pp3c26_10600V3/Pp3c4_27990V3/Pp3c4_810V3",4
"GO:0016053","GO:0016053","organic acid biosynthetic process","3/89","311/9629",0.552402607240571,0.747764504923212,0.643878777117379,"Pp3c16_17210V3/Pp3c19_15510V3/Pp3c25_4810V3",3
"GO:0046394","GO:0046394","carboxylic acid biosynthetic process","3/89","311/9629",0.552402607240571,0.747764504923212,0.643878777117379,"Pp3c16_17210V3/Pp3c19_15510V3/Pp3c25_4810V3",3
"GO:0045088","GO:0045088","regulation of innate immune response","1/89","87/9629",0.555817218123902,0.750556097466583,0.646282538169424,"Pp3c15_1990V3",1
"GO:0071482","GO:0071482","cellular response to light stimulus","1/89","88/9629",0.559960193138257,0.752488879398868,0.647946801796275,"Pp3c3_8110V3",1
"GO:0071806","GO:0071806","protein transmembrane transport","1/89","88/9629",0.559960193138257,0.752488879398868,0.647946801796275,"Pp3c4_810V3",1
"GO:0048316","GO:0048316","seed development","4/89","432/9629",0.570499591504888,0.764800177017423,0.658547710509075,"Pp3c16_17210V3/Pp3c22_8470V3/Pp3c25_4810V3/Pp3c9_1480V3",4
"GO:0048528","GO:0048528","post-embryonic root development","1/89","92/9629",0.576153441105183,0.77051845738163,0.663471559319602,"Pp3c18_15140V3",1
"GO:1905393","GO:1905393","plant organ formation","1/89","93/9629",0.580108809013502,0.770785725340302,0.663701696167846,"Pp3c8_1870V3",1
"GO:0010628","GO:0010628","positive regulation of gene expression","3/89","325/9629",0.582579140393932,0.770785725340302,0.663701696167846,"Pp3c12_21760V3/Pp3c19_4790V3/Pp3c8_1870V3",3
"GO:0042592","GO:0042592","homeostatic process","3/89","325/9629",0.582579140393932,0.770785725340302,0.663701696167846,"Pp3c16_14400V3/Pp3c25_3020V3/Pp3c3_4140V3",3
"GO:0000160","GO:0000160","phosphorelay signal transduction system","1/89","94/9629",0.584027676043473,0.770785725340302,0.663701696167846,"Pp3c15_1990V3",1
"GO:0005996","GO:0005996","monosaccharide metabolic process","1/89","94/9629",0.584027676043473,0.770785725340302,0.663701696167846,"Pp3c25_1530V3",1
"GO:0010557","GO:0010557","positive regulation of macromolecule biosynthetic process","3/89","326/9629",0.584686108771652,0.770785725340302,0.663701696167846,"Pp3c12_21760V3/Pp3c19_4790V3/Pp3c8_1870V3",3
"GO:0030003","GO:0030003","cellular cation homeostasis","1/89","95/9629",0.587910375239291,0.772611216695732,0.665273574926244,"Pp3c25_3020V3",1
"GO:0015031","GO:0015031","protein transport","4/89","442/9629",0.588855035427558,0.772611216695732,0.665273574926244,"Pp3c19_14410V3/Pp3c26_10600V3/Pp3c4_27990V3/Pp3c4_810V3",4
"GO:0071478","GO:0071478","cellular response to radiation","1/89","96/9629",0.59175723664098,0.774587892301283,0.666975634148473,"Pp3c3_8110V3",1
"GO:0007568","GO:0007568","aging","1/89","97/9629",0.595568587311174,0.777084528048756,0.669125416280958,"Pp3c13_13170V3",1
"GO:0006886","GO:0006886","intracellular protein transport","4/89","447/9629",0.597865033291565,0.777084528048756,0.669125416280958,"Pp3c19_14410V3/Pp3c26_10600V3/Pp3c4_27990V3/Pp3c4_810V3",4
"GO:0010154","GO:0010154","fruit development","4/89","447/9629",0.597865033291565,0.777084528048756,0.669125416280958,"Pp3c16_17210V3/Pp3c22_8470V3/Pp3c25_4810V3/Pp3c9_1480V3",4
"GO:0071215","GO:0071215","cellular response to abscisic acid stimulus","1/89","100/9629",0.606792801454217,0.779933726388346,0.671578780048002,"Pp3c3_4140V3",1
"GO:0097306","GO:0097306","cellular response to alcohol","1/89","100/9629",0.606792801454217,0.779933726388346,0.671578780048002,"Pp3c3_4140V3",1
"GO:0051253","GO:0051253","negative regulation of RNA metabolic process","2/89","221/9629",0.609898782045801,0.779933726388346,0.671578780048002,"Pp3c15_1990V3/Pp3c4_4790V3",2
"GO:0006873","GO:0006873","cellular ion homeostasis","1/89","101/9629",0.610465321201365,0.779933726388346,0.671578780048002,"Pp3c25_3020V3",1
"GO:1902531","GO:1902531","regulation of intracellular signal transduction","1/89","101/9629",0.610465321201365,0.779933726388346,0.671578780048002,"Pp3c15_1990V3",1
"GO:0070727","GO:0070727","cellular macromolecule localization","4/89","455/9629",0.612041254693619,0.779933726388346,0.671578780048002,"Pp3c19_14410V3/Pp3c26_10600V3/Pp3c4_27990V3/Pp3c4_810V3",4
"GO:0006753","GO:0006753","nucleoside phosphate metabolic process","2/89","222/9629",0.612374560138716,0.779933726388346,0.671578780048002,"Pp3c14_16940V3/Pp3c19_15510V3",2
"GO:0016052","GO:0016052","carbohydrate catabolic process","1/89","102/9629",0.614103921790479,0.779933726388346,0.671578780048002,"Pp3c3_28310V3",1
"GO:0060560","GO:0060560","developmental growth involved in morphogenesis","2/89","224/9629",0.617290726187383,0.779933726388346,0.671578780048002,"Pp3c20_20860V3/Pp3c25_8060V3",2
"GO:0045595","GO:0045595","regulation of cell differentiation","1/89","103/9629",0.617708912969302,0.779933726388346,0.671578780048002,"Pp3c25_8060V3",1
"GO:0050776","GO:0050776","regulation of immune response","1/89","103/9629",0.617708912969302,0.779933726388346,0.671578780048002,"Pp3c15_1990V3",1
"GO:0051336","GO:0051336","regulation of hydrolase activity","1/89","103/9629",0.617708912969302,0.779933726388346,0.671578780048002,"Pp3c19_14410V3",1
"GO:0009117","GO:0009117","nucleotide metabolic process","2/89","225/9629",0.6197311231302,0.779933726388346,0.671578780048002,"Pp3c14_16940V3/Pp3c19_15510V3",2
"GO:0019941","GO:0019941","modification-dependent protein catabolic process","2/89","225/9629",0.6197311231302,0.779933726388346,0.671578780048002,"Pp3c14_11870V3/Pp3c7_700V3",2
"GO:0048366","GO:0048366","leaf development","2/89","227/9629",0.624576574149355,0.784253390617403,0.675298320228166,"Pp3c12_21760V3/Pp3c13_13170V3",2
"GO:0071229","GO:0071229","cellular response to acid chemical","2/89","229/9629",0.629374950718263,0.787374419546785,0.677985749595524,"Pp3c15_1990V3/Pp3c3_4140V3",2
"GO:0051239","GO:0051239","regulation of multicellular organismal process","4/89","466/9629",0.631038817840038,0.787374419546785,0.677985749595524,"Pp3c25_8060V3/Pp3c3_37540V3/Pp3c3_8110V3/Pp3c8_300V3",4
"GO:0048438","GO:0048438","floral whorl development","1/89","107/9629",0.631798881185791,0.787374419546785,0.677985749595524,"Pp3c18_15140V3",1
"GO:0048367","GO:0048367","shoot system development","4/89","467/9629",0.632736920933092,0.787374419546785,0.677985749595524,"Pp3c12_21760V3/Pp3c13_13170V3/Pp3c18_15140V3/Pp3c8_1870V3",4
"GO:0008104","GO:0008104","protein localization","4/89","468/9629",0.634430147215663,0.78771528345569,0.678279257826236,"Pp3c19_14410V3/Pp3c26_10600V3/Pp3c4_27990V3/Pp3c4_810V3",4
"GO:0051172","GO:0051172","negative regulation of nitrogen compound metabolic process","3/89","354/9629",0.640941148301036,0.791875982863896,0.681861917914099,"Pp3c12_21760V3/Pp3c15_1990V3/Pp3c4_4790V3",3
"GO:2000241","GO:2000241","regulation of reproductive process","2/89","234/9629",0.641165441076596,0.791875982863896,0.681861917914099,"Pp3c3_37540V3/Pp3c8_300V3",2
"GO:0002376","GO:0002376","immune system process","2/89","235/9629",0.643488411300211,0.791875982863896,0.681861917914099,"Pp3c15_1990V3/Pp3c2_32750V3",2
"GO:0043632","GO:0043632","modification-dependent macromolecule catabolic process","2/89","235/9629",0.643488411300211,0.791875982863896,0.681861917914099,"Pp3c14_11870V3/Pp3c7_700V3",2
"GO:0032269","GO:0032269","negative regulation of cellular protein metabolic process","1/89","112/9629",0.648691153847811,0.796512368109591,0.685854177566153,"Pp3c12_21760V3",1
"GO:0055082","GO:0055082","cellular chemical homeostasis","1/89","115/9629",0.658456278082934,0.806717956591674,0.69464191994807,"Pp3c25_3020V3",1
"GO:0006073","GO:0006073","cellular glucan metabolic process","1/89","118/9629",0.66795293274766,0.816550391354519,0.703108350260695,"Pp3c3_28310V3",1
"GO:0002682","GO:0002682","regulation of immune system process","1/89","119/9629",0.671060091719951,0.816750769527572,0.703280890214353,"Pp3c15_1990V3",1
"GO:0051248","GO:0051248","negative regulation of protein metabolic process","1/89","119/9629",0.671060091719951,0.816750769527572,0.703280890214353,"Pp3c12_21760V3",1
"GO:0015979","GO:0015979","photosynthesis","2/89","250/9629",0.676941097286305,0.820310718327292,0.706346261015819,"Pp3c27_2320V3/Pp3c3_4140V3",2
"GO:0045934","GO:0045934","negative regulation of nucleobase-containing compound metabolic process","2/89","250/9629",0.676941097286305,0.820310718327292,0.706346261015819,"Pp3c15_1990V3/Pp3c4_4790V3",2
"GO:0010629","GO:0010629","negative regulation of gene expression","3/89","376/9629",0.681323254395561,0.82382223570705,0.709369928897109,"Pp3c12_21760V3/Pp3c15_1990V3/Pp3c4_4790V3",3
"GO:0051241","GO:0051241","negative regulation of multicellular organismal process","1/89","125/9629",0.68910838109983,0.831424242413925,0.715915800959549,"Pp3c25_8060V3",1
"GO:0016049","GO:0016049","cell growth","2/89","257/9629",0.691671240275359,0.832706156947558,0.717019621155413,"Pp3c20_20860V3/Pp3c25_8060V3",2
"GO:0007005","GO:0007005","mitochondrion organization","1/89","127/9629",0.694904096954373,0.832984392677488,0.717259202039981,"Pp3c16_4660V3",1
"GO:0017038","GO:0017038","protein import","1/89","127/9629",0.694904096954373,0.832984392677488,0.717259202039981,"Pp3c4_810V3",1
"GO:0006511","GO:0006511","ubiquitin-dependent protein catabolic process","2/89","262/9629",0.701856044984001,0.835363557361941,0.719307833176522,"Pp3c14_11870V3/Pp3c7_700V3",2
"GO:0031324","GO:0031324","negative regulation of cellular metabolic process","3/89","388/9629",0.701914873296198,0.835363557361941,0.719307833176522,"Pp3c12_21760V3/Pp3c15_1990V3/Pp3c4_4790V3",3
"GO:0044257","GO:0044257","cellular protein catabolic process","2/89","264/9629",0.70585230940414,0.835363557361941,0.719307833176522,"Pp3c14_11870V3/Pp3c7_700V3",2
"GO:0045893","GO:0045893","positive regulation of transcription, DNA-templated","2/89","264/9629",0.70585230940414,0.835363557361941,0.719307833176522,"Pp3c12_21760V3/Pp3c8_1870V3",2
"GO:0051130","GO:0051130","positive regulation of cellular component organization","1/89","131/9629",0.70617691609145,0.835363557361941,0.719307833176522,"Pp3c25_8060V3",1
"GO:0044042","GO:0044042","glucan metabolic process","1/89","132/9629",0.708930154085539,0.835363557361941,0.719307833176522,"Pp3c3_28310V3",1
"GO:0051093","GO:0051093","negative regulation of developmental process","1/89","132/9629",0.708930154085539,0.835363557361941,0.719307833176522,"Pp3c25_8060V3",1
"GO:0090696","GO:0090696","post-embryonic plant organ development","1/89","132/9629",0.708930154085539,0.835363557361941,0.719307833176522,"Pp3c18_15140V3",1
"GO:0045944","GO:0045944","positive regulation of transcription by RNA polymerase II","1/89","133/9629",0.711657880345031,0.836801109304009,0.720545668324362,"Pp3c9_1370V3",1
"GO:0019684","GO:0019684","photosynthesis, light reaction","1/89","134/9629",0.714360328602117,0.837801979814637,0.721407489494253,"Pp3c3_4140V3",1
"GO:0040029","GO:0040029","regulation of gene expression, epigenetic","1/89","135/9629",0.717037730471986,0.837801979814637,0.721407489494253,"Pp3c4_4790V3",1
"GO:0048507","GO:0048507","meristem development","1/89","135/9629",0.717037730471986,0.837801979814637,0.721407489494253,"Pp3c18_15140V3",1
"GO:0048589","GO:0048589","developmental growth","2/89","273/9629",0.723294351546997,0.843336901488621,0.726173453344398,"Pp3c20_20860V3/Pp3c25_8060V3",2
"GO:1905392","GO:1905392","plant organ morphogenesis","2/89","277/9629",0.730766307679347,0.849956212081782,0.731873153693938,"Pp3c12_21760V3/Pp3c18_15140V3",2
"GO:0000902","GO:0000902","cell morphogenesis","2/89","278/9629",0.732607757655481,0.849956212081782,0.731873153693938,"Pp3c20_20860V3/Pp3c25_8060V3",2
"GO:0031669","GO:0031669","cellular response to nutrient levels","1/89","142/9629",0.735097264503162,0.849956212081782,0.731873153693938,"Pp3c18_15140V3",1
"GO:0044264","GO:0044264","cellular polysaccharide metabolic process","1/89","142/9629",0.735097264503162,0.849956212081782,0.731873153693938,"Pp3c3_28310V3",1
"GO:0051603","GO:0051603","proteolysis involved in cellular protein catabolic process","2/89","281/9629",0.738068968733103,0.851618040845889,0.733304107243307,"Pp3c14_11870V3/Pp3c7_700V3",2
"GO:1902680","GO:1902680","positive regulation of RNA biosynthetic process","2/89","283/9629",0.74165751379195,0.852215155599446,0.73381826579829,"Pp3c12_21760V3/Pp3c8_1870V3",2
"GO:1903508","GO:1903508","positive regulation of nucleic acid-templated transcription","2/89","283/9629",0.74165751379195,0.852215155599446,0.73381826579829,"Pp3c12_21760V3/Pp3c8_1870V3",2
"GO:0030001","GO:0030001","metal ion transport","1/89","148/9629",0.749666380741251,0.859638101883046,0.740209954015938,"Pp3c16_14400V3",1
"GO:1901293","GO:1901293","nucleoside phosphate biosynthetic process","1/89","149/9629",0.752016311351317,0.860554748041197,0.740999251988058,"Pp3c19_15510V3",1
"GO:0032989","GO:0032989","cellular component morphogenesis","2/89","291/9629",0.75559986395537,0.862876387850268,0.742998350088235,"Pp3c20_20860V3/Pp3c25_8060V3",2
"GO:0071214","GO:0071214","cellular response to abiotic stimulus","1/89","152/9629",0.758936019994304,0.863134203067293,0.743220347449124,"Pp3c3_8110V3",1
"GO:0104004","GO:0104004","cellular response to environmental stimulus","1/89","152/9629",0.758936019994304,0.863134203067293,0.743220347449124,"Pp3c3_8110V3",1
"GO:0009165","GO:0009165","nucleotide biosynthetic process","1/89","156/9629",0.76786612748214,0.87102581121608,0.750015587087909,"Pp3c19_15510V3",1
"GO:0051254","GO:0051254","positive regulation of RNA metabolic process","2/89","301/9629",0.772123581471666,0.87102581121608,0.750015587087909,"Pp3c12_21760V3/Pp3c8_1870V3",2
"GO:0019725","GO:0019725","cellular homeostasis","1/89","158/9629",0.772207718058886,0.87102581121608,0.750015587087909,"Pp3c25_3020V3",1
"GO:0071396","GO:0071396","cellular response to lipid","1/89","158/9629",0.772207718058886,0.87102581121608,0.750015587087909,"Pp3c3_4140V3",1
"GO:0055086","GO:0055086","nucleobase-containing small molecule metabolic process","2/89","302/9629",0.773722026900049,0.87102581121608,0.750015587087909,"Pp3c14_16940V3/Pp3c19_15510V3",2
"GO:0009057","GO:0009057","macromolecule catabolic process","3/89","437/9629",0.77569532077772,0.871058496175473,0.750043731178122,"Pp3c14_11870V3/Pp3c3_28310V3/Pp3c7_700V3",3
"GO:0030163","GO:0030163","protein catabolic process","2/89","304/9629",0.776890010102449,0.871058496175473,0.750043731178122,"Pp3c14_11870V3/Pp3c7_700V3",2
"GO:0031668","GO:0031668","cellular response to extracellular stimulus","1/89","161/9629",0.778569991860582,0.871182148150449,0.7501502043818,"Pp3c18_15140V3",1
"GO:0032270","GO:0032270","positive regulation of cellular protein metabolic process","1/89","163/9629",0.782713565323986,0.873326306196185,0.751996477976421,"Pp3c19_4790V3",1
"GO:0010498","GO:0010498","proteasomal protein catabolic process","1/89","164/9629",0.784756507716355,0.873326306196185,0.751996477976421,"Pp3c7_700V3",1
"GO:0048827","GO:0048827","phyllome development","2/89","310/9629",0.786165543237993,0.873326306196185,0.751996477976421,"Pp3c12_21760V3/Pp3c13_13170V3",2
"GO:0043161","GO:0043161","proteasome-mediated ubiquitin-dependent protein catabolic process","1/89","165/9629",0.786780456032599,0.873326306196185,0.751996477976421,"Pp3c7_700V3",1
"GO:0005976","GO:0005976","polysaccharide metabolic process","1/89","166/9629",0.788785584880137,0.873804390436079,0.752408142736804,"Pp3c3_28310V3",1
"GO:0044283","GO:0044283","small molecule biosynthetic process","3/89","449/9629",0.791339482428214,0.874887276389758,0.753340585075297,"Pp3c16_17210V3/Pp3c19_15510V3/Pp3c25_4810V3",3
"GO:0051247","GO:0051247","positive regulation of protein metabolic process","1/89","169/9629",0.794689776967566,0.875104813922618,0.753527900466322,"Pp3c19_4790V3",1
"GO:0071496","GO:0071496","cellular response to external stimulus","1/89","169/9629",0.794689776967566,0.875104813922618,0.753527900466322,"Pp3c18_15140V3",1
"GO:1901605","GO:1901605","alpha-amino acid metabolic process","1/89","171/9629",0.798534938063103,0.877597803217866,0.755674542742363,"Pp3c19_15510V3",1
"GO:0007017","GO:0007017","microtubule-based process","1/89","173/9629",0.802308879042489,0.878571064084005,0.756512590031556,"Pp3c4_1960V3",1
"GO:0006790","GO:0006790","sulfur compound metabolic process","1/89","174/9629",0.804169550548963,0.878571064084005,0.756512590031556,"Pp3c19_15510V3",1
"GO:0098662","GO:0098662","inorganic cation transmembrane transport","1/89","174/9629",0.804169550548963,0.878571064084005,0.756512590031556,"Pp3c16_14400V3",1
"GO:0045935","GO:0045935","positive regulation of nucleobase-containing compound metabolic process","2/89","328/9629",0.812011308487673,0.883398451687585,0.76066931638912,"Pp3c12_21760V3/Pp3c8_1870V3",2
"GO:0031347","GO:0031347","regulation of defense response","1/89","179/9629",0.813216307843813,0.883398451687585,0.76066931638912,"Pp3c15_1990V3",1
"GO:0032268","GO:0032268","regulation of cellular protein metabolic process","2/89","329/9629",0.813363259121362,0.883398451687585,0.76066931638912,"Pp3c12_21760V3/Pp3c19_4790V3",2
"GO:0016311","GO:0016311","dephosphorylation","1/89","181/9629",0.81671817849558,0.883583994278843,0.760829081844656,"Pp3c25_8060V3",1
"GO:0031667","GO:0031667","response to nutrient levels","1/89","181/9629",0.81671817849558,0.883583994278843,0.760829081844656,"Pp3c18_15140V3",1
"GO:0010605","GO:0010605","negative regulation of macromolecule metabolic process","3/89","473/9629",0.819953348886401,0.885358187999908,0.762356789667061,"Pp3c12_21760V3/Pp3c15_1990V3/Pp3c4_4790V3",3
"GO:0016072","GO:0016072","rRNA metabolic process","1/89","184/9629",0.821849613561809,0.88568259325593,0.762636125819236,"Pp3c16_24460V3",1
"GO:0022622","GO:0022622","root system development","2/89","340/9629",0.827678406012232,0.88737005085675,0.764089147631986,"Pp3c16_14400V3/Pp3c18_15140V3",2
"GO:0048364","GO:0048364","root development","2/89","340/9629",0.827678406012232,0.88737005085675,0.764089147631986,"Pp3c16_14400V3/Pp3c18_15140V3",2
"GO:0040007","GO:0040007","growth","2/89","341/9629",0.828930261649816,0.88737005085675,0.764089147631986,"Pp3c20_20860V3/Pp3c25_8060V3",2
"GO:0010604","GO:0010604","positive regulation of macromolecule metabolic process","3/89","483/9629",0.830870555714108,0.88737005085675,0.764089147631986,"Pp3c12_21760V3/Pp3c19_4790V3/Pp3c8_1870V3",3
"GO:0034220","GO:0034220","ion transmembrane transport","2/89","343/9629",0.831409777379297,0.88737005085675,0.764089147631986,"Pp3c16_14400V3/Pp3c4_510V3",2
"GO:0051049","GO:0051049","regulation of transport","1/89","191/9629",0.83327706954464,0.887627087603169,0.764310474673947,"Pp3c19_14410V3",1
"GO:0010015","GO:0010015","root morphogenesis","1/89","192/9629",0.83484926077271,0.887627087603169,0.764310474673947,"Pp3c18_15140V3",1
"GO:0098660","GO:0098660","inorganic ion transmembrane transport","1/89","197/9629",0.842492991744388,0.894041320111157,0.769833588108991,"Pp3c16_14400V3",1
"GO:0044265","GO:0044265","cellular macromolecule catabolic process","2/89","354/9629",0.844483833158192,0.89444375458549,0.77018011300486,"Pp3c14_11870V3/Pp3c7_700V3",2
"GO:0006364","GO:0006364","rRNA processing","1/89","201/9629",0.84835521589709,0.895127651754534,0.770768997433017,"Pp3c16_24460V3",1
"GO:0009991","GO:0009991","response to extracellular stimulus","1/89","201/9629",0.84835521589709,0.895127651754534,0.770768997433017,"Pp3c18_15140V3",1
"GO:0051246","GO:0051246","regulation of protein metabolic process","2/89","364/9629",0.855574132826937,0.901031582009393,0.77585270409154,"Pp3c12_21760V3/Pp3c19_4790V3",2
"GO:0009908","GO:0009908","flower development","1/89","215/9629",0.867224265548658,0.911164722153725,0.784578063267504,"Pp3c18_15140V3",1
"GO:0098655","GO:0098655","cation transmembrane transport","1/89","216/9629",0.86847952796274,0.911164722153725,0.784578063267504,"Pp3c16_14400V3",1
"GO:0016192","GO:0016192","vesicle-mediated transport","2/89","380/9629",0.87184337447721,0.911595691351141,0.784949158602974,"Pp3c13_18320V3/Pp3c4_13960V3",2
"GO:0044262","GO:0044262","cellular carbohydrate metabolic process","1/89","219/9629",0.872175337130551,0.911595691351141,0.784949158602974,"Pp3c3_28310V3",1
"GO:0032879","GO:0032879","regulation of localization","1/89","221/9629",0.874581967251953,0.912392841776003,0.785635562193088,"Pp3c19_14410V3",1
"GO:0007010","GO:0007010","cytoskeleton organization","1/89","226/9629",0.880404293347101,0.916743682565931,0.789381947624339,"Pp3c25_8060V3",1
"GO:0033043","GO:0033043","regulation of organelle organization","1/89","230/9629",0.884869038791558,0.917854191427712,0.79033817526445,"Pp3c19_14410V3",1
"GO:0090567","GO:0090567","reproductive shoot system development","1/89","231/9629",0.885959224507863,0.917854191427712,0.79033817526445,"Pp3c18_15140V3",1
"GO:0051128","GO:0051128","regulation of cellular component organization","2/89","396/9629",0.886432156045502,0.917854191427712,0.79033817526445,"Pp3c19_14410V3/Pp3c25_8060V3",2
"GO:0006520","GO:0006520","cellular amino acid metabolic process","1/89","235/9629",0.890218826496799,0.920058563697809,0.792236297617459,"Pp3c19_15510V3",1
"GO:1901565","GO:1901565","organonitrogen compound catabolic process","2/89","406/9629",0.894762800881679,0.923035974887234,0.794800061827984,"Pp3c14_11870V3/Pp3c7_700V3",2
"GO:0034470","GO:0034470","ncRNA processing","1/89","244/9629",0.899236246923485,0.925929716219915,0.797291780301264,"Pp3c16_24460V3",1
"GO:1901135","GO:1901135","carbohydrate derivative metabolic process","2/89","419/9629",0.904754368336987,0.929886434124126,0.800698797709537,"Pp3c24_8730V3/Pp3c25_1530V3",2
"GO:0006811","GO:0006811","ion transport","2/89","422/9629",0.906932444014449,0.930402045153456,0.801142775722463,"Pp3c16_14400V3/Pp3c4_510V3",2
"GO:0006812","GO:0006812","cation transport","1/89","264/9629",0.916736089901511,0.937510984453177,0.807264081444746,"Pp3c16_14400V3",1
"GO:0035556","GO:0035556","intracellular signal transduction","1/89","266/9629",0.918311245748191,0.937510984453177,0.807264081444746,"Pp3c15_1990V3",1
"GO:0016567","GO:0016567","protein ubiquitination","1/89","268/9629",0.919856931919229,0.937510984453177,0.807264081444746,"Pp3c7_700V3",1
"GO:0032446","GO:0032446","protein modification by small protein conjugation","1/89","269/9629",0.92061889464321,0.937510984453177,0.807264081444746,"Pp3c7_700V3",1
"GO:0006325","GO:0006325","chromatin organization","1/89","275/9629",0.925042541654076,0.940290495637384,0.809657439581551,"Pp3c4_4790V3",1
"GO:0034660","GO:0034660","ncRNA metabolic process","1/89","299/9629",0.940427621049959,0.95301590967018,0.820614932176883,"Pp3c16_24460V3",1
"GO:0048468","GO:0048468","cell development","1/89","300/9629",0.940995889187853,0.95301590967018,0.820614932176883,"Pp3c25_8060V3",1
"GO:0070647","GO:0070647","protein modification by small protein conjugation or removal","1/89","306/9629",0.944294662458276,0.954614822703722,0.8219917107776,"Pp3c7_700V3",1
"GO:0042254","GO:0042254","ribosome biogenesis","1/89","335/9629",0.957839520339398,0.966547152342483,0.832266300926482,"Pp3c16_24460V3",1
"GO:0034654","GO:0034654","nucleobase-containing compound biosynthetic process","1/89","375/9629",0.971332018256471,0.978383430367225,0.842458183758597,"Pp3c19_15510V3",1
"GO:0051276","GO:0051276","chromosome organization","1/89","405/9629",0.978556894902309,0.982303626789221,0.84583375355582,"Pp3c4_4790V3",1
"GO:0022613","GO:0022613","ribonucleoprotein complex biogenesis","1/89","406/9629",0.97876379389989,0.982303626789221,0.84583375355582,"Pp3c16_24460V3",1
"GO:0009888","GO:0009888","tissue development","1/89","434/9629",0.983819590353829,0.985595437989847,0.848668238686373,"Pp3c18_15140V3",1
"GO:0030154","GO:0030154","cell differentiation","1/89","471/9629",0.988717898434336,0.988717898434336,0.851356900690732,"Pp3c25_8060V3",1
