"","ID","Description","GeneRatio","BgRatio","pvalue","p.adjust","qvalue","geneID","Count"
"GO:0005982","GO:0005982","starch metabolic process","2/11","44/5696",0.00306895008471928,0.27358161348456,0.240511308557855,"Pp3c7_20320V3/Pp3c18_14870V3",2
"GO:0006073","GO:0006073","cellular glucan metabolic process","2/11","92/5696",0.0129099285132818,0.27358161348456,0.240511308557855,"Pp3c7_20320V3/Pp3c18_14870V3",2
"GO:0044042","GO:0044042","glucan metabolic process","2/11","106/5696",0.0169114907157949,0.27358161348456,0.240511308557855,"Pp3c7_20320V3/Pp3c18_14870V3",2
"GO:0044264","GO:0044264","cellular polysaccharide metabolic process","2/11","108/5696",0.0175218074900094,0.27358161348456,0.240511308557855,"Pp3c7_20320V3/Pp3c18_14870V3",2
"GO:0042026","GO:0042026","protein refolding","1/11","10/5696",0.0191598439406673,0.27358161348456,0.240511308557855,"Pp3c4_22500V3",1
"GO:0005976","GO:0005976","polysaccharide metabolic process","2/11","125/5696",0.0230846442086586,0.27358161348456,0.240511308557855,"Pp3c7_20320V3/Pp3c18_14870V3",2
"GO:0010229","GO:0010229","inflorescence development","1/11","13/5696",0.0248423659047498,0.27358161348456,0.240511308557855,"Pp3c20_16130V3",1
"GO:0010103","GO:0010103","stomatal complex morphogenesis","1/11","14/5696",0.0267298784817421,0.27358161348456,0.240511308557855,"Pp3c20_16130V3",1
"GO:2000070","GO:2000070","regulation of response to water deprivation","1/11","14/5696",0.0267298784817421,0.27358161348456,0.240511308557855,"Pp3c19_21240V3",1
"GO:0009408","GO:0009408","response to heat","2/11","137/5696",0.0274005976998195,0.27358161348456,0.240511308557855,"Pp3c26_12010V3/Pp3c4_22500V3",2
"GO:0031098","GO:0031098","stress-activated protein kinase signaling cascade","1/11","16/5696",0.0304949431508973,0.27358161348456,0.240511308557855,"Pp3c20_16130V3",1
"GO:0051235","GO:0051235","maintenance of location","1/11","16/5696",0.0304949431508973,0.27358161348456,0.240511308557855,"Pp3c19_21240V3",1
"GO:0010374","GO:0010374","stomatal complex development","1/11","17/5696",0.0323725057609924,0.27358161348456,0.240511308557855,"Pp3c20_16130V3",1
"GO:0005978","GO:0005978","glycogen biosynthetic process","1/11","18/5696",0.0342467622210433,0.27358161348456,0.240511308557855,"Pp3c7_20320V3",1
"GO:0019252","GO:0019252","starch biosynthetic process","1/11","18/5696",0.0342467622210433,0.27358161348456,0.240511308557855,"Pp3c7_20320V3",1
"GO:0046835","GO:0046835","carbohydrate phosphorylation","1/11","19/5696",0.036117717771513,0.27358161348456,0.240511308557855,"Pp3c18_14870V3",1
"GO:0044262","GO:0044262","cellular carbohydrate metabolic process","2/11","160/5696",0.0365170260035665,0.27358161348456,0.240511308557855,"Pp3c7_20320V3/Pp3c18_14870V3",2
"GO:0005983","GO:0005983","starch catabolic process","1/11","21/5696",0.0398497470686481,0.27358161348456,0.240511308557855,"Pp3c18_14870V3",1
"GO:0032147","GO:0032147","activation of protein kinase activity","1/11","21/5696",0.0398497470686481,0.27358161348456,0.240511308557855,"Pp3c20_16130V3",1
"GO:0043622","GO:0043622","cortical microtubule organization","1/11","21/5696",0.0398497470686481,0.27358161348456,0.240511308557855,"Pp3c20_16130V3",1
"GO:0048589","GO:0048589","developmental growth","2/11","174/5696",0.0425765274978366,0.27358161348456,0.240511308557855,"Pp3c26_12010V3/Pp3c19_21240V3",2
"GO:0006626","GO:0006626","protein targeting to mitochondrion","1/11","23/5696",0.0435686354285713,0.27358161348456,0.240511308557855,"Pp3c4_22500V3",1
"GO:0070585","GO:0070585","protein localization to mitochondrion","1/11","23/5696",0.0435686354285713,0.27358161348456,0.240511308557855,"Pp3c4_22500V3",1
"GO:0072655","GO:0072655","establishment of protein localization to mitochondrion","1/11","23/5696",0.0435686354285713,0.27358161348456,0.240511308557855,"Pp3c4_22500V3",1
"GO:0010876","GO:0010876","lipid localization","1/11","24/5696",0.0454231647799346,0.27358161348456,0.240511308557855,"Pp3c19_21240V3",1
"GO:0045454","GO:0045454","cell redox homeostasis","1/11","24/5696",0.0454231647799346,0.27358161348456,0.240511308557855,"Pp3c1_28390V3",1
"GO:1990542","GO:1990542","mitochondrial transmembrane transport","1/11","24/5696",0.0454231647799346,0.27358161348456,0.240511308557855,"Pp3c4_22500V3",1
"GO:0031122","GO:0031122","cytoplasmic microtubule organization","1/11","25/5696",0.0472744245097337,0.27358161348456,0.240511308557855,"Pp3c20_16130V3",1
"GO:0044247","GO:0044247","cellular polysaccharide catabolic process","1/11","26/5696",0.049122419806929,0.27358161348456,0.240511308557855,"Pp3c18_14870V3",1
"GO:0045927","GO:0045927","positive regulation of growth","1/11","26/5696",0.049122419806929,0.27358161348456,0.240511308557855,"Pp3c19_21240V3",1
"GO:0044743","GO:0044743","protein transmembrane import into intracellular organelle","1/11","27/5696",0.0509671558531584,0.27358161348456,0.240511308557855,"Pp3c4_22500V3",1
"GO:0009251","GO:0009251","glucan catabolic process","1/11","28/5696",0.0528086378227505,0.27358161348456,0.240511308557855,"Pp3c18_14870V3",1
"GO:0030865","GO:0030865","cortical cytoskeleton organization","1/11","28/5696",0.0528086378227505,0.27358161348456,0.240511308557855,"Pp3c20_16130V3",1
"GO:0006458","GO:0006458","'de novo' protein folding","1/11","29/5696",0.0546468708827272,0.27358161348456,0.240511308557855,"Pp3c4_22500V3",1
"GO:0045860","GO:0045860","positive regulation of protein kinase activity","1/11","30/5696",0.0564818601928193,0.27358161348456,0.240511308557855,"Pp3c20_16130V3",1
"GO:0044275","GO:0044275","cellular carbohydrate catabolic process","1/11","33/5696",0.0619674171118529,0.27358161348456,0.240511308557855,"Pp3c18_14870V3",1
"GO:0040007","GO:0040007","growth","2/11","216/5696",0.0628441186242087,0.27358161348456,0.240511308557855,"Pp3c26_12010V3/Pp3c19_21240V3",2
"GO:0009744","GO:0009744","response to sucrose","1/11","34/5696",0.0637894828741292,0.27358161348456,0.240511308557855,"Pp3c14_14690V3",1
"GO:0009846","GO:0009846","pollen germination","1/11","34/5696",0.0637894828741292,0.27358161348456,0.240511308557855,"Pp3c26_12010V3",1
"GO:0033674","GO:0033674","positive regulation of kinase activity","1/11","34/5696",0.0637894828741292,0.27358161348456,0.240511308557855,"Pp3c20_16130V3",1
"GO:0034285","GO:0034285","response to disaccharide","1/11","34/5696",0.0637894828741292,0.27358161348456,0.240511308557855,"Pp3c14_14690V3",1
"GO:0003006","GO:0003006","developmental process involved in reproduction","3/11","496/5696",0.0638874129455692,0.27358161348456,0.240511308557855,"Pp3c7_20320V3/Pp3c26_12010V3/Pp3c20_16130V3",3
"GO:0001934","GO:0001934","positive regulation of protein phosphorylation","1/11","38/5696",0.071045616445257,0.27358161348456,0.240511308557855,"Pp3c20_16130V3",1
"GO:0000272","GO:0000272","polysaccharide catabolic process","1/11","40/5696",0.074654476993181,0.27358161348456,0.240511308557855,"Pp3c18_14870V3",1
"GO:0065002","GO:0065002","intracellular protein transmembrane transport","1/11","40/5696",0.074654476993181,0.27358161348456,0.240511308557855,"Pp3c4_22500V3",1
"GO:1990748","GO:1990748","cellular detoxification","1/11","40/5696",0.074654476993181,0.27358161348456,0.240511308557855,"Pp3c1_28390V3",1
"GO:0051347","GO:0051347","positive regulation of transferase activity","1/11","41/5696",0.0764541235195377,0.27358161348456,0.240511308557855,"Pp3c20_16130V3",1
"GO:0098869","GO:0098869","cellular oxidant detoxification","1/11","41/5696",0.0764541235195377,0.27358161348456,0.240511308557855,"Pp3c1_28390V3",1
"GO:0042327","GO:0042327","positive regulation of phosphorylation","1/11","42/5696",0.0782505876470865,0.27358161348456,0.240511308557855,"Pp3c20_16130V3",1
"GO:0071806","GO:0071806","protein transmembrane transport","1/11","42/5696",0.0782505876470865,0.27358161348456,0.240511308557855,"Pp3c4_22500V3",1
"GO:0009860","GO:0009860","pollen tube growth","1/11","43/5696",0.0800438744415471,0.27358161348456,0.240511308557855,"Pp3c26_12010V3",1
"GO:0010562","GO:0010562","positive regulation of phosphorus metabolic process","1/11","44/5696",0.0818339889614736,0.27358161348456,0.240511308557855,"Pp3c20_16130V3",1
"GO:0045937","GO:0045937","positive regulation of phosphate metabolic process","1/11","44/5696",0.0818339889614736,0.27358161348456,0.240511308557855,"Pp3c20_16130V3",1
"GO:0061077","GO:0061077","chaperone-mediated protein folding","1/11","44/5696",0.0818339889614736,0.27358161348456,0.240511308557855,"Pp3c4_22500V3",1
"GO:0048573","GO:0048573","photoperiodism, flowering","1/11","45/5696",0.0836209362582576,0.27358161348456,0.240511308557855,"Pp3c7_20320V3",1
"GO:0045859","GO:0045859","regulation of protein kinase activity","1/11","46/5696",0.085404721376141,0.27358161348456,0.240511308557855,"Pp3c20_16130V3",1
"GO:0090626","GO:0090626","plant epidermis morphogenesis","1/11","47/5696",0.0871853493522224,0.27358161348456,0.240511308557855,"Pp3c20_16130V3",1
"GO:0097237","GO:0097237","cellular response to toxic substance","1/11","47/5696",0.0871853493522224,0.27358161348456,0.240511308557855,"Pp3c1_28390V3",1
"GO:0009250","GO:0009250","glucan biosynthetic process","1/11","49/5696",0.09073715399172,0.279901051296492,0.246066858282631,"Pp3c7_20320V3",1
"GO:0043549","GO:0043549","regulation of kinase activity","1/11","50/5696",0.0925083406937021,0.280608633437563,0.246688908516539,"Pp3c20_16130V3",1
"GO:0033036","GO:0033036","macromolecule localization","2/11","276/5696",0.0964288337142365,0.283128774436699,0.248904417087208,"Pp3c19_21240V3/Pp3c4_22500V3",2
"GO:0009648","GO:0009648","photoperiodism","1/11","53/5696",0.0978030984107324,0.283128774436699,0.248904417087208,"Pp3c7_20320V3",1
"GO:0097435","GO:0097435","supramolecular fiber organization","1/11","54/5696",0.0995617668348832,0.283128774436699,0.248904417087208,"Pp3c20_16130V3",1
"GO:0098754","GO:0098754","detoxification","1/11","54/5696",0.0995617668348832,0.283128774436699,0.248904417087208,"Pp3c1_28390V3",1
"GO:0007346","GO:0007346","regulation of mitotic cell cycle","1/11","55/5696",0.101317318157963,0.283688490842296,0.249396475465754,"Pp3c20_16130V3",1
"GO:0009932","GO:0009932","cell tip growth","1/11","56/5696",0.103069757353187,0.284222664216365,0.24986607843197,"Pp3c26_12010V3",1
"GO:0006839","GO:0006839","mitochondrial transport","1/11","57/5696",0.104819089386719,0.284732451766908,0.250314243311567,"Pp3c4_22500V3",1
"GO:0034599","GO:0034599","cellular response to oxidative stress","1/11","58/5696",0.106565319217672,0.285218942612004,0.250741927570993,"Pp3c1_28390V3",1
"GO:0017038","GO:0017038","protein import","1/11","60/5696",0.110048492073135,0.286126079390151,0.25153941045288,"Pp3c4_22500V3",1
"GO:0031401","GO:0031401","positive regulation of protein modification process","1/11","60/5696",0.110048492073135,0.286126079390151,0.25153941045288,"Pp3c20_16130V3",1
"GO:0009743","GO:0009743","response to carbohydrate","1/11","61/5696",0.111785444980728,0.286548605443557,0.251910861928402,"Pp3c14_14690V3",1
"GO:0001932","GO:0001932","regulation of protein phosphorylation","1/11","62/5696",0.113519315451928,0.28695160294793,0.25226514544873,"Pp3c20_16130V3",1
"GO:0051338","GO:0051338","regulation of transferase activity","1/11","63/5696",0.115250108410755,0.287335886722704,0.252602977338641,"Pp3c20_16130V3",1
"GO:0048868","GO:0048868","pollen tube development","1/11","65/5696",0.11870248145241,0.291943940869441,0.256654013951157,"Pp3c26_12010V3",1
"GO:0033692","GO:0033692","cellular polysaccharide biosynthetic process","1/11","67/5696",0.122142603358146,0.296399384149102,0.260570887164046,"Pp3c7_20320V3",1
"GO:0042325","GO:0042325","regulation of phosphorylation","1/11","70/5696",0.127279900927384,0.30108229127258,0.264687728591279,"Pp3c20_16130V3",1
"GO:0000271","GO:0000271","polysaccharide biosynthetic process","1/11","71/5696",0.128986250214586,0.30108229127258,0.264687728591279,"Pp3c7_20320V3",1
"GO:0007005","GO:0007005","mitochondrion organization","1/11","72/5696",0.130689565991944,0.30108229127258,0.264687728591279,"Pp3c4_22500V3",1
"GO:0010016","GO:0010016","shoot system morphogenesis","1/11","72/5696",0.130689565991944,0.30108229127258,0.264687728591279,"Pp3c20_16130V3",1
"GO:0010228","GO:0010228","vegetative to reproductive phase transition of meristem","1/11","74/5696",0.134087116428137,0.301675390621953,0.265209134612706,"Pp3c7_20320V3",1
"GO:0016052","GO:0016052","carbohydrate catabolic process","1/11","78/5696",0.140846028317201,0.301675390621953,0.265209134612706,"Pp3c18_14870V3",1
"GO:0032270","GO:0032270","positive regulation of cellular protein metabolic process","1/11","78/5696",0.140846028317201,0.301675390621953,0.265209134612706,"Pp3c20_16130V3",1
"GO:0016310","GO:0016310","phosphorylation","2/11","347/5696",0.14157517875687,0.301675390621953,0.265209134612706,"Pp3c18_14870V3/Pp3c20_16130V3",2
"GO:0051247","GO:0051247","positive regulation of protein metabolic process","1/11","79/5696",0.142528245064889,0.301675390621953,0.265209134612706,"Pp3c20_16130V3",1
"GO:0005975","GO:0005975","carbohydrate metabolic process","2/11","349/5696",0.142914039055139,0.301675390621953,0.265209134612706,"Pp3c7_20320V3/Pp3c18_14870V3",2
"GO:0009266","GO:0009266","response to temperature stimulus","2/11","349/5696",0.142914039055139,0.301675390621953,0.265209134612706,"Pp3c26_12010V3/Pp3c4_22500V3",2
"GO:0046777","GO:0046777","protein autophosphorylation","1/11","80/5696",0.144207466945659,0.301675390621953,0.265209134612706,"Pp3c18_14870V3",1
"GO:0048588","GO:0048588","developmental cell growth","1/11","82/5696",0.147556945297473,0.305052677806696,0.268178178291601,"Pp3c26_12010V3",1
"GO:0034637","GO:0034637","cellular carbohydrate biosynthetic process","1/11","83/5696",0.149227211346943,0.305052677806696,0.268178178291601,"Pp3c7_20320V3",1
"GO:0000226","GO:0000226","microtubule cytoskeleton organization","1/11","84/5696",0.150894501686367,0.305052677806696,0.268178178291601,"Pp3c20_16130V3",1
"GO:0090698","GO:0090698","post-embryonic plant morphogenesis","1/11","85/5696",0.152558821087908,0.305052677806696,0.268178178291601,"Pp3c20_16130V3",1
"GO:0019220","GO:0019220","regulation of phosphate metabolic process","1/11","87/5696",0.155878566131993,0.305052677806696,0.268178178291601,"Pp3c20_16130V3",1
"GO:0051174","GO:0051174","regulation of phosphorus metabolic process","1/11","87/5696",0.155878566131993,0.305052677806696,0.268178178291601,"Pp3c20_16130V3",1
"GO:0006605","GO:0006605","protein targeting","1/11","90/5696",0.160836020577355,0.311405912181688,0.273763439280605,"Pp3c4_22500V3",1
"GO:0019725","GO:0019725","cellular homeostasis","1/11","96/5696",0.17067161065001,0.319744175806139,0.281093780928474,"Pp3c1_28390V3",1
"GO:0006468","GO:0006468","protein phosphorylation","2/11","390/5696",0.171007234556563,0.319744175806139,0.281093780928474,"Pp3c18_14870V3/Pp3c20_16130V3",2
"GO:0000904","GO:0000904","cell morphogenesis involved in differentiation","1/11","98/5696",0.173926776949493,0.319744175806139,0.281093780928474,"Pp3c26_12010V3",1
"GO:0009856","GO:0009856","pollination","1/11","98/5696",0.173926776949493,0.319744175806139,0.281093780928474,"Pp3c26_12010V3",1
"GO:0044706","GO:0044706","multi-multicellular organism process","1/11","98/5696",0.173926776949493,0.319744175806139,0.281093780928474,"Pp3c26_12010V3",1
"GO:0040008","GO:0040008","regulation of growth","1/11","103/5696",0.182013939656253,0.323227004838138,0.284155608648912,"Pp3c19_21240V3",1
"GO:0009653","GO:0009653","anatomical structure morphogenesis","2/11","406/5696",0.182264535340566,0.323227004838138,0.284155608648912,"Pp3c26_12010V3/Pp3c20_16130V3",2
"GO:0009826","GO:0009826","unidimensional cell growth","1/11","107/5696",0.18843177387846,0.323227004838138,0.284155608648912,"Pp3c26_12010V3",1
"GO:0048608","GO:0048608","reproductive structure development","2/11","415/5696",0.188658674588874,0.323227004838138,0.284155608648912,"Pp3c7_20320V3/Pp3c20_16130V3",2
"GO:0061458","GO:0061458","reproductive system development","2/11","415/5696",0.188658674588874,0.323227004838138,0.284155608648912,"Pp3c7_20320V3/Pp3c20_16130V3",2
"GO:0033554","GO:0033554","cellular response to stress","2/11","416/5696",0.189371707689902,0.323227004838138,0.284155608648912,"Pp3c20_16130V3/Pp3c1_28390V3",2
"GO:0043085","GO:0043085","positive regulation of catalytic activity","1/11","108/5696",0.19002906328396,0.323227004838138,0.284155608648912,"Pp3c20_16130V3",1
"GO:0072594","GO:0072594","establishment of protein localization to organelle","1/11","108/5696",0.19002906328396,0.323227004838138,0.284155608648912,"Pp3c4_22500V3",1
"GO:0009416","GO:0009416","response to light stimulus","2/11","420/5696",0.192228798342774,0.323941123133193,0.284783404952257,"Pp3c7_20320V3/Pp3c26_12010V3",2
"GO:0055085","GO:0055085","transmembrane transport","2/11","429/5696",0.198685174595089,0.331749557580791,0.291647962708388,"Pp3c6_2050V3/Pp3c4_22500V3",2
"GO:0007017","GO:0007017","microtubule-based process","1/11","116/5696",0.202704861086096,0.332362925384409,0.292187187151129,"Pp3c20_16130V3",1
"GO:0031399","GO:0031399","regulation of protein modification process","1/11","116/5696",0.202704861086096,0.332362925384409,0.292187187151129,"Pp3c20_16130V3",1
"GO:0009314","GO:0009314","response to radiation","2/11","438/5696",0.205177891633763,0.333414073904865,0.293111273762519,"Pp3c7_20320V3/Pp3c26_12010V3",2
"GO:0044093","GO:0044093","positive regulation of molecular function","1/11","121/5696",0.2105353781202,0.33909237891926,0.29810319025869,"Pp3c20_16130V3",1
"GO:0065008","GO:0065008","regulation of biological quality","2/11","450/5696",0.213886568070142,0.341468029726016,0.30019167448441,"Pp3c1_28390V3/Pp3c19_21240V3",2
"GO:0006457","GO:0006457","protein folding","1/11","125/5696",0.216749380975252,0.34302945510866,0.301564356139482,"Pp3c4_22500V3",1
"GO:0051726","GO:0051726","regulation of cell cycle","1/11","127/5696",0.219839678134374,0.344920874314276,0.303227142254309,"Pp3c20_16130V3",1
"GO:0033365","GO:0033365","protein localization to organelle","1/11","129/5696",0.222918887046388,0.34676271318327,0.304846341260018,"Pp3c4_22500V3",1
"GO:0010035","GO:0010035","response to inorganic substance","2/11","470/5696",0.228516254291289,0.348499141324209,0.30637287149381,"Pp3c26_12010V3/Pp3c4_22500V3",2
"GO:0007010","GO:0007010","cytoskeleton organization","1/11","134/5696",0.230568633060049,0.348499141324209,0.30637287149381,"Pp3c20_16130V3",1
"GO:0016051","GO:0016051","carbohydrate biosynthetic process","1/11","134/5696",0.230568633060049,0.348499141324209,0.30637287149381,"Pp3c7_20320V3",1
"GO:0009636","GO:0009636","response to toxic substance","1/11","136/5696",0.23360931451403,0.348499141324209,0.30637287149381,"Pp3c1_28390V3",1
"GO:0090558","GO:0090558","plant epidermis development","1/11","136/5696",0.23360931451403,0.348499141324209,0.30637287149381,"Pp3c20_16130V3",1
"GO:0009735","GO:0009735","response to cytokinin","1/11","140/5696",0.239657929181968,0.354615797651367,0.311750151781422,"Pp3c4_22500V3",1
"GO:0090567","GO:0090567","reproductive shoot system development","1/11","143/5696",0.244165874448186,0.357005506415974,0.313850994651406,"Pp3c20_16130V3",1
"GO:0060560","GO:0060560","developmental growth involved in morphogenesis","1/11","144/5696",0.245663114747316,0.357005506415974,0.313850994651406,"Pp3c26_12010V3",1
"GO:0009555","GO:0009555","pollen development","1/11","145/5696",0.247157658287982,0.357005506415974,0.313850994651406,"Pp3c26_12010V3",1
"GO:0048584","GO:0048584","positive regulation of response to stimulus","1/11","155/5696",0.261955730779189,0.373571813401543,0.328414781012346,"Pp3c19_21240V3",1
"GO:0000902","GO:0000902","cell morphogenesis","1/11","156/5696",0.263420897168185,0.373571813401543,0.328414781012346,"Pp3c26_12010V3",1
"GO:0009414","GO:0009414","response to water deprivation","1/11","158/5696",0.266343300129386,0.373571813401543,0.328414781012346,"Pp3c26_12010V3",1
"GO:0009415","GO:0009415","response to water","1/11","161/5696",0.270707144394547,0.373571813401543,0.328414781012346,"Pp3c26_12010V3",1
"GO:0080134","GO:0080134","regulation of response to stress","1/11","161/5696",0.270707144394547,0.373571813401543,0.328414781012346,"Pp3c19_21240V3",1
"GO:0016049","GO:0016049","cell growth","1/11","163/5696",0.273603250370943,0.373571813401543,0.328414781012346,"Pp3c26_12010V3",1
"GO:0009639","GO:0009639","response to red or far red light","1/11","164/5696",0.27504737909784,0.373571813401543,0.328414781012346,"Pp3c26_12010V3",1
"GO:0032989","GO:0032989","cellular component morphogenesis","1/11","164/5696",0.27504737909784,0.373571813401543,0.328414781012346,"Pp3c26_12010V3",1
"GO:0035556","GO:0035556","intracellular signal transduction","1/11","167/5696",0.279364119262151,0.376624220042307,0.331098215421808,"Pp3c20_16130V3",1
"GO:0050790","GO:0050790","regulation of catalytic activity","1/11","171/5696",0.285083423625967,0.380614855650152,0.334606466505629,"Pp3c20_16130V3",1
"GO:0032268","GO:0032268","regulation of cellular protein metabolic process","1/11","172/5696",0.286506786945444,0.380614855650152,0.334606466505629,"Pp3c20_16130V3",1
"GO:0048468","GO:0048468","cell development","1/11","174/5696",0.289345787714527,0.381600966406115,0.335473377060321,"Pp3c26_12010V3",1
"GO:0015979","GO:0015979","photosynthesis","1/11","184/5696",0.303387361521992,0.396210819748226,0.348317204174264,"Pp3c13_6570V3",1
"GO:0048229","GO:0048229","gametophyte development","1/11","185/5696",0.304777553652481,0.396210819748226,0.348317204174264,"Pp3c26_12010V3",1
"GO:0015833","GO:0015833","peptide transport","1/11","190/5696",0.311690757968929,0.39741532226165,0.349376107482769,"Pp3c4_22500V3",1
"GO:0045184","GO:0045184","establishment of protein localization","1/11","190/5696",0.311690757968929,0.39741532226165,0.349376107482769,"Pp3c4_22500V3",1
"GO:0042886","GO:0042886","amide transport","1/11","192/5696",0.314438496734492,0.39741532226165,0.349376107482769,"Pp3c4_22500V3",1
"GO:0051246","GO:0051246","regulation of protein metabolic process","1/11","192/5696",0.314438496734492,0.39741532226165,0.349376107482769,"Pp3c20_16130V3",1
"GO:0046686","GO:0046686","response to cadmium ion","1/11","194/5696",0.317176260055086,0.398110891931212,0.349987597302164,"Pp3c4_22500V3",1
"GO:0034613","GO:0034613","cellular protein localization","1/11","201/5696",0.326680344933855,0.406130164236309,0.357037507020931,"Pp3c4_22500V3",1
"GO:0042592","GO:0042592","homeostatic process","1/11","202/5696",0.32802820957548,0.406130164236309,0.357037507020931,"Pp3c1_28390V3",1
"GO:0006886","GO:0006886","intracellular protein transport","1/11","206/5696",0.333395174915872,0.408865825273847,0.359442483757228,"Pp3c4_22500V3",1
"GO:0015031","GO:0015031","protein transport","1/11","207/5696",0.334730812998919,0.408865825273847,0.359442483757228,"Pp3c4_22500V3",1
"GO:0065009","GO:0065009","regulation of molecular function","1/11","214/5696",0.344012370254311,0.417401675908565,0.366946528271266,"Pp3c20_16130V3",1
"GO:0006979","GO:0006979","response to oxidative stress","1/11","220/5696",0.351874124547856,0.424113183229866,0.372846754487794,"Pp3c1_28390V3",1
"GO:0008104","GO:0008104","protein localization","1/11","224/5696",0.35706760407377,0.427541473298856,0.375860635867126,"Pp3c4_22500V3",1
"GO:0070727","GO:0070727","cellular macromolecule localization","1/11","227/5696",0.36093785442322,0.429350911797556,0.377451351030818,"Pp3c4_22500V3",1
"GO:0009057","GO:0009057","macromolecule catabolic process","1/11","237/5696",0.373686226582543,0.440261830254564,0.38704336725676,"Pp3c18_14870V3",1
"GO:0009651","GO:0009651","response to salt stress","1/11","238/5696",0.374948262029986,0.440261830254564,0.38704336725676,"Pp3c26_12010V3",1
"GO:0046907","GO:0046907","intracellular transport","1/11","241/5696",0.378720510017517,0.441840595020436,0.388431292325658,"Pp3c4_22500V3",1
"GO:0009409","GO:0009409","response to cold","1/11","243/5696",0.3812238314456,0.441928263204453,0.388508363256662,"Pp3c26_12010V3",1
"GO:0071705","GO:0071705","nitrogen compound transport","1/11","261/5696",0.403344551030069,0.460042456813145,0.404432929066501,"Pp3c4_22500V3",1
"GO:0051649","GO:0051649","establishment of localization in cell","1/11","262/5696",0.404552133355491,0.460042456813145,0.404432929066501,"Pp3c4_22500V3",1
"GO:0010038","GO:0010038","response to metal ion","1/11","263/5696",0.405757493409428,0.460042456813145,0.404432929066501,"Pp3c4_22500V3",1
"GO:0051173","GO:0051173","positive regulation of nitrogen compound metabolic process","1/11","264/5696",0.406960634873167,0.460042456813145,0.404432929066501,"Pp3c20_16130V3",1
"GO:0009888","GO:0009888","tissue development","1/11","271/5696",0.415320812685328,0.46637742989258,0.410002136169301,"Pp3c20_16130V3",1
"GO:0030154","GO:0030154","cell differentiation","1/11","273/5696",0.417689676222476,0.46637742989258,0.410002136169301,"Pp3c26_12010V3",1
"GO:0010604","GO:0010604","positive regulation of macromolecule metabolic process","1/11","277/5696",0.422401247343472,0.468762359856779,0.41209877789607,"Pp3c20_16130V3",1
"GO:0006970","GO:0006970","response to osmotic stress","1/11","283/5696",0.429403647185444,0.473645235077278,0.416391415452552,"Pp3c26_12010V3",1
"GO:0048367","GO:0048367","shoot system development","1/11","293/5696",0.440903004418533,0.483399679543211,0.424966751246779,"Pp3c20_16130V3",1
"GO:0071702","GO:0071702","organic substance transport","1/11","314/5696",0.464368794334234,0.506078566280423,0.444904234092679,"Pp3c4_22500V3",1
"GO:0031325","GO:0031325","positive regulation of cellular metabolic process","1/11","317/5696",0.467646943629573,0.50661752226537,0.445378041551974,"Pp3c20_16130V3",1
"GO:0051641","GO:0051641","cellular localization","1/11","335/5696",0.48693579658581,0.52439239632318,0.461004304459938,"Pp3c4_22500V3",1
"GO:0048869","GO:0048869","cellular developmental process","1/11","341/5696",0.493222804821446,0.528038532220606,0.464209698655478,"Pp3c26_12010V3",1
"GO:0009893","GO:0009893","positive regulation of metabolic process","1/11","345/5696",0.497375147488781,0.529370040017299,0.465380254960263,"Pp3c20_16130V3",1
"GO:0034645","GO:0034645","cellular macromolecule biosynthetic process","1/11","368/5696",0.520656789080057,0.550927532631224,0.484331896818658,"Pp3c7_20320V3",1
"GO:0048583","GO:0048583","regulation of response to stimulus","1/11","378/5696",0.530469915154814,0.558066615943215,0.490608014016013,"Pp3c19_21240V3",1
"GO:0009059","GO:0009059","macromolecule biosynthetic process","1/11","387/5696",0.539145199034353,0.561899771333934,0.493977820952909,"Pp3c7_20320V3",1
"GO:0044248","GO:0044248","cellular catabolic process","1/11","390/5696",0.542004414167699,0.561899771333934,0.493977820952909,"Pp3c18_14870V3",1
"GO:1901575","GO:1901575","organic substance catabolic process","1/11","394/5696",0.545791615553066,0.561899771333934,0.493977820952909,"Pp3c18_14870V3",1
"GO:0070887","GO:0070887","cellular response to chemical stimulus","1/11","396/5696",0.547674519979641,0.561899771333934,0.493977820952909,"Pp3c1_28390V3",1
"GO:0023052","GO:0023052","signaling","1/11","398/5696",0.549550325810111,0.561899771333934,0.493977820952909,"Pp3c20_16130V3",1
"GO:0007165","GO:0007165","signal transduction","1/11","433/5696",0.581252881749641,0.590994550158853,0.519555648491299,"Pp3c20_16130V3",1
"GO:0009056","GO:0009056","catabolic process","1/11","439/5696",0.586479236082698,0.592995672039172,0.521314876517954,"Pp3c18_14870V3",1
"GO:0048522","GO:0048522","positive regulation of cellular process","1/11","452/5696",0.597600151549305,0.600901809845157,0.528265327336402,"Pp3c20_16130V3",1
"GO:0001101","GO:0001101","response to acid chemical","1/11","477/5696",0.618225679937627,0.618225679937627,0.54349510324187,"Pp3c26_12010V3",1
