Sample	Unique Reads	Duplicate Reads
M_1_10_1	10019732.0	28707572.0
M_1_10_2	10278738.0	28448566.0
M_1_11_1	10679216.0	31227780.0
M_1_11_2	10823541.0	31083455.0
M_1_12_1	12312462.0	25928675.0
M_1_12_2	12014785.0	26226352.0
M_1_13_1	11265950.0	30170745.0
M_1_13_2	11231043.0	30205652.0
M_1_14_1	10860883.0	25332393.0
M_1_14_2	10500141.0	25693135.0
M_1_15_1	8981457.0	22126944.0
M_1_15_2	8577056.0	22531345.0
M_1_16_1	10518968.0	28785455.0
M_1_16_2	10869097.0	28435326.0
M_1_17_1	9653979.0	25832563.0
M_1_17_2	9801941.0	25684601.0
M_1_18_1	11292552.0	27310017.0
M_1_18_2	11417751.0	27184818.0
M_1_19_1	10695966.0	25716403.0
M_1_19_2	10913462.0	25498907.0
M_1_1_1	12055499.0	27268614.0
M_1_1_2	11452752.0	27871361.0
M_1_20_1	11621532.0	27069830.0
M_1_20_2	11509644.0	27181718.0
M_1_21_1	14446494.0	40359615.0
M_1_21_2	13790485.0	41015624.0
M_1_22_1	10641818.0	37128601.0
M_1_22_2	10722458.0	37047961.0
M_1_23_1	13447212.0	35989424.0
M_1_23_2	12634242.0	36802394.0
M_1_24_1	11522920.0	24454205.0
M_1_24_2	10966532.0	25010593.0
M_1_25_1	13767965.0	33721506.0
M_1_25_2	13062901.0	34426570.0
M_1_26_1	9358938.0	25479143.0
M_1_26_2	8987346.0	25850735.0
M_1_27_1	10468144.0	22434873.0
M_1_27_2	10030173.0	22872844.0
M_1_28_1	9191907.0	27180304.0
M_1_28_2	9414677.0	26957534.0
M_1_29_1	12035399.0	28321396.0
M_1_29_2	12768461.0	27588334.0
M_1_2_1	10071772.0	23472412.0
M_1_2_2	10122627.0	23421557.0
M_1_30_1	13860528.0	25533059.0
M_1_30_2	14153591.0	25239996.0
M_1_31_1	10319797.0	31723719.0
M_1_31_2	10543012.0	31500504.0
M_1_32_1	8212552.0	21977069.0
M_1_32_2	8208190.0	21981431.0
M_1_33_1	9096711.0	23443738.0
M_1_33_2	8844004.0	23696445.0
M_1_34_1	12364656.0	24722388.0
M_1_34_2	12244947.0	24842097.0
M_1_35_1	12808333.0	25047142.0
M_1_35_2	12490040.0	25365435.0
M_1_36_1	12531961.0	20236463.0
M_1_36_2	12335154.0	20433270.0
M_1_37_1	10029413.0	20877582.0
M_1_37_2	9679673.0	21227322.0
M_1_38_1	10039327.0	27568613.0
M_1_38_2	9606312.0	28001628.0
M_1_39_1	9586530.0	25659168.0
M_1_39_2	9347150.0	25898548.0
M_1_3_1	13015431.0	32429943.0
M_1_3_2	12585696.0	32859678.0
M_1_40_1	9021810.0	25859818.0
M_1_40_2	9456970.0	25424658.0
M_1_41_1	11151943.0	22919392.0
M_1_41_2	11181148.0	22890187.0
M_1_42_1	14192938.0	25429595.0
M_1_42_2	14572253.0	25050280.0
M_1_43_1	12766792.0	28132397.0
M_1_43_2	12906537.0	27992652.0
M_1_44_1	12459571.0	30315872.0
M_1_44_2	12268202.0	30507241.0
M_1_45_1	12965479.0	27237583.0
M_1_45_2	12657741.0	27545321.0
M_1_46_1	11365363.0	22885350.0
M_1_46_2	11137395.0	23113318.0
M_1_47_1	13976577.0	30020258.0
M_1_47_2	13223930.0	30772905.0
M_1_48_1	14723804.0	29428644.0
M_1_48_2	14400812.0	29751636.0
M_1_49_1	14003134.0	25256474.0
M_1_49_2	13487225.0	25772383.0
M_1_4_1	9807527.0	23567492.0
M_1_4_2	10211578.0	23163441.0
M_1_50_1	13093424.0	19520861.0
M_1_50_2	12732794.0	19881491.0
M_1_51_1	13299544.0	24782474.0
M_1_51_2	12938518.0	25143500.0
M_1_52_1	10728099.0	23758203.0
M_1_52_2	10934545.0	23551757.0
M_1_53_1	6713735.0	26595598.0
M_1_53_2	7334569.0	25974764.0
M_1_54_1	10578013.0	22934607.0
M_1_54_2	10665549.0	22847071.0
M_1_55_1	12146949.0	24882367.0
M_1_55_2	12350047.0	24679269.0
M_1_56_1	9664431.0	21087147.0
M_1_56_2	9433319.0	21318259.0
M_1_57_1	10742969.0	30022811.0
M_1_57_2	11304658.0	29461122.0
M_1_58_1	12147811.0	28217173.0
M_1_58_2	12540847.0	27824137.0
M_1_59_1	13333288.0	22627302.0
M_1_59_2	13934915.0	22025675.0
M_1_5_1	10104940.0	23338981.0
M_1_5_2	10264968.0	23178953.0
M_1_60_1	14365730.0	23592750.0
M_1_60_2	14461334.0	23497146.0
M_1_61_1	14959149.0	26733491.0
M_1_61_2	15210274.0	26482366.0
M_1_62_1	14701491.0	24870584.0
M_1_62_2	14813461.0	24758614.0
M_1_63_1	13861475.0	22745921.0
M_1_63_2	13861118.0	22746278.0
M_1_65_1	11577948.0	33626897.0
M_1_65_2	12607882.0	32596963.0
M_1_66_1	10946594.0	31112958.0
M_1_66_2	11643855.0	30415697.0
M_1_67_1	9998219.0	33852221.0
M_1_67_2	10700037.0	33150403.0
M_1_68_1	8345307.0	25370488.0
M_1_68_2	8799974.0	24915821.0
M_1_69_1	11541108.0	34120447.0
M_1_69_2	12058835.0	33602720.0
M_1_6_1	9437856.0	21811631.0
M_1_6_2	9802903.0	21446584.0
M_1_70_1	11781599.0	23017918.0
M_1_70_2	11975049.0	22824468.0
M_1_71_1	14440321.0	28473591.0
M_1_71_2	15356077.0	27557835.0
M_1_72_1	15102172.0	28810336.0
M_1_72_2	15101314.0	28811194.0
M_1_73_1	16519283.0	30820356.0
M_1_73_2	16622687.0	30716952.0
M_1_74_1	15090238.0	27330870.0
M_1_74_2	14899178.0	27521930.0
M_1_75_1	9658400.0	31375756.0
M_1_75_2	9738693.0	31295463.0
M_1_76_1	8453380.0	29682536.0
M_1_76_2	9195314.0	28940602.0
M_1_77_1	10790559.0	35248722.0
M_1_77_2	11611542.0	34427739.0
M_1_78_1	9656880.0	29539864.0
M_1_78_2	10549331.0	28647413.0
M_1_79_1	9866369.0	34267264.0
M_1_79_2	10624111.0	33509522.0
M_1_7_1	10403916.0	27534834.0
M_1_7_2	10907033.0	27031717.0
M_1_80_1	12293159.0	29614042.0
M_1_80_2	13048736.0	28858465.0
M_1_81_1	9061021.0	21714171.0
M_1_81_2	9556850.0	21218342.0
M_1_82_1	16341724.0	31470408.0
M_1_82_2	16444957.0	31367175.0
M_1_83_1	13625528.0	27490861.0
M_1_83_2	14070475.0	27045914.0
M_1_84_1	15562903.0	35686313.0
M_1_84_2	15864902.0	35384314.0
M_1_85_1	16101551.0	28515552.0
M_1_85_2	16250903.0	28366200.0
M_1_86_1	15013631.0	29264454.0
M_1_86_2	14957933.0	29320152.0
M_1_87_1	14553313.0	24352782.0
M_1_87_2	14872996.0	24033099.0
M_1_88_1	12257910.0	24062672.0
M_1_88_2	12335601.0	23984981.0
M_1_89_1	13108848.0	21943530.0
M_1_89_2	12527733.0	22524645.0
M_1_8_1	9508078.0	20815756.0
M_1_8_2	9555298.0	20768536.0
M_1_90_1	12715060.0	24527124.0
M_1_90_2	12494310.0	24747874.0
M_1_91_1	15014745.0	32347230.0
M_1_91_2	14894542.0	32467433.0
M_1_92_1	11964398.0	19704085.0
M_1_92_2	12157309.0	19511174.0
M_1_93_1	12226581.0	20732948.0
M_1_93_2	12305631.0	20653898.0
M_1_94_1	10406941.0	21864099.0
M_1_94_2	10752443.0	21518597.0
M_1_95_1	12906157.0	24297557.0
M_1_95_2	13136803.0	24066911.0
M_1_96_1	12283475.0	22922162.0
M_1_96_2	12434396.0	22771241.0
M_1_9_1	8811083.0	22231897.0
M_1_9_2	8671823.0	22371157.0
