Description	time	Count
response to heat	0.25	1
response to temperature stimulus	0.25	1
protein folding	0.25	1
response to heat	0.5	1
response to temperature stimulus	0.5	1
protein folding	0.5	1
response to heat	1	1
response to temperature stimulus	1	1
protein folding	1	1
response to heat	2	1
response to temperature stimulus	2	1
protein folding	2	1
response to heat	4	23
response to temperature stimulus	4	34
protein folding	4	19
