"","ID","Description","GeneRatio","BgRatio","pvalue","p.adjust","qvalue","geneID","Count"
"GO:0016556","GO:0016556","mRNA modification","2/38","13/5486",0.00347326773379785,0.501067746706781,0.501067746706781,"Me1_v2_0198740/Me1_v2_0183560",2
"GO:0031326","GO:0031326","regulation of cellular biosynthetic process","9/38","487/5486",0.00500201672342874,0.501067746706781,0.501067746706781,"Me1_v2_0034480/Me1_v2_0152660/Me1_v2_0081950/Me1_v2_0086300/Me1_v2_0153970/Me1_v2_0171870/Me1_v2_0229220/Me1_v2_0067240/Me1_v2_0218430",9
"GO:0010431","GO:0010431","seed maturation","2/38","23/5486",0.0107854959272517,0.501067746706781,0.501067746706781,"Me1_v2_0200700/Me1_v2_0200690",2
"GO:0034614","GO:0034614","cellular response to reactive oxygen species","2/38","25/5486",0.0126784399511879,0.501067746706781,0.501067746706781,"Me1_v2_0080650/Me1_v2_0067750",2
"GO:1903506","GO:1903506","regulation of nucleic acid-templated transcription","7/38","374/5486",0.0129494223024488,0.501067746706781,0.501067746706781,"Me1_v2_0034480/Me1_v2_0152660/Me1_v2_0081950/Me1_v2_0086300/Me1_v2_0153970/Me1_v2_0067240/Me1_v2_0218430",7
"GO:2001141","GO:2001141","regulation of RNA biosynthetic process","7/38","374/5486",0.0129494223024488,0.501067746706781,0.501067746706781,"Me1_v2_0034480/Me1_v2_0152660/Me1_v2_0081950/Me1_v2_0086300/Me1_v2_0153970/Me1_v2_0067240/Me1_v2_0218430",7
"GO:0006468","GO:0006468","protein phosphorylation","6/38","291/5486",0.0138962897350622,0.501067746706781,0.501067746706781,"Me1_v2_0080650/Me1_v2_0191290/Me1_v2_0200700/Me1_v2_0219850/Me1_v2_0200690/Me1_v2_0094570",6
"GO:0006355","GO:0006355","regulation of transcription, DNA-templated","8/38","480/5486",0.0151300657914158,0.501067746706781,0.501067746706781,"Me1_v2_0034480/Me1_v2_0152660/Me1_v2_0157280/Me1_v2_0081950/Me1_v2_0086300/Me1_v2_0153970/Me1_v2_0067240/Me1_v2_0218430",8
"GO:0048609","GO:0048609","multicellular organismal reproductive process","3/38","79/5486",0.0168866087432451,0.501067746706781,0.501067746706781,"Me1_v2_0086300/Me1_v2_0200700/Me1_v2_0200690",3
"GO:0032504","GO:0032504","multicellular organism reproduction","3/38","84/5486",0.0198719296246511,0.501067746706781,0.501067746706781,"Me1_v2_0086300/Me1_v2_0200700/Me1_v2_0200690",3
"GO:0051252","GO:0051252","regulation of RNA metabolic process","7/38","417/5486",0.0224264813050928,0.501067746706781,0.501067746706781,"Me1_v2_0034480/Me1_v2_0152660/Me1_v2_0081950/Me1_v2_0086300/Me1_v2_0153970/Me1_v2_0067240/Me1_v2_0218430",7
"GO:0009642","GO:0009642","response to light intensity","3/38","88/5486",0.0224578644017322,0.501067746706781,0.501067746706781,"Me1_v2_0034480/Me1_v2_0152660/Me1_v2_0171870",3
"GO:0051239","GO:0051239","regulation of multicellular organismal process","5/38","248/5486",0.0268801121235024,0.501067746706781,0.501067746706781,"Me1_v2_0204900/Me1_v2_0067750/Me1_v2_0153970/Me1_v2_0171870/Me1_v2_0219850",5
"GO:0042542","GO:0042542","response to hydrogen peroxide","2/38","38/5486",0.0280829573179503,0.501067746706781,0.501067746706781,"Me1_v2_0080650/Me1_v2_0067750",2
"GO:0048284","GO:0048284","organelle fusion","2/38","38/5486",0.0280829573179503,0.501067746706781,0.501067746706781,"Me1_v2_0206630/Me1_v2_0210270",2
"GO:2000112","GO:2000112","regulation of cellular macromolecule biosynthetic process","7/38","443/5486",0.0300957065564858,0.501067746706781,0.501067746706781,"Me1_v2_0034480/Me1_v2_0152660/Me1_v2_0081950/Me1_v2_0086300/Me1_v2_0153970/Me1_v2_0067240/Me1_v2_0218430",7
"GO:0010556","GO:0010556","regulation of macromolecule biosynthetic process","7/38","452/5486",0.0331264440996279,0.501067746706781,0.501067746706781,"Me1_v2_0034480/Me1_v2_0152660/Me1_v2_0081950/Me1_v2_0086300/Me1_v2_0153970/Me1_v2_0067240/Me1_v2_0218430",7
"GO:0009636","GO:0009636","response to toxic substance","3/38","103/5486",0.0337241264946334,0.501067746706781,0.501067746706781,"Me1_v2_0080650/Me1_v2_0034480/Me1_v2_0067750",3
"GO:0010029","GO:0010029","regulation of seed germination","2/38","42/5486",0.0338060072469804,0.501067746706781,0.501067746706781,"Me1_v2_0204900/Me1_v2_0171870",2
"GO:0080167","GO:0080167","response to karrikin","2/38","47/5486",0.0415398116213793,0.501067746706781,0.501067746706781,"Me1_v2_0204900/Me1_v2_0171870",2
"GO:1900140","GO:1900140","regulation of seedling development","2/38","47/5486",0.0415398116213793,0.501067746706781,0.501067746706781,"Me1_v2_0204900/Me1_v2_0171870",2
"GO:0019219","GO:0019219","regulation of nucleobase-containing compound metabolic process","7/38","480/5486",0.0438724142426833,0.501067746706781,0.501067746706781,"Me1_v2_0034480/Me1_v2_0152660/Me1_v2_0081950/Me1_v2_0086300/Me1_v2_0153970/Me1_v2_0067240/Me1_v2_0218430",7
"GO:0000160","GO:0000160","phosphorelay signal transduction system","2/38","52/5486",0.0498714311417625,0.501067746706781,0.501067746706781,"Me1_v2_0080650/Me1_v2_0200690",2
"GO:0010035","GO:0010035","response to inorganic substance","6/38","400/5486",0.0547634726613024,0.501067746706781,0.501067746706781,"Me1_v2_0080650/Me1_v2_0210270/Me1_v2_0204900/Me1_v2_0067750/Me1_v2_0200700/Me1_v2_0200690",6
"GO:1901698","GO:1901698","response to nitrogen compound","3/38","126/5486",0.0557241886731876,0.501067746706781,0.501067746706781,"Me1_v2_0080650/Me1_v2_0067750/Me1_v2_0081950",3
"GO:0034599","GO:0034599","cellular response to oxidative stress","2/38","57/5486",0.0587532964214093,0.501067746706781,0.501067746706781,"Me1_v2_0080650/Me1_v2_0067750",2
"GO:0009644","GO:0009644","response to high light intensity","2/38","59/5486",0.0624499160138997,0.501067746706781,0.501067746706781,"Me1_v2_0152660/Me1_v2_0171870",2
"GO:0006458","GO:0006458","'de novo' protein folding","1/38","10/5486",0.0672009829672214,0.501067746706781,0.501067746706781,"Me1_v2_0144780",1
"GO:0007610","GO:0007610","behavior","1/38","10/5486",0.0672009829672214,0.501067746706781,0.501067746706781,"Me1_v2_0067750",1
"GO:0017000","GO:0017000","antibiotic biosynthetic process","1/38","10/5486",0.0672009829672214,0.501067746706781,0.501067746706781,"Me1_v2_0034480",1
"GO:0036294","GO:0036294","cellular response to decreased oxygen levels","1/38","10/5486",0.0672009829672214,0.501067746706781,0.501067746706781,"Me1_v2_0067750",1
"GO:0042136","GO:0042136","neurotransmitter biosynthetic process","1/38","10/5486",0.0672009829672214,0.501067746706781,0.501067746706781,"Me1_v2_0211740",1
"GO:0055074","GO:0055074","calcium ion homeostasis","1/38","10/5486",0.0672009829672214,0.501067746706781,0.501067746706781,"Me1_v2_0067750",1
"GO:0071453","GO:0071453","cellular response to oxygen levels","1/38","10/5486",0.0672009829672214,0.501067746706781,0.501067746706781,"Me1_v2_0067750",1
"GO:0071490","GO:0071490","cellular response to far red light","1/38","10/5486",0.0672009829672214,0.501067746706781,0.501067746706781,"Me1_v2_0171870",1
"GO:0071491","GO:0071491","cellular response to red light","1/38","10/5486",0.0672009829672214,0.501067746706781,0.501067746706781,"Me1_v2_0171870",1
"GO:1901699","GO:1901699","cellular response to nitrogen compound","2/38","62/5486",0.0681402427862155,0.501067746706781,0.501067746706781,"Me1_v2_0080650/Me1_v2_0067750",2
"GO:0003002","GO:0003002","regionalization","2/38","63/5486",0.0700744305299612,0.501067746706781,0.501067746706781,"Me1_v2_0200700/Me1_v2_0200690",2
"GO:0032350","GO:0032350","regulation of hormone metabolic process","1/38","11/5486",0.0736740221650385,0.501067746706781,0.501067746706781,"Me1_v2_0229220",1
"GO:0042391","GO:0042391","regulation of membrane potential","1/38","11/5486",0.0736740221650385,0.501067746706781,0.501067746706781,"Me1_v2_0067750",1
"GO:0051272","GO:0051272","positive regulation of cellular component movement","1/38","11/5486",0.0736740221650385,0.501067746706781,0.501067746706781,"Me1_v2_0067750",1
"GO:0051865","GO:0051865","protein autoubiquitination","1/38","11/5486",0.0736740221650385,0.501067746706781,0.501067746706781,"Me1_v2_0229220",1
"GO:0071731","GO:0071731","response to nitric oxide","1/38","11/5486",0.0736740221650385,0.501067746706781,0.501067746706781,"Me1_v2_0080650",1
"GO:0071732","GO:0071732","cellular response to nitric oxide","1/38","11/5486",0.0736740221650385,0.501067746706781,0.501067746706781,"Me1_v2_0080650",1
"GO:0090332","GO:0090332","stomatal closure","1/38","11/5486",0.0736740221650385,0.501067746706781,0.501067746706781,"Me1_v2_0204900",1
"GO:0097366","GO:0097366","response to bronchodilator","1/38","11/5486",0.0736740221650385,0.501067746706781,0.501067746706781,"Me1_v2_0080650",1
"GO:1904062","GO:1904062","regulation of cation transmembrane transport","1/38","11/5486",0.0736740221650385,0.501067746706781,0.501067746706781,"Me1_v2_0067750",1
"GO:0048580","GO:0048580","regulation of post-embryonic development","3/38","144/5486",0.0767110285899656,0.501067746706781,0.501067746706781,"Me1_v2_0204900/Me1_v2_0153970/Me1_v2_0171870",3
"GO:0019932","GO:0019932","second-messenger-mediated signaling","1/38","12/5486",0.0801033166230702,0.501067746706781,0.501067746706781,"Me1_v2_0067750",1
"GO:0070141","GO:0070141","response to UV-A","1/38","12/5486",0.0801033166230702,0.501067746706781,0.501067746706781,"Me1_v2_0171870",1
"GO:0071486","GO:0071486","cellular response to high light intensity","1/38","12/5486",0.0801033166230702,0.501067746706781,0.501067746706781,"Me1_v2_0171870",1
"GO:0071492","GO:0071492","cellular response to UV-A","1/38","12/5486",0.0801033166230702,0.501067746706781,0.501067746706781,"Me1_v2_0171870",1
"GO:0007389","GO:0007389","pattern specification process","2/38","70/5486",0.0841037705876121,0.501067746706781,0.501067746706781,"Me1_v2_0200700/Me1_v2_0200690",2
"GO:0010243","GO:0010243","response to organonitrogen compound","2/38","70/5486",0.0841037705876121,0.501067746706781,0.501067746706781,"Me1_v2_0067750/Me1_v2_0081950",2
"GO:0007584","GO:0007584","response to nutrient","1/38","13/5486",0.0864891540305104,0.501067746706781,0.501067746706781,"Me1_v2_0067750",1
"GO:0043572","GO:0043572","plastid fission","1/38","13/5486",0.0864891540305104,0.501067746706781,0.501067746706781,"Me1_v2_0204870",1
"GO:0048278","GO:0048278","vesicle docking","1/38","13/5486",0.0864891540305104,0.501067746706781,0.501067746706781,"Me1_v2_0206630",1
"GO:0007154","GO:0007154","cell communication","6/38","453/5486",0.0887848809725753,0.501067746706781,0.501067746706781,"Me1_v2_0080650/Me1_v2_0067750/Me1_v2_0162180/Me1_v2_0200700/Me1_v2_0219850/Me1_v2_0200690",6
"GO:0030154","GO:0030154","cell differentiation","4/38","247/5486",0.0895999949838232,0.501067746706781,0.501067746706781,"Me1_v2_0206630/Me1_v2_0210270/Me1_v2_0152660/Me1_v2_0086300",4
"GO:0000959","GO:0000959","mitochondrial RNA metabolic process","1/38","14/5486",0.0928318202367662,0.501067746706781,0.501067746706781,"Me1_v2_0198740",1
"GO:0010020","GO:0010020","chloroplast fission","1/38","14/5486",0.0928318202367662,0.501067746706781,0.501067746706781,"Me1_v2_0204870",1
"GO:0010117","GO:0010117","photoprotection","1/38","14/5486",0.0928318202367662,0.501067746706781,0.501067746706781,"Me1_v2_0171870",1
"GO:0022406","GO:0022406","membrane docking","1/38","14/5486",0.0928318202367662,0.501067746706781,0.501067746706781,"Me1_v2_0206630",1
"GO:0050877","GO:0050877","nervous system process","1/38","14/5486",0.0928318202367662,0.501067746706781,0.501067746706781,"Me1_v2_0067750",1
"GO:0140056","GO:0140056","organelle localization by membrane tethering","1/38","14/5486",0.0928318202367662,0.501067746706781,0.501067746706781,"Me1_v2_0206630",1
"GO:0016310","GO:0016310","phosphorylation","5/38","353/5486",0.0941253806063446,0.501067746706781,0.501067746706781,"Me1_v2_0080650/Me1_v2_0200700/Me1_v2_0219850/Me1_v2_0235080/Me1_v2_0200690",5
"GO:0000741","GO:0000741","karyogamy","1/38","15/5486",0.0991315992628997,0.501067746706781,0.501067746706781,"Me1_v2_0210270",1
"GO:0009559","GO:0009559","embryo sac central cell differentiation","1/38","15/5486",0.0991315992628997,0.501067746706781,0.501067746706781,"Me1_v2_0210270",1
"GO:0010197","GO:0010197","polar nucleus fusion","1/38","15/5486",0.0991315992628997,0.501067746706781,0.501067746706781,"Me1_v2_0210270",1
"GO:0010200","GO:0010200","response to chitin","1/38","15/5486",0.0991315992628997,0.501067746706781,0.501067746706781,"Me1_v2_0081950",1
"GO:0010769","GO:0010769","regulation of cell morphogenesis involved in differentiation","1/38","15/5486",0.0991315992628997,0.501067746706781,0.501067746706781,"Me1_v2_0219850",1
"GO:0010959","GO:0010959","regulation of metal ion transport","1/38","15/5486",0.0991315992628997,0.501067746706781,0.501067746706781,"Me1_v2_0067750",1
"GO:0034765","GO:0034765","regulation of ion transmembrane transport","1/38","15/5486",0.0991315992628997,0.501067746706781,0.501067746706781,"Me1_v2_0067750",1
"GO:0071417","GO:0071417","cellular response to organonitrogen compound","1/38","15/5486",0.0991315992628997,0.501067746706781,0.501067746706781,"Me1_v2_0067750",1
"GO:0080092","GO:0080092","regulation of pollen tube growth","1/38","15/5486",0.0991315992628997,0.501067746706781,0.501067746706781,"Me1_v2_0219850",1
"GO:0071695","GO:0071695","anatomical structure maturation","2/38","79/5486",0.103274371888799,0.501067746706781,0.501067746706781,"Me1_v2_0200700/Me1_v2_0200690",2
"GO:0010565","GO:0010565","regulation of cellular ketone metabolic process","1/38","16/5486",0.105388773312984,0.501067746706781,0.501067746706781,"Me1_v2_0229220",1
"GO:0018106","GO:0018106","peptidyl-histidine phosphorylation","1/38","16/5486",0.105388773312984,0.501067746706781,0.501067746706781,"Me1_v2_0080650",1
"GO:0034762","GO:0034762","regulation of transmembrane transport","1/38","16/5486",0.105388773312984,0.501067746706781,0.501067746706781,"Me1_v2_0067750",1
"GO:0042133","GO:0042133","neurotransmitter metabolic process","1/38","16/5486",0.105388773312984,0.501067746706781,0.501067746706781,"Me1_v2_0211740",1
"GO:0055046","GO:0055046","microgametogenesis","1/38","16/5486",0.105388773312984,0.501067746706781,0.501067746706781,"Me1_v2_0086300",1
"GO:0071484","GO:0071484","cellular response to light intensity","1/38","16/5486",0.105388773312984,0.501067746706781,0.501067746706781,"Me1_v2_0171870",1
"GO:1902170","GO:1902170","cellular response to reactive nitrogen species","1/38","16/5486",0.105388773312984,0.501067746706781,0.501067746706781,"Me1_v2_0080650",1
"GO:0000302","GO:0000302","response to reactive oxygen species","2/38","80/5486",0.105474694717491,0.501067746706781,0.501067746706781,"Me1_v2_0080650/Me1_v2_0067750",2
"GO:0023052","GO:0023052","signaling","5/38","372/5486",0.111480537316998,0.501067746706781,0.501067746706781,"Me1_v2_0080650/Me1_v2_0067750/Me1_v2_0200700/Me1_v2_0219850/Me1_v2_0200690",5
"GO:0009736","GO:0009736","cytokinin-activated signaling pathway","1/38","17/5486",0.111603622785398,0.501067746706781,0.501067746706781,"Me1_v2_0080650",1
"GO:0030334","GO:0030334","regulation of cell migration","1/38","17/5486",0.111603622785398,0.501067746706781,0.501067746706781,"Me1_v2_0067750",1
"GO:0040012","GO:0040012","regulation of locomotion","1/38","17/5486",0.111603622785398,0.501067746706781,0.501067746706781,"Me1_v2_0067750",1
"GO:0051510","GO:0051510","regulation of unidimensional cell growth","1/38","17/5486",0.111603622785398,0.501067746706781,0.501067746706781,"Me1_v2_0219850",1
"GO:0071236","GO:0071236","cellular response to antibiotic","1/38","17/5486",0.111603622785398,0.501067746706781,0.501067746706781,"Me1_v2_0080650",1
"GO:0071368","GO:0071368","cellular response to cytokinin stimulus","1/38","17/5486",0.111603622785398,0.501067746706781,0.501067746706781,"Me1_v2_0080650",1
"GO:2000145","GO:2000145","regulation of cell motility","1/38","17/5486",0.111603622785398,0.501067746706781,0.501067746706781,"Me1_v2_0067750",1
"GO:0009416","GO:0009416","response to light stimulus","4/38","268/5486",0.112389970945552,0.501067746706781,0.501067746706781,"Me1_v2_0211740/Me1_v2_0034480/Me1_v2_0152660/Me1_v2_0171870",4
"GO:0050793","GO:0050793","regulation of developmental process","4/38","268/5486",0.112389970945552,0.501067746706781,0.501067746706781,"Me1_v2_0204900/Me1_v2_0153970/Me1_v2_0171870/Me1_v2_0219850",4
"GO:0009617","GO:0009617","response to bacterium","3/38","171/5486",0.113716100506962,0.501067746706781,0.501067746706781,"Me1_v2_0080650/Me1_v2_0204900/Me1_v2_0034480",3
"GO:0021700","GO:0021700","developmental maturation","2/38","84/5486",0.114403406006583,0.501067746706781,0.501067746706781,"Me1_v2_0200700/Me1_v2_0200690",2
"GO:0009605","GO:0009605","response to external stimulus","6/38","488/5486",0.116582851198965,0.501067746706781,0.501067746706781,"Me1_v2_0211740/Me1_v2_0080650/Me1_v2_0204900/Me1_v2_0034480/Me1_v2_0067750/Me1_v2_0162180",6
"GO:0010311","GO:0010311","lateral root formation","1/38","18/5486",0.117776426284056,0.501067746706781,0.501067746706781,"Me1_v2_0229220",1
"GO:0035725","GO:0035725","sodium ion transmembrane transport","1/38","18/5486",0.117776426284056,0.501067746706781,0.501067746706781,"Me1_v2_0067750",1
"GO:0071483","GO:0071483","cellular response to blue light","1/38","18/5486",0.117776426284056,0.501067746706781,0.501067746706781,"Me1_v2_0171870",1
"GO:0001505","GO:0001505","regulation of neurotransmitter levels","1/38","19/5486",0.123907460629557,0.501067746706781,0.501067746706781,"Me1_v2_0211740",1
"GO:0006906","GO:0006906","vesicle fusion","1/38","19/5486",0.123907460629557,0.501067746706781,0.501067746706781,"Me1_v2_0206630",1
"GO:0007140","GO:0007140","male meiotic nuclear division","1/38","19/5486",0.123907460629557,0.501067746706781,0.501067746706781,"Me1_v2_0086300",1
"GO:0009699","GO:0009699","phenylpropanoid biosynthetic process","1/38","19/5486",0.123907460629557,0.501067746706781,0.501067746706781,"Me1_v2_0103080",1
"GO:0010030","GO:0010030","positive regulation of seed germination","1/38","19/5486",0.123907460629557,0.501067746706781,0.501067746706781,"Me1_v2_0171870",1
"GO:0018202","GO:0018202","peptidyl-histidine modification","1/38","19/5486",0.123907460629557,0.501067746706781,0.501067746706781,"Me1_v2_0080650",1
"GO:0070588","GO:0070588","calcium ion transmembrane transport","1/38","19/5486",0.123907460629557,0.501067746706781,0.501067746706781,"Me1_v2_0067750",1
"GO:0097164","GO:0097164","ammonium ion metabolic process","1/38","19/5486",0.123907460629557,0.501067746706781,0.501067746706781,"Me1_v2_0235080",1
"GO:0006814","GO:0006814","sodium ion transport","1/38","20/5486",0.129997000870289,0.501067746706781,0.501067746706781,"Me1_v2_0067750",1
"GO:0006816","GO:0006816","calcium ion transport","1/38","20/5486",0.129997000870289,0.501067746706781,0.501067746706781,"Me1_v2_0067750",1
"GO:0010380","GO:0010380","regulation of chlorophyll biosynthetic process","1/38","20/5486",0.129997000870289,0.501067746706781,0.501067746706781,"Me1_v2_0171870",1
"GO:0051270","GO:0051270","regulation of cellular component movement","1/38","20/5486",0.129997000870289,0.501067746706781,0.501067746706781,"Me1_v2_0067750",1
"GO:0071489","GO:0071489","cellular response to red or far red light","1/38","20/5486",0.129997000870289,0.501067746706781,0.501067746706781,"Me1_v2_0171870",1
"GO:0007165","GO:0007165","signal transduction","5/38","391/5486",0.130326702516487,0.501067746706781,0.501067746706781,"Me1_v2_0080650/Me1_v2_0067750/Me1_v2_0200700/Me1_v2_0219850/Me1_v2_0200690",5
"GO:0046677","GO:0046677","response to antibiotic","2/38","91/5486",0.130478430939945,0.501067746706781,0.501067746706781,"Me1_v2_0080650/Me1_v2_0067750",2
"GO:0010817","GO:0010817","regulation of hormone levels","2/38","92/5486",0.132817505372709,0.501067746706781,0.501067746706781,"Me1_v2_0034480/Me1_v2_0229220",2
"GO:0045892","GO:0045892","negative regulation of transcription, DNA-templated","2/38","93/5486",0.13516650119344,0.501067746706781,0.501067746706781,"Me1_v2_0034480/Me1_v2_0227220",2
"GO:0001522","GO:0001522","pseudouridine synthesis","1/38","21/5486",0.136045320293437,0.501067746706781,0.501067746706781,"Me1_v2_0198740",1
"GO:0002237","GO:0002237","response to molecule of bacterial origin","1/38","21/5486",0.136045320293437,0.501067746706781,0.501067746706781,"Me1_v2_0080650",1
"GO:0003008","GO:0003008","system process","1/38","21/5486",0.136045320293437,0.501067746706781,0.501067746706781,"Me1_v2_0067750",1
"GO:0006694","GO:0006694","steroid biosynthetic process","1/38","21/5486",0.136045320293437,0.501067746706781,0.501067746706781,"Me1_v2_0184110",1
"GO:0007420","GO:0007420","brain development","1/38","21/5486",0.136045320293437,0.501067746706781,0.501067746706781,"Me1_v2_0067750",1
"GO:0009749","GO:0009749","response to glucose","1/38","21/5486",0.136045320293437,0.501067746706781,0.501067746706781,"Me1_v2_0067750",1
"GO:0010105","GO:0010105","negative regulation of ethylene-activated signaling pathway","1/38","21/5486",0.136045320293437,0.501067746706781,0.501067746706781,"Me1_v2_0080650",1
"GO:0060322","GO:0060322","head development","1/38","21/5486",0.136045320293437,0.501067746706781,0.501067746706781,"Me1_v2_0067750",1
"GO:0070298","GO:0070298","negative regulation of phosphorelay signal transduction system","1/38","21/5486",0.136045320293437,0.501067746706781,0.501067746706781,"Me1_v2_0080650",1
"GO:0090174","GO:0090174","organelle membrane fusion","1/38","21/5486",0.136045320293437,0.501067746706781,0.501067746706781,"Me1_v2_0206630",1
"GO:0090333","GO:0090333","regulation of stomatal closure","1/38","21/5486",0.136045320293437,0.501067746706781,0.501067746706781,"Me1_v2_0080650",1
"GO:1901463","GO:1901463","regulation of tetrapyrrole biosynthetic process","1/38","21/5486",0.136045320293437,0.501067746706781,0.501067746706781,"Me1_v2_0171870",1
"GO:0006457","GO:0006457","protein folding","2/38","95/5486",0.139893301434235,0.501067746706781,0.501067746706781,"Me1_v2_0144780/Me1_v2_0125340",2
"GO:0034605","GO:0034605","cellular response to heat","1/38","22/5486",0.142052690435953,0.501067746706781,0.501067746706781,"Me1_v2_0171870",1
"GO:0140053","GO:0140053","mitochondrial gene expression","1/38","22/5486",0.142052690435953,0.501067746706781,0.501067746706781,"Me1_v2_0198740",1
"GO:0031667","GO:0031667","response to nutrient levels","2/38","97/5486",0.144656947190739,0.501067746706781,0.501067746706781,"Me1_v2_0067750/Me1_v2_0162180",2
"GO:0007051","GO:0007051","spindle organization","1/38","23/5486",0.148019381095439,0.501067746706781,0.501067746706781,"Me1_v2_0086300",1
"GO:0009698","GO:0009698","phenylpropanoid metabolic process","1/38","23/5486",0.148019381095439,0.501067746706781,0.501067746706781,"Me1_v2_0103080",1
"GO:0010118","GO:0010118","stomatal movement","1/38","23/5486",0.148019381095439,0.501067746706781,0.501067746706781,"Me1_v2_0204900",1
"GO:0045036","GO:0045036","protein targeting to chloroplast","1/38","23/5486",0.148019381095439,0.501067746706781,0.501067746706781,"Me1_v2_0067240",1
"GO:0061077","GO:0061077","chaperone-mediated protein folding","1/38","23/5486",0.148019381095439,0.501067746706781,0.501067746706781,"Me1_v2_0144780",1
"GO:0072507","GO:0072507","divalent inorganic cation homeostasis","1/38","23/5486",0.148019381095439,0.501067746706781,0.501067746706781,"Me1_v2_0067750",1
"GO:0072596","GO:0072596","establishment of protein localization to chloroplast","1/38","23/5486",0.148019381095439,0.501067746706781,0.501067746706781,"Me1_v2_0067240",1
"GO:0071495","GO:0071495","cellular response to endogenous stimulus","3/38","193/5486",0.148038769063265,0.501067746706781,0.501067746706781,"Me1_v2_0080650/Me1_v2_0067750/Me1_v2_0219850",3
"GO:0009408","GO:0009408","response to heat","2/38","100/5486",0.151867482351933,0.501067746706781,0.501067746706781,"Me1_v2_0204900/Me1_v2_0171870",2
"GO:0010102","GO:0010102","lateral root morphogenesis","1/38","24/5486",0.153945660340977,0.501067746706781,0.501067746706781,"Me1_v2_0229220",1
"GO:0010104","GO:0010104","regulation of ethylene-activated signaling pathway","1/38","24/5486",0.153945660340977,0.501067746706781,0.501067746706781,"Me1_v2_0080650",1
"GO:0070192","GO:0070192","chromosome organization involved in meiotic cell cycle","1/38","24/5486",0.153945660340977,0.501067746706781,0.501067746706781,"Me1_v2_0086300",1
"GO:0070297","GO:0070297","regulation of phosphorelay signal transduction system","1/38","24/5486",0.153945660340977,0.501067746706781,0.501067746706781,"Me1_v2_0080650",1
"GO:2000377","GO:2000377","regulation of reactive oxygen species metabolic process","1/38","24/5486",0.153945660340977,0.501067746706781,0.501067746706781,"Me1_v2_0034480",1
"GO:0009314","GO:0009314","response to radiation","4/38","302/5486",0.154222291647254,0.501067746706781,0.501067746706781,"Me1_v2_0211740/Me1_v2_0034480/Me1_v2_0152660/Me1_v2_0171870",4
"GO:0006352","GO:0006352","DNA-templated transcription, initiation","1/38","25/5486",0.159831794523885,0.501067746706781,0.501067746706781,"Me1_v2_0157280",1
"GO:0007417","GO:0007417","central nervous system development","1/38","25/5486",0.159831794523885,0.501067746706781,0.501067746706781,"Me1_v2_0067750",1
"GO:0009615","GO:0009615","response to virus","1/38","25/5486",0.159831794523885,0.501067746706781,0.501067746706781,"Me1_v2_0204900",1
"GO:0010101","GO:0010101","post-embryonic root morphogenesis","1/38","25/5486",0.159831794523885,0.501067746706781,0.501067746706781,"Me1_v2_0229220",1
"GO:0022604","GO:0022604","regulation of cell morphogenesis","1/38","25/5486",0.159831794523885,0.501067746706781,0.501067746706781,"Me1_v2_0219850",1
"GO:0072598","GO:0072598","protein localization to chloroplast","1/38","25/5486",0.159831794523885,0.501067746706781,0.501067746706781,"Me1_v2_0067240",1
"GO:0090056","GO:0090056","regulation of chlorophyll metabolic process","1/38","25/5486",0.159831794523885,0.501067746706781,0.501067746706781,"Me1_v2_0171870",1
"GO:0048869","GO:0048869","cellular developmental process","4/38","307/5486",0.160836560671312,0.501067746706781,0.501067746706781,"Me1_v2_0206630/Me1_v2_0210270/Me1_v2_0152660/Me1_v2_0086300",4
"GO:2000026","GO:2000026","regulation of multicellular organismal development","3/38","203/5486",0.164671356376871,0.502338532120154,0.502338532120154,"Me1_v2_0204900/Me1_v2_0153970/Me1_v2_0171870",3
"GO:0009247","GO:0009247","glycolipid biosynthetic process","1/38","26/5486",0.165678048288414,0.502338532120154,0.502338532120154,"Me1_v2_0162180",1
"GO:0043269","GO:0043269","regulation of ion transport","1/38","26/5486",0.165678048288414,0.502338532120154,0.502338532120154,"Me1_v2_0067750",1
"GO:0006664","GO:0006664","glycolipid metabolic process","1/38","27/5486",0.171484684582377,0.502338532120154,0.502338532120154,"Me1_v2_0162180",1
"GO:1901401","GO:1901401","regulation of tetrapyrrole metabolic process","1/38","27/5486",0.171484684582377,0.502338532120154,0.502338532120154,"Me1_v2_0171870",1
"GO:1903509","GO:1903509","liposaccharide metabolic process","1/38","27/5486",0.171484684582377,0.502338532120154,0.502338532120154,"Me1_v2_0162180",1
"GO:0009658","GO:0009658","chloroplast organization","2/38","109/5486",0.173912260248788,0.502338532120154,0.502338532120154,"Me1_v2_0204870/Me1_v2_0183560",2
"GO:0009991","GO:0009991","response to extracellular stimulus","2/38","110/5486",0.176395381963815,0.502338532120154,0.502338532120154,"Me1_v2_0067750/Me1_v2_0162180",2
"GO:1901701","GO:1901701","cellular response to oxygen-containing compound","3/38","210/5486",0.176645751908292,0.502338532120154,0.502338532120154,"Me1_v2_0080650/Me1_v2_0067750/Me1_v2_0219850",3
"GO:0000122","GO:0000122","negative regulation of transcription by RNA polymerase II","1/38","28/5486",0.177251964667717,0.502338532120154,0.502338532120154,"Me1_v2_0034480",1
"GO:0016036","GO:0016036","cellular response to phosphate starvation","1/38","28/5486",0.177251964667717,0.502338532120154,0.502338532120154,"Me1_v2_0162180",1
"GO:0006875","GO:0006875","cellular metal ion homeostasis","1/38","29/5486",0.182980148131005,0.502338532120154,0.502338532120154,"Me1_v2_0067750",1
"GO:0009561","GO:0009561","megagametogenesis","1/38","29/5486",0.182980148131005,0.502338532120154,0.502338532120154,"Me1_v2_0210270",1
"GO:0060284","GO:0060284","regulation of cell development","1/38","29/5486",0.182980148131005,0.502338532120154,0.502338532120154,"Me1_v2_0219850",1
"GO:1901420","GO:1901420","negative regulation of response to alcohol","1/38","29/5486",0.182980148131005,0.502338532120154,0.502338532120154,"Me1_v2_0080650",1
"GO:1905958","GO:1905958","negative regulation of cellular response to alcohol","1/38","29/5486",0.182980148131005,0.502338532120154,0.502338532120154,"Me1_v2_0080650",1
"GO:0051707","GO:0051707","response to other organism","4/38","327/5486",0.188332845247221,0.502338532120154,0.502338532120154,"Me1_v2_0211740/Me1_v2_0080650/Me1_v2_0204900/Me1_v2_0034480",4
"GO:0009746","GO:0009746","response to hexose","1/38","30/5486",0.188669492893883,0.502338532120154,0.502338532120154,"Me1_v2_0067750",1
"GO:0009788","GO:0009788","negative regulation of abscisic acid-activated signaling pathway","1/38","30/5486",0.188669492893883,0.502338532120154,0.502338532120154,"Me1_v2_0080650",1
"GO:0034644","GO:0034644","cellular response to UV","1/38","30/5486",0.188669492893883,0.502338532120154,0.502338532120154,"Me1_v2_0171870",1
"GO:0048511","GO:0048511","rhythmic process","1/38","30/5486",0.188669492893883,0.502338532120154,0.502338532120154,"Me1_v2_0210270",1
"GO:0062012","GO:0062012","regulation of small molecule metabolic process","1/38","30/5486",0.188669492893883,0.502338532120154,0.502338532120154,"Me1_v2_0229220",1
"GO:0009620","GO:0009620","response to fungus","2/38","115/5486",0.188897132794853,0.502338532120154,0.502338532120154,"Me1_v2_0211740/Me1_v2_0204900",2
"GO:0043207","GO:0043207","response to external biotic stimulus","4/38","328/5486",0.189748443833785,0.502338532120154,0.502338532120154,"Me1_v2_0211740/Me1_v2_0080650/Me1_v2_0204900/Me1_v2_0034480",4
"GO:0009607","GO:0009607","response to biotic stimulus","4/38","329/5486",0.1911676921457,0.502338532120154,0.502338532120154,"Me1_v2_0211740/Me1_v2_0080650/Me1_v2_0204900/Me1_v2_0034480",4
"GO:0009414","GO:0009414","response to water deprivation","2/38","117/5486",0.193934490517142,0.502338532120154,0.502338532120154,"Me1_v2_0200700/Me1_v2_0200690",2
"GO:0006970","GO:0006970","response to osmotic stress","3/38","220/5486",0.194174552267042,0.502338532120154,0.502338532120154,"Me1_v2_0034480/Me1_v2_0200700/Me1_v2_0200690",3
"GO:0007623","GO:0007623","circadian rhythm","1/38","31/5486",0.194320255223434,0.502338532120154,0.502338532120154,"Me1_v2_0210270",1
"GO:0010218","GO:0010218","response to far red light","1/38","31/5486",0.194320255223434,0.502338532120154,0.502338532120154,"Me1_v2_0171870",1
"GO:0034284","GO:0034284","response to monosaccharide","1/38","31/5486",0.194320255223434,0.502338532120154,0.502338532120154,"Me1_v2_0067750",1
"GO:0046474","GO:0046474","glycerophospholipid biosynthetic process","1/38","31/5486",0.194320255223434,0.502338532120154,0.502338532120154,"Me1_v2_0235080",1
"GO:0098657","GO:0098657","import into cell","1/38","31/5486",0.194320255223434,0.502338532120154,0.502338532120154,"Me1_v2_0067750",1
"GO:0009415","GO:0009415","response to water","2/38","118/5486",0.19646028542982,0.505183591105251,0.505183591105251,"Me1_v2_0200700/Me1_v2_0200690",2
"GO:0072593","GO:0072593","reactive oxygen species metabolic process","1/38","32/5486",0.199932689742501,0.511406774815028,0.511406774815028,"Me1_v2_0211740",1
"GO:0001666","GO:0001666","response to hypoxia","1/38","33/5486",0.205507049439931,0.512186800142597,0.512186800142597,"Me1_v2_0067750",1
"GO:0006997","GO:0006997","nucleus organization","1/38","33/5486",0.205507049439931,0.512186800142597,0.512186800142597,"Me1_v2_0210270",1
"GO:0010114","GO:0010114","response to red light","1/38","33/5486",0.205507049439931,0.512186800142597,0.512186800142597,"Me1_v2_0171870",1
"GO:0022411","GO:0022411","cellular component disassembly","1/38","33/5486",0.205507049439931,0.512186800142597,0.512186800142597,"Me1_v2_0152660",1
"GO:0061025","GO:0061025","membrane fusion","1/38","33/5486",0.205507049439931,0.512186800142597,0.512186800142597,"Me1_v2_0206630",1
"GO:0006887","GO:0006887","exocytosis","1/38","34/5486",0.211043585680768,0.512835913204266,0.512835913204266,"Me1_v2_0206630",1
"GO:0009860","GO:0009860","pollen tube growth","1/38","34/5486",0.211043585680768,0.512835913204266,0.512835913204266,"Me1_v2_0206630",1
"GO:0016050","GO:0016050","vesicle organization","1/38","34/5486",0.211043585680768,0.512835913204266,0.512835913204266,"Me1_v2_0206630",1
"GO:0048581","GO:0048581","negative regulation of post-embryonic development","1/38","34/5486",0.211043585680768,0.512835913204266,0.512835913204266,"Me1_v2_0204900",1
"GO:0048582","GO:0048582","positive regulation of post-embryonic development","1/38","34/5486",0.211043585680768,0.512835913204266,0.512835913204266,"Me1_v2_0171870",1
"GO:0042446","GO:0042446","hormone biosynthetic process","1/38","35/5486",0.216542548216375,0.518422061247085,0.518422061247085,"Me1_v2_0034480",1
"GO:0045132","GO:0045132","meiotic chromosome segregation","1/38","35/5486",0.216542548216375,0.518422061247085,0.518422061247085,"Me1_v2_0086300",1
"GO:1902532","GO:1902532","negative regulation of intracellular signal transduction","1/38","35/5486",0.216542548216375,0.518422061247085,0.518422061247085,"Me1_v2_0080650",1
"GO:0048285","GO:0048285","organelle fission","2/38","127/5486",0.219374303558056,0.521227217413182,0.521227217413182,"Me1_v2_0204870/Me1_v2_0086300",2
"GO:0000413","GO:0000413","protein peptidyl-prolyl isomerization","1/38","36/5486",0.222004185194504,0.521227217413182,0.521227217413182,"Me1_v2_0080850",1
"GO:0036293","GO:0036293","response to decreased oxygen levels","1/38","36/5486",0.222004185194504,0.521227217413182,0.521227217413182,"Me1_v2_0067750",1
"GO:0048232","GO:0048232","male gamete generation","1/38","36/5486",0.222004185194504,0.521227217413182,0.521227217413182,"Me1_v2_0086300",1
"GO:0009451","GO:0009451","RNA modification","2/38","130/5486",0.227071959232824,0.523840612228801,0.523840612228801,"Me1_v2_0198740/Me1_v2_0183560",2
"GO:0044550","GO:0044550","secondary metabolite biosynthetic process","1/38","37/5486",0.227428743169294,0.523840612228801,0.523840612228801,"Me1_v2_0103080",1
"GO:0060341","GO:0060341","regulation of cellular localization","1/38","37/5486",0.227428743169294,0.523840612228801,0.523840612228801,"Me1_v2_0067750",1
"GO:0070482","GO:0070482","response to oxygen levels","1/38","37/5486",0.227428743169294,0.523840612228801,0.523840612228801,"Me1_v2_0067750",1
"GO:0010224","GO:0010224","response to UV-B","1/38","38/5486",0.232816467111222,0.528732724374085,0.528732724374084,"Me1_v2_0171870",1
"GO:0030003","GO:0030003","cellular cation homeostasis","1/38","38/5486",0.232816467111222,0.528732724374085,0.528732724374084,"Me1_v2_0067750",1
"GO:0032940","GO:0032940","secretion by cell","1/38","38/5486",0.232816467111222,0.528732724374085,0.528732724374084,"Me1_v2_0206630",1
"GO:0009555","GO:0009555","pollen development","2/38","134/5486",0.237369991679499,0.530960797259875,0.530960797259875,"Me1_v2_0210270/Me1_v2_0086300",2
"GO:0010256","GO:0010256","endomembrane system organization","1/38","39/5486",0.238167600416981,0.530960797259875,0.530960797259875,"Me1_v2_0220520",1
"GO:0022412","GO:0022412","cellular process involved in reproduction in multicellular organism","1/38","39/5486",0.238167600416981,0.530960797259875,0.530960797259875,"Me1_v2_0086300",1
"GO:0046903","GO:0046903","secretion","1/38","39/5486",0.238167600416981,0.530960797259875,0.530960797259875,"Me1_v2_0206630",1
"GO:0044272","GO:0044272","sulfur compound biosynthetic process","1/38","40/5486",0.243482384919304,0.539722658909872,0.539722658909872,"Me1_v2_0162180",1
"GO:0006873","GO:0006873","cellular ion homeostasis","1/38","41/5486",0.248761060896731,0.539722658909872,0.539722658909872,"Me1_v2_0067750",1
"GO:0009637","GO:0009637","response to blue light","1/38","41/5486",0.248761060896731,0.539722658909872,0.539722658909872,"Me1_v2_0171870",1
"GO:0009932","GO:0009932","cell tip growth","1/38","41/5486",0.248761060896731,0.539722658909872,0.539722658909872,"Me1_v2_0206630",1
"GO:0016999","GO:0016999","antibiotic metabolic process","1/38","41/5486",0.248761060896731,0.539722658909872,0.539722658909872,"Me1_v2_0034480",1
"GO:0048527","GO:0048527","lateral root development","1/38","41/5486",0.248761060896731,0.539722658909872,0.539722658909872,"Me1_v2_0229220",1
"GO:0031327","GO:0031327","negative regulation of cellular biosynthetic process","2/38","139/5486",0.250284523741276,0.540614571281157,0.540614571281157,"Me1_v2_0034480/Me1_v2_0229220",2
"GO:0009657","GO:0009657","plastid organization","2/38","142/5486",0.258048799460604,0.550116007727633,0.550116007727633,"Me1_v2_0204870/Me1_v2_0183560",2
"GO:0009890","GO:0009890","negative regulation of biosynthetic process","2/38","142/5486",0.258048799460604,0.550116007727633,0.550116007727633,"Me1_v2_0034480/Me1_v2_0229220",2
"GO:0048513","GO:0048513","animal organ development","1/38","43/5486",0.259211040678247,0.550116007727633,0.550116007727633,"Me1_v2_0067750",1
"GO:1905393","GO:1905393","plant organ formation","1/38","43/5486",0.259211040678247,0.550116007727633,0.550116007727633,"Me1_v2_0229220",1
"GO:0046467","GO:0046467","membrane lipid biosynthetic process","1/38","44/5486",0.264382817355489,0.556233979371288,0.556233979371288,"Me1_v2_0162180",1
"GO:0090697","GO:0090697","post-embryonic plant organ morphogenesis","1/38","44/5486",0.264382817355489,0.556233979371288,0.556233979371288,"Me1_v2_0229220",1
"GO:0042742","GO:0042742","defense response to bacterium","2/38","145/5486",0.26582025985065,0.55653510093391,0.55653510093391,"Me1_v2_0204900/Me1_v2_0034480",2
"GO:0071241","GO:0071241","cellular response to inorganic substance","1/38","45/5486",0.269519431273256,0.55653510093391,0.55653510093391,"Me1_v2_0080650",1
"GO:0065008","GO:0065008","regulation of biological quality","4/38","383/5486",0.272319633588017,0.55653510093391,0.55653510093391,"Me1_v2_0211740/Me1_v2_0034480/Me1_v2_0067750/Me1_v2_0229220",4
"GO:0007276","GO:0007276","gamete generation","1/38","46/5486",0.274621115083515,0.55653510093391,0.55653510093391,"Me1_v2_0086300",1
"GO:0022603","GO:0022603","regulation of anatomical structure morphogenesis","1/38","46/5486",0.274621115083515,0.55653510093391,0.55653510093391,"Me1_v2_0219850",1
"GO:0048638","GO:0048638","regulation of developmental growth","1/38","46/5486",0.274621115083515,0.55653510093391,0.55653510093391,"Me1_v2_0219850",1
"GO:1901419","GO:1901419","regulation of response to alcohol","1/38","46/5486",0.274621115083515,0.55653510093391,0.55653510093391,"Me1_v2_0080650",1
"GO:1905957","GO:1905957","regulation of cellular response to alcohol","1/38","46/5486",0.274621115083515,0.55653510093391,0.55653510093391,"Me1_v2_0080650",1
"GO:0009755","GO:0009755","hormone-mediated signaling pathway","2/38","149/5486",0.276187342914563,0.55653510093391,0.55653510093391,"Me1_v2_0080650/Me1_v2_0219850",2
"GO:0071310","GO:0071310","cellular response to organic substance","3/38","265/5486",0.277552539341712,0.55653510093391,0.55653510093391,"Me1_v2_0080650/Me1_v2_0067750/Me1_v2_0219850",3
"GO:0001558","GO:0001558","regulation of cell growth","1/38","47/5486",0.279688099941387,0.55653510093391,0.55653510093391,"Me1_v2_0219850",1
"GO:0009787","GO:0009787","regulation of abscisic acid-activated signaling pathway","1/38","47/5486",0.279688099941387,0.55653510093391,0.55653510093391,"Me1_v2_0080650",1
"GO:0016071","GO:0016071","mRNA metabolic process","2/38","151/5486",0.281370844998239,0.55653510093391,0.55653510093391,"Me1_v2_0198740/Me1_v2_0183560",2
"GO:0007399","GO:0007399","nervous system development","1/38","48/5486",0.284720615514512,0.55653510093391,0.55653510093391,"Me1_v2_0067750",1
"GO:0048528","GO:0048528","post-embryonic root development","1/38","48/5486",0.284720615514512,0.55653510093391,0.55653510093391,"Me1_v2_0229220",1
"GO:0006366","GO:0006366","transcription by RNA polymerase II","1/38","49/5486",0.289718889992344,0.55653510093391,0.55653510093391,"Me1_v2_0034480",1
"GO:0006643","GO:0006643","membrane lipid metabolic process","1/38","49/5486",0.289718889992344,0.55653510093391,0.55653510093391,"Me1_v2_0162180",1
"GO:0045017","GO:0045017","glycerolipid biosynthetic process","1/38","49/5486",0.289718889992344,0.55653510093391,0.55653510093391,"Me1_v2_0235080",1
"GO:0051093","GO:0051093","negative regulation of developmental process","1/38","49/5486",0.289718889992344,0.55653510093391,0.55653510093391,"Me1_v2_0204900",1
"GO:0051241","GO:0051241","negative regulation of multicellular organismal process","1/38","49/5486",0.289718889992344,0.55653510093391,0.55653510093391,"Me1_v2_0204900",1
"GO:0055082","GO:0055082","cellular chemical homeostasis","1/38","49/5486",0.289718889992344,0.55653510093391,0.55653510093391,"Me1_v2_0067750",1
"GO:0097237","GO:0097237","cellular response to toxic substance","1/38","49/5486",0.289718889992344,0.55653510093391,0.55653510093391,"Me1_v2_0080650",1
"GO:0009409","GO:0009409","response to cold","2/38","155/5486",0.29173299975482,0.558197786932452,0.558197786932452,"Me1_v2_0204900/Me1_v2_0171870",2
"GO:0006400","GO:0006400","tRNA modification","1/38","50/5486",0.294683150095395,0.56163141547593,0.56163141547593,"Me1_v2_0198740",1
"GO:0010119","GO:0010119","regulation of stomatal movement","1/38","51/5486",0.299613621084427,0.566584513023469,0.566584513023469,"Me1_v2_0080650",1
"GO:0042445","GO:0042445","hormone metabolic process","1/38","51/5486",0.299613621084427,0.566584513023469,0.566584513023469,"Me1_v2_0034480",1
"GO:0009611","GO:0009611","response to wounding","1/38","52/5486",0.304510526769577,0.573612852751994,0.573612852751994,"Me1_v2_0235080",1
"GO:0071407","GO:0071407","cellular response to organic cyclic compound","1/38","53/5486",0.30937408951944,0.580524353306749,0.580524353306749,"Me1_v2_0067750",1
"GO:0007005","GO:0007005","mitochondrion organization","1/38","54/5486",0.314204530270086,0.580621299282365,0.580621299282365,"Me1_v2_0144780",1
"GO:0023056","GO:0023056","positive regulation of signaling","1/38","54/5486",0.314204530270086,0.580621299282365,0.580621299282365,"Me1_v2_0067750",1
"GO:0045595","GO:0045595","regulation of cell differentiation","1/38","54/5486",0.314204530270086,0.580621299282365,0.580621299282365,"Me1_v2_0219850",1
"GO:0048868","GO:0048868","pollen tube development","1/38","54/5486",0.314204530270086,0.580621299282365,0.580621299282365,"Me1_v2_0206630",1
"GO:0006650","GO:0006650","glycerophospholipid metabolic process","1/38","55/5486",0.319002068534029,0.587253807983099,0.587253807983099,"Me1_v2_0235080",1
"GO:0019748","GO:0019748","secondary metabolic process","1/38","56/5486",0.323766922409137,0.593776318078643,0.593776318078643,"Me1_v2_0103080",1
"GO:0010647","GO:0010647","positive regulation of cell communication","1/38","57/5486",0.328499308587488,0.595711432737013,0.595711432737013,"Me1_v2_0067750",1
"GO:0051640","GO:0051640","organelle localization","1/38","57/5486",0.328499308587488,0.595711432737013,0.595711432737013,"Me1_v2_0206630",1
"GO:0090698","GO:0090698","post-embryonic plant morphogenesis","1/38","57/5486",0.328499308587488,0.595711432737013,0.595711432737013,"Me1_v2_0229220",1
"GO:0018105","GO:0018105","peptidyl-serine phosphorylation","1/38","58/5486",0.333199442364183,0.601988583602205,0.601988583602205,"Me1_v2_0219850",1
"GO:0046686","GO:0046686","response to cadmium ion","2/38","172/5486",0.335550798667621,0.603689791529401,0.603689791529401,"Me1_v2_0210270/Me1_v2_0204900",2
"GO:0018209","GO:0018209","peptidyl-serine modification","1/38","59/5486",0.337867537646085,0.603689791529401,0.603689791529401,"Me1_v2_0219850",1
"GO:0098813","GO:0098813","nuclear chromosome segregation","1/38","59/5486",0.337867537646085,0.603689791529401,0.603689791529401,"Me1_v2_0086300",1
"GO:0032870","GO:0032870","cellular response to hormone stimulus","2/38","174/5486",0.340667691422542,0.606463362752217,0.606463362752217,"Me1_v2_0080650/Me1_v2_0219850",2
"GO:0071482","GO:0071482","cellular response to light stimulus","1/38","60/5486",0.342503806960522,0.60750675249202,0.60750675249202,"Me1_v2_0171870",1
"GO:0006979","GO:0006979","response to oxidative stress","2/38","176/5486",0.345773989193284,0.609006181485453,0.609006181485453,"Me1_v2_0080650/Me1_v2_0067750",2
"GO:0055065","GO:0055065","metal ion homeostasis","1/38","61/5486",0.347108461463931,0.609006181485453,0.609006181485453,"Me1_v2_0067750",1
"GO:1901617","GO:1901617","organic hydroxy compound biosynthetic process","1/38","61/5486",0.347108461463931,0.609006181485453,0.609006181485453,"Me1_v2_0034480",1
"GO:0035556","GO:0035556","intracellular signal transduction","2/38","180/5486",0.355952124783623,0.61610231044905,0.61610231044905,"Me1_v2_0067750/Me1_v2_0219850",2
"GO:0008654","GO:0008654","phospholipid biosynthetic process","1/38","63/5486",0.356223763860459,0.61610231044905,0.61610231044905,"Me1_v2_0235080",1
"GO:0009639","GO:0009639","response to red or far red light","1/38","63/5486",0.356223763860459,0.61610231044905,0.61610231044905,"Me1_v2_0171870",1
"GO:0051094","GO:0051094","positive regulation of developmental process","1/38","63/5486",0.356223763860459,0.61610231044905,0.61610231044905,"Me1_v2_0171870",1
"GO:0051240","GO:0051240","positive regulation of multicellular organismal process","1/38","64/5486",0.36073482728906,0.621691936391784,0.621691936391784,"Me1_v2_0171870",1
"GO:0000226","GO:0000226","microtubule cytoskeleton organization","1/38","65/5486",0.365215106994522,0.62410413647643,0.62410413647643,"Me1_v2_0086300",1
"GO:0009267","GO:0009267","cellular response to starvation","1/38","65/5486",0.365215106994522,0.62410413647643,0.62410413647643,"Me1_v2_0162180",1
"GO:0007059","GO:0007059","chromosome segregation","1/38","66/5486",0.369664807406661,0.62410413647643,0.62410413647643,"Me1_v2_0086300",1
"GO:0019953","GO:0019953","sexual reproduction","1/38","66/5486",0.369664807406661,0.62410413647643,0.62410413647643,"Me1_v2_0086300",1
"GO:0140013","GO:0140013","meiotic nuclear division","1/38","66/5486",0.369664807406661,0.62410413647643,0.62410413647643,"Me1_v2_0086300",1
"GO:0003006","GO:0003006","developmental process involved in reproduction","4/38","444/5486",0.370263307297993,0.62410413647643,0.62410413647643,"Me1_v2_0206630/Me1_v2_0086300/Me1_v2_0200700/Me1_v2_0200690",4
"GO:0048229","GO:0048229","gametophyte development","2/38","186/5486",0.371123653172198,0.62410413647643,0.62410413647643,"Me1_v2_0210270/Me1_v2_0086300",2
"GO:0090696","GO:0090696","post-embryonic plant organ development","1/38","67/5486",0.374084131635176,0.626913406809294,0.626913406809294,"Me1_v2_0229220",1
"GO:0048588","GO:0048588","developmental cell growth","1/38","68/5486",0.378473281477926,0.628087782124553,0.628087782124553,"Me1_v2_0206630",1
"GO:1902531","GO:1902531","regulation of intracellular signal transduction","1/38","68/5486",0.378473281477926,0.628087782124553,0.628087782124553,"Me1_v2_0080650",1
"GO:0023051","GO:0023051","regulation of signaling","2/38","189/5486",0.378661975642992,0.628087782124553,0.628087782124553,"Me1_v2_0080650/Me1_v2_0067750",2
"GO:0010646","GO:0010646","regulation of cell communication","2/38","190/5486",0.381167247657557,0.628569507806001,0.628569507806001,"Me1_v2_0080650/Me1_v2_0067750",2
"GO:0009553","GO:0009553","embryo sac development","1/38","69/5486",0.38283245742917,0.628569507806001,0.628569507806001,"Me1_v2_0210270",1
"GO:0009743","GO:0009743","response to carbohydrate","1/38","69/5486",0.38283245742917,0.628569507806001,0.628569507806001,"Me1_v2_0067750",1
"GO:0055080","GO:0055080","cation homeostasis","1/38","70/5486",0.387161858687743,0.631411621886721,0.631411621886721,"Me1_v2_0067750",1
"GO:0071478","GO:0071478","cellular response to radiation","1/38","70/5486",0.387161858687743,0.631411621886721,0.631411621886721,"Me1_v2_0171870",1
"GO:0008033","GO:0008033","tRNA processing","1/38","71/5486",0.391461683165192,0.632061056539147,0.632061056539147,"Me1_v2_0198740",1
"GO:0009733","GO:0009733","response to auxin","1/38","71/5486",0.391461683165192,0.632061056539147,0.632061056539147,"Me1_v2_0229220",1
"GO:0070085","GO:0070085","glycosylation","1/38","71/5486",0.391461683165192,0.632061056539147,0.632061056539147,"Me1_v2_0162180",1
"GO:0022622","GO:0022622","root system development","2/38","197/5486",0.398592297788562,0.639073828825038,0.639073828825038,"Me1_v2_0080650/Me1_v2_0229220",2
"GO:0031669","GO:0031669","cellular response to nutrient levels","1/38","73/5486",0.399973387034906,0.639073828825038,0.639073828825038,"Me1_v2_0162180",1
"GO:0008610","GO:0008610","lipid biosynthetic process","2/38","198/5486",0.40106485142312,0.639073828825038,0.639073828825038,"Me1_v2_0162180/Me1_v2_0235080",2
"GO:0048364","GO:0048364","root development","2/38","198/5486",0.40106485142312,0.639073828825038,0.639073828825038,"Me1_v2_0080650/Me1_v2_0229220",2
"GO:0033554","GO:0033554","cellular response to stress","4/38","464/5486",0.402713372449052,0.639603591536729,0.639603591536729,"Me1_v2_0080650/Me1_v2_0067750/Me1_v2_0162180/Me1_v2_0171870",4
"GO:0009826","GO:0009826","unidimensional cell growth","1/38","74/5486",0.404185655886314,0.639850908015468,0.639850908015468,"Me1_v2_0206630",1
"GO:0051172","GO:0051172","negative regulation of nitrogen compound metabolic process","2/38","200/5486",0.405996798681268,0.640217405383653,0.640217405383653,"Me1_v2_0034480/Me1_v2_0229220",2
"GO:0019725","GO:0019725","cellular homeostasis","1/38","75/5486",0.408369126890808,0.640217405383653,0.640217405383653,"Me1_v2_0067750",1
"GO:0044703","GO:0044703","multi-organism reproductive process","1/38","75/5486",0.408369126890808,0.640217405383653,0.640217405383653,"Me1_v2_0086300",1
"GO:0042594","GO:0042594","response to starvation","1/38","77/5486",0.416650440500962,0.646939661608522,0.646939661608522,"Me1_v2_0162180",1
"GO:0071103","GO:0071103","DNA conformation change","1/38","77/5486",0.416650440500962,0.646939661608522,0.646939661608522,"Me1_v2_0086300",1
"GO:0098771","GO:0098771","inorganic ion homeostasis","1/38","77/5486",0.416650440500962,0.646939661608522,0.646939661608522,"Me1_v2_0067750",1
"GO:0009411","GO:0009411","response to UV","1/38","78/5486",0.420748662586553,0.64925144358209,0.64925144358209,"Me1_v2_0171870",1
"GO:0051641","GO:0051641","cellular localization","3/38","341/5486",0.423640564873741,0.64925144358209,0.64925144358209,"Me1_v2_0206630/Me1_v2_0067750/Me1_v2_0067240",3
"GO:0000904","GO:0000904","cell morphogenesis involved in differentiation","1/38","79/5486",0.424818845800627,0.64925144358209,0.64925144358209,"Me1_v2_0206630",1
"GO:0009738","GO:0009738","abscisic acid-activated signaling pathway","1/38","79/5486",0.424818845800627,0.64925144358209,0.64925144358209,"Me1_v2_0219850",1
"GO:0097659","GO:0097659","nucleic acid-templated transcription","1/38","79/5486",0.424818845800627,0.64925144358209,0.64925144358209,"Me1_v2_0034480",1
"GO:0009719","GO:0009719","response to endogenous stimulus","4/38","480/5486",0.428540854861754,0.652886694240792,0.652886694240792,"Me1_v2_0080650/Me1_v2_0067750/Me1_v2_0229220/Me1_v2_0219850",4
"GO:0009968","GO:0009968","negative regulation of signal transduction","1/38","81/5486",0.432875841140828,0.657430183732632,0.657430183732632,"Me1_v2_0080650",1
"GO:0046486","GO:0046486","glycerolipid metabolic process","1/38","82/5486",0.436863023016248,0.659364686912722,0.659364686912722,"Me1_v2_0235080",1
"GO:1903046","GO:1903046","meiotic cell cycle process","1/38","82/5486",0.436863023016248,0.659364686912722,0.659364686912722,"Me1_v2_0086300",1
"GO:0031324","GO:0031324","negative regulation of cellular metabolic process","2/38","214/5486",0.439994350502625,0.660464615678235,0.660464615678235,"Me1_v2_0034480/Me1_v2_0229220",2
"GO:0009856","GO:0009856","pollination","1/38","84/5486",0.444755670588444,0.660464615678235,0.660464615678235,"Me1_v2_0206630",1
"GO:0030001","GO:0030001","metal ion transport","1/38","84/5486",0.444755670588444,0.660464615678235,0.660464615678235,"Me1_v2_0067750",1
"GO:0006886","GO:0006886","intracellular protein transport","2/38","216/5486",0.444771145322589,0.660464615678235,0.660464615678235,"Me1_v2_0206630/Me1_v2_0067240",2
"GO:0044706","GO:0044706","multi-multicellular organism process","1/38","85/5486",0.448661498896041,0.660464615678235,0.660464615678235,"Me1_v2_0206630",1
"GO:0006605","GO:0006605","protein targeting","1/38","86/5486",0.452540570001753,0.660464615678235,0.660464615678235,"Me1_v2_0067240",1
"GO:0007017","GO:0007017","microtubule-based process","1/38","86/5486",0.452540570001753,0.660464615678235,0.660464615678235,"Me1_v2_0086300",1
"GO:0010648","GO:0010648","negative regulation of cell communication","1/38","86/5486",0.452540570001753,0.660464615678235,0.660464615678235,"Me1_v2_0080650",1
"GO:0023057","GO:0023057","negative regulation of signaling","1/38","86/5486",0.452540570001753,0.660464615678235,0.660464615678235,"Me1_v2_0080650",1
"GO:0031668","GO:0031668","cellular response to extracellular stimulus","1/38","86/5486",0.452540570001753,0.660464615678235,0.660464615678235,"Me1_v2_0162180",1
"GO:0050801","GO:0050801","ion homeostasis","1/38","86/5486",0.452540570001753,0.660464615678235,0.660464615678235,"Me1_v2_0067750",1
"GO:0070887","GO:0070887","cellular response to chemical stimulus","3/38","358/5486",0.455521713974516,0.661329157827384,0.661329157827384,"Me1_v2_0080650/Me1_v2_0067750/Me1_v2_0219850",3
"GO:0051321","GO:0051321","meiotic cell cycle","1/38","87/5486",0.456393062286926,0.661329157827384,0.661329157827384,"Me1_v2_0086300",1
"GO:0032774","GO:0032774","RNA biosynthetic process","1/38","88/5486",0.460219152976516,0.661329157827384,0.661329157827384,"Me1_v2_0034480",1
"GO:0051049","GO:0051049","regulation of transport","1/38","88/5486",0.460219152976516,0.661329157827384,0.661329157827384,"Me1_v2_0067750",1
"GO:0072330","GO:0072330","monocarboxylic acid biosynthetic process","1/38","88/5486",0.460219152976516,0.661329157827384,0.661329157827384,"Me1_v2_0034480",1
"GO:0040008","GO:0040008","regulation of growth","1/38","89/5486",0.464019018146374,0.661329157827384,0.661329157827384,"Me1_v2_0219850",1
"GO:0061024","GO:0061024","membrane organization","1/38","89/5486",0.464019018146374,0.661329157827384,0.661329157827384,"Me1_v2_0206630",1
"GO:0071496","GO:0071496","cellular response to external stimulus","1/38","89/5486",0.464019018146374,0.661329157827384,0.661329157827384,"Me1_v2_0162180",1
"GO:0098662","GO:0098662","inorganic cation transmembrane transport","1/38","90/5486",0.467792832730483,0.663174976612072,0.663174976612072,"Me1_v2_0067750",1
"GO:0046777","GO:0046777","protein autophosphorylation","1/38","91/5486",0.471540770528156,0.663174976612072,0.663174976612072,"Me1_v2_0219850",1
"GO:0006508","GO:0006508","proteolysis","3/38","367/5486",0.4721387009024,0.663174976612072,0.663174976612072,"Me1_v2_0090090/Me1_v2_0090080/Me1_v2_0229220",3
"GO:0006644","GO:0006644","phospholipid metabolic process","1/38","92/5486",0.475263004211183,0.663174976612072,0.663174976612072,"Me1_v2_0235080",1
"GO:0051301","GO:0051301","cell division","1/38","92/5486",0.475263004211183,0.663174976612072,0.663174976612072,"Me1_v2_0204870",1
"GO:0018193","GO:0018193","peptidyl-amino acid modification","2/38","230/5486",0.477599825725651,0.663174976612072,0.663174976612072,"Me1_v2_0080650/Me1_v2_0219850",2
"GO:0071214","GO:0071214","cellular response to abiotic stimulus","1/38","93/5486",0.478959705330941,0.663174976612072,0.663174976612072,"Me1_v2_0171870",1
"GO:0071215","GO:0071215","cellular response to abscisic acid stimulus","1/38","93/5486",0.478959705330941,0.663174976612072,0.663174976612072,"Me1_v2_0219850",1
"GO:0097306","GO:0097306","cellular response to alcohol","1/38","93/5486",0.478959705330941,0.663174976612072,0.663174976612072,"Me1_v2_0219850",1
"GO:0104004","GO:0104004","cellular response to environmental stimulus","1/38","93/5486",0.478959705330941,0.663174976612072,0.663174976612072,"Me1_v2_0171870",1
"GO:1902679","GO:1902679","negative regulation of RNA biosynthetic process","1/38","94/5486",0.482631044325457,0.664472202669043,0.664472202669043,"Me1_v2_0034480",1
"GO:1903507","GO:1903507","negative regulation of nucleic acid-templated transcription","1/38","94/5486",0.482631044325457,0.664472202669043,0.664472202669043,"Me1_v2_0034480",1
"GO:0009266","GO:0009266","response to temperature stimulus","2/38","233/5486",0.484489914481188,0.66514717072841,0.66514717072841,"Me1_v2_0204900/Me1_v2_0171870",2
"GO:0048646","GO:0048646","anatomical structure formation involved in morphogenesis","1/38","97/5486",0.493494576384691,0.67358827060194,0.67358827060194,"Me1_v2_0229220",1
"GO:0098542","GO:0098542","defense response to other organism","2/38","238/5486",0.49585515344694,0.67358827060194,0.67358827060194,"Me1_v2_0204900/Me1_v2_0034480",2
"GO:0009735","GO:0009735","response to cytokinin","1/38","98/5486",0.497066149236311,0.67358827060194,0.67358827060194,"Me1_v2_0080650",1
"GO:0050832","GO:0050832","defense response to fungus","1/38","98/5486",0.497066149236311,0.67358827060194,0.67358827060194,"Me1_v2_0204900",1
"GO:0048523","GO:0048523","negative regulation of cellular process","3/38","381/5486",0.497568290424067,0.67358827060194,0.67358827060194,"Me1_v2_0080650/Me1_v2_0034480/Me1_v2_0229220",3
"GO:0048316","GO:0048316","seed development","2/38","241/5486",0.502602097372631,0.678512831453052,0.678512831453052,"Me1_v2_0200700/Me1_v2_0200690",2
"GO:0000280","GO:0000280","nuclear division","1/38","100/5486",0.504135879669963,0.678698164874244,0.678698164874244,"Me1_v2_0086300",1
"GO:0010038","GO:0010038","response to metal ion","2/38","244/5486",0.509294025479543,0.683748332549884,0.683748332549884,"Me1_v2_0210270/Me1_v2_0204900",2
"GO:0006486","GO:0006486","protein glycosylation","1/38","104/5486",0.517986231629319,0.689291720094817,0.689291720094817,"Me1_v2_0171890",1
"GO:0010154","GO:0010154","fruit development","2/38","248/5486",0.518129899329766,0.689291720094817,0.689291720094817,"Me1_v2_0200700/Me1_v2_0200690",2
"GO:0006399","GO:0006399","tRNA metabolic process","1/38","105/5486",0.521389524679874,0.689291720094817,0.689291720094817,"Me1_v2_0198740",1
"GO:0060560","GO:0060560","developmental growth involved in morphogenesis","1/38","105/5486",0.521389524679874,0.689291720094817,0.689291720094817,"Me1_v2_0206630",1
"GO:1901615","GO:1901615","organic hydroxy compound metabolic process","1/38","105/5486",0.521389524679874,0.689291720094817,0.689291720094817,"Me1_v2_0034480",1
"GO:0043436","GO:0043436","oxoacid metabolic process","3/38","395/5486",0.522429406994705,0.689291720094817,0.689291720094817,"Me1_v2_0211740/Me1_v2_0034480/Me1_v2_0162180",3
"GO:0006082","GO:0006082","organic acid metabolic process","3/38","396/5486",0.524181875854912,0.689291720094817,0.689291720094817,"Me1_v2_0211740/Me1_v2_0034480/Me1_v2_0162180",3
"GO:0051253","GO:0051253","negative regulation of RNA metabolic process","1/38","106/5486",0.524769416533091,0.689291720094817,0.689291720094817,"Me1_v2_0034480",1
"GO:0006790","GO:0006790","sulfur compound metabolic process","1/38","107/5486",0.52812606377691,0.689971147837575,0.689971147837576,"Me1_v2_0162180",1
"GO:0019941","GO:0019941","modification-dependent protein catabolic process","1/38","107/5486",0.52812606377691,0.689971147837575,0.689971147837576,"Me1_v2_0229220",1
"GO:0006351","GO:0006351","transcription, DNA-templated","1/38","108/5486",0.531459621980382,0.69061330556809,0.69061330556809,"Me1_v2_0034480",1
"GO:0007010","GO:0007010","cytoskeleton organization","1/38","108/5486",0.531459621980382,0.69061330556809,0.69061330556809,"Me1_v2_0086300",1
"GO:0001101","GO:0001101","response to acid chemical","3/38","401/5486",0.532895611262629,0.690632712196367,0.690632712196367,"Me1_v2_0200700/Me1_v2_0219850/Me1_v2_0200690",3
"GO:0010015","GO:0010015","root morphogenesis","1/38","109/5486",0.534770245700119,0.691218987793239,0.691218987793239,"Me1_v2_0229220",1
"GO:0006511","GO:0006511","ubiquitin-dependent protein catabolic process","1/38","110/5486",0.538058088486691,0.691788970911459,0.691788970911459,"Me1_v2_0229220",1
"GO:0032879","GO:0032879","regulation of localization","1/38","110/5486",0.538058088486691,0.691788970911459,0.691788970911459,"Me1_v2_0067750",1
"GO:0014070","GO:0014070","response to organic cyclic compound","1/38","112/5486",0.54456604047055,0.698308959547988,0.698308959547987,"Me1_v2_0067750",1
"GO:0000902","GO:0000902","cell morphogenesis","1/38","116/5486",0.557315219275624,0.707474380565589,0.707474380565589,"Me1_v2_0206630",1
"GO:0071396","GO:0071396","cellular response to lipid","1/38","116/5486",0.557315219275624,0.707474380565589,0.707474380565589,"Me1_v2_0219850",1
"GO:0098660","GO:0098660","inorganic ion transmembrane transport","1/38","116/5486",0.557315219275624,0.707474380565589,0.707474380565589,"Me1_v2_0067750",1
"GO:0055085","GO:0055085","transmembrane transport","3/38","416/5486",0.558532337579719,0.707474380565589,0.707474380565589,"Me1_v2_0067750/Me1_v2_0171870/Me1_v2_0134630",3
"GO:0043632","GO:0043632","modification-dependent macromolecule catabolic process","1/38","117/5486",0.560447811764921,0.707474380565589,0.707474380565589,"Me1_v2_0229220",1
"GO:2000241","GO:2000241","regulation of reproductive process","1/38","117/5486",0.560447811764921,0.707474380565589,0.707474380565589,"Me1_v2_0219850",1
"GO:0033993","GO:0033993","response to lipid","2/38","269/5486",0.562844863176174,0.707725025075108,0.707725025075108,"Me1_v2_0067750/Me1_v2_0219850",2
"GO:0048878","GO:0048878","chemical homeostasis","1/38","118/5486",0.563558816263512,0.707725025075108,0.707725025075108,"Me1_v2_0067750",1
"GO:0072594","GO:0072594","establishment of protein localization to organelle","1/38","121/5486",0.572763744879112,0.715687621969581,0.715687621969581,"Me1_v2_0067240",1
"GO:0006952","GO:0006952","defense response","2/38","274/5486",0.57306705628938,0.715687621969581,0.715687621969581,"Me1_v2_0204900/Me1_v2_0034480",2
"GO:0051649","GO:0051649","establishment of localization in cell","2/38","275/5486",0.575091606764724,0.715687621969581,0.715687621969581,"Me1_v2_0067750/Me1_v2_0067240",2
"GO:0098655","GO:0098655","cation transmembrane transport","1/38","122/5486",0.575789835782112,0.715687621969581,0.715687621969581,"Me1_v2_0067750",1
"GO:0045893","GO:0045893","positive regulation of transcription, DNA-templated","1/38","123/5486",0.578795053202,0.717587744531051,0.717587744531051,"Me1_v2_0152660",1
"GO:0044255","GO:0044255","cellular lipid metabolic process","2/38","278/5486",0.581125336571642,0.718643545989359,0.718643545989359,"Me1_v2_0162180/Me1_v2_0235080",2
"GO:2000113","GO:2000113","negative regulation of cellular macromolecule biosynthetic process","1/38","129/5486",0.596395797408153,0.735655729797873,0.735655729797873,"Me1_v2_0034480",1
"GO:0016049","GO:0016049","cell growth","1/38","131/5486",0.602101970550961,0.737082009289086,0.737082009289086,"Me1_v2_0206630",1
"GO:1902680","GO:1902680","positive regulation of RNA biosynthetic process","1/38","131/5486",0.602101970550961,0.737082009289086,0.737082009289086,"Me1_v2_0152660",1
"GO:1903508","GO:1903508","positive regulation of nucleic acid-templated transcription","1/38","131/5486",0.602101970550961,0.737082009289086,0.737082009289086,"Me1_v2_0152660",1
"GO:0048589","GO:0048589","developmental growth","1/38","132/5486",0.60492552332763,0.738677900344795,0.738677900344794,"Me1_v2_0206630",1
"GO:0010558","GO:0010558","negative regulation of macromolecule biosynthetic process","1/38","133/5486",0.607729563318954,0.740242024493764,0.740242024493764,"Me1_v2_0034480",1
"GO:0045934","GO:0045934","negative regulation of nucleobase-containing compound metabolic process","1/38","134/5486",0.610514221752334,0.741774779429085,0.741774779429085,"Me1_v2_0034480",1
"GO:0006357","GO:0006357","regulation of transcription by RNA polymerase II","1/38","135/5486",0.613279628996992,0.743276557836753,0.743276557836753,"Me1_v2_0034480",1
"GO:0051603","GO:0051603","proteolysis involved in cellular protein catabolic process","1/38","138/5486",0.62146163453251,0.751319289509452,0.751319289509452,"Me1_v2_0229220",1
"GO:0048585","GO:0048585","negative regulation of response to stimulus","1/38","140/5486",0.626822400924205,0.755919818484277,0.755919818484277,"Me1_v2_0080650",1
"GO:1905392","GO:1905392","plant organ morphogenesis","1/38","141/5486",0.629474991415204,0.757239717395517,0.757239717395517,"Me1_v2_0229220",1
"GO:0044257","GO:0044257","cellular protein catabolic process","1/38","143/5486",0.634725209556725,0.760860402084262,0.760860402084262,"Me1_v2_0229220",1
"GO:0032989","GO:0032989","cellular component morphogenesis","1/38","144/5486",0.637323083791582,0.760860402084262,0.760860402084262,"Me1_v2_0206630",1
"GO:0033365","GO:0033365","protein localization to organelle","1/38","144/5486",0.637323083791582,0.760860402084262,0.760860402084262,"Me1_v2_0067240",1
"GO:0009725","GO:0009725","response to hormone","3/38","468/5486",0.640980603868642,0.760860402084262,0.760860402084262,"Me1_v2_0080650/Me1_v2_0229220/Me1_v2_0219850",3
"GO:0009791","GO:0009791","post-embryonic development","3/38","468/5486",0.640980603868642,0.760860402084262,0.760860402084262,"Me1_v2_0229220/Me1_v2_0200700/Me1_v2_0200690",3
"GO:0071229","GO:0071229","cellular response to acid chemical","1/38","146/5486",0.642464973004031,0.760860402084262,0.760860402084262,"Me1_v2_0219850",1
"GO:0009892","GO:0009892","negative regulation of metabolic process","2/38","311/5486",0.643514444242721,0.760860402084262,0.760860402084262,"Me1_v2_0034480/Me1_v2_0229220",2
"GO:0051254","GO:0051254","positive regulation of RNA metabolic process","1/38","147/5486",0.645009229750444,0.760860402084262,0.760860402084262,"Me1_v2_0152660",1
"GO:0006812","GO:0006812","cation transport","1/38","149/5486",0.650044966014156,0.763096264451401,0.763096264451401,"Me1_v2_0067750",1
"GO:0032446","GO:0032446","protein modification by small protein conjugation","1/38","149/5486",0.650044966014156,0.763096264451401,0.763096264451401,"Me1_v2_0229220",1
"GO:0016567","GO:0016567","protein ubiquitination","1/38","151/5486",0.655011121493355,0.767073265170531,0.767073265170531,"Me1_v2_0229220",1
"GO:0010557","GO:0010557","positive regulation of macromolecule biosynthetic process","1/38","153/5486",0.659908631978912,0.770950949859979,0.770950949859979,"Me1_v2_0152660",1
"GO:0099402","GO:0099402","plant organ development","2/38","322/5486",0.662688447988219,0.772341932187708,0.772341932187708,"Me1_v2_0080650/Me1_v2_0229220",2
"GO:0010628","GO:0010628","positive regulation of gene expression","1/38","156/5486",0.667128205302128,0.775656238700561,0.775656238700561,"Me1_v2_0152660",1
"GO:0019438","GO:0019438","aromatic compound biosynthetic process","2/38","327/5486",0.671138205887356,0.776446577706152,0.776446577706152,"Me1_v2_0034480/Me1_v2_0103080",2
"GO:0090407","GO:0090407","organophosphate biosynthetic process","1/38","158/5486",0.67185811744333,0.776446577706152,0.776446577706152,"Me1_v2_0235080",1
"GO:0009653","GO:0009653","anatomical structure morphogenesis","2/38","328/5486",0.672808347671583,0.776446577706152,0.776446577706152,"Me1_v2_0206630/Me1_v2_0229220",2
"GO:0048468","GO:0048468","cell development","1/38","159/5486",0.674198468707811,0.776446577706152,0.776446577706152,"Me1_v2_0206630",1
"GO:0031328","GO:0031328","positive regulation of cellular biosynthetic process","1/38","161/5486",0.678830514641535,0.779932931715806,0.779932931715806,"Me1_v2_0152660",1
"GO:0006629","GO:0006629","lipid metabolic process","2/38","334/5486",0.682691214000697,0.782518702840421,0.782518702840421,"Me1_v2_0162180/Me1_v2_0235080",2
"GO:0032787","GO:0032787","monocarboxylic acid metabolic process","1/38","164/5486",0.685658579383437,0.784070751953766,0.784070751953766,"Me1_v2_0034480",1
"GO:0070647","GO:0070647","protein modification by small protein conjugation or removal","1/38","166/5486",0.690131876571116,0.787333549327611,0.787333549327611,"Me1_v2_0229220",1
"GO:0009891","GO:0009891","positive regulation of biosynthetic process","1/38","168/5486",0.694543167598524,0.790510490521973,0.790510490521973,"Me1_v2_0152660",1
"GO:0042592","GO:0042592","homeostatic process","1/38","170/5486",0.698893289042009,0.793603127276674,0.793603127276674,"Me1_v2_0067750",1
"GO:0040007","GO:0040007","growth","1/38","172/5486",0.703183066500384,0.796612984427009,0.796612984427009,"Me1_v2_0206630",1
"GO:0030163","GO:0030163","protein catabolic process","1/38","173/5486",0.7053055812676,0.797159331386171,0.797159331386171,"Me1_v2_0229220",1
"GO:0045935","GO:0045935","positive regulation of nucleobase-containing compound metabolic process","1/38","177/5486",0.713648825785582,0.804717701465876,0.804717701465877,"Me1_v2_0152660",1
"GO:0009966","GO:0009966","regulation of signal transduction","1/38","178/5486",0.715698429217518,0.805160732869707,0.805160732869707,"Me1_v2_0080650",1
"GO:0016192","GO:0016192","vesicle-mediated transport","1/38","183/5486",0.725734070321181,0.814565261376661,0.814565261376661,"Me1_v2_0206630",1
"GO:0034470","GO:0034470","ncRNA processing","1/38","184/5486",0.72769939284198,0.814889181846088,0.814889181846088,"Me1_v2_0198740",1
"GO:1901362","GO:1901362","organic cyclic compound biosynthetic process","2/38","366/5486",0.731484992952036,0.815486805520659,0.815486805520659,"Me1_v2_0034480/Me1_v2_0103080",2
"GO:1901137","GO:1901137","carbohydrate derivative biosynthetic process","1/38","186/5486",0.731588986022649,0.815486805520659,0.815486805520659,"Me1_v2_0162180",1
"GO:0016053","GO:0016053","organic acid biosynthetic process","1/38","190/5486",0.739206551440908,0.820215488585117,0.820215488585117,"Me1_v2_0034480",1
"GO:0046394","GO:0046394","carboxylic acid biosynthetic process","1/38","190/5486",0.739206551440908,0.820215488585117,0.820215488585117,"Me1_v2_0034480",1
"GO:0048608","GO:0048608","reproductive structure development","2/38","377/5486",0.746781568534248,0.824854187062828,0.824854187062828,"Me1_v2_0200700/Me1_v2_0200690",2
"GO:0061458","GO:0061458","reproductive system development","2/38","377/5486",0.746781568534248,0.824854187062828,0.824854187062828,"Me1_v2_0200700/Me1_v2_0200690",2
"GO:0009651","GO:0009651","response to salt stress","1/38","198/5486",0.753815384330552,0.830735321507139,0.830735321507139,"Me1_v2_0034480",1
"GO:0044265","GO:0044265","cellular macromolecule catabolic process","1/38","199/5486",0.755584487090658,0.830801042366651,0.830801042366651,"Me1_v2_0229220",1
"GO:0010629","GO:0010629","negative regulation of gene expression","1/38","201/5486",0.759085634805578,0.832766633217858,0.832766633217858,"Me1_v2_0034480",1
"GO:0015833","GO:0015833","peptide transport","1/38","205/5486",0.765942040452444,0.838396017251999,0.838396017251999,"Me1_v2_0067240",1
"GO:0042886","GO:0042886","amide transport","1/38","208/5486",0.770959281889988,0.841682295137486,0.841682295137486,"Me1_v2_0067240",1
"GO:0022402","GO:0022402","cell cycle process","1/38","210/5486",0.774245767137399,0.841682295137486,0.841682295137486,"Me1_v2_0086300",1
"GO:0034220","GO:0034220","ion transmembrane transport","1/38","211/5486",0.775871745311921,0.841682295137486,0.841682295137486,"Me1_v2_0067750",1
"GO:0045184","GO:0045184","establishment of protein localization","1/38","211/5486",0.775871745311921,0.841682295137486,0.841682295137486,"Me1_v2_0067240",1
"GO:0048522","GO:0048522","positive regulation of cellular process","2/38","408/5486",0.786056742923775,0.849893663261985,0.849893663261985,"Me1_v2_0152660/Me1_v2_0067750",2
"GO:0007049","GO:0007049","cell cycle","1/38","218/5486",0.78693857709443,0.849893663261985,0.849893663261985,"Me1_v2_0086300",1
"GO:0015031","GO:0015031","protein transport","1/38","223/5486",0.794515795877921,0.853986150246524,0.853986150246525,"Me1_v2_0067240",1
"GO:0009737","GO:0009737","response to abscisic acid","1/38","224/5486",0.795999436340896,0.853986150246524,0.853986150246525,"Me1_v2_0219850",1
"GO:0051128","GO:0051128","regulation of cellular component organization","1/38","224/5486",0.795999436340896,0.853986150246524,0.853986150246525,"Me1_v2_0219850",1
"GO:0097305","GO:0097305","response to alcohol","1/38","226/5486",0.798935491790288,0.855248125572864,0.855248125572864,"Me1_v2_0219850",1
"GO:0034613","GO:0034613","cellular protein localization","1/38","228/5486",0.801830386806427,0.856460588984448,0.856460588984448,"Me1_v2_0067240",1
"GO:0034660","GO:0034660","ncRNA metabolic process","1/38","231/5486",0.806096780073799,0.859129462973391,0.859129462973391,"Me1_v2_0198740",1
"GO:0034654","GO:0034654","nucleobase-containing compound biosynthetic process","1/38","235/5486",0.811646422688293,0.86315133791359,0.86315133791359,"Me1_v2_0034480",1
"GO:0044271","GO:0044271","cellular nitrogen compound biosynthetic process","2/38","436/5486",0.816980274245159,0.866505518956944,0.866505518956944,"Me1_v2_0211740/Me1_v2_0034480",2
"GO:0051173","GO:0051173","positive regulation of nitrogen compound metabolic process","1/38","240/5486",0.818366323459336,0.866505518956944,0.866505518956944,"Me1_v2_0152660",1
"GO:0070727","GO:0070727","cellular macromolecule localization","1/38","243/5486",0.822285596158682,0.868762608115477,0.868762608115477,"Me1_v2_0067240",1
"GO:0008104","GO:0008104","protein localization","1/38","246/5486",0.826122477852562,0.870364378687695,0.870364378687695,"Me1_v2_0067240",1
"GO:0019637","GO:0019637","organophosphate metabolic process","1/38","247/5486",0.827383421715463,0.870364378687695,0.870364378687695,"Me1_v2_0235080",1
"GO:1901565","GO:1901565","organonitrogen compound catabolic process","1/38","252/5486",0.833555779346916,0.874343538407065,0.874343538407065,"Me1_v2_0229220",1
"GO:0006811","GO:0006811","ion transport","1/38","253/5486",0.834764201277527,0.874343538407065,0.874343538407065,"Me1_v2_0067750",1
"GO:0046907","GO:0046907","intracellular transport","1/38","255/5486",0.83715547143617,0.874962492726835,0.874962492726835,"Me1_v2_0067240",1
"GO:0010604","GO:0010604","positive regulation of macromolecule metabolic process","1/38","261/5486",0.844128875937952,0.880357583059753,0.880357583059753,"Me1_v2_0152660",1
"GO:0009057","GO:0009057","macromolecule catabolic process","1/38","267/5486",0.850811191232431,0.884220351239679,0.884220351239679,"Me1_v2_0229220",1
"GO:0071705","GO:0071705","nitrogen compound transport","1/38","270/5486",0.854046907647858,0.884220351239679,0.884220351239679,"Me1_v2_0067240",1
"GO:1901135","GO:1901135","carbohydrate derivative metabolic process","1/38","270/5486",0.854046907647858,0.884220351239679,0.884220351239679,"Me1_v2_0162180",1
"GO:0031325","GO:0031325","positive regulation of cellular metabolic process","1/38","271/5486",0.855110216219442,0.884220351239679,0.884220351239679,"Me1_v2_0152660",1
"GO:0044283","GO:0044283","small molecule biosynthetic process","1/38","276/5486",0.860314634291596,0.887713189523812,0.887713189523812,"Me1_v2_0034480",1
"GO:0010605","GO:0010605","negative regulation of macromolecule metabolic process","1/38","279/5486",0.863349429255276,0.888957251309458,0.888957251309458,"Me1_v2_0034480",1
"GO:0051276","GO:0051276","chromosome organization","1/38","284/5486",0.86826533018359,0.89212885934297,0.89212885934297,"Me1_v2_0086300",1
"GO:0009893","GO:0009893","positive regulation of metabolic process","1/38","297/5486",0.880254664310002,0.902539592520382,0.902539592520382,"Me1_v2_0152660",1
"GO:0033036","GO:0033036","macromolecule localization","1/38","306/5486",0.887925382235801,0.908487864771787,0.908487864771788,"Me1_v2_0067240",1
"GO:0018130","GO:0018130","heterocycle biosynthetic process","1/38","324/5486",0.901858231420609,0.920804832921042,0.920804832921042,"Me1_v2_0034480",1
"GO:0071702","GO:0071702","organic substance transport","1/38","345/5486",0.915989021684886,0.93000512931644,0.93000512931644,"Me1_v2_0067240",1
"GO:0006396","GO:0006396","RNA processing","1/38","346/5486",0.916609993709001,0.93000512931644,0.93000512931644,"Me1_v2_0198740",1
"GO:0048583","GO:0048583","regulation of response to stimulus","1/38","346/5486",0.916609993709001,0.93000512931644,0.93000512931644,"Me1_v2_0080650",1
"GO:0019752","GO:0019752","carboxylic acid metabolic process","1/38","385/5486",0.937632057997588,0.949352458722557,0.949352458722557,"Me1_v2_0034480",1
"GO:0044248","GO:0044248","cellular catabolic process","1/38","418/5486",0.951307900539517,0.96119675605448,0.96119675605448,"Me1_v2_0229220",1
"GO:0034645","GO:0034645","cellular macromolecule biosynthetic process","1/38","429/5486",0.955180396306757,0.962083425819223,0.962083425819222,"Me1_v2_0034480",1
"GO:1901575","GO:1901575","organic substance catabolic process","1/38","434/5486",0.9568398727671,0.962083425819223,0.962083425819222,"Me1_v2_0229220",1
"GO:1901566","GO:1901566","organonitrogen compound biosynthetic process","1/38","438/5486",0.958124234766468,0.962083425819223,0.962083425819222,"Me1_v2_0235080",1
"GO:0009059","GO:0009059","macromolecule biosynthetic process","1/38","453/5486",0.962617374364277,0.96460215245575,0.96460215245575,"Me1_v2_0034480",1
"GO:0009056","GO:0009056","catabolic process","1/38","479/5486",0.969318375987094,0.969318375987094,0.969318375987094,"Me1_v2_0229220",1
