geneID	cold_0.5h_rep1	cold_0.5h_rep2	cold_0.5h_rep3	cold_1h_rep1	cold_1h_rep2	cold_1h_rep3	cold_2h_rep1	cold_2h_rep2	cold_2h_rep3	cold_4h_rep1	cold_4h_rep2	cold_4h_rep3	cold_6h_rep1	cold_6h_rep2	cold_6h_rep3	cold_24h_rep1	cold_24h_rep2	cold_24h_rep3	control_0h_rep1	control_0h_rep2	control_0h_rep3	control_0h_rep4	control_0h_rep5	control_0h_rep6	control_0.5h_rep1	control_0.5h_rep2	control_0.5h_rep3	control_1h_rep1	control_1h_rep2	control_1h_rep3	control_2h_rep1	control_2h_rep2	control_2h_rep3	control_4h_rep1	control_4h_rep2	control_4h_rep3	control_6h_rep1	control_6h_rep2	control_6h_rep3	control_24h_rep1	control_24h_rep2	control_24h_rep3	heat_0.5h_rep1	heat_0.5h_rep2	heat_0.5h_rep3	heat_1h_rep1	heat_1h_rep2	heat_1h_rep3	heat_2h_rep1	heat_2h_rep2	heat_2h_rep3	heat_4h_rep1	heat_4h_rep2	heat_4h_rep3	heat_6h_rep1	heat_6h_rep2	heat_6h_rep3	heat_24h_rep1	heat_24h_rep2	heat_24h_rep3	high_light_s_0.25_rep1	high_light_s_0.25_rep2	high_light_s_0.25_rep3	high_light_s_0.5_rep1	high_light_s_0.5_rep2	high_light_s_0.5_rep3	high_light_s_2_rep1	high_light_s_2_rep2	high_light_s_2_rep3	high_light_s_4_rep1	high_light_s_4_rep2	high_light_s_4_rep3	high_light_s_6_rep1	high_light_s_6_rep2	high_light_s_6_rep3	high_light_r_0.25h_rep1	high_light_r_0.25h_rep2	high_light_r_0.25h_rep3	high_light_r_0.5h_rep1	high_light_r_0.5h_rep2	high_light_r_0.5h_rep3	high_light_r_1h_rep1	high_light_r_1h_rep2	high_light_r_1h_rep3	high_light_r_2h_rep1	high_light_r_2h_rep2	high_light_r_2h_rep3	high_light_r_4h_rep1	high_light_r_4h_rep2	high_light_r_4h_rep3
Zci_00890	3.0909891182268145	3.0069911404733265	3.0052332815558853	3.109873839293652	2.8563914032036606	2.6626797659210917	3.376675996462564	3.356358715438021	3.677128317773798	3.950053565452418	4.403541481809285	4.561192830051251	4.008486621959107	3.816282640783352	4.791931367476283	3.336386122722719	2.948353211503698	3.8645495051768783	3.0362384610925472	2.079236667516063	2.50875484577052	2.2339964566847	2.713756119003678	2.746303250612831	1.9368253046509083	2.04484070084002	3.4334337276443505	1.9937180118692512	3.0198832204209083	2.800794037411986	3.1125169495951597	3.284844286729945	3.337274082730258	2.20502693172144	2.55600557578959	3.2491395096831996	2.355844668893199	2.7425570014604954	3.149794229106442	2.5872750443569457	1.450729981183754	3.3816543122807134	2.056587686704612	1.7507283590874985	1.1320150370137478	1.8848870464524603	0.8552797617587562	2.7051508944392135	1.2882834284772973	0.3322031814641564	2.1215383578782148	2.6367397578869833	2.7085812084561147	2.036048864723341	2.633071959275233	2.3143953459157096	3.534532853062813	4.2229724641131225	4.812447995141583	4.526412861264083	2.93250384700542	2.347380370230238	2.2615143388886945	2.2909029512242087	1.7206405325776404	2.2119947092948182	2.2492419479238572	2.801567980576693	2.3335885287646017	2.1555586104129407	2.915847364567478	2.3919082739312074	2.9467122064475535	2.261968417267819	2.692692646908696	3.861998063663315	2.3161589871516486	2.1162015885360224	4.125469421617365	2.373430383488358	2.5233128495191246	4.616482926821458	3.3836583829301112	3.106244924112255	5.508594822566531	3.6598049914488806	4.133451553023746	4.1012129260235755	4.193955880347773	3.769057410133196
Zci_01004	3.810622185723393	2.526367233911608	2.8670800987901233	3.143390113929691	2.8798757935513715	3.1077409437342944	3.917156956151152	2.773115801892024	2.8996760133501347	3.452292278010656	2.990807248705416	1.5226982927078905	3.651095487991566	3.596200292508291	3.1654027875599584	3.7816886729169177	3.9917504015180874	3.5450760809677195	3.2559141724879574	2.2216939043620214	3.3019799796828813	2.1455763791039444	2.9949358959409516	2.501694199310719	3.82219511813933	3.321755345703444	3.046166483292683	3.1219735695030773	3.054735808836062	2.8516435221338168	3.5535603933162903	2.366299777394271	2.6321217531873304	3.2407216949484323	2.7864649175247167	3.4205233507656727	3.047443051834715	3.0024037298410917	3.235179792189812	3.506499733764428	3.042792480237438	3.7156628975415846	3.1828577532248628	2.277584119692256	0.8341111993446256	3.764041845549451	3.5307870813624858	3.5366606362074675	3.036418702755446	3.945226463482792	2.073237699691254	3.4984576055320322	3.6579050120201817	2.984148136706992	3.362726007690902	3.4615099148957262	2.3521546616749376	2.389172530380319	4.183621754406606	4.306751577468504	2.3691681063526335	2.215693757618368	3.238277367215081	2.7308542743007984	2.612916334624595	3.126460332789951	3.6950082033463354	3.65099975512096	3.698687746934396	3.911249637603276	3.5660175270160037	3.946546969293452	3.824527396490385	4.078977250377971	3.5333347047383312	3.832278392496042	4.088283898306247	3.714497391363417	4.254065183420879	3.964181039025205	3.995219197574997	4.21477287923639	4.173578938963013	3.743930742978303	3.959694513118888	4.304835456438007	4.145017327068275	3.777355372789829	4.196812929631629	3.815028434780349
Zci_01215	3.2933643133986075	2.9437412873423856	3.332470154087476	2.597137648228362	2.887766167718998	3.36655906155306	2.8017343588980212	2.722710065737574	3.462124486591102	2.2510704005231124	3.508575488924653	2.16421463530125	1.9406312538551271	3.4205323511619805	2.749916831826576	3.1830383289487254	3.9135485184645344	3.6165257164614015	2.567107693623533	1.9091566958690855	2.625588028471624	2.4882094719061048	2.783035440041038	1.906337603416508	2.813467325747336	2.923772944913004	3.416499934390504	2.8865773671900654	2.5892159343452414	2.722972554439454	2.98195944416314	2.6535335483754934	3.842003146270258	2.9289458011100344	3.8584025506776527	3.7831302980105455	2.7490197773855036	3.1592644520754796	2.4572055818072585	3.3615734158318484	2.792178495718768	3.763302805000951	4.095352045983247	4.129389375773431	3.599342424152143	4.564494387159825	4.461074532136782	5.030357362320662	4.690755638920061	4.638700356490882	5.13769114779808	5.30133474813899	5.184600568645993	4.126599358338393	4.70098773840635	5.65520130234738	5.401455828976247	4.024856745650624	5.057315254743039	4.690285512021012	2.1212316488345873	2.9623458729203302	2.6260444471556985	2.8799608288201344	3.300168368798966	2.631077269813661	4.663029750288867	3.756723735159828	4.253651085802684	4.314848898103563	3.3753077627199346	4.386928857880647	4.486047909092941	3.830296945699528	4.438452056648255	3.409752649693579	3.267744151582189	3.950101964976021	3.79183797870596	3.945872515337433	3.746307750350923	4.131579713851247	3.661318527192454	3.6957991032287745	4.17483479305831	3.5954802475378247	2.9579129965134854	3.859036701315694	2.8201227900432286	3.5082372446399117
Zci_01728	2.819356819663921	2.0782737849731845	2.0782737849731845	2.065055256458848	2.347816632822366	2.4814807313121303	3.3530832826248456	3.2711922858168117	2.842754837025518	3.5350501750987693	3.4376594300020096	2.1837889309541634	3.8448465123958826	3.2868645261131633	3.667983025373139	2.2416023448971747	1.8793542376446557	1.8977204971126385	0.39667816108358434	1.2679667875436815	1.7632917572334357	1.2679667875436815	1.854607477860993	1.655153640332497	2.3726072107265943	2.500799619018217	1.2064048378613748	2.5343034149721757	1.269976719140779	2.766685534452728	2.5272042315905954	1.8294139861240113	1.5987951558692814	2.6693102053403313	2.85015898114734	1.779368896576293	2.1723816668983056	2.0990833544971945	1.114674569428762	2.327662363754571	2.3544349465873053	2.033195371656722	1.5498913106688956	1.7050200815988352	1.24951569073637	2.9588252034080456	1.8818297406967668	3.4718862078041455	1.849475957181945	1.8028728092247424	2.555514886841764	3.2518946814993477	2.9937479854519675	2.0245224228749295	3.350040318452677	1.854764516808478	2.5199560070115385	2.147989279585917	1.2899023747732767	3.426853829509798	1.0864957305658791	1.3651080258216086	1.685335996680628	1.639241874696126	1.713215626946824	1.2531185453756428	3.3837292588390464	2.199020162435331	2.015842769736173	2.514862010660893	2.3618920574556093	2.869693522723008	2.841242628306206	3.5014040949395437	3.64263927316975	3.487909005223353	3.969571314015644	3.2921866362710035	3.6799417569279314	2.8651859530817347	3.055186695039128	3.4495716825078135	3.327471517795555	3.226783769801152	4.051423022908465	2.4699421503493366	4.334700400403381	3.45903448798701	3.3186137556742525	3.9328780158125567
Zci_01745	3.002544626257413	0.04129355264973333	2.6290011319861004	2.382489431325041	2.3177963730898146	2.527433485782684	3.5564071111257	3.295399992442443	2.6849000743341196	3.189684995710461	3.1513325909123813	2.5953094406224366	3.433812619827535	2.5878718289224314	3.3355744684699555	3.3860565238927975	1.4819540701372749	1.7498143345884536	2.4322382131788634	1.9307137423758471	2.6107023786604375	1.3827094142704237	2.7616766795980805	2.50875484577052	2.4416376491170713	3.0265373462230754	1.98383860727978	2.2298083574082477	2.956568562964913	2.57466127246595	1.3462141267729262	1.221900610965781	1.90705615314029	3.1925582216677646	2.9508265168576053	1.818720331514173	2.88484665431086	2.831608095947822	3.4526715360604783	2.007840876093196	2.4952731782981465	2.0634866529436633	1.1320150370137478	0.9050558695357424	0.5194478344479391	1.395649796109676	-0.5214749406980246	0.7356212287402927	-0.5638279259060291	-0.48012661589325784	1.4373352701347295	-1.4321949649698926	1.0864287791970204	0.8823260640213585	2.261449731375428	-0.9722472056825348	1.1741784075451738	3.1509191022722516	3.2023440058164554	3.63273652732284	2.6827458370263035	2.4987323418333744	2.349701365221226	2.6190641141816484	2.147684547010301	2.2325916060597604	1.5149887899674432	2.6079653805584835	2.109461126077841	2.751429350765705	2.2313608645080145	2.9556037543271314	2.533223351532088	3.1391808095988276	2.930690605736218	2.9698284315260053	2.6985606353890037	3.407388691349828	3.3649996110463696	2.6546880117968183	3.3655206770638775	3.083240609770294	3.02320417175892	3.370296719308855	3.223593266673592	3.5301843582004113	4.054347731914315	3.2915587911316697	3.28120178360417	4.425170040163889
Zci_02137	2.7246665826000127	1.2728742453747046	2.411509883938416	2.5605683082607498	2.2743096935597675	2.814375857479658	2.152015139495916	2.420350576064097	2.5847341552581184	2.659203858447576	2.382324506069237	2.435191097264477	3.075627216246171	3.5314637519271255	2.518264020811023	3.3454581418691403	3.6148955996575793	3.1488237960171928	1.8367687658263243	1.4897970050005944	2.495649616706899	2.4401734169402123	2.4837691370842725	2.754033409265766	2.367971839642423	1.9155566418091348	3.316680969047988	1.959330343667968	2.2134842708907834	2.9295258193679015	3.0147542832130783	2.629577390880405	2.537858066822697	2.0237178911653793	2.9706457814875407	2.5776679738789454	1.869435118491308	2.182281072007029	2.473541177543199	2.924333945536952	2.6021765754816046	1.8510739068689093	2.519682803246803	2.4157366576269417	0.891502630364877	2.9189318580306023	3.763465275010056	2.7722293024983844	1.8639577834208376	3.3664060392120647	2.526968194895564	3.276419804814003	3.4162450268719056	2.0568247679669027	2.9866840680023694	3.201879922291453	3.2188725257250064	3.854751156902736	2.0686076280467995	2.9399011981569907	1.6118864455103594	2.3966519007999048	1.7599739627428177	1.0136435166373674	1.7360025325511093	1.888055052648545	2.7248986971479945	3.0418537082201103	2.336774062716265	2.921022925110872	2.3084862252010803	2.3403019410623926	2.4619776985612836	3.1763755870762984	2.857528488340754	2.8770456723800706	2.862624656769823	2.0768342819660117	3.013145456468818	2.9783458965345915	2.5063528610816967	2.9530687370067663	2.694106450273199	2.913949565052894	3.0471294839856435	2.8855504085335055	3.1279539630072115	3.4284449238057	3.102749797534788	3.483075615587235
Zci_02190	6.056643252241219	5.310945067503145	5.67853867239898	6.049836800013643	4.890852565594849	5.241296717300253	5.2417788524599755	5.034264431060847	5.924702156160487	5.827531230054702	5.537094589753479	5.741613733516131	5.842113712312549	5.942214948783922	6.15197399080646	6.662897166961266	6.339443313746491	5.947947814999402	5.668712120932709	5.675868497992579	5.7664759720372745	5.259484463426261	4.687891115014078	5.480740028308033	5.4183738346779	5.25640117990026	5.631565247457568	5.464770548764268	4.799951626988975	6.002722179181191	5.282489688042972	5.392468814244321	5.768504959009174	5.552287275859701	6.171111308926755	5.6900084566450975	6.006270061258193	5.609755612715309	5.339383096810366	5.843150846433085	5.521890261182563	5.4249367176504295	5.516122113536356	5.5527285309062835	5.287428448411553	5.345320701700785	5.44762910108425	5.597659104071459	5.487525046105861	5.501394265038314	5.648780438667509	5.845058959117913	5.298114720582091	5.597606080727623	5.989883655556474	5.366105411672849	6.109052129534778	6.498137931150633	5.756116055825829	6.2083040795009286	5.979536876940414	6.145273589258241	5.528229541630336	5.659537562634591	5.919065844993663	5.396899919115095	5.456850046060355	5.780638120631905	6.137125587399274	5.427096529582598	5.798684797069577	5.720006335256879	6.1872074701169915	5.934696931602454	5.7360570885528555	6.609585017463521	6.261791514005922	5.812361610434567	6.667838430226407	5.943113270420196	5.885158897971324	6.549939305039127	6.392190493967092	5.828056704280159	6.497903107940391	5.736760939668468	6.26989813557126	6.984197609288882	6.188739351332575	6.331103645413105
Zci_02361	3.665677572147895	3.851430572905159	4.551618788370978	3.685839619005878	4.644192986200085	4.322588066873959	3.872464045431544	4.476548231190558	4.39316706212512	3.951098128781968	4.904121737037371	4.451240416207846	4.205066856886795	4.581463705821421	4.480808918518277	3.549830076723311	4.384876745501098	4.566505603042064	4.060178462782982	3.788256797911354	4.279524876493895	4.429138789497113	4.2226854556412166	3.862261613242761	3.7143764624965216	4.4141460355322115	4.522593071489046	4.400992298486582	4.8197096439234235	3.315373257070862	3.9800298915922743	5.008075275145385	4.593733571751241	3.8584025506776527	3.710242241008249	4.464689109257516	4.447079737222374	4.371729424088995	4.147082883549456	4.487307994959834	4.005656112041628	3.930568609879549	3.5463656238318677	4.253139856303001	3.486684347396018	2.9892834765976364	3.1163432123868136	3.6972432753002775	3.4654978519610076	3.3450544999363316	2.905100096576166	3.606176560486305	3.6635912497761183	3.991289462614664	4.043153594784841	3.8507161287920697	3.6953196284348135	4.580006912437497	5.3504564057301005	4.739348237309174	3.7111194430107055	3.429344508288355	3.7828948959578943	2.5707074056418495	3.5558121735725465	3.929972993223664	2.0227607448713107	2.5798118634142826	2.8107678633683544	4.457624897980224	3.7743541460752263	3.4478225382710224	3.60588298106096	3.3549111568054104	3.97572146028422	2.8452697296493867	3.806061741900202	3.521045707218972	3.877954697749765	3.80215381300802	3.8564703771427937	4.737099683948929	4.778041941761419	4.830808551124556	7.363913426617945	5.021115919082906	5.042477085477549	5.790060034112297	4.575773653649345	5.849667407660103
Zci_03144	7.2678380102612525	6.311105621330518	5.144077686804769	6.621993896430987	6.3295997749097195	6.191467344059658	6.334967212215183	5.782850123892621	4.75888871103234	7.412583114224959	6.805641095299491	5.671371894349311	7.168248111775638	6.884882197819378	6.030292515485194	6.1862838380665925	6.318143762537523	6.305343640500731	6.641537537883274	4.724789433974844	7.584182383487864	6.535527889526001	5.953131007226952	4.34835377100107	7.0716195445993755	5.989159962451264	6.395221883045641	6.752733150467801	7.179181774532376	4.494597830615282	8.426913659266177	5.559456675539939	6.171518686863355	6.32709063622975	3.075082133039637	6.347453583055122	5.980856720575795	5.012270302197412	5.514123093000251	7.42030152146417	4.394158585773971	6.690612426495892	8.572372047822693	8.240205780039311	8.671195992760259	9.699768812473064	9.731325800100292	9.834914597988822	10.862624936843863	11.057384851468314	10.862624936843863	11.178131122768471	11.59352338338704	11.59352338338704	11.580474933957952	11.623411276654425	11.655183673730708	10.683494651269744	10.95946510176039	10.369173896461872	3.876852421042021	3.7299177755341737	6.290290794323588	6.7551873556568625	7.307380146453508	6.988166572161022	10.524214502014049	8.368789858889427	9.434618809704798	10.785355939348545	9.398118920901648	9.09914787316659	10.739244801324508	8.557263659974963	10.205070921632393	11.038147042218377	8.967329736019169	9.214297773634977	10.45099982913283	8.287138192654155	9.319798084292714	10.578015080053076	9.92204927716008	9.691861778775625	10.120316865483948	9.501973276753588	8.80961259708525	8.518061861422591	9.148536356467304	7.513583737613795
Zci_03195	7.342081751018174	7.432941263110825	7.89872003896598	7.481156721610152	7.218911898937939	7.62285204050252	7.1158789887563065	7.2920311743509645	7.857952994248643	7.01524127839489	7.128176353903237	7.458288113153165	6.790461785885175	7.643181748071433	7.258497243436105	7.114948376784101	7.31067818277999	7.586542563808197	10.042155325942993	8.305208436224525	7.503933518868363	7.75349507557915	6.7632911215092575	8.345162088191895	6.867914984897417	7.79577846339771	7.952128973404992	7.484655635027486	7.526925260160854	8.144988884128878	7.214324793962385	8.066961211608946	7.991999352277359	7.28151542060294	8.339357096726912	8.050609163886163	7.723508368084893	8.224880840319605	7.711290024796313	7.998384971872125	8.369190402341898	7.309137363749715	7.754454926836163	7.919380287369409	7.702572706024122	7.608643713747008	7.977555975384999	7.868858907934156	7.40176605674851	7.705525949436835	7.75747723924465	7.745611786159151	8.380867176496084	8.088948626684976	7.928889397465254	8.115851542401206	8.579537816349347	8.438044854408382	8.846839553128834	9.132618700738476	10.157042434521902	8.696865924114912	7.696322097828738	9.69250923580594	7.715603128071722	7.546899192050248	9.124304357961371	7.996395132036491	8.185308194792453	9.05078582801054	8.389867811036645	8.352568213185453	9.071292673986957	8.905440901531856	8.458012020006697	9.45029644376887	9.338268094286756	8.696305911577465	8.930099289504081	8.896615142179343	8.906785358637569	9.514913036867306	8.784050650648968	9.179468500023065	10.062823323740444	9.098057861901182	8.515886697016617	10.00067618313612	8.596234900851732	9.400320880186156
Zci_03379	6.01091989568485	5.690680432870728	5.820573578286811	6.000088861437662	5.6510795412281185	5.776344531715525	6.3157411164219575	6.240420902684452	6.375556431690684	6.628460203352237	6.51903090123724	6.601993025357279	6.906893378975041	6.808815164190238	7.372251888367918	6.735162726150974	6.823632256870747	6.504627864131022	5.992468270759025	6.120399266033474	6.036290489127517	5.597009361594384	5.498656533468766	5.746847643795381	6.056942572526903	6.029168210121988	6.12621393800769	5.719498915120641	5.916725145409477	6.210466964161266	6.039206898867732	5.611300102480511	5.941038393278049	6.249614220168968	5.187215815056654	5.964227811976141	6.278565990296726	5.956847715074074	6.033823894964865	6.076622887680239	5.5168120419228055	5.8136923146418695	5.7299114727346785	5.393527959651864	5.2425507626295245	5.654760473053047	5.477969782281674	5.372169584681797	5.391152217140299	5.113355545909253	5.700078668713045	5.440932794888831	5.483213060648208	4.635333436156977	5.498102802940241	5.148251676942682	5.1947087031476	6.04689467961854	5.402158824614886	4.671320435644339	6.2030753244478	5.905229050844359	5.810369511994654	5.927335736939263	5.926828260007496	5.662210027709878	5.275890012121111	5.936598869317549	5.37139704032731	5.69281110451171	5.976461119548624	5.767103365501552	5.806596919820808	6.420583642679251	5.756829517351924	6.291082512481845	6.111217542519054	5.8490298534429055	6.7462597994910505	6.2311443965912	6.1491682380035195	6.994103627762945	6.6994292950166585	6.373068223752989	7.529703810607803	6.215760027865855	6.951590941507229	7.537142428939784	6.229022408738022	6.934027208998313
Zci_03398	6.1518169694900955	5.25895010366208	5.753559803213584	6.101393947509129	5.164315428907293	6.074428329656073	6.316104961658906	5.983360079095293	6.14719189997047	6.562637203982036	6.434814724706536	6.058230045224599	6.663239969765158	6.594573249880702	6.636118321749911	5.809706336672856	6.232577538277286	5.992678832779655	5.765396676778783	4.832397888028314	6.017974509614414	4.577174550424183	5.150358798442089	5.128709463214491	5.926436467041567	5.4357737044755865	6.175636822750076	5.370395201778288	6.120900302115325	5.551012786338525	6.027358538654018	5.476845476772335	5.746741256482464	5.941836754036881	5.609377662736622	5.551179525787689	5.364367518215874	5.406624714070297	4.890969045250124	6.396061868505669	5.1607856426704615	5.708360077382579	4.97976948537222	4.802505459432839	3.461820944533173	5.328098709525359	5.218741553453165	5.071926562480697	4.992214827021316	4.498812607228373	5.328258812061779	5.472343976478959	5.353654323837917	3.796200886039544	4.823064855345473	5.155258093485603	4.486417333278771	4.970510965814745	5.227992038534551	3.8436401769440742	4.940009282224812	3.952496953906655	5.379727596170914	4.160580011344874	4.758418615884122	5.250447691886331	4.638255619930213	4.747726554475695	3.94895342023297	5.501335907102598	4.933022271612162	5.154574922854013	4.675544844202352	5.576772698167782	5.487328462427431	4.968621886866607	5.652168374035626	5.770420222037839	6.0645371417042595	5.890749681480677	5.6220279051569975	6.500455727380322	5.760242262419246	6.045688255730015	6.962689253951272	5.575204726706389	6.415391775652954	6.821135916080715	5.967535489399586	6.375342511878079
Zci_03792	4.654052150549463	4.880574554591606	5.382695223288077	5.074964951054974	5.653365729554246	5.009751570315	4.519539317299156	5.15154583794023	5.3618214547940735	4.179684679348546	4.160336635793703	5.084637598400039	4.856978416325038	5.312955103871781	4.538940322117586	4.67141155511844	5.332100931809601	5.6813453022545195	4.858998596985055	4.648402453653869	5.127944344787573	5.384111252254484	5.025821388520162	5.176880306246417	4.548135811812956	5.110661479226668	5.480166483533918	5.186230365495945	5.2302456270720015	5.371246022248548	4.890648134391154	5.89316761985316	5.752231956537348	4.992220608210442	4.389198564575826	5.028144553524261	5.204627855111068	5.088885757940188	5.193973887579429	5.484730729910026	5.053998414172044	4.860474949922509	4.789531742470664	4.885891348390267	3.8111424688512865	4.127965445726231	4.201403614052829	4.5621905273440575	4.393423985790641	3.8270200260905822	4.593929723375472	4.378490131658025	4.650254858319	4.917227456989982	4.262361073287777	4.715324849870388	4.506534486657269	4.810399487565176	6.0109410603572435	5.588991091039948	4.584206769091675	4.534764712040006	5.062331360481772	3.5670759687364346	4.110026595829392	4.650228307594121	3.5342085642614367	4.39467872599244	4.01145306030984	4.310175136395419	4.588655146863535	4.252023212977885	3.6613460503816233	4.309317384748797	4.241133772745914	3.779978519895847	4.846128057472562	4.268314322136377	4.386781045386344	4.661620345415576	4.963339194357589	5.029100384319016	5.506415117986012	5.708973665285114	7.891254597114657	5.406980831883818	5.353659065773228	6.891162175923001	4.9978232950821715	6.37025814450527
Zci_04298	6.553472647733505	5.704774121502196	6.139145074430908	6.648096893296238	5.72091129758928	6.37234125055767	6.355076076272406	6.042835317043786	6.579252923143314	6.544824013199953	6.241120784597934	6.1555217996249265	6.186783490297105	6.345935007792231	6.421134829808044	5.843458421849207	5.762438252448834	5.487569464785431	6.017456564706403	5.912425117243379	6.110323165947559	5.700783697997439	5.471656423868379	5.995651054403898	6.150559307136619	6.306077345169519	6.182079572558964	5.965342393170302	6.053866437957865	6.121946769280818	6.1033201841482665	5.523072704362948	6.07731440138993	5.847641049274202	6.104226907623463	5.864546993235491	6.006825644441809	5.9930510429719	6.101743789443561	6.479011954753082	6.438449026927662	6.136697725259182	5.847767846925644	5.551350182855424	5.313791450589485	6.0876670318789206	6.118873258068062	5.826126808403376	5.907369436372187	5.869610778566717	5.686166816563043	6.365045566517691	6.437152766101694	6.125396674983564	6.204587982483354	6.162744041640705	6.308957507684707	6.591016255948148	6.919733828489875	6.311536063081756	6.0614505554307145	6.4113204087656746	6.107330341509678	5.991378305124112	6.1553060445585634	6.041556990600333	6.1112872281254775	6.377763575548902	6.56110335091138	6.177395523931939	6.399159096815752	6.623656165463065	6.9088704450195175	6.998635457288576	6.650800893756086	6.247225877767776	6.97661631851054	6.726556696994202	6.024594598865749	6.647898413978167	6.344496708815957	6.3894413217139885	6.316801398815173	6.567321518534297	6.5730419901864146	6.7914530314162915	6.738712598888322	6.895641428772955	6.871797051324691	6.83794003441509
Zci_04796	3.647331644772823	2.4386984450860263	3.598798953735982	3.2776180241859194	2.69350237215356	3.6957942109744617	3.097268052670908	2.9024809289325284	3.484337064859232	3.2089142759687683	2.430381870166846	2.2297862910332498	2.956453697410643	3.230564727592656	3.1422447572161163	2.777005584605134	3.07203606574678	2.63440133027175	2.983070116804078	2.429119543045879	3.1429903287635024	2.7252708763308404	2.8050226613522766	3.4288533118916957	3.234901993858655	3.264335412993305	3.4027044969990756	2.4875414757935728	3.198677367405234	3.673704715114012	3.377922465302962	2.794688939727485	3.5429423490766605	2.7739677405472234	2.9474631549733217	3.643374805534043	2.664545384906598	2.5241140068945263	2.873028644838663	3.691058899412067	2.907012008860437	3.340527108150588	2.844898311546535	3.014171236275167	1.8754579451181708	3.8207384095501817	3.631322036479605	2.5416250992776828	3.52167369097072	4.1521479324185675	3.3893914944662065	4.459762678777135	4.864671614724115	4.511944638723663	3.989550092416552	4.7480335496547	4.585048969388274	4.4108769899511815	4.314721241964359	3.9085276250247896	2.6841535355192936	3.8084570787723937	3.235210789332194	2.6528925865225568	2.4469751689997854	2.441658676502982	2.946534696833505	3.428329655872672	3.5228934854750764	3.4692649722177027	3.727360389276656	3.3650650216885993	3.907230636938693	4.422003085882075	3.423830483079465	4.2120025378139285	4.715489054043989	3.866753085875192	4.098363240544868	4.158975574140682	3.8683289540434287	4.186012610408204	4.023382722965037	4.074714878771588	4.764503299357471	3.866857451840729	4.028696277768369	4.307064560582314	4.190458302588794	3.652039108736867
Zci_04930	10.888044796008163	9.909604761621337	9.843950396073645	11.079848248035248	10.115738563270664	10.129236608100484	11.196517445252114	9.951631833855824	9.549059225607492	10.922685245061578	10.215795411145804	9.791145613490627	10.959756567528885	10.439159934717804	10.715918164976614	11.893866504577415	11.594437584554507	10.857288752324507	11.086781898059108	10.80690434774249	11.39152465498818	9.615579223129387	9.4345275566787965	8.969469778394357	10.963338497314815	10.455637428366703	10.433948206601316	10.063944785846868	10.887841588976563	10.0150184374521	10.969871343873608	10.799028799971586	10.520559932104156	11.444586857144207	9.286107271568962	10.028422850507305	11.576044508752116	10.930217467085026	9.88511425557579	10.91948765987036	10.509378614872883	10.542838048278636	10.36667631821323	9.71748788725476	8.60469268396275	10.332724303504564	9.88945324528549	10.524800382148827	11.245241265778676	10.50385411085209	10.732960417039347	10.857771304624826	10.900963427622436	9.545442299795626	11.553353870479272	10.843497958198816	10.644768797794251	11.490699461713284	11.209332063549704	11.133024840702127	11.459415698280822	10.688468767796587	10.845680773190391	10.821402713058532	11.004402102262052	10.602358199740204	10.320078029520744	11.17962589692061	11.427007594428746	10.866612505669597	11.01206269576772	11.043624320165009	11.547074153950891	11.156165684476012	11.575728337215471	12.042415569122888	11.07415608745489	11.172581085107458	12.096649162156922	10.994715762901334	11.447963446120305	11.907135450241334	11.70007397832052	11.178050172403438	12.22468440211737	10.966172918350418	11.590985700284744	12.229011379495	10.966885686277651	11.74228172794535
Zci_04965	-1.2827686237307212	-2.2357835486610087	-1.2827686237307212	-4.673436735954311	-0.6635765536551407	-3.768185605503147	-2.322890796343964	-1.4488510170352895	-1.8363476277984956	-2.7579216298694567	0.493904777876984	-0.4819342978320514	0.8592467271375926	-0.22199643248610204	0.00614601661768249	-2.787479460876989	-4.70859229296698	-0.16266064213215192	-4.456940065693786	-1.3119271948618294	-3.711339281144964	-4.456940065693786	-0.1060135652486964	-1.055056069403834	-4.343714257622302	0.12175428431750863	-2.573130820889581	-2.5058015087548053	-1.0809213265450368	2.0222817460040337	0.00145661882664744	0.02879487417869631	-0.08667987348182075	-1.459514641832514	1.6560739341970163	-1.6752484406762616	-1.7755988746650744	0.23822903525777503	-3.650647865317531	-3.2203717528613733	-0.6657219613651013	0.06177130008726043	0.1166826730261705	-1.7950656049120568	1.359018791780794	1.3887411175663174	1.8725706360366097	3.192225274078671	3.1805146899233456	3.652414094224489	3.354617520378342	3.0958012168496287	4.238754408681653	4.30411197046699	3.0027123918581307	3.0202703279109175	3.091500854375469	2.7611637357787737	4.007256030508062	3.4255870511535025	-4.367244277714508	-1.9957464705332824	-0.5590166527851497	-2.843601427687884	-2.455724695682466	-0.7064777887365307	2.659725965872307	-1.1591817055807947	1.4972463797173257	1.7442537758175247	0.6327138312313736	1.4226542802935165	2.376984994030626	1.9104054534245356	1.7061550408548667	4.20477212999638	1.1868759916887832	0.9231449385636696	3.083390604453582	0.3705273925570765	0.3920684810891345	2.686494496474758	0.8524191186946256	1.065587383173637	2.496826088170689	-0.7716297259307854	0.5932291335967517	1.5869500880457952	-0.1686059592748401	0.9858595553399194
Zci_05348	2.589016235152731	2.422704155002042	2.20926252050349	2.451722370033666	2.621783980541986	2.24021256039059	2.666677145924594	2.1265949273916465	2.9154896644145065	1.7751473248217606	1.8716887998685152	2.105236074943186	1.913510389231218	2.670654602667496	2.512407703725408	2.3620838131881667	2.580052052321844	2.8441358811016095	1.9588699753761605	2.877907402622469	2.6638327837182234	2.4733961761320575	1.4369262856569796	2.854303139958205	2.33223582025671	2.6712863750235294	2.5442652872777187	2.781721703187474	2.920875672106302	3.067232832543324	1.8723698841108165	2.8992987301653073	2.8908095603487776	2.323470164218426	3.05946813236604	1.6851804014729923	2.3576762499135113	3.322221221718036	2.836683087862659	2.533546820929023	3.24566686383178	2.120901097833242	2.6409477806888058	3.3215610225926944	2.6275114237124875	2.9402444554854528	3.3159661472843966	2.46966162575301	2.9105166055253977	2.902832132822939	2.8996352481944303	3.2253387492900187	3.519697663048228	3.981208657833514	2.969206567361335	2.7994379779056535	4.483710883064051	2.3755180259106035	2.9366645401357157	3.53739023267911	2.6387974273190236	3.4695139843654728	2.72292321393042	2.461452479335441	2.6101700069104052	1.8799738238143429	1.396988405660102	2.3930019301585315	2.290269066990025	3.170988742988817	2.9946994560134828	2.1711888155686503	3.485544081810547	3.534938169579867	2.54580376328705	3.232887659186022	3.4212661448907937	3.1745483028663335	3.473483552437471	3.4625277445125433	3.136912682407268	3.868868116702305	3.586544401240882	3.208247418784611	3.6630410894364465	2.710752912323967	3.513284401382334	4.38317600853628	2.815551912033849	4.046186954385548
Zci_05742	6.390405157460316	5.9853121512684915	5.506467759265214	5.5901722786161026	5.314284413337514	5.85926599526426	5.292867494094037	4.9320867252295	4.545335736720464	6.240777638855474	5.825308265388087	4.935837701502926	6.312286472006529	6.232009366402187	4.9675663151663985	4.946531540389678	5.408679954293459	5.813776449394759	6.271278458964513	4.773245072777164	6.756623150781857	5.933163973047772	5.475713042625482	3.803434329793387	6.4377730393393096	4.754065503622658	5.452475222446231	6.007664508696187	6.155001872865418	3.842803509463789	7.70638296572796	4.4548880074347785	5.401892358842332	5.405545184610594	3.4994976592781932	5.737185906552958	5.5448522260259105	4.143634379795354	4.4154561002830635	6.728906583848833	4.180442315964127	6.087579358392807	10.087618727302248	10.222240856685968	10.601682389154393	10.992206060381072	11.46753335130706	11.31186184948293	11.472008223660296	11.391183770659842	11.284510270117131	10.611934548779017	10.565316454118632	10.61937649811286	10.670198691615896	10.335726964702925	10.396601475628122	10.595558165861547	10.60337310909934	10.715869579004655	6.694148289919468	7.967126233889482	5.6027460146126	9.44928098047505	9.592780396502638	8.264365376736034	11.518602797195529	10.30356709063182	11.811724903488717	10.47270860790806	9.521703602891185	10.236832577246709	11.436111686773014	9.534530219287838	10.211499425028956	11.452615691115897	9.54980744185399	10.035286167389025	10.922692745399315	9.606725205148772	9.710079193671008	9.942241981880768	9.56398512763784	9.609782155252976	9.360441890780736	9.06613749203498	8.701876325462425	6.907689867337087	8.352065791073548	7.3090587204871005
Zci_05745	4.536297212776489	3.73830556819936	4.1159959888832445	4.617590588313491	4.079075106980167	4.732781317468693	4.350883000610967	4.13001383213723	4.882431199483045	4.371967845263017	3.245910041715218	4.251866218426226	4.3927775019344875	5.00883063184691	4.677511570759101	5.569763416548197	4.959006736250645	5.006475929349433	4.220431748599704	3.5421007294941664	4.450946120163645	3.9556125238166584	3.686437326870739	4.490382214854549	4.376448157938089	4.486415799097841	5.2384524638596	4.279209601274648	4.338525178565359	4.169355750508605	4.6499107506415065	4.747125840858555	4.6410843188053414	4.437118806404949	5.161286826971053	4.777170674804417	4.188791500410177	3.976576224678897	4.271332717556622	5.051510025700396	4.22490575111723	5.105686625805109	4.5660419557223815	4.146893207193959	3.9418715301346454	5.208248984775018	4.443748991148402	4.91739593700654	4.895407755833485	4.340004389690981	4.987196748278394	5.1073303760246755	5.079264257022522	3.9670181357960703	5.399995236176685	4.56303330576891	3.2640995665176504	5.246998247570774	6.1236851387957465	6.134275891079326	4.08272115849871	4.546740387275593	4.306338132550678	4.252397630788711	4.04964967470174	4.1686777988747945	4.454394757438659	4.725039022686047	3.257566186099953	4.759801953350927	4.115838889037354	5.238209524521125	4.168624050246795	5.147580218514203	4.451446582840791	3.7487333577811217	5.636375881093966	4.618964957649332	3.5732085390580948	5.1091202313613095	4.829658896118681	4.201384057412082	4.634273601051168	5.081010528299878	5.473156027412333	5.300762493528781	5.403089046099773	5.6445527662833355	4.796858903745635	4.992024530731103
Zci_06010	8.444508136985306	6.527187621504142	8.07714698971511	8.40050065533342	6.692447097879514	7.674233628502115	8.585278754941733	6.595355736923562	7.04662018885958	7.998891006047533	7.356397077188117	7.311892757360208	8.157112219956218	7.977087980269327	8.199782467240055	9.52646548527992	9.13790497320174	7.640915905137715	8.168786840948398	7.940853440350186	8.345162088191895	6.2841706545765295	6.248156098393725	6.76785857695034	8.004797801918011	7.730215650919749	8.118694376820256	7.230221379227744	7.145499654138838	8.553801300966803	7.4070920412581955	7.915847057373997	7.876438085514617	8.448979982646241	7.485640218667322	7.392762238401299	8.804348542239659	7.696657746844504	7.280727874495972	8.024355925127763	8.483337613003174	7.908051853899717	7.190977641696651	6.529474585452499	5.8818344767987805	7.392079540106679	7.1675206585341655	7.60378108148698	7.9350971671982755	7.094042317016323	7.958848723212987	7.769070208553408	8.071358121933734	7.569551312756901	8.818100016615587	7.609974298645414	8.31867551982	9.463111993666796	8.9437353981777985	9.382875356302838	8.435950884732096	7.928945404330188	7.849970592193462	8.13967646276078	8.555344262748456	7.467928231843159	7.632031368362664	8.512610441349882	8.799576560982773	8.216836559635556	8.176066736725994	8.810344456025282	10.0651312028023	9.352079015687591	9.016954284726769	9.701713463984536	9.004401184063667	8.94657536964473	10.14126332232146	8.981228046091148	9.126794502101111	9.77206761057255	8.774575162891873	8.999543093742114	9.88928329771808	8.548421176492687	9.73922640372009	10.092817705222783	8.80471122054869	9.53697166436736
Zci_06339	4.158185014938514	3.20069154976022	3.654582007624616	3.593514317275752	3.7259766673902783	3.143390113929691	4.077238400183322	4.37970929286778	4.69000955512937	4.171643326161613	4.171643326161613	4.140074942608728	3.5012530828135997	4.267657234211553	4.306044012502189	4.719434006006081	4.701398296380744	4.174241241773348	2.9839143619970123	3.478623007000548	3.010452770329211	3.47068148266484	2.004792896321827	3.8216669215663335	2.5022379063772475	2.83662018238829	3.8292068582648	3.2500606861853627	3.4369692549243283	3.7869752879595455	2.812969668222948	3.838403981412696	3.748728689431093	3.194140336094259	3.8640550562330858	3.2188847644120293	3.6022673010478727	4.052703405438467	3.6621133122877305	3.7765352107236576	3.755983505764469	3.056646123588239	3.4597773651178807	3.333268135618063	3.5670962838919	3.360302758635331	3.73089994440164	3.6685669153074647	3.652414094224489	3.9028072809751815	3.556943653886216	4.097328436460537	3.91484687014014	4.2547008634800125	4.19575692918525	4.048890308970547	4.132345000881786	4.630396511974893	3.9108112700683937	4.736712458807048	3.6402180128412023	3.865523977134445	3.2446932592850986	2.7728822131668154	3.280322856049135	2.6937009365958704	3.3742086492170675	3.5779279851478667	4.172995789976401	3.441243002178227	3.784804993699324	3.3284546745480017	4.195750904021839	3.2623340441391564	3.6633481509255255	4.4470896605366885	3.9123014048792095	3.285356748153657	4.324616666466598	3.96196257448038	3.569510070589496	4.723458648601317	4.136599645398722	3.673156675035378	4.932198881677141	3.814092963879937	4.062189234927185	4.994184342776127	3.874186372573809	4.403280527906066
Zci_06657	0.23622049446466825	0.44713707282113013	-0.32366412348091117	0.3537323935099329	0.6398406656801415	0.8833033891791935	-0.5886041268562846	0.9061881392286544	0.7643507732875369	1.1289241867728457	2.3678738426674744	0.5120067103046797	-0.4618671878200195	1.0544731450974445	2.3517425182246865	1.2312908568832468	-0.29649683141309363	0.4527830432697562	-0.14255915930199847	0.4609259845229693	0.21072528863841536	-0.0731216586442972	-0.9489024740546436	1.1016690452542182	1.7583227139606827	0.211352955489087	0.5847407734363745	0.8071168383296398	0.3961521099195987	2.0807194724804434	1.4632270179176186	0.6952160314629251	0.7869922051856338	0.02869533684824309	-0.1819876278705123	0.8963536304464226	-0.21439251750298216	0.16850918972697523	0.3090554500785823	0.6180177194983839	0.29362063905426716	1.8664390044077757	0.4316103447746771	-0.16148066121630603	1.003714691820835	1.5020870396049235	1.3763979761377911	2.419591904467485	2.5539540052075616	3.2960834718167686	3.1838810707111964	2.573494159292527	3.785522629912845	3.868561748535302	3.251430033147225	4.182248195724031	3.4619803150009942	3.612554345676275	3.541187526633371	2.230483122772527	0.3147755052261861	0.27206550710879324	-0.3630220088435917	1.8524684463535064	2.065036513660596	0.9088158679766912	2.913165289228301	2.290269066990025	2.1639822736852636	2.2957104503560033	1.622174377308011	1.3893648522999964	2.839678316874368	1.1536007122606964	2.239682758785178	2.2789042012869443	1.39911033127374	1.3180853369039005	1.462768590609851	1.8129423050581617	1.1866788727680924	2.14432589995724	1.481028562081276	1.6728279091282516	1.791249921810243	1.774190757657832	1.523026385220398	1.4074715494658434	1.8795676993290595	0.9625922592976036
Zci_06867	5.654893569521791	4.424901288740536	4.31952443257622	5.283510586664098	3.431813233305124	4.019674875171383	5.017440142524006	3.7641787527164703	4.070617110097994	5.2418028952935884	4.262793246829243	4.504863478333376	5.198162537000743	4.576520586148336	5.1022709638522965	6.60929208144485	5.529752055321686	5.0367807006598655	4.568812897468823	4.499422918405023	5.175864692099749	3.5103940440176724	2.7921012303007577	3.9289572514189297	4.506524805359015	4.01398973167224	4.209476379878499	4.283913067863307	4.149095704319091	4.156543509056358	4.102023046677743	4.653083570303338	4.719062125878921	5.301611848809178	4.1193944446625474	3.833257081641925	5.811902720041202	4.192099877139372	4.332819034331253	5.179010295025311	4.340025184824451	4.195267695143917	4.373379589407585	3.751280964380096	4.068770757790653	4.357948990621085	3.306506270347129	4.16606609092588	4.815484212058453	3.6160846242272937	4.273091597509335	4.605029719645815	3.8700498354968422	3.257653469255102	5.123475236944274	4.531447309084856	4.058214877273137	5.50832389678599	4.376097676055591	5.6694565382967905	5.1979710307476985	4.693950774349301	4.617528670846998	4.485028147425	5.216795634440575	4.562022138713826	3.891369702013395	5.033212758907461	5.6752662888596195	4.542873268877448	4.342064102398668	4.854425520324277	5.283750154736877	4.566067385026509	5.014816639277502	5.923403022868965	4.504182647147455	4.736188531642418	5.983953723347392	5.052931603321943	5.0501629656162965	5.290244074109249	5.21346331339222	4.92882641484024	5.941452957551812	3.965735254537957	5.570474892025116	5.5303595014266325	5.072812589752922	5.499484542763769
Zci_06995	1.9382604367821137	1.4631531350458868	0.2789236604773595	1.0446461687672244	1.25537730181296	1.8089277513028104	0.860735013509319	1.0957837591952773	1.077364724703834	2.312372785670035	2.4913538532159243	0.3390846154569555	2.3304497944359626	2.477244971563281	1.0461555245297731	1.7893587369632262	2.155373646753204	1.9933691296561824	1.7212017626777487	0.5122349219998782	2.8157211674877334	1.5182115216115144	2.276886807538759	1.8053334622872088	1.8741184083849056	1.2307580153570277	2.041491331487171	0.24735128055487024	0.5381701769329474	2.521692558525227	2.52621271564259	0.7869922051856338	1.8894638536831183	-0.02481578976073694	-0.1819876278705123	1.5990997099576991	-0.00266082995674714	1.046014968875279	0.955555806030124	1.505500825723456	1.7179800347667404	2.4577796141365855	5.1018280571795165	5.057659395740995	5.536220913125461	6.035381117309407	5.95123210230334	5.590449063897946	7.120340930051211	7.464543866260868	6.359461152098146	7.1152852243058105	6.033222256512117	7.815034215657327	7.356084908058583	6.346705164751432	6.651286507610887	6.665207378806103	6.2829268893188575	6.252699855700823	2.1031759482075474	2.611941739979782	1.708556169462112	3.500927021637814	4.037407867825583	2.7206761891352085	6.652450000188852	5.411693287502846	7.301924358042648	6.660063413517249	5.847687146299443	6.204367086216564	7.350331827808843	5.207931754248262	6.444635248523299	7.617208990654562	4.697081444623242	5.495474784325084	7.011964030389439	4.001153010011995	5.548126915680937	6.802538129004545	6.034946066727593	6.003358917972131	5.828615951008946	5.123046195033582	5.395155077233539	4.917535392632422	4.812728828410348	4.469046353544759
Zci_06996	6.452434892467646	6.4020781588334605	5.656953600217429	5.866489082580932	6.069107178364512	6.299253610037834	5.775837088453951	6.004805162314518	5.730417351409261	6.5180192741413405	6.238797842020041	5.752801467399067	6.120164117413	6.783759506847027	5.9308261005064535	5.440317682705417	6.2330270362907045	6.135926237927807	6.499237475790327	5.623328682967661	6.803079697926901	6.371510565707246	6.604777349717935	5.6512872136650145	6.264483533946473	6.117060406313004	6.46730875560131	6.3308021664480085	6.639649214863822	5.785386926408681	7.692227830937065	5.1408917850488844	6.199044050283952	5.6457810627874965	3.2991475938800434	6.553383748342678	5.4093666628920944	5.220322513632736	5.707536065770568	6.392958311452307	5.595704475706417	6.895705843203774	9.534689000812314	9.50957165285653	9.91237745036382	10.262993411507235	10.679600994852862	10.624811345398014	11.367508114524846	11.774217513357186	11.367508114524846	11.472079895672447	11.87347031252241	11.87347031252241	11.698061945078065	11.698061945078065	11.756325562506843	11.000389991989596	11.039137579568914	10.870058601752833	7.035530111920837	8.043333844614835	6.336065396940016	8.488296205986678	8.655440753392615	7.834053312452457	11.121143429152786	10.192395979355329	11.550951366270423	11.01206269576772	10.51682019275749	10.679177081424577	11.575728337215471	10.11726416820466	10.960523874289963	11.787088191878896	9.923869036035754	10.35422121746284	11.228351804637352	9.51455097489833	10.283820807035712	11.46753443787208	10.422509787338893	10.516775072358843	10.72412890640802	9.722738307338746	9.926447001917182	9.443670271628903	9.419658515671324	8.966376171684358
Zci_07019	8.124597277477495	8.762463503886625	7.938078797486844	8.062020003596583	8.422648037407338	8.927953986264063	7.720583368172448	8.64657188937595	8.291719450105541	8.630512868651985	8.70062063720786	8.252139415757794	8.007331141671674	8.962723956310274	8.176069164203914	7.94734751775405	8.542266992685668	8.63104427120351	7.8886682832245185	7.042005881822506	8.510956495303425	8.722187261583032	9.121903391119028	7.842665341561346	8.28880789400289	8.514165739291359	8.871040813592641	8.48542843664414	8.29094778219182	7.616464527862293	9.549777305007664	7.471176395812841	8.648877275492088	7.808047062390507	5.990310146248203	8.97119531708077	6.934656189620605	6.9736832655821805	8.01716629672447	8.223832145035969	7.4582501248545165	9.27489739735258	10.277350911706703	10.22765115156408	10.46655872230244	10.814791858359197	11.184525967632425	11.235014691791784	11.774217513357186	12.318713139808056	12.077998540426922	12.106005799660178	12.202329082978515	12.283277693943717	11.992627613121105	12.198327610079271	12.269878536433689	11.408817174196066	11.682191229319038	11.408817174196066	7.698144102203041	8.45619249908486	8.001167863948673	9.14757855295181	9.34585733649616	9.003517043831856	11.306850208850914	10.78263189778383	11.66905161054902	11.437379778424733	11.301276891449092	11.2005769314461	11.876337186312782	10.823274962988098	11.156165684476012	11.963802800556952	10.66459221274191	10.759906533508628	11.540620027994429	10.467777278947112	10.87607356521998	11.70007397832052	11.045992308509677	10.972314287318996	11.002502301695309	10.321217137169702	10.582995801588403	9.915280930196255	10.156333846852505	9.349596946659174
Zci_07073	4.492823656398199	2.425919474918144	4.231070552753741	4.123875945254562	2.2114822275649075	4.255504222205833	4.118133915518231	1.701020580900494	3.7438025202264464	4.112824718534075	3.505910247235074	3.2780702307212675	3.7687274422694967	3.303517120041696	3.7121579589993976	4.626696733910346	3.6780663996726193	3.8442386133709503	3.628349918246392	3.1734297928142468	4.1749614595295546	2.512790725371415	1.4804899203166302	3.4246793501637893	3.892114532753431	2.6610833226771584	3.6160490889844863	3.1831842332105182	3.6942665972496913	4.508963832606399	3.5661659261311915	3.3757496113409435	3.698688383709761	3.902920230390219	4.676751484181081	3.444142733959243	4.4255470859835615	3.6150132686704137	3.5794140010252957	3.843370220937196	4.781922746748055	3.4560538543822217	6.617755347884531	6.345518334317174	7.225676033485779	7.059262302665254	7.541259866216274	7.275150048422483	6.168260061802784	5.729188099418102	6.7456736819764505	6.528533885037013	5.713392149697963	5.381987731765339	6.330816394394306	6.719616051067339	6.905107456579229	5.888669627613419	5.042913764791437	6.285060437695244	5.156607950903708	5.761924876331491	4.076889192143477	6.004798905245832	6.110668529354614	4.622666895619175	6.50371427495045	5.145880357412618	6.364847403861155	5.89806943409742	4.10871909162408	5.449005608673463	5.902090929837798	5.127789249286842	5.783151451636306	5.718883830106278	4.743141447390244	5.13023761223496	5.357580494718235	4.677969905905373	4.939389002623128	5.477159011537374	4.805877127760396	5.298464234066086	5.382528230745695	4.369959158921713	4.648539579675696	4.600116849765145	4.7051425167169425	4.122118440734328
Zci_08144	1.2479122206562154	0.9389118658773536	0.7914114924323282	-0.348272002119299	0.5572331330157843	1.1097705751980174	0.5452697907906437	0.4456746977730913	-0.6466535589960855	1.3128198034089766	1.7219013174223556	0.05801454815073335	1.9694661805825244	0.16913323815689885	0.9060840333671316	0.38853913636408965	-0.12857338732678902	-0.34138033686772296	0.1799189273475328	-1.50328715875526	-0.9489024740546436	0.5925594822116493	1.4116590990101283	0.02531240293047647	0.7685131275602325	-0.46270142924885627	1.8719614868473815	0.36167423854115105	0.8978837390752155	1.7904948436596542	1.5923041965503322	-0.8766395660596383	1.1255914869521109	-0.3590106021561403	-0.1819876278705123	1.731347526861416	0.7366332448769719	-0.21439251750298216	0.7366332448769719	0.3947078223265191	1.1021271786807605	1.2380338564625324	5.881252442267948	6.350175402013101	6.856358693293056	6.627755296019785	6.69934510392921	6.561529797711325	6.161180570106825	6.34764140370014	6.327848007196093	5.805496871331875	5.78567630629454	6.974843058602806	5.043934450403803	5.915418435535979	5.574947076066288	5.92513869759913	6.161806859656754	5.280355279339991	0.7650890623497213	3.1260066375017597	0.11269709062296254	4.36516957692655	4.7234266601227155	2.4022852541473316	6.31430801578883	3.3534155736293614	5.107504459663405	4.2097182509735775	2.9436859208245663	3.3521026314681293	5.473643138937699	4.132975023780256	3.3590252282253026	4.5858141741486955	2.1221682898101726	3.3831272733632742	4.25592830074337	3.1804550363304966	2.730386657554044	4.111799890569948	2.0701436531289596	2.2853897975978934	2.7518604831345836	1.4993200264191655	1.9413352750090795	2.3776995869915156	1.5665637385017066	1.2910763359135595
Zci_08514	1.1963142923568506	-2.564376132342358	1.0518296802110456	-0.14817346039027582	-0.5869586552183413	-0.8698106431247994	-0.9208136733376836	-1.9327359606390555	-0.13789027545504304	-0.759957483084089	0.6396594940145351	0.5791058283679353	-0.376786898279208	1.194929568693118	0.43095430651300914	0.893228144442836	0.21585741189913063	0.4842002737843753	0.21072528863841536	-0.4042921770453597	-0.19704059531696208	-0.5977418044348864	-0.8578954320025397	1.1273292358963336	-1.0852207313566848	-2.904322868356118	1.3808321472529563	-0.5986427228540744	1.053607347986114	2.2298083574082477	0.366159885735081	-0.2345799326670641	1.058958650587836	-1.0522446819015006	1.0397806196285586	0.02869533684824309	-1.00506906170759	0.09960125112930768	-0.6128828311790173	0.9375725066197812	1.6687706802638729	2.0735003802711507	2.737194810299171	1.0244940240706213	1.2813764909574368	4.062632579702579	4.164451594500555	2.4604823808755083	5.296295991867438	4.831994586337552	5.589164783080852	8.39258680737986	6.737645019814038	3.968507735626802	6.671458079709566	7.583622081310623	6.487395950964799	4.671320435644339	6.10865598490382	4.769811160313069	-0.6942605761372073	-1.9957464705332824	-1.0645490518966432	0.4111189900975848	0.14307655914000256	-1.5513223508302256	5.547492390296028	0.7111073061913578	0.23194625679236952	6.126925724251137	3.798536002037027	4.4639705161823295	4.158614562841433	1.7477165871458804	4.370789150525492	4.283348535338566	3.3413924597895757	4.605696309449778	4.611188983403913	2.6855383374175243	4.433073969109883	4.6717373992247175	5.023303800535744	5.949715212464757	5.290223208237982	5.0974367626911805	1.236229582999158	1.685766899628285	4.961233573421745	2.114989255080693
Zci_09149	1.661416635470427	1.8233354280520464	1.8063985297255387	1.3994331779073377	0.7374830581619775	1.139019170920351	1.597409643159665	0.3627085478499854	3.400990483476623	0.03687864830282982	-0.2893119692544326	0.972754300841992	0.9781440001060318	-0.8817290174331675	0.49387500746524937	3.108263261085719	2.884567391548709	2.020044064109358	1.4369262856569796	1.5109106041938345	1.2679667875436815	0.5511309830721693	0.3483364489008434	1.6286199361486005	1.4915179114569572	2.274455170843299	1.944513326382712	1.9735803699283616	1.5473474407133394	3.0793827397324662	1.5415375542379337	1.941217029923456	2.131627292429582	1.145848071843389	2.9661142086018644	1.5446884005478685	1.7799982363346705	3.9339663697689446	1.320572826077974	1.8695397730560648	1.7667025357149162	3.163373389957437	3.202192640991347	1.5243973036081229	1.1845100258022438	1.6214146914529282	1.357227947277022	1.7870741717307597	0.6539310677446725	1.8070512057885952	2.552443885670795	2.559157594331087	5.381987731765339	2.117218757423381	3.4851899341472916	3.2201222944780485	3.233652352017307	4.2032567458390915	3.5251057240844506	4.243823295277451	2.154162776425669	2.3072285413473397	1.4602041621739967	3.655964630085056	2.394873847438984	2.065036513660596	2.6609117438417926	1.5362151478253272	3.1211330185936874	2.6953521103419615	2.1281350439057194	3.8372281763264944	4.2384707759658955	3.873405958559552	2.9255047282446585	3.975498498726537	3.31173558771264	2.7909335887708577	2.9327182765704336	4.184821668615386	1.9640509232374208	1.6951446603718572	2.1912305748734755	1.4923808907052931	2.102147062293197	2.8748377570566777	3.233757800687858	2.792769713770689	3.04163010830547	2.63083150478297
Zci_09757	1.380340023783982	1.5158055237989567	1.397599133178137	1.5091855341086973	1.4061099463148905	0.9286715093577944	1.656903765227402	0.830944798120207	0.5648632171261706	0.8458381773240364	1.42389866341103	1.2099407074184825	-1.2650672157143468	1.783092316837828	1.6653011322801672	1.8445826273457364	1.538769444202987	0.9243790963326932	0.9498394817583056	1.3515905444353438	1.9390874172017312	0.6344026577124432	0.6344026577124432	1.6211852577137118	2.152185343849535	1.3893739827534466	1.218039808612078	0.6328985346225582	1.966023170641712	1.6795568346315777	1.6830293257846076	1.02234816847953	2.053738295665063	1.1595312539849076	2.1970784977561166	1.6385067041350778	1.2337512172706502	0.6644573981177524	0.47603539470370054	2.3100174111464264	1.273064513002191	1.424028639444738	3.5387324802472246	3.4818220630586016	2.554505944009582	4.252080958652195	3.530022433334117	2.91399413011037	3.313805642804835	3.199311300004437	3.4954528221517345	4.174343039305529	3.95813133498322	1.83996252072805	3.0701893531000555	4.378928663314992	3.815228820390878	1.8875933946244945	2.747684775775737	1.193570264898319	1.404977870889753	1.5629921859186342	1.6159522394041774	1.5226323776845638	1.796008170091433	1.8441306575196863	3.409820186613261	1.034797042189396	1.419577318004817	2.4687654013140654	1.184135091865548	2.066086129772103	1.8694691494403193	2.533223351532088	1.969714433689487	1.2850804495366064	2.0561453740172757	1.8920735960073576	2.001236054386186	1.1941678283997192	1.515238177336124	2.199894426461879	2.05491969214755	1.898782773404199	2.9525550436959587	2.6069618295473345	1.7593390433295597	3.2714131192440528	1.9193144660098187	2.584381068895321
Zci_09865	0.3254388909340338	-0.445412879710436	0.6986105850025881	0.2726817976498562	-3.265221672159224	0.4831255570519477	-0.09202663460142158	0.7643507732875369	0.3828641363715096	-0.5894455631877902	-0.4819342978320514	-2.0371776788135585	0.9060840333671316	-0.946961517324496	1.3296002030311376	0.90173681991093535	0.162684456054613	-0.3915716391798986	-0.7285006070406016	-0.8578954320025397	-0.4042921770453597	0.2994194141260131	0.02531240293047647	1.4030523290903665	-1.9657623155632244	1.3429128948460072	1.4035833503759203	-2.3306375838822184	-1.0809213265450368	1.9329314892526828	0.9792221904355488	0.43423858107027186	1.3990417502562522	-0.06867580123984249	1.0545444498906702	0.9488244434742972	-0.3773763850393842	0.5447529250255846	1.2802424516345965	-0.4208346958960485	0.8680816144407777	1.3054146194512215	6.108231077996729	6.200576342394839	6.897122486362787	6.5646776598098375	6.833406678418804	7.386082386458045	7.095622452900895	7.026189920019066	7.022151722610172	6.587744257710101	7.094744017855896	7.288864264848712	6.36345013339737	6.791005760314722	6.774385946752671	6.720715869180785	7.3955503195998045	6.999935853409354	1.0491487836933602	3.3854373638694493	-1.1808202040148086	4.881469357508241	5.583516405140049	2.604278144434596	7.202070290871808	5.780262186434072	7.0379690308793	5.414240580229027	5.52249372079871	5.455834498239245	6.824637072659756	5.590249799281698	4.575149971825014	6.782932472840146	4.967539273848185	4.825573910466486	5.947295580421065	4.564494440638232	4.34895912767728	6.311684086616287	4.519079117647879	4.391631556487135	5.105186496750043	3.1435678903370534	3.620813793129098	4.259711887631802	2.6124402815191172	2.642615743214135
Zci_10242	3.342773322205377	2.7421441116310437	3.4287236870006597	3.1190510299427103	3.194816845696238	2.9405426334121025	3.200383251522627	2.2978862129125655	3.0791213554156007	3.209509300739642	3.3402240788400417	2.688586856715225	3.3050541873474213	3.140735216781066	2.718435381898079	3.729935160881781	3.3970527330715705	2.849161213563733	2.1946903025120217	2.719733049089946	2.7483461763464274	2.4485378294967868	1.7879177909113204	3.20172727134186	2.079051562332305	2.6699164392849264	3.6504032684017576	2.9988627109492736	3.155352957103868	2.677752364429685	2.685129957770618	2.8251179191411344	3.3069931510184647	3.00871552641235	4.323172389528879	3.105844321634114	2.934470280864056	3.036987034802729	2.0716039937113164	3.389108674795214	3.523336406171446	2.5063561074848395	2.671594316373712	3.100764888116817	2.7712548886440325	2.971032383752509	3.20534717931886	3.355458991474438	1.5228642232737275	2.6503617154207335	2.123357722176597	3.139455900710266	2.213063395355885	2.7591356263708007	2.016476555308216	2.650357423479184	2.93523472830749	4.149663119854511	3.713511355670929	4.880245873934458	3.14516198596386	3.297399296938994	2.072460596635192	3.2365707505405807	2.7957244755898647	2.8743142388423615	3.006289810696196	2.9008059186945543	3.2900356438083627	3.185227699269052	2.759261753829602	3.0274865319093616	3.857436700582336	3.412213375308887	2.6351055928934644	3.2944752634823966	3.006227805287131	2.3400823832679825	3.6671311879723296	3.045722037101181	2.87490949912226	3.0775006916612644	2.9703067440307227	2.553801648573361	3.651304365536871	2.4952511905078523	3.07091224894402	4.314605876898916	3.0615493701921377	3.35932687348604
Zci_10454	2.0872252313291675	0.966946737346034	2.2191779538039578	1.7950359310298192	1.660407917997998	2.221337382852965	1.1814694289787744	0.09064313012086855	2.6282536522296795	1.9256893087648197	2.084317846687817	2.389320029807271	1.81853786651842	2.1547144848326885	1.6038322084878731	1.8737862026848684	2.186223356808808	1.0724489483883908	0.6939693181463306	0.6507907910631723	1.3428132621690518	2.0191186366063687	1.1273292358963336	2.215514346914708	1.4035833503759203	1.4975799821262192	2.5070138584022104	2.1375175674606113	1.1100716050079007	3.1320732838471357	2.005116431925295	1.5830801252543276	2.616865656069019	1.0397806196285586	1.853386669930791	2.603508891074665	1.2521406463685645	0.12242307043437271	2.4014802627600624	2.0609420948632367	2.4642625426189593	3.590187806539138	7.475650405179368	7.959130193928929	7.932467749467922	8.008797010712271	8.554024531527096	8.305539254984824	7.497350250948744	7.913724996259871	7.765330175934801	7.483164346101163	7.727860452911993	8.401083692001832	6.207193725326201	7.958523966625884	7.505507210134502	7.404832434823528	8.250485595057137	7.2915458456337	1.946287889020394	4.436529533677227	0.9184660365137388	5.314037801173366	6.116291604594149	4.0417708180662695	7.356878944861505	4.987175169510785	7.102891507946723	5.6310898335622666	4.778686456669175	4.883985044760493	6.892176540107755	5.539680426719403	4.415071152974304	6.501989386407177	4.440592583151572	4.548328443534406	5.890227405777607	4.888925814360036	4.329934686595693	6.1476294613048355	3.948301089636282	4.161528965678065	5.315682051995879	3.2079874792702907	3.3212476502678276	4.153625537932112	3.933817733605299	2.9650000709655275
Zci_10568	12.638577859748722	10.50946485715516	11.270761022818288	12.364811352883224	10.819932631146935	11.20186889495681	12.059842455562627	10.656277857751068	10.78001171790108	12.22530859480683	10.90563164418642	10.992879625238906	11.961357487890696	11.138341583136452	11.296415160847827	12.350531491734175	12.134942796806996	11.281978285968693	12.386566121858298	11.957796815625851	12.69350051701582	10.229884392672542	9.778838838784516	10.198821033481725	12.0500174198326	11.237331597004925	11.561693095003497	11.491048290106855	11.955743346050124	11.586006396869529	12.010883760977322	12.302006870069231	11.290817164673951	12.42245214574337	11.328933525933008	11.103782475906984	12.765794540805686	11.718254457424436	11.205716404080922	12.3245021835719	11.82860937335122	11.596776171953296	11.294510617417473	9.97381071092936	9.419208151246838	11.099493580455832	10.436943764203413	10.54341905153738	12.077998540426922	10.88429402857656	10.741608609808164	11.59352338338704	10.91484515584246	9.327280100261431	12.504186077855987	10.82892824714724	10.562923625386595	12.63313566579612	11.490699461713284	11.682191229319038	12.717100872338529	12.025408529925825	12.025408529925825	11.998399173991483	12.203743942129762	11.9283501505246	11.139692064429566	12.315336617153529	12.61252148035959	11.98370915776063	11.86030299175735	11.98370915776063	12.111709726164348	11.779121776942048	12.630904036841551	12.814562230857758	11.787088191878896	12.43476446358924	12.68380856712947	11.962368584051662	12.57496550476236	12.196436203613432	12.196436203613432	12.196436203613432	12.686362242147911	11.872710744698038	12.583631069793013	12.987962009022976	12.229011379495	13.1636352122126
Zci_11016	-5.174761729352031	-3.7353491226615305	-4.404014808621193	-1.67454717960759	-3.265221672159224	-4.819821587124684	-0.27041733577968313	-2.883681057387204	-2.883681057387204	-4.191735833394646	-4.737914941720181	-1.8664238214796829	-0.1043131567978407	-4.919923550648951	-3.290121491018432	-0.0759177764750978	0.6060515495604535	-1.9953687094481296	-2.2597004583312157	-3.9299481879152776	-5.274402861183563	-2.495989190001249	-2.2597004583312157	-1.8949304536943212	-5.159897638052481	-0.7746308389124476	-4.8338428719028705	-4.066689270912361	-1.0809213265450368	-1.2721895063326576	-1.913747302079987	-0.6025102977597376	-4.420247938802873	-2.870064570547908	-0.1819876278705123	-2.646137185774472	-4.412367948694118	0.06375446621660313	-0.6963057899083153	-1.315102316802748	-2.669362391837039	-0.6657219613651013	-1.0807132472225094	-4.168347515423116	-0.3438634789120467	1.493199656030265	0.56858053273376	0.28712175357321323	2.4643469282261634	2.5498956757601	3.143829672788836	3.918373768632344	3.7338769070861417	2.3960297555111927	3.6599332583207462	5.012266656558841	4.014033943746825	1.665005793208484	3.018828382920045	2.6916518015443565	-3.1447383857683313	-1.9957464705332824	-0.9515420120171686	-1.0450210387274217	-2.239360682370488	-5.344527442731076	2.7130362146803746	-1.9648387376864087	1.277397549144208	2.9058556112537572	-1.2546800218095238	0.6327138312313736	2.634249313211075	0.6616616484896347	2.557178945311918	1.4814346207164404	0.7829184187628376	0.08537139917200676	1.2988475990170825	-0.2853099822867007	0.6683881837003776	1.8693638816195215	1.983073986986665	0.5805737732275758	2.6002138425615064	0.812565923557283	-0.17558616985476144	0.491780529339006	0.9858595553399194	-0.7181451247498976
Zci_11041	5.953177712508114	5.472473704413988	6.191757000459378	5.850061938253397	5.464608620412751	5.994735032753217	5.595545700667741	5.573487727088892	6.167373408658303	5.745723340995567	5.897961772179239	5.982070335176984	5.549110175808486	6.0215456969140595	6.111728823022452	6.276386500393066	6.533117877487061	6.926096473185001	5.834302427392366	5.7871001566963605	5.575543796291352	5.633656456577539	5.420787148479212	6.2196950390256625	5.380558656927156	5.8193637829386216	5.913389019719627	5.594423318707881	5.688436747249148	5.88231488063378	5.500744484469693	6.276433731093876	5.810731280984947	5.644868153754068	6.862425426008638	5.994618484536758	5.830703942736257	5.843315657992504	5.775543363458428	5.85974159675239	6.159790125874852	6.016337911755908	5.768448720017695	6.0311298109276885	5.987614423149739	5.995875821954307	6.011349890311152	5.702070463262966	5.715083791462105	5.535079098152914	5.9016019562803	6.001387766735986	5.957434876160129	5.697780784559571	5.8804562310306485	6.00342499879972	5.929721708880935	5.891080899220951	6.260389846190416	6.489202790403627	5.782162446999832	6.0653490894826305	5.782162446999832	5.610295916897474	5.382479789897587	5.457713410110244	5.752236527715499	5.219633706982779	5.322987222409579	5.679913646758674	5.56524220619388	5.216432354387212	5.66257646936187	5.987794038802837	5.663217407007157	5.559953184764066	6.103013835984182	5.699602863829231	5.419723211112549	5.841710365005921	5.453851521066206	5.610335544839976	5.904845353986142	5.807272678282975	6.31742384322841	6.139037102389064	6.249984432009676	7.427083569992363	6.40488560830819	6.7504799097685595
Zci_11426	3.2805050762707646	3.1844297106729895	3.5499453314473253	3.18469417588005	2.928607429997245	3.655424120406301	3.6298933005890666	2.9107993700615373	3.4890974017165535	3.3154711684177816	3.066030061065313	2.99392185995313	3.7757131633523886	3.2611504727016594	3.4198173457476853	3.2696843436363694	3.2820060715011294	3.5835489392409663	2.892630510221638	2.178428542874629	3.1133669832332824	2.213019915231353	2.202950362136907	3.1636171680965743	3.1989181647663805	2.8021131480324226	3.6396947372454616	2.8896282210268778	3.3287303340311434	2.761687288115376	3.35809961736016	3.1113357016932466	3.436696042455932	3.5189797860933067	3.2447581545794963	3.2581576448370444	2.9533420739488623	3.059436153313111	3.134097734152196	4.026004642263235	3.1694431935987333	3.868116309961236	3.164764272724922	3.0018310517141837	2.8683159693048337	3.368118025084134	3.679304599239395	3.393168249051478	3.357646321684906	3.447583964438303	3.933814266272252	4.018129783419538	4.141625373538253	3.141177579964183	2.397068323750729	4.228921981988446	3.724865428393702	4.35979107087892	3.432591710406151	3.3999647527212056	2.988819901869441	3.412087876633185	2.9678371969803874	2.8943839766843347	2.8028326084654	3.204456927465089	3.254164102498919	2.571524558182195	2.8459487163461277	3.5824030748641262	3.269507147131526	3.3082387733457876	2.9100131755700436	3.3697570243846946	3.5630895293773643	3.528156934631116	3.408297685362514	3.760318191468071	3.040766401174382	3.304394289042081	3.133363531944294	3.4070474194832068	3.04944336309254	3.119558400738169	3.506761276202188	3.271847004113347	2.904490355777981	3.905915078218011	3.898081442733279	3.315638717424441
Zci_11526	4.175697438399216	1.8143410755025824	2.9758921482678224	4.336462357529382	2.2481060006727995	2.470211148564737	4.39316706212512	3.12262328495952	2.6835146753624355	5.234883029918069	3.701912760600157	4.009986307503582	5.115883188604561	4.95687923396385	5.898057563988959	5.869767807234077	5.804782143227357	4.638796638271742	3.8842734662960385	3.640072682504094	4.588310440066691	0.9950768247883804	0.3208014535161801	1.716119856897662	3.922150104777419	2.7225200990023315	2.4388403678754393	2.670649707614816	3.359926139231072	3.0958588844904056	3.489647661266727	3.004873601648545	3.2389495081607422	4.181006555892283	-0.1819876278705123	2.707862710426723	4.781136078112382	3.3523743306076788	2.201958059301615	4.2873946570312444	0.5905750851891934	-0.19020183358773743	3.2201899770454454	2.042909453147427	1.4400090925439513	2.162674818818949	1.992518771838668	2.686414732680124	3.747040677517014	2.5033202145551674	2.9120975575578014	3.584865790158279	3.9733492521161216	1.207499914340076	2.502974295747511	2.87877009693355	2.084664232900651	2.255840786556967	-0.0253844890271581	1.193570264898319	3.7095578972888497	2.661046733626282	3.789087892315048	2.8501349958071014	3.802837382923821	3.906351761202828	2.5944560301546495	2.998657767147466	3.215168329139516	3.208042773290125	2.62863767670654	3.1954692144856445	2.4203771632234647	3.2314059943948377	4.1695563290103514	3.4031311499160677	3.466677440211412	3.6963533576297825	4.6075952638075215	3.308895592609727	3.539434241858716	3.980134082378625	3.6635989952668058	3.855293556452412	6.706313111706934	2.6411094117895657	5.351233366673013	5.603580709877549	3.839673754787657	5.103085172743064
Zci_11790	0.8563767331111364	-0.05444385418636512	0.7383211258608627	-0.9436199857510608	-0.9436199857510608	-1.5335399135421548	-0.8468234924554606	-0.3903994490793687	0.23732859849755383	-0.4819342978320514	0.4084404655916403	-0.9331782808954256	-0.18193466161528585	1.157756232443335	-0.13680909426858998	-0.10009490604059729	0.8279556880666795	0.982899930915801	-2.7036408853694347	-1.4308551327731265	-1.7137861987629843	-3.711339281144964	-3.3443803059148465	0.8159229015905517	-0.2740531214083727	-0.24477536133008584	-0.381066492506176	-3.7540946917255447	0.4316898567239692	2.0861897025810223	-2.5327955748738447	0.4821181844363304	0.31712264417964386	-1.2601198048537048	1.0920022387601351	-0.4393429383733716	-2.799410757073377	-0.9133959466995673	-1.00506906170759	-0.8079553816942816	1.7707135447743605	1.3167183345089886	1.6013784691071944	0.5008380845483571	-2.215961706250762	2.6788233001623314	3.609827221207597	-0.47190286442520785	2.871007837933805	1.5013222459131554	2.6214964318739624	7.033759700271443	4.251559820914461	1.1271957399134036	3.1928634267080307	4.645751304651508	2.9076104567554704	0.9059027217427306	2.6373480425211735	2.602996982027665	-0.4094661797291333	-0.5237488809801427	-3.84687846063149	-1.5513223508302256	-4.932965446760476	-2.239360682370488	2.097295731639256	-0.37131217294468377	-0.4100599135896784	2.844954728212788	0.25821896163570296	0.7852266367655744	0.7071569744666817	-0.25905692419139986	-0.03943320170360219	0.5136840641667471	0.7008080270715659	-0.10396218919246064	1.6103709391507224	0.5742234221676566	-0.5882840727715327	1.6428782697757227	0.949816835140339	1.452022070910042	2.9831184342106254	0.947496268307903	-0.45228196620207994	1.144580342223932	1.875833811200392	0.1619480008287008
Zci_12148	5.419666503425943	4.679540947161909	3.9613532595598815	4.510041307775511	3.862725601402543	4.741209222520242	3.875467282116032	3.76887684907149	3.6642691114174455	4.979006148722271	4.279371363708298	4.2904168655025545	4.94163283235171	5.160262073693691	4.012384967199244	5.333850546072719	5.025013901441273	5.100979583945818	4.84911612416719	4.16299530296793	5.437186907789416	4.285709417966925	3.97319248838713	3.326506882784928	4.789654922132091	4.144260952369699	4.628290543958022	4.840476412454763	4.2239290759809816	4.4201154955081545	5.906651949664354	2.6567374744439856	4.223428084508966	4.052977461956596	1.971121771759306	4.559805536386265	5.102846465277239	3.5290888391511124	3.851348057210576	5.145659732597501	3.650437391302865	4.831488503706221	9.059513642544315	9.278107675970311	9.605838380143732	10.05906007147473	10.537834018795635	10.771350274186863	10.978846277769868	11.160242627456183	11.114182163882164	10.67250047155143	10.628447790238276	10.406531389880598	10.865275584398717	10.596791216446071	10.714890700128148	10.318067862346515	10.310936591935976	10.457543590346273	5.914225324590752	7.612696656569546	4.562927212978806	8.705827608827972	8.770818899883364	7.063374322827658	11.068587332781584	9.940799159623662	11.696811317917131	10.321876904695753	9.095441678261576	9.889502453929907	11.057597024319977	8.714505265871916	10.143258752088247	11.345536173896482	8.900498132863861	9.478436126694383	10.888741600944613	8.61451679243487	9.485334686921629	10.501836379988957	9.469469654491323	9.59634377608182	10.005950334311215	8.800382075643093	8.970177492083652	7.987133111724403	8.464529454342962	7.604797447724988
Zci_13259	7.739426421138935	7.454282397707464	7.290267117103096	7.88872442438674	7.168599786475761	7.247033616742327	7.6199045972473165	7.31536470445843	7.611897601296805	7.977539865117725	7.591525791271643	7.973473986461347	7.821772679126933	7.58616244101802	8.260206896008835	8.780552276186281	8.126417523117187	8.188686470845314	7.675571514251296	7.927088179663672	7.828517840066514	7.503933518868363	7.0014739553116065	7.112175138896701	7.343390257147049	7.741795900158704	7.707736898237901	7.307820329912415	7.8297902131973425	7.391696169101114	7.337023746637826	8.143613149408887	7.308224418375632	7.618221414874826	7.572514901582675	7.564580523941693	8.334820479240912	8.094083084940898	7.911095749786098	7.311964389843762	7.013533224054748	7.766742961812982	7.20124625778699	7.162995841120009	7.4219207622082415	7.147639201351564	7.159137095822488	7.186181551578305	7.6291859737051775	7.421777480028619	7.389159064175216	7.449792245511308	7.418839570318704	8.00478397907962	7.868669397071282	7.576538526967872	7.655348653779754	9.038536772119992	8.625008890055105	8.581174706785168	8.01709405094745	7.410576973493272	7.639257016415241	7.533742648393948	7.8215259454900705	7.530895396891664	7.323404485222279	7.929846174353917	8.236547431547253	7.322703768081181	7.9632487483854835	7.865618430444203	8.362958669388044	7.930511292485419	7.923577727681024	8.746434978526768	8.106953596919103	7.886882654583268	8.779596169417399	7.487745856660401	7.735251981799257	8.631707892476733	8.446698433612985	8.131831539241036	8.724805324098778	8.182688594360458	8.740135982083322	8.869860550673694	8.028100211480572	9.033946368520809
Zci_13485	5.694841133670414	4.881880188461028	4.997551812913908	5.652508428988574	4.712048197166709	4.866172581388847	5.597658737917287	4.611347944715512	5.124208754442044	5.965828658045064	5.303410490636563	5.989408456428667	5.781610965744953	5.686112602664497	6.2172019373753535	6.964108454919551	7.063755792458279	6.613470104535551	6.240140646970894	6.231254578728586	6.275799461751566	4.852922054440823	3.624577337036149	5.049106133307698	5.096733273861887	5.4650066377713955	5.498452502931839	4.975759223465652	5.657159930725604	5.444198444271502	5.04165615178377	6.66911246445938	5.524825289342604	5.942280797395802	6.077839799343431	5.165191129884324	6.723148133861668	6.616184948895544	5.615790843518105	5.603901650380342	4.929650950291013	4.669605706779495	5.401073567947829	4.890650553444793	5.118406174631804	5.302614049776107	4.914641405608141	5.222056693087318	5.82419270048224	5.229454117213531	5.404282558682275	5.498839239878103	5.2810354988168635	5.927810666017219	6.507500348816583	4.978597830058608	6.320067297535511	7.217484974264105	5.864279867339461	7.68363615614839	6.287398748550905	6.245831619232024	5.2974683976961146	5.5775815634570245	5.878667343855639	5.341526998052737	4.951829324256384	6.15134510870336	6.326612840011271	5.140515577048412	6.047613816586209	5.656647529999122	6.37148440749027	6.255599146716566	5.904504304890927	7.79094318724667	6.219955780984482	5.774792782584355	7.531246449547558	5.7439624358635735	5.857384953739026	7.484501618445518	7.151906944678164	6.259025321439618	8.877484398691331	6.0669352392507125	6.95744200406575	7.998421025283411	5.632528172597134	7.475662213644576
Zci_13660	2.954485623169791	3.9301985540048494	3.355830205748328	2.5255751599249407	2.8103193193995346	2.9088378445466136	3.4612730580167206	3.372099663720426	3.2150587287777426	3.436988827402874	3.0745415010057204	3.6525278814118463	3.810987538602665	2.9596445252931733	3.789601478967941	4.165360092738422	3.838785881006199	3.7720397994852606	2.9426598851770835	3.10231629434404	2.9701657077824666	2.4640670662175017	2.808137505593872	2.613063336936618	3.1752882414093904	2.9376422949177567	2.76402393577703	2.980098087596269	3.747575888255975	3.1195324659636157	2.7621551534550655	3.0937979693038153	2.219429959736708	2.8226258553481576	3.512790262627808	2.820094354240235	3.2781269730972102	2.7994239662078617	3.080349439798267	2.4661072035873293	2.3603640118378015	2.557488490019999	1.5243973036081229	2.263324774879902	2.7269929998167415	1.4306738105612835	1.8148450869106791	2.3937879027762596	2.6626458295091906	2.188511641433446	1.8070512057885952	1.8368420578892823	2.4754819238534993	1.5162272223272464	2.269967886033868	2.9006631985274325	2.0772881424927805	4.373503342115591	4.104467830112025	5.128843101162293	3.491368030363527	2.849197021544847	2.73273083617164	2.7998252791170946	2.7414292923446957	2.4628882135620564	2.226150353897498	2.905461618482377	2.4311273734746055	2.5911898745063864	3.1611592419468004	2.953957709377044	3.2777484366730696	2.966658638591342	2.972086442311062	3.598401342531578	3.07728096016594	3.270807777083685	3.5505875141210845	2.227702233913639	3.2589671669726146	2.925014165418408	3.16800837004684	3.578192597941211	3.425230109657984	3.230627930515498	3.885401070875392	3.7699629413153017	3.829560342349592	3.9654352012199783
Zci_14053	10.265199915408449	8.699626235074607	9.442940338357086	9.819325731032054	8.459028470200387	9.185188944809209	9.475135268651863	8.659821801147869	8.808329150581015	9.749034222039468	9.271922481218096	8.887104757278887	9.60911939618648	8.704759124726385	9.032822377588412	9.840720951807702	8.944315739544557	8.51893093728587	9.550811509239978	9.544559260191589	9.869960094824773	8.969469778394357	8.086686177741656	9.269220011131193	9.495182526900406	9.638934763675952	9.296436935167902	9.429819552559277	9.31272538064101	9.72346105661572	9.405844415371126	9.235927062502498	9.467714127084982	9.456204633427948	9.331932966942086	9.396919677878351	10.080254925886484	9.761784994284351	9.56965795170826	9.542947539951118	9.96098058494715	9.679063322386671	8.977697436873182	8.4183590396713	8.694247548681066	9.121548023110568	8.726732767659598	8.811484490483938	9.38014350653438	8.640312569616496	8.854433376115656	9.366822968926558	8.928432132225309	8.774454565121435	9.867472478028033	8.828649744895605	9.671508812345207	10.05857548515692	9.601534236236803	10.027455151287054	9.756586462408409	9.985739771754876	9.657720041768204	9.993837223240796	10.38680959622435	9.754092899805345	9.623938411865256	9.839440255760143	9.99658803608479	9.71133657066248	9.51720491093258	10.29625747714414	10.325266485243056	9.769675400414457	9.888215263018138	9.888871634002417	9.785809223765098	10.11820227549362	10.277501026475685	10.170315670884614	10.027400163840657	10.08018514802584	10.073790473420225	9.856786914975968	9.660120582524588	9.877725739263315	10.348634037176035	10.210001912014445	10.271388077960127	10.176574598172214
Zci_14179	5.165870942460957	4.2611103954323175	4.249938823611497	4.610898107135262	4.3623865640220805	4.606597345015521	4.975898777643602	4.375461342768043	4.561931225158476	5.525239623725214	5.026002148359174	5.026703237078639	5.312102529474087	5.511146750689621	5.774478341556511	5.570278094835551	5.217292772033437	4.907998082614463	5.079575348607214	4.504382426302589	4.983576024144071	3.623867780875213	3.7844326232730983	3.620037327824284	5.043536907128106	4.682087441584144	4.803867190712639	4.504189164897385	4.543140779671881	3.7397733636010058	4.830563653830526	4.494748675924337	4.244483092835736	4.543675186216018	3.5266811831927622	4.139413432998388	5.223775494142054	4.611857989104626	3.6008513405355425	5.137343469254127	4.023949816341043	4.451370914276685	5.514182778152452	5.413544385026699	5.745785238428962	5.99029926415847	5.856079117896103	6.22561481973508	6.0379976079408095	5.882352277163165	5.887646165463821	6.037327970975659	5.820148709384102	5.4068663071001835	6.109967290553651	6.189697626369385	5.762504981387287	6.1416357820875	5.527956406677445	5.636368162155582	5.414610456506693	5.617256978848136	4.6326342871352395	5.71041602805108	6.125076924403055	5.346445719146931	5.796223327621574	5.616848390167655	6.256802211710816	5.779964672749857	5.564763908358362	5.7155030001064535	6.1610884676529665	5.725163326269517	5.856240295826842	6.220446533692335	5.43276286336484	5.676905957299102	6.452731763742621	5.751672186260988	5.632794293725444	6.178438277520396	5.5894610710974755	5.479454739858081	6.293455606642951	5.135050337078127	6.045123315774373	5.6916880683648685	4.860063427699913	5.7718656757292255
Zci_14825	4.104040043677367	3.3719127332347005	3.499574210751488	3.637672027687685	3.4226865918607725	3.402373606949285	3.0232551377464607	3.37888690370886	3.305176370316964	4.050681095315519	3.5839219275250143	3.4110835334537986	3.8946564030724824	3.198392792692203	3.5122743464662083	3.958353177090443	3.67735206110762	3.619387671007016	3.5678513797441704	3.170695331363618	4.1303026267698195	3.633819446644147	2.862297434574426	3.1272552425098046	3.407740269705577	3.762800044453241	3.2518166778204365	3.323518986050464	3.6533242171643554	3.1892869014886527	3.5370931131882526	3.571125101505288	4.064723327245555	3.8991276821327823	3.318720391471443	3.53394426752761	3.7545158932082217	3.67794687897554	3.7422127721301903	3.9338768905025656	4.061521414242096	3.72978165763336	3.3770826726324046	3.9259826125453863	2.821717115811344	3.8157866831715106	3.697814444145056	2.537568219586869	3.579364478915632	3.6319780642523263	2.8337609199095777	3.987269606297389	4.022937304037981	3.1345974224383526	3.305739544417098	3.518898509582883	2.8540466217570444	4.4192782398093975	4.98950117589825	5.22424666383745	3.911642564005832	3.616191494575891	3.984547266395858	3.499492961612501	3.389591236893904	3.704051458924744	3.5573523081153446	3.38785729207181	3.806274638490669	3.8111327862456648	3.422430104002542	3.449262950828629	3.5327575209428344	3.2195971101377956	4.0230565685507	3.9598604914453785	3.6522189885189777	4.3014042207934144	3.3837149062793324	3.769502409619131	3.552174870896021	3.844703089548158	3.821836158368934	4.127835229867162	3.836214702720348	4.093326094898883	3.651839429085366	4.65296920907409	4.047953298289831	4.561085907306389
Zci_14847	2.754924819120824	0.8185970755330013	1.9596303154296415	1.118359147301732	0.611140839313589	2.531746389391003	1.867219364506138	-0.5886041268562846	1.2774386326683749	1.749592432378334	1.1869104451739352	1.9571474356740293	1.847941851611857	1.2170735306097076	1.0634549701472402	1.7358679001883084	2.1350295448237717	1.75252406878189	1.3174357549532916	-0.1060135652486964	1.8337060497029347	1.1016690452542182	1.8142091175503468	0.7370012622089236	1.1611800567537742	-0.20176689089787309	2.561110446161368	0.3961521099195987	1.0167975785518626	2.8172429574458033	2.0508832547733813	0.00145661882664744	1.9853174623197216	0.8828103919929813	2.559950242929728	2.2976218226588414	1.78301625639744	0.3090554500785823	1.2030191578531482	1.7563953113329456	1.3373178661040448	2.943778664201234	7.0001079377875834	7.086070742874392	8.03362105841873	8.137509296262978	8.838604703063965	8.570674541256425	8.333655568268403	8.397546775441526	8.572480590627295	7.27297971786377	7.394310982910634	8.027808930674475	7.070086790579506	7.447531572716629	7.75795140090506	7.188265489636834	7.582284699618203	6.522532255409719	0.8583000658703318	2.0499406690412316	0.46621655145771784	5.4365875248106414	5.964662423612858	2.606689999600915	8.12658454286617	5.838637164655232	7.95632729304962	6.438011828269643	5.27978888288926	6.064966503670735	7.728398799674165	5.090156647372258	5.917751069931521	7.944870941903016	4.8848618931575265	5.16494044478448	7.295658102953117	4.973838274795005	4.906224324149071	6.858367327153071	5.070392483829261	5.084714739315883	6.188647357944618	4.513314648410819	4.467164988730152	4.022404929099027	3.5274627672596472	3.0733817249951625
Zci_15831	-0.7889326960080314	-3.7353491226615305	-3.215623940308692	-2.983307474232805	-3.265221672159224	-3.468429045618964	-2.322890796343964	-4.8951909454346305	-3.303140805328479	-1.0357331684510651	-1.0357331684510651	-1.0357331684510651	-1.8888239967866551	-0.8107952897714962	-1.7810640211254418	-2.787479460876989	-1.1139987512933858	-2.9401994436286447	-5.274402861183563	-1.7137861987629843	-5.274402861183563	-4.030817959061781	-4.412848862964074	-1.4308551327731265	-3.738036518755928	-1.8190027785114489	-3.738036518755928	-5.0038329529667305	-1.0809213265450368	-0.02667124227038587	-3.625209260850084	-3.3580688237742806	-3.2621961298613034	-4.73500714426364	-0.1819876278705123	-2.870064570547908	-4.412367948694118	0.0220306850530311	-0.7895474184277999	-0.990590357479381	-1.204824289529699	-1.910952988502563	-3.003575979000835	-2.7975369832593113	-3.5122880923918016	-3.7112878510421625	-1.4953030231385624	-2.3042497057668947	2.8678472487705924	-2.1222804356840945	-0.20433026955517228	6.790339283339828	2.0433327191288773	-2.4774309898196596	3.9904560720356623	4.876650747566058	3.5081467996331943	-1.34908707108409	3.3354597084330706	2.0942742551220683	-2.942004529965837	-0.8229817836519406	-4.908524796882511	-4.651677445711395	-4.932965446760476	-4.214143011139052	1.9251968908770771	-3.838120190187205	-0.6209811026049836	1.8866903052532584	-3.409447204186887	0.6605005260194708	0.08074049438912143	-3.003835755380604	0.08074049438912143	0.16901442909717287	-1.0413324092671346	-2.9557605613572333	-0.5882840727715327	-1.460118903257975	-2.9985375899149025	-3.5453346412174636	-0.43547595509105846	0.9371334541295844	-3.474702589340726	-1.360934756077362	-3.474702589340726	-0.13393324400691753	-0.4596825697388398	0.9031988952599208
Zci_16302	3.4859384968327	3.213260487495048	3.4876737724327596	3.5037664515870777	3.065983241390436	3.6381422397184666	3.477166011525788	3.5743871385680483	3.475106705391433	4.026446035670042	4.026976022859744	3.7998355566387816	3.630772810738956	4.379333116159855	3.5171359703894676	4.556350025570864	4.327360399361388	4.182660303117091	3.20725270274699	2.894297921381884	3.272032092342954	3.321125065843586	3.1069531172098253	3.472235034998509	3.4173278934105493	3.284444827956147	4.322739891797526	3.1101461651897204	3.2272296969343044	3.819297631415653	4.078646823423955	3.288410649778322	3.5567969773995167	2.82822021512192	3.2277578040755515	3.858624675342561	4.112444105344593	3.3614698276787576	3.4272993446434667	3.4520490353720077	3.5348507888125797	3.215696247892289	6.142056083767502	5.624648151264113	4.912638168844822	7.096069437715997	6.765667107094641	6.590082880312238	7.71823775978563	7.409292573174645	7.848693795878411	8.616710198691413	8.494601088657362	6.924202857365719	8.428175082561733	8.683235871013327	8.482118369885377	6.931689299296665	8.071282174207807	7.178576511771696	3.33038994621112	3.563538298593977	2.578734589757258	4.087401199180596	3.900770292089524	3.173577355819228	6.87977002465267	3.201401289792509	5.087861736426808	6.73416083625985	4.049262292613837	5.0001486589722	6.676666855306104	5.206215324425214	5.746624290635087	5.944423793205165	5.12254179888951	5.2737283434350255	6.2665307147412275	4.948941942158226	5.237743922479692	6.400338129570175	5.16663495249705	5.339981219997536	6.4427417984697275	5.2738055076209225	5.0147218882466325	5.091323957851689	4.837487856443433	3.934656162145679
Zci_16336	3.4859384968327	3.213260487495048	3.4876737724327596	3.5037664515870777	3.065983241390436	3.6381422397184666	3.477166011525788	3.5743871385680483	3.475106705391433	4.026446035670042	4.026976022859744	3.7998355566387816	3.630772810738956	4.379333116159855	3.5171359703894676	4.556350025570864	4.327360399361388	4.182660303117091	3.20725270274699	2.894297921381884	3.272032092342954	3.321125065843586	3.1069531172098253	3.472235034998509	3.4173278934105493	3.284444827956147	4.322739891797526	3.1101461651897204	3.2272296969343044	3.819297631415653	4.078646823423955	3.288410649778322	3.5567969773995167	2.82822021512192	3.2277578040755515	3.858624675342561	4.112444105344593	3.3614698276787576	3.4272993446434667	3.4520490353720077	3.5348507888125797	3.215696247892289	6.142056083767502	5.624648151264113	4.912638168844822	7.096069437715997	6.765667107094641	6.590082880312238	7.71823775978563	7.409292573174645	7.848693795878411	8.616710198691413	8.494601088657362	6.924202857365719	8.428175082561733	8.683235871013327	8.482118369885377	6.931689299296665	8.071282174207807	7.178576511771696	3.33038994621112	3.563538298593977	2.578734589757258	4.087401199180596	3.900770292089524	3.173577355819228	6.87977002465267	3.201401289792509	5.087861736426808	6.73416083625985	4.049262292613837	5.0001486589722	6.676666855306104	5.206215324425214	5.746624290635087	5.944423793205165	5.12254179888951	5.2737283434350255	6.2665307147412275	4.948941942158226	5.237743922479692	6.400338129570175	5.16663495249705	5.339981219997536	6.4427417984697275	5.2738055076209225	5.0147218882466325	5.091323957851689	4.837487856443433	3.934656162145679
Zci_16359	2.671725043770022	3.178315379185818	3.051385282574595	2.759444805560747	2.6558810396555357	3.0329103329060416	3.4708706459818375	3.605453174705432	3.6020487822059657	3.837656099814992	3.5582680289939987	4.048002702287059	3.3089567648546434	4.07322680122818	3.392828440605023	4.1329592650623885	3.972360709647152	3.1936995978019107	3.819658753397478	3.439204427718741	2.773856620011943	3.124292095282458	3.657001187531893	2.6551194823492392	3.668535054042987	2.188898426348471	2.5416491149684157	2.2567207315546804	3.706187417504002	3.1463139206510515	3.6329065823145834	2.8194403474019447	3.2613221418730673	2.843961139910652	2.7980661803623197	3.0169666734873934	4.246763733818127	2.8485862349463527	3.5665557874474065	2.790565699500206	2.721632594535014	2.9056031046396185	6.194760827342303	5.56323398926205	5.542679092797782	6.786845043502372	6.771932202992141	5.867912437306538	8.171200456442959	7.663056102857213	7.213247507441824	8.111378334819264	7.399078494000789	7.180327465092093	8.621146437431873	8.25232421575924	7.832913545021245	7.216286281179101	7.493253329189301	6.726544761857918	3.751796753974219	3.2776309666085774	3.1260066375017597	3.9225582985008143	4.1645096301706355	3.276423437177174	7.446442631289248	3.705270673364043	6.0621700037853365	6.870129592765896	4.398761403470561	5.212817547337257	7.062936972261549	4.22088103829599	5.539101542316884	6.255563382742869	4.685043131725179	5.094702177194418	6.126911789250542	4.277293538209167	4.843646260047875	6.678759349042684	5.668649190179145	5.802035235535512	5.289214852829669	5.437650777133769	5.149486322513904	5.077697740123774	5.052747177529002	4.079408415020157
Zci_16469	4.69491336283265	3.179911609471819	3.648873335069177	4.339239453659512	3.43713283041267	4.285668642835395	4.756257761212352	4.288055429073395	3.6456482602248776	4.896985523883749	4.610953516358083	4.6009214536537915	4.42393244127504	3.8184608112478298	5.1889972165958405	3.918381456368147	2.7525631283978753	2.8195391064854523	3.6733845981679183	3.281683471665712	3.679980705086622	3.199054333418321	3.7020881676150577	3.807214667839043	4.470938583900951	4.824447996297813	3.899236650546681	4.189285322331129	4.319331598697564	3.7180970409046648	3.906710878446877	3.5063369090643324	3.434341419868424	4.112323483698419	3.898682074934435	3.509784910677614	4.726356156477609	5.06264667074606	4.69071562472132	3.6420581073815415	4.929363695430446	4.4113864013729644	3.4316396008349632	1.419597738286303	2.7457510649918175	2.8864261081550855	2.1668457307461053	4.448853890708134	3.2013135435321978	2.2834345169960883	2.8216735312403336	2.4063754585817474	2.7479055720902723	1.6297705382783838	3.4070035460362886	0.9731732139095984	2.87877009693355	4.40025977168065	3.6189958906340647	4.036793739964313	4.1165725866873	3.9734533142773967	4.230464313463148	4.8300301236132785	4.878093061870959	4.4227912280316595	4.073370989025677	4.0507811002035385	4.04838317510193	4.23409370651538	4.22038566220595	4.63321950207462	4.826462465746396	4.454145578422047	4.174495185258844	4.461444189374777	4.501917608576763	5.148564181681127	4.714964118699851	4.362834304955391	5.295962916746221	4.554174872920615	4.66956645969942	5.00608085155003	3.992340766740808	5.123492480435922	5.298775162967477	4.374095749579776	5.455252631144141	5.369108229970505
Zci_16475	5.147319152829516	3.2093146917098014	4.062399308921311	5.2527597282906	3.2128581848990563	3.9796619996677527	5.887495153010649	3.615391593486023	4.165509941581536	6.158654899521785	5.079751982543009	5.268995609217255	6.506139897779492	5.509548134169347	6.257773887627253	6.7597934332583955	6.202162451450655	5.491189966058112	5.036906221750001	4.428108002851995	5.696686949666913	2.60254433555183	2.363171855204764	2.363171855204764	5.133175845249488	3.942087571802963	4.341172474477498	4.435316318227648	5.543499934658032	3.8900890818653666	5.207610577988837	4.1536986156674915	3.927439651864763	5.564651253633712	2.4232047227551203	3.5513259887109885	5.676588660510042	4.814969371233707	3.816994842055576	5.8015430142169295	3.512038409948145	3.6924312327958657	4.4816364274163485	2.4549288006618513	1.6230365746521238	4.046284810655132	3.254075655596198	3.1049737687282732	4.763745686105462	3.4738408758854624	3.6881916581438863	4.39445852537283	3.3614123556434454	1.4720296070137002	4.680631723445366	3.337370028311549	3.4920956229613096	4.935592101092322	3.8506450685241154	2.527556213607043	4.782408495439529	3.832933351542652	5.048779314247168	4.564753280253064	5.167284931423695	4.878745053813382	3.859720193617646	4.547378610032988	4.364380776826882	4.775439193164885	4.29578427563025	4.388781909534888	4.49352049240048	3.747070739489553	5.016686828642714	5.087391849158709	4.189814037037339	4.972036880377012	5.775212051197233	4.589106493286516	5.2164039073792265	5.437695602737317	4.964011715020904	4.899693913022677	6.874028058673603	4.894041281074541	6.082617992630191	5.974721897176923	5.103085172743064	5.947808859697282
