0.9026745913818722	0.9314954051796157	0.9717698154180239	0.8977519941986947	0.9130434782608696	0.91825613079019075	0.9566596194503171	0.9176658673061551	0.9301503094606542	0.979933110367893	0.9774520856820744	0.9988009592326139
0.9663608562691132	0.9291338582677166	0.9874476987447699	0.9717898832684825	0.9372384937238494	0.9403202328966521	0.9745596868884541	0.9134146341463415	0.922077922077922	0.9750566893424036	0.9769585253456221	1
0.8458225667527993	0.9494020239190433	0.9655172413793104	0.8229787234042554	0.9227722772277228	0.944944944944945	0.9868891537544696	0.9773109243697479	0.9771210676835081	0.9749670619235836	0.9868421052631579	1
0.9815789473684211	0.9859154929577465	0.9704641350210971	0.9645120405576679	0.9642857142857143	0.9682875264270613	0.9857142857142858	0.9666666666666667	0.9798792756539235	0.9904761904761905	1	1
0.887243735763098	0.945872801082544	0.958041958041958	0.9008620689655172	0.9788732394366197	0.9593373493975904	0.9725738396624473	0.9929245283018868	0.9828080229226361	0.9828431372549019	1	0.9970059880239521
0.886734693877551	0.9676300578034682	0.9706422018348624	0.8693918245264207	0.9284802043422733	0.9572538860103627	0.9865092748735245	0.9767441860465116	0.9763975155279503	0.9688109161793372	0.9922630560928434	1
0.9806243272335845	0.9144927536231884	0.9829268292682927	0.9719626168224299	0.9718934911242604	0.9639498432601881	0.9372093023255814	0.9013333333333333	0.9375	1	0.9865591397849462	0.9967105263157895
0.9653121902874133	0.8926701570680629	0.9841897233201581	0.9841121495327103	0.9647058823529412	0.9515905947441217	0.9366602687140115	0.9009546539379475	0.9102384291725105	0.989517819706499	0.9871794871794872	0.995
0.9978540772532188	0.9834254143646409	1	0.9927835051546392	0.9555895865237366	0.9429037520391517	1	0.8512747875354107	0.8771043771043772	0.9863760217983651	0.9449275362318841	1
0.9698630136986301	0.9447619047619048	0.990909090909091	0.9885496183206107	0.983739837398374	0.9847494553376906	0.9725490196078431	0.9805510534846029	0.9916839916839917	0.9893617021276596	0.9832402234636871	1
0.9953917050691244	1	1	0.9985632183908046	0.995	1	1	1	0.9974093264248705	1	1	1
