FUCK FUCK FUCK

1 job for master in 1 minute and 12 seconds (queued for 7 seconds)
Name Stage Failure
failed
build-docker-master Build
compilation terminated.
make[2]: Leaving directory '/app/renderer-src/cJSON'
make[2]: *** [Makefile:83: cJSON.o] Error 1
make[1]: Leaving directory '/app/renderer-src'
make[1]: *** [Makefile:32: cJSON] Error 2
make: *** [Makefile:27: build-renderer] Error 2
The command '/bin/sh -c make build-renderer' returned a non-zero code: 2
Cleaning up project directory and file based variables
ERROR: Job failed: exit code 2