module dsb/formulartool

go 1.22.2

require (
	github.com/pocketbase/dbx v1.10.1
	github.com/pocketbase/pocketbase v0.22.19
	github.com/spf13/cobra v1.8.1
)

require (
	github.com/AlecAivazis/survey/v2 v2.3.7 // indirect
	github.com/asaskevich/govalidator v0.0.0-20230301143203-a9d515a09cc2 // indirect
	github.com/aws/aws-sdk-go-v2 v1.30.4 // indirect
	github.com/aws/aws-sdk-go-v2/aws/protocol/eventstream v1.6.4 // indirect
	github.com/aws/aws-sdk-go-v2/config v1.27.28 // indirect
	github.com/aws/aws-sdk-go-v2/credentials v1.17.28 // indirect
	github.com/aws/aws-sdk-go-v2/feature/ec2/imds v1.16.12 // indirect
	github.com/aws/aws-sdk-go-v2/feature/s3/manager v1.17.11 // indirect
	github.com/aws/aws-sdk-go-v2/internal/configsources v1.3.16 // indirect
	github.com/aws/aws-sdk-go-v2/internal/endpoints/v2 v2.6.16 // indirect
	github.com/aws/aws-sdk-go-v2/internal/ini v1.8.1 // indirect
	github.com/aws/aws-sdk-go-v2/internal/v4a v1.3.16 // indirect
	github.com/aws/aws-sdk-go-v2/service/internal/accept-encoding v1.11.4 // indirect
	github.com/aws/aws-sdk-go-v2/service/internal/checksum v1.3.18 // indirect
	github.com/aws/aws-sdk-go-v2/service/internal/presigned-url v1.11.18 // indirect
	github.com/aws/aws-sdk-go-v2/service/internal/s3shared v1.17.16 // indirect
	github.com/aws/aws-sdk-go-v2/service/s3 v1.59.0 // indirect
	github.com/aws/aws-sdk-go-v2/service/sso v1.22.5 // indirect
	github.com/aws/aws-sdk-go-v2/service/ssooidc v1.26.5 // indirect
	github.com/aws/aws-sdk-go-v2/service/sts v1.30.4 // indirect
	github.com/aws/smithy-go v1.20.4 // indirect
	github.com/disintegration/imaging v1.6.2 // indirect
	github.com/domodwyer/mailyak/v3 v3.6.2 // indirect
	github.com/dustin/go-humanize v1.0.1 // indirect
	github.com/fatih/color v1.17.0 // indirect
	github.com/gabriel-vasile/mimetype v1.4.5 // indirect
	github.com/ganigeorgiev/fexpr v0.4.1 // indirect
	github.com/go-ozzo/ozzo-validation/v4 v4.3.0 // indirect
	github.com/goccy/go-json v0.10.3 // indirect
	github.com/golang-jwt/jwt/v4 v4.5.0 // indirect
	github.com/golang/groupcache v0.0.0-20210331224755-41bb18bfe9da // indirect
	github.com/google/uuid v1.6.0 // indirect
	github.com/googleapis/gax-go/v2 v2.13.0 // indirect
	github.com/hashicorp/golang-lru/v2 v2.0.7 // indirect
	github.com/inconshreveable/mousetrap v1.1.0 // indirect
	github.com/kballard/go-shellquote v0.0.0-20180428030007-95032a82bc51 // indirect
	github.com/labstack/echo/v5 v5.0.0-20230722203903-ec5b858dab61 // indirect
	github.com/mattn/go-colorable v0.1.13 // indirect
	github.com/mattn/go-isatty v0.0.20 // indirect
	github.com/mattn/go-sqlite3 v1.14.22 // indirect
	github.com/mgutz/ansi v0.0.0-20200706080929-d51e80ef957d // indirect
	github.com/ncruces/go-strftime v0.1.9 // indirect
	github.com/remyoudompheng/bigfft v0.0.0-20230129092748-24d4a6f8daec // indirect
	github.com/spf13/cast v1.7.0 // indirect
	github.com/spf13/pflag v1.0.5 // indirect
	github.com/valyala/bytebufferpool v1.0.0 // indirect
	github.com/valyala/fasttemplate v1.2.2 // indirect
	go.opencensus.io v0.24.0 // indirect
	gocloud.dev v0.39.0 // indirect
	golang.org/x/crypto v0.26.0 // indirect
	golang.org/x/image v0.19.0 // indirect
	golang.org/x/net v0.28.0 // indirect
	golang.org/x/oauth2 v0.22.0 // indirect
	golang.org/x/sync v0.8.0 // indirect
	golang.org/x/sys v0.24.0 // indirect
	golang.org/x/term v0.23.0 // indirect
	golang.org/x/text v0.17.0 // indirect
	golang.org/x/time v0.6.0 // indirect
	golang.org/x/xerrors v0.0.0-20240716161551-93cc26a95ae9 // indirect
	google.golang.org/api v0.192.0 // indirect
	google.golang.org/genproto/googleapis/rpc v0.0.0-20240814211410-ddb44dafa142 // indirect
	google.golang.org/grpc v1.65.0 // indirect
	google.golang.org/protobuf v1.34.2 // indirect
	modernc.org/gc/v3 v3.0.0-20240801135723-a856999a2e4a // indirect
	modernc.org/libc v1.59.7 // indirect
	modernc.org/mathutil v1.6.0 // indirect
	modernc.org/memory v1.8.0 // indirect
	modernc.org/sqlite v1.32.0 // indirect
	modernc.org/strutil v1.2.0 // indirect
	modernc.org/token v1.1.0 // indirect
)
