<?xml version="1.0" encoding="UTF-8"?>
<svg width="17px" height="17px" viewBox="0 0 17 17" version="1.1" xmlns="http://www.w3.org/2000/svg" xmlns:xlink="http://www.w3.org/1999/xlink">
    <!-- Generator: Sketch 42 (36781) - http://www.bohemiancoding.com/sketch -->
    <title>X_grün</title>
    <desc>Created with Sketch.</desc>
    <defs></defs>
    <g id="0_Icon-Font" stroke="none" stroke-width="1" fill="none" fill-rule="evenodd">
        <g id="X_grün" fill-rule="nonzero" fill="#005A5A">
            <path d="M10.6066017,8.48528137 L16.9705627,2.12132034 L14.8492424,0 L8.48528137,6.36396103 L2.12132034,0 L0,2.12132034 L6.36396103,8.48528137 L0,14.8492424 L2.12132034,16.9705627 L8.48528137,10.6066017 L14.8492424,16.9705627 L16.9705627,14.8492424 L10.6066017,8.48528137 Z" id="Combined-Shape"></path>
        </g>
    </g>
</svg>