<?xml version="1.0" encoding="UTF-8"?>
<svg width="12px" height="12px" viewBox="0 0 12 12" version="1.1" xmlns="http://www.w3.org/2000/svg" xmlns:xlink="http://www.w3.org/1999/xlink">
    <!-- Generator: Sketch 42 (36781) - http://www.bohemiancoding.com/sketch -->
    <title>plus</title>
    <desc>Created with Sketch.</desc>
    <defs></defs>
    <g id="0_Icon-Font" stroke="none" stroke-width="1" fill="none" fill-rule="evenodd">
        <g id="plus" fill-rule="nonzero" fill="#005A5A">
            <path d="M7,7 L12,7 L12,5 L7,5 L7,0 L5,0 L5,5 L5.6769404e-14,5 L5.69174337e-14,7 L5,7 L5,12 L7,12 L7,7 Z" id="Combined-Shape"></path>
        </g>
    </g>
</svg>