,dry,stokes,newton,dryStokes,dryNewton,stokesNewton,dryStokesNewton
R²: ,0.9030960404908884,0.8843151119444946,0.8653190102183468,0.9718055078979275,0.6738317131153326,0.9672839220674403,0.9030959853532536
a: ,2.7202504589706016 ± 0.020417447870318444,-,-,21.793591301243914 ± 0.44887155957175334,2.509724089026363 ± 0.160751224589032,-,2.7205618644688334 ± 13.569653582842335
b: ,-,-2.4496554628808287 ± 0.02198854174261406,-,-17.02937232980604 ± 0.3957719828748098,-,22.496848641831946 ± 0.46110214655997755,7.300397479545177e-05 ± 1.187525740272988
c: ,-,-,2.204092870442748 ± 0.023202998831437994,-,3.772753897797299e-07 ± 0.12631936454223908,-17.86046382930116 ± 0.4047785933725044,3.489403827021762e-06 ± 0.03634831220047061
