,dry,stokes,newton,dryStokes,dryNewton,stokesNewton,dryStokesNewton
R²: ,0.8966317679054077,0.8518625543933322,0.8085402330888537,0.997285505419209,0.6414452367506976,0.9928037808464719,0.8966235163329306
SSE: ,0.9091250065045231,1.3028708479553348,1.6838912527706504,0.0238740167400737,3.153494017126592,0.06329084528380405,0.9091975791966352
a: ,0.6498834512393763 ± 0.0029741504160949272,-,-,3.473610524947299 ± 0.010105539494578854,1.056089670945734 ± 0.019914862905310193,-,18.57918905321703 ± 5460.6420365041895
b: ,-,-1.501769010802839 ± 0.009875805553575775,-,-6.407999770409909 ± 0.02227543343982081,-,10.524382913938554 ± 0.04407243508967214,0.15994225170143256 ± 17.436560952590753
c: ,-,-,3.455992212157416 ± 0.03013726672287212,-,2.5951807539329644e-07 ± 0.09877415722881516,-20.23967542138142 ± 0.09508063517534858,0.00035590942016329365 ± 0.08570051230168461
