,dry,stokes,newton,dryStokes,dryNewton,stokesNewton,dryStokesNewton
R²: ,-0.04534966688616082,0.0067533371126260455,0.05638228589211747,0.7145090311236038,0.7855899566292488,0.7200943385366918,0.05443927427625883
a: ,8.9532993996243 ± 0.2421617734276809,-,-,-373.99280802044956 ± 30.053641500056557,2.9932446444093377e-06 ± 0.4824326182234601,-,0.0032183757622362497 ± 568.2072062360131
b: ,-,-5.365362800879717 ± 0.14651208561761697,-,231.5053096981922 ± 18.277106669236968,-,-219.02315587829165 ± 17.827514314529598,0.20099647057229048 ± 708.8362642824295
c: ,-,-,3.2156018857817497 ± 0.08858814910672799,-,1.4772089294305917 ± 0.16912161372395576,135.62918067006373 ± 10.840721227665775,3.1412197573812586 ± 10.187041286519861
