,dry,stokes,newton,dryStokes,dryNewton,stokesNewton,dryStokesNewton
R²: ,0.8966317679054077,0.8518625543933322,0.8085402330888537,0.997285505419209,0.6414452367506976,0.9928037808464719,-21661770067.28041
a: ,0.6498834512393763 ± 0.0029741504160949272,-,-,3.473610524947299 ± 0.010105539494578854,1.056089670945734 ± 0.019914862905310193,-,-10.0 ± inf
b: ,-,-1.501769010802839 ± 0.009875805553575775,-,-6.407999770409909 ± 0.02227543343982081,-,10.524382913938554 ± 0.04407243508967214,-10.0 ± inf
c: ,-,-,3.455992212157416 ± 0.03013726672287212,-,2.5951807539329644e-07 ± 0.09877415722881516,-20.23967542138142 ± 0.09508063517534858,10.0 ± inf
