,dry,stokes,newton,dryStokes,dryNewton,stokesNewton,dryStokesNewton
R²: ,0.876566371286322,0.8609590011023941,0.8454078257153594,0.972666250351174,0.6366960179468933,0.9691588588954619,0.8765609212245605
a: ,5.655426719601324 ± 0.07129641253784713,-,-,69.91243274854894 ± 1.7919018447144548,3.668298204525342 ± 0.39224509579148875,-,5.6472696453461175 ± 0.5439251626808176
b: ,-,-3.6774429091488106 ± 0.05271687588514731,-,-41.47100354820902 ± 1.1432242785480926,-,50.22201550333591 ± 1.2950929042303718,3.7152168349865434e-06 ± 0.3708904409273177
c: ,-,-,2.39002433409887 ± 0.03854516243324902,-,5.359179286020374e-07 ± 0.15820247587915312,-29.999220260521874 ± 0.824058554583814,1.0130641840352166e-06 ± 0.055686832885598524
