name,institution,bio,email,url,github,orcid
"William J. Turkel","Western University","William J. Turkel is Professor of History at the
University of Western Ontario.
",,,,
"Alan MacEachern","Western University",,,,,
"Adam Crymble","ProgHist Ltd","Adam Crymble is a senior lecturer of digital history.
",adam.crymble@gmail.com,http://adamcrymble.org,acrymble,
"Caleb McDaniel","Rice University","Caleb McDaniel is an associate professor of history at Rice University.
",,,,
"Ian Milligan","University of Waterloo","Ian Milligan is an associate professor of history at the University
of Waterloo.
",,,,
"Fred Gibbs","University of New Mexico","Fred Gibbs is an assistant professor of history at the University of
New Mexico.
",,,,
"Maria José Afanador-Llach","Universidad de los Andes, Colombia","Maria José Afanador-Llach is an assistant professor of Digital Humanities and History at the Universidad de los Andes, Bogotá (Colombia).
",mj.afanador28@uniandes.edu.co,http://www.mariajoseafanador.com,mariajoafana,
"Víctor Gayol","El Colegio de Michoacán","Víctor Gayol is a researcher and professor of history at El Colegio de Michoacán, A.C. (CPI-CONACYT), México.
",vgayol@colmich.edu.mx,https://victorgayol.net,vgayolrs,0000-0002-2442-3193
"Antonio Rojas Castro","Berlin-Brandenburgische Akademie der Wissenschaften","Antonio Rojas Castro is a researcher at the Berlin-Brandenburgische Akademie der Wissenschaften, with a PhD in Humanities (Spanish Literature).
",rojas.castro.antonio@gmail.com,http://antoniorojascastro.com,arojascastro,0000-0002-8916-4997
"Stephen Margheim",,"Stephen Margheim is a classicist turned digital humanist hunkered down in
Philadelphia, looking for his next step.
",,,,
"Evan Taparata","University of Minnesota","Evan Taparata is a PhD candidate in history at the University of
Minnesota.
",,,,
"Taryn Dewar",,"Taryn Dewar has a Master's degree in Public History at Western University,
and is an Interpreter at the Oil Sands Discovery Centre in Fort McMurray, Alberta.
",,,,
"Maria Velez-Serna",,"Maria Velez-Serna is a research assistant in the Early Cinema of Scotland
project, University of Glasgow.
",,,,
"Andrew Hnatow",,"Andrew Hnatow is a PhD candidate at Wayne State University.
",,,,
"Daniel van Strien",,"Daniel van Strien is a Library Science student at City University, London.
",,,,
"Kim Pham",,"Kim Pham is the Digital Projects and Technologies Librarian
at the University of Toronto Scarborough Library.
Her heart belongs to open-source software & shared,
community-driven development practices in libraries.
",,,,
"Douglas Duhaime",,"Douglas Duhaime is the Text and Data Mining project manager at ProQuest
and a doctoral student at the University of Notre Dame.
",,,,
"Kellen Kurschinski",,"Kellen Kurschinski is a doctoral candidate in history at McMaster
University and a Research Officer at the University of Waterloo.
",,,,
"Seth Bernstein",,"Seth Bernstein is a postdoctoral fellow at the Higher School of Economics
in Moscow.  He defended his doctoral dissertation, ""Communist Upbringing
under Stalin: The Political Socialization and Militarization of Soviet
Youth, 1934-1941"" at the University of Toronto in 2013.
",,,,
"James Baker","University of Sussex","James Baker is a Senior Lecturer in Digital History and Archives at the University of Sussex
and a historian of interactions between people and things.
",james.baker@sussex.ac.uk,https://cradledincaricature.com/,drjwbaker,0000-0002-2682-6922
"Amanda Morton",,"Amanda Morton is a DH Fellow at the Center for History and New Media.
",,,,
"Miriam Posner",UCLA,"Miriam Posner is the digital humanities program coordinator at the
University of California, Los Angeles.
",,,,
"Jeremy Boggs","University of Virginia","Jeremy Boggs is the Design Architect for Digital Research Scholarship
at the University of Virginia Library.
",,,,
"Allison Hegel",UCLA,"Allison Hegel is a PhD candidate in English at UCLA.
",,,,
"Carrie Sanders",UCLA,"Carrie Sanders is a Ph.D candidate in history at UCLA.
",,,,
"Dennis Tenen",,"Dennis Tenen is an assistant professor of English and Comparative
Literature at Columbia University.
",,,,
"Grant Wythoff",,"Grant Wythoff is a lecturer in the Department of English and
Comparative Literature at Columbia University.
",,,,
"Shawn Graham",,"Shawn Graham is associate professor of digital humanities and history at Carleton University.
",,,,
"Scott Weingart",,"Scott Weingart is a historian of science and digital humanities specialist at Carnegie Mellon University.
",,,,
"Jim Clifford",,"Jim Clifford is an assistant professor in the Department of History
at the University of Saskatchewan.
",,,,
"Daniel Macfarlane",,"Daniel Macfarlane is a Visiting Scholar in the School of Canadian
Studies at Carleton University.
",,,,
"Josh MacFadyen",,"Josh MacFadyen is a Project Coordinator at the Network in Canadian
History & Environment.
",,,,
"Jeri Wieringa",,"Jeri Wieringa is a doctoral candidate in history at George Mason University.
",,,,
"Jon Crump",,"Jon Crump is an independent scholar and freelance digital humanist based in Seattle, Washington.
",,,,
"Vilja Hulden",,"Vilja Hulden is a history instructor and research associate in the Departments of History and
Linguistics at the University of Colorado Boulder.
",,,,
"Marten Düring",,"Marten Düring is a historian, works as researcher in the Digital Humanities Lab at CVCE Luxembourg, runs <a href=""http://historicalnetworkresearch.org"">http://historicalnetworkresearch.org</a> and regularly teaches workshops on network analysis.
",,,,
"Max De Wilde",,"Max De Wilde is a PhD student at the Information and Communication Science department of the Université libre de Bruxelles.
",,,,
"Ruben Verborgh",,"Ruben Verborgh is a post-doc researcher at the Multimedia Lab of the Universtiteit Gent.
",,,,
"Seth van Hooland",,"Seth van Hooland is an associate professor at the Information and Communication Science department of the Université libre de Bruxelles.
",,,,
"Jonathan Reeve",,"Jonathan Reeve is a digital humanist and web developer for the Modern Language Association.
",,,,
"Spencer Roberts",,"Spencer Roberts is Research Assistant and former Digital History Research Fellow at the Roy Rosenzweig Center for History and New Media, and a Ph.D. graduate student at George Mason University in the Department of History.
",,,,
"Doug Knox",,"Doug Knox is the Assistant Director of the Humanities Digital Workshop at Washington University in St. Louis.
",,,,
"Heather Froehlich",,"Heather Froehlich is a PhD student at the University of Strathclyde (Glasgow, UK), where she studies gender in Early Modern London plays using computers. Her thesis draws heavily from sociohistoric linguistics and corpus stylistics, though she sustains an interest in digital methods for literary and linguistic inquiry.
",,,,
"Laura Turner O'Hara",,"Laura Turner O'Hara works in the Office of the Historian at the U.S. House of Representatives.
",,,,
"Matthew Lincoln","Carnegie Mellon University","Matthew Lincoln is the digital humanities developer at Carnegie Mellon University, and an art historian of early modern Europe.
",mlincoln@andrew.cmu.edu,http://matthewlincoln.net,mdlincoln,0000-0002-4387-3384
"Sarah Melton","Boston College","Sarah Melton is the Head of Digital Scholarship at Boston College.
",sarah.melton@bc.edu,http://sarahvmelton.com,svmelton,
"Sarah Simpkin",,"Sarah Simpkin is a GIS, Geography, and Computer Science librarian at the University of Ottawa.
",,,,
"Amanda Visconti","University of Virginia","Amanda Visconti is Managing Director at the University of Virginia Scholars' Lab DH center.
",amandavisconti@gmail.com,http://www.amandavisconti.com,amandavisconti,
"Megan R. Brett",,"Megan R. Brett is Digital History Associate at the Roy Rosenzweig Center for History and New
Media, where she acts as Outreach Coordinator for the Omeka projects. She is also a doctoral
student in the Department of History and Art History at George Mason University.
",,,,
"Brandon Walsh","University of Virginia","Brandon Walsh is Head of Graduate Programs in the Scholars' Lab in the University of Virginia Library.
",walsh.brandon.michael@gmail.com,http://walshbr.com/,walshbr,
"Ted Dawson",,"Ted Dawson is a Doctoral Candidate in German Studies at Vanderbilt University.
",,,,
"M. H. Beals",,"M. H. Beals is a Lecturer in Digital History at Loughborough University.
",,,,
"Elizabeth Venditto",,"Elizabeth Venditto is Project Manager for ""Immigrant Stories,"" a digital storytelling initiative based at the University of Minnesota's Immigration History Research Center.
",,,,
"Jacob W. Greene",,"Jacob Greene is an Assistant Professor of English in the Writing, Rhetorics, and Literacies program at Arizona State University. His research and teaching explore how mobile technologies such augmented reality can be used to promote critical interventions into public and private spaces.
",,,,
"Jeanette Sewell",,"Jeanette Sewell is a Cataloging and Metadata Librarian at the Houston Area Digital Archives.
",,,,
"Boris Capitanu",,"Boris Capitanu is a Research Programmer at the HathiTrust Research Center. His research
interests include large scale data analysis, machine learning, data mining, and educational
technologies. Boris holds a B.S. and M.S. in Computer Science from University of Illinois at
Urbana-Champaign, and a MBA+MHRIR from the same institution.
",,,,
"Peter Organisciak",,"Peter Organisciak is an information scientist, at the HathiTrust Research Center as a postdoctoral research associate.
",,,,
"Justin Colson",,"Justin Colson is a lecturer of history at the University of Essex, and a scholar of early modern Britain.
",,,,
"Jessica Parr","Simmons College","Jessica Parr is a Lecturer in History at Simmons College (Boston).
She is a scholar of the early modern Atlantic.
",jparr1129@gmail.com,http://jessicaparr.org/,JMParr,
"Taylor Arnold",,"Taylor Arnold is assistant professor of statistics at the University of Richmond.
",,,,
"Lauren Tilton",,"Lauren Tilton is visiting assistant professor of digital humanities at the University of Richmond.
",,,,
"Stephanie J. Richmond",,"Stephanie J. Richmond is an assistant professor of history at Norfolk State University in Virginia and a historian of gender and race in the Atlantic world.
",,,,
"Tommy Tavenner",,"Tommy Tavenner is a developer and data architect working in open data and civic engagement.
",,,,
"Jonathan Blaney",,"Jonathan Blaney is a project editor at the Institute of Historical Research, University of London.
",,,,
"Daniel Ruten",,"Daniel Ruten is entering graduate studies in history at the University of Saskatchewan.
",,,,
"Nabeel Siddiqui",,"Nabeel Siddiqui is a doctoral candidate in American Studies at the College of William and Mary, where he is also an inaugural fellow of the Digital Equality Lab. His research focuses broadly on the relationship between the humanities and computation, with a particular expertise on the cultural history of media, new media studies, digital humanities, information studies, and the history of science and technology. Currently, he is completing his dissertation entitled ""Byting Out the Public,"" which looks at the historical relationship between the personal computer and the private sphere.
",,,,
"Anandi Silva Knuppel","Emory University","Anandi Silva Knuppel is a digital scholarship training coordinator and special projects liaison at Emory University.
",anandi.silva.knuppel@gmail.com,http://anandileela.com,alsalin,
"Anna-Maria Sichani","University of Sussex","Anna-Maria Sichani is a literary and cultural historian and a Digital Humanist. She is currently a Research Fellow in Media History at the University of Sussex.
",amsichani@gmail.com,https://amsichani.github.io,amsichani,
"Evan Peter Williamson",,"Evan Peter Williamson is the Digital Infrastructure Librarian at University of Idaho Library, working with Data & Digital Services to bring cool projects, enlightening workshops, and innovative services to life. Despite a background in Art History, Classical Studies, and Archives, he always manages to get involved in all things digital.
",,,,
"John Ladd",,"John Ladd is a PhD candidate in literature at Washington University in St. Louis and postdoctoral fellow for Six Degrees of Francis Bacon at Carnegie Mellon.
",,,,
"Jessica Otis",,"Jessica Otis is a Digital Humanities Specialist in the University Libraries and Assistant Professor of History at Carnegie Mellon University.
",,,,
"Christopher N. Warren",,"Christopher N. Warren is Associate Professor of English at Carnegie Mellon University, where he teaches early modern studies and directs the Digital Humanities Faculty Research Group.
",,,,
"Ryan Deschamps",,"Ryan Deschamps is a Postdoctoral Fellow at the University of Waterloo where he helps design unique tools for managing and studying web archives. His research interests include Canadian digital history, public policy, and quantitative methods in the social sciences.
",,,,
"Viola Wiegand",,"Viola Wiegand is a Research Fellow on the AHRC-funded CLiC Dickens project at the University of Birmingham.
",,,,
"Michaela Mahlberg",,"Michaela Mahlberg is the Chair in Corpus Linguistics and the Director of the Centre for Corpus Research at the University of Birmingham.
",,,,
"Peter Stockwell",,"Peter Stockwell is the Associate Pro-Vice-Chancellor for Global Engagement (Europe) and Professor of Literary Linguistics at the University of Nottingham.
",,,,
"Beatrice Alex",,"Beatrice Alex is a research fellow at the Institute for Language, Cognition and Computation at the School of Informatics, University of Edinburgh and a Turing fellow at the Alan Turing Institute.  Her research interests focus on text mining and geoparsing.
",,,,
"Zo&#235; Wilkinson Salda&#241;a",,"Zo&#235; Wilkinson Salda&#241;a is a graduate student at the University of Michigan School of Information, where she focuses on the intersection of critical data literacies, academic libraries, and data-informed learning.
",,,,
"José Antonio Motilla","Universidad Autónoma de San Luis Potosi","José Antonio Motilla is a researcher of history, art, culture and digital humanities at the Universidad Autónoma de San Luis Potosí, México. Director of the “Ricardo B. Anaya"" Library (San Luis Potosí, México).
",jamotilla@gmail.com,http://www.bibliografiapotosina.mx/about/,jamotilla,
"Jennifer Isasi","University of Texas","Jennifer Isasi is a CLIR Postdoctoral Fellow at LLILAS Benson Latin American Studies and Collections, and a PhD on Hispanic Studies.
",jenniferbibat@gmail.com,https://jenniferisasi.github.io/,jenniferisasi,
"Jon MacKay",,"Jon MacKay holds a PhD in Management Science from the University of Waterloo. He is currently a senior advanced analytics professional at Economical Insurance.
",,,,
"Patrick Smyth",,"Patrick Smyth is a PhD student in English and Digital Fellow at the Graduate Center, CUNY.
",,,,
"François Dominic Laramée","University of Ottawa","François Dominic Laramée is a postdoctoral fellow in digital history of medicine at the University of Ottawa, in Canada.
He holds master's degrees in computer science and U.S. history and is a former video game designer, TV personality and screenwriter.
",fdl@francoisdominiclaramee.com,http://www.francoisdominiclaramee.com,fdlaramee,0000-0001-5542-3754
"Jeff Blackadar",,"Jeff Blackadar is a part-time undergraduate history student at Carleton University. His career is in the field of information technology.
",,,,
"Martin Grandjean","University of Lausanne","Martin Grandjean is a researcher in contemporary history at the University of Lausanne (Switzerland). His work focuses on the analysis and visualization of large historical data sets.
",martin.grandjean@unil.ch,http://www.martingrandjean.ch,grandjeanmartin,0000-0003-3184-3943
"Sofia Papastamkou",CNRS,"Sofia Papastamkou is a historian and Research Engineer in Digital Humanities at the French National Center for Scientific Research (CNRS).
She is currently assigned to the Institut de recherches historiques du Septentrion (IRHiS, CNRS/University of Lille).
",spapastamkou@gmail.com,,spapastamkou,0000-0002-5148-1348
"Marie Puren",LARHRA,"Marie Puren is an historian and research engineer in the ALMAnaCH team at Inria Paris.
",marie.puren1406@gmail.com,,mpuren,
"Marie-Christine Boucher","Justus-Liebig-Universität Gießen","Marie-Christine Boucher is a doctoral student in German literature at Justus Liebig University Giessen (Germany).
",marie.c.boucher@ggk.uni-giessen.de,,mariechristineb,0000-0002-2475-3184
"Charlie Harper",,"Charlie Harper is the Digital Learning and Scholarship Librarian at Case Western Reserve University
",,,,
"Eric Weinberg",,"Eric Weinberg holds a PhD in History from the University of Kentucky. He teaches at Viterbo University in La Crosse, WI.
",,,,
"Alex Brey",,"Alexander Brey is a Research Associate at the Center for Advanced Study in the Visual Arts. His research investigates mechanisms for and perceptions of cross-cultural exchange in medieval visual culture, with a focus on the Islamic world.
",,,,
"Zoe LeBlanc","University of Virginia","Zoe LeBlanc is a digital humanities developer in the Scholars' Lab in the University of Virginia Library.
",zgleblanc@gmail.com,http://zoeleblanc.com,ZoeLeBlanc,
"Dave Rodriguez",,"Dave Rodriguez is an audiovisual archivist, curator, and filmmaker. He is currently Resident Librarian in the Office of Digital Research and Scholarship at Florida State University.
",,,,
"Stephen Krewson",,"Stephen Krewson is a PhD candidate in English at Yale University. His research explores the interplay between progressive theories of education and print media in the early nineteenth century. He holds a MS in Computer Science (also from Yale) and has been working on efficient methods for filtering and retrieval tasks within large-scale digital libraries.
",,,,
"Riva Quiroga","Universidad Católica de Chile","Riva Quiroga is a PhD student in Linguistics at the Catholic University of Chile.
",riva.quiroga@uc.cl,,rivaquiroga,
"Joshua G. Ortiz Baco","University of Texas, at Austin","Joshua G. Ortiz Baco is a PhD student in Spanish and Portuguese at the University of Texas, at Austin.
",joshuaortizbaco@utexas.edu,,joshuagob,
"Armando Luza",,,,,,
"Silvia Gutiérrez",,,,,,
"Matthew J. Lavin",,"Matthew J. Lavin is a Clinical Assistant Professor of English and Director of the Digital Media Lab at the University of Pittsburgh. His current scholarship and teaching focus on book history, cultural analytics, turn-of-the-twentieth-century U.S. literature and culture.
",,,,
"Go Sugimoto",,"Go Sugimoto is a data analyst at the Austrian Centre for Digital Humanities (ACDH) in the Austrian Academy of Sciences. He has worked for a wide range of cultural heritage projects around the world, including Europeana and Archives Portal Europe at the National Archives of the Netherlands, CHIRON fellowship at the University of Florence (Italy), the National Museum of Modern Art Tokyo (Japan), and Wessex Archaeology (UK).
",,,,
"Brad Rittenhouse",,"Brad Rittenhouse is the Lab Coordinator of the Digital Integrative Liberal Arts Center at the Georgia Institute of Technology, where he helps facilitate the integration of digital tools into research in a wide variety of humanities disciplines. His research is on the information logics of literary devices.
",,,,
"Ximin Mi",,"Ximin Mi manages the Data Visualization Lab and services at Georgia Tech Library. She holds a MS from iSchool from University of Illinois at Urbana-Champaign, and a MS of Education from Arizona State University.
",,,,
"Courtney Allen",,"Courtney Allen is a second year MS-HCI student at Georgia Tech, in the School of Interactive Computing (College of Computing). She is a User Experience Reseacher, supporting design with data-driven choices and elements, and is a Graduate Teaching Assistant for Human-Computer Interaction MS Research Methods.
",,,,
"Quinn Dombrowski",,"Quinn Dombrowski is the Academic Technology Specialist for the Division of Literatures, Cultures, and Languages at Stanford University, and works on non-English digital humanities.
",,,,0000-0001-5802-6623
"Tassie Gniady",,"Tassie Gniady is the manager of the Cyberinfrastructure for Digital Humanities and Creative Activities (CyberDH) at Indiana University.
",,,,0000-0001-8693-3677
"David Kloster",,"David Kloster works in the CyberDH group at Indiana University as a programmer/analyst.
",,,,0000-0001-8577-8409
