%YAML 1.1
%TAG !u! tag:unity3d.com,2011:
--- !u!1045 &1
EditorBuildSettings:
  m_ObjectHideFlags: 0
  serializedVersion: 2
  m_Scenes:
  - enabled: 0
    path: Assets/Scenes/PC.unity
    guid: 9fc0d4010bbf28b4594072e72b8655ab
  - enabled: 1
    path: Assets/Scenes/AR.unity
    guid: 8bfcc056d8647048f8ff6a396231e14a
  m_configObjects:
    Unity.XR.Oculus.Settings: {fileID: 11400000, guid: 16119a9ca38455d7da04fff378d510f4, type: 2}
    Unity.XR.OpenVR.Settings: {fileID: 11400000, guid: a679394b18b9eab43859f6df6d3c7b17, type: 2}
    com.unity.input.settings: {fileID: 11400000, guid: f869af835f34b79b0a93b270dfc3bec2, type: 2}
    com.unity.xr.management.loader_settings: {fileID: 11400000, guid: 9355b906c731023a88234921bca37ce4, type: 2}
    com.unity.xr.openxr.settings4: {fileID: 11400000, guid: 91cb778448dbeffec9c244655aed7a62, type: 2}
