0.6	1.5	6	9.45
0.6	24.62	36	61.39
0.6	70.31	77	136.59
0.6	151.91	140	255.57
0.6	216.62	212	382.99
0.6	310.55	307	553.67
0.6	459.13	406	746.74
0.6	655.51	506	955.65
0.6	737.38	638	1178.21
0.6	992.74	770	1452.82
0.6	1225.06	923	1752.02
0.6	1413.61	1077	2039.58
0.6	1705.11	1244	2377.53
0.6	1922.68	1421	2708.31
0.6	2375.56	1599	3111.17
0.6	2634.85	1797	3485.95
0.6	2864.37	2012	3877.31
0.6	3360.01	2230	4353.0
0.6	3889.02	2438	4823.71
0.6	4209.88	2676	5276.97
