0.05	54.2	133	215.76
0.1	123.59	121	218.58
0.15	120.9	119	214.77
0.2	143.81	122	226.14
0.25	152.27	123	230.18
0.3	144.59	138	250.38
0.35	160.78	140	258.23
0.4	200.8	132	258.24
0.45	219.14	128	257.74
0.5	221.49	128	258.45
0.55	226.32	130	262.89
0.6	230.05	126	258.02
0.65	260.94	122	261.28
0.7	282.2	120	264.66
0.75	318.79	114	266.64
0.8	336.84	113	270.55
0.85	346.36	116	277.91
0.9	361.48	109	271.94
0.95	417.39	98	272.22
