0.2	7.73	6	11.32
0.2	36.19	29	54.36
0.2	89.4	63	121.32
0.2	133.13	109	203.44
0.2	254.03	171	332.71
0.2	303.61	241	452.58
0.2	511.35	311	619.9
0.2	566.95	382	743.09
0.2	785.11	478	952.53
0.2	937.84	604	1187.35
0.2	1192.43	681	1379.23
0.2	1319.39	801	1597.32
0.2	1551.14	895	1807.84
0.2	1780.05	1029	2077.51
0.2	2196.6	1175	2421.48
0.2	2319.88	1319	2674.46
0.2	2790.95	1441	2998.78
0.2	3019.25	1589	3289.27
0.2	3413.63	1765	3671.59
0.2	3744.06	1942	4036.22
