0.2	0.5	6	9.15
0.2	13.28	37	59.48
0.2	74.66	74	133.4
0.2	142.95	136	246.88
0.2	241.06	207	382.82
0.2	292.17	297	533.15
0.2	471.48	347	661.94
0.2	648.7	445	862.11
0.2	806.82	629	1185.55
0.2	971.29	674	1302.39
0.2	1249.3	895	1717.29
0.2	1424.33	1043	1991.8
0.2	1728.18	1064	2114.45
0.2	2009.6	1383	2677.38
0.2	2326.35	1544	3013.9
0.2	2606.52	1522	3064.96
0.2	3010.76	1938	3810.23
0.2	3278.16	1819	3711.95
0.2	3689.52	2367	4657.35
0.2	4025.5	2557	5043.15
