0.2	7.73	6	11.32
0.2	31.02	26	48.31
0.2	80.78	65	121.73
0.2	139.41	117	217.32
0.2	255.93	173	336.28
0.2	314.67	230	439.4
0.2	479.66	307	604.4
0.2	553.72	383	740.62
0.2	828.23	466	947.47
0.2	922.99	576	1140.9
0.2	1170.51	679	1369.65
0.2	1332.68	796	1593.81
0.2	1593.29	894	1818.99
0.2	1736.83	1030	2066.05
0.2	2145.24	1162	2386.57
0.2	2407.64	1296	2666.29
0.2	2751.71	1457	3011.01
0.2	3028.35	1603	3313.01
0.2	3323.99	1775	3659.7
0.2	3702.18	1932	4008.65
