0.1	0.1	136.0	129	234.3
0.1	0.2	139.06	133	241.22
0.1	0.3	97.59	131	225.78
0.1	0.4	100.31	132	228.09
0.1	0.5	96.3	131	225.39
0.1	0.6	96.2	134	229.86
0.1	0.7	93.8	132	226.14
0.1	0.8	89.08	132	224.72
0.1	0.9	88.02	130	221.41
0.2	0.1	161.16	135	250.85
0.2	0.2	100.09	128	222.03
0.2	0.3	94.25	129	221.77
0.2	0.4	83.96	139	233.69
0.2	0.5	87.69	135	228.81
0.2	0.6	89.58	130	221.87
0.2	0.7	86.58	130	220.97
0.2	0.8	84.79	132	223.44
0.2	0.9	89.13	134	227.74
0.3	0.1	125.43	125	225.13
0.3	0.2	113.1	137	239.43
0.3	0.3	110.65	132	231.2
0.3	0.4	89.91	133	226.47
0.3	0.5	82.29	131	221.19
0.3	0.6	80.58	129	217.67
0.3	0.7	85.85	135	228.25
0.3	0.8	81.13	128	216.34
0.3	0.9	84.02	125	212.71
0.4	0.1	117.1	135	237.63
0.4	0.2	94.8	128	220.44
0.4	0.3	90.03	129	220.51
0.4	0.4	79.29	127	214.29
0.4	0.5	92.58	133	227.27
0.4	0.6	82.85	133	224.35
0.4	0.7	86.13	129	219.34
0.4	0.8	85.08	129	219.02
0.4	0.9	87.46	131	222.74
0.5	0.1	169.57	127	241.37
0.5	0.2	105.43	132	229.63
0.5	0.3	78.35	132	221.5
0.5	0.4	78.18	130	218.45
0.5	0.5	93.69	133	227.61
0.5	0.6	84.58	134	226.37
0.5	0.7	84.95	132	223.49
0.5	0.8	83.96	134	226.19
0.5	0.9	83.79	135	227.64
0.6	0.1	138.83	134	242.65
0.6	0.2	151.65	135	248.0
0.6	0.3	93.75	130	223.12
0.6	0.4	86.96	128	218.09
0.6	0.5	100.2	131	226.56
0.6	0.6	86.46	130	220.94
0.6	0.7	86.52	129	219.46
0.6	0.8	80.18	135	226.55
0.6	0.9	88.46	130	221.54
0.7	0.1	140.83	126	231.25
0.7	0.2	86.02	131	222.31
0.7	0.3	88.3	133	225.99
0.7	0.4	105.2	131	228.06
0.7	0.5	85.41	127	216.12
0.7	0.6	92.3	135	230.19
0.7	0.7	87.79	129	219.84
0.7	0.8	85.08	131	222.02
0.7	0.9	85.52	132	223.66
0.8	0.1	110.82	134	234.25
0.8	0.2	103.81	137	236.64
0.8	0.3	86.63	133	225.49
0.8	0.4	89.69	132	224.91
0.8	0.5	85.63	135	228.19
0.8	0.6	88.02	131	222.91
0.8	0.7	86.08	126	214.82
0.8	0.8	91.3	135	229.89
0.8	0.9	82.41	130	219.72
0.9	0.1	122.32	135	239.2
0.9	0.2	109.15	136	236.75
0.9	0.3	115.31	132	232.59
0.9	0.4	83.29	132	222.99
0.9	0.5	96.53	131	225.46
0.9	0.6	83.85	132	223.15
0.9	0.7	85.69	133	225.21
0.9	0.8	82.74	133	224.32
0.9	0.9	83.74	129	218.62
