0.1	0.1	203.02	130	255.91
0.1	0.2	118.22	134	236.47
0.1	0.3	123.49	130	232.05
0.1	0.4	88.96	132	224.69
0.1	0.5	85.36	130	220.61
0.1	0.6	86.63	130	220.99
0.1	0.7	89.52	135	229.36
0.1	0.8	90.3	130	222.09
0.1	0.9	91.8	134	228.54
0.2	0.1	124.82	135	239.95
0.2	0.2	96.97	127	219.59
0.2	0.3	94.3	131	224.79
0.2	0.4	86.08	136	229.82
0.2	0.5	89.69	128	218.91
0.2	0.6	87.29	129	219.69
0.2	0.7	86.13	133	225.34
0.2	0.8	84.58	131	221.87
0.2	0.9	96.42	129	222.42
0.3	0.1	130.16	130	234.05
0.3	0.2	156.55	136	250.96
0.3	0.3	117.27	136	239.18
0.3	0.4	99.03	132	227.71
0.3	0.5	98.47	137	235.04
0.3	0.6	81.58	129	217.97
0.3	0.7	86.25	135	228.37
0.3	0.8	88.19	131	222.96
0.3	0.9	83.79	131	221.64
0.4	0.1	190.72	127	247.72
0.4	0.2	97.42	135	231.72
0.4	0.3	83.46	131	221.54
0.4	0.4	96.7	135	231.51
0.4	0.5	84.8	137	230.94
0.4	0.6	90.63	131	223.69
0.4	0.7	90.91	133	226.77
0.4	0.8	88.75	132	224.62
0.4	0.9	85.69	129	219.21
0.5	0.1	150.29	130	240.09
0.5	0.2	90.13	131	223.54
0.5	0.3	87.69	129	219.81
0.5	0.4	88.52	134	227.56
0.5	0.5	82.96	139	233.39
0.5	0.6	86.69	129	219.51
0.5	0.7	90.63	137	232.69
0.5	0.8	91.13	131	223.84
0.5	0.9	81.41	131	220.92
0.6	0.1	113.44	133	233.53
0.6	0.2	133.82	131	236.65
0.6	0.3	101.14	128	222.34
0.6	0.4	87.46	128	218.24
0.6	0.5	90.69	131	223.71
0.6	0.6	85.13	127	216.04
0.6	0.7	87.13	134	227.14
0.6	0.8	84.75	132	223.42
0.6	0.9	83.25	128	216.97
0.7	0.1	115.1	129	228.03
0.7	0.2	84.46	136	229.34
0.7	0.3	91.3	130	222.39
0.7	0.4	83.18	136	228.95
0.7	0.5	109.2	134	233.76
0.7	0.6	82.79	140	234.84
0.7	0.7	88.63	132	224.59
0.7	0.8	87.19	128	218.16
0.7	0.9	86.74	133	225.52
0.8	0.1	115.93	132	232.78
0.8	0.2	128.71	133	238.11
0.8	0.3	94.76	132	226.43
0.8	0.4	96.03	135	231.31
0.8	0.5	90.08	130	222.02
0.8	0.6	85.91	132	223.77
0.8	0.7	81.79	130	219.54
0.8	0.8	79.07	134	224.72
0.8	0.9	85.91	133	225.27
0.9	0.1	131.89	132	237.57
0.9	0.2	98.14	132	227.44
0.9	0.3	108.54	132	230.56
0.9	0.4	96.3	129	222.39
0.9	0.5	82.41	133	224.22
0.9	0.6	85.63	136	229.69
0.9	0.7	84.46	128	217.34
0.9	0.8	81.41	131	220.92
0.9	0.9	90.63	135	229.69
