0.1	0.1	188.69	135	259.11
0.1	0.2	98.97	130	224.69
0.1	0.3	106.2	134	232.86
0.1	0.4	90.69	131	223.71
0.1	0.5	88.13	129	219.94
0.1	0.6	91.19	129	220.86
0.1	0.7	86.63	125	213.49
0.1	0.8	92.86	134	228.86
0.1	0.9	98.36	136	233.51
0.2	0.1	212.08	130	258.62
0.2	0.2	98.64	130	224.59
0.2	0.3	88.69	134	227.61
0.2	0.4	89.25	132	224.77
0.2	0.5	87.02	131	222.61
0.2	0.6	101.2	131	226.86
0.2	0.7	88.96	129	220.19
0.2	0.8	82.68	135	227.3
0.2	0.9	84.02	129	218.71
0.3	0.1	227.01	131	264.6
0.3	0.2	96.42	134	229.92
0.3	0.3	101.92	137	236.07
0.3	0.4	97.59	135	231.78
0.3	0.5	85.13	128	217.54
0.3	0.6	93.8	131	224.64
0.3	0.7	84.96	132	223.49
0.3	0.8	82.85	132	222.85
0.3	0.9	86.01	130	220.8
0.4	0.1	84.8	132	223.44
0.4	0.2	107.03	128	224.11
0.4	0.3	100.26	134	231.08
0.4	0.4	86.41	140	235.92
0.4	0.5	91.13	131	223.84
0.4	0.6	97.63	133	228.79
0.4	0.7	86.85	133	225.55
0.4	0.8	79.85	136	227.95
0.4	0.9	83.74	132	223.12
0.5	0.1	148.72	129	238.12
0.5	0.2	125.86	133	237.26
0.5	0.3	81.07	132	222.32
0.5	0.4	95.63	136	232.69
0.5	0.5	85.85	133	225.25
0.5	0.6	85.41	134	226.62
0.5	0.7	88.02	130	221.41
0.5	0.8	77.74	135	225.82
0.5	0.9	79.18	133	223.25
0.6	0.1	120.71	130	231.21
0.6	0.2	135.39	138	247.62
0.6	0.3	82.91	128	216.87
0.6	0.4	95.47	128	220.64
0.6	0.5	84.52	132	223.36
0.6	0.6	84.08	133	224.72
0.6	0.7	82.46	137	230.24
0.6	0.8	84.02	132	223.21
0.6	0.9	87.52	137	231.76
0.7	0.1	121.98	131	233.09
0.7	0.2	95.64	133	228.19
0.7	0.3	82.58	134	225.77
0.7	0.4	80.46	133	223.64
0.7	0.5	85.91	133	225.27
0.7	0.6	87.58	134	227.27
0.7	0.7	80.52	132	222.16
0.7	0.8	83.74	132	223.12
0.7	0.9	82.46	130	219.74
0.8	0.1	110.77	137	238.73
0.8	0.2	132.1	128	231.63
0.8	0.3	95.25	129	222.07
0.8	0.4	97.14	132	227.14
0.8	0.5	91.8	130	222.54
0.8	0.6	79.46	132	221.84
0.8	0.7	86.58	133	225.47
0.8	0.8	87.91	133	225.87
0.8	0.9	90.3	128	219.09
0.9	0.1	173.98	127	242.69
0.9	0.2	101.98	133	230.09
0.9	0.3	91.02	132	225.31
0.9	0.4	93.25	136	231.97
0.9	0.5	92.02	134	228.61
0.9	0.6	83.41	131	221.52
0.9	0.7	92.36	136	231.71
0.9	0.8	88.92	131	223.17
0.9	0.9	90.46	129	220.64
