0.2	0.5	6	9.15
0.2	22.29	33	56.19
0.2	55.14	79	135.04
0.2	136.14	138	247.84
0.2	224.15	208	379.24
0.2	355.75	283	531.23
0.2	470.04	389	724.51
0.2	595.72	502	931.72
0.2	827.55	550	1073.26
0.2	959.25	746	1406.77
0.2	1202.05	888	1692.61
0.2	1463.93	903	1793.68
0.2	1733.45	1185	2297.54
0.2	1887.81	1360	2606.34
0.2	2227.48	1564	3014.25
0.2	2657.0	1558	3134.1
0.2	2935.56	1900	3730.67
0.2	3316.61	2116	4168.98
0.2	3759.03	2066	4226.71
0.2	4167.52	2546	5069.26
