0.9	0.9	1.5	6	9.45
0.9	0.9	14.11	32	52.23
0.9	0.9	48.57	73	124.07
0.9	0.9	91.19	129	220.86
0.9	0.9	153.48	200	346.04
0.9	0.9	204.16	283	485.75
0.9	0.9	313.85	365	641.66
0.9	0.9	400.94	471	826.78
0.9	0.9	511.23	574	1014.37
0.9	0.9	621.53	696	1230.46
0.9	0.9	785.74	812	1453.72
0.9	0.9	919.55	966	1724.87
0.9	0.9	1097.25	1109	1992.68
0.9	0.9	1241.85	1272	2280.55
0.9	0.9	1476.9	1418	2570.07
0.9	0.9	1662.32	1596	2892.7
0.9	0.9	1922.14	1790	3261.64
0.9	0.9	2065.64	1970	3574.69
0.9	0.9	2395.41	2160	3958.62
0.9	0.9	2577.64	2351	4299.79
