0.9	0.9	1.0	6	9.3
0.9	0.9	12.61	31	50.28
0.9	0.9	46.28	75	126.38
0.9	0.9	83.24	126	213.97
0.9	0.9	151.31	198	342.39
0.9	0.9	207.49	277	477.75
0.9	0.9	298.91	365	637.17
0.9	0.9	389.81	466	815.94
0.9	0.9	517.57	578	1022.27
0.9	0.9	611.86	689	1217.06
0.9	0.9	795.69	820	1468.71
0.9	0.9	916.83	963	1719.55
0.9	0.9	1097.81	1097	1974.84
0.9	0.9	1242.02	1267	2273.11
0.9	0.9	1457.02	1418	2564.11
0.9	0.9	1622.05	1616	2910.62
0.9	0.9	1922.36	1774	3237.71
0.9	0.9	2060.8	1973	3577.74
0.9	0.9	2396.18	2165	3966.35
0.9	0.9	2589.16	2362	4319.75
