0.1	0.1	213.33	124	250.0
0.1	0.2	97.14	136	233.14
0.1	0.3	105.31	136	235.59
0.1	0.4	98.64	129	223.09
0.1	0.5	96.47	135	231.44
0.1	0.6	93.25	127	218.47
0.1	0.7	84.41	135	227.82
0.1	0.8	86.85	123	210.55
0.1	0.9	87.91	133	225.87
0.2	0.1	122.21	132	234.66
0.2	0.2	127.94	138	245.38
0.2	0.3	92.8	133	227.34
0.2	0.4	85.41	133	225.12
0.2	0.5	100.14	135	232.54
0.2	0.6	82.08	133	224.12
0.2	0.7	80.96	126	213.29
0.2	0.8	87.75	133	225.82
0.2	0.9	85.52	127	216.16
0.3	0.1	186.17	131	252.35
0.3	0.2	103.48	136	235.04
0.3	0.3	99.64	133	229.39
0.3	0.4	92.92	135	230.37
0.3	0.5	83.08	132	222.92
0.3	0.6	84.96	129	218.99
0.3	0.7	85.91	137	231.27
0.3	0.8	90.25	127	217.57
0.3	0.9	81.58	128	216.47
0.4	0.1	137.2	130	236.16
0.4	0.2	81.79	131	221.04
0.4	0.3	86.58	128	217.97
0.4	0.4	84.96	131	221.99
0.4	0.5	99.14	135	232.24
0.4	0.6	89.19	130	221.76
0.4	0.7	80.29	128	216.09
0.4	0.8	86.96	133	225.59
0.4	0.9	86.46	127	216.44
0.5	0.1	112.21	135	236.16
0.5	0.2	90.3	125	214.59
0.5	0.3	106.64	131	228.49
0.5	0.4	98.59	127	220.08
0.5	0.5	89.96	137	232.49
0.5	0.6	79.96	131	220.49
0.5	0.7	85.85	133	225.25
0.5	0.8	82.46	139	233.24
0.5	0.9	82.29	133	224.19
0.6	0.1	112.44	133	233.23
0.6	0.2	163.01	131	245.4
0.6	0.3	104.31	135	233.79
0.6	0.4	82.79	132	222.84
0.6	0.5	85.68	129	219.2
0.6	0.6	87.19	127	216.66
0.6	0.7	81.46	129	217.94
0.6	0.8	87.63	125	213.79
0.6	0.9	80.79	130	219.24
0.7	0.1	145.0	134	244.5
0.7	0.2	100.93	136	234.28
0.7	0.3	93.92	129	221.67
0.7	0.4	95.19	136	232.56
0.7	0.5	94.63	130	223.39
0.7	0.6	83.41	130	220.02
0.7	0.7	94.37	134	229.31
0.7	0.8	84.96	130	220.49
0.7	0.9	80.91	135	226.77
0.8	0.1	119.38	128	227.81
0.8	0.2	105.2	130	226.56
0.8	0.3	106.92	132	230.07
0.8	0.4	83.58	133	224.57
0.8	0.5	82.46	133	224.24
0.8	0.6	82.85	132	222.85
0.8	0.7	84.24	127	215.77
0.8	0.8	88.35	130	221.5
0.8	0.9	78.24	124	209.47
0.9	0.1	113.43	134	235.03
0.9	0.2	84.63	132	223.39
0.9	0.3	85.3	129	219.09
0.9	0.4	87.19	128	218.16
0.9	0.5	87.63	131	222.79
0.9	0.6	90.25	135	229.57
0.9	0.7	94.3	130	223.29
0.9	0.8	82.79	131	221.34
0.9	0.9	84.69	135	227.91
