0.6	1.0	6	9.3
0.6	27.18	34	59.15
0.6	58.87	80	137.66
0.6	133.79	142	253.14
0.6	219.38	209	379.31
0.6	341.37	297	547.91
0.6	388.05	402	719.41
0.6	642.49	512	960.75
0.6	736.01	636	1174.8
0.6	1001.51	764	1446.45
0.6	1250.15	908	1737.04
0.6	1492.58	1067	2048.27
0.6	1785.98	1230	2380.79
0.6	1951.99	1405	2693.1
0.6	2393.19	1600	3117.96
0.6	2434.53	1798	3427.36
0.6	2984.85	2007	3905.96
0.6	3213.45	2227	4304.54
0.6	3691.16	2446	4776.35
0.6	4268.7	2680	5300.61
