0.05	0	101	151.5
0.1	1.0	114	171.3
0.15	2.5	120	180.75
0.2	4.61	121	182.88
0.25	15.11	134	205.53
0.3	17.67	139	213.8
0.35	43.08	137	218.42
0.4	58.75	143	232.12
0.45	67.97	140	230.39
0.5	65.08	140	229.52
0.55	87.55	139	234.76
0.6	136.79	137	246.54
0.65	163.58	141	260.57
0.7	191.99	136	261.6
0.75	212.38	132	261.71
0.8	266.28	126	268.88
0.85	315.91	120	274.77
0.9	360.74	111	274.72
0.95	415.21	98	271.56
