0.2	7.73	6	11.32
0.2	29.35	29	52.3
0.2	85.22	58	112.57
0.2	145.47	114	214.64
0.2	257.1	167	327.63
0.2	328.79	237	454.14
0.2	516.38	308	616.91
0.2	619.56	398	782.87
0.2	798.78	491	976.13
0.2	910.64	597	1168.69
0.2	1201.94	680	1380.58
0.2	1325.68	790	1582.71
0.2	1643.28	910	1857.98
0.2	1778.06	1041	2094.92
0.2	2197.82	1154	2390.35
0.2	2466.22	1311	2706.37
0.2	2801.52	1451	3016.96
0.2	2983.39	1598	3292.02
0.2	3520.9	1767	3706.77
0.2	3776.11	1957	4068.33
