0.2	4.0	6	10.2
0.2	32.97	29	53.39
0.2	59.36	69	121.31
0.2	152.45	135	248.23
0.2	229.28	215	391.28
0.2	316.58	290	529.97
0.2	440.29	401	733.59
0.2	618.42	502	938.53
0.2	774.38	539	1040.81
0.2	975.86	747	1413.26
0.2	1208.21	884	1688.46
0.2	1453.6	928	1828.08
0.2	1738.9	1042	2084.67
0.2	1946.86	1339	2592.56
0.2	2319.46	1359	2734.34
0.2	2483.04	1736	3348.91
0.2	3068.97	1938	3827.69
0.2	3378.98	2137	4219.2
0.2	3818.36	2374	4706.51
0.2	4062.13	2578	5085.64
