0.2	7.73	6	11.32
0.2	29.96	28	50.99
0.2	78.28	63	117.98
0.2	146.8	112	212.04
0.2	255.76	170	331.73
0.2	323.72	242	460.12
0.2	493.23	307	608.47
0.2	579.14	387	754.24
0.2	837.55	478	968.26
0.2	857.13	571	1113.64
0.2	1161.58	683	1372.97
0.2	1343.73	808	1615.12
0.2	1682.15	919	1883.14
0.2	1788.7	1030	2081.61
0.2	2163.12	1166	2397.93
0.2	2403.92	1296	2665.18
0.2	2803.97	1446	3010.19
0.2	3033.53	1627	3350.56
0.2	3403.9	1728	3613.17
0.2	3848.28	1950	4079.48
