0.1	0.1	169.01	132	248.7
0.1	0.2	129.0	135	241.2
0.1	0.3	86.46	125	213.44
0.1	0.4	113.98	133	233.69
0.1	0.5	97.3	132	227.19
0.1	0.6	92.69	132	225.81
0.1	0.7	86.35	131	222.4
0.1	0.8	90.24	131	223.57
0.1	0.9	86.96	137	231.59
0.2	0.1	200.4	125	247.62
0.2	0.2	109.48	130	227.84
0.2	0.3	86.41	129	219.42
0.2	0.4	84.85	132	223.45
0.2	0.5	94.8	132	226.44
0.2	0.6	84.46	127	215.84
0.2	0.7	88.08	132	224.42
0.2	0.8	85.79	132	223.74
0.2	0.9	87.08	133	225.62
0.3	0.1	91.63	132	225.49
0.3	0.2	106.04	135	234.31
0.3	0.3	92.75	136	231.82
0.3	0.4	93.59	134	229.08
0.3	0.5	84.35	127	215.8
0.3	0.6	90.42	135	229.62
0.3	0.7	83.85	130	220.15
0.3	0.8	85.74	134	226.72
0.3	0.9	85.35	136	229.6
0.4	0.1	173.12	135	254.43
0.4	0.2	80.29	135	226.59
0.4	0.3	96.3	136	232.89
0.4	0.4	99.59	136	233.88
0.4	0.5	96.86	129	222.56
0.4	0.6	91.97	133	227.09
0.4	0.7	85.13	130	220.54
0.4	0.8	83.74	135	227.62
0.4	0.9	82.96	122	207.89
0.5	0.1	116.16	131	231.35
0.5	0.2	109.15	134	233.75
0.5	0.3	90.63	134	228.19
0.5	0.4	98.69	135	232.11
0.5	0.5	81.62	130	219.49
0.5	0.6	84.35	132	223.3
0.5	0.7	83.57	136	229.07
0.5	0.8	81.79	131	221.04
0.5	0.9	84.29	132	223.29
0.6	0.1	126.61	128	229.98
0.6	0.2	105.31	132	229.59
0.6	0.3	102.47	130	225.74
0.6	0.4	84.96	131	221.99
0.6	0.5	88.86	126	215.66
0.6	0.6	94.92	135	230.97
0.6	0.7	87.91	128	218.37
0.6	0.8	80.96	135	226.79
0.6	0.9	83.41	135	227.52
0.7	0.1	160.73	132	246.22
0.7	0.2	132.15	125	227.15
0.7	0.3	85.46	136	229.64
0.7	0.4	100.63	131	226.69
0.7	0.5	84.08	131	221.72
0.7	0.6	94.25	133	227.77
0.7	0.7	84.24	132	223.27
0.7	0.8	83.91	133	224.67
0.7	0.9	83.96	127	215.69
0.8	0.1	129.94	132	236.98
0.8	0.2	88.63	134	227.59
0.8	0.3	93.03	136	231.91
0.8	0.4	80.35	131	220.6
0.8	0.5	93.36	133	227.51
0.8	0.6	80.18	133	223.55
0.8	0.7	86.13	124	211.84
0.8	0.8	84.58	132	223.37
0.8	0.9	83.91	126	214.17
0.9	0.1	190.02	130	252.01
0.9	0.2	98.86	134	230.66
0.9	0.3	98.75	134	230.62
0.9	0.4	87.02	129	219.61
0.9	0.5	98.3	132	227.49
0.9	0.6	83.96	133	224.69
0.9	0.7	86.68	132	224.0
0.9	0.8	90.96	129	220.79
0.9	0.9	83.08	137	230.42
