0.2	0.5	6	9.15
0.2	25.24	30	52.57
0.2	55.14	81	138.04
0.2	150.11	143	259.53
0.2	216.02	215	387.31
0.2	307.98	300	542.39
0.2	465.96	387	720.29
0.2	611.07	510	948.32
0.2	819.83	620	1175.95
0.2	964.79	743	1403.94
0.2	1329.21	792	1586.76
0.2	1458.84	1042	2000.65
0.2	1780.27	1187	2314.58
0.2	1925.14	1178	2344.54
0.2	2339.73	1335	2704.42
0.2	2736.14	1736	3424.84
0.2	3028.89	1928	3800.67
0.2	3351.28	2122	4188.39
0.2	3736.59	2360	4660.98
0.2	4054.34	2555	5048.8
