0.1	0.1	221.96	128	258.59
0.1	0.2	167.0	131	246.6
0.1	0.3	102.64	133	230.29
0.1	0.4	85.52	133	225.16
0.1	0.5	98.3	137	234.99
0.1	0.6	99.42	130	224.82
0.1	0.7	88.13	135	228.94
0.1	0.8	92.19	132	225.66
0.1	0.9	94.09	132	226.23
0.2	0.1	173.46	133	251.54
0.2	0.2	110.2	134	234.06
0.2	0.3	98.76	128	221.63
0.2	0.4	89.58	129	220.37
0.2	0.5	97.63	133	228.79
0.2	0.6	85.29	133	225.09
0.2	0.7	85.13	134	226.54
0.2	0.8	88.25	130	221.47
0.2	0.9	93.25	126	216.97
0.3	0.1	143.61	129	236.58
0.3	0.2	118.54	130	230.56
0.3	0.3	96.86	133	228.56
0.3	0.4	109.04	130	227.71
0.3	0.5	83.24	125	212.47
0.3	0.6	81.58	136	228.47
0.3	0.7	89.63	131	223.39
0.3	0.8	84.46	132	223.34
0.3	0.9	84.96	133	224.99
0.4	0.1	87.63	134	227.29
0.4	0.2	89.75	137	232.42
0.4	0.3	96.86	123	213.56
0.4	0.4	86.52	132	223.96
0.4	0.5	85.69	130	220.71
0.4	0.6	78.74	131	220.12
0.4	0.7	88.58	131	223.07
0.4	0.8	85.52	130	220.66
0.4	0.9	88.52	135	229.06
0.5	0.1	130.99	133	238.8
0.5	0.2	101.2	132	228.36
0.5	0.3	91.47	129	220.94
0.5	0.4	78.91	133	223.17
0.5	0.5	94.86	138	235.46
0.5	0.6	81.85	128	216.55
0.5	0.7	79.35	123	208.3
0.5	0.8	83.46	129	218.54
0.5	0.9	87.08	130	221.12
0.6	0.1	128.99	135	241.2
0.6	0.2	99.42	134	230.82
0.6	0.3	90.92	134	228.27
0.6	0.4	105.43	131	228.13
0.6	0.5	83.52	133	224.56
0.6	0.6	86.52	140	235.96
0.6	0.7	84.52	126	214.36
0.6	0.8	84.96	124	211.49
0.6	0.9	85.58	126	214.67
0.7	0.1	134.71	127	230.91
0.7	0.2	88.36	129	220.01
0.7	0.3	101.98	132	228.59
0.7	0.4	87.41	120	206.22
0.7	0.5	85.35	131	222.1
0.7	0.6	87.79	132	224.34
0.7	0.7	85.58	129	219.17
0.7	0.8	76.62	135	225.49
0.7	0.9	85.96	135	228.29
0.8	0.1	140.17	133	241.55
0.8	0.2	113.93	133	233.68
0.8	0.3	89.08	135	229.22
0.8	0.4	95.36	133	228.11
0.8	0.5	84.96	137	230.99
0.8	0.6	87.58	128	218.27
0.8	0.7	83.41	134	226.02
0.8	0.8	90.46	138	234.14
0.8	0.9	87.75	131	222.82
0.9	0.1	114.94	137	239.98
0.9	0.2	107.6	135	234.78
0.9	0.3	83.96	131	221.69
0.9	0.4	87.08	134	227.12
0.9	0.5	83.29	131	221.49
0.9	0.6	79.74	129	217.42
0.9	0.7	82.35	129	218.2
0.9	0.8	84.41	134	226.32
0.9	0.9	83.85	137	230.65
