0.6	1.5	6	9.45
0.6	14.84	35	56.95
0.6	66.15	79	138.35
0.6	152.52	139	254.26
0.6	195.22	218	385.57
0.6	302.17	301	542.15
0.6	448.28	411	750.98
0.6	571.2	516	945.36
0.6	705.14	645	1179.04
0.6	977.29	770	1448.19
0.6	1238.81	915	1744.14
0.6	1485.21	1066	2044.56
0.6	1612.7	1229	2327.31
0.6	1971.9	1414	2712.57
0.6	2186.33	1602	3058.9
0.6	2668.61	1794	3491.58
0.6	2821.26	2018	3873.38
0.6	3373.82	2217	4337.64
0.6	3749.01	2453	4804.2
0.6	4280.03	2679	5302.51
