0.1	0.1	191.19	131	253.86
0.1	0.2	113.71	132	232.11
0.1	0.3	116.99	129	228.6
0.1	0.4	94.86	135	230.96
0.1	0.5	90.47	132	225.14
0.1	0.6	90.69	130	222.21
0.1	0.7	88.69	136	230.61
0.1	0.8	89.97	133	226.49
0.1	0.9	89.58	134	227.87
0.2	0.1	170.12	133	250.53
0.2	0.2	168.89	130	245.67
0.2	0.3	93.8	128	220.14
0.2	0.4	106.54	133	231.46
0.2	0.5	84.91	133	224.97
0.2	0.6	83.96	125	212.69
0.2	0.7	90.75	135	229.72
0.2	0.8	86.96	134	227.09
0.2	0.9	90.91	135	229.77
0.3	0.1	127.89	124	224.37
0.3	0.2	107.31	134	233.19
0.3	0.3	82.68	134	225.8
0.3	0.4	87.69	130	221.31
0.3	0.5	87.63	137	231.79
0.3	0.6	85.02	132	223.51
0.3	0.7	88.02	130	221.41
0.3	0.8	84.68	131	221.9
0.3	0.9	85.08	132	223.52
0.4	0.1	141.38	130	237.41
0.4	0.2	101.2	135	232.86
0.4	0.3	121.1	136	240.33
0.4	0.4	91.25	133	226.87
0.4	0.5	78.85	135	226.15
0.4	0.6	80.85	126	213.25
0.4	0.7	78.29	132	221.49
0.4	0.8	83.24	126	213.97
0.4	0.9	84.68	128	217.4
0.5	0.1	176.06	131	249.32
0.5	0.2	107.37	133	231.71
0.5	0.3	89.59	131	223.38
0.5	0.4	87.24	131	222.67
0.5	0.5	81.74	136	228.52
0.5	0.6	88.75	132	224.62
0.5	0.7	86.96	131	222.59
0.5	0.8	86.91	132	224.07
0.5	0.9	84.19	129	218.76
0.6	0.1	129.83	130	233.95
0.6	0.2	94.8	129	221.94
0.6	0.3	84.41	134	226.32
0.6	0.4	86.69	126	215.01
0.6	0.5	89.92	133	226.47
0.6	0.6	83.79	132	223.14
0.6	0.7	83.29	137	230.49
0.6	0.8	76.24	133	222.37
0.6	0.9	82.63	133	224.29
0.7	0.1	121.44	124	222.43
0.7	0.2	84.41	126	214.32
0.7	0.3	78.12	137	228.94
0.7	0.4	83.63	136	229.09
0.7	0.5	88.41	132	224.52
0.7	0.6	88.75	128	218.62
0.7	0.7	78.85	134	224.65
0.7	0.8	85.35	132	223.6
0.7	0.9	80.85	124	210.25
0.8	0.1	98.98	130	224.69
0.8	0.2	108.31	136	236.49
0.8	0.3	87.35	134	227.2
0.8	0.4	83.35	129	218.5
0.8	0.5	91.02	132	225.31
0.8	0.6	88.63	131	223.09
0.8	0.7	83.68	132	223.1
0.8	0.8	85.96	136	229.79
0.8	0.9	87.29	135	228.69
0.9	0.1	103.8	136	235.14
0.9	0.2	125.27	127	228.08
0.9	0.3	91.63	130	222.49
0.9	0.4	85.85	139	234.25
0.9	0.5	81.24	129	217.87
0.9	0.6	93.3	138	234.99
0.9	0.7	96.53	133	228.46
0.9	0.8	82.85	134	225.85
0.9	0.9	89.08	131	223.22
