0.2	7.73	6	11.32
0.2	24.18	31	53.75
0.2	92.79	63	122.34
0.2	138.69	112	209.61
0.2	245.99	167	324.3
0.2	320.28	233	445.58
0.2	471.05	296	585.31
0.2	592.99	389	761.4
0.2	796.44	468	940.93
0.2	954.01	585	1163.7
0.2	1159.82	687	1378.44
0.2	1341.69	792	1590.51
0.2	1650.83	909	1858.75
0.2	1841.92	1046	2121.58
0.2	2113.67	1162	2377.1
0.2	2323.25	1295	2639.47
0.2	2754.73	1441	2987.92
0.2	3065.4	1599	3318.12
0.2	3482.14	1746	3663.64
0.2	3729.98	1901	3970.49
