0.2	3.61	6	10.08
0.2	18.07	34	56.42
0.2	62.76	78	135.83
0.2	150.76	139	253.73
0.2	222.75	187	347.33
0.2	349.13	268	506.74
0.2	452.74	396	729.82
0.2	598.86	426	818.66
0.2	753.23	558	1062.97
0.2	991.21	681	1318.86
0.2	1178.41	883	1678.02
0.2	1539.82	929	1855.45
0.2	1753.19	1050	2100.96
0.2	2024.47	1216	2431.34
0.2	2207.85	1551	2988.85
0.2	2617.12	1742	3398.14
0.2	2914.85	1669	3377.95
0.2	3389.8	2146	4235.94
0.2	3655.56	2350	4621.67
0.2	4232.79	2565	5117.34
