0.6	3.61	6	10.08
0.6	23.85	34	58.15
0.6	64.09	80	139.23
0.6	153.75	140	256.12
0.6	220.62	215	388.69
0.6	313.25	297	539.48
0.6	454.12	402	739.24
0.6	599.12	512	947.73
0.6	777.01	629	1176.6
0.6	967.47	775	1452.74
0.6	1149.82	911	1711.45
0.6	1441.58	1072	2040.47
0.6	1721.43	1236	2370.43
0.6	2164.6	1400	2749.38
0.6	2326.97	1594	3089.09
0.6	2582.9	1800	3474.87
0.6	2961.02	2006	3897.31
0.6	3391.53	2212	4335.46
0.6	3828.62	2440	4808.58
0.6	4208.61	2690	5297.58
