0.05	66.09	138	226.83
0.1	109.13	141	244.24
0.15	119.9	126	224.97
0.2	128.79	138	245.64
0.25	114.4	139	242.82
0.3	169.56	130	245.87
0.35	176.52	133	252.46
0.4	186.9	135	258.57
0.45	192.57	130	252.77
0.5	206.86	134	263.06
0.55	230.6	129	262.68
0.6	235.5	129	264.15
0.65	277.6	119	261.78
0.7	273.84	122	265.15
0.75	335.7	114	271.71
0.8	341.84	111	269.05
0.85	348.72	111	271.12
0.9	388.36	104	272.51
0.95	411.82	99	272.05
