0.9	0.9	1.5	6	9.45
0.9	0.9	15.73	31	51.22
0.9	0.9	50.18	73	124.55
0.9	0.9	84.13	135	227.74
0.9	0.9	156.48	195	339.44
0.9	0.9	210.89	282	486.27
0.9	0.9	305.18	364	637.55
0.9	0.9	390.7	471	823.71
0.9	0.9	510.95	580	1023.28
0.9	0.9	614.86	699	1232.96
0.9	0.9	783.57	823	1469.57
0.9	0.9	901.83	960	1710.55
0.9	0.9	1108.1	1112	2000.43
0.9	0.9	1240.84	1267	2272.75
0.9	0.9	1477.57	1429	2586.77
0.9	0.9	1630.25	1603	2893.57
0.9	0.9	1919.12	1767	3226.24
0.9	0.9	2098.81	1966	3578.64
0.9	0.9	2372.02	2143	3926.11
0.9	0.9	2588.35	2381	4348.01
