0.05	71.59	135	223.98
0.1	96.49	122	211.95
0.15	93.25	123	212.47
0.2	129.85	139	247.46
0.25	152.82	118	222.85
0.3	177.85	138	260.36
0.35	172.35	136	255.71
0.4	169.12	127	241.24
0.45	198.9	129	253.17
0.5	210.26	134	264.08
0.55	244.45	127	263.83
0.6	220.2	135	268.56
0.65	259.16	125	265.25
0.7	293.82	120	268.14
0.75	279.05	124	269.72
0.8	327.43	120	278.23
0.85	361.64	108	270.49
0.9	398.3	103	273.99
0.95	422.32	98	273.7
