0.05	82.66	133	224.3
0.1	86.94	133	225.58
0.15	126.81	141	249.54
0.2	113.73	137	239.62
0.25	128.58	141	250.07
0.3	151.99	139	254.1
0.35	161.33	133	247.9
0.4	187.41	137	261.72
0.45	190.68	128	249.21
0.5	210.25	129	256.58
0.55	242.37	123	257.21
0.6	266.11	126	268.83
0.65	262.44	123	263.23
0.7	292.77	115	260.33
0.75	290.88	123	271.76
0.8	335.54	116	274.66
0.85	342.27	111	269.18
0.9	387.41	106	275.22
0.95	423.1	99	275.43
