0.9	0.9	2.5	6	9.75
0.9	0.9	14.61	31	50.88
0.9	0.9	45.51	78	130.65
0.9	0.9	88.63	130	221.59
0.9	0.9	154.21	201	347.76
0.9	0.9	214.72	277	479.92
0.9	0.9	320.19	358	633.06
0.9	0.9	381.09	479	832.83
0.9	0.9	515.79	578	1021.74
0.9	0.9	617.15	701	1236.64
0.9	0.9	787.35	812	1454.2
0.9	0.9	908.93	964	1718.68
0.9	0.9	1105.09	1117	2007.03
0.9	0.9	1238.38	1259	2260.01
0.9	0.9	1470.5	1428	2583.15
0.9	0.9	1632.81	1603	2894.34
0.9	0.9	1881.11	1769	3217.83
0.9	0.9	2090.06	1973	3586.52
0.9	0.9	2397.08	2153	3948.62
0.9	0.9	2576.96	2377	4338.59
