0.05	0	101	151.5
0.1	0	109	163.5
0.15	1.5	117	175.95
0.2	4.0	131	197.7
0.25	13.61	130	199.08
0.3	23.57	138	214.07
0.35	32.79	137	215.34
0.4	46.41	141	225.42
0.45	46.69	137	219.51
0.5	81.71	142	237.51
0.55	62.75	141	230.32
0.6	127.9	141	249.87
0.65	147.24	140	254.17
0.7	231.45	130	264.43
0.75	256.39	130	271.92
0.8	295.85	122	271.76
0.85	299.06	120	269.72
0.9	325.58	119	276.17
0.95	419.93	98	272.98
