0.2	7.73	6	11.32
0.2	35.08	27	51.02
0.2	81.22	64	120.37
0.2	129.73	108	200.92
0.2	238.59	165	319.08
0.2	290.03	223	421.51
0.2	472.76	302	594.83
0.2	589.38	388	758.81
0.2	810.34	476	957.1
0.2	923.35	578	1144.0
0.2	1143.15	679	1361.44
0.2	1257.87	796	1571.36
0.2	1652.48	916	1869.74
0.2	1854.82	1027	2096.94
0.2	2184.1	1165	2402.73
0.2	2385.53	1283	2640.16
0.2	2778.57	1439	2992.07
0.2	2970.39	1612	3309.12
0.2	3537.79	1753	3690.84
0.2	3749.0	1952	4052.7
