0.1	0.1	173.63	133	251.59
0.1	0.2	124.43	131	233.83
0.1	0.3	130.65	134	240.2
0.1	0.4	86.96	131	222.59
0.1	0.5	113.93	132	232.18
0.1	0.6	84.79	131	221.94
0.1	0.7	89.25	131	223.27
0.1	0.8	86.35	135	228.4
0.1	0.9	93.96	131	224.69
0.2	0.1	171.89	129	245.07
0.2	0.2	88.75	126	215.62
0.2	0.3	94.97	132	226.49
0.2	0.4	83.91	135	227.67
0.2	0.5	85.85	129	219.25
0.2	0.6	81.35	129	217.9
0.2	0.7	84.79	130	220.44
0.2	0.8	83.68	134	226.1
0.2	0.9	86.52	129	219.46
0.3	0.1	192.34	132	255.7
0.3	0.2	86.75	129	219.52
0.3	0.3	87.86	137	231.86
0.3	0.4	85.24	133	225.07
0.3	0.5	92.92	133	227.37
0.3	0.6	85.96	128	217.79
0.3	0.7	84.24	135	227.77
0.3	0.8	82.96	136	228.89
0.3	0.9	85.02	135	228.01
0.4	0.1	174.73	134	253.42
0.4	0.2	90.69	131	223.71
0.4	0.3	95.7	132	226.71
0.4	0.4	86.63	133	225.49
0.4	0.5	90.8	135	229.74
0.4	0.6	82.74	130	219.82
0.4	0.7	87.36	133	225.71
0.4	0.8	87.58	135	228.77
0.4	0.9	84.96	129	218.99
0.5	0.1	185.5	131	252.15
0.5	0.2	103.54	129	224.56
0.5	0.3	88.96	131	223.19
0.5	0.4	89.3	136	230.79
0.5	0.5	80.35	131	220.6
0.5	0.6	96.8	137	234.54
0.5	0.7	85.85	126	214.75
0.5	0.8	93.69	134	229.11
0.5	0.9	88.46	131	223.04
0.6	0.1	200.68	135	262.7
0.6	0.2	95.75	133	228.22
0.6	0.3	88.63	131	223.09
0.6	0.4	88.3	130	221.49
0.6	0.5	86.58	128	217.97
0.6	0.6	82.96	134	225.89
0.6	0.7	81.29	130	219.39
0.6	0.8	85.46	131	222.14
0.6	0.9	85.24	135	228.07
0.7	0.1	136.88	134	242.06
0.7	0.2	103.76	138	238.13
0.7	0.3	82.96	127	215.39
0.7	0.4	84.74	132	223.42
0.7	0.5	87.41	136	230.22
0.7	0.6	89.02	133	226.21
0.7	0.7	84.62	129	218.89
0.7	0.8	80.79	132	222.24
0.7	0.9	82.58	130	219.77
0.8	0.1	113.6	132	232.08
0.8	0.2	114.6	130	229.38
0.8	0.3	89.63	126	215.89
0.8	0.4	85.08	137	231.02
0.8	0.5	84.91	131	221.97
0.8	0.6	86.63	135	228.49
0.8	0.7	81.35	133	223.9
0.8	0.8	84.46	133	224.84
0.8	0.9	87.19	133	225.66
0.9	0.1	131.21	132	237.36
0.9	0.2	116.94	132	233.08
0.9	0.3	95.36	132	226.61
0.9	0.4	92.46	131	224.24
0.9	0.5	95.25	135	231.07
0.9	0.6	85.35	131	222.1
0.9	0.7	89.13	131	223.24
0.9	0.8	80.29	134	225.09
0.9	0.9	88.79	127	217.14
