0.05	0	101	151.5
0.1	0	106	159.0
0.15	2.0	123	185.1
0.2	4.0	128	193.2
0.25	25.12	135	210.04
0.3	25.45	134	208.64
0.35	32.79	136	213.84
0.4	50.86	140	225.26
0.45	64.43	142	232.33
0.5	79.64	142	236.89
0.55	130.68	139	247.7
0.6	119.0	142	248.7
0.65	144.13	138	250.24
0.7	203.6	135	263.58
0.75	227.73	132	266.32
0.8	273.4	122	265.02
0.85	321.28	120	276.38
0.9	378.12	107	273.94
0.95	409.37	101	274.31
