0.2	2.5	6	9.75
0.2	19.01	34	56.7
0.2	65.1	74	130.53
0.2	166.96	123	234.59
0.2	199.47	211	376.34
0.2	364.58	267	509.88
0.2	470.54	395	733.66
0.2	582.08	502	927.62
0.2	824.74	627	1187.92
0.2	963.96	634	1240.19
0.2	1157.54	891	1683.76
0.2	1493.78	920	1828.13
0.2	1717.86	1198	2312.36
0.2	2073.21	1354	2652.96
0.2	2342.61	1542	3015.78
0.2	2713.78	1726	3403.13
0.2	2916.61	1907	3735.48
0.2	3338.2	2164	4247.46
0.2	3816.57	2093	4284.47
0.2	4129.68	2224	4574.9
