0.9	0.9	2.5	6	9.75
0.9	0.9	13.61	32	52.08
0.9	0.9	46.45	73	123.44
0.9	0.9	87.58	134	227.27
0.9	0.9	149.54	202	347.86
0.9	0.9	212.82	277	479.35
0.9	0.9	310.68	369	646.7
0.9	0.9	391.3	479	835.89
0.9	0.9	523.62	571	1013.59
0.9	0.9	620.65	693	1225.69
0.9	0.9	786.18	827	1476.35
0.9	0.9	908.76	960	1712.63
0.9	0.9	1088.85	1099	1975.15
0.9	0.9	1249.91	1257	2260.47
0.9	0.9	1493.57	1429	2591.57
0.9	0.9	1618.64	1592	2873.59
0.9	0.9	1883.76	1777	3230.63
0.9	0.9	2069.74	1974	3581.92
0.9	0.9	2381.09	2148	3936.33
0.9	0.9	2586.12	2379	4344.33
