0.9	0.9	1.0	6	9.3
0.9	0.9	15.73	31	51.22
0.9	0.9	50.95	69	118.79
0.9	0.9	87.02	137	231.61
0.9	0.9	149.8	201	346.44
0.9	0.9	208.16	279	480.95
0.9	0.9	307.46	366	641.24
0.9	0.9	385.09	466	814.53
0.9	0.9	517.29	575	1017.69
0.9	0.9	617.92	695	1227.88
0.9	0.9	776.41	826	1471.92
0.9	0.9	904.65	961	1712.89
0.9	0.9	1113.67	1113	2003.6
0.9	0.9	1237.33	1258	2258.2
0.9	0.9	1486.68	1426	2585.0
0.9	0.9	1628.03	1586	2867.41
0.9	0.9	1908.3	1779	3240.99
0.9	0.9	2088.38	1974	3587.51
0.9	0.9	2389.73	2145	3934.42
0.9	0.9	2583.23	2374	4335.97
