0.2	7.73	6	11.32
0.2	22.07	28	48.62
0.2	84.17	64	121.25
0.2	132.85	110	204.86
0.2	243.14	169	326.44
0.2	302.17	231	437.15
0.2	443.4	307	593.52
0.2	611.32	396	777.4
0.2	795.29	474	949.59
0.2	909.47	578	1139.84
0.2	1193.27	684	1383.98
0.2	1338.65	804	1607.59
0.2	1679.89	911	1870.47
0.2	1826.34	1020	2077.9
0.2	2186.76	1164	2402.03
0.2	2385.52	1310	2680.66
0.2	2744.36	1460	3013.31
0.2	3020.93	1591	3292.78
0.2	3463.4	1752	3667.02
0.2	3767.99	1930	4025.4
