0.2	5.23	6	10.57
0.2	25.29	26	46.59
0.2	82.22	62	117.67
0.2	144.58	109	206.87
0.2	227.32	166	317.19
0.2	299.71	233	439.41
0.2	495.62	306	607.69
0.2	575.17	394	763.55
0.2	795.27	486	967.58
0.2	908.12	586	1151.44
0.2	1177.65	685	1380.79
0.2	1343.93	805	1610.68
0.2	1660.64	911	1864.69
0.2	1760.14	1046	2097.04
0.2	2131.77	1162	2382.53
0.2	2358.91	1313	2677.17
0.2	2795.38	1441	3000.11
0.2	3096.92	1621	3360.58
0.2	3416.42	1750	3649.93
0.2	3806.33	1943	4056.4
