0.9	0.9	1.5	6	9.45
0.9	0.9	16.17	32	52.85
0.9	0.9	49.4	72	122.82
0.9	0.9	81.74	128	216.52
0.9	0.9	153.43	194	337.03
0.9	0.9	211.6	276	477.48
0.9	0.9	319.08	373	655.22
0.9	0.9	384.86	464	811.46
0.9	0.9	521.57	573	1015.97
0.9	0.9	624.26	699	1235.78
0.9	0.9	774.35	818	1459.3
0.9	0.9	900.42	968	1722.13
0.9	0.9	1101.7	1112	1998.51
0.9	0.9	1234.61	1265	2267.88
0.9	0.9	1480.31	1428	2586.09
0.9	0.9	1639.38	1604	2897.81
0.9	0.9	1905.92	1769	3225.28
0.9	0.9	2061.71	1976	3582.51
0.9	0.9	2374.74	2174	3973.42
0.9	0.9	2576.95	2372	4331.08
