0.05	94.18	109	191.75
0.1	104.84	142	244.45
0.15	95.77	116	202.73
0.2	135.42	133	240.13
0.25	153.38	121	227.51
0.3	157.45	126	236.23
0.35	174.96	139	260.99
0.4	169.45	139	259.33
0.45	194.19	133	257.76
0.5	234.38	126	259.31
0.55	213.03	133	263.41
0.6	241.03	127	262.81
0.65	268.19	127	270.96
0.7	274.37	124	268.31
0.75	307.34	117	267.7
0.8	325.17	115	270.05
0.85	370.2	107	271.56
0.9	386.75	102	269.03
0.95	413.39	101	275.52
