0.9	0.9	1.0	6	9.3
0.9	0.9	15.67	32	52.7
0.9	0.9	48.12	73	123.94
0.9	0.9	85.96	128	217.79
0.9	0.9	150.09	198	342.03
0.9	0.9	212.88	282	486.86
0.9	0.9	305.96	362	634.79
0.9	0.9	387.46	468	818.24
0.9	0.9	512.05	575	1016.12
0.9	0.9	628.71	706	1247.61
0.9	0.9	778.56	813	1453.07
0.9	0.9	897.11	960	1709.13
0.9	0.9	1096.32	1106	1987.9
0.9	0.9	1239.27	1254	2252.78
0.9	0.9	1474.6	1413	2561.88
0.9	0.9	1624.03	1607	2897.71
0.9	0.9	1910.34	1762	3216.1
0.9	0.9	2075.8	1974	3583.74
0.9	0.9	2375.62	2163	3957.19
0.9	0.9	2598.33	2361	4321.0
