0.05	0	104	156.0
0.1	0.5	114	171.15
0.15	2.56	122	183.77
0.2	9.61	130	197.88
0.25	15.23	133	204.07
0.3	27.18	136	212.15
0.35	30.74	141	220.72
0.4	49.3	135	217.29
0.45	80.14	143	238.54
0.5	75.1	137	228.03
0.55	94.38	143	242.81
0.6	133.79	140	250.14
0.65	159.87	138	254.96
0.7	212.65	135	266.3
0.75	246.19	127	264.36
0.8	285.63	121	267.19
0.85	295.51	118	265.65
0.9	372.45	107	272.23
0.95	408.55	102	275.57
