0.6	7.73	6	11.32
0.6	20.4	36	60.12
0.6	58.26	79	135.98
0.6	114.84	142	247.45
0.6	191.27	217	382.88
0.6	308.94	302	545.68
0.6	457.62	405	744.79
0.6	589.13	517	952.24
0.6	812.11	633	1193.13
0.6	945.77	781	1455.23
0.6	1188.76	912	1724.63
0.6	1389.99	1069	2020.5
0.6	1818.17	1230	2390.45
0.6	1966.81	1416	2714.04
0.6	2368.6	1592	3098.58
0.6	2522.37	1798	3453.71
0.6	2951.88	2014	3906.56
0.6	3254.42	2226	4315.33
0.6	3593.61	2450	4753.08
0.6	4219.42	2680	5285.82
