0.05	0	101	151.5
0.1	0	114	171.0
0.15	6.06	122	184.82
0.2	10.17	129	196.55
0.25	9.06	128	194.72
0.3	20.28	137	211.58
0.35	23.9	138	214.17
0.4	42.74	140	222.82
0.45	43.24	137	218.47
0.5	73.15	141	233.45
0.55	110.67	142	246.2
0.6	123.74	142	250.12
0.65	126.63	141	249.49
0.7	198.99	135	262.2
0.75	255.18	126	265.56
0.8	246.56	127	264.47
0.85	316.56	117	270.47
0.9	367.34	105	267.7
0.95	407.38	101	273.71
