0.9	0.9	2.5	6	9.75
0.9	0.9	14.61	32	52.38
0.9	0.9	49.51	71	121.35
0.9	0.9	79.07	132	221.72
0.9	0.9	147.59	195	336.78
0.9	0.9	205.45	278	478.63
0.9	0.9	297.83	361	630.85
0.9	0.9	382.14	473	824.14
0.9	0.9	518.39	573	1015.02
0.9	0.9	605.69	711	1248.21
0.9	0.9	780.4	826	1473.12
0.9	0.9	908.32	961	1714.0
0.9	0.9	1094.08	1091	1964.73
0.9	0.9	1246.74	1265	2271.52
0.9	0.9	1469.59	1427	2581.38
0.9	0.9	1615.75	1604	2890.72
0.9	0.9	1923.7	1771	3233.61
0.9	0.9	2095.23	1959	3567.07
0.9	0.9	2377.75	2162	3956.32
0.9	0.9	2590.29	2372	4335.09
