0.2	7.73	6	11.32
0.2	28.12	28	50.44
0.2	91.06	63	121.82
0.2	131.57	107	199.97
0.2	238.76	167	322.13
0.2	324.18	232	445.25
0.2	466.98	306	599.09
0.2	572.68	386	750.8
0.2	745.07	470	928.52
0.2	877.6	580	1133.28
0.2	1203.37	682	1384.01
0.2	1342.91	810	1617.87
0.2	1656.46	918	1873.94
0.2	1832.77	1044	2115.83
0.2	2177.97	1171	2409.89
0.2	2463.27	1331	2735.48
0.2	2731.73	1445	2987.02
0.2	2972.41	1606	3300.72
0.2	3521.2	1758	3693.36
0.2	3854.49	1935	4058.85
