0.6	0	6	9.0
0.6	28.41	35	61.02
0.6	75.77	81	144.23
0.6	106.67	141	243.5
0.6	224.63	215	389.89
0.6	340.78	299	550.73
0.6	401.04	404	726.31
0.6	593.37	516	952.01
0.6	803.67	633	1190.6
0.6	937.82	775	1443.85
0.6	1207.99	914	1733.4
0.6	1470.51	1072	2049.15
0.6	1694.14	1240	2368.24
0.6	2054.8	1413	2735.94
0.6	2187.06	1607	3066.62
0.6	2509.82	1801	3454.45
0.6	3044.77	2007	3923.93
0.6	3340.79	2208	4314.24
0.6	3738.82	2434	4772.65
0.6	4005.17	2693	5241.05
