0.05	0.5	108	162.15
0.1	1.5	114	171.45
0.15	2.06	116	174.62
0.2	5.56	124	187.67
0.25	8.61	130	197.58
0.3	14.78	133	203.93
0.35	31.62	136	213.49
0.4	29.78	141	220.43
0.45	50.3	142	228.09
0.5	63.92	141	230.67
0.55	123.96	137	242.69
0.6	134.29	139	248.79
0.65	178.48	139	262.05
0.7	210.17	135	265.55
0.75	239.31	130	266.79
0.8	239.44	129	265.33
0.85	296.28	121	270.38
0.9	349.29	114	275.79
0.95	392.96	102	270.89
