0.05	0	102	153.0
0.1	0.5	115	172.65
0.15	2.56	115	173.27
0.2	4.06	128	193.22
0.25	15.01	127	195.0
0.3	31.57	140	219.47
0.35	22.23	137	212.17
0.4	50.58	141	226.67
0.45	61.09	138	225.33
0.5	77.43	142	236.23
0.55	87.54	140	236.26
0.6	138.58	139	250.07
0.65	170.53	135	253.66
0.7	176.88	137	258.56
0.75	191.1	136	261.33
0.8	279.11	123	268.23
0.85	306.18	121	273.36
0.9	342.19	113	272.16
0.95	379.4	106	272.82
