0.9	0.9	2.5	6	9.75
0.9	0.9	18.11	30	50.43
0.9	0.9	53.62	74	127.09
0.9	0.9	85.08	133	225.02
0.9	0.9	141.13	202	345.34
0.9	0.9	208.04	280	482.41
0.9	0.9	309.52	364	638.86
0.9	0.9	387.8	469	819.84
0.9	0.9	519.24	582	1028.77
0.9	0.9	624.1	695	1229.73
0.9	0.9	780.94	815	1456.78
0.9	0.9	903.21	960	1710.96
0.9	0.9	1109.37	1104	1988.81
0.9	0.9	1265.04	1268	2281.51
0.9	0.9	1496.29	1424	2584.89
0.9	0.9	1662.39	1598	2895.72
0.9	0.9	1911.77	1776	3237.53
0.9	0.9	2075.73	1967	3573.22
0.9	0.9	2386.16	2148	3937.85
0.9	0.9	2578.38	2380	4343.51
