0.9	0.9	1.5	6	9.45
0.9	0.9	16.11	32	52.83
0.9	0.9	49.28	73	124.28
0.9	0.9	87.19	131	222.66
0.9	0.9	143.92	201	344.67
0.9	0.9	209.1	278	479.73
0.9	0.9	297.9	367	639.87
0.9	0.9	379.74	470	818.92
0.9	0.9	517.17	566	1004.15
0.9	0.9	615.47	703	1239.14
0.9	0.9	790.47	818	1464.14
0.9	0.9	905.66	974	1732.7
0.9	0.9	1093.25	1115	2000.48
0.9	0.9	1230.0	1258	2256.0
0.9	0.9	1477.35	1422	2576.21
0.9	0.9	1630.11	1605	2896.53
0.9	0.9	1898.67	1763	3214.1
0.9	0.9	2081.04	1970	3579.31
0.9	0.9	2416.99	2158	3962.1
0.9	0.9	2593.5	2366	4327.05
