0.05	100.71	101	181.71
0.1	116.79	104	191.04
0.15	124.24	113	206.77
0.2	123.46	107	197.54
0.25	151.03	118	222.31
0.3	162.77	115	221.33
0.35	194.16	115	230.75
0.4	213.96	120	244.19
0.45	208.73	119	241.12
0.5	207.41	121	243.72
0.55	234.96	119	248.99
0.6	281.41	118	261.42
0.65	283.74	116	259.12
0.7	310.92	116	267.28
0.75	353.24	112	273.97
0.8	344.36	112	271.31
0.85	387.95	106	275.38
0.9	383.23	106	273.97
0.95	417.52	102	278.26
