0.05	74.37	140	232.31
0.1	126.03	128	229.81
0.15	137.38	141	252.71
0.2	123.24	140	246.97
0.25	147.44	130	239.23
0.3	141.87	140	252.56
0.35	184.63	129	248.89
0.4	176.14	129	246.34
0.45	189.73	132	254.92
0.5	206.75	129	255.53
0.55	197.13	133	258.64
0.6	253.55	122	259.07
0.65	282.18	125	272.15
0.7	279.61	121	265.38
0.75	304.72	119	269.92
0.8	325.1	116	271.53
0.85	354.87	109	269.96
0.9	396.57	102	271.97
0.95	422.04	96	270.61
