0.9	0.9	2.5	6	9.75
0.9	0.9	13.06	32	51.92
0.9	0.9	49.51	74	125.85
0.9	0.9	83.74	130	220.12
0.9	0.9	148.59	201	346.08
0.9	0.9	206.21	280	481.86
0.9	0.9	307.96	363	636.89
0.9	0.9	388.47	468	818.54
0.9	0.9	515.67	570	1009.7
0.9	0.9	614.74	698	1231.42
0.9	0.9	787.15	824	1472.14
0.9	0.9	905.44	968	1723.63
0.9	0.9	1105.25	1106	1990.58
0.9	0.9	1229.11	1259	2257.23
0.9	0.9	1462.35	1439	2597.21
0.9	0.9	1650.94	1606	2904.28
0.9	0.9	1909.3	1776	3236.79
0.9	0.9	2068.22	1980	3590.46
0.9	0.9	2398.33	2138	3926.5
0.9	0.9	2575.81	2364	4318.74
