0.05	0	107	160.5
0.1	1.0	118	177.3
0.15	3.0	122	183.9
0.2	3.5	119	179.55
0.25	13.17	131	200.45
0.3	16.73	137	210.52
0.35	24.23	136	211.27
0.4	41.79	140	222.54
0.45	57.09	142	230.13
0.5	65.92	141	231.27
0.55	116.07	143	249.32
0.6	113.72	142	247.12
0.65	168.09	137	255.93
0.7	204.3	137	266.79
0.75	245.82	129	267.25
0.8	283.47	123	269.54
0.85	327.9	120	278.37
0.9	343.84	112	271.15
0.95	405.54	104	277.66
