3.0
136.5
0
1122.0
1121.0
716.25
1058.77
1378.85
1829.43
2192.67
3551.38
2787.33
3762.06
5725.58
6383.98
9707.26
6476.04
8473.51
9290.87
7466.15
8.0
102.0
0
289.25
699.83
832.0
1838.67
1501.8
4246.17
2310.73
1742.46
3703.09
4588.03
3812.62
5856.21
4779.45
12392.43
12855.25
18023.92
4866.21
12.0
0
0
726.0
232.4
792.07
1615.82
1560.87
3860.03
1786.5
3106.97
2163.0
3927.92
5750.86
6885.55
9887.23
5740.4
7832.82
11877.7
15761.55
3.0
0
150.0
618.67
606.72
567.38
1266.7
2971.5
2072.4
5128.07
2708.6
3137.77
7499.83
3516.98
5370.83
12770.33
13001.79
6508.7
8107.35
11006.0
0
0
129.17
906.67
1610.0
935.75
1839.83
1521.07
3926.98
3321.5
3037.75
3658.96
5999.45
4705.03
5642.94
5528.92
7493.99
7919.53
14225.27
9927.82
3.0
0
171.6
594.09
1209.0
961.45
2353.08
2268.0
1963.47
3740.0
3607.27
2808.83
4548.3
4023.31
5138.91
4782.08
7608.13
14498.2
8973.47
8488.15
0
42.0
0
1006.5
687.74
784.74
1908.32
1414.22
1772.57
2546.83
3418.35
4079.69
4432.86
4101.92
3658.08
12058.67
6266.3
7400.0
7694.5
11940.52
0
37.5
190.0
672.0
639.31
2862.0
958.86
1116.0
829.6
3798.67
3203.8
2923.5
7716.42
5627.83
4521.66
5834.4
8015.12
7102.94
15906.43
10672.62
0
182.0
161.77
476.36
1102.0
1335.25
1669.33
1638.6
3636.5
3163.9
2963.6
3588.54
3517.75
5411.25
11220.73
12394.75
8008.27
15350.67
8059.03
16548.19
0
0
212.17
0
995.92
643.5
1322.18
1869.6
2198.7
2571.4
3039.11
4605.92
3638.61
4060.44
5954.0
5974.28
13310.04
8540.49
12867.62
9803.89
0
0
500.5
241.0
506.66
693.5
3270.0
2821.0
2613.71
4091.33
3208.75
2500.53
2731.22
4328.0
5889.55
7201.42
12966.73
11227.66
9014.79
11315.08
12.0
0
166.83
305.5
0
972.8
2052.49
2460.0
1772.15
3818.75
5274.67
4136.29
4252.39
4831.68
9086.67
6530.11
7465.77
6423.68
8999.32
14608.1
3.0
0
471.5
821.5
325.0
1225.18
3225.0
1517.53
4203.58
6141.25
6643.0
3749.59
3446.75
4569.11
3475.5
4679.25
5392.12
7778.6
7227.89
8117.61
3.0
102.0
175.5
471.15
0
1029.33
1974.25
2022.87
1256.33
2561.67
3518.93
3751.33
5235.8
4742.62
5629.91
5665.82
6325.02
8316.14
5974.95
13247.07
0
0
231.17
181.38
682.2
786.17
1233.1
5146.5
2598.92
4960.0
6132.1
4714.25
4122.89
5951.25
7399.33
7619.85
8699.96
16297.42
10184.0
19568.44
8.0
102.0
186.67
500.5
538.71
767.24
1709.92
3005.1
2290.3
6399.83
5602.18
3579.64
5525.93
3339.0
7241.12
6173.51
10706.29
7178.39
13062.92
20748.75
12.0
22.5
0
0
777.0
780.0
845.73
1562.1
1865.71
3465.0
4037.37
3995.73
4776.08
4641.84
7891.48
3905.8
10208.0
9583.93
11440.42
14190.0
0
182.0
253.0
536.67
425.39
0
627.3
2954.6
1444.8
2036.17
4927.3
4013.87
2357.81
8037.0
10600.0
5844.28
6303.8
6699.6
9492.0
9709.52
12.0
182.0
552.0
472.5
1892.0
1485.31
1447.13
1498.57
2511.47
2387.93
2832.35
5870.84
5014.95
7809.22
5661.19
4895.93
7755.17
7399.55
8250.78
11167.2
0
0
471.5
373.13
553.8
2066.17
1467.92
2625.03
2275.5
2220.53
3396.22
7516.6
4352.54
5404.46
3531.6
6841.51
11376.24
4835.53
6300.4
12885.56
3.0
38.33
343.0
114.21
1231.75
895.9
826.93
1626.13
3652.0
2858.33
5024.92
3966.76
3799.47
9655.85
7328.48
7671.47
12118.86
6377.93
9702.79
7668.84
0
0
0
250.0
874.17
669.2
1398.32
1339.8
3150.67
4355.0
5337.73
3083.98
9369.0
3623.3
10770.0
6203.03
10581.33
7477.43
8573.52
13094.15
8.0
65.0
0
623.33
803.33
989.44
1295.85
1079.83
2193.33
2154.69
2261.26
3203.16
4155.8
9836.3
6312.92
6330.14
7242.67
12950.17
10110.53
10719.88
3.0
100.0
231.17
1122.0
619.82
997.15
1215.57
2177.83
1978.0
3663.5
5636.88
5744.48
5590.99
6983.33
4120.58
7283.96
6901.49
9337.5
12487.9
7390.0
12.0
0
471.5
538.67
521.07
580.11
1143.0
3591.5
1944.08
2747.5
3509.52
6926.4
4516.05
9147.32
4421.5
5471.37
9756.89
8198.93
9207.0
19626.3
3.0
95.0
483.0
195.5
1346.67
1130.67
1833.0
4920.0
1965.71
2276.73
3966.28
2919.54
4798.9
4569.11
9110.05
5658.81
5091.45
7983.5
8671.2
9742.49
0
0
90.0
521.83
461.21
2210.0
1049.95
1107.78
2417.27
1457.75
2963.02
3925.54
4494.77
4843.04
3327.57
5486.02
13896.37
14543.1
16666.8
20218.08
12.0
21.67
552.0
412.08
390.13
665.62
839.47
672.0
2908.4
3152.8
2438.92
4558.8
3914.71
4629.3
6343.78
5403.0
7003.13
6793.6
7209.0
21350.37
12.0
76.0
552.0
546.93
725.0
1735.08
1551.5
1483.05
2031.71
5915.0
3312.63
3944.13
4190.58
4341.44
4377.14
5104.2
6478.95
6395.56
10932.66
17509.86
0
0
234.33
922.5
0
1313.0
1382.33
1463.13
3068.0
2797.08
2604.34
3388.35
7592.4
5355.05
6036.88
6295.86
14548.67
8450.11
14588.52
10783.74
3.0
52.0
0
906.67
611.87
922.78
1048.67
1912.5
1617.56
4348.5
1958.48
6048.1
4338.8
9013.2
5015.87
6097.71
11616.58
8793.31
5794.89
19796.35
12.0
0
471.5
0
718.25
1153.17
1943.47
3819.0
2464.8
1714.0
2358.78
3447.71
5484.23
6461.53
6744.86
4298.2
6085.23
6748.44
10990.76
8684.2
0
91.0
308.0
259.17
520.7
1055.13
1298.86
5402.0
2730.93
2020.89
5844.67
2315.24
7711.27
5793.37
12885.6
6380.58
7078.27
6786.61
7516.21
11549.65
0
0
0
1122.0
698.25
653.67
962.68
897.12
3492.55
2403.0
3879.24
5400.0
2984.8
8721.17
6790.63
5722.18
5420.8
9222.39
10289.68
7669.17
0
45.0
220.0
628.33
861.25
1058.4
1003.57
1746.33
3349.33
2926.8
2528.4
4213.79
3033.3
3986.08
4161.7
6512.0
4243.05
7096.47
7409.47
16412.1
12.0
0
138.83
710.0
137.13
1185.0
1219.5
2658.58
3370.05
2038.08
6915.33
3211.02
9318.6
9039.56
5691.97
10740.47
6448.76
11387.77
14912.33
6416.92
3.0
182.0
140.0
0
814.67
1050.4
1043.81
590.9
2184.37
3213.64
2944.07
2957.25
5947.72
3340.96
4968.6
6691.04
6174.54
15350.67
7459.73
19485.47
0
0
231.17
410.67
912.0
1093.4
1178.67
1432.72
1703.97
2589.12
2169.64
3224.73
4149.1
5842.62
5958.57
7114.67
5485.61
12241.51
8584.69
9383.94
3.0
0
343.0
0
1373.33
1266.67
984.65
1588.6
2021.12
2630.64
4313.25
4464.21
5221.5
6879.6
3721.7
13947.27
18611.0
12329.02
9957.69
7645.61
12.0
0
552.0
715.0
681.43
2070.25
2660.0
1330.54
2225.52
2126.6
7543.5
4422.86
3439.31
4802.57
11668.6
12696.67
11980.94
6031.11
18543.2
11016.13
0
68.75
0
296.0
1892.0
422.82
1830.0
2071.0
2925.75
2780.98
4181.62
3676.5
3584.04
2702.54
14807.37
7700.12
5029.3
9449.21
7384.87
8911.72
12.0
46.75
0
0
302.08
898.33
1180.48
2790.0
1481.91
5824.0
3682.8
2607.31
5217.4
4008.81
4769.45
5151.18
9223.74
7512.61
6916.22
15783.72
12.0
63.0
552.0
430.67
1231.75
547.8
1603.33
1590.3
1647.37
2449.42
3764.93
4974.93
4809.0
3657.82
10241.93
12257.22
10189.63
8711.38
11775.48
8950.9
0
59.5
124.4
183.67
643.5
1715.5
1310.83
1721.75
2724.7
4173.4
3464.27
3043.62
4250.0
6923.8
5394.1
8345.79
5411.52
9583.48
7996.31
8180.55
0
0
218.92
289.25
715.2
1455.0
2524.67
1207.45
3566.5
2718.75
2763.93
3660.8
5277.65
4933.49
11955.67
4661.05
7232.6
13740.45
8993.56
10891.4
12.0
0
0
0
1064.0
2513.33
1044.29
1952.5
2701.0
1625.71
2827.73
3552.42
3252.4
4220.86
4573.8
11501.7
13511.6
6973.26
9935.47
17118.4
0
53.67
245.85
296.33
560.0
954.5
1202.0
1913.49
3058.07
2430.9
2739.72
7758.3
4462.78
4820.82
4419.65
9412.94
6154.82
6548.97
11912.83
7096.98
8.0
27.0
209.0
700.0
306.27
2017.17
528.7
1607.57
3966.0
2713.33
2727.47
2858.46
4440.44
4017.42
5125.4
5054.51
9481.25
6897.91
11166.6
6873.48
0
0
322.5
472.5
526.86
931.64
1027.2
1716.75
2224.95
5096.25
2246.07
3899.8
3042.57
5203.34
10198.3
7689.6
5466.32
9156.77
8128.2
13242.6
0
18.0
231.8
154.0
404.03
1715.5
1404.62
1621.84
2160.65
2786.67
4640.56
3231.69
3772.56
4795.92
7929.02
3898.04
17259.83
16473.8
10699.05
8453.96
12.0
143.0
552.0
0
778.17
877.5
727.72
1631.29
3177.87
2456.36
2901.44
4235.77
6157.34
4305.84
9226.97
5733.8
5283.77
8779.18
10041.05
9576.44
0
182.0
0
309.17
1892.0
851.46
593.33
2522.5
2209.33
1870.52
2071.77
8155.95
4231.8
5323.86
6203.12
5516.78
6968.54
12470.6
8399.02
8342.8
3.0
0
328.67
365.75
1486.25
1735.08
1092.81
1235.89
1972.88
3635.8
3119.27
5335.4
2910.07
6311.33
9122.57
4193.88
4362.29
5345.28
5909.72
14969.47
12.0
42.5
183.33
0
1346.67
1241.42
1599.03
1836.92
1931.1
3091.75
3057.3
3573.57
3534.11
4307.73
3986.8
6178.7
6110.87
10878.45
11413.03
8063.02
3.0
0
341.25
379.75
693.6
566.07
749.23
2447.12
2038.5
4390.1
3020.76
2684.54
2868.43
5577.24
5915.73
9562.03
6304.47
11111.67
15070.28
5288.24
3.0
0
292.5
215.33
787.0
766.7
1736.4
2458.29
1358.57
2387.4
3013.0
4447.15
3995.97
5278.99
6094.27
9410.33
13848.42
7358.31
9928.6
9244.08
0
0
0
534.33
1892.0
1603.87
1072.08
1666.64
2645.5
4177.25
3177.22
6124.05
2959.55
4374.81
6847.92
5742.38
6705.83
6359.17
8814.31
16449.33
0
0
0
642.83
765.0
579.25
2238.0
0
2271.75
2087.79
2846.02
3788.4
5541.53
11414.53
5585.97
7546.2
9875.83
6447.41
7512.78
20546.86
12.0
136.5
341.25
1122.0
380.25
1067.38
1486.77
1361.85
1371.46
2560.08
2789.6
9149.83
2730.93
3831.07
9163.72
12417.48
7261.8
19961.42
8473.54
7516.62
3.0
0
88.0
386.67
0
1135.79
1031.52
3003.0
2128.91
2390.41
2936.97
2259.54
3314.29
4990.35
5992.77
6980.27
8522.25
7389.81
9897.68
10291.22
3.0
0
0
89.96
799.17
1583.17
1319.2
2517.0
3504.05
2116.71
2254.7
6457.02
6475.47
8966.95
5975.19
6448.0
11338.32
11256.54
9556.43
9695.64
3.0
42.0
185.0
317.68
763.25
849.33
827.57
2318.0
2324.0
2711.36
2509.06
5796.0
1904.43
5759.73
10524.0
6749.87
17629.5
18167.82
10411.27
16409.33
12.0
0
116.8
256.8
714.08
1504.5
769.23
1860.37
2850.58
1777.95
4539.45
3997.33
3643.7
3181.66
8324.33
11003.47
6763.17
11968.77
13265.21
11166.31
3.0
0
180.17
255.86
377.4
1904.0
2000.75
2648.42
2002.6
2535.01
3724.85
3294.36
8356.25
6345.53
6329.17
7198.35
5782.33
6885.43
14092.96
16833.74
0
0
0
0
1469.17
1265.63
2712.25
1196.0
4004.4
4686.02
3746.75
3045.15
3651.04
4442.83
7386.8
5860.43
14638.02
6791.15
15530.77
14493.48
12.0
0
0
390.08
666.5
1212.6
1466.33
3226.67
1222.34
3392.76
2995.37
3108.16
4886.56
2489.65
7126.12
6286.46
6040.35
19125.0
8373.39
12163.74
0
0
552.0
0
451.33
798.29
2487.33
2856.13
1948.86
3891.2
2758.0
2125.71
5956.0
5112.84
4110.38
9867.77
7514.16
13198.05
9217.31
12692.8
0
0
189.0
0
448.5
834.72
1187.65
1963.15
1720.57
3083.98
2789.58
3888.6
3395.92
4623.67
9932.79
6961.46
16114.63
8399.2
7935.0
8608.5
12.0
0
0
1122.0
597.85
0
1078.8
2823.07
3421.25
3967.2
3636.63
3243.8
7785.08
5005.53
4207.13
4332.57
6233.31
7187.84
6376.79
12216.22
12.0
100.0
0
485.5
730.19
2017.17
980.9
1722.22
1763.19
2684.09
5385.03
4688.75
6174.05
6797.16
4882.54
9114.0
16168.0
14837.61
7298.88
9047.38
3.0
0
151.42
270.6
260.0
1022.46
1248.0
1942.5
2785.92
3725.0
6345.0
2552.5
4619.51
4429.66
7866.2
6770.0
12174.8
8308.07
10629.52
13038.8
0
0
270.67
401.33
1368.0
1288.0
1885.0
1848.0
3942.0
2996.57
4823.0
4188.8
5149.11
5960.3
4850.35
6583.5
5479.86
8793.14
9762.86
10973.97
3.0
66.0
29.4
0
980.5
776.0
1423.14
1778.67
1524.63
2024.55
2832.67
5941.67
3997.05
8812.83
4898.63
6156.18
7396.67
6478.46
16279.24
17597.08
12.0
84.0
191.0
613.83
564.07
1473.75
931.45
1492.12
2381.29
2496.38
2888.9
3584.87
3885.19
9454.67
3327.53
6026.67
6274.71
11098.67
10070.71
10418.45
3.0
0
0
0
299.75
470.38
0
4456.67
1748.0
3485.36
2930.97
2776.03
3445.0
7303.4
4930.13
6896.06
7614.89
6554.63
8062.22
12799.33
3.0
64.17
0
620.25
812.0
783.53
1376.4
2450.0
4246.17
4433.0
4199.27
2985.62
7543.75
8279.1
4355.29
9626.7
11577.12
8024.57
15061.47
12156.93
0
0
238.0
200.8
1235.0
445.0
1470.47
1419.6
2003.3
2669.52
3642.87
5263.5
7367.8
8596.5
8036.18
7416.15
6810.75
14538.33
13030.42
9997.59
0
0
0
0
1610.0
1022.47
1880.83
1980.07
1874.4
2540.45
4635.55
3329.4
4926.13
5529.5
4616.75
5549.09
6815.56
5530.0
5631.24
8946.71
12.0
182.0
462.5
0
795.83
710.93
2680.9
2322.13
3004.47
3084.52
3083.54
4086.6
3700.47
7177.08
4919.27
5557.43
8712.83
8468.35
6229.53
9383.09
0
46.0
364.5
259.43
1892.0
867.43
1190.0
3430.92
1450.96
7500.0
4989.6
4229.29
10662.4
4386.48
4108.51
5994.05
5615.54
8452.57
16861.87
7164.46
12.0
0
0
450.0
502.83
797.38
874.82
868.7
842.61
2743.12
3112.0
2666.72
3999.72
9349.33
8978.62
5818.82
10080.78
20147.42
9436.41
22368.0
12.0
0
0
546.93
706.67
934.12
1045.83
1257.6
2970.33
3708.75
2631.43
3029.09
4941.9
5820.58
4524.48
5337.17
13065.75
6253.65
7819.79
8596.84
12.0
71.5
0
1122.0
613.43
929.64
1822.5
1626.98
2847.0
1719.32
3129.92
3709.2
4648.0
4508.64
12379.17
6796.13
8661.24
6735.87
8865.88
8126.09
3.0
182.0
172.5
403.0
466.03
970.3
1240.71
2619.44
1911.77
2278.19
6739.42
8724.4
4985.1
5204.64
6757.75
8344.33
5333.18
7359.5
8062.05
8638.93
0
96.0
552.0
345.0
995.92
1583.17
1324.55
1941.33
1700.29
1993.43
5926.17
2632.63
3785.83
5231.7
5223.61
7116.77
8490.98
6562.5
10220.04
8147.39
3.0
182.0
172.5
398.67
766.0
1639.22
914.6
1921.23
1872.6
3071.75
3894.8
4252.7
4277.35
3527.97
8567.1
6106.58
13592.44
8508.02
9165.17
10140.15
8.0
0
284.0
530.36
1610.0
1078.0
2002.2
1687.05
2297.17
3527.33
2910.48
3197.69
3084.29
8280.0
5053.68
7388.79
8017.2
13532.17
7275.58
9255.67
12.0
69.67
0
704.23
809.38
1735.08
1116.45
3226.67
1015.47
3940.17
2911.32
5331.75
5143.71
4814.63
8240.53
7058.02
10619.17
6403.16
17020.38
6436.42
12.0
102.0
114.0
370.0
1293.5
2862.0
840.64
913.5
2942.42
1653.85
2200.35
3427.86
3353.5
3558.28
11791.6
4940.98
5881.38
9806.33
13824.71
19579.05
0
182.0
0
349.33
660.0
1086.5
2102.33
1616.46
3269.67
1470.58
2809.07
6583.92
3842.78
8145.82
12032.13
4164.8
14188.7
5178.87
10312.32
9581.33
0
182.0
0
906.67
1333.33
906.67
1687.67
1612.0
3804.42
2144.1
2495.62
2519.4
3985.96
4324.83
5450.07
6191.17
15451.25
7772.95
5613.73
12380.57
3.0
182.0
357.0
528.13
616.58
1336.65
1220.88
2650.45
2551.25
3502.67
2626.74
3439.44
6975.95
4672.06
6687.92
5199.5
8089.19
7003.31
18824.0
12703.11
3.0
0
196.0
0
485.17
1202.07
2493.87
2997.75
2116.58
2259.4
2921.48
3651.67
3544.38
4619.07
11274.83
3885.72
9529.17
7438.83
16769.4
10877.63
0
0
552.0
800.83
1020.58
1399.17
875.48
2648.42
2197.8
2000.37
4291.07
3099.16
2712.11
6194.67
4981.74
5202.14
7366.88
10381.8
8736.93
15772.17
3.0
69.67
247.0
0
559.67
919.8
1410.38
823.2
1297.53
3354.74
4289.25
4586.35
4766.8
5402.02
6281.71
5445.79
10063.89
9984.38
8258.18
10255.46
8.0
182.0
471.5
800.83
0
1232.2
699.69
2648.42
3566.5
3227.8
2236.37
8891.0
3685.0
8716.58
5397.75
6499.14
7349.55
6788.79
11452.11
10099.17
3.0
136.5
552.0
434.35
999.0
793.33
1329.47
2143.67
3581.67
2801.31
4420.6
4552.09
2584.8
4844.63
9909.19
6457.33
16306.77
5659.57
13940.71
8820.71
12.0
182.0
126.65
583.83
480.0
1058.4
763.3
2142.69
2402.4
1806.35
2792.32
4330.82
3484.43
9702.93
3962.8
6882.03
8246.45
13756.9
7387.67
11905.83
12.0
40.0
0
906.67
686.98
1740.57
2300.83
1100.5
2280.27
2040.63
2785.34
2489.59
3795.5
5596.09
3561.3
8872.22
5802.06
6588.41
12407.42
8505.22
12.0
0
231.8
340.0
778.75
0
0
3852.5
1364.88
3425.67
2957.42
9325.33
7157.53
6543.22
4955.09
9669.92
9057.99
8322.17
8008.04
8161.08
