0.05	99.32	103	184.3
0.1	108.66	103	187.1
0.15	117.73	107	195.82
0.2	141.8	114	213.54
0.25	149.97	116	218.99
0.3	177.16	117	228.65
0.35	187.05	112	224.12
0.4	181.44	120	234.43
0.45	201.5	117	235.95
0.5	245.69	120	253.71
0.55	219.01	120	245.7
0.6	282.31	116	258.69
0.65	256.69	120	257.01
0.7	303.65	115	263.59
0.75	300.9	121	271.77
0.8	352.64	109	269.29
0.85	336.53	115	273.46
0.9	399.73	99	268.42
0.95	399.94	102	272.98
