0.9	0.9	1.5	6	9.45
0.9	0.9	18.23	31	51.97
0.9	0.9	46.51	74	124.95
0.9	0.9	89.63	134	227.89
0.9	0.9	151.87	195	338.06
0.9	0.9	224.0	278	484.2
0.9	0.9	312.46	368	645.74
0.9	0.9	388.14	470	821.44
0.9	0.9	517.06	566	1004.12
0.9	0.9	607.81	698	1229.34
0.9	0.9	789.12	822	1469.74
0.9	0.9	913.33	963	1718.5
0.9	0.9	1105.71	1097	1977.21
0.9	0.9	1243.95	1273	2282.69
0.9	0.9	1479.63	1425	2581.39
0.9	0.9	1639.28	1600	2891.78
0.9	0.9	1907.63	1771	3228.79
0.9	0.9	2082.54	1968	3576.76
0.9	0.9	2384.67	2154	3946.4
0.9	0.9	2595.68	2371	4335.2
