0.6	1.0	6	9.3
0.6	29.24	34	59.77
0.6	49.36	83	139.31
0.6	118.12	140	245.43
0.6	245.47	215	396.14
0.6	358.36	297	553.01
0.6	472.78	397	737.33
0.6	630.5	514	960.15
0.6	816.17	636	1198.85
0.6	954.7	768	1438.41
0.6	1156.61	919	1725.48
0.6	1418.11	1071	2031.93
0.6	1775.76	1226	2371.73
0.6	2129.3	1413	2758.29
0.6	2299.98	1602	3093.0
0.6	2616.82	1794	3476.05
0.6	3010.14	2007	3913.54
0.6	3154.9	2228	4288.47
0.6	3577.2	2456	4757.16
0.6	4188.6	2678	5273.58
