0.9	0.9	1.5	6	9.45
0.9	0.9	17.11	32	53.13
0.9	0.9	50.84	72	123.25
0.9	0.9	82.96	128	216.89
0.9	0.9	150.26	194	336.08
0.9	0.9	204.54	286	490.36
0.9	0.9	309.07	370	647.72
0.9	0.9	386.09	474	826.83
0.9	0.9	528.73	578	1025.62
0.9	0.9	616.82	701	1236.54
0.9	0.9	790.2	828	1479.06
0.9	0.9	897.44	957	1704.73
0.9	0.9	1108.76	1116	2006.63
0.9	0.9	1263.53	1267	2279.56
0.9	0.9	1473.18	1422	2574.95
0.9	0.9	1632.93	1603	2894.38
0.9	0.9	1928.46	1773	3238.04
0.9	0.9	2050.7	1968	3567.21
0.9	0.9	2398.64	2155	3952.09
0.9	0.9	2580.66	2349	4297.7
