0.05	0.5	107	160.65
0.1	0	115	172.5
0.15	2.56	123	185.27
0.2	3.5	124	187.05
0.25	14.84	132	202.45
0.3	20.95	134	207.29
0.35	25.45	135	210.14
0.4	34.62	138	217.39
0.45	65.87	141	231.26
0.5	95.82	140	238.75
0.55	141.19	137	247.86
0.6	106.12	140	241.83
0.65	150.35	142	258.11
0.7	188.43	137	262.03
0.75	210.7	136	267.21
0.8	270.51	126	270.15
0.85	318.18	117	270.96
0.9	346.83	109	267.55
0.95	384.61	105	272.88
