0.05	101.48	100	180.44
0.1	109.05	103	187.21
0.15	129.07	105	196.22
0.2	115.67	108	196.7
0.25	159.97	113	217.49
0.3	154.26	122	229.28
0.35	149.53	120	224.86
0.4	179.44	118	230.83
0.45	203.67	122	244.1
0.5	225.67	120	247.7
0.55	229.73	118	245.92
0.6	264.31	117	254.79
0.65	264.64	121	260.89
0.7	279.01	115	256.2
0.75	332.13	113	269.14
0.8	337.14	113	270.64
0.85	360.52	108	270.16
0.9	398.95	102	272.68
0.95	409.55	100	272.87
