0.05	0	108	162.0
0.1	2.0	115	173.1
0.15	1.0	114	171.3
0.2	8.0	127	192.9
0.25	8.61	131	199.08
0.3	10.61	128	195.18
0.35	36.24	139	219.37
0.4	40.35	141	223.6
0.45	74.04	143	236.71
0.5	72.93	142	234.88
0.55	91.53	142	240.46
0.6	147.29	138	251.19
0.65	181.44	138	261.43
0.7	210.78	137	268.73
0.75	223.71	129	260.61
0.8	250.24	126	264.07
0.85	320.21	118	273.06
0.9	350.28	113	274.58
0.95	393.41	101	269.52
