0.6	3.11	6	9.93
0.6	22.62	34	57.79
0.6	62.53	80	138.76
0.6	149.8	139	253.44
0.6	217.23	210	380.17
0.6	349.3	292	542.79
0.6	472.9	400	741.87
0.6	581.78	511	941.04
0.6	800.08	634	1191.02
0.6	1022.76	768	1458.83
0.6	1158.2	917	1722.96
0.6	1496.38	1070	2053.91
0.6	1705.71	1232	2359.71
0.6	2004.19	1414	2722.26
0.6	2286.6	1598	3082.98
0.6	2697.05	1785	3486.61
0.6	2881.46	2013	3883.94
0.6	3378.87	2222	4346.66
0.6	3758.42	2450	4802.52
0.6	4065.26	2687	5250.08
