0.1	0.1	206.59	129	255.48
0.1	0.2	122.1	134	237.63
0.1	0.3	103.43	133	230.53
0.1	0.4	95.75	128	220.72
0.1	0.5	90.08	133	226.52
0.1	0.6	88.75	125	214.12
0.1	0.7	91.86	125	215.06
0.1	0.8	90.19	129	220.56
0.1	0.9	84.35	137	230.8
0.2	0.1	184.59	132	253.38
0.2	0.2	156.05	132	244.81
0.2	0.3	98.53	137	235.06
0.2	0.4	88.96	136	230.69
0.2	0.5	82.96	129	218.39
0.2	0.6	96.97	130	224.09
0.2	0.7	84.79	134	226.44
0.2	0.8	86.19	131	222.36
0.2	0.9	87.91	132	224.37
0.3	0.1	182.67	133	254.3
0.3	0.2	84.52	131	221.86
0.3	0.3	92.13	134	228.64
0.3	0.4	94.36	134	229.31
0.3	0.5	86.02	131	222.31
0.3	0.6	91.8	132	225.54
0.3	0.7	84.91	136	229.47
0.3	0.8	91.46	134	228.44
0.3	0.9	87.02	131	222.61
0.4	0.1	120.81	133	235.74
0.4	0.2	114.65	133	233.9
0.4	0.3	93.42	129	221.52
0.4	0.4	102.2	133	230.16
0.4	0.5	84.35	136	229.3
0.4	0.6	104.59	134	232.38
0.4	0.7	90.25	134	228.07
0.4	0.8	82.02	130	219.61
0.4	0.9	84.35	129	218.8
0.5	0.1	180.05	129	247.51
0.5	0.2	143.28	127	233.48
0.5	0.3	82.41	130	219.72
0.5	0.4	93.08	138	234.92
0.5	0.5	91.75	138	234.52
0.5	0.6	86.02	135	228.31
0.5	0.7	87.3	131	222.69
0.5	0.8	89.86	131	223.46
0.5	0.9	84.46	127	215.84
0.6	0.1	147.23	133	243.67
0.6	0.2	95.97	136	232.79
0.6	0.3	92.92	132	225.87
0.6	0.4	83.51	130	220.05
0.6	0.5	91.13	130	222.34
0.6	0.6	85.29	135	228.09
0.6	0.7	84.85	135	227.95
0.6	0.8	86.46	137	231.44
0.6	0.9	81.29	133	223.89
0.7	0.1	136.38	134	241.91
0.7	0.2	104.2	133	230.76
0.7	0.3	109.37	122	215.81
0.7	0.4	92.63	134	228.79
0.7	0.5	88.63	130	221.59
0.7	0.6	88.52	132	224.56
0.7	0.7	82.29	134	225.69
0.7	0.8	86.02	134	226.81
0.7	0.9	86.52	137	231.46
0.8	0.1	150.11	131	241.53
0.8	0.2	81.35	134	225.4
0.8	0.3	93.03	135	230.41
0.8	0.4	91.92	133	227.07
0.8	0.5	89.13	137	232.24
0.8	0.6	80.01	134	225.0
0.8	0.7	83.52	140	235.06
0.8	0.8	88.19	132	224.46
0.8	0.9	85.02	132	223.51
0.9	0.1	110.98	132	231.29
0.9	0.2	111.1	126	222.33
0.9	0.3	97.53	132	227.26
0.9	0.4	97.64	130	224.29
0.9	0.5	84.91	130	220.47
0.9	0.6	77.35	129	216.7
0.9	0.7	87.02	132	224.11
0.9	0.8	89.58	132	224.87
0.9	0.9	85.85	137	231.25
