0.2	3.11	6	9.93
0.2	30.13	30	54.04
0.2	62.26	78	135.68
0.2	135.37	129	234.11
0.2	216.58	185	342.47
0.2	293.57	304	544.07
0.2	463.29	387	719.49
0.2	612.11	497	929.13
0.2	762.24	609	1142.17
0.2	955.0	750	1411.5
0.2	1168.47	898	1697.54
0.2	1395.37	1016	1942.61
0.2	1763.27	1196	2322.98
0.2	1966.19	1367	2640.36
0.2	2312.92	1361	2735.38
0.2	2577.68	1726	3362.3
0.2	2904.48	1913	3740.84
0.2	3437.36	2142	4244.21
0.2	3715.43	2326	4603.63
0.2	4096.73	2539	5037.52
