0.05	0	102	153.0
0.1	1.0	114	171.3
0.15	2.56	118	177.77
0.2	5.56	124	187.67
0.25	9.56	133	202.37
0.3	27.45	138	215.24
0.35	48.75	137	220.12
0.4	39.18	141	223.25
0.45	49.52	137	220.36
0.5	72.76	141	233.33
0.55	88.71	142	239.61
0.6	126.18	142	250.85
0.65	138.29	143	255.99
0.7	192.47	135	260.24
0.75	232.62	127	260.29
0.8	270.74	129	274.72
0.85	323.28	118	273.98
0.9	352.63	107	266.29
0.95	401.39	102	273.42
