0.2	0.5	6	9.15
0.2	16.34	32	52.9
0.2	56.69	78	134.01
0.2	115.07	141	246.02
0.2	219.38	212	383.81
0.2	329.6	259	487.38
0.2	482.78	343	659.33
0.2	631.01	438	846.3
0.2	805.06	618	1168.52
0.2	1092.6	661	1319.28
0.2	1174.35	908	1714.3
0.2	1465.44	1051	2016.13
0.2	1644.84	1196	2287.45
0.2	2004.0	1378	2668.2
0.2	2203.01	1540	2970.9
0.2	2559.72	1725	3355.41
0.2	3063.2	1690	3453.96
0.2	3301.74	2107	4151.02
0.2	3743.06	2319	4601.42
0.2	4065.91	2586	5098.77
