0.6	1.0	6	9.3
0.6	32.79	34	60.84
0.6	60.7	81	139.71
0.6	129.07	139	247.22
0.6	226.46	212	385.94
0.6	347.9	301	555.87
0.6	463.34	401	740.5
0.6	624.34	505	944.8
0.6	793.08	639	1196.42
0.6	934.81	768	1432.44
0.6	1123.75	919	1715.62
0.6	1423.24	1067	2027.47
0.6	1728.18	1238	2375.45
0.6	2059.94	1399	2716.48
0.6	2268.32	1602	3083.49
0.6	2563.26	1803	3473.48
0.6	3000.21	2006	3909.06
0.6	3302.69	2233	4340.31
0.6	3779.9	2452	4811.97
0.6	4312.93	2676	5307.88
