0.9	0.9	1.5	6	9.45
0.9	0.9	17.23	32	53.17
0.9	0.9	47.9	76	128.37
0.9	0.9	80.41	132	222.12
0.9	0.9	151.59	201	346.98
0.9	0.9	210.49	277	478.65
0.9	0.9	307.68	360	632.3
0.9	0.9	377.03	463	807.61
0.9	0.9	519.0	575	1018.2
0.9	0.9	624.87	692	1225.46
0.9	0.9	779.02	830	1478.7
0.9	0.9	909.22	967	1723.27
0.9	0.9	1094.25	1105	1985.78
0.9	0.9	1245.74	1257	2259.22
0.9	0.9	1476.9	1404	2549.07
0.9	0.9	1617.43	1609	2898.73
0.9	0.9	1926.69	1774	3239.01
0.9	0.9	2097.18	1959	3567.65
0.9	0.9	2415.3	2148	3946.59
0.9	0.9	2577.07	2356	4307.12
