0.6	1.0	6	9.3
0.6	28.68	35	61.1
0.6	96.66	76	143.0
0.6	126.96	139	246.59
0.6	205.83	216	385.75
0.6	367.82	301	561.85
0.6	472.15	400	741.65
0.6	627.87	518	965.36
0.6	774.29	629	1175.79
0.6	996.96	775	1461.59
0.6	1182.67	911	1721.3
0.6	1453.19	1071	2042.46
0.6	1849.57	1229	2398.37
0.6	1946.29	1421	2715.39
0.6	2310.58	1595	3085.67
0.6	2519.56	1804	3461.87
0.6	2839.03	2013	3871.21
0.6	3384.35	2223	4349.81
0.6	3640.93	2453	4771.78
0.6	4055.48	2675	5229.14
