0.6	1.0	6	9.3
0.6	33.74	34	61.12
0.6	69.15	75	133.25
0.6	115.12	142	247.53
0.6	234.9	210	385.47
0.6	362.69	300	558.81
0.6	388.14	406	725.44
0.6	598.46	516	953.54
0.6	823.32	634	1198.0
0.6	951.11	766	1434.33
0.6	1313.89	907	1754.67
0.6	1407.13	1067	2022.64
0.6	1662.97	1236	2352.89
0.6	1972.69	1415	2714.31
0.6	2343.09	1597	3098.43
0.6	2565.81	1791	3456.24
0.6	2962.91	2001	3890.37
0.6	3390.68	2215	4339.7
0.6	3667.22	2450	4775.16
0.6	4128.4	2682	5261.52
