0.1	0.1	158.23	134	248.47
0.1	0.2	128.22	136	242.47
0.1	0.3	96.64	135	231.49
0.1	0.4	97.59	132	227.28
0.1	0.5	89.96	134	227.99
0.1	0.6	95.8	135	231.24
0.1	0.7	94.36	133	227.81
0.1	0.8	87.68	127	216.8
0.1	0.9	96.42	132	226.92
0.2	0.1	172.78	130	246.83
0.2	0.2	85.69	130	220.71
0.2	0.3	98.2	132	227.46
0.2	0.4	100.03	135	232.51
0.2	0.5	84.85	130	220.45
0.2	0.6	85.85	129	219.25
0.2	0.7	88.58	126	215.57
0.2	0.8	88.69	132	224.61
0.2	0.9	80.74	136	228.22
0.3	0.1	149.0	130	239.7
0.3	0.2	121.82	130	231.55
0.3	0.3	94.75	131	224.92
0.3	0.4	86.52	135	228.46
0.3	0.5	90.69	128	219.21
0.3	0.6	87.08	130	221.12
0.3	0.7	83.41	134	226.02
0.3	0.8	88.08	132	224.42
0.3	0.9	87.08	131	222.62
0.4	0.1	162.46	133	248.24
0.4	0.2	103.31	131	227.49
0.4	0.3	92.75	129	221.32
0.4	0.4	99.26	131	226.28
0.4	0.5	81.29	127	214.89
0.4	0.6	92.19	129	221.16
0.4	0.7	86.96	127	216.59
0.4	0.8	85.63	134	226.69
0.4	0.9	77.18	128	215.15
0.5	0.1	110.37	130	228.11
0.5	0.2	96.64	126	217.99
0.5	0.3	98.14	130	224.44
0.5	0.4	96.2	127	219.36
0.5	0.5	93.8	133	227.64
0.5	0.6	89.52	129	220.36
0.5	0.7	83.02	128	216.91
0.5	0.8	81.02	131	220.81
0.5	0.9	85.63	126	214.69
0.6	0.1	149.06	137	250.22
0.6	0.2	114.93	131	230.98
0.6	0.3	95.86	137	234.26
0.6	0.4	94.53	134	229.36
0.6	0.5	88.13	137	231.94
0.6	0.6	95.02	132	226.51
0.6	0.7	80.79	125	211.74
0.6	0.8	80.85	131	220.75
0.6	0.9	87.02	131	222.61
0.7	0.1	166.79	132	248.04
0.7	0.2	124.99	138	244.5
0.7	0.3	98.8	131	226.14
0.7	0.4	87.13	133	225.64
0.7	0.5	90.08	128	219.02
0.7	0.6	83.96	129	218.69
0.7	0.7	97.25	136	233.17
0.7	0.8	86.91	134	227.07
0.7	0.9	85.35	134	226.6
0.8	0.1	163.12	133	248.43
0.8	0.2	114.61	132	232.38
0.8	0.3	83.46	131	221.54
0.8	0.4	77.52	131	219.76
0.8	0.5	91.69	132	225.51
0.8	0.6	86.29	130	220.89
0.8	0.7	86.24	133	225.37
0.8	0.8	85.46	132	223.64
0.8	0.9	83.85	129	218.65
0.9	0.1	124.27	134	238.28
0.9	0.2	143.33	131	239.5
0.9	0.3	102.98	128	222.89
0.9	0.4	83.68	136	229.1
0.9	0.5	111.04	131	229.81
0.9	0.6	82.41	134	225.72
0.9	0.7	89.52	135	229.36
0.9	0.8	87.29	132	224.19
0.9	0.9	84.41	132	223.32
