0.05	0	105	157.5
0.1	1.0	117	175.8
0.15	1.56	116	174.47
0.2	7.06	127	192.62
0.25	8.17	135	204.95
0.3	15.73	136	208.72
0.35	39.85	142	224.95
0.4	32.79	142	222.84
0.45	56.03	140	226.81
0.5	89.94	138	233.98
0.55	99.28	141	241.28
0.6	123.67	143	251.6
0.65	164.47	140	259.34
0.7	211.71	137	269.01
0.75	208.56	130	257.57
0.8	268.57	126	269.57
0.85	300.08	119	268.52
0.9	364.63	108	271.39
0.95	395.94	104	274.78
