0.05	109.11	98	179.73
0.1	110.83	107	193.75
0.15	115.39	109	198.12
0.2	125.63	108	199.69
0.25	161.87	118	225.56
0.3	156.7	111	213.51
0.35	203.78	119	239.63
0.4	192.22	119	236.17
0.45	207.84	118	239.35
0.5	218.74	119	244.12
0.55	241.65	118	249.49
0.6	267.84	115	252.85
0.65	244.08	123	257.72
0.7	284.31	113	254.79
0.75	342.19	112	270.66
0.8	363.56	104	265.07
0.85	351.47	109	268.94
0.9	356.62	112	274.99
0.95	396.89	102	272.07
