0.2	2.5	6	9.75
0.2	26.85	32	56.05
0.2	62.48	78	135.74
0.2	143.32	140	253.0
0.2	222.68	186	345.81
0.2	342.73	300	552.82
0.2	441.9	395	725.07
0.2	611.74	511	950.02
0.2	829.6	547	1069.38
0.2	970.99	749	1414.8
0.2	1175.06	891	1689.02
0.2	1424.89	1031	1973.97
0.2	1726.45	1190	2302.94
0.2	2014.24	1377	2669.77
0.2	2244.32	1551	2999.8
0.2	2592.59	1745	3395.28
0.2	3022.43	1699	3455.23
0.2	3343.6	1885	3830.58
0.2	3848.5	2070	4259.55
0.2	4103.48	2584	5107.04
