0.05	104.08	112	199.22
0.1	98.06	144	245.42
0.15	119.69	138	242.91
0.2	152.11	124	231.63
0.25	155.88	126	235.76
0.3	175.46	128	244.64
0.35	162.17	137	254.15
0.4	175.95	127	243.28
0.45	209.75	128	254.93
0.5	209.7	137	268.41
0.55	237.93	134	272.38
0.6	255.49	127	267.15
0.65	244.67	127	263.9
0.7	268.0	124	266.4
0.75	257.34	121	258.7
0.8	329.55	112	266.87
0.85	354.6	107	266.88
0.9	374.08	110	277.22
0.95	418.71	99	274.11
