0.9	0.9	2.5	6	9.75
0.9	0.9	15.17	32	52.55
0.9	0.9	45.34	76	127.6
0.9	0.9	83.96	128	217.19
0.9	0.9	147.43	193	333.73
0.9	0.9	207.32	276	476.2
0.9	0.9	318.85	366	644.66
0.9	0.9	382.75	472	822.82
0.9	0.9	519.17	571	1012.25
0.9	0.9	617.36	701	1236.71
0.9	0.9	779.72	826	1472.92
0.9	0.9	895.09	965	1716.03
0.9	0.9	1100.93	1091	1966.78
0.9	0.9	1231.83	1265	2267.05
0.9	0.9	1478.25	1417	2568.97
0.9	0.9	1632.59	1598	2886.78
0.9	0.9	1924.81	1771	3233.94
0.9	0.9	2077.14	1956	3557.14
0.9	0.9	2381.38	2156	3948.41
0.9	0.9	2595.03	2363	4323.01
