0.05	0.5	101	151.65
0.1	2.0	118	177.6
0.15	2.0	119	179.1
0.2	9.61	129	196.38
0.25	21.34	132	204.4
0.3	25.51	141	219.15
0.35	41.35	142	225.4
0.4	56.03	141	228.31
0.45	45.96	140	223.79
0.5	68.76	142	233.63
0.55	101.55	143	244.96
0.6	149.58	141	256.37
0.65	143.64	139	251.59
0.7	183.53	136	259.06
0.75	188.92	133	256.18
0.8	237.0	128	263.1
0.85	315.8	118	271.74
0.9	355.95	108	268.78
0.95	421.97	101	278.09
