0.6	2.5	6	9.75
0.6	22.01	34	57.6
0.6	63.03	81	140.41
0.6	119.45	138	242.83
0.6	223.0	214	387.9
0.6	283.52	300	535.06
0.6	431.44	401	730.93
0.6	605.2	514	952.56
0.6	800.85	634	1191.26
0.6	984.71	775	1457.91
0.6	1216.98	920	1745.09
0.6	1460.84	1058	2025.25
0.6	1668.88	1242	2363.66
0.6	1913.08	1412	2691.92
0.6	2244.29	1605	3080.79
0.6	2544.74	1803	3467.92
0.6	2933.35	2013	3899.5
0.6	3326.53	2225	4335.46
0.6	3817.4	2437	4800.72
0.6	4262.62	2667	5279.29
