0.05	103.27	101	182.48
0.1	95.32	108	190.6
0.15	138.85	108	203.66
0.2	136.79	110	206.04
0.25	162.15	111	215.15
0.3	154.26	116	220.28
0.35	150.92	118	222.28
0.4	198.78	115	232.13
0.45	203.79	113	230.64
0.5	246.8	120	254.04
0.55	239.64	119	250.39
0.6	272.66	114	252.8
0.65	285.99	118	262.8
0.7	257.18	122	260.16
0.75	317.71	115	267.81
0.8	347.01	113	273.6
0.85	383.94	106	274.18
0.9	385.78	104	271.73
0.95	420.09	100	276.03
