0.05	104.15	96	175.25
0.1	113.9	116	208.17
0.15	133.58	112	208.07
0.2	141.75	112	210.52
0.25	152.04	118	222.61
0.3	163.98	113	218.7
0.35	174.77	114	223.43
0.4	174.72	118	229.42
0.45	244.03	117	248.71
0.5	265.19	115	252.06
0.55	236.08	121	252.32
0.6	291.63	120	267.49
0.65	278.36	114	254.51
0.7	307.74	119	270.82
0.75	346.32	113	273.39
0.8	355.35	109	270.11
0.85	392.94	106	276.88
0.9	392.04	105	275.11
0.95	393.83	105	275.65
