0.1	0.1	170.96	132	249.29
0.1	0.2	106.43	135	234.43
0.1	0.3	106.97	130	227.09
0.1	0.4	84.85	128	217.45
0.1	0.5	85.08	129	219.02
0.1	0.6	90.36	129	220.61
0.1	0.7	90.91	128	219.27
0.1	0.8	95.46	135	231.14
0.1	0.9	88.02	125	213.91
0.2	0.1	108.37	127	223.01
0.2	0.2	99.03	136	233.71
0.2	0.3	99.42	133	229.32
0.2	0.4	94.8	131	224.94
0.2	0.5	81.74	133	224.02
0.2	0.6	87.13	136	230.14
0.2	0.7	85.91	127	216.27
0.2	0.8	87.96	132	224.39
0.2	0.9	89.58	132	224.87
0.3	0.1	129.78	134	239.93
0.3	0.2	139.54	135	244.36
0.3	0.3	109.32	128	224.8
0.3	0.4	80.62	130	219.19
0.3	0.5	88.02	135	228.91
0.3	0.6	89.58	134	227.87
0.3	0.7	86.69	127	216.51
0.3	0.8	85.91	132	223.77
0.3	0.9	84.52	130	220.36
0.4	0.1	197.89	128	251.37
0.4	0.2	92.63	129	221.29
0.4	0.3	105.3	136	235.59
0.4	0.4	81.91	134	225.57
0.4	0.5	85.29	127	216.09
0.4	0.6	86.52	139	234.46
0.4	0.7	79.85	127	214.45
0.4	0.8	85.41	134	226.62
0.4	0.9	81.41	129	217.92
0.5	0.1	125.05	135	240.01
0.5	0.2	101.7	137	236.01
0.5	0.3	93.97	133	227.69
0.5	0.4	113.47	136	238.04
0.5	0.5	82.85	137	230.35
0.5	0.6	86.85	132	224.05
0.5	0.7	83.24	137	230.47
0.5	0.8	79.35	130	218.8
0.5	0.9	81.29	130	219.39
0.6	0.1	84.29	131	221.79
0.6	0.2	87.96	129	219.89
0.6	0.3	82.79	131	221.34
0.6	0.4	84.85	130	220.45
0.6	0.5	86.41	127	216.42
0.6	0.6	87.08	131	222.62
0.6	0.7	81.24	132	222.37
0.6	0.8	83.52	133	224.56
0.6	0.9	79.24	130	218.77
0.7	0.1	127.49	137	243.75
0.7	0.2	102.59	132	228.78
0.7	0.3	86.19	123	210.36
0.7	0.4	93.86	137	233.66
0.7	0.5	86.02	132	223.81
0.7	0.6	87.75	130	221.32
0.7	0.7	82.63	127	215.29
0.7	0.8	86.52	136	229.96
0.7	0.9	79.46	134	224.84
0.8	0.1	129.39	129	232.32
0.8	0.2	84.52	132	223.36
0.8	0.3	103.43	139	239.53
0.8	0.4	82.46	132	222.74
0.8	0.5	85.19	135	228.06
0.8	0.6	94.09	131	224.73
0.8	0.7	85.02	128	217.51
0.8	0.8	90.08	134	228.02
0.8	0.9	81.24	128	216.37
0.9	0.1	133.94	133	239.68
0.9	0.2	97.3	127	219.69
0.9	0.3	108.37	130	227.51
0.9	0.4	81.96	133	224.09
0.9	0.5	95.92	136	232.77
0.9	0.6	85.52	128	217.66
0.9	0.7	84.58	134	226.37
0.9	0.8	88.52	130	221.56
0.9	0.9	79.35	132	221.8
