0.05	0	101	151.5
0.1	1.5	116	174.45
0.15	5.5	125	189.15
0.2	4.56	124	187.37
0.25	6.56	133	201.47
0.3	25.62	137	213.19
0.35	20.9	135	208.77
0.4	31.62	133	208.99
0.45	55.63	142	229.69
0.5	75.1	142	235.53
0.55	93.1	142	240.93
0.6	139.63	142	254.89
0.65	146.41	142	256.92
0.7	191.05	137	262.82
0.75	241.57	126	261.47
0.8	266.97	127	270.59
0.85	297.78	120	269.33
0.9	384.49	105	272.85
0.95	422.15	99	275.15
