0.05	92.48	101	179.24
0.1	130.35	104	195.11
0.15	144.19	113	212.76
0.2	131.96	114	210.59
0.25	141.41	118	219.42
0.3	175.93	112	220.78
0.35	147.08	118	221.12
0.4	195.62	119	237.19
0.45	209.57	119	241.37
0.5	228.05	118	245.42
0.55	230.97	120	249.29
0.6	273.26	117	257.48
0.65	257.36	120	257.21
0.7	280.74	116	258.22
0.75	291.41	121	268.92
0.8	347.47	110	269.24
0.85	351.13	112	273.34
0.9	399.87	103	274.46
0.95	373.67	109	275.6
