0.2	7.73	6	11.32
0.2	25.12	28	49.54
0.2	87.34	64	122.2
0.2	132.07	115	212.12
0.2	242.59	167	323.28
0.2	326.12	240	457.84
0.2	476.26	311	609.38
0.2	569.5	381	742.35
0.2	818.36	480	965.51
0.2	890.63	579	1135.69
0.2	1219.19	662	1358.76
0.2	1263.38	786	1558.01
0.2	1716.39	915	1887.42
0.2	1835.78	1058	2137.73
0.2	2157.58	1171	2403.77
0.2	2431.24	1339	2737.87
0.2	2835.47	1469	3054.14
0.2	3083.87	1652	3403.16
0.2	3463.58	1758	3676.07
0.2	3864.63	1939	4067.89
