0.9	0.9	2.5	6	9.75
0.9	0.9	17.17	32	53.15
0.9	0.9	47.9	74	125.37
0.9	0.9	85.02	131	222.01
0.9	0.9	149.76	199	343.43
0.9	0.9	209.1	279	481.23
0.9	0.9	303.78	363	635.63
0.9	0.9	386.03	473	825.31
0.9	0.9	506.33	578	1018.9
0.9	0.9	612.53	689	1217.26
0.9	0.9	775.9	820	1462.77
0.9	0.9	895.83	970	1723.75
0.9	0.9	1104.1	1107	1991.73
0.9	0.9	1250.34	1260	2265.1
0.9	0.9	1469.74	1423	2575.42
0.9	0.9	1628.62	1611	2905.09
0.9	0.9	1900.22	1781	3241.57
0.9	0.9	2072.35	1981	3593.2
0.9	0.9	2378.73	2161	3955.12
0.9	0.9	2580.2	2362	4317.06
