0.2	5.23	6	10.57
0.2	23.01	28	48.9
0.2	74.94	62	115.48
0.2	141.3	108	204.39
0.2	237.86	168	323.36
0.2	304.66	234	442.4
0.2	478.4	305	601.02
0.2	562.96	391	755.39
0.2	826.97	495	990.59
0.2	911.46	578	1140.44
0.2	1202.99	699	1409.4
0.2	1305.49	789	1575.15
0.2	1630.65	929	1882.7
0.2	1752.29	1020	2055.69
0.2	2201.29	1163	2404.89
0.2	2337.56	1320	2681.27
0.2	2678.28	1442	2966.48
0.2	3121.67	1626	3375.5
0.2	3437.59	1774	3692.28
0.2	3817.31	1918	4022.19
