1.67
1.89
0
60.12
30.46
1.97
167.32
27.83
0
422.04
249.12
1704.41
904.4
1428.94
820.94
962.69
1844.8
489.24
656.94
0
1.67
22.67
0
41.32
0
1.97
440.83
424.06
103.96
1.98
233.81
602.61
257.66
406.91
1.99
1570.33
3211.37
2746.84
963.76
2785.62
1.67
5.53
0
100.52
1.96
220.4
67.1
560.7
115.35
501.63
1.98
0
824.6
325.57
1419.49
253.77
1825.69
2610.4
1031.17
4716.34
0
0
18.94
0
76.09
150.69
370.94
0
191.24
475.42
0
0
1123.84
490.85
1137.72
228.31
1.99
0
476.97
537.02
1.67
15.18
1.92
1.95
0
98.4
346.94
0
788.93
1.98
159.73
292.97
44.12
453.73
416.05
213.02
1490.3
492.35
544.67
2244.5
1.67
10.48
11.53
0
1.96
59.11
315.46
0
554.12
678.31
117.73
0
1072.38
233.99
1935.86
1940.07
2082.26
901.19
1338.53
3262.35
0
0
1.92
220.03
1.96
68.62
0
1.97
70.22
212.65
481.32
605.26
907.98
405.21
1313.25
881.67
1501.42
752.44
251.88
724.07
0
0
0
1.95
194.8
0
118.58
40.7
351.69
145.67
769.28
696.75
0
196.35
219.6
1.99
731.55
2951.2
2338.92
41.61
0
31.17
20.24
69.48
170.25
0
85.43
237.02
132.61
1.98
0
848.96
145.78
0
778.24
863.69
763.15
1434.62
332.48
312.06
1.67
0
23.33
146.15
0
0
0
286.54
300.38
445.29
1.98
425.33
1.98
461.74
1798.5
919.62
940.56
3380.77
229.28
528.05
1.67
16.15
0
1.95
1.96
139.17
1.97
482.28
140.7
633.77
0
184.39
1.98
0
1.99
263.71
229.02
234.86
475.5
1915.56
1.67
0
55.21
0
0
0
132.77
218.11
492.9
399.36
603.62
0
210.58
1330.98
1.99
1385.8
128.76
581.9
1905.54
1.99
0
0
1.92
1.95
30.46
1.97
78.43
0
1.98
355.22
512.64
46.17
95.8
1.99
598.56
372.78
614.58
695.55
309.94
1213.89
0
1.89
0
0
20.89
144.73
90.16
1.97
1.98
136.06
437.12
352.71
120.83
1.99
1.99
685.51
829.97
365.06
2692.21
1194.89
1.67
0
52.04
101.44
82.62
1.97
45.43
230.22
1.98
313.0
893.66
491.96
661.12
1661.03
1393.33
342.35
3191.63
459.55
764.95
1840.94
0
0
0
0
156.53
0
223.56
1.97
0
0
1.98
186.51
806.25
113.9
499.97
1978.82
250.17
2412.8
2097.69
603.36
1.67
0
74.23
75.03
1.96
0
1.97
99.98
448.18
684.88
1007.41
642.76
1507.82
321.99
1217.34
710.77
1635.51
1487.92
1207.89
897.28
1.67
23.23
0
157.25
53.62
1.97
0
474.91
0
550.64
0
527.93
279.63
1599.56
0
1.99
249.64
1766.42
1283.51
1140.13
0
1.89
0
87.86
1.96
77.42
510.93
0
702.44
1.98
147.51
1.98
292.36
105.44
736.54
342.35
667.26
2315.01
1627.08
466.1
0
0
69.85
0
1.96
61.51
24.07
1.97
1.98
449.69
295.82
922.62
0
865.22
1440.63
1521.28
1883.15
217.1
1044.9
100.57
0
25.5
1.92
33.04
0
137.28
1.97
293.29
222.33
347.37
548.53
361.53
0
1188.31
364.11
190.21
233.69
355.97
1073.89
2374.83
0
17.0
60.42
0
1.96
0
90.16
226.99
1.98
0
0
1893.08
1.98
285.09
1.99
545.14
125.84
1551.33
264.26
1978.89
1.67
16.15
0
90.44
0
0
103.49
0
334.74
259.59
480.5
973.57
0
1044.4
1127.69
898.43
249.7
2431.77
1672.02
1185.86
0
4.55
0
73.62
112.09
1.97
1.97
1.97
219.11
352.83
692.87
243.83
354.36
264.08
648.1
351.52
2387.26
726.62
1145.28
740.72
1.67
1.89
0
38.85
0
0
436.04
516.83
1.98
0
177.06
573.72
221.6
999.54
1778.39
1.99
863.93
1.99
2678.69
536.49
0
33.15
1.92
180.2
75.54
0
0
79.08
173.7
618.75
641.87
154.2
735.7
958.02
1.99
214.67
754.53
1.99
0
2137.49
0
0
0
0
56.96
95.62
0
539.75
248.7
251.75
531.12
559.43
175.66
875.95
1392.65
2195.38
381.01
1219.02
350.0
1718.53
1.67
0
0
0
210.17
0
0
582.46
0
861.0
321.82
46.17
644.78
636.67
1367.09
202.9
862.14
268.29
2989.99
361.03
1.67
0
15.28
0
0
133.98
1.97
1.97
1.98
366.56
80.89
375.74
641.88
187.48
356.19
1.99
1338.78
2475.64
3788.21
590.27
0
1.89
98.67
151.5
130.88
0
0
137.61
175.53
777.14
1.98
710.5
2088.79
1049.22
603.47
1268.72
382.88
2792.15
325.46
4053.45
0
7.79
0
81.47
70.22
302.46
1.97
241.74
85.94
99.06
230.5
1.98
445.4
519.52
819.37
2219.87
1330.16
1284.97
2288.15
1027.31
0
0
0
0
1.96
1.97
0
235.18
197.7
527.03
381.44
1.98
1089.49
1.99
0
0
668.42
1591.52
812.82
3261.24
0
0
50.0
80.03
69.75
1.97
34.74
74.15
218.39
0
335.63
0
702.44
1324.74
464.22
863.08
1.99
3476.54
2612.3
1.99
1.67
0
0
205.37
121.5
95.4
0
0
236.05
415.22
603.64
1339.5
0
282.29
110.79
1.99
2955.35
246.86
1745.96
702.44
1.67
1.89
0
45.37
127.59
0
1.97
834.57
247.7
388.31
1.98
1.98
0
1180.67
318.92
851.38
0
1.99
1404.43
1577.14
1.67
0
1.92
0
0
1.97
1.97
0
509.17
663.9
932.1
80.21
35.53
1253.73
498.05
257.39
935.85
678.88
248.44
488.96
0
0
0
0
81.4
0
0
306.66
571.49
327.6
337.64
450.36
954.17
38.71
0
159.04
340.07
761.81
1394.12
149.78
1.67
12.75
26.8
0
104.68
0
394.9
0
284.67
933.32
120.36
372.32
212.06
1156.59
396.52
671.08
1687.61
209.75
204.23
497.07
1.67
0
29.17
87.86
95.75
0
125.54
189.29
1.98
181.69
311.82
344.82
1.98
172.41
683.92
967.08
1515.01
326.06
245.92
720.78
1.67
0
60.23
0
92.25
113.05
61.75
140.23
181.65
1.98
448.84
1177.43
628.21
185.18
621.64
1.99
373.0
1.99
2534.88
1.99
1.67
0
1.92
0
0
1.97
1.97
322.2
172.43
99.06
444.5
167.96
651.57
258.99
1753.0
545.38
2311.45
2440.44
1019.45
1.99
1.67
0
0
1.95
130.18
109.68
132.24
785.6
129.93
783.78
1.98
593.33
110.07
520.81
0
515.94
623.26
781.54
342.74
554.78
1.67
43.92
32.08
0
36.12
1.97
62.18
160.73
247.45
514.31
839.48
819.05
505.46
1171.26
754.43
704.62
1186.82
357.59
1394.73
180.54
1.67
23.33
0
1.95
193.93
132.59
231.37
1.97
188.29
109.32
185.89
832.53
1649.61
1.99
306.8
251.75
1.99
1.99
1071.61
2399.84
1.67
21.25
38.99
0
99.75
0
1.97
249.38
401.17
118.89
145.24
559.21
1280.57
1131.33
583.96
439.26
1.99
2275.1
1.99
571.66
0
0
0
0
141.25
243.2
0
0
537.85
337.25
1362.4
1637.5
1.98
1164.44
316.18
1.99
1041.26
1966.48
945.73
2711.98
0
33.15
1.92
94.35
0
0
0
405.52
0
1.98
243.73
1.98
523.37
263.37
1.99
1389.95
1892.27
1685.05
217.96
67.78
1.67
0
0
189.13
35.0
73.53
149.17
521.5
561.79
253.18
393.37
256.71
143.91
1.99
2984.71
1068.92
1710.6
308.2
2229.91
2698.62
0
0
24.4
1.95
50.94
0
0
604.5
1.98
639.74
1303.89
1.98
0
967.79
1.99
685.35
670.79
134.46
2152.28
0
0
0
1.92
0
0
1.97
155.45
336.4
0
74.91
15.5
343.98
127.05
1.99
0
1718.72
585.93
1.99
961.55
1981.07
0
10.48
17.5
61.16
85.13
217.21
1.97
254.61
558.67
778.67
120.57
965.34
1.98
865.37
74.6
2063.03
1187.33
971.79
139.77
184.66
1.67
49.0
0
45.72
105.34
88.21
1.97
156.99
87.93
0
0
258.17
1328.34
797.15
647.03
554.61
1976.26
491.85
1505.53
1724.13
1.67
0
65.25
0
0
1.97
147.33
1.97
0
204.3
1134.71
870.17
1.98
439.15
233.58
2871.19
1062.59
1476.61
1.99
3432.95
1.67
0
50.42
0
0
83.23
1.97
232.14
0
1.98
499.58
586.18
1041.67
470.82
0
499.66
1384.49
400.47
1558.76
1117.65
0
0
0
0
224.13
26.23
143.09
462.6
314.58
128.71
1.98
309.32
241.99
147.31
1241.36
1413.83
1.99
201.51
1275.67
115.93
0
16.15
0
0
0
144.15
63.75
0
355.72
363.98
399.08
604.92
1959.23
1.99
1.99
1381.58
1598.0
371.45
812.71
2210.33
0
7.79
35.83
58.35
0
1.97
16.64
649.69
147.32
1.98
159.83
1.98
840.37
1169.26
179.49
652.24
770.0
2413.72
1485.92
1628.97
1.67
1.89
0
0
0
156.38
253.27
1.97
914.58
166.05
757.4
284.07
391.59
1089.45
1.99
1135.72
1736.8
863.5
758.3
2145.39
0
1.89
0
113.2
0
1.97
303.79
1.97
0
221.02
247.39
268.37
796.02
768.2
98.83
469.37
1951.22
1.99
977.37
1.99
0
0
0
162.29
47.14
1.97
1.97
287.2
0
362.79
1.98
119.05
1368.86
1603.86
1.99
1705.03
1.99
1040.57
1666.41
3911.12
0
0
0
20.97
0
1.97
116.88
172.05
87.07
261.44
265.19
1650.31
409.69
433.9
1069.56
759.49
332.09
495.8
1105.77
1478.53
0
0
50.0
197.86
0
1.97
0
116.32
574.89
172.01
524.51
746.41
151.81
139.04
569.59
1.99
705.21
1620.6
3217.34
2476.9
1.67
1.89
0
139.11
1.96
175.38
0
156.09
248.7
582.7
711.72
250.76
1290.61
0
0
1463.9
1377.96
917.74
576.36
1903.4
0
0
14.37
82.94
1.96
116.89
256.14
103.08
212.16
166.71
1.98
314.72
159.58
162.08
231.91
801.27
2124.71
1243.46
1655.26
2145.41
0
0
26.46
0
0
160.97
474.38
459.25
315.88
123.62
289.25
37.2
831.64
0
774.72
600.87
697.39
1729.91
3651.25
331.88
1.67
11.9
0
58.35
72.75
0
1.97
0
305.06
0
0
358.12
1.98
536.2
1.99
183.53
1024.4
147.1
1.99
2104.94
0
0
0
1.95
0
0
475.76
1.97
0
1.98
1.98
728.82
283.61
228.51
849.06
1320.59
214.98
0
543.13
1177.62
0
28.0
41.07
0
213.07
61.18
55.86
27.83
492.12
455.74
111.94
629.07
94.13
1079.92
405.63
190.51
2268.48
1346.21
2534.37
2819.03
1.67
0
40.42
52.11
0
176.69
1.97
197.03
0
387.65
503.3
433.95
547.11
84.52
1076.79
145.61
1121.89
2854.52
2055.83
1259.63
1.67
0
41.57
0
0
1.97
307.13
0
378.56
344.29
0
540.61
549.56
276.11
1.99
495.84
434.45
851.16
1153.91
2741.27
1.67
0
105.11
0
0
0
123.5
404.94
1.98
115.42
812.44
251.41
733.88
2176.61
1.99
1399.95
2648.95
241.25
2758.6
1.99
1.67
58.81
41.57
0
53.25
202.89
575.21
696.54
1064.57
598.06
298.26
754.23
628.66
380.56
0
1766.53
207.64
1.99
667.99
635.05
0
0
1.92
35.15
1.96
0
0
314.08
1.98
500.19
519.69
1.98
162.71
1022.9
0
1558.31
439.72
0
1033.86
791.7
1.67
0
0
30.22
0
19.34
29.32
1.97
1.98
74.91
604.34
0
80.17
991.45
481.22
0
1977.51
111.6
603.95
2875.49
1.67
0
0
0
194.37
127.45
326.33
89.23
0
208.49
1.98
1182.07
416.43
1.99
1335.15
521.95
2026.52
2558.14
427.53
1984.38
1.67
0
1.92
1.95
0
89.63
0
1.97
1.98
1.98
0
757.44
933.2
1577.36
0
212.6
729.2
132.26
362.22
948.86
1.67
17.0
1.92
1.95
0
44.86
322.42
214.65
1.98
0
67.68
709.56
80.4
1355.6
2062.05
270.17
1.99
682.27
264.31
1115.34
0
12.75
0
64.49
0
0
422.5
855.49
0
431.19
80.81
216.42
0
1072.87
232.19
1497.83
241.8
1310.01
998.22
478.78
1.67
0
1.92
75.54
36.8
1.97
324.46
1.97
1.98
303.64
0
593.01
54.2
176.84
569.39
502.39
3737.71
1839.39
2449.45
373.98
1.67
0
0
0
0
0
183.62
466.86
144.24
0
0
612.02
1211.59
420.15
488.8
205.07
2009.75
1146.43
1.99
974.25
1.67
23.23
40.62
1.95
35.89
0
1.97
192.96
287.39
1.98
336.97
943.89
96.41
725.39
1141.88
0
920.3
1.99
1906.54
167.54
1.67
0
42.17
73.9
58.02
1.97
155.44
387.0
0
458.71
225.82
231.31
1.98
355.29
1577.66
781.21
1700.56
1857.23
659.21
2825.22
1.67
17.0
46.67
0
0
273.99
148.53
256.25
0
158.61
581.01
1.98
306.22
1240.92
1.99
2268.4
466.92
195.15
2554.43
1397.94
1.67
0
43.75
0
176.46
1.97
461.12
171.2
563.62
180.2
0
1.98
1.98
1.99
1729.06
1480.59
1810.98
2307.96
1484.5
2918.57
0
0
1.92
0
229.43
106.47
399.32
364.49
588.4
0
367.01
691.63
0
1.99
864.31
650.14
1.99
1215.36
611.22
1580.69
0
1.89
25.45
0
59.25
130.15
0
196.17
146.82
1.98
840.62
362.22
1625.16
1121.64
583.03
292.25
1016.74
422.43
533.51
1598.75
1.67
35.42
23.16
1.95
129.37
223.25
0
0
0
252.6
404.6
161.92
92.71
43.9
1.99
1.99
946.51
1765.96
1942.02
2342.9
0
19.43
0
30.37
143.45
0
0
1.97
197.09
517.24
1.98
251.62
252.91
1291.4
615.09
0
0
730.47
585.0
2852.68
0
0
0
0
0
1.97
822.19
233.49
0
30.55
0
542.66
688.63
1355.62
1.99
209.91
0
1383.88
1.99
1061.34
1.67
16.15
36.46
1.95
196.0
69.5
1.97
76.45
0
1.98
903.17
739.58
1.98
139.04
120.6
357.43
138.58
1738.35
2692.62
0
1.67
0
75.14
0
130.71
1.97
152.48
298.26
513.13
448.5
576.54
304.48
1.98
157.76
493.8
1681.74
1333.54
201.42
4223.99
1024.42
1.67
13.76
58.67
56.0
406.68
63.79
177.4
117.24
1.98
67.15
0
1.98
308.2
528.21
2040.67
449.48
194.64
473.13
2664.27
1874.99
0
19.43
14.37
1.95
0
247.0
146.91
0
411.24
718.49
32.96
497.02
1301.5
1092.05
1574.26
1568.08
1656.48
359.94
1357.7
779.85
1.67
0
0
93.73
0
249.55
1.97
0
0
148.97
256.6
514.88
1.98
1454.56
0
457.87
1473.42
806.68
1344.63
900.44
0
23.23
0
0
142.12
59.11
0
262.73
151.18
34.59
180.57
525.17
772.09
731.94
392.06
57.23
1.99
234.97
570.41
915.49
1.67
0
0
0
30.27
0
69.91
0
1.98
356.51
287.0
1.98
170.79
139.17
733.0
0
1608.71
133.92
0
2780.2
1.67
0
17.08
0
1.96
0
67.1
73.24
1114.92
585.1
651.62
552.57
0
577.84
1437.23
596.3
120.32
289.87
1156.93
2415.75
1.67
0
51.49
0
76.77
87.78
197.71
0
1.98
212.82
484.14
0
278.28
466.16
238.82
680.12
2161.93
3219.66
988.23
2335.72
1.67
0
21.87
54.99
0
74.75
0
130.78
215.65
390.53
1.98
199.8
189.77
757.69
942.23
1.99
3064.64
1535.27
2423.44
311.82
1.67
0
27.61
60.52
0
157.08
157.08
1.97
1.98
411.42
724.11
709.04
1.98
885.47
474.36
1047.08
1219.94
517.43
600.78
1.99
