0.6	0	6	9.0
0.6	34.46	32	58.34
0.6	72.48	80	141.74
0.6	114.5	138	241.35
0.6	217.46	218	392.24
0.6	315.01	302	547.5
0.6	427.01	402	731.1
0.6	626.4	513	957.42
0.6	713.84	635	1166.65
0.6	963.88	774	1450.16
0.6	1210.48	914	1734.14
0.6	1433.5	1071	2036.55
0.6	1785.06	1232	2383.52
0.6	1947.58	1415	2706.77
0.6	2354.17	1593	3095.75
0.6	2537.16	1796	3455.15
0.6	2969.86	2007	3901.46
0.6	3552.39	2211	4382.22
0.6	3640.2	2457	4777.56
0.6	4118.73	2672	5243.62
