0.05	102.77	97	176.33
0.1	107.99	101	183.9
0.15	139.69	118	218.91
0.2	133.35	115	212.51
0.25	152.2	111	212.16
0.3	147.75	116	218.32
0.35	187.66	115	228.8
0.4	200.29	119	238.59
0.45	192.67	120	237.8
0.5	222.23	117	242.17
0.55	214.06	123	248.72
0.6	244.67	118	250.4
0.65	294.02	115	260.71
0.7	299.86	115	262.46
0.75	319.79	114	266.94
0.8	345.46	108	265.64
0.85	363.18	107	269.46
0.9	366.23	111	276.37
0.95	394.82	104	274.45
