0.2	7.73	6	11.32
0.2	29.79	28	50.94
0.2	80.39	64	120.12
0.2	121.5	110	201.45
0.2	250.94	169	328.78
0.2	322.67	236	450.8
0.2	477.99	302	596.4
0.2	596.71	403	783.51
0.2	783.36	470	940.01
0.2	970.56	587	1171.67
0.2	1153.5	682	1369.05
0.2	1391.11	802	1620.33
0.2	1669.88	909	1864.46
0.2	1816.74	1033	2094.52
0.2	2165.36	1157	2385.11
0.2	2402.48	1304	2676.75
0.2	2824.98	1424	2983.49
0.2	3033.52	1616	3334.06
0.2	3495.29	1764	3694.59
0.2	3706.88	1934	4013.07
