0.05	88.45	137	232.03
0.1	95.6	115	201.18
0.15	110.79	140	243.24
0.2	131.3	139	247.89
0.25	159.56	126	236.87
0.3	153.48	138	253.05
0.35	172.61	125	239.28
0.4	167.72	141	261.82
0.45	191.24	126	246.37
0.5	218.32	130	260.49
0.55	213.86	127	254.66
0.6	273.88	120	262.16
0.65	259.5	127	268.35
0.7	283.73	120	265.12
0.75	306.37	119	270.41
0.8	322.49	118	273.75
0.85	367.74	107	270.82
0.9	392.95	103	272.38
0.95	425.37	98	274.61
