0.2	7.73	6	11.32
0.2	27.29	28	50.19
0.2	87.23	60	116.17
0.2	133.58	113	209.57
0.2	283.02	171	341.4
0.2	322.12	239	455.14
0.2	473.83	302	595.15
0.2	560.9	384	744.27
0.2	791.85	478	954.55
0.2	942.27	572	1140.68
0.2	1151.99	655	1328.1
0.2	1363.18	803	1613.45
0.2	1560.66	902	1821.2
0.2	1814.64	1050	2119.39
0.2	2165.04	1171	2406.01
0.2	2343.76	1313	2672.63
0.2	2797.7	1435	2991.81
0.2	3018.53	1595	3298.06
0.2	3391.13	1748	3639.34
0.2	3713.66	1933	4013.6
