0.1	0.1	223.85	126	256.16
0.1	0.2	109.1	135	235.23
0.1	0.3	99.03	133	229.21
0.1	0.4	91.36	134	228.41
0.1	0.5	91.08	131	223.82
0.1	0.6	88.08	131	222.92
0.1	0.7	94.25	133	227.77
0.1	0.8	87.02	131	222.61
0.1	0.9	86.68	131	222.5
0.2	0.1	127.11	134	239.13
0.2	0.2	102.7	128	222.81
0.2	0.3	96.42	134	229.92
0.2	0.4	92.86	133	227.36
0.2	0.5	86.96	132	224.09
0.2	0.6	86.41	127	216.42
0.2	0.7	89.3	133	226.29
0.2	0.8	81.52	135	226.96
0.2	0.9	88.63	129	220.09
0.3	0.1	189.52	136	260.86
0.3	0.2	121.6	135	238.98
0.3	0.3	83.02	136	228.91
0.3	0.4	91.19	131	223.86
0.3	0.5	81.35	127	214.9
0.3	0.6	90.69	125	214.71
0.3	0.7	86.74	134	227.02
0.3	0.8	94.3	129	221.79
0.3	0.9	85.29	130	220.59
0.4	0.1	163.72	128	241.12
0.4	0.2	117.99	134	236.4
0.4	0.3	100.09	130	225.03
0.4	0.4	82.79	131	221.34
0.4	0.5	89.19	136	230.76
0.4	0.6	82.74	133	224.32
0.4	0.7	92.13	136	231.64
0.4	0.8	83.35	129	218.5
0.4	0.9	83.91	130	220.17
0.5	0.1	150.96	132	243.29
0.5	0.2	110.81	131	229.74
0.5	0.3	88.42	130	221.52
0.5	0.4	83.41	134	226.02
0.5	0.5	87.41	132	224.22
0.5	0.6	91.75	136	231.52
0.5	0.7	83.85	131	221.65
0.5	0.8	86.63	132	223.99
0.5	0.9	81.79	134	225.54
0.6	0.1	135.16	133	240.05
0.6	0.2	111.32	132	231.4
0.6	0.3	93.13	133	227.44
0.6	0.4	99.14	135	232.24
0.6	0.5	81.74	129	218.02
0.6	0.6	81.68	130	219.5
0.6	0.7	82.24	133	224.17
0.6	0.8	88.19	131	222.96
0.6	0.9	90.3	129	220.59
0.7	0.1	98.87	130	224.66
0.7	0.2	113.38	133	233.51
0.7	0.3	88.13	128	218.44
0.7	0.4	87.19	129	219.66
0.7	0.5	84.35	131	221.8
0.7	0.6	84.74	130	220.42
0.7	0.7	83.74	132	223.12
0.7	0.8	88.19	136	230.46
0.7	0.9	82.68	134	225.8
0.8	0.1	136.9	135	243.57
0.8	0.2	101.2	135	232.86
0.8	0.3	113.04	132	231.91
0.8	0.4	86.69	132	224.01
0.8	0.5	81.35	131	220.9
0.8	0.6	85.35	128	217.6
0.8	0.7	86.08	131	222.32
0.8	0.8	83.41	126	214.02
0.8	0.9	79.62	132	221.89
0.9	0.1	148.61	135	247.08
0.9	0.2	109.47	135	235.34
0.9	0.3	86.02	140	235.81
0.9	0.4	88.52	130	221.56
0.9	0.5	82.96	131	221.39
0.9	0.6	84.08	139	233.72
0.9	0.7	83.02	138	231.91
0.9	0.8	83.91	132	223.17
0.9	0.9	87.13	135	228.64
