0.2	2.61	6	9.78
0.2	19.01	34	56.7
0.2	63.15	77	134.45
0.2	128.25	140	248.47
0.2	203.47	212	379.04
0.2	311.79	300	543.54
0.2	418.2	387	705.96
0.2	579.14	512	941.74
0.2	730.13	611	1135.54
0.2	972.23	741	1403.17
0.2	1201.07	890	1695.32
0.2	1401.5	883	1744.95
0.2	1734.0	1199	2318.7
0.2	2008.72	1386	2681.61
0.2	2285.41	1528	2977.62
0.2	2684.05	1501	3056.72
0.2	2980.61	1693	3433.68
0.2	3437.95	2134	4232.38
0.2	3780.59	2064	4230.18
0.2	4163.95	2563	5093.69
