0.9	0.9	1.5	6	9.45
0.9	0.9	13.17	32	51.95
0.9	0.9	49.68	75	127.4
0.9	0.9	84.74	132	223.42
0.9	0.9	158.1	195	339.93
0.9	0.9	209.83	273	472.45
0.9	0.9	303.46	370	646.04
0.9	0.9	383.52	470	820.06
0.9	0.9	517.06	578	1022.12
0.9	0.9	617.92	704	1241.38
0.9	0.9	781.9	819	1463.07
0.9	0.9	902.83	975	1733.35
0.9	0.9	1090.31	1110	1992.09
0.9	0.9	1260.1	1279	2296.53
0.9	0.9	1461.45	1420	2568.43
0.9	0.9	1639.4	1606	2900.82
0.9	0.9	1909.63	1779	3241.39
0.9	0.9	2090.06	1971	3583.52
0.9	0.9	2401.63	2158	3957.49
0.9	0.9	2584.67	2359	4313.9
