0.2	7.73	6	11.32
0.2	17.51	29	48.75
0.2	83.45	62	118.03
0.2	130.46	108	201.14
0.2	242.83	166	321.85
0.2	351.15	239	463.84
0.2	466.82	309	603.55
0.2	560.18	386	747.05
0.2	792.72	474	948.82
0.2	881.11	580	1134.33
0.2	1153.84	666	1345.15
0.2	1338.52	793	1591.06
0.2	1604.26	903	1835.78
0.2	1801.56	1025	2077.97
0.2	2283.52	1153	2414.56
0.2	2471.66	1319	2720.0
0.2	2751.35	1434	2976.41
0.2	3072.65	1604	3327.79
0.2	3474.99	1753	3672.0
0.2	3755.94	1948	4048.78
