0.6	0.5	6	9.15
0.6	19.9	33	55.47
0.6	51.42	81	136.92
0.6	155.92	139	255.28
0.6	223.46	213	386.54
0.6	352.7	298	552.81
0.6	396.14	402	721.84
0.6	625.12	513	957.03
0.6	785.05	636	1189.52
0.6	981.97	773	1454.09
0.6	1126.5	920	1717.95
0.6	1451.91	1069	2039.07
0.6	1626.87	1238	2345.06
0.6	2026.17	1402	2710.85
0.6	2321.22	1590	3081.37
0.6	2600.03	1786	3459.01
0.6	2857.68	2020	3887.3
0.6	3405.98	2216	4345.79
0.6	3713.6	2442	4777.08
0.6	4186.64	2678	5272.99
