0.05	0	107	160.5
0.1	0.5	117	175.65
0.15	1.0	121	181.8
0.2	4.5	120	181.35
0.25	12.11	129	197.13
0.3	29.79	140	218.94
0.35	31.01	141	220.8
0.4	27.28	138	215.18
0.45	53.3	143	230.49
0.5	87.81	139	234.84
0.55	138.9	138	248.67
0.6	125.68	143	252.2
0.65	150.63	140	255.19
0.7	198.43	134	260.53
0.75	249.9	129	268.47
0.8	284.18	127	275.76
0.85	321.69	114	267.51
0.9	372.22	107	272.17
0.95	398.44	103	274.03
