0.05	93.43	103	182.53
0.1	112.22	100	183.67
0.15	124.4	110	202.32
0.2	130.07	112	207.02
0.25	152.53	114	216.76
0.3	160.76	121	229.73
0.35	170.56	122	234.17
0.4	198.11	117	234.93
0.45	195.11	119	237.03
0.5	233.97	117	245.69
0.55	289.32	117	262.29
0.6	274.81	117	257.94
0.65	287.68	117	261.81
0.7	308.02	117	267.91
0.75	319.68	116	269.91
0.8	337.82	113	270.84
0.85	365.51	108	271.65
0.9	384.72	107	275.92
0.95	419.48	100	275.85
