0.05	0	102	153.0
0.1	1.56	118	177.47
0.15	1.0	120	180.3
0.2	5.11	126	190.53
0.25	13.11	134	204.93
0.3	22.78	137	212.33
0.35	39.96	141	223.49
0.4	52.69	143	230.31
0.45	55.92	141	228.27
0.5	66.81	142	233.04
0.55	101.66	143	245.0
0.6	111.55	143	247.96
0.65	190.59	130	252.18
0.7	235.11	126	259.53
0.75	265.69	126	268.71
0.8	230.39	133	268.62
0.85	277.4	122	266.22
0.9	351.32	116	279.4
0.95	415.15	100	274.55
