0.05	0	99	148.5
0.1	1.5	117	175.95
0.15	3.0	121	182.4
0.2	2.0	121	182.1
0.25	13.67	129	197.6
0.3	12.73	134	204.82
0.35	30.51	137	214.65
0.4	32.51	140	219.75
0.45	68.31	143	234.99
0.5	90.32	139	235.6
0.55	89.7	142	239.91
0.6	115.5	141	246.15
0.65	166.86	137	255.56
0.7	164.03	136	253.21
0.75	206.94	136	266.08
0.8	278.39	130	278.52
0.85	329.34	118	275.8
0.9	377.04	108	275.11
0.95	414.75	100	274.42
