0.05	104.96	112	199.49
0.1	93.89	139	236.67
0.15	123.79	137	242.64
0.2	134.31	138	247.29
0.25	117.62	139	243.78
0.3	172.8	128	243.84
0.35	173.67	136	256.1
0.4	179.68	137	259.41
0.45	200.91	131	256.77
0.5	199.58	125	247.37
0.55	247.04	127	264.61
0.6	243.83	125	260.65
0.65	282.22	122	267.67
0.7	265.1	122	262.53
0.75	298.45	119	268.03
0.8	318.7	119	274.11
0.85	343.75	115	275.63
0.9	394.96	101	269.99
0.95	415.12	101	276.04
