0.6	2.61	6	9.78
0.6	16.4	35	57.42
0.6	65.31	80	139.59
0.6	144.01	139	251.7
0.6	199.65	216	383.9
0.6	344.61	303	557.88
0.6	429.38	406	737.82
0.6	609.36	517	958.31
0.6	796.53	639	1197.46
0.6	957.89	770	1442.37
0.6	1160.77	908	1710.23
0.6	1441.47	1067	2032.94
0.6	1721.5	1231	2362.95
0.6	1916.78	1417	2700.53
0.6	2201.1	1599	3058.83
0.6	2723.62	1794	3508.08
0.6	2932.5	2006	3888.75
0.6	3429.37	2208	4340.81
0.6	3660.13	2465	4795.54
0.6	4197.33	2674	5270.2
