0.2	5.23	6	10.57
0.2	27.29	29	51.69
0.2	89.62	64	122.88
0.2	114.12	112	202.23
0.2	220.13	171	322.54
0.2	307.44	234	443.23
0.2	455.77	303	591.23
0.2	556.1	384	742.83
0.2	777.14	477	948.64
0.2	917.16	579	1143.65
0.2	1172.47	675	1364.24
0.2	1357.31	792	1595.19
0.2	1595.45	908	1840.64
0.2	1868.83	1046	2129.65
0.2	2209.64	1165	2410.39
0.2	2409.22	1333	2722.27
0.2	2756.25	1464	3022.87
0.2	3121.36	1626	3375.41
0.2	3637.31	1749	3714.69
0.2	3709.27	1922	3995.78
