0.05	85.92	105	183.27
0.1	117.72	100	185.32
0.15	108.49	109	196.05
0.2	149.14	110	209.74
0.25	174.38	116	226.31
0.3	164.94	118	226.48
0.35	161.77	117	224.03
0.4	191.28	119	235.88
0.45	198.62	121	241.09
0.5	262.8	119	257.34
0.55	257.24	116	251.17
0.6	245.75	120	253.73
0.65	280.58	116	258.17
0.7	308.86	113	262.16
0.75	302.6	113	260.28
0.8	325.25	113	267.08
0.85	356.4	110	271.92
0.9	353.06	115	278.42
0.95	409.49	101	274.35
