0.1	0.1	226.19	130	262.86
0.1	0.2	103.48	131	227.54
0.1	0.3	104.7	131	227.91
0.1	0.4	94.97	130	223.49
0.1	0.5	95.86	137	234.26
0.1	0.6	86.41	126	214.92
0.1	0.7	87.58	133	225.77
0.1	0.8	90.13	138	234.04
0.1	0.9	88.19	129	219.96
0.2	0.1	130.0	132	237.0
0.2	0.2	109.21	132	230.76
0.2	0.3	90.02	133	226.51
0.2	0.4	93.69	125	215.61
0.2	0.5	84.35	131	221.8
0.2	0.6	84.58	130	220.37
0.2	0.7	88.52	134	227.56
0.2	0.8	90.25	126	216.07
0.2	0.9	85.91	129	219.27
0.3	0.1	173.51	135	254.55
0.3	0.2	126.83	131	234.55
0.3	0.3	112.04	135	236.11
0.3	0.4	83.85	130	220.15
0.3	0.5	93.75	125	215.62
0.3	0.6	83.41	132	223.02
0.3	0.7	86.96	129	219.59
0.3	0.8	85.91	131	222.27
0.3	0.9	82.85	137	230.35
0.4	0.1	145.06	132	241.52
0.4	0.2	84.24	129	218.77
0.4	0.3	95.8	133	228.24
0.4	0.4	90.42	131	223.62
0.4	0.5	88.19	138	233.46
0.4	0.6	89.86	134	227.96
0.4	0.7	89.08	135	229.22
0.4	0.8	87.63	134	227.29
0.4	0.9	78.29	133	222.99
0.5	0.1	119.65	136	239.9
0.5	0.2	92.14	129	221.14
0.5	0.3	110.31	138	240.09
0.5	0.4	102.42	129	224.22
0.5	0.5	81.07	135	226.82
0.5	0.6	84.29	129	218.79
0.5	0.7	88.8	131	223.14
0.5	0.8	87.46	133	225.74
0.5	0.9	86.85	130	221.05
0.6	0.1	135.77	124	226.73
0.6	0.2	91.08	138	234.32
0.6	0.3	109.27	135	235.28
0.6	0.4	88.58	132	224.57
0.6	0.5	80.18	139	232.55
0.6	0.6	86.85	132	224.05
0.6	0.7	83.02	132	222.91
0.6	0.8	81.74	130	219.52
0.6	0.9	80.63	129	217.69
0.7	0.1	143.55	129	236.56
0.7	0.2	89.75	131	223.42
0.7	0.3	95.25	136	232.57
0.7	0.4	89.08	131	223.22
0.7	0.5	84.85	132	223.45
0.7	0.6	85.96	134	226.79
0.7	0.7	85.02	132	223.51
0.7	0.8	90.35	137	232.6
0.7	0.9	87.63	127	216.79
0.8	0.1	180.78	127	244.73
0.8	0.2	133.43	132	238.03
0.8	0.3	90.97	131	223.79
0.8	0.4	95.8	126	217.74
0.8	0.5	92.19	129	221.16
0.8	0.6	83.24	137	230.47
0.8	0.7	85.08	126	214.52
0.8	0.8	87.52	131	222.76
0.8	0.9	87.36	133	225.71
0.9	0.1	111.21	135	235.86
0.9	0.2	96.2	134	229.86
0.9	0.3	84.29	133	224.79
0.9	0.4	81.85	130	219.55
0.9	0.5	79.24	132	221.77
0.9	0.6	85.13	134	226.54
0.9	0.7	86.96	132	224.09
0.9	0.8	85.02	130	220.51
0.9	0.9	81.63	131	220.99
