0.6	3.61	6	10.08
0.6	16.4	34	55.92
0.6	67.37	81	141.71
0.6	104.78	139	239.93
0.6	217.71	219	393.81
0.6	304.04	302	544.21
0.6	431.69	405	737.01
0.6	598.91	517	955.17
0.6	795.05	633	1188.02
0.6	975.76	768	1444.73
0.6	1139.24	916	1715.77
0.6	1448.23	1067	2034.97
0.6	1740.16	1232	2370.05
0.6	1954.68	1417	2711.9
0.6	2320.65	1596	3090.19
0.6	2710.2	1789	3496.56
0.6	2954.83	2002	3889.45
0.6	3292.0	2223	4322.1
0.6	3732.59	2442	4782.78
0.6	4072.28	2697	5267.18
