0.05	99.55	99	178.36
0.1	105.78	105	189.23
0.15	121.45	103	190.93
0.2	143.69	110	208.11
0.25	146.92	115	216.58
0.3	156.42	114	217.93
0.35	149.93	118	221.98
0.4	180.38	123	238.61
0.45	219.91	118	242.97
0.5	226.52	121	249.46
0.55	261.02	121	259.81
0.6	269.03	119	259.21
0.65	263.58	122	262.07
0.7	311.24	117	268.87
0.75	341.14	110	267.34
0.8	371.28	108	273.38
0.85	355.02	111	273.01
0.9	366.89	110	275.07
0.95	391.18	105	274.86
