0.05	2.56	110	165.77
0.1	0.5	115	172.65
0.15	2.5	122	183.75
0.2	7.61	125	189.78
0.25	11.11	132	201.33
0.3	18.28	136	209.48
0.35	38.35	140	221.5
0.4	39.85	142	224.95
0.45	73.76	142	235.13
0.5	82.32	140	234.7
0.55	106.56	142	244.97
0.6	99.12	143	244.23
0.65	143.18	139	251.45
0.7	191.54	134	258.46
0.75	212.38	130	258.71
0.8	250.73	125	262.72
0.85	308.81	119	271.14
0.9	364.28	112	277.28
0.95	406.11	101	273.33
