0.1	0.1	170.36	130	246.11
0.1	0.2	132.22	134	240.67
0.1	0.3	115.48	132	232.64
0.1	0.4	99.14	133	229.24
0.1	0.5	103.37	135	233.51
0.1	0.6	88.75	130	221.62
0.1	0.7	94.03	133	227.71
0.1	0.8	88.46	137	232.04
0.1	0.9	93.53	128	220.06
0.2	0.1	177.67	132	251.3
0.2	0.2	87.69	130	221.31
0.2	0.3	89.8	133	226.44
0.2	0.4	91.86	137	233.06
0.2	0.5	90.19	132	225.06
0.2	0.6	87.91	136	230.37
0.2	0.7	84.63	130	220.39
0.2	0.8	82.85	127	215.35
0.2	0.9	79.41	134	224.82
0.3	0.1	150.4	135	247.62
0.3	0.2	110.21	128	225.06
0.3	0.3	93.36	132	226.01
0.3	0.4	89.08	131	223.22
0.3	0.5	88.46	134	227.54
0.3	0.6	86.68	136	230.0
0.3	0.7	83.63	137	230.59
0.3	0.8	85.29	132	223.59
0.3	0.9	84.02	138	232.21
0.4	0.1	146.79	131	240.54
0.4	0.2	96.47	131	225.44
0.4	0.3	92.59	129	221.28
0.4	0.4	86.3	131	222.39
0.4	0.5	82.79	132	222.84
0.4	0.6	79.79	129	217.44
0.4	0.7	85.85	134	226.75
0.4	0.8	82.24	134	225.67
0.4	0.9	85.46	130	220.64
0.5	0.1	107.37	129	225.71
0.5	0.2	136.49	141	252.45
0.5	0.3	98.47	139	238.04
0.5	0.4	90.13	125	214.54
0.5	0.5	89.08	131	223.22
0.5	0.6	88.8	135	229.14
0.5	0.7	84.52	129	218.86
0.5	0.8	87.63	137	231.79
0.5	0.9	82.35	131	221.2
0.6	0.1	114.65	135	236.9
0.6	0.2	103.65	128	223.1
0.6	0.3	98.53	132	227.56
0.6	0.4	97.53	135	231.76
0.6	0.5	88.41	134	227.52
0.6	0.6	87.91	132	224.37
0.6	0.7	84.96	133	224.99
0.6	0.8	80.07	135	226.52
0.6	0.9	80.79	130	219.24
0.7	0.1	159.01	135	250.2
0.7	0.2	93.75	135	230.62
0.7	0.3	103.14	127	221.44
0.7	0.4	100.87	137	235.76
0.7	0.5	80.57	131	220.67
0.7	0.6	80.18	128	216.05
0.7	0.7	81.79	134	225.54
0.7	0.8	87.52	133	225.76
0.7	0.9	90.46	134	228.14
0.8	0.1	129.38	131	235.31
0.8	0.2	112.38	132	231.71
0.8	0.3	100.2	130	225.06
0.8	0.4	104.03	136	235.21
0.8	0.5	82.46	133	224.24
0.8	0.6	85.52	135	228.16
0.8	0.7	82.79	128	216.84
0.8	0.8	79.74	133	223.42
0.8	0.9	80.41	137	229.62
0.9	0.1	111.77	134	234.53
0.9	0.2	84.35	126	214.3
0.9	0.3	94.69	136	232.41
0.9	0.4	96.92	128	221.07
0.9	0.5	91.69	133	227.01
0.9	0.6	84.91	133	224.97
0.9	0.7	84.63	135	227.89
0.9	0.8	83.02	128	216.91
0.9	0.9	91.25	130	222.37
