0.2	1.0	6	9.3
0.2	18.95	35	58.19
0.2	68.37	72	128.51
0.2	135.98	136	244.8
0.2	174.69	177	317.91
0.2	334.71	263	494.91
0.2	429.17	391	715.25
0.2	613.66	506	943.1
0.2	757.41	616	1151.22
0.2	1015.46	743	1419.14
0.2	1230.41	799	1567.62
0.2	1416.31	1029	1968.39
0.2	1754.64	1225	2363.89
0.2	2041.88	1366	2661.56
0.2	2288.34	1533	2986.0
0.2	2590.21	1714	3348.06
0.2	3048.22	1946	3833.47
0.2	3335.25	2141	4212.08
0.2	3724.84	2339	4625.95
0.2	4080.77	2560	5064.23
