0.2	0.5	6	9.15
0.2	30.75	36	63.22
0.2	58.59	77	133.08
0.2	154.33	141	257.8
0.2	233.83	209	383.65
0.2	330.64	269	502.69
0.2	443.53	338	640.06
0.2	618.74	506	944.62
0.2	869.93	555	1093.48
0.2	937.98	756	1415.39
0.2	1188.43	882	1679.53
0.2	1433.26	1041	1991.48
0.2	1681.59	1204	2310.48
0.2	2007.83	1384	2678.35
0.2	2244.26	1324	2659.28
0.2	2549.37	1738	3371.81
0.2	2896.04	1951	3795.31
0.2	3393.92	1847	3788.67
0.2	3662.71	2327	4589.31
0.2	4142.29	2571	5099.19
