0.2	3.11	6	9.93
0.2	18.57	35	58.07
0.2	72.6	73	131.28
0.2	157.17	122	230.15
0.2	221.99	210	381.6
0.2	323.99	283	521.7
0.2	436.27	407	741.38
0.2	535.1	497	906.03
0.2	752.95	614	1146.88
0.2	1027.15	751	1434.64
0.2	1179.33	761	1495.3
0.2	1477.0	913	1812.6
0.2	1695.41	1224	2344.62
0.2	1949.66	1366	2633.9
0.2	2269.68	1549	3004.4
0.2	2630.61	1742	3402.18
0.2	2993.03	1945	3815.41
0.2	3291.07	2112	4155.32
0.2	3745.72	2074	4234.72
0.2	4221.77	2602	5169.53
