0.6	0	6	9.0
0.6	20.12	35	58.54
0.6	64.59	77	134.88
0.6	110.78	141	244.73
0.6	240.84	211	388.75
0.6	335.12	298	547.54
0.6	475.7	390	727.71
0.6	633.49	509	953.55
0.6	856.21	633	1206.36
0.6	987.92	768	1448.38
0.6	1207.76	914	1733.33
0.6	1420.36	1074	2037.11
0.6	1673.2	1243	2366.46
0.6	2035.42	1407	2721.13
0.6	2287.84	1605	3093.85
0.6	2503.03	1795	3443.41
0.6	2999.97	2005	3907.49
0.6	3350.37	2232	4353.11
0.6	3696.41	2453	4788.42
0.6	4137.44	2686	5270.23
