0
0
0
0
0
0
0
0
0
0
726.4
0
0
580.0
665.0
508.67
237.0
39.19
82.22
0
0
0
0
0
0
0
0
0
0
0
0
0
864.0
400.83
868.0
250.67
81.54
117.12
0
0
0
0
0
0
0
0
0
0
0
0
0
511.0
262.0
338.87
233.43
111.83
67.5
0
0
0
0
0
0
0
0
0
0
0
0
0
0
220.8
0
278.4
114.45
39.19
0
0
0
0
0
0
0
0
0
0
0
0
1242.5
712.5
0
239.0
302.08
273.0
113.75
0
0
0
0
0
0
0
0
0
0
0
0
0
0
601.75
0
274.67
132.0
39.27
0
0
0
0
0
0
0
0
0
0
0
0
452.25
0
233.43
0
145.57
312.5
39.19
0
0
0
0
0
0
0
0
0
0
0
0
0
0
572.75
403.87
311.25
114.1
66.82
0
0
0
0
0
0
0
0
0
0
0
0
0
1053.0
311.25
444.86
209.3
152.78
84.0
0
0
0
0
0
0
0
0
0
0
0
0
0
613.83
0
244.8
296.67
166.83
82.86
0
0
0
0
0
0
0
0
0
0
0
0
585.8
541.33
275.43
367.25
276.0
205.85
81.43
0
0
0
0
0
0
0
0
0
0
0
0
0
754.33
368.33
0
0
198.95
61.43
0
0
0
0
0
0
0
0
0
0
0
0
0
541.33
0
0
302.08
194.95
100.0
0
0
0
0
0
0
0
0
0
0
374.83
0
0
223.43
296.67
251.0
285.0
304.17
68.33
0
0
0
0
0
0
0
0
0
0
0
0
0
0
604.17
325.0
309.17
81.67
69.17
0
0
0
0
0
0
0
0
0
0
0
785.33
0
0
0
436.5
236.0
288.0
230.0
0
0
0
0
0
0
0
0
0
0
0
0
0
752.0
527.33
492.33
177.69
141.9
61.25
0
0
0
0
0
0
0
0
0
0
0
0
0
0
629.3
117.12
266.67
150.94
18.0
0
0
0
0
0
0
0
0
0
0
0
0
0
495.6
0
364.0
157.67
259.43
66.82
0
0
0
0
0
0
0
0
0
0
0
0
0
494.67
687.5
0
236.23
81.33
18.0
0
0
0
0
0
0
0
0
0
0
0
0
0
0
316.67
420.75
268.0
177.87
66.67
0
0
0
0
0
0
0
0
0
0
0
0
0
550.67
450.0
207.0
160.81
177.69
86.67
0
0
0
0
0
0
0
0
0
0
0
0
0
0
0
274.67
0
137.89
165.0
0
0
0
0
0
0
0
0
0
0
0
379.17
0
0
236.8
186.88
318.75
117.83
40.11
0
0
0
0
0
0
0
0
0
0
0
0
0
0
349.7
447.75
138.11
81.43
161.15
0
0
0
0
0
0
0
0
0
0
0
0
0
570.33
0
436.5
264.8
113.75
122.5
0
0
0
0
0
0
0
0
0
0
0
0
0
626.2
423.0
0
44.33
107.62
68.48
0
0
0
0
0
0
0
0
0
0
0
0
0
0
468.83
388.7
268.8
163.53
82.86
0
0
0
0
0
0
0
0
0
0
0
0
0
0
248.0
350.0
300.0
101.0
81.33
0
0
0
0
0
0
0
0
0
0
0
0
0
635.5
712.5
335.83
191.47
128.33
44.33
0
0
0
0
0
0
0
0
0
0
0
0
0
459.0
406.25
166.2
127.75
240.0
39.73
0
0
0
0
0
0
0
0
0
0
0
0
0
582.42
361.83
313.33
298.75
165.73
18.0
0
0
0
0
0
0
0
0
0
0
0
0
0
616.25
377.87
0
297.92
164.48
18.0
0
0
0
0
0
0
0
0
0
0
0
864.0
0
0
570.33
595.47
185.92
205.08
40.71
0
0
0
0
0
0
0
0
0
0
0
0
0
0
268.75
618.67
149.81
128.33
40.11
0
0
0
0
0
0
0
0
0
0
0
0
0
0
351.0
0
0
290.67
117.25
0
0
0
0
0
0
0
0
0
0
0
0
957.0
450.9
452.25
374.83
0
204.54
114.33
0
0
0
0
0
0
0
0
0
0
0
0
0
273.75
690.0
0
300.83
162.25
83.33
0
0
0
0
0
0
0
0
0
0
0
0
0
616.25
463.5
444.86
162.07
81.43
130.2
0
0
0
0
0
0
0
0
0
0
0
0
0
604.17
0
434.25
459.9
112.0
47.5
0
0
0
0
0
0
0
0
0
0
0
0
700.0
545.0
374.83
0
266.18
114.1
127.62
0
0
0
0
0
0
0
0
0
0
0
0
0
792.0
0
248.8
192.43
217.54
80.0
0
0
0
0
0
0
0
0
0
0
0
0
0
0
0
160.84
341.67
161.33
67.0
0
0
0
0
0
0
0
0
0
0
0
0
0
864.0
629.3
256.8
236.0
96.41
65.83
0
0
0
0
0
0
0
0
0
0
0
0
0
420.0
525.0
238.0
0
209.09
65.82
0
0
0
0
0
0
0
0
0
0
0
0
390.87
570.33
0
435.86
263.0
162.25
168.14
0
0
0
0
0
0
0
0
0
0
0
0
0
0
452.25
205.08
406.71
57.0
82.5
0
0
0
0
0
0
0
0
0
0
0
0
0
362.7
255.0
325.83
252.0
176.0
39.58
0
0
0
0
0
0
0
0
0
0
0
0
655.0
0
616.25
588.5
216.97
207.0
18.0
0
0
0
0
0
0
0
0
0
0
0
0
0
623.5
1266.0
509.6
222.33
232.09
84.0
0
0
0
0
0
0
0
0
0
0
0
0
0
419.4
604.17
546.0
273.0
101.0
101.03
0
0
0
0
0
0
0
0
0
0
0
0
449.36
0
377.87
0
178.44
220.8
82.86
0
0
0
0
0
0
0
0
0
0
0
0
0
0
527.33
408.2
178.75
115.0
70.67
0
0
0
0
0
0
0
0
0
0
0
0
0
0
712.5
333.33
374.83
161.94
65.36
0
0
0
0
0
0
0
0
0
0
0
0
0
0
300.0
395.2
313.33
220.8
44.33
0
0
0
0
0
0
0
0
0
0
0
0
0
504.93
367.71
398.25
367.25
118.12
82.86
0
0
0
0
0
0
0
0
0
0
0
0
0
416.25
0
341.67
72.22
39.9
0
0
0
0
0
0
0
0
0
0
0
0
0
492.33
532.5
377.0
456.75
220.59
112.58
42.75
0
0
0
0
0
0
0
0
0
0
0
0
0
0
0
0
0
146.67
157.67
0
0
0
0
0
0
0
0
0
0
0
0
0
0
596.92
113.25
41.17
263.0
40.71
0
0
0
0
0
0
0
0
0
0
0
0
0
677.5
622.81
423.9
100.62
164.83
38.0
0
0
0
0
0
0
0
0
0
0
0
715.0
0
862.83
595.47
214.12
393.25
164.48
126.5
0
0
0
0
0
0
0
0
0
0
0
0
0
270.83
0
337.5
156.2
82.5
41.17
0
0
0
0
0
0
0
0
0
0
0
0
0
0
553.0
0
322.5
154.0
111.53
0
0
0
0
0
0
0
0
0
0
0
0
0
0
480.67
240.0
0
205.08
117.83
0
0
0
0
0
0
0
0
0
0
0
0
0
0
191.12
0
117.6
0
117.41
0
0
0
0
0
0
0
0
0
0
0
0
464.4
379.42
450.0
418.5
363.38
207.0
117.6
0
0
0
0
0
0
0
0
0
0
0
0
0
0
261.6
377.0
106.91
110.63
18.0
0
0
0
0
0
0
0
0
0
0
0
0
0
534.33
443.25
308.33
103.83
76.67
81.43
0
0
0
0
0
0
0
0
0
0
0
0
0
351.0
490.0
613.83
203.93
163.17
71.82
0
0
0
0
0
0
0
0
0
0
0
0
504.93
419.4
459.9
0
242.4
217.22
39.46
0
0
0
0
0
0
0
0
0
0
0
0
990.0
896.0
0
143.0
351.87
194.54
73.33
0
0
0
0
0
0
0
0
0
0
0
0
901.0
0
501.67
461.25
206.45
65.0
70.0
0
0
0
0
0
0
0
0
0
0
0
0
0
0
0
182.47
235.0
214.67
39.58
0
0
0
0
0
0
0
0
0
0
0
0
800.83
648.83
0
310.42
258.0
204.7
18.0
0
0
0
0
0
0
0
0
0
0
0
0
0
0
0
324.4
133.83
112.16
203.39
0
0
0
0
0
0
0
0
0
0
0
522.67
0
0
0
244.0
260.8
147.0
112.7
0
0
0
0
0
0
0
0
0
0
0
0
1006.5
0
0
270.83
251.43
146.67
81.67
0
0
0
0
0
0
0
0
0
0
0
0
1110.67
0
594.5
140.25
293.75
156.0
38.0
0
0
0
0
0
0
0
0
0
0
0
0
0
240.8
0
232.88
187.0
114.1
18.0
0
0
0
0
0
0
0
0
0
0
0
0
700.0
0
0
374.83
250.0
145.75
39.9
0
0
0
0
0
0
0
0
0
0
0
0
0
0
589.67
432.0
226.0
38.0
41.17
0
0
0
0
0
0
0
0
0
0
0
0
0
629.33
340.62
398.67
254.0
115.5
68.0
0
0
0
0
0
0
0
0
0
1342.67
0
0
733.83
0
0
267.0
217.35
150.94
81.67
0
0
0
0
0
0
0
0
0
0
0
0
0
0
570.33
452.25
0
179.21
40.71
0
0
0
0
0
0
0
0
0
0
0
0
0
0
525.0
423.9
118.12
114.33
129.0
0
0
0
0
0
0
0
0
0
0
0
0
760.0
562.5
0
357.5
238.67
102.2
113.91
0
0
0
0
0
0
0
0
0
0
0
0
0
880.0
513.33
316.67
196.27
198.95
0
0
0
0
0
0
0
0
0
0
0
0
0
0
0
394.33
293.75
161.94
47.5
139.5
0
0
0
0
0
0
0
0
0
0
0
0
710.0
258.8
366.17
0
259.43
0
85.0
0
0
0
0
0
0
0
0
0
0
0
0
0
331.5
432.0
237.43
214.47
140.64
65.82
0
0
0
0
0
0
0
0
0
0
0
0
0
0
462.38
251.43
168.67
68.67
119.0
0
0
0
0
0
0
0
0
0
0
0
0
604.17
0
492.33
328.57
0
0
85.0
0
0
0
0
0
0
0
0
0
0
0
0
506.33
0
604.17
374.4
240.0
80.0
117.12
0
0
0
0
0
0
0
0
0
0
0
0
0
359.67
312.5
630.75
217.54
69.52
81.82
0
0
0
0
0
0
0
0
0
0
0
0
0
454.5
0
316.07
130.53
117.41
82.86
0
0
0
0
0
0
0
0
0
0
0
0
0
525.0
495.6
221.79
144.83
152.78
39.46
0
0
0
0
0
0
0
0
0
0
0
0
0
311.25
0
0
447.75
267.43
82.0
0
0
0
0
0
0
0
0
0
0
0
0
0
0
361.83
537.6
150.94
202.62
111.3
0
0
0
0
0
0
0
0
0
0
0
0
811.17
471.15
0
388.7
334.17
117.6
139.15
