0.05	91.55	138	234.46
0.1	117.69	140	245.31
0.15	127.7	140	248.31
0.2	148.11	137	249.93
0.25	162.72	125	236.32
0.3	165.5	129	243.15
0.35	161.66	127	239.0
0.4	193.02	135	260.41
0.45	202.7	129	254.31
0.5	206.42	137	267.43
0.55	205.58	131	258.17
0.6	261.34	123	262.9
0.65	252.92	129	269.38
0.7	283.67	121	266.6
0.75	283.44	121	266.53
0.8	317.27	116	269.18
0.85	330.44	117	274.63
0.9	376.64	105	270.49
0.95	408.66	101	274.1
