0.05	65.03	129	213.01
0.1	85.15	119	204.05
0.15	140.48	120	222.15
0.2	120.57	138	243.17
0.25	142.59	125	230.28
0.3	161.45	124	234.43
0.35	187.24	127	246.67
0.4	182.24	140	264.67
0.45	204.03	135	263.71
0.5	223.09	136	270.93
0.55	230.66	128	261.2
0.6	235.61	132	268.68
0.65	274.27	119	260.78
0.7	291.06	118	264.32
0.75	288.16	124	272.45
0.8	324.92	116	271.48
0.85	356.4	111	273.42
0.9	369.86	107	271.46
0.95	394.0	101	269.7
