0.05	79.82	139	232.45
0.1	145.22	118	220.57
0.15	105.73	140	241.72
0.2	113.12	139	242.43
0.25	151.05	141	256.82
0.3	156.45	136	250.93
0.35	187.63	130	251.29
0.4	191.41	138	264.42
0.45	188.84	137	262.15
0.5	198.85	131	256.16
0.55	229.6	122	251.88
0.6	243.61	126	262.08
0.65	273.62	123	266.59
0.7	285.88	120	265.76
0.75	283.56	123	269.57
0.8	314.06	117	269.72
0.85	337.93	114	272.38
0.9	375.48	108	274.64
0.95	421.44	99	274.93
