0.2	2.5	6	9.75
0.2	26.96	34	59.09
0.2	38.91	80	131.67
0.2	149.44	135	247.33
0.2	220.03	212	384.01
0.2	308.31	302	545.49
0.2	456.34	395	729.4
0.2	620.68	486	915.21
0.2	804.36	619	1169.81
0.2	958.9	757	1423.17
0.2	1200.34	890	1695.1
0.2	1478.93	1048	2015.68
0.2	1742.1	1196	2316.63
0.2	1963.13	1369	2642.44
0.2	2381.65	1346	2733.49
0.2	2608.52	1700	3332.56
0.2	2954.89	1687	3416.97
0.2	3327.47	2137	4203.74
0.2	3589.93	2372	4634.98
0.2	4089.08	2234	4577.72
