0.05	53.57	144	232.07
0.1	84.99	139	234.0
0.15	122.53	137	242.26
0.2	145.81	133	243.24
0.25	164.34	134	250.3
0.3	156.49	138	253.95
0.35	198.98	134	260.69
0.4	161.71	140	258.51
0.45	204.3	136	265.29
0.5	196.46	135	261.44
0.55	226.98	129	261.59
0.6	238.03	125	258.91
0.65	252.71	128	267.81
0.7	278.29	122	266.49
0.75	281.72	124	270.52
0.8	352.77	109	269.33
0.85	362.49	106	267.75
0.9	369.09	111	277.23
0.95	417.1	99	273.63
