0.2	7.73	6	11.32
0.2	33.19	28	51.96
0.2	91.34	61	118.9
0.2	136.29	112	208.89
0.2	259.81	172	335.94
0.2	301.21	234	441.36
0.2	483.02	313	614.41
0.2	570.53	399	769.66
0.2	826.83	475	960.55
0.2	899.36	576	1133.81
0.2	1163.73	675	1361.62
0.2	1335.56	795	1593.17
0.2	1571.22	912	1839.37
0.2	1877.41	1055	2145.72
0.2	2141.42	1164	2388.43
0.2	2416.77	1300	2675.03
0.2	2854.39	1443	3020.82
0.2	3107.96	1604	3338.39
0.2	3481.11	1761	3685.83
0.2	3705.53	1958	4048.66
