0.05	100.32	99	178.6
0.1	107.61	103	186.78
0.15	120.06	106	195.02
0.2	123.84	113	206.65
0.25	136.59	114	211.98
0.3	168.72	118	227.62
0.35	137.63	120	221.29
0.4	180.61	119	232.68
0.45	205.56	117	237.17
0.5	202.62	117	236.29
0.55	246.47	117	249.44
0.6	237.96	114	242.39
0.65	318.43	111	262.03
0.7	312.75	110	258.83
0.75	323.92	111	263.68
0.8	341.68	113	272.01
0.85	355.29	115	279.09
0.9	387.73	104	272.32
0.95	383.89	107	275.67
