0.6	1.0	6	9.3
0.6	16.28	36	58.88
0.6	71.14	78	138.34
0.6	130.46	141	250.64
0.6	171.87	215	374.06
0.6	314.55	301	545.87
0.6	432.94	404	735.88
0.6	565.24	516	943.57
0.6	692.74	637	1163.32
0.6	946.22	764	1429.86
0.6	1155.66	921	1728.2
0.6	1564.26	1070	2074.28
0.6	1627.6	1241	2349.78
0.6	1994.07	1420	2728.22
0.6	2304.44	1604	3097.33
0.6	2669.6	1799	3499.38
0.6	2962.84	2004	3894.85
0.6	3352.74	2226	4344.82
0.6	3683.74	2445	4772.62
0.6	4102.83	2689	5264.35
