0.2	7.73	6	11.32
0.2	25.74	26	46.72
0.2	90.84	63	121.75
0.2	124.73	114	208.42
0.2	227.14	161	309.64
0.2	290.59	229	430.68
0.2	489.95	308	608.99
0.2	549.47	384	740.84
0.2	765.87	484	955.76
0.2	889.38	588	1148.81
0.2	1188.78	681	1378.13
0.2	1313.28	786	1572.98
0.2	1610.9	898	1830.27
0.2	1772.78	1045	2099.33
0.2	2141.13	1172	2400.34
0.2	2410.52	1316	2697.16
0.2	2918.71	1441	3037.11
0.2	3029.41	1603	3313.32
0.2	3515.96	1771	3711.29
0.2	3667.72	1934	4001.32
