0.1	0.1	197.29	129	252.69
0.1	0.2	139.45	130	236.83
0.1	0.3	113.81	135	236.64
0.1	0.4	84.79	132	223.44
0.1	0.5	84.58	131	221.87
0.1	0.6	84.68	129	218.9
0.1	0.7	85.13	131	222.04
0.1	0.8	83.24	131	221.47
0.1	0.9	90.46	129	220.64
0.2	0.1	129.44	124	224.83
0.2	0.2	97.03	136	233.11
0.2	0.3	108.93	133	232.18
0.2	0.4	90.86	131	223.76
0.2	0.5	80.24	135	226.57
0.2	0.6	82.41	130	219.72
0.2	0.7	85.02	130	220.51
0.2	0.8	90.19	128	219.06
0.2	0.9	87.08	128	218.12
0.3	0.1	155.41	137	252.12
0.3	0.2	96.19	128	220.86
0.3	0.3	89.08	130	221.72
0.3	0.4	89.75	132	224.92
0.3	0.5	92.8	132	225.84
0.3	0.6	84.91	128	217.47
0.3	0.7	83.29	135	227.49
0.3	0.8	88.35	134	227.5
0.3	0.9	80.24	131	220.57
0.4	0.1	111.1	135	235.83
0.4	0.2	166.56	131	246.47
0.4	0.3	98.13	133	228.94
0.4	0.4	86.58	131	222.47
0.4	0.5	95.08	136	232.52
0.4	0.6	87.79	131	222.84
0.4	0.7	82.74	130	219.82
0.4	0.8	81.29	133	223.89
0.4	0.9	86.63	132	223.99
0.5	0.1	111.76	131	230.03
0.5	0.2	110.21	138	240.06
0.5	0.3	89.69	131	223.41
0.5	0.4	99.53	133	229.36
0.5	0.5	89.58	132	224.87
0.5	0.6	84.63	137	230.89
0.5	0.7	79.07	132	221.72
0.5	0.8	83.08	131	221.42
0.5	0.9	82.24	126	213.67
0.6	0.1	135.11	132	238.53
0.6	0.2	120.37	137	241.61
0.6	0.3	97.59	135	231.78
0.6	0.4	90.19	133	226.56
0.6	0.5	88.25	134	227.47
0.6	0.6	83.29	129	218.49
0.6	0.7	89.36	133	226.31
0.6	0.8	87.52	136	230.26
0.6	0.9	78.74	137	229.12
0.7	0.1	113.1	132	231.93
0.7	0.2	94.92	133	227.97
0.7	0.3	89.69	137	232.41
0.7	0.4	86.58	129	219.47
0.7	0.5	85.91	135	228.27
0.7	0.6	86.58	137	231.47
0.7	0.7	84.52	131	221.86
0.7	0.8	81.68	134	225.5
0.7	0.9	83.41	131	221.52
0.8	0.1	108.87	133	232.16
0.8	0.2	102.14	130	225.64
0.8	0.3	90.75	134	228.22
0.8	0.4	91.25	130	222.37
0.8	0.5	87.41	128	218.22
0.8	0.6	93.36	134	229.01
0.8	0.7	81.74	137	230.02
0.8	0.8	79.46	134	224.84
0.8	0.9	83.41	137	230.52
0.9	0.1	82.12	134	225.64
0.9	0.2	125.66	139	246.2
0.9	0.3	98.59	133	229.08
0.9	0.4	98.14	135	231.94
0.9	0.5	82.85	126	213.85
0.9	0.6	86.46	132	223.94
0.9	0.7	78.41	132	221.52
0.9	0.8	82.41	134	225.72
0.9	0.9	86.25	134	226.87
