0.2	7.73	6	11.32
0.2	30.68	28	51.2
0.2	95.62	65	126.18
0.2	123.67	109	200.6
0.2	235.14	168	322.54
0.2	288.92	226	425.68
0.2	488.33	299	595.0
0.2	572.29	396	765.69
0.2	790.95	474	948.28
0.2	955.11	578	1153.53
0.2	1150.99	670	1350.3
0.2	1347.83	797	1599.85
0.2	1678.38	918	1880.51
0.2	1840.57	1025	2089.67
0.2	2221.04	1141	2377.81
0.2	2332.31	1316	2673.69
0.2	2871.13	1442	3024.34
0.2	2970.89	1604	3297.27
0.2	3528.06	1749	3681.92
0.2	3688.05	1920	3986.42
