0.05	107.22	110	197.17
0.1	112.89	106	192.87
0.15	128.18	112	206.45
0.2	135.58	112	208.67
0.25	143.8	109	206.64
0.3	162.93	120	228.88
0.35	184.94	118	232.48
0.4	164.47	121	230.84
0.45	198.89	118	236.67
0.5	200.06	123	244.52
0.55	261.74	116	252.52
0.6	288.53	119	265.06
0.65	295.08	114	259.52
0.7	304.47	112	259.34
0.75	322.49	112	264.75
0.8	346.01	111	270.3
0.85	335.51	114	271.65
0.9	381.96	106	273.59
0.95	401.28	102	273.38
