0.05	75.48	140	232.64
0.1	105.68	143	246.2
0.15	114.74	133	233.92
0.2	138.97	137	247.19
0.25	133.98	140	250.2
0.3	176.13	137	258.34
0.35	170.79	140	261.24
0.4	206.76	129	255.53
0.45	198.92	130	254.68
0.5	212.76	123	248.33
0.55	224.82	129	260.94
0.6	235.52	124	256.66
0.65	261.32	125	265.89
0.7	253.49	125	263.55
0.75	288.2	122	269.46
0.8	292.77	117	263.33
0.85	349.11	113	274.23
0.9	382.58	103	269.27
0.95	424.82	95	269.95
