0.05	65.48	137	225.14
0.1	122.46	117	212.24
0.15	117.4	121	216.72
0.2	118.68	135	238.1
0.25	120.63	139	244.69
0.3	162.39	126	237.72
0.35	151.65	136	249.5
0.4	170.28	134	252.08
0.45	182.9	130	249.87
0.5	195.9	130	253.77
0.55	216.25	132	262.88
0.6	242.0	125	260.1
0.65	247.94	126	263.38
0.7	289.73	122	269.92
0.75	276.37	124	268.91
0.8	323.04	112	264.91
0.85	342.43	117	278.23
0.9	387.58	103	270.77
0.95	396.78	102	272.03
