0.05	0	100	150.0
0.1	1.5	117	175.95
0.15	1.0	117	175.8
0.2	10.67	131	199.7
0.25	7.11	128	194.13
0.3	22.01	134	207.6
0.35	20.28	131	202.58
0.4	42.74	137	218.32
0.45	47.52	141	225.76
0.5	51.97	141	227.09
0.55	106.33	142	244.9
0.6	159.3	137	253.29
0.65	164.3	140	259.29
0.7	201.94	129	254.08
0.75	247.34	129	267.7
0.8	260.56	128	270.17
0.85	325.02	116	271.51
0.9	365.44	111	276.13
0.95	399.28	102	272.78
