0.9	0.9	1.5	6	9.45
0.9	0.9	13.67	32	52.1
0.9	0.9	46.4	73	123.42
0.9	0.9	86.8	132	224.04
0.9	0.9	148.81	200	344.64
0.9	0.9	209.27	278	479.78
0.9	0.9	301.12	359	628.83
0.9	0.9	385.3	474	826.59
0.9	0.9	524.84	573	1016.95
0.9	0.9	633.1	702	1242.93
0.9	0.9	781.56	817	1459.97
0.9	0.9	896.53	970	1723.96
0.9	0.9	1110.05	1103	1987.51
0.9	0.9	1234.27	1265	2267.78
0.9	0.9	1476.83	1422	2576.05
0.9	0.9	1648.71	1604	2900.61
0.9	0.9	1912.68	1772	3231.8
0.9	0.9	2090.38	1989	3610.61
0.9	0.9	2373.26	2149	3935.48
0.9	0.9	2585.27	2362	4318.58
