0.2	4.0	6	10.2
0.2	30.96	29	52.79
0.2	65.21	80	139.56
0.2	137.7	138	248.31
0.2	232.36	187	350.21
0.2	344.5	268	505.35
0.2	429.1	401	730.23
0.2	607.94	501	933.88
0.2	777.32	544	1049.2
0.2	992.42	735	1400.23
0.2	1200.7	755	1492.71
0.2	1492.55	1050	2022.77
0.2	1812.59	1065	2141.28
0.2	1923.38	1390	2662.01
0.2	2358.42	1552	3035.53
0.2	2593.35	1492	3016.01
0.2	3014.12	1678	3421.23
0.2	3501.89	1848	3822.57
0.2	3689.04	2349	4630.21
0.2	4187.64	2590	5141.29
