0.05	0.5	101	151.65
0.1	1.5	110	165.45
0.15	7.11	122	185.13
0.2	2.5	127	191.25
0.25	9.06	130	197.72
0.3	18.73	140	215.62
0.35	30.07	139	217.52
0.4	37.35	136	215.2
0.45	60.97	139	226.79
0.5	62.8	142	231.84
0.55	119.62	139	244.38
0.6	117.29	139	243.69
0.65	146.13	134	244.84
0.7	226.45	132	265.93
0.75	232.57	128	261.77
0.8	303.1	123	275.43
0.85	329.56	114	269.87
0.9	339.63	113	271.39
0.95	410.66	100	273.2
