0.05	98.32	99	178.0
0.1	117.12	104	191.13
0.15	129.18	106	197.75
0.2	163.59	110	214.08
0.25	137.96	110	206.39
0.3	167.98	115	222.9
0.35	192.01	118	234.6
0.4	194.95	116	232.48
0.45	212.4	117	239.22
0.5	239.07	120	251.72
0.55	216.83	117	240.55
0.6	236.69	120	251.01
0.65	306.84	112	260.05
0.7	284.98	118	262.49
0.75	310.52	111	259.66
0.8	300.84	116	264.25
0.85	356.86	106	266.06
0.9	388.88	103	271.16
0.95	414.14	100	274.24
