0.05	0	100	150.0
0.1	0	115	172.5
0.15	0.5	119	178.65
0.2	8.06	126	191.42
0.25	7.61	132	200.28
0.3	15.17	135	207.05
0.35	36.63	139	219.49
0.4	50.25	143	229.57
0.45	71.2	141	232.86
0.5	69.86	141	232.46
0.55	78.6	142	236.58
0.6	143.91	141	254.67
0.65	163.97	135	251.69
0.7	217.62	132	263.29
0.75	241.22	130	267.37
0.8	263.46	128	271.04
0.85	313.86	115	266.66
0.9	330.37	111	265.61
0.95	402.81	99	269.34
