0.2	4.67	6	10.4
0.2	21.62	37	61.99
0.2	57.75	68	119.32
0.2	143.65	138	250.1
0.2	205.58	212	379.67
0.2	304.74	296	535.42
0.2	447.55	349	657.76
0.2	618.57	495	928.07
0.2	812.26	611	1160.18
0.2	926.08	753	1407.32
0.2	1171.06	881	1672.82
0.2	1492.43	927	1838.23
0.2	1689.37	1185	2284.31
0.2	1980.82	1352	2622.25
0.2	2346.74	1556	3038.02
0.2	2680.98	1732	3402.29
0.2	2928.24	1668	3380.47
0.2	3388.11	1845	3783.93
0.2	3616.19	2336	4588.86
0.2	4074.52	2555	5054.85
