0.6	2.5	6	9.75
0.6	20.74	35	58.72
0.6	60.59	79	136.68
0.6	122.29	139	245.19
0.6	206.61	216	385.98
0.6	289.83	301	538.45
0.6	463.79	399	737.64
0.6	653.26	502	948.98
0.6	860.4	627	1198.62
0.6	915.72	771	1431.21
0.6	1088.44	917	1702.03
0.6	1448.57	1072	2042.57
0.6	1671.46	1239	2359.94
0.6	1985.91	1412	2713.77
0.6	2238.12	1607	3081.94
0.6	2574.99	1807	3483.0
0.6	2887.08	2013	3885.62
0.6	3234.02	2229	4313.71
0.6	3605.45	2449	4755.14
0.6	3964.33	2685	5216.8
