0.9	0.9	1.0	6	9.3
0.9	0.9	17.67	32	53.3
0.9	0.9	47.57	75	126.77
0.9	0.9	92.52	137	233.26
0.9	0.9	155.31	197	342.09
0.9	0.9	201.94	271	467.08
0.9	0.9	312.13	370	648.64
0.9	0.9	386.13	469	819.34
0.9	0.9	503.06	577	1016.42
0.9	0.9	614.09	696	1228.23
0.9	0.9	774.68	823	1466.9
0.9	0.9	898.66	963	1714.1
0.9	0.9	1102.77	1103	1985.33
0.9	0.9	1246.94	1260	2264.08
0.9	0.9	1469.33	1417	2566.3
0.9	0.9	1642.66	1612	2910.8
0.9	0.9	1860.92	1766	3207.28
0.9	0.9	2085.33	1969	3579.1
0.9	0.9	2379.85	2139	3922.46
0.9	0.9	2588.77	2371	4333.13
