0.2	7.73	6	11.32
0.2	32.25	28	51.67
0.2	92.17	64	123.65
0.2	122.84	109	200.35
0.2	229.13	166	317.74
0.2	297.54	231	435.76
0.2	447.03	306	593.11
0.2	539.6	392	749.88
0.2	769.07	480	950.72
0.2	941.9	594	1173.57
0.2	1184.53	679	1373.86
0.2	1277.32	794	1574.19
0.2	1620.04	893	1825.51
0.2	1792.46	1017	2063.24
0.2	2151.16	1174	2406.35
0.2	2426.34	1302	2680.9
0.2	2922.41	1472	3084.72
0.2	3074.47	1597	3317.84
0.2	3494.7	1769	3701.91
0.2	3925.04	1923	4062.01
