#include <Adafruit_MPU6050.h>
#include <Adafruit_Sensor.h>
#include <Wire.h>
#include <math.h>

Adafruit_MPU6050 mpu;

int stepCounter;
// Variablen für den State
double gravity = 9.81;
double corr = 0; // Korrektur für winkel, falls Oberfläche nicht exakt senkrecht zur Erdbeschleunigung steht
double gyr_corr = 0.14; // Korrektur des Gyroskops für die Winkelgeschwindigkeit
double x_factor = 89.5 / 100. * 3.14 / 3200.; // um steps in m umzurechnen
double x;
double x_prev;
double x_dot;
double state[5] = {0, 0, 0, 0, 0}; // Zustandsvektor inklusive der Zeit
double prev_state[5];
const int avg = 10; // Anzahl der letzten Winkel die für Mittelwertbildung benutzt werden
double last_angles[avg];
int eps = 0;

// für Zeitmessung
unsigned long begin;
unsigned long end;
double lastTime = 0;

// Variablen für die Motorbewegung
int stepper_t = 100;
int pause = 0;

double previous_action = 0;




// Gespeicherte Gewichte und Bias der in der Simulation trainierten Netzwerke
// Für die Benutzung muss das jeweilige Netzwerk auskommentiert werden und ggf. die In- oder Output spaces angepasst werden, falls diese nicht die Größen 4 und 2 besitzen

/*  my_network_202_val_stop_8
  int n[2] = {8, 8};
  double w1[32] = {-0.394329, -1.85392, -5.66163, -1.70274, -0.45314, -1.57701, -3.48071, -0.509503, 0.144278, -0.81559, -3.11285, -1.12925, 0.219523, -0.781836, -4.13385, -0.0969096, -0.443367, -1.0335, -2.71756, -1.25434, -0.593932, -0.399697, -1.01513, -0.229069, -1.09958, -1.50656, -1.65053, -0.880978, -0.154228, -0.464267, 2.82396, 0.951617 };
  double b1[8] = {-0.0373918, -0.0872704, 1.27276, 1.23997, 0.268427, 1.08458, 0.258829, -0.485849 };
  double w2[64] = {-3.36489, -1.40692, 1.90685, 1.42651, 1.75377, 1.3458, 1.62378, -0.878022, -5.78619, -2.54527, 1.44372, 1.70346, 0.723665, 1.36829, 1.10933, -1.14389, 0.449391, -0.500445, -0.269451, -0.172145, -0.121968, -0.173428, -0.467704, -0.177409, -5.54015, -1.72185, -0.968567, -0.31402, -0.638635, 1.83437, -0.226893, -0.561329, 3.43658, 1.45586, 0.137346, 0.178967, 0.971968, -1.15557, 0.663784, 0.401702, -2.78637, -1.36146, 2.54396, 1.33739, 1.66108, 1.80956, 1.24903, -1.85514, -4.68802, -0.740025, 1.55449, 2.38849, 0.119199, 0.569037, 2.17824, -0.934254, 0.866148, 0.755987, -0.671601, 1.51774, -0.389241, -0.147535, 1.00913, 1.75961 };
  double b2[8] = {0.655596, 0.572212, 0, 1.64381, -0.431497, 0.922236, 0.287241, 0.10289 };
  double w3[16] = {2.57651, 3.67449, 0.0327508, -4.67602, -3.17545, 2.92379, 2.57718, -1.86382, 1.84502, 4.28566, 0.631537, -2.0673, -3.09789, 1.43126, 4.22428, 0.487405 };
  double b3[2] = {1.38937, -0.498334 };
*/

/* g = 10,m_c = 5, m_p = 0.1, l_p = 0.25, t = 0.0063
  int n[2] = {8, 8};
  double w1[32] = {-0.33737, 0.588551, 0.959984, 0.926795, 0.125393, 0.778316, 3.96431, 1.77003, -0.99299, -0.294492, 0.710932, 0.706185, -1.0666, 0.50757, 0.934958, 0.567828, -0.321384, -1.50467, -1.59257, -1.13391, -0.145636, -0.136943, 0.960955, 0.878745, 0.748196, 1.34891, 3.76071, 2.27683, -0.213153, 0.618737, 0.761253, 0.496649 };
  double b1[8] = {1.29218, -0.694191, 1.21482, 1.30209, -0.150378, 1.0766, 0.222053, 1.16754 };
  double w2[64] = {1.99359, -2.12825, 1.02895, 1.42249, -1.87492, 1.20417, -2.12373, 0.350757, -0.144969, -2.01607, 0.586544, 0.704084, -0.164134, -0.365493, -1.72515, 0.421239, 1.77221, -2.56039, 1.3608, 1.33778, -1.99222, 0.960888, -2.93119, 1.09662, 2.07124, -2.9421, 1.75485, 1.10632, -2.25278, 1.109, -2.67691, 1.37311, -0.651644, 0.474262, -0.689407, 0.405089, -0.287185, -0.429145, -0.181624, 0.27843, -0.0668758, 0.0562987, -0.160682, -0.204092, 0.0333852, -0.38222, -0.00940216, 0.149545, 1.68981, -2.53096, 1.00308, 1.54645, -1.06008, 0.567805, -2.8163, 1.38768, -0.256511, -0.285516, -0.0663298, 0.434685, -0.521496, -0.0252082, 0.176449, -0.591379 };
  double b2[8] = {0.691689, 0.366241, 0.879192, 0.81813, -0.185094, -0.10585, 1.1074, -0.0588433 };
  double w3[16] = {2.10018, 0.755988, 2.92121, 2.59411, -0.575936, -0.692098, 2.93684, -0.430195, 3.06649, -1.75712, 2.62482, 2.61048, 0.21735, 0.0980428, 2.65598, 0.246711 };
  double b3[2] = {0.725883, 0.662957 };
*/

/*
  //g = 10, m_c = 1, m_p = 0.1, l_p = 0.5, t = 0.04
  int n[2] = {8, 8};
  double w1[32] = {0.472442, 0.650473, -1.04621, -0.229996, -0.203872, -2.00072, -0.607471, 0.641875, -0.284396, -0.120456, -1.96952, -0.240557, -0.222159, 0.494942, 2.15191, 0.670944, 0.0822096, -1.22571, -5.43865, -1.45219, 0.0461879, 0.834477, 1.28495, 0.650391, 0.0524969, -0.395572, 1.32895, 0.379302, -0.997864, 2.13774, 6.084, 1.78343 };
  double b1[8] = {1.06023, -0.671761, 1.06412, 0.913006, -0.150269, 0.817522, 0.98601, -0.281592 };
  double w2[64] = {0.573526, -1.34259, 0.964414, 0.603013, -3.39981, 1.7884, 0.841393, -3.51283, -0.498758, -0.219745, -0.50359, -0.473336, 0.375005, 0.384561, -0.50601, 0.520469, 1.7501, -1.84818, 0.994066, -0.0751026, -3.0079, 0.568634, -0.0475459, -4.88636, 0.575461, 0.963193, -0.278989, 1.5032, -3.00921, 0.887802, 1.33472, -4.164, 0.294873, -0.993243, 0.628752, 1.32104, -2.10541, 1.31441, 1.12054, -5.38075, 1.3524, -1.67124, 0.764317, 1.07317, -3.22969, 1.14053, 0.57681, -5.11387, 1.02577, -1.03001, 1.61559, -0.433735, -2.25442, -0.357837, 0.0737117, -8.60974, 0.276359, -0.400576, -0.0056014, 1.31462, -5.65773, 0.829643, 0.067449, -2.45419 };
  double b2[8] = {0.726447, -0.0256706, 1.07959, 0.0825223, 0.85194, 0.785649, 0.624678, -0.018555 };
  double w3[16] = {2.31906, 0.538107, 4.16145, -1.51494, 2.3258, 3.69967, 3.25239, -2.61996, 2.59945, -0.287988, 0.0857468, 2.87863, 3.13266, 2.928, -2.17417, 3.88472 };
  double b3[2] = {1.06454, 1.54147 };
*/

/*
  //g = 10, m_c = 1, m_p = 0.1, l_p = 0.5, t = 0.01
  int n[2] = {8, 8};
  double w1[32] = {0.729454, 0.282204, -0.141282, -0.38067, 3.72012, -0.612661, -3.79748, -0.551665, 1.60085, -2.72594, -6.33606, -2.27655, 0.460296, 0.921298, 3.37506, 1.0791, 4.41521, 0.237267, -3.04088, -0.0218615, 1.48521, -0.193485, -2.35408, -0.666183, -1.07143, -1.2211, -1.98043, -0.516461, 1.23213, 2.09068, 5.91471, 1.67632 };
  double b1[8] = {2.09397, 1.80911, 2.70591, 2.05139, 0.842558, 2.13215, 2.4323, 0.0964817 };
  double w2[64] = {1.91056, 0.406126, 1.71251, -0.131923, 0.338383, 1.92614, 1.25164, -1.53855, 1.7953, 1.19958, 1.17683, -0.0266745, 0.475986, 1.86987, 2.1035, -2.04688, 1.83249, 1.2236, 0.904669, -0.0521735, 0.469398, 0.703132, 1.05637, -1.91743, -0.041424, 0.840414, 3.47835, -6.48507, 0.219651, 0.903723, 1.9581, -6.40381, 2.36748, 0.86328, 1.0466, 0.242329, 0.00789175, 2.01963, 1.54963, -1.20804, 2.43246, 1.22472, 0.963291, -0.193248, -0.275347, 1.44889, 1.40899, -1.51049, 0.778099, 0.103017, 2.069, 1.2352, 0.481664, 1.20222, 2.38575, -0.356815, 0.542872, 2.36672, 1.16227, -7.0465, 2.07602, 1.11158, -1.23926, -3.19707 };
  double b2[8] = {0.808897, 1.00734, 0.815461, 0.543359, 0.937697, 0.77944, 1.01247, -1.79891 };
  double w3[16] = {1.60586, 1.31667, 1.20975, -3.71389, 1.42652, 1.68712, 0.0971568, -4.78088, 1.2848, 1.17215, 0.80203, -4.02782, 1.39026, 1.02285, 1.45137, -4.91707 };
  double b3[2] = {0.526109, 0.937051 };
*/
/*
  //g = 10, m_c = 1, m_p = 0.1, l_p = 0.5, t = 0.02, start_var = 0.05
  int n[2] = {8, 8};
  double w1[32] = {0.755013, 1.11286, 2.90425, 1.32389, 2.91954, 1.6836, -0.153674, -0.977584, 0.888119, 1.00085, 1.30288, 0.602738, 1.60548, 0.466488, -0.981596, -0.130473, 1.52392, -0.0240297, 2.61333, 0.877491, -0.196619, -1.28571, -2.04251, -0.988751, 1.45099, 1.02546, 1.05623, 1.04954, -0.747656, -1.1033, -2.95202, -0.560048 };
  double b1[8] = {0.0294956, -0.38339, 1.73636, 1.23899, 2.01996, 0.718382, 2.09641, 0.858006 };
  double w2[64] = {-2.2331, -1.03, 2.25164, 2.1545, 0.313104, 1.21442, 2.27474, 0.27071, 2.47716, 0.94473, 0.972118, -1.04595, 0.896445, -3.41303, 0.72133, -3.24043, -1.3814, -1.03502, 1.44395, 1.46104, 1.62521, 0.497216, 2.55722, 0.772006, 2.06937, -0.0746399, 0.402917, -0.13116, 0.546671, -2.41229, 0.883353, -1.28872, 2.70852, -0.164283, 0.607116, -0.738349, 0.280664, -4.57417, 1.30588, -3.47894, 0.366631, -0.194877, -0.282392, -0.331949, -0.298289, -0.542432, -0.587421, -0.24172, -1.63048, -1.63699, 1.7592, 1.58142, 1.23979, 0.621755, 1.47967, 0.728013, -1.40855, 1.49729, 0.564026, 1.72934, -0.738192, 0.363325, 0.311111, 0.164188 };
  double b2[8] = {1.16989, 0.0363038, 0.988227, -0.10423, 0.0687986, 0, 1.08609, 0.578875 };
  double w3[16] = {2.37503, -3.15786, 1.02489, -2.61422, -2.04118, 0.452498, 1.68304, 1.41952, 1.79517, -2.23893, 1.52862, -1.19106, -4.06015, 0.569131, 2.37253, -1.18779 };
  double b3[2] = {0.989612, 0.564039 };
*/
/*
  // f_mag = 15
  int n[2] = {8, 8};
  double w1[32] = {-3.76652, -0.0486342, 3.43042, 0.376338, -0.0121542, -0.672402, 0.442481, -0.405913, -0.094434, 1.04057, 0.268615, -0.432055, -0.492326, 1.69984, 4.20406, 1.37531, -0.426495, -0.919995, 0.0733359, 0.544226, -0.406017, -1.15974, -4.67091, -1.02251, 0.522058, 1.52954, 1.52831, -0.701037, -0.6242, 0.571873, 0.645255, 0.177821 };
  double b1[8] = {0.136766, 1.51691, 1.50768, 0.0135924, 1.40898, 0.273657, -1.41258, 1.42226 };
  double w2[64] = {0.0709464, 0.00169433, -0.182214, -0.701435, -0.685542, 2.77703, 0.472874, -1.16374, 0.989244, 0.282726, -0.134973, 3.45145, -0.421748, 0.952076, 0.546108, -0.127449, -1.49026, 1.63978, 0.715481, -4.12859, 1.10854, -4.32414, -4.98097, 1.46373, 0.423021, -0.199174, 0.796372, 2.53196, -0.561075, 1.25882, 0.406239, -0.492011, -2.07933, -0.514343, 1.24772, 0.36932, -4.99939, -2.63258, 4.4028, 0.840021, -0.709442, 1.04637, 1.33606, -2.56326, 1.95218, -2.6111, -1.93732, 0.893319, -1.37813, 1.44652, 1.23044, -2.0359, 1.7048, -4.33936, -3.07714, 1.44615, -2.56371, 1.52967, 2.52046, -3.83586, 1.2669, 0.130971, 0.356689, 2.06631 };
  double b2[8] = {0.05536, -0.186905, 1.32613, -0.248107, -0.221167, 1.09968, 1.07757, 1.47243 };
  double w3[16] = {-4.01979, -3.37526, 3.21739, -2.38153, 2.69785, 2.26864, 2.05324, 2.77878, 0.506131, -1.70471, 4.85052, -2.46346, -4.85106, 2.79543, 3.40246, 0.575501 };
  double b3[2] = {1.15465, 0.571324 };
*/

/*
  //g = 10, m_c = 1, m_p = 0.2, l_p = 0.4, t = 0.02, start_var = 0.02, f_mag = 20
  int n[2] = {8, 8};
  double w1[32] = {-0.018481, 1.06091, 1.63285, -0.298351, -0.0402246, -0.931999, -0.939198, 0.429865, 0.4866, 1.42759, 3.81017, 1.36352, -0.587059, -0.906824, -0.401957, 0.236255, 0.0816715, 1.06974, 2.03716, 1.24073, 0.461936, -0.414425, -0.125123, 0.505108, 0.210288, 1.253, 1.23648, 0.00671666, 0.0288008, -0.675835, -0.314331, 0.541581 };
  double b1[8] = {1.5305, 1.25022, 0.291129, 0.981431, -0.442335, 1.1928, 1.3969, 1.40615 };
  double w2[64] = {-0.361563, -0.122831, 0.445539, 0.130096, -0.16199, -0.0304675, -0.299199, -0.585287, 1.09606, 1.02702, -0.89477, 0.858443, -1.03195, 0.76251, 1.0599, 1.42728, 1.26178, 0.10403, -1.89816, 0.509836, -2.4712, 0.880345, 1.05486, 1.16805, 0.554528, 1.12613, -1.64139, 0.500012, -2.21949, 0.999975, 1.07542, 0.768467, 0.993615, 0.185929, -2.05865, 0.188555, -0.898436, 0.760397, 1.17376, 0.235106, 1.64861, -4.43856, 1.13915, -3.09561, -0.0623763, -2.08764, 1.73724, -2.74926, 1.02101, 0.515472, -0.399224, 1.2289, -1.12462, 0.262814, 1.32611, 0.964959, -2.38112, 0.98667, 1.34707, -0.0820379, 1.41317, 0.695796, -1.59335, 0.356459 };
  double b2[8] = {-0.00500691, 0.999172, 0.979769, 1.10457, 0.634983, 0.330142, 1.0365, 0.0228908 };
  double w3[16] = {0.363038, 0.59665, 1.94708, 2.14091, 1.84898, -0.0622541, 0.482884, -3.6088, -0.343272, 1.61023, 1.00294, 2.00897, 0.158523, -4.60778, 1.2368, -0.610608 };
  double b3[2] = {0.61915, 0.726226 };
*/

/*
//g = 10, m_c = 1, m_p = 0.2, l_p = 0.4, t = 0.02, start_var = 0.02, f_mag = 10
int n[2] = {8, 8};
double w1[32] = {-0.0714422, 0.831364, -0.831116, -0.110657, -0.439982, 1.39381, 3.93155, 1.50692, -0.267036, 0.286072, 1.00812, 0.338373, -0.560294, 0.284813, -0.14576, 0.499053, 0.064673, 1.16725, 1.84292, 1.20484, -0.0175421, 0.366226, -1.31308, -0.0146358, -0.0725573, 1.05549, 0.191298, 0.620047, 0.0373262, 0.817306, 2.26316, 0.534248 };
double b1[8] = {1.15638, -0.502804, 0.64996, 0.875456, 1.45564, 0.96891, 1.03169, 1.13828 };
double w2[64] = {-0.44661, -0.232679, -0.464858, -0.0320328, -0.289852, -0.602221, 0.180813, 0.055545, 1.19848, -2.36836, 1.21832, 1.49288, 1.37099, 1.41011, 1.47569, 0.928397, 0.426617, -2.63062, 1.14293, 0.559709, 1.33176, 0.710885, 1.81488, 1.39617, -0.962788, 2.52888, -0.114913, -0.449922, 1.37718, -1.35956, 0.364641, 0.982203, 1.41908, -0.651008, -0.443092, -0.801363, -1.07379, 1.28806, 0.472913, 0.193925, 0.911497, -2.87334, 1.18813, 0.702727, 0.188092, 0.935405, 1.35733, 0.801268, 1.10951, -3.01558, 0.516312, 1.14435, 0.410165, 1.26235, 1.00241, 1.1782, 1.15911, -2.60419, 0.720148, 0.641706, 0.916098, 0.953598, 1.05437, 0.920305 };
double b2[8] = {0, 0.684669, 0.8035, -0.40661, 0.475235, 0.764912, 0.748959, 0.678674 };
double w3[16] = {0.577655, 1.02831, 1.25314, -3.7708, -0.419856, 1.89639, 1.56263, 1.81715, 0.446153, 1.38966, 1.26174, -2.23687, -2.54275, 1.36642, 1.67549, 2.0022 };
double b3[2] = {0.466536, 0.511962 };
*/

/*
//g = 10, m_c = 1, m_p = 0.2, l_p = 0.4, t = 0.02, start_var = 0.05, f_mag = 10
int n[2] = {8, 8};
double w1[32] = { -0.627448, 0.0736268, 0.131969, 0.311527, -0.256725, 2.0639, 5.10587, 1.36309, 1.75149, 0.590074, -2.13043, -0.758113, -0.80351, 0.095895, 0.121746, -0.547848, 0.0869703, -0.0218011, 0.454511, 0.090722, 0.0368455, 0.330344, -0.469519, 0.112279, -0.361304, -1.12028, -4.66975, -1.12081, -0.35611, 0.157311, 0.374927, -0.522906 };
double b1[8] = {1.33821, 0.114019, 0.618319, 1.34464, 1.06018, 1.30479, -0.309582, 1.26407 };
double w2[64] = {0.145677, 1.83501, 0.988495, 0.00151091, -0.723252, -0.560722, 1.69693, 0.0142627, 0.980693, -3.49321, -1.4831, 1.45656, 0.35334, 1.7066, -3.23367, 0.576359, 1.04916, -1.52839, -0.995808, 0.86126, 0.686531, 1.12863, -3.57865, 1.32524, 0.563959, -3.77333, -1.32593, 0.789977, 0.844975, 1.30153, -2.44056, 1.00142, 1.22575, -2.12457, -0.843104, 1.4755, 1.06214, 1.2055, -3.89581, 0.95026, -0.507686, 0.260785, -0.124818, -0.288102, 0.0217685, -0.0765188, -0.228598, -0.570535, 1.53107, -0.771079, -1.37287, 0.642481, 0.927985, 0.878014, -5.42774, 0.558236, 0.2629, -2.77073, -0.802171, 1.44019, 0.376551, 1.45966, -2.11068, 1.06449 };
double b2[8] = { -0.0869013, 1.22279, 1.17826, 0.836042, 0.993696, 0, 0.625672, 1.09807 };
double w3[16] = { -0.468049, 2.8822, 2.25213, 3.02597, 2.15346, -0.68693, -0.694267, 2.29068, -2.3184, 3.1002, 2.50033, 1.94641, 1.59388, 0.746938, 2.42197, 0.849765 };
double b3[2] = {1.21489, -0.0219693 };
*/

/*
//200 Eps
int n[2] = {8, 8}; 
double w1[32] = {-3.76652, -0.0486342, 3.43042, 0.376338, -0.0121542, -0.672402, 0.442481, -0.405913, -0.094434, 1.04057, 0.268615, -0.432055, -0.492326, 1.69984, 4.20406, 1.37531, -0.426495, -0.919995, 0.0733359, 0.544226, -0.406017, -1.15974, -4.67091, -1.02251, 0.522058, 1.52954, 1.52831, -0.701037, -0.6242, 0.571873, 0.645255, 0.177821 }; 
double b1[8] = {0.136766, 1.51691, 1.50768, 0.0135924, 1.40898, 0.273657, -1.41258, 1.42226 }; 
double w2[64] = {0.0709464, 0.00169433, -0.182214, -0.701435, -0.685542, 2.77703, 0.472874, -1.16374, 0.989244, 0.282726, -0.134973, 3.45145, -0.421748, 0.952076, 0.546108, -0.127449, -1.49026, 1.63978, 0.715481, -4.12859, 1.10854, -4.32414, -4.98097, 1.46373, 0.423021, -0.199174, 0.796372, 2.53196, -0.561075, 1.25882, 0.406239, -0.492011, -2.07933, -0.514343, 1.24772, 0.36932, -4.99939, -2.63258, 4.4028, 0.840021, -0.709442, 1.04637, 1.33606, -2.56326, 1.95218, -2.6111, -1.93732, 0.893319, -1.37813, 1.44652, 1.23044, -2.0359, 1.7048, -4.33936, -3.07714, 1.44615, -2.56371, 1.52967, 2.52046, -3.83586, 1.2669, 0.130971, 0.356689, 2.06631 }; 
double b2[8] = {0.05536, -0.186905, 1.32613, -0.248107, -0.221167, 1.09968, 1.07757, 1.47243 }; 
double w3[16] = {-4.01979, -3.37526, 3.21739, -2.38153, 2.69785, 2.26864, 2.05324, 2.77878, 0.506131, -1.70471, 4.85052, -2.46346, -4.85106, 2.79543, 3.40246, 0.575501 }; 
double b3[2] = {1.15465, 0.571324 }; 
*/
/*
//Disturbance
int n[2] = {8, 8}; 
double w1[32] = {-0.357151, 1.04517, 2.69292, 1.37826, -1.06932, -0.416595, -0.0779372, -0.87746, -0.209901, -0.276525, -2.84156, -0.554559, -0.254834, 0.277915, -0.834945, -0.668028, 0.0565472, -0.0935036, -2.27567, -0.728939, 0.156433, 0.0494275, 2.24775, 0.838365, -0.781842, -0.257172, 1.64985, 0.567257, -0.707552, -0.914306, -3.69077, -2.05543 }; 
double b1[8] = {2.01682, 1.30675, 1.08768, 1.36545, 1.40322, 1.70912, 1.56619, -1.05348 }; 
double w2[64] = {0.331425, -0.36701, -0.141567, 0.0403701, -0.0612365, -0.310211, -0.559182, 0.302873, 1.53439, 0.352012, 0.314271, 0.933468, 0.671139, 1.84218, 1.80903, -3.86607, 1.80271, -2.19295, -6.48993, -1.53734, -2.76763, 1.24915, 0.655296, -0.0617376, 1.23315, 1.42464, 0.615089, 1.51258, 0.70235, 0.867869, 1.34813, -4.14994, 0.847712, 2.25245, 1.39636, 2.1357, 1.9844, 0.851022, 0.733622, -2.0429, 1.52136, 0.517848, 0.809549, 0.185546, 0.081842, 1.63716, 1.2753, -3.14408, -0.469361, 0.289243, -0.411675, 0.211118, -0.73559, -0.1984, -0.733226, 0.453834, 1.96354, -2.0295, -3.92915, -1.38759, -1.48804, 1.62746, 1.21285, -0.649582 }; 
double b2[8] = {-0.0494859, 1.12091, -0.0910318, 1.04839, 1.28088, 1.08401, -0.112703, 0.324469 }; 
double w3[16] = {-0.486289, 1.4499, -2.20478, 2.08322, 1.93391, 0.580733, -0.312908, -2.80447, 0.0906981, 2.2194, -3.3851, 1.95804, 0.285587, 2.16912, -0.382134, -1.74793 }; 
double b3[2] = {0.969478, 0.59364 }; 
*/

/*
//ohne x_dot
int n[2] = {8, 8}; 
double w1[24] = {-0.0898623, 1.67511, 0.238575, -0.509712, 1.9718, -0.067395, 1.24509, 7.49679, 0.383456, 0.357745, 2.97427, 0.686592, -1.26983, 1.41997, 1.15132, -0.617025, 5.42, 0.0461015, -3.32974, -0.0855384, -0.102722, -1.07571, 1.75998, 0.687303 }; 
double b1[8] = {1.13429, 0.967132, 0.10619, 1.24093, -0.650212, 1.17368, 0.368969, 1.22556 }; 
double w2[64] = {1.54986, 1.33779, -3.37027, 1.90063, -1.1588, 1.47456, 0.804028, 0.767081, -0.297496, -0.316129, -0.705276, -0.592895, -0.37219, 0.346481, 0.746435, 0.328365, 0.692071, -0.418012, -0.679876, 1.87408, 2.36555, 1.71001, 0.761513, 2.37157, 1.90112, 1.14366, -3.73482, 0.811561, -2.42885, 1.69454, 1.27961, -0.233979, -1.52031, -0.130884, 3.02298, 0.17788, 0.912837, 1.80572, -2.161, -0.527494, 1.20657, 0.483642, -6.0883, 0.688294, -2.59359, 1.75981, -0.119366, 0.353032, 1.58704, 1.05931, -3.90642, 1.31103, -1.83266, 2.37837, 0.354218, 0.762882, -0.0623103, -0.256563, 3.35484, -0.332082, 1.05599, 1.36456, -2.54, -0.110415 }; 
double b2[8] = {0.839818, 0.158233, 0.295866, 1.07825, -0.278537, 0.214961, 0.723147, -0.434434 }; 
double w3[16] = {1.75903, -0.981457, -0.191556, 2.68724, -2.52261, 3.14525, 2.48282, -3.84669, 1.66486, -1.12519, 1.88569, 1.31609, -4.90634, 2.33131, 2.18028, -3.57128 }; 
double b3[2] = {0.829152, 0.509619 }; 
*/

/*
// g = 10.,m_c = 1., m_p = 0.3, l_p = 0.2, t = 0.02, start_var = 0.0, f_mag = 10  nur theta, theta_dot
int n[2] = {8, 8}; 
double w1[16] = {5.58082, 0.520678, -5.10793, -0.182467, -4.29809, -0.222609, 0.5622, -0.181572, -0.460062, -0.0405707, 0.778535, -0.103909, -0.300774, 0.00740841, 0.726191, 0.553327 }; 
double b1[8] = {-0.335853, -0.089522, -0.324406, 1.05871, 1.09317, 1.07596, 1.1006, 1.08516 }; 
double w2[64] = {-2.11356, -1.23602, -2.78068, 1.46252, 1.51098, 1.021, 1.40714, -0.359144, -3.19632, 2.10249, -0.255794, 0.697057, 1.33572, 0.136946, 1.11962, -1.2556, -0.0334209, 0.176772, -0.0941035, -0.323343, -0.239529, -0.303924, 0.0913182, -0.150911, -2.2569, -1.17694, -2.58506, 1.51852, 1.50314, 0.912942, 0.901741, 0.553881, -1.95076, -1.63253, -2.82841, 1.05594, 1.26856, 0.825532, 1.42968, 0.539205, -2.19129, -1.60052, -2.57874, 0.660146, 0.832699, 0.754803, 1.56116, 0.468367, 3.14029, 1.15619, 3.06217, -0.706927, -0.057035, 0.00471566, 0.0248112, 0.294516, -1.01034, -1.90565, -2.81345, 0.917677, 1.19457, 1.09637, 1.18878, 1.28868 }; 
double b2[8] = {0.856156, 0.469341, 0, 0.802048, 0.89347, 1.00131, -0.371573, 0.893317 }; 
double w3[16] = {2.16153, 0.754568, 0.743044, 1.72943, 1.78784, 2.1647, -4.14554, 0.843328, 1.42649, -2.55143, -0.688546, 1.89674, 2.1608, 2.52773, -1.93005, 1.95002 }; 
double b3[2] = {0.404082, 0.814123 }; 
*/

/*
// g = 10.,m_c = 1., m_p = 0.5, l_p = 0.2, t = 0.02, start_var = 0.02, f_mag = 10 nur theta, theta_dot
int n[2] = {8, 8}; 
double w1[16] = {-0.723089, -0.200622, 0.894523, -0.605886, -3.68884, -0.416552, -0.215175, 0.125786, 0.549845, -0.342253, 1.10728, 1.17388, -4.51177, -0.777542, 0.0501691, -0.301279 }; 
double b1[8] = {1.06712, 0.80263, -0.411832, 1.26373, 1.22161, 1.06124, 0.224876, 1.17628 }; 
double w2[64] = {0.726134, -0.492491, -1.61688, 0.825053, 0.811984, 0.0568272, -1.37032, 1.08277, -1.83493, -1.12314, 0.0628198, 0.672758, -1.83198, 1.29529, -0.34008, -1.48377, 0.624503, -0.345843, -2.20521, 1.27822, 0.319638, 0.377883, -1.03723, 1.36656, 1.07041, -0.385412, -0.991386, 1.06542, 0.109986, 0.883582, -2.17784, 0.164114, -0.984188, -0.0213871, 1.97909, 0.479803, 0.23532, 0.747584, 1.98043, -0.832088, 1.16104, 0.499749, -2.00192, 0.892966, 0.81553, -0.483358, -0.363052, 0.89603, 1.73422, 0.565316, -2.15598, 1.10756, 0.75967, 0.15608, -0.56862, 0.686623, 0.854586, 0.074447, -1.24795, 1.05087, 0.678969, -0.0569303, -1.4232, 1.46437 }; 
double b2[8] = {0.856713, -0.446563, 0.940118, 0.702317, -0.434466, 0.877432, 0.830674, 0.864161 }; 
double w3[16] = {1.26515, -1.20095, 1.39518, -0.542019, -2.16501, 1.86395, 1.43783, 1.84553, 1.99779, -1.37424, 1.36367, 1.57827, -2.1764, 0.773763, 0.902059, 1.43534 }; 
double b3[2] = {0.802857, 0.541553 }; 
*/
/* was hierfür noch geändert werden muss:
  double as[2] = {state[2], state[3]};
  double action[2];
  actions(2,2, as, action);
 */

/*
int n[2] = {8, 8}; 
double w1[32] = {0.903665, 0.370143, 3.05289, 0.904022, 0.591297, 0.0729802, 0.755808, 0.797201, 2.87173, 1.49848, -2.5712, -0.0166575, 1.44162, 0.0267578, -2.51747, -0.484606, 0.706853, 1.99973, 7.04979, 2.67218, 0.253234, 0.181746, 0.576319, -0.0232382, 1.76347, -0.23581, -1.93097, 0.111767, 0.532063, -0.0291198, 1.19626, -0.0534806 }; 
double b1[8] = {2.3543, 1.97679, 0.633373, 0.920852, 0.68567, 1.08968, 1.04466, 1.49019 }; 
double w2[64] = {0.789283, 1.3111, -4.43325, -1.96564, -1.61418, 0.645978, -0.511835, 0.177785, -0.198791, 0.424098, -3.2027, -0.49719, -8.17855, 0.797369, -0.969255, 0.0368742, 1.48329, 0.666722, -0.462994, -6.26439, 1.55828, -0.425528, -4.28831, 0.802399, -0.153506, 0.904877, -0.691374, 0.355207, -9.32763, 0.248312, 0.437308, 0.369569, 1.23744, 2.35217, -2.03196, 0.961247, -4.34482, 1.61734, 1.93451, 2.21259, 0.594663, 1.67801, -0.560821, -0.66578, -3.03158, 1.20595, 0.568683, 0.811009, -0.596445, -0.11502, -3.83844, -0.601778, -3.02129, 0.620699, 0.146876, 0.244222, 3.11859, 2.95927, -2.71858, 0.852771, -4.59166, 1.07038, 1.0314, 1.50267 }; 
double b2[8] = {-0.450082, 0.533231, 0.586611, 0.789988, 1.56123, 0.689515, 0.627298, 1.89671 }; 
double w3[16] = {-2.10326, 3.62149, -3.5296, 2.35186, 3.79477, 3.11041, 1.86932, 2.92221, 1.81726, -2.80615, -3.04586, -3.05812, 2.47166, 3.04185, 3.21725, 4.25837 }; 
double b3[2] = {1.98528, 2.21021 }; 

int n[2] = {16, 16}; 
double w1[64] = {-0.0818771, 0.435233, 1.96086, 0.851018, 0.26413, -0.200017, -3.26901, -0.762723, -0.852659, 0.481069, 2.27026, 0.70252, -0.180106, 0.584996, 2.44131, 0.965793, -0.451604, -1.0692, -3.20821, -1.32496, 0.644084, 0.238928, -3.18901, -0.467252, 0.634373, 0.160959, -1.01386, -0.494692, 0.528135, 1.35973, 2.51347, 0.740522, 1.28807, 0.246748, -0.647736, 0.021501, 0.7872, 0.0780858, -2.68578, -0.386999, -0.214746, 0.741067, 1.66751, 0.568984, -2.157, -0.185143, 2.45925, 0.148676, 0.575337, -0.232893, 1.1448, 0.0407719, 0.299136, 0.192623, 0.0334077, -1.11423, 0.966251, -0.455998, -0.558833, 0.410551, 0.637072, -0.0821123, -0.861451, -0.508218 }; 
double b1[16] = {1.10871, -0.577846, -0.418812, -0.49466, 0.959262, -0.374521, 0.905869, 0.340706, 0.858188, -0.579343, 1.04282, 0.866752, 1.04526, 0.934933, 0.732219, 0.934525 }; 
double w2[256] = {1.23246, -1.75592, -1.5124, -2.09283, -3.73121, -1.43338, 0.398034, 1.31434, 0.988562, -1.62107, 0.499152, -0.869522, 0.711001, 0.25254, 0.505046, 0.480854, 0.945265, -2.03905, -2.35792, -2.38735, -1.78739, -1.47935, 0.312231, 1.17046, 1.48391, -2.69319, 0.984516, -0.782388, 1.09645, 0.545815, 1.03085, 0.835999, 1.15943, -0.654725, -2.43492, -2.35696, -1.64067, -0.158349, 0.812299, 1.52842, 0.872571, -2.13666, 1.21403, -1.1861, 0.689402, 0.998372, 0.940888, 0.685053, 1.20473, -1.32641, -1.37743, -2.55061, -0.682174, -0.518707, 0.340209, 1.2659, 1.52102, -2.32275, 1.49139, 0.374839, 1.41913, 1.22881, 0.996532, 0.883161, -2.73768, 1.81579, 0.232231, -0.376709, 1.32173, 1.35534, 0.0616889, -0.949817, 0.267723, 1.476, -0.996594, -2.27062, -0.432336, 0.350902, 0.318518, -0.0342149, 0.317696, -0.723901, -2.65821, -3.68434, 0.450344, 0.0487647, 0.912365, 0.685598, 1.05878, -1.60633, 0.62028, -0.562863, 0.657372, 0.452973, 0.61078, 0.971839, 1.47083, -0.917161, -1.51523, -2.62752, -0.0819265, -0.0423493, 0.576681, 1.25692, 0.836042, -2.05922, 1.11762, -0.661277, 1.52499, 0.765931, 0.613941, 0.804558, 1.09206, -1.17181, 1.62524, 2.12014, -3.1816, 1.91478, -1.60418, 1.37749, -0.365101, 1.41084, 1.24391, 0.584059, 0.427097, -2.03896, 0.175636, -0.663599, 0.467585, -8.46934, -0.931507, -0.00594448, -0.93399, -5.2617, 0.907707, 0.7675, 1.36876, -2.00775, 0.852317, 0.769346, 1.06039, 0.837678, 0.730325, 0.942058, -0.472938, -1.22983, -1.32, 0.198279, 0.500579, -0.0526133, -2.4256, 0.0342673, -0.638499, 0.0519471, 1.57148, -0.206348, 0.637512, -0.326659, -1.32135, 0.549047, 1.34091, -0.972006, -1.64524, -2.5533, -0.796494, -0.885075, 0.722243, 1.3561, 1.12656, -2.3212, 1.1047, 0.425563, 1.28975, 0.919728, 0.631373, 1.06647, 0.597853, 0.628335, 1.89281, 2.43276, -0.649194, 0.909795, -2.82053, 0.834056, -1.17597, 0.398377, 0.749839, 0.715259, 0.0863197, -1.99405, -0.484513, -2.43527, 1.06612, -1.91881, -2.11429, -2.21685, -1.42756, -1.46529, 0.917702, 0.631033, 0.705909, -2.74846, 1.02723, -0.271504, 0.765899, 0.359278, 1.15277, 1.14781, -3.96346, 1.64569, -0.0430419, -0.226992, 0.63211, 1.02709, -0.0865936, -0.502826, 0.391089, 1.96513, -1.49044, -1.8662, -0.330718, 0.201669, -0.0380825, 0.0793416, 0.808179, -0.322739, 2.23276, 2.65916, -2.29028, 1.71878, -2.23455, 0.820949, -1.06178, 1.22428, 0.99789, 0.163762, -0.0667625, -2.11094, -0.641729, -1.77717, -3.345, 1.82083, -0.288538, -0.649879, 0.337715, 1.23529, 0.203925, -0.554415, 0.00572554, 2.01259, -1.10714, -0.109816, -0.721607, -0.266281, -0.214745, 0.630833 }; 
double b2[16] = {0.218651, 0.731273, 0.786586, 1.15085, -0.11667, 0.963686, 1.18207, 0.0838695, 0.785865, 0.272145, 1.0639, -0.496896, 0.888529, -0.583724, -0.317715, -0.328666 }; 
double w3[32] = {1.7485, 2.4077, 1.76586, 1.55377, -1.91608, 2.06044, 2.31007, -3.83488, -1.43797, 1.56312, 2.1632, -1.25823, 2.51116, -3.1566, -1.79628, -2.71141, 2.59179, 2.88291, 1.52334, 1.30001, -3.12089, 0.879302, 1.12563, -0.921367, 2.06832, 0.919472, 1.57149, -3.54481, 2.04025, -1.27969, -3.03406, -1.41191 }; 
double b3[2] = {1.00198, 0.503649 }; 
*/

/*
int n[2] = {12, 12}; 
double w1[48] = {0.814772, -0.0687978, -1.88642, -0.673917, -0.263476, 0.329689, -0.248446, 0.548019, 0.0398662, 0.678098, -0.853068, 0.224003, 0.806886, -0.413225, -1.37132, -0.219035, -0.414708, 0.373232, 0.566301, 0.519562, 0.481591, 0.0308969, -0.0886478, 0.223265, 0.343919, 0.19953, -0.361219, 0.444063, 0.0405315, 0.776752, 4.04886, 1.66418, 0.68442, -0.209041, -0.721063, 0.152545, -1.03071, 0.727726, 2.57523, 0.819638, 0.616126, -0.268358, -1.14579, -0.309828, 0.184324, 0.00117217, 0.16326, 0.358136 }; 
double b1[12] = {1.33047, 0.815281, 0.92292, 0.932589, 0.814663, 1.07991, 0.979636, 0.423447, 1.13534, 1.41509, 0.887118, 0.96325 }; 
double w2[144] = {0.102036, 0.625521, 1.0068, 0.683796, 0.836573, 0.689464, 0.862626, -1.58299, 0.521817, 0.395267, 1.2185, 0.385696, 0.163633, 0.798298, 1.07077, 0.342096, 0.427027, 0.576313, 0.54444, -0.246298, 0.490106, 0.492669, 0.32248, 0.552446, 1.40531, -0.483332, 1.20818, 1.12094, -1.30255, 0.903776, 0.442697, 0.0452792, 0.784206, -3.98385, 0.787134, -0.265202, 0.531037, 0.446062, 0.255848, 0.834878, 1.01274, 0.11284, 0.080897, -1.41477, 0.380574, 0.205322, 0.473217, -0.00711724, 0.554617, 0.873215, 0.0546342, 0.862411, 0.286469, 0.406768, 0.616411, -1.45577, 0.715994, 0.265361, 1.34308, 0.745206, -0.3421, -0.321385, -0.522491, -0.177717, 0.106211, 0.345793, -0.351691, 0.0585558, -0.485148, 0.0422613, 0.154089, 0.168396, -0.337566, 0.161878, 0.519926, 0.552797, 0.99674, 1.41129, 1.34802, -0.525494, 0.800084, 1.37551, -0.0756957, 1.05733, -0.0382081, 0.502981, 0.495078, 0.785187, 0.584624, 0.830165, 0.606005, -1.42826, 0.450769, 1.09933, 0.812382, 0.851909, 0.19298, 0.415413, 1.10778, 0.457121, 0.823356, 1.03652, 0.706089, -1.42831, 0.578669, 0.414559, 0.370221, 0.414466, -3.86808, 0.378352, -0.360811, -2.30769, 0.6148, -0.41355, -0.343201, 2.43009, -0.518639, 2.17601, -2.03873, 0.37095, 0.0953226, 0.67394, 1.03707, 0.427985, 0.181858, 0.108227, -0.250969, -1.80542, 0.733762, 0.428829, 0.86696, 0.215475, 0.467548, 0.928172, 0.365329, 1.07344, 0.665936, 0.65506, 0.950759, -1.49528, 0.524979, 1.04453, 0.347936, 0.725209 }; 
double b2[12] = {0.585933, 0.423015, 0.674262, 0.647826, 0.59411, -0.0798758, 0.430041, 0.606119, 0.578499, 0.148456, 0.626285, 0.540944 }; 
double w3[24] = {1.55553, 0.30245, -2.62262, 1.31017, 1.39456, 0.053359, 0.241619, 1.17993, 1.47942, -2.93421, 1.69049, 1.08546, 0.973253, 1.06299, -2.75186, 0.268616, 0.497313, -0.297602, 1.60983, 1.50361, 1.57757, -3.29761, 0.49984, 1.20709 }; 
double b3[2] = {0.545782, 0.30395 }; 
*/

//Roboterparams
int n[2] = {8, 8}; 
double w1[32] = {-1.78655, 0.29712, 5.86094, 1.07638, 0.23095, 0.646661, 5.39963, 1.27943, -0.691534, 0.399517, 0.774003, 0.715821, -0.802571, -0.196495, 1.91463, 0.261747, -0.0886687, 0.854411, 5.94488, 1.56887, -1.05228, 0.650045, 1.72977, 0.790324, -0.96025, -0.236631, 0.0721672, 0.218959, -0.337577, 0.204687, 1.52412, 0.722994 }; 
double b1[8] = {-0.64687, -0.192577, 1.27808, 1.55387, 0.867513, 1.64014, 1.6591, 1.54957 }; 
double w2[64] = {-0.595264, -0.504559, 0.133281, 0.0533409, -0.241748, -0.113722, -0.487381, 0.0399386, -5.54419, -3.74832, 0.381977, 0.180187, 1.04329, 0.757232, 1.30256, -0.984331, -3.36833, -3.45457, 1.47942, 1.90764, -2.18783, 2.40929, 1.41452, 2.31767, -0.242791, -0.617751, -0.219318, 0.0920812, 0.445226, -0.449273, 0.119495, 0.601332, 0.5385, -3.87581, 0.598896, 0.450334, 2.06887, -0.0994551, 0.00875647, 0.481123, -2.71712, -3.8958, 1.29201, 1.44584, -1.66913, 1.94072, 1.44266, 2.0065, -0.607306, 0.178561, -0.0937414, -0.357413, -0.147632, -0.0175522, -0.253871, -0.44138, -2.81688, -1.96584, 0.783879, 1.79205, -3.03618, 1.70573, 1.81119, 1.3555 }; 
double b2[8] = {-0.0790389, 1.72955, 1.25225, 0.18904, -0.841162, 0.883201, -0.0109896, 1.11809 }; 
double w3[16] = {-0.302016, -1.40229, 2.91073, -0.591138, -4.58176, 2.69533, -0.512953, 3.79172, -0.656114, -4.77187, 3.07173, 1.20134, 1.13239, 3.9954, 0.0398933, 2.05343 }; 
double b3[2] = {3.13591, 2.16938 }; 







// Die Funktion action führt die Berechnung des Neuronalen Netzes durch, gibt also bei Eingabe des Zustandsvektors die Q werte der Actions aus
// Für die benötigten Matrix Vektor Operationen werden die funktionen add_func, matrix_vector_mult und relu als Übertragungsfunktion benötigt

void add_func(int n, double *vec1, double *vec2) { //speichert im 1. vector
  for (int i = 0; i < n; ++i) {
    vec1[i] += vec2[i];
  }
}

void relu(int n, double *vec) {
  for (int i = 0; i < n; ++i) {

    if (vec[i] < 0) {
      vec[i] = 0;
    }
    printf("%g \n", vec[i]);
  }
  printf("\n");
}

/*m- Spaltenanzahl, n Zeilenanzahl, Länge von vec = m, Länge von res = n */
void matrix_vector_mult(int m, int n, double *mat, double *vec, double *res) {
  for (int i = 0; i < n; ++i) {
    res[i] = 0;
    for (int j = 0; j < m; ++j) {
      res[i] += mat[m * i + j] * vec[j];
    }
  }
}


void actions(int input_dims, int number_actions ,double *state, double *action) {
  /*m- Spaltenanzahl, n Zeilenanzahl, Länge von vec = m, Länge von res = n */
  double x1[n[0]];
  matrix_vector_mult(input_dims, n[0], w1, state, x1);
  add_func(n[0], x1, b1);
  relu(n[0], x1);

  double x2[n[1]];
  matrix_vector_mult(n[0], n[1], w2, x1, x2);
  add_func(n[1], x2, b2);
  relu(n[1], x2);

  matrix_vector_mult(n[1], number_actions, w3, x2, action);
  add_func(number_actions, action, b3);

}



// Funktion zur Motorsteuerung
void turn(double state[5], int steps, int dir) {
  // if Bedingung setzt das Signal an den Direction Pin der Schrittmotortreiber fest
  if (dir == 0) { //turn left
    digitalWrite(8, HIGH); // im Uhrzeigersinn
    digitalWrite(7, LOW); // im Uhrzeigersinn
    state[0] -= steps * x_factor; // Die x-Position wird hier anhand der Motorschritte berechnet
  }
  else { //turn right
    digitalWrite(8, LOW); // gegen den Uhrzeigersinn
    digitalWrite(7, HIGH); // im Uhrzeigersinn
    state[0] += steps * x_factor;
  }

  // Schleife führt die eigentliche Bewegung durch, indem die Pins abwechselnd auf High und low gesetzt werden
  for (stepCounter = 0; stepCounter < steps; stepCounter++)
  {
    digitalWrite(6, HIGH);
    digitalWrite(5, HIGH);
    delayMicroseconds(stepper_t);
    digitalWrite(6, LOW);
    digitalWrite(5, LOW);
    delayMicroseconds(stepper_t);
  }
  delay(pause);


}



// Messung des Zustandsvektors 
void get_state(double state[5], double prev_state[5],int eps) {
  end = micros();
  double dt = (double) (end - begin); //Zeit zwischen zwei Episoden

  state[1] = (state[0] - prev_state[0]) / (dt) * 1e6  * 0.5; //in steps/s

  sensors_event_t a, g, temp; // Auslesen des Beschleunigungssensors
  mpu.getEvent(&a, &g, &temp);

  state[2] = asin((a.acceleration.y + corr) / gravity); //g.gyro.x*dt+0.13;  // //°
  state[3] = g.gyro.x + gyr_corr;
  state[4] = (double) end;
  begin = micros();
  for (int i = 0; i < 5; ++i) {
    prev_state[i] = state[i];
  }

  // Mittelwertbildung über letzte Winkel, falls avg != 1, soll Rauschen und plötzliche Beschleunigungen verringern
  last_angles[eps%avg] = state[2];
  state[2] = 0;
  for (int i = 0; i < avg; ++i) {
    state[2] += last_angles[i]/avg;
  }

}


// Festlegen der Pins am Arduino und initialisieren des Sensors
void setup()
{

  Serial.begin(115200);
  while (!Serial) {
    delay(10); // will pause Zero, Leonardo, etc until serial console opens
  }
  pinMode(4, OUTPUT); // Enable (both steppers)

  //Stepper 1
  pinMode(5, OUTPUT); // Step
  pinMode(7, OUTPUT); // Richtung

  //Stepper 2
  pinMode(6, OUTPUT); // Step
  pinMode(8, OUTPUT); // Richtung


  if (!mpu.begin()) {
    Serial.println("Failed to find MPU6050 chip");
    while (1) {
      delay(10);
    }
  }
  mpu.setAccelerometerRange(MPU6050_RANGE_2_G);
  mpu.setGyroRange(MPU6050_RANGE_250_DEG); //minimum?
  mpu.setFilterBandwidth(MPU6050_BAND_21_HZ);

  sensors_event_t a, g, temp;
  mpu.getEvent(&a, &g, &temp);
  corr = a.acceleration.y; // hiermit kann wenn bei starten des Programmes der Roboter aufrecht gehalten wird eine Kalibrierung der Winkelmessung vorgenommen werden
  begin = micros();

  // Dieses auskommentierte Stück dient als Überprüfung, ob die Berechnungen des Neuronalen Netzes mit der Funktion action auch die erwarteten Q Werte liegern
  // Die Q Werte für einen einfachen Zustandsvektor werden dafür auf den Seriellen Monitor geprintet und mit den Ergebnissen dieser Berechnung in der Simulation vergleichen
/*  // hier ist dies für ein Netzwerk mit 2 Input Werten durchgeführt, für ein Netzwerk mit dem vollständigen Zustandsvektor als Eingabe, müssen as und die Argumente von 
 *  // actions angepasst werden
    double as[2] = {1,1};
    double action[2];
    actions(2,2,as,action);

    Serial.print(action[0]);
    Serial.print(", ");
    Serial.println(action[1]);
    Serial.println("");
*/
}




// Programmschleife
void loop() {
  get_state(state, prev_state, eps);

/* Ausgabe des Zustandsvektor auf dem seriellen Monitor
  for(int i = 0;i<5;i++){
    Serial.print(state[i],5);
    if (i!= 4){Serial.print(", ");}
    else{Serial.println("");}
  }
*/

  double as[4] = {state[0],state[1],state[2], state[3]};
  double action[2];
  actions(4,2, as, action);
  
/* Ausgabe der berechneten Action auf dem seriellen Monitor
  Serial.print(action[0]);
  Serial.print(", ");
  Serial.println(action[1]);
  Serial.println("");
*/

  // Anzahl der Motorschritte
  int steps =  5;//(int) abs(action[0]-action[1])+5;

  // Entscheidung in welche Richtung die Motoren sich drehen müssen anhand der Rückgabe des Neuronalen Netzes
  if (action[0] > action[1]) { //(action==1){ //nach rechts fahren
    turn(state, steps, 0);
    previous_action = 0;
  }
  else { //nach links fahren
    turn(state, steps, 1);
    previous_action = 1;
  }
  eps++;
}
