,Grain No.,Size [Pixel],center x-coordinate,center y-coordinate,mean azimuth [degree],mean latitude [degree],mean colatitude [degree],Regelungsgrad [%]
0,1,1515,34,63,39.0456,47.4799,42.5201,99.9762
1,2,5902,148,65,220.701,46.7044,43.2956,99.9417
2,3,5499,3386,93,10.7272,79.1697,10.8303,99.9745
3,4,63052,3184,188,43.3512,34.1752,55.8248,76.4028
4,5,8419,241,146,220.894,3.93498,86.065,99.8139
5,6,176078,715,313,219.657,18.8926,71.1074,95.1934
6,7,507,146,78,227.025,50.3379,39.6621,99.8805
7,8,1663,519,105,30.8648,32.1458,57.8542,99.8111
8,9,13220,106,189,227.562,50.904,39.096,99.6493
9,10,960,28,146,220.423,47.3171,42.6829,99.9324
10,11,1911,655,133,34.6105,0.996605,89.0034,99.8498
11,12,623,706,122,34.3519,1.21062,88.7894,99.9912
12,13,109121,2873,340,217.843,53.0538,36.9462,98.7878
13,14,927,174,171,218.887,40.3776,49.6224,98.5381
14,15,13053,846,208,25.1068,40.045,49.955,99.8876
15,16,1246,3197,206,24.6232,80.5121,9.4879,99.965
16,17,11468,1005,253,216.025,30.5745,59.4255,99.5809
17,18,1605,167,219,217.679,35.1628,54.8372,99.9823
18,19,2328,1893,209,39.9186,62.4698,27.5302,99.9664
19,20,5314,3149,247,33.8612,1.05415,88.9459,99.8947
20,21,952,1777,216,212.073,76.7045,13.2955,99.9566
21,22,1129,556,236,203.411,77.1856,12.8144,99.9307
22,23,13313,251,280,215.592,34.7823,55.2177,99.9452
23,24,597,2000,240,326.58,85.2674,4.73259,99.9623
24,25,2078,3408,264,42.7792,62.6491,27.3509,99.9534
25,26,97337,1705,344,47.4429,9.94398,80.056,99.0035
26,27,27687,3268,340,48.4506,66.1422,23.8578,99.9271
27,28,2680,2068,259,316.715,85.0875,4.91253,99.9402
28,29,6990,1151,275,217.553,1.35645,88.6435,99.8728
29,30,34650,2194,330,35.7031,14.3936,75.6064,99.6877
30,31,775,2438,252,53.0876,81.9506,8.04942,99.9469
31,32,23865,1272,376,216.894,7.44273,82.5573,99.476
32,33,3580,2367,296,55.3401,83.969,6.0309800000000005,99.9707
33,34,3701,520,280,210.943,50.819,39.181,99.9919
34,35,750,1964,273,226.088,43.1387,46.8613,99.8801
35,36,9414,412,292,46.0728,50.6141,39.3859,99.9937
36,37,1161,1418,276,38.8945,68.0598,21.9402,99.9759
37,38,830,1453,278,206.675,55.4703,34.5297,99.9612
38,39,4890,1985,307,44.2345,44.657,45.343,99.2052
39,40,14788,2507,323,210.974,87.4217,2.57831,99.9836
40,41,13788,3080,342,42.5572,12.7658,77.2342,99.997
41,42,13469,117,364,223.823,41.2289,48.7711,99.6126
42,43,990,35,295,308.123,83.4021,6.59787,99.9697
43,44,1153,2615,296,65.2826,81.2444,8.75558,99.985
44,45,936,173,311,218.647,38.9323,51.0677,99.9854
45,46,16214,1221,347,198.945,76.7984,13.2016,99.9744
46,47,1644,3404,350,36.0562,70.0208,19.9792,99.9377
47,48,4595,2051,336,31.0511,88.7578,1.24222,99.9967
48,49,980,1424,319,215.574,42.8662,47.1338,99.9908
49,50,67776,430,477,36.4331,63.1581,26.8419,83.2575
50,51,3822,2736,334,199.785,64.3992,25.6008,99.9986
51,52,84885,2307,492,41.7785,4.7801,85.2199,99.9423
52,53,27424,2617,441,40.4951,74.5634,15.4366,99.8459
53,54,2058,2368,372,37.4253,8.89591,81.1041,99.9511
54,55,34563,2003,463,223.781,19.1346,70.8654,99.9623
55,56,1163,1404,396,216.588,39.7076,50.2924,99.9906
56,57,4657,2539,433,219.908,48.7675,41.2325,99.9809
57,58,2902,30,426,36.9875,8.92742,81.0726,99.7128
58,59,1196,3408,404,44.9791,64.0418,25.9582,99.9838
59,60,1713,1364,420,39.7006,66.1654,23.8346,99.9962
60,61,746,208,412,50.1065,52.521,37.479,99.9585
61,62,31319,1370,521,216.95,54.4602,35.5398,79.5713
62,63,1127,665,433,228.107,14.042,75.958,99.9763
63,64,826,3380,426,45.9898,10.7541,79.2459,99.9376
64,65,732,232,433,54.0189,67.3436,22.6564,99.9905
65,66,3290,3273,443,47.9066,66.3181,23.6819,99.9843
66,67,23258,721,497,262.366,83.9874,6.01264,99.4961
67,68,935,1290,439,31.9751,68.8573,21.1427,99.9898
68,69,29405,1606,498,160.39700000000005,81.9248,8.07517,99.5212
69,70,3586,1094,465,197.222,75.6493,14.3507,99.9349
70,71,72407,3032,633,50.8324,9.03309,80.9669,89.3258
71,72,27403,120,529,39.2711,45.2456,44.7544,99.4082
72,73,1491,3411,459,209.286,59.0375,30.9625,99.961
73,74,2401,3335,466,35.4074,2.87916,87.1208,99.8834
74,75,557,643,468,29.4844,44.3312,45.6688,99.9745
75,76,10341,1771,521,37.5544,44.1756,45.8244,99.9452
76,77,6098,2712,501,220.05900000000003,38.5555,51.4445,99.9799
77,78,534,3370,489,30.1094,46.867,43.133,99.9831
78,79,1659,3405,502,33.1784,49.6646,40.3354,99.9554
79,80,32541,1068,650,206.612,65.7587,24.2413,93.6668
80,81,31704,3332,604,221.173,60.6182,29.3818,99.9007
81,82,523,10,533,217.018,2.14379,87.8562,99.9241
82,83,12359,337,565,214.601,34.8127,55.1873,99.8474
83,84,24833,2839,621,1.51204,79.0075,10.9925,99.9103
84,85,11380,1889,582,12.7665,76.8759,13.1241,99.8975
85,86,19342,2595,614,217.723,79.3641,10.6359,99.7267
86,87,6490,1132,565,17.3364,75.7776,14.2224,99.9674
87,88,7853,1346,585,45.4988,30.1061,59.8939,99.9967
88,89,20210,2731,649,53.3784,9.22371,80.7763,99.9862
89,90,44008,801,624,211.784,41.0429,48.9571,99.9948
90,91,39548,2015,669,213.874,48.9603,41.0397,98.8825
91,92,64950,1675,695,35.1101,19.4253,70.5747,99.9791
92,93,2025,2492,593,216.802,28.896,61.104,99.9209
93,94,17700,3168,653,3.6434,79.8197,10.1803,99.9653
94,95,22637,276,669,212.451,66.2711,23.7289,99.9703
95,96,3952,1248,605,32.3019,24.7116,65.2884,99.9957
96,97,10138,418,660,33.2849,9.8429,80.1571,99.9837
97,98,70230,2562,771,217.903,40.4775,49.5225,97.2348
98,99,42635,1354,712,230.918,67.1815,22.8184,99.9802
99,100,3723,1822,651,208.822,25.0673,64.9327,99.9901
100,101,512,1206,629,212.749,25.073,64.92699999999999,99.9943
101,102,3114,128,670,217.611,67.1601,22.8399,99.9412
102,103,2514,2264,641,221.807,48.9689,41.0311,99.9951
103,104,216372,1811,995,32.9939,48.0614,41.9386,52.7788
104,105,4464,1175,679,30.2266,51.5567,38.4433,99.988
105,106,37010,2221,765,33.0709,62.9502,27.0498,99.7057
106,107,588,1932,666,14.3328,60.49,29.51,99.9935
107,108,103136,430,830,44.3814,73.5179,16.4821,99.9964
108,109,18846,916,739,345.162,77.9265,12.0735,99.9866
109,110,50921,3284,814,215.691,31.3871,58.6129,99.5049
110,111,2876,675,686,266.954,86.0514,3.94863,99.9809
111,112,2818,71,716,244.158,83.3131,6.686889999999999,99.9448
112,113,8307,752,747,29.617,0.735954,89.264,99.9949
113,114,1359,2600,712,225.999,33.0938,56.9062,99.992
114,115,6227,2665,746,220.30900000000003,2.84487,87.1551,99.9769
115,116,5768,138,749,44.6629,61.1284,28.8716,99.8862
116,117,603,1831,715,216.316,42.4728,47.5272,99.9157
117,118,510,13,727,239.865,82.23100000000002,7.76895,99.9586
118,119,590,204,729,39.1774,36.9601,53.0399,99.9953
119,120,3670,1179,746,32.6126,17.0596,72.9404,99.9965
120,121,27501,1867,868,210.634,27.4466,62.5534,99.8617
121,122,1363,2874,749,27.6486,48.7615,41.2385,99.9925
122,123,1659,2586,761,299.754,86.2229,3.77707,99.9963
123,124,7179,3103,795,39.4763,59.1846,30.8154,99.9977
124,125,704,2054,760,32.7921,62.3124,27.6876,99.9906
125,126,2106,40,774,219.111,57.1166,32.8834,99.673
126,127,743,3408,771,41.9634,46.6009,43.3991,99.8
127,128,3540,1145,796,43.4615,58.8768,31.1232,99.9965
128,129,34605,1251,865,215.292,16.3863,73.6137,99.9368
129,130,8576,150,830,220.324,3.74422,86.2558,99.9146
130,131,5923,1076,821,35.9467,30.036,59.964,99.9988
131,132,175895,1054,1046,188.536,88.363,1.63698,83.0066
132,133,879,721,803,210.421,84.1602,5.83979,99.9871
133,134,11031,834,843,50.2492,57.4542,32.5458,99.9936
134,135,2877,55,828,228.277,78.7122,11.2878,99.9528
135,136,17247,2962,869,223.595,58.6311,31.3689,99.9876
136,137,21467,2339,891,40.374,13.5309,76.4691,99.8772
137,138,1910,1452,841,26.7365,35.3935,54.6065,99.9927
138,139,6492,721,866,216.691,61.9881,28.0119,99.9904
139,140,16901,1627,901,203.461,81.1373,8.86275,99.9875
140,141,88069,491,1117,38.1686,15.142,74.858,73.5065
141,142,1638,26,900,61.5273,67.8614,22.1386,99.9562
142,143,8433,3141,907,220.396,7.630319999999998,82.3697,99.9908
143,144,4401,74,897,56.2092,69.8188,20.1812,99.9662
144,145,22827,2763,920,40.0324,26.0228,63.9772,99.9458
145,146,64881,2641,1002,10.3958,83.4865,6.51349,85.1346
146,147,12728,1414,935,23.8666,65.325,24.675,99.9187
147,148,1033,3074,918,35.3623,27.3702,62.6298,99.99
148,149,1179,122,929,44.3456,24.4426,65.5574,99.9488
149,150,128290,3061,1130,37.5384,36.5675,53.4325,70.7682
150,151,1813,2952,937,25.0849,52.3301,37.6699,99.9844
151,152,49100,717,1150,217.866,60.8862,29.1138,99.3979
152,153,4004,3013,956,220.342,62.4732,27.5268,99.9799
153,154,2148,3205,963,230.578,69.1963,20.8037,99.9951
154,155,22688,149,1045,44.64100000000001,73.1077,16.8923,99.7669
155,156,5422,76,992,228.422,56.2338,33.7662,99.9018
156,157,584,3108,968,225.966,19.4429,70.5571,99.9937
157,158,786,3406,988,62.1384,69.551,20.449,99.9404
158,159,124953,2589,1265,38.6769,29.4334,60.5666,96.8
159,160,19035,326,1033,35.2889,6.23387,83.7661,57.9538
160,161,2415,2389,1009,212.189,77.1174,12.8826,99.9279
161,162,3241,2327,1021,43.2127,69.8145,20.1855,99.8243
162,163,814,1722,1039,240.139,85.8995,4.1005,99.5797
163,164,12410,850,1083,13.0566,83.0358,6.964180000000002,99.9724
164,165,2639,1121,1072,42.7801,1.31227,88.6877,99.9942
165,166,1569,2262,1062,215.571,55.8482,34.1518,99.9804
166,167,43913,1791,1221,27.4978,15.2874,74.7126,99.9819
167,168,22382,2667,1145,32.7522,47.0007,42.9993,99.9682
168,169,754,1721,1076,213.588,25.2373,64.7627,99.9921
169,170,8055,3277,1134,43.041,10.2409,79.7591,99.9943
170,171,31905,1962,1192,34.6051,37.8658,52.1342,71.6058
171,172,1576,275,1099,26.0142,70.5838,19.4162,99.9642
172,173,4908,3058,1109,357.619,79.3652,10.6348,99.9907
173,174,12960,1666,1149,229.424,85.3668,4.63318,99.9816
174,175,1466,3135,1103,222.004,5.6396,84.3604,99.9966
175,176,1476,40,1115,57.6915,74.5531,15.4469,99.939
176,177,5900,1386,1151,221.578,0.0772781,89.9227,99.9152
177,178,13529,2255,1187,29.0625,4.99528,85.0047,99.9141
178,179,1971,3386,1163,51.999,67.173,22.827,99.9368
179,180,701,216,1139,36.8417,71.40899999999998,18.591,99.9937
180,181,4940,145,1162,44.771,73.0812,16.9188,99.918
181,182,9151,229,1196,37.3145,22.8604,67.1396,99.9773
182,183,1833,3065,1161,326.335,83.84,6.15998,99.997
183,184,824,76,1160,52.0823,73.4442,16.5558,99.9676
184,185,2563,2765,1188,221.599,34.139,55.861,99.9958
185,186,35183,1025,1338,33.4423,17.9933,72.0067,95.3274
186,187,1398,858,1184,224.46400000000003,2.92364,87.0764,99.9793
187,188,625,64,1187,12.9828,67.5601,22.4399,99.9297
188,189,4723,1631,1224,51.8158,12.4105,77.5895,99.9492
189,190,6954,921,1229,22.17,75.457,14.543,99.9922
190,191,19291,2128,1266,223.805,70.0103,19.9897,99.9678
191,192,16259,3231,1270,39.4173,15.866,74.134,99.9981
192,193,23996,1328,1296,30.9905,76.3856,13.6144,99.9497
193,194,1882,89,1224,15.5695,67.2768,22.7232,99.963
194,195,4354,3330,1246,307.0370000000001,83.2198,6.780239999999999,99.991
195,196,981,863,1228,4.22915,74.6112,15.3888,99.9923
196,197,3400,669,1244,41.6383,52.5694,37.4306,99.8832
197,198,4473,597,1245,217.642,4.21764,85.7824,99.9943
198,199,873,3389,1248,8.48708,79.6004,10.3996,99.9404
199,200,8954,2344,1272,31.07,29.0606,60.9394,99.9919
200,201,24425,191,1307,34.8243,35.9158,54.0842,99.8703
201,202,23220,361,1331,33.5695,35.2122,54.7878,99.9924
202,203,18451,1556,1343,35.4491,70.7213,19.2787,99.9814
203,204,7041,3082,1311,204.285,13.0941,76.9059,99.9893
204,205,1494,51,1275,231.111,62.7497,27.2503,99.9676
205,206,4013,1651,1301,23.4633,85.1633,4.83667,99.9951
206,207,1283,875,1282,223.825,62.09,27.91,99.9207
207,208,661,2459,1278,25.9269,9.12688,80.8731,99.9534
208,209,1476,2421,1289,25.6794,48.1434,41.8566,99.9967
209,210,3537,2243,1300,39.2358,28.5438,61.4562,99.9991
210,211,1711,609,1297,26.9193,73.7665,16.2335,99.9937
211,212,1123,944,1301,26.1063,19.9229,70.0771,99.9802
212,213,8776,888,1347,214.941,67.8924,22.1076,99.9971
213,214,7303,3320,1359,346.5130000000001,84.3844,5.61559,99.945
214,215,8663,795,1343,29.7347,17.5679,72.4321,99.9946
215,216,33223,1938,1394,39.4327,38.0257,51.9743,99.9795
216,217,14413,636,1356,22.9755,70.0881,19.9119,99.9788
217,218,2525,1446,1314,217.113,3.88764,86.1124,99.9862
218,219,4934,1193,1322,210.878,8.739189999999999,81.2608,99.9862
219,220,2108,3383,1346,35.8672,2.57976,87.4202,99.6659
220,221,2635,21,1358,15.5733,76.0139,13.9861,99.9663
221,222,4682,67,1355,17.9518,78.0903,11.9097,99.9815
222,223,15770,2427,1390,202.525,13.7065,76.2935,98.5055
223,224,1015,2987,1347,22.0767,64.8509,25.1491,86.4098
224,225,29741,2262,1399,38.9117,5.47605,84.5239,99.5862
225,226,11395,3121,1386,45.5305,10.2001,79.7999,99.9904
226,227,2688,3203,1350,217.849,14.6216,75.3784,99.982
227,228,3195,1428,1360,31.7117,52.3373,37.6627,99.987
228,229,1669,3369,1394,334.9790000000001,85.3444,4.65564,99.9405
229,230,2078,2064,1366,210.575,50.0471,39.9529,99.9904
230,231,3469,1785,1365,342.903,82.7464,7.25355,99.999
231,232,30796,1337,1472,30.5594,26.9265,63.0735,95.8241
232,233,1359,2110,1370,207.675,36.259,53.74100000000001,99.9973
233,234,7017,514,1396,15.5295,73.8867,16.1133,99.9655
234,235,7491,1669,1392,221.875,8.349910000000001,81.6501,99.9936
235,236,952,1203,1368,14.6172,73.7669,16.2331,99.9934
236,237,1532,3249,1374,222.106,38.7456,51.2544,98.9411
237,238,8247,1167,1415,33.759,58.4529,31.5471,99.9547
238,239,5558,159,1402,214.387,8.4072,81.5928,99.6971
239,240,2874,932,1409,213.875,37.54,52.46,99.9912
240,241,2552,3013,1413,34.6126,42.1571,47.8429,99.988
241,242,525,751,1389,29.8439,22.2249,67.7751,99.8415
242,243,4572,1775,1414,227.11,68.0719,21.9281,99.9606
243,244,1498,266,1415,29.8877,36.1061,53.8939,99.9738
244,245,4705,354,1439,39.3936,30.319000000000006,59.681,99.9949
245,246,14414,791,1437,4.97897,80.4283,9.57171,99.9756
246,247,709,1259,1411,33.3102,76.8917,13.1083,99.9786
247,248,2069,2638,1414,47.0751,55.7223,34.2777,99.9893
248,249,193913,2971,1642,24.8088,23.2572,66.7428,45.3416
249,250,4530,429,1431,207.211,64.9954,25.0046,99.9945
250,251,9622,599,1453,38.418,49.13,40.87,99.9921
251,252,3259,3264,1440,46.2121,8.58162,81.4184,99.9476
252,253,7033,1541,1443,219.442,63.1361,26.8639,99.9522
253,254,1909,2111,1427,126.002,81.6559,8.34411,99.9713
254,255,19289,3087,1471,205.999,75.2449,14.7551,99.9022
255,256,6362,1671,1464,6.8817,86.10700000000001,3.89297,99.9021
256,257,597,235,1437,215.142,37.5517,52.4483,99.9898
257,258,638,1225,1438,39.8923,66.1633,23.8367,99.9606
258,259,2361,122,1453,218.846,41.4421,48.5579,99.8103
259,260,28341,196,1530,39.2595,26.1565,63.8435,98.3289
260,261,5059,2603,1477,223.246,48.4417,41.5583,99.8748
261,262,1933,300,1462,209.683,2.00522,87.9948,99.8155
262,263,3966,1780,1478,23.0484,81.5353,8.46469,99.7986
263,264,15055,420,1508,221.378,55.9751,34.0249,88.4061
264,265,110281,2126,1696,38.645,28.1706,61.8294,50.242
265,266,567,930,1459,34.1743,27.4477,62.5523,99.9648
266,267,7817,2497,1492,32.1599,64.4465,25.5535,99.9764
267,268,20023,1125,1511,227.258,61.2984,28.7016,99.9136
268,269,4437,1850,1493,27.0624,84.5767,5.42332,99.9517
269,270,1542,2077,1485,225.357,57.1403,32.8597,99.9897
270,271,50690,782,1605,34.7931,12.7706,77.2294,99.669
271,272,2003,2032,1483,222.453,9.44786,80.5521,99.9802
272,273,2516,779,1486,213.343,46.7468,43.2532,99.998
273,274,7391,2624,1526,32.4688,54.339,35.661,99.9694
274,275,1461,2298,1491,31.4439,10.1243,79.8757,99.9897
275,276,927,1010,1488,36.9319,39.2984,50.7016,99.9889
276,277,120682,1558,1671,34.6357,4.0064199999999985,85.9936,96.7297
277,278,2473,3226,1502,28.7354,52.4369,37.5631,99.9944
278,279,540,2245,1489,299.011,86.3287,3.67131,99.9976
279,280,2077,1971,1500,94.4204,83.0294,6.97055,99.9617
280,281,9496,939,1523,215.205,70.4652,19.5348,99.85
281,282,731,7,1514,218.212,2.83476,87.1652,99.812
282,283,15041,599,1567,31.637,30.4146,59.5854,99.9831
283,284,8554,3131,1554,238.968,50.5536,39.4464,99.9862
284,285,12796,497,1622,29.7367,1.7291599999999998,88.2708,98.3651
285,286,1067,1359,1542,39.2496,52.0848,37.9152,99.9959
286,287,3723,1836,1568,230.501,5.38885,84.6111,99.9369
287,288,1060,62,1560,31.5343,71.1566,18.8434,99.958
288,289,15157,359,1677,201.808,39.6862,50.3138,99.6414
289,290,1231,2248,1567,12.3539,81.2944,8.70561,99.9809
290,291,95971,1231,1811,212.036,47.6389,42.3611,99.8913
291,292,3836,951,1593,30.1492,35.5843,54.4157,99.946
292,293,8806,1139,1606,209.526,21.2157,68.7843,99.9955
293,294,751,3031,1572,229.957,65.3834,24.6166,99.9905
294,295,115470,2393,1912,34.6173,6.03563,83.9644,91.8171
295,296,28737,964,1708,226.703,29.0122,60.9878,54.629
296,297,1101,1797,1582,38.8746,18.5574,71.4426,99.9947
297,298,15166,2205,1638,212.721,56.1923,33.8077,99.9952
298,299,13033,68,1634,226.93,67.1308,22.8692,99.8971
299,300,10462,2616,1670,35.2265,13.1903,76.8097,99.8853
300,301,5203,2073,1642,225.725,57.3385,32.6615,99.9837
301,302,5298,2544,1644,209.726,11.9923,78.0077,99.9956
302,303,658,2288,1613,31.8161,57.5028,32.4972,99.9948
303,304,1641,1874,1624,31.6923,24.7047,65.2953,99.9688
304,305,3115,1214,1633,28.9191,6.520580000000002,83.4794,99.9816
305,306,13915,211,1682,28.4722,67.6441,22.3559,99.9634
306,307,3400,1924,1663,11.3856,73.2605,16.7395,99.9861
307,308,28818,1850,1753,201.78,63.249,26.751,99.9428
308,309,2500,1097,1656,249.745,72.1159,17.8841,99.9909
309,310,747,3368,1623,229.036,44.5296,45.4704,99.9462
310,311,7099,631,1664,220.053,14.9182,75.0818,99.997
311,312,6963,2347,1675,203.426,67.125,22.875,99.9915
312,313,3175,3379,1688,356.723,75.6944,14.3056,99.8671
313,314,13886,115,1748,34.8346,69.598,20.402,99.9085
314,315,4950,431,1686,210.675,9.33835,80.6617,99.9899
315,316,2609,296,1702,27.0618,67.6676,22.3324,99.9946
316,317,45658,447,1822,208.156,11.9122,78.0878,99.8496
317,318,15967,1110,1728,257.261,69.1832,20.8168,99.9416
318,319,2018,683,1701,35.7394,20.9622,69.0378,99.9973
319,320,7101,2687,1736,220.508,27.2324,62.7676,99.9685
320,321,5061,2976,1755,45.4876,29.0807,60.9193,99.8969
321,322,15330,2134,1756,229.343,57.12600000000001,32.874,99.9214
322,323,6608,2250,1746,42.6677,15.8494,74.1506,99.9811
323,324,13623,1726,1769,39.7348,6.118519999999998,83.8815,99.9569
324,325,22864,3317,1820,36.7146,8.61844,81.3816,99.5952
325,326,666,2319,1720,210.012,65.9038,24.0962,99.9811
326,327,15153,646,1790,220.109,66.807,23.193,99.9861
327,328,1967,24,1767,42.9438,73.4251,16.5749,99.9536
328,329,6077,758,1765,220.421,6.07281,83.9272,99.9328
329,330,5081,2350,1766,202.838,67.2124,22.7876,99.9954
330,331,1323,278,1755,355.76199999999994,85.3385,4.66153,99.9936
331,332,2246,428,1784,23.995,70.6171,19.3829,99.9247
332,333,2506,2590,1772,33.0529,37.1545,52.8455,99.9973
333,334,12966,211,1826,30.7391,70.5764,19.4236,99.9765
334,335,1515,1626,1778,208.91,16.221,73.779,99.9968
335,336,899,3048,1777,42.9161,30.15,59.85,99.9941
336,337,4614,1026,1799,233.483,64.4231,25.5769,99.9737
337,338,4646,2282,1808,227.485,61.5424,28.4576,99.9914
338,339,1017,3085,1793,207.472,41.0483,48.9517,99.9895
339,340,921,3119,1791,43.0761,34.1559,55.8441,99.9807
340,341,822,43,1809,38.8547,73.1058,16.8942,99.9606
341,342,919,837,1801,29.981,22.0721,67.9279,99.9973
342,343,1250,1586,1810,41.9737,4.58056,85.4194,99.9984
343,344,1017,3248,1805,46.5389,30.4754,59.5246,99.9858
344,345,107746,785,1976,35.5649,13.4547,76.5453,99.2336
345,346,5293,792,1834,212.827,57.9784,32.0216,99.9875
346,347,8388,2598,1870,40.2564,4.13935,85.8606,99.8575
347,348,4630,3165,1830,8.06165,70.977,19.023,99.9979
348,349,523,3207,1804,220.682,10.7524,79.2476,99.9885
349,350,34385,3087,1899,45.245,57.2968,32.7032,99.9448
350,351,866,70,1835,43.4891,70.9052,19.0948,99.9504
351,352,21313,1656,1904,71.8322,72.7506,17.2494,99.9521
352,353,4098,2927,1868,219.822,51.0087,38.9913,99.9369
353,354,536,1601,1835,218.803,78.4269,11.5731,99.9937
354,355,14653,2153,1901,206.226,36.8353,53.1647,99.9509
355,356,1856,1391,1861,204.478,13.5731,76.4269,99.9865
356,357,11611,124,1917,211.825,19.1817,70.8183,99.8649
357,358,2421,585,1867,32.8506,63.1244,26.8756,99.9953
358,359,1426,24,1882,219.55900000000003,23.0583,66.9417,99.706
359,360,7131,1824,1887,34.6592,2.5356,87.4644,99.995
360,361,34614,2677,1984,41.2905,16.5865,73.4135,99.9434
361,362,2082,2209,1891,203.989,61.1258,28.8742,99.9953
362,363,3763,2736,1903,41.7334,4.23147,85.7685,99.9315
363,364,45646,311,2027,331.472,84.7648,5.23519,99.798
364,365,38876,3279,2019,211.555,43.3519,46.6481,95.0618
365,366,41230,1839,2075,30.3422,20.808000000000003,69.192,99.8691
366,367,8533,2828,1933,209.2,65.2997,24.7003,99.9946
367,368,11307,470,1964,40.7632,67.3737,22.6263,99.9131
368,369,35352,1256,2024,30.3118,8.11545,81.8846,99.7164
369,370,1676,1737,1924,210.011,14.2604,75.7396,99.9908
370,371,1494,1777,1930,211.178,7.720089999999999,82.2799,99.9796
371,372,6851,2912,1962,218.727,6.85265,83.1473,99.8205
372,373,1039,26,1931,40.1049,63.6034,26.3966,99.9144
373,374,25205,3009,2028,23.7162,79.2407,10.7593,91.5442
374,375,1310,2531,1955,203.185,61.2977,28.7023,99.988
375,376,2328,2282,1960,222.611,1.92352,88.0765,99.9946
376,377,50282,1589,2037,33.3415,20.8025,69.1975,89.6034
377,378,43750,81,2165,235.084,67.5534,22.4466,99.8178
378,379,7597,1059,2029,41.3879,55.6879,34.3121,99.9229
379,380,545,1230,1984,32.1622,3.16586,86.8341,99.9398
380,381,700,2175,1998,25.9033,35.98,54.02,99.9928
381,382,34897,2022,2125,309.534,87.7402,2.25984,99.9227
382,383,780,463,2051,54.1758,13.0169,76.9831,99.9686
383,384,8682,757,2097,13.3722,64.5075,25.4925,99.9607
384,385,9973,2678,2083,209.758,56.4109,33.5891,99.9952
385,386,12174,2781,2109,220.519,65.9467,24.0533,99.9814
386,387,10240,1308,2114,214.039,55.3286,34.6714,99.9626
387,388,1012,2545,2070,222.902,7.3826800000000015,82.6173,99.9971
388,389,1959,3163,2084,36.3407,8.20629,81.7937,99.9896
389,390,17613,647,2185,206.015,27.0188,62.9812,99.799
390,391,7805,172,2134,215.943,28.0789,61.9211,99.99
391,392,23328,3038,2141,36.4405,45.0604,44.9396,99.9545
392,393,1189,2357,2094,29.5428,66.4874,23.5126,99.9853
393,394,1353,3335,2106,215.19,43.5355,46.4645,99.9307
394,395,1629,2586,2109,317.283,77.7066,12.2934,99.9907
395,396,8099,2513,2128,44.1651,11.4266,78.5734,99.8877
396,397,561958,1124,2731,212.463,2.13086,87.8691,53.5424
397,398,2435,674,2130,216.66,3.82059,86.1794,99.995
398,399,2276,722,2113,213.47,25.108,64.892,99.992
399,400,503,1566,2105,218.759,83.4645,6.53546,99.8909
400,401,16128,2250,2149,31.1619,7.367210000000001,82.6328,99.9876
401,402,1726,104,2139,214.825,28.8562,61.1438,99.9742
402,403,13127,2885,2174,37.6609,9.41212,80.5879,99.9912
403,404,6048,310,2150,33.8037,24.1555,65.8445,99.993
404,405,1333,546,2131,29.2862,52.0033,37.9967,99.9861
405,406,141179,1540,2289,213.866,38.814,51.18600000000001,89.6464
406,407,9766,2412,2176,227.005,8.12782,81.8722,99.9934
407,408,1499,1106,2138,353.593,82.9317,7.068289999999998,99.9927
408,409,14263,1217,2192,19.911,51.6233,38.3767,99.8022
409,410,1260,3171,2151,214.585,13.229,76.771,99.995
410,411,19905,2606,2204,205.831,52.5444,37.4556,99.9903
411,412,6494,1921,2217,214.607,33.5206,56.4794,99.926
412,413,38009,445,2243,24.3437,75.3265,14.6735,97.5756
413,414,25621,3255,2247,45.6014,4.85471,85.1453,99.9653
414,415,3898,3354,2177,217.1,73.1516,16.8484,99.95
415,416,948,3289,2159,255.803,76.2326,13.7674,99.9948
416,417,1670,239,2169,37.7162,80.8884,9.11162,99.991
417,418,1384,739,2163,31.6821,8.39407,81.6059,99.9939
418,419,7141,2762,2196,208.754,67.9113,22.0887,99.9956
419,420,26497,1090,2264,212.35,8.69565,81.3044,99.7149
420,421,1790,2499,2185,50.7874,26.8453,63.1547,99.9958
421,422,6293,755,2225,16.5209,64.43,25.57,99.981
422,423,33061,3053,2291,213.545,32.4621,57.5379,99.8659
423,424,11896,2276,2224,45.9436,30.5648,59.4352,99.9952
424,425,12608,285,2254,222.289,12.2441,77.7559,99.9881
425,426,2805,2966,2231,44.43,48.8715,41.1285,99.9458
426,427,18996,2123,2266,220.472,29.1614,60.8386,99.9887
427,428,970,3383,2220,43.7068,11.9161,78.0839,99.8976
428,429,5692,2491,2263,43.5752,21.3389,68.6611,99.9688
429,430,2391,837,2238,33.3345,24.0225,65.9775,99.9939
430,431,64174,2834,2381,41.747,24.1291,65.8709,99.9714
431,432,5663,2884,2269,230.686,1.72197,88.27799999999998,99.8966
432,433,1219,1859,2243,28.3865,26.5129,63.4871,99.9873
433,434,6260,3367,2318,54.0269,84.4749,5.5251199999999985,99.9429
434,435,180040,2411,2861,38.3325,6.6669100000000014,83.3331,82.2546
435,436,1967,1999,2282,43.0847,3.0308,86.9692,99.9523
436,437,5623,1223,2294,156.714,86.5622,3.43784,99.9683
437,438,185450,1962,2484,218.471,27.7443,62.2557,26.8547
438,439,912,542,2271,28.1589,80.5578,9.44221,99.993
439,440,10295,468,2341,219.098,14.0719,75.9281,99.9419
440,441,20741,2271,2349,200.801,58.6109,31.3891,99.9909
441,442,835,745,2288,37.074,58.2085,31.7915,99.9965
442,443,3150,2610,2338,36.7544,12.0009,77.9991,99.4584
443,444,3726,155,2319,223.913,27.4562,62.5438,99.9749
444,445,1268,1313,2296,215.719,28.6626,61.3374,99.9978
445,446,1968,3157,2313,204.751,25.0687,64.9313,99.9819
446,447,971,2568,2299,34.3701,6.81387,83.1861,99.9897
447,448,1514,3020,2308,223.983,63.9527,26.0473,99.9952
448,449,3403,1167,2336,32.1162,37.1133,52.8867,99.9976
449,450,5073,1313,2345,39.4993,16.2775,73.7225,99.9877
450,451,3847,218,2345,32.4743,83.7491,6.25091,99.9946
451,452,6332,2553,2364,231.565,41.1578,48.8422,99.9945
452,453,8977,3304,2391,47.4661,84.2476,5.75245,99.9902
453,454,14142,3188,2396,211.269,67.513,22.487,99.9671
454,455,14640,247,2416,217.359,25.0033,64.9967,99.9605
455,456,1271,101,2371,41.2389,17.2076,72.7924,99.9551
456,457,2323,3031,2398,44.1825,51.8506,38.1494,99.9971
457,458,2112,167,2387,41.288,2.04305,87.9569,99.992
458,459,788,2654,2382,28.3752,41.282,48.718,99.9987
459,460,965,1049,2398,36.9672,33.6281,56.3719,99.9918
460,461,4308,2654,2422,214.83,66.1179,23.8821,99.9849
461,462,2468,3120,2425,43.0283,48.5129,41.4871,99.9873
462,463,1419,2592,2415,210.585,57.7353,32.2647,99.9942
463,464,3036,3085,2444,214.301,65.1054,24.8946,99.976
464,465,7008,65,2440,40.5839,4.9344,85.0656,99.5732
465,466,757,383,2407,36.5568,86.4913,3.5086699999999995,99.9834
466,467,36064,347,2502,218.086,0.237999,89.762,96.8472
467,468,34246,2757,2516,29.9921,27.3144,62.6856,99.9758
468,469,597,124,2443,352.867,77.1782,12.8218,99.9919
469,470,6479,2321,2463,27.952,27.0523,62.9477,99.9957
470,471,541,13,2451,36.7596,4.80357,85.1964,99.9381
471,472,5814,3242,2473,35.7034,8.23086,81.7691,99.971
472,473,33347,1380,2543,216.667,1.7756,88.2244,71.9189
473,474,17459,2577,2527,39.219,35.9093,54.0907,99.9504
474,475,4828,3336,2486,134.107,82.2298,7.77021,99.9901
475,476,567,3372,2456,131.463,82.9047,7.09532,99.9082
476,477,11243,707,2523,251.93400000000003,71.0125,18.9875,99.8147
477,478,19294,559,2553,220.299,7.73758,82.2624,99.9819
478,479,3424,3291,2520,200.995,71.2941,18.7059,99.9924
479,480,880,115,2493,38.5145,10.3449,79.6551,99.9716
480,481,2852,30,2529,46.8529,12.9348,77.0652,99.5412
481,482,13875,3085,2549,34.7952,65.9749,24.0251,99.9158
482,483,80413,194,2700,38.306,16.3594,73.6406,99.7835
483,484,7540,1775,2557,220.99,42.0248,47.9752,99.9915
484,485,67658,3239,2727,45.5002,20.4268,69.5732,93.4169
485,486,2141,2911,2563,211.391,68.461,21.539,99.8728
486,487,3548,775,2573,216.321,74.854,15.146,99.9642
487,488,8238,3335,2600,34.3201,42.941,47.059,99.8931
488,489,508,1843,2546,24.4326,37.0062,52.9938,99.9984
489,490,140976,2810,2784,222.567,11.3708,78.6292,97.6899
490,491,140210,1882,2818,319.195,84.4846,5.51537,70.1615
491,492,87966,444,2787,214.916,51.1713,38.8287,90.7475
492,493,16611,844,2640,7.01922,77.7512,12.2488,99.987
493,494,11855,1194,2649,201.141,14.8311,75.1689,99.9655
494,495,9494,679,2632,26.8221,8.513860000000001,81.4861,99.9789
495,496,1679,2516,2604,193.393,71.4535,18.5465,99.99
496,497,637,7,2605,39.8512,15.9454,74.0546,99.9639
497,498,10861,3097,2653,40.3804,15.638,74.362,99.9306
498,499,9945,1493,2662,223.472,30.0434,59.9566,99.9827
499,500,14059,2207,2674,199.673,73.1296,16.8704,99.9492
500,501,5041,2327,2655,217.377,9.16916,80.8308,99.9932
501,502,6243,1627,2644,33.0922,66.7838,23.2162,99.9907
502,503,4045,1259,2656,41.2263,37.1518,52.8482,99.9902
503,504,2146,3016,2646,230.956,68.962,21.038,99.985
504,505,6416,733,2675,221.012,5.16291,84.8371,99.9907
505,506,12513,595,2695,30.2366,32.1084,57.8916,99.9964
506,507,5941,1345,2663,229.681,22.9883,67.0117,99.9539
507,508,757,1421,2646,37.5884,8.34658,81.6534,99.9959
508,509,4528,1144,2697,222.522,30.7181,59.2819,99.9964
509,510,510,2529,2698,22.2486,4.53199,85.46799999999998,99.6532
510,511,14530,2578,2744,39.0136,33.3885,56.6115,99.9065
511,512,905,2004,2689,219.088,26.5095,63.4905,99.9971
512,513,887,10,2725,40.1006,16.2003,73.7997,99.9423
513,514,4973,2357,2735,194.30900000000003,72.8748,17.1252,99.9059
514,515,7674,799,2741,41.8089,53.7186,36.2814,99.9699
515,516,26958,2222,2791,34.1547,5.22305,84.777,99.9082
516,517,807,1005,2715,5.85918,79.5099,10.4901,99.9956
517,518,2554,92,2734,40.1368,17.6724,72.3276,99.9382
518,519,1093,44,2728,44.7479,18.698,71.30199999999998,99.9774
519,520,2988,694,2755,221.093,49.9387,40.0613,99.7624
520,521,690,339,2750,36.8533,2.39117,87.6088,99.9978
521,522,1339,903,2761,37.3027,52.1907,37.8093,99.9755
522,523,30465,2976,2998,38.145,5.7724,84.2276,95.8331
523,524,8509,86,2852,213.003,42.5313,47.4687,99.8026
524,525,27813,3232,2933,40.338,9.69151,80.3085,98.4015
525,526,537,710,2793,34.7694,51.9418,38.0582,99.9001
526,527,17179,1352,2882,53.9566,54.9309,35.0691,99.9858
527,528,2900,3355,2858,72.3251,82.71600000000002,7.28405,99.9594
528,529,1314,2592,2819,31.7238,8.82519,81.1748,99.9924
529,530,791,7,2871,212.584,41.2707,48.7293,99.9269
530,531,2139,2570,2852,33.6125,34.4712,55.5288,99.998
531,532,2663,3082,2863,29.0509,60.7224,29.2776,99.9973
532,533,4155,1631,2883,38.1671,49.7544,40.2456,99.9909
533,534,7656,2159,2899,40.1211,19.8467,70.1533,99.991
534,535,2639,1913,2901,219.674,38.8245,51.1755,99.9885
535,536,4851,2253,2914,220.427,40.6371,49.3629,99.9759
536,537,1154,3122,2912,37.5365,23.3164,66.6836,99.992
537,538,1315,3027,2901,39.1995,60.6954,29.3047,99.991
538,539,1251,42,2907,218.825,44.652,45.348,99.8928
539,540,63922,570,3030,217.549,29.516,60.484,96.5546
540,541,43529,2201,3025,23.5398,55.6212,34.3788,99.4468
541,542,1358,3058,2916,218.978,4.52913,85.4709,99.9458
542,543,2596,1225,2925,220.025,23.473000000000006,66.527,99.996
543,544,3657,712,2930,226.278,43.0131,46.9869,99.9949
544,545,73325,2622,3089,296.367,82.7499,7.250139999999999,99.6858
545,546,60162,3160,3111,42.353,10.4897,79.5103,76.178
546,547,1148,1837,2933,30.1738,11.9975,78.0025,99.9786
547,548,1844,1883,2953,218.849,10.9827,79.0173,99.3179
548,549,1649,38,2964,54.3976,64.3887,25.6113,99.9772
549,550,7507,2911,2991,26.9067,51.9399,38.0601,99.9866
550,551,52109,291,3057,38.3863,12.9619,77.0381,99.883
551,552,1547,114,2968,211.907,44.8193,45.1807,99.7702
552,553,3014,737,2978,212.24400000000003,36.2486,53.7514,99.9863
553,554,502,2303,2960,33.0989,34.3959,55.6041,99.9937
554,555,967,1331,2976,16.4508,79.7911,10.2089,99.9768
555,556,3133,89,3021,45.597,61.4612,28.5388,99.8918
556,557,1451,1025,3011,39.3827,65.3101,24.6899,99.8749
557,558,1435,39,3018,53.5112,63.2156,26.7844,99.9113
558,559,930,3375,3020,44.137,69.3376,20.6624,99.9676
559,560,3775,2841,3047,42.0755,16.4064,73.5936,99.9696
560,561,1060,3340,3024,40.781,67.9199,22.0801,99.9854
561,562,7861,132,3098,28.1039,33.4573,56.5427,99.956
562,563,8612,1071,3091,28.4381,23.028,66.972,99.9813
563,564,6031,1224,3102,240.301,69.8806,20.1194,99.3586
564,565,9248,3321,3107,340.56699999999995,87.1061,2.89388,99.9363
565,566,45707,2005,3180,222.333,67.0619,22.9381,55.4996
566,567,592,205,3073,211.639,53.0215,36.9785,99.9393
567,568,37962,1690,3174,241.659,75.4556,14.5444,99.8694
568,569,3570,1162,3095,223.919,66.1662,23.8338,99.9976
569,570,8579,1761,3121,220.344,11.6863,78.3137,99.9169
570,571,125794,829,3345,215.407,61.9866,28.0134,43.0545
571,572,17937,765,3153,225.579,59.1613,30.8387,99.9966
572,573,2342,1906,3110,223.481,58.5802,31.4198,99.981
573,574,512,44,3105,222.33,48.2785,41.7215,99.9517
574,575,1116,1490,3122,223.166,49.8508,40.1492,99.9919
575,576,5572,1566,3144,292.6690000000001,84.7821,5.21785,99.9951
576,577,2116,2201,3129,29.6957,56.2656,33.7344,99.9952
577,578,2361,2295,3135,215.867,24.2626,65.7374,99.9964
578,579,12814,1201,3216,1.74371,74.1525,15.8475,99.7155
579,580,3362,2885,3158,295.385,73.9339,16.0661,99.9638
580,581,1253,56,3138,46.2847,59.1225,30.8775,99.9383
581,582,21219,2192,3232,222.693,8.12934,81.8707,99.9884
582,583,11259,2727,3203,22.6496,80.5294,9.4706,99.9821
583,584,9907,3054,3191,38.2387,12.6639,77.3361,99.9983
584,585,2769,561,3167,216.29,58.2784,31.7216,99.9718
585,586,15993,1098,3224,197.265,8.2169,81.7831,99.9863
586,587,1114,2329,3176,21.4324,57.0629,32.9371,99.9742
587,588,3812,1473,3183,212.978,32.9379,57.0621,99.9441
588,589,8078,2849,3213,40.757,17.2217,72.7783,99.992
589,590,18899,347,3233,28.628,37.4707,52.5293,99.9961
590,591,973,2223,3178,23.0735,56.3221,33.6779,99.9959
591,592,977,110,3176,208.113,61.1641,28.8359,99.9764
592,593,144725,301,3493,213.771,5.79562,84.2044,84.971
593,594,1416,499,3195,30.4651,31.6909,58.3091,99.9957
594,595,1361,3335,3186,27.4763,59.8528,30.1472,99.9928
595,596,1067,37,3195,45.7364,64.9255,25.0745,99.9668
596,597,1591,84,3204,209.919,61.8273,28.1727,99.9378
597,598,1451,1519,3223,213.829,0.693565,89.3064,99.8334
598,599,4659,1631,3256,230.765,49.7512,40.2488,99.9432
599,600,11929,3328,3274,43.856,12.1057,77.8943,99.9676
600,601,81316,2921,3464,46.6872,81.7831,8.21693,83.3247
601,602,519,33,3230,48.3466,65.7835,24.2165,99.9701
602,603,1027,2773,3252,36.9949,4.39128,85.6087,99.8993
603,604,16105,3174,3312,290.448,76.6278,13.3722,99.9135
604,605,4543,1286,3266,208.661,6.641089999999998,83.3589,99.9914
605,606,6103,2548,3272,249.065,77.8479,12.1521,99.9931
606,607,5531,2784,3290,217.527,83.4208,6.57918,99.9743
607,608,19935,1806,3353,224.345,49.1573,40.8427,99.7248
608,609,8791,2059,3298,34.9689,22.2315,67.7685,99.7478
609,610,1291,1492,3281,220.74400000000003,21.4891,68.5109,99.9951
610,611,21809,494,3351,215.216,26.5346,63.4654,99.8719
611,612,1014,2625,3278,31.0398,82.0059,7.99414,99.8418
612,613,71709,2634,3460,38.4841,1.54483,88.4552,99.8248
613,614,900,2873,3280,207.759,80.9271,9.07285,99.9847
614,615,747,2712,3278,34.8471,9.43459,80.5654,99.9949
615,616,8347,882,3318,32.4598,31.9854,58.0146,99.9945
616,617,8865,1053,3308,1.19206,73.6419,16.3581,99.9962
617,618,2338,3016,3313,41.2346,15.1958,74.8042,99.9981
618,619,9077,3091,3335,278.643,75.7736,14.2264,99.99
619,620,29805,113,3390,36.986,17.6417,72.3583,99.6517
620,621,71313,1629,3436,212.264,43.7422,46.2578,99.925
621,622,2110,1515,3316,28.8098,71.972,18.028,99.92
622,623,1606,2169,3310,219.55,22.3243,67.6757,99.9537
623,624,30151,1159,3399,33.6487,5.2035,84.7965,99.8682
624,625,3607,796,3327,226.655,55.6539,34.3461,99.9972
625,626,1287,2834,3314,314.512,83.6223,6.37775,99.9869
626,627,30069,2058,3387,35.7293,55.7884,34.2116,99.8356
627,628,1956,754,3339,233.237,68.2288,21.7712,99.996
628,629,2217,1282,3323,239.732,68.6459,21.3541,99.9906
629,630,1208,2508,3343,245.544,77.4471,12.5529,99.9283
630,631,9053,672,3362,22.5914,45.185,44.815,99.9973
631,632,1742,2132,3349,32.4563,1.96751,88.0325,99.9941
632,633,7791,3348,3382,223.366,4.16235,85.8376,99.9774
633,634,26347,3112,3444,224.29,8.233369999999999,81.7666,99.9186
634,635,610,1301,3359,40.5624,68.9611,21.0389,99.9959
635,636,3885,2696,3384,215.187,21.3211,68.6789,99.9973
636,637,711,2475,3377,36.1587,2.30276,87.6972,99.9871
637,638,6335,1033,3398,195.432,3.11092,86.8891,99.9933
638,639,590,733,3383,233.028,68.067,21.933000000000003,99.9987
639,640,108890,1190,3583,349.256,79.7615,10.2385,83.8223
640,641,1241,782,3384,25.3138,23.4489,66.5511,99.9932
641,642,5079,3267,3414,13.0893,75.3758,14.6242,99.997
642,643,31816,2057,3495,34.7699,14.1128,75.8872,86.1418
643,644,1555,2383,3398,31.6874,57.0817,32.9183,99.9961
644,645,1097,746,3414,25.0729,24.4547,65.5453,99.9942
645,646,19000,2402,3475,35.7298,53.614,36.386,99.9657
646,647,17952,630,3471,26.66,22.0639,67.9361,69.9871
647,648,637,320,3425,43.729,51.8842,38.1158,99.9869
648,649,646,2271,3436,224.088,70.3396,19.6604,99.9922
649,650,8272,3310,3473,214.751,15.3404,74.6596,99.953
650,651,4146,514,3490,235.688,74.2682,15.7318,99.899
651,652,5442,2255,3493,35.2859,34.2413,55.7587,99.9932
652,653,19199,773,3533,262.461,75.4484,14.5516,99.7482
653,654,12710,1756,3525,39.2286,69.3397,20.6603,99.847
654,655,9204,50,3533,40.5375,59.2152,30.7848,99.8146
655,656,14854,1441,3577,232.976,69.8067,20.1933,96.2644
656,657,10784,1913,3526,212.127,66.9307,23.0693,99.2459
657,658,12123,3342,3568,214.715,2.10934,87.8907,99.7725
658,659,43056,2477,3650,216.707,11.706,78.294,99.9431
659,660,14819,2313,3590,213.029,25.0205,64.9795,99.7123
660,661,60845,3220,3707,46.7089,18.0466,71.9534,99.9206
661,662,8150,511,3562,197.832,67.3077,22.6923,99.9913
662,663,8372,659,3602,204.626,14.3458,75.6542,99.9071
663,664,2474,1952,3574,216.266,37.1631,52.8369,99.9393
664,665,5298,3259,3597,208.747,79.7042,10.2958,99.956
665,666,19309,1840,3656,37.8752,25.572,64.428,99.8112
666,667,16584,1569,3682,26.5197,72.0049,17.9951,99.9586
667,668,2313,2782,3588,211.849,17.5451,72.4549,99.7793
668,669,26823,2155,3656,35.0813,52.2065,37.7935,99.9948
669,670,858,1886,3579,30.0568,46.1577,43.8423,99.9866
670,671,6052,578,3620,18.2007,70.8419,19.1581,99.9953
671,672,3316,763,3611,5.53587,88.8955,1.10447,99.9898
672,673,1391,1995,3600,216.372,11.9909,78.0091,99.9724
673,674,8770,42,3668,40.2804,44.9482,45.0518,99.7255
674,675,17816,1984,3673,223.58900000000003,71.2772,18.7228,99.8767
675,676,7194,2733,3663,242.728,71.9213,18.0787,99.9731
676,677,34795,1393,3762,27.2778,34.1211,55.8789,95.3618
677,678,3274,1744,3644,215.894,74.3225,15.6775,99.9823
678,679,619,2788,3627,208.928,32.4965,57.5035,99.9947
679,680,6708,3061,3701,217.859,2.9602,87.0398,98.7729
680,681,1014,1618,3633,225.613,21.7703,68.2297,99.9928
681,682,15426,1693,3715,37.0713,1.49473,88.5053,99.964
682,683,553,2853,3632,256.871,71.5238,18.4762,99.9876
683,684,5943,1279,3669,44.6738,17.4372,72.5628,99.7624
684,685,7511,141,3681,35.2823,2.55158,87.4484,99.9768
685,686,16882,285,3743,217.061,28.3985,61.6015,99.955
686,687,40295,2980,3816,32.0314,31.3672,58.6328,60.0001
687,688,19626,2834,3751,46.4983,8.632819999999999,81.3672,99.9063
688,689,4545,820,3702,37.7613,48.7652,41.2348,99.9393
689,690,12517,2240,3742,220.708,70.2603,19.7397,99.8569
690,691,544,3013,3656,37.4115,47.2416,42.7584,99.9968
691,692,29796,2663,3762,231.256,54.8514,35.1486,99.9943
692,693,25605,676,3713,19.8531,70.3265,19.6735,99.9771
693,694,1074,3368,3694,225.662,0.998131,89.0019,99.9827
694,695,1748,2360,3694,39.7109,27.5381,62.4619,99.9969
695,696,13643,1302,3769,216.806,61.8022,28.1978,99.9468
696,697,995,2980,3683,21.1709,45.9772,44.0228,99.9564
697,698,1528,3161,3714,196.477,78.8674,11.1326,99.9923
698,699,6036,914,3726,121.878,84.5288,5.47117,99.9921
699,700,814,1781,3706,211.018,72.8687,17.1313,99.991
700,701,5029,2316,3741,214.198,20.9333,69.0667,99.9911
701,702,1851,46,3744,217.558,10.2931,79.7069,99.9207
702,703,549,541,3744,263.21,88.4655,1.5344799999999998,99.9886
703,704,5236,2384,3774,215.046,63.7595,26.2405,99.9849
704,705,2078,167,3769,218.58,26.9974,63.0026,99.9771
705,706,8775,2091,3775,45.3642,22.4175,67.5825,99.9962
706,707,514,564,3745,255.454,87.8491,2.15086,99.9946
707,708,577,1775,3744,40.5305,26.5904,63.4096,99.9871
708,709,2193,211,3756,38.601,6.33309,83.6669,99.9958
709,710,2850,109,3773,40.2197,50.6742,39.3258,99.9324
710,711,17614,1863,3806,70.4824,67.7654,22.2346,99.9813
711,712,2546,3093,3774,219.389,25.6308,64.3692,99.9913
712,713,744,860,3762,205.748,59.87600000000001,30.124,99.9977
713,714,4039,2003,3787,50.6578,77.8117,12.1883,99.9908
714,715,5664,1178,3790,43.5627,12.6984,77.3016,99.9738
715,716,2587,577,3777,245.927,75.2983,14.7017,99.9966
716,717,691,813,3774,26.1801,21.5707,68.4293,99.9922
717,718,3046,1587,3775,28.6426,22.9933,67.0067,99.9962
718,719,830,790,3789,26.2206,21.4317,68.5683,99.9905
719,720,11866,1502,3827,209.237,22.5807,67.4193,99.9875
720,721,3856,706,3794,143.424,89.4389,0.561103,99.8248
721,722,29829,967,3881,212.49400000000003,29.3122,60.6878,72.9464
722,723,2847,59,3812,359.16,80.4416,9.55839,99.8808
723,724,7488,810,3859,167.317,86.6288,3.37116,99.9394
724,725,90227,1832,3964,206.449,51.9359,38.0641,74.815
725,726,1135,395,3792,221.351,74.132,15.868,99.9898
726,727,9205,2505,3824,35.6082,59.9963,30.0037,99.9967
727,728,1704,323,3802,170.243,72.8292,17.1708,99.9947
728,729,34551,2216,3919,219.757,19.7409,70.2591,99.9622
729,730,15891,571,3864,35.3278,24.7961,65.2039,99.917
730,731,4653,1112,3844,336.791,88.0533,1.94672,100.002
731,732,838,24,3816,220.962,12.5534,77.4466,99.9647
732,733,5116,1178,3854,212.786,1.3963299999999998,88.6037,99.9527
733,734,2043,1058,3818,219.083,33.8264,56.1736,99.9968
734,735,2986,394,3821,220.153,73.9477,16.0523,99.9873
735,736,23881,337,3880,47.9734,65.7982,24.2018,99.9048
736,737,515,127,3814,210.895,14.8899,75.1101,99.9929
737,738,2126,473,3826,235.37,86.7369,3.26312,99.9901
738,739,2821,3115,3843,288.367,79.6366,10.3634,99.9965
739,740,4721,670,3843,244.312,75.8812,14.1188,99.9971
740,741,1135,1356,3824,225.608,74.0381,15.9619,99.9973
741,742,20195,2365,3911,29.8812,71.3956,18.6044,99.858
742,743,3258,2767,3858,29.5043,70.5355,19.4645,99.9924
743,744,1587,2601,3838,215.699,21.748,68.252,99.9963
744,745,17160,2076,3892,30.2052,71.9934,18.0066,99.9843
745,746,5381,731,3871,192.523,88.0297,1.9703,99.962
746,747,1010,3290,3844,210.65,77.3754,12.6246,99.9894
747,748,16985,116,3886,215.209,0.600037,89.4,99.7096
748,749,970,2022,3839,40.387,29.3176,60.6824,99.9906
749,750,3530,1540,3896,33.0248,47.7707,42.2293,99.9431
750,751,71439,3221,4065,214.524,73.492,16.508,99.7883
751,752,1214,1246,3854,224.652,1.30701,88.693,99.931
752,753,16932,2867,3931,212.845,27.3673,62.6327,99.9725
753,754,562,1042,3859,16.0395,39.2133,50.7867,99.9977
754,755,27703,2531,3939,220.675,11.3124,78.6876,99.8845
755,756,625,3352,3870,220.081,76.9328,13.0672,99.9581
756,757,5081,2673,3892,35.5169,43.8213,46.1787,99.9861
757,758,13025,1444,3944,219.957,62.7776,27.2224,99.9896
758,759,913,1853,3884,41.9185,77.5318,12.4682,99.9894
759,760,2687,1236,3901,57.4258,89.4385,0.561451,99.9923
760,761,2390,3288,3898,30.7412,53.8346,36.1654,99.894
761,762,1382,892,3905,24.4105,18.4467,71.5533,99.9808
762,763,3210,1157,3920,165.455,89.3324,0.667639,99.9844
763,764,1537,3330,3916,205.298,75.7492,14.2508,99.8645
764,765,11202,40,4007,32.1178,70.6627,19.3373,99.8705
765,766,20306,2773,3986,209.99,60.2986,29.7014,97.534
766,767,3740,536,3937,214.584,10.6741,79.3259,99.9918
767,768,2107,1316,3943,297.398,80.9452,9.05475,99.9955
768,769,38155,324,4002,199.858,85.2281,4.77188,99.7822
769,770,9752,858,3958,240.995,70.9602,19.0398,98.9258
770,771,4525,649,3955,235.553,74.8467,15.1533,99.8595
771,772,3549,1212,3963,216.598,0.872131,89.1279,99.9903
772,773,1748,106,3953,217.263,17.109,72.891,99.744
773,774,3746,3357,3979,29.5479,59.1645,30.8355,99.7877
774,775,9165,3006,3985,219.366,45.977,44.023,99.9932
775,776,2165,709,3965,190.82,83.971,6.028980000000002,99.9828
776,777,1704,72,3966,40.2039,84.7385,5.2615,99.9846
777,778,3776,1117,3970,218.332,80.6538,9.3462,99.9912
778,779,7657,2653,4022,229.123,16.213,73.78699999999998,99.9184
779,780,3676,1511,3995,204.499,20.6156,69.3844,78.9152
780,781,22125,1331,4031,35.6916,29.0715,60.9285,99.9716
781,782,27448,559,4054,225.765,43.45399999999999,46.54600000000001,72.7904
782,783,97956,1492,4170,34.1296,4.65794,85.3421,99.8597
783,784,2559,779,3995,38.3507,16.9104,73.0896,99.9697
784,785,41867,1062,4064,212.261,69.9728,20.0272,99.9753
785,786,3315,2081,4010,219.963,31.8971,58.1029,99.9236
786,787,24685,2918,4095,222.542,11.5837,78.4163,99.7925
787,788,8900,784,4064,324.152,88.5692,1.43081,99.8982
788,789,6873,2246,4038,220.379,72.0338,17.9662,99.7988
789,790,564,732,4011,256.204,77.0069,12.9931,85.9825
790,791,38438,2456,4102,214.781,66.3639,23.6361,99.7784
791,792,8317,3112,4070,217.666,45.7241,44.2759,99.9845
792,793,2111,861,4023,214.518,40.7473,49.2527,99.9891
793,794,3489,488,4036,219.646,46.9886,43.0114,99.9915
794,795,21822,1758,4098,29.2293,39.2626,50.7374,99.9764
795,796,5330,718,4090,38.6607,15.3961,74.6039,99.9134
796,797,2562,908,4058,44.9909,19.4818,70.5182,99.9828
797,798,16944,226,4074,24.3059,78.3711,11.6289,99.9897
798,799,25769,1219,4149,350.374,77.12100000000002,12.879,99.9495
799,800,600,2171,4057,235.396,72.0401,17.9599,99.9882
800,801,29573,2702,4145,49.417,77.2685,12.7315,99.962
801,802,1412,95,4079,41.247,42.8977,47.1023,99.7793
802,803,6928,2128,4112,69.6333,81.5949,8.40513,99.9852
803,804,6194,2306,4117,49.4355,85.5329,4.46708,99.9844
804,805,4122,2221,4102,23.8346,48.6249,41.3751,99.992
805,806,12495,3030,4150,45.804,13.7498,76.2502,99.9973
806,807,775,904,4095,44.3955,19.8639,70.1361,99.9908
807,808,21834,648,4176,223.335,63.1863,26.8137,99.6279
808,809,4211,843,4121,217.786,45.1627,44.8373,99.9933
809,810,1662,33,4104,226.459,47.744,42.256,99.9418
810,811,13777,81,4166,225.622,36.2682,53.7318,99.797
811,812,1451,3349,4126,221.485,48.4638,41.5362,99.3689
812,813,6628,2589,4157,221.171,8.478639999999999,81.5214,99.9949
813,814,2991,981,4155,213.989,64.1038,25.8962,99.9035
814,815,23233,234,4193,212.702,20.9451,69.0549,99.8877
815,816,73066,863,4332,40.716,20.0026,69.9974,75.27
816,817,794,3090,4132,30.9609,45.1924,44.8076,99.9884
817,818,801,407,4136,225.352,65.3846,24.6154,99.989
818,819,673,2376,4142,228.47,74.2151,15.7849,99.9895
819,820,7330,2214,4171,218.717,53.9583,36.0417,99.9964
820,821,93006,3174,4477,37.5525,21.4476,68.5524,88.7772
821,822,7180,776,4192,35.8954,36.0203,53.9797,99.9963
822,823,12277,2033,4180,35.0644,43.0025,46.9975,99.9654
823,824,3517,531,4175,213.822,47.3696,42.6304,99.9957
824,825,33887,431,4275,247.348,86.0994,3.90064,99.9365
825,826,7659,2362,4206,217.648,27.6338,62.3662,99.9743
826,827,53711,1729,4260,27.0941,20.5906,69.4094,99.9764
827,828,1539,2951,4180,209.951,61.3719,28.6281,99.9831
828,829,1173,955,4200,218.265,38.8255,51.1745,99.9826
829,830,600,2788,4195,222.762,44.8273,45.1727,99.985
830,831,4012,1046,4213,217.685,38.0624,51.9376,99.9969
831,832,9491,2551,4237,42.5762,36.4049,53.5951,99.995
832,833,1296,2955,4216,210.035,67.7052,22.2948,99.9551
833,834,1233,568,4208,28.7938,40.094,49.90600000000001,99.9975
834,835,11693,2283,4254,42.7154,35.1252,54.8748,99.9955
835,836,23138,2891,4271,47.7806,48.2932,41.7068,99.9251
836,837,1155,981,4215,212.467,46.8996,43.1004,99.9944
837,838,40869,1976,4365,218.624,15.6936,74.3064,99.8395
838,839,1149,2124,4214,39.1835,66.8348,23.1652,99.9965
839,840,13288,3063,4259,216.216,13.9322,76.0678,99.9963
840,841,5530,2029,4249,225.31,49.3603,40.6397,99.9323
841,842,3541,1265,4243,217.575,18.1029,71.8971,99.9948
842,843,16001,2153,4284,33.0275,14.3643,75.6357,99.9959
843,844,8708,55,4278,53.7616,86.1955,3.80449,99.9166
844,845,64454,1171,4374,39.5203,22.3976,67.6024,99.9883
845,846,5802,590,4288,225.179,65.8424,24.1576,99.9865
846,847,7996,272,4285,228.918,60.272,29.728,99.8422
847,848,530,2473,4244,32.2261,13.2226,76.7774,99.9994
848,849,3837,2734,4264,224.81,45.6168,44.3832,99.9696
849,850,9127,715,4298,221.352,20.1138,69.8862,99.9917
850,851,1812,541,4273,230.948,63.5914,26.4086,99.9942
851,852,17730,3171,4363,215.449,55.9407,34.0593,99.9695
852,853,2459,2473,4285,217.331,27.4624,62.5376,100.0
853,854,16272,2605,4365,22.3647,31.0337,58.9663,99.9698
854,855,2569,150,4300,217.846,49.517,40.483,99.9298
855,856,44131,2374,4379,198.908,80.7238,9.27617,99.5601
856,857,2610,2738,4303,217.043,80.4731,9.52693,99.9416
857,858,1350,2523,4302,270.71,80.5511,9.44892,99.9862
858,859,14070,3028,4370,223.463,52.0141,37.9859,99.9614
859,860,7508,2704,4357,224.672,46.1677,43.8323,99.9652
860,861,2250,1038,4343,209.465,59.6044,30.3956,99.9931
861,862,13836,1525,4372,213.709,53.4361,36.5639,99.9951
862,863,11056,1851,4375,212.947,3.74409,86.2559,99.9776
863,864,13385,2804,4380,32.7945,28.8594,61.1406,99.9716
864,865,2898,631,4351,215.805,64.7864,25.2136,99.9886
865,866,23540,226,4399,54.9408,86.5468,3.45324,99.8505
866,867,59801,129,4500,30.7587,7.0974,82.9026,86.0244
867,868,1543,571,4357,158.599,85.493,4.50698,99.9869
868,869,3328,2902,4378,229.233,49.3654,40.6346,99.98
869,870,42407,447,4480,110.376,81.8813,8.118730000000001,88.4336
870,871,1215,2182,4367,216.129,19.08,70.92,99.986
871,872,88430,2139,4542,35.1527,10.2275,79.7725,84.0616
872,873,7848,1647,4411,219.536,2.86745,87.1326,99.9688
873,874,5308,1766,4411,19.6651,61.1355,28.8645,99.9958
874,875,1541,994,4390,161.118,83.0621,6.9379300000000015,99.9953
875,876,90526,1589,4517,215.759,62.2529,27.7471,78.1804
876,877,1681,618,4404,38.2703,57.5247,32.4753,99.982
877,878,1061,2957,4406,30.0188,79.69,10.31,99.9962
878,879,599,1584,4412,31.5375,54.4077,35.5923,99.996
879,880,13452,2920,4476,38.7596,78.2949,11.7051,99.9309
880,881,15051,984,4500,35.3224,28.8687,61.1313,95.1648
881,882,6166,2710,4444,22.9204,70.6222,19.3778,99.9979
882,883,1114,1701,4432,25.7503,21.1378,68.8622,99.9841
883,884,6059,647,4455,207.22,64.7771,25.2229,99.9567
884,885,1249,2830,4454,47.5796,12.2059,77.7941,99.9951
885,886,54635,2473,4643,222.519,22.7188,67.2812,89.8338
886,887,725,3184,4453,39.2047,79.0776,10.9224,99.9943
887,888,1074,2054,4479,17.817,27.2133,62.7867,99.998
888,889,4670,736,4493,236.087,71.37899999999998,18.621,99.8453
889,890,76302,2745,4600,230.338,50.9414,39.0586,98.1846
890,891,1080,812,4493,212.165,86.2379,3.76208,99.9085
891,892,13122,630,4544,0.00692932,86.4742,3.52578,99.8293
892,893,935,1111,4505,231.147,65.3938,24.6062,99.9449
893,894,58269,1106,4650,205.036,51.5379,38.4621,99.8012
894,895,1280,769,4531,226.81,9.22272,80.7773,99.9829
895,896,26858,849,4595,239.455,64.208,25.792,99.9225
896,897,2107,3344,4559,37.7439,13.2178,76.7822,99.8664
897,898,28154,1485,4673,26.4559,70.2439,19.7561,99.9708
898,899,749,3305,4565,219.163,57.822,32.178000000000004,99.9236
899,900,738,732,4569,35.5596,86.1522,3.84784,99.9546
900,901,923,281,4569,231.971,32.9874,57.0126,99.9966
901,902,6072,1597,4615,34.4197,21.7391,68.2609,99.9492
902,903,695,525,4573,245.847,69.5711,20.4289,99.9958
903,904,8929,1360,4641,212.235,18.1189,71.8811,99.9581
904,905,2629,3256,4588,28.8223,30.8307,59.1693,99.9811
905,906,31008,175,4716,228.529,34.2997,55.7003,99.9762
906,907,2047,2510,4585,12.7969,70.2214,19.7786,99.9951
907,908,21059,2287,4688,27.1619,10.0995,79.9005,99.9686
908,909,1554,486,4591,247.137,66.242,23.758000000000006,99.9579
909,910,4398,1036,4611,31.9856,0.773331,89.2267,99.9755
910,911,26195,494,4688,220.225,28.9777,61.0223,99.9356
911,912,23054,303,4685,10.2228,74.4164,15.5836,99.9796
912,913,11259,629,4646,40.545,1.53757,88.4624,99.9951
913,914,4499,1271,4646,33.3417,56.5725,33.4275,99.9933
914,915,36492,1913,4688,24.3639,82.7286,7.271439999999999,99.9308
915,916,2085,2229,4660,34.8146,33.9483,56.0517,99.9941
916,917,5490,729,4668,216.449,43.2278,46.7722,99.9972
917,918,5621,1189,4689,242.95,82.4702,7.52981,99.9916
918,919,15514,48,4752,188.79,79.102,10.898,99.9439
919,920,5831,1669,4694,219.327,39.8669,50.1331,99.9775
920,921,2167,907,4696,208.575,5.4128,84.5872,99.9315
921,922,16755,790,4732,311.446,77.6364,12.3637,99.9868
922,923,3353,1290,4714,216.596,47.8915,42.1085,99.9867
923,924,587,678,4712,230.373,71.9081,18.0919,99.9934
924,925,1224,1621,4729,271.031,77.2601,12.7399,99.9862
925,926,501,1248,4730,232.938,78.5768,11.4232,99.7551
926,927,4950,2625,4756,220.985,80.6881,9.31193,99.9907
927,928,22898,455,4798,237.155,77.134,12.866,99.9792
928,929,712,861,4750,204.299,27.0823,62.9177,99.9781
929,930,14060,647,4800,29.9617,19.9159,70.0841,99.877
930,931,6649,857,4799,27.8047,32.8626,57.1374,99.7238
931,932,5112,969,4788,41.5067,6.43071,83.5693,99.8979
932,933,643,2477,4788,48.6095,7.9322,82.0678,99.9544
933,934,8056,275,4847,39.2626,3.87405,86.126,99.9501
934,935,6892,131,4869,264.8,74.6044,15.3956,99.9938
935,936,920,746,4839,38.9509,3.70769,86.2923,99.8378
936,937,3940,41,4892,211.154,29.6232,60.3768,99.9455
