,Grain No.,Size [Pixel],center x-coordinate,center y-coordinate,mean azimuth [degree],mean latitude [degree],mean colatitude [degree],Regelungsgrad [%]
0,1,35745,1333,268,313.112,5.29623,84.7038,99.9927
1,2,6402,207,222,130.43,20.1785,69.8215,99.921
2,3,10466,1555,241,300.795,21.5728,68.4272,99.9826
3,4,23807,317,264,130.618,47.5227,42.4773,99.9741
4,5,892,1231,205,310.059,25.859,64.141,99.9853
5,6,5009,1708,220,125.745,50.3079,39.6921,99.4485
6,7,6233,1141,238,302.373,36.666,53.334,99.9926
7,8,11896,2374,255,320.62,51.9767,38.0233,99.9065
8,9,2649,2545,221,134.627,28.355,61.645,99.956
9,10,1682,2668,230,306.808,78.4069,11.5931,99.8454
10,11,5983,2760,232,305.019,1.20773,88.7923,99.9362
11,12,10592,2934,277,310.84,52.4147,37.5853,99.9585
12,13,3750,3008,239,305.527,17.9681,72.0319,99.9568
13,14,1277,2618,232,315.738,11.6036,78.3964,99.9897
14,15,23703,2786,320,296.711,72.7965,17.2035,99.7601
15,16,2028,2476,246,305.441,49.7848,40.2152,99.8774
16,17,1717,2247,233,295.719,25.8464,64.1536,99.9881
17,18,2508,1813,252,304.99,35.5126,54.4874,99.9368
18,19,5061,3087,251,124.507,6.36224,83.6378,99.9346
19,20,11741,3330,262,301.1020000000001,51.5918,38.4082,99.9837
20,21,823,1480,239,309.572,34.4627,55.5373,99.9846
21,22,4241,3187,255,124.444,7.56343,82.4366,99.9733
22,23,3066,449,261,118.79,31.1548,58.8452,99.9912
23,24,828,1669,242,124.411,52.8715,37.1285,99.99
24,25,6001,1093,282,124.442,25.676,64.324,99.988
25,26,2364,2157,259,292.005,51.852,38.148,99.9939
26,27,7386,1999,280,305.915,53.9685,36.0315,98.3539
27,28,8085,501,324,311.071,57.5059,32.4941,65.205
28,29,2189,3457,288,122.865,2.16521,87.8348,99.8958
29,30,6153,3142,320,304.4190000000001,10.8221,79.1779,99.9554
30,31,1076,1889,258,300.395,55.3894,34.6106,99.9458
31,32,1895,2123,280,293.94,54.8386,35.1614,99.9927
32,33,1459,2282,264,113.491,21.8966,68.1034,99.9883
33,34,50682,2529,387,120.129,16.7988,73.2012,99.7144
34,35,12522,1671,303,303.106,39.0894,50.9106,99.9755
35,36,2013,958,286,117.17,42.2816,47.7184,99.9392
36,37,1101,2211,266,297.948,46.4038,43.5962,99.994
37,38,788,1174,272,101.307,79.2146,10.7854,99.9914
38,39,604,2047,262,304.607,21.7657,68.2343,99.9878
39,40,1758,1480,281,303.242,10.9663,79.0337,99.9715
40,41,29080,3280,388,302.961,0.0450134,89.955,99.9209
41,42,14621,1030,349,121.871,46.1297,43.8703,99.855
42,43,6422,1762,328,292.718,14.7153,75.2847,99.9949
43,44,1156,1854,285,109.337,50.0569,39.9431,99.9961
44,45,580,1584,291,302.254,12.2313,77.7687,99.9725
45,46,569,1189,291,301.626,67.9894,22.0106,99.9724
46,47,24314,638,369,297.433,36.1424,53.8576,99.9761
47,48,520,2242,287,112.993,22.6378,67.3622,99.9932
48,49,4034,196,315,132.053,17.3041,72.6959,99.5414
49,50,99157,1732,615,299.777,28.716,61.284,99.0225
50,51,4016,3051,310,128.805,2.51533,87.4847,99.9885
51,52,550,2052,289,127.565,5.78655,84.2134,99.9859
52,53,1225,2286,303,122.29,39.2985,50.7015,99.9835
53,54,5872,2193,361,297.988,5.74684,84.2532,99.7972
54,55,787,1558,315,310.408,34.5835,55.4165,99.9657
55,56,2850,2415,333,125.758,40.6755,49.3245,99.9099
56,57,2337,449,320,122.027,67.188,22.812,99.9858
57,58,3658,741,323,307.634,13.545,76.455,99.9981
58,59,8175,812,359,125.808,0.0862579,89.9137,99.9963
59,60,44784,291,426,299.553,21.1938,68.8062,99.5663
60,61,3117,1948,341,126.001,4.27525,85.7248,99.9801
61,62,11754,1425,376,124.771,3.8736,86.1264,99.9806
62,63,4915,887,363,294.189,50.5012,39.4988,99.7936
63,64,966,1113,327,292.865,70.7909,19.2091,99.9876
64,65,2759,2124,356,291.967,52.2847,37.7153,99.9423
65,66,9892,1530,391,306.108,8.02638,81.9736,99.9191
66,67,893,2278,340,112.39,23.0698,66.9302,99.9866
67,68,3658,2685,379,312.4240000000001,7.06435,82.9356,99.9411
68,69,586,1581,337,115.163,57.9118,32.0882,99.9733
69,70,1817,2904,362,28.925,87.6142,2.38585,99.9821
70,71,8059,2345,389,310.527,51.7693,38.2307,99.9629
71,72,1798,3063,361,111.636,64.3476,25.6524,99.9693
72,73,1180,1142,364,310.818,54.4257,35.5743,99.9809
73,74,1042,1698,361,115.094,23.1985,66.8015,99.9816
74,75,7457,1982,398,308.708,15.6314,74.3686,99.9378
75,76,6665,1274,385,305.726,23.986,66.014,99.9096
76,77,7266,2089,407,126.522,7.2073399999999985,82.7927,99.9914
77,78,4105,553,414,139.194,59.3312,30.6688,99.993
78,79,25134,941,473,121.122,24.8754,65.1246,90.6035
79,80,2185,1621,385,124.756,25.3541,64.6459,99.996
80,81,1964,753,396,306.009,20.1921,69.8079,99.9959
81,82,1297,3462,402,298.6670000000001,1.5300200000000002,88.47,99.9078
82,83,13806,3141,430,183.097,82.416,7.58395,99.9733
83,84,962,217,387,128.63,0.8453219999999999,89.1547,99.9869
84,85,3868,3033,405,303.316,47.549,42.451,99.9422
85,86,16713,2259,464,125.113,34.9144,55.0856,99.9489
86,87,11565,462,494,126.978,30.534,59.466,98.424
87,88,2712,2935,409,309.257,19.174,70.82600000000002,99.9938
88,89,13758,1160,435,288.089,69.7301,20.2699,99.969
89,90,4175,2855,421,306.164,6.11667,83.8833,99.9951
90,91,78443,1187,682,303.198,40.0463,49.9537,99.8742
91,92,6916,1723,434,122.055,54.4222,35.5778,99.9672
92,93,26327,1594,510,123.619,4.03904,85.961,95.3685
93,94,4505,2770,432,298.627,43.1453,46.8547,99.9893
94,95,8653,2996,474,120.674,27.8419,62.1581,99.8506
95,96,1694,499,434,307.402,5.77125,84.2288,99.9731
96,97,79008,718,608,127.374,22.3773,67.6227,89.4168
97,98,20054,1935,504,293.793,29.1539,60.8461,99.9036
98,99,12502,2139,503,304.308,8.32112,81.6789,75.8426
99,100,12745,2874,509,134.494,37.282,52.718,99.9309
100,101,4282,1442,469,305.408,13.2383,76.7617,99.9709
101,102,1469,2692,451,124.336,8.96603,81.03399999999998,99.922
102,103,19837,2692,512,311.246,71.6131,18.3869,99.7682
103,104,5604,1211,512,121.624,6.83028,83.1697,99.9558
104,105,45553,2444,601,119.497,15.3401,74.6599,99.8128
105,106,49832,3238,589,122.777,10.7417,79.2583,45.9817
106,107,1439,1095,501,313.035,25.4104,64.5896,99.9463
107,108,2135,3072,512,131.923,46.2852,43.7148,99.9924
108,109,1918,1466,514,291.452,67.8974,22.1026,99.5591
109,110,33416,1007,613,104.936,61.5175,28.4825,99.6808
110,111,2850,1333,523,301.282,6.43667,83.5633,99.9838
111,112,2300,144,548,305.991,24.2298,65.7702,99.9691
112,113,6064,249,559,119.619,8.68223,81.3178,99.9282
113,114,38773,433,634,109.896,26.2484,63.7516,99.0517
114,115,6444,1407,565,304.871,28.9262,61.0738,99.9783
115,116,93845,2798,718,307.678,40.0492,49.9508,99.9243
116,117,2902,2284,558,305.933,2.80877,87.1912,99.9693
117,118,3196,2051,572,310.773,44.2266,45.7734,99.9894
118,119,781,1474,560,97.1731,60.1287,29.8713,99.9939
119,120,1929,190,577,27.8339,87.5075,2.4925,99.9802
120,121,561,2963,567,128.957,39.0378,50.9622,99.9907
121,122,15846,1349,637,106.874,76.4276,13.5724,99.9836
122,123,4197,2664,580,314.41,48.7061,41.2939,99.9881
123,124,1491,2137,571,8.51181,86.6511,3.34887,99.9924
124,125,10240,1489,651,314.087,22.7529,67.2471,59.0417
125,126,1519,552,586,307.876,18.2319,71.7681,99.9959
126,127,14576,1869,750,304.214,4.8093,85.1907,99.812
127,128,9679,859,634,98.0012,61.476000000000006,28.524,99.9835
128,129,21709,2184,655,117.983,32.4865,57.5135,99.9746
129,130,11989,1948,649,296.01,18.6627,71.3373,99.955
130,131,928,2100,598,300.086,39.8724,50.1276,99.9934
131,132,666,1912,590,287.534,84.2017,5.79829,99.9924
132,133,12386,267,663,216.448,79.1353,10.8647,99.9531
133,134,5720,777,638,299.01,53.2091,36.7909,99.9961
134,135,6420,599,652,126.515,1.26894,88.7311,99.9968
135,136,9898,3035,674,128.901,46.2368,43.7632,99.9352
136,137,4325,2067,645,117.332,19.2574,70.7426,99.99
137,138,1862,146,646,308.106,24.8858,65.1142,99.8234
138,139,891,1435,656,298.046,68.8069,21.1931,99.9575
139,140,846,3125,661,239.288,86.0956,3.90437,99.9904
140,141,601,2286,660,333.267,71.8705,18.1295,99.9816
141,142,1308,3095,692,253.077,84.7404,5.2596300000000005,99.9932
142,143,1281,2019,682,119.767,1.30083,88.6992,99.9897
143,144,2478,2527,705,302.961,36.8288,53.1712,99.9891
144,145,1336,2302,689,117.588,14.8959,75.1041,99.9903
145,146,1460,2340,693,309.656,3.68652,86.3135,99.984
146,147,10929,209,739,138.501,66.704,23.296,99.9372
147,148,3945,377,712,136.709,66.063,23.937,99.8986
148,149,2496,3152,702,127.503,54.0004,35.9996,99.9893
149,150,13678,2035,752,307.086,17.6759,72.3241,99.9705
150,151,18973,2264,775,334.676,72.679,17.320999999999998,99.9296
151,152,39823,3224,801,305.547,57.6011,32.3989,99.878
152,153,7761,1320,734,137.62,17.1864,72.8136,99.865
153,154,8028,2373,787,321.295,73.8008,16.1992,99.7779
154,155,59632,862,901,124.268,15.7797,74.2203,99.7426
155,156,22021,2462,830,308.199,20.3672,69.6328,99.9598
156,157,5556,2545,775,312.618,38.6505,51.3495,99.9915
157,158,50972,411,851,107.797,47.8102,42.1898,99.8518
158,159,2862,608,753,295.117,38.5682,51.4318,99.9954
159,160,812,3175,736,315.578,28.8322,61.1678,99.9753
160,161,4850,3097,753,128.977,4.7165300000000006,85.2835,99.9928
161,162,145249,1469,1010,127.572,0.780624,89.2194,83.9976
162,163,6296,2969,773,301.736,23.3454,66.6546,99.9145
163,164,5022,2162,795,138.891,86.7872,3.2128400000000004,99.9868
164,165,2390,155,790,166.642,79.4831,10.5169,99.985
165,166,2362,1943,776,309.358,1.11115,88.8888,99.994
166,167,543,3394,776,117.696,26.014,63.986,99.9821
167,168,4946,1310,799,303.157,68.7512,21.2488,99.9938
168,169,40092,2141,930,120.492,8.62428,81.3757,99.4813
169,170,7238,558,838,114.181,38.4809,51.5191,99.9444
170,171,7655,632,824,314.435,17.4372,72.5628,99.9961
171,172,798,3037,798,316.455,48.3465,41.6535,99.9789
172,173,3088,2586,822,306.428,18.183,71.817,99.9888
173,174,2947,2665,840,118.301,26.0397,63.9603,99.9918
174,175,28900,224,916,119.222,21.7175,68.2825,99.9787
175,176,8868,1338,881,135.67700000000002,11.7542,78.2458,99.943
176,177,1774,2996,839,48.6669,73.0839,16.9161,99.9887
177,178,29675,1119,929,316.112,20.1013,69.8987,99.9767
178,179,9349,722,890,315.83,4.88053,85.1195,99.9228
179,180,5203,3292,872,124.682,22.6486,67.3514,99.9912
180,181,16956,1932,909,289.983,44.9278,45.0722,99.9594
181,182,8850,1778,880,311.83,29.0271,60.9729,99.9966
182,183,4135,1428,881,115.43,65.1318,24.8682,99.9873
183,184,779,2245,855,114.777,22.7987,67.2013,99.9929
184,185,4001,2586,870,125.957,50.2425,39.7575,99.9889
185,186,4164,2672,895,304.426,20.6567,69.3433,99.9572
186,187,20734,2313,960,125.945,41.8978,48.1022,99.6285
187,188,555,2932,881,123.232,35.7374,54.2626,99.9905
188,189,20844,2984,981,312.592,13.2916,76.7084,99.879
189,190,17138,3146,941,319.442,41.2618,48.7382,99.9718
190,191,3508,639,912,66.4823,84.0058,5.9942,99.9934
191,192,12966,2604,956,126.597,43.0804,46.9196,99.9701
192,193,526,3362,915,116.983,34.6119,55.3881,99.9908
193,194,4989,2870,935,135.309,68.4937,21.5063,99.9757
194,195,5388,892,954,303.881,50.3171,39.6829,99.9903
195,196,54272,2678,1058,148.715,63.5831,26.4169,91.8521
196,197,4378,3250,951,304.461,25.8363,64.1637,99.9921
197,198,4202,1260,950,120.167,13.0629,76.9371,99.9812
198,199,1116,2932,933,127.821,5.1712,84.8288,99.9699
199,200,4421,3312,960,121.176,34.5043,55.4957,99.9696
200,201,564,2227,936,309.963,36.9357,53.0643,99.989
201,202,7228,2464,962,313.543,75.3611,14.6389,99.9663
202,203,787,1326,944,111.82,64.5815,25.4186,99.9732
203,204,1161,2077,955,307.11,4.87016,85.1298,99.9827
204,205,1432,1806,948,285.275,75.4844,14.5156,99.9329
205,206,5677,621,976,340.784,63.6708,26.3292,90.3696
206,207,1626,3353,977,137.33700000000002,35.7927,54.2073,99.9795
207,208,7330,1974,997,123.992,1.87378,88.1262,99.9618
208,209,2450,485,976,327.83,59.5052,30.4948,99.9056
209,210,753,1861,967,307.449,73.8339,16.1661,99.9894
210,211,15308,342,1025,318.142,63.1635,26.8365,99.9781
211,212,1951,1316,982,118.932,11.3391,78.6609,99.9953
212,213,3494,2427,1004,126.056,6.08254,83.9175,99.9593
213,214,927,558,978,111.562,43.6257,46.3743,99.9808
214,215,16463,980,1034,322.426,61.5846,28.4154,99.8708
215,216,892,1042,988,128.185,23.3907,66.6093,99.9897
216,217,3968,2051,1008,130.95600000000002,22.2298,67.7702,99.9393
217,218,2772,2371,1000,136.567,52.7873,37.2127,99.9899
218,219,2379,2893,1003,297.953,27.6259,62.3741,99.9349
219,220,33478,1783,1092,128.444,76.7663,13.2337,99.7365
220,221,2594,2554,1013,125.381,8.44453,81.5555,99.9877
221,222,1730,1371,1005,112.264,70.6085,19.3916,99.6262
222,223,2212,1894,1019,293.675,36.4738,53.5262,99.8597
223,224,4790,3168,1037,123.349,34.7261,55.2739,99.6889
224,225,2453,645,1038,121.399,12.794,77.206,99.6586
225,226,5865,3073,1056,300.422,30.1149,59.8851,99.8264
226,227,56936,3258,1154,126.297,11.5674,78.4326,99.98
227,228,21701,496,1100,115.877,46.2167,43.7833,81.7824
228,229,761,3447,1045,122.686,11.5997,78.4003,99.9133
229,230,668,198,1020,315.569,69.5121,20.4879,99.9677
230,231,29013,674,1138,304.824,0.803711,89.1963,99.9354
231,232,4520,2504,1053,126.614,57.368,32.632,99.4668
232,233,3813,2188,1063,305.118,73.5309,16.4691,99.8808
233,234,3271,2067,1064,312.074,41.276,48.724,99.9806
234,235,25706,277,1134,304.149,32.2542,57.7458,99.8146
235,236,6323,2848,1093,119.806,24.0012,65.9988,99.9697
236,237,22577,854,1137,315.137,54.164,35.836,99.9161
237,238,3671,1970,1071,355.855,78.9815,11.0185,99.9551
238,239,8789,2427,1115,119.242,0.602119,89.3979,99.9724
239,240,30098,1128,1142,120.389,12.3434,77.6566,99.971
240,241,2530,1891,1082,298.298,47.8183,42.1817,99.993
241,242,2333,1612,1084,306.471,45.8942,44.1058,99.9916
242,243,2952,2101,1100,121.592,15.4702,74.5298,99.9927
243,244,2633,2978,1094,122.899,25.1797,64.8203,99.925
244,245,7866,405,1131,117.414,38.8778,51.1222,99.991
245,246,3866,2165,1123,105.968,49.5663,40.4337,99.9866
246,247,3881,2312,1128,304.748,3.01093,86.9891,99.9829
247,248,9906,2021,1167,120.371,14.1391,75.8609,99.9633
248,249,2084,3053,1118,122.103,36.0152,53.9848,99.9468
249,250,4285,2898,1148,309.741,23.1737,66.8263,99.9705
250,251,4397,2812,1155,135.474,7.9176600000000015,82.0823,99.9584
251,252,29152,1592,1198,120.672,35.5144,54.4856,99.9393
252,253,46295,1906,1279,307.221,15.5255,74.4745,68.4724
253,254,1837,953,1132,116.433,75.1522,14.8478,99.9813
254,255,22783,2229,1228,309.944,17.02,72.98,99.9598
255,256,1024,2367,1131,104.904,84.7111,5.28891,99.9637
256,257,58474,2961,1330,114.219,43.5537,46.4463,99.3973
257,258,7038,2717,1165,112.825,40.0276,49.9724,99.9429
258,259,7416,2114,1188,318.958,62.6418,27.3582,99.9833
259,260,82613,1070,1321,315.714,19.6927,70.3073,99.578
260,261,23348,624,1244,306.478,19.8389,70.1611,99.9626
261,262,920,3080,1172,314.466,44.2694,45.7306,99.989
262,263,1000,2351,1177,302.181,58.2401,31.7599,99.9933
263,264,25213,221,1275,127.719,41.4647,48.5353,99.9905
264,265,4627,2419,1202,309.442,6.06998,83.93,99.9941
265,266,1418,3440,1240,123.316,11.1895,78.8105,99.9421
266,267,611,2316,1189,122.183,5.6428400000000005,84.3572,99.9958
267,268,1437,2876,1205,107.912,41.4781,48.5219,99.9876
268,269,9409,1712,1254,151.753,86.8786,3.12136,99.944
269,270,560,2804,1200,110.1,38.9802,51.0198,99.9748
270,271,542,346,1202,106.069,41.4734,48.5266,99.9753
271,272,39718,2656,1295,311.237,40.2533,49.7467,99.9837
272,273,38267,3149,1320,313.742,44.2579,45.7421,99.9657
273,274,1898,1106,1220,316.853,4.29358,85.7064,99.9961
274,275,3049,432,1250,100.664,38.9909,51.0091,99.9789
275,276,1156,2325,1218,303.936,1.06833,88.9317,99.9363
276,277,5093,2835,1251,128.115,17.497,72.503,99.9916
277,278,8892,2502,1274,306.982,56.1156,33.8844,99.7569
278,279,15412,369,1310,120.701,7.43075,82.5693,99.8587
279,280,48794,2124,1430,128.639,26.8617,63.1383,99.9141
280,281,23176,2347,1303,130.513,31.3371,58.6629,99.9825
281,282,64042,1524,1356,283.213,63.5441,26.4559,99.7065
282,283,2405,2036,1267,132.42700000000002,26.8598,63.1402,99.9922
283,284,652,795,1259,320.394,16.3793,73.6207,99.99
284,285,1547,2793,1285,147.475,50.2826,39.7174,99.9858
285,286,10576,832,1332,129.909,77.0839,12.9161,99.4456
286,287,65492,631,1403,128.467,20.9053,69.0947,90.4868
287,288,866,2886,1289,307.15,27.6947,62.3053,99.9558
288,289,1290,1818,1293,124.084,28.9654,61.0346,99.9947
289,290,843,764,1307,121.584,57.1064,32.8936,99.9963
290,291,1587,515,1316,304.232,34.5932,55.4068,99.9942
291,292,86553,312,1523,299.74,33.9248,56.0752,99.9778
292,293,3844,907,1356,312.643,12.7376,77.2624,99.9899
293,294,12801,3319,1405,328.543,63.6902,26.3098,99.9194
294,295,1156,1791,1336,351.676,86.385,3.61501,99.9966
295,296,16976,2481,1415,121.479,18.2241,71.7759,99.8494
296,297,831,3434,1374,323.798,64.6231,25.3769,99.894
297,298,553,862,1351,125.689,56.9747,33.0253,99.9987
298,299,21871,2318,1454,117.701,11.5547,78.4453,99.9488
299,300,512,2387,1386,119.047,45.5892,44.4108,99.9818
300,301,746,167,1398,310.143,27.2882,62.7118,99.9619
301,302,4125,1381,1411,312.699,12.7916,77.2084,99.9908
302,303,55834,2747,1502,170.73,83.1821,6.81787,99.5907
303,304,6566,1948,1425,305.24,64.8242,25.1758,99.9314
304,305,1395,1771,1414,338.136,87.4626,2.53736,99.984
305,306,3992,2892,1423,304.552,20.4909,69.5091,99.9937
306,307,1446,875,1428,127.268,55.0907,34.9093,99.9903
307,308,10415,1305,1457,325.222,64.9978,25.0022,99.9887
308,309,73161,1133,1611,330.469,64.4575,25.5425,99.9471
309,310,94224,1586,1605,131.77700000000002,22.5632,67.4368,96.9688
310,311,18994,1930,1508,311.454,27.8453,62.1547,82.4942
311,312,2067,2945,1455,305.2940000000001,15.6952,74.3048,99.9885
312,313,2268,3237,1460,311.191,35.1747,54.8253,99.9913
313,314,1373,174,1463,127.793,5.35519,84.6448,99.9243
314,315,7204,1235,1502,117.35,13.3167,76.6833,99.9692
315,316,918,2044,1454,317.978,62.6891,27.3109,99.9638
316,317,5539,3168,1483,311.518,14.3206,75.6794,99.7185
317,318,13754,1355,1535,306.453,58.9897,31.0103,99.6514
318,319,9982,849,1508,306.096,9.2429,80.7571,99.9733
319,320,12957,3280,1536,313.483,27.1617,62.8383,99.9672
320,321,4256,2402,1511,308.363,43.1856,46.8144,99.9591
321,322,87856,924,1754,311.8,12.169,77.831,99.8393
322,323,1824,733,1500,121.343,57.3453,32.6547,99.8401
323,324,11503,2233,1564,155.494,85.8814,4.1186300000000005,99.6644
324,325,6742,2563,1554,311.831,3.31092,86.6891,99.9827
325,326,649,2506,1504,312.257,2.7702,87.2298,99.9809
326,327,908,2064,1506,126.906,3.21716,86.7828,99.992
327,328,14058,2447,1572,304.57,61.8753,28.1247,97.4487
328,329,12062,3148,1579,105.157,47.1127,42.8873,99.2984
329,330,21286,707,1619,108.788,66.9526,23.0474,99.9753
330,331,5897,602,1565,328.6690000000001,76.5854,13.4146,99.9909
331,332,23419,2916,1618,129.194,4.8259300000000005,85.1741,99.7931
332,333,41521,399,1743,136.475,1.80402,88.196,95.2274
333,334,1333,891,1575,104.239,67.7415,22.2585,99.9916
334,335,39151,1753,1668,137.812,78.6012,11.3988,99.9343
335,336,12222,809,1615,124.223,17.785999999999994,72.214,99.9968
336,337,6313,1917,1595,125.629,5.97534,84.0247,99.9444
337,338,71337,596,1795,126.188,20.9678,69.0322,99.9906
338,339,1107,1366,1600,328.905,62.7388,27.2612,99.9744
339,340,3212,3327,1621,99.7236,46.567,43.433,99.9828
340,341,7118,2968,1664,320.523,63.8907,26.1093,99.9484
341,342,1171,1653,1605,315.514,65.1315,24.8685,99.9945
342,343,654,2594,1605,311.404,54.2112,35.7888,99.9785
343,344,26465,3074,1709,126.45,16.8717,73.1283,99.9888
344,345,17362,3237,1676,286.208,56.8944,33.1056,99.9384
345,346,4731,2323,1636,309.288,42.3087,47.6913,99.993
346,347,34025,2691,1694,312.639,14.3054,75.6946,99.9918
347,348,4818,1349,1636,129.031,22.679,67.321,99.9569
348,349,18067,2209,1682,111.588,19.8653,70.1347,99.9874
349,350,95072,1979,1855,308.822,45.4333,44.5667,62.3411
350,351,45227,2434,1719,322.741,27.9195,62.0805,99.9672
351,352,1053,2110,1639,307.908,38.0302,51.9698,99.9581
352,353,3868,2089,1685,306.1,31.9704,58.0296,99.9626
353,354,744,3424,1679,122.329,12.2851,77.7149,99.9492
354,355,7804,1333,1708,306.219,38.3173,51.6827,99.9941
355,356,2016,3335,1696,296.943,39.9118,50.0882,99.9935
356,357,16802,195,1780,131.181,16.7876,73.2124,99.9479
357,358,17056,1420,1795,305.933,49.0939,40.9061,99.9851
358,359,17493,2950,1779,356.51,83.23200000000001,6.76796,99.9745
359,360,1946,1269,1735,144.791,53.783,36.217,99.9948
360,361,39115,2196,1838,156.895,78.1752,11.8248,99.8889
361,362,4355,3209,1769,344.153,83.6129,6.38707,99.8487
362,363,179670,2719,1987,292.41,47.4556,42.5444,66.0897
363,364,23184,2841,1842,304.469,40.9611,49.0389,99.9805
364,365,6964,3312,1786,66.5651,73.988,16.012,99.9801
365,366,1086,3159,1781,131.964,9.17938,80.8206,99.994
366,367,6404,1304,1807,314.601,64.0935,25.9065,99.9746
367,368,9908,1215,1830,300.85,22.7492,67.2508,99.9917
368,369,896,3425,1799,122.477,11.5553,78.4447,99.9432
369,370,94951,1604,1946,308.587,38.8743,51.1257,85.6445
370,371,5937,799,1838,126.466,28.3768,61.6232,99.9812
371,372,5220,1757,1817,315.163,63.1525,26.8475,99.9927
372,373,5713,260,1849,122.89,35.5807,54.4193,99.9892
373,374,916,3177,1841,235.884,85.639,4.3609800000000005,99.9664
374,375,19138,3263,1904,310.697,1.15285,88.8472,99.8981
375,376,1371,3146,1839,338.607,83.5975,6.40245,99.9918
376,377,3563,3077,1854,302.677,37.754,52.246,99.9815
377,378,55558,335,1970,122.242,21.2646,68.7354,96.0065
378,379,2519,1109,1870,311.1020000000001,7.895389999999999,82.1046,99.98
379,380,7463,3186,1937,177.51,79.5094,10.4906,99.9528
380,381,6194,1209,1929,130.929,21.0926,68.9074,99.9526
381,382,27265,3095,2007,132.936,6.3985400000000014,83.6015,99.9561
382,383,2574,228,1904,298.717,75.8247,14.1753,99.9873
383,384,32635,950,1966,334.309,77.1369,12.8631,99.518
384,385,9555,735,1955,311.909,21.7273,68.2727,99.9892
385,386,2530,1279,1936,320.052,59.272,30.728,99.979
386,387,17095,2192,1996,129.08,42.5172,47.4828,99.8363
387,388,10707,1336,1998,123.865,24.8354,65.1646,99.2409
388,389,3848,2300,1950,131.499,55.0915,34.9085,99.9896
389,390,1461,227,1957,295.798,59.1726,30.8274,99.9953
390,391,3306,1130,1956,309.064,1.75781,88.2422,99.9777
391,392,1295,3413,1985,113.0,15.1815,74.8185,99.9505
392,393,18759,2333,2033,122.228,32.9332,57.0668,99.8195
393,394,15973,1844,2028,126.768,40.5302,49.4698,99.8016
394,395,7063,3313,2040,115.654,15.3174,74.6826,99.9414
395,396,683,1303,1983,124.703,23.1076,66.8924,99.9937
396,397,22901,1094,2039,308.878,26.6536,63.3464,65.7785
397,398,503,89,2013,121.232,6.09744,83.9026,99.9126
398,399,49697,511,2185,306.847,34.4626,55.5374,26.2195
399,400,4099,634,2027,311.634,5.29815,84.7019,99.9903
400,401,38732,733,2141,127.011,68.4393,21.5607,99.479
401,402,7543,2476,2060,127.911,12.9417,77.0583,99.9811
402,403,5267,1228,2066,128.281,31.9969,58.0031,99.98
403,404,1960,1421,2044,119.595,28.8367,61.1633,99.9904
404,405,1459,3224,2045,115.573,14.4209,75.5791,99.9546
405,406,15658,370,2125,314.396,77.4892,12.5108,99.8541
406,407,2176,1758,2059,129.806,35.5025,54.4975,99.9942
407,408,11891,1367,2104,127.603,16.8394,73.1606,99.9874
408,409,2148,3408,2102,112.876,17.795,72.205,99.9603
409,410,33781,2038,2161,324.246,68.1437,21.8563,99.9689
410,411,30492,3237,2203,107.58,76.1945,13.8055,99.898
411,412,2635,692,2080,299.905,48.7211,41.2789,99.9947
412,413,1256,1450,2089,300.115,43.1241,46.8759,99.9455
413,414,750,149,2090,259.668,79.9781,10.0219,99.9927
414,415,660,628,2087,311.517,7.101889999999999,82.8981,99.9395
415,416,21321,1761,2132,131.19799999999998,9.97541,80.0246,99.8819
416,417,12368,2351,2138,296.0490000000001,38.8405,51.1595,99.9853
417,418,3094,2239,2115,136.41,50.7225,39.2775,99.9954
418,419,12928,1010,2160,131.749,0.763062,89.2369,99.9908
419,420,10553,211,2136,118.74,34.7451,55.2549,99.9748
420,421,3232,3282,2125,107.113,54.3643,35.6357,99.9384
421,422,37494,1270,2189,129.727,6.60957,83.3904,99.6779
422,423,1338,1504,2114,133.702,4.94299,85.057,99.9969
423,424,14675,2694,2175,131.084,8.03172,81.9683,99.9469
424,425,12125,2471,2154,308.982,44.6685,45.3315,99.2235
425,426,11446,894,2159,127.831,31.9066,58.0934,99.9797
426,427,1008,589,2119,321.256,35.7053,54.2947,99.9791
427,428,526,1063,2120,127.458,29.6796,60.3204,99.9922
428,429,531,348,2131,121.283,32.4233,57.5767,99.9928
429,430,38407,2550,2276,309.064,11.8222,78.1778,99.9866
430,431,2295,1489,2150,118.366,38.1498,51.8502,99.9107
431,432,616,1585,2140,302.892,66.2799,23.7201,99.9935
432,433,2042,598,2150,312.592,6.00119,83.9988,99.9739
433,434,4928,2207,2166,122.694,31.5703,58.4297,99.9861
434,435,11627,3022,2198,304.329,63.1393,26.8607,99.9402
435,436,7544,1793,2191,317.6670000000001,64.3779,25.6221,99.9955
436,437,629,790,2157,80.6811,79.4584,10.5416,99.9946
437,438,5516,846,2204,109.053,29.5581,60.4419,99.9858
438,439,6772,1121,2191,328.224,59.2094,30.7906,99.9965
439,440,1552,1542,2171,315.9240000000001,63.2679,26.7321,99.9333
440,441,2073,1601,2174,129.315,0.6353300000000001,89.3647,99.7114
441,442,1256,3112,2172,311.753,7.24212,82.7579,99.996
442,443,39977,1462,2287,127.995,6.00052,83.9995,97.9903
443,444,4085,148,2246,125.418,24.0849,65.9151,99.9315
444,445,1896,173,2204,122.474,17.4475,72.5525,99.9847
445,446,707,3409,2189,114.71,16.4194,73.5806,99.933
446,447,13896,1676,2240,348.711,78.369,11.630999999999998,99.9868
447,448,9626,254,2235,133.882,34.0611,55.9389,99.9812
448,449,940,797,2210,135.406,10.317,79.683,99.9937
449,450,70317,2177,2312,316.029,17.9185,72.0815,99.3903
450,451,937,390,2204,121.52,29.5966,60.4034,99.9934
451,452,2106,346,2221,299.338,6.299,83.70100000000002,99.9851
452,453,13984,1012,2286,124.552,22.3214,67.6786,99.5893
453,454,756,2413,2219,75.9037,78.6311,11.3689,99.9846
454,455,4703,3139,2249,299.848,55.4175,34.5825,99.985
455,456,1375,1066,2234,127.356,26.4286,63.5714,99.9781
456,457,8907,409,2270,122.094,15.2266,74.7734,99.9967
457,458,50428,2823,2363,51.0341,84.5782,5.42184,99.8738
458,459,557,2442,2233,78.2251,75.7277,14.2723,99.9657
459,460,1256,569,2243,311.828,10.0035,79.9965,99.9613
460,461,2314,2694,2248,312.247,25.2451,64.7549,99.9842
461,462,895,3085,2248,331.07199999999995,50.0945,39.9055,99.9772
462,463,12720,848,2288,300.7990000000001,66.2791,23.7209,99.9836
463,464,21135,1188,2341,310.802,59.2285,30.7715,99.9518
464,465,12416,1814,2285,64.1209,85.573,4.42698,99.9836
465,466,719,918,2265,104.22,67.7836,22.2164,99.9961
466,467,1520,3391,2275,115.727,20.1267,69.8733,99.8596
467,468,703,187,2265,126.233,22.7871,67.2129,99.9741
468,469,1969,608,2282,297.816,26.5878,63.4122,99.9644
469,470,956,1036,2272,106.327,68.074,21.926,99.9891
470,471,19237,3044,2340,328.275,46.9781,43.0219,99.9201
471,472,10983,3181,2330,127.267,31.3701,58.6299,99.9884
472,473,155569,600,2594,308.336,51.427,38.573,69.3012
473,474,1852,743,2295,122.863,38.3487,51.6513,99.9545
474,475,1893,334,2292,124.778,8.77058,81.2294,99.9985
475,476,4325,2382,2310,81.6264,77.7831,12.2169,99.9869
476,477,5711,249,2308,303.884,42.5906,47.4094,99.9665
477,478,3015,1908,2312,323.725,69.7866,20.2134,99.9632
478,479,502,2927,2293,121.491,11.8481,78.1519,99.9789
479,480,2117,2263,2313,58.0355,80.1572,9.84277,99.9912
480,481,1360,3111,2312,135.808,81.6887,8.3113,99.9785
481,482,44024,1756,2406,127.289,43.9526,46.0474,99.972
482,483,20667,1391,2391,144.968,79.8792,10.1208,99.98
483,484,3348,2325,2342,124.589,27.4461,62.5539,99.9985
484,485,10536,199,2379,124.912,40.2042,49.7958,99.9864
485,486,11463,366,2374,308.266,60.1052,29.8948,99.9652
486,487,509,829,2329,120.436,38.9053,51.0947,99.9896
487,488,714,1107,2338,127.16,24.0987,65.9013,99.9959
488,489,8990,1973,2390,302.703,69.5143,20.4857,99.9477
489,490,22369,3255,2432,128.84799999999998,41.3681,48.6319,99.9461
490,491,24806,2626,2429,131.946,24.0809,65.9191,99.9584
491,492,58894,1098,2498,307.625,45.7314,44.2686,99.9625
492,493,584,3412,2371,113.84,15.31,74.69,99.89
493,494,997,2983,2374,131.835,31.9561,58.0439,99.9748
494,495,4885,572,2391,125.152,40.2513,49.7487,99.9751
495,496,2551,877,2375,127.108,73.327,16.673,99.9927
496,497,3131,2389,2404,130.394,7.0129600000000005,82.98700000000002,99.9499
497,498,1961,2429,2400,118.185,24.926,65.074,99.9363
498,499,2077,283,2393,115.323,45.4153,44.5847,99.9908
499,500,876,2205,2390,319.103,68.6259,21.3741,99.9939
500,501,10148,1516,2436,299.646,43.6452,46.3548,99.9757
501,502,4181,3021,2425,123.518,16.7299,73.2701,99.9941
502,503,666,1585,2408,126.733,21.7403,68.2597,99.9821
503,504,1210,2070,2406,132.31,38.2234,51.7766,99.9688
504,505,5724,517,2436,140.14600000000002,54.4393,35.5607,99.9821
505,506,1709,325,2422,314.903,41.4541,48.5459,99.9835
506,507,28178,2192,2507,294.397,62.7918,27.2082,99.8183
507,508,4292,157,2446,120.308,41.5466,48.4534,99.9873
508,509,544,2156,2414,131.585,38.8103,51.1897,99.9835
509,510,37209,2019,2550,312.918,67.2422,22.7578,99.6094
510,511,908,3146,2431,142.09,36.4761,53.5239,99.9904
511,512,1070,362,2441,292.539,59.0557,30.9443,99.9892
512,513,943,1239,2441,129.202,34.8992,55.1008,99.987
513,514,38459,293,2529,295.4290000000001,59.7123,30.2877,95.3663
514,515,2730,1963,2451,130.03,36.6794,53.3206,99.9022
515,516,207763,1581,2743,133.1,1.48425,88.5157,93.2074
516,517,5637,443,2480,298.415,26.1722,63.8278,69.2267
517,518,19901,2499,2529,300.9840000000001,44.6653,45.3347,99.3675
518,519,2783,2404,2485,127.519,19.8516,70.1484,99.9961
519,520,7181,3126,2493,110.796,82.6953,7.30474,99.9686
520,521,3641,1262,2498,132.417,11.9971,78.0029,99.9863
521,522,5780,2747,2516,133.991,29.9842,60.0158,99.979
522,523,69314,2850,2641,305.05,18.8092,71.1908,99.9676
523,524,1957,3387,2536,299.988,30.4774,59.5226,99.8973
524,525,1368,1798,2517,317.409,29.011,60.989,99.9186
525,526,38235,980,2619,125.526,25.8103,64.1897,99.8401
526,527,27894,1889,2640,111.198,33.6278,56.3722,99.7911
527,528,24816,2623,2617,127.127,22.3831,67.6169,99.6305
528,529,6537,2311,2574,300.965,24.2224,65.7776,99.962
529,530,6004,3067,2569,322.015,79.9706,10.0294,99.4878
530,531,8935,3166,2588,121.971,55.51600000000001,34.484,99.6695
531,532,2083,3284,2554,303.696,29.9138,60.0862,99.9745
532,533,1238,144,2548,114.776,25.9788,64.0212,99.9843
533,534,16149,2401,2635,128.232,17.5232,72.4768,99.9287
534,535,40939,3275,2739,331.845,59.4036,30.5964,99.8322
535,536,8091,801,2616,294.943,50.9836,39.0164,99.9877
536,537,734,1041,2577,10.6758,76.8601,13.1399,99.9939
537,538,10411,252,2634,126.627,31.6465,58.3535,99.9909
538,539,7082,2215,2640,130.601,14.0868,75.9132,99.8441
539,540,6732,155,2647,125.216,25.8277,64.1723,99.9432
540,541,12929,675,2653,126.354,28.6785,61.3215,99.9529
541,542,18119,2108,2697,126.058,5.86132,84.1387,99.8612
542,543,653,3385,2618,301.064,30.1838,59.8162,99.9114
543,544,24267,1778,2720,309.405,1.0063799999999998,88.9936,99.8965
544,545,19967,3096,2706,334.37,58.8306,31.1694,99.9917
545,546,29773,833,2764,296.443,68.5648,21.4352,99.8793
546,547,1836,3387,2680,329.551,60.3699,29.6301,99.9018
547,548,3020,325,2687,116.013,26.2207,63.7793,99.9967
548,549,18810,2271,2727,104.323,50.8987,39.1013,99.9668
549,550,64195,2473,2858,125.761,2.08013,87.9199,75.6632
550,551,4537,1286,2706,307.46,20.5727,69.4273,99.9571
551,552,1169,1835,2676,309.509,59.9996,30.0004,99.9858
552,553,1152,3016,2681,326.543,79.1425,10.8575,99.9463
553,554,1497,233,2694,310.176,51.5091,38.4909,99.9764
554,555,596,1127,2685,124.677,21.2,68.8,99.9848
555,556,13182,2912,2743,309.887,58.1884,31.8116,99.9648
556,557,11372,706,2740,123.036,41.3176,48.6824,99.9717
557,558,4359,1072,2718,304.863,7.92255,82.0775,99.9968
558,559,853,276,2707,305.886,58.7729,31.2271,99.9978
559,560,22384,2619,2786,302.534,46.6841,43.3159,99.9895
560,561,4958,1186,2732,303.6040000000001,1.54729,88.4527,99.9963
561,562,1228,185,2720,142.172,41.1042,48.8958,99.9889
562,563,124631,2956,2930,307.028,4.55686,85.4431,85.458
563,564,767,428,2729,117.669,28.2753,61.7247,99.994
564,565,513,3386,2734,329.9190000000001,59.6186,30.3814,99.9236
565,566,2953,1003,2752,133.35299999999998,35.8832,54.1168,99.9937
566,567,4382,1905,2758,299.272,11.0409,78.9591,99.9912
567,568,11513,218,2778,129.47299999999998,67.0796,22.9204,99.946
568,569,22189,1183,2832,130.769,36.9238,53.0762,99.9407
569,570,1115,624,2745,125.981,28.7436,61.2564,99.9925
570,571,887,951,2758,127.135,22.8164,67.1836,99.9798
571,572,823,597,2765,296.079,62.4566,27.5434,99.9797
572,573,3772,3385,2829,329.147,61.2046,28.7954,99.8865
573,574,4108,1049,2789,299.0440000000001,46.4583,43.5417,99.9885
574,575,41587,1408,2871,130.49,1.68734,88.3127,99.9434
575,576,43224,2170,2857,318.465,75.301,14.699000000000002,99.8847
576,577,84415,2001,3025,312.258,40.1983,49.8017,99.5689
577,578,22103,696,2896,123.868,34.5613,55.4387,97.7688
578,579,104850,351,3020,303.4120000000001,51.2127,38.7873,99.8837
579,580,153286,974,3068,121.822,14.5883,75.4117,99.8685
580,581,535,132,2800,307.728,54.8808,35.1192,99.9836
581,582,898,341,2799,303.334,29.2452,60.7548,99.9973
582,583,18569,575,2882,309.6670000000001,66.1713,23.8287,99.9917
583,584,500,955,2811,297.2270000000001,72.2459,17.7541,99.9675
584,585,1633,2372,2851,305.696,34.7468,55.2532,99.9982
585,586,3149,196,2892,128.90200000000002,30.0002,59.9998,99.9645
586,587,10486,3226,2936,302.747,38.4072,51.5928,99.9732
587,588,4153,807,2916,124.093,19.2658,70.7342,99.967
588,589,999,1544,2890,222.418,85.8413,4.15874,99.9717
589,590,3417,2727,2908,252.031,78.2176,11.7824,99.9916
590,591,1513,158,2914,123.412,44.3955,45.6045,99.9862
591,592,1412,863,2935,116.909,38.7156,51.2844,99.9746
592,593,1229,2208,2933,114.959,60.1634,29.8366,99.9919
593,594,4639,1238,2962,144.592,66.6441,23.3559,99.9898
594,595,1613,3349,2961,333.7030000000001,53.8296,36.1704,99.9117
595,596,602,3386,2943,338.591,52.1491,37.8509,99.6451
596,597,1795,2335,2953,310.821,7.62057,82.3794,99.9906
597,598,26647,2592,3041,131.189,11.4406,78.5594,99.9494
598,599,9372,2257,3005,335.1930000000001,75.5202,14.4798,99.92
599,600,67191,1399,3198,306.575,14.9511,75.0489,83.4077
600,601,4136,1437,3002,118.433,15.2934,74.7066,99.9024
601,602,1352,2494,2995,128.431,22.1089,67.8911,99.7704
602,603,9547,3263,3061,318.848,54.9275,35.0725,99.9845
603,604,1080,777,3018,346.686,79.3187,10.6813,99.8891
604,605,5840,714,3049,347.374,79.6828,10.3172,99.9588
605,606,26296,3164,3128,307.564,15.4007,74.5993,99.9844
606,607,8305,2296,3060,80.6969,72.5902,17.4098,99.5741
607,608,16201,1512,3113,321.391,60.1977,29.8023,99.9495
608,609,7477,2423,3076,127.026,23.2739,66.7261,99.9361
609,610,8266,1597,3108,124.419,7.05226,82.9477,99.9696
610,611,7854,2753,3103,330.236,60.4785,29.5215,99.9962
611,612,4098,601,3119,303.478,3.56307,86.4369,99.9608
612,613,21163,2978,3147,306.345,31.633000000000006,58.367,99.9798
613,614,1995,1666,3105,123.993,6.6227399999999985,83.3773,99.9891
614,615,3201,695,3102,120.978,39.2281,50.7719,99.9906
615,616,69137,1805,3250,304.182,37.7745,52.2255,99.9942
616,617,1369,276,3113,299.986,2.10532,87.8947,99.9977
617,618,51551,977,3259,313.017,43.708,46.292,99.9679
618,619,212725,2215,3427,128.6,2.11715,87.8829,92.4402
619,620,96145,2511,3233,303.628,13.6784,76.3216,99.9859
620,621,7616,253,3175,301.435,25.3726,64.6274,99.9774
621,622,46870,536,3261,312.068,4.21365,85.7864,99.9533
622,623,5628,2844,3146,125.728,14.4984,75.5016,99.9924
623,624,5181,1054,3156,323.246,55.9359,34.0641,99.9948
624,625,8836,671,3164,10.0019,80.877,9.12305,99.99
625,626,5271,184,3175,310.48,14.3354,75.6646,99.9959
626,627,5254,1192,3184,113.74,66.1617,23.8383,99.9914
627,628,20060,1636,3258,302.983,3.93005,86.0699,99.9453
628,629,500,2519,3158,108.564,70.8488,19.1512,99.9068
629,630,942,2121,3185,132.45600000000002,12.130999999999998,77.869,99.9104
630,631,3643,1360,3214,128.787,69.3281,20.6719,99.9938
631,632,23163,1247,3321,304.6740000000001,75.7839,14.2161,99.9685
632,633,56084,2874,3297,125.215,21.939,68.061,99.9692
633,634,2895,306,3209,131.656,27.8684,62.1316,99.9752
634,635,24837,175,3304,125.099,0.929787,89.0702,99.8336
635,636,14672,3170,3275,124.263,23.1637,66.8363,99.9892
636,637,4673,379,3225,299.597,33.0815,56.9185,99.9888
637,638,1066,3239,3221,123.643,15.272,74.72800000000002,99.9947
638,639,647,3365,3250,123.936,17.6758,72.3242,99.943
639,640,1173,1083,3227,122.004,16.1685,73.8315,99.9923
640,641,586,3075,3218,124.103,23.2852,66.7148,99.984
641,642,3844,212,3256,128.485,18.4885,71.5115,99.9942
642,643,858,684,3228,307.871,21.2929,68.7071,99.9933
643,644,1896,3040,3241,307.551,15.7876,74.2124,99.9845
644,645,1245,1312,3248,121.014,17.4441,72.5559,99.9683
645,646,615,3251,3254,128.44899999999998,16.795,73.205,99.7705
646,647,1689,3379,3287,127.049,16.8904,73.1096,99.9115
647,648,2806,309,3268,131.451,19.5366,70.4634,99.983
648,649,3010,1098,3299,123.73,14.2568,75.7432,99.9961
649,650,8947,672,3337,301.055,79.408,10.592,99.941
650,651,1733,1168,3288,311.857,44.2757,45.7243,99.9923
651,652,8080,1556,3342,128.549,42.2136,47.7864,99.957
652,653,19234,3138,3382,306.0370000000001,20.6254,69.3746,99.9652
653,654,9009,416,3358,308.325,36.0598,53.9402,99.9916
654,655,1768,322,3310,292.795,75.0337,14.9663,99.9949
655,656,853,3361,3350,124.366,16.4954,73.5046,99.9016
656,657,64992,2731,3478,123.169,42.8003,47.1997,86.5296
657,658,567,910,3337,130.455,21.0796,68.9204,99.979
658,659,2598,2467,3365,345.702,78.0726,11.9274,99.9935
659,660,1178,319,3347,128.44299999999998,16.0931,73.9069,99.9932
660,661,7511,2997,3412,301.209,46.1716,43.8284,99.8927
661,662,1997,925,3369,128.519,17.910999999999994,72.089,99.9862
662,663,1010,1142,3356,321.073,22.9762,67.0238,99.9864
663,664,1793,285,3375,133.847,74.6029,15.3971,99.9881
664,665,2317,350,3380,131.20600000000002,24.2855,65.7145,99.9936
665,666,2779,737,3386,309.901,70.5408,19.4592,99.9948
666,667,1841,137,3401,125.993,6.32802,83.67200000000003,99.977
667,668,1693,880,3399,296.534,72.771,17.229,99.9854
668,669,5380,1640,3417,308.811,0.0434952,89.9565,99.9224
669,670,2201,613,3405,134.29,79.7373,10.2628,99.9805
670,671,1512,3373,3434,124.267,15.368,74.632,99.6379
671,672,22184,1407,3485,120.753,40.3811,49.6189,97.9491
672,673,8869,342,3438,121.761,6.26003,83.74,99.79
673,674,1767,1316,3419,311.6140000000001,48.8173,41.1827,99.9936
674,675,1084,956,3416,296.158,73.528,16.472,99.931
675,676,920,563,3412,311.762,12.5043,77.4957,99.9512
676,677,5849,1061,3443,133.344,33.236999999999995,56.76300000000001,99.9954
677,678,7812,619,3453,128.24200000000002,30.4789,59.5211,99.9063
678,679,2132,1539,3430,308.781,23.1917,66.8083,99.9841
679,680,5733,1762,3437,118.451,75.4105,14.5895,99.9897
680,681,1637,217,3434,121.416,4.52407,85.4759,99.9609
681,682,5279,3233,3455,308.276,62.1968,27.8032,99.996
682,683,7707,730,3456,126.397,20.1527,69.8473,99.971
683,684,7325,1237,3457,309.175,46.41,43.59,99.9831
684,685,102894,911,3610,306.564,20.2312,69.7688,99.8379
685,686,8076,494,3468,101.85,53.3479,36.6521,99.8888
686,687,6803,138,3467,299.001,1.97583,88.0242,99.9801
687,688,26537,1813,3527,121.361,17.9127,72.0873,90.4201
688,689,3461,991,3466,310.744,58.6322,31.3678,99.9851
689,690,21919,1598,3520,127.196,5.25519,84.7448,99.9531
690,691,2079,1713,3469,292.533,4.83222,85.1678,99.9877
691,692,2970,2568,3468,130.376,15.1237,74.8763,99.9924
692,693,12657,1958,3552,126.407,7.4851899999999985,82.5148,99.7544
693,694,2356,3151,3470,310.751,60.1338,29.8662,99.9843
694,695,1193,2500,3470,293.245,71.1075,18.8925,99.9904
695,696,2685,942,3493,135.917,31.9065,58.0935,99.9502
696,697,18457,220,3532,132.365,11.3693,78.6307,99.9772
697,698,47995,3049,3561,312.129,45.0788,44.9212,99.8752
698,699,22100,372,3614,302.655,48.1286,41.8714,98.5868
699,700,1697,563,3505,127.021,29.9246,60.0754,99.976
700,701,7193,1087,3535,129.884,39.8696,50.1304,99.9424
701,702,11747,1269,3562,88.8475,74.1518,15.8482,99.867
702,703,4458,585,3539,297.538,73.2612,16.7388,99.9356
703,704,3601,662,3535,302.093,11.5473,78.4527,99.9947
704,705,1886,320,3541,300.4120000000001,18.2736,71.7264,99.9795
705,706,870,459,3520,113.371,73.0213,16.9787,99.8424
706,707,2524,499,3549,101.055,76.3505,13.6495,99.9894
707,708,1579,3251,3557,318.4770000000001,21.8016,68.1984,99.9365
708,709,1634,2056,3575,128.563,29.5781,60.4219,99.9362
709,710,10455,624,3640,123.266,17.0366,72.9634,99.9147
710,711,1394,111,3584,119.307,14.3392,75.6608,99.9526
711,712,11813,1846,3613,306.598,22.6967,67.3033,99.9965
712,713,5307,1670,3616,123.977,5.53881,84.4612,99.9871
713,714,3031,2610,3600,123.101,18.7028,71.2972,99.9835
714,715,3323,1506,3594,99.1983,65.8227,24.1773,99.9485
715,716,19377,2298,3651,308.362,24.3671,65.6329,99.9279
716,717,6606,1407,3617,313.061,0.75843,89.2416,99.9889
717,718,3596,489,3605,126.316,37.1167,52.8833,99.9883
718,719,14497,3224,3647,57.3823,80.2192,9.78084,99.9852
719,720,23423,2769,3645,117.752,27.1867,62.8133,99.9663
720,721,4184,687,3621,117.763,18.1421,71.8579,99.9741
721,722,6152,2015,3649,138.83100000000002,42.2037,47.7963,99.9727
722,723,5672,151,3636,309.081,8.08761,81.9124,99.9852
723,724,1644,566,3612,304.652,54.617,35.383,99.9794
724,725,604,211,3600,329.533,87.5222,2.47781,99.9893
725,726,6192,250,3642,308.336,6.836689999999999,83.1633,99.9919
726,727,739,767,3608,123.953,21.4312,68.5688,99.9956
727,728,5980,1177,3637,294.495,42.5341,47.4659,99.972
728,729,1156,303,3620,296.872,20.3209,69.6791,99.969
729,730,1373,2036,3617,309.195,18.7349,71.2651,99.9926
730,731,867,738,3621,313.91,66.1829,23.8171,99.9987
731,732,1634,1570,3633,123.719,34.8536,55.1464,99.9764
732,733,10249,1307,3666,318.32,45.8144,44.1856,99.9714
733,734,1943,530,3643,126.434,44.2035,45.7965,99.9933
734,735,1125,1518,3636,106.85,80.2817,9.71833,99.9913
735,736,542,96,3640,305.246,24.5487,65.4513,99.9533
736,737,1528,2086,3659,112.677,44.1733,45.8267,99.9878
737,738,640,2941,3654,306.168,40.1695,49.8305,99.9038
738,739,9598,1529,3701,309.021,34.9822,55.0178,99.969
739,740,2972,1606,3668,128.74,0.192719,89.8073,99.994
740,741,3640,2598,3670,130.253,43.2962,46.7038,99.9774
741,742,3633,1762,3667,352.392,88.17200000000003,1.82805,99.9937
742,743,1889,471,3666,127.423,35.9553,54.0447,99.9612
743,744,3662,1700,3690,302.715,45.3813,44.6187,99.9959
744,745,1225,1438,3675,108.982,79.0812,10.9188,99.9505
745,746,1438,2904,3677,314.697,67.6347,22.3653,99.9776
746,747,8584,199,3731,111.063,81.2498,8.750210000000001,99.9921
747,748,24784,403,3854,305.83,11.5714,78.4286,99.6342
748,749,3638,2438,3688,297.262,84.79700000000003,5.2029999999999985,99.9794
749,750,581,2376,3676,270.728,85.2759,4.72414,99.9599
750,751,13384,1200,3775,307.689,34.8393,55.1607,99.9782
751,752,23223,1950,3771,302.878,0.221161,89.7788,99.2538
752,753,6609,560,3719,301.437,10.2165,79.7835,99.9875
753,754,579,2976,3682,309.775,43.0258,46.9742,99.8642
754,755,608,1994,3683,310.1690000000001,13.8238,76.1762,99.9893
755,756,3823,130,3702,122.196,1.32227,88.6777,99.9685
756,757,78358,2919,3853,310.038,30.0989,59.9011,55.0919
757,758,14396,1648,3773,303.15,25.2209,64.7791,99.9501
758,759,4355,490,3725,300.968,30.7192,59.2808,99.985
759,760,39919,1803,3822,115.544,38.1555,51.8445,99.9592
760,761,1287,1147,3719,130.61,13.5315,76.4685,99.9782
761,762,12292,2563,3798,122.729,19.8624,70.1376,99.7078
762,763,891,2627,3716,316.663,54.9136,35.0864,99.9334
763,764,20690,2744,3752,300.6740000000001,64.6704,25.3296,99.6758
764,765,7384,1271,3749,125.401,46.1967,43.8033,99.9892
765,766,954,2393,3715,127.566,2.1991,87.8009,99.931
766,767,1949,2516,3722,127.64,2.48038,87.5196,99.9908
767,768,656,1113,3715,323.128,69.8327,20.1673,99.9867
768,769,11466,1009,3777,82.0091,76.0803,13.9197,99.9543
769,770,16940,1411,3779,301.886,54.316,35.684,99.8535
770,771,11854,828,3784,307.063,31.4744,58.5256,99.5384
771,772,5937,2193,3763,125.254,24.4171,65.5829,99.9776
772,773,4889,2350,3765,8.55465,84.0117,5.98826,99.9819
773,774,10981,655,3797,311.205,63.6842,26.3158,99.9916
774,775,3624,3245,3738,319.263,23.1585,66.8415,99.9255
775,776,1987,1106,3753,299.871,19.2408,70.7592,99.9847
776,777,2684,2245,3750,317.131,74.1205,15.8795,99.9968
777,778,1204,2463,3751,128.454,1.97065,88.0294,99.9905
778,779,10712,292,3786,307.6620000000001,41.3745,48.6255,99.9728
779,780,583,2555,3753,305.587,24.2363,65.7637,99.9917
780,781,3246,2116,3774,301.505,12.7531,77.2469,99.9449
781,782,2020,2418,3766,109.206,45.5239,44.4761,99.8878
782,783,510,2498,3752,123.798,38.1756,51.8244,99.9865
783,784,774,2002,3765,124.344,17.578,72.422,99.9888
784,785,627,606,3768,300.248,57.722,32.278,99.9895
785,786,21495,191,3852,133.043,59.8125,30.1875,99.9113
786,787,2179,1539,3775,310.891,10.8846,79.1154,99.9895
787,788,1941,3185,3783,322.087,62.604,27.396,99.9751
788,789,1420,2286,3783,115.932,47.5128,42.4872,99.9951
789,790,9004,3248,3824,97.3848,73.6036,16.3964,99.9849
790,791,6315,539,3798,111.956,55.4438,34.5562,99.9284
791,792,8726,3006,3831,320.607,13.1549,76.8451,99.9898
792,793,963,2055,3811,301.324,14.0447,75.9553,99.9658
793,794,1621,56,3813,127.017,60.7471,29.2529,99.8613
794,795,3139,1594,3843,314.471,31.3,58.7,99.4877
795,796,28350,1296,3906,112.008,66.0089,23.9911,99.646
796,797,1970,2090,3826,309.878,14.896,75.104,99.9928
797,798,4407,2179,3830,308.526,72.0525,17.9475,99.9532
798,799,4991,1101,3833,129.19799999999998,12.034,77.96600000000002,99.9425
799,800,14235,891,3872,128.539,28.9994,61.0006,99.975
800,801,6736,1521,3846,115.168,41.9296,48.0704,99.965
801,802,24693,2402,3906,17.1632,79.1043,10.8957,73.1693
802,803,5179,3137,3854,300.581,6.51552,83.4845,99.9845
803,804,2644,2339,3829,306.773,19.9953,70.0047,99.9915
804,805,6950,497,3861,292.825,56.3165,33.6835,99.9822
805,806,4908,2271,3850,122.211,43.1406,46.8594,99.9955
806,807,1636,60,3870,131.327,60.0294,29.9706,99.8947
807,808,3929,2660,3855,314.326,63.50899999999999,26.491,99.9856
808,809,2513,1037,3855,323.192,69.0408,20.9592,99.9964
809,810,2159,741,3851,120.424,17.2378,72.7622,99.8128
810,811,825,2126,3839,309.122,40.7321,49.2679,99.9948
811,812,4616,2504,3884,128.139,35.4599,54.5401,99.9871
812,813,523,3092,3845,132.971,22.9838,67.0162,99.9941
813,814,6709,577,3901,308.6,39.9071,50.0929,99.9009
814,815,3618,1162,3877,297.526,80.4995,9.50053,99.979
815,816,698,2556,3867,143.134,75.733,14.267,99.9745
816,817,1027,1677,3873,303.959,33.7914,56.2086,99.9232
817,818,8559,173,3912,117.665,51.3452,38.6548,99.965
818,819,546,701,3874,298.399,16.9342,73.0658,99.9933
819,820,7895,979,3929,297.531,38.3024,51.6976,99.9683
820,821,6174,3198,3925,345.181,79.0313,10.9687,99.9251
821,822,6605,2151,3900,317.254,51.6548,38.3452,99.99
822,823,5127,3082,3921,260.866,84.057,5.94303,99.9412
823,824,8007,2045,3916,306.152,42.9032,47.0968,99.9756
824,825,3725,668,3900,121.016,13.6482,76.3518,99.5885
825,826,11276,1940,3946,305.873,23.321,66.679,99.8912
826,827,16192,753,3967,300.288,9.11901,80.881,99.8894
827,828,22702,1486,3955,309.015,27.352,62.648,99.8365
828,829,517,3277,3902,104.317,73.2385,16.7615,99.9875
829,830,12934,2576,3958,129.384,72.3385,17.6615,99.8596
830,831,5859,2228,3929,302.024,38.8153,51.1847,99.985
831,832,1349,1100,3898,308.377,21.9129,68.0871,99.9986
832,833,1955,1044,3913,305.001,8.118269999999999,81.8817,99.9833
833,834,725,3158,3916,303.252,85.6161,4.38392,99.9834
834,835,1952,2668,3923,130.695,43.5634,46.4366,99.9728
835,836,10524,3288,3985,309.256,6.17084,83.8292,99.9097
836,837,1565,488,3931,309.731,11.6157,78.3843,99.9917
837,838,3799,317,3953,133.827,77.5489,12.4511,99.9513
838,839,12733,1132,3962,153.976,86.7336,3.26642,99.8566
839,840,4824,1758,3956,118.73,57.8964,32.1036,99.9415
840,841,1245,2543,3938,126.029,22.5941,67.4059,99.9966
841,842,8264,2275,3987,315.698,45.5715,44.4285,99.9421
842,843,2786,1686,3950,305.27,35.6245,54.3755,99.9314
843,844,3624,654,3958,126.789,60.0811,29.9189,99.9845
844,845,12782,1501,4001,126.345,31.701,58.299,99.9258
845,846,13646,557,3995,130.687,39.7159,50.2841,98.138
846,847,3574,447,3992,125.183,11.4416,78.5584,67.8291
847,848,3255,896,3975,295.541,36.8727,53.1273,99.9765
848,849,23801,155,4012,128.32299999999998,43.8666,46.1334,66.2408
849,850,1798,2165,3964,334.449,70.5231,19.4769,99.9642
850,851,3310,2095,3978,127.082,12.2151,77.7849,99.9956
851,852,735,848,3965,318.826,19.4265,70.5735,99.9893
852,853,3138,2681,3990,308.623,11.9169,78.0831,99.9946
853,854,3553,3012,3982,303.289,10.2755,79.7245,99.9875
854,855,763,1849,3978,315.867,32.3484,57.6516,99.9847
855,856,6095,2019,4025,125.137,34.4177,55.5823,99.9218
856,857,4536,3148,4002,298.439,8.887889999999997,81.1121,99.989
857,858,2042,934,4001,312.849,28.6565,61.3435,99.9103
858,859,3079,3070,4006,135.44799999999998,46.968,43.032,99.9879
859,860,1347,1802,3991,262.381,85.5936,4.4064,99.9868
860,861,1369,1887,3993,130.134,2.14372,87.8563,99.9894
861,862,19860,2109,4071,305.098,37.8288,52.1712,99.342
862,863,46124,1791,4073,314.258,58.8704,31.1296,99.8382
863,864,27833,1005,4094,119.511,10.3433,79.6567,95.2946
864,865,13876,2383,4046,307.363,4.86198,85.13799999999998,99.9531
865,866,1568,811,4011,301.853,52.5023,37.4977,93.548
866,867,4052,2747,4038,313.691,34.9469,55.0531,99.9582
867,868,14013,347,4057,86.8071,81.3129,8.6871,99.992
868,869,3764,2978,4045,122.347,11.6962,78.3038,99.951
869,870,8449,1240,4065,307.816,1.49844,88.5016,99.9782
870,871,5228,3273,4068,297.597,42.8327,47.1673,99.9771
871,872,996,3192,4030,205.019,85.8388,4.1612300000000015,99.8991
872,873,1667,857,4042,310.015,44.1519,45.8481,99.9842
873,874,8528,1357,4114,305.38,55.8667,34.1333,99.9393
874,875,733,2498,4034,297.22,16.6575,73.3425,99.9084
875,876,1838,2844,4045,305.116,18.5247,71.4753,99.9858
876,877,13239,2671,4098,115.966,16.7311,73.2689,99.9557
877,878,3046,664,4064,123.987,13.1723,76.8277,99.9698
878,879,4590,2573,4060,120.713,69.4075,20.5925,99.6977
879,880,8111,2869,4083,130.269,38.5681,51.4319,99.9074
880,881,6885,3107,4081,124.689,20.6613,69.3387,99.9392
881,882,1429,471,4055,112.417,69.4007,20.5993,99.9847
882,883,10580,2273,4103,115.122,49.2381,40.7619,99.7603
883,884,6434,792,4095,297.812,27.2025,62.7975,99.8234
884,885,6306,556,4072,305.331,20.3308,69.6692,99.996
885,886,3074,1555,4070,112.869,53.1438,36.8562,99.9952
886,887,7712,3216,4107,114.627,35.2321,54.7679,99.964
887,888,815,824,4061,112.194,55.5338,34.4662,99.987
888,889,6810,1431,4100,117.579,36.2502,53.7498,99.8814
889,890,2926,2468,4081,300.028,12.2736,77.7264,99.9633
890,891,5635,1086,4093,127.728,10.0471,79.9529,99.9551
891,892,3264,117,4109,113.396,59.6559,30.3441,99.976
892,893,14141,3032,4148,351.254,72.0364,17.9636,99.8977
893,894,2583,1777,4086,326.247,81.7393,8.260689999999999,99.99
894,895,2178,719,4093,308.73,31.3844,58.6156,99.9943
895,896,4431,2187,4111,112.954,2.91645,87.0835,99.9958
896,897,6583,565,4129,313.485,35.8821,54.1179,99.9586
897,898,8589,868,4140,306.648,36.1091,53.8909,99.9715
898,899,9251,210,4119,307.0490000000001,16.723,73.277,99.9809
899,900,2999,2483,4125,305.62,4.5279099999999985,85.4721,99.9706
900,901,1712,2537,4104,302.349,42.0873,47.9127,99.9844
901,902,14915,447,4157,121.736,18.7885,71.2115,99.5987
902,903,135869,1761,4455,308.1620000000001,42.2678,47.7322,59.4166
903,904,1126,1222,4111,300.663,22.9412,67.0588,99.9931
904,905,43168,649,4226,311.088,22.8653,67.1347,99.8232
905,906,3342,2961,4156,306.761,15.9765,74.0235,99.8695
906,907,5205,1155,4141,125.833,22.2654,67.7346,99.9873
907,908,57504,1545,4279,309.611,29.4814,60.5186,99.9792
908,909,1174,2417,4130,300.036,63.1028,26.8972,99.8651
909,910,854,307,4127,95.2274,81.3378,8.6622,99.9817
910,911,1085,1305,4134,114.473,48.9893,41.0107,99.9839
911,912,82130,2975,4263,310.18,30.1841,59.8159,34.1638
912,913,3373,2368,4146,300.961,58.3553,31.6447,99.9906
913,914,921,344,4131,94.8379,80.8877,9.11234,99.9765
914,915,689,994,4133,304.753,35.3514,54.6486,99.9756
915,916,11665,2555,4187,305.125,62.2576,27.7424,99.9569
916,917,2808,1240,4157,109.254,55.4178,34.5822,99.9907
917,918,1064,3168,4145,120.435,2.12032,87.8797,99.9954
918,919,6869,2151,4189,307.942,21.5532,68.4468,99.9964
919,920,830,3297,4158,298.827,26.6859,63.3141,99.9588
920,921,24818,1057,4277,308.783,4.4309400000000005,85.5691,99.9743
921,922,951,2630,4160,340.035,76.5679,13.4321,99.9938
922,923,14889,261,4216,313.762,37.644,52.356,99.9539
923,924,57867,1986,4270,123.742,5.34269,84.6573,99.9865
924,925,9792,120,4221,304.492,2.12169,87.8783,99.9718
925,926,17344,2243,4242,126.287,13.8335,76.1665,99.9472
926,927,2137,2685,4175,138.605,86.6005,3.39949,99.9925
927,928,5961,1356,4207,127.613,5.89495,84.105,99.9906
928,929,1256,365,4186,307.642,19.782,70.218,99.9864
929,930,4032,2416,4195,307.349,23.1307,66.8693,99.9891
930,931,7895,1792,4227,247.193,82.4083,7.5917,99.9776
931,932,33362,875,4301,310.678,44.9384,45.0616,99.8864
932,933,9869,1176,4245,313.326,49.3246,40.6754,99.9826
933,934,1137,3239,4197,119.429,1.49891,88.5011,99.9905
934,935,1075,2336,4201,112.689,50.5021,39.4979,99.9879
935,936,24048,1305,4292,302.886,23.74,66.26,99.9957
936,937,1037,1039,4203,308.067,49.4302,40.5698,99.9937
937,938,7437,2724,4236,302.9790000000001,18.7942,71.2058,99.9494
938,939,8875,3256,4282,311.953,34.1642,55.8358,99.9374
939,940,14617,382,4274,105.682,71.2932,18.7068,99.9743
940,941,636,404,4221,99.3057,71.1831,18.8169,99.9009
941,942,3090,2378,4237,295.956,61.687,28.313,99.9922
942,943,760,2469,4238,81.4453,74.3196,15.6804,99.9894
943,944,21976,2658,4313,314.7270000000001,28.4198,61.5802,99.97
944,945,11199,501,4302,314.599,12.152,77.848,99.9898
945,946,3228,2552,4258,117.6,17.9765,72.0235,99.9877
946,947,787,3335,4261,114.582,13.1915,76.8085,99.9436
947,948,21476,171,4322,303.086,10.626,79.374,99.9898
948,949,3346,2152,4289,102.011,70.0815,19.9185,99.8673
949,950,879,3354,4283,115.445,12.7477,77.2523,99.9102
950,951,100868,2466,4518,125.824,6.359380000000002,83.6406,74.5184
951,952,7714,2322,4305,118.546,39.0911,50.9089,99.97
952,953,12390,1426,4380,305.52,5.30569,84.6943,92.0245
953,954,2339,2795,4312,120.729,5.40414,84.5959,99.977
954,955,4491,710,4334,122.591,43.6299,46.3701,99.9825
955,956,6731,1222,4346,109.247,64.7419,25.2581,99.9916
956,957,2520,976,4348,127.464,40.7936,49.2064,99.9913
957,958,1533,1144,4340,129.727,6.01,83.99,99.9948
958,959,7446,336,4356,307.806,15.5927,74.4073,99.9828
959,960,2647,1816,4348,302.813,56.3329,33.6671,99.9837
960,961,1275,2561,4345,299.335,1.01717,88.9828,99.9465
961,962,168658,452,4537,129.57,3.17583,86.8242,64.824
962,963,876,758,4344,303.562,25.9515,64.0485,99.9562
963,964,7203,3091,4369,307.065,30.7643,59.2357,99.9918
964,965,13384,2200,4396,126.64,55.8101,34.1899,99.9941
965,966,45780,2910,4480,308.593,8.01472,81.9853,82.6565
966,967,8522,577,4399,125.685,77.068,12.932,99.9754
967,968,46702,2203,4501,313.66,57.2818,32.7182,71.6085
968,969,7275,3222,4393,121.907,50.386,39.614,99.9791
969,970,1432,446,4374,129.862,5.3285300000000015,84.6715,99.9746
970,971,43579,1134,4497,112.636,68.9025,21.0975,87.0783
971,972,1245,2115,4388,124.812,23.2677,66.7323,99.9943
972,973,3325,1023,4396,313.047,51.6763,38.3237,99.9853
973,974,2056,3147,4397,312.5540000000001,43.401,46.599,99.9898
974,975,907,1844,4394,107.657,41.2586,48.7414,99.988
975,976,3102,444,4416,121.988,42.9043,47.0957,99.9197
976,977,850,672,4399,126.724,25.8763,64.1237,99.9825
977,978,1704,1067,4421,131.782,12.8085,77.1915,99.9946
978,979,4658,2708,4437,129.997,15.2602,74.7398,99.9861
979,980,5989,1307,4452,110.229,45.992,44.008,99.9503
980,981,1976,3056,4425,124.692,1.01615,88.9838,99.9789
981,982,6008,888,4473,309.943,34.9597,55.0403,99.879
982,983,985,535,4432,125.21,42.5102,47.4898,99.9959
983,984,1369,641,4444,122.364,45.3859,44.6141,99.9946
984,985,5828,1515,4471,121.591,33.2732,56.7268,99.9869
985,986,2965,3165,4450,121.509,81.2864,8.71359,99.9482
986,987,1865,3233,4467,128.344,23.4939,66.5061,99.8876
987,988,21152,1430,4542,304.396,9.45512,80.5449,99.4777
988,989,2755,2159,4480,298.709,32.2708,57.7292,99.9918
989,990,2300,3135,4484,133.155,49.691,40.309,99.9884
990,991,26788,2632,4597,318.267,57.5371,32.4629,99.9411
991,992,4511,807,4509,125.28,26.374,63.62600000000001,99.9855
992,993,2179,972,4484,126.379,28.1243,61.8757,99.9977
993,994,6774,2733,4505,5.95673,88.4439,1.55608,99.9163
994,995,607,1344,4500,128.33,39.7845,50.2155,99.9098
995,996,4424,3219,4525,209.16,79.7823,10.2177,99.9216
996,997,4094,1876,4546,132.319,54.7088,35.2912,99.966
997,998,740,28,4543,126.134,8.9961,81.0039,99.946
998,999,8442,926,4565,86.6917,80.8765,9.12351,99.962
999,1000,1009,3121,4539,123.331,6.39898,83.601,99.9745
1000,1001,2603,1315,4580,122.949,42.4996,47.5004,99.8197
1001,1002,13545,804,4613,308.331,33.8734,56.1266,99.9532
1002,1003,5136,2791,4571,117.889,11.9857,78.0143,99.9935
1003,1004,1841,1968,4573,299.002,67.6867,22.3133,99.9956
1004,1005,5340,1016,4594,135.36700000000002,16.141,73.859,99.9941
1005,1006,21138,1223,4639,307.228,30.2923,59.7077,99.9919
1006,1007,3503,2307,4589,120.16,29.6397,60.3603,99.9912
1007,1008,1835,3157,4577,297.3540000000001,87.6308,2.36918,99.9146
1008,1009,3452,3090,4602,115.396,38.6293,51.3707,99.9896
1009,1010,557,2731,4591,114.258,50.4904,39.5096,99.9967
1010,1011,776,3037,4586,29.6783,81.2779,8.72209,99.9838
1011,1012,1469,3203,4591,311.051,84.8786,5.1214,99.9725
1012,1013,2447,2254,4612,120.737,29.324,60.676,99.9966
1013,1014,509,1294,4587,309.682,3.4993199999999995,86.5007,99.9887
1014,1015,2278,39,4614,118.848,5.29915,84.7009,99.8754
1015,1016,6915,2136,4643,128.968,22.0211,67.9789,99.9943
1016,1017,2298,2862,4621,120.493,24.0235,65.9765,99.9919
1017,1018,40704,1462,4717,152.08100000000005,84.3867,5.61332,99.9776
1018,1019,5041,2209,4637,126.593,6.80045,83.1995,99.9953
1019,1020,4554,1998,4643,122.435,33.9203,56.0797,99.9674
1020,1021,29970,1939,4706,315.578,34.4205,55.5795,63.221
1021,1022,7312,2798,4643,302.956,77.1327,12.8673,99.9934
1022,1023,40582,2968,4710,122.303,3.51421,86.4858,99.6218
1023,1024,634,3224,4616,121.666,10.5626,79.4374,99.9404
1024,1025,8698,3142,4662,117.924,8.28272,81.7173,99.9904
1025,1026,15297,812,4677,126.923,25.503,64.497,99.9531
1026,1027,4916,976,4664,313.183,0.10141,89.8986,99.9672
1027,1028,3519,2746,4675,85.9421,78.5178,11.4822,99.9878
1028,1029,3172,2282,4668,125.91,0.409225,89.5908,99.9918
1029,1030,1290,2707,4677,88.0226,78.673,11.327,99.9934
1030,1031,745,3218,4667,338.547,86.07700000000001,3.92304,99.9767
1031,1032,5139,2556,4694,299.155,33.4586,56.5414,99.993
1032,1033,4909,1140,4693,301.409,36.8829,53.1171,99.9851
1033,1034,2384,1055,4682,135.04399999999998,50.8472,39.1528,99.9841
1034,1035,1560,1682,4678,296.748,67.5238,22.4762,99.996
1035,1036,3575,3288,4727,299.908,9.99656,80.0034,99.8207
1036,1037,4373,1324,4741,125.977,42.994,47.006,99.9735
1037,1038,911,1951,4699,296.159,65.9513,24.0487,99.9879
1038,1039,2058,2859,4708,310.884,51.6262,38.3738,99.9889
1039,1040,1765,2159,4703,127.428,0.510994,89.48899999999998,99.9982
1040,1041,7480,2225,4734,305.796,40.9683,49.0317,99.9967
1041,1042,10841,2667,4746,292.015,66.3896,23.6104,99.9806
1042,1043,21822,1725,4762,247.22,86.0391,3.96087,99.9695
1043,1044,7744,3156,4752,315.085,51.8214,38.1786,99.9695
1044,1045,7189,2328,4763,128.135,18.1148,71.8852,99.981
1045,1046,2065,1622,4727,113.768,4.4117,85.5883,99.9982
1046,1047,1653,2770,4724,312.443,50.2638,39.7362,99.986
1047,1048,863,2289,4719,120.237,26.3665,63.6335,99.9979
1048,1049,1371,3095,4736,312.056,53.6619,36.3381,99.9888
1049,1050,923,2810,4734,128.196,46.3141,43.6859,99.9966
1050,1051,1408,1286,4759,123.088,43.607,46.393,99.9116
1051,1052,3136,2764,4774,122.625,9.67155,80.3284,99.9802
1052,1053,2224,2587,4785,294.535,55.4317,34.5683,99.8532
1053,1054,540,3225,4768,112.908,15.6949,74.3051,99.9419
1054,1055,1539,1594,4804,311.616,24.9749,65.0251,99.9925
1055,1056,4375,2526,4809,293.123,48.6403,41.3597,99.9861
1056,1057,4428,2428,4817,296.356,36.2676,53.7324,99.9542
1057,1058,1904,2644,4814,123.114,9.50339,80.4966,99.8539
1058,1059,726,2559,4838,298.935,35.5549,54.4451,99.9833
