,Grain No.,Size [Pixel],center x-coordinate,center y-coordinate,mean azimuth [degree],mean latitude [degree],mean colatitude [degree],Regelungsgrad [%]
0,1,182841,1914,483,120.417,67.654,22.346,94.3979
1,2,78348,2516,266,150.31,30.5628,59.4372,99.7876
2,3,1275,2417,154,152.026,28.2322,61.7678,99.8601
3,4,12205,3380,212,136.071,40.993,49.007,99.893
4,5,3875,1683,157,346.095,52.4256,37.5744,99.7802
5,6,13628,792,188,114.415,33.1245,56.8755,99.9601
6,7,41501,2194,245,185.707,28.5216,61.4784,99.8265
7,8,548,2822,157,337.185,5.80334,84.1967,99.9561
8,9,5451,1309,178,351.915,47.5091,42.4909,99.8979
9,10,649,2949,164,341.283,4.676069999999998,85.3239,99.9729
10,11,785,2986,166,338.432,5.23999,84.76,99.4525
11,12,559,1854,155,346.099,50.8976,39.1024,99.9646
12,13,15834,491,230,84.3509,63.5546,26.4454,99.9435
13,14,1001,3286,177,182.948,13.8268,76.1732,99.9823
14,15,28857,3055,296,148.54,20.0273,69.9727,99.7529
15,16,6405,1097,180,329.2680000000001,20.7206,69.2794,99.8972
16,17,1297,948,170,0.32158000000000003,17.3625,72.6375,99.9788
17,18,1003,1548,173,186.333,24.0406,65.9594,99.9827
18,19,1060,1206,175,135.35299999999998,10.0175,79.9825,99.9785
19,20,8535,1671,204,347.958,50.3583,39.6417,99.9949
20,21,31400,2877,273,102.341,34.0792,55.9208,99.9499
21,22,11317,1767,235,313.527,53.8351,36.1649,99.9811
22,23,2393,1440,195,171.35299999999995,16.3295,73.6705,99.9795
23,24,2011,1858,192,312.4,52.9463,37.0537,99.9688
24,25,834,1520,188,309.648,56.8385,33.1615,99.9905
25,26,1730,1245,202,139.645,19.6051,70.3949,99.99
26,27,5830,2730,228,335.088,6.2469,83.7531,99.9052
27,28,2049,671,218,186.417,53.5116,36.4884,99.9886
28,29,16596,341,281,164.987,19.9396,70.0604,99.9198
29,30,1177,625,214,190.722,53.3495,36.6505,99.9926
30,31,1970,2998,226,338.216,5.139469999999998,84.8605,99.0914
31,32,9828,1113,234,331.45,20.9387,69.0613,99.9564
32,33,1185,898,213,116.483,31.8808,58.1192,99.9923
33,34,65999,843,304,347.301,63.2586,26.7414,98.6852
34,35,19801,1406,268,169.78099999999995,17.6731,72.3269,99.9342
35,36,4408,1263,260,140.159,18.7442,71.2558,99.9969
36,37,65188,1496,396,178.282,7.675,82.325,99.7676
37,38,1526,1650,253,177.946,7.53896,82.461,99.9964
38,39,557,610,239,11.9812,5.72639,84.2736,99.9969
39,40,3186,3219,298,183.234,13.2301,76.7699,99.9945
40,41,6047,187,290,316.116,62.2395,27.7605,99.6577
41,42,16303,458,347,358.30300000000005,3.56339,86.4366,99.7495
42,43,2472,269,280,306.374,64.8137,25.1863,99.9959
43,44,583,3438,280,138.166,39.338,50.662,99.9651
44,45,7053,1133,302,185.859,48.9443,41.0557,99.9946
45,46,9180,1672,363,289.1040000000001,26.7669,63.2331,99.98
46,47,36083,3130,448,59.3331,58.5238,31.4762,99.8706
47,48,6850,2757,341,105.822,33.4972,56.5028,99.9552
48,49,6109,1764,343,163.136,31.3249,58.6751,99.9763
49,50,48766,2257,417,343.5619999999999,20.9804,69.0196,99.9351
50,51,2360,1287,323,199.41,52.9993,37.0007,99.9742
51,52,111250,1124,523,313.683,11.1712,78.8288,99.9482
52,53,12330,3331,407,29.212,78.8109,11.1891,99.9451
53,54,4255,250,343,312.226,47.7047,42.2953,99.9439
54,55,7902,3246,368,152.911,14.2264,75.7736,99.9915
55,56,2941,169,403,104.492,66.4429,23.5571,99.9482
56,57,1035,2820,375,185.892,62.9613,27.0387,99.9964
57,58,77692,2895,554,176.983,49.8538,40.1462,94.464
58,59,1179,631,380,0.401269,8.34093,81.6591,99.9311
59,60,1739,2873,396,105.659,33.3692,56.6308,99.9904
60,61,1483,737,378,0.417796,9.34593,80.6541,99.9861
61,62,45251,2523,534,187.357,26.1206,63.8794,99.6605
62,63,73938,315,643,311.809,47.7888,42.2112,99.9296
63,64,6687,732,432,0.427445,8.374789999999999,81.6252,99.9961
64,65,1162,847,412,358.0440000000001,9.09795,80.9021,99.9379
65,66,598,657,417,0.270507,8.43484,81.5652,99.9902
66,67,17776,540,464,358.514,4.41571,85.5843,99.8333
67,68,2770,935,419,116.862,35.2223,54.7777,99.9819
68,69,703,1696,427,10.1075,57.0323,32.9677,99.9769
69,70,7518,2884,459,104.437,28.7023,61.2977,99.9759
70,71,845,3009,429,285.263,66.8334,23.1666,99.9335
71,72,1266,3358,442,174.243,7.32947,82.6705,99.9622
72,73,2990,818,452,358.7290000000001,9.12978,80.8702,99.9046
73,74,608,2884,444,180.473,63.1823,26.8177,99.9818
74,75,5246,155,507,128.585,34.0392,55.9608,99.4026
75,76,50673,830,595,286.694,70.3641,19.6359,99.8591
76,77,9936,2349,517,357.721,3.83818,86.1618,99.535
77,78,780,310,484,2.31511,3.35454,86.6455,99.9877
78,79,45562,1407,629,177.366,7.66154,82.3385,99.9326
79,80,1166,3241,495,197.798,51.6698,38.3302,99.9932
80,81,28785,3226,614,309.928,41.7197,48.2803,99.9717
81,82,3164,2129,535,137.27700000000002,52.1477,37.8523,99.6487
82,83,848,2003,527,311.266,15.8965,74.1035,99.9311
83,84,11013,474,599,359.048,0.327629,89.6724,99.2532
84,85,7696,1642,579,312.806,18.6949,71.3051,99.9568
85,86,1737,3344,540,172.25,10.0222,79.9778,99.8875
86,87,13960,3368,639,171.328,27.543000000000006,62.457,99.6937
87,88,1205,2689,547,323.046,45.3738,44.6262,99.9793
88,89,3173,584,582,174.78799999999995,1.60021,88.3998,99.9856
89,90,2966,209,586,311.6090000000001,52.5147,37.4853,99.994
90,91,19908,2434,665,342.261,23.7024,66.2976,99.9122
91,92,27673,2706,645,37.757,65.7328,24.2672,99.8774
92,93,689157,2118,1238,357.879,3.93389,86.0661,100.491
93,94,700,2188,584,339.32,22.874,67.126,99.9891
94,95,117968,539,851,161.47799999999995,18.2581,71.7419,99.4877
95,96,531,782,596,356.976,1.89632,88.1037,99.9862
96,97,14188,2869,656,284.135,66.9152,23.0848,99.9954
97,98,9110,185,739,161.54399999999995,19.9441,70.0559,99.76
98,99,20951,1680,722,129.58100000000002,38.6747,51.3253,99.9741
99,100,995,2957,682,143.541,18.3177,71.6823,99.9561
100,101,82320,1960,898,328.777,12.7741,77.2259,97.4769
101,102,309616,987,970,136.3,41.2794,48.7206,94.812
102,103,19694,3300,762,287.866,58.2022,31.7978,99.9733
103,104,25189,2813,771,6.60762,8.638869999999999,81.3611,99.9821
104,105,40509,2653,886,295.19,65.3815,24.6185,99.8594
105,106,1467,1523,738,181.642,6.19251,83.8075,99.9989
106,107,1009,922,722,344.606,50.6357,39.3643,99.9932
107,108,56156,2925,886,39.6932,65.7497,24.2503,99.8321
108,109,874,2050,734,126.174,34.2291,55.7709,99.9707
109,110,2197,1339,752,177.733,9.88898,80.111,99.9969
110,111,15572,1584,808,203.496,79.5269,10.4731,99.9741
111,112,3872,3169,762,8.70233,7.782089999999998,82.2179,99.9877
112,113,22617,3131,865,19.3963,68.0993,21.9007,99.9927
113,114,4588,414,793,324.147,86.4721,3.52789,99.9952
114,115,9317,2557,812,97.7276,72.932,17.067999999999998,99.9718
115,116,690,3406,800,284.833,58.5848,31.4152,99.9753
116,117,6642,1810,809,276.897,70.013,19.987,99.9912
117,118,817,1342,800,333.49,9.62907,80.3709,99.9974
118,119,1929,863,807,350.101,49.3964,40.6036,99.9952
119,120,14626,3269,881,37.9164,64.9532,25.0468,99.8771
120,121,31678,1557,909,131.668,38.7204,51.2796,99.847
121,122,1129,2002,832,124.715,32.2931,57.7069,99.9705
122,123,1305,1986,871,174.22,39.7515,50.2485,99.9561
123,124,17930,189,927,311.944,61.3926,28.6074,99.8248
124,125,860,1766,896,283.663,68.6316,21.3684,99.994
125,126,1017,2030,904,134.692,12.9014,77.0986,99.979
126,127,907,3396,902,32.7366,67.5743,22.4257,99.9624
127,128,1092,3437,918,116.823,50.9408,39.0592,99.9505
128,129,2056,1411,933,335.54,8.20914,81.7909,99.9968
129,130,6506,1788,950,177.317,23.1271,66.8729,99.9524
130,131,931,1886,933,334.335,54.0016,35.9984,99.9773
131,132,16392,3267,992,194.045,55.4227,34.5773,99.4667
132,133,22352,3056,1021,310.31,24.9221,65.0779,99.9461
133,134,1289,1454,974,127.999,39.9022,50.0978,99.9848
134,135,4400,1549,1010,174.669,45.2646,44.7354,99.6949
135,136,37349,2742,1099,356.67800000000005,4.58702,85.413,99.8408
136,137,17978,198,1064,344.881,28.8314,61.1686,99.8367
137,138,685,3445,999,12.2213,43.4571,46.5429,99.7959
138,139,1993,1413,1009,167.476,46.0629,43.9371,99.9003
139,140,579,3173,996,141.33100000000005,8.543660000000001,81.4563,99.9928
140,141,1391,1763,1006,276.742,68.2433,21.7567,99.9161
141,142,2878,1663,1010,179.338,6.287730000000002,83.7123,99.9841
142,143,1600,2571,1027,139.95600000000002,24.8545,65.1455,99.9325
143,144,2363,1788,1041,183.663,15.7917,74.2083,99.8537
144,145,26772,3247,1116,82.9661,71.4613,18.5387,99.9155
145,146,365076,3131,1503,129.309,26.3428,63.6572,70.7513
146,147,14172,1346,1097,331.612,6.51765,83.4823,99.9688
147,148,5798,329,1100,333.829,74.0981,15.9019,99.9708
148,149,599,3419,1063,146.358,20.3765,69.6235,99.6201
149,150,658,2068,1100,186.18400000000003,0.451645,89.5484,99.9941
150,151,2430,2037,1109,187.189,0.312981,89.68700000000003,99.9954
151,152,1142,3130,1090,39.6361,64.1969,25.8031,99.9885
152,153,2883,129,1113,171.208,29.8453,60.1547,99.9033
153,154,7256,445,1135,340.11300000000006,81.5069,8.49311,99.9176
154,155,4849,277,1157,315.177,41.7426,48.2574,99.9954
155,156,1458,793,1137,343.716,77.6127,12.3873,99.988
156,157,1721,179,1173,141.045,27.3697,62.6303,97.7333
157,158,586,100,1163,310.308,46.2564,43.7436,99.9591
158,159,1909,373,1165,137.43,27.1853,62.8147,99.9977
159,160,1026,1392,1165,124.559,42.8324,47.1676,99.9931
160,161,16618,1316,1218,311.5490000000001,21.5181,68.4819,99.9054
161,162,276496,747,1687,136.471,28.1557,61.8443,99.5448
162,163,773,1812,1177,121.779,63.1996,26.8004,99.9169
163,164,17801,313,1265,8.03417,2.45271,87.5473,99.9146
164,165,1280,126,1195,310.621,45.8639,44.1361,99.9601
165,166,11748,460,1270,9.27717,2.06638,87.9336,99.861
166,167,2832,229,1218,128.368,26.6086,63.3914,99.9922
167,168,579,855,1218,168.52700000000004,40.88800000000001,49.112,99.985
168,169,677,819,1225,357.781,73.2527,16.7473,99.9958
169,170,48403,1195,1350,311.349,15.3426,74.6574,99.7979
170,171,12382,902,1276,177.801,19.296,70.704,99.9591
171,172,6939,3281,1257,203.758,62.0694,27.9306,99.9982
172,173,1273,120,1253,341.026,87.9629,2.03711,99.987
173,174,14423,1012,1323,350.07199999999995,66.692,23.308000000000003,99.9775
174,175,2563,183,1268,347.903,87.8794,2.12062,99.9966
175,176,1352,1047,1249,173.287,25.2023,64.7977,99.9656
176,177,10414,1357,1324,174.352,25.7853,64.2147,99.9769
177,178,2597,2945,1336,352.232,25.4346,64.5654,99.9224
178,179,1335,186,1337,6.2207,1.04342,88.9566,99.9891
179,180,2459,319,1348,8.22357,3.3210300000000004,86.679,99.998
180,181,22221,369,1430,315.427,64.9286,25.0714,99.9494
181,182,515,145,1354,314.633,64.1416,25.8584,99.8503
182,183,183432,453,1663,1.35319,20.7016,69.2984,99.4516
183,184,5880,499,1391,268.337,80.9264,9.07361,99.9843
184,185,2798,2996,1392,211.293,61.2798,28.7202,99.9827
185,186,32098,976,1475,316.26,51.9961,38.0039,99.8962
186,187,1013,113,1390,3.01914,27.1566,62.8434,99.9361
187,188,1072,559,1412,263.095,80.1974,9.80261,99.969
188,189,88321,1266,1590,123.177,60.764,29.236,99.7081
189,190,13367,1543,1550,170.58900000000003,41.8784,48.1216,99.8914
190,191,227952,2643,1734,151.849,33.0266,56.9734,99.91
191,192,693,2834,1520,359.832,6.57857,83.4214,99.9944
192,193,1902,439,1537,235.311,78.5714,11.4286,99.987
193,194,1003,2245,1545,139.637,23.8381,66.1619,99.7732
194,195,1299,1030,1572,171.671,25.8707,64.1293,99.9364
195,196,130157,212,1852,331.546,47.1417,42.8583,99.6223
196,197,735,870,1567,338.074,57.7882,32.2118,99.9861
197,198,15245,1659,1630,344.896,46.2766,43.7234,99.9749
198,199,12382,2180,1631,136.09,58.7595,31.2405,99.896
199,200,3175,1051,1605,338.455,60.9573,29.0427,99.9915
200,201,1914,906,1608,337.101,57.7351,32.2649,99.9723
201,202,2288,966,1613,4.8179,63.4309,26.5691,99.8914
202,203,14453,2045,1683,354.3730000000001,17.5064,72.4936,99.9104
203,204,49543,2285,1793,352.922,4.0373199999999985,85.9627,99.953
204,205,533,1750,1667,356.906,0.8301540000000001,89.1698,99.9805
205,206,1343,973,1662,317.314,53.9107,36.0893,99.9364
206,207,13305,1305,1737,348.235,30.1206,59.8794,99.9817
207,208,34484,1467,1760,11.4525,54.4014,35.5986,99.9434
208,209,5627,1037,1712,335.519,57.5973,32.4027,99.9955
209,210,2089,1602,1724,132.257,64.942,25.058000000000003,99.9262
210,211,1182,2146,1718,298.247,13.7555,76.2445,99.8446
211,212,1001,2378,1730,338.815,6.73043,83.2696,99.9926
212,213,1667,1663,1768,176.638,2.99736,87.0026,99.9979
213,214,689,2418,1764,341.557,7.45582,82.5442,99.9616
214,215,465417,1837,2108,6.90545,23.6866,66.3134,97.1321
215,216,10127,1247,1834,1.7156,66.2259,23.7741,99.8561
216,217,60283,2977,1985,27.9523,63.0013,26.9987,99.9494
217,218,45399,1043,1971,149.34799999999996,49.5117,40.4883,99.9431
218,219,1844,2061,1926,9.12294,15.1182,74.8818,99.8611
219,220,24644,3352,1999,173.515,78.6216,11.3784,99.9165
220,221,1817,822,1932,332.7680000000001,16.3608,73.6392,99.992
221,222,522,3158,1934,180.732,0.132118,89.8679,99.976
222,223,852,2723,1959,198.774,74.8115,15.1885,99.9957
223,224,3094,1809,1991,177.582,1.99447,88.0055,99.9968
224,225,25001,2502,2048,145.17700000000005,14.378,75.622,99.886
225,226,26961,1243,2069,120.224,64.4543,25.5457,99.811
226,227,170110,2664,2296,172.34099999999995,8.819469999999997,81.1805,100.112
227,228,1190,2175,2013,146.203,17.4239,72.5761,99.949
228,229,1780,3216,2015,356.871,1.71895,88.2811,99.9919
229,230,4339,445,2050,133.718,31.0478,58.9522,99.9927
230,231,31705,3193,2136,188.061,38.2053,51.7947,99.6487
231,232,3416,3257,2054,353.362,57.7469,32.2531,99.9602
232,233,6401,760,2109,345.69199999999995,44.6236,45.3764,99.8727
233,234,42384,907,2144,0.456642,27.6325,62.3675,99.9127
234,235,8721,2839,2116,190.647,78.0623,11.9377,99.986
235,236,1145,1820,2081,173.36700000000005,4.32455,85.6755,99.9973
236,237,2914,3405,2166,170.792,38.0537,51.9463,99.9329
237,238,7988,2043,2138,309.584,13.3431,76.6569,99.9783
238,239,9957,391,2124,352.92800000000005,11.7189,78.2811,99.5113
239,240,10526,1158,2175,145.559,10.6046,79.3954,99.9451
240,241,6106,1899,2123,340.476,40.4226,49.5774,99.8599
241,242,761,3428,2121,170.487,36.8045,53.1955,99.8255
242,243,32805,187,2196,258.567,76.3651,13.6349,99.9898
243,244,1469,2630,2150,312.275,5.14424,84.8558,99.9832
244,245,7571,2555,2168,172.067,11.5846,78.4154,99.9892
245,246,45788,2985,2307,350.574,12.2668,77.7332,70.4047
246,247,11082,427,2186,356.05800000000005,8.8146,81.1854,99.6843
247,248,35247,1024,2264,154.79,64.1212,25.8788,99.5895
248,249,4313,1943,2184,348.001,9.52247,80.4775,99.5409
249,250,7755,562,2201,317.8040000000001,22.2769,67.7231,99.945
250,251,3408,1866,2218,150.88,25.1189,64.8811,99.9543
251,252,30407,3254,2271,277.24,81.4349,8.56512,99.9457
252,253,1112,696,2198,17.7296,26.6022,63.3978,99.9912
253,254,5624,1225,2247,116.818,52.8477,37.1523,99.9693
254,255,588,2995,2201,186.311,42.0045,47.9955,99.9944
255,256,851,623,2217,141.088,23.0207,66.9793,99.9887
256,257,2774,589,2243,179.737,6.27277,83.7272,99.9545
257,258,41860,597,2332,177.14700000000005,7.2513,82.7487,99.886
258,259,33696,231,2345,127.224,30.8123,59.1877,99.8799
259,260,12055,394,2349,141.446,23.3928,66.6072,99.9811
260,261,12383,1784,2297,181.271,7.033760000000001,82.9662,99.9847
261,262,2340,818,2260,160.697,40.5256,49.4744,99.9593
262,263,1732,3406,2301,146.722,51.1262,38.8738,99.9565
263,264,8948,2851,2318,180.859,31.0097,58.9903,99.9343
264,265,605,2454,2276,296.719,78.8224,11.1776,99.9592
265,266,2188,3101,2313,180.275,5.25205,84.7479,99.9958
266,267,286699,806,2602,5.124230000000002,23.768,66.232,99.5302
267,268,77071,1263,2473,6.9996800000000015,4.62154,85.3785,99.856
268,269,4867,1691,2377,180.466,10.3179,79.6821,99.9886
269,270,2384,1101,2347,147.507,42.224,47.776,99.9766
270,271,3130,1383,2352,190.16,4.96516,85.0348,99.9807
271,272,173613,3214,2601,344.142,24.317,65.683,99.7753
272,273,9040,3381,2413,354.146,30.0841,59.9159,99.8832
273,274,510,81,2356,126.377,31.284,58.716,99.9558
274,275,523,1566,2383,0.343909,8.66943,81.3306,99.9762
275,276,6306,1862,2379,314.386,18.2806,71.7194,99.9752
276,277,9866,1619,2428,353.361,11.9701,78.0299,99.9471
277,278,40166,2242,2459,357.224,69.8715,20.1285,99.8854
278,279,962,2063,2395,354.56699999999995,9.86049,80.1395,99.9526
279,280,13557,2442,2499,137.914,53.9711,36.0289,99.8085
280,281,4643,2839,2434,173.07299999999995,5.80698,84.193,99.9497
281,282,697,323,2409,244.668,84.3833,5.61665,99.994
282,283,1922,2034,2417,349.032,56.4555,33.5445,99.9372
283,284,3850,415,2441,305.955,58.9261,31.0739,99.9891
284,285,24929,1748,2493,126.03,67.3106,22.6894,99.763
285,286,95377,273,2614,350.5680000000001,39.99,50.01,99.617
286,287,9396,1902,2470,345.475,55.6515,34.3485,99.9801
287,288,40158,1989,2575,169.671,43.2851,46.7149,99.8797
288,289,982,2777,2448,7.48555,58.3723,31.6277,99.9813
289,290,4735,1544,2476,341.892,35.269,54.731,99.9878
290,291,1500,2909,2487,171.957,1.40978,88.5902,99.9521
291,292,23398,2820,2570,339.761,5.38376,84.6162,98.1515
292,293,1900,408,2511,268.298,86.5145,3.4855400000000003,99.9722
293,294,12876,1521,2568,155.221,39.5327,50.4673,99.3357
294,295,33092,2977,2718,295.539,66.538,23.462,99.8652
295,296,616,1214,2557,8.694180000000001,1.70053,88.2995,99.9911
296,297,883,1916,2553,180.269,5.10201,84.898,99.8962
297,298,1070,418,2558,316.361,58.5666,31.4334,99.9898
298,299,1512,2159,2567,108.569,66.05,23.95,99.9791
299,300,1362,2270,2567,181.0,0.0,90.0,100.004
300,301,1767,2419,2570,173.458,6.12988,83.8701,99.9885
301,302,1501,2326,2571,181.0,0.0,90.0,100.004
302,303,7267,1689,2615,173.87099999999995,1.49306,88.5069,99.9676
303,304,1788,1826,2586,346.28,0.2612,89.7388,99.996
304,305,16846,2476,2688,351.202,61.6297,28.3703,99.7157
305,306,4618,434,2634,192.768,5.12731,84.8727,99.9854
306,307,849,2368,2602,350.608,4.76582,85.2342,99.9978
307,308,761,2074,2604,113.48,66.442,23.558000000000003,99.899
308,309,243603,1980,2881,349.206,14.425999999999998,75.574,97.6355
309,310,3115,1646,2644,174.616,0.6644439999999999,89.3356,99.8902
310,311,1615,2613,2628,355.485,2.08401,87.916,99.9852
311,312,11299,1571,2675,338.595,0.6638109999999999,89.3362,99.7187
312,313,1930,2671,2649,347.63699999999994,5.75301,84.24700000000001,99.9961
313,314,2158,2546,2632,176.93099999999995,62.8218,27.1782,99.9901
314,315,13657,2322,2706,357.492,1.66074,88.3393,99.9617
315,316,10574,1319,2680,152.653,39.7632,50.2368,99.9923
316,317,774,2263,2646,353.967,3.71397,86.286,99.9959
317,318,500,2898,2645,172.925,0.371048,89.62899999999998,99.9989
318,319,1519,2744,2658,350.982,5.51284,84.4872,99.9935
319,320,1793,1416,2672,316.769,49.84,40.16,99.9741
320,321,6141,1208,2704,180.08,35.4833,54.5167,99.9843
321,322,22405,2793,2713,155.031,79.3909,10.6091,99.9903
322,323,18765,1560,2770,350.651,1.16523,88.8348,99.7962
323,324,1246,2115,2689,170.304,42.1571,47.8429,99.9813
324,325,794,493,2684,335.44699999999995,54.2025,35.7975,99.9917
325,326,767,527,2697,348.027,43.3297,46.6703,99.7401
326,327,13025,2565,2758,161.392,39.6602,50.3398,99.9519
327,328,15978,2723,2811,159.751,14.7317,75.2683,99.929
328,329,38503,1275,2821,347.981,34.1764,55.8236,99.9244
329,330,4955,279,2769,356.475,5.00116,84.9988,99.9934
330,331,1749,154,2767,348.05300000000005,3.54681,86.4532,99.9357
331,332,3262,486,2784,355.994,26.4903,63.5097,99.9249
332,333,10189,230,2819,162.67600000000004,54.2577,35.7423,99.9973
333,334,15445,2449,2847,324.036,24.8593,65.1407,99.8941
334,335,17380,2943,2871,345.332,23.2043,66.7957,99.8221
335,336,676,132,2822,349.291,7.9261,82.0739,99.9802
336,337,1439,2348,2820,359.185,7.51558,82.4844,99.9801
337,338,651,3108,2810,353.671,20.3534,69.6466,99.7818
338,339,4519,89,2850,132.501,53.931,36.069,99.945
339,340,1419,2634,2814,359.038,0.800056,89.1999,99.9757
340,341,3228,515,2834,355.963,45.648,44.352,99.9856
341,342,711,986,2819,208.5,61.0604,28.9396,99.9942
342,343,17535,3227,2906,354.365,0.339493,89.6605,99.982
343,344,13071,766,2871,357.017,37.2295,52.7705,99.9863
344,345,643,3158,2831,177.15099999999995,2.27771,87.7223,99.9997
345,346,3043,451,2848,5.92955,53.68899999999999,36.311,99.9671
346,347,30456,1538,2926,1.34139,30.1804,59.8196,99.9575
347,348,818,151,2838,352.245,6.10155,83.8985,99.993
348,349,3135,356,2839,327.108,73.0491,16.9509,99.9437
349,350,4142,882,2863,343.588,63.7208,26.2792,99.9797
350,351,483493,515,3258,349.555,7.30138,82.6986,91.969
351,352,7801,1301,2889,90.1362,69.4561,20.5439,99.9692
352,353,7107,2667,2894,358.302,1.6853,88.3147,99.9769
353,354,1104,2564,2850,155.959,14.5524,75.4476,99.9465
354,355,7678,3109,2887,144.765,49.3954,40.6046,99.9954
355,356,23572,2878,2935,149.362,27.9316,62.0684,99.9094
356,357,3222,2601,2871,321.075,18.5214,71.4786,99.9925
357,358,572,1422,2859,320.361,50.7682,39.2318,99.951
358,359,569,1391,2870,5.82073,26.2297,63.7703,99.9306
359,360,29303,169,2958,183.023,70.5412,19.4588,99.9756
360,361,4804,367,2893,1.75354,19.1995,70.8005,99.723
361,362,3856,3370,2907,58.7633,78.3998,11.6002,99.9706
362,363,656,3178,2884,177.17,1.85413,88.1459,99.9997
363,364,1016,275,2894,354.287,41.989,48.011,99.988
364,365,8699,453,2929,333.30300000000005,54.8117,35.1883,99.871
365,366,26541,2540,2978,170.98,32.6055,57.3945,99.8145
366,367,878,1410,2907,90.7314,68.4967,21.5032,99.962
367,368,1574,3416,2938,323.327,5.60036,84.3996,99.9396
368,369,1133,2361,2929,337.99,1.87928,88.1207,99.9555
369,370,36627,1345,3052,329.617,37.3835,52.6165,99.8087
370,371,45479,2793,3047,347.58,33.1597,56.8403,99.8313
371,372,4879,3053,2976,323.574,9.78233,80.2177,99.994
372,373,5231,2406,2990,3.59884,6.4947599999999985,83.5052,99.9939
373,374,4993,2317,2982,359.742,12.7432,77.2568,99.8591
374,375,4512,3382,2983,341.849,10.493,79.507,99.8946
375,376,1040,2644,2960,158.696,3.30452,86.6955,99.9744
376,377,34152,3171,3033,337.0130000000001,31.5753,58.4247,60.9643
377,378,544,1272,2960,2.48022,38.0145,51.9855,99.9388
378,379,54737,1125,3194,156.079,14.3528,75.6472,99.807
379,380,40999,1615,3075,335.668,24.1827,65.8173,99.8239
380,381,1213,2359,3013,359.961,10.2115,79.7885,99.9661
381,382,523,3402,3030,349.514,4.0479699999999985,85.95200000000001,99.9848
382,383,142238,2587,3246,173.75400000000005,2.15253,87.8475,99.7573
383,384,7660,2239,3076,235.347,87.566,2.43397,99.9584
384,385,759,112,3055,174.241,14.9637,75.0363,99.9361
385,386,8085,1131,3101,131.308,21.2618,68.7382,99.9781
386,387,10265,3351,3130,156.621,19.2884,70.7116,99.811
387,388,1698,2348,3073,144.55100000000004,9.67683,80.3232,99.9431
388,389,917,2112,3103,348.011,5.8019300000000005,84.1981,99.9759
389,390,731,237,3069,355.296,39.6047,50.3953,99.9828
390,391,2397,1033,3083,170.583,16.3252,73.6748,99.9725
391,392,3710,959,3107,332.80800000000005,44.0849,45.9151,99.9192
392,393,741,3309,3072,175.393,4.9705900000000005,85.0294,99.9825
393,394,1614,2064,3093,347.119,5.1637,84.8363,99.9939
394,395,1517,1031,3111,175.166,12.4403,77.5597,99.9522
395,396,42646,3011,3216,348.356,0.177849,89.8222,94.0825
396,397,1072,3038,3088,337.091,8.42265,81.5773,99.9982
397,398,837,2143,3096,349.3930000000001,5.7480699999999985,84.2519,99.9737
398,399,13553,2304,3142,323.3640000000001,58.3761,31.6239,99.895
399,400,7159,3258,3142,334.302,9.31515,80.6849,99.8427
400,401,663,3069,3113,337.216,8.69153,81.3085,99.9965
401,402,1693,2178,3120,204.165,70.1415,19.8585,99.7863
402,403,1495,2011,3136,347.22,6.0080300000000015,83.992,99.9704
403,404,14951,848,3183,332.848,44.7898,45.2102,99.9708
404,405,5589,3366,3193,57.03100000000001,77.8962,12.1038,99.8991
405,406,10784,570,3169,133.722,16.8882,73.1118,99.9852
406,407,6612,1488,3158,146.828,5.90948,84.0905,99.9324
407,408,1534,1764,3143,0.101072,31.3408,58.6592,99.8552
408,409,6914,712,3178,133.862,11.8264,78.1736,99.9819
409,410,1176,2084,3162,338.677,8.76176,81.2382,99.9741
410,411,5148,2125,3189,303.68,23.2115,66.7885,99.9832
411,412,2703,3125,3171,337.6690000000001,9.98869,80.0113,99.998
412,413,20682,1844,3227,349.226,33.5913,56.4087,99.9487
413,414,282962,1167,3545,178.1,15.2811,74.7189,98.9356
414,415,7891,942,3201,50.8515,75.4015,14.5985,99.9912
415,416,45487,1653,3313,176.165,40.6142,49.3858,99.8361
416,417,677,3222,3193,332.0080000000001,9.13962,80.8604,99.9757
417,418,655,3177,3191,330.834,9.69872,80.3013,99.9976
418,419,1119,1572,3192,186.758,50.2159,39.7841,99.9832
419,420,541,2004,3201,338.9430000000001,9.5219,80.4781,99.9687
420,421,1203,671,3197,348.807,8.76057,81.2394,99.9943
421,422,1236,775,3207,343.465,42.324,47.676,99.8951
422,423,15843,2219,3271,202.09,71.5256,18.4744,99.9817
423,424,4844,2022,3249,350.26,5.70184,84.2982,99.9716
424,425,621,2276,3205,78.2519,57.2406,32.7594,99.9898
425,426,7638,1519,3258,332.0440000000001,54.188,35.812,99.9807
426,427,2781,3181,3269,352.852,4.88389,85.1161,99.9986
427,428,79004,3185,3474,2.53409,64.6712,25.3288,75.6528
428,429,1813,3218,3274,348.02,5.19541,84.8046,99.9981
429,430,749,786,3260,180.302,5.65925,84.3408,99.9991
430,431,30842,1974,3393,166.043,26.5367,63.4633,99.5963
431,432,15529,3290,3344,353.025,5.17923,84.8208,99.99
432,433,3036,909,3324,56.393,76.5517,13.4483,99.9836
433,434,2472,3404,3353,165.535,33.3762,56.6238,99.8453
434,435,1689,3075,3319,49.0126,67.8346,22.1654,99.9778
435,436,17276,2889,3379,25.4014,86.8407,3.15932,99.9893
436,437,2000,1504,3346,178.717,11.5521,78.4479,99.9968
437,438,5523,1835,3340,138.543,27.1251,62.8749,99.9353
438,439,646,2150,3332,190.114,63.5764,26.4236,99.9862
439,440,3716,2301,3361,330.602,8.34009,81.6599,99.9875
440,441,22281,2219,3412,138.59799999999998,40.5785,49.4215,99.992
441,442,5085,1013,3369,177.563,20.3097,69.6903,99.8837
442,443,14962,2055,3401,302.504,20.5019,69.4981,99.9669
443,444,20284,3032,3412,173.83900000000003,3.38194,86.6181,99.9633
444,445,1107,1096,3366,180.829,7.80708,82.1929,99.9975
445,446,2949,648,3376,134.5,18.4539,71.5461,99.9905
446,447,65743,2662,3499,328.52,10.2686,79.7314,99.8751
447,448,3250,2378,3407,177.05900000000003,1.91748,88.0825,100.002
448,449,5330,1840,3419,42.412,67.3952,22.6048,99.9739
449,450,33864,1690,3493,168.518,21.2862,68.7138,99.0585
450,451,1650,1062,3423,180.843,7.99665,82.0033,99.9988
451,452,972,1491,3421,178.35299999999995,11.235,78.765,99.9927
452,453,580,1529,3425,176.838,22.1567,67.8433,99.9487
453,454,582,2435,3437,350.278,1.64687,88.3531,99.9941
454,455,3255,2894,3463,177.332,2.60866,87.3913,99.9813
455,456,12930,2350,3547,336.992,52.0808,37.9192,99.9591
456,457,2615,810,3479,350.3040000000001,36.0977,53.9023,99.9786
457,458,4344,1494,3478,338.292,51.4196,38.5804,99.9897
458,459,671005,2629,3878,196.264,54.4589,35.5411,95.3102
459,460,3260,1882,3515,164.72799999999995,48.5634,41.4366,99.8547
460,461,20554,2457,3580,204.717,70.462,19.538,99.9705
461,462,533,3064,3504,168.584,3.24197,86.758,99.9786
462,463,4567,1704,3561,301.36,20.6049,69.3951,99.9822
463,464,10151,2850,3576,346.986,84.8302,5.16975,99.894
464,465,5198,232,3564,351.496,6.3137300000000005,83.6863,99.9895
465,466,662,792,3534,353.17,3.19177,86.8082,99.9899
466,467,1215,2006,3552,17.3683,50.9535,39.0465,99.9299
467,468,9151,327,3610,316.527,50.4324,39.5676,99.9271
468,469,36083,1923,3638,15.4949,50.8848,39.1152,98.4357
469,470,33903,3330,3724,319.328,35.9714,54.0286,99.8762
470,471,1030,837,3573,124.48,29.9424,60.0576,99.9843
471,472,15973,1689,3676,359.726,67.8433,22.1567,99.9288
472,473,713,1729,3614,27.439,68.4982,21.5018,99.9908
473,474,84191,597,3790,127.997,30.1864,59.8136,99.8742
474,475,4855,359,3692,130.15200000000002,29.2916,60.7084,99.9462
475,476,763,1535,3662,178.58599999999996,12.3065,77.6935,99.9963
476,477,6313,241,3691,6.527430000000002,66.1958,23.8042,99.9802
477,478,1347,1601,3659,5.96539,68.5184,21.4816,99.9871
478,479,4672,2415,3689,324.887,2.04436,87.9556,99.8841
479,480,6743,1556,3732,31.1771,69.0947,20.9053,99.9973
480,481,124407,971,4062,135.499,37.047,52.953,70.3762
481,482,583,1871,3690,126.354,42.2768,47.7232,99.991
482,483,3204,1615,3732,129.292,26.5795,63.4205,99.9895
483,484,50574,1906,3861,307.735,36.9318,53.0682,99.9645
484,485,25663,221,3796,278.152,75.1469,14.8531,99.9669
485,486,36913,1426,3812,126.344,27.3634,62.6366,99.8924
486,487,4708,1770,3770,3.10421,4.89061,85.1094,99.9949
487,488,3485,994,3771,4.7046,8.03082,81.9692,99.9908
488,489,963,371,3752,316.132,48.8126,41.1874,99.9958
489,490,1421,74,3769,192.091,43.6379,46.3621,99.9277
490,491,61314,1618,3932,2.11674,55.2259,34.7741,99.9006
491,492,827,3221,3829,137.267,44.1357,45.8643,99.9977
492,493,52180,1266,3950,2.65647,8.49485,81.5051,98.4442
493,494,6079,3336,3869,193.858,60.4308,29.5692,99.939
494,495,8066,215,3879,10.3287,24.6415,65.3585,99.876
495,496,2194,925,3879,2.91326,10.0903,79.9097,99.8796
496,497,3664,320,3914,154.194,37.4237,52.5763,99.9949
497,498,43887,768,3952,149.749,34.8247,55.1753,99.889
498,499,8282,3371,3936,350.1,8.482489999999999,81.5175,99.9852
499,500,5838,109,3938,1.24268,27.7911,62.2089,99.9213
500,501,810,1110,3910,117.495,29.7481,60.2519,99.6439
501,502,44463,203,4060,126.116,43.5645,46.4355,99.9294
502,503,4044,514,3945,4.25189,1.61953,88.3805,99.9918
503,504,2578,577,3941,2.56533,15.8851,74.1149,99.9503
504,505,4543,384,3954,356.024,51.1356,38.8644,99.9274
505,506,82798,1850,4107,35.8094,76.3997,13.6003,99.9966
506,507,2160,2002,3991,314.031,56.7453,33.2547,99.9631
507,508,177040,317,4360,242.472,68.515,21.485,90.6814
508,509,4078,582,4013,359.284,59.3607,30.6393,99.7125
509,510,72148,3334,4232,12.1856,38.6654,51.3346,99.757
510,511,1350,136,4002,341.973,51.3898,38.6102,99.9252
511,512,3968,1362,4052,4.852530000000002,54.3212,35.6788,99.9887
512,513,43216,683,4200,182.234,44.7043,45.2957,99.9702
513,514,15681,552,4105,4.78727,51.8187,38.1813,99.9755
514,515,1150,152,4045,23.1632,56.358,33.642,99.9796
515,516,58924,1111,4231,9.41896,51.6987,38.3013,99.9908
516,517,146308,1452,4239,13.4319,31.3209,58.6791,69.7965
517,518,11344,2321,4142,26.2225,56.0671,33.9329,99.7773
518,519,10143,3201,4138,358.4980000000001,26.3469,63.6531,99.9774
519,520,132601,2913,4452,8.00767,34.2545,55.7455,90.5983
520,521,675,2639,4130,139.66899999999998,39.5668,50.4332,99.9945
521,522,18529,2722,4221,145.477,33.2633,56.7367,99.9907
522,523,1628,269,4177,333.923,53.0307,36.9693,99.996
523,524,7772,551,4238,135.004,21.596,68.404,99.9875
524,525,32188,2093,4267,24.4142,42.5349,47.4651,99.9674
525,526,804,57,4212,156.054,26.2906,63.7094,99.8372
526,527,1051,2009,4206,188.558,2.25306,87.7469,99.9853
527,528,1356,3157,4217,339.602,16.9105,73.0895,99.9975
528,529,94629,2580,4390,5.29483,2.40192,87.5981,99.8677
529,530,4780,3209,4245,159.484,71.4557,18.5443,99.9982
530,531,12215,1925,4283,12.2958,48.2646,41.7354,99.9386
531,532,10752,2228,4291,351.0019999999999,31.9908,58.0092,99.9933
532,533,4639,2315,4257,4.0105900000000005,0.884209,89.1158,99.9992
533,534,10098,129,4259,330.717,67.6846,22.3154,99.948
534,535,10026,795,4288,180.024,37.8828,52.1172,99.9713
535,536,21362,1750,4319,92.8216,45.2361,44.7639,99.9719
536,537,23598,3140,4350,325.466,18.9864,71.0136,99.9717
537,538,529,53,4301,154.79,25.7542,64.2458,99.9393
538,539,118026,606,4524,332.2290000000001,66.516,23.484,99.8283
539,540,3887,2760,4331,325.372,24.8016,65.1984,99.901
540,541,2453,3222,4331,347.7630000000001,13.3256,76.6744,99.96
541,542,9592,97,4364,213.574,44.8137,45.1863,99.8955
542,543,7097,2090,4359,319.6670000000001,23.0135,66.9865,99.989
543,544,4380,3009,4345,2.88967,12.601,77.399,99.9936
544,545,1936,1921,4346,310.426,47.8872,42.1128,99.9449
545,546,7572,2344,4379,24.0886,43.1147,46.8853,99.979
546,547,729,2285,4339,9.79079,35.3827,54.6173,98.3297
547,548,578,3177,4349,18.5324,39.8213,50.1787,99.997
548,549,2814,812,4363,176.877,54.5327,35.4673,99.9937
549,550,5955,2235,4382,25.2651,42.9096,47.0904,99.9559
550,551,1638,1887,4376,170.755,37.493,52.507,99.9529
551,552,2429,2168,4388,189.285,46.1132,43.8868,99.9937
552,553,73344,1097,4489,123.501,70.2033,19.7967,99.8848
553,554,98921,2154,4578,329.896,41.4689,48.5311,99.7971
554,555,563,3157,4378,178.667,69.7674,20.2326,99.9971
555,556,20998,1933,4449,11.0379,47.7953,42.2047,98.6771
556,557,3770,2304,4438,53.8373,76.9664,13.0336,99.9347
557,558,5219,3073,4425,166.575,73.7341,16.2659,99.9941
558,559,24336,1633,4486,355.389,10.1651,79.8349,99.9025
559,560,999,2042,4417,192.908,44.06100000000001,45.93899999999999,99.9957
560,561,1664,2376,4461,3.07928,3.02798,86.97200000000002,99.9981
561,562,6205,3223,4478,97.1341,66.0762,23.9238,99.9923
562,563,18604,1769,4510,140.888,44.0835,45.9165,99.9635
563,564,2201,1508,4458,188.933,1.2702,88.7298,99.9942
564,565,13657,1407,4528,184.019,2.12022,87.8798,99.7421
565,566,4820,3289,4503,260.369,57.3888,32.6112,99.995
566,567,15926,3346,4568,129.57299999999998,22.7301,67.2699,99.734
567,568,2294,2387,4528,323.636,32.8613,57.1387,99.7139
568,569,17584,2603,4574,40.1809,48.2738,41.7262,82.0164
569,570,30501,3124,4613,218.704,60.2942,29.7058,57.0193
570,571,42377,1168,4651,298.283,29.8572,60.1428,99.9219
571,572,6314,1642,4592,357.23,5.45843,84.5416,99.9946
572,573,11065,2387,4618,334.546,33.5267,56.4733,99.8173
573,574,51861,1955,4678,20.7476,54.6658,35.3342,99.9604
574,575,16661,834,4640,177.671,6.31896,83.681,99.9998
575,576,13502,635,4631,190.197,44.6397,45.3603,99.9922
576,577,2408,1146,4614,349.55300000000005,45.4807,44.5193,99.9973
577,578,2301,1716,4620,92.0417,42.7201,47.2799,99.9971
578,579,1677,1455,4615,187.843,1.58484,88.4152,99.9959
579,580,22315,283,4686,187.591,70.0619,19.9381,99.8366
580,581,2695,2465,4643,320.913,26.0106,63.9894,99.9858
581,582,27130,1531,4665,130.197,44.765,45.235,99.9642
582,583,31467,2566,4718,306.997,23.7808,66.2192,99.9742
583,584,18212,2875,4714,185.776,16.9356,73.0644,63.1712
584,585,3343,3252,4677,263.094,57.4739,32.5261,99.9738
585,586,5404,1756,4697,91.5586,45.0839,44.9161,99.9954
586,587,4665,3163,4686,320.7920000000001,25.1546,64.8454,99.9806
587,588,6182,67,4717,311.655,59.1191,30.8809,96.4561
588,589,5277,614,4687,186.829,69.7669,20.2331,99.9846
589,590,1095,2380,4686,330.42800000000005,44.6909,45.3091,99.9277
590,591,3054,1321,4701,352.046,43.0928,46.9072,99.9736
591,592,1061,3095,4684,20.7187,39.1741,50.8259,99.9976
592,593,1563,3072,4716,175.037,5.04253,84.9575,99.9904
593,594,4345,2392,4738,114.927,35.1667,54.8333,99.9626
594,595,1715,2329,4752,335.228,35.1475,54.8525,99.7528
595,596,1041,1827,4738,92.6837,44.875,45.125,99.9926
596,597,2146,2698,4768,11.715,60.4493,29.5507,99.946
