,Grain No.,Size [Pixel],center x-coordinate,center y-coordinate,mean azimuth [degree],mean latitude [degree],mean colatitude [degree],Regelungsgrad [%]
0,1,11807,1918,281,116.281,78.1025,11.8975,99.9023
1,2,7551,2420,275,51.2575,83.2417,6.758310000000002,99.9373
2,3,995,1391,265,35.1119,18.2876,71.7124,99.7942
3,4,25542,969,342,49.7325,17.6821,72.3179,99.4297
4,5,5722,1215,275,39.6802,63.9566,26.0434,99.9201
5,6,70413,474,400,35.8489,17.3135,72.6865,95.1414
6,7,2467,714,276,52.5691,29.0462,60.9538,99.5933
7,8,11632,1678,306,178.433,62.291,27.709,99.8955
8,9,1145,2167,272,352.749,72.6653,17.3347,99.9602
9,10,1240,308,276,34.5354,8.77798,81.222,98.9845
10,11,908,574,266,191.882,55.4681,34.5319,99.9294
11,12,11589,3851,347,44.3747,77.4501,12.5499,99.8455
12,13,9801,2929,321,23.9946,45.9681,44.0319,99.9739
13,14,2423,1561,287,31.9782,13.987,76.013,99.4925
14,15,3803,2098,304,161.768,79.0359,10.9641,99.9344
15,16,3630,2253,292,209.677,1.61688,88.3831,99.8451
16,17,1352,2872,279,215.459,6.0900300000000005,83.91,99.9701
17,18,34803,2689,339,205.542,9.05359,80.9464,99.7246
18,19,35649,3067,395,200.783,31.8063,58.1937,63.7708
19,20,1125,3062,276,210.853,66.6862,23.3138,99.9508
20,21,1350,1501,289,31.835,29.9828,60.0172,99.606
21,22,504,2644,277,204.129,8.82502,81.175,99.6365
22,23,772,3124,287,29.1275,53.6807,36.3193,99.9811
23,24,3128,340,309,34.5635,4.191319999999998,85.8087,99.9383
24,25,3680,1364,308,28.6044,22.2476,67.7524,99.9161
25,26,5465,3216,318,28.9879,52.8018,37.1982,99.8172
26,27,35967,3527,342,213.566,2.17913,87.8209,99.5538
27,28,3604,831,312,213.075,22.7416,67.2584,99.9639
28,29,839,1443,291,39.3014,52.3032,37.6968,99.9011
29,30,3494,1113,322,33.5594,43.4968,46.5032,99.9733
30,31,2201,1447,314,37.6685,51.823,38.177,99.974
31,32,37458,1225,435,26.7556,23.9454,66.0546,99.6434
32,33,2770,2001,338,217.939,23.5408,66.4592,57.5025
33,34,823,2182,315,348.541,75.0979,14.9021,99.9665
34,35,991,1555,315,30.2564,14.7997,75.2003,99.9788
35,36,2594,3739,328,31.3681,1.45596,88.544,99.9247
36,37,31636,1838,411,36.6813,0.552925,89.4471,99.9403
37,38,1304,311,331,14.8844,55.1911,34.8089,99.9968
38,39,55687,3326,507,31.375,40.3634,49.6366,99.2695
39,40,2579,2514,366,32.527,26.1427,63.8573,99.9069
40,41,659,1629,330,217.135,0.613358,89.3866,99.994
41,42,970,1335,357,207.708,8.60619,81.3938,99.9264
42,43,2752,766,342,22.7438,61.1267,28.8733,99.9873
43,44,7117,1339,383,35.1766,61.6381,28.3619,99.9925
44,45,52437,1502,462,203.613,7.329389999999999,82.6706,99.5061
45,46,7542,2434,397,201.93400000000003,61.9482,28.0518,99.82
46,47,1012,1532,345,197.467,16.565,73.435,99.9931
47,48,4128,2188,392,208.78,42.1665,47.8335,99.7848
48,49,15508,3477,406,18.499,22.7323,67.2677,96.1149
49,50,64214,769,484,33.66,10.0236,79.9764,92.3431
50,51,20499,2014,547,358.051,82.51100000000002,7.48901,99.9103
51,52,9135,3750,403,39.1818,75.2569,14.7431,99.9474
52,53,631,2356,384,204.646,64.6832,25.3168,99.9602
53,54,2442,3166,397,35.323,44.6099,45.3901,99.8767
54,55,14225,2769,420,257.376,86.5589,3.44105,99.9604
55,56,893,1748,413,24.9725,79.5203,10.4797,99.993
56,57,1586,1694,410,24.7635,80.1776,9.82241,99.9907
57,58,7052,2531,467,197.83,68.2244,21.7756,99.986
58,59,2574,2149,427,17.2679,43.9079,46.0921,99.9495
59,60,2204,2030,419,208.451,41.3359,48.6641,99.9812
60,61,22295,1100,525,208.712,19.9819,70.0181,99.4534
61,62,25687,2331,485,359.964,77.5646,12.4354,99.968
62,63,3239,1586,441,17.6603,40.2432,49.7568,99.9639
63,64,836,2106,436,209.368,39.7753,50.2247,99.9774
64,65,791,1682,442,216.61900000000003,0.773521,89.2265,99.7547
65,66,42718,2854,535,42.4609,60.8492,29.1508,99.8828
66,67,4104,1738,462,18.0409,41.2365,48.7635,99.8169
67,68,17487,3636,534,31.431,42.5101,47.4899,98.074
68,69,14686,2119,505,21.6045,57.0985,32.9015,94.2048
69,70,5614,2658,494,35.767,4.22425,85.7757,99.7528
70,71,1523,2591,477,40.4241,70.0406,19.9594,99.9943
71,72,8253,3495,512,195.748,59.6674,30.3326,99.9714
72,73,9272,3809,495,216.025,3.90307,86.0969,99.2401
73,74,627,3009,472,28.939,54.5162,35.4838,99.9736
74,75,12155,2488,558,30.1986,69.0626,20.9374,99.8755
75,76,947,2218,475,206.667,42.6565,47.3435,99.9826
76,77,159326,426,802,202.643,60.8116,29.1884,61.3415
77,78,2757,1004,501,37.9916,46.1998,43.8002,99.5625
78,79,7443,3046,533,35.9802,49.5011,40.4989,99.9463
79,80,9799,1745,547,36.6404,45.488,44.512,99.9762
80,81,2147,3139,532,35.1993,37.3831,52.6169,99.7059
81,82,18583,3201,592,39.1234,20.8875,69.1125,99.9631
82,83,79002,2553,760,196.987,15.1103,74.8897,89.0105
83,84,791,3104,528,18.9717,4.5079,85.4921,99.8777
84,85,13902,2261,612,31.3784,0.7479319999999999,89.2521,99.7379
85,86,12807,1931,581,34.4761,30.8102,59.1898,99.9847
86,87,117069,979,743,199.767,30.3069,59.6931,99.8759
87,88,7733,3854,597,37.1383,35.3792,54.6208,99.782
88,89,8228,1635,585,26.9919,4.1612,85.8388,99.9831
89,90,21273,1770,652,34.5007,28.5529,61.4471,99.7304
90,91,4132,2393,578,211.823,66.0391,23.9609,99.9569
91,92,3512,3771,601,36.538,35.9469,54.0531,99.5546
92,93,4116,2127,601,29.1223,4.137569999999998,85.8624,99.9739
93,94,2849,1429,586,19.1736,79.2526,10.7474,99.976
94,95,641,577,582,188.47,78.0787,11.9213,99.9887
95,96,1041,3104,590,35.5384,36.8656,53.1344,99.9808
96,97,7184,621,629,25.0436,56.8644,33.1356,99.9926
97,98,3623,3485,610,31.0478,52.7074,37.2926,99.8922
98,99,5152,2935,624,23.5211,70.0816,19.9184,99.7824
99,100,7442,1235,631,35.8254,25.0962,64.9038,99.9842
100,101,3776,3064,621,22.9254,69.2022,20.7978,99.9547
101,102,1933,1331,617,35.689,25.305,64.695,99.9223
102,103,782,3823,612,45.6911,36.4015,53.5985,99.8468
103,104,7500,701,658,18.5324,8.92489,81.0751,99.9329
104,105,496868,3517,1214,25.6285,79.205,10.795,66.5406
105,106,7587,1599,645,36.9663,44.3567,45.6433,99.9859
106,107,780,1450,623,35.4766,22.5542,67.4458,99.9795
107,108,658,192,640,193.175,76.7212,13.2788,99.961
108,109,1116,1410,639,209.442,6.05576,83.9442,99.991
109,110,2707,3437,665,204.372,18.1824,71.8176,99.9773
110,111,129273,1773,863,30.3336,46.613,43.387,99.5231
111,112,4536,3007,662,205.882,64.0499,25.9501,99.9243
112,113,2249,3879,685,206.824,8.22759,81.7724,99.7078
113,114,558,1367,650,10.77,79.9163,10.0837,99.9857
114,115,1414,1484,652,36.188,22.6135,67.3865,99.946
115,116,5205,2704,694,198.973,52.5263,37.4737,99.9246
116,117,751,1529,658,34.3131,10.2863,79.7137,99.8205
117,118,1539,2561,657,212.176,58.2021,31.7979,99.9852
118,119,28927,2205,777,35.0162,28.7909,61.2091,99.8479
119,120,504,215,667,192.442,78.1212,11.8788,99.9693
120,121,859,2202,659,25.362,4.52188,85.4781,99.8873
121,122,801,173,676,206.659,82.5444,7.45555,99.8518
122,123,19316,2350,745,192.109,11.8148,78.1852,99.9544
123,124,10943,2877,701,31.3883,18.5671,71.4329,99.856
124,125,976,3910,681,243.9,28.9104,61.0896,99.1504
125,126,106016,1304,851,35.3384,44.2837,45.7163,99.9516
126,127,8045,3065,716,39.1214,29.0144,60.9856,99.9749
127,128,4824,1433,695,209.621,5.8951,84.1049,99.9934
128,129,3523,1557,706,11.9948,83.0248,6.97519,99.9167
129,130,18013,3141,766,22.4088,54.1613,35.8387,99.9865
130,131,6506,3335,713,27.03,69.4391,20.5609,99.9083
131,132,16391,703,752,20.0182,47.4897,42.5103,99.9692
132,133,1361,589,705,204.983,9.02721,80.9728,99.9649
133,134,774,177,713,351.285,75.6464,14.3536,99.6889
134,135,1886,2616,726,205.064,49.0045,40.9955,99.9536
135,136,1436,3127,725,38.3878,38.6603,51.3397,99.9862
136,137,1545,1538,732,33.7596,10.74,79.26,99.9815
137,138,17993,2689,800,189.13,62.1369,27.8631,99.9746
138,139,20520,2866,789,32.859,45.3543,44.6457,99.9587
139,140,1165,3432,744,41.9513,43.0043,46.9957,99.9949
140,141,17855,253,846,358.532,76.5762,13.4238,99.9044
141,142,16041,3329,787,22.123,54.1832,35.8168,99.9946
142,143,19906,3607,855,47.4912,45.3017,44.6983,99.9394
143,144,1013,3880,751,203.794,26.8626,63.1374,99.2462
144,145,5142,2998,800,200.898,53.1823,36.8177,99.9849
145,146,590,3905,769,218.947,25.561,64.439,99.5135
146,147,4305,1619,800,36.588,44.3942,45.6058,99.8853
147,148,801,166,800,353.048,79.6764,10.3236,99.9374
148,149,7707,3914,860,28.4284,46.6815,43.3185,99.8865
149,150,8332,1563,838,28.331,83.551,6.44896,99.9834
150,151,31701,780,894,210.201,6.7343899999999985,83.2656,99.9707
151,152,1534,2086,805,162.15,62.3414,27.6586,99.9919
152,153,1977,3732,825,203.301,16.7717,73.2283,99.9718
153,154,14649,3809,882,210.632,24.6286,65.3714,99.9766
154,155,28746,2111,962,193.642,60.0676,29.9324,99.5721
155,156,1846,3056,844,215.818,75.3909,14.6091,99.9918
156,157,2053,1951,845,186.952,54.9872,35.0128,99.9978
157,158,5750,2017,855,32.6078,26.3261,63.6739,99.7143
158,159,9586,366,896,216.866,69.5642,20.4358,99.9903
159,160,640,2401,859,192.52,10.7066,79.2934,99.8532
160,161,6024,2324,889,18.3339,12.8213,77.1787,99.8086
161,162,67933,2890,983,202.893,18.6376,71.3624,92.3213
162,163,1875,2998,863,17.9899,11.8469,78.1531,99.9753
163,164,646,2942,876,210.731,66.8988,23.1012,99.9835
164,165,625,1935,895,191.925,9.07672,80.9233,99.9813
165,166,9856,2241,954,82.7326,85.2814,4.7186,99.9856
166,167,1327,1918,891,189.249,6.7370800000000015,83.2629,99.9973
167,168,1593,3131,919,208.596,15.1437,74.8563,99.9937
168,169,40027,1892,1016,210.373,51.625,38.375,99.9385
169,170,19948,1454,1043,196.086,59.4643,30.5357,99.9522
170,171,2812,2951,939,16.5085,11.1177,78.8823,99.9579
171,172,7200,2309,987,207.887,9.92704,80.07300000000002,99.872
172,173,9907,609,980,334.0,84.6735,5.32653,99.9662
173,174,51225,2552,1037,214.159,42.452,47.548,99.9423
174,175,824,2900,950,17.0166,10.2982,79.7018,99.8523
175,176,2740,966,986,20.1823,10.2942,79.7058,99.5969
176,177,1762,168,1003,23.0328,69.9841,20.0159,99.8518
177,178,24177,1092,1065,47.7208,81.3543,8.6457,99.9562
178,179,36810,940,1096,204.76,27.6502,62.3498,99.8604
179,180,6153,685,1032,216.305,56.4088,33.5912,92.3875
180,181,3707,1198,1035,211.647,11.6451,78.3549,99.8973
181,182,10121,1319,1065,226.49400000000003,65.7806,24.2194,99.8921
182,183,9523,2217,1075,54.6441,67.1901,22.8099,99.9638
183,184,15538,793,1106,253.66,85.221,4.778969999999998,99.9891
184,185,739,216,1051,19.2032,14.0123,75.9877,99.9453
185,186,751,706,1049,242.205,82.1434,7.85658,99.987
186,187,5297,2315,1110,195.073,67.9899,22.0101,99.7639
187,188,2214,597,1063,30.444000000000006,44.0888,45.9112,99.9954
188,189,602,2002,1053,29.2498,6.90319,83.0968,99.9196
189,190,2331,1940,1078,209.557,46.0841,43.9159,99.987
190,191,1759,235,1085,220.238,76.4793,13.5207,99.9448
191,192,93451,414,1293,28.2303,7.80681,82.1932,77.2294
192,193,716,2358,1080,207.719,10.0194,79.9806,99.9711
193,194,6926,662,1113,97.3943,83.2359,6.7641100000000005,99.9818
194,195,1806,2002,1094,128.352,83.4293,6.570710000000001,99.9484
195,196,26455,3005,1182,30.05,42.4632,47.5368,99.7921
196,197,1014,650,1091,237.376,85.3499,4.65013,99.9938
197,198,1366,1250,1109,23.806,46.801,43.199,99.9763
198,199,51314,2194,1253,32.1094,23.1395,66.8605,99.9579
199,200,17866,3835,1223,199.181,17.6114,72.3886,99.7654
200,201,2055,3924,1132,200.258,20.4668,69.5332,99.6153
201,202,4269,1198,1136,206.796,43.6592,46.3408,99.9829
202,203,4720,1534,1154,21.6565,8.18015,81.8199,99.9303
203,204,627,1961,1116,130.05200000000002,85.0678,4.93219,99.9774
204,205,35485,2519,1219,30.498,51.0525,38.9475,72.7111
205,206,2995,1369,1129,218.772,57.1771,32.8229,99.9825
206,207,1534,2674,1131,34.9295,45.5718,44.4282,99.9915
207,208,1634,888,1134,207.821,51.4508,38.5492,99.9927
208,209,128695,789,1346,201.604,49.1269,40.8731,98.9134
209,210,27923,1783,1174,197.545,70.3019,19.6981,99.976
210,211,8579,2053,1164,207.518,48.1995,41.8005,99.9868
211,212,5973,2742,1167,32.0936,38.1143,51.8857,99.8815
212,213,2152,215,1145,6.64095,80.5741,9.42587,99.985
213,214,4187,2543,1146,60.106,82.5054,7.49458,99.9774
214,215,1265,1315,1146,198.291,48.1118,41.8882,99.9883
215,216,17093,2863,1207,197.435,76.7462,13.2538,99.8011
216,217,109846,1506,1313,199.846,65.1421,24.8579,99.048
217,218,7150,1276,1204,33.8787,2.11886,87.8811,99.9821
218,219,3769,2355,1186,56.8015,68.7732,21.2268,99.9671
219,220,6900,3144,1205,201.497,34.2725,55.7275,99.959
220,221,646,2273,1162,55.7683,66.3607,23.6393,99.9848
221,222,2915,857,1182,16.1308,57.4956,32.5044,99.9944
222,223,1997,198,1205,221.08,9.40189,80.5981,99.7757
223,224,9592,1959,1231,109.272,83.2109,6.78908,99.9166
224,225,9694,1180,1219,198.735,25.831,64.169,99.9195
225,226,1827,236,1194,184.524,81.5433,8.45668,99.9861
226,227,30866,2727,1336,207.678,12.819,77.181,99.6893
227,228,1289,2026,1216,114.731,82.7547,7.24529,99.9937
228,229,556,3941,1210,199.265,19.1481,70.8519,99.9806
229,230,3388,911,1236,17.2668,27.5639,62.4361,99.9244
230,231,1030,2072,1230,44.1481,29.7577,60.2423,99.9948
231,232,5345,1864,1254,32.3988,34.0449,55.9551,99.9592
232,233,38716,2963,1414,21.0622,43.2752,46.7248,52.0032
233,234,13484,3210,1300,99.3932,84.5522,5.44779,99.9827
234,235,4765,3617,1285,197.729,76.7533,13.2467,99.9929
235,236,3600,3685,1264,204.967,19.5463,70.4537,99.997
236,237,852,3904,1270,198.64,19.5849,70.4151,99.8732
237,238,600,1789,1276,21.9592,40.6212,49.3788,99.9851
238,239,717,1123,1277,25.5941,3.48969,86.5103,99.986
239,240,2362,1279,1285,34.7938,1.4442700000000002,88.5557,99.9793
240,241,6234,1188,1333,26.0927,15.9272,74.0728,99.938
241,242,594,173,1295,242.603,13.008,76.992,99.5223
242,243,1341,3937,1317,48.5057,45.4115,44.5885,99.9547
243,244,1026,1342,1290,201.911,66.6944,23.3056,99.991
244,245,2599,2652,1304,31.5872,58.7937,31.2063,99.9949
245,246,506,2035,1289,35.9371,34.628,55.372,99.9931
246,247,1843,2514,1308,101.325,83.6939,6.3061,99.9885
247,248,35314,1878,1395,182.305,72.439,17.561,99.9652
248,249,771,3915,1311,45.887,43.7999,46.2001,99.9389
249,250,27406,273,1418,222.52,5.10679,84.8932,99.8354
250,251,3295,2568,1317,202.106,77.8698,12.1302,99.9567
251,252,26647,1113,1400,196.561,20.532,69.468,99.9585
252,253,1111,2708,1308,25.9289,38.0707,51.9293,99.9989
253,254,2048,2009,1315,33.1525,54.9029,35.0971,99.9909
254,255,13892,702,1356,26.2078,59.1526,30.8474,99.9909
255,256,7221,2322,1346,182.379,78.1019,11.8981,99.9945
256,257,78196,3238,1559,20.0036,5.7163,84.2837,99.7321
257,258,18687,3707,1382,231.861,55.2922,34.7078,99.9377
258,259,11485,3337,1349,209.973,69.9052,20.0948,99.9828
259,260,995,1973,1326,190.859,54.8646,35.1354,99.9718
260,261,21668,3851,1407,34.3338,34.1657,55.8343,99.952
261,262,598,3373,1309,7.64094,77.8358,12.1642,99.9851
262,263,16136,2434,1391,199.093,54.5554,35.4446,59.6948
263,264,1384,2692,1343,186.245,75.4719,14.5281,99.9959
264,265,3429,3544,1349,240.69,55.8605,34.1395,99.9738
265,266,1314,840,1347,33.1085,59.1919,30.8081,99.9698
266,267,1316,2600,1344,192.392,71.3237,18.6763,99.9885
267,268,737,2036,1351,202.777,46.2128,43.7872,99.9892
268,269,6996,2017,1415,209.404,57.9511,32.0489,99.9471
269,270,4902,2105,1386,201.356,40.2164,49.7836,99.8673
270,271,2681,1738,1399,211.707,2.42937,87.5706,99.8918
271,272,5137,2540,1398,208.662,9.58998,80.41,99.9475
272,273,888,2579,1371,36.432,59.6799,30.3201,99.9934
273,274,1122,3941,1397,34.0,32.706,57.294,99.7901
274,275,18629,1339,1435,20.2532,45.3746,44.6254,99.9839
275,276,6828,3053,1436,202.965,66.0112,23.9888,99.9384
276,277,548,2259,1393,211.607,87.3948,2.60523,99.9931
277,278,1192,2225,1407,201.909,72.7839,17.2161,99.9766
278,279,15784,2163,1453,195.013,23.5435,66.4565,99.8342
279,280,2281,2377,1420,39.7917,33.8964,56.1036,99.9945
280,281,13828,2826,1453,203.475,9.69192,80.3081,99.9396
281,282,706,2321,1419,205.242,86.8783,3.12174,99.9877
282,283,26672,1761,1496,212.173,54.0373,35.9627,99.5995
283,284,988,2069,1434,205.331,50.4231,39.5769,99.9909
284,285,1009,1616,1434,23.906,33.5084,56.4916,99.9438
285,286,3512,2601,1463,22.8381,26.2528,63.7472,99.9752
286,287,8015,3129,1488,29.6883,64.9142,25.0858,99.9858
287,288,9118,2717,1503,196.943,71.4101,18.5899,99.9078
288,289,1942,658,1456,213.433,5.68639,84.3136,99.9597
289,290,87030,2428,1607,46.8925,83.0266,6.973389999999998,68.4295
290,291,20221,1053,1555,31.0648,1.61704,88.383,99.8376
291,292,1670,2928,1476,40.6176,66.4154,23.5846,99.9818
292,293,1145,2525,1474,33.4132,19.7614,70.2386,99.9931
293,294,9064,596,1510,30.6407,63.5484,26.4516,99.7239
294,295,4590,3915,1509,210.923,61.5935,28.4065,99.9749
295,296,539,1499,1479,21.9432,45.3069,44.6931,99.9653
296,297,10540,445,1536,198.14,52.9313,37.0687,99.6527
297,298,28259,1267,1581,203.953,27.3186,62.6814,53.5886
298,299,1522,2740,1500,212.584,55.0801,34.9199,99.983
299,300,562,239,1501,128.749,89.0608,0.939203,99.5001
300,301,663,2555,1497,22.762,3.72429,86.2757,99.8556
301,302,1253,2195,1503,40.1312,40.478,49.522,99.9453
302,303,957,996,1505,32.9277,67.2551,22.7449,99.9772
303,304,126229,1430,1766,26.0883,18.4383,71.5617,70.5981
304,305,12675,3808,1546,22.5916,58.3109,31.6891,99.9751
305,306,1428,2034,1525,175.63,70.6488,19.3512,99.9434
306,307,4291,2876,1542,202.905,62.7674,27.2326,99.923
307,308,5678,908,1551,30.6065,63.7537,26.2463,99.9861
308,309,1216,2803,1522,198.024,60.9731,29.0269,99.9795
309,310,18710,2110,1566,210.431,60.3592,29.6408,99.8901
310,311,1530,256,1540,169.817,87.3373,2.66267,99.9895
311,312,2280,972,1560,19.225,66.8502,23.1498,99.9672
312,313,1733,629,1561,200.641,24.7278,65.2722,99.9846
313,314,23733,855,1670,211.599,23.6196,66.3804,99.843
314,315,2270,1917,1570,18.7645,22.2107,67.7893,99.9649
315,316,1080,528,1563,197.084,42.1592,47.8408,99.9537
316,317,3664,2723,1594,32.4667,17.5989,72.4011,99.9796
317,318,844,1809,1571,201.833,10.6743,79.3257,99.986
318,319,4065,2941,1611,24.168000000000006,19.6655,70.3345,99.8401
319,320,8713,2824,1619,185.122,75.3295,14.6705,99.9618
320,321,1217,353,1586,217.313,3.31355,86.6865,99.9821
321,322,14556,3873,1657,195.101,33.0744,56.9256,99.8935
322,323,916,311,1584,196.491,30.5184,59.4816,99.9839
323,324,2720,1748,1589,33.677,36.682,53.31800000000001,99.9676
324,325,7560,590,1614,36.3646,73.64699999999998,16.352999999999998,99.9558
325,326,2452,253,1604,207.894,39.4007,50.5993,99.9369
326,327,1535,2894,1592,26.9787,63.3358,26.6642,99.9927
327,328,23028,2206,1686,29.1569,17.8896,72.1104,99.9655
328,329,2536,2686,1618,23.9273,15.1822,74.8178,99.9866
329,330,18951,1200,1693,206.882,4.69956,85.3004,99.6072
330,331,4624,468,1620,201.975,62.9869,27.0131,85.0472
331,332,731,393,1599,219.111,2.85086,87.1491,99.9883
332,333,1356,1841,1610,206.611,43.1259,46.8741,99.9742
333,334,48230,2036,1728,26.8528,10.931,79.069,99.9069
334,335,778,2547,1606,33.9953,33.3674,56.6326,99.9899
335,336,2965,2994,1650,34.7466,5.8213,84.1787,99.9224
336,337,19624,3699,1649,193.534,74.9174,15.0826,99.9877
337,338,11844,1626,1644,202.561,32.4783,57.5217,99.9695
338,339,1186,1802,1606,25.9911,48.977,41.023,99.9803
339,340,1680,3796,1628,39.1059,35.6002,54.3998,99.9468
340,341,1442,1104,1622,20.5046,10.9303,79.0697,99.8206
341,342,10011,1869,1671,16.7928,50.7945,39.2055,99.9479
342,343,36155,3081,1753,207.609,57.5373,32.4627,99.9174
343,344,13023,1743,1677,197.342,19.6525,70.3475,99.8494
344,345,48951,525,1780,207.246,33.505,56.495,75.2789
345,346,5476,988,1675,24.0388,9.02692,80.9731,99.8858
346,347,14989,2603,1683,198.929,67.8933,22.1067,99.9945
347,348,1135,667,1648,202.257,25.1633,64.8367,99.988
348,349,4010,296,1653,208.503,15.089,74.911,99.8954
349,350,3892,1051,1658,210.281,24.1172,65.8828,99.979
350,351,10432,2935,1697,176.065,80.3178,9.68222,99.856
351,352,13146,737,1743,204.975,25.1677,64.8323,99.91
352,353,23291,2763,1738,29.0145,4.10799,85.89200000000002,99.9527
353,354,6966,646,1718,199.626,22.6287,67.3713,99.9604
354,355,3205,202,1703,219.08,1.7465099999999998,88.2535,99.8787
355,356,892,3040,1682,173.997,80.5838,9.41622,99.9873
356,357,2471,1111,1702,24.115,15.5788,74.4212,99.9884
357,358,8765,2310,1756,196.279,61.0418,28.9582,99.8013
358,359,25638,297,1771,31.111,0.145966,89.854,99.9544
359,360,1728,1068,1722,22.7667,9.82491,80.1751,99.9376
360,361,1279,1669,1706,28.8816,29.642,60.358,99.9459
361,362,811,1803,1707,197.657,14.5319,75.4681,99.8801
362,363,9962,3892,1766,34.1973,45.7978,44.2022,99.8705
363,364,4241,1582,1727,201.672,45.3629,44.6371,99.9856
364,365,532,3766,1716,40.2109,36.9556,53.0444,99.9819
365,366,1792,1929,1724,27.2916,17.8034,72.1966,99.9945
366,367,3862,2520,1744,31.8206,19.8008,70.1992,99.9888
367,368,1629,1355,1740,208.703,27.2139,62.7861,99.9884
368,369,8606,1104,1768,205.955,17.6559,72.3441,99.9474
369,370,22954,2872,1825,200.44,73.9582,16.0418,99.9732
370,371,5552,3823,1825,196.593,45.659,44.341,99.9163
371,372,55000,951,1903,203.657,29.5615,60.4385,96.4821
372,373,2453,3399,1742,18.2178,43.4599,46.5401,99.9934
373,374,8550,1794,1783,204.752,4.29121,85.7088,99.9051
374,375,4482,434,1761,210.358,73.4348,16.5652,99.992
375,376,820,999,1741,204.591,10.0427,79.9573,99.9726
376,377,5764,1645,1770,212.885,30.3672,59.6328,99.9551
377,378,1317,3218,1760,21.143,11.0485,78.9515,99.6273
378,379,6777,3733,1778,206.32,23.8086,66.1914,99.9949
379,380,662,1040,1759,22.5421,47.27,42.73,99.9693
380,381,38322,1811,1897,203.296,45.2662,44.7338,99.4842
381,382,18330,2642,1810,182.95,75.4431,14.5569,99.8316
382,383,1045,183,1767,226.18400000000003,55.5826,34.4174,99.9182
383,384,6637,3285,1790,216.444,63.2666,26.7334,99.9809
384,385,6276,3392,1817,208.94,0.328903,89.6711,99.9376
385,386,17807,1151,1854,35.1979,19.3258,70.6742,99.9216
386,387,10256,697,1839,35.7901,64.4209,25.5791,99.9512
387,388,18018,1653,1860,28.5006,27.1205,62.8795,99.9608
388,389,703,637,1805,203.366,16.038,73.962,99.9939
389,390,4151,3667,1830,200.172,44.1172,45.8828,99.9922
390,391,2018,828,1811,26.3029,44.2201,45.7799,99.9959
391,392,2341,412,1827,202.894,7.4535399999999985,82.5465,99.9747
392,393,22653,3313,1919,26.4831,6.3381,83.6619,99.9478
393,394,8844,2349,1869,206.37,65.0166,24.9834,99.9446
394,395,22556,2183,1876,22.3565,39.5592,50.4408,99.889
395,396,2471,3921,1861,203.581,17.1858,72.8142,99.8704
396,397,13063,3170,1878,204.389,17.326,72.67399999999998,99.9412
397,398,34146,2494,1955,177.963,81.5055,8.49447,50.5658
398,399,588,370,1846,214.305,20.3046,69.6954,99.9689
399,400,1330,308,1862,206.134,15.8787,74.1213,99.7647
400,401,725,3886,1862,203.634,15.7496,74.2504,99.9891
401,402,3268,2566,1871,204.04,25.7419,64.2581,99.9968
402,403,670,200,1869,188.439,74.624,15.376,99.967
403,404,63688,2956,2008,33.8456,27.9955,62.0045,99.4173
404,405,7441,766,1906,194.053,74.881,15.119000000000002,99.9264
405,406,4918,3473,1898,195.561,20.2684,69.7316,99.8699
406,407,3072,852,1913,211.007,32.5982,57.4018,99.9258
407,408,537,1031,1882,215.005,1.59408,88.4059,99.9973
408,409,7129,2656,1914,28.1164,16.8243,73.1757,99.9601
409,410,9391,2022,1937,206.457,7.8708300000000015,82.1292,99.942
410,411,788,359,1891,187.558,72.1747,17.8253,99.9716
411,412,4976,453,1920,203.638,78.52,11.48,99.9478
412,413,5016,3876,1923,204.432,30.0666,59.9334,99.9696
413,414,1164,887,1907,195.112,2.63528,87.3647,99.9916
414,415,1060,199,1920,200.188,40.9764,49.0236,99.8752
415,416,38637,333,2010,28.3667,0.636314,89.3637,99.6873
416,417,3305,3409,1950,202.336,61.1144,28.8856,99.98
417,418,1008,683,1915,198.239,28.48,61.52,99.9747
418,419,2644,3561,1934,30.0801,23.0928,66.9072,99.9256
419,420,4993,2121,1959,209.368,49.3574,40.6426,99.9706
420,421,18243,1856,2023,340.36800000000005,83.4039,6.59611,99.8782
421,422,2142,1355,1938,19.1657,50.6451,39.3549,99.974
422,423,1283,2534,1931,29.4444,0.0780411,89.92200000000003,99.9459
423,424,950,520,1953,209.218,78.6086,11.3914,99.9431
424,425,30509,2708,2035,106.779,85.7874,4.2125900000000005,99.8147
425,426,4390,3464,1959,169.292,73.4694,16.5306,99.277
426,427,2706,912,1962,22.8594,48.2801,41.7199,99.9893
427,428,2547,582,1954,20.024,57.8418,32.1582,99.9425
428,429,3366,2343,1966,199.053,55.316,34.684,99.9633
429,430,7821,2211,2000,207.755,14.8582,75.1418,99.9158
430,431,13811,3885,2021,208.186,10.0015,79.9985,99.8436
431,432,9034,2292,2023,21.7391,9.95916,80.0408,99.4693
432,433,14963,720,2009,25.4724,34.7375,55.2625,75.2017
433,434,971,3201,1961,215.99400000000003,36.1557,53.8443,99.6964
434,435,30505,3186,2060,22.9794,55.2641,34.7359,99.7564
435,436,10596,1134,2013,16.0544,32.2983,57.7017,99.8906
436,437,10977,1695,2025,208.935,7.5506199999999986,82.4494,99.6043
437,438,24488,3681,2046,31.419,5.20986,84.7901,99.6336
438,439,18717,3443,2051,202.587,52.6071,37.3929,98.7651
439,440,40213,1336,2085,198.874,33.4085,56.5915,72.0535
440,441,1308,2074,1990,196.825,47.6317,42.3683,99.9754
441,442,520,186,1994,34.1297,65.6823,24.3177,99.4741
442,443,13715,1507,2041,201.053,28.981,61.019,98.9743
443,444,755,2423,1993,196.169,25.4618,64.5382,99.9794
444,445,4782,462,2039,202.526,40.6219,49.3781,99.7453
445,446,806,489,2000,147.166,78.6918,11.3082,99.895
446,447,533,3176,1997,44.2234,22.3065,67.6935,99.9902
447,448,546,3818,1999,212.127,18.8552,71.1448,99.9866
448,449,3560,2374,2016,30.8582,48.1257,41.8743,99.8417
449,450,1716,588,2029,22.7491,54.6776,35.3224,99.9235
450,451,972,3700,2019,211.18400000000003,14.8532,75.1468,99.7972
451,452,2039,534,2041,164.593,76.3528,13.6472,99.8158
452,453,41853,2091,2114,352.441,84.2839,5.71615,99.8866
453,454,550,642,2031,11.4669,11.4099,78.5901,99.9981
454,455,4068,1026,2053,23.0346,36.5816,53.4184,99.959
455,456,3754,1606,2070,173.815,79.8596,10.1404,99.9762
456,457,641,1063,2042,35.1793,29.4473,60.5527,99.9919
457,458,1182,1653,2051,190.635,78.4408,11.5592,99.9866
458,459,4907,1002,2095,203.209,64.5861,25.4139,99.9103
459,460,116700,2486,2365,205.725,14.9321,75.0679,53.369
460,461,2315,925,2078,28.2276,8.103810000000001,81.8962,99.9881
461,462,31702,1798,2194,201.288,15.5396,74.4604,99.799
462,463,997,1915,2070,345.4530000000001,83.5258,6.47421,99.9733
463,464,1975,675,2086,33.7419,62.7195,27.2805,99.9921
464,465,13803,787,2124,30.7781,20.5853,69.4147,99.9685
465,466,2720,534,2090,37.5156,65.2476,24.7524,99.903
466,467,9484,2610,2131,190.665,11.997,78.003,99.9811
467,468,513,1954,2100,216.998,5.0724,84.9276,99.9111
468,469,8065,291,2136,206.67,7.78896,82.211,99.9045
469,470,104038,1136,2250,205.0,3.62032,86.3797,97.8284
470,471,8114,3864,2132,206.774,34.4084,55.5916,99.9891
471,472,17545,3698,2170,201.166,61.1652,28.8348,99.9865
472,473,11685,3550,2143,211.259,32.4736,57.5264,99.9692
473,474,1743,3462,2111,207.719,14.0741,75.9259,99.9377
474,475,13433,585,2148,23.7249,57.4259,32.5741,99.9691
475,476,888,3411,2108,198.711,66.6883,23.3117,99.9734
476,477,5895,461,2137,154.588,75.3835,14.6165,99.943
477,478,537,3936,2111,11.9711,37.4088,52.5912,99.9841
478,479,7393,1927,2148,34.8871,44.8365,45.1635,99.9779
479,480,5233,2551,2164,24.4436,4.637580000000002,85.3624,99.9829
480,481,13391,3308,2175,28.9438,16.9065,73.0935,99.8813
481,482,9558,3076,2161,215.424,12.1853,77.8147,99.9383
482,483,961,1525,2116,32.6576,45.7157,44.2843,99.9929
483,484,2063,922,2123,203.616,65.72399999999999,24.276,99.9791
484,485,40874,1638,2249,29.2973,18.0353,71.9647,99.9563
485,486,2983,1286,2140,207.195,19.8183,70.1817,99.9913
486,487,3002,2265,2161,177.892,81.4691,8.53088,99.963
487,488,4327,2661,2195,20.6161,3.60497,86.395,99.9884
488,489,21033,2970,2245,27.3185,68.1748,21.8252,98.6931
489,490,6213,2841,2176,196.71400000000003,56.5803,33.4197,99.9665
490,491,1484,3930,2181,208.938,49.8526,40.1474,99.9622
491,492,24610,639,2254,49.2717,79.1388,10.8612,99.9819
492,493,1589,3790,2164,203.621,40.8324,49.1676,99.9953
493,494,2212,3340,2193,187.424,64.814,25.186,99.9918
494,495,3874,3885,2201,205.75,46.0162,43.9838,99.9889
495,496,21440,323,2237,206.954,12.1068,77.8932,99.9546
496,497,19693,2768,2237,34.3389,56.5256,33.4744,99.9942
497,498,520,3163,2170,216.791,66.4228,23.5772,99.9758
498,499,2691,210,2202,210.935,64.5089,25.4912,99.9255
499,500,12553,484,2252,21.296,49.6661,40.3339,98.5915
500,501,2443,1020,2182,53.5563,78.584,11.416,99.9734
501,502,13388,3460,2248,198.016,48.8529,41.1471,88.348
502,503,38781,2254,2297,202.381,12.6894,77.3106,99.8896
503,504,5227,3182,2209,196.029,69.5522,20.4478,99.977
504,505,770,737,2188,209.213,16.9928,73.0072,99.9914
505,506,2977,3600,2211,206.289,24.3193,65.6807,99.9724
506,507,1014,495,2187,177.675,76.0369,13.9631,99.9631
507,508,16351,1489,2247,106.947,82.3919,7.608060000000001,99.958
508,509,4450,2210,2214,199.493,11.7607,78.2393,99.7856
509,510,7110,3773,2249,200.193,7.1212800000000005,82.8787,99.954
510,511,1324,793,2213,23.8862,81.2664,8.73363,99.9857
511,512,1854,2102,2222,199.971,18.0727,71.9273,99.9628
512,513,1642,3934,2246,208.718,28.355,61.645,99.8497
513,514,1524,3531,2230,20.6315,12.4909,77.5091,99.9678
514,515,4618,2049,2249,30.3637,5.22633,84.7737,99.9926
515,516,2644,745,2245,209.425,16.3506,73.6494,99.9875
516,517,1853,2263,2240,195.92,54.029,35.971,99.9974
517,518,22089,3848,2318,203.233,21.9627,68.0373,98.4907
518,519,7286,416,2284,34.2575,47.4941,42.5059,99.9854
519,520,11500,1931,2303,347.4530000000001,83.15899999999998,6.84099,99.9823
520,521,17415,3626,2294,210.196,44.0384,45.9616,99.9849
521,522,1645,1402,2265,27.7184,52.2036,37.7964,99.9683
522,523,1820,3114,2264,27.8804,69.6285,20.3715,99.9192
523,524,772,842,2249,24.4343,32.8216,57.1784,99.9927
524,525,4557,2866,2298,24.6759,28.5347,61.4653,99.9769
525,526,3201,2657,2278,191.555,3.44057,86.5594,99.9775
526,527,1640,211,2283,210.265,35.4931,54.5069,99.9678
527,528,1917,3400,2273,206.495,27.5642,62.4358,99.9555
528,529,548,3366,2262,187.036,62.7385,27.2615,99.9345
529,530,3221,3206,2286,126.767,83.5244,6.47561,99.9895
530,531,11567,857,2308,32.5449,58.7885,31.2115,99.9874
531,532,12848,3291,2314,207.357,23.215,66.785,99.7907
532,533,2295,544,2297,30.0328,47.6472,42.3528,99.9942
533,534,687,2692,2290,196.865,9.26785,80.7321,99.9976
534,535,8397,3049,2321,192.938,51.5017,38.4983,99.9959
535,536,2784,2009,2303,29.0119,42.5989,47.4011,99.9939
536,537,2714,267,2314,22.304,62.441,27.559,99.887
537,538,4897,761,2328,228.131,5.73698,84.26299999999998,99.9941
538,539,17786,1752,2367,30.9344,37.9706,52.0294,98.4575
539,540,2450,696,2310,212.146,15.4122,74.5878,99.9468
540,541,767,1457,2308,209.062,8.210139999999999,81.7899,99.94
541,542,6758,2707,2344,189.766,1.5341,88.4659,99.973
542,543,1039,3119,2323,206.277,18.5816,71.4184,99.9991
543,544,9958,959,2394,190.014,52.7795,37.2205,61.2365
544,545,9366,2016,2359,195.43,32.3693,57.6307,99.9656
545,546,569,1417,2321,111.728,79.5095,10.4905,99.8796
546,547,1324,3416,2325,18.4751,69.4958,20.5042,99.9672
547,548,1192,3713,2332,26.2947,19.4987,70.5013,99.9876
548,549,1281,237,2335,221.133,16.506,73.494,99.9721
549,550,15166,2812,2401,209.125,7.51907,82.4809,99.8869
550,551,13963,248,2440,24.2341,59.1273,30.8727,99.8082
551,552,17837,1468,2435,181.636,75.6299,14.3701,96.6428
552,553,3157,2106,2375,199.507,71.1964,18.8036,99.9926
553,554,3147,696,2357,37.8309,1.5093,88.4907,99.9695
554,555,2582,3201,2357,24.8777,67.3498,22.6502,99.9899
555,556,4735,3507,2364,196.112,56.5939,33.4061,99.9395
556,557,9964,445,2374,205.196,25.3359,64.6641,99.9407
557,558,1671,538,2354,30.3725,65.5312,24.4688,99.9798
558,559,7039,2953,2375,21.4739,9.15444,80.8456,97.1332
559,560,2875,1558,2382,143.974,85.5712,4.42877,99.9927
560,561,1130,3141,2356,32.2897,67.8,22.2,99.9943
561,562,4897,2537,2375,199.329,2.55338,87.4466,99.9916
562,563,718,330,2351,43.8338,57.0204,32.9796,99.9968
563,564,20785,3415,2429,22.7921,25.0621,64.9379,99.9557
564,565,22508,3681,2444,212.401,51.0155,38.9845,99.9144
565,566,8655,860,2403,27.4486,34.3473,55.6527,99.9529
566,567,2887,1353,2378,33.1392,52.146,37.854,99.9224
567,568,15116,3117,2425,205.836,8.91748,81.0825,99.985
568,569,1379,2173,2380,27.4235,46.6153,43.3847,99.9489
569,570,2273,324,2382,200.595,37.7819,52.2181,99.9651
570,571,4255,3593,2397,21.7335,19.2941,70.7059,99.9982
571,572,3984,1870,2410,20.5275,7.60815,82.3918,99.9543
572,573,13008,2650,2450,15.6852,7.7545199999999985,82.2455,99.8877
573,574,4346,773,2410,26.3841,58.9827,31.0173,99.9843
574,575,3156,1043,2399,29.7049,21.652,68.348,99.9219
575,576,949,239,2389,206.342,36.1449,53.8551,99.9518
576,577,28109,563,2461,21.2118,20.6525,69.3475,99.8133
577,578,7220,2244,2413,198.018,5.77785,84.2221,99.8896
578,579,1669,1134,2397,204.139,52.9838,37.0162,99.9887
579,580,10569,3256,2417,36.1254,84.3387,5.66126,99.9769
580,581,3489,1202,2417,33.5819,17.4312,72.5688,99.8581
581,582,30814,774,2498,26.8133,83.7204,6.27956,99.9645
582,583,31704,3858,2509,26.8232,28.356,61.644,99.8715
583,584,854,2137,2408,23.1911,8.77435,81.2257,99.9786
584,585,1325,2931,2418,211.083,6.83189,83.1681,99.7453
585,586,6994,1964,2434,166.37400000000005,83.9364,6.06356,99.7718
586,587,2133,177,2443,24.3869,60.2318,29.7682,99.7353
587,588,7876,1302,2460,209.935,9.43522,80.5648,99.9789
588,589,5830,2709,2438,22.8839,34.9666,55.0334,99.946
589,590,19032,2088,2478,29.4658,45.6013,44.3987,99.9547
590,591,1107,3538,2427,214.41,49.8656,40.1344,99.9135
591,592,8452,1398,2475,33.7648,23.2315,66.7685,99.9751
592,593,10041,2272,2481,204.263,13.2996,76.7004,99.977
593,594,5771,1062,2450,30.9847,33.8335,56.1665,99.9063
594,595,14479,1566,2530,25.8764,31.9786,58.0214,98.8224
595,596,4738,1713,2455,141.44299999999996,84.8719,5.12809,99.9946
596,597,55180,1772,2664,22.1121,34.0976,55.9024,99.5502
597,598,10378,3048,2510,33.704,35.2371,54.7629,99.9091
598,599,1391,1153,2457,32.8167,62.6294,27.3706,99.9946
599,600,9115,1679,2507,28.1391,5.26954,84.7305,99.6375
600,601,6571,3540,2493,213.617,37.2659,52.7341,99.8939
601,602,9092,2963,2500,106.477,88.2373,1.7627,99.8646
602,603,1515,1531,2480,203.705,71.2955,18.7045,99.875
603,604,1277,1199,2471,199.893,11.9627,78.0373,99.9187
604,605,708,2896,2480,42.4338,79.1045,10.8955,99.9832
605,606,13509,3238,2527,203.329,58.0211,31.9789,99.9216
606,607,1768,1119,2488,200.519,18.6129,71.3871,99.818
607,608,8221,2824,2509,31.5942,31.0231,58.9769,99.9149
608,609,2352,340,2495,48.6608,83.0378,6.96218,99.8353
609,610,622,915,2483,20.69,15.849,74.15100000000002,99.9506
610,611,19552,1989,2553,36.6692,82.573,7.427,91.15
611,612,4836,2385,2511,26.9409,65.7403,24.2597,99.9894
612,613,1695,1079,2512,29.2419,14.0018,75.9982,99.823
613,614,11267,986,2544,211.405,19.0499,70.9501,99.8636
614,615,13717,3407,2536,202.459,5.05618,84.9438,99.2934
615,616,526,1204,2515,62.4308,87.3223,2.67774,99.808
616,617,4827,1161,2551,93.068,85.7407,4.25933,99.9399
617,618,3581,201,2548,205.886,15.0073,74.9927,99.8909
618,619,5530,3122,2552,56.9507,88.6246,1.37537,99.6071
619,620,3210,1290,2535,95.6087,84.2714,5.72858,99.9233
620,621,7474,2704,2570,20.7772,36.3987,53.6013,99.8574
621,622,1786,3598,2535,203.141,23.422,66.578,99.49
622,623,750,3725,2528,202.388,24.767,65.233,99.9762
623,624,3214,2206,2545,15.372,1.50004,88.5,99.2224
624,625,1082,256,2536,58.9275,84.4658,5.53415,99.9912
625,626,3232,1235,2561,45.8255,49.6792,40.3208,99.9729
626,627,4846,2304,2559,21.0057,17.3702,72.6298,99.9173
627,628,8304,3775,2592,37.2119,13.9754,76.0246,82.0665
628,629,3077,1382,2558,31.142,35.5516,54.4484,99.9834
629,630,17270,2867,2601,25.8352,63.5821,26.4179,99.4979
630,631,1361,642,2547,45.4652,60.5743,29.4257,99.995
631,632,11845,386,2604,33.246,19.6052,70.3948,99.9183
632,633,1845,1689,2558,208.557,15.8024,74.1976,99.4732
633,634,1499,3644,2559,319.853,88.1128,1.8872,99.7633
634,635,4029,1090,2578,195.115,31.2458,58.7542,99.9868
635,636,1355,1330,2575,47.852,48.2275,41.7725,99.9246
636,637,5279,2158,2598,206.011,29.8388,60.1612,99.9377
637,638,1213,1878,2562,34.233000000000004,31.5373,58.4627,99.9713
638,639,3417,2389,2580,38.9955,82.5181,7.48194,99.858
639,640,20419,3659,2646,32.6949,16.1805,73.8195,99.9606
640,641,1945,285,2577,206.88,2.54756,87.4524,99.9609
641,642,550,244,2570,15.1267,63.5923,26.4077,99.9904
642,643,1002,3318,2577,200.89,43.6388,46.3612,99.8639
643,644,8111,622,2607,45.0996,60.2145,29.7855,99.9899
644,645,6469,3553,2594,59.6788,80.3233,9.67665,99.9433
645,646,1115,556,2579,24.3852,20.9881,69.0119,99.9785
646,647,1927,713,2579,207.618,15.7434,74.2566,99.9194
647,648,2806,1890,2601,209.432,9.94986,80.0501,99.9295
648,649,40545,919,2653,31.9749,13.2584,76.7416,92.9676
649,650,3140,1617,2606,24.2156,23.6341,66.3659,99.9919
650,651,503,3131,2596,29.1087,29.786,60.214,99.9835
651,652,6229,3449,2629,199.165,35.5197,54.4803,98.9415
652,653,18182,3351,2671,27.854,40.986,49.014,99.8605
653,654,591,3259,2593,28.8996,27.974,62.026,99.9976
654,655,23136,1180,2693,43.9826,51.139,38.861,99.9639
655,656,16117,1433,2642,220.404,77.755,12.245,97.8124
656,657,5192,1267,2619,98.0419,84.5526,5.44735,99.994
657,658,7643,264,2665,194.097,35.8615,54.1385,99.9466
658,659,1116,3091,2607,206.537,53.8066,36.1934,99.9927
659,660,13627,2703,2655,198.855,55.7646,34.2354,99.8364
660,661,2446,2309,2617,42.7194,76.3139,13.6861,99.9658
661,662,3081,211,2635,198.134,42.2874,47.7126,99.79
662,663,3873,1667,2642,203.487,14.7378,75.2622,99.9941
663,664,3291,2062,2630,59.0272,83.4041,6.595910000000001,99.9902
664,665,21157,2263,2728,30.3693,38.8697,51.1303,99.9855
665,666,29865,2988,2701,23.1298,0.025367700000000003,89.9746,91.3483
666,667,4723,555,2651,196.053,5.7011,84.2989,99.9597
667,668,27058,759,2745,32.2567,64.4972,25.5028,99.6906
668,669,79487,1911,2812,207.519,14.1334,75.8666,98.697
669,670,7465,3222,2648,214.35,5.396,84.604,99.8955
670,671,4991,661,2667,29.2605,2.53201,87.46799999999998,99.9829
671,672,9283,1601,2681,190.478,72.4193,17.5807,99.9442
672,673,28691,500,2788,196.58900000000003,56.2668,33.7332,63.0596
673,674,27720,2457,2716,200.892,42.4624,47.5376,64.0426
674,675,1450,3137,2638,196.55,12.1126,77.8874,99.9497
675,676,3947,2113,2660,212.767,38.4056,51.5944,99.9935
676,677,5114,3816,2667,200.219,39.8302,50.1698,99.9758
677,678,647,3558,2634,185.5,70.1151,19.8849,99.9861
678,679,1106,2308,2644,203.783,27.3236,62.6764,99.9825
679,680,964,157,2670,197.595,36.1365,53.8635,99.9906
680,681,1159,1860,2655,211.248,15.5804,74.4196,99.9894
681,682,966,2163,2664,65.1165,83.1315,6.8684699999999985,99.9906
682,683,2722,3537,2672,38.2565,64.0497,25.9503,99.992
683,684,934,3917,2662,203.312,14.5144,75.4856,99.9659
684,685,1177,2191,2676,62.8059,75.6894,14.3106,99.9928
685,686,8327,3896,2754,193.313,11.0552,78.9448,99.891
686,687,627,1377,2663,198.162,35.0394,54.9606,99.9954
687,688,2035,493,2678,203.534,40.3665,49.6335,99.9448
688,689,574,1278,2664,238.291,75.1524,14.8477,99.9944
689,690,23345,314,2760,209.898,19.1267,70.8733,99.9324
690,691,1055,311,2675,264.742,33.1303,56.8697,99.9922
691,692,10058,2767,2728,209.685,0.953247,89.0468,99.968
692,693,920,717,2702,199.635,25.0965,64.9035,99.9086
693,694,5112,1336,2693,196.235,70.0394,19.9606,99.9519
694,695,5075,3142,2721,26.475,21.9784,68.0216,99.9663
695,696,1528,2851,2696,194.997,5.14066,84.8593,99.9965
696,697,1809,1518,2698,28.692,38.4737,51.5263,99.9898
697,698,6835,1047,2745,214.532,2.97807,87.0219,99.8173
698,699,1308,2895,2703,209.374,0.909386,89.0906,99.9725
699,700,41243,3728,2774,27.1385,13.8356,76.1644,99.9833
700,701,951,1117,2704,33.1552,16.2594,73.7406,99.9847
701,702,4700,2147,2729,202.1,40.9704,49.0296,99.9163
702,703,1310,571,2710,38.1827,72.1072,17.8928,99.9354
703,704,2243,635,2723,205.738,8.4665,81.5335,99.9773
704,705,652,2079,2710,62.1679,81.1684,8.831560000000003,99.9826
705,706,615,3489,2705,190.897,49.0464,40.9536,99.955
706,707,4941,1321,2736,193.083,58.9626,31.0374,99.9136
707,708,3917,1486,2742,21.332,52.8899,37.1101,99.2625
708,709,5074,3498,2746,25.195,85.3059,4.69413,99.9869
709,710,3880,501,2746,203.515,6.946269999999998,83.0537,99.9776
710,711,9178,1579,2779,37.5181,35.5617,54.4383,99.9823
711,712,740,194,2747,199.879,43.784,46.216,99.7823
712,713,112026,1225,3007,31.6042,55.2481,34.7519,99.4566
713,714,11269,2566,2776,195.605,46.799,43.201,99.9628
714,715,3783,3420,2765,196.014,28.0857,61.9143,99.9102
715,716,11521,3305,2774,22.172,8.22512,81.7749,99.9194
716,717,543,2849,2742,199.246,19.883,70.117,99.9905
717,718,544,1276,2753,44.2958,48.5001,41.4999,99.9974
718,719,7596,966,2812,28.6606,60.723,29.277,99.8281
719,720,5117,3057,2779,201.036,58.5404,31.4597,99.9787
720,721,12382,3124,2833,25.6222,5.82072,84.1793,99.7859
721,722,974,2655,2774,214.354,78.8693,11.1307,99.8981
722,723,19748,1129,2831,23.7311,8.21954,81.7805,99.9858
723,724,1343,2740,2779,37.5496,52.3241,37.6759,99.9984
724,725,23707,2818,2849,202.591,51.4783,38.5217,99.9891
725,726,2850,3557,2801,206.396,66.6815,23.3185,99.9897
726,727,2587,2360,2803,206.786,49.7998,40.2002,99.9709
727,728,5655,3224,2830,194.479,63.6952,26.3048,99.9932
728,729,12307,1476,2865,203.557,45.3336,44.6664,58.7662
729,730,3322,3490,2806,28.5835,2.9237900000000003,87.0762,99.9958
730,731,21092,2968,2908,178.791,69.7491,20.2509,64.7699
731,732,1775,3932,2828,205.295,48.5317,41.4683,99.9793
732,733,2087,2179,2813,214.302,32.2943,57.7057,99.9668
733,734,7623,2660,2867,191.879,66.248,23.752,99.9053
734,735,7949,626,2840,209.048,9.62085,80.3792,99.9305
735,736,43583,3441,2922,191.557,48.5254,41.4746,87.6226
736,737,892,2686,2822,210.68400000000003,0.332191,89.6678,99.9897
737,738,40448,2446,2984,204.646,14.3425,75.6575,88.1427
738,739,1803,379,2832,210.217,2.79189,87.2081,99.8682
739,740,2644,2305,2836,38.3951,60.9867,29.0133,99.962
740,741,9204,3594,2874,194.857,28.6237,61.3763,99.9715
741,742,6151,1627,2875,25.9728,45.0854,44.9146,99.9815
742,743,3513,2253,2863,29.2494,21.1461,68.8539,99.9839
743,744,1360,3514,2847,78.1164,83.9826,6.01743,99.9879
744,745,1914,1851,2847,23.8525,25.5736,64.4264,99.9919
745,746,12022,2553,2897,199.389,11.0028,78.9972,99.9159
746,747,72902,453,3039,206.63,13.911,76.089,85.6513
747,748,4886,804,2864,31.5168,2.06357,87.9364,99.9904
748,749,13165,688,2890,161.488,80.4494,9.55056,99.9679
749,750,30932,2122,2946,32.1214,35.1969,54.8031,99.8723
750,751,7979,3051,2906,206.974,0.7893220000000001,89.2107,99.9295
751,752,1459,1989,2875,229.843,21.7028,68.2972,99.9592
752,753,2198,3851,2877,189.388,63.3978,26.6022,99.9647
753,754,4200,1002,2883,211.391,6.332319999999998,83.6677,99.879
754,755,11755,3755,2911,30.8345,20.5718,69.4282,99.9842
755,756,9648,3915,2991,200.078,64.7577,25.2423,99.8433
756,757,4943,2354,2917,49.2614,69.7306,20.2694,99.9584
757,758,659,428,2884,99.093,82.7722,7.227760000000001,99.984
758,759,17511,3158,2963,22.1305,19.2406,70.7594,99.9071
759,760,18287,1537,2954,10.672,45.2759,44.7241,99.9082
760,761,4363,286,2927,205.154,70.9739,19.0261,99.9872
761,762,2907,231,2916,203.546,80.1821,9.81793,99.9587
762,763,6018,1069,2924,208.091,1.56782,88.4322,99.979
763,764,5455,882,2927,206.661,19.6879,70.3121,99.9581
764,765,3638,2752,2929,28.6917,4.16087,85.8391,99.9754
765,766,1725,3118,2909,202.285,35.5423,54.4577,99.9792
766,767,950,2012,2913,184.269,65.7911,24.2089,99.9714
767,768,6053,560,2943,41.1944,62.7138,27.2862,99.8834
768,769,648,2294,2910,217.29,17.0099,72.9901,99.9839
769,770,4721,796,2943,215.13,9.5386,80.4614,99.9751
770,771,1017,3355,2923,202.144,13.9526,76.0474,99.5007
771,772,2512,2656,2933,196.406,73.688,16.312,99.9956
772,773,2311,3837,2940,48.5925,84.0799,5.92007,99.9629
773,774,1155,3659,2927,42.2925,75.1207,14.8793,99.9847
774,775,12525,991,3002,27.8944,2.46078,87.5392,99.6658
775,776,8721,3294,2970,199.703,86.1758,3.82421,99.9788
776,777,2155,1933,2948,206.668,40.7719,49.2281,99.9636
777,778,2477,203,2956,28.8166,49.7634,40.2366,99.9203
778,779,9320,2272,3011,39.9208,33.5965,56.4035,99.9745
779,780,1116,1623,2948,198.192,83.6717,6.32828,99.99
780,781,3486,2804,2966,27.0182,48.2855,41.7145,99.9859
781,782,4178,2882,2978,18.3941,51.0566,38.9434,99.9744
782,783,10446,3681,2997,27.9785,20.1654,69.8346,99.9663
783,784,4642,2216,2972,34.5528,45.6943,44.3057,99.9932
784,785,1881,2606,2972,33.1291,51.5937,38.4063,99.892
785,786,1342,1874,2967,195.776,59.0878,30.9122,99.9919
786,787,4832,2683,2985,192.691,71.8255,18.1745,99.9952
787,788,1012,1268,2970,206.405,68.0175,21.9825,99.9874
788,789,505,829,2965,216.732,10.4853,79.5147,99.9443
789,790,2683,1989,3003,186.818,80.3393,9.6607,99.9607
790,791,1240,1391,2978,204.072,67.2033,22.7967,99.9784
791,792,15233,275,3034,137.062,82.6254,7.374589999999999,99.6952
792,793,1566,3775,2980,28.7165,0.065361,89.9346,99.9593
793,794,15293,1708,3018,210.179,4.56114,85.4389,98.4247
794,795,3008,3845,3002,24.9671,65.2791,24.7209,99.988
795,796,23517,1893,3068,31.0797,33.4979,56.5021,99.8058
796,797,2270,2760,3009,198.085,72.679,17.320999999999998,99.9054
797,798,814,796,3002,215.864,8.75015,81.2498,99.785
798,799,20980,2134,3105,207.437,32.3157,57.6843,99.9191
799,800,1455,2839,3010,203.5,45.0694,44.9306,99.9837
800,801,13686,3194,3057,23.5465,35.5921,54.4079,99.928
801,802,14682,2346,3077,34.6789,43.9308,46.0692,99.8857
802,803,16670,2655,3058,17.805999999999994,5.30941,84.6906,99.6892
803,804,1931,843,3028,35.2522,0.80571,89.1943,99.8656
804,805,14373,1508,3070,49.7317,52.0694,37.9306,99.9584
805,806,11372,3554,3058,63.8933,71.2732,18.7268,99.8027
806,807,3310,3801,3032,35.9034,81.3346,8.665389999999999,99.9826
807,808,5707,768,3061,24.8994,7.518860000000001,82.4811,99.9831
808,809,47464,924,3223,25.1403,18.9775,71.0225,82.1992
809,810,1693,195,3060,190.325,65.5966,24.4034,99.8582
810,811,22423,2875,3118,74.7907,75.7073,14.2927,98.2618
811,812,8246,3033,3078,44.2676,72.8741,17.1259,99.0037
812,813,4183,3308,3055,211.709,1.79151,88.2085,99.9077
813,814,2559,2034,3066,186.748,64.5934,25.4066,99.9404
814,815,2779,3399,3053,31.283,57.2324,32.7676,99.9005
815,816,2609,3717,3057,215.12,1.58045,88.4195,99.9458
816,817,1620,331,3055,212.602,30.7671,59.2329,99.9193
817,818,1261,641,3060,208.523,30.2047,59.7953,99.9959
818,819,1127,1776,3057,107.28,83.9748,6.02516,99.9659
819,820,805,3469,3055,38.6837,20.5354,69.4646,99.9271
820,821,12013,721,3126,28.1693,2.14146,87.8585,99.9582
821,822,12120,3790,3118,32.0679,65.6596,24.3404,99.9831
822,823,8457,516,3104,207.45,31.7561,58.2439,99.9385
823,824,5481,2757,3100,211.819,24.1591,65.8409,99.908
824,825,736,156,3074,190.232,64.9379,25.0621,99.9916
825,826,24509,1649,3160,40.0389,30.878,59.122,99.9147
826,827,18603,3674,3147,28.9486,78.6818,11.3182,99.985
827,828,103360,3501,3242,28.3613,9.3931,80.6069,99.3194
828,829,739,2841,3083,202.431,41.294,48.706,99.9946
829,830,146807,2726,3366,27.9255,18.7163,71.2837,75.2348
830,831,753,1759,3088,28.6401,9.97242,80.0276,99.9667
831,832,1689,3266,3097,20.2079,12.5452,77.4548,99.996
832,833,8910,1287,3153,26.8745,27.2166,62.7834,99.7158
833,834,37083,1384,3228,207.846,8.26119,81.7388,99.8904
834,835,21256,2315,3190,179.396,64.3798,25.6202,99.8316
835,836,2827,3118,3120,26.5709,56.3819,33.6181,99.9836
836,837,4485,3892,3128,209.854,1.22918,88.7708,99.928
837,838,2960,2994,3129,26.8972,7.29281,82.7072,99.9888
838,839,878,1590,3119,15.9891,42.4575,47.5425,99.9759
839,840,1177,1755,3119,179.868,71.1456,18.8544,99.9969
840,841,545,226,3116,32.2516,6.04668,83.9533,99.9394
841,842,1144,578,3125,193.775,4.12279,85.8772,99.9813
842,843,942,992,3138,201.286,25.9912,64.0088,99.957
843,844,26540,1994,3265,30.0447,42.6187,47.3813,79.1572
844,845,3183,2633,3171,208.688,17.8375,72.1625,99.869
845,846,4834,816,3151,207.173,7.1834,82.8166,99.8499
846,847,615,1971,3133,147.16299999999995,84.9057,5.09432,99.9805
847,848,8394,663,3181,200.466,75.062,14.9379,99.9406
848,849,6907,247,3181,213.007,3.84296,86.15700000000002,99.9005
849,850,20202,1834,3205,30.0222,14.842,75.158,99.9615
850,851,1586,3187,3149,180.05700000000004,63.2119,26.7881,99.9968
851,852,10262,2706,3199,28.4038,3.3576,86.6424,99.9669
852,853,1484,345,3145,31.6664,11.7348,78.2652,99.9803
853,854,23186,543,3243,204.609,4.35606,85.6439,99.8649
854,855,501,1540,3146,34.736999999999995,49.8305,40.1695,99.9807
855,856,557,2620,3151,32.8646,62.1312,27.8688,99.9944
856,857,14422,3003,3227,22.4171,55.1008,34.8992,99.9618
857,858,18083,3878,3245,25.9296,14.3867,75.6133,99.9169
858,859,17255,3111,3236,188.715,63.9959,26.0041,99.9908
859,860,1826,1513,3169,25.9189,24.1162,65.8838,99.9942
860,861,545,486,3169,194.217,2.97041,87.0296,99.9874
861,862,5314,2167,3189,40.1823,48.9325,41.0675,99.9983
862,863,12824,3213,3247,33.1183,49.6077,40.3923,99.9695
863,864,2298,845,3200,199.114,77.4741,12.5259,99.9948
864,865,600,990,3190,22.1049,12.8665,77.1335,99.9882
865,866,7196,2055,3218,191.911,61.5339,28.4661,99.9756
866,867,4532,318,3227,25.5359,11.5619,78.4381,99.9785
867,868,3197,1507,3238,30.6124,52.1106,37.8894,99.9724
868,869,1710,801,3217,23.514,5.12862,84.8714,99.9782
869,870,9783,3782,3266,207.36900000000003,7.20811,82.7919,99.3776
870,871,32087,2195,3324,16.6856,16.916,73.084,99.7435
871,872,3757,2935,3258,201.628,19.328,70.672,99.9193
872,873,1265,1648,3222,182.069,64.0032,25.9968,99.9758
873,874,2463,1716,3236,203.417,41.0257,48.9743,99.996
874,875,906,1552,3221,34.4885,51.6373,38.3627,99.9828
875,876,7420,694,3255,208.704,3.45992,86.5401,99.9906
876,877,16820,792,3310,33.4505,55.5146,34.4854,99.9405
877,878,711,1210,3235,17.2191,50.5511,39.4489,99.9695
878,879,3854,201,3269,187.536,73.0989,16.9011,99.6752
879,880,3336,270,3268,45.7271,52.0135,37.9865,99.991
880,881,778,3729,3258,201.807,32.3809,57.6191,99.9629
881,882,3702,1131,3270,209.331,30.1295,59.8705,99.9917
882,883,154994,1622,3481,204.457,28.6989,61.3011,85.0487
883,884,2320,1064,3275,27.5652,7.14455,82.8555,99.9323
884,885,6309,1206,3288,18.3278,18.0585,71.9415,99.9771
885,886,1084,1640,3271,38.5337,41.9023,48.0977,99.9449
886,887,12449,2348,3325,196.93400000000003,65.3401,24.6599,99.9914
887,888,5121,1573,3307,41.2667,37.8164,52.1836,99.8497
888,889,3662,1721,3284,208.475,12.4986,77.5014,99.9875
889,890,33005,1412,3374,25.1082,5.99754,84.0025,99.633
890,891,4836,333,3314,210.632,2.04987,87.9501,99.9381
891,892,6584,430,3335,28.7623,48.5814,41.4186,99.9284
892,893,5317,652,3316,32.383,2.28628,87.7137,99.9895
893,894,663,1924,3309,32.8728,42.0133,47.9867,99.9921
894,895,11469,1125,3376,31.8376,9.74557,80.2544,99.9692
895,896,9504,3297,3343,197.471,65.1491,24.8509,99.9943
896,897,809,271,3303,27.8238,30.2168,59.7832,99.979
897,898,4726,1039,3339,204.889,0.297287,89.7027,99.9927
898,899,10024,3058,3361,203.912,7.448810000000001,82.5512,99.6564
899,900,6461,261,3378,8.19397,70.0056,19.9944,99.9259
900,901,13981,523,3395,197.784,2.58776,87.4122,99.8154
901,902,2269,3076,3332,179.02,69.5712,20.4288,99.9962
902,903,9282,3852,3395,209.269,2.24148,87.7585,99.9364
903,904,8714,3201,3421,29.6518,7.836010000000001,82.164,99.9741
904,905,6368,3383,3374,100.106,85.5663,4.43365,99.9707
905,906,2053,373,3372,186.357,43.7219,46.2781,99.9898
906,907,59321,2084,3524,31.5458,30.7925,59.2075,82.68700000000003
907,908,4808,2055,3380,205.384,44.675,45.325,99.9918
908,909,24212,2547,3437,43.0446,50.1619,39.8381,99.9491
909,910,3086,612,3369,37.7262,50.4895,39.5105,99.9538
910,911,36897,736,3458,201.23,34.1105,55.8895,83.0979
911,912,29961,315,3471,27.2832,30.6692,59.3308,43.9181
912,913,5868,1598,3405,21.6596,32.7518,57.2482,99.9485
913,914,109444,3497,3529,208.545,7.13502,82.865,96.9522
914,915,3910,996,3399,31.2985,53.8892,36.1108,99.981
915,916,612,301,3376,25.9299,29.2143,60.7857,99.9614
916,917,2801,1064,3403,26.0191,5.9913300000000005,84.0087,99.9483
917,918,1107,2383,3392,192.397,41.6104,48.3896,99.9965
918,919,715,818,3395,203.232,27.185,62.815,99.9925
919,920,5379,2690,3429,196.779,37.6121,52.3879,99.9823
920,921,559,3049,3409,191.942,59.8162,30.1838,99.7932
921,922,4784,3117,3422,27.7317,46.1452,43.8548,99.978
922,923,14465,3719,3492,31.4906,23.1065,66.8935,99.9358
923,924,1775,2246,3424,23.1559,39.1786,50.8214,99.9661
924,925,3118,2311,3429,202.712,23.6375,66.3625,99.8979
925,926,41148,922,3554,29.9452,13.9076,76.0924,92.7358
926,927,55914,2373,3581,211.602,2.06653,87.9335,99.2546
927,928,527,2060,3429,96.0705,81.7822,8.21782,99.9731
928,929,2532,2107,3447,26.3959,37.2922,52.7078,99.9646
929,930,1667,2740,3454,42.9425,40.1076,49.8924,99.996
930,931,679,3020,3437,191.199,70.9794,19.0206,99.9802
931,932,2381,2168,3447,203.583,43.3564,46.6436,99.9797
932,933,44997,3062,3555,205.509,38.4399,51.5601,99.9575
933,934,2970,3876,3466,190.696,66.575,23.425,99.9745
934,935,5863,3802,3478,200.032,61.573,28.427,99.9851
935,936,2337,3255,3476,22.6148,11.15,78.85,99.9629
936,937,2345,2071,3489,201.139,58.7515,31.2485,99.9933
937,938,2813,548,3481,197.764,61.7797,28.2203,99.8804
938,939,26419,1178,3605,63.9077,83.5802,6.41978,99.8399
939,940,1664,3919,3496,49.4967,5.69335,84.3066,99.9381
940,941,1299,2698,3486,180.692,81.2895,8.71055,99.9827
941,942,1002,2340,3510,23.1832,63.3416,26.6584,99.9856
942,943,1326,2118,3499,17.5043,69.0491,20.9509,99.9823
943,944,4350,2623,3530,32.3031,58.5435,31.4565,99.6342
944,945,2239,234,3527,204.284,16.3307,73.6693,99.9894
945,946,578,170,3519,10.7871,79.6377,10.3623,99.9508
946,947,1500,2688,3522,42.6531,39.5008,50.4992,99.9906
947,948,5820,468,3552,17.3391,79.1066,10.8934,96.5589
948,949,1602,819,3527,197.242,50.3975,39.6025,99.989
949,950,19203,1044,3603,21.4654,38.6667,51.3333,99.7864
950,951,1025,3845,3533,42.5871,72.4967,17.5033,99.9738
951,952,4822,185,3587,23.2803,23.626,66.374,99.9789
952,953,8603,3862,3600,193.845,62.9509,27.0491,99.5335
953,954,10615,308,3589,198.393,14.6348,75.3652,99.9821
954,955,970,3924,3561,207.278,64.6907,25.3093,99.6285
955,956,1339,656,3556,18.6982,17.2407,72.7593,99.9297
956,957,5892,585,3582,195.533,49.5537,40.4463,99.9653
957,958,1341,2566,3576,34.6719,3.00549,86.9945,99.9933
958,959,1375,759,3582,12.3011,12.6682,77.3318,99.9891
959,960,4532,2642,3611,206.196,13.6535,76.3465,99.8522
960,961,1518,686,3593,17.6648,14.5657,75.4343,99.99
961,962,22217,1418,3649,203.599,2.08996,87.91,99.7373
962,963,12728,2546,3651,206.55,15.5573,74.4427,99.7214
963,964,12654,3582,3638,195.817,46.7744,43.2256,99.9535
964,965,4695,513,3623,20.0708,22.8545,67.1455,99.8484
965,966,518,3222,3599,218.08900000000003,67.686,22.314,99.9148
966,967,6825,439,3642,205.729,31.1897,58.8103,99.5789
967,968,14475,3263,3658,26.126,7.86868,82.1313,99.4763
968,969,1979,850,3608,199.59,9.57819,80.4218,99.9882
969,970,4646,1622,3643,25.5723,59.5075,30.4925,99.9704
970,971,4815,1741,3637,205.212,71.3544,18.6456,99.9966
971,972,2542,619,3635,199.564,11.2241,78.7759,99.9916
972,973,1545,680,3626,199.229,44.0691,45.9309,99.9609
973,974,10405,2961,3682,32.1238,42.8809,47.1191,99.0011
974,975,4544,3129,3668,33.4367,47.3439,42.6561,99.8313
975,976,817,2898,3640,226.225,87.6167,2.38327,99.9949
976,977,4803,2815,3653,206.632,35.9431,54.0569,99.9312
977,978,3264,2050,3676,196.186,22.7621,67.2379,99.8539
978,979,1298,348,3655,17.9087,29.6923,60.3077,99.9578
979,980,2045,667,3663,204.447,34.1556,55.8444,99.793
980,981,1504,1661,3666,29.7392,54.8232,35.1768,99.9942
981,982,2241,559,3666,35.3514,56.3914,33.6086,99.9653
982,983,626,169,3669,33.911,42.2373,47.7627,99.9041
983,984,1798,3492,3682,223.827,67.7347,22.2653,99.9416
984,985,3453,1731,3679,23.8982,63.0176,26.9824,99.906
985,986,617,231,3668,202.076,30.321,59.679,99.8925
986,987,2972,2205,3684,182.037,82.0377,7.962280000000002,99.9856
987,988,737,291,3676,17.8792,30.7428,59.2572,99.9707
988,989,1065,356,3675,17.9414,31.5719,58.4281,99.808
989,990,1056,1871,3679,204.46,8.855310000000003,81.1447,99.6986
990,991,4988,2747,3689,163.827,72.5343,17.4657,99.9499
991,992,734,2348,3688,22.5042,63.6868,26.3132,99.9553
992,993,830,3526,3691,201.801,19.0408,70.9592,99.9793
993,994,2389,1974,3693,217.564,51.9969,38.0031,99.4583
994,995,787,987,3692,62.8079,81.4959,8.50408,99.9346
995,996,977,3632,3696,12.1122,27.9963,62.0037,99.8746
996,997,923,2606,3695,9.77537,63.1806,26.8194,99.972
