,Grain No.,Size [Pixel],center x-coordinate,center y-coordinate,mean azimuth [degree],mean latitude [degree],mean colatitude [degree],Regelungsgrad [%]
0,1,1623,103,142,211.504,5.1310699999999985,84.8689,99.9692
1,2,84275,407,239,46.3607,67.7697,22.2303,66.7896
2,3,4789,619,127,222.1,54.53100000000001,35.469,99.9937
3,4,3832,841,128,203.615,38.5918,51.4082,99.9542
4,5,14599,1008,171,18.6032,66.0484,23.9516,99.9772
5,6,5994,1117,176,203.558,36.9364,53.0636,99.8884
6,7,1956,1219,130,216.439,16.6187,73.3813,99.7218
7,8,738,1314,131,38.1023,1.59907,88.4009,99.9712
8,9,2705,1403,139,218.388,40.3305,49.6695,99.9354
9,10,1199,1500,140,14.1917,70.8881,19.1119,99.9585
10,11,29249,672,204,218.435,52.4372,37.5628,99.9969
11,12,55756,847,285,202.651,37.6431,52.3569,99.9924
12,13,69797,1634,286,43.3026,23.4458,66.5542,99.9664
13,14,17263,1850,195,221.832,67.3507,22.6493,99.7462
14,15,17242,1252,206,41.2896,47.6727,42.3273,99.8692
15,16,6499,2168,164,215.883,38.2381,51.7619,99.7104
16,17,2565,2290,157,218.176,58.2347,31.7653,99.929
17,18,10961,2471,171,223.083,56.8003,33.1997,99.8941
18,19,872,2039,168,215.151,33.3037,56.6963,99.9207
19,20,1996,1467,167,12.4267,69.3333,20.6667,99.9891
20,21,11382,127,244,30.0434,53.2458,36.7542,99.955
21,22,1288,1924,166,220.49,37.5372,52.4628,99.8963
22,23,7473,2665,178,226.068,33.7279,56.2721,99.9657
23,24,702,2759,166,357.68300000000005,79.333,10.667,99.829
24,25,300527,2940,545,33.7829,1.96387,88.0361,98.226
25,26,3091,1539,191,39.3244,9.39742,80.6026,99.979
26,27,1265,2836,177,69.4262,81.3498,8.65024,99.9516
27,28,2373,2104,180,54.4629,24.2737,65.7263,99.8974
28,29,1885,3053,177,30.028,66.7609,23.2391,99.9109
29,30,9230,3188,194,225.22,22.151,67.84899999999999,99.8813
30,31,27524,1397,261,39.7081,6.26403,83.736,99.9702
31,32,571,1929,185,216.186,34.764,55.236,99.9706
32,33,4224,2262,202,213.919,55.3683,34.6317,99.9814
33,34,74388,2475,333,43.2827,22.1711,67.8289,71.283
34,35,4111,203,210,221.04,65.0237,24.9763,99.9968
35,36,148642,1958,600,33.0534,30.3141,59.6859,86.3689
36,37,787,3085,203,23.9437,65.6175,24.3825,99.9533
37,38,674,2802,201,81.8325,81.5879,8.412139999999999,99.9953
38,39,4211,2108,219,45.4457,21.4586,68.5414,99.8942
39,40,20753,2820,285,217.97,36.7303,53.2697,99.9967
40,41,7150,2673,244,224.257,31.0967,58.9033,99.9766
41,42,1498,2752,225,221.602,53.1682,36.8318,99.9973
42,43,8910,1161,276,37.3968,14.1149,75.8851,99.9885
43,44,13909,2227,311,226.017,31.3283,58.6717,99.9923
44,45,7234,2153,273,44.8043,45.3411,44.6589,99.9809
45,46,1029,2051,248,215.18400000000003,58.1141,31.8859,99.9949
46,47,24654,1078,374,114.323,81.3291,8.670860000000001,99.7978
47,48,1623,3258,291,216.34,42.9159,47.0841,99.9749
48,49,9690,236,306,24.6194,39.8965,50.1035,99.7603
49,50,20767,1252,374,210.727,60.1709,29.8291,99.9271
50,51,1356,3214,314,215.463,42.7522,47.2478,99.9512
51,52,1111,1848,305,218.966,66.0021,23.9979,99.9941
52,53,14319,2662,360,220.025,12.7488,77.2512,98.8928
53,54,21638,724,423,212.805,67.0325,22.9675,99.9262
54,55,17204,1885,375,35.2586,5.82199,84.178,99.9656
55,56,5001,149,362,224.18,53.4791,36.5209,99.7532
56,57,2091,2093,359,42.2051,48.9587,41.0413,99.9886
57,58,1840,2134,361,34.6909,20.4581,69.5419,99.9972
58,59,1802,193,364,41.57,65.3236,24.6764,99.9876
59,60,991,336,352,37.9057,37.6232,52.3768,99.9516
60,61,930,603,357,218.202,3.02261,86.9774,99.992
61,62,3337,1063,382,203.672,63.3327,26.6673,99.9644
62,63,64606,2266,496,41.0245,0.721428,89.2786,94.356
63,64,2911,1370,384,344.145,76.0259,13.9741,99.9928
64,65,5509,272,389,33.2601,12.8039,77.1961,99.9921
65,66,1210,1420,373,217.312,13.8924,76.1076,99.9989
66,67,104812,349,542,40.9261,64.0761,25.9239,99.8265
67,68,2022,91,414,39.9079,69.5346,20.4654,99.9722
68,69,20341,1729,440,53.0755,27.1766,62.8234,99.9665
69,70,4077,2194,423,44.99800000000001,48.6592,41.3408,99.9933
70,71,15848,577,475,219.677,8.625689999999999,81.3743,99.8964
71,72,58850,849,548,20.2215,15.304,74.696,45.4899
72,73,1218,1470,416,213.613,43.7579,46.2421,99.9876
73,74,691,1428,419,202.304,66.2168,23.7832,99.9942
74,75,8629,1343,458,15.9924,76.3764,13.6236,99.9522
75,76,3537,1557,457,216.243,14.4826,75.5174,99.9527
76,77,225422,1415,803,35.7536,7.07475,82.9252,93.9857
77,78,990,3242,469,36.0152,16.4727,73.5273,99.9446
78,79,518,2466,456,221.117,3.56322,86.4368,99.9843
79,80,13360,1219,525,219.361,10.55,79.45,99.9156
80,81,2696,2681,487,163.72299999999996,77.9908,12.0092,99.9647
81,82,21468,1064,563,26.2305,48.0965,41.9035,99.9849
82,83,1331,656,493,29.7868,36.1382,53.8618,99.9896
83,84,1104,72,545,36.6134,65.9959,24.0041,99.9214
84,85,86793,2391,710,30.3177,6.17684,83.8232,96.9015
85,86,3044,358,561,30.3412,35.9842,54.0158,99.982
86,87,1798,640,537,20.3593,79.8944,10.1056,99.9825
87,88,6685,1316,577,195.21400000000003,73.3944,16.6056,99.9855
88,89,3296,1818,603,215.973,14.9392,75.0608,99.996
89,90,10518,935,636,44.7576,25.7596,64.2404,99.993
90,91,4223,1155,627,23.3588,56.8103,33.1897,99.9839
91,92,14575,145,703,27.6752,40.1495,49.8505,99.9036
92,93,627,1252,613,38.0978,3.94698,86.053,99.9875
93,94,82577,361,859,29.5818,16.8076,73.1924,93.8884
94,95,2271,3216,636,220.643,6.926660000000001,83.0733,99.8658
95,96,3646,674,661,15.9343,49.361,40.639,99.9817
96,97,6429,1232,674,225.443,59.8528,30.1472,99.9664
97,98,5700,1303,694,32.9628,6.7213,83.2787,99.8641
98,99,10324,1828,690,221.572,39.9739,50.0261,99.9961
99,100,55036,1691,890,27.1217,66.0695,23.9305,99.6835
100,101,3555,738,692,211.81,30.4636,59.5364,99.8385
101,102,859,1626,669,27.7624,66.1875,23.8125,99.9815
102,103,10125,1088,691,210.25,48.8176,41.1824,99.9565
103,104,7244,2592,707,219.406,11.7482,78.2518,99.9866
104,105,1793,3249,707,35.6464,46.9268,43.0732,99.8943
105,106,12222,225,716,51.6673,80.3163,9.68369,99.9948
106,107,1069,1348,688,32.5642,28.5043,61.4957,99.9234
107,108,83689,746,789,32.4318,11.8239,78.1761,97.3459
108,109,4391,2019,731,31.3193,59.7377,30.2623,99.9463
109,110,1606,2522,707,36.9146,18.4546,71.5454,99.9958
110,111,3712,2118,747,211.03,6.684360000000002,83.3156,99.9679
111,112,58332,1145,871,25.7728,59.2463,30.7537,99.9353
112,113,23784,2846,801,228.073,14.6013,75.3987,99.9909
113,114,1069,105,765,31.9397,15.3882,74.6118,99.9835
114,115,513,76,761,209.147,54.0103,35.9897,99.9705
115,116,10734,1296,825,215.926,11.9416,78.0584,99.9864
116,117,34411,2679,888,207.752,58.0843,31.9157,99.9798
117,118,11533,149,843,48.2694,81.8705,8.12952,99.972
118,119,52937,2316,884,211.833,9.79247,80.2075,99.158
119,120,2863,1380,822,28.1659,61.0575,28.9425,99.9935
120,121,2106,2082,848,42.5163,44.8809,45.1191,99.8491
121,122,8933,2026,901,26.206,10.8848,79.1152,99.9855
122,123,12379,861,875,209.61900000000003,42.4357,47.5643,99.9966
123,124,5173,3209,877,36.3501,47.4994,42.5006,99.951
124,125,87642,2803,1046,37.0297,9.3258,80.6742,44.9284
125,126,4818,3142,955,35.0422,30.3561,59.6439,99.9624
126,127,1110,680,898,34.9271,3.84356,86.1564,99.6384
127,128,24332,810,981,217.23,2.8451,87.1549,95.5098
128,129,3733,2542,909,34.568000000000005,28.3632,61.6368,99.9948
129,130,5212,3075,934,31.297,27.7064,62.2936,99.9864
130,131,3063,565,911,213.673,22.4427,67.5573,99.9831
131,132,20379,637,969,223.595,17.2177,72.7823,98.8261
132,133,15176,2153,960,212.046,38.4822,51.5178,99.9937
133,134,2265,80,950,31.5265,64.7731,25.2269,99.8308
134,135,14834,154,975,28.0496,62.7912,27.2088,99.9478
135,136,153021,511,1201,193.795,61.1587,28.8413,99.6692
136,137,597,3001,922,226.453,13.8062,76.1938,99.9908
137,138,45808,1888,1102,35.0,25.3499,64.6501,99.9341
138,139,17294,3008,1017,213.243,69.5733,20.4267,99.4545
139,140,149005,2457,1256,26.3055,82.1027,7.8973,71.9309
140,141,43644,3140,1159,38.6254,42.1801,47.8199,99.812
141,142,29348,2128,1067,215.016,22.895,67.105,99.3124
142,143,1593,1782,1041,224.11,20.1589,69.8411,99.9852
143,144,17368,1441,1096,37.2472,53.1276,36.8724,99.8922
144,145,1287,887,1053,30.0286,49.8206,40.1794,99.9911
145,146,179886,977,1389,235.288,81.4075,8.59249,85.6645
146,147,16971,1696,1122,229.701,2.84205,87.15799999999999,99.791
147,148,8554,129,1087,228.696,68.2825,21.7175,99.9304
148,149,13558,1580,1103,39.8846,7.6574300000000015,82.3426,99.8613
149,150,5844,809,1077,26.0779,56.3903,33.6097,99.9966
150,151,3250,196,1104,26.2571,10.0362,79.9638,99.998
151,152,14808,1304,1151,216.277,10.9296,79.0704,99.9801
152,153,3677,1780,1107,216.734,10.8797,79.1203,99.9924
153,154,1068,2993,1099,199.344,54.78100000000001,35.219,99.9757
154,155,588,1351,1101,41.1636,52.0186,37.9814,99.9977
155,156,690,64,1121,24.7668,60.1525,29.8475,99.9616
156,157,92637,2095,1266,39.0358,3.35796,86.64200000000002,99.331
157,158,12921,2678,1189,40.2334,3.46241,86.5376,99.9167
158,159,732,2222,1139,220.811,22.2846,67.7154,99.9961
159,160,1389,3035,1152,40.7387,52.7408,37.2592,99.8866
160,161,5193,162,1169,236.459,87.1208,2.87916,99.9809
161,162,29094,1210,1243,220.268,55.4147,34.5853,99.9913
162,163,11037,249,1219,208.656,4.71429,85.2857,99.9902
163,164,6392,1393,1233,202.401,67.4052,22.5948,99.9884
164,165,1160,2813,1181,21.0769,72.7474,17.2526,99.9959
165,166,790,64,1200,34.7394,25.0347,64.9653,99.8954
166,167,14131,129,1265,33.488,25.1704,64.8296,99.9448
167,168,5843,1572,1200,224.253,5.47414,84.5259,98.1606
168,169,59278,2840,1350,27.2879,45.9425,44.0575,99.9842
169,170,11942,3215,1290,55.5235,0.423332,89.5767,99.9679
170,171,360261,1709,1600,216.488,3.24319,86.7568,88.569
171,172,3878,1701,1242,48.5543,2.22395,87.7761,99.5495
172,173,4036,1648,1246,351.9380000000001,69.3271,20.6729,99.9958
173,174,39003,1680,1350,352.492,69.6979,20.3021,99.7775
174,175,7736,3029,1294,223.49,47.2887,42.7113,99.9821
175,176,5943,2705,1304,307.93,85.4386,4.56137,99.9609
176,177,1543,1584,1267,204.96,66.592,23.408,99.9768
177,178,788,70,1273,34.8544,25.6547,64.3453,99.8939
178,179,5662,220,1313,214.97,12.6794,77.3206,99.9863
179,180,8394,853,1316,213.322,66.0925,23.9075,99.9635
180,181,7104,322,1334,39.8007,7.5389,82.4611,99.9741
181,182,2750,1812,1322,43.8679,17.636,72.36399999999998,99.8781
182,183,24998,2322,1369,43.0747,51.8317,38.1683,99.9757
183,184,5028,751,1341,225.179,10.9877,79.0123,99.9994
184,185,8236,2973,1385,304.88,89.3467,0.65327,94.0375
185,186,661,2648,1321,29.2676,45.8987,44.1013,99.9975
186,187,971,1276,1337,44.2773,7.286589999999999,82.7134,99.9971
187,188,5396,1866,1359,36.5223,42.6799,47.3201,99.9796
188,189,1640,80,1367,203.344,42.1495,47.8505,99.9221
189,190,8834,3061,1392,198.735,49.4859,40.5141,99.9918
190,191,94318,2571,1651,34.115,6.730639999999998,83.2694,98.7528
191,192,2925,178,1372,209.939,61.6939,28.3061,99.9057
192,193,186289,413,1554,37.231,25.353,64.64699999999999,48.2264
193,194,33291,2089,1470,221.695,18.6527,71.3473,99.8636
194,195,1666,305,1384,310.647,82.7437,7.25632,99.9394
195,196,9165,748,1420,207.99,27.8867,62.1133,99.9872
196,197,4960,3164,1437,38.9613,27.5219,62.4781,99.9522
197,198,16718,3094,1512,37.3461,36.6456,53.3544,91.8129
198,199,572,3240,1435,216.072,17.0493,72.9507,99.8882
199,200,6553,2298,1463,42.9559,10.5843,79.4157,99.9962
200,201,1537,3231,1483,226.498,45.7691,44.2309,99.9727
201,202,2563,3190,1501,225.514,45.1548,44.8452,99.9619
202,203,3761,2762,1511,230.432,59.1125,30.8875,99.9481
203,204,78430,3010,1699,227.221,63.2284,26.7716,99.878
204,205,11389,2901,1584,218.012,56.2664,33.7336,99.9362
205,206,1086,3057,1534,223.462,40.8531,49.1469,99.9923
206,207,9174,1152,1585,27.7965,18.8639,71.1361,99.9942
207,208,4543,2826,1566,5.7122199999999985,80.141,9.859,99.2448
208,209,43184,659,1673,22.6072,64.8141,25.1859,99.8989
209,210,3344,1236,1572,40.0207,15.049,74.95100000000002,99.9928
210,211,8170,2291,1588,43.0946,59.9666,30.0334,99.9805
211,212,1748,3220,1585,30.2513,62.4213,27.5787,99.8608
212,213,5973,1319,1595,230.706,57.6639,32.3361,99.9892
213,214,2771,2371,1612,305.724,79.1655,10.8345,99.9942
214,215,7063,2760,1637,45.552,6.7439300000000015,83.2561,99.7883
215,216,15912,1230,1670,215.956,55.2015,34.7985,99.9894
216,217,509,3228,1630,221.238,52.00899999999999,37.991,99.9235
217,218,1142,2321,1647,57.8635,24.5913,65.4087,99.9986
218,219,20296,2341,1709,60.1152,27.3939,62.6061,99.9786
219,220,1774,3223,1699,220.11900000000003,53.864,36.136,99.9093
220,221,1397,2643,1674,230.866,70.895,19.105,99.982
221,222,5329,2714,1707,45.3276,60.4578,29.5422,99.9839
222,223,16530,911,1759,44.8172,46.6311,43.3689,99.8853
223,224,519,871,1700,208.772,60.4654,29.5346,99.995
224,225,20246,199,1766,222.252,50.1052,39.8948,99.9754
225,226,6477,1655,1747,34.191,38.5552,51.4448,99.9874
226,227,1559,632,1723,38.0696,50.4129,39.5871,99.9548
227,228,1271,839,1709,218.246,30.0099,59.9901,99.9957
228,229,2172,2653,1729,210.871,1.76968,88.2303,99.995
229,230,11965,326,1780,28.2313,52.8962,37.1038,99.8344
230,231,1051,89,1752,225.137,51.7963,38.2037,99.9572
231,232,573,587,1737,217.374,55.8311,34.1689,99.5284
232,233,6103,1187,1755,32.3133,55.1763,34.8237,99.998
233,234,1602,1101,1740,19.9947,63.4193,26.5807,99.9832
234,235,1613,63,1787,215.678,57.1586,32.8414,99.7848
235,236,9577,542,1800,222.289,49.6006,40.3994,99.9945
236,237,6567,2684,1780,232.405,86.3191,3.68095,99.9697
237,238,1988,2856,1772,42.1437,15.2561,74.7439,99.9759
238,239,32852,947,1916,247.754,73.1021,16.8979,76.1453
239,240,2482,1739,1779,46.823,71.6901,18.3099,99.9639
240,241,6176,2770,1799,228.426,28.8436,61.1564,99.99
241,242,17127,1112,1841,40.6909,1.41931,88.5807,99.9977
242,243,1695,620,1791,29.9666,30.6521,59.3479,99.9958
243,244,1004,2312,1785,43.3723,0.389709,89.6103,99.993
244,245,18132,1259,1855,23.3438,9.46033,80.5397,99.9588
245,246,30727,516,1884,238.732,22.2847,67.7153,99.8686
246,247,4177,2383,1809,53.7293,14.2346,75.7654,99.998
247,248,3003,669,1815,39.4039,37.9076,52.0924,99.9905
248,249,75344,1630,1910,13.8109,67.7083,22.2917,99.9677
249,250,1480,1671,1804,27.1747,4.9673,85.0327,99.9976
250,251,48261,707,1936,14.0209,71.9377,18.0623,99.6943
251,252,720,2867,1806,224.498,29.6854,60.3146,99.9618
252,253,3858,3226,1910,28.8605,50.6593,39.3407,99.9356
253,254,14258,2580,1876,218.668,33.6342,56.3658,99.9771
254,255,8498,152,1851,19.8322,70.7342,19.2658,99.9907
255,256,1854,2318,1827,24.1117,60.5722,29.4278,99.9942
256,257,92269,2999,1951,211.865,22.4734,67.5266,99.924
257,258,1608,2201,1839,42.4248,6.27489,83.7251,99.9826
258,259,3935,71,1892,23.6277,73.4085,16.5915,99.9661
259,260,15252,2754,1881,210.846,81.7153,8.28475,99.9728
260,261,14353,1389,1898,32.1725,14.7128,75.2872,99.9091
261,262,3777,909,1858,22.5481,27.1362,62.8638,99.9967
262,263,4907,1866,1880,26.3393,22.6607,67.3393,99.9952
263,264,4210,2374,1883,219.919,9.43217,80.5678,99.9929
264,265,58656,2075,1957,216.978,51.2613,38.7387,99.9734
265,266,3760,2072,1901,219.002,8.30256,81.6974,99.9783
266,267,11477,2293,1899,38.1877,62.1624,27.8376,99.9922
267,268,2329,338,1872,19.7474,82.5416,7.45835,99.9745
268,269,944,237,1881,20.235,81.07,8.93004,99.9948
269,270,895,2660,1890,55.9001,74.8436,15.1565,99.9829
270,271,11903,302,1943,235.129,24.591,65.40899999999999,99.9017
271,272,7046,172,1928,221.326,47.6214,42.3786,99.8903
272,273,1739,372,1932,33.6298,55.6492,34.3508,99.9772
273,274,7834,429,1942,213.364,51.4135,38.5865,99.9945
274,275,2144,3197,1954,27.5493,49.1906,40.8094,99.9837
275,276,179574,1128,2132,43.5946,29.2165,60.7835,99.8559
276,277,3889,2639,1937,38.4795,17.0977,72.9023,99.9918
277,278,1133,111,1943,222.04,44.9252,45.0748,99.9553
278,279,1125,1023,1934,43.5141,31.2921,58.7079,99.981
279,280,10048,2733,1997,214.474,74.407,15.593,99.8884
280,281,824,2399,1962,221.668,2.18523,87.8148,99.8447
281,282,979,74,1975,232.843,51.9409,38.0591,99.6808
282,283,1471,2560,1972,34.7932,62.4438,27.5562,99.9788
283,284,33085,221,2056,33.4343,63.39,26.61,99.9668
284,285,8349,1824,2033,42.7066,9.70069,80.2993,86.2454
285,286,1180,1412,1981,212.807,51.5294,38.4706,99.9944
286,287,2468,2522,1995,33.2237,73.6903,16.3097,99.9702
287,288,3891,2297,2014,217.263,9.42207,80.5779,99.8961
288,289,6497,2385,2017,32.9486,63.4846,26.5154,99.7562
289,290,11489,2592,2037,15.8546,66.9937,23.0063,99.6442
290,291,1649,2458,2001,222.531,26.3854,63.6146,99.9539
291,292,5276,460,2024,235.172,27.121,62.879,99.9174
292,293,1787,82,2019,33.4711,64.4553,25.5447,99.9528
293,294,5026,749,2037,237.694,53.6426,36.3574,99.9371
294,295,18604,1692,2073,218.969,50.7297,39.2703,99.9143
295,296,845,1384,2014,35.1609,13.1832,76.8168,98.1581
296,297,1328,1435,2034,212.407,51.3197,38.6803,99.802
297,298,2021,380,2029,224.509,23.0998,66.9002,99.9946
298,299,2698,3207,2054,40.9218,13.3803,76.6197,99.8822
299,300,17596,1537,2092,29.5385,24.1771,65.8229,99.8528
300,301,5710,839,2084,26.3914,14.4469,75.5531,99.9818
301,302,6103,1949,2093,221.598,18.4771,71.5229,91.985
302,303,42458,2624,2152,34.6546,64.658,25.342,99.9498
303,304,1469,1870,2061,45.2719,45.3172,44.6828,99.9973
304,305,631,1990,2054,41.5562,18.7743,71.2257,99.9861
305,306,11290,2231,2081,216.966,12.8423,77.1577,99.7662
306,307,557,355,2059,214.591,80.2237,9.77633,99.9914
307,308,8205,2042,2100,35.3286,66.3656,23.6344,99.9892
308,309,8701,2398,2108,226.468,34.0232,55.9768,99.7832
309,310,1755,2813,2068,255.819,80.5701,9.42994,99.9903
310,311,1293,79,2070,221.385,7.88248,82.1175,98.7795
311,312,2626,426,2086,216.761,81.2042,8.7958,99.9711
312,313,68463,609,2199,23.3286,66.0215,23.9785,99.9017
313,314,10309,2822,2135,220.046,30.5508,59.4492,99.8791
314,315,49161,3116,2214,228.465,6.35226,83.6477,99.9597
315,316,24105,2213,2166,219.039,26.8106,63.1894,99.2839
316,317,24204,1865,2177,217.482,52.5855,37.4145,99.9084
317,318,3650,1428,2122,215.496,16.7385,73.2615,99.9843
318,319,8299,2965,2125,348.876,85.4706,4.52941,99.9636
319,320,946,363,2109,205.817,79.5052,10.4948,99.9446
320,321,6669,1725,2158,208.573,69.3825,20.6175,99.8331
321,322,7864,85,2208,27.2407,49.604,40.396,99.807
322,323,22439,428,2209,225.32,22.6316,67.3684,99.9907
323,324,200268,389,2415,25.5271,52.8784,37.1216,77.7165
324,325,1112,336,2149,204.645,79.52199999999998,10.478,99.835
325,326,139819,2552,2374,51.7776,25.9819,64.0181,97.726
326,327,15196,1456,2208,224.705,55.4915,34.5085,99.959
327,328,185862,2037,2435,223.054,28.9555,61.0445,99.2064
328,329,783,2938,2174,223.51,29.2322,60.7678,99.9895
329,330,3458,1643,2197,216.997,18.6738,71.3262,99.9747
330,331,99770,2964,2430,41.0193,7.20327,82.7967,67.4888
331,332,5022,2149,2244,42.6736,17.9206,72.0794,98.0653
332,333,14522,1508,2296,15.2359,63.0201,26.9799,99.9552
333,334,5215,990,2269,227.269,28.4656,61.5344,99.9932
334,335,8264,1724,2254,36.3463,10.5885,79.4115,99.9774
335,336,1206,1801,2234,210.617,66.3388,23.6612,99.9959
336,337,7433,1638,2303,205.507,70.4687,19.5313,99.9528
337,338,21857,793,2344,224.838,75.2007,14.7993,99.8691
338,339,11082,937,2305,35.5253,66.8071,23.1929,99.9393
339,340,2770,2255,2277,46.5625,29.1915,60.8085,99.9964
340,341,2301,1892,2263,213.029,38.69300000000001,51.307,99.9667
341,342,5125,689,2291,231.818,29.1122,60.8878,99.9969
342,343,590,2211,2278,35.2995,25.7609,64.2391,99.993
343,344,2000,1609,2301,211.057,47.7879,42.2121,98.9276
344,345,2279,1536,2302,212.318,69.4175,20.5825,99.9843
345,346,10945,1401,2343,30.5191,48.9484,41.0516,99.9238
346,347,2532,1960,2316,227.501,20.334,69.666,99.9905
347,348,3719,1312,2345,26.4698,62.5601,27.4399,99.9904
348,349,1149,1707,2328,36.6421,17.7278,72.2722,99.9168
349,350,1066,1579,2337,218.338,36.538,53.462,99.9938
350,351,1963,1770,2356,2.62663,75.1784,14.8216,99.9679
351,352,1590,63,2360,26.805,50.2062,39.7938,99.8927
352,353,1969,2157,2349,229.95,59.6905,30.3095,99.9859
353,354,18690,945,2424,35.009,34.2919,55.7081,99.9312
354,355,27107,1656,2419,37.5091,11.232,78.768,99.9677
355,356,24196,2772,2450,61.5226,47.6145,42.3855,99.9754
356,357,9085,3149,2407,23.628,44.7684,45.2316,99.8894
357,358,18546,1271,2405,48.7308,67.8712,22.1288,99.9696
358,359,18029,1162,2443,26.0857,61.2202,28.7798,99.9534
359,360,15200,2359,2507,219.627,40.2735,49.7265,99.9234
360,361,5005,57,2478,234.539,81.242,8.75796,99.881
361,362,4820,1506,2460,44.129,62.2639,27.7361,99.9479
362,363,1623,580,2452,213.912,73.9193,16.0807,99.9515
363,364,4134,1401,2468,34.8515,51.4488,38.5512,99.9949
364,365,1385,1055,2482,201.441,45.9122,44.0878,99.9943
365,366,1487,3145,2488,218.276,70.336,19.664,99.9692
366,367,16454,1399,2554,225.365,60.942,29.058000000000003,99.8081
367,368,5303,1112,2512,260.851,73.9891,16.011,98.8262
368,369,1442,965,2500,233.511,71.8859,18.1141,99.3491
369,370,8792,1613,2521,34.0964,47.9948,42.0052,98.6885
370,371,13685,855,2560,251.446,76.2615,13.7385,99.8066
371,372,1087,1673,2502,52.6811,59.7338,30.2662,99.9822
372,373,5321,1298,2533,46.0352,63.7341,26.2659,99.7037
373,374,1350,1229,2523,236.489,62.5222,27.4778,99.7731
374,375,2564,1012,2545,239.081,62.6767,27.3233,99.8101
375,376,25006,274,2622,35.0617,32.9194,57.0806,99.6838
376,377,9568,1526,2610,47.3742,66.6603,23.3397,99.9707
377,378,1304,1197,2551,31.4747,64.7781,25.2219,99.9912
378,379,2278,1087,2556,36.2668,23.1606,66.8394,99.9977
379,380,64474,2872,2709,242.074,81.8826,8.11735,94.6048
380,381,19935,2416,2668,30.0324,19.5248,70.4752,99.7855
381,382,15550,1631,2636,211.669,53.5992,36.4008,99.2926
382,383,5221,1242,2609,221.413,60.5383,29.4617,99.987
383,384,2923,527,2587,219.33,3.22306,86.7769,99.9921
384,385,892,1162,2570,34.5171,28.2998,61.7002,99.9643
385,386,29545,1089,2645,33.858000000000004,51.5876,38.4124,99.9933
386,387,2330,1450,2600,35.4438,48.0362,41.9638,99.9304
387,388,31210,2010,2676,209.55900000000003,7.546130000000002,82.4539,99.973
388,389,5040,918,2613,33.8549,18.4309,71.5691,99.9792
389,390,26750,516,2695,34.9372,44.0136,45.9864,99.8568
390,391,2087,1393,2610,211.203,18.8151,71.1849,99.9976
391,392,569,63,2606,26.7673,48.4978,41.5022,99.9352
392,393,5689,134,2632,24.7953,56.4981,33.5019,99.9927
393,394,1492,2185,2619,220.543,39.8037,50.1963,99.9873
394,395,798,60,2637,31.9058,44.1522,45.8478,99.8587
395,396,1611,2990,2638,46.1217,2.57276,87.4272,98.2047
396,397,24751,2332,2748,33.9149,8.89124,81.1088,99.7722
397,398,633,3184,2629,341.935,79.6453,10.3547,99.9369
398,399,47019,1803,2769,32.6317,31.8014,58.1986,99.8923
399,400,3806,878,2652,44.7073,23.4251,66.5749,99.9931
400,401,13182,3091,2684,232.112,5.91268,84.0873,99.9853
401,402,38457,2574,2724,224.318,55.5798,34.4202,99.9874
402,403,35813,686,2746,38.2964,6.60335,83.3967,99.937
403,404,7682,2234,2677,39.6388,13.2057,76.7943,99.9882
404,405,1999,740,2640,43.5718,25.0899,64.9101,99.8887
405,406,6907,394,2682,219.072,29.1661,60.8339,99.9971
406,407,12991,862,2715,38.9262,33.4534,56.5466,99.8326
407,408,3221,2149,2672,298.936,75.4491,14.5509,99.9859
408,409,626,1380,2654,229.439,61.3225,28.6775,99.9918
409,410,914,1317,2653,33.4189,49.4568,40.5432,99.9973
410,411,11557,1467,2728,213.629,8.85844,81.1416,99.9571
411,412,6791,1314,2701,315.798,79.2681,10.7319,99.9417
412,413,2836,1550,2715,211.46400000000003,39.4846,50.5154,99.9486
413,414,4846,1221,2710,35.6166,42.0546,47.9454,99.9913
414,415,5580,132,2709,215.8,62.2892,27.7108,99.9089
415,416,3573,54,2733,226.245,65.5729,24.4271,99.8116
416,417,638,1682,2699,203.814,42.1509,47.8491,99.9674
417,418,7120,278,2732,26.9364,57.0916,32.9084,99.9879
418,419,48267,1391,2905,217.533,63.3428,26.6572,90.1663
419,420,532,2837,2704,213.662,69.3324,20.6676,99.9925
420,421,20737,167,2797,215.617,71.3567,18.6433,99.9417
421,422,508,2111,2727,37.8309,16.347,73.653,99.9741
422,423,3771,3146,2768,218.164,73.3678,16.6322,99.9311
423,424,9777,2190,2754,49.3651,23.0914,66.9086,99.9608
424,425,4668,370,2750,31.532,43.6139,46.3861,99.9455
425,426,28842,981,2819,24.8738,14.2096,75.7904,99.825
426,427,5134,1642,2751,222.221,53.74100000000001,36.259,99.998
427,428,8509,1124,2753,315.579,78.4299,11.5701,99.9972
428,429,33093,438,2850,222.542,27.8484,62.1516,97.1468
429,430,824,3174,2758,224.153,74.0497,15.9503,99.9377
430,431,2833,2742,2765,37.0301,7.5871,82.4129,99.9959
431,432,12335,1237,2796,39.4912,55.6836,34.3164,99.9926
432,433,2038,1566,2764,229.148,58.3701,31.6299,99.8597
433,434,25743,1986,2827,209.888,37.5969,52.4031,99.9493
434,435,3352,1358,2791,27.5366,45.9956,44.0044,99.9967
435,436,1616,3078,2780,215.755,68.7929,21.2071,99.9893
436,437,603,2106,2780,39.1433,9.15331,80.8467,99.9062
437,438,9487,1702,2836,43.6054,51.3965,38.6035,99.9348
438,439,7089,2809,2820,29.2155,36.2724,53.7276,99.9948
439,440,10138,2673,2837,242.258,81.9863,8.01366,99.979
440,441,2923,55,2832,220.812,74.1046,15.8954,99.9153
441,442,1192,1601,2804,245.231,72.2814,17.7186,99.9965
442,443,15182,3105,2868,229.176,61.7133,28.2867,99.9659
443,444,28270,2223,2871,220.699,25.7817,64.2183,98.7337
444,445,7146,2550,2851,36.15,11.1491,78.8509,99.9859
445,446,1093,3055,2813,48.7358,50.7188,39.2812,99.9884
446,447,12772,759,2861,237.485,80.4828,9.51715,99.9254
447,448,1075,849,2841,223.072,51.0999,38.9001,99.2074
448,449,2637,1299,2845,222.929,51.2558,38.7442,99.9972
449,450,12687,1216,2892,217.645,34.1537,55.8463,99.8512
450,451,3293,254,2858,24.4049,40.4753,49.5247,99.9987
451,452,1058,1579,2850,43.9271,49.3068,40.6932,99.5206
452,453,883,2444,2861,208.278,36.4142,53.5858,99.971
453,454,657,295,2858,21.3056,25.6447,64.3553,99.2354
454,455,37304,603,2977,220.378,44.5247,45.4753,99.3419
455,456,5687,1630,2879,208.174,53.0479,36.9521,99.9893
456,457,518,79,2860,218.179,71.5258,18.4742,99.9947
457,458,1695,2507,2858,213.952,38.928,51.072,99.7929
458,459,6531,1085,2890,32.2347,0.548141,89.4519,99.9966
459,460,7381,2884,2896,28.5986,51.7829,38.2171,99.9945
460,461,2920,214,2888,208.122,10.0781,79.9219,99.9833
461,462,10410,2773,2911,226.301,17.6512,72.3488,99.986
462,463,980,2398,2888,206.25,42.6641,47.3359,99.9828
463,464,1244,1401,2898,224.758,56.8143,33.1857,99.9969
464,465,929,1764,2890,225.448,65.0663,24.9337,99.9966
465,466,17529,850,2945,212.813,69.7804,20.2196,99.8066
466,467,3684,1961,2900,241.017,73.4831,16.5169,99.9169
467,468,881,309,2893,39.6364,1.64742,88.3526,99.9962
468,469,53154,2540,3048,215.982,13.354,76.646,94.7925
469,470,52692,216,3013,215.139,34.2891,55.7109,97.1161
470,471,5455,1576,2967,29.4004,22.3771,67.6229,99.917
471,472,11497,418,2958,237.528,67.9097,22.0903,99.8908
472,473,19499,2359,3025,219.733,16.5282,73.4718,60.8329
473,474,1594,2973,2914,226.842,64.3089,25.6911,99.9834
474,475,3636,1658,2933,211.088,19.2406,70.7594,99.9795
475,476,17373,2264,2971,219.211,40.3332,49.6668,99.2269
476,477,703,2657,2911,221.296,17.232,72.768,99.9953
477,478,703,59,2909,21.9759,40.7592,49.2408,99.8822
478,479,1413,1743,2929,210.841,18.7156,71.2844,99.9973
479,480,1870,1895,2937,28.2578,16.4678,73.5322,99.9919
480,481,42352,2042,3030,214.092,30.3799,59.6201,94.3889
481,482,8358,3038,2983,35.697,24.1175,65.8825,99.8181
482,483,1040,3085,2932,30.2048,2.84191,87.1581,99.9636
483,484,3102,1041,2956,199.002,55.5669,34.4331,99.9677
484,485,2552,2937,2954,48.3901,50.0124,39.9876,99.9865
485,486,1710,3196,2988,216.5,27.0639,62.9361,99.8429
486,487,6811,1121,2979,222.647,42.7585,47.2415,99.9772
487,488,2593,3156,2974,214.094,26.0877,63.9123,99.9597
488,489,6125,961,2978,223.24400000000003,41.0358,48.9642,99.9417
489,490,2821,3105,2970,25.1605,9.65205,80.348,99.9093
490,491,10135,1683,3009,39.828,62.1257,27.8743,99.8045
491,492,18418,2814,3018,31.6614,42.091,47.909,99.8836
492,493,6295,59,3037,221.379,44.7432,45.2568,99.8576
493,494,34488,1460,3067,36.1824,15.7579,74.2421,80.1959
494,495,3317,1778,2997,34.5087,59.6795,30.3205,99.9565
495,496,2627,2110,2993,29.3632,7.39767,82.6023,99.2386
496,497,1287,2766,2978,23.9357,56.1266,33.8734,99.9629
497,498,681,1861,2984,217.091,39.8655,50.1345,99.9764
498,499,67712,2964,3148,216.96,58.4049,31.5951,65.6605
499,500,529,2154,3001,29.7125,23.1395,66.8605,99.9924
500,501,13007,748,3052,211.502,12.273,77.727,99.9053
501,502,719,2381,3003,28.0543,23.9193,66.0807,99.9938
502,503,1213,1057,3022,212.111,48.3227,41.6773,98.132
503,504,569,2193,3005,39.4712,82.5408,7.4591699999999985,99.9847
504,505,1313,1308,3029,214.424,26.9442,63.0558,99.9864
505,506,16094,364,3090,215.148,68.5925,21.4075,99.9808
506,507,1673,1003,3040,199.696,53.2207,36.7793,99.7515
507,508,790,1827,3035,195.297,78.1381,11.8619,91.2048
508,509,12005,921,3087,24.3924,17.08,72.92,99.0192
509,510,664,1347,3039,213.507,53.1121,36.8879,99.931
510,511,5023,2623,3084,30.9564,16.779,73.221,99.9468
511,512,5190,3148,3070,218.548,12.938,77.062,99.9155
512,513,17106,1110,3105,226.319,73.1399,16.8601,99.9847
513,514,680,850,3042,25.9,10.7522,79.2478,99.9879
514,515,4127,1264,3068,209.93400000000003,53.1713,36.8287,99.972
515,516,522,93,3073,214.329,40.9039,49.0961,99.9364
516,517,4124,1206,3095,211.564,21.2729,68.7271,99.8905
517,518,2487,1852,3074,230.342,66.8086,23.1914,99.9892
518,519,1445,1726,3079,221.466,76.3503,13.6497,99.9806
519,520,651,620,3061,27.5587,67.9608,22.0392,99.9931
520,521,2801,1783,3079,214.677,43.5675,46.4325,99.9922
521,522,10601,577,3126,29.5937,43.6038,46.3962,99.993
522,523,4455,999,3107,201.67,17.6329,72.3671,99.9943
523,524,1369,1604,3089,206.755,20.0559,69.9441,99.9665
524,525,826,642,3088,262.41700000000003,82.7206,7.27945,99.9849
525,526,2922,2713,3100,212.906,12.1609,77.8391,99.9258
526,527,6912,1944,3122,209.228,44.2383,45.7617,99.962
527,528,3899,2355,3108,40.2382,45.5616,44.4384,99.961
528,529,1039,3183,3111,39.5047,3.61317,86.3868,99.6206
529,530,760,2198,3103,231.791,32.046,57.95399999999999,99.9777
530,531,867,2659,3112,236.489,73.8569,16.1431,99.816
531,532,21253,820,3169,213.439,44.327,45.673,99.9009
532,533,1160,730,3117,321.688,86.1841,3.8159,99.9801
533,534,715,663,3113,217.606,9.24062,80.7594,99.9948
534,535,3197,1817,3123,32.093,24.8623,65.1377,98.7041
535,536,1016,1689,3114,217.497,33.0255,56.9745,99.9917
536,537,2504,1868,3141,33.4819,2.93333,87.0667,99.9792
537,538,5320,1562,3141,29.836,17.4102,72.5898,99.9172
538,539,668,265,3124,33.2105,66.2076,23.7924,99.8983
539,540,813,1271,3131,35.9068,43.5032,46.4968,99.8999
540,541,4087,72,3161,220.209,51.2875,38.7125,99.9583
541,542,540,1311,3130,219.169,55.4252,34.5748,99.9687
542,543,2860,3150,3154,44.1659,2.90982,87.0902,99.9116
543,544,12109,455,3168,35.563,42.2654,47.7346,99.9719
544,545,519,695,3128,83.0569,88.3416,1.6583599999999998,99.9926
545,546,1979,1722,3146,37.6628,24.8459,65.1541,99.9923
546,547,2490,124,3169,214.342,47.5944,42.4056,99.9874
547,548,6956,1996,3184,334.716,82.4984,7.50161,99.9551
548,549,2345,2598,3152,334.467,83.95,6.05,99.9803
549,550,4355,2215,3164,225.661,18.3953,71.6047,99.9854
550,551,11871,2117,3191,207.567,10.3162,79.6838,99.9304
551,552,10714,2345,3172,26.9683,25.4342,64.5658,99.9827
552,553,8124,1681,3196,32.261,9.14133,80.8587,99.5706
553,554,3300,648,3173,31.044,21.918000000000006,68.082,99.9857
554,555,5496,2678,3179,223.256,44.4252,45.5748,99.9946
555,556,9701,1015,3191,208.17,28.3277,61.6723,99.9147
556,557,614,1235,3155,34.0081,19.8191,70.1809,99.9892
557,558,1232,1777,3160,210.802,41.3804,48.6196,99.9806
558,559,4081,327,3180,211.746,3.65177,86.3482,99.9861
559,560,1465,1281,3165,296.392,78.7643,11.2357,99.9978
560,561,6485,246,3189,38.0811,66.1078,23.8922,99.9962
561,562,41334,1475,3257,220.707,36.7853,53.2147,55.1522
562,563,19094,1184,3266,220.232,1.7402099999999998,88.2598,99.8662
563,564,22580,1862,3246,214.366,1.23747,88.7625,99.7596
564,565,12056,161,3266,213.463,34.8513,55.1487,99.972
565,566,17338,572,3257,205.467,59.8591,30.1409,99.9743
566,567,13879,2581,3248,38.0253,33.4712,56.5288,99.9637
567,568,11043,2879,3249,220.979,57.8068,32.1932,99.969
568,569,6814,1105,3229,33.2798,16.4347,73.5653,99.977
569,570,931,689,3209,206.62,60.4791,29.5209,99.9928
570,571,1701,3186,3247,33.2447,52.6199,37.3801,99.9388
571,572,1826,1779,3217,208.044,42.6178,47.3822,99.9976
572,573,2019,2036,3238,220.115,60.551,29.449,99.8798
573,574,4991,343,3247,212.682,10.2772,79.7228,99.9744
574,575,4592,1301,3246,33.0971,20.3418,69.6582,99.9948
575,576,1058,2305,3224,302.645,86.2839,3.71615,99.9558
576,577,1168,2227,3229,334.226,87.0796,2.92041,99.9846
577,578,3799,906,3237,26.0593,18.0615,71.9385,99.9791
578,579,690,2733,3231,218.066,17.3222,72.6778,99.9989
579,580,2495,56,3257,213.939,30.6126,59.3874,99.7994
580,581,7214,78,3322,215.099,37.7072,52.2928,99.5781
581,582,685,2801,3237,222.445,49.4522,40.5478,99.9969
582,583,18695,430,3323,196.584,59.935,30.065,99.1001
583,584,3671,2165,3258,235.084,21.298,68.702,99.9454
584,585,15824,757,3282,218.133,19.7001,70.2999,99.9323
585,586,546,2355,3232,16.6144,85.7574,4.24261,99.967
586,587,5666,1349,3283,43.8576,81.0814,8.918610000000003,99.9313
587,588,659,982,3245,27.9491,33.3639,56.6361,99.9072
588,589,9798,228,3303,199.235,68.0665,21.9335,99.9404
589,590,6791,2772,3290,29.4396,8.805489999999997,81.1945,99.9374
590,591,5062,2685,3278,211.05,59.049,30.951,99.9907
591,592,1050,1130,3261,29.7188,45.458,44.542,99.9979
592,593,6110,2356,3294,33.6276,46.6522,43.3478,99.9647
593,594,11678,3017,3309,28.2245,31.5355,58.4645,99.5976
594,595,7199,2285,3309,227.781,24.101,65.899,98.8239
595,596,15609,1679,3322,27.2606,23.1768,66.8232,99.9805
596,597,922,652,3270,31.7008,58.1764,31.8236,99.9873
597,598,1055,870,3272,214.377,0.324295,89.6757,97.6318
598,599,14739,2482,3320,40.8021,57.0837,32.9163,99.947
599,600,50111,901,3396,210.946,51.012,38.988,77.6529
600,601,2824,2073,3292,214.159,21.8202,68.1798,99.8364
601,602,8349,309,3342,215.608,23.7439,66.2561,99.9361
602,603,5303,2208,3326,25.9732,37.7856,52.2144,99.9902
603,604,1403,2024,3305,222.381,33.8837,56.1163,99.9951
604,605,11191,2902,3361,221.96400000000003,62.4107,27.5893,99.9594
605,606,2939,1546,3318,202.381,4.95235,85.0477,99.9432
606,607,7417,1894,3331,29.1469,17.4809,72.5191,99.9933
607,608,2925,2134,3317,219.189,66.1081,23.8919,99.9977
608,609,1235,1029,3326,26.939,37.9874,52.0126,99.9851
609,610,10796,2752,3345,218.593,1.65769,88.3423,98.7946
610,611,2283,1807,3330,236.622,71.6252,18.3748,99.9895
611,612,1127,1976,3324,210.756,66.4189,23.5811,99.9821
612,613,986,3148,3327,210.575,1.0573,88.9427,99.9932
613,614,4284,555,3349,214.71,6.27611,83.7239,99.3558
614,615,560,1275,3327,203.946,14.5296,75.4704,99.9846
615,616,6113,1755,3378,26.8364,12.5373,77.4627,99.9608
616,617,2067,2588,3357,215.483,58.846,31.154,99.9879
617,618,3844,670,3367,25.0419,57.1563,32.8437,99.9595
618,619,5066,1069,3371,35.7717,18.3148,71.6852,99.9971
619,620,24355,1205,3429,13.5413,77.9359,12.0641,99.9706
620,621,11289,1330,3393,213.996,18.5741,71.4259,99.8825
621,622,39104,2083,3440,39.7836,7.3387699999999985,82.6612,99.5146
622,623,6296,2433,3377,211.192,60.5715,29.4285,99.9736
623,624,23954,3034,3418,29.4277,40.3551,49.6449,99.9424
624,625,3686,1576,3371,225.855,36.1321,53.8679,99.9751
625,626,3659,564,3386,19.5922,43.755,46.245,99.7927
626,627,2568,2661,3379,27.8771,14.9674,75.0326,99.9961
627,628,4101,202,3386,212.952,52.0787,37.9213,99.993
628,629,10703,2255,3404,201.932,31.2679,58.7321,99.9855
629,630,6216,1871,3391,34.849000000000004,28.3628,61.6372,99.9898
630,631,3228,1612,3399,214.98,63.2874,26.7126,99.9728
631,632,3126,2362,3409,212.165,65.2435,24.7565,99.9834
632,633,4557,2796,3425,31.4995,13.1572,76.8428,99.9688
633,634,790,1510,3402,200.86900000000003,81.9685,8.03151,99.9365
634,635,80099,395,3637,216.779,40.1916,49.8084,68.4306
635,636,528,110,3401,30.482,36.6286,53.3714,99.9568
636,637,13259,240,3474,268.449,84.4622,5.53775,99.8436
637,638,2502,2738,3424,216.761,51.403,38.597,99.9043
638,639,3170,2544,3418,205.079,13.2316,76.7684,99.9964
639,640,1584,1123,3411,233.885,77.3032,12.6968,99.9857
640,641,1629,1003,3417,257.285,84.5471,5.45293,99.982
641,642,3072,2641,3419,214.345,2.04241,87.9576,99.804
642,643,1110,147,3421,32.2631,6.70482,83.2952,99.9605
643,644,5496,513,3436,38.0797,3.94556,86.0544,99.9928
644,645,7065,1429,3458,220.44,81.82600000000002,8.17404,99.5469
645,646,2043,608,3428,207.982,63.0411,26.9589,99.9704
646,647,10013,2438,3458,215.721,33.9174,56.0826,99.9613
647,648,5006,109,3467,218.767,86.35700000000001,3.64296,99.8949
648,649,1874,1518,3438,36.4103,17.9597,72.0403,99.9149
649,650,2312,48,3477,211.614,84.6129,5.38707,99.9374
650,651,6126,1782,3466,225.384,68.0202,21.9798,99.9551
651,652,2289,1859,3438,216.27,18.3374,71.6626,99.998
652,653,7508,1606,3463,26.4937,9.29274,80.7073,99.9953
653,654,1887,2875,3439,32.1218,1.53855,88.4614,99.9194
654,655,8286,3143,3478,33.2487,12.5398,77.4602,99.9535
655,656,4534,2673,3460,29.4383,33.1931,56.8069,99.9683
656,657,22377,829,3513,185.24400000000003,81.7926,8.20745,98.8611
657,658,4262,1098,3464,217.386,13.5793,76.4207,99.9497
658,659,595,1964,3446,33.1987,18.2792,71.7208,98.8034
659,660,1645,1697,3450,35.8319,18.7324,71.2676,99.9511
660,661,5237,2316,3480,38.9827,12.6493,77.3507,99.9558
661,662,1014,905,3453,222.188,63.4457,26.5543,99.9952
662,663,3210,671,3470,46.7173,38.2762,51.7238,99.948
663,664,134829,1302,3769,235.902,73.2622,16.7378,56.7375
664,665,1705,2555,3461,224.802,50.1497,39.8503,99.9608
665,666,17818,1936,3524,31.2947,50.1259,39.8741,70.5756
666,667,551,601,3455,19.9354,52.4841,37.5159,99.997
667,668,14131,2844,3510,38.7483,46.4886,43.5114,99.9593
668,669,1161,2242,3472,234.194,68.7087,21.2913,99.9911
669,670,4110,2595,3500,37.3638,29.3774,60.6226,99.9943
670,671,13995,630,3522,36.0372,2.44458,87.5554,75.115
671,672,1010,1511,3489,221.797,7.47899,82.521,99.8924
672,673,8836,1677,3523,223.131,65.9806,24.0194,99.7991
673,674,17185,2963,3557,214.763,19.8286,70.1714,97.7929
674,675,5936,2711,3513,220.094,60.5232,29.4768,99.918
675,676,2068,144,3507,209.758,24.9742,65.0258,99.7236
676,677,1651,2238,3505,206.123,29.8994,60.1006,99.9748
677,678,17093,2443,3558,207.454,17.0085,72.9915,99.1368
678,679,19550,1561,3568,32.7401,0.515846,89.4842,98.8711
679,680,3565,1071,3525,257.157,80.7255,9.27453,99.4401
680,681,3456,497,3532,30.862,40.2639,49.7361,99.9353
681,682,1369,1416,3518,49.9907,78.5359,11.464,99.7645
682,683,23768,1748,3612,34.706,7.29745,82.7025,99.5787
683,684,924,1856,3525,208.335,74.2707,15.7293,99.6078
684,685,28708,2249,3625,30.1276,23.1797,66.8203,99.8318
685,686,1355,2411,3527,247.063,71.5692,18.4308,99.6832
686,687,1063,1237,3525,205.087,20.2367,69.7633,99.9882
687,688,1944,144,3542,34.3709,31.3236,58.6764,99.981
688,689,607,1132,3532,345.769,69.5764,20.4236,99.9947
689,690,827,2770,3545,33.6859,28.4403,61.5597,99.9555
690,691,1169,3166,3553,19.5462,34.7855,55.2145,96.4187
691,692,991,90,3554,30.0558,43.7031,46.2969,99.9933
692,693,703,58,3554,32.6118,49.2736,40.7264,99.437
693,694,23982,1101,3599,210.145,28.1814,61.8186,99.7071
694,695,8527,3085,3578,209.749,59.6104,30.3896,99.9229
695,696,7756,2613,3612,214.234,8.904860000000003,81.0951,98.8263
696,697,1428,2658,3565,220.147,24.2579,65.7421,99.9936
697,698,1004,743,3559,219.082,52.6074,37.3926,99.9944
698,699,3752,155,3585,25.9938,33.6924,56.3076,99.9941
699,700,953,266,3563,31.7532,5.95708,84.0429,99.9677
700,701,4066,1447,3610,20.006,19.967,70.033,99.8704
701,702,1529,2555,3571,219.31,56.36600000000001,33.634,99.9388
702,703,1373,575,3575,29.52,29.4355,60.5645,99.9951
703,704,5429,2738,3589,50.8251,54.5235,35.4765,99.977
704,705,9528,2067,3593,35.6969,17.7239,72.2761,99.933
705,706,592,207,3569,29.7924,3.62712,86.3729,99.9865
706,707,7950,768,3614,230.388,50.3853,39.6147,99.9938
707,708,5061,46,3651,40.7299,32.0081,57.9919,99.6641
708,709,504,2806,3585,21.5919,62.5675,27.4325,99.9921
709,710,3822,93,3628,39.8639,31.5724,58.4276,99.9024
710,711,21397,255,3715,31.1084,36.6637,53.3363,99.5909
711,712,2837,3154,3617,35.0665,43.1217,46.8783,99.9281
712,713,4808,3018,3620,27.6138,28.3708,61.6292,99.9709
713,714,5519,658,3621,205.604,9.25667,80.7433,99.6451
714,715,978,2528,3620,225.943,47.0219,42.9781,99.9328
715,716,54573,1975,3792,17.236,83.1281,6.8719,96.2548
716,717,7484,2130,3644,217.849,19.4031,70.5969,99.6266
717,718,9363,2836,3654,38.1752,25.7236,64.2764,99.9581
718,719,2645,1515,3623,212.071,11.1194,78.8806,99.9842
719,720,2980,892,3628,219.305,17.7963,72.2037,99.987
720,721,1318,1857,3620,233.749,78.2714,11.7286,99.9937
721,722,9704,2383,3676,218.022,50.9673,39.0327,92.9564
722,723,1017,2489,3630,215.329,5.31548,84.6845,99.991
723,724,2781,165,3642,35.5882,4.58228,85.4177,99.6272
724,725,6642,1076,3669,213.39,0.270966,89.729,99.9897
725,726,2096,515,3634,204.618,13.2125,76.7875,99.9914
726,727,2686,2743,3644,44.0059,54.927,35.073,99.9929
727,728,634,2459,3650,28.7995,29.9104,60.0896,99.9938
728,729,2722,1897,3660,3.05411,77.2283,12.7717,99.9742
729,730,14132,3113,3695,222.224,61.3952,28.6048,99.9507
730,731,68390,916,3854,222.821,19.5233,70.4767,57.5365
731,732,5808,1506,3696,30.2057,78.2001,11.7999,99.9582
732,733,6421,2640,3694,217.315,49.6087,40.3913,99.991
733,734,66723,2826,3809,225.599,63.6683,26.3317,99.5214
734,735,5107,536,3686,223.038,73.4249,16.5751,99.9467
735,736,11028,763,3723,350.31,78.6212,11.3788,99.7793
736,737,3663,745,3675,16.9918,52.3995,37.6005,99.9941
737,738,2695,3005,3688,16.5394,42.32100000000001,47.679,99.9957
738,739,1152,2543,3673,213.156,38.649,51.351000000000006,99.9906
739,740,1430,1819,3671,355.182,76.2323,13.7677,99.9837
740,741,6313,620,3686,206.762,51.1701,38.8299,99.9964
741,742,5153,1579,3699,6.53465,78.0738,11.9262,99.9916
742,743,879,122,3678,33.803000000000004,35.1487,54.8513,99.9914
743,744,1885,2734,3700,30.7889,11.4322,78.5678,99.8004
744,745,1335,1860,3688,222.117,5.37421,84.6258,99.9953
745,746,939,170,3676,34.0867,36.8154,53.1846,99.9967
746,747,2069,2775,3696,206.799,7.93513,82.0649,99.9669
747,748,1979,2691,3711,51.1196,57.4139,32.5861,99.981
748,749,771,203,3691,32.6171,8.89659,81.1034,99.4353
749,750,8746,1756,3748,227.446,30.6076,59.3924,99.9223
750,751,80885,2538,3905,9.45113,84.1205,5.87953,79.1396
751,752,2096,2586,3719,24.2648,19.6124,70.3876,99.9727
752,753,1941,1701,3721,19.9195,77.4713,12.5287,99.9624
753,754,2088,1632,3714,30.9279,2.1937900000000004,87.8062,99.8613
754,755,7230,130,3754,207.366,36.5785,53.4215,99.9799
755,756,5899,2140,3748,212.404,4.20081,85.7992,99.8992
756,757,1888,201,3727,216.281,56.5957,33.4043,99.9986
757,758,7064,1861,3744,42.4435,1.11056,88.8894,99.9875
758,759,623,2964,3725,211.277,15.6154,74.3846,99.9944
759,760,25119,578,3824,211.697,31.6065,58.3935,99.6253
760,761,11289,3056,3794,19.7864,63.2433,26.7567,99.8469
761,762,3020,50,3774,210.804,39.0878,50.9122,99.6156
762,763,760,558,3743,31.6665,7.35873,82.6413,99.8375
763,764,1376,84,3785,206.012,35.2361,54.7639,99.9712
764,765,11853,1641,3824,206.448,4.90896,85.09100000000002,99.7146
765,766,10845,796,3817,5.831930000000002,34.1088,55.8912,99.9918
766,767,3740,1581,3806,356.38199999999995,76.8942,13.1058,99.9896
767,768,737,2587,3770,33.001,21.9922,68.0078,99.9904
768,769,1768,3123,3771,39.5527,9.57924,80.4208,99.9521
769,770,1495,2184,3778,33.4244,22.2526,67.7474,99.9983
770,771,1999,1537,3781,205.873,24.3884,65.6116,99.9965
771,772,6948,698,3809,218.278,8.93972,81.0603,99.9431
772,773,6996,2506,3809,215.651,20.2788,69.7212,99.9899
773,774,2778,317,3794,38.994,5.87709,84.1229,99.9974
774,775,4611,1784,3813,29.9438,4.64582,85.3542,99.9854
775,776,702,1855,3794,246.835,71.1465,18.8535,99.9933
776,777,2387,3171,3823,30.6687,38.1236,51.8764,99.7722
777,778,1630,2286,3823,219.855,48.1571,41.8429,99.8579
778,779,5923,180,3850,206.19,25.0719,64.9281,99.9918
779,780,772,2242,3806,224.782,45.6366,44.3634,99.9957
780,781,2787,119,3837,210.182,18.5848,71.4152,99.7347
781,782,1225,1322,3823,43.1579,12.720999999999998,77.279,99.9907
782,783,4501,2213,3844,309.155,83.3041,6.6958600000000015,99.9657
783,784,5912,2564,3857,215.254,55.0483,34.9517,99.9963
784,785,7138,1527,3896,243.167,75.8612,14.1388,99.9865
785,786,2925,2113,3848,352.622,81.0814,8.918610000000003,99.9591
786,787,548,3147,3861,28.6198,36.2088,53.7912,99.9566
787,788,941,255,3850,206.977,40.8014,49.1986,99.991
788,789,714,1805,3867,235.413,73.2306,16.7694,99.9922
789,790,5743,791,3907,20.1007,35.12,54.88,99.9562
790,791,29266,3070,3948,213.458,10.3282,79.6718,99.9633
791,792,1736,1251,3861,35.1693,62.5174,27.4826,99.9926
792,793,1303,2993,3875,33.2597,14.0821,75.9179,99.9953
793,794,12531,257,3909,219.352,49.5139,40.4861,99.9616
794,795,4638,2291,3891,216.188,57.4053,32.5947,99.9907
795,796,685,1335,3865,24.9509,30.592,59.408,99.9894
796,797,682,40,3876,32.3748,18.0941,71.9059,99.3334
797,798,1007,566,3881,33.0011,24.9348,65.0652,99.9907
798,799,7178,1192,3916,201.96400000000003,14.5406,75.4594,99.9923
799,800,1680,1700,3888,242.267,73.4521,16.5479,99.9959
800,801,868,1778,3878,229.303,33.3806,56.6194,99.9972
801,802,4392,2623,3894,43.465,29.2312,60.7688,99.9985
802,803,518,472,3878,204.157,25.4261,64.5739,99.8165
803,804,3973,125,3908,38.1747,16.3285,73.6715,99.9814
804,805,711,718,3879,52.0295,88.47,1.52995,99.9954
805,806,1820,2508,3892,30.528,44.8986,45.1014,99.9969
806,807,5303,1296,3908,59.5238,71.5604,18.4396,99.9866
807,808,2027,682,3899,226.137,6.99793,83.0021,99.9872
808,809,781,2818,3890,214.501,48.1422,41.8578,99.4011
809,810,2101,2241,3906,240.54,81.4213,8.578669999999999,99.9956
810,811,3486,1738,3918,21.1185,15.472,74.528,99.9918
811,812,1253,1582,3900,242.389,59.6768,30.3232,99.9837
812,813,546,2097,3893,20.5907,13.1012,76.8988,99.9963
813,814,35767,2022,3987,28.9299,44.0217,45.9783,99.7141
814,815,558,1008,3907,20.0952,65.9392,24.0608,99.9919
815,816,1573,84,3934,18.1706,72.9526,17.0474,99.9891
816,817,2276,41,3928,25.3258,77.9928,12.0072,99.956
817,818,1984,2860,3917,225.176,52.8173,37.1827,99.9738
818,819,15815,509,3967,205.035,26.7208,63.2792,99.5346
819,820,2330,486,3917,213.711,7.63945,82.3605,99.9916
820,821,15265,1815,3999,208.507,48.8545,41.1455,96.6331
821,822,2480,1619,3960,220.829,40.696,49.304,99.9815
822,823,1748,1588,3939,205.736,4.16444,85.8356,99.9929
823,824,2170,1676,3945,217.067,59.2757,30.7243,99.9827
824,825,26174,2292,3998,215.49,2.72736,87.2726,98.0146
825,826,7982,691,3969,23.2468,58.0422,31.9578,99.9217
826,827,654,612,3953,17.9312,56.0382,33.9618,99.1644
827,828,1121,1979,3947,218.305,25.3772,64.6228,99.9975
828,829,51797,200,4068,25.8096,17.5801,72.4199,98.1661
829,830,6513,946,4002,209.057,37.0261,52.9739,99.8976
830,831,18212,2953,4054,31.8046,37.1786,52.8214,99.8102
831,832,14562,353,4006,245.241,75.7281,14.2719,99.838
832,833,1300,1326,3967,29.2042,7.55388,82.4461,99.8971
833,834,2190,1537,3979,242.279,63.2442,26.7558,99.9951
834,835,24425,1378,4048,200.814,59.3409,30.6591,69.2566
835,836,10083,1700,4014,220.803,41.849,48.151,99.9139
836,837,768,1041,3986,33.3266,13.2586,76.7414,99.804
837,838,2613,1244,3988,21.5048,33.3766,56.6234,99.9696
838,839,9468,1155,4029,213.35,28.3807,61.6193,96.6832
839,840,906,46,3989,211.36,31.0143,58.9857,99.598
840,841,5608,2785,4019,218.087,23.301,66.699,99.9935
841,842,957,1094,3992,34.6526,13.9157,76.0843,99.9854
842,843,1798,3176,4028,207.33900000000003,60.5698,29.4302,99.8957
843,844,6657,712,4049,221.093,36.047,53.953,99.9556
844,845,15077,1012,4071,15.1142,71.4475,18.5525,99.4235
845,846,70538,563,4158,212.266,13.876,76.124,95.3864
846,847,2738,2091,4032,213.449,13.7359,76.2641,99.9724
847,848,2422,2470,4034,208.778,57.982,32.018,99.9062
848,849,3321,41,4080,26.4637,22.7612,67.2388,99.6783
849,850,9714,3113,4092,40.5295,7.82067,82.1793,99.9459
850,851,1376,1889,4053,211.396,10.8498,79.1502,99.9763
851,852,501,1614,4048,215.63,51.3988,38.6012,99.991
852,853,11476,1555,4133,207.199,6.7664300000000015,83.2336,99.9108
853,854,1716,2816,4074,27.9138,54.2669,35.7331,99.9861
854,855,34557,2504,4170,30.601,48.7388,41.2612,87.0245
855,856,1482,2074,4077,32.1508,4.17976,85.8202,99.9343
856,857,1116,2198,4070,222.86900000000003,53.4167,36.5833,99.9823
857,858,12103,2713,4111,21.56,55.5254,34.4746,99.9851
858,859,8512,1275,4112,28.8478,10.3355,79.6645,99.9321
859,860,18223,2297,4123,44.0526,54.0277,35.9723,99.9283
860,861,1584,415,4089,23.5079,51.8309,38.1691,99.9698
861,862,3530,1660,4086,223.959,53.7935,36.2065,99.9389
862,863,33360,2111,4211,32.6652,52.6924,37.3076,99.8456
863,864,19564,1119,4153,209.274,39.964,50.036,99.8057
864,865,2528,1774,4095,40.6503,10.9892,79.0108,99.9747
865,866,637,929,4085,239.896,54.0484,35.9516,99.9858
866,867,525,2897,4075,34.8421,0.270004,89.73,99.995
867,868,18442,1971,4180,231.403,75.2505,14.7495,88.4292
868,869,911,1371,4096,22.5156,32.8484,57.1516,99.9933
869,870,602,2052,4093,208.353,38.049,51.951,99.9913
870,871,2065,750,4104,30.3985,0.407135,89.5929,99.7634
871,872,1150,1723,4101,217.219,1.47517,88.5248,99.9863
872,873,1656,2866,4099,31.7506,54.9611,35.0389,99.3622
873,874,1010,2806,4111,215.049,22.2478,67.7522,99.9874
874,875,2442,2035,4121,29.1499,43.9274,46.0726,99.9594
875,876,516,2475,4109,24.338,84.0425,5.95748,99.9872
876,877,41830,2954,4242,32.7077,51.7499,38.2501,85.7281
877,878,15170,901,4179,217.718,82.476,7.5239699999999985,65.3221
878,879,577,1818,4120,204.421,15.6484,74.3516,99.9865
879,880,12538,1863,4187,33.9522,15.7598,74.2402,99.9329
880,881,3520,1656,4141,214.5,56.3107,33.6893,99.9957
881,882,3399,2649,4151,206.153,5.27792,84.7221,99.983
882,883,14056,1436,4223,206.96400000000003,3.81231,86.1877,98.7939
883,884,3014,2840,4145,315.874,79.4365,10.5635,99.9763
884,885,2388,1756,4146,209.265,23.0895,66.9105,99.936
885,886,562,1703,4142,32.2438,19.2558,70.7442,99.995
886,887,3332,1468,4160,221.161,28.5027,61.4973,99.9943
887,888,1556,2778,4171,220.443,5.57706,84.4229,99.9679
888,889,1842,3056,4166,22.7657,19.5569,70.4431,99.9523
889,890,663,2220,4164,45.9667,60.488,29.512,99.9606
890,891,9050,167,4197,214.86,1.50954,88.4905,99.9856
891,892,6744,1002,4192,23.958,56.5855,33.4145,99.9884
892,893,2498,3124,4182,217.868,69.7781,20.2219,99.9825
893,894,966,56,4187,46.2336,33.3754,56.6246,99.5602
894,895,8305,346,4210,209.057,12.1205,77.8795,99.8678
895,896,10218,1327,4210,31.2587,73.4817,16.5183,99.9941
896,897,2054,286,4193,217.625,15.9039,74.0961,99.9943
897,898,12044,1801,4247,29.1163,59.8023,30.1977,99.9345
898,899,2288,637,4193,219.865,66.7698,23.2302,99.997
899,900,3963,1661,4194,38.4004,65.1772,24.8228,99.9585
900,901,1861,684,4221,337.926,84.37799999999999,5.62199,99.9413
901,902,2889,2784,4220,216.795,20.5527,69.4473,99.9766
902,903,6639,752,4215,209.096,1.65075,88.3493,99.9835
903,904,9285,1220,4228,36.0028,3.00565,86.9943,99.9654
904,905,4380,2721,4213,34.2299,65.4715,24.5285,99.9975
905,906,1728,2651,4210,25.9907,40.7996,49.2004,99.9957
906,907,9165,1597,4240,27.6204,4.3276900000000005,85.6723,99.9192
907,908,638,2169,4204,25.7967,43.57,46.43,99.9917
908,909,1204,3165,4218,233.723,46.1907,43.8093,99.9249
909,910,1273,1133,4220,45.8433,89.1851,0.814934,99.9975
910,911,10764,2286,4255,231.319,54.3855,35.6145,99.9911
911,912,1805,252,4234,214.932,3.45989,86.5401,99.9953
912,913,55179,2410,4344,29.8739,46.1014,43.8986,99.2402
913,914,3814,115,4259,212.76,1.47788,88.5221,99.9779
914,915,3207,3107,4256,229.425,43.8452,46.1548,99.9503
915,916,29747,830,4308,37.7409,8.40987,81.5901,99.7941
916,917,3265,2196,4257,217.079,20.2452,69.7548,99.9924
917,918,1979,2637,4245,37.5968,66.8388,23.1612,99.9892
918,919,27136,1647,4334,216.694,16.9965,73.0035,99.981
919,920,708,400,4249,211.035,71.2917,18.7083,99.9787
920,921,17547,652,4307,37.6221,5.63171,84.3683,99.9872
921,922,2378,3154,4296,233.665,44.8967,45.1033,99.9366
922,923,733,219,4260,223.584,74.3719,15.6281,99.9915
923,924,22459,2677,4331,31.8063,4.873480000000002,85.1265,99.9777
924,925,3904,1094,4289,29.9922,45.0565,44.9435,99.9618
925,926,1872,1151,4295,95.8257,87.9584,2.04162,99.9902
926,927,34950,1029,4371,222.509,27.812,62.188,99.9083
927,928,7864,296,4304,215.499,54.7956,35.2044,99.9969
928,929,9095,390,4332,26.6475,2.38055,87.6194,69.3763
929,930,3605,2787,4306,213.645,31.1524,58.8476,99.9934
930,931,8098,1349,4321,223.49400000000003,27.0274,62.9726,99.9762
931,932,12638,1226,4335,37.2631,17.2049,72.7951,99.9087
932,933,8780,2892,4362,359.022,79.932,10.068,99.8932
933,934,1317,450,4284,24.8018,30.9924,59.0076,99.9837
934,935,14369,152,4328,41.5382,46.9051,43.0949,99.9695
935,936,1573,2173,4306,209.246,30.6632,59.3368,99.9845
936,937,14606,1465,4340,209.598,18.9301,71.0699,99.957
937,938,1295,43,4309,226.896,10.1772,79.8228,98.7493
938,939,587,1284,4295,210.272,23.4746,66.5254,99.9964
939,940,2197,1776,4311,35.8786,56.215,33.785,99.9902
940,941,31332,3081,4436,219.629,61.974,28.026,99.8344
941,942,27019,1899,4366,221.476,29.822,60.178,99.8676
942,943,1505,2909,4328,215.703,64.3233,25.6767,99.4229
943,944,5642,323,4388,214.92,55.3826,34.6174,99.972
944,945,6638,2127,4362,220.755,37.7516,52.2484,99.954
945,946,2170,2078,4349,45.8109,59.7924,30.2076,99.9968
946,947,18179,2864,4433,209.837,54.5237,35.4763,99.6042
947,948,1122,2228,4370,209.632,37.8796,52.1204,99.9627
948,949,4019,555,4392,17.7355,75.3602,14.6398,99.8415
949,950,6576,664,4401,214.397,10.6181,79.3819,99.5487
950,951,3528,1344,4406,212.815,16.2372,73.7628,99.4425
951,952,5636,217,4392,272.12,80.9447,9.05527,99.9803
952,953,3347,476,4394,29.7263,76.2032,13.7968,99.9857
953,954,15229,2148,4445,35.4516,75.7225,14.2775,99.6629
954,955,12823,2569,4438,34.9153,64.2675,25.7325,99.9028
955,956,7407,1492,4421,207.249,26.638,63.362,99.9714
956,957,1379,1419,4405,23.2672,35.7394,54.2606,97.2896
957,958,2131,1692,4408,222.468,11.7934,78.2066,99.9883
958,959,7260,1227,4426,36.2545,18.3535,71.6465,99.993
959,960,5239,834,4421,19.8621,56.9746,33.0254,99.9546
960,961,12332,1682,4454,32.9164,61.6571,28.3429,99.8146
961,962,1436,1561,4432,33.3433,67.6133,22.3867,99.9676
962,963,2027,591,4436,211.018,40.0091,49.9909,99.9755
963,964,3660,2033,4431,40.1146,57.3381,32.6619,99.941
964,965,1279,2249,4431,33.0825,75.405,14.595,99.9895
965,966,2311,427,4433,204.126,41.9083,48.0917,99.8237
966,967,1086,2479,4442,214.843,21.809,68.191,99.9925
967,968,3027,2665,4460,207.162,8.35567,81.6443,99.9841
968,969,5534,2732,4460,202.331,12.5958,77.4042,99.9227
969,970,1227,749,4445,208.781,40.1989,49.8011,99.9356
970,971,2739,129,4457,248.457,80.5827,9.41734,99.8894
971,972,725,689,4441,226.267,10.481,79.51899999999998,99.9929
972,973,784,333,4444,213.347,56.3107,33.6893,99.9107
973,974,961,2292,4449,33.2818,2.5937,87.4063,99.9721
974,975,1592,1015,4451,35.4742,27.972,62.028,99.9348
975,976,2652,1911,4470,30.2684,39.912,50.088,63.4261
976,977,1306,512,4448,228.193,80.5237,9.47633,99.991
977,978,766,2018,4449,205.087,26.322,63.678,99.9949
978,979,994,2795,4458,209.71,53.2299,36.7701,99.9765
979,980,586,1315,4460,221.638,28.863000000000003,61.137,99.9523
980,981,952,804,4469,27.3177,65.1397,24.8603,99.8295
981,982,577,862,4465,21.7297,58.0692,31.9308,99.9337
982,983,760,2845,4463,200.672,11.4866,78.5134,99.9616
983,984,796,730,4470,201.094,42.4245,47.5755,99.3025
984,985,984,1448,4483,226.507,32.4081,57.5919,98.5963
985,986,812,648,4471,237.24400000000003,17.357,72.643,98.816
986,987,1067,1497,4479,207.829,26.1951,63.8049,98.9722
987,988,1279,1533,4494,209.368,17.6609,72.3391,99.3871
988,989,747,1550,4471,36.7411,70.578,19.422,99.967
989,990,1208,587,4476,217.296,43.201,46.799,99.8839
990,991,950,483,4474,222.749,78.2493,11.7507,99.9033
991,992,1197,1280,4486,33.4079,44.2767,45.7233,99.579
992,993,675,1356,4481,51.5219,53.9783,36.0217,99.8051
993,994,515,2035,4486,230.275,35.035,54.965,99.3056
994,995,915,2010,4492,213.533,19.0895,70.9105,99.7513
995,996,2383,2394,4486,36.6388,6.5937800000000015,83.4062,99.0018
996,997,516,1419,4484,217.391,25.1911,64.8089,99.5208
997,998,3343,2523,4503,45.0151,68.2901,21.7099,99.913
998,999,526,969,4488,51.5047,29.1223,60.8777,99.6113
999,1000,781,2624,4504,218.35,14.1302,75.8698,99.9358
1000,1001,649,1767,4498,222.253,35.148,54.852,99.6204
