,Grain No.,Size [Pixel],center x-coordinate,center y-coordinate,mean azimuth [degree],mean latitude [degree],mean colatitude [degree],Regelungsgrad [%]
0,1,1030,190,222,254.478,1.9786,88.0214,99.963
1,2,612,674,231,86.09299999999998,51.5939,38.4061,99.9666
2,3,103684,730,338,86.1747,51.7583,38.2417,99.9798
3,4,11216,438,363,254.459,3.03511,86.9649,99.8321
4,5,2626,176,306,254.85,2.72033,87.2797,99.9431
5,6,4981,1173,300,254.451,52.9106,37.0894,99.945
6,7,3737,1362,296,249.052,74.1026,15.8974,99.9529
7,8,36715,1592,342,262.807,17.4473,72.5527,99.9664
8,9,4189,1078,323,260.29200000000003,42.3765,47.6235,99.9663
9,10,2405,1276,287,259.316,51.3666,38.6334,99.9848
10,11,16701,1803,349,252.731,72.881,17.119,99.9914
11,12,11167,1933,331,77.0956,33.6459,56.3541,99.9853
12,13,49005,2241,353,77.6758,0.342056,89.6579,99.8588
13,14,3850,365,337,81.7432,45.3283,44.6717,99.9824
14,15,652,2578,311,258.14,6.9505300000000005,83.0495,99.9777
15,16,7350,302,369,257.079,52.7058,37.2942,99.9894
16,17,3941,2825,332,259.921,0.8216479999999999,89.1784,99.9908
17,18,105581,3041,479,256.212,4.3359,85.6641,99.9727
18,19,1425,2517,344,75.8824,27.1926,62.8074,99.9354
19,20,7139,2929,388,261.091,40.8395,49.1605,99.9844
20,21,5034,1256,346,244.14,73.0542,16.9458,99.9431
21,22,4108,2740,354,79.4197,51.9434,38.0566,99.9947
22,23,1980,1408,367,257.825,51.1677,38.8323,99.9742
23,24,7317,2544,414,84.0661,9.2928,80.7072,99.9711
24,25,648,2666,382,231.807,74.6833,15.3167,99.9921
25,26,57511,1149,471,260.253,54.5263,35.4737,99.8399
26,27,14246,1975,439,80.2554,5.5266199999999985,84.4734,99.9273
27,28,27445,1481,477,85.977,53.3497,36.6503,99.8887
28,29,537,2867,405,275.171,7.0373600000000005,82.9626,99.9341
29,30,32317,2369,636,72.4098,25.8639,64.1361,99.869
30,31,849,2762,448,275.73,3.81727,86.1827,99.9572
31,32,1977,2665,448,265.589,2.88731,87.1127,99.9495
32,33,546,746,437,94.9077,58.0852,31.9148,99.2682
33,34,1402,2156,447,83.1665,25.7893,64.2107,99.982
34,35,52026,384,547,258.106,31.9231,58.0769,99.9787
35,36,740,3308,467,255.365,3.9587,86.0413,99.9384
36,37,631,170,452,253.694,3.65166,86.3483,99.9165
37,38,13749,781,509,71.7257,33.1679,56.8321,99.9805
38,39,4035,2233,475,77.8527,9.02308,80.9769,99.9538
39,40,746,1641,455,93.4596,54.215,35.785,99.8856
40,41,1134,915,481,266.92400000000004,50.9189,39.0811,99.9212
41,42,634,887,477,276.26,54.74100000000001,35.259,99.918
42,43,2488,2116,486,83.6158,20.5982,69.4018,99.8836
43,44,3303,2411,499,272.719,7.90124,82.0988,99.9775
44,45,8091,1772,507,75.4791,30.1703,59.8297,99.9784
45,46,1043,540,489,79.5543,7.75778,82.2422,99.9894
46,47,7333,1890,539,82.9061,28.7073,61.2927,99.9149
47,48,20626,2626,576,253.146,53.0608,36.9392,99.9779
48,49,135785,485,806,80.4253,32.2736,57.7264,99.9474
49,50,2970,2036,523,85.0852,29.2744,60.7256,99.967
50,51,514,2486,516,271.58,7.9866800000000016,82.0133,99.9828
51,52,7127,1622,567,264.418,9.42575,80.5742,99.9385
52,53,713,2162,526,81.1347,22.0077,67.9923,99.8534
53,54,14834,2212,602,260.772,9.72392,80.2761,99.9201
54,55,15342,1362,626,247.997,38.3402,51.6598,99.9275
55,56,1493,2090,553,256.515,40.8273,49.1727,99.9512
56,57,8760,1021,599,268.543,52.6548,37.3452,99.9441
57,58,1481,3285,568,255.026,53.3227,36.6773,99.9525
58,59,7530,893,582,250.991,23.3068,66.6932,99.9844
59,60,762,2509,563,275.166,7.86776,82.1322,99.9704
60,61,17672,3190,634,61.059,66.8885,23.1115,99.9838
61,62,2639,1844,592,73.7772,35.9023,54.0977,99.9737
62,63,1085,1788,596,67.7876,18.1834,71.8166,99.7845
63,64,790,2972,597,260.076,2.00571,87.9943,99.7318
64,65,11294,748,658,83.0685,27.7784,62.2216,99.9646
65,66,667,1715,596,69.5895,16.5013,73.4987,99.9532
66,67,21100,1197,662,256.16700000000003,7.37131,82.6287,99.9455
67,68,32146,1583,685,80.5248,41.7246,48.2754,99.8079
68,69,926,804,614,77.1112,33.3259,56.6741,99.9958
69,70,6038,2860,661,82.1379,4.7067,85.2933,99.9873
70,71,9642,2140,685,257.745,12.1747,77.8253,99.9483
71,72,8061,261,745,238.031,68.1678,21.8322,99.9841
72,73,2592,1861,661,237.762,48.537,41.463,99.9623
73,74,1121,3291,651,255.148,53.6335,36.3665,99.9798
74,75,4068,863,665,249.27,27.3014,62.6986,99.996
75,76,12838,975,705,74.8064,28.1492,61.8508,99.9389
76,77,8746,1806,699,239.605,47.0593,42.9407,99.977
77,78,4115,567,674,81.5166,45.4034,44.5966,99.9765
78,79,2004,1983,679,85.4064,24.0286,65.9714,99.8504
79,80,569,2809,696,272.516,86.051,3.94901,99.9395
80,81,1219,152,707,243.792,69.4156,20.5844,99.936
81,82,6067,3045,703,75.8213,60.0776,29.9224,99.9925
82,83,810,2030,700,258.35200000000003,18.065,71.935,99.9895
83,84,582,2792,722,170.97,88.1251,1.87492,99.9519
84,85,12055,2521,754,234.384,26.6819,63.3181,99.9774
85,86,3715,833,729,63.4394,50.1805,39.8195,99.9974
86,87,646,3289,712,254.33,53.4854,36.5146,99.9706
87,88,19214,3165,771,255.708,53.1715,36.8285,99.9652
88,89,4891,1603,739,69.8778,19.1464,70.8536,99.9977
89,90,4040,1306,751,255.252,30.2877,59.7123,99.9915
90,91,5325,1075,756,255.043,69.7057,20.2943,99.96
91,92,29528,1867,838,76.1407,32.0087,57.9913,99.7369
92,93,49359,2936,893,214.851,72.2772,17.7228,99.9778
93,94,3150,735,758,255.845,8.01141,81.9886,99.9924
94,95,10907,2052,792,94.0538,9.503,80.497,99.955
95,96,1384,1508,748,256.86,49.5178,40.4822,99.8838
96,97,3275,1198,770,252.957,50.2335,39.7665,99.8876
97,98,570,2319,743,257.825,10.2711,79.7289,99.996
98,99,10352,1413,806,244.857,39.9892,50.0108,99.9318
99,100,190203,786,1032,76.3979,56.0483,33.9517,99.8864
100,101,3437,801,794,74.6005,7.42022,82.5798,99.9907
101,102,3606,1306,817,254.654,51.3777,38.6223,99.8713
102,103,5307,1034,813,80.5584,75.6287,14.3713,99.9187
103,104,1621,2314,802,95.8244,9.96989,80.0301,99.6177
104,105,745,2640,792,267.535,44.5442,45.4558,99.9605
105,106,4287,1578,809,82.9458,41.4411,48.5589,99.9148
106,107,13613,2227,858,79.0406,35.386,54.614,99.9854
107,108,11362,1152,846,253.034,11.5022,78.4978,99.991
108,109,41155,2743,954,255.1,50.874,39.126,99.7108
109,110,2709,2144,825,263.525,36.9286,53.0714,99.9905
110,111,6783,1506,861,254.157,45.9417,44.0583,99.9622
111,112,2033,1659,848,268.817,0.746498,89.2535,99.9781
112,113,3463,1724,855,81.1694,40.0872,49.9128,99.8712
113,114,21137,2074,923,266.461,39.511,50.489,99.9593
114,115,13207,3142,931,75.4161,19.2804,70.7196,99.984
115,116,10504,1574,929,82.4335,0.5805739999999999,89.4194,99.947
116,117,9213,1284,937,257.039,29.6706,60.3294,99.9786
117,118,18626,1422,969,91.2094,19.6485,70.3515,99.9485
118,119,6121,1687,925,266.333,5.53374,84.4663,99.9911
119,120,49239,2372,1007,88.0181,14.0679,75.9321,99.9571
120,121,838,3048,945,247.83,80.6032,9.39684,99.9762
121,122,9216,1154,985,259.132,29.6907,60.3093,99.9853
122,123,91846,3172,1159,79.656,16.6193,73.3807,99.9495
123,124,23563,1869,1078,246.342,38.5833,51.4167,99.9307
124,125,14387,1639,1041,86.9941,11.6752,78.3248,99.9768
125,126,31403,1730,1139,264.695,21.9373,68.0627,99.9807
126,127,7472,1341,1064,75.893,38.0079,51.9921,99.9735
127,128,11076,2073,1065,250.671,14.684,75.316,99.9699
128,129,2449,2827,1029,266.534,17.4909,72.5091,99.9756
129,130,11888,2561,1082,258.346,41.7588,48.2412,99.9889
130,131,2465,273,1057,83.484,36.3423,53.6577,99.9733
131,132,25989,1514,1122,84.8407,13.6177,76.3823,99.876
132,133,16077,2185,1141,78.6537,38.3581,51.6419,99.9812
133,134,9286,1049,1119,93.7011,38.0452,51.9548,99.9505
134,135,72395,339,1230,242.524,70.2418,19.7582,99.9692
135,136,7550,484,1141,84.2149,6.20625,83.7938,99.8862
136,137,94934,2880,1281,255.31,22.6371,67.3629,99.9855
137,138,42382,1258,1209,258.19,21.0899,68.9101,99.967
138,139,6754,1981,1123,78.1892,2.67966,87.3203,99.95
139,140,7859,2475,1145,77.1798,62.2779,27.7221,99.8139
140,141,3256,161,1147,248.722,70.7889,19.2111,99.9644
141,142,32283,2657,1236,68.6805,33.9968,56.0032,99.8907
142,143,11172,2373,1193,73.154,34.7442,55.2558,99.984
143,144,619,2058,1149,242.404,25.5538,64.4462,99.7971
144,145,3230,1103,1180,102.254,71.8252,18.1748,99.9947
145,146,8639,1393,1240,250.425,22.2278,67.7722,99.8137
146,147,2243,1426,1190,265.633,24.8007,65.1993,99.9922
147,148,5850,977,1223,85.3639,38.6412,51.3588,99.8707
148,149,514,2080,1191,242.145,24.7892,65.2108,99.9874
149,150,39587,2273,1314,260.487,29.8992,60.1008,99.9892
150,151,2785,2003,1216,72.9193,28.5938,61.4062,99.8581
151,152,1069,1060,1220,264.205,70.9819,19.0181,99.9918
152,153,1153,2096,1222,74.6259,31.873,58.127,99.9172
153,154,7531,2499,1256,255.113,42.5714,47.4286,99.9761
154,155,29068,1561,1311,87.7822,38.3984,51.6016,99.9118
155,156,51993,1789,1393,110.452,17.1957,72.8043,99.952
156,157,12056,1140,1287,86.149,42.8684,47.1316,99.9419
157,158,4513,1996,1263,249.985,22.6901,67.3099,99.9864
158,159,19066,888,1336,268.493,16.4191,73.5809,99.8906
159,160,1014,2442,1272,92.3841,24.5714,65.4286,99.9716
160,161,3292,3078,1307,80.2484,0.758583,89.2414,99.9874
161,162,2187,712,1312,269.52,16.2389,73.7611,99.9815
162,163,922,1933,1296,274.99,74.5224,15.4776,99.9301
163,164,27811,2106,1412,280.495,70.7881,19.2119,99.9156
164,165,60096,655,1460,80.6199,23.8322,66.1678,99.9714
165,166,893,1997,1329,260.011,76.7608,13.2392,99.8773
166,167,529,1017,1332,71.0522,51.7033,38.2967,99.5217
167,168,1543,3284,1346,224.354,72.6251,17.3749,99.8289
168,169,8112,457,1386,257.268,33.0381,56.9619,99.9622
169,170,31387,219,1492,76.7204,1.18016,88.8198,99.8733
170,171,59037,2689,1515,252.787,11.4174,78.5826,99.9661
171,172,16497,1375,1433,84.6306,10.9339,79.0661,99.9218
172,173,4565,3034,1416,81.4871,63.0982,26.9018,99.8701
173,174,21030,1108,1419,263.486,14.3312,75.6688,99.9583
174,175,1436,2519,1371,80.1236,20.2375,69.7625,99.8881
175,176,2064,1206,1382,259.011,10.1413,79.8587,99.9942
176,177,2372,987,1386,92.2756,39.7844,50.2156,99.8398
177,178,6103,1929,1419,89.2271,10.9307,79.0693,99.9389
178,179,530,1877,1432,111.402,16.3332,73.6668,99.8018
179,180,9119,335,1456,259.475,82.9409,7.05912,99.9432
180,181,17156,1237,1480,273.43,36.2574,53.7426,99.9873
181,182,899,3176,1403,77.2606,28.5107,61.4893,99.9942
182,183,15788,1512,1470,265.243,18.8909,71.1091,99.9152
183,184,878,3244,1419,76.8105,67.4003,22.5997,99.874
184,185,7452,1002,1473,263.362,59.6226,30.3774,99.9333
185,186,2656,3089,1456,263.67,11.6469,78.3531,99.9756
186,187,1164,3255,1446,75.5151,67.9776,22.0224,99.9361
187,188,225717,886,1926,252.463,44.6894,45.3106,100.031
188,189,63134,2493,1625,73.403,60.812,29.188,99.9035
189,190,29501,1567,1608,276.596,46.7597,43.2403,99.9637
190,191,3473,3160,1485,75.7991,35.2206,54.7794,99.9731
191,192,2659,1660,1506,261.181,24.6683,65.3317,99.94
192,193,10736,407,1553,250.779,25.2866,64.7134,99.6855
193,194,2976,3035,1505,81.8642,65.9564,24.0436,99.9874
194,195,5553,3249,1507,261.505,4.54222,85.4578,99.9718
195,196,954,497,1493,92.8458,30.5947,59.4053,99.5076
196,197,617,465,1518,87.4793,31.9488,58.0512,99.7486
197,198,2407,1970,1538,80.854,22.1474,67.8526,99.9342
198,199,8086,1396,1575,274.91700000000003,41.3683,48.6317,99.9886
199,200,10431,1706,1607,90.2758,8.618260000000001,81.3817,99.9835
200,201,23703,2908,1627,255.883,57.0584,32.9416,99.9333
201,202,758,2220,1536,252.571,17.2315,72.7685,99.9832
202,203,642,3000,1550,260.934,53.4756,36.5244,99.8223
203,204,1354,484,1571,79.8222,23.3249,66.6751,99.8555
204,205,14411,1205,1622,248.713,31.9155,58.0845,97.0992
205,206,1346,2193,1574,251.968,18.3513,71.6487,99.8658
206,207,1396,2149,1569,262.111,11.4713,78.5287,99.9777
207,208,93040,1291,1775,269.107,13.9898,76.0102,99.8635
208,209,27846,1836,1718,109.926,29.2969,60.7031,99.696
209,210,20904,3119,1634,77.3059,66.3309,23.6691,99.9701
210,211,6675,3240,1612,64.1606,65.9479,24.0521,99.9019
211,212,18598,299,1663,78.2901,34.8773,55.1227,99.9916
212,213,2565,2067,1604,81.9424,21.0677,68.9323,99.9688
213,214,1140,1094,1595,79.4257,56.9742,33.0258,99.9787
214,215,578,2221,1607,74.6183,39.7963,50.2037,99.9795
215,216,559,746,1616,252.7,13.1671,76.8329,99.9849
216,217,1937,2004,1628,79.9042,19.7857,70.2143,99.9474
217,218,5025,2265,1658,80.278,22.1665,67.8335,99.9764
218,219,660,1892,1620,109.094,17.1677,72.8323,99.9895
219,220,566,2330,1625,89.4402,26.4949,63.5051,99.9909
220,221,14941,648,1674,252.862,45.3388,44.6612,99.9951
221,222,649,2174,1627,79.6411,19.1558,70.8442,99.9167
222,223,9516,2074,1672,291.564,75.7369,14.2631,99.9809
223,224,567,556,1637,249.658,27.1801,62.8199,99.989
224,225,47743,544,1822,82.5202,30.1173,59.8827,99.8215
225,226,2562,2193,1676,78.982,20.8125,69.1875,99.9439
226,227,6161,142,1744,251.048,28.0014,61.9986,99.7824
227,228,3328,401,1716,79.0612,47.7139,42.2861,99.991
228,229,7037,738,1749,85.7417,1.22286,88.7771,99.9737
229,230,6264,2738,1720,240.884,42.1177,47.8823,99.9964
230,231,4874,584,1749,81.3729,23.7271,66.2729,99.9545
231,232,1415,209,1737,241.969,35.6932,54.3068,99.9768
232,233,2977,2317,1735,261.823,8.81429,81.1857,99.9759
233,234,25534,2827,1824,76.4928,44.6587,45.3413,99.9693
234,235,11143,3065,1778,268.807,60.8349,29.1651,99.9182
235,236,14609,1673,1813,255.414,16.3214,73.6786,99.961
236,237,12949,3206,1770,75.0037,14.0011,75.9989,99.9692
237,238,2579,2238,1769,78.9746,45.3234,44.6766,99.8354
238,239,4574,2970,1798,270.416,61.0008,28.9992,99.9676
239,240,12294,303,1800,79.069,10.9771,79.0229,99.9905
240,241,35419,2689,1907,257.004,35.8914,54.1086,99.972
241,242,109152,2281,2053,73.9467,43.1884,46.8116,99.6527
242,243,2722,1601,1816,79.0906,17.2072,72.7928,99.9954
243,244,5908,1314,1832,281.29200000000003,43.533,46.467,99.9117
244,245,23123,2229,1893,81.6255,56.3557,33.6443,99.8586
245,246,19864,1962,1947,82.0366,53.9311,36.0689,99.8778
246,247,6102,1410,1869,260.555,46.3083,43.6917,99.9909
247,248,3338,730,1862,267.253,0.197144,89.8029,99.9912
248,249,584,222,1851,254.748,69.1834,20.8166,99.9677
249,250,11642,3220,1887,76.3899,3.70325,86.2967,99.9734
250,251,2500,2136,1868,83.5619,54.1288,35.8712,99.9577
251,252,890,1737,1859,267.436,32.9818,57.0182,99.9714
252,253,781,133,1869,252.536,27.35,62.65,99.6628
253,254,9612,2987,1895,81.9497,2.92302,87.07700000000001,99.9568
254,255,3674,404,1895,74.9373,19.3334,70.6666,99.8538
255,256,14733,3069,1960,237.361,75.4704,14.5296,99.9705
256,257,11282,1599,1952,96.5758,49.6892,40.3108,99.9759
257,258,6521,1327,1927,270.336,34.2569,55.7431,99.9653
258,259,609,1820,1903,274.261,0.440277,89.5597,99.2724
259,260,2571,1728,1937,269.47700000000003,31.7205,58.2795,99.8972
260,261,7784,2566,1949,100.495,24.7509,65.2491,99.93
261,262,30566,253,1986,260.281,18.5616,71.4384,99.7429
262,263,1242,126,1920,81.4014,24.5724,65.4276,99.9183
263,264,7074,1444,1952,261.66900000000004,5.61141,84.3886,99.9347
264,265,27670,690,2034,242.375,64.5448,25.4552,99.963
265,266,607,2325,1932,70.1699,46.0304,43.9696,99.8072
266,267,717,2083,1941,97.8141,1.42834,88.5717,99.9786
267,268,11092,3190,2034,87.3461,48.6329,41.3671,99.9479
268,269,5269,2932,1971,86.611,47.916,42.084,99.946
269,270,682,1847,1952,94.8177,0.671371,89.3286,99.9531
270,271,4649,446,1962,263.54400000000004,21.5303,68.4697,99.9598
271,272,69576,1907,2162,271.715,25.2116,64.7884,99.9114
272,273,5453,3251,1999,250.963,54.264,35.736,99.9755
273,274,104897,2874,2246,259.24,40.3104,49.6896,99.9433
274,275,8051,1704,2063,79.414,7.60502,82.395,99.8921
275,276,24489,388,2139,64.0016,84.6169,5.38314,99.9549
276,277,93894,1449,2181,266.159,13.4176,76.5824,99.8144
277,278,1481,568,2014,81.3839,29.7787,60.2213,99.91
278,279,3018,473,2029,58.0539,78.9045,11.0955,99.8895
279,280,100345,2618,2236,257.994,12.2478,77.7522,99.9315
280,281,622,1652,2043,81.7839,5.41151,84.5885,99.7442
281,282,58468,3087,2218,264.688,33.6908,56.3092,99.9861
282,283,1622,1058,2050,270.598,23.2503,66.7497,99.9863
283,284,3929,515,2085,84.3798,20.475,69.525,99.9796
284,285,1743,124,2092,259.17,22.0985,67.9015,99.9573
285,286,1593,2467,2093,73.8445,40.3859,49.6141,99.9317
286,287,1261,1272,2085,252.002,46.161,43.839,99.9779
287,288,3433,1187,2091,270.04,13.2217,76.7783,99.9923
288,289,29013,1063,2177,281.995,43.3449,46.6551,99.9605
289,290,13626,1650,2195,271.72900000000004,24.1814,65.8186,99.9697
290,291,790,3277,2113,102.929,19.9925,70.0075,99.9505
291,292,1697,209,2136,260.432,20.2195,69.7805,99.7551
292,293,2898,123,2204,258.652,21.8872,68.1128,99.9543
293,294,2737,1228,2155,83.9667,52.5523,37.4477,99.8806
294,295,4169,518,2159,253.86,30.0775,59.9225,99.9378
295,296,574,2505,2169,262.455,38.6283,51.3717,99.9804
296,297,650,189,2184,257.905,21.5757,68.4243,99.9792
297,298,12263,255,2257,87.624,8.08608,81.9139,99.9815
298,299,41346,493,2313,257.497,24.1291,65.8709,99.9079
299,300,3678,1269,2242,87.242,53.0406,36.9594,99.9349
300,301,18749,1137,2313,276.158,39.2981,50.7019,99.9533
301,302,27052,2199,2324,255.255,10.3177,79.6823,99.8659
302,303,754,1713,2232,81.7016,44.2246,45.7754,99.9837
303,304,517,326,2222,54.655,84.9985,5.00149,99.9925
304,305,12450,3223,2313,256.616,46.9303,43.0697,99.9568
305,306,1458,1226,2281,248.269,58.69600000000001,31.304,99.9635
306,307,19436,1782,2345,246.961,17.114,72.88600000000002,99.9592
307,308,2450,959,2283,82.7887,18.2957,71.7043,99.8709
308,309,766,1701,2281,72.9669,11.8824,78.1176,99.9549
309,310,13590,192,2366,257.843,21.237,68.763,99.9698
310,311,1390,2421,2292,81.4847,14.2722,75.7278,99.9346
311,312,9237,1928,2356,118.937,84.3143,5.68574,99.9521
312,313,18967,676,2393,66.8407,63.9184,26.0816,99.9784
313,314,14274,1591,2373,260.075,22.0228,67.9772,99.9274
314,315,1493,1014,2337,270.54400000000004,22.7817,67.2183,99.9571
315,316,18582,2427,2416,63.18600000000001,76.5793,13.4207,99.9265
316,317,1315,1285,2344,85.95299999999997,23.8962,66.1038,99.9922
317,318,6177,311,2381,74.8744,23.9905,66.0095,99.9687
318,319,528,1238,2353,280.966,22.1241,67.8759,99.9816
319,320,3967,2051,2391,125.7,82.8429,7.15711,99.756
320,321,519,117,2380,259.573,21.2221,68.7779,99.9777
321,322,4831,792,2415,63.6367,16.9588,73.0412,99.9892
322,323,2602,1322,2395,266.188,29.4322,60.5678,99.9902
323,324,6936,1010,2428,255.643,47.5383,42.4617,99.9781
324,325,1448,926,2402,89.8991,6.54739,83.4526,99.9676
325,326,99110,1293,2554,84.8056,42.0309,47.9691,99.8298
326,327,12999,2211,2449,85.2163,54.4681,35.5319,99.9483
327,328,7349,582,2465,256.309,22.8714,67.1286,99.8438
328,329,11785,3155,2464,105.246,21.1213,68.8787,99.9249
329,330,8633,2988,2492,88.3127,28.6761,61.3239,99.9661
330,331,81951,1768,2522,248.524,13.2105,76.7895,99.9848
331,332,6902,850,2491,77.9142,28.0038,61.9962,99.9397
332,333,2689,2099,2454,79.3699,27.2257,62.7743,99.9893
333,334,8428,257,2484,74.6433,26.3034,63.6966,99.9842
334,335,18374,396,2520,221.947,75.6544,14.3456,99.6857
335,336,553,116,2453,78.0729,24.9347,65.0653,99.9114
336,337,25392,938,2590,88.2365,31.7678,58.2322,99.8508
337,338,20997,2029,2586,267.208,34.9737,55.0263,99.9383
338,339,127721,2401,2716,72.0227,51.5071,38.4929,99.8715
339,340,20158,2688,2541,81.5471,16.2318,73.7682,99.9377
340,341,6924,701,2555,258.118,26.411,63.589,99.9659
341,342,657,2599,2516,97.2355,17.9536,72.0464,99.925
342,343,583,552,2517,20.4208,83.0186,6.981389999999998,99.8076
343,344,28622,3039,2620,86.3853,55.625,34.375,99.9459
344,345,634,504,2529,254.599,20.2045,69.7955,99.9864
345,346,11124,2233,2579,249.651,46.5166,43.4834,99.9817
346,347,3890,2139,2554,77.9602,26.6586,63.3414,99.9844
347,348,5829,3155,2580,104.598,27.4403,62.5597,99.9497
348,349,961,167,2562,76.2163,25.9656,64.0344,99.9653
349,350,2713,1046,2561,267.693,33.9098,56.0902,99.9777
350,351,4477,606,2584,86.2775,24.6287,65.3713,99.9063
351,352,1251,518,2572,259.545,26.8745,63.1255,99.9299
352,353,1401,765,2579,220.23,60.4281,29.5719,99.9967
353,354,2330,2852,2586,258.834,20.2971,69.7029,99.9876
354,355,18458,555,2667,259.12,33.6888,56.3112,99.9554
355,356,739,410,2594,260.046,32.251999999999995,57.74800000000001,99.6684
356,357,57387,292,2795,79.7927,24.6622,65.3378,99.9706
357,358,5924,2915,2653,258.619,20.6026,69.3974,99.9815
358,359,1581,817,2621,246.566,38.7549,51.2451,99.9732
359,360,2365,182,2630,249.294,38.5499,51.4501,99.9801
360,361,4138,1058,2633,261.378,12.5243,77.4757,99.9836
361,362,50103,1506,2753,267.187,7.249410000000001,82.7506,99.9619
362,363,533,2281,2617,74.5965,51.9529,38.0471,99.965
363,364,651,106,2625,255.146,31.8467,58.1533,99.9402
364,365,23765,2736,2705,86.4723,3.8813,86.1187,100.018
365,366,4539,335,2643,255.46400000000003,34.4161,55.5839,99.9879
366,367,1744,675,2630,253.727,27.4987,62.5013,99.9806
367,368,2896,2841,2649,80.4365,26.084,63.916,99.9898
368,369,2364,740,2650,78.5484,19.1784,70.8216,99.9677
369,370,88308,1851,2789,84.7562,17.8386,72.1614,99.886
370,371,4089,792,2691,256.257,27.6158,62.3842,99.9831
371,372,4759,898,2690,85.256,4.1173199999999985,85.8827,99.9897
372,373,53541,522,2863,48.0167,75.8176,14.1824,99.9072
373,374,1203,680,2690,213.142,75.9027,14.0973,99.9911
374,375,1276,1067,2695,263.583,29.1105,60.8895,99.9534
375,376,2264,2849,2715,259.882,27.1407,62.8593,99.9934
376,377,94320,2931,2893,265.408,11.0807,78.9193,99.8931
377,378,2679,2065,2726,77.2632,42.2285,47.7715,99.9872
378,379,4747,1025,2778,249.154,44.6929,45.3071,99.9265
379,380,40813,826,2854,82.3807,32.3647,57.6353,99.9647
380,381,37169,1201,2820,276.658,48.3224,41.6776,99.9793
381,382,5664,663,2762,74.9325,65.9056,24.0944,99.9836
382,383,28682,2193,2846,75.89699999999998,43.76300000000001,46.237,99.9268
383,384,1903,980,2757,88.2892,1.72393,88.2761,99.9739
384,385,560,1097,2752,249.783,4.72845,85.2716,99.9388
385,386,781,2574,2756,265.618,6.15594,83.8441,99.9932
386,387,9204,3146,2831,106.448,3.32887,86.6711,99.9748
387,388,623,116,2787,78.9066,20.9919,69.0081,99.8755
388,389,507,3263,2782,73.3989,57.5215,32.4785,99.8994
389,390,1474,2108,2808,76.8111,46.6529,43.3471,99.4943
390,391,12966,2661,2832,111.532,69.6211,20.3789,99.9741
391,392,2747,941,2805,47.4223,72.8526,17.1474,99.9781
392,393,1128,1083,2808,247.583,21.3155,68.6845,99.9953
393,394,555,2079,2818,83.3168,50.559,39.441,99.8528
394,395,52201,704,3040,87.4796,36.8461,53.1539,99.8949
395,396,13213,998,2904,84.6389,25.344,64.656,99.9642
396,397,35338,1975,2985,77.5084,12.7081,77.2919,99.9785
397,398,883,926,2914,80.282,28.0514,61.9486,99.4151
398,399,11087,2118,2986,80.7959,51.9801,38.0199,99.9616
399,400,592,2541,2892,95.3986,73.4887,16.5113,99.9777
400,401,15409,1253,2954,244.112,54.8976,35.1024,99.9907
401,402,6456,1705,2945,78.3588,18.4089,71.5911,99.9812
402,403,23940,2640,2958,265.56,45.3575,44.6425,99.9806
403,404,834,1439,2921,267.309,81.7654,8.23457,99.995
404,405,2745,1348,2959,70.4058,7.1445,82.8555,99.9434
405,406,512,110,2931,249.303,28.9051,61.0949,99.9248
406,407,23939,390,3063,262.624,25.3369,64.6631,99.8692
407,408,3937,3134,2973,70.3474,23.2104,66.7896,99.9875
408,409,22014,247,3022,247.5,29.1076,60.8924,99.904
409,410,1959,1131,2973,245.232,54.6075,35.3925,99.9902
410,411,1012,1439,2967,73.6745,4.63075,85.3692,99.9841
411,412,19341,2267,3028,263.941,9.21675,80.7832,99.9729
412,413,27759,1000,3072,71.6696,36.3474,53.6526,99.9136
413,414,143117,2709,3204,97.1214,75.0293,14.9707,99.8975
414,415,26483,1457,3060,74.5794,39.816,50.184,99.9384
415,416,847,1728,3002,97.6473,28.8446,61.1554,99.9162
416,417,627,3195,2998,226.181,79.7726,10.2274,99.9946
417,418,1155,3172,3036,258.311,43.0242,46.9758,99.9724
418,419,6912,1605,3068,79.8008,17.5413,72.4587,99.9947
419,420,20057,3088,3118,261.188,45.5781,44.4219,99.944
420,421,35968,1307,3140,262.452,13.0173,76.9827,99.9209
421,422,6729,2946,3086,75.6599,20.0123,69.9877,99.9609
422,423,2461,852,3096,78.3007,36.0567,53.9433,99.1179
423,424,30582,1711,3235,88.3586,24.5946,65.4054,99.9809
424,425,39627,1932,3171,78.8846,19.1634,70.8366,99.946
425,426,543,2348,3109,264.017,8.82948,81.1705,99.858
426,427,1134,2189,3126,256.45,39.5148,50.4852,99.9603
427,428,2801,247,3128,79.6338,35.8079,54.1921,99.991
428,429,48708,239,3285,249.599,32.5976,57.4024,99.9853
429,430,1300,459,3129,77.2966,33.762,56.238,99.9332
430,431,116962,639,3351,59.3615,77.3546,12.6454,100.021
431,432,962,2306,3144,110.256,67.9687,22.0313,99.984
432,433,1166,3179,3152,271.021,30.0974,59.9026,99.9424
433,434,25438,829,3240,79.6444,19.5853,70.4147,99.9683
434,435,84082,1071,3308,229.11900000000003,77.529,12.470999999999998,99.885
435,436,1977,2193,3178,255.932,42.2946,47.7054,99.9927
436,437,2616,450,3183,263.303,25.0709,64.9291,99.9243
437,438,7847,2289,3203,264.343,14.9283,75.0717,99.9118
438,439,522,1623,3173,75.4022,0.08537289999999999,89.9146,99.9873
439,440,6627,107,3294,265.936,28.5223,61.4777,99.689
440,441,564,326,3192,249.981,31.5552,58.4448,99.7087
441,442,16589,2139,3262,265.231,12.8617,77.1383,99.9774
442,443,5538,3175,3254,93.5704,24.163,65.837,99.9928
443,444,10568,3034,3304,273.49,17.4872,72.5128,99.9908
444,445,5433,1542,3262,270.965,34.9159,55.0841,99.9674
445,446,22490,1411,3332,262.381,27.2769,62.7231,99.9481
446,447,32951,1324,3412,92.8484,25.5045,64.4955,99.9686
447,448,7159,1974,3285,82.243,50.4701,39.5299,99.9528
448,449,565,2037,3268,80.6448,20.6059,69.3941,99.9097
449,450,629,1876,3288,291.639,59.0792,30.9208,99.9098
450,451,3342,1586,3323,297.19,55.6036,34.3964,99.992
451,452,1877,2038,3331,78.2261,17.507,72.493,99.9694
452,453,2803,3140,3346,272.607,17.32,72.68,99.9958
453,454,11472,1842,3385,85.7804,16.0505,73.9495,99.9484
454,455,28335,1592,3425,265.516,16.3585,73.6415,99.8585
455,456,6294,1953,3395,87.9285,10.9625,79.0375,99.5901
456,457,52758,2360,3458,263.503,7.71208,82.2879,99.9269
457,458,1033,368,3361,88.3107,26.425,63.575,99.8743
458,459,3757,2145,3372,78.7195,21.2214,68.7786,99.9589
459,460,1255,2200,3398,270.634,5.31091,84.6891,99.9396
460,461,19791,2053,3464,85.1238,3.73667,86.2633,99.9315
461,462,1771,1741,3393,264.16900000000004,16.1899,73.8101,99.9521
462,463,1446,3077,3396,86.4509,70.5431,19.4569,99.915
463,464,17053,457,3495,72.8439,21.9892,68.0108,99.8773
464,465,1280,2937,3402,260.111,42.6673,47.3327,99.8856
465,466,6332,3196,3460,94.8959,24.198,65.80199999999999,99.9333
466,467,60219,278,3610,87.1251,27.5881,62.4119,99.962
467,468,582,2894,3430,77.3779,30.3398,59.6602,99.9897
468,469,740,376,3455,86.421,30.1427,59.8573,99.9309
469,470,115343,3043,3631,103.52,55.9889,34.0111,99.9384
470,471,20785,1766,3506,84.6216,19.6374,70.3626,99.9673
471,472,597,2818,3452,98.0672,74.2859,15.7141,99.9672
472,473,651,1920,3467,85.6888,4.14266,85.8573,99.9385
473,474,1037,246,3476,282.4790000000001,62.5925,27.4075,99.9401
474,475,6613,1246,3491,237.526,77.668,12.332,99.8994
475,476,1304,105,3486,88.7675,27.289,62.71100000000001,99.94
476,477,3655,1145,3487,261.927,32.1298,57.8702,99.9958
477,478,743,2156,3492,78.4414,7.79177,82.2082,99.9615
478,479,1418,328,3499,249.726,32.2174,57.7826,99.9902
479,480,807,1069,3503,77.1619,17.7597,72.2403,99.953
480,481,5928,2794,3524,80.2106,48.8871,41.1129,99.9457
481,482,63788,777,3630,85.2137,25.6249,64.3751,99.9216
482,483,11197,566,3585,66.2759,61.3153,28.6847,99.984
483,484,19047,2210,3631,256.26,43.6692,46.3308,99.9717
484,485,98838,2101,3763,81.8432,30.6086,59.3914,99.7311
485,486,1808,1495,3528,268.308,14.2467,75.7533,99.9758
486,487,14676,1844,3584,85.8495,10.4029,79.5971,99.9859
487,488,3948,1575,3538,261.868,1.95932,88.0407,99.9915
488,489,1239,2435,3534,254.367,1.00421,88.9958,99.1675
489,490,557,110,3539,87.477,27.8051,62.1949,99.9488
490,491,57528,1094,3727,77.5288,13.746,76.25399999999998,99.5827
491,492,5808,1325,3581,277.876,5.36603,84.634,99.9618
492,493,27051,2748,3640,80.1442,11.9645,78.0355,99.8945
493,494,9146,1049,3592,233.86900000000003,80.6785,9.32146,99.9916
494,495,84083,1446,3772,180.424,71.4848,18.5152,99.5576
495,496,14275,1627,3633,74.4458,7.1293,82.8707,99.9801
496,497,10423,2413,3624,79.9893,8.412930000000001,81.5871,99.9238
497,498,9386,483,3644,249.581,33.0724,56.9276,99.9942
498,499,8856,1772,3708,270.261,31.88,58.12,99.9834
499,500,710,1253,3680,67.7682,8.92887,81.0711,99.6742
500,501,4834,156,3702,262.693,40.9237,49.0763,99.9877
501,502,10915,2389,3720,76.5101,15.0486,74.9514,99.9587
502,503,510,206,3716,250.237,34.1067,55.8933,99.7714
503,504,1016,2577,3705,261.171,60.5564,29.4436,99.9972
504,505,615,899,3707,246.045,55.1471,34.8529,99.9691
505,506,5111,2757,3745,65.0322,52.1311,37.8689,99.9745
506,507,12959,1676,3806,74.5643,5.46828,84.5317,99.8802
507,508,754,1873,3719,261.765,1.93864,88.0614,99.9741
508,509,5554,2649,3743,265.008,38.5008,51.4992,99.9443
509,510,1895,2545,3748,257.932,57.34,32.66,99.9062
510,511,1246,2496,3736,84.1285,7.10612,82.8939,99.9465
511,512,970,246,3734,249.333,32.8625,57.1375,99.9885
512,513,7482,488,3765,77.0793,9.1586,80.8414,99.9304
513,514,930,784,3753,89.0757,23.5214,66.4786,99.8977
514,515,30436,1225,3921,256.79900000000004,44.0444,45.9556,99.926
515,516,511,1888,3744,82.0424,3.54446,86.4555,99.9953
516,517,1173,948,3752,260.04,1.86506,88.1349,99.9413
517,518,45155,2780,3896,75.3185,56.392,33.608000000000004,99.9495
518,519,34252,142,3929,249.13,20.6766,69.3234,99.942
519,520,2708,1834,3771,80.0601,29.5154,60.4846,99.9771
520,521,109880,753,3994,258.006,2.34428,87.6557,99.9927
521,522,1248,2799,3774,69.1656,48.6768,41.3232,99.8451
522,523,6125,2312,3814,80.9907,7.58467,82.4153,99.9255
523,524,1031,811,3772,76.9091,52.8076,37.1924,99.9926
524,525,7591,867,3809,87.7686,29.3827,60.6173,99.987
525,526,17981,2476,3834,263.754,41.2296,48.7704,99.864
526,527,2175,1914,3798,84.2474,44.7138,45.2862,99.9282
527,528,5606,247,3834,77.3631,6.54128,83.4587,99.9799
528,529,504,1797,3802,76.3283,6.606889999999999,83.3931,99.9536
529,530,924,1752,3809,264.883,11.8107,78.1893,99.9291
530,531,1604,3223,3832,268.121,43.1593,46.8407,99.9813
531,532,652,2826,3812,72.5213,53.9419,36.0581,99.3156
532,533,1437,2625,3828,252.236,60.3639,29.6361,99.9804
533,534,74263,3008,4012,251.315,61.6201,28.3799,99.8811
534,535,5861,1754,3896,266.612,12.705,77.295,99.9493
535,536,3160,2990,3875,86.7246,52.5258,37.4742,99.9762
536,537,1175,1895,3868,84.5565,45.7447,44.2553,99.9819
537,538,1370,2695,3877,262.35400000000004,39.8119,50.1881,99.8334
538,539,1758,351,3875,241.333,68.0011,21.9989,99.9557
539,540,2826,436,3885,78.1136,5.74138,84.2586,99.6527
540,541,508,507,3872,239.043,69.0837,20.9163,99.9739
541,542,7535,1834,3920,80.6951,6.75542,83.2446,99.9518
542,543,7004,1997,3907,85.1507,48.0197,41.9803,99.9351
543,544,2691,1183,3904,256.318,37.886,52.114,99.9535
544,545,525,2346,3891,81.679,8.219510000000001,81.7805,99.6892
545,546,3193,3225,3902,256.293,14.6719,75.3281,99.988
546,547,13269,274,3940,264.534,41.7223,48.2777,99.9374
547,548,1688,2871,3910,83.05799999999998,54.74800000000001,35.25199999999999,99.9683
548,549,109585,1613,4133,256.696,43.4266,46.5734,100.008
549,550,116144,2304,4213,87.7808,49.9599,40.0401,99.9329
550,551,29921,2048,4054,254.353,28.571,61.429,99.9728
551,552,999,2595,3905,82.8485,20.5803,69.4197,99.9144
552,553,17450,476,3983,259.094,2.03917,87.9608,99.9424
553,554,790,3178,3914,220.284,64.2357,25.7643,99.9919
554,555,6099,2520,3945,255.282,23.4681,66.5319,99.9691
555,556,5683,1049,3949,257.517,43.8053,46.1947,99.9887
556,557,4205,1132,3953,78.8257,10.6345,79.3655,99.8891
557,558,894,565,3943,239.126,42.9571,47.0429,99.9898
558,559,4708,2610,3966,258.911,7.53403,82.46600000000002,99.9815
559,560,4964,1955,3978,263.945,16.7279,73.2721,99.9162
560,561,41388,1317,4074,265.78,28.3893,61.6107,99.9848
561,562,9729,281,4032,242.433,30.2215,59.7785,99.7637
562,563,1643,3223,3977,77.2867,35.4017,54.5983,99.9394
563,564,500,3181,3974,76.2211,33.3083,56.6917,99.8985
564,565,112934,524,4305,247.528,44.5697,45.4303,99.8639
565,566,44851,1000,4173,282.63,20.6356,69.3644,99.9533
566,567,2666,2579,4031,264.783,2.78506,87.2149,99.966
567,568,860,2340,4033,262.338,59.719,30.281,99.8126
568,569,14184,2226,4070,253.352,29.1898,60.8102,99.9747
569,570,9093,1877,4090,78.4537,47.3709,42.6291,99.9842
570,571,11475,340,4114,256.905,5.08778,84.9122,99.996
571,572,5733,3188,4113,78.6635,25.3995,64.6005,99.9537
572,573,8177,2722,4126,80.8599,5.28629,84.7137,99.9957
573,574,769,2617,4102,87.9776,49.3186,40.6814,99.9873
574,575,4828,102,4131,78.8668,6.55369,83.4463,99.8995
575,576,6570,2809,4168,89.1483,24.1754,65.8246,99.9948
576,577,6018,1431,4157,103.1,15.7113,74.2887,99.8292
577,578,2364,2872,4132,261.79900000000004,48.6144,41.3856,99.9839
578,579,15429,208,4186,52.5337,70.0966,19.9034,99.985
579,580,6209,2644,4184,88.5676,49.3419,40.6581,99.9892
580,581,16896,1159,4231,95.7476,52.6217,37.3783,99.9807
581,582,563,1059,4150,263.569,23.1307,66.8693,99.8904
582,583,21102,3157,4239,76.4953,13.2016,76.7984,99.9461
583,584,2349,3049,4179,221.077,64.9087,25.0913,99.9751
584,585,515,306,4177,247.451,69.3021,20.6979,99.9949
585,586,1833,1062,4192,262.836,22.9448,67.0552,99.9762
586,587,43784,2982,4297,89.8549,7.23592,82.7641,99.9709
587,588,20087,1369,4266,262.835,19.1957,70.8043,99.9568
588,589,1293,2417,4200,87.0723,43.6699,46.3301,99.9461
589,590,4548,445,4235,249.766,74.0381,15.9619,99.9492
590,591,2278,334,4223,259.395,19.2378,70.7622,99.9938
591,592,23147,770,4297,104.923,21.1215,68.8785,99.9876
592,593,28269,2781,4308,87.7754,2.05428,87.9457,99.9667
593,594,554,71,4235,258.622,5.39042,84.6096,99.9377
594,595,13801,198,4295,261.055,19.1548,70.8452,99.9904
595,596,1621,99,4260,242.945,5.31824,84.6818,99.9729
596,597,10350,1221,4328,102.102,11.8261,78.1739,99.9222
597,598,13813,335,4349,244.713,73.4609,16.5391,99.9797
598,599,967,2649,4300,91.5154,26.2368,63.7632,99.993
599,600,60374,1362,4553,103.234,21.6854,68.3146,99.8734
600,601,46538,2644,4556,89.4502,51.3858,38.6142,99.9542
601,602,8610,3160,4402,92.715,31.846,58.154,99.9519
602,603,7333,139,4396,246.227,37.9221,52.0779,99.9367
603,604,8130,2507,4406,90.2689,50.534,39.466,99.9714
604,605,27658,1092,4441,217.049,75.0269,14.9731,99.9552
605,606,717,949,4363,259.405,21.5866,68.4134,99.9845
606,607,13986,891,4429,83.8788,53.5084,36.4916,99.9485
607,608,12458,1461,4426,85.785,41.429,48.57100000000001,99.9401
608,609,12940,226,4452,261.464,18.413,71.587,99.9932
609,610,5653,2620,4416,272.86,24.7165,65.2835,99.9763
610,611,840,2418,4401,251.941,48.3719,41.6281,99.9794
611,612,8650,2849,4439,83.1741,48.1241,41.8759,99.9485
612,613,719,2122,4406,94.313,41.7565,48.2435,99.9921
613,614,66789,2313,4649,251.048,47.0795,42.9205,99.8224
614,615,23368,2230,4491,91.7137,42.7718,47.2282,99.9459
615,616,29014,3058,4565,84.9977,49.6209,40.3791,99.8975
616,617,5881,1594,4464,268.851,42.5244,47.4756,99.9201
617,618,45821,603,4572,249.527,12.2308,77.7692,99.9949
618,619,985,1534,4502,98.8176,47.8121,42.1879,99.4525
619,620,7436,1964,4483,84.4802,24.2421,65.7579,99.9697
620,621,6747,3192,4486,273.875,7.85165,82.1484,99.9953
621,622,769,1685,4467,275.416,25.6981,64.3019,99.9412
622,623,6916,2905,4503,89.4847,9.19016,80.8098,99.9626
623,624,2089,2544,4487,75.2406,37.1419,52.8581,99.9728
624,625,26343,1190,4587,50.7333,66.9734,23.0266,99.9635
625,626,1089,2976,4478,91.6389,8.90553,81.0945,99.9965
626,627,3716,744,4519,247.925,16.2862,73.7138,99.6114
627,628,2769,1742,4505,261.443,22.5343,67.4657,99.9772
628,629,1789,92,4508,249.193,45.7192,44.2808,99.9151
629,630,574,965,4494,94.5745,14.8369,75.1631,99.9597
630,631,523,2819,4510,88.2779,50.3007,39.6993,99.83
631,632,2412,2043,4543,86.6543,64.0681,25.9319,99.8021
632,633,5840,990,4546,94.4239,14.6024,75.3976,99.9823
633,634,2174,821,4530,261.192,6.15299,83.84700000000002,99.9586
634,635,2996,1817,4534,257.706,22.8792,67.1208,99.7875
635,636,4508,1645,4553,82.3203,41.3117,48.6883,99.9688
636,637,26636,223,4616,62.4984,75.1332,14.8667,99.9887
637,638,2185,929,4573,268.499,3.78385,86.2161,99.9148
638,639,11241,1948,4589,261.172,19.5904,70.4096,99.9434
639,640,19277,2064,4655,98.7452,77.8427,12.1573,99.9566
640,641,15803,1791,4615,71.4919,60.3227,29.6773,99.918
641,642,11411,2921,4632,233.719,82.0598,7.9401899999999985,99.9365
642,643,9533,865,4621,71.5985,10.1713,79.8287,99.988
643,644,15487,2771,4660,90.4268,8.96658,81.0334,99.9662
644,645,868,93,4586,95.9722,56.0522,33.9478,99.9243
645,646,2497,464,4608,78.885,22.5527,67.4473,99.9918
646,647,23085,998,4688,258.706,8.18892,81.8111,99.9714
647,648,676,2288,4615,266.327,53.0985,36.9015,99.9382
648,649,3316,1534,4653,81.1066,9.09486,80.9051,99.9781
649,650,1326,87,4631,98.4543,51.4586,38.5414,99.9797
650,651,16630,503,4693,77.4749,27.2764,62.7236,99.9566
651,652,22440,782,4710,256.48,18.1584,71.8416,99.9597
652,653,4542,382,4668,251.892,64.4061,25.5939,99.9566
653,654,11216,1643,4683,265.383,14.585,75.415,99.992
654,655,9059,191,4717,239.014,24.6488,65.3512,99.9736
655,656,1228,77,4689,95.6894,57.7682,32.2318,99.9663
656,657,19669,1789,4737,72.2948,29.1197,60.8803,99.9713
657,658,5590,1125,4698,100.172,13.6558,76.3442,99.9946
658,659,9072,1296,4721,98.8137,13.9498,76.0502,99.989
659,660,22828,2927,4753,272.796,10.9729,79.0271,99.8818
660,661,1388,1909,4706,261.985,17.1067,72.8933,99.914
661,662,2317,3212,4728,255.444,54.783,35.217,99.9377
662,663,5274,1199,4760,260.606,58.9199,31.0801,99.9801
663,664,20515,2471,4769,100.22,62.7176,27.2824,99.9681
664,665,9389,2696,4759,82.6218,37.2818,52.7182,99.969
665,666,1854,3120,4723,257.634,58.1764,31.8236,99.993
666,667,2812,1539,4736,83.625,40.8742,49.1258,99.993
667,668,860,1943,4753,91.4926,58.6102,31.3898,99.9884
668,669,1434,2105,4755,240.742,30.8322,59.1678,99.7598
669,670,855,3084,4762,258.158,53.3867,36.6133,99.9242
670,671,1045,1588,4763,87.0582,44.6739,45.3261,99.9765
671,672,2005,1987,4772,111.989,76.3559,13.6441,99.9621
672,673,1045,1503,4773,262.426,20.4839,69.5161,99.8935
673,674,1694,3167,4786,274.58,13.5098,76.4902,99.9385
674,675,681,1679,4783,263.775,28.4376,61.5624,99.9904
