,Grain No.,Size [Pixel],center x-coordinate,center y-coordinate,mean azimuth [degree],mean latitude [degree],mean colatitude [degree],Regelungsgrad [%]
0,1,676,150,120,181.837,79.618,10.382,99.5827
1,2,7573,221,185,147.664,67.0046,22.9954,99.9277
2,3,64656,431,330,142.078,46.8133,43.1867,89.4305
3,4,15428,319,220,139.261,23.2538,66.7462,99.9067
4,5,16682,1888,254,317.333,29.726,60.274,99.1244
5,6,2333,929,183,126.877,25.3051,64.6949,99.9877
6,7,3193,731,190,313.567,5.36281,84.6372,99.9921
7,8,3346,832,189,124.415,6.95029,83.0497,99.9836
8,9,1343,449,198,288.628,31.088,58.912,99.9888
9,10,728,992,194,243.705,48.2464,41.7536,99.915
10,11,544,1134,194,312.908,16.1225,73.8775,99.9782
11,12,95712,1117,393,307.199,49.9367,40.0633,99.9531
12,13,1915,1318,203,318.6690000000001,31.8306,58.1694,99.9716
13,14,2439,109,231,145.642,54.5221,35.4779,99.6841
14,15,5238,1247,224,252.245,51.3575,38.6425,99.9951
15,16,5196,1375,244,138.645,40.5222,49.4778,99.9941
16,17,2354,1200,243,144.187,35.7358,54.2642,99.9396
17,18,18565,1544,244,330.881,53.5495,36.4505,91.8118
18,19,10239,905,243,137.599,32.8507,57.1493,99.9942
19,20,1535,689,222,138.187,50.5719,39.4281,99.9962
20,21,6800,778,244,302.626,44.4055,45.5945,99.9899
21,22,1538,1825,226,159.787,62.774,27.226,99.8744
22,23,10151,2048,263,138.53799999999998,29.9012,60.0988,99.9137
23,24,3352,169,259,128.991,0.196495,89.8035,99.8722
24,25,8956,1695,283,160.92600000000004,59.5194,30.4806,99.9772
25,26,1208,2599,256,121.003,9.17212,80.8279,99.0902
26,27,3584,1293,267,140.608,45.0832,44.9168,99.9975
27,28,8534,2252,257,112.998,36.7411,53.2589,99.9239
28,29,3443,583,259,319.737,69.0465,20.9535,99.9948
29,30,542,2749,243,117.533,45.52,44.48,99.7556
30,31,2415,677,270,137.989,22.7654,67.2346,99.9984
31,32,314565,1652,592,313.476,3.98197,86.01799999999999,89.2005
32,33,53187,2438,364,114.878,36.4941,53.5059,99.9432
33,34,5867,2729,297,327.217,37.1235,52.8765,99.9496
34,35,7817,2851,299,132.245,15.6495,74.3505,99.9607
35,36,2055,1789,301,147.262,3.30942,86.6906,99.9908
36,37,3462,111,311,149.11,54.3698,35.6302,99.4949
37,38,1007,2176,280,326.2290000000001,34.8206,55.1794,99.991
38,39,23620,790,368,303.774,43.8236,46.1764,99.9868
39,40,6130,2994,308,312.736,31.0861,58.9139,99.7703
40,41,3271,213,314,165.123,49.9458,40.0542,99.9235
41,42,5254,1331,318,334.0019999999999,40.9322,49.0678,99.9716
42,43,1331,594,292,313.675,7.5354800000000015,82.4645,99.9836
43,44,7618,907,330,136.66299999999998,33.1997,56.8003,99.989
44,45,3231,695,314,138.006,22.1007,67.8993,99.9973
45,46,663,3091,294,98.9855,23.2605,66.7395,99.9794
46,47,709,3130,304,216.683,73.5297,16.4703,99.9705
47,48,1966,3187,313,321.934,25.734,64.266,99.9173
48,49,579,2086,303,139.583,30.3543,59.6457,99.9677
49,50,27964,2160,376,328.965,34.1832,55.8168,99.9545
50,51,11107,503,378,328.426,65.2036,24.7964,99.9793
51,52,3466,3087,333,131.471,12.9088,77.0912,99.9575
52,53,8801,594,336,314.318,7.92477,82.0752,99.9738
53,54,35872,2720,418,324.113,39.0129,50.9871,99.7133
54,55,2587,1622,328,337.293,68.6395,21.3605,99.9733
55,56,586,148,332,156.016,48.7929,41.2071,99.9838
56,57,776,1901,326,316.951,31.0665,58.9335,99.9979
57,58,1988,132,360,309.185,4.47506,85.5249,99.5037
58,59,3182,3161,356,320.015,27.9549,62.0451,99.9927
59,60,3452,2883,347,132.898,15.8172,74.1828,99.9883
60,61,1232,2967,354,315.025,30.1605,59.8395,99.9921
61,62,4152,1683,369,332.773,47.9119,42.0881,99.9919
62,63,11989,3253,415,333.976,29.2194,60.7806,99.9563
63,64,551,3043,359,135.279,23.9518,66.0482,99.942
64,65,43324,181,494,129.865,3.15089,86.8491,88.4773
65,66,656,1623,380,130.225,40.1053,49.8947,99.9983
66,67,9327,3029,423,137.075,23.4878,66.5122,99.9493
67,68,1397,2880,392,324.373,1.39855,88.6014,99.9937
68,69,12123,653,419,137.83,22.132,67.868,99.9177
69,70,27708,2893,496,193.604,68.3433,21.6567,99.9064
70,71,886,3093,390,312.657,58.7288,31.2712,99.9757
71,72,17723,935,455,295.871,39.278,50.722,99.9539
72,73,720,1590,393,331.134,62.1381,27.8619,99.9979
73,74,94155,3210,621,325.462,25.1692,64.8308,97.2879
74,75,57175,2470,520,127.01,65.264,24.736,93.2529
75,76,10195,3354,472,317.527,18.2717,71.7283,99.3142
76,77,895,3106,423,320.309,27.4898,62.5102,99.9946
77,78,784,2777,446,314.913,43.621,46.379,99.9919
78,79,37173,2065,547,314.664,18.8031,71.1969,99.3349
79,80,36012,625,546,21.1803,68.6761,21.3239,99.9111
80,81,114923,805,663,166.128,45.1508,44.8492,98.6512
81,82,1084,3007,506,319.05,33.7251,56.2749,99.788
82,83,6702,2285,558,153.536,47.3828,42.6172,98.3764
83,84,108503,2885,699,105.789,46.8642,43.1358,98.394
84,85,55687,384,619,289.87,3.88417,86.1158,99.9781
85,86,1526,1337,538,142.111,47.6339,42.3661,99.9847
86,87,11713,2208,595,295.029,67.8647,22.1353,99.9906
87,88,1934,1272,561,153.639,58.3645,31.6355,99.9354
88,89,5313,1291,606,143.986,48.2326,41.7674,99.9712
89,90,1325,2402,593,142.922,22.7465,67.2535,99.9958
90,91,1084,2454,596,116.055,49.1712,40.8288,99.9886
91,92,75947,2494,744,139.159,11.8519,78.1481,95.6823
92,93,55507,172,810,161.409,57.6789,32.3211,99.418
93,94,28637,1185,688,176.734,56.4167,33.5833,99.9895
94,95,36987,1389,760,125.496,7.2599,82.7401,99.9629
95,96,18154,2091,701,356.7030000000001,36.1858,53.8142,99.9788
96,97,1264,2307,644,144.957,22.8927,67.1073,99.9979
97,98,19428,2253,728,82.6198,72.8121,17.1879,99.4967
98,99,165404,2017,938,131.409,58.9137,31.0863,89.5501
99,100,9740,333,762,154.859,8.47343,81.5266,99.9589
100,101,486876,729,1366,317.188,13.8145,76.1855,87.3519
101,102,16033,1110,789,272.249,50.1307,39.8693,99.9189
102,103,1473,1311,772,122.379,70.2213,19.7787,99.9819
103,104,10476,2190,804,283.94,31.2156,58.7844,99.9937
104,105,14224,878,809,172.458,49.9995,40.0005,99.9899
105,106,107058,2682,969,348.964,67.3669,22.6331,99.7582
106,107,75863,3183,931,315.374,27.0492,62.9508,99.8278
107,108,278952,1267,1133,335.31699999999995,35.1665,54.8335,75.4992
108,109,562,77,810,297.209,41.6535,48.3465,99.899
109,110,522,1235,797,153.55700000000004,52.5344,37.4656,99.7728
110,111,14646,1225,853,324.209,23.5961,66.4039,99.9366
111,112,49978,672,906,322.9170000000001,5.4896699999999985,84.5103,91.8422
112,113,9396,2344,876,301.349,24.7082,65.2918,99.97
113,114,33545,321,936,141.648,6.94769,83.0523,99.9503
114,115,7323,3031,900,101.017,46.5976,43.4024,88.2805
115,116,15074,2239,931,111.062,17.6382,72.3618,99.9933
116,117,6545,1093,898,180.358,58.7309,31.2691,99.9941
117,118,13760,2941,951,112.953,17.204,72.796,99.9787
118,119,16853,861,949,121.875,56.5091,33.4909,99.9904
119,120,669,1578,946,110.164,54.8435,35.1565,99.9941
120,121,1939,2904,997,316.564,25.6369,64.3631,99.9872
121,122,1379,526,985,329.934,23.8059,66.1941,99.9241
122,123,1251,1595,978,295.688,56.1652,33.8348,99.9931
123,124,1657,80,1007,302.902,1.76738,88.2326,99.6444
124,125,15748,1656,1051,107.228,54.1152,35.8848,99.9505
125,126,2770,204,1009,322.742,77.3986,12.6014,99.9226
126,127,199819,3239,1433,320.016,10.1163,79.8837,94.6401
127,128,1341,2580,1011,116.985,11.8685,78.1315,99.9946
128,129,5170,2436,1069,90.3023,41.6877,48.3123,99.9689
129,130,1595,136,1029,137.264,3.15755,86.8425,99.8352
130,131,2140,606,1063,259.978,55.3226,34.6774,99.9662
131,132,1818,365,1051,316.747,8.09961,81.9004,99.996
132,133,58089,193,1188,161.553,63.963,26.037,99.6898
133,134,574,2597,1045,318.48,14.0296,75.9704,99.2636
134,135,2794,81,1090,301.226,37.6422,52.3578,99.8593
135,136,50935,2645,1229,318.181,13.9597,76.0403,99.9304
136,137,9204,369,1118,258.228,55.2796,34.7204,99.9856
137,138,26075,3088,1170,289.941,60.3716,29.6284,99.9792
138,139,4961,2979,1100,284.0490000000001,60.6081,29.3919,99.9722
139,140,44144,1785,1212,138.252,6.862310000000001,83.1377,99.986
140,141,76395,2169,1257,320.146,30.8863,59.1137,99.9391
141,142,21030,2358,1169,320.789,22.3741,67.6259,99.9558
142,143,9033,2511,1161,118.283,8.47287,81.5271,99.7628
143,144,67156,2867,1327,110.266,18.202,71.798,99.7074
144,145,7702,2795,1151,75.9763,62.2555,27.7445,99.9912
145,146,17957,1998,1216,123.708,26.3773,63.6227,99.9872
146,147,17194,1648,1203,323.988,52.3879,37.6121,99.9901
147,148,521,3400,1153,320.856,13.4742,76.5258,99.9045
148,149,682,2444,1172,90.3696,41.9515,48.0485,99.9977
149,150,3151,2865,1197,300.283,10.9787,79.0213,99.9962
150,151,3618,332,1220,312.144,44.0054,45.9946,99.9938
151,152,2713,1928,1223,292.459,46.2348,43.7652,99.9944
152,153,6313,834,1230,117.48,57.9322,32.0678,99.9799
153,154,4150,3140,1243,316.628,26.3315,63.6685,99.992
154,155,1590,2793,1230,87.8441,54.5069,35.4931,99.9986
155,156,769,2484,1229,98.974,37.7164,52.2836,99.9304
156,157,996,71,1245,121.924,29.3285,60.6715,99.7517
157,158,36338,2432,1350,85.4068,54.6612,35.3388,99.967
158,159,2984,1893,1259,292.5420000000001,59.2386,30.7614,99.9978
159,160,15984,1601,1319,325.882,32.6463,57.3537,99.9314
160,161,1659,2516,1286,112.205,16.5651,73.4349,99.994
161,162,137561,1858,1493,129.749,14.1508,75.8492,96.6084
162,163,15248,3134,1359,292.885,29.0529,60.9471,99.9924
163,164,4015,1891,1317,330.57,19.1379,70.8621,99.9923
164,165,33411,175,1416,131.351,25.5443,64.4557,99.8895
165,166,1715,2497,1345,102.35,38.4325,51.5675,99.9698
166,167,4371,3030,1372,317.259,22.4582,67.5418,99.9838
167,168,16068,333,1418,305.17,21.6275,68.3725,99.9842
168,169,19162,2604,1423,298.748,18.3402,71.6598,99.9876
169,170,590,2333,1378,114.916,40.8852,49.1148,99.9961
170,171,4056,1358,1422,133.053,51.6595,38.3405,99.9772
171,172,797,2889,1399,330.102,48.4159,41.5841,99.9962
172,173,37013,2318,1522,100.953,41.257,48.743,96.4829
173,174,5645,2973,1444,319.885,21.386,68.61399999999999,99.8027
174,175,677782,2641,1901,319.021,1.33047,88.6695,59.0083
175,176,2157,1029,1448,156.131,42.3526,47.6474,99.9928
176,177,2593,1404,1456,142.477,35.975,54.025,99.4083
177,178,9432,431,1493,145.60299999999995,46.9477,43.0523,99.6393
178,179,7794,2166,1472,153.514,38.5166,51.4834,99.9838
179,180,980,68,1483,306.404,23.9946,66.0054,99.3597
180,181,7310,85,1564,155.722,66.2805,23.7195,99.194
181,182,6655,1326,1513,290.435,57.0009,32.9991,99.9408
182,183,24351,338,1562,139.60399999999998,38.7554,51.2446,99.9005
183,184,78325,2079,1729,321.607,30.6172,59.3828,84.1941
184,185,1113,128,1540,325.993,27.9094,62.0906,99.9873
185,186,156251,1105,1769,282.314,58.0967,31.9033,99.8236
186,187,569737,1509,2484,153.374,15.7099,74.2901,39.7033
187,188,62374,275,1726,152.856,56.5299,33.4701,99.9526
188,189,948,1720,1565,279.27,53.33,36.67,99.9991
189,190,872,1241,1564,324.212,21.0253,68.9747,99.9904
190,191,1725,775,1604,275.55,54.5829,35.4171,99.9968
191,192,11375,846,1610,162.255,31.1135,58.8865,99.9818
192,193,10180,1582,1608,149.775,25.0135,64.9865,99.9598
193,194,1025,146,1592,336.719,50.424,39.576,99.9971
194,195,2983,1277,1604,135.112,47.5116,42.4884,99.9905
195,196,640,116,1630,323.743,14.9232,75.0768,99.9968
196,197,10009,1659,1727,296.445,24.251,65.749,99.9743
197,198,3540,3021,1665,322.598,48.4534,41.5466,99.9945
198,199,4582,82,1679,325.157,20.2463,69.7537,99.556
199,200,43376,1857,1765,320.129,23.0034,66.9966,99.9669
200,201,1832,1544,1679,285.828,56.1929,33.8071,99.9539
201,202,15860,1577,1755,314.067,36.9885,53.0115,99.9621
202,203,4293,754,1722,142.681,28.6749,61.3251,99.9968
203,204,11503,98,1802,298.741,18.3893,71.6107,99.1438
204,205,2913,2218,1757,283.668,16.8564,73.1436,99.9975
205,206,3251,1742,1760,121.761,42.5417,47.4583,99.9984
206,207,5260,1319,1780,303.571,21.466,68.53399999999999,99.9979
207,208,3154,969,1750,145.138,37.7636,52.2364,99.9012
208,209,3237,794,1766,302.815,18.8283,71.1717,99.9975
209,210,3395,3190,1773,139.879,12.4486,77.5514,99.9941
210,211,1401,708,1777,140.904,31.4694,58.5306,99.996
211,212,7532,908,1803,324.441,87.8135,2.18651,100.004
212,213,3989,782,1826,296.704,85.1304,4.86957,99.9508
213,214,11285,199,1840,169.609,56.6471,33.3529,99.9847
214,215,6822,628,1830,328.36800000000005,4.9387300000000005,85.0613,99.9644
215,216,7887,3229,1841,344.397,61.4502,28.5498,99.9966
216,217,197758,815,2078,121.47,12.9572,77.0428,52.4954
217,218,7080,1715,1841,131.893,54.0691,35.9309,99.9983
218,219,5014,3333,1837,329.3,39.9599,50.0401,99.6116
219,220,636,842,1814,266.691,89.4718,0.528231,99.9987
220,221,2857,3168,1873,130.41299999999998,42.9684,47.0316,99.999
221,222,876,835,1845,293.409,57.558,32.442,99.9901
222,223,3433,944,1868,147.59799999999996,39.5266,50.4734,99.981
223,224,1391,765,1865,288.184,52.3689,37.6311,99.9769
224,225,8090,1665,1916,315.205,34.7722,55.2278,99.9482
225,226,2253,261,1883,164.396,36.4596,53.5404,99.9957
226,227,2322,73,1937,304.922,5.3665,84.6335,99.4064
227,228,1349,3354,1896,318.823,34.504,55.496,99.7108
228,229,1597,106,1910,323.07,2.4635700000000003,87.5364,99.937
229,230,786,3299,1891,130.421,42.7774,47.2226,99.9984
230,231,13267,3280,1943,264.586,67.9844,22.0156,99.9857
231,232,780,292,1904,172.55900000000003,57.2817,32.7183,99.963
232,233,14797,1846,1959,161.805,30.8089,59.1911,99.8786
233,234,162023,309,2134,332.8640000000001,1.52903,88.471,78.2093
234,235,113206,1769,2155,161.444,37.118,52.882,98.0364
235,236,640,3385,1983,322.858,32.3122,57.6878,99.9755
236,237,653,1129,1966,143.83100000000005,46.892,43.108,99.9971
237,238,4570,1913,2006,130.959,46.4104,43.5896,99.9471
238,239,519,3227,1986,130.423,43.2808,46.7192,99.9954
239,240,4929,932,2036,302.216,18.4241,71.5759,99.9769
240,241,1051,64,2025,301.368,4.44519,85.5548,99.1954
241,242,18087,1275,2083,125.497,46.2882,43.7118,99.9642
242,243,762,3381,2066,144.472,3.0828,86.9172,99.9171
243,244,578,1525,2040,308.111,33.7974,56.2026,99.9493
244,245,2561,1155,2064,125.096,25.3419,64.6581,99.9981
245,246,6183,1880,2105,150.31,56.3665,33.6335,99.4502
246,247,516,1005,2062,264.22,60.0982,29.9018,99.9774
247,248,4689,2081,2131,136.988,50.1758,39.8242,99.9643
248,249,10019,3077,2141,314.388,25.2695,64.7305,99.9541
249,250,2380,2797,2156,136.845,3.72512,86.2749,99.9716
250,251,2808,3335,2150,300.055,19.4598,70.5402,99.863
251,252,9054,550,2196,315.692,66.6951,23.3049,99.944
252,253,22589,2763,2252,303.255,27.246,62.754,99.9502
253,254,4561,1213,2213,335.025,51.2533,38.7467,99.9966
254,255,37085,2591,2272,168.94299999999996,42.4517,47.5483,99.9689
255,256,13335,3306,2232,321.341,23.6452,66.3548,99.2851
256,257,536081,3005,2701,140.536,5.91933,84.0807,47.5629
257,258,2888,1164,2221,126.456,25.2495,64.7505,99.993
258,259,521,50,2199,135.455,38.5873,51.4127,99.769
259,260,4234,1917,2220,134.44299999999998,49.7688,40.2312,99.9968
260,261,64748,2180,2318,301.527,3.3624300000000003,86.6376,99.9898
261,262,21449,126,2320,149.105,30.8671,59.1329,99.7708
262,263,19762,709,2306,115.878,27.3977,62.6023,99.9355
263,264,1537,2899,2250,138.906,2.11914,87.8809,99.9914
264,265,15417,586,2373,308.822,45.4105,44.5895,99.9367
265,266,3236,1197,2287,152.59799999999996,13.8644,76.1356,99.8946
266,267,129074,1029,2518,334.494,62.4288,27.5712,95.0997
267,268,2419,197,2306,303.23,16.7678,73.2322,99.9654
268,269,3224,1916,2312,140.497,51.0294,38.9706,99.9783
269,270,561,3379,2305,141.528,63.1335,26.8665,99.9693
270,271,3751,2777,2355,325.766,13.9793,76.0207,99.9105
271,272,1923,2426,2342,127.24,47.1019,42.8981,99.9905
272,273,5289,2689,2370,130.28799999999998,47.4131,42.5869,99.9816
273,274,368368,2038,2842,310.457,14.3941,75.6059,95.6514
274,275,123730,229,2553,304.298,18.5828,71.4172,99.5584
275,276,20228,2318,2455,135.62,13.8974,76.1026,99.9232
276,277,4130,485,2410,305.816,51.652,38.348,99.8309
277,278,1242,2621,2404,136.32299999999998,70.1696,19.8304,99.9941
278,279,159867,576,2701,346.211,52.1014,37.8986,98.8154
279,280,3544,2047,2429,288.297,71.6863,18.3137,99.9974
280,281,1777,2391,2429,145.031,46.9364,43.0636,99.9959
281,282,1112,409,2445,316.503,39.7255,50.2745,99.9884
282,283,35078,2204,2543,123.131,40.7172,49.2828,99.9271
283,284,4014,3029,2473,137.859,11.9528,78.0472,99.9821
284,285,308667,967,2939,156.879,45.1527,44.8473,97.2685
285,286,6267,1324,2536,138.58100000000002,37.6854,52.3146,99.9396
286,287,3284,3058,2537,238.789,42.6614,47.3386,99.9186
287,288,862,3117,2533,137.727,10.315,79.685,99.9844
288,289,921,476,2555,349.107,54.3423,35.6577,99.995
289,290,3760,399,2574,348.173,54.9509,35.0491,99.9164
290,291,53786,2488,2697,186.402,89.2939,0.706098,99.8301
291,292,5596,2376,2578,202.291,49.419,40.581,99.9914
292,293,2128,1161,2568,133.446,5.7635,84.2365,99.9898
293,294,5212,2948,2595,238.787,43.3506,46.6494,99.8469
294,295,4028,1260,2615,135.366,14.4384,75.5616,99.9967
295,296,5440,2562,2631,235.008,44.7753,45.2247,99.9979
296,297,754,2745,2638,260.42400000000004,49.8336,40.1664,98.4452
297,298,716,2636,2648,146.912,70.4182,19.5818,99.9969
298,299,578,2723,2654,239.827,43.1394,46.8606,99.9946
299,300,33140,1276,2781,124.076,41.4529,48.5471,99.9938
300,301,1951,2678,2666,295.722,51.9842,38.0158,99.996
301,302,10477,2754,2763,130.278,75.1902,14.8098,99.9975
302,303,82060,224,2905,329.77,46.7721,43.2279,99.8627
303,304,23727,67,2927,315.585,27.0513,62.9487,96.4619
304,305,55186,3272,2983,141.24200000000005,25.4631,64.5369,99.6738
305,306,13288,2500,2814,237.356,50.3222,39.6778,99.9603
306,307,593,1743,2787,162.12,45.2032,44.7968,99.9863
307,308,8719,1839,2833,159.95600000000005,45.7468,44.2532,99.9867
308,309,632,2421,2800,204.095,50.5208,39.4792,99.9861
309,310,29257,2738,2907,60.1733,85.7323,4.26769,99.964
310,311,25890,2513,2898,318.515,68.1449,21.8551,99.9933
311,312,4194,757,2866,306.648,23.7864,66.2136,99.9801
312,313,23507,1443,2937,70.8341,67.0316,22.9684,99.9622
313,314,685,3366,2884,141.686,26.1833,63.8167,99.9133
314,315,648,688,2892,141.127,32.2548,57.7452,99.998
315,316,1472,653,2917,306.968,24.2698,65.7302,99.6304
316,317,1733,1279,2919,332.494,78.8629,11.1371,99.9887
317,318,1300,2642,2926,312.7940000000001,63.8615,26.1385,99.9953
318,319,776,632,2950,139.55200000000002,33.4055,56.5945,99.982
319,320,4512,2600,2972,46.0087,82.1631,7.8368699999999984,99.9817
320,321,96112,432,3144,305.67,22.1082,67.8918,99.9069
321,322,3527,3318,2977,133.114,21.6662,68.3338,99.3669
322,323,8706,3084,3021,308.6020000000001,57.458,32.542,99.976
323,324,1032,1674,2967,72.9164,67.8973,22.1027,99.997
324,325,9860,2475,2997,292.131,26.7715,63.2285,99.9827
325,326,841,572,2969,104.487,69.8551,20.1449,99.997
326,327,18338,658,3079,338.175,25.7053,64.2947,99.8248
327,328,20605,2653,3078,291.686,59.3611,30.6389,99.9752
328,329,559,3353,3003,136.025,20.1556,69.8444,99.9284
329,330,682,2698,3004,206.233,52.9493,37.0507,99.9946
330,331,5880,2538,3048,100.889,81.9449,8.05508,99.989
331,332,1464,1638,3045,70.8711,67.5576,22.4424,99.9973
332,333,3497,1848,3069,134.19899999999998,40.5409,49.4591,99.9979
333,334,1347,259,3066,313.575,19.5241,70.4759,99.9511
334,335,28427,2369,3116,158.156,65.9682,24.0318,62.5139
335,336,9111,2818,3096,102.163,23.0366,66.9634,99.9987
336,337,891,3200,3064,165.517,50.7105,39.2895,99.9146
337,338,4145,1922,3103,288.163,27.3931,62.6069,99.9379
338,339,24331,1309,3161,116.837,70.3691,19.6309,99.9826
339,340,15689,91,3186,329.5080000000001,21.8073,68.1927,99.725
340,341,18447,1798,3163,73.0482,65.77600000000001,24.224,99.9399
341,342,4876,1207,3142,145.917,10.469,79.531,99.9877
342,343,1273,3067,3128,142.457,22.6186,67.3814,99.9947
343,344,160844,289,3486,132.714,54.4374,35.5626,62.7532
344,345,247915,2740,3377,146.572,34.2562,55.7438,95.9183
345,346,3679,2357,3162,290.567,28.4521,61.5479,99.9951
346,347,5160,2283,3184,214.38,53.0195,36.9805,99.9948
347,348,6437,2182,3210,281.656,57.9929,32.0071,99.9987
348,349,1359,468,3193,124.659,67.4403,22.5597,99.9877
349,350,5056,656,3202,227.917,74.637,15.363,99.9906
350,351,979,1217,3196,321.423,69.1509,20.8491,99.9977
351,352,2520,2221,3240,325.567,1.28222,88.7178,99.9923
352,353,11903,1401,3269,126.889,60.7805,29.2195,99.9626
353,354,2568,550,3252,335.414,20.0035,69.9965,99.9323
354,355,32978,1722,3328,118.513,37.5477,52.4523,99.8421
355,356,118177,912,3422,197.22,57.7834,32.2166,99.9393
356,357,11299,1116,3286,310.281,32.8512,57.1488,99.9701
357,358,34525,2159,3354,289.21,27.3235,62.6765,99.9119
358,359,12419,595,3338,101.253,71.5572,18.4428,100.004
359,360,1184,1793,3269,288.029,22.8642,67.1358,99.9865
360,361,5593,1279,3293,153.10399999999996,31.83,58.17,99.9933
361,362,3719,2298,3293,307.095,64.2476,25.7524,99.9973
362,363,1501,285,3278,332.82199999999995,20.8513,69.1487,99.9804
363,364,3509,3314,3320,295.995,25.128,64.872,99.8098
364,365,10283,1167,3342,309.743,71.9861,18.0139,99.9932
365,366,30622,1453,3374,136.80100000000002,25.6353,64.3647,99.9528
366,367,840,2140,3290,149.345,0.410858,89.5891,99.9967
367,368,29641,488,3401,330.3230000000001,14.7936,75.2064,99.8698
368,369,1535,2393,3322,139.78799999999998,4.93071,85.0693,99.9908
369,370,507,2103,3316,145.053,1.57449,88.4255,99.9729
370,371,3284,3344,3374,103.411,44.9066,45.0934,99.8665
371,372,35527,1271,3439,137.363,60.8142,29.1858,99.9918
372,373,4421,701,3383,306.683,16.0025,73.9975,99.9967
373,374,24757,2351,3436,329.385,42.9974,47.0026,99.9072
374,375,1384,2320,3342,198.98,54.4959,35.5041,99.9971
375,376,4718,2847,3374,136.481,16.049,73.95100000000002,99.9866
376,377,51749,1583,3483,115.782,70.6848,19.3152,99.9941
377,378,10752,3272,3411,353.189,59.8689,30.1311,99.8454
378,379,40123,2037,3450,204.356,60.5093,29.4907,98.811
379,380,3824,2785,3405,149.715,20.0866,69.9134,99.993
380,381,2379,1871,3422,224.797,61.1409,28.8591,99.9847
381,382,5351,669,3461,112.321,40.1752,49.8248,99.9849
382,383,2812,3238,3449,333.216,19.6779,70.3221,99.9848
383,384,6969,1848,3484,313.688,58.5097,31.4903,99.9785
384,385,14692,1754,3527,288.289,55.4336,34.5664,99.9871
385,386,31475,3294,3687,143.681,45.1812,44.8188,98.6751
386,387,7219,3209,3517,144.95600000000005,45.0099,44.9901,99.8399
387,388,17943,2954,3527,113.94,6.40575,83.5943,99.9646
388,389,1776,2120,3493,290.868,24.6998,65.3002,99.9887
389,390,12616,580,3532,100.419,70.4832,19.5168,99.9513
390,391,7718,2488,3506,286.686,44.648,45.352,99.9401
391,392,1994,3162,3516,127.611,73.3467,16.6533,99.9957
392,393,1160,924,3510,152.111,1.09254,88.9075,99.953
393,394,4701,3274,3531,131.80700000000002,74.2921,15.7079,99.9615
394,395,177411,867,3790,169.02,11.6597,78.3403,99.5406
395,396,14975,2059,3596,296.418,5.23952,84.7605,99.9699
396,397,62099,2382,3638,121.752,63.0409,26.9591,99.9818
397,398,14241,2173,3584,290.828,23.8809,66.1191,99.9576
398,399,5947,962,3564,119.761,23.3632,66.6368,99.9413
399,400,27884,1255,3650,148.58100000000005,24.4858,65.5142,99.962
400,401,1583,473,3544,318.769,15.8221,74.1779,99.9504
401,402,1566,1419,3546,216.655,77.543,12.457,99.991
402,403,1486,30,3566,116.5,32.2681,57.7319,99.578
403,404,1986,1222,3549,198.058,55.4915,34.5085,99.9982
404,405,2000,1828,3560,328.51199999999994,54.99100000000001,35.009,99.981
405,406,66038,1928,3714,141.611,41.9336,48.0664,80.5425
406,407,5420,1346,3579,162.355,13.0385,76.9615,99.9663
407,408,21494,3009,3625,282.678,29.7354,60.2646,99.9805
408,409,195524,2877,3927,318.478,1.54546,88.4545,66.6218
409,410,1022,59,3592,129.439,1.97528,88.0247,99.6972
410,411,20225,163,3633,322.973,1.20351,88.7965,99.8376
411,412,129428,1544,3802,154.44,42.2189,47.7811,99.9242
412,413,22355,328,3673,331.957,16.8986,73.1014,99.9089
413,414,5694,1667,3614,118.001,17.3786,72.6214,99.9348
414,415,6524,3199,3634,131.3,72.726,17.274,99.9854
415,416,14125,1025,3662,130.72799999999998,64.9919,25.0081,99.9984
416,417,3814,1588,3649,154.761,18.4373,71.5627,99.9942
417,418,2533,1742,3641,136.545,25.5838,64.4162,99.9922
418,419,12298,63,3731,127.334,28.4666,61.5334,99.0824
419,420,3538,3160,3672,312.69,45.8815,44.1185,99.9948
420,421,9390,2222,3705,110.689,6.27036,83.7296,99.9171
421,422,21403,2186,3757,319.389,3.70042,86.2996,99.8207
422,423,12061,3099,3754,151.888,43.8977,46.1023,99.9416
423,424,5636,2497,3726,132.644,57.1201,32.8799,99.9957
424,425,6779,2033,3723,289.969,20.7055,69.2945,99.9894
425,426,7472,577,3736,110.803,40.8752,49.1248,99.991
426,427,5904,1746,3749,326.361,36.0589,53.9411,99.9909
427,428,519,3070,3700,121.387,67.5213,22.4787,99.992
428,429,3434,154,3724,321.623,67.7892,22.2108,99.9938
429,430,2946,3008,3717,107.431,64.5596,25.4404,99.9522
430,431,1248,205,3720,2.92234,85.8024,4.19764,99.9969
431,432,2935,396,3722,146.014,4.3224300000000015,85.6776,99.998
432,433,6769,1192,3784,93.2987,72.8045,17.1955,99.9976
433,434,561,3175,3730,142.8,71.5834,18.4166,99.9991
434,435,1066,2985,3752,317.317,57.3961,32.6039,99.9981
435,436,3175,235,3768,302.882,61.2527,28.7473,99.9657
436,437,16272,401,3806,336.278,8.033,81.96700000000001,99.8324
437,438,8166,2950,3801,105.568,64.4309,25.5691,99.9496
438,439,8533,3212,3810,322.502,57.9065,32.0935,99.9783
439,440,17488,141,3839,138.216,31.9999,58.0001,99.976
440,441,50983,2525,3904,323.059,9.95513,80.0449,99.8847
441,442,1242,288,3775,6.00747,83.1128,6.8872100000000005,99.9985
442,443,11764,628,3835,116.855,23.4361,66.5639,99.992
443,444,732561,1696,4386,325.519,31.7459,58.2541,92.4429
444,445,3219,1336,3811,145.045,27.1722,62.8278,99.9954
445,446,2692,1797,3811,322.492,46.3715,43.6285,99.9979
446,447,9238,3042,3835,319.077,55.2932,34.7068,99.9901
447,448,3771,2381,3816,111.08,10.8906,79.1094,99.9793
448,449,5099,1962,3864,320.066,4.88574,85.1143,99.7196
449,450,14896,257,3871,324.1020000000001,19.2602,70.7398,99.9878
450,451,83400,1946,4038,129.644,4.56847,85.4315,32.3992
451,452,2986,30,3889,134.48,70.4129,19.5871,99.7879
452,453,1301,58,3858,128.871,36.5239,53.4761,99.928
453,454,1086,3123,3837,312.7990000000001,55.7395,34.2605,99.9977
454,455,785,1759,3843,117.891,16.9729,73.0271,99.9978
455,456,10544,2273,3878,139.767,71.3682,18.6318,99.9966
456,457,1841,2352,3852,343.141,48.5808,41.4192,99.9968
457,458,1861,1347,3856,119.056,6.55956,83.4404,99.9903
458,459,745,511,3850,105.281,66.8375,23.1625,99.9833
459,460,11319,2138,3921,342.6430000000001,53.0189,36.9811,99.9637
460,461,2110,3295,3871,321.821,30.4827,59.5173,99.6638
461,462,959,3199,3853,313.48,54.1059,35.8941,99.9972
462,463,24811,3121,3923,149.709,45.1822,44.8178,99.9142
463,464,19255,370,3938,294.88,62.5206,27.4794,99.8827
464,465,1143,2977,3880,137.488,17.0939,72.9061,99.9955
465,466,608,3225,3874,131.493,75.2985,14.7015,99.999
466,467,4150,2383,3910,261.326,67.9874,22.0125,99.9883
467,468,61807,628,4033,6.763610000000001,80.32300000000002,9.67697,99.9371
468,469,7596,1328,3915,290.6040000000001,73.9383,16.0617,99.9833
469,470,809,3341,3899,326.7390000000001,21.7594,68.2406,99.3927
470,471,753,2866,3897,337.1269999999999,32.0182,57.9818,99.9982
471,472,685,3267,3898,146.564,46.6859,43.3141,99.9949
472,473,1499,1911,3930,290.645,35.0954,54.9046,99.9908
473,474,2406,2033,3931,133.343,51.5453,38.4547,99.9707
474,475,607,2060,3907,141.921,74.4885,15.5115,99.9874
475,476,45702,2238,4051,108.096,7.05302,82.947,100.007
476,477,2913,3295,3944,140.094,17.2259,72.7741,99.8829
477,478,12327,125,3969,158.875,63.0036,26.9964,99.7199
478,479,3682,1963,3940,318.934,37.0793,52.9207,99.8961
479,480,2550,252,3957,21.6312,79.1375,10.8625,99.9973
480,481,577,3346,3959,329.889,20.2867,69.7133,99.3091
481,482,47793,2432,4168,330.06,17.6488,72.3512,81.5364
482,483,1569,438,3972,345.999,79.7411,10.2589,99.4094
483,484,894,3322,3978,328.19699999999995,21.3112,68.6888,99.8227
484,485,1352,1156,3972,287.1090000000001,72.2757,17.7243,99.9928
485,486,2605,1089,3988,19.616,81.6147,8.38533,99.6348
486,487,9467,1628,4023,306.119,3.53901,86.461,42.3773
487,488,70149,322,4126,328.7530000000001,4.34424,85.6558,65.6469
488,489,2180,1556,4003,344.636,76.4921,13.5079,99.9819
489,490,4240,261,4044,320.689,22.0326,67.9674,99.7869
490,491,5171,2335,4063,126.891,57.4692,32.5308,99.9678
491,492,694,237,4003,44.0628,83.2395,6.7605,99.8897
492,493,328767,2887,4415,140.373,20.874,69.126,78.0752
493,494,1978,16,4039,113.773,32.742,57.258,99.7064
494,495,1103,3226,4025,137.108,16.9372,73.0628,99.9682
495,496,569,3300,4018,148.282,52.6108,37.3892,99.7272
496,497,2068,215,4052,284.496,64.6246,25.3754,99.8866
497,498,1073,3258,4031,151.15200000000004,51.9341,38.0659,99.9926
498,499,2689,62,4051,313.101,19.8818,70.1182,99.888
499,500,5548,3309,4092,139.121,25.72,64.28,98.0492
500,501,145319,934,4282,3.62294,76.5158,13.4842,99.9023
501,502,1303,28,4092,114.791,33.3618,56.6382,99.8466
502,503,767,3030,4085,322.015,28.3894,61.6106,99.988
503,504,640,3344,4125,143.239,22.0893,67.9107,99.6366
504,505,1886,71,4147,322.2990000000001,45.6225,44.3775,99.8209
505,506,1080,749,4140,305.148,19.2743,70.7257,99.8114
506,507,5523,170,4191,290.298,37.0959,52.9041,99.9936
507,508,1360,106,4178,328.0540000000001,40.8872,49.1128,99.9819
508,509,11474,721,4237,180.921,62.5618,27.4382,99.8922
509,510,11876,2268,4208,322.621,3.81779,86.1822,99.9383
510,511,736,3344,4214,143.61700000000005,18.4552,71.5448,99.9116
511,512,66837,418,4320,3.4669800000000004,80.1114,9.8886,99.8853
512,513,5235,621,4232,307.228,25.5951,64.4049,99.9143
513,514,533,3308,4215,88.8663,76.8748,13.1252,99.9845
514,515,29948,128,4312,285.86,11.6203,78.3797,99.8987
515,516,2135,1270,4228,157.499,41.9875,48.0125,99.996
516,517,6317,3184,4251,84.0487,80.3078,9.69223,99.9546
517,518,20602,3266,4317,130.988,8.74927,81.2507,99.4266
518,519,1425,38,4253,288.69,35.0173,54.9827,99.8923
519,520,12864,2830,4297,328.3730000000001,18.9455,71.0545,99.9606
520,521,3655,1192,4270,323.43,21.6759,68.3241,99.9347
521,522,531,1144,4259,129.496,7.01214,82.9879,99.9924
522,523,12631,1211,4346,0.163448,75.2264,14.7736,99.9835
523,524,656,3109,4276,117.347,40.3586,49.6414,99.9927
524,525,2132,618,4301,300.945,16.84,73.16,99.9971
525,526,959,2984,4296,117.645,36.8438,53.1562,99.9968
526,527,13536,3098,4361,312.844,9.54105,80.459,99.9717
527,528,14650,679,4354,309.878,21.8147,68.1853,99.9868
528,529,2324,3022,4322,87.1717,77.2335,12.7665,99.9965
529,530,44715,176,4513,132.086,18.2193,71.7807,51.4084
530,531,871,6,4361,318.457,37.753,52.247,99.9302
531,532,849,2329,4328,331.579,21.838,68.16199999999999,99.5167
532,533,7115,2659,4382,288.93,75.2152,14.7848,99.9935
533,534,1143,2362,4340,328.01,3.7202,86.2798,99.9944
534,535,4639,3240,4385,72.2443,78.3235,11.6765,99.991
535,536,126281,741,4593,201.864,60.8143,29.1857,99.9003
536,537,807,1127,4367,322.367,35.8795,54.1205,99.9952
537,538,14249,2820,4403,139.95,22.8372,67.1628,99.9295
538,539,30191,1077,4494,169.71200000000005,82.0962,7.903789999999999,99.9127
539,540,1609,49,4425,140.03799999999998,72.8205,17.1795,99.907
540,541,6396,365,4461,301.82,23.3381,66.6619,99.932
541,542,4495,2553,4461,329.166,6.0408300000000015,83.9592,99.9829
542,543,1942,243,4460,162.011,71.154,18.846,99.9918
543,544,47642,2394,4614,247.748,83.309,6.690989999999998,90.0018
544,545,2563,12,4505,314.541,32.1852,57.8148,99.6984
545,546,731,3318,4467,138.622,55.4873,34.5127,99.8763
546,547,44053,408,4582,320.158,23.0293,66.9707,99.6068
547,548,2171,2506,4535,146.52700000000004,6.79015,83.2099,99.3716
548,549,571,20,4575,316.313,11.0504,78.9496,99.9397
549,550,15841,2535,4646,324.398,13.4639,76.5361,99.8845
550,551,3504,56,4606,309.535,12.4336,77.5664,99.7351
551,552,4486,2222,4610,332.037,3.92204,86.07799999999997,99.9606
552,553,42928,2791,4695,324.488,41.3475,48.6525,99.9097
553,554,7590,2895,4640,334.569,48.0196,41.9804,99.9402
554,555,4356,109,4653,149.861,67.1271,22.8729,99.9124
555,556,32596,1716,4704,152.595,76.1277,13.8723,99.9504
556,557,723,2456,4637,143.253,11.2317,78.7683,99.9737
557,558,7170,1096,4676,321.406,42.8303,47.1697,99.9858
558,559,5114,210,4668,325.36,12.0964,77.9036,99.6497
559,560,5969,1173,4717,286.066,12.2646,77.7354,99.9848
560,561,3471,3096,4713,189.266,68.8741,21.1259,99.9989
561,562,3101,1289,4718,160.202,76.4268,13.5732,99.9851
562,563,3497,2625,4751,174.611,67.4548,22.5452,99.9993
563,564,2194,519,4733,11.5416,73.6165,16.3835,99.7416
564,565,14805,2510,4784,331.091,42.8583,47.1417,92.895
565,566,585,3064,4750,212.08,62.9928,27.0072,99.9992
566,567,1011,2942,4765,309.818,25.6116,64.3884,99.9283
567,568,6882,2725,4779,332.832,16.5512,73.4488,99.964
568,569,3706,3133,4778,315.733,9.86929,80.1307,99.9835
569,570,3124,2324,4780,318.349,26.6062,63.3938,99.7044
570,571,528,2216,4775,99.0829,53.0926,36.9074,99.9736
571,572,1981,3068,4786,321.693,20.1744,69.8256,99.9258
572,573,960,3302,4792,149.369,13.3709,76.6291,99.9878
573,574,1412,2994,4790,322.45,18.808,71.192,99.9347
