,Grain No.,Size [Pixel],center x-coordinate,center y-coordinate,mean azimuth [degree],mean latitude [degree],mean colatitude [degree],Regelungsgrad [%]
0,1,12947,651,113,265.088,28.9308,61.0692,99.8899
1,2,12830,471,143,241.543,5.6842,84.3158,99.937
2,3,1532,812,125,260.619,45.4575,44.5425,99.9792
3,4,820,765,139,44.1898,52.1616,37.8384,99.9917
4,5,633,981,145,256.407,11.0989,78.9011,99.8755
5,6,5641,574,188,238.517,65.7546,24.2454,99.9454
6,7,52913,923,290,88.8926,19.6346,70.3654,97.1767
7,8,3759,711,192,234.80900000000003,64.0586,25.9414,99.9116
8,9,706,963,170,252.364,11.132,78.868,99.9972
9,10,639,638,175,247.45,59.9247,30.0753,99.9939
10,11,36996,501,309,85.75,21.619,68.381,98.8952
11,12,29524,768,355,40.8718,51.3016,38.6984,99.9035
12,13,2820,671,223,31.606,49.9312,40.0688,99.9705
13,14,565,308,199,61.0675,26.3114,63.6886,99.8665
14,15,10540,1281,247,102.812,18.365,71.635,99.711
15,16,27423,1154,309,96.9649,15.3696,74.6304,99.9494
16,17,826,1064,231,41.9012,57.7405,32.2595,99.9986
17,18,150340,542,527,248.675,3.52579,86.4742,52.7333
18,19,4104,630,258,263.92,14.9652,75.0348,99.9299
19,20,14292,1485,296,258.749,45.9825,44.0175,95.4841
20,21,22321,179,347,265.546,27.9571,62.0429,99.9204
21,22,1211,1636,253,221.321,0.373024,89.62700000000002,99.9374
22,23,2259,1395,276,102.739,66.2704,23.7296,99.9902
23,24,145347,1886,623,67.1814,0.390244,89.6098,88.5702
24,25,1307,686,279,89.2179,20.9988,69.0012,99.9942
25,26,83950,1349,457,244.5,56.6421,33.3579,92.7518
26,27,1631,858,319,93.756,32.603,57.397,99.993
27,28,21748,1038,466,107.768,72.8694,17.1306,86.9753
28,29,1545,630,346,58.4254,27.2904,62.7096,99.9967
29,30,712,1563,352,322.029,52.6859,37.3141,99.985
30,31,7181,644,418,277.398,26.0132,63.9868,99.9804
31,32,4350,267,414,44.2018,40.3685,49.6315,99.9948
32,33,572,1542,384,101.637,34.6583,55.3417,99.995
33,34,131763,1550,750,264.835,4.81188,85.1881,78.3188
34,35,819,1647,414,322.093,53.7089,36.2911,99.9916
35,36,666,101,440,51.2118,44.4084,45.5916,99.9
36,37,1064,126,461,58.341,48.0681,41.9319,99.9354
37,38,4819,193,485,183.602,80.61399999999998,9.38601,98.716
38,39,954,97,505,348.159,51.0948,38.9052,99.9317
39,40,742,1070,500,281.066,50.5549,39.4451,99.9494
40,41,7150,953,579,83.8837,22.7735,67.2265,99.7492
41,42,4892,1120,578,293.072,49.7162,40.2838,99.9827
42,43,24442,222,646,297.212,70.4944,19.5056,99.9461
43,44,50708,727,769,91.3996,10.5993,79.4007,99.9476
44,45,2612,709,597,257.126,2.28399,87.71600000000002,99.9959
45,46,693,1401,592,67.9867,44.6805,45.3195,99.9553
46,47,17305,1208,655,73.7545,45.3213,44.6787,99.98
47,48,2614,658,627,89.0162,31.917,58.083,99.9918
48,49,8995,1041,647,97.7531,5.337269999999998,84.6627,99.6173
49,50,6306,1363,633,70.5462,45.4413,44.5587,99.9891
50,51,1092,568,631,65.8245,24.9993,65.0007,99.9895
51,52,2514,108,681,243.689,16.8102,73.1898,99.8014
52,53,1703,526,638,286.914,31.8586,58.1414,99.9827
53,54,605,1288,639,264.978,24.1559,65.8441,99.9934
54,55,2534,2083,675,259.194,4.8057300000000005,85.1943,99.9067
55,56,7986,556,703,95.0513,32.153,57.847,99.8108
56,57,19369,1321,767,57.4127,24.081,65.919,99.9926
57,58,3508,1050,717,239.981,49.495,40.505,99.9899
58,59,120325,1669,1044,289.56,45.8076,44.1924,99.3202
59,60,1836,1138,716,246.595,46.1572,43.8428,99.997
60,61,4678,285,727,88.4901,1.90913,88.0909,99.989
61,62,1282,908,712,230.238,70.6504,19.3496,99.997
62,63,8468,435,757,296.578,70.5652,19.4348,99.9611
63,64,1818,1768,741,46.9563,33.5239,56.4761,99.9834
64,65,639,181,732,237.375,15.6818,74.3182,99.8982
65,66,804,2173,746,258.59,5.124630000000002,84.8754,99.833
66,67,28609,1157,836,276.52,53.97,36.03,99.893
67,68,23686,216,828,239.764,15.1236,74.8764,99.5194
68,69,34444,532,857,49.6045,78.9055,11.0945,88.1995
69,70,4054,972,779,83.8769,16.0565,73.9435,99.3864
70,71,1762,1727,763,247.599,74.4389,15.5611,99.9844
71,72,884,1016,758,236.445,72.3868,17.6132,99.9951
72,73,5857,2244,812,76.5014,14.4934,75.5066,99.8999
73,74,5659,265,782,88.1912,0.702843,89.2972,99.9874
74,75,24043,1041,914,197.487,76.3332,13.6668,99.6475
75,76,3821,1761,827,308.69,60.8023,29.1977,99.9945
76,77,3543,397,838,268.555,29.2972,60.7028,99.9943
77,78,19890,896,892,83.4695,10.0714,79.9286,99.5528
78,79,89708,221,1059,84.2011,10.4499,79.5501,94.3598
79,80,8754,1304,919,268.312,53.5835,36.4165,99.9753
80,81,3480,2270,888,49.7467,58.2491,31.7509,99.9922
81,82,648,371,879,42.351000000000006,37.5113,52.4887,99.9905
82,83,843,2335,883,64.2723,49.0397,40.9603,99.836
83,84,7189,1924,929,246.646,52.5929,37.4071,99.9767
84,85,2710,2068,933,319.088,59.4407,30.5593,99.9701
85,86,6644,792,948,94.0194,26.5469,63.4531,99.9802
86,87,7044,2396,941,2.93366,81.3078,8.692169999999999,99.9702
87,88,146805,2412,1100,87.0138,41.0369,48.9631,85.189
88,89,2984,2306,957,97.0352,44.4342,45.5658,99.9867
89,90,2349,1369,954,142.686,72.8461,17.1539,99.9474
90,91,997,2031,940,248.427,17.3765,72.6235,99.9778
91,92,2224,621,952,264.758,36.1509,53.8491,99.9879
92,93,3536,2356,986,63.5482,10.7396,79.2604,99.9887
93,94,49103,856,1084,254.768,62.2532,27.7468,92.8167
94,95,836,565,959,79.3305,1.60866,88.3913,99.9882
95,96,35085,1158,1059,69.9904,37.3436,52.6564,99.69
96,97,771,461,983,241.365,10.6364,79.3636,99.9555
97,98,1184,2049,994,249.085,18.0493,71.9507,99.9703
98,99,1174,520,998,245.962,9.82642,80.1736,99.9709
99,100,1817,1391,1007,211.565,77.4109,12.5891,99.1595
100,101,19662,416,1081,254.164,15.6103,74.3897,97.7087
101,102,32666,1344,1146,325.182,70.5746,19.4254,99.9076
102,103,4049,1439,1074,73.1677,81.0071,8.99287,99.9727
103,104,8121,2821,1088,75.813,59.9838,30.0162,99.6907
104,105,51830,1877,1149,61.1485,69.2999,20.7001,99.8992
105,106,10507,737,1076,264.266,55.6357,34.3643,99.9307
106,107,840,347,1057,236.036,12.4145,77.5855,99.9908
107,108,17636,3271,1099,177.373,74.0108,15.9892,99.7128
108,109,1598,2761,1097,61.9375,62.0576,27.9424,99.9933
109,110,1090,2893,1074,282.503,56.874,33.126,99.9191
110,111,1917,2978,1100,70.6518,27.8691,62.1309,98.9648
111,112,501,3127,1084,235.844,73.1071,16.8929,99.9558
112,113,7501,3442,1123,182.669,73.6099,16.3901,99.952
113,114,10219,2071,1128,76.0014,76.8548,13.1452,99.9624
114,115,2633,3053,1106,180.496,77.916,12.084,99.9779
115,116,4024,776,1117,83.9921,2.1830700000000003,87.8169,99.9846
116,117,1733,2407,1109,59.666,59.2218,30.7782,99.9951
117,118,1166,513,1102,88.1941,1.63175,88.3682,99.7758
118,119,708,3132,1107,193.328,78.9788,11.0212,99.9764
119,120,8965,2310,1173,53.9051,33.7727,56.2273,99.9811
120,121,13319,3387,1195,194.134,64.6493,25.3507,99.9755
121,122,691,2955,1133,277.825,57.922,32.078,99.9855
122,123,8853,3037,1167,179.46900000000005,73.9255,16.0745,99.9889
123,124,18890,657,1183,264.253,58.249,31.751,99.9579
124,125,2825,3159,1143,185.169,75.1008,14.8992,99.9516
125,126,1312,1239,1144,44.3126,63.4356,26.5644,99.9978
126,127,38177,766,1321,224.096,61.6766,28.3234,99.7325
127,128,76174,3077,1296,101.594,22.4617,67.5383,54.8585
128,129,6811,2787,1180,155.628,70.757,19.243,99.9913
129,130,6280,2425,1179,265.185,6.00356,83.9964,99.9825
130,131,12922,434,1202,258.375,10.5547,79.4453,83.55799999999998
131,132,6597,1215,1201,36.2622,27.8179,62.1821,99.9922
132,133,4977,1098,1181,268.937,32.3861,57.6139,99.9911
133,134,1002,2249,1174,74.8063,73.1438,16.8562,99.9686
134,135,2162,3292,1192,37.2788,23.4405,66.5595,99.9932
135,136,1675,2018,1179,89.6862,21.0849,68.9151,99.9948
136,137,10080,2125,1219,88.8231,8.22993,81.7701,99.9771
137,138,2595,3238,1199,273.759,55.43899999999999,34.561,99.992
138,139,4945,1035,1215,79.0886,12.7533,77.2467,99.9961
139,140,4759,1150,1236,94.7258,9.45359,80.5464,99.9783
140,141,8237,529,1262,87.7028,1.11337,88.8866,99.6594
141,142,20494,1692,1287,356.194,56.5187,33.4813,99.9926
142,143,7499,866,1246,69.8506,20.7402,69.2598,99.995
143,144,4085,2408,1242,40.8127,39.0804,50.9196,99.9835
144,145,1171,2330,1223,252.194,70.4156,19.5845,99.8046
145,146,177971,301,1520,254.454,55.0072,34.9928,89.9082
146,147,21341,1816,1337,84.2269,5.03028,84.9697,99.9413
147,148,8450,1293,1289,260.758,34.2173,55.7827,99.9737
148,149,849,1941,1230,71.2464,20.9024,69.0976,99.9963
149,150,8289,2832,1292,66.4967,53.3808,36.6192,99.9452
150,151,1964,2217,1250,264.078,69.8776,20.1224,99.9923
151,152,2253,2745,1250,71.2845,2.50352,87.4965,99.9836
152,153,28014,3362,1311,58.9763,15.0124,74.9876,99.9711
153,154,1984,2337,1258,42.3387,39.611,50.389,99.9986
154,155,3177,2481,1278,64.8146,33.8968,56.1032,99.7698
155,156,3979,682,1274,85.0751,2.58001,87.42,99.9885
156,157,375662,1079,1619,25.6454,52.535,37.465,61.383
157,158,846,99,1260,80.935,0.0603943,89.9396,99.9481
158,159,9607,1961,1311,193.017,78.9973,11.0027,99.9459
159,160,2180,1380,1280,263.41,37.4802,52.5198,99.9894
160,161,27914,2179,1335,87.9041,14.2089,75.7911,99.8595
161,162,766,223,1283,75.2082,25.5537,64.4463,99.9965
162,163,5093,2340,1315,342.101,48.008,41.992,99.9612
163,164,11270,2734,1332,247.035,59.892,30.108,99.9822
164,165,4525,591,1305,262.064,6.1836,83.8164,99.9855
165,166,13713,1428,1376,102.578,72.4483,17.5517,99.9464
166,167,20641,2390,1378,264.386,26.8961,63.1039,99.7605
167,168,3322,1084,1338,252.907,13.0258,76.9742,99.8859
168,169,910,537,1323,91.416,1.21407,88.7859,99.988
169,170,19743,2846,1407,81.5916,10.4867,79.5133,99.927
170,171,17842,2057,1422,142.495,66.7408,23.2592,99.9534
171,172,109299,2879,1521,253.249,7.932689999999999,82.0673,95.3666
172,173,15256,533,1399,91.4036,29.6564,60.3436,99.7164
173,174,10333,1536,1404,66.1377,8.4202,81.5798,99.9885
174,175,4368,1682,1407,82.4481,13.5829,76.4171,99.8451
175,176,6535,1352,1412,73.5605,23.1643,66.8357,99.9928
176,177,895,1966,1381,227.076,9.79362,80.2064,99.9935
177,178,4323,1613,1411,226.379,9.0286,80.9714,99.9953
178,179,8955,1928,1440,74.6233,17.4872,72.5128,99.9506
179,180,717,2972,1385,235.475,60.2163,29.7837,99.6629
180,181,27633,3353,1480,225.979,76.4177,13.5823,99.651
181,182,2005,3457,1435,321.588,75.8632,14.1368,99.969
182,183,6644,1834,1456,226.274,56.648,33.352,99.9948
183,184,4060,723,1438,195.002,80.5271,9.47289,99.9796
184,185,8400,2916,1469,275.517,21.9194,68.0806,99.97
185,186,3536,2232,1439,142.811,65.9567,24.0433,99.9941
186,187,82287,1884,1666,232.264,13.7903,76.2097,77.8686
187,188,1083135,2669,2468,69.0048,14.6063,75.3937,61.2171
188,189,940,845,1431,80.249,15.1789,74.8211,99.9958
189,190,1016,3093,1438,205.524,59.856,30.144,99.9526
190,191,2369,2520,1454,87.5518,17.6078,72.3922,99.9859
191,192,2878,1302,1473,79.0121,10.465,79.535,99.9874
192,193,14232,1587,1523,16.0967,37.1274,52.8726,63.4496
193,194,569,1454,1474,209.231,63.1763,26.8237,99.9708
194,195,1126,1893,1487,85.147,2.44036,87.5596,99.9822
195,196,5528,3245,1565,53.7582,30.9858,59.0142,99.9344
196,197,13826,1736,1612,227.969,82.0418,7.95825,99.9615
197,198,9198,1637,1623,263.351,15.5001,74.4999,99.9829
198,199,9688,2663,1604,220.601,12.4453,77.5547,99.9964
199,200,6020,3365,1603,43.6253,29.1353,60.8647,99.995
200,201,2778,1511,1604,56.6358,69.2192,20.7808,99.9811
201,202,3333,3423,1623,41.0006,43.2008,46.7992,99.9863
202,203,1939,1168,1596,30.3535,26.4511,63.5489,99.9708
203,204,8043,393,1633,252.773,1.81877,88.1812,99.9727
204,205,2107,3058,1614,47.5233,27.0773,62.9227,99.9927
205,206,1490,2751,1614,352.351,44.2913,45.7087,99.9967
206,207,9060,1247,1673,77.3286,30.7601,59.2399,99.9894
207,208,5203,2854,1654,296.626,74.9173,15.0827,99.9414
208,209,53323,3210,1752,284.937,20.414,69.586,99.5823
209,210,556,458,1642,227.402,77.4752,12.5248,99.9734
210,211,736,2745,1645,83.2543,52.6513,37.3487,99.9843
211,212,1735,3062,1680,263.505,57.1035,32.8965,99.8693
212,213,9653,1191,1723,72.4732,50.4978,39.5022,99.977
213,214,6660,3432,1733,279.12,14.6009,75.3991,99.9678
214,215,51733,567,1778,257.891,7.206069999999999,82.7939,99.827
215,216,108558,2152,1938,266.346,7.661969999999998,82.338,98.7851
216,217,1766,2678,1691,355.11300000000006,46.365,43.635,99.9748
217,218,25507,2795,1804,86.1942,56.1292,33.8708,99.923
218,219,1960,2630,1697,84.92200000000003,56.2436,33.7564,99.9732
219,220,4264,377,1715,277.472,27.3472,62.6528,99.9771
220,221,49158,1823,1835,170.128,76.3151,13.6849,99.9099
221,222,2138,2999,1719,272.704,45.1135,44.8865,99.8673
222,223,5422,2888,1736,118.731,70.855,19.145,99.9734
223,224,1519,3391,1733,86.2952,3.90903,86.09100000000002,99.8241
224,225,1658,1327,1724,44.834,29.388,60.612,99.9963
225,226,802,2688,1764,79.9436,56.8621,33.1379,99.9851
226,227,16100,2925,1822,236.796,76.4149,13.5851,99.8667
227,228,9316,3363,1823,62.7947,40.7449,49.2551,99.9903
228,229,14181,1339,1836,342.204,46.1598,43.8402,99.9548
229,230,458122,388,2300,259.22700000000003,30.1248,59.8752,66.423
230,231,7381,1230,1835,92.1586,4.2609900000000005,85.73899999999998,99.9868
231,232,4579,2723,1849,0.207119,46.4376,43.5624,99.9762
232,233,211235,3211,2075,276.91900000000004,1.72858,88.2714,79.8613
233,234,1441,85,1879,69.7564,36.8515,53.1485,99.958
234,235,2107,137,1908,68.0468,36.1875,53.8125,99.9759
235,236,1412,3225,1874,277.086,41.5494,48.4506,99.9965
236,237,2305,1453,1894,36.1652,26.6354,63.3646,99.9882
237,238,4322,1593,1892,274.137,49.3963,40.6037,99.9957
238,239,2027,1513,1906,352.872,45.7664,44.2336,99.9941
239,240,97278,1142,2021,272.508,13.6545,76.3455,90.0263
240,241,2724,633,1915,239.656,32.3074,57.6926,99.9967
241,242,1221,1420,1923,259.575,9.56962,80.4304,99.9934
242,243,2396,1657,1929,354.0080000000001,50.1787,39.8213,99.9953
243,244,6956,2356,1975,343.1140000000001,51.0887,38.9113,99.9718
244,245,1360,100,1980,71.5803,36.8813,53.1187,99.9591
245,246,998791,1089,2644,263.089,1.3751799999999998,88.6248,67.7646
246,247,2083,2007,1977,349.04,52.6847,37.3153,99.976
247,248,906,1969,1997,343.564,51.7173,38.2827,99.1325
248,249,6810,2906,2028,92.4716,26.6286,63.3714,99.6195
249,250,3388,117,2105,66.9515,34.9398,55.0602,99.9377
250,251,11635,1967,2105,137.82299999999998,75.3002,14.6998,99.9538
251,252,5938,2349,2077,281.643,74.5017,15.4983,99.9744
252,253,728,72,2078,67.8835,35.3887,54.6113,99.9576
253,254,3436,633,2099,79.181,4.65976,85.3402,99.993
254,255,2081,793,2122,270.806,25.9905,64.0095,99.9948
255,256,9442,719,2151,274.392,27.3878,62.6122,99.9505
256,257,1275,2560,2109,339.07199999999995,41.997,48.003,99.9971
257,258,53863,2353,2252,63.6864,1.62678,88.3732,91.3168
258,259,257872,1926,2548,292.545,61.1885,28.8115,60.243
259,260,15634,572,2212,251.21400000000003,1.07859,88.9214,99.9525
260,261,22370,2166,2230,170.28,59.7043,30.2957,99.9953
261,262,6810,2618,2197,79.7305,75.33,14.67,99.9539
262,263,1565,1800,2180,346.247,53.0617,36.9383,99.9432
263,264,22757,658,2275,260.561,12.064,77.936,99.9384
264,265,9540,1562,2252,65.0524,1.96443,88.0356,99.9551
265,266,3596,1113,2252,268.54,47.8381,42.1619,99.9953
266,267,553,3458,2260,80.5724,18.1656,71.8344,99.9454
267,268,563,87,2253,268.434,22.8334,67.1666,99.944
268,269,14648,1688,2314,154.275,73.4075,16.5925,99.8978
269,270,7945,2534,2306,261.012,71.5223,18.4777,99.8926
270,271,3609,1592,2311,300.752,71.1979,18.8021,99.9954
271,272,22448,3211,2397,283.283,20.207,69.793,98.6088
272,273,33771,3390,2462,57.1006,47.6954,42.3046,84.665
273,274,509,88,2331,269.355,22.5951,67.4049,99.989
274,275,1052,2607,2331,48.9449,19.7676,70.2324,99.9961
275,276,1695,2648,2356,78.367,80.3814,9.61863,99.9929
276,277,1156,1520,2365,267.575,47.6867,42.3133,99.9912
277,278,3842,1609,2377,263.258,49.4427,40.5573,99.988
278,279,1014,2518,2375,85.6582,81.5608,8.43924,99.9949
279,280,2314,2575,2383,82.5622,82.4325,7.567539999999998,99.987
280,281,8539,2337,2433,257.659,8.24576,81.7542,99.9777
281,282,1106,2275,2412,67.7202,5.11594,84.8841,99.9908
282,283,23544,1674,2475,112.549,52.3912,37.6088,90.3829
283,284,1085,2615,2417,119.601,59.6319,30.3681,99.9942
284,285,4938,2550,2453,100.118,81.1434,8.856589999999997,99.9609
285,286,7390,660,2491,276.54900000000004,51.697,38.303,56.7625
286,287,514,1587,2460,158.425,69.3856,20.6144,99.994
287,288,922,2363,2484,122.461,61.0906,28.9094,99.9873
288,289,2230,1772,2521,232.426,21.6698,68.3302,99.9626
289,290,1682,2320,2510,292.575,84.3034,5.6966,99.9801
290,291,5211,641,2570,283.856,37.8431,52.1569,99.9931
291,292,15530,803,2606,36.0885,6.68745,83.3126,99.9407
292,293,694,1707,2549,108.054,58.1213,31.8787,99.9389
293,294,681,1667,2554,233.198,31.6495,58.3505,98.741
294,295,11260,603,2655,98.1234,71.3965,18.6035,99.954
295,296,5417,3352,2662,261.41,19.8505,70.1495,99.9942
296,297,12066,2595,2712,105.166,67.4413,22.5587,99.9202
297,298,1557,3414,2682,79.5073,49.4056,40.5944,99.9967
298,299,1241,1631,2672,264.275,19.353,70.64699999999998,99.972
299,300,964,2090,2680,293.324,61.7693,28.2307,99.9974
300,301,1554,1598,2700,247.675,43.9417,46.0583,99.9967
301,302,26589,1107,2789,250.923,37.3028,52.6972,99.8461
302,303,1730,1860,2704,255.697,30.0705,59.9295,99.9959
303,304,12926,2663,2767,274.51,7.6665,82.3335,99.9726
304,305,810,2117,2715,55.1382,25.1288,64.8712,99.9939
305,306,575,3316,2714,188.446,56.7537,33.2463,99.9974
306,307,11245,3188,2751,45.1036,82.0844,7.91564,99.6613
307,308,917,3428,2728,71.9907,47.7781,42.2219,99.9837
308,309,60880,1684,2858,262.449,15.2659,74.7341,99.5541
309,310,22638,3360,2842,285.764,49.1516,40.8484,99.9432
310,311,3493,2150,2756,237.185,30.1615,59.8385,99.9916
311,312,2609,100,2754,260.222,10.9928,79.0072,99.9735
312,313,799,3424,2771,284.626,50.7001,39.2999,99.9819
313,314,1202,3294,2772,47.1582,8.85806,81.1419,99.9949
314,315,10243,1225,2852,103.077,68.4153,21.5847,99.977
315,316,657,2196,2790,57.1231,24.0894,65.9106,99.7988
316,317,38017,162,2988,270.379,22.4939,67.5061,99.979
317,318,16925,3228,2872,348.546,63.5695,26.4305,99.8478
318,319,9468,2548,2837,151.018,77.6039,12.3961,99.9805
319,320,1725,3301,2832,81.1497,44.6381,45.3619,99.9951
320,321,3598,1386,2839,265.386,29.517,60.483,99.9875
321,322,13523,485,2882,115.835,69.6965,20.3035,99.8607
322,323,1878,1308,2855,245.196,73.8767,16.1233,99.9935
323,324,6272,2685,2898,109.524,47.1809,42.8191,99.9892
324,325,3058,2250,2907,279.511,40.0847,49.9153,99.9865
325,326,8419,1383,2934,78.2839,15.5315,74.4685,99.9841
326,327,6041,1102,2948,77.5869,11.4652,78.5348,99.9918
327,328,3134,2039,2943,237.65,38.6421,51.3579,99.9938
328,329,103148,1964,3167,256.789,12.5402,77.4598,88.7249
329,330,2639,2723,2966,84.9933,8.70602,81.294,99.9882
330,331,2673,1867,2966,235.429,38.5135,51.4865,99.9767
331,332,1582,2043,2990,265.55400000000003,7.89262,82.1074,99.9848
332,333,24836,1718,3065,249.588,49.0033,40.9967,99.7593
333,334,2493,1900,3006,186.322,70.5828,19.4172,99.8379
334,335,612,2802,3014,245.673,76.9278,13.0722,99.9161
335,336,3431,2736,3054,306.967,76.5992,13.4008,98.9475
336,337,7635,2975,3082,278.81,56.2328,33.7672,98.5909
337,338,160376,2960,3302,266.933,0.93457,89.0654,97.5413
338,339,20565,2202,3183,124.381,71.6286,18.3714,99.9175
339,340,713,1253,3107,99.1686,63.6592,26.3408,99.9795
340,341,4031,2435,3162,83.7486,11.5503,78.4497,97.2193
341,342,3283,89,3175,85.9156,30.2999,59.7001,99.986
342,343,11170,3080,3186,275.421,55.8188,34.1812,99.972
343,344,37728,1117,3217,257.969,39.8111,50.1889,99.9634
344,345,1617,1229,3141,51.1226,23.8623,66.1377,99.9139
345,346,1290,1272,3169,98.5468,63.2424,26.7576,99.9861
346,347,9112,1702,3218,259.552,6.20218,83.7978,99.9749
347,348,17227,723,3276,113.261,68.0053,21.9947,99.8512
348,349,2286,1326,3179,244.608,2.32526,87.6747,99.9957
349,350,10497,1525,3226,264.875,7.97285,82.0271,99.9832
350,351,2085,1623,3176,268.09,8.37616,81.6238,99.9725
351,352,5519,157,3192,80.4912,45.7364,44.2636,99.9691
352,353,1913,2483,3199,102.578,34.419000000000004,55.581,99.9832
353,354,13301,3187,3249,282.03,58.0018,31.9982,99.9477
354,355,12355,633,3272,269.64,40.3322,49.6678,99.9942
355,356,97218,952,3417,127.938,73.5946,16.4054,99.2502
356,357,6944,530,3243,271.949,40.4585,49.5415,99.9832
357,358,6530,1601,3247,83.5026,9.28283,80.7172,99.982
358,359,2233,2397,3233,89.9615,35.4496,54.5504,99.9756
359,360,24218,1313,3324,56.9021,38.94,51.06,99.9864
360,361,1682,2088,3248,101.535,51.8894,38.1106,99.9887
361,362,720876,2110,3695,87.4728,17.2574,72.7426,49.88399999999999
362,363,3109,102,3267,153.007,81.4826,8.5174,99.9745
363,364,168839,456,3467,91.13,2.0116,87.9884,89.8603
364,365,2073,208,3267,265.995,36.7648,53.2352,99.9955
365,366,4577,1230,3294,94.9828,51.1082,38.8918,99.9699
366,367,1089,1656,3282,324.033,61.5622,28.4378,99.9988
367,368,29459,1842,3355,337.223,67.9055,22.0945,99.9452
368,369,1312,176,3291,275.16900000000004,7.956469999999999,82.0435,99.9834
369,370,14719,2139,3364,103.9,51.2084,38.7916,99.9313
370,371,3341,2074,3305,279.779,46.1041,43.8959,99.8391
371,372,27174,1594,3363,118.256,53.3035,36.6965,99.9457
372,373,908,1101,3309,47.6785,34.628,55.372,99.987
373,374,923,137,3313,266.143,40.4494,49.5506,99.9968
374,375,9903,126,3464,90.4667,3.78362,86.2164,100.001
375,376,527,3407,3325,35.9886,39.9887,50.0113,99.9652
376,377,25964,1201,3463,88.2172,15.2526,74.7474,99.4173
377,378,1300,2024,3352,273.043,19.11,70.89,99.9762
378,379,699,3387,3347,351.096,59.4592,30.5408,99.9823
379,380,6314,179,3418,266.016,40.9735,49.0265,99.9616
380,381,1629,80,3400,90.2129,3.9399,86.0601,99.9909
381,382,4677,589,3387,269.251,18.3847,71.6153,99.9745
382,383,7005,3364,3444,257.357,39.7166,50.2834,99.9944
383,384,2865,2185,3395,266.399,19.7867,70.2133,99.9875
384,385,2688,3410,3427,258.668,40.2638,49.7362,99.9875
385,386,177599,3179,3992,88.8664,2.7829200000000003,87.2171,44.235
386,387,2953,2168,3487,97.4697,20.0751,69.9249,99.9881
387,388,2026,3158,3475,87.2912,37.9763,52.0237,99.9954
388,389,747,3415,3490,53.5985,20.8931,69.1069,99.9813
389,390,1193,79,3502,90.5198,3.98735,86.0126,99.9884
390,391,3919,3079,3495,91.5809,38.1662,51.8338,99.9922
391,392,73119,2853,3615,277.718,54.3336,35.6664,97.3805
392,393,31005,3172,3593,283.659,52.9684,37.0316,99.6212
393,394,990,1118,3518,216.365,24.4507,65.5493,99.8193
394,395,1874,171,3549,206.108,17.3543,72.6457,99.9984
395,396,7087,1114,3598,86.7541,18.7944,71.2056,99.9437
396,397,721,3408,3585,57.114,21.9013,68.0987,99.9785
397,398,2510,3371,3594,54.3643,21.0189,68.9811,99.9839
398,399,27233,737,3649,69.4619,48.4113,41.5887,99.8863
399,400,542,1045,3585,216.925,24.7778,65.2222,99.9889
400,401,737,2838,3588,289.449,68.5514,21.4486,99.9724
401,402,12956,1228,3661,82.8664,15.7972,74.2028,99.9869
402,403,12883,209,3688,55.4471,25.0265,64.9735,99.9228
403,404,12227,551,3665,292.696,80.0786,9.92145,99.9618
404,405,3314,980,3647,63.9139,50.1148,39.8852,99.9865
405,406,787,911,3620,298.481,74.8102,15.1897,99.9236
406,407,12943,3375,3723,86.6338,33.1464,56.8536,99.9879
407,408,845,1033,3650,304.514,74.5038,15.4962,99.9912
408,409,619,949,3668,302.372,72.3497,17.6503,99.959
409,410,180717,1268,3923,160.47299999999996,69.1272,20.8728,81.8651
410,411,3102,1080,3674,88.7237,15.668,74.332,99.9852
411,412,3187,108,3689,59.8781,24.8492,65.1508,99.8712
412,413,26411,275,3762,228.12,2.24684,87.7532,99.8821
413,414,52147,886,3866,73.7465,44.452,45.548,62.3257
414,415,41474,3025,3812,290.703,77.0063,12.9937,82.7539
415,416,22119,2726,3776,275.0,28.5601,61.4399,99.9401
416,417,2087,431,3725,74.7462,35.2741,54.7259,99.5979
417,418,4997,782,3780,94.4202,23.2042,66.7958,99.9832
418,419,27277,556,3810,95.9134,37.7812,52.2188,99.8994
419,420,68673,2070,3937,261.001,26.6104,63.3896,98.992
420,421,3046,1987,3770,67.40100000000001,39.1209,50.8791,99.9913
421,422,52688,725,3926,47.219,53.1945,36.8055,99.955
422,423,1186,427,3773,75.7977,39.0295,50.9705,99.6071
423,424,7182,2835,3798,277.028,69.6355,20.3645,99.9861
424,425,1073,2900,3776,272.362,30.7525,59.2475,99.9965
425,426,2586,1471,3803,220.675,17.4619,72.5381,99.9992
426,427,31568,3136,3880,278.047,54.6897,35.3103,99.9575
427,428,776,2622,3804,50.3769,3.94353,86.0565,99.995
428,429,8285,2241,3864,273.487,34.3977,55.6023,99.9572
429,430,2009,86,3820,269.073,22.506,67.494,99.9902
430,431,2095,132,3837,270.937,39.5855,50.4145,99.9926
431,432,6007,2360,3839,272.861,31.4164,58.5836,99.9526
432,433,4386,431,3850,313.75,65.4675,24.5325,99.156
433,434,3168,1341,3856,81.4703,32.0398,57.9602,99.9865
434,435,63493,2717,4015,84.5691,27.6531,62.3469,90.7052
435,436,45396,428,3968,91.8445,33.8722,56.1278,56.9809
436,437,4436,191,3902,50.227,29.445,60.555,99.8357
437,438,2734,245,3867,314.281,65.0767,24.9233,99.9511
438,439,149922,1896,4251,280.261,34.4102,55.5898,77.3526
439,440,10652,2806,3919,271.699,21.9685,68.0315,99.9817
440,441,3688,109,3888,267.506,11.4979,78.5021,99.9884
441,442,2199,3254,3900,305.47,55.1704,34.8296,99.9888
442,443,4165,496,3920,111.35,32.0621,57.9379,99.9948
443,444,17002,2255,3997,89.1249,25.7223,64.2777,91.1719
444,445,20134,138,4005,29.6378,37.7161,52.2839,99.4894
445,446,2061,993,3945,89.7934,25.0342,64.9658,99.9162
446,447,3275,1893,3964,85.2355,36.0274,53.9726,99.9876
447,448,976,2535,3962,91.9385,0.759567,89.2404,99.9983
448,449,526,1538,3969,64.517,31.2039,58.7961,99.9909
449,450,9280,1034,4038,268.562,78.2313,11.7687,98.9128
450,451,1805,1074,3998,95.8229,58.4303,31.5697,99.9126
451,452,4049,3397,4081,98.3927,35.8048,54.1952,99.9669
452,453,59929,465,4183,266.86400000000003,2.6450400000000003,87.355,96.5594
453,454,5474,2561,4033,86.9231,42.0396,47.9604,99.6582
454,455,1784,1131,4031,80.8759,58.3146,31.6854,99.6888
455,456,9168,1666,4084,53.6452,30.7011,59.2989,99.8886
456,457,5736,1565,4072,211.064,34.6957,55.3043,99.9395
457,458,69737,712,4296,234.679,9.46946,80.5305,99.7791
458,459,3020,468,4064,284.341,29.9086,60.0914,99.9887
459,460,1868,280,4057,281.666,21.4472,68.5528,99.9785
460,461,4629,196,4077,270.406,32.363,57.637,99.964
461,462,5195,2106,4103,91.8825,29.9719,60.0281,99.9883
462,463,1164,2213,4075,283.584,30.1409,59.8591,99.9889
463,464,25237,819,4137,77.2443,37.1844,52.8156,99.9155
464,465,3678,1751,4109,96.2624,9.93498,80.065,99.9729
465,466,28811,194,4167,265.178,8.71922,81.2808,99.8919
466,467,2038,1324,4103,82.2517,59.4213,30.5787,99.9886
467,468,62776,2174,4262,98.4949,2.14099,87.859,99.8626
468,469,557,1837,4120,91.3861,9.21052,80.7895,99.9938
469,470,615,1033,4131,257.93,80.1437,9.85626,99.9892
470,471,7168,1595,4161,249.644,78.8075,11.1925,99.983
471,472,31778,1166,4192,112.447,42.5237,47.4763,99.8874
472,473,973,2069,4148,239.847,18.6024,71.3976,99.9975
473,474,7519,1749,4179,336.965,60.9399,29.0601,99.9943
474,475,1850,2863,4176,270.128,38.9399,51.0601,99.9932
475,476,52704,993,4355,96.9254,44.198,45.802,96.6999
476,477,5262,1362,4192,252.942,41.6509,48.3491,99.9778
477,478,4417,1003,4195,294.228,62.9707,27.0293,99.9952
478,479,2121,1649,4198,87.58,63.6803,26.3197,99.993
479,480,3380,3360,4201,301.946,54.761,35.23900000000001,99.9721
480,481,987,2684,4195,274.307,38.6158,51.3842,99.9938
481,482,1074,1992,4193,71.4156,73.9639,16.0361,99.9889
482,483,788,3076,4205,176.48,61.0039,28.9961,99.9357
483,484,24262,2799,4277,217.446,42.5658,47.4342,99.9911
484,485,3355,842,4247,263.901,58.1906,31.8094,99.993
485,486,15740,1249,4295,104.711,48.9156,41.0844,99.8085
486,487,9182,338,4277,56.0359,45.8848,44.1152,99.9904
487,488,2191,1314,4251,107.858,42.3295,47.6705,99.9742
488,489,1422,1700,4243,211.932,27.3643,62.6357,99.9976
489,490,5336,1583,4262,53.9411,39.5222,50.4778,99.9972
490,491,1972,3357,4252,94.0877,41.2367,48.7633,99.9215
491,492,30831,1699,4383,100.687,5.63114,84.3689,99.9601
492,493,8898,3254,4278,280.971,36.1566,53.8434,99.9675
493,494,11324,133,4300,159.25799999999995,70.1491,19.8509,99.9798
494,495,535,3171,4248,45.1696,8.59478,81.4052,99.9831
495,496,4005,3017,4285,39.3683,10.6534,79.3466,99.9073
496,497,4209,55,4368,157.194,71.02600000000002,18.974,99.8947
497,498,3117,2301,4309,81.8706,10.8272,79.1728,99.9836
498,499,6977,1486,4284,196.497,69.6837,20.3163,99.9763
499,500,13296,219,4346,268.255,28.2525,61.7475,99.9751
500,501,3821,1384,4307,259.145,46.664,43.33600000000001,99.9871
501,502,1291,3074,4290,249.138,17.7669,72.2331,99.9966
502,503,604,1334,4291,107.647,42.6159,47.3841,99.9966
503,504,2775,2601,4299,268.194,0.28804,89.712,99.9771
504,505,2042,2637,4356,105.619,76.529,13.470999999999998,99.9301
505,506,8476,3113,4335,281.803,38.4754,51.5246,99.9855
506,507,1836,2683,4319,99.8088,79.0067,10.9933,99.9641
507,508,5874,2562,4342,116.823,61.0925,28.9075,99.9696
508,509,49520,3174,4425,279.237,38.5371,51.4629,99.9699
509,510,1198,3362,4343,92.0969,55.6109,34.3891,99.9924
510,511,18877,1510,4382,115.536,39.4442,50.5558,99.9466
511,512,3131,527,4342,99.6169,21.6596,68.3404,99.9782
512,513,2052,317,4354,266.445,1.84394,88.1561,99.9513
513,514,13301,1143,4407,97.4328,51.8811,38.1189,99.9652
514,515,3079,105,4402,159.453,69.2963,20.7037,99.9879
515,516,6817,1371,4391,45.1955,34.1135,55.8865,99.9655
516,517,629,1422,4355,302.371,59.0152,30.9848,99.9526
517,518,4444,586,4387,271.612,11.3696,78.6304,99.9698
518,519,734,3315,4372,95.616,42.8395,47.1605,99.9953
519,520,21416,2728,4420,113.59,61.8025,28.1975,99.9463
520,521,3820,460,4410,91.8064,38.1075,51.8925,99.8244
521,522,2123,2533,4393,270.224,0.610306,89.3897,99.995
522,523,911,1249,4381,108.932,40.7306,49.2694,99.989
523,524,2357,2883,4386,269.63,51.0673,38.9327,99.9772
524,525,6389,1227,4427,109.415,40.5852,49.4148,99.9924
525,526,1184,272,4393,134.41899999999998,56.4368,33.5632,99.9815
526,527,7374,1620,4451,280.548,17.9296,72.0704,99.9926
527,528,625,3375,4397,92.9878,54.8261,35.1739,99.9951
528,529,500,324,4392,267.312,2.50228,87.4977,99.9876
529,530,21268,337,4452,236.188,24.6621,65.3379,99.9811
530,531,883,2326,4407,274.546,33.2149,56.7851,99.9977
531,532,1881,1326,4426,107.56,40.1308,49.8692,99.9798
532,533,4746,2590,4443,268.225,65.8331,24.1669,99.9704
533,534,3896,2855,4445,244.829,43.4624,46.5376,99.7612
534,535,8444,601,4461,270.971,10.9614,79.0386,99.975
535,536,1783,155,4448,140.326,55.9753,34.0247,99.9473
536,537,5031,2344,4470,75.9789,42.9698,47.0302,99.9489
537,538,2490,906,4458,102.673,39.5848,50.4152,99.912
538,539,1107,530,4456,268.67900000000003,6.22861,83.7714,99.961
539,540,2501,1312,4468,108.018,40.8435,49.1565,99.9889
540,541,1918,1544,4453,115.22,34.5197,55.4803,99.9894
541,542,1050,84,4478,156.968,70.4283,19.5717,99.983
542,543,3002,495,4479,273.508,10.2935,79.7065,99.9921
543,544,855,1266,4480,107.315,41.3314,48.6686,99.9815
544,545,698,2506,4467,113.818,78.1931,11.8069,99.9892
545,546,6311,1458,4483,110.824,35.8193,54.1807,99.847
546,547,1751,2912,4483,247.977,44.1498,45.8502,99.9243
547,548,1627,731,4480,120.031,40.5405,49.4595,99.955
548,549,672,193,4482,79.7976,20.9689,69.0311,99.9909
549,550,1139,839,4488,103.008,39.6457,50.3543,99.9882
550,551,532,130,4494,136.666,57.361,32.639,99.9849
