,Grain No.,Size [Pixel],center x-coordinate,center y-coordinate,mean azimuth [degree],mean latitude [degree],mean colatitude [degree],Regelungsgrad [%]
0,1,3230,339,42,36.9815,71.6499,18.3501,99.7456
1,2,3100,931,53,198.802,61.9914,28.0086,99.9307
2,3,31135,796,134,196.621,59.9754,30.0246,99.9144
3,4,30923,576,158,17.6906,2.21465,87.7854,99.7607
4,5,507,1637,42,190.08900000000003,11.0062,78.9938,99.9761
5,6,49724,1030,168,188.202,16.5609,73.4391,96.054
6,7,2272,1839,73,196.913,28.0426,61.9574,99.6819
7,8,2826,1543,65,190.143,6.45316,83.5468,99.8062
8,9,2402,1279,55,186.87,6.14811,83.8519,99.9375
9,10,17668,1355,106,187.23,5.78454,84.2155,99.9812
10,11,973,669,64,12.8304,0.658691,89.3413,99.9804
11,12,13493,1771,121,189.898,10.9673,79.0327,99.9763
12,13,199490,403,454,25.3764,2.91079,87.0892,98.7056
13,14,4197,328,70,34.9127,71.7338,18.2662,99.9823
14,15,3552,941,98,195.477,58.3259,31.6741,99.9777
15,16,105206,1355,271,191.181,39.3836,50.6164,99.958
16,17,685,663,98,12.4688,1.38087,88.6191,99.9943
17,18,1581,1593,114,20.2822,8.04568,81.9543,99.9947
18,19,3379,1715,135,6.2563900000000015,47.2788,42.7212,99.9906
19,20,10987,1146,199,99.8514,86.2026,3.79736,99.9286
20,21,1394,1824,191,192.82,13.1237,76.8763,99.9939
21,22,12687,1790,247,21.0966,9.68769,80.3123,99.8707
22,23,810,207,212,16.0429,2.66303,87.337,99.9814
23,24,579,1673,210,191.093,39.4066,50.5934,99.9336
24,25,24494,750,283,26.8346,27.7442,62.2558,99.5848
25,26,1114,657,226,178.25599999999997,46.8863,43.1137,99.9926
26,27,599,454,236,15.0473,3.71839,86.2816,99.9795
27,28,1026,1054,238,131.517,84.7236,5.27639,99.9835
28,29,12453,1723,300,4.1081699999999985,45.8652,44.1348,99.8669
29,30,116336,1664,501,14.872,8.89725,81.1027,76.55199999999998
30,31,884,213,285,173.94099999999997,50.0165,39.9835,99.9823
31,32,1222,1052,288,125.304,82.9516,7.0483699999999985,99.9797
32,33,572,1392,302,4.36637,46.4505,43.5495,99.9619
33,34,4332,565,330,199.024,2.06759,87.9324,99.9965
34,35,14885,1025,378,40.0714,75.1827,14.8173,81.2496
35,36,1739,660,344,178.59099999999995,44.008,45.992,99.9955
36,37,2535,704,360,21.6645,41.4551,48.5449,99.9669
37,38,5247,1823,360,149.77700000000004,72.8755,17.1245,99.9873
38,39,526,1079,348,190.283,6.40079,83.5992,99.9888
39,40,7769,840,375,123.47,81.4985,8.5015,99.9633
40,41,1240,1455,365,174.612,28.702,61.298,99.9812
41,42,1443,1132,388,195.94,81.5173,8.482669999999999,99.9719
42,43,15091,1405,473,4.97624,47.3274,42.6726,99.8857
43,44,6869,715,419,185.084,26.157,63.843,99.9221
44,45,15988,915,451,21.7396,42.2577,47.7423,99.9163
45,46,266963,773,814,203.431,14.0956,75.9044,96.4212
46,47,7425,241,488,177.804,49.6619,40.3381,99.9073
47,48,3083,1121,457,19.6939,42.8478,47.1522,99.4842
48,49,596,778,446,193.276,11.4511,78.5489,99.5641
49,50,705,1163,451,189.154,81.2064,8.79359,99.9761
50,51,7064,1211,508,202.183,9.46197,80.538,99.9304
51,52,14227,1074,564,199.82,45.2033,44.7967,99.9338
52,53,1315,1284,520,11.1134,47.719,42.28100000000001,99.3687
53,54,2114,1318,542,192.573,23.5663,66.4337,99.9597
54,55,19651,1593,586,161.77200000000005,77.6697,12.3303,99.8795
55,56,516,1839,549,207.612,1.78183,88.2182,99.9617
56,57,10057,1447,600,218.024,2.40247,87.5975,99.9167
57,58,1664,1169,574,9.51182,5.04066,84.9593,99.8264
58,59,1171,642,568,17.5588,56.1772,33.8228,99.9738
59,60,950,1255,564,10.8335,18.3412,71.6588,99.9858
60,61,688,290,563,22.108,66.3293,23.6707,99.939
61,62,6992,1359,614,24.6331,0.174347,89.8257,99.8285
62,63,7046,1251,619,197.586,9.89368,80.1063,99.949
63,64,3963,902,650,348.505,78.7414,11.2586,99.9566
64,65,61568,1150,804,213.805,20.2073,69.7927,97.6518
65,66,2027,1843,698,212.394,16.9004,73.0996,99.9293
66,67,36066,1427,739,28.4771,56.4962,33.5038,99.9057
67,68,573,1593,669,9.35423,51.6668,38.3332,99.6444
68,69,3914,969,726,6.5079,82.1065,7.893489999999999,99.9808
69,70,781,1372,712,179.102,24.0526,65.9474,99.9917
70,71,15925,284,772,18.8812,56.1163,33.8837,99.9543
71,72,2460,1267,773,182.495,13.0348,76.9652,99.9954
72,73,77122,1577,922,207.981,9.42078,80.5792,99.6717
73,74,1150,1273,815,182.915,19.563,70.437,99.9912
74,75,4926,1229,847,206.278,5.27077,84.7292,99.9874
75,76,21677,1772,906,24.4127,55.6354,34.3646,99.8215
76,77,4271,375,861,21.9528,58.3024,31.6976,99.9534
77,78,508,1297,857,182.191,24.5175,65.4825,99.9519
78,79,6465,247,884,208.853,10.3375,79.6625,99.9872
79,80,47225,1358,998,187.455,63.9176,26.0824,99.8344
80,81,15751,358,974,171.377,55.4542,34.5458,99.8158
81,82,2623,243,966,173.07299999999995,53.69,36.31,99.9804
82,83,4785,1711,993,200.39,33.3779,56.6221,99.9887
83,84,10525,1161,1050,92.0633,76.7406,13.2594,99.2245
84,85,20640,303,1077,208.946,18.2332,71.7668,99.9412
85,86,16073,1781,1121,34.4495,70.0285,19.9715,99.9264
86,87,1161,1823,1023,198.279,69.8763,20.1237,99.8071
87,88,3655,455,1078,230.424,22.4841,67.5159,99.5227
88,89,5095,707,1117,212.888,44.9934,45.0066,99.9496
89,90,22374,1053,1156,105.345,76.7642,13.2358,99.8921
90,91,36662,887,1215,210.889,7.1215199999999985,82.8785,99.9092
91,92,49371,405,1225,220.88,47.0763,42.9237,99.8925
92,93,2120,765,1115,27.5578,53.5433,36.4567,99.9808
93,94,21940,1669,1170,31.6984,53.5246,36.4754,99.9832
94,95,1182,594,1123,29.8647,53.0592,36.9408,99.9545
95,96,265535,1437,1361,198.327,5.45981,84.5402,99.6122
96,97,3857,1428,1146,11.8176,49.4169,40.5831,99.9314
97,98,2509,242,1153,16.3723,15.3855,74.6145,99.983
98,99,10277,610,1191,197.102,13.7358,76.2642,99.9918
99,100,47792,696,1325,23.8312,5.23027,84.7697,99.5057
100,101,590,209,1166,217.952,8.71534,81.2847,99.9742
101,102,5546,1823,1216,39.3359,71.0597,18.9403,99.9594
102,103,791,290,1168,203.549,10.8681,79.1319,99.995
103,104,1071,802,1196,27.4854,53.9612,36.0388,99.8829
104,105,1463,647,1216,193.821,4.17488,85.8251,99.8018
105,106,3146,220,1254,217.431,8.75896,81.241,99.9848
106,107,535,810,1254,17.782,26.318,63.682,99.0355
107,108,107284,447,1542,23.7152,4.34321,85.6568,98.7125
108,109,628,546,1331,19.4604,5.31744,84.6826,99.9227
109,110,46640,1045,1448,202.389,56.3419,33.6581,99.8872
110,111,9910,283,1365,170.09,71.1634,18.8366,99.9441
111,112,8747,830,1394,134.547,73.275,16.725,99.916
112,113,2095,630,1399,130.656,71.1818,18.8182,99.9621
113,114,2040,574,1435,221.503,44.7438,45.2562,99.9841
114,115,46911,753,1561,229.735,58.3144,31.6856,99.6599
115,116,1533,517,1459,22.5266,4.17966,85.8203,99.9466
116,117,83262,1357,1689,13.0537,81.7213,8.27866,99.716
117,118,628,1024,1535,195.313,56.2174,33.7826,99.9949
118,119,548224,1147,2043,204.028,7.974089999999999,82.0259,96.9943
119,120,11826,268,1638,211.05900000000003,2.49518,87.5048,99.7709
120,121,1056,1739,1599,190.237,2.93249,87.0675,99.9485
121,122,1882,1646,1621,190.954,43.6619,46.3381,99.9802
122,123,17750,1740,1725,10.4432,22.5256,67.4744,97.4486
123,124,30965,1594,1735,149.548,76.725,13.275,99.9404
124,125,11111,451,1720,192.685,0.771362,89.2286,99.9706
125,126,657,768,1691,42.6751,84.8923,5.10768,99.9548
126,127,45151,329,1849,202.414,18.3569,71.6431,99.9934
127,128,9345,229,1805,356.713,71.9769,18.0231,99.9322
128,129,54605,528,1906,15.0236,10.2262,79.7738,98.3401
129,130,1170,1805,1850,18.8239,12.3624,77.6376,99.9816
130,131,929,1708,1837,9.5752,7.2530199999999985,82.74700000000001,99.9065
131,132,49911,1643,1960,25.4127,36.8365,53.1635,99.4962
132,133,1166,1507,1850,159.08,75.7986,14.2014,99.9881
133,134,962,1559,1852,310.805,84.2921,5.70795,99.8603
134,135,35449,823,1926,355.653,77.4763,12.5237,99.8523
135,136,1415,1776,1872,17.8688,11.8864,78.1136,99.988
136,137,1913,1652,1889,9.22962,0.651947,89.3481,99.9891
137,138,3115,1799,1954,18.9327,13.3458,76.6542,99.9747
138,139,2374,1383,1941,14.4411,27.2796,62.7204,99.9471
139,140,4276,225,2027,208.693,4.58016,85.4198,99.9718
140,141,1052,1392,1979,178.025,72.1134,17.8866,99.9592
141,142,6688,305,2029,0.144293,34.5731,55.4269,99.9704
142,143,5814,989,2049,213.407,15.2594,74.7406,99.7542
143,144,725,506,2060,13.8516,1.52296,88.477,99.8442
144,145,813764,947,2584,17.7151,3.45718,86.5428,90.3214
145,146,601,906,2086,193.993,5.81313,84.1869,99.9887
146,147,3055,1016,2101,207.885,36.6541,53.3459,99.9336
147,148,538,225,2093,195.569,20.0161,69.9839,99.991
148,149,4039,249,2131,17.9795,6.18461,83.8154,99.9343
149,150,1392,1248,2165,355.64,39.5235,50.4765,99.9532
150,151,924,232,2169,11.9869,1.42323,88.5768,99.9596
151,152,818,1798,2246,203.429,1.0537299999999998,88.9463,99.9547
152,153,542,740,2280,202.584,14.3491,75.6509,99.8678
153,154,776,1048,2277,11.6476,1.34349,88.6565,99.9264
154,155,8132,875,2323,8.17027,1.82328,88.1767,99.9916
155,156,15540,1130,2352,210.808,0.307861,89.6921,99.9954
156,157,1899,784,2318,14.8199,16.5287,73.4713,99.9842
157,158,2508,1367,2366,183.418,51.0509,38.9491,99.9764
158,159,11191,1442,2641,182.793,50.2816,39.7184,99.9721
159,160,1010,406,2578,193.412,46.7281,43.2719,99.9846
160,161,6603,1661,2640,174.84900000000005,54.4559,35.5441,99.9888
161,162,2151,1748,2696,175.38099999999997,55.4881,34.5119,99.9828
162,163,10018,1170,2775,183.547,49.6206,40.3794,99.9194
163,164,10834,1045,2842,189.812,24.4228,65.5772,99.9442
164,165,3908,232,2841,17.1133,16.7548,73.2452,99.9694
165,166,3063,797,2834,209.778,63.3655,26.6345,99.7639
166,167,29687,549,2892,205.024,4.25349,85.7465,99.3036
167,168,9252,777,2901,207.105,61.9665,28.0335,99.9665
168,169,4440,345,2900,166.977,56.1918,33.8082,99.8989
169,170,10247,911,2914,190.544,29.2264,60.7736,99.9397
170,171,6645,254,2914,139.892,78.0028,11.9972,99.9414
171,172,5752,1027,2917,17.8908,26.2535,63.7465,99.913
172,173,748,684,2926,12.1205,4.01492,85.9851,99.8976
173,174,527,1115,2946,192.536,27.9205,62.0795,99.9181
174,175,1001,709,2943,15.9304,15.4566,74.5434,99.9481
175,176,594,1622,2952,202.888,29.6463,60.3537,99.8467
