,Grain No.,Size [Pixel],center x-coordinate,center y-coordinate,mean azimuth [degree],mean latitude [degree],mean colatitude [degree],Regelungsgrad [%]
0,1,24668,251,293,282.219,17.4489,72.5511,99.9841
1,2,6279,318,233,281.301,17.394000000000002,72.60600000000002,99.9796
2,3,8707,624,253,291.165,9.26622,80.7338,99.9408
3,4,19080,502,284,277.076,54.1299,35.8701,99.9459
4,5,872,713,207,102.737,40.5993,49.4007,99.8749
5,6,531,809,203,103.906,42.6523,47.3477,99.9612
6,7,978,667,211,290.213,10.2139,79.7861,99.9391
7,8,1109,790,220,98.1373,40.1175,49.8825,99.9652
8,9,13422,897,262,262.75,59.8254,30.1746,99.9547
9,10,6423,750,260,97.264,40.4417,49.5583,99.9903
10,11,2391,1137,238,101.696,0.411942,89.5881,99.9946
11,12,902,685,278,268.569,62.2377,27.7623,99.9886
12,13,1254,557,265,103.651,34.6239,55.3761,99.9771
13,14,42624,1504,323,272.12,2.71526,87.2847,99.6697
14,15,9126,1299,300,97.4726,33.8399,56.1601,99.9767
15,16,6484,1185,301,280.54900000000004,4.22411,85.7759,99.9862
16,17,50544,1840,350,277.63,24.7038,65.2962,99.941
17,18,928,1109,278,269.0,62.1517,27.8483,99.9975
18,19,6399,2020,325,115.065,79.8634,10.1366,99.9614
19,20,10188,1089,334,283.874,0.298904,89.7011,99.9686
20,21,19440,2181,333,101.152,28.6987,61.3013,99.9117
21,22,1448,985,302,263.092,59.7767,30.2233,99.8669
22,23,1372,2430,309,260.624,57.5241,32.4759,99.9686
23,24,5768,747,321,288.082,21.2706,68.7294,99.9802
24,25,22163,2734,348,300.337,65.3191,24.6809,99.9848
25,26,30937,2603,409,278.616,31.3505,58.6495,99.8434
26,27,1174,2378,311,275.383,17.7656,72.2344,99.9948
27,28,523,3138,312,280.183,27.7251,62.2749,99.9535
28,29,2990,3057,326,106.739,36.1039,53.8961,99.6278
29,30,12523,2897,394,98.8983,15.4813,74.5187,99.9853
30,31,1845,2314,341,260.11,56.7105,33.2895,99.9575
31,32,1626,172,341,95.6887,8.544989999999999,81.455,99.9352
32,33,4978,1251,357,96.9852,12.447,77.553,99.9888
33,34,2222,923,335,260.527,59.2045,30.7955,99.9851
34,35,6483,499,363,277.431,53.9647,36.0353,99.847
35,36,3314,1028,357,119.522,42.3246,47.6754,99.7322
36,37,1262,384,345,100.385,33.6126,56.3874,99.9482
37,38,16157,2407,400,289.512,69.8515,20.1485,99.8751
38,39,71089,3078,565,268.53700000000003,86.3832,3.61682,59.8189
39,40,5527,2211,396,279.73900000000003,41.9204,48.0796,99.8781
40,41,7504,3313,398,265.282,72.3036,17.6964,99.9762
41,42,1015,3179,361,273.363,36.5661,53.4339,99.9787
42,43,82744,869,492,284.502,23.0057,66.9943,99.2874
43,44,2055,3225,387,268.453,70.9709,19.0291,99.9868
44,45,118012,1662,554,278.828,9.12252,80.8775,81.2697
45,46,8536,2057,418,283.3520000000001,55.4543,34.5457,99.991
46,47,8551,1041,429,121.187,41.3954,48.6046,99.6414
47,48,2135,1170,384,268.237,61.8776,28.1224,99.9961
48,49,55698,543,535,292.312,78.0725,11.9275,75.2311
49,50,2798,326,402,274.974,57.3174,32.6826,99.989
50,51,793,220,391,273.78700000000003,36.4057,53.5943,99.9816
51,52,11423,2297,444,94.3455,1.69347,88.3065,99.9863
52,53,75830,1240,605,289.685,52.8453,37.1547,99.5744
53,54,2267,266,411,274.273,21.6808,68.3192,99.9956
54,55,3820,3178,424,273.833,12.2471,77.7529,99.9858
55,56,22363,2864,511,270.681,23.1555,66.8445,99.8956
56,57,3407,1179,430,118.506,41.3579,48.6421,99.9302
57,58,3092,2497,460,117.704,41.5996,48.4004,99.4063
58,59,820,212,449,273.555,36.9256,53.0744,99.9779
59,60,1202,246,451,273.693,37.1888,52.8112,99.992
60,61,61265,356,615,278.393,43.27,46.73,99.8207
61,62,5194,3181,487,237.634,71.6631,18.3369,99.956
62,63,122581,2217,630,101.916,31.9498,58.0502,74.655
63,64,748,3329,473,266.456,65.5136,24.4864,99.9843
64,65,5442,151,523,110.032,61.1904,28.8096,99.7368
65,66,1166,210,499,112.124,61.9892,28.0108,99.8426
66,67,956,2542,497,111.299,14.3308,75.6692,99.9899
67,68,1162,1102,500,288.616,22.0396,67.9604,99.9769
68,69,4271,2605,524,275.454,22.0689,67.9311,99.9447
69,70,1262,2666,523,273.327,21.9149,68.0851,99.9743
70,71,3392,2026,548,289.9770000000001,51.1701,38.8299,99.3474
71,72,1782,1408,539,105.654,69.2373,20.7627,99.6517
72,73,5322,2772,564,104.182,84.0313,5.96867,98.4086
73,74,15784,2549,619,115.873,42.287,47.713,99.6931
74,75,6646,2671,584,107.494,1.86868,88.1313,99.9601
75,76,1500,3199,578,97.3766,66.4109,23.5891,99.4066
76,77,530,753,569,292.105,64.2022,25.7978,99.9905
77,78,2166,825,589,95.37,3.37065,86.6293,99.9814
78,79,6787,702,623,285.639,51.9172,38.0828,99.9636
79,80,1140,1857,591,77.3941,80.4454,9.55463,99.961
80,81,909,759,599,290.47,21.0668,68.9332,99.9866
81,82,21124,2804,693,117.239,83.1937,6.806310000000001,99.9503
82,83,3404,1059,638,299.243,85.7417,4.2583,99.9837
83,84,641,853,626,286.293,20.1322,69.8678,99.982
84,85,611,3193,629,275.077,7.78573,82.2143,99.9796
85,86,2582,770,646,111.856,40.8665,49.1335,99.9935
86,87,1016,943,636,235.901,86.8109,3.18914,99.9924
87,88,972,912,654,239.453,86.9996,3.00042,99.9945
88,89,12994,790,725,94.7858,32.01,57.99,99.8736
89,90,12171,1885,684,104.5,80.40100000000002,9.59899,99.9708
90,91,29448,3013,773,116.611,44.6166,45.3834,99.3055
91,92,29740,1423,724,104.173,40.5171,49.4829,99.6272
92,93,4626,2663,672,273.314,23.0509,66.9491,99.9868
93,94,11654,2492,734,275.336,29.3398,60.6602,98.4606
94,95,2363,2425,701,271.507,24.2708,65.7292,99.9836
95,96,832,907,689,269.518,7.8124,82.1876,99.9844
96,97,13925,1704,756,278.796,27.8667,62.1333,99.9442
97,98,2441,695,724,280.974,27.42,62.58,99.9878
98,99,13073,559,761,288.098,12.1095,77.8905,99.6695
99,100,16085,2604,775,285.307,26.896,63.104,99.961
100,101,20637,929,774,210.561,83.9082,6.09175,99.9492
101,102,4254,1100,753,118.141,38.7341,51.2659,99.9923
102,103,19373,1892,801,91.7728,16.369,73.631,99.9079
103,104,4544,402,761,281.644,13.0179,76.9821,99.9512
104,105,739,2402,747,90.2405,13.5387,76.4613,99.9923
105,106,22468,493,882,273.10200000000003,64.9328,25.0672,99.671
106,107,531,2767,754,74.1351,86.5475,3.4525300000000003,99.9989
107,108,20642,2325,839,277.337,25.7047,64.2953,99.9507
108,109,8503,689,806,284.657,64.8311,25.1689,99.9866
109,110,18977,2731,857,96.9808,29.3094,60.6906,99.9365
110,111,11181,264,817,251.226,72.7752,17.2248,99.9393
111,112,1647,1064,793,105.944,2.72997,87.27,99.9916
112,113,5755,2425,833,102.676,43.3565,46.6435,99.9166
113,114,599,1299,785,98.4405,11.6922,78.3078,99.9959
114,115,16739,1745,865,108.596,40.0338,49.9662,99.958
115,116,7136,1431,835,92.9526,55.2603,34.7397,99.8376
116,117,1505,1263,808,140.969,78.1521,11.8479,99.9754
117,118,3029,1184,819,99.0659,5.64823,84.3518,99.9851
118,119,13051,2875,867,100.549,29.931,60.069,99.9524
119,120,819,162,831,228.614,81.8351,8.16491,99.9697
120,121,1136,1316,814,105.198,54.9339,35.0661,99.9915
121,122,4544,1090,847,287.483,56.7611,33.2389,99.7934
122,123,10789,2198,868,107.633,44.1496,45.8504,99.8943
123,124,1541,128,845,225.695,81.555,8.44497,99.909
124,125,1336,1518,816,277.806,28.9948,61.0052,99.9917
125,126,579,386,805,284.154,10.0887,79.9113,99.9878
126,127,4135,2094,833,287.062,11.8237,78.1763,99.9511
127,128,3487,604,856,272.909,63.1616,26.8384,99.9869
128,129,21678,819,915,99.6628,24.2087,65.7913,99.9432
129,130,6262,919,868,270.202,29.1018,60.8982,99.9822
130,131,3403,1023,853,279.10400000000004,23.4965,66.5035,99.6479
131,132,27003,1610,962,264.944,61.358,28.642,99.2355
132,133,2528,2507,846,290.1620000000001,9.18539,80.8146,98.9588
133,134,3584,3181,867,280.502,45.833,44.167,99.9872
134,135,2347,387,838,279.837,17.2363,72.7637,99.9884
135,136,565,2969,833,265.78700000000003,15.0052,74.9948,99.9761
136,137,1064,1985,857,269.533,40.9253,49.0747,99.2462
137,138,14169,321,902,104.291,7.1947600000000005,82.8052,99.9416
138,139,33791,3028,975,120.65,74.9129,15.0871,70.2433
139,140,10101,1335,893,112.527,40.1332,49.8668,99.8916
140,141,773,2953,863,282.428,26.4421,63.5579,99.6622
141,142,3425,2606,875,291.955,65.3977,24.6023,99.9781
142,143,8436,2073,906,286.743,46.6406,43.3594,99.9181
143,144,8430,1152,900,105.754,79.2851,10.7149,99.9714
144,145,721,2458,873,274.025,40.3674,49.6326,99.992
145,146,895,690,864,100.007,16.3695,73.6305,99.9829
146,147,1712,201,903,216.816,79.9881,10.0119,99.9922
147,148,9541,1478,928,104.647,28.155,61.845,99.2938
148,149,15362,1293,971,271.013,45.6125,44.3875,99.7712
149,150,13462,714,944,97.5309,32.5436,57.4564,99.9514
150,151,5562,2497,913,108.256,44.8276,45.1724,99.4559
151,152,791,636,892,102.766,23.4797,66.5203,99.9819
152,153,1967,1941,896,266.343,27.0097,62.9903,99.9703
153,154,1258,3345,911,96.028,17.2241,72.7759,99.9327
154,155,13317,1789,945,274.437,27.2817,62.7183,99.8943
155,156,2259,1985,923,232.426,69.98100000000001,20.019,99.8486
156,157,1197,2947,911,92.6014,61.3429,28.6571,99.7389
157,158,599,2585,909,12.2756,88.988,1.01201,99.9923
158,159,6798,1082,1002,283.786,55.6428,34.3572,99.2505
159,160,2208,2391,929,99.7804,18.1037,71.8963,99.9814
160,161,713,419,923,280.907,12.5026,77.4974,99.9877
161,162,557,970,918,218.61900000000003,80.0603,9.93969,99.9806
162,163,3160,3188,959,104.08,56.0253,33.9747,99.9675
163,164,29129,649,1088,273.856,43.1795,46.8205,99.8754
164,165,1390,143,971,102.841,1.4166,88.5834,99.7179
165,166,1729,926,945,269.661,21.3811,68.6189,99.8716
166,167,14157,1837,1011,273.208,37.8622,52.1378,58.2579
167,168,6723,2589,982,163.701,88.2068,1.7932400000000002,99.832
168,169,8756,2054,988,277.034,1.04935,88.9507,99.8929
169,170,2578,2197,986,274.914,21.2113,68.7887,99.9372
170,171,1454,275,953,279.186,35.21,54.79,99.9935
171,172,1190,454,955,96.974,2.00519,87.9948,99.9943
172,173,6078,1458,1002,107.86,41.1813,48.8187,99.3792
173,174,22885,2302,1047,274.032,20.5101,69.4899,99.8453
174,175,536,2522,950,125.892,52.968,37.032,99.9881
175,176,15514,2469,1025,101.362,18.1021,71.8979,99.0286
176,177,3863,394,974,279.148,13.4205,76.5795,99.9848
177,178,1377,2243,971,113.319,34.0319,55.9681,99.9741
178,179,3884,3124,992,118.272,40.6459,49.3541,99.9861
179,180,526,2694,968,111.946,80.1727,9.8273,99.9865
180,181,1699,1145,975,289.96,52.8081,37.1919,99.9112
181,182,14036,2820,1015,99.4359,75.6199,14.3801,98.9088
182,183,3920,2145,997,264.14,69.44,20.56,99.4303
183,184,9754,257,1016,282.194,5.4966800000000005,84.5033,91.5442
184,185,8611,1015,1026,282.7940000000001,34.1291,55.8709,99.4722
185,186,953,1395,982,102.947,28.2658,61.7342,99.9724
186,187,2280,1988,1008,102.881,45.8204,44.1796,98.1591
187,188,13118,2668,1030,279.335,44.4707,45.5293,99.2779
188,189,1657,529,997,281.896,10.1386,79.8614,99.8792
189,190,4288,368,1020,267.797,31.9974,58.0026,99.8996
190,191,984,1276,1003,272.98400000000004,45.1599,44.8401,99.718
191,192,4708,1563,1025,15.2226,86.4877,3.51232,97.8427
192,193,1650,1677,1006,123.597,61.5922,28.4078,99.7063
193,194,5576,1231,1035,108.41,46.1912,43.8088,99.4342
194,195,11468,2866,1078,93.8058,24.1357,65.8643,99.7857
195,196,22174,883,1110,97.848,34.7564,55.2436,99.9152
196,197,4469,555,1042,99.3711,9.5919,80.4081,99.9786
197,198,5435,3168,1061,106.862,18.2697,71.7303,99.96
198,199,2193,1169,1035,306.015,62.8775,27.1225,99.222
199,200,621,858,1025,267.421,7.97675,82.0232,99.9952
200,201,1134,161,1044,106.52,55.4826,34.5174,99.983
201,202,4481,788,1066,87.738,16.6899,73.3101,99.9832
202,203,1570,1424,1046,287.276,52.4089,37.5911,99.988
203,204,748,445,1037,91.1038,24.5411,65.4589,99.9798
204,205,25548,1294,1135,270.95,34.0976,55.9024,99.8331
205,206,5418,1842,1074,99.3842,5.4911699999999986,84.5088,99.9776
206,207,4122,232,1086,286.061,23.1771,66.8229,99.9969
207,208,3483,1522,1079,295.031,49.8294,40.1706,99.965
208,209,1780,432,1073,85.9349,33.6623,56.3377,99.9911
209,210,52643,1963,1179,297.74,63.7024,26.2976,99.5183
210,211,1138,2110,1073,281.809,6.27979,83.7202,99.9829
211,212,7790,348,1106,137.509,79.5363,10.4637,99.9686
212,213,1572,2711,1078,279.33,53.5036,36.4964,99.9927
213,214,6947,1762,1128,104.955,25.8809,64.1191,99.9747
214,215,14314,513,1147,96.6885,34.1932,55.8068,99.566
215,216,603,692,1081,275.413,50.9307,39.0693,99.9904
216,217,10024,2545,1130,287.916,10.9188,79.0812,99.8003
217,218,4261,1083,1108,100.963,38.9932,51.0068,99.9834
218,219,2662,1145,1106,275.6,34.9431,55.0569,99.9827
219,220,10797,1460,1130,101.006,25.8642,64.1358,99.206
220,221,892,295,1089,97.8027,8.54796,81.452,99.9979
221,222,15495,3041,1158,106.315,11.5181,78.4819,99.3508
222,223,777,1574,1102,110.445,23.1131,66.8869,99.9914
223,224,2853,2137,1110,300.608,65.94,24.06,99.9866
224,225,1494,1190,1105,102.909,44.3299,45.6701,99.9916
225,226,2220,196,1120,279.638,32.2531,57.7469,99.9782
226,227,8922,2700,1148,276.106,14.9746,75.0254,99.9678
227,228,3002,419,1134,92.3805,2.27816,87.7218,99.9741
228,229,2353,1020,1129,107.403,14.2231,75.7769,99.9911
229,230,8141,2458,1171,273.156,42.1673,47.8327,99.3657
230,231,1255,2630,1123,287.953,16.6733,73.3267,99.984
231,232,6074,3167,1158,268.311,0.881683,89.1183,99.9688
232,233,1853,279,1145,260.172,45.0634,44.9366,99.9818
233,234,2523,1621,1152,109.829,24.65,65.35,99.9914
234,235,6027,2816,1161,107.719,65.0809,24.9191,99.9814
235,236,2454,1678,1146,284.411,60.4454,29.5546,99.9238
236,237,1880,2893,1146,209.048,74.4667,15.5333,99.9752
237,238,6334,2286,1176,109.131,72.3568,17.6432,99.9758
238,239,14716,2186,1201,112.255,38.504,51.496,99.9676
239,240,923,113,1153,236.575,69.7484,20.2516,99.9601
240,241,2137,1559,1159,111.608,39.1127,50.8873,99.9892
241,242,831,1105,1157,284.813,1.71862,88.2814,99.9906
242,243,8863,214,1218,285.856,7.81563,82.1844,99.9844
243,244,3952,1059,1183,107.326,16.8262,73.1738,99.9405
244,245,8410,948,1202,261.986,64.9736,25.0264,99.7841
245,246,870,2107,1164,101.082,29.0256,60.9744,99.9907
246,247,1730,1816,1180,292.404,67.7412,22.2588,99.9322
247,248,1276,1150,1172,278.915,10.0549,79.9451,99.9832
248,249,808,2413,1174,276.562,42.4449,47.5551,99.9876
249,250,17454,333,1264,113.953,69.5538,20.4462,99.9473
250,251,6106,1520,1206,122.907,62.287,27.713,99.8805
251,252,1948,319,1194,260.594,43.2301,46.7699,99.9435
252,253,807,148,1191,234.03,67.2894,22.7106,99.9757
253,254,8130,768,1231,89.62899999999998,17.636,72.36399999999998,99.9663
254,255,26350,2884,1273,253.222,68.9151,21.0849,99.8411
255,256,6702,1709,1225,121.888,56.3215,33.6785,99.9857
256,257,3679,2974,1224,276.217,5.03403,84.96600000000002,98.1639
257,258,515,67,1217,284.139,19.6117,70.3883,99.8251
258,259,658,2622,1198,114.835,37.5892,52.4108,99.9742
259,260,1104,117,1205,236.087,69.9682,20.0318,99.8617
260,261,2393,1601,1209,287.2390000000001,17.5131,72.4869,99.9938
261,262,2064,2377,1210,91.6429,28.6433,61.3567,99.9922
262,263,734,444,1197,273.517,19.2266,70.7734,99.9826
263,264,966,607,1200,274.875,42.63800000000001,47.362,99.9681
264,265,1412,1647,1209,107.935,48.8815,41.1185,99.9749
265,266,1136,1374,1203,273.505,5.582000000000002,84.41799999999998,99.993
266,267,720,266,1214,99.8625,10.2789,79.7211,99.9914
267,268,1194,1135,1211,277.68,51.2642,38.7358,99.9923
268,269,5475,2593,1259,286.861,15.4748,74.5252,99.938
269,270,2237,1167,1235,272.897,39.095,50.905,99.957
270,271,1203,862,1213,95.9683,17.4521,72.5479,99.9928
271,272,5827,1402,1250,278.172,57.776,32.224000000000004,99.9628
272,273,13853,2704,1258,101.93,21.7345,68.2655,99.9622
273,274,3926,1022,1246,115.14,38.7825,51.2175,99.9518
274,275,23490,682,1313,273.808,32.2639,57.7361,99.5956
275,276,3595,1301,1241,273.643,15.4485,74.5515,99.8094
276,277,2147,3187,1244,100.708,13.1294,76.8706,99.9967
277,278,1538,3138,1232,312.486,80.8331,9.16691,99.9917
278,279,2444,2427,1245,86.7721,6.08334,83.9167,99.972
279,280,1417,429,1246,273.993,20.0137,69.9863,99.9858
280,281,8952,2301,1289,113.429,70.0266,19.9734,99.9446
281,282,2220,132,1304,281.493,15.524,74.476,99.9774
282,283,1052,511,1247,285.42,15.4479,74.5521,99.9056
283,284,1508,3063,1261,292.823,82.7907,7.209289999999998,99.9742
284,285,9866,1491,1294,108.943,27.5017,62.4983,98.7251
285,286,6164,862,1289,267.71,44.8365,45.1635,99.9539
286,287,3587,1196,1283,110.528,31.6629,58.3371,99.9927
287,288,1770,1123,1274,281.996,48.2895,41.7105,99.977
288,289,5367,943,1289,260.84,20.8743,69.1257,99.9888
289,290,4155,1249,1300,278.182,53.8688,36.1312,99.9784
290,291,938,1922,1262,276.105,70.0169,19.9831,99.9921
291,292,1145,2147,1263,106.606,32.3972,57.6028,99.9817
292,293,20243,3139,1371,291.235,72.1099,17.8901,99.8523
293,294,1056,1749,1277,273.759,64.4342,25.5658,99.9968
294,295,1091,2535,1282,96.3978,14.7418,75.2582,99.9316
295,296,10082,1042,1321,280.389,52.1918,37.8082,99.9057
296,297,1072,72,1315,101.586,25.0472,64.9528,99.0649
297,298,3017,477,1290,135.679,75.5536,14.4464,99.9703
298,299,1380,107,1315,282.536,15.5646,74.4354,99.9462
299,300,1134,2113,1293,272.402,29.6972,60.3028,99.9936
300,301,9093,388,1355,142.5,74.312,15.6879,99.9498
301,302,10801,496,1384,277.021,19.0451,70.9549,98.8359
302,303,646,1590,1292,122.605,29.2335,60.7665,99.9891
303,304,1262,2484,1297,94.3425,7.31326,82.6867,98.2042
304,305,2177,1308,1298,95.9245,33.0297,56.9703,99.9875
305,306,28998,2003,1371,275.407,5.97676,84.0232,98.6826
306,307,19711,2472,1356,95.9966,37.8549,52.1451,99.1572
307,308,9549,1376,1342,93.757,8.95755,81.0424,99.9474
308,309,7624,2642,1356,286.433,17.3867,72.6133,99.9758
309,310,582,1640,1298,104.473,51.5193,38.4807,99.9569
310,311,9978,2171,1346,276.316,46.8241,43.1759,99.9788
311,312,1628,1153,1317,116.518,41.4167,48.5833,99.9865
312,313,10301,1831,1351,270.741,27.2503,62.7497,99.9703
313,314,1373,3018,1322,249.15,84.4167,5.58328,99.989
314,315,2904,231,1327,108.222,18.2952,71.7048,99.9988
315,316,1897,2885,1330,270.862,22.7514,67.2486,99.9902
316,317,48953,1608,1468,293.668,55.2178,34.7822,99.7146
317,318,5789,1667,1349,274.225,58.1578,31.8422,99.9863
318,319,2999,453,1331,103.574,25.802,64.19800000000001,99.7015
319,320,966,2785,1332,282.002,19.9446,70.0554,99.9909
320,321,4441,1282,1365,277.25,47.5975,42.4025,99.9895
321,322,1489,2724,1349,239.189,75.2026,14.7974,99.9641
322,323,1854,2256,1360,122.173,73.583,16.417,99.9535
323,324,515,1753,1341,268.276,64.7331,25.2669,99.9967
324,325,13487,1170,1412,101.564,12.6894,77.3106,99.8503
325,326,1108,1106,1353,273.58,47.7142,42.2858,99.9925
326,327,655,3204,1362,99.544,10.8002,79.1998,99.9678
327,328,1589,2829,1356,272.754,10.028,79.972,99.9879
328,329,1555,3047,1364,282.158,20.8831,69.1169,99.8611
329,330,726,189,1354,277.957,10.6394,79.3606,99.994
330,331,3753,2769,1394,132.273,64.6834,25.3166,99.947
331,332,34705,2308,1444,277.332,30.7106,59.2894,99.7556
332,333,15070,644,1413,141.236,74.6985,15.3015,99.9606
333,334,13031,893,1407,104.569,33.8275,56.1725,99.9732
334,335,759,546,1372,280.66900000000004,22.8487,67.1513,99.9878
335,336,28340,320,1468,279.183,14.48,75.52,99.8786
336,337,9715,1869,1440,280.033,7.3391899999999985,82.6608,99.9595
337,338,830,2879,1378,274.733,16.2104,73.7896,99.9956
338,339,2164,1083,1404,276.08,39.9268,50.0732,99.9893
339,340,11742,1426,1459,263.43,14.6258,75.3742,99.9267
340,341,4968,1017,1424,118.056,41.2299,48.7701,98.5119
341,342,1617,2704,1400,107.24,16.4225,73.5775,99.9809
342,343,13323,3003,1437,91.7972,8.00109,81.9989,98.9316
343,344,6777,2852,1442,104.044,38.5804,51.4196,99.9416
344,345,2588,2906,1427,267.784,33.9877,56.0123,99.9887
345,346,4138,554,1435,168.313,74.1806,15.8194,99.9726
346,347,2354,3360,1438,266.113,28.5558,61.4442,99.9674
347,348,2428,2554,1432,267.744,52.0514,37.9486,99.9879
348,349,11135,771,1472,101.87,16.4425,73.5575,99.8691
349,350,10566,1776,1480,107.973,29.1006,60.8994,98.0133
350,351,10475,1345,1494,106.031,49.3322,40.6678,99.4538
351,352,1939,2669,1453,265.485,53.9002,36.0998,99.9648
352,353,808,2118,1436,269.92400000000004,50.9679,39.0321,99.991
353,354,2184,3211,1448,272.874,55.0981,34.9019,99.9913
354,355,592,3318,1447,266.649,28.8269,61.1731,99.972
355,356,5561,1255,1459,189.092,73.8217,16.1783,99.9796
356,357,537,2729,1434,244.972,75.9525,14.0475,99.9899
357,358,904,2609,1449,267.369,53.9013,36.0987,99.9833
358,359,7302,1982,1499,120.283,69.0877,20.9123,99.3129
359,360,691,2356,1473,112.567,43.0929,46.9071,99.9744
360,361,1579,2571,1469,279.032,49.7332,40.2668,99.9637
361,362,6135,213,1503,101.636,7.55058,82.4494,99.9833
362,363,6097,511,1505,96.0385,0.402161,89.5978,99.8628
363,364,3445,1121,1500,101.746,5.0602,84.9398,99.9388
364,365,4614,3242,1532,267.673,28.6676,61.3324,99.9305
365,366,1481,2740,1471,96.1815,1.15798,88.84200000000001,99.9856
366,367,1359,2823,1481,262.584,37.7741,52.2259,99.989
367,368,661,840,1480,104.579,44.4146,45.5854,99.977
368,369,6122,2167,1512,284.353,2.00045,87.9995,99.5437
369,370,1288,903,1477,95.4291,20.6075,69.3925,99.9939
370,371,12801,2532,1565,247.647,82.4209,7.57913,97.5826
371,372,866,3089,1485,149.128,81.9231,8.07686,99.9386
372,373,2400,998,1501,102.956,4.7731900000000005,85.2268,99.6224
373,374,1716,2064,1495,288.051,25.4169,64.5831,99.9881
374,375,15245,2649,1547,110.693,37.7361,52.2639,99.3319
375,376,42156,655,1598,122.293,76.2781,13.7219,99.6714
376,377,1280,2943,1497,162.629,75.32300000000002,14.6771,99.9822
377,378,4605,1912,1538,266.133,6.4963,83.5037,99.9762
378,379,5002,896,1527,92.7239,46.9919,43.0081,99.7747
379,380,880,2794,1505,255.405,58.2984,31.7016,99.9511
380,381,9553,1055,1557,280.965,42.4809,47.5191,99.8074
381,382,889,1194,1509,112.424,23.3778,66.6222,99.9639
382,383,2006,125,1543,333.255,82.4224,7.577560000000001,99.9571
383,384,5897,2373,1545,273.48900000000003,5.64735,84.3526,99.9686
384,385,1183,3362,1531,266.021,28.7763,61.2237,99.9489
385,386,18902,517,1640,113.353,54.4654,35.5346,94.5291
386,387,9370,3155,1564,275.66200000000003,21.1712,68.8288,99.9512
387,388,13751,2938,1567,267.253,13.1449,76.8551,98.9106
388,389,3078,2834,1545,268.491,49.3379,40.6621,99.1596
389,390,1599,3072,1533,95.5282,6.7445,83.2555,99.9907
390,391,603,50,1537,279.38,41.4292,48.5708,99.4025
391,392,3196,255,1546,273.442,21.0203,68.9797,99.9951
392,393,1699,1249,1536,272.583,17.9967,72.0033,99.9953
393,394,529,3002,1522,95.0033,8.88144,81.1186,99.9713
394,395,3807,1834,1554,89.4704,65.3105,24.6895,99.6595
395,396,1822,2105,1546,89.3424,73.8739,16.1261,98.2141
396,397,2151,2778,1548,288.1,14.7732,75.2268,99.9694
397,398,841,946,1546,275.961,55.0518,34.9482,99.9903
398,399,995,174,1568,337.723,81.047,8.953,99.9715
399,400,4889,2294,1582,309.138,72.7824,17.2176,99.8084
400,401,815,1506,1548,288.631,11.4286,78.5714,99.9918
401,402,854,1554,1550,287.386,11.229,78.771,99.9907
402,403,644,55,1569,262.045,36.2946,53.7054,99.7834
403,404,1034,1155,1564,231.029,88.0174,1.98258,99.9962
404,405,10787,1275,1607,286.975,12.7248,77.2752,99.9546
405,406,1921,1199,1568,195.157,88.3718,1.6282299999999998,99.9821
406,407,2230,794,1568,89.9324,15.6921,74.3079,99.8167
407,408,3758,2070,1588,287.297,44.1419,45.8581,99.9814
408,409,7943,2175,1600,285.586,14.7387,75.2613,99.9757
409,410,4678,1369,1599,86.458,9.99413,80.0059,99.9677
410,411,6619,986,1621,103.712,31.879,58.121,99.2509
411,412,6757,1978,1610,289.191,24.8646,65.1354,84.8464
412,413,2132,2243,1608,284.953,41.98,48.02,99.9886
413,414,2612,2434,1602,273.92,26.7092,63.2908,99.9813
414,415,557,383,1584,73.0381,87.59100000000002,2.4090000000000003,99.9982
415,416,2570,3059,1608,110.949,30.4983,59.5017,99.9829
416,417,1565,3348,1604,267.259,29.0112,60.9888,99.979
417,418,16757,250,1655,279.095,19.1281,70.8719,99.9865
418,419,148846,1481,1889,104.699,1.367,88.633,83.8068
419,420,10644,852,1642,102.915,49.0815,40.9185,99.9821
420,421,2418,916,1605,268.218,7.05302,82.947,99.9658
421,422,15772,2779,1653,289.003,64.6108,25.3892,99.9495
422,423,2894,1809,1616,75.8153,77.4961,12.5039,99.9886
423,424,5891,2369,1633,273.681,19.2347,70.7653,99.9758
424,425,4719,1148,1623,100.695,9.97536,80.0246,99.9579
425,426,4667,3120,1629,101.767,22.832,67.168,99.978
426,427,4287,1868,1644,98.5171,32.8128,57.1872,99.9863
427,428,3176,2032,1648,99.0112,71.1316,18.8684,99.9722
428,429,3766,113,1661,286.379,21.7537,68.2463,99.9405
429,430,2589,405,1640,116.153,87.93700000000003,2.06298,99.9965
430,431,10977,3211,1679,292.71,59.0654,30.9346,99.9502
431,432,8401,1692,1660,286.019,4.38245,85.6175,99.9039
432,433,872,2895,1626,93.5301,41.9687,48.0313,99.9904
433,434,644,1928,1630,268.813,12.075,77.925,99.9945
434,435,1185,176,1652,286.699,20.9925,69.0075,99.9871
435,436,829,2687,1636,97.6568,37.3849,52.6151,99.9878
436,437,1531,2499,1646,104.531,41.1789,48.8211,99.7184
437,438,895,1767,1643,82.2076,62.1326,27.8674,99.9966
438,439,3542,1349,1671,89.8667,17.2637,72.7363,99.9681
439,440,21943,3009,1723,284.782,33.5592,56.4408,99.2818
440,441,1924,2908,1667,270.449,47.9991,42.0009,99.979
441,442,31507,1043,1734,279.375,25.3101,64.6899,99.4566
442,443,1783,3340,1670,267.155,29.0385,60.9615,99.9825
443,444,7252,1197,1679,283.389,26.3969,63.6031,99.9867
444,445,16209,2126,1700,309.646,69.9635,20.0365,99.9172
445,446,2630,2677,1697,202.513,80.4917,9.50833,99.9312
446,447,36792,375,1783,272.124,27.1572,62.8428,99.9287
447,448,15673,2459,1728,90.3831,79.7706,10.2294,98.261
448,449,41506,535,1843,108.536,41.2247,48.7753,99.7851
449,450,6433,2276,1691,287.453,6.7001,83.2999,99.6727
450,451,2635,2574,1671,109.507,45.4074,44.5926,99.9828
451,452,9108,1784,1730,109.972,37.3666,52.6334,99.9772
452,453,2136,2410,1691,85.9031,4.2168199999999985,85.7832,99.9926
453,454,3124,1889,1694,98.8964,30.5239,59.4761,99.9798
454,455,1683,3098,1690,112.729,37.7049,52.2951,99.9703
455,456,1008,2339,1690,87.7385,1.27396,88.726,99.9875
456,457,4478,776,1706,269.778,12.9634,77.0366,99.9397
457,458,48577,2817,1817,89.66799999999998,23.1336,66.8664,99.8601
458,459,2090,1954,1711,299.899,12.1611,77.8389,99.873
459,460,5129,1287,1731,100.687,19.0306,70.9694,99.9704
460,461,900,2006,1711,109.541,18.8127,71.1873,99.9968
461,462,3925,3266,1753,102.468,36.2111,53.7889,99.9857
462,463,5057,124,1762,284.711,21.3407,68.6593,99.9149
463,464,4353,1347,1753,150.361,85.6518,4.34817,99.9322
464,465,51154,789,1814,287.6740000000001,74.7059,15.2941,99.8517
465,466,3712,2206,1753,114.273,48.3677,41.6323,99.9847
466,467,2317,3172,1746,282.548,35.0778,54.9222,99.9768
467,468,899,3117,1737,95.73,12.5758,77.4242,99.9924
468,469,16034,229,1821,101.334,28.5929,61.4071,99.9734
469,470,2123,1848,1752,267.173,31.3295,58.6705,99.9916
470,471,7921,2618,1781,176.405,78.9191,11.0809,99.9754
471,472,1957,1899,1751,104.256,77.3596,12.6404,99.9892
472,473,28380,2338,1836,279.655,39.7137,50.2863,99.9368
473,474,2496,1219,1762,97.2643,77.2495,12.7505,99.993
474,475,4629,1953,1799,100.936,28.6976,61.3024,99.2655
475,476,51903,1774,1903,285.769,5.4452300000000005,84.5548,99.8532
476,477,14596,2106,1834,112.736,55.2364,34.7636,99.8803
477,478,1516,2045,1791,118.933,18.2235,71.7765,99.9736
478,479,539,3104,1784,281.344,33.2412,56.7588,99.994
479,480,1039,3142,1790,258.266,47.0257,42.9743,99.909
480,481,37746,3167,1924,280.076,56.6164,33.3836,99.8404
481,482,10072,1373,1831,98.9798,19.6382,70.3618,99.9812
482,483,651,1691,1793,284.748,15.5742,74.4258,99.9876
483,484,6829,1145,1831,116.034,74.8994,15.1006,99.8903
484,485,27547,2533,1883,100.979,10.5414,79.4586,99.1832
485,486,1242,1996,1796,297.567,82.8822,7.11782,99.987
486,487,1481,1259,1805,200.838,84.4522,5.54775,99.9851
487,488,2670,3140,1825,262.655,46.6859,43.3141,99.9797
488,489,12096,3015,1861,98.0578,18.2827,71.7173,99.4631
489,490,9109,1283,1877,107.311,3.99569,86.0043,99.9802
490,491,1242,2207,1831,151.982,75.7085,14.2916,99.9891
491,492,817,3209,1830,260.845,45.7323,44.2677,99.9798
492,493,9662,2015,1905,272.809,28.4771,61.5229,99.6847
493,494,886,115,1852,97.157,34.0286,55.9714,99.9402
494,495,5417,1029,1879,102.66,17.9031,72.0969,99.8924
495,496,9363,1148,1920,112.864,57.175,32.825,99.9602
496,497,13099,926,1904,139.78,71.2055,18.7945,99.9824
497,498,4078,1935,1901,275.165,13.3965,76.6035,99.9673
498,499,10456,2206,1906,288.331,7.80777,82.1922,99.9336
499,500,1826,1228,1911,105.829,80.7665,9.2335,99.965
500,501,848,339,1884,274.337,43.3528,46.6472,99.9972
501,502,4462,255,1911,106.761,58.8469,31.1531,99.9696
502,503,115444,2779,2060,279.202,53.0921,36.9079,97.8783
503,504,514,323,1916,271.418,26.5421,63.4579,99.9956
504,505,6101,670,1938,108.997,34.4246,55.5754,99.9852
505,506,16447,2055,1995,190.013,71.2694,18.7306,99.305
506,507,29357,1021,2067,108.659,37.5091,52.4909,99.4735
507,508,7676,2342,1968,269.856,17.9133,72.0867,99.983
508,509,7027,3267,1976,274.565,53.914,36.086,99.9851
509,510,91863,463,2128,293.246,50.4884,39.5116,82.09899999999998
510,511,7044,866,1976,93.8436,17.1718,72.8282,99.9542
511,512,10778,2228,1994,285.03,48.1481,41.8519,99.8722
512,513,583,3340,1965,98.1999,27.8249,62.1751,99.9457
513,514,663,327,1942,271.296,26.8375,63.1625,99.9925
514,515,11753,255,2000,97.2347,66.1976,23.8024,99.5675
515,516,894,171,1969,104.55,58.2256,31.7744,99.9464
516,517,2633,1101,1980,279.517,25.5433,64.4567,99.978
517,518,3615,1929,1984,261.825,27.5112,62.4888,99.9894
518,519,4370,764,1989,104.814,33.7824,56.2176,99.9107
519,520,5193,1218,1990,276.966,3.99242,86.0076,99.9872
520,521,1065,718,1984,121.148,44.9751,45.0249,99.9493
521,522,8930,678,2040,104.988,24.1981,65.8019,99.9178
522,523,31258,1663,2102,104.647,4.05043,85.9496,99.9308
523,524,6866,128,2065,104.2,54.5102,35.4898,99.9305
524,525,4181,786,2039,310.827,70.1886,19.8114,99.9044
525,526,16991,887,2095,113.361,44.1354,45.8646,99.9471
526,527,12292,3241,2083,98.6195,27.4664,62.5336,99.7115
527,528,37500,2389,2137,119.608,24.9897,65.0103,91.3036
528,529,20335,2146,2087,287.509,1.59883,88.4012,99.8845
529,530,19418,1854,2101,267.538,27.7389,62.2611,99.947
530,531,694,1086,2038,107.955,44.6152,45.3848,99.9686
531,532,30724,1199,2160,185.36,85.1619,4.8381300000000005,99.864
532,533,6164,1961,2107,98.3347,0.524918,89.4751,98.3476
533,534,1488,2903,2095,180.511,86.324,3.67597,99.9815
534,535,101412,731,2277,280.516,12.1421,77.8579,99.8127
535,536,12624,255,2163,105.582,53.6404,36.3596,99.9766
536,537,41118,2130,2208,107.573,2.07301,87.927,99.8488
537,538,1116,2851,2112,280.893,61.929,28.071,99.9871
538,539,520,2295,2139,220.327,77.561,12.439,99.9791
539,540,3843,1766,2161,109.91,56.5132,33.4868,99.9825
540,541,1048,112,2138,105.825,62.5103,27.4897,99.9341
541,542,24800,2589,2225,279.91700000000003,19.9154,70.0846,99.8447
542,543,25563,2933,2297,252.662,77.6157,12.3843,99.8084
543,544,4946,1560,2201,288.957,18.8775,71.1225,99.9837
544,545,1030,2907,2156,92.832,26.7416,63.2584,99.9901
545,546,10434,3229,2177,109.204,71.8645,18.1355,99.9747
546,547,3787,2843,2163,281.35,77.7804,12.2196,99.9837
547,548,2703,153,2186,106.405,62.5884,27.4116,99.9737
548,549,16931,3314,2309,95.596,19.6638,70.3362,99.966
549,550,43601,1414,2254,286.221,3.06376,86.9362,99.277
550,551,5784,104,2229,110.401,62.3267,27.6733,99.974
551,552,22178,260,2296,111.671,61.0763,28.9237,99.915
552,553,14894,3117,2228,115.643,59.68,30.32,99.9325
553,554,8409,1861,2231,266.607,64.7831,25.2169,99.9865
554,555,11485,1967,2261,111.971,50.1812,39.8188,99.5543
555,556,49544,1021,2322,284.821,16.0334,73.9666,99.4614
556,557,14934,1708,2267,106.175,62.1974,27.8026,99.9416
557,558,13455,2282,2283,272.078,22.1725,67.8275,99.9095
558,559,6452,372,2238,93.9481,47.477,42.523,99.9665
559,560,27525,2753,2299,116.473,48.3326,41.6674,99.9181
560,561,5833,1162,2286,275.442,40.8574,49.1426,99.9819
561,562,6244,1261,2283,273.092,23.3397,66.6603,99.973
562,563,1096,3249,2256,275.347,39.7527,50.2473,99.9889
563,564,16157,1629,2380,302.832,10.7828,79.2172,99.9732
564,565,24870,3207,2389,270.473,51.3626,38.6374,99.9047
565,566,13905,2431,2349,102.647,46.6105,43.3895,99.4842
566,567,598,1561,2288,276.499,64.6093,25.3907,99.9822
567,568,1447,93,2306,280.965,20.2107,69.7893,99.9805
568,569,3253,1860,2311,265.648,71.8893,18.1107,99.9895
569,570,8526,3086,2346,275.201,51.0368,38.9632,99.9727
570,571,5680,394,2331,274.497,58.182,31.818,99.9795
571,572,3722,2614,2332,273.921,40.8419,49.1581,99.9866
572,573,2010,3022,2356,276.228,50.9809,39.0191,99.9718
573,574,16122,2121,2362,106.163,7.695119999999998,82.3049,99.9338
574,575,18352,152,2464,99.4113,6.23001,83.77,99.9585
575,576,3824,1553,2356,117.81,20.7991,69.2009,99.9778
576,577,14029,1239,2395,285.2990000000001,16.9189,73.0811,99.9661
577,578,677,1474,2346,286.087,40.6375,49.3625,99.7271
578,579,5350,1463,2398,130.289,66.7393,23.2607,99.9255
579,580,73152,2241,2492,279.425,9.9345,80.0655,98.256
580,581,115806,1827,2543,296.111,12.408,77.592,99.9273
581,582,3298,2008,2374,285.146,0.808983,89.191,99.985
582,583,1345,1677,2372,274.588,42.8246,47.1754,99.9963
583,584,960,2542,2364,154.09,75.3904,14.6096,99.9899
584,585,72978,709,2489,100.03,2.02483,87.9752,97.3867
585,586,12689,1124,2460,232.267,76.1836,13.8164,99.8764
586,587,17254,2785,2429,110.72,62.237,27.763,99.9496
587,588,11437,251,2431,278.997,8.84888,81.1511,99.987
588,589,2921,349,2402,112.567,42.0509,47.9491,99.9456
589,590,3137,2635,2415,272.35200000000003,41.5573,48.4427,99.9685
590,591,18975,2544,2470,120.034,45.479,44.521,99.9139
591,592,1035,3070,2432,273.105,50.5303,39.4697,99.9903
592,593,6469,1541,2446,113.299,13.1364,76.8636,99.9671
593,594,829,90,2419,100.597,5.66261,84.3374,99.967
594,595,5204,2961,2465,105.364,24.8048,65.1952,98.8842
595,596,5042,374,2467,273.66900000000004,39.5313,50.4687,99.8464
596,597,21005,1360,2541,276.628,49.5629,40.4371,99.3371
597,598,979,2024,2436,119.887,51.4432,38.5568,99.9779
598,599,14392,251,2539,277.603,6.7366800000000016,83.2633,99.9772
599,600,590,2674,2455,117.742,31.1166,58.8834,99.9698
600,601,702,2895,2452,100.822,27.4578,62.5422,99.9827
601,602,541,1466,2452,110.081,15.3398,74.6602,99.1461
602,603,4988,90,2563,280.397,24.2475,65.7525,99.9665
603,604,16721,3276,2645,93.0098,14.4035,75.5965,99.8606
604,605,3033,2923,2503,263.905,48.0615,41.9385,99.8479
605,606,9146,1241,2512,101.74,81.168,8.832,98.1849
606,607,129007,3072,2736,114.187,51.9746,38.0254,90.0902
607,608,6764,2732,2511,275.381,47.5301,42.4699,99.7987
608,609,57499,1547,2663,282.825,9.95702,80.043,99.5
609,610,3109,2651,2520,112.669,19.5089,70.4911,99.9562
610,611,1229,2025,2507,108.74,10.6698,79.3302,99.9918
611,612,160746,378,2802,103.721,19.0889,70.9111,64.5333
612,613,1473,2879,2523,250.55900000000003,58.9052,31.0948,99.9685
613,614,1300,1162,2531,284.466,51.9132,38.0868,99.6103
614,615,2623,2821,2549,276.273,47.7763,42.2237,99.2284
615,616,1090,1042,2543,110.578,8.37026,81.6297,99.9851
616,617,26760,973,2623,281.035,11.543,78.457,98.9477
617,618,1238,1082,2542,106.851,9.81206,80.1879,99.9932
618,619,18313,649,2631,275.603,31.853,58.147,99.9751
619,620,9890,1648,2630,108.098,49.2412,40.7588,99.9422
620,621,743,284,2558,87.6097,70.2495,19.7504,99.9963
621,622,953,2499,2556,106.502,82.1603,7.83972,98.351
622,623,1556,2568,2570,280.763,36.7813,53.2187,99.9914
623,624,3268,738,2617,105.21,36.4153,53.5847,99.9741
624,625,5580,1106,2610,286.445,51.4671,38.5329,99.9613
625,626,3418,2704,2586,111.539,32.0138,57.9862,99.9638
626,627,63672,1209,2768,100.126,12.628,77.372,99.8629
627,628,965,2649,2575,111.515,28.4835,61.5165,99.9875
628,629,15319,2810,2634,275.741,60.9286,29.0714,99.9525
629,630,2120,2305,2602,93.1902,69.3262,20.6738,99.9697
630,631,22056,2104,2717,116.541,11.4447,78.5553,99.9468
631,632,1057,2771,2594,286.655,16.761,73.23899999999998,99.9765
632,633,3438,278,2628,290.272,50.9599,39.0401,99.995
633,634,5217,2168,2633,289.317,16.1627,73.8373,99.9742
634,635,5603,2624,2636,281.49,62.3791,27.6209,99.9647
635,636,1584,2242,2623,98.0112,68.9796,21.0204,99.9308
636,637,11227,1965,2679,102.23,57.5567,32.4433,99.7763
637,638,49769,2429,2801,264.44,67.7636,22.2363,95.8464
638,639,29677,2257,2740,276.915,60.7493,29.2507,99.7007
639,640,6204,2536,2663,116.782,16.1471,73.8529,99.9834
640,641,830,2904,2631,278.31,48.7381,41.2619,99.9884
641,642,26589,874,2731,280.817,0.869919,89.1301,99.7795
642,643,530,2667,2649,283.017,49.1204,40.8796,99.994
643,644,3303,573,2687,281.266,11.9261,78.0739,99.9891
644,645,630,163,2656,112.444,44.0427,45.9573,99.9479
645,646,6095,1435,2696,95.4016,11.4345,78.5655,98.8106
646,647,5904,146,2698,276.901,32.3574,57.6426,99.9121
647,648,5545,2666,2709,274.122,58.7554,31.2446,99.9874
648,649,5045,1354,2712,245.302,78.0374,11.9626,99.9753
649,650,18545,1062,2779,284.62,10.3809,79.6191,99.9612
650,651,7636,2843,2730,267.867,60.628,29.372,99.9834
651,652,22319,758,2791,83.9928,11.1732,78.8268,99.9723
652,653,14468,2591,2803,282.1020000000001,47.0573,42.9427,99.9694
653,654,1121,1036,2728,107.295,6.88367,83.1163,99.9798
654,655,4638,2914,2772,277.447,61.6617,28.3383,99.9809
655,656,66431,1944,2911,281.249,1.05325,88.9468,98.677
656,657,12511,634,2790,287.7270000000001,58.3067,31.6933,99.9755
657,658,1199,2729,2765,268.241,58.7976,31.2024,99.9886
658,659,2794,1882,2778,103.934,64.9903,25.0097,99.9857
659,660,2541,1368,2803,285.427,73.0078,16.9922,99.9457
660,661,866,1463,2794,243.337,77.613,12.387,99.9357
661,662,61113,2737,2920,284.91,18.1401,71.8599,99.4859
662,663,522,2968,2794,291.877,60.9577,29.0423,99.9034
663,664,8734,161,2867,277.995,36.0736,53.9264,99.9595
664,665,5854,1455,2839,99.5321,9.76909,80.2309,98.622
665,666,3614,862,2842,275.156,8.877360000000003,81.1226,99.9878
666,667,4792,3300,2909,92.8492,12.6761,77.3239,99.9648
667,668,22116,1597,2917,110.069,53.7627,36.2373,99.9588
668,669,8558,2107,2893,274.9,61.5766,28.4234,99.9762
669,670,9702,2286,2936,266.742,57.3807,32.6193,99.9439
670,671,18813,670,2943,253.096,70.3373,19.6627,99.4965
671,672,15819,3188,2930,265.404,59.4213,30.5787,99.9429
672,673,6523,2515,2921,266.09,64.3107,25.6893,99.9513
673,674,17143,1017,2924,103.373,31.9277,58.0723,99.5946
674,675,786,2632,2877,267.938,61.1251,28.8749,99.9859
675,676,8297,1735,2899,185.914,86.6446,3.3553800000000003,99.98
676,677,1516,605,2877,279.696,24.7807,65.2193,99.9806
677,678,2637,857,2901,284.853,59.3751,30.6249,99.9738
678,679,938,1462,2895,232.381,76.1277,13.8723,99.9365
679,680,607,1244,2899,98.3776,13.0416,76.9584,99.9198
680,681,3036,1372,2952,266.41,72.4863,17.5137,99.9817
681,682,24115,1509,3036,283.398,60.0411,29.9589,98.7417
682,683,624,2582,2921,290.288,17.6396,72.3604,99.9892
683,684,145901,1037,3157,107.098,0.71711,89.2829,99.5569
684,685,1087,1305,2933,225.42,74.4658,15.5342,99.9718
685,686,3763,577,2961,119.308,57.1891,32.8109,99.9452
686,687,6962,1250,2979,101.611,14.4331,75.5669,99.9527
687,688,8069,105,3004,99.9384,17.3914,72.6086,99.9755
688,689,67463,1766,3088,112.628,43.5777,46.4223,99.6511
689,690,19978,2119,3032,279.416,61.5597,28.4403,98.6942
690,691,1996,2547,2980,120.525,56.0639,33.9361,99.9836
691,692,11293,532,3025,110.898,1.76276,88.2372,99.9801
692,693,1109,2355,2977,269.851,29.6297,60.3703,99.9895
693,694,97743,3138,3165,285.8520000000001,40.5236,49.4764,92.0742
694,695,510,1553,2998,285.46,27.5436,62.4564,99.972
695,696,1110,2510,3011,115.396,41.64100000000001,48.359,99.9857
696,697,2079,2888,3017,109.131,66.0026,23.9974,99.9762
697,698,731,2340,3010,263.933,57.0722,32.9278,99.9712
698,699,2706,1183,3022,111.846,82.176,7.82396,97.9868
699,700,76507,1457,3227,108.938,38.9427,51.0573,94.2718
700,701,37896,2389,3135,275.763,32.07,57.93,99.3478
701,702,4912,2473,3066,102.594,44.57899999999999,45.42100000000001,99.2059
702,703,565,2829,3025,280.039,18.5679,71.4321,99.9909
703,704,20173,2653,3117,278.935,32.2784,57.7216,99.9004
704,705,7164,1108,3078,279.605,22.057,67.943,99.9258
705,706,3320,180,3065,282.361,5.73603,84.264,99.978
706,707,5553,2180,3081,103.295,11.2358,78.7642,99.975
707,708,37137,481,3152,282.445,16.3606,73.6394,99.474
708,709,709,1264,3045,277.487,28.5243,61.4757,99.9604
709,710,7180,661,3071,295.921,85.6266,4.37338,99.9773
710,711,2575,2824,3074,78.3887,69.2992,20.7008,99.7873
711,712,1708,2874,3079,90.6957,58.867,31.133000000000006,99.4263
712,713,1596,133,3088,291.813,48.5777,41.4223,99.9904
713,714,2598,246,3118,294.21,49.6031,40.3969,99.9574
714,715,9152,2221,3141,287.882,61.1612,28.8388,99.9407
715,716,743,2733,3103,83.1044,69.0377,20.9623,99.9931
716,717,3403,324,3137,294.058,82.5645,7.43545,99.9445
717,718,53581,2855,3284,283.52,14.4154,75.5846,99.4473
718,719,4928,172,3141,100.759,47.4158,42.5842,99.9833
719,720,2653,2547,3135,281.13,21.0548,68.9452,99.9638
720,721,1432,2842,3118,100.806,45.7159,44.2841,99.9712
721,722,3564,2905,3137,279.608,46.8519,43.1481,99.8782
722,723,6250,2113,3163,120.193,43.9901,46.0099,99.9684
723,724,3670,1978,3162,290.657,8.14832,81.8517,99.9784
724,725,596,2038,3141,198.249,84.8186,5.18145,99.8896
725,726,7457,649,3191,281.652,19.1565,70.8435,99.8785
726,727,4610,796,3190,282.514,71.7573,18.2427,99.9614
727,728,761,2018,3162,339.836,84.6998,5.30016,99.9791
728,729,1392,1618,3171,117.06,65.1901,24.8099,99.9853
729,730,22674,2298,3259,97.6822,20.175,69.825,99.9267
730,731,3954,257,3218,103.186,27.8974,62.1026,99.9559
731,732,30767,113,3301,276.879,32.9523,57.0477,99.9749
732,733,572,2944,3173,288.2,36.991,53.00899999999999,99.2315
733,734,7920,746,3232,276.327,63.0148,26.9852,99.9655
734,735,4099,867,3210,276.246,54.6604,35.3396,99.9754
735,736,22684,2645,3264,111.283,7.46166,82.5383,99.8768
736,737,113883,1778,3503,282.6,4.45299,85.54700000000003,91.1196
737,738,1862,211,3217,278.974,6.5768,83.4232,99.9826
738,739,31545,438,3309,274.339,44.731,45.269,97.597
739,740,826,2036,3201,107.583,21.2563,68.7437,99.9862
740,741,103004,2064,3436,106.527,13.8561,76.1439,99.6686
741,742,3619,1994,3237,292.686,40.7887,49.2113,99.9927
742,743,10879,691,3307,103.301,1.23283,88.7672,99.7322
743,744,531,1720,3226,120.614,64.0057,25.9943,99.9931
744,745,692,1366,3239,106.88,54.7937,35.2063,99.9596
745,746,14201,2484,3319,102.953,26.5805,63.4195,99.0177
746,747,6335,830,3310,274.79,7.05288,82.9471,99.978
747,748,101970,973,3559,277.663,13.4472,76.5528,99.2003
748,749,3480,588,3295,285.157,1.96412,88.0359,99.9855
749,750,12057,226,3330,278.103,3.08047,86.9195,99.9566
750,751,1551,1344,3290,221.235,87.9226,2.07745,99.993
751,752,1092,880,3295,254.529,66.5426,23.4574,99.992
752,753,48529,2292,3451,141.263,79.0665,10.9335,99.2067
753,754,5979,3040,3324,282.064,14.679,75.321,99.9379
754,755,4063,333,3330,93.6448,38.2896,51.7104,99.986
755,756,30231,1380,3415,96.8298,7.624619999999998,82.3754,99.3552
756,757,6845,1880,3377,276.631,2.57807,87.4219,99.9736
757,758,5759,1810,3349,284.791,2.07788,87.9221,99.9709
758,759,796,539,3331,276.819,59.9804,30.0196,99.9921
759,760,616,2612,3345,287.58,14.8168,75.1832,99.9898
760,761,2733,578,3362,290.077,0.6142350000000001,89.3858,99.9899
761,762,724,2689,3347,238.727,81.2965,8.70354,99.9937
762,763,2959,2667,3386,104.128,16.9924,73.0076,99.9728
763,764,201248,2908,3690,147.58700000000005,72.232,17.768,61.2658
764,765,3126,3277,3375,96.5057,11.5756,78.4244,99.9672
765,766,7941,3107,3387,101.592,14.0767,75.9233,99.9444
766,767,514,2475,3367,291.2270000000001,12.2676,77.7324,99.986
767,768,20401,764,3427,112.308,43.1667,46.8333,99.8997
768,769,2791,2734,3387,285.073,14.4367,75.5633,99.9835
769,770,621,2529,3376,276.797,29.3474,60.6526,99.9911
770,771,973,2607,3378,109.093,54.7642,35.2358,99.9862
771,772,561,637,3382,267.362,60.5349,29.4651,99.9948
772,773,6670,1105,3425,276.281,0.395401,89.6046,99.9731
773,774,33948,197,3494,278.449,66.8803,23.1197,99.5744
774,775,3015,2996,3408,243.913,72.179,17.820999999999994,99.9762
775,776,2095,339,3415,274.23900000000003,12.1305,77.8695,99.9884
776,777,1031,2502,3406,109.365,26.7084,63.2916,99.9168
777,778,18152,2604,3470,217.198,69.7814,20.2186,99.8706
778,779,995,2526,3432,292.721,21.7528,68.2472,99.9777
779,780,6948,1936,3464,290.443,4.27765,85.7224,99.5077
780,781,9047,379,3492,89.6925,24.154,65.846,99.9166
781,782,5296,2463,3470,104.597,26.5008,63.4992,98.9646
782,783,12238,635,3487,265.404,74.8957,15.1043,98.8085
783,784,26885,521,3527,96.5798,24.2384,65.7616,99.838
784,785,6146,1254,3485,112.279,41.8643,48.1357,99.7696
785,786,6233,828,3508,271.635,18.8064,71.1936,99.9387
786,787,587,1135,3480,276.896,63.0813,26.9187,99.9818
787,788,1224,1347,3485,273.33,17.3088,72.6912,99.9964
788,789,34484,1521,3595,281.021,11.5933,78.4067,96.61
789,790,908,2685,3507,117.199,39.8925,50.1075,99.9883
790,791,14770,1376,3595,89.9764,3.3856,86.6144,99.9717
791,792,3410,2703,3555,108.287,43.7466,46.2534,99.5314
792,793,1879,63,3560,285.1140000000001,4.77717,85.2228,99.9793
793,794,5780,712,3575,97.1294,40.9481,49.0519,99.9408
794,795,6293,2427,3572,283.935,15.0614,74.9386,98.8982
795,796,68359,1267,3723,277.906,6.66213,83.3379,99.8942
796,797,1153,225,3546,64.7254,67.3379,22.6621,99.9913
797,798,46721,2588,3656,109.753,43.2576,46.7424,99.841
798,799,3775,1693,3570,99.1398,10.5388,79.4612,99.978
799,800,1245,254,3568,283.398,6.84207,83.1579,99.9958
800,801,89470,267,3722,288.905,8.69917,81.3008,99.9448
801,802,3029,463,3603,282.448,27.8834,62.1166,99.7064
802,803,1791,3270,3580,274.531,14.2512,75.7488,99.986
803,804,1481,1593,3590,289.988,45.4118,44.5882,99.9874
804,805,28481,2370,3681,105.474,17.8639,72.1361,99.3359
805,806,6133,2188,3647,273.207,3.27681,86.7232,99.9323
806,807,828,651,3605,105.528,44.4794,45.5206,99.9883
807,808,3344,1680,3639,104.406,41.7987,48.2013,99.9482
808,809,8370,3263,3655,105.277,18.9675,71.0325,99.958
809,810,12966,3098,3648,278.867,14.2866,75.7134,99.8829
810,811,1047,1952,3636,280.72,28.4076,61.5924,99.5434
811,812,4341,1607,3650,107.135,50.5076,39.4924,99.9276
812,813,20303,554,3710,283.862,60.7413,29.2587,99.8784
813,814,3819,686,3652,286.688,56.7186,33.2814,99.9839
814,815,4194,3179,3690,271.081,42.1412,47.8588,99.9652
815,816,1753,1112,3662,279.532,25.434,64.566,99.9578
816,817,3825,1990,3693,287.138,3.54177,86.4582,99.9752
817,818,5041,1630,3708,115.579,58.7268,31.2732,99.9748
818,819,15940,628,3834,94.2764,20.4898,69.5102,99.9118
819,820,5037,2067,3736,294.951,12.0111,77.9889,99.9854
820,821,1180,2248,3719,280.185,8.54294,81.4571,99.9741
821,822,10730,3238,3760,88.1192,17.8378,72.1622,99.9641
822,823,67954,1722,3865,297.0540000000001,72.2928,17.7072,99.7372
823,824,4179,2194,3746,272.652,4.92809,85.0719,99.9792
824,825,3180,1411,3737,275.777,37.1729,52.8271,99.8213
825,826,13984,1119,3808,99.1024,62.1574,27.8426,99.8901
826,827,2341,2133,3748,95.1201,6.47921,83.5208,99.9777
827,828,9445,1698,3763,282.815,29.4959,60.5041,99.9823
828,829,715,796,3747,97.154,0.397141,89.6029,99.9585
829,830,10001,1506,3784,113.74,18.2097,71.7903,99.9583
830,831,92958,735,3987,106.534,40.9291,49.0709,99.6708
831,832,36405,2353,3871,269.255,5.83322,84.1668,99.7638
832,833,961,2288,3754,288.789,16.9331,73.0669,99.9929
833,834,6865,3132,3785,211.561,73.8987,16.1013,99.9724
834,835,11310,2230,3831,289.218,13.4642,76.5358,99.9577
835,836,46008,131,3945,285.238,4.31079,85.6892,99.9566
836,837,11752,471,3842,271.35200000000003,27.1952,62.8048,99.6617
837,838,13735,2567,3864,114.181,12.8139,77.1861,99.9753
838,839,3439,1430,3818,106.676,41.3328,48.6672,99.5083
839,840,1336,389,3835,203.943,78.8943,11.1057,99.9823
840,841,4556,2495,3844,118.446,46.4526,43.5474,99.976
841,842,32139,2070,3902,202.146,79.363,10.637,99.9087
842,843,34941,1010,3969,104.225,2.90305,87.09700000000002,99.7515
843,844,545,3071,3823,103.344,27.972,62.028,99.9191
844,845,707,1995,3829,296.4840000000001,11.8768,78.1232,99.9947
845,846,13601,3217,3919,266.392,39.7813,50.2187,99.8711
846,847,14521,3105,3890,275.78700000000003,3.4017,86.5983,99.9113
847,848,541,1453,3865,305.277,76.9831,13.0169,99.904
848,849,8151,1163,3928,271.015,7.66365,82.3363,99.9831
849,850,5456,1239,3918,94.8847,40.7824,49.2176,99.9674
850,851,12005,2476,3956,281.713,14.6927,75.3073,99.6406
851,852,13427,282,3971,259.714,76.3103,13.6897,99.2697
852,853,690,1457,3891,289.107,6.20086,83.7991,99.9901
853,854,13768,485,3956,283.345,4.915,85.085,99.6062
854,855,12531,1467,3961,171.815,75.4165,14.5835,99.5922
855,856,4221,2224,3960,140.759,57.3997,32.6003,99.9746
856,857,6528,1359,3960,281.366,0.593605,89.4064,99.9918
857,858,46395,2668,4061,280.894,29.7004,60.2996,99.7901
858,859,4682,1302,3985,275.2,16.1546,73.8454,99.9904
859,860,6127,371,3998,283.284,10.4671,79.5329,99.76
860,861,4517,3273,4005,93.6731,3.9812,86.0188,99.9156
861,862,78661,1642,4097,281.795,6.17903,83.821,99.0568
862,863,4158,3128,4000,118.383,59.7151,30.2849,99.9725
863,864,3587,1721,3981,101.315,2.65328,87.3467,99.9892
864,865,63894,2111,4138,292.99,11.0057,78.9943,99.894
865,866,4937,1230,4008,172.885,77.9182,12.0818,98.392
866,867,4175,2289,4026,284.635,9.11852,80.8815,99.9835
867,868,1912,1149,4007,100.524,3.3136300000000003,86.6864,99.9953
868,869,1603,2525,4016,114.896,13.0151,76.9849,99.9936
869,870,28249,2983,4096,98.9746,38.6073,51.3927,99.3653
870,871,2628,3226,4027,113.46,60.3971,29.6029,99.5783
871,872,3100,2381,4026,106.055,15.1172,74.8828,99.9744
872,873,880,1082,4010,139.664,70.3107,19.6893,99.4041
873,874,595,430,4020,294.266,67.372,22.628,99.7215
874,875,1570,1111,4040,287.023,38.5275,51.4725,99.892
875,876,23281,268,4115,108.249,61.4949,28.5051,99.9468
876,877,6638,1357,4058,310.4840000000001,68.0637,21.9363,99.9799
877,878,511,2003,4045,234.927,85.6366,4.36345,98.2545
878,879,1849,3094,4054,151.546,80.1349,9.86513,97.1665
879,880,41360,2302,4208,100.859,11.1298,78.8702,99.9059
880,881,9305,1193,4081,56.2879,79.4465,10.5535,99.9658
881,882,1008,2470,4050,286.706,1.51759,88.4824,99.9659
882,883,16429,432,4131,103.906,44.3027,45.6973,67.0891
883,884,5566,2513,4103,282.814,1.0358,88.9642,99.953
884,885,13795,1934,4122,221.409,85.18700000000003,4.813,99.9294
885,886,20112,1298,4162,278.683,6.6326399999999985,83.3674,99.8764
886,887,595,2420,4078,126.276,62.4704,27.5296,99.9513
887,888,1097,2829,4086,98.4871,45.94600000000001,44.054,99.8832
888,889,689,64,4077,267.575,57.2824,32.7176,99.992
889,890,22079,3100,4189,131.45,82.7061,7.2939,99.8172
890,891,1884,496,4100,288.781,9.259,80.741,99.9952
891,892,625,2457,4089,94.2236,56.4578,33.5422,99.9917
892,893,871,948,4105,288.242,51.4781,38.5219,99.9291
893,894,5477,1835,4135,89.1693,9.37879,80.6212,99.9818
894,895,3807,1110,4122,285.619,40.4258,49.5742,99.9728
895,896,10593,2433,4168,93.7634,53.0984,36.9016,99.2723
896,897,5710,891,4142,357.09,87.5818,2.41816,81.6512
897,898,676,531,4108,283.487,44.8971,45.1029,99.992
898,899,29632,2908,4262,93.5864,13.2275,76.7725,98.4546
899,900,1197,1382,4109,125.882,84.8469,5.15309,99.994
900,901,2019,782,4147,127.332,83.1583,6.84172,99.9855
901,902,3449,1427,4170,104.682,66.5008,23.4992,99.8369
902,903,799,3241,4145,88.9165,35.5982,54.4018,99.9908
903,904,2582,154,4158,96.3398,45.8197,44.1803,99.9902
904,905,598,2231,4148,109.202,36.3093,53.6907,99.9897
905,906,3922,541,4176,114.052,81.8405,8.159469999999999,99.9603
906,907,14176,2750,4225,96.9877,21.0347,68.9653,99.9571
907,908,31452,1072,4218,71.7684,79.3318,10.6682,99.9068
908,909,890,1179,4150,129.981,81.3951,8.60491,99.989
909,910,904,1668,4155,281.26,10.3664,79.6336,99.9915
910,911,1081,377,4158,99.7988,9.74485,80.2551,99.9915
911,912,22274,428,4280,104.663,33.2697,56.7303,99.3794
912,913,1851,1779,4179,97.4637,37.0473,52.9527,99.9902
913,914,19494,2595,4230,293.84,13.8897,76.1103,99.9495
914,915,13063,148,4265,284.634,6.857480000000002,83.1425,99.961
915,916,700,76,4189,267.204,57.4672,32.5328,99.9894
916,917,1329,403,4189,276.644,1.18655,88.8134,99.9884
917,918,7297,1688,4206,277.338,9.12777,80.8722,99.9757
918,919,3494,602,4207,293.562,60.794,29.206,99.9779
919,920,44448,648,4304,111.857,69.3152,20.6848,99.8809
920,921,12429,1860,4252,89.6807,14.6146,75.3854,99.969
921,922,5874,1934,4232,274.195,11.9995,78.0005,98.0891
922,923,746,181,4200,87.065,78.3713,11.6287,99.9961
923,924,17274,1391,4276,105.662,39.8356,50.1644,99.6176
924,925,57720,3148,4351,98.9047,20.0124,69.9876,99.8099
925,926,4605,231,4243,103.227,32.6445,57.3555,99.9918
926,927,789,511,4231,292.698,62.0525,27.9475,99.9617
927,928,48941,1707,4347,107.179,23.2403,66.7597,99.7929
928,929,502,2239,4240,285.801,9.73969,80.2603,99.986
929,930,5157,81,4282,99.2773,46.4843,43.5157,99.932
930,931,2549,1483,4254,108.544,34.62,55.38,99.9923
931,932,2254,1622,4252,111.158,59.6612,30.3388,99.9922
932,933,18134,2843,4323,284.341,7.386039999999999,82.61399999999998,99.9647
933,934,25876,331,4337,94.9845,17.8979,72.1021,99.7408
934,935,1570,798,4257,127.064,78.5888,11.4112,99.9819
935,936,44878,2447,4403,256.765,78.1601,11.8399,99.6695
936,937,29533,1211,4344,94.1111,15.9078,74.0922,99.8908
937,938,6713,982,4304,106.522,77.2513,12.7487,99.9043
938,939,2773,2516,4279,135.468,54.902,35.098,99.976
939,940,779,1161,4274,247.238,68.9588,21.0412,99.9974
940,941,9708,2653,4380,285.879,5.00812,84.9919,99.9781
941,942,2349,1960,4309,280.879,41.0848,48.9152,99.9255
942,943,33059,2092,4395,100.954,1.19163,88.8084,99.9156
943,944,2479,821,4313,97.625,25.3058,64.6942,99.9887
944,945,520,1524,4301,283.181,11.3616,78.6384,99.9914
945,946,3128,761,4341,134.071,78.1287,11.8713,99.9524
946,947,8171,2730,4356,94.6498,14.6748,75.3252,99.9762
947,948,4898,1501,4353,120.059,56.9618,33.0382,99.9595
948,949,3250,1949,4360,276.224,12.5061,77.4939,98.7922
949,950,18472,938,4383,114.881,49.471,40.529,99.6668
950,951,21467,2260,4438,111.411,2.73922,87.2608,99.9479
951,952,6687,65,4391,283.19,5.3636,84.6364,99.9828
952,953,8298,1404,4422,264.259,52.4244,37.5756,99.5641
953,954,837,128,4362,261.42400000000004,59.8006,30.1994,99.9958
954,955,844,2993,4366,104.584,61.2489,28.7511,99.9947
955,956,51701,653,4520,90.1275,78.5382,11.4618,98.3808
956,957,58134,185,4520,280.937,12.1922,77.8078,99.6831
957,958,6475,1908,4407,271.749,43.7394,46.2606,99.398
958,959,565,1840,4387,272.54,43.566,46.434,99.9871
959,960,23725,1514,4511,286.8040000000001,3.12669,86.8733,99.9535
960,961,3627,347,4425,108.257,74.6299,15.3701,99.9769
961,962,44878,1218,4505,94.8489,11.46,78.54,99.9174
962,963,3598,470,4425,107.129,3.24792,86.7521,99.9088
963,964,39083,1628,4603,117.843,64.1134,25.8866,99.2218
964,965,6911,320,4501,258.475,67.6556,22.3444,94.2514
965,966,38821,939,4531,278.088,28.1478,61.8522,99.0787
966,967,10860,2741,4452,290.415,1.10509,88.8949,99.9448
967,968,9636,1838,4494,286.988,7.47115,82.5288,99.9827
968,969,2406,1060,4460,287.572,56.081,33.919000000000004,99.9795
969,970,6336,431,4480,264.181,61.0943,28.9057,99.3956
970,971,1473,1959,4462,112.072,32.7245,57.2755,99.9831
971,972,1929,1005,4467,110.82,29.1053,60.8947,99.9912
972,973,1833,512,4474,267.467,58.8933,31.1067,99.9794
973,974,4376,2523,4510,290.176,8.32292,81.6771,99.9651
974,975,64631,2058,4602,290.26,31.6679,58.3321,99.7304
975,976,12947,1754,4582,282.216,47.7174,42.2826,99.7729
976,977,7714,1368,4566,271.701,17.4623,72.5377,99.985
977,978,12322,428,4595,287.88,53.0336,36.9664,99.823
978,979,1766,38,4574,287.154,26.3243,63.6757,99.976
979,980,743,2281,4551,108.026,76.1722,13.8278,99.674
980,981,696,1418,4580,277.014,20.0111,69.9889,95.511
981,982,6685,682,4597,290.811,53.7054,36.2946,99.9614
982,983,2236,353,4601,273.238,61.1054,28.8946,99.9256
983,984,1718,1083,4604,102.468,0.132896,89.8671,99.9902
984,985,18672,1293,4674,95.5432,8.31081,81.6892,99.9659
985,986,1072,1476,4614,286.645,50.0938,39.9062,99.9847
986,987,3460,75,4617,101.182,21.7771,68.2229,99.9297
987,988,25599,1859,4675,283.112,57.3762,32.6238,99.7336
988,989,795,891,4620,291.089,72.2691,17.7309,99.9931
989,990,8845,1438,4660,276.499,69.1743,20.8257,99.787
990,991,1436,957,4633,106.734,24.9786,65.0214,99.9807
991,992,8244,884,4695,282.818,39.4461,50.5539,99.7969
992,993,9720,517,4683,108.303,30.1817,59.8183,99.9873
993,994,13690,1127,4680,284.02,68.7826,21.2174,99.9707
994,995,4970,133,4672,104.292,61.2463,28.7537,99.9732
995,996,520,707,4639,274.556,55.5091,34.4909,99.9839
996,997,4541,952,4676,281.279,32.258,57.742,99.657
997,998,3315,759,4675,267.664,52.2958,37.7042,99.9545
998,999,2491,320,4677,96.8219,66.587,23.413,99.9851
999,1000,2502,409,4678,94.8825,15.3404,74.6596,99.2221
1000,1001,797,1009,4661,287.461,67.657,22.343000000000004,99.9945
1001,1002,1478,61,4676,97.0032,6.3844699999999985,83.6155,99.9791
1002,1003,1281,363,4677,130.261,76.7135,13.2865,99.9923
1003,1004,6942,647,4690,99.6986,18.0946,71.9054,99.9712
1004,1005,980,1374,4688,272.998,63.0949,26.9051,99.988
1005,1006,2558,1196,4708,267.769,46.7481,43.2519,99.9948
1006,1007,2570,1028,4720,106.526,22.4679,67.5321,99.9734
1007,1008,4868,1499,4729,286.49,32.7847,57.2153,99.9764
1008,1009,923,789,4711,89.8113,21.2492,68.7508,99.9919
1009,1010,2513,1419,4742,280.755,16.0688,73.9312,99.3716
1010,1011,4237,1639,4750,112.043,12.7281,77.2719,99.9802
1011,1012,2750,1943,4756,114.539,11.8618,78.1382,99.5896
1012,1013,566,1195,4744,99.3413,23.3488,66.6512,99.974
1013,1014,912,1749,4761,285.443,57.2181,32.7819,99.954
