,Grain No.,Size [Pixel],center x-coordinate,center y-coordinate,mean azimuth [degree],mean latitude [degree],mean colatitude [degree],Regelungsgrad [%]
0,1,568,2459,134,351.034,38.658,51.342,99.923
1,2,2730,1846,154,116.477,76.6448,13.3552,99.9574
2,3,6320,1980,166,3.2513,51.2435,38.7565,99.8708
3,4,66201,791,293,347.041,52.5809,37.4191,99.7467
4,5,2709,717,186,353.2940000000001,57.4707,32.5293,99.9285
5,6,2931,2526,161,183.457,23.1927,66.8073,99.6828
6,7,1577,2423,159,351.795,38.881,51.119,99.9479
7,8,4299,2739,163,343.658,7.2446899999999985,82.7553,99.9211
8,9,5001,498,171,358.3930000000001,35.3577,54.6423,99.74
9,10,8271,204,200,349.412,35.9845,54.0155,99.7172
10,11,527,1093,155,188.473,20.8833,69.1167,99.9722
11,12,162157,3025,436,5.48477,23.013,66.987,97.8848
12,13,712,2248,155,181.272,7.97345,82.0266,99.9995
13,14,10111,3418,242,356.37,30.1677,59.8323,99.8643
14,15,638,1690,162,182.885,21.5174,68.4826,99.9604
15,16,893,2119,157,179.715,10.9512,79.0488,99.9897
16,17,509,1298,163,173.703,17.7344,72.2656,99.9849
17,18,535,1642,167,183.262,20.6407,69.3593,99.9739
18,19,2118,2790,201,344.465,7.24573,82.7543,99.8833
19,20,4407,3206,217,189.784,20.3534,69.6466,99.9537
20,21,12852,566,274,330.769,61.8559,28.1441,99.9683
21,22,699,2608,218,352.903,5.17854,84.8215,99.9357
22,23,17057,2034,282,358.908,15.8392,74.1608,99.2117
23,24,41079,2439,308,178.505,39.5418,50.4582,89.8552
24,25,3543,3377,244,177.577,41.8924,48.1076,99.9195
25,26,8394,2674,254,347.5619999999999,8.32017,81.6798,99.9612
26,27,37107,1042,316,173.554,33.556,56.444,99.8304
27,28,725,461,239,178.105,35.7451,54.2549,99.9384
28,29,947,2131,239,356.789,21.4767,68.5233,99.9853
29,30,24525,1663,311,183.033,23.7336,66.2664,99.7941
30,31,3769,2254,250,358.741,21.9935,68.0065,99.9949
31,32,2118,2736,260,350.631,5.8312599999999986,84.1687,99.9891
32,33,1317,1889,250,356.88199999999995,2.37997,87.62,99.9912
33,34,700,2329,228,137.126,72.8926,17.1074,99.8808
34,35,770,1796,258,357.5440000000001,2.26676,87.7332,99.9918
35,36,4801,359,293,329.992,62.2034,27.7966,99.9633
36,37,510,1245,258,185.97,27.4579,62.5421,99.9506
37,38,901,111,270,353.858,28.5823,61.4177,99.6378
38,39,569,3306,272,346.426,27.186,62.81399999999999,99.9698
39,40,1340,3155,271,189.237,17.7158,72.2842,99.993
40,41,2454,3222,279,351.357,20.5565,69.4435,99.9886
41,42,30867,1484,380,191.772,28.8062,61.1938,99.753
42,43,11786,2166,353,359.1330000000001,4.0015,85.9985,99.9583
43,44,5034,2605,314,351.829,6.00117,83.9988,99.9774
44,45,864,1318,302,188.11,25.4282,64.5718,99.9517
45,46,786,3146,299,182.411,33.3553,56.6447,99.9307
46,47,3793,2722,329,357.64,11.4406,78.5594,99.912
47,48,11890,3228,361,358.653,16.5301,73.4699,99.9544
48,49,596,2112,323,358.031,13.1543,76.8457,99.9944
49,50,10269,102,414,162.593,60.38,29.6201,99.6501
50,51,1779,3466,371,349.091,36.6909,53.3091,98.8921
51,52,56987,2364,459,358.362,48.9741,41.0259,86.4891
52,53,3606,479,366,343.1280000000001,43.2279,46.7721,99.8978
53,54,146203,2790,670,181.466,5.64113,84.3589,99.8316
54,55,1144,1265,359,187.182,28.2735,61.7265,99.926
55,56,621,1894,351,357.395,55.8207,34.1793,99.9644
56,57,1328,3166,378,359.716,17.9771,72.0229,99.9935
57,58,24670,2071,535,189.178,25.2914,64.7086,99.6236
58,59,42117,1087,518,175.011,30.219,59.78100000000001,99.6917
59,60,5574,1303,422,197.445,69.2575,20.7425,99.9829
60,61,3385,537,426,344.082,44.5076,45.4924,99.8916
61,62,19637,1680,502,357.671,3.22988,86.7701,99.6725
62,63,839,2022,407,1.4328299999999998,28.3065,61.6935,99.9682
63,64,754,937,420,170.613,36.171,53.82899999999999,99.9329
64,65,1844,2393,437,355.474,24.9315,65.0685,99.9842
65,66,785,333,436,158.282,61.0709,28.9291,99.9637
66,67,563,959,439,170.442,37.1993,52.8007,99.9447
67,68,712,2423,438,353.1690000000001,17.4298,72.5702,99.8082
68,69,1694,3454,442,177.736,40.9454,49.0546,99.7564
69,70,59522,1890,661,356.7,2.09812,87.9019,99.8793
70,71,2484,1814,476,358.092,4.0738699999999985,85.9261,99.9914
71,72,8002,1457,485,204.025,71.0233,18.9767,99.9089
72,73,2388,1999,488,359.162,22.4718,67.5282,99.7492
73,74,604,1333,470,353.045,44.6052,45.3948,99.9826
74,75,652,1935,465,188.505,29.3241,60.6759,99.9673
75,76,972,2770,477,172.956,21.4067,68.5933,99.9847
76,77,1075,577,482,344.869,44.1686,45.8314,99.9232
77,78,2547,3440,518,357.356,28.1896,61.8104,99.889
78,79,164010,1469,692,6.01978,55.9281,34.0719,99.6586
79,80,9027,232,560,166.03,53.0262,36.9738,99.9683
80,81,576,1956,510,188.238,30.9184,59.0816,99.9583
81,82,726,408,527,161.092,57.847,32.153,99.909
82,83,965,558,529,334.46,64.2922,25.7078,99.9605
83,84,938,2656,530,183.123,6.86445,83.1356,99.7256
84,85,1436,140,555,349.191,55.0563,34.9437,99.7003
85,86,5726,335,598,164.78,53.2755,36.7245,99.9713
86,87,2321,2372,567,352.325,55.8275,34.1725,99.9893
87,88,28095,744,635,352.8880000000001,51.8288,38.1712,99.9687
88,89,66622,2246,697,177.065,40.4392,49.5608,99.8754
89,90,1119,98,589,353.82199999999995,49.8914,40.1086,99.7512
90,91,657,398,586,164.21099999999996,53.3759,36.6241,99.9683
91,92,1332,523,583,349.33,52.9642,37.0358,99.9711
92,93,105772,475,815,166.757,69.8928,20.1072,55.1526
93,94,16384,964,671,350.961,88.0239,1.97606,99.9947
94,95,1734,270,645,165.382,52.8727,37.1273,99.9817
95,96,2576,3417,673,356.148,31.2209,58.7791,99.9205
96,97,3654,1068,661,194.85,72.4136,17.5864,99.9732
97,98,1153,178,662,173.899,46.2127,43.7873,99.9361
98,99,9868,876,730,354.222,5.66501,84.335,99.9861
99,100,1402,3298,697,0.16303900000000002,25.3573,64.6427,99.9843
100,101,43164,2540,762,346.685,45.5005,44.4995,99.9603
101,102,838,223,693,173.866,46.5242,43.4758,99.9453
102,103,4321,3025,729,2.85453,3.04515,86.9548,99.9602
103,104,14183,3243,778,166.467,64.7751,25.2249,99.9773
104,105,12348,273,813,353.6330000000001,17.2103,72.7897,99.9196
105,106,1125,660,730,358.0540000000001,1.77676,88.2232,99.9913
106,107,657,2116,731,359.395,3.99844,86.0016,99.9925
107,108,36757,755,856,171.658,44.4253,45.5747,99.9517
108,109,4462,3433,796,357.398,29.5461,60.4539,99.9516
109,110,13557,2297,784,1.61377,29.4935,60.5065,99.9682
110,111,4118,1102,775,358.798,7.43141,82.5686,99.9839
111,112,4417,3078,789,356.861,3.74926,86.2507,99.9728
112,113,751,670,764,357.522,3.1789400000000003,86.8211,99.9716
113,114,1889,2396,799,174.377,0.656357,89.3436,99.9072
114,115,89737,1304,941,176.22299999999996,50.983,39.017,99.8541
115,116,28668,932,934,181.236,2.77789,87.2221,99.8121
116,117,2741,3137,823,355.629,15.7679,74.2321,99.9311
117,118,133887,2173,1029,355.99,38.8272,51.1728,97.1797
118,119,26698,2682,930,348.396,13.3505,76.6495,99.9404
119,120,1011,864,829,178.627,3.88313,86.1169,99.9969
120,121,786,97,849,353.972,28.7028,61.2972,99.9168
121,122,11978,2422,875,174.84400000000005,40.3212,49.6788,99.8685
122,123,37419,1591,922,4.18433,30.4677,59.5323,99.9319
123,124,12543,1891,883,338.92,38.5765,51.4235,99.9937
124,125,8560,3238,891,355.98800000000006,18.4905,71.5095,99.9563
125,126,3280,3294,964,349.31699999999995,14.6994,75.3006,99.8812
126,127,12375,3141,932,346.81699999999995,18.079,71.921,99.5409
127,128,1909,181,908,106.322,83.2283,6.771660000000002,99.9901
128,129,1753,2307,880,348.472,34.8104,55.1896,99.9813
129,130,2401,3031,904,357.7,6.17265,83.8273,99.8913
130,131,4906,3427,982,345.462,17.9385,72.0615,99.6762
131,132,1487,1758,903,9.7802,34.7918,55.2082,99.9696
132,133,5423,328,943,1.68196,38.6705,51.3295,99.9847
133,134,5535,2807,930,347.153,9.44701,80.553,99.9634
134,135,2669,2577,942,0.5618890000000001,22.6301,67.3699,99.9801
135,136,3701,3074,938,354.821,18.7647,71.2353,99.9933
136,137,507,2297,909,163.47899999999996,71.9408,18.0592,99.9964
137,138,12120,233,970,353.5019999999999,55.032,34.968,99.9589
138,139,527,2898,915,159.584,19.5649,70.4351,99.9386
139,140,72334,1666,1101,356.1230000000001,7.45883,82.5412,98.0937
140,141,1224,2533,936,352.105,42.1742,47.8258,99.9695
141,142,23823,2959,1029,352.181,12.2601,77.7399,98.2651
142,143,1357,2203,963,176.88,71.5392,18.4608,99.9119
143,144,5210,3042,992,1.73227,9.8661,80.1339,99.8975
144,145,3925,695,977,340.1330000000001,77.8349,12.1651,99.9702
145,146,7178,3224,994,167.888,73.5522,16.4478,99.9904
146,147,1529,3061,981,357.412,17.5114,72.4886,99.9263
147,148,16497,2670,1053,349.4790000000001,40.1191,49.8809,99.6978
148,149,2791,1789,1027,173.515,2.33261,87.6674,99.6027
149,150,9564,361,1073,173.511,47.8579,42.1421,99.9482
150,151,4947,286,1038,176.695,29.854,60.146,99.9381
151,152,803,98,1036,175.435,23.8511,66.1489,99.7283
152,153,11128,659,1065,342.525,79.6961,10.3039,99.9426
153,154,12416,598,1111,18.6536,81.6589,8.34107,99.9608
154,155,14895,2547,1076,177.042,59.0641,30.9359,99.9565
155,156,20282,2881,1092,160.056,21.2927,68.7073,99.8925
156,157,594,717,1034,176.96200000000005,5.1482,84.8518,99.6783
157,158,7693,941,1076,177.908,4.763330000000002,85.2367,99.9952
158,159,12227,1079,1079,181.831,3.970380000000001,86.0296,99.9803
159,160,23779,1913,1157,173.933,5.50645,84.4935,99.8797
160,161,1353,184,1053,356.332,9.5817,80.4183,99.9928
161,162,29555,3146,1129,344.103,39.281,50.719,95.172
162,163,10978,1132,1113,349.161,23.2874,66.7126,99.9859
163,164,5303,3279,1105,353.246,4.62867,85.3713,99.9533
164,165,1174,769,1070,177.695,6.22664,83.7734,99.9974
165,166,26518,484,1161,352.8930000000001,10.7332,79.2668,99.899
166,167,2559,1211,1099,349.559,70.7194,19.2806,99.9908
167,168,31464,275,1197,87.9146,83.8948,6.10522,99.8238
168,169,84706,906,1253,169.109,29.236,60.764,99.2649
169,170,604,275,1082,329.23,5.70643,84.2936,99.9865
170,171,5422,2524,1124,36.0557,83.8679,6.13213,99.9474
171,172,7607,3401,1187,195.169,53.8531,36.1469,99.8867
172,173,2424,1284,1129,13.8895,31.9603,58.0397,99.9864
173,174,12129,2759,1170,181.321,5.89305,84.1069,99.9682
174,175,3939,3454,1202,193.078,54.3617,35.6383,99.9177
175,176,20007,2229,1256,174.045,31.2892,58.7108,99.9404
176,177,137202,2560,1367,98.555,86.0099,3.99013,99.8498
177,178,1223,1401,1150,0.6668609999999999,55.0386,34.9614,99.9573
178,179,12379,1171,1238,10.4787,31.4921,58.5079,99.9214
179,180,10410,670,1242,100.397,81.7062,8.29381,99.9699
180,181,4656,1300,1176,177.213,1.48112,88.5189,99.9739
181,182,5054,2908,1184,349.802,29.647,60.353,99.9893
182,183,15785,2657,1224,173.515,37.8372,52.1628,99.9442
183,184,25518,2948,1267,174.96,6.52856,83.4714,99.9164
184,185,618,1446,1176,176.96099999999996,11.6076,78.3924,99.9779
185,186,1930,1880,1207,171.79,6.088030000000002,83.912,99.9949
186,187,136236,1284,1450,174.886,27.891,62.109,84.7188
187,188,3636,1225,1221,4.11587,50.5196,39.4804,99.9952
188,189,518,612,1200,175.34400000000005,2.24662,87.7534,99.996
189,190,3865,3287,1228,358.032,39.2775,50.7225,99.7936
190,191,3709,3111,1237,174.59,11.8841,78.1159,99.9822
191,192,1750,3180,1216,177.486,8.1632,81.8368,99.951
192,193,3283,1443,1243,176.524,12.2707,77.7293,99.9795
193,194,10566,1825,1261,355.9890000000001,51.411,38.589,99.9596
194,195,8297,560,1275,168.247,34.9063,55.0937,99.9917
195,196,3312,1697,1247,177.419,8.234630000000001,81.7654,99.9798
196,197,42980,3197,1357,198.901,50.3636,39.6364,99.9212
197,198,936,2085,1260,7.07101,49.6434,40.3566,99.9877
198,199,981,2047,1264,332.82,74.4856,15.5143,99.9551
199,200,122863,1730,1423,349.73,25.3313,64.6687,93.6391
200,201,2594,3456,1311,0.177514,67.4138,22.5862,99.8426
201,202,8878,213,1347,349.5490000000001,57.7675,32.2325,99.9266
202,203,9376,724,1332,359.517,75.4924,14.5076,99.9931
203,204,49582,493,1415,341.301,54.5019,35.4981,99.674
204,205,8175,2157,1329,357.5019999999999,48.3678,41.6322,99.9979
205,206,2873,352,1307,164.56,72.1684,17.8316,99.9916
206,207,1185,2044,1318,352.477,29.0097,60.9903,99.9785
207,208,4098,2097,1360,171.62400000000005,30.5716,59.4284,99.8705
208,209,1432,3415,1332,340.398,3.94748,86.0525,99.9751
209,210,2516,293,1364,183.381,34.8029,55.1971,99.9919
210,211,974,926,1352,171.34099999999995,10.2377,79.7623,99.9987
211,212,15730,3004,1457,184.151,7.56152,82.4385,99.7051
212,213,909,803,1367,10.99,76.2393,13.7607,99.9644
213,214,30740,1998,1490,179.658,37.0032,52.9968,99.4604
214,215,90913,2223,1599,169.01,14.9742,75.0258,99.8442
215,216,3146,2297,1408,101.617,85.3739,4.62614,99.9928
216,217,2939,3356,1412,200.709,55.1668,34.8332,99.9193
217,218,2958,1242,1405,158.791,62.978,27.022,99.9885
218,219,558,3316,1409,199.404,53.6056,36.3944,99.9431
219,220,126544,839,1606,124.371,83.0521,6.94786,99.7714
220,221,12417,217,1460,356.064,2.962,87.038,99.9117
221,222,6870,624,1457,174.94099999999997,74.3532,15.6468,99.9415
222,223,2470,2750,1465,78.0042,85.09299999999998,4.90704,99.7548
223,224,3046,2123,1453,1.94214,49.677,40.323,99.9913
224,225,6487,3197,1466,196.111,84.89299999999999,5.10701,99.9663
225,226,551,3420,1434,358.05800000000005,41.334,48.666,99.941
226,227,5041,2896,1469,163.563,37.1205,52.8795,99.8087
227,228,510,3061,1450,354.601,24.7505,65.2495,99.993
228,229,684,374,1462,182.013,1.79191,88.2081,99.9995
229,230,6149,3095,1493,175.827,11.8547,78.1453,99.9144
230,231,2390,2836,1487,178.65099999999995,1.10705,88.89299999999999,99.9456
231,232,15822,2734,1556,177.083,3.63794,86.3621,99.8402
232,233,1912,1114,1510,351.838,49.4425,40.5575,99.9358
233,234,1669,433,1511,171.204,77.7791,12.2209,99.8068
234,235,860,2100,1519,174.50400000000005,7.78252,82.2175,99.9754
235,236,25588,435,1638,350.032,36.6495,53.3505,82.9994
236,237,585,340,1505,182.321,4.453130000000002,85.5469,99.9987
237,238,1951,304,1538,165.929,28.1923,61.8077,99.973
238,239,46423,3165,1619,351.639,27.773000000000003,62.227,99.9736
239,240,13680,219,1619,181.207,5.35168,84.6483,99.9715
240,241,48515,2943,1683,174.02700000000004,42.6709,47.3291,99.8505
241,242,4661,3359,1607,347.346,31.8862,58.1138,99.8537
242,243,7252,294,1588,168.752,21.5002,68.4998,99.9724
243,244,607,1751,1543,176.46,48.3486,41.6514,99.9934
244,245,8026,575,1607,41.9842,69.5202,20.4798,99.992
245,246,713,1065,1549,175.59900000000005,20.7217,69.2783,99.9295
246,247,3676,2949,1584,183.779,6.22256,83.7774,99.9689
247,248,580,1444,1563,179.91299999999995,9.98149,80.0185,99.9862
248,249,712,439,1568,158.004,77.0318,12.9682,99.9897
249,250,2777,1807,1583,177.78599999999997,49.6545,40.3455,99.9963
250,251,864,78,1580,335.155,58.8634,31.1366,99.928
251,252,42689,1581,1678,185.899,4.82346,85.1765,99.9593
252,253,135690,2520,1810,353.983,33.0435,56.9565,98.4831
253,254,2905,1191,1590,161.858,56.0126,33.9874,99.9793
254,255,2015,1135,1592,161.162,55.6416,34.3584,99.9659
255,256,851,2450,1593,359.858,23.7465,66.2535,99.9311
256,257,2623,3429,1629,345.845,33.6757,56.3243,99.9031
257,258,4093,1383,1638,175.74599999999995,12.8561,77.1439,99.9957
258,259,1901,1779,1618,175.011,69.8918,20.1082,99.9796
259,260,567,1961,1614,166.65900000000005,40.944,49.056,99.9873
260,261,606,3062,1618,8.98855,84.5511,5.44888,99.9794
261,262,25767,1843,1698,55.8144,86.8094,3.19062,99.9456
262,263,1993,2465,1638,1.2245,17.8888,72.1112,99.4904
263,264,4375,1045,1651,167.451,54.8213,35.1787,99.992
264,265,1039,1146,1638,186.298,54.8644,35.1356,99.9879
265,266,2787,2794,1690,173.928,47.3096,42.6904,99.7104
266,267,1335,117,1672,159.256,28.2163,61.7837,99.7259
267,268,862,633,1654,175.40400000000002,4.36819,85.6318,99.9794
268,269,2211,177,1677,163.761,21.4413,68.5587,99.8762
269,270,4368,331,1692,163.796,21.0597,68.9403,99.9938
270,271,880,1766,1656,346.972,87.9994,2.00056,99.9706
271,272,1762,1130,1668,175.79,21.6098,68.3902,99.9813
272,273,872,1982,1686,91.9702,88.8019,1.19812,99.976
273,274,1707,641,1688,176.519,3.36437,86.6356,99.9883
274,275,645,3311,1692,350.13199999999995,31.3878,58.6122,99.9581
275,276,621,526,1703,4.9534400000000005,1.61642,88.3836,99.9929
276,277,4509,1036,1715,167.791,55.1752,34.8248,99.9548
277,278,5759,3419,1779,198.523,78.6892,11.3108,99.9614
278,279,11151,1966,1774,184.303,42.555,47.445,89.0323
279,280,6085,1295,1745,176.843,40.8145,49.1855,99.1488
280,281,13457,2132,1760,355.30800000000005,30.9582,59.0418,99.9826
281,282,7775,3198,1766,0.0806998,85.2364,4.76362,99.9448
282,283,608,3373,1731,202.413,79.7238,10.2762,99.9616
283,284,34184,230,1832,341.744,59.5968,30.4032,99.9675
284,285,2015,1408,1751,331.776,55.2044,34.7956,99.99
285,286,6680,641,1785,349.01199999999994,28.116,61.88399999999999,99.1078
286,287,3540,2302,1761,342.394,47.3998,42.6002,99.8802
287,288,1888,3272,1758,197.61,77.1798,12.8202,99.992
288,289,2680,552,1783,343.8180000000001,28.0085,61.9915,99.9087
289,290,20387,2897,1812,109.718,86.0337,3.9663,93.7153
290,291,776,485,1769,178.093,56.9435,33.0565,99.9749
291,292,6723,1610,1792,339.432,54.6144,35.3856,99.8938
292,293,13905,391,1842,357.962,2.78378,87.2162,99.9785
293,294,81933,1511,2024,153.403,75.4841,14.5159,94.4651
294,295,2426,2238,1792,348.371,26.8644,63.1356,99.9628
295,296,5157,2032,1814,358.418,23.4771,66.5229,99.8331
296,297,557,112,1783,328.918,65.8063,24.1937,99.7998
297,298,2656,1351,1791,355.146,22.8936,67.1064,99.9682
298,299,1502,870,1790,343.462,29.7218,60.2782,99.9963
299,300,1476,1820,1798,121.019,87.4818,2.5182,99.9884
300,301,2694,1179,1800,190.855,73.4979,16.5021,99.9809
301,302,35393,3177,1910,352.026,25.8606,64.1394,98.8978
302,303,947,1290,1807,355.9480000000001,22.0834,67.9166,99.9521
303,304,1098,1100,1801,358.08,10.7461,79.2539,99.9981
304,305,921,1316,1804,356.656,13.7921,76.2079,99.9764
305,306,12537,483,1895,354.499,10.2904,79.7096,99.7905
306,307,12787,1715,1858,148.755,62.7405,27.2595,99.974
307,308,5016,1901,1842,353.706,14.2372,75.7628,99.5324
308,309,7333,686,1852,2.35615,12.3929,77.6071,99.9693
309,310,2825,1253,1832,356.853,13.1258,76.8742,99.9887
310,311,12531,1054,1900,174.46200000000005,80.3264,9.67362,99.9466
311,312,11530,2171,1889,179.39,48.4545,41.5455,99.9799
312,313,1597,2335,1842,347.951,26.6661,63.3339,99.994
313,314,5509,2098,1856,353.847,29.5141,60.4859,99.9312
314,315,2068,867,1831,356.819,3.14436,86.8556,99.9906
315,316,52542,2807,1942,357.569,5.05843,84.9416,100.012
316,317,684,1369,1835,356.5780000000001,13.1749,76.8251,99.9944
317,318,1513,560,1852,344.164,68.685,21.315,99.9916
318,319,2349,1189,1849,158.125,65.889,24.111,99.9814
319,320,1641,1124,1845,157.10399999999996,64.9761,25.0239,99.9377
320,321,4219,1589,1849,177.72099999999998,48.8618,41.1382,99.9896
321,322,1195,2390,1849,172.045,28.6096,61.3904,99.9921
322,323,2853,617,1868,2.2759400000000003,9.68583,80.3142,99.9685
323,324,1504,1303,1861,355.9190000000001,16.0949,73.9051,99.7188
324,325,17066,860,1919,356.525,17.5209,72.4791,99.4535
325,326,5929,1840,1883,171.43200000000004,22.6754,67.3246,99.7839
326,327,1096,890,1862,356.594,3.68819,86.3118,99.9934
327,328,582,933,1868,169.049,84.6429,5.35714,99.8519
328,329,718,1999,1885,183.705,56.074,33.926,99.5769
329,330,22204,1340,1945,352.097,37.1734,52.8266,99.7299
330,331,724,1218,1882,146.43,87.5555,2.44453,99.9568
331,332,689,3412,1880,173.639,52.4152,37.5848,99.9481
332,333,586,1267,1879,355.783,20.1792,69.8208,99.9085
333,334,10395,1120,1979,171.10299999999995,44.9938,45.0062,97.5122
334,335,636,1625,1887,346.8730000000001,57.4004,32.5996,99.9938
335,336,958,732,1906,357.468,20.9042,69.0958,99.9515
336,337,875,583,1899,357.5180000000001,10.2576,79.7424,99.9865
337,338,5562,619,1933,347.314,67.8778,22.1222,99.9297
338,339,2506,3273,1939,161.083,65.9584,24.0416,99.88
339,340,835,1971,1914,338.2290000000001,34.5333,55.4667,99.8813
340,341,1582,1628,1922,349.865,39.8472,50.1528,99.9878
341,342,1501,1220,1930,155.181,64.8472,25.1528,99.9931
342,343,39630,2072,2006,355.144,49.4458,40.5542,78.6007
343,344,16407,1820,2012,172.299,17.3147,72.6853,99.724
344,345,674,3446,1944,154.35,71.0502,18.9498,99.9705
345,346,1982,742,1945,356.764,13.1043,76.8957,99.9326
346,347,2153,1691,1936,182.719,56.1235,33.8765,99.9849
347,348,6725,1767,1962,172.759,27.046,62.95399999999999,99.9432
348,349,4840,401,1956,356.395,32.6235,57.3765,99.9776
349,350,3545,319,1961,358.63699999999994,44.7545,45.2455,99.8857
350,351,759,3021,1940,158.72,81.8961,8.103860000000001,99.7838
351,352,2766,199,1985,172.987,6.37581,83.6242,99.9457
352,353,33714,612,2036,353.131,25.353,64.64699999999999,99.9168
353,354,2130,2271,1985,345.884,45.5955,44.4045,99.8806
354,355,1723,2986,1994,3.4469199999999995,1.70207,88.2979,99.9107
355,356,3966,1223,1994,4.2378,46.4463,43.5537,99.9827
356,357,1463,907,1989,358.374,11.9696,78.0304,99.9667
357,358,2129,1016,1998,164.96,32.9909,57.0091,99.6009
358,359,5989,3091,2036,3.32376,4.16489,85.8351,99.7225
359,360,2399,825,1996,359.3769999999999,4.293069999999998,85.7069,99.987
360,361,4751,312,2028,182.657,9.48283,80.5172,99.9752
361,362,34272,2453,2096,0.995568,1.03836,88.9616,99.3262
362,363,3649,1009,2040,184.732,31.4519,58.5481,99.7355
363,364,1583,936,2039,175.56900000000005,3.9446,86.0554,99.6844
364,365,925,238,2020,349.241,62.1675,27.8325,99.9958
365,366,1132,82,2041,169.77200000000005,53.729,36.271,99.9285
366,367,2073,3243,2027,354.022,12.1686,77.8314,99.9937
367,368,4911,1279,2048,187.086,38.0781,51.9219,99.9672
368,369,19173,421,2104,353.055,21.8222,68.1778,98.8324
369,370,204798,826,2284,168.007,68.2674,21.7326,66.3693
370,371,10128,2846,2060,352.876,24.346,65.654,99.8949
371,372,684,1217,2045,173.78599999999997,7.27142,82.7286,99.9898
372,373,1801,201,2053,175.137,11.1239,78.8761,99.9863
373,374,1183,1335,2053,354.935,1.20174,88.7983,99.9973
374,375,7313,1183,2108,175.982,2.52247,87.4775,99.9413
375,376,685,3178,2053,355.083,11.8951,78.1049,99.9317
376,377,15488,276,2117,170.27700000000004,42.4744,47.5256,99.9916
377,378,42471,1810,2198,167.206,48.9913,41.0087,99.7116
378,379,1191,2349,2064,352.8280000000001,10.6088,79.3912,99.9939
379,380,6304,2294,2090,352.291,8.262960000000001,81.737,99.9802
380,381,598,3212,2061,169.236,53.2976,36.7024,99.9621
381,382,5022,1862,2088,175.14,52.7464,37.2536,99.9915
382,383,8726,2742,2113,323.933,73.00399999999998,16.996,99.9771
383,384,2355,1941,2096,356.2340000000001,39.8115,50.1885,99.8421
384,385,710,319,2064,181.792,14.3001,75.6999,99.9977
385,386,4408,2658,2103,6.27664,9.15411,80.8459,99.9945
386,387,2402,3021,2090,171.636,9.67109,80.3289,99.9799
387,388,1192,84,2119,9.70193,77.0693,12.9308,99.9819
388,389,506,3275,2088,166.791,52.6866,37.3134,99.9852
389,390,5833,3338,2128,165.247,52.8948,37.1052,99.9169
390,391,1424,1354,2112,177.101,2.53551,87.4645,99.9976
391,392,23803,3054,2169,173.19400000000005,6.80548,83.1945,99.9687
392,393,8314,1281,2125,174.355,2.994,87.006,99.9166
393,394,3781,3260,2130,166.68,50.4787,39.5213,99.9656
394,395,5580,2622,2147,8.44807,11.1115,78.8885,99.9885
395,396,1571,2884,2111,321.472,74.44,15.56,99.9939
396,397,5860,2237,2161,355.477,43.432,46.56800000000001,99.9284
397,398,2809,2820,2142,169.47400000000005,21.7068,68.2932,99.958
398,399,503,1403,2128,173.85299999999995,4.85421,85.1458,99.9987
399,400,1787,654,2138,356.17,11.3223,78.6777,99.9931
400,401,33341,2957,2255,1.62021,6.9167,83.0833,99.8735
401,402,13935,1569,2242,174.53799999999995,5.3062,84.6938,99.9772
402,403,2327,476,2169,350.365,33.5613,56.4387,99.9217
403,404,2839,2151,2174,172.58900000000003,1.51748,88.4825,99.9861
404,405,11075,2548,2220,168.245,52.7348,37.2652,99.9385
405,406,717,1797,2159,209.579,59.9752,30.0248,99.9965
406,407,11785,239,2209,172.322,23.4568,66.5432,99.9828
407,408,4080,2710,2186,3.95661,7.65522,82.3448,99.9904
408,409,1139,1632,2176,171.38,6.60796,83.39200000000002,99.9233
409,410,1078,3219,2187,4.97695,1.68465,88.3153,99.9944
410,411,37628,1268,2250,174.65,8.86918,81.1308,99.9714
411,412,1554,2055,2188,344.471,35.626,54.374,99.9426
412,413,794,2585,2180,176.657,69.4322,20.5678,99.994
413,414,18532,1711,2291,177.942,38.3171,51.6829,99.7228
414,415,1138,2275,2192,173.00099999999995,49.1805,40.8195,99.9749
415,416,3894,1968,2227,346.157,54.0387,35.9613,45.797
416,417,2697,2774,2215,356.228,10.7804,79.2196,99.9925
417,418,128516,491,2469,359.351,74.7873,15.2127,56.7031
418,419,930,402,2212,162.757,49.5286,40.4714,99.9938
419,420,1601,2238,2227,357.247,10.3125,79.6875,99.988
420,421,576,2346,2216,178.69099999999997,6.85562,83.1444,99.9567
421,422,1681,2119,2235,167.188,49.9719,40.0281,99.9816
422,423,11114,2682,2281,339.94199999999995,84.6666,5.33344,99.9519
423,424,18386,2402,2294,347.805,9.17894,80.8211,99.8815
424,425,6056,2052,2260,177.577,6.12132,83.8787,99.9897
425,426,1069,2292,2231,177.565,7.76426,82.2357,99.989
426,427,3060,3183,2250,175.425,7.00236,82.9976,99.9956
427,428,1119,1798,2260,345.56,35.3533,54.6467,99.9956
428,429,2641,2504,2270,352.94199999999995,45.0242,44.9758,99.921
429,430,5379,2778,2274,168.81599999999997,26.9466,63.0534,99.9492
430,431,1709,3249,2278,175.667,5.63296,84.367,99.95
431,432,1601,2153,2281,180.666,6.19821,83.8018,99.9987
432,433,1941,2189,2300,178.28599999999997,6.39472,83.6053,99.9966
433,434,8057,2247,2324,353.175,53.6203,36.3797,99.9172
434,435,1076,3175,2294,169.834,44.4044,45.5956,99.7546
435,436,26716,228,2368,357.987,28.2434,61.7566,99.9143
436,437,1756,2116,2310,179.418,8.47775,81.5223,99.9926
437,438,17529,2765,2380,184.362,66.3655,23.6345,99.9294
438,439,79885,2082,2475,349.338,7.17404,82.82600000000002,99.745
439,440,11161,3202,2351,175.014,7.555919999999999,82.4441,99.9765
440,441,59892,2540,2443,183.33900000000003,24.5818,65.4182,99.8898
441,442,547,79,2319,172.01,77.4258,12.5742,99.9815
442,443,1358,1444,2321,167.86900000000003,60.8857,29.1144,99.9341
443,444,1133,1772,2320,346.595,31.4809,58.5191,99.9869
444,445,23421,1285,2380,167.972,62.5866,27.4134,99.9431
445,446,7272,1097,2359,161.333,61.28100000000001,28.719,99.9546
446,447,121165,1341,2617,170.053,26.468000000000004,63.532,62.84
447,448,539,3303,2330,159.817,54.3341,35.6659,99.658
448,449,16764,3044,2390,166.327,25.9751,64.0249,99.9415
449,450,4454,1650,2381,346.824,34.5208,55.4792,99.6004
450,451,2205,3374,2344,359.6040000000001,30.7789,59.2211,99.9388
451,452,653,1618,2332,170.548,46.0446,43.9554,99.9271
452,453,1303,1809,2358,179.55200000000005,68.1823,21.8177,99.8942
453,454,1811,1392,2361,10.0016,83.3644,6.635560000000001,99.9876
454,455,1304,3426,2370,163.28799999999995,60.3464,29.6536,99.9358
455,456,5369,1899,2408,356.472,10.8521,79.1479,99.9503
456,457,6996,844,2396,170.918,60.6806,29.3193,99.9892
457,458,6176,3242,2429,155.70600000000005,55.7401,34.2599,99.9102
458,459,797,1180,2372,176.87099999999995,2.28954,87.7105,99.9897
459,460,699,3300,2396,158.08700000000005,58.6165,31.3835,99.9589
460,461,6089,2275,2405,177.08,7.01547,82.9845,99.9862
461,462,515,2381,2371,182.238,23.0102,66.9898,99.9881
462,463,1914,3344,2415,155.737,60.3734,29.6266,99.8773
463,464,2108,2838,2396,1.11448,21.1086,68.8914,99.9686
464,465,3336,2913,2409,183.246,65.9355,24.0645,99.937
465,466,1134,1822,2412,158.785,58.2433,31.7567,99.9678
466,467,5456,2996,2445,3.77259,17.4219,72.5781,99.8718
467,468,757,344,2412,11.8575,65.4184,24.5816,99.9788
468,469,16664,1068,2458,359.85,22.8791,67.1209,99.9361
469,470,6302,1737,2452,175.775,25.5491,64.4509,99.9906
470,471,637,1359,2428,7.776680000000002,80.205,9.79497,99.9742
471,472,1843,3157,2440,3.20739,19.1673,70.8327,99.9822
472,473,28495,244,2539,159.689,41.7254,48.2746,99.7365
473,474,44403,2874,2575,355.036,15.7299,74.2701,75.0252
474,475,2261,1397,2489,175.935,5.93875,84.0612,99.9701
475,476,599,1651,2470,179.43900000000005,8.289530000000001,81.7105,99.9947
476,477,5043,1884,2497,355.67800000000005,2.78552,87.2145,99.3443
477,478,7561,1285,2510,178.95,5.39582,84.6042,99.8599
478,479,5281,92,2554,153.343,48.2502,41.7498,99.799
479,480,3927,1143,2498,1.61914,5.71338,84.2866,99.9338
480,481,760,1372,2468,179.899,3.57436,86.4256,99.9992
481,482,26845,3171,2561,176.167,2.4306400000000004,87.5694,99.7891
482,483,1540,1215,2493,0.418538,2.69136,87.3086,99.9846
483,484,2581,3267,2514,5.13547,9.80029,80.1997,99.9699
484,485,2311,1632,2507,176.078,10.7582,79.2418,99.9866
485,486,1285,2651,2502,182.304,65.7626,24.2374,99.9634
486,487,1261,1583,2510,173.27200000000005,14.9058,75.0942,99.9965
487,488,22257,2295,2562,350.251,40.8929,49.1071,99.9503
488,489,2360,2735,2516,354.051,12.2825,77.7175,99.9974
489,490,4742,3013,2522,188.981,72.9658,17.0342,99.5214
490,491,560,1688,2516,178.985,8.64542,81.3546,99.9951
491,492,30479,2491,2637,155.137,58.6002,31.3998,99.941
492,493,35950,941,2641,342.545,42.4314,47.5686,94.8013
493,494,1948,2742,2562,178.509,73.4861,16.5139,99.8229
494,495,7997,2701,2613,173.709,0.117081,89.8829,99.875
495,496,8453,1939,2602,181.914,68.5372,21.4628,99.9387
496,497,2423,3055,2605,173.888,2.71105,87.2889,99.9817
497,498,5812,759,2658,351.1040000000001,27.738000000000003,62.262,99.9899
498,499,701,1086,2581,25.4637,7.2758600000000015,82.7241,99.9244
499,500,8019,2891,2661,351.684,10.4735,79.5265,99.9716
500,501,558,2602,2619,156.298,56.2771,33.7229,99.9154
501,502,690,1590,2628,5.6079300000000005,2.32835,87.6717,99.9843
502,503,2734,2312,2636,152.306,65.7626,24.2374,99.9849
503,504,827,1082,2639,26.0504,10.5163,79.4837,99.9947
504,505,10054,3180,2667,7.226310000000002,15.3893,74.6107,99.9026
505,506,136467,933,2915,177.79,38.6433,51.3567,86.0308
506,507,31839,349,2772,357.121,2.70132,87.2987,99.9128
507,508,3039,2369,2660,175.18,5.1017800000000015,84.8982,99.9964
508,509,27628,217,2704,170.861,52.371,37.629,99.9091
509,510,12060,1564,2699,2.0028200000000003,2.43111,87.5689,99.9621
510,511,55153,2950,2810,355.899,8.10368,81.8963,99.8865
511,512,4869,2273,2694,176.023,4.97501,85.025,99.9933
512,513,3943,2214,2696,354.306,35.3889,54.6111,99.9581
513,514,4667,484,2696,172.703,24.8033,65.1967,99.7712
514,515,23488,2005,2797,355.892,22.4047,67.5953,97.504
515,516,9430,2129,2725,180.379,67.0811,22.9189,99.9679
516,517,11938,1722,2735,346.7580000000001,78.1393,11.8607,99.9786
517,518,3879,2378,2724,343.526,38.4748,51.5252,99.9498
518,519,577,821,2698,186.129,59.4712,30.5288,99.7593
519,520,727,3240,2706,2.71133,2.19188,87.8081,99.9973
520,521,1529,2692,2715,177.576,34.914,55.08600000000001,99.9834
521,522,507,2337,2698,149.68,59.4204,30.5796,99.9982
522,523,1520,2038,2723,1.96798,25.0311,64.9689,99.9396
523,524,10415,3208,2769,169.33,34.0373,55.9627,99.9855
524,525,1147,3282,2730,356.788,5.43042,84.5696,99.951
525,526,647,2826,2743,310.04,84.7641,5.23589,99.9652
526,527,1086,1376,2729,181.933,74.1284,15.8715,99.9956
527,528,9019,2450,2778,0.55774,1.70047,88.2995,99.8102
528,529,5109,2758,2748,292.343,84.4323,5.56766,99.9852
529,530,1857,711,2746,351.721,45.3907,44.6093,99.9981
530,531,919,3317,2770,355.065,6.6935,83.3065,99.9497
531,532,715,1457,2759,154.60299999999995,70.1453,19.8547,99.696
532,533,14134,2600,2791,189.586,85.0273,4.97272,99.9722
533,534,20810,1343,2863,351.661,5.94442,84.0556,99.9061
534,535,1771,2206,2770,0.650189,6.1099,83.8901,99.9934
535,536,653,1836,2762,353.425,38.2612,51.7388,99.9143
536,537,3170,2100,2792,4.88136,9.60753,80.3925,99.9647
537,538,3796,113,2811,343.902,54.1124,35.8876,99.8031
538,539,2741,178,2782,156.584,46.7799,43.2201,99.9829
539,540,20063,1100,2879,165.669,48.0709,41.9291,99.9481
540,541,28236,2335,2857,355.7680000000001,24.0581,65.9419,99.9587
541,542,825,1624,2781,10.8798,11.6934,78.3066,99.9967
542,543,619,85,2808,165.33900000000003,46.5887,43.4113,99.921
543,544,1781,1519,2791,160.964,70.0441,19.9559,99.9944
544,545,5604,1807,2851,358.547,0.35537,89.6446,99.9575
545,546,2692,1592,2812,165.153,63.9801,26.0199,99.992
546,547,2962,1923,2820,354.6790000000001,27.19,62.81,99.9933
547,548,7051,1730,2813,1.58855,19.9341,70.0659,99.9839
548,549,4661,2200,2827,3.9407,9.78203,80.218,99.9373
549,550,1369,3144,2809,347.3280000000001,59.7488,30.2512,99.9128
550,551,1767,1442,2816,174.422,47.38,42.62,99.1485
551,552,3184,1872,2828,355.158,26.7813,63.2187,99.9903
552,553,47835,2694,2933,163.657,40.1275,49.8725,99.9841
553,554,3387,1639,2839,356.2030000000001,3.5937900000000003,86.4062,99.9971
554,555,723,598,2815,181.079,11.4832,78.5168,99.9796
555,556,714,1263,2828,162.936,49.3818,40.6182,99.9609
556,557,8465,3207,2870,0.5120239999999999,4.38245,85.6175,99.9707
557,558,1577,622,2845,179.467,3.38275,86.6172,99.9898
558,559,18540,419,2944,180.429,2.08216,87.9178,99.7656
559,560,8014,1405,2921,179.15200000000004,67.8764,22.1236,99.9917
560,561,2302,569,2859,178.90099999999995,53.5851,36.4149,99.9932
561,562,4435,830,2859,342.282,45.8036,44.1964,99.9977
562,563,19440,3035,2913,359.921,3.50509,86.4949,99.9246
563,564,4123,334,2899,179.79,0.867233,89.1328,99.8851
564,565,17548,1497,2949,357.55,4.31979,85.6802,99.8014
565,566,5884,2545,2882,173.81799999999996,88.4721,1.5279,99.9898
566,567,6300,2092,2903,2.80262,4.14705,85.853,99.9755
567,568,3232,1681,2885,203.716,65.6181,24.3819,99.9969
568,569,2565,3269,2892,310.709,85.0541,4.94585,99.9938
569,570,1221,539,2891,179.946,4.6307,85.3693,99.9878
570,571,43061,2219,2996,0.5377109999999999,8.56076,81.4392,99.8346
571,572,539,291,2876,178.435,1.60449,88.3955,99.9793
572,573,3349,1869,2897,179.8,3.51983,86.4802,99.9977
573,574,3857,664,2910,340.2290000000001,40.9974,49.0026,99.9387
574,575,5259,113,2933,166.014,42.9773,47.0227,99.9054
575,576,2609,605,2917,178.56900000000005,5.2915,84.7085,99.9685
576,577,1478,3132,2917,212.142,81.7836,8.216380000000001,99.9799
577,578,576,1581,2914,2.28165,1.85256,88.1474,99.9984
578,579,7767,1968,2940,331.19699999999995,62.3789,27.6211,99.2966
579,580,11869,2441,2972,331.511,84.0671,5.932930000000002,99.8515
580,581,562,1746,2935,355.906,11.307,78.693,99.9307
581,582,2044,1217,2942,162.08700000000005,48.2042,41.7958,99.9918
582,583,2072,1655,2954,4.3042,13.0219,76.9781,99.9969
583,584,1130,1700,2948,5.53913,13.0097,76.9903,99.9951
584,585,903,1504,2943,357.636,1.31287,88.6871,99.9996
585,586,10540,3133,2976,345.115,35.6294,54.3706,99.9405
586,587,1134,1604,2954,5.35385,12.0007,77.9993,99.9913
587,588,1804,3252,2963,7.98021,6.15311,83.8469,99.9922
588,589,995,704,2960,182.386,9.50473,80.4953,99.9837
589,590,100827,3202,3096,356.148,27.1866,62.8134,93.6952
590,591,1364,1010,2965,175.929,12.7826,77.2174,99.9978
591,592,1212,1093,2967,185.096,53.2944,36.7056,99.994
592,593,1068,312,2983,353.101,6.42251,83.5775,99.9104
593,594,5616,1700,3009,352.684,37.3049,52.6951,96.0862
594,595,15872,106,3153,12.0034,39.4058,50.5942,99.8414
595,596,7489,1325,3021,357.122,9.27062,80.7294,99.9696
596,597,7535,666,3041,182.446,5.05804,84.94200000000002,99.9587
597,598,3023,1999,3020,1.83941,6.41945,83.5806,99.9355
598,599,65414,2544,3219,4.30376,1.95247,88.0475,99.8541
599,600,2305,1596,3014,1.00878,7.133960000000001,82.866,99.9926
600,601,13350,216,3053,181.181,4.0201400000000005,85.9799,99.9801
601,602,22289,610,3104,183.691,1.38491,88.6151,99.965
602,603,620,886,3010,176.109,8.76646,81.2335,99.8818
603,604,979,318,3024,332.9890000000001,47.5965,42.4035,99.9944
604,605,36434,440,3168,183.077,0.393364,89.6066,99.7226
605,606,10511,1794,3092,182.05,2.2800700000000003,87.7199,99.8643
606,607,1171,824,3028,182.782,5.91908,84.0809,99.995
607,608,18402,1348,3103,177.97099999999998,72.0651,17.9349,99.9336
608,609,59093,1028,3200,185.386,7.452660000000002,82.5473,100.016
609,610,554,740,3029,182.245,79.0891,10.9109,99.5951
610,611,856,864,3041,0.968641,80.6691,9.3309,99.9429
611,612,7913,2736,3079,5.3533,19.9985,70.0015,99.8646
612,613,844,2658,3053,9.06096,15.7565,74.2435,99.9383
613,614,5567,2414,3098,14.8916,84.0388,5.96125,99.9607
614,615,20297,816,3139,2.8604700000000003,79.5035,10.4965,99.9133
615,616,796,531,3070,5.66788,0.757263,89.2427,99.9919
616,617,1455,1714,3089,175.67,3.2794300000000005,86.7206,99.9667
617,618,57546,1945,3230,0.767166,4.75668,85.2433,99.6801
618,619,851,1755,3079,353.841,52.9655,37.0345,99.8294
619,620,578,2121,3088,0.353123,1.93745,88.0626,99.9993
620,621,1337,1495,3114,352.37,2.1870700000000003,87.8129,99.9898
621,622,9313,2256,3138,183.704,1.8617,88.1383,99.9869
622,623,1964,1374,3144,178.322,71.9792,18.0208,99.9718
623,624,11867,267,3186,180.183,6.19485,83.8052,99.9199
624,625,980,195,3139,178.15599999999995,6.14159,83.8584,99.9988
625,626,8520,1670,3180,354.761,2.2676,87.7324,99.857
626,627,649,2093,3137,5.99896,1.95013,88.0499,99.9874
627,628,529,527,3143,6.07152,0.9869,89.0131,99.9914
628,629,9387,1467,3192,350.117,40.4112,49.5888,71.0845
629,630,2604,2701,3179,3.66112,0.8142699999999999,89.1857,99.9981
630,631,38685,678,3265,193.198,1.27155,88.7284,99.9861
631,632,27279,3013,3310,356.15,29.6321,60.3679,97.1583
632,633,8736,3219,3236,8.26163,10.8226,79.1774,99.9701
633,634,1562,555,3209,180.765,5.8268900000000015,84.1731,99.9924
634,635,1710,1547,3208,352.4790000000001,6.6661800000000015,83.3338,99.9504
635,636,14142,2222,3246,355.107,48.7554,41.2446,99.9815
636,637,923,1747,3205,347.285,62.1283,27.8717,99.6052
637,638,3652,3014,3221,4.83641,11.8102,78.1898,99.9583
638,639,169734,1473,3450,347.089,64.1206,25.8794,94.4336
639,640,2258,177,3235,8.80037,10.1981,79.8019,99.9868
640,641,3579,195,3269,13.7243,29.2759,60.7241,99.7845
641,642,19631,3151,3345,179.25599999999997,22.8716,67.1284,99.9235
642,643,1408,2381,3275,181.0,0.0,90.0,100.004
643,644,2920,3323,3285,223.846,83.5282,6.47184,99.9554
644,645,17792,247,3344,158.719,62.0383,27.9617,99.9956
645,646,149656,1021,3467,2.88472,4.66167,85.3383,99.9052
646,647,1681,3278,3288,217.198,83.3927,6.607289999999999,99.953
647,648,3785,1750,3312,2.5522400000000003,6.1654300000000015,83.8346,99.9769
648,649,149242,2184,3491,3.94306,49.1693,40.8307,74.5359
649,650,3978,2878,3328,176.61,40.2344,49.7656,99.9795
650,651,1067,1828,3313,2.14899,6.37242,83.6276,99.9943
651,652,78831,243,3555,8.64925,13.5346,76.4654,99.4538
652,653,38834,437,3402,183.255,62.3297,27.6703,99.957
653,654,9488,3242,3390,187.853,9.75912,80.2409,99.9986
654,655,4095,2920,3368,7.720389999999999,35.8658,54.1342,99.9502
655,656,2225,3412,3363,172.01,28.4315,61.5685,99.9593
656,657,1190,1760,3373,3.35537,13.117,76.883,99.9993
657,658,2874,646,3392,10.7612,20.0396,69.9604,99.8207
658,659,3564,3335,3392,350.626,70.9724,19.0276,99.9537
659,660,30353,2664,3439,359.8880000000001,4.9930400000000015,85.007,99.9692
660,661,3004,2830,3424,131.127,69.5938,20.4062,99.9917
661,662,5534,1937,3435,359.004,9.9606,80.0394,99.6391
662,663,2314,2884,3457,127.058,68.7367,21.2633,99.776
663,664,1265,3412,3430,171.36900000000003,28.5404,61.4596,99.9491
664,665,6851,1340,3441,177.048,7.636830000000002,82.3632,99.9953
665,666,1152,2907,3424,172.857,49.0578,40.9422,99.0736
666,667,170230,2965,3744,15.8686,37.4698,52.5302,78.0072
667,668,13009,3100,3508,184.739,18.4988,71.5012,99.6819
668,669,41889,3241,3592,173.519,7.36603,82.634,99.9014
669,670,8532,1582,3483,180.323,35.4911,54.5089,99.971
670,671,3588,652,3478,1.68012,4.77142,85.2286,99.9773
671,672,56456,1669,3622,0.517142,51.8619,38.1381,99.526
672,673,2919,3415,3505,169.592,8.46674,81.5333,99.9742
673,674,1104,782,3482,1.99757,5.66587,84.3341,99.9836
674,675,6434,1882,3509,358.096,4.77001,85.23,99.8855
675,676,581,1669,3500,3.1369,4.58007,85.4199,99.9878
676,677,49649,2644,3574,183.072,5.56815,84.4318,99.929
677,678,1147,3154,3525,183.508,13.263,76.737,99.999
678,679,873,547,3522,183.32,3.15495,86.8451,99.9749
679,680,664,1698,3541,157.629,60.9177,29.0823,99.8722
680,681,1297,503,3575,8.59848,1.21394,88.7861,99.9904
681,682,1064,1809,3563,0.99633,0.0369797,89.963,100.002
682,683,24416,3385,3768,4.42088,42.5146,47.4854,98.5943
683,684,2408,1496,3579,167.71400000000003,64.2663,25.7337,99.9876
684,685,28632,2421,3692,2.92775,23.3737,66.6263,94.4764
685,686,17245,1881,3656,159.563,57.5803,32.4197,99.9846
686,687,17177,501,3692,4.15993,2.07536,87.9246,99.9385
687,688,66900,854,3761,356.913,23.4597,66.5403,99.8918
688,689,1060,704,3640,177.40099999999995,6.64342,83.3566,99.977
689,690,1482,1476,3662,176.39700000000005,27.2844,62.7156,99.985
690,691,44614,2269,3766,176.82,30.2621,59.7379,99.9799
691,692,6637,1444,3730,153.468,52.8768,37.1232,99.382
692,693,12403,2076,3747,177.115,1.06875,88.9313,99.916
693,694,4216,1594,3734,157.945,53.3404,36.6596,99.9605
694,695,70041,1743,3836,357.764,54.2542,35.7458,99.7901
695,696,12671,164,3752,172.18599999999995,45.2424,44.7576,99.8866
696,697,739,3044,3720,172.47,72.2276,17.7724,99.9956
697,698,4082,1855,3768,175.106,30.6188,59.3812,99.9272
698,699,423089,1534,4222,0.615304,21.6939,68.3061,69.4498
699,700,2812,2598,3758,2.96596,2.20764,87.7924,99.9873
700,701,11240,380,3799,1.28184,27.3167,62.6833,99.9319
701,702,528,2494,3757,0.615695,1.92878,88.0712,99.9995
702,703,18510,587,3794,356.735,52.3343,37.6657,99.9142
703,704,634,2533,3762,359.695,11.0426,78.9574,99.9896
704,705,694,3034,3788,9.40073,38.9399,51.0601,99.9967
705,706,7563,2619,3826,7.222010000000001,33.4024,56.5976,99.9555
706,707,16242,162,3863,9.64849,6.19015,83.8099,99.8241
707,708,11652,1480,3859,5.02369,24.2863,65.7137,99.8652
708,709,12858,2052,3850,2.99041,11.1511,78.8489,99.9253
709,710,20609,3240,3893,178.86900000000003,50.9312,39.0688,99.9951
710,711,35465,2492,3917,181.623,10.041,79.959,87.0792
711,712,644,2735,3814,177.241,3.91794,86.0821,99.989
712,713,2986,2174,3834,351.3280000000001,54.0496,35.9504,99.7244
713,714,8415,3325,3924,177.278,52.5109,37.4891,99.9467
714,715,13591,558,3898,342.69699999999995,62.1073,27.8927,99.9303
715,716,51521,743,3975,162.996,17.7921,72.2079,99.8394
716,717,80636,2775,4012,0.709184,23.4946,66.5054,99.4706
717,718,1607,2172,3869,1.91626,20.1986,69.8014,99.9961
718,719,530,1410,3863,185.365,73.3284,16.6716,99.9516
719,720,829,337,3876,5.36512,6.66879,83.3312,99.9141
720,721,2914,256,3904,199.93,77.0999,12.9001,99.8858
721,722,3904,2001,3896,4.78471,8.11641,81.8836,99.9074
722,723,1242,304,3887,1.08016,5.84656,84.1534,99.9965
723,724,580,2187,3897,1.57735,12.5451,77.4549,99.9995
724,725,6404,1920,3935,3.41527,14.3575,75.6425,99.4297
725,726,2803,1024,3930,2.45516,5.15672,84.8433,99.9937
726,727,11805,3385,3999,356.8880000000001,68.5076,21.4924,99.8859
727,728,948,491,3913,177.017,1.87804,88.12200000000001,99.9991
728,729,14623,2161,3952,349.17800000000005,60.9279,29.0721,99.9528
729,730,3031,2277,3928,1.31553,12.5508,77.4492,99.9855
730,731,5879,1836,3955,329.7519999999999,63.7718,26.2282,99.9885
731,732,1050,413,3929,359.1230000000001,0.123528,89.8765,99.9267
732,733,3539,1109,3949,1.39423,27.6577,62.3423,99.8412
733,734,41873,436,4040,347.7030000000001,12.865,77.135,98.4948
734,735,11691,809,3978,358.038,22.3448,67.6552,99.9094
735,736,2592,2046,3949,12.6313,69.3488,20.6512,99.9556
736,737,24025,226,4004,190.498,42.0274,47.9726,99.8817
737,738,41254,1662,4035,6.19094,13.8818,76.1182,99.928
738,739,4489,2339,3978,8.708269999999999,23.8591,66.1409,99.9858
739,740,49017,3157,4122,5.40193,9.8698,80.1302,99.8925
740,741,2305,1194,3983,2.11818,7.85525,82.1448,99.9761
741,742,895,2018,3986,180.516,16.4137,73.5863,99.9983
742,743,848,3156,3979,3.40607,12.1527,77.8473,99.9943
743,744,7043,1952,4038,178.988,11.2368,78.7632,99.5714
744,745,1254,1148,3991,2.08732,7.58045,82.4195,99.9912
745,746,5431,1046,4007,1.96502,3.75451,86.2455,99.2695
746,747,531,107,3981,191.446,49.5702,40.4298,99.9555
747,748,14174,2329,4069,173.38299999999995,56.6125,33.3875,99.3921
748,749,1772,1848,4010,0.538043,20.7642,69.2358,99.9756
749,750,853,2972,4018,24.1731,26.9667,63.0333,99.973
750,751,17600,2150,4091,180.359,9.05257,80.9474,99.7418
751,752,49216,1131,4178,200.975,52.3062,37.6938,99.9896
752,753,2192,2530,4044,5.61971,26.7549,63.2451,99.4846
753,754,3528,1207,4065,188.693,39.1176,50.8824,99.9799
754,755,11290,865,4085,346.722,40.4042,49.5958,99.9782
755,756,71789,2953,4257,186.318,13.0974,76.9026,78.9765
756,757,2945,1008,4061,336.834,29.7654,60.2346,99.8343
757,758,24816,2525,4145,7.78575,65.8609,24.1391,99.901
758,759,17795,239,4134,203.57,79.6489,10.3511,99.7348
759,760,2412,2015,4091,181.977,14.6304,75.3696,99.9917
760,761,766,2935,4107,149.334,61.1164,28.8836,99.9632
761,762,755,948,4103,179.979,4.7801300000000015,85.2199,99.99
762,763,558,973,4128,179.791,5.1792,84.8208,99.9914
763,764,6347,2663,4131,170.132,56.0192,33.9808,99.9689
764,765,20140,884,4252,180.024,0.857986,89.14200000000002,99.9673
765,766,320579,631,4397,191.415,44.3954,45.6046,68.4229
766,767,13976,1683,4152,187.822,38.5431,51.4569,99.9624
767,768,10349,2287,4152,9.59309,66.8235,23.1765,99.9632
768,769,2908,2042,4140,14.9036,65.1025,24.8975,99.9918
769,770,1287,3188,4133,30.9228,10.3451,79.6549,99.9763
770,771,29758,3332,4214,25.4879,14.4511,75.5489,99.7802
771,772,781,949,4163,182.458,2.32652,87.6735,99.9969
772,773,958,3157,4172,159.94299999999996,65.8921,24.1079,99.9934
773,774,767,996,4184,176.615,4.7275800000000014,85.2724,99.9979
774,775,5364,2803,4213,185.602,8.67731,81.3227,99.9966
775,776,2373,1026,4209,179.11700000000005,2.7922700000000003,87.2077,99.9915
776,777,12560,2684,4256,186.057,3.5161800000000003,86.4838,99.9608
777,778,20021,2370,4258,7.31924,5.1713,84.8287,99.7717
778,779,1293,2028,4228,190.62,6.70269,83.2973,99.9732
779,780,168933,2365,4472,354.8730000000001,62.1199,27.8801,99.9435
780,781,21146,263,4341,5.78448,17.0105,72.9895,99.9539
781,782,978,3064,4297,151.642,59.6953,30.3047,99.9826
782,783,760,2227,4298,1.2008299999999998,20.9313,69.0687,99.9991
783,784,11249,3229,4349,349.446,13.8887,76.1113,99.9915
784,785,4972,2216,4354,6.64117,6.1983,83.8017,99.7837
785,786,3690,126,4350,191.229,36.8083,53.1917,99.9284
786,787,1013,1225,4346,174.28099999999995,5.7916,84.2084,99.9396
787,788,3159,3306,4386,3.85002,11.1985,78.8015,99.9947
788,789,2954,3158,4395,351.205,10.3928,79.6072,99.9816
789,790,736,3050,4388,357.939,5.28022,84.7198,99.9369
790,791,1166,908,4396,182.789,0.61998,89.38,99.9854
791,792,2031,3075,4408,191.708,42.2573,47.7427,99.9891
792,793,18785,142,4510,159.251,59.4208,30.5792,99.8686
793,794,973,2974,4421,178.359,0.24378200000000005,89.7562,99.9795
794,795,6470,609,4438,197.166,72.8751,17.1249,99.9533
795,796,11442,1546,4452,159.562,62.4698,27.5302,99.9881
796,797,40780,2804,4529,182.418,21.3238,68.6762,90.1054
797,798,44117,3085,4536,180.668,6.6469,83.3531,99.9502
798,799,6227,3275,4458,183.36900000000003,4.90932,85.0907,99.9073
799,800,2788,1722,4444,179.519,5.23186,84.7681,99.9434
800,801,847,1831,4465,184.843,4.41771,85.5823,99.985
801,802,753,1649,4457,11.618,30.5957,59.4043,99.9648
802,803,3591,1233,4494,28.1415,75.393,14.607,99.9087
803,804,3354,1844,4513,187.867,8.862169999999997,81.1378,99.7167
804,805,1063,3197,4490,179.34900000000005,0.798737,89.2013,99.9922
805,806,12337,3314,4589,11.2035,28.7937,61.2063,86.9061
806,807,5093,1702,4543,182.33900000000003,4.72398,85.27600000000002,99.9825
807,808,727,1571,4539,3.70607,67.6523,22.3477,99.9161
808,809,2010,1879,4559,179.40900000000005,3.98167,86.0183,99.9821
809,810,4642,1089,4560,19.2733,71.4769,18.5231,99.9446
810,811,3395,1618,4582,329.055,71.2582,18.7418,99.935
811,812,15918,784,4607,163.224,38.6792,51.3208,99.968
812,813,2106,2638,4567,172.69299999999996,12.9312,77.0688,76.67399999999998
813,814,1360,538,4579,3.95451,60.0022,29.9979,99.9767
814,815,1747,2585,4593,358.001,10.0058,79.9942,99.9719
815,816,4684,1736,4586,330.449,68.8123,21.1877,99.87
816,817,783,1163,4592,356.631,70.2854,19.7146,99.9344
817,818,504,1032,4605,10.0002,1.37447,88.6255,99.9986
818,819,1686,603,4616,32.0119,65.8081,24.1919,99.9307
819,820,1267,2639,4625,189.661,3.631780000000001,86.3682,99.9454
820,821,639,935,4609,10.3622,1.42043,88.5796,99.996
821,822,1663,2541,4629,182.37,22.399,67.601,99.9748
822,823,2463,3249,4633,182.217,2.65519,87.3448,99.975
823,824,3129,1753,4636,355.982,27.3501,62.6499,99.8487
824,825,1544,2701,4632,350.487,50.0752,39.9248,99.963
825,826,2202,92,4665,159.871,58.0459,31.9541,99.9817
826,827,848,1623,4660,356.801,25.1545,64.8455,99.9142
827,828,532,3288,4663,181.813,3.5658800000000004,86.4341,99.8463
828,829,943,3200,4675,181.281,4.640619999999998,85.3594,99.9645
