,Grain No.,Size [Pixel],center x-coordinate,center y-coordinate,mean azimuth [degree],mean latitude [degree],mean colatitude [degree],Regelungsgrad [%]
0,1,1397,1077,36,181.0,0.000106812,89.9999,100.004
1,2,1667,1577,45,181.0,0.0,90.0,100.004
2,3,2837,2061,56,181.0,0.0,90.0,99.9982
3,4,1991,2568,62,181.0,0.0,90.0,100.004
4,5,898,3046,75,188.914,0.650017,89.35,99.9966
5,6,2513,3562,83,181.001,0.000190735,89.9998,100.0
6,7,29290,3979,557,196.444,69.498,20.502,99.6119
7,8,781,511,204,16.8288,18.4044,71.5956,99.7348
8,9,24735,387,286,188.052,70.3616,19.6384,99.851
9,10,39159,865,339,23.4048,46.7943,43.2057,99.819
10,11,3033,256,233,196.62,37.4766,52.5234,99.9656
11,12,594,1087,216,144.026,8.98971,81.0103,98.7174
12,13,4759,1228,251,28.3722,47.721,42.279,99.7364
13,14,17606,681,308,196.512,11.3911,78.6089,98.1798
14,15,2989,1588,257,203.055,0.496269,89.5037,98.3051
15,16,11116,581,261,21.6856,23.3641,66.6359,99.8522
16,17,7917,1365,274,200.665,31.2315,58.7685,99.8269
17,18,2444,190,258,194.765,29.4797,60.5203,99.8704
18,19,6108,1067,272,201.435,19.0418,70.9582,99.7376
19,20,36522,2206,351,193.421,9.77395,80.2261,99.6622
20,21,15114,1840,307,24.6856,15.4369,74.5631,99.8541
21,22,4217,1693,283,64.6116,68.6175,21.3825,99.945
22,23,889,2096,266,124.893,29.3566,60.6434,99.1463
23,24,761,1970,271,205.011,1.61636,88.3836,99.8627
24,25,18977,269,383,31.6225,1.19816,88.8018,99.7232
25,26,5440,2016,320,185.913,56.7904,33.2096,99.8712
26,27,4089,1534,307,53.8219,56.6633,33.3367,99.8794
27,28,15967,1179,341,25.3855,21.8231,68.1769,99.8683
28,29,15274,1568,356,205.616,18.5868,71.4132,97.4678
29,30,4443,1618,319,200.595,34.125,55.875,99.6967
30,31,987,1031,307,183.477,63.4204,26.5796,99.7203
31,32,2381,1280,324,28.5122,44.6318,45.3682,99.9494
32,33,672,1374,315,206.567,16.0535,73.9465,99.9656
33,34,4443,2396,326,179.235,79.6536,10.3464,99.9515
34,35,33347,3095,393,24.2831,36.8987,53.1013,99.8533
35,36,46802,1349,466,207.723,4.9997,85.0003,79.8184
36,37,8432,1004,371,194.796,23.3143,66.6857,99.7222
37,38,39715,2492,468,190.348,73.4759,16.5241,94.5029
38,39,4619,2756,330,199.219,8.5574,81.4426,99.8883
39,40,4146,517,356,17.2394,2.83578,87.1642,99.6382
40,41,6571,3292,368,47.0233,72.5162,17.4838,99.8599
41,42,2213,3344,337,48.5933,73.4863,16.5137,99.8826
42,43,2430,2604,352,27.8559,30.6299,59.3701,99.8124
43,44,20593,1992,432,189.901,48.9368,41.0632,93.3447
44,45,1768,1401,353,21.188,20.2626,69.7374,99.9946
45,46,12043,3482,436,199.103,20.1869,69.8131,98.8105
46,47,741,1899,354,32.7486,6.3474,83.6526,99.9712
47,48,814,739,356,186.46400000000003,2.30611,87.6939,99.9497
48,49,15251,2694,417,186.865,27.6847,62.3153,99.4234
49,50,4267,1835,373,199.716,49.2395,40.7605,99.9232
50,51,9506,1093,414,200.42,34.9541,55.0459,99.9942
51,52,1330,3220,379,184.299,77.7429,12.2571,99.7653
52,53,3370,651,394,142.157,79.4538,10.5462,99.9778
53,54,3399,1264,393,200.845,31.433000000000003,58.567,99.9941
54,55,3890,579,393,219.755,72.0599,17.9401,99.9863
55,56,6137,416,403,216.906,69.9476,20.0524,99.9801
56,57,2292,3374,389,165.25,77.5245,12.4755,99.9886
57,58,1471,1743,382,63.3819,86.9871,3.0129200000000003,99.9865
58,59,2874,2370,386,28.0561,36.2659,53.7341,99.9542
59,60,2202,2801,390,25.753,16.1857,73.8143,99.9921
60,61,2749,3520,403,190.051,73.6662,16.3338,99.91
61,62,3856,478,434,133.761,79.1522,10.8478,99.8693
62,63,33915,2752,506,18.5686,7.72411,82.2759,99.0801
63,64,1366,2959,410,172.729,55.1332,34.8668,99.9881
64,65,5957,356,452,189.518,72.0389,17.9611,99.9298
65,66,3285,1863,431,30.7576,6.21435,83.7857,99.9041
66,67,1795,3391,433,35.9181,73.4601,16.5399,99.9687
67,68,1345,1697,415,200.208,13.9805,76.0195,99.525
68,69,1221,3627,421,325.01,54.13800000000001,35.86199999999999,99.8549
69,70,1799,1433,437,17.6008,17.881,72.119,99.7411
70,71,1267,1755,421,81.4495,80.0841,9.91592,99.9951
71,72,31608,1789,525,198.427,16.8331,73.1669,99.0312
72,73,1799,2925,434,112.87,81.9141,8.08588,99.954
73,74,72978,984,652,23.4594,49.8143,40.1857,89.1902
74,75,10038,1598,461,204.817,47.6657,42.3343,99.9782
75,76,953,1167,429,197.615,9.11282,80.8872,99.9905
76,77,1806,2326,437,198.327,81.6877,8.31227,99.9805
77,78,1513,764,433,18.6671,14.903,75.097,99.8631
78,79,623,2097,431,204.513,50.1933,39.8067,99.9858
79,80,24650,731,503,192.873,2.7458,87.2542,98.9321
80,81,4112,3339,461,25.5408,5.1753800000000005,84.8246,99.9894
81,82,504,3417,445,16.0212,70.5601,19.4399,99.839
82,83,2545,3265,457,172.84900000000005,60.9491,29.0509,99.8449
83,84,1922,1228,449,14.2531,15.2373,74.7627,99.9912
84,85,4324,2264,468,200.085,11.0862,78.9138,99.9286
85,86,4621,572,466,192.326,2.67606,87.3239,99.9263
86,87,824,3444,453,20.1068,6.48325,83.5168,99.951
87,88,1048,512,460,216.834,69.6611,20.3389,99.9555
88,89,507,3638,448,332.581,41.9129,48.0871,99.2232
89,90,1021,2978,454,166.455,58.9071,31.0929,99.9801
90,91,63108,2151,591,27.1846,55.298,34.702,90.6338
91,92,2707,1152,480,11.2095,45.3378,44.6622,99.9636
92,93,3440,3028,507,193.586,30.0314,59.9686,99.936
93,94,735,1807,485,31.0342,71.8735,18.1265,99.8093
94,95,4494,2435,518,177.69099999999997,73.0625,16.9375,92.8481
95,96,518,3558,491,199.678,10.9047,79.0953,98.8874
96,97,1383,1448,498,34.7299,67.5893,22.4107,99.9085
97,98,1757,3443,511,188.75,11.6153,78.3847,99.9903
98,99,571,2218,497,27.0402,39.2734,50.7266,99.9787
99,100,7453,3100,526,104.53,76.0381,13.9619,99.4367
100,101,1814,2346,507,197.0,77.5935,12.4065,99.7546
101,102,3400,3265,511,17.5943,34.4673,55.5327,99.9936
102,103,12994,3240,550,183.027,69.30199999999999,20.698,84.1626
103,104,2456,1937,517,195.75,69.316,20.684,99.0936
104,105,11737,420,533,150.287,86.5118,3.48824,99.2121
105,106,580,311,509,201.643,56.7928,33.2072,99.6036
106,107,1058,2389,517,197.305,7.998939999999998,82.0011,99.9655
107,108,2725,3392,516,12.5978,37.6559,52.3441,99.9671
108,109,820,338,513,23.3621,8.07802,81.92200000000003,99.9317
109,110,2109,231,522,192.649,20.218,69.782,99.7545
110,111,3807,1611,541,55.8207,73.2746,16.7254,99.0099
111,112,1006,1505,526,46.0892,77.2089,12.7911,99.0952
112,113,16364,1162,615,36.8856,65.914,24.086,99.957
113,114,15794,2888,577,31.2696,69.4304,20.5696,99.3004
114,115,30910,1494,663,17.0034,45.2685,44.7315,91.9423
115,116,2128,538,555,38.0087,75.6771,14.3229,99.8188
116,117,1032,770,545,188.009,60.4849,29.5151,99.9868
117,118,6822,1670,597,22.1249,77.2242,12.7758,99.7105
118,119,17826,3475,623,51.2065,72.3341,17.6659,99.6049
119,120,10497,364,631,16.6876,42.8989,47.1011,99.5803
120,121,10293,2374,600,21.8871,10.1185,79.8815,99.9022
121,122,3228,727,577,22.4355,45.6258,44.3742,99.9785
122,123,686,1413,561,54.9388,75.6718,14.3282,99.712
123,124,3287,3366,579,194.628,51.3217,38.6783,99.9853
124,125,22237,818,653,15.4409,22.4174,67.5826,98.8084
125,126,1829,1078,565,201.4,7.62936,82.3706,99.9283
126,127,5472,2989,615,200.003,11.009,78.991,99.629
127,128,1892,225,575,13.8086,12.3078,77.6922,99.7755
128,129,914,3569,581,19.0155,15.5973,74.4027,99.4892
129,130,9593,469,630,209.055,65.5435,24.4565,99.8746
130,131,5445,2621,606,135.502,85.4953,4.50467,99.9728
131,132,9373,665,623,202.521,47.1481,42.8519,99.9061
132,133,658,270,583,12.5806,19.6698,70.3302,99.9948
133,134,4778,3099,597,191.753,33.225,56.775,99.9695
134,135,4320,1281,607,7.2265,69.7706,20.2294,99.9364
135,136,2935,845,617,195.154,68.1615,21.8385,99.9885
136,137,5323,539,618,22.6748,50.5862,39.4138,99.9595
137,138,3188,2746,606,22.5255,69.8334,20.1666,99.9918
138,139,32673,3343,716,29.9338,27.6556,62.3444,99.9508
139,140,3878,247,630,185.773,71.5031,18.4969,99.9119
140,141,4829,3225,628,342.889,75.9664,14.0336,99.9449
141,142,27536,1993,718,202.033,22.4643,67.5357,65.6623
142,143,664,1725,616,200.53,4.29652,85.7035,99.9332
143,144,6527,1864,635,16.698,21.5052,68.4948,99.9341
144,145,5036,1390,645,23.6575,57.1434,32.8566,99.668
145,146,1825,2684,639,199.096,11.5956,78.4044,99.991
146,147,16270,2780,681,194.582,65.2247,24.7753,99.9857
147,148,1710,3157,645,13.5495,67.9312,22.0688,99.9883
148,149,14709,1596,692,35.6571,59.3257,30.6743,99.9807
149,150,9357,2569,676,16.4358,8.35398,81.646,99.7848
150,151,7460,348,691,188.43400000000003,68.6218,21.3782,99.9804
151,152,1381,3108,643,25.7703,12.8119,77.1881,99.9839
152,153,2750,2317,661,187.009,4.65717,85.3428,99.9989
153,154,940,1764,648,204.337,3.1591,86.8409,99.9939
154,155,1120,3032,646,189.475,24.4075,65.5925,99.9946
155,156,2783,2914,654,178.385,61.3009,28.6991,99.9791
156,157,5367,280,695,18.3259,17.8057,72.1943,99.9017
157,158,19063,1266,705,12.172,28.4156,61.5844,99.9277
158,159,22601,2429,732,127.025,85.4697,4.53026,99.9131
159,160,3147,615,678,19.5192,15.4823,74.5177,99.9922
160,161,5782,1682,714,192.224,25.9995,64.0005,99.9699
161,162,15111,1830,735,16.722,51.7322,38.2678,99.8235
162,163,818,2355,692,45.9317,69.9985,20.0015,99.9453
163,164,5390,3137,716,286.698,87.8175,2.18247,99.9122
164,165,856,1898,697,12.9517,27.5185,62.4815,99.9934
165,166,42085,3023,786,19.8237,5.92623,84.0738,99.6875
166,167,1783,3226,698,187.255,1.52756,88.4724,99.9936
167,168,2531,3045,706,109.622,81.9978,8.002189999999999,99.8361
168,169,36049,517,830,199.213,9.84605,80.154,94.5154
169,170,584,2653,697,201.113,13.5818,76.4182,99.9982
170,171,3297,227,731,20.7401,6.50169,83.4983,99.9408
171,172,525,2103,711,36.9635,63.68899999999999,26.311,99.9762
172,173,706,566,708,20.4027,11.2752,78.7248,99.64
173,174,1665,1423,722,197.95,34.8069,55.1931,99.9916
174,175,6482,649,743,193.348,25.0146,64.9854,99.9939
175,176,14873,2699,783,22.1296,12.8966,77.1034,99.4258
176,177,997,172,738,20.03,6.16381,83.8362,99.8546
177,178,629,2280,729,12.6174,9.19382,80.8062,99.9933
178,179,1817,3219,735,149.263,73.9105,16.0895,99.9818
179,180,1129,3543,736,39.1302,33.5591,56.4409,99.778
180,181,3780,1394,761,207.144,55.6969,34.3031,99.9971
181,182,8418,3494,807,199.478,12.1632,77.8368,93.8258
182,183,3519,2141,755,12.5402,7.859089999999999,82.1409,99.9777
183,184,2448,382,755,208.927,48.2697,41.7303,99.9923
184,185,623,2581,754,185.678,27.2411,62.7589,99.9766
185,186,6410,1315,776,197.902,64.0774,25.9226,99.9423
186,187,5376,2228,789,14.6308,7.362610000000001,82.6374,99.9829
187,188,11398,1748,794,33.5804,61.4875,28.5125,99.9885
188,189,3319,724,778,12.5109,4.8608400000000005,85.1392,99.9398
189,190,1045,1542,770,24.3313,43.1455,46.8545,99.9956
190,191,1740,307,773,198.222,27.202,62.798,99.9937
191,192,3111,2813,802,191.005,9.3114,80.6886,99.9961
192,193,2328,2296,789,22.5338,31.4095,58.5905,99.9926
193,194,1492,1638,793,19.6537,45.5549,44.4451,99.9345
194,195,2309,2548,794,14.7111,9.13496,80.865,99.7671
195,196,5844,2140,822,192.202,5.7481,84.2519,99.9198
196,197,17614,1191,834,173.606,83.8584,6.14157,99.8756
197,198,3971,378,803,80.2304,84.7484,5.2515800000000015,99.9916
198,199,4686,3269,815,193.884,29.1964,60.8036,99.844
199,200,39922,869,902,191.295,25.4665,64.5335,97.6227
200,201,5050,1601,826,199.294,55.2212,34.7788,99.9952
201,202,7693,1047,838,191.49400000000003,12.185,77.815,99.9512
202,203,1916,1426,819,188.795,40.1258,49.8742,99.7474
203,204,11865,2094,861,191.221,5.64427,84.3557,99.9715
204,205,65328,3027,962,20.646,35.2411,54.7589,81.3733
205,206,843,297,806,211.248,3.81342,86.1866,99.9739
206,207,7372,2377,839,31.2097,65.7138,24.2862,99.9863
207,208,17699,684,891,10.7012,56.5791,33.4209,99.9739
208,209,3815,2472,826,15.5713,58.3037,31.6963,99.9236
209,210,617,2606,812,194.232,22.6875,67.3125,99.9531
210,211,16228,1930,869,22.0829,40.4837,49.5163,98.8922
211,212,14198,3412,886,26.1009,61.7463,28.2537,99.9307
212,213,589,1842,819,32.5564,68.3166,21.6834,99.9683
213,214,4791,243,845,12.7602,55.981,34.019,99.5462
214,215,43077,1280,959,23.0766,8.54035,81.4596,98.5357
215,216,1162,963,831,194.829,61.0691,28.9309,99.9574
216,217,3141,2245,845,28.2067,65.6236,24.3764,99.9531
217,218,737,2567,828,197.048,18.5026,71.4974,99.9919
218,219,5413,310,877,12.1701,1.6840099999999998,88.316,99.1807
219,220,564,3534,848,197.33900000000003,21.015,68.985,99.9221
220,221,2570,1701,850,30.2933,70.3986,19.6014,99.9744
221,222,6391,2290,889,196.343,8.92729,81.0727,99.9832
222,223,6299,2770,891,190.271,9.6248,80.3752,99.9645
223,224,2196,2704,854,194.229,19.7111,70.2889,99.9821
224,225,2905,1502,857,19.7661,32.6434,57.3566,99.9581
225,226,2949,3087,875,195.685,9.64539,80.3546,99.9693
226,227,52615,2523,954,22.6977,31.7579,58.2421,92.2044
227,228,8093,1766,886,10.7385,10.2171,79.7829,99.9803
228,229,3876,3308,877,17.6934,2.39845,87.6015,99.8371
229,230,773,372,866,201.329,1.01214,88.9879,99.9953
230,231,1533,188,877,213.518,5.95904,84.041,99.9439
231,232,778,385,885,193.771,0.679138,89.3209,99.9868
232,233,2465,1419,880,195.271,36.8606,53.1394,99.9882
233,234,916,2821,882,10.482,61.389,28.611,99.9792
234,235,734,1576,879,200.427,25.6667,64.3333,99.994
235,236,667,1660,882,200.6,25.2646,64.7354,99.9972
236,237,10703,3231,920,170.952,66.2904,23.7096,99.9901
237,238,2511,1503,899,27.1834,68.3766,21.6234,99.8011
238,239,8245,2720,946,28.2208,61.4488,28.5512,99.9891
239,240,4559,1048,931,190.922,0.423119,89.5769,99.9235
240,241,2880,2221,918,11.2256,5.36929,84.6307,99.9674
241,242,671,250,918,21.0975,0.737717,89.2623,99.9837
242,243,8177,1114,951,207.034,13.4262,76.5738,99.9835
243,244,22090,1865,1018,196.819,5.14931,84.8507,99.4594
244,245,5352,1579,950,196.725,55.1724,34.8276,99.9414
245,246,3080,3500,946,190.056,70.6616,19.3384,99.9462
246,247,3693,1446,945,29.7825,67.8035,22.1965,99.8258
247,248,1692,1898,942,9.08215,8.00367,81.9963,99.731
248,249,4184,2050,944,201.511,4.913119999999998,85.0869,99.9909
249,250,1510,3021,938,15.7921,12.1336,77.8664,99.9247
250,251,21140,274,999,23.1925,29.954,60.04600000000001,97.2757
251,252,3025,1658,939,202.007,62.7046,27.2954,99.9165
252,253,3855,2123,954,56.5788,74.5348,15.4652,99.9628
253,254,2031,1509,946,206.236,9.18394,80.8161,99.852
254,255,13283,2317,1012,195.07,6.40583,83.5942,99.6291
255,256,4587,3435,1010,191.024,67.6049,22.3951,99.6311
256,257,753,1923,952,11.6711,20.2001,69.7999,99.8428
257,258,1366,608,951,190.767,0.6334989999999999,89.3665,99.9918
258,259,2260,209,953,206.719,22.771,67.229,99.8625
259,260,1687,3319,958,191.914,60.5942,29.4058,99.9838
260,261,7719,1985,989,67.7922,74.5396,15.4604,99.6847
261,262,1302,2180,954,54.8564,74.8948,15.1052,99.9606
262,263,5342,1758,968,38.7767,72.8235,17.1765,99.9763
263,264,2483,388,974,23.2493,55.1982,34.8018,99.9568
264,265,3006,500,972,17.3268,59.0191,30.9809,99.9629
265,266,4263,2227,984,19.9669,26.9794,63.0206,99.8555
266,267,24783,613,1042,28.4367,2.00639,87.9936,89.025
267,268,13064,2780,1042,11.3255,63.3183,26.6817,88.5633
268,269,816,579,980,187.282,41.6995,48.3005,99.9905
269,270,1407,1461,988,192.84,8.6279,81.3721,99.9787
270,271,776,3363,977,18.0309,40.7148,49.2852,99.9952
271,272,1028,751,975,28.1214,20.6247,69.3753,99.9929
272,273,1248,3525,1009,40.8472,63.4871,26.5129,99.9402
273,274,21788,1005,1104,20.6769,3.3622400000000003,86.6378,83.2744
274,275,7632,1440,1043,194.27,4.71502,85.285,99.818
275,276,1928,1629,997,31.2807,70.5457,19.4543,99.6634
276,277,7956,1704,1029,195.267,20.6841,69.3159,99.8657
277,278,3840,3477,1013,16.0259,39.362,50.63800000000001,99.8712
278,279,2041,760,1025,99.8696,86.8294,3.17061,98.6498
279,280,10873,2127,1047,24.5095,28.2306,61.7694,99.9377
280,281,2647,3311,1013,189.229,59.6905,30.3095,99.5411
281,282,1013,2066,1013,18.4241,28.1428,61.8572,99.7224
282,283,3134,418,1025,210.218,49.3305,40.6695,99.9796
283,284,8353,1552,1046,25.2568,21.5167,68.4833,99.9684
284,285,7838,3344,1064,171.702,74.1253,15.8747,99.3419
285,286,7981,852,1087,205.387,10.1217,79.8783,99.7103
286,287,1453,1091,1025,196.732,88.9073,1.09271,99.3266
287,288,7418,2241,1088,22.5385,11.0254,78.9746,98.1291
288,289,1041,902,1033,189.284,5.7095400000000005,84.2905,99.9889
289,290,2244,2902,1050,195.265,23.68,66.32,99.9321
290,291,1176,1317,1038,197.85,13.2239,76.7761,99.7602
291,292,1585,806,1049,191.366,16.8108,73.1892,99.9932
292,293,2546,372,1059,14.3471,18.2989,71.7011,99.9796
293,294,15086,3054,1129,185.18,65.6435,24.3565,99.1201
294,295,909,1050,1049,200.768,27.4282,62.5718,99.8669
295,296,3965,2610,1063,213.832,72.0461,17.9539,99.5547
296,297,960,3534,1072,40.9985,61.4952,28.5048,99.6542
297,298,9142,1349,1091,195.515,24.0642,65.9358,99.9933
298,299,4959,2011,1075,26.7112,22.5418,67.4582,99.8215
299,300,1344,3483,1074,196.587,71.0641,18.9359,99.8916
300,301,697,2684,1066,18.4741,75.1679,14.8321,99.995
301,302,1769,1643,1074,21.4019,14.097,75.903,99.9693
302,303,2611,1135,1083,207.221,69.5104,20.4896,99.6585
303,304,6008,1760,1088,199.943,66.7601,23.2399,99.9708
304,305,20457,452,1136,199.577,13.4488,76.5512,99.9364
305,306,3275,310,1088,25.6273,8.59596,81.404,99.7678
306,307,3847,751,1094,195.475,36.9586,53.0414,99.9565
307,308,1331,1061,1083,188.5,55.8239,34.1761,99.9442
308,309,11242,2407,1111,19.1859,58.2421,31.7579,99.727
309,310,830,833,1083,197.086,20.9787,69.0213,98.9267
310,311,1484,3416,1093,11.5072,14.8732,75.1268,99.9556
311,312,1154,3208,1084,16.3785,16.6464,73.3536,99.3296
312,313,1570,2866,1098,182.347,30.5843,59.4157,99.9817
313,314,3849,216,1116,199.291,7.96177,82.0382,99.8887
314,315,7728,2721,1149,194.806,47.7847,42.2153,97.8877
315,316,3209,2584,1113,30.0238,55.5415,34.4585,99.8988
316,317,2137,2663,1109,168.965,78.4003,11.5997,99.9896
317,318,6104,1586,1155,25.5406,35.0676,54.9324,99.6368
318,319,2168,2118,1120,23.0855,1.14743,88.8526,99.9769
319,320,526,3185,1098,13.1766,35.1694,54.8306,99.965
320,321,1712,1516,1112,23.4107,56.4091,33.5909,99.9906
321,322,566,2930,1108,13.3071,0.389877,89.6101,99.9997
322,323,882,1454,1108,32.2563,37.726,52.274,99.998
323,324,3514,3256,1125,205.14,26.8655,63.1345,99.936
324,325,2271,1288,1124,25.0493,17.8096,72.1904,99.8357
325,326,1108,2803,1115,197.8,9.64155,80.3585,99.9927
326,327,868,550,1112,192.233,21.3772,68.6228,99.9933
327,328,3260,921,1136,188.02,39.1966,50.8034,99.9444
328,329,3609,1639,1151,38.9362,29.4876,60.5124,99.9811
329,330,8411,1169,1146,202.186,62.2426,27.7574,99.9223
330,331,8497,621,1180,30.1928,58.3305,31.6695,99.9463
331,332,3840,1936,1132,202.36900000000003,40.741,49.25899999999999,99.909
332,333,3558,1824,1137,10.5951,46.6155,43.3845,99.973
333,334,3063,3437,1133,12.4651,34.1493,55.8507,99.8832
334,335,3306,2044,1129,199.667,59.1892,30.8108,99.9857
335,336,6722,3968,1251,195.216,69.6656,20.3344,99.4356
336,337,521,1072,1120,206.956,11.2414,78.7586,99.9711
337,338,3535,3344,1132,184.808,34.2941,55.7059,99.9805
338,339,2867,699,1139,199.935,7.0993,82.9007,99.9297
339,340,1331,271,1133,202.219,25.1039,64.8961,99.9581
340,341,2553,2193,1135,196.503,10.0323,79.9677,99.861
341,342,588,1762,1127,17.507,38.2107,51.7893,99.9931
342,343,3536,2975,1170,194.352,37.7271,52.2729,99.7982
343,344,5803,3483,1187,23.2443,17.4677,72.5323,71.9873
344,345,15110,1506,1205,200.911,45.9493,44.0507,69.9306
345,346,48263,2698,1291,17.6666,25.5753,64.4247,93.2725
346,347,649,3530,1137,194.463,27.6216,62.3784,99.7803
347,348,9405,1757,1183,191.758,2.62146,87.3785,99.726
348,349,1660,1258,1149,24.6264,6.34946,83.6505,99.9895
349,350,2037,2288,1149,214.674,15.7637,74.2363,99.986
350,351,81881,2435,1413,201.433,5.19137,84.8086,98.7601
351,352,1644,1870,1160,187.784,48.3962,41.6038,99.9968
352,353,945,2646,1146,11.4845,10.1529,79.8471,99.9952
353,354,1340,638,1149,40.7797,56.8937,33.1063,99.9773
354,355,921,1770,1152,192.171,31.4552,58.5448,99.654
355,356,2316,2074,1169,186.80900000000003,50.113,39.887,99.0501
356,357,2136,275,1161,200.27,41.1244,48.8756,99.9017
357,358,3499,349,1178,212.303,31.2396,58.7604,99.9952
358,359,1242,182,1161,198.794,52.1697,37.8303,99.9074
359,360,5764,841,1179,11.6244,10.1964,79.8036,99.9529
360,361,1035,1350,1156,18.3916,49.5389,40.4611,99.9951
361,362,3614,2320,1201,17.5617,5.49944,84.5006,99.8993
362,363,7718,3204,1181,210.536,7.37997,82.62,99.8742
363,364,1386,2124,1175,178.717,68.2546,21.7454,99.9951
364,365,7293,2194,1192,163.321,65.6087,24.3913,99.8287
365,366,1383,2015,1174,191.188,60.9351,29.0649,99.9907
366,367,1411,3376,1166,205.785,14.8598,75.1402,99.2823
367,368,8637,1321,1203,19.3282,50.7701,39.2299,99.9877
368,369,1363,2405,1182,192.209,34.7681,55.2319,99.1097
369,370,1059,2914,1171,196.285,27.8172,62.1828,99.9734
370,371,4129,1942,1182,10.4598,31.5012,58.4988,99.8364
371,372,691,3529,1181,25.2348,29.9711,60.0289,99.954
372,373,2963,2613,1193,11.9733,0.0490112,89.95100000000002,99.9625
373,374,861,2434,1174,197.094,38.4837,51.5163,99.8835
374,375,8846,215,1222,204.177,32.0003,57.9997,99.9398
375,376,2650,2369,1198,193.768,6.25322,83.7468,99.9747
376,377,2116,725,1188,19.6595,14.0398,75.9602,99.9941
377,378,834,3322,1185,200.982,44.5519,45.4481,99.9959
378,379,9913,3409,1232,230.096,57.3845,32.6155,99.9771
379,380,956,922,1190,22.8208,0.947159,89.0528,99.8371
380,381,3104,1217,1211,17.6315,62.5652,27.4348,99.9532
381,382,1367,290,1198,195.767,26.2601,63.7399,99.9981
382,383,1003,788,1197,197.145,63.7823,26.2177,99.926
383,384,846,551,1197,135.42700000000002,76.4924,13.5076,99.9733
384,385,8408,1134,1245,190.203,52.2539,37.7461,99.9498
385,386,2264,2932,1212,221.879,58.2324,31.7676,99.991
386,387,947,3047,1209,17.5092,30.0977,59.9023,98.6981
387,388,1331,2989,1222,14.2888,28.2971,61.7029,96.1771
388,389,536,3088,1202,211.63,9.06651,80.9335,99.9951
389,390,971,1865,1209,205.44,3.43802,86.56200000000003,99.9965
390,391,9021,3318,1270,165.873,84.0797,5.9203199999999985,99.9107
391,392,3062,514,1227,27.572,12.6098,77.3902,99.9503
392,393,516,2103,1207,191.143,9.77229,80.2277,99.971
393,394,1580,1038,1221,198.336,37.242,52.758,99.994
394,395,5756,2015,1236,1.665,7.724710000000001,82.2753,99.8433
395,396,975,1083,1212,48.0781,64.8519,25.1481,99.994
396,397,7045,1610,1260,17.0942,2.46613,87.5339,99.3494
397,398,9506,791,1265,188.972,42.757,47.243,99.7436
398,399,2155,1701,1223,32.7725,54.7522,35.2478,99.9916
399,400,689,3223,1216,185.451,31.6511,58.3489,99.8497
400,401,1247,939,1221,162.859,63.5988,26.4012,99.8897
401,402,4028,318,1235,194.307,18.7111,71.2889,99.9885
402,403,2248,697,1241,191.836,1.15857,88.8414,99.7748
403,404,9347,891,1271,23.2045,8.419130000000001,81.5809,99.995
404,405,3619,2244,1235,359.603,79.307,10.693,99.9297
405,406,2533,426,1232,67.3309,79.1413,10.8587,99.9755
406,407,1047,2835,1224,194.647,27.0325,62.9675,99.9289
407,408,1390,1436,1236,9.50928,35.3342,54.6658,99.8863
408,409,1945,1936,1235,172.88299999999995,62.9895,27.0105,99.9927
409,410,1911,2657,1237,197.954,7.0215,82.9785,99.6501
410,411,1100,3538,1243,23.7951,13.7465,76.2535,99.5739
411,412,1413,2592,1240,23.878,6.83717,83.1628,99.7658
412,413,2098,2117,1236,197.414,17.1092,72.8908,99.9104
413,414,3914,3115,1243,188.375,62.0033,27.9967,99.9818
414,415,7854,606,1266,137.947,73.893,16.107,99.9541
415,416,1854,2883,1245,188.859,39.7559,50.2441,99.9945
416,417,1271,3507,1251,22.348000000000006,11.9908,78.0092,99.9616
417,418,819,3042,1244,20.1469,10.8157,79.1843,99.9284
418,419,53351,1890,1343,191.044,51.7286,38.2714,99.9803
419,420,2302,376,1260,24.2431,12.0391,77.9609,99.9961
420,421,631,2072,1249,201.557,5.68847,84.3115,99.9968
421,422,1009,2954,1246,11.0448,10.8188,79.1812,99.9929
422,423,1889,1747,1252,196.204,65.0271,24.9729,99.9885
423,424,2688,3209,1258,210.444,0.14444,89.8556,99.9821
424,425,40653,1360,1324,17.4702,24.2009,65.7991,97.1078
425,426,14279,1051,1318,201.673,3.14351,86.8565,96.5405
426,427,839,2831,1252,196.345,33.2561,56.7439,99.9794
427,428,3099,2278,1276,19.1616,15.5456,74.4544,99.9735
428,429,1859,3012,1264,13.9042,31.1045,58.8955,99.9893
429,430,3218,478,1281,189.997,16.605,73.395,99.8793
430,431,25238,2166,1334,201.591,15.2099,74.7901,98.5313
431,432,12143,2896,1317,194.016,6.80682,83.1932,99.9182
432,433,3620,722,1293,199.746,12.5396,77.4604,99.9479
433,434,13412,348,1333,56.5733,79.9314,10.0686,99.9547
434,435,2961,3072,1295,202.361,21.6251,68.3749,99.9826
435,436,23276,3432,1377,191.703,50.9228,39.0772,98.6226
436,437,20155,3296,1399,18.3906,18.8252,71.1748,99.0319
437,438,601,957,1293,194.405,11.2999,78.7001,99.9855
438,439,12533,238,1346,13.474,32.2946,57.7054,99.7621
439,440,1764,3131,1299,12.5003,27.8986,62.1014,99.7565
440,441,5187,562,1316,197.886,25.2032,64.7968,99.9661
441,442,1559,2133,1308,358.665,73.0397,16.9603,99.9839
442,443,6268,3012,1332,186.4,49.0876,40.9124,99.9698
443,444,3057,391,1316,198.628,21.1997,68.8003,99.9939
444,445,17956,1642,1375,26.5695,60.5967,29.4033,99.9604
445,446,8025,494,1371,8.46168,72.5213,17.4787,82.931
446,447,7701,2421,1348,171.892,88.5995,1.40054,99.967
447,448,3013,1181,1336,194.186,37.5589,52.4411,99.8158
448,449,8815,2525,1376,200.785,6.19364,83.8064,99.7094
449,450,2280,658,1327,41.1202,57.3011,32.6989,99.9927
450,451,17633,890,1392,198.689,26.3593,63.6407,99.6151
451,452,1607,731,1337,31.2472,31.8741,58.1259,99.8944
452,453,7451,2809,1379,208.327,10.3605,79.6395,98.8177
453,454,835,2370,1372,348.654,88.3906,1.60937,99.8927
454,455,3845,1229,1367,200.935,0.155159,89.8448,99.98
455,456,18426,3184,1407,178.317,62.474,27.526,99.8902
456,457,558,3528,1361,189.98,49.7206,40.2794,99.953
457,458,3462,2946,1371,22.9297,0.3693010000000001,89.6307,99.9479
458,459,887,568,1356,23.6543,32.7981,57.2019,99.9933
459,460,12808,705,1399,193.349,7.73588,82.2641,99.9958
460,461,3353,1541,1373,189.984,26.4828,63.5172,99.9625
461,462,3991,800,1396,26.8247,33.6384,56.3616,99.9833
462,463,634,598,1368,281.257,87.1984,2.80163,99.9972
463,464,5054,1018,1390,26.5394,57.8424,32.1576,99.977
464,465,610,2465,1391,15.4429,85.6576,4.3424,99.9026
465,466,1833,3533,1408,19.6709,13.3433,76.6567,99.8646
466,467,66307,321,1525,191.556,24.0208,65.9792,71.5449
467,468,5377,3036,1400,201.284,26.0838,63.9162,99.9762
468,469,791,162,1406,190.254,39.8839,50.1161,99.8742
469,470,525,968,1398,29.0229,57.9138,32.0862,99.9268
470,471,27772,1179,1485,200.828,3.83959,86.1604,90.4329
471,472,688,1174,1388,26.9582,59.6473,30.3527,99.9629
472,473,9533,2147,1448,207.077,71.2337,18.7663,99.9231
473,474,36990,613,1535,332.344,85.1333,4.86665,99.2602
474,475,4123,371,1422,129.156,81.2797,8.72028,99.9846
475,476,7241,1464,1435,12.2087,55.4357,34.5643,99.7742
476,477,6663,1814,1434,22.6791,16.2062,73.7938,99.9891
477,478,6893,3964,1524,193.484,68.3786,21.6214,99.5834
478,479,846,2888,1425,189.888,12.6205,77.3795,99.944
479,480,9004,1738,1473,200.24400000000003,6.22668,83.7733,99.9703
480,481,25932,2811,1494,33.8158,73.0675,16.9325,99.5648
481,482,30288,1023,1538,31.1722,60.8582,29.1418,99.629
482,483,6869,2973,1467,187.876,60.8976,29.1024,99.9306
483,484,702,2537,1426,189.322,4.42679,85.5732,99.9335
484,485,1024,1257,1430,192.586,19.6197,70.3803,99.9942
485,486,547,1298,1436,195.933,29.7083,60.2917,99.6739
486,487,695,2479,1445,199.817,37.8159,52.1841,99.9468
487,488,4033,2578,1460,26.9438,76.7708,13.2292,99.9479
488,489,24759,1414,1532,17.5872,17.1734,72.8266,86.5229
489,490,2014,2676,1451,208.805,20.7424,69.2576,99.9832
490,491,8693,3126,1475,34.2608,78.3218,11.6782,99.8314
491,492,570,1259,1451,190.15,2.55651,87.4435,99.9273
492,493,2478,1404,1464,19.5568,3.34392,86.6561,99.4565
493,494,7053,802,1495,269.198,84.8462,5.15377,99.151
494,495,21610,1593,1555,182.507,67.8684,22.1316,99.6319
495,496,97433,1932,1644,22.0471,61.669,28.331,99.6805
496,497,1033,2623,1474,13.0618,67.7389,22.2611,99.9091
497,498,861,525,1455,201.848,1.1436,88.8564,99.9863
498,499,2315,3528,1507,19.5719,11.2225,78.7775,99.8262
499,500,3382,3434,1494,190.899,1.31624,88.6838,99.9354
500,501,890,2229,1477,160.82399999999996,84.6381,5.36186,99.9896
501,502,621,168,1493,204.521,25.393,64.607,99.6907
502,503,868,1524,1485,13.4598,8.660969999999999,81.339,99.906
503,504,12442,2217,1543,356.711,75.1456,14.8544,99.2958
504,505,2862,3476,1525,15.5121,10.272,79.72800000000002,99.7476
505,506,15801,3146,1569,200.648,12.8489,77.1511,99.7204
506,507,1435,3275,1508,198.468,21.6059,68.3941,99.9906
507,508,5415,1707,1557,193.183,19.2346,70.7654,99.7947
508,509,1175,3223,1534,25.1479,86.5653,3.43467,99.9699
509,510,13590,834,1586,167.632,81.1259,8.874089999999997,99.9134
510,511,16043,3311,1601,9.39894,68.8008,21.1991,99.3018
511,512,3689,2445,1587,26.7577,79.0087,10.9913,99.9708
512,513,867,3403,1568,25.1091,70.0791,19.9209,99.5079
513,514,15078,2149,1626,192.359,8.27016,81.7298,99.9228
514,515,11420,2987,1611,178.79,67.2067,22.7933,99.8835
515,516,4463,149,1639,28.0758,45.172,44.828,99.793
516,517,13995,2790,1635,16.0007,0.601776,89.3982,99.5622
517,518,946,3096,1571,190.43,58.3444,31.6556,99.976
518,519,8892,2682,1608,17.1512,10.905,79.095,99.9759
519,520,4972,3479,1598,196.46400000000003,45.6414,44.3586,99.7946
520,521,2424,1780,1588,192.701,9.3288,80.6712,99.9681
521,522,4462,2907,1601,205.088,54.9704,35.0296,99.9925
522,523,2712,927,1595,190.886,77.1599,12.8401,99.9714
523,524,5471,706,1623,197.046,53.1509,36.8491,99.8875
524,525,10739,1234,1625,36.9425,55.0284,34.9716,99.9486
525,526,7338,210,1662,29.0716,46.5956,43.4044,99.9085
526,527,57451,407,1776,22.4039,27.9384,62.0616,86.8992
527,528,3358,1684,1608,27.265,34.324,55.676,99.8006
528,529,10546,2350,1632,27.7417,72.7651,17.2349,99.9444
529,530,715,1326,1608,12.4417,7.92327,82.0767,99.998
530,531,22935,2525,1695,35.0293,78.9195,11.0805,99.857
531,532,806,489,1617,19.7281,0.506714,89.4933,99.8835
532,533,7653,3097,1647,195.194,35.5343,54.4657,99.9888
533,534,649,2863,1639,193.864,0.589218,89.4108,99.9894
534,535,787,967,1625,26.0683,44.0959,45.9041,99.8003
535,536,3485,1101,1636,34.7105,47.0241,42.9759,99.992
536,537,46497,1401,1728,167.648,72.6675,17.3325,72.8689
537,538,846,3435,1633,22.7403,71.8224,18.1776,99.9844
538,539,16391,1702,1680,195.37,52.5565,37.4435,99.9451
539,540,16812,1113,1698,213.808,25.5709,64.4291,99.7734
540,541,18329,818,1700,188.391,42.5888,47.4112,99.9969
541,542,5028,2231,1686,208.397,8.96585,81.0341,99.8714
542,543,2003,3319,1666,194.428,27.328000000000007,62.672,99.978
543,544,21954,3423,1749,190.68400000000003,23.7582,66.2418,97.214
544,545,2341,627,1663,23.0941,19.5019,70.4981,99.9976
545,546,654,3478,1665,193.234,21.6266,68.3734,99.2176
546,547,5660,955,1683,21.8017,14.4614,75.5386,99.9352
547,548,967,567,1659,193.376,28.6291,61.3709,99.9945
548,549,678,2992,1660,195.333,6.07765,83.9223,99.8888
549,550,2584,3512,1681,195.718,21.1709,68.8291,99.8496
550,551,14362,3957,2005,195.379,68.9169,21.0831,99.5675
551,552,1757,3570,1737,190.702,14.9371,75.0629,99.2734
552,553,3285,3030,1689,204.204,1.44272,88.5573,99.9951
553,554,8428,3171,1717,27.1802,47.2963,42.7037,99.9534
554,555,5233,1567,1701,192.618,23.9638,66.0362,98.1723
555,556,23324,2415,1787,198.785,6.4599400000000005,83.5401,99.8696
556,557,19274,3010,1775,195.069,52.94300000000001,37.057,98.2231
557,558,4423,701,1712,30.528,53.7885,36.2115,99.9953
558,559,2981,2605,1711,20.2592,1.37894,88.6211,99.9737
559,560,2030,2678,1695,28.8401,77.3653,12.6347,99.9839
560,561,4053,565,1716,213.565,50.6684,39.3316,99.9808
561,562,1941,2734,1709,189.078,41.6383,48.3617,99.9442
562,563,2217,2923,1710,29.3813,24.7025,65.2975,99.9167
563,564,4670,2795,1718,13.7706,8.745519999999999,81.2545,99.9933
564,565,683,2157,1701,24.2507,6.1670300000000005,83.833,99.9708
565,566,2286,3309,1713,231.953,88.0527,1.94732,99.9541
566,567,1432,625,1706,206.575,4.19341,85.8066,99.993
567,568,627,3266,1700,225.842,86.3773,3.62272,99.5519
568,569,12234,2101,1760,200.379,17.9756,72.0244,99.9913
569,570,7941,2322,1742,183.697,37.4237,52.5763,99.5999
570,571,11018,2848,1768,194.093,42.7214,47.2786,99.9826
571,572,4445,262,1748,175.158,65.0948,24.9052,99.8168
572,573,2025,3248,1739,186.525,12.7127,77.2873,99.9994
573,574,2049,1786,1733,193.219,5.59976,84.4002,99.726
574,575,17109,1265,1806,203.61900000000003,11.4104,78.5896,99.3987
575,576,1332,3094,1731,184.517,61.7095,28.2905,99.9695
576,577,1146,208,1738,177.09799999999996,66.3776,23.6224,99.9263
577,578,7283,1037,1769,207.36900000000003,10.6713,79.3287,99.1335
578,579,3768,2667,1748,17.1668,50.9043,39.0957,99.9496
579,580,10534,2231,1776,186.561,21.6211,68.3789,99.966
580,581,2084,947,1755,193.804,0.8976360000000001,89.1024,99.9583
581,582,664,2027,1737,201.167,63.9622,26.0378,99.9454
582,583,10139,1658,1772,201.487,22.9497,67.0503,99.18
583,584,2699,3521,1777,203.3,32.1023,57.8977,99.3885
584,585,2375,618,1771,21.3003,36.4859,53.5141,99.9044
585,586,2279,167,1791,192.594,34.1341,55.8659,99.3589
586,587,3554,2597,1781,193.762,20.57,69.43,99.9519
587,588,10505,2755,1825,200.778,13.2049,76.7951,99.9917
588,589,1953,197,1789,189.283,31.7573,58.2427,99.9741
589,590,20605,696,1824,198.751,14.7481,75.2519,99.9403
590,591,3213,2008,1797,14.4113,63.0442,26.9558,99.5855
591,592,1515,3299,1775,18.9756,44.7404,45.2596,99.9916
592,593,1234,861,1780,11.2426,6.87277,83.1272,99.9789
593,594,2614,542,1797,199.176,21.2708,68.7292,98.6949
594,595,13541,3209,1820,13.7808,75.7357,14.2643,99.9679
595,596,5667,3331,1817,24.4962,1.34601,88.654,99.9882
596,597,92750,654,1979,17.8688,28.0792,61.9208,99.0069
597,598,1740,2660,1790,20.5809,56.2948,33.7052,99.9493
598,599,985,911,1799,130.798,81.4276,8.57242,99.9745
599,600,4174,1740,1812,198.862,54.2477,35.7523,99.994
600,601,6854,991,1837,22.2422,19.0315,70.9685,99.9569
601,602,9629,1165,1841,204.078,72.1406,17.8594,99.9568
602,603,1278,228,1823,184.26,40.8321,49.1679,99.9841
603,604,1203,581,1816,28.056,31.5061,58.4939,99.97
604,605,1389,2170,1820,197.773,56.595,33.405,99.9704
605,606,9312,2317,1860,191.977,51.151,38.849,99.6477
606,607,10232,2624,1864,195.854,40.6486,49.3514,99.5109
607,608,28882,1680,1951,195.419,63.0534,26.9466,99.504
608,609,4676,1551,1853,7.636239999999999,8.491760000000001,81.5082,99.993
609,610,1512,1458,1844,194.141,9.62423,80.3758,99.9696
610,611,4018,2910,1857,189.395,7.4196399999999985,82.5804,99.9776
611,612,8461,3060,1854,32.8295,44.8473,45.1527,99.9097
612,613,4528,2059,1855,202.462,64.7072,25.2928,99.9372
613,614,953,2855,1839,24.1181,5.82917,84.1708,99.9965
614,615,14435,369,1893,6.161969999999998,44.1492,45.8508,99.9919
615,616,676,549,1840,189.448,3.8716,86.1284,99.9137
616,617,1207,3530,1842,195.368,20.9928,69.0072,99.8818
617,618,639,1497,1850,7.53662,0.5188520000000001,89.4811,99.8516
618,619,3090,2538,1885,7.44245,12.1217,77.8783,99.996
619,620,583,1635,1844,21.3395,19.2992,70.7008,99.9978
620,621,1549,929,1851,25.41,41.1668,48.8332,99.6413
621,622,2454,1072,1855,200.699,45.8537,44.1463,99.7576
622,623,7251,1787,1884,200.842,29.0248,60.9752,99.9867
623,624,1785,2206,1857,189.988,21.6265,68.3735,99.9984
624,625,908,170,1857,188.096,41.8891,48.1109,99.7755
625,626,727,2721,1869,10.3062,2.28413,87.7159,99.8261
626,627,7896,3268,1899,24.1066,1.84458,88.1554,99.9312
627,628,2013,2975,1888,21.9514,49.5465,40.4535,99.9272
628,629,674,3482,1871,196.141,2.69701,87.303,99.9885
629,630,6175,2733,1922,11.985,11.7572,78.2428,99.7008
630,631,14845,3415,1923,188.029,64.339,25.661,99.9812
631,632,12693,2116,1908,25.0791,7.945710000000001,82.0543,99.833
632,633,99392,2814,2052,25.5684,17.1563,72.8437,74.3754
633,634,16057,3234,1951,18.1009,19.5557,70.4443,98.9606
634,635,596,1089,1880,21.5122,18.5175,71.4825,99.9936
635,636,28697,1302,1953,103.523,79.964,10.0361,99.708
636,637,45864,907,2051,199.616,17.611,72.389,96.259
637,638,24446,1121,1989,19.8487,16.5296,73.4704,95.7446
638,639,2288,1492,1893,22.6573,22.47,67.53,99.9025
639,640,23611,1978,1981,195.905,32.4445,57.5555,99.6815
640,641,7929,3061,1930,200.669,4.07707,85.9229,99.9853
641,642,27945,2306,1974,188.384,72.7403,17.2597,99.7175
642,643,2086,165,1936,200.54,13.6309,76.3691,99.7803
643,644,5645,1762,1947,196.004,41.2648,48.7352,99.9695
644,645,1520,1207,1921,203.002,7.805910000000001,82.1941,99.9921
645,646,7562,2445,1978,174.862,64.3934,25.6066,99.5654
646,647,8634,2543,1951,19.3015,39.7089,50.2911,99.8765
647,648,6227,259,1955,207.57,12.803,77.197,99.36
648,649,2461,1538,1939,101.254,80.2014,9.7986,99.9314
649,650,1318,2682,1940,211.138,18.9211,71.0789,99.957
650,651,2397,751,1955,13.8175,3.34219,86.6578,99.9529
651,652,23014,2142,2047,197.145,17.8833,72.1167,76.411
652,653,672,1872,1960,15.961,5.55506,84.4449,99.9783
653,654,16437,1469,2017,16.8239,10.5369,79.4631,99.4317
654,655,2559,191,1994,192.836,18.4386,71.5614,99.9449
655,656,1380,1609,1975,171.938,70.0895,19.9105,99.4793
656,657,1136,1847,1985,17.8942,57.0514,32.9486,99.9725
657,658,1394,3513,1998,18.1324,6.24913,83.7509,99.3149
658,659,1470,152,2005,193.793,17.8551,72.1449,99.7402
659,660,524,1040,1984,16.8296,2.68079,87.3192,99.5972
660,661,21334,3165,2042,17.3196,36.3102,53.6898,98.3125
661,662,57350,3386,2158,22.956,26.8985,63.1015,94.2327
662,663,27610,290,2080,5.6443699999999986,59.8443,30.1557,99.3219
663,664,859,3287,2025,27.5784,7.50162,82.4984,99.9912
664,665,19233,1590,2083,6.6878600000000015,67.1312,22.8688,99.8143
665,666,26507,1880,2091,5.51032,40.8679,49.1321,66.4011
666,667,1791,3431,2024,19.0957,16.3925,73.6075,99.9684
667,668,1895,863,2053,202.935,1.43897,88.561,99.986
668,669,3174,1295,2052,199.515,17.8821,72.1179,99.9259
669,670,1369,2507,2044,23.8086,47.3519,42.6481,99.9776
670,671,865,3008,2046,25.199,44.6098,45.3902,99.9878
671,672,555,197,2050,192.85,7.99898,82.001,99.8004
672,673,1407,1399,2049,4.83901,3.22567,86.7743,99.9914
673,674,5024,600,2075,199.306,11.4806,78.5194,99.9912
674,675,1095,1093,2065,200.946,48.1324,41.8676,99.9482
675,676,1202,2238,2059,183.71400000000003,51.5014,38.4986,99.979
676,677,1789,423,2072,10.669,10.4122,79.5878,99.9942
677,678,755,2389,2061,188.088,3.70199,86.29799999999999,99.9652
678,679,4365,1266,2107,189.84,23.0398,66.9602,99.983
679,680,9647,1360,2114,167.237,69.3543,20.6457,99.869
680,681,20917,2488,2164,12.3094,5.62085,84.3792,99.7705
681,682,13585,1721,2145,185.412,69.3245,20.6755,99.8999
682,683,1312,2436,2095,192.791,3.97295,86.0271,99.8063
683,684,11793,3189,2147,195.769,23.2124,66.7876,99.7524
684,685,584,2296,2092,189.338,2.8509,87.1491,99.977
685,686,1599,817,2097,12.5959,60.0014,29.9986,99.4717
686,687,13145,2355,2163,16.4907,53.9103,36.0897,99.5689
687,688,4931,2026,2122,20.9546,58.5399,31.4601,99.7744
688,689,1645,3505,2111,31.7496,29.0153,60.9847,99.7796
689,690,947,2247,2095,19.0024,63.8238,26.1762,99.9887
690,691,34697,2998,2213,19.6686,48.9142,41.0858,98.2175
691,692,20117,1039,2154,26.0584,56.5548,33.4452,99.7899
692,693,2017,397,2115,19.1823,46.4382,43.5618,99.5418
693,694,11656,1507,2177,160.631,67.5264,22.4736,99.8573
694,695,1446,647,2123,203.945,20.2213,69.7787,99.9977
695,696,7071,179,2187,7.92275,54.9751,35.0249,99.7972
696,697,10628,1190,2168,198.011,3.93643,86.0636,99.8922
697,698,8287,717,2179,23.3845,5.83663,84.1634,99.8987
698,699,7081,2240,2156,46.0892,78.3287,11.6713,99.9556
699,700,675,613,2133,19.8456,5.95938,84.0406,99.9247
700,701,8176,2667,2154,22.1271,26.642,63.358,99.9538
701,702,508,2311,2127,19.4191,4.18865,85.8113,99.9979
702,703,947,2542,2133,179.623,58.5046,31.4954,99.9313
703,704,1008,585,2147,198.628,10.9156,79.0844,99.9612
704,705,4423,904,2190,193.81,12.6525,77.3475,99.877
705,706,2330,1401,2162,18.6293,14.9857,75.0143,99.9674
706,707,13406,477,2218,14.9661,48.0521,41.9479,93.7672
707,708,555,2755,2163,191.896,5.86172,84.1383,99.9962
708,709,1462,1264,2165,14.2958,26.2882,63.7118,99.998
709,710,1678,310,2165,197.884,37.8307,52.1693,99.9899
710,711,7240,2021,2201,23.1122,17.4862,72.5138,99.7617
711,712,13018,289,2237,192.188,12.0831,77.9169,99.7907
712,713,5222,3497,2238,20.9394,2.40216,87.5978,84.4306
713,714,601,3565,2175,123.36,12.4609,77.5391,99.9699
714,715,4827,3130,2192,194.883,5.04899,84.95100000000002,99.9933
715,716,593,122,2172,3.77519,59.567,30.433000000000003,98.5589
716,717,6656,2115,2196,14.1891,15.944,74.056,99.9872
717,718,4743,617,2193,22.648000000000003,44.6101,45.3899,99.9734
718,719,28031,1934,2289,188.718,60.0201,29.9799,98.8069
719,720,1278,1632,2197,18.8932,14.8422,75.1578,99.9838
720,721,6694,1803,2220,193.794,7.6817600000000015,82.3182,99.9693
721,722,3674,1379,2213,167.90900000000005,65.9348,24.0652,99.9045
722,723,7823,2731,2229,32.1186,64.7204,25.2796,99.9933
723,724,1696,104,2214,129.41,26.7174,63.2826,99.4709
724,725,597,365,2227,191.81,14.9275,75.0725,99.9804
725,726,20853,1513,2290,162.55,81.5725,8.42752,99.8957
726,727,30622,800,2326,198.662,21.5567,68.4433,98.5353
727,728,637,1268,2204,173.852,71.1209,18.8791,99.9923
728,729,15038,2288,2267,13.7131,6.78885,83.2112,99.873
729,730,7260,1274,2252,178.68200000000004,70.2691,19.7309,99.9631
730,731,947,2224,2209,196.18,69.2614,20.7386,99.9458
731,732,2547,3188,2230,202.102,10.6082,79.3918,99.9719
732,733,16696,1689,2268,28.5594,70.6741,19.3259,99.915
733,734,1463,2657,2227,22.0516,29.6068,60.3932,99.9879
734,735,2292,2602,2236,27.9768,49.6215,40.3785,99.9733
735,736,10422,1089,2255,199.268,38.133,51.867,99.9291
736,737,1728,838,2240,25.5289,5.41116,84.5888,99.8673
737,738,14850,442,2315,198.966,35.0414,54.9586,98.9049
738,739,1197,2170,2239,14.6044,57.2485,32.7515,99.8575
739,740,3920,3105,2255,189.984,46.66,43.34,99.9962
740,741,1684,2457,2250,190.904,54.5122,35.4878,99.9522
741,742,843,3562,2254,258.23,8.81209,81.1879,99.6745
742,743,5328,3269,2261,182.891,45.8418,44.1582,99.9927
743,744,5209,590,2262,12.0684,54.1432,35.8568,99.9821
744,745,1034,939,2255,6.30218,60.5053,29.4947,99.8965
745,746,2259,2835,2269,202.793,15.8072,74.1928,99.5143
746,747,7863,2089,2273,194.798,27.321,62.679,99.9952
747,748,1879,890,2263,179.84099999999995,73.0466,16.9534,99.953
748,749,1025,1436,2256,195.331,12.4144,77.5856,99.5158
749,750,3628,2527,2271,201.176,11.2663,78.7337,99.8475
750,751,5558,2418,2283,46.6941,72.9293,17.0707,99.8377
751,752,14004,1348,2316,16.4038,30.657,59.343,99.9683
752,753,7406,164,2327,189.447,54.7826,35.2174,99.3638
753,754,3310,3182,2283,189.264,80.1259,9.87412,99.9914
754,755,20153,2805,2369,219.947,18.3176,71.6824,99.9711
755,756,535,986,2276,8.176110000000001,58.2934,31.7066,99.9709
756,757,38493,2454,2381,25.7843,44.5663,45.4337,99.594
757,758,3329,818,2301,190.164,15.6073,74.3927,99.9865
758,759,567,844,2280,189.172,3.95114,86.0489,99.9574
759,760,962,1161,2285,182.034,70.117,19.883,99.9924
760,761,3509,2707,2301,193.665,13.2741,76.7259,99.9832
761,762,761,112,2295,218.233,53.6185,36.3815,99.5172
762,763,13840,2215,2346,182.503,70.4635,19.5365,99.9626
763,764,1182,3559,2314,71.7308,14.9235,75.0765,98.8424
764,765,2961,3108,2313,202.465,13.2329,76.7671,99.9979
765,766,548,3317,2297,181.102,41.5059,48.4941,99.9943
766,767,35941,1085,2405,24.7785,64.6111,25.3889,99.8825
767,768,10449,603,2339,38.957,61.0551,28.9449,99.9761
768,769,1695,766,2317,22.5202,9.11092,80.8891,99.9886
769,770,18192,3258,2380,18.132,74.9133,15.0867,99.9546
770,771,7850,296,2358,14.4387,13.1615,76.8385,99.9243
771,772,561,882,2311,24.2807,6.99758,83.0024,99.9901
772,773,18567,392,2402,194.331,65.8901,24.1099,99.8065
773,774,676,676,2312,14.8077,3.83086,86.1691,99.9874
774,775,14988,1815,2367,196.194,24.5465,65.4535,99.9459
775,776,2803,1063,2331,181.32,69.9904,20.0096,99.9751
776,777,1289,2056,2332,17.6219,84.5503,5.4496699999999985,99.9848
777,778,2565,3497,2352,202.987,29.764,60.236,99.2387
778,779,5550,3067,2357,30.9852,64.9553,25.0447,99.9614
779,780,1301,2115,2334,18.7028,11.6484,78.3516,99.9709
780,781,6583,3365,2367,194.402,10.7626,79.2374,99.9802
781,782,1459,1267,2346,171.50799999999995,67.9989,22.0011,99.9926
782,783,865,231,2342,190.377,70.1746,19.8254,99.9647
783,784,2629,2714,2356,156.994,74.6457,15.3543,99.9907
784,785,2566,2649,2370,209.003,84.0224,5.97763,99.9941
785,786,5943,1640,2393,175.605,74.459,15.541,99.8156
786,787,26630,2976,2432,52.2948,60.247,29.753,99.8977
787,788,5558,2062,2391,57.3004,78.6428,11.3572,98.9179
788,789,552,986,2363,182.08900000000003,69.4943,20.5057,99.9897
789,790,26825,1463,2425,27.1935,19.4709,70.5291,99.7521
790,791,1319,215,2409,194.179,1.12543,88.8746,99.9808
791,792,9408,3446,2455,22.3981,5.1128800000000005,84.8871,98.9273
792,793,11038,1254,2440,202.638,1.17188,88.8281,99.8157
793,794,4488,821,2414,33.3263,73.4176,16.5824,99.9786
794,795,9488,3506,2497,23.4342,4.83865,85.1613,99.3145
795,796,1496,2609,2400,191.515,17.5945,72.4055,99.971
796,797,1041,1723,2395,199.943,22.7574,67.2426,99.9964
797,798,1006,183,2402,195.034,4.27541,85.7246,99.8511
798,799,1834,241,2426,193.731,0.572807,89.4272,99.9889
799,800,3105,2535,2434,195.151,17.857,72.143,99.8942
800,801,41862,2173,2501,12.5307,15.3881,74.6119,84.4818
801,802,853,1961,2401,190.508,1.7621099999999998,88.2379,99.8057
802,803,16283,642,2452,18.4,10.7433,79.2567,98.8226
803,804,1126,3565,2425,197.445,15.0388,74.9612,99.8415
804,805,33220,3238,2492,185.837,69.5429,20.4571,51.1659
805,806,2720,522,2436,157.257,69.2288,20.7712,99.977
806,807,654,764,2420,204.802,55.6688,34.3312,99.994
807,808,15158,191,2510,27.4832,0.871986,89.12799999999999,99.6085
808,809,7141,2666,2463,205.376,41.4524,48.5476,99.9967
809,810,3243,2588,2442,20.9094,27.2385,62.7615,99.9688
810,811,6615,1661,2450,200.739,15.2521,74.7479,99.8403
811,812,3605,1142,2460,30.8593,39.8995,50.1005,99.992
812,813,8086,1868,2455,22.7871,56.7448,33.2552,99.9442
813,814,7103,884,2498,204.459,55.4355,34.5645,99.7625
814,815,2072,1981,2443,10.9085,7.9881600000000015,82.0118,99.8164
815,816,1650,2736,2450,170.333,61.4809,28.5191,99.9875
816,817,31525,1717,2540,21.9486,3.61161,86.3884,96.2785
817,818,1373,3382,2460,141.023,72.3883,17.6117,99.7635
818,819,5012,2491,2481,23.1078,7.22306,82.7769,99.9836
819,820,11928,2818,2496,27.0671,35.9502,54.0498,99.8234
820,821,11462,305,2517,187.841,8.56055,81.4395,99.869
821,822,21963,763,2544,17.1045,19.0043,70.9957,99.491
822,823,18716,513,2520,162.74200000000005,76.3609,13.6391,99.2997
823,824,575,113,2468,205.854,43.1164,46.8836,99.8167
824,825,23214,1402,2571,192.116,51.4696,38.5304,84.9344
825,826,500,1445,2485,20.6336,8.12929,81.8707,99.8611
826,827,2139,1971,2514,26.7008,31.5329,58.4671,99.9341
827,828,3455,2369,2522,193.284,2.70276,87.2972,99.7643
828,829,10295,1554,2527,185.925,79.0597,10.9403,99.2451
829,830,43040,2703,2608,20.9353,6.136830000000002,83.8632,99.429
830,831,639,2086,2495,130.555,82.2498,7.750210000000001,99.9379
831,832,1078,117,2504,171.18200000000004,33.2034,56.7966,99.4552
832,833,1514,2314,2514,192.49400000000003,74.33,15.67,99.521
833,834,4292,1125,2521,188.383,37.0886,52.9114,99.9655
834,835,3642,1910,2529,313.809,75.3747,14.6253,98.5768
835,836,1258,2719,2513,14.8638,33.2686,56.7314,99.6791
836,837,934,29,2522,181.0,0.0,90.0,100.003
837,838,2936,1221,2529,192.483,3.52747,86.4725,99.7196
838,839,6191,2452,2557,175.773,71.8875,18.1125,99.4313
839,840,18325,441,2610,18.6956,3.1299900000000003,86.87,66.7703
840,841,11975,1007,2560,203.474,2.11285,87.8871,99.9511
841,842,16118,3041,2579,1.22775,39.7031,50.2969,99.9136
842,843,6788,2885,2573,170.234,73.7705,16.2295,99.3983
843,844,2585,3387,2579,13.4494,4.75127,85.2487,99.7582
844,845,557,2950,2541,172.8,71.7433,18.2567,98.966
845,846,1612,109,2564,122.93,43.64100000000001,46.359,99.3323
846,847,1244,2296,2572,190.852,4.4645800000000015,85.5354,99.5901
847,848,718,1225,2561,187.891,37.3188,52.6812,99.9899
848,849,2784,1164,2574,191.236,3.28419,86.7158,99.998
849,850,11009,2072,2611,24.8374,16.8754,73.1246,99.9974
850,851,2261,2362,2583,9.85113,4.44125,85.5587,99.9563
851,852,4310,1886,2603,199.65,39.229,50.771,99.5284
852,853,5049,1969,2599,30.6839,16.7936,73.2064,99.9703
853,854,15056,3247,2623,19.416,1.29567,88.7043,99.6392
854,855,9142,1306,2605,195.489,28.7819,61.2181,99.3188
855,856,8858,844,2616,206.001,3.05201,86.948,99.9212
856,857,6291,285,2608,23.7039,1.15111,88.8489,99.1911
857,858,1974,1743,2604,33.3368,28.556,61.444,99.9076
858,859,51870,1944,2736,24.4232,19.251,70.749,86.3144
859,860,6980,2584,2641,197.351,6.26212,83.7379,99.6404
860,861,8601,571,2662,19.5604,16.6781,73.3219,99.9567
861,862,977,3430,2607,192.798,1.1997799999999998,88.8002,99.9942
862,863,4279,2456,2616,172.00400000000005,49.0415,40.9585,99.807
863,864,19213,1090,2650,197.516,70.3421,19.6579,99.9547
864,865,12126,219,2662,35.5958,50.1476,39.8524,99.8247
865,866,6549,701,2647,195.385,46.6541,43.3459,99.858
866,867,7608,932,2659,20.1068,27.2395,62.7605,77.1514
867,868,8278,1540,2673,196.201,8.53064,81.4694,99.3966
868,869,2265,2161,2633,13.8387,28.185,61.815,99.9946
869,870,881,2974,2631,194.453,10.4162,79.5838,99.9858
870,871,3813,2322,2648,225.761,83.26899999999998,6.7309600000000005,99.9795
871,872,1256,94,2649,227.685,0.08713530000000001,89.9129,99.3425
872,873,775,2657,2626,15.6959,24.5899,65.4101,98.1004
873,874,1660,3442,2649,25.2841,46.0675,43.9325,98.4344
874,875,734,1932,2633,19.7489,27.0714,62.9286,99.9956
875,876,31280,1263,2721,201.291,2.4578,87.5422,99.185
876,877,3040,2405,2658,21.534,14.9566,75.0434,99.577
877,878,4355,1682,2654,200.956,1.50573,88.4943,99.9725
878,879,1663,3373,2646,127.78,81.423,8.57704,99.9611
879,880,10071,2179,2674,170.17,69.9329,20.0671,99.9197
880,881,4005,3110,2667,23.5499,75.4977,14.5023,99.99
881,882,2573,3323,2660,121.922,80.8367,9.16331,99.983
882,883,1675,3487,2658,31.0416,48.8726,41.1274,99.8731
883,884,10158,2911,2688,192.704,78.8007,11.1993,99.8416
884,885,773,116,2650,125.258,42.8595,47.1405,99.8915
885,886,8145,2511,2698,5.71597,76.044,13.956,99.9584
886,887,4331,342,2671,205.287,17.8746,72.1254,99.9824
887,888,9474,405,2729,186.076,40.5238,49.4762,99.9446
888,889,10557,3165,2715,199.202,13.5139,76.4861,99.4298
889,890,1038,3026,2657,200.144,6.04985,83.9501,99.7956
890,891,1077,1401,2667,192.778,0.223465,89.7765,99.9968
891,892,2216,1358,2675,5.1092900000000006,64.9503,25.0497,99.9926
892,893,1450,3011,2685,13.4997,5.01662,84.9834,99.6531
893,894,13708,1630,2732,17.6027,4.5607,85.4393,99.8572
894,895,975,123,2696,37.0019,42.8193,47.1807,99.481
895,896,1595,2062,2691,188.015,58.8081,31.1919,99.8924
896,897,6705,2651,2730,191.629,67.6697,22.3303,99.8649
897,898,2335,633,2698,4.7322,49.5725,40.4275,99.9425
898,899,6304,2281,2713,205.186,67.5968,22.4032,99.9853
899,900,1485,3058,2702,199.146,9.57817,80.4218,99.9624
900,901,17780,802,2725,22.833,35.3743,54.6257,99.8527
901,902,2337,2417,2699,197.493,68.2363,21.7637,99.9816
902,903,5610,3362,2707,25.3095,1.41541,88.5846,99.9666
903,904,5078,661,2743,17.3681,20.7046,69.2954,99.9792
904,905,1347,1492,2706,198.835,1.01717,88.9828,99.9936
905,906,2858,1758,2711,201.444,26.343000000000004,63.657,99.0588
906,907,2526,2363,2723,192.756,2.56365,87.4363,99.9632
907,908,1869,320,2717,13.7545,49.3147,40.6853,99.9797
908,909,8963,2766,2778,19.6238,39.4759,50.5241,99.7456
909,910,4576,1086,2740,23.3639,72.5109,17.4891,99.9905
910,911,579,2469,2741,359.99300000000005,81.4474,8.55262,99.9307
911,912,9240,186,2762,19.52,48.002,41.99800000000001,99.7611
912,913,20954,3311,2793,22.7771,25.7039,64.2961,99.7609
913,914,5270,3023,2764,20.3511,33.7428,56.2572,99.9658
914,915,1257,546,2727,12.7561,43.8108,46.1892,99.9912
915,916,600,2604,2730,17.5033,23.4001,66.5999,99.9869
916,917,585,3207,2735,198.509,24.928,65.072,99.5354
917,918,1783,262,2736,197.22,22.794,67.206,99.9861
918,919,35300,944,2821,18.6019,20.9074,69.0926,98.1987
919,920,702,3245,2726,24.6025,43.6233,46.3767,99.9406
920,921,2504,995,2744,55.4504,67.7104,22.2896,99.9043
921,922,3004,1744,2753,24.3027,49.6343,40.3657,99.9979
922,923,20402,502,2808,200.02,40.9914,49.0086,99.8933
923,924,3691,2177,2755,8.61588,0.650909,89.3491,99.9016
924,925,8497,1528,2790,193.63,31.1674,58.8326,99.4897
925,926,834,1440,2739,220.081,75.6841,14.3159,99.922
926,927,902,2851,2746,17.4915,1.61422,88.3858,99.9632
927,928,5667,2549,2782,16.7091,9.82423,80.1758,99.9156
928,929,1122,1381,2792,16.2545,5.6485,84.3515,99.7077
929,930,3897,2341,2776,27.6619,25.3638,64.6362,99.9943
930,931,28979,1326,2839,20.0336,16.4008,73.5992,99.7509
931,932,760,2409,2765,29.7934,22.9775,67.0225,99.9923
932,933,26338,2967,2851,188.607,41.0922,48.9078,62.3216
933,934,3879,2267,2787,196.374,19.6004,70.3996,99.9933
934,935,1288,101,2786,60.4541,2.65396,87.346,99.4785
935,936,1110,3479,2774,203.888,37.708,52.292,99.8991
936,937,25669,2472,2874,25.285,42.9723,47.0277,98.3019
937,938,12308,319,2844,204.236,9.71779,80.2822,99.8816
938,939,1963,274,2791,44.3339,78.9278,11.0722,99.9881
939,940,826,3512,2795,20.158,16.9618,73.0382,99.4663
940,941,4144,1888,2817,199.161,29.1922,60.8078,99.9366
941,942,1625,1008,2796,21.7737,12.5686,77.4314,99.4051
942,943,1553,2204,2795,151.951,74.3877,15.6123,99.8494
943,944,6848,2657,2812,4.45889,28.2965,61.7035,99.9965
944,945,3531,674,2810,193.871,48.357,41.643,99.7054
945,946,5330,3118,2811,20.2007,36.0111,53.9889,99.9971
946,947,21763,1689,2857,16.0225,75.0125,14.9875,99.9421
947,948,2548,3465,2828,12.0853,82.1558,7.84415,99.264
948,949,4321,163,2838,40.0686,78.1171,11.8829,99.7359
949,950,3015,598,2817,4.69351,52.5284,37.4716,99.9948
950,951,3781,1991,2842,201.906,4.62867,85.3713,99.3523
951,952,2436,3387,2817,320.482,83.4102,6.58984,99.9443
952,953,535,3060,2823,190.625,9.6495,80.3505,99.9156
953,954,15206,2762,2867,13.612,10.3512,79.6488,98.2561
954,955,14702,3209,2887,23.2611,53.2753,36.7247,99.7844
955,956,893,1589,2836,18.4264,72.1959,17.8041,99.9271
956,957,3412,2333,2847,205.443,0.8268049999999999,89.1732,99.6707
957,958,824,236,2833,26.9538,74.9173,15.0827,99.9881
958,959,1701,2283,2837,15.0439,10.1228,79.8772,99.8392
959,960,1075,108,2851,35.4756,18.8689,71.1311,99.7195
960,961,6356,763,2860,199.841,13.6848,76.3152,99.9473
961,962,6833,692,2910,31.1141,54.7326,35.2674,98.8224
962,963,25409,2195,2917,193.512,62.9549,27.0451,99.9641
963,964,1278,2421,2852,209.971,2.0994,87.9006,99.9708
964,965,980,1823,2849,26.2695,2.23521,87.7648,99.8008
965,966,4741,1528,2882,194.717,37.7571,52.2429,99.9827
966,967,7253,1884,2914,14.8105,16.345,73.655,99.7133
967,968,6054,2023,2888,12.287,7.81216,82.1878,99.9906
968,969,22807,473,2945,18.1871,50.9106,39.0894,98.8329
969,970,1128,1128,2869,33.1704,63.1164,26.8836,99.9539
970,971,1883,3394,2874,11.5138,42.1375,47.8625,99.9921
971,972,541,227,2867,210.106,10.8784,79.1216,99.9657
972,973,941,606,2871,16.5237,21.7434,68.2566,99.9586
973,974,1631,1804,2875,195.564,2.23999,87.76,99.9718
974,975,1936,1870,2881,176.75,58.9424,31.0576,99.9874
975,976,9562,1369,2913,189.778,2.22761,87.7724,99.9738
976,977,1016,632,2891,204.153,24.6081,65.3919,99.998
977,978,9197,223,2965,200.961,22.0897,67.9103,98.3614
978,979,5936,517,2923,204.608,3.27814,86.7219,99.9914
979,980,3749,3141,2912,11.0713,0.667549,89.3325,99.9614
980,981,11267,3307,2941,28.4645,17.750999999999994,72.249,99.9851
981,982,10257,1111,2917,192.263,14.3869,75.6131,99.9437
982,983,589,111,2902,80.4564,51.7861,38.2139,99.9565
983,984,1531,2586,2906,13.0596,2.02586,87.9741,99.9674
984,985,3106,797,2915,26.0563,15.831,74.169,99.997
985,986,3094,3415,2923,188.425,26.4698,63.5302,99.9304
986,987,4319,2878,2925,17.514,5.3322699999999985,84.6677,99.9461
987,988,14662,929,2965,14.3665,3.23909,86.7609,97.874
988,989,6579,1775,2945,202.231,18.2144,71.7856,99.9645
989,990,11641,1992,2965,171.94099999999997,62.7511,27.2489,99.9743
990,991,743,2094,2910,199.577,57.9701,32.0299,99.9684
991,992,990,169,2934,202.858,29.0982,60.9018,99.8973
992,993,1304,192,2945,201.80900000000003,26.6561,63.3439,99.9319
993,994,1516,2540,2929,189.782,58.5467,31.4533,99.9843
994,995,510,3555,2936,263.386,5.63357,84.3664,99.9634
995,996,18005,2779,2971,193.007,60.4751,29.5249,99.9654
996,997,2538,1003,2946,191.398,34.5242,55.4758,99.7209
997,998,2545,2320,2930,68.718,84.4243,5.5757,99.964
998,999,28172,1286,3004,13.2086,20.0676,69.9324,99.7293
999,1000,9886,1535,2986,197.511,47.3527,42.6473,99.8588
1000,1001,998,1619,2929,197.616,5.30836,84.6916,99.9702
1001,1002,5219,1624,2957,15.7472,6.7359800000000005,83.264,99.7844
1002,1003,33123,2221,3045,23.5407,18.2705,71.7295,97.2739
1003,1004,7129,2581,2977,25.8334,0.678497,89.3215,98.4179
1004,1005,12296,338,2999,39.816,69.6367,20.3633,99.2293
1005,1006,20042,3061,3012,182.056,72.0337,17.9663,99.5337
1006,1007,14663,653,3032,31.9456,35.1454,54.8546,99.947
1007,1008,648,3476,2957,46.5777,83.85700000000001,6.14299,99.8791
1008,1009,553,2990,2953,28.5733,34.4494,55.5506,99.9885
1009,1010,2238,1880,2968,17.8888,19.5576,70.4424,99.9874
1010,1011,6952,2938,2993,16.3418,26.0285,63.9715,99.9421
1011,1012,1156,815,2962,187.469,54.2097,35.7903,99.9191
1012,1013,1662,2290,2970,28.9626,46.417,43.583,99.954
1013,1014,728,3435,2985,68.0461,84.7846,5.21539,99.9721
1014,1015,1923,2359,2980,10.0447,6.65378,83.3462,99.6985
1015,1016,6895,2458,2997,17.6369,21.4869,68.5131,99.1488
1016,1017,2446,1105,2988,190.623,27.6838,62.3162,99.9099
1017,1018,2865,3164,3000,18.9546,32.4609,57.5391,99.9906
1018,1019,3049,3393,2996,188.638,27.1099,62.8901,99.9809
1019,1020,810,3467,2985,115.162,82.3528,7.64718,99.8378
1020,1021,815,3515,2997,25.3415,80.081,9.91897,99.5512
1021,1022,518,102,2992,311.641,1.22921,88.7708,99.8989
1022,1023,11169,769,3036,218.89,53.372,36.628,99.9211
1023,1024,2749,1475,3001,26.2488,17.8535,72.1465,99.8817
1024,1025,35008,1720,3065,33.8936,58.0565,31.9435,77.1606
1025,1026,1629,837,3000,24.7098,4.78791,85.2121,99.9158
1026,1027,2113,1911,3011,201.067,15.1171,74.8829,99.9642
1027,1028,2028,3296,3005,3.69993,23.6053,66.3947,99.9888
1028,1029,1593,1863,3007,32.7552,34.075,55.925,99.9874
1029,1030,5825,2693,3037,146.894,85.1763,4.82365,98.556
1030,1031,27997,905,3148,12.3175,75.5545,14.4455,42.9406
1031,1032,8324,3237,3063,30.7649,21.0222,68.9778,99.9135
1032,1033,1830,3337,3023,197.783,24.8125,65.1875,99.9794
1033,1034,1554,20,3021,181.0,0.0,90.0,100.004
1034,1035,1276,2615,3022,221.99,81.7531,8.24688,99.8081
1035,1036,601,3489,3023,46.25,86.0519,3.94806,99.8792
1036,1037,1028,143,3034,202.787,71.2036,18.7964,99.9408
1037,1038,40237,400,3159,11.0806,80.3268,9.67317,99.7825
1038,1039,24694,1086,3102,191.352,55.2954,34.7046,99.8264
1039,1040,2970,864,3048,195.234,41.5735,48.4265,99.8827
1040,1041,16666,2612,3083,358.444,79.6189,10.3811,99.5055
1041,1042,8101,249,3064,15.2221,28.9752,61.0248,99.8427
1042,1043,35583,2912,3179,189.466,58.0578,31.9422,75.8282
1043,1044,50733,1503,3180,201.799,1.85277,88.1472,98.568
1044,1045,1207,3374,3049,206.798,76.1197,13.8803,99.5966
1045,1046,3389,548,3059,200.46,56.0751,33.9249,99.9944
1046,1047,6945,1962,3088,29.2991,34.7715,55.2285,99.9043
1047,1048,508,3181,3045,2.99929,26.7744,63.2256,99.9915
1048,1049,2714,2015,3064,181.915,66.5202,23.4798,99.9719
1049,1050,1595,3415,3070,20.2415,33.5951,56.4049,99.9777
1050,1051,2533,1682,3114,193.133,10.7352,79.2648,99.3999
1051,1052,533,3326,3065,183.91,76.3136,13.6864,99.8114
1052,1053,25956,2213,3134,192.417,72.3313,17.6687,99.9619
1053,1054,3993,2813,3076,49.7096,81.12100000000002,8.87902,99.9879
1054,1055,968,3359,3083,182.446,76.8621,13.1379,99.9687
1055,1056,557,1215,3070,192.423,53.8447,36.1553,99.986
1056,1057,4276,2436,3121,9.49378,0.587151,89.4128,99.8109
1057,1058,10190,3155,3131,117.824,73.7431,16.2569,99.9783
1058,1059,5647,3297,3120,198.914,49.2642,40.7358,99.9705
1059,1060,911,486,3095,36.5831,31.995,58.005,99.9462
1060,1061,3884,1284,3101,11.6683,50.5145,39.4855,99.9403
1061,1062,595,131,3102,204.213,70.1666,19.8334,99.8745
1062,1063,6682,794,3119,18.3322,9.75018,80.2498,99.6102
1063,1064,11940,3392,3156,25.3274,26.9408,63.0592,99.8456
1064,1065,6274,627,3123,23.8899,4.99974,85.0003,99.9005
1065,1066,3419,1902,3131,15.4794,36.961,53.039,99.9878
1066,1067,1065,266,3104,27.8237,9.41977,80.5802,99.9887
1067,1068,2487,3064,3120,202.151,14.2752,75.7248,99.9583
1068,1069,14323,544,3180,8.977160000000003,1.86218,88.1378,99.9621
1069,1070,12770,2759,3152,226.003,74.7325,15.2675,99.917
1070,1071,552,2480,3109,196.568,18.091,71.90899999999998,99.9951
1071,1072,843,3462,3119,19.0053,19.7426,70.2574,99.4393
1072,1073,7161,193,3148,215.073,3.98335,86.0166,99.977
1073,1074,3400,2067,3152,190.159,10.7053,79.2947,99.9818
1074,1075,525,3022,3123,188.746,12.1198,77.8802,99.9953
1075,1076,22953,2558,3188,194.13,32.0307,57.9693,99.9905
1076,1077,569,711,3128,184.585,57.5872,32.4128,99.9355
1077,1078,827,1859,3137,209.996,50.077,39.923,99.9974
1078,1079,2847,268,3151,124.276,83.9742,6.02581,99.9934
1079,1080,8696,1194,3168,17.7848,4.9537900000000015,85.0462,99.9671
1080,1081,23091,1945,3212,193.135,15.6154,74.3846,89.4348
1081,1082,1377,1811,3141,188.852,10.4625,79.5375,99.9949
1082,1083,9829,1337,3182,185.81,28.0537,61.9463,99.9427
1083,1084,3401,2336,3179,189.288,11.8015,78.1985,99.9903
1084,1085,6957,1658,3177,191.583,43.5955,46.4045,99.9843
1085,1086,2494,3034,3164,26.9217,10.6468,79.3532,99.994
1086,1087,508,2885,3152,191.607,7.63611,82.3639,99.7623
1087,1088,9564,684,3185,20.5163,10.8416,79.1584,99.9029
1088,1089,2145,3228,3181,16.9458,42.8768,47.1232,99.9426
1089,1090,723,2661,3159,189.169,4.86581,85.1342,99.9912
1090,1091,2023,2897,3182,189.058,22.8659,67.1341,99.9872
1091,1092,7211,1736,3210,6.41715,42.512,47.488,99.9765
1092,1093,1324,3319,3177,194.229,23.2238,66.7762,99.9421
1093,1094,5204,3098,3191,198.831,4.213430000000002,85.7866,99.9824
1094,1095,5812,2413,3216,192.643,14.9506,75.0494,99.9688
1095,1096,1337,3504,3199,37.7326,68.9521,21.0479,99.972
1096,1097,1058,1820,3185,201.426,1.09685,88.9032,99.9936
1097,1098,1870,2765,3208,11.8838,4.84776,85.1522,99.9903
1098,1099,4185,1011,3222,196.422,3.17366,86.8263,99.8928
1099,1100,21473,1185,3241,195.176,33.5245,56.4755,99.9401
1100,1101,9610,2249,3240,18.3761,26.7903,63.2097,99.9616
1101,1102,531,180,3197,195.859,64.0825,25.9175,99.9734
1102,1103,1849,2104,3210,189.713,36.6745,53.3255,99.6008
1103,1104,5150,3288,3227,206.73,2.12544,87.8746,99.9805
1104,1105,11475,3453,3257,207.30900000000003,23.3833,66.6167,72.9245
1105,1106,2864,3159,3227,202.13,32.2564,57.7436,99.998
1106,1107,5904,1800,3240,194.114,21.8843,68.1157,99.9955
1107,1108,1581,212,3227,24.8464,75.5809,14.4191,99.9182
1108,1109,6073,841,3250,26.7677,62.034,27.966,99.9869
1109,1110,8696,238,3301,16.9636,20.7099,69.2901,98.6587
1110,1111,873,169,3229,214.424,17.6117,72.3883,99.9933
1111,1112,17983,2563,3289,19.9106,47.272,42.728,99.5683
1112,1113,10380,640,3270,202.669,8.329880000000001,81.6701,99.9934
1113,1114,2017,2728,3242,10.2459,18.929,71.071,99.9878
1114,1115,1352,719,3239,24.031,62.8534,27.1466,99.9535
1115,1116,1074,138,3247,216.247,18.4624,71.5376,99.9548
1116,1117,18530,3112,3301,15.9968,11.4604,78.5396,99.8968
1117,1118,825,1514,3241,194.203,14.0758,75.9242,99.9944
1118,1119,6986,1384,3267,189.698,15.7702,74.2298,99.9903
1119,1120,1478,3209,3251,27.4211,43.398,46.602,99.9749
1120,1121,2123,2073,3247,188.415,16.3203,73.6797,99.9934
1121,1122,1402,3356,3261,200.728,45.5936,44.4064,99.9933
1122,1123,692,772,3253,193.907,23.0789,66.9211,99.9988
1123,1124,2313,991,3273,203.205,61.8116,28.1884,99.8358
1124,1125,4570,1996,3290,11.3763,2.80785,87.1922,99.9738
1125,1126,5628,2343,3291,188.469,3.635780000000001,86.3642,99.9724
1126,1127,1142,3549,3316,197.096,19.3258,70.6742,99.9089
1127,1128,12073,331,3322,22.3064,17.8198,72.1802,99.5193
1128,1129,11782,1907,3342,23.8785,1.58693,88.4131,99.7094
1129,1130,7960,182,3315,202.618,1.55419,88.4458,99.9364
1130,1131,5020,2087,3294,202.786,25.5659,64.4341,99.916
1131,1132,8205,3267,3306,200.545,46.6548,43.3452,99.7465
1132,1133,6116,2148,3317,199.46400000000003,10.6606,79.3394,98.8404
1133,1134,19349,2869,3329,202.249,13.3445,76.6555,99.6692
1134,1135,6293,476,3319,193.36,21.0845,68.9155,99.9123
1135,1136,800,2997,3285,192.971,48.0026,41.9974,99.8496
1136,1137,6406,736,3315,20.0169,53.853,36.147,99.9332
1137,1138,2109,2261,3295,185.127,14.3466,75.6534,99.9714
1138,1139,26467,760,3388,12.8605,55.0864,34.9136,99.4324
1139,1140,962,1791,3288,188.113,0.444321,89.5557,99.9795
1140,1141,22640,1422,3389,203.852,5.7865400000000005,84.2135,99.5234
1141,1142,15045,3410,3349,14.9057,38.1251,51.8749,99.7693
1142,1143,564,1718,3288,8.81339,0.293747,89.7063,99.9651
1143,1144,6357,1118,3311,200.815,62.0517,27.9483,99.9704
1144,1145,2042,406,3312,335.173,81.3943,8.60572,99.9795
1145,1146,1400,942,3305,197.47,26.5831,63.4169,99.9607
1146,1147,3641,1014,3318,210.363,53.347,36.653,99.903
1147,1148,5350,1742,3325,6.09133,44.4787,45.5213,99.9968
1148,1149,10067,568,3346,39.7962,55.4804,34.5196,99.9853
1149,1150,528,2954,3303,196.6,46.589,43.411,99.7739
1150,1151,2627,2687,3323,14.7397,4.11626,85.8837,99.9787
1151,1152,15180,1206,3363,197.026,5.064780000000002,84.9352,99.174
1152,1153,598,1463,3313,189.569,11.7618,78.2382,99.999
1153,1154,816,2408,3319,191.471,70.7413,19.2587,99.9317
1154,1155,2594,1801,3345,151.164,79.0141,10.9859,99.9222
1155,1156,7312,897,3358,22.8047,41.247,48.753,99.897
1156,1157,9021,1531,3343,28.9053,85.3686,4.6313900000000015,99.9652
1157,1158,8599,2206,3352,28.0663,74.5544,15.4456,99.9706
1158,1159,6993,2019,3355,18.7502,8.733789999999999,81.2662,99.9813
1159,1160,1414,2653,3350,193.787,1.34611,88.6539,99.9685
1160,1161,2538,1666,3347,186.134,80.5133,9.4867,99.9871
1161,1162,1950,2545,3354,28.5742,36.579,53.42100000000001,99.9928
1162,1163,2600,1070,3364,191.997,3.3103,86.6897,99.9281
1163,1164,6870,2381,3369,21.95,39.2483,50.7517,99.9903
1164,1165,4140,2483,3376,18.4232,8.16423,81.8358,99.9833
1165,1166,829,399,3351,29.8969,85.1766,4.82343,99.9851
1166,1167,6851,2283,3390,197.563,13.2981,76.7019,99.9915
1167,1168,13084,2599,3420,176.048,72.3675,17.6325,99.9577
1168,1169,2353,970,3364,16.3096,55.6775,34.3225,99.9909
1169,1170,84437,2995,3481,17.5646,1.26994,88.7301,96.244
1170,1171,7441,3209,3399,203.638,16.2534,73.7466,99.7906
1171,1172,1015,442,3378,341.311,82.851,7.1490300000000016,99.9205
1172,1173,761,1860,3370,193.845,9.50219,80.4978,99.9919
1173,1174,1583,2079,3388,17.4307,0.7836529999999999,89.2163,99.9395
1174,1175,7128,3322,3409,204.518,2.93097,87.069,99.9853
1175,1176,124192,431,3623,196.524,10.8391,79.1609,98.8399
1176,1177,55266,1734,3502,18.4994,58.62,31.38,52.2728
1177,1178,25186,1283,3490,23.8184,54.161,35.839,60.132
1178,1179,1262,1627,3390,36.0275,83.6431,6.35686,99.9918
1179,1180,670,1590,3385,201.342,23.2147,66.7853,99.8726
1180,1181,727,1103,3392,16.0947,4.84068,85.1593,99.993
1181,1182,2967,1561,3423,352.29,84.9377,5.06229,99.9483
1182,1183,8340,1660,3444,198.824,27.4378,62.5622,99.8763
1183,1184,28511,1033,3474,4.32196,35.6059,54.3941,84.6329
1184,1185,1054,1220,3403,14.6228,16.9556,73.0444,99.7835
1185,1186,569,3494,3398,218.389,24.6897,65.3103,99.8579
1186,1187,2744,3545,3511,195.389,21.6275,68.3725,99.8539
1187,1188,4521,464,3426,35.2503,58.4761,31.5239,99.9854
1188,1189,4323,546,3424,22.8436,9.21949,80.7805,99.909
1189,1190,2661,332,3426,188.687,7.35162,82.6484,99.9947
1190,1191,984,2186,3407,24.744,56.5926,33.4074,99.9874
1191,1192,800,2439,3414,171.739,72.0209,17.9791,99.9806
1192,1193,1059,631,3416,196.752,31.7896,58.2104,99.969
1193,1194,2480,181,3437,194.12,6.964169999999998,83.0358,99.9937
1194,1195,5414,3437,3458,18.3753,58.1614,31.8386,99.0534
1195,1196,8959,2037,3446,199.995,0.77166,89.2283,99.9668
1196,1197,19317,2272,3481,17.289,10.1514,79.8486,96.6854
1197,1198,3711,3035,3443,194.674,37.1532,52.8468,99.9721
1198,1199,2880,2181,3436,24.5936,56.4604,33.5396,99.9914
1199,1200,2597,2126,3454,10.2297,36.2137,53.7863,99.982
1200,1201,1056,409,3435,14.5677,7.83247,82.1675,99.9919
1201,1202,7969,874,3471,194.878,39.4951,50.5049,99.5993
1202,1203,2633,3498,3467,222.515,13.4128,76.5872,99.8442
1203,1204,710,1294,3431,21.542,22.4586,67.5414,99.9972
1204,1205,561,2257,3432,196.997,12.4665,77.5335,99.9789
1205,1206,28713,2507,3520,200.647,44.2226,45.7774,99.6775
1206,1207,4709,2811,3468,17.0818,66.8188,23.1812,99.8366
1207,1208,2345,3297,3472,206.042,15.0595,74.9405,99.9953
1208,1209,1784,2701,3463,25.0883,3.4473300000000004,86.5527,99.9846
1209,1210,7902,171,3536,195.988,6.21204,83.788,99.869
1210,1211,3812,3353,3480,193.481,14.5662,75.4338,99.9585
1211,1212,8963,1995,3512,322.566,81.5357,8.46429,99.5304
1212,1213,553,117,3489,171.782,43.0862,46.9138,99.8816
1213,1214,20583,706,3543,189.696,19.4774,70.5226,99.9728
1214,1215,9721,2678,3534,204.071,50.7901,39.2099,61.6553
1215,1216,49061,1471,3684,14.3816,6.73544,83.2646,80.607
1216,1217,11823,3469,3608,194.526,6.2764,83.7236,99.3563
1217,1218,1265,14,3523,181.0,0.0,90.0,100.004
1218,1219,7533,3383,3549,197.941,32.3409,57.6591,99.9779
1219,1220,1843,2818,3525,196.239,40.85,49.15,99.9867
1220,1221,14748,1175,3591,192.373,7.82764,82.1724,99.9769
1221,1222,29440,1994,3598,293.821,87.7288,2.27116,97.9146
1222,1223,17173,793,3608,19.8021,50.0582,39.9418,99.8226
1223,1224,2358,3298,3544,32.4608,68.5145,21.4855,99.6408
1224,1225,21841,2312,3604,196.676,36.1288,53.8712,99.2111
1225,1226,23970,252,3674,198.989,18.9586,71.0414,99.639
1226,1227,3104,3090,3570,24.1632,23.6494,66.3506,99.852
1227,1228,2146,2750,3559,212.521,30.7612,59.2388,99.948
1228,1229,6607,554,3579,32.5458,49.1686,40.8314,99.9868
1229,1230,5531,998,3581,55.5946,88.0534,1.94657,99.95
1230,1231,3002,912,3582,191.965,0.967674,89.0323,99.9225
1231,1232,2128,2391,3567,200.906,41.5097,48.4903,99.8969
1232,1233,1410,1783,3568,339.309,76.9106,13.0894,99.9932
1233,1234,4859,1824,3606,26.5016,0.972839,89.0272,99.8213
1234,1235,1265,1530,3592,203.865,64.8687,25.1313,99.8752
1235,1236,2741,2182,3592,195.114,25.3145,64.6855,99.6802
1236,1237,4447,1079,3598,56.4229,82.9572,7.04283,99.9861
1237,1238,14632,1341,3640,221.125,89.1547,0.845341,99.7845
1238,1239,16700,3176,3645,190.608,79.2741,10.7259,99.8553
1239,1240,16567,3320,3656,189.334,8.22392,81.7761,99.9436
1240,1241,6502,2921,3612,25.9454,63.1573,26.8427,99.9773
1241,1242,2335,634,3612,197.842,23.0972,66.9028,99.986
1242,1243,18303,2781,3692,190.545,37.6304,52.3696,99.0556
1243,1244,1049,3400,3603,190.419,12.7823,77.2177,99.9973
1244,1245,7869,2653,3625,24.7699,11.3073,78.6927,99.6298
1245,1246,4359,131,3679,7.778510000000002,66.006,23.994,99.7604
1246,1247,1517,1591,3612,201.007,66.9018,23.0982,99.9947
1247,1248,31645,2496,3715,197.626,9.33808,80.6619,85.5086
1248,1249,725,3165,3607,22.0105,47.4173,42.5827,99.9954
1249,1250,7282,2199,3643,201.028,14.6313,75.3687,99.951
1250,1251,3068,3011,3636,13.4213,12.3832,77.6168,99.9923
1251,1252,20611,1783,3707,147.967,76.0536,13.9463,99.9547
1252,1253,1443,3540,3703,195.419,22.396,67.604,99.9098
1253,1254,1077,3063,3642,200.417,22.6043,67.3957,99.9058
1254,1255,5267,864,3684,11.7663,5.18656,84.8134,99.9579
1255,1256,746,952,3647,108.829,84.2731,5.72685,99.971
1256,1257,2660,2586,3659,191.573,10.0283,79.9717,99.9485
1257,1258,1138,590,3645,192.641,6.54574,83.4543,99.9908
1258,1259,2333,1032,3651,357.23800000000006,57.7575,32.2425,99.793
1259,1260,5074,178,3709,6.27933,64.9417,25.0583,99.9947
1260,1261,13555,1604,3745,17.6447,50.8513,39.1487,99.8385
1261,1262,4892,1916,3676,11.6449,4.81171,85.1883,99.9608
1262,1263,5178,2120,3675,15.1008,47.3691,42.6309,99.996
1263,1264,20086,1280,3734,185.383,65.4923,24.5077,99.9179
1264,1265,4155,2208,3714,201.143,12.9203,77.0797,99.7229
1265,1266,1494,2925,3673,223.706,70.0396,19.9604,99.9012
1266,1267,2252,3059,3680,222.396,75.8327,14.1673,99.9349
1267,1268,10436,1083,3751,193.366,15.5883,74.4117,99.9274
1268,1269,10643,746,3738,54.9766,72.2192,17.7808,99.9116
1269,1270,14523,1681,3770,205.30900000000003,6.023630000000002,83.9764,99.9279
1270,1271,5880,3446,3725,203.155,13.3701,76.6299,98.3971
1271,1272,1199,2330,3692,153.629,82.0092,7.99079,99.9749
1272,1273,4358,2996,3708,26.4997,64.8896,25.1104,99.9844
1273,1274,1357,2636,3705,15.755999999999998,10.5891,79.4109,99.9469
1274,1275,2093,1127,3707,197.49400000000003,78.6432,11.3568,99.9845
1275,1276,8230,905,3736,187.149,76.5925,13.4075,99.9313
1276,1277,4031,2274,3714,22.8413,43.0187,46.9813,99.9972
1277,1278,1498,2063,3708,20.1682,19.4977,70.5023,99.9583
1278,1279,1236,1306,3709,27.3083,32.3935,57.6065,99.9413
1279,1280,6106,998,3735,18.2243,36.7109,53.2891,99.9977
1280,1281,25630,3107,3764,197.709,26.1703,63.8297,99.8625
1281,1282,52957,2888,3935,21.1586,14.4123,75.5877,98.1224
1282,1283,82843,2011,3879,15.8228,29.0642,60.9358,99.5686
1283,1284,682,3376,3718,27.1316,54.9692,35.0308,99.9815
1284,1285,1980,2690,3724,197.203,74.7046,15.2954,99.9914
1285,1286,641,3403,3723,27.1669,55.0368,34.9632,99.99
1286,1287,3061,816,3761,205.493,4.86197,85.13799999999998,99.9591
1287,1288,8900,3327,3763,187.852,34.5897,55.4103,99.979
1288,1289,1798,1935,3740,144.226,76.7627,13.2373,99.9886
1289,1290,4374,2006,3752,11.5672,46.8537,43.1463,99.9838
1290,1291,1320,1178,3742,22.9367,30.2452,59.7548,99.9926
1291,1292,1743,214,3755,190.663,25.0215,64.9785,99.9974
1292,1293,33466,2446,3849,29.3167,32.1644,57.8356,90.6624
1293,1294,2233,2481,3756,19.5589,4.5229599999999985,85.477,99.9708
1294,1295,2633,3494,3780,148.11700000000005,79.3339,10.6661,99.9135
1295,1296,3963,1870,3768,207.695,12.2975,77.7025,99.7801
1296,1297,653,2266,3754,24.5593,51.0659,38.9341,99.9987
1297,1298,575,2671,3757,22.9111,39.7442,50.2558,99.9913
1298,1299,1078,288,3768,30.9908,82.4019,7.598089999999999,99.9912
1299,1300,20460,2719,3832,195.537,72.1684,17.8316,99.9762
1300,1301,8784,650,3808,17.6775,24.2644,65.7356,99.9951
1301,1302,14611,2241,3825,18.3575,73.2092,16.7908,99.9633
1302,1303,1945,2526,3791,22.3614,7.05951,82.9405,99.9326
1303,1304,9012,162,3827,19.8369,22.619,67.381,99.7404
1304,1305,25366,1228,3867,196.307,21.8079,68.1921,99.9158
1305,1306,8414,1117,3841,49.5921,77.5655,12.4345,99.9384
1306,1307,8647,3409,3823,17.6702,51.8336,38.1664,82.2359
1307,1308,617,963,3785,197.916,16.5094,73.4906,99.9689
1308,1309,17634,3230,3853,26.4584,48.3631,41.6369,99.9357
1309,1310,522,897,3795,167.062,84.3278,5.67216,99.856
1310,1311,9263,1804,3839,36.3525,83.0674,6.93257,99.9967
1311,1312,7053,995,3834,21.9359,30.7095,59.2905,99.9904
1312,1313,2418,1884,3827,193.431,16.9768,73.0232,99.962
1313,1314,14947,809,3859,184.439,30.6804,59.3196,99.9173
1314,1315,5790,1562,3855,286.263,89.3766,0.623382,99.9734
1315,1316,1132,885,3818,174.118,80.7545,9.24554,99.9778
1316,1317,9435,3059,3855,195.909,2.25446,87.7455,99.9682
1317,1318,1252,932,3846,200.65,81.6842,8.31581,99.939
1318,1319,914,307,3835,46.9668,85.1877,4.81227,99.9919
1319,1320,1550,397,3840,19.9932,22.8377,67.1623,99.9582
1320,1321,2799,1334,3856,202.988,6.26896,83.73100000000002,99.9902
1321,1322,1668,715,3851,206.348,6.24314,83.7569,99.9927
1322,1323,769,3498,3840,196.883,31.0686,58.9314,99.9567
1323,1324,3844,587,3866,191.445,42.9486,47.0514,99.9404
1324,1325,1461,342,3863,197.748,26.3185,63.6815,99.8771
1325,1326,12325,1423,3922,19.4291,9.20184,80.7982,99.6164
1326,1327,5001,492,3873,20.4004,27.3936,62.6064,99.9742
1327,1328,2417,3287,3875,197.304,24.0211,65.9789,99.9965
1328,1329,15788,196,3934,19.8077,69.7472,20.2528,99.9659
1329,1330,1161,2199,3867,202.232,16.8271,73.1729,99.9962
1330,1331,5005,2843,3901,193.904,5.684819999999998,84.3152,98.9905
1331,1332,3711,402,3893,18.6349,28.0491,61.9509,99.4928
1332,1333,575,2342,3871,166.604,82.6324,7.36757,99.9702
1333,1334,603,73,3883,66.7674,4.33652,85.6635,99.9422
1334,1335,2613,3388,3901,12.4372,27.1539,62.8461,99.9616
1335,1336,3302,918,3902,16.4288,5.49573,84.5043,99.9154
1336,1337,2629,1644,3907,15.3469,19.1553,70.8447,99.9922
1337,1338,915,2630,3893,193.026,1.0665,88.9335,99.9951
1338,1339,1538,2340,3916,193.595,12.3099,77.6901,99.8882
1339,1340,4587,2758,3909,207.393,0.195305,89.8047,99.9418
1340,1341,10879,632,3927,24.9092,72.8677,17.1323,99.9526
1341,1342,2244,3474,3906,13.1076,28.4367,61.5633,99.8299
1342,1343,4122,986,3935,56.9962,75.7319,14.2681,99.8903
1343,1344,1784,470,3911,195.587,20.1331,69.8669,99.9343
1344,1345,1521,2384,3918,185.98,82.2675,7.73251,99.9783
1345,1346,935,1331,3910,11.8097,26.5684,63.4316,99.9893
1346,1347,8660,1072,3938,207.166,75.4022,14.5978,99.905
1347,1348,3302,1528,3926,187.289,34.2998,55.7002,99.9188
1348,1349,9334,2695,3961,194.16,0.705551,89.2944,99.9395
1349,1350,34462,3322,4010,201.785,33.2158,56.7842,99.1939
1350,1351,13193,3059,3953,196.726,45.0641,44.9359,99.9823
1351,1352,3230,2596,3940,181.177,40.9739,49.0261,99.9358
1352,1353,2565,759,3932,50.2504,72.2631,17.7369,99.9751
1353,1354,7858,1617,3971,13.8014,35.2514,54.7486,99.948
1354,1355,744,1350,3933,187.936,23.1312,66.8688,99.973
1355,1356,61416,500,4110,196.849,15.6303,74.3697,96.8195
1356,1357,5833,3444,3971,184.979,26.5606,63.4394,99.881
1357,1358,19508,283,4013,2.04226,78.7272,11.2728,98.7079
1358,1359,43834,797,4027,21.2284,22.25,67.75,98.8425
1359,1360,4932,2334,4003,198.289,0.8040010000000001,89.196,66.958
1360,1361,1013,1313,3956,52.8246,81.2758,8.724160000000001,99.8512
1361,1362,6618,1369,3998,198.047,31.2227,58.7773,99.9881
1362,1363,3228,2544,3967,15.4819,9.59282,80.4072,99.9433
1363,1364,8532,1220,3981,29.5287,17.2037,72.7963,99.9455
1364,1365,1729,1938,3975,182.67,73.6197,16.3803,99.9762
1365,1366,1358,394,3974,196.82,11.1752,78.8248,99.9869
1366,1367,1661,1713,3976,184.306,29.4239,60.5761,99.8308
1367,1368,815,2395,3969,14.9289,51.4738,38.5262,99.9604
1368,1369,2213,2480,3978,17.6081,20.3237,69.6763,99.9451
1369,1370,3368,3182,3991,18.6086,10.7273,79.2727,99.9655
1370,1371,2247,1780,4000,196.737,6.28172,83.7183,99.8369
1371,1372,8543,2419,4046,34.5528,61.9962,28.0038,99.4873
1372,1373,2710,1539,4007,33.2824,20.9463,69.0537,99.945
1373,1374,1486,1049,3994,164.398,83.9679,6.03212,99.9926
1374,1375,3043,1467,4014,185.189,31.7886,58.2114,99.9571
1375,1376,24374,2647,4102,192.525,36.5518,53.4482,83.9088
1376,1377,3016,2558,4010,210.836,12.3206,77.6794,99.8172
1377,1378,5196,3027,4031,8.4127,31.0911,58.9089,99.9747
1378,1379,738,3502,4016,195.127,59.7277,30.2723,99.9726
1379,1380,504,10,4016,181.0,0.0,90.0,100.0
1380,1381,581,393,4014,21.3581,50.4582,39.5418,99.9482
1381,1382,505,1049,4016,153.273,86.4868,3.51316,99.191
1382,1383,1400,1310,4036,35.5071,70.3,19.7,99.4718
1383,1384,3968,989,4053,30.9535,10.5548,79.4452,99.984
1384,1385,15224,3160,4101,183.681,58.7814,31.2186,99.8941
1385,1386,20103,1185,4071,193.736,33.0714,56.9286,99.9688
1386,1387,13480,1643,4072,189.825,57.9286,32.0714,99.4597
1387,1388,2995,560,4041,20.399,24.5696,65.4304,99.9875
1388,1389,17932,2131,4085,16.9742,35.5787,54.4213,99.7925
1389,1390,577,3467,4034,207.217,50.8045,39.1955,99.9664
1390,1391,2556,2492,4056,23.1205,6.5557,83.4443,99.9038
1391,1392,819,2145,4030,205.664,35.1294,54.8706,99.9411
1392,1393,719,2972,4045,22.083,61.1318,28.8682,99.8568
1393,1394,25165,2006,4140,332.381,83.5667,6.43325,99.877
1394,1395,3308,1418,4067,34.376,70.3832,19.6168,99.9214
1395,1396,8040,1876,4067,195.269,7.52305,82.477,99.5973
1396,1397,2571,1054,4055,18.4932,23.6441,66.3559,99.9889
1397,1398,2096,1769,4047,27.845,17.4818,72.5182,99.9924
1398,1399,8824,3259,4115,20.4103,36.7805,53.2195,99.9379
1399,1400,7687,1512,4081,21.8053,37.0782,52.9218,99.98
1400,1401,1354,3092,4056,22.1484,39.5039,50.4961,99.9364
1401,1402,11446,928,4112,206.905,15.9817,74.0183,85.7783
1402,1403,519,2533,4058,36.7724,58.8453,31.1547,99.982
1403,1404,5687,2751,4086,21.8231,22.4455,67.5545,99.9728
1404,1405,670,2149,4066,19.9146,43.2481,46.7519,99.9527
1405,1406,8104,203,4101,197.8,37.9169,52.0831,99.8174
1406,1407,3850,1338,4091,30.5202,12.8864,77.1136,99.9967
1407,1408,600,2266,4068,202.794,0.186722,89.8133,99.99
1408,1409,670,1803,4086,30.8694,11.02,78.98,99.4661
1409,1410,2880,2304,4090,17.2546,3.3503,86.6497,99.6006
1410,1411,892,3487,4084,195.897,63.7913,26.2087,99.9396
1411,1412,602,2221,4084,26.7837,63.5256,26.4744,99.8121
1412,1413,16608,1723,4152,197.731,19.0441,70.9559,99.4827
1413,1414,659,123,4091,18.5649,8.04948,81.9505,99.9522
1414,1415,2023,3019,4097,194.511,65.3039,24.6961,99.9874
1415,1416,2733,304,4105,15.6087,24.1581,65.8419,99.9827
1416,1417,626,2962,4094,192.806,37.336,52.664,99.9787
1417,1418,2495,1060,4125,216.303,79.6086,10.3914,99.8419
1418,1419,36887,2474,4190,207.58,12.9631,77.0369,98.3857
1419,1420,5267,3080,4127,3.06553,30.5118,59.4882,99.9829
1420,1421,21144,2300,4192,16.3627,14.7905,75.2095,99.5621
1421,1422,1528,357,4123,190.765,20.9537,69.0463,99.9472
1422,1423,10375,1469,4151,10.0597,79.2833,10.7167,99.9123
1423,1424,3640,2961,4135,168.547,83.8678,6.1322,99.9312
1424,1425,2175,2807,4127,28.2945,2.05173,87.9483,99.8434
1425,1426,12857,1843,4171,199.485,54.1661,35.8339,99.9128
1426,1427,3567,738,4141,194.406,14.7288,75.2712,99.994
1427,1428,1298,3454,4133,13.8637,20.2635,69.7365,99.9841
1428,1429,3221,1317,4143,44.9584,72.9836,17.0164,99.9888
1429,1430,6070,1197,4163,191.025,4.495430000000002,85.5046,99.5278
1430,1431,3324,1270,4162,174.305,81.1391,8.86089,99.9322
1431,1432,2511,3371,4152,193.913,1.40565,88.5944,99.9762
1432,1433,15150,2720,4224,196.224,6.4194900000000015,83.5805,99.6663
1433,1434,3257,334,4169,21.4874,80.5735,9.42648,99.9363
1434,1435,10725,1011,4198,21.9829,22.4658,67.5342,98.4584
1435,1436,10281,2193,4201,19.7703,1.13676,88.8632,99.9933
1436,1437,7453,2876,4183,29.1437,66.458,23.542,99.9581
1437,1438,1291,170,4151,190.55900000000003,10.2561,79.7439,99.9993
1438,1439,3092,3411,4198,202.989,1.98988,88.0101,99.9694
1439,1440,1787,255,4161,197.176,11.6998,78.3002,99.9964
1440,1441,834,889,4166,196.429,20.3155,69.6845,99.6385
1441,1442,7835,2993,4207,198.941,17.3292,72.6708,99.9982
1442,1443,2707,2788,4185,191.616,64.0014,25.9985,99.9951
1443,1444,708,1602,4167,26.6633,2.65147,87.3485,99.6871
1444,1445,6966,186,4207,195.927,21.2401,68.7599,99.8236
1445,1446,725,856,4173,59.2076,76.1006,13.8994,99.9916
1446,1447,1888,1662,4179,207.727,0.215347,89.7847,99.9394
1447,1448,3515,1118,4193,154.121,64.3415,25.6585,99.9918
1448,1449,876,3213,4177,197.458,22.4959,67.5041,99.9947
1449,1450,11131,3332,4226,197.979,23.5735,66.4265,99.9845
1450,1451,1298,3451,4179,11.8187,1.89389,88.1061,99.9857
1451,1452,2367,1397,4186,20.9204,19.1584,70.8416,99.9835
1452,1453,698,624,4176,36.8523,30.4647,59.5353,99.9674
1453,1454,2601,767,4187,206.216,42.7846,47.2154,99.9981
1454,1455,15741,718,4252,5.94793,42.9533,47.0467,99.9732
1455,1456,8319,1569,4219,194.565,11.3104,78.6896,99.2889
1456,1457,1632,3259,4190,193.787,2.27244,87.7276,99.9961
1457,1458,1002,289,4193,190.956,30.3763,59.6237,99.9887
1458,1459,3023,3067,4204,189.755,37.7542,52.2458,99.9895
1459,1460,8108,1384,4234,200.681,9.12151,80.8785,98.1833
1460,1461,6252,615,4232,18.2512,30.9442,59.0558,99.9869
1461,1462,7459,295,4252,122.839,83.895,6.10496,99.9141
1462,1463,19236,887,4295,203.538,22.251,67.749,97.7476
1463,1464,5361,3435,4256,16.2991,0.511696,89.4883,99.1133
1464,1465,6527,1946,4240,30.7858,14.6314,75.3686,99.9857
1465,1466,578,3151,4203,154.469,76.5397,13.4603,99.9734
1466,1467,11008,3183,4248,2.4045,31.7846,58.2154,99.9764
1467,1468,2566,1196,4227,11.1829,7.77318,82.2268,99.9968
1468,1469,524,1458,4211,187.471,75.6046,14.3954,99.9893
1469,1470,1678,384,4225,65.1948,73.0069,16.9931,99.9843
1470,1471,7704,1329,4272,14.0817,7.57966,82.4203,99.4955
1471,1472,1400,540,4227,192.765,33.8672,56.1328,99.9972
1472,1473,2774,2136,4243,193.956,8.016860000000001,81.9831,99.9562
1473,1474,2147,1787,4258,337.75699999999995,71.4114,18.5886,99.966
1474,1475,2526,1859,4244,188.08,31.7613,58.2387,99.9705
1475,1476,4877,1141,4267,193.456,19.4356,70.5644,99.9376
1476,1477,1178,1747,4260,195.156,16.6366,73.3634,99.9757
1477,1478,1634,219,4253,141.11700000000005,85.0271,4.97291,99.972
1478,1479,19083,1066,4316,202.757,63.9733,26.0267,99.9147
1479,1480,615,1254,4248,190.904,18.2217,71.7783,99.9969
1480,1481,4699,2068,4265,14.9412,29.8082,60.1918,99.6799
1481,1482,688,2943,4257,30.0266,50.7753,39.2247,99.9728
1482,1483,1686,1637,4260,209.953,12.005,77.995,99.925
1483,1484,3901,2810,4281,192.682,30.4198,59.5802,99.9955
1484,1485,8968,3045,4302,63.8651,70.6971,19.3029,99.8891
1485,1486,3720,532,4279,18.5259,6.97315,83.0268,99.9869
1486,1487,3391,2240,4272,20.2801,9.01018,80.9898,99.8203
1487,1488,7011,2728,4303,195.288,34.99,55.01,99.9664
1488,1489,14946,2942,4356,25.5266,17.9001,72.0999,97.3643
1489,1490,5139,1219,4296,196.37,5.01768,84.9823,99.9761
1490,1491,1599,2548,4275,13.4676,71.8287,18.1713,99.9903
1491,1492,855,1839,4271,28.4752,0.575378,89.4246,99.9922
1492,1493,533,3490,4279,199.353,1.86549,88.1345,99.9871
1493,1494,33484,2082,4348,205.433,11.3829,78.6171,96.7365
1494,1495,1794,3454,4292,191.785,0.127777,89.8722,99.9913
1495,1496,1223,3122,4281,196.439,21.8159,68.1841,99.996
1496,1497,6419,1705,4311,190.393,3.69672,86.3033,99.8973
1497,1498,1218,2611,4280,20.2207,29.3108,60.6892,99.9972
1498,1499,6347,170,4318,4.5673,30.8805,59.1195,99.8306
1499,1500,3168,1621,4312,195.249,73.5516,16.4484,99.9823
1500,1501,2039,1547,4293,211.513,74.6416,15.3584,99.9782
1501,1502,3006,2151,4301,14.8976,4.86485,85.1352,99.9931
1502,1503,1130,2021,4289,194.258,22.3289,67.6711,99.4316
1503,1504,11637,1445,4346,37.3511,53.0649,36.9351,58.4937
1504,1505,6603,2640,4325,20.14,9.72847,80.2715,99.9614
1505,1506,9643,3269,4325,13.0113,65.9129,24.0871,99.8689
1506,1507,18650,295,4356,22.3556,4.6276199999999985,85.3724,99.9814
1507,1508,672,583,4295,152.105,75.9964,14.0036,99.9317
1508,1509,733,3359,4296,17.3554,5.6708300000000005,84.3292,99.9633
1509,1510,609,804,4300,183.743,42.2916,47.7084,99.9837
1510,1511,1738,2560,4308,7.71053,9.84673,80.1533,99.9961
1511,1512,4458,1819,4324,25.9452,1.07097,88.929,99.6486
1512,1513,1138,2021,4316,191.928,1.88583,88.1142,99.7555
1513,1514,3381,614,4338,69.7006,84.6547,5.34531,99.977
1514,1515,8325,3143,4349,207.928,42.66,47.34,99.9847
1515,1516,1902,2393,4325,192.43,9.39773,80.6023,99.7
1516,1517,1327,3484,4329,188.189,0.300354,89.6996,99.983
1517,1518,1455,2514,4321,192.659,8.98157,81.0184,99.9837
1518,1519,3381,414,4335,15.015999999999998,9.59142,80.4086,99.9395
1519,1520,1432,476,4332,103.194,81.0191,8.98087,99.8904
1520,1521,4346,708,4332,202.219,50.4911,39.5089,99.8456
1521,1522,1166,3376,4327,27.0631,54.74800000000001,35.25199999999999,99.9871
1522,1523,6066,1276,4348,22.5531,25.4457,64.5543,99.9896
1523,1524,760,2800,4324,207.281,53.1846,36.8154,99.9935
1524,1525,532,2464,4329,13.9359,10.7861,79.2139,99.5192
1525,1526,530,963,4326,195.486,1.60998,88.39,99.9955
1526,1527,4712,1560,4350,21.1373,0.214714,89.7853,99.9851
1527,1528,590,2315,4333,48.2411,8.7672,81.2328,99.9938
1528,1529,4385,3423,4358,33.9851,49.5928,40.4072,99.9725
1529,1530,14255,520,4395,206.678,9.0638,80.9362,99.8949
1530,1531,5723,782,4367,5.16423,3.56306,86.4369,99.9972
1531,1532,1584,1361,4355,177.627,37.9741,52.0259,99.9825
1532,1533,2167,2878,4356,201.057,47.7879,42.2121,98.5139
1533,1534,790,1762,4351,165.687,66.2074,23.7926,99.9963
1534,1535,1630,2562,4356,205.138,27.4173,62.5827,99.6082
1535,1536,2076,3350,4366,39.1213,57.63,32.37,99.9751
1536,1537,1151,2511,4361,357.076,42.0244,47.9756,99.9925
1537,1538,2926,2382,4370,190.336,43.0716,46.9284,99.9672
1538,1539,1391,1685,4359,193.204,31.5947,58.4053,99.7227
1539,1540,7156,203,4407,9.45773,78.0855,11.9145,99.9435
1540,1541,2254,2480,4383,190.635,44.1948,45.8052,99.6245
1541,1542,5730,2303,4388,18.8859,62.2179,27.7821,99.988
1542,1543,7558,2749,4394,209.009,48.6818,41.3182,99.995
1543,1544,8277,1843,4403,195.64,58.5741,31.4259,99.9284
1544,1545,5692,1191,4397,188.597,25.8472,64.1528,99.8232
1545,1546,1248,3217,4369,189.963,41.3608,48.6392,99.9977
1546,1547,16637,1326,4453,190.881,61.9042,28.0958,80.6843
1547,1548,6964,1939,4433,195.738,15.3826,74.6174,99.3519
1548,1549,8820,917,4408,24.6946,16.9138,73.0862,99.8307
1549,1550,2103,683,4378,196.778,27.7026,62.2974,99.9905
1550,1551,2388,3072,4386,24.871,46.8506,43.1494,99.9721
1551,1552,1110,2607,4389,6.20058,0.674225,89.3258,99.9848
1552,1553,2673,2660,4389,208.341,8.3047,81.6953,99.4215
1553,1554,5411,1491,4417,60.4872,77.8674,12.1326,99.9756
1554,1555,2124,2552,4397,197.112,40.0769,49.9231,99.8825
1555,1556,2776,425,4409,196.643,85.7631,4.23686,99.9631
1556,1557,14617,1639,4424,196.496,79.9833,10.0167,99.8925
1557,1558,534,3250,4383,219.991,65.8481,24.1519,99.9912
1558,1559,1009,2107,4396,30.7109,1.22511,88.7749,99.9657
1559,1560,6294,3241,4422,202.101,16.0134,73.9866,99.8836
1560,1561,7078,1047,4442,191.954,20.8689,69.1311,98.8427
1561,1562,896,3492,4404,24.9748,18.9341,71.0659,99.9197
1562,1563,21485,561,4478,198.033,56.3025,33.6975,77.4064
1563,1564,71147,2390,4597,21.3921,6.39812,83.6019,70.028
1564,1565,2714,3448,4409,26.5421,16.072,73.928,99.9237
1565,1566,5480,2828,4427,26.8032,25.7957,64.2043,99.9517
1566,1567,64531,789,4560,195.34,19.0765,70.9235,96.5372
1567,1568,4917,159,4461,192.968,22.5158,67.4842,99.8044
1568,1569,1199,3177,4408,170.122,55.0396,34.9604,99.9931
1569,1570,1817,3353,4416,196.328,8.5249,81.4751,99.8936
1570,1571,2174,2027,4425,25.085,51.4581,38.5419,99.9956
1571,1572,5454,2054,4466,206.74400000000003,5.05238,84.9476,99.985
1572,1573,1966,1241,4429,11.6915,15.0454,74.9546,99.9847
1573,1574,4128,2247,4433,205.084,27.8585,62.1415,99.9948
1574,1575,2810,3019,4424,220.319,21.5594,68.4406,99.9863
1575,1576,563,3119,4410,26.8066,41.2265,48.7735,99.8139
1576,1577,10800,330,4463,148.065,82.9814,7.0186199999999985,99.903
1577,1578,5585,2516,4465,22.6158,31.6579,58.3421,99.3697
1578,1579,898,2612,4442,9.61402,8.19037,81.8096,99.9741
1579,1580,6513,2678,4451,15.6708,25.8442,64.1558,99.6994
1580,1581,2367,3299,4437,203.541,1.22089,88.7791,99.9909
1581,1582,52106,3338,4571,197.385,11.5812,78.4188,71.4479
1582,1583,1040,2575,4435,18.1547,24.3927,65.6073,99.9979
1583,1584,569,1086,4431,200.028,44.0753,45.9247,99.9932
1584,1585,2538,1129,4448,17.0839,19.1699,70.8301,99.9958
1585,1586,12446,2179,4487,21.8494,50.0161,39.9839,99.9364
1586,1587,625,1812,4436,203.049,18.6765,71.3235,99.9982
1587,1588,11049,1586,4523,33.3033,5.1952099999999986,84.8048,99.8341
1588,1589,28350,3110,4513,20.4926,21.7153,68.2847,98.7244
1589,1590,30899,1786,4544,203.33,2.25549,87.7445,99.4906
1590,1591,1827,1432,4470,21.7402,32.9532,57.0468,99.9542
1591,1592,875,2897,4455,31.6298,66.8914,23.1086,99.9845
1592,1593,21981,1088,4531,187.392,44.5642,45.4358,99.4373
1593,1594,1333,855,4463,191.032,43.094,46.90600000000001,99.9767
1594,1595,1413,3247,4475,21.8421,6.67329,83.3267,99.9906
1595,1596,1432,1862,4472,15.1798,19.3474,70.6526,99.9861
1596,1597,2345,2764,4479,18.2407,36.2516,53.7484,99.8694
1597,1598,2618,2598,4482,202.129,7.2602600000000015,82.7397,99.2594
1598,1599,58871,2861,4594,19.0483,5.3743,84.6257,89.5917
1599,1600,5035,1466,4517,194.072,75.3711,14.6289,99.1903
1600,1601,994,1522,4498,20.5886,33.6121,56.3879,99.9907
1601,1602,10370,1957,4540,33.1855,58.0662,31.9338,99.8066
1602,1603,569,3073,4495,343.755,73.8272,16.1728,99.9908
1603,1604,2272,1189,4512,198.527,65.7616,24.2384,99.4882
1604,1605,5392,1382,4535,11.4386,9.93053,80.0695,99.945
1605,1606,9455,299,4545,21.8676,26.5449,63.4551,99.9718
1606,1607,18187,194,4580,197.936,16.6071,73.3929,99.9259
1607,1608,4902,400,4550,196.035,17.992,72.008,99.9063
1608,1609,564,3493,4521,9.28433,6.33562,83.6644,99.9278
1609,1610,1603,1868,4518,197.872,20.7331,69.2669,99.7224
1610,1611,2330,2178,4538,203.938,24.3174,65.6826,99.4239
1611,1612,2056,1238,4543,15.2264,60.7958,29.2042,99.9804
1612,1613,9466,578,4567,19.0865,48.9667,41.0333,99.8908
1613,1614,12413,2075,4588,19.2142,26.4105,63.5895,99.9439
1614,1615,917,2555,4543,203.554,7.36429,82.6357,99.9157
1615,1616,21485,1429,4599,195.061,62.304,27.696,99.4568
1616,1617,8420,2572,4604,209.911,14.8983,75.1017,99.9837
1617,1618,4099,479,4606,19.73,58.7306,31.2694,99.8736
1618,1619,3808,2232,4583,131.255,78.6269,11.3731,99.8805
1619,1620,32231,958,4689,20.4165,9.38293,80.6171,97.0231
1620,1621,12209,1704,4627,207.22,14.2146,75.7854,99.9587
1621,1622,33010,2686,4666,11.9913,56.7402,33.2598,99.9796
1622,1623,20491,405,4677,200.909,11.7255,78.2745,98.5404
1623,1624,4065,1214,4607,180.806,64.6925,25.3075,99.9244
1624,1625,1163,1027,4600,186.652,44.4419,45.5581,99.9708
1625,1626,886,288,4601,190.825,21.1363,68.8637,99.9984
1626,1627,792,128,4607,207.502,28.0091,61.9909,99.8844
1627,1628,1117,2805,4608,15.7547,26.4552,63.5448,99.5633
1628,1629,7356,2150,4643,26.369,57.4333,32.5667,99.9315
1629,1630,1049,3115,4615,19.348,88.4135,1.58653,99.9879
1630,1631,22584,574,4677,197.046,10.9402,79.0598,99.5329
1631,1632,12377,1112,4650,191.029,10.8784,79.1216,99.9939
1632,1633,733,1787,4633,74.6993,82.5817,7.41825,99.9883
1633,1634,2001,142,4642,199.748,20.796,69.204,99.8889
1634,1635,2184,1402,4647,191.264,63.4088,26.5912,99.9384
1635,1636,588,1445,4634,189.36,22.5072,67.4928,99.994
1636,1637,3090,1977,4641,75.8284,80.5996,9.40042,99.993
1637,1638,1668,3254,4635,193.944,58.4598,31.5402,99.9918
1638,1639,23440,1283,4709,197.812,4.92238,85.0776,99.7507
1639,1640,757,296,4643,27.3829,29.6139,60.3861,99.9888
1640,1641,7100,1495,4691,195.855,4.94181,85.0582,99.9644
1641,1642,4482,3250,4693,193.361,6.90775,83.0923,99.8988
1642,1643,1824,1588,4664,207.499,16.3154,73.6846,99.9982
1643,1644,1640,3313,4674,20.5975,24.8237,65.1763,99.9574
1644,1645,3372,2064,4675,200.168,10.0538,79.9462,99.9751
1645,1646,1038,1845,4666,90.9769,86.4448,3.55515,99.9486
1646,1647,1252,3367,4663,193.2,0.342468,89.6575,99.9974
1647,1648,7763,1932,4737,100.156,81.6828,8.31724,99.5951
1648,1649,10805,1798,4706,193.89,4.66386,85.3361,99.9692
1649,1650,5139,294,4703,35.584,53.9993,36.0007,99.993
1650,1651,765,320,4671,196.83,40.2703,49.7297,99.9949
1651,1652,2323,1639,4689,59.0868,74.751,15.249,99.9705
1652,1653,595,3022,4667,160.946,76.7825,13.2175,99.96
1653,1654,1035,3046,4684,294.827,87.3125,2.68752,99.8937
1654,1655,6158,205,4704,16.0758,59.9441,30.0559,99.8427
1655,1656,4792,133,4733,188.004,47.7198,42.2802,99.6263
1656,1657,520,1947,4686,170.477,82.4762,7.52376,99.8715
1657,1658,1207,1988,4685,17.0088,26.8446,63.1554,99.9836
1658,1659,877,3380,4685,24.1765,4.51917,85.4808,99.6771
1659,1660,5648,2184,4731,185.763,28.8941,61.1059,99.9909
1660,1661,1009,3412,4704,196.899,23.5404,66.4596,69.835
1661,1662,12149,1527,4763,159.006,82.43799999999997,7.56203,99.8256
1662,1663,1224,2272,4695,199.699,7.164739999999999,82.8353,99.9862
1663,1664,1833,2232,4716,13.9254,57.0708,32.9292,99.9843
1664,1665,1003,2556,4707,71.8169,76.7167,13.2833,99.976
1665,1666,8915,706,4741,32.2306,41.8085,48.1915,99.7919
1666,1667,5653,3068,4722,207.702,47.5378,42.4622,99.9478
1667,1668,979,2893,4725,199.33,3.35136,86.6486,99.8004
1668,1669,617,3335,4709,4.38786,71.7603,18.2397,99.7704
1669,1670,1634,3282,4716,206.445,4.84255,85.1574,99.9932
1670,1671,6048,3135,4747,140.105,83.4555,6.54452,99.8058
1671,1672,1509,1138,4711,183.715,52.8208,37.1792,99.9514
1672,1673,2050,1699,4728,188.3,4.33261,85.6674,99.9971
1673,1674,7889,2071,4739,200.96400000000003,32.1347,57.8653,99.962
1674,1675,3031,1408,4744,195.35,26.8199,63.1801,88.3074
1675,1676,6058,1639,4769,129.97799999999998,84.2123,5.78769,99.9355
1676,1677,14294,2328,4776,181.193,51.262,38.738,99.9795
1677,1678,4195,2510,4765,179.137,52.7875,37.2125,99.9878
1678,1679,812,819,4740,20.2755,16.9962,73.0038,99.9888
1679,1680,3276,2986,4758,159.618,83.6257,6.37432,99.9485
1680,1681,11472,358,4787,195.324,46.3545,43.6455,99.5276
1681,1682,8830,2891,4790,18.2162,4.4912,85.5088,97.0568
1682,1683,8038,218,4780,25.2936,19.8132,70.1868,99.7858
1683,1684,1707,1986,4767,123.627,82.3924,7.60763,99.8652
1684,1685,1139,547,4757,36.2437,52.3484,37.6516,99.9973
1685,1686,5125,1810,4774,2.53556,7.97475,82.0252,99.9937
1686,1687,11836,2661,4802,52.9502,83.7523,6.2476699999999985,99.9346
1687,1688,8288,1736,4804,46.2109,76.1208,13.8792,99.8549
1688,1689,2725,2742,4770,190.71400000000003,19.5698,70.4302,99.9977
1689,1690,975,808,4774,191.487,59.4004,30.5996,99.9499
1690,1691,716,1163,4780,320.423,22.5515,67.4485,99.7574
1691,1692,3029,2561,4794,195.195,6.3167800000000005,83.6832,99.9888
1692,1693,4469,632,4792,196.524,30.115,59.885,99.3929
1693,1694,8095,2148,4801,20.2544,53.1469,36.8531,99.953
1694,1695,1977,529,4790,37.5108,54.6668,35.3332,99.9163
1695,1696,952,3251,4789,116.977,78.4689,11.5311,99.945
1696,1697,583,1130,4786,161.071,37.2525,52.7475,99.7785
1697,1698,2347,462,4809,202.25,36.5112,53.4888,99.7811
1698,1699,590,703,4787,23.5677,4.29626,85.7037,99.9285
1699,1700,1631,2782,4801,21.7575,40.9546,49.0454,99.9835
1700,1701,1772,2023,4807,169.356,80.4746,9.52541,99.8786
1701,1702,531,3332,4791,61.5184,15.239,74.76100000000002,98.7781
1702,1703,3056,1411,4804,191.436,37.8267,52.1733,99.6921
1703,1704,3838,2277,4838,165.90200000000004,76.9952,13.0048,99.9416
1704,1705,614,1200,4809,297.288,29.7368,60.2632,99.5105
1705,1706,1411,1029,4820,4.92264,3.78057,86.2194,99.5935
1706,1707,1379,142,4824,183.518,80.9017,9.09828,99.9089
1707,1708,777,997,4821,18.79,2.70578,87.2942,99.7987
1708,1709,1395,830,4814,284.201,88.4597,1.54028,99.5185
1709,1710,1164,3216,4822,222.539,0.220566,89.7794,99.2249
1710,1711,1219,2810,4826,203.124,6.958310000000001,83.0417,99.6687
1711,1712,761,3172,4818,326.315,3.15806,86.8419,99.3974
1712,1713,581,3090,4823,4.56711,2.74606,87.2539,99.8763
1713,1714,4089,2466,4841,102.392,83.5074,6.49256,99.8997
1714,1715,574,1566,4819,188.832,2.66692,87.3331,99.9598
1715,1716,775,966,4834,308.531,20.9277,69.0723,99.9272
1716,1717,1421,1851,4829,180.202,81.5469,8.45306,99.8942
1717,1718,543,2762,4836,9.72758,7.99131,82.0087,99.9638
1718,1719,542,1538,4851,56.5056,0.469986,89.53,99.8277
1719,1720,565,1434,4855,25.999,41.9493,48.0507,99.187
1720,1721,1406,2200,4857,200.012,26.5468,63.4532,99.7783
1721,1722,513,2890,4865,41.3752,17.9792,72.0208,99.669
1722,1723,640,2282,4908,255.683,37.9988,52.0012,99.9086
1723,1724,1352,2323,4913,251.223,66.5308,23.4692,99.6742
