,Grain No.,Size [Pixel],center x-coordinate,center y-coordinate,mean azimuth [degree],mean latitude [degree],mean colatitude [degree],Regelungsgrad [%]
0,1,1030,128,310,107.719,42.1092,47.8908,99.9697
1,2,1015,397,321,259.533,40.317,49.683,99.9755
2,3,13837,267,352,114.984,36.5393,53.4607,99.9579
3,4,35380,765,414,350.881,71.758,18.242,99.8455
4,5,1239,520,337,280.516,54.8901,35.1099,99.9501
5,6,2306,601,334,291.942,10.1673,79.8327,99.817
6,7,151650,1036,528,284.704,37.0914,52.9086,84.8378
7,8,2221,1250,344,119.027,35.6713,54.3287,99.8681
8,9,1897,1471,346,305.998,32.9469,57.0531,99.931
9,10,932,1358,342,144.813,46.0061,43.9939,99.9292
10,11,721,1823,354,263.052,57.1749,32.8251,99.9599
11,12,4019,1412,375,292.032,10.6545,79.3455,99.9909
12,13,76629,1746,513,292.4890000000001,2.33512,87.6649,89.9311
13,14,3381,1518,388,311.615,55.426,34.574,98.2716
14,15,12251,1894,415,122.328,7.2542,82.7458,99.9471
15,16,17596,2060,421,113.605,8.1747,81.8253,99.902
16,17,841,3115,361,307.399,49.7363,40.2637,99.5445
17,18,11568,349,421,288.583,53.7354,36.2646,99.906
18,19,1443,2289,365,125.286,39.5086,50.4914,99.9017
19,20,1662,1953,377,92.2169,4.03753,85.9625,99.9918
20,21,922,506,369,285.633,54.6327,35.3673,99.8779
21,22,3377,1316,380,284.047,32.6557,57.3443,99.9878
22,23,603,2181,359,102.952,25.9842,64.0158,99.9346
23,24,3951,2333,389,295.251,27.8019,62.1981,99.926
24,25,4903,452,394,347.075,64.0893,25.9107,99.991
25,26,14037,2214,431,127.818,38.2195,51.7805,99.9329
26,27,1536,1785,385,121.647,9.59373,80.4063,99.9609
27,28,808,2869,370,308.884,13.0904,76.9096,99.9349
28,29,287032,476,742,128.856,53.9625,36.0375,88.2172
29,30,12280,2650,429,128.191,42.0731,47.9269,99.8665
30,31,35200,211,504,108.021,39.1384,50.8616,98.2725
31,32,3642,2740,382,259.801,31.7136,58.2864,99.9574
32,33,15050,2433,444,270.746,4.0148199999999985,85.9852,99.9758
33,34,2450,3158,418,124.184,31.5727,58.4273,99.9629
34,35,3432,2536,436,121.843,8.132810000000001,81.8672,99.9917
35,36,1186,1244,409,349.367,76.47,13.53,99.9972
36,37,2062,1765,419,140.67600000000002,63.2052,26.7948,99.9903
37,38,2125,2823,422,308.248,14.9523,75.0477,99.9049
38,39,16255,3055,508,275.221,73.7843,16.2157,99.3859
39,40,8814,1403,451,165.752,59.9986,30.0014,99.989
40,41,2201,3294,442,258.271,72.9704,17.0296,99.9608
41,42,2323,3343,473,245.852,71.5439,18.4561,99.8598
42,43,1206,3230,455,259.566,73.476,16.524,99.982
43,44,2849,2336,455,129.686,37.3325,52.6675,99.9842
44,45,1970,429,448,108.048,42.2968,47.7032,99.9824
45,46,902,99,448,110.59,38.0597,51.9403,99.9673
46,47,2586,1249,457,100.716,34.1467,55.8533,99.9627
47,48,885,2280,459,276.199,8.945160000000003,81.0548,99.9802
48,49,2239,1490,477,289.781,31.7288,58.2712,99.9315
49,50,5446,3145,493,257.577,73.3481,16.6519,99.9158
50,51,139457,2804,664,302.743,43.1461,46.8539,75.3256
51,52,9816,2548,519,120.807,37.0592,52.9408,99.7176
52,53,12821,2035,549,97.423,2.14616,87.8538,99.7849
53,54,22678,2258,569,286.851,19.6079,70.3921,55.6658
54,55,947,3231,527,258.175,73.4672,16.5328,99.9485
55,56,2850,1552,564,321.89,52.5363,37.4637,99.9156
56,57,112009,2461,806,278.365,28.2125,61.7875,96.3939
57,58,634,3339,573,298.889,72.6415,17.3585,99.3041
58,59,562,1428,561,275.279,54.9866,35.0134,99.9804
59,60,703,1380,575,274.10900000000004,55.1492,34.8508,99.9558
60,61,1161,1760,577,141.137,52.8596,37.1404,99.9906
61,62,7379,3111,632,112.651,32.0906,57.9094,99.9747
62,63,6352,2530,610,311.73,58.854,31.146,99.9788
63,64,45411,1809,747,296.971,30.9804,59.0196,99.9771
64,65,7139,3283,693,297.5370000000001,22.8519,67.1481,99.7652
65,66,2683,1507,630,295.157,31.3966,58.6034,99.9164
66,67,1091,3329,629,300.7390000000001,21.0298,68.9702,99.9196
67,68,647,1352,621,269.195,54.7619,35.2381,99.9595
68,69,19558,2053,684,99.2489,3.05232,86.9477,99.7532
69,70,926,2127,620,310.591,46.3213,43.6787,99.9841
70,71,1387,1309,640,302.032,14.2373,75.7627,99.9023
71,72,7382,1587,671,141.851,60.3245,29.6755,99.9642
72,73,8885,147,693,277.421,67.1731,22.8269,99.9877
73,74,528,3043,638,123.375,30.4734,59.5266,99.9115
74,75,672,1263,636,122.809,13.3297,76.6703,99.98
75,76,2077,1388,673,268.719,54.2849,35.7151,99.9761
76,77,540,2240,664,273.575,1.98637,88.0136,99.9654
77,78,3593,2171,698,310.084,48.8978,41.1022,99.9905
78,79,1014,2266,680,302.782,42.4064,47.5936,99.9686
79,80,17574,3077,765,117.297,8.98386,81.0161,99.9608
80,81,96782,1260,962,99.3302,22.7187,67.2813,99.9343
81,82,1281,3329,688,69.5768,66.9817,23.0183,99.906
82,83,695,1471,698,140.73,59.5657,30.4343,99.9737
83,84,680,1103,693,94.1134,8.2493,81.7507,99.9986
84,85,26325,1076,833,124.691,33.663000000000004,56.337,99.9901
85,86,27674,1574,808,143.62,59.1714,30.8286,99.9788
86,87,25158,887,776,148.514,58.1179,31.8821,99.9496
87,88,2620,1444,757,141.894,59.4295,30.5705,99.9916
88,89,1899,2273,752,296.23,30.4808,59.5192,99.9506
89,90,41272,2094,835,273.421,40.8802,49.1198,99.9257
90,91,537,1496,758,142.585,59.6682,30.3318,99.9259
91,92,2771,1470,808,142.031,59.1628,30.8372,99.9854
92,93,605,2230,781,273.088,40.9255,49.0745,99.9898
93,94,3584,1674,846,143.11700000000005,58.9267,31.0733,99.9924
94,95,18483,1346,874,150.471,53.5173,36.4827,99.9937
95,96,1021,3194,813,308.058,27.1072,62.8928,99.9332
96,97,4265,3275,859,310.512,26.3284,63.6716,99.9228
97,98,16900,3128,910,315.3540000000001,25.8009,64.1991,99.8195
98,99,21274,954,904,125.432,40.3066,49.6934,99.8902
99,100,26774,2804,883,208.215,69.0815,20.9185,99.9585
100,101,541,1442,845,142.208,59.0908,30.9092,99.968
101,102,3586,2652,851,306.899,19.2165,70.7835,99.9948
102,103,11340,1912,907,104.096,69.8914,20.1086,99.9575
103,104,1373,2974,881,118.355,6.13511,83.8649,99.9271
104,105,269303,1766,1303,299.53,17.2761,72.7239,84.3849
105,106,20860,2297,968,118.89,63.9122,26.0878,99.7321
106,107,3544,3297,943,305.205,26.2527,63.7473,99.6844
107,108,27353,3031,1029,56.6667,36.4552,53.5448,99.8059
108,109,5894,1448,983,141.83,59.4867,30.5133,99.9306
109,110,10625,2046,962,137.487,38.9454,51.0546,99.9869
110,111,4227,638,961,288.128,33.0503,56.9497,99.9879
111,112,5651,752,952,198.046,70.4974,19.5026,99.9975
112,113,2817,848,941,102.869,43.8007,46.1993,99.9892
113,114,24271,2867,1012,114.858,8.0021,81.9979,99.9786
114,115,3270,1037,970,116.999,36.0918,53.9082,99.9923
115,116,21050,2107,1037,279.325,25.4148,64.5852,99.8117
116,117,953,265,969,295.509,2.93931,87.0607,99.9842
117,118,12816,861,1030,99.3673,44.2413,45.7587,99.838
118,119,3550,2741,1012,117.325,56.2068,33.7932,99.2186
119,120,27498,760,1092,208.553,74.1538,15.8462,97.6483
120,121,7882,1091,1025,304.387,33.5081,56.4919,99.9841
121,122,21193,2434,1074,93.0584,65.0224,24.9776,98.8266
122,123,912,944,1023,92.393,20.3711,69.6289,99.9814
123,124,439814,2593,1680,304.778,23.1895,66.8105,78.8609
124,125,7658,2205,1071,293.131,18.9996,71.0004,99.9777
125,126,351734,830,1396,316.628,18.9703,71.0297,39.6103
126,127,6780,3146,1094,268.141,17.8265,72.1735,99.7557
127,128,10390,286,1109,275.252,33.8078,56.1922,99.9384
128,129,542,947,1051,109.549,40.4087,49.5913,99.9972
129,130,18514,1049,1131,304.673,59.282,30.718000000000004,99.6794
130,131,1057,2327,1072,91.8279,64.1925,25.8075,99.9643
131,132,9139,2266,1122,145.431,45.4522,44.5478,99.8888
132,133,1218,222,1075,143.09799999999996,55.1594,34.8406,99.9771
133,134,15619,1508,1130,301.901,21.2418,68.7582,99.9587
134,135,39900,864,1220,93.7109,19.0006,70.9994,99.9072
135,136,89314,2880,1215,289.111,27.641,62.359,99.8779
136,137,3347,2033,1124,298.577,18.5632,71.4368,99.9939
137,138,20057,1180,1198,132.496,39.7962,50.2038,99.9926
138,139,19484,192,1232,141.316,68.5055,21.4945,99.9802
139,140,5205,1387,1173,303.089,9.97875,80.0212,99.9929
140,141,972,3083,1146,335.966,60.2632,29.7368,99.9934
141,142,15341,2029,1190,66.6682,80.9743,9.02575,99.7127
142,143,5633,322,1194,305.9890000000001,2.53559,87.4644,99.9915
143,144,1414,2346,1155,297.815,66.0166,23.9834,99.9963
144,145,569,2193,1157,301.654,64.8903,25.1097,99.9981
145,146,22724,3144,1271,291.652,51.3256,38.6744,99.9699
146,147,4546,2257,1217,294.7340000000001,67.4049,22.5951,99.9267
147,148,11406,1469,1239,108.783,7.885439999999999,82.1146,87.6726
148,149,6034,2386,1217,295.161,2.84222,87.1578,99.9944
149,150,19143,2489,1341,122.223,1.69039,88.3096,97.7844
150,151,2288,2322,1199,146.895,45.118,44.882,99.9938
151,152,3592,2189,1205,294.455,18.3073,71.6927,99.997
152,153,1041,2049,1204,298.561,20.3243,69.6757,99.9384
153,154,1598,270,1215,137.215,25.4851,64.5149,99.9619
154,155,598,104,1214,131.619,73.2842,16.7158,99.9629
155,156,674,244,1214,143.833,24.2155,65.7845,99.7842
156,157,6989,1629,1252,116.051,33.2907,56.7093,99.9919
157,158,16343,941,1324,304.391,22.7175,67.2825,99.9894
158,159,9019,1566,1286,128.69899999999998,71.089,18.911,99.9395
159,160,1957,2025,1244,143.109,40.838,49.162,99.9869
160,161,8151,2090,1272,293.938,69.0943,20.9057,99.9921
161,162,67165,2335,1434,300.37,0.6069180000000001,89.3931,84.8002
162,163,1065,1295,1264,305.029,11.7785,78.2215,99.9898
163,164,6352,2212,1302,297.046,43.7505,46.2495,99.9585
164,165,20615,1410,1360,297.418,35.4705,54.5295,99.661
165,166,2388,295,1285,110.493,60.2472,29.7528,99.9893
166,167,3991,2136,1309,141.118,42.1401,47.8599,99.9974
167,168,738,116,1331,128.113,74.7058,15.2942,99.9191
168,169,85905,305,1495,122.102,19.5049,70.4951,98.6123
169,170,5942,806,1346,298.418,67.7897,22.2103,99.974
170,171,1549,1527,1332,294.73,14.4846,75.5154,99.9666
171,172,29631,2056,1432,116.677,4.37809,85.6219,99.9848
172,173,2311,2226,1379,119.564,19.7684,70.2316,99.9956
173,174,11310,1548,1407,111.439,7.331469999999999,82.6685,99.989
174,175,6870,1947,1415,114.385,23.5116,66.4884,99.9671
175,176,1860,2180,1384,313.624,46.2285,43.7715,99.9961
176,177,2836,1351,1411,98.5072,22.9513,67.0487,99.9865
177,178,1201,3019,1405,197.557,70.2927,19.7073,99.9961
178,179,562,3187,1399,116.972,50.8535,39.1465,99.9388
179,180,667,1892,1403,311.278,42.922,47.078,99.9707
180,181,1071,3043,1446,66.9922,16.8745,73.1255,99.9679
181,182,749,3282,1411,112.346,51.7784,38.2216,99.9426
182,183,4310,2357,1445,134.018,23.1457,66.8543,99.9968
183,184,648,1865,1437,309.3540000000001,41.6028,48.3972,99.9623
184,185,5628,1925,1490,308.17,44.4762,45.5238,99.8713
185,186,795,3218,1435,296.691,24.2894,65.7106,99.9489
186,187,1339,3266,1483,112.191,51.3944,38.6056,99.9517
187,188,4799,1485,1536,111.977,4.622719999999998,85.3773,99.8307
188,189,17360,2150,1576,147.42700000000005,74.5872,15.4128,99.7031
189,190,42560,569,1666,283.302,45.4516,44.5484,99.8913
190,191,1915,1414,1557,137.303,16.6915,73.3085,99.9946
191,192,2292,1918,1587,299.816,12.6343,77.3657,99.994
192,193,5129,1981,1605,298.153,63.4198,26.5802,99.96
193,194,1848,2439,1608,148.861,74.1725,15.8275,99.9783
194,195,27252,2336,1645,303.369,73.7368,16.2632,99.9638
195,196,11763,185,1668,111.329,24.0241,65.9759,99.9239
196,197,11595,3168,1656,118.043,51.7065,38.2935,99.8659
197,198,271980,1495,1864,311.898,50.154,39.846,99.7904
198,199,170880,849,1995,297.661,38.0101,51.9899,73.6821
199,200,60881,418,1796,300.664,2.76286,87.2371,85.2423
200,201,596,2176,1596,310.186,46.4723,43.5277,99.9581
201,202,604,3036,1603,304.995,25.3104,64.6896,99.9799
202,203,1791,3250,1644,112.464,52.8267,37.1733,99.9503
203,204,4283,3098,1624,150.877,67.9022,22.0978,99.9962
204,205,128843,2918,2008,303.382,19.9241,70.0759,99.5935
205,206,1124,1268,1630,102.139,66.9836,23.0164,99.994
206,207,13837,2182,1704,300.373,27.6496,62.3504,99.9827
207,208,6207,2075,1664,117.487,8.578389999999999,81.4216,99.9976
208,209,886,705,1639,135.132,22.1275,67.8725,99.9838
209,210,5084,711,1687,153.52700000000004,64.1292,25.8708,99.9935
210,211,599,448,1671,119.274,7.925960000000001,82.074,99.9959
211,212,10871,1779,1732,300.708,26.0221,63.9779,99.9943
212,213,2963,2920,1697,140.71200000000002,67.3926,22.6074,99.9898
213,214,4164,2043,1718,301.326,66.9166,23.0834,99.9955
214,215,2657,2563,1713,117.743,10.9996,79.0004,99.9939
215,216,11694,818,1756,296.012,19.2952,70.7048,99.9978
216,217,29897,163,1840,124.916,58.2862,31.7138,99.3627
217,218,778,725,1731,278.877,44.8389,45.1611,99.9758
218,219,757,2092,1739,311.2940000000001,45.5246,44.4754,99.9631
219,220,9867,2920,1770,276.41200000000003,58.4773,31.5227,99.9193
220,221,30957,2694,1866,157.144,63.5446,26.4554,99.9292
221,222,13976,1122,1795,105.447,63.8148,26.1852,99.9862
222,223,14552,733,1818,99.5906,37.3157,52.6843,99.9941
223,224,9679,2377,1813,109.707,19.0912,70.9088,99.9297
224,225,6837,3146,1783,278.741,57.7807,32.2193,99.9829
225,226,12974,2805,1810,135.086,61.7349,28.2651,99.9877
226,227,1040,2048,1765,302.572,28.466,61.534,99.9963
227,228,5595,2125,1787,292.123,76.0163,13.9837,99.9958
228,229,2895,334,1825,126.753,2.91209,87.0879,99.9685
229,230,14791,1896,1866,269.459,65.0486,24.9514,99.9735
230,231,158076,1999,2128,300.593,23.8784,66.1216,94.5607
231,232,16299,588,1920,240.819,66.3156,23.6844,99.9837
232,233,6325,3133,1888,95.2685,38.146,51.854,99.9763
233,234,10294,672,1911,272.413,46.7295,43.2705,99.9938
234,235,18747,279,1924,119.492,3.5260199999999995,86.47399999999998,99.9156
235,236,8546,3070,1931,139.87,61.0265,28.9735,99.9737
236,237,4853,1136,1892,284.097,50.0183,39.9817,99.9856
237,238,36557,1092,2038,94.0144,39.0964,50.9036,99.7762
238,239,2094,2942,1952,143.399,64.9828,25.0172,99.9945
239,240,58952,199,2123,114.519,10.1121,79.8879,83.7232
240,241,12585,370,2036,298.677,11.7849,78.2151,99.8471
241,242,18566,547,2041,129.35399999999998,1.21629,88.7837,99.9068
242,243,63009,2649,2158,303.561,9.2356,80.7644,99.9433
243,244,948,3117,2006,108.349,40.1889,49.8111,99.9929
244,245,1537,3144,2049,102.453,33.7241,56.2759,99.7867
245,246,14680,1463,2094,296.763,43.2528,46.7472,99.8995
246,247,67163,1290,2221,302.991,21.0993,68.9007,99.8625
247,248,1355,2769,2080,132.967,59.5773,30.4227,99.9959
248,249,79790,2981,2328,292.918,9.10172,80.8983,98.3423
249,250,1083,671,2094,289.808,51.0508,38.9492,99.9934
250,251,520,1393,2095,93.5076,33.9946,56.0054,99.9946
251,252,1998,1320,2110,94.6824,34.428000000000004,55.572,99.9813
252,253,552239,1227,2548,300.626,26.0974,63.9026,88.5062
253,254,54992,388,2262,298.921,14.9035,75.0965,99.9745
254,255,2286,3137,2134,137.539,23.0752,66.9248,99.8629
255,256,11457,2544,2181,141.105,58.014,31.986,99.9621
256,257,5754,1876,2151,310.725,15.4373,74.5627,99.9947
257,258,3329,1376,2158,94.9326,27.5258,62.4742,99.9914
258,259,5752,1728,2162,282.288,59.7215,30.2785,99.9855
259,260,750,535,2151,287.532,54.115,35.885,99.9927
260,261,887,1336,2173,63.3192,82.7454,7.25455,99.9955
261,262,1389,3171,2184,123.975,27.3481,62.6519,99.73
262,263,3180,3119,2203,100.203,35.1984,54.8016,99.9845
263,264,1804,3241,2207,122.452,27.883000000000006,62.117,99.9435
264,265,1884,119,2198,297.862,66.6445,23.3555,99.8938
265,266,4710,1304,2221,297.492,38.2638,51.7362,99.9952
266,267,3937,1023,2235,249.707,67.1932,22.8068,99.9026
267,268,1285,508,2234,287.967,55.9404,34.0596,99.9918
268,269,7028,3137,2314,106.625,43.3511,46.6489,99.9683
269,270,2859,144,2257,140.499,70.2728,19.7272,99.8973
270,271,1934,3070,2245,298.166,21.1052,68.8948,99.9912
271,272,3152,2224,2261,266.887,72.7942,17.2058,99.992
272,273,5315,2510,2280,127.405,7.32665,82.6733,99.9941
273,274,22937,1791,2379,309.765,11.4773,78.5227,99.8637
274,275,5708,1707,2297,132.713,8.56425,81.4357,99.9639
275,276,27597,672,2357,92.9096,28.0778,61.9222,99.9889
276,277,1468,2571,2286,293.724,34.6113,55.3887,99.9972
277,278,5154,193,2303,296.887,11.7838,78.2162,99.9819
278,279,44749,543,2451,118.045,14.8621,75.1379,99.9321
279,280,205244,2255,2602,303.545,20.1954,69.8046,94.1429
280,281,7885,1904,2355,276.831,3.47645,86.5236,99.9868
281,282,2034,76,2377,63.3465,77.9172,12.0828,99.9642
282,283,15926,203,2385,299.798,1.27947,88.7205,99.8945
283,284,508,1118,2333,297.761,45.7435,44.2565,99.9911
284,285,1171,2358,2347,300.23,15.5009,74.4991,99.9734
285,286,922,3247,2342,99.3344,45.2623,44.7377,99.9822
286,287,599,112,2341,55.3917,77.857,12.143,99.9607
287,288,700,1422,2341,299.173,21.69,68.31,99.9212
288,289,1291,2753,2349,294.175,2.5790900000000003,87.4209,99.9915
289,290,6111,3254,2423,303.253,13.9477,76.0523,99.9292
290,291,2819,2761,2398,306.93,21.106,68.89399999999999,99.9595
291,292,2619,2300,2402,142.852,55.6375,34.3625,99.9944
292,293,14719,1959,2444,302.8040000000001,19.481,70.51899999999998,99.9744
293,294,2424,2353,2400,125.773,39.3944,50.6056,99.9921
294,295,821,2611,2390,289.712,73.7524,16.2476,99.9939
295,296,1900,431,2425,120.557,0.987152,89.0128,99.9858
296,297,129226,2820,2591,116.062,30.2725,59.7275,93.2291
297,298,8727,3129,2492,138.292,27.0758,62.9242,99.8953
298,299,529,1851,2444,292.094,36.9865,53.0135,99.9774
299,300,36057,195,2558,59.2638,75.2238,14.7762,99.8734
300,301,2064,2075,2464,329.57,55.7009,34.2991,99.9982
301,302,1845,286,2474,126.756,41.6663,48.3337,99.9548
302,303,1337,341,2457,108.088,30.8984,59.1016,99.9799
303,304,2816,1859,2494,279.181,0.798615,89.2014,99.9859
304,305,7193,375,2503,118.018,17.5196,72.4804,99.985
305,306,3702,614,2509,130.959,71.3949,18.6051,99.6905
306,307,115228,298,2726,122.001,1.64153,88.3585,99.4629
307,308,2022,2048,2500,106.331,19.0158,70.9842,99.9858
308,309,1107,107,2503,70.2866,76.3251,13.6749,99.9178
309,310,19155,1989,2572,266.969,75.5241,14.4759,99.5802
310,311,503,85,2529,43.4915,78.0301,11.9699,99.9352
311,312,5792,3104,2622,299.238,39.5773,50.4227,99.9946
312,313,14680,1898,2667,297.469,16.6706,73.3294,99.9674
313,314,6164,2191,2611,119.902,21.332,68.668,99.9959
314,315,793,3169,2626,281.244,37.6732,52.3268,99.9723
315,316,1039,3224,2622,280.883,37.3757,52.6243,99.9713
316,317,1837,2585,2649,125.478,51.1524,38.8476,99.9823
317,318,15127,2638,2725,303.986,40.978,49.022,99.9625
318,319,15069,3084,2776,285.607,37.6266,52.3734,99.9723
319,320,1858,2188,2677,305.143,15.5154,74.4846,98.8488
320,321,2510,2008,2690,309.057,48.6001,41.3999,99.962
321,322,1760,3240,2716,280.687,37.519,52.481,99.9788
322,323,10172,2505,2731,120.543,20.5781,69.4219,99.9181
323,324,13212,2240,2747,119.818,21.1044,68.8956,99.9931
324,325,10890,534,2764,289.74,16.2895,73.7105,99.9795
325,326,12347,2382,2773,133.342,51.6104,38.3896,99.9823
326,327,112541,1441,2980,156.382,57.401,32.599000000000004,99.916
327,328,12563,1872,2778,112.66,36.0661,53.9339,99.9908
328,329,2307,783,2750,299.825,22.1539,67.8461,99.9986
329,330,8426,2820,2774,303.564,43.3329,46.6671,99.9852
330,331,15865,655,2827,134.034,66.3717,23.6283,99.9834
331,332,38365,851,2864,261.266,83.0867,6.9133,99.9616
332,333,116947,2836,2987,116.729,5.48413,84.5159,80.1701
333,334,21464,1756,2856,147.526,49.0278,40.9722,99.9836
334,335,6898,2555,2811,302.017,47.6107,42.3893,99.9939
335,336,2772,722,2795,134.502,42.2817,47.7183,99.9958
336,337,1371,420,2804,275.206,41.1306,48.8694,99.988
337,338,9316,459,2862,297.325,27.9665,62.0335,99.9168
338,339,47339,2389,2936,119.411,21.5228,68.4772,99.8964
339,340,4106,2789,2845,297.002,46.0512,43.9488,99.9892
340,341,2813,2299,2837,134.356,51.382,38.618,99.9907
341,342,839,482,2840,284.815,42.4016,47.5984,99.9782
342,343,10671,1267,2876,147.48,44.4096,45.5904,99.9878
343,344,3079,554,2875,283.809,37.0489,52.9511,99.9934
344,345,24332,294,2958,136.115,29.6168,60.3832,99.9827
345,346,1384,2038,2875,121.958,46.8396,43.1604,99.97
346,347,9473,1153,2916,124.204,8.45071,81.5493,99.9933
347,348,1957,2728,2897,299.29,23.8581,66.1419,99.9928
348,349,1151,3055,2881,120.004,12.2396,77.7604,99.9891
349,350,6561,632,2914,137.947,41.0021,48.9979,99.992
350,351,8058,1058,2932,142.127,64.2964,25.7036,99.9867
351,352,2067,521,2915,312.219,11.7969,78.2031,99.9917
352,353,579,3093,2907,273.341,73.7058,16.2942,99.9935
353,354,31686,1993,2987,332.796,72.982,17.018,53.5581
354,355,5820,1694,2955,264.405,1.7798900000000002,88.2201,99.9861
355,356,9050,380,2988,128.66899999999998,66.884,23.116,99.7503
356,357,6501,1618,2967,276.10900000000004,10.4699,79.5301,99.9935
357,358,3282,119,2945,130.251,32.9919,57.0081,99.4138
358,359,34700,97,3194,292.778,31.2462,58.7538,99.2421
359,360,3094,987,2956,131.591,7.507510000000001,82.4925,99.9852
360,361,6720,2200,2964,86.0143,76.9879,13.0121,99.9947
361,362,3389,1467,2971,300.564,36.0125,53.9875,99.9781
362,363,723,3105,2943,290.176,49.2332,40.7668,99.9866
363,364,13375,2538,3010,137.773,51.2334,38.7666,99.7308
364,365,700,1818,2958,149.782,50.2647,39.7353,99.8956
365,366,6727,535,2974,121.652,13.3139,76.6861,99.991
366,367,366525,726,3275,296.738,20.9055,69.0945,97.9391
367,368,6143,656,2976,138.493,67.2023,22.7977,99.9738
368,369,2142,1794,2984,274.116,9.41216,80.5878,99.9896
369,370,971,88,2972,122.189,35.6514,54.3486,99.7222
370,371,4413,3097,3039,293.845,17.3762,72.6238,99.9662
371,372,26274,1201,3102,129.675,7.0144600000000015,82.9855,99.9735
372,373,20036,3042,3131,312.113,18.7341,71.2659,99.6918
373,374,2433,1072,3001,132.096,59.3413,30.6587,99.8169
374,375,100698,1929,3197,112.524,31.4061,58.5939,40.5224
375,376,1244,1110,3023,314.01,36.484,53.51600000000001,99.9849
376,377,2980,989,3048,157.827,77.4691,12.5309,99.7664
377,378,19853,2372,3090,307.272,50.9931,39.0069,99.6549
378,379,8266,1054,3076,129.859,6.791760000000001,83.2082,99.9884
379,380,3305,2143,3050,114.976,51.6258,38.3742,99.6497
380,381,8679,1651,3080,273.811,5.66719,84.3328,99.9604
381,382,16376,2719,3136,123.242,53.4041,36.5959,99.8639
382,383,23231,176,3149,100.845,26.6744,63.3256,99.972
383,384,1563,2208,3063,302.446,28.5,61.5,99.8542
384,385,507,3274,3059,136.575,56.9619,33.0381,99.9128
385,386,1870,1121,3087,138.04,79.7909,10.2091,99.9952
386,387,787,3151,3078,287.531,18.067,71.933,99.9641
387,388,746,3243,3074,135.317,57.8127,32.1873,99.9636
388,389,5131,356,3101,286.948,52.0656,37.9344,99.9929
389,390,4636,1944,3099,307.9770000000001,20.0957,69.9043,99.9565
390,391,62146,2608,3239,26.2894,80.6811,9.31886,99.8836
391,392,70572,2351,3269,118.996,46.0889,43.9111,99.9175
392,393,601,289,3115,297.497,33.0498,56.9502,99.7097
393,394,6614,2226,3153,312.4890000000001,51.6496,38.3504,99.9968
394,395,13869,1677,3193,87.4943,8.25564,81.7444,99.9888
395,396,6953,310,3216,134.66299999999998,33.1541,56.8459,99.9346
396,397,6825,1573,3187,147.934,55.8406,34.1594,99.9476
397,398,4694,237,3206,275.487,38.9279,51.0721,99.9617
398,399,3822,1135,3190,126.52,9.8822,80.1178,99.944
399,400,6041,940,3188,159.489,84.804,5.19599,99.9636
400,401,15434,654,3288,264.453,62.3504,27.6496,99.8943
401,402,702,1331,3185,290.684,6.824839999999999,83.1752,99.9906
402,403,1344,1509,3196,131.20600000000002,40.7515,49.2485,99.9933
403,404,1140,578,3212,134.39700000000002,38.3822,51.6178,99.9964
404,405,25132,1377,3297,131.181,7.31522,82.6848,99.9891
405,406,100823,2943,3424,123.948,34.8763,55.1237,99.1263
406,407,4442,937,3259,120.454,38.1397,51.8603,99.9472
407,408,522,1755,3241,89.9307,67.7049,22.2951,99.9967
408,409,2666,1546,3250,68.7071,72.0527,17.9473,99.9311
409,410,1281,877,3255,158.045,84.1842,5.81585,99.9961
410,411,22965,2104,3353,299.987,42.0111,47.9889,99.9877
411,412,111114,1626,3469,72.6213,56.0054,33.9946,61.6072
412,413,6173,1709,3303,276.841,57.9757,32.0243,99.9955
413,414,10513,1797,3327,111.978,18.6488,71.3512,99.9917
414,415,880,3270,3308,118.867,39.2891,50.7109,99.8313
415,416,716,159,3293,294.638,13.0605,76.9395,99.9986
416,417,686,666,3308,299.933,27.1267,62.8733,99.9828
417,418,16049,2244,3427,299.576,41.8081,48.1919,99.6528
418,419,1827,2025,3358,110.076,37.3346,52.6654,99.3135
419,420,1785,611,3373,270.177,60.5495,29.4505,99.9899
420,421,5907,158,3399,261.433,56.9825,33.0175,99.9945
421,422,5288,2705,3403,300.282,29.3113,60.6887,99.9404
422,423,4683,1842,3408,270.438,61.3384,28.6616,99.991
423,424,58863,200,3584,2.36476,62.1462,27.8538,99.9961
424,425,129724,2460,3599,306.106,13.6516,76.3484,96.8245
425,426,687,1007,3396,126.148,37.4881,52.5119,99.9925
426,427,330639,1230,3778,137.64700000000002,31.2761,58.7239,97.385
427,428,1409,2023,3414,300.946,25.2529,64.7471,99.9848
428,429,8432,1402,3462,129.428,28.9129,61.0871,99.8608
429,430,679,1980,3429,300.543,42.5134,47.4866,99.9862
430,431,1063,3052,3469,124.06,30.1594,59.8406,99.9671
431,432,18858,2055,3526,300.652,42.1712,47.8288,99.9739
432,433,48177,1872,3650,89.8166,13.6672,76.3328,99.8785
433,434,5222,102,3482,293.6040000000001,15.6889,74.3111,99.5632
434,435,45372,2747,3592,290.357,5.19992,84.8001,99.8757
435,436,1326,876,3469,293.191,24.9363,65.0637,99.99
436,437,2437,3233,3517,299.327,14.2744,75.7256,99.9482
437,438,2889,2667,3495,300.228,26.0013,63.9987,99.9883
438,439,2892,2152,3495,286.019,20.5353,69.4647,99.9904
439,440,161411,428,3768,284.716,31.0296,58.9704,99.8651
440,441,766,3261,3497,300.041,14.9022,75.0978,99.9047
441,442,28002,792,3629,287.932,22.2632,67.7368,99.9748
442,443,1076,67,3548,114.875,26.8423,63.1577,99.8715
443,444,1182,3201,3568,296.622,14.0131,75.9869,99.9489
444,445,10056,1512,3607,126.39,37.1131,52.8869,99.9752
445,446,4899,2205,3628,126.824,17.2809,72.7191,99.9891
446,447,623,2868,3576,290.345,34.6317,55.3683,99.9959
447,448,1018,3252,3602,131.477,27.9897,62.0103,99.9028
448,449,3907,594,3623,293.038,31.3139,58.6861,99.9974
449,450,8608,56,3673,281.644,6.12312,83.8769,99.8624
450,451,50391,2188,3745,114.883,1.99558,88.0044,99.9235
451,452,1469,3219,3617,128.946,28.4597,61.5403,99.9559
452,453,5354,2009,3634,282.383,60.1684,29.8316,99.9732
453,454,5104,1710,3668,300.767,16.226,73.774,99.9732
454,455,521,3258,3649,131.186,28.5115,61.4885,99.9077
455,456,44047,2943,3787,284.87,21.9611,68.0389,99.6053
456,457,3374,641,3691,293.945,80.8576,9.14243,99.9693
457,458,12334,566,3728,297.5440000000001,0.7671359999999999,89.2329,99.9993
458,459,7072,712,3738,153.62,75.2776,14.7224,99.7388
459,460,7367,1507,3700,300.015,8.84572,81.1543,99.9975
460,461,1877,3230,3695,130.583,27.5774,62.4226,99.9631
461,462,838,2615,3690,106.169,59.7422,30.2578,99.9921
462,463,558,3110,3685,125.494,29.3855,60.6145,99.9569
463,464,3539,2006,3708,297.573,38.3274,51.6726,99.9904
464,465,20377,1752,3803,123.887,51.6817,38.3183,99.979
465,466,16803,2721,3750,315.564,54.2167,35.7833,99.9702
466,467,16707,872,3769,125.711,34.1793,55.8207,99.8274
467,468,715,3170,3728,287.209,24.8633,65.1367,99.9845
468,469,44834,2004,3876,116.603,2.48291,87.5171,99.9089
469,470,6399,1635,3777,129.667,49.4154,40.5846,99.9881
470,471,15935,3105,3875,288.373,25.0095,64.9905,99.8554
471,472,1361,3239,3780,287.423,24.9365,65.0635,99.9793
472,473,6010,2406,3851,110.442,2.1664,87.8336,99.9523
473,474,13331,2330,3820,102.417,28.2039,61.7961,99.9725
474,475,1348,2064,3779,308.34,51.6129,38.3871,99.9967
475,476,12028,1023,3840,276.04900000000004,2.19889,87.8011,99.9847
476,477,4184,2635,3829,317.512,56.604,33.396,99.9656
477,478,2673,69,3820,336.21,59.2735,30.7265,99.6939
478,479,19023,2759,3873,305.136,42.9278,47.0722,99.9586
479,480,1373,3254,3841,288.634,26.2791,63.7209,99.7925
480,481,932,121,3819,283.338,61.6817,28.3183,99.9862
481,482,22939,862,3887,270.296,59.4406,30.5594,99.9077
482,483,8177,1707,3883,118.322,48.4911,41.5089,99.9932
483,484,26557,2185,3964,284.733,28.5133,61.4867,99.9488
484,485,2402,111,3874,131.343,41.9896,48.0104,99.9649
485,486,5306,3216,3930,286.184,25.2504,64.7496,99.9726
486,487,63061,2612,3997,116.191,4.37164,85.6284,97.0586
487,488,847,2555,3866,301.148,43.6974,46.3026,99.9861
488,489,706,739,3871,137.855,76.0019,13.9981,99.9958
489,490,502,64,3889,341.871,63.9399,26.0601,99.9149
490,491,24363,380,3976,164.041,74.7657,15.2343,98.9995
491,492,906,2880,3908,264.496,63.6942,26.3058,99.9847
492,493,29105,1701,3991,126.086,44.6035,45.3965,99.7156
493,494,13579,2871,3993,118.394,9.73445,80.2655,99.8144
494,495,5871,996,3946,111.774,16.6517,73.3483,99.9979
495,496,1094,1605,3932,122.961,46.6106,43.3894,99.9698
496,497,36400,131,4076,117.369,39.4064,50.5936,99.9082
497,498,657,161,3926,117.675,14.4012,75.5988,99.9912
498,499,1306,62,3942,117.436,44.7138,45.2862,99.6518
499,500,17628,757,4003,130.161,33.602,56.398,99.9687
500,501,30021,1896,4091,287.255,25.9462,64.0538,98.9463
501,502,4155,1681,3962,298.767,21.634,68.366,99.9976
502,503,8381,2988,3983,306.148,35.999,54.00100000000001,99.9547
503,504,2637,2333,3955,276.603,78.5488,11.4512,99.9948
504,505,595,1621,3950,108.526,48.8805,41.1195,99.7891
505,506,607,3170,3966,285.871,25.104,64.896,99.9801
506,507,1713,684,3959,138.882,61.7957,28.2043,99.9958
507,508,9231,2437,4030,306.111,78.5852,11.4148,99.3215
508,509,63799,799,4199,132.15,37.4956,52.5044,99.7512
509,510,870,1576,3972,55.7036,71.1856,18.8144,99.9977
510,511,9501,939,4034,292.26,47.512,42.488,99.8649
511,512,614,55,3990,283.099,14.5903,75.4097,99.8495
512,513,4797,652,4048,139.688,62.6714,27.3286,99.9184
513,514,1033,1151,3995,288.711,44.3516,45.6484,99.9858
514,515,2879,2328,4004,111.903,2.8386400000000003,87.1614,99.9451
515,516,13580,1967,4047,144.989,64.8653,25.1347,99.7515
516,517,5700,3042,4030,122.197,31.9039,58.0961,99.9029
517,518,10498,262,4046,294.141,10.0014,79.9986,99.9947
518,519,88809,474,4169,122.08,76.1821,13.8179,85.10600000000002
519,520,36402,2311,4118,117.096,9.09461,80.9054,99.9867
520,521,1548,573,4025,128.204,28.1986,61.8014,99.996
521,522,4145,3214,4090,296.545,11.7578,78.2422,99.9346
522,523,21982,1473,4139,286.918,41.7765,48.2235,99.8989
523,524,19688,1299,4098,304.12,78.0024,11.9976,99.9532
524,525,12418,2077,4110,307.454,29.2786,60.7214,99.9924
525,526,27961,1681,4153,295.534,22.9979,67.0021,99.9771
526,527,2348,1575,4076,130.423,52.664,37.336,99.9798
527,528,2852,2972,4086,275.385,63.2712,26.7288,99.9802
528,529,4980,2718,4122,126.737,48.2976,41.7024,99.8039
529,530,1355,1640,4076,131.361,46.9469,43.0531,99.9796
530,531,2251,3102,4092,111.278,2.52985,87.4701,99.8802
531,532,987,705,4081,132.889,55.2221,34.7779,99.9983
532,533,9543,2867,4108,117.086,56.3546,33.6454,99.9778
533,534,835,3155,4103,297.106,11.2492,78.7508,99.9635
534,535,1707,3025,4095,121.7,0.742645,89.2574,99.9969
535,536,707,2173,4119,114.132,0.187759,89.8122,99.9839
536,537,1937,2507,4136,137.487,35.8539,54.1461,99.9973
537,538,6025,2446,4173,115.662,3.46149,86.5385,99.8619
538,539,28935,2943,4198,301.243,17.8572,72.1428,99.7952
539,540,19792,2624,4197,132.425,40.9405,49.0595,99.9917
540,541,16643,201,4220,293.78,2.68877,87.3112,99.9984
541,542,45633,1828,4286,243.525,61.8327,28.1673,99.9566
542,543,706,1561,4148,304.732,9.21374,80.7863,99.995
543,544,1417,1378,4159,277.184,3.70599,86.294,99.9773
544,545,1533,2797,4175,303.281,18.5621,71.4379,99.9869
545,546,902,2026,4160,231.451,80.5269,9.47312,99.989
546,547,24360,1067,4270,291.627,76.1702,13.8298,99.8488
547,548,776,38,4172,113.846,40.4094,49.5906,99.9272
548,549,7545,2189,4183,234.366,78.9018,11.0982,99.9751
549,550,11337,1215,4208,304.881,6.932860000000002,83.0671,99.9942
550,551,43106,1430,4333,128.195,62.9792,27.0208,54.9104
551,552,4581,2508,4205,125.064,26.8343,63.1657,99.9964
552,553,15317,1581,4260,270.161,13.8593,76.1407,99.9844
553,554,529,2080,4184,109.69,3.14642,86.8536,99.9792
554,555,16315,2736,4267,122.667,11.3115,78.6885,99.8735
555,556,3203,2042,4218,109.856,3.24684,86.7532,99.9797
556,557,786,3011,4206,297.8590000000001,7.83953,82.1605,99.9943
557,558,117799,2090,4388,305.717,29.5676,60.4324,99.0165
558,559,5157,3039,4281,150.77700000000004,43.1486,46.8514,99.9881
559,560,14909,2426,4279,322.635,76.9423,13.0577,99.9339
560,561,10769,318,4271,286.097,51.2146,38.7854,99.9967
561,562,1908,3080,4263,146.69,46.6403,43.3597,99.9671
562,563,592,3200,4249,123.319,44.8311,45.1689,99.9607
563,564,9815,2556,4316,129.011,37.9533,52.0467,99.986
564,565,1531,2847,4263,119.934,12.7179,77.2821,99.9982
565,566,758,850,4261,283.141,50.3686,39.6314,99.9671
566,567,2897,101,4281,119.369,38.3895,51.6105,99.9977
567,568,17504,832,4329,351.247,67.4037,22.5963,99.9927
568,569,1827,1234,4281,276.963,76.4953,13.5047,99.9948
569,570,2970,2969,4295,148.921,45.4203,44.5797,99.9818
570,571,24080,519,4358,288.64,52.0919,37.9081,99.992
571,572,2539,3111,4338,115.907,29.6569,60.3431,99.9617
572,573,2079,1694,4286,153.31799999999996,61.3893,28.6107,99.9963
573,574,82862,168,4463,292.307,28.5373,61.4627,95.8382
574,575,18239,1222,4366,294.515,41.7764,48.2236,99.9846
575,576,9116,1350,4355,123.729,28.5058,61.4942,99.9911
576,577,728,2614,4297,124.75,25.8221,64.1779,99.9947
577,578,1841,631,4318,287.27,48.8751,41.1249,99.9786
578,579,5761,2864,4352,115.79,2.37006,87.6299,99.9923
579,580,59948,1625,4480,121.348,3.66009,86.3399,99.9663
580,581,7472,2750,4358,125.67,34.4292,55.5708,99.9885
581,582,704,2947,4323,148.40200000000004,46.1122,43.8878,99.965
582,583,2844,915,4369,282.7870000000001,52.1882,37.8118,99.8777
583,584,7440,998,4372,310.691,38.404,51.596,99.989
584,585,3660,2453,4352,306.874,30.9578,59.0422,99.942
585,586,6208,2676,4394,121.86,54.8229,35.1771,99.5089
586,587,25551,2986,4433,304.019,39.3874,50.6126,99.8583
587,588,1052,639,4362,299.015,61.5124,28.4876,99.9968
588,589,1292,1093,4360,308.768,37.8163,52.1837,99.9904
589,590,2799,117,4379,36.7509,81.3669,8.63315,99.9962
590,591,6652,413,4407,123.743,18.3953,71.6047,99.9586
591,592,3886,2373,4403,129.797,25.9738,64.0262,99.974
592,593,3016,1913,4398,294.073,41.9195,48.0805,99.749
593,594,3262,2603,4389,120.347,6.6520899999999985,83.3479,99.9975
594,595,527,3183,4374,116.235,29.2447,60.7553,99.9508
595,596,503,2715,4392,283.04,29.5362,60.4638,99.9264
596,597,2202,2845,4411,119.717,52.8802,37.1198,99.8519
597,598,2787,1061,4404,107.836,49.5811,40.4189,99.9965
598,599,2022,317,4409,294.46,19.258,70.742,99.9421
599,600,26467,2530,4475,319.541,74.7756,15.2244,99.5691
600,601,2948,2472,4403,262.885,54.0188,35.9812,99.99
601,602,1022,3174,4399,116.365,27.5787,62.4213,99.7474
602,603,1208,2405,4409,319.008,75.0221,14.9779,99.993
603,604,5678,1287,4435,284.269,41.6466,48.3534,99.9872
604,605,7034,615,4437,117.659,19.7742,70.2258,99.9932
605,606,62970,1139,4533,299.975,11.2268,78.7732,57.5517
606,607,27073,718,4487,295.629,61.895,28.105,99.2859
607,608,7064,2795,4455,280.692,29.8251,60.1749,99.9772
608,609,513,254,4416,284.629,20.3196,69.6804,99.9799
609,610,5445,962,4445,132.067,50.8203,39.1797,99.135
610,611,525,1386,4426,257.865,61.6309,28.3691,99.8701
611,612,8797,1744,4501,294.712,41.8559,48.1441,99.9042
612,613,3894,3134,4480,108.709,19.0462,70.9538,99.9391
613,614,13690,872,4516,133.782,30.0984,59.9016,99.9591
614,615,33985,2159,4542,299.6020000000001,79.7277,10.2723,71.1145
615,616,1212,2872,4458,299.262,40.5755,49.4245,99.9722
616,617,31713,475,4549,289.7870000000001,19.2105,70.7895,99.9214
617,618,78483,2527,4659,125.818,30.4885,59.5115,99.702
618,619,11039,2897,4540,117.746,49.83600000000001,40.164,99.3911
619,620,592,2712,4480,294.168,1.62236,88.3776,99.959
620,621,591,2115,4507,110.46,61.6429,28.3571,99.9912
621,622,3129,2791,4518,273.111,34.9923,55.0077,99.9356
622,623,15057,792,4597,308.532,39.0526,50.9474,99.9896
623,624,8415,3054,4566,125.364,69.2756,20.7244,99.3593
624,625,12224,1422,4571,280.751,62.8376,27.1624,99.792
625,626,8144,2927,4640,299.592,29.1148,60.8852,99.6151
626,627,5201,2286,4590,276.683,37.297,52.703,99.9935
627,628,1952,104,4575,295.822,35.6907,54.3093,99.9915
628,629,3833,2833,4590,2.11326,86.0061,3.99388,99.9415
629,630,6514,2761,4603,82.7571,71.7441,18.2559,99.9835
630,631,3102,2538,4584,312.039,31.3319,58.6681,99.9754
631,632,17818,327,4647,297.709,41.5361,48.4639,99.9928
632,633,1905,2486,4574,124.151,33.7379,56.2621,99.9922
633,634,30839,597,4672,293.207,31.2254,58.7746,99.9816
634,635,3130,1886,4601,287.8640000000001,36.2049,53.7951,99.9855
635,636,35507,2138,4670,302.551,46.6115,43.3885,99.979
636,637,594,293,4584,296.357,13.4174,76.5826,99.9943
637,638,10724,1269,4622,274.668,59.9095,30.0905,99.992
638,639,10409,1714,4640,288.749,13.7531,76.2469,99.9827
639,640,6000,1811,4611,28.6148,81.6849,8.31505,99.9935
640,641,894,142,4606,303.488,2.4414,87.5586,99.9612
641,642,729,1072,4627,293.147,21.8274,68.1726,99.9596
642,643,3519,234,4660,282.064,57.4148,32.5852,99.9527
643,644,62881,1465,4719,302.969,49.3704,40.6296,99.9496
644,645,2332,953,4647,296.3590000000001,60.8108,29.1892,99.9956
645,646,12187,3016,4691,139.122,47.1912,42.8088,99.8143
646,647,4235,96,4660,298.982,36.4095,53.5905,99.9894
647,648,1783,1002,4657,296.522,6.52881,83.4712,99.997
648,649,3564,2825,4671,302.9890000000001,40.5063,49.4937,99.7998
649,650,27739,758,4735,296.797,17.9076,72.0924,99.7734
650,651,22011,2693,4743,122.032,8.49268,81.5073,99.8529
651,652,9883,172,4699,291.258,58.5438,31.4562,99.9949
652,653,12311,908,4725,306.288,32.8545,57.1455,97.3194
653,654,21947,1132,4739,44.4721,61.92100000000001,28.079,99.8871
654,655,5629,1867,4695,137.54,72.3187,17.6813,99.9767
655,656,3705,1787,4691,102.318,17.6468,72.3532,99.9938
656,657,762,404,4679,294.262,10.8869,79.1131,99.9696
657,658,1716,471,4682,296.675,11.6777,78.3223,99.9835
658,659,539,8,4683,297.634,27.4951,62.5049,99.9626
659,660,6348,2293,4744,276.185,44.4286,45.5714,99.9437
660,661,2089,2259,4691,103.021,47.6445,42.3555,99.991
661,662,2238,1570,4694,280.348,62.9929,27.0071,99.9182
662,663,9138,1940,4741,157.797,75.8437,14.1563,97.2729
663,664,1839,1025,4716,41.3276,65.5648,24.4352,99.9717
664,665,9476,435,4738,299.831,17.0554,72.9446,99.6564
665,666,1565,989,4707,116.586,1.84914,88.1509,99.9758
666,667,7632,2821,4736,123.468,8.996310000000003,81.0037,99.9835
667,668,3116,2347,4720,97.8156,65.2789,24.7211,99.9912
668,669,2240,29,4721,98.4479,60.5702,29.4298,99.981
669,670,4442,89,4744,302.101,20.8434,69.1566,99.9186
670,671,2999,2957,4727,291.376,72.4831,17.5169,99.9821
671,672,4593,332,4769,117.973,2.29576,87.7042,99.9768
672,673,7066,2033,4769,299.603,37.8871,52.1129,99.9666
673,674,5680,2397,4771,93.7828,61.7312,28.2688,99.9212
674,675,7925,1795,4769,125.157,42.6947,47.3053,99.9823
675,676,4735,2903,4768,304.585,42.8101,47.1899,99.9425
676,677,3218,3116,4761,138.355,50.2798,39.7202,99.9526
677,678,5264,205,4771,305.066,21.4708,68.5292,99.9826
678,679,3366,2233,4775,120.547,37.61,52.39,99.9958
679,680,1998,1004,4772,297.6020000000001,14.7076,75.2924,99.9642
680,681,1127,531,4772,137.951,59.5543,30.4457,99.9644
681,682,1862,1226,4785,289.881,38.3125,51.6875,99.9952
682,683,3199,434,4802,296.022,20.2717,69.7283,98.5589
683,684,1531,266,4792,299.47,19.6551,70.3449,99.9791
684,685,568,2179,4781,125.073,35.3102,54.6898,99.6941
685,686,1690,969,4795,114.109,2.72493,87.2751,99.9939
686,687,960,1865,4796,297.046,38.2367,51.7633,99.9707
687,688,1773,2120,4792,123.295,13.1197,76.8803,99.9921
688,689,1073,2850,4791,302.749,43.1657,46.8343,99.9456
689,690,2571,1449,4803,302.37,50.0348,39.9652,99.9427
690,691,3549,3077,4806,143.28799999999995,46.4938,43.5062,99.7491
691,692,1672,572,4812,146.217,70.8391,19.1609,99.9647
692,693,1156,2368,4812,97.4816,62.0344,27.9656,99.9407
693,694,1688,2239,4819,116.276,33.9847,56.0153,99.4951
694,695,2110,2770,4839,123.9,5.76486,84.2351,99.6969
695,696,775,2292,4830,117.435,32.376,57.624,99.4243
