,Grain No.,Size [Pixel],center x-coordinate,center y-coordinate,mean azimuth [degree],mean latitude [degree],mean colatitude [degree],Regelungsgrad [%]
0,1,70567,492,280,143.186,27.1242,62.8758,37.5995
1,2,1250,729,121,312.582,3.5901300000000003,86.4099,99.4199
2,3,1970,863,121,103.909,17.0399,72.9601,98.3982
3,4,1138,686,155,310.395,12.2189,77.7811,99.6444
4,5,45929,1180,212,338.906,72.6818,17.3182,99.7955
5,6,520,1330,131,299.507,63.844,26.156,99.9804
6,7,561,1384,130,232.135,8.0054,81.9946,99.8093
7,8,2162,261,148,149.892,14.9857,75.0143,99.9409
8,9,6010,201,213,118.363,75.4823,14.5177,99.7376
9,10,9580,795,184,339.13,55.7885,34.2115,99.596
10,11,1247,956,145,338.30800000000005,71.7865,18.2135,99.5638
11,12,6772,1667,174,130.624,34.6065,55.3935,99.9604
12,13,879,1737,139,124.684,36.9945,53.0055,99.6608
13,14,7577,2071,183,112.905,67.1081,22.8919,99.8476
14,15,2026,2278,157,94.1883,67.5362,22.4638,99.6618
15,16,15796,2355,235,305.833,56.3153,33.6847,99.9467
16,17,29788,2503,252,47.3286,80.00399999999998,9.99601,99.744
17,18,1213,289,168,152.311,20.2001,69.7999,99.929
18,19,1447,1850,158,106.27,75.8252,14.1748,99.9502
19,20,937,328,164,326.841,8.159189999999999,81.8408,99.8973
20,21,5496,1462,177,334.413,8.73864,81.2614,99.209
21,22,127457,2820,309,54.985,80.4785,9.52153,99.8553
22,23,2595,3331,186,251.563,58.3786,31.6214,99.678
23,24,1025,3402,164,249.149,59.4954,30.5046,99.5741
24,25,1231,3444,178,245.948,54.0749,35.9251,99.6913
25,26,21718,645,257,310.21,13.3355,76.6645,99.9647
26,27,4246,3681,190,130.94,50.9526,39.0474,99.4252
27,28,90896,2023,322,162.577,23.2205,66.7795,91.7871
28,29,5388,919,207,322.33,3.86042,86.1396,99.9906
29,30,1693,1848,186,116.303,74.3656,15.6344,99.9869
30,31,3584,1358,199,336.061,8.79133,81.2087,99.9627
31,32,683,364,200,141.746,70.3098,19.6902,99.9552
32,33,604,329,187,322.688,7.13236,82.8676,99.9815
33,34,1039,2238,186,106.219,69.8575,20.1425,99.9436
34,35,9342,3559,266,332.112,0.558968,89.441,99.8141
35,36,136421,1597,382,338.971,51.149,38.851,99.9887
36,37,8131,1716,231,131.03799999999998,34.004,55.996,99.9908
37,38,26535,3161,300,146.023,6.92719,83.0728,99.8827
38,39,7189,993,259,329.367,54.734,35.266,99.9603
39,40,10102,2255,272,311.724,77.1165,12.8835,99.9755
40,41,829,3638,222,159.319,3.93484,86.0652,99.507
41,42,706,3364,216,240.586,55.4408,34.5592,99.9666
42,43,5115,1876,246,334.314,34.6056,55.3944,99.9943
43,44,1275,3320,219,242.328,56.7818,33.2182,99.9843
44,45,777,3677,247,149.894,28.8373,61.1627,99.6651
45,46,33883,3456,364,125.535,61.8845,28.1155,51.4575
46,47,59297,794,380,143.208,16.1709,73.8291,98.9788
47,48,887,3647,258,159.19,5.86745,84.1326,99.7467
48,49,3255,725,302,323.3540000000001,1.32658,88.6734,99.9379
49,50,2669,3651,298,334.473,2.7086,87.2914,99.6733
50,51,60899,1090,426,321.782,11.6404,78.3596,99.9014
51,52,4418,220,339,122.622,75.1015,14.8985,99.96
52,53,1060,3266,321,257.168,72.1868,17.8132,99.895
53,54,7225,1275,354,305.07,66.8834,23.1166,99.9919
54,55,7231,2342,378,132.27200000000002,36.7033,53.2967,99.994
55,56,10026,3671,402,152.991,29.9135,60.0865,99.4405
56,57,531,3663,332,159.247,8.14671,81.8533,99.5509
57,58,5522,1336,393,160.635,17.1858,72.8142,99.9135
58,59,45364,2530,471,110.393,69.0073,20.9927,99.325
59,60,17359,3374,421,154.22899999999996,33.7844,56.2156,99.7741
60,61,1331,3292,367,336.267,70.0848,19.9152,99.9506
61,62,4053,3588,421,153.015,33.1018,56.8982,99.8903
62,63,8565,3186,407,152.67700000000005,28.4177,61.5823,99.9939
63,64,10144,2280,420,289.612,79.6349,10.3651,99.9688
64,65,897,335,398,128.731,68.0189,21.9811,99.9811
65,66,995,2198,419,329.915,9.50205,80.4979,99.9888
66,67,763,240,418,312.651,1.97439,88.0256,99.717
67,68,5239,359,453,323.893,19.1018,70.8982,99.9407
68,69,1405,3280,417,324.853,26.163,63.837,99.8336
69,70,1842,2999,430,151.514,1.09686,88.9031,99.9381
70,71,6343,3099,458,320.465,34.4977,55.5023,99.8123
71,72,1750,1284,435,144.773,22.9501,67.0499,99.9953
72,73,13404,894,497,301.858,19.7607,70.2393,84.7339
73,74,10442,489,488,146.691,41.3683,48.6317,99.8373
74,75,305261,3227,777,177.645,32.6001,57.3999,80.3149
75,76,32193,1996,540,163.47899999999996,19.0526,70.9474,98.2815
76,77,164687,1357,767,151.928,36.2158,53.7842,73.5138
77,78,574,1350,465,158.915,18.7676,71.2324,99.9749
78,79,670,2918,491,73.6708,82.8935,7.10647,99.9464
79,80,45407,2261,548,332.147,1.84496,88.155,41.6314
80,81,4400,3652,538,159.235,32.99,57.01,99.39
81,82,1693,3678,493,159.951,38.5099,51.4901,99.7879
82,83,18661,774,553,323.862,8.796489999999997,81.2035,99.9158
83,84,1884,3082,496,179.248,86.2827,3.71731,99.9834
84,85,1696,3393,495,183.531,37.6136,52.3864,99.975
85,86,814,343,514,146.313,42.957,47.043,99.9024
86,87,1717,2686,520,126.069,50.3424,39.6576,99.9844
87,88,1005,228,531,125.163,67.9401,22.0599,99.9748
88,89,5777,384,579,322.382,18.6377,71.3623,99.9448
89,90,2847,321,565,129.767,66.5365,23.4635,99.9704
90,91,46495,513,654,327.728,28.6824,61.3176,82.2659
91,92,6936,3097,571,319.741,71.3593,18.6407,99.5337
92,93,72935,1769,662,100.308,66.61,23.39,99.8966
93,94,5208,1547,570,7.919189999999999,81.7921,8.207939999999999,99.9439
94,95,818,1123,542,313.272,56.5311,33.4689,99.9865
95,96,3021,2622,595,113.512,54.7104,35.2896,99.7138
96,97,531,270,558,126.025,67.6281,22.3719,99.9624
97,98,6712,3617,625,157.224,30.4275,59.5725,99.9363
98,99,897,1465,573,321.69,19.4309,70.5691,99.9914
99,100,35318,2768,658,174.296,13.1719,76.8281,99.9713
100,101,570,1868,572,338.431,50.941,39.059,99.9721
101,102,5593,1047,604,301.579,32.6663,57.3337,99.9397
102,103,8019,208,689,105.689,73.2092,16.7908,99.9772
103,104,37289,756,660,336.344,55.5115,34.4885,99.9337
104,105,15192,2399,631,327.005,8.9683,81.0317,99.4113
105,106,77643,992,776,324.005,31.0498,58.9502,99.966
106,107,1317,3666,633,148.493,36.5741,53.4259,99.798
107,108,82015,2236,842,137.967,4.8728,85.1272,99.9864
108,109,6607,317,667,107.135,72.8202,17.1798,99.9875
109,110,2472,1563,645,152.762,26.0772,63.9228,99.9925
110,111,4954,2071,662,98.8573,67.5877,22.4123,99.9889
111,112,593,3313,638,317.055,0.893135,89.1069,99.9075
112,113,4136,2562,656,169.16400000000004,66.6041,23.3959,99.8969
113,114,8506,2374,700,101.701,64.0093,25.9907,99.9778
114,115,1049,3670,685,155.05200000000005,31.887,58.113,99.9489
115,116,9638,1323,734,158.565,17.4405,72.5595,99.9814
116,117,15094,2125,757,142.878,38.9336,51.0664,99.9835
117,118,1010,2555,693,325.0490000000001,56.2427,33.7573,99.9866
118,119,287777,1936,1132,150.732,27.7134,62.2866,87.7452
119,120,37777,2502,824,153.322,17.9235,72.0765,56.2533
120,121,4289,2607,718,328.579,12.216,77.78399999999998,99.9935
121,122,539,347,702,145.69,41.6633,48.3367,99.989
122,123,4626,631,744,303.641,50.0763,39.9237,99.9389
123,124,9659,2700,763,104.709,58.526,31.474,99.9204
124,125,2695,344,741,307.99,19.5187,70.4813,99.9688
125,126,11413,1169,808,326.423,13.7848,76.2152,99.9448
126,127,1940,452,753,301.521,46.3723,43.6277,99.9799
127,128,5139,2928,767,163.138,8.64114,81.3589,99.8515
128,129,4221,278,776,149.745,9.32875,80.6712,99.9914
129,130,7824,698,782,310.2870000000001,55.6199,34.3801,99.9858
130,131,834,2768,761,327.331,57.6753,32.3247,99.8788
131,132,5835,2626,799,321.509,55.8049,34.1951,99.9651
132,133,1968,417,792,331.595,8.82477,81.1752,99.9901
133,134,2780,3593,808,121.409,16.7257,73.2743,99.9467
134,135,908,2846,783,324.131,56.5044,33.4956,99.9577
135,136,7425,1854,823,337.01199999999994,36.0657,53.9343,99.9907
136,137,971,310,799,330.2480000000001,46.8257,43.1743,99.9976
137,138,20733,3215,865,334.9430000000001,77.9338,12.0662,99.947
138,139,8745,348,846,307.152,38.2222,51.7778,99.9946
139,140,20771,2927,874,142.83100000000005,39.4861,50.5139,99.9778
140,141,9047,1629,832,165.59400000000005,40.5718,49.4282,99.9726
141,142,17367,502,881,155.96,46.6512,43.3488,99.9517
142,143,20338,800,884,324.555,54.6026,35.3974,99.9956
143,144,5027,1748,841,138.326,34.8094,55.1906,99.9781
144,145,625,1345,816,35.4128,87.1449,2.85513,99.7838
145,146,1741,201,829,128.349,30.0762,59.9238,99.895
146,147,897,632,819,158.36700000000005,40.8623,49.1377,99.9966
147,148,840,1709,834,170.127,36.6824,53.3176,99.8708
148,149,16947,2751,898,161.14600000000004,11.5461,78.4539,99.9538
149,150,644,236,857,130.381,30.8299,59.1701,99.9479
150,151,2468,2824,887,334.848,45.1615,44.8385,99.9743
151,152,2117,266,849,133.885,30.4351,59.5649,99.9468
152,153,2687,589,859,306.011,38.6192,51.3808,99.9412
153,154,3397,656,854,167.317,29.8056,60.1944,99.9867
154,155,2177,3399,871,122.164,18.6606,71.3394,99.9092
155,156,21902,2635,954,148.08,12.3682,77.6318,99.9734
156,157,15596,1807,917,299.311,72.4695,17.5305,99.9753
157,158,4372,696,891,308.4240000000001,45.2067,44.7933,99.9917
158,159,16425,1601,939,297.452,10.7978,79.2022,99.9807
159,160,3812,1150,897,332.9290000000001,10.9482,79.0518,99.9894
160,161,704,3673,903,134.363,2.79646,87.2035,99.9636
161,162,22885,426,981,133.67,32.714,57.286,99.9804
162,163,1961,191,918,112.471,73.0808,16.9192,99.9503
163,164,14579,269,990,318.269,28.3504,61.6496,92.0471
164,165,7391,3284,934,318.456,2.11383,87.8862,99.9875
165,166,11243,612,970,128.369,51.1407,38.8593,99.908
166,167,1190,1117,925,325.222,10.1418,79.8582,99.9536
167,168,6668,1028,950,331.587,10.2842,79.7158,99.6458
168,169,185748,3387,1309,123.158,18.3917,71.6083,99.7307
169,170,1683,2867,934,161.44799999999995,5.48335,84.5166,99.8049
170,171,1183,3387,961,292.666,84.5822,5.41776,99.9596
171,172,825,3359,951,303.016,85.3267,4.67328,99.9405
172,173,3025,1199,967,138.52,31.9009,58.0991,99.9896
173,174,1121,680,944,334.711,9.76399,80.236,99.9387
174,175,13213,2378,994,332.523,41.9046,48.0954,99.988
175,176,1842,721,968,166.208,30.0727,59.9273,99.9954
176,177,657,2825,954,154.675,22.0292,67.9708,99.6858
177,178,11028,1119,999,130.882,61.7049,28.2951,99.9016
178,179,49985,771,1100,307.6620000000001,54.2594,35.7406,99.8343
179,180,14793,2886,1017,321.332,74.6847,15.3153,99.5146
180,181,906,2474,994,305.186,40.5612,49.4388,99.8437
181,182,7430,341,1053,306.495,49.4433,40.5567,99.994
182,183,8437,2627,1052,308.569,40.7416,49.2584,99.5473
183,184,605,3208,1006,229.922,84.0363,5.96371,99.9793
184,185,1065,3671,1024,125.898,3.35068,86.6493,99.883
185,186,725,532,1007,301.987,44.3392,45.6608,99.8988
186,187,71018,2496,1183,152.286,19.3132,70.6868,98.1317
187,188,5587,653,1050,158.409,39.2071,50.7929,99.9935
188,189,553,1375,1037,166.517,42.0019,47.9981,99.9585
189,190,3581,2743,1050,329.099,15.8944,74.1056,67.8299
190,191,572153,1218,1497,324.065,2.52743,87.4726,91.8362
191,192,2140,559,1048,310.638,52.2347,37.7653,99.9754
192,193,719,3427,1051,315.672,83.2094,6.79057,99.4573
193,194,4907,2321,1081,312.177,38.9132,51.0868,99.997
194,195,703,1340,1067,328.897,23.0108,66.9892,99.9193
195,196,4292,1423,1094,168.627,23.4625,66.5375,99.9464
196,197,28487,2802,1152,320.6140000000001,54.6566,35.3434,99.9233
197,198,504,3670,1079,133.939,4.4231,85.5769,99.8612
198,199,223389,434,1383,149.243,8.49302,81.507,87.6773
199,200,949,3554,1097,114.032,72.8274,17.1726,99.9649
200,201,593,479,1098,133.407,25.2449,64.7551,82.6298
201,202,993,426,1095,301.32,43.4258,46.5742,99.9884
202,203,685,1327,1100,173.16,24.472,65.528,99.9897
203,204,904,2343,1126,147.165,53.1203,36.8797,99.9953
204,205,1590,3661,1146,136.02100000000002,3.93867,86.0613,99.7976
205,206,52962,1240,1268,123.08,69.3622,20.6378,99.8884
206,207,1450,1418,1132,297.204,11.6719,78.3281,99.9546
207,208,1727,1771,1148,326.524,36.319,53.681,99.9927
208,209,366691,2212,1576,313.983,39.6441,50.3559,97.9335
209,210,1379,3572,1168,320.279,12.0642,77.9358,99.7331
210,211,1474,2679,1170,319.601,44.7126,45.2874,99.9942
211,212,3402,3183,1201,337.973,66.2052,23.7948,99.9696
212,213,1131,3627,1220,318.754,13.7261,76.2739,99.8159
213,214,1038,2631,1221,136.067,40.7433,49.2567,99.8286
214,215,2549,3575,1229,151.011,55.1292,34.8708,99.9124
215,216,28793,2736,1286,338.629,69.0054,20.9946,99.9748
216,217,3720,2982,1248,341.797,73.2885,16.7115,99.9666
217,218,913,3109,1228,121.557,19.6022,70.3978,99.9577
218,219,3744,2911,1247,157.71,20.4261,69.5739,99.9871
219,220,2598,1137,1246,344.946,56.1101,33.8899,99.9464
220,221,178031,3007,1583,143.671,74.5744,15.4256,95.952
221,222,543,176,1269,332.096,14.6701,75.3299,99.8967
222,223,6753,3583,1320,309.017,50.364,39.636,99.8734
223,224,10861,1341,1324,293.41,13.1341,76.8659,99.9958
224,225,1218,2983,1381,338.024,74.3334,15.6666,99.9722
225,226,939,1839,1395,117.248,73.307,16.692999999999998,99.9876
226,227,5969,736,1425,5.1371699999999985,63.6415,26.3585,99.9309
227,228,13647,1270,1443,160.237,59.1647,30.8353,99.994
228,229,5439,1918,1438,119.731,70.8631,19.1369,99.9728
229,230,1919,3656,1452,117.79,22.6502,67.3498,99.8989
230,231,8989,3432,1481,339.23,38.8116,51.1884,99.9731
231,232,1431,1862,1477,140.697,18.2467,71.7533,99.994
232,233,8824,2691,1509,151.208,10.899,79.101,99.9478
233,234,170631,656,1797,327.012,54.737,35.26300000000001,98.6784
234,235,5012,3248,1609,354.555,76.0865,13.9135,99.9533
235,236,793,184,1610,143.56,27.5117,62.4883,99.9184
236,237,7952,3525,1650,311.476,59.5463,30.4537,99.835
237,238,15098,3385,1669,321.405,69.5089,20.4911,99.9568
238,239,4701,2070,1658,154.171,17.5945,72.4055,99.9899
239,240,2357,3293,1656,122.518,16.4001,73.5999,99.9729
240,241,5231,3222,1679,146.846,1.88177,88.1182,99.8675
241,242,3621,1604,1665,321.18,15.4729,74.5271,99.9118
242,243,4997,2744,1668,152.93,18.4537,71.5463,99.9775
243,244,3972,542,1670,54.4181,87.6106,2.38942,99.9827
244,245,2736,365,1691,86.7585,80.1543,9.84567,99.9963
245,246,3723,415,1699,85.1766,78.3494,11.6506,99.9928
246,247,10352,286,1733,330.647,15.3013,74.6987,99.9582
247,248,1011,2629,1686,151.899,2.14256,87.8574,99.9968
248,249,12624,1383,1764,46.42,70.9182,19.0818,99.9841
249,250,1537,2503,1709,328.15,29.4608,60.5392,99.9425
250,251,2312,2560,1707,160.879,25.6849,64.3151,99.9668
251,252,4401,511,1731,92.8168,78.9794,11.0206,99.9771
252,253,2631,3303,1721,339.783,77.4463,12.5537,99.9748
253,254,65432,2737,1807,160.57,26.9495,63.0505,99.8684
254,255,1514,3575,1727,294.421,17.3386,72.6614,99.9278
255,256,1079,3636,1732,298.496,63.2937,26.7063,99.9282
256,257,1930,2434,1727,331.4480000000001,10.9848,79.0152,99.9834
257,258,669,2595,1722,142.964,16.4343,73.5657,99.9865
258,259,16093,3547,1819,147.963,0.806183,89.1938,99.7946
259,260,9886,3302,1797,144.167,7.15526,82.8447,99.9697
260,261,7052,2084,1776,240.422,79.2895,10.7105,99.9552
261,262,6205,2542,1768,139.07,65.1303,24.8697,99.9808
262,263,1294,3614,1775,299.384,63.0866,26.9134,99.956
263,264,5428,3418,1780,137.565,41.2378,48.7622,99.9887
264,265,8625,2389,1797,208.306,82.2898,7.71024,99.982
265,266,1296,3651,1795,299.642,64.0198,25.9802,99.8887
266,267,755,1847,1782,163.143,59.9657,30.0343,99.9234
267,268,3131,2040,1802,130.082,56.6372,33.3628,99.992
268,269,2584,3241,1837,304.362,68.6743,21.3257,99.9879
269,270,74131,2024,1987,327.475,19.9421,70.0579,97.2478
270,271,517,2263,1808,130.178,59.9439,30.0561,99.9955
271,272,9721,2317,1893,230.777,77.6879,12.3121,99.96
272,273,549,236,1815,137.782,33.785,56.215,99.9255
273,274,3560,1929,1847,228.043,78.8341,11.1659,99.954
274,275,3815,2186,1863,130.321,59.3682,30.6318,99.9887
275,276,830,3488,1828,301.523,15.3485,74.6515,99.9253
276,277,14227,1702,1871,149.72299999999996,8.468539999999999,81.5315,99.9706
277,278,9138,2506,1886,172.93200000000004,83.8849,6.11512,99.945
278,279,12272,3371,1881,323.079,20.2607,69.7393,99.9436
279,280,2013,2979,1864,326.639,81.4263,8.57368,99.914
280,281,4302,2096,1871,199.903,79.7868,10.2132,99.913
281,282,3329,2260,1868,149.735,7.78405,82.21600000000002,99.9886
282,283,1199,2927,1850,148.41899999999995,5.643669999999998,84.3563,99.9628
283,284,3111,270,1882,331.771,47.8133,42.1867,99.9837
284,285,1530,3507,1873,312.867,60.099,29.901,99.994
285,286,5822,2394,1888,146.798,12.2693,77.7307,99.9694
286,287,63279,1149,2030,314.915,15.1284,74.8716,99.9516
287,288,2712,1137,1881,320.922,25.6354,64.3646,99.9914
288,289,11519,3059,1921,121.161,7.299069999999999,82.7009,99.9938
289,290,25805,308,1996,142.987,42.2968,47.7032,99.8731
290,291,5004,2742,1917,148.97299999999996,82.4639,7.53609,99.9257
291,292,594,2040,1901,234.509,77.747,12.253,99.9886
292,293,16745,3486,1948,158.313,60.1427,29.8573,99.9051
293,294,156731,3073,2115,348.024,60.0981,29.9019,99.8405
294,295,2225,1547,1923,160.47799999999995,79.8233,10.1767,99.9399
295,296,32756,1685,2019,149.983,59.5091,30.4909,99.7012
296,297,20459,2618,1975,160.961,63.992,26.008000000000006,99.7609
297,298,10283,2437,1977,154.857,9.49207,80.5079,99.5842
298,299,1286,1489,1942,237.758,82.62100000000002,7.37896,99.9646
299,300,39871,1463,2027,327.785,41.3577,48.6423,99.876
300,301,1082,2927,1956,143.639,82.1967,7.803260000000001,99.9868
301,302,9196,3115,2009,139.04,0.356522,89.6435,92.5473
302,303,861,1009,1977,138.609,52.313,37.687,99.9306
303,304,630,2793,1953,163.096,65.30199999999999,24.698,99.7824
304,305,580,1603,1964,150.803,74.3594,15.6406,99.926
305,306,101442,595,2213,152.546,34.9786,55.0214,96.8213
306,307,5851,763,1984,327.661,2.30652,87.6935,99.9692
307,308,4342,2318,1982,225.358,87.8681,2.13185,99.9915
308,309,5717,2782,2005,154.77700000000004,80.4162,9.58382,99.919
309,310,816,2054,1973,133.981,56.9214,33.0786,99.9912
310,311,13040,837,2030,325.231,18.7835,71.2165,99.8409
311,312,15387,3545,2084,140.709,44.7347,45.2653,99.9222
312,313,37118,623,2099,139.517,28.9602,61.0398,99.9848
313,314,2528,3606,2097,336.704,39.3626,50.6374,99.915
314,315,11818,3446,2084,296.0420000000001,31.3204,58.6796,99.7858
315,316,31103,1774,2136,148.535,10.4245,79.5755,99.9633
316,317,17378,2237,2128,139.116,37.788,52.212,99.8896
317,318,24289,2377,2103,149.45600000000005,64.6835,25.3165,99.9256
318,319,1697,975,2043,135.026,1.78605,88.214,99.9745
319,320,4572,2522,2068,169.98,68.7451,21.2549,99.8754
320,321,34322,2598,2149,148.928,1.85603,88.14399999999998,99.4737
321,322,5690,1337,2076,149.547,43.1268,46.8732,99.9572
322,323,91773,994,2325,142.12,34.1604,55.8396,88.9708
323,324,1535,1934,2072,218.788,87.5101,2.4899400000000003,99.9818
324,325,7805,865,2116,156.062,42.1164,47.8836,99.9917
325,326,3051,2714,2103,323.712,8.756310000000001,81.2437,99.9908
326,327,1256,1044,2101,106.728,65.8826,24.1174,99.9887
327,328,28790,1974,2203,95.0453,80.0737,9.92632,97.6696
328,329,5973,760,2134,325.0,47.0882,42.9118,99.9922
329,330,3555,1800,2146,78.8821,73.2521,16.7479,99.9855
330,331,507,2136,2100,153.394,55.8631,34.1369,99.9251
331,332,44687,1318,2224,230.436,81.5984,8.40162,99.9669
332,333,1701,2132,2136,160.373,88.0722,1.92783,99.9957
333,334,734,160,2146,305.974,14.8103,75.1897,99.8504
334,335,7090,293,2178,105.206,75.273,14.727,99.9951
335,336,2558,3308,2174,304.496,47.4688,42.5312,99.9431
336,337,1078,194,2146,309.311,14.0727,75.9273,99.9241
337,338,32603,3413,2236,151.804,45.4535,44.5465,99.9131
338,339,3841,2713,2171,357.635,56.526,33.474000000000004,99.989
339,340,5072,1608,2184,146.899,74.7876,15.2124,99.9854
340,341,2894,849,2175,325.494,18.7804,71.2196,99.9822
341,342,3455,1537,2178,149.793,74.4748,15.5252,99.9898
342,343,4188,209,2198,333.222,55.4798,34.5202,99.9014
343,344,13976,1471,2235,325.831,20.4055,69.5945,99.984
344,345,182291,2263,2397,328.204,18.0484,71.9516,94.7972
345,346,723,442,2174,97.5953,73.7971,16.2029,99.9948
346,347,1040,2133,2182,150.637,20.8246,69.1754,99.9779
347,348,9781,2180,2239,141.71200000000005,12.2185,77.7815,99.9737
348,349,1577,3574,2188,296.914,7.473510000000001,82.5265,99.7967
349,350,12592,2770,2229,124.235,63.1386,26.8614,99.8496
350,351,1072,3612,2218,307.556,39.9978,50.0022,99.9234
351,352,584,1086,2196,323.351,14.4088,75.5912,99.9797
352,353,2091,912,2228,250.919,76.1572,13.8428,99.9849
353,354,942,2677,2214,332.666,18.4264,71.5736,99.9967
354,355,1380,1127,2224,147.546,48.4711,41.5289,99.9875
355,356,2198,1593,2249,319.881,41.6652,48.3348,99.9923
356,357,12829,1737,2283,92.4273,73.2067,16.7933,99.968
357,358,2852,197,2272,149.285,38.7483,51.2517,99.938
358,359,54131,319,2433,318.599,20.9764,69.0236,79.4459
359,360,1957,1631,2270,97.368,72.4279,17.5721,99.9902
360,361,2315,3230,2278,305.69,48.5262,41.4738,99.9555
361,362,5798,1206,2304,324.464,16.9093,73.0907,99.9766
362,363,19453,2762,2361,332.221,4.74072,85.2593,99.9526
363,364,8671,1530,2312,326.522,45.2628,44.7372,99.9718
364,365,12642,2631,2309,137.787,50.7472,39.2528,99.9908
365,366,608,1869,2268,181.656,83.7396,6.26037,99.9756
366,367,3798,386,2316,336.235,66.4583,23.5417,99.9599
367,368,1714,3281,2298,344.983,50.5977,39.4023,99.9909
368,369,1410,3576,2312,320.591,35.9476,54.0524,99.967
369,370,966,2526,2292,134.034,57.93600000000001,32.064,99.8766
370,371,524,3641,2305,312.113,39.0018,50.9982,99.7088
371,372,3004,3495,2325,300.101,11.7618,78.2382,99.9699
372,373,1379,1611,2313,145.58,49.8443,40.1557,99.9954
373,374,47501,3363,2435,153.57399999999996,29.1706,60.8294,99.9501
374,375,23062,2912,2374,302.125,51.7085,38.2915,99.8935
375,376,4372,591,2336,133.63299999999998,12.7243,77.2757,99.9944
376,377,1298,1431,2331,318.722,13.7534,76.2466,99.9979
377,378,4992,2264,2363,212.952,77.4321,12.5679,99.9752
378,379,6416,3161,2356,143.344,34.5867,55.4133,99.9257
379,380,389799,1744,2631,159.957,31.0231,58.9769,99.2781
380,381,771,2423,2329,144.812,52.2396,37.7604,99.9941
381,382,2015,448,2351,310.468,48.6042,41.3958,99.9219
382,383,10067,3065,2420,296.4170000000001,81.5203,8.4797,99.936
383,384,6502,549,2406,161.485,42.0665,47.9335,99.9785
384,385,704,3552,2365,138.77100000000002,63.3018,26.6982,99.965
385,386,10716,367,2407,149.055,30.6481,59.3519,99.9695
386,387,8328,3223,2418,311.374,33.5237,56.4763,99.9914
387,388,621,164,2382,139.114,1.7160099999999998,88.28399999999998,99.9658
388,389,2288,712,2379,206.321,80.6313,9.36875,99.9962
389,390,9712,647,2424,304.901,19.1543,70.8457,99.8945
390,391,842,499,2384,314.258,48.8696,41.1304,99.9492
391,392,6171,2985,2450,138.954,9.45947,80.5405,99.9822
392,393,4452,483,2443,140.362,79.5741,10.4259,99.9792
393,394,98866,768,2600,309.46,15.6389,74.3611,94.8451
394,395,1109,3586,2425,156.642,44.3028,45.6972,99.749
395,396,203529,2530,2721,318.085,53.7588,36.2412,56.9779
396,397,22140,3153,2530,330.736,2.79147,87.2085,99.9526
397,398,13012,3520,2505,323.62,52.9528,37.0472,99.9097
398,399,14255,2847,2567,142.075,7.908460000000002,82.0915,99.8187
399,400,593,2429,2493,144.444,63.9238,26.0762,99.9766
400,401,791,2943,2509,135.695,18.2422,71.7578,99.9903
401,402,5665,3420,2543,318.591,3.50707,86.4929,99.9648
402,403,24076,1051,2610,315.331,74.4543,15.5457,99.9468
403,404,23039,2963,2617,314.18,77.7065,12.2935,99.6078
404,405,9821,588,2636,124.502,63.5989,26.4011,99.9506
405,406,25239,1365,2619,152.213,66.8924,23.1076,98.6212
406,407,2835,190,2600,141.014,60.7065,29.2935,99.961
407,408,1549,322,2569,134.886,66.5454,23.4546,99.9944
408,409,741,2105,2564,132.881,43.682,46.31800000000001,99.9639
409,410,2376,377,2582,126.708,63.0205,26.9795,99.958
410,411,7617,1983,2610,142.613,4.5172,85.4828,99.9534
411,412,1206,3240,2588,132.46200000000002,70.9151,19.0849,99.9377
412,413,49087,3507,2708,152.232,42.6005,47.3995,99.8523
413,414,13548,1183,2626,213.276,78.2913,11.7087,99.9631
414,415,511,976,2581,300.826,17.9863,72.0137,99.9882
415,416,1055,3268,2610,131.394,70.1296,19.8704,99.9765
416,417,25526,322,2665,325.853,26.598000000000006,63.402,99.951
417,418,2101,657,2611,142.58100000000005,11.9508,78.0492,99.9919
418,419,5629,2190,2613,156.821,40.7275,49.2725,99.994
419,420,43277,3116,2730,304.675,3.24918,86.7508,99.9753
420,421,1868,468,2636,324.605,13.2673,76.7327,99.7439
421,422,8088,3342,2656,301.531,4.14677,85.8532,99.991
422,423,647,154,2637,137.988,61.5724,28.4276,99.9257
423,424,11886,1325,2690,207.824,84.4047,5.5953300000000015,99.937
424,425,983,1510,2661,320.551,13.9123,76.0877,99.9924
425,426,11261,475,2697,313.4290000000001,50.5238,39.4762,99.9777
426,427,873,1548,2672,133.917,44.4925,45.5075,99.9406
427,428,3259,2839,2687,143.455,38.9202,51.0798,99.9777
428,429,1140,674,2687,186.278,86.3516,3.64841,99.9954
429,430,7764,215,2729,175.63299999999995,43.9508,46.0492,99.8476
430,431,16324,1144,2748,145.096,25.6724,64.3276,99.9871
431,432,5321,1505,2742,311.403,17.9211,72.0789,99.9636
432,433,173870,2850,3028,153.776,50.574,39.426,99.7433
433,434,19533,1623,2774,324.831,4.66787,85.3321,99.9742
434,435,2447,1058,2722,154.414,55.3284,34.6716,99.9949
435,436,8087,629,2753,331.534,17.2319,72.7681,99.9066
436,437,13881,1255,2792,293.307,43.3049,46.6951,99.9635
437,438,1386,3377,2770,247.183,84.7702,5.22982,99.9522
438,439,26872,997,2841,326.827,5.4953,84.5047,99.7478
439,440,34816,2778,2862,335.516,24.5653,65.4347,99.9472
440,441,980,3351,2771,249.275,85.0958,4.90425,99.9703
441,442,11845,1389,2781,161.631,55.81100000000001,34.189,99.9912
442,443,1236,3315,2772,252.366,85.15700000000002,4.8430300000000015,99.985
443,444,5999,423,2769,174.889,46.5742,43.4258,99.898
444,445,2396,539,2767,309.323,52.2976,37.7024,99.9069
445,446,2130,495,2764,134.058,18.321,71.679,99.9909
446,447,3902,3224,2794,246.127,84.8173,5.1827,99.9752
447,448,8787,737,2806,135.17,22.3867,67.6133,99.9961
448,449,19097,283,2833,142.315,0.557426,89.4426,99.991
449,450,1253,1537,2798,156.01,29.4686,60.5314,99.9803
450,451,23458,2305,2871,152.42600000000004,2.8745,87.1255,99.9792
451,452,9496,574,2852,320.856,0.15520499999999998,89.8448,99.8183
452,453,2567,3171,2827,296.092,76.274,13.726,99.9789
453,454,38100,1501,2897,145.377,51.3575,38.6425,99.9376
454,455,14160,854,2858,209.285,73.3209,16.6791,99.993
455,456,1018,165,2824,309.346,47.33600000000001,42.664,99.9788
456,457,631,475,2815,320.467,3.07925,86.9207,99.9877
457,458,5112,720,2877,186.921,82.7821,7.21787,99.9809
458,459,3789,3297,2836,312.082,35.6259,54.3741,99.957
459,460,612,3383,2822,93.5867,82.2582,7.74178,99.9789
460,461,33791,373,2951,322.243,15.3051,74.6949,99.8032
461,462,6341,498,2881,174.50799999999995,44.2636,45.7364,99.9894
462,463,1527,628,2855,189.066,83.2416,6.75842,99.9803
463,464,17981,692,2952,134.811,18.6977,71.3023,99.9135
464,465,281091,1264,3121,329.327,41.2681,48.7319,96.2618
465,466,6260,2024,2880,353.851,54.5115,35.4885,99.9251
466,467,14772,3565,2956,310.897,14.9359,75.0641,99.7805
467,468,9305,3477,2888,308.405,38.4288,51.5712,99.9286
468,469,767,3624,2851,151.14,44.5224,45.4776,99.8667
469,470,906,3224,2856,321.76,45.1227,44.8773,99.9847
470,471,1131,3358,2872,319.947,46.114,43.886,99.9707
471,472,1301,3397,2874,321.078,45.5469,44.4531,99.9756
472,473,23607,3227,2988,173.326,67.0532,22.9468,99.7058
473,474,2091,3047,2919,321.6790000000001,18.3057,71.6943,99.9976
474,475,5645,236,2936,310.673,46.5018,43.4982,99.971
475,476,32004,3376,3027,336.18,33.4282,56.5718,96.6566
476,477,2038,3207,2931,311.395,38.5809,51.4191,99.9883
477,478,2031,3545,2945,151.595,70.5649,19.4351,99.9844
478,479,877,817,2925,328.746,3.3593,86.6407,99.9878
479,480,1418,2523,2954,150.244,2.43744,87.5626,99.9932
480,481,120779,535,3173,143.761,30.0519,59.9481,96.6194
481,482,630,659,2954,181.618,78.081,11.919,99.9958
482,483,1057,578,2952,329.4369999999999,19.6462,70.3538,99.9893
483,484,5326,835,2976,171.378,82.9846,7.01543,99.9368
484,485,2708,2180,2960,336.7340000000001,39.1747,50.8253,99.9578
485,486,887,1656,2968,327.464,10.8616,79.1384,98.7999
486,487,1171,2018,2984,316.539,5.68296,84.31700000000002,99.9357
487,488,4622,621,3019,143.795,8.7944,81.2056,99.9341
488,489,138274,1957,3205,325.932,30.3999,59.6001,78.6642
489,490,43294,2098,3079,151.774,15.5795,74.4205,99.9544
490,491,23994,246,3119,186.626,78.4666,11.5334,99.9184
491,492,2203,2287,3012,323.275,17.9281,72.0719,99.8909
492,493,6804,3517,3066,134.816,67.9587,22.0413,99.6528
493,494,248626,3289,3383,138.59799999999998,11.7066,78.2934,99.5963
494,495,565,2523,3019,149.618,2.02383,87.9762,99.988
495,496,21206,822,3113,302.895,33.5425,56.4575,99.9531
496,497,1474,2312,3052,158.275,51.5593,38.4407,99.9923
497,498,154885,2394,3376,142.762,14.5124,75.4876,87.8596
498,499,542,144,3112,195.871,78.4924,11.5076,99.977
499,500,1017,3613,3122,132.806,49.3497,40.6503,99.9421
500,501,2456,3577,3137,135.44,47.9115,42.0885,99.8758
501,502,741,3248,3131,143.592,53.7261,36.2739,99.9913
502,503,47461,950,3342,149.916,34.3745,55.6255,97.6615
503,504,745,3543,3156,134.57,48.3701,41.6299,99.8132
504,505,2807,2703,3187,167.875,61.4107,28.5893,99.9521
505,506,1052,3523,3176,317.032,22.229,67.771,99.897
506,507,28153,2617,3258,323.965,14.6387,75.3613,99.9814
507,508,1007,3610,3222,136.267,37.2696,52.7304,99.9516
508,509,967,3558,3206,133.4,37.993,52.007,99.9477
509,510,933,3131,3219,155.84799999999996,50.5351,39.4649,99.992
510,511,133239,1721,3418,142.81,18.8749,71.1251,99.2647
511,512,4779,728,3222,321.6,8.67683,81.3232,99.9832
512,513,566,3514,3225,133.779,48.217,41.783,99.9631
513,514,7637,346,3294,323.77,32.0819,57.9181,99.9759
514,515,592,161,3249,183.55,80.0088,9.99118,99.9707
515,516,2613,3558,3274,132.44899999999998,52.69,37.31,99.8709
516,517,10364,841,3330,322.272,26.2867,63.7133,99.9489
517,518,1704,2249,3260,150.175,75.0044,14.9956,99.9937
518,519,5803,734,3278,317.617,51.1927,38.8073,99.997
519,520,30497,2904,3344,29.2518,85.1243,4.8757199999999985,98.614
520,521,684,2748,3271,22.2083,80.8245,9.17547,99.9958
521,522,1145,281,3273,133.135,45.223,44.777,99.9464
522,523,4754,222,3304,187.729,80.4038,9.59618,99.9876
523,524,1106,407,3297,323.788,4.58697,85.413,99.9909
524,525,5207,2752,3316,149.54,63.2523,26.7477,99.9735
525,526,1195,3616,3322,140.281,45.7517,44.2483,99.9429
526,527,11129,723,3368,182.74400000000003,70.7617,19.2383,99.9835
527,528,7192,1080,3355,306.413,41.6735,48.3265,99.79
528,529,616,3579,3329,135.345,46.6476,43.3524,99.7845
529,530,10619,487,3404,322.428,10.1798,79.8202,99.913
530,531,30966,255,3406,155.376,48.6981,41.3019,99.9689
531,532,559,411,3353,194.081,75.3112,14.6888,99.9652
532,533,6710,2682,3381,326.503,24.866,65.134,99.9344
533,534,3233,1671,3370,329.842,15.9772,74.0228,99.9949
534,535,3506,562,3422,201.93400000000003,71.6628,18.3372,99.9932
535,536,531,2591,3402,325.779,27.1946,62.8054,99.9699
536,537,5423,1325,3419,155.725,49.1385,40.8615,99.9928
537,538,509,3620,3405,142.39700000000005,1.49525,88.5048,99.9806
538,539,5014,829,3440,134.745,16.0694,73.9306,99.9947
539,540,16822,2943,3460,324.263,37.0182,52.9818,99.9352
540,541,12283,724,3464,177.58599999999996,81.8233,8.17666,99.9004
541,542,34607,2760,3510,141.512,46.2532,43.7468,99.9612
542,543,219331,1302,3751,144.83,57.1258,32.8742,56.0448
543,544,1076,1442,3432,115.675,72.2905,17.7095,99.9612
544,545,83696,2095,3655,152.28799999999995,5.72697,84.273,93.7062
545,546,10241,2033,3487,321.9120000000001,13.1302,76.8698,99.9201
546,547,161564,601,3699,160.07,35.9033,54.0967,55.7074
547,548,22780,1542,3556,328.037,0.8672489999999999,89.1328,99.7507
548,549,806,2183,3455,337.059,10.9155,79.0845,98.6776
549,550,990,3621,3465,141.702,2.35949,87.6405,99.976
550,551,2719,792,3514,161.597,52.7281,37.2719,99.9907
551,552,2602,3058,3513,40.1991,85.1921,4.8078699999999985,99.9896
552,553,604,869,3489,208.397,82.8023,7.19774,99.8064
553,554,20007,1868,3620,321.822,44.0829,45.9171,99.6835
554,555,136043,972,3781,322.599,12.0426,77.9574,94.9841
555,556,86254,2852,3678,148.855,37.3863,52.6137,75.5653
556,557,980,2671,3552,32.5056,80.2873,9.71266,99.5217
557,558,816,2968,3540,29.7883,86.6359,3.36406,99.9678
558,559,1886,758,3556,209.48,81.0938,8.90622,99.9539
559,560,10259,1006,3605,136.08100000000002,16.4908,73.5092,99.9761
560,561,696,2217,3564,310.2990000000001,47.4303,42.5697,99.8931
561,562,6271,183,3625,145.59799999999996,43.1004,46.8996,99.8689
562,563,102875,2489,3762,322.81,8.81867,81.1813,99.505
563,564,810,1481,3581,338.199,17.07,72.93,99.9875
564,565,36353,3478,3739,140.185,40.196,49.804,99.5537
565,566,33201,313,3694,318.638,18.7039,71.2961,99.9807
566,567,1396,3618,3634,143.273,39.192,50.808,99.7122
567,568,7094,673,3638,269.246,82.3142,7.68582,99.9835
568,569,1605,2827,3620,150.519,37.6325,52.3675,98.9514
569,570,529,3591,3615,140.97299999999996,39.8826,50.1174,99.8374
570,571,938,146,3645,140.92600000000004,45.2865,44.7135,99.882
571,572,945,1682,3638,153.46,8.58032,81.4197,99.0997
572,573,1060,1868,3644,156.88,5.76386,84.2361,99.9967
573,574,1216,1679,3671,326.013,44.8187,45.1813,99.969
574,575,2625,3214,3676,142.497,23.5951,66.4049,99.9908
575,576,5106,1658,3728,151.673,3.48965,86.5104,99.9925
576,577,42842,3074,3805,145.472,27.373,62.627,99.9643
577,578,16985,1613,3806,326.749,44.5115,45.4885,99.9497
578,579,1667,1102,3683,305.868,42.7212,47.2788,99.9935
579,580,5626,1185,3707,158.217,45.5517,44.4483,99.9978
580,581,1263,3619,3730,139.006,38.2705,51.7295,99.7071
581,582,15818,1740,3761,328.326,21.106,68.89399999999999,99.9876
582,583,2445,171,3713,268.403,80.1391,9.86093,99.9958
583,584,3732,3255,3722,302.618,73.4586,16.5414,99.9589
584,585,676,2279,3708,157.8,16.3412,73.6588,99.9925
585,586,585,1025,3732,141.108,9.25332,80.7467,99.7136
586,587,9174,2357,3793,137.525,57.7784,32.2216,99.9917
587,588,691,1858,3759,126.503,74.0115,15.9885,99.9464
588,589,8412,227,3807,141.716,28.4724,61.5276,99.9889
589,590,27684,3253,3849,321.32,17.090999999999998,72.90899999999998,99.9885
590,591,163756,488,4110,148.75,46.0586,43.9414,96.9352
591,592,1066,2126,3787,121.727,75.5041,14.4959,99.9927
592,593,9745,1844,3836,324.369,49.4282,40.5718,99.6369
593,594,29914,2917,3884,331.889,22.7459,67.2541,99.9747
594,595,8164,1946,3818,137.158,73.2329,16.7671,99.9882
595,596,6463,3440,3820,333.55,31.5534,58.4466,99.9563
596,597,1490,3609,3845,144.05700000000004,35.2792,54.7208,99.8044
597,598,820,1114,3805,132.775,42.3649,47.6351,99.9982
598,599,3380,313,3828,319.088,0.5061260000000001,89.4939,99.9984
599,600,633,2154,3816,139.58,16.55,73.45,99.9992
600,601,25494,224,3982,141.631,15.0607,74.9393,97.2883
601,602,2688,1774,3837,150.997,70.0713,19.9287,99.9931
602,603,11336,579,3885,314.698,2.41261,87.5874,99.9936
603,604,26487,2044,3915,315.998,18.5793,71.4207,99.8948
604,605,4849,1543,3877,327.11,4.11784,85.8822,99.9616
605,606,25442,3463,3937,144.69,2.39532,87.6047,99.8306
606,607,46118,1618,4000,323.474,16.7544,73.2456,82.8631
607,608,3880,2340,3886,147.433,12.5056,77.4944,99.981
608,609,14319,2531,3941,334.1930000000001,7.489139999999999,82.5109,99.9716
609,610,767,2816,3882,322.85,72.7548,17.2452,99.963
610,611,78149,2343,4049,147.13,45.1313,44.8687,99.9737
611,612,6906,291,3934,143.452,29.1235,60.8765,99.9931
612,613,1133,3343,3899,131.79399999999998,34.2155,55.7845,99.9842
613,614,4495,1863,3918,331.335,0.836899,89.1631,99.9907
614,615,8914,2150,3949,331.533,20.9378,69.0622,99.9459
615,616,572,3129,3904,150.997,8.93551,81.0645,99.5758
616,617,7412,1921,3968,327.32,52.0975,37.9025,99.9756
617,618,1716,1487,3916,139.55100000000002,4.27045,85.7295,99.9825
618,619,13218,2714,3963,318.709,15.476,74.524,99.9773
619,620,968,3599,3921,151.476,40.7804,49.2196,99.8465
620,621,3262,2797,3962,313.921,73.5479,16.4521,99.9521
621,622,3456,3108,3953,148.593,3.4182,86.5818,99.9828
622,623,1984,143,3991,127.304,18.8574,71.1426,99.7619
623,624,599,3290,3938,142.654,0.337173,89.6628,99.994
624,625,670,1780,3944,324.038,7.040260000000001,82.9597,99.9619
625,626,627,1743,3954,153.036,24.778,65.222,99.7721
626,627,20601,3209,4021,157.94,86.3134,3.68663,80.7293
627,628,1685,3353,3965,141.158,12.494000000000002,77.506,99.9599
628,629,13708,855,4005,144.748,3.86248,86.1375,85.5019
629,630,2694,3315,3998,323.464,86.0518,3.94816,99.9679
630,631,14776,1811,4041,316.245,40.7446,49.2554,99.9569
631,632,103025,2821,4116,149.70600000000005,25.6911,64.3089,98.9391
632,633,4253,3574,4053,143.225,42.1757,47.8243,99.8216
633,634,15291,1991,4063,138.376,19.7741,70.2259,99.9872
634,635,1808,3393,4010,139.928,19.0517,70.9483,99.9857
635,636,5256,3070,4029,182.155,66.0122,23.9878,99.9218
636,637,717,3602,4046,144.322,40.4403,49.5597,99.8138
637,638,2603,2190,4055,152.386,24.069000000000006,65.931,99.9608
638,639,1169,977,4040,142.662,10.7469,79.2531,99.9719
639,640,81962,3354,4186,326.683,7.8006600000000015,82.1993,99.7425
640,641,7995,774,4094,301.314,46.877,43.12300000000001,99.9808
641,642,635,2519,4049,302.4120000000001,69.9041,20.0959,99.4234
642,643,47537,2140,4197,315.939,47.4314,42.5686,99.5249
643,644,2100,1380,4070,144.717,11.0671,78.9329,99.9774
644,645,8928,1877,4112,322.745,3.84044,86.1596,99.9427
645,646,5948,1628,4100,146.833,9.37723,80.6228,99.9665
646,647,2105,711,4073,153.865,69.5469,20.4531,99.9989
647,648,2904,872,4074,118.83,73.2062,16.7938,99.9855
648,649,48927,1466,4217,138.623,45.0316,44.9684,97.433
649,650,8927,963,4112,321.985,6.3834300000000015,83.6166,99.946
650,651,1258,662,4089,297.921,42.3921,47.6079,99.996
651,652,840,1019,4097,327.8590000000001,18.0688,71.9312,99.9743
652,653,11800,1117,4140,235.311,79.1111,10.8889,99.9633
653,654,18309,248,4167,313.7,32.9767,57.0233,99.6768
654,655,3767,2517,4119,148.23,9.73161,80.2684,99.0039
655,656,10804,820,4176,320.394,9.81094,80.1891,99.9726
656,657,4570,141,4160,308.888,33.6051,56.3949,99.9743
657,658,1446,702,4114,126.916,68.1624,21.8376,99.9939
658,659,2292,336,4121,138.112,1.11989,88.8801,99.9947
659,660,33319,920,4298,145.878,58.4841,31.5159,98.963
660,661,691,1815,4132,328.00699999999995,33.2665,56.7335,99.9932
661,662,6340,1561,4194,151.904,85.4916,4.50841,99.9524
662,663,5210,695,4180,317.318,2.90586,87.0941,99.9765
663,664,3282,357,4172,326.51,52.8318,37.1682,99.947
664,665,4377,1689,4184,147.811,32.2945,57.7055,99.942
665,666,2776,2855,4177,140.513,6.650739999999999,83.3493,99.9884
666,667,2075,1021,4176,143.32299999999995,14.7995,75.2005,99.9957
667,668,76027,1903,4299,199.155,86.5126,3.4874,99.9568
668,669,1868,2586,4174,328.548,50.0297,39.9703,99.9777
669,670,21186,1650,4274,148.245,37.7514,52.2486,99.8008
670,671,16738,2518,4245,339.504,46.4121,43.5879,99.9946
671,672,2876,2997,4187,318.589,36.822,53.178,99.9734
672,673,17551,2326,4265,142.69899999999996,28.0487,61.9513,99.8263
673,674,2636,2617,4220,315.088,34.6777,55.3223,99.9972
674,675,77245,1106,4358,323.899,4.00218,85.9978,85.1253
675,676,20277,774,4304,144.003,4.73484,85.2652,99.9451
676,677,10245,1250,4235,329.112,70.7595,19.2405,99.995
677,678,1532,2824,4217,323.324,37.9325,52.0675,99.9924
678,679,13013,226,4274,330.455,46.5975,43.4025,99.9633
679,680,3513,2916,4228,343.587,39.3123,50.6877,99.9082
680,681,136468,3362,4442,144.238,19.3452,70.6548,99.5294
681,682,560,1739,4236,322.717,5.16485,84.8352,99.9856
682,683,1377,3486,4237,313.741,41.6739,48.3261,99.9883
683,684,36626,2879,4364,319.963,27.018,62.982,85.9812
684,685,866,3594,4263,147.484,20.4862,69.5138,99.8645
685,686,12244,635,4309,142.40200000000004,10.8545,79.1455,99.9878
686,687,2985,350,4267,146.036,41.0306,48.9694,99.982
687,688,4975,2878,4276,149.817,54.3402,35.6598,99.9779
688,689,4324,135,4317,328.025,48.232,41.768,99.9088
689,690,7334,2634,4302,148.852,53.0204,36.9796,99.9486
690,691,3912,1320,4316,301.5420000000001,75.6411,14.3589,99.9526
691,692,1149,3587,4318,148.425,21.0878,68.9122,99.8917
692,693,5235,1350,4352,337.759,39.889,50.111,99.846
693,694,8262,2432,4358,147.476,39.4134,50.5866,99.9505
694,695,4714,705,4367,319.978,70.5841,19.4159,99.9781
695,696,8566,3039,4387,149.92700000000005,17.3399,72.6601,99.9906
696,697,26133,241,4436,137.844,32.7023,57.2977,87.23200000000001
697,698,1474,301,4338,160.03799999999995,80.2892,9.71078,99.9908
698,699,11522,2577,4380,134.27,32.3089,57.6911,99.9524
699,700,3110,1587,4376,142.811,25.3388,64.6612,99.9574
700,701,5621,2333,4372,313.675,30.8131,59.1869,99.9905
701,702,19770,2193,4407,333.477,2.34219,87.6578,99.9317
702,703,38967,2773,4546,324.798,40.9036,49.0964,95.8495
703,704,4882,1418,4386,310.079,50.7495,39.2505,99.9686
704,705,19613,1598,4460,243.403,79.8938,10.1062,99.853
705,706,2681,347,4380,330.175,58.479,31.521,97.2234
706,707,697,2677,4370,146.231,13.0815,76.9185,99.9685
707,708,755,1658,4378,141.341,24.5639,65.4361,99.9878
708,709,14739,588,4460,145.558,4.50372,85.4963,99.8695
709,710,5520,828,4412,322.666,57.3407,32.6593,99.6968
710,711,2183,302,4403,320.216,47.0868,42.9132,99.9968
711,712,1191,1358,4391,136.317,26.9217,63.0783,99.9954
712,713,626,3580,4393,149.713,12.7655,77.2345,99.9126
713,714,7478,2698,4452,153.375,24.7394,65.2606,99.9907
714,715,10216,2379,4472,341.056,44.499,45.50100000000001,99.7972
715,716,9434,1928,4431,333.519,16.1016,73.8984,99.9543
716,717,25843,1307,4482,272.95,78.9582,11.0418,99.6006
717,718,889,680,4421,146.972,3.66926,86.3307,99.9573
718,719,4913,2534,4431,324.981,17.8069,72.1931,99.9894
719,720,803,1483,4417,314.437,49.9175,40.0825,99.9875
720,721,925,653,4435,132.291,5.12667,84.8733,99.9906
721,722,5158,2452,4441,329.38,1.85518,88.1448,99.9235
722,723,1564,351,4433,319.564,50.1127,39.8873,99.984
723,724,2118,1542,4435,310.392,79.6968,10.3032,99.9837
724,725,2135,2062,4441,316.215,10.6418,79.3582,99.9854
725,726,7125,832,4484,142.24,16.3036,73.6964,99.9055
726,727,793,1457,4445,314.91,51.097,38.903,99.9754
727,728,1606,731,4446,307.528,24.6472,65.3528,99.9834
728,729,1063,2011,4452,313.4240000000001,31.4404,58.5596,99.9889
729,730,3406,1756,4469,341.19,14.0239,75.9761,99.9046
730,731,6823,489,4493,307.702,49.4919,40.5081,99.9541
731,732,1039,2170,4449,143.253,10.3953,79.6047,99.8631
732,733,5252,1825,4477,147.438,37.2062,52.7938,99.9928
733,734,808,2861,4452,161.02,56.1757,33.8243,99.9
734,735,999,799,4461,313.407,25.7593,64.2407,99.9823
735,736,584,2584,4458,340.144,43.6352,46.3648,99.989
736,737,599,2820,4460,145.483,29.0796,60.9204,99.9764
737,738,2693,134,4492,309.821,43.999,46.00100000000001,99.8412
738,739,10925,682,4513,132.304,55.4032,34.5968,99.9593
739,740,1231,3054,4470,288.111,80.7453,9.25466,99.9701
740,741,8876,3155,4507,287.089,79.2693,10.7307,99.8538
741,742,2700,2278,4474,147.23,15.5834,74.4166,99.9886
742,743,4005,2632,4499,128.421,40.7138,49.2862,99.9818
743,744,33170,2986,4574,153.411,32.0487,57.9513,99.8867
744,745,119138,2103,4585,146.179,19.3473,70.6527,82.9721
745,746,1559,2128,4488,334.86,1.33459,88.6654,99.9574
746,747,1302,2072,4490,325.405,50.151,39.849,99.9918
747,748,1802,1017,4501,150.995,80.9888,9.01118,99.9162
748,749,596,3023,4499,148.882,30.0425,59.9575,99.9852
749,750,10341,1646,4526,330.016,6.80287,83.1971,99.8956
750,751,5514,1478,4547,334.847,72.7029,17.2971,99.6734
751,752,4442,878,4519,316.186,10.9805,79.0195,99.902
752,753,3693,3250,4529,333.65,21.1771,68.8229,99.8815
753,754,800,163,4527,305.842,45.0878,44.9122,99.9918
754,755,7759,389,4550,220.348,81.2688,8.73122,99.9497
755,756,3442,256,4547,310.558,43.3754,46.6246,99.9878
756,757,2670,987,4538,155.839,78.434,11.566,99.9841
757,758,7142,1665,4574,328.783,6.34739,83.6526,99.9811
758,759,2237,527,4560,214.924,80.9445,9.05551,99.9804
759,760,3266,754,4553,309.0420000000001,24.1471,65.8529,99.9903
760,761,24997,1406,4641,151.535,55.3942,34.6058,99.9532
761,762,617,221,4568,306.5540000000001,45.4317,44.5683,99.9774
762,763,1145,200,4573,307.192,45.7884,44.2116,99.991
763,764,32053,955,4628,158.012,76.7434,13.2566,99.9373
764,765,821,130,4562,138.697,20.5884,69.4116,99.9434
765,766,7746,3191,4600,156.59799999999996,30.9498,59.0502,99.9837
766,767,27123,1190,4643,145.537,27.9179,62.0821,99.9471
767,768,8053,2522,4600,144.542,17.5995,72.4005,99.9766
768,769,11743,786,4608,308.3,26.3149,63.6851,99.8901
769,770,1045,182,4586,306.515,46.0406,43.9594,99.9513
770,771,1519,1277,4569,296.888,78.4328,11.5672,99.9765
771,772,23654,583,4647,130.847,14.7409,75.2591,99.9224
772,773,5694,177,4649,307.5440000000001,36.414,53.58600000000001,99.8432
773,774,9369,395,4610,298.789,73.2254,16.7746,89.2964
774,775,639,669,4586,132.96,55.7317,34.2683,99.9913
775,776,7285,1542,4621,331.2940000000001,72.4572,17.5428,99.9136
776,777,760,1216,4591,317.466,29.169,60.831,99.9943
777,778,17898,3228,4661,326.3520000000001,15.1992,74.8008,98.7757
778,779,7530,1687,4622,322.297,67.081,22.919,99.9818
779,780,1456,2611,4610,313.555,26.0421,63.9579,99.9754
780,781,1177,256,4616,136.91899999999998,47.2777,42.7223,99.9917
781,782,2109,3091,4621,304.878,43.7802,46.2198,99.9263
782,783,4472,3418,4641,334.792,12.1706,77.8294,99.6872
783,784,15168,2606,4682,146.602,22.6297,67.3703,99.8982
784,785,543,324,4627,140.248,19.8767,70.1233,99.9358
785,786,4946,2444,4651,139.641,2.68762,87.3124,99.9587
786,787,963,309,4642,140.064,19.1388,70.8612,99.9753
787,788,10971,2868,4684,339.685,38.3566,51.6434,99.8792
788,789,7233,279,4678,137.009,21.3283,68.6717,99.8087
789,790,1054,128,4669,137.571,19.8836,70.1164,99.8879
790,791,3535,1703,4666,328.685,6.38811,83.6119,99.9706
791,792,1198,2321,4666,325.896,72.7142,17.2858,99.9514
792,793,1498,736,4670,307.889,29.3022,60.6978,99.9148
793,794,5067,416,4683,313.319,56.4694,33.5306,99.9618
794,795,753,1509,4677,331.116,77.7198,12.2801,99.9715
795,796,752,1569,4675,205.857,83.5129,6.48711,99.992
796,797,1747,2152,4693,332.325,74.3815,15.6185,99.9855
797,798,5036,2083,4709,144.381,18.2344,71.7656,99.8053
798,799,2713,2267,4695,327.535,72.9993,17.0007,99.965
799,800,601,1641,4688,318.173,46.0217,43.9783,99.9761
800,801,4159,1731,4706,147.751,21.5903,68.4097,99.9659
801,802,1691,3353,4694,149.838,4.2148400000000015,85.7852,99.9308
802,803,2059,1571,4711,321.823,48.4319,41.5681,99.8805
803,804,563,727,4701,309.751,29.0002,60.9998,99.9884
804,805,2812,1069,4709,139.304,31.258000000000006,58.742,99.7479
805,806,1537,2334,4710,155.615,28.2673,61.7327,99.8534
806,807,868,1152,4708,133.985,35.8718,54.1282,99.8174
807,808,1219,3062,4712,160.07,29.6308,60.3692,99.803
808,809,1119,3177,4708,155.403,25.4236,64.5764,99.9722
809,810,610,2997,4709,338.165,48.7952,41.2048,99.9703
810,811,726,3365,4710,142.036,11.2774,78.7226,99.9283
811,812,1486,2689,4729,143.185,26.4397,63.5603,99.1863
812,813,572,3276,4715,340.168,12.8697,77.1303,99.8377
813,814,1934,2457,4726,142.748,44.511,45.489,99.9266
814,815,765,3121,4721,155.787,33.2348,56.7652,99.9431
815,816,1774,2940,4736,339.405,56.4503,33.5497,99.2094
816,817,593,2028,4722,135.221,24.0715,65.9285,99.7936
817,818,961,2768,4739,327.59,48.9642,41.0358,99.7878
818,819,854,2854,4736,336.272,50.4472,39.5528,99.6706
819,820,673,2556,4744,138.219,21.7793,68.2207,99.606
