,Grain No.,Size [Pixel],center x-coordinate,center y-coordinate,mean azimuth [degree],mean latitude [degree],mean colatitude [degree],Regelungsgrad [%]
0,1,1652,293,245,306.749,37.7679,52.2321,99.9325
1,2,1173,412,232,132.842,20.0279,69.9721,99.9583
2,3,2319,505,241,141.659,17.1013,72.8987,99.9107
3,4,515,367,238,313.77,7.86884,82.1312,99.9922
4,5,2407,852,244,136.939,1.60994,88.3901,99.7196
5,6,1170,648,238,185.46,78.1549,11.8451,99.98
6,7,876,944,239,132.864,12.21,77.79,99.9397
7,8,1604,750,246,137.852,31.2645,58.7355,99.9705
8,9,14769,1089,291,166.081,85.4568,4.54323,99.9463
9,10,5230,593,304,314.314,4.18262,85.8174,99.928
10,11,687,1264,257,312.72,46.7478,43.2522,99.9897
11,12,691,1456,254,191.159,81.9441,8.05591,99.9933
12,13,6596,1401,278,320.363,13.1859,76.8141,99.136
13,14,17867,904,321,138.13,7.0685699999999985,82.9314,99.9969
14,15,5701,1820,291,140.262,7.52464,82.4754,99.9932
15,16,6840,1591,289,141.553,11.6311,78.3689,99.9577
16,17,578,1295,276,310.74,3.26428,86.7357,99.9779
17,18,16945,1663,334,318.564,13.0789,76.9211,99.7767
18,19,4230,1920,287,137.028,62.9438,27.0562,99.9668
19,20,39338,2078,392,319.747,15.1382,74.8618,87.3951
20,21,1019,1515,289,315.127,9.10201,80.898,99.9886
21,22,1453,1227,290,317.588,12.4441,77.5559,99.998
22,23,15617,520,359,300.641,63.4481,26.5519,99.4567
23,24,1212,995,300,320.778,1.07269,88.9273,99.9801
24,25,7135,760,316,137.942,19.6326,70.3674,99.9946
25,26,1373,2046,289,153.173,63.6298,26.3702,99.9865
26,27,19422,1236,348,137.681,14.4843,75.5157,99.965
27,28,8665,2144,313,135.571,10.1841,79.8159,99.9349
28,29,10468,2517,335,139.868,39.7148,50.2852,97.7247
29,30,11216,2311,315,137.623,26.4771,63.5229,99.9787
30,31,4009,670,319,185.683,76.6395,13.3605,99.9966
31,32,13333,2693,336,149.453,62.0522,27.9478,99.9921
32,33,1041,2861,301,306.972,67.0726,22.9274,99.9822
33,34,7712,1387,333,306.336,72.4513,17.5487,99.9949
34,35,952,823,320,321.336,9.78342,80.2166,99.999
35,36,13685,2962,366,315.831,65.6806,24.3194,99.8916
36,37,1017,265,327,138.216,32.9426,57.0574,99.7512
37,38,4317,2432,338,316.613,66.7105,23.2895,99.9943
38,39,601,2226,312,140.197,61.9014,28.0986,99.9949
39,40,782,2914,315,138.475,37.5772,52.4228,99.9742
40,41,11092,1503,374,123.356,75.5558,14.4442,99.7586
41,42,6718,3128,340,127.794,7.772480000000002,82.2275,99.9816
42,43,843,3370,315,316.481,13.7188,76.2812,99.9319
43,44,1611,3439,323,134.184,47.1354,42.8646,99.9771
44,45,1385,2801,331,312.57,63.1278,26.8722,99.9979
45,46,553,3050,318,321.0440000000001,5.85902,84.141,99.9774
46,47,2472,3282,319,313.143,35.2507,54.7493,99.958
47,48,1651,2595,342,141.279,23.8925,66.1075,99.9893
48,49,1740,2852,334,187.471,80.7763,9.22373,99.9967
49,50,10717,3538,363,315.199,62.4492,27.5508,99.9379
50,51,5745,1876,353,135.322,37.5836,52.4164,99.9913
51,52,2369,1768,345,309.836,57.3474,32.6526,99.9976
52,53,1311,697,354,138.30200000000002,25.488000000000003,64.512,99.9922
53,54,620,3436,342,135.213,46.6423,43.3577,99.9779
54,55,777,409,351,295.586,68.0936,21.9064,99.9767
55,56,2061,3065,368,137.326,32.1594,57.8406,99.9945
56,57,862,2345,353,314.882,63.0079,26.9921,99.9764
57,58,5136,988,399,309.107,44.0949,45.9051,96.2345
58,59,18949,1110,438,323.218,21.9511,68.0489,99.9884
59,60,889,1813,368,317.495,4.78634,85.2137,99.9984
60,61,6418,2833,387,141.255,47.2908,42.7092,99.9923
61,62,4215,3187,384,132.359,20.2186,69.7814,99.9933
62,63,6669,2381,404,137.429,40.7939,49.2061,99.9938
63,64,3109,3261,379,314.695,35.5802,54.4198,99.981
64,65,724,3453,382,283.84,78.0046,11.9954,99.9497
65,66,27821,763,446,143.078,31.9457,58.0543,99.8587
66,67,786,1041,366,328.971,58.7652,31.2348,99.9853
67,68,2204,384,398,120.153,56.0167,33.9833,99.972
68,69,12234,2592,440,299.652,51.1513,38.8487,99.9406
69,70,6734,618,424,310.18,47.7839,42.2161,99.9477
70,71,25534,1784,454,134.849,31.6502,58.3498,99.9637
71,72,6469,1394,400,134.502,23.609,66.391,99.9927
72,73,5953,3363,398,163.536,89.4442,0.555847,99.8307
73,74,951,2423,383,133.58100000000002,25.3564,64.6436,99.9962
74,75,544,2763,382,301.639,50.9806,39.0194,99.9942
75,76,3169,1653,402,310.2340000000001,36.8382,53.1618,99.9935
76,77,2536,2300,394,326.111,30.2196,59.7804,99.9992
77,78,10067,2484,466,309.998,20.7242,69.2758,99.908
78,79,3033,3034,418,131.22899999999998,10.5056,79.4944,99.993
79,80,926,2727,392,154.718,59.386,30.614,99.9981
80,81,2704,453,412,262.286,79.9829,10.0171,99.986
81,82,803,1920,401,148.463,69.5377,20.4623,99.8543
82,83,3345,906,423,331.714,59.3154,30.6846,99.9567
83,84,7274,1278,444,134.785,42.4855,47.5145,99.971
84,85,67461,3281,524,141.601,9.24569,80.7543,81.1143
85,86,1258,1167,430,277.184,85.0518,4.9482300000000015,99.9752
86,87,9953,2729,453,138.944,46.7091,43.2909,99.9967
87,88,110896,1418,630,309.094,38.981,51.019,18.8089
88,89,5411,3497,467,325.836,28.6518,61.3482,99.8351
89,90,4003,2906,443,321.21,40.4151,49.5849,99.989
90,91,7123,1922,452,133.401,61.3156,28.6844,99.9868
91,92,2656,1603,446,154.731,78.194,11.806,99.9977
92,93,973,3414,430,140.605,51.3138,38.6862,99.9838
93,94,788,2187,433,268.86,78.4308,11.5692,99.9939
94,95,995,2640,437,156.062,55.2539,34.7461,99.9982
95,96,28562,2311,512,142.195,18.6687,71.3313,96.6428
96,97,1384,2826,435,150.451,48.2513,41.7487,99.984
97,98,6309,2195,476,324.555,5.03737,84.9626,99.9626
98,99,1197,1650,453,154.205,43.8925,46.1075,99.9918
99,100,2370,3345,459,136.483,17.8567,72.1433,99.9802
100,101,1411,3661,466,321.942,30.6644,59.3356,99.8956
101,102,1695,999,461,320.046,55.8164,34.1836,99.9718
102,103,1075,412,459,144.658,1.73355,88.2664,99.9025
103,104,3653,927,470,315.534,5.45012,84.5499,99.9959
104,105,26772,2962,552,296.4190000000001,77.3198,12.6802,68.6606
105,106,653,3525,460,145.799,50.5293,39.4707,99.9782
106,107,8405,430,506,138.075,11.3405,78.6595,99.3401
107,108,1352,514,464,268.706,78.9957,11.0043,99.9936
108,109,1907,623,472,129.02,17.256,72.744,99.9941
109,110,12022,2809,515,318.117,58.7519,31.2481,99.9633
110,111,10893,900,530,318.301,21.0286,68.9714,99.8953
111,112,9556,2028,534,140.366,25.0029,64.9971,99.8002
112,113,13814,1686,548,313.837,66.9868,23.0132,99.9123
113,114,1378,542,499,135.315,16.0749,73.9251,99.9815
114,115,9269,1054,534,135.69299999999998,10.6807,79.3193,99.8924
115,116,4133,646,512,309.858,46.9187,43.0813,93.3661
116,117,85835,2528,678,136.004,23.1062,66.8938,87.8046
117,118,2831,1849,530,317.558,24.924,65.07600000000001,99.8475
118,119,906,2568,524,315.585,62.4484,27.5516,99.9258
119,120,1425,2124,530,155.583,79.9213,10.0787,99.8869
120,121,4281,1587,544,314.482,45.3929,44.6071,99.9862
121,122,3739,561,572,309.585,51.1435,38.8565,99.9397
122,123,978,529,539,307.9190000000001,51.4226,38.5774,99.9927
123,124,1219,1906,533,134.749,62.8354,27.1646,99.9406
124,125,1354,3662,554,320.756,31.6832,58.3168,99.8765
125,126,33351,3504,725,138.662,31.451,58.549,80.3973
126,127,40563,449,676,138.755,57.8819,32.1181,49.9679
127,128,7144,657,582,139.488,18.4012,71.5988,99.9396
128,129,4142,3096,567,137.763,2.62361,87.3764,99.9155
129,130,4420,824,570,314.504,6.25156,83.7484,99.9958
130,131,3254,1011,579,256.653,82.3484,7.651569999999999,99.9931
131,132,2109,2134,577,294.217,75.8355,14.1645,99.9741
132,133,590,1901,567,314.817,27.4578,62.5422,99.9882
133,134,11975,1987,628,315.065,48.11600000000001,41.88399999999999,99.8875
134,135,13205,1836,660,127.281,66.327,23.673,99.9907
135,136,5911,3179,615,141.126,73.2075,16.7925,99.9743
136,137,4406,747,606,273.04200000000003,82.7197,7.28025,99.9843
137,138,10031,2847,635,149.352,19.1476,70.8524,99.9939
138,139,4164,1798,603,309.334,48.2366,41.7634,99.9964
139,140,23427,879,658,134.19299999999998,49.7242,40.2758,99.9952
140,141,8886,2286,628,141.768,24.6592,65.3408,99.9908
141,142,682,2196,592,286.5490000000001,76.4783,13.5217,99.9733
142,143,2161,2159,608,317.8,0.6397550000000001,89.3602,99.9975
143,144,4231,2074,615,313.043,30.8691,59.1309,99.9718
144,145,1148,1093,602,156.00799999999995,78.2576,11.7424,99.9971
145,146,4978,597,629,144.588,0.44239,89.5576,99.9963
146,147,16268,3284,664,282.2870000000001,81.5883,8.411719999999999,99.9824
147,148,47103,1022,766,137.418,39.2775,50.7225,63.3785
148,149,615,1135,610,146.151,51.0969,38.9031,99.9939
149,150,42974,3156,757,319.151,2.90205,87.0979,99.9409
150,151,1260,1719,615,313.083,47.0604,42.9396,99.9483
151,152,799,1058,613,147.576,50.5399,39.4601,99.9969
152,153,2451,2363,632,140.638,49.9001,40.0999,99.9837
153,154,8117,1623,650,134.514,8.11323,81.8868,99.8395
154,155,3416,2776,634,18.7375,87.5529,2.44709,99.9941
155,156,561,1244,616,314.1620000000001,18.562,71.438,99.6724
156,157,9680,2205,683,135.821,9.16969,80.8303,99.9992
157,158,1301,258,639,135.274,28.0398,61.9602,99.8451
158,159,3210,3646,690,139.749,1.82192,88.1781,99.7902
159,160,3738,1424,656,313.936,32.4845,57.5155,99.994
160,161,9271,1718,684,314.584,27.1549,62.8451,99.9395
161,162,24573,2754,716,325.444,55.8543,34.1457,99.1267
162,163,20567,1221,702,311.1740000000001,30.8952,59.1048,99.9941
163,164,5015,2109,674,306.458,48.0477,41.9523,99.9934
164,165,7873,635,687,316.377,43.2561,46.7439,99.9133
165,166,529,2906,645,136.04,15.5311,74.4689,99.9972
166,167,2543,545,684,318.303,6.5952199999999985,83.4048,99.9971
167,168,1768,718,660,314.379,17.6589,72.3411,99.9976
168,169,39940,2954,804,290.888,67.7841,22.2159,97.0221
169,170,43361,1969,791,139.805,13.357,76.643,83.2139
170,171,3044,1366,692,147.299,70.1874,19.8126,99.8633
171,172,7793,2346,717,312.159,13.4626,76.5374,99.9962
172,173,3969,2919,699,313.797,73.214,16.785999999999998,99.9716
173,174,20826,789,757,134.364,17.8493,72.1507,99.9991
174,175,593,1628,694,312.427,12.7816,77.2184,99.998
175,176,2482,1321,727,158.194,62.7135,27.2865,99.886
176,177,15004,2263,788,304.82,47.0485,42.9515,99.9815
177,178,5843,2122,744,312.771,30.397,59.603,99.993
178,179,8667,1650,761,313.083,13.5789,76.4211,99.9851
179,180,13867,3323,780,282.783,87.2412,2.75882,100.008
180,181,2582,3420,753,320.806,3.3533800000000005,86.6466,99.9439
181,182,2090,674,756,321.093,16.277,73.723,99.992
182,183,607,1813,746,146.202,25.2661,64.7339,99.9866
183,184,845,3661,762,132.02200000000002,3.76112,86.2389,99.7884
184,185,15124,610,829,320.722,11.702,78.298,99.773
185,186,2397,910,772,317.918,7.59023,82.4098,99.996
186,187,4999,3088,790,315.233,29.9417,60.0583,99.9638
187,188,3620,374,773,321.062,52.2963,37.7037,99.9587
188,189,3520,1773,779,139.797,27.0647,62.9353,99.9798
189,190,2744,1840,782,312.897,86.3668,3.63319,99.984
190,191,2833,721,791,135.778,28.9117,61.0883,99.9969
191,192,6270,2627,809,142.457,11.1837,78.8163,99.9848
192,193,2223,1319,793,293.659,57.0591,32.9409,99.9973
193,194,3257,2686,806,308.335,59.8452,30.1548,99.9959
194,195,21335,2165,871,322.257,16.5892,73.4108,97.2818
195,196,4714,1274,816,141.941,13.833,76.167,99.9819
196,197,34824,1691,877,139.224,11.1993,78.8007,98.9378
197,198,1021,2766,791,323.201,17.222,72.778,99.9988
198,199,7020,414,841,323.6670000000001,67.0064,22.9936,99.9936
199,200,2569,1181,806,134.709,9.86067,80.1393,99.987
200,201,1964,1872,827,316.015,27.5692,62.4308,99.9935
201,202,10384,3397,869,323.16,21.6571,68.3429,99.8539
202,203,6745,2741,853,129.034,16.0848,73.9152,99.9978
203,204,5218,2369,846,319.382,73.4101,16.5899,99.9913
204,205,1577,355,824,130.639,22.4211,67.5789,99.9659
205,206,51564,683,993,137.648,0.239944,89.7601,97.9287
206,207,965,304,835,324.389,66.7796,23.2204,99.9572
207,208,2466,897,834,138.644,80.7249,9.27506,99.9414
208,209,7251,542,880,306.944,2.63007,87.3699,99.9072
209,210,1060,1780,843,308.571,46.5164,43.4836,99.9931
210,211,8553,2553,857,314.188,68.5,21.5,99.9887
211,212,15443,1172,871,313.379,33.1654,56.8346,99.9366
212,213,6280,1052,901,309.1,8.88866,81.1113,99.9857
213,214,1277,834,848,143.46200000000005,40.4915,49.5085,99.9732
214,215,1670,1886,860,140.099,40.9372,49.0628,99.9568
215,216,3447,481,878,319.405,31.5367,58.4633,99.9802
216,217,2336,3651,879,315.497,0.948883,89.0511,99.9079
217,218,1605,1318,872,121.1,6.399769999999998,83.6002,99.9971
218,219,1327,3314,869,147.466,54.4467,35.5533,99.9989
219,220,12422,2956,930,322.243,8.869069999999997,81.1309,99.9347
220,221,902,249,873,315.769,18.247,71.753,99.8629
221,222,4298,2313,895,323.646,3.52619,86.4738,99.937
222,223,22610,2703,935,317.377,8.935,81.065,99.1341
223,224,2473,368,898,131.739,0.5703739999999999,89.4296,99.8657
224,225,9969,852,918,324.393,11.1785,78.8215,99.984
225,226,792,1360,871,125.453,1.8181,88.1819,99.9907
226,227,3608,1446,885,145.923,70.4122,19.5878,99.9931
227,228,2175,1278,894,151.03,76.6828,13.3172,99.9946
228,229,6099,2399,932,133.656,10.8089,79.1911,99.954
229,230,5530,3500,914,192.72,71.1507,18.8493,99.976
230,231,12358,1542,948,34.9098,82.786,7.21395,99.9873
231,232,8135,1403,930,137.674,26.8446,63.1554,99.9853
232,233,2035,1878,910,319.818,46.4599,43.5401,99.9953
233,234,648,2058,905,153.85,47.4225,42.5775,99.9369
234,235,1014,439,908,316.62,29.8212,60.1788,99.9791
235,236,556,1325,910,320.681,15.375,74.625,99.9943
236,237,674,252,911,234.313,85.4852,4.5147900000000005,99.982
237,238,7290,3114,960,321.185,15.8258,74.1742,99.0736
238,239,7712,3259,942,317.277,38.3138,51.6862,99.4643
239,240,2913,3033,917,319.125,16.6065,73.3935,99.9867
240,241,634,2558,907,141.594,32.4636,57.5364,99.9986
241,242,2321,1105,933,303.275,27.044,62.956,99.9886
242,243,5962,364,959,135.753,5.93266,84.0673,99.9612
243,244,636,3195,919,276.337,80.2039,9.79605,99.9964
244,245,5429,3346,958,131.431,19.9588,70.0412,99.9787
245,246,4598,1830,945,318.418,35.6591,54.3409,99.9955
246,247,6838,463,961,316.755,50.8722,39.1278,99.9572
247,248,7189,1259,969,310.431,8.81655,81.1834,99.4757
248,249,1951,2862,948,105.618,80.8176,9.18243,99.9883
249,250,11316,2370,1012,314.6740000000001,54.971,35.029,99.7302
250,251,5678,2571,978,315.995,34.0822,55.9178,99.9262
251,252,2554,1939,948,318.708,31.5374,58.4626,99.9908
252,253,5004,1175,967,321.563,2.98977,87.0102,99.9418
253,254,2027,2043,953,319.663,25.599,64.40100000000001,99.892
254,255,8950,2487,994,131.671,20.4307,69.5693,99.5806
255,256,26514,2146,1006,133.19299999999998,9.04848,80.9515,99.1301
256,257,949,2184,947,307.708,49.6905,40.3095,99.9887
257,258,2158,2915,1000,129.586,82.6633,7.33672,99.8665
258,259,854,3067,948,321.897,53.758,36.242,99.9871
259,260,1574,1338,961,123.641,69.1584,20.8416,99.993
260,261,1247,2217,962,306.817,26.6905,63.3095,99.9471
261,262,1335,601,959,321.733,27.5117,62.4883,99.9941
262,263,4233,3530,983,133.273,16.7251,73.2749,99.9046
263,264,2291,1868,995,145.202,73.8403,16.1596,99.9154
264,265,745,1775,961,128.513,5.89452,84.1055,99.9824
265,266,721,3174,960,133.998,16.0129,73.9871,99.9979
266,267,5104,3434,976,315.0440000000001,20.5057,69.4943,99.9573
267,268,13951,2813,1048,132.211,82.7428,7.25718,99.6016
268,269,5059,888,1005,139.906,15.2224,74.7776,99.9194
269,270,2470,1744,991,140.95,12.3092,77.6908,99.9848
270,271,26220,2007,1131,317.833,1.04726,88.9527,98.1555
271,272,1549,559,981,313.57,13.4495,76.5505,99.9916
272,273,1566,947,977,140.11700000000002,6.32568,83.6743,99.9844
273,274,17530,1101,1036,150.386,39.1891,50.8109,67.3449
274,275,25197,1356,1065,319.075,23.5574,66.4426,99.7351
275,276,4797,1673,1015,317.252,14.9418,75.0582,99.8922
276,277,3544,806,1005,315.213,0.156418,89.8436,99.9182
277,278,4858,1479,1036,141.86,10.9059,79.0941,99.8399
278,279,1178,1796,985,122.11,2.82783,87.1722,99.9955
279,280,1132,2619,990,311.072,52.7481,37.2519,99.9922
280,281,627,1599,993,327.64,20.7595,69.2405,99.9954
281,282,3308,499,1017,315.642,31.1986,58.8014,99.7214
282,283,1324,241,1003,306.622,35.8859,54.1141,99.7239
283,284,11798,965,1059,318.553,20.1094,69.8906,99.574
284,285,5428,3150,1035,315.814,13.0964,76.9036,99.1776
285,286,2240,3019,1013,323.235,28.355,61.645,99.9622
286,287,6779,3247,1027,312.2390000000001,1.1618,88.8382,99.9884
287,288,3753,397,1029,306.617,21.2983,68.7017,99.9864
288,289,1112,1618,1015,140.578,14.3938,75.6062,99.9853
289,290,6010,2732,1035,134.81799999999998,4.416530000000002,85.5835,83.764
290,291,742,315,1012,313.326,71.6392,18.3608,99.9665
291,292,1731,1255,1025,137.19799999999998,14.4404,75.5596,99.9771
292,293,6090,3345,1042,327.8119999999999,11.5375,78.4625,99.7518
293,294,1399,746,1020,147.23,50.5357,39.4643,99.9967
294,295,7481,1756,1065,312.265,13.0917,76.9083,99.1268
295,296,1491,3413,1028,309.69,50.5111,39.4889,99.9604
296,297,1404,1564,1032,147.452,69.9645,20.0355,99.9522
297,298,964,2312,1041,144.263,12.9008,77.0992,99.818
298,299,42840,3468,1264,140.82399999999996,2.73717,87.2628,82.2348
299,300,738,1887,1033,145.268,8.942169999999997,81.0578,99.9581
300,301,530,3049,1033,338.017,22.2136,67.7864,99.9371
301,302,7176,2624,1082,317.775,35.9654,54.0346,99.9562
302,303,17721,2438,1126,142.64600000000004,4.84858,85.1514,89.1547
303,304,14623,3001,1101,316.232,42.598,47.402,60.0504
304,305,1742,3094,1055,314.824,9.40546,80.5945,96.5842
305,306,7863,841,1091,74.6987,86.9077,3.09231,99.9765
306,307,8719,1867,1095,149.034,79.1541,10.8459,99.9839
307,308,5420,2894,1094,318.805,3.55627,86.4437,99.9819
308,309,2548,1674,1066,323.502,52.025,37.975,99.9023
309,310,2134,1799,1071,308.032,1.62818,88.3718,99.9926
310,311,1328,417,1065,149.81,76.5765,13.4235,99.9961
311,312,7812,1221,1094,304.52,54.6099,35.3901,99.9964
312,313,6675,468,1107,114.646,76.705,13.295,99.8723
313,314,11767,1617,1129,316.464,7.73782,82.2622,99.6527
314,315,7735,2202,1097,74.8765,74.0114,15.9886,99.9805
315,316,557,360,1062,135.46200000000002,77.1029,12.8971,99.9969
316,317,2731,1517,1099,332.101,54.7059,35.2941,99.9812
317,318,924,2267,1074,321.502,47.5007,42.4993,99.9959
318,319,8005,3285,1107,263.886,77.765,12.235,100.0
319,320,675,3650,1077,189.229,70.8945,19.1055,99.9658
320,321,1147,2525,1079,137.42,15.9216,74.0784,99.9806
321,322,2040,2097,1083,319.23,11.1171,78.8829,99.9934
322,323,2392,3406,1098,315.905,9.3581,80.6419,99.9786
323,324,1054,335,1090,137.113,33.6762,56.3238,99.9725
324,325,4730,2311,1107,148.086,49.9772,40.0228,99.9741
325,326,990,2696,1089,335.93300000000005,80.8548,9.14516,99.996
326,327,2974,1087,1110,316.747,12.1468,77.8532,99.9916
327,328,614,3568,1092,141.928,4.58726,85.4127,99.9155
328,329,579,1477,1095,324.047,6.4221900000000005,83.5778,99.9978
329,330,761,1041,1093,322.092,14.9472,75.0528,99.9939
330,331,1708,3217,1111,313.856,20.9588,69.0412,99.9966
331,332,695,294,1100,308.475,10.1268,79.8732,99.9644
332,333,833,1546,1109,122.342,72.0529,17.9471,99.9962
333,334,758,2723,1105,319.987,16.692,73.308,99.9988
334,335,6273,394,1132,268.742,78.0637,11.9363,99.9942
335,336,15839,3096,1169,318.401,43.4413,46.5587,98.8499
336,337,1213,3533,1111,140.056,30.0578,59.9422,99.981
337,338,686,2055,1110,312.076,37.4863,52.5137,99.9929
338,339,13181,568,1170,133.498,1.47076,88.5292,98.9525
339,340,8825,2553,1150,318.824,84.02600000000002,5.9739900000000015,99.9928
340,341,52903,1461,1291,137.659,12.6137,77.3863,87.1376
341,342,7347,909,1150,326.074,28.2148,61.7852,99.9868
342,343,7040,734,1152,309.988,34.4611,55.5389,99.996
343,344,530,1789,1114,128.14600000000002,22.9351,67.0649,99.9955
344,345,1334,2852,1127,322.815,19.487,70.513,99.9887
345,346,7195,1011,1156,313.413,46.9571,43.0429,99.9846
346,347,4096,3366,1142,315.382,0.21675100000000005,89.7832,99.8487
347,348,673,2121,1131,74.6561,73.1742,16.8258,99.9689
348,349,1223,2687,1134,318.118,26.7769,63.2231,99.9804
349,350,540,3648,1135,137.39600000000002,64.419,25.581,99.9523
350,351,1281,1693,1141,142.16,52.7482,37.2518,99.9728
351,352,3489,1759,1157,323.5540000000001,2.56063,87.4394,99.9974
352,353,10205,2819,1172,132.495,7.38651,82.6135,99.9938
353,354,867,1900,1135,314.059,2.89286,87.1071,99.9939
354,355,19839,2730,1224,142.101,27.0682,62.9318,99.3602
355,356,4975,2170,1159,311.356,29.7513,60.2487,99.995
356,357,2438,1180,1152,315.248,16.0747,73.9253,99.5918
357,358,4282,1562,1164,133.937,0.11837,89.8816,99.3863
358,359,3066,2941,1164,319.952,50.32899999999999,39.671,99.9767
359,360,15693,1910,1262,318.692,8.976180000000003,81.0238,99.2877
360,361,1361,1934,1156,149.72,13.4045,76.5955,99.9943
361,362,525,3193,1148,131.094,1.06635,88.9336,99.9966
362,363,763,1353,1154,134.577,32.7235,57.2765,99.9938
363,364,552,1427,1154,134.526,21.1883,68.8117,99.9956
364,365,2984,3538,1188,317.376,46.8527,43.1473,99.9623
365,366,3839,1104,1176,291.555,79.7694,10.2306,99.9979
366,367,3249,796,1182,129.54,51.6415,38.3585,99.9704
367,368,4527,3231,1184,323.51,9.60722,80.3928,99.9825
368,369,992,3294,1160,316.9170000000001,60.7419,29.2581,99.9975
369,370,953,342,1166,141.661,26.0493,63.9507,99.9867
370,371,1250,1895,1175,136.284,6.4661300000000015,83.5339,99.9756
371,372,2966,2299,1180,156.91299999999995,58.4475,31.5525,99.9288
372,373,1517,854,1183,325.946,4.05772,85.9423,99.9892
373,374,8498,1204,1211,301.585,78.5895,11.4105,99.9975
374,375,1303,1263,1175,142.171,18.6068,71.3932,99.9394
375,376,2212,1056,1208,322.334,52.1189,37.8811,99.9805
376,377,2942,3401,1200,312.06,35.5979,54.4021,99.9922
377,378,3116,1306,1198,139.336,32.8049,57.1951,99.9627
378,379,5706,3326,1215,142.486,19.4731,70.5269,99.9494
379,380,11265,382,1220,140.546,34.6525,55.3475,99.8885
380,381,2118,954,1208,318.684,7.58236,82.4176,99.9448
381,382,2683,2396,1203,138.313,22.5141,67.4859,99.9939
382,383,11895,2196,1243,323.24,3.93098,86.069,99.6839
383,384,1236,3179,1201,312.028,1.08552,88.9145,99.9984
384,385,2284,2908,1211,120.42,7.7423,82.2577,99.9835
385,386,7278,1796,1239,137.685,54.2865,35.7135,99.9887
386,387,1870,1680,1235,147.02100000000004,53.9247,36.0753,99.784
387,388,2177,1733,1202,340.13699999999994,63.8431,26.1569,99.9984
388,389,1642,503,1214,236.465,77.1767,12.8233,99.9903
389,390,5738,723,1229,183.906,74.2624,15.7376,99.9947
390,391,722,2289,1204,94.4298,74.1405,15.8595,99.9911
391,392,2398,2563,1218,321.356,10.0332,79.9668,99.9912
392,393,7811,1604,1254,301.683,62.332,27.668000000000006,99.9614
393,394,2092,3132,1230,148.382,52.9041,37.0959,99.9983
394,395,7968,850,1234,166.19400000000005,78.9421,11.0579,99.94
395,396,2251,2509,1237,151.25,7.04967,82.9503,99.9778
396,397,1044,2961,1220,157.115,5.72164,84.2784,99.9969
397,398,551,2655,1215,319.378,34.1082,55.8918,99.9917
398,399,517,3290,1220,326.421,37.7359,52.2641,99.9943
399,400,1465,1128,1233,128.118,9.04332,80.9567,99.9897
400,401,7370,1704,1280,136.093,16.0291,73.9709,99.8935
401,402,4253,2592,1255,147.031,43.7696,46.2304,99.9725
402,403,3154,959,1257,322.498,9.54023,80.4598,95.4765
403,404,1552,584,1237,307.985,1.88976,88.1102,99.9981
404,405,559,1013,1228,310.009,17.035,72.965,99.9927
405,406,10681,661,1296,320.45,15.7014,74.2986,99.9841
406,407,5417,2324,1244,312.433,1.80802,88.19200000000002,96.8276
407,408,15423,2921,1306,140.718,59.2983,30.7017,84.4593
408,409,1427,1093,1250,284.428,73.0197,16.9803,99.9934
409,410,3230,3373,1277,315.059,30.9734,59.0266,99.939
410,411,43346,2531,1491,134.811,2.17372,87.8263,97.1166
411,412,609,545,1235,138.52,14.0688,75.9312,99.9909
412,413,6346,3179,1267,136.111,5.28625,84.7138,99.9998
413,414,2789,2418,1259,313.149,58.197,31.803,99.9974
414,415,1768,485,1257,312.91,57.8113,32.1887,99.9911
415,416,4296,2092,1260,320.847,15.7732,74.2268,99.9915
416,417,1342,3654,1256,317.073,45.2162,44.7838,99.9345
417,418,3023,2651,1268,320.869,37.0364,52.9636,99.5623
418,419,3340,3265,1273,319.507,6.39915,83.6008,98.6057
419,420,2421,363,1256,144.211,27.4654,62.5346,99.9948
420,421,35092,1805,1423,319.657,4.75606,85.2439,99.2442
421,422,4963,1033,1277,306.757,46.9182,43.0818,99.9938
422,423,2539,3540,1268,319.802,25.5311,64.4689,99.9683
423,424,864,521,1261,189.701,82.234,7.76598,99.9801
424,425,1828,1540,1269,322.453,67.9167,22.0833,99.9879
425,426,2902,1186,1276,139.336,10.0336,79.9664,99.9357
426,427,1191,2876,1267,144.833,72.0229,17.9771,99.9959
427,428,7826,1286,1312,314.1740000000001,27.7025,62.2975,99.9363
428,429,9366,2016,1324,328.587,10.3858,79.6142,60.0058
429,430,17727,483,1319,314.578,16.396,73.604,98.0884
430,431,5611,3074,1285,139.188,18.3224,71.6776,99.9936
431,432,5307,1140,1305,334.191,71.4296,18.5704,99.9849
432,433,702,600,1283,316.875,23.7547,66.2453,99.9778
433,434,6229,845,1291,140.308,8.93024,81.0698,99.7979
434,435,2728,759,1296,311.033,4.11409,85.8859,99.9156
435,436,1875,2251,1291,138.839,55.4048,34.5952,99.9842
436,437,1281,3327,1283,322.048,8.48272,81.5173,99.6009
437,438,7375,2346,1303,319.579,7.542160000000001,82.4578,99.9426
438,439,4461,328,1307,320.691,0.396271,89.6037,99.9729
439,440,3949,2551,1322,132.664,14.8158,75.1842,99.9809
440,441,542,2829,1294,331.561,69.163,20.837,99.6931
441,442,5266,1079,1338,134.25,5.32644,84.6736,99.8712
442,443,11768,2126,1345,318.375,3.75283,86.2472,99.658
443,444,2483,2783,1320,312.577,33.0738,56.9262,99.994
444,445,11074,951,1353,146.256,15.8938,74.1062,96.1302
445,446,11568,1221,1375,144.023,0.187111,89.8129,99.913
446,447,2444,3220,1320,145.239,14.3464,75.6536,99.9977
447,448,8979,1777,1350,320.119,21.9943,68.0057,99.6771
448,449,987,3026,1321,135.922,2.15499,87.845,99.9929
449,450,2364,1626,1325,316.816,10.2983,79.7017,99.9959
450,451,567,1572,1310,137.67,46.0264,43.9736,99.9956
451,452,3336,725,1337,198.209,74.5033,15.4967,99.9983
452,453,6217,2624,1346,142.336,34.6125,55.3875,99.9684
453,454,5210,3316,1341,306.827,38.1384,51.8616,99.9945
454,455,1188,3140,1323,319.773,47.5198,42.4802,99.9981
455,456,2034,2211,1327,316.273,5.84795,84.1521,99.6333
456,457,2953,3424,1338,156.95600000000005,62.7053,27.2947,99.9932
457,458,4436,2722,1344,331.1090000000001,48.0363,41.9637,99.9964
458,459,9038,2441,1369,145.781,22.37,67.63,99.9664
459,460,1190,601,1333,150.203,58.5735,31.4265,99.9927
460,461,1716,1727,1342,141.411,40.7898,49.2102,99.9991
461,462,12710,813,1385,317.398,55.7734,34.2266,99.9564
462,463,632,1017,1332,321.672,17.5114,72.4886,99.9925
463,464,4514,2960,1374,313.86,17.0641,72.9359,99.9752
464,465,2087,3097,1339,131.596,24.6337,65.3663,99.9949
465,466,10225,2262,1373,151.135,13.4212,76.5788,97.2782
466,467,12274,3232,1413,319.212,0.153389,89.8466,99.8963
467,468,1267,1554,1359,325.828,25.071,64.929,99.9825
468,469,2849,3174,1361,134.403,19.5829,70.4171,99.9976
469,470,1445,1365,1354,319.91,3.08608,86.9139,99.9681
470,471,6583,388,1377,317.828,8.10057,81.8994,99.9915
471,472,515,3369,1354,313.171,13.4959,76.5041,99.9669
472,473,8697,622,1410,321.393,21.0247,68.9753,99.9661
473,474,730,336,1357,312.9890000000001,13.9241,76.0759,99.9949
474,475,15261,3063,1410,313.079,31.9711,58.0289,99.6923
475,476,1045,1687,1362,134.346,50.9077,39.0923,99.9836
476,477,31540,2290,1482,140.649,5.56242,84.4376,98.8986
477,478,2150,1130,1380,167.55,83.3671,6.63294,99.9952
478,479,566,1657,1367,316.903,14.9542,75.0458,99.9944
479,480,12033,1331,1438,138.372,13.7425,76.2575,99.5958
480,481,512,3658,1383,256.79900000000004,14.7996,75.2004,99.9897
481,482,3143,1391,1397,321.546,19.7682,70.2318,99.6826
482,483,7533,714,1424,312.206,17.7944,72.2056,99.9803
483,484,1142,324,1395,319.582,38.783,51.217,99.9915
484,485,567,2570,1385,141.726,16.5353,73.4647,99.9919
485,486,6717,2085,1418,316.337,43.8418,46.1582,99.9718
486,487,696,3339,1385,149.755,20.9643,69.0357,99.9977
487,488,14409,2731,1454,317.789,38.2619,51.7381,99.9567
488,489,4792,530,1418,158.10399999999996,53.8747,36.1253,99.9491
489,490,2985,1069,1416,142.418,12.6332,77.3668,99.9774
490,491,2542,2827,1401,322.879,12.4761,77.5239,99.9651
491,492,1343,1921,1401,160.959,57.0783,32.9217,99.9933
492,493,6494,2648,1419,143.958,11.7859,78.2141,99.9096
493,494,21094,2947,1485,139.01,9.0295,80.9705,99.439
494,495,3250,1643,1409,258.175,66.2628,23.7372,99.9732
495,496,2100,933,1408,317.183,6.9759600000000015,83.024,99.9951
496,497,2236,1007,1433,142.657,1.7461099999999998,88.2539,99.8161
497,498,3914,447,1431,140.787,58.4601,31.5399,99.9575
498,499,9246,3327,1480,139.601,29.7069,60.2931,99.9554
499,500,1690,1448,1421,138.983,30.2356,59.7644,99.9753
500,501,3089,2408,1427,309.455,64.6479,25.3521,99.9777
501,502,962,3544,1433,153.351,81.9787,8.02125,99.9834
502,503,7035,1148,1438,143.19799999999995,78.2924,11.7076,99.991
503,504,2955,1953,1447,321.631,33.7832,56.2168,99.9512
504,505,2641,317,1444,316.506,48.2652,41.7348,99.9265
505,506,742,3378,1423,313.874,7.79678,82.2032,99.7785
506,507,11013,816,1486,307.703,35.9595,54.0405,99.9108
507,508,2028,2000,1456,159.925,57.2354,32.7646,99.9289
508,509,545,2991,1437,152.876,84.0157,5.98425,99.9731
509,510,1008,3628,1441,324.826,15.7986,74.2014,99.9571
510,511,1051,3145,1442,147.951,27.3561,62.6439,99.9672
511,512,1571,389,1438,321.403,38.3302,51.6698,99.9479
512,513,5514,924,1466,134.143,27.7927,62.2073,99.9774
513,514,8357,1026,1489,139.249,6.45789,83.5421,99.9624
514,515,1983,1629,1472,138.703,25.1323,64.8677,99.9911
515,516,1826,2063,1456,134.226,14.4437,75.5563,99.9785
516,517,14135,633,1516,211.036,83.2619,6.738110000000002,96.4805
517,518,1347,1488,1465,310.615,20.3109,69.6891,99.9868
518,519,60278,1940,1692,138.96,19.3929,70.6071,97.5075
519,520,649,2373,1459,320.427,12.06,77.94,99.9896
520,521,816,3506,1457,137.158,4.94503,85.055,99.9876
521,522,1548,3386,1476,134.533,1.57938,88.4206,99.9914
522,523,10293,344,1511,135.966,51.4279,38.5721,85.2387
523,524,19193,494,1540,315.964,0.368034,89.632,99.8716
524,525,1646,2123,1477,308.024,43.2376,46.7624,99.9889
525,526,707,242,1481,314.194,49.0093,40.9907,99.6793
526,527,785,1361,1481,134.798,53.633,36.367,99.9946
527,528,2957,1587,1491,192.989,87.2922,2.70783,99.9981
528,529,14808,3140,1524,133.75,35.7024,54.2976,99.9328
529,530,973,3472,1484,141.839,24.0791,65.9209,99.9684
530,531,4853,1490,1519,137.005,31.0173,58.9827,99.9187
531,532,1866,2052,1491,321.55,6.0946,83.9054,99.9873
532,533,1780,3521,1493,220.746,66.0543,23.9457,99.9946
533,534,2160,1206,1497,314.736,41.358,48.642,99.9409
534,535,1633,1541,1502,328.555,20.9465,69.0535,99.388
535,536,1320,2871,1496,307.371,59.9343,30.0657,99.9901
536,537,3938,1706,1503,316.008,31.4553,58.5447,99.9735
537,538,2422,1263,1513,134.309,22.3401,67.6599,99.9356
538,539,883,1136,1489,159.833,87.9557,2.0443,99.9625
539,540,7911,3255,1571,314.752,6.51952,83.4805,89.7994
540,541,14524,2761,1574,144.191,2.94872,87.0513,99.7084
541,542,1798,3453,1514,325.257,27.3611,62.6389,99.9877
542,543,1375,1438,1520,308.59,18.1098,71.8902,99.9394
543,544,1449,1393,1504,151.02,70.3231,19.6769,99.9547
544,545,667,3637,1516,142.813,81.2268,8.77317,99.9829
545,546,29633,2107,1603,310.969,28.537,61.463,99.8828
546,547,15056,1026,1573,314.755,24.9421,65.0579,83.43299999999998
547,548,1629,2422,1523,138.754,22.1839,67.8161,99.9298
548,549,3632,2928,1541,312.147,66.1148,23.8852,99.9214
549,550,6397,874,1572,123.447,3.12029,86.8797,99.9875
550,551,2753,1612,1543,137.689,15.765999999999998,74.234,99.975
551,552,892,1171,1528,134.599,35.5943,54.4057,99.977
552,553,633,2884,1529,277.982,73.9918,16.0082,99.9859
553,554,6527,2662,1557,148.033,32.6136,57.3864,99.7423
554,555,788,3507,1530,318.369,8.946069999999997,81.0539,99.9941
555,556,824,3540,1540,326.387,54.291,35.709,99.9606
556,557,1727,749,1549,129.16299999999998,26.7435,63.2565,99.9918
557,558,5264,3416,1564,320.644,9.85882,80.1412,99.915
558,559,2774,1320,1553,134.629,51.1994,38.8006,99.9865
559,560,820,675,1549,131.773,23.0787,66.9213,99.9938
560,561,568,1128,1546,134.46,37.3396,52.6604,99.9926
561,562,768,1197,1553,139.591,3.35904,86.641,99.9962
562,563,642,1409,1551,147.752,73.464,16.535999999999998,99.9909
563,564,4239,253,1583,310.107,4.6143800000000015,85.3856,99.9679
564,565,2518,2241,1570,316.624,20.307,69.693,99.9853
565,566,7981,1240,1590,312.185,27.0042,62.9958,99.9628
566,567,4260,1705,1586,139.356,16.743,73.257,99.9962
567,568,2387,3493,1583,327.44,21.391,68.609,99.926
568,569,10260,1517,1599,287.138,49.3567,40.6433,99.965
569,570,1790,1655,1573,288.082,52.6392,37.3608,99.9792
570,571,1459,1444,1567,317.278,24.6292,65.3708,99.9886
571,572,2671,812,1578,313.683,7.44353,82.5565,99.9924
572,573,16449,3477,1650,320.746,4.10234,85.8977,99.2321
573,574,1850,2823,1568,157.60299999999995,64.9229,25.0771,99.9709
574,575,541,1156,1562,314.004,13.4483,76.5517,99.9984
575,576,14549,2419,1615,143.50799999999995,48.3051,41.6949,99.9594
576,577,1211,1372,1566,159.55,71.1016,18.8984,99.9693
577,578,33433,2913,1672,321.962,12.2932,77.7068,62.8864
578,579,4056,368,1591,152.338,61.058,28.942,99.9092
579,580,1444,933,1578,134.639,30.4146,59.5854,99.9948
580,581,1225,3316,1583,315.797,29.9361,60.0639,99.9641
581,582,821,1802,1579,137.778,4.571269999999998,85.4287,99.9633
582,583,7680,734,1607,135.01,12.1698,77.8302,99.9858
583,584,683,1618,1582,284.231,45.2853,44.7147,99.9941
584,585,1525,311,1593,141.99,4.38734,85.6127,99.9957
585,586,670,1142,1588,140.46200000000002,10.1021,79.8979,99.9926
586,587,1458,3199,1588,141.13299999999995,36.6303,53.3697,99.9916
587,588,3681,431,1610,321.437,24.5122,65.4878,99.9534
588,589,963,1762,1592,143.35,10.6288,79.3712,99.9957
589,590,9084,577,1654,142.282,2.65886,87.3411,99.6671
590,591,7210,2265,1632,314.577,2.32013,87.6799,99.9957
591,592,1534,3366,1607,310.69,0.0686798,89.9313,99.9782
592,593,4056,657,1622,315.012,45.7878,44.2122,99.9978
593,594,2673,3140,1604,133.59,6.13166,83.8683,99.9765
594,595,1417,1414,1608,332.288,0.5244979999999999,89.4755,99.88
595,596,3545,2337,1634,315.636,79.5391,10.4609,99.995
596,597,737,3052,1599,150.314,24.5483,65.4517,99.9974
597,598,4368,1054,1624,319.105,44.7729,45.2271,99.9876
598,599,5873,1350,1623,143.497,0.93399,89.066,99.9954
599,600,1141,3284,1612,127.018,55.8387,34.1613,99.9969
600,601,1584,1842,1604,329.333,0.752289,89.2477,99.9829
601,602,1233,920,1620,142.797,18.4374,71.5626,99.9964
602,603,877,3404,1614,310.125,42.9125,47.0875,99.9916
603,604,1450,1791,1620,319.7920000000001,13.7037,76.2963,99.9968
604,605,586,3627,1626,312.496,12.2612,77.7388,99.9459
605,606,10534,1592,1655,136.809,30.1791,59.8209,99.9918
606,607,5300,1137,1634,131.325,19.2798,70.7202,99.9837
607,608,3739,840,1649,140.71,0.417534,89.5825,99.6552
608,609,9466,2660,1669,317.467,3.98273,86.0173,99.9768
609,610,1966,3102,1631,141.694,32.8478,57.1522,99.997
610,611,5725,1727,1657,295.713,51.5486,38.4514,99.9873
611,612,9512,278,1698,325.726,7.573939999999999,82.4261,99.8767
612,613,982,340,1628,318.066,23.7029,66.2971,99.9976
613,614,812,3207,1631,321.7,12.4616,77.5384,99.9947
614,615,1810,1278,1634,319.201,17.1019,72.8981,99.9949
615,616,3485,3054,1651,297.704,69.8928,20.1072,99.9977
616,617,2332,3309,1650,317.802,10.4772,79.5228,99.9973
617,618,1302,501,1637,315.016,21.6092,68.3908,99.9908
618,619,10277,1834,1676,311.2290000000001,40.8325,49.1675,99.9885
619,620,5588,2172,1701,314.111,18.8475,71.1525,99.5705
620,621,873,3353,1644,308.777,45.9163,44.0837,99.9927
621,622,3992,3185,1666,296.27,65.9412,24.0588,99.8598
622,623,4734,773,1671,275.587,79.2071,10.7929,99.9974
623,624,24394,1443,1736,164.328,71.7658,18.2342,90.8861
624,625,35128,1265,1764,318.204,0.953842,89.0462,98.4642
625,626,976,229,1667,324.137,6.5601699999999985,83.4398,99.9743
626,627,5921,476,1686,320.105,10.3439,79.6561,99.5502
627,628,2740,937,1664,334.425,81.7326,8.26736,99.264
628,629,2098,890,1686,288.11,86.6012,3.3988,99.9908
629,630,3495,2511,1679,319.532,6.2965800000000005,83.7034,99.9419
630,631,19538,372,1730,138.165,1.97062,88.0294,99.8755
631,632,2058,699,1677,318.28,5.7509,84.2491,99.9964
632,633,1723,1127,1674,144.523,26.2773,63.7227,99.9986
633,634,1342,2738,1677,311.9770000000001,47.6427,42.3573,99.9908
634,635,1516,3124,1677,138.156,24.3042,65.6958,99.9964
635,636,2273,2317,1683,312.73,19.857,70.143,99.9977
636,637,16018,3192,1775,317.6740000000001,16.1536,73.8464,99.9143
637,638,42432,1027,1816,310.665,60.2463,29.7537,51.8734
638,639,801,1085,1684,314.471,64.9948,25.0052,99.9363
639,640,1618,1603,1694,330.376,70.4723,19.5277,99.9972
640,641,11714,3315,1729,139.338,3.15851,86.8415,99.998
641,642,4204,2402,1714,323.318,16.3576,73.6424,98.3154
642,643,5993,2755,1736,296.927,73.6407,16.3593,99.8787
643,644,4322,3059,1711,309.306,51.2325,38.7675,99.996
644,645,4498,1657,1718,321.586,14.2243,75.7757,99.9963
645,646,1138,3550,1706,138.365,50.5686,39.4314,99.9707
646,647,1769,1727,1720,129.624,42.1756,47.8244,99.9337
647,648,9309,631,1731,301.8,68.9019,21.0981,99.9682
648,649,743,2054,1694,313.55,6.7507199999999985,83.2493,99.9923
649,650,4033,2229,1719,135.66299999999998,48.2348,41.7652,99.9939
650,651,516,981,1705,310.656,84.1339,5.86608,99.992
651,652,6371,2478,1752,140.563,57.532,32.468,94.9706
652,653,1471,2563,1717,305.506,40.0387,49.9613,99.994
653,654,1018,806,1709,297.535,74.4459,15.5541,99.9986
654,655,658,2722,1709,306.34,39.3374,50.6626,99.9979
655,656,20316,3486,1845,314.44,8.76126,81.2387,89.9824
656,657,1299,848,1715,150.513,25.4062,64.5938,99.9976
657,658,2335,2075,1722,135.658,27.1544,62.8456,99.9974
658,659,1819,3132,1719,308.837,15.9988,74.0012,99.9984
659,660,541,738,1712,149.106,66.5811,23.4189,99.9906
660,661,3136,1315,1733,324.416,17.2982,72.7018,99.9973
661,662,2281,511,1726,136.131,0.962708,89.0373,100.0
662,663,5354,1549,1736,145.507,65.5247,24.4753,99.9801
663,664,4424,729,1747,145.718,26.4572,63.5428,99.9719
664,665,4414,2330,1737,317.43,31.6475,58.3525,99.998
665,666,2110,1931,1737,318.831,1.37927,88.6207,99.9963
666,667,21791,2678,1788,314.531,15.1456,74.8544,98.9315
667,668,2635,2168,1762,316.272,26.1081,63.8919,99.9882
668,669,5440,3511,1781,324.248,1.85078,88.1492,99.9866
669,670,3727,3624,1797,142.491,9.83417,80.1658,98.6678
670,671,1462,892,1742,273.376,82.611,7.3889999999999985,99.9944
671,672,5580,814,1772,302.878,8.26913,81.7309,99.9977
672,673,802,2263,1747,157.716,71.6517,18.3483,99.9935
673,674,5483,3573,1789,125.348,10.3828,79.6172,99.9685
674,675,15220,2083,1805,313.717,2.15363,87.8464,98.9301
675,676,2334,3063,1758,247.523,82.0069,7.9931100000000015,99.9931
676,677,2429,531,1767,320.25,13.1753,76.8247,99.9756
677,678,27374,2999,1884,317.815,0.543655,89.4563,71.4588
678,679,784,444,1753,140.563,10.1159,79.8841,99.9942
679,680,2532,3120,1777,131.85,20.6422,69.3578,99.9866
680,681,2780,1757,1782,308.725,73.2813,16.7187,99.9959
681,682,6943,1663,1784,138.069,8.532169999999999,81.4678,99.8842
682,683,14183,2344,1827,140.409,38.4459,51.5541,99.8231
683,684,4431,1909,1788,139.954,31.6735,58.3265,99.9579
684,685,12685,2234,1812,324.385,13.0494,76.9506,99.9416
685,686,3001,231,1829,135.68200000000002,2.16981,87.8302,99.9412
686,687,2309,467,1793,135.55,18.9329,71.0671,99.9788
687,688,2451,586,1787,313.51,34.9617,55.0383,99.9725
688,689,790,917,1777,264.801,80.3022,9.69775,99.6477
689,690,582,252,1793,135.767,2.98907,87.0109,99.98
690,691,3533,3348,1799,144.991,44.7803,45.2197,99.9925
691,692,4103,657,1806,318.91,15.289,74.711,99.963
692,693,10780,2560,1865,321.38,29.9841,60.0159,99.7524
693,694,1443,862,1795,313.18,72.4789,17.5211,99.9553
694,695,3423,1598,1802,137.42600000000002,19.3975,70.6025,99.9915
695,696,2372,2822,1803,317.751,65.6148,24.3852,99.9983
696,697,611,2494,1796,324.408,36.7633,53.2367,99.9955
697,698,6175,756,1821,315.216,3.45712,86.5429,99.9948
698,699,8714,3338,1849,135.747,24.053,65.947,99.8906
699,700,17682,876,1898,316.612,21.7285,68.2715,99.4207
700,701,3208,1835,1816,320.9240000000001,4.02922,85.9708,99.9245
701,702,3454,285,1830,134.209,9.6961,80.3039,99.9426
702,703,3604,2776,1832,283.457,77.0512,12.9488,99.997
703,704,1142,519,1807,314.638,25.3067,64.6933,99.9966
704,705,1811,3104,1822,309.06,63.3814,26.6186,99.9979
705,706,1688,1744,1821,294.385,69.2771,20.7229,99.9985
706,707,6451,2910,1852,316.032,7.12466,82.8753,99.9689
707,708,762,2410,1818,312.338,4.8375,85.1625,99.9993
708,709,3712,574,1846,323.143,9.53639,80.4636,99.9788
709,710,685,3381,1823,148.093,53.1524,36.8476,99.9709
710,711,1222,3066,1831,147.171,75.1931,14.8069,99.9159
711,712,707,3226,1828,308.712,46.4284,43.5716,99.8504
712,713,1084,1416,1836,305.635,55.925,34.075,99.9805
713,714,1335,412,1837,314.643,44.2661,45.7339,99.9188
714,715,3822,2476,1855,325.228,33.9229,56.0771,99.5856
715,716,827,462,1839,314.755,24.8335,65.1665,99.4314
716,717,2740,1713,1856,307.14,30.3022,59.6978,99.9411
717,718,1503,1561,1854,314.807,16.9565,73.0435,99.9779
718,719,20331,1153,1904,138.54399999999998,3.31372,86.6863,99.1108
719,720,2289,1294,1860,308.658,59.9477,30.0523,99.9977
720,721,19452,318,1938,313.165,14.0356,75.9644,99.7926
721,722,913,518,1841,329.349,50.8343,39.1657,99.9938
722,723,48106,1582,1939,319.666,0.60537,89.3946,98.398
723,724,4657,2831,1871,312.835,18.533,71.467,99.8083
724,725,1633,1666,1849,319.152,19.9896,70.0104,99.9963
725,726,2448,1865,1858,141.028,20.528,69.472,99.9954
726,727,1560,3245,1854,317.713,16.9006,73.0994,99.9877
727,728,43494,580,1955,309.163,80.6169,9.38307,63.9309
728,729,5661,1616,1876,133.536,35.6083,54.3917,99.9944
729,730,2238,1796,1858,129.255,47.9464,42.0536,99.9711
730,731,2114,2391,1876,314.3590000000001,38.6701,51.3299,99.9965
731,732,633,2527,1859,161.571,71.0819,18.9181,99.9911
732,733,4602,2641,1897,150.217,80.6221,9.37794,99.8534
733,734,2569,3295,1878,316.186,5.7226300000000005,84.2774,99.9943
734,735,928,476,1864,324.0,33.8341,56.1659,71.9167
735,736,1151,787,1868,141.667,2.0576,87.9424,99.9909
736,737,568,441,1879,132.121,24.4985,65.5015,99.7145
737,738,3939,410,1901,137.55200000000002,4.54358,85.4564,99.9971
738,739,4775,3142,1898,146.961,7.11905,82.881,99.9951
739,740,4050,492,1915,134.739,26.1978,63.8022,99.0595
740,741,1465,3433,1896,138.481,30.2187,59.7813,99.9835
741,742,19709,2773,1938,147.408,47.4683,42.5317,99.5682
742,743,7701,3241,1919,154.39,52.8284,37.1716,99.9979
743,744,574,2179,1882,141.559,38.6995,51.3005,99.9862
744,745,2746,2428,1907,141.424,74.0917,15.9083,99.9476
745,746,2503,2152,1908,148.858,56.2267,33.7733,99.993
746,747,4026,1853,1911,136.4,68.9967,21.0033,99.9679
747,748,4205,1326,1926,303.435,54.1894,35.8106,99.9945
748,749,9167,2256,1942,321.812,24.0353,65.9647,99.9883
749,750,1161,2492,1912,323.952,7.55814,82.4419,99.9048
750,751,997,234,1912,313.27,53.8851,36.1149,99.9859
751,752,1068,772,1901,316.947,31.5653,58.4347,99.9946
752,753,1071,2310,1906,320.33,9.97773,80.0223,99.9944
753,754,65577,3433,2065,139.65,0.5103300000000001,89.4897,99.0149
754,755,1503,2352,1920,322.78,27.8221,62.1779,99.7557
755,756,19598,2142,2013,141.423,25.6756,64.3244,77.6319
756,757,7074,757,1954,141.787,1.91963,88.0804,99.9887
757,758,3879,1913,1946,315.971,0.575836,89.4242,99.7652
758,759,4290,1277,1963,322.251,11.8733,78.1267,99.9776
759,760,3175,3184,1960,141.782,4.50013,85.4999,96.3068
760,761,8089,2476,1978,153.282,63.1161,26.8839,99.9757
761,762,500,3600,1951,139.672,1.08408,88.9159,99.9553
762,763,2204,894,1952,129.68200000000002,4.02435,85.9756,99.9927
763,764,4603,2193,1978,143.29,52.6297,37.3703,99.9762
764,765,10519,2376,1989,318.87,4.76917,85.2308,99.9212
765,766,21595,3099,2024,132.994,38.9384,51.0616,79.2125
766,767,18408,1992,2017,147.815,65.1488,24.8512,99.9152
767,768,1368,1171,1963,129.036,6.15762,83.8424,99.9927
768,769,16391,2596,2006,300.067,67.1085,22.8915,99.9302
769,770,3710,1137,1991,316.551,9.84787,80.1521,99.9581
770,771,8324,940,2013,297.847,63.9347,26.0653,99.917
771,772,1412,3271,1979,146.77200000000005,5.21265,84.7874,99.965
772,773,5255,1230,2003,143.132,34.9,55.1,99.9098
773,774,544,224,1978,313.008,54.5961,35.4039,99.9601
774,775,19260,2802,2051,316.171,5.49641,84.5036,97.2105
775,776,7433,1854,2015,320.802,32.5899,57.4101,98.2851
776,777,2695,2771,2000,137.252,12.8529,77.1471,99.9636
777,778,1011,1697,1986,150.084,52.9007,37.0993,99.9949
778,779,847,3564,1989,130.358,12.68,77.32,99.9722
779,780,6182,1355,2022,138.197,38.8047,51.1953,99.9869
780,781,14548,1675,2040,316.643,11.8418,78.1582,54.3689
781,782,5238,1429,2030,315.753,35.3839,54.6161,99.8622
782,783,691,3161,1996,322.327,10.6473,79.3527,99.9947
783,784,29807,721,2089,147.67,9.73194,80.2681,95.3335
784,785,729,1097,2010,310.011,26.0203,63.9797,99.9191
785,786,6562,388,2047,308.326,37.7153,52.2847,99.9842
786,787,6548,250,2068,134.535,42.1293,47.8707,99.9045
787,788,521,2259,2006,318.728,32.3844,57.6156,99.8773
788,789,2999,817,2041,139.576,35.3059,54.6941,99.9917
789,790,12966,1070,2087,146.069,34.8818,55.1182,99.9964
790,791,7083,2334,2065,310.974,34.0057,55.9943,98.5916
791,792,719,1015,2025,319.4170000000001,0.0306778,89.9693,99.9411
792,793,4336,484,2061,314.972,30.826,59.174,99.9607
793,794,1132,3631,2045,308.742,61.9481,28.0519,99.886
794,795,1134,1466,2052,320.39,49.9417,40.0583,99.9616
795,796,889,1311,2050,324.619,14.2094,75.7906,99.9964
796,797,8142,1513,2099,150.398,24.4376,65.5624,99.9734
797,798,950,1145,2047,139.99,12.7964,77.2036,99.9984
798,799,10553,1249,2085,130.059,6.958289999999999,83.0417,99.9971
799,800,6627,976,2102,314.83,35.9825,54.0175,99.7602
800,801,670,2601,2066,313.905,36.1302,53.8698,99.9853
801,802,7533,1773,2107,147.332,21.7434,68.2566,99.8412
802,803,3811,3241,2090,138.6,47.76300000000001,42.237,99.8732
803,804,3732,2438,2082,135.328,75.5379,14.4621,99.9885
804,805,6536,1881,2102,151.02200000000005,60.5066,29.4934,99.9817
805,806,2803,2639,2087,318.781,23.7626,66.2374,99.9915
806,807,115281,1065,2357,314.692,8.19632,81.8037,98.6228
807,808,2332,1166,2096,136.08100000000002,30.0767,59.9233,99.9945
808,809,6527,2854,2106,137.632,14.7562,75.2438,99.8878
809,810,4972,2288,2108,307.087,7.256760000000001,82.7432,99.9625
810,811,5214,2524,2099,177.832,69.8575,20.1425,99.997
811,812,989,1828,2083,323.305,6.11169,83.8883,99.9973
812,813,9098,320,2129,135.572,9.58385,80.4161,99.9537
813,814,1693,1343,2094,131.655,34.2867,55.7133,99.9984
814,815,1972,3095,2093,310.118,48.8015,41.1985,99.9977
815,816,8960,2126,2130,313.143,54.5971,35.4029,99.6588
816,817,2368,2941,2097,137.139,11.606,78.39399999999998,99.7342
817,818,973,3178,2088,143.084,25.0547,64.9453,99.7845
818,819,1701,589,2096,144.248,31.5169,58.4831,99.9856
819,820,1452,3032,2099,137.435,41.7183,48.2817,99.975
820,821,40697,465,2278,317.078,14.0524,75.9476,98.6919
821,822,9465,2019,2148,315.313,49.8372,40.1628,99.868
822,823,3051,2749,2109,137.46200000000002,72.7927,17.2073,99.965
823,824,6404,1649,2114,323.683,27.5951,62.4049,99.9923
824,825,1261,2578,2110,324.873,44.8877,45.1123,99.9798
825,826,909,3605,2117,320.148,10.8789,79.1211,99.9523
826,827,1670,511,2112,314.436,37.4428,52.5572,99.9803
827,828,3238,1392,2123,135.651,1.04208,88.9579,99.9986
828,829,1877,2204,2118,312.396,50.2849,39.7151,99.9862
829,830,3235,3000,2138,127.779,53.337,36.663,99.9894
830,831,39421,3098,2227,320.386,22.9268,67.0732,99.7423
831,832,40765,1443,2270,140.494,5.50237,84.4976,98.9735
832,833,884,2411,2120,153.33100000000005,74.8702,15.1298,99.9766
833,834,4641,2588,2147,139.442,8.70261,81.2974,99.9589
834,835,1012,2085,2129,309.235,34.9655,55.0345,99.9953
835,836,11095,2839,2196,317.736,9.62086,80.3791,99.9013
836,837,3601,555,2148,145.392,52.5912,37.4088,99.8952
837,838,4565,623,2153,157.798,69.3323,20.6677,99.9709
838,839,3761,2473,2165,136.222,34.7348,55.2652,88.5315
839,840,6924,1910,2172,139.787,13.6973,76.3027,99.885
840,841,10983,2349,2179,314.48,8.94409,81.0559,98.8527
841,842,8332,1260,2169,140.612,66.9905,23.0095,98.9786
842,843,5489,2245,2172,138.934,23.1243,66.8757,99.9958
843,844,26615,3295,2246,136.66299999999998,13.0524,76.9476,98.8071
844,845,1489,3056,2153,316.1690000000001,8.80231,81.1977,99.991
845,846,2703,824,2162,270.363,78.7934,11.2066,99.9953
846,847,3334,1596,2173,330.326,51.1724,38.8276,99.9974
847,848,9329,2728,2188,169.34799999999996,71.0109,18.9891,99.9824
848,849,601,1664,2147,136.79399999999998,18.9082,71.0918,99.9963
849,850,6459,2941,2177,141.55200000000005,57.0412,32.9588,99.9221
850,851,3926,1700,2178,324.4120000000001,32.0552,57.9448,99.9976
851,852,3552,1767,2173,305.666,33.287,56.713,99.99
852,853,587,230,2167,306.149,65.45,24.55,99.9669
853,854,3332,2183,2190,125.261,31.2348,58.7652,99.9968
854,855,7533,289,2213,314.214,64.6394,25.3606,99.9069
855,856,2220,1830,2178,311.527,33.3687,56.6313,99.9962
856,857,8512,2062,2228,314.416,9.36938,80.6306,99.9233
857,858,17755,1619,2259,318.367,60.718,29.282,99.937
858,859,1091,218,2201,297.298,43.2789,46.7211,99.939
859,860,14180,2548,2232,157.003,66.0742,23.9258,99.9949
860,861,1402,551,2191,136.861,64.8346,25.1654,99.982
861,862,2851,3120,2201,141.616,14.1531,75.8469,99.9985
862,863,578,3617,2191,40.3511,60.4658,29.5342,99.972
863,864,2227,366,2221,138.441,39.0646,50.9354,99.9957
864,865,1401,1966,2206,310.998,57.0449,32.9551,99.9877
865,866,4062,1503,2229,133.756,19.2515,70.7485,97.5956
866,867,21833,2677,2298,304.583,59.3624,30.6376,99.9649
867,868,1377,1033,2203,314.606,42.5587,47.4413,99.9931
868,869,13304,2358,2261,128.02,59.6159,30.3841,99.9944
869,870,2760,612,2225,314.885,15.2847,74.7153,99.5487
870,871,1485,683,2213,147.96200000000005,18.2651,71.7349,99.9905
871,872,1466,826,2216,138.39700000000002,1.22842,88.7716,99.9821
872,873,4921,880,2247,148.293,35.043,54.957,99.9948
873,874,2079,1225,2218,320.282,12.2118,77.7882,99.9462
874,875,558,718,2201,137.045,38.0265,51.9735,99.7405
875,876,3836,1833,2232,147.54,53.8077,36.1923,99.9811
876,877,8469,3573,2246,319.188,18.8684,71.1316,99.3461
877,878,3056,777,2232,144.292,16.3777,73.6223,99.895
878,879,6739,1170,2252,143.795,62.0874,27.9126,99.9928
879,880,4913,2458,2267,309.6690000000001,12.5147,77.4853,82.4688
880,881,1310,1284,2220,324.908,35.649,54.351000000000006,99.9963
881,882,2699,1754,2234,140.737,14.4287,75.5713,99.9977
882,883,957,2162,2231,304.3,57.4032,32.5968,99.8691
883,884,934,3451,2221,139.366,52.5552,37.4448,99.9938
884,885,4062,568,2264,318.258,70.1171,19.8829,99.9834
885,886,1678,3153,2230,313.142,45.5272,44.4728,99.9931
886,887,7177,2233,2271,137.43,8.813930000000003,81.1861,99.9936
887,888,13480,668,2308,140.625,8.09998,81.9,99.9096
888,889,15559,1932,2300,343.957,84.9082,5.09178,99.8261
889,890,526,228,2249,309.891,65.4094,24.5906,99.9894
890,891,1382,2794,2253,133.80100000000002,75.7275,14.2725,99.9946
891,892,13754,3494,2298,323.5540000000001,10.0512,79.9488,99.5869
892,893,4473,2902,2302,299.973,84.9768,5.02321,99.9731
893,894,3841,730,2269,140.59799999999998,38.3498,51.6502,99.997
894,895,1594,544,2269,142.855,14.132,75.868,99.9957
895,896,9718,1248,2316,171.963,81.1188,8.881219999999997,99.9526
896,897,544,314,2255,136.08100000000002,39.9895,50.0105,99.9886
897,898,3749,811,2286,325.798,84.9556,5.04442,99.8691
898,899,21390,317,2353,140.246,49.1847,40.8153,99.9551
899,900,4996,2806,2291,137.53799999999998,3.27652,86.7235,99.982
900,901,6087,3190,2332,146.76,10.5175,79.4825,99.3277
901,902,4053,399,2301,132.822,25.2371,64.7629,99.872
902,903,17790,2110,2319,140.086,2.73523,87.2648,99.995
903,904,623,1804,2263,313.224,47.643,42.357,99.9964
904,905,994,1300,2276,146.844,34.3271,55.6729,99.9981
905,906,12339,1745,2310,140.093,19.925,70.075,98.9108
906,907,1370,219,2298,142.243,49.9464,40.0536,99.9192
907,908,6773,1350,2326,322.813,21.9244,68.0756,99.9823
908,909,573,3174,2298,134.232,14.1246,75.8754,99.8117
909,910,687,1846,2308,138.13,13.984000000000002,76.016,99.9847
910,911,2552,3378,2319,322.711,41.5763,48.4237,99.9943
911,912,2300,2419,2320,318.201,7.1977,82.8023,99.9971
912,913,2979,2573,2321,146.115,57.618,32.382,99.9906
913,914,7885,838,2357,315.936,3.8749,86.1251,99.9974
914,915,11305,2280,2354,334.034,41.9783,48.0217,99.9079
915,916,516,2511,2323,147.44299999999996,71.3382,18.6618,99.9953
916,917,6585,2454,2392,290.244,87.4725,2.52751,96.0217
917,918,11634,2809,2414,321.154,3.53007,86.4699,99.7775
918,919,69563,2956,2553,134.345,12.675999999999998,77.324,95.2226
919,920,6985,2786,2348,314.7390000000001,30.3437,59.6563,99.9981
920,921,5664,1597,2354,307.021,29.2835,60.7165,99.9931
921,922,832,1812,2340,325.624,60.1022,29.8978,99.9961
922,923,3127,1975,2361,318.248,6.7422,83.2578,98.3571
923,924,9007,3436,2385,314.447,5.92938,84.0706,99.9827
924,925,1441,2630,2344,137.483,42.0842,47.9158,99.9977
925,926,7450,614,2387,138.866,58.375,31.625,99.9912
926,927,4998,2532,2366,136.636,34.6161,55.3839,99.9986
927,928,5104,736,2373,317.54,8.67941,81.3206,99.5929
928,929,2796,539,2374,309.873,11.2255,78.7745,99.8985
929,930,4889,3339,2370,131.083,25.8287,64.1713,99.995
930,931,7192,3574,2401,321.415,19.0401,70.9599,99.9172
931,932,6319,1727,2386,318.831,29.7474,60.2526,99.9834
932,933,8545,902,2417,133.58100000000002,26.5043,63.4957,98.9851
933,934,5473,2372,2396,129.141,14.4444,75.5556,99.9972
934,935,18019,1844,2426,142.95,13.9251,76.0749,99.9881
935,936,5924,3285,2402,138.916,33.969,56.03100000000001,99.9942
936,937,5784,1646,2419,137.722,8.3181,81.6819,99.9893
937,938,1772,3505,2380,306.2390000000001,86.8696,3.13044,99.9844
938,939,4902,2580,2400,212.867,81.8533,8.14668,99.937
939,940,1729,1259,2385,129.0,16.3342,73.6658,99.9967
940,941,85070,2078,2584,319.956,24.6095,65.3905,36.0019
941,942,3540,1304,2411,318.834,14.9885,75.0115,99.9871
942,943,6777,1394,2414,175.96,70.5589,19.4411,99.9956
943,944,9829,3184,2410,143.225,20.7123,69.2877,99.822
944,945,4818,1968,2426,326.291,32.5884,57.4116,45.899
945,946,7048,2039,2421,136.765,21.4868,68.5132,99.9865
946,947,1179,2131,2404,218.546,83.3577,6.642289999999999,99.9733
947,948,2254,797,2413,139.735,22.8871,67.1129,99.9782
948,949,33165,1582,2528,311.934,9.35083,80.6492,54.8367
949,950,5270,2634,2447,324.526,8.89609,81.1039,99.9098
950,951,1446,675,2428,309.8640000000001,13.9939,76.0061,99.9908
951,952,1608,1249,2435,144.845,34.036,55.964,99.9653
952,953,647,401,2423,307.441,13.6963,76.3037,99.9899
953,954,7293,2375,2459,318.783,19.1191,70.8809,99.4354
954,955,2884,3117,2441,317.709,15.7786,74.2214,99.9906
955,956,5334,722,2459,328.134,64.1987,25.8013,99.9961
956,957,580,3622,2438,319.539,20.273,69.727,99.9781
957,958,1108,3073,2441,131.477,25.9842,64.0158,99.9958
958,959,3099,2524,2448,161.247,64.9461,25.0539,99.982
959,960,18128,3295,2547,133.349,19.4869,70.5131,99.5975
960,961,2771,3408,2452,146.675,9.17579,80.8242,99.9967
961,962,1047,3494,2441,303.779,34.7179,55.2821,99.9835
962,963,8751,1742,2519,305.451,50.084,39.916,99.9287
963,964,1028,2712,2444,139.309,12.6327,77.3673,99.998
964,965,65607,727,2557,136.872,29.3566,60.6434,91.0569
965,966,1341,378,2454,316.638,8.94942,81.0506,99.9563
966,967,600,1707,2446,317.15,53.2,36.8,99.9872
967,968,2084,428,2461,317.855,74.1398,15.8602,99.9913
968,969,1143,1441,2457,312.812,38.1612,51.8388,99.7811
969,970,2917,1315,2469,310.7920000000001,28.6931,61.3069,99.9729
970,971,1555,1508,2465,316.596,57.6366,32.3634,99.9834
971,972,946,660,2468,128.012,51.6156,38.3844,99.9958
972,973,790,2139,2472,133.971,4.39071,85.6093,99.8726
973,974,30810,3154,2573,317.513,20.961,69.039,99.7531
974,975,1340,3532,2468,140.02100000000002,40.4498,49.5502,99.9839
975,976,2390,2850,2486,310.43,11.8268,78.1732,99.9355
976,977,799,2089,2465,323.132,6.60988,83.3901,99.965
977,978,6957,3427,2523,144.80200000000005,36.7494,53.2506,99.8904
978,979,677,1675,2472,138.11700000000002,45.9716,44.0284,99.9442
979,980,911,1104,2478,304.4170000000001,44.1126,45.8874,99.988
980,981,878,1353,2491,312.35,39.7624,50.2376,99.9637
981,982,750,1381,2476,316.809,8.15652,81.8435,99.978
982,983,26524,2703,2556,139.738,61.3571,28.6429,99.7809
983,984,1976,341,2485,129.17600000000002,5.64849,84.3515,99.9861
984,985,2826,3085,2491,311.539,34.3306,55.6694,99.898
985,986,15416,2526,2539,198.705,77.7791,12.2209,99.8858
986,987,574,3591,2483,318.1,1.06496,88.935,99.9726
987,988,1038,3615,2502,316.732,1.0335,88.9665,99.8754
988,989,5638,1884,2515,306.311,70.4682,19.5318,99.914
989,990,885,2779,2484,137.924,9.02425,80.9757,99.999
990,991,884,1447,2492,313.084,10.515,79.485,99.8943
991,992,63985,432,2821,143.873,6.92874,83.0713,70.1518
992,993,2345,935,2497,311.095,33.6258,56.3742,99.9057
993,994,1147,2623,2499,325.01,27.6316,62.3684,99.9723
994,995,16736,3506,2571,144.316,51.7417,38.2583,55.6357
995,996,3558,2387,2522,137.095,20.8716,69.1284,99.9377
996,997,2056,2443,2532,135.91899999999998,5.304119999999998,84.6959,99.9157
997,998,2475,1412,2526,307.33,39.1157,50.8843,99.9174
998,999,583,292,2506,310.6670000000001,49.0084,40.9916,99.8755
999,1000,12420,1812,2589,145.61,8.91659,81.0834,99.8925
1000,1001,1125,2889,2527,302.742,44.2136,45.7864,99.9942
1001,1002,5510,1323,2554,319.618,1.32973,88.6703,99.9691
1002,1003,22930,342,2588,318.656,15.9046,74.0954,99.9538
1003,1004,8958,989,2581,315.021,27.1476,62.8524,99.9513
1004,1005,1949,1920,2541,186.493,86.601,3.3989800000000003,99.8929
1005,1006,2308,3330,2545,301.556,48.2875,41.7125,99.9814
1006,1007,943,907,2535,316.467,12.9149,77.0851,99.9881
1007,1008,2764,3351,2574,149.585,12.353,77.64699999999998,99.96
1008,1009,6525,2241,2585,314.197,14.2319,75.7681,99.9253
1009,1010,3168,1405,2582,301.711,56.8335,33.1665,99.9896
1010,1011,5449,2826,2591,127.3,1.55863,88.4414,99.9892
1011,1012,10130,1066,2649,144.453,5.30627,84.6937,99.9207
1012,1013,8003,1546,2636,142.594,10.2126,79.7874,99.4091
1013,1014,24324,2370,2634,316.39,52.0745,37.9255,98.9409
1014,1015,11625,3379,2654,145.273,16.8797,73.1203,99.9807
1015,1016,4955,1140,2627,314.968,23.8298,66.1702,99.9316
1016,1017,1349,3213,2612,145.917,15.0095,74.9905,99.9863
1017,1018,2473,1328,2607,137.60399999999998,17.8549,72.1451,99.9914
1018,1019,18514,661,2682,131.792,55.5777,34.4223,99.888
1019,1020,853,2760,2607,140.804,18.6685,71.3315,99.9866
1020,1021,1388,1264,2616,127.017,50.5895,39.4105,99.9969
1021,1022,1969,2597,2623,317.651,26.8962,63.1038,99.9909
1022,1023,977,1639,2612,166.46099999999996,72.0806,17.9194,99.9974
1023,1024,10122,1744,2669,314.9120000000001,8.99888,81.0011,99.8446
1024,1025,5342,1594,2660,308.173,54.0925,35.9075,99.9972
1025,1026,1898,3118,2642,145.41299999999995,14.8715,75.1285,99.9979
1026,1027,82903,2552,2813,310.547,60.0251,29.9749,45.347
1027,1028,5663,1393,2658,139.749,44.5755,45.4245,99.986
1028,1029,844,3331,2627,313.541,63.4108,26.5892,99.997
1029,1030,6385,2715,2669,312.971,20.7154,69.2846,99.9822
1030,1031,4874,3024,2654,138.489,35.6741,54.3259,99.9519
1031,1032,1438,3610,2641,314.96,7.52462,82.4754,99.8339
1032,1033,2195,240,2665,140.035,49.1341,40.8659,99.9691
1033,1034,1056,1448,2643,145.863,6.27528,83.7247,99.9526
1034,1035,23250,1707,2749,142.66,10.4368,79.5632,99.7868
1035,1036,1552,2220,2647,304.587,43.0082,46.9918,99.996
1036,1037,1521,542,2653,319.626,54.2217,35.7783,99.9898
1037,1038,11947,1307,2694,273.815,69.2121,20.7879,99.9927
1038,1039,517,2821,2641,311.082,35.9753,54.0247,99.9969
1039,1040,748,2776,2645,315.87,43.1652,46.8348,99.9269
1040,1041,1316,1202,2665,124.829,49.7983,40.2017,99.9958
1041,1042,10933,2200,2709,151.118,49.6158,40.3842,99.914
1042,1043,7933,875,2695,140.056,8.48804,81.512,99.9962
1043,1044,1342,1861,2666,154.102,18.0021,71.9979,99.9967
1044,1045,124752,3457,3146,134.887,15.6272,74.3728,57.7287
1045,1046,13348,311,2732,142.813,61.8109,28.1891,99.9883
1046,1047,8753,2815,2707,320.043,80.3941,9.60588,99.9754
1047,1048,1539,746,2676,317.665,15.4657,74.5343,99.9945
1048,1049,3599,381,2694,325.745,27.7348,62.2652,99.9905
1049,1050,12789,975,2748,164.018,77.5801,12.4199,97.9743
1050,1051,655,3615,2685,117.372,47.4118,42.5882,99.9866
1051,1052,9137,1498,2743,303.128,64.1653,25.8347,99.9966
1052,1053,4483,1169,2705,135.869,54.599,35.401,99.9983
1053,1054,11716,791,2744,339.249,70.9167,19.0833,99.9632
1054,1055,845,1232,2697,283.448,73.8986,16.1014,99.9991
1055,1056,3807,3150,2711,135.975,22.4696,67.5304,99.9057
1056,1057,5189,2336,2710,154.41899999999995,81.9711,8.02892,99.9902
1057,1058,1619,552,2704,311.901,9.28897,80.711,99.9947
1058,1059,681,3091,2699,320.295,38.6589,51.3411,99.9891
1059,1060,1950,3021,2716,318.536,40.1205,49.8795,99.9477
1060,1061,3077,3291,2724,140.02,55.7267,34.2733,99.9979
1061,1062,5286,3232,2747,139.852,11.28,78.72,99.9442
1062,1063,12188,1835,2802,307.494,43.2081,46.7919,99.8517
1063,1064,4838,2085,2719,152.674,21.0268,68.9732,99.9939
1064,1065,1388,1058,2715,140.796,20.2808,69.7192,99.958
1065,1066,14806,3094,2798,137.97899999999998,7.11998,82.88,99.9724
1066,1067,7143,3368,2749,313.618,12.0491,77.9509,99.9955
1067,1068,21313,1431,2816,318.815,0.426735,89.5733,90.2579
1068,1069,34381,1163,2833,140.864,8.72665,81.2734,99.7813
1069,1070,4238,1236,2751,139.975,22.5772,67.4228,99.9961
1070,1071,527,235,2740,314.059,8.18409,81.8159,99.9609
1071,1072,2893,531,2755,320.055,33.5325,56.4675,99.9979
1072,1073,14225,2316,2786,135.194,85.1141,4.88592,99.9733
1073,1074,1288,674,2756,319.54,16.6344,73.3656,99.9931
1074,1075,6609,320,2817,308.848,29.3164,60.6836,99.9677
1075,1076,981,2104,2757,138.813,60.1948,29.8052,99.9972
1076,1077,1731,584,2766,321.782,17.467,72.533,99.9658
1077,1078,4011,2854,2790,313.557,18.8497,71.1503,99.9969
1078,1079,2721,3180,2778,304.927,82.9924,7.00758,99.9971
1079,1080,659,220,2786,305.582,22.7466,67.2534,99.6628
1080,1081,10794,2173,2823,316.138,3.67839,86.3216,99.9976
1081,1082,6761,1648,2812,323.68,47.0613,42.9387,99.9737
1082,1083,1847,3010,2791,317.712,43.8655,46.1345,99.9774
1083,1084,128791,447,3129,321.586,5.8560300000000005,84.14399999999998,99.0449
1084,1085,3100,1322,2796,140.639,41.8593,48.1407,99.9858
1085,1086,1098,883,2789,139.95600000000002,3.06895,86.931,99.6484
1086,1087,27502,3352,2891,137.215,62.7012,27.2988,99.9102
1087,1088,4321,2015,2811,137.628,64.8198,25.1802,99.9947
1088,1089,2344,1529,2813,150.118,13.094,76.906,99.9594
1089,1090,3872,2525,2828,136.278,35.1784,54.8216,99.9974
1090,1091,21169,2781,2876,319.519,1.45351,88.5465,99.9934
1091,1092,2429,727,2817,321.897,13.9168,76.0832,99.9912
1092,1093,694,404,2805,139.947,66.0109,23.9891,99.9607
1093,1094,7140,811,2837,139.80700000000002,86.9892,3.01081,99.9366
1094,1095,23622,917,2889,134.889,7.89738,82.1026,75.9027
1095,1096,2566,2691,2823,144.965,9.38313,80.6169,99.9937
1096,1097,1758,3239,2812,136.093,0.836082,89.1639,99.9767
1097,1098,6451,261,2874,319.333,3.72449,86.2755,98.3382
1098,1099,3816,2104,2840,314.643,37.3554,52.6446,99.996
1099,1100,6293,1868,2872,142.216,10.1621,79.8379,98.3976
1100,1101,8919,2250,2874,313.52,19.9717,70.0283,99.7118
1101,1102,8270,366,2869,323.101,10.2075,79.7925,99.9888
1102,1103,2074,1958,2828,302.611,42.737,47.26300000000001,99.968
1103,1104,1733,3166,2833,322.055,13.3205,76.6795,99.9905
1104,1105,8140,1575,2855,314.206,38.7177,51.2823,99.9626
1105,1106,1632,2899,2835,137.53799999999998,30.5856,59.4144,99.9952
1106,1107,1458,3206,2839,323.999,83.2535,6.74648,99.9912
1107,1108,4540,2999,2867,141.773,28.0481,61.9519,99.9902
1108,1109,14680,753,2922,316.215,30.8712,59.1288,99.5632
1109,1110,4901,1294,2871,312.936,48.7411,41.2589,99.9862
1110,1111,5337,1404,2895,283.382,75.7492,14.2508,99.966
1111,1112,6867,3049,2943,313.508,40.8661,49.1339,99.854
1112,1113,7605,1043,2879,309.555,37.4889,52.5111,99.9785
1113,1114,2106,1719,2863,127.15,50.3064,39.6936,99.9988
1114,1115,11068,2047,2926,136.403,23.7303,66.2697,99.983
1115,1116,538,3244,2857,126.972,59.6736,30.3264,99.9902
1116,1117,4830,1977,2892,143.674,21.8558,68.1442,99.956
1117,1118,15360,2898,2937,308.164,42.4376,47.5624,99.9706
1118,1119,636,1918,2879,135.442,66.2618,23.7382,99.9583
1119,1120,1040,2354,2875,137.589,44.2866,45.7134,99.9949
1120,1121,30538,3195,2945,317.052,13.938,76.062,99.5015
1121,1122,12089,1666,2918,315.315,1.98904,88.01100000000002,99.9276
1122,1123,2893,3596,2922,317.7870000000001,0.391167,89.6088,99.7823
1123,1124,35661,2190,3012,137.38299999999998,9.91203,80.08800000000002,99.9076
1124,1125,3476,2302,2920,148.909,80.0094,9.9906,99.9912
1125,1126,7265,1336,2935,146.602,2.38612,87.6139,99.9632
1126,1127,48971,1843,3050,309.398,60.372,29.628,98.1967
1127,1128,1292,272,2922,324.569,7.35925,82.6408,99.9701
1128,1129,2615,2657,2950,137.235,5.97032,84.0297,99.9917
1129,1130,2637,2993,2948,310.9240000000001,0.0623322,89.9377,99.8979
1130,1131,2663,1080,2943,135.741,26.42,63.58,99.9906
1131,1132,895,1563,2928,323.28,4.27529,85.7247,99.9725
1132,1133,4300,1777,2951,141.16899999999995,43.5794,46.4206,99.994
1133,1134,167385,1374,3178,140.422,38.3843,51.6157,69.9224
1134,1135,1486,676,2947,318.274,14.7028,75.2972,99.9974
1135,1136,940,1514,2944,314.154,20.8525,69.1475,99.9967
1136,1137,1357,1830,2944,326.046,14.1906,75.8094,99.9885
1137,1138,32695,2770,3039,310.84,29.5192,60.4808,99.9421
1138,1139,554,214,2948,321.316,8.82731,81.1727,99.8276
1139,1140,793,1439,2945,323.816,24.7311,65.2689,99.9898
1140,1141,2802,1261,2966,152.609,70.6726,19.3274,99.9946
1141,1142,9055,1205,3000,251.743,78.1739,11.8261,57.8237
1142,1143,1191,1975,2956,318.558,15.7489,74.2511,99.9868
1143,1144,3276,243,3008,153.329,68.5151,21.4849,99.8959
1144,1145,993,284,2961,150.417,8.013689999999999,81.9863,99.9522
1145,1146,4912,2345,2976,139.97799999999998,74.7633,15.2367,99.9836
1146,1147,18984,2552,3045,148.944,43.5493,46.4507,45.0173
1147,1148,2125,1134,2970,328.266,46.1127,43.8873,99.9979
1148,1149,2128,3551,2973,138.431,20.1732,69.8268,99.9639
1149,1150,1226,1609,2970,139.296,52.0636,37.9364,99.9909
1150,1151,4037,1490,2994,309.192,41.8831,48.1169,99.9695
1151,1152,13151,2386,3044,312.7990000000001,15.5647,74.4353,99.9495
1152,1153,8010,2958,3039,313.845,7.70724,82.2928,99.8815
1153,1154,3180,1659,2992,326.748,19.5949,70.4051,99.9908
1154,1155,2097,1725,2992,136.355,54.9516,35.0484,99.9965
1155,1156,14633,822,3040,308.215,22.4462,67.5538,99.953
1156,1157,632,3617,2998,308.01,30.8551,59.1449,99.7923
1157,1158,7199,714,3043,183.393,81.9198,8.080169999999999,99.9576
1158,1159,111875,3062,3189,142.715,34.7967,55.2033,75.4096
1159,1160,10652,3326,3050,155.096,41.5885,48.4115,45.2841
1160,1161,2469,2046,3042,144.26,65.5916,24.4084,99.9507
1161,1162,1403,904,3046,310.47,13.1414,76.8586,99.996
1162,1163,9264,578,3136,141.968,33.3779,56.6221,99.995
1163,1164,671,1348,3060,317.72,12.8874,77.1126,99.9939
1164,1165,91479,980,3278,139.47899999999998,35.5619,54.4381,99.7632
1165,1166,2001,3386,3091,114.517,74.2379,15.7621,99.9964
1166,1167,5235,516,3107,307.374,74.61399999999998,15.3861,99.9911
1167,1168,27598,2015,3160,318.433,3.73697,86.26299999999998,98.8287
1168,1169,835,2420,3095,305.746,21.777,68.223,99.9824
1169,1170,3119,2269,3115,139.028,1.63464,88.3654,99.9924
1170,1171,1870,657,3101,141.80700000000004,38.8289,51.1711,99.9631
1171,1172,820,1400,3099,136.89600000000002,0.423576,89.5764,99.9762
1172,1173,3209,2686,3110,326.335,53.9279,36.0721,99.9941
1173,1174,1095,2629,3107,321.786,65.4881,24.5119,99.9864
1174,1175,625,3568,3134,318.646,33.924,56.076,99.9536
1175,1176,3263,719,3137,310.618,29.0209,60.9791,99.9753
1176,1177,45646,2596,3244,140.869,33.7581,56.2419,99.8676
1177,1178,5312,2476,3168,141.877,46.8861,43.1139,99.9306
1178,1179,1183,3589,3133,318.987,34.2158,55.7842,99.8991
1179,1180,8821,2317,3173,304.1670000000001,26.8459,63.1541,99.9946
1180,1181,4502,3343,3155,322.661,4.08526,85.9147,99.9959
1181,1182,3639,624,3171,313.706,7.7095,82.2905,99.9963
1182,1183,2814,670,3160,309.636,10.6906,79.3094,99.9927
1183,1184,5698,2420,3179,135.708,13.1902,76.8098,99.9926
1184,1185,8219,2221,3185,305.492,48.8943,41.1057,99.8987
1185,1186,9645,1133,3173,312.834,41.1487,48.8513,99.9677
1186,1187,726,1906,3139,316.455,20.528,69.472,99.8881
1187,1188,3582,1880,3180,298.606,49.3288,40.6712,99.9952
1188,1189,6316,1676,3186,136.687,36.313,53.687,99.9886
1189,1190,836,1227,3158,143.966,40.22,49.78,99.9962
1190,1191,1472,2135,3166,136.569,8.987960000000003,81.012,99.9985
1191,1192,13649,1873,3261,132.996,31.274,58.726000000000006,99.8469
1192,1193,1219,1770,3176,312.138,52.8253,37.1747,99.9104
1193,1194,4270,2891,3206,317.687,10.0444,79.9556,99.9944
1194,1195,1124,3594,3189,132.441,64.3482,25.6518,99.9243
1195,1196,565,2735,3178,141.313,35.4372,54.5628,99.9518
1196,1197,8954,1266,3217,307.423,58.5352,31.4648,99.9829
1197,1198,2725,2087,3196,140.762,59.0619,30.9381,99.9961
1198,1199,2420,3410,3219,233.58900000000003,78.1057,11.8943,99.9621
1199,1200,11788,709,3231,149.933,81.6475,8.35251,99.9772
1200,1201,760,1511,3195,318.004,32.7292,57.2708,99.9884
1201,1202,1170,2033,3198,125.436,7.5067,82.4933,99.7723
1202,1203,9298,2747,3245,319.876,30.4476,59.5524,99.9848
1203,1204,7554,2346,3242,323.19,0.137711,89.8623,99.9976
1204,1205,828,3226,3197,322.558,4.66539,85.3346,99.999
1205,1206,3915,2160,3243,313.184,13.701,76.29899999999998,99.9726
1206,1207,8970,3352,3260,297.462,65.7789,24.2211,99.9926
1207,1208,1523,2832,3224,305.806,29.3268,60.6732,99.9462
1208,1209,16542,1761,3266,146.518,40.6011,49.3989,99.9695
1209,1210,1515,3536,3221,121.824,72.7061,17.2939,99.979
1210,1211,3077,1526,3236,313.706,49.8801,40.1199,99.9904
1211,1212,10601,581,3267,147.704,51.8138,38.1862,99.9765
1212,1213,3137,1141,3241,319.589,0.660194,89.3398,99.9993
1213,1214,771,3600,3228,153.893,56.8579,33.1421,99.9251
1214,1215,10654,2052,3281,318.86,43.0476,46.9524,99.968
1215,1216,3741,2123,3250,132.584,58.2103,31.7897,99.9966
1216,1217,2163,1573,3249,144.007,21.5348,68.4652,99.9594
1217,1218,12047,1663,3310,123.937,74.945,15.055,99.9811
1218,1219,14658,1260,3289,147.765,37.9115,52.0885,99.9362
1219,1220,875,2487,3242,139.445,4.63976,85.3602,99.9841
1220,1221,2601,1096,3259,134.382,54.848,35.152,99.9558
1221,1222,1363,225,3265,132.299,7.55099,82.449,99.991
1222,1223,12585,2440,3304,139.911,50.9363,39.0637,99.3594
1223,1224,3373,2209,3279,132.862,57.5051,32.4949,99.9956
1224,1225,2321,3288,3268,138.293,4.4825599999999985,85.5174,99.9985
1225,1226,3909,3535,3271,140.975,63.367,26.633000000000006,99.9868
1226,1227,1050,2844,3260,321.301,29.3614,60.6386,99.9983
1227,1228,3980,2809,3303,140.328,41.2154,48.7846,99.9922
1228,1229,24021,2223,3357,141.34,53.3529,36.6471,99.5257
1229,1230,20168,751,3356,141.281,42.9982,47.0018,99.9487
1230,1231,3015,3591,3313,139.036,63.4111,26.5889,99.9544
1231,1232,756,273,3285,134.28,38.1079,51.8921,99.9911
1232,1233,7614,1369,3327,157.688,52.2125,37.7875,99.9859
1233,1234,2190,1578,3300,305.96,50.4789,39.5211,99.9823
1234,1235,2674,682,3309,135.185,28.6492,61.3508,99.998
1235,1236,597,199,3296,138.105,11.7754,78.2246,99.8484
1236,1237,906,2355,3295,179.417,84.5932,5.40679,99.9937
1237,1238,1125,744,3297,311.796,26.287,63.713,99.9962
1238,1239,6898,3162,3341,136.82399999999998,70.3923,19.6077,99.9981
1239,1240,2514,504,3356,321.395,10.5766,79.4234,99.9199
1240,1241,2076,2707,3323,132.619,11.0523,78.9477,99.986
1241,1242,12917,282,3386,306.208,39.8524,50.1476,99.9938
1242,1243,12217,578,3365,311.888,25.6594,64.3406,99.9793
1243,1244,2293,1193,3338,311.866,31.4828,58.5172,99.9983
1244,1245,695,650,3326,133.08700000000002,16.4229,73.5771,99.9982
1245,1246,3479,2992,3338,318.201,23.2433,66.7567,99.9858
1246,1247,5396,214,3386,304.492,41.1896,48.8104,99.9335
1247,1248,3888,3265,3347,138.882,49.9026,40.0974,99.9972
1248,1249,3566,3533,3354,317.996,4.0793,85.9207,99.926
1249,1250,1503,2173,3330,313.96,2.12655,87.8735,99.9839
1250,1251,2921,919,3377,317.513,5.46317,84.5368,99.748
1251,1252,5764,2746,3368,137.284,17.3009,72.6991,99.9615
1252,1253,25914,1884,3404,135.15,46.0512,43.9488,99.7377
1253,1254,9828,2021,3370,136.564,3.69126,86.3087,99.9835
1254,1255,97734,917,3637,140.826,15.7372,74.2628,74.5321
1255,1256,59305,2440,3537,318.475,20.5755,69.4245,42.3525
1256,1257,114352,3010,3563,139.69299999999998,46.6961,43.3039,77.021
1257,1258,670,2967,3362,131.89600000000002,16.8067,73.1933,99.9912
1258,1259,7606,1235,3416,315.601,40.8817,49.1183,99.9861
1259,1260,13232,1330,3434,324.069,39.033,50.967,99.9963
1260,1261,27043,2574,3450,142.533,0.667229,89.3328,99.954
1261,1262,1516,2659,3396,136.067,14.9222,75.0778,99.9728
1262,1263,1208,3028,3396,167.226,70.0035,19.9965,99.9852
1263,1264,122111,1484,3698,138.378,23.087,66.913,93.1349
1264,1265,963,1656,3384,147.245,46.2864,43.7136,99.9922
1265,1266,6566,3095,3420,135.747,14.4493,75.5507,99.9975
1266,1267,2220,2710,3426,34.2748,86.4255,3.5744800000000003,99.9808
1267,1268,5096,1641,3431,319.15,53.8913,36.1087,99.9985
1268,1269,538,2418,3401,318.75,44.0146,45.9854,99.9756
1269,1270,1120,899,3407,137.114,11.2058,78.7942,99.9971
1270,1271,679,2866,3408,129.80100000000002,43.7482,46.2518,99.9974
1271,1272,4986,2834,3444,62.0867,88.5412,1.45878,99.9709
1272,1273,721,2739,3418,136.30100000000002,52.4904,37.5096,99.9972
1273,1274,1777,500,3425,289.578,61.7477,28.2523,99.9936
1274,1275,1283,972,3432,135.329,13.562,76.438,99.9737
1275,1276,4773,2089,3446,307.2920000000001,40.1051,49.8949,99.9221
1276,1277,2359,586,3454,313.305,15.8548,74.1452,99.9728
1277,1278,4744,644,3455,141.714,4.5733,85.4267,99.987
1278,1279,13971,2221,3472,316.431,50.7808,39.2192,99.8339
1279,1280,968,745,3435,136.457,14.5402,75.4598,99.9921
1280,1281,14565,1842,3502,308.791,23.4699,66.5301,62.4234
1281,1282,812,2766,3447,140.89700000000005,4.46895,85.5311,99.9967
1282,1283,1155,3055,3454,320.01,19.9666,70.0334,99.979
1283,1284,613,885,3446,319.233,8.20779,81.7922,99.9914
1284,1285,3228,731,3480,143.037,32.3732,57.6268,99.9927
1285,1286,12668,278,3504,133.40200000000002,9.3338,80.6662,59.0589
1286,1287,1379,3593,3504,312.008,41.6044,48.3956,99.9376
1287,1288,110676,481,3816,135.808,10.5455,79.4545,46.5781
1288,1289,892,541,3465,283.372,62.7472,27.2528,99.9943
1289,1290,1993,2317,3484,139.202,55.137,34.863,99.9968
1290,1291,1083,436,3473,327.23,43.1636,46.8364,99.8587
1291,1292,994,2759,3482,76.6247,88.0112,1.98884,99.9947
1292,1293,70020,1175,3609,142.482,44.5552,45.4448,99.7399
1293,1294,3079,2039,3506,317.914,0.789131,89.2109,99.9858
1294,1295,30550,2128,3587,131.53,8.89045,81.1096,99.9677
1295,1296,21759,658,3606,137.431,31.4373,58.5627,80.2787
1296,1297,655,1969,3508,311.88,31.2294,58.7706,99.9662
1297,1298,891,2636,3509,242.331,83.8701,6.12988,99.9976
1298,1299,20513,3284,3594,312.881,11.1494,78.8506,99.9813
1299,1300,810,1402,3522,138.58700000000002,1.56821,88.4318,99.9734
1300,1301,2227,3415,3542,129.15200000000002,39.8733,50.1267,99.9854
1301,1302,16888,347,3594,323.445,60.6683,29.3317,99.99
1302,1303,503,1992,3538,140.321,65.2917,24.7083,99.9223
1303,1304,532,2487,3531,304.48,68.8335,21.1665,99.9677
1304,1305,1624,3473,3539,288.262,51.1513,38.8487,99.9829
1305,1306,3891,3549,3552,145.613,32.0515,57.9485,82.5071
1306,1307,2875,1369,3564,315.99,18.505,71.495,99.9802
1307,1308,568,1883,3553,308.824,29.811,60.18899999999999,99.9951
1308,1309,634,1785,3553,310.514,39.0299,50.9701,99.9815
1309,1310,925,1409,3564,326.14,24.4036,65.5964,99.9918
1310,1311,12102,566,3631,307.635,30.6431,59.3569,99.9892
1311,1312,7933,3469,3606,310.0490000000001,34.8566,55.1434,99.9777
1312,1313,538,1867,3571,143.216,51.2827,38.7173,99.4792
1313,1314,41233,1959,3725,312.302,25.1713,64.8287,96.9921
1314,1315,2212,2612,3585,318.46,1.23392,88.7661,99.9965
1315,1316,3532,760,3598,316.2940000000001,1.1992,88.8008,99.9916
1316,1317,8885,254,3619,152.4,32.0379,57.9621,99.9877
1317,1318,2045,1748,3592,229.444,82.6374,7.362610000000001,99.995
1318,1319,6111,2761,3622,135.216,4.52577,85.4742,99.9552
1319,1320,17297,3373,3676,139.412,44.7122,45.2878,99.8267
1320,1321,896,962,3588,264.516,76.2033,13.7967,99.8678
1321,1322,35007,1715,3699,135.748,31.5341,58.4659,97.8573
1322,1323,1335,1866,3591,143.69799999999995,41.0651,48.9349,99.9852
1323,1324,548,189,3610,143.10299999999995,33.3436,56.6564,99.8824
1324,1325,2785,2654,3608,313.851,4.74446,85.2555,99.9969
1325,1326,1908,2388,3605,314.143,7.76336,82.2366,99.9972
1326,1327,810,2703,3602,140.67600000000002,84.4431,5.5569,99.9969
1327,1328,1327,3561,3626,154.767,53.4963,36.5037,99.9738
1328,1329,7057,3505,3692,156.207,52.4539,37.5461,99.9771
1329,1330,788,3590,3618,310.231,50.112,39.88800000000001,99.9459
1330,1331,7352,3093,3670,313.342,21.6247,68.3753,99.9489
1331,1332,10427,2513,3675,308.95,49.2474,40.7526,99.9209
1332,1333,3273,1903,3647,144.09799999999996,62.1395,27.8605,99.9931
1333,1334,6763,1578,3662,311.728,54.5101,35.4899,99.9837
1334,1335,964,2423,3636,141.069,5.20032,84.7997,99.9909
1335,1336,74441,2772,3777,139.643,18.0967,71.9033,99.6296
1336,1337,1610,3178,3658,328.475,22.1838,67.8162,99.901
1337,1338,11422,3556,3750,310.475,72.4659,17.5341,99.9266
1338,1339,3240,2235,3684,137.77700000000002,5.395969999999998,84.604,99.9809
1339,1340,1512,230,3677,305.211,75.0546,14.9454,99.9878
1340,1341,22539,2345,3736,321.82,11.6808,78.3192,99.9305
1341,1342,14316,2117,3727,131.545,79.8328,10.1672,99.9742
1342,1343,938,3171,3681,136.43,35.0568,54.9432,99.6056
1343,1344,8976,672,3734,303.301,71.7227,18.2773,99.9559
1344,1345,10224,3238,3738,313.548,1.17958,88.8204,99.9028
1345,1346,5430,3143,3753,328.9790000000001,21.9594,68.0406,99.948
1346,1347,4450,1251,3748,289.062,80.1552,9.84476,99.9331
1347,1348,1385,1656,3710,313.921,10.7558,79.2442,99.9969
1348,1349,18826,264,3776,314.199,31.2657,58.7343,99.9461
1349,1350,7808,849,3740,313.9840000000001,13.936,76.064,99.9974
1350,1351,616,1744,3715,136.814,3.51112,86.4889,99.9982
1351,1352,1903,2771,3729,317.326,26.7631,63.2369,99.9968
1352,1353,1851,1782,3745,132.29399999999998,73.9613,16.0387,99.9963
1353,1354,950,2807,3734,304.861,64.7316,25.2684,99.9964
1354,1355,2117,750,3750,316.539,5.19972,84.8003,99.9661
1355,1356,9407,3390,3774,140.868,26.451,63.549,99.9876
1356,1357,563,191,3754,312.192,31.5606,58.4394,99.8339
1357,1358,3369,1752,3777,305.826,54.2479,35.7521,99.9645
1358,1359,845,2474,3759,303.622,75.9692,14.0308,99.9754
1359,1360,56827,2474,3894,138.409,31.063,58.937,99.829
1360,1361,508,363,3763,141.77700000000004,21.3979,68.6021,99.9877
1361,1362,2484,1687,3773,312.746,9.26376,80.7362,99.9927
1362,1363,5619,2206,3796,141.349,8.080639999999999,81.9194,99.9985
1363,1364,8111,807,3805,303.7290000000001,74.3782,15.6218,99.9801
1364,1365,1005,652,3781,304.38,78.2912,11.7088,99.986
1365,1366,4501,380,3804,317.035,35.2365,54.7635,99.9678
1366,1367,1979,1178,3787,323.719,10.2961,79.7039,99.9977
1367,1368,3788,1525,3811,317.56,54.1307,35.8693,99.9896
1368,1369,7388,712,3828,137.695,25.4775,64.5225,99.9633
1369,1370,75111,1720,3982,143.184,26.6754,63.3246,85.0809
1370,1371,5582,283,3825,320.726,23.1054,66.8946,99.9772
1371,1372,11226,2269,3845,341.867,65.1835,24.8165,99.8425
1372,1373,6478,2107,3819,131.709,11.6925,78.3075,99.9918
1373,1374,10610,3404,3849,137.35399999999998,5.4058199999999985,84.5942,99.9086
1374,1375,1024,3503,3804,310.647,8.96707,81.0329,99.4298
1375,1376,6173,1667,3826,279.228,80.0092,9.99078,99.9979
1376,1377,4108,2831,3831,136.415,0.104347,89.8957,99.9801
1377,1378,1487,3187,3813,143.02700000000004,29.8929,60.1071,99.9841
1378,1379,1694,3080,3828,139.059,24.6519,65.3481,99.9787
1379,1380,4737,3273,3834,324.035,21.802,68.19800000000001,99.9967
1380,1381,723,1146,3822,313.925,60.839,29.161,99.997
1381,1382,1708,1092,3843,147.631,21.9835,68.0165,99.9925
1382,1383,2520,3152,3835,138.275,9.63978,80.3602,99.994
1383,1384,2948,1740,3845,317.918,7.133210000000001,82.8668,99.9985
1384,1385,3982,3531,3853,315.487,13.9568,76.0432,99.975
1385,1386,2099,854,3846,201.06,83.3559,6.64405,99.986
1386,1387,1951,659,3861,138.342,18.9459,71.0541,99.9863
1387,1388,519,2168,3844,140.03799999999998,18.354,71.646,99.882
1388,1389,1302,2012,3854,131.391,2.22306,87.7769,99.9817
1389,1390,17790,1568,3904,318.258,46.8274,43.1726,99.9947
1390,1391,3432,1209,3859,140.56799999999998,28.5985,61.4015,99.9974
1391,1392,3567,1260,3881,321.312,86.2979,3.70211,99.9833
1392,1393,11768,1120,3908,160.55700000000004,79.1159,10.8841,99.9372
1393,1394,8471,2082,3881,132.102,26.5638,63.4362,99.9641
1394,1395,11246,3083,3922,315.119,56.7726,33.2274,99.8598
1395,1396,16164,890,3926,131.019,16.6031,73.3969,99.987
1396,1397,1953,3312,3875,320.697,13.4934,76.5066,99.9974
1397,1398,22267,3223,3940,139.855,49.0591,40.9409,99.9519
1398,1399,570,808,3869,317.464,54.3754,35.6246,99.991
1399,1400,675,189,3882,312.317,31.0526,58.9474,99.8956
1400,1401,6624,2814,3931,317.627,9.32122,80.6788,99.8005
1401,1402,1180,1686,3884,321.066,16.6451,73.3549,99.9904
1402,1403,1418,2851,3883,309.4290000000001,62.6383,27.3617,99.9864
1403,1404,3232,3500,3904,313.553,0.8252870000000001,89.1747,99.9924
1404,1405,18975,747,3965,137.972,6.609889999999999,83.3901,94.9157
1405,1406,1486,2363,3892,143.071,16.7819,73.2181,99.9783
1406,1407,1222,790,3897,137.43,20.8071,69.1929,99.9824
1407,1408,6819,3412,3926,313.316,27.7448,62.2552,99.886
1408,1409,8289,1747,3926,318.142,45.3369,44.6631,99.9927
1409,1410,4999,2934,3913,132.719,53.5394,36.4606,99.9305
1410,1411,1627,2187,3901,137.005,9.41343,80.5866,99.9613
1411,1412,528,2744,3890,301.87,58.7357,31.2643,99.9931
1412,1413,2883,2676,3908,320.737,1.84301,88.15700000000002,99.9936
1413,1414,2406,633,3904,154.907,59.2065,30.7935,99.9933
1414,1415,8885,2064,3950,310.486,34.0839,55.9161,99.9908
1415,1416,952,3560,3918,137.083,61.1378,28.8622,99.9615
1416,1417,3435,2263,3937,141.461,7.67006,82.3299,99.9826
1417,1418,64455,2541,4074,138.02100000000002,7.828410000000001,82.1716,84.1959
1418,1419,1605,673,3939,253.476,81.9261,8.07395,99.9939
1419,1420,12840,2900,3985,323.835,59.8804,30.1196,99.9527
1420,1421,2472,1213,3939,138.167,69.8962,20.1038,99.9585
1421,1422,7485,2176,3963,149.363,78.5502,11.4498,99.9726
1422,1423,5835,247,3972,139.635,29.9935,60.0065,97.6356
1423,1424,535,186,3954,126.32,8.6368,81.3632,99.871
1424,1425,1026,212,3948,127.809,9.22508,80.7749,99.9751
1425,1426,583,984,3932,153.935,51.5501,38.4499,99.024
1426,1427,2453,2319,3954,312.605,8.82629,81.1737,99.9969
1427,1428,1987,985,3968,124.234,66.6212,23.3788,99.9885
1428,1429,67560,1152,4112,322.355,2.51122,87.4888,95.5527
1429,1430,6060,3309,3990,314.925,13.4078,76.5922,99.9843
1430,1431,5086,3512,3961,312.192,11.1417,78.8583,99.9935
1431,1432,2255,3581,3979,305.196,76.8875,13.1125,99.9753
1432,1433,10068,1032,4017,171.107,83.0078,6.99218,96.635
1433,1434,40938,310,4084,314.11,52.3396,37.6604,62.2574
1434,1435,13674,3065,4047,321.771,6.6175,83.3825,99.8538
1435,1436,19513,1934,4034,316.077,8.878589999999997,81.1214,75.3071
1436,1437,52348,3443,4102,139.487,26.6099,63.3901,99.1005
1437,1438,30214,2233,4081,136.77200000000002,9.46678,80.5332,69.5232
1438,1439,1047,3153,3995,136.459,6.858219999999998,83.1418,99.9903
1439,1440,1319,1438,4003,318.839,14.8328,75.1672,99.9822
1440,1441,7388,2094,4049,122.515,79.3106,10.6894,99.8266
1441,1442,19425,848,4076,148.554,29.4194,60.5806,99.6984
1442,1443,696,808,4026,144.035,1.5758299999999998,88.4242,99.5167
1443,1444,26103,1423,4124,134.99200000000002,77.6553,12.3447,98.7656
1444,1445,8357,2931,4063,139.372,40.6924,49.3076,99.8355
1445,1446,2365,727,4062,137.217,45.0442,44.9558,99.6235
1446,1447,1237,771,4036,328.792,15.1855,74.8145,99.9946
1447,1448,777,638,4043,313.158,28.204,61.79600000000001,99.9582
1448,1449,6277,2638,4084,322.41,6.26665,83.7334,98.5907
1449,1450,95887,2711,4255,304.487,69.3883,20.6117,99.9532
1450,1451,49492,3261,4188,271.515,79.9607,10.0393,99.8867
1451,1452,8607,556,4095,310.215,51.2411,38.7589,99.9653
1452,1453,925,1210,4053,132.753,76.0409,13.9591,99.9962
1453,1454,4188,1307,4104,329.672,44.971,45.029,99.9602
1454,1455,1325,1165,4058,314.014,22.2326,67.7674,99.9973
1455,1456,811,2824,4071,316.555,10.5012,79.4988,99.9341
1456,1457,3608,632,4095,309.998,5.09158,84.9084,99.9836
1457,1458,12705,1882,4136,143.17,3.0685,86.9315,99.979
1458,1459,2223,1740,4095,132.44299999999998,42.5922,47.4078,99.9962
1459,1460,618,1904,4090,141.73,10.5286,79.4714,99.993
1460,1461,2383,2002,4107,134.35,80.5467,9.45332,99.9859
1461,1462,3176,1790,4106,305.135,41.7982,48.2018,99.9933
1462,1463,4054,2057,4128,310.705,32.1976,57.8024,99.9963
1463,1464,1748,3571,4131,134.14700000000002,15.2076,74.7924,99.977
1464,1465,20365,680,4190,317.53,84.7295,5.27054,99.8754
1465,1466,8829,878,4160,128.65200000000002,21.5478,68.4522,99.9949
1466,1467,620,939,4130,135.811,3.87246,86.1275,99.9669
1467,1468,537,3063,4120,141.654,27.0975,62.9025,98.9958
1468,1469,1971,455,4140,304.812,49.4203,40.5797,99.9805
1469,1470,1534,2958,4136,317.762,9.21175,80.7882,99.9968
1470,1471,529,3011,4131,138.329,35.1905,54.8095,99.9763
1471,1472,20071,1700,4193,320.014,53.9777,36.0223,99.987
1472,1473,2634,2915,4169,137.026,21.4463,68.5537,99.9748
1473,1474,6070,771,4187,323.432,16.3263,73.6737,99.9804
1474,1475,1112,2368,4156,314.954,55.8623,34.1377,99.9854
1475,1476,1148,498,4154,144.99200000000005,33.928000000000004,56.072,99.9862
1476,1477,3360,3050,4164,323.403,2.1412400000000003,87.8588,99.9472
1477,1478,2314,1602,4160,136.964,54.5287,35.4713,99.9991
1478,1479,2578,1315,4173,133.472,0.506836,89.4932,99.9984
1479,1480,6137,1977,4194,319.458,7.67432,82.3257,99.9941
1480,1481,7074,2304,4202,312.376,16.5509,73.4491,99.9967
1481,1482,48635,2170,4269,285.03,82.1194,7.88058,99.9367
1482,1483,3003,2966,4183,136.447,40.7777,49.2223,99.9975
1483,1484,8232,534,4203,146.046,56.3276,33.6724,99.9827
1484,1485,542,3209,4173,137.591,25.4466,64.5534,99.9491
1485,1486,2257,442,4187,295.666,71.5033,18.4967,99.9933
1486,1487,2352,219,4190,308.463,61.7974,28.2026,99.9773
1487,1488,6509,1039,4211,303.944,70.9639,19.0361,98.9089
1488,1489,876,806,4186,128.92700000000002,76.1224,13.8776,99.9358
1489,1490,3729,3181,4201,133.721,28.4566,61.5434,99.9991
1490,1491,567,3370,4184,147.849,7.43475,82.5653,99.9944
1491,1492,595,3584,4193,141.015,36.5647,53.4353,99.9832
1492,1493,9123,371,4221,136.525,9.77434,80.2257,99.8127
1493,1494,13184,1505,4225,139.616,23.4458,66.5542,99.9834
1494,1495,4056,2556,4215,151.67700000000005,56.1716,33.8284,99.9453
1495,1496,61266,2985,4357,320.16,29.919,60.081,78.3056
1496,1497,757,1895,4204,134.55100000000002,30.5485,59.4515,99.996
1497,1498,2135,1802,4233,136.371,6.37134,83.6287,99.9911
1498,1499,8345,263,4248,333.702,72.8623,17.1377,99.9926
1499,1500,7215,1324,4260,284.671,83.3876,6.61239,99.975
1500,1501,2861,1843,4239,134.289,29.928,60.072,99.9967
1501,1502,2652,900,4224,134.335,0.419876,89.5801,99.9915
1502,1503,3437,2372,4240,313.824,54.7305,35.2695,99.9864
1503,1504,11854,3492,4275,134.942,8.43095,81.5691,99.9361
1504,1505,3339,474,4257,317.958,23.4398,66.5602,99.8013
1505,1506,24038,1695,4320,322.438,10.4343,79.5657,99.9947
1506,1507,3189,1895,4256,130.55,46.3799,43.6201,99.9604
1507,1508,1267,864,4256,324.351,32.6436,57.3564,99.994
1508,1509,9243,648,4273,332.065,75.9589,14.0411,99.9781
1509,1510,20379,2451,4360,132.70600000000002,26.4751,63.5249,99.6387
1510,1511,22724,1179,4315,308.6690000000001,63.2814,26.7186,99.994
1511,1512,3823,814,4290,143.819,12.4252,77.5748,99.9975
1512,1513,16669,988,4318,155.703,65.7285,24.2715,44.4943
1513,1514,23312,1961,4325,312.2940000000001,39.7212,50.2788,99.5878
1514,1515,1725,2315,4267,126.528,16.5636,73.4364,99.9989
1515,1516,1260,2247,4260,133.564,26.1868,63.8132,99.9986
1516,1517,10129,1402,4326,316.38,26.1405,63.8595,98.9121
1517,1518,6065,1549,4295,314.455,8.01475,81.9853,99.9899
1518,1519,3289,198,4295,315.573,14.0734,75.9266,99.957
1519,1520,24797,542,4345,138.101,46.4627,43.5373,99.9643
1520,1521,6803,303,4311,146.73,49.9898,40.0102,99.9838
1521,1522,1738,1073,4291,326.388,26.4626,63.5374,99.9902
1522,1523,14483,3139,4368,137.815,41.2556,48.7444,99.9803
1523,1524,560,2077,4301,132.991,34.8523,55.1477,99.9975
1524,1525,46832,992,4419,140.665,35.3019,54.6981,99.8706
1525,1526,4538,2360,4316,134.155,36.0777,53.9223,99.997
1526,1527,1342,1799,4312,316.718,52.3421,37.6579,99.9908
1527,1528,26472,2815,4383,305.834,32.8703,57.1297,99.9934
1528,1529,919,410,4298,139.144,36.5613,53.4387,99.958
1529,1530,17552,734,4384,317.878,40.9921,49.0079,99.9588
1530,1531,2345,3543,4331,309.83,52.1675,37.8325,99.9783
1531,1532,1020,3573,4337,310.281,52.0606,37.9394,99.9716
1532,1533,2149,2497,4322,302.119,66.19800000000001,23.802,99.9939
1533,1534,5185,1472,4362,121.12,76.9906,13.0094,99.9482
1534,1535,21412,1254,4463,141.816,2.17659,87.8234,99.1703
1535,1536,13171,389,4379,320.433,20.5989,69.4011,99.9653
1536,1537,1761,643,4335,320.725,33.7508,56.2492,99.9961
1537,1538,1874,1574,4339,152.763,60.0523,29.9477,99.9978
1538,1539,782,2527,4333,312.776,43.7063,46.2937,99.9967
1539,1540,2650,3496,4350,318.046,11.2741,78.7259,99.997
1540,1541,2058,253,4355,134.767,29.4629,60.5371,99.9823
1541,1542,4790,3316,4354,167.78599999999997,79.0224,10.9776,99.9958
1542,1543,5635,1844,4379,136.131,45.9607,44.0393,99.8162
1543,1544,14688,3232,4392,317.842,8.672039999999999,81.328,99.8743
1544,1545,1048,182,4382,299.685,63.5175,26.4825,99.9754
1545,1546,4063,220,4383,298.9770000000001,63.1571,26.8429,99.989
1546,1547,11006,2295,4413,311.085,21.0338,68.9662,99.9767
1547,1548,3934,1771,4377,308.074,23.1382,66.8618,99.9983
1548,1549,1928,2073,4368,131.14,34.6805,55.3195,99.9986
1549,1550,2622,3369,4379,140.41899999999998,24.1399,65.8601,99.9965
1550,1551,1317,309,4370,149.339,70.7497,19.2503,99.9815
1551,1552,1064,2620,4378,319.011,6.19647,83.8035,99.9987
1552,1553,1091,1588,4384,326.793,51.8703,38.1297,99.9974
1553,1554,32694,3382,4492,326.372,40.1705,49.8295,99.9207
1554,1555,2392,3555,4394,139.077,26.1817,63.8183,99.9053
1555,1556,1170,1096,4392,326.148,24.4503,65.5497,99.9877
1556,1557,12562,1588,4437,150.58700000000005,59.7194,30.2806,99.9695
1557,1558,38962,1968,4521,320.27,0.740242,89.2598,76.7538
1558,1559,814,2155,4402,343.892,87.4692,2.53084,99.994
1559,1560,9200,3514,4456,134.878,38.2781,51.7219,99.9698
1560,1561,942,1156,4406,311.816,15.3032,74.6968,99.9951
1561,1562,12980,293,4492,143.656,57.9319,32.0681,99.8355
1562,1563,8014,2564,4445,322.293,19.602,70.398,99.8894
1563,1564,3049,3019,4427,140.394,15.9893,74.0107,99.9908
1564,1565,39138,448,4587,137.028,1.98302,88.01700000000002,99.3606
1565,1566,17063,1755,4482,318.512,47.9851,42.0149,79.4223
1566,1567,2435,2376,4443,227.723,89.5533,0.446749,99.9785
1567,1568,22391,630,4577,140.547,38.2205,51.7795,99.6118
1568,1569,7440,1929,4470,314.09,53.0178,36.9822,99.9686
1569,1570,12443,392,4485,294.168,62.9107,27.0893,99.9848
1570,1571,42714,1471,4558,318.401,0.517509,89.4825,97.9779
1571,1572,1656,1866,4446,130.463,16.1113,73.8887,99.8977
1572,1573,34019,3085,4533,143.841,26.5094,63.4906,77.6772
1573,1574,2954,190,4474,133.25799999999998,28.3715,61.6285,99.8336
1574,1575,110293,2383,4592,320.099,31.8494,58.1506,80.9161
1575,1576,3641,642,4458,286.626,76.1441,13.8559,99.9555
1576,1577,16181,1308,4520,307.207,56.3261,33.6739,95.2533
1577,1578,1465,229,4463,132.007,29.2445,60.7555,99.9764
1578,1579,891,3260,4453,322.596,12.5228,77.4772,99.9914
1579,1580,3058,2320,4480,273.411,83.0931,6.90687,99.9893
1580,1581,665,3594,4462,86.0676,16.8389,73.1611,99.9832
1581,1582,4035,2437,4484,116.951,69.2007,20.7993,99.9742
1582,1583,13635,841,4507,319.531,10.6936,79.3064,99.1869
1583,1584,2195,3235,4502,141.44299999999996,1.10254,88.8975,99.9958
1584,1585,5936,2776,4518,312.658,20.4946,69.5054,99.9853
1585,1586,7407,3540,4571,319.202,58.7219,31.2781,99.8092
1586,1587,5023,1680,4538,124.78,62.6852,27.3148,99.9364
1587,1588,19638,1007,4553,315.836,27.8366,62.1634,78.3084
1588,1589,2650,1587,4532,137.60399999999998,57.5396,32.4604,99.9524
1589,1590,4653,230,4546,316.261,6.03412,83.9659,99.9744
1590,1591,1911,729,4545,321.01,4.39199,85.60799999999998,99.9923
1591,1592,22637,1650,4666,320.153,11.1496,78.8504,99.904
1592,1593,15224,812,4609,344.005,85.0376,4.96242,99.992
1593,1594,1832,168,4574,132.48,11.8568,78.1432,99.9547
1594,1595,2061,1263,4558,222.273,81.7956,8.204360000000001,99.9931
1595,1596,11571,676,4600,300.867,74.1948,15.8052,100.002
1596,1597,8709,3236,4604,174.71,77.5215,12.4785,99.961
1597,1598,1006,2256,4570,134.139,21.4889,68.5111,99.9933
1598,1599,6888,1754,4603,322.403,24.7056,65.2944,99.8923
1599,1600,19469,2029,4657,138.704,11.2428,78.7572,99.6572
1600,1601,2433,2151,4586,135.827,12.4087,77.5913,99.9972
1601,1602,4531,2637,4613,105.809,74.0206,15.9794,99.9974
1602,1603,997,2891,4584,135.744,3.4936300000000005,86.5064,99.9921
1603,1604,3263,3467,4609,314.656,55.7964,34.2036,99.9344
1604,1605,18700,3391,4659,319.646,12.4624,77.5376,99.9723
1605,1606,2436,1330,4606,187.474,87.6267,2.37331,99.9957
1606,1607,5684,234,4634,318.363,1.30618,88.6938,99.9347
1607,1608,934,3170,4601,314.118,53.8885,36.1115,99.9973
1608,1609,33595,1071,4684,158.933,86.0675,3.93248,99.8417
1609,1610,1370,3036,4607,313.671,55.5944,34.4056,99.7178
1610,1611,2017,522,4615,309.569,39.2702,50.7298,99.9736
1611,1612,8900,2463,4664,315.772,17.7913,72.2087,99.9866
1612,1613,1998,278,4614,138.504,20.4067,69.5933,99.9743
1613,1614,743,1138,4609,307.801,57.56399999999999,32.436,99.9979
1614,1615,6518,2537,4645,322.399,8.75891,81.2411,99.9969
1615,1616,3247,179,4676,319.325,0.217072,89.7829,99.6993
1616,1617,2712,2141,4643,131.92600000000002,55.5989,34.4011,99.9561
1617,1618,3588,1299,4650,143.679,30.4742,59.5258,99.9937
1618,1619,648,1877,4623,316.245,24.1503,65.8497,99.9951
1619,1620,2391,2625,4661,324.163,1.02445,88.9755,99.7125
1620,1621,8254,2996,4681,136.816,2.36777,87.6322,99.8909
1621,1622,4084,3149,4652,136.808,64.0263,25.9737,99.9892
1622,1623,506,3533,4631,320.535,48.0216,41.9784,99.9778
1623,1624,15378,2871,4740,139.384,16.373,73.627,99.3976
1624,1625,15925,3102,4713,313.712,52.6617,37.3383,99.9664
1625,1626,955,1700,4642,324.585,39.3426,50.6574,99.9973
1626,1627,4248,582,4682,309.6020000000001,42.0138,47.9862,99.9693
1627,1628,1658,3498,4658,314.335,8.994069999999997,81.0059,99.9891
1628,1629,6691,2773,4669,165.65,83.6738,6.3262,99.9924
1629,1630,987,3574,4662,63.2686,66.3367,23.6633,99.9857
1630,1631,2690,318,4675,333.475,76.0121,13.9879,99.983
1631,1632,5432,3247,4688,320.634,20.5778,69.4222,99.9708
1632,1633,3216,1731,4680,130.09799999999998,83.17399999999998,6.82602,99.9968
1633,1634,10035,1873,4709,168.514,76.4124,13.5876,59.8457
1634,1635,850,3531,4669,132.63,53.8269,36.1731,99.9838
1635,1636,2096,1172,4705,309.8640000000001,20.9329,69.0671,99.9958
1636,1637,1380,2689,4670,259.387,83.4979,6.50206,99.9986
1637,1638,10129,1359,4724,134.451,7.230410000000001,82.7696,99.9145
1638,1639,2799,2589,4690,302.754,68.2523,21.7477,99.9962
1639,1640,10614,815,4701,310.475,56.1649,33.8351,99.9394
1640,1641,5988,1452,4705,306.253,7.60553,82.3945,99.9917
1641,1642,2580,2389,4695,135.675,27.1081,62.8919,99.9955
1642,1643,4290,2943,4717,320.898,64.5361,25.4639,99.9957
1643,1644,4850,1237,4701,136.865,84.8551,5.14489,99.9545
1644,1645,8572,494,4718,321.036,7.53113,82.4689,99.9577
1645,1646,658,271,4682,138.996,60.5761,29.4239,99.9834
1646,1647,2847,3326,4704,134.222,43.3172,46.6828,99.997
1647,1648,3006,932,4717,141.04,48.0287,41.9713,75.6911
1648,1649,4694,2336,4724,305.177,60.0232,29.9768,99.9433
1649,1650,5009,3505,4726,316.909,49.0311,40.9689,99.9806
1650,1651,5571,266,4723,139.82,17.4447,72.5553,99.9152
1651,1652,9980,2721,4743,237.525,84.0143,5.98573,99.9832
1652,1653,8738,2566,4761,140.747,4.41679,85.5832,99.9039
1653,1654,2514,2629,4730,128.493,37.5133,52.4867,99.9992
1654,1655,13857,3410,4788,139.869,12.4918,77.5082,98.5274
1655,1656,16999,1608,4754,149.641,59.4674,30.5326,99.9807
1656,1657,4171,2037,4767,131.655,2.10786,87.8921,99.8604
1657,1658,1660,732,4739,305.278,59.6494,30.3506,99.9625
1658,1659,7243,1263,4754,293.716,59.1447,30.8553,99.9915
1659,1660,501,3571,4733,138.372,56.5183,33.4817,99.9342
1660,1661,1303,1985,4732,127.76,59.5684,30.4316,99.9929
1661,1662,2008,1861,4741,140.44,40.821,49.179,99.9947
1662,1663,3593,2083,4749,318.165,13.1129,76.8871,99.9965
1663,1664,6704,2425,4772,324.439,34.4693,55.5307,99.7998
1664,1665,995,629,4732,132.877,6.90544,83.0946,99.9804
1665,1666,6406,3257,4760,91.696,82.6462,7.35375,99.9831
1666,1667,1062,683,4736,318.903,72.533,17.467,99.9971
1667,1668,2113,563,4751,321.782,0.03501130000000001,89.965,99.961
1668,1669,2082,1499,4767,135.609,23.8073,66.1927,99.9909
1669,1670,3807,1812,4760,145.352,78.9427,11.0573,99.9963
1670,1671,7303,924,4760,153.47899999999996,36.8777,53.1223,99.8664
1671,1672,5140,2500,4785,193.168,83.5287,6.47127,99.9888
1672,1673,913,392,4748,312.781,20.4003,69.5997,99.9219
1673,1674,1211,782,4758,312.137,72.0084,17.9916,99.9893
1674,1675,855,2986,4763,145.91,48.1105,41.8895,99.9895
1675,1676,753,649,4757,151.252,49.9905,40.0095,99.9774
1676,1677,814,707,4762,132.658,33.74,56.26,99.9789
1677,1678,4578,1441,4784,145.378,45.5762,44.4238,99.1405
1678,1679,6853,2311,4791,322.155,4.84917,85.1508,99.9822
1679,1680,4175,1967,4790,148.36,7.68427,82.3157,99.9762
1680,1681,516,3045,4774,141.997,47.8833,42.1167,99.9987
1681,1682,1417,2112,4789,128.819,58.1253,31.8747,99.9958
1682,1683,2097,2792,4788,312.343,12.4163,77.5837,99.9924
1683,1684,1078,2658,4780,311.887,69.4442,20.5558,99.979
1684,1685,1192,2950,4782,307.72,52.3443,37.6557,99.9681
1685,1686,16311,3134,4812,321.371,20.374,69.626,99.7816
1686,1687,1190,3497,4791,137.741,10.903,79.097,99.9907
1687,1688,1262,1872,4789,134.18200000000002,16.4067,73.5933,99.9744
1688,1689,585,2178,4788,317.4190000000001,34.5046,55.4954,99.9716
1689,1690,502,1731,4793,134.925,38.2292,51.7708,99.9762
1690,1691,2705,3559,4830,142.791,62.6965,27.3035,99.9724
1691,1692,1453,2155,4807,140.534,53.8717,36.1283,99.9666
1692,1693,856,2220,4806,325.781,47.5161,42.4839,99.9805
1693,1694,2727,2725,4810,159.601,83.1309,6.86908,99.9948
1694,1695,2400,2634,4815,268.823,77.8152,12.1848,99.9921
1695,1696,1461,2970,4820,146.25799999999995,25.4303,64.5697,99.9938
1696,1697,2589,2816,4823,312.956,63.2064,26.7936,99.9809
1697,1698,824,3345,4815,316.21,84.0431,5.95694,99.9944
1698,1699,1662,3299,4828,139.929,2.78851,87.2115,99.9898
1699,1700,652,2918,4829,181.463,83.5018,6.49824,99.9833
1700,1701,596,3424,4845,316.971,3.46883,86.5312,99.9299
1701,1702,850,3344,4841,134.654,3.59464,86.4054,99.9865
