,Grain No.,Size [Pixel],center x-coordinate,center y-coordinate,mean azimuth [degree],mean latitude [degree],mean colatitude [degree],Regelungsgrad [%]
0,1,694,258,53,253.611,7.36752,82.6325,99.7722
1,2,4882,3279,103,80.1103,10.8167,79.1833,99.6936
2,3,6747,3354,140,73.4071,41.3726,48.6274,99.6905
3,4,15934,284,125,256.831,3.93832,86.0617,99.8598
4,5,29582,443,172,79.4501,64.0764,25.9236,99.8507
5,6,10636,712,131,84.1889,63.5843,26.4157,99.9674
6,7,8789,813,151,265.639,12.4051,77.5949,99.9232
7,8,4960,585,103,83.2366,60.6498,29.3502,99.8994
8,9,1627,141,99,282.658,38.0703,51.9297,99.9778
9,10,6477,972,115,258.97900000000004,72.8953,17.1047,99.6686
10,11,1062,3410,117,130.891,17.6139,72.3861,99.219
11,12,555,1232,94,262.60400000000004,26.8233,63.1767,99.9923
12,13,29922,1785,167,79.5035,61.1499,28.8501,99.9264
13,14,555,1057,95,267.517,71.2879,18.7121,99.7319
14,15,678,1087,103,298.603,69.9732,20.0268,99.6506
15,16,20563,1971,204,262.632,10.6436,79.3564,98.9297
16,17,666,1404,97,271.807,50.7469,39.2531,99.9853
17,18,796,1577,102,85.4921,18.9311,71.0689,99.9341
18,19,25326,2995,202,268.946,53.5961,36.4039,98.7752
19,20,11207,2504,174,93.8242,57.4208,32.5792,99.56
20,21,1178,2685,115,85.5969,64.6484,25.3516,99.9228
21,22,1116,2785,115,264.999,23.9668,66.0332,99.9741
22,23,7333,3105,139,92.9823,25.0613,64.9387,99.8504
23,24,1641,1497,126,275.747,27.1024,62.8976,98.8335
24,25,39280,2286,196,83.865,31.2794,58.7206,99.8851
25,26,2463,1318,125,262.404,77.1257,12.8743,99.9893
26,27,1944,1221,119,263.331,26.7771,63.2229,99.9861
27,28,3998,2575,146,273.065,55.8259,34.1741,99.9755
28,29,2034,1405,135,272.763,50.1073,39.8927,99.9832
29,30,4870,2426,164,73.7062,21.8855,68.1145,99.9788
30,31,13452,1505,259,266.196,53.2798,36.7202,99.2308
31,32,679,2107,124,329.261,88.2057,1.79428,99.9823
32,33,515,2628,129,272.654,56.0789,33.9211,99.9962
33,34,1394,1635,135,270.774,0.7747189999999999,89.2253,99.9891
34,35,22423,2803,227,86.6001,29.9184,60.0816,99.9641
35,36,958,2035,143,212.711,88.2432,1.7568,99.9922
36,37,2332,2741,147,275.011,50.7351,39.2649,99.9884
37,38,1115,150,144,98.7326,0.91877,89.0812,99.991
38,39,3394,1564,159,275.441,52.3325,37.6675,99.9861
39,40,47936,1106,240,98.1904,44.9705,45.0295,99.7085
40,41,1036,1253,146,80.7875,33.1497,56.8503,99.9867
41,42,3283,1189,159,97.6398,47.5851,42.4149,99.9738
42,43,10933,910,199,152.707,82.8489,7.151089999999999,99.9569
43,44,3375,3258,161,83.8425,11.9269,78.0731,99.9898
44,45,1542,592,157,271.789,18.9752,71.0248,99.9957
45,46,3718,1341,163,259.235,28.8073,61.1927,99.9634
46,47,6950,3217,199,260.74,43.9209,46.0791,99.9672
47,48,12394,231,203,75.7677,62.4066,27.5934,99.9734
48,49,1496,2641,167,280.66,48.0186,41.9814,99.986
49,50,25172,611,292,56.097,82.9599,7.0400800000000014,99.9097
50,51,7556,1602,223,282.848,63.6245,26.3755,99.9274
51,52,2380,3314,206,77.7969,42.883,47.117,99.9618
52,53,763,139,190,76.3387,69.9487,20.0513,99.9647
53,54,1165,2067,191,268.326,10.1163,79.8837,99.9924
54,55,24981,2643,286,93.03,6.88245,83.1175,99.9352
55,56,743,2110,187,273.736,9.90506,80.0949,99.9942
56,57,3995,1371,210,261.68,2.83675,87.1632,99.9851
57,58,4466,1433,247,255.186,26.1174,63.8826,99.9919
58,59,3449,3167,229,79.7671,34.5708,55.4292,99.9922
59,60,2136,560,212,268.839,12.5503,77.4497,99.9887
60,61,12580,745,243,260.116,10.8734,79.1266,99.9512
61,62,3456,3108,228,79.7716,34.6441,55.3559,99.8799
62,63,645,1544,216,275.301,2.59744,87.4026,99.9772
63,64,3985,2128,227,278.482,76.7601,13.2399,99.9851
64,65,966,1654,231,272.833,56.2872,33.7128,99.9949
65,66,7394,1708,274,258.415,17.4773,72.5227,99.986
66,67,25676,2420,342,254.011,32.32,57.68,99.6965
67,68,565,2891,231,239.561,70.8092,19.1908,99.9923
68,69,65942,321,421,275.318,30.9957,59.0043,99.776
69,70,742,1316,239,258.608,31.2295,58.7705,99.9985
70,71,516,193,244,262.922,23.3519,66.6481,99.9426
71,72,11093,170,328,268.594,20.0492,69.9508,99.9859
72,73,7422,1891,293,261.189,25.9131,64.0869,99.9861
73,74,2252,2965,264,260.335,45.8803,44.1197,99.9911
74,75,13303,3251,308,85.0284,14.9292,75.0708,99.9516
75,76,616,2495,256,74.6998,24.4095,65.5905,99.2212
76,77,1707,3351,273,299.282,75.8317,14.1683,99.9675
77,78,2950,2916,286,81.7964,49.1592,40.8408,99.9753
78,79,940,1346,266,85.0507,28.4887,61.5113,99.9941
79,80,6238,886,299,263.152,8.26878,81.7312,99.9861
80,81,852,2530,278,87.6599,64.7609,25.2391,99.9865
81,82,2352,1818,285,88.1713,17.4075,72.5925,99.9893
82,83,2095,231,303,262.388,57.6221,32.3779,99.9226
83,84,16526,1339,328,262.916,3.18054,86.8195,99.9248
84,85,653,2196,282,279.683,77.2362,12.7638,99.9878
85,86,1766,474,288,263.858,30.5713,59.4287,99.7042
86,87,600,2141,281,264.238,77.3775,12.6225,99.9677
87,88,530,2551,295,84.8095,63.65600000000001,26.344,99.8501
88,89,824,536,292,103.467,5.56035,84.4397,99.9911
89,90,1582,2240,302,257.764,31.8307,58.1693,99.9963
90,91,6363,752,327,253.264,17.4325,72.5675,99.9431
91,92,3258,1942,331,267.585,24.0504,65.9496,99.9884
92,93,6398,2031,332,267.195,28.1514,61.8486,99.2906
93,94,12284,3011,374,83.5828,47.3616,42.6384,99.4097
94,95,8558,3133,362,106.425,61.7994,28.2006,99.9887
95,96,23414,2900,425,272.545,18.8108,71.1892,99.9652
96,97,557,2312,318,267.019,51.7005,38.2995,99.9658
97,98,11844,1819,373,258.946,39.9334,50.0666,99.9489
98,99,1363,856,354,265.01,9.8624,80.1376,99.961
99,100,6556,2173,370,85.2646,26.8821,63.1179,99.8417
100,101,1309,2120,336,93.5554,45.1383,44.8617,99.9832
101,102,10941,2254,404,265.909,49.7985,40.2015,99.8738
102,103,663,1200,336,93.4958,36.8527,53.1473,99.9599
103,104,4518,3350,365,250.292,9.58118,80.4188,99.9468
104,105,4495,1615,354,81.4805,52.619,37.381,99.9754
105,106,21526,2799,458,82.3732,4.59785,85.4021,99.907
106,107,14110,961,392,259.922,5.55595,84.4441,99.2946
107,108,3458,2517,369,88.2112,51.9308,38.0692,99.7608
108,109,10655,2704,410,275.011,14.6913,75.3087,99.9732
109,110,947,912,350,85.8881,0.953087,89.0469,99.9925
110,111,13527,1121,402,162.135,73.9988,16.0012,99.9804
111,112,8621,770,390,91.8574,50.1837,39.8163,99.9769
112,113,1070,1706,352,267.773,42.7813,47.2187,99.9884
113,114,1820,1216,371,270.737,64.4152,25.5848,99.989
114,115,23168,1494,445,260.446,19.8303,70.1697,99.2111
115,116,10977,2592,452,89.5804,65.6967,24.3033,99.883
116,117,2694,2076,400,272.535,27.4646,62.5354,99.9778
117,118,14536,1762,432,86.8323,23.3423,66.6577,99.9319
118,119,1102,1905,391,84.2631,24.7651,65.2349,99.9936
119,120,5952,3185,424,263.95,17.5129,72.4871,99.9942
120,121,3573,531,401,267.081,30.8747,59.1253,99.4043
121,122,10485,3285,452,262.5,17.6024,72.3976,99.948
122,123,56740,1117,512,267.931,4.2622300000000015,85.7378,53.6906
123,124,1263,3236,399,102.051,62.9244,27.0756,99.9957
124,125,28766,1911,533,84.3257,31.4275,58.5725,99.7659
125,126,3724,642,404,97.1369,50.5067,39.4933,99.9904
126,127,3953,2458,428,78.9942,37.0802,52.9198,99.9855
127,128,13022,1375,453,228.554,76.5361,13.4639,99.4773
128,129,22679,1582,516,266.246,1.97736,88.0226,99.8521
129,130,2969,2010,427,270.41200000000003,15.1829,74.8171,98.7704
130,131,6039,840,447,263.23,16.596,73.404,99.9771
131,132,605,1182,420,91.9337,12.0788,77.9212,99.9863
132,133,562,2617,418,221.348,72.4068,17.5932,99.9873
133,134,2018,602,440,272.723,31.9733,58.0267,99.9866
134,135,1448,3083,433,106.199,28.0977,61.9023,99.9937
135,136,1167,2115,429,270.978,16.1725,73.8275,99.9858
136,137,5302,515,454,138.208,82.6885,7.31146,99.9707
137,138,1960,671,453,110.314,39.4098,50.5902,99.7549
138,139,3423,184,457,269.132,10.3644,79.6356,99.9888
139,140,2510,748,460,255.317,18.7159,71.2841,99.9692
140,141,1053,2338,446,229.378,72.8764,17.1236,99.9918
141,142,748,2080,454,269.67,18.6697,71.3303,99.9665
142,143,3198,3008,475,106.04,24.4278,65.5722,99.4324
143,144,3799,2303,483,237.514,67.2667,22.7333,99.9841
144,145,923,3108,469,263.841,7.216369999999999,82.7836,99.9908
145,146,1992,3066,493,92.9597,45.3154,44.6846,99.9442
146,147,592,461,470,85.7505,35.7088,54.2912,99.973
147,148,24842,2418,546,276.55400000000003,71.934,18.066,99.233
148,149,5032,3337,522,262.066,37.9536,52.0464,99.8687
149,150,647,2177,482,265.008,1.26844,88.7316,99.9936
150,151,2491,3144,495,102.222,24.7443,65.2557,99.9935
151,152,5013,2724,509,277.652,18.5071,71.4929,99.9893
152,153,1683,611,495,259.719,34.7811,55.2189,99.8919
153,154,30313,783,592,303.448,77.0889,12.9111,84.7023
154,155,28502,1695,600,273.551,30.4046,59.5954,99.8757
155,156,9080,3202,540,262.264,10.0724,79.9276,99.9843
156,157,9314,2078,538,269.196,75.0535,14.9465,98.2527
157,158,880,832,499,263.48900000000003,72.5263,17.4737,98.7839
158,159,4677,154,538,281.31,40.2766,49.7234,99.9434
159,160,6261,900,539,77.8827,31.0546,58.9454,99.8901
160,161,15126,486,562,95.8581,33.7351,56.2649,99.3086
161,162,3095,1787,534,77.668,47.3851,42.6149,97.498
162,163,2044,2539,522,256.953,63.7029,26.2971,99.8033
163,164,5566,3002,540,129.184,82.8833,7.11672,99.1824
164,165,1048,2248,520,95.236,3.41076,86.5892,99.9612
165,166,4596,2171,538,89.46,26.8497,63.1503,99.8502
166,167,6350,2646,566,266.5,66.2487,23.7513,99.0703
167,168,6142,1337,574,80.95100000000002,9.31948,80.6805,99.9756
168,169,2326,1234,572,90.0847,10.2532,79.7468,99.9895
169,170,39807,3102,671,89.9617,17.6462,72.3538,99.9161
170,171,1464,2739,573,79.5625,27.4497,62.5503,99.9808
171,172,7794,2843,606,73.0926,30.8818,59.1182,99.9783
172,173,30464,2212,660,88.8807,12.3816,77.6184,99.8879
173,174,4193,2552,591,90.6166,9.78698,80.21300000000002,99.9497
174,175,2214,372,587,76.7513,43.7701,46.2299,99.9961
175,176,3988,2937,599,80.3037,0.8957209999999999,89.1043,99.9601
176,177,6132,1206,628,276.791,60.1118,29.8882,99.9693
177,178,8950,1963,633,81.4134,7.548839999999998,82.4512,99.3913
178,179,687,3245,588,269.253,17.7981,72.2019,99.996
179,180,4003,297,618,80.3474,22.9015,67.0985,99.9825
180,181,18461,1359,662,75.9666,61.4123,28.5877,99.9716
181,182,1422,3286,596,81.6074,11.4854,78.5146,99.989
182,183,6708,163,643,90.8247,1.0052299999999998,88.9948,100.001
183,184,3010,2039,618,95.1899,26.114,63.886,99.9903
184,185,3775,2114,613,275.538,66.7813,23.2187,99.9599
185,186,3933,628,623,90.8729,40.8417,49.1583,99.9772
186,187,1035,211,614,288.041,61.1564,28.8436,99.9943
187,188,8767,414,647,272.42900000000003,58.0738,31.9262,99.9292
188,189,2180,952,626,89.8607,57.605,32.395,99.9501
189,190,13201,2671,650,260.215,39.0049,50.9951,99.9189
190,191,1325,1269,621,262.6,25.4422,64.5578,99.9497
191,192,977,914,633,265.446,47.5616,42.4384,99.988
192,193,5139,3259,682,69.8954,59.7177,30.2823,99.9721
193,194,4821,2363,648,198.582,85.0323,4.96767,99.9496
194,195,1358,494,644,279.899,59.1819,30.8181,99.5604
195,196,10948,1143,679,87.9002,49.5678,40.4322,99.9834
196,197,10481,1518,678,264.991,6.57787,83.4221,99.1168
197,198,835,1803,639,89.8447,46.3781,43.6219,99.8509
198,199,1907,232,655,279.223,31.3229,58.6771,99.9798
199,200,9276,3325,705,81.3028,13.6517,76.3483,99.9008
200,201,26638,561,749,104.382,50.0485,39.9515,99.8717
201,202,1050,2459,649,257.152,27.6533,62.3467,99.9523
202,203,4593,2937,666,74.9838,14.1773,75.8227,99.853
203,204,2578,2511,663,83.6526,4.31982,85.6802,99.4489
204,205,530,2074,657,274.353,68.2851,21.7149,99.9971
205,206,1038,2872,654,87.7178,55.2375,34.7625,99.9964
206,207,1050,702,664,270.289,51.2037,38.7963,99.9913
207,208,12481,254,720,48.5136,82.3176,7.682410000000001,99.9147
208,209,7423,2561,707,83.0327,5.71692,84.2831,99.9568
209,210,907,2827,671,76.0081,25.7157,64.2843,99.9943
210,211,2240,650,681,273.137,55.4987,34.5013,99.9708
211,212,2395,1053,678,97.3285,59.7868,30.2132,99.9855
212,213,20266,407,768,73.1957,72.3244,17.6756,99.9464
213,214,2797,977,686,103.882,44.5213,45.4787,99.7062
214,215,7921,1608,720,85.24700000000001,18.0255,71.9745,99.9688
215,216,8676,1853,720,94.1582,44.2743,45.7257,99.9392
216,217,580,2420,670,255.548,69.4894,20.5106,99.9895
217,218,6867,2754,732,77.7652,23.8008,66.1992,99.9959
218,219,1002,930,696,78.8988,53.7401,36.2599,99.9923
219,220,21071,1437,783,82.80799999999998,21.8525,68.1475,99.73
220,221,635,2065,693,93.0419,34.8959,55.1041,99.9839
221,222,2938,2859,708,74.9432,26.7963,63.2037,99.9726
222,223,17352,2536,791,82.8637,9.46558,80.5344,99.5563
223,224,1225,2391,694,78.76100000000002,26.9731,63.0269,99.9884
224,225,3450,2956,728,264.302,68.4461,21.5539,99.986
225,226,1813,1776,720,270.519,20.1013,69.8987,99.9766
226,227,649,750,703,267.046,51.3526,38.6474,99.9224
227,228,7133,1251,743,82.3448,16.3742,73.6258,99.984
228,229,1996,146,725,273.401,28.8506,61.1494,99.9855
229,230,1157,2809,729,258.159,60.8721,29.1279,99.996
230,231,5498,700,744,124.239,58.1479,31.8521,99.9807
231,232,9685,2021,802,294.874,84.8007,5.19931,99.9099
232,233,546,1945,716,76.0456,8.83639,81.1636,99.982
233,234,4778,1054,758,79.0743,67.7162,22.2838,99.9904
234,235,7118,1697,763,279.58,47.5334,42.4666,99.9515
235,236,13405,2373,774,255.924,67.6523,22.3477,99.9134
236,237,10352,2679,771,268.004,20.7297,69.2703,99.9572
237,238,15642,3229,797,279.784,63.3659,26.6341,99.9687
238,239,1083,983,731,94.013,60.2644,29.7356,99.6505
239,240,19373,2915,839,76.0314,17.1335,72.8665,99.8932
240,241,939,3363,759,259.23900000000003,13.8608,76.1392,99.8853
241,242,9860,889,782,79.4404,10.4159,79.5841,99.9761
242,243,1476,2211,755,266.553,64.1223,25.8777,99.9927
243,244,2457,815,764,84.2154,20.2997,69.7003,99.9947
244,245,8530,1148,784,93.0433,64.7579,25.2421,99.9701
245,246,1218,759,768,118.533,54.7918,35.2082,99.977
246,247,1088,1899,763,78.234,24.1867,65.8133,99.9919
247,248,6968,979,808,262.638,48.8163,41.1837,99.584
248,249,13407,1298,824,270.79900000000004,15.1828,74.8172,99.9595
249,250,555,2091,763,268.872,8.126610000000001,81.8734,99.9137
250,251,4926,2308,819,263.706,59.335,30.665,99.8591
251,252,20514,1571,859,273.598,24.3411,65.6589,99.9453
252,253,11344,2820,841,80.5934,10.421,79.579,99.9661
253,254,743,133,766,275.546,32.8237,57.1763,99.752
254,255,2101,200,776,92.544,22.4092,67.5908,99.9918
255,256,12540,1916,834,266.293,7.3726699999999985,82.6273,99.9653
256,257,2063,2135,778,265.74,12.6244,77.3756,99.9871
257,258,6419,322,811,281.342,71.4875,18.5125,99.9819
258,259,960,1766,783,258.033,70.7898,19.2102,99.9959
259,260,2618,1811,803,90.2377,24.8172,65.1828,99.9837
260,261,2211,2238,799,83.6756,70.3584,19.6416,99.9445
261,262,561,3058,792,89.0008,13.0165,76.9835,99.998
262,263,5369,178,822,100.344,59.7113,30.2887,99.811
263,264,11751,3023,858,83.9419,12.8189,77.1811,99.6847
264,265,13668,2471,881,79.6635,15.0844,74.9156,99.4444
265,266,6311,2123,827,145.192,80.8093,9.19071,99.976
266,267,9758,1732,851,269.087,47.5151,42.4849,99.9467
267,268,5125,702,824,97.0357,43.2405,46.7595,99.9884
268,269,581,262,814,84.6748,4.37988,85.6201,99.996
269,270,4218,3336,859,82.8615,5.65256,84.3474,99.9383
270,271,13376,2676,903,270.498,30.4658,59.5342,99.9658
271,272,11533,3126,878,274.67900000000003,61.4926,28.5074,99.9458
272,273,1907,801,854,90.7216,36.0341,53.9659,99.9593
273,274,2891,1089,851,274.498,46.9557,43.0443,99.9788
274,275,1183,1835,844,89.0343,20.7835,69.2165,99.9881
275,276,665,1793,840,83.2849,23.1622,66.8378,99.978
276,277,8527,262,884,85.7861,69.5028,20.4972,99.9767
277,278,2865,631,866,271.22700000000003,5.94193,84.0581,99.9869
278,279,4975,1165,876,82.4857,13.195,76.805,99.9732
279,280,20800,925,933,253.322,15.1129,74.8871,99.7988
280,281,6714,160,902,269.316,32.5004,57.4996,99.9836
281,282,2137,1036,873,256.551,26.0393,63.9607,99.9915
282,283,823,2757,865,261.154,59.9009,30.0991,99.9953
283,284,5859,496,881,89.439,16.0942,73.9058,99.0076
284,285,1768,757,875,83.2537,10.9952,79.0048,99.9861
285,286,662,355,867,78.4047,16.4663,73.5337,99.9947
286,287,1524,1654,887,274.914,30.6715,59.3285,99.9644
287,288,933,2084,879,274.666,47.8314,42.1686,99.9879
288,289,1442,1438,903,92.1224,59.6574,30.3426,99.9784
289,290,2803,2132,905,271.512,63.37600000000001,26.624,99.9488
290,291,11254,599,940,95.9191,14.4417,75.5583,99.9738
291,292,690,970,879,80.3452,9.08659,80.9134,99.7953
292,293,1154,2235,876,91.9222,70.5635,19.4365,99.9907
293,294,8281,707,936,82.8702,44.6362,45.3638,99.9638
294,295,11909,1309,939,253.605,57.5617,32.4383,99.9528
295,296,6995,2317,921,77.4132,8.84322,81.1568,99.9704
296,297,802,2548,885,191.237,80.8606,9.13936,99.9777
297,298,1622,2183,908,80.6265,2.46274,87.5373,99.9917
298,299,2584,1996,898,78.0158,5.18853,84.8115,99.1064
299,300,9216,3281,945,83.369,65.6506,24.3494,99.9166
300,301,533,1468,891,136.785,82.8282,7.171810000000002,99.993
301,302,702,2274,895,260.018,61.1266,28.8734,99.9807
302,303,1764,2385,921,79.4193,36.3025,53.6975,99.9751
303,304,598,1840,900,89.0782,41.4751,48.5249,99.9565
304,305,713,650,906,86.805,5.5304,84.4696,99.995
305,306,2883,2778,926,256.428,59.3781,30.6219,99.9433
306,307,2562,3210,919,239.344,70.6621,19.3379,99.9804
307,308,2057,334,923,89.0173,63.0841,26.9159,99.9863
308,309,808,1720,909,95.4666,84.4171,5.58295,99.9674
309,310,25723,1109,1005,83.0018,27.5685,62.4315,99.8405
310,311,3987,1667,943,262.36400000000003,13.9712,76.0288,99.9508
311,312,3382,1808,936,85.3825,23.8151,66.1849,99.9476
312,313,1060,2601,920,253.124,57.1912,32.8088,99.9944
313,314,1897,1035,940,98.5817,61.8574,28.1426,99.9735
314,315,2692,1901,941,92.5935,48.2413,41.7587,99.9432
315,316,3225,1506,947,28.5313,89.1188,0.8811559999999999,99.9764
316,317,1321,2073,934,73.9524,81.6757,8.32434,99.9915
317,318,740,1861,931,94.9094,44.3172,45.6828,99.9518
318,319,1016,394,938,258.44,44.0532,45.9468,99.9885
319,320,4013,851,955,89.9056,57.142,32.858000000000004,99.981
320,321,4341,2562,962,87.699,24.5673,65.4327,99.9788
321,322,923,1079,937,64.6521,82.3103,7.68974,99.9909
322,323,6677,1412,968,258.939,11.7935,78.2065,99.9867
323,324,16652,261,1013,75.5912,61.4852,28.5148,98.7086
324,325,7827,2979,971,281.138,71.2167,18.7833,99.9223
325,326,6675,2864,979,247.686,62.1549,27.8451,99.9644
326,327,882,1733,943,264.643,6.78687,83.2131,99.9608
327,328,2396,521,967,85.9432,11.4414,78.5586,99.8316
328,329,16927,2268,1033,259.651,57.7353,32.2647,99.2475
329,330,2069,350,961,94.1208,63.8493,26.1507,99.9732
330,331,5195,2095,978,245.088,77.8745,12.1255,99.8584
331,332,938,795,963,91.385,43.7161,46.2839,99.9749
332,333,4531,3170,970,188.529,83.2704,6.7296,99.9181
333,334,703,130,964,50.0153,66.6668,23.3332,99.9827
334,335,768,2723,961,268.655,74.9603,15.0397,99.9947
335,336,2573,2001,979,102.246,48.7472,41.2528,99.3505
336,337,1809,3068,965,247.908,72.2527,17.7473,99.9813
337,338,993,1784,967,87.8776,5.32538,84.6746,99.9873
338,339,1931,2803,986,251.331,52.3286,37.6714,99.9821
339,340,8032,2392,1006,257.265,17.8867,72.1133,99.959
340,341,9780,1770,1019,89.2768,46.1165,43.8835,99.2825
341,342,1358,2286,979,90.1143,60.8729,29.1271,99.9803
342,343,1495,2703,988,265.675,49.6972,40.3028,99.9772
343,344,2921,1595,990,89.0399,11.5268,78.4732,99.9774
344,345,26961,1434,1073,63.687,73.8279,16.1721,99.6329
345,346,715,1833,987,266.376,12.0223,77.9777,99.9858
346,347,5962,2129,1026,87.3075,19.93,70.07,99.7518
347,348,11969,2505,1041,263.547,46.1279,43.8721,99.2334
348,349,4115,379,1018,34.4607,71.8785,18.1215,99.3337
349,350,678,1659,999,109.16,41.8438,48.1562,99.9858
350,351,14371,505,1038,72.7614,63.9437,26.0563,99.4333
351,352,3013,804,1009,78.854,6.53683,83.4632,99.9442
352,353,12841,158,1072,23.7106,81.4047,8.59527,99.7435
353,354,2731,1933,1014,94.0986,80.4812,9.5188,99.287
354,355,5369,2746,1040,270.783,77.4093,12.5907,99.4239
355,356,1508,3144,1016,23.7946,84.3219,5.6781,99.9242
356,357,1769,882,1021,89.1225,39.7814,50.2186,99.7082
357,358,530,3174,1020,180.327,83.1932,6.806769999999998,99.6614
358,359,4261,1880,1076,81.0126,3.82303,86.177,99.9433
359,360,3362,2649,1039,261.762,17.9405,72.0595,99.9384
360,361,1354,647,1025,87.0868,3.16989,86.8301,99.9803
361,362,518,726,1018,86.8396,17.7047,72.2953,99.9624
362,363,1741,1626,1032,103.295,44.4034,45.5966,99.4584
363,364,15629,3227,1073,203.155,88.3718,1.6282299999999998,98.5982
364,365,3304,3069,1040,90.0798,19.8584,70.1416,99.9136
365,366,5388,1980,1055,268.464,71.1501,18.8499,98.8849
366,367,1248,3017,1033,88.47399999999998,19.7835,70.2165,99.9924
367,368,2420,689,1048,284.379,56.2046,33.7954,99.9769
368,369,540,3366,1054,62.0598,71.9666,18.0334,99.6571
369,370,517,1272,1039,272.785,61.8742,28.1258,99.9846
370,371,2130,2588,1057,277.67400000000004,51.1586,38.8414,99.5434
371,372,16094,2881,1089,295.129,73.5357,16.4643,99.7069
372,373,3083,1201,1057,264.833,2.06787,87.9321,99.9845
373,374,672,1571,1037,99.8146,45.5827,44.4173,99.664
374,375,22652,1700,1138,94.5781,8.311860000000001,81.6881,99.9656
375,376,747,2804,1044,254.444,43.7713,46.2287,99.6093
376,377,6894,848,1079,263.267,3.45353,86.5465,99.985
377,378,644,747,1048,284.45,58.6885,31.3115,99.9762
378,379,895,1722,1054,274.58,27.6288,62.3712,99.99
379,380,4673,634,1096,270.21,32.1536,57.8464,99.9735
380,381,6627,950,1097,79.024,57.9676,32.0324,99.792
381,382,9635,405,1109,261.725,14.4071,75.5929,99.9435
382,383,3808,3002,1086,85.8281,9.88165,80.1183,99.5839
383,384,1401,1583,1077,277.608,37.0953,52.9047,99.9762
384,385,7950,2222,1143,267.63,5.6418800000000005,84.3581,99.967
385,386,7211,682,1137,274.628,52.9703,37.0297,99.8882
386,387,2832,2071,1089,257.476,0.8530120000000001,89.147,99.977
387,388,8823,1256,1126,262.61400000000003,67.8038,22.1962,99.9858
388,389,3359,1164,1096,68.1157,66.3552,23.6448,99.971
389,390,2235,3098,1093,84.28200000000002,14.2646,75.7354,99.9819
390,391,5679,222,1118,264.255,4.65509,85.3449,99.9724
391,392,4149,2397,1102,80.1606,26.6006,63.3994,99.9862
392,393,2782,2719,1105,80.6722,26.2136,63.7864,99.9952
393,394,7507,1826,1135,266.469,24.0091,65.9909,99.9907
394,395,26003,2623,1184,98.6804,74.3693,15.6307,99.9239
395,396,5951,3333,1168,80.691,71.0699,18.9301,99.9627
396,397,8522,555,1135,275.467,19.6045,70.3955,99.9553
397,398,956,1337,1095,112.988,84.5487,5.45126,99.9956
398,399,6201,2142,1137,267.771,2.49478,87.5052,99.8701
399,400,1521,2540,1111,86.8133,26.0859,63.9141,99.9939
400,401,3329,480,1141,272.761,12.9192,77.0808,98.2126
401,402,6207,1057,1143,105.823,66.9616,23.0384,99.8557
402,403,2636,1554,1129,277.879,55.5534,34.4466,99.9936
403,404,7218,2482,1149,268.809,14.7338,75.2662,99.1415
404,405,12266,1981,1150,281.762,71.8853,18.1147,99.8723
405,406,4527,790,1132,141.9,84.3037,5.69629,99.9846
406,407,8914,346,1159,50.6389,60.7494,29.2506,99.9941
407,408,8326,3043,1169,89.6324,14.8377,75.1623,99.9564
408,409,947,271,1134,265.464,5.62643,84.3736,99.9911
409,410,987,2341,1131,268.673,36.5522,53.4478,99.9931
410,411,8050,2776,1165,87.0702,49.6678,40.3322,99.9903
411,412,2108,1597,1158,60.2297,76.5213,13.4787,99.9887
412,413,6449,3136,1158,72.7915,79.555,10.445,99.9157
413,414,756,3367,1156,77.1843,70.4353,19.5647,99.9712
414,415,3873,882,1151,238.205,80.1161,9.88394,99.9891
415,416,2103,1165,1160,93.8292,69.5053,20.4947,99.994
416,417,6092,1312,1184,275.889,73.6407,16.3593,99.9813
417,418,2722,2953,1165,274.166,78.7015,11.2985,99.9349
418,419,1751,1493,1156,264.625,10.824000000000002,79.176,98.9987
419,420,3713,3256,1171,260.85900000000004,1.81737,88.1826,99.9784
420,421,6462,2331,1183,259.231,0.976997,89.023,99.965
421,422,1556,3205,1184,270.754,57.1005,32.8995,99.983
422,423,13280,707,1224,84.2813,36.1603,53.8397,99.9376
423,424,1960,944,1175,262.718,3.13012,86.8699,99.9889
424,425,21039,2114,1274,268.19,8.92422,81.0758,99.9603
425,426,8340,227,1194,267.35,11.6665,78.3335,99.9422
426,427,4550,856,1211,273.372,54.4255,35.5745,99.9538
427,428,2492,141,1218,201.241,85.4358,4.56422,99.9818
428,429,1454,1243,1190,78.2598,36.5376,53.4624,99.9882
429,430,41631,1479,1319,261.74,56.6743,33.3257,99.5474
430,431,8323,1101,1230,87.9897,26.8021,63.1979,99.9482
431,432,21466,521,1256,264.41200000000003,5.56134,84.4387,99.2033
432,433,4303,2265,1231,82.0712,19.6277,70.3723,99.9804
433,434,3880,2776,1224,79.0727,22.7861,67.2139,99.995
434,435,541,1019,1204,90.4537,25.9741,64.0259,99.9826
435,436,4373,2877,1235,247.456,74.5015,15.4985,99.9856
436,437,8471,2455,1240,263.868,56.9525,33.0475,99.7147
437,438,4919,1798,1230,254.484,2.33528,87.6647,99.9893
438,439,12033,1198,1277,271.625,23.3975,66.6025,99.8536
439,440,6461,2978,1241,250.161,13.7085,76.2915,99.2159
440,441,2461,1571,1242,277.902,53.3649,36.6351,99.9693
441,442,13351,978,1269,89.493,77.0035,12.9965,99.9384
442,443,8046,1977,1248,84.319,19.7971,70.2029,98.9762
443,444,3045,3276,1232,92.5452,45.3632,44.6368,99.9811
444,445,2085,3167,1228,93.0875,23.8663,66.1337,99.9959
445,446,1946,410,1240,257.61,4.30492,85.6951,99.9869
446,447,5117,3106,1257,268.091,11.2077,78.7923,99.9924
447,448,20858,741,1330,268.764,55.2517,34.7483,99.9386
448,449,8365,344,1275,265.478,55.7862,34.2138,99.893
449,450,3408,2199,1266,83.6502,19.9439,70.0561,99.9735
450,451,774,255,1242,267.698,7.0133800000000015,82.9866,99.983
451,452,1568,200,1243,267.806,7.0625800000000005,82.9374,99.9879
452,453,1233,1097,1253,275.871,26.3274,63.6726,99.9956
453,454,10365,2353,1308,257.628,52.2525,37.7475,99.8802
454,455,1865,1873,1258,305.373,79.5932,10.4068,99.9908
455,456,2857,1695,1256,267.85,8.036,81.964,99.9848
456,457,7325,3036,1306,267.974,22.9787,67.0213,99.9702
457,458,2257,1312,1264,254.915,72.2145,17.7855,99.9906
458,459,566,3373,1264,250.402,23.5426,66.4574,99.8801
459,460,577,1610,1258,88.4754,5.7133699999999985,84.2866,99.9945
460,461,6573,2775,1293,261.195,20.7934,69.2066,99.9934
461,462,2211,3183,1283,89.786,69.8559,20.1441,99.9825
462,463,3422,3293,1300,269.145,55.3724,34.6276,99.9437
463,464,4042,2886,1291,77.3629,8.48798,81.512,99.987
464,465,1576,205,1284,250.002,85.0127,4.98727,99.9944
465,466,524,1942,1280,89.5397,15.8886,74.1114,99.9943
466,467,5193,1796,1295,86.6646,16.9922,73.0078,99.9749
467,468,2257,2402,1302,230.729,81.7463,8.253689999999999,99.9888
468,469,1589,3229,1293,259.693,25.0429,64.9571,99.9919
469,470,595,1358,1282,83.0312,8.12265,81.8773,99.996
470,471,1423,1656,1292,271.338,52.7973,37.2027,99.9759
471,472,36408,2629,1376,84.45,50.9549,39.0451,99.901
472,473,1246,401,1289,268.333,25.725,64.275,99.9921
473,474,3000,621,1306,273.317,48.0514,41.9486,99.9858
474,475,1259,909,1297,97.5385,74.0968,15.9032,99.9514
475,476,1900,1620,1307,269.072,52.8763,37.1237,99.9039
476,477,1570,1721,1300,95.9393,15.5297,74.4703,99.9922
477,478,2653,2518,1309,89.1361,73.811,16.189,99.9872
478,479,1300,2263,1302,81.0945,67.5724,22.4276,99.9977
479,480,824,1076,1301,85.9369,1.22442,88.7756,99.9767
480,481,11751,2960,1356,84.6237,12.7206,77.2794,99.2663
481,482,653,1333,1303,80.8586,31.0763,58.9237,99.9918
482,483,9046,1894,1351,84.4241,1.27725,88.7227,99.976
483,484,3981,2454,1331,74.8278,5.59782,84.4022,99.8811
484,485,1773,1593,1330,268.568,53.1717,36.8283,99.9876
485,486,47416,1300,1441,84.9096,42.588,47.412,99.7985
486,487,4572,3100,1364,80.2723,69.9779,20.0221,99.962
487,488,4842,157,1342,358.624,87.1386,2.86136,99.983
488,489,1417,2070,1321,86.2697,20.3544,69.6456,99.9905
489,490,2428,266,1327,66.7079,75.7997,14.2003,99.9797
490,491,7075,1700,1360,82.7728,16.3623,73.6377,99.9511
491,492,4646,444,1351,82.0279,58.4797,31.5203,99.8268
492,493,3778,3244,1357,93.1854,24.1681,65.8319,99.9427
493,494,4613,881,1344,91.4873,11.4534,78.5466,99.9899
494,495,4056,2011,1343,331.288,81.6958,8.30423,99.9418
495,496,934,1958,1341,320.741,84.1125,5.88755,99.99
496,497,785,208,1334,65.9533,75.3187,14.6813,99.9909
497,498,3430,3336,1384,85.001,20.0439,69.9561,99.852
498,499,5806,2249,1362,97.005,86.2731,3.72686,99.9715
499,500,602,2312,1331,263.347,3.48315,86.5168,99.9973
500,501,3762,2830,1360,246.872,80.3178,9.68221,99.9941
501,502,9830,573,1394,90.1587,14.954,75.046,99.898
502,503,9206,3171,1387,259.51,32.3111,57.6889,99.9888
503,504,14270,998,1432,279.631,43.4371,46.5629,99.3972
504,505,8925,1097,1384,102.661,72.0565,17.9435,99.9817
505,506,1452,1176,1360,62.5933,79.6822,10.3178,99.9808
506,507,2478,335,1358,63.8649,75.6391,14.3609,99.9903
507,508,4400,1809,1372,118.346,78.3376,11.6624,99.9898
508,509,1337,2519,1373,84.99799999999998,37.3979,52.6021,99.9833
509,510,879,1640,1366,95.3747,15.5323,74.4677,99.9907
510,511,4616,802,1400,253.511,7.1627600000000005,82.8372,99.9897
511,512,884,233,1377,92.6819,45.3637,44.6363,99.9612
512,513,12309,2914,1456,94.6571,14.1951,75.8049,99.8738
513,514,5460,2073,1402,88.5131,14.2091,75.7909,99.9807
514,515,4575,2335,1412,74.8028,30.5102,59.4898,99.9893
515,516,8346,894,1428,84.1665,29.8667,60.1333,99.946
516,517,6001,1969,1412,239.747,76.8749,13.1251,99.9386
517,518,1614,208,1400,92.3298,46.2188,43.7812,99.9464
518,519,535,3056,1391,72.9598,61.8845,28.1155,99.847
519,520,7002,343,1426,87.0826,55.4849,34.5151,99.9704
520,521,639,280,1394,97.2616,50.9707,39.0293,99.983
521,522,1716,2466,1400,256.594,13.5161,76.4839,99.3485
522,523,6005,2174,1428,80.0694,8.79198,81.208,99.976
523,524,873,402,1407,83.6135,12.4401,77.5599,99.9878
524,525,9502,1690,1445,78.3637,70.7276,19.2724,99.8516
525,526,883,1769,1412,278.742,61.1497,28.8504,99.9849
526,527,1083,1602,1409,265.004,7.32333,82.6767,99.9813
527,528,2480,2807,1419,86.8165,14.9967,75.0033,99.9939
528,529,4398,467,1441,85.8372,23.3248,66.6752,99.4399
529,530,4314,2384,1463,264.823,2.98103,87.01899999999998,99.8263
530,531,13996,1850,1466,259.617,13.0555,76.9445,99.988
531,532,7167,2272,1460,167.72,78.7783,11.2217,99.9761
532,533,6173,2772,1476,92.5647,16.9451,73.0549,99.958
533,534,8922,3027,1486,93.8258,23.8983,66.1017,99.9555
534,535,744,126,1435,87.6816,18.6428,71.3572,99.951
535,536,3938,3243,1466,268.782,24.2848,65.7152,99.9946
536,537,10043,740,1471,261.306,28.6163,61.3837,99.8735
537,538,1568,2445,1438,246.054,87.4672,2.53285,99.9879
538,539,1437,2971,1444,257.603,24.048,65.952,99.3255
539,540,580,3366,1445,261.024,1.19485,88.8052,99.9767
540,541,7046,290,1483,84.4378,16.151,73.84899999999998,99.9359
541,542,5695,3313,1472,263.501,2.67648,87.3235,99.979
542,543,4783,1592,1467,81.7956,73.3314,16.6686,99.99
543,544,1356,405,1444,87.2087,28.4332,61.5668,99.9809
544,545,2212,169,1460,258.54,15.8473,74.1527,99.9474
545,546,3372,622,1467,270.71,6.1576,83.8424,99.9807
546,547,7935,3181,1521,92.7486,40.0149,49.9851,99.754
547,548,10002,2003,1487,270.128,10.1148,79.8852,99.1488
548,549,690,2101,1456,93.4565,25.212,64.788,99.9817
549,550,1549,1101,1459,270.955,35.5269,54.4731,99.9415
550,551,9301,1207,1548,264.923,35.4853,54.5147,99.7971
551,552,1788,1448,1480,82.0985,5.4381,84.5619,99.986
552,553,856,3187,1468,66.6943,84.965,5.03495,99.9936
553,554,36262,2431,1592,79.777,37.838,52.162,98.8286
554,555,541,2657,1469,85.5509,23.9123,66.0877,99.9947
555,556,8612,225,1540,91.4809,51.1642,38.8358,99.7798
556,557,853,2855,1489,81.1929,10.0415,79.9585,99.9826
557,558,5409,861,1506,88.0966,71.6739,18.3261,99.1636
558,559,1513,419,1490,271.201,73.6002,16.3998,98.9059
559,560,2746,1093,1498,264.435,27.6887,62.3113,99.9365
560,561,1445,2830,1501,84.8867,13.4198,76.5802,99.9331
561,562,595,2710,1495,263.88,7.80864,82.1914,99.9941
562,563,2293,2731,1526,82.2282,25.9796,64.0204,99.9107
563,564,6552,149,1561,93.3038,12.4546,77.5454,99.9822
564,565,6966,2635,1519,96.7203,54.9639,35.0361,99.7857
565,566,5087,529,1517,274.714,69.007,20.993,98.1411
566,567,1075,2115,1493,245.816,63.5179,26.4821,99.9812
567,568,2566,3115,1511,101.419,59.5463,30.4537,99.9866
568,569,6937,2198,1528,77.4853,38.3862,51.6138,94.1441
569,570,822,675,1498,85.9891,23.8361,66.1639,99.9407
570,571,1016,937,1510,78.6854,6.11712,83.8829,99.9375
571,572,8986,394,1550,78.5664,53.7951,36.2049,99.8978
572,573,2188,2338,1519,82.3293,0.242432,89.7576,99.8605
573,574,1516,3347,1514,258.018,32.6126,57.3874,99.9837
574,575,11014,1756,1577,84.8852,64.9765,25.0235,99.5072
575,576,8472,2065,1555,284.28,64.7024,25.2976,98.8355
576,577,1308,1543,1519,224.778,71.8362,18.1638,98.9226
577,578,12132,589,1592,88.9764,12.3209,77.6791,99.9684
578,579,502,1049,1525,90.2038,7.15945,82.8406,99.9798
579,580,1752,2289,1531,79.0022,22.6299,67.3701,99.9485
580,581,677,1652,1528,270.751,12.8157,77.1843,99.9877
581,582,1296,1405,1535,72.5771,10.0427,79.9573,99.9408
582,583,1654,1109,1542,268.406,61.5656,28.4345,99.822
583,584,3711,1908,1559,264.296,65.2418,24.7582,99.5357
584,585,7751,2897,1564,87.9493,48.3941,41.6059,99.6964
585,586,2024,1682,1561,103.273,19.403,70.597,99.9905
586,587,11192,686,1594,245.279,77.4143,12.5857,99.861
587,588,906,754,1536,77.2543,66.2616,23.7384,99.993
588,589,9054,1604,1583,268.235,10.7295,79.2705,99.9813
589,590,17820,3310,1624,83.64200000000002,20.3648,69.6352,98.9479
590,591,7712,1500,1592,266.416,9.17229,80.8277,99.1529
591,592,28389,936,1640,79.3425,0.209373,89.7906,99.4355
592,593,6660,3085,1580,285.541,60.1072,29.8928,99.5821
593,594,2081,490,1569,91.5686,24.2273,65.7727,99.5258
594,595,1652,1834,1561,276.37,46.1992,43.8008,99.988
595,596,2144,2773,1567,275.621,47.6774,42.3226,99.9607
596,597,13563,308,1627,88.7816,11.313,78.687,99.927
597,598,1664,816,1563,318.322,75.7023,14.2977,99.9627
598,599,1473,1175,1578,77.6441,46.3374,43.6626,99.9905
599,600,2036,1420,1579,87.8136,44.9267,45.0733,99.9906
600,601,3044,2568,1594,267.186,16.1057,73.8943,99.9889
601,602,1564,2680,1570,87.5253,11.8756,78.1244,99.9911
602,603,56376,2213,1715,85.5894,31.6343,58.3657,99.9051
603,604,3189,1051,1587,264.17,22.0503,67.9497,99.9795
604,605,920,1371,1575,77.6616,20.876,69.124,99.9854
605,606,1182,1986,1586,85.89200000000002,34.8475,55.1525,99.5403
606,607,729,3009,1585,84.9458,15.2927,74.7073,99.8975
607,608,5355,810,1612,87.618,8.67976,81.3202,99.973
608,609,815,2617,1582,84.9778,1.01507,88.9849,99.9915
609,610,6164,1121,1617,265.657,4.910819999999998,85.0892,99.9429
610,611,2248,1824,1615,85.574,39.5315,50.4685,99.9847
611,612,2102,2810,1604,259.691,16.1772,73.8228,99.9953
612,613,31739,3161,1692,286.556,55.2022,34.7978,99.9145
613,614,2981,1876,1618,86.2951,35.66900000000001,54.331,99.9889
614,615,1857,1320,1605,268.423,35.7441,54.2559,99.9883
615,616,1837,2757,1614,264.822,3.39881,86.6012,99.9474
616,617,8042,440,1650,263.12,13.2449,76.7551,99.636
617,618,25019,2654,1699,268.515,52.0638,37.9362,99.9222
618,619,1222,1965,1618,88.0342,41.294,48.706,99.6095
619,620,5848,2909,1657,273.047,45.2515,44.7485,99.9509
620,621,1788,1390,1616,71.3154,10.2064,79.7936,99.9904
621,622,3424,515,1642,280.223,69.839,20.161,99.9759
622,623,31503,1705,1728,88.375,1.92997,88.07,99.9232
623,624,6428,2835,1665,277.774,40.8482,49.1518,99.9681
624,625,789,2617,1622,87.8055,11.4846,78.5154,99.9954
625,626,3003,2035,1638,93.1781,20.326,69.67399999999999,99.9839
626,627,1235,2088,1627,92.4883,20.4849,69.5151,99.9955
627,628,2697,1209,1639,70.982,75.4669,14.5331,99.9906
628,629,9492,163,1675,60.2366,68.86,21.1399,99.9639
629,630,7830,1926,1673,252.372,66.0451,23.9549,99.9138
630,631,16040,2989,1710,87.1485,34.3655,55.6345,99.4869
631,632,25419,1326,1702,84.6535,61.9337,28.0663,99.7854
632,633,1096,2583,1642,271.703,52.1254,37.8746,99.9594
633,634,3296,1602,1661,276.088,42.7447,47.2553,99.9752
634,635,560,631,1652,93.9587,33.7576,56.2424,99.9739
635,636,2227,2519,1670,277.071,18.1265,71.8735,99.9871
636,637,4900,1494,1691,265.432,0.840759,89.1592,99.2526
637,638,3330,2776,1699,289.18,68.524,21.476,99.9711
638,639,7144,777,1681,90.0395,3.39393,86.6061,99.9416
639,640,7877,1129,1733,88.5171,61.8824,28.1176,99.8322
640,641,8729,1826,1739,97.3514,48.2623,41.7377,99.8405
641,642,20837,1005,1763,248.065,63.207,26.793000000000006,99.7122
642,643,6365,2054,1727,270.527,49.1016,40.8984,99.9488
643,644,2681,377,1694,79.8722,6.15445,83.8456,99.9941
644,645,7144,655,1709,86.1133,24.1341,65.8659,99.9759
645,646,1150,2560,1682,272.012,4.72132,85.2787,99.9937
646,647,761,1194,1689,267.683,51.2192,38.7808,99.9917
647,648,4581,2480,1722,259.323,7.830610000000001,82.1694,99.1581
648,649,1990,510,1699,95.1945,24.9808,65.0192,99.984
649,650,3529,1558,1721,61.3303,64.8004,25.1996,99.9465
650,651,3777,576,1726,94.5662,32.0309,57.9691,99.9828
651,652,20462,301,1771,264.327,17.1737,72.8263,99.9579
652,653,30095,783,1791,265.18,30.8372,59.1628,99.852
653,654,20812,3279,1801,248.761,68.1814,21.8186,99.9355
654,655,13532,1924,1776,80.0839,11.4789,78.5211,99.5544
655,656,3741,134,1790,88.1015,3.92068,86.0793,99.9927
656,657,6430,2383,1775,259.905,24.9207,65.0793,99.9943
657,658,4064,438,1761,249.598,83.8617,6.13827,99.9743
658,659,6833,1196,1794,259.991,71.4253,18.5747,99.9554
659,660,5677,497,1796,256.215,74.5656,15.4344,99.7016
660,661,17592,2863,1800,89.936,54.7816,35.2184,99.9787
661,662,1646,1082,1760,84.6928,0.344696,89.6553,99.9399
662,663,12098,1394,1780,264.295,46.8363,43.1637,99.7725
663,664,9291,2433,1828,78.3631,48.6071,41.3929,99.9231
664,665,811,2479,1778,64.7138,70.7801,19.2199,99.9456
665,666,5280,199,1809,80.4702,57.1683,32.8317,99.9406
666,667,6177,578,1808,265.785,28.0186,61.9814,99.9816
667,668,12662,2659,1814,268.29,0.604584,89.3954,99.9522
668,669,3768,3050,1799,91.1331,10.0857,79.9143,99.9866
669,670,11586,1571,1833,60.0859,76.4039,13.5961,99.8835
670,671,2498,1626,1795,88.5314,5.5931,84.4069,99.9832
671,672,1879,2031,1795,106.364,31.8176,58.1824,99.9803
672,673,5069,393,1835,259.35900000000004,17.3496,72.6504,99.9862
673,674,3373,1088,1832,267.261,2.28535,87.7147,99.9666
674,675,1071,2757,1802,55.4729,70.0696,19.9304,99.9929
675,676,3451,906,1847,252.496,64.3235,25.6765,99.9664
676,677,12806,2093,1887,93.8948,49.0005,40.9995,99.9381
677,678,6151,2533,1842,209.879,83.5621,6.437880000000002,99.9893
678,679,2602,3145,1830,269.708,37.0322,52.9678,99.9888
679,680,2566,1969,1840,257.993,48.4299,41.5701,99.309
680,681,29538,327,1960,262.928,25.262,64.738,99.5706
681,682,11136,2960,1895,266.771,5.17287,84.8271,99.1828
682,683,63279,1294,1965,93.5413,63.01,26.99,99.4746
683,684,2897,1238,1855,201.984,77.0358,12.9642,99.9814
684,685,1703,1832,1842,279.517,32.5099,57.4901,99.9451
685,686,873,694,1846,96.3788,42.5893,47.4107,99.9907
686,687,5156,2740,1872,268.398,13.4668,76.5332,99.989
687,688,9105,504,1899,91.7566,6.16434,83.8357,99.5384
688,689,3714,3032,1877,269.75,28.4994,61.5006,99.9791
689,690,536,1271,1851,219.971,85.4586,4.5414400000000015,99.9406
690,691,15314,1097,1944,233.388,67.3812,22.6188,99.1989
691,692,8487,3102,1913,258.851,17.1376,72.8624,99.9062
692,693,10347,1779,1905,267.699,40.5703,49.4297,99.9424
693,694,1204,1866,1861,102.128,48.3835,41.6165,99.9861
694,695,2254,1697,1875,82.2037,9.27107,80.7289,99.9819
695,696,945,3174,1874,273.695,36.9266,53.0734,99.9397
696,697,2852,210,1886,272.698,25.0604,64.9396,99.9918
697,698,6554,2214,1899,84.7236,9.50647,80.4935,99.9897
698,699,752,2308,1862,67.6294,59.0704,30.9296,99.9975
699,700,2197,1043,1874,271.017,2.22711,87.7729,99.987
700,701,1120,1483,1866,91.7818,16.3459,73.6541,99.075
701,702,3911,1899,1894,254.668,52.9689,37.0311,99.7764
702,703,8219,583,1928,271.399,31.5221,58.4779,99.9716
703,704,1425,140,1892,270.312,15.8185,74.1815,99.9954
704,705,1834,420,1880,41.7841,83.8727,6.1273,99.9851
705,706,2774,3282,1884,78.5366,48.7464,41.2536,99.9903
706,707,84346,1959,2088,81.9561,23.5368,66.4632,96.6719
707,708,13913,2803,1930,268.15,41.1878,48.8122,99.9803
708,709,664,628,1877,87.96,1.13644,88.8636,99.9936
709,710,572,316,1877,259.521,7.845339999999998,82.1547,99.9924
710,711,7440,735,1930,100.704,53.0717,36.9283,99.9213
711,712,4186,2590,1905,211.064,74.2996,15.7004,99.9815
712,713,1484,3216,1886,110.265,61.8218,28.1782,99.9808
713,714,5224,2667,1911,85.3799,3.3521300000000003,86.6479,99.985
714,715,8560,1511,1931,275.591,29.9781,60.0219,99.6966
715,716,1839,2283,1902,75.7738,53.4047,36.5953,99.9918
716,717,19578,936,1970,259.256,34.2733,55.7267,99.0555
717,718,2362,1586,1906,94.9503,11.7657,78.2343,99.9853
718,719,11813,2495,1944,278.802,3.87158,86.1284,99.5043
719,720,567,2345,1892,84.0511,50.4755,39.5245,99.9935
720,721,8169,2390,1954,71.78,62.6477,27.3523,99.9263
721,722,1885,667,1910,155.96200000000005,84.0551,5.94495,99.9892
722,723,2156,1652,1924,88.8601,60.8765,29.1235,99.9704
723,724,1339,175,1917,83.1774,3.89368,86.1063,99.9881
724,725,4885,822,1946,276.863,6.5610300000000015,83.439,99.9854
725,726,3333,3219,1933,265.741,47.1127,42.8873,99.9574
726,727,15175,3302,1992,88.434,11.5563,78.4437,99.9761
727,728,504,2254,1934,83.193,30.8133,59.1867,99.9927
728,729,8891,2895,1999,257.538,25.1729,64.8271,99.9278
729,730,1020,694,1947,82.7875,2.68302,87.31700000000002,99.993
730,731,1370,1715,1950,93.8791,58.9536,31.0464,99.9842
731,732,52239,2234,2056,82.1336,14.307,75.693,99.0324
732,733,6583,169,1987,99.3812,34.5347,55.4653,99.7959
733,734,820,2167,1951,78.1081,20.5089,69.4911,99.9937
734,735,5208,644,1994,82.8615,22.6839,67.3161,99.9415
735,736,4286,1581,1979,108.28,40.8058,49.1942,99.9838
736,737,22041,3144,2027,262.514,1.10892,88.8911,99.9529
737,738,21169,2531,2051,260.289,11.6285,78.3715,99.5194
738,739,22444,2690,2067,85.4431,13.4373,76.5627,99.918
739,740,1630,2068,1979,85.5525,19.8101,70.1899,99.9957
740,741,16371,1689,2075,269.211,65.2791,24.7209,98.9593
741,742,742,1679,1973,101.368,54.8457,35.1543,99.9648
742,743,3371,440,1993,129.483,85.155,4.84497,98.9928
743,744,34550,1480,2076,263.05,9.70833,80.2917,81.1618
744,745,15746,542,2053,96.7008,43.7083,46.2917,99.537
745,746,1764,991,1996,278.05,4.98374,85.0163,99.6304
746,747,1091,2970,1994,261.0,24.6499,65.3501,99.0356
747,748,529,1641,1985,81.7505,18.2392,71.7608,99.979
748,749,2477,804,2009,95.7731,54.2124,35.7876,99.3211
749,750,3550,2814,2021,85.4389,9.91302,80.087,99.9886
750,751,27001,3022,2149,90.9686,22.6211,67.3789,99.8362
751,752,778,2497,2015,96.2086,23.3867,66.6133,99.9893
752,753,2510,132,2051,283.048,56.2209,33.7791,99.9885
753,754,54788,707,2213,335.15,82.0015,7.9984899999999985,99.5374
754,755,2624,277,2052,89.1732,23.09,66.91,99.9942
755,756,1857,777,2042,354.842,77.6131,12.3869,99.7974
756,757,7591,887,2089,175.31799999999996,87.3243,2.67565,99.9678
757,758,1524,226,2062,84.64399999999998,37.3711,52.6289,99.9925
758,759,23089,350,2125,264.335,34.0812,55.9188,99.6962
759,760,23701,2843,2142,115.454,80.7944,9.20563,99.9582
760,761,910,2768,2090,288.092,86.4974,3.5025800000000005,99.9805
761,762,2056,1103,2074,88.081,7.54691,82.4531,99.9925
762,763,727,2379,2078,49.4444,62.6976,27.3024,99.9803
763,764,1027,3360,2088,81.3491,1.84359,88.1564,99.9473
764,765,3922,176,2097,87.0725,0.7750090000000001,89.225,99.9888
765,766,1498,3330,2092,84.0742,2.09837,87.9016,99.9918
766,767,2782,2597,2099,84.0062,18.7569,71.2431,99.9832
767,768,671,1048,2079,285.655,58.0209,31.9791,99.992
768,769,1087,790,2081,87.0003,43.5336,46.4664,99.9876
769,770,24448,3198,2164,267.018,40.2403,49.7597,99.9653
770,771,1459,1040,2108,293.695,58.9053,31.0947,99.9646
771,772,7159,1132,2136,306.495,65.1805,24.8195,99.9722
772,773,1267,1319,2121,261.389,19.7684,70.2316,99.9483
773,774,10973,2443,2150,76.1365,70.0542,19.9458,99.7727
774,775,648,994,2120,294.641,57.183,32.817,99.9699
775,776,10280,1242,2161,274.746,24.3169,65.6831,99.9688
776,777,12184,884,2186,276.208,62.3548,27.6452,99.8647
777,778,2006,1729,2149,268.711,66.7067,23.2933,99.9766
778,779,6206,1547,2164,282.072,65.8813,24.1187,99.9453
779,780,1208,2173,2150,81.2714,71.6032,18.3968,99.988
780,781,5854,3326,2180,64.3565,80.4213,9.5787,99.9782
781,782,4642,511,2182,276.588,31.1616,58.8384,99.9834
782,783,14122,174,2209,85.609,21.4055,68.5945,99.9537
783,784,46936,986,2307,93.4854,49.6255,40.3745,99.5279
784,785,3677,2599,2162,262.874,14.5696,75.4304,99.9841
785,786,33394,365,2243,78.0675,3.23524,86.7648,99.813
786,787,643,1313,2160,260.091,11.664,78.336,99.9072
787,788,10297,1853,2198,263.747,24.6791,65.3209,99.9397
788,789,955,713,2159,317.313,76.1358,13.8642,99.933
789,790,13550,1368,2215,82.2316,7.49188,82.5081,99.9742
790,791,8953,569,2243,358.691,83.0985,6.90155,99.7708
791,792,64981,2368,2305,266.834,36.3977,53.6023,99.6493
792,793,2239,1132,2202,289.502,59.1523,30.8477,99.9571
793,794,4944,1760,2219,93.9004,52.1442,37.8558,99.988
794,795,3423,1585,2216,80.4861,63.8598,26.1402,99.9866
795,796,11536,1469,2264,213.968,79.2965,10.7035,99.9212
796,797,11822,2651,2234,87.99700000000001,18.1108,71.8892,99.939
797,798,5484,2202,2239,81.375,27.241,62.75899999999999,99.933
798,799,9801,2969,2294,261.394,34.3554,55.6446,99.4037
799,800,7382,3220,2292,80.7753,7.22288,82.7771,99.9107
800,801,4844,1183,2232,96.8442,60.4671,29.5329,99.9673
801,802,17347,2848,2281,80.8687,0.424065,89.5759,99.9275
802,803,1175,1526,2226,91.1114,20.252,69.748,99.9932
803,804,1216,1716,2241,89.2208,59.804,30.196,99.966
804,805,1504,2757,2251,268.671,84.0555,5.94452,99.9544
805,806,1389,2028,2250,77.6993,65.44,24.56,99.9895
806,807,9805,2556,2298,92.8273,10.1911,79.8089,99.9753
807,808,3826,1642,2262,89.7225,19.8209,70.1791,99.9751
808,809,699,3350,2241,263.151,15.9271,74.0729,99.9733
809,810,14598,1794,2318,273.922,2.36525,87.6348,99.948
810,811,2184,506,2260,87.8517,3.97211,86.0279,99.9633
811,812,2697,1101,2267,272.953,50.7362,39.2638,99.986
812,813,1506,1246,2262,80.3746,42.6964,47.3036,99.9899
813,814,784,2059,2267,72.4125,67.911,22.089,99.9957
814,815,2848,1561,2285,96.7521,42.9298,47.0702,99.99
815,816,12169,3094,2328,262.22900000000004,85.9087,4.0913,99.9269
816,817,5337,3310,2293,84.7974,30.3094,59.6906,99.7815
817,818,4033,1318,2292,77.2317,43.2858,46.7142,99.9912
818,819,1138,127,2298,260.1,69.9069,20.0931,99.9927
819,820,1281,176,2298,265.204,17.7049,72.2951,99.9947
820,821,3972,250,2329,263.398,25.0901,64.9099,99.9866
821,822,2192,2699,2294,253.519,68.2041,21.7959,99.9952
822,823,3105,1247,2313,268.056,50.1999,39.8001,99.9865
823,824,1041,2054,2300,284.709,84.9946,5.00537,99.9854
824,825,2434,1648,2325,93.4465,58.9271,31.0729,99.9505
825,826,533,1140,2299,262.587,46.2069,43.7931,99.9338
826,827,693,2159,2310,86.7935,61.9944,28.0056,99.9946
827,828,4737,1992,2342,275.478,61.82,28.18,99.898
828,829,65399,2590,2478,86.1945,9.59309,80.4069,98.779
829,830,9023,423,2352,260.445,21.9129,68.0871,99.6335
830,831,1002,1712,2330,331.4190000000001,82.9376,7.062410000000002,99.9905
831,832,44683,182,2481,85.7294,27.4947,62.5053,99.8853
832,833,9342,532,2366,134.195,83.01700000000002,6.98303,99.9521
833,834,21240,1621,2393,88.728,19.2174,70.7826,99.7638
834,835,6214,1914,2364,89.4152,14.6743,75.3257,99.6127
835,836,2703,1138,2338,99.0291,57.1736,32.8264,99.9903
836,837,556,1448,2334,88.2829,62.4466,27.5534,99.9859
837,838,2216,638,2353,98.6998,50.5,39.5,99.9773
838,839,730,2046,2352,262.379,84.34299999999998,5.6569699999999985,99.9937
839,840,41331,2155,2463,86.085,27.5786,62.4214,99.8379
840,841,5424,1211,2368,274.562,22.7538,67.2462,99.9812
841,842,1113,3336,2348,79.2026,73.8958,16.1042,99.9846
842,843,1114,1391,2339,79.8053,41.4807,48.5193,99.9882
843,844,1927,3254,2367,79.47800000000002,57.4289,32.5711,99.98
844,845,64789,671,2466,84.6272,5.54701,84.45299999999997,99.4909
845,846,12881,1333,2393,87.4388,68.935,21.065,99.9757
846,847,32828,2828,2455,267.387,8.49446,81.5055,99.9706
847,848,619,1484,2357,275.639,4.46726,85.5327,99.9895
848,849,3192,3300,2383,79.1283,6.57797,83.42200000000003,99.9931
849,850,882,1440,2375,266.402,64.4548,25.5452,99.9873
850,851,2243,3207,2379,86.9711,21.8789,68.1211,99.9588
851,852,6957,1119,2401,276.31,2.01918,87.9808,99.9663
852,853,18891,346,2444,86.2744,41.8588,48.1412,99.8392
853,854,3454,3146,2396,157.77,75.7182,14.2818,99.8819
854,855,1428,2961,2385,262.405,0.0103683,89.9896,99.1618
855,856,5392,2036,2405,85.6967,5.363569999999998,84.6364,99.9751
856,857,1311,3340,2410,206.855,82.9174,7.08259,99.9125
857,858,573,685,2396,88.4585,27.4676,62.5324,99.9941
858,859,832,1842,2399,319.348,81.3003,8.69968,99.9879
859,860,16982,1429,2475,255.043,66.9799,23.0201,99.35
860,861,897,2498,2409,92.7486,13.8133,76.1867,99.9865
861,862,1549,1892,2412,21.9132,81.8271,8.172880000000001,99.9837
862,863,12666,3043,2460,168.486,74.01,15.99,99.9077
863,864,5610,1222,2456,92.7615,39.8273,50.1727,99.9145
864,865,512,3116,2417,100.429,40.243,49.757,99.9865
865,866,1036,3255,2427,266.142,35.8242,54.1758,99.9968
866,867,10894,3176,2492,101.208,46.4985,43.5015,99.9104
867,868,1423,2310,2427,113.26,77.8967,12.1033,99.9891
868,869,1785,1794,2437,222.592,75.8962,14.1038,99.9928
869,870,8797,1600,2474,262.148,64.1447,25.8554,99.8899
870,871,994,701,2446,88.9214,27.3195,62.6805,99.9885
871,872,2466,1158,2458,97.6797,37.6848,52.3152,99.9786
872,873,3810,1870,2456,93.1326,33.3793,56.6207,99.9841
873,874,19277,860,2570,80.2891,52.6176,37.3824,99.7949
874,875,704,3287,2443,88.1741,28.0202,61.9798,99.9943
875,876,2372,1089,2465,284.091,22.5952,67.4048,99.9709
876,877,1871,2370,2452,87.6051,59.254,30.746,99.984
877,878,3008,3345,2474,78.9136,2.03931,87.9607,99.97
878,879,3385,1966,2472,84.0477,15.1676,74.8324,98.9805
879,880,2394,2312,2472,263.9,18.5067,71.4933,99.9897
880,881,1929,1278,2484,246.37,62.9242,27.0758,99.9514
881,882,2543,1820,2486,246.981,52.6402,37.3598,99.9834
882,883,9500,1027,2514,92.8352,20.6513,69.3487,99.8608
883,884,1254,1722,2469,95.9747,30.0312,59.9688,99.9603
884,885,2702,2973,2490,188.564,83.6269,6.37314,99.992
885,886,738,2561,2486,205.764,83.5747,6.42526,99.9661
886,887,602,2542,2497,306.165,87.0994,2.90057,99.7109
887,888,776,2906,2500,77.4394,7.29293,82.7071,99.9835
888,889,15895,1705,2545,86.0948,57.5649,32.4351,99.2745
889,890,6363,3321,2549,264.53,33.8685,56.1315,99.8229
890,891,9909,1291,2545,276.441,25.2875,64.7125,99.8071
891,892,689,3091,2511,83.4894,7.53118,82.4688,99.9849
892,893,33820,1883,2612,90.1426,4.77094,85.2291,99.6981
893,894,795,2394,2515,257.61,33.0229,56.9771,99.9559
894,895,29329,284,2633,88.2497,18.6977,71.3023,99.9168
895,896,1180,1613,2528,323.014,81.4636,8.53642,98.1599
896,897,7683,1504,2558,87.9441,15.8591,74.1409,99.5663
897,898,3200,2001,2569,268.613,18.6933,71.3067,99.9494
898,899,505,944,2529,261.562,17.3666,72.6334,99.5228
899,900,2788,2960,2551,258.811,31.0697,58.9303,98.9034
900,901,521,3252,2535,91.6954,85.8347,4.16528,99.9552
901,902,65056,689,2700,31.6813,83.2621,6.73787,99.8015
902,903,5970,1171,2583,283.16,72.7821,17.2179,99.9431
903,904,56757,2314,2673,271.743,50.3403,39.6597,99.9023
904,905,126241,2892,2747,82.23,30.7885,59.2115,99.683
905,906,41449,470,2714,83.7102,22.7742,67.2258,98.5119
906,907,7284,3101,2589,271.735,46.5941,43.4059,99.913
907,908,8744,2726,2615,258.89,32.7983,57.2017,99.7118
908,909,559,1366,2559,82.1776,13.2215,76.7785,99.9874
909,910,511,769,2572,81.9827,3.96783,86.0322,99.99
910,911,51530,987,2709,83.0231,10.2646,79.7354,99.3498
911,912,3103,2069,2582,278.231,51.1843,38.8157,99.9471
912,913,8017,3259,2600,61.5765,64.1704,25.8296,99.9461
913,914,6056,1245,2621,76.3347,56.8582,33.1418,99.9913
914,915,29982,1606,2713,275.518,41.1054,48.8946,99.9038
915,916,3641,2670,2621,262.232,16.6326,73.3674,99.9823
916,917,16406,2117,2656,84.6311,33.7807,56.2193,99.9479
917,918,8546,2604,2647,264.507,34.9341,55.0659,99.9593
918,919,3270,969,2615,283.7870000000001,63.0695,26.9305,99.7295
919,920,2523,1413,2607,75.0365,55.2715,34.7285,99.9596
920,921,2574,1516,2612,87.20100000000002,55.0312,34.9688,99.9933
921,922,7245,1346,2672,260.741,78.4468,11.5532,99.9617
922,923,947,882,2618,256.598,10.6,79.4,99.9878
923,924,15676,3176,2684,87.8112,10.3726,79.6274,99.9846
924,925,6331,1738,2653,82.1532,56.5775,33.4225,99.9775
925,926,2842,1279,2665,277.02,77.3159,12.6841,99.9802
926,927,2757,1999,2664,337.905,79.6486,10.3514,99.869
927,928,28999,1420,2737,81.7084,62.309,27.691,99.7991
928,929,4714,1176,2686,271.98900000000003,43.3815,46.6185,99.9775
929,930,3061,3308,2667,279.347,60.1567,29.8433,99.9847
930,931,1117,953,2666,82.4246,18.9999,71.0001,98.9414
931,932,587,3251,2683,81.4122,30.547,59.453,99.9936
932,933,991,146,2685,339.98,82.7,7.29997,99.995
933,934,1445,1805,2705,330.867,83.6916,6.30839,99.8512
934,935,25611,2554,2763,267.666,8.09088,81.9091,99.8488
935,936,3275,355,2723,272.608,15.4493,74.5507,99.9971
936,937,31458,190,2833,267.313,33.556,56.444,99.8812
937,938,3177,3331,2736,271.129,35.4661,54.5339,99.9288
938,939,18221,1837,2790,84.0617,11.0387,78.9613,99.9544
939,940,1851,3280,2744,271.482,32.8853,57.1147,99.9557
940,941,6464,307,2766,78.9587,53.1936,36.8064,99.9461
941,942,5279,1979,2749,73.3765,69.1813,20.8187,99.9288
942,943,1491,2148,2746,85.9335,5.75301,84.24700000000001,99.9856
943,944,24563,1169,2837,251.963,66.0185,23.9815,99.9359
944,945,16527,1305,2852,84.2737,21.5388,68.4612,99.7697
945,946,4477,2077,2764,302.388,80.3359,9.66408,99.9413
946,947,2126,1724,2770,86.5518,44.2549,45.7451,99.985
947,948,49303,3167,2942,269.105,13.5071,76.4929,99.9162
948,949,6661,368,2829,248.996,75.8285,14.1715,99.9653
949,950,4659,2427,2809,257.244,12.2582,77.7418,99.8972
950,951,1635,237,2779,265.59,27.063,62.937,99.9956
951,952,8545,2194,2821,267.113,2.5992,87.4008,99.9726
952,953,967,3336,2797,256.79400000000004,13.3049,76.6951,99.9926
953,954,65624,2006,2971,101.63,29.1139,60.8861,99.5154
954,955,2520,2304,2822,101.338,15.7219,74.2781,99.9959
955,956,646,1498,2816,272.698,67.047,22.953000000000007,99.999
956,957,3211,2065,2823,232.331,84.0495,5.9505300000000005,99.9728
957,958,17191,1025,2889,94.7666,4.31579,85.6842,99.7819
958,959,18074,1612,2852,278.392,78.0029,11.9971,99.6472
959,960,15594,2342,2898,266.442,8.429160000000001,81.5708,99.9789
960,961,15925,3296,2906,261.064,9.67754,80.3225,99.8663
961,962,3471,811,2844,267.617,32.7166,57.2834,99.9847
962,963,5353,1781,2871,265.502,35.4152,54.5848,99.8825
963,964,27147,597,2936,92.9588,28.911,61.089,99.8846
964,965,3054,3103,2859,256.625,59.7726,30.2274,99.9788
965,966,681,2618,2838,265.078,18.7744,71.2256,99.9908
966,967,2081,2108,2861,86.3331,15.2403,74.7597,99.9942
967,968,2224,2491,2854,265.263,18.1736,71.8264,99.9865
968,969,1579,898,2864,330.396,89.1115,0.8884540000000001,99.9598
969,970,1081,2245,2870,81.4944,9.80495,80.1951,99.9938
970,971,519,2399,2880,257.279,5.8832900000000015,84.1167,99.9393
971,972,764,2531,2879,326.437,81.2811,8.718919999999999,99.9833
972,973,1313,2571,2879,272.764,0.446945,89.5531,99.9901
973,974,38781,811,2960,148.238,82.8256,7.17439,99.1606
974,975,3361,413,2897,85.3718,13.7326,76.2674,99.9493
975,976,6404,2177,2901,87.109,13.1572,76.8428,99.9701
976,977,1208,496,2897,268.244,62.4848,27.5152,99.9885
977,978,2165,1371,2904,263.815,46.4541,43.5459,99.9916
978,979,1170,1267,2903,112.474,84.7693,5.23068,99.9898
979,980,10513,2590,2996,260.36,67.3831,22.6169,98.949
980,981,5652,1842,2938,84.1738,24.6318,65.3682,99.9888
981,982,7578,2492,2932,98.3203,18.1707,71.8293,99.7104
982,983,14963,1424,2995,268.206,35.5835,54.4165,99.2762
983,984,1180,2255,2910,86.7178,31.8149,58.1851,99.992
984,985,8604,1124,2955,93.5925,16.6772,73.3228,99.9639
985,986,570,374,2919,80.8101,33.124,56.87600000000001,99.8631
986,987,560,2781,2917,267.128,1.37876,88.6212,99.975
987,988,2872,2988,2939,241.284,65.2824,24.7176,99.9192
988,989,1136,325,2920,257.66200000000003,25.1004,64.8996,99.9868
989,990,6850,1756,2955,260.414,32.4272,57.5728,99.9761
990,991,5965,2871,2944,106.13,57.2065,32.7935,99.9449
991,992,15438,1581,2968,266.762,77.6909,12.3091,99.4964
992,993,677,2699,2916,267.254,4.19196,85.80799999999998,99.9871
993,994,12364,2671,2984,91.6117,25.837,64.163,99.9313
994,995,20891,220,2993,254.043,16.4433,73.5567,99.9668
995,996,920,128,2962,267.954,18.4665,71.5335,99.9869
996,997,3523,380,2978,83.834,29.2271,60.7729,99.8075
997,998,813,2156,2950,125.664,80.8456,9.15444,99.9824
998,999,5734,2287,2992,84.6237,60.1365,29.8635,99.8809
999,1000,758,1372,2957,96.8022,72.7122,17.2878,99.9552
1000,1001,551,3242,2962,50.6012,84.9386,5.06144,99.9905
1001,1002,2441,2215,2976,102.058,47.6079,42.3921,99.9888
1002,1003,1654,1213,2979,260.171,0.159607,89.8404,99.991
1003,1004,20674,2805,3056,255.87,44.3553,45.6447,99.6439
1004,1005,906,486,2982,92.9505,31.9257,58.0743,99.903
1005,1006,3569,1674,2987,81.9283,1.18723,88.8128,99.9868
1006,1007,2471,2384,3002,93.9159,20.2356,69.7644,99.9685
1007,1008,622,3355,2995,42.0104,82.0617,7.9383,99.9248
1008,1009,963,444,2980,81.7157,33.7961,56.2039,99.7468
1009,1010,2370,1258,2992,262.281,60.7419,29.2581,99.7313
1010,1011,1694,2467,2993,87.4913,1.27654,88.7235,99.5351
1011,1012,51102,2979,3130,267.492,46.6845,43.3155,99.0285
1012,1013,70293,1068,3137,269.972,29.134,60.86600000000001,99.6927
1013,1014,27454,1312,3104,302.617,66.527,23.473000000000006,99.7102
1014,1015,5729,1798,3064,280.148,81.0506,8.94941,98.808
1015,1016,61117,2429,3147,80.4821,21.6352,68.3648,99.4116
1016,1017,888,1877,3014,160.71,83.7557,6.24435,99.1327
1017,1018,906,1851,3020,231.213,82.5195,7.480539999999999,98.1769
1018,1019,6258,3312,3051,26.0059,81.1129,8.887080000000003,98.7437
1019,1020,4163,1496,3045,78.9823,60.8336,29.1664,99.2969
1020,1021,1726,298,3026,74.6306,53.9628,36.0372,99.93
1021,1022,4552,927,3030,85.1402,2.09725,87.9027,99.3476
1022,1023,3137,1743,3030,90.06299999999997,31.0254,58.9746,99.7991
1023,1024,2180,2233,3032,100.413,27.243,62.757,99.9288
1024,1025,54180,403,3170,87.7283,28.6514,61.3486,83.6822
1025,1026,2185,677,3051,47.4709,70.3404,19.6596,99.9935
1026,1027,9215,2715,3100,264.646,50.5175,39.4825,99.7771
1027,1028,535,384,3029,257.913,17.3399,72.6601,99.989
1028,1029,4401,1629,3056,83.9298,37.2697,52.7303,99.9349
1029,1030,988,603,3039,93.8091,14.4215,75.5785,99.9957
1030,1031,1389,2176,3055,88.65899999999998,5.94381,84.0562,99.9949
1031,1032,1282,252,3054,88.4465,12.3147,77.6853,99.7462
1032,1033,629,1829,3054,89.9671,16.0047,73.9953,99.9181
1033,1034,1442,131,3080,90.4478,39.9147,50.0853,99.9723
1034,1035,15566,2247,3145,87.9971,33.999,56.00100000000001,99.9824
1035,1036,3037,1722,3095,316.701,70.0937,19.9063,99.9812
1036,1037,25393,1877,3174,264.832,27.3006,62.6994,99.8654
1037,1038,1056,721,3073,84.2892,6.22325,83.7767,99.9753
1038,1039,2871,848,3076,46.7279,72.4011,17.5989,99.991
1039,1040,3924,605,3095,84.5497,47.4087,42.5913,99.963
1040,1041,2218,2128,3092,102.663,78.3733,11.6267,99.9909
1041,1042,2595,554,3127,264.211,32.2577,57.7423,99.9075
1042,1043,3295,287,3108,83.3323,29.5876,60.4124,99.9931
1043,1044,11227,780,3140,266.91900000000004,12.0387,77.9613,99.6412
1044,1045,774,243,3089,86.6113,21.6949,68.3051,99.9815
1045,1046,61541,1586,3238,268.691,1.79462,88.2054,99.9055
1046,1047,5294,3261,3123,280.284,63.5492,26.4508,99.9844
1047,1048,848,1465,3109,281.166,46.2632,43.7368,99.9778
1048,1049,9605,676,3150,264.853,0.694695,89.3053,99.9814
1049,1050,22010,193,3184,88.6487,1.2928,88.7072,99.943
1050,1051,621,3325,3129,257.07,14.3993,75.6007,99.9908
1051,1052,12630,2604,3192,98.8197,13.886,76.11399999999998,99.9631
1052,1053,2038,2679,3158,89.7333,9.9282,80.0718,99.9925
1053,1054,1757,2142,3149,95.0231,81.0064,8.99364,99.9871
1054,1055,9027,2028,3178,182.197,85.3833,4.61669,99.9808
1055,1056,6074,1729,3183,81.8056,26.3227,63.6773,99.5499
1056,1057,1168,1791,3165,260.374,37.2394,52.7606,99.9837
1057,1058,4805,3169,3171,80.5782,2.79074,87.2093,99.9819
1058,1059,7565,2829,3194,67.1895,53.9185,36.0815,99.9913
1059,1060,2514,602,3181,91.7585,25.8089,64.1911,99.9725
1060,1061,3309,3302,3180,87.4574,62.1267,27.8733,99.9919
1061,1062,709,884,3170,64.4323,72.6518,17.3482,99.9912
1062,1063,16975,2100,3255,98.8019,38.6692,51.3308,99.8531
1063,1064,3244,2742,3209,90.232,8.99174,81.0083,99.9903
1064,1065,1630,2197,3201,90.7377,54.2429,35.7571,99.9911
1065,1066,973,525,3199,20.5564,76.6272,13.3728,99.9878
1066,1067,762,1373,3197,284.144,84.8648,5.13525,99.9967
1067,1068,37056,3236,3293,267.592,48.0228,41.9772,99.9745
1068,1069,1590,863,3208,84.333,12.3279,77.6721,99.983
1069,1070,16612,1233,3294,94.0743,41.5078,48.4922,99.9765
1070,1071,772,1318,3198,260.904,28.2555,61.7445,99.9961
1071,1072,1269,567,3219,91.3785,4.04285,85.9571,99.9939
1072,1073,3391,2687,3239,272.869,68.1565,21.8435,99.9797
1073,1074,5401,757,3224,23.0328,75.9733,14.0267,99.8928
1074,1075,4154,1959,3249,256.545,80.487,9.51304,99.9486
1075,1076,5437,3089,3244,255.436,34.2407,55.7593,99.9856
1076,1077,19970,663,3296,268.1,17.6354,72.3646,99.9823
1077,1078,11806,1337,3275,66.4129,56.6179,33.3821,99.9833
1078,1079,13195,919,3276,85.6439,14.7764,75.2236,98.9921
1079,1080,1120,1795,3242,269.571,60.5793,29.4207,99.9149
1080,1081,17340,1446,3319,273.632,41.8228,48.1772,99.4189
1081,1082,10361,2217,3283,258.26,39.6958,50.3042,99.9824
1082,1083,503,2539,3243,95.7076,11.2779,78.7221,99.9968
1083,1084,67879,546,3436,275.369,33.1045,56.8955,99.5635
1084,1085,2297,1744,3256,80.4761,28.4109,61.5891,99.7822
1085,1086,11936,230,3312,275.228,44.1113,45.8887,99.951
1086,1087,10368,2764,3297,95.8265,29.3766,60.6234,99.9891
1087,1088,3678,2519,3288,98.3981,6.7020300000000015,83.29799999999999,99.9793
1088,1089,3187,2301,3285,94.9103,38.2686,51.7314,99.9938
1089,1090,3408,1012,3293,72.9944,71.0152,18.9848,99.9865
1090,1091,550,2635,3268,274.386,68.042,21.958,99.9739
1091,1092,898,148,3282,106.491,37.6496,52.3504,99.9952
1092,1093,23868,2984,3382,263.04,44.6962,45.3038,99.5646
1093,1094,2504,800,3292,73.0455,80.9958,9.00415,99.9454
1094,1095,3498,458,3311,92.1656,3.72574,86.2743,98.9748
1095,1096,20210,1743,3377,267.523,14.9173,75.0827,99.9435
1096,1097,721,1890,3301,87.87799999999999,30.6878,59.3122,99.9619
1097,1098,561,2597,3294,265.61400000000003,73.7102,16.2898,99.9933
1098,1099,857,2354,3305,64.229,71.1188,18.8813,99.8984
1099,1100,1388,1939,3302,90.676,31.5904,58.4096,99.133
1100,1101,524,1834,3317,87.3032,29.2322,60.7678,99.8612
1101,1102,2075,2034,3319,121.951,81.2818,8.71819,99.9811
1102,1103,6277,2922,3332,78.0783,2.56628,87.4337,99.3076
1103,1104,5966,2667,3349,265.848,38.4252,51.5748,99.9796
1104,1105,11140,2835,3378,85.395,3.58195,86.41799999999998,99.9906
1105,1106,4345,810,3367,270.582,31.7194,58.2806,99.9656
1106,1107,14870,2469,3360,121.265,74.7931,15.2069,99.676
1107,1108,3884,756,3364,71.0886,11.459,78.541,99.9954
1108,1109,5176,1059,3363,269.427,23.513,66.487,99.9601
1109,1110,5318,1973,3359,91.7142,72.8016,17.1984,99.9482
1110,1111,1250,2595,3337,93.7411,2.13506,87.8649,99.984
1111,1112,2925,1890,3346,262.949,18.9556,71.0444,99.9829
1112,1113,5515,2314,3365,255.016,39.2578,50.7422,99.9948
1113,1114,6997,901,3361,78.3684,79.5611,10.4389,99.955
1114,1115,43517,295,3501,259.444,17.6125,72.3875,99.8344
1115,1116,2915,2167,3357,251.627,64.9997,25.0003,99.9939
1116,1117,46341,1089,3471,263.08,11.7606,78.2394,99.8229
1117,1118,1975,155,3359,107.537,37.0371,52.9629,99.9896
1118,1119,92890,2115,3592,95.164,26.5909,63.4091,99.6511
1119,1120,22215,2087,3439,108.219,56.6611,33.3389,99.8997
1120,1121,48549,1379,3486,271.092,58.8248,31.1752,99.1381
1121,1122,7729,3098,3411,275.29900000000004,37.0341,52.9659,99.8498
1122,1123,1739,1838,3393,257.077,24.6265,65.3735,99.9947
1123,1124,4733,2727,3411,272.886,30.4091,59.5909,99.9933
1124,1125,15463,1909,3454,92.3396,66.6295,23.3705,85.2981
1125,1126,1294,124,3399,276.216,30.3506,59.6494,99.9836
1126,1127,2851,3323,3416,246.649,76.9063,13.0937,99.9695
1127,1128,4689,2469,3420,54.7416,71.2692,18.7308,99.9317
1128,1129,1963,193,3411,90.7738,32.2078,57.7922,99.9944
1129,1130,8836,2570,3456,103.83,31.9653,58.0347,99.9142
1130,1131,3295,155,3455,100.658,30.4077,59.5923,99.9132
1131,1132,4923,2652,3447,84.9825,43.4694,46.5306,99.9259
1132,1133,3730,1645,3442,83.6092,25.915,64.085,99.9691
1133,1134,2957,2004,3453,265.264,8.837439999999997,81.1626,99.9844
1134,1135,2985,2363,3425,86.8701,8.5977,81.4023,99.9665
1135,1136,17080,2796,3515,268.538,12.7495,77.2505,99.9792
1136,1137,1112,1525,3447,275.415,43.6358,46.3642,99.9752
1137,1138,17216,3265,3507,86.1753,65.7121,24.2879,99.1976
1138,1139,562,115,3439,94.6887,30.3386,59.6614,99.9828
1139,1140,2194,3176,3453,96.3558,57.1704,32.8296,99.9905
1140,1141,1449,1553,3461,274.26,59.3716,30.6284,99.993
1141,1142,6932,822,3475,51.5129,81.2692,8.73082,99.4692
1142,1143,76883,3050,3603,278.468,39.0893,50.9107,99.6573
1143,1144,1081,1753,3477,80.6488,27.8343,62.1657,99.8911
1144,1145,533,177,3465,90.4672,32.1245,57.8755,99.9673
1145,1146,2859,2359,3471,103.522,57.3682,32.6318,99.9846
1146,1147,2503,1597,3480,255.848,68.7975,21.2025,99.9605
1147,1148,22082,2422,3552,269.041,26.435,63.565,99.234
1148,1149,15619,1811,3534,85.1531,14.4452,75.5548,99.9729
1149,1150,700,105,3471,277.998,34.671,55.32899999999999,99.9727
1150,1151,729,2299,3467,258.212,63.3595,26.6405,99.9927
1151,1152,24961,865,3562,265.28700000000003,61.3561,28.6439,99.3593
1152,1153,5813,2709,3507,86.8879,6.82635,83.1736,99.9864
1153,1154,1753,411,3492,251.59,69.4362,20.5638,98.68
1154,1155,5647,1204,3520,271.545,34.9609,55.0391,99.6388
1155,1156,7009,1654,3544,278.2,37.8221,52.1779,99.4866
1156,1157,1058,106,3526,95.7708,22.235,67.765,99.9303
1157,1158,6501,1557,3551,46.4501,77.5235,12.4765,98.7117
1158,1159,3000,138,3544,260.743,48.7561,41.2439,99.9829
1159,1160,6722,2645,3550,83.507,63.2972,26.7028,98.8327
1160,1161,9752,593,3579,38.2146,79.1317,10.8683,99.9469
1161,1162,1781,704,3541,268.04900000000004,18.9739,71.0261,99.9946
1162,1163,794,2495,3556,290.44,68.3029,21.6971,98.4762
1163,1164,785,752,3545,274.206,61.1591,28.8409,99.9936
1164,1165,9616,1744,3630,65.6657,67.782,22.218000000000004,99.9282
1165,1166,20152,1142,3648,82.6354,79.7647,10.2353,99.9302
1166,1167,1200,3199,3571,270.469,47.881,42.119,99.9032
1167,1168,8975,2554,3606,99.2772,5.0976,84.9024,99.9557
1168,1169,4289,170,3604,87.0684,8.16232,81.8377,99.9914
1169,1170,3050,1270,3597,269.423,35.9144,54.0856,99.8745
1170,1171,23382,683,3653,262.519,23.8017,66.1983,99.9497
1171,1172,4438,2901,3648,89.084,27.2016,62.7984,99.9762
1172,1173,12172,974,3663,324.98,78.8843,11.1157,93.6315
1173,1174,811,408,3598,267.28,66.3184,23.6816,99.9742
1174,1175,838,1604,3602,279.235,34.9206,55.0794,99.9938
1175,1176,4733,2842,3642,275.384,38.5618,51.4382,99.974
1176,1177,36426,2681,3689,100.446,40.6561,49.3439,99.9319
1177,1178,90581,1400,3761,90.3554,8.209010000000001,81.791,99.4862
1178,1179,8584,1845,3648,85.7733,6.16316,83.8368,99.9843
1179,1180,1526,108,3646,289.1040000000001,74.7186,15.2814,99.9633
1180,1181,655,128,3616,261.269,18.9669,71.0331,99.9977
1181,1182,2897,1627,3633,60.0546,68.2049,21.7951,99.9893
1182,1183,1118,3240,3637,259.36400000000003,8.33788,81.6621,99.9213
1183,1184,1310,451,3627,266.807,20.7501,69.2499,99.1627
1184,1185,3765,2483,3658,268.512,31.5986,58.4014,99.9778
1185,1186,8290,3309,3677,77.2012,22.9039,67.0961,99.973
1186,1187,1199,401,3637,83.3509,54.007,35.993,99.9625
1187,1188,1370,261,3644,259.587,18.4109,71.5891,99.985
1188,1189,7142,2197,3652,84.1545,11.4841,78.5159,99.9112
1189,1190,24627,240,3740,85.98100000000002,32.2943,57.7057,99.979
1190,1191,6027,327,3687,83.4972,55.5827,34.4173,99.9071
1191,1192,12350,1695,3703,267.166,14.0232,75.9768,99.9699
1192,1193,2815,1582,3680,280.181,77.7404,12.2596,99.9422
1193,1194,5040,843,3687,48.9022,80.7983,9.20174,99.9482
1194,1195,49059,536,3767,87.1104,8.38688,81.6131,99.5152
1195,1196,16745,2203,3722,84.8345,11.7037,78.2963,99.8841
1196,1197,549,2377,3666,266.411,26.6181,63.3819,99.9809
1197,1198,615,581,3675,277.809,3.64069,86.3593,99.961
1198,1199,3142,2467,3706,265.378,30.1946,59.8054,99.5976
1199,1200,7963,2351,3726,88.1613,17.919,72.081,99.9618
1200,1201,3042,3236,3709,79.7318,16.075,73.925,99.984
1201,1202,7894,130,3757,216.828,81.8456,8.15441,99.9693
1202,1203,26431,873,3782,81.9388,19.0234,70.9766,99.4731
1203,1204,7507,1871,3752,52.1556,64.8092,25.1908,99.9894
1204,1205,9894,2813,3752,92.3293,66.8479,23.1521,99.9679
1205,1206,864,3175,3718,258.232,4.0770800000000005,85.9229,99.9952
1206,1207,11592,2580,3792,104.804,39.6779,50.3221,99.9828
1207,1208,831,1598,3728,264.3,78.1006,11.8994,99.9711
1208,1209,7594,2441,3769,87.3517,20.4926,69.5074,98.825
1209,1210,4568,1803,3770,269.938,49.7941,40.2059,99.9896
1210,1211,1361,1173,3752,87.0233,42.3471,47.6529,99.9906
1211,1212,11233,3195,3794,83.1179,76.9731,13.0269,99.992
1212,1213,3867,3316,3773,69.006,75.3382,14.6618,99.942
1213,1214,1974,358,3766,69.2959,69.7823,20.2177,99.9584
1214,1215,9090,1023,3832,284.524,62.8634,27.1366,99.9535
1215,1216,33526,1701,3902,78.5079,7.5378,82.4622,99.9002
1216,1217,14171,2260,3815,260.651,19.3762,70.6238,99.9921
1217,1218,23338,2779,3859,102.328,67.1242,22.8758,99.8499
1218,1219,61619,2976,3916,252.202,80.1562,9.84376,98.5823
1219,1220,1591,1145,3780,87.8943,42.4375,47.5625,99.9951
1220,1221,1790,2537,3836,263.079,30.6254,59.3746,99.9674
1221,1222,30262,1952,3921,264.182,3.26213,86.7379,99.5492
1222,1223,4153,1692,3818,92.6791,74.3695,15.6305,99.992
1223,1224,3264,1090,3817,104.629,77.5296,12.4704,99.9975
1224,1225,1434,1218,3809,269.73,40.412,49.588,99.9832
1225,1226,63457,2383,3941,85.9928,9.68383,80.3162,99.3984
1226,1227,1277,1168,3812,270.777,40.0373,49.9627,99.9772
1227,1228,20555,2160,3890,93.9002,18.1881,71.8119,99.9748
1228,1229,30197,426,3905,263.823,41.1108,48.8892,99.4276
1229,1230,2576,3301,3834,83.4639,13.7372,76.2628,99.9939
1230,1231,9474,158,3854,86.5219,20.5881,69.4119,99.9328
1231,1232,4959,1844,3856,78.0004,1.36115,88.6388,99.9939
1232,1233,1013,2036,3834,262.813,12.6782,77.3218,99.9957
1233,1234,615,2070,3834,85.8462,10.6881,79.3119,99.9767
1234,1235,29278,644,3928,211.057,73.8245,16.1755,99.6264
1235,1236,12007,1214,3878,290.655,79.1265,10.8735,99.9689
1236,1237,2031,2630,3867,104.541,39.6593,50.3407,99.9918
1237,1238,10460,236,3897,219.077,75.1844,14.8156,99.9725
1238,1239,26003,840,3911,279.437,57.6079,32.3921,99.8535
1239,1240,27002,1082,3966,273.277,41.6159,48.3841,99.7699
1240,1241,4686,3253,3878,252.506,38.8571,51.1429,99.9896
1241,1242,11216,2064,3925,240.55900000000003,76.6914,13.3086,99.7845
1242,1243,883,1556,3869,81.9305,60.052,29.948,99.9932
1243,1244,2109,3156,3881,263.42400000000004,47.8141,42.1859,99.9397
1244,1245,767,1801,3868,261.761,52.8167,37.1833,99.9957
1245,1246,38101,1578,4005,94.1181,64.1685,25.8315,98.9691
1246,1247,764,3330,3895,87.1878,43.4546,46.5454,99.9732
1247,1248,649,2592,3895,259.212,29.5297,60.4703,99.9566
1248,1249,33848,2615,4008,267.152,42.5298,47.4702,99.7488
1249,1250,23428,3259,3973,267.081,35.9882,54.0118,99.9022
1250,1251,1108,1282,3923,90.1686,9.07398,80.926,99.9434
1251,1252,3166,1866,3934,262.891,49.469,40.531,99.9841
1252,1253,3313,1245,3943,94.9012,7.543660000000001,82.4563,99.9936
1253,1254,7211,125,3985,87.0447,7.80457,82.1954,99.9558
1254,1255,518,1307,3930,91.141,8.2554,81.7446,99.978
1255,1256,28752,1279,4049,87.4648,35.9823,54.0177,99.8459
1256,1257,37272,335,4029,86.2986,27.7061,62.2939,99.5792
1257,1258,3000,961,3998,237.364,75.3586,14.6414,98.8342
1258,1259,1723,3100,3972,277.525,18.397,71.60300000000002,99.9859
1259,1260,1485,1467,3966,264.389,39.2983,50.7017,99.9857
1260,1261,1672,2853,3987,99.7617,71.3093,18.6907,99.9689
1261,1262,1405,892,3982,273.659,9.11592,80.8841,99.9809
1262,1263,1589,2813,3976,235.59,73.0979,16.9021,99.9898
1263,1264,11250,3180,4036,83.06,30.4402,59.5598,99.8199
1264,1265,3201,1217,4003,264.019,65.5484,24.4516,99.0914
1265,1266,764,1430,3987,260.423,40.3371,49.6629,99.6199
1266,1267,6423,159,4078,80.3715,25.7901,64.2099,99.9464
1267,1268,618,2052,3999,97.4535,22.6978,67.3022,99.9876
1268,1269,5595,2166,4033,265.027,1.57671,88.4233,99.9474
1269,1270,1956,822,4011,263.41900000000004,30.2347,59.7653,99.7752
1270,1271,5346,2080,4041,93.7881,23.391,66.609,99.9533
1271,1272,757,2810,4019,101.052,71.4284,18.5716,99.9588
1272,1273,4730,1827,4046,269.577,49.7997,40.2003,99.5468
1273,1274,8239,809,4057,266.373,30.5013,59.4987,99.979
1274,1275,8515,2721,4070,259.22900000000004,21.5677,68.4323,99.9706
1275,1276,85307,629,4180,297.4290000000001,59.0905,30.9095,99.4728
1276,1277,1862,538,4042,251.053,81.5697,8.43028,99.9879
1277,1278,625,1421,4042,64.6467,61.2266,28.7734,98.4719
1278,1279,1838,3097,4067,99.2,55.408,34.592,99.5338
1279,1280,4179,1750,4070,64.1993,61.0997,28.9003,99.9917
1280,1281,59010,2900,4192,82.5699,68.6873,21.3127,87.1529
1281,1282,24419,906,4159,79.7938,66.6275,23.3725,99.9017
1282,1283,6197,2247,4092,92.6884,43.6298,46.3702,99.9923
1283,1284,13710,2417,4113,277.613,59.235,30.765,99.4884
1284,1285,6500,1859,4103,268.3,49.8866,40.1134,99.9901
1285,1286,871,96,4089,79.4411,19.2716,70.7284,99.9564
1286,1287,1380,1084,4086,266.246,3.89976,86.1002,99.9835
1287,1288,518,1974,4082,65.6812,61.6664,28.3336,99.9579
1288,1289,740,1033,4079,277.782,8.667819999999999,81.3322,99.9889
1289,1290,12684,2117,4128,86.5561,24.6933,65.3067,99.9737
1290,1291,12630,3151,4151,228.154,81.6107,8.3893,99.9498
1291,1292,4532,261,4117,76.7449,20.5995,69.4005,99.9786
1292,1293,51218,2155,4229,268.117,33.8148,56.1852,99.7599
1293,1294,20999,1319,4156,87.6414,35.6424,54.3576,99.8546
1294,1295,1482,1022,4110,278.228,8.68726,81.3127,99.9779
1295,1296,35800,1612,4208,83.0639,32.9542,57.0458,99.7872
1296,1297,571,1626,4101,80.843,33.1543,56.8457,99.976
1297,1298,1224,3309,4107,270.584,18.3028,71.6972,99.9872
1298,1299,1564,1927,4126,282.156,54.6876,35.3124,99.3507
1299,1300,2640,357,4119,265.315,41.2668,48.7332,99.9887
1300,1301,14614,2685,4180,80.8425,2.91106,87.0889,99.9274
1301,1302,25603,1105,4215,266.966,4.6688800000000015,85.3311,99.8759
1302,1303,6446,1513,4140,80.369,66.5386,23.4614,99.9624
1303,1304,1336,3259,4120,270.74,18.074,71.926,99.9889
1304,1305,2343,3059,4129,67.4709,72.2266,17.7734,99.9718
1305,1306,3069,1764,4145,73.5079,28.4328,61.5672,99.9872
1306,1307,49971,196,4285,267.487,48.7891,41.2109,99.956
1307,1308,10255,3298,4188,84.9629,16.7399,73.2601,99.9827
1308,1309,717,2628,4146,260.254,7.4572600000000016,82.5427,99.9943
1309,1310,12560,2464,4209,97.4232,37.2983,52.7017,99.7209
1310,1311,1254,1892,4163,267.259,46.5174,43.4826,99.9719
1311,1312,2604,1015,4183,274.689,54.7152,35.2848,99.9845
1312,1313,6077,2568,4189,276.478,57.8178,32.1822,99.9883
1313,1314,906,278,4167,264.22700000000003,77.6934,12.3066,99.9919
1314,1315,2503,1821,4172,272.589,42.8716,47.1284,99.996
1315,1316,10300,1418,4218,85.819,60.6935,29.3065,99.5676
1316,1317,8230,372,4240,258.22900000000004,76.18,13.82,99.8071
1317,1318,3196,1973,4205,288.193,54.9654,35.0346,99.9869
1318,1319,16267,1892,4259,73.8656,63.3851,26.6149,99.8657
1319,1320,35367,3164,4310,263.5,47.3193,42.6807,99.9536
1320,1321,6513,1221,4253,270.47,32.2385,57.7615,99.9802
1321,1322,1620,1786,4211,271.83,54.8116,35.1884,99.982
1322,1323,1222,2362,4218,261.214,33.8594,56.1406,99.9801
1323,1324,643,2310,4232,262.464,10.2899,79.7101,99.9939
1324,1325,4397,972,4255,275.725,67.8003,22.1997,99.9198
1325,1326,3341,2601,4258,87.8104,0.5456850000000001,89.4543,99.7783
1326,1327,594,1717,4274,73.1695,30.2297,59.7703,99.9576
1327,1328,2246,1309,4257,267.78700000000003,49.301,40.699,99.9958
1328,1329,1628,1760,4252,270.57,55.2287,34.7713,99.9879
1329,1330,26829,1471,4384,89.1211,30.1798,59.8202,99.6657
1330,1331,63116,2300,4384,88.3792,21.5269,68.4731,99.6106
1331,1332,2065,2526,4268,304.758,71.2898,18.7102,99.9928
1332,1333,7881,2701,4291,107.158,56.0899,33.9101,99.989
1333,1334,8005,478,4316,85.4907,23.8854,66.1146,99.9857
1334,1335,11705,2018,4331,89.426,16.7223,73.2777,99.9751
1335,1336,17540,3297,4387,87.236,13.6896,76.3104,99.9879
1336,1337,6311,1818,4319,268.355,54.7149,35.2851,99.6851
1337,1338,13496,1630,4349,89.3392,35.0432,54.9568,99.95
1338,1339,1018,1009,4288,269.472,17.7774,72.2226,99.9691
1339,1340,2684,1279,4307,95.8758,63.1288,26.8712,99.977
1340,1341,1458,3002,4297,91.8813,12.5106,77.4894,99.9899
1341,1342,3652,567,4304,281.971,69.3651,20.6349,99.9941
1342,1343,10443,1363,4355,78.6362,52.9405,37.0595,99.9541
1343,1344,3756,816,4325,265.632,67.619,22.3809,99.8967
1344,1345,4649,2599,4316,310.369,71.3148,18.6852,99.9501
1345,1346,1047,881,4303,272.911,64.3309,25.6691,99.9927
1346,1347,43610,2872,4448,86.6149,4.0471,85.9529,99.4852
1347,1348,1400,361,4300,102.601,69.9342,20.0658,99.9954
1348,1349,3677,929,4334,277.365,64.3791,25.6209,99.577
1349,1350,2132,761,4332,264.67900000000003,41.4471,48.5529,99.9934
1350,1351,6207,2792,4341,82.7179,60.7077,29.2923,99.992
1351,1352,1374,2086,4346,275.311,45.9149,44.0851,99.993
1352,1353,5540,1212,4343,118.199,86.1852,3.81475,99.9847
1353,1354,7058,385,4369,83.0623,7.23335,82.7666,99.874
1354,1355,1792,587,4332,279.875,69.5988,20.4012,99.9821
1355,1356,6873,997,4355,87.8451,63.6348,26.3652,99.9608
1356,1357,560,1152,4321,87.8392,1.18528,88.8147,99.9336
1357,1358,7064,303,4382,261.997,4.90559,85.0944,99.9823
1358,1359,1538,1723,4347,276.29900000000004,77.4986,12.5014,99.9937
1359,1360,6337,1080,4389,232.49400000000003,84.5373,5.46266,99.9467
1360,1361,1392,1940,4350,275.995,70.1783,19.8217,99.8473
1361,1362,57094,2623,4487,88.1501,58.0021,31.9979,99.625
1362,1363,1910,744,4382,272.344,48.7908,41.2092,99.9936
1363,1364,63960,574,4495,279.231,48.7937,41.2063,99.497
1364,1365,1198,1272,4370,88.1417,70.0205,19.9795,99.9905
1365,1366,722,1151,4371,267.791,11.8077,78.1923,99.9572
1366,1367,44089,1769,4461,260.954,77.7704,12.2296,99.4444
1367,1368,1077,554,4371,275.46,53.3824,36.6176,99.9818
1368,1369,3494,1317,4408,91.3238,25.1938,64.8062,99.9938
1369,1370,2592,2072,4401,274.658,43.9943,46.0057,99.9926
1370,1371,96246,988,4522,91.5221,2.69524,87.3048,99.6571
1371,1372,551,909,4387,85.9583,2.62378,87.3762,99.9853
1372,1373,1606,433,4402,145.856,85.0553,4.94471,99.9886
1373,1374,706,1191,4392,269.931,18.1065,71.8935,99.9908
1374,1375,1010,561,4402,260.704,7.75076,82.2492,99.9834
1375,1376,1254,1923,4407,250.292,74.6756,15.3244,99.8604
1376,1377,1283,452,4416,150.996,84.381,5.61897,99.9881
1377,1378,10240,2991,4469,268.583,51.6445,38.3555,99.9908
1378,1379,1428,1246,4416,88.3758,69.2932,20.7068,99.9617
1379,1380,764,1014,4414,96.3328,2.5088,87.4912,99.9928
1380,1381,5313,1170,4432,92.0261,2.4884,87.5116,99.9729
1381,1382,11300,1999,4457,276.99,52.328,37.672,99.9435
1382,1383,39415,3170,4519,49.083,81.5437,8.45631,99.1653
1383,1384,7449,2484,4470,137.359,75.7144,14.2856,99.9787
1384,1385,1806,111,4460,94.1456,18.2188,71.7812,99.983
1385,1386,1290,1574,4454,97.2143,67.5951,22.4049,99.9865
1386,1387,976,175,4451,81.684,22.6819,67.3181,99.9867
1387,1388,2026,363,4461,259.496,48.8507,41.1493,99.9914
1388,1389,26764,225,4537,280.80400000000003,66.667,23.333,99.1907
1389,1390,1352,1282,4456,89.1481,2.68105,87.319,99.9879
1390,1391,2180,1364,4468,263.48,29.2641,60.7359,99.9129
1391,1392,2250,2304,4469,102.139,63.7065,26.2935,99.9857
1392,1393,9754,2374,4509,267.192,65.9253,24.0747,99.2568
1393,1394,9196,1368,4538,265.099,29.4061,60.5939,99.7539
1394,1395,720,1573,4499,270.581,8.12157,81.8784,99.9757
1395,1396,11605,2224,4552,265.701,1.10136,88.8986,99.9188
1396,1397,1086,2024,4514,276.272,52.9283,37.0717,99.5079
1397,1398,1587,1937,4517,92.5342,42.8872,47.1128,99.3473
1398,1399,1725,1514,4511,106.11,43.1296,46.8704,99.9075
1399,1400,1349,1155,4539,278.29900000000004,73.0426,16.9574,68.7398
1400,1401,4263,104,4573,266.067,34.1349,55.8651,99.9629
1401,1402,823,328,4518,275.17400000000004,1.13015,88.8699,99.9931
1402,1403,22387,2405,4582,82.8253,26.9764,63.0236,99.4006
1403,1404,4542,3008,4553,268.585,32.9307,57.0693,99.8053
1404,1405,2533,1486,4544,95.9737,44.8273,45.1727,99.7342
1405,1406,1832,1660,4551,82.0962,61.7794,28.2206,99.5848
1406,1407,6378,2036,4568,91.03,5.407780000000002,84.5922,99.9376
1407,1408,548,1621,4548,66.9032,68.8754,21.1246,99.9914
1408,1409,560,1444,4557,94.9797,44.6784,45.3216,99.9883
1409,1410,6552,334,4587,81.7714,12.7637,77.2363,99.9585
1410,1411,6327,2742,4592,282.092,50.6017,39.3983,99.9926
1411,1412,4940,1880,4596,79.1055,14.0782,75.9218,99.9754
1412,1413,872,3308,4578,271.98900000000003,37.8373,52.1627,99.9876
1413,1414,865,1739,4568,81.6476,14.2095,75.7905,99.9476
1414,1415,2380,1946,4604,276.111,10.2881,79.7119,99.9719
1415,1416,618,1145,4577,332.621,78.4053,11.5947,99.9922
1416,1417,1230,1607,4589,271.141,14.3396,75.6604,99.9933
1417,1418,2624,1315,4601,89.7223,29.4244,60.5756,99.9287
1418,1419,5453,2073,4613,264.813,1.88206,88.1179,99.9172
1419,1420,2941,1552,4604,71.9989,60.3714,29.6286,99.992
1420,1421,2873,1487,4602,267.16700000000003,42.5822,47.4178,99.9808
1421,1422,2953,1663,4603,78.5452,63.3706,26.6294,99.9372
1422,1423,1144,1755,4588,81.1183,14.1027,75.8973,99.987
1423,1424,1978,507,4601,90.4132,5.68593,84.3141,99.9841
1424,1425,3174,1424,4606,93.7197,54.6929,35.3071,99.7603
1425,1426,2882,1794,4612,264.745,26.4562,63.5438,99.9822
1426,1427,7104,2866,4615,68.8684,64.4289,25.5711,99.9037
1427,1428,3712,3005,4632,280.955,46.9884,43.0116,99.9341
1428,1429,1141,2157,4610,259.672,9.7066,80.2934,99.9538
1429,1430,1639,3075,4618,282.968,46.1952,43.8048,99.969
1430,1431,3726,594,4619,260.73900000000003,14.7782,75.2218,99.955
1431,1432,1212,722,4626,258.613,14.2103,75.7897,99.9245
1432,1433,630,447,4618,91.2482,4.94705,85.0529,99.9632
1433,1434,1280,3154,4623,274.374,50.5569,39.4431,99.9925
1434,1435,2582,3206,4643,268.149,50.0399,39.9601,99.9701
