,Grain No.,Size [Pixel],center x-coordinate,center y-coordinate,mean azimuth [degree],mean latitude [degree],mean colatitude [degree],Regelungsgrad [%]
0,1,659,178,151,2.3338400000000004,79.5628,10.4372,99.548
1,2,1730,124,178,348.495,81.3875,8.6125,99.9623
2,3,1550,582,183,0.7114189999999999,61.6322,28.3678,99.9775
3,4,22074,2172,233,161.511,59.0097,30.9903,99.9008
4,5,1187,626,191,50.6409,85.7078,4.29222,99.9939
5,6,61140,1103,269,182.632,56.0357,33.9643,92.538
6,7,21812,588,296,3.52797,2.85082,87.1492,99.9864
7,8,134085,2841,339,350.788,35.1203,54.8797,99.9059
8,9,51960,2474,296,2.96972,27.7702,62.2298,86.6788
9,10,9512,256,266,173.87900000000005,69.02600000000001,20.974,99.9071
10,11,13746,748,235,172.502,18.8912,71.1088,99.8351
11,12,534,1366,187,4.34145,29.1011,60.8989,99.977
12,13,849,1448,197,3.06828,14.2709,75.7291,99.9986
13,14,79818,1753,284,3.7447,16.7763,73.2237,99.812
14,15,8467,1439,251,189.986,66.9841,23.0159,99.9469
15,16,4575,3399,274,75.9012,77.1553,12.8447,99.9273
16,17,789,2020,234,3.42342,8.00035,81.9996,99.9961
17,18,579,127,250,348.385,81.7021,8.29786,99.9899
18,19,8657,3174,244,183.287,32.3223,57.6777,99.5686
19,20,501,966,231,182.894,51.7213,38.2787,99.9193
20,21,1381,846,251,293.29,85.1479,4.8521,99.9746
21,22,11637,2278,283,183.09,37.518,52.482,99.9462
22,23,55185,1463,381,180.308,52.9604,37.0396,92.3297
23,24,2739,3294,287,81.6476,77.7175,12.2825,99.9861
24,25,13173,473,322,173.872,66.8944,23.1056,99.9882
25,26,1178,1257,284,17.0466,25.8472,64.1528,99.9932
26,27,119963,2161,495,176.102,31.6205,58.3795,97.1831
27,28,21780,801,368,359.825,36.8178,53.1822,99.9404
28,29,3266,112,340,356.056,42.6744,47.3256,99.7549
29,30,757,3267,317,81.45,76.6806,13.3194,99.9902
30,31,525,3357,313,74.8055,75.9281,14.0719,99.8927
31,32,46871,1044,430,162.17600000000004,70.5788,19.4212,98.5251
32,33,64736,296,513,12.0617,85.8132,4.1868,99.956
33,34,99904,3137,515,6.17403,10.1592,79.8408,99.8297
34,35,2181,2247,386,173.4,27.5893,62.4107,99.9948
35,36,6347,419,409,2.55077,8.14471,81.8553,99.9617
36,37,6166,1275,444,9.18742,9.44553,80.5545,99.9565
37,38,5478,548,432,3.42748,4.9434,85.0566,99.9324
38,39,37876,614,554,351.264,70.6634,19.3366,97.3486
39,40,1164,891,431,343.964,50.5893,39.4107,99.9913
40,41,12573,1797,497,342.6,55.0704,34.9296,99.9163
41,42,906,2477,425,175.30700000000004,13.4441,76.5559,99.9201
42,43,1282,2620,457,82.9087,79.7331,10.2669,99.9715
43,44,254080,1291,672,4.90638,28.0241,61.9759,97.0601
44,45,10622,888,502,356.63199999999995,17.7145,72.2855,99.2896
45,46,5244,2461,473,177.83599999999996,27.7709,62.2291,99.8554
46,47,815,3417,461,356.414,21.7601,68.2399,99.8978
47,48,14754,755,542,9.9365,8.050139999999999,81.9499,99.8955
48,49,871,1884,470,175.312,13.6591,76.3409,99.9713
49,50,524,2531,462,184.96400000000003,27.2924,62.7076,99.9923
50,51,705,833,471,358.897,21.3806,68.6194,99.9958
51,52,21092,2894,561,356.732,2.3512,87.6488,99.8818
52,53,566,511,482,3.65424,5.02546,84.9745,99.9677
53,54,3131,2559,495,357.8769999999999,55.8409,34.1591,99.9542
54,55,4463,2665,531,6.62137,17.4276,72.5724,99.9172
55,56,10283,2428,583,351.867,1.30181,88.6982,99.8634
56,57,6872,2564,582,356.815,0.0395737,89.9604,99.6953
57,58,2988,1879,550,179.18900000000005,10.8442,79.1558,99.9733
58,59,1084,1825,557,183.418,9.38099,80.619,99.995
59,60,40807,2713,648,177.778,7.12283,82.8772,100.032
60,61,77600,1987,737,139.753,81.5434,8.45655,94.2662
61,62,8303,1826,638,177.301,26.381,63.619,99.7837
62,63,20661,745,682,1.41385,38.3616,51.6384,99.9207
63,64,1075,2377,628,352.658,1.64102,88.359,99.9888
64,65,12023,2494,695,176.64,1.19987,88.8001,99.9525
65,66,832,3291,638,5.7577,2.57864,87.4214,99.994
66,67,23245,869,724,165.1,23.9607,66.0393,99.9468
67,68,538,3389,647,357.496,37.6557,52.3443,99.7493
68,69,3572,1707,655,5.96016,8.83866,81.1613,99.9198
69,70,4361,430,664,170.919,35.3937,54.6063,99.9751
70,71,2178,3307,677,359.8180000000001,30.225,59.775,99.6271
71,72,11394,3251,731,179.976,3.6504,86.3496,99.9917
72,73,4261,1754,696,5.17013,5.84238,84.1576,99.9927
73,74,86926,532,811,347.954,78.2027,11.7973,99.9295
74,75,18740,306,758,358.148,46.6358,43.3642,99.9693
75,76,6711,229,726,263.269,82.5449,7.4550800000000015,99.9889
76,77,128193,2880,866,0.640315,24.031,65.969,100.011
77,78,751,2954,690,176.835,5.10565,84.8943,99.8745
78,79,18377,1613,770,172.399,56.9999,33.0001,99.9971
79,80,2265,2366,722,352.724,50.2196,39.7804,99.9701
80,81,644,2580,703,180.769,6.33849,83.6615,99.9978
81,82,107964,2381,915,175.513,38.1989,51.8011,97.75
82,83,2850,3127,721,179.97299999999996,4.0713300000000014,85.9287,99.9955
83,84,2915,3054,729,179.81799999999996,3.86282,86.1372,99.9944
84,85,3215,2424,729,178.325,30.1474,59.8526,99.9912
85,86,1491,1711,734,4.43883,13.1952,76.8048,99.9559
86,87,5914,3163,766,177.638,5.7681,84.2319,99.9948
87,88,3661,1315,768,180.855,7.18544,82.8146,99.9978
88,89,2927,1752,758,4.08772,28.8081,61.1919,99.9906
89,90,6040,1193,782,156.961,76.794,13.206,99.992
90,91,10030,2304,786,181.077,55.4461,34.5539,99.9941
91,92,21355,1745,836,358.2680000000001,30.7792,59.2208,99.7642
92,93,6099,3306,869,177.683,47.4285,42.5715,99.7416
93,94,8895,2421,806,170.415,54.0203,35.9797,99.9929
94,95,1193,780,810,173.66,37.7327,52.2673,99.9954
95,96,21621,1277,882,3.26555,21.8566,68.1434,99.9812
96,97,1023,3233,818,178.248,1.81255,88.1874,99.9995
97,98,583,3259,834,178.392,1.61132,88.3887,99.9997
98,99,2693,2089,885,2.78586,36.7587,53.2413,99.8037
99,100,844,3216,855,177.99400000000003,2.1069,87.8931,99.998
100,101,2723,210,883,356.886,12.2266,77.7734,99.9712
101,102,147241,1328,1072,183.788,7.07292,82.9271,82.37299999999998
102,103,1333,766,874,163.525,23.0933,66.9067,99.9704
103,104,3526,2436,878,352.019,49.0954,40.9046,99.9976
104,105,21040,1848,942,185.122,39.1709,50.8291,99.8822
105,106,20656,241,984,214.542,84.3396,5.66043,99.8834
106,107,2311,318,902,4.19635,30.0428,59.9572,99.9957
107,108,4017,1195,928,344.0730000000001,61.5928,28.4072,99.9718
108,109,1293,709,910,7.80364,44.1157,45.8843,99.9966
109,110,700,2046,911,179.649,31.3761,58.6239,99.9904
110,111,1401,660,915,6.67585,33.1066,56.8934,99.983
111,112,5053,772,946,179.886,44.8951,45.1049,99.9817
112,113,2042,875,929,178.96900000000005,44.3327,45.6673,99.9878
113,114,27555,3237,1059,180.896,2.96929,87.0307,99.7324
114,115,54238,542,1067,194.431,56.06800000000001,33.931999999999995,99.9028
115,116,43703,2177,1024,183.337,12.0225,77.9775,99.771
116,117,7980,855,991,183.421,49.9793,40.0207,99.7252
117,118,30047,1016,1029,204.457,72.4497,17.5503,99.7921
118,119,2029,2595,961,0.7167279999999999,12.1478,77.8522,99.9968
119,120,3230,558,988,185.127,46.7386,43.2614,99.8719
120,121,16862,698,1042,270.965,78.7872,11.2128,99.8738
121,122,29444,1913,1075,340.374,67.9191,22.0809,99.8414
122,123,617,1660,991,4.90681,30.186,59.81399999999999,99.9956
123,124,7408,2758,1030,3.0724,63.0529,26.9471,99.6499
124,125,1180,1827,1007,2.64604,36.5443,53.4557,99.9665
125,126,9306,3099,1039,186.132,21.61,68.39,99.112
126,127,18832,408,1137,5.7571900000000005,25.1627,64.8373,99.787
127,128,46003,2860,1097,7.1314199999999985,56.8758,33.1242,99.9372
128,129,558,2592,1023,168.267,53.967,36.033,99.988
129,130,529,89,1040,172.458,24.2272,65.7728,99.9283
130,131,6614,279,1095,5.1726,15.5076,74.4924,99.9505
131,132,2528,1732,1049,342.671,48.0262,41.9738,99.9851
132,133,4418,849,1066,348.474,59.9824,30.0176,99.9362
133,134,16515,2569,1143,182.881,3.52484,86.4752,99.9725
134,135,1062,349,1061,4.82578,15.0682,74.9318,99.996
135,136,28510,1759,1191,177.997,1.2296,88.7704,99.972
136,137,75043,1535,1223,188.164,16.4949,73.5051,99.6601
137,138,784,766,1091,181.99400000000003,71.865,18.135,99.9959
138,139,2550,197,1116,181.135,6.55299,83.447,99.9973
139,140,8761,2254,1144,182.223,14.201,75.79899999999998,99.996
140,141,13190,2075,1144,36.4966,71.1013,18.8987,99.93
141,142,11015,773,1132,258.89,82.3528,7.647239999999999,99.9468
142,143,680,3097,1119,357.80300000000005,1.48507,88.5149,99.9831
143,144,522,2166,1119,182.567,15.5674,74.4326,99.9947
144,145,11616,2634,1187,173.831,37.753,52.247,99.9921
145,146,1650,3138,1146,357.07,3.47224,86.5278,99.9935
146,147,137068,2884,1308,0.62568,29.3532,60.6468,99.9044
147,148,712,2188,1144,182.57,11.0388,78.9612,99.9986
148,149,11485,295,1228,180.835,9.08861,80.9114,99.9805
149,150,4247,2360,1180,174.61700000000005,11.1491,78.8509,99.9941
150,151,51453,1049,1275,4.57855,29.6956,60.3044,85.3757
151,152,9042,3275,1209,8.30508,19.9988,70.0012,99.6925
152,153,238557,1948,1507,356.589,29.1136,60.8864,97.9272
153,154,610,2195,1171,183.048,14.0415,75.9585,99.9995
154,155,7697,3156,1217,170.67700000000005,49.5919,40.4081,99.9275
155,156,1958,726,1194,170.12,30.8927,59.1073,99.9783
156,157,17296,2464,1277,10.5386,54.1537,35.8463,99.7516
157,158,1164,184,1215,180.711,9.21594,80.7841,99.9902
158,159,11645,2303,1264,163.97299999999996,44.5862,45.4138,99.9776
159,160,42776,672,1324,353.589,61.4941,28.5059,99.9834
160,161,1245,2127,1223,2.76099,45.7027,44.2973,99.9394
161,162,881,2187,1213,183.08,17.5404,72.4596,99.9904
162,163,3874,1799,1251,172.13099999999997,24.8698,65.1302,99.9911
163,164,162771,425,1458,169.486,35.1191,54.8809,99.0293
164,165,773,3370,1251,8.012410000000001,31.9262,58.0738,99.8859
165,166,7161,870,1299,4.746,24.7041,65.2959,99.9622
166,167,1069,1762,1279,175.40599999999995,28.6833,61.3167,99.9566
167,168,11124,3325,1319,160.151,34.3674,55.6326,99.5334
168,169,3678,2416,1329,2.16036,56.5213,33.4787,99.9532
169,170,51877,1415,1464,166.91,57.2461,32.7539,99.9076
170,171,2751,966,1330,357.1230000000001,27.1405,62.8595,99.9351
171,172,7554,3216,1365,5.76082,13.1634,76.8366,99.7815
172,173,10419,2843,1409,176.532,52.9934,37.0066,99.9946
173,174,1254,2346,1346,1.45919,55.7507,34.2493,99.798
174,175,5827,2301,1384,171.75099999999995,25.3186,64.6814,99.8937
175,176,4234,868,1361,2.91673,28.657,61.343,99.9952
176,177,46725,826,1484,7.64577,43.4223,46.5777,99.9243
177,178,6815,1708,1394,181.664,24.1296,65.8704,99.9276
178,179,30773,1018,1472,180.033,84.795,5.20496,55.6748
179,180,644,1271,1377,1.49844,20.7583,69.2417,99.9996
180,181,8706,2410,1409,179.855,3.54391,86.4561,99.9862
181,182,6104,1229,1425,1.72813,12.7025,77.2975,99.992
182,183,5522,3318,1425,157.792,49.3688,40.6312,99.8782
183,184,5381,3249,1426,4.365480000000002,29.4191,60.5809,99.9938
184,185,274379,3001,1717,1.43327,23.4966,66.5034,94.7915
185,186,2286,2575,1435,180.02,6.44402,83.556,99.9878
186,187,15741,1586,1504,146.253,67.7029,22.2971,99.4057
187,188,5155,2264,1448,178.465,5.57251,84.4275,99.9921
188,189,98777,2454,1643,180.33900000000003,3.63791,86.3621,100.006
189,190,535,1248,1462,1.47012,13.0008,76.9992,99.9982
190,191,614,564,1454,167.327,30.861,59.139,99.9766
191,192,856,2436,1463,177.36,3.34437,86.6556,99.9974
192,193,1133,522,1462,176.795,33.334,56.666,99.9659
193,194,13290,1085,1540,355.048,33.8441,56.1559,99.9615
194,195,18084,1231,1595,354.702,33.6762,56.3238,99.9596
195,196,1114,332,1506,169.695,22.3272,67.6728,99.7419
196,197,40216,2167,1630,9.70559,9.99755,80.0024,99.9448
197,198,10709,156,1595,8.364519999999999,62.7577,27.2423,99.643
198,199,5758,1155,1611,172.67700000000005,19.1275,70.8725,99.933
199,200,1874,1347,1572,179.438,2.70315,87.2969,99.9789
200,201,52658,322,1731,163.48,52.1812,37.8188,99.823
201,202,17062,1795,1660,358.8280000000001,0.256447,89.7436,99.9894
202,203,24399,993,1677,148.037,51.4543,38.5457,83.9632
203,204,2539,1573,1615,2.26362,31.3427,58.6573,99.9904
204,205,1626,1443,1621,181.69,6.37153,83.6285,99.995
205,206,8386,3317,1655,172.643,28.4045,61.5955,99.4704
206,207,371678,865,2003,157.797,24.0341,65.9659,54.2275
207,208,6219,666,1673,351.316,39.1475,50.8525,99.9905
208,209,56711,1537,1826,0.445426,14.8093,75.1907,95.3769
209,210,891,1592,1651,356.339,29.0736,60.9264,99.9971
210,211,2172,732,1673,174.595,23.7912,66.2088,99.9942
211,212,3826,1655,1696,164.601,83.9379,6.06209,99.9858
212,213,43994,1203,1857,168.58599999999996,27.5296,62.4704,99.7014
213,214,9051,174,1739,345.63199999999995,66.9753,23.0247,99.8482
214,215,2921,3302,1758,357.675,25.0532,64.9468,99.745
215,216,6296,1200,1767,4.00235,0.5620729999999999,89.4379,99.9977
216,217,9720,2741,1796,9.24252,38.7483,51.2517,99.9908
217,218,3735,2645,1781,12.4199,48.6301,41.3699,99.946
218,219,4467,2549,1795,196.386,85.5753,4.42474,99.991
219,220,507,2127,1784,4.61126,1.30928,88.6907,99.9848
220,221,8526,2128,1840,221.276,77.3196,12.6804,99.964
221,222,8908,137,1878,149.749,56.1382,33.8618,99.8299
222,223,3857,1753,1842,178.428,1.6755400000000005,88.3245,99.8889
223,224,71745,3234,1996,170.896,36.3494,53.6506,98.194
224,225,1255,2208,1832,167.22799999999995,7.708639999999999,82.2914,99.9783
225,226,650,2293,1833,183.516,0.00239563,89.9976,99.9995
226,227,618,1698,1832,181.0,0.0,90.0,100.001
227,228,7788,2079,1920,183.261,0.5829770000000001,89.417,99.9867
228,229,95148,2492,1940,0.8141390000000001,29.6321,60.3679,99.9173
229,230,1893,1694,1867,3.73292,0.0182877,89.9817,99.9981
230,231,644,87,1861,152.453,53.9138,36.0862,99.9583
231,232,55387,2758,2022,23.3984,77.7615,12.2385,99.4167
232,233,87269,333,2049,4.70064,60.442,29.558000000000003,99.9473
233,234,687,1617,1864,199.076,80.1565,9.84349,99.9917
234,235,14508,855,1911,353.594,19.1289,70.8711,99.9291
235,236,1344,3392,1907,170.35299999999995,29.814,60.18600000000001,99.6935
236,237,5865,1872,1906,177.831,1.30389,88.6961,99.9703
237,238,5262,1800,1952,193.906,77.2641,12.7359,99.9743
238,239,4672,1723,1923,181.655,1.83853,88.1615,99.9772
239,240,3611,1950,1947,177.80900000000003,4.8697599999999985,85.1302,99.7406
240,241,514,2221,1899,201.154,78.9297,11.0703,99.9861
241,242,1147,1332,1911,15.5519,44.6889,45.3111,99.9936
242,243,10178,2193,1960,182.032,5.08732,84.9127,99.9336
243,244,68780,1579,2112,137.04,53.3129,36.6871,99.8646
244,245,2577,927,1965,2.994,43.8738,46.1262,99.9839
245,246,1301,84,1982,7.90556,69.1824,20.8176,99.9213
246,247,48510,1842,2087,348.997,38.8501,51.1499,99.9726
247,248,5349,2216,2048,173.61,5.47224,84.5278,99.6803
248,249,667,1385,2022,248.537,85.64399999999998,4.35597,99.8003
249,250,8628,2325,2065,77.6214,86.2157,3.78429,99.4245
250,251,864,3090,2034,26.1234,77.595,12.405,99.9808
251,252,21210,2119,2100,181.053,4.0995300000000015,85.9005,99.8812
252,253,4351,1427,2110,135.752,53.9383,36.0617,99.9413
253,254,3184,3066,2081,184.18400000000003,8.2718,81.7282,99.9928
254,255,48548,2430,2196,359.213,48.2077,41.7923,99.2517
255,256,35777,2012,2244,252.682,83.5165,6.4835,97.3533
256,257,4904,3065,2142,183.959,10.4124,79.5876,99.9763
257,258,773,2312,2122,171.574,9.48595,80.5141,99.9952
258,259,1649,2998,2138,345.436,49.622,40.378,99.9753
259,260,3381,2626,2166,358.449,1.67562,88.3244,99.9837
260,261,50338,3188,2294,156.952,28.9779,61.0221,99.9581
261,262,25499,1400,2253,240.152,84.7341,5.26589,99.9125
262,263,21629,2197,2241,168.213,85.6863,4.3137,99.9367
263,264,251309,2662,2484,3.5115,27.6397,62.3603,82.5545
264,265,105095,734,2324,176.06,38.6092,51.3908,99.95
265,266,3496,915,2208,8.584489999999999,21.8651,68.1349,99.9818
266,267,14873,3006,2228,159.747,47.754,42.246,99.9753
267,268,19440,1739,2243,356.5730000000001,14.7884,75.2116,99.5608
268,269,832,125,2218,134.286,52.9507,37.0493,99.8803
269,270,2803,1894,2224,171.601,6.93918,83.0608,99.9966
270,271,14219,390,2252,359.815,9.52599,80.47399999999998,99.8992
271,272,513,3328,2219,351.991,15.6996,74.3004,99.882
272,273,540,164,2244,3.3882,4.09703,85.90299999999998,99.9971
273,274,632,2611,2254,184.894,11.07,78.93,99.9995
274,275,8751,1623,2305,3.03121,30.7809,59.2191,99.9632
275,276,5974,2937,2309,169.209,26.7405,63.2595,99.9654
276,277,1316,1878,2286,342.076,51.3524,38.6476,99.981
277,278,41121,2502,2374,175.877,64.5991,25.4009,83.8715
278,279,1700,3071,2289,357.207,13.9054,76.0946,99.9826
279,280,225888,485,2598,1.9689,2.77296,87.227,98.8346
280,281,936,942,2296,340.784,64.9764,25.0236,99.9883
281,282,29158,3206,2453,355.7,15.328,74.672,99.624
282,283,7938,2269,2334,6.07123,77.0961,12.9039,99.9881
283,284,1752,3018,2317,347.034,46.6012,43.3988,99.9897
284,285,20640,1771,2373,175.97299999999996,5.1914099999999985,84.8086,99.9722
285,286,12067,1209,2375,196.476,81.6606,8.339369999999999,99.9926
286,287,19864,2030,2399,309.086,87.2182,2.78179,99.7676
287,288,15515,968,2417,184.026,37.1055,52.8945,99.9346
288,289,5902,1327,2367,181.965,37.2009,52.7991,99.9864
289,290,1089,1498,2352,359.289,32.8825,57.1175,99.991
290,291,4956,612,2418,139.754,51.5723,38.4277,99.9891
291,292,583,1606,2366,177.009,8.53379,81.4662,99.99
292,293,620,2329,2365,167.408,31.6676,58.3324,99.9707
293,294,3639,1648,2406,179.86900000000003,5.00485,84.9951,99.9987
294,295,871,1550,2373,191.813,79.1001,10.8999,99.6859
295,296,3258,1486,2393,215.433,81.19800000000002,8.802010000000003,99.9556
296,297,17252,1108,2442,3.72573,37.7292,52.2708,99.9924
297,298,12768,1915,2455,344.1140000000001,53.4443,36.5557,99.9521
298,299,4591,2364,2418,353.652,79.2222,10.7778,99.9899
299,300,1772,1400,2408,141.014,56.6402,33.3598,99.9877
300,301,42857,1536,2515,173.262,49.2519,40.7481,64.9381
301,302,13163,1304,2459,6.95033,65.2473,24.7527,99.9333
302,303,5145,3043,2459,357.797,21.031,68.969,99.7965
303,304,33427,1794,2542,163.03,32.1354,57.8646,95.7935
304,305,48710,1051,2593,6.9073600000000015,19.5833,70.4167,95.7375
305,306,26274,3274,2587,166.196,52.2832,37.7168,99.8478
306,307,8085,2046,2527,169.757,30.899,59.101000000000006,99.8369
307,308,6540,1002,2535,170.266,43.2993,46.7007,99.9093
308,309,34611,3088,2660,183.613,57.677,32.323,99.8895
309,310,1072,594,2518,181.991,9.92089,80.0791,99.7572
310,311,4471,137,2557,348.545,75.5411,14.4589,99.8896
311,312,2587,3374,2574,165.96200000000005,53.1515,36.8485,99.9338
312,313,9947,1333,2550,256.019,83.4551,6.5448900000000005,99.8576
313,314,39511,2191,2612,19.3206,67.7177,22.2823,99.9375
314,315,6525,1957,2607,344.43300000000005,52.7585,37.2415,99.7753
315,316,9064,554,2613,137.894,52.4696,37.5304,99.9884
316,317,1228,1070,2562,5.75891,9.80034,80.1997,99.996
317,318,2250,195,2590,8.11484,15.7737,74.2263,99.9832
318,319,249688,1397,2898,359.879,67.0139,22.9861,88.0592
319,320,2468,2817,2607,359.194,30.3162,59.6838,99.9882
320,321,79811,2416,2796,161.207,32.7337,57.2663,99.3277
321,322,2366,1551,2634,353.848,9.5949,80.4051,99.96
322,323,3486,892,2645,3.68604,12.4128,77.5872,99.9782
323,324,7052,179,2637,5.1609,30.284,59.716,99.8121
324,325,656,1311,2621,1.01918,63.8747,26.1252,99.9962
325,326,1397,1599,2634,357.709,11.1177,78.8823,99.9965
326,327,508,265,2630,8.5618,29.1016,60.8984,99.9905
327,328,4570,1193,2659,342.708,64.3113,25.6887,99.9912
328,329,13534,1899,2726,359.4,75.0817,14.9183,99.9422
329,330,17254,1789,2709,142.02700000000004,46.9373,43.0627,99.982
330,331,4069,1662,2672,9.78177,75.2068,14.7932,99.9945
331,332,52493,2111,2827,355.1380000000001,77.0097,12.9903,99.8294
332,333,15738,2009,2728,169.66,28.1424,61.8576,99.9917
333,334,599,1140,2681,4.84049,9.92342,80.0766,99.9928
334,335,7831,197,2697,6.01955,25.8887,64.1113,99.9383
335,336,17625,1653,2749,356.202,5.4775,84.5225,99.9522
336,337,68342,2684,2859,357.287,29.7313,60.2687,99.9529
337,338,2327,1052,2718,4.97884,10.1671,79.8329,99.9922
338,339,543,3384,2717,167.408,51.6568,38.3432,99.8597
339,340,2183,1101,2716,6.77998,13.9676,76.0324,99.983
340,341,3663,2802,2714,349.264,20.9195,69.0805,99.9906
341,342,3784,3238,2718,186.24,10.2164,79.7836,99.9917
342,343,647,859,2706,181.132,5.976,84.024,99.9985
343,344,1061,1008,2744,7.61828,13.8626,76.1374,99.9884
344,345,155557,3029,3012,184.104,55.0909,34.9091,94.7543
345,346,1618,865,2755,181.199,6.45913,83.5409,99.9857
346,347,24072,171,2828,143.879,75.157,14.8431,99.9711
347,348,6190,948,2805,14.656,66.0526,23.9474,99.9757
348,349,734,3282,2767,186.215,10.4075,79.5925,99.9994
349,350,1829,1058,2781,169.328,32.1879,57.8121,99.9966
350,351,6101,3130,2824,186.09,9.18026,80.8197,99.9926
351,352,21661,848,2903,166.398,44.6202,45.3798,99.9607
352,353,820,395,2808,147.773,52.3035,37.6965,99.9411
353,354,8163,1741,2877,354.99300000000005,11.1677,78.8323,99.9434
354,355,6401,1865,2849,355.511,11.2678,78.7322,99.9941
355,356,39380,1897,2953,176.882,20.6027,69.3973,82.2591
356,357,7994,314,2845,6.69464,38.8467,51.1533,99.9422
357,358,624,1009,2829,3.88062,8.06673,81.9333,99.9879
358,359,1751,2267,2828,351.587,76.553,13.447,99.9746
359,360,1223,1016,2850,6.89093,12.9561,77.0439,99.9627
360,361,2392,402,2868,182.30900000000003,2.60717,87.3928,99.9941
361,362,988,2238,2860,158.132,29.1225,60.8775,99.9906
362,363,24066,983,2954,4.10818,14.9181,75.0819,99.2136
363,364,670,1602,2858,181.363,35.3506,54.6494,99.9735
364,365,658,3208,2879,184.617,9.56964,80.4304,99.8436
365,366,11896,345,2927,354.708,53.5155,36.4845,99.9457
366,367,108069,2331,3097,354.861,30.2815,59.7185,76.6239
367,368,12157,181,2960,124.107,87.8152,2.18481,99.9349
368,369,3272,2526,2984,168.222,50.5489,39.4511,99.9934
369,370,10791,1136,3019,183.679,37.7852,52.2148,99.7795
370,371,954,2424,2970,346.033,83.7433,6.25671,99.9867
371,372,54720,377,3073,223.719,87.7646,2.23537,99.678
372,373,3016,3272,2990,174.451,55.0987,34.9013,99.9544
373,374,527,893,3000,178.24599999999995,74.0439,15.9561,99.9479
374,375,37054,749,3121,3.831,38.7292,51.2708,99.9367
375,376,8585,1820,3063,356.34,10.4488,79.5512,99.8502
376,377,10591,624,3032,183.188,4.1786699999999986,85.8213,100.002
377,378,15708,2681,3064,170.352,49.5403,40.4597,99.9879
378,379,5028,3285,3037,182.489,40.6772,49.3228,99.522
379,380,11571,2111,3114,356.946,9.41499,80.585,99.9006
380,381,742,1006,3047,5.5975199999999985,9.79354,80.2065,99.9923
381,382,3599,860,3086,175.97400000000005,75.76,14.24,99.9235
382,383,8856,2813,3112,357.048,47.0591,42.9409,99.9639
383,384,8899,1092,3120,353.1330000000001,43.9482,46.0518,99.9688
384,385,19627,958,3191,139.013,60.4753,29.5247,99.9623
385,386,28112,1650,3153,5.93729,1.20077,88.7992,99.966
386,387,2414,2017,3113,2.98864,4.69168,85.3083,99.9635
387,388,636,1915,3102,356.048,5.78022,84.2198,99.9101
388,389,2042,1183,3114,181.346,37.6887,52.3113,99.8281
389,390,61661,2690,3224,3.78312,6.390619999999998,83.6094,99.9263
390,391,8015,177,3149,180.209,28.8061,61.1939,99.9476
391,392,1480,1024,3143,7.75473,34.454,55.54600000000001,99.9941
392,393,94900,2067,3317,354.644,22.4536,67.5464,96.6191
393,394,1884,889,3138,358.164,6.9935800000000015,83.0064,99.9934
394,395,1687,2712,3149,347.056,71.9291,18.0709,99.9798
395,396,536,823,3155,357.242,7.5424,82.4576,99.956
396,397,1089,847,3159,141.08700000000005,62.8464,27.1536,99.9174
397,398,167952,1338,3367,174.479,34.7911,55.2089,99.8386
398,399,1371,2069,3175,0.692747,9.79489,80.2051,99.9902
399,400,1642,1848,3208,181.29,0.320671,89.6793,99.9881
400,401,11673,586,3212,161.717,38.656,51.344,99.5649
401,402,27136,3132,3223,312.9840000000001,78.887,11.113,99.9674
402,403,7304,274,3198,356.4,3.08148,86.9185,99.9823
403,404,15532,434,3234,180.985,4.6254300000000015,85.3746,99.8024
404,405,711,1047,3180,184.675,56.8797,33.1203,99.9825
405,406,3961,1111,3201,13.068,76.1356,13.8644,99.981
406,407,3597,709,3206,3.47654,28.6889,61.3111,99.9918
407,408,657,2032,3196,4.66648,1.0001799999999998,88.9998,99.9939
408,409,4714,148,3241,358.9,5.7785400000000005,84.2215,99.981
409,410,526,2911,3202,178.347,4.8045300000000015,85.1955,99.9879
410,411,937,1051,3217,182.916,57.9099,32.0901,99.9816
411,412,1348,197,3243,178.735,30.2446,59.7554,99.9763
412,413,26906,275,3324,170.752,19.2811,70.7189,99.7635
413,414,955,3322,3242,308.368,74.5809,15.4191,99.9218
414,415,12640,812,3282,180.203,8.41441,81.5856,99.9787
415,416,6279,1066,3277,181.045,37.5468,52.4532,99.9825
416,417,5476,2307,3296,343.331,75.7883,14.2117,99.9254
417,418,2963,3256,3272,6.00659,7.00747,82.9925,99.9952
418,419,632,95,3267,183.212,56.8874,33.1126,99.9212
419,420,12978,683,3307,180.65,9.58571,80.4143,99.97
420,421,558,2882,3266,1.39598,8.27586,81.7241,99.9973
421,422,34059,3260,3377,2.70756,41.0801,48.9199,99.1616
422,423,4679,3074,3310,176.12099999999995,56.5835,33.4165,99.9855
423,424,9147,529,3340,293.459,78.1301,11.8699,99.9889
424,425,52715,2378,3474,169.956,8.39888,81.6011,79.1669
425,426,816,3273,3305,181.581,59.154,30.846,99.9853
426,427,19144,965,3357,186.438,54.6632,35.3368,99.981
427,428,1257,2724,3309,155.093,80.8104,9.18958,99.9921
428,429,611,100,3305,151.36,42.506,47.494,99.9658
429,430,13730,2967,3410,358.077,45.1677,44.8323,98.6097
430,431,2918,1093,3342,355.844,29.608,60.392,99.9862
431,432,4482,432,3361,353.3830000000001,35.2028,54.7972,99.935
432,433,74768,2600,3491,175.477,31.8738,58.1262,98.6119
433,434,7718,628,3378,4.18098,30.7703,59.2297,99.9923
434,435,10773,131,3401,175.108,34.0863,55.9137,99.7992
435,436,1590,2904,3359,356.292,5.17368,84.8263,99.9524
436,437,2686,2374,3363,345.1740000000001,8.968060000000003,81.0319,99.9457
437,438,46497,813,3464,177.399,25.559,64.441,92.815
438,439,19286,3080,3448,182.475,29.4297,60.5703,99.9598
439,440,89233,1646,3543,4.0114,52.743,37.257,94.2532
440,441,4012,2358,3417,166.463,20.0053,69.9947,99.9561
441,442,2145,404,3413,155.83100000000005,34.7517,55.2483,99.9646
442,443,43622,270,3514,1.653,32.5332,57.4668,99.4765
443,444,4300,1696,3419,333.402,84.57799999999997,5.42204,99.9945
444,445,4114,2850,3449,173.963,52.4138,37.5862,99.9634
445,446,5027,583,3466,270.82,75.2079,14.7921,99.9529
446,447,5327,1012,3461,169.141,40.9876,49.0124,99.9701
447,448,540,651,3439,175.857,37.9834,52.0166,99.9905
448,449,9779,504,3499,178.50400000000005,31.3275,58.6725,99.0329
449,450,733,624,3458,15.0738,41.5339,48.4661,99.9953
450,451,2344,1092,3485,194.782,56.7567,33.2433,99.9875
451,452,5917,1972,3513,168.78400000000005,16.8419,73.1581,99.8899
452,453,3972,2762,3486,170.138,77.5042,12.4958,99.9851
453,454,17208,3205,3540,4.7835800000000015,16.6035,73.3965,99.8986
454,455,8769,2068,3519,258.01,84.1971,5.8028900000000005,99.3166
455,456,1398,3298,3515,357.9369999999999,2.02531,87.9747,99.9889
456,457,2301,1019,3524,191.973,54.2049,35.7951,99.3531
457,458,10051,2861,3539,348.307,38.0701,51.9299,99.9739
458,459,746,2485,3501,175.28599999999997,53.8547,36.1453,99.9884
459,460,46193,3061,3624,186.354,3.79426,86.2057,99.9129
460,461,942,1910,3527,262.91200000000003,82.6291,7.370939999999999,99.4804
461,462,20611,385,3584,154.547,78.2435,11.7565,99.9917
462,463,16479,622,3600,156.608,22.6534,67.3466,99.9238
463,464,1015,1074,3539,356.034,34.2341,55.7659,99.9887
464,465,3529,679,3558,175.763,24.612,65.388,99.9972
465,466,7088,180,3590,180.558,70.9838,19.0162,99.9918
466,467,1121,2609,3553,3.2876199999999995,72.3643,17.6357,99.862
467,468,4281,505,3581,287.584,76.4121,13.5879,99.9952
468,469,6667,2222,3589,188.646,48.0373,41.9627,99.9845
469,470,2642,3337,3581,8.33049,55.6796,34.3204,99.8507
470,471,10591,1029,3607,68.425,87.522,2.47797,99.9151
471,472,41006,939,3703,177.667,27.6102,62.3898,99.3809
472,473,2354,2141,3563,0.972302,59.3407,30.6593,99.9957
473,474,8168,2669,3590,176.548,46.1616,43.8384,99.8487
474,475,1040,1875,3557,1.00002,7.629389999999999e-06,90.0,100.003
475,476,114345,1187,3835,353.351,29.9983,60.0017,99.6896
476,477,3285,1849,3591,10.4834,2.71113,87.2889,99.9811
477,478,31223,1957,3667,2.3414200000000003,63.8891,26.1109,73.918
478,479,2943,107,3607,7.1818,39.2361,50.7639,99.8671
479,480,2411,2115,3605,305.332,82.3691,7.63092,99.9874
480,481,6690,2825,3634,176.273,25.5123,64.4877,99.9558
481,482,3409,937,3633,348.519,34.8379,55.1621,99.8635
482,483,33752,1711,3747,7.1747,3.53566,86.4643,99.9895
483,484,1304,2731,3620,178.956,25.5351,64.4649,99.7536
484,485,598,2689,3622,356.41,25.1996,64.8004,99.9813
485,486,692,2573,3620,357.5080000000001,71.4722,18.5278,99.9841
486,487,9250,494,3691,274.008,84.1544,5.8456,99.8432
487,488,1379,1337,3637,356.8880000000001,35.1411,54.8589,99.9947
488,489,24748,2128,3718,174.638,27.4689,62.5311,99.6662
489,490,3144,3274,3652,173.243,21.0222,68.9778,99.9672
490,491,4653,747,3666,262.219,83.4477,6.55232,99.9635
491,492,670,2896,3645,184.403,28.6957,61.3043,99.9943
492,493,515,1905,3638,2.22525,0.353622,89.6464,99.9672
493,494,16940,2682,3683,179.065,29.2094,60.7906,99.7879
494,495,1759,636,3661,265.10400000000004,83.0732,6.92685,99.9047
495,496,53704,2457,3772,347.046,73.7874,16.2126,99.9247
496,497,898,1695,3660,359.201,74.5744,15.4256,99.9682
497,498,981,158,3669,186.028,10.0188,79.9812,99.9962
498,499,584,888,3667,158.346,25.2823,64.7177,99.9881
499,500,130511,1426,3963,7.41211,4.2351800000000015,85.7648,99.6267
500,501,534,692,3670,243.554,85.9318,4.068230000000002,99.9927
501,502,1040,424,3676,281.619,78.5041,11.4959,99.9624
502,503,1095,3015,3686,177.799,11.7321,78.2679,99.9987
503,504,898,1620,3691,7.40366,1.11224,88.8878,99.9901
504,505,27191,2984,3783,171.321,25.0766,64.9234,99.7624
505,506,22266,3205,3788,346.923,53.1221,36.8779,99.8688
506,507,18160,373,3773,143.998,75.0975,14.9025,99.9772
507,508,15280,683,3775,169.822,14.9917,75.0083,99.9768
508,509,4635,1533,3736,8.4769,73.9405,16.0595,99.9928
509,510,11352,127,3754,182.49,72.6058,17.3942,99.9707
510,511,12073,575,3774,125.514,81.9585,8.04147,99.9599
511,512,1028,1811,3725,5.2675800000000015,4.5442800000000005,85.4557,99.9827
512,513,10929,2727,3758,0.36751,7.293710000000001,82.7063,99.9844
513,514,8382,1976,3764,188.045,50.2962,39.7038,99.93
514,515,5819,2166,3768,345.57199999999995,73.0204,16.9796,99.988
515,516,15363,879,3802,321.835,84.8022,5.19776,99.9523
516,517,3708,3317,3754,171.91099999999997,24.9994,65.0006,99.4108
517,518,2955,2870,3779,179.956,26.5116,63.4884,99.8912
518,519,1848,1808,3771,2.9481,75.2163,14.7837,99.993
519,520,35775,700,3894,171.80700000000004,10.6783,79.3217,99.9874
520,521,20855,2763,3858,169.64700000000005,26.1262,63.8738,99.9712
521,522,1392,1615,3826,7.64873,3.665,86.335,99.9554
522,523,133730,2077,3961,184.85,52.9804,37.0196,99.8764
523,524,2342,1829,3821,8.21032,4.3544800000000015,85.6455,99.9832
524,525,811,145,3828,161.453,79.1421,10.8579,99.9852
525,526,850,190,3828,190.89,79.8425,10.1575,99.9704
526,527,660,1973,3829,346.6090000000001,84.461,5.53897,99.9838
527,528,1424,499,3837,318.969,85.1187,4.88134,99.9968
528,529,33042,2441,3920,183.383,41.111,48.889,93.0959
529,530,5286,1664,3868,6.16551,77.3993,12.6007,99.8749
530,531,4933,3111,3866,357.556,85.5576,4.44241,99.9509
531,532,18132,2890,3914,310.385,87.4795,2.52049,99.9666
532,533,6054,307,3864,139.079,82.4253,7.5747399999999985,99.9976
533,534,1008,1850,3851,358.023,4.88077,85.1192,99.993
534,535,1802,181,3859,347.673,85.3733,4.62671,99.9358
535,536,19187,132,3955,169.507,72.318,17.682000000000006,99.8976
536,537,745,446,3890,4.27697,1.39711,88.6029,99.9917
537,538,1396,3288,3894,184.794,9.63306,80.3669,99.9846
538,539,917,551,3889,180.613,9.15583,80.8442,99.9996
539,540,211786,816,4212,4.7069800000000015,7.79333,82.2067,79.2545
540,541,745,515,3899,175.612,11.1291,78.8709,99.9873
541,542,51414,331,4016,174.248,11.5885,78.4115,99.7309
542,543,505,3262,3907,183.821,11.6169,78.3831,99.9709
543,544,1369,1615,3913,4.16524,3.20171,86.7983,99.9426
544,545,93610,3095,4062,177.233,43.6386,46.3614,99.6355
545,546,4895,3155,3929,3.03939,8.14766,81.8523,99.8959
546,547,9309,1724,3944,175.12900000000005,66.5331,23.4669,99.8432
547,548,5856,2615,3976,174.648,9.004489999999997,80.9955,99.9845
548,549,4733,478,3974,5.62357,3.18067,86.8193,99.9671
549,550,1603,537,3956,5.87849,2.23196,87.76799999999999,99.9885
550,551,6997,2751,3976,173.67700000000005,10.7398,79.2602,99.9404
551,552,2107,2677,3989,5.74009,2.65256,87.3474,99.9769
552,553,7364,2481,4047,338.655,83.7773,6.22271,98.6821
553,554,19897,1595,4083,160.076,21.7756,68.2244,99.9553
554,555,14826,2795,4070,355.168,8.86081,81.1392,99.8106
555,556,16934,1956,4091,170.706,67.8776,22.1224,99.8611
556,557,1895,2576,4036,4.4482,1.06744,88.9326,99.9458
557,558,3403,2682,4047,14.8201,48.4099,41.5901,99.8987
558,559,5153,1015,4070,6.772660000000001,32.8538,57.1462,99.9918
559,560,1190,206,4057,173.449,16.6833,73.3167,99.9838
560,561,338109,1884,4374,1.26073,51.4148,38.5852,98.4471
561,562,13195,1167,4121,163.697,60.894,29.106,99.9556
562,563,596,2696,4087,356.412,9.72682,80.2732,99.9977
563,564,86947,178,4298,161.207,43.6287,46.3713,99.7809
564,565,1256,1737,4102,177.748,68.7155,21.2845,99.9965
565,566,1164,2621,4110,184.905,2.28873,87.7113,99.9937
566,567,639,2656,4113,184.505,2.24581,87.7542,99.9967
567,568,1014,2579,4123,186.503,1.92165,88.0783,99.9827
568,569,11652,1784,4151,158.204,47.0283,42.9717,99.8984
569,570,2944,1663,4150,184.856,53.1878,36.8122,99.9794
570,571,48327,3187,4238,329.09,83.4371,6.56289,99.9556
571,572,88341,504,4319,6.2041,57.9881,32.0119,99.1609
572,573,2926,3362,4179,356.1,52.0881,37.9119,99.5612
573,574,1735,3330,4161,359.347,58.2645,31.7355,99.9113
574,575,48033,2584,4253,221.697,79.2738,10.7262,99.8869
575,576,8084,2747,4190,351.83,76.6052,13.3948,99.8289
576,577,4472,1148,4182,6.0188,73.2147,16.7853,99.9883
577,578,868,2826,4176,185.572,2.67901,87.321,99.9856
578,579,568,2858,4166,354.696,76.6631,13.3369,99.9636
579,580,5401,353,4200,69.9464,81.4291,8.570889999999999,99.9843
580,581,45053,1101,4302,157.445,65.0203,24.9797,99.6918
581,582,163067,2551,4466,10.8058,46.5859,43.4141,98.5259
582,583,7280,1526,4240,182.61,74.1616,15.8384,99.9817
583,584,1837,2906,4213,356.165,78.3231,11.6769,99.9591
584,585,3037,1639,4231,171.65599999999995,65.0724,24.9276,99.9931
585,586,2514,2845,4228,8.75601,1.7534599999999998,88.2465,99.9609
586,587,1091,1294,4243,163.216,66.35600000000001,23.644,99.9931
587,588,9227,2915,4301,356.87,79.0744,10.9256,99.6018
588,589,661,2993,4260,4.39005,7.836419999999999,82.1636,99.9976
589,590,589,28,4277,160.491,44.1322,45.8678,99.9602
590,591,7561,2796,4313,177.39,0.5292279999999999,89.4708,99.9604
591,592,1249,2239,4284,187.343,50.775,39.225,99.9765
592,593,3418,3028,4315,5.73804,6.08268,83.9173,99.9578
593,594,1731,2250,4319,219.124,79.8772,10.1228,99.9861
594,595,1274,2155,4329,158.2,44.9396,45.0604,99.9903
595,596,1612,3190,4336,352.266,73.392,16.608,99.9948
596,597,2153,2201,4348,164.99200000000005,48.7061,41.2939,99.9253
597,598,40806,3261,4509,182.479,43.1122,46.8878,98.7114
598,599,824,1266,4349,166.55,58.2578,31.7422,99.9439
599,600,3416,2267,4365,183.386,49.467,40.533,99.9623
600,601,10390,2976,4384,171.037,52.5975,37.4025,99.9254
601,602,2089,3135,4359,158.71,70.9344,19.0656,99.9289
602,603,7868,1709,4408,351.292,57.1681,32.8319,99.9746
603,604,9447,1185,4414,195.707,12.3592,77.6408,99.9865
604,605,4551,3108,4455,5.43132,10.7973,79.2027,99.9407
605,606,885,1082,4433,164.301,57.9084,32.0916,99.8724
606,607,8986,2892,4449,358.735,4.86816,85.1318,99.8828
607,608,4937,3202,4424,189.33,52.8659,37.1341,99.941
608,609,14845,1844,4453,3.46127,5.85852,84.1415,99.9422
609,610,1864,2267,4439,181.978,48.5794,41.4206,99.9797
610,611,93935,1285,4548,6.64392,10.2648,79.7352,89.3504
611,612,969,30,4463,159.238,45.6992,44.3008,99.9646
612,613,9839,1655,4524,182.915,57.536,32.464,99.9783
613,614,4760,298,4475,358.38199999999995,3.3101,86.6899,99.7528
614,615,41432,636,4574,6.9481199999999985,55.9203,34.0797,99.9636
615,616,11620,432,4491,359.194,27.4698,62.5302,99.7419
616,617,41237,3009,4584,347.74,54.5775,35.4225,99.9318
617,618,2892,509,4525,167.91099999999997,54.3249,35.6751,99.9382
618,619,7851,77,4554,352.142,73.9413,16.0587,99.954
619,620,4157,190,4535,337.19,50.5435,39.4565,99.9254
620,621,26946,328,4605,357.2340000000001,52.2671,37.7329,99.6024
621,622,608,3139,4526,0.985744,8.60023,81.3998,99.9974
622,623,13601,2287,4597,186.188,57.4156,32.5844,99.9017
623,624,6366,167,4594,346.941,65.0219,24.9781,99.9469
624,625,790,445,4578,2.71926,9.81167,80.1883,99.9965
625,626,566,1299,4570,4.4273099999999985,26.3272,63.6728,99.929
626,627,20225,1154,4631,184.245,19.7268,70.2732,99.9102
627,628,12011,2143,4641,349.365,59.1128,30.8872,99.8158
628,629,9474,2698,4647,185.656,51.4105,38.5895,99.9264
629,630,507,81,4618,346.476,65.0949,24.9051,99.9243
630,631,5014,850,4639,185.159,21.6063,68.3937,99.9589
631,632,5193,2805,4650,179.15900000000005,50.4154,39.5846,99.9291
632,633,7524,515,4662,175.737,40.2347,49.7653,99.5207
633,634,10712,2361,4661,350.357,9.13999,80.86,99.5975
634,635,984,931,4658,186.279,14.1327,75.8673,99.6886
635,636,2979,2872,4672,182.644,53.0689,36.9311,99.7755
636,637,2921,123,4663,19.7013,68.4151,21.5849,99.5958
637,638,716,3138,4656,1.98446,8.84763,81.1524,99.9939
638,639,4179,3203,4677,196.55900000000003,42.6867,47.3133,99.8642
639,640,1609,1775,4678,158.77200000000005,44.5616,45.4384,99.8779
640,641,1532,44,4674,67.0094,58.4515,31.5485,98.6408
641,642,2237,204,4680,336.295,69.7732,20.2268,99.5795
642,643,1768,2624,4680,191.194,58.5662,31.4338,99.9406
643,644,2305,3105,4681,198.014,49.2361,40.7639,99.8145
644,645,983,691,4683,186.194,8.5518,81.4482,99.9858
645,646,575,2768,4692,190.227,56.6175,33.3825,99.9025
646,647,977,2049,4700,187.166,58.1555,31.8445,99.7126
