,Grain No.,Size [Pixel],center x-coordinate,center y-coordinate,mean azimuth [degree],mean latitude [degree],mean colatitude [degree],Regelungsgrad [%]
0,1,1118,911,246,196.537,67.8029,22.1971,99.2521
1,2,931,310,252,196.303,15.6962,74.3038,99.9359
2,3,34779,1474,361,343.0730000000001,75.7303,14.2697,91.5915
3,4,7691,1175,275,10.734000000000002,51.9766,38.0234,99.6188
4,5,5777,1746,269,240.131,83.3738,6.6262,99.959
5,6,3966,1849,270,169.46599999999995,61.1498,28.8502,96.7752
6,7,14488,1319,301,353.545,70.8898,19.1102,99.9186
7,8,671,700,255,188.091,8.52375,81.4762,99.4973
8,9,23905,934,356,12.5604,52.6662,37.3338,99.8993
9,10,1135,1595,273,5.4373,23.0773,66.9227,99.9557
10,11,940,1637,267,2.86043,13.4062,76.5938,99.9981
11,12,4737,817,288,194.345,51.5105,38.4895,99.7205
12,13,6921,1046,313,198.025,42.3375,47.6625,99.9391
13,14,948,581,290,3.2566900000000003,0.658836,89.3412,99.9931
14,15,2177,1823,304,230.238,86.9521,3.04787,99.9163
15,16,2024,1675,313,2.84742,13.2188,76.7812,99.9929
16,17,22499,755,397,15.078,52.9061,37.0939,99.9442
17,18,827,1111,319,5.99148,64.2998,25.7002,99.9942
18,19,16890,1604,402,195.676,31.44,58.56,99.9091
19,20,5145,1159,343,191.758,9.84829,80.1517,99.8773
20,21,506,1774,329,9.61039,18.2759,71.7241,99.9698
21,22,562,299,337,195.023,13.3777,76.6223,99.8709
22,23,3753,457,364,3.04454,71.6723,18.3277,97.505
23,24,5048,559,388,2.98028,1.53041,88.4696,99.9834
24,25,13471,1304,409,189.112,56.8994,33.1006,99.8795
25,26,7906,287,467,194.88,22.3587,67.6413,98.5248
26,27,614,1097,374,187.02,55.9179,34.0821,99.9869
27,28,1180,1775,382,187.414,1.09884,88.9012,99.9391
28,29,7826,1050,424,193.786,56.3553,33.6447,99.9707
29,30,8891,1713,428,180.035,26.9813,63.0187,99.8681
30,31,2504,645,396,13.2415,7.388689999999999,82.6113,99.5452
31,32,1187,1192,389,26.9137,43.5661,46.4339,99.9963
32,33,1561,1823,397,343.158,58.865,31.135,99.7507
33,34,2729,855,423,197.056,45.9811,44.0189,99.9292
34,35,11847,1151,463,189.859,18.3844,71.6156,99.9702
35,36,1077,454,417,359.927,52.6526,37.3474,99.4501
36,37,6154,1252,460,4.88821,68.2226,21.7774,99.9376
37,38,2994,526,443,7.9622600000000014,24.1267,65.8733,99.8347
38,39,661,1791,453,192.44,8.04642,81.9536,99.9254
39,40,1030,417,452,336.056,77.2968,12.7032,99.8045
40,41,19520,635,501,186.394,32.5639,57.4361,99.9379
41,42,756,1864,457,3.66009,7.75693,82.2431,99.845
42,43,3467,353,485,11.2608,34.4709,55.5291,98.0814
43,44,20796,1765,571,354.797,47.8365,42.1635,98.0948
44,45,21219,984,523,7.80775,25.9588,64.0412,99.538
45,46,3425,977,475,8.31395,38.0731,51.9269,99.8836
46,47,2383,478,484,209.207,77.6179,12.3821,99.3305
47,48,5475,1392,507,340.426,62.6481,27.3519,99.9627
48,49,1799,1685,484,6.07016,34.1476,55.8524,99.907
49,50,958,808,486,2.97308,40.0016,49.9984,99.9279
50,51,1151,743,495,351.211,37.5469,52.4531,99.981
51,52,9641,1628,524,4.48958,13.3764,76.6236,99.8941
52,53,3219,1473,525,192.091,27.0956,62.9044,98.6796
53,54,964,397,519,191.661,74.4102,15.5898,99.9011
54,55,10665,1298,556,190.263,3.99969,86.0003,99.8705
55,56,8379,770,556,190.853,78.8647,11.1353,99.9817
56,57,44174,569,625,8.531360000000001,13.1065,76.8935,85.73100000000002
57,58,1428,1202,551,184.656,53.6663,36.3337,99.2789
58,59,2429,430,550,10.0535,19.1009,70.8991,99.9251
59,60,2109,324,555,1.96058,68.7239,21.2761,99.9789
60,61,11278,874,597,188.924,28.7154,61.2846,99.977
61,62,1690,1556,569,187.828,11.8801,78.1199,99.9869
62,63,9321,1010,615,219.764,77.891,12.109000000000002,69.8541
63,64,804,1492,569,192.728,58.9689,31.0311,99.9391
64,65,25894,1476,661,358.361,46.0734,43.9266,99.8336
65,66,810,350,583,11.9265,16.6679,73.3321,99.9685
66,67,17338,1633,670,221.561,74.0365,15.9635,99.9797
67,68,42620,1284,688,199.293,61.0611,28.9389,99.8677
68,69,2691,292,626,192.204,17.4167,72.5833,99.9842
69,70,2696,347,631,353.644,69.0748,20.9252,99.9854
70,71,757,258,628,193.715,19.6484,70.3516,99.8978
71,72,9031,793,705,2.32649,21.363000000000003,68.637,99.9661
72,73,9938,911,685,188.803,76.4229,13.5771,99.8647
73,74,684,766,658,2.06675,13.3098,76.6902,99.9973
74,75,1449,1083,646,352.49300000000005,65.9865,24.0135,99.9747
75,76,840,454,658,173.076,63.8266,26.1734,99.9915
76,77,830,255,688,9.22663,7.4408699999999985,82.5591,99.9648
77,78,10161,304,730,4.00208,34.4272,55.5728,99.9098
78,79,12866,1055,718,9.38064,8.92532,81.0747,99.9479
79,80,9788,514,719,7.283239999999998,16.3059,73.6941,99.8077
80,81,4488,379,716,192.587,8.05923,81.9408,99.9977
81,82,14476,1701,767,194.614,32.9715,57.0285,99.1664
82,83,10636,629,770,5.59806,41.1401,48.8599,99.8221
83,84,33250,442,850,7.605180000000002,4.4520300000000015,85.54799999999999,93.5755
84,85,2352,1208,737,356.88699999999994,66.1323,23.8677,99.9983
85,86,23500,1181,802,63.9608,80.5356,9.46438,99.9251
86,87,19961,954,801,60.0299,83.0291,6.970910000000001,98.1744
87,88,307884,1150,1131,191.173,6.696160000000001,83.3038,82.8881
88,89,20981,816,831,187.471,10.1941,79.8059,99.9626
89,90,3823,330,806,193.666,30.8653,59.1347,99.9115
90,91,2871,405,808,166.025,64.8439,25.1561,99.9423
91,92,2814,1324,826,191.457,22.4018,67.5982,99.9943
92,93,4952,1687,855,187.478,59.7749,30.2251,99.957
93,94,58392,699,981,191.31,30.6837,59.3163,98.4964
94,95,571,1076,834,21.5353,40.4871,49.5129,99.9908
95,96,4318,1311,868,10.7594,24.6582,65.3418,99.8879
96,97,542,1773,859,17.2865,49.5989,40.4011,99.878
97,98,569,1746,864,19.3444,51.916,38.084,99.9383
98,99,853,995,897,63.7281,85.6161,4.38392,99.9953
99,100,2519,1655,903,194.752,12.5526,77.4474,99.9569
100,101,2421,1765,913,199.257,45.5089,44.4911,99.5877
101,102,19709,858,952,176.018,72.9866,17.0134,99.9807
102,103,1494,1040,915,202.959,68.4716,21.5284,99.9931
103,104,1436,417,928,8.42975,8.80203,81.19800000000002,99.9903
104,105,73824,436,1072,5.56941,62.2374,27.7626,46.2405
105,106,4022,1068,953,24.2003,45.3488,44.6512,99.9812
106,107,5801,1629,953,205.549,75.1688,14.8312,99.9706
107,108,755,1003,951,4.40492,4.13055,85.8694,99.9694
108,109,3478,1702,993,195.737,11.9054,78.0946,99.9567
109,110,943,1763,974,196.188,12.7704,77.2296,99.971
110,111,1449,1772,1033,7.24965,7.6474,82.3526,99.8372
111,112,9376,1624,1088,17.8534,45.7535,44.2465,99.9931
112,113,577,1714,1052,229.574,79.2571,10.7429,99.9122
113,114,687,1738,1051,235.901,79.7831,10.2169,99.9803
114,115,571,1802,1073,356.6740000000001,27.6291,62.3709,99.5128
115,116,2765,885,1091,356.1380000000001,46.9405,43.0595,99.9922
116,117,10163,1689,1135,195.331,46.6299,43.3701,99.7713
117,118,2395,1775,1133,192.736,44.4424,45.5576,99.6245
118,119,13216,339,1167,4.29322,5.40992,84.5901,99.9751
119,120,28642,653,1183,356.839,49.6958,40.3042,99.9908
120,121,16736,1182,1174,22.5232,47.8186,42.1814,99.9412
121,122,510,1804,1127,334.125,41.4529,48.5471,99.6647
122,123,2321,1311,1181,187.631,49.1486,40.8514,99.9983
123,124,17767,1458,1263,14.5285,14.1409,75.8591,77.5587
124,125,19146,1682,1257,16.0392,15.33,74.67,99.9051
125,126,1165,1770,1214,14.8369,14.7286,75.2714,99.975
126,127,5487,1564,1231,8.290289999999999,17.7364,72.2636,99.9472
127,128,11169,1296,1258,5.54065,12.5508,77.4492,99.994
128,129,1893,367,1256,186.896,41.7939,48.2061,99.9885
129,130,22657,590,1312,204.052,57.2409,32.7591,98.8168
130,131,16856,1363,1336,0.284447,42.5732,47.4268,99.941
131,132,5404,1780,1339,199.23,49.0131,40.9869,99.2707
132,133,1630,1193,1265,6.46431,6.7122199999999985,83.2878,99.9888
133,134,2176,331,1284,187.526,36.1912,53.8088,99.9919
134,135,4343,1737,1349,205.828,55.5467,34.4533,99.8047
135,136,21908,1137,1374,187.73,1.98215,88.0178,99.8711
136,137,17349,446,1364,12.876,20.7891,69.2109,99.7087
137,138,1708,1572,1284,3.53384,42.5882,47.4118,99.9958
138,139,5141,1597,1323,198.041,50.1441,39.8559,99.991
139,140,13648,359,1428,1.03642,21.669,68.331,99.8965
140,141,1891,1250,1342,5.99912,8.26193,81.7381,99.9589
141,142,2716,1543,1372,324.325,80.5303,9.46969,99.977
142,143,763,1264,1372,190.406,2.4315,87.5685,99.9713
143,144,17100,643,1420,194.985,44.885,45.115,99.9906
144,145,1718,1450,1390,347.331,57.5492,32.4508,99.983
145,146,160192,1567,1641,194.844,3.99548,86.0045,95.3499
146,147,21614,1249,1460,277.704,79.3282,10.6718,99.9419
147,148,1221,1356,1424,187.68,5.2007,84.7993,99.9355
148,149,10018,1414,1466,9.35064,52.5131,37.4869,99.9946
149,150,536,269,1448,2.36301,20.3005,69.6995,99.5993
150,151,25069,470,1533,187.531,28.537,61.463,99.7368
151,152,12003,877,1526,196.429,43.4942,46.5058,99.9701
152,153,4824,816,1527,3.02065,61.5359,28.4641,99.9886
153,154,23356,1243,1592,191.61,6.3261,83.6739,99.9208
154,155,4615,1121,1531,299.138,79.9262,10.0738,99.8241
155,156,3683,591,1547,343.98,85.5569,4.44312,99.8907
156,157,64720,999,1682,1.00893,59.3303,30.6697,99.8823
157,158,22227,345,1625,12.7917,21.7011,68.2989,99.9537
158,159,11992,1379,1593,4.85455,3.72001,86.28,99.9649
159,160,5371,537,1611,7.537439999999999,1.41412,88.5859,99.993
160,161,2510,671,1617,3.78477,10.0448,79.9552,99.9991
161,162,1639,585,1635,195.887,3.5898800000000004,86.4101,99.844
162,163,861,1778,1648,338.182,54.2589,35.7411,99.8756
163,164,1202,750,1658,251.404,82.1089,7.89111,99.2304
164,165,19890,1165,1707,192.238,41.0715,48.9285,99.9867
165,166,2746,812,1665,310.747,83.0423,6.95769,99.8773
166,167,56676,438,1934,187.534,15.806,74.194,86.265
167,168,2269,629,1671,326.68,85.8967,4.103269999999998,99.9798
168,169,1368,1708,1681,192.435,2.3493,87.6507,99.9657
169,170,1180,1754,1681,192.861,2.83208,87.1679,99.9399
170,171,7644,714,1700,190.242,37.1572,52.8428,99.8053
171,172,18221,897,1804,189.477,39.4513,50.5487,99.7858
172,173,9688,1278,1750,8.69011,65.1135,24.8865,99.7905
173,174,7077,593,1738,12.9621,32.2438,57.7562,99.9904
174,175,1734,252,1724,226.842,72.2909,17.7091,99.8953
175,176,4832,393,1740,191.495,28.4912,61.5088,99.9937
176,177,15706,797,1826,328.05800000000005,78.5723,11.4278,99.9181
177,178,13668,682,1792,196.412,23.3302,66.6698,99.9969
178,179,2847,336,1775,199.137,3.2838199999999995,86.7162,99.7467
179,180,8226,1788,1841,190.704,46.8693,43.1307,99.0678
180,181,11948,1713,1860,197.872,51.9883,38.0117,99.6101
181,182,605,270,1761,202.392,3.41618,86.5838,99.8123
182,183,781,267,1811,18.3851,3.51957,86.4804,99.8757
183,184,6050,1174,1826,195.145,56.9368,33.0632,99.9658
184,185,2418,1287,1813,187.946,28.7326,61.2674,99.8752
185,186,2732,336,1860,15.1851,4.73002,85.27,99.987
186,187,1261,554,1821,7.63507,17.483,72.517,99.9946
187,188,1798,1107,1836,11.5517,39.9534,50.0466,99.9898
188,189,2262,382,1845,11.6727,4.75977,85.2402,99.9846
189,190,19064,1424,1929,7.51225,41.6031,48.3969,99.5901
190,191,1940,1236,1856,7.22537,9.20633,80.7937,99.9976
191,192,7100,593,1869,213.232,71.3359,18.6641,99.9427
192,193,2987,1055,1889,345.477,69.6106,20.3894,99.8547
193,194,27894,797,1967,14.5907,38.9796,51.0204,99.7772
194,195,2552,1284,1907,188.056,29.8022,60.1978,99.8237
195,196,16329,1121,1939,352.1280000000001,54.7959,35.2041,99.9326
196,197,3352,1231,1919,0.596689,60.9755,29.0245,99.8876
197,198,2651,1633,1925,358.181,53.5522,36.4478,99.9955
198,199,6453,580,1927,8.69251,26.1614,63.8386,99.9956
199,200,47186,1671,2178,199.057,34.6625,55.3375,99.0664
200,201,831,1548,1938,3.59071,55.7195,34.2805,99.9464
201,202,4587,908,1959,183.196,1.80331,88.1967,99.9931
202,203,14308,980,2021,187.572,4.99712,85.0029,99.846
203,204,2267,262,1967,6.47156,2.87651,87.1235,99.718
204,205,36986,607,2035,11.8332,13.3591,76.6409,99.9555
205,206,612,1582,1944,192.284,53.8378,36.1622,99.9316
206,207,4383,1508,1983,358.6869999999999,70.8449,19.1551,99.9669
207,208,2595,1783,1985,174.16400000000004,77.4392,12.5608,99.7169
208,209,41852,1506,2094,185.237,41.5479,48.4521,99.7875
209,210,41213,1227,2041,188.93,53.2021,36.7979,89.8879
210,211,3894,1754,2047,182.016,39.5873,50.4127,99.3363
211,212,42972,588,2201,11.863,20.48,69.52,98.9495
212,213,5624,831,2099,202.416,50.3474,39.6526,99.9648
213,214,2703,1641,2098,2.4862900000000003,49.5872,40.4128,99.9694
214,215,1682,1770,2110,193.304,83.0148,6.98515,99.984
215,216,1241,270,2139,2.7953,29.0554,60.9446,99.8929
216,217,12458,1029,2147,199.838,75.0634,14.9366,99.979
217,218,1573,308,2138,3.69522,33.4899,56.5101,99.9367
218,219,1629,927,2116,192.161,6.8553,83.1447,99.9943
219,220,26197,1247,2169,329.918,73.4853,16.5147,99.9626
220,221,4391,345,2208,1.34159,33.4668,56.5332,99.559
221,222,1529,1760,2146,192.211,46.822,43.178,99.89
222,223,10818,389,2189,185.58,71.4504,18.5496,99.9856
223,224,6947,841,2161,194.406,75.979,14.021,99.9961
224,225,1045,922,2156,185.926,3.21815,86.7819,99.9564
225,226,16057,794,2266,192.878,10.3724,79.6276,99.83
226,227,1619,458,2178,358.084,33.5684,56.4316,99.8707
227,228,642,1750,2183,9.10716,54.8764,35.1236,99.9615
228,229,4643,710,2221,186.0,2.21254,87.7875,99.9841
229,230,2807,897,2202,184.705,1.91892,88.0811,99.9688
230,231,18835,1384,2247,189.731,4.7533400000000015,85.2467,99.7533
231,232,2083,1078,2208,186.676,2.26375,87.7363,99.9972
232,233,11826,932,2266,190.554,77.9453,12.0547,98.8042
233,234,4635,1019,2244,185.968,4.35569,85.6443,99.9969
234,235,1280,1148,2213,192.873,71.9458,18.0542,99.9843
235,236,4764,1540,2248,307.851,85.5,4.49998,99.8594
236,237,1896,1180,2249,189.696,4.69162,85.3084,99.9962
237,238,2063,252,2291,200.421,70.3292,19.6708,99.6494
238,239,1048,1092,2251,3.60838,13.3035,76.6965,99.9986
239,240,2222,623,2263,11.5496,9.81709,80.1829,99.9982
240,241,534,647,2254,9.34827,5.5404300000000015,84.4596,99.9356
241,242,827,1128,2248,4.21148,13.1733,76.8267,99.9984
242,243,1266,1776,2275,196.527,25.1275,64.8725,99.9571
243,244,13044,1197,2317,355.129,60.1045,29.8955,99.9808
244,245,6593,722,2290,187.573,0.151314,89.8487,99.9959
245,246,3792,1087,2302,335.4,75.7141,14.2859,99.9637
246,247,13362,1426,2334,197.991,7.68935,82.3107,65.5547
247,248,4106,662,2325,197.277,8.67497,81.325,99.9871
248,249,19616,407,2379,10.4968,34.82,55.18,93.2661
249,250,759,1290,2309,186.422,80.5984,9.40157,99.9974
250,251,3627,864,2326,345.162,71.9657,18.0343,99.9816
251,252,9661,1028,2352,0.171469,58.4,31.6,99.9744
252,253,2277,1626,2330,353.505,71.8989,18.1011,99.9498
253,254,12685,542,2365,196.265,10.6169,79.3831,99.9685
254,255,3466,255,2357,210.664,59.4484,30.5516,99.2528
255,256,35715,1310,2469,196.601,25.8666,64.1334,99.4426
256,257,502,919,2335,357.494,66.7515,23.2485,99.984
257,258,10527,1564,2391,189.679,9.73806,80.2619,99.9807
258,259,90868,491,2568,355.365,56.4437,33.5563,98.6505
259,260,1033,943,2358,6.719310000000001,58.3462,31.6538,99.9834
260,261,20663,1086,2436,191.727,9.4911,80.5089,99.9777
261,262,3884,1667,2373,186.778,1.29969,88.7003,99.9845
262,263,584,723,2358,333.495,71.4945,18.5055,99.9936
263,264,74163,878,2486,189.887,34.3766,55.6234,98.8282
264,265,6027,1783,2426,190.29,76.4206,13.5794,99.8541
265,266,2391,1331,2394,337.305,83.1384,6.8616100000000015,99.9886
266,267,1031,1375,2380,193.304,6.09276,83.9072,99.9973
267,268,684,315,2389,12.228,44.2735,45.7265,99.9456
268,269,10568,1704,2445,7.91264,14.2075,75.7925,99.9831
269,270,764,273,2405,187.379,7.95288,82.0471,99.9689
270,271,29509,1506,2515,331.4430000000001,80.0954,9.90461,99.5479
271,272,2118,522,2453,201.703,28.7292,61.2708,99.9247
272,273,6587,1659,2506,188.336,16.9191,73.0809,99.4949
273,274,2147,1186,2501,292.967,83.1489,6.851089999999999,99.8358
274,275,8309,793,2550,7.65543,64.8739,25.1261,99.9901
275,276,9343,1634,2578,188.653,17.8033,72.1967,99.9874
276,277,1248,1731,2572,189.326,21.4473,68.5527,99.9541
277,278,14374,1300,2602,354.639,51.7637,38.2363,99.9928
278,279,133227,980,2745,191.521,49.7003,40.2997,87.0781
279,280,3172,1202,2592,318.265,81.2074,8.79256,99.9835
280,281,5380,1744,2638,3.59941,75.3489,14.6511,99.8974
281,282,817,1430,2578,328.157,75.2873,14.7127,99.9715
282,283,1407,1466,2598,192.721,16.2017,73.7983,81.0117
283,284,19707,1417,2683,3.14265,75.312,14.688,99.9772
284,285,2858,254,2639,5.8593199999999985,47.6855,42.3145,97.5769
285,286,5122,364,2694,3.4587800000000004,23.8665,66.1335,99.9767
286,287,7852,1278,2693,302.921,85.8471,4.15294,99.9913
287,288,28552,1698,2747,199.517,35.9635,54.0365,99.5988
288,289,1958,1108,2675,191.794,29.2505,60.7495,99.992
289,290,9639,284,2798,2.63698,35.633,54.367,95.0003
290,291,45270,1432,2804,8.08601,28.0415,61.9585,90.1231
291,292,3760,1575,2728,345.843,76.7121,13.2879,99.9963
292,293,1973,915,2729,6.16065,50.9966,39.0034,99.9953
293,294,1494,456,2731,194.26,73.3379,16.6621,99.9904
294,295,34709,481,2801,5.927219999999998,51.3493,38.6507,99.9865
295,296,1989,1094,2793,171.153,71.2123,18.7877,99.9938
296,297,14213,708,2826,187.473,4.85219,85.1478,99.9778
297,298,1010,1210,2798,163.52,71.5696,18.4304,99.9854
298,299,1725,1057,2846,191.803,9.48479,80.5152,99.995
299,300,519,1796,2851,354.825,71.5277,18.4723,99.7998
300,301,551,1766,2848,0.330498,73.0658,16.9342,99.9916
301,302,5588,1464,2887,4.38624,60.055,29.945,94.8556
302,303,3666,590,2872,334.9530000000001,81.5734,8.426630000000001,99.9556
303,304,2437,868,2870,214.868,71.7191,18.2809,99.9923
304,305,25613,1609,2928,359.8280000000001,80.7262,9.27375,99.9697
305,306,7052,803,2894,196.432,30.7395,59.2605,99.9392
306,307,56848,950,3059,10.6697,64.8089,25.1911,87.5909
307,308,2970,493,2889,210.176,75.178,14.822,99.9501
308,309,1593,668,2895,356.255,81.5416,8.45842,99.9666
309,310,70976,468,3036,195.82,78.4964,11.5036,99.8483
310,311,21813,263,3056,199.835,76.9037,13.0963,99.6514
311,312,14953,718,2948,186.762,1.36073,88.6393,99.9902
312,313,824,608,2917,216.608,73.9474,16.0525,99.9552
313,314,887,1151,2952,3.8166,1.5778,88.4222,99.9968
314,315,4579,813,2990,0.06076469999999999,38.4763,51.5237,99.9811
315,316,72580,1432,3052,9.94137,46.6523,43.3477,98.9891
316,317,4687,1148,3012,3.55276,0.0409698,89.959,99.688
317,318,748,323,2989,197.286,79.1805,10.8195,99.8848
318,319,754,1699,3003,189.96400000000003,3.99788,86.0021,99.9667
319,320,7093,875,3039,3.16926,68.3488,21.6512,99.9568
320,321,4955,681,3020,216.995,76.6167,13.3833,99.7949
321,322,1277,736,3045,192.103,28.3612,61.6388,99.9601
322,323,5443,800,3080,198.976,84.6853,5.3147400000000005,99.9876
323,324,24504,690,3132,192.55,11.0383,78.9617,99.9422
324,325,12592,1342,3137,195.054,53.5644,36.4356,99.9936
325,326,28033,1445,3208,185.06,0.6315689999999999,89.3684,98.2533
326,327,841,999,3130,6.69957,11.3855,78.6145,99.983
327,328,4851,1174,3144,193.487,9.44308,80.5569,99.9901
328,329,5509,1077,3159,187.762,8.9995,81.0005,99.9855
329,330,22375,1710,3221,314.4,66.3564,23.6436,99.9532
330,331,2379,1601,3156,189.504,7.75755,82.2425,99.9955
331,332,519,1255,3142,4.96381,2.89819,87.1018,99.9954
332,333,1122,1008,3152,194.321,32.9848,57.0152,99.9936
333,334,4650,1270,3193,7.3902100000000015,10.1759,79.8241,99.9699
334,335,8365,505,3205,192.876,27.0192,62.9808,99.9533
335,336,8141,1139,3212,4.31065,0.91552,89.0845,99.9811
336,337,33613,1095,3276,200.629,26.0499,63.9501,99.9253
337,338,5105,704,3216,336.7290000000001,68.9842,21.0158,99.996
338,339,7037,1554,3221,189.808,29.5185,60.4815,99.9333
339,340,3851,611,3217,8.06374,58.058,31.942,99.9939
340,341,25484,471,3328,12.0347,22.7354,67.2646,79.8832
341,342,1373,288,3238,193.318,0.40934,89.5907,99.9836
342,343,3843,356,3249,192.102,0.187607,89.8124,99.9765
343,344,4223,1626,3270,15.9921,10.4671,79.5329,99.9268
344,345,2336,1535,3276,12.6565,9.08984,80.9102,99.989
345,346,26946,861,3326,314.696,80.4413,9.55868,99.9763
346,347,1604,1295,3268,186.611,2.19076,87.8092,99.9726
347,348,12024,655,3278,191.196,47.5799,42.4201,99.9551
348,349,1553,1471,3306,12.8674,9.731,80.26899999999998,99.9949
349,350,2453,1448,3335,195.201,52.5681,37.4319,99.8274
350,351,1024,651,3309,334.346,69.8975,20.1025,99.9945
351,352,1240,1498,3331,9.54249,7.150460000000002,82.8495,99.9996
352,353,10199,1631,3339,195.888,51.9171,38.0829,99.9133
353,354,10329,381,3387,5.0072199999999984,2.5349,87.4651,99.9687
354,355,7815,1249,3349,186.316,1.4267299999999998,88.5733,99.9307
355,356,1237,610,3321,355.717,58.5369,31.4631,99.9678
356,357,1973,766,3337,28.4685,3.98367,86.0163,99.9658
357,358,2057,1169,3331,11.1087,9.50538,80.4946,99.9994
358,359,9536,679,3369,12.1886,6.51965,83.4803,99.9755
359,360,1055,556,3346,11.34,4.18369,85.8163,99.99
360,361,1061,982,3350,5.34494,31.87,58.13,99.9888
361,362,36376,1317,3509,350.146,69.2628,20.7372,99.8461
362,363,733,1132,3363,189.303,0.433685,89.5663,99.9725
363,364,9250,1607,3407,188.213,2.82286,87.1771,99.9821
364,365,502,299,3390,6.93645,7.498439999999999,82.5016,99.8189
365,366,802,1539,3377,200.556,16.8934,73.1066,99.9953
366,367,108663,892,3620,3.9197,45.9704,44.0296,49.5976
367,368,970,1157,3379,344.811,64.794,25.206,99.9533
368,369,1665,754,3393,15.3725,38.311,51.68899999999999,99.9874
369,370,10194,1250,3440,8.230139999999999,17.0366,72.9634,99.8645
370,371,1782,1100,3399,196.583,2.08439,87.9156,99.9706
371,372,913,899,3400,192.564,3.17143,86.8286,99.9874
372,373,1380,1494,3406,337.11800000000005,74.8572,15.1428,98.3332
373,374,1567,1696,3406,11.5846,7.57858,82.4214,99.9957
374,375,8525,580,3442,203.556,50.9618,39.0382,99.9858
375,376,5094,1172,3436,14.5808,30.4786,59.5214,99.9931
376,377,963,1771,3469,11.4557,10.3171,79.6829,99.9619
377,378,4053,1478,3443,10.281,12.9763,77.0237,99.872
378,379,2899,1094,3447,24.4159,1.85605,88.14399999999998,99.9631
379,380,5829,737,3457,196.077,49.8468,40.1532,99.9915
380,381,4268,1713,3478,12.5772,10.6049,79.3951,99.8403
381,382,17186,1042,3538,207.894,58.3386,31.6614,99.9603
382,383,1099,458,3451,192.22,82.5689,7.43107,99.9747
383,384,71085,1591,3585,195.953,50.3618,39.6382,99.0841
384,385,22767,409,3562,0.246292,43.6459,46.3541,99.7241
385,386,6836,580,3507,5.3610000000000015,42.2737,47.7263,99.9928
386,387,2326,1147,3491,14.8754,79.3845,10.6155,99.9306
387,388,8769,519,3587,194.652,47.7791,42.2209,99.9618
388,389,839,305,3536,195.724,48.8435,41.1565,99.3434
389,390,10274,1149,3583,198.735,33.5628,56.4372,99.9914
390,391,8282,1400,3610,10.9685,16.1931,73.8069,99.9541
391,392,3183,280,3601,192.471,49.669,40.331,99.944
392,393,732,311,3584,195.351,57.8177,32.1823,99.8592
393,394,6734,594,3613,201.082,56.6425,33.3575,99.9774
394,395,553,1068,3599,2.22338,67.8966,22.1034,99.9898
395,396,1233,734,3638,5.49397,4.42513,85.5749,99.9729
396,397,12257,1160,3677,188.301,44.4493,45.5507,99.9369
397,398,2856,767,3667,3.0449900000000003,3.83118,86.1688,99.9912
398,399,707,663,3647,3.42196,34.3833,55.6167,99.9942
399,400,37667,364,3783,194.582,29.514,60.486,99.377
400,401,1299,1347,3665,341.444,67.9857,22.0143,99.9925
401,402,770,1272,3658,189.755,9.9007,80.0993,99.998
402,403,6268,554,3719,287.176,81.5602,8.43978,99.9431
403,404,3658,624,3676,194.486,3.56032,86.4397,99.909
404,405,1676,1442,3677,255.252,85.3323,4.66774,99.7926
405,406,4733,713,3699,181.358,63.8189,26.1811,99.9666
406,407,8438,1294,3718,338.709,64.4183,25.5817,99.9974
407,408,519,255,3675,341.721,35.8476,54.1524,99.8416
408,409,10985,1462,3734,187.295,29.2369,60.7631,99.8647
409,410,8870,855,3731,339.71,85.3481,4.65187,99.902
410,411,2205,1377,3700,194.251,59.761,30.239,99.9849
411,412,661,514,3693,192.431,38.0034,51.9966,99.9963
412,413,9891,1117,3734,191.72,22.1592,67.8408,99.916
413,414,2710,474,3724,342.2480000000001,79.5171,10.4829,99.8791
414,415,1460,637,3726,177.638,62.3757,27.6243,99.982
415,416,2418,1561,3744,15.7158,22.1551,67.8449,99.9848
416,417,553,1183,3740,190.802,9.24077,80.7592,99.9856
417,418,998,1196,3761,189.093,36.9723,53.0277,99.3579
418,419,1878,1368,3771,177.99200000000005,6.77284,83.2272,99.9889
419,420,2365,713,3757,178.99599999999995,36.1924,53.8076,99.9984
420,421,4161,1617,3776,230.058,81.7409,8.259089999999999,99.9879
421,422,1671,1736,3760,21.328000000000007,47.8404,42.1596,99.9887
422,423,3038,614,3766,180.391,35.7473,54.2527,99.9918
423,424,681,753,3770,193.975,73.1409,16.8591,97.5683
424,425,5270,1223,3812,303.344,79.5639,10.4361,99.9441
425,426,3721,825,3787,7.9015,6.93306,83.0669,99.8401
426,427,1197,478,3769,192.481,38.139,51.861,99.9957
427,428,4242,1706,3797,189.587,1.10495,88.8951,99.9344
428,429,7407,657,3814,297.925,83.2447,6.755260000000002,99.9302
429,430,3779,1292,3789,359.416,63.1886,26.8114,99.9951
430,431,7838,1475,3811,39.9689,77.26,12.74,99.9534
431,432,5749,502,3824,194.961,1.94283,88.0572,99.995
432,433,873,560,3792,184.638,0.987907,89.0121,99.9937
433,434,594,1106,3809,272.925,77.9421,12.0579,99.9947
434,435,5297,1142,3837,8.874080000000003,40.1668,49.8332,99.9166
435,436,963,751,3812,27.5181,4.48422,85.5158,99.9642
436,437,4891,1377,3845,173.46,86.3738,3.626230000000001,99.9268
437,438,10946,1630,3858,1.98636,41.8706,48.1294,99.914
438,439,730,1559,3826,191.188,3.51001,86.49,99.994
439,440,4304,1750,3859,4.95285,9.92006,80.0799,99.4489
440,441,4068,1297,3850,19.9246,79.5042,10.4958,99.9733
441,442,1197,562,3851,4.0720800000000015,2.46801,87.53200000000002,99.9944
442,443,778,742,3850,192.19,6.74452,83.2555,99.9837
443,444,3452,873,3889,8.77442,41.9158,48.0842,99.7372
444,445,1589,1455,3882,190.75,9.6115,80.3885,98.4118
445,446,2054,1270,3890,359.992,64.9052,25.0948,99.9556
446,447,2435,605,3903,336.997,71.6275,18.3725,99.7273
447,448,1369,1174,3893,246.662,80.8138,9.18624,99.9221
448,449,1044,1366,3891,186.822,85.4755,4.5245,99.9554
449,450,552,1502,3895,2.6591,1.60284,88.3972,99.9914
450,451,993,657,3915,264.96,84.3369,5.6631300000000016,99.953
