,Grain No.,Size [Pixel],center x-coordinate,center y-coordinate,mean azimuth [degree],mean latitude [degree],mean colatitude [degree],Regelungsgrad [%]
0,1,7852,211,139,89.0797,38.4798,51.5202,99.9614
1,2,74350,470,213,47.3635,30.5303,59.4697,99.9753
2,3,88659,1870,266,72.577,2.95428,87.0457,98.6692
3,4,15309,124,232,69.9537,32.7862,57.2138,99.7549
4,5,685,935,109,266.607,73.9536,16.0464,99.8595
5,6,522,687,119,273.713,42.1121,47.8879,99.9855
6,7,1689,2156,136,272.79,52.6083,37.3917,99.9896
7,8,10935,700,185,233.867,3.95468,86.0453,99.9767
8,9,4551,1152,141,108.025,71.1859,18.8141,99.9571
9,10,3531,1477,150,42.7941,79.4185,10.5814,99.9181
10,11,5460,1668,181,356.874,71.4977,18.5023,99.9824
11,12,1400254,2545,882,262.951,2.90626,87.0937,73.8491
12,13,236786,958,603,295.1670000000001,47.5879,42.4121,78.14699999999998
13,14,2804,1310,157,270.086,41.1615,48.8385,99.9943
14,15,14659,1606,228,87.2695,27.4913,62.5087,99.9582
15,16,5400,2123,185,274.493,52.8053,37.1947,99.9881
16,17,904,2312,158,164.345,67.5108,22.4892,99.9887
17,18,882,1413,165,267.015,44.6462,45.3538,99.9888
18,19,4831,1242,220,267.838,40.4216,49.5784,99.9697
19,20,1588,2909,190,244.447,16.2175,73.7825,99.9749
20,21,10735,2226,213,49.9503,62.4255,27.5745,99.9889
21,22,15194,1162,238,269.23400000000004,41.3587,48.6413,99.9937
22,23,2723,942,209,266.36400000000003,73.8995,16.1005,99.9956
23,24,549,1521,184,350.75,76.5048,13.4952,99.9921
24,25,524,3038,180,212.263,71.4995,18.5005,99.9541
25,26,4058,1299,219,288.186,46.4721,43.5279,99.932
26,27,4663,2323,215,157.374,85.6837,4.31629,99.949
27,28,6638,2845,209,218.107,40.777,49.223,99.9976
28,29,3128,2053,210,87.4199,1.48312,88.5169,99.9916
29,30,25646,1394,268,4.12172,63.6251,26.3749,99.9566
30,31,7636,3398,235,79.8693,10.6376,79.3624,99.9035
31,32,20209,764,298,39.5853,28.5287,61.4713,99.9562
32,33,3446,3264,227,297.765,70.6633,19.3367,99.929
33,34,3706,874,226,252.908,21.6732,68.3268,99.9977
34,35,8696,217,282,178.952,63.7093,26.2907,99.9911
35,36,576,634,236,104.262,52.3485,37.6515,99.9968
36,37,3043,2152,260,249.061,50.707,39.293,99.897
37,38,58894,3302,379,72.7328,26.8429,63.1571,99.9485
38,39,1098,2911,258,220.242,73.2339,16.7661,99.9906
39,40,4884,867,288,262.672,73.3611,16.6389,99.9922
40,41,916,3477,286,51.3141,39.0032,50.9968,99.96
41,42,14615,1490,334,261.108,26.1367,63.8633,93.0524
42,43,10401,2087,316,266.465,61.444,28.556,99.9882
43,44,3398,2841,274,100.735,30.7797,59.2203,99.9685
44,45,21808,2329,358,273.161,33.0417,56.9583,99.9731
45,46,2238,3451,317,55.8053,40.7648,49.2352,99.9031
46,47,2318,679,299,102.462,51.6029,38.3971,99.9956
47,48,931,928,282,35.4677,34.2383,55.7617,99.9925
48,49,13704,2669,311,265.732,14.0667,75.9333,99.9422
49,50,796,2959,287,75.1016,41.0136,48.9864,99.9881
50,51,144912,423,477,102.354,59.3362,30.6638,79.4687
51,52,1699,2915,300,218.864,72.4199,17.5801,99.9904
52,53,6142,2212,329,110.594,34.8752,55.1248,99.9363
53,54,3253,1269,312,258.577,38.3456,51.6544,99.9901
54,55,9877,1701,345,81.6858,45.5183,44.4817,99.9754
55,56,9761,2811,348,20.7306,36.481,53.519,99.9941
56,57,633,1219,313,280.028,44.8199,45.1801,99.9071
57,58,1887,1593,341,260.807,11.355,78.645,99.9954
58,59,7380,126,379,242.273,1.59321,88.4068,99.7506
59,60,6899,1251,407,273.313,45.6658,44.3342,99.9629
60,61,637,1213,366,236.033,67.9863,22.0137,99.9963
61,62,4549,674,393,31.9569,40.8615,49.1385,99.9766
62,63,7527,2244,439,111.961,30.6026,59.3974,99.9114
63,64,63710,1640,557,103.116,0.4787520000000001,89.5212,99.0707
64,65,8875,1351,430,102.945,39.6693,50.3307,99.9515
65,66,1162,2176,386,82.2952,0.954834,89.0452,99.9849
66,67,1670,1586,395,90.3032,46.5419,43.4581,99.9714
67,68,2356,3450,464,245.638,63.1843,26.8157,98.5749
68,69,1231,1539,404,111.639,43.9505,46.0495,99.8742
69,70,4191,727,454,247.313,53.4067,36.5933,99.9921
70,71,1676,1449,439,257.311,23.2871,66.7129,99.958
71,72,1995,137,456,225.168,6.958469999999998,83.0415,99.9686
72,73,10175,1879,495,264.53,1.4487,88.5513,99.9355
73,74,1294,1563,474,91.2937,45.4624,44.5376,99.9886
74,75,3891,1388,485,350.704,74.0546,15.9454,99.9923
75,76,1163,1453,481,100.573,42.0766,47.9234,99.9916
76,77,28778,1330,617,284.097,50.0106,39.9894,99.9025
77,78,601,779,524,254.80900000000003,55.249,34.751,99.9904
78,79,7583,1445,582,338.718,64.1337,25.8663,99.9559
79,80,5952,3432,576,246.152,62.1647,27.8353,99.626
80,81,7403,1779,603,100.284,31.441,58.559,99.9415
81,82,11638,1880,621,313.817,72.4516,17.5484,99.9672
82,83,3773,200,575,277.664,42.5243,47.4757,99.9957
83,84,1194,3285,569,97.4162,36.9621,53.0379,99.8667
84,85,7916,1163,617,50.5911,22.0706,67.9294,99.958
85,86,91422,335,755,96.8156,8.1122,81.8878,99.9303
86,87,4728,93,604,199.29,70.7304,19.2696,99.5176
87,88,5510,650,621,301.838,48.407,41.593,99.997
88,89,9255,759,637,275.922,56.7251,33.2749,99.9466
89,90,26630,1524,742,11.6874,61.2445,28.7555,99.9507
90,91,856,139,647,277.496,42.4133,47.5867,99.9914
91,92,1769,1234,655,263.16,27.2918,62.7082,99.9872
92,93,9958,96,722,68.0242,15.5402,74.4598,99.8077
93,94,540,1697,658,3.1105400000000003,60.0555,29.9445,99.9946
94,95,8047,1420,712,229.731,36.6817,53.3183,99.9854
95,96,2669,591,692,230.327,6.43195,83.5681,99.9981
96,97,3785,1717,698,100.012,0.417534,89.5825,99.9851
97,98,85115,1193,917,50.6082,22.5235,67.4765,99.8463
98,99,3614,3222,725,230.563,72.102,17.898,99.978
99,100,5183,1208,725,281.692,47.2264,42.7736,99.9825
100,101,2429,164,726,279.504,39.9539,50.0461,99.9947
101,102,32080,643,820,48.6788,25.3761,64.6239,99.8931
102,103,5251,504,770,93.9265,38.9889,51.0111,99.5099
103,104,4723,3173,754,105.497,21.5181,68.4819,99.9483
104,105,837,3358,742,74.9338,16.2418,73.7582,99.9509
105,106,47973,3371,983,83.4916,11.2575,78.7425,99.6135
106,107,20470,3295,831,228.404,8.81985,81.1802,99.9955
107,108,13914,1368,835,63.0737,64.5973,25.4028,99.9323
108,109,7213,142,815,277.075,43.0527,46.9473,99.9965
109,110,1736,3188,831,103.382,27.8556,62.1444,99.9636
110,111,3393,1627,852,149.875,73.3404,16.6596,99.9644
111,112,5904,204,873,43.8374,50.9456,39.0544,99.9982
112,113,4087,1461,864,273.737,40.06,49.94,99.8088
113,114,14929,1495,951,98.629,36.0152,53.9848,98.6661
114,115,69461,640,1061,241.784,12.4407,77.5593,70.6963
115,116,32433,120,1008,205.663,5.20686,84.7931,99.2759
116,117,580,3244,901,85.1705,11.8304,78.1696,99.9433
117,118,4992,1392,937,282.433,28.2786,61.7214,99.9305
118,119,3385,3226,952,89.2321,41.768,48.232,99.9751
119,120,134090,936,1222,282.628,52.9434,37.0566,89.8176
120,121,332335,375,1330,278.64,8.22419,81.7758,88.8896
121,122,667,1381,1028,289.756,30.9059,59.0941,99.8459
122,123,11359,1313,1087,286.902,27.8107,62.1893,99.984
123,124,717,1418,1063,74.9053,5.01022,84.9898,99.9836
124,125,11125,3301,1150,275.624,54.4812,35.5188,99.965
125,126,20671,1436,1167,116.596,75.6855,14.3145,99.9252
126,127,7162,1311,1173,292.796,34.5241,55.4759,99.951
127,128,321046,2493,1455,264.137,23.4247,66.5753,60.4402
128,129,12147,2781,1185,273.636,1.6941099999999998,88.3059,99.9765
129,130,20170,1912,1221,133.485,74.4398,15.5602,99.9402
130,131,85966,1217,1329,290.572,62.9609,27.0391,99.7056
131,132,1367,653,1170,77.7615,42.2878,47.7122,99.9936
132,133,986,1990,1178,90.3431,27.4101,62.5899,98.8848
133,134,13198,3411,1253,81.6731,8.08435,81.9156,99.9178
134,135,7892,3230,1242,277.459,56.2247,33.7753,99.9686
135,136,9386,2348,1251,269.206,39.6756,50.3244,99.9587
136,137,2750,2177,1224,339.999,61.7931,28.2069,99.9974
137,138,21986,1776,1318,275.473,10.1742,79.8258,99.9191
138,139,14318,1518,1301,300.293,81.7327,8.26726,98.9329
139,140,1937,2862,1269,18.484,40.1153,49.8847,99.998
140,141,1572,2217,1262,23.6259,25.8091,64.1909,99.9953
141,142,3502,3314,1284,236.9,32.1043,57.8957,99.9964
142,143,7721,3129,1294,278.336,48.4872,41.5128,99.974
143,144,1139,2189,1295,248.362,0.982025,89.01799999999999,99.9775
144,145,1131,754,1303,269.336,48.1107,41.8893,99.9792
145,146,34222,1996,1401,137.702,36.4992,53.5008,99.905
146,147,842,722,1315,282.178,56.3133,33.6867,99.9908
147,148,3900,3253,1345,81.7564,6.08627,83.9137,99.9929
148,149,199047,3253,1749,79.3307,19.1314,70.8686,85.8048
149,150,1326,668,1348,280.934,53.525,36.475,99.9925
150,151,128596,1751,1519,136.732,64.7039,25.2961,87.4878
151,152,726,3207,1346,240.163,33.7559,56.2441,99.9906
152,153,6959,706,1382,266.17400000000004,49.2051,40.7949,99.9728
153,154,1622,1403,1355,284.546,81.1112,8.88878,99.9903
154,155,1090,1817,1414,263.85,46.3569,43.6431,99.9689
155,156,560,2906,1415,73.3788,12.6454,77.3546,99.9801
156,157,24704,3372,1516,28.525,7.24745,82.7525,99.599
157,158,10162,774,1497,265.506,48.673,41.327,99.8701
158,159,70119,1217,1583,256.585,49.0869,40.9131,49.0314
159,160,593,829,1480,274.551,49.9464,40.0536,99.9933
160,161,41526,864,1636,48.9572,15.989,74.01100000000002,99.9321
161,162,12187,200,1602,94.2975,11.9663,78.0337,99.9132
162,163,1296,2323,1541,268.29,52.2907,37.7093,99.3451
163,164,1074,795,1558,264.752,17.0137,72.9863,99.9814
164,165,4410,367,1566,282.588,6.80335,83.1966,99.9863
165,166,13294,1699,1636,262.837,1.44249,88.5575,99.9739
166,167,6962,1221,1603,287.43,19.3213,70.6787,99.9915
167,168,42703,2457,1726,148.885,81.6546,8.34543,47.1194
168,169,4675,311,1601,101.584,3.3442300000000005,86.6558,99.9963
169,170,13636,1266,1670,211.25,32.3299,57.6701,99.8777
170,171,1640,1529,1616,288.245,44.2667,45.7333,99.9909
171,172,8396,2861,1641,74.109,7.03269,82.9673,99.993
172,173,44217,1031,1761,76.8147,41.398,48.602,96.819
173,174,3273,1564,1656,113.293,16.0424,73.9576,99.991
174,175,3059,1622,1641,271.57,6.07057,83.9294,99.9874
175,176,56040,1382,1763,84.5375,40.7782,49.2218,99.6833
176,177,18121,1842,1682,259.449,39.3792,50.6208,99.9493
177,178,287203,538,1987,279.683,32.0369,57.9631,45.3723
178,179,765,3191,1632,242.179,30.8264,59.1736,99.998
179,180,8546,2612,1672,254.698,33.4429,56.5571,99.9861
180,181,777,56,1636,247.516,28.1935,61.8065,99.9058
181,182,11356,108,1703,18.5172,34.2309,55.7691,99.731
182,183,8237,740,1699,66.6534,37.3061,52.6939,99.9973
183,184,4247,198,1708,279.707,46.8445,43.1555,99.9297
184,185,47670,2304,1775,259.687,42.6897,47.3103,99.9638
185,186,567,294,1671,290.075,82.3008,7.69918,99.9447
186,187,714,409,1673,281.965,3.09399,86.906,99.9985
187,188,3774,545,1718,248.83,35.3704,54.6296,99.9936
188,189,1213,251,1700,283.89,84.9018,5.09818,99.9876
189,190,23266,1606,1781,276.455,46.4707,43.5293,99.9668
190,191,4519,1726,1760,244.235,37.3012,52.6988,99.9544
191,192,20068,1922,1788,343.153,65.3632,24.6368,99.9822
192,193,36104,2628,1874,108.445,48.3588,41.6412,99.9042
193,194,10730,196,1820,313.967,84.7965,5.20345,99.9932
194,195,6372,2775,1821,289.285,46.8223,43.1777,99.9936
195,196,11335,814,1831,66.1473,39.2596,50.7404,99.9936
196,197,10194,346,1817,222.36,37.2996,52.7004,99.991
197,198,621,3165,1792,243.888,31.4053,58.5947,99.9904
198,199,3825,1760,1815,265.953,10.8639,79.1361,99.9681
199,200,1489,88,1817,275.751,50.4571,39.5429,99.9811
200,201,968,1200,1829,82.663,58.8628,31.1372,99.9824
201,202,3862,3170,1855,16.5579,9.21496,80.785,99.9067
202,203,132134,1807,2009,259.034,37.9367,52.0633,99.4525
203,204,18357,2100,1925,264.643,1.33653,88.6635,99.9234
204,205,5871,995,1914,76.9016,46.2918,43.7082,95.6253
205,206,2197,919,1865,76.5553,24.4272,65.5728,99.9781
206,207,6052,1161,1882,69.2889,75.479,14.521,99.9875
207,208,3522,2335,1870,26.4195,28.001,61.999,99.9942
208,209,839,1467,1876,263.118,79.156,10.844,99.9462
209,210,2954,885,1902,47.0823,17.8488,72.1512,99.9888
210,211,10830,316,1899,299.625,85.8026,4.19741,99.9848
211,212,1722,2420,1881,41.7629,67.188,22.812,99.9559
212,213,15462,2796,1973,40.2904,33.1884,56.8116,99.5639
213,214,703,394,1885,274.724,1.65025,88.3497,99.9812
214,215,77732,1256,2049,277.833,22.0793,67.9207,98.7824
215,216,10107,2238,1944,220.716,48.5071,41.4929,99.987
216,217,1486,2378,1912,231.448,45.7121,44.2879,99.9885
217,218,5126,2338,1954,257.911,44.8105,45.1895,99.9855
218,219,132659,2260,2146,282.16,39.1212,50.8788,91.9807
219,220,1627,1129,1940,61.525,52.3332,37.6668,99.9672
220,221,950,1513,1940,253.791,39.0656,50.9344,99.9805
221,222,43620,973,2133,311.289,85.7772,4.22281,68.1769
222,223,6491,1068,1977,279.086,15.884,74.116,99.9578
223,224,15103,2682,2005,29.9314,36.6279,53.3721,99.9874
224,225,14163,1501,2015,29.9888,65.708,24.292,99.658
225,226,863,3029,2017,41.1402,10.8345,79.1655,99.9743
226,227,10280,1394,2100,279.722,30.9333,59.0667,99.9622
227,228,5628,3026,2087,46.4754,20.6195,69.3805,99.9481
228,229,88030,2907,2226,77.4687,48.1255,41.8745,80.6993
229,230,1583,3145,2077,74.5079,69.9685,20.0315,99.9916
230,231,2500,1479,2094,231.453,8.9645,81.0355,99.9494
231,232,16717,3120,2167,67.3416,61.148,28.852,99.9715
232,233,24089,154,2134,113.202,72.035,17.965,99.9413
233,234,7105,1620,2130,280.033,18.5662,71.4338,99.9858
234,235,2805,1559,2109,69.6449,31.5933,58.4067,99.9921
235,236,721,2897,2108,42.4628,13.5441,76.4559,99.8549
236,237,7263,3228,2166,101.329,38.6547,51.3453,99.9147
237,238,19603,2312,2171,324.8,57.6365,32.3635,99.992
238,239,12504,486,2184,258.527,10.1393,79.8607,99.9138
239,240,9482,2645,2181,57.6555,22.5208,67.4792,99.9988
240,241,19692,3363,2233,215.43,22.7151,67.2849,99.6583
241,242,10901,1510,2191,263.546,32.9253,57.0747,99.8543
242,243,2444,1427,2172,82.9198,15.8467,74.1533,99.9643
243,244,1478,1228,2154,281.841,20.275,69.725,99.8998
244,245,4166,1139,2162,277.943,15.8811,74.1189,99.9824
245,246,3825,2013,2160,58.4661,51.9549,38.0451,99.9757
246,247,4998,1932,2198,125.224,38.1225,51.8775,99.9059
247,248,6588,195,2204,279.072,83.685,6.31497,99.9917
248,249,6383,1648,2245,107.294,79.6758,10.3242,99.9583
249,250,1790,43,2221,263.743,69.72,20.28,99.9436
250,251,3415,1185,2217,57.5406,82.2361,7.76392,99.9934
251,252,10552,830,2260,246.475,15.1801,74.8199,99.9762
252,253,1123,3280,2223,214.595,21.7399,68.2601,99.9972
253,254,3809,1099,2238,232.082,51.2275,38.7725,99.9435
254,255,45427,2532,2328,231.701,41.6661,48.3339,99.9204
255,256,60492,1850,2393,109.411,44.2771,45.7229,99.6855
256,257,4290,118,2257,243.676,14.6409,75.3591,99.9755
257,258,10800,3218,2272,38.9566,33.7616,56.2384,99.992
258,259,5799,290,2244,261.716,36.8379,53.1621,99.9568
259,260,5969,1557,2280,244.899,55.9803,34.0197,99.987
260,261,6449,2317,2280,89.8932,15.4046,74.5954,99.9765
261,262,4584,2688,2273,40.6747,35.6974,54.3026,99.8383
262,263,1512,431,2259,271.969,2.15066,87.8493,99.9955
263,264,6532,1366,2284,251.646,11.8403,78.1597,99.9381
264,265,601,1460,2259,27.6245,60.9363,29.0637,99.9741
265,266,1856,55,2267,261.818,33.2672,56.7328,99.9659
266,267,988,912,2259,79.7691,53.9745,36.0255,99.9835
267,268,1858,2227,2271,275.192,35.1488,54.8512,99.9937
268,269,13423,1125,2332,71.1893,9.59567,80.4043,99.9716
269,270,3385,1247,2268,222.282,44.5916,45.4084,99.9615
270,271,519,1038,2269,35.7222,71.2995,18.7005,99.9763
271,272,12620,406,2327,69.1729,76.9678,13.0322,99.9432
272,273,30510,2810,2356,77.6479,44.4703,45.5297,99.9472
273,274,502,1688,2270,259.998,58.8025,31.1975,99.9456
274,275,1082,1751,2266,258.756,14.278,75.722,99.9866
275,276,71755,616,2422,245.52,25.7847,64.2153,87.2116
276,277,7102,271,2303,250.217,33.5023,56.4977,99.9976
277,278,2533,1058,2310,267.21,7.902710000000001,82.0973,99.9889
278,279,1205,180,2294,94.3952,52.7601,37.2399,99.9858
279,280,2841,923,2326,238.019,20.0936,69.9064,99.9937
280,281,3176,2247,2319,312.199,61.3028,28.6972,99.9956
281,282,21729,1517,2375,92.6066,30.1601,59.8399,99.144
282,283,3686,3286,2335,80.9207,17.6144,72.3856,99.9791
283,284,1884,865,2331,265.35200000000003,46.1603,43.8397,99.9458
284,285,4047,116,2327,208.665,82.6303,7.36966,99.9677
285,286,1716,2678,2333,72.8904,80.5947,9.40526,99.9918
286,287,17596,269,2383,251.793,8.42262,81.5774,99.596
287,288,12096,1347,2393,260.384,33.343,56.657,99.8638
288,289,4237,798,2365,239.972,28.7591,61.2409,99.9958
289,290,1191,3156,2341,98.8158,78.9089,11.0911,99.9954
290,291,1352,3404,2352,235.211,62.089,27.911,99.8496
291,292,7108,2335,2386,49.9662,67.8932,22.1068,99.9834
292,293,4311,1197,2383,251.29,78.8794,11.1206,99.9733
293,294,1463,2276,2366,87.2304,7.00105,82.999,99.9741
294,295,1414,3099,2353,68.2651,61.3806,28.6194,99.9898
295,296,5514,2160,2398,45.0254,16.9362,73.0638,99.9863
296,297,6734,2230,2399,92.0315,19.8336,70.1664,99.9778
297,298,4399,3223,2376,238.756,14.2953,75.7047,99.9832
298,299,1026,3365,2366,84.6458,18.0664,71.9336,99.9962
299,300,49487,1704,2541,84.5251,25.1108,64.8892,99.7961
300,301,4726,1044,2410,237.703,22.4899,67.5101,99.9942
301,302,33868,916,2484,84.259,7.480180000000002,82.5198,99.2692
302,303,9935,2425,2425,211.123,69.9032,20.0968,99.9739
303,304,2124,875,2392,96.3831,60.4408,29.5592,99.9904
304,305,9150,2083,2430,261.441,2.9303,87.0697,99.9616
305,306,5705,3111,2407,47.3406,7.28233,82.7177,99.9792
306,307,6805,87,2442,99.2026,50.2008,39.7992,99.9085
307,308,12706,3268,2448,9.66013,81.2062,8.79383,99.7315
308,309,7108,3378,2432,252.765,67.0718,22.9282,99.9294
309,310,2072,2019,2423,93.0607,11.2544,78.7456,99.9619
310,311,761,3174,2413,91.9042,32.1257,57.8743,99.9861
311,312,701,1427,2426,254.821,74.13600000000002,15.864,99.9722
312,313,20528,2726,2524,82.5987,27.8255,62.1745,88.4746
313,314,1989,2905,2437,82.5438,60.271,29.729,99.9865
314,315,13634,203,2471,52.2849,46.8248,43.1752,84.5037
315,316,19331,349,2509,249.532,37.6781,52.3219,96.4393
316,317,81125,2535,2694,247.853,34.9262,55.0738,76.4704
317,318,18890,1096,2504,67.2059,19.46,70.54,81.3743
318,319,2064,1253,2433,266.252,39.2934,50.7066,99.9698
319,320,13964,3079,2484,84.6505,40.5528,49.4472,99.9293
320,321,2873,2347,2476,104.785,52.4665,37.5335,99.9664
321,322,24399,1238,2553,290.681,80.0654,9.93456,98.8143
322,323,13392,1507,2526,100.957,72.9391,17.0609,98.4906
323,324,7600,2225,2490,83.6898,8.55412,81.4459,99.9663
324,325,1353,536,2473,50.4758,3.87063,86.1294,99.9628
325,326,9455,2971,2526,267.02,31.8342,58.1658,99.2413
326,327,5243,2623,2520,279.523,30.7088,59.2912,99.8968
327,328,5156,2858,2518,270.149,21.9475,68.0525,99.9585
328,329,5014,2129,2518,83.4009,4.92854,85.0715,99.9487
329,330,2114,1399,2509,95.1095,63.5872,26.4128,99.4337
330,331,965,2798,2505,88.4126,3.98445,86.0155,99.9661
331,332,3750,3384,2519,150.05700000000004,79.8359,10.1641,99.9049
332,333,10257,3235,2531,98.4663,32.8664,57.1336,79.991
333,334,13461,1996,2595,83.9982,33.8027,56.1973,99.632
334,335,1140,766,2515,85.8873,15.6994,74.3006,95.6995
335,336,2425,741,2549,255.276,2.77414,87.2259,99.9592
336,337,8072,84,2574,80.9012,24.5961,65.4039,99.8715
337,338,4572,2249,2574,247.57,41.2015,48.7985,99.7452
338,339,628,133,2546,4.87136,78.3072,11.6928,99.9974
339,340,25987,411,2642,76.7873,68.1015,21.8985,95.2476
340,341,2516,1418,2561,39.9091,58.159,31.841,99.9683
341,342,2395,197,2556,277.866,37.0258,52.9742,99.989
342,343,2463,1850,2554,73.7288,63.6005,26.3995,99.928
343,344,6256,2358,2575,206.671,76.1142,13.8858,99.9745
344,345,5737,1397,2620,237.906,59.2379,30.7621,99.9317
345,346,5237,2933,2590,264.531,59.7327,30.2673,99.5769
346,347,19196,3287,2629,251.185,60.0566,29.9434,99.9505
347,348,2507,3080,2579,71.2139,24.051,65.949,99.9826
348,349,11029,759,2631,75.7004,5.22929,84.7707,99.9948
349,350,566,3118,2581,274.168,62.553,27.447,99.9984
350,351,946,2130,2580,253.581,41.0122,48.9878,99.8946
351,352,28067,1307,2681,61.8787,32.2174,57.7826,99.8895
352,353,1043,3402,2584,249.463,4.93614,85.0639,99.9501
353,354,1079,2188,2590,64.9265,9.13735,80.8626,99.9735
354,355,21584,2162,2666,255.797,45.8127,44.1873,99.9093
355,356,11638,207,2636,77.36,20.5538,69.4462,99.9933
356,357,2748,1896,2603,250.192,9.49887,80.5011,99.9935
357,358,4923,882,2625,63.1663,37.024,52.976000000000006,99.9851
358,359,742,308,2591,242.128,42.4134,47.5866,99.9943
359,360,2944,1496,2609,44.6261,59.2932,30.7068,99.9945
360,361,9210,2616,2632,153.475,80.46300000000002,9.53702,99.9568
361,362,15393,1656,2659,46.4952,64.6343,25.3657,99.9678
362,363,7644,571,2634,81.8817,82.7485,7.25155,99.9863
363,364,11473,1051,2653,94.0768,15.8935,74.1065,99.9472
364,365,1899,291,2617,241.905,42.2776,47.7224,99.9943
365,366,9838,3013,2653,255.396,58.8956,31.1044,99.8564
366,367,589,2297,2606,88.1135,23.0455,66.9545,99.9744
367,368,4650,2708,2647,72.8402,59.5965,30.4035,99.9517
368,369,5220,676,2644,266.378,50.428,39.572,99.993
369,370,4212,3384,2653,247.623,63.3105,26.6895,99.9634
370,371,8283,70,2655,73.1402,75.9115,14.0885,99.9475
371,372,16126,3141,2702,265.757,62.1572,27.8428,99.9745
372,373,3480,2793,2635,237.99,69.1538,20.8462,99.9925
373,374,1007,1548,2639,81.8454,27.1647,62.8353,99.8569
374,375,7095,2358,2653,279.176,69.9531,20.0469,99.9347
375,376,1506,2248,2645,281.941,65.1141,24.8859,99.9717
376,377,3733,2891,2655,221.121,85.3158,4.68421,99.9888
377,378,2840,985,2669,91.4864,58.1363,31.8637,99.9523
378,379,19067,1896,2717,85.9422,0.464554,89.5354,99.6904
379,380,1748,828,2669,231.05900000000003,44.7888,45.2112,99.991
380,381,2453,1481,2666,260.565,25.616,64.384,99.8337
381,382,532,2839,2661,270.899,23.3813,66.6187,99.994
382,383,7373,2759,2707,85.7519,27.1958,62.8042,99.9868
383,384,19399,2917,2796,259.217,9.14943,80.8506,61.8988
384,385,5570,913,2714,83.1114,2.51951,87.4805,99.843
385,386,768,1164,2687,90.923,15.9326,74.0674,99.9901
386,387,13449,1513,2731,75.3066,62.0403,27.9597,99.8247
387,388,14569,567,2733,104.023,82.0531,7.946919999999999,99.9378
388,389,1228,2420,2695,77.0597,40.7271,49.2729,99.9834
389,390,2676,2036,2704,88.399,11.4044,78.5956,99.9916
390,391,14342,784,2741,237.314,55.409,34.591,99.641
391,392,2453,239,2699,79.3448,74.8305,15.1695,99.9799
392,393,4412,2847,2720,68.2521,44.4405,45.5595,99.9958
393,394,1154,3405,2712,254.616,22.6256,67.3744,99.9567
394,395,1089,671,2703,265.659,50.2736,39.7264,99.9949
395,396,13030,2194,2773,248.612,38.597,51.403,99.9008
396,397,2536,2368,2729,53.5061,44.962,45.038,99.9703
397,398,16322,1026,2766,258.131,15.1431,74.8569,99.5985
398,399,783,200,2718,248.221,48.5957,41.4043,99.998
399,400,7350,157,2754,76.5988,75.7965,14.2035,99.9219
400,401,2465,3364,2735,256.815,36.1824,53.8176,99.9885
401,402,9249,3262,2763,247.348,39.7907,50.2093,99.9979
402,403,1265,3417,2780,254.454,20.6558,69.3442,99.8835
403,404,5600,56,2770,65.2312,5.29439,84.7056,99.7609
404,405,2316,400,2740,78.5614,22.6276,67.3724,99.9912
405,406,8248,2081,2780,101.37,51.2924,38.7076,99.9832
406,407,1109,342,2744,57.5341,15.6156,74.3844,99.9988
407,408,1168,266,2738,248.775,49.1038,40.8962,99.9979
408,409,1455,2894,2753,77.3428,26.3085,63.6915,99.9883
409,410,1312,1794,2758,57.3323,22.7717,67.2283,99.9636
410,411,4527,2802,2778,202.795,73.8243,16.1757,99.9405
411,412,4903,1427,2782,242.58,43.0828,46.9172,99.9285
412,413,6197,1614,2784,61.5681,34.7729,55.2271,99.9571
413,414,659,2301,2759,83.29700000000003,35.0646,54.9354,99.977
414,415,928,1217,2761,267.056,14.5362,75.4638,99.9945
415,416,7434,1254,2815,72.3128,31.1847,58.8153,99.4699
416,417,12195,3314,2840,268.513,33.2101,56.7899,99.9644
417,418,35949,222,2874,246.792,39.5032,50.4968,99.9898
418,419,2587,1703,2777,262.629,51.4292,38.5708,99.9884
419,420,639,1161,2770,268.05,14.849,75.15100000000002,99.9914
420,421,8420,3152,2805,244.805,65.6124,24.3876,99.912
421,422,708,3033,2767,137.961,76.1934,13.8066,99.9948
422,423,7311,2363,2806,278.815,66.1881,23.8119,99.9743
423,424,5206,671,2792,46.3367,62.2284,27.7716,99.9929
424,425,123339,357,3020,259.66200000000003,62.8511,27.1489,33.5443
425,426,833,1978,2779,95.6853,14.4555,75.5445,99.9754
426,427,987,2989,2781,70.2064,20.0344,69.9656,99.9929
427,428,110532,2888,3108,255.234,7.9172,82.0828,93.5499
428,429,2570,150,2798,57.8704,10.5336,79.4664,99.9943
429,430,18973,775,2866,255.906,48.3255,41.6745,99.8544
430,431,3460,875,2812,60.0197,10.8131,79.1869,99.9728
431,432,4301,576,2813,134.286,61.3103,28.6897,99.9859
432,433,15597,2986,2894,71.2878,14.9615,75.0385,99.7691
433,434,1184,1135,2811,243.565,30.2721,59.7279,99.9678
434,435,999,2027,2816,64.4675,25.0561,64.9439,99.8945
435,436,972,3088,2819,75.4588,60.3142,29.6858,99.9974
436,437,7904,2156,2863,113.89,44.945,45.055,99.962
437,438,800,3375,2816,268.511,33.8109,56.1891,99.9425
438,439,1220,1016,2806,261.148,71.7126,18.2874,99.9905
439,440,801,1950,2815,263.483,40.7398,49.2602,99.5386
440,441,9466,1362,2844,242.542,35.5764,54.4236,99.9912
441,442,2084,1077,2823,270.076,20.2141,69.7859,99.9936
442,443,3250,1499,2850,64.8059,34.6898,55.3102,99.7805
443,444,4201,1688,2860,76.1732,62.0359,27.9641,99.7829
444,445,2648,73,2854,63.6348,10.956,79.044,99.8184
445,446,5181,1176,2886,268.89,27.8682,62.1318,99.828
446,447,506,2319,2842,266.091,49.8325,40.1675,99.993
447,448,571,1038,2837,258.125,17.0203,72.9797,99.9886
448,449,725,678,2836,139.299,68.4269,21.5731,99.9958
449,450,2191,646,2857,35.9408,55.4166,34.5834,99.9748
450,451,5023,3212,2874,258.086,0.8514709999999999,89.1485,99.9941
451,452,36978,1749,2982,89.6768,0.8983690000000001,89.1016,99.9674
452,453,3037,35,2885,97.0252,15.8663,74.1337,99.8552
453,454,6547,1105,2879,255.287,23.8075,66.1925,99.9555
454,455,15795,1598,2912,243.08,41.9672,48.0328,99.9553
455,456,1308,1927,2861,304.188,71.5844,18.4156,99.9818
456,457,6488,577,2879,261.45,8.09107,81.9089,99.9874
457,458,1443,1534,2871,66.9803,33.0283,56.9717,99.9035
458,459,830,2411,2863,73.3897,36.8283,53.1717,99.9511
459,460,22861,957,2963,265.105,3.65919,86.3408,98.0722
460,461,3347,1456,2891,263.478,23.1711,66.8289,99.1041
461,462,10316,3073,2896,69.9832,29.8703,60.1297,99.9871
462,463,6252,2065,2897,103.895,48.978,41.022,99.9362
463,464,695,2257,2866,53.1556,47.1992,42.8008,99.9607
464,465,1242,1013,2873,262.411,7.570589999999998,82.4294,99.8014
465,466,60315,2191,3023,79.5841,31.6011,58.3989,82.0564
466,467,1890,1996,2888,97.2045,9.87961,80.1204,99.9451
467,468,5225,1259,2916,267.35,11.7827,78.2173,99.984
468,469,14411,717,2991,67.1526,38.6799,51.3201,99.9119
469,470,2193,2232,2906,106.444,65.8821,24.1179,99.9729
470,471,4643,3381,2941,71.337,38.0736,51.9264,99.9321
471,472,4210,3146,2941,354.355,78.1945,11.8055,99.9703
472,473,877,1327,2901,260.615,23.0296,66.9704,99.9478
473,474,12128,1933,2940,265.692,42.5209,47.4791,99.4178
474,475,39183,2577,3034,263.418,55.4164,34.5836,85.9137
475,476,16622,3265,2965,78.6728,6.66563,83.3344,99.9869
476,477,789,1385,2921,278.313,68.189,21.811,99.9911
477,478,4507,619,2955,266.72,22.4287,67.5713,99.9464
478,479,1779,550,2930,102.94,81.1303,8.86969,99.9838
479,480,11148,843,2976,69.8253,34.8724,55.1276,99.8901
480,481,1270,2422,2944,73.3342,36.5571,53.4429,99.9633
481,482,5232,1340,2959,277.009,67.0061,22.9939,99.9674
482,483,1414,55,2941,99.8467,12.1952,77.8048,99.8719
483,484,7941,1122,2986,273.445,21.6138,68.3862,99.7717
484,485,3648,2685,2979,262.821,34.3774,55.6226,99.9946
485,486,591,1476,2950,242.348,46.3878,43.6122,99.9393
486,487,10932,1232,3014,97.7063,68.1378,21.8622,99.1978
487,488,2901,2463,2973,263.057,67.5971,22.4029,99.8749
488,489,4320,3079,2991,84.898,2.09985,87.9002,99.9893
489,490,3140,2018,3010,270.685,52.8675,37.1325,75.4431
490,491,15711,1470,3073,76.3318,49.8243,40.1757,74.3713
491,492,9052,1578,3030,93.5972,55.5879,34.4121,99.1123
492,493,1370,2983,3000,75.7141,18.4219,71.5781,99.9397
493,494,22127,3240,3053,245.295,40.9615,49.0385,82.2714
494,495,4522,1381,3045,260.279,19.7448,70.2552,99.9044
495,496,10945,1915,3045,63.1179,17.8185,72.1815,99.4747
496,497,8895,612,3049,47.9072,76.6874,13.3126,99.8525
497,498,1881,3044,3034,230.485,40.6781,49.3219,99.9904
498,499,40695,2430,3177,88.1518,47.5524,42.4476,92.7235
499,500,15040,846,3117,219.524,44.8542,45.1458,99.9458
500,501,7951,2796,3076,271.35,27.439,62.56100000000001,99.966
501,502,1092,52,3052,99.5479,15.3557,74.6443,99.9388
502,503,19752,1136,3140,275.373,4.34373,85.6563,99.9352
503,504,1453,277,3071,259.474,30.1998,59.8002,99.9488
504,505,1708,1018,3073,266.867,35.9999,54.0001,99.9788
505,506,796,1045,3049,85.4731,67.1226,22.8774,99.8823
506,507,2171,690,3080,72.3646,29.5545,60.4455,99.9923
507,508,1822,794,3069,285.391,67.0766,22.9234,99.9672
508,509,667,1823,3073,274.716,55.706,34.294000000000004,99.9891
509,510,7008,526,3102,250.762,21.6741,68.3259,99.9945
510,511,12679,2269,3147,240.021,38.5487,51.4513,99.9885
511,512,2285,1238,3094,69.5686,25.0055,64.9945,99.9871
512,513,15920,993,3175,78.4261,72.8149,17.1851,91.7846
513,514,2759,44,3124,253.332,54.659,35.341,99.9418
514,515,71624,1341,3274,49.4577,31.6773,58.3227,88.6744
515,516,2584,3356,3107,260.618,35.7261,54.2739,99.9769
516,517,741,236,3093,248.823,55.264,34.736,99.9981
517,518,6684,1568,3155,250.911,56.6534,33.3466,99.7924
518,519,515,3204,3095,276.191,51.8819,38.1181,99.9913
519,520,11150,2622,3163,259.22700000000003,42.5065,47.4935,99.9905
520,521,502,740,3099,289.069,68.3723,21.6277,99.9844
521,522,12177,3158,3159,249.362,43.1429,46.8571,99.9892
522,523,15003,1762,3151,267.389,2.05638,87.9436,99.9403
523,524,925,2695,3133,75.1416,35.2106,54.7894,99.9933
524,525,1598,1604,3113,279.228,3.45385,86.5462,99.99
525,526,1870,1875,3127,255.575,41.3957,48.6043,99.9497
526,527,507,3091,3116,265.886,28.6841,61.3159,99.9969
527,528,8710,241,3164,267.588,49.0031,40.9969,99.9963
528,529,890,1935,3128,257.583,58.9751,31.0249,99.9587
529,530,16317,631,3228,260.833,10.8588,79.1412,99.979
530,531,3273,707,3131,35.3753,75.0092,14.9908,99.9524
531,532,3328,2757,3146,78.7197,16.2426,73.7574,99.9909
532,533,2866,1990,3159,71.8629,31.5245,58.4755,99.9534
533,534,34315,3289,3282,61.944,2.66407,87.3359,99.962
534,535,2504,2513,3160,222.837,33.5428,56.4572,99.9298
535,536,2482,1234,3169,264.323,35.3062,54.6938,99.9725
536,537,1027,3356,3150,242.76,66.2627,23.7373,99.9786
537,538,7181,92,3185,249.062,19.4075,70.5925,99.9486
538,539,7246,2820,3202,88.5099,12.2157,77.7843,99.979
539,540,946,740,3169,263.096,36.9417,53.0583,99.985
540,541,1283,3327,3177,257.34,30.1901,59.8099,99.9947
541,542,2679,1862,3186,288.697,73.563,16.437,99.9879
542,543,4431,1642,3203,83.801,53.1172,36.8828,99.9832
543,544,947,3092,3177,268.805,28.4531,61.5469,99.9948
544,545,20365,2131,3222,80.9355,20.5132,69.4868,99.7651
545,546,2377,839,3190,259.205,45.2065,44.7935,99.9865
546,547,5039,3368,3218,48.9442,55.3918,34.6082,99.9417
547,548,1719,697,3204,252.314,25.0518,64.9482,99.9928
548,549,21755,1888,3288,84.8209,45.5801,44.4199,99.7232
549,550,906,1520,3192,252.555,6.42208,83.5779,99.9901
550,551,14053,2695,3247,247.626,58.7065,31.2935,99.9627
551,552,3315,405,3221,61.4696,10.2884,79.7116,99.9838
552,553,3474,3063,3242,175.86,86.5463,3.45369,99.9737
553,554,6687,1699,3251,62.8531,13.8035,76.1965,99.9252
554,555,10328,763,3244,70.2385,9.04602,80.954,99.998
555,556,4576,2888,3249,62.2899,66.961,23.039,99.9884
556,557,4880,3123,3251,275.927,57.32100000000001,32.679,99.9835
557,558,22168,902,3306,234.946,84.3827,5.6173199999999985,99.7567
558,559,1432,2388,3232,260.676,18.8999,71.1001,99.9021
559,560,4080,147,3248,39.9818,73.8281,16.1719,99.9486
560,561,5026,1093,3248,66.9912,74.5016,15.4984,99.9891
561,562,30334,1567,3326,350.576,76.2469,13.7531,99.8545
562,563,6579,2607,3312,87.9631,39.7239,50.2761,99.767
563,564,1315,2545,3234,92.0738,37.6345,52.3655,99.9897
564,565,508,1767,3229,269.981,30.941,59.059,99.974
565,566,2480,1187,3266,93.6568,4.76414,85.2359,99.9811
566,567,1110,333,3251,63.0333,13.4708,76.5292,99.9904
567,568,5778,2346,3273,247.037,29.8143,60.1857,99.9733
568,569,26525,427,3381,110.57,69.5417,20.4583,99.6417
569,570,828,219,3241,44.6621,76.9077,13.0923,99.9983
570,571,679,263,3245,88.3326,37.2505,52.7495,99.9876
571,572,1052,1808,3255,269.622,29.8773,60.1227,99.9416
572,573,14057,529,3291,64.329,79.7058,10.2942,99.987
573,574,725,62,3251,249.577,29.7591,60.2409,99.9404
574,575,4480,38,3302,265.271,11.2038,78.7962,99.901
575,576,1024,86,3271,264.596,24.6141,65.3859,99.9986
576,577,1309,2154,3278,279.63,77.9939,12.0061,99.9956
577,578,3880,1025,3290,91.0063,64.6293,25.3707,99.9929
578,579,5180,309,3305,225.984,82.0464,7.953589999999998,99.9947
579,580,658,2766,3275,80.0186,17.4984,72.5016,99.9955
580,581,10058,208,3314,106.866,61.4143,28.5857,99.9951
581,582,10586,2394,3378,253.599,40.4589,49.5411,99.9521
582,583,2161,2805,3296,272.222,49.9491,40.0509,99.9984
583,584,576,3403,3288,86.4567,20.5245,69.4755,99.9493
584,585,1410,2723,3299,256.443,33.6004,56.3996,99.9875
585,586,20724,2220,3355,263.598,27.5015,62.4985,99.9387
586,587,13073,1757,3357,245.862,46.9332,43.0668,99.9929
587,588,797,2861,3301,265.246,53.239,36.761,99.8756
588,589,13457,706,3340,61.3576,19.5478,70.4522,99.991
589,590,2270,2069,3296,267.097,28.4747,61.5253,99.9635
590,591,19662,3184,3379,99.9387,39.2867,50.7133,99.9632
591,592,1211,1129,3300,260.485,36.4655,53.5345,99.9879
592,593,1233,1085,3309,82.5259,21.2029,68.7971,99.9904
593,594,12811,2017,3351,281.125,59.1337,30.8663,99.9079
594,595,5735,106,3341,77.7692,33.5774,56.4226,99.9937
595,596,2093,1671,3313,65.5183,26.3972,63.6028,99.9723
596,597,3641,2762,3332,273.063,48.9687,41.0313,99.9892
597,598,1419,3058,3342,267.624,29.3699,60.6301,99.9855
598,599,10006,2673,3387,77.2396,23.847,66.153,99.9591
599,600,3121,2454,3360,85.9342,15.2608,74.7392,99.468
600,601,1145,1027,3334,266.346,2.74865,87.2514,99.985
601,602,667,2352,3328,263.423,23.8904,66.1096,99.9917
602,603,9733,1066,3381,253.943,82.435,7.56504,99.9558
603,604,958,2324,3353,243.538,72.8671,17.1329,99.9955
604,605,1900,908,3355,290.164,35.2051,54.7949,99.9944
605,606,871,2364,3352,264.826,40.8546,49.1454,99.9941
606,607,531,283,3347,256.863,69.7421,20.258,99.995
607,608,723,990,3353,249.896,17.4464,72.5536,99.9776
608,609,36291,855,3468,269.957,50.0078,39.9922,73.8031
609,610,73430,397,3582,174.481,84.2526,5.7474,37.671
610,611,1123,1492,3360,75.1932,22.9937,67.0063,99.9821
611,612,14381,2809,3433,85.0506,33.3198,56.6802,99.9866
612,613,1912,34,3377,75.3815,23.8535,66.1465,99.941
613,614,3112,535,3375,256.758,9.14483,80.8552,99.9927
614,615,25405,2507,3487,95.7591,17.8142,72.1858,82.2378
615,616,887,1250,3384,75.1055,33.0963,56.9037,99.81
616,617,14347,2097,3446,258.339,71.9159,18.0841,99.8972
617,618,5004,3031,3407,93.3166,23.4537,66.5463,99.9754
618,619,11163,137,3426,87.2631,24.2749,65.7251,99.9028
619,620,5721,2299,3422,267.968,42.228,47.772,99.9507
620,621,10606,1952,3445,248.077,47.2693,42.7307,99.7783
621,622,4239,1200,3417,93.071,1.3918,88.6082,99.8494
622,623,3630,3123,3440,265.064,6.17358,83.8264,99.9576
623,624,6637,651,3423,30.9773,57.555,32.445,99.9211
624,625,1708,1674,3411,284.61,56.7612,33.2388,99.9712
625,626,5681,1710,3454,13.9246,79.6687,10.3313,99.9548
626,627,2947,36,3441,263.539,9.09845,80.9016,99.936
627,628,2672,2723,3440,254.862,14.1403,75.8597,99.9852
628,629,4882,3295,3448,291.04,67.987,22.0131,99.9858
629,630,7320,563,3472,257.586,11.7981,78.2019,96.3116
630,631,23476,1796,3529,253.672,45.5808,44.4192,93.3618
631,632,6639,1068,3459,83.6494,27.6032,62.3968,99.98
632,633,1990,3074,3461,78.3757,44.0183,45.9817,99.9931
633,634,7651,2607,3473,278.022,11.5098,78.4902,99.8511
634,635,44532,1273,3524,78.7813,34.3486,55.6514,92.5227
635,636,1694,3363,3450,255.269,6.3151199999999985,83.6849,99.9802
636,637,965,2991,3454,80.7761,44.2323,45.7677,99.9731
637,638,5481,2230,3485,55.8023,17.5878,72.4122,99.9948
638,639,615,991,3453,181.992,82.9008,7.09915,99.9792
639,640,665,3408,3463,73.7608,14.4852,75.5148,99.9573
640,641,2018,2342,3469,249.301,17.8985,72.1015,99.9925
641,642,17321,1522,3514,263.166,19.4015,70.5985,99.0101
642,643,8366,675,3506,60.9819,19.9629,70.0371,43.0504
643,644,27104,2757,3555,62.9021,11.2123,78.7877,82.8457
644,645,14076,99,3526,73.1604,23.0787,66.9213,92.9236
645,646,34754,3158,3565,156.666,80.6236,9.37635,98.7172
646,647,3805,3001,3511,264.82,1.55235,88.4477,99.9874
647,648,1562,2378,3504,77.2249,38.7194,51.2806,99.9804
648,649,4790,3373,3541,74.3464,13.5708,76.4292,99.8721
649,650,2151,2299,3519,237.08,6.30598,83.694,99.966
650,651,1872,3314,3516,40.3899,41.658,48.342,99.9878
651,652,645,1995,3512,110.986,65.6355,24.3645,99.9936
652,653,26243,216,3631,254.046,8.79748,81.2025,99.9971
653,654,9423,1595,3566,84.2222,48.5447,41.4553,99.7808
654,655,5712,295,3545,85.7956,1.04873,88.9513,99.9987
655,656,18399,2063,3597,115.666,73.292,16.708,99.3506
656,657,17280,1957,3628,269.945,49.2247,40.7753,77.6736
657,658,22391,2944,3655,73.795,29.4215,60.5785,92.9074
658,659,14381,1090,3601,82.4946,64.8505,25.1495,99.9803
659,660,1250,2210,3544,236.942,8.91043,81.0896,99.6456
660,661,2472,646,3565,263.151,12.6468,77.3532,99.9945
661,662,5007,3295,3608,262.051,69.8315,20.1685,99.7288
662,663,772,18,3552,77.3743,3.2998300000000005,86.7002,99.9156
663,664,59872,2464,3846,91.5367,12.6679,77.3321,70.1904
664,665,10650,2298,3608,77.9858,14.8974,75.1026,99.9403
665,666,2037,593,3575,266.592,44.7429,45.2571,99.9949
666,667,557,1000,3568,280.092,82.588,7.411969999999998,99.9953
667,668,16763,755,3648,257.782,5.36993,84.6301,99.9938
668,669,909,1866,3578,237.455,55.146,34.854,99.9469
669,670,7119,3029,3618,234.298,68.8479,21.1521,99.9788
670,671,7384,2198,3610,72.1133,35.157,54.843,99.9928
671,672,4618,2526,3602,70.1424,48.5698,41.4302,99.963
672,673,1478,529,3595,267.681,45.9045,44.0955,99.9959
673,674,3041,813,3604,248.17,50.5007,39.4993,99.9671
674,675,4628,885,3599,31.3115,51.8149,38.1851,99.9588
675,676,965,684,3590,226.849,12.0631,77.9369,99.9937
676,677,1962,2125,3597,272.721,30.5905,59.4095,99.9716
677,678,3093,1652,3606,52.6396,21.5817,68.4183,99.9912
678,679,741,18,3594,54.0983,62.3948,27.6052,99.9006
679,680,573,1796,3587,79.9656,59.2179,30.7821,99.961
680,681,16222,2676,3672,216.897,70.0515,19.9485,99.9739
681,682,3032,1290,3620,71.767,35.9259,54.0741,99.9861
682,683,2240,3386,3633,74.0266,0.523567,89.4764,99.9592
683,684,1900,1883,3627,79.7083,10.638,79.362,99.9898
684,685,810,2822,3616,67.2936,54.2623,35.7377,99.9749
685,686,969,1514,3615,54.3131,59.5123,30.4877,99.9874
686,687,1445,101,3632,267.626,43.2364,46.7636,99.9923
687,688,5274,643,3640,251.251,49.1584,40.8416,99.9966
688,689,2983,577,3634,95.2296,65.3449,24.6551,99.9664
689,690,4359,973,3659,263.478,50.1177,39.8823,99.9436
690,691,26981,1390,3705,275.77,83.0651,6.93492,93.2853
691,692,904,995,3630,213.397,51.005,38.995,99.9959
692,693,2823,1805,3639,78.1367,36.0222,53.9778,99.9886
693,694,651,1844,3646,78.9844,58.5409,31.4591,99.9448
694,695,1586,910,3635,83.9027,4.56536,85.4346,99.9954
695,696,10954,2350,3700,234.984,15.2328,74.7672,99.9184
696,697,720,69,3633,254.876,0.0536652,89.9463,99.994
697,698,24107,2881,3817,235.373,20.1393,69.8607,99.8905
698,699,1070,3348,3655,262.28,70.8577,19.1423,99.9319
699,700,5055,44,3675,96.4363,34.5255,55.4745,99.9802
700,701,10371,2595,3713,87.4065,1.7971400000000002,88.2029,99.9656
701,702,1438,1571,3648,90.3515,33.3131,56.6869,99.9489
702,703,8141,1639,3673,88.9109,35.6709,54.3291,99.9632
703,704,1458,2545,3646,314.948,77.7479,12.252,99.9939
704,705,2072,1507,3656,303.546,64.3749,25.6251,99.9814
705,706,1179,2152,3652,95.4602,17.3489,72.6511,99.9908
706,707,3975,2821,3693,229.524,69.9434,20.0566,99.9398
707,708,1325,531,3661,267.93,46.8752,43.1248,99.9719
708,709,1345,1169,3670,258.78,42.9325,47.0675,99.9872
709,710,11438,169,3739,77.9454,13.9848,76.0152,99.9557
710,711,6370,2240,3701,286.488,75.3779,14.6221,99.9711
711,712,5212,2506,3695,101.318,59.1338,30.8662,99.9905
712,713,9794,1258,3724,67.5191,0.8613280000000001,89.1387,99.9775
713,714,6278,1043,3700,250.867,8.7851,81.2149,99.9761
714,715,542,1755,3668,51.0877,26.7435,63.2565,99.6507
715,716,112849,854,3941,265.593,8.65668,81.3433,66.4051
716,717,1120,1872,3681,252.938,8.87756,81.1224,99.9883
717,718,6563,3312,3716,307.803,71.9442,18.0558,99.9896
718,719,12061,2119,3733,83.4747,58.8202,31.1798,99.8302
719,720,9806,3114,3746,78.9046,17.5823,72.4177,99.8963
720,721,746,1197,3690,80.4748,34.1888,55.8112,99.9743
721,722,849,1821,3689,74.1035,10.1417,79.8583,99.995
722,723,6260,622,3728,242.291,38.7272,51.2728,99.9656
723,724,2982,3226,3720,252.637,10.6466,79.3534,99.9896
724,725,979,3380,3694,261.22700000000003,72.1834,17.8166,99.9517
725,726,1246,1518,3700,92.0709,22.5191,67.4809,99.9915
726,727,716,3158,3694,237.607,36.741,53.25899999999999,99.9962
727,728,6194,1737,3720,222.455,55.455,34.545,99.9922
728,729,15525,314,3777,106.864,61.2626,28.7374,99.9661
729,730,2504,1122,3718,253.878,37.3068,52.6932,99.9929
730,731,880,678,3709,91.6267,63.7332,26.2668,99.9966
731,732,4593,84,3740,246.363,60.5873,29.4127,99.9959
732,733,17972,1889,3796,261.225,13.0569,76.9431,98.4262
733,734,1016,2777,3714,233.382,19.104,70.896,99.9981
734,735,4490,1575,3738,68.5616,29.2875,60.7125,99.9794
735,736,41553,1582,3883,267.47700000000003,14.0768,75.9232,96.9531
736,737,995,3369,3732,37.7376,38.8997,51.1003,99.8935
737,738,1082,1162,3724,70.7251,2.25246,87.7475,99.9561
738,739,6267,1054,3766,98.0913,15.4089,74.5911,99.9044
739,740,659,775,3734,214.467,45.8889,44.1111,99.9968
740,741,8934,3007,3787,351.654,75.551,14.449000000000002,99.9822
741,742,1225,1800,3741,1.15269,73.6867,16.3133,99.996
742,743,1224,1991,3743,167.907,84.9378,5.0621800000000015,99.9889
743,744,8908,704,3790,240.424,36.8574,53.1426,99.9395
744,745,1251,1509,3745,325.4290000000001,82.1338,7.86618,99.9038
745,746,8940,1267,3811,349.9190000000001,54.8251,35.1749,99.9611
746,747,7151,2776,3782,56.3073,86.2134,3.78662,99.9884
747,748,1812,674,3762,218.664,44.051,45.949,99.9947
748,749,1706,1970,3771,263.205,9.24965,80.7504,99.9168
749,750,5027,3271,3790,263.33,31.8792,58.1208,99.9893
750,751,8377,2541,3824,79.2592,44.2873,45.7127,99.9655
751,752,1375,1113,3771,252.551,6.5254400000000015,83.4746,99.9841
752,753,8628,2272,3798,75.8213,56.5863,33.4137,99.8885
753,754,2157,28,3791,252.665,11.6726,78.3274,99.9045
754,755,4524,1789,3797,92.9138,50.7234,39.2766,99.9802
755,756,2397,1156,3800,66.568,1.80842,88.1916,99.9289
756,757,12446,3179,3839,102.711,72.8944,17.1056,99.9487
757,758,6480,3359,3816,59.646,2.90421,87.0958,99.8218
758,759,1312,2698,3791,81.3493,49.7607,40.2393,99.982
759,760,2793,99,3803,98.0512,32.7747,57.2253,99.9742
760,761,2734,1508,3798,68.0748,26.7668,63.2332,99.9778
761,762,1151,2032,3791,46.5048,59.6181,30.3819,99.9632
762,763,4884,511,3856,263.719,14.6403,75.3597,99.2444
763,764,897,2116,3800,235.11,60.7648,29.2352,99.7041
764,765,932,2652,3799,79.2599,42.7663,47.2337,99.9973
765,766,13645,415,3860,73.8935,16.6245,73.3755,83.4637
766,767,790,1386,3810,204.533,83.5918,6.4081800000000015,99.9853
767,768,521,1351,3803,178.16,86.5203,3.4797,99.9847
768,769,4086,2010,3836,233.049,10.7223,79.2777,99.9968
769,770,2587,146,3827,66.8858,73.98899999999998,16.011,99.9985
770,771,7711,880,3851,236.037,15.1618,74.8382,99.9856
771,772,1461,1111,3820,65.8605,64.9036,25.0964,99.9951
772,773,4347,2599,3845,258.285,18.9997,71.0003,99.9937
773,774,1019,488,3823,250.701,32.983000000000004,57.017,99.9865
774,775,671,2154,3818,81.8008,60.8469,29.1531,99.6411
775,776,1021,54,3832,246.049,15.4408,74.5592,99.967
776,777,1263,1426,3828,248.77,0.102028,89.898,99.8459
777,778,8014,2206,3878,234.025,45.573,44.427,99.9603
778,779,1077,589,3829,214.067,19.4741,70.5259,99.9681
779,780,1885,2733,3831,257.524,9.83436,80.1656,99.9946
780,781,1417,720,3834,248.779,11.2407,78.7593,99.5754
781,782,1472,227,3832,263.631,15.3493,74.6507,99.9962
782,783,7169,782,3863,266.303,36.4748,53.5252,99.9567
783,784,921,2651,3839,85.9733,43.4082,46.5918,99.4554
784,785,9525,2064,3882,240.063,47.1868,42.8132,99.9925
785,786,20834,1224,3913,124.355,65.2194,24.7806,99.9735
786,787,2509,2690,3853,257.025,19.2095,70.7905,99.996
787,788,18911,631,3905,259.191,11.6661,78.3339,99.8045
788,789,18363,3332,3958,258.468,19.7992,70.2008,99.6094
789,790,6426,188,3886,255.163,17.0524,72.9476,99.9883
790,791,1499,1087,3856,272.332,34.7064,55.2936,99.9952
791,792,8137,1792,3883,79.1326,20.6443,69.3557,99.9888
792,793,6202,3015,3869,72.0852,3.638630000000001,86.3614,99.9939
793,794,967,29,3868,273.993,40.5576,49.4424,99.9851
794,795,5802,61,3917,44.5172,36.1938,53.8062,99.7069
795,796,6112,2151,3891,68.0226,38.8704,51.1296,99.9822
796,797,1395,3310,3875,61.4175,5.45451,84.5455,99.9729
797,798,3224,1117,3894,244.927,15.4914,74.5086,99.9755
798,799,10239,1411,3907,48.2205,3.3459800000000004,86.654,99.9772
799,800,898,119,3871,44.5533,34.2951,55.7049,99.9852
800,801,2769,2268,3880,75.6034,28.1287,61.8713,99.9959
801,802,12147,1688,3914,96.9584,66.6031,23.397,99.984
802,803,1722,1310,3893,253.368,0.485222,89.5148,99.9785
803,804,1710,1974,3890,277.861,58.3279,31.6721,99.9898
804,805,4264,316,3891,189.148,76.2315,13.7685,99.887
805,806,2464,251,3898,44.2641,48.1731,41.8269,99.9743
806,807,893,2332,3883,229.476,17.8038,72.1962,99.619
807,808,34670,2709,3983,238.656,55.0286,34.9714,87.6108
808,809,9990,2823,3931,222.628,70.6418,19.3582,99.9845
809,810,1648,110,3912,260.119,20.11,69.89,99.9969
810,811,10247,1951,3963,83.1966,18.7294,71.2706,98.7317
811,812,3377,3114,3915,276.811,39.5093,50.4907,99.9968
812,813,3096,850,3922,257.442,25.7684,64.2316,99.9833
813,814,226990,2047,4361,56.8026,35.3161,54.6839,53.3493
814,815,9894,3015,3948,93.6155,28.4022,61.5978,99.9805
815,816,915,11,3924,111.122,62.1455,27.8545,99.9425
816,817,5179,1861,3944,272.946,37.0919,52.9081,99.9856
817,818,503,2378,3911,85.6144,23.4927,66.5073,99.9925
818,819,55210,3155,4071,239.271,46.3708,43.6292,73.0451
819,820,4743,1336,3977,267.034,15.4747,74.5253,99.9336
820,821,3825,2092,3953,161.606,83.4042,6.59582,99.9775
821,822,3295,156,3955,37.724,46.7704,43.2296,99.8376
822,823,7484,244,3974,46.875,37.9862,52.0138,99.6117
823,824,14621,350,4002,85.7858,7.07735,82.9227,99.9878
824,825,5660,2407,3988,309.033,81.925,8.075,99.9819
825,826,2942,2234,3969,73.2694,29.3679,60.6321,99.9931
826,827,6178,802,3973,199.591,63.7889,26.2111,99.9947
827,828,1450,425,3961,176.243,74.5094,15.4906,99.9757
828,829,703,107,3958,267.403,15.4676,74.5324,99.9945
829,830,2193,1785,3969,255.699,23.3285,66.6715,99.9851
830,831,869,1626,3967,239.323,72.0994,17.9006,99.9902
831,832,23824,1724,4053,268.515,2.85907,87.1409,54.1099
832,833,3604,1212,4007,70.9291,54.8106,35.1894,99.7508
833,834,882,79,3981,81.042,32.7626,57.2374,99.983
834,835,787,1390,3994,251.984,37.0109,52.9891,99.9483
835,836,1802,1429,4010,49.4257,3.45019,86.5498,99.9107
836,837,1573,2089,4000,236.299,48.483,41.517,99.9872
837,838,17020,2910,4085,77.65100000000002,21.7812,68.2188,98.9366
838,839,532,1833,4009,99.3374,55.599,34.401,99.957
839,840,17055,214,4066,97.1918,52.6145,37.3855,99.9796
840,841,1259,94,4034,79.12899999999998,33.7606,56.2394,99.988
841,842,626,3030,4012,170.357,69.3298,20.6702,99.9589
842,843,1530,2984,4026,170.604,67.7702,22.2298,99.9853
843,844,2310,49,4044,80.5493,33.2153,56.7847,99.9651
844,845,1100,1296,4028,260.532,37.4843,52.5157,99.0243
845,846,3342,515,4048,242.45,38.632,51.368,99.9796
846,847,3561,1174,4049,266.71,17.1482,72.8518,99.9849
847,848,3378,1378,4059,266.752,12.1268,77.8732,99.9943
848,849,34314,809,4147,104.265,56.1208,33.8792,99.9706
849,850,985,1506,4053,266.309,35.8878,54.1122,99.989
850,851,1820,1572,4058,277.91200000000003,73.1757,16.8243,99.9936
851,852,1216,3011,4058,263.659,50.382,39.618,99.767
852,853,5556,1296,4073,54.0055,69.03699999999999,20.963,99.9691
853,854,1103,2629,4059,91.4306,25.6649,64.3351,99.9662
854,855,4112,1457,4083,74.3911,60.0346,29.9654,99.9442
855,856,1137,410,4073,237.211,3.78909,86.2109,99.9818
856,857,7270,638,4108,11.413,54.6109,35.3891,99.7894
857,858,55696,2240,4180,255.794,14.2897,75.7103,99.999
858,859,15763,2487,4163,86.3639,16.26,73.74,99.9178
859,860,6553,101,4112,76.0341,20.6453,69.3547,99.9806
860,861,29724,1031,4247,251.289,37.23,52.77,99.9298
861,862,87715,2686,4221,238.462,50.2136,39.7864,99.9824
862,863,769,1526,4081,275.66700000000003,73.1974,16.8026,99.9985
863,864,8620,3337,4140,257.163,76.749,13.251,99.9587
864,865,731,343,4086,236.743,1.3451799999999998,88.6548,99.9344
865,866,280683,385,4401,277.357,39.0267,50.9733,31.0117
866,867,30158,1183,4163,98.6993,67.1915,22.8085,99.9364
867,868,3842,1400,4119,256.96,38.8584,51.1416,99.9259
868,869,762,3006,4104,259.83,14.3934,75.6066,99.9903
869,870,1426,163,4114,263.951,24.1987,65.8013,99.9986
870,871,11191,1624,4184,80.6573,61.2605,28.7395,99.9655
871,872,713,1828,4111,277.569,34.2936,55.7064,99.9928
872,873,4440,41,4148,75.3184,40.731,49.269,99.886
873,874,6213,348,4144,343.745,65.8056,24.1944,99.9982
874,875,667,1768,4113,269.135,8.98982,81.0102,99.9906
875,876,2728,3224,4135,258.017,7.17558,82.8244,99.8961
876,877,2354,401,4162,262.583,17.0581,72.9419,99.9962
877,878,10123,2424,4181,187.154,74.3488,15.6512,99.9547
878,879,123914,1320,4391,264.191,15.8195,74.1805,83.1995
879,880,2631,1801,4151,71.6105,29.4648,60.5352,99.993
880,881,8528,1481,4173,249.31,25.6753,64.3247,99.9852
881,882,23582,1750,4233,67.4992,14.7731,75.2269,99.9917
882,883,16404,3015,4222,112.573,45.2238,44.7762,99.9731
883,884,3550,1558,4206,93.1687,50.3164,39.6836,99.9338
884,885,5605,3273,4206,260.503,21.7807,68.2193,99.9871
885,886,66958,941,4505,267.85,20.7356,69.2644,91.9547
886,887,12410,103,4221,315.707,70.8093,19.1907,99.883
887,888,804,693,4194,19.8149,58.0228,31.9772,99.9853
888,889,586,3225,4194,228.634,23.7567,66.2433,99.9376
889,890,16165,2101,4284,48.056,15.9407,74.0593,99.9903
890,891,1995,2896,4218,260.096,68.2951,21.7049,99.9934
891,892,3118,1060,4255,268.237,18.183,71.817,99.9743
892,893,8655,3347,4260,258.223,2.85335,87.1467,99.9525
893,894,13621,1523,4304,64.1666,52.8696,37.1304,99.9897
894,895,116329,2912,4462,275.207,31.4818,58.5182,84.9209
895,896,6754,3244,4291,277.75,41.6596,48.3404,99.9754
896,897,7362,1138,4283,254.223,82.3158,7.684189999999999,99.988
897,898,27551,2454,4365,136.393,56.2293,33.7707,66.7707
898,899,569,24,4269,80.1375,30.2973,59.7027,99.8965
899,900,4302,812,4291,54.3286,2.40888,87.5911,99.9444
900,901,878,3130,4268,228.728,48.168,41.832,99.9971
901,902,822,1809,4273,245.58,68.0091,21.9909,99.9954
902,903,11082,1663,4331,83.5277,18.9362,71.0638,99.9016
903,904,866,3173,4293,83.6169,28.5089,61.4911,99.9245
904,905,13408,3128,4344,279.691,40.234,49.76600000000001,99.98
905,906,2375,38,4312,103.04,26.2575,63.7425,99.9406
906,907,958,3385,4317,259.362,23.9793,66.0207,99.9574
907,908,521,622,4310,263.05400000000003,15.9647,74.0353,99.9906
908,909,2033,887,4335,88.5035,6.530869999999998,83.4691,99.9895
909,910,5498,1822,4364,67.208,24.5776,65.4224,99.9394
910,911,5137,833,4372,97.5411,22.2072,67.7928,99.9858
911,912,4246,2248,4334,75.7755,7.60597,82.39399999999998,99.9942
912,913,8053,738,4350,131.82,81.17399999999998,8.82597,99.9425
913,914,54437,3240,4536,254.385,36.5075,53.4925,88.2071
914,915,5549,3227,4403,273.441,51.0641,38.9359,99.9773
915,916,3889,22,4381,80.6407,49.4346,40.5654,99.9734
916,917,789,1582,4348,268.024,8.76801,81.232,99.987
917,918,4331,2342,4375,274.031,16.6499,73.3501,99.9917
918,919,7503,2159,4393,174.84,70.9852,19.0148,99.9942
919,920,547,2292,4354,179.295,71.9231,18.0769,99.8939
920,921,580,3228,4362,87.1585,36.5861,53.4139,99.9948
921,922,1670,2104,4383,260.723,14.5278,75.4722,99.9976
922,923,3816,1018,4388,106.931,23.0145,66.9855,99.9852
923,924,2901,1605,4386,104.786,20.9397,69.0603,99.9684
924,925,6751,526,4401,176.68599999999995,73.4021,16.5979,99.9776
925,926,3647,1719,4414,266.972,10.2271,79.7729,99.9847
926,927,3723,2663,4420,266.635,33.1016,56.8984,99.9966
927,928,962,733,4405,50.8545,1.48358,88.5164,99.9883
928,929,781,3069,4414,92.8746,25.8619,64.1381,99.9942
929,930,2275,1579,4453,240.646,40.9357,49.0643,99.9621
930,931,11282,2592,4471,92.6284,34.9288,55.0712,99.9939
931,932,1907,3123,4422,89.5867,27.2933,62.7067,99.9319
932,933,26117,2417,4525,136.053,81.57600000000002,8.42401,89.2787
933,934,2044,491,4440,340.68,72.7421,17.2579,99.9957
934,935,1839,1061,4454,264.749,4.12786,85.8721,99.9755
935,936,1310,1017,4451,102.625,22.5536,67.4464,99.9952
936,937,66521,1704,4592,73.0639,35.0068,54.9932,99.83
937,938,1912,1486,4479,247.757,2.8554,87.1446,99.986
938,939,9352,835,4557,87.5188,38.9512,51.0488,98.2275
939,940,1933,3265,4496,269.636,51.6056,38.3944,99.9928
940,941,41694,2754,4617,83.4596,33.7151,56.2849,99.7255
941,942,42316,664,4654,264.805,22.1486,67.8514,98.6227
942,943,716,1305,4560,66.9586,28.6848,61.3152,99.9927
943,944,960,872,4578,140.108,70.8557,19.1443,99.9907
944,945,14243,1181,4619,68.0351,28.6904,61.3096,99.9857
945,946,6337,1370,4605,25.4707,43.573,46.427,99.9122
946,947,19525,2532,4638,13.9103,55.0273,34.9727,99.9077
947,948,9067,2248,4642,86.0446,9.47064,80.5294,99.9541
948,949,1014,182,4581,74.4916,27.8913,62.1087,99.9965
949,950,1439,1266,4591,107.704,2.87056,87.1294,99.9948
950,951,4028,487,4607,266.889,11.174,78.82600000000002,99.9862
951,952,1495,1108,4644,107.729,3.98737,86.0126,99.985
952,953,14804,2363,4673,71.6668,11.2665,78.7335,99.7156
953,954,3741,181,4649,332.76,71.9516,18.0484,99.9905
954,955,1564,604,4620,67.9535,26.5154,63.4846,99.9908
955,956,6361,1528,4664,94.6843,4.696280000000002,85.3037,99.974
956,957,1139,1879,4635,75.0612,45.8284,44.1716,99.9823
957,958,3241,1290,4656,96.6962,13.0998,76.9002,99.9934
958,959,6051,1417,4670,37.8638,61.778,28.222,99.2639
959,960,1788,112,4655,55.9073,28.8844,61.1156,99.9957
960,961,937,3107,4658,250.133,23.2128,66.7872,99.9864
961,962,10500,1070,4698,77.09899999999998,58.6913,31.3087,99.8554
962,963,2337,3164,4674,234.476,36.0362,53.9638,99.9702
963,964,2410,315,4686,251.468,5.74524,84.2548,99.8698
964,965,5236,1342,4700,279.371,32.6044,57.3956,99.9049
965,966,3066,2642,4714,267.887,32.2783,57.7217,99.9313
966,967,782,3066,4701,266.254,42.1028,47.8972,99.9776
967,968,695,1473,4715,94.6917,4.74149,85.2585,99.9599
968,969,2113,2531,4713,262.04400000000004,42.0723,47.9277,99.9749
969,970,2403,1213,4708,103.605,2.60574,87.3943,99.8438
970,971,689,2208,4710,82.44,29.5748,60.4252,99.9823
971,972,639,2081,4718,86.9432,26.9463,63.0537,99.967
972,973,921,1973,4722,87.4706,26.5633,63.4367,99.9815
973,974,523,580,4759,275.422,18.661,71.339,99.625
