,Grain No.,Size [Pixel],center x-coordinate,center y-coordinate,mean azimuth [degree],mean latitude [degree],mean colatitude [degree],Regelungsgrad [%]
0,1,120352,282,438,85.6106,0.502129,89.4979,68.5596
1,2,2819,25,286,263.682,1.23804,88.762,99.7412
2,3,3784,740,284,229.965,71.9527,18.0473,99.9278
3,4,956,366,277,251.687,48.7916,41.2084,99.9721
4,5,512,972,271,97.6883,36.3752,53.6248,99.8678
5,6,7885,1797,318,72.8237,24.8822,65.1178,99.9163
6,7,22721,1661,370,328.405,80.8292,9.17078,99.8767
7,8,18686,504,344,84.5043,7.15929,82.8407,93.7826
8,9,7647,627,313,89.7268,60.9201,29.0799,99.9887
9,10,886,3029,299,266.73900000000003,27.3186,62.6814,99.8015
10,11,2766,1963,310,70.3916,20.2726,69.7274,99.2629
11,12,41019,1066,369,69.7715,43.0498,46.9502,87.7789
12,13,7418,1439,329,262.423,0.968964,89.031,99.8652
13,14,2488,2263,304,230.305,73.5828,16.4172,99.8764
14,15,3862,368,340,41.8599,35.4233,54.5767,99.9484
15,16,4626,1347,315,99.7805,28.9551,61.0449,99.9713
16,17,4693,2985,318,266.087,25.4573,64.5427,99.0777
17,18,168456,2477,570,276.436,51.346,38.654,57.86600000000001
18,19,4358,1253,314,103.963,33.5153,56.4847,99.9708
19,20,1411,2794,300,93.6297,57.4968,32.5032,99.483
20,21,1403,1157,307,97.0845,41.4239,48.5761,99.9652
21,22,1620,804,311,94.4078,37.1343,52.8657,99.9969
22,23,3127,2361,322,79.979,28.6559,61.3441,99.9315
23,24,1574,2901,321,275.876,37.8762,52.1238,99.9076
24,25,20020,1838,404,291.14,38.8182,51.1818,99.947
25,26,2831,2151,329,278.831,43.0728,46.9272,99.9817
26,27,24107,1496,422,261.94,8.21238,81.7876,99.2338
27,28,11831,793,399,86.2648,3.41306,86.5869,99.961
28,29,2048,851,343,256.563,44.4062,45.5938,99.997
29,30,1315,2070,330,284.677,78.5512,11.4488,99.9751
30,31,24101,2718,381,106.301,55.5191,34.4809,99.8899
31,32,13552,686,397,92.1718,31.4676,58.5324,99.9746
32,33,9270,2303,398,66.8836,36.0517,53.9483,99.9351
33,34,1275,3123,349,111.08,49.3545,40.6455,99.9736
34,35,1348,3165,351,109.555,49.5277,40.4723,99.9931
35,36,1666,1979,362,258.112,79.3484,10.6516,99.2034
36,37,3214,1290,382,104.824,9.28378,80.7162,99.9753
37,38,21839,3192,436,97.8361,15.2667,74.7333,99.9644
38,39,1451,933,361,94.7019,31.71,58.29,99.9936
39,40,19932,2040,443,283.571,15.5859,74.4141,99.2589
40,41,980,2884,364,79.7826,27.4761,62.5239,99.9909
41,42,511,3082,365,111.073,48.952,41.048,99.9954
42,43,11162,2144,427,284.425,19.4594,70.5406,99.9777
43,44,6267,1346,417,102.367,35.9031,54.0969,99.9345
44,45,13371,52,536,283.625,41.3488,48.6512,99.902
45,46,58734,1087,525,97.7876,0.28083,89.7192,80.2093
46,47,4315,2836,399,260.622,33.1848,56.8152,99.9473
47,48,13372,3032,436,87.9601,23.7384,66.2616,99.5036
48,49,1861,1952,399,210.325,80.89,9.10996,99.8493
49,50,5805,2920,432,106.89,49.3956,40.6044,99.9594
50,51,700,2809,439,257.019,37.8509,52.1491,99.763
51,52,916,613,440,250.965,43.3429,46.6571,99.9959
52,53,3632,2768,471,257.186,42.6365,47.3635,99.9866
53,54,11079,611,506,49.6314,44.0512,45.9488,99.9098
54,55,9933,2198,513,94.0646,18.1875,71.8125,99.9695
55,56,190384,1594,744,124.179,50.6344,39.3656,99.513
56,57,1398,2264,482,258.892,65.8742,24.1258,99.9881
57,58,8737,758,515,257.082,32.0975,57.9025,99.9726
58,59,2331,2835,491,112.34,47.9791,42.0209,99.8672
59,60,25924,1360,568,91.7329,26.9866,63.0134,99.8972
60,61,5823,2959,529,251.354,52.8477,37.1523,99.4723
61,62,2690,3254,529,252.695,54.1374,35.8626,99.5863
62,63,864,1289,489,283.57,4.38387,85.6161,99.9327
63,64,31493,1950,583,268.38,66.1381,23.8619,98.7045
64,65,4071,891,546,257.637,49.5623,40.4377,99.9786
65,66,2795,2783,532,100.153,57.0585,32.9415,99.2914
66,67,13335,146,599,79.3439,78.1308,11.8692,99.9645
67,68,46733,2842,692,262.941,55.6288,34.3712,99.7144
68,69,93677,658,719,89.8603,21.5264,68.4736,99.7413
69,70,2201,2733,547,110.722,49.6194,40.3806,99.0183
70,71,4596,3065,575,85.0191,23.5456,66.4544,99.8466
71,72,6206,2112,594,302.055,79.8282,10.1718,99.9406
72,73,1836,393,580,86.0116,35.2844,54.7156,99.9706
73,74,575,3006,564,86.3161,39.1992,50.8008,99.1835
74,75,9511,972,604,45.565,42.2117,47.7883,99.9428
75,76,9730,3167,601,272.103,28.849,61.151,99.9401
76,77,1298,801,579,256.768,49.6693,40.3307,99.9951
77,78,15100,891,683,79.2746,40.3618,49.6382,99.956
78,79,1556,1753,595,274.447,51.778,38.222,99.983
79,80,5829,2195,608,245.004,79.1022,10.8978,99.9594
80,81,71068,329,782,92.4222,34.6293,55.3707,99.9304
81,82,2196,3241,637,91.6542,40.9722,49.0278,99.9582
82,83,29976,3042,701,88.3034,8.59126,81.4087,99.6138
83,84,35173,1108,741,276.248,25.177,64.82300000000001,99.9341
84,85,2126,2144,659,125.334,49.0117,40.9883,99.9728
85,86,8219,61,702,324.405,79.5759,10.4241,99.9362
86,87,16046,1309,717,273.362,0.170471,89.8295,99.9443
87,88,3732,1921,688,285.344,43.0325,46.9675,99.987
88,89,1983,1220,681,278.73,4.24883,85.7512,99.9927
89,90,2770,2066,685,296.048,40.6127,49.3873,99.9877
90,91,961,3219,682,260.987,47.1348,42.8652,99.9882
91,92,4367,987,719,271.418,15.0153,74.9847,98.5781
92,93,975,3168,695,96.328,41.475,48.525,99.9976
93,94,40200,120,906,89.6269,1.93861,88.0614,98.6314
94,95,8498,2126,729,254.915,72.0536,17.9464,99.9639
95,96,30770,1964,794,271.386,35.231,54.769,98.9779
96,97,1421,1865,719,268.458,17.5675,72.4325,99.9816
97,98,1140,3242,726,86.9772,40.9203,49.0797,99.9711
98,99,54525,2502,856,282.212,72.7359,17.2641,99.7387
99,100,970,3187,756,262.883,46.3864,43.6136,99.8743
100,101,955,3157,770,260.293,46.0124,43.9876,99.9945
101,102,10844,2698,821,108.658,49.3704,40.6296,99.8355
102,103,838,2234,775,265.428,71.4799,18.5201,99.9967
103,104,20916,909,843,109.852,60.6885,29.3115,99.9369
104,105,2063,27,787,265.10200000000003,3.12889,86.8711,99.975
105,106,18776,2131,855,277.939,27.0634,62.9366,99.9272
106,107,2086,3227,795,99.6219,41.096,48.904,99.991
107,108,17127,1313,845,270.243,39.1205,50.8795,99.9698
108,109,1824,2206,805,279.492,37.8305,52.1695,99.9891
109,110,614,581,790,80.5847,63.6653,26.3347,99.9944
110,111,6419,2945,828,270.005,24.8756,65.1244,99.6232
111,112,31681,1032,930,263.28700000000003,12.4821,77.5179,99.4176
112,113,2587,3081,814,260.001,54.5454,35.4546,99.9259
113,114,862,2281,815,242.024,69.5242,20.4758,99.9675
114,115,1371,3177,825,260.564,48.9734,41.0266,99.9977
115,116,8448,694,864,279.823,51.6092,38.3908,99.9928
116,117,48124,3179,1010,261.88,20.1277,69.8723,99.9244
117,118,782,22,862,264.363,3.55424,86.4458,99.9464
118,119,22052,250,932,128.238,77.012,12.988,99.7757
119,120,2266,3067,869,258.42400000000004,55.4319,34.5681,99.9674
120,121,666,1759,856,70.08800000000001,5.15661,84.8434,99.9953
121,122,5786,1168,888,271.333,8.59109,81.4089,99.9819
122,123,61992,2225,1030,275.029,66.3535,23.6465,90.0081
123,124,4791,2978,881,273.91900000000004,11.8022,78.1978,99.2316
124,125,69121,1793,1022,253.667,52.9753,37.0247,99.2084
125,126,1237,560,886,273.494,44.8557,45.1443,99.9935
126,127,35484,615,998,271.415,38.8654,51.1346,97.784
127,128,63411,2750,1020,70.7165,56.315,33.685,70.8345
128,129,803,2909,920,112.481,48.7472,41.2528,99.9788
129,130,967,2698,909,96.6173,11.2333,78.7667,99.9827
130,131,31170,1210,1002,261.35200000000003,13.1568,76.8432,99.9023
131,132,4481,1683,942,68.7933,66.5188,23.4812,99.9547
132,133,48954,2967,1090,111.098,48.481,41.519,99.5548
133,134,5094,2039,952,271.576,59.1932,30.8068,99.6621
134,135,4460,815,944,267.249,17.5743,72.4257,99.9661
135,136,1277,741,946,100.882,48.1354,41.8646,99.991
136,137,582,1106,964,279.166,43.8038,46.1962,99.9865
137,138,1602,866,981,95.1687,13.8754,76.1246,99.9817
138,139,853,781,981,89.0997,60.6421,29.3579,99.9703
139,140,3460,437,1034,268.552,43.0897,46.9103,99.9056
140,141,2442,2509,1018,100.501,39.8118,50.1882,99.2728
141,142,916,803,1011,94.1935,47.4366,42.5634,99.7734
142,143,91287,889,1172,74.367,53.5798,36.4202,99.8564
143,144,16230,1453,1063,277.338,5.52494,84.4751,98.7175
144,145,1024,477,1037,268.778,43.5111,46.4889,99.8871
145,146,576,508,1020,275.236,43.8719,46.1281,99.9459
146,147,4550,293,1064,263.644,27.5576,62.4424,99.9786
147,148,7064,2013,1103,19.9321,75.2318,14.7682,99.8829
148,149,4507,160,1079,264.713,14.162,75.83800000000002,99.9882
149,150,1231,781,1072,91.97,48.7903,41.2097,99.9559
150,151,1030,3342,1061,49.6969,77.4398,12.5602,99.5534
151,152,9662,70,1101,94.2036,0.6609189999999999,89.3391,99.9832
152,153,6908,2506,1086,90.6206,63.3266,26.6734,99.8052
153,154,1981,505,1077,266.668,28.5127,61.4873,99.9739
154,155,14480,1278,1124,95.0433,52.3035,37.6965,99.9561
155,156,21052,2373,1177,78.8871,3.48667,86.5133,99.9417
156,157,9297,424,1127,44.8633,78.683,11.317,99.9707
157,158,19736,316,1173,81.9908,1.00073,88.9993,99.9655
158,159,124112,1505,1371,101.711,22.9134,67.0866,87.6363
159,160,595,232,1103,64.3265,73.8211,16.1789,99.905
160,161,1501,1106,1114,101.727,13.5914,76.4086,99.9623
161,162,18636,1885,1174,86.2463,15.032,74.968,99.9191
162,163,2012,1979,1127,83.7857,9.60387,80.3961,98.4371
163,164,17333,580,1198,98.5691,46.9736,43.0264,99.9561
164,165,5500,514,1140,274.556,41.8967,48.1033,99.9422
165,166,2693,1374,1134,95.1733,36.9582,53.0418,99.9905
166,167,51749,2555,1231,234.32,74.4193,15.5807,99.8356
167,168,27093,2138,1217,270.88,31.8385,58.1615,99.9425
168,169,15649,190,1194,257.41200000000003,18.9207,71.0793,99.829
169,170,3241,1073,1160,282.158,48.0987,41.9013,99.985
170,171,13013,1128,1209,99.9969,13.6878,76.3122,99.8845
171,172,22013,3069,1263,274.29200000000003,6.7422,83.2578,99.944
172,173,1792,23,1182,268.547,1.7787099999999998,88.2213,99.9827
173,174,3248,3222,1181,262.087,20.2558,69.7442,99.993
174,175,1419,407,1180,270.358,39.0855,50.9145,99.9986
175,176,4028,81,1204,268.806,2.01688,87.9831,99.9956
176,177,13633,1729,1233,289.18,54.6043,35.3957,99.9381
177,178,2815,3156,1195,272.592,39.6933,50.3067,99.9846
178,179,3033,2028,1195,124.581,48.6922,41.3078,99.9694
179,180,1624,1444,1219,283.136,53.7209,36.2791,99.8735
180,181,740,698,1195,52.0372,37.0684,52.9316,99.9921
181,182,3475,738,1226,84.2832,47.4362,42.5638,99.9967
182,183,16208,2752,1297,262.126,12.9002,77.0998,99.9209
183,184,22424,1199,1295,284.552,72.4404,17.5596,99.92
184,185,9391,1320,1260,82.8089,15.011,74.98899999999998,99.9364
185,186,7277,1980,1255,104.039,44.7349,45.2651,99.1662
186,187,10297,2250,1274,90.6968,37.4556,52.5444,99.9503
187,188,33606,408,1343,255.796,19.8152,70.1848,99.9661
188,189,610,1395,1220,92.0552,0.390953,89.609,99.9848
189,190,3293,3213,1250,280.075,63.9239,26.0761,99.9625
190,191,4261,99,1270,89.2648,3.98354,86.0165,99.992
191,192,685,3176,1232,269.996,49.4816,40.5184,99.9612
192,193,7330,651,1257,295.853,84.5885,5.4115,99.9819
193,194,8151,1444,1291,90.6713,69.3423,20.6577,48.4862
194,195,2934,32,1282,93.1088,12.5996,77.4004,99.9772
195,196,85184,1837,1468,266.46,44.6882,45.3118,99.5781
196,197,1150,504,1273,92.8037,18.1826,71.8174,99.9361
197,198,13576,2340,1345,220.071,71.1858,18.8142,99.8664
198,199,5635,3244,1310,84.8971,7.231160000000001,82.7688,99.9866
199,200,916,3310,1279,81.873,7.68043,82.3196,99.9849
200,201,140432,245,1527,268.806,17.9647,72.0353,99.7732
201,202,23100,3163,1391,263.826,8.024519999999999,81.9755,99.9541
202,203,234400,817,1641,94.2878,47.6102,42.3898,33.4049
203,204,9687,976,1370,91.1942,32.1097,57.8903,99.4109
204,205,15140,2113,1363,282.08,66.1599,23.8401,99.8165
205,206,2883,2872,1335,94.3877,57.5475,32.4525,99.9876
206,207,8431,58,1391,87.6053,7.12259,82.8774,99.8532
207,208,690,1077,1342,101.889,31.6111,58.3889,99.9945
208,209,1473,2620,1353,86.6519,10.7767,79.2233,99.9888
209,210,2406,536,1358,94.2593,20.37,69.63,99.9537
210,211,565,1369,1342,109.808,53.7142,36.2858,99.9958
211,212,823,1408,1345,108.555,54.2247,35.7753,99.9555
212,213,1968,2954,1353,80.8162,18.6923,71.3077,99.845
213,214,594,2685,1363,84.3686,76.6599,13.3401,99.9472
214,215,507,2009,1359,93.7863,1.18086,88.8191,99.99
215,216,2767,2528,1389,93.2958,44.3739,45.6261,99.9552
216,217,3055,2466,1384,92.3937,44.412,45.588,99.5728
217,218,19212,2917,1435,250.584,50.6913,39.3087,99.6391
218,219,559,1030,1380,277.461,50.333,39.667,99.9884
219,220,511,1052,1381,277.60400000000004,48.8306,41.1694,99.9669
220,221,58372,2185,1528,255.625,16.593,73.407,99.9151
221,222,4796,2756,1409,259.95,41.5774,48.4226,99.971
222,223,10046,1135,1430,101.339,35.5366,54.4634,99.8625
223,224,826,3323,1406,82.3032,13.578,76.422,99.9572
224,225,987,3248,1434,272.232,86.41799999999998,3.58195,99.9722
225,226,825,3029,1415,268.436,7.92457,82.0754,99.9875
226,227,1470,2039,1427,106.476,61.3793,28.6207,99.9696
227,228,1348,2619,1436,268.811,20.5285,69.4715,99.9829
228,229,21279,2492,1489,267.143,21.0383,68.9617,98.9746
229,230,755,2328,1426,91.2659,47.5048,42.4952,99.9928
230,231,577,2679,1434,269.713,20.3491,69.6509,99.8844
231,232,7594,2829,1479,257.659,4.83401,85.166,99.976
232,233,1306,2692,1456,271.336,24.1131,65.8869,99.9827
233,234,74803,3163,1662,84.4139,2.25013,87.7499,99.814
234,235,3120,2726,1478,82.8152,64.8608,25.1392,99.9902
235,236,8722,2007,1498,106.089,70.4521,19.5479,99.417
236,237,4997,2392,1530,262.328,2.33646,87.6635,99.9407
237,238,2798,2340,1521,80.8984,63.3811,26.6189,99.0387
238,239,1395,3322,1500,81.445,11.5764,78.4236,99.8942
239,240,856,3014,1487,258.6,52.2523,37.7477,99.9794
240,241,4006,2632,1539,84.801,28.5559,61.4441,99.7609
241,242,805,3263,1494,264.133,10.3067,79.6933,99.976
242,243,373527,1497,1926,257.723,65.3,24.7,59.5649
243,244,72725,2915,1662,87.1572,12.9852,77.0148,99.784
244,245,6859,2565,1573,87.4237,43.3381,46.6619,99.3824
245,246,79741,2652,1769,267.173,24.2658,65.7342,99.7603
246,247,1442,1267,1550,307.827,63.5346,26.4654,99.9769
247,248,26761,1614,1650,270.901,2.49052,87.5095,99.8708
248,249,13939,1960,1632,99.2913,8.18748,81.8125,48.4792
249,250,4305,2037,1602,268.594,1.32895,88.6711,99.9352
250,251,3479,1468,1579,268.125,32.3388,57.6612,99.4655
251,252,2536,2306,1592,287.078,78.6273,11.3727,99.9934
252,253,509,2354,1586,285.122,76.2041,13.7959,99.993
253,254,1928,2452,1607,249.153,75.5621,14.4379,99.9808
254,255,5603,608,1623,81.66,57.9611,32.0389,99.9821
255,256,529,811,1614,285.2290000000001,83.8879,6.11205,99.9475
256,257,19194,686,1686,288.641,53.2861,36.7139,99.9883
257,258,8232,1472,1668,301.581,67.5339,22.4661,99.7214
258,259,15215,2429,1690,265.353,19.2078,70.7922,99.0356
259,260,1138,2509,1652,270.742,2.40823,87.5918,99.9798
260,261,1574,2539,1652,269.123,2.38335,87.6167,99.9923
261,262,1593,2281,1638,267.822,19.9263,70.0737,99.9881
262,263,20347,70,1765,269.556,30.729,59.271,99.8757
263,264,7928,429,1709,77.3739,57.9639,32.0361,99.985
264,265,682,2772,1665,259.80400000000003,6.46413,83.5359,99.9917
265,266,10432,541,1737,88.6377,8.26643,81.7336,99.9698
266,267,18355,2307,1735,82.4095,44.8303,45.1697,99.8509
267,268,15137,1781,1752,82.9396,48.4646,41.5354,99.9773
268,269,17039,855,1748,87.6923,56.8629,33.1371,99.9715
269,270,1508,757,1704,263.773,20.6705,69.3295,99.9654
270,271,4996,2111,1724,94.1525,12.2129,77.7871,99.9416
271,272,111626,329,1923,89.0094,37.7963,52.2037,99.6051
272,273,673,2198,1705,88.2992,8.21751,81.7825,99.9812
273,274,8345,1875,1759,264.409,23.185,66.815,99.9804
274,275,19457,1995,1786,103.099,30.0364,59.9636,98.9233
275,276,2434,2156,1746,93.5698,37.6335,52.3665,99.981
276,277,17310,662,1816,266.757,21.2498,68.7502,99.8354
277,278,12339,2172,1819,92.6881,44.6149,45.3851,99.921
278,279,3887,1681,1797,271.067,22.5518,67.4482,99.9194
279,280,19450,2819,1859,254.403,23.3013,66.6987,99.9198
280,281,3208,2441,1790,263.914,10.6903,79.3097,99.6391
281,282,659,3316,1795,262.719,33.0147,56.9853,99.9459
282,283,8338,2286,1838,263.155,5.00654,84.9935,99.9658
283,284,61755,3011,1982,263.115,41.4835,48.5165,99.2458
284,285,897,528,1796,291.034,68.2025,21.7975,99.9874
285,286,3289,2078,1852,275.143,23.1053,66.8947,99.9601
286,287,1230,543,1827,79.5003,59.6732,30.3268,99.9971
287,288,12346,827,1877,282.581,54.1929,35.8071,99.9558
288,289,736,2453,1834,232.154,71.1796,18.8204,99.9908
289,290,768,3247,1849,264.806,33.5894,56.4106,99.9943
290,291,756,741,1847,286.508,54.0762,35.9238,99.9515
291,292,6340,2423,1877,228.49400000000003,73.8957,16.1043,99.9513
292,293,3931,706,1908,265.967,21.342,68.658,99.9148
293,294,7759,577,1907,98.2317,45.147,44.853,99.9615
294,295,862,666,1889,286.961,52.6811,37.3189,99.9834
295,296,502,57,1895,87.4935,28.4858,61.5142,99.9717
296,297,4893,2355,1917,87.9687,43.0663,46.9337,99.9726
297,298,5340,2075,1928,122.076,67.0499,22.9501,99.9757
298,299,7192,2149,1929,89.2287,1.9688900000000005,88.0311,99.9673
299,300,6201,2542,1917,98.9035,1.43436,88.5656,99.8812
300,301,887,3250,1895,90.14,7.508610000000001,82.4914,99.991
301,302,37938,2180,2112,270.83,23.5501,66.4499,99.8469
302,303,18013,2004,1996,274.205,23.1494,66.8506,99.0951
303,304,15957,3203,1993,205.019,66.2438,23.7562,99.2559
304,305,1002,1049,1939,266.586,35.6329,54.3671,99.9873
305,306,31557,2749,2030,272.016,10.4485,79.5515,97.2105
306,307,652,3312,1947,261.68,33.9457,56.0543,99.9786
307,308,6473,2522,1967,87.5464,14.3119,75.6881,99.3916
308,309,3249,822,1967,89.1609,11.2323,78.7677,99.9893
309,310,4176,56,1968,267.487,32.6586,57.3414,99.9868
310,311,1168,766,1966,278.92400000000004,43.4398,46.5602,99.9762
311,312,1230,2313,1962,91.4942,42.9158,47.0842,99.9835
312,313,3054,714,1968,283.436,53.744,36.256,99.9817
313,314,915,657,1963,287.97,51.3205,38.6795,99.9917
314,315,1619,2743,1981,85.5477,0.6706770000000001,89.3293,99.9924
315,316,74129,2374,2130,82.3098,14.5043,75.4957,99.2694
316,317,826,1042,1980,280.572,53.3793,36.6207,99.9814
317,318,1199,585,1980,90.8153,60.7425,29.2575,99.9745
318,319,532,628,1984,296.036,57.9325,32.0675,99.9854
319,320,2247,718,2015,91.1801,10.9967,79.0033,99.9926
320,321,40646,1074,2109,95.8485,12.3518,77.6482,99.8097
321,322,31917,160,2106,264.216,57.119,32.881,99.9419
322,323,6901,612,2055,285.493,44.3977,45.6023,99.9605
323,324,9839,2067,2094,266.819,38.3789,51.6211,99.8827
324,325,1664,34,2028,85.564,28.4415,61.5585,99.9085
325,326,671,641,2017,97.5083,8.25259,81.7474,99.9897
326,327,3573,739,2057,286.529,42.1045,47.8955,99.9888
327,328,2941,262,2054,40.376,78.0052,11.9948,99.9768
328,329,7614,2564,2101,94.6992,0.0749054,89.9251,99.8781
329,330,844,662,2052,266.748,9.3019,80.6981,99.9969
330,331,576,783,2056,65.0139,14.7542,75.2458,99.9979
331,332,14442,1234,2128,86.8421,8.42641,81.5736,99.8912
332,333,3050,3150,2078,85.1258,37.4387,52.5613,99.833
333,334,809,3112,2094,85.1355,37.6241,52.3759,99.9891
334,335,680,43,2094,85.7629,28.4958,61.5042,99.9817
335,336,1958,2907,2088,273.099,12.7545,77.2455,99.9742
336,337,4263,3228,2143,279.132,61.6046,28.3954,99.9532
337,338,4174,2682,2104,276.903,19.4856,70.5144,99.9749
338,339,3541,447,2119,267.097,32.7458,57.2542,99.747
339,340,6344,606,2123,268.853,9.56111,80.4389,99.967
340,341,24992,549,2209,188.643,78.1029,11.8971,99.9592
341,342,16161,2856,2181,89.82700000000001,41.1356,48.8644,99.9535
342,343,2363,3071,2119,280.889,42.0664,47.9336,99.9873
343,344,41218,1987,2249,90.2606,43.9354,46.0646,99.2997
344,345,3791,3163,2147,278.057,57.3263,32.6737,99.9548
345,346,37569,890,2278,95.1535,36.5635,53.4365,99.8031
346,347,30473,2628,2225,106.282,21.5251,68.4749,99.8721
347,348,1163,2767,2154,272.869,31.4093,58.5907,99.9734
348,349,6771,66,2239,97.7425,47.6363,42.3637,99.9683
349,350,65353,320,2281,272.651,14.53,75.47,99.877
350,351,7618,1259,2201,276.823,36.8362,53.1638,99.9844
351,352,8867,3074,2200,275.902,59.2474,30.7526,99.938
352,353,1936,674,2174,283.191,52.4071,37.5929,99.9945
353,354,6335,716,2217,108.223,60.922,29.078000000000007,99.9901
354,355,6222,1866,2240,266.38,50.673,39.327,99.976
355,356,2221,2766,2220,92.0005,7.57851,82.4215,99.9741
356,357,109784,1281,2339,266.012,4.84895,85.1511,99.3815
357,358,1787,3176,2211,281.065,0.296234,89.7038,99.9711
358,359,1316,3218,2247,271.35,61.6834,28.3166,99.9855
359,360,1696,3143,2239,283.4790000000001,0.645576,89.3544,99.834
360,361,13021,990,2321,278.815,43.6633,46.3367,99.5569
361,362,15515,2944,2294,246.705,77.6729,12.3271,99.9557
362,363,8826,1630,2298,107.338,56.6579,33.3421,99.8447
363,364,847,751,2251,99.4761,35.9171,54.0829,99.9918
364,365,518,779,2269,276.655,44.4342,45.5658,99.9573
365,366,582,671,2266,276.681,50.3878,39.6122,99.9852
366,367,72916,2973,2396,278.991,28.778,61.222,98.547
367,368,9928,2405,2324,259.128,67.6859,22.3141,99.9648
368,369,9247,2497,2339,86.7877,27.112,62.88800000000001,99.7038
369,370,8752,110,2337,268.909,29.4558,60.5442,99.9902
370,371,10758,704,2345,268.463,38.1551,51.8449,99.987
371,372,2252,756,2305,274.314,41.5727,48.4273,99.9621
372,373,7062,503,2333,262.682,23.8005,66.1995,99.9498
373,374,64038,2307,2483,119.646,84.9732,5.02675,99.0662
374,375,535,3163,2306,277.811,32.6839,57.3161,99.9927
375,376,17015,1784,2338,167.72400000000005,75.1818,14.8182,99.9689
376,377,5954,2144,2336,263.48900000000003,44.5973,45.4027,99.8944
377,378,4251,1558,2334,230.746,73.4962,16.5038,99.9517
378,379,8095,608,2346,275.069,9.62066,80.3793,99.9892
379,380,2692,3229,2354,88.2373,57.2465,32.7535,99.9576
380,381,911,3201,2314,281.751,0.469643,89.5304,99.9952
381,382,14422,2623,2373,104.7,18.0765,71.9235,99.9424
382,383,5688,2878,2363,275.32,29.6121,60.3879,99.987
383,384,649,166,2340,270.889,51.6294,38.3706,99.9914
384,385,7779,1641,2395,102.121,27.7924,62.2076,99.9669
385,386,1053,548,2366,278.712,51.0292,38.9708,99.9882
386,387,76948,1886,2497,91.7873,17.173,72.827,92.9438
387,388,8769,2151,2440,277.57,53.7565,36.2435,99.9557
388,389,45425,177,2494,90.1622,9.95876,80.0412,98.2655
389,390,650,787,2389,272.285,52.7691,37.2309,99.9902
390,391,876,2083,2415,100.011,31.3067,58.6933,99.9511
391,392,804,463,2402,259.869,11.9979,78.0021,99.6947
392,393,505,544,2398,274.115,57.3006,32.6994,99.9959
393,394,2520,575,2419,273.16,57.1583,32.8417,99.9923
394,395,4596,1554,2429,266.217,12.2369,77.7631,99.9893
395,396,3479,659,2420,271.97,56.2559,33.7441,99.99
396,397,14204,1225,2468,258.233,39.4641,50.5359,99.8852
397,398,2873,2441,2426,92.163,19.767,70.233,99.7308
398,399,3244,2508,2438,260.264,66.6642,23.3358,99.9819
399,400,97417,577,2542,262.707,7.130319999999998,82.8697,89.7151
400,401,1299,896,2427,79.4476,7.76875,82.2313,99.9854
401,402,2119,3034,2438,275.199,19.9557,70.0443,99.9922
402,403,15749,2668,2483,256.261,56.3636,33.6364,99.6833
403,404,859,831,2437,78.7488,9.5131,80.4869,99.9981
404,405,8851,1496,2477,273.232,22.9476,67.0524,99.1734
405,406,6338,949,2461,259.567,43.0584,46.9416,99.5242
406,407,1239,3210,2442,272.569,3.80058,86.1994,99.9744
407,408,2575,1642,2467,274.251,29.5716,60.4284,99.9891
408,409,4077,863,2501,255.435,8.87124,81.1288,99.9784
409,410,34504,1352,2578,261.468,15.4626,74.5374,99.1288
410,411,59549,994,2609,90.8031,11.1435,78.8565,99.2686
411,412,2957,3000,2506,274.11400000000003,26.6963,63.3037,99.9943
412,413,5198,2774,2524,96.5219,5.071280000000002,84.9287,99.9393
413,414,16614,2532,2570,273.226,28.6505,61.3495,99.4986
414,415,523,2946,2500,204.327,63.6719,26.3281,99.9848
415,416,8376,2155,2545,99.7314,33.2625,56.7375,99.6528
416,417,3480,3048,2533,268.713,12.5948,77.4052,99.9773
417,418,3794,1627,2521,268.128,25.1611,64.8389,99.9236
418,419,1730,1235,2538,287.478,63.8062,26.1938,99.4566
419,420,18280,3000,2622,274.664,7.4798,82.5202,99.4498
420,421,44641,1511,2681,283.493,59.615,30.385,97.9056
421,422,2389,2836,2580,268.052,7.73525,82.2647,99.9587
422,423,7508,3128,2586,96.8008,3.09167,86.9083,99.9888
423,424,765,1683,2568,268.387,26.0399,63.9601,99.9921
424,425,24715,328,2662,83.7584,2.15179,87.8482,99.8424
425,426,4269,2660,2589,306.3040000000001,77.6039,12.3961,99.9701
426,427,1817,3211,2583,277.35,3.45546,86.5445,99.9905
427,428,5504,2752,2600,89.3434,47.9589,42.0411,99.9813
428,429,13521,1865,2661,88.3969,35.4165,54.5835,99.9584
429,430,551,2881,2586,87.8868,16.9002,73.0998,99.9225
430,431,2240,1221,2606,255.316,32.5857,57.4143,99.9939
431,432,884,2042,2584,340.88,83.0767,6.92334,99.9833
432,433,3411,2417,2614,254.71400000000003,7.8109899999999985,82.189,99.9265
433,434,1279,257,2607,78.6805,51.894,38.106,99.986
434,435,3399,109,2624,264.655,58.0197,31.9803,99.9779
435,436,29042,2042,2675,95.0679,14.7746,75.2254,91.6218
436,437,682,1688,2617,88.9576,26.8945,63.1055,99.7679
437,438,4367,2856,2639,262.76,9.75462,80.2454,99.9588
438,439,1734,3221,2648,91.0112,27.5633,62.4367,99.9831
439,440,2762,2593,2659,276.177,55.2932,34.7068,99.9685
440,441,21206,84,2760,100.181,28.3582,61.6418,99.9127
441,442,46643,2416,2767,271.143,34.8214,55.1786,99.1594
442,443,2768,3125,2652,272.156,18.4726,71.5274,99.9819
443,444,4770,3191,2691,90.7448,16.0921,73.9079,99.9804
444,445,509,1645,2649,93.4768,67.6567,22.3433,99.9954
445,446,545,656,2647,259.589,35.0574,54.9426,99.9848
446,447,2019,2698,2658,87.0407,62.3969,27.6031,99.98
447,448,657,2762,2651,90.0852,48.176,41.824,99.9942
448,449,33693,1806,2768,263.368,39.4468,50.5532,99.856
449,450,6223,1200,2689,268.256,29.0263,60.9737,99.9578
450,451,5083,825,2704,288.439,38.7783,51.2217,99.9876
451,452,14407,191,2720,82.79299999999998,49.0272,40.9728,99.9623
452,453,3224,2206,2687,273.233,4.62039,85.3796,99.978
453,454,1899,2810,2677,87.6607,60.4952,29.5048,99.9735
454,455,13736,462,2759,90.9474,5.98867,84.0113,99.1871
455,456,6376,1117,2709,264.514,14.9847,75.0153,99.9327
456,457,2494,2988,2689,283.672,77.1522,12.8478,99.9812
457,458,5083,707,2701,258.722,10.1628,79.8372,99.9931
458,459,1923,2526,2697,104.355,9.16647,80.8335,99.9072
459,460,928,2643,2676,288.358,23.5424,66.4576,99.9941
460,461,4909,1618,2712,94.4311,26.3225,63.6775,99.978
461,462,30151,613,2827,97.3427,79.9364,10.0636,99.8496
462,463,2801,2746,2708,268.42400000000004,8.84021,81.1598,99.9895
463,464,738,3140,2695,261.394,22.6696,67.3304,99.9884
464,465,12844,1362,2773,208.739,75.084,14.916,99.9545
465,466,2400,3112,2720,269.426,24.1692,65.8308,99.9422
466,467,119235,2914,2909,87.0729,12.4711,77.5289,99.1789
467,468,2343,2682,2720,96.8901,14.4156,75.5844,99.989
468,469,4773,1005,2737,262.996,41.4112,48.5888,99.9613
469,470,2245,2257,2735,114.882,86.1284,3.87164,99.9755
470,471,22680,2135,2785,268.815,20.0731,69.9269,99.9192
471,472,2186,2623,2735,268.891,54.2188,35.7812,99.9929
472,473,40395,792,2814,256.531,40.2345,49.7655,99.954
473,474,11791,1289,2821,83.4878,3.94269,86.0573,99.9255
474,475,587,1828,2726,86.0336,21.4089,68.5911,99.9911
475,476,745,3013,2742,95.215,14.6536,75.3464,99.9907
476,477,13866,2571,2812,100.87,11.6081,78.3919,99.7217
477,478,30073,2708,2869,268.608,0.302223,89.6978,99.9233
478,479,18358,3192,2828,266.927,27.4369,62.5631,99.9266
479,480,6226,351,2807,90.6027,64.8382,25.1618,99.9597
480,481,18905,1181,2819,100.638,42.52,47.48,99.9488
481,482,1011,1720,2764,266.504,41.2347,48.7653,99.9801
482,483,2168,1673,2772,96.1692,20.3599,69.6401,99.9791
483,484,718,325,2770,85.8867,7.85331,82.1467,99.9665
484,485,890,1084,2773,157.757,76.7414,13.2586,99.9906
485,486,5586,2300,2829,269.896,4.28165,85.7183,99.9867
486,487,3882,266,2803,260.733,35.4431,54.5569,99.9885
487,488,4934,966,2832,164.85,78.9929,11.0071,99.9465
488,489,1201,996,2794,95.7881,10.7243,79.2757,99.9747
489,490,1010,169,2800,83.906,9.59457,80.4054,99.9966
490,491,1309,1654,2805,226.74400000000003,74.8792,15.1208,99.9791
491,492,46391,2030,3036,271.506,38.7036,51.2964,99.6308
492,493,2826,1716,2831,216.823,80.6755,9.32447,99.9399
493,494,11345,1617,2867,240.705,73.1019,16.8981,99.9453
494,495,57815,442,2986,85.1244,63.4629,26.5371,88.65100000000002
495,496,6918,1442,2855,83.0022,4.5450300000000015,85.455,98.8042
496,497,4390,1088,2845,170.428,78.911,11.089,99.9498
497,498,6305,192,2869,270.497,42.9571,47.0429,99.9928
498,499,8642,1915,2905,88.9948,9.55743,80.4426,99.7709
499,500,3382,2237,2869,99.7496,76.3171,13.6829,99.9756
500,501,12085,1816,2978,263.212,27.9643,62.0357,99.7491
501,502,38784,1543,2988,262.657,32.0354,57.9646,99.6408
502,503,946,1028,2880,260.686,40.4,49.6,99.9953
503,504,1183,261,2880,265.91900000000004,10.2695,79.7305,99.9861
504,505,5379,2158,2926,271.611,40.7631,49.2369,99.9605
505,506,2490,88,2894,271.302,12.2933,77.7067,99.9957
506,507,8237,2312,2931,258.621,9.97914,80.0209,99.8886
507,508,1810,305,2898,265.13,53.0579,36.9421,99.9929
508,509,832,2119,2898,270.447,41.4548,48.5452,99.9589
509,510,540,2386,2892,258.742,8.68665,81.3133,99.981
510,511,29382,2561,2994,86.448,11.5848,78.4152,99.7054
511,512,14772,1726,2991,270.954,46.2782,43.7218,99.4493
512,513,17411,1118,2955,268.223,2.58556,87.4144,99.8959
513,514,8993,889,2949,82.0717,8.81668,81.1833,99.9651
514,515,987,1689,2912,271.618,45.4286,44.5714,99.9967
515,516,1279,132,2912,260.758,54.9098,35.0902,99.9888
516,517,10261,1363,2954,117.259,83.8543,6.14566,99.6897
517,518,4027,987,2950,98.3228,24.4832,65.5168,99.6903
518,519,718,831,2928,109.2,78.1854,11.8146,99.9778
519,520,5843,2447,2978,256.529,8.144969999999999,81.855,98.875
520,521,504,271,2922,269.966,25.2995,64.7005,99.9953
521,522,1028,1270,2922,114.008,83.3487,6.6513100000000005,99.9879
522,523,2095,1855,2947,82.2815,5.31727,84.6827,99.9809
523,524,2729,2397,2965,82.0435,6.73005,83.27,99.955
524,525,1475,2220,2938,109.048,75.2079,14.7921,99.979
525,526,16161,158,2990,89.1372,28.0002,61.9998,99.9522
526,527,844,97,2942,261.589,51.1088,38.8912,99.9887
527,528,15981,287,3020,270.563,61.6001,28.3999,99.6964
528,529,6415,2068,2997,85.3377,1.42809,88.5719,99.9781
529,530,26093,640,3067,259.688,28.4536,61.5464,88.05799999999998
530,531,4149,1308,2990,87.1306,20.1882,69.8118,99.9522
531,532,4590,759,3001,271.869,3.7564,86.2436,99.9645
532,533,4396,3202,2988,248.227,62.1305,27.8695,99.9797
533,534,1257,807,2982,87.1763,20.7849,69.2151,99.9568
534,535,27248,2269,3030,84.59700000000002,7.45547,82.5445,99.9078
535,536,17351,939,3071,269.238,2.52818,87.4718,98.9444
536,537,2122,3090,3029,240.249,74.4041,15.5959,99.8089
537,538,6832,844,3052,84.1555,29.595,60.405,99.9051
538,539,592,3155,3014,94.6323,37.9553,52.0447,99.9634
539,540,5975,1169,3049,90.6966,16.9059,73.0941,99.9728
540,541,1428,1269,3027,33.7006,81.9923,8.007719999999999,98.6624
541,542,7892,1931,3060,85.1722,23.2534,66.7466,99.1966
542,543,2558,195,3050,82.9463,35.6442,54.3558,99.9896
543,544,15578,3156,3086,270.233,7.153510000000002,82.8465,48.9275
544,545,636,3036,3031,268.41,76.5343,13.4657,99.9365
545,546,4478,1070,3069,91.907,14.3926,75.6074,99.9816
546,547,564,65,3050,92.0644,19.3367,70.6633,99.9959
547,548,29827,1235,3155,71.1807,74.2906,15.7094,99.8899
548,549,3851,1354,3063,258.60400000000004,48.1842,41.8158,99.9525
549,550,1564,3024,3071,293.37,72.8982,17.1018,99.1315
550,551,784,2962,3058,275.281,72.3954,17.6046,98.8249
551,552,4422,2415,3100,83.9626,31.2001,58.7999,99.8672
552,553,3191,2626,3085,273.71,2.8696200000000003,87.1304,99.989
553,554,5157,1496,3094,20.2556,83.5812,6.41885,99.9523
554,555,7769,1729,3104,83.5362,12.6683,77.3317,99.9382
555,556,858,1870,3085,262.923,38.8812,51.1188,99.9796
556,557,1876,84,3082,288.558,79.8908,10.1092,99.996
557,558,1130,2989,3089,328.76,75.0794,14.9206,99.9765
558,559,4456,736,3105,83.2727,3.72653,86.2735,99.9867
559,560,910,152,3093,269.681,52.0952,37.9048,99.9869
560,561,17190,2275,3144,89.1014,12.7617,77.2383,99.8759
561,562,5285,2895,3131,90.3211,35.501,54.499,99.9603
562,563,862,786,3103,90.9899,2.82436,87.1756,99.9872
563,564,2344,1824,3112,258.73900000000003,50.9164,39.0836,99.972
564,565,8436,302,3143,260.713,8.86876,81.1312,99.9488
565,566,2215,48,3124,78.9318,54.0143,35.9857,99.9825
566,567,1096,3320,3121,92.0593,30.0259,59.9741,99.7784
567,568,12103,1582,3163,266.54200000000003,33.9788,56.0212,99.9543
568,569,2484,1436,3126,85.9785,9.20826,80.7917,98.8114
569,570,621,545,3108,274.333,10.5745,79.4255,99.9868
570,571,1529,2755,3124,89.575,18.7858,71.2142,99.9725
571,572,1972,2822,3114,85.2063,28.7364,61.2636,99.9802
572,573,7862,2159,3180,87.5743,21.0371,68.9629,99.9471
573,574,3170,986,3147,274.241,3.91942,86.0806,99.8757
574,575,6065,1131,3216,266.694,8.434460000000001,81.5655,99.8906
575,576,69737,2731,3277,89.27,20.0532,69.9468,99.8371
576,577,2924,3024,3149,266.858,31.2054,58.7946,99.9811
577,578,4342,1062,3150,274.941,41.9144,48.0856,99.9785
578,579,24210,3164,3223,91.6674,28.2733,61.7267,99.9519
579,580,16365,547,3214,86.8917,1.63421,88.3658,99.9586
580,581,1582,2478,3130,266.527,11.300999999999998,78.699,99.7762
581,582,3481,1892,3174,83.2462,25.796,64.204,99.9278
582,583,5413,2973,3183,93.3161,32.8793,57.1207,99.8999
583,584,2129,164,3156,271.705,37.2751,52.7249,99.9887
584,585,36578,1385,3261,262.949,29.3953,60.6047,99.5466
585,586,7396,219,3214,267.642,52.8191,37.1809,99.9286
586,587,2687,792,3159,261.633,47.4938,42.5062,99.9846
587,588,632,2691,3145,113.474,48.3165,41.6835,99.9683
588,589,12888,97,3213,86.8018,30.0703,59.9297,99.9912
589,590,7880,932,3205,269.401,9.8425,80.1575,98.9137
590,591,864,1796,3156,260.68,48.2259,41.7741,99.9552
591,592,507,1835,3159,91.1288,25.3555,64.6445,99.9797
592,593,12774,721,3225,264.483,50.4861,39.5139,99.962
593,594,2045,1713,3164,264.073,46.9047,43.0953,99.9794
594,595,4328,429,3176,263.501,1.7815599999999998,88.2184,99.5676
595,596,903,2403,3159,255.912,44.9683,45.0317,99.9912
596,597,1554,1758,3180,79.5439,20.9825,69.0175,99.9893
597,598,8477,847,3219,88.5016,0.322319,89.6777,99.9698
598,599,11263,2404,3250,84.7823,22.019,67.98100000000001,99.3134
599,600,1078,488,3193,268.78700000000003,1.99546,88.0045,99.9665
600,601,2722,2368,3199,257.57,52.4079,37.5921,99.9887
601,602,1756,2511,3203,268.264,64.0947,25.9053,99.9948
602,603,13201,350,3266,233.24400000000003,85.8938,4.1062,99.9709
603,604,9314,1029,3246,88.5332,63.1782,26.8218,99.9736
604,605,14949,1688,3304,90.6193,38.0608,51.9392,99.8921
605,606,2616,280,3232,261.791,2.37476,87.6252,99.9932
606,607,5100,1798,3241,84.8106,33.9143,56.0857,99.9786
607,608,1084,2316,3218,267.29900000000004,30.6823,59.3177,99.9934
608,609,2246,451,3254,254.854,84.3151,5.6849300000000005,99.9807
609,610,7462,2922,3261,65.9647,87.4112,2.58876,99.9635
610,611,26429,3045,3336,263.063,2.84019,87.1598,99.9513
611,612,9463,2015,3269,259.733,20.5493,69.4507,99.9815
612,613,3930,1534,3253,89.9224,16.5882,73.4118,99.9813
613,614,10244,1922,3285,88.9108,16.904,73.096,69.8133
614,615,776,1859,3230,255.083,47.4838,42.5162,99.9859
615,616,12973,2550,3284,5.65421,81.0495,8.95054,99.948
616,617,24850,2190,3289,272.41700000000003,23.7002,66.2998,99.9128
617,618,4176,1620,3266,94.0138,35.8468,54.1532,99.9611
618,619,1292,1083,3269,265.634,7.10363,82.8964,99.9012
619,620,14889,625,3315,91.5912,2.0163,87.9837,99.9547
620,621,820,1749,3269,84.3143,39.4427,50.5573,99.993
621,622,1152,180,3285,266.869,52.5824,37.4176,99.9937
622,623,15716,781,3348,256.028,5.63884,84.3612,99.9725
623,624,6183,120,3312,270.592,32.1869,57.8131,99.9776
624,625,10306,918,3322,269.514,19.608,70.392,99.3339
625,626,798,1106,3295,278.922,42.9973,47.0027,99.8861
626,627,563,1566,3287,104.537,39.9913,50.0087,99.9735
627,628,6172,252,3329,259.201,24.507,65.493,99.9893
628,629,928,1803,3294,256.082,19.9649,70.0351,99.9931
629,630,564,1597,3302,103.997,41.4939,48.5061,99.9434
630,631,3941,1226,3312,265.04400000000004,59.2689,30.7311,99.9909
631,632,1490,827,3305,86.0815,2.21172,87.7883,99.9862
632,633,1515,2463,3321,103.347,33.3696,56.6304,99.691
633,634,3097,2045,3343,99.5391,23.4032,66.5968,99.9662
634,635,541,22,3312,86.0878,7.03183,82.9682,99.9698
635,636,878,446,3319,262.725,48.4984,41.5016,99.7387
636,637,1177,417,3322,260.051,48.1985,41.8015,99.9843
637,638,3632,2322,3336,84.8809,1.15303,88.84700000000002,99.9852
638,639,507,1849,3323,270.136,38.2223,51.7777,99.9869
639,640,17705,1161,3408,90.3343,0.281555,89.7184,99.9765
640,641,16646,76,3397,79.0752,8.06527,81.9347,99.9539
641,642,1932,1071,3329,279.41,43.9681,46.0319,99.9802
642,643,4880,2391,3349,243.174,74.1868,15.8132,99.9039
643,644,3790,497,3338,89.8933,1.10991,88.8901,99.9916
644,645,15718,1560,3375,91.9036,4.05194,85.9481,99.8922
645,646,6365,1797,3365,89.6415,20.5607,69.4393,99.9513
646,647,7062,1031,3386,277.685,9.40682,80.5932,99.9611
647,648,3210,186,3366,264.47,53.7273,36.2727,99.9931
648,649,16589,355,3391,260.904,26.429,63.57100000000001,99.984
649,650,10614,600,3420,96.3558,42.2566,47.7434,99.9791
650,651,8625,2925,3383,268.274,47.2295,42.7705,99.6709
651,652,3996,1359,3379,79.4855,9.88696,80.113,99.9761
652,653,541,1750,3357,73.1283,1.51432,88.4857,99.9817
653,654,803,2477,3360,104.229,43.738,46.262,99.9843
654,655,803,2198,3364,106.253,22.6713,67.3287,99.9932
655,656,23841,2566,3433,222.266,81.6475,8.35254,99.8034
656,657,5619,2122,3381,280.78700000000003,64.7572,25.2428,99.9253
657,658,994,2710,3370,91.4415,21.4108,68.5892,99.9911
658,659,504,3206,3373,91.3521,24.4181,65.5819,99.9867
659,660,1852,3137,3381,87.9893,35.4473,54.5527,99.9947
660,661,1028,464,3387,260.315,69.735,20.265,99.9915
661,662,795,3315,3394,154.184,86.9566,3.04337,99.9779
662,663,8030,1482,3427,173.987,75.0131,14.9869,99.9475
663,664,5577,1889,3405,123.179,79.5847,10.4153,99.9508
664,665,1867,2437,3405,263.07,3.0601,86.9399,98.9777
665,666,33477,803,3459,86.2147,15.4938,74.5062,99.8072
666,667,1281,1279,3393,88.8438,21.3906,68.6094,99.9805
667,668,6560,2335,3445,265.342,2.95405,87.046,99.7373
668,669,539,3267,3405,278.243,66.8726,23.1274,99.9705
669,670,9472,2240,3457,265.486,67.3219,22.6781,99.8841
670,671,1623,234,3406,78.5114,2.56731,87.4327,99.979
671,672,4441,2033,3422,117.091,54.9189,35.0811,99.9726
672,673,516,513,3402,80.1873,29.3697,60.6303,99.9843
673,674,1042,3209,3421,325.562,79.6156,10.3844,99.9941
674,675,1245,2380,3426,262.07,3.07096,86.929,99.9309
675,676,12877,156,3482,107.878,74.7783,15.2217,99.3328
676,677,2192,2736,3426,267.279,17.8485,72.1515,99.9856
677,678,1568,1665,3429,263.608,18.9049,71.0951,99.9646
678,679,43554,445,3510,280.975,66.4474,23.5526,98.4978
679,680,1683,3265,3442,277.064,66.7928,23.2072,99.9676
680,681,4394,1419,3452,86.0996,25.9587,64.0413,99.3353
681,682,26411,1294,3503,82.8021,31.3402,58.6598,99.8012
682,683,2904,1742,3445,273.559,42.0758,47.9242,99.933
683,684,6548,2799,3454,225.83,77.63600000000002,12.364,99.9055
684,685,589,3136,3426,329.065,79.5107,10.4893,99.995
685,686,1030,1906,3432,80.3739,13.9297,76.0703,99.9823
686,687,4288,2106,3463,90.5848,27.3797,62.6203,99.9859
687,688,20852,3036,3515,297.821,72.0131,17.9869,97.7108
688,689,4534,2899,3469,272.839,24.1818,65.8182,99.988
689,690,3895,1603,3495,276.826,40.7336,49.2664,99.7593
690,691,6115,1840,3478,84.8234,16.1221,73.8779,99.9251
691,692,17451,2422,3543,280.066,21.4433,68.5567,98.8259
692,693,2329,1076,3473,260.905,5.68167,84.3183,99.9621
693,694,4707,1700,3497,271.242,41.7158,48.2842,99.7205
694,695,1642,947,3476,271.504,12.4691,77.5309,99.2981
695,696,14633,1999,3525,289.396,47.0927,42.9073,99.1726
696,697,1252,3157,3473,280.033,61.5573,28.4427,99.9414
697,698,8451,990,3528,270.622,51.3281,38.6719,99.6403
698,699,1587,3209,3481,107.016,80.9352,9.06479,99.9915
699,700,702,2570,3488,273.893,15.8449,74.1551,99.9749
700,701,717,1559,3492,273.467,31.5574,58.4426,99.9834
701,702,4701,876,3533,83.581,11.5346,78.4654,99.8857
702,703,1931,1400,3517,261.091,56.0539,33.9461,98.8489
703,704,2687,207,3527,259.656,56.2608,33.7392,99.8965
704,705,17852,1498,3566,278.944,25.5754,64.4246,99.4277
705,706,13857,639,3585,278.309,54.5549,35.4451,99.9084
706,707,3881,2828,3527,260.713,28.4404,61.5596,99.9077
707,708,13002,2728,3572,266.993,16.896,73.104,97.9443
708,709,4944,2326,3543,87.5,0.363594,89.6364,99.942
709,710,4473,41,3555,85.7111,47.3975,42.6025,99.9802
710,711,7569,1063,3566,274.663,22.6655,67.3345,99.9516
711,712,17141,1783,3604,72.2728,61.1536,28.8464,99.8179
712,713,7625,2101,3560,310.539,76.6784,13.3216,98.3198
713,714,6863,3232,3561,294.541,64.2022,25.7978,98.86
714,715,33650,2561,3653,276.04,15.96,74.04,99.6857
715,716,3926,2213,3546,264.48400000000004,1.73537,88.2646,99.9304
716,717,625,1638,3530,86.4526,7.21643,82.7836,99.9925
717,718,2432,1854,3539,82.6859,17.4586,72.5414,99.9504
718,719,3743,1682,3586,89.0046,29.847,60.153,99.9503
719,720,1952,2914,3551,86.1757,32.9151,57.0849,99.6313
720,721,5079,1923,3592,58.217,77.7315,12.2685,99.9331
721,722,34839,285,3639,345.1430000000001,85.8221,4.17793,99.9186
722,723,511,1614,3558,278.95,25.7489,64.2511,99.9763
723,724,2324,1116,3582,274.3,12.4531,77.5469,99.9946
724,725,592,3331,3568,281.857,66.8175,23.1825,99.6157
725,726,6043,3131,3589,351.42800000000005,78.6878,11.3122,99.9076
726,727,2951,188,3580,77.2683,7.956360000000001,82.0436,99.9886
727,728,2630,2869,3578,266.491,28.6603,61.3397,99.9838
728,729,899,1214,3573,267.066,66.707,23.293000000000006,99.9962
729,730,22152,895,3659,279.265,68.8566,21.1434,99.8363
730,731,739,1151,3591,265.13,66.6809,23.3191,99.9873
731,732,8311,1622,3652,274.15,34.9812,55.0188,99.9308
732,733,25191,83,3688,87.4122,12.6963,77.3037,99.9744
733,734,905,2153,3586,87.6489,15.4054,74.5946,99.9796
734,735,2235,2262,3599,90.6364,41.679,48.32100000000001,99.9739
735,736,675,2203,3601,311.522,74.4711,15.5289,99.9649
736,737,18876,1338,3684,88.4946,28.654,61.346,99.9555
737,738,4682,2701,3621,74.5285,64.3542,25.6458,99.9799
738,739,9498,1229,3657,267.508,39.2684,50.7316,99.9487
739,740,3931,744,3621,107.467,87.1649,2.83507,99.9925
740,741,8661,2325,3647,84.5763,64.3054,25.6946,99.9685
741,742,1073,1176,3613,273.824,11.6431,78.3569,99.9911
742,743,6227,2991,3622,347.05,81.2417,8.758339999999999,99.9286
743,744,10528,2058,3654,82.8937,55.5657,34.4343,99.9526
744,745,3500,3193,3648,268.879,46.7309,43.2691,99.9791
745,746,2652,453,3632,267.871,19.1126,70.8874,99.6782
746,747,1023,2861,3618,64.9693,51.7781,38.2219,99.9932
747,748,11620,2945,3703,262.841,5.84119,84.1588,98.7905
748,749,2499,509,3644,67.1153,71.9177,18.0823,99.9851
749,750,712,2135,3622,79.2455,61.5986,28.4014,99.993
750,751,3200,2234,3654,257.396,14.185,75.815,99.9681
751,752,5243,1070,3657,267.985,2.5745,87.4255,99.9716
752,753,4805,3061,3660,266.403,12.6815,77.3185,99.969
753,754,654,1005,3642,98.0546,15.9187,74.0813,99.9615
754,755,984,1130,3637,86.7792,40.1057,49.8943,99.9932
755,756,1682,1419,3656,79.6187,17.2407,72.7593,99.5543
756,757,1908,1478,3653,277.298,38.723,51.277,99.9801
757,758,1766,2158,3663,100.501,18.5767,71.4233,99.9396
758,759,1954,2846,3658,265.91200000000003,28.843000000000004,61.157,99.9887
759,760,15353,1872,3711,267.56,3.78629,86.2137,99.6979
760,761,9918,2450,3712,93.8286,57.892,32.108000000000004,99.2731
761,762,714,157,3709,329.463,87.1479,2.85211,99.9667
762,763,664,1539,3651,82.0647,14.7771,75.2229,99.955
763,764,4984,1990,3695,97.4939,5.75855,84.2414,99.7913
764,765,12563,2762,3706,277.47,43.0665,46.9335,99.8685
765,766,1971,731,3687,273.606,52.7853,37.2147,99.9968
766,767,1213,1141,3673,80.2527,9.61348,80.3865,99.9837
767,768,2315,774,3691,273.742,52.3401,37.6599,99.9908
768,769,3092,443,3695,82.3372,3.41566,86.5843,99.5279
769,770,23400,3168,3766,82.0599,27.768,62.232,99.9395
770,771,2568,1577,3696,80.8331,55.9996,34.0004,99.9591
771,772,25156,681,3757,58.7773,59.2633,30.7367,99.9267
772,773,7441,1735,3720,86.7467,28.95,61.05,99.9599
773,774,52158,1086,3855,100.065,57.1631,32.8369,99.9006
774,775,976,633,3684,266.587,16.2084,73.7916,99.9884
775,776,3224,497,3722,266.331,53.9783,36.0217,99.9936
776,777,38005,1445,3800,269.22,67.1245,22.8755,99.5041
777,778,618,2268,3702,260.007,37.7381,52.2619,99.9865
778,779,721,2303,3703,86.6497,61.4081,28.5919,99.9144
779,780,7483,1144,3762,81.4278,10.7369,79.2631,99.9389
780,781,12401,2161,3737,85.3429,6.78768,83.2123,99.9426
781,782,1275,2324,3724,258.889,36.7278,53.2722,99.8636
782,783,799,311,3709,79.4764,34.4742,55.5258,99.9794
783,784,28856,361,3804,260.536,13.929,76.071,99.8316
784,785,2139,2656,3744,76.736,67.4878,22.5122,99.9926
785,786,3574,279,3750,79.3795,34.0271,55.9729,99.979
786,787,552,1244,3730,286.36,66.8735,23.1265,99.9105
787,788,2079,2370,3746,248.21,38.365,51.635,99.9929
788,789,588,3319,3746,81.4182,14.2421,75.7579,99.8946
789,790,794,1964,3744,98.9814,6.2859,83.7141,99.9882
790,791,3522,2889,3767,89.0234,58.4219,31.5781,99.9837
791,792,7116,1251,3782,74.7907,17.7885,72.2115,99.9895
792,793,67333,2954,3953,93.5058,61.2763,28.7237,99.6172
793,794,3586,1669,3789,79.5971,58.6114,31.3886,99.983
794,795,797,1795,3760,84.5171,18.4843,71.5157,99.9916
795,796,4077,526,3783,95.6846,72.1848,17.8152,99.9878
796,797,18858,1580,3855,266.842,35.316,54.684,99.9578
797,798,5966,2771,3799,256.13,6.50189,83.4981,99.9744
798,799,30176,2015,3821,100.015,17.7981,72.2019,99.1503
799,800,3938,2317,3802,84.9566,4.88503,85.115,99.8567
800,801,1200,208,3780,264.272,11.0059,78.9941,99.9863
801,802,4688,2674,3795,273.12,25.0668,64.9332,99.9772
802,803,121685,2361,4064,296.686,83.3249,6.67515,69.3475
803,804,5255,1748,3809,83.3486,3.2496,86.7504,99.9734
804,805,3260,3022,3800,273.41200000000003,41.6906,48.3094,99.9836
805,806,13363,111,3855,264.266,12.6678,77.3322,99.9681
806,807,6776,591,3823,261.335,40.6459,49.3541,99.9654
807,808,3882,2234,3816,260.85400000000004,42.7004,47.2996,99.9286
808,809,14028,2547,3837,97.6886,16.7345,73.2655,99.7887
809,810,4542,1821,3829,84.9162,59.7349,30.2651,99.9545
810,811,7177,934,3823,91.0959,15.2682,74.7318,98.8842
811,812,673,3293,3806,85.3704,18.3486,71.6514,99.9501
812,813,773,9,3826,256.039,68.1568,21.8432,99.9804
813,814,624,43,3816,253.826,68.3893,21.6107,99.99
814,815,1610,189,3828,259.878,62.8598,27.1402,99.9976
815,816,5364,828,3850,83.969,73.3592,16.6408,99.9843
816,817,9898,496,3885,175.299,80.8329,9.16712,99.9649
817,818,3120,696,3857,272.692,54.8573,35.1427,99.9903
818,819,760,2277,3839,96.0346,50.4198,39.5802,99.9797
819,820,3674,3112,3856,98.6247,12.3448,77.6552,99.9826
820,821,849,3315,3879,82.4269,12.8292,77.1708,99.9307
821,822,1131,642,3855,273.224,52.691,37.309,99.9805
822,823,647,3341,3869,81.0985,16.6932,73.3068,99.8219
823,824,23616,935,3977,264.338,6.86192,83.1381,99.0086
824,825,693,1296,3855,91.9936,28.8209,61.1791,99.9903
825,826,2565,1689,3870,274.494,62.9199,27.0801,99.9901
826,827,43636,2717,3980,260.612,11.0798,78.9202,99.7527
827,828,2762,2673,3893,267.986,61.6043,28.3957,99.991
828,829,3971,201,3898,79.9679,45.9176,44.0824,99.9808
829,830,4072,2238,3894,277.353,67.2423,22.7577,99.9756
830,831,4376,3208,3900,85.8172,12.5008,77.4992,99.9781
831,832,4628,1250,3917,83.8332,10.3165,79.6835,99.99
832,833,14055,1945,3927,97.138,32.4427,57.5573,99.0765
833,834,42943,678,4007,263.694,35.8666,54.1334,95.4646
834,835,8741,390,3922,270.985,27.8148,62.1852,99.9377
835,836,1297,588,3902,268.638,33.6203,56.3797,99.9805
836,837,695,1755,3895,268.071,63.4506,26.5494,99.9926
837,838,5680,1320,3928,248.859,43.6664,46.3336,99.9913
838,839,604,1828,3899,92.4435,57.191,32.809,99.9766
839,840,4820,288,3913,256.002,4.18547,85.8145,99.9545
840,841,2950,1788,3919,86.4884,7.89795,82.1021,99.9603
841,842,717,983,3909,268.47700000000003,10.4197,79.5803,99.9741
842,843,6599,2580,3926,274.48900000000003,26.5254,63.4746,99.9772
843,844,22311,2070,3982,265.79900000000004,37.9825,52.0175,99.7671
844,845,924,3297,3929,85.2076,12.3951,77.6049,99.9126
845,846,1146,1671,3917,75.2628,61.3656,28.6344,99.9855
846,847,9506,94,3972,78.9067,45.4045,44.5955,99.8901
847,848,2066,3128,3926,277.532,45.4749,44.5251,99.9755
848,849,643,51,3927,90.8426,79.3301,10.6699,99.9903
849,850,1982,2172,3927,94.6884,41.3108,48.6892,99.9767
850,851,3191,619,3941,85.0476,3.3798800000000004,86.6201,99.9914
851,852,13946,210,4002,272.016,2.70387,87.2961,98.6536
852,853,1654,1643,3941,89.1986,8.5266,81.4734,99.9834
853,854,866,1453,3935,250.183,74.7467,15.2533,99.8888
854,855,3091,553,3951,269.473,31.4917,58.5083,99.9934
855,856,1011,1712,3936,91.516,39.7444,50.2556,99.9826
856,857,8908,1863,3992,81.335,18.0368,71.9632,99.9047
857,858,20223,1568,4006,96.5712,6.48228,83.5177,99.7388
858,859,2530,3194,3976,93.4152,34.3711,55.6289,99.9381
859,860,2254,1424,3971,203.098,76.983,13.017,99.9708
860,861,6883,1753,3997,272.251,7.42152,82.5785,99.9855
861,862,529,443,3957,88.1976,29.204,60.79600000000001,99.7016
862,863,10150,1204,4021,90.8299,32.4535,57.5465,99.725
863,864,92223,1404,4146,263.022,2.95864,87.0414,99.3213
864,865,3634,460,4003,274.171,4.66359,85.3364,99.9627
865,866,635,3294,3981,260.421,70.9533,19.0467,99.9669
866,867,638,3257,3982,87.7484,14.4605,75.5395,99.9771
867,868,1033,2806,3990,85.8218,44.819,45.181,99.99
868,869,1692,407,4015,78.85600000000002,27.3891,62.6109,99.8387
869,870,7827,2565,4076,280.019,57.5195,32.4805,99.1931
870,871,531,1666,3989,86.7936,5.8777300000000015,84.1223,99.9591
871,872,18494,301,4068,268.55,31.1968,58.8032,99.9824
872,873,3689,97,4020,272.533,39.4236,50.5764,99.9828
873,874,928,844,4011,88.8587,40.0253,49.9747,99.4889
874,875,4120,3141,4037,261.418,36.2032,53.7968,99.7936
875,876,10925,3221,4097,264.035,37.5856,52.4144,99.7303
876,877,6045,1083,4052,271.236,26.7422,63.2578,99.86
877,878,6560,1803,4091,273.625,54.511,35.48900000000001,99.9272
878,879,1914,3330,4052,48.9572,70.7453,19.2547,99.7201
879,880,1734,479,4057,86.4746,24.9743,65.0257,99.9914
880,881,3092,829,4065,258.713,9.85837,80.1416,99.9849
881,882,574,1685,4056,88.3929,7.83231,82.1677,99.9775
882,883,6450,3070,4088,272.733,46.2762,43.7238,99.9073
883,884,590,120,4060,82.64,36.9103,53.0897,99.9938
884,885,733,1932,4064,282.98,35.6342,54.3658,99.2007
885,886,3196,1902,4096,275.214,49.7702,40.2298,99.8125
886,887,1011,409,4071,261.934,26.0218,63.9782,99.8643
887,888,75867,954,4236,279.764,25.6116,64.3884,99.1785
888,889,2047,2792,4095,262.856,13.156,76.844,99.9757
889,890,1404,3156,4107,268.665,3.14941,86.8506,99.991
890,891,7785,1193,4115,296.812,66.8985,23.1015,99.9701
891,892,5494,2100,4126,95.5843,28.9053,61.0947,99.973
892,893,3153,1680,4105,72.1037,60.8206,29.1794,99.8071
893,894,1263,132,4090,259.651,7.41933,82.5807,99.9754
894,895,1629,2027,4103,303.003,62.3243,27.6757,99.9689
895,896,64904,545,4202,268.165,33.4192,56.5808,82.4835
896,897,3924,1980,4115,96.0488,28.0899,61.9101,99.9829
897,898,5836,115,4139,272.355,43.404,46.596,99.9751
898,899,1526,713,4105,263.35900000000004,21.323,68.67699999999999,99.9817
899,900,4123,814,4128,260.238,19.645,70.355,99.8885
900,901,5943,753,4157,63.4069,65.4788,24.5212,99.9466
901,902,3736,2863,4138,88.9842,49.438,40.562,99.984
902,903,4646,2635,4150,290.189,79.9317,10.0683,99.9462
903,904,720,3296,4131,261.323,37.6967,52.3033,99.9307
904,905,35089,2995,4205,61.4232,72.2205,17.7795,99.9577
905,906,1017,183,4159,270.55,88.1187,1.88128,99.9735
906,907,1079,1722,4142,277.72900000000004,50.1969,39.8031,99.9668
907,908,813,1760,4150,274.751,51.6173,38.3827,99.9891
908,909,16158,1913,4202,106.242,64.1358,25.8642,99.6743
909,910,608,671,4147,83.8913,74.0629,15.9371,99.9948
910,911,9492,1144,4201,269.85,30.8881,59.1119,99.9697
911,912,520,1661,4151,95.3958,65.7941,24.2059,99.9894
912,913,6001,244,4179,264.8,18.5798,71.4202,99.9897
913,914,7928,3152,4187,85.4276,6.8074,83.1926,99.9928
914,915,17031,2153,4215,291.523,62.4421,27.5579,99.9222
915,916,3116,1705,4186,277.072,39.1604,50.8396,99.9828
916,917,3167,2015,4183,270.813,2.38481,87.6152,99.9819
917,918,1573,329,4182,91.0483,70.0458,19.9542,99.9932
918,919,2018,2291,4193,295.593,64.3154,25.6846,99.9842
919,920,24227,2677,4318,263.137,16.4771,73.5229,99.7763
920,921,3114,2794,4220,263.986,15.6888,74.3112,99.9303
921,922,2077,370,4210,265.918,28.6393,61.3607,99.984
922,923,5882,1784,4209,67.4862,57.64100000000001,32.359,99.9923
923,924,554,814,4186,87.2224,19.3299,70.6701,99.9804
924,925,572,2251,4197,276.573,17.3991,72.6009,99.9941
925,926,1346,81,4212,115.886,83.1288,6.8712,99.9757
926,927,528,2541,4200,270.172,20.8313,69.1687,99.9921
927,928,610,2831,4204,63.2007,72.778,17.222,99.9927
928,929,1306,204,4224,272.945,28.7871,61.2129,99.9651
929,930,11533,1615,4261,105.415,64.0263,25.9737,99.936
930,931,80310,383,4402,261.404,51.9303,38.0697,77.1531
931,932,859,2598,4214,292.79,66.7386,23.2614,99.9705
932,933,1473,2034,4225,88.3178,2.32964,87.6704,99.9902
933,934,14733,3176,4292,266.603,25.3265,64.6735,99.938
934,935,1013,165,4226,263.801,17.0863,72.9137,99.978
935,936,510,132,4220,272.818,26.0726,63.9274,99.9966
936,937,8405,782,4297,275.862,11.7561,78.2439,99.9686
937,938,719,771,4229,77.6915,19.1472,70.8528,99.9922
938,939,5260,1713,4271,86.0858,1.28065,88.7194,99.9762
939,940,711,2579,4241,265.016,16.1848,73.8152,99.9901
940,941,3996,1185,4280,84.8222,5.53139,84.4686,99.9689
941,942,4747,1815,4269,74.1776,39.4901,50.5099,99.9628
942,943,5771,2754,4284,95.7506,43.4943,46.5057,99.9889
943,944,1976,87,4258,266.441,13.9815,76.0185,99.9499
944,945,1344,136,4264,266.25,7.46552,82.5345,99.9961
945,946,3586,189,4281,261.16200000000003,21.0876,68.9124,99.9936
946,947,5796,2596,4295,270.018,24.728,65.27199999999999,99.9802
947,948,28567,2360,4360,261.43,27.5945,62.4055,99.1928
948,949,243179,1100,4575,91.6799,31.9184,58.0816,88.7839
949,950,4728,2224,4301,96.1319,28.21,61.79,99.9837
950,951,20511,2942,4352,68.1453,73.0913,16.9087,99.9729
951,952,2435,2015,4311,268.985,0.482033,89.51799999999999,99.9058
952,953,3399,1220,4316,274.711,69.8159,20.1841,99.9973
953,954,4778,1937,4315,91.5103,0.348373,89.6516,98.2918
954,955,1128,2886,4286,276.18,41.4184,48.5816,99.9938
955,956,503,2155,4286,89.398,64.9569,25.0431,99.9963
956,957,12357,676,4344,79.2411,66.6509,23.3491,99.9724
957,958,10944,1452,4335,94.0671,14.3884,75.6116,98.6325
958,959,5862,124,4327,265.825,3.71098,86.289,99.9948
959,960,6997,2095,4327,94.3822,64.8819,25.1181,99.9819
960,961,2854,2525,4336,266.081,20.9418,69.0582,99.9612
961,962,58448,1827,4452,117.806,49.7257,40.2743,68.4115
962,963,1169,589,4331,102.638,75.7734,14.2266,99.9921
963,964,9671,1318,4391,264.399,69.6239,20.3761,99.9606
964,965,32056,1618,4428,264.94,46.7206,43.2794,99.8789
965,966,4364,1956,4383,91.8692,1.73977,88.2602,99.5747
966,967,565,3252,4358,96.3245,56.07100000000001,33.929,99.9716
967,968,1079,3332,4353,85.1027,57.0315,32.9685,99.9388
968,969,11280,531,4399,93.0591,23.913,66.087,99.9907
969,970,144391,2810,4627,261.444,13.1743,76.8257,99.1152
970,971,1789,607,4376,82.2606,72.6084,17.3917,99.9933
971,972,13019,2515,4417,189.647,79.877,10.123,99.9771
972,973,4496,2109,4388,98.2518,28.5938,61.4062,99.9695
973,974,7305,804,4403,263.84,26.294,63.706,99.9739
974,975,2324,2190,4393,264.386,42.188,47.812,99.9903
975,976,663,2007,4378,276.284,48.506,41.494,99.9869
976,977,4419,102,4401,272.54,64.4011,25.5989,99.9827
977,978,71016,3142,4554,282.552,22.771,67.229,99.8727
978,979,1593,3055,4406,86.6962,0.239616,89.7604,99.9793
979,980,30177,2106,4527,273.58,37.0077,52.9923,97.1594
980,981,10110,719,4446,264.152,36.6118,53.3882,99.9683
981,982,9806,2246,4461,252.425,65.2999,24.7001,99.9034
982,983,7715,49,4478,87.2856,61.2409,28.7591,99.8281
983,984,1707,2950,4427,90.6984,0.130814,89.8692,99.7499
984,985,2755,2125,4434,265.965,40.7302,49.2698,99.9887
985,986,2004,606,4464,269.278,27.6806,62.3194,99.9926
986,987,13045,2381,4502,239.849,68.0847,21.9153,99.2149
987,988,2534,2752,4473,97.7757,52.0531,37.9469,99.9841
988,989,1856,116,4477,91.9567,30.8418,59.1582,99.8875
989,990,61166,185,4671,86.6938,21.0597,68.9403,99.8963
990,991,7026,307,4503,281.026,56.1384,33.8616,99.7658
991,992,5900,2521,4507,236.298,69.5359,20.4641,99.3242
992,993,938,1019,4501,269.263,29.9917,60.0083,99.9038
993,994,2146,2282,4542,84.8664,45.6932,44.3068,99.4774
994,995,12710,485,4575,262.887,18.6608,71.3392,99.8615
995,996,622,70,4545,265.708,55.2558,34.7442,99.9964
996,997,956,1718,4562,269.85,47.417,42.583,99.9933
997,998,6455,326,4594,82.2466,55.0317,34.9683,99.9901
998,999,6637,2557,4599,88.0635,1.36675,88.6332,99.982
999,1000,25205,2478,4657,86.9371,53.4507,36.5493,99.7654
1000,1001,2131,27,4603,268.146,55.105,34.895,99.9622
1001,1002,17971,2269,4634,281.153,66.3838,23.6162,99.8577
1002,1003,3495,607,4597,274.391,24.2131,65.7869,99.9966
1003,1004,16850,2001,4627,84.1512,67.4579,22.5421,99.9342
1004,1005,2033,3270,4605,273.451,28.4856,61.5144,99.9822
1005,1006,5594,1531,4617,304.67,54.1258,35.8742,99.8762
1006,1007,3054,659,4622,76.2935,80.3856,9.61439,99.9231
1007,1008,12048,1835,4651,83.99799999999998,50.949,39.051,99.9798
1008,1009,50925,492,4725,102.029,5.4387300000000005,84.5613,99.7098
1009,1010,9223,1630,4715,299.043,57.8594,32.1406,99.9384
1010,1011,10116,1730,4657,287.378,69.7396,20.2604,99.9486
1011,1012,3883,1615,4663,291.213,69.1059,20.8942,99.9637
1012,1013,1264,1476,4649,64.0011,87.1371,2.86286,99.9921
1013,1014,46295,2102,4781,281.837,42.7374,47.2626,99.9189
1014,1015,779,2564,4682,94.8886,65.4034,24.5966,99.9899
1015,1016,3175,27,4697,265.821,0.08870700000000001,89.9113,99.9626
1016,1017,549,2187,4675,74.3998,58.3694,31.6306,99.9973
1017,1018,1927,335,4693,266.318,27.4015,62.5985,99.9791
1018,1019,5189,720,4732,97.5173,19.0715,70.9285,99.9578
1019,1020,12664,1452,4752,124.674,86.2597,3.74031,99.9477
1020,1021,10089,1911,4729,267.063,20.9417,69.0583,98.586
1021,1022,10555,3212,4765,278.827,48.4912,41.5088,99.9532
1022,1023,21952,2433,4780,255.447,71.7551,18.2449,98.43
1023,1024,1007,285,4712,92.7288,48.8237,41.1763,99.9945
1024,1025,5789,1159,4751,271.66,21.1778,68.8222,99.9596
1025,1026,7327,3049,4804,83.1577,5.76821,84.2318,99.8891
1026,1027,10757,690,4799,267.948,65.1041,24.8959,99.947
1027,1028,3625,1736,4741,265.735,26.3392,63.6608,99.979
1028,1029,8609,1668,4816,82.1447,3.49793,86.5021,99.7533
1029,1030,4117,75,4768,263.638,15.9483,74.0517,99.9873
1030,1031,777,355,4743,92.7771,48.3961,41.6039,99.9951
1031,1032,1047,1246,4752,272.998,26.9713,63.0287,99.9688
1032,1033,646,2522,4752,108.115,60.922,29.078000000000007,99.9824
1033,1034,11058,1070,4837,276.837,7.47907,82.5209,99.8929
1034,1035,1939,1315,4777,268.064,27.2648,62.7352,99.9943
1035,1036,9536,1821,4804,278.626,66.1209,23.8791,99.9363
1036,1037,588,2258,4773,265.381,62.9543,27.0457,99.9382
1037,1038,8378,2647,4819,89.1475,9.88959,80.1104,99.9729
1038,1039,5050,3115,4804,77.8299,29.9973,60.0027,99.9799
1039,1040,4138,1563,4808,279.668,75.616,14.384,99.9836
1040,1041,5403,336,4807,276.597,54.1885,35.8115,99.9654
1041,1042,1134,1400,4784,80.0947,43.1424,46.8576,99.7751
1042,1043,10476,1228,4839,262.711,2.21171,87.7883,99.8819
1043,1044,1124,1734,4800,259.207,0.0718384,89.9282,99.9958
1044,1045,982,16,4814,96.7399,43.9373,46.0627,99.9826
1045,1046,5628,108,4851,263.28700000000003,15.3311,74.6689,99.8847
1046,1047,895,124,4807,262.73,15.9426,74.0574,99.9926
1047,1048,7452,1404,4834,100.277,5.40601,84.594,99.244
1048,1049,1450,3000,4823,49.7172,73.5257,16.4743,99.9911
1049,1050,4782,1895,4834,91.7651,3.67562,86.3244,91.4648
1050,1051,7744,2308,4847,288.987,65.8922,24.1078,99.8875
1051,1052,6569,2829,4844,259.592,46.8024,43.1976,99.9586
1052,1053,1998,1307,4838,85.6486,25.3085,64.6915,99.8873
1053,1054,639,258,4832,320.455,83.6071,6.3928699999999985,99.9774
1054,1055,1568,2240,4846,273.199,41.094,48.90600000000001,99.9948
1055,1056,1738,3281,4870,258.075,19.7591,70.2409,99.8657
1056,1057,7392,2508,4858,281.136,44.5388,45.4612,99.7481
1057,1058,874,2728,4854,279.313,33.8157,56.1843,99.9922
1058,1059,1799,3187,4868,94.7057,35.0457,54.9543,99.9538
1059,1060,2203,971,4879,98.1202,22.8936,67.1064,99.8664
1060,1061,1087,2994,4870,276.696,16.1286,73.8714,99.9796
1061,1062,1094,286,4865,283.135,71.1171,18.8829,99.778
1062,1063,823,847,4882,87.5979,23.353,66.64699999999999,99.8521
1063,1064,2779,3103,4897,230.255,78.0531,11.9469,99.7987
1064,1065,546,1765,4875,251.139,67.0965,22.9035,99.8341
1065,1066,609,1125,4896,274.286,6.911969999999998,83.088,99.9431
1066,1067,2100,1995,4908,278.97,42.8096,47.1904,99.9442
1067,1068,587,1151,4892,270.706,6.48064,83.5194,99.8371
1068,1069,629,2096,4897,274.783,42.5942,47.4058,99.9556
1069,1070,740,2235,4899,267.744,40.4425,49.5575,99.9528
1070,1071,801,1868,4893,314.482,37.1774,52.8226,99.8434
1071,1072,521,2172,4894,269.59,39.9341,50.0659,99.9154
1072,1073,868,2342,4909,264.807,45.0442,44.9558,99.962
1073,1074,2160,3197,4906,91.7713,36.042,53.958,99.9663
1074,1075,981,1469,4907,106.959,4.87325,85.1268,99.9479
1075,1076,1000,1916,4915,93.0191,6.83321,83.1668,98.7831
