,Grain No.,Size [Pixel],center x-coordinate,center y-coordinate,mean azimuth [degree],mean latitude [degree],mean colatitude [degree],Regelungsgrad [%]
0,1,11745,204,157,109.613,1.22021,88.7798,99.9057
1,2,6890,518,118,107.976,56.6713,33.3287,99.8928
2,3,603,611,109,106.634,66.4717,23.5283,99.9675
3,4,543,1007,110,113.944,8.91537,81.0846,99.8854
4,5,4281,686,134,105.901,66.9595,23.0405,99.9793
5,6,4958,795,137,118.971,40.9042,49.0958,99.9823
6,7,23077,1125,187,283.79,46.7195,43.2805,95.5461
7,8,2002,469,140,108.53,56.0851,33.9149,99.7602
8,9,18465,1337,165,107.972,25.553,64.447,99.9696
9,10,1129,349,140,109.859,1.2042700000000002,88.7957,99.977
10,11,861,1492,129,284.055,49.5995,40.4005,99.9621
11,12,2499,906,150,118.864,38.4554,51.5446,99.9763
12,13,13240,1979,197,286.308,2.10903,87.891,97.3042
13,14,3834,1563,171,277.003,39.9405,50.0595,99.9889
14,15,4849,1633,173,297.944,15.6215,74.3785,99.9958
15,16,5190,2077,171,287.041,34.6861,55.3139,99.9837
16,17,4097,1773,154,103.897,14.5357,75.4643,99.9861
17,18,978,1508,150,110.076,6.8662600000000005,83.1337,99.6185
18,19,31527,1847,263,104.462,20.8182,69.1818,99.9794
19,20,7713,2172,200,124.493,6.3456199999999985,83.6544,99.9728
20,21,1265,2325,154,290.839,11.7041,78.2959,99.9667
21,22,2421,2429,171,289.985,1.26635,88.7337,99.9465
22,23,6830,877,206,105.734,11.8298,78.1702,99.9887
23,24,9268,678,194,108.331,67.0224,22.9776,99.9876
24,25,1822,484,180,296.446,38.2531,51.7469,99.989
25,26,7471,373,228,269.259,50.364,39.636,99.9944
26,27,5067,997,204,284.957,17.867,72.133,99.9172
27,28,539,227,188,108.916,1.78558,88.2144,99.9685
28,29,750,2532,173,118.001,31.4905,58.5095,99.9442
29,30,645,1509,182,290.623,50.9455,39.0545,99.8202
30,31,930,1482,183,286.952,50.7783,39.2217,99.9941
31,32,12397,2664,221,106.949,5.28589,84.7141,99.9599
32,33,11610,2377,239,292.888,10.1624,79.8376,99.9224
33,34,628,2581,187,289.9790000000001,37.1518,52.8482,99.9708
34,35,2823,1699,203,106.979,5.93641,84.0636,99.9987
35,36,999,317,214,111.724,1.29543,88.7046,99.9679
36,37,3549,557,209,293.867,12.7926,77.2074,99.9883
37,38,70239,3087,299,290.497,69.7798,20.2202,99.922
38,39,2356,1750,214,288.289,41.1183,48.8817,99.9582
39,40,26314,761,283,336.0630000000001,85.18299999999998,4.81701,99.994
40,41,1525,2270,208,266.693,67.0589,22.9411,99.9948
41,42,594,2492,204,290.764,39.0499,50.9501,99.841
42,43,3694,2225,247,285.5540000000001,75.043,14.957,99.9872
43,44,1941,1257,224,117.464,18.2114,71.7886,99.9806
44,45,3783,1472,243,277.824,48.6184,41.3816,99.9448
45,46,1505,1100,229,115.451,54.4242,35.5758,99.9951
46,47,8804,1353,265,290.79,60.4677,29.5323,99.9238
47,48,44300,1565,330,291.707,31.392,58.608,64.71
48,49,30552,454,326,270.773,57.2411,32.7589,83.5751
49,50,22946,2124,347,282.42,63.8879,26.1121,99.9723
50,51,111453,2744,464,115.58,20.7029,69.2971,98.0994
51,52,2337,919,260,116.076,38.9175,51.0825,99.9938
52,53,533,619,232,110.042,1.54749,88.4525,99.9701
53,54,20032,1013,330,288.7940000000001,53.6243,36.3757,80.2303
54,55,1114,624,262,108.536,64.9389,25.0611,99.9897
55,56,4178,2561,293,290.7340000000001,38.6156,51.3844,99.9811
56,57,771,662,268,288.228,41.105,48.895,99.9941
57,58,3227,1251,279,107.178,30.2484,59.7516,99.9915
58,59,823,1107,267,299.947,72.5933,17.4067,99.9969
59,60,5549,1399,314,108.989,16.4729,73.5271,99.9087
60,61,652,2469,274,287.1090000000001,38.8732,51.1268,99.9972
61,62,173326,443,540,266.594,65.6136,24.3864,59.3197
62,63,13050,2471,372,111.395,10.0277,79.9723,78.8986
63,64,1866,2267,299,284.533,75.3803,14.6197,99.9873
64,65,7284,2016,329,286.132,0.117645,89.8824,99.6569
65,66,3303,894,314,287.002,3.25757,86.7424,99.9785
66,67,1534,1726,314,110.78,1.92255,88.0774,99.9832
67,68,3933,608,316,107.9,64.3223,25.6777,99.9957
68,69,990,978,299,279.757,68.2843,21.7157,99.9881
69,70,12985,2359,375,122.0,57.3548,32.6452,99.9798
70,71,24311,1230,371,281.333,35.6849,54.3151,99.9382
71,72,1152,2301,319,109.022,55.2583,34.7417,99.9963
72,73,6798,2585,381,281.428,47.9807,42.0193,99.9691
73,74,57097,2146,545,281.146,11.5106,78.4894,93.8924
74,75,51499,1863,501,296.832,23.9587,66.0413,85.9963
75,76,10026,1736,409,292.845,29.8942,60.1058,99.9936
76,77,8799,788,404,289.894,2.7004,87.2996,99.9795
77,78,568,860,360,287.401,3.047,86.95299999999997,99.9944
78,79,2499,577,378,291.651,51.2595,38.7405,99.9932
79,80,904,1344,371,298.346,64.3512,25.6488,99.9115
80,81,11837,957,437,284.082,35.6455,54.3545,99.824
81,82,8785,2043,441,113.544,13.7609,76.2391,99.9332
82,83,527,1975,396,293.738,38.5729,51.4271,99.985
83,84,1429,2408,416,121.819,6.21674,83.7833,99.9973
84,85,723,1019,400,284.827,36.8794,53.1206,99.9928
85,86,1801,3315,454,276.967,12.7084,77.2916,99.9577
86,87,6349,1601,437,118.627,48.8752,41.1248,99.9924
87,88,954,3077,405,114.247,17.442,72.558,99.9933
88,89,145250,1238,599,293.342,9.3139,80.6861,96.8889
89,90,333899,2918,880,108.994,43.1045,46.8955,76.2995
90,91,1215,869,427,106.821,49.0945,40.9055,99.9925
91,92,10908,1670,506,110.429,2.84216,87.1578,60.4639
92,93,808,1043,436,270.766,35.5428,54.4572,99.9799
93,94,900,3199,460,277.3,53.56399999999999,36.436,99.9649
94,95,4762,891,492,282.733,42.4316,47.5684,98.1911
95,96,754,519,476,298.587,37.0841,52.9159,99.935
96,97,606,2193,465,260.74,68.5885,21.4115,99.9821
97,98,837,427,471,152.841,71.5691,18.4309,99.9831
98,99,17443,2389,545,110.142,45.161,44.839,76.8366
99,100,7084,1587,551,292.706,19.1136,70.8864,99.0592
100,101,1466,89,535,282.8040000000001,20.783,69.217,99.8815
101,102,2881,925,564,284.031,43.706,46.294,99.9916
102,103,1728,3300,563,102.092,25.7546,64.2454,99.9427
103,104,33627,795,694,296.2920000000001,10.5561,79.4439,99.9906
104,105,44929,2417,690,290.081,64.5356,25.4644,78.178
105,106,1283,1919,577,278.275,6.93974,83.0603,99.9942
106,107,1401,1533,583,295.0440000000001,56.8568,33.1432,99.9907
107,108,6384,2856,609,103.23,16.711,73.289,99.9672
108,109,2141,2283,605,308.6,67.0844,22.9156,99.9865
109,110,1210,1727,598,114.266,17.8437,72.1563,99.9696
110,111,2236,112,641,282.887,21.0758,68.9242,99.9443
111,112,1013,1955,606,109.138,11.4042,78.5958,99.9962
112,113,1469,1628,607,111.694,21.5522,68.4478,99.9866
113,114,15627,931,695,287.923,29.7229,60.2771,99.9649
114,115,3536,1696,637,114.239,59.4113,30.5887,99.9916
115,116,9671,2839,727,299.723,58.4973,31.5027,99.9752
116,117,7131,1632,683,297.413,9.18845,80.8115,99.9883
117,118,6586,1777,668,302.617,65.8333,24.1667,99.9607
118,119,6408,2176,677,116.628,53.05,36.95,99.9804
119,120,2255,2892,681,103.475,24.003,65.997,99.96
120,121,112171,1804,941,300.453,18.9565,71.0435,98.3393
121,122,1139,2775,686,108.477,20.9323,69.0677,99.9901
122,123,2519,642,715,288.705,39.2491,50.7509,99.9797
123,124,635,227,688,284.235,45.8591,44.1409,99.9717
124,125,56096,1327,812,294.393,24.3719,65.6281,99.9576
125,126,37709,2621,805,111.991,5.7385,84.2615,99.9759
126,127,604,595,695,292.271,6.2324,83.7676,99.9954
127,128,7194,1553,732,117.465,0.373222,89.6268,99.9939
128,129,54245,470,863,294.452,14.244000000000002,75.756,83.5981
129,130,33273,2156,790,290.778,31.6484,58.3516,99.9504
130,131,2378,2721,734,115.398,57.0018,32.9982,99.9807
131,132,1399,614,738,109.215,25.8362,64.1638,99.9908
132,133,2814,1652,741,288.78,57.8074,32.1926,99.9415
133,134,6333,2778,779,277.518,16.8616,73.1384,99.9888
134,135,8502,231,806,103.385,40.071,49.929,99.9923
135,136,12848,1678,824,297.091,12.4808,77.5192,99.8018
136,137,1624,293,754,115.6,17.6401,72.3599,99.9818
137,138,9708,1080,812,290.548,45.545,44.455,99.9893
138,139,1420,325,780,287.336,1.40871,88.5913,99.9796
139,140,5801,692,802,276.619,36.5738,53.4262,99.9921
140,141,2230,896,785,163.217,82.60600000000002,7.3940100000000015,99.9929
141,142,1317,1536,789,297.61,11.6547,78.3453,99.994
142,143,615,286,796,113.909,18.3673,71.6327,99.9512
143,144,1906,1004,821,115.936,7.77407,82.2259,99.8591
144,145,2888,3297,869,101.476,18.3349,71.6651,99.9733
145,146,1049,1583,811,290.29,55.0323,34.9677,99.9897
146,147,3061,2030,822,87.4566,77.5499,12.4501,99.9886
147,148,15096,823,870,279.051,61.45,28.55,99.4525
148,149,19001,2320,873,290.779,53.2248,36.7752,99.9869
149,150,818,2445,817,108.456,4.41141,85.5886,99.9952
150,151,6632,952,850,290.152,37.7231,52.2769,99.977
151,152,8554,1510,856,296.092,6.967510000000001,83.0325,99.8276
152,153,15963,649,879,295.895,50.0023,39.9977,99.9292
153,154,14668,1405,912,283.018,24.2049,65.7951,99.9589
154,155,1771,1216,857,111.23,36.0584,53.9416,99.9694
155,156,1613,408,853,133.107,69.8511,20.1489,99.991
156,157,2978,2423,869,107.432,5.69904,84.301,99.9829
157,158,8292,2847,890,275.65,16.0536,73.9464,99.9873
158,159,64590,1055,1086,296.014,31.4088,58.5912,99.1658
159,160,28450,2043,954,298.096,54.1467,35.8533,99.7925
160,161,1585,908,881,269.356,39.036,50.964,99.9898
161,162,1837,232,896,104.092,39.9856,50.0144,99.9955
162,163,29116,1590,967,291.185,53.5194,36.4806,99.78
163,164,1744,1016,901,298.297,32.7446,57.2554,99.871
164,165,11232,2187,952,114.106,10.3,79.7,99.9969
165,166,3121,265,940,118.411,15.3455,74.6545,97.485
166,167,39019,890,1019,108.462,47.6382,42.3618,99.8002
167,168,27676,695,1020,119.735,19.1081,70.8919,99.9867
168,169,525,3281,929,229.398,78.9127,11.0873,99.9695
169,170,83068,531,1166,288.409,41.2819,48.7181,99.6301
170,171,727,1356,930,292.093,3.86722,86.1328,99.9765
171,172,10469,1888,985,248.404,85.1384,4.8616199999999985,99.7513
172,173,6313,2269,975,290.437,31.5287,58.4713,99.9871
173,174,4605,204,972,114.341,8.05797,81.94200000000002,82.9392
174,175,5118,3084,965,129.506,78.8399,11.1601,99.9814
175,176,587,3274,964,228.312,78.7714,11.2286,99.9636
176,177,4212,1344,980,148.179,78.3068,11.6932,99.9629
177,178,690,314,968,96.1677,65.7404,24.2596,99.9857
178,179,28875,240,1087,306.025,66.7926,23.2074,99.936
179,180,2327,84,1037,114.114,25.2911,64.7089,99.7939
180,181,2670,1298,1031,302.088,18.4514,71.5486,99.9912
181,182,512048,2623,1444,115.611,37.8869,52.1131,77.1777
182,183,4468,1229,1042,298.4790000000001,56.9501,33.0499,99.9094
183,184,27528,1350,1134,104.177,61.2631,28.7369,99.9476
184,185,591,2873,1027,287.707,33.4838,56.5162,99.9938
185,186,1078,3300,1051,268.565,31.9676,58.0324,99.9268
186,187,2833,1493,1055,103.924,59.9216,30.0784,99.9485
187,188,3664,1854,1059,295.045,18.767,71.233,99.9825
188,189,64795,2523,1242,2.76364,83.1962,6.80382,99.8364
189,190,15322,1972,1119,293.335,33.325,56.675,99.8384
190,191,531,127,1059,112.424,26.4599,63.5401,99.9668
191,192,740,1052,1074,111.244,52.0455,37.9545,99.9818
192,193,502,1281,1079,299.345,57.9825,32.0175,99.9926
193,194,15770,1577,1146,292.903,1.08433,88.9157,99.6685
194,195,4697,127,1162,114.689,25.833,64.167,99.8924
195,196,18337,3012,1158,45.9472,86.3849,3.61512,99.9347
196,197,1243,2532,1093,113.975,23.106,66.89399999999999,99.9953
197,198,619,3184,1100,272.944,31.8464,58.1536,99.9767
198,199,1692,757,1110,280.509,65.9461,24.0539,99.9933
199,200,19925,1467,1197,304.957,19.5887,70.4113,99.9415
200,201,27520,1190,1209,102.116,2.24343,87.7566,99.9602
201,202,2279,2910,1146,283.327,51.1075,38.8925,99.9848
202,203,5193,1870,1147,294.008,54.0695,35.9305,99.9919
203,204,631,432,1129,299.5440000000001,11.2408,78.7592,99.9875
204,205,1890,3116,1142,274.605,30.7205,59.2795,99.983
205,206,12914,3144,1220,291.4770000000001,49.9751,40.0249,99.8789
206,207,9687,806,1211,123.187,19.7526,70.2474,99.9543
207,208,4772,2797,1183,286.003,50.1654,39.8346,99.9949
208,209,7761,713,1200,94.209,68.8573,21.1427,99.9879
209,210,38597,272,1279,277.472,3.06276,86.9372,99.989
210,211,13883,1921,1255,300.505,55.3446,34.6554,99.8901
211,212,1316,913,1206,122.036,20.5132,69.4868,99.991
212,213,4097,869,1246,79.8497,74.4238,15.5762,99.985
213,214,7676,964,1271,288.291,8.4716,81.5284,98.7086
214,215,2460,1758,1253,111.343,1.66885,88.3312,99.9967
215,216,20720,470,1310,284.821,87.4609,2.53906,99.9742
216,217,41297,1544,1360,231.399,81.8449,8.15507,99.9226
217,218,5687,1341,1290,116.247,21.2565,68.7435,99.9839
218,219,5094,1860,1326,297.754,52.8269,37.1731,99.1559
219,220,24082,1745,1369,120.569,6.6646,83.3354,99.9623
220,221,842,1702,1290,247.333,82.2886,7.71143,99.9893
221,222,300656,1388,1553,298.802,34.2577,55.7423,18.3926
222,223,956,877,1299,284.897,65.6522,24.3478,99.8388
223,224,76579,621,1480,290.94,25.1691,64.8309,55.5198
224,225,6417,143,1379,301.466,67.5846,22.4154,99.9585
225,226,1300,3231,1358,110.727,23.988000000000003,66.012,99.9543
226,227,2295,1105,1348,285.579,35.1469,54.8531,99.9687
227,228,13498,911,1377,299.283,31.5933,58.4067,99.8779
228,229,702,1957,1333,110.79,8.95072,81.0493,99.9778
229,230,1374,96,1371,300.742,67.5948,22.4052,99.8849
230,231,1302,3264,1357,110.646,23.3278,66.6722,99.9729
231,232,2226,1002,1399,286.72,12.2412,77.7588,99.2659
232,233,14953,329,1418,159.845,80.5163,9.48373,99.9703
233,234,7072,1109,1424,116.198,38.7205,51.2795,99.8802
234,235,1019,1847,1405,114.842,17.6843,72.3157,99.9693
235,236,10476,473,1435,111.565,25.6102,64.3898,99.8364
236,237,8101,198,1473,290.722,26.6764,63.3236,99.8069
237,238,1516,935,1450,278.871,45.7865,44.2135,99.9874
238,239,814,82,1491,112.558,37.3013,52.6987,99.8489
239,240,12873,303,1580,150.275,85.1096,4.89044,99.9845
240,241,5555,207,1566,282.372,18.5344,71.4656,99.9877
241,242,46607,628,1653,295.921,47.3532,42.6468,99.983
242,243,799,73,1577,112.575,37.7209,52.2791,99.8422
243,244,138455,2079,1872,111.804,12.4161,77.5839,96.4749
244,245,680,2153,1587,118.135,20.2657,69.7343,99.952
245,246,17185,2241,1659,290.822,30.8893,59.1107,99.9644
246,247,517,2180,1596,290.79,31.0881,58.9119,99.8239
247,248,3999,2340,1623,296.4240000000001,52.7412,37.2588,99.9714
248,249,1731,2399,1617,115.436,21.5364,68.4636,99.9789
249,250,689,377,1619,104.716,54.4057,35.5943,99.9861
250,251,1794,182,1645,115.574,37.4511,52.5489,99.9843
251,252,1220,2872,1620,109.107,26.2661,63.7339,99.9506
252,253,3900,1740,1653,116.492,29.9929,60.0071,99.9907
253,254,930,1117,1648,266.323,71.2301,18.7699,99.6471
254,255,75736,1243,1813,110.677,10.3786,79.6214,99.9406
255,256,13785,260,1700,282.3540000000001,18.5725,71.4275,99.9578
256,257,3678,2379,1682,288.883,31.4893,58.5107,99.9951
257,258,1943,2486,1667,317.87,73.2913,16.7087,99.9147
258,259,213203,602,2046,102.53,46.2918,43.7082,99.59
259,260,30901,1615,1790,105.602,37.0034,52.9966,99.904
260,261,5540,2459,1723,102.094,7.9768,82.0232,99.3314
261,262,656,108,1699,278.846,18.8497,71.1503,99.9578
262,263,1093,1698,1707,104.439,38.1149,51.8851,99.9527
263,264,38578,2612,1806,283.008,58.8591,31.1409,99.8139
264,265,4204,813,1738,299.945,29.7221,60.2779,99.9909
265,266,9003,1448,1759,162.829,87.5338,2.46625,99.9756
266,267,4601,2314,1748,294.395,45.3099,44.6901,99.9791
267,268,5607,2388,1758,281.062,57.2874,32.7126,99.9912
268,269,22693,1775,1814,117.179,29.5882,60.4118,99.949
269,270,7381,233,1810,290.79,46.9742,43.0258,99.9857
270,271,11733,743,1799,291.427,32.5786,57.4214,99.8929
271,272,2000,2228,1752,295.993,53.3613,36.6387,99.9744
272,273,743,2817,1788,275.11400000000003,44.8809,45.1191,99.8492
273,274,12046,2925,1811,106.987,29.9749,60.0251,99.5261
274,275,604,2253,1775,122.378,30.3583,59.6417,99.9957
275,276,14789,871,1829,114.947,45.1303,44.8697,99.9836
276,277,8881,2319,1818,287.6690000000001,16.4812,73.5188,99.9357
277,278,48744,920,1936,107.027,27.3904,62.6096,99.4712
278,279,3495,2784,1822,280.821,42.9096,47.0904,99.985
279,280,11391,3108,1857,116.521,23.5195,66.4805,99.9633
280,281,1235,3160,1823,271.692,48.9812,41.0188,99.9944
281,282,1629,658,1818,92.9593,66.1284,23.8716,99.9861
282,283,34769,1481,1916,301.35,45.9186,44.0814,99.8651
283,284,16803,1109,1954,282.156,46.2085,43.7915,99.8913
284,285,634,95,1845,285.186,48.4902,41.5098,99.9617
285,286,47145,2978,1954,269.555,61.6855,28.3145,87.1905
286,287,6263,2487,1868,287.505,46.8266,43.1734,99.6674
287,288,2654,708,1879,293.038,38.7585,51.2415,99.9902
288,289,17138,2349,1910,121.348,29.7232,60.2768,99.9839
289,290,2524,2250,1883,291.261,42.328,47.672,99.9828
290,291,6992,224,1917,294.633,45.8941,44.1059,99.964
291,292,7979,2798,1902,113.982,0.963051,89.0369,99.9924
292,293,1229,760,1879,96.737,72.5334,17.4666,99.9875
293,294,334757,1561,2170,116.797,15.6252,74.3748,98.3997
294,295,591,100,1898,286.613,48.0369,41.9631,99.9604
295,296,3529,406,1933,313.244,81.0753,8.924669999999997,99.8809
296,297,668,380,1901,98.9021,50.4541,39.5459,99.9874
297,298,102760,2424,2119,286.8590000000001,35.8401,54.1599,99.7464
298,299,16905,2691,1968,115.873,41.1916,48.8084,99.903
299,300,981,72,1932,107.127,53.0736,36.9264,99.921
300,301,1973,2851,1939,278.28,21.1939,68.8061,99.9609
301,302,2765,79,2006,99.9147,54.4662,35.5338,99.8961
302,303,4271,294,1959,311.432,80.6198,9.38019,99.9862
303,304,604,358,1966,96.2911,47.293,42.707,99.8983
304,305,2329,1012,2003,121.819,45.5984,44.4016,99.8547
305,306,50027,3091,2157,305.264,64.1086,25.8914,99.7427
306,307,3662,330,2008,159.366,83.9346,6.06537,99.9454
307,308,30932,2835,2159,277.91900000000004,14.9012,75.0988,99.9512
308,309,2548,205,2030,156.75,84.1618,5.83823,99.9875
309,310,6775,256,2059,285.634,47.3554,42.6446,99.967
310,311,43047,347,2186,274.217,52.8888,37.1112,99.989
311,312,4289,1415,2054,297.953,82.2349,7.76513,99.971
312,313,6410,3050,2062,293.149,33.9269,56.0731,99.8501
313,314,2536,112,2072,99.5453,54.346,35.654,99.9739
314,315,704,2394,2057,276.131,32.1801,57.8199,99.9586
315,316,2470,2388,2093,276.871,34.83,55.17,99.752
316,317,13032,844,2122,290.001,42.7534,47.2466,99.9853
317,318,1722,78,2109,102.274,54.1591,35.8409,99.9263
318,319,689,2136,2081,279.634,37.3085,52.6915,99.9783
319,320,2398,2904,2101,301.844,64.1787,25.8213,99.9651
320,321,926,2209,2095,106.771,46.2448,43.7552,99.9925
321,322,10484,2134,2151,300.032,2.40705,87.5929,99.9843
322,323,1817,188,2159,287.742,47.6961,42.3039,99.9654
323,324,3118,2720,2134,288.25,56.542,33.458,99.9853
324,325,2002,2643,2139,294.951,65.1092,24.8908,99.9636
325,326,5410,2483,2173,114.561,36.5483,53.4517,99.7483
326,327,661,82,2170,100.98,20.3641,69.6359,99.8842
327,328,10459,2549,2228,292.051,51.4817,38.5183,99.9579
328,329,739,2630,2165,115.066,58.025,31.975,99.9945
329,330,23234,2767,2268,289.04,64.9519,25.0482,99.8563
330,331,24339,595,2285,120.033,32.5359,57.4641,99.9768
331,332,993,2612,2205,116.323,21.2972,68.7028,99.9917
332,333,9390,128,2269,284.449,23.1135,66.8865,99.9509
333,334,3068,3108,2251,95.7326,61.6406,28.3594,99.9795
334,335,26026,1081,2311,296.857,71.4193,18.5807,99.9386
335,336,30264,2078,2336,303.103,77.5574,12.4426,99.9512
336,337,652,473,2254,276.597,53.0243,36.9757,99.9905
337,338,34351,2608,2339,115.762,23.1858,66.8142,99.727
338,339,25317,301,2353,109.706,30.7791,59.2209,99.9723
339,340,27615,3093,2374,106.429,1.11119,88.8888,99.8355
340,341,1153,3247,2314,101.964,0.246056,89.7539,99.9479
341,342,861,454,2301,96.8319,15.5906,74.4094,99.9693
342,343,1894,82,2355,277.78,66.3105,23.6895,99.9865
343,344,902,2378,2315,287.939,48.3361,41.6639,99.979
344,345,55120,2315,2507,119.324,57.7788,32.2212,66.7179
345,346,9467,2251,2367,119.012,34.2636,55.7364,99.9857
346,347,4176,1323,2354,292.752,72.8865,17.1135,99.9867
347,348,2618,1815,2355,120.897,26.2221,63.7779,99.9729
348,349,1028,475,2343,87.3563,59.2296,30.7704,99.9636
349,350,11419,967,2408,279.711,56.9081,33.0919,99.7725
350,351,6215,2786,2389,288.001,3.33522,86.6648,99.9679
351,352,7181,1116,2402,108.344,4.1245699999999985,85.8754,99.9812
352,353,6782,2328,2395,121.266,40.3014,49.6986,99.8038
353,354,27225,2964,2455,109.17,69.5467,20.4533,99.7215
354,355,65032,228,2559,287.332,4.97778,85.0222,83.9315
355,356,1023,3261,2373,97.436,60.7024,29.2976,99.9636
356,357,24154,614,2418,282.031,18.9569,71.0431,99.9635
357,358,766,1861,2364,121.584,5.65099,84.34899999999998,99.9665
358,359,6374,1733,2402,110.587,20.5643,69.4357,99.9745
359,360,5343,468,2412,292.122,71.8387,18.1613,99.9797
360,361,9192,1363,2425,298.957,15.843,74.157,99.8768
361,362,201894,1222,2643,294.172,21.4926,68.5074,62.0636
362,363,921,1454,2394,290.6690000000001,9.36472,80.6353,99.9084
363,364,49532,1706,2544,114.39,7.17166,82.8283,91.2413
364,365,1084,1047,2414,103.476,25.4698,64.5302,99.9454
365,366,1415,2126,2423,301.74,57.7914,32.2086,99.9777
366,367,160095,2881,2729,286.062,3.74756,86.2524,96.7887
367,368,57765,2537,2652,295.301,29.6673,60.3327,98.6872
368,369,2056,95,2460,106.417,30.9653,59.0347,99.9651
369,370,815,3257,2443,99.3423,63.1813,26.8187,99.952
370,371,518,64,2455,109.306,30.5233,59.4767,99.8716
371,372,2052,2222,2457,300.43,57.3456,32.6544,99.9691
372,373,2605,437,2465,272.05,18.892,71.108,99.9401
373,374,1033,1429,2458,287.589,8.57493,81.4251,99.7356
374,375,181269,1853,2707,295.529,0.931358,89.0686,99.8209
375,376,2516,1930,2475,288.876,6.71974,83.2803,99.3204
376,377,2388,3091,2494,127.346,42.8239,47.1761,99.9882
377,378,4050,643,2508,281.749,61.7165,28.2835,99.7151
378,379,2153,2609,2513,121.745,38.4731,51.5269,99.9423
379,380,1735,742,2514,280.133,60.0122,29.9878,99.5689
380,381,1586,827,2538,101.043,15.9573,74.0427,99.9447
381,382,9313,542,2544,301.4240000000001,71.6817,18.3183,99.8167
382,383,1320,2497,2517,121.038,38.8714,51.1286,99.5282
383,384,9063,705,2563,82.1433,61.607,28.393,99.9639
384,385,3306,2421,2553,115.513,40.5119,49.4881,99.677
385,386,10806,3128,2580,283.323,15.7486,74.2514,99.9488
386,387,13820,302,2649,288.694,23.5795,66.4205,99.9734
387,388,88714,496,2751,102.409,26.8605,63.1395,85.8433
388,389,46529,943,2795,107.103,13.7619,76.2381,99.5884
389,390,7057,2319,2604,289.562,50.1629,39.8371,99.9834
390,391,1694,630,2590,101.639,23.2364,66.7636,99.959
391,392,4094,812,2629,88.8919,58.2286,31.7714,99.9759
392,393,870,227,2611,118.199,21.2851,68.7149,99.9395
393,394,6083,648,2642,288.138,17.0891,72.9109,99.9843
394,395,1616,751,2618,99.5274,21.9761,68.0239,99.994
395,396,619,3058,2625,118.615,46.1499,43.8501,99.9655
396,397,4026,2823,2668,129.57299999999998,33.7919,56.2081,99.9717
397,398,15433,1419,2701,119.306,28.532,61.468,99.8282
398,399,1369,251,2645,323.386,85.9704,4.02963,99.9962
399,400,24780,3117,2737,111.222,11.8582,78.1418,99.9535
400,401,14689,2325,2714,291.883,28.7127,61.2873,99.8497
401,402,2964,744,2661,290.525,0.495865,89.5041,99.9953
402,403,570,3241,2684,111.307,69.7785,20.2215,99.9508
403,404,2816,2423,2722,301.886,49.872,40.128,99.9894
404,405,27133,778,2758,308.725,83.4388,6.56115,99.9546
405,406,1295,254,2719,107.961,23.7324,66.2676,99.999
406,407,714,2788,2732,129.002,33.394,56.606,99.9981
407,408,15652,2202,2789,302.118,49.4398,40.5602,99.979
408,409,1075,228,2742,111.833,10.7108,79.2892,99.969
409,410,1414,2686,2777,105.549,1.35178,88.6482,99.9957
410,411,10876,252,2814,113.041,36.0088,53.9912,99.9943
411,412,3310,2769,2806,114.954,40.3726,49.6274,99.9514
412,413,4306,101,2812,290.788,23.4651,66.5349,99.9239
413,414,562,2305,2785,117.751,20.839,69.161,99.9924
414,415,1350,1428,2799,283.6670000000001,17.2461,72.7539,99.9015
415,416,109103,2599,3006,115.808,40.2298,49.7702,94.7719
416,417,590,2654,2792,133.045,36.2186,53.7814,99.9944
417,418,808,173,2807,109.916,40.1079,49.8921,99.9706
418,419,6103,1914,2851,111.23,32.0481,57.9519,99.988
419,420,5622,2566,2828,123.108,59.9068,30.0932,99.9844
420,421,2509,1367,2819,286.4,29.7799,60.2201,99.8961
421,422,3982,324,2853,110.791,9.05294,80.9471,99.9927
422,423,7767,1105,2871,279.432,34.1993,55.8007,99.9377
423,424,8058,2722,2862,277.411,68.0331,21.9669,99.9709
424,425,62009,2250,2943,128.30700000000002,42.7064,47.2936,99.8938
425,426,986,2037,2833,119.839,14.0198,75.9802,99.9769
426,427,1795,748,2840,288.921,12.7556,77.2444,99.9942
427,428,1881,828,2858,288.838,11.5726,78.4274,99.9846
428,429,89221,320,3019,294.595,32.3422,57.6578,95.6351
429,430,22465,1491,2916,114.354,29.8687,60.1313,98.6791
430,431,177194,1866,3130,292.694,65.5335,24.4665,99.1701
431,432,13575,3119,2906,124.142,45.4424,44.5576,99.9162
432,433,1584,2669,2867,131.707,36.1594,53.8406,99.9959
433,434,51416,660,2982,291.274,22.0503,67.9497,99.9663
434,435,3848,1992,2893,133.69899999999998,69.7132,20.2868,99.9687
435,436,1851,77,2896,291.409,25.2078,64.7922,99.9457
436,437,2469,1070,2920,113.662,51.3453,38.6547,99.9795
437,438,21687,913,2990,106.291,52.1666,37.8334,99.4795
438,439,11315,3226,3013,118.535,7.98118,82.0188,99.8375
439,440,4738,1930,2958,117.192,13.8893,76.1107,99.9229
440,441,2509,2809,2958,129.254,35.077,54.923,99.9468
441,442,1263,1160,2976,129.463,57.4676,32.5324,99.9927
442,443,14336,1092,3080,299.743,45.0823,44.9177,99.5022
443,444,13737,2150,3025,114.367,37.5013,52.4987,99.7281
444,445,25959,1443,3062,283.264,42.8207,47.1793,99.5986
445,446,10589,1182,3043,306.012,41.9469,48.0531,99.8881
446,447,5130,2903,3024,281.414,43.6914,46.3086,99.7681
447,448,10410,2980,3083,290.562,0.552353,89.4476,94.4078
448,449,2333,1305,3015,107.011,2.53957,87.4604,99.893
449,450,70011,880,3167,298.496,8.528880000000001,81.4711,99.9525
450,451,43691,1241,3210,112.223,24.8691,65.1309,99.9632
451,452,4335,521,3096,305.777,62.8549,27.1451,99.987
452,453,7894,2880,3117,105.766,57.9695,32.0305,99.9786
453,454,6508,2238,3113,104.136,9.03197,80.968,99.9828
454,455,23129,3187,3188,113.905,53.3484,36.6516,99.9006
455,456,80828,1573,3323,295.405,10.5909,79.4091,99.7792
456,457,1444,1348,3123,118.499,32.9786,57.0214,99.9897
457,458,39171,2446,3299,291.097,27.8736,62.1264,90.404
458,459,5246,550,3140,275.17900000000003,65.8574,24.1426,99.9905
459,460,6782,3038,3154,107.379,20.3352,69.6648,99.9875
460,461,25211,2573,3202,112.319,12.7186,77.2814,99.9709
461,462,1763,81,3162,281.575,53.005,36.995,99.9565
462,463,56463,609,3275,296.677,24.9932,65.0068,99.9876
463,464,2356,2332,3146,286.066,6.05305,83.947,99.9668
464,465,7161,459,3204,288.498,46.6067,43.3933,99.9268
465,466,936,2962,3172,114.868,10.5711,79.4289,99.9973
466,467,2176,2271,3182,88.4596,67.3801,22.6199,99.9959
467,468,83819,331,3382,92.6507,4.2213400000000005,85.7787,99.8727
468,469,1099,1341,3173,108.452,12.2399,77.7601,99.9812
469,470,17573,195,3312,291.943,50.6723,39.3277,99.7645
470,471,62348,2276,3381,310.795,67.7903,22.2097,99.764
471,472,4471,1093,3210,293.638,22.4549,67.5451,99.9954
472,473,679,1890,3211,92.5633,62.68600000000001,27.314,99.972
473,474,1461,1371,3207,285.077,18.5227,71.4773,99.9952
474,475,71352,3096,3363,293.717,10.4974,79.5026,99.4832
475,476,1000,2953,3203,299.515,13.2214,76.7786,99.8559
476,477,6262,2895,3234,116.557,63.0907,26.9093,99.9555
477,478,536,2746,3214,289.103,1.1428200000000002,88.8572,99.9714
478,479,848,422,3243,113.167,34.1129,55.8871,99.9449
479,480,16527,2669,3287,110.53,3.4043300000000003,86.5957,99.8365
480,481,625,1036,3239,297.035,48.4162,41.5838,99.9694
481,482,555,92,3258,284.319,53.0685,36.9315,99.9725
482,483,6376,980,3306,84.6289,76.2492,13.7508,99.9651
483,484,8205,1361,3302,278.064,37.2924,52.7076,99.9754
484,485,3883,2808,3283,140.2,73.8647,16.1353,99.957
485,486,1497,1103,3267,290.772,12.8592,77.1408,99.9859
486,487,11280,1059,3331,292.891,15.5595,74.4405,99.9707
487,488,11124,1704,3368,290.494,4.840319999999998,85.1597,99.951
488,489,6170,763,3333,283.847,42.7514,47.2486,99.9243
489,490,1123,84,3301,286.718,51.6215,38.3785,99.8997
490,491,169292,1951,3511,108.729,1.00882,88.9912,91.938
491,492,9589,2694,3365,285.355,44.0328,45.9672,99.9621
492,493,140716,2848,3593,114.01,6.79305,83.2069,72.9897
493,494,8809,1182,3372,129.34,62.5389,27.4611,99.934
494,495,19476,853,3400,115.603,48.74100000000001,41.25899999999999,99.9836
495,496,6756,2614,3393,119.397,43.7517,46.2483,99.9905
496,497,73627,637,3539,105.065,15.0965,74.9035,86.2271
497,498,38840,2480,3545,293.298,10.4302,79.5698,69.0951
498,499,5707,1094,3411,294.433,38.8056,51.1944,99.9816
499,500,26120,1291,3486,102.161,18.7317,71.2683,98.7379
500,501,3053,244,3418,294.4120000000001,40.7545,49.2455,99.9944
501,502,664,963,3408,296.155,44.854,45.146,99.988
502,503,7320,963,3478,116.874,58.9075,31.0925,99.3643
503,504,995,78,3452,295.954,18.8842,71.1158,99.9479
504,505,1609,2727,3453,138.891,67.0234,22.9766,99.9901
505,506,70243,985,3607,288.823,15.2106,74.7894,99.7781
506,507,1286,1074,3452,118.814,30.3677,59.6323,99.9869
507,508,25814,2638,3535,102.819,21.693,68.307,99.948
508,509,3185,1178,3492,254.886,76.5926,13.4074,99.2537
509,510,52067,1521,3598,123.432,52.2249,37.7751,88.1434
510,511,665,98,3493,93.8978,5.66582,84.3342,99.9817
511,512,723,1396,3526,116.81,25.447,64.553,99.9637
512,513,1088,67,3585,267.686,74.2342,15.7658,99.9848
513,514,34457,1209,3653,295.071,8.717080000000001,81.2829,99.9127
514,515,703,3080,3572,68.0755,76.9277,13.0723,99.465
515,516,3383,1353,3609,122.877,61.2011,28.7989,99.9947
516,517,841,3237,3580,289.725,8.2599,81.7401,99.8626
517,518,1969,2502,3593,75.4391,73.6105,16.3894,99.9691
518,519,1562,3174,3589,107.275,3.23655,86.7635,99.978
519,520,21425,387,3642,92.9452,76.4055,13.5945,99.9009
520,521,15117,220,3655,95.3785,44.0511,45.9489,99.9805
521,522,1239,268,3592,115.925,30.4317,59.5683,99.9833
522,523,2974,3209,3632,115.512,0.028923,89.9711,99.6555
523,524,6665,793,3644,110.382,10.918,79.082,99.9849
524,525,19372,3105,3702,294.442,8.23978,81.7602,99.9713
525,526,2655,2289,3629,102.714,13.9367,76.0633,99.992
526,527,9907,1681,3681,291.769,3.3530300000000004,86.647,99.9472
527,528,10384,1772,3708,115.9,29.4135,60.5865,99.9867
528,529,27748,1975,3774,293.7990000000001,23.5457,66.4543,48.0708
529,530,2410,521,3657,299.283,50.1356,39.8644,99.9841
530,531,737,146,3648,298.935,15.8079,74.1921,99.951
531,532,169292,2168,3932,287.118,17.0411,72.9589,70.7459
532,533,3114,94,3688,284.521,31.4659,58.5341,99.9623
533,534,1169,3151,3659,64.5808,73.9703,16.0297,99.9905
534,535,8148,2083,3701,311.026,65.3426,24.6574,99.9849
535,536,6524,592,3689,111.947,68.6125,21.3875,99.9878
536,537,3866,1389,3695,113.728,32.7937,57.2063,99.9923
537,538,685,2324,3682,102.777,14.0054,75.9946,99.9768
538,539,1316,150,3700,296.721,15.0272,74.9728,99.929
539,540,82930,455,3965,129.11,44.8143,45.1857,99.8852
540,541,714,525,3702,315.135,81.7004,8.2996,99.9926
541,542,2691,2414,3718,102.623,11.125,78.875,99.7588
542,543,34685,755,3804,278.457,46.7052,43.2948,99.9733
543,544,1247,2361,3712,108.389,28.9692,61.0308,99.9876
544,545,1950,2588,3735,104.46,68.4748,21.5252,99.9912
545,546,1716,2522,3708,113.739,2.43384,87.5662,99.9914
546,547,10635,1255,3767,278.948,11.3413,78.6587,99.971
547,548,103539,1631,3963,291.759,30.4979,59.5021,88.2611
548,549,1230,3216,3751,98.5178,42.9034,47.0966,99.9697
549,550,3866,1440,3764,265.676,75.7948,14.2052,97.0757
550,551,4223,189,3754,151.107,87.8473,2.15268,99.9755
551,552,255544,2794,3998,117.799,5.90824,84.0918,82.0734
552,553,4012,529,3764,117.392,29.2133,60.7867,99.9183
553,554,568,51,3739,281.567,8.00493,81.9951,99.9622
554,555,936,847,3740,276.051,79.5867,10.4133,99.9984
555,556,10850,2541,3782,109.376,72.3387,17.6613,99.9787
556,557,1704,1339,3753,256.39,67.3177,22.6823,99.9733
557,558,662,124,3741,111.812,17.067999999999998,72.932,99.9795
558,559,2808,589,3754,112.993,9.84104,80.15899999999998,99.9989
559,560,757,2100,3754,286.846,55.3317,34.6683,99.9947
560,561,920,1067,3747,103.805,16.3763,73.6237,99.987
561,562,966,2370,3751,104.766,68.0941,21.9059,99.9925
562,563,1291,938,3789,272.637,81.0735,8.92654,99.952
563,564,1535,1382,3761,127.733,67.1223,22.8777,99.9908
564,565,1368,61,3793,117.223,5.73414,84.2659,99.8896
565,566,1699,282,3782,106.016,18.7788,71.2212,99.9984
566,567,35630,212,3868,286.404,31.9605,58.0395,99.9771
567,568,3304,1090,3798,101.256,39.309,50.691,99.9713
568,569,8235,1777,3844,116.124,25.492,64.508,99.9933
569,570,10508,3171,3876,291.959,33.4276,56.5724,99.8784
570,571,7316,1881,3833,113.261,6.934660000000001,83.0653,99.994
571,572,596,1163,3786,253.353,69.3934,20.6066,99.9723
572,573,2838,1824,3807,284.503,29.7616,60.2384,99.9939
573,574,11280,1479,3852,291.891,13.6973,76.3027,99.5541
574,575,2300,2070,3821,114.447,50.6162,39.3838,99.9921
575,576,8714,593,3838,112.663,44.5134,45.4866,99.9768
576,577,24504,1331,3883,301.635,38.1795,51.8205,99.9787
577,578,38191,1151,3936,132.705,65.6484,24.3516,99.622
578,579,1061,3219,3832,291.428,39.8914,50.1086,99.9541
579,580,609,882,3820,96.0034,39.9664,50.0336,99.9625
580,581,18967,999,3869,302.56,61.3786,28.6214,99.8674
581,582,3340,666,3868,118.428,69.9027,20.0973,99.9911
582,583,109951,795,4053,169.065,79.0495,10.9505,50.0633
583,584,629,3191,3874,108.713,8.26116,81.7388,99.9474
584,585,1159,1627,3887,132.57,55.1228,34.8772,99.997
585,586,5326,3102,3921,106.815,41.9487,48.0513,99.9658
586,587,1322,1867,3910,281.958,54.6075,35.3925,99.9892
587,588,5282,1460,3951,291.574,6.40717,83.5928,99.8685
588,589,209484,264,4311,112.647,6.83173,83.1683,93.142
589,590,3980,944,3957,115.103,9.39072,80.6093,99.7725
590,591,1241,1000,3969,111.006,44.835,45.165,99.9856
591,592,1761,1398,3971,196.665,80.4611,9.53894,99.9951
592,593,3575,148,4003,107.137,31.9576,58.0424,99.9322
593,594,13905,1325,4025,126.235,45.9054,44.0946,97.4586
594,595,1054,60,4013,107.067,31.6773,58.3227,99.9232
595,596,667,246,3991,117.028,15.2404,74.7596,99.9543
596,597,4880,3191,4059,113.73,63.6096,26.3904,99.4565
597,598,1394,1118,4047,109.672,7.25293,82.7471,99.8376
598,599,848,1908,4052,97.4205,51.2754,38.7246,99.99
599,600,1934,1766,4077,291.422,4.91707,85.0829,99.9864
600,601,5319,1189,4079,297.56,86.9652,3.0348,99.9834
601,602,775,87,4072,104.161,31.9553,58.0447,99.9817
602,603,661,56,4076,105.86,31.9794,58.0206,99.9533
603,604,3758,1985,4105,295.7390000000001,43.7295,46.2705,99.9972
604,605,606,1295,4072,286.04,87.6879,2.3120700000000003,99.9962
605,606,28052,1201,4187,231.696,86.5924,3.4076,99.9475
606,607,1480,1579,4092,293.856,12.6938,77.3062,99.9584
607,608,4387,578,4113,111.514,13.5523,76.4477,99.9884
608,609,12604,2273,4137,109.841,29.1266,60.8734,99.9224
609,610,857,1100,4104,295.965,86.7945,3.20546,99.9846
610,611,8773,1798,4152,106.103,50.776,39.224,99.8305
611,612,1344,2436,4125,288.219,27.6419,62.3581,99.7702
612,613,103745,1411,4305,285.32,16.3304,73.6696,99.7801
613,614,5445,1618,4156,305.909,53.4202,36.5798,99.9948
614,615,2634,2409,4152,109.049,28.624,61.37600000000001,99.8705
615,616,508,3160,4131,114.349,17.9581,72.0419,99.9847
616,617,2644,2590,4159,118.945,31.8994,58.1006,99.9967
617,618,68513,2084,4297,293.8,35.0363,54.9637,99.9154
618,619,9934,1015,4184,112.883,1.02124,88.9788,99.9927
619,620,7143,1924,4172,84.5123,74.8761,15.1239,99.9716
620,621,2559,2357,4176,284.133,30.9008,59.0992,99.9824
621,622,4127,601,4179,134.311,49.7578,40.2422,99.8983
622,623,5774,2554,4192,105.784,46.8732,43.1268,99.9706
623,624,9956,3095,4227,106.592,64.5689,25.4311,99.9645
624,625,719,529,4161,108.939,63.0869,26.9131,99.9967
625,626,18390,3177,4278,120.221,62.0294,27.9706,99.9184
626,627,11167,2679,4232,115.143,29.153,60.847,99.812
627,628,15519,1816,4246,93.3577,24.0907,65.9093,99.6926
628,629,1520,1771,4203,289.976,8.88734,81.1127,99.9983
629,630,3578,2504,4231,298.045,39.8391,50.1609,99.9682
630,631,9565,668,4247,113.802,7.64306,82.3569,99.9854
631,632,800,2437,4207,104.491,44.0946,45.9054,99.7538
632,633,785,959,4212,125.042,64.0146,25.9854,99.9798
633,634,3680,591,4264,216.537,86.7012,3.29883,99.941
634,635,7208,2422,4260,288.67,29.9667,60.0333,99.7495
635,636,141311,2420,4443,295.847,74.7026,15.2974,54.5431
636,637,16880,870,4278,281.595,2.86648,87.1335,99.7393
637,638,1018,1921,4242,103.382,56.6609,33.3391,99.7941
638,639,80155,2961,4372,121.105,27.7236,62.2764,99.7663
639,640,32145,1089,4341,304.521,37.3082,52.6918,99.954
640,641,1941,764,4274,294.211,31.6853,58.3147,99.996
641,642,24584,2532,4366,285.315,12.1316,77.8684,99.9808
642,643,1315,564,4277,109.893,17.831,72.169,99.9988
643,644,5617,1658,4308,298.247,37.7801,52.2199,99.9943
644,645,11356,959,4366,124.137,65.3808,24.6192,99.9182
645,646,10305,1911,4340,110.22,23.0232,66.9768,99.5508
646,647,174616,828,4507,123.539,38.8894,51.1106,85.0092
647,648,4232,1719,4325,291.681,15.6278,74.3722,99.9975
648,649,3870,1485,4348,309.7920000000001,58.39,31.61,99.9692
649,650,81175,1912,4546,291.91,8.21275,81.7873,95.4534
650,651,9052,854,4400,100.919,40.4096,49.5904,99.9418
651,652,12638,1579,4408,139.157,73.7101,16.2899,99.8959
652,653,650,792,4377,283.9770000000001,0.927559,89.0724,99.9844
653,654,64684,1576,4565,108.02,9.46284,80.5372,65.0961
654,655,617,3183,4412,298.805,0.403656,89.5963,99.9776
655,656,1556,1915,4431,114.682,50.3348,39.6652,99.9135
656,657,9098,2814,4463,108.203,13.5246,76.4754,99.9826
657,658,575,1484,4441,112.813,56.0133,33.9867,99.9896
658,659,620,3197,4459,119.4,35.404,54.596,99.9585
659,660,13464,3098,4557,121.913,35.5649,54.4351,99.8419
660,661,32927,2879,4587,109.853,20.8608,69.1392,99.7223
661,662,13253,2658,4605,97.3981,66.4128,23.5872,95.5216
662,663,1698,2104,4535,295.202,18.8043,71.1957,99.9528
663,664,518,389,4544,106.412,14.5572,75.4428,99.9936
664,665,5182,1366,4572,294.636,5.8630900000000015,84.1369,99.9873
665,666,16070,2263,4638,112.892,29.6421,60.3579,99.9465
666,667,2450,2149,4585,297.079,18.1691,71.8309,99.9938
667,668,4884,1728,4601,104.602,21.6605,68.3395,99.9934
668,669,759,2760,4580,115.415,53.5607,36.4393,99.9085
669,670,6058,393,4638,288.611,48.0984,41.9016,99.9168
670,671,3337,1123,4607,302.731,51.7096,38.2904,99.9799
671,672,2457,1608,4609,291.511,61.2722,28.7278,99.9912
672,673,9948,2383,4647,114.043,47.6539,42.3461,99.8974
673,674,1484,1320,4611,301.918,32.7396,57.2604,99.9982
674,675,5945,842,4641,285.404,37.603,52.397,99.9324
675,676,2891,1266,4631,109.515,27.7731,62.2269,99.9698
676,677,7245,3015,4664,122.142,27.9219,62.0781,99.9876
677,678,1840,677,4640,285.269,15.1429,74.8571,99.9561
678,679,4895,3096,4664,300.866,37.3708,52.6292,99.9468
679,680,1555,164,4641,113.554,37.1804,52.8196,99.9553
680,681,755,2680,4634,290.764,26.1773,63.8227,99.951
681,682,3712,740,4648,209.28,84.0638,5.93624,99.9578
682,683,1200,1768,4639,295.151,11.6239,78.3761,99.9946
683,684,1559,2702,4658,292.047,25.6489,64.3511,99.9608
684,685,1687,1351,4652,105.742,0.7431260000000001,89.2569,99.989
685,686,589,3198,4647,104.871,12.0034,77.9966,99.8386
686,687,1239,1067,4655,283.745,33.4714,56.5286,99.9671
687,688,560,1176,4652,109.753,26.1093,63.8907,99.9689
688,689,10394,2812,4697,293.128,24.075,65.925,99.9205
689,690,664,1983,4661,112.007,11.1902,78.8098,99.9137
690,691,4510,1736,4677,106.335,27.0317,62.9683,99.9899
691,692,896,1248,4663,285.376,0.634041,89.366,99.9969
692,693,1262,1305,4669,101.157,13.7455,76.2545,99.9941
693,694,520,1105,4675,113.161,4.72667,85.2733,99.9501
694,695,575,1966,4690,110.754,9.10296,80.89699999999998,99.8796
695,696,1629,2966,4702,293.965,20.9876,69.0124,99.988
696,697,924,2554,4697,100.451,67.6512,22.3488,99.8193
697,698,1026,2680,4712,285.733,18.6745,71.3255,99.9672
698,699,846,3150,4711,293.371,21.5784,68.4216,99.9524
