,Grain No.,Size [Pixel],center x-coordinate,center y-coordinate,mean azimuth [degree],mean latitude [degree],mean colatitude [degree],Regelungsgrad [%]
0,1,1282,959,40,98.9528,13.8826,76.1174,99.9059
1,2,4691,1167,58,275.448,33.8597,56.1403,99.9666
2,3,1465,1267,42,278.829,32.1008,57.8992,99.9632
3,4,1398,167,46,224.261,71.5866,18.4134,99.9457
4,5,5842,294,72,299.9190000000001,19.5323,70.4677,99.5756
5,6,1373,650,53,101.094,16.775,73.225,99.9178
6,7,2364,225,79,301.317,4.7932,85.2068,99.9064
7,8,4701,437,75,103.391,3.96959,86.0304,99.6802
8,9,60985,2268,160,113.828,9.52261,80.4774,98.4377
9,10,2896,2489,69,283.22,31.64,58.36,99.8792
10,11,3300,92,82,110.005,13.3755,76.6245,99.8879
11,12,509,1367,57,284.46,44.8346,45.1654,99.9477
12,13,16815,611,122,99.2704,59.4629,30.5371,99.9156
13,14,8394,1477,82,101.211,9.90863,80.0914,99.6882
14,15,34577,733,218,105.649,71.3921,18.6079,96.6523
15,16,5691,1815,83,104.687,2.4577,87.5423,99.6773
16,17,707,1936,56,102.539,3.31116,86.6888,99.9554
17,18,1803,2200,72,95.8027,8.57359,81.4264,99.979
18,19,28797,1983,180,289.861,59.5242,30.4758,99.7539
19,20,1872,1732,92,279.497,6.647760000000001,83.3522,99.9344
20,21,3277,2570,104,96.2418,34.406,55.594,99.9459
21,22,1542,2137,77,280.567,1.69148,88.3085,99.9619
22,23,2336,1682,87,106.538,1.23061,88.7694,99.7531
23,24,2397,706,86,277.47900000000004,5.53446,84.4655,99.8936
24,25,1309,1569,84,284.15,11.8605,78.1395,99.8293
25,26,704,166,73,108.872,26.3634,63.6366,99.9638
26,27,9528,1234,125,293.365,7.775919999999998,82.2241,99.8029
27,28,583,755,103,97.5877,69.4589,20.5411,99.9536
28,29,3104,1371,110,95.4745,36.3314,53.6686,99.9551
29,30,548,915,104,99.4087,45.107,44.893,99.9481
30,31,930,1607,98,304.747,75.2727,14.7273,99.9794
31,32,8649,150,130,284.644,71.4245,18.5755,99.9815
32,33,1338,388,137,312.079,85.3682,4.63177,99.9603
33,34,536,1880,114,109.18,16.3359,73.6641,99.9831
34,35,22959,1551,205,297.331,72.0962,17.9038,88.2118
35,36,33711,2792,254,279.565,24.7178,65.2822,99.8037
36,37,6249,1876,157,110.252,16.3418,73.6582,99.9651
37,38,6218,1717,165,281.146,6.5948699999999985,83.4051,99.9317
38,39,679,1102,147,89.2356,75.5233,14.4767,99.9709
39,40,2960,1782,156,142.688,78.8044,11.1956,99.9454
40,41,1566,289,161,285.168,63.1427,26.8573,99.9606
41,42,22372,963,231,102.387,47.9327,42.0673,91.775
42,43,6063,197,183,292.204,31.8854,58.1146,99.9266
43,44,4608,362,187,106.591,17.2342,72.7658,99.8823
44,45,4033,1368,194,96.7134,35.0693,54.9307,99.9356
45,46,667,1139,163,91.0649,75.417,14.583,99.9505
46,47,1445,2515,178,103.358,48.9688,41.0312,99.9381
47,48,1778,112,194,113.2,16.3764,73.6236,99.8752
48,49,4650,1267,193,109.315,44.9586,45.0414,99.9157
49,50,612,2580,174,285.463,38.9412,51.0588,99.8551
50,51,7090,223,231,282.884,32.6348,57.3652,99.9527
51,52,2874,1071,195,276.888,33.7282,56.2718,99.9738
52,53,2740,2476,212,301.088,74.0075,15.9925,99.9527
53,54,3647,721,211,279.264,29.3531,60.6469,99.9756
54,55,32723,2524,309,111.648,15.0356,74.9644,87.932
55,56,1792,659,209,282.112,21.222,68.778,99.9713
56,57,6009,100,251,292.746,14.4683,75.5317,99.9831
57,58,22822,1134,309,113.044,2.42293,87.5771,99.64
58,59,32084,1692,302,119.169,46.7699,43.2301,99.6478
59,60,15759,2314,296,277.844,18.4188,71.5812,99.897
60,61,47889,238,425,284.503,17.8561,72.1439,99.1675
61,62,5101,2050,265,221.731,79.5703,10.4297,99.9091
62,63,9341,1433,289,283.3,10.8542,79.1458,99.8561
63,64,1471,1794,229,290.1620000000001,81.6208,8.37921,99.955
64,65,1420,1868,231,285.444,79.5201,10.4799,99.9869
65,66,5691,1299,263,107.836,1.61578,88.3842,99.8365
66,67,1755,2366,242,308.59,72.8285,17.1715,99.9682
67,68,3400,414,257,281.316,4.38859,85.6114,99.915
68,69,1258,1226,260,112.781,80.217,9.78297,99.9557
69,70,3582,2415,273,288.226,6.07625,83.9238,99.9768
70,71,1326,541,268,279.184,56.8168,33.1832,99.9265
71,72,2628,1364,298,286.567,33.6533,56.3467,99.9376
72,73,845,157,291,282.668,14.7522,75.2478,99.9691
73,74,8898,2712,345,105.873,24.809,65.191,99.7745
74,75,3853,519,332,277.29900000000004,57.1655,32.8345,99.933
75,76,680,1316,300,285.075,9.32166,80.6783,99.9642
76,77,7252,3068,346,281.495,27.1142,62.8858,99.9388
77,78,12427,2231,356,291.502,22.2493,67.7507,99.933
78,79,1219,2986,303,94.7587,2.74476,87.2552,99.9161
79,80,5902,358,345,92.0061,55.5571,34.4429,99.9789
80,81,7832,795,337,287.221,30.5228,59.4772,99.9415
81,82,11489,976,359,115.341,77.9118,12.0882,99.9655
82,83,29352,638,413,283.463,55.7976,34.2024,99.7487
83,84,2277,1541,327,296.2920000000001,52.7595,37.2405,99.9936
84,85,1102,2138,318,119.322,64.8123,25.1877,99.9548
85,86,577,2885,317,283.439,12.3728,77.6272,99.9413
86,87,1836,1849,332,287.825,55.6973,34.3027,99.9663
87,88,4779,90,369,116.654,4.30079,85.6992,99.9179
88,89,7822,1269,360,301.798,12.2404,77.7596,99.9934
89,90,10524,2046,364,145.891,48.4969,41.5031,99.8886
90,91,1535,178,337,98.3646,2.4826,87.5174,99.9591
91,92,568,126,337,107.464,4.3457300000000005,85.6543,99.7801
92,93,946,1215,342,113.714,62.5472,27.4528,99.9773
93,94,608,2103,332,298.2390000000001,6.30765,83.6924,99.9787
94,95,6612,2949,397,131.071,78.6224,11.3776,99.8717
95,96,7872,1385,377,191.163,77.0477,12.9523,99.929
96,97,10726,2578,394,107.303,11.3212,78.6788,99.6391
97,98,3490,430,389,283.139,19.9825,70.0175,99.8829
98,99,1039,1579,362,285.3590000000001,76.9409,13.0591,99.9744
99,100,7118,2114,427,297.245,7.53693,82.4631,99.9586
100,101,20582,1893,424,284.082,22.7331,67.2669,99.9004
101,102,25545,832,476,153.60399999999996,74.1119,15.8881,95.1013
102,103,569,1667,368,114.421,39.0091,50.9909,99.9922
103,104,796,1052,388,291.157,44.3174,45.6826,99.9764
104,105,3003,1999,407,129.86700000000002,59.1703,30.8297,99.4914
105,106,4466,1468,417,259.587,78.1946,11.8054,99.9777
106,107,6005,345,429,108.813,59.8783,30.1217,99.9384
107,108,27609,511,543,280.509,22.8434,67.1566,99.281
108,109,512,3092,401,282.039,55.4757,34.5243,99.9611
109,110,68635,2323,569,287.435,5.63756,84.3624,99.6791
110,111,603,2786,407,290.1740000000001,13.2604,76.7396,99.9559
111,112,1517,1600,414,116.642,39.6738,50.3262,99.9919
112,113,25016,2723,524,286.336,36.3394,53.6606,99.3337
113,114,54547,1370,548,284.798,11.0365,78.9635,99.2262
114,115,7969,1270,450,116.488,5.66045,84.3395,99.9655
115,116,1176,1036,425,121.413,50.4216,39.5784,99.9835
116,117,561,1710,424,305.695,10.3335,79.6665,99.8219
117,118,6941,3090,469,273.482,72.9911,17.0089,99.9319
118,119,7627,1181,470,128.253,31.8642,58.1358,99.9691
119,120,1609,1766,439,139.345,52.3866,37.6134,99.9943
120,121,17484,1675,524,123.98,32.2766,57.7234,99.1361
121,122,3710,2148,476,118.51,18.3898,71.6102,99.9892
122,123,17866,2916,515,297.742,76.9793,13.0207,99.5772
123,124,1131,820,461,117.076,64.0601,25.9399,99.9948
124,125,1099,997,459,112.514,52.9666,37.0334,99.2835
125,126,29330,1049,559,106.503,25.112,64.888,98.9179
126,127,7081,2533,496,283.4770000000001,36.1131,53.8869,99.7422
127,128,7134,724,540,284.67,21.1947,68.8053,99.9709
128,129,10336,2013,530,301.881,52.6513,37.3487,98.9496
129,130,559,1112,473,135.912,46.4021,43.5979,99.9868
130,131,1731,92,509,106.338,5.27961,84.7204,99.8513
131,132,2875,372,498,114.909,4.42809,85.5719,99.8097
132,133,6198,1791,519,295.742,8.87336,81.1266,99.9217
133,134,600,1585,482,297.529,23.1494,66.8506,99.9942
134,135,963,135,514,301.36,20.1793,69.8207,99.8943
135,136,5556,1907,510,284.632,16.5208,73.4792,99.945
136,137,6081,3177,542,287.784,9.91837,80.0816,99.7802
137,138,23657,2570,687,300.501,10.0662,79.9338,95.7418
138,139,1180,383,535,126.296,4.22085,85.7792,99.9569
139,140,592,865,527,122.05,83.1888,6.811210000000001,99.971
140,141,1195,419,538,290.092,9.78929,80.2107,99.994
141,142,1789,1576,546,125.593,36.798,53.202,99.8376
142,143,1461,598,543,301.951,69.7762,20.2238,99.9943
143,144,1221,641,545,112.05,55.3021,34.6979,99.9799
144,145,14141,1788,632,124.55,57.2024,32.7976,99.7943
145,146,3325,346,573,124.556,2.57345,87.4266,99.9965
146,147,892,884,559,88.3879,65.37100000000001,24.629,99.9908
147,148,6478,3089,587,114.004,33.5846,56.4154,99.8857
148,149,4532,2875,573,113.88,3.14573,86.8543,99.784
149,150,9360,1892,614,125.969,64.6234,25.3766,99.9812
150,151,22027,2471,638,110.218,7.5751300000000015,82.4249,99.4847
151,152,4304,92,599,300.518,24.5256,65.4744,99.9068
152,153,7791,2095,601,141.47,37.4478,52.5522,99.9927
153,154,6093,686,599,296.964,11.7825,78.2175,99.9953
154,155,587,2167,563,110.024,38.7265,51.2735,99.9963
155,156,779,130,585,121.544,41.4141,48.5859,99.9783
156,157,125943,576,1037,111.439,14.4604,75.5396,94.9234
157,158,5460,1457,610,289.683,30.8076,59.1924,99.7075
158,159,12328,1557,665,297.472,5.15308,84.8469,99.8931
159,160,953,874,600,91.4118,64.388,25.612,99.9859
160,161,4598,206,617,122.011,29.8689,60.1311,99.9917
161,162,2326,620,610,126.818,36.4076,53.5924,99.9941
162,163,14211,1200,681,294.126,36.3887,53.6113,99.9718
163,164,1528,1618,607,129.344,63.3196,26.6804,99.9947
164,165,8807,312,656,114.937,23.4621,66.5379,99.9812
165,166,1113,2000,610,296.03,17.3513,72.6487,99.2548
166,167,568,2903,607,284.757,9.91156,80.0884,99.93
167,168,19655,1023,713,301.826,9.53947,80.4605,99.8869
168,169,5727,814,665,283.3540000000001,18.2606,71.7394,99.8992
169,170,5363,3197,664,293.4790000000001,24.7662,65.2338,99.8451
170,171,548,899,622,101.586,46.8169,43.1831,99.9485
171,172,1520,2976,643,294.918,1.97691,88.0231,99.921
172,173,1414,1702,632,293.197,12.5368,77.4632,99.9911
173,174,2975,720,662,293.647,41.1124,48.8876,99.9589
174,175,5532,939,658,298.497,34.8813,55.1187,99.9853
175,176,918,2183,631,120.557,11.3471,78.6529,99.9875
176,177,1224,2664,653,295.51,5.62172,84.3783,99.9537
177,178,17913,3085,712,123.516,23.8784,66.1216,99.785
178,179,3111,2833,652,115.633,22.0324,67.9676,99.9523
179,180,16999,188,714,284.019,8.25432,81.7457,99.9246
180,181,13286,2932,705,284.77,34.2225,55.7775,99.9613
181,182,720,2016,641,311.383,52.0827,37.9173,99.9926
182,183,1430,860,648,105.556,44.1647,45.8353,99.9845
183,184,2439,639,671,111.104,55.0015,34.9985,99.966
184,185,1641,1649,658,308.597,30.9132,59.0868,99.9982
185,186,25181,1411,724,287.218,10.4838,79.5162,99.7589
186,187,855,1950,653,288.9770000000001,12.6376,77.3624,99.9899
187,188,89617,2192,825,120.111,22.7803,67.2197,99.9043
188,189,43789,2778,771,121.06,60.537,29.463,99.9028
189,190,4198,1985,701,153.871,71.4276,18.5724,99.9635
190,191,41955,625,802,123.583,14.9876,75.0124,99.9833
191,192,6084,96,732,301.856,7.840389999999998,82.1596,99.8755
192,193,1258,1919,681,86.3068,71.4668,18.5332,99.9983
193,194,31805,1646,807,109.579,30.5227,59.4773,99.9059
194,195,19907,787,759,288.321,25.0647,64.9353,99.9562
195,196,1144,895,705,119.344,53.5975,36.4025,99.3927
196,197,4869,1847,765,109.294,18.8617,71.1383,99.9374
197,198,6574,1789,760,111.307,19.3262,70.6738,99.9048
198,199,4028,286,754,160.589,74.9695,15.0305,99.9834
199,200,907,1123,732,296.394,6.43852,83.5615,99.9956
200,201,3060,910,752,118.415,16.6254,73.3746,99.9889
201,202,18931,1269,803,125.519,69.2767,20.7233,99.9687
202,203,3937,1103,779,133.55100000000002,38.3687,51.6313,99.9972
203,204,4839,1926,777,289.393,43.4126,46.5874,99.982
204,205,2562,3178,777,285.543,76.1633,13.8367,99.9752
205,206,819,1998,773,297.3540000000001,64.2723,25.7277,99.8053
206,207,4440,2465,782,124.803,29.1993,60.8007,99.9064
207,208,29757,1469,867,292.083,22.1933,67.8067,99.5249
208,209,8583,2615,855,174.865,69.4293,20.5707,99.9134
209,210,2461,1155,799,280.488,33.2205,56.7795,99.9579
210,211,17210,970,887,118.804,7.16352,82.8365,92.9484
211,212,3189,3046,805,134.613,66.7305,23.2695,99.9782
212,213,6220,1757,827,122.9,18.6815,71.3185,99.9886
213,214,8362,2391,833,301.6790000000001,7.70755,82.2924,99.9686
214,215,1024,3092,798,299.832,12.7412,77.2588,99.9756
215,216,126350,250,1026,296.172,36.7548,53.2452,99.4102
216,217,11164,2975,848,277.797,38.5548,51.4452,99.5919
217,218,1017,71,825,246.445,73.7082,16.2918,99.9639
218,219,2801,395,827,128.407,44.7102,45.2898,99.9847
219,220,682,3125,815,279.368,80.8728,9.12722,99.989
220,221,2927,1928,828,288.67,16.4114,73.5886,99.9444
221,222,14000,848,876,129.501,24.0096,65.9904,99.9848
222,223,4509,1065,849,129.306,73.7347,16.2653,99.9741
223,224,34590,2537,1020,125.451,33.1849,56.8151,96.2631
224,225,12141,3078,903,218.892,70.0313,19.9687,99.8703
225,226,4018,2885,899,111.8,66.9031,23.0969,99.9315
226,227,764,1859,847,87.3869,69.3035,20.6965,99.9987
227,228,26847,2714,962,294.923,0.737106,89.2629,99.7735
228,229,19271,1249,934,301.344,20.6825,69.3175,99.9806
229,230,12344,2018,913,297.599,10.9873,79.0127,99.5094
230,231,954,425,861,126.67,39.6194,50.3806,99.9947
231,232,3078,3167,899,303.514,19.7538,70.2462,99.96
232,233,2711,1158,878,295.269,13.5143,76.4857,99.9953
233,234,2040,359,882,190.075,69.5049,20.4951,99.9961
234,235,54712,1100,1030,144.637,72.0899,17.9101,99.0612
235,236,1100,1906,889,70.7049,72.9263,17.0737,99.8666
236,237,2175,78,923,285.503,9.21592,80.7841,99.8908
237,238,3562,1797,926,96.612,69.2634,20.7366,99.9905
238,239,4615,1698,935,120.584,30.9437,59.0563,99.8738
239,240,12327,2369,1020,173.38099999999997,65.4735,24.5265,99.605
240,241,6098,1938,956,296.422,19.1809,70.8191,99.9378
241,242,47974,1403,1057,113.748,15.1349,74.8651,99.8091
242,243,17317,818,971,158.687,78.8894,11.1106,99.4446
243,244,10285,1617,985,115.53,15.9675,74.0325,99.9634
244,245,8982,2836,1022,133.881,50.0757,39.9243,99.8794
245,246,595,3117,952,119.049,25.1447,64.8553,99.9733
246,247,11420,2151,1002,147.225,27.6603,62.3397,99.9858
247,248,25026,1907,1065,122.704,19.1854,70.8146,99.9491
248,249,3813,2921,971,115.853,21.6294,68.3706,99.9747
249,250,11814,3105,1021,281.878,45.0676,44.9324,99.8869
250,251,4826,2046,998,188.306,59.7849,30.2151,99.9361
251,252,1012,1785,991,297.7920000000001,20.1909,69.8091,99.9768
252,253,3832,1735,1003,115.286,13.1677,76.8323,99.9839
253,254,8416,2634,1047,300.1690000000001,4.80103,85.199,99.8848
254,255,39605,2941,1233,286.781,45.2311,44.7689,99.73
255,256,1143,2443,1011,274.22900000000004,44.4127,45.5873,99.9655
256,257,1185,2274,1030,146.309,28.9748,61.0252,99.949
257,258,60044,1815,1212,294.654,69.4779,20.5221,99.4944
258,259,545853,1010,1637,102.86,20.2044,69.7956,96.4602
259,260,16493,2402,1138,289.219,45.4037,44.5963,99.5947
260,261,8380,1587,1075,117.036,14.5087,75.4913,99.9846
261,262,23822,2060,1144,291.566,18.905,71.095,99.8706
262,263,7975,2186,1097,305.973,5.80438,84.1956,99.9854
263,264,23548,517,1148,294.034,3.42754,86.5725,99.4999
264,265,7404,2272,1153,278.8,17.0836,72.9164,99.9322
265,266,8698,2815,1129,126.986,30.1894,59.8106,99.9475
266,267,27371,3095,1240,288.61,45.3832,44.6168,99.924
267,268,55778,1619,1263,4.2420300000000015,69.8979,20.1021,99.8898
268,269,8181,87,1246,294.32,42.6313,47.3687,99.7885
269,270,2616,2356,1139,302.25,6.31034,83.6897,99.9978
270,271,559,398,1128,306.806,56.4218,33.5782,99.9943
271,272,13510,2719,1178,152.13,55.0536,34.9464,99.9071
272,273,6238,379,1186,125.993,47.1075,42.8925,99.992
273,274,10243,1231,1180,300.623,44.5995,45.4005,99.9895
274,275,98324,2403,1340,282.551,27.1801,62.8199,99.3233
275,276,1192,1465,1175,359.355,68.9296,21.0704,99.9913
276,277,3479,2153,1193,284.418,15.1404,74.8596,99.9779
277,278,1620,2216,1192,291.951,41.5217,48.4783,99.9871
278,279,2801,1326,1196,119.654,20.4235,69.5765,99.9896
279,280,7790,2866,1218,124.924,23.0236,66.9764,99.9897
280,281,10630,450,1251,115.621,11.6504,78.3496,99.7655
281,282,605,1924,1191,110.079,30.5014,59.4986,99.996
282,283,3628,1441,1216,110.225,19.1853,70.8147,99.9329
283,284,13751,2189,1298,310.92,66.8757,23.1243,99.8734
284,285,87066,2808,1473,165.793,57.4785,32.5215,99.5643
285,286,2789,2106,1254,125.076,31.5547,58.4453,99.9955
286,287,314041,330,1707,112.398,31.3834,58.6166,87.7219
287,288,765,373,1266,144.46,57.8383,32.1617,99.9959
288,289,1703,2833,1282,169.52700000000004,54.9719,35.0281,99.9703
289,290,91567,2110,1526,147.53,52.6969,37.3031,99.2238
290,291,74002,704,1505,291.101,14.9511,75.0489,99.4711
291,292,908,2649,1299,155.784,54.407,35.593,99.9776
292,293,1139,525,1301,117.923,0.998718,89.0013,99.9917
293,294,3739,1989,1342,122.983,32.4115,57.5885,99.4446
294,295,2010,469,1336,129.999,48.0491,41.9509,99.8468
295,296,1046,1555,1331,230.239,60.4179,29.5821,99.9813
296,297,1484,511,1357,144.827,58.669,31.331,99.9708
297,298,819,3032,1350,289.568,45.1058,44.8942,99.967
298,299,1047,102,1362,118.98,42.117,47.883,99.9574
299,300,963,1530,1376,1.84059,71.9869,18.0131,99.9926
300,301,2724,1736,1383,285.322,40.798,49.202,99.9612
301,302,845,64,1382,288.2340000000001,43.1619,46.8381,99.905
302,303,48268,3094,1556,121.123,17.0675,72.9325,99.6828
303,304,147352,2538,1650,120.27,35.2378,54.7622,99.4619
304,305,11119,1801,1456,356.376,75.4951,14.5049,99.9749
305,306,98559,1660,1625,127.634,23.6505,66.3495,99.3475
306,307,3334,1922,1451,263.605,70.9642,19.0358,99.9875
307,308,4947,1702,1457,354.9380000000001,75.8555,14.1445,99.96
308,309,570,61,1439,113.359,60.0859,29.9141,99.9053
309,310,4761,1894,1507,232.547,71.285,18.715,98.821
310,311,501,1837,1525,229.186,60.3169,29.6831,99.1237
311,312,3747,746,1570,116.827,9.40657,80.5934,99.9976
312,313,3491,1330,1553,114.519,30.0274,59.9726,99.9841
313,314,25634,1271,1645,131.945,8.437710000000001,81.5623,99.9955
314,315,1383,1159,1565,117.261,1.20374,88.7963,99.9972
315,316,41402,1440,1709,282.711,40.0786,49.9214,99.4422
316,317,1967,1882,1608,86.4143,6.55766,83.4423,99.978
317,318,20373,1887,1715,132.41299999999998,55.5505,34.4495,99.9782
318,319,927,812,1639,291.777,5.39542,84.6046,99.9684
319,320,1816,2774,1657,307.375,4.55423,85.4458,99.9941
320,321,77988,2116,1819,96.7879,11.8567,78.1433,99.6463
321,322,569,733,1644,95.3621,57.8014,32.1986,99.9917
322,323,5740,2979,1714,155.067,78.5664,11.4336,99.9169
323,324,7456,2792,1715,156.63299999999995,77.3394,12.6606,99.9708
324,325,762,2296,1719,99.6614,4.41907,85.5809,99.9767
325,326,46535,3100,1882,105.273,17.0115,72.9885,99.8479
326,327,23836,2839,1799,148.344,42.9104,47.0896,99.9908
327,328,8269,342,1779,194.222,68.3721,21.6279,99.9822
328,329,5364,2373,1799,324.783,58.7981,31.2019,99.9147
329,330,18142,605,1829,294.159,18.7474,71.2526,99.9647
330,331,809,879,1765,306.405,62.9877,27.0123,99.9973
331,332,5524,436,1799,285.28,48.1104,41.8896,99.8556
332,333,2531,648,1796,294.004,12.842,77.158,99.939
333,334,15770,1694,1840,151.96200000000005,56.2471,33.7529,99.9827
334,335,100113,1270,2027,299.494,24.6083,65.3917,99.9012
335,336,1178,3173,1798,119.141,0.06841280000000001,89.9316,99.9181
336,337,980,1586,1792,351.066,73.6018,16.3982,99.9817
337,338,792,2293,1814,327.223,59.1198,30.8802,99.9973
338,339,15594,1518,1868,125.58,25.5189,64.4811,99.0163
339,340,838,1934,1808,280.10200000000003,22.0686,67.9314,99.9834
340,341,18984,2310,1906,173.05700000000004,63.3795,26.6205,99.4423
341,342,5714,1867,1877,114.508,15.4607,74.5393,99.9838
342,343,3737,72,1861,123.552,54.2488,35.7512,99.7162
343,344,3995,1944,1862,282.586,21.1803,68.8197,99.4521
344,345,6449,538,1880,296.513,5.605,84.395,99.9708
345,346,8259,2938,1866,161.696,73.6442,16.3558,99.971
346,347,1228,143,1855,102.028,4.67345,85.3266,99.9979
347,348,884,3179,1874,298.506,2.42087,87.5791,99.9394
348,349,4425,2488,1895,134.394,33.2334,56.7666,99.843
349,350,10595,2649,1925,121.616,12.1326,77.8674,99.9756
350,351,760,188,1865,131.524,48.6003,41.3997,99.9971
351,352,5693,150,1901,291.0490000000001,60.9021,29.0979,99.8537
352,353,116736,2945,2149,110.001,15.0924,74.9076,97.1496
353,354,27517,2725,2014,307.82,8.98667,81.0133,99.9924
354,355,502,111,1887,127.598,44.6012,45.3988,99.9418
355,356,2240,2576,1905,161.642,54.832,35.168,99.9923
356,357,6776,2493,1942,285.355,6.38802,83.61200000000002,98.9929
357,358,102282,1788,2014,289.495,30.3471,59.6529,99.3702
358,359,3566,1779,1929,280.793,55.3391,34.6609,99.9787
359,360,21177,167,1990,128.11,46.4023,43.5977,99.7458
360,361,14823,620,2019,121.932,30.6541,59.3459,99.9123
361,362,2164,1488,1960,339.977,70.3812,19.6188,99.9897
362,363,81961,2468,2160,125.116,19.8284,70.1716,94.5183
363,364,2009,544,1969,102.861,20.8119,69.1881,99.9688
364,365,11082,3108,2086,295.176,0.6331939999999999,89.3668,99.7839
365,366,5498,77,2046,287.577,61.2942,28.7058,99.827
366,367,11127,2602,2058,349.458,70.8038,19.1962,99.1351
367,368,9283,2226,2054,2.5461400000000003,81.8645,8.135530000000001,90.2405
368,369,3286,239,2086,127.321,4.0151,85.9849,99.9975
369,370,7831,2292,2122,157.753,58.8782,31.1218,99.9755
370,371,10672,152,2123,120.752,23.2957,66.7043,99.8476
371,372,3192,3044,2119,123.185,37.5002,52.4998,99.9386
372,373,141693,1828,2337,248.968,66.5024,23.4976,86.0187
373,374,2452,2145,2121,119.151,4.07008,85.9299,99.9884
374,375,9394,1473,2161,278.196,50.4398,39.5602,99.0553
375,376,718,1389,2138,272.567,50.3409,39.6591,99.9975
376,377,7896,639,2175,130.562,11.9643,78.0357,99.991
377,378,10170,304,2191,126.084,4.35682,85.6432,99.985
378,379,59187,2228,2295,294.582,42.62600000000001,47.374,99.7725
379,380,41480,2730,2250,298.563,60.7201,29.2799,99.8452
380,381,1528,921,2174,286.11,23.8268,66.1732,99.9871
381,382,510,50,2179,86.6661,65.1652,24.8348,99.9685
382,383,4044,129,2188,127.801,33.9106,56.0894,99.9521
383,384,6953,3177,2311,122.742,22.8309,67.1691,99.8153
384,385,6132,3146,2263,119.53,22.1934,67.8066,99.9183
385,386,3801,1340,2208,116.47,14.1967,75.8033,99.9918
386,387,5352,207,2204,336.487,75.2369,14.7631,99.9928
387,388,41592,1931,2289,288.926,30.7182,59.2818,99.4878
388,389,3470,427,2217,133.749,48.669,41.331,99.9584
389,390,2948,88,2234,90.697,65.3666,24.6334,99.9702
390,391,8031,2300,2240,128.987,36.5319,53.4681,99.9033
391,392,11485,928,2259,153.654,70.417,19.583,99.9052
392,393,20436,1271,2284,110.072,39.7296,50.2704,99.9289
393,394,28383,1447,2340,133.767,82.3246,7.67537,99.8763
394,395,1813,612,2235,290.736,38.0023,51.9977,99.9913
395,396,961,718,2240,284.22,28.3723,61.6277,99.9947
396,397,2894,200,2251,287.748,17.6625,72.3375,99.9585
397,398,544,681,2242,103.999,7.71984,82.2802,99.9973
398,399,1835,840,2257,138.371,66.7379,23.2621,99.9956
399,400,789,416,2255,133.957,48.4299,41.5701,99.9927
400,401,12191,562,2295,289.77,38.7976,51.2024,99.9782
401,402,186561,397,2469,101.758,26.4409,63.5591,88.772
402,403,31983,1062,2400,114.314,16.1583,73.8417,99.3833
403,404,3223,249,2290,286.113,17.7822,72.2178,99.9879
404,405,3251,112,2292,94.9494,38.6687,51.3313,99.9909
405,406,1398,816,2285,139.44799999999998,66.3604,23.6396,99.9889
406,407,1772,795,2316,136.033,44.0899,45.9101,99.9977
407,408,11500,2073,2375,118.94,7.9871,82.0129,99.9858
408,409,3128,53,2366,293.1690000000001,71.1343,18.8657,99.9539
409,410,10742,860,2356,299.222,48.4122,41.5878,99.9916
410,411,44023,2643,2431,294.959,36.2857,53.7143,99.9264
411,412,17228,906,2416,138.67700000000002,47.0718,42.9282,99.8708
412,413,78861,1579,2489,136.495,38.5127,51.4873,98.357
413,414,570,776,2351,138.126,64.0073,25.9927,99.9969
414,415,17804,1253,2402,302.411,77.8359,12.1641,99.9624
415,416,2035,2834,2381,296.467,11.9793,78.0207,99.956
416,417,743,1689,2367,171.002,82.8476,7.15237,99.9925
417,418,299812,2701,2729,118.64,14.3545,75.6455,99.8119
418,419,20723,2311,2457,129.29399999999998,40.008,49.992,99.8485
419,420,2325,2468,2400,192.132,76.0898,13.9102,99.9751
420,421,726,1156,2403,127.015,17.9272,72.0728,99.9945
421,422,978,395,2408,201.416,63.5421,26.4579,99.9877
422,423,3321,776,2429,289.876,52.8508,37.1492,99.9911
423,424,5377,466,2460,209.644,62.9304,27.0696,99.8501
424,425,2176,3068,2422,79.7852,78.4539,11.5461,99.9212
425,426,3711,54,2476,282.35,20.7853,69.2147,99.9573
426,427,2318,2422,2433,279.868,13.8777,76.1223,99.9887
427,428,2971,2108,2454,117.374,8.13917,81.8608,99.9907
428,429,11968,2485,2508,311.295,7.759410000000001,82.2406,99.9491
429,430,23070,1139,2526,117.113,1.23472,88.7653,89.105
430,431,568,3144,2451,275.29400000000004,47.7021,42.2979,99.9782
431,432,12421,1297,2522,104.283,2.469,87.531,99.9606
432,433,3866,3102,2478,121.245,43.9954,46.0046,99.8249
433,434,7299,3024,2492,97.4022,9.57621,80.4238,99.9164
434,435,1806,2047,2472,132.385,37.8362,52.1638,99.9884
435,436,1608,2157,2473,293.672,20.0409,69.9591,99.97
436,437,33277,708,2559,124.359,33.8685,56.1315,99.9
437,438,3705,926,2512,271.988,27.9405,62.0595,99.5768
438,439,16094,2216,2567,80.9296,64.328,25.672,98.9009
439,440,599,3165,2516,117.706,31.664,58.33600000000001,99.9346
440,441,37174,1680,2633,54.0809,83.8718,6.12815,99.7652
441,442,568,3093,2526,256.3,74.5446,15.4554,99.9667
442,443,1581,3114,2558,279.134,46.4046,43.5954,99.8286
443,444,521,1356,2541,112.105,33.8664,56.1336,99.9941
444,445,6236,94,2596,282.1020000000001,82.3735,7.62648,99.9769
445,446,19134,878,2666,304.463,35.8369,54.1631,99.9749
446,447,1941,3051,2572,291.886,73.8741,16.1259,99.5752
447,448,17324,1831,2711,302.197,7.03654,82.9635,99.4191
448,449,4038,1342,2618,113.293,31.6987,58.3013,99.9732
449,450,6545,1218,2616,310.001,51.9665,38.0335,99.9876
450,451,2835,1071,2600,112.43,18.3926,71.6074,99.9913
451,452,57645,1500,2786,130.284,53.3764,36.6236,93.5706
452,453,39810,1029,2699,307.161,47.1509,42.8491,99.8933
453,454,1600,3092,2610,293.442,75.9757,14.0243,99.9486
454,455,2771,3102,2651,281.35,50.9539,39.0461,99.83
455,456,18911,707,2667,223.155,65.0165,24.9835,99.9204
456,457,5654,1890,2688,231.916,70.6977,19.3023,99.9612
457,458,93896,2188,2766,129.606,42.8076,47.1924,99.9239
458,459,1804,70,2670,269.17900000000003,82.9399,7.06012,99.9763
459,460,549,1291,2639,125.634,26.7764,63.2236,99.9925
460,461,2078,1362,2671,100.334,25.487,64.513,99.9667
461,462,1705,184,2696,259.457,82.6146,7.3854,99.9785
462,463,14542,319,2723,286.931,64.4533,25.5467,99.9613
463,464,2653,1268,2682,104.833,25.5103,64.4897,99.9693
464,465,3860,126,2724,256.634,80.5057,9.4943,99.8189
465,466,1751,1186,2681,159.808,66.6434,23.3566,99.993
466,467,6551,3161,2751,282.4170000000001,19.9423,70.0577,99.9504
467,468,25925,3098,2815,301.405,28.3988,61.6012,99.2844
468,469,3092,220,2717,286.811,19.8152,70.1848,99.9975
469,470,1696,1323,2720,129.987,59.2116,30.7884,99.991
470,471,1412,1258,2711,299.759,35.7682,54.2318,99.9973
471,472,762,1197,2715,308.73,53.88,36.12,99.995
472,473,4934,741,2759,116.202,25.9626,64.0374,99.9944
473,474,22231,635,2798,302.8,20.9571,69.0429,99.9598
474,475,40053,1325,2856,148.644,63.8153,26.1847,99.9146
475,476,740,1171,2740,161.083,63.9094,26.0906,99.9978
476,477,676,1685,2758,111.427,84.8789,5.1210900000000015,99.9696
477,478,438173,536,3135,123.609,19.1124,70.8876,98.3406
478,479,9658,58,2841,285.389,13.2782,76.7218,99.9487
479,480,568,201,2765,244.795,82.5394,7.46059,99.9791
480,481,3058,810,2792,273.566,23.2129,66.7871,99.9801
481,482,3258,1167,2790,302.318,28.9785,61.0215,99.9828
482,483,112555,2058,3062,126.133,9.99183,80.0082,99.8067
483,484,24510,1739,2865,296.748,17.32,72.68,99.8957
484,485,2043,1669,2800,122.815,28.2333,61.7667,99.9952
485,486,4389,898,2810,114.546,25.9111,64.0889,99.9779
486,487,3282,1052,2821,304.811,25.9774,64.0226,99.9961
487,488,37119,1817,3019,281.4,41.1342,48.8658,99.2996
488,489,6998,948,2904,292.702,47.9227,42.0773,99.5818
489,490,5782,764,2863,136.332,59.8338,30.1662,99.9906
490,491,13904,1068,2906,122.192,25.9404,64.0596,99.9117
491,492,1448,1137,2849,113.115,11.7125,78.2875,99.9935
492,493,11020,3049,2928,124.698,44.018,45.982,99.7766
493,494,5255,2413,2913,121.375,30.2444,59.7556,99.8774
494,495,16401,1216,2962,283.742,52.5019,37.4981,99.7493
495,496,8677,2269,2958,269.306,33.751,56.249,99.9544
496,497,34872,2976,3028,122.449,46.4267,43.5733,97.2216
497,498,39012,979,3063,299.205,33.2749,56.7251,99.8349
498,499,78309,1398,3077,301.671,19.9925,70.0075,97.9403
499,500,4125,2379,2976,265.498,34.1156,55.8844,99.97
500,501,16174,2297,3054,280.748,36.0086,53.9914,99.5889
501,502,5422,65,2992,256.193,76.0365,13.9635,99.7416
502,503,510,1639,2962,123.801,69.38600000000001,20.614,99.9847
503,504,12675,2642,3029,253.597,68.5229,21.4771,98.0796
504,505,827,1664,2979,301.448,21.6234,68.3766,99.9897
505,506,1070,1700,2994,124.538,72.4208,17.5792,99.9759
506,507,1159,2431,3006,200.007,72.0436,17.9564,99.815
507,508,15410,1625,3058,303.043,21.7232,68.2768,99.9479
508,509,2210,2826,3048,305.865,16.1627,73.8373,99.9759
509,510,1955,3164,3061,319.967,58.8787,31.1213,99.9483
510,511,2885,2399,3061,115.903,29.3738,60.6262,99.9385
511,512,546,1090,3035,126.346,16.7125,73.2875,99.9744
512,513,630,2783,3035,231.225,66.4416,23.5584,99.9154
513,514,11115,2548,3096,306.971,47.9865,42.0135,99.785
514,515,38504,1124,3172,283.209,14.2025,75.7975,99.9563
515,516,1892,111,3055,288.896,16.6527,73.3473,99.9834
516,517,616,2442,3068,253.361,72.2166,17.7834,99.5018
517,518,7414,2864,3099,2.57521,78.9294,11.0706,99.9652
518,519,4302,74,3105,151.654,85.1961,4.80387,99.9587
519,520,751,30,3087,285.509,14.1263,75.8737,99.9319
520,521,15786,2706,3131,122.786,12.9974,77.0026,99.9763
521,522,923,1052,3102,300.627,47.0905,42.9095,99.9803
522,523,12653,1710,3171,133.884,34.6215,55.3785,99.9891
523,524,25415,1917,3208,244.787,70.3206,19.6794,82.6382
524,525,1744,2382,3114,132.38299999999998,58.4783,31.5217,99.9494
525,526,1330,3138,3117,118.412,46.0001,43.9999,99.9696
526,527,5022,2448,3153,121.865,80.1662,9.83379,99.8799
527,528,635,3031,3121,127.419,46.5409,43.4591,99.9367
528,529,776,3086,3114,317.4840000000001,57.2983,32.7017,99.9325
529,530,46134,2312,3279,123.322,15.7094,74.2906,99.9779
530,531,2881,106,3162,298.374,35.347,54.653,99.9867
531,532,561,3166,3141,306.288,21.1572,68.8428,99.9626
532,533,1970,2231,3154,297.593,9.8625,80.1375,99.9945
533,534,18850,3098,3205,316.244,63.7497,26.2503,99.8579
534,535,14921,1595,3213,287.347,43.2667,46.7333,99.9279
535,536,2833,2998,3162,302.873,58.6566,31.3434,99.9873
536,537,7773,2873,3177,291.366,59.9755,30.0245,99.9772
537,538,2578,61,3186,294.66,30.8507,59.1493,99.9757
538,539,1680,2502,3180,137.092,49.6082,40.3918,99.9881
539,540,5222,37,3249,277.321,26.3092,63.6908,99.9716
540,541,600,2218,3206,286.5440000000001,9.96095,80.0391,99.8988
541,542,5655,2542,3245,136.75,49.7612,40.2388,99.9211
542,543,518,656,3193,114.533,60.982,29.018,99.9952
543,544,36442,2875,3287,325.581,81.8196,8.18036,99.8793
544,545,7756,2642,3229,148.539,84.819,5.18098,99.9394
545,546,664,1515,3202,291.152,31.9982,58.0018,99.9874
546,547,924,727,3214,116.102,11.0687,78.9313,99.9489
547,548,613,2994,3216,301.7340000000001,59.15600000000001,30.844,99.9906
548,549,1054,2479,3215,301.551,15.5965,74.4035,99.7813
549,550,174058,1230,3434,293.08,19.2895,70.7105,89.3237
550,551,2653,1809,3237,303.587,0.657249,89.3428,99.9831
551,552,2552,92,3249,297.0,21.0065,68.9935,99.9035
552,553,609,1490,3232,307.705,67.9286,22.0714,99.9954
553,554,812,1637,3248,278.803,39.9873,50.0127,99.3914
554,555,2111,1383,3254,297.751,24.1119,65.8881,99.9914
555,556,770,3017,3243,105.283,4.93644,85.0636,99.9922
556,557,1120,2448,3266,300.621,11.8596,78.1404,99.6091
557,558,599,840,3255,108.126,3.61573,86.3843,99.993
558,559,8282,1662,3306,128.235,59.2159,30.7841,99.9777
559,560,2304,1012,3307,300.815,61.5061,28.4938,99.9573
560,561,1234,930,3288,124.321,23.141,66.859,99.941
561,562,35047,1820,3360,129.789,62.5524,27.4476,99.9496
562,563,1560,3008,3290,298.91,59.9275,30.0725,99.9911
563,564,4905,312,3311,121.243,50.0844,39.9156,99.9905
564,565,2516,2484,3297,130.32399999999998,14.2061,75.7939,99.9706
565,566,4602,2650,3309,309.112,13.826,76.17399999999998,99.9945
566,567,1523,2544,3305,302.862,12.0758,77.9242,99.9889
567,568,29021,2175,3399,130.352,53.109,36.891,99.8856
568,569,847,3049,3294,278.764,61.1408,28.8592,99.9863
569,570,693,972,3301,120.126,17.13,72.87,99.9167
570,571,919,1376,3304,293.732,21.8952,68.1048,99.976
571,572,942,2588,3301,147.33700000000005,59.7974,30.2026,99.9961
572,573,1597,3135,3303,121.49,37.1544,52.8456,99.8626
573,574,120755,288,3481,291.323,38.463,51.537,98.0814
574,575,1275,2892,3304,95.487,35.0257,54.9743,99.9885
575,576,541,2429,3317,293.376,10.9394,79.0606,99.9902
576,577,9867,2789,3354,105.788,30.4025,59.5975,99.9223
577,578,1643,909,3336,262.244,84.1288,5.8712300000000015,99.9991
578,579,1946,497,3339,317.452,47.7899,42.2101,99.9947
579,580,640,964,3334,130.259,25.576,64.42399999999999,99.9966
580,581,783,538,3343,300.943,15.2449,74.7551,99.9889
581,582,6439,3099,3378,278.235,60.3817,29.6183,99.9611
582,583,3798,1342,3373,97.2346,12.6735,77.3265,99.9806
583,584,15605,2429,3407,266.328,38.7522,51.2478,99.1193
584,585,29798,2627,3484,115.395,45.3271,44.6729,99.5568
585,586,2902,2880,3358,305.126,84.6044,5.39565,99.985
586,587,19803,331,3424,315.086,43.8123,46.1877,99.9276
587,588,1024,2577,3348,146.314,59.798,30.202,99.9894
588,589,3012,978,3374,121.636,20.2318,69.7682,98.3178
589,590,2220,872,3368,127.726,23.2977,66.7023,99.9456
590,591,32830,2019,3518,134.203,48.5298,41.4702,96.4796
591,592,6439,1624,3404,172.972,56.8888,33.1112,99.9344
592,593,7177,2556,3414,300.126,11.5344,78.4656,99.9615
593,594,4751,2854,3418,102.171,36.0591,53.9409,99.8795
594,595,1708,555,3429,254.992,80.5685,9.43149,99.984
595,596,72983,2883,3531,105.486,40.836,49.164,99.0609
596,597,59257,1749,3624,100.76,38.5311,51.4689,99.6594
597,598,1349,1300,3428,249.692,75.6194,14.3806,99.9908
598,599,1794,1786,3439,256.687,61.2653,28.7347,99.9885
599,600,602,1341,3436,209.345,73.4699,16.5301,99.9188
600,601,552,1655,3444,294.166,19.3219,70.6781,99.9919
601,602,9738,1494,3536,296.664,18.6274,71.3726,99.7434
602,603,5612,1608,3507,283.994,29.8061,60.1939,99.8754
603,604,14036,2499,3567,137.849,24.017,65.983,99.9793
604,605,1627,890,3498,122.405,17.7944,72.2056,99.9744
605,606,64445,2217,3702,314.733,16.5546,73.4454,99.9642
606,607,872,2644,3508,329.656,9.11243,80.8876,99.9975
607,608,100357,2485,3726,113.72,27.0643,62.9357,99.5703
608,609,11065,1980,3576,288.678,34.1822,55.8178,99.5406
609,610,7692,79,3585,299.113,44.4821,45.5179,99.9015
610,611,10468,3131,3597,279.321,1.77069,88.2293,90.3462
611,612,28951,2755,3702,331.622,83.2354,6.764639999999999,99.6931
612,613,4388,1874,3594,269.561,40.9127,49.0873,99.9837
613,614,1204,1533,3571,312.098,57.8405,32.1595,99.9791
614,615,7592,1566,3624,111.068,14.7543,75.2457,99.973
615,616,1629,613,3587,277.703,36.971,53.029,99.9878
616,617,47312,1024,3692,127.495,21.0479,68.9521,99.9574
617,618,583,1606,3601,297.514,40.5673,49.4327,99.9983
618,619,7201,549,3641,277.569,36.3594,53.6406,99.9617
619,620,622,2069,3604,298.589,16.5692,73.4308,99.8877
620,621,43316,1397,3716,118.655,33.7662,56.2338,99.8001
621,622,3481,1479,3623,98.3575,71.4142,18.5858,99.9874
622,623,38481,414,3722,305.381,15.4641,74.5359,99.9745
623,624,18652,3060,3701,122.932,27.2738,62.7262,99.5905
624,625,3127,1908,3641,123.394,51.3533,38.6467,99.948
625,626,6085,787,3659,323.764,79.4161,10.5839,99.985
626,627,3679,109,3662,114.28,40.0592,49.9408,99.9958
627,628,6151,2040,3686,125.769,6.50301,83.49700000000001,99.993
628,629,51559,1933,3825,120.958,12.4976,77.5024,99.7009
629,630,1898,719,3663,271.91200000000003,36.9079,53.0921,99.9961
630,631,1033,207,3661,276.848,50.7402,39.2598,99.9858
631,632,46819,107,3791,281.204,34.9803,55.0197,99.9616
632,633,738,244,3667,282.092,34.425,55.575,99.9965
633,634,5107,1203,3684,307.741,55.8742,34.1258,99.989
634,635,13572,2913,3705,270.818,10.3964,79.6036,98.4851
635,636,7408,867,3729,303.766,25.5655,64.4345,99.9142
636,637,46461,1575,3854,119.952,7.46259,82.5374,99.2739
637,638,875,266,3696,275.307,49.3839,40.6161,99.9943
638,639,40343,591,3804,118.141,32.9451,57.0549,99.9679
639,640,1155,703,3713,113.071,26.3922,63.6078,99.9796
640,641,7971,2468,3808,305.943,11.3001,78.6999,99.3044
641,642,17469,1714,3815,256.944,40.198,49.802,99.9835
642,643,119056,1191,4015,304.533,2.81231,87.1877,84.3024
643,644,31202,798,3842,209.533,52.9353,37.0647,99.9001
644,645,39831,2122,3910,110.272,39.6673,50.3327,99.7356
645,646,7039,3021,3799,112.582,18.2021,71.7979,99.6981
646,647,1307,968,3789,125.862,34.3559,55.6441,99.989
647,648,1437,358,3793,108.773,33.8036,56.1964,99.9952
648,649,585,316,3796,109.058,33.5368,56.4632,99.9943
649,650,536,139,3798,116.866,54.1429,35.8571,99.9974
650,651,1869,908,3815,302.588,12.8806,77.1194,99.9926
651,652,17348,222,3895,129.359,8.85242,81.1476,99.9057
652,653,1036,1004,3817,142.095,80.8066,9.19343,99.9738
653,654,737,166,3818,130.54,7.43515,82.5648,99.9938
654,655,834,3158,3833,154.72299999999996,78.5684,11.4316,99.9158
655,656,5376,1117,3842,107.894,72.8333,17.1667,99.9852
656,657,36900,354,3947,108.541,52.8322,37.1678,99.7778
657,658,1580,962,3845,114.349,0.243111,89.7569,99.9921
658,659,4031,1069,3877,114.753,1.58701,88.413,99.9897
659,660,770,3104,3844,298.636,75.5187,14.4813,99.9695
660,661,67177,2724,4003,98.6742,36.8258,53.1742,99.5915
661,662,4881,912,3891,304.098,29.1716,60.8284,99.9607
662,663,4441,692,3875,304.307,31.8257,58.1743,99.9936
663,664,4414,2340,3891,259.295,58.6934,31.3066,99.9919
664,665,786,2902,3901,237.817,86.383,3.61698,99.9863
665,666,863,3175,3871,154.356,77.9137,12.0863,99.9507
666,667,59114,945,4123,125.249,3.68242,86.3176,98.3492
667,668,2104,1382,3878,108.125,73.9127,16.0873,99.9846
668,669,724,2393,3872,139.64,21.0645,68.9355,99.9165
669,670,4623,508,3928,105.23,71.5587,18.4413,99.9107
670,671,2923,3111,3926,249.218,86.6695,3.33049,99.9746
671,672,673,2864,3896,236.529,86.7038,3.29622,99.9792
672,673,39209,1421,4030,282.992,48.7682,41.2318,99.3989
673,674,45978,2400,4023,306.427,31.6566,58.3434,97.2092
674,675,1420,1111,3930,114.037,69.3652,20.6348,99.9913
675,676,1351,708,3927,264.026,41.0248,48.9752,99.9867
676,677,864,3054,3943,245.156,86.2054,3.79462,99.9739
677,678,2913,1772,3959,100.395,1.84766,88.1523,99.9231
678,679,914,608,3928,105.072,69.1722,20.8278,99.9947
679,680,1199,1729,3943,113.334,69.4469,20.5531,99.987
680,681,14272,3119,4017,288.413,13.4652,76.5348,99.8644
681,682,1285,674,3962,266.565,38.3996,51.6004,99.9656
682,683,6970,1844,3986,253.585,54.6945,35.3055,99.8955
683,684,13333,2972,3988,111.76,13.8349,76.1651,99.7896
684,685,3525,1672,3970,167.34,59.5133,30.4867,99.9788
685,686,1434,138,3966,130.243,9.41128,80.5887,99.9785
686,687,800,600,3953,118.224,23.2603,66.7397,99.9961
687,688,17635,2040,4041,271.125,52.9211,37.0789,99.3812
688,689,21941,502,4045,215.114,69.4316,20.5684,99.7424
689,690,2340,814,3967,297.9240000000001,33.1144,56.8856,99.9827
690,691,15492,102,4066,123.256,36.3634,53.6366,99.9146
691,692,17729,836,4052,144.355,24.6756,65.3244,99.9747
692,693,1358,599,3988,115.862,38.1381,51.8619,99.9865
693,694,3313,677,4001,116.857,26.0094,63.9906,99.9379
694,695,18444,720,4092,111.709,33.6638,56.3362,99.9769
695,696,53006,1646,4146,110.447,3.73736,86.2626,99.7761
696,697,2047,2536,4002,314.269,50.1824,39.8176,99.9877
697,698,2866,1611,4021,174.543,68.8266,21.1734,99.0958
698,699,801,205,4005,117.134,41.2022,48.7978,99.9474
699,700,6888,1915,4059,102.396,39.4417,50.5583,99.1864
700,701,4899,263,4058,298.24,15.6059,74.3941,99.9636
701,702,564,629,4038,108.948,40.1294,49.8706,99.9733
702,703,2987,171,4063,125.496,35.5938,54.4062,99.9936
703,704,3790,2567,4060,350.546,77.3666,12.6334,98.776
704,705,10400,236,4151,125.929,35.0244,54.9756,99.9838
705,706,21974,2270,4131,297.959,7.55437,82.4456,99.9932
706,707,9108,2956,4166,96.7224,36.6923,53.3077,99.7658
707,708,7644,3063,4094,128.346,55.6247,34.3753,99.8164
708,709,1430,1836,4067,284.753,7.323810000000001,82.6762,99.9803
709,710,1148,1788,4073,98.9572,55.9043,34.0957,99.9927
710,711,4460,1978,4124,282.339,49.2277,40.7723,99.9663
711,712,2041,377,4103,291.853,4.04396,85.956,99.9868
712,713,3395,1507,4131,94.7893,12.9243,77.0757,99.9916
713,714,7948,2634,4157,301.574,14.5179,75.4821,99.9794
714,715,5129,307,4135,66.9077,69.6025,20.3975,99.9076
715,716,9522,626,4167,136.952,18.8048,71.1952,99.9191
716,717,1620,1870,4121,272.706,48.9867,41.0133,99.9872
717,718,32040,505,4224,274.273,56.8447,33.1553,99.9423
718,719,1202,1816,4117,261.074,56.1845,33.8155,99.9672
719,720,34346,2058,4246,311.603,27.8859,62.1141,99.9818
720,721,6297,1942,4183,111.155,18.2053,71.7947,99.429
721,722,2825,2391,4143,122.677,11.6017,78.3983,99.9425
722,723,22041,2188,4253,307.0540000000001,16.1619,73.8381,99.9952
723,724,13472,2448,4200,315.136,47.1348,42.8652,99.9884
724,725,12681,372,4227,68.2379,66.7381,23.2619,99.9471
725,726,36868,3050,4274,294.831,2.08186,87.9181,99.8204
726,727,1525,54,4171,314.761,60.5885,29.4115,99.9433
727,728,857,822,4157,259.731,64.7785,25.2215,99.9776
728,729,2244,1778,4174,80.4115,75.7048,14.2952,99.9902
729,730,1234,145,4177,72.419,69.0078,20.9922,99.9769
730,731,18515,2546,4258,125.479,3.90095,86.0991,99.9648
731,732,12750,1808,4228,107.073,57.7555,32.2445,99.9246
732,733,46607,1499,4358,130.81,19.7968,70.2032,99.6866
733,734,58136,1287,4324,89.3118,13.0533,76.9467,99.8647
734,735,9285,739,4227,303.096,6.52262,83.4774,99.9669
735,736,15508,1914,4304,107.742,29.2077,60.7923,73.1574
736,737,3011,806,4249,255.85,64.5444,25.4556,99.9302
737,738,1273,84,4202,295.61,15.8208,74.1792,99.9162
738,739,910,187,4204,73.6431,70.5541,19.4459,99.982
739,740,510,2360,4204,277.475,28.9259,61.0741,99.9949
740,741,30291,2652,4347,304.09,3.99713,86.0029,99.9902
741,742,11605,1038,4296,132.49,51.2731,38.7269,99.7566
742,743,2528,292,4244,292.976,13.2244,76.7756,99.9906
743,744,18873,656,4315,257.829,65.0226,24.9774,99.9744
744,745,134123,2385,4460,96.8757,60.0236,29.9764,99.4723
745,746,82486,198,4428,280.457,32.8614,57.1386,99.9628
746,747,96450,1728,4477,300.907,8.2946,81.7054,99.9611
747,748,143888,2937,4565,302.0,0.0459137,89.9541,69.8384
748,749,920,447,4305,109.486,0.878883,89.1211,99.9916
749,750,515,2942,4311,296.308,14.405,75.595,99.945
750,751,11191,1123,4372,130.54,20.2597,69.7403,99.9979
751,752,1650,2814,4331,299.379,0.0219193,89.9781,99.835
752,753,309753,828,4632,238.61900000000003,67.4712,22.5288,97.125
753,754,4160,958,4374,284.363,31.7653,58.2347,99.9055
754,755,56756,422,4576,283.31,11.0856,78.9144,92.4861
755,756,11347,334,4410,128.191,52.0399,37.9601,99.962
756,757,14760,3119,4392,131.036,49.9494,40.0506,99.4323
757,758,5142,552,4391,112.362,3.90884,86.0912,99.9878
758,759,640,1898,4389,300.129,87.0807,2.91927,99.9955
759,760,23276,2047,4480,306.701,14.6334,75.3666,88.2207
760,761,1089,877,4398,278.838,33.3415,56.6585,99.9948
761,762,67608,1364,4592,114.985,3.68189,86.3181,82.086
762,763,4277,48,4469,116.936,34.4683,55.5317,99.7609
763,764,820,79,4430,107.499,14.8124,75.1876,99.9367
764,765,20887,1933,4542,304.561,21.0529,68.9471,99.8845
765,766,578,3158,4475,118.455,47.736,42.264,99.7126
766,767,1173,2981,4489,121.416,67.9835,22.0165,99.9606
767,768,3261,2227,4511,288.371,22.5886,67.4114,99.9768
768,769,2747,23,4563,278.155,35.9885,54.0115,99.9236
769,770,9040,123,4619,111.89,41.9893,48.0107,99.926
770,771,9811,2284,4583,348.855,82.7434,7.25661,99.7228
771,772,20779,2680,4650,114.82,7.949839999999999,82.0502,99.9829
772,773,23562,1555,4678,116.136,57.2002,32.7998,99.9418
773,774,2925,2159,4599,291.386,19.3592,70.6408,99.9919
774,775,1973,2099,4617,104.836,46.5115,43.4885,99.9791
775,776,1052,2212,4625,301.684,3.71835,86.2816,99.9785
776,777,38841,1999,4709,119.319,11.1077,78.8923,99.5665
777,778,565,1866,4627,281.368,23.7733,66.2267,99.9893
778,779,7153,2295,4681,254.108,69.8929,20.1071,99.9761
779,780,1368,2153,4651,346.61800000000005,83.6121,6.3879,99.901
780,781,45040,1776,4762,282.817,25.0134,64.9866,99.9064
781,782,14656,2801,4735,125.235,33.6521,56.3479,99.9877
782,783,4884,1235,4695,116.134,24.8878,65.1122,99.9867
783,784,28027,2514,4729,117.972,20.8417,69.1583,99.9272
784,785,26902,2246,4783,286.633,25.231,64.76899999999999,99.8468
785,786,3473,87,4712,273.452,36.2181,53.7819,99.9855
786,787,13743,276,4743,298.693,74.8407,15.1593,99.9099
787,788,826,2246,4728,121.819,14.2528,75.7472,99.981
788,789,29497,1327,4796,313.625,4.01397,85.986,99.8848
789,790,3521,2371,4742,289.728,74.2183,15.7817,99.9907
790,791,12826,2675,4799,126.493,29.6425,60.3575,99.9601
791,792,549,171,4742,303.198,47.3756,42.6244,99.996
792,793,13713,2071,4822,286.397,0.362885,89.6371,99.9332
793,794,10997,3021,4803,300.928,57.996,32.004,99.8857
794,795,20067,1568,4826,129.309,21.9016,68.0984,99.7213
795,796,2807,194,4780,113.229,43.7557,46.2443,99.9477
796,797,1952,67,4790,273.048,35.9844,54.0156,99.964
797,798,7458,1169,4832,281.865,36.7509,53.2491,99.9365
798,799,949,2388,4796,284.463,37.1766,52.8234,99.9882
799,800,1542,134,4809,113.457,57.8311,32.1689,99.9799
800,801,948,2910,4800,294.876,24.6463,65.3537,99.89
801,802,12202,2474,4835,309.115,19.2151,70.7849,99.9079
802,803,1416,14,4831,116.496,57.528,32.472,99.6618
803,804,1916,2857,4815,281.644,37.9286,52.0714,99.9864
804,805,11036,282,4839,147.155,70.7425,19.2575,99.9285
805,806,2362,2790,4838,297.733,24.853,65.14699999999999,99.9605
806,807,851,2157,4832,117.595,12.6046,77.3954,99.9493
807,808,641,2615,4850,291.958,4.92489,85.0751,99.9517
808,809,878,2943,4846,100.795,22.7531,67.2469,99.8551
809,810,914,1919,4853,114.57,0.0102463,89.9898,99.8619
810,811,2484,1062,4854,101.565,40.9112,49.0888,99.9533
811,812,833,432,4856,147.933,70.4846,19.5154,99.7789
812,813,1276,2878,4846,296.384,25.3478,64.6522,99.8845
813,814,890,63,4857,118.641,56.0663,33.9337,99.9191
