,Grain No.,Size [Pixel],center x-coordinate,center y-coordinate,mean azimuth [degree],mean latitude [degree],mean colatitude [degree],Regelungsgrad [%]
0,1,4675,354,255,152.196,62.8653,27.1347,99.8949
1,2,2483,475,264,163.471,34.4807,55.5193,99.9746
2,3,70535,1117,340,344.885,60.1964,29.8036,99.9206
3,4,592,587,256,155.97799999999995,64.8317,25.1683,99.9537
4,5,17769,194,340,160.537,36.4563,53.5437,99.8126
5,6,2251,1138,265,167.953,35.8568,54.1432,99.9396
6,7,1101,1258,257,162.389,37.3472,52.6528,99.8986
7,8,718,1212,263,171.55599999999995,64.9303,25.0697,99.9208
8,9,4337,532,298,351.302,25.2264,64.7736,99.9776
9,10,51051,1566,360,171.84,9.70139,80.2986,73.6498
10,11,1501,656,268,347.716,10.9598,79.0402,99.9157
11,12,2513,764,268,348.543,10.3286,79.6714,99.9862
12,13,112498,2078,425,344.403,82.7451,7.254860000000001,67.0531
13,14,4834,2366,291,340.468,30.377,59.62300000000001,99.9618
14,15,1545,1867,273,182.987,56.1446,33.8554,99.9717
15,16,2915,1773,282,182.539,56.4281,33.5719,99.9799
16,17,41936,2440,381,340.249,51.5646,38.4354,99.7533
17,18,1075,3067,285,347.2480000000001,8.13137,81.8686,99.8962
18,19,13768,2854,318,333.50699999999995,54.0122,35.9878,99.8886
19,20,11832,384,327,353.8880000000001,3.5676300000000003,86.4324,99.9529
20,21,2598,1802,317,168.794,48.7048,41.2952,99.9789
21,22,1223,598,287,157.135,63.6718,26.3282,99.997
22,23,21224,756,348,347.957,26.7827,63.2173,99.9754
23,24,830,1224,288,171.80599999999995,63.0486,26.9514,99.9961
24,25,34424,2654,370,158.519,28.4661,61.5339,99.9757
25,26,562,2979,286,345.547,8.07426,81.9257,99.9756
26,27,1100,3246,301,166.247,28.6763,61.3237,99.9635
27,28,3056,300,318,354.3780000000001,3.69003,86.31,99.8799
28,29,1317,3196,315,175.243,64.5394,25.4606,99.9778
29,30,998,662,312,159.537,63.4742,26.5258,99.9951
30,31,850,1853,312,182.634,55.8608,34.1392,99.9676
31,32,9405,3295,364,347.602,28.7224,61.2776,99.9536
32,33,5878,3032,337,161.869,8.47845,81.5216,98.6011
33,34,791,3108,312,332.171,54.9939,35.0061,99.9114
34,35,1845,899,331,166.12599999999995,35.2298,54.7702,99.9929
35,36,10232,570,370,171.47299999999996,31.0179,58.9821,99.7779
36,37,56485,3165,463,345.784,15.2523,74.7477,99.9295
37,38,112321,1281,511,161.143,23.3062,66.6938,99.9049
38,39,23864,2903,430,347.7940000000001,8.48223,81.5178,99.9713
39,40,54857,378,482,335.135,30.289,59.71100000000001,99.7166
40,41,84485,1888,633,180.36900000000003,79.1519,10.8481,94.5288
41,42,583,1779,359,348.744,9.11553,80.8845,99.9904
42,43,66477,771,484,348.288,65.9279,24.0721,99.6349
43,44,19490,2392,495,337.225,60.2953,29.7047,95.6113
44,45,9334,3006,473,165.767,40.9165,49.0835,99.9096
45,46,848,132,421,171.699,30.0749,59.9251,99.8983
46,47,4666,2736,446,336.728,39.9044,50.0956,99.9429
47,48,3285,1825,453,193.603,76.7514,13.2486,99.983
48,49,694,3333,446,163.09,8.6206,81.3794,99.9636
49,50,1341,1361,453,170.637,60.5982,29.4018,99.9956
50,51,8749,180,497,345.291,1.37677,88.6232,99.4619
51,52,3281,2770,492,158.362,28.7967,61.2033,99.9941
52,53,3074,1639,503,346.879,59.9692,30.0308,99.9276
53,54,67903,3232,742,341.92,56.8672,33.1328,99.9026
54,55,26172,2636,594,296.1670000000001,83.0151,6.98491,99.5737
55,56,2011,2833,536,305.011,86.4639,3.53607,98.7173
56,57,7484,2870,618,256.767,84.0448,5.95516,99.5238
57,58,528,2573,515,263.696,81.1105,8.889489999999997,99.9754
58,59,504,125,527,160.532,0.683662,89.3163,99.9922
59,60,111404,567,746,165.25400000000005,15.6242,74.3758,87.1901
60,61,6438,2793,603,312.865,80.7261,9.27385,99.7128
61,62,763,2739,580,313.338,80.0978,9.90215,99.7463
62,63,9163,2963,596,240.297,82.5409,7.459119999999999,99.8408
63,64,33437,735,670,165.916,8.401860000000001,81.5981,99.9662
64,65,80717,2505,784,179.415,43.8817,46.1183,99.7155
65,66,27432,221,665,335.499,50.8825,39.1175,99.1553
66,67,596,210,576,162.555,15.1478,74.8522,99.9976
67,68,2242,2414,588,175.396,54.6927,35.3073,99.9949
68,69,16380,1604,633,166.859,36.3568,53.6432,99.9702
69,70,14200,969,643,343.0080000000001,77.6491,12.3509,99.9552
70,71,3674,2105,600,174.278,41.7303,48.2697,99.9985
71,72,47584,2227,690,178.25799999999995,59.76300000000001,30.237,99.9119
72,73,11955,3082,640,182.03,65.5415,24.4585,99.9809
73,74,3098,859,621,157.227,24.1583,65.8417,99.9955
74,75,1177,1002,607,135.869,81.6899,8.31011,99.9794
75,76,61037,1481,750,209.557,77.872,12.128,99.7496
76,77,982,2734,655,305.232,81.3587,8.64125,99.9608
77,78,21821,1206,691,168.763,50.3926,39.6074,99.953
78,79,1052,2828,660,250.019,82.0816,7.91835,99.9007
79,80,648,2526,662,254.08900000000003,82.8823,7.11774,99.9575
80,81,45624,1774,772,342.955,7.8027,82.1973,100.018
81,82,134458,2859,966,172.787,60.3562,29.6438,60.2342
82,83,1075,2792,676,325.348,79.82600000000002,10.174,99.9804
83,84,1935,1098,704,164.04,63.5365,26.4635,99.9885
84,85,3535,3042,718,299.49,86.0532,3.94685,99.9796
85,86,6142,3155,712,162.442,43.2967,46.7033,99.9979
86,87,114722,1158,925,166.858,27.2839,62.7161,98.7298
87,88,950,2574,705,252.841,84.1428,5.85722,99.97
88,89,971,329,707,184.548,84.8404,5.15963,99.9914
89,90,1292,2747,733,309.692,81.4541,8.545869999999999,99.9148
90,91,871,2702,720,313.35,81.6828,8.31725,99.9544
91,92,10525,204,774,171.259,81.3772,8.62284,99.9823
92,93,516,2851,746,298.2390000000001,84.7099,5.29006,99.9729
93,94,4459,2343,777,168.093,52.3697,37.6303,99.9839
94,95,949,1428,768,128.306,79.916,10.084,99.9842
95,96,2789,2929,788,317.122,84.9844,5.015630000000002,99.9666
96,97,1082,915,778,151.958,80.9262,9.07376,99.982
97,98,27153,370,858,343.719,48.217,41.783,99.9895
98,99,3251,879,804,323.274,61.708,28.292,99.9422
99,100,577,956,778,165.97400000000005,80.8628,9.13723,99.9717
100,101,5987,1690,822,155.017,79.9924,10.0076,99.968
101,102,4335,977,820,323.306,60.4803,29.5197,99.8819
102,103,31446,1386,913,336.9290000000001,22.1142,67.8858,99.6749
103,104,3816,2198,812,357.862,2.37447,87.6255,99.9963
104,105,6251,2258,867,164.09400000000005,53.6508,36.3492,99.9596
105,106,651,127,848,351.298,19.7102,70.2898,99.6208
106,107,13304,202,885,354.27,22.2496,67.7504,99.9826
107,108,11715,2127,872,342.543,34.2192,55.7808,99.9507
108,109,5252,1936,875,157.607,40.5026,49.4974,99.9929
109,110,931,909,864,169.03599999999997,30.854,59.146,99.9948
110,111,4878,1686,895,163.531,39.278,50.722,99.9931
111,112,1074,802,883,161.352,24.4037,65.5963,99.9123
112,113,9978,899,931,326.628,81.286,8.714,99.9652
113,114,46500,1916,1055,335.163,36.0722,53.9278,86.5865
114,115,19941,3266,969,169.94299999999996,37.7302,52.2698,99.6895
115,116,40520,2326,995,346.81,0.495598,89.5044,78.5794
116,117,1773,3148,916,295.9,83.2805,6.7195100000000005,99.9878
117,118,78170,717,1034,318.842,58.5255,31.4745,99.6105
118,119,4314,1772,938,325.145,74.4753,15.5247,99.99
119,120,2000,496,948,311.84,64.732,25.268,99.8816
120,121,63148,278,1034,344.667,17.8564,72.1436,99.8732
121,122,5313,2074,957,350.121,59.4814,30.5186,99.9951
122,123,5572,1877,937,338.194,76.4351,13.5649,99.9773
123,124,2740,1075,946,327.381,79.2723,10.7277,99.9891
124,125,629,2120,935,161.217,41.3794,48.6206,99.9971
125,126,3935,1364,980,171.02900000000002,59.584,30.416,99.8971
126,127,23531,1646,997,336.917,20.0886,69.9114,71.9598
127,128,11248,3095,992,279.421,84.0688,5.93115,99.8405
128,129,2683,2336,979,213.076,71.8774,18.1226,99.4383
129,130,48452,2526,1093,339.9480000000001,18.9127,71.0873,99.9197
130,131,11099,484,1041,335.619,74.0053,15.9947,99.3006
131,132,859,2131,989,206.715,73.3563,16.6437,99.9804
132,133,2289,984,1015,174.975,54.0416,35.9584,98.7408
133,134,1067,1029,990,337.014,26.4024,63.5976,99.9867
134,135,1201,2940,1003,283.37,84.3285,5.67154,99.9214
135,136,2043,1049,1028,330.18300000000005,70.6826,19.3174,98.4073
136,137,9580,2123,1047,344.1790000000001,70.9877,19.0123,95.2433
137,138,3929,1524,1041,287.312,84.3577,5.64233,98.4761
138,139,3088,1408,1030,221.073,86.0336,3.96637,99.3051
139,140,53769,3187,1174,173.28,59.2774,30.7226,99.7119
140,141,3411,3123,1061,158.142,17.4879,72.5121,74.6487
141,142,4610,918,1084,157.17,24.5559,65.4441,99.9788
142,143,6075,1613,1089,172.433,40.5032,49.4968,99.9954
143,144,4067,2040,1084,161.862,4.0966,85.9034,99.9935
144,145,1214,1663,1076,154.42600000000004,27.1014,62.8986,99.9788
145,146,126676,1092,1388,342.347,17.3695,72.6305,85.2578
146,147,2624,1486,1074,156.388,24.7725,65.2275,99.9743
147,148,718,1403,1068,171.46900000000005,65.7692,24.2308,99.745
148,149,70392,1349,1297,164.22299999999996,41.6384,48.3616,99.8077
149,150,2458,1945,1131,169.69099999999997,1.1843,88.8157,99.9863
150,151,77393,2028,1271,165.226,35.0043,54.9957,91.5868
151,152,4210,1718,1114,167.64,37.1944,52.8056,99.9694
152,153,1230,2273,1107,262.738,77.8985,12.1015,99.9952
153,154,2735,361,1125,353.971,48.0102,41.9898,99.9302
154,155,798,1537,1109,338.468,40.3945,49.6055,99.985
155,156,640,2345,1126,154.998,45.6481,44.3519,99.9875
156,157,5830,2303,1163,330.926,41.3325,48.6675,99.9876
157,158,1162,1630,1141,155.731,27.2561,62.7439,99.9889
158,159,34635,181,1352,160.297,45.9182,44.0818,99.3349
159,160,13759,830,1180,164.21400000000003,36.924,53.076,99.9967
160,161,18133,1574,1193,340.677,75.3528,14.6472,99.9767
161,162,56131,337,1253,352.309,56.4382,33.5618,99.9883
162,163,37836,1727,1262,347.63699999999994,82.1022,7.89779,99.646
163,164,27200,2550,1244,162.248,16.8064,73.1936,99.7202
164,165,24820,543,1237,308.548,66.7055,23.2945,99.8733
165,166,52800,2949,1292,179.41299999999995,71.8636,18.1364,99.9077
166,167,42951,768,1277,327.276,76.3659,13.6341,99.8491
167,168,842,2560,1180,173.87599999999995,3.44417,86.5558,99.9391
168,169,4073,2246,1199,343.723,41.8817,48.1183,99.9981
169,170,8192,1199,1212,340.36,58.9698,31.0302,99.9951
170,171,14047,2707,1266,342.589,81.3371,8.6629,99.9476
171,172,2056,1684,1239,170.50099999999995,35.3037,54.6963,99.9973
172,173,169268,2390,1487,340.89,3.23206,86.7679,97.3893
173,174,2320,3067,1239,353.944,52.5482,37.4518,99.9962
174,175,8521,2387,1262,335.842,41.5649,48.4351,99.9708
175,176,14715,1493,1328,330.466,52.0017,37.9983,99.8703
176,177,2329,1092,1261,157.376,36.375,53.625,99.9876
177,178,6001,1259,1286,170.035,61.2117,28.7883,99.9838
178,179,1133,1155,1257,170.167,60.3615,29.6385,99.9365
179,180,568,1645,1259,331.141,48.9071,41.0929,99.9912
180,181,3984,3288,1295,350.006,8.38913,81.6109,99.9941
181,182,1200,1137,1291,339.918,75.8881,14.1119,99.9898
182,183,1479,1183,1305,329.095,57.8121,32.1879,99.9971
183,184,3221,3121,1333,351.723,52.0362,37.9638,99.9962
184,185,5939,2073,1353,207.356,73.2517,16.7483,99.9727
185,186,13842,2449,1401,120.349,81.7273,8.27266,99.9232
186,187,836,2382,1367,78.3496,82.7407,7.25926,99.9652
187,188,47756,618,1450,162.664,18.3134,71.6866,99.1068
188,189,1446,2702,1348,166.489,24.6493,65.3507,99.966
189,190,44961,3180,1465,322.911,80.0413,9.95866,99.6441
190,191,519,1387,1339,304.837,85.5769,4.42315,99.996
191,192,759,1579,1340,352.838,38.1877,51.8123,99.9966
192,193,2648,3173,1369,178.831,57.4787,32.5213,99.9958
193,194,812,107,1374,163.93599999999995,47.9588,42.0412,99.9394
194,195,5817,787,1375,162.601,39.4681,50.5319,99.9904
195,196,8267,1602,1398,160.769,39.0024,50.9976,99.9951
196,197,4654,2832,1395,174.655,59.8122,30.1878,99.9864
197,198,879,3101,1381,340.701,27.0424,62.9576,99.9861
198,199,4357,1826,1402,177.08700000000005,48.6114,41.3886,99.9247
199,200,9595,1715,1417,336.9530000000001,56.6265,33.3735,99.9137
200,201,149545,422,1662,340.816,34.2624,55.7376,92.837
201,202,31268,834,1472,311.367,72.5188,17.4812,99.2492
202,203,4955,2081,1430,163.37,29.6468,60.3532,99.9888
203,204,7587,2892,1460,342.524,25.5587,64.4413,99.9506
204,205,916,3008,1427,342.67,28.1312,61.8688,99.9593
205,206,8816,1511,1459,173.66400000000004,42.6378,47.3622,99.9627
206,207,1056,107,1439,162.35299999999995,50.2272,39.7728,99.8576
207,208,256065,1665,1687,168.305,28.4869,61.5131,82.5465
208,209,992,1962,1459,328.8130000000001,78.241,11.759,99.7699
209,210,605,2119,1471,182.422,71.8138,18.1862,99.9958
210,211,1477,2054,1473,305.289,80.1351,9.86494,99.9917
211,212,5964,2971,1518,183.972,62.6321,27.3679,99.7696
212,213,31576,2785,1596,161.533,12.2337,77.7663,99.9621
213,214,38331,3258,1677,343.115,40.5518,49.4482,99.4208
214,215,689,117,1538,341.191,14.6367,75.3633,99.0428
215,216,3326,2705,1545,335.374,51.3941,38.6059,99.8802
216,217,25570,702,1608,302.053,85.3108,4.68918,99.9393
217,218,122506,2455,1831,171.68400000000003,57.2951,32.7049,99.2797
218,219,1213,2975,1573,340.102,73.0446,16.9554,99.5305
219,220,601,3031,1574,162.35399999999996,15.0442,74.9558,99.9971
220,221,3549,105,1630,154.952,57.7476,32.2524,99.9537
221,222,34128,1132,1663,337.059,3.96712,86.0329,99.9847
222,223,20063,3061,1651,163.975,29.4363,60.5637,99.875
223,224,2017,2990,1609,339.83,74.053,15.947,99.8152
224,225,26049,794,1721,243.629,85.5021,4.49789,99.9566
225,226,2822,145,1648,156.394,55.1013,34.8987,99.9907
226,227,10043,1844,1670,353.903,3.15623,86.8438,99.992
227,228,7423,2763,1683,345.914,40.3455,49.6545,99.9896
228,229,7862,369,1690,166.1,47.4041,42.5959,99.9913
229,230,3447,981,1674,167.87900000000005,14.8651,75.1349,99.9402
230,231,4690,2182,1667,28.1686,84.105,5.895,99.9617
231,232,3199,2870,1673,167.82,58.3831,31.6169,99.9766
232,233,17711,212,1732,341.837,46.5791,43.4209,99.9762
233,234,1054,2122,1693,167.517,55.3684,34.6316,99.997
234,235,990,1308,1692,333.235,86.5592,3.44077,99.9862
235,236,572,1274,1697,188.195,82.0561,7.943860000000001,99.5836
236,237,5751,1382,1718,317.211,67.8844,22.1156,99.9923
237,238,3306,1243,1723,326.082,85.9294,4.07061,99.913
238,239,6505,3143,1740,345.209,34.7093,55.2907,99.9973
239,240,1969,2831,1716,162.454,9.91375,80.0863,99.9964
240,241,4870,3058,1738,171.467,67.3005,22.6995,99.9539
241,242,1548,2966,1716,166.805,57.3029,32.6971,99.9827
242,243,724,868,1713,206.391,77.094,12.906,99.9927
243,244,5043,1144,1734,165.58,13.8887,76.1113,99.8675
244,245,10949,2685,1766,340.319,14.0341,75.9659,99.9753
245,246,19824,2119,1771,167.646,59.3087,30.6913,99.9876
246,247,1068,1306,1729,338.4380000000001,74.9839,15.0161,99.8491
247,248,3010,630,1755,172.232,44.6055,45.3945,99.9443
248,249,48123,3028,1863,285.373,82.9299,7.070130000000002,99.7163
249,250,10268,2817,1788,166.602,57.3901,32.6099,99.984
250,251,29426,222,1835,164.455,37.1238,52.8762,99.9389
251,252,2168,923,1750,250.827,85.8379,4.16212,99.9923
252,253,36079,1927,1885,307.539,85.2511,4.74892,99.9067
253,254,3328,1220,1765,354.626,0.115753,89.8842,99.9894
254,255,45770,931,1857,203.861,75.0656,14.9344,99.8999
255,256,4610,2578,1796,163.737,55.4413,34.5587,99.9923
256,257,3641,3206,1791,150.697,63.6958,26.3042,99.9874
257,258,68913,1159,1933,159.379,16.2834,73.7166,99.9262
258,259,2144,1689,1812,164.613,48.8732,41.1268,99.9939
259,260,10898,741,1867,162.869,31.2553,58.7447,99.9404
260,261,2254,1846,1821,168.505,21.1202,68.8798,99.9963
261,262,11281,1770,1863,179.707,67.3562,22.6438,99.9899
262,263,1509,2612,1837,176.24200000000005,55.5635,34.4365,99.9957
263,264,23669,2146,1912,166.65,54.6128,35.3872,99.9898
264,265,180107,2907,2081,164.562,0.932022,89.068,69.8142
265,266,2618,392,1853,164.417,46.2024,43.7976,99.9933
266,267,3278,2562,1870,349.122,44.0294,45.9706,99.9976
267,268,1428,3182,1879,152.072,43.104,46.896,99.9946
268,269,67045,324,2003,163.214,69.0736,20.9264,99.8378
269,270,553,3283,1884,284.206,79.6023,10.3977,99.9724
270,271,1269,1695,1889,353.954,83.5064,6.49362,99.9808
271,272,8236,3190,1943,175.49599999999995,71.2717,18.7283,99.6477
272,273,5059,710,1928,330.426,62.1413,27.8587,99.9747
273,274,21390,1689,1999,179.503,44.2269,45.7731,99.8818
274,275,9580,2359,1986,167.921,44.4192,45.5808,98.4094
275,276,724,2246,1944,174.29,0.547974,89.45200000000001,99.9664
276,277,9137,3272,1991,332.9980000000001,45.7541,44.2459,99.9659
277,278,864,125,1952,166.16400000000004,67.2552,22.7448,99.9648
278,279,12284,610,2020,169.828,76.8903,13.1097,98.8431
279,280,9956,723,2015,177.828,50.6278,39.3722,99.9291
280,281,5990,1823,2039,335.1140000000001,79.7825,10.2175,98.4481
281,282,192849,1012,2210,351.445,13.7218,76.2782,99.8021
282,283,9228,2008,1995,330.06,75.9399,14.0601,99.844
283,284,1294,103,2003,161.31,56.0865,33.9135,99.7239
284,285,68448,1446,2078,200.698,79.8698,10.1302,99.0219
285,286,9309,2256,2019,162.80200000000005,80.8626,9.13743,98.6225
286,287,724,3200,1991,171.998,34.1461,55.8539,99.9903
287,288,81426,2005,2226,162.734,36.0858,53.9142,98.9755
288,289,7774,2163,2079,348.78,38.3288,51.6712,99.9975
289,290,27079,204,2144,158.983,31.3449,58.6551,99.9624
290,291,819,1758,2046,349.319,14.7217,75.2783,99.9635
291,292,21409,2442,2140,341.379,47.8453,42.1547,99.7813
292,293,2604,100,2083,158.673,32.4544,57.5456,99.8987
293,294,622,2042,2054,347.446,9.65108,80.3489,99.9853
294,295,3925,2328,2085,340.68300000000005,57.2619,32.7381,99.9981
295,296,13584,685,2127,165.079,39.1419,50.8581,99.9894
296,297,9081,2633,2113,166.34799999999996,76.5922,13.4078,99.9806
297,298,7120,534,2128,161.475,14.5479,75.4521,99.994
298,299,7096,1778,2124,346.315,39.4513,50.5487,99.9624
299,300,1224,2720,2116,317.574,83.5814,6.41859,99.9688
300,301,31874,2222,2202,160.55100000000004,27.3101,62.6899,99.9651
301,302,564,1647,2112,347.416,40.5484,49.4516,99.9937
302,303,1700,1693,2120,349.775,14.0216,75.9784,99.9738
303,304,5165,460,2164,165.13,77.24,12.76,99.9661
304,305,6780,1670,2192,177.36700000000005,44.8555,45.1445,99.9569
305,306,3637,2561,2160,327.786,70.7841,19.2159,99.9796
306,307,608,115,2139,177.521,65.4518,24.5482,99.9855
307,308,1212,593,2149,324.332,61.5512,28.4488,99.9927
308,309,1735,2115,2158,348.76199999999994,37.8893,52.1107,99.9787
309,310,788,3309,2179,162.482,69.1317,20.8683,99.9174
310,311,2341,2354,2185,352.099,13.2719,76.7281,99.9931
311,312,2516,2732,2188,303.3540000000001,81.5714,8.428560000000001,99.9741
312,313,5259,1594,2208,344.14,41.6957,48.3043,99.961
313,314,7154,404,2237,173.641,47.0153,42.9847,99.9719
314,315,6229,1795,2199,299.55,79.4178,10.5822,99.9754
315,316,1187,2610,2190,165.535,40.3902,49.6098,99.9955
316,317,4920,2645,2225,342.8,52.8182,37.1818,99.9533
317,318,96202,535,2382,340.425,4.08413,85.9159,97.9396
318,319,1327,358,2201,164.51,75.5128,14.4872,99.9914
319,320,4130,1388,2218,157.16899999999995,21.8804,68.1196,99.9937
320,321,12369,2555,2285,181.026,73.9287,16.0713,99.9433
321,322,1028,103,2220,190.319,67.41,22.59,99.9616
322,323,28123,3144,2277,351.086,3.65249,86.3475,99.9534
323,324,2827,1521,2235,177.048,43.1244,46.8756,99.9965
324,325,9102,336,2274,332.769,62.5826,27.4175,99.9888
325,326,166795,1228,2600,337.147,29.8978,60.1022,80.1738
326,327,5086,1750,2264,347.576,38.9233,51.0767,99.9966
327,328,619,3003,2231,353.1880000000001,30.3935,59.6065,99.9916
328,329,1891,2436,2238,352.136,18.9965,71.0035,99.975
329,330,15778,180,2292,174.577,47.295,42.705,99.849
330,331,933,1646,2248,176.10299999999995,70.4141,19.5859,98.2549
331,332,1982,2367,2259,163.947,47.2361,42.7639,99.9911
332,333,1098,2491,2254,166.484,42.1133,47.8867,99.9907
333,334,13098,3270,2344,340.694,16.2843,73.7157,99.8613
334,335,2955,1504,2293,156.467,22.6109,67.3891,99.907
335,336,3179,1849,2294,175.74,42.4895,47.5105,99.9675
336,337,648,1808,2273,344.168,54.7525,35.2475,99.388
337,338,15213,2815,2328,316.62,74.4669,15.5331,99.7524
338,339,90301,2476,2468,349.093,30.5285,59.4715,98.9988
339,340,1944,1683,2283,175.44299999999996,41.7447,48.2553,99.9964
340,341,30144,2246,2346,180.456,69.4729,20.5271,99.948
341,342,57424,1686,2372,344.486,23.7323,66.2677,99.9657
342,343,27498,279,2395,311.334,74.7205,15.2795,99.9475
343,344,10420,1284,2386,170.952,65.0235,24.9765,99.5259
344,345,647,2641,2299,237.417,86.4021,3.59785,99.9879
345,346,847,3000,2316,351.486,24.6644,65.3356,99.9978
346,347,6442,2688,2362,343.935,46.2767,43.7233,99.9986
347,348,24085,3078,2416,0.916151,85.9954,4.0046300000000015,99.8826
348,349,31281,783,2414,319.438,70.1351,19.8649,99.9601
349,350,1992,1867,2331,165.043,35.3434,54.6566,99.987
350,351,566,102,2339,171.929,49.4066,40.5934,99.9569
351,352,13500,2919,2421,172.804,30.0875,59.9125,99.8833
352,353,1132,91,2384,172.738,48.2888,41.7112,99.9386
353,354,786,2870,2397,330.6,36.6706,53.3294,99.8684
354,355,122768,2729,2678,170.852,43.0857,46.9143,78.2958
355,356,13975,3229,2467,170.98,45.5672,44.4328,99.9867
356,357,9009,171,2460,323.032,56.0874,33.9126,99.9896
357,358,302135,1885,2826,330.617,63.4154,26.5846,88.84700000000002
358,359,550,107,2440,318.94,56.7144,33.2856,99.9297
359,360,59091,1659,2550,166.14,35.3682,54.6318,99.9733
360,361,3214,93,2493,323.433,65.9452,24.0548,99.8119
361,362,2840,1552,2453,166.912,40.9095,49.0905,99.98
362,363,15129,2969,2532,24.2718,86.329,3.67104,97.8925
363,364,21112,2237,2509,166.97799999999995,46.0676,43.9324,99.8847
364,365,592,1487,2451,170.072,41.8125,48.1875,99.987
365,366,1040,913,2469,177.24900000000005,60.897,29.103,99.9821
366,367,2059,2124,2475,281.565,79.6085,10.3915,99.9763
367,368,34459,1438,2626,156.22299999999996,23.5558,66.4442,99.9272
368,369,715,3300,2481,168.976,47.0207,42.9793,99.8075
369,370,24250,326,2570,322.567,53.7522,36.2478,99.4621
370,371,74729,700,2608,333.168,46.6583,43.3417,99.8986
371,372,36220,221,2654,333.342,68.1285,21.8715,99.9938
372,373,41465,3099,2617,340.9840000000001,30.1892,59.8108,80.9832
373,374,4208,99,2599,332.97,68.6785,21.3215,99.9474
374,375,1347,2183,2573,331.094,68.3624,21.6376,99.9934
375,376,1015,2896,2577,340.511,65.4338,24.5662,99.7196
376,377,5721,2257,2596,328.487,44.5654,45.4346,99.9967
377,378,2217,1095,2599,177.97099999999998,70.708,19.292,99.9625
378,379,1942,2875,2607,177.84799999999996,35.6181,54.3819,99.8867
379,380,18220,2080,2647,183.463,73.2205,16.7795,99.9691
380,381,1416,991,2613,341.759,41.7714,48.2286,99.9653
381,382,27490,3195,2723,176.804,84.484,5.51598,99.8736
382,383,62419,2297,2749,331.4790000000001,74.0133,15.9867,92.3416
383,384,3247,425,2652,174.607,41.0809,48.9191,99.9823
384,385,27486,909,2692,346.362,25.3912,64.6088,99.932
385,386,1507,2387,2666,162.425,71.7819,18.2181,99.9617
386,387,3511,1639,2667,175.65900000000005,74.1251,15.8749,99.9832
387,388,16348,2570,2705,169.18599999999995,73.4243,16.5757,99.9541
388,389,64192,474,2816,339.49300000000005,39.6698,50.3302,99.9652
389,390,3875,97,2761,344.838,31.0422,58.9578,99.7975
390,391,15990,200,2820,341.9840000000001,32.7646,57.2354,99.9203
391,392,2391,747,2723,314.2990000000001,77.3063,12.6938,99.9877
392,393,1263837,2436,3475,173.176,9.52238,80.4776,64.7688
393,394,19249,1512,2795,167.43200000000004,67.1199,22.8801,99.9779
394,395,1961,2721,2774,170.763,67.3731,22.6269,99.9852
395,396,106912,785,2938,339.663,75.8773,14.1227,99.5388
396,397,4395,2532,2796,351.825,54.8678,35.1322,99.9882
397,398,32027,1016,2875,166.00400000000005,33.7177,56.2823,99.8791
398,399,3642,261,2779,351.483,47.6189,42.3811,99.9875
399,400,621,2484,2783,166.62400000000005,72.5739,17.4261,99.9913
400,401,1739,3296,2806,155.188,50.3231,39.6769,99.947
401,402,1937,3265,2808,156.697,48.5825,41.4175,99.9903
402,403,16414,2938,2848,340.05300000000005,60.375,29.625,99.9558
403,404,1552,2348,2828,162.446,46.6314,43.3686,99.9747
404,405,3949,2273,2846,311.529,82.6645,7.33545,99.9814
405,406,8374,145,2898,167.618,46.6198,43.3802,99.9754
406,407,2510,87,2891,164.44099999999997,50.0869,39.9131,99.6299
407,408,2462,2382,2867,331.896,12.8586,77.1414,99.9906
408,409,8798,1130,2907,335.543,55.4177,34.5823,99.9673
409,410,113529,2441,3079,339.156,59.938,30.062,99.5665
410,411,21413,264,2948,171.033,1.7012599999999998,88.2987,99.554
411,412,2326,2837,2906,162.26,35.8097,54.1903,99.9948
412,413,2332,408,2913,170.261,1.27623,88.7238,99.9943
413,414,3730,1227,2919,177.43400000000003,62.9537,27.0463,99.9804
414,415,1123,2970,2931,344.216,27.0312,62.9688,99.9319
415,416,2514,3007,2963,335.851,63.7634,26.2366,99.9342
416,417,1089,2531,2956,165.17,47.1256,42.8744,99.9703
417,418,2325,95,2975,347.6,50.6188,39.3812,99.9639
418,419,2201,2159,2973,170.794,56.4818,33.5182,99.9865
419,420,1972,405,2971,343.73,50.88399999999999,39.116,99.9703
420,421,10757,509,3021,342.146,73.7094,16.2906,99.225
421,422,3446,603,3004,169.09099999999995,55.0091,34.9909,99.858
422,423,1997,1122,3000,181.316,50.0678,39.9322,99.6129
423,424,1444,304,3006,346.259,14.0166,75.9834,99.722
424,425,40022,1280,3132,175.227,72.21300000000002,17.787,99.7881
425,426,18216,282,3051,157.797,51.9777,38.0223,99.9916
426,427,32944,1120,3170,177.46400000000003,72.0256,17.9744,99.8243
427,428,3546,90,3050,156.194,54.7913,35.2087,99.9712
428,429,658,3307,3029,167.84599999999998,54.1891,35.8109,99.9486
429,430,6509,1020,3058,340.487,44.4543,45.5457,99.971
430,431,331774,668,3504,168.293,68.7102,21.2898,61.7921
431,432,6247,601,3098,163.891,44.6062,45.3938,99.9912
432,433,5256,1851,3087,293.231,85.4552,4.5448,99.945
433,434,3950,1951,3111,287.057,85.0414,4.95855,99.8226
434,435,7505,967,3133,177.09799999999996,72.7346,17.2654,99.922
435,436,3229,2717,3120,166.484,23.5363,66.4637,99.764
436,437,3690,1421,3138,171.05,5.63756,84.3624,99.9698
437,438,6807,2050,3129,340.782,34.8798,55.1202,99.9925
438,439,2156,2173,3134,162.797,46.4683,43.5317,99.9984
439,440,8876,1822,3163,337.446,42.7008,47.2992,99.9961
440,441,23875,3151,3184,169.185,37.6108,52.3892,99.9961
441,442,14452,767,3172,223.659,84.8523,5.14775,99.9407
442,443,1147,2133,3155,335.6280000000001,60.3176,29.6824,99.9906
443,444,4565,631,3184,233.705,86.5683,3.43171,99.9743
444,445,41572,1989,3266,171.597,14.4657,75.5343,94.1767
445,446,577,566,3183,250.711,85.49,4.5099800000000005,99.978
446,447,11553,2209,3226,172.33900000000003,42.1177,47.8823,99.9692
447,448,11918,2585,3222,16.9692,76.6761,13.3239,99.9731
448,449,1177,2674,3193,16.9528,75.7154,14.2846,99.9861
449,450,734,1903,3179,171.675,8.75885,81.2411,99.9959
450,451,2619,983,3199,343.249,37.9415,52.0585,99.9906
451,452,1743,1432,3192,174.43900000000005,50.7631,39.2369,99.9816
452,453,4108,2328,3232,331.048,61.3245,28.6755,99.9731
453,454,23097,815,3260,187.636,50.4656,39.5344,99.9816
454,455,4524,1858,3236,171.872,48.714,41.286,99.9895
455,456,30059,598,3310,176.112,8.66235,81.3377,100.006
456,457,1235,1408,3223,335.856,37.1907,52.8093,99.9949
457,458,1364,982,3256,343.141,36.7716,53.2284,99.8944
458,459,1291,2494,3265,164.855,24.7643,65.2357,99.9918
459,460,41412,1023,3390,347.999,1.63565,88.3643,99.8388
460,461,2636,1064,3297,171.923,20.6116,69.3884,99.9691
461,462,4952,2563,3310,337.327,61.1636,28.8364,99.9908
462,463,4475,2494,3323,340.564,25.0959,64.9041,99.9913
463,464,22629,2120,3353,332.32199999999995,63.9112,26.0888,99.9429
464,465,1324,3285,3327,354.1740000000001,2.43092,87.5691,99.9052
465,466,11148,208,3354,154.952,34.6916,55.3084,99.992
466,467,2632,721,3341,314.437,76.9767,13.0233,99.9828
467,468,11726,1221,3383,349.246,2.47676,87.5232,99.9657
468,469,11451,823,3386,339.837,45.6633,44.3367,99.8455
469,470,5416,323,3378,348.6430000000001,8.23217,81.7678,99.9968
470,471,6507,2618,3420,348.536,77.139,12.861,99.9624
471,472,1185,3285,3392,323.982,6.3033800000000015,83.6966,99.0682
472,473,1752,954,3385,180.621,47.8678,42.1322,99.9734
473,474,548,125,3401,160.317,4.34856,85.6514,99.9931
474,475,2271,192,3405,171.68400000000003,0.37999,89.62,99.9833
475,476,29590,1917,3444,339.787,50.4887,39.5113,99.9414
476,477,772,876,3418,341.777,1.39286,88.6071,99.9983
477,478,756,553,3414,333.726,66.0378,23.9622,99.7917
478,479,1262,169,3435,168.43900000000005,1.6602599999999998,88.3397,99.9929
479,480,1153,3285,3439,354.083,4.15573,85.8443,99.8343
480,481,2128,291,3443,323.108,73.6598,16.3402,99.9857
481,482,39009,1268,3544,328.8,62.8408,27.1592,99.3522
482,483,2212,229,3448,153.934,35.3411,54.6589,99.9895
483,484,605,890,3456,341.181,0.340233,89.6598,99.9909
484,485,666,1084,3469,159.971,31.7401,58.2599,99.9929
485,486,9020,116,3544,359.302,86.3761,3.62385,99.7596
486,487,8764,216,3503,0.0631997,85.3479,4.65215,99.5638
487,488,24040,1483,3545,343.05300000000005,47.125,42.875,99.9428
488,489,4250,2315,3514,314.815,64.691,25.309,99.6576
489,490,1232,1101,3508,161.067,0.0486069,89.9514,99.7293
490,491,1004,3280,3522,355.796,3.77473,86.2253,99.9486
491,492,96213,428,3689,348.982,48.7024,41.2976,97.182
492,493,687,2000,3503,337.021,37.0396,52.9604,99.8648
493,494,3425,468,3547,337.202,61.5825,28.4175,99.9827
494,495,5168,229,3571,26.4272,88.5204,1.4796200000000002,98.9349
495,496,952,1061,3543,160.612,5.14848,84.8515,99.9975
496,497,887,1099,3555,160.55200000000005,5.02467,84.9753,99.9957
497,498,15644,1631,3654,161.44,34.4567,55.5433,99.9992
498,499,1639,76,3624,340.94699999999995,45.5183,44.4817,99.6697
499,500,63588,1352,3748,161.371,26.2153,63.7847,99.2761
500,501,666,3273,3635,355.18,0.668999,89.331,99.9692
501,502,2058,106,3646,344.134,41.78,48.22,99.8759
502,503,13921,215,3666,159.269,2.2970900000000003,87.7029,99.8977
503,504,4680,204,3718,168.884,0.260422,89.7396,99.9525
504,505,685,286,3703,350.523,0.251549,89.7485,99.9683
505,506,890,3273,3708,355.36300000000006,0.310867,89.6891,99.9715
506,507,2557,3108,3727,2.67295,2.79211,87.2079,99.9713
507,508,8314,1633,3766,165.13,54.3327,35.6673,99.9977
508,509,97089,1609,3925,159.582,9.87544,80.1246,78.9651
509,510,1040,3275,3748,355.228,0.501038,89.499,99.962
510,511,13231,556,3792,339.3180000000001,27.7845,62.2155,99.9861
511,512,3051,3042,3770,348.2990000000001,43.3945,46.6055,99.9845
512,513,4515,164,3791,192.073,75.7436,14.2564,99.9977
513,514,2236,1169,3794,318.658,60.3144,29.6856,99.9849
514,515,100524,701,4023,349.945,52.5957,37.4043,62.4635
515,516,104531,198,4043,337.171,62.1091,27.8909,92.416
516,517,1080,1701,3826,345.149,25.2556,64.7444,99.9952
517,518,1012,599,3842,156.70600000000005,51.1426,38.8574,99.9884
518,519,35007,455,3962,165.18200000000004,53.8528,36.1472,99.954
519,520,20049,1203,3914,344.05300000000005,59.9305,30.0695,99.9609
520,521,65448,2089,4101,337.047,86.7934,3.2065900000000003,98.6961
521,522,3550,569,3882,338.9430000000001,43.8776,46.1224,99.9967
522,523,1648,378,3885,175.05700000000004,77.0073,12.9927,99.905
523,524,3743,3084,3906,166.203,53.00899999999999,36.991,99.9654
524,525,17621,2289,3978,152.80100000000004,85.0685,4.93151,99.4537
525,526,155421,2724,4154,339.7630000000001,29.0064,60.9936,99.9176
526,527,799,3269,3928,355.539,0.879044,89.12100000000002,99.9407
527,528,5485,1010,3953,181.673,83.2873,6.712739999999998,99.9799
528,529,2104,3126,3945,164.65400000000002,52.7433,37.2567,99.9474
529,530,543,575,3938,165.315,75.2624,14.7376,99.992
530,531,382123,1270,4350,345.5,16.1183,73.8817,92.6707
531,532,12170,1311,4011,241.271,79.2422,10.7578,98.5748
532,533,90728,3080,4205,178.049,1.24017,88.7598,100.024
533,534,9432,3208,4028,162.249,32.8963,57.1037,99.9196
534,535,2144,3267,3990,160.526,31.3113,58.6887,99.8513
535,536,5152,2856,3996,161.407,49.5959,40.4041,99.9348
536,537,570,1894,3998,159.09799999999996,78.9199,11.0801,99.9928
537,538,2229,1958,4023,166.072,50.9613,39.0387,99.5072
538,539,1130,2793,4014,355.162,2.76471,87.2353,99.9881
539,540,70501,1941,4275,165.59099999999995,35.8224,54.1776,93.1821
540,541,2241,2749,4050,159.655,23.2429,66.7571,99.9662
541,542,1420,2378,4044,158.52700000000004,49.8669,40.1331,99.9827
542,543,2376,702,4091,157.991,53.6113,36.3887,99.9855
543,544,16789,911,4127,348.845,87.6372,2.36281,99.9531
544,545,3193,649,4080,306.31,82.1915,7.80855,99.9826
545,546,1157,2344,4074,345.533,47.2822,42.7178,99.9523
546,547,505,995,4085,331.85,84.8563,5.1437300000000015,99.7491
547,548,2943,2981,4092,338.2530000000001,73.58800000000002,16.412,99.9865
548,549,6916,2410,4119,165.24400000000003,20.6292,69.3708,99.9238
549,550,16165,1304,4138,238.122,83.1802,6.819839999999999,99.9599
550,551,1565,2253,4112,350.713,87.2901,2.70986,99.9885
551,552,1847,2315,4120,325.443,86.2387,3.76132,99.9922
552,553,5016,2510,4142,330.99,68.0131,21.9869,99.8215
553,554,9320,623,4208,155.532,22.955,67.045,99.8665
554,555,1551,1036,4153,249.698,82.37899999999998,7.621,99.9787
555,556,5582,2642,4152,150.495,10.343,79.657,99.9933
556,557,1143,2222,4138,341.892,12.4196,77.5804,99.9944
557,558,14218,704,4193,178.919,75.4934,14.5066,99.9639
558,559,17071,2446,4234,300.551,82.2836,7.71638,99.8751
559,560,17331,377,4202,352.564,5.1586,84.8414,99.9091
560,561,5162,1100,4191,173.37,44.7357,45.2643,99.995
561,562,81365,2265,4328,169.804,11.8912,78.1088,99.9679
562,563,517,2921,4178,175.86700000000005,0.714378,89.2856,99.9276
563,564,1500,3247,4186,0.501026,28.4705,61.5295,99.9858
564,565,1391,2571,4193,344.142,50.713,39.287,99.9888
565,566,12037,2638,4240,339.084,69.1203,20.8797,99.9282
566,567,22994,813,4323,342.031,40.5483,49.4517,99.9082
567,568,24341,988,4257,180.672,75.9277,14.0723,99.8998
568,569,5662,300,4240,235.943,77.9326,12.0674,99.9931
569,570,717,376,4242,186.466,70.7391,19.2609,99.7138
570,571,2303,3232,4295,55.3869,82.4235,7.57647,99.977
571,572,1433,2580,4271,354.519,4.2128,85.7872,99.992
572,573,6700,313,4293,174.32299999999995,71.0009,18.9991,99.22
573,574,17350,1710,4330,357.977,2.01,87.99,99.9901
574,575,6362,565,4312,160.203,52.9911,37.0089,99.9844
575,576,6299,1843,4337,344.731,18.9477,71.0523,99.7019
576,577,790,2064,4287,343.741,53.9412,36.0588,99.9881
577,578,3935,3187,4349,66.7977,84.0672,5.93283,99.9664
578,579,775,74,4323,309.226,82.5246,7.47543,99.9351
579,580,932,171,4305,159.649,17.7786,72.2214,99.9892
580,581,14622,2612,4348,177.77,56.1212,33.8788,99.9938
581,582,816,677,4312,345.0030000000001,39.5693,50.4307,99.9868
582,583,1251,349,4320,170.37599999999995,9.58691,80.4131,99.9306
583,584,33696,608,4444,191.989,54.8863,35.1137,99.8386
584,585,758,3243,4340,54.0174,82.6744,7.32555,99.947
585,586,5923,260,4352,349.327,26.3384,63.6616,99.8532
586,587,686,506,4330,181.794,68.5514,21.4486,99.9804
587,588,13801,449,4389,347.747,11.2585,78.7415,85.0348
588,589,8079,180,4377,166.078,72.2643,17.7357,99.989
589,590,3330,630,4352,348.9890000000001,41.61,48.39,99.9839
590,591,15826,1675,4466,156.173,66.5534,23.4466,95.362
591,592,4550,104,4380,170.291,72.1082,17.8918,99.9506
592,593,4452,1066,4367,152.49200000000005,1.42755,88.5724,99.9933
593,594,687,2517,4379,346.30800000000005,6.73959,83.2604,99.9233
594,595,1290,2473,4387,258.699,83.0918,6.90825,99.989
595,596,17467,1807,4417,343.541,44.8946,45.1054,99.9262
596,597,3257,3240,4402,166.424,26.2675,63.7325,99.8154
597,598,100329,331,4571,162.636,31.2089,58.7911,95.8636
598,599,4714,791,4422,168.759,30.2385,59.7615,99.9795
599,600,1365,2688,4423,283.698,86.2341,3.76593,99.9969
600,601,1207,2505,4420,332.74300000000005,60.7682,29.2318,99.9683
601,602,60247,2728,4536,337.017,84.7986,5.20144,98.22
602,603,2995,2446,4434,343.5780000000001,11.6563,78.3437,99.974
603,604,8105,3151,4483,183.359,0.559433,89.4406,99.9487
604,605,15908,3029,4473,348.474,42.2336,47.7664,99.9829
605,606,34998,1905,4518,339.501,30.1741,59.8259,99.8299
606,607,4928,3245,4481,350.515,21.8766,68.1234,99.8944
607,608,1982,105,4457,350.191,16.4205,73.5795,99.4306
608,609,1535,574,4469,339.559,51.6437,38.3563,99.9841
609,610,17348,2450,4511,224.178,78.9567,11.0433,98.6566
610,611,873,446,4467,164.99599999999995,29.3704,60.6296,99.9919
611,612,1217,3202,4498,350.496,21.666,68.334,99.9939
612,613,13465,726,4515,171.605,10.787,79.21300000000002,86.4635
613,614,2473,866,4511,157.719,18.4893,71.5107,99.9327
614,615,1933,75,4536,175.34,6.22002,83.78,99.8858
615,616,1871,120,4522,336.91,50.4346,39.5654,99.6263
616,617,1319,2327,4509,345.732,7.55801,82.44200000000002,99.9783
617,618,27849,2184,4584,346.8119999999999,28.2198,61.7802,99.8615
618,619,50273,1326,4636,173.50099999999995,63.2586,26.7414,99.9297
619,620,6557,838,4580,346.0080000000001,27.0777,62.9223,99.9556
620,621,2004,2312,4561,177.884,34.3591,55.6409,99.9401
621,622,6067,1607,4572,174.32,65.2978,24.7022,99.9901
622,623,5340,3183,4571,342.293,20.8572,69.1428,99.9573
623,624,12037,3052,4580,159.043,34.2811,55.7189,99.9733
624,625,2057,769,4591,174.55599999999995,18.7636,71.2364,99.9963
625,626,21426,591,4677,175.078,20.972,69.028,99.672
626,627,592,1977,4563,189.068,85.1008,4.89917,99.9903
627,628,6673,698,4601,345.659,28.927,61.073,99.9947
628,629,515,1827,4578,173.768,81.1823,8.81766,99.989
629,630,34978,2457,4683,358.085,33.1142,56.8858,85.15700000000002
630,631,1439,1666,4605,340.73,13.5261,76.4739,99.9892
631,632,22714,1923,4692,162.938,32.8903,57.1097,99.9722
632,633,7962,1557,4628,167.679,73.0506,16.9494,99.9417
633,634,1725,2026,4602,183.129,84.8559,5.14407,99.965
634,635,1300,124,4610,347.681,43.6816,46.3184,99.9957
635,636,4134,1725,4619,183.406,71.4852,18.5148,99.9955
636,637,1541,2345,4615,166.13299999999995,54.932,35.068000000000005,98.0078
637,638,4688,1810,4629,164.55,42.0149,47.9851,99.9967
638,639,28890,3015,4678,184.433,5.3411300000000015,84.6589,99.8994
639,640,30696,2732,4695,7.40285,49.0283,40.9717,99.9797
640,641,12006,3171,4712,183.388,5.61984,84.3802,99.9323
641,642,26212,2155,4685,339.376,52.0974,37.9026,99.8983
642,643,634,3263,4636,157.661,3.76333,86.2367,99.2634
643,644,2601,177,4658,156.779,45.8389,44.1611,99.9836
644,645,5546,95,4700,166.765,74.7449,15.2551,99.9433
645,646,3998,142,4684,166.94400000000005,73.2955,16.7045,99.9982
646,647,24764,745,4732,123.872,85.5952,4.4047800000000015,99.7811
647,648,25691,1654,4724,310.572,79.462,10.538,99.9336
648,649,788,1764,4666,340.523,26.1206,63.8794,99.9875
649,650,1601,2587,4676,166.22400000000005,30.6765,59.3235,99.994
650,651,14249,1469,4707,340.829,45.9871,44.0129,99.978
651,652,1075,1818,4678,156.812,72.003,17.997,99.9808
652,653,3797,2349,4700,168.787,7.67714,82.3229,99.9953
653,654,1719,3260,4697,332.69199999999995,74.7721,15.2279,99.8956
654,655,1782,1785,4710,164.128,40.9543,49.0457,99.9868
655,656,819,792,4718,45.7583,86.6077,3.39226,99.9939
656,657,13446,257,4743,341.44199999999995,41.4391,48.5609,99.9672
657,658,1059,2571,4713,292.265,81.045,8.95503,99.9926
658,659,8084,491,4766,344.101,52.598,37.402,99.9276
659,660,1699,2062,4754,167.87099999999995,61.2775,28.7225,99.9944
660,661,742,2603,4738,167.15,31.8859,58.1141,99.9949
661,662,1517,2827,4746,172.032,5.1748400000000006,84.8252,99.9719
662,663,1585,2138,4753,174.328,60.2175,29.7825,99.9926
663,664,832,2941,4758,183.6,2.79464,87.2054,99.9247
664,665,4532,2852,4775,171.412,3.98571,86.0143,99.9745
665,666,604,378,4760,342.16,51.6761,38.3239,99.6743
666,667,6784,1360,4773,174.658,64.656,25.344,99.8899
667,668,4923,2223,4768,335.6230000000001,56.0143,33.9857,99.91
668,669,775,1999,4757,335.8730000000001,56.6254,33.3746,99.9916
669,670,12223,2574,4792,355.851,48.75899999999999,41.24100000000001,99.9181
670,671,1149,1918,4764,152.201,71.5489,18.4511,99.9575
671,672,4145,948,4788,165.988,24.1178,65.8822,99.9049
672,673,1284,155,4776,337.496,46.0325,43.9675,99.7979
673,674,755,1127,4769,348.38699999999994,4.05052,85.9495,99.9982
674,675,2164,2019,4785,334.899,58.0089,31.9911,99.9282
675,676,1192,1190,4781,179.28599999999997,60.8703,29.1297,99.895
676,677,936,1056,4779,165.66099999999997,25.0501,64.9499,99.957
677,678,1690,319,4785,340.975,42.0712,47.9288,99.9657
678,679,2203,2714,4791,8.25029,51.908,38.092,99.959
679,680,612,3064,4782,184.356,2.32337,87.6766,99.9755
680,681,1130,3140,4787,336.207,75.0332,14.9668,99.8419
681,682,4631,2951,4797,352.7530000000001,40.1583,49.8417,99.8527
682,683,940,2690,4821,348.48,46.9064,43.0936,99.9286
