,Grain No.,Size [Pixel],center x-coordinate,center y-coordinate,mean azimuth [degree],mean latitude [degree],mean colatitude [degree],Regelungsgrad [%]
0,1,767,1496,147,311.393,2.23029,87.7697,97.2775
1,2,7247,2792,168,86.4191,17.0324,72.9676,99.7924
2,3,36774,2554,222,69.5551,57.4219,32.5781,99.7332
3,4,675,1519,163,118.953,15.3592,74.6408,99.6193
4,5,50003,3016,255,262.913,28.3026,61.6974,99.1887
5,6,3226,1987,196,82.2203,27.6618,62.3382,98.8668
6,7,1136,2266,170,276.29,42.8635,47.1365,99.8875
7,8,526,1771,159,72.2054,23.894,66.10600000000001,99.7823
8,9,1096,2220,192,90.9934,21.4506,68.5494,99.9732
9,10,533,663,176,291.628,4.56307,85.4369,99.8885
10,11,22382,732,271,273.288,15.3345,74.6655,99.6309
11,12,6746,2376,207,275.175,48.7514,41.2486,99.9726
12,13,4214,2072,221,85.4367,13.9466,76.0534,99.952
13,14,887,3189,189,92.5295,11.9174,78.0826,99.9257
14,15,15288,478,271,264.914,14.9541,75.0459,99.417
15,16,583,2108,182,305.32,85.0491,4.9508800000000015,99.9594
16,17,6865,371,221,82.4271,31.4487,58.5513,99.7117
17,18,13836,1668,232,87.1178,34.056,55.944,99.8522
18,19,13511,1475,295,75.814,66.7839,23.2161,99.8901
19,20,16339,1847,250,277.928,71.9655,18.0345,99.9743
20,21,6312,3211,248,76.8627,24.0718,65.9282,99.946
21,22,19836,2168,281,73.0598,61.4011,28.5989,99.9569
22,23,5416,2708,239,100.214,44.6885,45.3115,99.8672
23,24,13858,973,243,211.33,84.8548,5.14525,99.788
24,25,5162,2310,259,261.395,32.3435,57.6565,99.9497
25,26,1120,2770,219,276.928,56.4828,33.5172,99.9965
26,27,14778,1359,292,83.2301,30.8888,59.1112,99.9773
27,28,1090,1180,218,99.3364,48.6269,41.3731,99.9809
28,29,3319,607,229,283.982,58.5641,31.4359,99.9407
29,30,715,1441,217,87.079,39.7222,50.2778,99.9856
30,31,4076,273,234,137.634,87.7953,2.2046900000000003,99.9298
31,32,1057,2260,225,265.695,30.5517,59.4483,99.995
32,33,779,1237,217,96.1258,8.81427,81.1857,99.9829
33,34,859,526,222,95.6053,55.9148,34.0852,99.8783
34,35,4406,2844,240,87.1269,16.4065,73.5935,99.973
35,36,581,1757,235,273.333,49.4114,40.5886,99.9969
36,37,3390,2035,265,306.791,84.1415,5.85853,99.9827
37,38,1044,1227,238,95.7371,8.85108,81.1489,99.9879
38,39,3971,1161,261,99.4206,9.31844,80.6816,99.9778
39,40,1022,1416,251,89.8718,15.8276,74.1724,99.9878
40,41,748,1257,253,272.24,52.4701,37.5299,99.9967
41,42,4521,203,285,92.1829,44.6118,45.3882,99.9818
42,43,24889,1091,335,90.0256,12.4566,77.5434,99.892
43,44,8066,606,294,96.3562,55.5096,34.4904,99.9742
44,45,62785,2334,421,92.9809,22.2136,67.7864,99.852
45,46,12361,2782,322,274.99,59.0608,30.9392,99.9724
46,47,4999,3239,317,263.032,53.1762,36.8238,99.9856
47,48,3961,1535,299,87.6475,63.027,26.973000000000006,99.9597
48,49,1453,1216,290,66.6408,74.756,15.244000000000002,99.9798
49,50,14279,2002,354,95.787,38.4409,51.5591,99.3187
50,51,20095,851,352,263.183,4.68811,85.3119,99.8241
51,52,12848,1282,337,264.431,0.713676,89.2863,99.9825
52,53,837,1602,284,247.217,80.8126,9.18737,99.9871
53,54,524,338,285,256.958,10.9273,79.0727,99.9334
54,55,18212,266,370,82.4783,51.1281,38.8719,99.4651
55,56,1158,1739,301,10.4635,79.4436,10.5564,99.9899
56,57,23822,420,429,265.941,11.6668,78.3332,86.7683
57,58,1099,2262,311,283.785,69.7419,20.2581,99.9496
58,59,3729,3134,330,94.976,44.7549,45.2451,99.9665
59,60,2982,1662,312,18.6203,81.4793,8.520660000000001,99.9885
60,61,19913,2627,380,263.754,32.9725,57.0275,99.9409
61,62,3990,1586,342,94.335,61.9855,28.0145,99.9758
62,63,6161,2497,357,77.0218,63.2054,26.7946,99.7733
63,64,619,1781,323,88.4892,71.1201,18.8799,99.9981
64,65,6243,160,382,269.534,28.4346,61.5654,99.9983
65,66,1864,1894,349,266.665,71.6196,18.3804,99.9951
66,67,22901,3158,465,97.8639,48.3672,41.6328,99.5866
67,68,1149,2897,349,92.652,49.8235,40.1765,99.9864
68,69,3035,918,390,93.1558,38.674,51.326,99.9567
69,70,3425,525,372,89.7305,13.2135,76.7865,99.5595
70,71,7348,2114,389,97.6299,56.18,33.82,99.9781
71,72,3604,1653,370,95.8121,11.767,78.233,99.9636
72,73,12637,660,412,89.2718,20.6839,69.3161,99.9664
73,74,3345,2932,385,79.7105,35.9793,54.0207,99.9879
74,75,2282,1862,392,95.707,71.9344,18.0656,99.9851
75,76,868,1928,379,83.05,12.0368,77.9632,99.993
76,77,1441,1554,385,132.556,83.4713,6.5286800000000005,99.9825
77,78,10339,3246,473,98.5439,49.3072,40.6928,99.6931
78,79,748,1205,392,265.04400000000004,52.088,37.912,99.9971
79,80,583,1007,406,268.445,4.79269,85.2073,98.9995
80,81,3772,2732,420,101.599,47.7386,42.2614,99.9779
81,82,2945,3016,411,285.357,59.3044,30.6956,99.6343
82,83,7347,2880,427,281.887,77.0276,12.9724,99.9786
83,84,3609,1674,410,95.2112,11.9889,78.0111,99.9704
84,85,8221,1803,461,94.126,22.8455,67.1545,99.975
85,86,6424,518,444,257.371,71.2628,18.7372,99.9257
86,87,6286,1892,437,96.8563,72.182,17.817999999999994,99.9946
87,88,12810,1426,476,83.0554,27.4991,62.5009,99.8954
88,89,12065,2555,491,273.391,38.328,51.672,99.4485
89,90,1185,1327,423,86.4728,31.2626,58.7374,99.9812
90,91,2259,1370,434,80.6295,74.1445,15.8555,99.9662
91,92,1454,1561,421,134.96200000000002,83.2346,6.765439999999999,99.9863
92,93,3703,1265,429,265.28,0.469566,89.5304,99.9831
93,94,52511,238,631,79.2339,53.5096,36.4904,99.3456
94,95,128279,1073,669,96.7177,23.3841,66.6159,99.2923
95,96,2308,1020,441,270.377,4.8903,85.1097,99.2891
96,97,29444,2128,511,105.943,58.2656,31.7344,98.7494
97,98,2310,439,441,97.0322,31.4222,58.5778,99.9883
98,99,2879,932,442,93.957,37.0374,52.9626,99.9584
99,100,13964,1532,528,279.44,33.3663,56.6337,99.3783
100,101,2959,1724,455,106.168,68.7298,21.2702,99.9117
101,102,634,2773,442,99.7483,45.1563,44.8437,99.9861
102,103,603,126,451,81.3311,46.6106,43.3894,99.97
103,104,3859,1107,455,270.277,0.943359,89.0566,99.982
104,105,12223,2011,552,98.3811,56.3263,33.6737,99.0641
105,106,13612,210,509,270.871,27.4864,62.5136,99.9768
106,107,5997,836,475,264.807,3.91308,86.0869,99.956
107,108,1316,3153,461,231.456,79.145,10.855,99.9934
108,109,1086,2986,487,268.325,78.7812,11.2188,99.8267
109,110,998,2685,460,270.791,44.1112,45.8888,99.9828
110,111,3255,2842,473,255.565,32.5066,57.4934,99.9641
111,112,10479,703,480,87.9952,21.1464,68.8536,99.9451
112,113,13854,2732,534,270.439,38.3366,51.6634,99.575
113,114,861,3055,470,258.468,80.5296,9.47044,99.9864
114,115,1083,1673,477,92.7143,25.0136,64.9864,99.9881
115,116,13594,898,577,278.401,38.5841,51.4159,99.8515
116,117,2637,125,515,89.2568,27.3136,62.6864,99.9574
117,118,9830,1710,538,97.5859,47.5195,42.4805,99.3519
118,119,14261,612,551,270.75,21.5709,68.4291,99.9314
119,120,7988,1602,525,95.021,11.6781,78.3219,99.9799
120,121,2574,1933,507,91.1406,40.7683,49.2317,99.8046
121,122,8594,3073,538,73.7463,6.76213,83.2379,99.7918
122,123,5357,88,579,266.138,37.6584,52.3416,99.8574
123,124,2171,1864,520,86.7247,14.6318,75.3682,99.9801
124,125,49235,2397,630,263.64,14.9106,75.0894,98.6341
125,126,613,2648,510,271.061,46.8374,43.1626,99.9911
126,127,1229,2851,530,248.188,79.6672,10.3328,99.6046
127,128,21308,717,625,266.244,52.0777,37.9223,99.9749
128,129,3475,1370,552,87.2216,25.2809,64.7191,99.9885
129,130,688,1310,525,49.1189,69.8198,20.1802,99.8708
130,131,2104,2936,554,84.5883,21.0882,68.9118,99.8655
131,132,728,418,553,81.1214,27.4605,62.5395,99.9893
132,133,756,1796,546,90.8952,15.8565,74.1435,99.9947
133,134,1473,1892,572,90.0967,29.7056,60.2944,99.9396
134,135,3643,2887,591,282.529,53.085,36.915,99.5939
135,136,2482,839,563,344.885,81.2351,8.76493,99.9908
136,137,8609,1308,602,256.921,39.3106,50.6894,99.9694
137,138,1935,2797,561,86.4768,21.571,68.429,99.9661
138,139,41304,1745,694,95.0932,28.9697,61.0303,99.8673
139,140,2304,3045,588,280.07,66.0514,23.9486,99.9768
140,141,765,1415,578,315.349,87.9112,2.08877,99.9913
141,142,19563,420,642,267.386,27.3532,62.6468,99.7867
142,143,12934,1607,638,279.651,53.3064,36.6936,99.9651
143,144,2394,2143,595,279.617,38.7866,51.2134,99.9953
144,145,9121,2648,630,98.0572,49.4514,40.5486,99.9846
145,146,13182,2970,656,87.5088,65.9147,24.0853,99.8327
146,147,503,2828,594,273.269,52.0428,37.9572,99.9721
147,148,3333,2774,614,91.7922,58.9684,31.0316,99.995
148,149,9606,3167,663,92.1326,10.0617,79.9383,99.9475
149,150,27566,553,717,91.5443,39.9944,50.0056,99.8067
150,151,12536,1989,685,277.165,43.3768,46.6232,99.254
151,152,967,1925,622,86.9674,52.1834,37.8166,99.9982
152,153,911,2174,630,274.178,39.8984,50.1016,99.9963
153,154,8199,2564,690,93.0255,12.9238,77.0762,99.9525
154,155,4282,1894,665,88.3926,55.2144,34.7856,99.9913
155,156,792,2840,651,86.5498,22.3367,67.6633,99.9916
156,157,4888,1459,679,269.202,0.208878,89.7911,99.6958
157,158,3291,819,667,334.251,87.3461,2.65391,99.9346
158,159,872,2215,648,273.79,40.2729,49.7271,99.9905
159,160,5111,2161,680,94.0224,58.0462,31.9538,99.9907
160,161,953,2730,654,264.133,26.9228,63.0772,99.986
161,162,556,2762,660,277.622,51.4425,38.5575,99.9903
162,163,2709,766,686,280.913,48.4999,41.5001,99.9851
163,164,3681,1318,684,279.528,4.75994,85.2401,99.9873
164,165,1644,1526,676,273.086,13.0258,76.9742,99.9904
165,166,1203,2880,675,90.9219,64.30199999999999,25.698,99.9936
166,167,11856,3073,720,267.48900000000003,9.30878,80.6912,99.9505
167,168,3504,2070,690,101.686,61.2144,28.7856,99.9786
168,169,6087,1334,710,96.356,10.311,79.689,99.8544
169,170,548,3251,676,271.765,38.3515,51.6485,99.9594
170,171,538,892,682,319.93,88.1311,1.86891,99.9937
171,172,1428,2637,699,80.8029,63.4868,26.5132,99.9936
172,173,20124,2880,801,97.8929,66.7781,23.2219,99.8889
173,174,46374,2711,822,87.6351,9.63329,80.3667,99.8992
174,175,1082,3219,712,270.855,38.0316,51.9684,99.9963
175,176,1796,434,717,289.9840000000001,66.6141,23.3859,99.9849
176,177,520,1419,710,94.5909,28.0326,61.9674,99.7463
177,178,10284,1568,761,96.1798,11.5066,78.4934,99.9009
178,179,11609,2211,772,93.9328,51.5787,38.4213,99.9248
179,180,1309,1501,726,105.569,25.7611,64.2389,99.2822
180,181,13791,2422,761,254.873,24.3932,65.6068,99.8932
181,182,2132,2126,723,90.2651,45.4906,44.5094,99.9959
182,183,59413,1942,855,268.253,39.764,50.236,99.5402
183,184,1175,1927,729,272.564,41.7311,48.2689,99.9892
184,185,10371,304,766,266.11,32.2623,57.7377,99.9911
185,186,601,785,723,274.745,53.3585,36.6415,99.9969
186,187,1301,3255,742,270.86400000000003,38.2452,51.7548,99.9203
187,188,8631,793,765,305.211,87.219,2.78098,99.9718
188,189,5025,2609,781,265.409,27.7149,62.2851,99.946
189,190,8117,2084,783,265.905,18.1668,71.8332,99.9754
190,191,153722,1415,988,92.6231,15.9049,74.0951,99.2385
191,192,8932,2531,807,271.173,15.2957,74.7043,99.5587
192,193,12957,436,822,280.464,59.8286,30.1714,99.9311
193,194,52315,3090,875,253.504,69.16199999999999,20.838,99.6065
194,195,1851,89,787,265.619,44.49800000000001,45.502,99.9845
195,196,16774,280,858,89.2879,29.2486,60.7514,99.9698
196,197,1068,2313,783,324.027,79.8827,10.1173,99.964
197,198,2027,128,797,267.561,31.9472,58.0528,99.9983
198,199,4797,665,825,88.7683,16.7847,73.2153,99.9825
199,200,2350,2139,853,274.53,38.8278,51.1722,99.9437
200,201,5146,574,833,276.375,72.3135,17.6865,99.9852
201,202,31976,2405,933,81.956,1.80286,88.1971,99.5123
202,203,9235,169,891,266.74,43.7459,46.2541,99.7325
203,204,24549,820,933,245.402,85.1541,4.84586,98.2165
204,205,64406,1056,1015,270.338,45.1037,44.8963,99.4207
205,206,677,2454,831,88.7408,56.9665,33.0335,99.9671
206,207,13053,1674,891,98.4832,71.2755,18.7245,99.9744
207,208,7880,2254,917,85.4839,1.06552,88.9345,99.9386
208,209,3796,2474,876,90.7696,36.0992,53.9008,99.2204
209,210,26912,511,957,93.6341,50.1112,39.8888,72.3283
210,211,3013,2566,888,272.755,0.148758,89.8512,99.9772
211,212,65456,1811,1039,87.5018,11.7413,78.2587,99.8803
212,213,2750,619,893,89.6025,18.6611,71.3389,99.9949
213,214,846,371,881,267.365,41.1791,48.8209,99.9871
214,215,22141,674,975,256.069,77.4797,12.5203,98.8878
215,216,8620,2765,938,259.556,60.0708,29.9292,99.9832
216,217,674,354,900,268.371,41.2369,48.7631,99.9969
217,218,4295,104,928,266.058,14.6748,75.3252,99.9887
218,219,1141,2181,912,276.81,38.7577,51.2423,99.9918
219,220,9202,340,980,260.63,40.85,49.15,99.8909
220,221,1392,2153,946,99.4693,49.1839,40.8161,99.9883
221,222,8698,2865,991,243.667,77.7567,12.2433,99.8913
222,223,2152,2565,948,122.844,85.8625,4.1374900000000014,99.9813
223,224,59254,2115,1111,93.2703,19.4046,70.5954,99.8038
224,225,11213,2242,1012,269.05400000000003,32.191,57.809,99.8323
225,226,3297,3164,961,271.678,47.0369,42.9631,99.9912
226,227,3265,3212,984,94.0864,47.4198,42.5802,99.9584
227,228,4078,188,1016,85.5329,24.3608,65.6392,99.8782
228,229,9078,273,1032,88.4588,35.6635,54.3365,99.8519
229,230,15356,2992,1028,170.028,86.5638,3.43621,98.6774
230,231,1667,136,983,265.509,12.3216,77.6784,99.975
231,232,1901,2788,986,86.4327,10.3375,79.6625,99.9926
232,233,638,467,993,91.6094,37.8981,52.1019,99.7968
233,234,626,3267,1012,85.0554,1.92303,88.07700000000001,99.9254
234,235,9422,3207,1074,85.706,3.70187,86.2981,99.9768
235,236,3073,2652,1034,279.85200000000003,56.9698,33.0302,98.1433
236,237,1371,3122,1010,94.1257,2.5539400000000003,87.4461,99.9774
237,238,720,803,1002,98.7217,38.2768,51.7232,99.7564
238,239,19683,1209,1123,295.76,62.3299,27.6701,99.7271
239,240,19968,417,1083,263.396,25.901,64.09899999999999,99.8357
240,241,1038,2580,1003,280.948,50.9243,39.0757,99.984
241,242,2472,775,1037,83.7776,10.299,79.70100000000002,99.9618
242,243,19396,173,1098,87.9295,7.65446,82.3455,99.7932
243,244,1144,2687,1042,83.1585,3.10235,86.8977,99.9615
244,245,3484,2758,1043,82.7424,2.93329,87.0667,99.9645
245,246,8594,2330,1081,13.0096,78.5381,11.4619,99.6533
246,247,8134,2421,1100,271.111,34.0481,55.9519,99.9232
247,248,3884,3110,1060,272.18,70.9124,19.0876,98.2314
248,249,14721,1619,1119,286.383,48.0182,41.9818,99.9691
249,250,1758,2544,1060,299.115,48.8978,41.1022,99.5062
250,251,2414,820,1078,272.101,43.3919,46.6081,99.9923
251,252,6968,2681,1121,276.807,11.7502,78.2498,99.9786
252,253,29917,2784,1155,271.407,19.5687,70.4313,99.8945
253,254,984,3256,1097,80.5749,2.752,87.24799999999998,99.6836
254,255,1775,2586,1087,268.843,5.67915,84.3208,99.9895
255,256,1077,871,1069,90.05799999999998,47.3154,42.6846,99.9903
256,257,986,702,1075,84.7578,26.9898,63.0102,99.9902
257,258,8541,2506,1119,294.499,54.6846,35.3154,99.5904
258,259,7882,765,1130,84.8027,15.2835,74.7165,99.9616
259,260,9397,654,1123,83.3963,15.4353,74.5647,99.9375
260,261,775,3121,1089,17.5736,78.7844,11.2156,99.785
261,262,73921,522,1279,290.636,56.3777,33.6223,99.7597
262,263,2146,2631,1110,266.626,5.1279,84.8721,99.9758
263,264,16560,925,1156,82.191,2.88327,87.1167,99.3285
264,265,689,1953,1113,83.1612,29.712,60.288,99.9799
265,266,11161,3053,1156,80.7326,74.2082,15.7918,99.9464
266,267,6414,2945,1153,84.5561,73.3557,16.6443,99.9679
267,268,4191,3147,1155,99.2208,18.6343,71.3657,99.8495
268,269,3911,117,1175,264.709,36.9331,53.0669,99.8761
269,270,7459,294,1175,71.7283,39.1337,50.8663,99.8979
270,271,10220,1948,1203,283.2940000000001,71.8646,18.1354,99.9302
271,272,2114,2321,1147,261.902,13.2638,76.7362,99.9737
272,273,9741,2582,1213,284.034,5.809819999999998,84.1902,99.9733
273,274,527,3253,1153,258.623,30.7073,59.2927,99.7994
274,275,1604,3230,1180,263.91,31.7454,58.2546,99.9074
275,276,15536,716,1236,260.874,47.2676,42.7324,99.987
276,277,1597,1276,1178,260.742,28.0597,61.9403,99.9948
277,278,8302,370,1223,261.206,17.8312,72.1688,99.9897
278,279,1382,2391,1180,92.0606,33.1257,56.8743,99.9472
279,280,15091,1697,1237,265.659,11.0422,78.9578,99.9519
280,281,523,825,1173,74.8378,17.8612,72.1388,99.9974
281,282,4299,1613,1215,90.5358,31.827,58.173,99.9806
282,283,7395,2468,1230,262.42900000000003,7.255730000000002,82.7443,98.6619
283,284,21486,1856,1276,265.766,29.1365,60.8635,99.9651
284,285,6421,842,1230,88.0669,1.12544,88.8746,99.9278
285,286,923,2524,1198,282.847,32.6483,57.3517,99.9749
286,287,8071,1370,1232,256.85200000000003,5.33134,84.6687,99.9731
287,288,1878,2873,1215,265.119,71.0815,18.9186,99.9926
288,289,2124,88,1231,272.684,68.6722,21.3278,99.9475
289,290,4821,2040,1228,92.2521,22.3835,67.6165,99.991
290,291,2906,189,1212,264.337,31.0504,58.9496,99.9987
291,292,995,1542,1216,94.1862,39.6952,50.3048,99.9717
292,293,2850,968,1232,21.2375,88.5046,1.49541,99.9952
293,294,9508,3213,1278,265.951,40.4279,49.5721,99.9629
294,295,3667,1259,1230,76.5399,6.54974,83.4503,99.9854
295,296,5395,3129,1242,100.914,17.3376,72.6624,99.9536
296,297,19743,249,1305,62.7512,72.5819,17.4181,99.9479
297,298,2494,2217,1253,267.60900000000004,14.7407,75.2593,99.9381
298,299,2637,1112,1245,91.2387,42.7836,47.2164,99.9937
299,300,3251,2957,1255,3.08849,85.8783,4.12175,99.8748
300,301,815,2409,1242,263.119,66.806,23.194000000000006,99.9702
301,302,1889,2253,1259,75.3579,71.4795,18.5205,99.9769
302,303,4103,1058,1277,90.2941,43.5662,46.4338,99.9917
303,304,666,1268,1252,264.843,11.9172,78.0828,99.9983
304,305,713,158,1249,80.5977,63.355,26.645,99.9931
305,306,1932,121,1265,85.8444,8.03898,81.961,99.9993
306,307,6320,2853,1282,263.938,52.1718,37.8282,99.9693
307,308,4041,1561,1280,91.3424,39.4631,50.5369,99.9954
308,309,7478,2310,1319,268.816,12.755999999999998,77.244,99.9297
309,310,627,3013,1264,94.718,73.2199,16.7801,99.9912
310,311,15613,1195,1333,262.555,14.3404,75.6596,99.9828
311,312,13436,951,1357,206.364,85.9616,4.0384400000000005,99.9022
312,313,12003,2638,1319,276.511,11.2131,78.7869,99.8935
313,314,5206,2015,1302,69.4597,83.7664,6.233619999999998,99.957
314,315,16181,2767,1349,266.04,15.3434,74.6566,99.8407
315,316,20172,2379,1369,258.455,21.0013,68.9987,99.9696
316,317,5492,2095,1305,96.073,26.4746,63.5254,99.9849
317,318,9342,834,1323,261.49,14.9478,75.0522,99.9931
318,319,3573,2175,1298,87.9489,28.8782,61.1218,99.9932
319,320,17452,1336,1340,75.8892,8.86932,81.1307,99.9803
320,321,3535,1761,1311,86.8295,3.41401,86.586,99.9862
321,322,15101,2516,1368,107.074,59.358,30.642,99.6086
322,323,647,3104,1288,59.9809,84.3945,5.60546,99.9969
323,324,4776,1432,1355,157.387,87.1512,2.84881,99.906
324,325,1610,1609,1310,75.4007,84.33200000000002,5.66801,99.9947
325,326,683,2906,1302,351.0780000000001,86.2967,3.70327,99.9884
326,327,994,3045,1297,277.705,12.4161,77.5839,99.9936
327,328,1073,170,1295,274.593,49.2058,40.7942,99.9744
328,329,2453,3159,1327,263.183,26.2693,63.7307,99.9465
329,330,3447,341,1313,269.79,2.53118,87.4688,99.976
330,331,32313,145,1465,87.1279,44.9831,45.0169,99.927
331,332,7868,1980,1357,269.351,23.1684,66.8316,99.1491
332,333,5013,1070,1335,96.7358,11.8432,78.1568,99.9401
333,334,750,3109,1317,101.966,20.3289,69.6711,99.9922
334,335,24694,694,1400,283.682,50.7946,39.2054,99.9599
335,336,24776,2156,1422,98.5563,27.962,62.038,99.9489
336,337,11784,1676,1385,266.115,39.5758,50.4242,99.963
337,338,3006,3034,1345,289.344,74.4845,15.5155,99.9288
338,339,12706,2927,1389,260.731,1.61657,88.3834,99.797
339,340,1946,1723,1356,89.7733,57.3994,32.6006,99.9938
340,341,3654,3115,1364,286.595,77.8892,12.1108,99.9581
341,342,1105,2245,1356,265.06,36.0527,53.9473,99.9978
342,343,24141,308,1451,76.4789,13.2703,76.7297,99.99
343,344,1414,1778,1374,98.6106,25.4788,64.5212,99.9897
344,345,2868,3219,1383,91.4716,33.0518,56.9482,99.9923
345,346,16724,1159,1447,86.6017,7.21586,82.7841,99.9598
346,347,13012,2651,1417,279.54,68.8925,21.1075,99.9633
347,348,7402,3040,1421,98.7868,19.113,70.887,99.931
348,349,1139,3253,1417,84.6564,11.3025,78.6975,99.9817
349,350,8807,1567,1439,97.1674,26.4279,63.5721,99.9842
350,351,8129,1867,1408,256.558,73.0335,16.9665,99.8585
351,352,9207,3158,1436,267.043,8.38063,81.6194,99.9586
352,353,554,2277,1383,77.9381,85.0591,4.94086,99.9988
353,354,3033,1478,1416,179.61700000000005,85.9122,4.08778,99.94
354,355,1337,1055,1422,240.255,77.1349,12.8651,99.9907
355,356,2240,856,1420,85.3143,8.75077,81.2492,99.975
356,357,4009,2008,1431,95.0678,61.583,28.417,99.7964
357,358,743,1269,1411,84.6096,25.5731,64.4269,99.9867
358,359,2557,921,1441,224.735,76.9962,13.0038,99.9437
359,360,28856,789,1511,82.9584,16.8466,73.1534,99.9265
360,361,740,1774,1424,93.2987,50.6958,39.3042,99.9752
361,362,7291,1343,1447,82.5657,29.7807,60.2193,99.9716
362,363,505,2449,1418,91.8193,43.4463,46.5537,99.87
363,364,3441,1639,1451,111.529,77.1668,12.8332,99.9841
364,365,44239,2819,1568,280.4,58.0109,31.9891,99.0552
365,366,1283,3228,1452,266.125,33.0947,56.9053,99.9937
366,367,5570,2493,1466,102.224,36.995,53.005,99.3119
367,368,1530,1272,1458,92.8071,44.6078,45.3922,99.9827
368,369,6482,2936,1493,255.361,64.2649,25.7351,99.8136
369,370,8183,976,1489,266.77,16.4773,73.5227,99.2491
370,371,1571,2265,1452,98.6348,62.6723,27.3277,99.9864
371,372,15487,1435,1501,87.5242,84.2834,5.71659,99.0919
372,373,933,1088,1469,262.404,32.2546,57.7454,99.9699
373,374,4613,1717,1477,99.1186,51.7303,38.2697,99.811
374,375,6338,1852,1490,99.43,76.3266,13.6734,99.5682
375,376,5012,2448,1505,94.3722,29.2745,60.7255,99.4317
376,377,1590,1906,1464,115.605,66.1261,23.8739,99.9864
377,378,2491,435,1477,264.474,8.116660000000001,81.8833,99.9917
378,379,9315,566,1502,88.4629,50.9178,39.0822,87.2833
379,380,20517,2033,1523,93.0804,67.1479,22.8521,98.8306
380,381,7127,2338,1497,258.49,28.6183,61.3817,99.8446
381,382,1393,1053,1482,270.405,16.8561,73.1439,99.9953
382,383,3806,2597,1501,283.108,18.5687,71.4313,99.9854
383,384,2134,3100,1494,106.757,51.8709,38.1291,99.9784
384,385,1260,3274,1494,84.8052,12.6736,77.3264,99.9143
385,386,10911,1771,1541,88.5508,23.694000000000006,66.306,99.9256
386,387,5069,3162,1533,95.0207,36.7001,53.2999,99.2499
387,388,3800,3030,1503,276.876,12.3839,77.6161,99.9807
388,389,3909,376,1524,270.839,38.3436,51.6564,99.9478
389,390,2089,3226,1514,82.8805,26.6293,63.3707,99.9904
390,391,12055,1137,1566,272.975,8.91347,81.0865,99.9578
391,392,12737,1569,1561,30.7346,78.0736,11.9264,99.1142
392,393,3569,2534,1536,106.706,33.9534,56.0466,99.4444
393,394,23455,1734,1631,106.073,44.2653,45.7347,99.9152
394,395,795,1279,1525,81.605,47.5509,42.4491,99.5372
395,396,126137,404,1861,268.839,25.9838,64.0162,52.5005
396,397,5593,2203,1556,272.183,34.0232,55.9768,99.8381
397,398,10420,2303,1574,80.9203,21.2578,68.7422,99.9281
398,399,42580,273,1646,88.5386,21.4095,68.5905,99.9733
399,400,18040,684,1636,79.2719,33.6711,56.3289,99.958
400,401,50104,1060,1721,87.3545,15.0952,74.9048,99.6342
401,402,553,2429,1532,94.8136,33.3825,56.6175,99.3904
402,403,695,250,1539,270.399,34.4394,55.5606,99.9928
403,404,20577,1913,1614,263.285,10.5487,79.4513,99.6035
404,405,8183,912,1623,267.6,28.0609,61.9391,99.9459
405,406,23689,3117,1680,276.302,65.6194,24.3806,99.7005
406,407,1021,1246,1559,269.52,49.7381,40.2619,99.9969
407,408,18464,3007,1658,267.91900000000004,18.8094,71.1906,99.3569
408,409,2336,625,1579,78.979,48.2171,41.7829,99.9942
409,410,43587,2402,1709,264.13,31.6125,58.3875,99.6931
410,411,4279,2595,1578,295.775,78.8569,11.1431,99.9827
411,412,641,1205,1571,270.43,13.3202,76.6798,99.9778
412,413,49749,1383,1664,266.118,50.2452,39.7548,99.6558
413,414,11395,3202,1647,276.015,64.5079,25.4921,99.9102
414,415,1585,2113,1590,273.242,32.5481,57.4519,99.9863
415,416,509,3257,1603,281.52,70.0309,19.9691,99.9661
416,417,1552,844,1601,268.943,40.0203,49.9797,99.9963
417,418,6133,2180,1634,309.7340000000001,76.6017,13.3983,99.9547
418,419,1598,2509,1613,98.1405,43.00899999999999,46.99100000000001,99.9808
419,420,69090,2645,1788,281.774,19.554,70.446,99.8953
420,421,25128,2050,1696,96.5524,34.4775,55.5225,99.808
421,422,754,2557,1617,284.879,19.9685,70.0315,99.996
422,423,9195,138,1738,256.365,42.1681,47.8319,99.9285
423,424,2259,850,1647,81.1111,33.0862,56.9138,99.9919
424,425,3804,2271,1676,265.582,18.3926,71.6074,99.9874
425,426,6782,739,1697,80.2369,8.75067,81.2493,99.8735
426,427,8735,1173,1697,84.1426,49.2582,40.7418,99.9189
427,428,12130,1596,1711,98.1438,27.0291,62.9709,99.9725
428,429,1980,3256,1696,285.559,64.5304,25.4696,99.7845
429,430,3417,2499,1687,99.4829,39.3953,50.6047,99.7411
430,431,4144,2895,1696,293.722,60.62600000000001,29.374,99.9892
431,432,3835,385,1700,70.7425,41.0952,48.9048,99.9936
432,433,2351,76,1740,262.301,43.6199,46.3801,99.9698
433,434,3343,1692,1718,90.4385,29.3964,60.6036,99.9785
434,435,4013,2194,1716,87.6402,15.1408,74.8592,99.9937
435,436,2821,570,1711,78.8353,49.7147,40.2853,99.9978
436,437,38634,749,1831,88.7519,10.4861,79.5139,99.9489
437,438,8123,961,1751,86.9301,18.0285,71.9715,93.7823
438,439,2884,2810,1753,79.2929,39.0634,50.9366,99.9909
439,440,1158,1913,1729,87.1277,35.5055,54.4945,99.9813
440,441,9904,2902,1772,270.235,17.9771,72.0229,99.9698
441,442,658,1790,1725,87.1901,71.1049,18.8951,99.988
442,443,7215,302,1762,93.1716,8.1255,81.8745,99.7823
443,444,3166,1762,1759,95.1912,70.5026,19.4974,99.9725
444,445,6742,2271,1771,263.217,64.5155,25.4845,99.9736
445,446,6839,399,1767,282.073,71.2302,18.7698,99.9943
446,447,39566,1938,1877,89.9134,25.0677,64.9323,99.3302
447,448,7854,1663,1792,97.1235,12.1302,77.8698,99.9758
448,449,751,880,1753,89.0602,25.3459,64.6541,99.9898
449,450,3519,1211,1776,259.337,20.5054,69.4946,99.9919
450,451,10005,1295,1801,95.0395,29.0128,60.9872,99.9805
451,452,15227,1537,1833,88.6243,52.4417,37.5583,99.9422
452,453,1232,2180,1772,93.6634,38.5137,51.4863,99.9499
453,454,44341,2984,1970,267.535,38.0249,51.9751,99.4105
454,455,689,2117,1779,100.935,51.4831,38.5169,99.9947
455,456,9725,3027,1830,104.824,40.166,49.834,99.9811
456,457,14849,892,1830,86.6438,16.8889,73.1111,99.9703
457,458,1710,2784,1801,67.4507,77.1776,12.8224,99.991
458,459,3634,2502,1833,104.892,31.6368,58.3632,99.9865
459,460,502,1969,1792,265.318,14.6353,75.3647,98.7198
460,461,13867,1402,1875,256.703,18.8879,71.1121,99.9393
461,462,993,2070,1796,274.02,44.2604,45.7396,99.9824
462,463,28800,1756,1885,260.062,20.946,69.054,99.9746
463,464,3649,3195,1828,82.6804,18.2746,71.7254,99.9853
464,465,500,2180,1807,92.3497,40.8457,49.1543,99.9879
465,466,1693,2008,1817,274.35200000000003,45.6658,44.3342,99.9912
466,467,41652,2783,1969,91.4629,16.3824,73.6176,99.8824
467,468,17072,360,1870,98.4817,26.5957,63.4043,99.9854
468,469,3337,1240,1852,59.8201,74.7524,15.2476,99.9886
469,470,2630,2086,1835,99.2623,65.3207,24.6793,99.9813
470,471,2596,2154,1843,92.0364,35.5277,54.4723,99.985
471,472,1266,156,1831,86.7814,40.1569,49.8431,99.9961
472,473,908,260,1831,83.0189,41.3158,48.6842,99.9917
473,474,2163,2326,1845,78.3464,41.964,48.036,99.9623
474,475,664,1350,1836,251.597,75.9534,14.0466,99.9154
475,476,13522,3112,1892,92.2237,18.546,71.454,99.9584
476,477,8581,2240,1859,89.5609,37.0135,52.9865,99.9841
477,478,52102,2521,2060,75.0928,42.976000000000006,47.024,99.6113
478,479,6777,2146,1911,92.3811,34.5633,55.4367,99.9736
479,480,3545,3197,1898,261.942,11.3491,78.6509,99.9916
480,481,30847,919,1976,75.1023,58.8406,31.1594,99.5869
481,482,5562,2371,1905,261.396,49.8498,40.1502,99.9911
482,483,1446,1625,1896,264.286,19.397,70.60300000000002,99.995
483,484,15617,1157,1942,92.0247,47.5036,42.4964,99.8197
484,485,4231,1567,1920,99.5527,26.8472,63.1528,99.9846
485,486,891,3255,1911,263.874,13.8266,76.1734,99.8439
486,487,3848,2657,1956,269.926,21.4027,68.5973,99.9766
487,488,3156,1269,1938,85.9949,50.5627,39.4373,99.9857
488,489,6975,1511,1964,93.011,7.6040100000000015,82.396,99.5609
489,490,6932,647,1977,273.018,0.959221,89.0408,99.9816
490,491,1792,2248,1922,267.964,48.0939,41.9061,99.9965
491,492,7598,2057,1972,96.0376,28.5813,61.4187,99.9283
492,493,665,124,1941,86.8163,32.7667,57.2333,99.9836
493,494,1220,1315,1948,259.478,17.0746,72.9254,99.997
494,495,1489,1431,1945,62.9065,68.5547,21.4453,99.9927
495,496,8477,3185,1988,124.325,66.5616,23.4384,99.9766
496,497,67186,2209,2082,273.116,49.2352,40.7648,71.714
497,498,5431,1068,1975,90.3164,13.8794,76.1206,99.9893
498,499,754,2393,1953,96.4062,56.0616,33.9384,99.9781
499,500,22531,1723,2017,101.961,58.269,31.731,53.2257
500,501,609,1594,1965,266.062,21.0178,68.9822,99.9928
501,502,56136,1463,2085,92.3866,22.2678,67.7322,99.4342
502,503,15257,552,2041,92.6521,38.5559,51.4441,99.8562
503,504,7369,749,2036,91.9501,41.7106,48.2894,99.7581
504,505,23209,1156,2078,88.7969,31.8975,58.1025,99.9108
505,506,1662,836,2011,284.758,54.0881,35.9119,99.5087
506,507,2654,2632,2033,270.353,16.3413,73.6587,99.9827
507,508,946,1940,2024,94.287,34.466,55.534,99.8018
508,509,504,3270,2028,120.297,65.1921,24.8079,99.8574
509,510,4046,417,2061,86.6878,20.319000000000006,69.681,99.9943
510,511,2443,1865,2047,89.9442,40.1318,49.8682,99.9001
511,512,3964,328,2061,258.199,41.1897,48.8103,99.9919
512,513,3305,1996,2061,93.5082,17.0886,72.9114,99.928
513,514,90339,736,2283,96.1693,20.2669,69.7331,99.8234
514,515,1488,2873,2055,90.1367,37.4702,52.5298,99.7663
515,516,2248,3188,2073,55.037,81.3387,8.66127,99.9529
516,517,32524,1911,2165,266.742,10.1454,79.8546,99.4556
517,518,6810,1711,2103,266.74,27.7362,62.2638,99.9685
518,519,2235,1795,2078,263.207,4.01935,85.9807,99.9594
519,520,16794,3113,2126,271.435,26.7194,63.2806,99.7583
520,521,3811,705,2096,85.3387,18.3133,71.6867,99.9775
521,522,1176,2392,2086,74.9911,70.8308,19.1692,99.9294
522,523,1245,646,2088,306.891,77.7922,12.2078,99.9921
523,524,3573,511,2114,275.851,55.5222,34.4778,99.992
524,525,821,1288,2092,287.298,52.6023,37.3977,99.9848
525,526,19569,403,2193,259.643,25.0922,64.9078,99.8384
526,527,519,2901,2090,289.466,85.1946,4.80544,99.9971
527,528,575,3241,2094,268.305,28.3182,61.6818,99.8966
528,529,2350,454,2112,269.249,54.3201,35.6799,99.8167
529,530,1162,2959,2100,303.3540000000001,85.3595,4.64051,99.9361
530,531,6660,1011,2118,89.3019,25.0076,64.9924,99.8585
531,532,828,2680,2093,264.018,38.5253,51.4747,99.9902
532,533,2687,2860,2121,271.665,45.004,44.996,99.9732
533,534,3076,948,2148,275.41,65.5387,24.4613,99.7876
534,535,591,2354,2114,101.298,46.3507,43.6493,99.9947
535,536,17490,230,2227,86.1541,25.7798,64.2202,99.8623
536,537,3660,590,2129,278.115,53.401,36.599,99.996
537,538,3006,2032,2142,289.296,48.1276,41.8724,99.9701
538,539,7067,2728,2150,91.9469,63.162,26.838,99.9774
539,540,6979,1770,2150,88.2138,5.16899,84.831,99.973
540,541,5847,2417,2151,68.273,64.1381,25.8619,99.9943
541,542,2404,665,2137,288.298,58.0909,31.9091,99.9919
542,543,652,334,2130,94.3687,20.9878,69.0122,99.9985
543,544,3011,1301,2152,261.018,18.7611,71.2389,99.9637
544,545,14844,2907,2190,90.4664,48.0899,41.9101,99.8089
545,546,2086,1085,2157,95.9236,1.59236,88.4076,99.9943
546,547,660,1218,2146,288.705,55.7579,34.2421,99.9916
547,548,7596,3097,2187,99.0933,66.1012,23.8988,99.9867
548,549,1903,162,2155,82.0274,22.9939,67.0061,99.9483
549,550,1169,504,2167,90.987,40.9685,49.0315,99.9788
550,551,2190,643,2180,97.9586,42.8588,47.1412,99.9875
551,552,1903,2361,2178,86.9096,25.839,64.161,99.9958
552,553,546,2325,2176,99.0695,63.6648,26.3352,99.9878
553,554,5688,154,2207,260.23400000000004,57.1073,32.8927,99.899
554,555,5166,921,2226,264.389,65.9734,24.0266,99.9527
555,556,81962,1033,2457,90.5191,45.5522,44.4478,73.1535
556,557,10346,1216,2223,297.632,67.9338,22.0662,99.9835
557,558,10060,586,2225,268.297,18.7284,71.2716,99.9901
558,559,1198,1495,2194,89.23200000000001,28.3947,61.6053,99.9942
559,560,22174,1618,2323,58.6418,82.1673,7.83271,99.8541
560,561,107734,2012,2409,84.8326,0.960594,89.0394,99.5829
561,562,13131,313,2257,275.567,64.9326,25.0674,99.994
562,563,3546,3019,2216,293.177,83.5038,6.49622,99.9815
563,564,2091,2801,2223,89.7245,22.5057,67.4943,99.9895
564,565,3491,3180,2225,84.4935,43.9548,46.0452,99.9844
565,566,1413,2760,2206,271.452,41.7626,48.2374,99.9923
566,567,2695,1137,2206,87.5383,25.6959,64.3041,99.9224
567,568,31263,1481,2264,271.82,38.3266,51.6734,99.5207
568,569,6154,2292,2223,83.9718,22.5253,67.4747,99.9857
569,570,13351,1736,2243,87.13600000000002,8.34607,81.6539,99.9579
570,571,837,3259,2198,260.939,38.3245,51.6755,99.6174
571,572,991,2006,2211,285.684,54.9172,35.0828,99.992
572,573,11105,2421,2252,98.9723,62.8614,27.1386,99.2888
573,574,962,1088,2215,96.7901,9.5263,80.4737,99.996
574,575,913,2494,2208,85.7922,63.6926,26.3074,99.9937
575,576,5959,2606,2267,106.104,55.393,34.607,99.9101
576,577,4911,489,2248,278.02,0.658783,89.3412,99.459
577,578,11322,2535,2289,99.8986,25.1678,64.8322,99.9732
578,579,2520,2683,2246,89.1988,54.3293,35.6707,99.9957
579,580,1066,2969,2250,89.3073,10.9303,79.0697,98.8076
580,581,5424,1296,2291,274.656,60.7605,29.2395,99.9705
581,582,5111,2227,2282,279.043,48.6413,41.3587,99.9884
582,583,7032,3168,2312,193.1,86.6384,3.36165,99.9581
583,584,2022,2917,2260,252.471,80.9552,9.04484,99.9961
584,585,806,2135,2258,284.62,49.2096,40.7904,99.9959
585,586,57880,2980,2364,97.6063,52.0406,37.9594,99.7348
586,587,1959,3201,2281,264.193,38.1963,51.8037,99.9962
587,588,1648,2759,2283,269.437,56.1073,33.8927,99.998
588,589,1361,818,2275,85.2928,11.048,78.952,99.9901
589,590,3380,101,2306,264.534,26.4501,63.5499,99.897
590,591,1221,1855,2292,267.79,67.5521,22.4479,99.9953
591,592,1566,2659,2290,273.732,57.4875,32.5125,99.9936
592,593,660,864,2279,261.576,16.1272,73.8728,99.9956
593,594,23646,496,2392,268.624,4.75332,85.2467,71.8932
594,595,2802,2305,2303,266.368,50.9809,39.0191,99.9964
595,596,16981,2393,2360,252.786,11.8385,78.1615,99.8289
596,597,3509,906,2314,256.145,25.5661,64.4339,99.9941
597,598,2641,751,2313,264.275,18.8735,71.1265,99.9974
598,599,2995,860,2333,267.832,17.4172,72.5828,99.9887
599,600,9516,2723,2363,257.715,39.7849,50.2151,99.9611
600,601,861,1807,2317,266.11,43.4046,46.5954,99.9944
601,602,899,2797,2331,273.534,35.3775,54.6225,99.9872
602,603,890,1870,2318,282.064,64.2886,25.7114,99.9742
603,604,7327,2223,2354,274.035,14.6449,75.3551,99.9674
604,605,7736,240,2375,256.798,12.1951,77.8049,99.9928
605,606,2294,1755,2331,94.1539,34.6413,55.3587,99.9949
606,607,1890,147,2355,86.5367,30.53,59.47,99.992
607,608,1806,1447,2353,76.9597,67.3524,22.6476,99.9131
608,609,6372,1115,2373,92.1508,31.4345,58.5655,99.9718
609,610,11088,333,2392,88.2235,19.2004,70.7996,99.9944
610,611,887,188,2363,260.644,45.7834,44.2166,99.9947
611,612,747,376,2342,28.7416,73.4737,16.5263,99.9958
612,613,7017,3153,2397,270.257,28.9704,61.0296,99.9786
613,614,1592,3264,2375,184.077,82.7319,7.268089999999999,99.6161
614,615,537,2652,2348,272.718,34.5927,55.4073,99.9839
615,616,2275,2600,2370,84.3769,70.2065,19.7935,99.9915
616,617,543,1798,2352,94.3464,34.3992,55.6008,99.9953
617,618,8419,1367,2410,267.717,60.2792,29.7208,99.9827
618,619,2211,2512,2379,266.006,8.66408,81.3359,99.969
619,620,3554,2297,2387,82.0937,31.9044,58.0956,99.9954
620,621,44425,1738,2514,273.857,7.560389999999999,82.4396,92.0756
621,622,9728,1243,2410,91.0072,22.9916,67.0084,99.9781
622,623,1587,2805,2396,272.638,32.388000000000005,57.612,99.9703
623,624,1110,94,2393,114.934,74.9104,15.0896,99.9141
624,625,10564,838,2456,256.819,23.6712,66.3288,99.8568
625,626,28602,2601,2478,102.258,25.3372,64.6628,99.8493
626,627,8286,1077,2431,92.4305,27.9594,62.0406,99.98
627,628,1015,1441,2393,86.3492,23.8501,66.1499,99.8226
628,629,36811,188,2605,262.97,25.147,64.85300000000001,97.8542
629,630,2301,995,2422,98.1138,9.33702,80.663,99.9812
630,631,11669,2769,2488,79.44,4.77726,85.2227,99.8606
631,632,3086,2837,2434,92.7673,27.2798,62.7202,99.993
632,633,4105,1629,2432,87.2953,28.3344,61.6656,99.9848
633,634,5763,1462,2452,264.297,48.7931,41.2069,99.3423
634,635,1502,3206,2430,264.91700000000003,13.2712,76.7288,99.9984
635,636,6952,2285,2484,258.261,58.0529,31.9471,99.7209
636,637,836,2703,2431,260.199,36.5254,53.4746,99.9952
637,638,9692,2370,2487,252.847,20.4923,69.5077,99.9454
638,639,849,399,2442,38.2511,75.5453,14.4547,99.9685
639,640,4590,1562,2481,95.4004,29.9325,60.0675,99.978
640,641,20569,331,2515,262.425,45.3574,44.6426,97.8972
641,642,600,3269,2456,258.35900000000004,27.2088,62.7912,99.7949
642,643,872,99,2451,261.209,24.7657,65.2343,99.9652
643,644,2410,2886,2469,261.981,11.363,78.637,99.9835
644,645,30978,1153,2523,89.6375,27.1082,62.8918,99.3816
645,646,6454,462,2486,41.4263,73.3368,16.6632,99.679
646,647,4195,3160,2479,85.1128,32.5157,57.4843,99.9675
647,648,7358,3066,2514,269.994,40.8887,49.1113,99.9076
648,649,567,1754,2462,271.273,13.0031,76.9969,99.9615
649,650,3017,1379,2480,262.10900000000004,73.8886,16.1114,99.9868
650,651,506,2432,2470,92.5748,25.4205,64.5795,99.9811
651,652,8827,1305,2549,81.9396,35.3931,54.6069,99.654
652,653,621,1517,2470,266.52,42.8574,47.1426,99.576
653,654,788,3265,2496,258.392,26.8965,63.1035,99.8161
654,655,1153,2935,2492,267.199,36.5161,53.4839,99.9587
655,656,653,1013,2486,94.8642,9.77324,80.2268,99.9164
656,657,4643,97,2557,87.8773,20.2353,69.7647,99.9104
657,658,8073,2517,2538,268.815,30.8986,59.1014,99.6256
658,659,1658,2513,2513,260.555,25.3603,64.6397,99.4588
659,660,8485,709,2552,269.008,19.2214,70.7786,99.9619
660,661,12596,593,2554,85.1583,44.5705,45.4295,99.882
661,662,4818,2449,2567,90.4389,11.7898,78.2102,98.6162
662,663,2799,2194,2522,93.8541,77.2542,12.7458,98.9033
663,664,11068,3142,2560,83.2165,18.9509,71.0491,88.7172
664,665,13224,2909,2559,7.20148,86.1975,3.80251,98.5737
665,666,1039,126,2543,85.1072,20.3619,69.6381,99.9896
666,667,2561,2249,2538,93.4008,38.3907,51.6093,99.5612
667,668,762,1392,2519,91.4627,30.4745,59.5255,99.8202
668,669,2827,780,2566,332.36300000000006,80.3967,9.60329,99.9897
669,670,3737,1499,2553,98.0676,29.9991,60.0009,99.9476
670,671,4095,1556,2576,266.807,46.0934,43.9066,99.7398
671,672,17915,433,2622,277.331,54.9894,35.0106,99.6147
672,673,969,2674,2549,93.6004,28.6693,61.3307,99.9163
673,674,881,1413,2548,301.125,76.355,13.645,99.9828
674,675,1250,2800,2564,337.159,77.0863,12.9137,93.4241
675,676,3757,823,2581,88.78,70.6648,19.3352,99.9906
676,677,1148,885,2568,279.82,81.0023,8.99767,99.9865
677,678,811,1371,2556,86.4049,6.0741,83.9259,99.9958
678,679,22700,2089,2624,267.338,30.5073,59.4927,99.9771
679,680,7609,251,2594,90.5111,13.0797,76.9203,99.997
680,681,1354,2732,2571,75.4139,18.182,71.818,99.935
681,682,6998,2224,2608,269.039,21.2496,68.7504,99.9833
682,683,1973,2300,2585,254.581,22.9465,67.0535,99.9923
683,684,17612,2385,2639,282.992,56.9778,33.0222,99.8934
684,685,31058,1380,2660,285.072,73.9302,16.0698,99.9004
685,686,7885,3005,2637,87.2191,11.1244,78.8756,99.9346
686,687,27847,2613,2669,282.507,58.6947,31.3053,99.9203
687,688,9640,1920,2634,269.683,10.3445,79.6555,99.1061
688,689,3134,3197,2619,23.2598,78.414,11.586,99.9847
689,690,1988,2829,2608,87.309,19.7006,70.2994,99.9015
690,691,7530,1689,2648,83.2323,27.2651,62.7349,99.881
691,692,654,1246,2608,93.1475,22.4264,67.5736,99.9968
692,693,855,3259,2606,262.783,33.9991,56.0009,99.8708
693,694,8716,1201,2656,93.6666,33.1958,56.8042,99.9808
694,695,829,2773,2608,276.027,44.4753,45.5247,99.9908
695,696,11687,1608,2670,75.7008,19.4729,70.5271,99.9439
696,697,1479,123,2659,84.1114,20.1726,69.8274,99.9563
697,698,4524,641,2634,87.9854,42.2184,47.7816,99.9927
698,699,9004,3111,2650,86.5471,19.9747,70.0253,99.8773
699,700,16088,2743,2726,85.6561,23.2349,66.7651,99.9556
700,701,10567,524,2670,263.08,14.1313,75.8687,99.989
701,702,3996,2900,2645,260.431,37.2189,52.7811,99.9835
702,703,1967,717,2646,279.61400000000003,60.5066,29.4934,99.9399
703,704,8001,777,2683,86.8361,7.7195399999999985,82.2805,99.9252
704,705,3377,304,2664,266.553,50.7383,39.2617,99.9702
705,706,1131,2814,2647,77.7809,34.4493,55.5507,99.9939
706,707,2052,1837,2656,268.897,48.0238,41.9762,99.9917
707,708,86501,2241,2831,81.5359,46.5257,43.4743,99.6766
708,709,1288,1784,2671,271.451,48.8965,41.1035,99.9905
709,710,672,892,2663,263.438,80.52,9.47997,99.9888
710,711,699,2939,2669,77.2858,11.9507,78.0493,99.9915
711,712,3877,687,2698,102.796,70.043,19.957,99.9849
712,713,3500,2500,2698,83.0737,45.5123,44.4877,99.9855
713,714,2145,605,2690,269.77,53.7076,36.2924,99.9981
714,715,20402,1450,2785,97.3273,5.25358,84.7464,99.037
715,716,1023,1978,2681,96.1087,47.9018,42.0982,99.9931
716,717,561,124,2706,258.131,26.6539,63.3461,99.9864
717,718,16624,846,2751,261.151,11.232,78.768,99.9814
718,719,12357,2865,2741,83.0195,51.6728,38.3272,99.9558
719,720,7909,3166,2729,86.7481,8.8198,81.1802,99.9871
720,721,656,1863,2690,90.5537,56.0667,33.9333,99.9904
721,722,505,917,2691,253.461,27.1928,62.8072,99.993
722,723,5289,1911,2731,87.4995,50.089,39.911,99.8282
723,724,11565,2982,2770,90.0265,16.2436,73.7564,99.0744
724,725,4940,3088,2724,268.937,24.9924,65.0076,99.9805
725,726,23579,1693,2784,91.4265,53.4064,36.5936,99.6217
726,727,936,89,2718,86.6767,20.0165,69.9835,99.9399
727,728,25729,388,2782,269.962,32.3536,57.6464,99.7861
728,729,10165,668,2764,272.672,16.0894,73.9106,99.3144
729,730,2459,954,2726,270.437,40.7885,49.2115,99.4722
730,731,1002,1832,2715,77.1716,28.5109,61.4891,99.9975
731,732,3674,291,2737,262.231,11.0479,78.9521,99.9979
732,733,1805,1215,2735,94.8038,24.3703,65.6297,99.9818
733,734,105012,1000,2919,84.7609,33.0364,56.9636,99.556
734,735,14349,2021,2784,99.2529,44.7397,45.2603,99.8574
735,736,17793,2495,2811,276.641,4.8772,85.1228,98.9556
736,737,548,544,2737,270.97900000000004,6.596189999999999,83.4038,99.9973
737,738,4748,1302,2765,91.8111,19.9124,70.0876,99.9633
738,739,6565,3194,2817,87.3815,0.8759610000000001,89.124,99.9663
739,740,930,510,2748,270.278,54.6111,35.3889,99.9962
740,741,11821,1830,2801,80.4684,17.3255,72.6745,99.9338
741,742,538,2521,2749,278.106,11.322,78.678,99.9865
742,743,620,110,2762,256.721,10.4115,79.5885,99.975
743,744,536,94,2777,259.569,11.2369,78.7631,99.9673
744,745,1623,563,2772,104.657,68.8979,21.1021,99.9812
745,746,5017,2614,2798,85.2928,49.7974,40.2026,99.9859
746,747,1324,164,2785,255.646,8.65733,81.3427,99.9958
747,748,3765,3087,2802,280.538,50.4993,39.5007,99.9853
748,749,8044,1553,2859,90.2096,8.48013,81.5199,99.9486
749,750,14570,759,2859,98.1976,46.4877,43.5123,99.9741
750,751,10709,1234,2844,262.94,3.70341,86.2966,99.9859
751,752,4096,623,2822,86.9365,36.1939,53.8061,99.9903
752,753,1320,2109,2797,91.5851,2.71436,87.2856,99.9902
753,754,7271,2809,2819,75.3379,9.76893,80.2311,99.9779
754,755,11527,191,2883,259.15,6.1312,83.8688,99.7699
755,756,1810,2929,2819,81.7001,7.14744,82.8526,99.8957
756,757,3422,259,2832,281.141,44.3125,45.6875,99.9983
757,758,1632,562,2817,78.9386,12.7855,77.2145,99.9985
758,759,41028,504,2969,99.1371,34.7406,55.2594,94.001
759,760,1553,3141,2821,70.4119,59.7324,30.2676,99.9975
760,761,3744,142,2843,283.035,83.8073,6.19271,99.9813
761,762,1291,1910,2822,139.27,80.2371,9.76285,99.9873
762,763,27128,2710,2891,271.106,27.6661,62.3339,99.9071
763,764,3653,3014,2866,279.053,12.6429,77.3571,99.9324
764,765,844,96,2856,267.73400000000004,82.8785,7.1215,99.9374
765,766,819,3246,2832,86.5288,1.14519,88.8548,99.9099
766,767,821,1588,2839,259.77,56.9067,33.0933,99.9943
767,768,1162,3058,2849,272.244,51.2317,38.7683,99.9929
768,769,3337,2896,2872,79.8454,9.23341,80.7666,99.9531
769,770,3731,1421,2862,259.775,73.6071,16.3929,99.9713
770,771,2888,1960,2865,276.019,52.1563,37.8437,99.4647
771,772,4762,3110,2873,84.4438,27.8373,62.1627,99.9478
772,773,2433,1892,2871,84.3336,33.9313,56.0687,99.989
773,774,1905,703,2906,111.42,68.5743,21.4257,99.9687
774,775,3810,595,2888,105.022,45.0724,44.9276,99.992
775,776,48598,1360,3025,82.4473,48.4508,41.5492,72.5793
776,777,3865,1652,2889,263.29400000000004,10.4118,79.5882,99.9821
777,778,4308,273,2911,94.5774,49.6906,40.3094,99.9844
778,779,1235,3249,2895,83.6168,1.5204799999999998,88.4795,99.7417
779,780,1455,2960,2891,93.6854,24.0529,65.9471,72.5463
780,781,14056,1735,2946,97.784,42.4119,47.5881,99.9216
781,782,3004,656,2904,274.838,18.8609,71.1391,99.9896
782,783,703,1353,2887,90.8482,1.73239,88.2676,99.9771
783,784,5393,2292,2934,113.114,73.3274,16.6726,99.8502
784,785,2048,1160,2903,92.2413,7.99538,82.0046,99.9917
785,786,10584,2378,2934,84.7348,9.64101,80.359,99.9901
786,787,5605,1834,2920,87.5025,36.7534,53.2466,99.9313
787,788,13107,366,2963,286.86,54.2858,35.7142,99.938
788,789,2151,3162,2910,312.1740000000001,89.0804,0.919623,99.9929
789,790,2197,432,2918,267.849,34.0219,55.9781,99.9436
790,791,10018,1456,2938,260.511,54.2622,35.7378,99.5687
791,792,1339,2023,2910,91.82,43.4644,46.5356,99.9892
792,793,9191,2552,2952,272.289,1.27569,88.7243,99.8928
793,794,59898,2782,3044,275.762,28.1966,61.8034,98.8096
794,795,939,2054,2925,91.735,44.3485,45.6515,99.9842
795,796,699,3233,2912,83.9614,4.68297,85.31700000000002,99.7751
796,797,10742,1958,2948,92.6501,7.5989,82.4011,99.1644
797,798,7417,1622,2969,89.2109,7.0686300000000015,82.9314,99.8805
798,799,3777,3068,2941,86.2875,27.602,62.398,99.9631
799,800,2006,1550,2935,83.1891,69.7156,20.2844,99.9837
800,801,4080,2933,2947,263.21,15.6326,74.3674,99.1627
801,802,580,3115,2924,270.733,8.42641,81.5736,99.9966
802,803,5992,1165,2962,263.061,28.5429,61.4571,99.9901
803,804,2030,3001,2940,277.73,12.5254,77.4746,99.9882
804,805,1082,3190,2953,267.818,34.0811,55.9189,99.9823
805,806,1739,3240,2971,263.172,32.0893,57.9107,99.7814
806,807,34214,635,3084,89.1723,3.66807,86.3319,99.8765
807,808,18408,3100,3037,268.568,12.4968,77.5032,99.1857
808,809,12203,183,3001,79.7859,72.9326,17.0674,99.9293
809,810,2672,284,2969,288.978,50.9278,39.0722,99.972
810,811,5536,1880,3010,51.1988,64.6775,25.3225,99.6048
811,812,7986,796,2996,82.9408,4.57142,85.4286,99.9688
812,813,8994,2437,3010,116.438,77.4205,12.5795,99.2446
813,814,866,2037,2970,96.7372,17.8484,72.1516,99.9856
814,815,2395,93,3026,90.4509,20.0606,69.9394,99.9702
815,816,6426,3001,3026,142.269,89.1246,0.8753629999999999,98.713
816,817,3127,3188,3043,268.108,33.2567,56.7433,99.9361
817,818,9219,1168,3066,94.2432,4.52309,85.4769,99.956
818,819,1386,1808,3002,269.337,6.49158,83.5084,99.9951
819,820,1652,2282,3006,267.737,17.7199,72.2801,99.9704
820,821,13725,2097,3053,81.8493,60.8952,29.1048,98.9716
821,822,1351,1543,3000,108.919,68.4147,21.5853,99.9889
822,823,550,327,3005,174.283,86.5817,3.41827,99.6963
823,824,961,286,3009,264.126,6.46089,83.5391,99.9967
824,825,10536,2355,3068,260.36,28.8593,61.1407,99.8256
825,826,24083,1985,3142,274.973,34.8745,55.1255,98.0528
826,827,1078,1728,3034,268.404,10.4889,79.5111,99.9929
827,828,1138,2003,3035,272.802,6.69732,83.3027,99.9744
828,829,1317,1693,3041,264.557,46.5627,43.4373,99.8248
829,830,6534,1570,3061,326.208,74.1733,15.8267,99.6761
830,831,805,269,3034,89.1147,50.3322,39.6678,99.9968
831,832,757,1810,3040,269.271,9.21811,80.7819,99.995
832,833,3761,788,3062,269.481,25.0977,64.9023,99.9415
833,834,25156,2220,3144,60.54600000000001,79.0116,10.9884,99.8801
834,835,8327,2565,3111,268.154,25.3877,64.6123,99.9718
835,836,4746,2494,3079,87.3037,39.7579,50.2421,99.843
836,837,873,1088,3074,93.9838,4.2278400000000005,85.7722,99.9521
837,838,3313,1758,3077,85.3892,9.90585,80.0941,99.9888
838,839,91477,405,3278,84.3663,24.5916,65.4084,82.5454
839,840,5678,227,3081,88.9874,56.3814,33.6186,99.9197
840,841,966,854,3069,254.529,18.1494,71.8506,99.9965
841,842,1797,1116,3080,270.61,10.097,79.903,99.9928
842,843,2168,2943,3082,280.18,36.5361,53.4639,99.2584
843,844,3917,711,3113,296.1670000000001,79.6351,10.3649,99.981
844,845,1620,1821,3074,78.0535,5.8791,84.1209,99.9057
845,846,2647,1695,3091,267.556,42.5751,47.4249,99.9874
846,847,5552,3164,3139,271.601,7.91972,82.0803,99.9636
847,848,23750,1833,3207,82.4945,9.35841,80.6416,99.7998
848,849,21556,161,3186,266.183,15.4716,74.5284,99.9846
849,850,15294,1632,3148,86.8264,50.1222,39.8778,99.9745
850,851,13386,1312,3138,257.922,10.9043,79.0957,99.9566
851,852,1451,2706,3109,90.5667,46.4952,43.5048,99.9903
852,853,21934,836,3161,265.442,4.07881,85.9212,99.9465
853,854,9579,2349,3174,272.964,51.5467,38.4533,99.9828
854,855,1770,2978,3120,270.064,16.974,73.02600000000002,99.9816
855,856,1150,84,3139,264.632,15.4217,74.5783,99.8855
856,857,5326,1905,3144,3.33467,80.4789,9.52109,99.9798
857,858,2170,3018,3138,274.264,57.6171,32.3829,99.9758
858,859,1290,3095,3147,274.547,9.72337,80.2766,99.9853
859,860,2665,1754,3154,268.01,62.2268,27.7732,99.9903
860,861,639,2736,3126,92.4819,44.9986,45.0014,99.9034
861,862,1151,2111,3133,273.49,15.6694,74.3306,99.9948
862,863,4514,1055,3159,93.2074,9.47955,80.5204,99.9801
863,864,4304,2943,3172,82.0513,36.3208,53.6792,99.2109
864,865,1512,1117,3149,97.1531,4.03493,85.9651,99.8443
865,866,2408,2436,3172,276.677,51.2207,38.7793,99.2615
866,867,1864,2635,3149,91.4194,18.3268,71.6732,99.9907
867,868,995,3257,3157,267.36,16.6639,73.3361,99.9132
868,869,1492,2498,3154,292.261,48.4803,41.5197,99.9968
869,870,2954,3048,3171,269.844,24.956,65.044,99.6861
870,871,1231,1169,3158,80.3897,50.35,39.65,99.9982
871,872,2149,736,3172,263.781,29.2701,60.7299,99.9977
872,873,7056,2749,3178,82.0136,59.5425,30.4575,99.9934
873,874,1033,1504,3152,264.959,12.4762,77.5238,99.9889
874,875,652,3221,3165,270.226,8.52707,81.4729,99.9381
875,876,1545,1438,3166,283.1040000000001,76.0637,13.9363,99.8591
876,877,1696,2107,3178,82.411,34.248000000000005,55.752,99.9722
877,878,41632,2668,3277,268.826,12.5275,77.4725,99.7417
878,879,26631,1279,3274,77.0292,2.967,87.03299999999999,99.9258
879,880,1451,1133,3188,93.4615,5.02682,84.9732,99.9371
880,881,547,392,3190,77.9591,19.986,70.014,99.9914
881,882,3174,1486,3202,277.26,11.2207,78.7793,99.9924
882,883,642,3143,3186,87.1995,52.0576,37.9424,99.9904
883,884,890,1539,3190,302.107,72.75399999999998,17.246,99.9957
884,885,2018,2481,3200,101.849,49.2392,40.7608,99.9866
885,886,23752,1026,3251,90.6399,7.552969999999998,82.447,99.6761
886,887,7533,2861,3224,266.817,3.01253,86.9875,99.9362
887,888,9032,682,3240,78.6972,17.0299,72.9701,99.9794
888,889,688,3114,3201,91.7102,52.4554,37.5446,99.9876
889,890,9460,1413,3254,95.9279,46.6871,43.3129,99.7653
890,891,13882,1677,3305,287.797,62.302,27.698,99.9447
891,892,1804,2043,3212,96.1012,18.3904,71.6096,99.9942
892,893,15958,266,3270,160.77200000000005,83.6343,6.36572,99.9623
893,894,51327,3038,3362,264.136,88.7067,1.29331,99.771
894,895,8554,1164,3294,266.613,63.239,26.761,99.9752
895,896,26485,2502,3316,277.05,14.3279,75.6721,99.2291
896,897,3779,3172,3264,91.0805,21.6549,68.3451,99.9285
897,898,1367,3252,3236,93.2568,21.9368,68.0632,99.9203
898,899,53932,2147,3331,86.4911,9.23132,80.7687,99.843
899,900,7728,1521,3280,292.03,74.0533,15.9467,99.9297
900,901,2577,3132,3257,93.3117,21.7586,68.2414,99.9893
901,902,2440,780,3247,100.063,65.3041,24.6959,99.992
902,903,5693,1598,3270,85.119,51.8048,38.1952,99.9888
903,904,3556,2359,3266,86.7145,29.3942,60.6058,99.9741
904,905,12905,844,3331,261.525,27.015,62.985,99.9699
905,906,9162,920,3318,269.845,21.3778,68.6222,99.4248
906,907,1280,2005,3272,99.8145,22.029,67.971,99.9939
907,908,2256,2857,3281,90.0767,0.182243,89.8178,99.9704
908,909,1076,762,3290,263.473,2.61499,87.385,99.9833
909,910,10219,1767,3329,258.148,35.3551,54.6449,99.9953
910,911,785,3020,3275,280.387,5.6842,84.3158,99.9792
911,912,19661,1929,3404,260.844,7.927,82.073,99.0186
912,913,10040,660,3335,167.782,85.4347,4.56532,99.97
913,914,1541,1883,3303,257.091,35.2597,54.7403,99.9975
914,915,42117,1551,3442,93.5093,21.2349,68.7651,93.6985
915,916,4012,2336,3333,80.881,3.07294,86.9271,99.9895
916,917,23910,2401,3456,262.553,14.1194,75.8806,99.1795
917,918,4969,2862,3347,270.689,4.04216,85.9578,99.9263
918,919,2626,175,3340,155.375,86.1007,3.89933,99.9936
919,920,4944,752,3352,70.6906,69.2181,20.7819,99.9924
920,921,846,1013,3331,95.4991,40.0563,49.9437,99.9964
921,922,4877,531,3381,81.9898,21.2301,68.7699,99.9836
922,923,3293,3185,3396,81.1639,0.5530470000000001,89.447,99.9781
923,924,7941,1338,3386,268.414,26.2768,63.7232,99.9865
924,925,1671,1894,3354,258.644,11.4778,78.5222,99.9955
925,926,6937,252,3374,87.8198,12.3487,77.6513,99.9877
926,927,49518,1166,3483,117.997,68.863,21.137,99.313
927,928,7088,2721,3393,273.013,0.202423,89.7976,99.9838
928,929,929,989,3359,88.3033,49.1821,40.8179,99.9966
929,930,1966,1403,3371,206.856,85.3354,4.6645900000000005,99.9902
930,931,945,95,3392,283.073,54.4144,35.5856,99.7937
931,932,5633,150,3421,282.819,54.4953,35.5047,99.9534
932,933,2606,1844,3380,87.271,53.0796,36.9204,99.9928
933,934,634,1021,3364,279.312,16.3192,73.6808,99.9731
934,935,983,599,3384,262.583,0.530937,89.4691,99.8712
935,936,6899,2286,3431,264.66,30.6871,59.3129,99.9793
936,937,1197,2804,3381,88.1074,57.3908,32.6092,99.9959
937,938,727,2896,3387,263.015,69.9841,20.0159,99.9647
938,939,704,126,3411,278.51,55.3401,34.6599,99.977
939,940,5531,957,3426,99.1211,9.67416,80.3258,99.1153
940,941,11006,818,3433,264.785,6.690180000000002,83.3098,99.9437
941,942,58490,667,3535,78.0548,17.6803,72.3197,99.2633
942,943,1036,1279,3408,262.28,16.2235,73.7765,99.9933
943,944,512,3263,3419,83.0412,1.34574,88.6543,99.8105
944,945,541,1797,3403,280.731,58.1183,31.8817,99.995
945,946,12299,1714,3449,98.2964,28.1328,61.8672,99.9722
946,947,4123,1027,3441,275.653,15.7493,74.2507,99.9873
947,948,39646,2808,3506,139.444,86.2844,3.71557,98.8171
948,949,1076,2460,3428,102.598,70.7424,19.2576,99.9539
949,950,12763,2203,3484,264.207,52.1101,37.8899,99.835
950,951,11573,1399,3493,264.589,24.3761,65.6239,99.5368
951,952,15616,2547,3475,99.5117,16.8304,73.1696,99.957
952,953,6612,1822,3469,87.0351,61.5951,28.4049,99.9052
953,954,929,1973,3423,97.9587,17.1881,72.8119,99.9806
954,955,6286,2667,3471,107.496,73.8688,16.1312,99.9749
955,956,1229,239,3433,276.376,12.6993,77.3007,99.9866
956,957,1467,1384,3447,262.834,20.6897,69.3103,99.994
957,958,1570,191,3456,90.9851,20.0321,69.9679,99.9945
958,959,2948,1960,3472,274.626,22.9928,67.0072,99.381
959,960,13864,2025,3531,290.907,63.86600000000001,26.134,99.1111
960,961,20159,222,3531,79.8642,61.2333,28.7667,89.8328
961,962,3700,2115,3495,274.713,16.3095,73.6905,99.9876
962,963,1091,3238,3485,262.628,0.539108,89.4609,99.8331
963,964,9205,3128,3543,274.129,49.2173,40.7827,99.9202
964,965,24143,963,3540,90.3212,2.27341,87.7266,65.8211
965,966,908,830,3500,73.7014,72.5835,17.4165,99.4043
966,967,508,2626,3512,266.263,14.643,75.357,99.9049
967,968,555,1304,3506,81.7294,4.89906,85.1009,99.9916
968,969,30844,394,3598,261.063,8.58267,81.4173,99.7435
969,970,25487,1709,3615,267.25,29.0436,60.9564,99.9716
970,971,2119,2987,3524,88.7654,22.777,67.223,99.9744
971,972,10832,1799,3640,261.312,17.7953,72.2047,99.9115
972,973,65273,2915,3684,264.47700000000003,12.0769,77.9231,99.4162
973,974,7203,2299,3561,91.6377,80.8731,9.12692,99.0796
974,975,27749,1309,3650,72.5101,57.3014,32.6986,99.9411
975,976,17458,1887,3628,265.37,1.7324400000000002,88.2676,99.6617
976,977,553,836,3549,262.431,4.95984,85.0402,99.9936
977,978,810,2654,3552,265.692,13.3467,76.6533,99.9889
978,979,19618,2626,3626,272.012,20.2904,69.7096,99.8855
979,980,10940,1433,3619,264.651,34.028,55.972,99.6077
980,981,11585,2262,3640,260.135,5.72651,84.2735,99.9818
981,982,764,3188,3573,264.209,48.78100000000001,41.219,99.9741
982,983,1112,179,3565,281.585,55.8496,34.1504,99.9891
983,984,679,1375,3570,85.535,15.3653,74.6347,99.9872
984,985,2205,2176,3569,340.42800000000005,84.7846,5.2154099999999985,99.9795
985,986,5033,2849,3593,266.061,19.4028,70.5972,99.969
986,987,1870,1057,3586,85.6019,68.8657,21.1343,99.9472
987,988,6943,1553,3609,276.314,40.3635,49.6365,99.9874
988,989,5913,566,3631,275.685,60.3325,29.6675,99.9797
989,990,773,856,3581,91.8237,0.906914,89.0931,99.9409
990,991,15205,2420,3630,82.5987,20.3539,69.6461,99.0903
991,992,1830,3243,3623,87.545,13.6525,76.3475,99.8674
992,993,13657,3194,3703,84.4662,12.9043,77.0957,99.9729
993,994,4292,897,3623,278.131,77.7078,12.2922,99.991
994,995,16478,221,3667,92.3338,35.4739,54.5261,99.9351
995,996,1285,516,3612,358.574,74.3648,15.6352,99.9888
996,997,1802,2094,3613,96.7817,33.5067,56.4933,99.9841
997,998,11740,2166,3673,258.153,6.6984,83.3016,99.9434
998,999,570,1611,3614,90.202,19.8438,70.1562,99.9804
999,1000,3801,833,3633,272.525,54.8012,35.1988,99.9942
1000,1001,4008,2008,3628,260.272,7.44672,82.5533,99.951
1001,1002,511,2511,3620,90.5625,31.6869,58.3131,99.9907
1002,1003,3607,1071,3642,271.427,19.6138,70.3862,99.9904
1003,1004,668,110,3652,266.41200000000003,5.5742,84.4258,99.9702
1004,1005,1386,948,3658,286.59,76.7876,13.2124,99.9928
1005,1006,12723,3124,3720,88.0862,12.2166,77.7834,99.9757
1006,1007,7476,2072,3690,292.738,65.8727,24.1273,99.9796
1007,1008,5375,1188,3674,270.17400000000004,39.1086,50.8914,99.9933
1008,1009,1423,1503,3656,70.6893,21.5833,68.4167,99.9964
1009,1010,6778,1005,3690,281.04,15.5607,74.4393,99.9792
1010,1011,1915,798,3678,274.28700000000003,56.9524,33.0476,99.9807
1011,1012,536,92,3672,267.654,6.09713,83.9029,99.9687
1012,1013,3953,1594,3683,83.3886,33.7533,56.2467,99.9894
1013,1014,1790,493,3669,276.309,1.3421299999999998,88.6579,99.9837
1014,1015,49521,2518,3789,96.091,16.820999999999998,73.179,99.4746
1015,1016,10426,643,3706,272.539,25.3643,64.6357,99.9859
1016,1017,142453,362,4003,89.5261,1.05256,88.9474,99.5093
1017,1018,1120,1973,3679,293.505,65.7497,24.2503,99.9943
1018,1019,3982,2343,3699,84.9796,33.0919,56.9081,99.9767
1019,1020,530,1129,3681,89.6828,71.1884,18.8116,99.9786
1020,1021,2494,855,3703,88.2742,71.9719,18.0281,99.9982
1021,1022,21594,2704,3824,270.298,24.0239,65.9761,99.9699
1022,1023,161425,1927,3982,98.669,14.8788,75.1212,70.6065
1023,1024,18112,1479,3764,268.081,18.178,71.822,99.483
1024,1025,6243,1068,3738,72.1377,67.5877,22.4123,99.9908
1025,1026,17705,487,3758,269.584,49.8878,40.1122,99.9163
1026,1027,6034,1219,3761,265.423,12.9667,77.0333,99.9569
1027,1028,968,765,3712,81.1422,22.1449,67.8551,99.991
1028,1029,2899,919,3752,259.936,78.1224,11.8776,99.9053
1029,1030,691,1528,3710,262.966,15.3018,74.6982,99.9796
1030,1031,3876,2259,3733,83.352,64.7495,25.2505,99.9743
1031,1032,1208,1130,3719,275.788,11.4142,78.5858,99.9874
1032,1033,1044,1883,3717,260.867,17.5457,72.4543,99.9961
1033,1034,3564,2382,3752,268.567,60.0635,29.9365,99.9793
1034,1035,3122,1608,3734,62.8061,82.0745,7.92552,99.9906
1035,1036,850,1909,3743,93.1297,75.5262,14.4738,99.9016
1036,1037,4183,739,3750,86.12799999999999,70.683,19.317,99.9781
1037,1038,765,1734,3739,84.1857,9.1513,80.8487,99.9958
1038,1039,894,1838,3743,260.117,17.4409,72.5591,99.9978
1039,1040,1857,1166,3748,263.716,8.5293,81.4707,99.9882
1040,1041,6531,1777,3784,266.214,28.0027,61.9973,99.9864
1041,1042,1268,2121,3750,269.17400000000004,24.7577,65.2423,99.995
1042,1043,9020,641,3809,265.759,60.1633,29.8367,99.9394
1043,1044,2352,596,3767,88.5024,66.0915,23.9085,99.9932
1044,1045,1052,3251,3760,85.2582,12.5396,77.4604,99.9813
1045,1046,6077,1867,3840,265.862,2.14367,87.8563,99.7875
1046,1047,62805,2997,3882,95.1109,6.5747100000000005,83.4253,99.1936
1047,1048,27736,2221,3836,81.8533,10.8792,79.1208,99.9415
1048,1049,1196,857,3773,93.8892,71.8639,18.1361,99.9957
1049,1050,815,1708,3765,70.3991,82.007,7.99299,99.9981
1050,1051,3106,795,3790,272.303,5.69621,84.3038,99.9855
1051,1052,2850,1636,3784,271.957,53.0199,36.9801,99.9918
1052,1053,13299,1012,3839,274.524,33.0267,56.9733,99.9776
1053,1054,3087,1325,3789,265.001,13.0542,76.9458,99.9911
1054,1055,539,1585,3784,268.325,4.6897400000000005,85.3103,99.9978
1055,1056,1287,1826,3794,277.152,63.4315,26.5685,99.9944
1056,1057,2298,1155,3800,271.253,32.7449,57.2551,99.9919
1057,1058,3442,1384,3835,92.4225,52.0524,37.9476,99.9446
1058,1059,950,960,3799,277.863,12.9183,77.0817,99.9941
1059,1060,6875,1267,3837,267.164,5.74751,84.2525,99.9268
1060,1061,6541,873,3836,261.086,57.2849,32.7151,99.9579
1061,1062,35664,1092,3925,267.29900000000004,0.6312180000000001,89.3688,99.8867
1062,1063,716,726,3807,92.7977,1.2335200000000002,88.7665,99.9965
1063,1064,712,1579,3825,20.0824,84.8835,5.1165,99.977
1064,1065,2998,2342,3851,275.383,56.3525,33.6475,99.9937
1065,1066,4372,752,3848,77.3709,23.3724,66.6276,99.996
1066,1067,4286,1463,3845,96.8539,19.8525,70.1475,99.1514
1067,1068,1499,1619,3844,101.684,54.8326,35.1674,99.9957
1068,1069,2326,1812,3850,89.0815,62.5271,27.4729,99.9883
1069,1070,695,1548,3839,77.0116,66.883,23.117,99.9957
1070,1071,555,527,3841,93.9672,24.4924,65.5076,99.9852
1071,1072,853,3209,3848,91.487,7.6963300000000014,82.3037,99.9862
1072,1073,628,818,3844,87.9571,66.8953,23.1047,99.9983
1073,1074,1994,561,3862,102.014,66.0417,23.9583,99.9905
1074,1075,59861,1369,4005,273.825,66.9594,23.0406,92.3715
1075,1076,697,652,3866,265.11400000000003,8.9119,81.0881,99.9923
1076,1077,1451,1574,3869,91.9475,5.20455,84.7954,99.9876
1077,1078,3351,2786,3883,77.9585,11.2016,78.7984,99.9965
1078,1079,512,2383,3891,87.4161,52.1082,37.8918,99.9831
1079,1080,2698,777,3907,83.5368,3.848430000000001,86.1516,99.8665
1080,1081,22283,2591,3947,92.5081,32.0701,57.9299,99.8101
1081,1082,17947,641,3934,154.019,85.2315,4.76851,99.9451
1082,1083,6899,1452,3921,92.2421,5.5251800000000015,84.4748,99.2574
1083,1084,23811,860,3975,76.3941,29.6806,60.3194,99.8849
1084,1085,1317,1497,3891,77.1154,58.7032,31.2968,99.9925
1085,1086,3840,1773,3950,88.1009,8.505519999999999,81.4945,99.9638
1086,1087,14679,1591,3961,275.454,68.0112,21.9888,99.892
1087,1088,1227,2816,3915,82.3306,77.6794,12.3206,99.9854
1088,1089,656,3223,3917,255.392,73.529,16.471,99.9404
1089,1090,5113,3179,3967,278.402,73.0914,16.9086,99.9822
1090,1091,13499,2252,3953,96.5924,52.197,37.803,99.9285
1091,1092,8230,2393,3978,264.717,58.7964,31.2036,99.6301
1092,1093,1481,3118,3956,94.3048,7.75387,82.2461,99.9801
1093,1094,640,2763,3944,83.0522,78.4843,11.5157,99.992
1094,1095,534,1825,3951,269.221,59.6823,30.3177,99.9913
1095,1096,3398,756,3994,85.5447,28.393,61.607,99.9238
1096,1097,18086,217,4038,264.286,11.4835,78.5165,99.9693
1097,1098,888,3229,3988,285.237,72.5414,17.4586,99.9325
1098,1099,1646,2569,3987,265.631,67.0103,22.9897,99.9957
1099,1100,599,1823,3984,253.942,38.6243,51.3757,99.9969
1100,1101,8099,3147,4048,268.284,46.9609,43.0391,99.7557
1101,1102,19390,2791,4053,265.73900000000003,24.7354,65.2646,99.8668
1102,1103,1483,3072,4000,100.971,51.1968,38.8032,99.9845
1103,1104,25726,2226,4095,261.267,20.313,69.687,99.916
1104,1105,1862,550,4011,92.3226,3.32691,86.6731,99.9778
1105,1106,1797,2471,4006,103.945,73.85,16.15,99.9055
1106,1107,4019,3006,4027,267.853,3.73078,86.2692,99.9524
1107,1108,2296,101,4073,260.495,12.4986,77.5014,99.765
1108,1109,3990,478,4012,264.387,32.9574,57.0426,99.9773
1109,1110,2775,1205,4025,271.747,65.4427,24.5573,99.0538
1110,1111,988,591,4008,84.0195,26.2558,63.7442,99.9675
1111,1112,1086,2337,4022,266.284,24.0248,65.9752,99.8854
1112,1113,19020,714,4080,269.428,37.6491,52.3509,99.9048
1113,1114,31512,1011,4088,269.318,7.69872,82.3013,99.7253
1114,1115,921,2171,4017,100.489,52.4059,37.5941,99.8491
1115,1116,1343,2549,4020,97.0427,17.3732,72.6268,99.9901
1116,1117,2382,2674,4048,83.8804,34.6394,55.3606,99.7604
1117,1118,616,1825,4020,268.694,65.0513,24.9487,99.4708
1118,1119,8277,3049,4082,269.233,44.6631,45.3369,99.8696
1119,1120,6056,2444,4066,60.1195,71.8223,18.1777,99.2841
1120,1121,2385,610,4061,91.1133,3.65295,86.34700000000002,99.9738
1121,1122,19769,2903,4125,279.636,48.8841,41.1159,99.5278
1122,1123,2080,2528,4053,96.8056,17.17,72.83,99.9475
1123,1124,3577,2580,4079,86.7821,56.011,33.989000000000004,99.8877
1124,1125,7183,1107,4111,79.62899999999998,63.7714,26.2286,99.9792
1125,1126,519,475,4068,265.012,16.6341,73.3659,99.9932
1126,1127,3124,1223,4092,89.5719,2.3132,87.6868,99.9913
1127,1128,3303,2328,4101,87.2037,4.12354,85.8765,99.9455
1128,1129,19937,583,4154,270.593,2.38611,87.6139,99.9394
1129,1130,4721,865,4104,259.934,1.31494,88.6851,99.9921
1130,1131,1833,2643,4094,269.452,24.3198,65.6802,99.9913
1131,1132,3093,1654,4109,294.756,64.4666,25.5334,99.9954
1132,1133,1364,2690,4102,270.789,27.0537,62.9463,99.9955
1133,1134,11215,1579,4150,80.0734,76.1734,13.8266,99.9211
1134,1135,27382,2445,4167,73.8248,29.7555,60.2445,99.6421
1135,1136,568,1174,4107,274.659,68.8872,21.1128,99.9882
1136,1137,9426,3148,4184,260.176,45.2376,44.7624,99.8874
1137,1138,4588,2114,4146,75.3038,2.57749,87.4225,99.995
1138,1139,875,2635,4129,79.383,31.5675,58.4325,99.9821
1139,1140,781,1713,4119,88.5713,19.5871,70.4129,99.9918
1140,1141,22012,1317,4208,267.13,53.4731,36.5269,99.9514
1141,1142,12493,1443,4176,272.801,12.9737,77.0263,99.1768
1142,1143,3376,1754,4158,82.363,38.1586,51.8414,99.9763
1143,1144,641,2734,4138,260.557,9.74509,80.2549,99.9752
1144,1145,6034,186,4222,263.927,11.7575,78.2425,99.9696
1145,1146,3482,1155,4173,272.33,66.1994,23.8006,99.9306
1146,1147,1148,707,4150,86.4888,2.15283,87.8472,99.9957
1147,1148,13226,804,4223,97.9921,71.1869,18.8131,99.9208
1148,1149,1037,2680,4146,75.6833,61.4831,28.5169,99.9875
1149,1150,6713,1708,4204,87.8863,53.8442,36.1558,99.8353
1150,1151,4484,3007,4173,260.397,8.52074,81.4793,99.9657
1151,1152,2334,3113,4171,75.3359,44.1875,45.8125,99.9705
1152,1153,553,836,4152,93.7162,70.2643,19.7357,99.9934
1153,1154,3172,3058,4192,79.3202,44.4869,45.5131,99.9626
1154,1155,614,1210,4150,269.447,1.10265,88.8974,99.9424
1155,1156,24257,2684,4220,268.514,20.1277,69.8723,99.8481
1156,1157,4819,891,4192,71.6576,38.0132,51.9868,99.951
1157,1158,885,130,4190,57.7906,78.521,11.479,99.9679
1158,1159,3381,2289,4212,265.16700000000003,21.6308,68.3692,99.9402
1159,1160,6152,2824,4227,266.883,54.1803,35.8197,99.96
1160,1161,522,2274,4184,260.595,21.1948,68.8052,99.9878
1161,1162,7893,964,4228,74.7081,69.9883,20.0117,99.9812
1162,1163,11464,696,4256,288.898,75.5937,14.4063,99.9782
1163,1164,2671,1523,4224,271.796,4.40137,85.5986,99.9781
1164,1165,24146,1132,4275,271.849,1.03915,88.9609,99.9627
1165,1166,27402,1833,4294,261.838,17.9725,72.0275,99.8706
1166,1167,762,257,4215,263.886,12.0292,77.9708,99.9781
1167,1168,978,2246,4210,85.5409,67.1941,22.8059,99.9959
1168,1169,14778,1626,4273,279.841,14.3884,75.6116,99.9681
1169,1170,857,2113,4217,257.063,53.9278,36.0722,99.9974
1170,1171,3843,577,4243,274.728,19.5764,70.4236,99.9565
1171,1172,10713,3031,4275,81.0129,44.576,45.424,99.9356
1172,1173,16224,2542,4271,268.491,8.825660000000003,81.1743,99.7254
1173,1174,643,2981,4224,283.261,49.6128,40.3872,99.9881
1174,1175,21230,2923,4348,255.029,6.70823,83.2918,99.5611
1175,1176,2318,2169,4242,75.9408,71.5958,18.4042,99.9503
1176,1177,1076,1020,4247,92.2772,64.3009,25.6991,99.9938
1177,1178,700,2096,4242,50.7313,80.5846,9.41542,99.9975
1178,1179,786,2220,4251,71.6083,16.7144,73.2856,99.978
1179,1180,26499,3123,4348,252.392,59.0811,30.9189,99.9219
1180,1181,26811,1427,4345,272.397,65.4573,24.5427,99.612
1181,1182,1895,2342,4259,81.6334,9.71573,80.2843,99.9811
1182,1183,1362,254,4287,262.563,12.6081,77.3919,99.9787
1183,1184,751,2088,4262,52.5658,80.9901,9.00992,99.9976
1184,1185,6833,903,4320,259.428,71.3768,18.6232,99.9265
1185,1186,6937,1684,4337,58.26300000000001,71.8664,18.1336,99.8138
1186,1187,4132,2160,4300,82.4787,74.0631,15.9369,99.9717
1187,1188,878,204,4303,82.0369,61.00100000000001,28.999,99.9862
1188,1189,18879,2023,4327,92.5313,11.3066,78.6934,99.7932
1189,1190,1988,1251,4297,89.3493,22.8151,67.1849,99.9968
1190,1191,15375,2291,4314,82.6424,9.80125,80.1988,99.9444
1191,1192,2893,989,4300,70.6315,80.4262,9.57384,99.9863
1192,1193,4153,2846,4328,74.2529,19.5871,70.4129,99.9952
1193,1194,30436,621,4353,88.1451,17.8949,72.1051,99.9317
1194,1195,3203,802,4322,94.7296,72.9668,17.0332,99.9963
1195,1196,10408,1006,4375,282.028,3.91763,86.0824,99.9635
1196,1197,637,2725,4306,252.34,68.1138,21.8862,99.9952
1197,1198,2410,1316,4316,89.6738,63.6509,26.3491,99.9905
1198,1199,684,1376,4311,230.524,74.1193,15.8807,99.9886
1199,1200,33752,2565,4382,268.137,8.55798,81.442,99.8641
1200,1201,4139,2801,4356,98.0928,47.6549,42.3451,99.9912
1201,1202,1138,64,4345,266.361,23.0347,66.9653,99.7203
1202,1203,17252,1183,4396,261.79200000000003,17.2283,72.7717,99.9324
1203,1204,22422,2346,4400,82.1492,9.96801,80.032,99.8551
1204,1205,800,408,4337,83.3462,55.3315,34.6685,99.981
1205,1206,1756,2735,4354,250.195,68.5806,21.4194,99.9366
1206,1207,1096,1255,4363,86.8907,22.4732,67.5268,99.9758
1207,1208,3545,1542,4378,282.196,68.0109,21.9891,99.99
1208,1209,1039,2161,4358,69.6779,84.0766,5.92341,99.9903
1209,1210,1086,838,4361,263.04200000000003,68.73100000000001,21.269,99.9868
1210,1211,2383,2770,4391,75.2959,19.4065,70.5935,99.9883
1211,1212,2068,184,4414,70.8309,75.3399,14.6602,99.9213
1212,1213,7033,1806,4404,262.515,16.4059,73.5941,99.9776
1213,1214,11555,2036,4415,92.1422,11.5409,78.4591,99.9206
1214,1215,2424,1670,4393,61.3207,72.2067,17.7933,99.9506
1215,1216,1239,2162,4394,253.55900000000003,55.6851,34.3149,99.9698
1216,1217,6273,457,4442,90.1064,48.8529,41.1471,99.8906
1217,1218,3509,854,4397,112.863,74.5276,15.4724,99.9912
1218,1219,1084,1487,4402,76.2483,80.5131,9.48686,99.9885
1219,1220,7805,399,4460,82.0014,55.5795,34.4205,99.9579
1220,1221,61068,658,4502,85.7129,25.6679,64.3321,86.7216
1221,1222,3976,1581,4428,276.521,68.5203,21.4797,99.9685
1222,1223,27625,1037,4490,271.933,14.140999999999998,75.859,96.6065
1223,1224,1333,1712,4413,95.7913,29.2993,60.7007,99.9973
1224,1225,56734,1887,4524,82.7165,61.6064,28.3936,79.8113
1225,1226,7763,2234,4466,265.107,61.15,28.85,99.981
1226,1227,5631,3160,4446,74.5238,1.32446,88.6755,99.9929
1227,1228,3915,3029,4445,84.4903,24.5961,65.4039,99.9699
1228,1229,19031,2200,4528,264.862,15.1822,74.8178,85.3284
1229,1230,6786,859,4481,106.422,75.3826,14.6174,99.7106
1230,1231,21817,1382,4538,69.7652,68.241,21.759,79.3167
1231,1232,32146,2683,4507,85.1073,55.6426,34.3574,99.8224
1232,1233,3470,1653,4459,278.314,82.4985,7.50148,99.9726
1233,1234,6355,3183,4507,77.2785,5.659,84.34100000000002,95.7853
1234,1235,3456,3074,4467,254.115,33.6039,56.3961,99.9905
1235,1236,1225,1702,4459,56.8347,73.6375,16.3625,99.9715
1236,1237,569,1133,4443,262.644,17.229,72.771,99.9726
1237,1238,12431,1270,4501,92.4053,46.5889,43.4111,99.645
1238,1239,17491,2828,4535,260.382,15.9505,74.0495,99.979
1239,1240,20675,1536,4528,57.3509,83.44,6.56003,72.2839
1240,1241,1499,2481,4480,85.6269,79.4315,10.5685,99.984
1241,1242,503,179,4487,84.816,37.2224,52.7776,99.9603
1242,1243,1191,2045,4482,90.9194,12.0892,77.9108,99.977
1243,1244,18093,2996,4536,94.6588,35.5833,54.4167,99.688
1244,1245,8895,2380,4546,263.296,8.44161,81.5584,99.9151
1245,1246,525,2351,4505,262.458,8.25404,81.74600000000002,99.9799
1246,1247,548,2528,4504,85.9986,76.8606,13.1394,99.9787
1247,1248,8617,2476,4551,272.04,34.1182,55.8818,99.899
1248,1249,670,370,4530,48.2968,83.1007,6.89933,99.986
1249,1250,12981,410,4595,82.3446,66.9688,23.0312,99.9664
1250,1251,4048,217,4598,88.1832,36.4212,53.5788,99.9835
1251,1252,2136,3194,4574,259.155,0.377823,89.6222,99.9651
1252,1253,3547,1112,4581,92.4088,11.191,78.809,99.9665
1253,1254,2425,1636,4572,268.075,1.95951,88.0405,99.9907
1254,1255,4850,1188,4576,266.467,20.7112,69.2888,99.9845
1255,1256,4457,1045,4579,273.039,9.12672,80.8733,99.947
1256,1257,2953,936,4568,61.6002,79.4588,10.5412,99.9703
1257,1258,3301,2577,4586,259.05,21.3714,68.6286,99.9041
1258,1259,1627,1751,4599,266.353,0.7147600000000001,89.2852,99.9893
1259,1260,843,3229,4609,259.814,0.874077,89.1259,99.964
1260,1261,7954,623,4625,266.869,81.5651,8.43487,99.9554
1261,1262,8219,846,4621,264.782,7.7816800000000015,82.2183,99.9178
1262,1263,568,1706,4599,92.0919,29.6211,60.3789,99.9887
1263,1264,940,1251,4603,257.774,64.595,25.405,99.9612
1264,1265,1338,1526,4603,246.408,54.7148,35.2852,99.9801
1265,1266,762,2101,4604,240.156,61.1112,28.8888,99.9898
1266,1267,3899,2207,4612,261.253,20.9257,69.0743,99.8219
1267,1268,767,1566,4612,232.465,50.6179,39.3821,99.964
1268,1269,1001,2336,4617,266.35900000000004,8.21746,81.7825,99.9785
1269,1270,957,475,4621,89.1629,53.5818,36.4182,99.9713
1270,1271,1035,959,4625,91.5912,81.4501,8.54989,99.99
1271,1272,1037,2944,4624,96.9942,34.3522,55.6478,99.9113
1272,1273,6516,2002,4637,265.103,27.6699,62.3301,99.9216
1273,1274,1472,2748,4636,262.251,16.4652,73.5348,99.9603
1274,1275,747,1871,4627,75.9296,59.2445,30.7555,99.9623
1275,1276,2110,1149,4630,87.3952,13.2585,76.7415,99.9828
1276,1277,529,720,4633,250.811,81.2985,8.70149,99.9977
1277,1278,511,2480,4630,265.84,20.9856,69.0144,99.9756
1278,1279,626,1243,4638,244.225,63.6097,26.3903,99.9666
1279,1280,514,523,4643,235.631,80.4038,9.59618,99.8237
1280,1281,1006,2136,4632,265.399,24.3051,65.6949,99.956
1281,1282,886,1809,4651,76.0169,57.949,32.051,99.9291
1282,1283,1385,2256,4658,79.2486,56.8701,33.1299,99.9373
1283,1284,556,2190,4648,263.856,23.543000000000006,66.457,99.9766
1284,1285,786,1305,4662,74.8072,76.0003,13.9997,99.9543
1285,1286,514,373,4658,81.7877,67.2933,22.7067,99.9708
1286,1287,530,1006,4671,282.083,68.2047,21.7953,99.9234
1287,1288,674,716,4663,244.338,81.5094,8.49062,99.9905
