,Grain No.,Size [Pixel],center x-coordinate,center y-coordinate,mean azimuth [degree],mean latitude [degree],mean colatitude [degree],Regelungsgrad [%]
0,1,89081,545,213,237.108,83.51100000000002,6.48897,91.0882
1,2,43115,1279,167,301.191,75.7245,14.2755,99.8443
2,3,80835,1513,254,178.49,72.1412,17.8588,83.1902
3,4,297507,1085,405,180.146,29.4113,60.5887,67.5742
4,5,1682,1714,86,356.6869999999999,68.4565,21.5435,99.646
5,6,2936,1848,84,348.3880000000001,47.3,42.7,99.9004
6,7,14853,1902,150,335.2519999999999,77.8457,12.1543,99.9657
7,8,1867,2018,104,169.93400000000003,36.9835,53.0165,99.7007
8,9,7504,2131,118,327.514,80.3972,9.60281,99.9122
9,10,34655,2393,155,347.423,48.5653,41.4347,99.4755
10,11,5527,2510,115,339.045,75.5211,14.4789,99.9398
11,12,2789,2785,107,189.761,6.6328,83.3672,99.9672
12,13,90203,3173,197,8.65815,19.6129,70.3871,99.7172
13,14,48293,1758,244,4.99064,17.1499,72.8501,99.9669
14,15,29594,2720,204,168.505,7.052039999999999,82.948,99.902
15,16,1070,262,141,3.980080000000001,1.14955,88.8504,99.9985
16,17,523,129,135,3.44745,1.22133,88.7787,99.992
17,18,1208,2593,156,168.918,22.3558,67.6442,99.9951
18,19,1671,2040,157,172.143,27.0794,62.9206,99.9937
19,20,544,1994,150,341.606,72.627,17.373,99.9065
20,21,15919,358,245,356.838,48.7549,41.2451,99.9947
21,22,13701,3071,252,172.71,4.9023400000000015,85.0977,99.964
22,23,828,134,190,2.6548,1.60005,88.3999,99.9845
23,24,4244,2153,203,171.731,30.1761,59.8239,99.9737
24,25,53081,2025,301,342.8590000000001,44.4111,45.5889,99.9839
25,26,18306,2238,256,332.594,72.3163,17.6837,99.9589
26,27,3054,246,222,1.14698,1.3993,88.6007,99.9818
27,28,584,3013,205,323.447,75.41199999999998,14.588,99.8595
28,29,1442,2331,212,168.17,29.4811,60.5189,99.9953
29,30,50242,2505,318,351.847,20.1011,69.8989,99.9143
30,31,549,2875,237,320.275,71.7505,18.2495,99.8559
31,32,1605,3002,244,161.358,5.21134,84.7887,99.8671
32,33,2294,2963,271,321.974,74.2727,15.7273,99.9542
33,34,2264,941,286,359.337,71.529,18.471,99.9663
34,35,1483,2319,307,347.524,36.0529,53.9471,98.6229
35,36,803,2670,273,171.671,6.94465,83.0554,99.994
36,37,50088,274,408,349.921,35.30300000000001,54.697,99.4562
37,38,1474,1103,311,7.55858,71.1771,18.8229,99.9756
38,39,60703,2858,414,181.28,43.7343,46.2657,99.9458
39,40,27592,3165,385,173.298,44.1815,45.8185,99.8961
40,41,999,1606,310,174.653,39.4703,50.5297,99.9977
41,42,10927,2720,368,167.102,13.932,76.068,99.8099
42,43,773,676,312,187.227,78.8728,11.1272,98.9508
43,44,1116,1664,322,215.188,82.87100000000002,7.128989999999999,99.9884
44,45,7443,2270,371,353.6090000000001,58.6518,31.3482,99.9792
45,46,2600,3431,362,355.711,0.4566270000000001,89.5434,99.9587
46,47,30455,1714,422,353.844,30.5434,59.4566,99.5399
47,48,5864,2187,388,351.501,62.6824,27.3176,99.7161
48,49,10307,1876,399,354.103,52.9704,37.0296,99.9278
49,50,21821,2472,455,321.457,82.7302,7.2698399999999985,92.0612
50,51,6297,584,367,358.63199999999995,70.3755,19.6245,99.9868
51,52,524,683,347,210.021,78.0355,11.9645,99.9931
52,53,8881,2060,442,179.233,42.5874,47.4126,99.9753
53,54,4905,714,390,182.69,31.3055,58.6945,99.9969
54,55,509,3391,376,357.784,0.8196110000000001,89.1804,99.9773
55,56,4681,638,403,177.578,2.81271,87.1873,99.9933
56,57,505,3053,384,172.479,37.4641,52.5359,98.4434
57,58,1389,3431,414,350.67,39.7083,50.2917,99.8299
58,59,1779,3256,416,357.204,11.5277,78.4723,99.99
59,60,4126,3083,445,173.833,49.8622,40.1378,99.806
60,61,45463,2249,514,170.145,13.1938,76.8062,99.8513
61,62,2215,755,433,218.909,77.6244,12.3756,99.9882
62,63,7501,3328,449,359.225,1.21822,88.7818,99.9867
63,64,3237,678,463,351.736,8.547419999999999,81.4526,99.9837
64,65,61815,472,668,349.59,26.2862,63.7138,90.5367
65,66,2290,609,469,170.87599999999995,45.2396,44.7604,99.7708
66,67,3626,1880,480,286.143,80.7929,9.20707,99.9095
67,68,536,407,465,358.583,19.2193,70.7807,99.9983
68,69,725,2111,457,355.144,60.4342,29.5658,99.9584
69,70,9981,3249,548,2.5931,5.63476,84.3652,99.8682
70,71,13196,745,534,169.968,44.2393,45.7607,99.9813
71,72,89214,2753,634,0.8325450000000001,11.9083,78.0917,99.6472
72,73,1577,3101,502,350.715,8.05199,81.948,99.9866
73,74,42404,1886,600,0.217236,40.5127,49.4873,99.7997
74,75,6794,3355,516,185.002,58.3337,31.6663,99.9408
75,76,1066,3434,507,186.149,57.4657,32.5343,99.7313
76,77,18991,1664,540,1.1093,1.4526,88.5474,98.6674
77,78,1009,3040,511,169.424,52.4694,37.5306,99.8967
78,79,7363,219,562,173.06400000000005,47.5987,42.4013,99.9159
79,80,22926,3124,588,178.08599999999996,36.3997,53.6003,99.9046
80,81,3572,597,536,4.22882,0.167664,89.8323,99.8372
81,82,1566,665,537,177.94400000000005,2.93561,87.0644,99.9545
82,83,2079,333,548,343.897,9.01522,80.9848,99.9958
83,84,4132,2090,555,182.803,47.1504,42.8496,99.9734
84,85,1571,3430,566,187.093,62.6003,27.3997,99.7979
85,86,1628,364,584,172.61700000000005,49.0658,40.9342,99.9456
86,87,10705,2418,605,155.64700000000005,57.073,32.927,99.9744
87,88,6234,3361,616,2.13855,10.9826,79.0174,99.9645
88,89,875,3338,568,182.267,64.4034,25.5966,99.8045
89,90,2127,1371,568,168.472,43.379,46.621,99.9982
90,91,4681,1282,598,348.184,68.3242,21.6759,99.9744
91,92,854,294,589,185.829,53.3466,36.6534,99.976
92,93,500,3305,595,190.878,61.3075,28.6925,99.976
93,94,26639,680,661,253.98,77.9927,12.0073,99.9169
94,95,953,2020,606,177.325,24.0327,65.9673,99.7151
95,96,8085,2265,648,348.135,40.5685,49.4315,99.6936
96,97,526,2100,607,175.213,28.5223,61.4777,99.9541
97,98,2269,354,633,353.7990000000001,10.7898,79.2102,99.1647
98,99,2077,1736,622,347.912,51.7829,38.2171,99.9693
99,100,5722,1650,633,354.68,49.9882,40.0118,99.1138
100,101,26277,2082,697,173.051,35.4818,54.5182,96.7482
101,102,3356,813,646,342.537,67.6207,22.3793,99.7823
102,103,11378,238,675,202.83900000000003,73.6546,16.3454,99.9247
103,104,4252,2532,658,357.786,22.443,67.557,99.9927
104,105,25334,963,723,350.3769999999999,13.0753,76.9247,72.9314
105,106,1449,1327,641,172.80599999999995,53.5821,36.4179,99.9969
106,107,5505,3089,696,165.71900000000005,73.1085,16.8915,99.9187
107,108,1724,1471,659,175.455,18.4637,71.5363,99.9697
108,109,29884,1307,766,168.84599999999998,33.5712,56.4288,99.9577
109,110,60280,1547,820,172.312,23.7888,66.2112,52.4779
110,111,2255,2291,657,310.786,81.4732,8.526819999999999,99.9864
111,112,4029,3226,674,358.58,65.0125,24.9875,99.9768
112,113,6101,2453,688,201.327,62.2373,27.7627,99.9765
113,114,7135,383,692,182.517,3.71601,86.28399999999998,99.9728
114,115,18253,3295,740,345.171,35.2343,54.7657,99.9318
115,116,13177,1182,705,349.491,52.117,37.883,99.9641
116,117,38038,2975,766,182.186,23.6375,66.3625,99.964
117,118,1635,3375,678,163.46,73.1213,16.8787,99.9871
118,119,4851,2346,694,157.235,56.6136,33.3864,99.9936
119,120,527,1726,674,2.2586,39.6888,50.3112,99.6291
120,121,3529,3156,698,325.623,69.5373,20.4627,99.9943
121,122,8151,1890,744,354.531,47.9147,42.0853,99.9833
122,123,12399,1727,769,178.25099999999995,55.6082,34.3918,99.9367
123,124,25648,823,778,328.297,67.5879,22.4121,99.923
124,125,2233,2538,727,354.635,74.4277,15.5723,99.9905
125,126,1340,595,723,338.652,32.9265,57.0735,99.8178
126,127,1399,1055,728,194.515,79.2536,10.7464,99.9373
127,128,89073,2533,964,166.916,31.6981,58.3019,91.7281
128,129,1130,2378,739,353.497,4.4722300000000015,85.5278,99.9778
129,130,891,3425,746,351.601,63.8469,26.1531,99.9322
130,131,15674,220,794,338.94199999999995,75.4827,14.5173,99.9201
131,132,3592,670,759,176.498,3.60851,86.3915,99.9937
132,133,1732,1081,760,351.59,11.8622,78.1378,99.9989
133,134,932,621,761,178.75,71.0181,18.9819,99.9646
134,135,5144,2491,785,348.946,4.46999,85.53,99.7887
135,136,15473,1151,816,171.601,11.9341,78.0659,99.9893
136,137,7186,2380,801,172.989,6.05541,83.9446,99.9687
137,138,40545,2091,859,168.72,29.8091,60.1909,96.4186
138,139,1152,3139,768,357.546,3.83849,86.1615,99.9962
139,140,637,1028,768,310.088,71.26,18.74,99.5325
140,141,1581,2145,775,353.2519999999999,42.5822,47.4178,99.9964
141,142,1050,2185,779,359.789,44.8067,45.1933,99.8268
142,143,880,1461,774,353.115,17.9327,72.0673,99.9885
143,144,742,2249,787,0.28453,5.70404,84.296,99.999
144,145,744,3408,792,353.665,26.7905,63.2095,99.7083
145,146,552,1951,791,357.296,49.99100000000001,40.009,99.9054
146,147,1392,3374,803,355.1090000000001,11.7518,78.2482,99.9798
147,148,74920,3220,930,162.415,67.8613,22.1387,99.8247
148,149,7206,2598,820,177.55,14.8273,75.1727,99.9428
149,150,1126,1922,805,174.718,44.3883,45.6117,99.9936
150,151,27045,512,875,357.01,26.3602,63.6398,98.9295
151,152,31239,1750,866,355.136,20.7853,69.2147,99.9649
152,153,45672,2740,905,347.135,19.1616,70.8384,99.9605
153,154,9946,302,893,193.227,67.4005,22.5995,99.9163
154,155,1350,3216,833,347.392,37.3754,52.6246,99.9935
155,156,2392,932,838,170.778,31.3341,58.6659,99.9944
156,157,1234,2541,845,2.21727,12.3431,77.6569,99.9145
157,158,787,841,840,169.544,28.9939,61.0061,99.9265
158,159,11122,228,923,192.925,70.5731,19.4269,99.8948
159,160,2052,1904,857,355.92,41.8855,48.1145,99.9753
160,161,14359,780,935,176.055,9.52358,80.4764,99.9725
161,162,13718,1362,917,350.259,27.743,62.257,99.9272
162,163,504,721,855,177.572,2.91301,87.087,99.9904
163,164,546,653,868,354.341,31.2315,58.7685,99.988
164,165,147174,1091,1091,349.764,28.4286,61.5714,73.3175
165,166,559,2883,872,176.641,4.28811,85.7119,99.9845
166,167,1359,652,898,172.76,65.6217,24.3783,99.8107
167,168,9844,2928,923,357.485,26.9554,63.0446,99.7386
168,169,2823,716,895,187.092,67.2625,22.7375,99.9941
169,170,610,851,884,169.66,68.0964,21.9036,99.971
170,171,4484,1914,919,177.69,48.0627,41.9373,99.9427
171,172,1096,585,927,176.713,67.8767,22.1233,99.9729
172,173,25814,2246,982,353.4369999999999,31.0615,58.9385,99.9685
173,174,864,1803,930,355.564,13.7134,76.2866,99.9938
174,175,3001,621,949,162.685,55.2145,34.7855,99.9932
175,176,4309,404,949,358.557,1.29755,88.7024,99.976
176,177,1680,706,947,188.042,83.1752,6.824839999999999,99.9857
177,178,6011,1645,964,187.135,64.6217,25.3783,99.9804
178,179,15865,1916,989,171.185,17.3214,72.6786,97.0059
179,180,1692,2046,969,172.405,51.5964,38.4036,99.9317
180,181,36810,462,1082,172.106,42.4151,47.5849,99.8834
181,182,2042,1075,961,177.234,3.74957,86.2504,99.9964
182,183,3175,2984,973,168.265,24.4568,65.5432,99.9101
183,184,14160,1747,1018,147.029,77.7281,12.2719,98.8907
184,185,589,1723,972,185.297,61.3849,28.6151,99.8635
185,186,4916,2618,988,189.969,63.2605,26.7395,99.9455
186,187,5439,3051,1018,4.37449,3.00628,86.9937,99.9821
187,188,1728,343,995,337.005,26.169,63.831,99.9495
188,189,6601,611,1000,198.466,69.243,20.757,98.9819
189,190,1206,1095,990,353.165,10.2445,79.7555,99.9896
190,191,1608,1019,997,178.993,44.4352,45.5648,99.9635
191,192,1619,3426,1022,175.475,0.683228,89.3168,99.9172
192,193,2565,869,1007,179.07,72.6733,17.3267,98.976
193,194,19807,1401,1041,351.495,11.5499,78.4501,98.2295
194,195,13763,2072,1063,358.444,13.6071,76.3929,99.628
195,196,1711,239,1022,174.255,60.3917,29.6083,99.9408
196,197,2324,276,1063,169.80200000000005,47.9144,42.0856,99.9457
197,198,3743,2995,1064,167.24400000000003,60.2396,29.7604,99.7831
198,199,7745,647,1067,345.005,55.2189,34.7811,99.9581
199,200,1109,1838,1053,6.47839,83.0437,6.956289999999999,99.9899
200,201,1898,1215,1053,161.02,2.41721,87.5828,99.9947
201,202,3498,1568,1060,201.279,78.2304,11.7696,99.7489
202,203,2322,2247,1066,179.273,13.2164,76.7836,99.9867
203,204,5407,3090,1089,0.698415,4.08995,85.91,99.8563
204,205,2370,878,1066,351.125,55.0674,34.9326,99.9898
205,206,9206,1683,1084,190.967,74.1862,15.8138,99.9811
206,207,1520,197,1094,179.899,35.6072,54.3928,99.9197
207,208,1911,557,1067,338.75699999999995,51.237,38.76300000000001,99.9918
208,209,13212,1296,1100,173.158,7.32371,82.6763,99.9583
209,210,12311,788,1102,340.764,23.2422,66.7578,99.9967
210,211,2572,2181,1083,172.928,88.8167,1.18333,99.9599
211,212,100197,1927,1254,357.329,28.1502,61.8498,99.72
212,213,37788,2568,1152,329.722,83.0678,6.9322,99.7725
213,214,13936,3249,1111,175.31099999999995,4.54691,85.4531,99.9348
214,215,566,377,1078,348.9480000000001,0.34617600000000004,89.6538,99.9992
215,216,870,2291,1087,116.885,86.6853,3.31467,99.9821
216,217,11819,1581,1161,351.55800000000005,28.9429,61.0571,99.983
217,218,15153,297,1143,343.5680000000001,48.9586,41.0414,99.6145
218,219,3277,1769,1127,204.686,77.9791,12.0209,99.9817
219,220,1276,1835,1111,171.27599999999995,11.5402,78.4598,99.9938
220,221,7012,2708,1114,181.977,62.0277,27.9723,99.9916
221,222,711,1807,1103,353.788,7.2480699999999985,82.7519,99.9965
222,223,21604,2961,1187,2.40746,5.49521,84.5048,99.8115
223,224,14471,2370,1159,348.115,57.659,32.341,99.9387
224,225,3053,2837,1131,356.477,0.5628810000000001,89.4371,99.9992
225,226,1232,1417,1119,350.2390000000001,9.29814,80.7019,99.9783
226,227,48286,2222,1262,156.914,65.9424,24.0576,99.6713
227,228,870,3409,1119,173.35299999999995,45.615,44.385,99.9149
228,229,53569,1398,1278,183.297,40.5816,49.4184,53.7392
229,230,3068,3341,1141,166.377,40.7113,49.2887,99.8726
230,231,1523,872,1132,175.482,10.0854,79.9146,99.9936
231,232,5881,600,1163,341.184,23.4691,66.5309,99.9831
232,233,2858,3159,1159,358.955,7.932,82.068,99.957
233,234,844,2798,1146,177.759,1.39431,88.6057,99.9941
234,235,11975,689,1181,351.372,55.0422,34.9578,99.9862
235,236,8685,1692,1174,170.82,13.3434,76.6566,99.9286
236,237,1484,208,1179,346.372,49.4714,40.5286,99.9368
237,238,1780,379,1161,169.27200000000005,42.2248,47.7752,99.9935
238,239,33024,822,1281,347.918,6.0378300000000005,83.9622,99.9254
239,240,548,2793,1178,177.112,47.6533,42.3467,99.8712
240,241,619,3417,1176,347.792,29.5922,60.4078,99.9777
241,242,1822,3050,1191,2.19635,3.47413,86.5259,99.9987
242,243,7995,3116,1233,166.732,70.73100000000002,19.269,99.9811
243,244,1078,2829,1215,356.066,1.7327400000000002,88.2673,99.9133
244,245,590,3214,1192,3.66021,5.57365,84.4263,99.9867
245,246,13346,3249,1283,182.38,9.6506,80.3494,99.9226
246,247,4614,378,1224,178.11,5.73785,84.2621,99.9684
247,248,52488,2532,1325,171.392,19.2989,70.7011,99.7014
248,249,19696,327,1321,6.25669,33.5814,56.4186,99.9047
249,250,698,2797,1218,356.1880000000001,1.59364,88.4064,99.985
250,251,14735,455,1337,346.15,19.8729,70.1271,92.3032
251,252,15003,2721,1262,181.713,54.0947,35.9053,99.9473
252,253,3371,497,1257,180.163,6.32304,83.677,99.804
253,254,14107,1639,1276,178.551,46.2058,43.7942,99.9463
254,255,1840,599,1244,191.84,68.2775,21.7226,99.9922
255,256,1876,3027,1256,357.969,5.87438,84.1256,99.9886
256,257,16817,977,1320,182.11,57.9174,32.0826,99.748
257,258,2172,229,1274,4.8611,26.5841,63.4159,99.8674
258,259,3098,2875,1262,180.364,52.0708,37.9292,99.993
259,260,7027,676,1279,179.324,3.66513,86.3349,99.9727
260,261,549,3406,1285,177.636,9.98413,80.0159,99.9608
261,262,16494,1684,1350,171.912,18.1138,71.8862,99.9874
262,263,11578,2864,1323,167.451,64.6192,25.3808,99.9151
263,264,12866,2090,1353,178.378,7.5053800000000015,82.4946,99.9902
264,265,888,3007,1294,355.89,7.76202,82.238,99.9776
265,266,8715,3064,1332,278.715,86.2731,3.72694,99.9565
266,267,4493,3153,1325,357.273,6.4619800000000005,83.538,99.9885
267,268,16932,580,1362,159.57,1.26397,88.736,99.8011
268,269,2055,2965,1317,1.42221,10.966,79.03399999999998,99.9651
269,270,1109,2164,1304,151.319,79.9924,10.0076,99.9181
270,271,981,1527,1319,359.36300000000006,2.0780000000000003,87.92200000000003,99.9725
271,272,2149,1063,1331,200.596,72.9954,17.0046,99.9837
272,273,688,1013,1320,193.656,73.5925,16.4075,99.994
273,274,10017,2343,1381,187.198,8.16663,81.8334,99.8886
274,275,3936,279,1391,3.94962,33.4511,56.5489,99.8558
275,276,4290,1523,1365,358.223,0.909607,89.0904,99.9679
276,277,3057,720,1370,191.558,64.7109,25.2891,99.9312
277,278,877,3194,1362,181.59,8.61588,81.3841,99.921
278,279,12426,1143,1394,172.459,28.6266,61.3734,99.9765
279,280,5926,3353,1401,349.602,8.372489999999999,81.6275,99.9827
280,281,10009,2941,1405,172.456,21.5746,68.4254,99.8238
281,282,903,1559,1382,196.977,79.3423,10.6577,99.7873
282,283,4754,2774,1396,239.923,87.4154,2.5846,99.9868
283,284,1498,3212,1400,179.625,20.49,69.51,99.9728
284,285,2472,3089,1403,176.75099999999995,20.8286,69.1714,99.9185
285,286,2166,674,1407,186.539,53.3257,36.6743,99.9261
286,287,14733,802,1450,186.322,10.2592,79.7408,99.9271
287,288,1929,2454,1400,353.552,54.2442,35.7558,99.9951
288,289,87256,1683,1515,185.162,72.63,17.37,98.8116
289,290,4848,2532,1452,188.329,7.053960000000001,82.946,99.9122
290,291,5357,3295,1437,187.174,73.4278,16.5722,99.9661
291,292,10346,925,1491,174.24200000000005,7.802510000000002,82.1975,99.932
292,293,12853,1017,1455,187.201,2.05668,87.9433,99.4467
293,294,3329,369,1445,178.75400000000005,61.0781,28.9219,99.9755
294,295,9159,2874,1472,181.336,7.52118,82.4788,99.9148
295,296,1524,3160,1427,254.602,84.961,5.0389800000000005,99.2477
296,297,4242,1901,1439,353.724,4.15677,85.8432,99.9841
297,298,1871,2627,1428,354.4840000000001,29.8923,60.1077,99.8578
298,299,15917,1308,1469,170.84400000000005,30.6082,59.3918,99.8697
299,300,55713,2145,1527,356.45,22.6937,67.3063,99.8064
300,301,668,309,1441,4.09985,40.576,49.424,99.9642
301,302,10208,2397,1501,163.621,20.0161,69.9839,99.9074
302,303,1421,3099,1440,224.171,86.5371,3.46295,99.9686
303,304,10410,3199,1489,6.43267,6.30286,83.6971,99.9964
304,305,99223,2944,1709,172.21099999999996,10.4907,79.5093,98.7318
305,306,20380,612,1490,189.682,67.127,22.873,99.3672
306,307,1061,2953,1446,343.516,80.9252,9.07478,99.9873
307,308,6031,460,1467,347.611,28.8706,61.1294,99.7623
308,309,4930,2471,1480,175.6,23.0483,66.9517,99.9211
309,310,561,3046,1450,250.12,83.9808,6.01923,99.9184
310,311,4750,1136,1476,355.569,3.97475,86.0252,99.9745
311,312,39703,2612,1579,354.05300000000005,7.64262,82.3574,99.6967
312,313,2701,3116,1474,191.46400000000003,70.7181,19.2819,99.9694
313,314,658,296,1465,346.13199999999995,50.6652,39.3348,99.9482
314,315,2206,1203,1481,178.764,57.7667,32.2333,99.9891
315,316,993,2947,1481,269.328,85.0287,4.97126,99.9934
316,317,18678,382,1559,343.923,26.7606,63.2394,91.1825
317,318,2603,3354,1502,309.696,85.4219,4.57815,99.9489
318,319,578,306,1496,346.596,20.5069,69.4931,99.552
319,320,2215,1070,1523,168.826,64.3862,25.6138,97.3765
320,321,1839,1426,1509,350.321,4.49069,85.5093,99.6255
321,322,9410,3237,1572,340.36800000000005,78.1358,11.8642,98.9142
322,323,1360,856,1502,176.483,64.8479,25.1521,99.3925
323,324,4195,3113,1536,172.49599999999995,65.637,24.363000000000003,99.0918
324,325,3905,3401,1545,344.712,48.331,41.669,99.6236
325,326,581,310,1543,352.9240000000001,24.281,65.719,99.9788
326,327,38651,1225,1673,353.846,53.4384,36.5616,99.9257
327,328,939,1404,1540,351.482,2.70722,87.2928,99.9939
328,329,1832,771,1547,350.5490000000001,19.389,70.611,99.9856
329,330,861,1164,1538,168.541,31.6173,58.3827,99.9855
330,331,1210,843,1542,351.029,23.4437,66.5563,99.9973
331,332,8345,1446,1599,351.494,62.1693,27.8307,99.7828
332,333,1015,1350,1551,347.779,4.68353,85.3165,99.9869
333,334,23823,685,1667,182.278,42.5382,47.4618,99.8961
334,335,6934,539,1577,331.22,53.8135,36.1865,99.9457
335,336,10742,1087,1600,174.31,1.54359,88.4564,99.9844
336,337,3808,708,1572,344.9369999999999,52.125,37.875,99.996
337,338,3080,3313,1570,342.385,78.8197,11.1803,99.7387
338,339,117422,2350,1782,171.25099999999995,25.9125,64.0875,99.4665
339,340,2858,3078,1579,340.25699999999995,70.8264,19.1736,99.605
340,341,1857,1289,1581,347.991,2.4341,87.5659,99.9713
341,342,996,877,1569,181.338,43.2135,46.7865,99.4238
342,343,16885,872,1625,177.326,1.05275,88.9473,99.9449
343,344,1209,822,1582,168.065,69.6139,20.3861,99.8357
344,345,2540,1152,1624,177.28099999999995,1.93846,88.0615,99.9969
345,346,5766,1837,1609,354.797,61.2684,28.7316,99.9457
346,347,3254,474,1606,182.611,64.7607,25.2393,99.9699
347,348,4492,1567,1622,348.9240000000001,5.75917,84.2408,99.9696
348,349,7068,3363,1635,167.34400000000005,39.3643,50.6357,99.834
349,350,645,2262,1597,14.9194,74.5982,15.4018,99.8835
350,351,718,1363,1600,348.73800000000006,3.75024,86.2498,99.9857
351,352,3377,3290,1634,169.27599999999995,37.4465,52.5535,99.919
352,353,2779,1910,1624,171.078,19.2928,70.7072,99.9885
353,354,1187,3152,1615,178.30900000000003,16.8744,73.1256,99.9984
354,355,1521,2764,1632,164.002,23.83,66.17,99.8947
355,356,939,1976,1632,350.556,31.9091,58.0909,99.9344
356,357,597,3045,1625,149.341,67.9098,22.0902,99.9767
357,358,3451,1385,1676,201.9,72.941,17.059,99.95
358,359,921,358,1639,174.60299999999995,43.6247,46.3753,99.9931
359,360,3938,1472,1673,200.765,71.9245,18.0755,99.8464
360,361,10365,560,1684,352.03,52.6407,37.3593,99.9864
361,362,9625,451,1689,175.762,44.0871,45.9129,99.9588
362,363,13378,3114,1712,319.918,72.6472,17.3528,99.9392
363,364,5663,336,1693,175.08900000000003,48.1282,41.8718,99.487
364,365,9878,2006,1687,200.575,74.6454,15.3546,99.932
365,366,984,3037,1656,326.12,74.256,15.744000000000002,99.9658
366,367,1144,3223,1653,175.792,40.0155,49.9845,99.9878
367,368,8532,1805,1729,348.5540000000001,35.0024,54.9976,99.7781
368,369,4121,1747,1686,347.04,60.879,29.121,99.9562
369,370,837,786,1677,176.173,1.16537,88.8346,99.997
370,371,2313,2712,1676,337.336,75.4711,14.5289,99.9296
371,372,21989,3238,1760,171.616,8.3512,81.6488,99.9007
372,373,696,2102,1670,1.49112,13.3004,76.6996,99.9983
373,374,17949,1662,1753,158.52700000000004,48.7897,41.2103,99.9408
374,375,27394,937,1741,197.467,73.3454,16.6546,99.9452
375,376,1390,1867,1694,347.534,34.9407,55.0593,99.966
376,377,5089,1547,1711,343.5080000000001,65.8262,24.1738,99.9583
377,378,1533,2768,1708,167.391,6.1217,83.8783,99.9203
378,379,4742,2180,1742,1.85305,20.7347,69.2653,99.9421
379,380,1303,3349,1716,339.177,58.7703,31.2297,99.8865
380,381,11421,1926,1746,181.314,64.4802,25.5198,99.8649
381,382,19439,2646,1794,183.216,25.0929,64.9071,99.9396
382,383,596,2711,1727,337.216,66.5535,23.4465,99.9821
383,384,1761,798,1732,347.168,31.2845,58.7155,99.9874
384,385,35947,2845,1827,343.755,69.6918,20.3082,99.856
385,386,43408,604,1826,185.219,68.7319,21.2681,99.8767
386,387,808,1435,1744,172.834,17.1643,72.8357,99.9965
387,388,5086,3344,1780,170.15599999999995,10.1272,79.8728,99.9783
388,389,6193,2059,1771,0.48608,19.5226,70.4774,99.8891
389,390,48716,1251,1852,176.71900000000005,50.0645,39.9355,99.8564
390,391,14142,346,1804,349.909,36.3233,53.6767,99.7892
391,392,650,1442,1773,174.06900000000005,12.4428,77.5572,99.9929
392,393,27879,1513,1841,186.029,41.0183,48.9817,99.9813
393,394,548,2285,1756,326.453,59.2,30.8,99.9924
394,395,5182,1244,1774,190.992,70.4064,19.5936,99.8907
395,396,1152,2485,1774,354.827,67.6343,22.3657,99.9851
396,397,600,2125,1768,0.337043,10.8286,79.1714,99.9865
397,398,1245,2285,1787,175.86700000000005,21.6432,68.3568,99.98
398,399,874,1362,1795,183.935,66.9829,23.0171,99.9777
399,400,12114,2172,1818,1.56707,11.091,78.90899999999998,99.9864
400,401,740,2316,1800,1.39267,72.5319,17.4681,99.9648
401,402,1869,460,1835,151.57399999999996,75.5713,14.4287,99.9732
402,403,14754,3163,1864,339.957,63.5397,26.4603,99.8872
403,404,863,1868,1803,170.90599999999995,14.809,75.191,99.9742
404,405,40220,1988,1898,352.311,63.8865,26.1135,98.1589
405,406,6554,794,1841,172.106,9.79955,80.2005,99.9855
406,407,4327,1005,1841,178.533,61.8953,28.1047,99.9781
407,408,4301,910,1832,336.709,48.181,41.819,99.9953
408,409,3942,2286,1848,355.325,67.6166,22.3834,99.979
409,410,614,2569,1838,181.503,25.9416,64.0584,99.9639
410,411,26835,1819,1955,348.186,12.3068,77.6932,99.8049
411,412,7536,1680,1863,343.82199999999995,68.5003,21.4997,99.9699
412,413,2842,2704,1866,169.067,28.8476,61.1524,99.9961
413,414,8479,3328,1892,342.155,40.7531,49.2469,99.7043
414,415,1632,1071,1861,163.762,20.0354,69.9646,99.8349
415,416,49715,2564,1988,350.599,26.9752,63.0248,96.9236
416,417,530,2220,1862,168.16400000000004,34.2389,55.7611,99.75
417,418,8757,332,1907,356.566,59.2552,30.7448,99.8999
418,419,926,261,1888,357.831,54.1927,35.8073,99.9467
419,420,2526,711,1884,174.75599999999997,12.6672,77.3328,99.9967
420,421,11682,928,1928,170.854,7.75415,82.2458,99.4683
421,422,15040,803,1933,183.342,55.9018,34.0982,99.9917
422,423,5678,413,1939,166.328,65.4364,24.5636,99.6207
423,424,685,462,1893,173.24200000000005,53.816,36.184,99.981
424,425,55173,1199,2016,165.21400000000003,3.49431,86.5057,99.2108
425,426,14903,2694,1936,347.085,52.2622,37.7378,99.9881
426,427,2440,3260,1920,342.6380000000001,76.3438,13.6562,99.965
427,428,18235,647,1976,355.649,27.0082,62.9918,99.2027
428,429,10792,1673,1941,349.711,49.6504,40.3496,99.9879
429,430,6599,2830,1956,178.84599999999998,28.7319,61.2681,99.9561
430,431,1076,1458,1927,177.206,53.7719,36.2281,99.9778
431,432,1965,1513,1944,327.285,72.1266,17.8734,99.9773
432,433,16873,1568,2020,344.85,72.185,17.815,98.9336
433,434,9887,3241,1968,354.152,43.4476,46.5524,99.6838
434,435,8444,1439,1993,354.80300000000005,40.1702,49.8298,99.6269
435,436,67386,631,2116,172.835,74.014,15.986,99.6667
436,437,565,308,1968,352.49,40.8547,49.1453,99.9209
437,438,2579,2332,1981,339.05300000000005,81.193,8.807030000000003,99.9623
438,439,2597,2911,2000,357.575,2.58137,87.4186,99.9881
439,440,3816,1700,2000,173.46200000000005,31.2942,58.7058,99.9217
440,441,9041,3231,2025,355.652,74.8604,15.1396,99.8748
441,442,3751,896,2015,180.379,60.056,29.944000000000006,99.7714
442,443,2913,2989,2028,334.71,76.5962,13.4038,99.6582
443,444,2218,820,2020,335.732,43.4667,46.5333,99.9749
444,445,1044,2026,2013,183.43,65.7478,24.2522,99.967
445,446,983,962,2025,162.65,8.19563,81.8044,98.5605
446,447,28870,2454,2112,183.536,71.76899999999998,18.231,99.6603
447,448,65859,2999,2222,3.5790900000000003,66.8867,23.1133,54.6334
448,449,11147,2193,2072,174.595,8.086110000000001,81.9139,99.8353
449,450,6469,2077,2055,167.87,56.8876,33.1124,99.5211
450,451,44364,3206,2149,183.162,54.0439,35.9561,99.6607
451,452,19513,1920,2106,170.357,17.3873,72.6127,98.2051
452,453,79156,1621,2184,355.476,56.4454,33.5546,99.8155
453,454,33319,864,2161,350.671,8.71573,81.2843,99.6015
454,455,2794,1425,2079,158.46,63.7338,26.2662,99.8972
455,456,1395,3231,2077,173.679,65.9576,24.0424,99.9682
456,457,5906,2640,2131,358.281,13.9923,76.0077,99.9954
457,458,741,3034,2081,174.958,22.7189,67.2811,99.9765
458,459,720,474,2097,177.338,77.5938,12.4062,99.967
459,460,1675,2760,2107,5.73919,62.4204,27.5796,99.9693
460,461,30922,1129,2211,357.80800000000005,37.4754,52.5246,99.4544
461,462,17899,2244,2145,186.48,47.5749,42.4251,97.8502
462,463,856,425,2119,353.6869999999999,4.29868,85.7013,99.9752
463,464,3326,2864,2153,1.78584,65.8025,24.1975,99.9686
464,465,3669,2715,2133,333.097,60.3167,29.6833,99.9884
465,466,2367,1400,2116,165.737,56.986,33.014,99.9951
466,467,1987,2012,2123,174.894,5.3238699999999985,84.6761,99.995
467,468,1891,2799,2114,344.955,57.7574,32.2426,99.9958
468,469,11395,2064,2179,172.18900000000005,37.691,52.309,99.9767
469,470,11202,1242,2149,344.7340000000001,65.9381,24.0619,99.744
470,471,721,1335,2124,351.207,67.3745,22.6255,99.9312
471,472,2940,3054,2161,352.626,25.2567,64.7433,99.9851
472,473,18016,2823,2246,336.87,64.5189,25.4811,99.8672
473,474,1412,456,2162,346.12,81.1424,8.857610000000003,99.9585
474,475,551,1418,2149,178.53099999999995,33.2949,56.7051,99.9925
475,476,608,404,2167,354.374,4.26845,85.7316,99.9845
476,477,966,367,2182,354.793,3.81497,86.185,99.9828
477,478,2401,3342,2197,165.465,28.1211,61.8789,99.9256
478,479,2204,1984,2181,332.865,69.4165,20.5835,99.9253
479,480,20974,1370,2233,356.61,4.54063,85.4594,99.9625
480,481,1383,2267,2190,165.285,44.5145,45.4855,99.979
481,482,10814,2653,2218,6.05079,66.1081,23.8919,99.937
482,483,9632,2382,2223,166.18200000000004,40.9092,49.0908,99.9598
483,484,4611,404,2235,193.009,86.6119,3.38807,99.9739
484,485,17319,1917,2269,168.78,68.9156,21.0844,99.8515
485,486,3317,261,2268,350.017,29.6888,60.3112,99.9036
486,487,2939,2518,2213,350.9480000000001,20.8854,69.1146,99.968
487,488,1630,201,2245,351.086,22.7064,67.2936,99.8728
488,489,17056,524,2316,182.549,82.0962,7.903760000000001,99.8387
489,490,53472,2328,2323,356.386,8.45255,81.5474,88.3023
490,491,100971,923,2362,178.625,61.8226,28.1774,91.709
491,492,1780,1617,2245,171.78900000000004,30.8898,59.1102,99.9973
492,493,12024,2749,2319,178.44099999999997,16.371,73.62899999999998,99.9206
493,494,16832,1750,2276,170.56,28.2476,61.7524,99.9835
494,495,1958,2673,2263,342.727,66.2936,23.7064,99.9857
495,496,4130,2537,2257,333.5730000000001,63.1928,26.8072,99.8708
496,497,1834,2139,2251,174.481,27.5739,62.4261,99.5526
497,498,5912,3305,2311,347.835,28.7689,61.2311,99.8361
498,499,924,2175,2259,176.27599999999995,34.5323,55.4677,99.9604
499,500,11554,2054,2305,0.997341,66.8428,23.1572,99.9841
500,501,1717,366,2283,135.96,69.7648,20.2352,99.9316
501,502,43173,1268,2379,350.384,51.4562,38.5438,99.9479
502,503,1036,2938,2298,186.881,6.25082,83.7492,99.9895
503,504,551,2880,2295,186.979,5.92215,84.0779,99.9965
504,505,602,2687,2305,187.738,10.0907,79.9093,99.9013
505,506,7017,2640,2337,193.28,18.4536,71.5464,99.8215
506,507,11891,2907,2373,177.505,64.1361,25.8639,99.9758
507,508,17862,3236,2438,182.855,66.3028,23.6972,99.9019
508,509,1335,1945,2343,354.806,51.9375,38.0625,99.9152
509,510,767,1429,2338,353.6740000000001,39.1829,50.8171,99.9763
510,511,872,572,2336,169.763,53.6121,36.3879,99.9968
511,512,1708,783,2344,181.008,75.6256,14.3744,99.9337
512,513,17191,1784,2376,359.246,57.4315,32.5685,99.707
513,514,20581,635,2417,350.0019999999999,27.121,62.879,99.9938
514,515,18049,2147,2449,175.238,37.9337,52.0663,99.9401
515,516,638,3174,2352,359.9240000000001,67.3791,22.6209,99.9401
516,517,1775,3359,2386,350.3730000000001,22.1484,67.8516,99.9356
517,518,1198,460,2376,353.769,24.307,65.693,99.8068
518,519,1088,2565,2367,327.579,65.5214,24.4786,99.9897
519,520,1200,1635,2374,357.469,9.8516,80.1484,99.9859
520,521,13413,1459,2442,180.558,55.0513,34.9487,99.9345
521,522,997,2504,2373,347.098,51.1936,38.8064,99.8058
522,523,6140,2052,2408,6.794810000000001,82.6136,7.386419999999998,99.8699
523,524,2834,2383,2405,180.185,38.147,51.853,99.9696
524,525,15844,2693,2428,184.753,42.2217,47.7783,99.7991
525,526,11360,1920,2444,179.987,3.08109,86.9189,99.9499
526,527,5792,3174,2414,345.816,22.7781,67.2219,99.9096
527,528,12219,2528,2448,174.101,25.1254,64.8746,99.9682
528,529,5492,2989,2447,177.34900000000005,29.7495,60.2505,99.9662
529,530,1767,337,2439,347.545,25.1996,64.8004,99.7824
530,531,2929,1694,2434,358.82,10.31,79.69,99.9667
531,532,19076,474,2484,352.189,47.7619,42.2381,99.4619
532,533,1126,2883,2436,176.58,4.47823,85.5218,99.8564
533,534,11865,2342,2478,173.199,55.7574,34.2426,99.8966
534,535,1256,3294,2442,351.246,31.9148,58.0852,99.919
535,536,970,3338,2448,352.284,24.378,65.622,99.9803
536,537,9797,2839,2481,174.59400000000005,11.8422,78.1578,99.9884
537,538,65199,883,2615,178.465,30.806,59.194,97.8205
538,539,5286,2030,2482,179.422,1.53171,88.4683,99.9807
539,540,39532,1828,2555,181.577,62.6774,27.3226,99.6067
540,541,12127,1320,2505,353.655,9.76005,80.24,99.923
541,542,6027,3097,2478,175.84900000000005,52.9713,37.0287,99.9241
542,543,1060,2444,2463,323.052,65.7139,24.2861,99.9406
543,544,4353,2235,2486,174.215,55.1941,34.8059,99.9861
544,545,2634,1107,2494,178.31099999999995,4.1287400000000005,85.8713,99.941
545,546,2908,2925,2501,175.608,58.7506,31.2494,99.973
546,547,11592,3346,2582,170.757,47.2105,42.7895,99.5151
547,548,183994,2552,2724,347.36800000000005,20.5075,69.4925,97.0751
548,549,23430,1572,2564,1.86652,6.0574900000000005,83.9425,99.6574
549,550,1965,217,2504,330.004,75.6256,14.3744,99.885
550,551,2597,305,2518,10.1022,67.9258,22.0742,99.9599
551,552,616,1224,2500,185.272,56.1499,33.8501,99.9843
552,553,2891,1178,2543,348.907,20.3194,69.6806,99.8672
553,554,1218,2279,2526,178.234,26.8027,63.1973,99.966
554,555,609,3057,2528,173.01,30.199,59.801,99.9601
555,556,6209,1429,2545,193.308,58.1113,31.8887,99.8948
556,557,587,3037,2543,174.505,23.3194,66.6806,99.801
557,558,6057,1089,2574,181.312,4.7099199999999986,85.2901,99.9785
558,559,2645,2974,2540,265.855,83.2913,6.708660000000001,98.598
559,560,714,1232,2530,197.802,74.7011,15.2989,99.4075
560,561,32016,3169,2609,343.9,74.6677,15.3323,99.7833
561,562,13688,2052,2583,359.536,75.0151,14.9849,99.8529
562,563,5671,505,2561,352.696,76.325,13.675,99.9318
563,564,8062,2253,2582,1.08633,69.8643,20.1357,99.6993
564,565,8546,371,2614,191.413,69.0583,20.9417,99.8901
565,566,2938,2164,2564,161.606,61.699,28.301,99.9665
566,567,169452,3015,2903,176.72,0.918655,89.0813,18.5989
567,568,2429,1262,2567,358.43300000000005,27.6198,62.3802,99.9815
568,569,563,698,2558,184.077,64.63600000000001,25.364,99.9889
569,570,8471,1178,2617,357.39,7.54975,82.4502,99.9873
570,571,33436,473,2718,175.44799999999995,55.0552,34.9448,97.4857
571,572,17635,1331,2646,175.328,54.9132,35.0868,99.9556
572,573,17291,751,2636,334.564,81.4708,8.52922,99.9282
573,574,45273,1772,2699,348.6880000000001,73.9203,16.0797,99.7024
574,575,997,625,2608,177.926,8.68903,81.311,99.9972
575,576,17732,3045,2683,175.972,21.4713,68.5287,99.7379
576,577,107511,1306,2779,351.742,54.6868,35.3132,99.8967
577,578,569,2711,2601,351.825,75.1478,14.8522,99.9798
578,579,714,1245,2620,357.9240000000001,10.8476,79.1524,99.9987
579,580,23692,2261,2672,343.254,64.582,25.418000000000006,99.7304
580,581,106529,2120,2849,185.47,21.2609,68.7391,99.6627
581,582,51746,680,2761,188.353,63.9702,26.0298,99.9741
582,583,925,569,2656,329.684,69.4278,20.5722,99.9133
583,584,21230,3254,2771,171.453,53.2449,36.7551,99.9078
584,585,628,1210,2678,200.349,76.8239,13.1761,99.9445
585,586,1227,1140,2693,176.493,38.3802,51.6198,99.9973
586,587,890,866,2722,169.196,46.1794,43.8206,99.9363
587,588,21300,284,2828,358.75,54.8618,35.1382,99.9097
588,589,3283,3328,2782,170.447,37.5458,52.4542,99.8905
589,590,4829,3114,2778,1.18242,57.0663,32.9337,99.9752
590,591,25483,1876,2856,173.94799999999995,60.4945,29.5055,99.9746
591,592,37242,1687,2864,348.055,21.7579,68.2421,99.968
592,593,1864,865,2788,166.96900000000005,59.5511,30.4489,99.9431
593,594,554,3049,2788,173.706,40.7196,49.2804,99.9591
594,595,2597,3020,2813,175.138,34.5644,55.4356,99.9961
595,596,1482,975,2809,3.74077,4.58664,85.4134,99.9647
596,597,6328,884,2850,1.53786,9.87942,80.1206,99.9727
597,598,95354,543,2974,356.24,3.96278,86.0372,94.5347
598,599,9732,2795,2875,321.789,69.5032,20.4968,99.9144
599,600,6631,3327,2881,185.33900000000003,54.3963,35.6037,99.9274
600,601,109800,1339,2990,174.96599999999995,47.1887,42.8113,99.9294
601,602,1671,563,2858,177.035,61.96,28.04,99.9883
602,603,8920,792,2896,187.34,9.78802,80.212,99.9931
603,604,20569,929,2958,169.956,62.7819,27.2181,99.7073
604,605,1685,2390,2887,173.127,23.8656,66.1344,99.991
605,606,52921,2393,3091,341.815,65.5509,24.4491,99.5503
606,607,724,2836,2922,192.354,47.181,42.819,99.9659
607,608,2734,1984,2957,189.87,10.7478,79.2522,99.9034
608,609,3279,2437,2979,328.298,67.884,22.116,99.6191
609,610,1771,2788,2947,182.428,2.75791,87.2421,99.9959
610,611,1265,2893,2950,175.457,10.1493,79.8507,99.9771
611,612,9283,1807,3040,171.428,54.5422,35.4578,99.7896
612,613,13654,1905,2998,177.69400000000005,44.2084,45.7916,98.1661
613,614,16366,1671,3001,325.636,82.2433,7.756710000000001,98.9379
614,615,2295,1040,2968,334.4430000000001,74.4997,15.5003,99.9715
615,616,1489,2829,2972,180.2,4.20487,85.7951,99.994
616,617,50934,2856,3134,331.266,76.7057,13.2943,98.8712
617,618,575,2877,2975,182.18400000000003,3.16669,86.8333,99.9992
618,619,23759,2583,3053,178.458,77.4042,12.5958,98.7581
619,620,36033,2137,3114,171.58900000000003,17.0008,72.9992,99.7054
620,621,66432,1079,3155,341.348,43.3593,46.6407,99.8948
621,622,2320,188,3044,202.155,76.4494,13.5506,99.9581
622,623,5047,238,3078,202.624,75.703,14.297,99.9842
623,624,7086,896,3086,170.169,63.833,26.167,99.9093
624,625,12561,2683,3153,334.58,80.884,9.11596,99.8822
625,626,3245,1623,3073,356.514,24.8117,65.1883,99.972
626,627,7699,1713,3099,347.0019999999999,59.4569,30.5431,99.9709
627,628,1523,639,3076,182.646,51.0632,38.9368,99.9675
628,629,37186,374,3160,195.086,44.6531,45.3469,99.9611
629,630,5821,1912,3095,353.32199999999995,72.8024,17.1976,99.9569
630,631,1027,126,3094,162.158,74.7222,15.2778,99.932
631,632,40461,641,3165,353.4530000000001,69.7858,20.2142,99.917
632,633,1422,770,3105,200.844,74.6897,15.3103,99.9911
633,634,2026,1595,3116,340.7480000000001,59.7428,30.2572,99.8268
634,635,3611,193,3161,163.621,70.3164,19.6836,99.9291
635,636,29908,3240,3230,353.217,35.9018,54.0982,99.7827
636,637,1383,1648,3119,355.629,7.82305,82.1769,99.9967
637,638,780,1530,3124,358.2990000000001,22.6831,67.3169,99.945
638,639,901,116,3135,180.264,71.3264,18.6736,99.9217
639,640,9122,1764,3163,184.282,34.8182,55.1818,99.8996
640,641,16068,1936,3187,183.043,35.1411,54.8589,99.8269
641,642,2057,3020,3152,334.265,78.0021,11.9979,99.9834
642,643,1142,1407,3140,340.69,58.7861,31.2139,99.9829
643,644,2176,1571,3156,180.539,49.0043,40.9957,99.9952
644,645,836,903,3150,176.52599999999995,52.4728,37.5272,99.8919
645,646,145345,1332,3393,349.776,3.73063,86.2694,78.1909
646,647,3192,1846,3173,8.129719999999999,73.9074,16.0926,99.9756
647,648,2943,1636,3178,343.728,48.9313,41.0687,99.9962
648,649,4534,2754,3205,180.794,2.53218,87.4678,99.9396
649,650,4274,2274,3207,349.707,39.2662,50.7338,99.936
650,651,60231,266,3350,310.532,70.0069,19.9931,99.9642
651,652,6398,2631,3240,175.21,58.3449,31.6551,99.9791
652,653,274259,2141,3544,173.044,15.6522,74.3478,78.8993
653,654,1633,122,3213,162.028,72.9517,17.0483,99.8305
654,655,15666,2494,3253,167.97099999999998,61.5461,28.4539,99.9553
655,656,6729,818,3227,193.171,44.6955,45.3045,99.9749
656,657,18554,1734,3301,339.834,51.6051,38.3949,99.9919
657,658,810,1667,3221,179.851,3.38933,86.6107,99.9987
658,659,14538,1611,3290,176.577,2.71777,87.2822,99.9814
659,660,1363,1547,3248,172.636,75.3364,14.6636,99.8941
660,661,63448,3006,3356,170.86,34.2498,55.7502,99.8759
661,662,35483,1851,3385,355.8780000000001,1.42574,88.5743,98.1542
662,663,1585,1133,3255,354.776,23.0611,66.9389,99.7298
663,664,3834,1049,3260,1.65005,10.7016,79.2984,99.9735
664,665,3249,135,3276,309.663,71.0401,18.9599,99.8544
665,666,19940,2340,3296,346.858,56.4896,33.5104,99.7826
666,667,1102,473,3253,351.088,30.3804,59.6196,99.9922
667,668,30721,685,3329,196.307,44.0882,45.9118,99.9339
668,669,1976,780,3273,175.554,10.8438,79.1562,99.9805
669,670,16718,502,3309,314.273,72.9519,17.0481,99.9725
670,671,925,2813,3265,180.249,1.58226,88.4177,99.9957
671,672,45002,2736,3387,174.37900000000005,10.145,79.855,99.9765
672,673,3398,2221,3300,342.463,72.7933,17.2067,99.876
673,674,3190,960,3294,195.988,45.4328,44.5672,99.9766
674,675,2969,2579,3296,349.167,53.1653,36.8347,99.9962
675,676,202965,977,3713,356.103,31.4015,58.5985,94.2651
676,677,1628,872,3297,210.58,79.9728,10.0272,99.9681
677,678,29693,433,3473,354.046,22.2051,67.7949,99.3463
678,679,12839,848,3373,183.542,24.771,65.229,99.9453
679,680,1267,1569,3353,3.34404,2.23494,87.7651,99.9613
680,681,13687,2560,3382,176.28400000000005,56.1455,33.8545,99.9874
681,682,1617,3272,3351,1.89695,64.9491,25.0509,99.9852
682,683,868,111,3361,303.029,71.3029,18.6971,99.8834
683,684,35032,3207,3451,182.335,42.8584,47.1416,99.9397
684,685,3991,3349,3430,183.467,49.9992,40.0008,99.8774
685,686,24425,1676,3446,183.151,64.08,25.92,99.9473
686,687,7425,2170,3428,358.844,1.08896,88.911,99.9769
687,688,7088,573,3449,3.36689,11.1684,78.8316,99.9823
688,689,1050,537,3414,3.22154,8.006689999999999,81.9933,99.9976
689,690,1110,691,3425,2.89248,14.3606,75.6394,99.9525
690,691,1102,2234,3447,348.244,25.7636,64.2364,99.9935
691,692,567,693,3436,4.57109,18.6487,71.3513,99.9607
692,693,11482,732,3491,184.538,1.85898,88.141,99.9607
693,694,521,354,3448,1.53006,24.3734,65.6266,99.96
694,695,1095,622,3469,3.08916,5.30783,84.6922,99.9471
695,696,2262,2614,3476,345.715,53.8466,36.1534,99.9896
696,697,1250,3080,3485,6.0625,66.2376,23.7624,99.9725
697,698,19507,221,3593,193.1,30.1541,59.8459,99.9197
698,699,37671,1587,3580,352.796,42.9772,47.0228,99.347
699,700,1814,2670,3497,358.148,1.25579,88.7442,99.9864
700,701,6430,2863,3521,349.6269999999999,4.38771,85.6123,99.6231
701,702,619,3366,3492,350.83,66.2886,23.7114,99.9701
702,703,2704,127,3537,182.372,19.349,70.65100000000002,99.7188
703,704,4588,2988,3516,185.544,77.5946,12.4054,99.9433
704,705,66250,678,3625,356.309,49.8562,40.1438,97.7549
705,706,18149,367,3624,194.065,68.1805,21.8195,72.8833
706,707,1145,3344,3528,181.372,47.7814,42.2186,99.9159
707,708,71333,2974,3664,185.615,52.6421,37.3579,72.4941
708,709,2975,1770,3551,340.782,49.9834,40.0166,99.9573
709,710,20626,2677,3591,1.29419,42.8231,47.1769,99.9742
710,711,8644,3160,3579,352.11800000000005,63.5667,26.4333,99.3337
711,712,1801,286,3574,353.233,6.73035,83.2696,99.9961
712,713,8731,1201,3612,171.774,31.0003,58.9997,99.9187
713,714,811,3289,3566,351.839,58.7909,31.2091,99.9293
714,715,10658,1399,3621,172.69299999999996,34.8763,55.1237,99.9613
715,716,25078,3283,3683,15.0073,79.6126,10.3874,99.9429
716,717,40049,1648,3702,329.952,63.5087,26.4913,99.6705
717,718,2679,159,3634,195.156,37.1346,52.8654,98.7713
718,719,15280,1281,3685,353.865,44.6917,45.3083,99.9366
719,720,5572,2236,3654,0.25805900000000004,40.2267,49.7733,99.9976
720,721,658,2592,3626,349.64,76.7365,13.2635,99.9879
721,722,48432,2509,3751,13.3448,70.0233,19.9767,99.7991
722,723,3306,2739,3661,183.081,43.5478,46.4522,99.9632
723,724,11277,1138,3719,169.02700000000004,28.5334,61.4666,99.4866
724,725,5136,1817,3738,350.467,44.6618,45.3382,99.7285
725,726,88850,427,3889,355.255,23.1155,66.8845,99.2955
726,727,31851,1395,3822,175.27200000000005,58.552,31.448,94.8583
727,728,42138,2704,3805,179.55900000000003,26.0966,63.9034,99.995
728,729,25045,558,3782,173.645,23.2368,66.7632,99.9941
729,730,43440,2197,3805,344.536,25.3639,64.6361,99.9846
730,731,9919,783,3765,340.125,81.0804,8.9196,99.9786
731,732,12115,3101,3783,345.478,61.1433,28.8567,99.9513
732,733,48227,3207,3892,339.516,77.4874,12.5126,99.9271
733,734,3399,1319,3785,173.676,76.782,13.218,99.9566
734,735,1445,1665,3775,171.113,26.2718,63.7282,99.9964
735,736,978,215,3788,183.687,77.5411,12.4589,99.7619
736,737,1279,258,3804,351.827,28.4782,61.5218,99.8892
737,738,635,1215,3790,173.66400000000004,62.5206,27.4794,99.8889
738,739,27245,2851,3893,30.0439,71.6362,18.3638,99.9682
739,740,1708,3029,3817,177.14700000000005,7.883269999999999,82.1167,99.9961
740,741,34384,2336,3922,353.491,8.59579,81.4042,99.6153
741,742,11384,1505,3881,351.695,30.6873,59.3127,99.9815
742,743,6734,1729,3867,354.606,18.3635,71.6365,99.0175
743,744,2063,1644,3848,181.717,71.8949,18.1051,99.9884
744,745,8817,3010,3888,359.899,74.6009,15.3991,99.9811
745,746,8207,1817,3884,356.13699999999994,16.8655,73.1345,99.8768
746,747,60013,2056,3982,8.805,73.916,16.084,99.3046
747,748,4826,1607,3890,177.30900000000003,46.2556,43.7444,99.9948
748,749,931,2056,3867,179.75099999999995,63.6738,26.3262,99.9886
749,750,9248,1241,3905,175.981,72.9268,17.0732,99.9622
750,751,548,3353,3871,353.57199999999995,40.2805,49.7195,99.8876
751,752,2082,1150,3874,358.522,33.7568,56.2432,99.9679
752,753,7627,667,3935,305.034,78.2321,11.7679,99.9722
753,754,2971,1099,3909,161.575,86.6089,3.39108,96.2028
754,755,1903,1626,3936,356.8119999999999,45.6065,44.3935,99.9378
755,756,6440,2742,3954,198.121,81.8642,8.13584,99.9714
756,757,220714,2816,4195,350.586,0.0134811,89.9865,91.7046
757,758,2789,1708,3938,155.852,61.6308,28.3692,99.9902
758,759,6319,1493,3970,348.449,48.5092,41.4908,99.9419
759,760,20269,2443,4021,180.808,0.717514,89.2825,99.854
760,761,648,2534,3961,2.09659,0.270332,89.7297,99.9788
761,762,198301,1943,4270,1.42854,21.9998,68.0002,89.1757
762,763,20561,1369,4013,167.795,35.5742,54.4258,99.676
763,764,2079,2909,3982,189.183,78.6076,11.3924,99.9512
764,765,93361,915,4282,351.413,48.4375,41.5625,83.7293
765,766,7131,863,4040,351.177,7.33955,82.6604,99.9118
766,767,36855,709,4083,181.61,64.4004,25.5996,99.9312
767,768,32179,3234,4229,355.233,33.5388,56.4612,99.7844
768,769,12636,3228,4083,350.934,77.0092,12.9908,99.3856
769,770,11630,1223,4063,181.35,2.85451,87.1455,99.9691
770,771,708,592,4040,355.521,28.9361,61.0639,99.9865
771,772,10188,1760,4103,159.526,75.5924,14.4076,99.9339
772,773,8361,2314,4085,182.692,85.0201,4.97992,99.862
773,774,660,298,4048,351.069,29.5666,60.4334,99.9841
774,775,4967,2023,4076,177.275,3.9163,86.0837,99.9791
775,776,11622,1581,4114,181.18,60.0194,29.9806,99.9638
776,777,10660,291,4125,336.412,59.6059,30.3941,99.9754
777,778,1303,553,4083,332.9840000000001,77.4438,12.5562,99.9885
778,779,15635,475,4122,180.692,45.5341,44.4659,99.9821
779,780,4010,189,4120,335.42800000000005,62.1831,27.8169,99.9549
780,781,3480,1187,4123,184.697,13.4762,76.5238,99.9841
781,782,4767,1286,4129,183.358,1.10088,88.8991,99.9523
782,783,33625,3062,4212,355.786,30.8364,59.1636,99.9548
783,784,2318,3334,4143,355.2340000000001,35.4118,54.5882,99.9782
784,785,15368,1428,4199,3.98874,15.1027,74.8973,84.6789
785,786,2993,2121,4132,353.163,53.713,36.287,99.7109
786,787,5412,2464,4140,168.033,35.011,54.989,99.98
787,788,3700,855,4155,170.084,3.22505,86.7749,99.9914
788,789,5299,2385,4161,179.30700000000004,42.1193,47.8807,99.9304
789,790,1182,812,4141,332.8880000000001,68.1122,21.8878,99.9685
790,791,35308,2285,4213,180.478,32.4512,57.5488,99.9411
791,792,148253,436,4353,351.731,70.7571,19.2429,95.7228
792,793,3061,1115,4160,336.245,65.8512,24.1488,99.988
793,794,26056,1591,4232,0.484441,51.1747,38.8253,99.1819
794,795,4545,1034,4180,184.345,8.86727,81.1327,99.9963
795,796,507,146,4172,9.4041,24.7244,65.2756,99.6433
796,797,1814,188,4205,7.9609,41.2071,48.7929,99.4445
797,798,5617,811,4231,171.96400000000003,6.671810000000002,83.3282,99.9635
798,799,7437,1149,4237,359.838,7.6654,82.3346,99.9903
799,800,6401,1733,4220,174.576,30.3122,59.6878,99.9444
800,801,675,139,4207,2.25148,42.548,47.452,99.4901
801,802,3816,286,4224,352.103,29.9261,60.0739,99.9811
802,803,1622,542,4212,350.91,7.33128,82.6687,99.9967
803,804,14171,2654,4260,15.618,25.5756,64.4244,99.8207
804,805,1172,3138,4222,176.328,16.34,73.66,99.9956
805,806,1391,874,4226,357.927,69.0279,20.9721,99.9935
806,807,7472,2133,4253,175.888,32.3161,57.6839,99.9981
807,808,532,1080,4226,1.78401,5.21677,84.7832,99.9992
808,809,4514,1054,4264,314.055,71.454,18.546,99.979
809,810,4073,139,4282,3.2208,46.3886,43.6114,99.3739
810,811,5231,1290,4270,337.145,65.788,24.212,99.9515
811,812,706,3373,4255,354.858,34.6487,55.3513,99.9826
812,813,48092,2446,4395,349.932,66.4342,23.5658,65.1602
813,814,1707,317,4267,174.725,66.5122,23.4878,99.9934
814,815,2239,1849,4263,279.301,83.1057,6.89429,99.9886
815,816,1862,1457,4294,347.676,63.6506,26.3494,99.9724
816,817,2632,1814,4293,265.425,83.1369,6.86313,99.9934
817,818,867,1737,4277,278.263,83.2624,6.73755,99.9949
818,819,721,275,4282,191.622,57.0605,32.9395,99.9976
819,820,31152,1122,4386,174.575,27.564,62.43600000000001,99.8717
820,821,9611,2285,4321,191.448,77.1586,12.8414,99.9815
821,822,543,145,4287,353.156,42.9073,47.0927,99.9814
822,823,5742,1185,4336,2.39229,3.49479,86.5052,99.9826
823,824,612,200,4295,6.5449199999999985,47.2533,42.7467,99.7736
824,825,1328,3108,4302,186.688,72.4057,17.5943,99.97
825,826,502,1587,4292,2.17041,23.2507,66.7493,99.9923
826,827,5015,213,4344,3.83662,46.2844,43.7156,99.7816
827,828,3162,1515,4319,4.51297,52.667,37.333,99.9649
828,829,3436,1331,4339,0.62142,6.27834,83.7217,99.9956
829,830,572,1274,4335,0.946333,5.42612,84.5739,99.9963
830,831,1061,304,4332,180.728,64.6603,25.3397,99.9915
831,832,2876,1412,4338,1.07761,7.1604800000000015,82.8395,99.8099
832,833,6367,1423,4415,178.747,3.18804,86.81200000000003,99.8284
833,834,752,3354,4371,355.593,33.8236,56.1764,99.9876
834,835,513,1285,4363,0.955448,5.86832,84.1317,99.9952
835,836,3879,1006,4395,313.654,71.6139,18.3861,99.9887
836,837,3377,2572,4407,181.533,12.3381,77.6619,99.9954
837,838,1523,3314,4397,355.445,36.1088,53.8912,99.8472
838,839,5869,1697,4413,2.8114,8.23235,81.7676,99.9793
839,840,1942,1348,4391,179.863,3.17233,86.8277,99.9949
840,841,8430,2606,4459,180.778,20.6816,69.3184,99.8637
841,842,20917,1812,4487,357.116,3.95032,86.0497,99.9121
842,843,572,2219,4407,189.679,79.7761,10.2239,99.9903
843,844,2989,2187,4439,164.675,79.3559,10.6441,99.9773
844,845,894,2462,4435,179.512,10.2175,79.7825,99.9912
845,846,9337,1278,4491,359.946,5.20587,84.7941,94.3121
846,847,506,3298,4446,351.497,43.448,46.552,99.9453
847,848,1071,3354,4456,350.717,39.1449,50.8551,99.6788
848,849,546,1677,4449,183.867,53.9858,36.0142,99.9255
849,850,2061,554,4458,174.02900000000002,12.3853,77.6147,99.9901
850,851,32452,2881,4504,1.3598,71.3123,18.6877,99.9127
851,852,5491,1069,4497,172.42,9.9341,80.0659,99.9081
852,853,1552,1117,4471,354.01199999999994,27.8273,62.1727,99.9725
853,854,6928,3189,4486,176.535,25.188,64.812,99.9513
854,855,2088,601,4480,356.702,10.6265,79.3735,99.9933
855,856,4259,2502,4496,355.18300000000005,47.6839,42.3161,99.9881
856,857,4058,830,4508,350.61300000000006,29.4198,60.5802,99.8047
857,858,553,3400,4500,352.44,34.6043,55.3957,99.7807
858,859,5344,3338,4543,352.66,41.58,48.42,98.928
859,860,7706,2547,4548,168.21599999999995,49.6927,40.3073,99.8916
860,861,593,3205,4530,185.189,34.078,55.922,99.8427
861,862,3716,2070,4542,181.707,49.422,40.578,99.7656
862,863,1608,367,4537,174.49900000000005,52.2918,37.7082,99.8246
863,864,5258,3059,4555,335.03,24.3048,65.6952,97.2512
864,865,3049,3194,4551,170.30200000000005,9.08304,80.917,67.4416
865,866,1217,1555,4545,181.774,4.09199,85.90799999999999,99.9918
866,867,522,1359,4541,180.668,4.55138,85.4486,99.9922
867,868,2245,2796,4564,7.08525,67.4142,22.5858,99.5498
