,Grain No.,Size [Pixel],center x-coordinate,center y-coordinate,mean azimuth [degree],mean latitude [degree],mean colatitude [degree],Regelungsgrad [%]
0,1,11850,248,173,84.7515,59.2065,30.7935,99.9658
1,2,8664,440,195,277.72900000000004,40.0158,49.9842,99.9254
2,3,7158,354,194,89.8086,11.9639,78.0361,99.8736
3,4,7408,545,169,109.62,23.3906,66.6094,99.8688
4,5,9217,657,171,265.438,40.8789,49.1211,99.9881
5,6,778,844,145,99.4223,16.387,73.613,99.9829
6,7,1374,956,147,93.1133,55.9542,34.0458,99.9537
7,8,1917,1332,157,295.211,67.2288,22.7712,99.9332
8,9,14563,765,206,100.28,32.5001,57.4999,99.9682
9,10,16331,902,215,98.5503,25.213,64.78699999999999,99.9496
10,11,6420,1068,171,113.165,49.7147,40.2853,99.9733
11,12,600,1411,144,43.6739,80.7876,9.21238,99.9298
12,13,55244,1182,283,275.938,2.42328,87.5767,99.8995
13,14,52183,2027,268,102.348,23.41,66.59,94.8671
14,15,21216,2939,216,80.4487,52.1389,37.8611,99.6997
15,16,24186,1445,229,288.938,73.5303,16.4697,99.8695
16,17,9306,1866,181,107.253,55.0741,34.9259,99.9547
17,18,23533,1637,211,95.0256,50.4002,39.5998,99.9601
18,19,1990,2353,173,94.527,24.7146,65.2854,99.9916
19,20,5169,136,193,279.379,19.8772,70.1228,99.9727
20,21,8286,2307,215,85.3588,18.0436,71.9564,99.9691
21,22,708,2183,172,283.798,85.3351,4.66491,99.998
22,23,3155,1002,201,92.4499,63.276,26.724,99.7683
23,24,994,2705,180,86.5681,48.4093,41.5907,99.9736
24,25,3040,3094,199,76.0354,78.9415,11.0585,99.9765
25,26,551,3173,185,303.083,81.6563,8.34372,99.9176
26,27,576,3268,181,94.3567,1.8164,88.1836,99.9592
27,28,3238,2759,207,81.2394,52.1611,37.8389,99.9615
28,29,882,3330,185,92.1749,2.14148,87.8585,99.9307
29,30,2933,1314,225,59.7619,80.3463,9.65371,99.9517
30,31,10849,2513,251,97.4562,65.6033,24.3967,71.0245
31,32,2662,3281,216,95.797,3.42254,86.5775,99.9475
32,33,621,3217,205,92.5653,31.2747,58.7253,99.9946
33,34,8175,3145,262,106.512,80.3615,9.63848,99.9737
34,35,2221,489,240,104.932,23.8448,66.1552,99.407
35,36,14635,2746,324,269.378,44.9158,45.0842,99.9344
36,37,60241,231,364,94.7227,24.5913,65.4087,99.8792
37,38,9500,2375,304,101.629,8.31873,81.6813,99.9451
38,39,3052,563,237,100.713,1.68947,88.3105,99.976
39,40,39246,1830,367,265.783,35.4508,54.5492,99.9258
40,41,28274,612,320,109.931,44.1352,45.8648,99.8726
41,42,1037,3228,242,265.378,1.63757,88.3624,99.9591
42,43,4351,2255,279,99.0858,7.61185,82.3881,99.6653
43,44,18157,2881,321,88.1118,18.6573,71.3427,99.9538
44,45,3554,1005,262,93.1187,10.5367,79.4633,98.8964
45,46,2455,2785,261,125.071,85.8069,4.19307,99.9906
46,47,2123,116,264,94.53,17.0019,72.9981,99.9841
47,48,2668,3267,273,297.275,85.1098,4.8902,99.9805
48,49,1150,2640,267,270.939,5.86715,84.1329,99.9913
49,50,1144,2189,274,272.034,46.8932,43.1068,99.9976
50,51,1034,792,275,102.179,23.7405,66.2595,99.9892
51,52,31032,1660,392,282.462,46.0334,43.9666,99.9628
52,53,730,3076,288,92.0,55.1148,34.8852,99.9908
53,54,14046,465,385,267.222,8.69765,81.3023,99.6629
54,55,695,349,294,92.8875,9.58739,80.4126,99.9938
55,56,5018,891,305,103.802,28.8085,61.1915,99.9604
56,57,29024,1396,382,92.5235,8.72425,81.2757,99.8662
57,58,47650,2566,399,98.6124,32.7461,57.2539,99.3041
58,59,1930,2329,313,99.384,11.617,78.383,99.8898
59,60,20765,3243,374,269.16200000000003,2.55187,87.4481,99.8869
60,61,5952,3049,341,119.754,82.1834,7.81655,99.9659
61,62,3833,59,357,268.016,6.7958300000000005,83.2042,99.9864
62,63,7483,1030,347,97.4014,33.0369,56.9631,99.3928
63,64,2128,1536,308,283.846,45.3424,44.6576,99.9618
64,65,1805,783,312,113.885,43.7293,46.2707,99.9973
65,66,849,2270,312,270.647,18.1796,71.8204,99.995
66,67,591,2709,313,271.839,45.6375,44.3625,99.9769
67,68,6164,848,363,103.434,24.4161,65.5839,99.9937
68,69,633,2414,319,89.8105,25.8856,64.1144,99.9981
69,70,5629,2185,360,111.691,40.9124,49.0876,99.9695
70,71,6250,733,359,291.802,75.347,14.653,99.9808
71,72,2109,3119,343,122.892,79.3119,10.6881,99.984
72,73,856,1553,342,102.879,9.46957,80.5304,99.9803
73,74,10011,920,400,113.492,42.6156,47.3844,99.9543
74,75,731,2258,356,262.66700000000003,45.5489,44.4511,99.9963
75,76,1036,2294,362,96.9893,8.332419999999999,81.6676,99.9795
76,77,633,155,357,95.781,10.8394,79.1606,99.9958
77,78,1160,3365,370,101.565,24.0491,65.9509,99.8954
78,79,653,1533,377,286.678,46.1369,43.8631,99.9803
79,80,10911,2984,416,151.752,78.2748,11.7252,99.9649
80,81,9987,812,445,105.563,28.4134,61.5866,99.9238
81,82,8060,2369,415,275.978,63.4703,26.5297,99.9846
82,83,861,3112,387,286.692,28.1107,61.8893,99.9914
83,84,24560,1235,502,277.004,60.2983,29.7017,99.1491
84,85,4376,2222,411,105.019,24.3749,65.6251,99.9923
85,86,21632,1042,523,283.703,49.0449,40.9551,99.6139
86,87,40834,1959,550,90.5148,61.365,28.635,95.6018
87,88,40713,3299,668,97.0792,23.5123,66.4877,99.8946
88,89,5396,703,454,95.7146,18.049,71.95100000000002,99.9866
89,90,8680,415,464,98.6263,32.2367,57.7633,99.909
90,91,675,2810,417,268.82,45.399,44.601000000000006,99.9856
91,92,3193,1521,435,109.421,42.5327,47.4673,99.6093
92,93,3158,3121,428,283.981,70.1256,19.8744,99.9711
93,94,775,1101,425,103.737,13.289,76.711,99.9902
94,95,7861,940,485,100.641,25.7376,64.2624,99.8335
95,96,1165,2286,435,98.0071,18.5632,71.4368,99.9906
96,97,108135,2974,578,273.21,14.4427,75.5573,99.6253
97,98,772,2902,439,96.5934,41.0375,48.9625,99.9752
98,99,3061,3238,448,102.633,23.89,66.11,99.9875
99,100,4403,2750,456,102.373,16.5441,73.4559,99.9783
100,101,1019,2183,451,98.0255,5.06891,84.9311,99.9864
101,102,7271,77,498,90.8761,7.35838,82.6416,99.9894
102,103,11915,2247,504,262.78,45.5847,44.4153,99.6881
103,104,56330,582,612,286.548,9.06942,80.9306,99.7557
104,105,5866,2070,509,101.457,21.3917,68.6083,99.8865
105,106,57032,1592,645,270.954,1.02235,88.9777,99.2368
106,107,5855,730,548,273.975,8.26411,81.7359,99.9289
107,108,925,1035,465,105.258,13.8475,76.1525,99.9921
108,109,2670,2446,497,93.5526,7.061160000000001,82.9388,99.9882
109,110,19315,339,554,264.215,14.314,75.686,99.9406
110,111,853,2155,479,203.334,72.3551,17.6449,99.9926
111,112,9856,1418,539,93.2161,45.6674,44.3326,99.6744
112,113,32561,2623,579,278.324,44.0096,45.9904,99.5084
113,114,32014,1770,611,91.9707,23.0032,66.9968,94.4313
114,115,22402,156,591,269.88,4.01546,85.9845,99.8873
115,116,3333,2132,523,271.685,52.0784,37.9216,99.3876
116,117,6595,792,570,279.094,11.1439,78.8561,99.9785
117,118,4680,874,567,82.3966,34.0651,55.9349,99.9484
118,119,13521,1325,599,97.4166,37.7245,52.2755,99.9613
119,120,748,2368,521,113.637,71.9693,18.0307,99.9793
120,121,1340,2411,538,101.837,42.9008,47.0992,99.5179
121,122,2424,454,567,167.87,84.787,5.21301,99.9752
122,123,24443,2402,618,95.6055,20.5881,69.4119,99.5918
123,124,811,2381,566,62.9982,76.1209,13.8791,99.9926
124,125,1246,53,584,295.105,58.2108,31.7892,99.9911
125,126,9927,2142,616,341.775,79.4064,10.5936,99.9358
126,127,13890,1121,680,278.39,3.5502199999999995,86.4498,99.8804
127,128,9677,952,644,105.815,80.5975,9.40254,99.9802
128,129,33791,3023,745,279.91900000000004,22.9273,67.0727,98.8162
129,130,9799,1218,665,274.264,34.7447,55.2553,99.9695
130,131,2555,429,628,322.874,82.7517,7.24826,99.9857
131,132,3313,740,646,284.526,9.63462,80.3654,99.979
132,133,36840,2319,725,269.207,22.4204,67.5796,99.8652
133,134,19723,1462,732,88.6369,15.1357,74.8643,99.0501
134,135,69500,314,795,275.336,36.6211,53.3789,99.9534
135,136,637,1853,634,95.2034,14.4473,75.5527,99.9928
136,137,5231,2041,682,105.307,12.3379,77.6621,99.9702
137,138,586,199,650,269.084,4.11455,85.8855,99.9957
138,139,583,703,649,90.4173,30.6788,59.3212,99.9802
139,140,981,778,659,278.708,11.3524,78.6476,99.8538
140,141,1795,1045,663,102.584,79.3751,10.6249,99.988
141,142,13775,2667,713,295.204,58.56,31.44,99.9453
142,143,2599,823,677,109.402,42.7495,47.2505,99.9838
143,144,699,1887,670,91.9566,11.9852,78.0148,99.9802
144,145,5865,1299,712,97.4215,4.19997,85.8,99.9343
145,146,2826,858,703,98.472,13.4265,76.5735,99.9911
146,147,2266,949,695,100.585,49.8061,40.1939,99.9931
147,148,13886,1961,766,274.323,27.6892,62.3108,99.2116
148,149,37215,107,822,287.7340000000001,54.0799,35.9201,99.9734
149,150,7027,1371,733,269.631,30.6697,59.3303,99.9852
150,151,13223,2116,718,279.16200000000003,71.9178,18.0822,99.9775
151,152,9057,2537,748,295.441,57.0448,32.9552,99.9252
152,153,1323,169,723,290.032,53.8269,36.1731,99.9748
153,154,20771,498,824,90.7975,2.87693,87.1231,98.8073
154,155,1678,747,713,273.507,4.51484,85.4852,99.9916
155,156,6781,1062,772,222.909,85.0004,4.99959,99.9605
156,157,1639,685,739,95.9949,9.055,80.945,99.9347
157,158,515,3179,720,286.97,61.6943,28.3057,99.859
158,159,13072,930,776,97.6358,33.485,56.515,99.6433
159,160,18713,3103,821,287.626,61.299,28.701,99.957
160,161,29075,700,846,272.672,28.7342,61.2658,99.9484
161,162,3462,2811,768,107.539,66.1653,23.8347,99.9752
162,163,951,2857,746,284.701,58.2937,31.7063,99.9927
163,164,717,1248,753,93.5149,60.2763,29.7237,99.9938
164,165,2270,827,776,62.651,76.7146,13.2854,99.9561
165,166,4381,1175,777,94.8843,60.1074,29.8926,99.8988
166,167,65009,1673,936,88.1976,4.831919999999998,85.1681,99.5705
167,168,33302,2485,905,93.6128,19.9813,70.0187,98.9973
168,169,57175,1387,943,97.3522,30.286,59.714,99.642
169,170,2102,1260,820,280.09,77.0476,12.9524,99.9873
170,171,6903,1896,820,258.025,77.2622,12.7378,99.9714
171,172,929,2749,785,117.913,51.1842,38.8158,99.8932
172,173,849,2619,792,294.045,59.4218,30.5782,99.9261
173,174,9851,3311,844,99.0488,26.764,63.236,99.9446
174,175,3571,2412,833,287.798,73.8252,16.1748,99.9551
175,176,2367,2846,818,285.307,58.3632,31.6368,99.9887
176,177,23500,2715,880,301.663,75.4146,14.5854,99.8721
177,178,10707,2227,878,106.727,12.4441,77.5559,99.9675
178,179,1298,1109,826,94.0624,8.89434,81.1057,99.9893
179,180,943,2898,817,94.8003,18.6013,71.3987,99.9922
180,181,6103,2116,846,263.558,71.8675,18.1325,99.9795
181,182,1222,2799,835,123.827,54.6635,35.3365,99.9738
182,183,45985,1075,951,269.601,41.0534,48.9466,99.6362
183,184,6646,821,868,71.8636,76.5004,13.4996,99.9607
184,185,1523,1841,850,271.933,12.3994,77.6006,99.9856
185,186,1247,2296,852,97.9812,32.1436,57.8564,99.9758
186,187,7532,922,895,92.3567,3.36934,86.6307,99.9458
187,188,27885,2890,939,106.27,10.6611,79.3389,99.8752
188,189,664,2334,854,98.1145,27.5802,62.4198,99.9673
189,190,11081,3200,938,87.0687,22.7291,67.2709,99.9827
190,191,927,2036,864,97.2895,77.2878,12.7122,99.9966
191,192,14743,1952,991,265.849,58.7267,31.2733,98.8616
192,193,2350,2347,908,100.311,25.6683,64.3317,99.7662
193,194,2787,208,915,273.619,4.61306,85.3869,99.9886
194,195,24012,1837,989,93.8451,65.3629,24.6371,99.1654
195,196,11161,3119,961,108.603,9.4825,80.5175,99.9511
196,197,40872,3278,1069,282.168,37.3358,52.6642,99.4963
197,198,12985,2042,969,271.951,11.9162,78.0838,99.873
198,199,4107,2131,929,260.166,69.318,20.682,99.9783
199,200,1177,3330,912,285.927,66.6975,23.3025,99.9864
200,201,20396,817,982,273.617,7.80268,82.1973,99.9676
201,202,7796,505,982,280.591,48.4205,41.5795,99.1258
202,203,2109,560,929,278.383,8.25025,81.7497,99.9783
203,204,27466,2257,1037,104.301,19.4854,70.5146,99.9324
204,205,1712,431,954,266.628,29.4871,60.5129,99.8803
205,206,2343,1907,949,89.3062,5.642530000000002,84.3575,99.9873
206,207,13725,2634,993,112.131,32.3752,57.6248,99.5942
207,208,19206,603,1022,82.4111,54.1776,35.8224,99.4907
208,209,18226,1215,1019,94.8835,22.7785,67.2215,99.9065
209,210,1440,242,958,285.15,54.4123,35.5877,99.989
210,211,1778,2179,964,91.9281,32.5347,57.4653,99.9892
211,212,1001,2342,963,83.2513,30.2094,59.7906,99.9676
212,213,723,2664,947,103.548,24.1704,65.8296,99.9832
213,214,2410,208,981,283.92,54.3462,35.6538,99.8963
214,215,2973,2383,1013,269.144,17.1022,72.8978,99.9844
215,216,30448,133,1087,280.093,61.5158,28.4842,99.8941
216,217,4772,703,1024,287.425,39.2141,50.7859,99.7679
217,218,5848,326,1030,94.7649,56.6161,33.3839,99.733
218,219,5079,2123,1010,106.44,24.5338,65.4662,99.9373
219,220,2108,3032,1005,277.665,61.9687,28.0313,99.9856
220,221,5971,448,1032,280.23400000000004,36.8882,53.1118,99.6303
221,222,11787,952,1075,262.849,24.3519,65.6481,99.5323
222,223,1734,355,1011,69.7105,53.7633,36.2367,99.7974
223,224,22613,2530,1100,103.45,16.1213,73.8787,99.413
224,225,11001,2678,1085,110.23,5.46697,84.53299999999999,99.8328
225,226,20744,2909,1070,302.1040000000001,62.7968,27.2032,98.8324
226,227,629,1547,1036,295.241,59.3236,30.6764,99.2566
227,228,11734,307,1107,93.2041,56.5101,33.4899,99.9843
228,229,803,2368,1052,270.944,15.4064,74.5936,99.9916
229,230,16239,3100,1110,289.2940000000001,54.3254,35.6746,99.807
230,231,5347,1530,1086,273.873,7.24184,82.7582,99.8552
231,232,808,433,1061,264.066,6.66205,83.338,99.9944
232,233,4750,831,1095,102.791,24.9367,65.0633,99.9632
233,234,824,18,1095,85.56299999999997,45.8741,44.1259,99.9538
234,235,5491,2432,1107,77.8862,34.3252,55.6748,99.9668
235,236,3359,243,1097,284.588,45.9548,44.0452,99.9953
236,237,12434,2098,1149,43.5853,75.5883,14.4117,99.9201
237,238,15394,1293,1130,92.1951,24.1941,65.8059,99.8946
238,239,2794,1622,1105,68.8461,68.0678,21.9322,99.9741
239,240,2829,746,1101,111.332,65.1767,24.8233,99.9475
240,241,4641,2345,1119,278.791,69.7427,20.2573,99.975
241,242,57561,459,1290,94.5273,8.23755,81.7625,99.1209
242,243,184695,2003,1594,101.918,29.805,60.195,58.6674
243,244,57252,2870,1224,108.738,53.7829,36.2171,99.8062
244,245,1429,616,1108,287.918,48.2658,41.7342,99.99
245,246,630,517,1113,286.7,36.4531,53.5469,99.9866
246,247,1667,2182,1126,284.942,72.5365,17.4635,99.9662
247,248,7459,1853,1142,69.1732,71.6062,18.3938,99.9684
248,249,720,688,1112,283.446,34.3428,55.6572,99.9952
249,250,1848,1443,1139,262.957,6.09882,83.9012,99.9828
250,251,552,43,1134,275.661,61.8178,28.1822,99.9895
251,252,1037,406,1125,282.608,59.7011,30.2989,99.9904
252,253,1142,1478,1131,97.2678,30.186,59.81399999999999,98.9415
253,254,2250,1052,1135,106.245,3.91655,86.0835,99.939
254,255,850,1182,1137,284.716,69.6524,20.3476,99.9902
255,256,1220,1513,1137,275.04,7.36945,82.6306,99.981
256,257,957,1681,1134,273.538,27.6995,62.3005,99.9958
257,258,547,878,1131,275.236,27.9752,62.0248,99.995
258,259,10618,596,1174,286.686,48.89100000000001,41.109,99.9809
259,260,2887,691,1155,282.631,34.2346,55.7654,99.9923
260,261,950,1141,1147,269.666,42.79,47.21,99.9898
261,262,599,3343,1142,89.6785,55.7443,34.2557,99.9737
262,263,715,1609,1139,71.476,68.1662,21.8338,99.9845
263,264,1538,1742,1145,75.5298,64.8186,25.1814,99.9897
264,265,4130,357,1191,277.205,39.629,50.371,99.9434
265,266,6706,756,1178,148.585,84.9995,5.00046,99.9717
266,267,27344,1356,1235,264.161,32.8552,57.1448,99.9448
267,268,20627,822,1228,275.275,27.8503,62.1497,99.9619
268,269,911,1571,1152,91.4017,1.6935,88.3065,99.9909
269,270,1733,2645,1162,97.7775,5.21756,84.7824,99.9901
270,271,1384,1786,1164,75.7346,80.7104,9.28962,99.9885
271,272,3712,1651,1172,274.629,27.0878,62.9122,99.9597
272,273,522,50,1163,276.016,61.8211,28.1789,99.9913
273,274,12998,993,1229,102.242,26.5904,63.4096,98.7232
274,275,14754,2424,1227,105.237,1.73515,88.2648,99.5948
275,276,541,2371,1161,268.881,16.5219,73.4781,99.9954
276,277,4182,1061,1175,106.468,4.2617,85.7383,99.9793
277,278,259401,267,1636,273.141,6.75732,83.2427,100.179
278,279,16623,1152,1233,101.495,44.2065,45.7935,99.9511
279,280,16126,3101,1233,101.666,3.12506,86.8749,99.9187
280,281,3106,2179,1197,88.9343,28.5387,61.4613,99.9869
281,282,754,1553,1186,247.061,86.0786,3.92136,99.9871
282,283,1365,1725,1179,75.4765,65.4727,24.5273,99.9637
283,284,3438,58,1226,273.398,34.4201,55.5799,99.9923
284,285,1073,1476,1197,264.756,81.5163,8.48369,99.9269
285,286,54517,2198,1333,279.86,5.86333,84.1367,99.7355
286,287,2718,2028,1200,284.6670000000001,5.37946,84.6205,99.9866
287,288,811,1835,1198,74.5354,71.69800000000002,18.302,99.9878
288,289,17585,2652,1273,288.771,1.57522,88.4248,99.9367
289,290,5983,561,1252,111.723,18.7234,71.2766,99.9881
290,291,1376,1904,1223,274.692,58.7079,31.2921,99.9623
291,292,610,3242,1220,274.151,34.2403,55.7597,99.7647
292,293,13862,1673,1286,271.665,0.989227,89.0108,99.986
293,294,3412,97,1271,103.07,44.8948,45.1052,99.9914
294,295,1364,3203,1233,270.832,26.1637,63.8363,99.9808
295,296,34228,3278,1343,94.8397,58.2578,31.7422,99.8972
296,297,80807,679,1461,109.057,18.0481,71.9519,99.8885
297,298,4439,2537,1258,109.752,5.66261,84.3374,99.9838
298,299,895,2089,1251,54.8552,77.281,12.719,99.9953
299,300,1734,1546,1258,91.0681,59.0579,30.9421,99.9912
300,301,967,639,1266,280.325,57.6143,32.3857,99.9921
301,302,6814,1781,1290,110.368,81.1594,8.84065,99.9625
302,303,2118,2080,1278,101.407,23.7373,66.2627,99.9605
303,304,6593,2743,1332,100.639,7.62582,82.3742,99.9509
304,305,816,47,1290,274.954,6.9497800000000005,83.0502,99.9932
305,306,831,2815,1283,107.201,8.21941,81.7806,99.9417
306,307,18560,3077,1352,103.113,26.0013,63.9987,99.8934
307,308,1639,2431,1293,293.994,4.63812,85.3619,99.9968
308,309,176788,1092,1509,93.9601,83.1823,6.81774,98.9238
309,310,20545,1539,1355,96.1024,58.3285,31.6715,99.7041
310,311,1219,25,1302,276.80400000000003,7.15009,82.8499,99.9398
311,312,33012,2455,1380,196.915,77.4878,12.5122,99.8745
312,313,2321,2804,1327,114.204,53.1142,36.8858,99.9915
313,314,32184,1365,1418,228.867,74.0299,15.9701,99.7855
314,315,3282,843,1344,277.725,24.5842,65.4158,99.9606
315,316,6304,2613,1376,278.153,8.4806,81.5194,99.9727
316,317,3562,2834,1371,107.345,7.76952,82.2305,99.9683
317,318,6857,1724,1387,277.236,15.9894,74.0106,99.9865
318,319,2100,14,1429,276.334,7.045260000000002,82.9547,99.9381
319,320,1688,334,1388,107.042,48.5917,41.4083,99.9142
320,321,12381,2940,1457,285.586,61.2122,28.7878,99.7868
321,322,2716,2788,1414,101.608,41.4318,48.5682,99.9768
322,323,795,1445,1407,92.8631,55.3081,34.6919,99.9927
323,324,45052,3191,1543,271.089,51.6713,38.3287,97.7945
324,325,1387,1627,1417,250.833,75.0253,14.9747,99.9424
325,326,8537,366,1457,92.1836,6.2451300000000005,83.7549,99.9513
326,327,503,3133,1425,286.878,9.52132,80.4787,99.9922
327,328,921,2858,1428,97.8181,0.472328,89.5277,99.9431
328,329,3094,1473,1450,248.811,72.5187,17.4813,99.8666
329,330,9500,2699,1461,97.5237,71.2534,18.7466,99.9635
330,331,509,1579,1427,97.6962,57.9451,32.0549,99.9928
331,332,2414,3078,1448,104.415,8.62402,81.376,99.9856
332,333,21263,1723,1524,111.615,39.2855,50.7145,99.6273
333,334,581,2134,1440,298.91,12.0051,77.9949,99.9839
334,335,1235,2592,1452,287.096,0.195305,89.8047,99.971
335,336,2217,1602,1462,103.057,7.32523,82.6748,99.9714
336,337,1936,2099,1460,102.482,22.4551,67.5449,99.9906
337,338,3472,2813,1479,99.451,2.72037,87.2796,99.9566
338,339,17807,2218,1526,96.2581,11.1156,78.8844,99.9462
339,340,19568,2368,1532,9.80488,87.2033,2.7967,98.2884
340,341,4039,480,1487,283.013,11.0806,78.9194,99.2507
341,342,4501,2565,1493,279.66,7.31579,82.6842,99.9728
342,343,2649,3333,1490,271.875,34.5974,55.4026,99.9938
343,344,6061,2478,1499,100.901,1.61811,88.3819,98.9916
344,345,33349,1515,1569,87.9867,58.0053,31.9947,99.3283
345,346,1619,1644,1502,275.164,12.6924,77.3076,99.5134
346,347,813,2124,1502,256.11,83.1412,6.85884,99.9961
347,348,8067,2983,1545,96.0786,5.56754,84.4325,98.977
348,349,5328,2745,1540,297.121,58.0311,31.969,98.6757
349,350,13847,2588,1582,48.981,80.1768,9.82318,99.2159
350,351,755,3350,1548,101.175,50.9033,39.0967,99.6555
351,352,6660,2112,1568,107.899,8.53072,81.4693,99.9599
352,353,759,2820,1546,91.2106,2.49307,87.5069,99.9185
353,354,3786,2695,1583,114.27,67.7838,22.2162,99.3433
354,355,14808,2875,1603,93.6665,10.1432,79.8568,99.9297
355,356,36834,656,1685,109.05,6.87563,83.1244,99.8331
356,357,716,2467,1569,301.243,58.1043,31.8957,99.689
357,358,82273,1700,1820,108.948,24.7626,65.2374,99.784
358,359,3029,3328,1611,274.165,15.9456,74.0544,99.9798
359,360,3360,3050,1608,294.149,41.1417,48.8583,99.9886
360,361,4486,2294,1641,277.47700000000003,62.4317,27.5683,99.9221
361,362,1011,2768,1596,273.892,4.6738300000000015,85.3262,99.9756
362,363,97670,2383,1852,271.54900000000004,20.5204,69.4796,98.9517
363,364,1004,2497,1620,292.465,13.0476,76.9524,99.993
364,365,153812,1144,1807,283.259,38.0088,51.9912,99.6167
365,366,23527,2963,1709,89.866,1.23846,88.7615,98.1922
366,367,3053,2778,1640,89.1829,3.16534,86.8347,99.9709
367,368,91012,2762,1841,112.669,58.0488,31.9512,99.5984
368,369,8124,2555,1686,112.424,0.28476,89.7152,99.9883
369,370,8059,3090,1683,102.536,2.5249200000000003,87.4751,99.9604
370,371,2702,3178,1655,323.236,80.6407,9.35929,99.9695
371,372,4857,3325,1703,95.7693,3.93372,86.0663,99.9358
372,373,16582,1867,1736,106.581,39.3826,50.6174,99.9696
373,374,2383,1579,1690,104.447,1.70185,88.2981,99.9924
374,375,92915,3105,1889,106.719,35.3871,54.6129,99.4979
375,376,2869,35,1755,274.317,6.49815,83.5019,99.9821
376,377,2793,3056,1768,107.847,43.7125,46.2875,99.9822
377,378,4186,585,1788,276.449,17.4752,72.5248,99.972
378,379,1905,640,1766,109.157,6.17435,83.8256,99.9635
379,380,3740,2612,1782,75.5718,64.6975,25.3025,99.9775
380,381,4643,803,1815,73.4755,67.3387,22.6613,99.9756
381,382,4012,2561,1816,87.6877,68.476,21.524,99.9896
382,383,1612,45,1831,274.525,6.40594,83.5941,99.9833
383,384,402444,1159,2209,104.577,12.3418,77.6582,87.7955
384,385,694,1637,1803,104.719,10.4244,79.5756,99.9799
385,386,2714,3341,1846,96.3498,3.79306,86.2069,99.9276
386,387,2447,3040,1838,107.889,3.27277,86.7272,99.9746
387,388,1381,1398,1830,276.572,19.972,70.028,99.9459
388,389,6185,1895,1873,204.36,77.3912,12.6088,99.9495
389,390,22954,1459,1939,104.041,11.2886,78.7114,99.3189
390,391,2559,19,1890,96.5869,21.1425,68.8575,99.8973
391,392,1974,908,1857,101.726,65.1453,24.8547,99.9924
392,393,11818,1673,1929,103.391,10.83,79.17,99.9718
393,394,6520,2220,1892,277.55,64.6822,25.3178,99.9659
394,395,1193,65,1887,274.648,6.44701,83.553,99.9804
395,396,26746,2597,1998,92.4322,69.028,20.972,99.1099
396,397,30871,3247,2013,290.086,54.0207,35.9793,99.6632
397,398,1159,2277,1911,277.327,23.8163,66.1837,99.9966
398,399,576,3046,1894,285.494,5.52401,84.476,99.9912
399,400,5759,468,1979,102.706,12.1834,77.8166,99.1164
400,401,18741,1981,1994,283.19,20.0471,69.9529,98.9545
401,402,27880,149,2009,288.067,0.632423,89.3676,99.9884
402,403,2877,927,1966,101.602,16.9369,73.0631,99.9917
403,404,685,1160,1947,281.426,37.6765,52.3235,99.9805
404,405,1660,21,1979,278.405,45.4772,44.5228,99.9505
405,406,5230,1674,2031,276.199,66.5936,23.4064,98.495
406,407,597,327,2015,87.5674,56.803,33.197,99.7593
407,408,1582,3092,2023,123.912,54.7422,35.2578,99.9883
408,409,40820,521,2093,104.729,62.0707,27.9293,99.6925
409,410,612,9,2062,285.057,45.3027,44.6973,99.9051
410,411,10976,1879,2060,62.2253,80.1863,9.81367,99.2431
411,412,6113,2084,2064,287.416,4.02917,85.9708,99.9602
412,413,106360,2229,2214,102.983,8.18375,81.8162,99.6806
413,414,506,917,2030,286.009,30.4422,59.5578,99.9947
414,415,1206,292,2047,286.203,30.7667,59.2333,99.9803
415,416,604,1031,2040,108.686,20.9809,69.0191,99.9856
416,417,540,2501,2042,103.868,66.8386,23.1614,98.4666
417,418,2214,740,2060,105.887,3.817730000000001,86.1823,99.9775
418,419,15386,2615,2119,280.737,39.1206,50.8794,99.9164
419,420,569,683,2067,278.806,51.015,38.985,99.8826
420,421,18571,2954,2115,103.584,58.877,31.123,99.7967
421,422,154267,2981,2427,278.942,30.471,59.529,68.545
422,423,4538,1648,2105,286.578,79.3842,10.6158,99.9773
423,424,1350,3318,2104,94.965,29.6478,60.3522,99.9873
424,425,80763,433,2307,285.495,16.0272,73.9728,87.4365
425,426,12145,1976,2148,351.466,78.703,11.297,99.8835
426,427,1536,1702,2093,70.225,61.861,28.139,99.9897
427,428,26449,1792,2163,85.911,56.6134,33.3866,99.9407
428,429,52114,185,2209,100.733,8.14973,81.8503,99.9648
429,430,1052,2481,2096,101.623,41.3113,48.6887,99.8374
430,431,6310,2430,2176,68.7325,68.8748,21.1252,99.9545
431,432,10552,741,2144,100.612,12.4313,77.5687,99.969
432,433,19264,3225,2169,273.956,0.478645,89.5214,99.9528
433,434,5400,905,2136,93.2059,14.9949,75.0051,99.962
434,435,1695,3120,2130,106.929,58.5141,31.4859,99.985
435,436,802,824,2134,109.953,31.172,58.828,99.9324
436,437,15505,636,2231,105.836,23.9067,66.0933,99.9561
437,438,5243,864,2201,94.0776,21.4516,68.5484,99.9701
438,439,1367,814,2177,101.074,24.3081,65.6919,99.9878
439,440,1582,1680,2183,78.5991,62.4687,27.5313,99.9815
440,441,15591,2625,2213,106.212,12.0998,77.9002,99.9465
441,442,813,2473,2177,287.471,7.26318,82.7368,99.4843
442,443,2268,27,2216,279.658,71.8022,18.1978,99.9568
443,444,843,3107,2176,97.6123,43.2296,46.7704,99.9908
444,445,5718,3052,2207,110.354,58.4795,31.5205,99.9501
445,446,3149,1905,2212,288.967,58.5901,31.4099,99.9661
446,447,5338,3097,2251,98.9297,43.5188,46.4812,99.9678
447,448,2080,3309,2211,98.8229,14.3456,75.6544,99.9693
448,449,12488,1611,2276,223.977,82.5262,7.47375,99.9454
449,450,11490,2521,2266,114.228,5.7725300000000015,84.2275,99.9216
450,451,7970,738,2270,313.218,86.5498,3.4501699999999995,99.9722
451,452,1985,2732,2238,277.487,3.4578900000000004,86.5421,99.992
452,453,9001,2024,2287,107.224,26.829,63.17100000000001,99.9575
453,454,6353,1865,2281,285.309,61.0707,28.9293,99.8787
454,455,10131,3302,2315,276.41,37.2522,52.7478,99.9814
455,456,3683,1720,2265,82.5148,45.2977,44.7023,99.9934
456,457,5013,3241,2275,272.913,45.3508,44.6492,99.9906
457,458,678,799,2245,101.938,74.1108,15.8892,99.9921
458,459,1438,1107,2258,282.688,2.24827,87.7517,99.9955
459,460,9715,75,2339,275.373,4.39221,85.6078,99.9955
460,461,925,196,2261,301.982,55.8765,34.1235,99.982
461,462,1513,1943,2270,281.596,45.3573,44.6427,99.8952
462,463,4333,2443,2290,277.761,4.82409,85.1759,98.9087
463,464,4527,339,2299,284.366,37.3278,52.6722,99.9955
464,465,617,836,2273,95.727,21.1908,68.8092,99.9973
465,466,937,606,2288,98.7903,37.5158,52.4842,99.9786
466,467,7348,137,2321,298.761,78.37100000000002,11.629,99.9908
467,468,672,1902,2280,285.969,47.1585,42.8415,99.9467
468,469,512,1787,2273,286.272,9.01828,80.9817,99.99
469,470,7941,2650,2309,113.632,19.5372,70.4628,99.9394
470,471,8022,648,2345,104.483,21.7151,68.2849,99.9539
471,472,2154,1698,2323,168.07299999999995,86.0068,3.99322,99.9787
472,473,9473,1782,2346,285.723,44.5458,45.4542,99.9386
473,474,2492,2845,2327,72.6729,72.5338,17.4662,99.9882
474,475,61793,1950,2467,97.7795,20.5698,69.4302,98.6132
475,476,1335,1648,2346,288.915,42.6531,47.3469,99.9972
476,477,31650,2359,2490,276.633,42.5192,47.4808,99.4367
477,478,3655,190,2375,300.715,56.4008,33.5992,99.997
478,479,2243,2536,2355,287.512,38.43,51.57,99.9864
479,480,25117,2684,2421,77.8488,74.0427,15.9573,99.9046
480,481,4803,2468,2383,112.293,7.30052,82.6995,98.9573
481,482,13862,3152,2409,99.6223,49.6337,40.3663,99.9559
482,483,1122,734,2371,242.174,87.355,2.64501,99.9926
483,484,3966,2818,2388,269.639,40.2514,49.7486,99.9866
484,485,6088,2199,2402,109.915,30.6227,59.3773,99.9599
485,486,2946,1664,2406,98.5866,65.8927,24.1073,99.934
486,487,10242,3277,2422,280.568,4.5948,85.4052,99.9632
487,488,608,2768,2390,270.398,38.1221,51.8779,99.9892
488,489,25929,2515,2520,279.371,36.4307,53.5693,99.5883
489,490,24742,1738,2484,105.428,49.5176,40.4824,99.37
490,491,1379,2123,2409,106.897,13.4292,76.5708,99.9871
491,492,3003,59,2445,99.0365,19.5628,70.4372,99.9811
492,493,97553,319,2593,274.076,33.6837,56.3163,78.4537
493,494,21402,1374,2521,98.273,14.5313,75.4687,99.9411
494,495,815,29,2455,102.225,19.3047,70.6953,99.8492
495,496,29236,649,2533,69.5142,72.9201,17.0799,98.7696
496,497,978,581,2454,286.907,44.6886,45.3114,99.9721
497,498,2447,866,2465,269.916,28.1819,61.8181,99.9826
498,499,4847,2231,2481,103.905,26.2893,63.7107,99.9775
499,500,16452,3304,2594,97.9821,15.6377,74.3623,99.7836
500,501,13123,2132,2525,281.52,26.0878,63.9122,99.8639
501,502,32115,914,2586,275.376,1.0068700000000002,88.9931,99.0915
502,503,1168,822,2495,272.347,27.6384,62.3616,99.9428
503,504,105459,1133,2787,102.839,28.6317,61.3683,99.7266
504,505,534,1148,2496,95.0387,1.3821,88.6179,99.9904
505,506,5198,2622,2541,70.9178,73.5689,16.4311,98.0321
506,507,2565,1606,2539,286.4770000000001,40.2726,49.7274,99.5608
507,508,2430,2042,2541,106.188,27.5714,62.4286,99.7401
508,509,14588,2737,2574,283.849,12.6092,77.3908,99.9465
509,510,686,2205,2530,284.152,44.8491,45.1509,99.4496
510,511,3957,2249,2559,109.59,28.425,61.575,99.8589
511,512,11365,3217,2622,191.228,86.6646,3.33542,99.6353
512,513,5531,1076,2586,97.055,2.27602,87.72399999999998,99.8946
513,514,797,1145,2544,297.738,41.9746,48.0254,99.9943
514,515,1905,1034,2550,16.4183,80.2199,9.78008,99.9709
515,516,29573,1667,2637,97.9792,13.8818,76.1182,99.8684
516,517,1058,1281,2572,297.0,43.6038,46.3962,99.9854
517,518,541,1804,2563,66.518,71.1593,18.8407,99.9942
518,519,3125,689,2579,275.877,24.2644,65.7356,99.9868
519,520,7296,2883,2609,262.60400000000004,17.7797,72.2203,99.9835
520,521,19771,185,2669,272.18,14.73,75.27,99.9342
521,522,502,1783,2588,99.9911,45.2138,44.7862,99.9929
522,523,660,2062,2588,112.062,28.841,61.159,99.9122
523,524,2103,1827,2599,267.713,22.3927,67.6073,99.9756
524,525,20396,2312,2679,106.283,34.0509,55.9491,99.8147
525,526,2182,571,2603,276.16,25.4207,64.5793,99.9926
526,527,5483,2160,2621,282.836,38.6416,51.3584,99.921
527,528,11833,2823,2679,268.094,2.4146,87.5854,99.9408
528,529,931,2625,2598,91.6718,54.4236,35.5764,99.9892
529,530,35175,608,2745,94.8382,58.5884,31.4116,99.9021
530,531,73669,1459,2786,280.144,48.8438,41.1562,89.3692
531,532,5121,1337,2634,92.5717,37.2311,52.7689,99.9882
532,533,4799,2954,2659,90.9058,44.7966,45.2034,99.4396
533,534,736,2078,2620,95.8454,53.3407,36.6593,99.9969
534,535,13442,774,2676,272.616,38.0562,51.9438,99.9417
535,536,2239,1901,2642,93.637,12.1471,77.8529,99.9864
536,537,1210,1037,2637,291.29,40.3084,49.6916,99.9961
537,538,44010,2464,2774,122.088,51.1258,38.8742,95.3464
538,539,9713,2035,2672,114.443,28.3868,61.6132,99.9831
539,540,972,1836,2641,95.7662,12.2266,77.7734,99.9906
540,541,669,2661,2644,290.637,52.1949,37.8051,99.9962
541,542,783,2126,2656,276.708,31.9826,58.0174,99.9971
542,543,11195,2632,2727,94.6168,29.7982,60.2018,99.9707
543,544,6785,1067,2701,334.296,75.0554,14.9446,99.9863
544,545,3190,1814,2688,267.983,24.3427,65.6573,99.977
545,546,8279,2211,2724,112.201,31.3528,58.6472,99.9781
546,547,13841,2750,2767,97.9394,71.8062,18.1938,99.9499
547,548,2631,292,2703,284.209,28.1427,61.8573,99.9661
548,549,3304,990,2697,101.675,3.87327,86.1267,99.9106
549,550,10648,1972,2747,118.943,37.454,52.54600000000001,99.4852
550,551,700,2115,2694,281.291,41.1093,48.8907,99.9063
551,552,1805,1855,2711,94.0272,7.62833,82.3717,99.9889
552,553,3188,863,2738,23.1816,83.2609,6.73907,99.9932
553,554,1461,1631,2724,106.779,52.8568,37.1432,99.9786
554,555,5194,3234,2750,90.927,52.5697,37.4303,99.9853
555,556,2201,811,2737,262.933,24.8647,65.1353,99.9822
556,557,4231,2959,2750,273.306,2.80843,87.1916,97.9889
557,558,17598,2089,2807,277.03,36.0795,53.9205,99.9681
558,559,5663,928,2780,84.0082,35.1403,54.8597,99.6555
559,560,1238,2137,2745,114.385,41.2563,48.7437,99.9863
560,561,862,1906,2740,90.7449,49.9945,40.0055,99.9868
561,562,703,1738,2751,242.252,84.0647,5.9353099999999985,99.9742
562,563,12096,138,2794,302.036,68.577,21.423,99.9665
563,564,14861,1699,2823,242.795,81.5447,8.45526,99.9101
564,565,4770,2882,2774,280.225,31.9329,58.0671,99.9875
565,566,1559,989,2750,284.284,0.718163,89.2818,99.994
566,567,23525,750,2842,90.7478,31.5813,58.4187,99.9767
567,568,19737,1887,2827,99.6057,68.0754,21.9246,99.8591
568,569,1408,239,2760,279.512,10.3302,79.6698,99.9911
569,570,5695,299,2783,93.0295,12.2735,77.7265,99.9788
570,571,16025,3140,2810,278.934,48.3031,41.6969,99.917
571,572,619,3221,2774,271.902,40.9716,49.0284,99.9931
572,573,7127,1263,2813,219.351,86.1436,3.85638,99.9502
573,574,6389,2217,2809,106.948,25.1477,64.8523,99.9827
574,575,1803,2574,2814,97.69,29.6607,60.3393,99.9953
575,576,4683,2971,2850,101.788,4.90065,85.0993,98.717
576,577,13878,874,2886,265.036,42.822,47.178,99.9497
577,578,1767,3012,2820,282.935,11.7439,78.2561,99.9903
578,579,11748,217,2871,61.225,73.7035,16.2965,99.9524
579,580,7079,3297,2860,87.3565,24.1862,65.8138,99.8932
580,581,2612,2292,2837,271.931,32.0038,57.9962,99.9571
581,582,8236,338,2868,95.1219,17.1969,72.8031,99.911
582,583,17180,2858,2929,264.882,34.2419,55.7581,99.9452
583,584,28127,523,2916,93.7289,30.1479,59.8521,99.2337
584,585,1362,2610,2835,273.459,46.1258,43.8742,99.9944
585,586,6861,2705,2856,103.925,64.4133,25.5867,99.7706
586,587,12417,1807,2902,104.926,8.3893,81.6107,99.9097
587,588,2164,1619,2864,295.337,73.7221,16.2779,99.9814
588,589,953,73,2858,274.97700000000003,10.0232,79.9768,99.9853
589,590,656,385,2855,123.831,78.7166,11.2834,99.9142
590,591,14751,3061,2920,278.811,19.6121,70.3879,99.9598
591,592,87869,2122,3079,101.493,32.365,57.635,54.495
592,593,1512,2806,2868,92.7006,4.50127,85.4987,99.9879
593,594,53342,3169,3014,279.152,11.6521,78.3479,98.6405
594,595,131738,2495,3157,111.113,10.4512,79.5488,99.341
595,596,4561,121,2886,280.528,47.6884,42.3116,99.9808
596,597,4585,2021,2898,274.494,24.3269,65.6731,99.9886
597,598,5922,1337,2901,274.296,48.2187,41.7813,99.9815
598,599,1463,51,2896,282.987,47.0114,42.9886,99.9004
599,600,74815,1543,3096,282.661,35.0669,54.9331,99.2161
600,601,726,1275,2878,279.159,46.8458,43.1542,99.9932
601,602,1068,408,2922,77.7423,9.22871,80.7713,99.9776
602,603,13512,2729,2962,191.846,85.8661,4.13394,99.7765
603,604,14848,682,2998,103.167,66.1186,23.8814,99.3161
604,605,7403,1268,2954,90.5184,15.4927,74.5073,99.9792
605,606,10159,2961,2970,95.8636,12.7782,77.2218,98.7911
606,607,8674,2117,2945,126.605,68.5196,21.4804,99.9808
607,608,10746,2386,2963,276.467,51.3314,38.6686,99.9282
608,609,1281,1663,2920,105.284,28.033,61.967,99.9919
609,610,16620,325,2980,89.7739,40.3873,49.6127,89.8957
610,611,19880,1719,2998,103.736,16.4695,73.5305,87.155
611,612,3047,800,2952,85.7546,8.980369999999997,81.0196,99.9845
612,613,11700,922,3015,289.737,76.8129,13.1871,98.8537
613,614,11876,106,2989,277.655,24.1633,65.8367,98.1998
614,615,1309,2031,2960,292.47,50.1072,39.8928,99.9956
615,616,1091,735,2961,10.6437,86.1309,3.86908,99.9895
616,617,5875,1349,2993,107.714,28.0157,61.9843,99.9002
617,618,2027,215,2985,279.432,56.7336,33.2664,99.8139
618,619,1302,483,2985,101.427,47.2742,42.7258,99.9624
619,620,3516,2498,3000,110.559,20.0117,69.9883,99.9592
620,621,10114,1858,3016,232.925,77.6784,12.3216,98.2297
621,622,2473,2084,2991,283.199,36.8429,53.1571,99.9936
622,623,8387,522,3059,282.26,1.6924400000000002,88.3076,99.9608
623,624,24939,1168,3105,74.5058,77.7142,12.2858,99.7032
624,625,881,1126,3021,266.938,35.9658,54.0342,99.8579
625,626,10243,821,3062,274.268,38.613,51.387,99.9377
626,627,2555,451,3040,274.368,28.6808,61.3192,99.2375
627,628,21331,215,3107,76.9752,46.4507,43.5493,99.9738
628,629,1936,1278,3049,96.7972,38.8683,51.1317,99.9096
629,630,1490,1493,3044,97.983,55.002,34.998000000000005,99.4356
630,631,919,1315,3054,296.673,47.6842,42.3158,99.9911
631,632,2400,2313,3059,73.1188,73.47399999999998,16.526,99.2834
632,633,1808,48,3074,279.786,27.3095,62.6905,99.9293
633,634,28311,2798,3133,88.1385,15.547,74.453,99.9009
634,635,1163,300,3062,82.1805,53.0588,36.9412,99.9883
635,636,970,745,3064,86.241,34.2237,55.7763,99.9895
636,637,6850,1032,3118,280.869,41.8157,48.1843,99.9908
637,638,2644,335,3089,79.2621,41.8566,48.1434,99.9933
638,639,6375,1959,3093,288.811,36.5033,53.4967,99.4241
639,640,1614,3286,3078,84.3624,1.02966,88.9703,99.9905
640,641,643,2969,3077,100.365,15.1862,74.8138,99.9793
641,642,37689,543,3196,275.578,40.5174,49.4826,99.7343
642,643,15440,3236,3162,66.1779,62.944,27.056,99.9805
643,644,1007,102,3089,262.48900000000003,72.2487,17.7513,99.9891
644,645,8480,408,3132,84.3438,49.2704,40.7296,99.8722
645,646,23705,1781,3155,94.9511,0.8681030000000001,89.1319,99.9302
646,647,1974,722,3106,97.2873,19.8544,70.1456,99.9937
647,648,1386,1883,3102,255.769,82.2306,7.76938,99.9913
648,649,10517,2274,3139,109.618,24.3279,65.6721,99.969
649,650,22256,2994,3176,72.0328,82.8419,7.1581,99.9403
650,651,2720,658,3121,99.6489,19.2529,70.7471,99.9935
651,652,35326,903,3201,265.876,32.3625,57.6375,99.3275
652,653,1329,2689,3120,280.327,13.2948,76.7052,99.9869
653,654,1698,769,3123,90.0134,4.3753,85.6247,99.9946
654,655,893,44,3127,282.475,61.0651,28.9349,99.9348
655,656,547,99,3120,88.0573,1.1818799999999998,88.8181,99.9726
656,657,7724,1304,3172,276.51,32.1856,57.8144,99.9492
657,658,962,2648,3139,97.4468,12.4367,77.5633,99.9807
658,659,16441,1899,3220,91.0255,8.57249,81.4275,99.4315
659,660,5555,64,3225,266.199,72.6852,17.3148,99.8494
660,661,50013,293,3313,260.068,70.5526,19.4474,99.7599
661,662,6307,326,3197,80.8888,47.5409,42.4591,99.9767
662,663,1131,741,3170,272.108,49.9188,40.0812,99.9967
663,664,37002,2645,3303,105.739,6.4161199999999985,83.5839,99.8365
664,665,3796,1205,3194,279.538,38.1689,51.8311,99.9786
665,666,1495,1433,3176,94.0408,0.866585,89.1334,98.8974
666,667,5521,1378,3229,263.486,2.16608,87.8339,99.8965
667,668,21414,3152,3292,286.357,28.2838,61.7162,99.9416
668,669,1206,175,3189,275.803,9.79933,80.2007,99.996
669,670,2433,1259,3213,83.5022,78.1842,11.8158,99.9923
670,671,11128,2206,3258,61.1699,67.7248,22.2752,99.9631
671,672,9699,1974,3291,278.938,2.82776,87.1722,99.4206
672,673,6610,749,3253,99.9861,18.2068,71.7932,99.9868
673,674,31175,1469,3333,98.3716,4.65476,85.3452,98.7361
674,675,1033,258,3236,77.8037,43.9124,46.0876,99.9809
675,676,10213,643,3276,275.015,2.50032,87.4997,99.9572
676,677,8034,1029,3270,104.964,52.918,37.082,99.9701
677,678,8785,1135,3266,271.10900000000004,1.69508,88.3049,99.9671
678,679,3342,3272,3270,85.3777,68.6422,21.3578,99.9919
679,680,6296,1759,3270,292.7340000000001,59.6158,30.3842,99.9769
680,681,656,244,3261,273.66700000000003,68.7306,21.2694,99.9913
681,682,1815,1317,3283,278.971,60.4445,29.5555,99.9735
682,683,7697,1608,3317,298.701,53.4765,36.5235,99.9863
683,684,35862,2973,3376,278.415,64.3593,25.6407,68.5158
684,685,21123,851,3354,260.082,48.6959,41.3041,99.9322
685,686,4900,1670,3327,82.6858,71.50399999999998,18.496,99.9694
686,687,23217,2787,3379,90.2,14.2194,75.7806,99.8935
687,688,1981,1252,3303,100.033,77.8211,12.1789,99.9623
688,689,4800,175,3318,91.3821,24.3675,65.6325,99.9967
689,690,1026,3238,3304,274.134,30.171,59.82899999999999,99.9889
690,691,10630,1184,3352,91.4025,27.8286,62.1714,99.9561
691,692,600,2831,3304,103.829,83.3939,6.60607,99.9959
692,693,1160,1835,3321,100.319,48.3826,41.6174,99.9892
693,694,2977,3294,3338,88.7109,58.0483,31.9517,99.9933
694,695,26339,677,3387,274.548,6.23428,83.7657,99.8908
695,696,51833,1779,3480,117.432,49.7959,40.2041,99.6379
696,697,2250,1293,3353,89.4331,10.1088,79.8912,99.9823
697,698,21868,2217,3450,99.4996,13.3489,76.6511,99.7014
698,699,12788,3214,3419,280.235,0.33628800000000003,89.6637,99.9845
699,700,15870,1065,3389,97.0064,24.8568,65.1432,99.9575
700,701,20610,2031,3410,103.606,14.8054,75.1946,99.8335
701,702,5317,1891,3374,169.672,84.4619,5.5380699999999985,99.9728
702,703,2747,2336,3358,99.9914,5.84079,84.1592,99.9905
703,704,2792,2133,3355,281.454,33.1495,56.8505,99.9909
704,705,2709,493,3404,267.774,68.8998,21.1002,99.985
705,706,11277,3094,3449,282.676,6.67055,83.3295,99.9468
706,707,3058,962,3409,108.911,11.7253,78.2747,99.3684
707,708,6939,163,3438,94.1171,31.4228,58.5772,99.9916
708,709,5557,1316,3419,274.447,54.4837,35.5163,99.9709
709,710,1464,3300,3399,271.868,29.3039,60.6961,99.9812
710,711,12997,1628,3476,107.656,40.3199,49.6801,99.6691
711,712,5837,299,3429,88.5936,25.3763,64.6237,99.9829
712,713,7899,1408,3472,92.0755,8.66532,81.3347,99.7405
713,714,29629,623,3519,300.874,63.2809,26.7191,99.1924
714,715,6091,1194,3438,93.6336,1.17485,88.8251,99.9692
715,716,9095,2363,3475,251.813,63.4686,26.5314,99.9516
716,717,1923,3272,3442,85.9484,62.969,27.031,99.9934
717,718,1967,2662,3438,107.686,41.4385,48.5615,99.9857
718,719,536,72,3419,94.2059,22.8387,67.1613,99.9699
719,720,622,2324,3439,261.212,68.6368,21.3632,99.9583
720,721,2170,2446,3454,90.7551,11.9523,78.0477,98.7643
721,722,2980,1924,3464,269.49,49.6645,40.3355,99.7658
722,723,74429,459,3652,345.3780000000001,81.0349,8.965119999999997,67.2507
723,724,28444,1562,3581,104.345,18.6608,71.3392,98.9988
724,725,3415,483,3459,271.819,8.277999999999999,81.722,99.6674
725,726,1170,73,3453,94.1954,25.9149,64.0851,99.9802
726,727,5280,1058,3468,278.666,32.4732,57.5268,99.9737
727,728,25315,2609,3578,280.066,22.4057,67.5943,99.6256
728,729,4155,3299,3489,282.139,26.3219,63.6781,99.9687
729,730,968,1247,3454,273.068,60.06100000000001,29.939,99.998
730,731,713,48,3472,95.9792,23.9851,66.0149,99.8142
731,732,526,821,3449,277.546,68.0207,21.9793,99.995
732,733,16799,829,3510,236.134,85.9418,4.05821,98.3019
733,734,7176,2741,3488,102.904,7.212999999999999,82.787,99.9824
734,735,5607,392,3482,263.743,14.5359,75.4641,99.8824
735,736,8255,973,3507,159.3,82.0007,7.99931,97.9111
736,737,879,1473,3462,97.2188,9.88226,80.1177,99.9825
737,738,8714,2847,3497,134.658,78.328,11.672,99.8722
738,739,1701,2542,3475,122.59,41.464,48.536,99.9832
739,740,18690,1215,3527,272.969,6.17253,83.8275,95.1159
740,741,26759,2040,3540,112.853,10.3495,79.6505,85.1598
741,742,11992,2502,3580,88.9688,46.1955,43.8045,99.3006
742,743,79511,248,3712,90.545,0.583145,89.4169,99.9812
743,744,132416,1367,3843,94.0663,10.3729,79.6271,85.9034
744,745,21840,3047,3575,283.3,18.0098,71.9902,99.6573
745,746,36685,3216,3641,272.66200000000003,34.0351,55.9649,99.8772
746,747,838,2925,3506,278.34,5.444369999999998,84.5556,99.9812
747,748,1102,2457,3521,111.303,14.3839,75.6161,99.6306
748,749,2857,2404,3554,75.4542,44.7935,45.2065,99.789
749,750,59388,2258,3678,104.421,13.3342,76.6658,99.8022
750,751,34672,1276,3642,275.218,0.912498,89.0875,99.9019
751,752,4969,2751,3571,290.478,37.5981,52.4019,99.8112
752,753,5455,2842,3589,281.155,4.30704,85.693,99.9163
753,754,1504,980,3571,277.775,10.0322,79.9678,99.1192
754,755,14331,1896,3653,70.4042,73.9956,16.0044,83.3342
755,756,6336,835,3599,271.313,5.09261,84.9074,99.9519
756,757,660,47,3606,93.7666,0.190453,89.8095,99.8993
757,758,46111,2481,3810,104.903,20.5267,69.4733,98.1472
758,759,1804,984,3606,291.7290000000001,60.4463,29.5537,99.988
759,760,2241,1125,3605,290.548,60.9033,29.0967,99.9678
760,761,3644,933,3642,276.815,48.3862,41.6138,99.205
761,762,44274,1065,3741,107.886,6.41446,83.5855,99.9111
762,763,198616,2829,4024,99.858,6.18755,83.8125,95.7613
763,764,555,748,3621,276.48400000000004,55.9976,34.0024,99.9922
764,765,29876,2023,3730,102.102,54.895,35.105,99.7972
765,766,856,2669,3621,114.067,26.1502,63.8498,99.982
766,767,1516,2101,3640,284.199,64.5779,25.4221,99.9918
767,768,12359,3036,3703,294.398,3.93784,86.0622,99.9648
768,769,9993,2811,3699,65.5587,74.1045,15.8955,99.9054
769,770,6478,1741,3666,107.244,42.7205,47.2795,99.982
770,771,9598,1627,3700,97.3009,54.0654,35.9346,99.9722
771,772,1052,2756,3654,291.956,37.0604,52.9396,99.9883
772,773,2983,792,3672,284.1040000000001,56.5326,33.4674,99.9382
773,774,1444,2686,3657,277.076,23.259,66.741,99.963
774,775,853,2627,3661,116.291,25.1828,64.8172,99.9424
775,776,13360,674,3723,271.844,13.2897,76.7103,99.9559
776,777,1191,2708,3686,283.665,34.4651,55.5349,99.8901
777,778,3479,860,3695,270.406,3.5014,86.4986,99.9797
778,779,10974,3137,3767,96.5875,22.1912,67.8088,99.9362
779,780,771,2658,3690,100.333,14.6555,75.3445,99.9451
780,781,1788,2890,3712,278.87,34.0843,55.9157,99.9765
781,782,288713,1625,4089,99.8521,12.5475,77.4525,90.6549
782,783,1226,909,3716,80.0085,0.944099,89.0559,99.9897
783,784,31322,784,3805,81.2761,70.8181,19.1819,99.938
784,785,21219,2681,3815,279.976,31.7582,58.2418,99.9221
785,786,615,744,3748,269.262,13.4934,76.5066,99.9689
786,787,967,2549,3750,105.561,23.6965,66.3035,99.9946
787,788,5953,3273,3809,47.2594,73.8567,16.1433,99.9754
788,789,2073,2618,3776,101.884,14.0954,75.9046,99.9916
789,790,3741,2832,3774,282.55,34.3136,55.6864,99.9466
790,791,1113,961,3779,280.369,46.9642,43.0358,99.9857
791,792,1923,3071,3809,276.839,8.4426,81.5574,99.9898
792,793,4292,2251,3825,110.095,28.2965,61.7035,99.98
793,794,8990,2309,3867,281.17,63.5296,26.4704,99.9844
794,795,604,973,3811,94.9923,8.582980000000001,81.417,99.9893
795,796,2825,568,3835,282.619,49.0467,40.9533,99.9784
796,797,1341,370,3856,269.303,2.84496,87.155,99.9911
797,798,1768,2817,3845,99.8977,30.9067,59.0933,99.9897
798,799,5806,2756,3876,101.864,19.1602,70.8398,99.9179
799,800,12359,2168,3889,278.263,25.4945,64.5055,99.9648
800,801,3895,3135,3858,101.021,27.9509,62.0491,99.9274
801,802,158425,849,4109,90.7867,52.7614,37.2386,90.9114
802,803,5679,2089,3909,95.0885,3.57659,86.4234,99.9547
803,804,62962,534,4020,342.374,75.6965,14.3035,99.1635
804,805,35398,3163,3982,289.832,3.08128,86.9187,99.9601
805,806,573,1877,3868,87.7015,3.93017,86.0698,99.9887
806,807,6751,2029,3910,105.627,1.72971,88.2703,99.9687
807,808,3565,3285,3912,102.774,45.5598,44.4402,99.9398
808,809,1865,435,3895,272.56,1.25983,88.7402,98.8698
809,810,5560,700,3932,95.8938,71.1417,18.8583,99.987
810,811,1874,1030,3893,92.1659,9.09317,80.9068,99.9751
811,812,96350,2396,4155,281.781,24.4856,65.5144,99.3312
812,813,3149,2803,3913,87.632,27.3013,62.6987,99.987
813,814,2601,1949,3934,86.1068,75.7367,14.2633,98.9724
814,815,20251,304,3990,272.182,30.2568,59.7432,99.8818
815,816,691,65,3940,268.541,16.9524,73.0476,99.9405
816,817,77513,2092,4230,94.2314,24.182,65.818,99.2755
817,818,6659,2014,4022,82.7415,70.7179,19.2821,97.9055
818,819,1619,2142,3991,93.6239,61.4151,28.5849,99.9902
819,820,1534,198,4020,268.807,8.48359,81.5164,99.9917
820,821,3142,385,4013,86.3714,1.53233,88.4677,99.9813
821,822,3600,2484,4028,263.60200000000003,48.35,41.65,99.5326
822,823,1250,2082,4027,95.622,3.03315,86.9669,99.886
823,824,8731,3228,4117,13.5313,78.7569,11.2431,99.8305
824,825,8408,3274,4120,98.171,14.9602,75.0398,99.9941
825,826,116444,1122,4238,309.906,71.1725,18.8275,99.8377
826,827,21588,270,4135,273.98400000000004,16.2449,73.7551,99.9008
827,828,5297,2064,4103,287.493,15.0853,74.9147,99.9412
828,829,3909,2542,4101,345.216,80.4796,9.52044,99.9666
829,830,544,55,4083,272.97900000000004,17.8325,72.1675,99.9796
830,831,1801,389,4121,262.356,1.31695,88.6831,99.9912
831,832,3620,3165,4130,295.236,72.14699999999998,17.852999999999994,99.9583
832,833,7205,1779,4137,260.891,20.8756,69.1244,99.9653
833,834,11368,123,4193,100.478,8.59821,81.4018,99.9604
834,835,10465,608,4174,280.01,36.015,53.985,99.9826
835,836,1480,866,4139,277.861,46.8701,43.1299,99.9719
836,837,1180,1904,4152,92.5341,8.33788,81.6621,98.7044
837,838,1257,3314,4173,96.3883,14.8467,75.1533,99.8075
838,839,1920,389,4182,346.276,74.3286,15.6714,99.9757
839,840,5169,3135,4210,96.544,25.7051,64.2949,99.9647
840,841,16779,2875,4257,104.802,48.3508,41.6492,99.7325
841,842,5990,2211,4202,284.84,44.4599,45.5401,99.9776
842,843,12739,1881,4230,82.1557,61.8316,28.1684,99.9352
843,844,21061,1800,4324,92.0682,24.5075,65.4925,99.8954
844,845,719,2289,4195,269.535,40.0978,49.9022,99.9775
845,846,15500,372,4261,276.249,38.4402,51.5598,97.3048
846,847,541,508,4198,343.746,68.1962,21.8038,99.9958
847,848,2616,3076,4228,293.3540000000001,74.368,15.632,99.9914
848,849,752,247,4244,272.351,12.0071,77.9929,99.8685
849,850,4552,3259,4263,92.7072,26.2444,63.7556,99.9903
850,851,13775,2266,4300,279.062,44.1756,45.8244,99.9414
851,852,10925,3226,4311,107.352,35.414,54.58600000000001,99.9895
852,853,14177,3039,4308,96.6681,26.014,63.986,99.9447
853,854,685,297,4277,275.415,33.6035,56.3965,99.9905
854,855,682,3110,4273,102.009,26.873,63.127,99.9914
855,856,847,209,4273,272.861,6.46799,83.53200000000002,99.9966
856,857,2602,3143,4297,111.547,21.1059,68.8941,99.996
857,858,10965,2631,4329,294.73,4.48257,85.5174,99.976
858,859,823,144,4297,99.75,6.9486300000000005,83.0514,99.9772
859,860,6973,258,4333,109.435,61.9196,28.0804,99.9588
860,861,998,183,4308,266.60900000000004,0.781158,89.2188,99.9883
861,862,9583,2983,4377,273.18,46.3367,43.6633,99.9324
862,863,4534,130,4357,99.4568,9.83852,80.1615,99.9745
863,864,1984,2745,4336,111.026,7.31641,82.6836,99.9929
864,865,18763,3149,4404,109.115,2.10944,87.8906,99.9685
865,866,1073,181,4358,273.199,6.637760000000001,83.3622,99.9867
866,867,1837,2336,4356,103.318,30.065,59.935,99.9945
867,868,3066,321,4382,72.5221,75.6625,14.3375,99.9829
868,869,17492,2885,4415,104.982,26.0073,63.9927,99.8732
869,870,3575,1912,4399,90.6117,71.1873,18.8127,99.913
870,871,950,385,4374,279.176,50.4963,39.5037,99.9638
871,872,1771,2549,4390,281.4770000000001,26.1945,63.8055,99.9929
872,873,10718,2737,4429,90.2645,41.5997,48.4003,99.9457
873,874,4434,2404,4411,100.784,52.6162,37.3838,99.901
874,875,8092,1148,4417,303.553,73.0662,16.9338,99.9741
875,876,2298,2674,4389,293.8540000000001,3.7493,86.2507,99.979
876,877,5763,1995,4420,277.55,14.0287,75.9713,99.9603
877,878,1386,2504,4409,109.988,54.2897,35.7103,99.9383
878,879,3465,2271,4404,102.773,68.1292,21.8707,99.9942
879,880,651,211,4393,262.274,28.8523,61.1477,99.9708
880,881,982,687,4405,84.8555,57.819,32.181,99.9186
881,882,2201,951,4406,99.4738,10.3871,79.6129,99.9169
882,883,1419,99,4408,100.778,10.4551,79.5449,99.9147
883,884,1258,2342,4401,279.034,43.3131,46.6869,99.9937
884,885,851,466,4409,87.9991,29.0757,60.9243,99.924
885,886,3890,3270,4426,109.662,23.0193,66.9807,99.996
886,887,1262,2607,4431,91.8243,31.1014,58.8986,99.9454
887,888,2102,1871,4431,272.694,16.2622,73.7378,99.9746
888,889,2449,2111,4439,285.396,50.0502,39.9498,99.988
889,890,3942,2192,4435,101.526,29.1734,60.8266,99.979
890,891,1240,3042,4450,28.4443,79.9816,10.0184,99.9908
891,892,2215,2339,4435,278.91,25.1475,64.8525,99.9832
892,893,1209,2562,4440,283.871,44.962,45.038,99.9735
893,894,1669,1803,4440,92.4288,23.5316,66.4684,99.9827
894,895,846,2240,4454,100.637,29.2595,60.7405,99.99
895,896,1074,1805,4459,94.6918,22.856,67.14399999999999,99.6661
896,897,1419,2505,4474,284.325,48.0357,41.9643,99.6931
897,898,526,2968,4482,108.772,25.0015,64.9985,99.8318
