,Grain No.,Size [Pixel],center x-coordinate,center y-coordinate,mean azimuth [degree],mean latitude [degree],mean colatitude [degree],Regelungsgrad [%]
0,1,31401,671,336,159.111,48.7559,41.2441,99.6443
1,2,275025,447,661,177.049,30.8084,59.1916,97.1629
2,3,664,287,298,169.437,44.4901,45.5099,99.7987
3,4,536,793,300,154.292,51.2812,38.7188,99.9532
4,5,501,1483,301,184.626,35.0487,54.9513,99.6322
5,6,2526,1518,328,185.954,35.3271,54.6729,99.8341
6,7,1275,3036,341,21.9504,37.7234,52.2766,99.6674
7,8,509,2863,333,353.01199999999994,39.3362,50.6638,99.7261
8,9,6619,1514,368,185.165,33.4277,56.5723,99.935
9,10,2283,1371,379,85.1549,85.9506,4.04941,99.9885
10,11,17443,1686,408,6.0511,8.099210000000001,81.9008,99.8874
11,12,13484,910,435,359.362,59.5304,30.4696,99.9098
12,13,24310,1142,431,121.922,85.471,4.529,99.8262
13,14,12209,2126,425,3.88808,2.6453,87.3547,99.9894
14,15,787,2838,366,353.791,37.1635,52.8365,99.9384
15,16,1537,2913,372,352.403,37.5322,52.4678,99.9314
16,17,3374,3056,396,352.756,38.5424,51.4576,99.8789
17,18,829,1804,392,142.44299999999996,69.4473,20.5527,99.9808
18,19,71376,1273,542,15.6759,22.1952,67.8048,99.7029
19,20,4138,1909,417,141.99200000000005,69.6356,20.3644,99.9796
20,21,27857,1569,494,135.95600000000002,62.6739,27.3261,99.7985
21,22,775,2521,416,4.53611,9.14141,80.8586,99.9742
22,23,26286,702,489,161.499,47.1939,42.8061,99.8748
23,24,19257,2276,507,20.2284,20.3835,69.6165,99.7901
24,25,180990,2733,677,357.202,11.3324,78.6676,89.1883
25,26,21986,1807,554,150.806,74.2951,15.7049,99.7402
26,27,5558,1889,471,3.69179,5.70297,84.29700000000003,99.9856
27,28,91012,2011,679,352.461,36.0829,53.9171,91.0996
28,29,676,882,482,179.778,1.41959,88.5804,99.9882
29,30,671,1716,483,135.106,73.0069,16.9931,99.5478
30,31,1637,2399,503,134.417,45.4177,44.5823,99.7338
31,32,8306,2117,543,161.826,56.0938,33.9062,99.9599
32,33,82012,929,778,173.542,46.253,43.747,75.7023
33,34,531,3008,537,354.0,36.595,53.405,99.9519
34,35,2148,1575,560,130.525,66.0695,23.9305,99.9748
35,36,1548,2978,584,177.232,3.54126,86.4587,99.9616
36,37,8846,734,607,154.457,73.7354,16.2646,99.9187
37,38,502,2313,593,150.554,40.2463,49.7537,99.2011
38,39,1423,2640,607,182.396,39.0754,50.9246,99.5148
39,40,7493,1758,650,182.121,3.95451,86.0455,99.9866
40,41,59318,1498,864,164.44400000000005,59.9529,30.0471,79.8112
41,42,13002,2354,676,347.231,18.7998,71.2002,99.9756
42,43,6165,1324,640,176.232,2.4671,87.5329,99.9952
43,44,3154,1599,637,183.587,2.35228,87.6477,99.9868
44,45,2858,1648,651,183.453,2.38771,87.6123,99.9849
45,46,674,2136,619,342.208,44.5695,45.4305,99.9824
46,47,782,2615,642,183.187,33.9642,56.0358,99.7969
47,48,14517,1097,697,355.971,72.3844,17.6156,99.9014
48,49,602,824,649,158.88,70.4709,19.5291,99.9918
49,50,839,680,652,159.315,71.0888,18.9112,99.9924
50,51,1303,2689,683,182.558,42.9896,47.0104,99.9723
51,52,207789,1175,980,177.794,1.57027,88.4297,100.112
52,53,526,2284,680,348.954,42.2166,47.7834,99.8731
53,54,3589,2663,719,184.454,42.1364,47.8636,99.9149
54,55,5532,667,717,185.521,28.2848,61.7152,99.9153
55,56,793,2259,703,357.855,55.6818,34.3182,99.9851
56,57,1397,1586,706,183.677,1.94161,88.0584,99.9914
57,58,285770,2224,1166,3.45542,17.7629,72.2371,98.5529
58,59,542,103,751,15.1743,63.3237,26.6763,99.9402
59,60,53538,2527,944,10.9378,4.1504900000000005,85.8495,99.8554
60,61,25432,208,868,7.5099,64.7942,25.2058,99.9571
61,62,1118,1790,770,180.936,5.05336,84.9466,99.9932
62,63,95400,2765,970,167.56900000000005,30.7606,59.2394,99.9637
63,64,551,2528,777,6.54674,12.216,77.78399999999998,99.9926
64,65,623,1694,788,177.08700000000005,6.03955,83.9604,99.9987
65,66,83002,1858,984,178.91099999999997,2.48599,87.514,99.9847
66,67,959,1758,804,179.646,3.76893,86.2311,99.997
67,68,1358,1718,837,178.118,2.19395,87.806,99.9964
68,69,2828,1607,864,171.782,11.7835,78.2165,99.9639
69,70,4226,770,864,17.39,63.0315,26.9685,99.9929
70,71,22358,358,936,13.0767,66.5082,23.4918,99.8853
71,72,2914,1987,907,185.162,41.8653,48.1347,99.9687
72,73,754,135,911,10.4693,67.9665,22.0335,99.9419
73,74,519,500,916,356.963,9.73824,80.2618,99.8528
74,75,22205,559,999,1.54037,48.49,41.51,99.5895
75,76,533,120,1016,133.24,80.6328,9.3672,99.7014
76,77,2378,194,1019,185.444,8.56178,81.4382,99.9756
77,78,913,1628,1004,177.56,6.43679,83.5632,99.9788
78,79,2017,399,1021,177.868,1.67707,88.3229,99.904
79,80,14143,284,1102,174.52700000000004,71.3094,18.6906,99.9327
80,81,12112,822,1053,7.392530000000002,47.0819,42.9181,99.894
81,82,1481,1622,1041,179.78400000000005,4.68547,85.3145,99.9793
82,83,3661,460,1096,177.907,1.15508,88.8449,99.8837
83,84,1241,180,1055,185.055,11.0248,78.9752,99.9835
84,85,4473,386,1081,178.608,1.4669,88.5331,99.9875
85,86,23289,1725,1155,1.31649,24.3739,65.6261,99.9707
86,87,3459,187,1127,165.245,82.5623,7.43766,99.95
87,88,35592,2903,1178,5.73505,3.3572800000000003,86.6427,99.7748
88,89,5041,570,1112,176.953,2.8789700000000003,87.12100000000002,99.9397
89,90,41953,1493,1205,8.71316,0.263321,89.7367,99.8819
90,91,3216,2106,1135,358.626,5.4936300000000005,84.5064,99.9313
91,92,11708,2660,1148,0.219287,7.13744,82.8626,99.9559
92,93,25609,1903,1216,122.668,71.2858,18.7142,99.9418
93,94,11991,445,1200,0.217892,5.64984,84.3502,99.8827
94,95,853,2773,1150,359.499,7.39202,82.60799999999998,99.9704
95,96,881,630,1148,358.824,4.21309,85.7869,99.9962
96,97,8765,344,1195,0.7613,7.914910000000001,82.0851,99.9628
97,98,187922,369,1421,178.25400000000005,53.6096,36.3904,98.4543
98,99,928,109,1175,175.949,48.5993,41.4007,99.8892
99,100,1653,1302,1177,169.21099999999996,55.5766,34.4234,99.9484
100,101,3866,536,1177,359.787,1.7658,88.2342,99.9778
101,102,759,832,1171,177.437,3.09308,86.9069,99.998
102,103,1722,3123,1213,355.43,47.4075,42.5925,99.7904
103,104,3760,2705,1205,6.12946,2.56922,87.4308,99.9888
104,105,10341,2543,1253,149.41299999999995,35.7402,54.2598,99.91
105,106,99170,884,1360,356.51199999999994,30.6781,59.3219,99.8751
106,107,4431,3056,1255,358.07,42.518,47.482,99.8607
107,108,2367,918,1218,163.898,57.4033,32.5967,99.9746
108,109,7208,1103,1254,169.13,56.6549,33.3451,99.9391
109,110,84014,1755,1414,9.66155,67.6834,22.3166,99.8259
110,111,15648,2645,1304,148.849,35.1168,54.8832,99.9753
111,112,2835,1273,1270,164.688,56.7434,33.2566,99.5808
112,113,671,1230,1250,172.01,49.4767,40.5233,99.8217
113,114,215632,2707,1552,176.9,31.4929,58.5071,96.2556
114,115,5176,475,1294,161.089,48.6355,41.3645,99.9858
115,116,59794,1381,1390,352.3130000000001,10.7854,79.2146,100.017
116,117,1440,1467,1287,138.555,69.1267,20.8733,99.9796
117,118,1453,1918,1296,358.29,10.9251,79.0749,99.9758
118,119,503,3127,1297,358.316,42.7991,47.2009,99.9436
119,120,7997,2453,1404,351.485,31.5729,58.4271,99.9599
120,121,30389,1153,1467,21.5685,79.7426,10.2575,82.3495
121,122,15323,3016,1461,5.11779,3.69034,86.3097,99.973
122,123,1319,2800,1406,127.082,55.0872,34.9128,99.9882
123,124,505,531,1390,189.517,60.6798,29.3202,99.8557
124,125,57272,603,1579,359.528,21.6033,68.3967,96.2515
125,126,3285,1584,1496,170.002,70.6655,19.3345,99.0138
126,127,4272,685,1485,3.8381,8.129430000000001,81.8706,93.7471
127,128,100205,1896,1638,160.232,74.2805,15.7195,99.5008
128,129,4063,793,1499,182.953,61.72,28.28,99.3681
129,130,1117,2043,1500,131.517,54.9467,35.0533,99.9447
130,131,2342,1294,1513,359.19699999999995,63.2123,26.7877,99.5831
131,132,3258,1524,1515,197.402,30.7876,59.2124,99.9547
132,133,9972,1348,1557,194.172,35.2058,54.7942,99.9822
133,134,40307,1125,1635,4.6379800000000015,13.412,76.58800000000002,99.9025
134,135,4580,954,1544,181.963,62.2143,27.7857,99.8834
135,136,83106,1477,1729,176.622,30.4084,59.5916,58.3527
136,137,2595,868,1551,185.461,29.4668,60.5332,99.9768
137,138,12666,2346,1619,345.754,21.5388,68.4612,99.9521
138,139,628,906,1583,183.239,54.1318,35.8682,98.8882
139,140,27689,2082,1644,207.83,28.4737,61.5263,99.9807
140,141,31794,2936,1703,88.6103,61.4596,28.5404,99.2647
141,142,7568,909,1636,186.178,33.0434,56.9566,99.9753
142,143,655,2582,1613,0.903495,33.5451,56.4549,99.9895
143,144,809,735,1615,188.558,34.1263,55.8737,99.9242
144,145,37200,185,1750,6.950139999999998,29.4039,60.5961,99.2555
145,146,2293,2633,1629,166.96200000000005,67.9131,22.0869,99.9895
146,147,62646,950,1749,154.453,73.0527,16.9473,99.94
147,148,2595,2802,1653,173.261,19.234,70.766,99.9911
148,149,1156,2257,1660,183.801,1.8816,88.1184,99.9921
149,150,531,704,1679,187.774,32.3695,57.6305,99.7912
150,151,7837,2236,1704,3.93664,0.883759,89.1162,99.9891
151,152,584534,516,2225,179.174,8.7933,81.2067,74.2307
152,153,75886,2135,1829,215.638,9.79012,80.2099,99.9596
153,154,3782,542,1734,178.84,47.7283,42.2717,99.9934
154,155,2362,652,1743,165.562,71.4543,18.5457,99.9961
155,156,39312,1270,1839,201.101,24.6733,65.3267,99.9717
156,157,36205,2440,1833,189.001,26.8895,63.1105,98.8632
157,158,21072,1868,1829,352.404,10.4832,79.5168,99.9793
158,159,69414,2933,2017,182.813,20.9632,69.0368,99.769
159,160,173353,1487,2071,354.445,10.0792,79.9208,99.7611
160,161,3093,1812,1908,171.59599999999998,67.523,22.477,99.9949
161,162,2169,116,1917,351.415,42.2452,47.7548,99.937
162,163,35021,2559,1977,359.185,31.5831,58.4169,99.7863
163,164,722579,1586,2550,187.963,25.1971,64.8029,91.5837
164,165,5270,2748,1930,156.68,75.9126,14.0874,99.9923
165,166,1243,2823,1912,181.513,11.9955,78.0045,99.9972
166,167,1046,323,1919,183.43400000000003,14.4741,75.5259,99.9981
167,168,14393,2097,1982,179.472,21.0849,68.9151,99.8231
168,169,1011,652,1940,359.148,2.3585,87.6415,99.9923
169,170,98626,2301,2174,179.94299999999996,29.5812,60.4188,99.945
170,171,1556,1088,1974,180.11,2.04153,87.9585,99.9888
171,172,9205,2727,2015,180.927,13.0403,76.9597,99.9852
172,173,3769,2057,2049,182.105,12.0283,77.9717,99.9722
173,174,1542,193,2011,182.478,14.2367,75.7633,99.9934
174,175,600,170,2033,182.816,14.5897,75.4103,99.991
175,176,569,2182,2027,151.216,33.7274,56.2726,99.9916
176,177,3529,2468,2070,21.8477,4.22477,85.7752,99.8457
177,178,3375,2808,2059,114.834,82.9891,7.01088,98.2497
178,179,161003,1128,2274,169.579,50.4801,39.5199,99.9426
179,180,644,2561,2066,0.664856,9.6777,80.3223,99.9966
180,181,8569,2703,2121,113.509,59.4909,30.5091,99.953
181,182,6336,2147,2107,358.0080000000001,22.1036,67.8964,99.9877
182,183,1011,2627,2075,180.167,17.3305,72.6695,99.9988
183,184,619,2601,2089,0.247915,14.3751,75.6249,99.9945
184,185,737,2002,2090,204.852,18.2122,71.7878,99.9715
185,186,57456,2710,2199,0.187477,22.0669,67.9331,99.9323
186,187,1622,2771,2111,182.756,22.8712,67.1288,99.5088
187,188,606,863,2117,175.47099999999998,45.5321,44.4679,99.6749
188,189,1901,2048,2133,205.144,18.9484,71.0516,99.9956
189,190,728,2158,2148,358.89,13.6398,76.3602,99.9989
190,191,2039,2123,2190,160.371,34.3259,55.6741,99.9716
191,192,4081,1893,2208,29.836,41.4233,48.5767,99.9707
192,193,14599,2477,2259,19.7079,57.577,32.423,99.953
193,194,2431,2936,2290,194.287,9.84766,80.1523,99.9698
194,195,4934,2124,2326,359.242,0.393784,89.6062,99.9952
195,196,410528,2497,2817,15.3294,48.0446,41.9554,85.7023
196,197,11213,2811,2323,111.236,57.1836,32.8164,99.9676
197,198,129373,2889,2651,170.36900000000003,14.6932,75.3068,93.8005
198,199,21285,1860,2413,165.826,56.2585,33.7415,99.9801
199,200,2750,2873,2367,169.30599999999995,22.0896,67.9104,99.9706
200,201,3421,777,2436,186.604,9.67513,80.3249,99.9709
201,202,847,823,2458,185.397,9.22908,80.7709,99.9915
202,203,3141,109,2492,173.918,37.5056,52.4944,99.4199
203,204,1467,224,2457,167.49200000000005,30.1682,59.8318,99.9807
204,205,2004,2364,2470,15.2202,43.4079,46.5921,99.9168
205,206,8256,2610,2536,169.72,9.73054,80.2695,99.7896
206,207,1089,1269,2507,349.4369999999999,46.9266,43.0734,99.9842
207,208,1179,168,2547,344.547,39.591,50.409,99.9491
208,209,2391,609,2571,179.43099999999995,43.8709,46.1291,99.8871
209,210,2346,208,2595,182.949,27.0407,62.9593,99.9947
210,211,1952,522,2600,174.41,32.9861,57.0139,99.9698
211,212,809203,646,3374,177.537,13.8336,76.1664,89.54700000000003
212,213,2604,234,2642,165.919,26.5756,63.4244,99.91
213,214,2285,170,2628,344.84,41.7044,48.2956,99.5791
214,215,2011,125,2664,184.232,28.5702,61.4298,99.8268
215,216,30460,257,2777,173.44099999999997,18.344,71.656,99.9271
216,217,70924,1444,2868,183.51,71.9426,18.0574,99.7738
217,218,37268,160,2975,173.451,21.8919,68.1081,99.745
218,219,916,2650,2729,181.041,4.72803,85.272,99.9969
219,220,2489,856,2793,176.155,29.7502,60.2498,99.9516
220,221,18407,783,2840,171.456,7.4364,82.5636,99.9521
221,222,1098,2639,2803,51.6231,64.9191,25.0809,99.9943
222,223,5090,1612,2823,180.223,28.2261,61.7739,99.9973
223,224,9687,962,2879,351.056,50.0044,39.9956,99.9381
224,225,17805,2236,2865,183.412,45.1098,44.8902,99.9855
225,226,42458,1727,2923,156.44899999999996,83.4915,6.50846,99.7149
226,227,553,2588,2834,6.2979400000000005,56.5118,33.4882,99.8481
227,228,4097,2943,2860,179.699,25.8169,64.1831,99.9249
228,229,10768,2654,2883,11.1177,55.2963,34.7037,99.9178
229,230,1292,1591,2873,208.111,23.2363,66.7637,99.9978
230,231,3728,2999,2922,171.938,9.56876,80.4312,99.9887
231,232,6737,2899,2923,165.14700000000005,56.1308,33.8692,99.9921
232,233,556,215,2904,349.251,35.3668,54.6332,99.9922
233,234,1088,157,2911,349.959,41.6446,48.3554,99.7939
234,235,602,3139,2928,177.451,29.5265,60.4735,99.9213
235,236,3089,2393,2965,336.767,35.4133,54.5867,99.9939
236,237,5789,2321,2981,180.906,63.4054,26.5946,99.991
237,238,593,2938,2971,168.50099999999995,50.6234,39.3766,99.9455
238,239,1623,2987,2974,16.5892,54.418,35.582,99.9861
239,240,4039,1843,3002,186.721,24.2704,65.7296,99.9506
240,241,2399,1952,2989,178.24900000000005,43.0955,46.9045,99.953
241,242,1485,2884,2977,12.0171,56.2009,33.7991,99.9948
242,243,1850,1206,3016,183.752,4.7794300000000005,85.2206,99.9678
243,244,4486,1573,3019,215.476,17.5372,72.4628,99.9813
244,245,12895,1107,3057,183.703,4.59432,85.4057,99.5093
245,246,813,1903,3005,334.032,43.8228,46.1772,99.9726
246,247,13699,1939,3077,3.15928,68.5782,21.4218,99.7211
247,248,1602,1409,3037,343.999,51.5465,38.4535,99.8635
248,249,936,1642,3044,184.349,24.5573,65.4427,99.8668
249,250,9319,1779,3083,182.79,1.72192,88.2781,99.9583
250,251,15969,1505,3094,352.5780000000001,49.8438,40.1562,99.7965
251,252,569,1389,3076,184.772,65.244,24.756,99.9568
252,253,759,321,3080,175.37099999999995,13.6576,76.3424,99.9986
253,254,10352,952,3124,353.599,45.6442,44.3558,99.9211
254,255,61254,1901,3220,353.3830000000001,28.0064,61.9936,99.8392
255,256,78953,1303,3241,187.326,72.1081,17.8919,94.7558
256,257,1991,2745,3102,165.21,22.9857,67.0143,99.9606
257,258,887,281,3094,1.75917,60.9187,29.0813,99.9862
258,259,1074,734,3097,8.20095,62.5984,27.4016,99.9919
259,260,1863,2449,3112,359.588,21.9195,68.0805,99.4212
260,261,3170,1701,3118,340.8830000000001,50.9209,39.0791,99.9796
261,262,11020,2565,3158,13.9799,18.1681,71.8319,99.984
262,263,1183,2700,3121,14.3586,31.2943,58.7057,99.9953
263,264,1399,545,3126,185.757,11.9657,78.0343,99.9741
264,265,17391,1021,3207,351.566,2.77605,87.2239,99.8231
265,266,8278,2261,3181,0.193885,23.7527,66.2473,99.9317
266,267,1823,1564,3151,173.018,57.0868,32.9132,99.9936
267,268,842,2814,3146,167.773,25.8299,64.1701,99.7084
268,269,10028,2727,3180,165.176,34.5345,55.4655,99.8966
269,270,75809,2487,3293,182.668,26.6054,63.3946,95.2129
270,271,4839,1491,3182,179.36900000000003,19.8749,70.1251,99.7341
271,272,2227,120,3230,167.303,29.933000000000003,60.067,99.9546
272,273,3302,1473,3227,184.103,58.3918,31.6082,97.6396
273,274,552,899,3213,174.47099999999998,24.1185,65.8815,99.7104
274,275,3903,1557,3260,353.242,28.9444,61.0556,99.9897
275,276,842,1169,3240,359.158,46.1386,43.8614,99.9976
276,277,660,1640,3236,178.81099999999995,9.85496,80.145,99.9852
277,278,26420,2818,3332,162.309,37.4154,52.5846,99.9428
278,279,598,2775,3242,15.2848,61.2034,28.7966,99.9672
279,280,520,1109,3247,171.084,38.9458,51.0542,99.9612
280,281,1377,2721,3261,4.1844,23.2332,66.7668,99.9906
281,282,74615,2124,3398,167.862,26.6603,63.3397,99.8138
282,283,4420,1695,3287,178.142,10.6679,79.3321,99.9871
283,284,1143,1626,3277,177.922,10.8472,79.1528,99.9924
284,285,4675,2138,3308,4.25544,1.7085,88.2915,99.9846
285,286,45590,1130,3379,356.576,35.2035,54.7965,98.7297
286,287,976,3144,3314,10.2829,25.7868,64.2132,99.8945
287,288,8353,1605,3343,177.44299999999996,7.2458,82.7542,99.9908
288,289,863,1644,3313,181.275,7.63772,82.3623,99.9998
289,290,3790,2981,3366,163.85299999999995,55.7197,34.2803,99.985
290,291,6775,2716,3394,177.005,2.87733,87.1227,99.9952
291,292,887,3141,3392,7.83476,54.8397,35.1603,99.9515
292,293,9705,2431,3407,347.892,29.7778,60.2222,99.9442
293,294,1227,1549,3378,351.7519999999999,43.0414,46.9586,99.9906
294,295,11449,2918,3448,359.2390000000001,28.9665,61.0335,99.9641
295,296,60569,1898,3493,174.484,42.7043,47.2957,99.2729
296,297,11670,1648,3462,187.114,53.2565,36.7435,99.9131
297,298,723,1606,3397,182.885,60.4656,29.5344,99.9854
298,299,1259,2998,3445,160.52100000000004,55.8925,34.1075,99.9753
299,300,207225,2709,3715,165.97299999999996,11.1045,78.8955,99.2551
300,301,4219,2815,3464,180.327,7.47208,82.5279,99.9974
301,302,38889,2390,3545,177.043,49.6784,40.3216,99.7511
302,303,973,1322,3461,175.459,32.5091,57.4909,99.9927
303,304,1152,822,3496,181.791,2.88401,87.116,99.9709
304,305,15383,2099,3580,169.08599999999996,65.9371,24.0629,99.588
305,306,2417,2986,3530,179.076,11.4062,78.5938,99.9704
306,307,1430,1224,3524,179.503,14.4761,75.5239,99.705
307,308,3496,1688,3547,169.576,8.26337,81.7366,99.9798
308,309,938,884,3554,179.378,17.8216,72.1784,99.9788
309,310,4430,1758,3586,165.99,39.1771,50.8229,99.5062
310,311,197599,1209,3817,351.985,30.3299,59.6701,91.6097
311,312,163879,1918,3768,354.607,37.9193,52.0807,99.033
312,313,746,892,3608,184.517,10.4409,79.5591,99.9256
313,314,4325,1555,3637,180.322,6.16971,83.8303,99.9611
314,315,894,3134,3640,356.912,53.1035,36.8965,99.9542
315,316,1284,2066,3660,177.709,48.6367,41.3633,99.8662
316,317,639,2334,3659,182.402,10.425,79.575,99.9989
317,318,3813,147,3720,178.92700000000005,3.73072,86.2693,99.5904
318,319,31634,2406,3801,183.986,21.2618,68.7382,99.7692
319,320,4340,2161,3737,158.635,38.8251,51.1749,99.9727
320,321,1408,3140,3755,165.315,42.3188,47.6812,99.9419
321,322,2035,224,3766,171.668,15.314,74.686,99.9939
322,323,966,3056,3782,166.68900000000005,42.0148,47.9852,99.891
323,324,3126,2990,3796,177.05200000000005,22.4078,67.5922,99.9072
324,325,15320,973,3842,353.684,8.06248,81.9375,99.8761
325,326,16004,202,3853,185.502,9.98398,80.016,99.9897
326,327,546,3083,3807,165.144,44.4429,45.5571,99.9323
327,328,57827,2986,4018,167.709,39.4776,50.5224,99.8942
328,329,1926,3126,3858,165.519,42.0678,47.9322,99.8932
329,330,4582,887,3874,177.84799999999996,64.1912,25.8088,99.9771
330,331,45736,792,3987,355.084,6.39182,83.6082,94.865
331,332,21176,1506,3924,354.934,77.8994,12.1006,99.9335
332,333,737,804,3888,180.626,7.603389999999999,82.3966,99.9995
333,334,2394,2313,3902,342.1280000000001,45.7937,44.2063,99.979
334,335,26097,237,4014,352.529,32.7665,57.2335,99.8352
335,336,543,3135,3921,165.28799999999995,42.1643,47.8357,99.9037
336,337,866,2865,3919,171.6,3.66375,86.3363,99.985
337,338,11442,343,3970,356.6790000000001,2.94992,87.0501,99.9576
338,339,1060,1229,3946,187.952,73.8005,16.1995,99.9875
339,340,936,2342,3945,340.936,44.9027,45.0973,99.9636
340,341,2529,2437,3957,186.248,22.8762,67.1238,99.8792
341,342,21649,507,4030,357.6090000000001,65.9294,24.0706,99.6224
342,343,693,2859,4001,170.425,4.92001,85.08,99.9879
343,344,4240,1391,4018,175.99400000000003,6.52048,83.4795,99.9748
344,345,4847,3151,4065,166.09099999999995,42.5293,47.4707,99.8891
345,346,518,875,4034,178.128,3.62056,86.3794,99.9672
346,347,5727,1210,4061,1.9021,24.5744,65.4256,99.9809
347,348,1757,353,4066,352.215,66.8098,23.1902,99.9359
348,349,1275,904,4059,357.575,0.7316739999999999,89.2683,99.9803
349,350,2549,2819,4118,171.155,8.16628,81.8337,99.9926
350,351,17947,676,4122,357.496,1.51991,88.4801,99.9561
351,352,11254,1426,4142,177.167,8.91051,81.0895,99.8445
352,353,1157,406,4101,354.672,2.82101,87.179,99.9884
353,354,4360,1354,4159,167.95,88.1793,1.8207,99.9813
354,355,38430,1207,4210,1.6393099999999998,23.6217,66.3783,99.9846
355,356,28346,2954,4247,336.807,70.1274,19.8726,90.2846
356,357,12111,480,4156,134.345,77.9769,12.0231,99.9548
357,358,46673,1017,4279,330.598,58.658,31.342,99.9511
358,359,4568,3157,4233,342.995,84.3334,5.66657,99.9252
359,360,1024,810,4152,177.333,12.7385,77.2615,99.9939
360,361,2727,3067,4197,334.3730000000001,82.8886,7.1113800000000005,99.9587
361,362,15759,865,4250,177.185,13.3895,76.6105,99.9247
362,363,3634,2799,4189,169.69299999999996,50.2282,39.7718,99.9952
363,364,1673,579,4178,221.991,82.7052,7.29477,99.9879
364,365,1183,1552,4193,142.224,79.4594,10.5406,99.9879
365,366,1642,1485,4209,179.933,10.5185,79.4815,99.9815
366,367,574,817,4191,177.576,12.9704,77.0296,99.9993
367,368,160670,2606,4513,340.04,54.4573,35.5427,99.3837
368,369,2446,723,4208,357.911,0.6341479999999999,89.3659,99.966
369,370,7694,586,4251,216.636,81.071,8.929,99.9558
370,371,14415,1369,4272,160.871,80.2057,9.79426,99.9423
371,372,8115,1536,4266,182.82,1.55167,88.4483,99.9764
372,373,168740,493,4509,138.575,78.9496,11.0504,96.1178
373,374,618,719,4224,218.504,82.76700000000002,7.23302,99.9507
374,375,1633,754,4259,177.989,18.722,71.278,99.9948
375,376,602,1474,4255,180.796,10.6578,79.3422,99.9896
376,377,3669,664,4261,177.885,18.5887,71.4113,99.9949
377,378,1125,1611,4266,169.47400000000005,78.6325,11.3675,99.9819
378,379,245231,1918,4534,352.07,7.17409,82.8259,97.0577
379,380,3178,1235,4328,342.4980000000001,58.6367,31.3633,99.921
380,381,728,333,4295,352.996,29.5359,60.4641,99.9563
381,382,17220,699,4362,163.439,35.06,54.94,99.9953
382,383,4272,846,4345,176.635,13.0048,76.9952,99.9541
383,384,30582,1482,4400,358.844,1.01797,88.98200000000001,99.9264
384,385,19078,1261,4387,179.646,40.8286,49.1714,99.9194
385,386,13561,2959,4378,159.941,27.9598,62.0402,99.7824
386,387,4568,170,4376,173.047,56.654,33.346,99.9314
387,388,2290,794,4356,176.25599999999997,20.0428,69.9572,99.9709
388,389,8632,1822,4403,347.472,60.0568,29.9432,99.9729
389,390,18765,662,4446,193.082,74.2391,15.7609,99.8395
390,391,2868,225,4406,163.81799999999996,38.2963,51.7037,99.9831
391,392,11974,833,4484,175.03900000000004,37.9553,52.0447,99.9358
392,393,1012,1074,4424,177.928,41.0078,48.9922,99.9881
393,394,37098,989,4586,343.843,75.6296,14.3704,99.6497
394,395,2196,2926,4437,177.28400000000005,87.5774,2.42257,99.9722
395,396,923,1033,4433,180.435,77.6361,12.3639,96.0766
396,397,2576,1251,4436,191.269,77.7385,12.2615,99.9949
397,398,8751,993,4485,177.763,40.4095,49.5905,99.9131
398,399,14220,2997,4502,349.244,1.01669,88.9833,99.6511
399,400,541,161,4462,171.172,57.7303,32.2697,99.9106
400,401,5783,1322,4486,197.051,73.8475,16.1525,99.5118
401,402,16911,2827,4526,171.87099999999995,76.5147,13.4853,98.8285
402,403,2743,1094,4484,233.703,76.3877,13.6123,99.9837
403,404,1371,1226,4463,222.911,75.83,14.17,99.9919
404,405,519,1149,4475,189.89,72.0422,17.9578,97.3382
405,406,16133,1200,4536,342.73,59.8599,30.1401,99.7916
406,407,3480,3082,4541,134.808,88.1433,1.85667,97.8698
407,408,600,3158,4535,175.452,84.8578,5.1422,99.9676
408,409,1345,1076,4545,341.898,36.4404,53.5596,99.9176
409,410,80070,2818,4734,171.583,1.48484,88.5152,90.5473
410,411,36103,235,4668,176.83599999999996,72.8931,17.1069,99.8777
411,412,1179,812,4569,344.94,74.89,15.11,99.9876
412,413,1493,3143,4580,358.221,80.2836,9.71636,99.7358
413,414,1401,1306,4580,156.482,54.4187,35.5813,99.9829
414,415,38695,1670,4672,1.35889,73.09,16.9099,99.9146
415,416,5446,1319,4639,177.903,5.32869,84.6713,99.9904
416,417,34523,3047,4724,173.203,79.9723,10.0277,99.7366
417,418,744,2973,4601,350.621,0.865311,89.1347,99.9391
418,419,6407,1202,4655,158.778,53.8633,36.1367,99.9892
419,420,83139,943,4780,178.259,36.4161,53.5839,99.9554
420,421,792,3150,4660,172.138,82.9816,7.01843,99.9493
421,422,47798,389,4776,177.65099999999995,7.15021,82.8498,99.7975
422,423,7829,2304,4675,358.289,8.29577,81.7042,99.9799
423,424,30941,2018,4806,177.68,36.3699,53.6301,99.9677
424,425,1052,859,4678,176.59400000000005,10.0169,79.9831,99.9677
425,426,12628,1449,4748,178.607,5.0316800000000015,84.9683,99.8846
426,427,734,1266,4696,177.982,5.24519,84.7548,99.9985
427,428,40112,2314,4797,357.481,11.1586,78.8414,99.9285
428,429,1319,1332,4711,177.805,5.18649,84.8135,99.9907
429,430,9634,1197,4768,3.08879,78.5469,11.4531,99.894
430,431,729,3143,4725,170.845,80.4456,9.55436,99.9627
431,432,3492,1581,4753,190.706,80.7634,9.23659,99.9899
432,433,3424,2113,4767,1.14816,7.33255,82.6674,99.9908
433,434,15500,610,4812,177.423,7.1009699999999984,82.899,99.995
434,435,6732,1299,4777,176.951,8.15243,81.8476,99.9871
435,436,3143,651,4757,182.506,6.17702,83.823,99.9356
436,437,5286,1681,4788,179.12,1.56447,88.4355,99.9266
437,438,2051,703,4788,180.632,9.07259,80.9274,99.9935
438,439,16397,1817,4824,346.455,30.7621,59.2379,99.6851
439,440,6949,1541,4801,12.7485,74.4495,15.5505,99.9571
440,441,3124,247,4808,340.3769999999999,57.612,32.388000000000005,99.9817
441,442,3742,2600,4834,342.451,56.5005,33.4995,99.9877
442,443,6003,2520,4853,186.773,71.5563,18.4437,99.9812
443,444,579,1872,4845,356.506,76.2971,13.7029,99.9063
444,445,1828,1699,4875,17.2116,62.7478,27.2522,99.9852
445,446,1011,2812,4865,357.917,44.9328,45.0672,99.8325
446,447,1023,1563,4876,13.3593,76.1108,13.8892,99.9677
447,448,744,2613,4877,348.529,38.8072,51.1928,99.9546
