,Grain No.,Size [Pixel],center x-coordinate,center y-coordinate,mean azimuth [degree],mean latitude [degree],mean colatitude [degree],Regelungsgrad [%]
0,1,599,894,109,52.464,65.5419,24.4581,98.4414
1,2,636,1119,121,307.564,71.9291,18.0709,99.3275
2,3,1393,415,154,110.553,67.5844,22.4156,99.9606
3,4,27460,2363,228,141.306,28.7349,61.2651,99.9567
4,5,13622,1550,188,140.942,12.9036,77.0964,99.6321
5,6,568,2623,143,238.816,62.4317,27.5683,99.6506
6,7,21410,272,229,321.556,38.0977,51.9023,99.9673
7,8,23331,994,229,319.242,42.5965,47.4035,99.8845
8,9,2925,575,167,318.428,53.7423,36.2577,99.9032
9,10,18058,1262,209,316.759,2.46797,87.53200000000002,99.9791
10,11,1269,867,160,332.94699999999995,64.5574,25.4426,99.9508
11,12,3529,1121,178,139.881,16.2699,73.7301,99.9564
12,13,18152,1908,192,325.059,32.6296,57.3704,99.864
13,14,13016,455,206,325.694,5.30066,84.6993,99.9474
14,15,6545,751,182,148.516,14.7088,75.2912,99.9926
15,16,5727,2965,194,329.728,40.7255,49.2745,99.8935
16,17,1328,2190,179,22.3942,69.4999,20.5001,99.9355
17,18,1183,2104,171,349.6330000000001,58.6873,31.3127,99.9567
18,19,3583,2613,189,141.856,8.21555,81.7844,99.8328
19,20,688,2751,181,320.155,7.28783,82.7122,99.9739
20,21,1898,2520,192,325.624,56.1601,33.8399,99.9133
21,22,1505,2873,188,140.516,10.2703,79.7297,99.9717
22,23,918,655,186,116.588,68.418,21.5821,99.9887
23,24,997,821,201,323.86,11.3143,78.6857,99.9946
24,25,5371,3357,217,130.519,46.6043,43.3957,99.9489
25,26,18533,1450,273,139.406,42.4811,47.5189,99.8897
26,27,2554,3521,211,137.189,59.3869,30.6131,99.8791
27,28,82598,2554,369,322.519,3.65406,86.3459,99.8248
28,29,3355,591,216,320.853,25.6721,64.3279,99.9849
29,30,120843,2178,485,141.304,25.4104,64.5896,99.5456
30,31,852,3054,198,147.194,29.8654,60.1346,99.9444
31,32,2207,3136,199,328.302,12.5648,77.4352,99.8884
32,33,765,3590,212,323.867,38.3603,51.6397,99.8971
33,34,1152,3268,212,325.391,42.8341,47.1659,99.9143
34,35,10685,721,252,332.8540000000001,42.0587,47.9413,99.9973
35,36,880,1502,218,342.2290000000001,80.3732,9.62679,99.977
36,37,810,2213,218,22.9783,70.0656,19.9344,99.9905
37,38,2560,1757,233,136.279,54.0187,35.9813,99.9637
38,39,1063,3220,227,134.39700000000002,30.5353,59.4647,99.9667
39,40,7798,2791,276,123.536,62.4184,27.5816,99.9566
40,41,141972,3083,561,324.256,43.5297,46.4703,99.4507
41,42,3629,823,274,319.589,71.684,18.316,99.9399
42,43,1516,3157,228,317.2920000000001,24.5157,65.4843,99.9243
43,44,26850,3494,349,320.6040000000001,7.39175,82.6083,98.5485
44,45,14068,1130,301,317.332,48.3529,41.6471,99.9702
45,46,9677,886,277,328.9530000000001,9.15143,80.8486,99.9979
46,47,2596,1713,254,318.687,2.18352,87.8165,99.9748
47,48,22631,656,331,131.542,54.1137,35.8863,99.7611
48,49,520,1538,239,325.161,18.0072,71.9928,99.991
49,50,5680,1208,306,136.562,20.3721,69.6279,99.8909
50,51,9568,2244,299,142.7,0.63205,89.368,99.9816
51,52,11754,1682,312,142.202,35.9565,54.0435,99.9841
52,53,11002,1805,314,318.028,51.0742,38.9258,99.9697
53,54,1540,1583,257,139.945,43.129,46.871,99.9891
54,55,1835,3612,270,137.118,42.343,47.657,99.9229
55,56,7614,2702,292,324.342,51.5842,38.4158,99.9704
56,57,4260,1372,286,145.52200000000005,34.8734,55.1266,99.9932
57,58,13342,3227,307,142.621,2.1398900000000003,87.8601,99.9768
58,59,2612,3564,296,134.637,43.3094,46.6906,99.93
59,60,23354,387,366,136.243,27.9319,62.0681,99.8103
60,61,18927,1281,368,318.288,61.3758,28.6242,99.8268
61,62,6139,2030,307,6.49594,73.7496,16.2504,99.9826
62,63,10697,280,347,318.306,29.1308,60.8692,99.9699
63,64,7162,1582,331,312.454,15.5258,74.4742,99.9973
64,65,791,506,305,333.3,53.6259,36.3741,99.9882
65,66,41492,3335,458,321.42,23.34,66.66,99.8289
66,67,2432,2114,320,357.233,81.0274,8.97262,99.9758
67,68,2991,773,323,329.985,54.3202,35.6798,99.996
68,69,2912,452,344,315.268,27.3543,62.6457,99.9904
69,70,33366,1023,445,144.30200000000005,20.801,69.199,99.4877
70,71,12938,589,384,141.648,15.2712,74.7288,99.9872
71,72,2049,856,359,319.238,0.30574,89.6943,99.9852
72,73,1726,3225,351,320.677,48.9206,41.0794,99.9849
73,74,2422,2764,359,141.554,57.0239,32.9761,99.9932
74,75,985,2148,365,128.336,26.6998,63.3002,99.9699
75,76,4708,3052,374,99.495,65.9031,24.0969,99.943
76,77,3277,490,389,331.721,52.7854,37.2146,99.9734
77,78,2725,3117,380,96.9429,62.0183,27.9817,99.8922
78,79,5626,1540,403,137.579,54.4678,35.5322,99.9454
79,80,26068,1395,453,143.526,2.85239,87.1476,99.8536
80,81,1603,3151,391,97.7096,63.3677,26.6323,99.9882
81,82,3877,1628,400,314.4170000000001,87.54899999999998,2.45096,99.9859
82,83,7717,906,425,311.658,51.6661,38.3339,99.9581
83,84,1035,811,395,141.835,25.452,64.548,99.9288
84,85,5372,3214,418,319.5,49.5952,40.4048,99.985
85,86,1004,2253,392,130.56799999999998,26.5099,63.4901,99.9907
86,87,7996,2768,432,146.01,22.9385,67.0615,99.9632
87,88,68640,1937,495,140.88299999999995,3.4847,86.5153,99.6778
88,89,5920,2868,449,146.894,57.0119,32.9881,99.9601
89,90,578,1148,398,315.493,61.992,28.008000000000006,99.9875
90,91,611,3074,422,329.6869999999999,56.1347,33.8653,99.9305
91,92,3047,3609,489,321.3540000000001,38.5626,51.4374,99.9274
92,93,2843,306,456,319.4790000000001,51.1512,38.8488,99.9341
93,94,2946,454,445,318.965,24.9252,65.0748,99.9864
94,95,1408,829,440,139.135,17.2479,72.7521,99.9946
95,96,3476,542,456,137.673,27.0738,62.9262,99.9975
96,97,5380,638,465,326.464,57.0892,32.9108,99.9873
97,98,15422,1154,533,32.9706,78.1051,11.8949,99.0554
98,99,9685,222,530,140.45600000000002,11.8795,78.1205,99.7946
99,100,3650,1672,478,139.81,52.3639,37.6361,99.9814
100,101,1099,740,460,327.433,56.2486,33.7514,99.9653
101,102,509,3583,459,321.282,39.2236,50.7764,99.8973
102,103,12177,779,522,150.881,10.2329,79.7671,62.5419
103,104,1810,1522,473,306.701,58.6592,31.3408,99.9453
104,105,943,3567,479,319.841,40.1125,49.8875,99.8379
105,106,18725,634,564,139.464,20.532,69.468,99.9401
106,107,768,1614,470,310.311,58.9812,31.0188,99.9509
107,108,1055,1235,480,312.753,9.61833,80.3817,99.994
108,109,710,1277,479,318.2870000000001,63.9687,26.0313,99.9687
109,110,2974,3205,519,143.114,26.1098,63.8902,99.9451
110,111,6484,3448,504,135.532,59.9195,30.0805,99.9592
111,112,4710,483,501,123.155,68.501,21.499,98.9633
112,113,3536,298,518,130.472,64.4329,25.5671,99.767
113,114,3814,886,529,138.142,18.9887,71.0113,99.9387
114,115,51368,2760,626,323.9190000000001,15.5843,74.4157,80.8655
115,116,537,3501,506,139.849,56.5824,33.4176,99.6563
116,117,36988,1536,603,337.747,52.5612,37.4388,99.8577
117,118,8400,1730,539,324.255,55.0938,34.9062,99.5508
118,119,830,2708,510,299.371,61.4425,28.5575,99.774
119,120,3760,395,531,320.908,20.1986,69.8014,99.9527
120,121,1623,551,524,331.309,5.32573,84.6743,99.9237
121,122,1594,3548,530,322.6020000000001,25.9768,64.0232,99.9116
122,123,1261,2661,522,145.21,19.9983,70.0017,99.9979
123,124,5922,951,566,359.5080000000001,78.0661,11.9339,99.9632
124,125,507,455,536,1.72764,75.09,14.91,99.9941
125,126,12595,2454,574,140.942,38.9151,51.0849,99.7243
126,127,13957,1374,570,324.225,1.22588,88.7741,99.964
127,128,38822,330,690,321.119,6.696060000000001,83.3039,99.5952
128,129,2950,2626,567,316.89,57.9391,32.0609,99.8953
129,130,5957,1825,595,318.6140000000001,13.1458,76.8542,99.9929
130,131,8667,348,597,147.91899999999995,10.5103,79.4897,99.9913
131,132,1388,3485,587,322.185,23.4497,66.5503,99.9369
132,133,4565,3421,589,134.445,77.0745,12.9255,99.9633
133,134,3483,818,591,17.6903,79.3908,10.6092,99.9817
134,135,1301,3550,590,323.887,36.6078,53.3922,99.9503
135,136,2202,1670,596,135.317,12.3454,77.6546,99.9847
136,137,1174,866,589,357.126,78.8646,11.1354,99.9133
137,138,3116,2569,612,143.21200000000005,24.8779,65.1221,99.6078
138,139,969,1756,596,120.519,52.746,37.254,99.9527
139,140,10628,697,643,327.772,23.6862,66.3138,99.9644
140,141,2945,1195,613,142.834,19.4362,70.5638,99.9739
141,142,11158,1284,647,128.338,24.9276,65.0724,99.9804
142,143,716,2314,609,144.297,38.194,51.806,99.9783
143,144,1124,883,619,142.437,35.3704,54.6296,99.996
144,145,2535,1980,635,39.554,86.4711,3.52886,99.9805
145,146,13643,2448,665,338.241,59.2755,30.7245,99.9277
146,147,900,2624,625,145.102,25.9369,64.0631,99.965
147,148,45101,898,736,135.241,24.5536,65.4464,99.6567
148,149,2298,1030,639,332.978,56.4968,33.5032,99.9837
149,150,9202,1141,665,328.505,29.5158,60.4842,99.9824
150,151,3005,566,655,325.697,49.7296,40.2704,99.9257
151,152,5252,2877,667,323.629,35.5069,54.4931,99.9346
152,153,1144,3561,650,316.325,40.6312,49.3688,99.8462
153,154,11819,1776,690,136.22,44.8283,45.1717,99.9725
154,155,2252,1860,646,329.358,52.9508,37.0492,99.9844
155,156,13003,2331,696,340.161,73.7316,16.2685,99.8102
156,157,1992,2045,646,318.555,33.9833,56.0167,99.9906
157,158,8486,3468,701,321.222,5.8610000000000015,84.139,99.9254
158,159,38704,478,786,142.252,7.08942,82.9106,99.296
159,160,1619,1660,660,322.616,52.24,37.76,99.9867
160,161,2913,1375,669,143.308,3.76532,86.2347,99.9957
161,162,1106,2586,654,143.69,42.1496,47.8504,99.9914
162,163,10204,3377,704,144.37,80.861,9.13905,99.9741
163,164,9507,2959,702,148.923,0.527039,89.473,99.9942
164,165,2627,3604,699,323.135,44.6526,45.3474,99.8693
165,166,1209,2547,670,327.93,43.4161,46.5839,99.9946
166,167,3096,2132,685,320.2340000000001,33.9385,56.0615,99.9925
167,168,897,1613,677,324.805,51.2555,38.7445,99.9923
168,169,3414,1891,695,321.083,3.83242,86.1676,99.9916
169,170,1219,2081,684,319.839,26.0476,63.9524,99.4808
170,171,20436,2002,755,143.54,7.362319999999999,82.6377,99.8528
171,172,4019,1036,711,107.605,80.3455,9.65452,99.9653
172,173,1615,3569,710,321.68,46.3529,43.6471,99.8368
173,174,2882,1586,716,146.656,12.7388,77.2612,99.9611
174,175,12834,697,738,334.217,56.624,33.376,99.9752
175,176,1755,2565,715,148.612,31.6392,58.3608,99.9964
176,177,10367,1139,753,111.588,81.3675,8.63246,99.9381
177,178,837,2187,714,321.193,34.3116,55.6884,99.9445
178,179,7879,1288,773,319.121,66.7051,23.2949,99.8235
179,180,2949,1453,731,327.715,75.5934,14.4066,99.9895
180,181,2872,2606,742,328.112,40.8782,49.1218,99.9459
181,182,15912,2825,801,143.11,14.4244,75.5756,99.9695
182,183,1715,3040,738,341.915,59.8425,30.1575,99.9824
183,184,2285,1391,739,129.938,65.0125,24.9875,99.9901
184,185,1483,1543,740,324.147,64.5549,25.4451,99.9802
185,186,1055,1641,736,322.764,18.0855,71.9145,99.98
186,187,24477,1761,817,128.95600000000002,29.078000000000007,60.922,99.9648
187,188,771,584,741,324.026,33.5522,56.4478,99.9925
188,189,1504,2119,738,333.14,68.9749,21.0251,99.9672
189,190,890,1299,740,123.729,27.927,62.073,99.9938
190,191,7280,2420,783,321.914,29.7823,60.2177,99.9988
191,192,6484,1892,790,325.647,16.2955,73.7045,99.9616
192,193,577,2522,743,318.422,60.982,29.018,99.9263
193,194,1328,1349,757,133.739,32.5471,57.4529,99.983
194,195,10263,2155,797,142.07,25.5635,64.4365,99.6442
195,196,1230,2487,757,137.143,22.4309,67.5691,99.9534
196,197,2102,365,768,286.925,85.7619,4.23806,99.9982
197,198,1770,1467,771,138.651,9.13676,80.8632,99.9662
198,199,720,1228,770,144.221,22.7929,67.2071,99.9886
199,200,21690,1662,888,340.218,55.4517,34.5483,99.9786
200,201,9102,3583,867,124.207,73.5623,16.4377,99.5571
201,202,6509,811,830,135.73,74.1762,15.8238,99.9308
202,203,4793,2631,794,142.618,20.9471,69.0529,99.9832
203,204,31620,1529,893,316.86,24.5634,65.4366,99.9536
204,205,1579,3442,794,326.06,16.4813,73.5187,99.9792
205,206,944,3543,788,321.572,1.57728,88.4227,99.9648
206,207,1572,640,787,138.736,25.6207,64.3793,99.9962
207,208,2641,576,799,165.46900000000005,79.1999,10.8001,99.9866
208,209,13286,2984,831,144.004,30.0051,59.9949,99.9406
209,210,737,2547,789,52.158,87.0326,2.96739,99.9475
210,211,6261,3457,841,145.153,0.54425,89.4557,99.7667
211,212,5073,1230,836,320.898,70.0698,19.9302,99.9778
212,213,655,2890,804,349.523,65.025,24.975,99.9701
213,214,4267,738,817,318.783,13.2778,76.7222,99.9706
214,215,10260,2680,855,325.811,44.1767,45.8233,99.9741
215,216,1287,3085,827,345.658,60.6956,29.3044,99.9542
216,217,19834,1359,878,315.339,4.29285,85.7072,99.9382
217,218,5779,1138,832,79.4358,77.7841,12.2159,99.9866
218,219,4006,1051,839,129.44299999999998,71.1135,18.8865,99.9781
219,220,42541,2633,976,144.03799999999995,16.3293,73.6707,70.1396
220,221,2640,2589,846,144.18200000000004,0.14669,89.8533,99.9442
221,222,19317,610,887,149.53799999999995,8.88606,81.1139,99.4609
222,223,18172,295,907,142.489,18.5578,71.4422,99.5891
223,224,2385,1944,850,144.105,30.1841,59.8159,99.9926
224,225,2231,3361,846,152.916,70.4297,19.5703,99.9716
225,226,36311,2097,959,325.684,45.5918,44.4082,99.9414
226,227,4356,2271,872,327.636,70.814,19.186,99.951
227,228,1740,208,876,322.481,14.8668,75.1332,99.9429
228,229,4139,1869,882,136.92600000000002,51.6012,38.3988,99.9864
229,230,7737,2404,901,342.2030000000001,78.1388,11.8612,99.9712
230,231,5078,2182,889,320.093,4.80495,85.195,99.956
231,232,22250,2888,950,325.263,20.5259,69.4741,99.3502
232,233,12421,3115,910,154.532,25.6195,64.3805,99.8409
233,234,5837,961,899,307.7990000000001,58.7692,31.2308,99.4914
234,235,3004,696,909,142.808,25.3307,64.6693,99.9698
235,236,1537,762,886,316.525,48.6884,41.3116,99.9928
236,237,2182,2748,890,166.84900000000005,82.8719,7.12805,99.9712
237,238,5250,3412,913,146.92,72.889,17.111,99.9358
238,239,11612,3317,939,145.89600000000004,11.458,78.542,99.9142
239,240,3002,1048,907,323.368,39.5111,50.4889,99.983
240,241,878,1195,897,315.2290000000001,3.08658,86.9134,99.9952
241,242,5798,866,926,302.085,66.372,23.628,99.8521
242,243,23125,1912,1011,322.258,12.7062,77.2938,99.4813
243,244,5620,782,939,307.42,31.0539,58.9461,99.9864
244,245,3087,1140,916,114.501,75.1592,14.8408,99.9771
245,246,7912,2322,972,141.268,5.171880000000002,84.8281,99.6945
246,247,13651,3027,982,131.334,66.2797,23.7203,99.7578
247,248,2901,2237,946,139.94299999999998,25.0546,64.9454,99.9978
248,249,8808,707,996,325.337,48.8694,41.1306,99.8853
249,250,4246,2697,946,330.672,52.2227,37.7773,99.9914
250,251,2077,2776,934,326.988,56.1662,33.8338,99.9825
251,252,5457,1804,975,148.19799999999995,5.70522,84.2948,99.9868
252,253,1244,3582,960,137.78,69.20100000000001,20.799,99.9493
253,254,12096,1140,981,313.713,61.657,28.343000000000004,99.7983
254,255,837,1238,943,316.2290000000001,74.0569,15.9431,99.9817
255,256,9205,1318,997,136.222,70.1494,19.8506,99.1853
256,257,13626,1430,1019,359.672,75.9394,14.0606,99.3666
257,258,2502,1997,965,155.167,67.2793,22.7207,99.9867
258,259,12393,3506,1022,317.84,20.7774,69.2226,99.436
259,260,840,982,956,330.1380000000001,67.925,22.075,99.9534
260,261,691,2360,964,338.67,79.0364,10.9636,99.9876
261,262,37925,548,1071,322.33,11.1643,78.8357,98.1656
262,263,9605,3190,1010,127.789,79.7681,10.2319,99.5757
263,264,2042,440,974,142.391,41.0751,48.9249,99.9731
264,265,1125,2401,975,163.993,80.4949,9.50506,99.7857
265,266,1245,954,990,315.639,10.656,79.344,99.9243
266,267,1409,876,989,145.17700000000005,1.1697799999999998,88.8302,99.8831
267,268,747,918,980,187.781,85.0727,4.9272800000000005,99.9916
268,269,3786,2473,999,149.83100000000005,20.878,69.122,99.7282
269,270,24075,3344,1059,142.879,4.16178,85.8382,99.7913
270,271,3091,1018,1006,314.659,58.9131,31.0869,99.5945
271,272,10806,1693,1039,344.3830000000001,71.1576,18.8424,98.7662
272,273,13238,831,1056,139.501,26.8898,63.1102,99.1381
273,274,2046,2238,1007,327.1140000000001,3.8311,86.1689,99.9912
274,275,803,3416,1000,319.882,18.0314,71.9686,99.9822
275,276,688,2397,1010,340.43,77.8395,12.1605,99.9874
276,277,991,208,1017,328.19699999999995,16.3906,73.6094,99.9164
277,278,1592,648,1022,145.692,23.7482,66.2518,99.979
278,279,840,1599,1013,141.582,60.6793,29.3207,99.7757
279,280,1738,2307,1028,143.91,45.2466,44.7534,99.859
280,281,659,305,1030,68.8708,77.493,12.507,99.9863
281,282,1435,1076,1029,318.629,68.9822,21.0178,99.3003
282,283,11117,1211,1068,139.247,15.6137,74.3863,99.939
283,284,1963,2016,1048,166.266,83.9414,6.05858,99.4432
284,285,10326,2538,1094,324.6670000000001,25.8682,64.1318,99.9548
285,286,3193,355,1055,327.074,18.261,71.73899999999998,99.9819
286,287,8024,974,1075,334.951,84.6163,5.38365,99.9647
287,288,1996,1311,1050,131.261,0.399559,89.6004,99.9956
288,289,1334,435,1048,129.10399999999998,66.0269,23.9731,99.9775
289,290,684,1583,1047,132.49,64.2179,25.7821,99.8165
290,291,2162,914,1073,352.602,84.6997,5.30031,99.9816
291,292,3493,1781,1072,321.7270000000001,0.8219219999999999,89.1781,99.9625
292,293,2821,772,1066,127.583,62.9667,27.0333,99.9826
293,294,2093,1538,1067,140.55,13.3459,76.6541,99.9739
294,295,731,2218,1062,318.523,78.7629,11.2371,99.9564
295,296,5332,2425,1082,324.231,14.7912,75.2088,99.4623
296,297,837,2469,1061,146.781,3.862530000000001,86.1375,99.9512
297,298,6101,2972,1089,145.735,22.606,67.39399999999999,99.969
298,299,3139,1060,1086,143.489,20.7973,69.2027,99.9857
299,300,12499,2271,1123,319.566,31.3111,58.6889,99.984
300,301,7708,2638,1117,145.753,12.8556,77.1444,99.9664
301,302,7329,2756,1105,133.687,44.7879,45.2121,99.7455
302,303,5833,3118,1091,327.81699999999995,25.5573,64.4427,99.9418
303,304,1088,3043,1068,322.125,11.9052,78.0948,99.9716
304,305,17265,278,1154,140.63299999999998,18.3114,71.6886,99.6695
305,306,795,300,1077,321.034,1.5534,88.4466,99.9746
306,307,8975,1599,1114,133.871,8.323789999999999,81.6762,99.6355
307,308,693,1499,1090,126.058,64.9364,25.0636,99.9016
308,309,11577,1943,1136,324.869,18.0812,71.9188,99.724
309,310,599,3547,1090,143.186,1.94987,88.0501,99.9746
310,311,911,2032,1095,326.281,10.272,79.72800000000002,99.9938
311,312,726,1326,1093,31.7388,80.1426,9.85742,99.9809
312,313,1355,2876,1103,327.223,19.7329,70.2671,99.9951
313,314,3510,1807,1121,131.711,46.6737,43.3263,99.9786
314,315,13557,1144,1179,141.13299999999995,1.51073,88.4893,99.9092
315,316,596,3214,1099,321.53,16.521,73.479,99.9967
316,317,4496,2174,1129,125.473,81.2741,8.72592,99.9671
317,318,1355,3277,1116,133.894,28.4711,61.5289,99.968
318,319,863,2112,1117,131.032,80.997,9.00295,99.9806
319,320,34879,2426,1281,324.198,29.1483,60.8517,99.1869
320,321,9014,1249,1150,33.4577,80.5842,9.41576,99.937
321,322,6177,1374,1151,323.743,10.9936,79.0064,99.9778
322,323,1097,3071,1130,316.966,84.4167,5.58327,99.9871
323,324,8464,3233,1158,338.402,61.7513,28.2487,99.8306
324,325,3705,2929,1138,326.389,60.0345,29.9655,99.9815
325,326,13196,1494,1187,131.178,68.2313,21.7687,99.9276
326,327,2693,2053,1152,327.435,45.7662,44.2338,99.9905
327,328,1438,385,1133,148.335,36.2283,53.7717,99.9884
328,329,1380,1716,1130,145.135,18.134,71.866,99.9973
329,330,1158,2850,1135,128.612,51.5387,38.4613,99.9717
330,331,698,3569,1141,138.78,9.83063,80.1694,99.9157
331,332,6397,573,1172,319.76,31.2934,58.7066,99.961
332,333,63586,960,1229,134.884,60.3379,29.6621,99.4358
333,334,4637,2320,1175,137.113,44.795,45.205,99.9835
334,335,3210,2465,1154,134.221,51.7718,38.2282,99.9535
335,336,861,3450,1143,327.684,47.757,42.243,99.9693
336,337,4714,3389,1164,135.269,58.4981,31.5019,99.9356
337,338,1973,1596,1172,122.171,61.9119,28.0881,99.9819
338,339,1076,1657,1156,322.411,0.5173949999999999,89.4826,99.8931
339,340,9566,2937,1209,321.528,31.3016,58.6984,99.9635
340,341,31382,3098,1237,143.316,6.6505100000000015,83.3495,99.9815
341,342,3795,445,1179,136.516,32.3663,57.6337,99.9418
342,343,36619,2659,1297,143.71,13.2512,76.7488,97.2798
343,344,570,2826,1156,148.627,20.2039,69.7961,99.9601
344,345,615,3483,1157,131.36700000000002,33.9841,56.0159,99.5865
345,346,63276,739,1365,327.552,11.262,78.738,93.2787
346,347,3758,1757,1185,140.023,64.6921,25.3079,99.9802
347,348,17434,3487,1284,326.062,4.93688,85.0631,99.2047
348,349,72026,1832,1291,325.732,41.552,48.448,99.8497
349,350,2971,2136,1196,324.32,16.2391,73.7609,99.9856
350,351,12864,2547,1223,134.655,31.652,58.348,99.9849
351,352,12550,1313,1230,323.816,20.519,69.48100000000001,99.9802
352,353,855,3323,1188,133.756,27.3161,62.6839,99.9962
353,354,1663,2086,1203,139.967,79.1006,10.8994,99.9586
354,355,1557,3587,1197,327.236,10.3838,79.6162,99.6986
355,356,6662,2284,1233,144.225,11.6105,78.3895,99.9936
356,357,692,1416,1205,318.93,9.24516,80.7548,99.9818
357,358,2873,2031,1217,322.971,24.8346,65.1654,99.9909
358,359,9619,2801,1235,130.88,51.2427,38.7573,99.9585
359,360,7826,436,1247,321.659,7.9882399999999985,82.0118,99.9872
360,361,1444,1592,1217,325.1740000000001,66.2298,23.7702,99.9944
361,362,32779,3266,1313,325.752,47.7932,42.2068,99.8009
362,363,561,517,1216,322.398,26.1051,63.8949,97.902
363,364,13024,357,1292,139.465,34.3078,55.6922,99.5765
364,365,4809,3289,1251,138.83100000000002,10.116,79.884,99.995
365,366,4017,202,1276,140.162,32.7676,57.2324,99.9558
366,367,917,2158,1235,341.736,56.4781,33.5219,99.9844
367,368,1103,1764,1240,137.77200000000002,9.94835,80.0517,99.999
368,369,1329,2703,1249,145.782,14.0185,75.9815,99.9935
369,370,622,1455,1243,162.43,84.9765,5.02348,99.9888
370,371,13382,556,1305,144.81,5.10986,84.8901,99.2842
371,372,1089,2097,1257,318.385,12.461,77.539,99.8397
372,373,574,599,1250,148.328,28.5913,61.4087,99.9936
373,374,1036,2229,1260,335.797,55.1724,34.8276,99.9872
374,375,11222,1417,1291,343.181,60.4945,29.5055,99.9827
375,376,1772,295,1279,136.481,10.2892,79.7108,99.9672
376,377,2308,3444,1278,321.874,52.6804,37.3196,99.9782
377,378,30876,2216,1373,142.134,47.7193,42.2807,99.7808
378,379,13429,2967,1342,326.678,8.27339,81.7266,93.4191
379,380,881,2196,1276,324.991,14.6504,75.3496,99.9923
380,381,3235,2892,1302,146.717,82.8328,7.16719,99.9757
381,382,5123,1270,1319,141.575,31.3279,58.6721,99.9143
382,383,2309,2093,1295,324.357,24.6006,65.3994,99.7431
383,384,14749,1132,1376,137.465,63.8058,26.1942,99.9364
384,385,3572,3583,1326,325.711,10.2894,79.7106,99.8372
385,386,9160,956,1353,144.293,7.12778,82.8722,99.5105
386,387,9982,1681,1358,320.806,56.6612,33.3388,99.9559
387,388,5305,669,1350,149.047,56.497,33.503,99.8552
388,389,560,2829,1321,353.6140000000001,78.0827,11.9173,99.8843
389,390,10707,1535,1346,146.38299999999995,71.7763,18.2237,99.9516
390,391,706,1764,1318,141.59799999999996,53.2305,36.7695,99.9923
391,392,718,265,1332,140.094,33.1983,56.8017,99.9319
392,393,7554,2294,1373,319.997,27.9558,62.0442,99.9919
393,394,1801,2664,1353,325.963,53.3654,36.6346,99.9737
394,395,1963,455,1360,140.173,38.9616,51.0384,99.9902
395,396,632,1369,1342,110.839,78.4162,11.5838,99.9852
396,397,4239,1243,1381,321.76,18.1149,71.8851,99.9924
397,398,1181,1412,1370,145.857,7.9953699999999985,82.0046,99.9888
398,399,1341,623,1374,148.471,12.3604,77.6396,99.9956
399,400,2993,196,1431,130.691,20.3834,69.6166,99.6531
400,401,7534,1327,1425,326.135,22.5079,67.4921,99.9788
401,402,47375,424,1529,122.928,52.6057,37.3943,71.2458
402,403,48386,3340,1466,324.473,12.6113,77.3887,95.5491
403,404,670,1472,1384,325.08,64.0469,25.9531,99.9372
404,405,559,2820,1372,339.315,65.6922,24.3078,99.9753
405,406,6175,313,1424,150.049,80.7179,9.28205,99.9649
406,407,4016,535,1409,320.232,53.8269,36.1731,99.9691
407,408,4135,3551,1397,143.305,9.93497,80.065,99.9466
408,409,7371,2705,1415,149.77100000000004,50.5005,39.4995,99.9845
409,410,55010,3058,1536,142.13,4.29085,85.7092,98.1468
410,411,4027,1247,1428,141.23,21.6443,68.3557,99.9755
411,412,2143,1927,1420,151.35,66.7884,23.2116,99.9968
412,413,13959,2124,1459,326.031,2.7919400000000003,87.2081,99.8521
413,414,3798,2812,1428,147.325,0.636841,89.3632,99.9558
414,415,3575,1395,1438,143.649,36.5818,53.4182,99.9475
415,416,2083,2905,1437,26.3117,80.4245,9.5755,99.9552
416,417,10062,1603,1454,165.537,69.1361,20.8639,99.9607
417,418,2245,1878,1428,321.5540000000001,12.7581,77.2419,99.9692
418,419,842,526,1410,135.107,35.6552,54.3448,99.9836
419,420,2156,2387,1435,322.992,8.80402,81.196,99.9679
420,421,20482,965,1498,98.4739,84.2367,5.76327,98.896
421,422,2617,1462,1440,286.809,83.5775,6.4225,99.9919
422,423,2537,2610,1437,319.428,16.3472,73.6528,99.997
423,424,3091,1995,1450,138.611,52.6345,37.3655,99.8449
424,425,30197,1750,1516,318.346,67.8704,22.1296,99.2038
425,426,872,3335,1452,140.291,5.95903,84.041,99.9632
426,427,832,3585,1448,319.978,33.832,56.168,99.9192
427,428,1905,1160,1459,324.377,20.7419,69.2581,99.9729
428,429,31381,2396,1561,72.5067,81.9061,8.093860000000001,98.9287
429,430,551,2541,1453,137.761,67.8479,22.1521,99.9191
430,431,617,3539,1456,123.517,62.7102,27.2898,99.9821
431,432,1124,2659,1467,144.571,19.0016,70.9984,99.9804
432,433,1478,1880,1490,320.664,11.8927,78.1073,99.8461
433,434,4904,1219,1500,138.615,5.26949,84.7305,99.9755
434,435,6266,1112,1510,319.4170000000001,66.296,23.704,99.2253
435,436,5134,2837,1495,136.921,21.895,68.105,99.8734
436,437,1482,2582,1481,146.843,68.2455,21.7545,99.9541
437,438,1512,2219,1487,314.591,17.8003,72.1997,99.9845
438,439,21766,2790,1594,70.347,77.1267,12.8733,99.4664
439,440,6122,3241,1527,143.931,32.9031,57.0969,99.9274
440,441,10245,1368,1527,143.207,15.3034,74.6966,99.247
441,442,563,554,1489,149.043,18.4612,71.5388,99.9099
442,443,8355,734,1528,141.122,20.8599,69.1401,99.9843
443,444,2561,836,1515,144.695,30.5073,59.4927,99.9801
444,445,14390,1932,1544,316.772,30.0914,59.9086,99.8853
445,446,23486,1431,1580,315.334,11.9538,78.0462,97.9473
446,447,1138,3587,1505,113.043,65.7283,24.2717,99.8208
447,448,563,794,1502,136.589,84.9891,5.01091,98.9025
448,449,3945,2263,1527,95.5312,81.0001,8.99993,98.5179
449,450,3555,2525,1562,324.056,26.2418,63.7582,99.914
450,451,879,2663,1505,139.97299999999998,15.3712,74.6288,99.9911
451,452,1276,1288,1525,144.034,39.9021,50.0979,99.9573
452,453,536,2315,1518,315.745,18.629,71.37100000000002,99.9888
453,454,26917,2615,1619,130.64600000000002,50.4103,39.5897,99.748
454,455,3080,203,1572,137.563,0.143982,89.85600000000002,99.8864
455,456,13702,649,1592,323.003,9.07295,80.92699999999998,99.6595
456,457,23309,2123,1617,147.722,19.3104,70.6896,99.6361
457,458,611,3478,1537,123.41,56.8772,33.1228,99.8116
458,459,9105,1073,1587,351.973,85.5652,4.434819999999998,99.9262
459,460,1468,300,1563,131.15,5.12969,84.8703,99.9737
460,461,9241,1209,1591,133.264,44.1687,45.8313,99.9708
461,462,1888,2827,1557,132.667,32.5172,57.4828,99.9242
462,463,1193,3450,1561,317.197,26.8245,63.1755,99.9639
463,464,744,1598,1557,152.005,79.1239,10.8761,99.977
464,465,7686,801,1617,320.751,5.66753,84.3325,99.9922
465,466,2387,864,1591,142.382,24.0038,65.9962,99.9997
466,467,39604,1615,1692,322.616,1.21085,88.7891,99.2214
467,468,2901,3510,1602,323.795,18.0512,71.9488,97.8857
468,469,3674,3425,1611,136.995,27.7513,62.2487,99.9912
469,470,4885,1937,1623,335.702,73.7183,16.2817,99.9797
470,471,1930,3275,1613,143.312,35.3244,54.6756,99.9813
471,472,3963,298,1647,149.778,12.9861,77.0139,99.8175
472,473,1098,2237,1606,118.171,62.7065,27.2936,99.9803
473,474,19844,931,1660,321.631,16.8873,73.1127,99.8747
474,475,3061,3334,1625,142.987,8.58924,81.4108,99.8599
475,476,2349,3573,1629,331.646,47.3829,42.6171,99.9626
476,477,1965,2998,1620,339.635,65.6177,24.3823,99.9832
477,478,1446,2017,1628,129.72299999999998,70.7445,19.2555,99.9741
478,479,616,3056,1619,156.785,11.0309,78.9691,99.6863
479,480,1132,234,1639,145.534,14.8942,75.1058,99.9557
480,481,4123,1835,1665,119.245,57.5763,32.4237,99.9608
481,482,2684,1752,1641,79.2456,77.5161,12.4839,99.9801
482,483,2106,541,1641,331.065,55.356,34.644,99.994
483,484,7049,2472,1678,325.795,18.8671,71.1329,99.978
484,485,5140,2928,1681,126.04,66.1184,23.8816,99.9616
485,486,18576,3211,1717,147.748,42.2079,47.7921,99.9266
486,487,22626,3432,1715,3.09307,75.0895,14.9105,99.9469
487,488,17933,2243,1704,151.226,33.0845,56.9155,99.9968
488,489,9252,678,1670,18.4893,78.6255,11.3745,99.9865
489,490,22184,1130,1717,331.089,48.7544,41.2456,99.9686
490,491,1115,1050,1662,141.957,39.205,50.795,99.9939
491,492,5548,3001,1705,89.6591,77.6707,12.3293,97.3389
492,493,13750,1313,1709,324.095,33.0731,56.9269,99.9402
493,494,1022,461,1672,331.5540000000001,39.0746,50.9254,99.4914
494,495,100961,1957,1884,145.31799999999996,6.6528399999999985,83.3472,82.4912
495,496,1757,2005,1683,127.048,46.3313,43.6687,99.9906
496,497,4853,1409,1693,146.207,35.8748,54.1252,99.9855
497,498,29641,580,1787,133.858,66.1275,23.8725,99.8319
498,499,2958,1482,1691,311.936,65.6786,24.3214,99.9705
499,500,16044,2755,1717,321.083,19.7914,70.2086,99.3553
500,501,20333,359,1809,131.22799999999998,66.2188,23.7812,99.9468
501,502,2123,3580,1692,137.234,31.9571,58.0429,99.8706
502,503,9804,2889,1764,151.136,4.61646,85.3835,99.5391
503,504,2767,781,1708,131.907,29.3461,60.6539,99.971
504,505,7804,3316,1765,146.671,1.44257,88.5574,99.9488
505,506,2196,388,1708,144.594,6.02999,83.97,99.9858
506,507,527,2544,1701,140.019,27.488000000000003,62.512,99.9873
507,508,1412,1004,1715,60.49100000000001,83.8356,6.1644,99.9837
508,509,10747,2371,1739,139.265,49.5234,40.4766,99.9786
509,510,6489,641,1731,322.3590000000001,33.1036,56.8964,99.9947
510,511,1479,2031,1720,325.588,28.3602,61.6398,99.9583
511,512,2883,3534,1748,335.62,5.31845,84.6815,99.8114
512,513,1412,841,1721,316.737,41.4827,48.5173,99.9816
513,514,1676,1537,1724,319.461,17.5247,72.4753,99.9225
514,515,1927,221,1736,135.415,20.4482,69.5518,99.9554
515,516,892,2582,1729,140.126,22.8444,67.1556,99.9491
516,517,908,297,1733,326.164,48.6205,41.3795,99.986
517,518,3106,2548,1752,135.045,17.6989,72.3011,99.8965
518,519,25331,1628,1838,73.6605,80.0312,9.96876,99.6333
519,520,2627,3589,1761,137.752,16.1467,73.8533,99.9365
520,521,11460,2454,1795,316.631,26.9018,63.0982,99.9714
521,522,44720,876,1833,317.872,4.11296,85.887,97.5411
522,523,1404,2149,1749,326.238,82.1292,7.870789999999999,99.9276
523,524,1289,433,1744,123.36,62.3918,27.6082,99.9726
524,525,4669,1461,1778,144.681,49.4332,40.5668,99.8462
525,526,14518,1321,1817,136.338,47.2563,42.7437,99.9333
526,527,7040,2623,1823,101.192,82.2407,7.759289999999999,99.9064
527,528,2468,3120,1780,325.795,32.2868,57.7132,99.9836
528,529,522,285,1764,325.141,42.8763,47.1237,99.9871
529,530,864,1803,1771,322.648,40.1496,49.8504,99.9962
530,531,864,3010,1771,130.614,18.0249,71.9751,99.9856
531,532,12241,1830,1823,325.415,10.7186,79.2814,99.8782
532,533,1495,448,1786,141.25799999999995,7.124560000000002,82.8754,99.9896
533,534,10046,1175,1822,326.8590000000001,6.22782,83.7722,99.9894
534,535,3085,2725,1800,139.567,12.5329,77.4671,99.9995
535,536,2651,3062,1809,135.484,79.4998,10.5001,99.8905
536,537,7872,846,1839,140.361,10.9272,79.0728,99.9811
537,538,35164,3486,1907,143.85399999999996,3.32902,86.671,99.0368
538,539,910,2781,1796,19.614,85.2361,4.76391,99.9833
539,540,2421,1707,1809,144.32,2.95885,87.0411,99.9752
540,541,9745,3172,1829,321.975,52.2038,37.7962,99.9855
541,542,538,2562,1804,144.628,4.80614,85.1939,97.6432
542,543,2799,2999,1815,81.833,83.946,6.0539999999999985,99.965
543,544,2770,2881,1820,323.983,59.4562,30.5438,99.9836
544,545,7644,2379,1858,142.94,11.8144,78.1856,99.7729
545,546,721,3364,1818,142.953,36.51300000000001,53.487,99.9071
546,547,943,1438,1825,133.44799999999998,27.9101,62.0899,99.9847
547,548,8099,1067,1872,327.917,31.9642,58.0358,99.9832
548,549,11218,481,1932,130.597,71.9846,18.0154,98.6794
549,550,4448,2269,1858,141.11700000000005,38.3661,51.6339,99.9937
550,551,545,3260,1836,330.5030000000001,71.5438,18.4562,99.8504
551,552,2579,2767,1851,324.142,21.4334,68.5666,99.9948
552,553,1228,2535,1846,136.213,49.485,40.515,99.9898
553,554,15260,2908,1878,330.537,60.5481,29.4519,99.9176
554,555,2563,553,1864,324.991,19.3802,70.6198,99.991
555,556,716,1396,1858,318.084,27.8657,62.1343,99.9319
556,557,20640,2695,1922,136.237,49.8674,40.1326,99.9676
557,558,2095,247,1861,133.32399999999998,19.8644,70.1356,99.8714
558,559,13021,3322,1888,141.36,18.955,71.045,99.9614
559,560,3323,1230,1884,329.385,43.1057,46.8943,99.9761
560,561,544,1452,1867,140.092,38.8372,51.1628,99.9403
561,562,1473,3067,1879,341.884,21.9385,68.0615,99.9401
562,563,2032,2499,1882,153.607,79.1891,10.8109,99.9227
563,564,3675,326,1912,141.192,7.96237,82.0376,99.9838
564,565,2565,1127,1904,301.737,80.6858,9.31422,99.9924
565,566,29951,2299,2003,138.47899999999998,36.7244,53.2756,99.8647
566,567,2751,722,1912,137.58,23.3441,66.6559,99.9964
567,568,1667,3161,1893,145.675,39.2585,50.7415,99.9956
568,569,645,1758,1890,160.30200000000005,77.3535,12.6465,99.9872
569,570,765,1432,1902,139.505,26.9476,63.0524,99.949
570,571,2666,1388,1917,312.26,61.7045,28.2955,99.9722
571,572,6467,1682,1929,320.933,33.1218,56.8782,99.9383
572,573,863,226,1906,320.089,15.3127,74.6873,99.6513
573,574,2197,1304,1912,309.834,56.3477,33.6523,99.9843
574,575,14991,587,1966,143.05,18.4224,71.5776,99.7686
575,576,17092,3007,1965,140.976,14.0997,75.9003,99.4925
576,577,6299,2555,1936,323.106,6.82327,83.1767,99.4658
577,578,2747,2401,1930,322.458,2.36023,87.6398,99.9888
578,579,11108,3215,1955,164.032,80.4819,9.51812,99.8256
579,580,521,3589,1920,140.41299999999998,15.1175,74.8825,99.9816
580,581,16789,2061,1990,325.874,44.9199,45.0801,99.8607
581,582,3739,1165,1950,140.863,38.3419,51.6581,99.9922
582,583,2890,1753,1946,325.962,12.0602,77.9398,99.9583
583,584,3984,1241,1943,137.379,51.9621,38.0379,99.9776
584,585,11281,355,1974,323.406,10.6029,79.3971,98.7047
585,586,737,1464,1934,142.911,29.6546,60.3454,99.9349
586,587,25861,929,2036,141.517,21.7303,68.2697,99.4372
587,588,2834,2179,1960,145.197,14.5475,75.4525,99.8378
588,589,3739,2807,1963,139.393,54.8632,35.1368,99.8353
589,590,6144,3364,1970,322.427,20.055,69.945,99.9728
590,591,3961,234,1996,314.515,12.502,77.498,99.2639
591,592,1137,3567,1954,332.204,19.6588,70.3412,99.9805
592,593,1071,772,1951,324.627,26.8642,63.1358,99.9658
593,594,3444,1416,1978,141.849,48.0823,41.9177,99.951
594,595,1828,3527,1956,333.1380000000001,19.3934,70.6066,99.9904
595,596,594,2478,1953,138.08100000000002,76.2072,13.7928,99.8451
596,597,5931,1313,1981,318.093,42.0161,47.9839,99.9866
597,598,3842,676,1996,319.152,62.777,27.223000000000006,99.4932
598,599,8232,1517,2024,67.676,84.2122,5.78782,98.4874
599,600,969,725,1979,317.351,3.27502,86.725,99.9915
600,601,3585,3094,2012,328.865,37.2818,52.7182,99.9128
601,602,6795,1104,2020,326.721,58.2022,31.7978,99.7971
602,603,2607,1228,2000,144.364,29.5749,60.4251,99.9193
603,604,566,2444,1981,136.579,27.8726,62.1274,99.9705
604,605,2285,2610,1993,323.502,39.2661,50.7339,99.9918
605,606,19286,2510,2058,358.311,67.1072,22.8928,99.094
606,607,1230,854,1998,319.88,26.033,63.967,99.9654
607,608,10187,776,2029,330.522,39.4363,50.5637,99.9594
608,609,12904,1618,2060,315.693,19.0212,70.9788,99.9618
609,610,10679,2872,2051,140.249,49.5973,40.4027,99.7277
610,611,1382,1367,2021,329.477,46.5405,43.4595,99.9515
611,612,7453,2748,2036,320.07,19.2267,70.7733,99.9382
612,613,1467,1176,2015,132.266,51.7361,38.2639,99.4034
613,614,2042,415,2028,322.399,16.3463,73.6537,99.0603
614,615,4467,1011,2040,145.66899999999995,32.5332,57.4668,99.8499
615,616,6700,3342,2042,325.839,34.992,55.008,99.965
616,617,4115,2959,2049,326.853,40.4211,49.5789,99.8927
617,618,7027,3149,2056,136.721,58.0114,31.9886,99.1782
618,619,797,193,2038,320.2,7.59607,82.4039,99.8064
619,620,4054,1445,2058,118.622,65.546,24.454,99.907
620,621,4804,3246,2051,322.063,17.8246,72.1754,99.389
621,622,616,3516,2055,143.83700000000005,16.7912,73.2088,99.919
622,623,9111,3541,2104,139.75,19.3471,70.6529,99.5394
623,624,621,2093,2045,144.172,14.0593,75.9407,99.7918
624,625,2113,326,2048,79.60600000000002,83.1591,6.84092,99.9666
625,626,30765,613,2098,332.139,36.2772,53.7228,99.5619
626,627,6668,1243,2062,144.085,2.89461,87.1054,99.4482
627,628,3203,2693,2077,124.034,59.0125,30.9875,99.8071
628,629,7343,422,2123,99.8053,74.4455,15.5545,99.9053
629,630,11592,327,2130,141.69899999999996,10.085,79.915,98.5721
630,631,5802,2160,2100,313.451,35.2568,54.7432,99.9784
631,632,2406,1366,2073,140.836,5.9011,84.0989,99.9939
632,633,16155,3107,2142,327.192,41.4966,48.5034,99.9338
633,634,2724,2047,2080,317.631,24.9019,65.0981,99.6919
634,635,8696,1167,2129,137.939,54.4911,35.5089,99.9244
635,636,13260,2314,2125,121.242,55.2006,34.7994,99.8974
636,637,3898,3432,2101,135.662,28.8786,61.1214,99.8559
637,638,704,193,2084,144.07299999999995,24.394,65.60600000000001,99.7508
638,639,582,225,2088,140.249,26.5073,63.4927,99.9305
639,640,2999,2092,2109,312.778,38.5673,51.4327,99.984
640,641,635,330,2084,121.576,63.1293,26.8707,99.9895
641,642,646,794,2082,145.553,20.1928,69.8072,99.9542
642,643,24648,1878,2150,329.5680000000001,33.9565,56.0435,98.96
643,644,15358,1019,2142,141.095,3.82082,86.1792,99.8809
644,645,556,1299,2091,326.025,27.1461,62.8539,99.9335
645,646,13909,3340,2144,145.884,8.61168,81.3883,99.8777
646,647,2008,1747,2095,136.018,36.081,53.919,99.9698
647,648,2133,3232,2113,135.869,25.3339,64.6661,99.9602
648,649,7860,2630,2135,127.525,67.579,22.421,99.8467
649,650,1819,2794,2107,324.723,27.964,62.036,99.9938
650,651,2099,2015,2113,322.1620000000001,28.3782,61.6218,99.8228
651,652,2595,2975,2125,146.755,4.97356,85.0264,99.0885
652,653,28315,1382,2164,326.045,40.5784,49.4216,99.2737
653,654,1880,1538,2114,328.5,30.418000000000006,59.582,99.7341
654,655,10516,2443,2166,338.786,34.9077,55.0923,99.9482
655,656,1212,1700,2122,144.595,22.3665,67.6335,96.9114
656,657,775,219,2126,332.911,42.8917,47.1083,99.9591
657,658,623,193,2133,334.211,43.1858,46.8142,99.9045
658,659,10603,2884,2168,130.424,36.3927,53.6073,99.9159
659,660,507,2707,2120,136.774,1.31864,88.6814,99.9895
660,661,551,3468,2128,331.5730000000001,57.6016,32.3984,99.982
661,662,12538,2737,2179,319.353,16.3467,73.6533,99.8797
662,663,9186,815,2174,337.431,53.4328,36.5672,99.9805
663,664,567,3622,2141,81.3312,36.3525,53.6475,99.8789
664,665,12958,2089,2197,143.179,30.3359,59.6641,99.4019
665,666,29801,3065,2274,145.327,10.3378,79.6622,99.4928
666,667,937,2047,2156,317.548,24.3216,65.6784,99.9668
667,668,9941,669,2206,323.482,55.1275,34.8725,99.962
668,669,1413,582,2162,144.966,82.794,7.20598,99.5744
669,670,1422,488,2167,320.921,10.7809,79.2191,99.9898
670,671,22483,1681,2216,147.64600000000004,6.74493,83.2551,99.1272
671,672,2295,252,2170,322.456,33.3785,56.6215,99.7423
672,673,1120,3466,2172,137.164,22.8464,67.1536,99.9518
673,674,6400,2562,2206,140.172,31.1329,58.8671,99.9505
674,675,742,1063,2194,328.982,77.7744,12.2256,99.8866
675,676,1270,2278,2189,69.832,78.6774,11.3227,99.9693
676,677,2084,532,2192,143.596,2.47576,87.5242,99.9769
677,678,1378,1244,2196,226.012,80.6164,9.38358,99.9795
678,679,26479,1474,2283,339.69199999999995,53.3682,36.6318,99.7312
679,680,686,2220,2184,152.597,14.2657,75.7343,99.9605
680,681,3725,2334,2213,340.86300000000006,37.7761,52.2239,99.9917
681,682,2351,294,2206,320.2,46.3936,43.6064,99.993
682,683,1716,902,2197,312.1020000000001,76.7809,13.2191,99.9599
683,684,2473,3322,2201,318.633,11.6302,78.3698,99.9921
684,685,2080,3077,2198,138.88299999999998,28.1508,61.8492,99.9316
685,686,592,2954,2197,321.276,36.448,53.552,99.8978
686,687,2397,391,2217,319.156,15.2308,74.7692,99.9954
687,688,16575,1157,2241,324.23,18.1095,71.8905,99.8384
688,689,997,347,2212,140.781,8.49725,81.5027,99.9963
689,690,3329,3456,2232,144.22799999999995,32.9872,57.0128,99.9762
690,691,8385,3241,2251,128.618,78.3024,11.6976,99.9213
691,692,7409,3523,2259,142.099,34.3727,55.6273,98.9882
692,693,10571,1923,2243,324.67,47.4425,42.5575,99.9305
693,694,6645,227,2242,326.715,9.60104,80.399,99.9442
694,695,907,954,2216,324.15,18.6535,71.3465,99.9863
695,696,542,489,2220,103.142,73.2284,16.7716,99.9425
696,697,8955,2781,2257,139.697,10.0686,79.9314,98.6529
697,698,5092,2174,2249,135.503,7.77402,82.226,99.9547
698,699,2611,578,2238,144.055,7.47723,82.5228,99.7367
699,700,2604,2642,2243,127.906,25.9625,64.0375,99.996
700,701,687,3575,2236,310.2920000000001,19.7308,70.2692,99.9587
701,702,1561,3377,2244,331.745,11.4033,78.5967,99.9893
702,703,1475,3408,2249,319.454,7.6511,82.3489,99.8681
703,704,5820,789,2258,105.715,60.6005,29.3995,99.9791
704,705,547,2258,2232,328.639,6.55582,83.4442,99.7491
705,706,2863,879,2247,140.743,23.3917,66.6083,99.9623
706,707,4095,2530,2268,141.85399999999996,12.7782,77.2218,99.7574
707,708,4043,532,2277,324.815,39.618,50.382,99.9674
708,709,4000,1280,2263,134.628,27.101,62.899,99.9772
709,710,13870,2357,2301,316.639,18.5907,71.4093,99.9265
710,711,7166,2456,2287,330.196,52.6769,37.3231,99.9886
711,712,1801,2277,2266,148.85399999999996,5.48913,84.5109,99.9884
712,713,12685,1015,2292,152.638,49.5439,40.4561,99.7386
713,714,6414,328,2287,138.388,18.5315,71.4685,99.853
714,715,1317,2893,2257,134.25,59.68899999999999,30.311,99.9903
715,716,10339,1676,2305,327.80300000000005,36.3304,53.6696,99.5152
716,717,882,2690,2257,143.86,10.5529,79.4471,99.9871
717,718,10427,444,2302,139.435,36.2017,53.7983,94.49
718,719,1351,2224,2276,85.555,80.0731,9.9269,99.9934
719,720,5303,672,2298,133.526,25.9629,64.0371,99.9972
720,721,42995,2080,2376,11.9979,83.8969,6.1031,99.8987
721,722,4517,3304,2305,2.70221,85.3217,4.67831,99.8585
722,723,2889,1573,2295,135.509,58.8963,31.1037,99.9769
723,724,5553,2941,2316,313.013,80.8992,9.10081,99.9099
724,725,3299,2592,2300,318.963,24.5946,65.4054,99.9965
725,726,943,618,2287,137.452,11.035,78.965,99.9746
726,727,18130,1860,2371,146.13299999999995,76.7751,13.2249,99.8064
727,728,2730,3442,2298,332.023,14.978,75.02199999999998,99.929
728,729,3006,2657,2304,132.666,55.1188,34.8812,99.9857
729,730,3565,2862,2313,146.197,21.7538,68.2462,99.9628
730,731,597,3377,2288,143.099,5.44165,84.5583,99.9802
731,732,8564,877,2333,138.446,1.61135,88.3886,99.9947
732,733,4286,725,2341,152.39600000000004,31.6236,58.3764,99.9503
733,734,3269,243,2312,134.816,53.0723,36.9277,99.9799
734,735,2683,802,2327,331.862,56.4435,33.5565,99.9821
735,736,747,195,2339,133.511,53.6441,36.3559,99.9178
736,737,2013,1177,2317,333.987,68.5409,21.4591,99.9865
737,738,3180,1290,2318,347.148,65.1253,24.8747,99.9396
738,739,1551,380,2326,319.1670000000001,8.009319999999999,81.9907,99.7313
739,740,1137,2744,2314,126.345,46.6478,43.3522,99.9736
740,741,3100,3368,2339,135.64700000000002,73.7514,16.2486,99.9772
741,742,2794,3252,2340,172.19299999999996,74.7624,15.2376,99.9732
742,743,8373,604,2372,326.201,2.74783,87.2522,99.839
743,744,4571,1770,2369,149.57,65.7999,24.2001,99.9773
744,745,3390,2532,2345,137.363,53.6606,36.3394,99.9718
745,746,1183,2813,2334,153.463,56.0087,33.9913,99.9903
746,747,12656,3121,2426,325.6670000000001,1.90409,88.0959,99.7232
747,748,1671,3475,2342,102.634,81.29,8.71,99.9772
748,749,3810,1376,2368,144.634,21.234,68.766,99.8234
749,750,5935,2695,2373,147.036,28.4261,61.5739,99.9609
750,751,13061,1165,2412,136.186,7.02647,82.9735,99.936
751,752,4257,273,2355,331.727,7.86977,82.1302,99.9939
752,753,1441,3421,2352,128.553,48.1671,41.8329,99.991
753,754,565,3627,2353,249.671,7.84696,82.15299999999998,99.6855
754,755,2389,2768,2353,322.829,7.95541,82.0446,99.9835
755,756,3035,2269,2370,325.629,46.4087,43.5913,99.8458
756,757,18657,1564,2420,138.00799999999998,35.9994,54.0006,99.8794
757,758,11856,1291,2397,136.526,54.0906,35.9094,99.9827
758,759,1042,2623,2359,137.3,17.5895,72.4105,99.9899
759,760,10101,2916,2433,318.213,13.509,76.491,99.1011
760,761,1859,3041,2372,324.323,46.4411,43.5589,99.9483
761,762,3528,402,2385,136.653,37.4684,52.5316,99.9852
762,763,6496,2379,2404,135.183,49.3733,40.6267,99.8214
763,764,663,2221,2385,321.319,14.6443,75.3557,99.7468
764,765,4901,522,2386,329.085,26.9594,63.0406,99.9953
765,766,4701,1070,2392,324.872,17.2491,72.7509,99.6689
766,767,3506,976,2387,321.658,57.6608,32.3392,99.9345
767,768,6935,3281,2399,316.112,2.96761,87.0324,99.9897
768,769,6994,1697,2402,146.918,5.65807,84.3419,99.9541
769,770,805,2813,2378,154.519,56.1255,33.8745,99.9549
770,771,898,795,2380,136.469,28.3952,61.6048,99.9607
771,772,40344,2525,2515,322.817,8.85786,81.1421,98.9119
772,773,2688,2981,2393,135.43200000000002,17.4061,72.5939,99.8819
773,774,831,3498,2383,319.976,34.736999999999995,55.26300000000001,99.9956
774,775,5745,2614,2416,146.965,30.4761,59.5239,99.9572
775,776,3590,335,2408,139.24200000000002,0.6167600000000001,89.3832,99.9791
776,777,13774,699,2438,140.291,69.8852,20.1148,99.9748
777,778,5491,3453,2427,333.88199999999995,68.5962,21.4038,99.9737
778,779,9313,3564,2453,163.799,28.8237,61.1763,97.3288
779,780,1244,781,2411,142.571,39.0567,50.9433,99.9867
780,781,1155,2847,2406,129.908,69.4159,20.5841,99.9161
781,782,647,2788,2401,127.766,65.9132,24.0868,99.9874
782,783,1478,276,2406,145.762,44.7419,45.2581,99.9686
783,784,5884,1450,2443,148.934,22.613000000000003,67.387,99.8674
784,785,1679,234,2416,324.308,9.15502,80.845,99.9925
785,786,11010,488,2482,116.734,70.4504,19.5496,99.127
786,787,1079,849,2406,137.315,30.584,59.416,99.9895
787,788,1496,3202,2430,320.715,43.8776,46.1224,99.9122
788,789,39785,3318,2577,322.9170000000001,26.709,63.291,97.9994
789,790,1980,198,2435,144.952,24.9124,65.0876,99.8185
790,791,974,2754,2419,322.262,9.8925,80.1075,99.9935
791,792,11530,901,2472,325.956,3.14533,86.8547,98.8877
792,793,5285,2263,2439,325.82,7.72493,82.2751,99.9296
793,794,18184,1051,2486,324.58,7.48181,82.5182,99.3512
794,795,8774,1907,2477,330.834,15.28,74.72,99.7071
795,796,8557,582,2496,134.605,72.0154,17.9846,99.2221
796,797,1175,2994,2452,132.599,43.7685,46.2315,99.9751
797,798,807,394,2436,326.438,30.8321,59.1679,99.9791
798,799,3921,1636,2501,325.133,5.1937,84.8063,99.5609
799,800,3212,3507,2487,158.19,25.6291,64.3709,99.9123
800,801,12281,2790,2485,146.834,24.6112,65.3888,99.5134
801,802,7157,771,2494,326.569,18.8594,71.1406,99.3501
802,803,1893,1346,2474,135.237,40.2491,49.7509,99.9743
803,804,20399,1461,2552,322.288,35.6983,54.3017,99.8752
804,805,2943,315,2484,164.16,88.0339,1.96608,99.492
805,806,1080,1248,2460,340.166,69.4333,20.5667,99.9832
806,807,7091,243,2498,318.462,32.6285,57.3715,99.9613
807,808,6571,401,2497,315.496,9.00031,80.9997,99.9461
808,809,1091,2368,2463,142.263,6.45911,83.5409,99.9903
809,810,2112,1682,2476,136.084,33.2253,56.7747,99.8572
810,811,780,3212,2474,132.197,17.3281,72.6719,99.9544
811,812,15911,1254,2540,330.034,23.2847,66.7153,99.9633
812,813,2299,3178,2501,142.485,29.3608,60.6392,99.9836
813,814,13445,2284,2535,143.938,31.9539,58.0461,99.7226
814,815,552,2185,2483,114.836,82.8306,7.16938,99.9563
815,816,1741,1795,2498,143.362,31.0567,58.9433,99.9459
816,817,2663,1738,2514,335.463,12.911,77.089,99.8503
817,818,1998,2738,2501,151.174,46.3156,43.6844,99.9926
818,819,1622,3022,2511,319.608,7.56152,82.4385,99.3211
819,820,839,3125,2504,327.964,32.9106,57.0894,99.7347
820,821,1093,2390,2502,137.577,48.0297,41.9703,99.9693
821,822,981,1692,2511,327.728,48.8923,41.1077,99.8313
822,823,2002,2094,2500,143.989,14.6147,75.3853,99.9754
823,824,2093,1973,2520,141.27200000000005,33.1201,56.8799,99.8073
824,825,1111,2632,2511,325.2990000000001,25.5986,64.4014,99.9845
825,826,843,2970,2518,130.082,62.9509,27.0491,99.526
826,827,10416,3202,2581,142.543,57.1519,32.8481,99.7315
827,828,7759,2166,2542,143.695,0.143867,89.8561,99.9478
828,829,1119,3085,2521,318.545,31.4451,58.5549,99.812
829,830,5271,841,2556,140.83700000000005,21.2616,68.7384,99.7796
830,831,802,343,2530,334.297,70.9023,19.0977,99.9841
831,832,9796,2043,2572,329.809,72.5217,17.4783,99.4258
832,833,735,1581,2532,96.9473,72.9641,17.0359,98.6533
833,834,15765,1849,2588,143.54399999999995,25.0033,64.9967,99.9852
834,835,1079,2663,2546,138.20600000000002,49.2281,40.7719,99.6848
835,836,502,2734,2535,320.653,10.7865,79.2135,99.9783
836,837,26631,932,2640,138.41899999999998,38.7558,51.2442,99.6614
837,838,18220,706,2651,324.255,5.58303,84.417,98.0168
838,839,6125,3404,2568,326.885,1.10593,88.8941,99.8724
839,840,1309,3468,2550,334.093,63.2708,26.7292,99.8566
840,841,7141,2835,2568,328.474,31.3094,58.6906,99.407
841,842,1038,2918,2550,135.125,42.6857,47.3143,99.8036
842,843,1225,2696,2553,148.321,52.3793,37.6207,99.8434
843,844,1960,190,2598,122.077,58.2856,31.7144,99.9506
844,845,2600,1140,2565,139.009,7.45625,82.5437,99.9752
845,846,1786,427,2562,137.433,12.1145,77.8855,99.9508
846,847,3500,1750,2566,139.821,38.5284,51.4716,99.9922
847,848,40562,3002,2640,320.623,14.3096,75.6904,99.3057
848,849,921,313,2555,148.806,22.8623,67.1377,99.9966
849,850,5012,232,2601,124.595,57.7408,32.2592,99.9943
850,851,513,2384,2562,141.067,19.1888,70.8112,99.9677
851,852,23878,581,2628,322.413,31.5313,58.4687,99.6455
852,853,6502,1634,2592,325.125,18.2803,71.7197,99.9291
853,854,5296,1396,2599,150.752,4.30154,85.6985,99.7887
854,855,664,277,2563,332.077,73.1017,16.8983,99.9312
855,856,1190,347,2574,134.696,24.349,65.65100000000001,99.994
856,857,13507,2365,2609,146.061,3.35555,86.6444,99.8397
857,858,2879,1175,2611,130.855,66.1,23.9,99.939
858,859,19269,2776,2722,138.292,69.7005,20.2995,99.2654
859,860,1945,3492,2609,104.992,83.3877,6.612260000000001,99.9865
860,861,3958,1080,2599,320.886,56.9422,33.0578,99.9946
861,862,21853,2663,2665,327.866,25.7062,64.2938,99.9676
862,863,1618,3551,2615,146.384,83.5202,6.47984,99.9113
863,864,1831,291,2601,135.634,9.05615,80.9438,99.9962
864,865,6191,340,2628,333.223,73.9906,16.0094,99.8372
865,866,4918,1981,2622,140.944,35.8625,54.1375,98.9222
866,867,1721,443,2608,324.585,2.55146,87.4485,99.9902
867,868,26042,1736,2696,325.093,43.4496,46.5504,99.6475
868,869,21741,1324,2684,133.77100000000002,58.2412,31.7588,99.9523
869,870,543,2172,2606,319.6740000000001,23.6077,66.3923,99.7227
870,871,610,1548,2623,121.388,74.2204,15.7796,99.9053
871,872,8964,3397,2653,25.1607,81.5197,8.480260000000001,99.9759
872,873,597,2141,2628,141.798,4.43289,85.5671,99.9801
873,874,6272,2258,2668,139.912,7.30116,82.6988,99.5907
874,875,6317,759,2666,321.754,67.9497,22.0503,99.9644
875,876,3473,1045,2650,140.438,30.3613,59.6387,99.9761
876,877,16415,1476,2738,321.677,18.5042,71.4958,99.8091
877,878,1269,1228,2644,328.525,9.66158,80.3384,98.9578
878,879,12256,1136,2691,319.443,35.9096,54.0904,99.9394
879,880,7951,421,2708,118.026,66.8202,23.1798,99.9284
880,881,3380,2423,2674,37.1131,87.1508,2.84919,99.971
881,882,763,412,2654,136.614,31.4265,58.5735,99.9871
882,883,2455,2168,2668,141.142,47.1286,42.8714,99.9901
883,884,19535,1912,2745,116.361,59.354,30.646,99.8676
884,885,1432,3613,2671,154.65200000000004,75.2746,14.7254,99.2953
885,886,4927,3495,2694,140.234,10.538,79.462,99.9778
886,887,853,1497,2662,122.66,73.2905,16.7095,99.9648
887,888,3127,1992,2673,145.81799999999996,26.4011,63.5989,99.9554
888,889,5743,216,2707,138.291,8.48115,81.5189,99.7352
889,890,1593,2364,2673,144.798,16.9303,73.0697,99.9241
890,891,1923,3180,2676,139.266,13.2141,76.7859,99.994
891,892,641,365,2666,333.17800000000005,39.3675,50.6325,99.9898
892,893,8240,1620,2714,141.795,19.2831,70.7169,99.9963
893,894,2891,2530,2689,143.327,68.6702,21.3298,99.9672
894,895,1913,1424,2690,330.324,16.7313,73.2687,99.9958
895,896,17256,290,2763,140.389,24.3877,65.6123,99.9523
896,897,12707,2113,2745,320.994,27.753,62.247,99.9606
897,898,2409,3128,2698,326.955,28.1776,61.8224,99.9795
898,899,991,3551,2693,140.314,10.8671,79.1329,99.9513
899,900,1098,2935,2694,138.833,18.1379,71.8621,99.9304
900,901,1690,2044,2703,145.248,43.8353,46.1647,99.9837
901,902,2433,2210,2712,318.607,3.47871,86.5213,99.9299
902,903,9960,2336,2749,323.062,3.4953199999999995,86.5047,99.584
903,904,4019,2887,2736,136.945,77.078,12.922,99.9623
904,905,3092,3101,2741,326.456,30.5359,59.4641,99.4568
905,906,3431,1046,2733,313.181,27.3508,62.6492,99.9963
906,907,29889,594,2804,321.627,7.96705,82.03299999999999,80.407
907,908,8764,1541,2775,104.013,74.6093,15.3907,99.956
908,909,6292,3219,2752,130.028,24.6191,65.3809,99.9961
909,910,12005,3581,2794,322.121,33.3084,56.6916,98.8317
910,911,12364,2539,2762,8.49775,80.9427,9.05725,98.725
911,912,19913,814,2806,322.832,34.1746,55.8254,99.7481
912,913,1980,3161,2760,317.883,40.5437,49.4563,99.9798
913,914,539,1215,2724,145.491,9.29529,80.7047,99.9895
914,915,3406,3439,2748,133.336,31.5787,58.4213,99.9496
915,916,646,2010,2730,118.418,58.6055,31.3945,99.9894
916,917,30208,965,2843,120.52,67.6207,22.3793,99.8031
917,918,888,693,2741,129.894,57.2761,32.7239,99.9006
918,919,537,2951,2741,266.732,84.9464,5.0536400000000015,99.9314
919,920,15194,3429,2799,322.351,31.4999,58.5001,97.9636
920,921,14558,1196,2795,135.761,59.9703,30.0297,99.9289
921,922,813,2228,2761,136.743,54.1616,35.8384,99.9912
922,923,1255,2397,2773,147.438,13.5874,76.4126,99.6077
923,924,6384,1334,2805,141.91299999999995,9.70607,80.2939,99.8934
924,925,6322,2198,2809,148.11700000000005,17.8184,72.1816,99.9792
925,926,1459,2669,2793,178.595,77.6332,12.3668,99.9567
926,927,747,775,2782,140.708,0.0925217,89.9075,99.9941
927,928,11426,2971,2811,133.11,68.0514,21.9486,99.9554
928,929,4657,401,2801,319.152,25.2333,64.7667,99.9913
929,930,16026,1626,2839,142.079,1.44803,88.552,97.6179
930,931,648,191,2795,139.254,24.5935,65.4065,99.98
931,932,1150,2041,2800,326.483,9.28669,80.7133,99.9716
932,933,8182,2482,2851,150.031,53.154,36.846,99.9069
933,934,1165,1798,2806,120.709,64.2786,25.7214,99.9111
934,935,617,2285,2797,310.964,36.8638,53.1362,99.9645
935,936,7669,3127,2844,322.2290000000001,13.7852,76.2148,99.9822
936,937,17958,1101,2879,144.463,33.5205,56.4795,99.9921
937,938,39086,2281,2911,311.517,36.7105,53.2895,99.8786
938,939,14827,3251,2866,319.24,4.10149,85.8985,97.4946
939,940,4529,1989,2837,322.4,26.6296,63.3704,99.9906
940,941,8814,2592,2838,35.7439,84.7313,5.268680000000002,99.9677
941,942,7126,2790,2844,326.64,13.172,76.828,99.9277
942,943,7235,2703,2875,322.438,24.2458,65.7542,99.9858
943,944,4653,582,2866,139.918,27.9329,62.0671,99.9859
944,945,25326,3392,2944,312.98,76.0033,13.9967,99.853
945,946,539,1305,2843,124.997,79.9043,10.0957,99.9774
946,947,2021,237,2846,135.249,62.3791,27.6209,99.9741
947,948,10805,1809,2903,297.3590000000001,60.5877,29.4123,99.948
948,949,5073,1409,2901,143.08700000000005,26.678,63.322,99.9471
949,950,4891,2083,2870,321.091,26.1997,63.8003,99.9873
950,951,799,1169,2841,335.71,25.7596,64.2404,99.9961
951,952,9963,362,2882,291.733,74.5528,15.4472,99.8951
952,953,4446,1895,2879,137.724,35.1208,54.8792,99.9889
953,954,2546,206,2891,333.458,33.1394,56.8606,99.9581
954,955,10783,512,2910,322.346,11.758,78.242,99.97
955,956,640,2975,2870,317.298,18.6731,71.3269,99.9877
956,957,2081,2898,2887,135.614,37.7429,52.2571,99.9858
957,958,21911,1273,2932,325.356,53.642,36.358,99.8365
958,959,888,3501,2883,135.856,1.82342,88.1766,99.965
959,960,638,268,2877,142.267,20.3601,69.6399,99.9974
960,961,4970,1473,2901,325.431,34.3729,55.6271,99.9234
961,962,849,1956,2884,147.881,21.9637,68.0363,99.9701
962,963,8481,2047,2926,313.526,47.2939,42.7061,99.8443
963,964,1366,3012,2894,139.16,67.4591,22.5409,99.9579
964,965,1063,2633,2895,137.912,33.1213,56.8787,99.9943
965,966,3075,2433,2909,134.135,53.678,36.322,99.9559
966,967,12752,1596,2926,332.977,48.3245,41.6755,99.988
967,968,13577,2937,2956,171.893,74.2886,15.7114,99.8982
968,969,2358,3252,2910,313.385,23.4426,66.5574,99.9951
969,970,5478,3581,2937,141.431,25.5225,64.4775,99.9527
970,971,1995,288,2911,133.85399999999998,63.0585,26.9415,99.9214
971,972,15417,875,2983,322.414,43.0499,46.9501,99.3849
972,973,1831,3080,2910,138.241,20.4488,69.5512,99.9947
973,974,5674,1704,2936,318.27,11.9385,78.0615,99.9922
974,975,512,2852,2899,325.777,13.1642,76.8358,99.9797
975,976,15795,678,2982,319.596,7.6005600000000015,82.3994,98.7995
976,977,2713,2580,2914,134.938,7.99697,82.00299999999999,99.9828
977,978,1928,2781,2912,135.981,41.1701,48.8299,99.955
978,979,1989,236,2926,121.733,73.17,16.83,99.9576
979,980,3594,799,2937,153.618,56.8811,33.1189,99.9939
980,981,2304,3531,2959,138.644,28.1921,61.8079,99.8697
981,982,747,3035,2931,322.765,14.5227,75.4773,99.9687
982,983,723,2657,2925,137.256,39.264,50.736,99.9873
983,984,3147,3115,2949,323.839,29.8052,60.1948,99.9486
984,985,150859,2639,3258,325.514,0.123833,89.8762,95.9443
985,986,1036,3281,2941,321.533,40.2291,49.7709,99.9904
986,987,13533,1923,3004,145.436,12.3233,77.6767,99.685
987,988,9586,2770,2968,325.547,11.1193,78.8807,99.3447
988,989,1962,644,2955,140.454,23.3722,66.6278,99.9949
989,990,1674,1381,2962,326.305,46.9738,43.0262,99.8603
990,991,2362,3491,3004,143.80100000000004,26.2288,63.7712,99.9726
991,992,2192,301,2957,129.765,75.7506,14.2494,99.976
992,993,2796,1729,2986,325.927,51.4863,38.5137,99.9267
993,994,1053,2409,2955,127.593,84.5881,5.4118900000000005,99.9891
994,995,2152,3042,2971,312.599,26.598000000000006,63.402,99.985
995,996,2579,485,2964,321.893,26.372,63.628,99.9679
996,997,2612,2649,2972,145.852,61.3048,28.6952,99.9418
997,998,15202,392,3023,322.838,70.0411,19.9589,99.0101
998,999,1330,3217,2960,139.808,24.0672,65.9328,99.9625
999,1000,1257,2218,2978,132.082,50.0123,39.9877,99.9877
1000,1001,16157,1109,3010,320.72,39.7065,50.2935,99.8079
1001,1002,2559,1518,2979,322.903,31.38,58.62,99.9878
1002,1003,581,193,2971,139.925,17.0415,72.9585,99.9863
1003,1004,15050,1776,3042,143.194,1.35294,88.6471,99.841
1004,1005,48539,3258,3172,321.408,29.4803,60.5197,96.81
1005,1006,9091,268,3033,141.969,14.3492,75.6508,99.9531
1006,1007,3356,3254,3001,140.924,11.1523,78.8477,99.772
1007,1008,6175,1623,3016,148.822,4.84328,85.1567,99.2252
1008,1009,2475,2451,3029,146.019,66.7416,23.2584,99.493
1009,1010,8453,2388,3050,322.014,33.0033,56.9967,99.9681
1010,1011,25033,2006,3096,79.548,74.2916,15.7084,99.4602
1011,1012,524,1345,2992,317.221,38.8848,51.1152,99.9147
1012,1013,707,3087,2995,178.785,72.1687,17.8313,99.986
1013,1014,17983,1419,3053,135.20600000000002,53.2839,36.7161,99.7694
1014,1015,38909,676,3112,142.489,17.459,72.541,99.6867
1015,1016,3641,3575,3068,335.07199999999995,70.3677,19.6323,99.4896
1016,1017,2392,1302,3029,332.724,1.70878,88.2912,99.9529
1017,1018,15843,2177,3061,316.681,29.6825,60.3175,99.9701
1018,1019,31691,3043,3154,328.11800000000005,40.5699,49.4301,99.8827
1019,1020,24295,2867,3093,328.167,39.841,50.159,99.9815
1020,1021,584,3533,3024,138.305,28.5497,61.4503,99.79
1021,1022,790,2733,3023,142.591,57.2803,32.7197,99.93
1022,1023,9973,1536,3093,143.309,8.9007,81.0993,99.9903
1023,1024,531,681,3029,132.57399999999998,6.20827,83.7917,99.0111
1024,1025,18938,1090,3108,145.194,19.3089,70.6911,99.9764
1025,1026,1538,204,3052,324.444,61.3738,28.6262,99.9855
1026,1027,2687,3253,3058,138.197,22.4499,67.5501,99.9508
1027,1028,924,2315,3051,156.994,3.31677,86.6832,98.6094
1028,1029,15797,874,3126,150.05,82.8012,7.198760000000001,99.9067
1029,1030,1838,978,3061,322.876,49.19300000000001,40.807,99.9703
1030,1031,20087,3476,3134,326.203,70.9876,19.0124,99.7804
1031,1032,683,2966,3077,140.425,14.3162,75.6838,99.9731
1032,1033,4327,2273,3104,321.248,3.97563,86.0244,99.9928
1033,1034,4040,2087,3098,329.3,22.5842,67.4158,99.9962
1034,1035,28579,1699,3181,0.62317,79.6602,10.3398,99.7378
1035,1036,12265,1259,3120,147.02700000000004,77.8419,12.1581,99.9267
1036,1037,832,445,3079,144.931,15.9211,74.0789,99.9727
1037,1038,39892,536,3204,148.852,41.6007,48.3993,99.9004
1038,1039,1884,183,3121,144.58,64.8063,25.1937,99.9338
1039,1040,736,965,3097,112.645,63.2214,26.7786,99.9252
1040,1041,1377,386,3099,148.486,10.8425,79.1575,99.9685
1041,1042,753,3402,3102,142.893,26.8014,63.1986,99.989
1042,1043,13147,2340,3184,127.797,43.5154,46.4846,99.9655
1043,1044,5791,271,3143,141.809,52.5374,37.4626,99.9709
1044,1045,1239,206,3143,146.744,63.7339,26.2661,99.9536
1045,1046,7176,3182,3196,136.873,29.9312,60.0688,99.8096
1046,1047,17266,355,3208,145.18,14.9626,75.0374,99.9288
1047,1048,590,1818,3121,322.876,23.7354,66.2646,99.9845
1048,1049,14593,1425,3175,151.457,3.34772,86.6523,99.9355
1049,1050,2517,1899,3174,146.484,15.5211,74.4789,99.8615
1050,1051,4604,2932,3200,316.177,32.5389,57.4611,99.8733
1051,1052,13813,955,3223,320.66,49.1153,40.8847,99.5243
1052,1053,7936,1558,3203,18.1121,78.9546,11.0454,99.9021
1053,1054,1495,2174,3141,139.621,13.5905,76.4095,99.9843
1054,1055,2887,1834,3162,6.817989999999999,78.4689,11.5311,99.9433
1055,1056,23704,2202,3220,320.676,36.4822,53.5178,99.938
1056,1057,4368,3560,3212,332.774,70.6351,19.3649,99.8797
1057,1058,1219,1223,3178,107.192,83.5116,6.48842,99.9838
1058,1059,24356,3380,3246,314.49,34.2168,55.7832,99.9828
1059,1060,5775,1090,3196,330.8130000000001,32.7807,57.2193,99.851
1060,1061,7719,1314,3218,6.8162699999999985,80.0143,9.98568,99.9336
1061,1062,1286,1971,3196,330.15,40.563,49.437,99.9698
1062,1063,1571,1775,3200,333.711,59.7396,30.2604,99.9925
1063,1064,1613,2558,3215,146.701,25.3485,64.6515,99.9903
1064,1065,2963,808,3233,313.65,46.4744,43.5256,99.977
1065,1066,19296,1890,3267,138.762,7.4226899999999985,82.5773,99.5546
1066,1067,16639,2039,3284,328.987,40.3997,49.6003,99.8829
1067,1068,1994,258,3233,325.6690000000001,40.3899,49.6101,99.9934
1068,1069,555,1203,3213,94.9046,81.1515,8.84853,99.9923
1069,1070,6143,1044,3249,17.3244,84.4222,5.57781,99.9329
1070,1071,3813,2478,3237,331.49,20.2681,69.7319,99.7622
1071,1072,10041,1633,3286,136.532,79.203,10.797,99.8982
1072,1073,16303,1428,3305,323.65,15.8452,74.1548,99.9259
1073,1074,20343,3146,3321,321.652,20.2239,69.7761,99.7945
1074,1075,26744,1243,3312,138.905,31.511,58.489,98.6975
1075,1076,45869,2319,3421,327.958,40.3888,49.6112,99.8506
1076,1077,1311,763,3261,135.82399999999998,39.9853,50.0147,99.9946
1077,1078,56310,913,3387,321.524,24.8497,65.1503,99.4975
1078,1079,10076,894,3318,141.06,34.8671,55.1329,99.9884
1079,1080,1387,1557,3273,321.574,1.31252,88.6875,99.9809
1080,1081,2870,2474,3284,125.308,81.7036,8.296380000000001,99.9423
1081,1082,8306,3491,3332,141.45600000000005,43.409,46.591,99.933
1082,1083,553,808,3280,134.755,38.7465,51.2535,99.9867
1083,1084,3374,2316,3293,142.672,28.087,61.913,99.9035
1084,1085,1820,295,3296,319.064,56.6392,33.3608,99.996
1085,1086,6841,516,3342,142.494,24.9816,65.0184,99.9213
1086,1087,7483,2964,3342,133.465,10.7612,79.2388,99.8766
1087,1088,1362,2983,3295,319.379,13.8611,76.1389,99.9919
1088,1089,6287,1076,3330,90.8743,71.6582,18.3418,99.9682
1089,1090,2570,1571,3335,145.128,11.1417,78.8583,99.9526
1090,1091,620,179,3302,320.451,54.3409,35.6591,99.9427
1091,1092,3644,783,3317,116.687,79.3216,10.6784,99.9578
1092,1093,4125,231,3367,320.951,57.0118,32.9882,99.8313
1093,1094,49976,336,3440,323.005,2.23225,87.7678,99.3237
1094,1095,1584,2410,3321,133.91299999999998,48.7417,41.2583,99.9593
1095,1096,33461,2111,3440,149.17,39.4654,50.5346,99.7283
1096,1097,1706,2960,3332,319.578,5.1767400000000015,84.8233,99.7475
1097,1098,1931,1729,3326,315.823,43.2048,46.7952,99.9911
1098,1099,2590,2229,3345,146.416,12.8385,77.1615,99.9881
1099,1100,9570,2794,3400,134.715,66.8996,23.1004,99.9467
1100,1101,758,3575,3336,332.915,59.387,30.613000000000003,99.9876
1101,1102,2950,2833,3361,153.174,0.339828,89.6602,99.9985
1102,1103,1987,3405,3351,319.254,39.2011,50.7989,99.686
1103,1104,1582,1609,3360,326.459,11.7745,78.2255,99.9917
1104,1105,5941,1901,3388,138.211,19.0402,70.9598,99.9862
1105,1106,1417,191,3407,318.335,55.5678,34.4322,99.9048
1106,1107,2175,1658,3381,324.004,51.5061,38.4939,99.8411
1107,1108,4967,1731,3392,147.384,41.675,48.325,99.9955
1108,1109,2541,3567,3383,19.1417,83.4272,6.5727699999999984,99.8865
1109,1110,852,623,3373,126.7,56.3512,33.6488,99.989
1110,1111,3979,1803,3401,146.76,23.0316,66.9684,99.9884
1111,1112,964,1488,3369,27.6092,85.4703,4.52974,99.9153
1112,1113,2607,616,3399,145.012,15.565,74.435,99.9326
1113,1114,7838,1573,3421,135.243,20.1102,69.8898,99.9701
1114,1115,5656,3117,3429,319.277,16.4795,73.5205,99.8955
1115,1116,21423,1978,3478,328.892,33.2764,56.7236,99.9543
1116,1117,829,2893,3396,321.684,10.9253,79.0747,99.9317
1117,1118,2971,2928,3429,134.368,65.6015,24.3985,99.9075
1118,1119,6827,3441,3413,58.0388,86.0296,3.97045,99.9199
1119,1120,2294,2484,3409,141.19299999999996,41.2626,48.7374,99.9934
1120,1121,1313,3166,3407,134.04399999999998,61.6995,28.3005,99.9578
1121,1122,8627,1380,3433,320.472,50.1386,39.8614,99.9713
1122,1123,27968,3067,3510,319.3540000000001,7.29121,82.7088,98.8925
1123,1124,1613,1229,3407,146.893,38.9112,51.0888,99.9018
1124,1125,10603,1523,3479,145.675,33.008,56.992,99.9641
1125,1126,8870,3264,3445,132.289,61.6218,28.3782,99.9495
1126,1127,14189,513,3454,144.106,72.6908,17.3092,99.8791
1127,1128,2041,2536,3423,121.76,82.0843,7.91568,99.9882
1128,1129,3133,3551,3439,7.21833,81.1848,8.81516,99.8139
1129,1130,7673,1701,3455,324.19,0.443436,89.5566,99.9592
1130,1131,14198,748,3500,149.755,29.508000000000006,60.492,99.8648
1131,1132,1801,701,3438,118.874,57.9572,32.0428,99.958
1132,1133,20472,2454,3513,135.803,33.8878,56.1122,99.7668
1133,1134,4423,632,3462,322.245,51.5354,38.4646,99.9937
1134,1135,2378,830,3463,139.05200000000002,16.0803,73.9197,99.889
1135,1136,6619,1209,3472,133.01,57.6239,32.3761,99.9282
1136,1137,2372,1046,3461,147.595,31.5231,58.4769,99.9941
1137,1138,1189,1441,3460,303.814,85.4907,4.50926,99.9817
1138,1139,5108,1825,3479,147.108,45.8765,44.1235,99.9898
1139,1140,26710,2811,3560,342.596,82.4289,7.571110000000001,98.5564
1140,1141,1223,1882,3469,146.541,6.89305,83.1069,99.9927
1141,1142,1858,3461,3467,318.319,8.378039999999999,81.622,99.9472
1142,1143,2415,2890,3479,137.141,69.7042,20.2958,99.9016
1143,1144,2128,1104,3473,322.258,5.84322,84.1568,99.9915
1144,1145,1740,1285,3476,324.55,24.8387,65.1613,99.9924
1145,1146,632,2820,3474,324.998,8.489939999999999,81.5101,99.8184
1146,1147,63192,1847,3603,142.908,2.9277,87.0723,83.4509
1147,1148,544,3393,3471,329.228,76.3163,13.6837,99.9076
1148,1149,7968,3463,3538,129.87,43.0562,46.9438,99.7974
1149,1150,11150,3559,3580,133.968,13.8209,76.1791,99.6864
1150,1151,688,184,3512,124.541,44.2342,45.7658,99.9111
1151,1152,1906,1436,3510,319.074,53.4654,36.5346,99.8611
1152,1153,1909,3224,3514,143.675,2.39952,87.6005,99.9736
1153,1154,3727,1335,3521,328.2030000000001,13.711,76.289,99.8331
1154,1155,6354,589,3535,321.811,4.40316,85.5968,99.971
1155,1156,3946,1069,3543,12.4156,78.9314,11.0686,99.1562
1156,1157,4582,1144,3536,324.692,10.9634,79.0366,80.4206
1157,1158,25239,3342,3586,330.856,72.5073,17.4927,99.049
1158,1159,5039,1001,3552,325.101,7.9623300000000015,82.0377,99.6749
1159,1160,1423,382,3531,142.7,22.582,67.418,99.9801
1160,1161,30661,892,3626,144.062,7.23753,82.7625,99.0984
1161,1162,12829,474,3571,114.85,83.7476,6.25241,99.9567
1162,1163,2219,836,3543,111.398,75.2241,14.7759,99.9851
1163,1164,6209,1231,3562,144.851,24.9637,65.0363,99.9922
1164,1165,12855,673,3595,329.932,59.8616,30.1384,99.9378
1165,1166,4343,1376,3564,327.252,45.0462,44.9538,99.9907
1166,1167,539,160,3552,320.17,6.966589999999999,83.0334,99.8486
1167,1168,13707,1492,3599,137.429,1.34322,88.6568,99.9926
1168,1169,549,2213,3554,139.265,11.9245,78.0755,99.9918
1169,1170,4423,2979,3582,138.398,9.10383,80.8962,99.9744
1170,1171,3091,3197,3592,59.1957,75.0474,14.9526,99.9455
1171,1172,2271,2216,3583,139.589,9.09366,80.9063,99.9529
1172,1173,4058,2410,3592,316.943,21.4331,68.5669,99.9873
1173,1174,19452,1297,3654,325.853,51.7206,38.2794,99.9399
1174,1175,2436,2150,3602,126.356,53.449,36.551,99.988
1175,1176,9918,1134,3635,323.728,7.19049,82.8095,99.7507
1176,1177,8222,2345,3631,131.70600000000002,29.0604,60.9396,99.9865
1177,1178,893,1967,3586,149.466,4.43008,85.5699,99.8461
1178,1179,2199,2090,3600,337.38,47.2645,42.7355,99.9898
1179,1180,1900,2256,3612,322.106,36.9833,53.0167,99.9622
1180,1181,22729,247,3691,320.894,14.082,75.918,99.6595
1181,1182,10931,3095,3682,149.578,37.2323,52.7677,99.373
1182,1183,3462,2484,3623,145.82299999999995,5.23166,84.7683,99.9555
1183,1184,8253,422,3645,127.475,63.3965,26.6035,99.9422
1184,1185,2246,345,3629,322.887,7.7719,82.2281,99.9881
1185,1186,779,567,3619,138.567,9.49522,80.5048,99.9855
1186,1187,1972,1411,3627,337.954,58.7138,31.2862,99.9669
1187,1188,3040,2563,3637,353.124,70.3934,19.6066,99.9823
1188,1189,2297,632,3639,135.314,33.6323,56.3677,99.9915
1189,1190,621,2212,3632,143.066,6.38391,83.6161,99.9786
1190,1191,11933,2974,3683,140.83700000000005,15.4767,74.5233,98.9279
1191,1192,21576,1774,3746,321.637,9.4986,80.5014,99.5371
1192,1193,844,2271,3648,326.961,56.3436,33.6564,99.9824
1193,1194,20610,3232,3733,137.923,10.7972,79.2028,99.8752
1194,1195,12302,1648,3688,151.722,22.3819,67.6181,99.9408
1195,1196,1525,2183,3659,334.99300000000005,21.8674,68.1326,99.5846
1196,1197,909,3122,3654,318.093,50.3671,39.6329,99.992
1197,1198,2570,3468,3673,323.495,6.54321,83.4568,99.9877
1198,1199,2424,2626,3671,139.134,25.7511,64.2489,99.994
1199,1200,6051,1864,3678,166.31400000000005,87.0369,2.96306,99.9596
1200,1201,1955,2404,3677,5.76551,81.5291,8.4709,99.9763
1201,1202,718,2893,3658,138.813,15.6641,74.3359,99.8984
1202,1203,1350,2801,3662,141.545,5.92355,84.0764,99.9976
1203,1204,10293,2520,3737,132.875,54.0016,35.9984,99.9419
1204,1205,3976,333,3682,135.009,51.5985,38.4015,99.993
1205,1206,1008,580,3666,144.226,59.1102,30.8898,99.9935
1206,1207,1127,2845,3669,325.175,31.4135,58.5865,99.9001
1207,1208,3210,1195,3691,336.824,58.2486,31.7514,99.9776
1208,1209,6082,1397,3705,1.7426700000000002,79.1953,10.8047,99.9525
1209,1210,4951,817,3712,142.444,34.4422,55.5578,99.6184
1210,1211,602,499,3671,328.594,15.7973,74.2027,99.9829
1211,1212,4975,2248,3701,147.627,38.9143,51.0857,99.9821
1212,1213,7924,3351,3700,322.835,35.9099,54.0901,99.9355
1213,1214,4726,536,3711,139.362,7.28643,82.7136,99.745
1214,1215,54800,2842,3829,150.247,36.1389,53.8611,81.1632
1215,1216,6437,694,3724,145.606,19.3592,70.6408,99.9946
1216,1217,2302,757,3694,11.6094,82.1799,7.820119999999998,99.9444
1217,1218,3671,625,3701,324.733,69.9446,20.0554,99.9899
1218,1219,2475,1506,3688,145.951,28.2105,61.7895,99.9975
1219,1220,2728,1089,3696,141.042,34.3969,55.6031,99.992
1220,1221,925,2297,3692,136.737,48.8649,41.1351,99.9425
1221,1222,29475,2530,3786,145.026,19.8749,70.1251,98.9425
1222,1223,2485,2881,3719,118.156,71.2633,18.7367,99.9454
1223,1224,68167,2010,3939,323.569,12.5216,77.4784,98.7782
1224,1225,5010,2341,3737,325.462,14.9351,75.0649,99.8937
1225,1226,3008,3517,3725,328.307,53.0138,36.9862,99.7638
1226,1227,1707,2192,3722,324.88,0.139053,89.8609,99.9632
1227,1228,5271,449,3742,328.94199999999995,21.4381,68.5619,99.8373
1228,1229,3412,1603,3733,335.91,66.2792,23.7208,99.9413
1229,1230,7454,940,3771,329.2519999999999,71.9029,18.0971,99.9672
1230,1231,8853,1047,3765,82.0764,79.2931,10.7069,99.8985
1231,1232,1060,587,3731,318.1670000000001,76.99600000000002,13.004,99.9894
1232,1233,556,3561,3724,330.51,55.9093,34.0907,99.8494
1233,1234,30821,1544,3825,320.42,0.6098020000000001,89.3902,99.3842
1234,1235,34400,3413,3827,322.682,66.5493,23.4507,99.7174
1235,1236,4356,1162,3752,141.468,34.2014,55.7986,99.97
1236,1237,1347,882,3736,139.246,31.3555,58.6445,99.9738
1237,1238,10920,1911,3795,123.777,75.2102,14.7898,99.884
1238,1239,2101,755,3756,324.83,71.8064,18.1936,99.9531
1239,1240,3961,2165,3766,329.439,24.3279,65.6721,99.9039
1240,1241,7750,3097,3783,137.155,48.7803,41.2197,99.988
1241,1242,896,2230,3757,326.985,14.8352,75.1648,99.9405
1242,1243,796,186,3757,84.4246,87.2062,2.79379,99.9927
1243,1244,4405,858,3776,142.281,21.7533,68.2467,99.9922
1244,1245,3630,1233,3772,333.601,3.1124,86.8876,99.9277
1245,1246,1866,2561,3768,323.934,63.5896,26.4104,99.974
1246,1247,1088,395,3769,321.381,4.53011,85.4699,99.9872
1247,1248,17274,655,3822,142.701,6.05302,83.947,99.8855
1248,1249,26400,1264,3877,313.393,55.3347,34.6653,99.8148
1249,1250,842,2102,3771,133.739,40.1443,49.8557,99.9175
1250,1251,1387,506,3770,145.31,39.285,50.715,99.9953
1251,1252,1885,3554,3777,138.716,16.5514,73.4486,99.8015
1252,1253,641,546,3778,142.371,36.4322,53.5678,99.985
1253,1254,3452,1417,3820,346.716,81.6164,8.38363,99.9295
1254,1255,559,2300,3790,153.84799999999996,0.829628,89.1704,99.4443
1255,1256,910,2333,3792,150.344,28.6457,61.3543,99.866
1256,1257,4960,441,3825,134.534,46.3763,43.6237,99.8989
1257,1258,1527,2262,3794,336.48,37.0241,52.9759,99.9878
1258,1259,4356,294,3801,325.7340000000001,14.7738,75.2262,99.8373
1259,1260,14236,783,3875,146.376,13.1943,76.8057,98.8006
1260,1261,3055,2868,3812,334.6140000000001,53.4098,36.5902,99.9728
1261,1262,838,3210,3804,143.07399999999996,24.4102,65.5898,99.9932
1262,1263,1132,1278,3806,139.542,0.441765,89.5582,99.9966
1263,1264,32637,2249,3950,144.32,0.683067,89.3169,99.3552
1264,1265,3402,1671,3816,327.29,34.298,55.702,99.9154
1265,1266,880,538,3808,151.64700000000005,55.9216,34.0784,99.9778
1266,1267,5918,1149,3826,148.231,15.0571,74.9429,99.999
1267,1268,5418,2129,3835,145.501,59.0849,30.9151,99.9919
1268,1269,1065,184,3819,120.808,73.3629,16.6371,99.9768
1269,1270,7036,361,3850,322.368,32.2949,57.7051,99.9121
1270,1271,755,573,3820,145.94299999999996,53.5818,36.4182,99.9741
1271,1272,1548,3059,3828,324.202,39.5001,50.4999,99.996
1272,1273,6265,2359,3849,330.967,40.7781,49.2219,99.9955
1273,1274,1118,1045,3827,332.941,52.7652,37.2348,99.9649
1274,1275,1445,756,3841,308.338,72.2297,17.7703,99.9683
1275,1276,4214,3133,3857,323.5370000000001,26.6744,63.3256,99.9473
1276,1277,4301,260,3862,138.108,42.3884,47.6116,99.9777
1277,1278,15684,1769,3891,145.67700000000005,35.5615,54.4385,99.9793
1278,1279,2274,544,3853,335.6380000000001,27.3718,62.6282,99.9938
1279,1280,2533,944,3859,130.254,4.9974,85.0026,99.5515
1280,1281,2309,1478,3855,138.922,43.893,46.107,99.9927
1281,1282,1202,3518,3860,324.486,60.0952,29.9048,99.4576
1282,1283,7197,2639,3897,326.496,26.9698,63.0302,99.9859
1283,1284,4074,3294,3886,137.14,33.1187,56.8813,99.9837
1284,1285,8558,1049,3877,165.204,83.6981,6.30186,99.9729
1285,1286,106792,1045,4058,148.809,26.3371,63.6629,97.5992
1286,1287,5205,2542,3893,144.531,47.0356,42.9644,99.993
1287,1288,1157,1374,3876,157.036,11.5041,78.4959,99.9891
1288,1289,2662,2166,3908,314.689,49.2247,40.7753,99.9599
1289,1290,5987,3213,3904,318.664,8.935039999999997,81.065,99.9774
1290,1291,3106,444,3886,148.291,20.568,69.432,99.9597
1291,1292,718,3559,3881,132.259,45.6381,44.3619,99.8448
1292,1293,7726,1452,3923,143.096,2.02698,87.973,99.2017
1293,1294,1380,3056,3892,320.3590000000001,0.8430860000000001,89.1569,99.9986
1294,1295,59021,638,4100,140.65,17.5078,72.4922,99.7219
1295,1296,41534,358,3995,144.963,14.9931,75.0069,81.3429
1296,1297,1474,1146,3896,135.72,36.3119,53.6881,99.9879
1297,1298,1599,2397,3912,316.344,37.6609,52.3391,99.9466
1298,1299,1415,3123,3904,137.856,25.939,64.061,99.9797
1299,1300,1624,3518,3922,153.605,16.254,73.74600000000002,99.7803
1300,1301,2000,190,3918,322.738,20.6182,69.3818,99.8746
1301,1302,2711,2907,3929,144.638,5.00338,84.9966,99.9915
1302,1303,3535,416,3933,140.376,26.2675,63.7325,99.9642
1303,1304,585,494,3913,137.69,45.0813,44.9187,99.9584
1304,1305,3281,3561,3973,139.903,58.1088,31.8912,99.7147
1305,1306,9600,1339,3960,174.22099999999998,72.6725,17.3275,99.9631
1306,1307,1869,2449,3925,341.55300000000005,58.3707,31.6293,99.9743
1307,1308,3480,1681,3953,309.793,80.7848,9.21525,99.9244
1308,1309,3789,2512,3956,324.968,62.8606,27.1394,99.9575
1309,1310,10569,684,3983,328.358,46.308,43.692,99.9676
1310,1311,11251,2699,3979,141.83700000000005,32.9226,57.0774,99.8069
1311,1312,8929,3322,3967,139.344,16.1702,73.8298,99.9443
1312,1313,5974,3169,3963,329.56,44.9243,45.0757,99.9919
1313,1314,2722,3063,3951,326.545,80.0342,9.96583,99.9815
1314,1315,3095,3460,3955,130.502,75.3694,14.6306,99.9579
1315,1316,5306,189,4005,327.639,64.9185,25.0815,99.6865
1316,1317,2462,1550,3962,323.124,32.4019,57.5981,99.9706
1317,1318,2846,1853,3964,103.004,80.8117,9.18828,99.9729
1318,1319,1087,2978,3962,155.917,65.8935,24.1065,99.9707
1319,1320,18807,2473,4029,322.611,44.5613,45.4387,99.7892
1320,1321,1672,2139,3983,338.37,15.5236,74.4764,97.5332
1321,1322,15383,1744,4046,304.655,79.1753,10.8247,98.3742
1322,1323,511,2601,3965,137.243,23.1725,66.8275,99.9815
1323,1324,1104,2864,3973,134.107,1.27201,88.728,99.9891
1324,1325,828,3532,3982,143.72799999999995,53.3859,36.6141,99.9542
1325,1326,18507,3417,4040,135.306,12.0259,77.9741,99.8472
1326,1327,9861,2912,4036,141.065,49.0379,40.9621,99.7625
1327,1328,1044,3011,3985,153.246,63.6979,26.3021,99.9614
1328,1329,9679,1415,4069,144.83100000000005,22.0089,67.9911,98.935
1329,1330,5298,1839,4032,145.097,18.4159,71.5841,99.8176
1330,1331,4350,3151,4024,316.5420000000001,4.73911,85.2609,99.6777
1331,1332,13020,1556,4051,134.231,41.4801,48.5199,99.6842
1332,1333,1677,2616,4011,323.476,4.88326,85.1167,99.9876
1333,1334,6537,3241,4039,139.012,56.5917,33.4083,99.4906
1334,1335,758,2753,4010,143.253,49.825,40.175,99.9946
1335,1336,631,2990,4015,323.117,18.3199,71.6801,99.7187
1336,1337,73892,2432,4240,323.65,21.4519,68.5481,99.0157
1337,1338,804,2800,4016,321.3040000000001,39.4358,50.5642,99.9599
1338,1339,15984,1312,4075,320.795,24.1896,65.8104,99.9918
1339,1340,36507,2993,4129,321.99,16.8535,73.1465,99.0052
1340,1341,1226,2657,4055,337.747,62.7226,27.2774,99.3784
1341,1342,998,652,4053,317.611,37.3457,52.6543,99.972
1342,1343,6677,2771,4070,321.745,19.2986,70.7014,99.8674
1343,1344,88545,1827,4191,153.77,0.365456,89.6345,99.2001
1344,1345,950,1214,4068,33.2118,85.8242,4.17584,99.9782
1345,1346,6324,3428,4107,319.824,38.5378,51.4622,99.9144
1346,1347,2887,295,4083,137.987,35.9597,54.0403,99.9961
1347,1348,19389,2605,4130,151.791,58.7552,31.2448,99.9904
1348,1349,1211,918,4083,144.74200000000005,24.811,65.189,99.9473
1349,1350,821,148,4086,317.471,38.5757,51.4243,99.9735
1350,1351,8386,1495,4112,322.707,24.3458,65.6542,99.9944
1351,1352,3254,3171,4098,142.731,16.307000000000002,73.693,99.9529
1352,1353,1796,483,4090,1.76422,72.2522,17.7478,99.7048
1353,1354,11197,2214,4158,145.924,13.9829,76.0171,98.786
1354,1355,734,531,4090,357.414,69.2191,20.7809,99.9475
1355,1356,3080,3547,4122,134.27,19.2477,70.7523,99.9304
1356,1357,8308,385,4134,147.653,27.5023,62.4977,99.7582
1357,1358,1049,641,4100,139.42,36.9351,53.0649,99.9573
1358,1359,6677,3247,4136,321.8590000000001,65.4016,24.5983,99.978
1359,1360,2350,251,4124,120.802,70.2646,19.7354,99.993
1360,1361,5645,2471,4133,146.756,6.07948,83.9205,99.9699
1361,1362,3327,3330,4125,114.095,68.2294,21.7706,99.9671
1362,1363,1664,193,4149,317.629,38.6617,51.3383,99.9869
1363,1364,4974,872,4134,329.42,4.41266,85.5873,99.9788
1364,1365,5023,2128,4150,121.595,75.2565,14.7435,99.9874
1365,1366,6878,2732,4157,139.35299999999998,77.4264,12.5736,99.9763
1366,1367,1341,321,4143,322.307,63.3428,26.6572,99.9948
1367,1368,2803,973,4164,325.224,19.5276,70.4724,99.9681
1368,1369,1888,249,4170,321.126,63.93600000000001,26.064,99.9971
1369,1370,8121,1450,4219,145.947,25.4044,64.5956,99.9173
1370,1371,7672,1339,4211,323.849,31.5708,58.4292,99.9695
1371,1372,797,1534,4169,144.142,44.6898,45.3102,99.968
1372,1373,1555,3330,4175,330.997,64.3998,25.6002,99.7594
1373,1374,4983,3137,4212,146.016,3.31185,86.6881,99.9952
1374,1375,3238,3539,4199,317.936,41.0297,48.9703,99.8557
1375,1376,2732,3452,4196,143.461,30.0325,59.9675,99.9083
1376,1377,15722,865,4223,140.947,24.8796,65.1204,99.9816
1377,1378,3634,1496,4196,143.672,14.1376,75.8624,99.9933
1378,1379,2584,450,4194,319.922,21.0708,68.9292,99.991
1379,1380,3153,2284,4199,130.834,72.3426,17.6574,99.9724
1380,1381,797,311,4190,144.662,15.2223,74.7777,99.9983
1381,1382,4688,1072,4220,325.904,31.8773,58.1227,99.9066
1382,1383,12895,2861,4237,331.339,70.9039,19.0961,99.9659
1383,1384,16578,3264,4234,145.378,71.2311,18.7689,99.9288
1384,1385,1627,383,4203,154.395,8.18346,81.8165,99.9917
1385,1386,37820,2753,4338,147.889,5.33327,84.6667,99.8323
1386,1387,3730,191,4229,323.183,12.0343,77.9657,97.3063
1387,1388,6514,3416,4240,139.841,8.70016,81.2998,99.9855
1388,1389,4601,1002,4218,327.244,4.0295,85.9705,99.9973
1389,1390,862,3076,4206,342.279,68.1514,21.8486,99.9903
1390,1391,4230,1266,4235,328.969,21.2647,68.7353,99.9874
1391,1392,2841,754,4230,136.085,49.4705,40.5295,99.991
1392,1393,1768,2643,4220,321.212,2.56914,87.4309,99.9754
1393,1394,1556,257,4231,336.925,39.0054,50.9946,99.997
1394,1395,1710,2993,4234,131.746,81.5588,8.4412,99.9529
1395,1396,705,2600,4233,150.121,67.2627,22.7373,99.965
1396,1397,1907,480,4250,153.317,21.6949,68.3051,99.9358
1397,1398,1619,1222,4255,321.645,30.479,59.521,99.9841
1398,1399,1376,427,4242,240.388,79.9783,10.0217,99.9781
1399,1400,5507,578,4260,319.789,23.1415,66.8585,99.3032
1400,1401,5274,2227,4291,149.516,12.9907,77.0093,99.5106
1401,1402,3663,3058,4264,321.969,22.3238,67.6762,99.9509
1402,1403,30447,3414,4353,83.0725,75.0497,14.9503,99.9441
1403,1404,1165,335,4251,257.193,78.8107,11.1893,99.9879
1404,1405,582,2149,4248,327.006,23.7613,66.2387,99.9936
1405,1406,1962,3551,4274,74.2726,74.1093,15.8907,99.8615
1406,1407,1075,690,4251,137.998,35.3172,54.6828,99.9896
1407,1408,1983,1380,4269,141.124,25.6941,64.3059,99.9678
1408,1409,778,1421,4266,143.988,3.3231,86.6769,99.9272
1409,1410,676,508,4262,139.664,29.6443,60.3557,99.9875
1410,1411,1696,162,4275,144.869,27.453000000000007,62.547,99.9093
1411,1412,1302,380,4271,138.85299999999998,30.7174,59.2826,99.997
1412,1413,9721,3136,4304,339.349,66.6637,23.3363,99.993
1413,1414,871,2038,4277,63.25100000000001,80.6092,9.39076,99.9818
1414,1415,2697,761,4283,144.64,39.5533,50.4467,99.4121
1415,1416,2277,2142,4289,146.22,6.20984,83.7902,99.9679
1416,1417,10359,2952,4310,131.808,28.5443,61.4557,99.8293
1417,1418,2184,986,4278,326.8540000000001,32.7136,57.2864,99.5339
1418,1419,2946,651,4291,148.372,45.8759,44.1241,99.9933
1419,1420,633,705,4279,337.9240000000001,33.1751,56.8249,99.9977
1420,1421,2492,2084,4297,323.165,17.9907,72.0093,99.1933
1421,1422,1732,1628,4284,331.81,48.5112,41.4888,99.4868
1422,1423,2140,1075,4307,150.345,2.28715,87.7129,99.7729
1423,1424,935,1517,4286,161.11,68.9575,21.0425,99.959
1424,1425,1779,206,4296,310.492,7.8434300000000015,82.1566,99.9817
1425,1426,645,1303,4293,139.364,36.6011,53.3989,99.9793
1426,1427,882,940,4295,326.685,20.6148,69.3852,99.9785
1427,1428,531,1745,4285,131.116,50.3518,39.6482,99.9739
1428,1429,1551,1703,4301,311.747,13.272,76.72800000000002,99.9887
1429,1430,2355,536,4307,147.033,36.565,53.435,99.9035
1430,1431,3642,341,4332,319.564,12.4306,77.5694,99.7556
1431,1432,948,1228,4310,143.526,16.1002,73.8998,99.9052
1432,1433,1606,834,4297,133.11700000000002,11.9203,78.0797,99.9354
1433,1434,704,400,4301,324.688,36.027,53.973,99.9937
1434,1435,4225,454,4321,332.1280000000001,26.1647,63.8353,99.5985
1435,1436,1247,903,4320,36.7201,78.2434,11.7566,99.9635
1436,1437,2448,1474,4310,118.628,57.7982,32.2018,99.9802
1437,1438,628,1981,4295,156.27700000000004,8.95129,81.0487,99.9949
1438,1439,2022,1430,4337,314.58,68.9311,21.0689,71.0428
1439,1440,690,1275,4308,331.78,12.7404,77.2596,99.9916
1440,1441,728,1352,4314,146.171,11.3508,78.6492,99.2851
1441,1442,3475,3241,4313,328.642,59.4932,30.5068,99.9753
1442,1443,1473,382,4327,145.614,4.80711,85.1929,99.8593
1443,1444,1942,2174,4338,332.02,0.0897598,89.9102,99.7719
1444,1445,2452,1758,4329,152.007,6.34698,83.65299999999998,99.979
1445,1446,3855,270,4336,142.769,54.7619,35.2381,99.9811
1446,1447,543,2009,4313,165.12599999999995,18.2453,71.7547,99.9928
1447,1448,688,1391,4317,129.628,39.3411,50.6589,99.9709
1448,1449,10636,698,4367,141.702,11.7396,78.2604,97.861
1449,1450,1084,977,4323,338.031,21.777,68.223,99.986
1450,1451,530,169,4319,127.522,48.4239,41.5761,99.9329
1451,1452,596,1543,4320,156.357,20.348,69.652,99.9038
1452,1453,1846,2469,4338,333.272,34.7935,55.2065,99.9893
1453,1454,852,1115,4324,136.32399999999998,10.112,79.888,99.9214
1454,1455,2029,604,4332,154.423,6.9435,83.0565,99.9604
1455,1456,1159,2024,4337,328.432,6.20599,83.794,99.7257
1456,1457,624,1958,4325,301.372,67.3653,22.6347,99.9699
1457,1458,1011,3538,4348,75.0201,74.5068,15.4932,99.9542
1458,1459,1315,2066,4346,329.668,29.2801,60.7199,99.4697
1459,1460,613,828,4326,156.616,24.7,65.3,99.9453
1460,1461,2391,1039,4343,344.78,50.857,39.143,99.8378
1461,1462,675,1252,4333,141.27100000000004,38.4371,51.5629,99.9931
1462,1463,1447,1678,4338,140.958,33.9602,56.0398,99.9958
1463,1464,1907,2131,4343,150.577,19.4329,70.5671,99.9673
1464,1465,1029,1810,4341,327.4840000000001,16.9049,73.0951,99.8372
1465,1466,10992,3058,4382,134.249,41.7719,48.2281,99.9918
1466,1467,1829,204,4343,143.512,10.622,79.378,99.9814
1467,1468,1552,1179,4342,147.511,10.7062,79.2938,99.3929
1468,1469,605,154,4345,309.2290000000001,26.1704,63.8296,99.8943
1469,1470,1279,529,4344,135.155,38.9953,51.0047,99.9894
1470,1471,1210,1881,4358,318.803,36.6338,53.3662,99.8976
1471,1472,548,1581,4344,338.495,11.4968,78.5032,99.9865
1472,1473,1242,1640,4350,140.953,48.1665,41.8335,99.9661
1473,1474,9959,3236,4387,322.476,38.2508,51.7492,99.9822
1474,1475,1011,1350,4355,324.9,4.37251,85.6275,99.9114
1475,1476,608,2202,4352,163.558,32.5782,57.4218,99.9933
1476,1477,5555,1970,4377,144.095,20.6396,69.3604,99.8977
1477,1478,3015,1366,4383,318.258,13.3387,76.6613,99.2765
1478,1479,652,1727,4357,313.694,58.7881,31.2119,99.9679
1479,1480,4507,930,4384,152.489,17.0687,72.9313,99.9356
1480,1481,680,940,4358,9.64276,67.8811,22.1189,99.9727
1481,1482,752,1240,4358,121.596,25.7406,64.2594,99.9551
1482,1483,748,1492,4366,319.42,37.3052,52.6948,99.488
1483,1484,1430,1117,4376,152.114,5.44936,84.5506,99.9808
1484,1485,932,1152,4364,316.692,29.1122,60.8878,99.9586
1485,1486,1460,425,4374,151.55200000000005,36.88800000000001,53.112,99.9577
1486,1487,910,1300,4371,318.666,26.0601,63.9399,99.989
1487,1488,1185,2307,4381,330.783,1.72787,88.2721,99.4007
1488,1489,523,387,4372,324.122,0.183823,89.8162,99.9476
1489,1490,3522,2948,4381,339.858,39.461,50.539,99.9865
1490,1491,4150,3550,4430,319.9840000000001,0.374748,89.6253,99.7606
1491,1492,1483,540,4379,327.626,17.9135,72.0865,99.9581
1492,1493,4470,2505,4398,146.903,6.76944,83.2306,99.8551
1493,1494,1074,603,4374,325.435,20.1812,69.8188,99.9897
1494,1495,1591,831,4382,161.985,13.7222,76.2778,99.9671
1495,1496,2672,3147,4399,144.357,22.3248,67.6752,98.5958
1496,1497,668,471,4379,358.905,36.4357,53.5643,99.9811
1497,1498,2695,2590,4389,322.813,2.4692,87.5308,99.9778
1498,1499,2800,239,4393,128.782,75.4341,14.5659,99.9879
1499,1500,551,1214,4377,315.52,33.7786,56.2214,99.8521
1500,1501,3473,1789,4411,318.536,33.4938,56.5062,99.6374
1501,1502,1211,155,4388,149.257,32.0176,57.9824,99.7379
1502,1503,747,1020,4381,166.877,33.101,56.899,99.9834
1503,1504,29998,1616,4492,147.278,2.06245,87.9375,79.8223
1504,1505,2304,1746,4397,143.864,8.44149,81.5585,99.994
1505,1506,3138,2229,4399,150.056,20.502,69.498,99.8817
1506,1507,2197,1681,4399,140.025,31.6938,58.3062,99.9267
1507,1508,1942,1615,4397,335.584,59.1633,30.8367,99.9821
1508,1509,3508,2376,4402,327.43,14.7301,75.2699,99.9909
1509,1510,1754,627,4407,319.54,39.2831,50.7169,99.9909
1510,1511,885,1243,4402,130.703,12.2634,77.7366,99.8105
1511,1512,1231,2638,4404,326.51,61.4796,28.5204,99.8198
1512,1513,518,772,4396,136.459,1.2281799999999998,88.7718,99.8627
1513,1514,1745,2078,4403,151.447,9.95602,80.044,99.6764
1514,1515,1099,1428,4407,137.487,24.4311,65.5689,99.8299
1515,1516,1438,1492,4404,161.644,22.3838,67.6162,99.9917
1516,1517,1390,1870,4404,136.901,42.7595,47.2405,99.9709
1517,1518,1941,2145,4409,148.863,9.80687,80.1931,99.8516
1518,1519,4682,404,4437,146.567,15.354,74.646,99.4056
1519,1520,1042,285,4409,147.60399999999996,38.3668,51.6332,99.9979
1520,1521,1609,462,4423,181.93400000000003,65.8227,24.1773,99.986
1521,1522,806,3303,4414,320.516,50.1635,39.8365,99.7114
1522,1523,837,1304,4414,149.313,3.93449,86.0655,99.6884
1523,1524,1095,2911,4416,326.883,14.942,75.058,99.981
1524,1525,1366,1067,4416,319.117,41.6706,48.3294,99.9583
1525,1526,1142,536,4420,147.906,14.8287,75.1713,98.6318
1526,1527,1513,786,4435,156.597,17.7284,72.2716,99.9897
1527,1528,940,2988,4420,144.67,13.9692,76.0308,99.9921
1528,1529,582,321,4427,343.915,29.6063,60.3937,99.9641
1529,1530,544,1192,4418,346.659,21.9952,68.0048,99.9428
1530,1531,4925,846,4443,302.372,56.6505,33.3495,99.9828
1531,1532,2627,1945,4452,327.67,59.2042,30.7958,99.9168
1532,1533,647,2849,4419,137.344,39.3781,50.6219,99.9833
1533,1534,1332,1721,4437,149.031,17.1084,72.8916,99.9779
1534,1535,3754,2300,4449,327.17,7.866060000000001,82.1339,99.9889
1535,1536,891,2556,4432,327.468,18.6093,71.3907,99.9507
1536,1537,712,1130,4426,155.048,24.2577,65.7423,99.9628
1537,1538,1108,208,4437,142.105,61.6299,28.3701,99.9884
1538,1539,6615,2075,4457,327.03,16.8566,73.1434,98.6296
1539,1540,29870,1302,4575,323.857,12.4751,77.5249,73.3108
1540,1541,804,996,4436,334.46,5.66427,84.3357,99.2646
1541,1542,8563,2165,4483,319.2940000000001,44.386,45.614,99.976
1542,1543,1215,1051,4445,311.8590000000001,43.382,46.618,99.935
1543,1544,2240,727,4452,325.848,17.6759,72.3241,99.9958
1544,1545,2187,958,4451,333.281,16.7539,73.2461,99.8409
1545,1546,1710,1471,4450,337.36800000000005,50.8952,39.1048,99.9944
1546,1547,517,2894,4437,323.296,9.06712,80.9329,99.9457
1547,1548,1321,3253,4444,319.4170000000001,53.1493,36.8507,99.985
1548,1549,5935,1864,4460,314.761,30.6562,59.3438,99.9671
1549,1550,4954,2609,4457,322.197,17.4883,72.5117,99.9673
1550,1551,856,912,4443,317.932,13.6724,76.3276,99.9598
1551,1552,6267,2406,4465,147.047,3.55179,86.4482,99.875
1552,1553,4008,1163,4474,306.135,8.041139999999999,81.9589,99.9829
1553,1554,1807,3463,4456,104.393,75.094,14.906,99.9385
1554,1555,2067,2242,4474,134.67,12.1084,77.8916,99.9685
1555,1556,2141,2775,4456,140.382,19.9074,70.0926,99.6947
1556,1557,2131,2499,4459,328.088,29.1989,60.8011,99.7384
1557,1558,8028,634,4495,154.379,55.083,34.917,97.8595
1558,1559,9569,528,4474,325.088,4.26997,85.73,99.9726
1559,1560,1398,3118,4451,145.964,29.7427,60.2573,99.9691
1560,1561,1615,2844,4454,137.452,4.7469199999999985,85.2531,99.9784
1561,1562,10474,190,4503,140.911,40.6672,49.3328,99.8842
1562,1563,1016,1236,4469,91.2176,81.5171,8.48293,99.9779
1563,1564,1358,1426,4470,139.584,27.1606,62.8394,99.8908
1564,1565,17515,268,4558,320.935,8.589780000000001,81.4102,99.8278
1565,1566,1098,1356,4465,168.861,75.5679,14.4321,99.9934
1566,1567,1083,3306,4463,121.286,19.0559,70.9441,99.9584
1567,1568,1051,3069,4469,142.718,42.6382,47.3618,99.9823
1568,1569,703,359,4472,308.7290000000001,76.3766,13.6234,99.9875
1569,1570,2114,2893,4482,327.154,20.911,69.089,99.9473
1570,1571,13408,913,4512,320.76,14.9444,75.0556,61.9401
1571,1572,705,1079,4483,324.763,6.27203,83.728,99.9897
1572,1573,1094,3160,4478,138.03799999999998,0.432846,89.5672,99.9582
1573,1574,2653,1997,4488,152.625,11.344,78.656,99.8216
1574,1575,949,2811,4481,135.373,45.9586,44.0414,99.9905
1575,1576,609,3270,4476,323.259,1.02959,88.9704,99.9736
1576,1577,4412,2964,4503,140.878,51.3027,38.6973,99.9669
1577,1578,2232,1388,4506,96.6736,79.008,10.9919,98.7997
1578,1579,16202,3210,4552,144.123,6.77703,83.223,96.4705
1579,1580,1006,1046,4488,131.099,6.09236,83.9076,99.9854
1580,1581,917,3384,4483,329.275,28.8568,61.1432,99.9854
1581,1582,4927,2496,4534,121.291,73.2693,16.7307,98.6878
1582,1583,956,3119,4488,334.664,6.913410000000002,83.0866,99.9914
1583,1584,808,1819,4495,327.152,3.18926,86.8107,98.3937
1584,1585,1141,3501,4503,318.3520000000001,2.0632,87.9368,99.836
1585,1586,1984,2294,4509,326.763,19.4016,70.5984,99.9874
1586,1587,542,2557,4497,146.52700000000004,22.9762,67.0238,99.9723
1587,1588,1090,3429,4497,316.81,14.5341,75.4659,99.8057
1588,1589,2576,729,4515,334.182,3.2318,86.7682,70.4339
1589,1590,3985,1444,4532,336.03,38.5303,51.4697,78.9031
1590,1591,2702,2763,4512,332.413,43.6179,46.3821,99.968
1591,1592,2381,2351,4508,140.431,10.7648,79.2352,99.9796
1592,1593,14148,2662,4545,132.738,36.6277,53.3723,98.9951
1593,1594,8382,3045,4543,132.976,42.6754,47.3246,99.7898
1594,1595,11458,405,4561,295.079,73.3884,16.6116,68.1471
1595,1596,841,3249,4500,320.062,48.6102,41.3898,99.9864
1596,1597,610,334,4511,98.3225,70.6446,19.3554,99.2132
1597,1598,1308,1110,4516,138.476,17.8146,72.1854,99.8601
1598,1599,725,2586,4512,147.0,35.1797,54.8203,99.4194
1599,1600,1003,2057,4519,151.88,9.80715,80.1928,99.9158
1600,1601,4429,3361,4543,139.793,22.1419,67.8581,99.8486
1601,1602,11112,1963,4561,131.695,43.5136,46.4864,99.7035
1602,1603,10454,2866,4567,322.3590000000001,20.5646,69.4354,93.4237
1603,1604,2068,1828,4536,320.297,5.9657800000000005,84.0342,99.5891
1604,1605,758,532,4528,157.379,20.9333,69.0667,99.9732
1605,1606,686,2194,4528,139.922,2.1704,87.8296,99.515
1606,1607,784,1865,4532,143.648,17.2577,72.7423,99.9547
1607,1608,7469,2398,4565,143.411,24.342,65.658,99.9287
1608,1609,2342,3461,4540,144.28799999999995,21.7803,68.2197,97.2441
1609,1610,6125,1318,4560,143.751,10.6642,79.3358,99.6323
1610,1611,1892,2240,4554,325.661,42.2443,47.7557,99.9713
1611,1612,747,638,4540,144.843,56.4795,33.5205,99.8171
1612,1613,607,2559,4544,126.559,67.6327,22.3673,98.5011
1613,1614,4051,1734,4573,135.082,1.61922,88.3808,99.9803
1614,1615,4698,701,4584,321.021,16.4044,73.5956,99.9803
1615,1616,698,1097,4551,137.033,35.1057,54.8943,99.973
1616,1617,2329,815,4561,323.801,17.4157,72.5843,99.8948
1617,1618,1372,1798,4564,324.459,28.6223,61.3777,99.9589
1618,1619,4767,500,4589,145.79399999999995,28.3471,61.6529,99.9274
1619,1620,512,2067,4551,322.9,4.70274,85.2973,99.9855
1620,1621,1603,1060,4562,138.535,36.4117,53.5883,99.9954
1621,1622,2368,2314,4577,327.398,39.1446,50.8554,99.2537
1622,1623,2808,564,4573,344.286,45.4574,44.5426,99.9818
1623,1624,533,2204,4562,335.834,47.3669,42.6331,99.9898
1624,1625,2592,3421,4579,137.586,12.2616,77.7384,99.5539
1625,1626,964,1148,4564,155.826,24.408,65.592,99.9941
1626,1627,7206,613,4610,332.876,49.4232,40.5768,99.9898
1627,1628,1464,963,4570,322.754,22.4051,67.5949,99.8494
1628,1629,2265,1481,4578,133.32299999999998,9.98663,80.0134,99.5502
1629,1630,622,82,4577,256.632,78.5153,11.4847,97.8893
1630,1631,1968,907,4588,144.02200000000005,37.8452,52.1548,97.6607
1631,1632,2709,3311,4592,133.724,35.013000000000005,54.987,99.989
1632,1633,2859,1895,4594,352.987,72.9209,17.0791,99.9861
1633,1634,1011,2043,4583,315.888,25.0184,64.9816,99.951
1634,1635,1043,2151,4583,318.184,27.0447,62.9553,99.9687
1635,1636,1174,861,4588,331.326,3.38766,86.6123,99.9937
1636,1637,1416,1658,4583,327.81,52.1325,37.8675,99.483
1637,1638,3861,3485,4615,140.42600000000002,7.629580000000002,82.3704,99.7952
1638,1639,3932,770,4602,137.296,53.3102,36.6898,99.9791
1639,1640,3622,2089,4603,318.041,34.6681,55.3319,99.9933
1640,1641,9411,1090,4613,140.968,76.3281,13.6719,99.8947
1641,1642,2208,1589,4604,311.293,34.2915,55.7085,99.9736
1642,1643,2676,3068,4602,324.97,39.6137,50.3863,99.9806
1643,1644,1406,1838,4604,137.747,5.16669,84.8333,99.9973
1644,1645,3701,2207,4609,141.597,62.0039,27.9961,99.9947
1645,1646,1476,2273,4607,138.71200000000002,57.8698,32.1302,99.9871
1646,1647,1384,1787,4609,140.644,42.8781,47.1219,99.9684
1647,1648,3197,1532,4619,125.374,33.4134,56.5866,99.9877
1648,1649,609,532,4609,146.622,16.0342,73.9658,99.386
1649,1650,642,952,4613,102.696,72.8902,17.1098,99.9237
1650,1651,2050,2588,4613,131.857,16.7542,73.2458,99.9801
1651,1652,2305,3348,4615,149.209,23.1133,66.8867,99.9521
1652,1653,1021,2989,4607,137.19899999999998,37.0672,52.9328,99.9851
1653,1654,2006,869,4627,146.13,18.1735,71.8265,98.9472
1654,1655,592,3229,4610,135.618,19.3875,70.6125,99.9885
1655,1656,3979,2672,4648,326.976,63.07899999999999,26.921,99.9489
1656,1657,1088,2517,4625,10.9665,80.3719,9.62806,99.981
1657,1658,4885,2394,4637,323.509,5.92446,84.0755,99.9431
1658,1659,5682,3158,4645,137.654,32.6513,57.3487,99.8832
1659,1660,2821,2920,4638,320.369,28.8612,61.1388,99.9129
1660,1661,1631,387,4632,140.156,38.4755,51.5245,99.7565
1661,1662,2253,2133,4645,123.28,67.1737,22.8263,99.9388
1662,1663,776,1739,4628,148.486,68.4858,21.5142,99.9711
1663,1664,1953,2020,4647,133.5,3.90887,86.0911,99.9916
1664,1665,528,176,4631,142.637,38.7109,51.2891,99.8565
1665,1666,536,3240,4632,130.798,23.0825,66.9175,99.9188
1666,1667,2698,2991,4643,134.865,38.4736,51.5264,99.9731
1667,1668,1234,3068,4634,323.735,41.2221,48.7779,99.9821
1668,1669,2708,1939,4649,315.714,28.1169,61.8831,99.9575
1669,1670,4372,2753,4654,145.58700000000005,30.1675,59.8325,99.8247
1670,1671,1668,1646,4642,140.344,32.9652,57.0348,99.3391
1671,1672,2536,3335,4641,146.236,24.4291,65.5709,99.8771
1672,1673,1427,3448,4646,147.19,22.8914,67.1086,99.9115
1673,1674,1259,695,4640,130.292,48.5367,41.4633,99.9621
1674,1675,1874,2487,4652,57.6856,82.0585,7.94152,99.9655
1675,1676,1319,2835,4650,136.437,15.4423,74.5577,99.9728
1676,1677,2806,2595,4649,130.821,16.4216,73.5784,99.8359
1677,1678,942,1825,4646,328.956,53.5721,36.4279,99.9526
1678,1679,586,1863,4647,134.865,32.7175,57.2825,99.9825
1679,1680,631,2209,4652,336.298,67.2576,22.7424,99.8878
1680,1681,1369,2883,4667,336.397,53.316,36.684,99.9777
1681,1682,2931,3393,4669,331.13,3.88794,86.1121,99.6854
1682,1683,1718,3279,4671,318.937,24.7287,65.2713,99.79
1683,1684,790,2971,4678,134.817,50.2534,39.7466,99.9347
