,Grain No.,Size [Pixel],center x-coordinate,center y-coordinate,mean azimuth [degree],mean latitude [degree],mean colatitude [degree],Regelungsgrad [%]
0,1,23894,1225,261,132.849,21.2044,68.7956,99.8616
1,2,809,2540,181,298.409,58.6901,31.3099,99.8551
2,3,556778,2136,556,131.987,3.96286,86.0371,85.5135
3,4,533,2353,183,310.207,21.0756,68.9244,99.8598
4,5,5645,2481,231,317.225,56.0076,33.9924,99.8184
5,6,1421,369,218,311.082,28.5092,61.4908,99.9879
6,7,14991,244,251,310.773,4.02485,85.9752,99.9729
7,8,228900,1468,521,319.019,37.8701,52.1299,98.3766
8,9,4927,2377,273,310.105,24.6188,65.3812,99.946
9,10,26050,2696,289,313.212,15.2453,74.7547,99.882
10,11,108330,666,408,316.678,21.2593,68.7407,99.3648
11,12,1025,2914,237,319.97,62.3023,27.6977,99.858
12,13,971,1538,247,136.168,16.3545,73.6455,99.9377
13,14,2683,3119,290,318.824,30.341,59.659,99.1862
14,15,10837,2116,284,309.902,23.589,66.411,99.9874
15,16,2923,96,280,128.509,41.7826,48.2174,99.971
16,17,2091,409,289,124.301,51.9143,38.0857,99.971
17,18,595,799,258,285.318,11.9003,78.0997,99.618
18,19,2820,845,284,133.64600000000002,0.021965,89.978,99.586
19,20,7187,2891,302,33.9718,77.5022,12.4978,99.9096
20,21,9264,952,310,320.796,26.5167,63.4833,83.6886
21,22,61228,235,400,182.485,63.8778,26.1222,99.9772
22,23,2339,1534,292,130.579,23.2051,66.7949,99.9762
23,24,60432,1057,448,313.073,8.67137,81.3286,95.5666
24,25,1895,2254,292,124.22,48.4568,41.5432,99.993
25,26,43801,2992,421,315.644,14.0605,75.9395,99.9886
26,27,1358,2200,310,311.663,7.52225,82.4777,99.9803
27,28,12446,2380,368,310.58,7.772939999999998,82.2271,99.9909
28,29,913,3198,325,308.383,80.8762,9.12385,99.9136
29,30,1607,3058,334,135.755,34.6004,55.3996,99.98
30,31,1340,3263,335,304.588,80.4286,9.57136,99.9565
31,32,539,382,327,314.436,22.6438,67.3562,99.9947
32,33,990,866,351,136.351,41.2584,48.7416,99.9863
33,34,512,1256,347,128.007,51.3265,38.6735,99.9954
34,35,828,2216,352,129.536,32.2825,57.7175,99.991
35,36,3663,3306,379,285.815,63.5179,26.4821,99.8481
36,37,959,278,370,315.5440000000001,24.6238,65.3762,99.9865
37,38,2779,3213,376,286.967,60.6333,29.3667,99.8753
38,39,645,3175,377,285.316,61.1214,28.8786,99.971
39,40,1595,3161,417,288.218,61.0208,28.9792,99.9921
40,41,2102,3298,442,121.031,1.53735,88.4627,99.9356
41,42,13060,3102,518,299.557,78.5239,11.4761,99.3614
42,43,11959,1146,538,135.232,22.4294,67.5706,99.9907
43,44,4360,3325,534,303.123,0.878166,89.1218,99.9265
44,45,269895,684,782,116.99,20.0683,69.9317,96.7272
45,46,1479,363,510,335.9790000000001,73.1662,16.8338,99.8359
46,47,30735,174,590,131.233,22.3645,67.6355,99.9701
47,48,4023,2935,555,303.217,54.7771,35.2229,99.5781
48,49,22031,3154,649,307.916,1.3434,88.6566,99.832
49,50,4614,2861,576,315.021,74.3692,15.6308,99.8295
50,51,780,3222,616,299.015,1.70662,88.2934,99.9075
51,52,4628,2702,611,319.061,7.85429,82.1457,99.8856
52,53,3739,79,658,338.733,76.7403,13.2597,99.9472
53,54,19659,2203,776,136.841,40.3448,49.6552,99.97
54,55,2298,2799,613,304.398,50.917,39.083,99.9826
55,56,14007,1085,674,139.004,34.6899,55.3101,99.9054
56,57,882,3090,612,158.076,70.2448,19.7552,99.9799
57,58,4200,2924,626,150.93,73.5464,16.4536,99.963
58,59,887,3045,616,313.256,16.3514,73.6486,99.9956
59,60,6967,2528,653,319.133,14.3524,75.6476,99.9859
60,61,641,2585,629,355.2519999999999,72.5185,17.4815,99.9804
61,62,853,3001,627,323.686,73.6025,16.3975,99.9657
62,63,28802,2789,750,324.87,59.6172,30.3828,99.9837
63,64,9068,2627,687,127.858,32.2338,57.7662,99.9851
64,65,1047,350,655,344.338,71.4045,18.5955,99.9646
65,66,2865,3065,665,146.93200000000004,77.4451,12.5549,99.9846
66,67,901,118,659,129.525,29.5052,60.4948,99.9916
67,68,884,906,661,329.464,48.5033,41.4967,99.9884
68,69,14450,2974,717,297.548,27.7149,62.2851,99.8516
69,70,16039,365,716,145.119,80.579,9.42101,99.9751
70,71,55784,1648,782,145.488,26.9706,63.0294,99.9641
71,72,8412,2875,755,306.341,1.62129,88.3787,99.9829
72,73,5021,134,717,312.4790000000001,28.4057,61.5943,99.9278
73,74,2434,947,715,329.92800000000005,48.2905,41.7095,99.9874
74,75,38071,211,810,312.478,48.824,41.176,99.9952
75,76,9031,1028,768,131.093,39.6797,50.3203,99.9656
76,77,78364,3065,884,323.293,60.5094,29.4906,99.9251
77,78,2054,2555,745,310.934,20.1487,69.8513,99.9944
78,79,14169,1124,802,120.724,12.9149,77.0851,99.9836
79,80,30935,1214,884,133.35299999999998,40.2435,49.7565,99.9581
80,81,2175,1285,750,134.351,20.2931,69.7069,99.9981
81,82,35280,2638,858,315.341,8.20072,81.7993,99.9652
82,83,6206,2529,806,322.072,45.6256,44.3744,99.9722
83,84,19393,1388,825,306.7,53.109,36.891,99.976
84,85,1236,73,789,301.743,22.5926,67.4074,99.9392
85,86,89372,281,998,316.951,32.9952,57.0048,99.3532
86,87,8523,2438,857,319.283,13.9289,76.0711,99.9149
87,88,1719,2943,819,133.299,60.8055,29.1945,99.9655
88,89,2106,2893,873,306.182,1.44452,88.5555,99.9516
89,90,57818,1434,1022,137.615,41.4571,48.5429,99.9268
90,91,8182,94,942,131.075,38.2493,51.7507,99.9409
91,92,1482,2292,888,307.81,22.056,67.944,99.992
92,93,3346,1086,905,311.601,67.7684,22.2316,99.9912
93,94,13156,3231,961,132.702,10.5053,79.4947,99.7712
94,95,11842,2153,922,307.015,45.9721,44.0279,99.9509
95,96,5949,1304,921,121.147,15.2611,74.7389,99.9958
96,97,11963,1655,951,308.84,61.7454,28.2546,99.9838
97,98,2139,2261,918,319.339,20.3389,69.6611,99.9672
98,99,54353,2453,1093,304.317,84.4476,5.55238,99.3905
99,100,778,2824,904,291.608,81.0393,8.96068,99.9755
100,101,10446,996,959,132.648,39.743,50.257,99.819
101,102,717,570,928,320.538,24.2764,65.7236,99.8935
102,103,6954,2323,952,320.1040000000001,45.6808,44.3192,99.9885
103,104,3156,2717,948,136.86700000000002,55.3168,34.6832,99.9902
104,105,5137,2764,974,298.069,33.8626,56.1374,99.9772
105,106,44823,949,1123,304.867,2.09496,87.905,99.9306
106,107,144958,564,1257,311.928,1.57364,88.4264,46.4318
107,108,750,2957,944,278.896,76.8626,13.1374,99.9906
108,109,25082,2105,1039,118.351,18.7796,71.2204,99.9105
109,110,52510,1204,1144,318.666,17.9394,72.0606,99.2143
110,111,1071,3345,993,130.856,10.7904,79.2096,99.9614
111,112,238621,2921,1298,314.254,9.0774,80.9226,99.8411
112,113,25281,2648,1084,313.293,76.1903,13.8097,99.5883
113,114,24339,2304,1077,323.06,15.3279,74.6721,99.9406
114,115,1867,1155,999,120.926,13.3457,76.6543,98.5527
115,116,43378,2146,1239,140.27100000000002,44.0885,45.9115,99.7474
116,117,4503,3181,1046,130.026,32.8858,57.1142,99.8683
117,118,2396,1604,1029,317.965,9.59366,80.4063,99.97
118,119,1742,1138,1048,91.6779,78.9128,11.0871,99.9659
119,120,684,2776,1030,313.014,8.25632,81.7437,99.9862
120,121,1045,1672,1032,133.102,20.6852,69.3148,99.9875
121,122,7546,1798,1118,132.149,39.9721,50.0279,99.6409
122,123,21705,1649,1104,151.688,56.0752,33.9248,99.9632
123,124,7561,1279,1088,104.87,81.3667,8.63335,99.9695
124,125,4271,578,1087,318.637,21.3479,68.6521,99.9942
125,126,29584,3211,1250,122.993,26.5523,63.4477,99.8802
126,127,30245,2000,1183,131.25,25.0566,64.9434,99.954
127,128,14186,253,1160,319.096,69.7438,20.2562,99.9961
128,129,1245,73,1132,309.821,34.1593,55.8407,99.1385
129,130,1890,1520,1151,315.363,9.17562,80.8244,99.4559
130,131,2309,1298,1154,305.721,5.26284,84.7372,99.9911
131,132,3697,679,1146,311.796,4.453869999999998,85.5461,99.9692
132,133,4051,336,1185,330.834,47.6239,42.3761,99.9916
133,134,1591,1682,1181,130.715,27.0618,62.9382,99.9866
134,135,5521,1832,1196,297.202,62.7588,27.2412,99.9782
135,136,7809,1547,1213,302.72,29.3337,60.6663,99.9924
136,137,12320,2609,1207,141.438,18.7437,71.2563,99.9906
137,138,2162,1755,1194,130.286,27.1777,62.8223,99.9864
138,139,8456,1465,1243,311.43,7.6440899999999985,82.3559,92.8533
139,140,25244,205,1288,319.735,13.4073,76.5927,97.4372
140,141,1067,786,1194,311.398,3.90236,86.0976,99.9857
141,142,30017,1150,1300,134.421,7.32605,82.67399999999998,99.1283
142,143,72888,1702,1346,139.811,38.2744,51.7256,99.9912
143,144,73003,2392,1387,124.475,24.2904,65.7096,99.8885
144,145,643,841,1216,311.842,4.06622,85.9338,99.9928
145,146,682,1909,1253,95.0141,66.6942,23.3058,99.9516
146,147,1145,1217,1258,141.389,32.7423,57.2577,99.9839
147,148,6803,86,1315,113.346,60.2197,29.7803,99.9768
148,149,4557,1009,1293,126.311,25.0536,64.9464,99.7889
149,150,10830,2559,1336,307.428,46.4272,43.5728,99.9806
150,151,676,348,1294,139.122,19.8187,70.1813,99.9574
151,152,1139,671,1309,127.654,15.7131,74.2869,99.9948
152,153,10598,1473,1349,124.439,17.0643,72.9357,99.936
153,154,3568,2209,1336,326.414,78.7894,11.2106,99.9807
154,155,1553,1325,1325,136.727,2.72416,87.2758,99.984
155,156,598,1276,1319,319.14,23.038,66.962,99.9971
156,157,16239,1917,1387,290.576,70.7725,19.2275,99.9513
157,158,1892,955,1353,316.51,32.6142,57.3858,99.9823
158,159,2021,1267,1366,310.594,4.93082,85.0692,99.9887
159,160,639,605,1353,318.962,32.6064,57.3936,99.9617
160,161,2348,690,1356,317.753,35.4247,54.5753,99.9947
161,162,279423,986,1652,128.239,16.6275,73.3725,90.0195
162,163,7910,1313,1408,322.976,31.3621,58.6379,99.9903
163,164,1016,2638,1374,293.992,80.1042,9.89583,99.9743
164,165,13198,108,1444,319.74,29.4959,60.5041,99.9155
165,166,19343,2153,1434,119.993,65.5069,24.4931,99.9674
166,167,26032,553,1471,128.02,3.4608,86.5392,99.9353
167,168,16904,1399,1464,127.49,19.2993,70.7007,99.8928
168,169,10437,840,1423,310.045,0.787148,89.2129,99.9925
169,170,957,1227,1390,136.45600000000002,34.5146,55.4854,99.887
170,171,1043,168,1401,320.172,13.8385,76.1615,99.9878
171,172,8371,727,1428,130.858,8.27937,81.7206,99.9898
172,173,26092,1968,1505,130.256,33.2706,56.7294,99.8187
173,174,676,1466,1413,305.495,1.97452,88.0255,99.9793
174,175,3631,1507,1452,145.70600000000005,69.7455,20.2545,99.9833
175,176,634,1503,1414,305.4240000000001,2.7841400000000003,87.2159,99.9354
176,177,9952,302,1463,319.026,76.5813,13.4187,99.7374
177,178,3683,207,1436,114.094,60.7164,29.2836,99.9957
178,179,6648,2628,1452,139.013,15.2825,74.7175,99.9858
179,180,1755,2547,1436,126.209,13.0082,76.9918,99.9649
180,181,49140,1694,1621,305.998,1.34321,88.6568,99.9004
181,182,4467,1548,1491,126.356,24.3588,65.6412,99.959
182,183,13962,1614,1548,132.944,42.7495,47.2505,99.7194
183,184,1855,707,1482,311.951,2.89737,87.1026,99.9815
184,185,5281,210,1506,330.1280000000001,43.7818,46.2182,99.9701
185,186,516,2247,1477,78.9163,85.3642,4.6357800000000005,99.9758
186,187,12813,2187,1543,315.369,12.9234,77.0766,99.9354
187,188,18349,3120,1570,126.72,10.8676,79.1324,99.9457
188,189,719,770,1499,311.045,2.713,87.287,99.9742
189,190,916,1485,1509,305.5440000000001,1.04617,88.9538,99.871
190,191,1195,316,1520,320.944,41.31800000000001,48.682,99.9682
191,192,602,3338,1531,123.6,27.6416,62.3584,99.8872
192,193,593,50,1528,308.934,8.329419999999999,81.6706,99.9407
193,194,3936,2324,1536,52.5196,83.1746,6.82544,99.0388
194,195,30029,186,1617,128.78,20.2288,69.7712,99.9097
195,196,3124,2799,1548,136.53,57.6723,32.3277,99.6079
196,197,33622,2493,1666,315.939,64.7058,25.2942,99.2964
197,198,12082,2120,1605,311.615,1.87822,88.1218,99.9754
198,199,1233,66,1560,311.281,8.03951,81.9605,99.9529
199,200,10285,2955,1604,115.374,54.1377,35.8623,99.6858
200,201,7215,2685,1599,304.226,60.8257,29.1743,99.9264
201,202,46647,991,1724,306.944,8.6495,81.3505,99.8578
202,203,9215,1452,1595,140.494,6.66017,83.3398,99.9627
203,204,3786,1362,1582,321.813,27.7572,62.2428,99.9337
204,205,41752,2309,1675,130.821,34.9917,55.0083,99.9879
205,206,9088,2785,1619,138.461,15.643,74.357,99.9811
206,207,24317,1853,1674,121.493,26.7218,63.2782,99.9845
207,208,1659,2596,1602,128.208,13.0611,76.9389,99.5608
208,209,4630,792,1610,311.735,4.12236,85.8776,99.9953
209,210,1187,3235,1595,126.095,5.93411,84.0659,99.7716
210,211,1968,79,1609,133.82399999999998,36.834,53.166,99.9472
211,212,3464,3183,1613,124.117,27.693,62.307,99.9935
212,213,40096,2001,1818,307.166,24.6118,65.3882,97.1938
213,214,1594,289,1624,356.999,80.0021,9.99794,99.9836
214,215,923,2632,1623,293.007,68.6188,21.3812,99.9644
215,216,53231,3019,1747,305.075,31.9282,58.0718,99.8475
216,217,24353,391,1704,308.856,44.26,45.74,99.9874
217,218,12314,3222,1722,124.739,5.5960800000000015,84.4039,99.8982
218,219,48718,2711,1777,98.4606,67.1977,22.8023,99.901
219,220,4432,861,1715,125.162,60.131,29.869,99.7584
220,221,4593,1195,1696,349.335,73.4748,16.5252,99.9861
221,222,43983,2146,1818,123.089,1.6336700000000002,88.3663,99.9932
222,223,2144,2984,1705,125.997,9.11536,80.8846,99.9361
223,224,295215,472,2066,312.082,6.14838,83.8516,83.0462
224,225,9119,717,1770,306.29,11.9752,78.0248,99.9641
225,226,1117,816,1719,57.047,74.4693,15.5307,99.954
226,227,1130,1966,1720,304.698,16.592,73.408,99.9722
227,228,20408,1621,1809,131.66,4.5733,85.4267,99.993
228,229,65396,1222,1921,314.006,36.1483,53.8517,99.9762
229,230,1400,639,1752,56.4464,79.3595,10.6405,99.9972
230,231,1047,1960,1760,128.626,6.44524,83.5548,99.9932
231,232,10783,1767,1794,100.851,71.6947,18.3053,99.9681
232,233,1152,822,1767,304.436,9.28493,80.7151,99.9691
233,234,1547,1900,1778,305.938,42.7791,47.2209,99.9807
234,235,944,871,1777,309.952,10.7226,79.2774,99.9972
235,236,1460,2902,1797,127.717,42.2311,47.7689,99.9344
236,237,37114,851,1879,70.141,79.0784,10.9216,99.9385
237,238,4747,2381,1811,305.418,20.2837,69.7163,99.9963
238,239,8985,1925,1867,129.509,55.7884,34.2116,99.9619
239,240,4403,1858,1845,129.4,8.035160000000001,81.9648,99.9465
240,241,775,2221,1822,310.499,25.8145,64.1855,99.9845
241,242,3078,2502,1830,327.58,62.1711,27.8289,99.9739
242,243,65318,3208,2148,125.542,23.5147,66.4853,99.3065
243,244,25116,2961,1913,129.149,62.2642,27.7358,99.8961
244,245,2148,3152,1856,323.53,67.0992,22.9008,99.9912
245,246,4775,2576,1888,134.773,74.2323,15.7677,99.8728
246,247,136396,2568,2011,120.893,14.514,75.486,99.9011
247,248,18397,1847,1979,297.639,35.5099,54.4901,99.9195
248,249,323755,1554,2239,309.645,10.7201,79.2799,99.7291
249,250,2032,3113,1894,128.211,63.0375,26.9625,99.9867
250,251,835,3251,1896,125.326,42.6337,47.3663,99.9654
251,252,18546,947,2008,130.864,38.0891,51.9109,99.7859
252,253,5595,3095,1965,298.56,29.3812,60.6188,99.9913
253,254,1750,3266,1949,123.861,7.78268,82.2173,99.9122
254,255,18926,2100,2039,129.709,33.054,56.94600000000001,99.9268
255,256,12521,1081,1981,128.60299999999998,21.8359,68.1641,99.9692
256,257,34394,133,2054,310.733,20.5135,69.4865,99.9318
257,258,10724,2902,2013,123.282,46.9456,43.0544,99.657
258,259,1980,1912,1970,306.312,19.0231,70.9769,99.9852
259,260,5228,2578,2009,127.626,28.1807,61.8193,99.8704
260,261,27745,2289,2082,126.15,2.47803,87.522,99.9616
261,262,7374,842,2030,54.0511,77.4161,12.5839,99.6867
262,263,549,2082,2006,294.387,29.7348,60.2652,99.9728
263,264,31744,3033,2104,131.234,0.4739,89.5261,99.95
264,265,29372,1096,2123,310.574,10.2326,79.7674,99.995
265,266,18505,2022,2168,313.683,48.0677,41.9323,99.9745
266,267,6143,3154,2154,52.286,86.6235,3.37649,99.974
267,268,3326,260,2132,134.44,10.511,79.48899999999998,99.9918
268,269,11965,568,2162,314.095,24.7302,65.2698,99.9934
269,270,3461,2891,2138,24.071,86.1241,3.87591,99.9716
270,271,133287,1010,2341,305.636,36.758,53.242,99.228
271,272,84908,232,2350,130.942,36.4414,53.5586,99.8821
272,273,166824,2111,2382,124.558,36.6264,53.3736,99.507
273,274,1560,2116,2168,126.946,2.18079,87.8192,99.9857
274,275,64497,2745,2322,124.968,10.9004,79.0996,99.946
275,276,5489,2700,2205,130.576,52.6507,37.3493,99.954
276,277,3880,3121,2218,118.293,24.8525,65.1475,99.9727
277,278,970,2943,2197,125.713,25.6803,64.3197,99.9886
278,279,3486,2434,2206,315.2990000000001,56.104,33.896,99.8847
279,280,14651,2551,2287,318.045,57.0657,32.9343,99.9799
280,281,1045,2905,2208,155.799,88.8991,1.10092,99.9917
281,282,599,884,2223,231.503,85.8665,4.13354,99.983
282,283,145804,2866,2484,316.246,58.0126,31.9874,99.869
283,284,88479,2414,2434,132.764,49.6289,40.3711,97.8116
284,285,629,406,2244,137.491,4.4347900000000005,85.5652,99.5854
285,286,524,2934,2255,316.682,64.8656,25.1344,99.8583
286,287,1840,2611,2274,127.071,2.11829,87.8817,99.997
287,288,20973,734,2371,312.884,12.5262,77.4738,99.9919
288,289,23924,119,2460,126.925,0.452599,89.5474,99.9713
289,290,3906,1395,2346,74.7871,84.7094,5.29058,99.9895
290,291,1614,377,2406,121.101,51.9895,38.0105,99.9842
291,292,7591,375,2500,325.547,82.9512,7.04879,99.5827
292,293,1478,404,2443,126.093,35.6315,54.3685,99.9929
293,294,13466,1777,2486,142.811,73.758,16.242,99.7697
294,295,19685,548,2515,120.124,35.6227,54.3773,72.6809
295,296,508,1681,2485,257.177,89.421,0.5789529999999999,99.9754
296,297,3025,1078,2506,149.45,84.3967,5.60326,99.466
297,298,76313,1164,2651,131.075,20.71,69.29,99.8565
298,299,82276,3106,2695,318.692,4.01044,85.9896,99.9664
299,300,30736,1710,2601,124.654,17.1378,72.8622,98.0437
300,301,937,57,2532,314.156,42.2766,47.7234,99.9757
301,302,22049,2031,2604,135.523,52.3653,37.6347,99.8885
302,303,15816,762,2593,305.685,19.8544,70.1456,99.9737
303,304,59903,1871,2722,128.218,7.66595,82.334,99.9939
304,305,12239,889,2595,302.836,56.4505,33.5495,99.977
305,306,11976,595,2590,114.569,47.0042,42.9958,99.9738
306,307,14691,1562,2629,126.867,12.8273,77.1727,99.8917
307,308,208913,322,2952,296.056,49.9047,40.0953,82.4559
308,309,33385,471,2722,126.297,14.6532,75.3468,96.5148
309,310,1486,2323,2598,300.263,17.866,72.134,99.9911
310,311,562,2146,2592,133.57399999999998,3.86799,86.132,99.9845
311,312,14602,2380,2686,47.434,85.6276,4.37244,99.9364
312,313,64141,1451,2756,126.11,54.1112,35.8888,99.8326
313,314,101498,681,2868,127.626,28.1645,61.8355,99.0201
314,315,4256,2503,2644,62.6525,79.3627,10.6373,99.9831
315,316,510,3317,2627,297.203,15.8575,74.1425,99.8633
316,317,274526,2228,3057,125.314,14.9814,75.0186,88.5155
317,318,2453,958,2661,306.0370000000001,33.4795,56.5205,99.9543
318,319,12559,2610,2700,120.293,35.9365,54.0635,99.9769
319,320,3056,1457,2661,297.788,38.6386,51.3614,99.9291
320,321,6451,868,2702,301.478,33.3577,56.6423,99.9451
321,322,2521,757,2689,127.446,18.5257,71.4743,99.9938
322,323,248455,2949,3099,134.189,28.7699,61.2301,99.9172
323,324,872,2463,2702,299.422,20.7283,69.2717,99.9492
324,325,2038,2500,2716,126.21,0.487663,89.5123,99.9905
325,326,17681,1060,2763,311.795,10.0393,79.9607,99.9886
326,327,8311,922,2749,128.696,1.6215700000000002,88.3784,99.9596
327,328,1816,2545,2723,321.4,54.0557,35.9443,99.9719
328,329,3326,802,2734,123.92,8.0074,81.9926,99.9978
329,330,4833,157,2738,336.559,76.0286,13.9714,99.9773
330,331,736,2427,2730,297.6740000000001,21.2044,68.7956,99.9828
331,332,5160,2693,2773,131.213,54.2264,35.7736,99.9748
332,333,10644,2027,2827,311.721,58.1576,31.8424,99.9857
333,334,5118,2568,2783,121.632,52.9383,37.0617,99.9634
334,335,746,2479,2769,120.734,55.863,34.137,99.9885
335,336,5519,212,2803,301.064,70.0631,19.9369,99.9844
336,337,35101,900,2917,134.306,65.9694,24.0306,99.8217
337,338,602,2498,2801,318.709,54.4581,35.5419,99.9667
338,339,128422,1568,3005,129.92,24.3591,65.6409,99.9474
339,340,35992,1061,2940,125.763,0.6367189999999999,89.3633,99.9893
340,341,19118,2621,2884,127.924,29.3536,60.6464,99.9945
341,342,6987,235,2864,335.955,77.1222,12.8778,99.9838
342,343,32695,1214,2990,121.195,38.1597,51.8403,99.8022
343,344,161348,1795,3160,296.058,35.1686,54.8314,99.8569
344,345,90582,2683,3085,318.233,57.1415,32.8585,99.903
345,346,11981,94,2960,334.561,82.031,7.968960000000001,50.9188
346,347,2055,3195,2905,306.81,17.9596,72.0404,99.9842
347,348,3388,192,2916,126.365,45.4546,44.5454,99.9901
348,349,7105,3124,2933,308.8,22.7505,67.2495,99.9826
349,350,6799,1392,2938,304.886,14.2545,75.7455,99.9898
350,351,1836,2279,2958,132.132,41.9144,48.0856,99.9748
351,352,5477,1768,3019,134.906,2.84275,87.1572,99.9868
352,353,18476,1306,3109,295.607,24.3343,65.6657,99.9818
353,354,1122,2716,3016,120.304,2.87563,87.1244,99.9821
354,355,2127,987,3056,118.443,38.2476,51.7524,99.9923
355,356,1375,560,3056,115.713,54.3434,35.6566,99.9968
356,357,923,3312,3080,130.467,31.5288,58.4712,99.8955
357,358,3252,99,3122,118.216,41.0283,48.9717,99.7696
358,359,28093,1027,3157,131.79399999999998,56.3905,33.6095,98.3998
359,360,3819,1136,3112,121.103,21.8156,68.1844,99.9295
360,361,94382,635,3287,125.116,4.00127,85.9987,99.9242
361,362,588,365,3125,119.268,49.9145,40.0855,99.9957
362,363,599,874,3129,134.154,25.6929,64.3071,99.9941
363,364,18951,3221,3282,133.981,13.8336,76.1664,99.8975
364,365,5056,889,3192,124.345,16.2479,73.7521,99.9862
365,366,13098,169,3208,128.205,1.10371,88.8963,99.9816
366,367,15168,1234,3216,304.149,28.5742,61.4258,99.9897
367,368,16962,111,3341,127.628,40.7415,49.2585,99.755
368,369,1720,278,3183,123.462,44.6154,45.3846,99.936
369,370,4787,2460,3218,113.148,42.7938,47.2062,99.6416
370,371,17840,1388,3262,302.817,48.0632,41.9368,99.9895
371,372,1405,315,3204,130.9,5.81755,84.1824,99.9952
372,373,5053,278,3251,301.4240000000001,49.9935,40.0065,99.9318
373,374,16365,2330,3302,298.038,40.1636,49.8364,99.8198
374,375,135454,959,3507,132.31,29.5985,60.4015,90.109
375,376,5067,2616,3258,122.967,25.0402,64.9598,99.9797
376,377,11619,3131,3299,308.376,4.13183,85.8682,99.9959
377,378,1226,73,3278,127.144,42.1818,47.8182,99.9535
378,379,15625,2459,3315,130.306,3.4879300000000004,86.5121,98.7383
379,380,892,2496,3259,312.012,64.9476,25.0524,99.971
380,381,94578,1328,3457,299.281,35.4461,54.5539,99.8397
381,382,1102,817,3283,122.458,16.0325,73.9675,99.9892
382,383,21652,230,3364,132.392,49.6719,40.3281,99.9931
383,384,1594,2672,3286,129.912,34.826,55.174,99.9626
384,385,2184,2554,3305,303.555,67.6479,22.3521,99.9053
385,386,69066,294,3513,306.0,19.7513,70.2487,99.8085
386,387,909,2603,3314,309.026,9.18924,80.8108,99.9929
387,388,1322,840,3323,120.039,15.4727,74.5273,99.9921
388,389,4825,2614,3351,132.042,73.1037,16.8963,99.9679
389,390,10958,805,3391,300.935,4.59796,85.402,99.9916
390,391,235410,2016,3595,312.758,58.4933,31.5067,83.6948
391,392,21644,2679,3441,305.297,23.502,66.498,99.9946
392,393,1455,1146,3381,307.457,15.55,74.45,99.9945
393,394,730,2543,3371,303.403,38.3652,51.6348,99.9845
394,395,8435,2413,3418,130.589,18.5873,71.4127,99.985
395,396,1872,2506,3426,300.431,38.515,51.485,99.9438
396,397,11884,470,3459,75.3038,79.6883,10.3117,99.926
397,398,8590,2576,3485,136.39600000000002,73.4291,16.5709,99.8606
398,399,16079,1548,3502,136.838,35.8125,54.1875,99.8549
399,400,22560,2928,3499,294.825,74.2704,15.7296,99.6392
400,401,33779,745,3536,301.541,25.2495,64.7505,99.5842
401,402,1635,66,3467,312.946,61.5282,28.4718,99.9667
402,403,2837,3176,3469,315.645,71.2468,18.7532,99.9864
403,404,12685,3109,3514,125.744,21.168000000000006,68.832,99.9674
404,405,24481,2532,3556,119.309,47.8265,42.1735,99.2635
405,406,596,1084,3477,294.66,43.9494,46.0506,99.9896
406,407,12560,2741,3546,314.932,50.9019,39.0981,99.9111
407,408,2173,70,3522,127.454,16.0269,73.9731,99.8929
408,409,22867,547,3579,131.338,19.5623,70.4377,99.968
409,410,56846,1193,3660,136.515,36.5887,53.4113,99.9441
410,411,23466,3003,3633,306.6620000000001,36.2522,53.7478,99.9236
411,412,1112,2843,3563,128.57299999999998,80.22399999999998,9.77602,99.6963
412,413,10436,113,3633,306.63,49.5939,40.4061,99.9519
413,414,110024,2495,3743,317.232,24.4188,65.5812,99.9825
414,415,5825,3127,3601,314.766,71.8537,18.1463,99.9881
415,416,53139,2839,3735,119.273,75.2253,14.7747,99.8256
416,417,611,1604,3616,136.132,38.274,51.726000000000006,99.9925
417,418,1137,3180,3645,325.944,68.14399999999999,21.856,99.9206
418,419,15593,1606,3688,309.646,8.299660000000001,81.7003,99.9529
419,420,12514,491,3683,28.2227,83.4048,6.5952,99.9726
420,421,12645,374,3714,60.3941,81.8468,8.153189999999999,99.915
421,422,5300,1753,3659,307.2920000000001,78.248,11.752,99.9941
422,423,11625,3141,3712,124.193,15.1963,74.8037,99.9611
423,424,1068,1482,3655,306.802,43.1478,46.8522,99.9666
424,425,10720,616,3701,39.8969,83.0026,6.99737,99.9607
425,426,72238,208,3816,303.459,12.4754,77.5246,99.9849
426,427,4628,1252,3692,319.498,76.066,13.934,99.9879
427,428,17367,692,3757,313.582,16.7791,73.2209,99.9986
428,429,3585,1856,3699,134.708,26.1056,63.8944,99.9575
429,430,512,1902,3680,131.246,27.8314,62.1686,99.9382
430,431,43487,1394,3815,309.766,10.2619,79.7381,99.7847
431,432,8605,1681,3743,115.559,41.4308,48.5692,99.9576
432,433,1498,1794,3701,307.611,8.1802,81.8198,99.9975
433,434,3707,3093,3775,317.708,25.0224,64.9776,99.8558
434,435,781,3315,3734,316.723,26.7679,63.2321,99.942
435,436,795,1818,3731,310.902,55.0399,34.9601,99.9982
436,437,84156,1903,3916,313.007,9.42922,80.5708,99.9357
437,438,5093,1061,3758,308.322,7.730639999999998,82.2694,99.9981
438,439,8102,1540,3789,117.676,22.5072,67.4928,99.9898
439,440,6267,1273,3792,124.98,18.0244,71.9756,99.9875
440,441,28930,516,3827,299.8,27.2723,62.7277,99.9415
441,442,3189,3043,3782,339.38199999999995,72.5158,17.4842,99.9723
442,443,9462,2051,3805,117.166,39.4649,50.5351,99.9722
443,444,47913,764,3894,127.175,13.7282,76.2718,99.9567
444,445,10031,1098,3848,305.186,46.1157,43.8843,99.9437
445,446,140651,2514,3968,306.715,5.91208,84.0879,99.9366
446,447,2174,963,3841,132.06,37.109,52.89100000000001,99.9441
447,448,4873,3153,3835,311.841,4.34895,85.6511,99.9567
448,449,691,1616,3801,309.928,7.555630000000002,82.4444,99.7894
449,450,33226,3013,3921,306.11,3.93478,86.0652,99.9157
450,451,1844,1505,3842,125.615,31.0577,58.9423,99.9918
451,452,41231,1629,3931,311.368,55.5819,34.4181,99.8827
452,453,504,1035,3841,311.624,49.3371,40.6629,99.8948
453,454,3159,993,3882,303.971,79.1735,10.8265,99.9764
454,455,584,1738,3856,312.452,54.3792,35.6208,99.9813
455,456,22835,1226,3952,124.858,19.9227,70.0773,99.7859
456,457,1680,1264,3870,305.475,26.5316,63.4684,99.9862
457,458,13004,408,3911,126.68,15.5811,74.4189,99.9799
458,459,914,3172,3919,311.68,49.4966,40.5034,99.9261
459,460,3380,3312,3944,307.3,20.8792,69.1208,99.9363
460,461,1249,1048,3929,310.818,48.2985,41.7015,99.9667
461,462,172218,542,4160,307.6670000000001,19.8876,70.1124,72.4513
462,463,149622,1038,4178,302.9790000000001,9.6052,80.3948,99.7698
463,464,829,660,3949,299.547,28.6146,61.3854,99.9957
464,465,22184,1404,4014,310.651,58.1476,31.8524,99.7727
465,466,1241,1118,3963,304.365,45.7734,44.2266,99.9432
466,467,46843,199,4073,116.847,17.2886,72.7114,97.3817
467,468,774,3113,3961,303.462,14.5519,75.4481,99.9715
468,469,5300,3144,4024,150.69299999999996,71.297,18.703,99.4816
469,470,1200,3075,4002,304.646,15.5091,74.4909,99.9777
470,471,22247,3057,4118,113.398,79.7623,10.2377,97.6386
471,472,8228,2851,4059,322.6670000000001,71.7925,18.2075,99.3493
472,473,7549,1617,4057,300.003,31.528,58.472,99.0803
473,474,13326,2155,4082,325.404,58.1233,31.8767,99.951
474,475,504,3191,4025,305.74,21.3265,68.6735,99.9308
475,476,4337,1199,4056,5.54266,82.9413,7.05869,99.9565
476,477,1026,1710,4040,308.039,48.2572,41.7428,99.8993
477,478,6488,1504,4085,120.294,2.7146,87.2854,99.8639
478,479,14232,1932,4106,110.88,22.801,67.199,99.5191
479,480,2627,2585,4086,308.938,11.5065,78.4935,99.9443
480,481,25358,1806,4183,307.393,11.4733,78.5267,99.716
481,482,2119,1749,4087,125.565,41.6225,48.3775,99.9881
482,483,4018,1280,4105,295.498,47.9931,42.0069,99.5898
483,484,7192,1683,4131,112.775,11.5985,78.4015,99.9895
484,485,2474,2506,4093,118.319,5.03774,84.9623,99.9892
485,486,5494,2992,4110,305.184,14.2034,75.7966,99.9977
486,487,11602,2899,4158,125.714,15.4166,74.5834,99.9451
487,488,7425,1585,4143,309.813,48.8061,41.1939,99.7811
488,489,2022,2787,4121,124.509,15.29,74.71,99.97
489,490,69595,2402,4328,294.906,68.0526,21.9474,93.4616
490,491,226347,1427,4465,134.316,29.7715,60.2285,93.4207
491,492,697,3174,4112,314.481,44.6806,45.3194,99.94
492,493,1222,1196,4109,131.11,35.7825,54.2175,99.9969
493,494,77535,2759,4256,126.164,1.29459,88.7054,97.9283
494,495,549,620,4118,300.202,61.3627,28.6373,99.9911
495,496,1164,2530,4135,73.2857,77.4107,12.5893,99.9918
496,497,13697,2230,4192,288.3640000000001,72.3361,17.6639,99.9174
497,498,7419,3160,4184,156.003,73.8873,16.1127,99.9805
498,499,214988,2040,4483,303.755,0.25311300000000003,89.7469,56.298
499,500,589,2959,4156,329.296,56.9711,33.0289,99.9406
500,501,697,2527,4170,308.235,11.2027,78.7973,99.9378
501,502,1382,667,4188,119.468,23.1707,66.8293,99.9877
502,503,12559,936,4242,324.483,35.2115,54.7885,99.9822
503,504,1000,1534,4201,304.606,75.4309,14.5691,99.9895
504,505,19222,207,4301,309.656,45.7666,44.2334,99.3028
505,506,3973,2976,4227,329.415,57.4448,32.5552,99.9867
506,507,11437,106,4270,127.833,43.5418,46.4582,99.9763
507,508,5834,2535,4227,130.668,12.7786,77.2214,99.9769
508,509,16170,1674,4268,305.427,70.6446,19.3554,99.9845
509,510,1780,1598,4218,320.742,21.5033,68.4967,99.9893
510,511,2523,1558,4249,130.705,38.8591,51.1409,99.9917
511,512,28872,3104,4318,304.134,0.320328,89.6797,99.9733
512,513,22363,2262,4331,328.665,68.1577,21.8423,99.2085
513,514,5556,864,4296,119.032,14.2006,75.7994,99.9717
514,515,6841,2618,4308,310.177,35.1638,54.8362,99.9895
515,516,3924,1563,4318,298.553,52.4056,37.5944,99.9914
516,517,1552,711,4277,318.61,58.6568,31.3432,99.9922
517,518,11351,1750,4359,312.802,41.7144,48.2856,99.9872
518,519,17017,687,4371,127.62,46.3258,43.6742,99.9212
519,520,17381,814,4382,312.361,68.9794,21.0206,99.9747
520,521,5441,2686,4368,121.499,10.4987,79.5013,99.9773
521,522,183317,2596,4589,310.086,71.7696,18.2304,99.7898
522,523,67227,316,4504,308.575,52.4634,37.5366,98.2891
523,524,20937,145,4453,143.453,70.6833,19.3167,99.8961
524,525,6169,529,4404,126.523,29.7949,60.2051,99.9925
525,526,15356,2998,4473,325.223,48.7755,41.2245,99.9156
526,527,6537,3044,4412,312.905,30.3225,59.6775,99.9951
527,528,536,2914,4393,127.582,14.1178,75.8822,99.9726
528,529,7280,1676,4442,128.335,55.5707,34.4293,99.9844
529,530,567,3189,4411,282.261,87.7294,2.27064,99.981
530,531,7010,1773,4457,311.215,18.3178,71.6822,99.7892
531,532,22108,552,4555,334.409,69.1917,20.8083,82.9707
532,533,2051,3116,4438,124.185,16.0995,73.9005,99.9875
533,534,1357,2910,4443,131.151,2.0414,87.9586,99.9757
534,535,1779,2782,4441,169.507,78.3116,11.6884,99.9724
535,536,7915,3169,4488,98.7908,74.0625,15.9375,99.8942
536,537,15231,721,4500,134.941,30.8288,59.1712,99.9437
537,538,2440,1119,4469,126.67,9.58801,80.41199999999998,99.9926
538,539,1698,915,4463,120.828,13.3209,76.6791,99.9642
539,540,522,538,4471,127.754,33.7809,56.2191,99.9873
540,541,19768,923,4515,105.006,59.1703,30.8297,98.5783
541,542,12703,1801,4546,126.71,3.00656,86.9934,99.98
542,543,526,1138,4498,307.529,14.7432,75.2568,99.968
543,544,25735,3046,4613,357.706,85.8525,4.14751,99.6689
544,545,6182,1047,4566,318.161,54.0048,35.9952,99.9946
545,546,3499,1259,4559,357.36300000000006,76.5907,13.4093,99.9646
546,547,15979,662,4614,102.443,73.6218,16.3782,99.9776
547,548,1017,588,4562,126.865,37.3824,52.6176,99.9893
548,549,32694,831,4645,331.288,67.4519,22.5481,99.8996
549,550,36355,333,4669,123.157,22.6007,67.3993,99.9128
550,551,892,3177,4589,305.398,3.47106,86.5289,99.9662
551,552,25391,1182,4649,97.7301,60.8057,29.1943,99.9444
552,553,3598,2941,4619,319.772,43.8561,46.1439,99.9251
553,554,978,3310,4622,302.779,4.31647,85.6835,99.9246
554,555,3473,121,4633,127.746,34.0093,55.9907,99.9927
555,556,15460,1713,4656,301.018,26.2113,63.7887,99.9909
556,557,9052,3153,4667,305.563,4.397,85.603,99.9548
557,558,11101,1823,4688,138.04,56.0174,33.9826,99.9886
558,559,5338,502,4664,113.83,50.9054,39.0946,99.9127
559,560,7898,1090,4688,309.46,41.6478,48.3522,99.9833
560,561,1253,1001,4665,316.858,53.9844,36.0156,99.9684
561,562,2876,929,4672,97.708,77.2418,12.7582,99.9781
562,563,2355,1483,4683,103.191,49.2435,40.7565,99.9391
563,564,2261,2892,4686,315.644,1.1068,88.8932,99.0677
564,565,13815,953,4722,319.303,58.627,31.373,99.8526
565,566,4229,3067,4730,127.533,2.62653,87.3735,99.9623
566,567,5658,483,4731,121.2,4.29059,85.7094,99.682
567,568,2431,578,4719,104.828,73.1557,16.8443,99.9849
568,569,1827,639,4720,132.114,12.9571,77.0429,99.9946
569,570,2929,702,4738,121.477,31.7471,58.2529,99.9546
570,571,1028,2252,4735,113.093,26.842,63.158,99.9967
571,572,2994,3234,4737,309.33,19.6805,70.3195,99.9665
572,573,1091,3149,4740,352.30800000000005,85.9212,4.07878,99.9769
573,574,739,2942,4751,63.5008,87.2369,2.76315,99.8583
574,575,3063,2854,4764,319.728,47.26600000000001,42.734,99.4527
575,576,757,526,4757,138.74,46.922,43.078,99.7068
576,577,1240,561,4756,122.311,28.7981,61.2019,99.9015
577,578,710,1804,4755,300.041,27.4315,62.5685,99.9801
578,579,981,1853,4772,140.69299999999998,49.8897,40.1103,99.5686
