,Grain No.,Size [Pixel],center x-coordinate,center y-coordinate,mean azimuth [degree],mean latitude [degree],mean colatitude [degree],Regelungsgrad [%]
0,1,190305,600,400,354.391,35.0229,54.9771,92.1046
1,2,1004,3966,163,206.894,16.317999999999998,73.682,99.8964
2,3,576,3276,162,319.438,43.3801,46.6199,99.9955
3,4,1065,4878,161,175.572,11.8675,78.1325,99.0702
4,5,3875,4814,185,284.7,3.20194,86.7981,99.9547
5,6,6996,4235,203,267.498,31.8765,58.1235,99.9202
6,7,5767,702,185,242.899,30.8691,59.1309,94.881
7,8,3972,4411,195,292.755,35.3757,54.6243,99.9876
8,9,535,4937,174,325.319,16.7427,73.2573,99.9892
9,10,17455,792,270,310.414,30.8233,59.1767,99.7658
10,11,1979,3995,191,285.488,60.2115,29.7885,99.7832
11,12,23008,3655,251,349.11300000000006,32.4717,57.5283,99.8709
12,13,72385,3475,363,21.3675,48.5536,41.4464,44.6666
13,14,570,4723,177,327.53,33.645,56.355,99.9384
14,15,1771,4063,196,253.36,0.08376310000000001,89.9162,99.8937
15,16,9486,4357,249,49.8847,50.5338,39.4662,99.8829
16,17,29859,1895,268,79.7258,5.2,84.8,99.9111
17,18,1045,2198,197,333.093,26.3181,63.6819,99.8234
18,19,6405,4129,229,144.239,31.2717,58.7283,99.947
19,20,3086,3922,210,342.027,11.983,78.017,98.7881
20,21,11720,4711,225,173.079,16.9855,73.0145,99.9671
21,22,24602,4514,270,1.00568,35.7253,54.2747,99.3992
22,23,537,1268,186,296.0420000000001,54.027,35.973,99.9771
23,24,1118,4875,195,229.806,76.5526,13.4474,99.8906
24,25,6985,2881,231,216.04,60.7364,29.2636,99.9505
25,26,2335,1700,233,315.404,3.91946,86.0805,99.8565
26,27,36595,3831,303,6.1393,62.1447,27.8553,99.8334
27,28,586,1388,199,110.886,23.5943,66.4057,99.9824
28,29,43885,2964,349,43.7943,34.9387,55.0613,90.7163
29,30,688,1352,198,19.77,8.39229,81.6077,99.9478
30,31,8311,2057,251,227.567,16.9259,73.0741,99.9009
31,32,4518,679,242,63.1109,63.0144,26.9856,99.9067
32,33,661,3559,205,340.835,57.6702,32.3298,99.9485
33,34,44202,1177,304,9.75921,45.6211,44.3789,99.4309
34,35,4777,4951,263,198.83900000000003,65.3742,24.6258,99.9567
35,36,2905,439,229,247.808,40.2169,49.7831,99.9884
36,37,61324,1524,352,260.568,85.8135,4.18652,66.8632
37,38,27639,2420,270,352.21,25.5495,64.4505,99.5844
38,39,3904,2743,234,278.61,60.3668,29.6332,99.8332
39,40,923,729,216,337.014,67.0368,22.9632,99.9511
40,41,14816,3291,302,8.83245,68.0891,21.9109,99.955
41,42,1286,4892,232,168.58900000000003,15.2489,74.7511,99.9613
42,43,11297,1406,263,228.168,73.4649,16.5351,99.9683
43,44,579,3194,235,104.516,48.4047,41.5953,99.9878
44,45,5077,2150,252,335.341,63.3381,26.6619,99.8777
45,46,4299,4001,249,195.007,4.00844,85.9916,99.9786
46,47,586,4066,238,74.1183,0.5683520000000001,89.4316,99.9327
47,48,24073,233,372,158.447,8.293510000000001,81.7065,99.9139
48,49,8413,960,286,60.7892,64.6134,25.3866,99.9661
49,50,688,1050,249,65.1617,64.8967,25.1033,99.9329
50,51,13853,3210,328,61.8769,24.6487,65.3513,99.8497
51,52,19970,4267,322,174.118,63.9891,26.011,99.9731
52,53,2965,864,282,183.577,17.7243,72.2757,99.9358
53,54,4734,4806,283,294.9770000000001,59.7546,30.2454,99.95
54,55,8577,4880,326,122.645,37.9073,52.0927,99.9788
55,56,5930,1766,301,112.712,27.239,62.761,99.9361
56,57,686,2195,279,96.9825,40.8014,49.1986,99.9317
57,58,9765,2820,326,244.883,68.9982,21.0018,99.9892
58,59,7373,4693,326,283.171,1.19753,88.8025,99.9645
59,60,641,4649,291,350.3930000000001,8.19539,81.8046,99.9939
60,61,15277,2743,377,351.7940000000001,10.598,79.402,99.9913
61,62,2951,4131,304,144.809,29.7815,60.2185,99.9883
62,63,4709,3106,313,124.736,59.3421,30.6579,99.9937
63,64,6611,4072,342,340.91,50.166,39.834,99.9118
64,65,40418,2188,388,251.037,63.1598,26.8402,99.9641
65,66,542,2558,298,349.287,15.3373,74.6627,99.9865
66,67,4608,1331,342,138.378,45.0219,44.9781,99.9811
67,68,11556,2359,363,230.645,61.5498,28.4502,99.9577
68,69,11252,3982,374,105.892,28.7068,61.2932,99.6337
69,70,9667,2644,397,349.398,15.8197,74.1803,99.853
70,71,3423,4593,344,284.682,1.08334,88.9167,99.9899
71,72,1775,1850,330,188.006,9.27365,80.7263,99.9829
72,73,13143,2508,395,352.23,13.4566,76.5434,99.6192
73,74,7558,3132,376,235.945,43.3847,46.6153,99.9758
74,75,33834,1991,468,59.1556,12.9503,77.0497,91.1339
75,76,2015,4762,343,183.992,69.4848,20.5152,99.9872
76,77,1770,4808,351,243.681,31.2356,58.7644,99.9917
77,78,9119,3369,404,321.501,71.5188,18.4812,99.9701
78,79,1652,4955,363,93.6566,44.0178,45.9822,99.9898
79,80,5643,4521,371,31.5018,33.0563,56.9437,99.9582
80,81,503,3038,342,130.001,57.7075,32.2925,99.9926
81,82,15679,1803,411,130.63,34.2333,55.7667,99.9839
82,83,9478,1682,412,255.557,81.24600000000002,8.753960000000001,99.9768
83,84,4237,820,383,49.9788,60.4844,29.5156,99.9665
84,85,37196,4331,491,278.895,61.4214,28.5786,99.7654
85,86,4698,3046,392,264.1,59.0017,30.9983,99.9955
86,87,1172,1885,373,352.875,38.9512,51.0488,99.9958
87,88,1439,3656,376,274.686,16.4617,73.5383,99.9908
88,89,16851,4127,431,162.768,69.3843,20.6157,99.9758
89,90,6799,4647,402,345.55,45.6097,44.3903,99.9862
90,91,1585,3779,383,270.35200000000003,16.8102,73.1898,99.9912
91,92,690,4922,376,200.56,72.587,17.413,99.9865
92,93,5898,4224,427,162.335,69.3773,20.6227,99.9864
93,94,3751,4765,399,188.527,13.8345,76.1655,99.958
94,95,1235,4842,398,271.758,81.0508,8.9492,99.99
95,96,43025,3760,503,290.568,78.092,11.908,99.5061
96,97,10284,4510,437,49.9827,43.4905,46.5095,99.9433
97,98,34726,1324,500,339.497,26.3943,63.6057,99.8834
98,99,1517,2275,405,85.6711,21.6272,68.3728,99.9966
99,100,10316,1146,436,52.3555,65.0786,24.9214,99.9863
100,101,780,1056,408,207.098,31.7409,58.2591,99.9919
101,102,6031,2427,447,80.7326,52.7273,37.2727,99.9355
102,103,12615,3191,468,115.755,64.4863,25.5137,99.7956
103,104,740,2832,422,26.9423,14.5993,75.4007,99.9843
104,105,931,4889,430,185.985,11.4461,78.5539,99.9839
105,106,1554,4923,441,189.084,18.2804,71.7196,99.9482
106,107,16783,1579,514,93.6099,32.431999999999995,57.56800000000001,95.5122
107,108,928,3087,440,155.542,57.5103,32.4897,99.9956
108,109,8069,4760,471,137.746,65.0815,24.9185,99.9916
109,110,947,4682,454,106.351,35.9139,54.0861,99.9145
110,111,1528,2846,463,10.0138,5.56462,84.4354,99.9914
111,112,9201,2371,494,277.696,56.0531,33.9469,99.957
112,113,26627,2605,542,77.0072,41.5232,48.4768,99.5164
113,114,1481,3284,467,288.975,33.2828,56.7172,99.9905
114,115,20270,312,570,142.656,40.7429,49.2571,99.6313
115,116,19730,3068,523,53.3083,39.1313,50.8687,99.9461
116,117,24117,4682,536,194.097,58.9349,31.0651,99.9047
117,118,1227,3975,459,129.433,60.0943,29.9057,99.9362
118,119,1166,2820,474,13.3856,8.103660000000001,81.8963,99.9907
119,120,10232,4877,514,92.8669,44.1534,45.8466,99.919
120,121,1563,1075,483,212.005,34.7257,55.2743,99.9698
121,122,3310,1874,502,329.896,35.9934,54.0066,99.383
122,123,6475,4440,528,255.253,45.2024,44.7976,99.9427
123,124,13632,1727,523,320.0440000000001,52.2354,37.7646,99.9704
124,125,21211,4075,552,305.511,65.4629,24.5371,73.0188
125,126,1597,2212,500,25.2392,59.563,30.437,99.992
126,127,3640,3806,506,174.25099999999995,63.2807,26.7193,99.9961
127,128,2251,4950,521,90.8913,44.7296,45.2704,99.959
128,129,11758,3275,540,252.656,58.1752,31.8248,99.7003
129,130,2355,1177,502,339.918,13.5514,76.4486,99.9574
130,131,3128,2155,514,275.23900000000003,62.0535,27.9465,99.9266
131,132,566,2885,498,26.5481,15.3827,74.6173,99.9954
132,133,7886,1013,537,198.537,31.0903,58.9097,99.6208
133,134,5127,1106,538,143.94799999999995,75.9999,14.0001,99.5995
134,135,6816,3900,530,35.7507,75.7345,14.2655,99.837
135,136,2690,2872,541,12.7124,5.20646,84.7935,99.7253
136,137,3261,2083,535,103.141,72.7566,17.2434,99.3664
137,138,1586,4502,523,289.783,2.10897,87.891,99.8181
138,139,2375,2198,539,258.391,43.8576,46.1424,99.9393
139,140,6908,2757,541,95.4901,82.4511,7.548939999999999,99.0601
140,141,1025,2479,527,283.428,83.6845,6.31553,99.5245
141,142,1127,2828,541,13.3427,5.72403,84.27600000000002,99.8264
142,143,692,4205,536,278.663,61.7336,28.2664,99.9911
143,144,2508,1197,548,137.936,33.1122,56.8878,99.997
144,145,49873,2325,624,320.383,61.0115,28.9885,99.8767
145,146,49500,1772,662,94.735,55.3931,34.6069,99.8969
146,147,1994,3954,557,40.0758,75.5828,14.4172,99.3965
147,148,3826,4551,573,87.4665,64.8035,25.1965,99.1211
148,149,4429,249,579,137.526,75.5661,14.4339,99.9912
149,150,3379,3384,562,254.44,57.5113,32.4887,99.7059
150,151,3322,628,574,283.898,34.6479,55.3521,99.994
151,152,20717,885,670,155.989,70.0941,19.9059,99.9286
152,153,10218,3662,577,334.727,78.3871,11.6129,99.0167
153,154,811,1618,564,115.992,0.27375,89.7262,99.9849
154,155,4413,2923,583,83.4092,84.8844,5.11563,99.9941
155,156,5998,787,603,216.957,35.5054,54.4946,99.9895
156,157,4610,4494,607,11.695,84.6606,5.33944,99.6369
157,158,16148,2054,664,272.528,48.5821,41.4179,99.8994
158,159,1552,183,576,281.98,66.2605,23.7395,99.9157
159,160,12944,4180,637,286.848,35.6564,54.3436,99.9399
160,161,841,3454,572,258.422,58.8751,31.1249,99.9634
161,162,11650,1276,617,113.439,46.3325,43.6675,99.847
162,163,4025,948,596,133.366,54.1501,35.8499,99.9942
163,164,989,4853,590,232.163,79.8925,10.1075,99.2244
164,165,12638,3391,634,84.7512,66.8257,23.1743,99.9793
165,166,31742,2800,703,298.791,1.33514,88.6649,99.9911
166,167,13242,1942,650,352.6980000000001,38.9235,51.0765,99.9822
167,168,8509,3543,620,3.1299,79.9647,10.0353,99.9925
168,169,9800,1078,622,307.3540000000001,19.5574,70.4426,99.9931
169,170,21283,422,674,100.351,27.4789,62.5211,99.9531
170,171,4799,1524,613,229.581,49.0549,40.9451,99.9909
171,172,23683,4346,672,169.02700000000004,33.7455,56.2545,99.9921
172,173,703,303,594,132.168,72.9142,17.0858,99.9942
173,174,4995,4918,622,348.718,64.4576,25.5424,99.9651
174,175,3166,3887,601,323.563,43.9577,46.0423,99.9954
175,176,29758,4635,684,9.98914,39.4925,50.5075,99.8631
176,177,89293,4009,894,173.452,42.3473,47.6527,90.6982
177,178,59413,3112,676,100.085,85.3739,4.62607,99.8494
178,179,23339,609,660,242.063,43.076,46.924,99.9517
179,180,1324,3466,604,84.4034,65.4301,24.5699,99.9956
180,181,93839,2536,822,177.558,33.242,56.758,83.3138
181,182,3255,2726,622,309.527,84.7614,5.23864,99.9916
182,183,8155,1434,660,1.6933900000000002,73.7229,16.2771,99.9853
183,184,1311,4837,634,190.691,54.7413,35.2587,99.9355
184,185,2691,247,635,151.355,42.645,47.355,99.9959
185,186,4859,3889,641,51.1375,39.8149,50.1851,99.7971
186,187,2313,1154,645,135.517,53.5665,36.4335,99.9721
187,188,3662,988,656,297.768,21.6827,68.3173,99.8168
188,189,14520,4765,698,74.3831,41.2846,48.7154,99.9752
189,190,1428,2667,643,258.30400000000003,50.0511,39.9489,99.9927
190,191,589,1591,639,308.605,49.9566,40.0434,99.9095
191,192,13813,771,709,71.5599,71.0142,18.9858,99.9623
192,193,4751,4473,672,96.9466,40.7014,49.2986,99.736
193,194,42139,3597,767,1.45636,28.5494,61.4506,99.9071
194,195,3853,196,696,194.646,14.0707,75.9293,99.9313
195,196,1075,1526,661,6.15685,73.9965,16.0035,99.9913
196,197,23309,4866,767,243.077,75.78,14.22,99.9254
197,198,8467,1222,695,131.196,80.0189,9.98113,99.9872
198,199,7170,1360,711,128.445,70.2636,19.7364,99.9648
199,200,9379,4957,764,241.617,75.8627,14.1373,99.8628
200,201,27180,3867,750,258.232,0.23053,89.7695,99.9648
201,202,3179,246,709,194.239,13.7914,76.2086,99.9972
202,203,650,4218,684,272.16,50.515,39.485,99.9932
203,204,7671,1593,714,266.194,76.6733,13.3267,99.9824
204,205,9578,1076,716,170.72099999999998,69.1908,20.8092,99.9858
205,206,3145,4128,732,264.34,73.5169,16.4831,99.9837
206,207,1484,3722,700,309.639,62.8262,27.1738,99.997
207,208,20793,1482,783,96.6061,54.119,35.881,91.1467
208,209,15958,3395,750,297.685,53.5019,36.4981,99.9834
209,210,12273,2259,744,339.385,53.3864,36.6136,99.9977
210,211,2894,3746,734,51.2719,37.8671,52.1329,99.9948
211,212,6410,4431,742,175.62099999999995,56.8283,33.1717,99.9812
212,213,1808,980,735,55.88,63.9551,26.0449,99.9473
213,214,57714,2024,883,297.4890000000001,58.3379,31.6621,99.6801
214,215,538,2485,718,307.256,18.8939,71.1061,99.9231
215,216,1221,1300,727,136.657,52.5829,37.4171,99.9962
216,217,13488,4240,776,130.938,59.6486,30.3514,99.9724
217,218,566,4531,733,317.15,79.2434,10.7566,99.9288
218,219,26818,549,812,110.808,52.5398,37.4602,99.8029
219,220,28963,2940,856,50.9132,38.0715,51.9285,99.937
220,221,6432,262,811,145.616,8.82627,81.1737,99.9637
221,222,73333,1300,917,68.6987,17.0638,72.9362,99.9262
222,223,12996,331,805,288.997,29.7439,60.2561,99.9884
223,224,2783,3682,756,337.917,80.3881,9.61187,99.9898
224,225,2051,2369,748,124.367,73.9669,16.0331,99.9872
225,226,800,1964,749,114.277,60.0445,29.9555,99.9884
226,227,1744,1260,756,112.042,5.49891,84.5011,99.9949
227,228,14438,697,814,178.046,42.7402,47.2598,99.9731
228,229,7111,1897,776,204.478,54.3222,35.6778,99.9888
229,230,39789,1605,932,290.756,15.2645,74.7355,99.9296
230,231,29575,3182,829,13.6917,81.986,8.01396,99.9231
231,232,6932,1323,801,43.9085,73.5365,16.4635,99.9872
232,233,13834,4470,848,315.847,39.3504,50.6496,77.0718
233,234,14014,4382,822,142.467,1.7845099999999998,88.2155,99.9908
234,235,26931,1011,841,272.021,48.0455,41.9545,99.5879
235,236,756,186,774,300.995,30.1326,59.8674,99.8971
236,237,3153,437,783,174.421,58.9225,31.0775,99.9972
237,238,581,959,776,287.623,34.3726,55.6274,99.9772
238,239,7621,3314,838,298.829,65.7756,24.2244,99.9878
239,240,7843,2307,816,273.869,70.3224,19.6776,99.9815
240,241,9594,4157,831,225.91,80.5042,9.49579,99.9555
241,242,5629,829,806,144.596,27.0046,62.9954,99.9362
242,243,2740,4744,803,337.066,60.2598,29.7402,99.9935
243,244,63761,3733,1001,267.811,50.2722,39.7278,99.7701
244,245,11305,1725,842,240.317,49.9171,40.0829,99.9944
245,246,2351,1256,811,166.24,70.8821,19.1179,99.9925
246,247,20075,2776,891,90.0803,52.5447,37.4553,99.923
247,248,4940,201,834,143.365,8.77229,81.2277,99.9586
248,249,15008,4669,853,138.601,13.7304,76.2696,99.9856
249,250,23177,1830,896,74.426,36.0082,53.9918,99.9616
250,251,29169,3440,904,155.296,16.1499,73.8501,99.9759
251,252,6642,379,883,105.035,9.81831,80.1817,99.9466
252,253,45936,2205,999,186.548,21.7457,68.2543,59.7302
253,254,20857,3091,927,240.979,70.3463,19.6537,99.9457
254,255,12039,835,890,125.851,55.5332,34.4668,99.9708
255,256,3472,4546,866,2.20867,34.4913,55.5087,99.9959
256,257,7543,4812,880,187.99400000000003,39.7129,50.2871,99.9724
257,258,16701,4250,927,351.6869999999999,45.0242,44.9758,99.993
258,259,1389,1345,884,148.464,83.9579,6.04212,99.9905
259,260,6743,2311,911,182.671,56.0576,33.9424,99.9959
260,261,17772,228,956,125.526,10.7192,79.2808,99.9582
261,262,4702,588,914,303.426,82.162,7.8379699999999985,99.9827
262,263,10149,4955,974,332.88199999999995,52.719,37.281,99.9535
263,264,37998,4513,978,47.3179,53.9009,36.0991,99.9494
264,265,4842,684,926,303.937,51.1101,38.8899,99.9925
265,266,9536,1093,954,216.37,67.4218,22.5782,99.9868
266,267,7358,784,953,115.621,50.1006,39.8994,99.9628
267,268,25328,411,987,247.904,50.7835,39.2165,99.7751
268,269,7944,3602,948,263.147,70.3271,19.6729,99.9673
269,270,6551,4348,958,185.178,51.6382,38.3618,99.9883
270,271,6506,4722,958,229.035,71.8189,18.1811,99.9536
271,272,503,1966,923,74.0842,35.1203,54.8797,99.9286
272,273,17422,4842,988,73.8068,5.56059,84.4394,99.9936
273,274,33299,3422,1025,352.523,5.236269999999998,84.7637,98.4961
274,275,4038,3863,961,82.9223,41.5093,48.4907,99.967
275,276,1232,975,941,144.968,28.1221,61.8779,99.9803
276,277,1134,2039,957,342.0730000000001,25.854,64.146,99.9003
277,278,18223,626,998,39.2392,72.4682,17.5318,79.3982
278,279,3269,3199,970,156.37,53.9919,36.0081,99.9948
279,280,22854,837,1046,87.189,74.2096,15.7904,99.2017
280,281,2532,303,977,152.623,1.72575,88.2742,99.9327
281,282,1177,2351,969,259.675,57.9385,32.0615,99.9802
282,283,14130,2771,1014,268.089,59.2153,30.7847,99.679
283,284,6150,2656,1002,130.634,38.2521,51.7479,99.958
284,285,19435,2987,1041,307.586,43.732,46.268,99.781
285,286,9060,1438,1035,358.897,30.1605,59.8395,99.9627
286,287,23527,1726,1049,308.863,64.4356,25.5644,99.5288
287,288,56611,1044,1118,345.216,18.5276,71.4724,79.3164
288,289,72044,4200,1155,70.6111,53.5021,36.4979,99.5241
289,290,977,1040,992,215.282,65.9602,24.0398,99.969
290,291,9922,2859,1074,307.814,44.9226,45.0774,99.9446
291,292,9483,2358,1059,311.704,22.3012,67.6988,99.9683
292,293,3267,2581,1034,218.739,11.9758,78.0242,99.9835
293,294,9083,483,1064,283.914,54.3116,35.6884,99.7073
294,295,27689,2447,1115,103.692,35.1405,54.8595,99.6104
295,296,14130,3164,1058,128.006,74.9648,15.0352,98.3719
296,297,15533,4603,1091,357.716,27.5339,62.4661,99.9848
297,298,15087,4694,1118,335.0619999999999,23.2295,66.7705,99.9738
298,299,7779,186,1096,172.139,76.8046,13.1954,99.845
299,300,47756,2008,1189,248.6,59.9827,30.0173,99.7641
300,301,1014,4079,1042,329.48800000000006,30.8141,59.1859,99.9578
301,302,625,1505,1054,33.4573,69.8566,20.1434,99.9931
302,303,9708,696,1108,318.596,59.769,30.231,99.9954
303,304,1842,1192,1072,229.853,76.815,13.185,99.9704
304,305,15535,2690,1107,332.499,78.2732,11.7268,99.9303
305,306,43484,4858,1165,248.94,17.1359,72.8641,99.9737
306,307,1296,4359,1071,251.14,59.0732,30.9268,99.6065
307,308,1502,1246,1075,119.84,66.1077,23.8923,99.9867
308,309,9215,257,1124,172.616,73.8621,16.1379,99.9906
309,310,595,2916,1079,350.972,78.2313,11.7687,99.9889
310,311,11982,1867,1113,286.505,18.806,71.194,99.9818
311,312,4163,4460,1101,10.2157,79.5814,10.4186,99.8182
312,313,6447,1428,1124,342.209,56.605,33.395,99.9647
313,314,1019,545,1101,49.982,33.6152,56.3848,99.9932
314,315,1650,1514,1106,286.103,41.7687,48.2313,99.9922
315,316,3359,2572,1120,17.082,54.3354,35.6646,99.9922
316,317,871,383,1099,274.923,57.8603,32.1397,99.9901
317,318,9212,3441,1135,282.164,14.5371,75.4629,99.4013
318,319,2570,2963,1126,217.158,2.20795,87.7921,99.9968
319,320,3903,591,1133,96.2865,72.2849,17.7151,99.9858
320,321,10210,3102,1144,100.476,22.3467,67.6533,99.9653
321,322,2193,1204,1123,288.142,31.3309,58.6691,99.9731
322,323,7708,1570,1158,138.37,82.9329,7.067080000000002,99.9342
323,324,12563,3292,1156,160.624,17.214000000000002,72.786,99.9917
324,325,18123,4493,1183,43.9383,51.9067,38.0933,99.928
325,326,9967,1273,1162,40.2356,29.8798,60.1202,99.9958
326,327,1690,1738,1125,121.356,75.3508,14.6492,99.9852
327,328,9689,3688,1178,119.519,56.07,33.93,99.9556
328,329,2083,422,1129,154.545,74.8486,15.1514,99.9676
329,330,877,1329,1122,310.148,60.3588,29.6412,99.9927
330,331,3346,2919,1148,79.5829,65.3709,24.6291,99.9805
331,332,8256,3854,1165,32.1892,43.8408,46.1592,99.9967
332,333,2706,3211,1143,94.8824,84.6703,5.32965,99.94
333,334,7103,2256,1176,155.976,2.1694,87.8306,99.9924
334,335,1325,3759,1153,204.96,47.9046,42.0954,99.9912
335,336,7284,323,1172,183.749,81.309,8.69102,99.9824
336,337,3919,896,1169,160.981,17.3221,72.6779,99.9605
337,338,3798,1645,1156,341.735,67.4802,22.5198,99.9929
338,339,18574,1784,1206,55.5029,59.7469,30.2531,99.9686
339,340,19488,531,1200,132.328,68.8817,21.1183,99.708
340,341,19327,1549,1249,348.1330000000001,10.6938,79.3062,99.8393
341,342,14457,2808,1191,298.361,73.1044,16.8956,99.9537
342,343,755,3981,1146,326.8520000000001,30.2773,59.7227,99.939
343,344,2347,2162,1169,119.62,28.9347,61.0653,99.9765
344,345,936,387,1164,163.98,79.5015,10.4985,99.9862
345,346,5679,1181,1191,119.735,67.0243,22.9757,99.9438
346,347,6704,796,1199,98.5563,75.6385,14.3615,99.9674
347,348,4521,1393,1196,68.4214,63.2275,26.7725,99.986
348,349,38424,3994,1282,237.525,57.8278,32.1722,95.1035
349,350,29299,2599,1245,108.073,7.7996,82.2004,99.9645
350,351,822,690,1173,99.168,73.0431,16.9569,99.9957
351,352,1503,196,1198,156.22799999999995,78.5185,11.4815,99.9501
352,353,21014,3293,1261,175.797,47.6447,42.3553,99.9916
353,354,7289,2958,1221,253.242,60.0849,29.9151,99.7526
354,355,5486,3453,1217,281.829,14.3712,75.6288,99.5682
355,356,1644,3513,1186,177.66400000000004,44.8737,45.1263,99.6765
356,357,1738,3126,1193,176.78,47.9552,42.0448,99.9872
357,358,6683,3154,1237,192.643,59.2814,30.7186,99.9855
358,359,5141,3754,1236,78.1348,13.6612,76.3388,99.9945
359,360,5512,2115,1232,199.431,44.0073,45.9927,99.997
360,361,1660,1620,1208,254.145,73.2891,16.7109,99.9865
361,362,3134,3583,1220,287.263,27.3013,62.6987,99.968
362,363,58840,379,1353,125.237,24.6469,65.3531,99.9505
363,364,19483,4352,1292,63.6615,10.9396,79.0604,99.993
364,365,85266,750,1354,221.958,77.6669,12.3331,99.8471
365,366,55294,1397,1362,95.6197,46.6471,43.3529,99.5725
366,367,5707,4287,1251,316.456,42.0388,47.9612,99.9942
367,368,872,2309,1216,257.409,43.4487,46.5513,99.9959
368,369,945,936,1218,243.347,84.6686,5.33144,99.9686
369,370,2187,247,1232,329.524,46.8821,43.1179,99.9863
370,371,19125,4613,1309,149.431,22.5461,67.4539,99.9939
371,372,2973,2199,1239,119.391,26.9656,63.0344,99.9925
372,373,18892,2382,1265,130.71200000000002,73.7078,16.2922,99.933
373,374,696,2716,1225,86.1189,67.0462,22.9538,99.9929
374,375,12666,4724,1269,127.15,77.3085,12.6915,99.9851
375,376,1804,1660,1232,314.784,13.6826,76.3174,99.9982
376,377,3290,886,1238,309.825,47.0989,42.9011,99.9911
377,378,2277,1130,1239,303.454,35.7516,54.2484,99.9941
378,379,2343,1715,1235,328.157,61.4996,28.5004,99.9946
379,380,6803,3032,1255,268.718,7.14847,82.8515,99.6869
380,381,5935,4458,1273,348.31,38.2467,51.7533,99.9877
381,382,936,197,1248,332.351,48.1847,41.8153,99.9174
382,383,3518,2503,1303,292.921,78.1223,11.8777,99.9793
383,384,1365,2744,1253,308.832,3.77995,86.22,99.9759
384,385,1427,4958,1262,124.458,69.3299,20.6701,99.9766
385,386,5839,3646,1266,205.911,10.2799,79.7201,99.9905
386,387,2883,1194,1260,348.44699999999995,49.3473,40.6527,99.9966
387,388,1597,963,1266,147.062,43.6619,46.3381,99.9866
388,389,855,2871,1266,234.83,39.9767,50.0233,99.9903
389,390,6483,3539,1301,34.4691,45.6374,44.3626,99.9856
390,391,17640,2812,1332,51.7706,80.1824,9.81759,99.9527
391,392,6666,3443,1298,153.533,44.149,45.851000000000006,99.9656
392,393,696,2148,1273,101.592,9.46523,80.5348,99.9421
393,394,610,1743,1272,141.475,71.3886,18.6114,99.9868
394,395,5495,3096,1309,64.0424,73.02,16.98,99.947
395,396,1509,945,1295,287.284,65.6774,24.3226,99.9693
396,397,2061,1693,1290,226.547,55.5643,34.4357,99.9926
397,398,1703,1881,1289,2.24138,57.9345,32.0655,99.9898
398,399,5611,195,1323,305.885,19.242,70.758,99.9036
399,400,14762,2977,1340,36.1177,50.9548,39.0452,99.9258
400,401,21549,3823,1333,180.25,75.0021,14.9979,99.9644
401,402,12161,2279,1340,181.318,53.0626,36.9374,99.983
402,403,8801,1788,1322,248.742,33.4409,56.5591,99.9875
403,404,3558,1110,1326,295.513,22.4232,67.5768,99.9705
404,405,3657,2156,1307,197.534,46.31800000000001,43.682,99.9927
405,406,3444,4510,1326,273.942,24.0479,65.9521,99.6302
406,407,10428,4894,1336,7.6298,55.0958,34.9042,99.9753
407,408,21630,1229,1389,290.257,37.1592,52.8408,99.9387
408,409,1293,4964,1310,212.584,33.6259,56.3741,99.9846
409,410,1949,252,1335,305.988,18.4666,71.5334,99.9978
410,411,3681,3611,1332,105.174,53.2193,36.7807,99.9744
411,412,12314,3668,1380,280.032,59.4157,30.5843,99.9881
412,413,18397,1000,1411,295.536,45.5661,44.4339,99.5492
413,414,31448,2691,1431,317.916,58.5649,31.4351,99.94
414,415,1206,4241,1324,195.817,59.4458,30.5542,99.9967
415,416,4343,1561,1374,190.615,59.1057,30.8943,99.9927
416,417,7309,2141,1362,197.536,64.437,25.563,99.9853
417,418,8257,3331,1364,140.671,75.691,14.309,99.9914
418,419,530,2377,1325,132.151,6.2588,83.7412,99.9967
419,420,7327,1898,1377,284.61,45.4192,44.5808,99.974
420,421,5176,4759,1344,350.279,47.2785,42.7215,99.9923
421,422,708,3215,1333,315.92,35.4288,54.5712,99.9962
422,423,26802,1672,1429,235.385,31.4995,58.5005,99.9573
423,424,20683,2047,1407,164.44799999999995,59.2227,30.7773,99.9836
424,425,1410,2226,1355,151.303,39.1667,50.8333,99.9874
425,426,48506,3900,1476,358.974,68.8658,21.1342,98.2964
426,427,1144,3178,1351,118.139,18.9754,71.0246,99.998
427,428,1404,4436,1352,136.707,56.8537,33.1463,99.9939
428,429,39975,2429,1485,93.9674,54.8248,35.1752,88.8446
429,430,6084,3105,1395,190.097,31.0392,58.9608,99.9716
430,431,2787,3237,1367,315.446,73.1738,16.8262,99.9968
431,432,5818,4128,1394,179.71200000000005,70.3226,19.6774,99.9747
432,433,1103,4387,1361,348.281,27.0706,62.9294,99.995
433,434,608,3444,1354,282.014,85.2498,4.75019,99.9889
434,435,5054,548,1409,113.518,54.5663,35.4337,99.9075
435,436,25434,3483,1435,263.988,84.4717,5.52826,99.9632
436,437,1482,4962,1382,139.486,54.918,35.082,99.9828
437,438,1703,4845,1385,340.708,13.9373,76.0627,99.9724
438,439,552,2463,1369,74.2108,49.8745,40.1255,99.978
439,440,7929,1134,1413,185.56,24.0828,65.9172,99.9919
440,441,23080,4538,1452,306.97,29.3151,60.6849,99.9401
441,442,13716,2566,1441,86.8661,51.4261,38.5739,99.8313
442,443,1352,4427,1393,187.727,69.8385,20.1615,99.9823
443,444,9761,4197,1435,283.732,14.4645,75.5355,99.9872
444,445,3590,4751,1394,326.276,72.7292,17.2708,99.9745
445,446,7064,3173,1430,162.39700000000005,33.9195,56.0805,99.994
446,447,13091,2962,1431,328.594,60.5634,29.4366,99.9415
447,448,501,1792,1391,324.641,6.49101,83.509,98.1444
448,449,2167,198,1404,304.7290000000001,22.0087,67.9913,99.9764
449,450,13122,4372,1472,92.9021,37.908,52.092,99.981
450,451,2533,4310,1404,173.65400000000002,70.2499,19.7501,99.9899
451,452,8580,1810,1462,153.405,21.0562,68.9438,99.9491
452,453,1663,3735,1412,61.2042,59.5744,30.4256,99.9841
453,454,1977,4666,1411,185.175,41.2758,48.7242,99.96
454,455,578,2489,1411,149.92600000000004,45.3451,44.6549,99.9511
455,456,551,2230,1408,314.911,59.0233,30.9767,99.9948
456,457,3888,2830,1440,308.862,5.31498,84.685,99.9828
457,458,51008,2078,1513,108.704,21.551,68.449,84.2955
458,459,10782,3270,1469,143.134,13.5065,76.4935,99.9883
459,460,3106,4928,1442,83.5494,75.8118,14.1882,99.9777
460,461,6441,4855,1451,87.6266,75.2472,14.7528,99.9589
461,462,1701,1057,1440,207.758,0.32402,89.676,99.9832
462,463,2289,2271,1446,197.39,63.3377,26.6623,99.9953
463,464,13250,4732,1504,110.62,43.573,46.427,99.863
464,465,970,206,1458,128.543,82.9868,7.01325,99.9285
465,466,3579,4273,1466,134.077,65.595,24.405,99.9753
466,467,691,4674,1443,193.679,59.5665,30.4335,99.7263
467,468,14629,636,1504,159.028,46.3583,43.6417,99.9284
468,469,11732,3704,1505,66.6324,55.6575,34.3425,99.9723
469,470,1717,3608,1472,176.021,38.86,51.14,99.9975
470,471,4916,1542,1508,266.809,0.0871429,89.9129,99.9481
471,472,1045,169,1474,127.105,80.4824,9.51758,99.9278
472,473,3991,2869,1492,313.55,60.8369,29.1631,99.9884
473,474,3751,3396,1496,101.927,27.9545,62.0455,99.967
474,475,690,3111,1463,17.8753,54.1584,35.8416,99.9975
475,476,7435,4083,1505,144.981,83.8055,6.19448,99.9711
476,477,1981,1034,1491,61.6508,38.2778,51.7222,99.9788
477,478,643,1124,1476,137.975,46.6731,43.3269,99.8812
478,479,21285,3069,1539,17.7078,36.6901,53.3099,99.7875
479,480,2130,1107,1507,143.156,43.9211,46.0789,99.8145
480,481,7311,482,1511,231.419,30.8255,59.1745,99.8862
481,482,2915,1196,1501,90.1625,0.00968933,89.9903,99.9749
482,483,5773,4627,1522,110.61,72.0763,17.9237,99.9429
483,484,1492,280,1493,95.3594,81.5489,8.45107,99.5094
484,485,1291,4936,1511,274.131,51.1104,38.8896,99.9337
485,486,12259,334,1549,76.7122,19.2895,70.7105,99.9705
486,487,3290,4215,1513,187.913,66.1091,23.8909,99.9928
487,488,8076,194,1555,353.73,68.2913,21.7087,99.8395
488,489,9365,861,1530,23.7892,57.0838,32.9162,99.8815
489,490,2577,1355,1516,135.942,79.0782,10.9218,98.2805
490,491,3788,2787,1530,169.024,58.2676,31.7324,99.8436
491,492,4589,1278,1537,265.03,53.0778,36.9222,99.7193
492,493,1191,1729,1517,121.287,66.4843,23.5157,98.6069
493,494,1670,247,1565,353.469,68.86,21.14,99.9931
494,495,5284,3616,1545,134.764,19.6136,70.3864,99.9774
495,496,3776,3236,1537,113.19,4.99181,85.0082,99.9848
496,497,19606,4854,1575,155.47,43.8355,46.1645,99.9622
497,498,10164,1080,1572,352.57199999999995,82.4639,7.53609,99.8406
498,499,2524,3528,1544,143.838,40.3816,49.6184,99.9225
499,500,44296,4299,1610,2.45539,75.3934,14.6066,99.1898
500,501,10640,1758,1588,88.6661,62.1558,27.8442,99.8747
501,502,5686,1595,1566,149.374,9.41031,80.5897,99.9796
502,503,1912,3363,1544,114.892,50.3066,39.6934,99.5119
503,504,5875,743,1568,95.1554,59.9015,30.0985,99.9731
504,505,5072,1188,1563,83.3517,34.3545,55.6455,99.9145
505,506,9166,1432,1573,92.1024,42.0071,47.9929,99.8813
506,507,2103,2318,1557,330.28,73.1621,16.8379,99.5797
507,508,2758,3434,1558,336.392,79.2931,10.7069,98.7717
508,509,1255,560,1550,283.126,30.6759,59.3241,99.9748
509,510,2992,2592,1573,334.829,8.69712,81.3029,99.9558
510,511,12038,3321,1596,96.0783,56.043,33.957,99.7044
511,512,5007,2844,1571,46.9957,38.1394,51.8606,99.9778
512,513,2050,1915,1571,166.09099999999995,23.079,66.921,99.9825
513,514,690,2924,1553,295.4840000000001,5.96922,84.0308,99.9814
514,515,901,2681,1560,2.33193,10.7963,79.2037,99.9824
515,516,2107,2119,1575,339.139,62.1381,27.8619,99.9952
516,517,1883,2056,1582,95.3982,76.5471,13.4529,99.9967
517,518,4355,4068,1573,234.117,77.62100000000002,12.379,98.5807
518,519,3240,995,1596,311.22,40.6103,49.3897,99.9198
519,520,6909,517,1594,299.834,57.351000000000006,32.649,99.9577
520,521,909,3198,1576,10.1238,63.2979,26.7021,99.9006
521,522,19229,4545,1631,332.97,63.2886,26.7114,99.8708
522,523,7488,2735,1602,140.192,57.1092,32.8908,99.9874
523,524,7825,419,1613,239.963,64.4464,25.5536,98.6487
524,525,3851,4674,1613,156.319,68.8191,21.1809,99.7212
525,526,5728,1345,1636,229.596,30.8911,59.1089,99.8849
526,527,1747,1664,1593,139.908,13.6582,76.3418,99.9964
527,528,7170,3721,1611,239.108,55.7658,34.2342,99.975
528,529,1668,923,1586,17.7171,17.0097,72.9903,99.9888
529,530,3353,2653,1613,286.334,25.4344,64.5656,99.9632
530,531,3866,2343,1611,277.214,67.7501,22.2499,99.9856
531,532,5194,843,1600,286.719,76.9057,13.0943,99.9791
532,533,10671,3526,1611,338.404,44.7549,45.2451,99.9694
533,534,4363,2894,1619,300.6790000000001,8.532860000000001,81.4671,99.9827
534,535,1341,4630,1589,337.499,8.3222,81.6778,99.8026
535,536,1513,644,1585,338.366,71.0229,18.9771,99.9614
536,537,13551,3120,1652,285.391,15.0002,74.9998,99.9747
537,538,7971,2259,1647,291.117,53.38,36.62,99.9886
538,539,8950,3976,1679,353.15,12.7395,77.2605,96.2174
539,540,631,1271,1603,286.8540000000001,4.6525,85.3475,98.9422
540,541,669,3433,1602,204.987,39.7247,50.2753,99.9921
541,542,1273,1326,1615,187.544,87.5774,2.42265,99.9876
542,543,7398,1997,1632,112.147,3.66906,86.3309,99.3827
543,544,6433,3879,1652,151.5,78.958,11.042,99.9414
544,545,19772,2118,1678,326.701,81.79,8.20999,99.9143
545,546,20530,655,1656,21.1724,81.6616,8.33844,99.8538
546,547,8863,1478,1653,227.74,32.0922,57.9078,99.9824
547,548,1726,3802,1617,301.117,39.4899,50.5101,99.9951
548,549,2504,3226,1623,345.324,76.7255,13.2745,99.982
549,550,8466,3672,1669,270.931,37.1218,52.8782,99.9695
550,551,4697,2975,1643,129.395,75.1697,14.8303,99.9109
551,552,4472,4754,1641,331.233,37.2086,52.7914,99.991
552,553,3788,1575,1624,333.54,57.098,32.902,99.9763
553,554,3808,285,1637,324.765,46.5378,43.4622,99.9688
554,555,55892,1113,1743,258.863,60.2976,29.7024,99.9009
555,556,2089,1245,1630,36.1224,75.4651,14.5349,99.9931
556,557,1122,1883,1623,259.814,37.6916,52.3084,99.8785
557,558,1687,777,1629,91.46,88.9495,1.05053,99.9882
558,559,6492,947,1650,153.703,14.8338,75.1662,85.3501
559,560,11513,3403,1692,113.197,13.4435,76.5565,99.979
560,561,560,2556,1632,185.401,0.5680390000000001,89.432,99.9889
561,562,16326,2625,1717,83.5388,21.1961,68.8039,99.6214
562,563,10287,4056,1665,331.23800000000006,15.8328,74.1672,99.9949
563,564,6549,1652,1675,322.048,32.3599,57.6401,99.9852
564,565,2779,1030,1652,302.088,56.1527,33.8473,99.9845
565,566,6112,2489,1658,182.601,1.99531,88.0047,99.9413
566,567,1226,4155,1645,326.4170000000001,49.1295,40.8705,99.9944
567,568,2495,4910,1648,271.324,13.0084,76.9916,99.9574
568,569,1575,2828,1651,289.091,47.4323,42.5677,99.9734
569,570,15348,428,1711,81.6326,78.8065,11.1935,99.9529
570,571,20138,1929,1721,208.015,21.7758,68.2242,99.9669
571,572,3577,2772,1666,128.709,37.5015,52.4985,99.984
572,573,15863,3279,1707,173.761,63.103,26.897,99.9879
573,574,20024,2290,1733,207.182,55.166,34.834,99.9526
574,575,5544,3804,1681,57.4362,39.7942,50.2058,99.951
575,576,47753,1734,1799,259.175,2.94652,87.0535,99.9725
576,577,33405,3547,1751,352.353,79.1544,10.8456,99.9078
577,578,772,838,1661,124.987,88.8588,1.14124,99.9871
578,579,589,1593,1654,317.518,52.799,37.201,99.9825
579,580,13546,4815,1711,150.744,53.3551,36.6449,99.9563
580,581,2538,2690,1681,39.099,3.78956,86.2104,99.9263
581,582,790,1845,1667,223.707,29.4942,60.5058,99.5863
582,583,1757,2426,1678,37.0028,32.0725,57.9275,99.9974
583,584,7588,4449,1708,43.2905,67.5297,22.4703,99.9675
584,585,3762,4697,1688,112.452,13.1664,76.8336,99.9891
585,586,1305,2870,1673,189.601,14.7366,75.2634,99.9717
586,587,1899,4639,1692,281.378,18.5428,71.4572,99.9901
587,588,688,2922,1680,55.7501,53.7476,36.2524,99.9932
588,589,1805,920,1688,59.5191,50.3106,39.6894,99.9948
589,590,577,3186,1683,87.5518,75.9603,14.0397,99.9889
590,591,1753,4944,1689,81.7275,60.6105,29.3895,99.9735
591,592,4136,286,1698,80.9406,55.5494,34.4506,99.9952
592,593,762,2889,1698,56.5318,54.0373,35.9627,99.9188
593,594,806,3038,1685,19.7144,29.6969,60.3031,99.9956
594,595,8369,1564,1715,102.352,22.7848,67.2152,99.9737
595,596,3016,4175,1705,128.045,38.049,51.951,99.9871
596,597,19633,844,1772,235.051,72.1746,17.8254,99.9488
597,598,4552,2969,1709,250.773,22.0775,67.9225,99.3881
598,599,11426,1378,1749,147.539,3.98895,86.0111,99.996
599,600,2073,1433,1715,34.3853,63.5439,26.4561,99.9921
600,601,23344,4145,1802,48.3057,61.2244,28.7756,99.9402
601,602,1175,214,1713,254.511,53.2172,36.7828,99.8682
602,603,1418,2730,1707,304.151,71.8746,18.1254,99.9961
603,604,518,499,1704,302.398,33.1523,56.8477,99.9688
604,605,11622,587,1760,341.771,55.3001,34.6999,99.9239
605,606,25812,2924,1784,78.7308,54.3032,35.6968,90.8804
606,607,3207,2406,1727,33.7395,51.3898,38.6102,99.9095
607,608,5893,2521,1739,309.519,70.7336,19.2664,99.9884
608,609,16294,4585,1762,201.655,81.2065,8.79349,99.925
609,610,6004,734,1748,171.084,74.4004,15.5996,99.9752
610,611,2217,673,1729,358.082,58.7642,31.2358,99.798
611,612,1413,3927,1732,274.361,66.6865,23.3135,99.9805
612,613,6952,4348,1746,0.981127,44.6492,45.3508,99.9269
613,614,1239,3188,1737,95.045,75.8244,14.1756,99.9942
614,615,1629,4721,1747,247.594,65.6857,24.3143,99.9879
615,616,11334,3083,1767,16.6752,31.0914,58.9086,99.9656
616,617,9464,4258,1785,64.8791,11.8877,78.1123,99.9303
617,618,11850,311,1774,285.2390000000001,81.6265,8.373510000000001,99.9907
618,619,1522,1471,1747,313.884,75.6713,14.3287,99.945
619,620,8713,3768,1763,147.924,56.1297,33.8703,99.9857
620,621,7774,4945,1798,179.014,76.5405,13.4595,99.8871
621,622,6291,2417,1785,20.1345,21.5173,68.4827,99.9959
622,623,3780,197,1777,129.55100000000002,65.8198,24.1802,99.9594
623,624,11882,3667,1824,12.9686,1.43814,88.5619,99.989
624,625,13656,1273,1820,288.53,44.9846,45.0154,99.9664
625,626,550,234,1779,285.4190000000001,81.2954,8.70464,99.9858
626,627,859,4872,1768,75.5017,70.1003,19.8997,99.9935
627,628,3889,1491,1790,284.836,53.6927,36.3073,99.6128
628,629,14718,2119,1809,257.156,34.54,55.46,99.9682
629,630,20050,1573,1867,42.1131,50.9196,39.0804,99.9069
630,631,3566,4820,1797,270.25,61.427,28.573,99.8997
631,632,6183,3927,1798,325.789,12.1889,77.8111,98.8308
632,633,1283,402,1788,96.483,76.7636,13.2364,99.9908
633,634,29635,2735,1847,221.521,46.9254,43.0746,99.9909
634,635,55102,3374,1888,27.3958,66.3608,23.6392,99.9477
635,636,2522,3189,1807,335.745,39.4729,50.5271,99.975
636,637,686,2793,1791,102.835,65.4945,24.5055,99.9929
637,638,7084,1982,1817,174.54,57.2011,32.7989,99.9796
638,639,542,676,1790,172.015,72.0739,17.9261,99.9673
639,640,18843,2515,1851,101.258,20.6755,69.3245,99.6271
640,641,8615,4428,1818,176.604,53.1564,36.8436,99.9872
641,642,1054,4723,1797,213.34,30.6928,59.3072,99.987
642,643,58964,517,1951,169.387,41.0543,48.9457,84.2114
643,644,586,4683,1807,111.791,16.4583,73.5417,99.9525
644,645,2061,3818,1820,240.514,71.4706,18.5294,99.9841
645,646,4529,744,1822,349.537,34.7959,55.2041,99.9719
646,647,10260,4055,1855,145.175,26.3755,63.6245,99.9501
647,648,2752,4878,1824,193.43400000000003,76.2904,13.7096,99.9837
648,649,15597,662,1890,138.36,31.9583,58.0417,99.9958
649,650,1302,1889,1815,53.8167,77.8654,12.1346,99.9754
650,651,7472,2329,1846,133.662,22.711,67.289,99.9919
651,652,815,4534,1808,45.7597,43.0796,46.9204,99.9937
652,653,3095,2905,1827,159.451,54.465,35.535,99.9964
653,654,9569,3776,1872,139.68200000000002,0.757095,89.2429,99.9834
654,655,3802,348,1852,308.869,74.2901,15.7099,99.9911
655,656,22754,2258,1914,329.569,68.8072,21.1928,99.9512
656,657,4924,1400,1847,259.342,37.1257,52.8743,99.9737
657,658,651,3131,1830,129.684,85.3631,4.63692,99.9939
658,659,3433,4583,1857,304.388,9.81564,80.1844,99.9965
659,660,7523,235,1866,242.013,41.5698,48.4302,99.9252
660,661,652,2047,1848,205.24400000000003,50.7824,39.2176,99.9965
661,662,4697,4338,1858,168.495,21.7539,68.2461,99.983
662,663,6498,3957,1865,144.52200000000005,64.0311,25.9689,99.9593
663,664,2581,4530,1857,105.266,78.2322,11.7678,99.9815
664,665,7042,4761,1892,268.078,28.5747,61.4253,99.9634
665,666,9234,4638,1892,306.837,5.59805,84.402,99.9846
666,667,6478,1889,1871,112.551,72.7672,17.2328,99.9683
667,668,593,4705,1849,112.089,9.75146,80.2485,99.987
668,669,22844,3171,1924,130.891,71.7312,18.2688,99.904
669,670,2824,1050,1872,186.939,7.2199399999999985,82.7801,99.9979
670,671,27105,1205,1918,326.1740000000001,27.9283,62.0717,99.8641
671,672,7042,917,1886,344.653,33.6386,56.3614,99.8833
672,673,713,3855,1861,285.672,84.1041,5.89593,99.9906
673,674,773,1005,1871,186.691,7.03136,82.9686,99.9983
674,675,12938,4288,1929,308.18,0.6417390000000001,89.3583,99.9873
675,676,5547,4886,1887,267.215,25.5528,64.4472,99.95
676,677,1809,2404,1878,291.055,65.5561,24.4439,99.981
677,678,1385,1467,1880,71.7623,70.7599,19.2401,99.8621
678,679,612,988,1884,188.036,5.5207,84.4793,99.9662
679,680,13248,749,1980,131.181,39.1336,50.8664,63.25899999999999
680,681,11568,4422,1927,303.269,55.0032,34.9968,99.9424
681,682,652,4718,1872,266.072,72.3998,17.6002,99.9956
682,683,1494,2938,1882,351.556,36.9466,53.0534,99.9934
683,684,1459,747,1897,329.07,62.0443,27.9557,99.9778
684,685,10454,1959,1943,292.833,78.2866,11.7134,99.9096
685,686,6019,2116,1915,33.5114,66.2996,23.7004,99.8734
686,687,11009,3029,1960,157.19299999999996,34.3398,55.6602,99.9772
687,688,1723,2025,1900,269.505,78.5567,11.4433,99.9807
688,689,4006,2603,1916,272.282,49.1439,40.8561,99.9844
689,690,2147,3868,1902,253.93400000000003,77.3106,12.6894,99.8278
690,691,9125,2900,1935,112.476,48.6222,41.3778,99.9452
691,692,1700,3544,1915,258.147,42.6773,47.3227,99.9917
692,693,6262,3608,1923,246.707,76.59100000000002,13.409,99.9866
693,694,7097,1476,1941,140.055,50.7271,39.2729,99.7623
694,695,5222,2401,1942,292.403,50.6526,39.3474,99.8859
695,696,2598,1378,1928,276.98400000000004,25.3434,64.6566,99.9759
696,697,5215,4144,1932,286.156,56.9906,33.0094,99.9567
697,698,12239,4527,1960,168.078,22.4454,67.5546,99.9788
698,699,1783,859,1930,137.375,11.0858,78.9142,99.7421
699,700,12986,3704,1960,127.732,44.3643,45.6357,99.973
700,701,41858,4817,2073,142.38299999999995,46.5044,43.4956,99.8857
701,702,992,316,1921,179.863,75.6587,14.3413,99.9939
702,703,4293,263,1972,60.3204,50.5923,39.4077,99.9418
703,704,6497,4021,1955,292.517,57.1488,32.8512,99.9364
704,705,654,2682,1918,132.14700000000002,43.5305,46.4695,99.9935
705,706,1983,2462,1943,52.056,78.3898,11.6102,99.9627
706,707,4689,215,1951,227.905,66.1714,23.8286,99.9742
707,708,3319,1049,1950,195.212,21.5538,68.4462,99.993
708,709,10385,4913,1968,125.868,55.4345,34.5655,99.9781
709,710,19763,1825,2017,98.6254,83.7351,6.26491,98.7532
710,711,758,2771,1939,28.8173,48.0671,41.9329,99.9905
711,712,14756,986,2017,78.6993,85.1033,4.896730000000002,98.4725
712,713,10936,2091,2000,124.046,32.924,57.076,99.8647
713,714,2336,3900,1945,101.905,72.8607,17.1393,99.9781
714,715,14466,3831,2021,167.207,8.282689999999999,81.7173,99.9068
715,716,12282,2653,1991,335.295,34.1189,55.8811,99.9937
716,717,3001,4123,1976,357.017,1.94147,88.0585,99.9008
717,718,4572,2816,1974,143.756,51.484,38.516,99.9946
718,719,11680,350,2003,216.455,78.4603,11.5397,99.6629
719,720,994,4704,1954,306.488,4.0256300000000005,85.9744,99.9952
720,721,2323,1595,1969,127.953,38.1982,51.8018,99.9892
721,722,17225,2518,2038,144.82,30.217,59.783,99.7237
722,723,770,4657,1956,63.3609,59.7307,30.2693,99.9732
723,724,3748,1729,1975,345.973,19.615,70.385,99.9934
724,725,2386,883,1975,336.35,50.5279,39.4721,99.9468
725,726,19441,1271,2057,285.6740000000001,55.771,34.229,99.742
726,727,8696,3948,2010,255.278,37.1234,52.8766,99.5609
727,728,531,1462,1977,245.955,60.8599,29.1401,99.7739
728,729,675,3537,1973,322.139,65.5926,24.4074,99.9827
729,730,2389,4230,1983,284.453,66.8123,23.1877,99.9805
730,731,2955,4609,1998,284.121,58.1009,31.8991,99.9587
731,732,75097,1542,2104,148.094,50.5346,39.4654,99.9604
732,733,3571,2972,2014,25.8848,64.2283,25.7717,99.8748
733,734,27640,3265,2057,52.8769,45.4413,44.5587,97.8575
734,735,3073,2177,2003,355.039,69.6872,20.3128,99.9463
735,736,3808,4668,2004,259.25,75.133,14.867,99.9923
736,737,1007,1138,1991,139.157,63.1952,26.8048,99.9902
737,738,2014,1085,2001,178.98,66.0296,23.9704,99.8243
738,739,607,3591,1992,117.471,49.2988,40.7012,99.9529
739,740,646,1186,1999,283.553,55.6944,34.3056,99.9731
740,741,2069,4068,2023,62.5848,70.0656,19.9344,99.9191
741,742,2541,4355,2013,123.521,26.5539,63.4461,99.9814
742,743,35801,2320,2082,218.375,53.758,36.242,99.9086
743,744,522,1699,2005,130.572,67.3099,22.6901,99.9342
744,745,1011,2454,2009,111.976,68.153,21.847,99.5681
745,746,2998,2729,2024,29.8137,46.397,43.603,99.9895
746,747,5844,831,2030,240.079,11.7357,78.2643,99.9872
747,748,16023,3534,2051,314.677,53.9694,36.0306,99.8265
748,749,1463,2017,2008,164.854,71.9306,18.0694,99.9801
749,750,5509,4276,2036,109.114,78.7577,11.2423,99.6536
750,751,3044,1563,2019,257.325,62.2587,27.7413,99.6548
751,752,29069,2794,2107,325.673,39.2653,50.7347,99.9363
752,753,982,180,2019,116.55,10.1179,79.8821,99.9657
753,754,3384,4431,2036,300.466,60.2265,29.7735,99.9336
754,755,6942,909,2069,356.68300000000005,78.7816,11.2184,99.7927
755,756,1032,3660,2014,132.21200000000002,42.3255,47.6745,99.9752
756,757,828,4138,2014,13.4693,38.3962,51.6038,99.7575
757,758,5644,1924,2044,261.394,8.44604,81.554,99.9755
758,759,8881,4695,2061,292.769,56.3652,33.6348,99.77
759,760,988,4203,2023,325.308,32.165,57.835,99.9963
760,761,1661,3119,2031,116.1,22.69,67.31,99.6737
761,762,3004,256,2049,310.677,19.2676,70.7324,99.9599
762,763,10757,1128,2070,299.3,65.9728,24.0272,99.9324
763,764,7019,3728,2058,247.062,51.437,38.563,99.8233
764,765,10113,462,2104,136.27,17.4232,72.5768,99.9858
765,766,2574,4538,2043,32.947,27.3981,62.6019,99.9945
766,767,4478,2002,2072,279.717,0.382233,89.6178,99.9712
767,768,678,210,2052,292.345,10.0355,79.9645,99.9557
768,769,1345,748,2074,8.3615,67.3673,22.6327,99.9895
769,770,8625,4025,2089,119.377,61.6182,28.3818,98.7436
770,771,2375,3071,2072,57.1256,12.1203,77.8797,99.9856
771,772,10343,2599,2105,327.13,75.9025,14.0975,99.9623
772,773,1933,4354,2068,309.211,1.61591,88.3841,99.9817
773,774,4555,2942,2083,139.64600000000002,56.4026,33.5974,99.9819
774,775,1550,3026,2077,21.0329,60.4027,29.5973,99.895
775,776,576,3635,2068,245.668,49.9202,40.0798,99.8622
776,777,47630,3844,2186,310.759,61.9617,28.0383,99.9105
777,778,601,4311,2078,307.2990000000001,72.7175,17.2825,99.0185
778,779,5495,669,2099,48.0069,57.8472,32.1528,99.9857
779,780,34596,4054,2231,344.829,53.6739,36.3261,99.9809
780,781,8715,291,2120,337.504,40.7411,49.2589,99.9924
781,782,3870,3123,2096,350.1040000000001,29.77,60.23,99.9875
782,783,1468,2063,2085,286.326,40.7456,49.2544,99.9898
783,784,15022,4542,2121,337.8640000000001,66.7783,23.2217,99.8534
784,785,4504,374,2106,77.8208,58.2849,31.7151,99.9921
785,786,10759,2136,2119,340.659,20.6979,69.3021,99.954
786,787,602,784,2074,240.637,8.47672,81.5233,99.9924
787,788,6836,4401,2117,144.65200000000004,47.2564,42.7436,99.9896
788,789,1815,2682,2094,134.797,61.2255,28.7745,99.9826
789,790,4472,3670,2112,15.9085,71.718,18.282,99.9815
790,791,5088,817,2103,268.119,66.6149,23.3851,99.9912
791,792,3995,224,2138,48.2336,16.8037,73.1963,99.9516
792,793,13069,4215,2155,312.2870000000001,60.3962,29.6038,99.9522
793,794,14873,1966,2173,331.8540000000001,60.2012,29.7988,99.742
794,795,1956,3606,2117,319.426,63.6267,26.3733,99.9935
795,796,5129,3403,2133,133.727,47.7582,42.2418,99.9897
796,797,2584,1043,2124,13.9488,23.1413,66.8587,99.9863
797,798,9731,1839,2171,342.647,32.1524,57.8476,99.9759
798,799,604,3779,2113,119.974,53.4989,36.5011,99.9784
799,800,12573,589,2197,332.316,5.77557,84.2244,99.9486
800,801,5343,3063,2137,8.70447,86.7567,3.24329,99.8928
801,802,5606,3281,2151,284.578,73.7305,16.2695,99.9758
802,803,5006,3516,2131,175.41099999999997,76.5935,13.4065,99.9706
803,804,71547,3029,2284,342.44699999999995,73.5252,16.4748,69.3327
804,805,4990,1142,2150,3.09252,8.11995,81.8801,99.9909
805,806,8047,4637,2181,296.058,14.2965,75.7035,99.9865
806,807,3109,2023,2155,290.586,40.7709,49.2291,99.9929
807,808,2654,2217,2156,266.157,77.7903,12.2097,99.9938
808,809,5526,900,2157,133.072,49.867,40.133,99.9686
809,810,10458,3215,2190,12.4546,36.2269,53.7731,99.9383
810,811,1983,1000,2165,46.8015,82.5472,7.45283,99.9901
811,812,15832,734,2200,105.268,39.4978,50.5022,99.9388
812,813,9913,4929,2213,196.84,58.0514,31.9486,99.9611
813,814,1358,418,2158,329.462,81.1441,8.855889999999997,99.9941
814,815,32694,4231,2253,210.11900000000003,65.0049,24.9951,99.9635
815,816,21107,2514,2256,325.9170000000001,65.4735,24.5265,92.8028
816,817,9836,3580,2194,261.889,79.0233,10.9767,99.9763
817,818,20923,1285,2238,318.147,81.5477,8.45229,99.9327
818,819,3283,2643,2172,335.959,44.5305,45.4695,99.9964
819,820,20652,3435,2237,47.8434,46.6478,43.3522,59.7037
820,821,3558,821,2186,160.138,29.6369,60.3631,99.9977
821,822,6886,1745,2207,286.371,36.2577,53.7423,99.9885
822,823,12158,288,2205,215.903,18.4465,71.5535,99.9406
823,824,4698,4870,2211,198.327,56.7115,33.2885,99.9721
824,825,15857,2345,2228,146.703,66.7392,23.2608,99.9634
825,826,1324,1053,2173,264.538,68.8149,21.1851,99.9944
826,827,8135,1154,2206,251.248,70.2667,19.7333,99.8786
827,828,6806,2564,2205,216.82,53.2101,36.7899,99.8027
828,829,26207,4495,2270,352.602,70.9529,19.0472,83.9843
829,830,888,1363,2183,269.858,61.9728,28.0272,99.9767
830,831,2570,461,2196,96.7259,54.3821,35.6179,99.8237
831,832,66001,2185,2367,7.1082,18.651,71.34899999999998,99.9815
832,833,830,881,2195,291.861,47.0381,42.9619,99.9816
833,834,667,1401,2189,175.46900000000005,21.899,68.101,99.994
834,835,2232,4189,2205,342.728,53.8367,36.1633,99.9957
835,836,955,1071,2197,342.621,64.9391,25.0609,99.9916
836,837,4877,1465,2214,1.42751,43.6053,46.3947,99.9608
837,838,3323,4716,2214,196.754,59.0289,30.9711,99.9851
838,839,11434,950,2235,142.38299999999995,32.5177,57.4823,99.953
839,840,7271,431,2246,38.1781,72.2233,17.7767,99.9855
840,841,2566,520,2217,260.722,28.5592,61.4408,99.9973
841,842,3699,2676,2225,177.373,52.4229,37.5771,99.9774
842,843,8134,4815,2248,94.149,55.2041,34.7959,99.9798
843,844,4567,1412,2250,55.7095,70.7474,19.2526,99.9818
844,845,4272,1797,2254,71.0077,53.5128,36.4872,99.9762
845,846,1866,3664,2240,322.438,67.5832,22.4168,99.9911
846,847,1189,3896,2233,326.78,71.1004,18.8996,99.9859
847,848,2806,2039,2253,116.531,24.7868,65.2132,99.9921
848,849,14336,3322,2300,276.004,63.2665,26.7335,99.9721
849,850,2796,1887,2252,343.9790000000001,17.1428,72.8572,99.994
850,851,527,2740,2241,173.255,53.0644,36.9356,99.9931
851,852,1438,2824,2245,222.433,52.864,37.136,99.9835
852,853,1474,3593,2243,319.646,9.07333,80.9267,99.9982
853,854,651,289,2243,219.35,13.3682,76.6318,99.9957
854,855,804,2086,2257,280.276,34.7016,55.2984,99.9334
855,856,2207,4639,2246,192.103,9.76418,80.2358,99.9979
856,857,7052,2741,2283,258.845,43.9237,46.0763,99.9769
857,858,1401,3705,2255,293.443,60.9039,29.0961,99.9943
858,859,5672,687,2272,342.098,65.2143,24.7857,99.9723
859,860,6819,1600,2270,160.741,65.4209,24.5791,99.9062
860,861,19667,1950,2358,343.019,44.4451,45.5549,83.619
861,862,2644,4375,2266,335.279,73.3604,16.6396,99.9874
862,863,14195,1116,2314,286.718,67.3459,22.6541,99.9644
863,864,747,253,2259,286.897,63.3828,26.6172,99.9946
864,865,3084,3232,2272,286.379,69.7523,20.2477,99.9763
865,866,5076,2256,2289,267.10400000000004,52.935,37.065,99.9906
866,867,2913,3878,2277,314.298,11.5298,78.4702,99.9986
867,868,9228,4639,2292,198.717,58.7259,31.2741,99.9913
868,869,3062,1030,2291,9.79855,73.9388,16.0612,99.898
869,870,1412,4767,2282,306.397,35.5734,54.4266,99.9961
870,871,20711,914,2355,101.11,74.9674,15.0326,99.9034
871,872,7093,3622,2294,132.749,75.1383,14.8617,99.9881
872,873,1414,526,2282,179.23,0.261879,89.7381,99.9505
873,874,18510,1671,2349,277.891,57.5356,32.4644,99.9774
874,875,4889,1825,2309,209.388,34.8978,55.1022,99.9975
875,876,1273,760,2283,357.9190000000001,1.32748,88.6725,99.9938
876,877,3651,391,2298,97.1075,61.862,28.138,99.9929
877,878,3824,291,2300,167.731,78.8048,11.1952,99.9229
878,879,13603,2841,2335,192.307,45.9627,44.0373,99.9965
879,880,853,4298,2292,320.491,70.2056,19.7944,99.9698
880,881,10149,1486,2354,346.7990000000001,3.2186,86.7814,79.0011
881,882,1559,3178,2300,261.86,69.7065,20.2935,97.0397
882,883,9156,219,2380,154.245,29.1822,60.8178,99.9577
883,884,8260,634,2353,283.259,2.30548,87.6945,99.9798
884,885,5514,3851,2328,165.176,36.7214,53.2786,99.9917
885,886,3045,1882,2318,73.2854,28.2425,61.7575,99.9881
886,887,832,583,2299,328.784,64.3497,25.6503,99.9667
887,888,605,2027,2298,127.871,78.6331,11.3669,99.9947
888,889,2531,4365,2312,161.439,27.9645,62.0355,99.9928
889,890,8692,3670,2356,331.956,4.85175,85.1482,99.996
890,891,16491,4812,2366,29.0125,56.6684,33.3316,99.9881
891,892,4801,4912,2339,28.5735,57.8993,32.1007,99.9903
892,893,9077,334,2358,110.486,44.9718,45.0282,99.9765
893,894,9883,3544,2361,134.49200000000002,43.0086,46.9914,99.9856
894,895,911,794,2312,220.065,56.5871,33.4129,99.9947
895,896,5630,501,2342,1.45267,3.18203,86.818,99.9632
896,897,585,2366,2307,3.31334,83.5891,6.4109,99.9912
897,898,1704,1588,2323,281.833,78.2811,11.7189,99.9912
898,899,13379,770,2372,158.21,36.8408,53.1592,99.9926
899,900,8867,4679,2346,97.3837,63.6094,26.3906,99.9689
900,901,3850,4935,2389,357.994,65.5762,24.4238,99.9068
901,902,2112,565,2338,131.69899999999998,27.1355,62.8645,99.8269
902,903,7679,1300,2351,142.511,58.7597,31.2403,99.9914
903,904,3607,3132,2339,158.641,25.1687,64.8313,99.9955
904,905,658,2420,2319,313.7990000000001,21.3147,68.6853,99.9949
905,906,1714,2650,2328,256.714,45.813,44.187,99.9829
906,907,2011,1386,2330,352.326,40.0174,49.9826,99.99
907,908,969,3218,2325,219.173,60.1105,29.8895,99.9844
908,909,15171,4190,2370,4.86436,42.2707,47.7293,99.9948
909,910,1675,1556,2348,116.238,9.98472,80.0153,99.954
910,911,1566,1764,2346,242.177,66.6657,23.3343,99.9976
911,912,627,2532,2330,285.741,54.7401,35.2599,99.9896
912,913,800,685,2338,305.128,54.6499,35.3501,99.9938
913,914,826,2566,2328,282.122,51.5423,38.4577,99.9813
914,915,16684,3387,2391,335.996,66.6194,23.3806,99.9838
915,916,54638,2531,2498,136.457,14.418,75.582,99.9328
916,917,3476,2363,2351,264.878,79.949,10.051,99.988
917,918,6550,2600,2377,167.449,60.9995,29.0005,99.9961
918,919,20061,3783,2417,139.842,1.58757,88.4124,99.6393
919,920,13165,4465,2406,174.675,42.5325,47.4675,99.9744
920,921,2246,2743,2364,105.827,84.3471,5.65286,99.9953
921,922,53073,4206,2478,309.577,77.1154,12.8846,93.2478
922,923,4250,1207,2372,37.7341,62.0999,27.9001,99.9894
923,924,1153,2695,2362,163.94,62.2469,27.7531,99.9961
924,925,12750,408,2419,240.679,35.0519,54.9481,99.9608
925,926,1770,3912,2377,282.803,9.66087,80.3391,99.9852
926,927,2385,1384,2386,232.981,77.0527,12.9473,99.9211
927,928,5149,2405,2411,195.117,1.3218299999999998,88.6782,99.9973
928,929,54558,1811,2541,74.5646,58.4103,31.5897,99.514
929,930,2571,1835,2390,76.6048,49.7106,40.2894,99.9603
930,931,5972,2683,2413,119.469,83.8162,6.18383,99.9436
931,932,12219,1104,2421,86.5547,26.9275,63.0725,99.9382
932,933,1867,3274,2393,187.535,46.2408,43.7592,99.9961
933,934,13071,2787,2447,153.586,68.8395,21.1605,99.9564
934,935,6870,574,2434,39.8393,38.5169,51.4831,99.9319
935,936,3790,1418,2417,197.527,75.7509,14.2491,99.9659
936,937,966,1569,2397,256.396,81.1631,8.8369,99.9632
937,938,3418,4652,2413,180.454,69.9856,20.0144,99.9935
938,939,40770,4628,2612,209.152,7.0141800000000005,82.9858,57.5504
939,940,2470,496,2429,131.119,22.9213,67.0787,99.982
940,941,6932,1271,2424,191.521,76.7699,13.2301,99.9486
941,942,621,2347,2405,191.457,0.618088,89.3819,99.9955
942,943,5044,4737,2435,187.08900000000003,46.4033,43.5967,99.9943
943,944,12325,2948,2473,192.797,51.5423,38.4577,95.9675
944,945,4121,3630,2429,327.511,85.8159,4.18409,99.9697
945,946,1835,4026,2416,112.766,17.7194,72.2806,99.9012
946,947,19929,3517,2477,156.55,51.2915,38.7085,99.9572
947,948,1694,2889,2425,134.179,42.7455,47.2545,99.9977
948,949,4028,275,2453,154.04,29.6076,60.3924,99.9724
949,950,10870,1547,2469,238.785,47.5374,42.4626,99.9576
950,951,12567,688,2479,244.695,41.1483,48.8517,99.8496
951,952,551,4896,2436,354.891,63.9353,26.0647,99.9955
952,953,6042,931,2454,250.264,63.1036,26.8964,99.7728
953,954,1468,1458,2449,243.697,81.9203,8.07968,99.9613
954,955,9039,3982,2468,251.691,72.7669,17.2331,99.8234
955,956,65343,4424,2587,304.713,26.7848,63.2152,99.943
956,957,20667,2023,2498,287.9240000000001,61.2736,28.7264,99.6073
957,958,2491,3269,2464,319.598,87.9611,2.03894,99.9929
958,959,6438,3883,2485,283.0,8.054730000000001,81.9453,99.9561
959,960,2424,996,2474,303.73,45.369,44.631,99.9359
960,961,4314,4840,2475,159.917,83.6328,6.3672,99.9681
961,962,32100,1226,2581,174.55200000000005,75.3472,14.6528,99.4806
962,963,607,1390,2461,247.068,81.2378,8.762189999999999,99.9756
963,964,11467,3687,2504,317.616,39.8051,50.1949,99.9616
964,965,2430,3134,2469,1.9205,23.3521,66.6479,99.9911
965,966,2591,4942,2483,148.417,71.6027,18.3973,99.9292
966,967,6766,1318,2485,12.3915,58.2807,31.7193,99.9828
967,968,10285,1670,2511,131.35399999999998,60.1643,29.8357,99.1695
968,969,5270,804,2501,332.311,55.9803,34.0197,99.9084
969,970,27184,495,2581,357.784,27.1081,62.8919,77.2585
970,971,2496,3369,2480,289.267,65.7573,24.2427,99.9821
971,972,6752,4744,2494,212.622,60.3931,29.6069,99.9951
972,973,23508,1025,2555,123.368,63.7428,26.2572,99.4258
973,974,705,3312,2481,312.038,81.5368,8.463189999999999,99.9924
974,975,4040,203,2506,38.5555,63.2564,26.7436,99.5141
975,976,3171,336,2497,326.895,19.5912,70.4088,92.3163
976,977,916,1419,2488,251.123,72.4342,17.5658,99.9783
977,978,504,3238,2494,301.361,83.3619,6.63806,99.9446
978,979,7614,2183,2554,56.5156,60.6209,29.3791,99.4789
979,980,28208,2261,2624,314.353,28.8471,61.1529,99.9734
980,981,11206,3379,2549,41.4372,57.8831,32.1169,99.7865
981,982,28710,3115,2553,324.486,79.666,10.334,99.2635
982,983,7774,1466,2544,298.453,49.7296,40.2704,99.527
983,984,3178,888,2516,302.004,44.4008,45.5992,99.9296
984,985,7587,2749,2531,258.532,66.7589,23.2412,99.5624
985,986,3616,3288,2539,344.957,48.6815,41.3185,99.9727
986,987,635,3757,2517,304.651,39.156,50.844,99.9919
987,988,6415,1364,2541,321.01,55.2236,34.7764,99.8811
988,989,1604,4851,2532,41.4973,40.4698,49.5302,99.988
989,990,2708,2119,2559,97.5453,55.974,34.026,99.278
990,991,6824,336,2546,214.07,80.6642,9.33584,99.9586
991,992,15239,4877,2589,67.6935,84.8699,5.13005,98.9767
992,993,5058,2900,2553,306.823,2.89101,87.109,99.9777
993,994,536,3940,2532,138.06799999999998,27.9186,62.0814,99.98
994,995,672,4788,2539,147.347,72.0747,17.9253,99.9706
995,996,909,2373,2550,47.26300000000001,71.1913,18.8087,99.724
996,997,12430,3848,2588,231.574,71.7563,18.2437,99.4883
997,998,817,2842,2555,129.606,77.3862,12.6138,99.5491
998,999,14271,3717,2611,275.814,19.7275,70.2725,99.9227
999,1000,20463,3544,2612,295.863,60.291,29.709,99.8687
1000,1001,1831,698,2570,246.408,42.4697,47.5303,99.9805
1001,1002,2967,769,2556,241.878,41.4942,48.5058,99.9617
1002,1003,1012,236,2551,206.888,82.8954,7.10465,99.985
1003,1004,1790,4724,2556,61.094,44.9344,45.0656,99.9775
1004,1005,6492,2963,2601,321.283,21.3045,68.6955,99.9674
1005,1006,7259,1545,2586,204.551,67.6226,22.3774,99.9905
1006,1007,1229,840,2566,117.97,30.4472,59.5528,99.983
1007,1008,17420,4159,2633,34.6386,54.8632,35.1368,99.9612
1008,1009,2231,657,2589,328.101,52.29600000000001,37.704,99.9843
1009,1010,17662,2017,2625,123.372,16.0921,73.9079,99.9589
1010,1011,8026,3398,2619,295.74,17.8308,72.1692,99.9631
1011,1012,6047,2807,2592,216.324,53.4273,36.5727,99.9943
1012,1013,9578,3950,2626,22.2039,17.3499,72.6501,99.9228
1013,1014,1204,257,2579,294.672,66.6277,23.3723,99.9851
1014,1015,1874,590,2587,247.911,42.2428,47.7572,99.9899
1015,1016,1743,2717,2585,308.518,6.40021,83.5998,99.9962
1016,1017,3843,3225,2605,326.9,0.07389069999999999,89.9261,99.9937
1017,1018,703,215,2587,298.89,68.4457,21.5543,99.9618
1018,1019,11334,798,2619,40.0625,39.4994,50.5006,99.7347
1019,1020,12622,2441,2641,155.69899999999996,32.5362,57.4638,99.9884
1020,1021,41423,313,2673,189.616,40.7123,49.2877,99.5648
1021,1022,23710,1606,2666,236.819,20.9339,69.0661,99.9927
1022,1023,11185,1411,2641,209.918,52.0135,37.9865,99.981
1023,1024,1248,1196,2603,270.232,51.6867,38.3133,99.99
1024,1025,4919,1016,2621,278.141,81.2433,8.75665,99.9852
1025,1026,787,1346,2608,102.767,6.7347600000000005,83.2652,99.9837
1026,1027,5371,3274,2638,204.265,50.4872,39.5128,99.985
1027,1028,27968,619,2704,206.863,28.584,61.416,99.9753
1028,1029,513,4251,2614,330.097,28.1515,61.8485,99.9902
1029,1030,1138,2134,2618,277.529,74.7746,15.2254,99.992
1030,1031,22963,2553,2701,282.889,54.6072,35.3928,99.9224
1031,1032,67199,2990,2875,112.594,29.1978,60.8022,95.7317
1032,1033,13597,2755,2671,223.402,81.9422,8.057830000000001,99.9477
1033,1034,578,902,2634,259.94,82.76299999999998,7.2370100000000015,99.9692
1034,1035,13266,3051,2706,125.823,50.3319,39.6681,99.9415
1035,1036,29431,3679,2775,200.341,58.4967,31.5033,99.9813
1036,1037,141178,3391,2881,301.106,44.7777,45.2223,88.6186
1037,1038,1578,3804,2651,325.964,28.1683,61.8317,99.9932
1038,1039,2752,4767,2669,41.7078,39.3332,50.6668,99.9961
1039,1040,10676,4919,2710,252.688,17.5201,72.4799,99.9755
1040,1041,1621,958,2664,271.54200000000003,83.2716,6.728439999999999,99.9759
1041,1042,3439,1491,2682,287.932,4.21048,85.7895,99.9905
1042,1043,3109,4865,2704,253.152,17.6538,72.3462,99.9783
1043,1044,29426,2330,2762,113.928,0.258331,89.7417,99.9861
1044,1045,687,4036,2664,121.926,28.0876,61.9124,99.9832
1045,1046,21633,1751,2756,345.235,22.5058,67.4942,99.9845
1046,1047,3279,1097,2682,238.538,24.7168,65.2832,99.9961
1047,1048,2330,781,2679,135.346,59.4969,30.5031,99.9871
1048,1049,5313,2851,2704,23.4679,25.1088,64.8912,99.9978
1049,1050,16299,1004,2736,334.964,4.78106,85.2189,99.9767
1050,1051,4340,3774,2689,69.3582,71.1424,18.8576,99.9528
1051,1052,2593,3866,2688,330.41,26.2501,63.7499,99.9977
1052,1053,2693,3919,2700,117.475,29.0679,60.9321,99.9951
1053,1054,5821,877,2694,46.4036,52.1503,37.8497,99.9917
1054,1055,50399,2028,2773,39.3718,67.744,22.256,92.0268
1055,1056,5989,1220,2716,205.191,58.7856,31.2144,99.945
1056,1057,13914,3554,2773,229.201,61.2369,28.7631,99.9491
1057,1058,29594,4759,2771,266.78700000000003,59.7234,30.2766,99.9319
1058,1059,2246,1374,2714,70.2051,2.84205,87.15799999999999,99.9834
1059,1060,16892,4081,2750,333.481,29.0553,60.9447,99.9543
1060,1061,2146,3984,2702,296.181,67.7135,22.2865,99.9351
1061,1062,3742,1321,2723,215.259,36.6385,53.3615,99.99
1062,1063,2350,2663,2716,106.117,44.6314,45.3686,99.9886
1063,1064,20268,4263,2766,102.64,56.4203,33.5797,99.9556
1064,1065,2083,1145,2715,327.805,43.3909,46.6091,99.9977
1065,1066,35405,4453,2824,92.1225,45.4726,44.5274,98.3156
1066,1067,4430,1440,2736,162.58,54.7375,35.2625,99.986
1067,1068,4896,3820,2747,259.038,51.5847,38.4153,99.9831
1068,1069,5282,1650,2754,41.5612,62.1301,27.8699,99.9934
1069,1070,50603,879,2865,231.787,9.51609,80.4839,75.1069
1070,1071,689,3761,2734,326.6790000000001,27.6306,62.3694,99.9974
1071,1072,1416,775,2742,189.1,66.9506,23.0494,99.9841
1072,1073,6305,3956,2770,263.728,69.2571,20.7429,99.746
1073,1074,3919,214,2783,120.263,19.938,70.062,99.9791
1074,1075,856,187,2754,120.052,19.254,70.74600000000002,99.975
1075,1076,3200,2823,2766,71.5909,58.8733,31.1267,99.9939
1076,1077,588,1279,2753,235.523,28.2415,61.7585,99.9682
1077,1078,11713,723,2848,107.642,27.927,62.073,99.9538
1078,1079,4568,2703,2771,9.76303,21.3443,68.6557,99.995
1079,1080,2842,3882,2775,202.57,55.3203,34.6797,99.9914
1080,1081,3628,2759,2789,109.225,54.5125,35.4875,99.9658
1081,1082,5885,438,2781,298.475,55.7793,34.2207,99.8593
1082,1083,21046,2640,2847,128.72,34.178000000000004,55.822,99.9552
1083,1084,18308,1140,2818,239.099,26.3073,63.6927,99.9471
1084,1085,2963,1330,2810,238.33,27.2701,62.7299,99.883
1085,1086,6349,1263,2802,68.4978,2.91018,87.0898,99.9893
1086,1087,20555,1384,2876,258.311,48.3425,41.6575,99.9284
1087,1088,14274,1517,2833,213.952,37.1339,52.8661,99.9638
1088,1089,2417,4687,2780,264.128,3.73447,86.2655,99.9929
1089,1090,1399,260,2776,242.251,62.5867,27.4133,99.9956
1090,1091,1468,743,2793,225.099,64.3239,25.6761,99.908
1091,1092,15581,592,2840,299.009,53.1062,36.8938,99.9732
1092,1093,3375,314,2808,254.457,49.9625,40.0375,99.9913
1093,1094,5586,1851,2825,245.158,69.9382,20.0618,99.9864
1094,1095,14753,4164,2855,327.097,21.1042,68.8958,99.9931
1095,1096,12252,3814,2871,76.6748,14.8651,75.1349,99.9922
1096,1097,1739,3076,2810,192.388,79.4371,10.5629,99.9791
1097,1098,47621,2538,2948,226.412,57.6416,32.3584,99.066
1098,1099,2171,2002,2809,97.1862,27.4124,62.5876,99.9664
1099,1100,6927,2799,2846,99.4948,48.3037,41.6963,99.9827
1100,1101,3800,4930,2845,252.387,55.0819,34.9181,99.8711
1101,1102,33355,1693,2897,329.023,60.2967,29.7033,99.9905
1102,1103,2230,172,2847,321.52,22.3107,67.6893,99.9752
1103,1104,12418,4672,2864,237.983,70.9724,19.0276,99.9587
1104,1105,5731,2206,2851,282.654,68.2729,21.7271,99.971
1105,1106,1617,251,2833,140.13299999999998,46.6666,43.3334,99.9904
1106,1107,1043,467,2817,299.374,55.3422,34.6578,99.8145
1107,1108,6864,3918,2852,25.0522,43.341,46.659,99.9817
1108,1109,2247,2519,2837,303.369,65.8773,24.1227,99.9828
1109,1110,4949,4037,2853,207.649,58.3167,31.6833,99.9852
1110,1111,9338,399,2871,269.85900000000004,49.236,40.764,99.9407
1111,1112,28269,1065,2949,99.7052,34.3594,55.6406,99.8819
1112,1113,2271,4577,2863,329.934,10.9521,79.0479,99.9437
1113,1114,13608,4329,2908,39.8056,1.14274,88.8573,99.9901
1114,1115,12690,3655,2897,30.9647,42.4664,47.5336,99.9512
1115,1116,1561,4844,2849,45.9604,37.5,52.5,99.9624
1116,1117,1300,474,2852,256.809,89.193,0.806971,99.9855
1117,1118,1777,303,2862,279.303,70.624,19.376,99.9959
1118,1119,1239,4885,2860,48.69,41.1298,48.8702,99.9458
1119,1120,9101,3145,2899,161.106,71.1507,18.8493,99.9782
1120,1121,2668,1281,2872,67.4673,4.88474,85.1153,99.983
1121,1122,5655,2298,2900,129.609,68.4261,21.5739,99.785
1122,1123,11361,2018,2923,312.615,29.7145,60.2855,99.9917
1123,1124,1085,1902,2872,236.103,44.2974,45.7026,99.9943
1124,1125,6231,2744,2914,229.353,41.4845,48.5155,99.9815
1125,1126,16929,301,2986,338.85,58.7384,31.2616,99.4803
1126,1127,7717,1235,2923,334.3590000000001,43.5931,46.4069,99.9726
1127,1128,38394,4000,2967,87.9956,7.457910000000001,82.5421,99.8275
1128,1129,53656,551,3014,23.6616,47.1181,42.8819,99.9618
1129,1130,57540,4697,2994,95.8313,37.4128,52.5872,99.8135
1130,1131,4853,193,2925,332.226,59.3322,30.6678,99.9412
1131,1132,9556,2369,2945,290.022,64.8754,25.1246,99.9757
1132,1133,1465,2105,2898,127.559,74.3152,15.6848,99.987
1133,1134,2746,311,2910,270.29,47.6321,42.3679,99.9799
1134,1135,8885,631,2932,354.73800000000006,10.7868,79.2132,99.9058
1135,1136,43482,2166,3012,272.367,67.4991,22.5009,47.9589
1136,1137,947,4906,2914,0.20303,64.7821,25.2179,99.9842
1137,1138,2798,1897,2926,43.6124,30.5566,59.4434,99.9861
1138,1139,1445,4258,2917,297.8640000000001,4.20341,85.7966,99.9966
1139,1140,2864,4939,2945,237.372,28.6774,61.3226,99.9864
1140,1141,4900,1496,2944,219.958,25.9532,64.0468,99.9026
1141,1142,1057,4890,2947,91.7547,37.1623,52.8377,99.9869
1142,1143,2702,2131,2943,206.699,13.6016,76.3984,99.9944
1143,1144,602,2805,2913,323.241,12.7148,77.2852,99.9971
1144,1145,5301,4209,2947,109.656,57.4955,32.5045,99.9912
1145,1146,12632,3355,3002,54.8957,69.2423,20.7577,99.7051
1146,1147,7101,1822,2966,342.181,23.8719,66.1281,99.9876
1147,1148,1355,2087,2941,296.611,48.3868,41.6132,99.9885
1148,1149,1069,1446,2948,197.83900000000003,23.0885,66.9115,99.9665
1149,1150,1426,1550,2951,195.041,17.605,72.395,99.9954
1150,1151,1394,3236,2953,297.154,36.4874,53.5126,99.9807
1151,1152,684,2824,2957,323.557,12.9028,77.0972,99.9938
1152,1153,3771,3287,2972,158.379,72.3183,17.6817,99.972
1153,1154,47674,4242,3049,281.152,13.4595,76.5405,78.5355
1154,1155,45734,1263,3066,252.954,54.088,35.912,99.8751
1155,1156,1049,1932,2968,342.955,23.5717,66.4283,99.971
1156,1157,29566,3735,3072,332.131,31.8753,58.1247,99.9598
1157,1158,1084,147,2988,313.442,40.2393,49.7607,99.6528
1158,1159,20269,832,3040,153.293,23.8678,66.1322,99.9792
1159,1160,13523,2974,3021,62.4498,67.42,22.58,99.5158
1160,1161,6602,186,3028,292.565,53.1384,36.8616,99.6802
1161,1162,5094,3203,3004,348.594,47.1949,42.8051,99.9688
1162,1163,10667,1535,3037,291.916,48.4643,41.5357,99.8252
1163,1164,48677,1787,3094,111.545,8.26636,81.7336,85.5607
1164,1165,1190,2783,2991,119.721,49.159,40.841,99.9882
1165,1166,4014,2844,3009,355.216,32.7644,57.2356,99.9882
1166,1167,3049,4489,3013,70.9075,77.1033,12.8967,99.9704
1167,1168,8240,1433,3087,136.168,25.3568,64.6432,99.9284
1168,1169,2639,4901,3034,92.8954,36.8224,53.1776,99.9876
1169,1170,523,1636,3000,194.093,17.9637,72.0363,99.9905
1170,1171,97508,2428,3222,178.12900000000005,13.6087,76.3913,93.7156
1171,1172,1814,235,3039,290.66,53.2708,36.7292,99.9909
1172,1173,1727,3277,3025,308.4290000000001,57.7046,32.2954,99.9923
1173,1174,2748,1615,3051,45.4181,81.0009,8.999139999999997,99.6322
1174,1175,1124,2765,3039,296.585,18.9329,71.0671,99.9629
1175,1176,4268,3623,3077,146.279,70.9391,19.0609,99.4944
1176,1177,3429,1395,3061,291.9770000000001,46.277,43.723,99.9892
1177,1178,6889,2826,3065,276.928,73.4706,16.5294,99.4906
1178,1179,1100,940,3053,127.862,21.3099,68.6901,99.9959
1179,1180,69700,3181,3243,169.234,40.3448,49.6552,98.9117
1180,1181,1523,2702,3057,170.71099999999996,44.29600000000001,45.70399999999999,99.9801
1181,1182,10938,3899,3106,198.008,75.6603,14.3397,99.7221
1182,1183,861,4945,3070,105.78,61.0126,28.9874,98.6164
1183,1184,4180,1008,3083,344.004,46.0811,43.9189,99.9968
1184,1185,2440,4485,3067,256.276,63.6459,26.3541,99.8203
1185,1186,28199,1849,3204,20.1354,49.4684,40.5316,99.6911
1186,1187,1303,1100,3075,117.895,27.4154,62.5846,99.9759
1187,1188,21269,2595,3116,46.9935,56.9087,33.0913,99.9776
1188,1189,3259,3267,3084,59.8178,62.544,27.456,99.9853
1189,1190,6661,775,3125,13.5547,25.9204,64.0796,99.9568
1190,1191,51916,2820,3176,210.382,45.4046,44.5954,99.9781
1191,1192,91769,491,3217,184.93,1.42171,88.5783,99.8594
1192,1193,687,2482,3088,51.8633,57.598,32.402,99.9702
1193,1194,43289,4492,3198,351.103,54.7944,35.2056,99.8908
1194,1195,2783,2140,3104,176.775,13.0435,76.9565,99.983
1195,1196,4606,244,3122,191.008,45.8781,44.1219,99.9642
1196,1197,20767,1581,3146,17.9627,54.5175,35.4825,99.9914
1197,1198,1857,3379,3098,297.585,56.4005,33.5995,99.9599
1198,1199,26330,4753,3164,155.065,36.0855,53.9145,99.9973
1199,1200,2267,940,3113,342.997,45.5212,44.4788,99.9677
1200,1201,1313,4132,3103,64.4489,54.2708,35.7292,99.995
1201,1202,15451,4907,3199,344.7530000000001,56.4284,33.5716,99.9516
1202,1203,4328,4394,3122,299.625,39.0608,50.9392,99.9928
1203,1204,8907,2216,3157,80.485,51.3774,38.6226,99.9828
1204,1205,1813,3341,3121,297.851,59.0079,30.9921,99.9867
1205,1206,53599,1046,3234,13.74,6.776860000000001,83.2231,99.8306
1206,1207,1546,712,3123,330.344,79.2005,10.7995,99.981
1207,1208,2917,192,3140,33.9338,36.8404,53.1596,99.9443
1208,1209,62448,2038,3261,335.682,2.27831,87.7217,99.9594
1209,1210,6157,3297,3164,109.621,56.3841,33.6159,99.9691
1210,1211,4352,4307,3153,61.8408,56.9932,33.0068,99.9616
1211,1212,737,4199,3130,64.9863,52.9022,37.0978,99.9848
1212,1213,2888,4030,3141,314.132,82.0585,7.94147,99.9963
1213,1214,15328,4095,3185,314.1140000000001,67.0699,22.9301,99.9901
1214,1215,11608,836,3206,185.01,36.2079,53.7921,99.9698
1215,1216,9331,1369,3196,330.907,40.4043,49.5957,99.9913
1216,1217,2169,3034,3175,53.2422,58.3595,31.6405,99.9893
1217,1218,51637,3476,3298,221.146,39.8323,50.1677,74.4226
1218,1219,2199,737,3182,307.12,52.4069,37.5931,99.9955
1219,1220,2861,3896,3181,280.642,87.6114,2.3886,99.9494
1220,1221,3083,4204,3196,64.221,57.3869,32.6131,99.9979
1221,1222,4697,3635,3194,37.5523,26.7951,63.2049,99.961
1222,1223,3539,3830,3201,221.06,59.2849,30.7151,99.9944
1223,1224,60713,3738,3341,12.6117,38.6587,51.3413,99.7721
1224,1225,3505,4377,3194,27.4612,73.3743,16.6257,99.9959
1225,1226,4815,906,3199,313.926,56.3217,33.6783,99.9919
1226,1227,12130,190,3262,170.68,74.2912,15.7088,99.9645
1227,1228,15233,1459,3283,234.206,21.7466,68.2534,99.7218
1228,1229,5350,4268,3217,180.797,31.0263,58.9737,99.9946
1229,1230,11715,3945,3247,341.338,48.1961,41.8039,88.6796
1230,1231,894,1285,3204,42.9415,49.43,40.57,99.9894
1231,1232,3804,1520,3234,14.5885,64.1653,25.8348,99.9834
1232,1233,4218,2931,3226,132.05200000000002,60.6646,29.3354,99.9146
1233,1234,686,4342,3216,68.5747,56.8106,33.1894,99.987
1234,1235,4122,1240,3237,113.791,75.148,14.852,99.9895
1235,1236,13824,4687,3266,350.222,75.3641,14.6359,99.9816
1236,1237,2390,1593,3226,350.889,55.1475,34.8525,99.9938
1237,1238,1170,715,3234,8.24592,6.46632,83.5337,99.9948
1238,1239,12964,1346,3311,338.0680000000001,77.1229,12.8771,99.9672
1239,1240,785,4844,3241,237.933,46.0696,43.9304,99.9879
1240,1241,8677,2988,3292,346.441,32.1818,57.8182,99.9857
1241,1242,26644,815,3346,99.9643,49.0874,40.9126,99.9799
1242,1243,1521,4047,3249,228.846,59.308,30.692,99.9857
1243,1244,22630,1664,3323,288.177,4.47572,85.5243,99.9926
1244,1245,61686,4014,3379,249.993,52.1277,37.8723,99.7322
1245,1246,7293,2840,3300,117.889,46.2314,43.7686,99.9906
1246,1247,7689,4839,3298,345.342,53.5127,36.4873,99.9914
1247,1248,5010,1559,3301,19.8639,55.4193,34.5807,99.9843
1248,1249,13855,2885,3387,228.249,45.049,44.951,99.9518
1249,1250,9255,4563,3319,76.8583,58.5012,31.4988,99.961
1250,1251,20372,1236,3339,281.555,60.1808,29.8192,99.9761
1251,1252,6202,3609,3322,143.115,57.4686,32.5314,99.9941
1252,1253,999,4937,3314,313.397,67.8232,22.1768,99.9785
1253,1254,7558,4290,3315,170.583,76.0076,13.9924,99.9903
1254,1255,15713,4387,3361,308.726,43.6579,46.3421,99.9105
1255,1256,25858,252,3381,0.9003260000000001,82.719,7.28095,99.96
1256,1257,1174,360,3328,5.0658699999999985,0.0301514,89.9698,99.9915
1257,1258,11358,477,3364,143.444,48.5676,41.4324,99.9672
1258,1259,11971,2293,3345,189.475,77.8958,12.1042,99.9814
1259,1260,3750,4194,3342,196.775,74.4938,15.5062,99.9888
1260,1261,40665,4687,3408,224.441,58.8614,31.1386,99.8939
1261,1262,1918,2754,3337,172.812,32.7732,57.2268,99.9971
1262,1263,27146,1610,3410,236.579,63.4727,26.5273,99.8568
1263,1264,12242,3346,3400,245.115,15.5768,74.4232,99.8932
1264,1265,17005,2141,3414,312.389,45.0939,44.9061,99.8828
1265,1266,22452,3099,3420,318.259,39.4043,50.5957,99.9243
1266,1267,1659,1862,3351,177.6,1.44954,88.5505,99.998
1267,1268,20379,595,3435,341.289,38.4105,51.5895,99.9242
1268,1269,1855,1882,3377,356.772,0.567398,89.4326,99.9768
1269,1270,5917,1054,3370,320.098,61.3792,28.6208,99.9828
1270,1271,3348,2627,3373,33.5364,57.6552,32.3448,99.9944
1271,1272,671,4936,3363,21.9186,61.1507,28.8493,99.9891
1272,1273,2051,2819,3365,50.8142,56.5905,33.4095,99.9673
1273,1274,4489,4860,3391,300.732,3.27869,86.7213,99.9955
1274,1275,1847,2752,3377,54.3339,56.8322,33.1678,99.9917
1275,1276,686,2230,3377,12.6362,71.9263,18.0737,99.9782
1276,1277,519,4907,3377,320.221,55.834,34.166,99.9906
1277,1278,9842,968,3428,10.7509,51.473,38.527,99.8457
1278,1279,20078,2342,3442,254.526,12.9181,77.0819,99.8063
1279,1280,966,1141,3377,137.468,18.5446,71.4554,99.9909
1280,1281,1995,2560,3386,43.9451,68.8998,21.1002,99.9935
1281,1282,648,401,3387,345.153,54.6428,35.3572,99.9212
1282,1283,1199,4514,3392,88.98700000000002,58.7336,31.2664,99.969
1283,1284,9739,4197,3427,172.953,65.163,24.837,99.9645
1284,1285,1879,724,3409,7.74638,8.6174,81.3826,99.9939
1285,1286,2794,2714,3409,53.4541,47.4216,42.5784,99.9445
1286,1287,1556,1367,3406,39.9254,82.1085,7.8915,99.9721
1287,1288,12761,2975,3452,107.644,1.6487,88.3513,99.6736
1288,1289,590,2802,3398,288.144,44.7807,45.2193,99.9928
1289,1290,8804,1119,3439,8.83457,52.5253,37.4747,99.8457
1290,1291,14104,1883,3444,357.163,0.30925,89.6908,99.9383
1291,1292,1952,2494,3408,134.58100000000002,50.1042,39.8958,99.9964
1292,1293,3030,3465,3423,196.61900000000003,88.3267,1.67328,99.944
1293,1294,11178,4470,3455,146.476,54.6418,35.3582,99.826
1294,1295,8013,4310,3454,115.101,63.0576,26.9424,99.97
1295,1296,520,2243,3405,30.2472,73.4634,16.5366,99.9712
1296,1297,9814,4875,3454,298.639,3.4351,86.5649,99.9356
1297,1298,3359,2582,3427,53.9163,71.3559,18.6441,99.9267
1298,1299,10765,406,3467,1.1495,3.55686,86.4431,99.9451
1299,1300,8033,3268,3455,109.079,73.5049,16.4951,99.9482
1300,1301,2816,1215,3437,308.752,55.212,34.788000000000004,99.9496
1301,1302,5057,1398,3465,53.8234,85.5195,4.48045,99.9624
1302,1303,15017,2710,3462,58.2161,49.0515,40.9485,99.9536
1303,1304,608,1771,3433,131.422,8.18798,81.812,99.9547
1304,1305,1794,715,3446,7.967739999999999,9.67367,80.3263,99.9866
1305,1306,3849,1253,3463,277.585,56.2797,33.7203,99.9746
1306,1307,3068,2490,3463,138.154,48.3138,41.6862,99.9668
1307,1308,7120,850,3463,105.012,48.5312,41.4688,99.978
1308,1309,806,2022,3441,110.267,77.1166,12.8834,99.9879
1309,1310,4865,190,3468,131.352,41.1008,48.8992,99.9839
1310,1311,3833,1324,3469,227.646,21.3651,68.6349,99.9805
1311,1312,2719,2554,3478,317.686,38.9287,51.0713,99.9725
1312,1313,6986,1571,3481,305.634,42.7916,47.2084,99.9514
1313,1314,2188,1748,3477,170.52599999999995,64.6123,25.3877,99.958
1314,1315,1953,3387,3480,344.49300000000005,36.9412,53.0588,99.8962
1315,1316,2049,770,3483,355.034,70.0758,19.9242,99.9145
1316,1317,507,4108,3482,255.343,59.6071,30.3929,99.9601
1317,1318,800,2063,3484,115.925,76.6155,13.3845,99.989
1318,1319,1025,1006,3486,216.282,67.3019,22.6981,99.7506
1319,1320,2386,4196,3490,83.8129,61.3848,28.6152,99.9369
