,Grain No.,Size [Pixel],center x-coordinate,center y-coordinate,mean azimuth [degree],mean latitude [degree],mean colatitude [degree],Regelungsgrad [%]
0,1,1498,2470,48,91.4147,47.8996,42.1004,99.7832
1,2,15294,2518,95,96.7138,47.8821,42.1179,99.6534
2,3,13863,2745,99,102.743,44.3908,45.6092,99.9296
3,4,567,2820,53,281.351,48.4701,41.5299,99.9953
4,5,6315,2908,75,99.2426,44.7077,45.2923,99.9466
5,6,1523,2633,81,98.2839,43.3068,46.6932,99.9478
6,7,42777,2211,139,102.183,5.55005,84.45,99.5409
7,8,8487,3018,108,340.0080000000001,85.6892,4.3108,99.8914
8,9,2864,3089,76,273.02,38.779,51.221,99.9684
9,10,5115,3187,93,270.291,37.8206,52.1794,99.937
10,11,925,3290,66,267.78700000000003,33.2163,56.7837,99.9949
11,12,807,3377,84,262.336,77.0759,12.9241,99.9801
12,13,820,3516,102,101.393,13.3318,76.6682,99.6687
13,14,18657,3298,175,274.009,17.2217,72.7783,99.8313
14,15,21436,2751,234,270.539,57.2596,32.7404,99.8337
15,16,2736,3129,133,288.9770000000001,53.2127,36.7873,99.9829
16,17,15019,3010,207,282.648,53.1594,36.8406,99.5144
17,18,586,2579,133,100.237,41.26300000000001,48.737,99.9696
18,19,3500,2627,156,278.087,56.9038,33.0962,99.9814
19,20,9579,1859,178,265.248,38.0206,51.9794,99.9595
20,21,6034,2876,178,272.31,48.4345,41.5655,99.9812
21,22,4777,1971,168,266.577,69.3152,20.6848,99.794
22,23,14528,3499,257,88.8582,19.9605,70.0395,98.8475
23,24,923,3084,162,112.965,50.4794,39.5206,99.9763
24,25,572,3171,156,74.4095,84.4828,5.5172,99.9918
25,26,11328,2438,203,261.731,66.1873,23.8127,99.4199
26,27,1600,2571,189,103.77,7.60076,82.3992,99.9361
27,28,546,3142,175,269.885,36.7193,53.2807,99.9923
28,29,4588,2073,232,98.4581,3.20184,86.7982,99.8732
29,30,612,3186,192,267.876,35.3183,54.6817,99.9934
30,31,20320,3163,284,293.497,54.2744,35.7256,99.8617
31,32,528,2368,203,282.33,63.2862,26.7138,99.9847
32,33,1237,2176,219,98.5048,12.5247,77.4753,99.9405
33,34,24639,3356,296,92.2969,18.0155,71.9845,99.8665
34,35,7859,1752,262,95.6848,44.1591,45.8409,99.9725
35,36,5494,2310,238,288.456,65.4739,24.5261,99.8942
36,37,3934,1930,246,273.47900000000004,55.6191,34.3809,99.9875
37,38,5309,2016,276,282.506,55.2609,34.7391,99.562
38,39,7425,2590,247,103.446,12.6814,77.3186,99.9453
39,40,3307,1843,263,268.92900000000003,48.352,41.648,99.9902
40,41,580,2889,241,269.198,48.4059,41.5941,99.9922
41,42,2136,2177,265,98.5801,16.7682,73.2318,99.962
42,43,6216,2240,279,275.72,50.3138,39.6862,99.9792
43,44,9309,2497,301,262.432,19.7593,70.2407,98.7102
44,45,6374,2963,320,266.282,10.3731,79.6269,63.322
45,46,1234,2893,269,108.657,41.4761,48.5239,99.9848
46,47,656,2827,273,111.193,44.2666,45.7334,99.9885
47,48,6450,2120,306,286.085,2.71294,87.2871,99.9741
48,49,5600,2635,311,101.068,10.0845,79.9155,99.9794
49,50,848,1876,295,273.275,55.4981,34.5019,99.9953
50,51,6578,1456,315,98.2799,1.40218,88.5978,99.6073
51,52,1904,1709,304,101.649,46.6847,43.3153,99.9341
52,53,976,1661,310,256.791,69.1454,20.8546,99.9874
53,54,3658,2854,317,262.29200000000003,57.8186,32.1814,99.9758
54,55,12302,2352,335,117.218,36.5614,53.4386,99.9556
55,56,881,2908,309,282.097,6.911580000000002,83.0884,99.9926
56,57,4466,1578,318,258.78,75.1192,14.8808,99.9623
57,58,7761,1938,329,279.905,49.4376,40.5624,99.8009
58,59,31014,1432,416,154.314,68.5654,21.4346,99.9335
59,60,4605,3051,342,97.7957,17.3722,72.6278,99.9685
60,61,2001,2229,341,269.707,41.7552,48.2448,99.9473
61,62,12015,1265,402,219.158,73.7511,16.2489,99.9403
62,63,585,1827,342,89.5171,6.578130000000002,83.4219,99.9695
63,64,4213,1553,364,247.423,74.65,15.35,99.8611
64,65,8447,1743,402,92.0765,27.903,62.097,99.9483
65,66,20777,1953,420,279.388,49.2688,40.7312,99.4509
66,67,4644,1634,395,282.555,24.5583,65.4417,99.9799
67,68,893,2631,376,107.943,25.3354,64.6646,99.9795
68,69,2813,1058,406,291.226,4.59007,85.4099,99.8951
69,70,1282,3412,392,91.4185,18.1671,71.8329,99.9462
70,71,2489,3316,403,94.184,17.8849,72.1151,99.9671
71,72,543,2968,391,86.5756,18.2575,71.7425,99.9608
72,73,836,3459,413,254.909,62.1378,27.8622,99.9775
73,74,1267,3170,427,285.6,52.9441,37.0559,99.9688
74,75,1236,3247,412,280.681,34.5847,55.4153,99.988
75,76,707,970,414,101.56,17.8051,72.1949,99.8152
76,77,13549,1134,476,113.108,30.0704,59.9296,99.7798
77,78,2273,3357,423,93.1469,18.033,71.967,99.9845
78,79,985,3507,441,113.613,26.2184,63.7816,99.2585
79,80,19762,841,525,108.809,20.6957,69.3043,99.9274
80,81,5673,3420,457,254.713,61.1425,28.8575,99.9412
81,82,3771,1011,450,115.681,20.6237,69.3763,99.1562
82,83,9459,2118,489,116.076,61.8592,28.1408,99.4283
83,84,1246,1697,463,104.313,44.3716,45.6284,99.9797
84,85,1020,888,451,108.1,20.5784,69.4216,99.985
85,86,543,3277,452,256.93,65.488,24.512,99.9712
86,87,4285,3310,486,272.493,21.4916,68.5084,99.8092
87,88,19217,1593,543,261.067,76.337,13.6631,97.8396
88,89,20356,703,553,274.29,70.4969,19.5031,98.957
89,90,27494,1308,559,128.312,58.9564,31.0436,99.3499
90,91,61894,1838,571,268.888,15.4929,74.5071,95.7974
91,92,1360,3168,477,270.712,31.2617,58.7383,99.9279
92,93,560,1270,480,185.83900000000003,76.2352,13.7648,99.992
93,94,7551,3093,511,121.043,41.7283,48.2717,99.8325
94,95,527,1326,478,108.135,29.118,60.882,99.9548
95,96,13079,3229,546,275.133,22.2027,67.7973,99.8095
96,97,7402,945,520,215.151,79.7182,10.2818,98.4917
97,98,1065,1017,488,118.763,19.9579,70.0421,99.5187
98,99,1056,595,505,282.608,20.8248,69.1752,99.8821
99,100,7276,3414,526,266.872,30.8195,59.1805,99.718
100,101,843,2865,503,288.6040000000001,61.1277,28.8723,99.8322
101,102,46885,501,618,98.509,20.7561,69.2439,98.9837
102,103,1996,1435,531,268.06,13.5886,76.4114,99.9587
103,104,4815,2753,554,270.657,61.3684,28.6316,99.5734
104,105,163276,2115,825,100.724,2.40471,87.5953,99.3145
105,106,14400,1013,600,106.407,17.2497,72.7503,98.9134
106,107,667,2854,541,301.43,45.9365,44.0635,99.8872
107,108,56545,2964,690,284.749,45.6464,44.3536,99.5364
108,109,1489,3134,551,275.698,32.8803,57.1197,99.7807
109,110,1515,361,551,96.6547,12.9751,77.0249,99.9668
110,111,718,3514,553,115.288,27.4202,62.5798,99.7281
111,112,15688,2267,657,97.4255,9.27319,80.7268,99.9486
112,113,51581,3316,746,262.947,57.3536,32.6464,99.8147
113,114,3555,1455,586,273.434,11.7095,78.2905,99.6814
114,115,25017,1127,661,276.621,52.1252,37.8748,99.9494
115,116,743,3499,592,276.343,58.1673,31.8327,99.4925
116,117,2642,314,596,293.267,72.7275,17.2725,99.8821
117,118,2106,3337,613,274.594,58.1157,31.8843,99.9779
118,119,19422,3173,663,274.273,0.871964,89.12799999999999,99.8582
119,120,582,2606,598,296.969,62.6157,27.3843,99.9449
120,121,16729,893,677,103.595,24.7644,65.2356,99.915
121,122,33587,1464,719,271.276,19.9082,70.0918,98.7168
122,123,880,2663,631,338.749,64.4919,25.5081,99.9066
123,124,2963,763,678,264.932,70.8916,19.1084,99.9674
124,125,5316,1687,685,280.708,50.5555,39.4445,99.9367
125,126,15972,1810,733,263.706,14.4801,75.5199,99.926
126,127,3064,1596,659,285.437,14.3341,75.6659,99.9313
127,128,1052,1349,656,121.103,64.5219,25.4781,99.9943
128,129,39468,2420,754,276.887,3.05756,86.9424,99.0153
129,130,1023,671,662,284.902,34.8101,55.1899,99.9948
130,131,27066,2680,716,283.0440000000001,18.4025,71.5975,99.7315
131,132,4659,405,686,89.1628,0.0166092,89.9834,99.985
132,133,748,1320,683,105.951,34.4186,55.5814,99.9888
133,134,3978,665,710,300.556,71.3249,18.6751,99.6844
134,135,20834,801,806,303.611,74.6347,15.3653,99.8411
135,136,4401,328,720,95.5469,1.41961,88.5804,99.9759
136,137,966,1328,721,98.887,30.9178,59.0822,99.9362
137,138,2296,1265,729,268.134,52.2287,37.7713,99.9674
138,139,4277,643,760,277.98,73.43,16.57,99.9873
139,140,695,1001,735,285.231,48.9343,41.0657,99.2954
140,141,101288,1603,919,281.9770000000001,18.2655,71.7345,99.4278
141,142,6474,520,767,275.036,65.3713,24.6287,99.6456
142,143,824,1693,743,114.417,48.0316,41.9684,99.996
143,144,10635,370,846,246.785,76.2256,13.7744,99.7085
144,145,7434,1178,788,126.971,59.3137,30.6863,99.9215
145,146,41791,1014,859,110.923,14.9432,75.0568,99.1291
146,147,15623,1291,830,95.9138,26.7662,63.2338,99.958
147,148,3642,2652,800,102.259,31.8082,58.1918,99.9895
148,149,4696,3099,797,115.487,41.7914,48.2086,99.9864
149,150,1126,423,777,262.177,76.8576,13.1424,99.9864
150,151,16157,2728,834,98.2773,14.8291,75.1709,99.9758
151,152,3056,1089,794,103.177,28.0238,61.9762,99.9849
152,153,7606,3440,840,261.906,43.0723,46.9277,99.9889
153,154,10930,483,877,255.773,71.8089,18.1911,99.8109
154,155,525,2582,813,266.245,48.51600000000001,41.484,99.9936
155,156,2549,2583,841,267.874,33.3498,56.6502,99.9782
156,157,12481,2924,888,119.785,43.3617,46.6383,99.8906
157,158,7995,1821,872,86.6419,15.2833,74.7167,99.9733
158,159,14096,3071,901,109.305,13.9705,76.0295,99.9504
159,160,19957,669,923,280.277,66.6852,23.3148,99.413
160,161,943,2827,842,103.249,27.5051,62.4949,99.9947
161,162,9267,2431,902,253.273,50.0191,39.9809,99.9264
162,163,4943,3353,881,104.437,35.4093,54.5907,99.9542
163,164,2778,1205,865,99.5437,26.6271,63.3729,99.9772
164,165,837,603,871,265.871,73.383,16.617,99.9965
165,166,12242,1384,949,116.699,52.6212,37.3788,99.6398
166,167,1160,3503,887,101.249,24.8947,65.1053,99.8295
167,168,2760,2828,899,103.1,33.8504,56.1496,99.9784
168,169,5132,2601,909,281.972,27.5297,62.4703,99.9694
169,170,4181,1243,945,274.991,11.1305,78.8695,99.8987
170,171,3321,2524,907,101.595,16.9547,73.0453,99.9037
171,172,10646,325,958,272.529,58.5398,31.4602,67.6531
172,173,26852,2727,977,104.688,18.8454,71.1546,99.7966
173,174,9830,3181,936,106.149,0.881668,89.1183,99.9747
174,175,965,3271,899,253.507,59.4515,30.5485,99.9931
175,176,1012,600,920,254.787,70.5608,19.4392,99.985
176,177,1045,3310,920,116.374,62.9182,27.0818,99.9925
177,178,684,3430,913,93.8805,3.13987,86.8601,99.987
178,179,33323,1151,1075,110.601,64.7449,25.2551,99.0016
179,180,932,564,917,120.632,73.253,16.747,99.9914
180,181,2486,3008,943,111.328,20.6701,69.3299,99.7942
181,182,2789,3474,939,116.439,66.2057,23.7943,99.8597
182,183,21320,878,990,125.706,61.5325,28.4675,98.8912
183,184,31687,3362,1035,266.333,62.457,27.543000000000006,98.0995
184,185,2879,1858,949,115.78,41.8224,48.1776,99.9831
185,186,1684,458,949,88.0807,3.59431,86.4057,99.9794
186,187,20370,1913,1068,107.955,43.3257,46.6743,99.227
187,188,619,767,958,104.937,14.6607,75.3393,99.988
188,189,3289,2577,986,268.595,50.6157,39.3843,99.9758
189,190,20530,402,1045,269.185,0.7166899999999999,89.2833,99.7416
190,191,10998,1026,1007,178.128,78.2048,11.7952,98.5893
191,192,46941,1342,1111,281.927,0.0985641,89.9014,99.8252
192,193,2433,1900,988,85.7582,12.6059,77.3941,99.9826
193,194,2141,522,988,140.50799999999998,68.5605,21.4395,99.5481
194,195,4514,2435,1000,87.0301,8.20533,81.7947,99.9047
195,196,1945,3508,1001,121.436,66.7017,23.2983,99.7895
196,197,731,1810,982,252.717,48.9548,41.0452,99.9779
197,198,1825,2921,1003,119.829,41.8643,48.1357,99.9776
198,199,24363,3117,1065,270.865,72.1782,17.8218,98.3727
199,200,1017,3194,1000,128.907,55.9377,34.0623,99.9687
200,201,18101,2779,1097,284.553,59.2287,30.7713,99.1836
201,202,1147,1823,1019,103.281,24.8765,65.1235,99.8431
202,203,3721,2539,1039,104.0,18.0897,71.9103,99.7865
203,204,812,2358,1020,258.887,48.3031,41.6969,99.484
204,205,13162,716,1050,106.357,14.5123,75.4877,99.9396
205,206,833,2038,1029,271.186,53.0354,36.9646,98.9997
206,207,38520,2947,1143,97.4242,12.8963,77.1037,98.9577
207,208,4266,584,1057,291.651,70.0462,19.9538,99.8968
208,209,8961,2012,1103,281.822,55.5272,34.4728,99.6673
209,210,13901,2472,1112,93.8696,9.90328,80.0967,98.8897
210,211,16572,2326,1138,263.566,40.2929,49.7071,99.9648
211,212,9179,1499,1105,106.307,27.1414,62.8586,98.8634
212,213,853,3471,1086,104.916,35.9733,54.0267,99.9239
213,214,961,2277,1076,112.516,46.5518,43.4482,99.9872
214,215,45489,2606,1227,111.238,22.5153,67.4847,99.9289
215,216,888,3234,1098,273.732,55.083,34.917,99.9807
216,217,10998,1754,1127,104.843,25.6292,64.3708,99.8883
217,218,880,1015,1088,245.957,75.3955,14.6045,99.9827
218,219,20929,787,1193,96.2117,34.755,55.245,99.7977
219,220,2118,932,1108,89.7136,15.595999999999998,74.404,99.9706
220,221,3715,3307,1125,276.432,54.6767,35.3233,99.9617
221,222,2446,552,1111,278.775,0.705376,89.2946,99.9903
222,223,41293,441,1344,266.801,69.1962,20.8038,81.3052
223,224,2881,2098,1119,272.41,19.7483,70.2517,99.9759
224,225,4998,2201,1120,275.568,54.2133,35.7867,99.9579
225,226,2340,883,1128,168.977,87.7377,2.26226,99.9924
226,227,2546,602,1129,95.8042,66.3655,23.6345,99.9869
227,228,3949,999,1138,33.5895,85.1605,4.83955,99.9804
228,229,15637,337,1209,94.4012,16.8212,73.1788,99.8649
229,230,2722,1065,1152,275.656,3.46999,86.53,99.9724
230,231,2761,691,1144,112.016,45.3603,44.6397,99.9679
231,232,5622,1663,1170,98.1552,34.0861,55.9139,99.9644
232,233,7131,3092,1188,275.83,24.0388,65.9612,99.9689
233,234,555,3368,1148,273.878,7.53733,82.4627,99.9941
234,235,11284,3212,1222,285.871,75.827,14.173,99.9566
235,236,2999,1554,1168,266.683,55.4493,34.5507,99.9859
236,237,34415,979,1257,92.2261,1.80032,88.1997,77.0794
237,238,785,2182,1177,273.627,54.1316,35.8684,99.9747
238,239,4439,617,1194,281.175,47.5158,42.4842,99.9491
239,240,950,1947,1179,93.3381,40.0361,49.9639,99.9889
240,241,18552,2049,1243,115.618,47.1408,42.8592,99.8616
241,242,9050,2800,1222,272.403,31.8216,58.1784,99.9862
242,243,517,2225,1175,277.137,69.9718,20.0282,99.9927
243,244,22115,2407,1267,259.266,31.8943,58.1057,99.8961
244,245,1379,3346,1183,281.856,81.4939,8.506110000000001,99.9962
245,246,7646,678,1227,100.761,63.4273,26.5727,99.9264
246,247,9415,1524,1235,277.35,12.9249,77.0751,99.3405
247,248,3817,1794,1222,100.702,37.5403,52.4597,99.9835
248,249,4873,1619,1241,264.196,55.3461,34.6539,99.9796
249,250,10307,2709,1257,94.7944,17.831,72.169,99.9807
250,251,1477,1207,1212,273.338,11.7491,78.2509,99.9863
251,252,832,1838,1212,106.685,50.6824,39.3176,99.8933
252,253,6926,1914,1228,263.505,56.249,33.751,99.9555
253,254,3783,1263,1227,81.6783,81.064,8.93595,99.9903
254,255,4065,2500,1270,99.487,49.5854,40.4146,99.4974
255,256,996,1318,1223,107.623,67.3288,22.6712,99.9709
256,257,619,2198,1216,277.275,67.718,22.282,99.9924
257,258,4383,1162,1263,111.2,66.0071,23.9929,99.8691
258,259,878,3397,1235,273.345,7.23305,82.76700000000002,99.9645
259,260,35395,3039,1362,110.723,36.0353,53.9647,99.5464
260,261,1180,3355,1245,260.22,80.9068,9.09316,99.992
261,262,13130,1716,1301,106.469,28.8624,61.1376,99.9602
262,263,5759,2264,1281,257.629,69.5243,20.4757,99.9709
263,264,8377,564,1285,147.878,83.1217,6.878310000000001,99.9527
264,265,1359,2253,1245,264.327,74.7116,15.2884,99.9952
265,266,3378,1842,1269,94.8891,27.0033,62.9967,99.9826
266,267,6672,3319,1299,100.356,16.8957,73.1043,99.972
267,268,1461,2143,1265,278.035,58.425,31.575,99.9908
268,269,4090,1410,1280,143.019,68.3554,21.6446,99.9692
269,270,6498,848,1312,101.46,59.7766,30.2234,99.9691
270,271,26591,3400,1412,104.207,42.4826,47.5174,99.7901
271,272,935,3373,1276,264.367,14.7227,75.2773,99.9911
272,273,11763,2881,1315,269.502,31.7191,58.2809,99.9333
273,274,4578,3148,1301,275.54200000000003,24.3685,65.6315,99.9826
274,275,15192,1272,1338,105.355,80.7502,9.24984,99.9655
275,276,7908,2169,1352,270.932,38.5319,51.4681,99.9464
276,277,5616,716,1330,281.708,19.1422,70.8578,99.9608
277,278,2718,1483,1306,113.104,51.5431,38.4569,99.4639
278,279,5353,1903,1309,249.515,66.0001,23.9999,99.9868
279,280,8753,3244,1328,99.4075,32.312,57.688,99.9813
280,281,5450,1822,1335,108.377,42.0581,47.9419,99.9829
281,282,8572,1587,1331,275.446,45.5179,44.4821,99.9251
282,283,1174,648,1296,120.371,49.2213,40.7787,99.9607
283,284,4695,347,1321,253.732,66.7073,23.2927,99.9809
284,285,21309,1133,1397,288.121,15.1908,74.8092,99.6438
285,286,26193,851,1446,106.818,63.0324,26.9676,73.8209
286,287,717,2750,1322,277.434,39.3326,50.6674,99.9901
287,288,45255,1998,1482,267.98400000000004,75.874,14.126,61.3032
288,289,925,2300,1335,238.84,71.6567,18.3433,99.9604
289,290,741,618,1332,277.386,44.2673,45.7327,99.9862
290,291,10657,658,1393,275.433,52.8195,37.1805,99.9749
291,292,10557,1430,1378,103.55,62.7459,27.2541,99.8211
292,293,2381,2240,1348,101.565,8.45464,81.5454,99.9866
293,294,2387,412,1354,133.945,71.2124,18.7876,99.9812
294,295,93321,2377,1588,268.805,15.2327,74.7673,99.5496
295,296,1141,2725,1347,277.143,43.0602,46.9398,99.9853
296,297,5192,3175,1380,281.393,46.64,43.36,99.9656
297,298,4241,2810,1381,126.698,75.1468,14.8532,99.907
298,299,1879,2105,1363,277.393,55.7643,34.2357,99.975
299,300,1908,1502,1365,278.216,10.6176,79.3824,99.5446
300,301,2804,2521,1389,270.45,33.0535,56.9465,99.9745
301,302,2602,1016,1396,294.099,23.4982,66.5018,99.9099
302,303,1130,1911,1373,273.435,59.3969,30.6031,99.9794
303,304,3730,3327,1387,260.986,10.7189,79.2811,99.9843
304,305,8969,356,1399,176.734,78.9586,11.0414,99.9806
305,306,546,533,1376,273.746,66.7271,23.2729,99.9977
306,307,41235,1717,1480,252.105,67.2495,22.7505,98.9624
307,308,2255,1582,1390,278.147,9.34657,80.6534,99.9813
308,309,3173,2631,1425,151.097,67.9121,22.0879,99.9355
309,310,1805,2568,1396,113.342,18.4747,71.5253,99.9885
310,311,5245,2713,1413,264.143,35.8688,54.1312,99.9886
311,312,1440,2242,1397,109.449,38.6949,51.3051,99.992
312,313,2545,929,1399,270.937,34.5053,55.4947,99.9711
313,314,4727,569,1440,266.709,66.7635,23.2365,99.9806
314,315,2246,1191,1406,123.046,42.7354,47.2646,99.9903
315,316,664,1876,1402,268.014,58.3288,31.6712,99.9891
316,317,2041,2785,1416,137.415,70.8785,19.1215,99.9857
317,318,1560,3262,1403,233.172,78.09100000000002,11.909,99.9887
318,319,1183,1312,1411,269.653,30.4095,59.5905,99.9815
319,320,1402,1354,1422,117.64,51.9853,38.0147,99.9907
320,321,2207,2111,1427,110.717,59.0662,30.9338,99.9617
321,322,21848,2893,1479,94.9254,23.9178,66.0822,99.6804
322,323,4682,3235,1466,97.5274,65.1146,24.8854,99.9361
323,324,10720,1418,1480,85.2023,35.8012,54.1988,99.7454
324,325,21618,1077,1516,122.336,42.611,47.389,99.1078
325,326,8369,2235,1495,105.646,40.0662,49.9338,99.6634
326,327,5487,1539,1477,277.688,29.5082,60.4918,99.4978
327,328,2007,1941,1454,100.407,45.6351,44.3649,99.9729
328,329,1324,3329,1450,98.7396,19.7177,70.2823,99.9828
329,330,10957,1279,1495,132.659,84.2837,5.71628,98.2075
330,331,79550,652,1624,102.683,13.8684,76.1316,99.64
331,332,602,851,1466,91.664,12.6412,77.3588,99.9353
332,333,37784,2673,1559,125.076,83.3187,6.681260000000001,98.162
333,334,4676,2550,1498,103.106,9.71101,80.289,99.948
334,335,8044,3192,1516,278.345,32.8644,57.1356,99.8845
335,336,2362,2160,1489,206.179,69.5652,20.4348,99.9898
336,337,3024,755,1499,279.171,15.7856,74.2144,99.9629
337,338,520,3492,1493,289.205,6.876410000000001,83.1236,99.8241
338,339,4334,3113,1518,113.768,59.2033,30.7967,99.7492
339,340,7887,1850,1558,279.202,39.2829,50.7171,99.6554
340,341,5862,3024,1546,98.9965,18.3307,71.6693,99.9162
341,342,2529,1534,1532,270.019,63.9142,26.0858,98.2674
342,343,3158,1348,1541,273.812,46.1583,43.8417,99.7938
343,344,738,493,1532,106.569,48.8313,41.1687,99.9907
344,345,1127,798,1538,101.935,37.8646,52.1354,99.8974
345,346,3744,1579,1553,279.639,46.5904,43.4096,99.7948
346,347,13778,2187,1614,289.453,58.2116,31.7884,99.7884
347,348,509,3489,1539,112.042,39.8629,50.1371,99.5249
348,349,20101,2866,1640,94.2359,35.0822,54.9178,99.8819
349,350,1938,3357,1556,102.808,17.2925,72.7075,99.9491
350,351,586,3447,1549,99.3248,15.6725,74.3275,99.9174
351,352,46462,3367,1676,272.54400000000004,7.512810000000001,82.4872,99.4805
352,353,2602,869,1581,101.567,34.2855,55.7145,99.96
353,354,1048,943,1567,95.7195,15.7262,74.2738,99.9841
354,355,1274,2804,1576,77.1646,81.7973,8.20266,99.9732
355,356,3072,382,1587,101.252,52.1851,37.8149,99.9789
356,357,567,3143,1575,102.599,48.7185,41.2815,99.9939
357,358,4049,322,1601,100.292,64.3763,25.6237,99.9651
358,359,1272,1410,1587,267.253,44.6858,45.3142,99.9843
359,360,1281,3064,1591,289.399,24.5059,65.4941,99.9846
360,361,6280,1314,1610,278.355,19.6834,70.3166,99.9826
361,362,2571,459,1592,95.6736,48.2806,41.7194,99.5614
362,363,2064,1212,1595,282.103,19.5856,70.4144,99.9955
363,364,1596,1516,1594,284.166,30.3125,59.6875,99.9764
364,365,2694,2270,1601,294.6620000000001,63.4711,26.5289,99.9734
365,366,1037,1010,1591,112.82,26.377,63.62300000000001,99.9878
366,367,118549,1179,1784,111.428,29.805,60.195,99.5788
367,368,1476,969,1606,294.814,60.6765,29.3235,99.5572
368,369,1520,2483,1601,296.019,81.3633,8.6367,99.929
369,370,19968,2069,1678,103.109,54.6149,35.3851,99.9523
370,371,15625,3144,1660,98.2714,14.5365,75.4635,99.9048
371,372,1566,1471,1627,103.615,82.939,7.0609600000000015,99.9716
372,373,716,1246,1616,34.0434,82.5402,7.45976,99.974
373,374,9075,1709,1664,264.879,68.0041,21.9959,99.9724
374,375,554,1850,1621,274.29200000000003,61.0496,28.9504,99.9438
375,376,9531,1402,1660,109.384,57.8827,32.1173,99.98
376,377,2814,3002,1635,101.937,33.693000000000005,56.307,99.8778
377,378,1119,2537,1628,102.228,81.3124,8.687560000000001,99.9885
378,379,12145,2973,1705,285.163,24.7319,65.2681,98.9333
379,380,1550,299,1664,286.321,40.0204,49.9796,99.9699
380,381,873,3240,1657,276.3,41.8036,48.1964,99.9957
381,382,7524,1564,1661,283.543,0.369904,89.6301,99.9424
382,383,1896,1971,1660,95.9935,5.60259,84.3974,97.6463
383,384,691,1813,1641,274.728,62.3102,27.6898,99.9814
384,385,26064,383,1749,102.252,74.1819,15.8181,95.2673
385,386,8111,1854,1728,96.0615,0.755325,89.2447,99.9749
386,387,526,2528,1667,108.422,36.0414,53.9586,99.9651
387,388,1058,1476,1698,283.176,28.2348,61.7652,98.6026
388,389,5699,1743,1746,260.583,67.8284,22.1716,99.9572
389,390,1099,2742,1694,111.552,86.0486,3.95141,99.9944
390,391,729,2524,1696,286.017,43.4509,46.5491,99.9886
391,392,1047,1732,1707,289.505,58.0715,31.9285,99.8628
392,393,7084,3196,1762,107.499,43.2033,46.7967,99.9768
393,394,11788,1548,1747,121.427,48.3177,41.6823,99.9727
394,395,950,2623,1701,275.146,34.3827,55.6173,99.9749
395,396,21255,810,1756,275.933,13.4809,76.5191,99.8764
396,397,2462,1958,1721,78.5474,69.0915,20.9085,99.9329
397,398,8953,2206,1754,110.472,55.1957,34.8043,99.9104
398,399,687,1912,1717,263.60900000000004,65.1299,24.8701,99.9897
399,400,11056,2729,1764,116.541,33.4574,56.5426,99.9224
400,401,4139,2603,1744,258.33,65.584,24.416,99.9724
401,402,8875,1427,1767,132.213,78.7364,11.2636,99.967
402,403,37259,2479,1907,285.4190000000001,0.07627869999999999,89.9237,98.7993
403,404,4242,1654,1761,279.898,1.27305,88.727,99.9855
404,405,1931,2911,1756,95.2479,23.8854,66.1146,99.9859
405,406,819,2878,1742,116.336,44.2188,45.7812,99.9942
406,407,588,283,1753,284.51,40.5325,49.4675,99.9318
407,408,1062,3119,1755,106.978,25.3498,64.6502,99.9829
408,409,55313,2026,1860,230.202,74.0472,15.9528,99.8733
409,410,13757,3037,1816,115.743,77.4584,12.5416,99.8919
410,411,1333,2814,1770,96.3787,34.2576,55.7424,99.9924
411,412,5637,1777,1798,91.5432,16.7676,73.2324,99.9574
412,413,69553,3402,1953,102.499,61.8463,28.1537,99.3113
413,414,2991,2844,1800,115.132,33.4751,56.5249,99.9887
414,415,4793,534,1804,111.22,56.746,33.254,99.9666
415,416,59228,676,1919,279.155,5.20758,84.7924,99.8542
416,417,1816,2637,1803,273.755,40.552,49.448,99.995
417,418,14815,2589,1881,217.451,74.6624,15.3376,99.8675
418,419,553,3248,1798,115.081,35.5439,54.4561,99.9947
419,420,12431,2748,1858,260.42900000000003,58.6802,31.3198,99.7786
420,421,29403,2981,1897,103.871,26.7768,63.2232,99.2284
421,422,1207,1559,1816,274.284,56.7855,33.2145,99.995
422,423,14933,1506,1883,113.085,52.2565,37.7435,99.4967
423,424,4452,3148,1839,272.664,50.9184,39.0816,99.9924
424,425,47246,1673,2010,98.1387,39.3408,50.6592,78.4783
425,426,2330,1836,1845,266.361,19.9006,70.0994,99.9857
426,427,18335,895,1908,116.877,72.0955,17.9045,99.6998
427,428,8229,449,1871,102.461,12.4109,77.5891,96.6162
428,429,664,3518,1849,275.908,15.5728,74.4272,99.9784
429,430,784,818,1839,121.54,62.6697,27.3303,99.9017
430,431,1722,374,1860,277.975,36.6987,53.3013,99.9918
431,432,6675,320,1910,276.91700000000003,32.8524,57.1476,99.9443
432,433,2664,1788,1887,248.851,63.3472,26.6528,99.9608
433,434,7683,2252,1912,119.019,52.7142,37.2858,99.9201
434,435,2568,1577,1866,281.93,4.8270300000000015,85.17299999999999,99.9823
435,436,770,2295,1865,266.789,61.9001,28.0999,99.9901
436,437,5379,1067,1900,282.314,28.5636,61.4364,99.9769
437,438,152626,911,2240,96.585,9.79203,80.208,99.0076
438,439,2543,2391,1913,266.742,43.386,46.614,99.9851
439,440,598,2708,1895,259.517,61.0841,28.9159,99.9178
440,441,4902,3244,1929,268.673,49.5329,40.4671,99.9945
441,442,523,2508,1902,280.195,44.0508,45.9492,99.9832
442,443,5688,2323,1955,270.084,15.2956,74.7044,99.9798
443,444,2172,517,1934,280.236,19.0919,70.9081,99.9864
444,445,1172,2827,1923,113.818,66.1319,23.8681,99.9693
445,446,2328,356,1948,265.058,41.9439,48.0561,99.9891
446,447,6336,1759,1967,249.723,62.2837,27.7163,99.9305
447,448,849,2139,1930,268.369,28.4645,61.5355,99.9854
448,449,4610,436,1942,162.686,67.5884,22.4116,99.9923
449,450,860,2725,1931,102.0,3.15077,86.8492,99.994
450,451,5649,2782,1968,258.409,24.5791,65.4209,99.9647
451,452,77690,2030,2046,92.8861,21.466,68.53399999999999,98.5112
452,453,942,1411,1929,95.8079,1.16864,88.8314,99.9511
453,454,29261,2885,2032,264.384,65.3357,24.6643,98.4814
454,455,29635,2694,2068,271.265,51.1146,38.8854,99.4839
455,456,1343,1484,1946,280.888,0.038230900000000005,89.9618,98.8379
456,457,12019,1118,1995,156.453,82.50200000000002,7.49803,97.9351
457,458,13579,1297,2022,281.538,71.6239,18.3761,98.1937
458,459,32535,3119,2048,276.747,42.0315,47.9685,95.4184
459,460,3327,1465,1989,272.834,13.3991,76.6009,98.7091
460,461,9129,3285,2010,94.0524,61.2364,28.7636,99.7965
461,462,134451,480,2230,276.07,53.3806,36.6194,99.3663
462,463,936,311,1992,95.8168,7.3025699999999985,82.6974,99.971
463,464,1519,838,2013,157.438,84.9853,5.01466,97.6781
464,465,889,1417,2007,100.039,49.2139,40.7861,99.5541
465,466,1268,2016,2005,131.533,46.3104,43.6896,99.9954
466,467,566,1431,2029,90.8969,52.0502,37.9498,99.7668
467,468,567,2615,2022,229.802,68.0013,21.9987,99.9906
468,469,9426,765,2082,249.394,82.7368,7.263160000000001,99.9582
469,470,1148,1700,2037,116.175,53.1291,36.8709,99.3093
470,471,62558,2499,2162,109.156,26.187,63.813,99.2825
471,472,1189,852,2052,105.83,41.0749,48.9251,99.9883
472,473,13491,1506,2102,99.2518,13.778,76.222,99.3452
473,474,4712,1399,2078,280.048,29.5673,60.4327,99.9693
474,475,1035,889,2058,91.6524,4.64529,85.3547,99.9767
475,476,1412,613,2080,104.662,33.6219,56.3781,99.9747
476,477,2954,2296,2086,97.1795,20.6607,69.3393,99.9839
477,478,89126,1364,2285,109.005,73.3179,16.6821,99.5922
478,479,64096,3299,2242,274.323,7.486789999999999,82.5132,99.7565
479,480,82759,2988,2310,272.439,16.3206,73.6794,98.286
480,481,641,635,2102,121.258,34.0042,55.9958,99.9929
481,482,568,2056,2101,107.926,22.9924,67.0076,99.99
482,483,30464,2035,2253,271.26,39.7339,50.2661,99.469
483,484,11513,1176,2203,102.304,46.8984,43.1016,99.9605
484,485,28260,1626,2214,278.636,33.0869,56.9131,99.9366
485,486,1112,3324,2145,275.453,7.64169,82.3583,99.8975
486,487,3809,2262,2178,265.994,40.3163,49.6837,99.9912
487,488,589,3140,2140,102.34,52.5739,37.4261,99.9944
488,489,24917,1831,2272,224.126,78.7305,11.2695,99.4485
489,490,2266,2175,2183,295.345,53.6892,36.3108,99.9895
490,491,2773,2792,2200,268.649,51.2591,38.7409,99.9771
491,492,26206,2333,2296,98.7126,35.4717,54.5283,99.9508
492,493,3777,893,2239,100.272,68.8732,21.1268,99.9839
493,494,7944,706,2257,113.478,41.5609,48.4391,99.9759
494,495,38083,2763,2328,273.677,30.6507,59.3493,99.6852
495,496,4867,2184,2260,272.055,47.8047,42.1953,99.9871
496,497,2795,970,2254,102.833,36.4803,53.5197,98.7614
497,498,1130,1105,2258,287.872,0.411537,89.5885,99.9789
498,499,2475,2440,2287,263.534,48.3967,41.6033,99.8404
499,500,1894,2686,2280,262.969,75.1031,14.8969,99.9933
500,501,1632,1709,2301,102.835,7.05402,82.946,99.9875
501,502,777,3494,2290,83.3148,61.3399,28.6601,99.7364
502,503,9595,3125,2325,112.57,29.4825,60.5175,99.9703
503,504,1129,1167,2298,270.074,47.5612,42.4388,99.9978
504,505,15503,2526,2350,256.115,74.6668,15.3332,99.9397
505,506,9411,1144,2357,112.822,62.6371,27.3629,99.9182
506,507,22870,2197,2404,98.5062,23.2404,66.7596,99.9512
507,508,5074,1913,2342,92.6364,23.9616,66.0384,99.9831
508,509,9041,314,2420,96.2477,8.84985,81.1502,99.9797
509,510,8688,1758,2361,126.509,67.1178,22.8822,99.9654
510,511,11828,1636,2375,277.632,29.189,60.81100000000001,99.9067
511,512,1677,3488,2345,283.774,8.29128,81.7087,99.8511
512,513,30520,2428,2497,269.068,40.7313,49.2687,99.1109
513,514,12112,3459,2431,236.68400000000003,70.5932,19.4068,99.8737
514,515,140645,3293,2587,271.23,40.5427,49.4573,99.6547
515,516,7723,2009,2397,210.827,74.9015,15.0985,99.9706
516,517,1268,2097,2387,273.074,33.4879,56.5121,99.9723
517,518,3425,2660,2419,238.511,73.9314,16.0686,99.9145
518,519,23976,1372,2500,275.449,6.979610000000001,83.0204,98.7535
519,520,1667,998,2428,281.8040000000001,32.8167,57.1833,99.9856
520,521,72100,1990,2579,270.39,31.0662,58.9338,99.1211
521,522,4566,1528,2447,279.513,29.5921,60.4079,99.6423
522,523,5707,2317,2438,169.89700000000005,71.7807,18.2192,99.9759
523,524,1153,1111,2418,110.325,26.1216,63.8784,99.9863
524,525,4858,2568,2452,272.565,48.5032,41.4968,99.9851
525,526,10688,2796,2482,105.031,35.0886,54.9114,99.9567
526,527,1232,2063,2436,215.121,75.7115,14.2885,99.986
527,528,76851,1684,2589,280.401,9.63345,80.3666,99.662
528,529,8239,1640,2464,156.25799999999995,75.6864,14.3136,99.9006
529,530,11214,630,2508,97.6739,8.84084,81.1592,99.9503
530,531,631,1032,2445,281.9170000000001,30.5434,59.4566,99.9548
531,532,142028,1182,2702,280.486,31.7867,58.2133,99.4585
532,533,621,655,2466,106.555,21.116,68.884,99.9441
533,534,72205,439,2705,153.695,80.2814,9.71855,98.8575
534,535,4564,865,2498,272.893,15.983,74.017,99.941
535,536,2495,2692,2503,163.424,72.4832,17.5168,99.9786
536,537,4158,2219,2525,266.009,43.39,46.61,99.4934
537,538,7778,2595,2537,269.577,36.6043,53.3957,99.6759
538,539,2485,1485,2516,110.133,64.0694,25.9306,98.6051
539,540,655,2528,2512,280.529,60.6062,29.3938,99.9929
540,541,15742,3025,2590,117.143,43.5591,46.4409,99.5053
541,542,12225,710,2586,286.413,45.7992,44.2008,99.9388
542,543,1406,319,2548,83.2693,70.1426,19.8574,99.9662
543,544,11694,2752,2585,105.089,23.7188,66.2812,99.9028
544,545,20650,871,2593,100.045,29.5239,60.4761,99.8157
545,546,4727,2272,2579,88.969,28.9309,61.0691,99.9811
546,547,8397,2866,2589,108.271,43.082,46.918,99.916
547,548,55790,2645,2724,295.165,59.8665,30.1335,99.7715
548,549,2027,1337,2588,273.72900000000004,59.2604,30.7396,99.9955
549,550,2802,2482,2607,279.836,45.5153,44.4847,99.715
550,551,2640,555,2611,107.432,84.509,5.49101,99.9813
551,552,587,2217,2608,268.248,42.56100000000001,47.43899999999999,99.9123
552,553,925,625,2637,157.45,79.5197,10.4803,99.956
553,554,879,2660,2619,291.463,8.710980000000001,81.289,99.989
554,555,4086,565,2652,286.151,2.02453,87.9755,99.9359
555,556,887,1470,2641,280.525,13.1376,76.8624,99.9602
556,557,112823,2250,2902,94.8196,4.76614,85.2339,99.7557
557,558,679,2953,2635,131.548,80.9767,9.02333,99.9653
558,559,8889,713,2683,106.101,29.321,60.679,99.9645
559,560,13859,2452,2701,94.9887,31.8225,58.1775,98.9288
560,561,1153,2189,2639,99.8964,21.7198,68.2802,99.9252
561,562,8402,975,2699,276.222,47.6314,42.3686,99.4809
562,563,41957,2049,2761,102.295,16.5797,73.4203,99.1554
563,564,10909,2901,2694,110.19,54.9523,35.0477,99.7924
564,565,2207,1506,2672,288.771,54.3276,35.6724,99.9804
565,566,1755,2813,2689,285.126,8.07152,81.9285,99.972
566,567,46930,835,2814,275.228,32.0511,57.9489,99.7638
567,568,39117,3083,2781,294.266,9.40183,80.5982,99.9336
568,569,2193,1237,2710,104.801,25.458,64.542,99.9739
569,570,8333,590,2729,104.002,13.2728,76.7272,99.9612
570,571,2243,1736,2703,93.5861,26.9526,63.0474,99.9843
571,572,1155,1435,2707,100.658,78.4312,11.5688,99.9884
572,573,2296,2773,2758,127.084,75.4472,14.5528,99.9566
573,574,28043,1463,2816,275.514,8.09244,81.9076,98.6783
574,575,1540,1765,2732,92.4052,23.1785,66.8215,99.9864
575,576,15601,1682,2806,121.61,65.6109,24.3891,99.9031
576,577,1414,1520,2755,284.742,56.6948,33.3052,99.9553
577,578,58299,2901,2901,127.424,57.3041,32.6959,99.7328
578,579,12080,1821,2808,279.314,2.6154900000000003,87.3845,99.9644
579,580,30737,644,2878,224.125,75.0563,14.9437,99.8598
580,581,58906,964,2960,101.753,6.18457,83.8154,98.9443
581,582,70176,2497,2967,251.374,77.9315,12.0685,98.6275
582,583,1947,3276,2816,272.135,40.5443,49.4557,99.9955
583,584,45605,3355,2956,255.685,72.6219,17.378,99.1796
584,585,2039,2078,2822,255.096,75.1692,14.8308,99.981
585,586,126975,2979,3122,112.099,50.9921,39.0079,98.0184
586,587,746,3316,2835,293.612,7.90562,82.0944,99.9662
587,588,1529,322,2861,277.788,36.8954,53.1046,99.9839
588,589,8918,2768,2897,272.225,0.409866,89.5901,99.9686
589,590,8751,1712,2896,278.394,4.8189,85.1811,99.9675
590,591,5020,1853,2896,269.53,24.5928,65.4072,99.9645
591,592,3541,2603,2904,291.012,58.529,31.471,99.9854
592,593,8493,467,2941,203.262,77.8408,12.1592,68.7245
593,594,12590,353,2959,277.188,9.90405,80.096,99.9786
594,595,9892,1639,2931,151.384,75.0717,14.9283,99.9658
595,596,148512,1926,3263,137.78799999999998,76.8856,13.1144,90.0247
596,597,657,1781,2904,276.382,4.86401,85.13600000000002,99.9708
597,598,9390,2703,3011,102.143,14.1926,75.8074,99.6571
598,599,4058,1412,2927,152.841,72.8345,17.1655,99.989
599,600,8536,1508,2948,127.641,62.5062,27.4938,99.9258
600,601,1036,1359,2936,110.17,42.1309,47.8691,99.9867
601,602,2731,2656,2973,117.814,51.7492,38.2508,99.9821
602,603,746,1327,2950,273.786,30.1161,59.8839,99.8807
603,604,12145,730,2986,191.373,85.1597,4.84031,98.4653
604,605,26442,1739,3062,269.12,64.8251,25.1749,98.7659
605,606,845,2740,2968,98.2774,13.5827,76.4173,99.9664
606,607,18429,3460,3102,106.617,3.01155,86.9884,97.6014
607,608,509,1602,2964,167.53400000000005,70.2394,19.7606,99.9806
608,609,1586,2604,2972,105.567,11.925,78.075,99.9624
609,610,755,1385,2969,109.578,42.1789,47.8211,99.9555
610,611,18095,514,3035,244.706,85.06299999999997,4.93699,98.4588
611,612,17801,1201,3015,278.965,20.5926,69.4074,99.0784
612,613,85269,1532,3174,118.874,37.6488,52.3512,92.8291
613,614,6072,2773,3031,119.677,50.7547,39.2453,99.1099
614,615,3010,1685,3012,279.19,4.78046,85.2195,99.9816
615,616,3200,637,3061,64.3464,83.00200000000002,6.99804,99.8224
616,617,1436,352,3036,277.177,0.401688,89.5983,99.9912
617,618,29153,731,3138,96.8809,12.7709,77.2291,99.8962
618,619,808,269,3053,97.5,12.6191,77.3809,99.9532
619,620,8064,1251,3098,277.961,23.2927,66.7073,99.9846
620,621,3593,1105,3072,110.629,41.4445,48.5555,99.9859
621,622,64747,486,3235,224.858,83.7796,6.22044,99.8922
622,623,1636,378,3097,92.3363,15.92,74.08,99.9647
623,624,44243,1057,3196,282.885,24.9613,65.0387,99.6681
624,625,904,1336,3113,90.8711,31.526,58.474,99.9956
625,626,2448,1592,3139,277.565,64.2584,25.7416,99.9461
626,627,3240,3346,3132,275.879,61.9145,28.0855,99.9808
627,628,1385,1151,3117,119.323,52.6347,37.3653,99.9918
628,629,47829,2490,3261,106.077,13.7141,76.2859,98.7208
629,630,11825,3180,3158,286.841,7.07924,82.9208,99.9131
630,631,4629,1208,3154,278.334,14.9198,75.0802,99.7394
631,632,3590,1319,3148,93.5096,30.0928,59.9072,99.9646
632,633,866,3397,3124,275.083,62.0559,27.9441,99.9874
633,634,991,3219,3125,304.9190000000001,73.9575,16.0425,99.9915
634,635,14961,1808,3198,264.771,64.5863,25.4137,99.9386
635,636,1019,3085,3139,308.12,81.4918,8.508189999999999,99.9906
636,637,1010,2384,3148,99.6189,15.5512,74.4488,99.8808
637,638,571,2236,3140,288.345,70.0565,19.9435,99.9949
638,639,2601,2171,3167,100.778,25.7139,64.2861,99.9608
639,640,4523,853,3171,272.034,37.6349,52.3651,99.9604
640,641,27152,2656,3233,113.253,78.5925,11.4075,99.8684
641,642,1325,302,3159,96.989,29.8838,60.1162,99.9691
642,643,501,2258,3163,281.985,61.9848,28.0152,99.9894
643,644,23590,2169,3273,272.786,37.73,52.27,99.9494
644,645,666,3099,3177,294.474,15.1695,74.8305,99.9916
645,646,3984,2301,3200,124.36,85.7729,4.227119999999998,99.9825
646,647,38629,1285,3297,273.73900000000003,8.23756,81.7624,99.9031
647,648,4555,2073,3205,279.766,75.3353,14.6647,99.9841
648,649,12280,3349,3261,101.247,16.9345,73.0655,99.9673
649,650,887,3063,3207,288.788,8.17879,81.8212,99.9967
650,651,7444,836,3248,252.207,68.9523,21.0477,99.973
651,652,50246,1018,3401,277.953,17.9082,72.0918,99.2693
652,653,1279,3417,3244,86.9314,68.2818,21.7182,99.9736
653,654,109160,3064,3425,272.22900000000004,41.4388,48.5612,99.5034
654,655,2167,3160,3252,258.97700000000003,80.5668,9.43321,99.9917
655,656,2286,2301,3264,279.028,66.6759,23.3241,99.9689
656,657,785,3278,3274,265.454,65.8279,24.1721,99.9455
657,658,1126,2744,3273,96.8044,24.5347,65.4653,99.9868
658,659,17490,751,3326,95.8357,22.992,67.008,99.9217
659,660,11903,1409,3348,276.565,14.0979,75.9021,99.6288
660,661,2426,332,3285,116.204,55.827,34.173,99.978
661,662,2339,1024,3291,106.523,9.76289,80.2371,99.9668
662,663,6213,3463,3341,277.548,61.1069,28.8931,99.7795
663,664,59866,2295,3451,176.343,82.2685,7.73152,99.0935
664,665,609,3153,3305,117.166,44.2023,45.7977,99.9937
665,666,3251,3288,3329,102.08,64.3153,25.6847,99.9901
666,667,1437,3395,3339,265.534,18.1657,71.8343,99.992
667,668,9289,344,3368,160.459,85.5365,4.46353,99.96
668,669,7161,657,3375,100.38,6.28526,83.7147,99.9805
669,670,6735,1604,3361,218.327,77.7926,12.2074,99.888
670,671,9919,2441,3387,244.48,68.5472,21.4528,99.8185
671,672,5737,1490,3380,279.672,30.2967,59.7033,99.9667
672,673,142068,464,3612,289.976,20.6286,69.3714,98.2439
673,674,1223,596,3356,280.059,40.7639,49.2361,99.9872
674,675,632,3338,3347,112.531,42.6417,47.3583,99.9977
675,676,13088,856,3417,119.63,50.1596,39.8404,99.9186
676,677,565,1145,3350,268.363,41.5402,48.4598,99.9178
677,678,1899,2719,3364,98.5982,6.84707,83.1529,99.9883
678,679,2519,2649,3366,102.25,23.7333,66.2667,99.9925
679,680,720,1561,3373,157.325,74.99600000000002,15.004,99.9876
680,681,3219,3417,3399,97.0108,65.2867,24.7133,99.9067
681,682,343692,1572,3944,274.067,19.0146,70.9854,94.3062
682,683,10079,3323,3427,265.447,60.82,29.18,99.9675
683,684,635,603,3395,278.957,40.1723,49.8277,99.9882
684,685,60880,2704,3573,276.386,33.8335,56.1665,99.5986
685,686,898,2098,3403,276.831,65.3768,24.6232,99.9709
686,687,1788,1698,3416,116.273,40.831,49.169,99.9737
687,688,8494,2749,3450,265.261,45.11600000000001,44.88399999999999,99.9889
688,689,1501,2543,3426,282.248,40.9104,49.0896,99.9912
689,690,1849,726,3433,124.401,48.7967,41.2033,99.9945
690,691,1178,1563,3434,105.422,29.2987,60.7013,99.962
691,692,11118,3450,3481,103.171,28.0957,61.9043,99.437
692,693,723,2026,3432,124.024,66.4163,23.5837,99.9517
693,694,2328,1380,3452,133.93200000000002,55.1258,34.8742,99.9938
694,695,4320,2097,3453,127.383,56.7732,33.2268,99.9681
695,696,1132,612,3458,270.1,44.7138,45.2862,99.9957
696,697,35132,1506,3561,239.674,73.7318,16.2681,98.9514
697,698,1347,2000,3455,119.184,60.9662,29.0338,99.9677
698,699,1721,1286,3452,108.751,50.4941,39.5059,99.9934
699,700,1278,2583,3449,275.255,34.5173,55.4827,99.9876
700,701,8292,1724,3487,259.437,55.2749,34.7251,99.8445
701,702,5283,1616,3482,213.674,74.3851,15.6149,99.9745
702,703,2900,695,3471,268.534,32.5753,57.4247,99.9579
703,704,770,1334,3457,270.774,3.70309,86.2969,99.9657
704,705,5990,2492,3494,280.81,40.5103,49.4897,99.8329
705,706,1690,907,3484,258.659,65.5068,24.4932,99.6074
706,707,7902,2534,3538,93.8118,11.4098,78.5902,99.9836
707,708,580,2043,3493,271.181,23.3349,66.6651,99.9892
708,709,3017,2079,3513,270.384,23.4505,66.5495,99.9605
709,710,4635,751,3540,116.506,52.3984,37.6016,99.7596
710,711,3302,814,3547,290.891,64.436,25.564,99.619
711,712,515,2144,3503,267.154,67.4875,22.5125,99.981
712,713,627,736,3503,263.627,68.5157,21.4843,98.4967
713,714,31105,945,3619,119.459,65.6595,24.3405,76.4982
714,715,5737,668,3553,274.638,46.6789,43.3211,99.8744
715,716,1304,1820,3511,265.098,46.2757,43.7243,99.9802
716,717,1078,2014,3523,121.634,44.5732,45.4268,99.6446
717,718,5397,2151,3551,108.339,59.9,30.1,98.7344
718,719,218438,3009,3843,273.514,13.8893,76.1107,99.2208
719,720,1580,3358,3552,291.33,51.6307,38.3693,99.3494
720,721,6306,1680,3577,117.273,40.9634,49.0366,99.87
721,722,4468,3207,3573,288.068,60.885,29.115,99.3572
722,723,19627,1971,3647,107.642,62.6768,27.3232,99.7303
723,724,8434,3399,3609,86.6463,66.274,23.726,99.5499
724,725,1439,2092,3575,110.933,20.6578,69.3422,99.9857
725,726,1221,2453,3575,285.326,42.7977,47.2023,99.6463
726,727,14014,2143,3631,271.944,34.7695,55.2305,99.9514
727,728,837,1920,3578,265.762,27.8103,62.1897,99.9058
728,729,5684,3305,3624,101.125,69.2066,20.7934,99.9694
729,730,35006,786,3696,110.621,52.1274,37.8726,99.9524
730,731,3531,3467,3609,101.114,11.8096,78.1904,99.6015
731,732,2943,2431,3620,278.257,37.7322,52.2678,99.123
732,733,3709,3218,3624,102.208,36.0942,53.9058,99.976
733,734,1093,1897,3621,264.421,7.760289999999999,82.2397,99.9654
734,735,6410,2351,3642,84.6175,7.128589999999999,82.8714,99.9836
735,736,2002,1080,3651,283.601,3.93668,86.0633,99.9838
736,737,541,2495,3630,287.129,37.5883,52.4117,99.9921
737,738,5590,1738,3680,278.62,60.2994,29.7006,99.9762
738,739,1314,2524,3654,95.7814,12.7907,77.2093,99.9796
739,740,3102,1647,3662,120.916,39.3786,50.6214,99.9695
740,741,17250,1624,3726,117.866,69.4996,20.5004,99.9414
741,742,1053,1874,3657,105.734,66.7339,23.2661,99.9686
742,743,1015,3458,3658,302.636,50.7352,39.2648,99.9933
743,744,48314,2527,3764,93.2168,18.7244,71.2756,99.1903
744,745,12284,2241,3730,266.753,59.7193,30.2807,99.9718
745,746,2344,3345,3677,89.662,11.4884,78.5116,99.9938
746,747,23214,705,3805,108.742,40.9567,49.0433,99.9036
747,748,16634,1041,3749,92.6417,7.2117,82.7883,99.9305
748,749,31465,1217,3816,112.036,44.6017,45.3983,99.8501
749,750,2691,1856,3706,88.2248,57.5142,32.4858,99.993
750,751,545,3399,3688,292.472,50.6887,39.3113,99.9761
751,752,940,1803,3701,106.055,66.5136,23.4864,99.9935
752,753,4107,3305,3731,92.5812,11.2991,78.7009,99.9837
753,754,2927,2100,3708,279.689,69.1798,20.8202,99.9558
754,755,10131,2336,3763,279.268,26.0902,63.9098,99.9837
755,756,4820,2042,3743,287.509,54.18,35.82,99.9829
756,757,2210,3485,3740,111.692,15.8383,74.1617,99.9084
757,758,13471,3402,3780,281.35200000000003,74.0518,15.9482,99.9254
758,759,15182,1816,3776,95.7828,54.2061,35.7939,99.8372
759,760,2665,1153,3775,281.084,46.3262,43.6738,99.9833
760,761,15589,2100,3843,88.1735,5.63026,84.3697,99.9558
761,762,8923,355,3808,293.67,68.2808,21.7192,99.974
762,763,2957,1988,3796,288.043,73.2657,16.7343,99.9493
763,764,712,1953,3781,95.3547,72.50399999999998,17.496,99.9783
764,765,46727,976,3913,116.984,43.2085,46.7915,99.2342
765,766,3077,1712,3799,117.094,66.2283,23.7717,99.9923
766,767,16534,2219,3853,258.597,52.7237,37.2763,99.968
767,768,14966,2606,3875,271.432,51.9823,38.0177,99.9415
768,769,32369,1977,4004,104.243,44.6568,45.3432,98.7122
769,770,35752,665,3966,266.875,70.4075,19.5925,82.1747
770,771,13583,2331,3903,259.144,75.0823,14.9177,99.9095
771,772,8426,619,3922,276.636,17.2701,72.7299,99.9804
772,773,12056,3359,3922,256.629,61.6292,28.3708,99.9624
773,774,4364,1859,3897,274.031,21.1601,68.8399,99.9861
774,775,817,837,3898,97.5113,4.27145,85.7286,99.9479
775,776,538,440,3907,277.711,63.5642,26.4358,98.7611
776,777,7890,3445,3970,288.172,16.989,73.01100000000002,99.3717
777,778,41051,2621,4020,272.461,51.3704,38.6296,99.4885
778,779,1069,1130,3926,278.517,56.3983,33.6017,99.9948
779,780,1353,2069,3931,89.9177,5.0449199999999985,84.9551,99.9308
780,781,25428,1154,4031,274.313,52.5306,37.4694,99.3389
781,782,706,346,3941,112.888,66.2181,23.7819,99.9187
782,783,1150,842,3953,268.903,56.8208,33.1792,99.9916
783,784,591,2456,3947,277.881,45.8775,44.1225,99.9805
784,785,15661,481,4016,108.451,48.2552,41.7448,99.4382
785,786,541,2207,3963,85.6177,6.35242,83.6476,99.9613
786,787,111087,2261,4146,93.0492,15.6348,74.3652,95.5556
787,788,7832,2098,3991,101.355,29.0817,60.9183,99.9223
788,789,856,2435,3966,242.203,69.7079,20.2921,99.8528
789,790,4402,1277,4008,284.003,15.069,74.931,99.9803
790,791,2064,2177,3993,107.172,35.5077,54.4923,99.9776
791,792,1934,1101,4000,281.082,56.1365,33.8635,99.4028
792,793,19603,839,4067,100.953,9.30859,80.6914,99.9516
793,794,685,3298,3995,272.587,44.923,45.077,99.9936
794,795,515,271,3998,105.651,66.8761,23.1239,99.5865
795,796,1565,3264,4016,82.0802,4.51132,85.4887,99.9759
796,797,7822,3355,4069,278.79200000000003,47.5141,42.4859,99.2823
797,798,3163,386,4042,95.7361,67.4929,22.5071,99.9376
798,799,2260,3137,4036,227.199,70.6094,19.3906,99.2832
799,800,7340,1372,4068,79.0319,72.3529,17.6471,99.89
800,801,28618,3171,4147,97.4169,5.70466,84.2953,99.8463
801,802,1938,1045,4051,294.635,53.57,36.43,99.8565
802,803,1226,1456,4051,83.7437,75.4796,14.5204,99.7916
803,804,57384,507,4183,97.9976,12.9536,77.0464,96.7306
804,805,1284,931,4060,285.788,14.9582,75.0418,98.6389
805,806,45006,1268,4218,270.48,21.7778,68.2222,99.8375
806,807,1643,2771,4072,93.303,0.381104,89.6189,99.9706
807,808,1111,2822,4063,92.0686,0.36692,89.6331,99.9678
808,809,2343,3480,4073,110.281,22.1037,67.8963,99.8448
809,810,2131,2980,4076,301.878,49.0729,40.9271,99.8459
810,811,7375,3073,4093,296.691,55.5751,34.4249,99.9319
811,812,11998,984,4134,285.577,57.2775,32.7225,99.843
812,813,17717,3410,4159,81.3127,4.74869,85.2513,99.2273
813,814,9886,2655,4142,270.467,15.0739,74.9261,99.9049
814,815,1769,3007,4133,88.5257,6.85163,83.1484,99.9797
815,816,769,2953,4131,298.528,49.7404,40.2596,99.9448
816,817,7239,1526,4157,105.85,76.2417,13.7583,99.9294
817,818,1639,696,4138,291.509,1.05296,88.947,99.9854
818,819,7943,2527,4174,112.882,46.4789,43.5211,99.9442
819,820,7466,369,4196,97.1861,54.9748,35.0252,99.9643
820,821,4262,1072,4173,276.41,21.1125,68.8875,99.9664
821,822,13857,2790,4236,268.847,3.61426,86.3857,99.9465
822,823,69299,3248,4326,279.378,55.6585,34.3415,99.7953
823,824,1255,1461,4159,284.686,23.2391,66.7609,99.9874
824,825,11963,840,4192,104.722,50.9667,39.0333,99.9616
825,826,2700,1136,4171,113.125,70.354,19.646,99.9916
826,827,22652,759,4278,109.568,2.91395,87.0861,99.9638
827,828,2908,2940,4189,64.8508,76.5444,13.4556,99.9796
828,829,7603,1426,4224,277.185,22.3817,67.6183,98.7065
829,830,29040,2971,4281,291.845,54.8057,35.1943,99.7027
830,831,4638,2455,4217,101.805,37.1009,52.8991,99.4565
831,832,6044,2726,4231,111.749,55.4191,34.5809,99.974
832,833,6210,1153,4241,285.253,57.0059,32.9941,99.9724
833,834,562,3489,4213,104.914,8.99429,81.0057,99.8869
834,835,731,1215,4210,263.957,72.5161,17.4839,99.9912
835,836,24200,612,4328,291.012,17.0328,72.9672,99.9624
836,837,8834,2054,4263,109.545,48.6475,41.3525,99.8412
837,838,11643,2644,4266,96.2955,37.1152,52.8848,99.9907
838,839,69214,1014,4367,281.744,61.6507,28.3493,99.6336
839,840,1037,1532,4228,101.343,25.7012,64.2988,99.9896
840,841,4233,2565,4258,103.111,16.6914,73.3086,99.9921
841,842,4591,1367,4266,264.168,65.0298,24.9702,99.9734
842,843,2240,1212,4256,273.578,22.9036,67.0964,99.9648
843,844,2099,2512,4268,128.025,66.0597,23.9403,99.986
844,845,894,1511,4265,112.092,74.696,15.304,99.7604
845,846,14205,2416,4322,259.851,77.0857,12.9143,99.8651
846,847,875,349,4272,282.09,10.8791,79.1209,99.9643
847,848,1779,580,4276,120.044,43.1573,46.8427,99.9932
848,849,725,1487,4282,96.9612,21.6853,68.3147,99.9794
849,850,4326,2700,4337,96.8225,37.1458,52.8542,99.9639
850,851,4330,2153,4338,104.624,0.7826,89.2174,99.9899
851,852,78245,1563,4508,284.067,40.1632,49.8368,99.6507
852,853,1132,1156,4326,264.625,75.5666,14.4334,99.9833
853,854,3623,2555,4331,280.797,23.1196,66.8804,99.9792
854,855,1568,1405,4332,245.847,76.8414,13.1586,99.9735
855,856,4969,313,4360,112.917,64.3981,25.6019,99.9357
856,857,5719,1351,4373,100.422,35.0055,54.9945,99.953
857,858,880,710,4344,277.873,14.1895,75.8105,99.9964
858,859,2262,2069,4349,122.349,51.9193,38.0807,99.9953
859,860,899,3457,4360,166.787,80.5489,9.45113,99.9719
860,861,4163,472,4367,292.1670000000001,66.3744,23.6256,99.9926
861,862,42051,1888,4481,90.4399,60.4223,29.5777,97.4193
862,863,24440,2836,4409,263.684,40.4922,49.5078,99.8458
863,864,11736,2090,4411,114.496,65.4696,24.5304,99.925
864,865,62993,2291,4487,257.97900000000004,65.388,24.612,99.0281
865,866,1018,2581,4365,264.668,65.0006,24.9994,99.9974
866,867,4487,3423,4422,273.153,55.852,34.148,99.4452
867,868,24680,713,4441,127.098,43.9747,46.0253,99.8742
868,869,6531,2984,4414,288.801,17.4626,72.5374,99.9649
869,870,1477,3043,4392,111.601,40.208,49.792,99.9227
870,871,51531,432,4525,120.993,47.4863,42.5137,97.5095
871,872,2705,2573,4404,279.84,22.8354,67.1646,99.9805
872,873,575,2202,4392,120.869,48.1812,41.8188,99.9905
873,874,43986,2576,4532,269.363,53.2843,36.7157,75.2965
874,875,4964,2502,4443,103.54,26.444000000000006,63.556,99.9621
875,876,4575,3112,4433,91.6239,18.7096,71.2904,99.9818
876,877,842,2621,4419,104.74,42.6805,47.3195,99.9876
877,878,7299,2012,4457,113.951,47.4123,42.5877,99.8382
878,879,6622,1244,4461,105.098,39.6108,50.3892,99.9791
879,880,1570,3353,4442,269.025,56.3782,33.6218,99.9919
880,881,2878,1170,4448,134.89,68.6444,21.3556,99.9918
881,882,16752,1713,4480,90.9908,20.1884,69.8116,99.8691
882,883,4997,1331,4474,268.451,31.8437,58.1563,99.9883
883,884,1019,845,4446,219.181,69.6982,20.3018,99.9888
884,885,8322,941,4488,274.29,5.63759,84.3624,99.2583
885,886,24567,3090,4536,107.908,37.6559,52.3441,97.7717
886,887,24420,3342,4563,85.5907,15.6581,74.3419,99.9282
887,888,5309,2906,4499,272.347,2.25848,87.7415,99.0399
888,889,2482,842,4505,166.66,79.9836,10.0164,98.8491
889,890,724,3461,4481,290.348,56.5471,33.4529,99.9511
890,891,9185,2764,4522,93.3489,2.90049,87.0995,99.967
891,892,3146,630,4518,281.96,16.4018,73.5982,99.9441
892,893,594,2057,4502,111.369,41.5556,48.4444,99.6044
893,894,4735,3454,4548,99.6222,8.2331,81.7669,99.8054
894,895,19485,2114,4628,97.4047,9.18766,80.8123,99.8078
895,896,5017,1196,4550,103.143,74.1755,15.8245,99.6308
896,897,6543,1317,4544,151.92,72.2029,17.7971,99.8675
897,898,99173,2907,4766,279.118,25.8692,64.1308,95.0588
898,899,9475,788,4559,281.932,4.16289,85.8371,99.9331
899,900,812,902,4540,89.9684,38.856,51.144,99.9801
900,901,38921,634,4642,102.466,2.12534,87.8747,99.8724
901,902,30304,2767,4677,270.578,35.92,54.08,99.9292
902,903,9288,1003,4577,100.539,41.9117,48.0883,99.8342
903,904,13932,912,4635,105.35,4.32568,85.6743,98.9853
904,905,6144,1466,4610,298.435,82.023,7.977019999999999,99.9786
905,906,4641,2029,4603,278.04200000000003,46.3489,43.6511,99.9842
906,907,2578,1799,4597,114.454,85.8228,4.17715,99.9919
907,908,679,1240,4586,274.038,31.3268,58.6732,99.9886
908,909,3490,1300,4603,114.186,69.6367,20.3633,99.9924
909,910,19918,3209,4673,276.623,49.4333,40.5667,99.9437
910,911,1806,1116,4600,97.8764,77.2875,12.7125,99.9836
911,912,9580,1374,4637,100.051,43.5842,46.4158,99.867
912,913,1445,1585,4623,278.297,41.7434,48.2566,99.9779
913,914,8701,1872,4656,97.9137,49.6406,40.3594,99.7563
914,915,1569,1542,4618,301.685,82.82600000000002,7.17403,99.972
915,916,3986,3463,4671,280.642,51.2085,38.7915,99.968
916,917,60935,2581,4754,111.291,42.4082,47.5918,99.9473
917,918,6023,1201,4635,272.413,27.4199,62.5801,99.982
918,919,660,2361,4633,267.913,66.7976,23.2024,99.9942
919,920,3724,2247,4660,269.678,43.3438,46.6562,99.9821
920,921,576,319,4632,117.825,54.7245,35.2755,99.9736
921,922,1719,1093,4641,285.237,51.1719,38.8281,99.9965
922,923,3183,3408,4663,92.9256,0.149658,89.8503,98.9915
923,924,5807,1032,4664,276.934,20.1198,69.8802,99.9815
924,925,5016,1963,4694,278.622,26.142,63.858,99.8835
925,926,1329,2018,4662,101.939,14.1914,75.8086,99.9854
926,927,64225,2343,4796,273.395,14.9683,75.0317,99.3776
927,928,9165,1249,4722,257.138,58.0404,31.9596,99.9197
928,929,13118,1142,4714,79.6975,60.4212,29.5788,99.9873
929,930,6102,1580,4706,276.656,31.5511,58.4489,99.9866
930,931,5349,816,4696,101.261,4.241230000000002,85.7588,99.9693
931,932,14326,3315,4737,133.567,67.5473,22.4527,99.9841
932,933,16293,407,4764,274.755,56.6866,33.3134,99.6703
933,934,4632,3114,4738,282.582,53.7219,36.2781,99.983
934,935,12398,967,4745,268.54200000000003,24.7555,65.2445,99.4982
935,936,2710,1512,4721,252.953,84.5304,5.46959,99.9825
936,937,12316,746,4768,123.974,83.5908,6.40915,99.9286
937,938,2121,875,4708,96.1694,34.5527,55.4473,99.9896
938,939,36547,1919,4845,99.4845,2.3929400000000003,87.6071,98.2615
939,940,1604,1306,4717,81.3541,12.1369,77.8631,99.9948
940,941,4115,1398,4729,85.5805,10.4789,79.5211,99.0487
941,942,902,1458,4708,281.264,81.73899999999998,8.26095,99.9803
942,943,829,1791,4711,106.716,51.0719,38.9281,99.9929
943,944,21833,525,4799,108.106,54.6816,35.3184,99.9581
944,945,6297,2093,4759,105.566,20.1718,69.8282,99.9168
945,946,3294,1819,4753,91.4271,11.2258,78.7742,99.935
946,947,543,1334,4734,247.225,60.3701,29.6299,99.9907
947,948,4849,3449,4767,266.608,21.7065,68.2935,99.5983
948,949,1496,1918,4743,101.998,22.3987,67.6013,98.25
949,950,1996,1774,4772,254.669,70.3987,19.6013,99.9566
950,951,3038,1686,4759,103.266,51.3243,38.6757,99.8123
951,952,3107,1352,4775,82.7423,12.1925,77.8075,99.992
952,953,6911,644,4788,277.615,5.07816,84.9218,99.9809
953,954,19256,1297,4857,271.365,8.77538,81.2246,99.9222
954,955,11529,1580,4813,278.17,4.01949,85.9805,99.9286
955,956,25699,1490,4868,251.193,69.5511,20.4489,99.8439
956,957,6717,848,4848,274.621,1.86324,88.1368,99.9902
957,958,21515,1015,4839,273.833,57.1975,32.8025,99.8015
958,959,11335,3379,4841,260.297,58.9896,31.0104,99.8588
959,960,17904,3197,4853,93.2799,28.3384,61.6616,99.9516
960,961,15420,1710,4857,265.77,37.3515,52.6485,99.9015
961,962,3131,1196,4825,273.056,53.4301,36.5699,99.9809
962,963,17246,2152,4875,92.4173,12.0504,77.9496,99.8969
963,964,2783,3288,4836,94.3613,36.4206,53.5794,99.9876
964,965,1431,790,4821,273.23,55.8391,34.1609,99.9875
965,966,4780,3032,4842,97.9153,34.3334,55.6666,99.5091
966,967,2176,721,4858,281.767,12.7507,77.2493,99.9187
967,968,5926,2048,4894,203.863,77.8915,12.1085,99.9642
968,969,1701,648,4863,99.7013,3.1986,86.8014,99.9516
969,970,7042,1132,4890,97.5699,36.0173,53.9827,99.972
970,971,2433,916,4892,272.423,3.65179,86.3482,99.1776
971,972,11409,3077,4910,270.10400000000004,37.3634,52.6366,99.9864
972,973,2617,2273,4895,131.778,71.5475,18.4525,99.9936
973,974,3771,768,4893,266.053,72.8465,17.1536,99.9833
974,975,2237,585,4888,281.185,4.04978,85.9502,99.9733
975,976,1674,3299,4919,271.079,13.4713,76.5287,99.9875
976,977,1529,2499,4917,270.812,15.9081,74.0919,99.989
977,978,3856,3439,4934,278.509,38.7786,51.2214,99.5638
978,979,1443,3242,4932,272.483,13.1424,76.8576,99.9945
979,980,1324,3343,4925,272.214,14.2772,75.7228,99.9733
980,981,877,2626,4930,285.384,53.1455,36.8545,99.9743
981,982,838,2250,4932,134.935,70.811,19.189,99.9578
982,983,1599,2458,4944,109.324,30.9415,59.0585,99.7314
983,984,665,3369,4947,268.103,44.7902,45.2098,99.9934
984,985,511,2728,4959,268.23900000000003,36.6244,53.3756,99.8771
