,Grain No.,Size [Pixel],center x-coordinate,center y-coordinate,mean azimuth [degree],mean latitude [degree],mean colatitude [degree],Regelungsgrad [%]
0,1,127854,842,302,65.6946,10.2936,79.7064,99.7348
1,2,505,607,106,116.199,17.7414,72.2586,99.9946
2,3,1592,1040,119,55.9462,38.1692,51.8308,98.3205
3,4,2949,1135,99,66.7732,70.4955,19.5045,99.9337
4,5,46473,1277,196,51.2901,49.7718,40.2282,99.4008
5,6,757,1661,102,47.4293,81.0308,8.96924,99.8369
6,7,982,1798,114,57.9267,6.5967,83.4033,99.0353
7,8,552,1498,106,66.5403,20.6119,69.3881,99.6975
8,9,90289,1988,308,69.7584,39.4184,50.5816,99.0332
9,10,8171,957,144,246.766,25.8326,64.1674,99.9391
10,11,114353,285,495,230.545,38.1524,51.8476,98.8593
11,12,502,1705,113,35.2063,79.5658,10.4342,99.953
12,13,14137,1499,169,245.681,24.9472,65.0528,99.7197
13,14,5675,1638,173,137.827,85.2361,4.76389,99.965
14,15,631,1226,125,244.169,14.1817,75.8183,99.9782
15,16,1026,1847,148,36.3598,17.6542,72.3458,99.5785
16,17,8694,3097,194,67.1128,3.59071,86.4093,99.9118
17,18,15519,3294,190,58.3408,24.7302,65.2698,99.9254
18,19,856,2697,144,252.23,63.1155,26.8845,99.9327
19,20,553,815,142,59.3889,51.827,38.173,99.8446
20,21,4539,1790,159,51.8409,66.6336,23.3664,99.0911
21,22,14200,2799,184,29.4203,68.7758,21.2242,99.9614
22,23,2800,2398,145,18.8577,85.4152,4.58475,99.7889
23,24,673,2663,145,31.6269,69.9355,20.0645,99.959
24,25,3068,3438,184,225.385,51.1512,38.8488,99.8271
25,26,2238,1080,155,31.9844,74.8595,15.1405,99.9945
26,27,686,1883,155,189.359,0.7086640000000001,89.2913,99.6664
27,28,20686,2575,221,59.3993,18.5517,71.4483,99.9065
28,29,27150,2913,262,67.643,79.7889,10.2111,99.8426
29,30,1424,401,177,357.2340000000001,5.18322,84.8168,99.9341
30,31,709,507,174,243.607,36.9122,53.0878,99.9516
31,32,944,1874,187,24.5151,31.8091,58.1909,97.4832
32,33,55033,483,371,251.316,41.6772,48.3228,98.846
33,34,2963,1572,209,82.1325,42.1623,47.8377,99.9842
34,35,7180,2408,230,251.844,22.9382,67.0618,99.9727
35,36,5282,2697,236,64.1072,35.8381,54.1619,99.9103
36,37,58610,3155,346,243.919,5.64661,84.3534,99.8622
37,38,947,3281,247,244.633,14.4727,75.5273,99.8854
38,39,56769,1440,340,247.725,26.0328,63.9672,99.5963
39,40,2100,1641,234,329.958,88.1223,1.87774,99.9793
40,41,814,2763,257,241.787,17.45,72.55,99.995
41,42,9139,2235,289,52.6285,73.3479,16.6521,99.9864
42,43,204103,2454,601,67.8504,0.426781,89.5732,99.1155
43,44,5937,1782,314,156.203,80.4563,9.54371,99.9465
44,45,4219,1698,295,66.9595,38.1792,51.8208,99.9802
45,46,1969,3472,302,232.448,42.7199,47.2801,99.9248
46,47,892,3330,276,49.9347,20.0955,69.9045,99.9865
47,48,18860,1175,351,73.8908,54.0218,35.9782,99.9773
48,49,513,1125,297,234.779,25.975,64.025,99.996
49,50,9231,3337,342,51.9375,24.3302,65.6698,99.9421
50,51,10268,2298,347,64.9236,23.1138,66.8862,99.9707
51,52,2075,2392,317,121.74,84.2129,5.7870599999999985,99.9891
52,53,965,2149,317,61.9222,36.146,53.854,99.9914
53,54,13741,2747,371,243.065,7.059710000000001,82.9403,99.9825
54,55,30540,2933,436,250.612,15.8294,74.1706,99.904
55,56,44700,2106,441,74.7801,29.3955,60.6045,99.8345
56,57,1030,2829,357,35.2604,74.7264,15.2736,99.9425
57,58,1800,3465,386,56.2859,23.0283,66.9717,99.8745
58,59,1052,1063,378,70.5907,52.3024,37.6976,99.9877
59,60,3481,2358,407,61.8597,4.95869,85.0413,99.967
60,61,776,1649,389,205.702,86.4742,3.52576,99.9896
61,62,850,2000,395,80.9607,35.3476,54.6524,99.4563
62,63,2436,3023,421,327.076,77.8876,12.1124,99.9487
63,64,119276,1402,536,81.8913,53.9531,36.0469,85.3069
64,65,7874,1006,460,249.971,15.1697,74.8303,99.8411
65,66,23134,3374,547,230.117,59.9702,30.0298,99.5526
66,67,3434,2308,440,66.2876,3.84438,86.1556,99.9724
67,68,970,1694,463,245.859,28.3367,61.6633,99.9941
68,69,4744,675,469,235.851,7.5506199999999986,82.4494,99.9941
69,70,36866,2801,573,229.942,78.3086,11.6914,98.7169
70,71,12453,3271,530,232.974,14.6854,75.3146,99.9755
71,72,7515,1749,538,249.837,29.4083,60.5917,99.7627
72,73,14405,2217,536,254.756,72.439,17.561,98.4093
73,74,9709,573,512,61.8839,41.4628,48.5372,99.8155
74,75,2338,1919,504,248.32,17.1034,72.8966,99.8917
75,76,13603,800,534,235.425,6.37194,83.6281,67.5997
76,77,1645,3455,517,229.022,59.7989,30.2011,99.5669
77,78,2983,3187,528,67.5618,70.298,19.702,99.61
78,79,15567,956,580,314.71,85.4377,4.56229,99.8971
79,80,24178,3078,596,61.8949,30.6022,59.3978,99.7907
80,81,2085,682,538,273.17,46.7196,43.2804,99.9912
81,82,2276,1868,552,234.145,30.9767,59.0233,99.9904
82,83,661,494,540,257.388,64.3472,25.6528,99.8782
83,84,1499,879,556,249.595,16.4024,73.5976,99.9983
84,85,77464,1708,737,67.9914,9.62471,80.3753,99.3885
85,86,3778,2039,572,63.5429,38.2151,51.7849,99.95
86,87,587,461,554,215.174,8.2881,81.7119,99.9818
87,88,4853,656,590,60.96,7.16507,82.8349,99.9974
88,89,625,523,562,239.116,10.7871,79.2129,99.992
89,90,12469,1072,620,266.468,50.3406,39.6594,99.981
90,91,1465,1248,580,58.2266,50.1996,39.8004,99.9429
91,92,3365,2219,610,266.721,72.7203,17.2797,99.9861
92,93,39499,794,747,262.244,43.8239,46.1761,99.8526
93,94,4470,446,612,252.536,59.3919,30.6081,99.9726
94,95,12089,2673,650,61.6041,26.9949,63.0051,99.9733
95,96,4260,2952,613,242.782,31.8908,58.1092,99.9422
96,97,7886,1314,627,58.2176,52.4386,37.5614,99.9547
97,98,10579,565,632,257.965,64.4628,25.5372,99.9791
98,99,2116,2095,598,68.5899,28.6021,61.3979,99.9798
99,100,48107,3217,722,24.8167,75.781,14.219,99.8933
100,101,2321,112,650,255.547,33.2995,56.7005,99.9826
101,102,31517,1901,696,59.3931,48.4558,41.5442,99.9044
102,103,21574,2093,752,215.987,63.9883,26.0117,99.9486
103,104,93615,527,803,57.5104,24.9456,65.0544,99.8501
104,105,816,868,656,48.403,32.8071,57.1929,99.5149
105,106,24426,3021,765,255.75,0.85955,89.1404,99.6938
106,107,4970,933,695,58.8973,21.677,68.32300000000001,99.9973
107,108,583,987,669,61.3123,52.2717,37.7283,99.7863
108,109,19363,2868,745,73.0481,28.2949,61.7051,99.9606
109,110,25994,191,778,68.1803,3.40506,86.5949,99.977
110,111,38905,1201,835,243.679,28.6358,61.3642,99.6745
111,112,29027,1419,757,249.036,19.2007,70.7993,99.9032
112,113,30949,992,823,242.724,30.802,59.198,99.9046
113,114,3818,1063,714,69.9158,52.1419,37.8581,99.9911
114,115,2163,1279,723,255.326,86.6574,3.3426400000000003,99.9957
115,116,4448,3419,768,64.8804,13.3182,76.6818,99.9166
116,117,2471,3349,729,246.614,10.8843,79.1157,99.993
117,118,734,873,713,50.1548,34.001999999999995,55.99800000000001,99.9975
118,119,3998,2735,746,354.7680000000001,74.5088,15.4912,99.9879
119,120,1951,1951,770,68.5042,33.7233,56.2767,99.7896
120,121,3150,898,763,72.2995,11.0619,78.9381,99.9907
121,122,2186,1253,780,245.689,42.3504,47.6496,99.9332
122,123,1232,3325,780,69.0762,7.46273,82.5373,99.9855
123,124,1055,1292,776,246.738,39.5865,50.4135,99.9973
124,125,1406,859,793,233.44,2.13097,87.869,99.9982
125,126,5987,2933,835,70.6592,2.83567,87.1643,99.9532
126,127,24251,2694,844,61.4144,30.3317,59.6683,99.9442
127,128,6000,2033,833,235.285,17.0571,72.9429,99.9925
128,129,10757,1904,841,26.6352,81.2494,8.75062,99.985
129,130,44218,3333,958,235.7,35.0221,54.9779,99.9525
130,131,5236,2431,841,256.316,22.8834,67.1166,99.9579
131,132,1245,1345,826,234.30900000000003,27.9583,62.0417,99.9948
132,133,37098,189,987,53.6441,26.7788,63.2212,99.3769
133,134,1518,3390,859,51.7185,33.4684,56.5316,99.9877
134,135,642,1127,849,234.71,1.40608,88.5939,99.936
135,136,5326,2827,893,53.5796,27.8573,62.1427,99.901
136,137,10731,1636,929,236.41,19.0414,70.9586,99.9597
137,138,13460,1327,931,37.1525,30.4297,59.5703,99.7746
138,139,142652,1977,1054,63.1995,7.83188,82.1681,94.0943
139,140,15065,1504,939,63.1691,55.3035,34.6965,99.7086
140,141,1578,3137,872,66.3568,31.2626,58.7374,99.9899
141,142,3315,759,895,251.683,57.6825,32.3175,99.9653
142,143,2691,1059,886,56.8934,5.92575,84.0742,99.9626
143,144,1741,314,896,241.792,72.5001,17.4999,99.9388
144,145,16711,2986,970,76.9928,12.3111,77.6889,99.281
145,146,563,2543,874,212.733,54.9108,35.0892,99.9697
146,147,41630,2439,1039,75.4971,26.4112,63.5888,99.4243
147,148,8947,3073,925,52.3763,28.3966,61.6034,99.9803
148,149,2144,2888,910,335.791,82.2126,7.78737,99.913
149,150,11396,2704,934,61.7117,0.853317,89.1467,99.9537
150,151,32260,3181,1025,233.023,60.547,29.453000000000007,99.5742
151,152,3474,1951,924,61.4499,17.4925,72.5075,99.938
152,153,12648,1097,980,52.0055,12.5533,77.4467,99.9748
153,154,2645,276,928,239.705,12.1419,77.8581,99.9968
154,155,1378,1572,911,85.8269,24.4615,65.5385,99.9496
155,156,19099,2575,1019,212.361,57.0893,32.9107,99.4526
156,157,18830,583,985,77.0297,49.9639,40.0361,99.6299
157,158,10560,719,961,244.316,32.1909,57.8091,99.9868
158,159,1604,2236,935,234.247,22.2437,67.7563,99.9495
159,160,10184,852,972,318.145,74.5729,15.4271,99.8409
160,161,47426,1439,1123,61.1147,44.5796,45.4204,99.6146
161,162,6625,956,977,57.9561,2.40656,87.5934,99.9641
162,163,1470,321,956,199.069,79.9102,10.0898,99.9878
163,164,638,2808,958,323.44,83.3195,6.68055,99.9813
164,165,31660,998,1105,240.04,35.5768,54.4232,99.894
165,166,28815,352,1089,252.333,64.9683,25.0317,99.7778
166,167,6979,1345,1012,246.067,53.8409,36.1591,99.7242
167,168,27195,2721,1082,215.6,56.6208,33.3792,99.7844
168,169,2483,2251,992,191.006,59.1011,30.8989,99.994
169,170,2487,2871,992,76.4614,4.05589,85.9441,99.9828
170,171,6906,1190,1051,347.44,78.2572,11.7428,99.9393
171,172,6284,774,1066,257.921,31.7447,58.2553,99.8476
172,173,19352,1651,1112,243.21,43.4811,46.5189,99.9267
173,174,28802,2887,1107,239.87,12.0464,77.9536,96.3825
174,175,717,905,1034,250.125,17.669,72.331,99.9827
175,176,1560,2232,1039,82.0125,26.3321,63.6679,99.5447
176,177,3064,670,1060,64.6955,26.2761,63.7239,99.8447
177,178,2107,3451,1077,57.0157,43.0187,46.9813,99.4293
178,179,1748,850,1055,243.622,18.1839,71.8161,99.9808
179,180,3254,726,1063,329.994,68.7896,21.2104,99.9956
180,181,15282,447,1124,263.089,37.1559,52.8441,78.4594
181,182,9626,1269,1104,255.659,55.6145,34.3855,99.973
182,183,9228,2295,1105,246.087,10.1786,79.8214,99.9958
183,184,837,628,1071,58.5345,30.4237,59.5763,99.9834
184,185,2796,573,1084,336.034,70.5935,19.4065,99.9679
185,186,1528,1121,1084,71.3624,20.2884,69.7116,99.9972
186,187,1671,99,1128,56.0807,30.7765,59.2235,99.8321
187,188,1016,266,1103,59.2644,33.1591,56.8409,99.9941
188,189,613,3398,1095,57.0242,40.9188,49.0812,99.8904
189,190,4392,854,1122,250.9,13.6372,76.3628,99.89
190,191,33742,197,1237,53.2383,29.6422,60.3578,99.9528
191,192,5185,2406,1133,356.076,76.7714,13.2286,99.9833
192,193,1099,3085,1105,264.248,13.9689,76.0311,99.9805
193,194,5038,629,1142,69.0453,26.6499,63.3501,99.7501
194,195,5739,1204,1146,43.5301,34.1953,55.8047,99.9208
195,196,49592,888,1291,61.1853,29.9408,60.0592,99.7952
196,197,1369,2642,1131,267.69,23.3658,66.6342,99.9767
197,198,3346,549,1148,262.3,41.5827,48.4173,99.9869
198,199,5217,754,1189,67.2588,30.0251,59.9749,99.9869
199,200,5054,3381,1171,62.2134,35.8056,54.1944,99.9776
200,201,1068,2195,1132,61.7845,1.39163,88.6084,99.9977
201,202,6276,3175,1158,70.5007,22.1256,67.8744,99.9771
202,203,2452,3304,1145,48.8595,27.5469,62.4531,99.9599
203,204,3749,2144,1171,8.0364,84.8415,5.15854,99.8688
204,205,5915,2582,1178,62.4997,22.0258,67.9742,99.9781
205,206,765,3010,1145,238.682,34.5033,55.4967,99.9686
206,207,89041,3008,1367,80.3842,4.44376,85.5562,99.5652
207,208,24992,1119,1304,248.491,70.4085,19.5915,99.7657
208,209,2795,3056,1168,299.405,80.8276,9.1724,99.9577
209,210,569,2219,1155,64.835,14.7548,75.2452,99.9979
210,211,5805,1547,1187,115.364,84.1743,5.82573,99.9812
211,212,513,3424,1172,55.7882,17.1014,72.8986,99.945
212,213,2520,659,1178,316.913,80.5738,9.42617,99.9675
213,214,59792,2323,1288,253.677,38.853,51.147,99.9328
214,215,39264,3270,1265,286.48,76.9282,13.0718,99.9239
215,216,72108,1923,1317,62.5046,25.0565,64.9435,99.6692
216,217,22239,456,1241,34.7148,66.4452,23.5548,99.9673
217,218,3436,699,1207,248.802,59.5667,30.4333,99.9957
218,219,16952,1313,1259,250.386,30.8666,59.1334,99.9794
219,220,638,980,1191,253.203,12.2389,77.7611,99.8501
220,221,7032,2708,1232,323.627,79.344,10.656,99.9684
221,222,7734,3079,1242,245.596,7.03598,82.964,99.9928
222,223,12784,1212,1293,69.1263,22.0589,67.9411,99.9562
223,224,25835,1613,1281,265.714,49.4304,40.5696,99.9244
224,225,1770,1070,1212,256.122,32.1144,57.8856,99.9739
225,226,809,1028,1215,75.4644,43.3588,46.6412,99.957
226,227,1306,3137,1223,246.15,48.4263,41.5737,99.9908
227,228,230343,931,1545,65.4241,11.5591,78.4409,99.0864
228,229,5016,2192,1290,71.9662,12.3652,77.6348,99.9958
229,230,4000,2634,1277,79.6697,4.79948,85.2005,99.9641
230,231,707,2566,1256,79.706,5.36966,84.6303,99.9806
231,232,572,2596,1274,324.85,79.8695,10.1305,99.9259
232,233,249517,351,1764,256.096,20.4044,69.5956,99.6281
233,234,24508,2531,1360,83.2685,56.2895,33.7105,99.8307
234,235,10473,2763,1325,67.0897,29.3064,60.6936,99.9799
235,236,2691,1738,1298,60.895,14.1784,75.8216,99.9796
236,237,1573,3045,1310,73.929,5.49494,84.5051,99.8714
237,238,3913,1465,1327,257.907,52.2837,37.7163,99.7271
238,239,2125,116,1347,328.95,71.9982,18.0018,99.95
239,240,615,2673,1321,73.7411,60.3511,29.6489,99.9653
240,241,554,3079,1319,69.4326,19.9816,70.0184,99.9842
241,242,15396,1398,1404,245.939,17.5411,72.4589,99.9085
242,243,3467,1015,1355,287.816,87.1245,2.87545,99.9851
243,244,276201,1806,1690,3.34548,74.9785,15.0215,91.9648
244,245,3230,2121,1375,223.221,87.6665,2.33347,99.9787
245,246,3571,1328,1352,257.902,43.9668,46.0332,99.9968
246,247,93856,2709,1599,74.9391,3.54989,86.4501,99.934
247,248,1363,1279,1389,243.773,63.1775,26.8225,99.9943
248,249,8045,3300,1429,264.398,76.9766,13.0234,99.9907
249,250,6141,1235,1417,247.472,20.2552,69.7448,99.9818
250,251,2863,2811,1407,56.1658,16.9533,73.0467,99.9947
251,252,15980,2906,1470,258.842,45.6389,44.3611,99.942
252,253,2215,2425,1419,323.51,81.5866,8.41335,99.975
253,254,592,1019,1408,252.416,20.734,69.266,99.9889
254,255,50787,2270,1505,213.307,54.7665,35.2335,99.9204
255,256,8782,2798,1504,68.0812,30.1178,59.8822,99.8696
256,257,5336,3369,1468,253.03,32.7011,57.2989,99.9543
257,258,4553,1016,1465,222.911,85.061,4.939,99.9775
258,259,6095,1349,1478,248.633,40.4747,49.5253,99.9807
259,260,17880,2528,1530,311.166,79.6871,10.3129,98.9647
260,261,666,3441,1480,250.721,34.1284,55.8716,99.933
261,262,51663,3269,1637,54.8049,16.4182,73.5818,99.9628
262,263,3897,951,1512,247.189,17.9769,72.0231,99.9316
263,264,666,3172,1490,70.8226,77.76100000000002,12.239,99.9659
264,265,12938,1398,1556,49.6332,17.0781,72.9219,99.9808
265,266,1549,136,1505,28.2516,60.5128,29.4872,99.7687
266,267,2874,2425,1544,359.074,79.6285,10.3715,98.7291
267,268,996,1477,1534,1.5003799999999998,68.492,21.508000000000006,99.635
268,269,1229,2095,1539,75.6284,50.6556,39.3444,99.1312
269,270,8582,2044,1576,64.7255,12.5202,77.4798,99.9386
270,271,1192,3434,1570,59.4881,17.4239,72.5761,99.6206
271,272,711,169,1539,258.772,25.5295,64.4705,99.9902
272,273,4074,2985,1563,68.4873,28.9986,61.0014,99.105
273,274,23699,199,1634,26.4823,59.7126,30.2874,99.97
274,275,33381,811,1689,91.4709,80.42,9.57999,99.8866
275,276,553,94,1566,30.1265,61.7701,28.2299,99.9633
276,277,9267,1532,1594,273.237,50.9563,39.0437,99.8833
277,278,651,2898,1563,249.52,17.7505,72.2495,99.9823
278,279,4025,1612,1671,268.026,50.8987,39.1013,99.9804
279,280,558,2888,1596,54.4222,16.9421,73.0579,99.8909
280,281,33264,2996,1689,56.1567,15.68,74.32,99.8945
281,282,64222,2218,1733,65.6104,52.3853,37.6147,99.8921
282,283,30807,2489,1744,263.54200000000003,54.8243,35.1757,99.8392
283,284,835,600,1620,91.0975,86.6277,3.37232,99.9941
284,285,508,3037,1617,67.0521,20.7715,69.2285,98.8194
285,286,1352,1378,1640,25.7854,83.4059,6.5940699999999985,99.9886
286,287,90879,1459,1833,260.775,42.5026,47.4974,99.7332
287,288,41859,626,1789,258.011,31.671,58.32899999999999,99.9677
288,289,3930,397,1686,329.856,82.7626,7.23735,99.9863
289,290,1292,1571,1698,268.932,50.4602,39.5398,99.996
290,291,8370,2410,1756,272.567,60.2346,29.7654,99.8703
291,292,5091,280,1741,125.581,86.2325,3.76751,99.9786
292,293,66804,3171,1863,55.0589,71.1621,18.8379,99.5922
293,294,16746,150,1787,247.851,37.2771,52.7229,99.9549
294,295,828,335,1727,232.15,39.566,50.434,99.9965
295,296,5875,747,1821,95.1842,86.9962,3.00381,99.9465
296,297,527,3428,1764,53.9774,19.0167,70.9833,99.9089
297,298,3060,2801,1784,272.916,51.5576,38.4424,99.9229
298,299,168370,1002,1948,252.209,16.2352,73.7648,99.8758
299,300,1086,3005,1796,81.4654,40.2692,49.7308,99.9677
300,301,1452,2654,1792,262.653,55.2369,34.7631,99.8348
301,302,19938,288,1859,69.9047,26.0603,63.9397,99.9269
302,303,3386,2937,1829,257.712,52.9318,37.0682,99.9674
303,304,17220,2806,1876,60.6678,32.473,57.527,99.9638
304,305,4545,2725,1841,274.25,54.2722,35.7278,99.9688
305,306,4445,2637,1841,274.53700000000003,55.7618,34.2382,99.9806
306,307,1909,3013,1837,284.1690000000001,52.548,37.452,99.9807
307,308,3363,2297,1850,210.324,73.0333,16.9667,93.8997
308,309,173900,2369,2081,309.434,75.5157,14.4843,99.0888
309,310,1779,2347,1890,297.502,77.0447,12.9553,99.7689
310,311,1961,2602,1884,253.308,5.83665,84.1634,99.9869
311,312,1408,679,1890,250.899,20.3663,69.6337,99.9956
312,313,3557,2925,1917,251.873,27.8657,62.1343,99.8866
313,314,2362,266,1908,255.952,15.1465,74.8535,99.9904
314,315,8605,167,1969,73.6513,31.337,58.663,99.8006
315,316,29717,2593,1984,82.8688,25.6985,64.3015,99.7606
316,317,12145,3311,1966,54.4655,16.576,73.42399999999998,99.9424
317,318,1775,2793,1934,62.8147,70.4637,19.5363,99.9895
318,319,1085,1641,1944,62.1623,19.4458,70.5542,99.9914
319,320,1815,2865,1946,64.7171,69.7743,20.2257,99.9387
320,321,1847,237,1955,71.4258,26.2179,63.7821,99.9896
321,322,1746,1656,1987,240.458,71.3142,18.6858,99.964
322,323,2609,2823,1991,252.71,27.8405,62.1595,99.9907
323,324,9224,568,2017,217.753,65.6882,24.3118,97.103
324,325,3614,1588,1997,71.2082,56.499,33.501,99.9361
325,326,559,1953,1984,254.943,76.17399999999998,13.826,99.9512
326,327,1450,3094,1991,57.5723,17.2419,72.7581,99.9882
327,328,19153,3398,2105,247.381,26.0028,63.9972,99.8544
328,329,468889,2772,2331,76.2486,23.5206,66.4794,99.382
329,330,370095,1099,2337,244.535,14.404000000000002,75.596,92.241
330,331,39259,2051,2174,248.157,22.2511,67.7489,99.8441
331,332,8630,1535,2073,32.326,83.2751,6.724939999999999,99.6358
332,333,7544,1650,2057,55.5434,13.5522,76.4478,99.9858
333,334,11804,1236,2101,73.9763,16.1825,73.8175,99.9693
334,335,13083,1959,2104,222.475,78.3234,11.6766,99.7788
335,336,3545,2789,2057,72.5288,25.9486,64.0514,99.4366
336,337,3116,458,2062,131.526,68.8544,21.1456,99.9133
337,338,18615,698,2096,69.1241,5.74699,84.25299999999999,99.9749
338,339,8611,536,2107,275.481,69.5899,20.4101,99.9907
339,340,1041,608,2114,64.2065,8.419410000000001,81.5806,99.9973
340,341,97340,327,2337,77.0878,4.57362,85.4264,98.6457
341,342,4769,1749,2126,56.4275,3.27598,86.72399999999998,99.9663
342,343,2275,1834,2128,55.5522,3.62486,86.3751,99.9833
343,344,28161,1612,2208,211.008,75.5408,14.4592,99.9093
344,345,3111,1891,2163,299.506,76.4546,13.5454,99.9808
345,346,2430,1001,2185,18.8351,71.5547,18.4452,99.9934
346,347,18567,1811,2252,216.421,50.249,39.751,99.9664
347,348,550,67,2204,260.073,13.5671,76.4329,99.949
348,349,1932,1902,2236,248.257,25.5624,64.4376,99.9934
349,350,163216,550,2543,246.226,6.42499,83.575,82.8651
350,351,13970,1703,2322,72.0049,43.6087,46.3913,99.9774
351,352,6834,1943,2314,61.1436,39.3576,50.6424,99.8433
352,353,51418,2044,2516,240.171,10.3853,79.6147,99.9722
353,354,8406,3378,2386,251.545,4.83744,85.1626,99.9465
354,355,2459,1878,2373,45.719,37.8218,52.1782,99.919
355,356,2221,111,2389,229.201,82.5028,7.49719,99.9832
356,357,690,40,2351,231.825,82.0875,7.912539999999999,99.9132
357,358,1205,1923,2363,240.201,41.048,48.952,99.9882
358,359,1441,2762,2366,244.444,26.7847,63.2153,99.9823
359,360,5921,1828,2396,67.3118,42.243,47.757,99.9931
360,361,16986,1944,2450,242.939,42.8014,47.1986,99.791
361,362,690,40,2404,220.032,79.673,10.327,99.9458
362,363,1230,1726,2404,251.592,2.92908,87.0709,99.9903
363,364,2540,1155,2423,73.1234,4.0963699999999985,85.9036,99.9686
364,365,29398,1730,2508,51.3245,39.9675,50.0325,99.8271
365,366,82515,3006,2621,252.789,41.4725,48.5275,88.0424
366,367,551,815,2424,80.19,10.1279,79.8721,99.9841
367,368,99204,1402,2599,251.096,59.0006,30.9994,95.9765
368,369,11013,3273,2496,48.2786,31.3783,58.6217,99.9667
369,370,2565,1797,2479,92.6549,18.0824,71.9176,99.9879
370,371,3735,2488,2510,88.6943,34.3369,55.6631,99.4714
371,372,41834,3295,2715,314.013,81.0683,8.93171,99.7001
372,373,1260,3184,2520,51.64100000000001,20.302,69.69800000000001,98.7613
373,374,5325,2553,2563,253.887,1.98311,88.0169,99.9147
374,375,1862,77,2558,65.8776,23.8272,66.1728,99.953
375,376,674,301,2524,82.6831,11.057,78.943,99.9959
376,377,5111,180,2587,129.715,66.0476,23.9524,99.8096
377,378,950,252,2529,122.942,67.8161,22.1839,99.9869
378,379,2211,114,2566,265.723,54.9711,35.0289,99.9911
379,380,1145,37,2563,67.4802,23.892,66.108,99.9286
380,381,6526,1861,2590,39.2982,11.5318,78.4682,99.9794
381,382,6905,2428,2588,249.565,1.66416,88.3358,99.8777
382,383,2963,253,2586,71.8614,4.76322,85.2368,99.9959
383,384,4532,1909,2634,247.016,36.9262,53.0738,99.9728
384,385,4219,312,2603,78.2119,65.369,24.631,99.9856
385,386,3587,2619,2609,262.572,51.5904,38.4096,99.9809
386,387,9788,3206,2626,49.0619,23.2831,66.7169,99.9889
387,388,14585,1727,2646,29.5835,64.7349,25.2651,99.9739
388,389,24391,1055,2662,252.148,10.4929,79.5071,99.993
389,390,4365,2519,2630,78.4145,30.9066,59.0934,99.9881
390,391,19241,1611,2703,43.7011,40.1654,49.8346,99.9488
391,392,2366,2846,2646,278.034,60.9886,29.0114,99.9941
392,393,1710,1178,2652,250.148,1.6769599999999998,88.323,99.9757
393,394,9527,650,2689,260.133,18.477,71.523,99.9877
394,395,1810,2465,2653,238.027,5.10266,84.8973,99.9022
395,396,33228,181,2710,208.29,63.533,26.467,99.9859
396,397,1675,1810,2655,88.3264,8.07526,81.9247,99.992
397,398,5508,2576,2677,317.6140000000001,78.0116,11.9884,99.9439
398,399,20574,2632,2740,256.05400000000003,47.8187,42.1813,99.8727
399,400,5967,2791,2689,252.21,49.7822,40.2178,99.9453
400,401,17570,1179,2759,263.008,53.2535,36.7465,99.9615
401,402,44017,2261,2807,242.623,17.9044,72.0956,99.9135
402,403,3011,327,2701,71.0139,9.57293,80.4271,99.9639
403,404,1262,2168,2673,256.317,38.521,51.479,99.99
404,405,1188,2426,2674,69.8663,0.00512695,89.9949,99.9713
405,406,1628,2493,2695,253.48,0.33710500000000004,89.6629,99.9735
406,407,1149,3213,2687,76.6395,86.9483,3.05172,99.9962
407,408,4963,2147,2725,57.1952,54.9242,35.0758,99.9182
408,409,8737,2044,2723,155.94899999999996,74.5194,15.4806,99.929
409,410,1280,1878,2698,249.717,30.4413,59.5587,99.9908
410,411,406897,2610,3183,246.913,5.248480000000002,84.7515,99.2873
411,412,3462,1276,2723,57.5175,47.2888,42.7112,99.9958
412,413,2643,1805,2732,252.483,30.9429,59.0571,99.9819
413,414,20157,1880,2808,247.03,21.5197,68.4803,99.8698
414,415,5206,961,2737,34.4674,68.3113,21.6887,99.977
415,416,769,2724,2716,240.345,2.64016,87.3598,99.9814
416,417,13609,795,2752,244.69,24.0077,65.9923,99.9709
417,418,610,2197,2717,35.3316,17.3668,72.6332,99.9904
418,419,1871,3154,2776,268.436,64.9313,25.0687,99.9963
419,420,897,2758,2735,183.509,75.7893,14.2107,99.9931
420,421,1143,2226,2762,32.3132,16.4726,73.5274,99.9834
421,422,3818,2884,2761,257.008,17.6052,72.3948,99.9936
422,423,19059,1678,2814,60.588,41.5109,48.4891,99.9145
423,424,3943,2788,2781,254.216,18.526,71.47399999999998,99.9832
424,425,1417,1844,2759,262.636,1.92385,88.0761,99.9954
425,426,5532,2005,2765,89.6245,19.2101,70.7899,99.9504
426,427,13766,706,2838,252.653,10.4139,79.5861,99.9784
427,428,6608,1041,2799,256.271,2.56448,87.4355,99.9893
428,429,972,315,2762,47.0976,28.1528,61.8472,99.7507
429,430,13253,1533,2827,43.3557,30.5795,59.4205,99.9948
430,431,12881,283,2835,244.088,27.2465,62.7535,99.9959
431,432,10100,955,2833,244.11900000000003,44.7871,45.2129,99.8885
432,433,955,2834,2802,188.928,72.9696,17.0304,99.9881
433,434,119484,1390,2990,261.67400000000004,13.898,76.102,99.7518
434,435,5122,2726,2823,60.5681,0.967194,89.0328,99.9839
435,436,6479,846,2826,259.569,52.7993,37.2007,99.9921
436,437,42920,156,2941,238.696,52.3918,37.6082,98.1382
437,438,5908,1409,2832,69.7324,18.8641,71.1359,99.987
438,439,894,2890,2812,169.668,77.0447,12.9553,98.928
439,440,8288,607,2853,242.882,38.344,51.65600000000001,99.9915
440,441,6069,2536,2837,289.013,78.4618,11.5382,99.9659
441,442,3662,2001,2830,243.208,29.3965,60.6035,99.978
442,443,8136,3190,2856,240.275,83.3663,6.6337100000000015,99.9633
443,444,6230,386,2867,45.4065,31.6745,58.3255,99.9422
444,445,585,413,2826,264.933,54.515,35.485,99.9956
445,446,4266,2896,2858,143.588,82.735,7.26501,99.9342
446,447,18384,3039,2886,105.496,29.8213,60.1787,99.7808
447,448,719,2650,2827,114.802,76.3554,13.6446,99.9754
448,449,585,1755,2844,247.755,71.0319,18.9681,99.9535
449,450,592,544,2837,242.87,24.367,65.633,99.9977
450,451,6657,2074,2874,86.7317,21.8864,68.1136,99.5841
451,452,1014,2599,2849,72.0711,0.224976,89.775,99.9956
452,453,145842,1237,3153,58.399,34.4031,55.5969,99.2415
453,454,1224,2636,2859,164.985,72.5363,17.4637,99.9851
454,455,12915,538,2916,44.9176,30.7885,59.2115,99.8781
455,456,89369,801,3049,28.9024,66.6896,23.3104,98.9481
456,457,1943,449,2889,265.13,32.1222,57.8778,99.7048
457,458,4631,3343,2926,250.014,59.5645,30.4355,99.9282
458,459,5451,1763,2906,246.974,69.9675,20.0325,99.9754
459,460,177146,1856,3144,265.812,1.02519,88.9748,99.6203
460,461,3078,2857,2912,254.426,17.7932,72.2068,99.9859
461,462,3674,763,2920,238.468,43.5657,46.4343,99.9886
462,463,52584,3058,3171,65.4347,8.652339999999999,81.3477,99.5382
463,464,811,1857,2904,240.96,30.883000000000006,59.117,99.9902
464,465,22706,3180,2973,251.116,59.1161,30.8839,99.9519
465,466,6087,3287,2940,231.699,5.20798,84.792,99.99
466,467,3077,1662,2925,252.189,73.3822,16.6178,99.9672
467,468,6683,334,2937,22.5065,78.7804,11.2196,99.9448
468,469,151597,2033,3400,65.2832,10.2274,79.7726,98.1293
469,470,357553,386,3482,241.935,18.7396,71.2604,71.8139
470,471,1993,1645,2971,68.0003,43.3102,46.6898,99.9945
471,472,1643,2346,2971,68.8189,6.71762,83.2824,99.9943
472,473,7351,547,3013,277.066,54.2862,35.7138,99.7654
473,474,1376,1712,2978,248.482,60.0922,29.9078,99.9885
474,475,4156,2110,3018,80.9529,27.7868,62.2132,99.6982
475,476,1861,3323,3035,101.211,32.7514,57.2486,99.6771
476,477,2499,1639,3057,57.8453,16.0928,73.9072,99.9778
477,478,10585,3132,3108,96.5693,31.1207,58.8793,99.8303
478,479,169220,3220,3439,255.571,24.9715,65.0285,99.8887
479,480,6114,590,3137,47.8454,36.326,53.674,99.9956
480,481,4631,532,3154,48.1711,36.1124,53.8876,99.9977
481,482,61852,978,3285,74.9442,28.6286,61.3714,99.7091
482,483,756,3391,3170,255.843,24.9785,65.0215,99.9411
483,484,19601,616,3254,242.613,41.0557,48.9443,99.9714
484,485,899,2272,3212,74.7006,8.58779,81.4122,99.9925
485,486,2585,737,3241,46.6683,37.2169,52.7831,99.9967
486,487,3249,782,3268,44.2233,39.4521,50.5479,99.9944
487,488,34020,1598,3368,64.9722,50.5191,39.4809,99.9517
488,489,6975,2263,3322,160.313,82.1977,7.8023,99.9813
489,490,6251,1139,3300,69.6014,20.102,69.898,99.9871
490,491,3223,1453,3325,63.972,50.5919,39.4081,99.8828
491,492,57773,789,3569,65.824,56.0436,33.9564,99.8124
492,493,1104,679,3329,57.7834,2.62337,87.3766,99.9955
493,494,595,1486,3363,272.099,5.96809,84.0319,99.992
494,495,84054,2118,3612,242.58,59.5952,30.4048,99.5522
495,496,39963,2302,3516,211.553,76.6479,13.3521,99.1979
496,497,1809,832,3397,73.4587,28.5538,61.4462,99.9772
497,498,14165,957,3430,249.368,16.9955,73.0045,99.9131
498,499,740,2361,3428,71.0461,12.8032,77.1968,99.9703
499,500,2769,1755,3429,57.9892,10.199,79.801,99.9838
500,501,16428,130,3473,8.94058,87.2071,2.79288,99.525
501,502,12027,1270,3434,74.028,18.1638,71.8362,99.9666
502,503,62917,1539,3541,267.971,12.8202,77.1798,87.1601
503,504,2786,1088,3433,245.911,11.4909,78.5091,99.9848
504,505,1972,40,3445,52.5942,76.3885,13.6115,99.9712
505,506,39000,2795,3542,72.1738,13.9323,76.0677,99.8452
506,507,143393,1115,3670,241.775,0.131073,89.8689,95.9896
507,508,1175,1112,3482,247.31,17.44,72.56,99.9873
508,509,24446,678,3572,57.9635,2.30866,87.6913,99.9882
509,510,812,1056,3493,74.2684,58.2005,31.7995,99.362
510,511,3044,270,3509,238.285,72.4785,17.5215,99.5021
511,512,1025,54,3518,2.29292,82.2058,7.7941699999999985,99.8477
512,513,28896,3013,3668,95.732,31.8841,58.1159,97.8205
513,514,8301,1807,3594,54.1188,10.4348,79.5652,99.9713
514,515,2368,388,3555,34.7083,83.9516,6.04844,99.9826
515,516,7351,50,3633,62.0183,18.5258,71.4742,99.9248
516,517,29342,233,3609,64.1454,7.68595,82.314,99.9321
517,518,80801,2614,3739,40.6749,30.1997,59.8003,99.8448
518,519,2647,101,3617,262.37,64.9107,25.0893,99.9659
519,520,4069,1354,3618,50.8262,37.9437,52.0563,99.9887
520,521,1342,380,3599,230.99400000000003,86.0284,3.97158,99.9825
521,522,2049,1723,3612,262.945,56.5174,33.4826,99.9914
522,523,4521,1656,3636,51.5952,57.6855,32.3145,99.9775
523,524,2456,1444,3650,262.205,70.2828,19.7172,99.8443
524,525,620,1502,3620,276.53700000000003,68.5244,21.4756,99.9941
525,526,1011,1990,3633,60.5511,37.596,52.404,99.9405
526,527,14988,2265,3725,73.9514,10.3755,79.6245,99.9244
527,528,30731,2924,3852,55.916,37.1705,52.8295,96.674
528,529,4817,1387,3677,59.0122,37.8018,52.1982,99.9912
529,530,1705,1721,3660,57.6778,40.758,49.242,99.9967
530,531,1252,2361,3662,71.7732,13.2359,76.7641,99.862
531,532,77603,682,3930,70.166,2.62485,87.3752,99.8244
532,533,763,2012,3670,60.6085,38.3388,51.6612,99.9909
533,534,13790,2427,3751,58.4155,8.34152,81.6585,99.7521
534,535,1928,2324,3696,196.793,81.5303,8.46972,99.9948
535,536,2726,129,3724,261.694,64.0324,25.9676,99.9854
536,537,18776,1693,3753,265.877,55.2574,34.7426,99.9351
537,538,28099,204,3810,246.077,27.752,62.24800000000001,99.9507
538,539,3821,70,3741,76.4209,15.5387,74.4613,99.9291
539,540,981,1286,3714,55.5862,40.9738,49.0262,99.9972
540,541,3819,2844,3738,48.4655,22.4262,67.5738,99.9918
541,542,2056,1570,3734,274.619,55.0344,34.9656,99.9805
542,543,3473,1457,3736,244.346,0.983528,89.0165,99.964
543,544,713,3316,3719,56.5998,38.1971,51.8029,99.9844
544,545,3162,2992,3744,240.912,4.68875,85.3112,99.9484
545,546,2472,2789,3733,92.3934,28.6968,61.3032,99.9864
546,547,12139,1369,3773,258.171,54.9449,35.0551,99.9816
547,548,15642,896,3791,65.6635,3.74935,86.2506,99.6568
548,549,14953,3231,3795,67.039,45.6141,44.3859,99.9401
549,550,2481,1299,3772,75.7284,1.0118,88.9882,99.9917
550,551,589,3331,3763,56.9854,1.42091,88.5791,99.9554
551,552,103798,2216,3946,70.7217,17.9957,72.0043,97.2681
552,553,965,2772,3788,50.0862,22.4016,67.5984,99.9888
553,554,958,1539,3792,268.651,54.6867,35.3133,99.9957
554,555,2944,295,3791,238.833,55.9864,34.0136,99.9902
555,556,4498,2857,3805,57.1664,0.275429,89.7246,99.9017
556,557,11751,65,3851,73.8554,10.0135,79.9865,99.9784
557,558,13286,1472,3847,231.554,9.18784,80.8122,42.9365
558,559,14536,1841,3840,239.423,12.4405,77.5595,99.8475
559,560,19897,1593,3885,247.366,6.54053,83.4595,99.9846
560,561,999,977,3806,221.054,46.6575,43.3425,99.9978
561,562,11592,3055,3873,243.771,73.9795,16.0205,99.9225
562,563,3459,538,3829,217.631,82.3129,7.68715,99.9612
563,564,1028,3314,3827,68.2026,3.53365,86.4664,99.9979
564,565,35448,878,3942,221.294,45.6655,44.3345,99.9424
565,566,614,3384,3836,60.8615,6.75587,83.2441,99.9207
566,567,4454,1052,3858,221.288,46.9087,43.0913,99.9924
567,568,2203,2833,3846,213.772,72.9402,17.0598,99.9164
568,569,10859,3264,3887,245.654,33.3062,56.6938,99.9852
569,570,809,2760,3844,56.1901,2.27956,87.7204,99.9635
570,571,8465,1689,3907,34.3895,77.5069,12.4931,99.8925
571,572,2824,1384,3882,264.314,56.2614,33.7386,99.9862
572,573,2796,582,3899,45.3212,35.0016,54.9984,99.7738
573,574,12352,2769,3941,241.5,4.4741,85.5259,99.9893
574,575,3652,1009,3906,248.848,9.36914,80.6309,99.9947
575,576,1955,1348,3918,53.9546,30.6263,59.3737,99.9458
576,577,20580,2543,3982,241.565,30.5168,59.4832,99.8819
577,578,4724,2669,3929,253.56,44.93600000000001,45.06399999999999,99.9755
578,579,1658,1289,3911,239.432,19.6156,70.3844,99.9954
579,580,21929,1786,3992,234.385,48.1071,41.8929,99.7357
580,581,19014,1936,4008,72.4418,38.0598,51.9402,99.3608
581,582,11932,3200,3959,248.054,37.2791,52.7209,99.8507
582,583,10028,175,3935,217.366,65.9382,24.0618,99.9742
583,584,3486,3098,3928,256.256,31.9585,58.0415,99.9622
584,585,779,1067,3922,78.146,37.0202,52.9798,99.9837
585,586,1479,1115,3928,234.701,59.7351,30.2649,99.9889
586,587,2408,1211,3935,248.287,16.4324,73.5676,99.9818
587,588,13943,1387,4029,56.4808,30.8624,59.1376,99.7939
588,589,1078,1430,3941,265.777,3.24931,86.7507,99.4342
589,590,1082,1288,3947,231.382,59.5977,30.4023,99.9928
590,591,3837,507,3968,44.6946,46.8278,43.1722,99.9593
591,592,7291,1516,3996,50.0484,29.6055,60.3945,99.1907
592,593,916,1251,3970,235.826,1.2743799999999998,88.7256,99.9639
593,594,7640,1020,4014,73.3327,37.2211,52.7789,99.596
594,595,3269,574,3992,51.6021,1.10302,88.897,98.2896
595,596,14995,1152,4015,88.4236,81.109,8.89102,99.1272
596,597,835,70,3974,62.729,25.1778,64.8222,99.8271
597,598,18243,3010,4025,237.004,22.5112,67.4888,99.8594
598,599,843,1444,3987,258.474,40.0042,49.9958,99.6575
599,600,544,1563,3987,64.6343,40.0578,49.9422,99.9846
600,601,5703,1652,4006,42.8243,23.1002,66.8998,99.8863
601,602,1406,1301,3996,242.008,15.0947,74.9053,99.943
602,603,7742,157,4010,42.1125,78.3608,11.6392,93.3979
603,604,1208,2645,3990,75.0754,74.2522,15.7478,99.9902
604,605,5816,41,4073,52.019,61.8492,28.1508,99.6783
605,606,932,3130,4001,257.502,27.1376,62.8624,99.975
606,607,16854,2744,4056,57.5123,7.153980000000002,82.846,99.9495
607,608,1003,2848,4018,253.487,22.9498,67.0502,99.9283
608,609,963,463,4020,47.2477,34.3848,55.6152,99.7976
609,610,2384,510,4028,254.996,64.5527,25.4473,99.8093
610,611,1138,2883,4025,54.4083,60.7551,29.2449,99.9708
611,612,10480,3267,4059,63.8587,32.9701,57.0299,99.7436
612,613,2031,229,4037,265.314,61.4285,28.5715,99.9942
613,614,4322,1597,4070,45.7821,41.018,48.982,98.9858
614,615,1853,2637,4030,258.374,20.9958,69.0042,99.9249
615,616,9874,547,4088,254.604,65.6024,24.3976,99.9826
616,617,10760,99,4104,52.5777,61.9946,28.0054,99.9418
617,618,1078,1248,4040,262.758,5.197,84.803,99.9647
618,619,5155,810,4074,241.699,4.60668,85.3933,99.9733
619,620,7810,2568,4101,260.141,61.8299,28.1701,99.8806
620,621,772,1191,4048,67.1707,37.1509,52.8491,99.9915
621,622,20849,1481,4157,232.717,27.277,62.723,99.8996
622,623,2479,1050,4065,231.502,46.3268,43.6732,99.9982
623,624,3010,1662,4075,245.6,4.37638,85.6236,99.9897
624,625,11726,2272,4101,241.803,3.13882,86.8612,99.9931
625,626,4048,3141,4068,176.752,82.9296,7.07045,99.0538
626,627,1091,1306,4066,53.5464,30.5387,59.4613,99.9895
627,628,5562,2427,4092,240.363,3.2103,86.7897,99.8143
628,629,918,471,4073,243.04,34.5622,55.4378,99.9663
629,630,4836,2046,4094,55.0519,67.5655,22.4345,99.9644
630,631,21079,211,4182,56.25,11.5261,78.4739,99.8507
631,632,34698,914,4206,245.272,55.7174,34.2826,63.9039
632,633,20948,1869,4125,230.362,29.7757,60.2243,99.9717
633,634,2804,2878,4080,247.281,16.3561,73.6439,99.975
634,635,11187,1214,4117,66.0174,1.5416299999999998,88.4584,99.9762
635,636,6129,279,4096,41.4869,69.9658,20.0342,99.9891
636,637,8715,2637,4153,244.158,1.55309,88.4469,99.8363
637,638,668,3239,4087,235.099,20.1405,69.8595,99.9983
638,639,965,753,4094,66.5878,10.4408,79.5592,99.9727
639,640,3091,610,4117,55.7497,7.30151,82.6985,99.9873
640,641,927,3054,4100,268.362,61.7981,28.2019,99.9901
641,642,17484,1327,4173,50.5405,31.8854,58.1146,99.9905
642,643,2189,1022,4124,233.445,5.08515,84.9148,99.9277
643,644,16275,1136,4187,69.467,9.98811,80.0119,99.8941
644,645,1647,3192,4115,63.0582,10.3444,79.6556,99.9963
645,646,773,448,4110,56.4601,56.0832,33.9168,99.9879
646,647,4648,3133,4135,250.792,29.5153,60.4847,99.9808
647,648,30551,2907,4195,54.6188,23.7031,66.2969,99.8682
648,649,1235,1990,4126,57.9479,34.9297,55.0703,99.9954
649,650,2171,1624,4133,232.349,27.4301,62.5699,99.9929
650,651,887,2841,4123,62.5706,1.64894,88.3511,99.975
651,652,2954,3244,4142,246.652,29.2022,60.7978,99.9813
652,653,1003,1716,4128,242.261,36.3543,53.6457,99.9745
653,654,9269,2056,4179,55.144,14.3321,75.6679,99.9288
654,655,684,2408,4123,257.119,62.9086,27.0914,99.9305
655,656,782,2701,4136,265.52,23.4212,66.5788,99.7344
656,657,1188,305,4155,243.819,32.6364,57.3636,99.9936
657,658,771,458,4143,27.0347,84.4493,5.55072,99.99
658,659,4304,2745,4173,250.965,14.1573,75.8427,99.9661
659,660,17653,1654,4215,48.1822,37.6572,52.3428,99.952
660,661,12622,598,4211,42.9558,77.0596,12.9404,99.971
661,662,1398,2471,4175,267.137,63.4732,26.5268,99.9888
662,663,6189,1800,4174,249.081,47.8056,42.1944,99.9829
663,664,1505,2189,4166,225.808,69.6412,20.3588,99.9566
664,665,36640,2253,4260,231.359,54.9401,35.0599,99.772
665,666,6483,3266,4190,50.9792,29.4261,60.5739,99.9713
666,667,8586,497,4208,36.0621,76.0864,13.9136,99.9623
667,668,556,2514,4167,249.442,2.44877,87.5512,99.9938
668,669,14839,3103,4225,248.077,34.1358,55.8642,99.994
669,670,1453,2555,4175,252.769,21.8316,68.1684,99.9947
670,671,3417,997,4197,53.8365,42.9767,47.0233,99.9891
671,672,5534,2705,4228,62.7607,9.49429,80.5057,99.9962
672,673,2346,55,4204,65.4963,9.51875,80.4812,99.9233
673,674,5841,2128,4219,250.444,45.0804,44.9196,99.9291
674,675,27849,2480,4279,54.9685,43.6025,46.3975,98.1151
675,676,24180,1098,4290,231.65,50.0124,39.9876,99.9403
676,677,4340,812,4250,231.478,47.8499,42.1501,99.3599
677,678,1130,1991,4214,70.0017,35.2403,54.7597,99.935
678,679,2565,1209,4211,231.257,48.6531,41.3469,99.9979
679,680,5028,1561,4249,256.763,72.2389,17.7611,99.9714
680,681,1360,1259,4217,55.6718,46.0518,43.9482,99.9786
681,682,27537,1473,4422,70.0877,39.6847,50.3153,87.6996
682,683,857,1958,4222,50.5098,76.8179,13.182,99.9839
683,684,25967,1778,4301,221.066,60.5852,29.4148,99.9039
684,685,14037,732,4318,49.4578,29.4033,60.5967,99.893
685,686,5838,2606,4264,61.683,39.5902,50.4098,99.9352
686,687,17916,444,4296,234.645,42.051,47.949,99.9331
687,688,32219,3097,4347,194.154,84.9488,5.05125,99.5516
688,689,2413,3277,4262,254.105,42.5548,47.4452,99.9258
689,690,33630,1971,4341,237.215,42.7085,47.2915,99.9099
690,691,2023,1365,4256,240.073,54.2781,35.7219,99.9925
691,692,6696,2340,4284,229.588,0.8850100000000001,89.115,99.9201
692,693,40692,184,4380,239.601,35.109,54.89100000000001,99.9525
693,694,1157,706,4254,238.259,47.4005,42.5995,99.9974
694,695,3013,2852,4276,64.9688,4.1098300000000005,85.8902,99.9903
695,696,1448,1907,4262,52.8457,14.4168,75.5832,99.9686
696,697,3605,316,4281,228.372,3.55036,86.4496,99.9724
697,698,547,74,4264,58.1843,30.6452,59.3548,99.9706
698,699,765,2092,4275,58.3458,9.54799,80.452,99.9945
699,700,520,47,4272,54.3901,23.6686,66.3314,99.9488
700,701,11894,2752,4314,287.087,84.8955,5.10446,99.9236
701,702,4128,1334,4305,230.598,79.6216,10.3784,99.9665
702,703,5421,1516,4304,50.3363,38.5589,51.4411,99.9902
703,704,2697,683,4301,241.211,44.7906,45.2094,99.9979
704,705,8117,600,4327,53.9319,9.21197,80.788,99.9826
705,706,11684,3263,4374,258.508,51.2896,38.7104,99.9812
706,707,6560,1625,4335,64.3839,27.0494,62.9506,99.9902
707,708,6484,60,4362,249.408,33.4112,56.5888,99.9807
708,709,12246,2902,4399,244.107,84.8552,5.14479,99.7283
709,710,795,3216,4317,253.736,38.4375,51.5625,99.99
710,711,2135,1277,4329,50.824,36.4281,53.5719,99.9983
711,712,982,1837,4333,46.9206,13.4433,76.5567,99.9274
712,713,4834,344,4368,38.8949,66.9547,23.0453,99.988
713,714,5724,2608,4359,259.466,37.9205,52.0795,99.989
714,715,997,2116,4344,69.067,21.191,68.809,99.9941
715,716,10818,2435,4384,235.707,8.39967,81.6003,99.9189
716,717,8859,436,4392,240.031,4.41032,85.5897,99.8969
717,718,3874,787,4402,60.0328,8.228489999999999,81.7715,99.007
718,719,1340,1557,4358,234.015,59.3497,30.6503,99.9974
719,720,1738,1333,4366,63.5544,2.96791,87.0321,99.9711
720,721,1338,2743,4372,247.894,86.3212,3.67879,99.9617
721,722,5572,2123,4404,254.949,45.6027,44.3973,99.9892
722,723,785,1375,4361,49.9185,36.6657,53.3343,99.9539
723,724,11765,848,4438,234.403,18.9489,71.0511,97.6532
724,725,12188,1010,4427,224.058,88.3236,1.67643,99.9873
725,726,4165,1254,4381,203.33900000000003,79.8192,10.1808,99.9815
726,727,4484,2672,4393,263.157,37.7183,52.2817,99.9899
727,728,1019,551,4371,45.4466,25.1466,64.8534,99.9949
728,729,99623,2329,4607,238.675,9.81786,80.1821,92.6017
729,730,1200,2085,4383,60.3363,15.6632,74.3368,99.982
730,731,1523,1160,4378,53.2321,2.54713,87.4529,99.9949
731,732,1115,2729,4392,213.63,86.7777,3.22228,99.9897
732,733,1872,2800,4393,249.018,50.1338,39.8662,99.6893
733,734,3354,1604,4415,238.08900000000003,34.5061,55.4939,99.9341
734,735,54164,609,4488,49.5852,13.3455,76.6545,74.3698
735,736,8294,2325,4440,61.2263,23.6682,66.3318,99.9906
736,737,9122,1658,4454,64.1056,68.5252,21.4748,99.9352
737,738,29113,369,4531,55.0046,4.11921,85.8808,99.1522
738,739,11636,1762,4458,52.9018,14.2277,75.7723,99.987
739,740,2419,1106,4426,61.8209,21.7931,68.2069,99.9917
740,741,1613,1548,4417,47.3626,82.0266,7.97342,99.9715
741,742,13534,1310,4504,228.074,8.18298,81.817,99.827
742,743,5124,2446,4437,49.5509,15.1345,74.8655,99.9762
743,744,695,2048,4421,228.1,52.0574,37.9426,99.9883
744,745,2977,1226,4431,53.232,36.5553,53.4447,99.9925
745,746,1527,1382,4420,53.431,12.0047,77.9953,99.9565
746,747,4761,1840,4460,238.218,59.9541,30.0459,99.9183
747,748,4498,2743,4453,224.443,13.7156,76.2844,99.9604
748,749,2693,1176,4445,71.00399999999998,70.2003,19.7997,99.9938
749,750,3666,2810,4446,240.368,20.1375,69.8625,99.988
750,751,6428,2570,4464,232.385,35.4667,54.5333,99.9756
751,752,15319,3122,4491,118.34,84.1378,5.86224,99.6536
752,753,9063,1957,4469,60.2354,20.4886,69.5114,99.9501
753,754,1362,2963,4469,253.571,82.7695,7.2305,99.9593
754,755,779,3025,4442,66.278,87.5237,2.47631,99.9793
755,756,11003,3247,4497,231.305,16.1323,73.8677,99.9778
756,757,34154,97,4609,243.631,9.96977,80.0302,99.9678
757,758,22230,2043,4543,65.8196,19.566,70.434,91.9393
758,759,2454,1389,4475,234.597,19.4427,70.5573,99.9626
759,760,938,2686,4457,244.37,59.8369,30.1631,99.9835
760,761,1331,2050,4471,242.612,41.2298,48.7702,99.9925
761,762,7859,923,4509,61.2252,42.1386,47.8614,99.7253
762,763,1250,1144,4476,57.7671,25.4662,64.5338,99.9868
763,764,7589,1095,4512,67.4253,23.1984,66.8016,45.0129
764,765,5409,2411,4493,245.515,71.3441,18.6559,99.666
765,766,1798,1875,4491,57.5983,11.0845,78.9155,99.9805
766,767,712,3361,4478,58.8286,56.8316,33.1684,99.9474
767,768,975,2716,4486,57.5478,15.4217,74.5783,99.9951
768,769,550,2506,4488,125.291,83.4328,6.56723,99.9815
769,770,828,2950,4510,249.446,82.0382,7.96183,99.9479
770,771,2964,2679,4523,233.707,35.2477,54.7523,99.9484
771,772,26390,3020,4597,53.3431,29.684,60.316,98.2776
772,773,2394,3346,4524,232.616,7.6292300000000015,82.3708,99.8722
773,774,15144,1645,4573,244.338,45.2061,44.7939,99.6201
774,775,2324,1211,4529,232.135,4.65216,85.3478,99.9054
775,776,1175,990,4528,247.425,27.4402,62.5598,99.961
776,777,885,2902,4516,53.537,18.791,71.209,99.9746
777,778,5816,2605,4568,290.566,77.5077,12.4923,99.131
778,779,889,2733,4520,257.765,36.6882,53.3118,99.9696
779,780,3549,1383,4557,257.685,35.1701,54.8299,99.9164
780,781,904,2554,4525,259.532,65.5114,24.4886,99.9901
781,782,1471,243,4536,63.8527,15.8864,74.1136,99.9544
782,783,30965,2779,4607,239.513,26.3741,63.6259,99.6251
783,784,641,2489,4542,38.5108,82.7341,7.265919999999999,98.4776
784,785,10655,1495,4580,57.612,65.2074,24.7926,99.9496
785,786,3128,198,4575,238.406,45.6852,44.3148,99.9494
786,787,15438,1032,4627,61.337,4.88256,85.1174,99.15
787,788,5640,1786,4564,260.42400000000004,42.2909,47.7091,99.9902
788,789,6472,263,4601,69.5132,39.5472,50.4528,99.9898
789,790,3213,1132,4568,238.1,17.0069,72.9931,99.9794
790,791,17939,914,4644,238.903,61.7885,28.2115,92.01
791,792,5950,3230,4588,49.3274,52.1682,37.8318,99.9098
792,793,4302,703,4590,330.784,87.6479,2.3521,99.9896
793,794,10074,1904,4659,236.346,45.8992,44.1008,77.2742
794,795,1076,1867,4581,232.995,8.13711,81.8629,99.9933
795,796,1061,2067,4577,247.469,6.71145,83.2886,99.9914
796,797,1903,1233,4587,236.463,52.7643,37.2357,99.9914
797,798,1055,3345,4600,71.109,10.8435,79.1565,99.7175
798,799,2537,771,4604,50.6738,4.6851699999999985,85.3148,99.9737
799,800,8438,1169,4629,238.582,21.3016,68.6984,99.9927
800,801,877,1334,4607,261.089,47.0099,42.9901,99.9141
801,802,5638,817,4655,53.3284,43.7569,46.2431,99.9898
802,803,2998,597,4613,49.7526,6.1013199999999985,83.8987,99.998
803,804,16550,1777,4655,256.898,56.1984,33.8016,99.9593
804,805,7847,557,4692,60.555,25.5093,64.4907,99.8618
805,806,5508,3257,4646,46.0361,53.5222,36.4778,99.7908
806,807,10895,1257,4680,55.62300000000001,39.6404,50.3596,99.973
807,808,18808,232,4702,68.8683,53.9024,36.0976,99.9509
808,809,20609,676,4694,238.7,22.0506,67.9494,99.7666
809,810,19498,456,4697,237.627,68.8081,21.1919,99.9269
810,811,6241,2061,4671,229.128,5.87643,84.1236,99.9892
811,812,12597,1442,4680,238.541,8.91677,81.0832,99.9482
812,813,3694,336,4660,239.458,37.5642,52.4358,99.9962
813,814,1554,1673,4654,242.555,60.6358,29.3642,99.9596
814,815,1191,1510,4641,260.575,54.412,35.588,99.9944
815,816,6144,1125,4700,51.0904,53.9731,36.0269,99.9108
816,817,1011,773,4646,234.053,4.05204,85.948,99.9926
817,818,1462,1349,4669,56.6164,67.221,22.779,99.9938
818,819,9233,1597,4699,241.295,16.8139,73.1861,99.6656
819,820,2146,2706,4674,234.026,67.581,22.419,99.9788
820,821,2941,3216,4687,44.3337,36.8731,53.1269,99.462
821,822,1719,1968,4680,45.7134,20.9212,69.0788,99.996
822,823,12580,1720,4735,243.392,51.7014,38.2986,99.8926
823,824,750,2887,4704,112.445,30.2726,59.7274,98.9828
824,825,525,3127,4708,150.014,34.3307,55.6693,99.8833
825,826,8326,3065,4740,50.2216,49.985,40.015,99.0475
826,827,567,3144,4703,135.249,40.3813,49.6187,99.9364
827,828,4355,2592,4724,64.2734,35.8517,54.1483,99.2242
828,829,3009,1867,4741,49.6081,80.9862,9.01382,99.9377
829,830,4947,2216,4726,66.7128,3.6877,86.3123,99.936
830,831,2232,1331,4721,235.535,41.7472,48.2528,99.9468
831,832,1349,2953,4725,70.7042,45.4807,44.5193,99.4746
832,833,3160,2009,4727,319.225,88.6171,1.38289,99.9882
833,834,996,356,4725,57.0875,24.9985,65.0015,99.9853
834,835,1848,784,4731,245.909,81.5903,8.40973,99.888
835,836,1372,2785,4748,218.067,10.8003,79.1997,98.7701
836,837,1059,3263,4725,155.024,23.7777,66.2223,99.7947
837,838,935,2995,4739,64.2443,37.1458,52.8542,99.9023
838,839,582,2746,4724,4.09943,4.87951,85.1205,99.7604
839,840,3891,2079,4751,63.2953,12.9746,77.0254,99.9607
840,841,2686,2331,4740,64.2299,6.28148,83.7185,99.9405
841,842,2490,1005,4757,162.75,70.2703,19.7297,99.4164
842,843,1090,1280,4749,249.251,33.2321,56.7679,99.8697
843,844,1046,2813,4764,312.59,24.3082,65.6918,99.7406
844,845,1440,182,4774,40.7197,7.3931,82.6069,99.8613
