,Grain No.,Size [Pixel],center x-coordinate,center y-coordinate,mean azimuth [degree],mean latitude [degree],mean colatitude [degree],Regelungsgrad [%]
0,1,1386,141,318,262.702,28.9387,61.0613,99.2347
1,2,507,214,289,340.202,53.7077,36.2923,99.0643
2,3,656,629,300,126.402,22.6877,67.3123,99.9708
3,4,12445,688,347,125.883,29.554,60.44600000000001,99.9515
4,5,36832,1011,365,143.671,50.0792,39.9208,99.9572
5,6,4251,801,334,317.2290000000001,25.1816,64.8184,99.9804
6,7,58433,380,439,132.50799999999998,11.4293,78.5707,99.9086
7,8,563646,1231,732,136.22899999999998,16.2875,73.7125,66.0915
8,9,23348,215,419,304.013,54.0809,35.9191,99.9313
9,10,16104,671,437,316.346,17.230999999999998,72.76899999999998,99.9207
10,11,18434,1645,364,189.878,71.1288,18.8712,99.9585
11,12,1408,1976,355,322.8540000000001,66.9322,23.0678,99.9475
12,13,21053,1815,377,312.971,5.169980000000002,84.83,99.8959
13,14,1159,2280,324,135.08,14.0324,75.9676,98.2524
14,15,1868,2409,330,109.415,26.5951,63.4049,99.0832
15,16,82372,2781,481,314.414,11.5084,78.4916,98.927
16,17,10451,3027,407,321.197,11.1977,78.8023,99.8859
17,18,1330,498,377,310.485,21.732,68.268,99.8764
18,19,50128,573,549,314.823,45.9726,44.0274,99.9023
19,20,52580,2065,493,321.4240000000001,37.0828,52.9172,99.8132
20,21,969,769,393,125.973,28.3113,61.6887,99.9866
21,22,30356,2559,463,141.124,22.0324,67.9676,99.9802
22,23,642,3252,404,49.1746,70.6199,19.38,98.0455
23,24,3674,1910,419,320.574,37.6511,52.3489,99.9158
24,25,8159,2307,436,150.013,47.6754,42.3246,99.9788
25,26,5241,1114,451,322.275,23.9396,66.0604,99.9943
26,27,587,127,425,301.872,55.2822,34.7178,99.963
27,28,1124,1837,432,168.452,64.779,25.221,99.9946
28,29,772,1937,436,319.806,60.7669,29.2331,99.8682
29,30,843223,2547,1110,143.622,36.3664,53.6336,68.873
30,31,26110,1757,507,327.548,61.6083,28.3917,99.938
31,32,537,945,441,123.523,58.3633,31.6367,99.9839
32,33,35066,2931,609,139.15,1.83612,88.1639,98.6909
33,34,22388,3179,500,159.644,73.9321,16.0679,99.7303
34,35,8928,3397,499,129.814,69.2763,20.7237,98.094
35,36,3015,114,486,319.045,20.6473,69.3527,99.6207
36,37,41861,2296,589,138.14700000000002,28.7207,61.2793,96.4262
37,38,1459,2022,471,324.197,60.4581,29.5419,99.9877
38,39,1078,1640,498,313.728,46.3491,43.6509,99.9546
39,40,20275,163,645,107.436,47.9661,42.0339,99.8712
40,41,3959,1903,537,102.097,66.5107,23.4892,99.7281
41,42,123485,3124,771,312.246,67.0312,22.9688,99.0635
42,43,5728,713,558,127.104,27.2145,62.7855,99.9854
43,44,35712,1798,659,139.03799999999998,55.1422,34.8578,99.9913
44,45,6070,449,603,108.724,6.041919999999998,83.9581,99.9955
45,46,1786,2293,574,327.1620000000001,38.2901,51.7099,99.9875
46,47,1774,1856,572,323.283,0.0823441,89.9177,99.99
47,48,934,107,609,309.59,18.5688,71.4312,99.4932
48,49,506,93,591,103.44,53.3258,36.6742,99.9683
49,50,13604,3322,643,137.279,51.1616,38.8384,98.5911
50,51,2377,245,609,108.866,45.8408,44.1592,99.9808
51,52,628,1937,597,337.47,56.442,33.558,99.9898
52,53,4159,397,639,118.665,35.9318,54.0682,99.9878
53,54,1196,840,615,150.59,73.4518,16.5482,99.9958
54,55,10759,2120,681,328.8640000000001,48.5453,41.4547,99.9842
55,56,6238,751,650,147.192,72.7106,17.2894,99.9987
56,57,3624,1952,671,248.449,66.811,23.189,99.9799
57,58,6762,302,668,314.83,20.4671,69.5329,99.5522
58,59,6496,546,693,287.241,5.0841699999999985,84.9158,99.9921
59,60,7768,2735,674,313.584,62.1672,27.8328,99.9927
60,61,1261,3441,671,124.599,15.5198,74.4802,99.9472
61,62,9721,2030,684,306.366,0.749153,89.2508,99.9968
62,63,3397,2427,673,138.934,8.76711,81.2329,99.9972
63,64,18286,2264,749,116.734,57.6277,32.3723,99.974
64,65,1388,447,680,316.147,26.7059,63.2941,99.9908
65,66,6161,2161,747,315.002,15.1157,74.8843,99.9447
66,67,2011,362,702,129.108,3.00325,86.9967,99.9986
67,68,12493,548,757,111.521,76.8116,13.1884,99.861
68,69,5694,696,719,327.143,16.8721,73.1279,99.9918
69,70,11587,387,751,106.998,51.0807,38.9193,99.9795
70,71,2332,1697,723,325.093,43.8825,46.1175,99.9985
71,72,1876,854,731,152.857,52.184,37.816,99.9665
72,73,1094,3298,720,116.688,0.231705,89.7683,99.9676
73,74,1026,3411,719,287.374,32.0038,57.9962,99.9169
74,75,1694,2451,733,315.018,32.1745,57.8255,99.9694
75,76,1836,2741,736,312.49,8.9074,81.0926,99.9988
76,77,32273,245,826,324.808,3.28017,86.7198,99.9623
77,78,9505,3336,805,312.155,10.0566,79.9434,99.4995
78,79,1273,3427,779,316.055,10.1054,79.8946,99.9008
79,80,1690,2772,772,301.366,3.39526,86.6047,99.9782
80,81,1710,1804,759,94.4619,65.2489,24.7511,99.9982
81,82,38392,1710,895,136.29,44.0418,45.9582,99.9951
82,83,3893,2838,776,316.707,11.1589,78.8411,99.9962
83,84,4777,701,778,317.598,44.853,45.147,99.9963
84,85,2909,2432,777,325.077,65.8815,24.1185,99.9399
85,86,608,2907,776,137.531,37.833,52.167,99.9912
86,87,10011,1351,836,343.3730000000001,73.2966,16.7034,99.9756
87,88,1030,767,793,149.977,47.3921,42.6079,99.9985
88,89,33052,445,890,133.833,4.45728,85.5427,75.112
89,90,1485,134,795,291.357,26.397,63.603,99.8509
90,91,4243,2370,844,115.933,57.8421,32.1579,99.9906
91,92,992,2797,806,331.8640000000001,67.9064,22.0936,99.9962
92,93,227815,385,1092,315.773,8.842830000000003,81.1572,97.1601
93,94,4169,2832,840,320.991,64.6321,25.3679,99.9504
94,95,4134,3424,914,125.663,28.0991,61.9009,99.7419
95,96,4234,2168,892,216.737,80.7927,9.20727,99.9818
96,97,10711,2086,936,101.159,24.2131,65.7869,99.9877
97,98,48658,879,1075,302.697,47.786,42.214,96.8797
98,99,2402,3161,966,162.89600000000004,78.0789,11.9211,99.9958
99,100,794,3094,990,153.976,41.1773,48.8227,99.9909
100,101,6212,3276,1037,266.657,46.8592,43.1408,99.7636
101,102,584,1405,1023,107.342,77.6404,12.3596,99.4857
102,103,6664,1415,1116,302.215,32.1505,57.8495,99.9939
103,104,19959,1503,1147,188.742,53.1721,36.8279,99.8434
104,105,3283,1627,1112,314.939,42.8578,47.1422,99.9505
105,106,20050,829,1136,151.636,48.2752,41.7248,99.9668
106,107,2082,99,1108,128.607,17.0606,72.9394,99.8475
107,108,8224,3121,1126,285.561,56.0566,33.9434,99.9641
108,109,263997,603,1502,297.285,14.355,75.645,98.0861
109,110,1858,2058,1152,100.049,24.7957,65.2043,99.996
110,111,60702,1139,1265,140.53,15.3159,74.6841,99.7318
111,112,4157,1696,1242,316.546,45.721,44.279,99.9894
112,113,88426,1623,1426,313.253,7.3647300000000016,82.6353,86.2153
113,114,4513,2744,1248,275.577,53.5137,36.4863,99.9979
114,115,550,3371,1228,126.448,42.4231,47.5769,99.8969
115,116,4619,3426,1349,133.329,39.2947,50.7053,99.9082
116,117,1211,1416,1244,115.699,75.1471,14.8529,99.9959
117,118,2578,2572,1257,307.107,21.1232,68.8768,99.9619
118,119,6392,138,1291,123.704,33.3024,56.6976,99.9465
119,120,11675,2456,1306,325.503,43.7583,46.2417,99.9812
120,121,24041,2136,1365,137.187,29.9883,60.0117,99.9857
121,122,1143,84,1299,310.185,45.8991,44.1009,99.9576
122,123,1459,2530,1282,112.191,56.2841,33.7159,99.9958
123,124,4132,1667,1305,195.578,76.8686,13.1314,99.9925
124,125,8402,2344,1316,140.72799999999998,42.6872,47.3128,99.9698
125,126,2974,2256,1307,144.08700000000005,58.2271,31.7729,99.9927
126,127,569,2562,1317,276.332,63.1278,26.8722,99.9969
127,128,18691,1149,1374,318.04,18.9504,71.0496,99.9967
128,129,58957,2598,1438,323.336,55.8948,34.1052,99.9699
129,130,19089,1299,1395,147.273,36.29,53.71,99.9747
130,131,5846,967,1361,303.365,29.5163,60.4837,99.7779
131,132,30709,839,1493,283.751,49.5806,40.4194,99.9797
132,133,718,104,1366,307.948,47.6208,42.3792,99.8289
133,134,15323,2293,1405,90.7049,27.6677,62.3323,99.9795
134,135,17629,1392,1447,277.595,59.0677,30.9323,99.9559
135,136,7504,2447,1389,240.767,81.4041,8.59592,99.9805
136,137,2249,141,1387,125.259,48.7755,41.2245,99.9578
137,138,8809,1045,1424,144.536,37.4964,52.5036,99.9913
138,139,16592,1801,1426,305.58,34.8622,55.1378,99.9748
139,140,6949,1938,1422,325.718,2.76139,87.2386,99.9685
140,141,19682,940,1491,113.541,70.7166,19.2834,99.7724
141,142,24602,1487,1546,121.372,74.4176,15.5824,99.794
142,143,9353,2982,1550,310.777,6.3651800000000005,83.6348,99.9439
143,144,27296,134,1550,306.396,7.625889999999999,82.3741,99.7541
144,145,19032,1978,1535,312.07,35.6884,54.3116,99.8415
145,146,38056,2143,1540,307.704,35.7087,54.2913,99.9877
146,147,16866,266,1518,308.415,24.4471,65.5529,97.4506
147,148,11002,2642,1524,324.0370000000001,45.3635,44.6365,99.9632
148,149,13552,1100,1520,311.2,4.2257,85.7743,62.0638
149,150,280043,2356,1845,307.622,14.1059,75.8941,98.1947
150,151,6469,2801,1526,120.602,33.4978,56.5022,99.8141
151,152,807,1926,1485,318.624,22.9132,67.0868,99.9871
152,153,13926,1225,1559,287.741,58.8533,31.1467,99.9088
153,154,815,2049,1518,281.038,54.5028,35.4972,99.9457
154,155,1104,2744,1513,119.94,28.5822,61.4178,99.9931
155,156,938,1324,1515,124.19,74.7772,15.2228,99.4623
156,157,569,1920,1516,124.355,74.6662,15.3338,99.8797
157,158,2033,1180,1541,114.303,28.1075,61.8925,99.9773
158,159,19318,353,1619,140.656,56.8119,33.1881,99.9976
159,160,2768,2707,1550,129.516,40.4777,49.5223,99.9266
160,161,794,1375,1555,304.992,1.29169,88.7083,99.9949
161,162,7488,1833,1605,209.924,72.8213,17.1787,99.9948
162,163,103024,2982,1733,295.578,62.2401,27.7599,44.1179
163,164,6392,1729,1609,316.562,34.3064,55.6936,99.9923
164,165,151776,1340,1772,315.706,67.9786,22.0214,60.0564
165,166,6963,2649,1626,134.09,44.7208,45.2792,99.9798
166,167,974,1067,1598,121.939,25.9759,64.0241,99.9747
167,168,660,1000,1593,123.542,36.0076,53.9924,99.9934
168,169,709,1039,1601,123.282,30.7107,59.2893,99.9964
169,170,8072,3052,1655,21.2374,80.5912,9.40881,99.9657
170,171,16192,254,1689,320.1740000000001,18.1104,71.8896,99.1649
171,172,375252,1004,2239,302.307,14.112,75.888,78.3301
172,173,555,3414,1631,127.53,33.8999,56.1001,99.8961
173,174,6366,1091,1656,287.646,34.0355,55.9645,99.9752
174,175,8929,1657,1666,144.408,77.7304,12.2696,99.9633
175,176,37836,2656,1779,141.93200000000004,47.6939,42.3061,99.9954
176,177,9864,1876,1699,214.799,77.8668,12.1332,99.9844
177,178,4208,2573,1668,289.378,0.021667500000000003,89.9783,99.9958
178,179,1109,3334,1659,279.603,41.7379,48.2621,99.956
179,180,8263,1957,1696,155.98,76.7253,13.2747,99.9792
180,181,754,1574,1666,201.897,82.2291,7.7709199999999985,99.9965
181,182,7597,1758,1701,322.702,16.5365,73.4635,99.9775
182,183,1835,167,1694,308.158,20.3238,69.6762,99.9506
183,184,2717,2758,1733,121.132,33.4705,56.5295,99.9594
184,185,1212,115,1732,129.486,74.1149,15.8851,99.9778
185,186,561,74,1747,129.754,74.4265,15.5735,99.937
186,187,671,141,1737,134.941,73.7204,16.2797,99.9773
187,188,3176,1800,1747,136.592,71.405,18.595,99.9983
188,189,1340,360,1745,304.178,38.1045,51.8955,99.9967
189,190,36019,368,1892,139.38299999999998,56.5005,33.4995,99.9116
190,191,703,295,1770,138.276,28.3709,61.6291,99.9966
191,192,46176,215,1938,316.201,36.4525,53.5475,99.8354
192,193,12389,817,1825,285.471,33.7126,56.2874,99.9853
193,194,18996,1774,1841,304.645,33.6735,56.3265,99.9551
194,195,7422,1910,1828,204.147,72.9769,17.0231,99.9813
195,196,5781,649,1820,136.513,6.19399,83.806,99.9992
196,197,2356,2798,1816,300.922,9.50694,80.4931,99.9922
197,198,898,392,1811,138.594,28.0246,61.9754,99.9938
198,199,2555,103,1845,129.142,75.5542,14.4458,99.978
199,200,1096,722,1813,135.615,69.1534,20.8466,99.9965
200,201,1790,3293,1826,288.659,61.2534,28.7465,99.9889
201,202,503,74,1827,123.299,75.5776,14.4224,99.8393
202,203,67044,3050,2004,122.248,32.2083,57.7917,99.8968
203,204,16466,3194,1915,134.417,10.7613,79.2387,99.9157
204,205,478853,2094,2429,321.378,3.3531,86.6469,90.8198
205,206,3147,3078,1862,207.815,72.6724,17.3276,99.9926
206,207,820,1415,1867,142.841,46.4855,43.5145,99.9968
207,208,2238,2783,1884,303.108,11.1621,78.8379,99.8403
208,209,715,372,1869,138.636,28.01,61.99,99.9969
209,210,855,1180,1871,285.7340000000001,31.9414,58.0586,99.9803
210,211,1626,3298,1880,341.561,66.2489,23.7511,99.9679
211,212,102576,1572,2015,1.15526,80.3673,9.63267,99.6267
212,213,2969,3412,1936,126.399,17.4346,72.5654,99.7741
213,214,5682,1861,1919,149.624,0.024086,89.9759,99.9682
214,215,16986,3277,1987,321.29,61.0625,28.9375,99.9659
215,216,46792,2780,2055,146.371,11.1596,78.8404,88.8105
216,217,933,3353,1935,322.923,16.3636,73.6364,99.9642
217,218,37893,1178,2023,150.454,31.2139,58.7861,99.9042
218,219,2828,2755,1977,59.8905,64.2193,25.7807,99.9958
219,220,1722,89,1994,306.838,40.8992,49.1008,99.5341
220,221,1319,515,1995,334.224,42.6742,47.3258,99.9536
221,222,1052,116,2035,306.263,40.6489,49.3511,99.9259
222,223,84487,453,2209,313.944,12.8972,77.1028,97.2975
223,224,2195,306,2048,315.44,14.598,75.402,99.8937
224,225,36835,1299,2138,291.135,44.4587,45.5413,99.9874
225,226,1142,361,2057,295.813,82.3257,7.67427,99.9983
226,227,1247,3329,2077,126.295,43.8422,46.1578,99.9391
227,228,684,2955,2071,158.981,4.1223800000000015,85.8776,99.9548
228,229,192722,3037,2412,66.2956,55.9743,34.0257,92.4016
229,230,26925,156,2183,278.451,48.678,41.322,99.8395
230,231,11601,745,2116,328.172,46.7658,43.2342,99.9953
231,232,42441,3309,2318,321.2340000000001,15.3343,74.6657,99.8008
232,233,2473,3243,2100,130.601,43.5077,46.4923,99.9972
233,234,5397,268,2120,315.24,35.9428,54.0572,99.9916
234,235,998,369,2093,335.775,30.2897,59.7103,99.9908
235,236,586,64,2102,277.501,48.6815,41.3185,99.941
236,237,7178,310,2159,133.282,43.1684,46.8316,99.9962
237,238,19037,1721,2167,110.927,47.1497,42.8503,99.9267
238,239,650,2300,2128,111.401,45.4402,44.5598,99.9969
239,240,21342,2589,2214,138.681,3.60209,86.3979,99.7439
240,241,1468,70,2178,278.456,51.6236,38.3764,99.8691
241,242,59940,677,2272,283.47,73.5921,16.4079,100.027
242,243,68862,2757,2351,137.012,1.42458,88.5754,99.8154
243,244,7703,2383,2205,291.36,55.4251,34.5749,99.9854
244,245,5125,1491,2196,296.29,67.4542,22.5458,99.9889
245,246,17134,1379,2273,131.237,49.0213,40.9787,99.8995
246,247,1894,1574,2218,0.594233,77.4332,12.5668,99.993
247,248,134388,246,2633,325.339,22.2383,67.7617,99.8902
248,249,6801,2655,2298,159.40200000000004,6.97031,83.0297,99.9516
249,250,250255,1579,2538,20.5251,65.4459,24.5541,99.9527
250,251,1978,1275,2266,113.122,1.34301,88.65700000000002,99.9972
251,252,11285,1820,2404,321.9790000000001,1.7796599999999998,88.2203,99.9911
252,253,1458,96,2379,323.947,25.5355,64.4645,99.495
253,254,3445,571,2381,130.715,57.4444,32.5556,99.9855
254,255,20414,684,2431,134.99,15.5424,74.4576,99.9501
255,256,2199,2887,2414,162.67,4.90474,85.0953,99.9564
256,257,57365,408,2517,317.362,5.3669699999999985,84.633,99.3829
257,258,8907,809,2457,280.391,74.0698,15.9302,99.9779
258,259,18164,124,2534,133.20600000000002,0.0337677,89.9662,99.6077
259,260,139225,2320,2666,315.935,24.9837,65.0163,99.9771
260,261,15454,2639,2581,162.0,8.38701,81.613,99.8717
261,262,40626,710,2582,353.214,60.3574,29.6426,99.9863
262,263,3352,2537,2549,134.904,32.7622,57.2378,99.9868
263,264,16814,2716,2642,55.8723,54.7907,35.2093,99.9538
264,265,36852,3324,2702,130.87,23.1008,66.8992,99.8043
265,266,1072,66,2609,305.473,0.615051,89.3849,99.67
266,267,28955,1104,2659,115.085,50.7291,39.2709,99.8939
267,268,22082,555,2664,128.964,50.0582,39.9418,99.8359
268,269,46583,955,2767,291.235,33.3292,56.6708,97.5411
269,270,31543,3134,2743,300.558,1.90641,88.0936,99.9907
270,271,21348,772,2737,281.772,23.8481,66.1519,99.9944
271,272,78647,2748,2869,325.815,10.2583,79.7417,99.5989
272,273,2446,3019,2686,60.5492,54.7219,35.2781,99.9726
273,274,7557,2613,2741,304.888,19.9746,70.0254,99.9979
274,275,4735,2909,2758,60.1976,54.1178,35.8822,99.9946
275,276,55071,654,2905,278.545,19.3279,70.6721,75.1434
276,277,3783,3247,2770,50.6043,44.0848,45.9152,99.9938
277,278,9032,1084,2774,137.062,58.8913,31.1087,99.9974
278,279,42637,1946,2836,111.555,55.7364,34.2636,99.8765
279,280,3887,3019,2763,194.012,62.1993,27.8007,99.9959
280,281,1738,2669,2781,88.8645,67.6392,22.3608,99.9945
281,282,4236,3190,2807,228.766,78.5874,11.4126,99.9676
282,283,937,455,2797,309.714,61.8768,28.1232,99.9716
283,284,1515,2563,2799,304.358,36.281,53.719,99.9972
284,285,2438,2972,2802,141.934,55.6943,34.3057,99.9737
285,286,1785,858,2812,318.381,59.0408,30.9592,99.9895
286,287,265345,1602,3066,323.701,30.5363,59.4637,99.8469
287,288,16953,1152,2887,294.716,2.25016,87.7498,99.9737
288,289,3426,2891,2836,276.628,42.1456,47.8544,99.9173
289,290,65933,2456,2927,110.185,14.913,75.087,99.8613
290,291,139499,459,3055,130.244,28.3275,61.6725,82.7221
291,292,53744,3230,3025,290.62,36.4841,53.5159,99.9121
292,293,4668,3027,2864,81.7597,37.7303,52.2697,99.9945
293,294,33021,2984,2961,133.59799999999998,58.3248,31.6752,94.0212
294,295,1898,1205,2855,172.34599999999998,60.9962,29.0038,99.9604
295,296,3631,795,2863,313.039,59.3727,30.6273,99.93
296,297,12358,879,2900,283.343,19.7691,70.2309,99.9914
297,298,14931,3186,2914,309.171,39.5714,50.4286,99.9932
298,299,83680,152,3171,141.159,15.3683,74.6317,99.795
299,300,1026,2236,2872,25.2008,64.5422,25.4578,99.7795
300,301,557,2188,2908,302.88,34.9697,55.0303,99.9847
301,302,3256,2245,2921,109.517,67.5578,22.4422,99.9951
302,303,4408,786,2935,165.928,64.8472,25.1528,99.9972
303,304,5594,1285,2953,171.60299999999995,60.5334,29.4666,99.9521
304,305,621,3337,2913,315.032,45.9413,44.0587,99.9826
305,306,33849,872,3060,302.746,59.6577,30.3423,98.925
306,307,739,2163,2925,321.159,26.6177,63.3823,99.9875
307,308,3049,2216,2964,32.8322,63.9035,26.0965,99.9663
308,309,776,3397,2970,328.827,65.498,24.502,99.9498
309,310,13593,239,2996,320.481,35.1098,54.8902,99.8592
310,311,1107,3371,2967,286.027,37.4233,52.5767,99.9285
311,312,68586,1137,3072,314.265,2.95329,87.0467,99.87
312,313,1304,900,2970,295.624,2.19853,87.8015,99.9905
313,314,560,1975,2971,319.308,28.14,61.86,99.9798
314,315,1527,1924,2978,319.4240000000001,26.8751,63.1249,99.9804
315,316,1625,2289,2995,107.385,49.7821,40.2179,99.9855
316,317,1061,2851,2983,107.514,7.589860000000002,82.4101,99.9921
317,318,22049,2200,3086,293.288,33.5562,56.4438,99.9382
318,319,77654,2841,3162,139.192,28.2525,61.7475,99.9819
319,320,235952,2294,3340,127.575,54.3873,35.6127,99.7044
320,321,3854,3379,3077,293.845,28.4401,61.5599,99.8995
321,322,9005,2620,3112,290.249,47.7974,42.2026,99.9966
322,323,1255,262,3086,315.317,10.5946,79.4054,99.9984
323,324,188332,898,3391,137.172,24.0022,65.9978,99.4684
324,325,337529,2935,3507,308.399,21.8857,68.1143,85.6212
325,326,2666,2315,3145,95.9132,67.8138,22.1862,99.9789
326,327,4823,1273,3177,312.111,13.7226,76.2774,99.9869
327,328,3681,1022,3190,132.34799999999998,53.2209,36.7791,99.9902
328,329,6358,276,3210,321.515,74.9478,15.0522,100.0
329,330,2774,1350,3191,284.75,57.5119,32.4881,99.9963
330,331,705,1309,3214,156.889,49.3692,40.6308,99.9577
331,332,560,2676,3225,137.554,16.1069,73.8931,96.8894
332,333,1257,2076,3230,105.828,46.6387,43.3613,99.9946
333,334,28406,1197,3292,164.928,63.362,26.638,99.9877
334,335,1119,2049,3249,296.009,34.6123,55.3877,99.9967
335,336,648,323,3251,129.255,9.87247,80.1275,99.995
336,337,9320,1856,3304,316.79,23.0733,66.9267,99.9957
337,338,4237,1998,3301,309.496,18.2646,71.7354,99.9957
338,339,3661,320,3304,145.586,0.873009,89.12700000000002,99.9057
339,340,2010,730,3322,125.85,45.9876,44.0124,99.9914
340,341,4883,1765,3337,264.282,37.1916,52.8084,99.9952
341,342,3068,2919,3325,124.4,54.8831,35.1169,99.9966
342,343,4336,366,3341,130.145,9.66804,80.332,99.9963
343,344,285075,409,3769,316.029,14.0126,75.9874,90.8804
344,345,2513,633,3330,138.088,41.0006,48.9994,99.9935
345,346,19276,1327,3387,304.573,13.9253,76.0747,99.995
346,347,9594,2519,3405,315.67,65.5207,24.4793,99.2105
347,348,2535,594,3357,145.642,19.793,70.207,99.9929
348,349,9495,1482,3387,153.14700000000005,56.6051,33.3949,99.5732
349,350,8974,1635,3396,303.624,16.6911,73.3089,99.977
350,351,2455,680,3376,292.206,41.547,48.453,99.969
351,352,4016,1177,3386,116.361,65.7392,24.2608,99.9807
352,353,51003,1797,3470,267.873,51.0109,38.9891,99.9196
353,354,1714,746,3379,114.806,66.1709,23.8291,99.9972
354,355,1441,90,3399,121.099,64.757,25.243,99.9144
355,356,25372,3257,3472,145.39700000000005,56.9814,33.0186,99.9001
356,357,4542,638,3427,127.081,50.50100000000001,39.499,99.9854
357,358,685,731,3423,322.486,3.39523,86.6048,99.9992
358,359,11145,132,3463,117.228,5.649,84.351,83.9118
359,360,3159,274,3443,303.629,25.9031,64.0969,99.994
360,361,14515,1179,3483,301.35,35.2486,54.7514,99.9005
361,362,1448,220,3434,141.85,14.09,75.91,99.9862
362,363,10000,705,3506,122.87,47.6087,42.3913,99.9831
363,364,5522,1459,3488,311.363,56.0961,33.9039,99.9353
364,365,1454,1494,3446,133.446,50.0676,39.9324,99.9915
365,366,3313,1556,3462,315.747,61.0954,28.9046,99.9843
366,367,1196,1274,3450,318.932,57.8033,32.1967,99.9987
367,368,51842,2490,3585,322.742,32.3782,57.6218,99.9337
368,369,2750,1307,3497,300.786,36.7612,53.2388,99.9206
369,370,2742,1397,3489,128.514,51.8961,38.1039,99.9728
370,371,526,1626,3470,132.825,51.7324,38.2676,99.9922
371,372,2056,227,3482,93.4186,12.9444,77.0556,99.9949
372,373,2953,399,3515,148.02100000000004,7.1020699999999986,82.8979,99.973
373,374,6291,1343,3539,314.303,57.1202,32.8798,99.8729
374,375,1009,1240,3516,135.82,9.65205,80.348,99.5983
375,376,6101,1583,3531,153.905,57.6395,32.3605,99.9132
376,377,7418,251,3547,92.9539,12.6985,77.3015,99.9995
377,378,1508,1262,3528,297.933,40.2539,49.7461,99.9766
378,379,1361,99,3528,96.3715,4.94958,85.0504,99.9811
379,380,14492,173,3599,104.25,71.4819,18.5181,99.9883
380,381,87152,725,3737,313.785,6.25626,83.7437,99.9036
381,382,12916,1914,3584,299.492,53.5218,36.4782,95.9791
382,383,17804,1527,3612,300.39,5.3271,84.6729,99.9051
383,384,8163,67,3640,278.04900000000004,41.433,48.567,99.9226
384,385,68279,1453,3731,314.694,6.7652899999999985,83.2347,99.9847
385,386,12878,1212,3637,134.526,10.2057,79.7943,99.7904
386,387,518,1227,3572,298.884,33.6466,56.3534,99.9825
387,388,1039,106,3608,315.718,3.9345,86.0655,99.9915
388,389,7873,3291,3605,142.359,5.7358400000000005,84.2642,99.7196
389,390,2326,1786,3582,148.273,59.8952,30.1048,99.998
390,391,12640,2105,3635,151.409,50.4413,39.5587,99.9082
391,392,22724,3230,3662,137.243,14.1507,75.8493,99.8525
392,393,9029,2678,3636,215.227,64.14,25.86,99.9893
393,394,10612,1665,3630,312.8,53.7586,36.2414,99.9321
394,395,2648,1128,3645,302.232,33.9018,56.0982,99.9832
395,396,3443,1773,3635,270.272,55.2667,34.7333,99.9944
396,397,3109,2020,3656,307.593,16.2564,73.7436,99.9983
397,398,11250,3074,3679,175.257,52.7201,37.2799,99.7698
398,399,4120,134,3681,138.672,20.8714,69.1286,99.9844
399,400,19842,2095,3738,146.731,43.0623,46.9377,99.8281
400,401,2171,2343,3671,335.566,44.8374,45.1626,99.9958
401,402,106745,1916,3824,166.393,61.464,28.536,93.8348
402,403,2596,2093,3679,144.93200000000004,46.7802,43.2198,99.4765
403,404,25344,1247,3764,296.358,17.3859,72.6141,99.9918
404,405,9129,2612,3728,119.505,10.5335,79.4665,99.9791
405,406,4952,2267,3695,147.918,33.2271,56.7729,99.9781
406,407,8726,2487,3725,329.585,46.4804,43.5196,99.9919
407,408,737,1808,3694,133.95,44.6927,45.3073,99.9958
408,409,31290,3150,3794,150.779,74.8057,15.1943,99.9257
409,410,74825,2425,3937,130.285,59.2935,30.7065,99.7565
410,411,5107,2986,3752,317.458,30.2015,59.7985,99.9917
411,412,40467,1000,3808,106.488,72.4459,17.5541,99.9048
412,413,4917,190,3755,313.373,35.1201,54.8799,99.9791
413,414,2166,1131,3753,310.3590000000001,58.4466,31.5534,99.9628
414,415,3360,122,3758,306.666,37.3605,52.6395,99.9747
415,416,1409,2285,3752,129.683,67.8419,22.1581,99.9982
416,417,1038,3289,3761,312.539,40.7394,49.2606,99.8762
417,418,10831,72,3870,309.145,41.6835,48.3165,99.6886
418,419,7701,2332,3799,146.792,28.0081,61.9919,99.9976
419,420,4250,689,3801,138.349,11.6325,78.3675,99.9971
420,421,5844,2230,3831,133.686,37.7157,52.2843,99.9498
421,422,3118,2208,3812,117.89,65.2139,24.7861,99.9971
422,423,4752,2994,3837,186.508,64.1134,25.8866,99.9836
423,424,23646,919,3905,136.769,42.6572,47.3428,99.9712
424,425,3016,124,3845,316.4840000000001,38.6934,51.3066,99.9911
425,426,5100,1149,3845,155.183,63.3465,26.6535,99.9954
426,427,1430,3317,3844,42.0562,76.1869,13.8131,99.9373
427,428,2670,2387,3849,142.531,67.1111,22.8889,99.996
428,429,19460,3222,3925,138.61700000000002,62.4918,27.5082,99.9729
429,430,2935,1323,3870,139.494,31.6962,58.3038,99.9947
430,431,15480,1548,3903,154.351,57.8764,32.1236,99.9978
431,432,3690,2440,3880,334.716,47.9888,42.0112,99.8187
432,433,24264,1212,3932,303.995,59.4367,30.5633,99.9874
433,434,14527,2304,3909,133.543,56.8264,33.1736,99.9891
434,435,72838,1691,4023,128.971,34.8229,55.1771,99.9868
435,436,10406,3108,3922,186.821,65.6165,24.3835,99.9894
436,437,87803,1434,4095,301.442,7.1940800000000005,82.8059,67.3823
437,438,50197,1991,4063,134.385,67.1421,22.8579,99.8065
438,439,65154,2985,4039,127.214,37.8294,52.1706,60.6615
439,440,186679,901,4183,310.312,29.327,60.673,54.5584
440,441,941,2370,3944,131.138,37.3869,52.6131,99.9908
441,442,10746,1117,4016,138.476,31.2702,58.7298,99.8769
442,443,15246,2631,4042,305.902,35.17,54.83,99.9567
443,444,5930,3275,4038,134.065,40.661,49.339,99.7731
444,445,623,3379,4034,127.876,43.2412,46.7588,99.9023
445,446,1859,3159,4017,305.221,58.7262,31.2738,99.9921
446,447,1432,2727,4024,126.311,34.1588,55.8412,99.9664
447,448,7359,118,4070,314.99,52.1482,37.8518,99.9868
448,449,1009,73,4038,305.67,55.8916,34.1084,99.9498
449,450,18319,1194,4135,309.043,39.3428,50.6572,99.9903
450,451,528,2157,4031,320.468,2.61017,87.3898,99.9598
451,452,10175,51,4139,122.253,15.9566,74.0434,99.8378
452,453,35697,2939,4195,327.994,55.2063,34.7937,89.7726
453,454,24667,196,4146,325.986,64.6987,25.3013,99.9876
454,455,769,1127,4078,305.074,38.4168,51.5832,99.9945
455,456,1108,2181,4076,122.544,63.2243,26.7757,99.9869
456,457,680,2239,4069,321.485,0.14785,89.8521,99.9973
457,458,4252,2498,4088,137.029,43.6697,46.3303,99.9846
458,459,10419,2278,4114,315.136,6.24262,83.7574,99.9426
459,460,20161,2760,4158,133.466,72.766,17.234,99.9555
460,461,1782,2661,4105,140.851,23.9403,66.0597,99.9969
461,462,28565,1814,4221,294.379,31.7012,58.2988,99.794
462,463,3606,2143,4116,312.5420000000001,48.7433,41.2567,99.9792
463,464,8706,3246,4130,127.714,62.9842,27.0158,99.9557
464,465,618,2404,4095,148.138,12.5015,77.4985,99.9939
465,466,4784,718,4139,132.407,32.7623,57.2377,99.9935
466,467,21877,2410,4209,342.4790000000001,60.3923,29.6077,99.9598
467,468,5158,318,4163,300.205,77.3466,12.6534,99.9947
468,469,15402,2567,4182,142.043,18.6834,71.3166,99.9902
469,470,18843,2254,4204,134.45,27.5821,62.4179,99.9976
470,471,5024,2671,4177,127.562,15.0839,74.9161,99.9913
471,472,15395,806,4198,133.128,14.8155,75.1845,99.9959
472,473,27015,1945,4309,129.536,25.7892,64.2108,90.217
473,474,9767,2800,4239,298.043,6.8685,83.1315,99.9194
474,475,54556,658,4310,126.624,6.22284,83.7772,99.945
475,476,6794,1662,4207,133.246,28.6349,61.3651,99.9428
476,477,780,1390,4193,317.842,89.2914,0.708588,99.9973
477,478,7669,3146,4254,157.516,86.1817,3.81829,99.9874
478,479,13095,1389,4274,202.203,88.5389,1.46112,99.9923
479,480,1606,1748,4206,314.726,45.3605,44.6395,99.9984
480,481,22012,2084,4266,130.986,12.068,77.932,99.8645
481,482,1798,3237,4243,272.524,58.2347,31.7653,99.981
482,483,3599,3183,4223,126.236,24.9567,65.0433,99.9967
483,484,369399,574,4538,126.848,35.8988,54.1012,76.7944
484,485,2508,1890,4251,280.728,75.9653,14.0347,99.981
485,486,1164,2188,4247,304.969,53.306,36.694,99.9966
486,487,2620,1483,4244,113.93,57.4478,32.5522,99.9893
487,488,78207,2932,4408,135.539,23.9782,66.0218,99.8962
488,489,1800,3313,4254,131.363,43.8956,46.1044,99.9017
489,490,1234,1851,4240,106.29,73.7376,16.2624,99.9972
490,491,597,3370,4256,133.069,41.9662,48.0338,99.9035
491,492,2173,919,4259,317.691,74.4774,15.5226,99.9906
492,493,2167,2657,4257,132.585,36.2971,53.7029,99.997
493,494,562,333,4253,302.236,27.8585,62.1415,99.9973
494,495,26605,2629,4348,307.689,1.29435,88.7057,99.9841
495,496,29986,1652,4381,305.539,2.074,87.926,99.9969
496,497,3314,857,4276,317.557,12.7708,77.2292,99.9995
497,498,36862,2465,4418,299.823,39.7857,50.2143,99.8465
498,499,3368,410,4304,286.981,5.8266800000000005,84.1733,99.992
499,500,3573,2283,4315,312.055,39.4803,50.5197,99.9897
500,501,26518,960,4410,315.122,15.6514,74.3486,99.3719
501,502,18979,3283,4395,308.094,4.06324,85.9368,99.7021
502,503,5485,1504,4340,113.639,57.4025,32.5975,99.952
503,504,1530,3134,4317,278.331,60.2999,29.7001,99.9977
504,505,2680,3208,4328,239.181,79.0566,10.9434,99.9738
505,506,700,3369,4321,308.281,3.76188,86.2381,99.8805
506,507,72573,2333,4528,315.621,0.8439639999999999,89.156,90.7188
507,508,3669,844,4333,314.926,27.6959,62.3041,99.8855
508,509,16956,1385,4406,315.307,12.8189,77.1811,99.9678
509,510,3653,1825,4377,137.989,29.9401,60.0599,99.9977
510,511,19198,2102,4420,131.394,8.33356,81.6664,99.9857
511,512,3929,824,4389,305.395,35.7085,54.2915,99.8134
512,513,7505,1500,4418,128.909,21.0523,68.9477,99.9758
513,514,3679,1245,4400,197.88,86.1122,3.88784,99.9973
514,515,3741,1987,4430,125.295,83.7393,6.2607300000000015,99.9864
515,516,25380,2701,4506,264.712,64.8933,25.1067,99.8161
516,517,3092,1763,4423,144.143,7.4649,82.5351,99.9871
517,518,30266,3141,4505,319.703,43.0836,46.9164,98.7379
518,519,7256,2575,4451,137.632,24.8814,65.1186,99.9931
519,520,157040,1849,4706,211.9,61.4126,28.5874,82.4407
520,521,723,1834,4428,202.393,73.2337,16.7663,99.995
521,522,1395,3031,4440,232.506,74.2156,15.7844,99.9352
522,523,1884,3355,4505,125.412,1.54788,88.4521,99.9282
523,524,123398,1435,4624,130.138,35.6506,54.3494,83.1094
524,525,1119,1973,4501,125.232,41.5085,48.4915,99.9769
525,526,9168,2206,4527,311.636,39.1744,50.8256,99.982
526,527,6071,52,4569,134.47,48.3919,41.6081,99.8449
527,528,3944,2071,4513,49.444,85.7536,4.24644,99.8696
528,529,1127,1446,4504,140.069,21.0805,68.9195,99.9839
529,530,574,2939,4509,298.915,5.15827,84.8417,99.9876
530,531,2395,3305,4563,284.676,56.0864,33.9136,99.9069
531,532,8927,329,4574,201.754,84.2165,5.78354,99.9827
532,533,13554,201,4605,136.239,47.3632,42.6368,99.9779
533,534,6416,1052,4600,122.77,56.747,33.253,99.9943
534,535,16656,2217,4620,109.17,76.5929,13.4071,99.971
535,536,46963,2888,4731,161.8,81.0833,8.91667,97.702
536,537,1397,121,4584,311.146,2.24065,87.7593,99.9939
537,538,4488,2570,4604,296.362,38.4164,51.5836,99.9885
538,539,526,2754,4583,270.0,88.3884,1.61156,99.9813
539,540,4335,2483,4629,273.944,62.1697,27.8303,99.9441
540,541,47361,3119,4702,295.663,79.1243,10.8757,99.9337
541,542,776,3215,4599,306.529,9.29926,80.7007,99.2471
542,543,659,2774,4603,252.55900000000003,88.4895,1.51051,99.9977
543,544,2380,793,4621,326.006,73.5056,16.4944,99.9893
544,545,11304,3286,4665,176.601,84.9656,5.03437,99.97
545,546,14814,62,4687,312.597,31.0795,58.9205,99.7611
546,547,9035,2681,4662,300.205,18.8853,71.1147,99.9694
547,548,1777,2751,4643,309.925,62.4915,27.5085,99.9928
548,549,18311,2559,4703,294.997,54.3256,35.6744,99.9659
549,550,1942,2941,4651,318.367,37.5518,52.4482,99.9555
550,551,3151,2791,4670,300.996,18.1245,71.8755,99.9271
551,552,6539,1585,4664,312.903,39.5124,50.4876,99.9955
552,553,1206,348,4672,298.714,32.1984,57.8016,99.9992
553,554,4866,1233,4702,136.762,19.7101,70.2899,99.9745
554,555,3087,2106,4687,114.805,75.7901,14.2099,99.9972
555,556,968,1041,4678,309.112,56.5027,33.4973,99.9948
556,557,5734,215,4691,114.17,79.9943,10.0057,99.9737
557,558,3986,2724,4733,128.049,6.02519,83.9748,99.99
558,559,515,2159,4695,125.37,28.9737,61.0263,99.9978
559,560,61695,207,4844,131.915,39.7222,50.2778,99.7104
560,561,1420,2237,4705,302.2940000000001,30.7483,59.2517,99.999
561,562,1290,297,4709,303.893,28.7494,61.2506,99.9504
562,563,36354,867,4805,137.52100000000002,60.0003,29.9997,99.9093
563,564,589,343,4700,131.379,42.8263,47.1737,99.987
564,565,5086,1608,4752,297.193,50.6688,39.3312,99.9897
565,566,23699,1116,4793,131.609,6.8371,83.1629,99.9971
566,567,6830,3306,4780,121.788,3.27443,86.7256,99.7988
567,568,7570,1513,4761,198.169,64.8318,25.1682,99.8724
568,569,47575,2167,4805,125.976,26.7476,63.2524,99.8728
569,570,4544,2652,4794,137.487,0.875893,89.1241,99.8666
570,571,1287,558,4759,124.672,26.0062,63.9938,99.9886
571,572,15780,2501,4797,124.737,11.8225,78.1775,99.9385
572,573,4236,1280,4801,316.28,7.26772,82.7323,99.9899
573,574,21842,627,4849,321.569,75.5739,14.4261,99.8399
574,575,13423,1217,4872,303.258,20.2688,69.7312,99.747
575,576,4851,2853,4830,312.112,26.0075,63.9925,99.787
576,577,823,3046,4814,127.037,60.9073,29.0927,99.9982
577,578,991,1532,4821,299.398,49.5088,40.4912,99.9964
578,579,3768,1474,4839,302.75,47.5945,42.4055,99.9961
579,580,2802,3147,4837,116.83,22.6391,67.3609,99.8044
580,581,4754,2792,4862,316.291,37.8441,52.1559,99.7114
581,582,1630,3034,4843,314.474,42.2127,47.7873,99.6475
582,583,2222,1996,4857,315.597,42.3479,47.6521,99.7772
583,584,590,3352,4853,136.086,0.242378,89.7576,99.7754
584,585,9715,1371,4887,291.277,58.3357,31.6643,99.8815
585,586,1997,2719,4869,307.966,29.5984,60.4016,99.5924
586,587,558,2636,4845,303.909,2.06317,87.9368,99.6263
587,588,2743,1110,4890,296.954,6.00095,83.999,99.8142
588,589,667,3112,4877,132.138,16.7489,73.2511,99.2674
589,590,3501,1496,4897,304.885,28.6994,61.3006,99.6887
590,591,1017,798,4882,64.6203,85.2508,4.7492,99.9691
591,592,1184,3284,4889,58.6209,50.4243,39.5757,97.3825
592,593,695,67,4918,125.38,34.0997,55.9003,99.875
593,594,503,514,4902,131.78,10.9154,79.0846,99.997
594,595,669,462,4921,131.55100000000002,37.074,52.926,98.7402
595,596,775,1474,4935,311.016,30.8113,59.1887,99.6711
596,597,1529,39,4959,127.837,33.8138,56.1862,99.9445
