,Datei Name,e1,e2,e3,mean grain size,depth,Regelungsgrad [%],Nr der Körner,bag,cut,Azimuth delta[deg]
0,grains_EGRIP1546_4_20.txt.csv,0.00826742,0.424024,0.567708,16037,850.57,38.2092,782,1546,4,0
1,grains_EGRIP2075_6_20.txt.csv,0.00862158,0.373715,0.617663,12785,1141.7,43.1866,935,2075,6,0
2,grains_EGRIP756_3_20.txt.csv,0.0380533,0.352721,0.609225,12018,415.98,46.2702,1022,756,3,0
3,grains_EGRIP1208_2_volume_vertical_20.txt.csv,0.0142887,0.429511,0.5562,17260,664.4900000000001,38.8304,214,1208,2,0
4,grains_EGRIP1406_4_20.txt.csv,0.019019,0.300713,0.680268,16546,773.57,56.3691,624,1406,4,0
5,grains_EGRIP2386_1_20.txt.csv,0.00656924,0.36762,0.625811,9660,1312.3000000000004,47.4117,1253,2386,1,0
6,grains_EGRIP2416_6_20.txt.csv,0.010767,0.393455,0.595778,5652,1329.2500000000002,41.0441,1993,2416,6,0
7,grains_EGRIP956_6_20.txt.csv,0.0202138,0.364818,0.6149680000000001,12862,526.2500000000001,47.1075,957,956,6,0
8,grains_EGRIP1146_5_20.txt.csv,0.0191666,0.358258,0.622576,10844,630.6600000000002,48.5442,1076,1146,5,0
9,grains_EGRIP796_5_20.txt.csv,0.034824400000000005,0.380577,0.584598,12134,438.16,41.5094,990,796,5,0
10,grains_EGRIP2600_3_volume_vertical_20.txt.csv,0.00938752,0.301349,0.689263,4582,1430.1800000000005,57.4283,2707,2600,3,61
11,grains_EGRIP2056_4_20.txt.csv,0.0124535,0.424306,0.563241,12606,1131.0700000000004,38.2716,962,2056,4,0
12,grains_EGRIP866_2_20.txt.csv,0.031108,0.35480500000000004,0.6140869999999999,21861,476.39,46.5175,611,866,2,0
13,grains_EGRIP896_3_20.txt.csv,0.0255615,0.32769000000000004,0.646748,23392,492.98000000000013,49.771,499,896,3,0
14,grains_EGRIP816_6_20.txt.csv,0.0249526,0.30457,0.670477,16164,449.25,56.2384,776,816,6,0
15,grains_EGRIP2286_2_20.txt.csv,0.00892122,0.34173200000000004,0.649347,6848,1257.39,51.7011,1581,2286,2,0
16,grains_EGRIP1933_4_20.txt.csv,0.0197371,0.423449,0.556814,10348,1063.42,37.851,829,1933,4,0
17,grains_EGRIP1965_5_20.txt.csv,0.00958039,0.387261,0.603159,13046,1081.11,44.9175,919,1965,5,0
18,grains_EGRIP1096_6_20.txt.csv,0.0169328,0.362234,0.620833,13374,603.2500000000001,48.007,938,1096,6,0
19,grains_EGRIP1016_3_20.txt.csv,0.019078900000000003,0.371558,0.609363,12430,558.98,31.7485,987,1016,3,0
20,grains_EGRIP646_6_20.txt.csv,0.0602038,0.376174,0.5636220000000001,8667,355.75,36.0215,1269,646,6,0
21,grains_EGRIP1377_4_20.txt.csv,0.0133924,0.35397,0.632638,10805,757.62,49.5336,1014,1377,4,0
22,grains_EGRIP2106_2_20.txt.csv,0.00857928,0.385446,0.605975,12027,1158.39,44.7329,992,2106,2,0
23,grains_EGRIP1315_5_20.txt.csv,0.0144358,0.361736,0.6238279999999999,15233,723.6100000000001,48.2436,548,1315,5,0
24,grains_EGRIP2635_2_20.txt.csv,0.0100058,0.299675,0.6903189999999999,2983,1449.34,57.2203,3240,2635,2,0
25,grains_EGRIP936_4_20.txt.csv,0.0227346,0.333004,0.644262,25736,515.07,48.6013,522,936,4,0
26,grains_EGRIP1444_4_20.txt.csv,0.0215943,0.319495,0.6589109999999999,14792,794.47,54.8552,689,1444,4,0
27,grains_EGRIP2356_1_20.txt.csv,0.0112912,0.384863,0.603846,5391,1295.8000000000004,44.5292,2122,2356,1,0
28,grains_EGRIP2486_5_20.txt.csv,0.00693097,0.305663,0.6874060000000001,6708,1367.66,58.2411,1647,2486,5,0
29,grains_EGRIP2817_5_20.txt.csv,0.0115272,0.31295500000000004,0.6755180000000001,3027,1549.71,55.175,3084,2817,5,0
30,grains_EGRIP2176_6_20.txt.csv,0.00750934,0.399004,0.593486,9506,1197.2500000000002,39.7343,1234,2176,6,0
31,grains_EGRIP776_2_20.txt.csv,0.0387501,0.383663,0.577587,13064,426.89,42.1357,932,776,2,0
32,grains_EGRIP1475_3_20.txt.csv,0.0136015,0.326475,0.6599229999999999,10020,811.4300000000002,51.5819,768,1475,3,0
33,grains_EGRIP2666_4_20.txt.csv,0.0160518,0.296512,0.6874359999999999,3312,1466.5700000000004,58.1077,2990,2666,4,166
34,grains_EGRIP2316_2_20.txt.csv,0.0138033,0.332855,0.653341,5600,1273.89,52.5429,2243,2316,2,0
35,grains_EGRIP3027_3_20.txt.csv,0.0119237,0.315589,0.672488,5146,1665.0300000000002,56.1765,2264,3027,3,0
36,grains_EGRIP1346_3_20.txt.csv,0.010507700000000002,0.39367,0.595823,13477,740.48,46.2005,805,1346,3,0
37,grains_EGRIP1637_5_20.txt.csv,0.0162853,0.348647,0.635067,7615,900.71,47.9069,1117,1637,5,0
38,grains_EGRIP2446_3_20.txt.csv,0.0117314,0.352446,0.6358229999999999,5231,1345.4800000000002,48.4959,2179,2446,3,0
39,grains_EGRIP2136_5_20.txt.csv,0.0132807,0.342064,0.644656,9491,1175.16,51.6172,1128,2136,5,0
40,grains_EGRIP724_4_20.txt.csv,0.0580432,0.384734,0.5572229999999999,20191,398.47,35.0268,635,724,4,0
41,grains_EGRIP1558_5_20.txt.csv,0.013531,0.31700500000000004,0.6694640000000001,13740,857.2600000000001,55.5084,848,1558,5,0
42,grains_EGRIP995_3_20.txt.csv,0.011954,0.404113,0.583933,16205,547.43,42.6538,782,995,3,0
43,grains_EGRIP2696_5_20.txt.csv,0.0137304,0.21797600000000006,0.7682939999999999,3209,1483.16,70.5188,2730,2696,5,162
44,grains_EGRIP1214_6_20.txt.csv,0.0134531,0.4316640000000001,0.554883,12726,668.1500000000002,32.7367,778,1214,6,0
45,grains_EGRIP2966_2_20.txt.csv,0.0139209,0.302616,0.6834640000000001,4156,1631.39,56.6507,2775,2966,2,320
46,grains_EGRIP2506_3_20.txt.csv,0.01223,0.307225,0.680545,4383,1378.4800000000002,56.5436,2548,2506,3,0
47,grains_EGRIP2997_3_20.txt.csv,0.0160464,0.288082,0.695871,2231,1648.5300000000002,58.8814,4550,2997,3,0
48,grains_EGRIP2565_2_20.txt.csv,0.010509200000000002,0.286466,0.703025,4476,1410.84,59.362,2572,2565,2,0
49,grains_EGRIP2256_2_20.txt.csv,0.016791099999999996,0.387299,0.59591,6352,1240.89,41.932,1848,2256,2,0
50,grains_EGRIP2726_4_20.txt.csv,0.0120142,0.350579,0.637407,4373,1499.5700000000004,50.0337,2497,2726,4,299
51,grains_EGRIP2626_5_20.txt.csv,0.0123113,0.31648200000000004,0.671207,4477,1444.66,55.5081,2391,2626,5,0
52,grains_EGRIP2356_3_20.txt.csv,0.00807547,0.385528,0.6063970000000001,7477,1295.9800000000002,42.6053,1602,2356,3,0
53,grains_EGRIP1615_5_20.txt.csv,0.0207727,0.263308,0.715919,13905,888.6100000000001,62.2854,758,1615,5,0
54,grains_EGRIP2176_4_20.txt.csv,0.00683893,0.375131,0.61803,8448,1197.0700000000004,46.6574,1133,2176,4,0
55,grains_EGRIP1377_6_20.txt.csv,0.014641299999999998,0.326914,0.658445,14802,757.8000000000002,54.1502,771,1377,6,0
56,grains_EGRIP1444_6_20.txt.csv,0.015175799999999996,0.321502,0.6633220000000001,16238,794.6500000000002,55.7222,763,1444,6,0
57,grains_EGRIP936_6_20.txt.csv,0.0124027,0.31463,0.672968,16741,515.2500000000001,57.6721,765,936,6,0
58,grains_EGRIP1016_1_20.txt.csv,0.0235937,0.39894,0.577466,14551,558.8000000000002,40.9078,855,1016,1,0
59,grains_EGRIP1096_4_20.txt.csv,0.0200028,0.359904,0.620093,13201,603.07,44.309,903,1096,4,0
60,grains_EGRIP646_4_20.txt.csv,0.0764102,0.347374,0.576216,16194,355.57,42.4569,718,646,4,0
61,grains_EGRIP1247_2_20.txt.csv,0.00973704,0.386849,0.603414,18820,685.94,45.3754,482,1247,2,0
62,grains_EGRIP2506_1_20.txt.csv,0.011345,0.331348,0.657307,5470,1378.3000000000004,53.1139,2110,2506,1,0
63,grains_EGRIP2997_1_20.txt.csv,0.0163627,0.274598,0.7090390000000001,2131,1648.35,61.0019,4106,2997,1,0
64,grains_EGRIP2726_6_20.txt.csv,0.0116513,0.354849,0.6335,4136,1499.7500000000002,39.9108,2503,2726,6,299
65,grains_EGRIP1057_2_20.txt.csv,0.00803797,0.343418,0.648544,9668,581.44,50.4958,1297,1057,2,0
66,grains_EGRIP836_5_20.txt.csv,0.039605400000000006,0.342107,0.6182880000000001,26838,460.16,48.5359,485,836,5,0
67,grains_EGRIP2756_2_20.txt.csv,0.0101783,0.366195,0.623627,4242,1515.89,47.2271,2385,2756,2,299
68,grains_EGRIP1276_5_20.txt.csv,0.0111854,0.319908,0.668906,10889,702.1600000000002,54.4573,989,1276,5,0
69,grains_EGRIP3117_5_20.txt.csv,0.0131671,0.33029000000000003,0.656543,4107,1714.71,52.3236,2340,3117,5,0
70,grains_EGRIP686_2_20.txt.csv,0.036067400000000006,0.391327,0.5726060000000001,12427,377.39,33.6657,995,686,2,0
71,grains_EGRIP1214_4_20.txt.csv,0.0141821,0.316962,0.668856,17131,667.97,49.7397,679,1214,4,0
72,grains_EGRIP2436_5_20.txt.csv,0.00862509,0.351941,0.6394340000000001,4937,1340.16,49.6426,2340,2436,5,0
73,grains_EGRIP1606_3_volume_vertical_20.txt.csv,0.00963695,0.376847,0.613516,11565,883.48,44.7023,1166,1606,3,0
74,grains_EGRIP724_6_20.txt.csv,0.0645915,0.386697,0.548712,21432,398.65,21.5401,542,724,6,0
75,grains_EGRIP3056_5_20.txt.csv,0.0145354,0.29600000000000004,0.689465,2959,1681.16,57.6623,3397,3056,5,8
76,grains_EGRIP1116_2_20.txt.csv,0.014793100000000003,0.345112,0.640095,22198,613.8900000000001,52.3456,583,1116,2,0
77,grains_EGRIP995_1_20.txt.csv,0.0178583,0.366204,0.615938,14574,547.25,45.0018,683,995,1,0
78,grains_EGRIP977_5_20.txt.csv,0.019712,0.348214,0.632074,22596,537.71,6.57412,598,977,5,0
79,grains_EGRIP1475_1_20.txt.csv,0.0161042,0.333697,0.650199,12606,811.2500000000001,52.0423,898,1475,1,0
80,grains_EGRIP2666_6_20.txt.csv,0.0135631,0.298462,0.687975,4153,1466.7500000000002,57.5271,2864,2666,6,166
81,grains_EGRIP1185_2_20.txt.csv,0.0188406,0.395894,0.5852649999999999,23915,651.84,43.2877,510,1185,2,0
82,grains_EGRIP2446_1_20.txt.csv,0.0107888,0.396736,0.592475,6545,1345.3000000000004,42.187,1798,2446,1,0
83,grains_EGRIP3027_1_20.txt.csv,0.0114427,0.32224200000000003,0.666315,4540,1664.85,54.8716,2335,3027,1,0
84,grains_EGRIP1346_1_20.txt.csv,0.00801521,0.411584,0.5804010000000001,12832,740.3000000000002,26.2828,796,1346,1,0
85,grains_EGRIP1208_1_volume_vertical_20.txt.csv,0.01931,0.378574,0.602116,12993,664.4000000000002,45.5374,1096,1208,1,0
86,grains_EGRIP2846_2_20.txt.csv,0.0120996,0.348995,0.6389050000000001,4028,1565.39,50.1022,2580,2846,2,0
87,grains_EGRIP837_3_volume_vertical_20.txt.csv,0.0439289,0.356459,0.5996130000000001,24350,460.53,45.5671,561,837,3,0
88,grains_EGRIP1400_3_volume_vertical_20.txt.csv,0.016006700000000002,0.312818,0.671176,17872,770.1800000000002,55.0319,647,1400,3,0
89,grains_EGRIP1406_6_20.txt.csv,0.0100434,0.365368,0.6245890000000001,12802,773.7500000000001,49.0319,626,1406,6,0
90,grains_EGRIP2386_3_20.txt.csv,0.00665915,0.3337,0.65964,8071,1312.4800000000002,53.7954,1468,2386,3,0
91,grains_EGRIP756_1_20.txt.csv,0.0323029,0.384685,0.583012,6267,415.8,42.6428,1536,756,1,0
92,grains_EGRIP2156_5_20.txt.csv,0.0093895,0.370655,0.6199560000000001,11900,1186.16,47.2561,986,2156,5,0
93,grains_EGRIP2075_4_20.txt.csv,0.00760748,0.42152,0.570873,12556,1141.52,39.7567,996,2075,4,0
94,grains_EGRIP2236_2_20.txt.csv,0.00699577,0.434277,0.5587270000000001,8924,1229.89,22.4024,1318,2236,2,0
95,grains_EGRIP1546_6_20.txt.csv,0.00770934,0.439812,0.5524789999999999,11574,850.7500000000001,23.6574,918,1546,6,0
96,grains_EGRIP2906_2_20.txt.csv,0.0106347,0.322617,0.666748,6677,1598.39,53.9386,1874,2906,2,284
97,grains_EGRIP2596_2_20.txt.csv,0.00904096,0.330743,0.660217,4750,1427.89,52.7702,2217,2596,2,0
98,grains_EGRIP666_5_20.txt.csv,0.064279,0.34367,0.592051,19589,366.66,19.1086,644,666,5,0
99,grains_EGRIP816_4_20.txt.csv,0.033675199999999995,0.334693,0.631632,16874,449.07,50.1822,696,816,4,0
100,grains_EGRIP1996_5_20.txt.csv,0.00889013,0.421225,0.5698850000000001,12055,1098.16,31.9457,1045,1996,5,0
101,grains_EGRIP1507_5_20.txt.csv,0.0140995,0.380179,0.605722,10773,829.21,43.6915,1053,1507,5,0
102,grains_EGRIP896_1_20.txt.csv,0.017960499999999997,0.379816,0.602223,13409,492.80000000000007,28.7889,946,896,1,0
103,grains_EGRIP2206_5_20.txt.csv,0.0119156,0.352851,0.635233,7101,1213.66,49.1437,1616,2206,5,0
104,grains_EGRIP2535_5_20.txt.csv,0.0140474,0.329562,0.656391,3685,1394.61,53.2219,2848,2535,5,0
105,grains_EGRIP1933_6_20.txt.csv,0.0121237,0.435757,0.5521189999999999,12593,1063.6,20.7103,934,1933,6,0
106,grains_EGRIP2026_2_20.txt.csv,0.00637629,0.461255,0.5323680000000001,12453,1114.39,29.3289,989,2026,2,0
107,grains_EGRIP2936_5_20.txt.csv,0.0121248,0.368032,0.619843,3597,1615.16,47.3539,2851,2936,5,307
108,grains_EGRIP657_2_20.txt.csv,0.0581768,0.32008600000000004,0.621737,15929,361.44,48.8873,749,657,2,0
109,grains_EGRIP2056_6_20.txt.csv,0.00957621,0.398417,0.592007,11143,1131.2500000000002,42.5838,1098,2056,6,0
110,grains_EGRIP2786_2_20.txt.csv,0.00973033,0.286433,0.7038369999999999,3980,1532.39,60.1242,2745,2786,2,295
111,grains_EGRIP3086_5_20.txt.csv,0.0111941,0.265484,0.723322,2805,1697.66,63.203,3635,3086,5,247
112,grains_EGRIP2876_5_20.txt.csv,0.0116198,0.30415,0.684231,3832,1582.16,56.0131,2823,2876,5,279
113,grains_EGRIP2416_4_20.txt.csv,0.0107006,0.358336,0.6309640000000001,5710,1329.0700000000004,48.5388,1885,2416,4,0
114,grains_EGRIP2475_5_20.txt.csv,0.00655579,0.432489,0.560955,9048,1361.61,31.3683,1268,2475,5,0
115,grains_EGRIP956_4_20.txt.csv,0.033424300000000004,0.346985,0.619591,26272,526.07,50.2707,536,956,4,0
116,grains_EGRIP2600_1_volume_vertical_20.txt.csv,0.00944693,0.302522,0.6880310000000001,4395,1430.0000000000002,57.3499,2104,2600,1,61
117,grains_EGRIP1558_3_20.txt.csv,0.0132029,0.376869,0.609928,16804,857.08,46.6201,755,1558,3,0
118,grains_EGRIP1116_6_20.txt.csv,0.0144292,0.33058200000000004,0.654989,15210,614.2500000000001,51.7687,841,1116,6,0
119,grains_EGRIP995_5_20.txt.csv,0.0201759,0.389394,0.59043,16298,547.61,43.4137,784,995,5,0
120,grains_EGRIP977_1_20.txt.csv,0.0277201,0.356207,0.616073,16232,537.35,47.82899999999999,820,977,1,0
121,grains_EGRIP2696_3_20.txt.csv,0.0134635,0.306371,0.6801649999999999,4350,1482.9800000000002,55.7441,2533,2696,3,162
122,grains_EGRIP2436_1_20.txt.csv,0.00732907,0.357469,0.635202,6009,1339.8000000000004,49.7891,1536,2436,1,0
123,grains_EGRIP724_2_20.txt.csv,0.0632532,0.362082,0.574665,20242,398.29,42.7985,626,724,2,0
124,grains_EGRIP3056_1_20.txt.csv,0.0147447,0.32247600000000004,0.662779,3395,1680.8000000000004,53.5517,3007,3056,1,8
125,grains_EGRIP2446_5_20.txt.csv,0.00782131,0.371969,0.62021,7141,1345.66,43.358,1808,2446,5,0
126,grains_EGRIP2136_3_20.txt.csv,0.0092779,0.371022,0.6197,10009,1174.9800000000002,40.5718,1099,2136,3,0
127,grains_EGRIP1346_5_20.txt.csv,0.0137284,0.355729,0.6305430000000001,13022,740.6600000000002,47.0459,829,1346,5,0
128,grains_EGRIP3027_5_20.txt.csv,0.0125041,0.309688,0.677808,4540,1665.21,56.7031,2490,3027,5,0
129,grains_EGRIP1637_3_20.txt.csv,0.015361700000000002,0.362104,0.622534,14092,900.53,49.4535,675,1637,3,0
130,grains_EGRIP1475_5_20.txt.csv,0.0175231,0.323289,0.659188,18384,811.6100000000001,55.0726,702,1475,5,0
131,grains_EGRIP2666_2_20.txt.csv,0.013595500000000002,0.300536,0.685868,3688,1466.39,55.9366,2717,2666,2,166
132,grains_EGRIP2316_4_20.txt.csv,0.0102956,0.349302,0.640402,5255,1274.0700000000004,49.0834,2121,2316,4,0
133,grains_EGRIP1185_6_20.txt.csv,0.012135,0.448361,0.539504,12256,652.2,21.8447,928,1185,6,0
134,grains_EGRIP2256_4_20.txt.csv,0.0149033,0.369678,0.6154189999999999,7333,1241.0700000000004,45.6176,1737,2256,4,0
135,grains_EGRIP2726_2_20.txt.csv,0.012112,0.334193,0.653695,3939,1499.39,50.8477,2574,2726,2,299
136,grains_EGRIP2565_4_20.txt.csv,0.0104133,0.288671,0.700916,4381,1411.0200000000002,59.4827,2686,2565,4,0
137,grains_EGRIP2506_5_20.txt.csv,0.0124392,0.392589,0.5949720000000001,4427,1378.66,43.6061,1730,2506,5,0
138,grains_EGRIP2997_5_20.txt.csv,0.015983700000000003,0.298838,0.685179,2523,1648.71,56.9781,3857,2997,5,0
139,grains_EGRIP2966_4_20.txt.csv,0.0122993,0.321365,0.6663359999999999,4383,1631.5700000000004,54.4053,2522,2966,4,320
140,grains_EGRIP686_6_20.txt.csv,0.0450336,0.34674,0.6082270000000001,21541,377.75,47.2772,593,686,6,0
141,grains_EGRIP3117_1_20.txt.csv,0.0153159,0.345898,0.638786,4413,1714.35,50.0112,2497,3117,1,0
142,grains_EGRIP1276_1_20.txt.csv,0.00825196,0.36488,0.626868,7425,701.8000000000002,47.7082,894,1276,1,0
143,grains_EGRIP1057_6_20.txt.csv,0.0119382,0.313846,0.674216,21605,581.8000000000002,57.4396,579,1057,6,0
144,grains_EGRIP836_1_20.txt.csv,0.0435786,0.382016,0.5744060000000001,19192,459.8,38.9205,549,836,1,0
145,grains_EGRIP2756_6_20.txt.csv,0.0104792,0.349051,0.64047,4428,1516.2500000000002,51.3044,2370,2756,6,299
146,grains_EGRIP1016_5_20.txt.csv,0.0300378,0.336716,0.633246,20436,559.1600000000002,44.8054,611,1016,5,0
147,grains_EGRIP1965_3_20.txt.csv,0.00984039,0.381457,0.608703,12494,1080.93,44.9322,919,1965,3,0
148,grains_EGRIP1247_6_20.txt.csv,0.0101052,0.394938,0.594956,14616,686.3000000000002,43.292,605,1247,6,0
149,grains_EGRIP1615_1_20.txt.csv,0.0106276,0.4464260000000001,0.542946,15723,888.2500000000001,18.4199,709,1615,1,0
150,grains_EGRIP1400_2_volume_vertical_20.txt.csv,0.015797299999999997,0.214166,0.770037,23127,770.0900000000001,68.3403,176,1400,2,0
151,grains_EGRIP776_4_20.txt.csv,0.0360042,0.349716,0.61428,18333,427.07,43.7515,687,776,4,0
152,grains_EGRIP2486_3_20.txt.csv,0.00658217,0.339873,0.6535449999999999,7441,1367.4800000000002,51.8635,1702,2486,3,0
153,grains_EGRIP2817_3_20.txt.csv,0.0108122,0.276448,0.712739,2711,1549.5300000000002,61.8031,3418,2817,3,0
154,grains_EGRIP2626_1_20.txt.csv,0.0136797,0.288986,0.697335,4006,1444.3000000000004,59.1142,2585,2626,1,0
155,grains_EGRIP837_2_volume_vertical_20.txt.csv,0.0536152,0.351877,0.594507,25255,460.44,36.5672,221,837,2,0
156,grains_EGRIP2635_4_20.txt.csv,0.00866171,0.29425,0.6970890000000001,3798,1449.5200000000002,58.7841,3026,2635,4,0
157,grains_EGRIP936_2_20.txt.csv,0.0294825,0.3734,0.597117,22193,514.8900000000001,45.1525,603,936,2,0
158,grains_EGRIP2106_4_20.txt.csv,0.0119664,0.364354,0.623679,10203,1158.5700000000004,46.9742,1128,2106,4,0
159,grains_EGRIP1315_3_20.txt.csv,0.0102698,0.413071,0.576659,14216,723.4300000000002,39.2111,834,1315,3,0
160,grains_EGRIP1377_2_20.txt.csv,0.0108689,0.357066,0.632065,10306,757.44,49.8745,880,1377,2,0
161,grains_EGRIP3086_1_20.txt.csv,0.0129584,0.278184,0.708858,2657,1697.3000000000004,60.8995,3266,3086,1,247
162,grains_EGRIP2876_1_20.txt.csv,0.010687,0.29645,0.692864,4578,1581.8000000000004,58.1004,2462,2876,1,279
163,grains_EGRIP796_3_20.txt.csv,0.0285111,0.324512,0.646977,11249,437.98,52.5163,1115,796,3,0
164,grains_EGRIP1606_2_volume_vertical_20.txt.csv,0.00871709,0.332857,0.6584260000000001,6502,883.3900000000001,51.5307,476,1606,2,0
165,grains_EGRIP1588_3_20.txt.csv,0.013443200000000002,0.358989,0.627568,11033,873.58,47.2804,1118,1588,3,0
166,grains_EGRIP1146_3_20.txt.csv,0.0202979,0.326282,0.653421,13863,630.48,54.5979,873,1146,3,0
167,grains_EGRIP2475_1_20.txt.csv,0.00559494,0.482315,0.5120899999999999,8621,1361.25,26.9681,1193,2475,1,0
168,grains_EGRIP2535_1_20.txt.csv,0.013255100000000002,0.324552,0.662193,3755,1394.25,52.9989,2752,2535,1,0
169,grains_EGRIP1933_2_20.txt.csv,0.00943353,0.390809,0.599758,13343,1063.24,35.5619,932,1933,2,0
170,grains_EGRIP2026_6_20.txt.csv,0.00994126,0.383951,0.606107,12465,1114.7500000000002,46.7509,951,2026,6,0
171,grains_EGRIP1996_1_20.txt.csv,0.00913457,0.440933,0.549932,14279,1097.8000000000004,34.3536,937,1996,1,0
172,grains_EGRIP1507_1_20.txt.csv,0.0170689,0.283339,0.699592,10371,828.85,60.913,985,1507,1,0
173,grains_EGRIP2286_4_20.txt.csv,0.0116754,0.37454,0.613785,6186,1257.5700000000004,45.9528,1967,2286,4,0
174,grains_EGRIP896_5_20.txt.csv,0.0221144,0.375775,0.602111,16544,493.16000000000014,45.7159,748,896,5,0
175,grains_EGRIP2206_1_20.txt.csv,0.0106529,0.428797,0.560551,9502,1213.3000000000004,38.9409,1243,2206,1,0
176,grains_EGRIP866_4_20.txt.csv,0.0210226,0.328577,0.6504,17253,476.57,50.9925,752,866,4,0
177,grains_EGRIP2786_6_20.txt.csv,0.0114098,0.261788,0.726803,3052,1532.7500000000002,64.0002,3238,2786,6,295
178,grains_EGRIP2936_1_20.txt.csv,0.013527700000000002,0.322063,0.664409,3146,1614.8000000000004,54.9342,3046,2936,1,307
179,grains_EGRIP657_6_20.txt.csv,0.0421001,0.404505,0.553395,8529,361.8,36.1496,1457,657,6,0
180,grains_EGRIP2056_2_20.txt.csv,0.0113379,0.405976,0.5826859999999999,11510,1130.89,38.5648,1113,2056,2,0
181,grains_EGRIP2236_6_20.txt.csv,0.00916409,0.399975,0.59086,10168,1230.2500000000002,42.6352,1134,2236,6,0
182,grains_EGRIP2596_6_20.txt.csv,0.00991529,0.280244,0.7098409999999999,4075,1428.2500000000002,60.8276,2820,2596,6,0
183,grains_EGRIP2906_6_20.txt.csv,0.0111127,0.318422,0.670465,5988,1598.7500000000002,54.504,2050,2906,6,284
184,grains_EGRIP666_1_20.txt.csv,0.0723895,0.372842,0.554769,22149,366.3,32.4884,551,666,1,0
185,grains_EGRIP1546_2_20.txt.csv,0.00982567,0.338309,0.651866,17157,850.3900000000001,52.2296,692,1546,2,0
186,grains_EGRIP1406_2_20.txt.csv,0.009487,0.34443,0.646083,12978,773.3900000000001,52.6609,920,1406,2,0
187,grains_EGRIP2846_6_20.txt.csv,0.0124532,0.346902,0.640644,4257,1565.7500000000002,26.9603,2597,2846,6,0
188,grains_EGRIP756_5_20.txt.csv,0.0459878,0.408035,0.545977,14827,416.16,35.6391,877,756,5,0
189,grains_EGRIP2156_1_20.txt.csv,0.0116337,0.323531,0.6648350000000001,14891,1185.8000000000004,52.5504,833,2156,1,0
190,grains_EGRIP866_6_20.txt.csv,0.0336499,0.377304,0.589047,18205,476.75,42.5128,679,866,6,0
191,grains_EGRIP2786_4_20.txt.csv,0.00985514,0.271543,0.7186020000000001,3518,1532.5700000000004,62.2834,2744,2786,4,295
192,grains_EGRIP657_4_20.txt.csv,0.0554476,0.326882,0.6176699999999999,19318,361.62,47.6633,665,657,4,0
193,grains_EGRIP2936_3_20.txt.csv,0.0124837,0.342134,0.645382,3579,1614.9800000000002,51.1421,2843,2936,3,307
194,grains_EGRIP2026_4_20.txt.csv,0.010014,0.421845,0.568141,14023,1114.5700000000004,32.8193,868,2026,4,0
195,grains_EGRIP2535_3_20.txt.csv,0.015326,0.295579,0.689095,3202,1394.43,57.7617,3390,2535,3,0
196,grains_EGRIP2206_3_20.txt.csv,0.0125107,0.390304,0.5971850000000001,8968,1213.4800000000002,43.5175,1327,2206,3,0
197,grains_EGRIP816_2_20.txt.csv,0.0333103,0.331215,0.635475,19145,448.89,52.2284,645,816,2,0
198,grains_EGRIP1507_3_20.txt.csv,0.0188963,0.27765300000000004,0.703451,10139,829.03,59.9845,1101,1507,3,0
199,grains_EGRIP2286_6_20.txt.csv,0.0104625,0.378962,0.610575,7050,1257.7500000000002,45.0675,1724,2286,6,0
200,grains_EGRIP956_2_20.txt.csv,0.0320358,0.36905,0.5989140000000001,14332,525.8900000000001,42.145,932,956,2,0
201,grains_EGRIP2475_3_20.txt.csv,0.00654551,0.419026,0.574429,5985,1361.43,42.1837,1129,2475,3,0
202,grains_EGRIP2416_2_20.txt.csv,0.0119771,0.365092,0.622931,5772,1328.89,47.3552,1732,2416,2,0
203,grains_EGRIP2876_3_20.txt.csv,0.0106319,0.269595,0.719773,4050,1581.9800000000002,62.5531,2711,2876,3,279
204,grains_EGRIP796_1_20.txt.csv,0.0417801,0.300582,0.6576380000000001,17710,437.8,54.5373,708,796,1,0
205,grains_EGRIP3086_3_20.txt.csv,0.0107439,0.260232,0.729024,2518,1697.4800000000002,63.9017,3748,3086,3,247
206,grains_EGRIP1146_1_20.txt.csv,0.0202811,0.388435,0.591284,16303,630.3000000000002,31.1549,769,1146,1,0
207,grains_EGRIP1606_1_volume_vertical_20.txt.csv,0.0089336,0.405546,0.5855199999999999,10483,883.3000000000002,40.0851,997,1606,1,0
208,grains_EGRIP1588_1_20.txt.csv,0.0119699,0.410143,0.577887,7673,873.4000000000002,39.1229,1265,1588,1,0
209,grains_EGRIP2156_3_20.txt.csv,0.00760037,0.409845,0.582554,11117,1185.9800000000002,41.1548,1099,2156,3,0
210,grains_EGRIP2386_5_20.txt.csv,0.00797658,0.344866,0.647157,6710,1312.66,51.397,1684,2386,5,0
211,grains_EGRIP2846_4_20.txt.csv,0.0127562,0.312874,0.674369,3665,1565.5700000000004,57.0316,2851,2846,4,0
212,grains_EGRIP666_3_20.txt.csv,0.08537,0.341848,0.572782,21327,366.48,35.4738,597,666,3,0
213,grains_EGRIP2596_4_20.txt.csv,0.00979203,0.30304200000000003,0.6871659999999999,3894,1428.0700000000004,57.3318,2706,2596,4,0
214,grains_EGRIP2906_4_20.txt.csv,0.0117329,0.329531,0.658736,5821,1598.5700000000004,52.9755,2028,2906,4,284
215,grains_EGRIP2236_4_20.txt.csv,0.00761476,0.447942,0.544443,9984,1230.0700000000004,36.6686,1147,2236,4,0
216,grains_EGRIP2075_2_20.txt.csv,0.0113998,0.334877,0.6537229999999999,14862,1141.34,52.27,840,2075,2,0
217,grains_EGRIP1214_2_20.txt.csv,0.016079200000000002,0.350506,0.633415,14518,667.7900000000002,49.5593,798,1214,2,0
218,grains_EGRIP2966_6_20.txt.csv,0.0119369,0.334964,0.653099,4380,1631.7500000000002,50.5489,2544,2966,6,320
219,grains_EGRIP3117_3_20.txt.csv,0.0129823,0.330348,0.65667,5057,1714.5300000000002,52.2342,2200,3117,3,0
220,grains_EGRIP686_4_20.txt.csv,0.0401271,0.367485,0.592388,15226,377.57,28.4933,847,686,4,0
221,grains_EGRIP1276_3_20.txt.csv,0.0122334,0.336194,0.651573,16756,701.98,53.7777,699,1276,3,0
222,grains_EGRIP2756_4_20.txt.csv,0.0101817,0.340469,0.64935,4674,1516.0700000000004,52.9607,2275,2756,4,299
223,grains_EGRIP1057_4_20.txt.csv,0.014918,0.314969,0.670113,25103,581.62,53.8099,510,1057,4,0
224,grains_EGRIP836_3_20.txt.csv,0.0296517,0.335856,0.6344920000000001,29677,459.98,50.0664,442,836,3,0
225,grains_EGRIP2256_6_20.txt.csv,0.0111102,0.385801,0.603088,8385,1241.2500000000002,43.29,1560,2256,6,0
226,grains_EGRIP2565_6_20.txt.csv,0.0119876,0.295569,0.692444,3860,1411.2000000000005,58.261,3100,2565,6,0
227,grains_EGRIP1637_1_20.txt.csv,0.016434900000000002,0.37428,0.6092850000000001,11969,900.35,44.3276,898,1637,1,0
228,grains_EGRIP2136_1_20.txt.csv,0.012265,0.360346,0.6273890000000001,7069,1174.8000000000004,47.7325,1674,2136,1,0
229,grains_EGRIP1185_4_20.txt.csv,0.014192700000000003,0.406647,0.57916,18259,652.02,18.9252,647,1185,4,0
230,grains_EGRIP2316_6_20.txt.csv,0.011182,0.331372,0.657446,5150,1274.2500000000002,53.4746,2178,2316,6,0
231,grains_EGRIP1558_1_20.txt.csv,0.0148262,0.393754,0.59142,11818,856.9000000000002,42.4255,985,1558,1,0
232,grains_EGRIP1116_4_20.txt.csv,0.0130757,0.342498,0.644426,15938,614.07,51.9448,787,1116,4,0
233,grains_EGRIP977_3_20.txt.csv,0.0165235,0.302039,0.681438,23986,537.53,57.6087,559,977,3,0
234,grains_EGRIP2696_1_20.txt.csv,0.0153764,0.299519,0.685104,4391,1482.8000000000004,57.099,2348,2696,1,162
235,grains_EGRIP2600_2_volume_vertical_20.txt.csv,0.0186395,0.291729,0.689632,3197,1430.09,56.7041,1036,2600,2,61
236,grains_EGRIP3056_3_20.txt.csv,0.0137228,0.282133,0.704144,2973,1680.9800000000002,59.7433,3129,3056,3,8
237,grains_EGRIP2436_3_20.txt.csv,0.00967469,0.310938,0.679387,4443,1339.9800000000002,55.8358,2441,2436,3,0
238,grains_EGRIP2635_6_20.txt.csv,0.00929642,0.289818,0.7008850000000001,3265,1449.7000000000005,59.9528,3239,2635,6,0
239,grains_EGRIP2106_6_20.txt.csv,0.00909842,0.393753,0.5971479999999999,7987,1158.7500000000002,44.3392,1420,2106,6,0
240,grains_EGRIP1315_1_20.txt.csv,0.0168817,0.442812,0.5403060000000001,7845,723.2500000000001,40.4568,550,1315,1,0
241,grains_EGRIP2486_1_20.txt.csv,0.00582296,0.378357,0.61582,9048,1367.3000000000004,47.712,1388,2486,1,0
242,grains_EGRIP2817_1_20.txt.csv,0.0104709,0.278451,0.711078,2831,1549.35,60.7553,3584,2817,1,0
243,grains_EGRIP1615_3_20.txt.csv,0.0141063,0.394007,0.5918869999999999,11254,888.4300000000002,16.8725,920,1615,3,0
244,grains_EGRIP2176_2_20.txt.csv,0.00879958,0.381858,0.6093430000000001,8921,1196.89,45.6738,1273,2176,2,0
245,grains_EGRIP1400_1_volume_vertical_20.txt.csv,0.0137136,0.27755100000000005,0.7087359999999999,16703,770.0000000000001,60.481,591,1400,1,0
246,grains_EGRIP776_6_20.txt.csv,0.0586755,0.338572,0.602753,21834,427.25,43.6821,584,776,6,0
247,grains_EGRIP837_1_volume_vertical_20.txt.csv,0.032449200000000004,0.342581,0.624969,19314,460.35,49.2331,514,837,1,0
248,grains_EGRIP1208_3_volume_vertical_20.txt.csv,0.012557,0.35738400000000003,0.630059,10941,664.58,47.5504,1025,1208,3,0
249,grains_EGRIP2626_3_20.txt.csv,0.0111836,0.3067,0.682116,4443,1444.4800000000002,56.8261,2371,2626,3,0
250,grains_EGRIP2356_5_20.txt.csv,0.00988412,0.350896,0.63922,6212,1296.16,49.5299,1866,2356,5,0
251,grains_EGRIP1965_1_20.txt.csv,0.011615,0.364297,0.624088,14468,1080.75,48.1537,863,1965,1,0
252,grains_EGRIP1247_4_20.txt.csv,0.0132578,0.428435,0.558308,14899,686.12,16.8183,799,1247,4,0
253,grains_EGRIP646_2_20.txt.csv,0.08285419999999999,0.339851,0.577294,20296,355.39,40.5395,551,646,2,0
254,grains_EGRIP1096_2_20.txt.csv,0.0237222,0.327991,0.6482859999999999,17776,602.8900000000001,50.5464,731,1096,2,0
255,grains_EGRIP995_2_20.txt.csv,0.0217179,0.389616,0.588666,11342,547.34,36.666,1054,995,2,0
256,grains_EGRIP977_6_20.txt.csv,0.0132596,0.368886,0.617855,12257,537.8000000000002,45.8791,586,977,6,0
257,grains_EGRIP2696_4_20.txt.csv,0.0130188,0.290449,0.696533,4773,1483.0700000000004,58.225,2341,2696,4,162
258,grains_EGRIP1558_4_20.txt.csv,0.00757233,0.388042,0.604386,9413,857.1700000000002,43.6572,1247,1558,4,0
259,grains_EGRIP1116_1_20.txt.csv,0.014112799999999997,0.323691,0.662197,13770,613.8000000000002,54.5555,910,1116,1,0
260,grains_EGRIP3056_6_20.txt.csv,0.014962799999999997,0.327945,0.657092,3553,1681.2500000000002,52.5818,2632,3056,6,8
261,grains_EGRIP724_5_20.txt.csv,0.055663,0.33470900000000003,0.609628,19131,398.56000000000006,48.3856,630,724,5,0
262,grains_EGRIP2436_6_20.txt.csv,0.00907563,0.333226,0.657698,5268,1340.2500000000002,51.9533,2232,2436,6,0
263,grains_EGRIP1637_4_20.txt.csv,0.0104817,0.344544,0.644975,8658,900.62,36.8283,956,1637,4,0
264,grains_EGRIP3027_2_20.txt.csv,0.0135136,0.304064,0.682422,4334,1664.94,56.9121,2628,3027,2,0
265,grains_EGRIP1346_2_20.txt.csv,0.0102525,0.454427,0.535321,14655,740.3900000000001,23.6798,789,1346,2,0
266,grains_EGRIP2446_2_20.txt.csv,0.00898032,0.382147,0.608873,5685,1345.39,45.3321,2090,2446,2,0
267,grains_EGRIP2136_4_20.txt.csv,0.0125326,0.34246,0.645008,8607,1175.0700000000004,51.8571,1288,2136,4,0
268,grains_EGRIP1185_1_20.txt.csv,0.0124402,0.379437,0.608122,19768,651.75,47.0146,624,1185,1,0
269,grains_EGRIP1475_2_20.txt.csv,0.0192044,0.281953,0.698843,19043,811.3400000000001,60.0869,632,1475,2,0
270,grains_EGRIP2666_5_20.txt.csv,0.0120983,0.303261,0.6846409999999999,4216,1466.66,57.0742,2525,2666,5,166
271,grains_EGRIP2316_3_20.txt.csv,0.0144887,0.349696,0.635815,4861,1273.9800000000002,50.2684,2463,2316,3,0
272,grains_EGRIP2256_3_20.txt.csv,0.0112419,0.385725,0.603033,7299,1240.9800000000002,45.0431,1627,2256,3,0
273,grains_EGRIP2726_5_20.txt.csv,0.0120306,0.381909,0.60606,4217,1499.66,40.6416,2434,2726,5,299
274,grains_EGRIP2997_2_20.txt.csv,0.0171262,0.295392,0.6874819999999999,2171,1648.44,57.8468,4108,2997,2,0
275,grains_EGRIP2506_2_20.txt.csv,0.012886000000000002,0.30943200000000004,0.677682,4812,1378.39,56.0314,2351,2506,2,0
276,grains_EGRIP2565_3_20.txt.csv,0.0104454,0.30935300000000004,0.6802010000000001,4668,1410.9300000000005,56.4756,2574,2565,3,0
277,grains_EGRIP1276_6_20.txt.csv,0.0117367,0.364738,0.623525,12418,702.2500000000001,48.2341,872,1276,6,0
278,grains_EGRIP686_1_20.txt.csv,0.034049,0.368155,0.597796,11748,377.3,46.2526,1009,686,1,0
279,grains_EGRIP3117_6_20.txt.csv,0.0142279,0.341108,0.644664,5154,1714.8000000000004,49.4824,2177,3117,6,0
280,grains_EGRIP2966_3_20.txt.csv,0.013193,0.300414,0.686393,4079,1631.4800000000002,56.7963,2740,2966,3,320
281,grains_EGRIP2756_1_20.txt.csv,0.011899,0.341864,0.646237,4106,1515.8000000000004,51.3507,2588,2756,1,299
282,grains_EGRIP836_6_20.txt.csv,0.040676,0.338192,0.621132,26283,460.25,13.6455,497,836,6,0
283,grains_EGRIP1057_1_20.txt.csv,0.0145313,0.37964,0.605829,18398,581.35,47.0416,675,1057,1,0
284,grains_EGRIP1016_2_20.txt.csv,0.0250588,0.40681,0.568131,16897,558.8900000000001,27.0171,768,1016,2,0
285,grains_EGRIP1965_4_20.txt.csv,0.00949699,0.373328,0.617175,11374,1081.02,45.9323,804,1965,4,0
286,grains_EGRIP1247_1_20.txt.csv,0.00789861,0.392168,0.5999329999999999,16013,685.85,45.4147,703,1247,1,0
287,grains_EGRIP2817_4_20.txt.csv,0.0171597,0.285602,0.697239,2572,1549.62,59.4803,3139,2817,4,0
288,grains_EGRIP2486_4_20.txt.csv,0.00650891,0.362029,0.631462,7869,1367.5700000000004,48.1572,1545,2486,4,0
289,grains_EGRIP776_3_20.txt.csv,0.0485768,0.290902,0.660521,25150,426.98,54.7904,499,776,3,0
290,grains_EGRIP1615_6_20.txt.csv,0.0245098,0.309516,0.665975,23326,888.7000000000003,55.4486,448,1615,6,0
291,grains_EGRIP2626_6_20.txt.csv,0.0118472,0.330823,0.6573289999999999,4343,1444.7500000000002,52.1008,2539,2626,6,0
292,grains_EGRIP2635_3_20.txt.csv,0.00903056,0.299765,0.691204,3326,1449.4300000000005,57.67,2749,2635,3,0
293,grains_EGRIP936_5_20.txt.csv,0.0228452,0.32688,0.650275,28226,515.1600000000002,54.2568,493,936,5,0
294,grains_EGRIP1444_5_20.txt.csv,0.0300863,0.343878,0.6260359999999999,8825,794.5600000000002,49.22,1083,1444,5,0
295,grains_EGRIP1377_5_20.txt.csv,0.017484200000000002,0.373051,0.6094649999999999,8830,757.71,43.4837,1234,1377,5,0
296,grains_EGRIP2106_3_20.txt.csv,0.0084679,0.362679,0.628853,9209,1158.4800000000002,48.9233,1252,2106,3,0
297,grains_EGRIP1315_4_20.txt.csv,0.00986047,0.435904,0.554235,13505,723.5200000000002,36.1747,846,1315,4,0
298,grains_EGRIP796_4_20.txt.csv,0.0279758,0.389623,0.5824010000000001,12829,438.07,38.4953,926,796,4,0
299,grains_EGRIP2876_6_20.txt.csv,0.0111439,0.304527,0.684329,3924,1582.2500000000002,56.6543,2867,2876,6,279
300,grains_EGRIP3086_6_20.txt.csv,0.0104174,0.260928,0.728654,2908,1697.7500000000002,63.3986,3649,3086,6,247
301,grains_EGRIP1146_4_20.txt.csv,0.019998,0.36796,0.612042,14563,630.57,46.4456,834,1146,4,0
302,grains_EGRIP1588_4_20.txt.csv,0.0226287,0.362775,0.614596,15003,873.6700000000002,46.9294,823,1588,4,0
303,grains_EGRIP599_1_volume_vertical_20.txt.csv,0.094259,0.311389,0.594352,21036,329.4500000000001,45.8168,531,599,1,0
304,grains_EGRIP2475_6_20.txt.csv,0.00571384,0.398629,0.595657,12128,1361.7,36.431,957,2475,6,0
305,grains_EGRIP203_1_volume_vertical_20.txt.csv,0.206199,0.278516,0.515285,9846,111.65,32.2143,814,203,1,0
306,grains_EGRIP2026_1_20.txt.csv,0.010457700000000002,0.4176,0.5719420000000001,13853,1114.3000000000004,30.1005,891,2026,1,0
307,grains_EGRIP1933_5_20.txt.csv,0.0119261,0.408955,0.5791189999999999,14867,1063.51,16.9302,817,1933,5,0
308,grains_EGRIP2535_6_20.txt.csv,0.0129001,0.322657,0.664443,3959,1394.7,53.8196,2839,2535,6,0
309,grains_EGRIP2206_6_20.txt.csv,0.0155876,0.390116,0.5942970000000001,9038,1213.7500000000002,40.9443,1428,2206,6,0
310,grains_EGRIP896_2_20.txt.csv,0.028329900000000005,0.35789,0.61378,19486,492.89,44.8577,659,896,2,0
311,grains_EGRIP1507_6_20.txt.csv,0.0338509,0.371927,0.594222,15241,829.3000000000002,41.6051,594,1507,6,0
312,grains_EGRIP2286_3_20.txt.csv,0.0109162,0.321765,0.667319,5722,1257.4800000000002,53.8224,2081,2286,3,0
313,grains_EGRIP1996_6_20.txt.csv,0.00985175,0.383229,0.606919,12301,1098.2500000000002,46.6743,997,1996,6,0
314,grains_EGRIP2786_1_20.txt.csv,0.0108215,0.288492,0.700687,3749,1532.3000000000004,58.9184,3036,2786,1,295
315,grains_EGRIP866_3_20.txt.csv,0.0297927,0.333619,0.636588,14811,476.48,50.3372,850,866,3,0
316,grains_EGRIP657_1_20.txt.csv,0.0500463,0.386606,0.563348,15066,361.35,36.2963,844,657,1,0
317,grains_EGRIP2056_5_20.txt.csv,0.0114974,0.394563,0.593939,11194,1131.16,42.7253,1146,2056,5,0
318,grains_EGRIP2936_6_20.txt.csv,0.0128285,0.325846,0.661326,3356,1615.2500000000002,53.861,3106,2936,6,307
319,grains_EGRIP2236_1_20.txt.csv,0.0073158999999999984,0.438264,0.55442,7845,1229.8000000000004,25.4495,1323,2236,1,0
320,grains_EGRIP666_6_20.txt.csv,0.07596280000000001,0.324776,0.5992609999999999,24730,366.75,38.8229,482,666,6,0
321,grains_EGRIP2906_1_20.txt.csv,0.0111485,0.33682,0.652031,5578,1598.3000000000004,51.4785,2087,2906,1,284
322,grains_EGRIP2596_1_20.txt.csv,0.0102027,0.31212,0.6776770000000001,4324,1427.8000000000004,55.7083,2642,2596,1,0
323,grains_EGRIP1546_5_20.txt.csv,0.00936673,0.419997,0.5706359999999999,10343,850.6600000000002,43.4902,729,1546,5,0
324,grains_EGRIP1406_5_20.txt.csv,0.0174745,0.269067,0.713458,15661,773.6600000000002,62.3057,637,1406,5,0
325,grains_EGRIP2846_1_20.txt.csv,0.0116237,0.326339,0.662038,4211,1565.3000000000004,53.9127,2165,2846,1,0
326,grains_EGRIP2156_6_20.txt.csv,0.00971268,0.445852,0.5444359999999999,18222,1186.2500000000002,25.435,683,2156,6,0
327,grains_EGRIP756_2_20.txt.csv,0.0368651,0.367679,0.595456,10678,415.89,36.4125,1126,756,2,0
328,grains_EGRIP2786_3_20.txt.csv,0.00953739,0.29188400000000003,0.698579,4493,1532.4800000000002,58.3813,2525,2786,3,295
329,grains_EGRIP866_1_20.txt.csv,0.0393284,0.358532,0.60214,22297,476.3,44.8765,597,866,1,0
330,grains_EGRIP1000_3_volume_vertical_20.txt.csv,0.0264931,0.398968,0.574539,24995,550.18,33.8353,511,1000,3,0
331,grains_EGRIP2936_4_20.txt.csv,0.0121274,0.34287,0.645003,3609,1615.0700000000004,46.8728,2827,2936,4,0
332,grains_EGRIP657_3_20.txt.csv,0.053977099999999986,0.361187,0.584836,16867,361.53,43.7975,790,657,3,0
333,grains_EGRIP2535_4_20.txt.csv,0.0159422,0.292835,0.6912229999999999,3308,1394.52,58.3624,3213,2535,4,0
334,grains_EGRIP2026_3_20.txt.csv,0.00787124,0.432221,0.559908,12597,1114.4800000000002,37.8784,980,2026,3,0
335,grains_EGRIP1507_4_20.txt.csv,0.0122157,0.355622,0.632162,12273,829.12,48.2973,830,1507,4,0
336,grains_EGRIP2286_1_20.txt.csv,0.011601299999999998,0.357167,0.631232,6176,1257.3000000000004,48.8179,1870,2286,1,0
337,grains_EGRIP816_5_20.txt.csv,0.0305566,0.3763260000000001,0.593117,14145,449.16,43.8467,880,816,5,0
338,grains_EGRIP1996_4_20.txt.csv,0.0114126,0.40658,0.5820069999999999,14639,1098.0700000000004,39.8044,847,1996,4,0
339,grains_EGRIP2206_4_20.txt.csv,0.0109086,0.40177,0.587321,9260,1213.5700000000004,40.5573,1314,2206,4,0
340,grains_EGRIP956_5_20.txt.csv,0.020918400000000004,0.385902,0.59318,13478,526.1600000000002,43.9291,942,956,5,0
341,grains_EGRIP2416_5_20.txt.csv,0.0134983,0.356085,0.630417,5868,1329.16,48.6796,1974,2416,5,0
342,grains_EGRIP2475_4_20.txt.csv,0.00616428,0.4570770000000001,0.536759,10099,1361.52,24.0628,1124,2475,4,0
343,grains_EGRIP599_2_volume_vertical_20.txt.csv,0.105253,0.35730500000000004,0.537442,21391,329.54,23.5343,431,599,2,0
344,grains_EGRIP203_2_volume_vertical_20.txt.csv,0.212429,0.256304,0.531267,9539,111.74,31.7086,403,203,2,0
345,grains_EGRIP3086_4_20.txt.csv,0.0109583,0.262694,0.726348,2855,1697.5700000000004,63.5057,3461,3086,4,247
346,grains_EGRIP796_6_20.txt.csv,0.023512400000000003,0.347355,0.629132,12788,438.25,50.5622,930,796,6,0
347,grains_EGRIP2876_4_20.txt.csv,0.0115793,0.27734000000000003,0.7110810000000001,3870,1582.0700000000004,61.1263,2860,2876,4,279
348,grains_EGRIP1588_6_20.txt.csv,0.0131439,0.389619,0.597237,9584,873.8500000000001,32.5094,1112,1588,6,0
349,grains_EGRIP1146_6_20.txt.csv,0.0247211,0.330777,0.644501,9484,630.7500000000001,31.7256,979,1146,6,0
350,grains_EGRIP2156_4_20.txt.csv,0.0117598,0.339662,0.648578,14086,1186.0700000000004,52.7541,869,2156,4,0
351,grains_EGRIP2386_2_20.txt.csv,0.00629496,0.336295,0.65741,10054,1312.39,53.9045,1264,2386,2,0
352,grains_EGRIP2846_3_20.txt.csv,0.0126947,0.307857,0.679449,3677,1565.4800000000002,56.3153,2762,2846,3,0
353,grains_EGRIP2906_3_20.txt.csv,0.0120104,0.354347,0.6336430000000001,5185,1598.4800000000002,21.1997,2342,2906,3,284
354,grains_EGRIP2596_3_20.txt.csv,0.00960673,0.297556,0.692837,4426,1427.9800000000002,57.5862,2562,2596,3,0
355,grains_EGRIP666_4_20.txt.csv,0.0540109,0.4138060000000001,0.532183,14134,366.57,29.5995,860,666,4,0
356,grains_EGRIP2236_3_20.txt.csv,0.00953746,0.411842,0.57862,9707,1229.9800000000002,41.1638,1166,2236,3,0
357,grains_EGRIP2075_5_20.txt.csv,0.0101485,0.4275100000000001,0.562341,12303,1141.61,37.6888,1034,2075,5,0
358,grains_EGRIP1276_4_20.txt.csv,0.0120329,0.293248,0.694719,11836,702.07,59.8612,943,1276,4,0
359,grains_EGRIP3117_4_20.txt.csv,0.0149721,0.319412,0.665616,4674,1714.62,54.1115,2530,3117,4,0
360,grains_EGRIP686_3_20.txt.csv,0.0515071,0.378613,0.56988,23836,377.48,41.9479,574,686,3,0
361,grains_EGRIP2966_1_20.txt.csv,0.0137752,0.301008,0.6852159999999999,4160,1631.3000000000004,57.1896,2629,2966,1,320
362,grains_EGRIP1214_5_20.txt.csv,0.014694799999999997,0.370109,0.615196,14560,668.0600000000002,47.8177,832,1214,5,0
363,grains_EGRIP836_4_20.txt.csv,0.0400125,0.345493,0.614495,22582,460.07,46.4329,551,836,4,0
364,grains_EGRIP1057_3_20.txt.csv,0.00934766,0.355182,0.63547,11576,581.53,50.2774,1059,1057,3,0
365,grains_EGRIP2756_3_20.txt.csv,0.0112705,0.322246,0.666483,3897,1515.9800000000002,53.2706,2683,2756,3,299
366,grains_EGRIP2256_1_20.txt.csv,0.0129177,0.387855,0.5992270000000001,7539,1240.8000000000004,42.698,1619,2256,1,0
367,grains_EGRIP2565_1_20.txt.csv,0.0103212,0.275294,0.714384,4389,1410.7500000000002,61.4325,2641,2565,1,0
368,grains_EGRIP2136_6_20.txt.csv,0.014414700000000003,0.394115,0.5914699999999999,8665,1175.2500000000002,43.9389,1283,2136,6,0
369,grains_EGRIP1637_6_20.txt.csv,0.00951654,0.314389,0.676094,6508,900.8,55.7836,1091,1637,6,0
370,grains_EGRIP2316_1_20.txt.csv,0.0150031,0.367194,0.617803,5865,1273.8000000000004,41.0403,2111,2316,1,0
371,grains_EGRIP1185_3_20.txt.csv,0.0158774,0.440986,0.543137,21869,651.93,33.316,553,1185,3,0
372,grains_EGRIP977_4_20.txt.csv,0.0193743,0.368926,0.6117,17048,537.62,48.7389,748,977,4,0
373,grains_EGRIP2696_6_20.txt.csv,0.014504,0.305357,0.680139,3641,1483.2500000000002,56.3057,2856,2696,6,162
374,grains_EGRIP1558_6_20.txt.csv,0.0126104,0.319902,0.667488,19482,857.3500000000001,54.4167,630,1558,6,0
375,grains_EGRIP2221_3_volume_vertical_20.txt.csv,0.00714325,0.368774,0.6240829999999999,8304,1221.7300000000002,47.492,1751,2221,3,0
376,grains_EGRIP1116_3_20.txt.csv,0.0131043,0.370821,0.616075,19137,613.98,45.8951,677,1116,3,0
377,grains_EGRIP2436_4_20.txt.csv,0.00608608,0.352327,0.641586,7321,1340.0700000000004,49.8039,1651,2436,4,0
378,grains_EGRIP3056_4_20.txt.csv,0.0132437,0.30576,0.680996,3694,1681.0700000000004,56.6268,3009,3056,4,8
379,grains_EGRIP2635_1_20.txt.csv,0.00973616,0.268347,0.721917,3191,1449.2500000000002,62.4422,1969,2635,1,0
380,grains_EGRIP2106_1_20.txt.csv,0.00933961,0.38614,0.60452,8577,1158.3000000000004,45.3862,1389,2106,1,0
381,grains_EGRIP1315_6_20.txt.csv,0.009734200000000002,0.456604,0.533662,16727,723.7000000000003,31.764,604,1315,6,0
382,grains_EGRIP776_1_20.txt.csv,0.0466881,0.398198,0.555114,25277,426.8,35.2407,515,776,1,0
383,grains_EGRIP1615_4_20.txt.csv,0.0210212,0.278975,0.700004,12033,888.5200000000002,60.1886,919,1615,4,0
384,grains_EGRIP2176_5_20.txt.csv,0.00826179,0.349822,0.6419159999999999,9383,1197.16,50.1633,1238,2176,5,0
385,grains_EGRIP2817_6_20.txt.csv,0.0118086,0.284968,0.7032229999999999,2831,1549.8000000000004,58.9634,3470,2817,6,0
386,grains_EGRIP2486_6_20.txt.csv,0.00790577,0.360418,0.631676,6541,1367.7500000000002,47.1188,1818,2486,6,0
387,grains_EGRIP2626_4_20.txt.csv,0.0114721,0.318308,0.6702199999999999,4492,1444.5700000000004,54.3059,2634,2626,4,0
388,grains_EGRIP2356_2_20.txt.csv,0.00952982,0.385658,0.604812,8647,1295.89,43.9143,1411,2356,2,0
389,grains_EGRIP1965_6_20.txt.csv,0.0114469,0.344954,0.643599,14937,1081.2,50.7314,813,1965,6,0
390,grains_EGRIP1247_3_20.txt.csv,0.0124611,0.401264,0.586275,24627,686.03,41.2376,480,1247,3,0
391,grains_EGRIP646_5_20.txt.csv,0.0617077,0.368417,0.569875,12966,355.66,39.759,974,646,5,0
392,grains_EGRIP1096_5_20.txt.csv,0.0184281,0.356806,0.6247659999999999,17783,603.1600000000002,19.0498,705,1096,5,0
393,grains_EGRIP1546_3_20.txt.csv,0.0123013,0.436196,0.551503,14114,850.48,23.7141,651,1546,3,0
394,grains_EGRIP2075_1_20.txt.csv,0.00976212,0.370119,0.620119,14255,1141.25,47.2339,874,2075,1,0
395,grains_EGRIP756_4_20.txt.csv,0.0334366,0.412393,0.5541699999999999,10543,416.07,39.163,1205,756,4,0
396,grains_EGRIP2386_6_20.txt.csv,0.0065586,0.358472,0.634969,8936,1312.7500000000002,49.8195,1314,2386,6,0
397,grains_EGRIP1406_3_20.txt.csv,0.008792200000000002,0.341447,0.64976,13835,773.48,52.0114,720,1406,3,0
398,grains_EGRIP2416_1_20.txt.csv,0.0108579,0.394314,0.594828,6676,1328.8000000000004,41.7539,1602,2416,1,0
399,grains_EGRIP956_1_20.txt.csv,0.023563,0.349215,0.6272220000000001,14682,525.8000000000002,40.2535,836,956,1,0
400,grains_EGRIP1588_2_20.txt.csv,0.00758356,0.370708,0.621708,12830,873.4900000000001,48.0169,859,1588,2,0
401,grains_EGRIP1146_2_20.txt.csv,0.0147158,0.333196,0.652088,14170,630.3900000000001,52.0717,888,1146,2,0
402,grains_EGRIP796_2_20.txt.csv,0.0357728,0.338661,0.625566,12446,437.89,50.0184,966,796,2,0
403,grains_EGRIP2221_2_volume_vertical_20.txt.csv,0.00627652,0.43246,0.561264,10038,1221.64,30.3938,451,2221,2,0
404,grains_EGRIP2056_3_20.txt.csv,0.00977029,0.412166,0.578063,11114,1130.9800000000002,36.1659,1121,2056,3,0
405,grains_EGRIP866_5_20.txt.csv,0.040380800000000015,0.380869,0.57875,14352,476.66,43.8267,849,866,5,0
406,grains_EGRIP2286_5_20.txt.csv,0.0103184,0.3688010000000001,0.620881,6341,1257.66,47.4765,1848,2286,5,0
407,grains_EGRIP816_1_20.txt.csv,0.033261800000000015,0.31879,0.647948,15078,448.8,51.5157,814,816,1,0
408,grains_EGRIP896_4_20.txt.csv,0.0287886,0.327796,0.643415,23755,493.07000000000005,51.3555,569,896,4,0
409,grains_EGRIP1933_3_20.txt.csv,0.0111256,0.429071,0.559804,14489,1063.3300000000004,31.9345,842,1933,3,0
410,grains_EGRIP1965_2_20.txt.csv,0.011661,0.412106,0.576233,11572,1080.84,41.422,1001,1965,2,0
411,grains_EGRIP1016_4_20.txt.csv,0.0232371,0.39531,0.581453,14594,559.07,42.243,890,1016,4,0
412,grains_EGRIP1096_1_20.txt.csv,0.0190131,0.358188,0.622799,21877,602.8000000000002,48.0878,596,1096,1,0
413,grains_EGRIP646_1_20.txt.csv,0.0666518,0.370423,0.562925,15057,355.3,37.2691,347,646,1,0
414,grains_EGRIP2106_5_20.txt.csv,0.0101778,0.356039,0.633783,10654,1158.66,46.6295,1118,2106,5,0
415,grains_EGRIP1315_2_20.txt.csv,0.00912134,0.450672,0.5402060000000001,12150,723.3400000000001,23.5489,916,1315,2,0
416,grains_EGRIP1377_3_20.txt.csv,0.0168722,0.362601,0.620527,16588,757.53,48.132,664,1377,3,0
417,grains_EGRIP1444_3_20.txt.csv,0.0187759,0.299479,0.6817449999999999,18123,794.38,57.802,603,1444,3,0
418,grains_EGRIP2635_5_20.txt.csv,0.00871447,0.292916,0.6983699999999999,3316,1449.61,57.3562,3145,2635,5,0
419,grains_EGRIP936_3_20.txt.csv,0.0200068,0.3352,0.6447930000000001,16021,514.98,51.7887,834,936,3,0
420,grains_EGRIP2356_6_20.txt.csv,0.0101088,0.34477800000000003,0.645113,5785,1296.2500000000002,48.8626,1331,2356,6,0
421,grains_EGRIP776_5_20.txt.csv,0.0387584,0.389323,0.571919,18612,427.16,14.9641,703,776,5,0
422,grains_EGRIP2176_1_20.txt.csv,0.00950105,0.395432,0.595067,9141,1196.8000000000004,43.0662,1250,2176,1,0
423,grains_EGRIP2817_2_20.txt.csv,0.0181134,0.287065,0.694821,2533,1549.44,58.3254,3034,2817,2,0
424,grains_EGRIP2486_2_20.txt.csv,0.00795739,0.31931,0.672732,6132,1367.39,55.0453,1890,2486,2,0
425,grains_EGRIP1475_4_20.txt.csv,0.0217906,0.340719,0.63749,16962,811.5200000000002,50.9676,711,1475,4,0
426,grains_EGRIP2666_3_20.txt.csv,0.0155468,0.293769,0.690684,3594,1466.4800000000002,56.5979,3180,2666,3,166
427,grains_EGRIP2316_5_20.txt.csv,0.0118339,0.347649,0.640517,5798,1274.16,50.729,2103,2316,5,0
428,grains_EGRIP599_3_volume_vertical_20.txt.csv,0.07805269999999999,0.324015,0.597933,20854,329.63000000000005,44.9513,897,599,3,0
429,grains_EGRIP203_3_volume_vertical_20.txt.csv,0.210208,0.284137,0.505654,9679,111.83,29.6032,1320,203,3,0
430,grains_EGRIP2446_4_20.txt.csv,0.00867183,0.365572,0.6257560000000001,7569,1345.5700000000004,47.5406,1721,2446,4,0
431,grains_EGRIP2136_2_20.txt.csv,0.0117262,0.396886,0.591388,7890,1174.89,42.6039,1435,2136,2,0
432,grains_EGRIP1637_2_20.txt.csv,0.0184545,0.371684,0.609862,18282,900.44,43.1643,673,1637,2,0
433,grains_EGRIP1346_4_20.txt.csv,0.0141761,0.358865,0.626959,15055,740.57,49.7664,622,1346,4,0
434,grains_EGRIP3027_4_20.txt.csv,0.0155118,0.295372,0.689116,3588,1665.12,56.7154,2949,3027,4,0
435,grains_EGRIP724_3_20.txt.csv,0.0727991,0.373538,0.553663,24371,398.38000000000005,8.169310000000001,534,724,3,0
436,grains_EGRIP995_4_20.txt.csv,0.0197235,0.430547,0.54973,16203,547.52,21.7468,721,995,4,0
437,grains_EGRIP2696_2_20.txt.csv,0.013292700000000005,0.315202,0.671506,4782,1482.89,54.7884,2475,2696,2,162
438,grains_EGRIP1558_2_20.txt.csv,0.0107667,0.373621,0.6156119999999999,13992,856.9900000000001,46.7738,915,1558,2,0
439,grains_EGRIP2966_5_20.txt.csv,0.0117483,0.303809,0.684443,4595,1631.66,56.8479,2482,2966,5,320
440,grains_EGRIP1214_1_20.txt.csv,0.0164566,0.407072,0.576471,22380,667.7,39.8673,521,1214,1,0
441,grains_EGRIP1000_2_volume_vertical_20.txt.csv,0.0197751,0.328705,0.65152,30486,550.09,53.5791,188,1000,2,0
442,grains_EGRIP2565_5_20.txt.csv,0.011579,0.300269,0.6881520000000001,4915,1411.11,58.2025,1844,2565,5,0
443,grains_EGRIP2997_4_20.txt.csv,0.016974799999999998,0.29588400000000004,0.687141,2426,1648.62,56.9853,3932,2997,4,0
444,grains_EGRIP2506_4_20.txt.csv,0.0127836,0.341914,0.645302,4200,1378.5700000000004,49.4321,2001,2506,4,0
445,grains_EGRIP2256_5_20.txt.csv,0.0106054,0.413643,0.575752,8386,1241.16,39.7023,1569,2256,5,0
446,grains_EGRIP2726_3_20.txt.csv,0.011902,0.31656,0.671538,4125,1499.4800000000002,55.5823,2250,2726,3,299
447,grains_EGRIP2626_2_20.txt.csv,0.012595,0.301426,0.685979,4429,1444.39,57.5445,2521,2626,2,0
448,grains_EGRIP2356_4_20.txt.csv,0.0103383,0.397984,0.591677,7085,1296.0700000000004,41.6123,1633,2356,4,0
449,grains_EGRIP1615_2_20.txt.csv,0.0117115,0.360338,0.62795,18876,888.3400000000001,50.803,607,1615,2,0
450,grains_EGRIP2176_3_20.txt.csv,0.0077106000000000015,0.369008,0.6232810000000001,8042,1196.9800000000002,43.143,1395,2176,3,0
451,grains_EGRIP1377_1_20.txt.csv,0.00936381,0.377262,0.613374,6863,757.35,45.9016,1252,1377,1,0
452,grains_EGRIP936_1_20.txt.csv,0.0335942,0.354977,0.611429,21285,514.8000000000002,45.0509,623,936,1,0
453,grains_EGRIP1096_3_20.txt.csv,0.0273426,0.323484,0.649173,15032,602.98,51.1015,845,1096,3,0
454,grains_EGRIP1016_6_20.txt.csv,0.0184469,0.346321,0.635232,15995,559.2500000000001,51.2525,763,1016,6,0
455,grains_EGRIP646_3_20.txt.csv,0.06352680000000001,0.349224,0.587249,12869,355.48,41.93,851,646,3,0
456,grains_EGRIP1247_5_20.txt.csv,0.0165429,0.36217,0.621287,25648,686.21,48.8544,466,1247,5,0
457,grains_EGRIP2997_6_20.txt.csv,0.014641899999999998,0.281767,0.703591,2535,1648.8000000000004,60.033,3892,2997,6,0
458,grains_EGRIP2506_6_20.txt.csv,0.0115906,0.35646500000000003,0.631945,4550,1378.7500000000002,44.1786,2229,2506,6,0
459,grains_EGRIP2756_5_20.txt.csv,0.0120266,0.339667,0.648307,4043,1516.16,52.1185,2562,2756,5,299
460,grains_EGRIP836_2_20.txt.csv,0.0415242,0.392116,0.5663600000000001,19668,459.89,34.3399,661,836,2,0
461,grains_EGRIP1057_5_20.txt.csv,0.016250399999999998,0.332455,0.6512939999999999,19173,581.71,51.2991,642,1057,5,0
462,grains_EGRIP1000_1_volume_vertical_20.txt.csv,0.0197871,0.378795,0.601418,23105,550.0,46.1847,358,1000,1,0
463,grains_EGRIP1214_3_20.txt.csv,0.0149845,0.385452,0.599563,15834,667.88,31.9079,614,1214,3,0
464,grains_EGRIP3117_2_20.txt.csv,0.0145771,0.355548,0.629875,4933,1714.44,48.1005,2308,3117,2,0
465,grains_EGRIP686_5_20.txt.csv,0.0514346,0.364301,0.5842649999999999,20312,377.66,27.7292,649,686,5,0
466,grains_EGRIP1276_2_20.txt.csv,0.0139827,0.287895,0.698122,11417,701.8900000000001,60.347,929,1276,2,0
467,grains_EGRIP3056_2_20.txt.csv,0.015127000000000003,0.296854,0.6880189999999999,3518,1680.89,57.512,3084,3056,2,8
468,grains_EGRIP724_1_20.txt.csv,0.0445677,0.339633,0.615799,22280,398.2000000000001,47.8147,574,724,1,0
469,grains_EGRIP2436_2_20.txt.csv,0.00850793,0.34,0.651492,5107,1339.89,51.4001,2119,2436,2,0
470,grains_EGRIP995_6_20.txt.csv,0.0211887,0.355756,0.623055,18609,547.7,49.7263,643,995,6,0
471,grains_EGRIP977_2_20.txt.csv,0.0196403,0.362346,0.6180140000000001,22928,537.44,47.0368,586,977,2,0
472,grains_EGRIP1116_5_20.txt.csv,0.0147187,0.351524,0.633757,15957,614.1600000000002,51.7711,788,1116,5,0
473,grains_EGRIP1185_5_20.txt.csv,0.0115769,0.411655,0.5767680000000001,13509,652.11,39.3895,864,1185,5,0
474,grains_EGRIP1475_6_20.txt.csv,0.0133876,0.300151,0.686461,12909,811.7000000000003,58.1775,923,1475,6,0
475,grains_EGRIP2666_1_20.txt.csv,0.013935299999999998,0.282291,0.703774,4270,1466.3000000000004,60.232,2178,2666,1,166
476,grains_EGRIP1346_6_20.txt.csv,0.0136319,0.33085,0.655518,8953,740.7500000000001,52.2468,736,1346,6,0
477,grains_EGRIP3027_6_20.txt.csv,0.0148196,0.31491,0.670271,3771,1665.3000000000004,55.5402,2973,3027,6,0
478,grains_EGRIP2446_6_20.txt.csv,0.00804319,0.352132,0.639825,7298,1345.7500000000002,49.5588,1823,2446,6,0
479,grains_EGRIP2846_5_20.txt.csv,0.0130251,0.32981,0.657165,3550,1565.66,52.6249,2920,2846,5,0
480,grains_EGRIP2386_4_20.txt.csv,0.00642877,0.37254,0.6210319999999999,8288,1312.5700000000004,46.3235,1390,2386,4,0
481,grains_EGRIP1406_1_20.txt.csv,0.0116486,0.364183,0.624169,10249,773.3000000000002,48.5001,931,1406,1,0
482,grains_EGRIP2156_2_20.txt.csv,0.00822353,0.387864,0.603912,14067,1185.89,46.2568,865,2156,2,0
483,grains_EGRIP756_6_20.txt.csv,0.034072000000000005,0.34253,0.623398,12919,416.25,49.4896,956,756,6,0
484,grains_EGRIP2075_3_20.txt.csv,0.00936007,0.364678,0.625962,16892,1141.43,48.2861,752,2075,3,0
485,grains_EGRIP2236_5_20.txt.csv,0.0108788,0.451415,0.537706,7961,1230.16,25.6165,1421,2236,5,0
486,grains_EGRIP1546_1_20.txt.csv,0.0144293,0.412813,0.572758,15477,850.3000000000002,36.163,537,1546,1,0
487,grains_EGRIP666_2_20.txt.csv,0.06374049999999999,0.410046,0.5262140000000001,16920,366.39,15.1571,732,666,2,0
488,grains_EGRIP2596_5_20.txt.csv,0.00914363,0.309106,0.68175,4431,1428.16,56.0479,2625,2596,5,0
489,grains_EGRIP2906_5_20.txt.csv,0.0099312,0.312014,0.678055,6597,1598.66,55.7402,1906,2906,5,284
490,grains_EGRIP2206_2_20.txt.csv,0.0109288,0.388672,0.600399,10015,1213.39,44.021,1253,2206,2,0
491,grains_EGRIP896_6_20.txt.csv,0.0221775,0.33944,0.638383,16071,493.25000000000006,48.9866,788,896,6,0
492,grains_EGRIP1996_2_20.txt.csv,0.0163202,0.410066,0.5736140000000001,15709,1097.89,39.0672,845,1996,2,0
493,grains_EGRIP816_3_20.txt.csv,0.028830200000000007,0.306979,0.664191,20305,448.98,54.1238,630,816,3,0
494,grains_EGRIP2026_5_20.txt.csv,0.00912407,0.435071,0.555805,13295,1114.66,23.0197,868,2026,5,0
495,grains_EGRIP1933_1_20.txt.csv,0.0140032,0.42312,0.5628770000000001,13315,1063.15,28.7802,997,1933,1,0
496,grains_EGRIP2535_2_20.txt.csv,0.015440100000000003,0.308247,0.676313,2948,1394.34,55.5863,3189,2535,2,0
497,grains_EGRIP2056_1_20.txt.csv,0.0106082,0.371253,0.618139,12458,1130.8000000000004,47.5964,1131,2056,1,0
498,grains_EGRIP2936_2_20.txt.csv,0.013622,0.377127,0.609251,3000,1614.89,46.1453,3252,2936,2,307
499,grains_EGRIP2786_5_20.txt.csv,0.00961942,0.280219,0.710162,3868,1532.66,61.6223,2803,2786,5,295
500,grains_EGRIP2221_1_volume_vertical_20.txt.csv,0.0106116,0.36535,0.624039,7419,1221.5500000000004,47.7642,1578,2221,1,0
501,grains_EGRIP2876_2_20.txt.csv,0.0113897,0.30140300000000003,0.687208,4469,1581.89,57.2207,2615,2876,2,279
502,grains_EGRIP3086_2_20.txt.csv,0.0104572,0.281491,0.708051,3094,1697.39,60.5807,3585,3086,2,247
503,grains_EGRIP2475_2_20.txt.csv,0.005998699999999999,0.468525,0.525476,7532,1361.34,32.4876,1220,2475,2,0
504,grains_EGRIP2416_3_20.txt.csv,0.0112541,0.396161,0.592585,6107,1328.9800000000002,42.7421,1895,2416,3,0
505,grains_EGRIP956_3_20.txt.csv,0.0287866,0.312673,0.65854,24217,525.98,54.6086,539,956,3,0
