,Grain No.,Size [Pixel],center x-coordinate,center y-coordinate,mean azimuth [degree],mean latitude [degree],mean colatitude [degree],Regelungsgrad [%]
0,1,50261,268,281,248.478,64.9013,25.0987,99.9377
1,2,367490,680,450,256.96,67.5499,22.4501,82.7657
2,3,10810,551,207,256.577,13.4449,76.5551,99.9561
3,4,2850,2304,187,61.5049,14.7117,75.2883,99.8859
4,5,18835,2460,249,278.83,60.3728,29.6271,99.9799
5,6,53010,1201,328,65.2308,34.6674,55.3326,99.9876
6,7,42894,1489,298,70.2108,6.12701,83.87299999999998,99.9191
7,8,950,1361,188,63.6853,14.0488,75.9512,99.9142
8,9,27600,3158,337,252.788,23.6675,66.3325,99.9365
9,10,2127,3272,219,260.74,20.3541,69.6459,99.944
10,11,668,3367,200,65.5482,13.5586,76.4414,99.8965
11,12,725,3243,197,251.322,24.9023,65.0977,99.9708
12,13,1044,3135,202,274.925,1.43555,88.5645,99.5178
13,14,597,3309,204,258.557,20.0587,69.9413,99.9491
14,15,1109,2725,206,241.099,17.0986,72.9014,99.9426
15,16,1180,3096,209,264.683,36.4943,53.5057,99.4981
16,17,616,3210,200,246.489,26.6254,63.3746,99.9315
17,18,55239,1716,321,64.6865,33.389,56.611,99.9745
18,19,40683,2045,245,63.3014,14.2603,75.7397,99.9076
19,20,45418,3006,392,287.816,72.5005,17.4995,73.3791
20,21,763,3476,206,151.149,27.9477,62.0523,99.2215
21,22,27962,2793,272,48.2276,22.2346,67.7654,99.9165
22,23,19704,2308,305,59.3304,13.5146,76.4854,99.5925
23,24,21555,3378,302,73.4573,33.103,56.897,99.9284
24,25,3269,475,267,264.23400000000004,42.0653,47.9347,75.6963
25,26,593,3235,241,330.142,84.4586,5.54143,99.9931
26,27,7233,1368,309,247.755,23.6684,66.3316,99.9874
27,28,510,3220,277,108.071,72.1469,17.8531,99.9981
28,29,9548,1892,327,253.807,23.1295,66.8705,99.9965
29,30,590,3487,281,40.8013,34.6094,55.3906,99.6763
30,31,58979,2773,422,73.2251,53.8393,36.1607,99.9106
31,32,131250,2633,570,244.561,8.23407,81.7659,64.3877
32,33,9761,2147,327,248.46,28.149,61.851000000000006,99.9532
33,34,5634,2950,373,56.0114,51.2083,38.7917,99.9636
34,35,701,3485,328,40.6358,38.4043,51.5957,99.7235
35,36,2250,3293,359,268.725,23.6798,66.3202,99.9536
36,37,784,2358,338,318.63,71.5522,18.4478,99.9869
37,38,8707,2006,373,99.3917,74.9442,15.0558,99.9495
38,39,5922,133,402,249.907,15.3284,74.6716,99.9295
39,40,5617,1316,383,62.2736,48.8969,41.1031,99.9955
40,41,20878,2201,418,107.999,72.7612,17.2388,99.9878
41,42,1483,3220,368,90.3129,78.3848,11.6152,99.99
42,43,502,3473,367,114.064,25.7625,64.2375,99.9475
43,44,1843,184,380,221.418,72.9079,17.0921,99.9946
44,45,2598,3344,399,276.921,23.9437,66.0563,99.9839
45,46,129556,1200,607,212.605,76.6401,13.3599,99.8974
46,47,23124,3243,488,95.852,77.8509,12.1491,99.9562
47,48,4187,2415,431,336.676,77.9099,12.0901,99.9878
48,49,510,1879,394,60.5599,14.1992,75.8008,99.9972
49,50,41988,1920,538,249.893,19.1703,70.8297,81.2997
50,51,839,301,404,68.9873,31.7355,58.2645,99.9847
51,52,8191,1587,441,69.7325,28.9216,61.0784,99.9926
52,53,2689,3190,428,266.309,24.1605,65.8395,99.9947
53,54,1020,3439,420,92.8582,79.1715,10.8285,99.9285
54,55,3762,2060,439,59.2515,51.9403,38.0597,99.9968
55,56,3907,1947,454,59.8036,10.0848,79.9152,99.9929
56,57,24378,2363,508,60.9069,22.3987,67.6013,87.4261
57,58,685,3054,439,54.4552,53.3771,36.6229,99.9638
58,59,500,3423,448,271.62,14.8337,75.1663,99.9898
59,60,2909,2149,471,249.58900000000003,17.8015,72.1985,99.9916
60,61,1694,1658,470,59.5709,20.2126,69.7874,99.9959
61,62,45230,1588,553,40.7588,73.0429,16.9571,67.5546
62,63,4923,3333,537,271.573,15.3082,74.6918,99.9409
63,64,715,3096,472,101.741,77.0817,12.9183,99.9903
64,65,17072,172,549,248.11900000000003,58.1218,31.8782,99.9402
65,66,61267,2186,633,229.908,3.32133,86.6787,98.8783
66,67,1092,3436,522,270.3,14.4464,75.5536,99.9271
67,68,933,1831,498,60.0657,20.0981,69.9019,99.9917
68,69,2822,3100,520,251.988,20.8874,69.1126,99.992
69,70,13967,3162,598,25.5678,74.1427,15.8573,99.9641
70,71,576,2936,560,14.3564,75.9945,14.0055,99.9962
71,72,18815,1697,629,61.5203,18.4842,71.5158,99.959
72,73,35156,3002,806,61.8181,11.1754,78.8246,81.9454
73,74,4897,2381,610,254.963,20.6672,69.3328,99.9492
74,75,57939,1464,755,62.8198,16.3113,73.6887,99.5008
75,76,591143,863,1419,240.08900000000003,68.7481,21.2519,50.0124
76,77,1682,1799,617,249.538,45.2697,44.7303,99.9906
77,78,7764,225,652,228.65,54.0918,35.9082,99.915
78,79,12700,3312,676,19.6027,77.1711,12.8289,99.8764
79,80,8527,3220,675,251.811,34.2877,55.7123,99.7175
80,81,44592,1972,804,233.804,45.7885,44.2115,87.8652
81,82,2761,2923,637,56.5172,29.8929,60.1071,99.9947
82,83,21626,3092,731,247.849,14.5018,75.4982,99.9567
83,84,915,610,657,54.9697,2.05558,87.9444,99.9968
84,85,8847,177,698,56.8585,21.3508,68.6492,99.984
85,86,15900,1810,711,225.195,63.1253,26.8747,99.9549
86,87,7497,335,686,78.5969,54.8965,35.1035,99.9723
87,88,5053,1646,729,255.222,59.5706,30.4294,99.9796
88,89,36830,2321,854,260.451,70.6871,19.3129,99.8468
89,90,588,644,715,234.86900000000003,0.146484,89.8535,99.9857
90,91,19259,423,779,62.8096,13.5328,76.4672,99.9641
91,92,3158,2672,752,51.3878,75.006,14.994000000000002,99.9947
92,93,10027,140,791,225.774,9.73094,80.2691,99.9619
93,94,26406,2132,792,57.559,53.2602,36.7398,99.896
94,95,13129,2566,782,45.2805,13.5323,76.4677,99.9837
95,96,7140,1315,769,238.937,35.802,54.198,99.985
96,97,3656,2728,757,245.397,69.1877,20.8123,99.998
97,98,64877,289,919,211.229,51.3056,38.6944,58.1069
98,99,4179,2887,783,57.2765,28.6701,61.3299,99.9838
99,100,20883,3275,808,32.9969,68.5117,21.4883,99.9909
100,101,42680,1754,869,252.225,6.12668,83.8733,100.008
101,102,24849,2829,855,241.462,70.0056,19.9944,99.9921
102,103,4620,3144,820,59.798,28.4608,61.5392,99.8421
103,104,3023,2292,785,344.745,62.5975,27.4025,99.9985
104,105,42209,2479,905,251.079,40.7235,49.2765,99.9678
105,106,6268,1625,837,25.8266,56.9589,33.0411,99.9947
106,107,11884,2665,850,59.5981,17.1421,72.8579,99.9585
107,108,13059,682,898,264.393,32.9942,57.0058,99.9575
108,109,1092,1879,819,59.1692,57.4164,32.5836,99.9971
109,110,910450,2944,1674,244.701,21.9618,68.0382,65.352
110,111,10071,1288,864,245.136,0.784149,89.2159,99.9806
111,112,175663,1267,1119,240.781,23.2375,66.7625,93.2164
112,113,1685,1576,862,244.829,27.4052,62.5948,99.9911
113,114,2771,432,880,245.452,17.7191,72.2809,99.9923
114,115,31417,2194,1001,336.292,63.0459,26.9541,99.8778
115,116,882,598,896,251.142,6.08286,83.9171,99.963
116,117,2215,2596,899,251.646,36.8517,53.1483,99.9799
117,118,5402,148,920,231.508,26.8604,63.1396,99.9777
118,119,1350,911,892,238.348,3.18333,86.8167,99.9935
119,120,1847,1412,909,253.442,8.08253,81.9175,99.9935
120,121,63859,1568,1054,298.663,57.5043,32.4957,99.8826
121,122,19702,2696,965,25.2773,88.1846,1.81537,100.01
122,123,22290,524,982,251.771,6.630330000000002,83.3697,99.9301
123,124,42390,1956,1093,56.9986,41.2288,48.7712,66.6664
124,125,685,322,932,259.801,29.0039,60.9961,99.9818
125,126,1992,681,973,78.2607,55.6272,34.3728,99.996
126,127,7979,2852,988,240.93400000000003,41.5102,48.4898,99.9827
127,128,6652,134,1018,36.4926,67.535,22.465,99.9348
128,129,6410,1808,1033,228.705,64.3728,25.6272,99.937
129,130,3187,2055,979,59.7041,20.2952,69.7048,99.9758
130,131,524,2283,971,55.5094,45.9496,44.0504,99.9745
131,132,6537,2347,1039,53.8812,45.3115,44.6885,99.9772
132,133,18511,1766,1111,243.454,0.915344,89.0847,99.981
133,134,29328,474,1126,248.68400000000003,41.5111,48.4889,99.9043
134,135,5780,2045,1043,256.747,32.4522,57.5478,99.9745
135,136,5602,190,1084,253.269,25.9357,64.0643,99.8879
136,137,11278,2720,1144,61.7786,15.4058,74.5942,99.737
137,138,1725,1885,1084,244.57,1.23881,88.7612,99.9959
138,139,19965,2120,1149,245.055,45.1566,44.8434,99.966
139,140,1944,121,1105,64.1467,8.97077,81.0292,99.9679
140,141,892,2284,1108,246.306,37.5242,52.4758,99.992
141,142,28842,2318,1205,219.662,73.0815,16.9185,99.9404
142,143,15473,174,1168,235.618,12.6,77.4,99.8683
143,144,61336,488,1324,244.158,24.0424,65.9576,80.123
144,145,6550,1903,1141,51.7866,48.4598,41.5402,99.9965
145,146,3586,1055,1134,263.707,20.2818,69.7182,99.9458
146,147,659,3432,1169,259.103,38.2419,51.7581,99.9589
147,148,525,1276,1145,257.577,53.1277,36.8723,99.9887
148,149,518,2003,1166,67.1123,4.8688400000000005,85.1312,99.9746
149,150,7194,1028,1227,264.657,10.7882,79.2118,99.9356
150,151,6870,261,1203,55.3677,8.70588,81.2941,99.968
151,152,178426,1590,1450,246.285,52.43,37.57,86.5889
152,153,6108,608,1220,224.156,82.3965,7.60349,99.9911
153,154,25321,2190,1289,236.046,27.8806,62.1194,99.988
154,155,8659,1887,1235,202.515,83.01100000000002,6.98901,99.9953
155,156,878,2555,1213,264.941,60.7641,29.2359,99.9821
156,157,3782,2072,1253,69.7946,9.42445,80.5756,99.9728
157,158,25104,170,1342,226.353,38.7707,51.2293,99.8988
158,159,47962,256,1446,54.9488,40.4818,49.5182,99.9181
159,160,700,2548,1242,198.324,85.8341,4.16591,99.9917
160,161,19146,3272,1328,251.397,5.26517,84.7348,99.9446
161,162,855,436,1266,249.493,9.713,80.28699999999998,99.9982
162,163,12285,609,1302,84.5549,59.2279,30.7721,99.9789
163,164,13512,1907,1346,250.857,75.5445,14.4555,99.9936
164,165,3490,1343,1313,259.208,50.4389,39.5611,99.9013
165,166,2655,2062,1321,251.342,75.4057,14.5943,99.9968
166,167,1058,1200,1325,300.501,88.2961,1.70387,99.9968
167,168,11466,1816,1408,75.6145,14.0274,75.9726,99.8699
168,169,8198,2044,1371,220.801,70.1904,19.8096,99.9642
169,170,252777,2139,1614,252.609,45.1521,44.8479,99.2269
170,171,518,1119,1381,264.5,17.3975,72.6025,99.9652
171,172,500,1090,1383,38.1501,87.51299999999998,2.48703,99.9937
172,173,1890,2497,1433,256.809,46.5409,43.4591,99.6922
173,174,92276,2473,1796,62.3224,15.7495,74.2505,99.7089
174,175,1225,1051,1419,62.5849,15.5115,74.4885,99.9874
175,176,27085,3322,1529,64.8444,33.0755,56.9245,99.9785
176,177,5496,516,1467,76.2612,59.7326,30.2674,99.9942
177,178,936,447,1461,262.839,81.6693,8.33072,99.9948
178,179,153488,412,1716,241.76,17.3039,72.6961,91.8098
179,180,698,427,1479,80.5106,75.3,14.7,99.9952
180,181,8612,112,1557,231.591,64.1383,25.8617,99.881
181,182,1691,3434,1526,68.2647,33.8689,56.1311,99.8549
182,183,8105,542,1552,86.7954,76.1872,13.8128,99.975
183,184,19987,2894,1602,70.2191,16.9382,73.0618,99.9806
184,185,4847,1357,1554,67.0242,5.81216,84.1878,99.9902
185,186,1333,3415,1605,67.5688,32.8279,57.1721,99.886
186,187,8653,3211,1645,70.2358,50.226000000000006,39.774,99.9825
187,188,22684,2667,1668,252.509,26.561,63.43899999999999,99.9985
188,189,550,932,1612,66.861,39.4716,50.5284,99.9959
189,190,20408,1309,1761,75.4861,18.959,71.041,99.9117
190,191,51773,1522,1786,256.53,69.7241,20.2759,99.9021
191,192,4742,925,1665,197.206,84.3767,5.62333,99.9949
192,193,3383,1191,1694,82.6838,60.5255,29.4745,99.9677
193,194,30483,1778,1765,49.9967,37.9642,52.0358,99.8746
194,195,9065,1678,1715,61.1217,29.723000000000006,60.277,99.9868
195,196,11520,862,1703,65.2123,38.1576,51.8424,99.9923
196,197,17929,127,1770,64.2889,34.744,55.256,99.9303
197,198,2144,1230,1702,59.3907,70.5992,19.4008,99.9955
198,199,27863,3255,1758,66.0603,25.2568,64.7432,99.9783
199,200,6602,1589,1732,60.7365,37.4743,52.5257,99.9487
200,201,23850,2613,1801,69.6328,4.80238,85.1976,99.9936
201,202,14126,3290,1928,249.03,30.0815,59.9185,99.9189
202,203,20300,1250,1864,66.9625,17.94,72.06,97.6279
203,204,1275,3119,1763,77.9971,72.5898,17.4102,99.9959
204,205,148918,1977,2046,59.5363,29.1791,60.8209,77.018
205,206,120697,1584,2119,64.3422,40.0269,49.9731,99.9898
206,207,7585,2737,1839,73.7303,36.0609,53.9391,99.9846
207,208,21687,2314,1877,68.4748,8.417019999999999,81.583,99.9695
208,209,1267,165,1828,246.145,49.3801,40.6199,99.9969
209,210,557041,1029,2506,61.7277,4.969130000000002,85.0309,72.553
210,211,509,3343,1853,252.569,30.2132,59.7868,99.9702
211,212,997,171,1863,51.3847,10.9556,79.0444,99.9819
212,213,4539,1420,1910,251.349,72.3542,17.6458,99.9842
213,214,6384,3398,1943,252.063,30.4176,59.5824,99.9128
214,215,94926,246,2026,58.323,1.09895,88.90100000000002,70.5044
215,216,4610,1349,1901,62.7366,17.8731,72.1269,99.9768
216,217,722,2622,1885,217.249,69.16,20.84,99.9846
217,218,1994,1749,1943,65.3821,17.9525,72.0475,99.9561
218,219,842,2214,1934,64.3429,15.9146,74.0854,99.9929
219,220,2012,724,1965,239.902,15.1662,74.8338,99.9487
220,221,8790,1367,2020,242.19,21.9123,68.0877,99.8481
221,222,4296,1741,2029,62.2344,32.9369,57.0631,99.9749
222,223,606549,2368,2870,236.278,1.91163,88.0884,55.466
223,224,3885,3401,2098,73.3663,1.35093,88.6491,99.8923
224,225,5859,789,2086,47.5432,59.994,30.006,99.9875
225,226,5881,2081,2095,209.878,72.7031,17.2969,99.9919
226,227,39027,1374,2205,233.953,37.3769,52.6231,99.9465
227,228,3534,2582,2117,244.112,8.82894,81.1711,99.9059
228,229,566,720,2078,54.5368,77.696,12.304,99.9968
229,230,4697,2765,2125,207.774,70.8414,19.1586,99.9947
230,231,3220,2535,2113,62.4291,1.60822,88.3918,99.9825
231,232,711,1731,2104,61.6159,0.248138,89.7519,99.9919
232,233,138168,432,2448,233.83,8.94873,81.0513,82.2096
233,234,673,552,2110,244.712,69.8158,20.1842,99.9886
234,235,21751,2672,2188,66.6181,20.7898,69.2102,99.8281
235,236,5971,1677,2138,59.0166,26.6578,63.3422,99.9972
236,237,23052,1780,2250,43.8884,37.7082,52.2918,99.9417
237,238,6522,799,2152,241.17,14.4587,75.5413,99.9871
238,239,1155,1298,2144,233.695,15.5804,74.4196,99.9978
239,240,630,571,2159,244.29,5.07172,84.9283,99.9944
240,241,25898,701,2267,269.35400000000004,63.6419,26.3581,99.9696
241,242,1148,1137,2170,238.899,4.18909,85.8109,99.9947
242,243,6452,606,2216,259.439,86.7145,3.28551,99.9937
243,244,1202,2034,2194,243.703,10.5235,79.4765,99.9784
244,245,18703,218,2268,147.513,82.3892,7.61084,99.9568
245,246,2449,2001,2234,37.6256,54.3312,35.6688,99.9874
246,247,645,2073,2210,243.741,10.1514,79.8486,99.994
247,248,4112,2757,2277,40.9605,50.5047,39.4953,99.9967
248,249,4197,3397,2297,250.223,50.718,39.282,99.9316
249,250,16566,144,2350,236.33900000000003,25.8437,64.1563,99.9577
250,251,22818,3293,2394,247.126,51.5179,38.4821,99.9817
251,252,56240,1531,2437,56.3135,83.885,6.11496,95.2894
252,253,26814,3084,2331,64.7575,0.8114399999999999,89.1886,99.9897
253,254,18893,344,2334,238.026,18.984,71.016,99.9882
254,255,86145,2094,2436,89.0313,76.7887,13.2113,99.9512
255,256,1019,1503,2297,240.381,72.5374,17.4626,99.9894
256,257,3361,2689,2314,226.568,23.9921,66.0079,99.9944
257,258,1981,496,2312,56.8593,40.2265,49.7735,99.9722
258,259,1041,1887,2297,38.1436,80.5267,9.4733,99.9611
259,260,3470,1882,2341,47.6404,1.06367,88.9363,99.9854
260,261,1667,2711,2356,241.052,59.1962,30.8038,99.9748
261,262,1252,1363,2362,60.4593,3.84834,86.1517,99.9869
262,263,44216,3186,2507,64.006,17.8776,72.1224,99.6671
263,264,786,557,2367,57.4585,46.3782,43.6218,99.9738
264,265,11761,1316,2420,54.3008,62.5316,27.4684,99.967
265,266,769,589,2366,237.943,18.0047,71.9953,99.9907
266,267,30402,225,2491,240.845,22.0778,67.9222,87.9352
267,268,5179,1871,2406,58.2372,21.9233,68.0767,99.9866
268,269,27941,2769,2480,213.567,63.6456,26.3544,99.8575
269,270,2705,1610,2412,51.7735,46.5748,43.4252,99.9894
270,271,1888,1803,2415,66.9958,43.9835,46.0165,99.9951
271,272,3105,101,2454,249.219,25.292,64.708,99.9121
272,273,703,1713,2449,238.561,18.9297,71.0703,99.9913
273,274,3944,1829,2467,243.127,4.69086,85.3091,99.9852
274,275,587,3025,2445,71.4849,26.5361,63.4639,99.9845
275,276,1181,3414,2488,62.3679,6.62034,83.3797,99.9257
276,277,51422,1763,2626,249.61,37.6279,52.3721,99.9078
277,278,797,3008,2484,71.3449,68.0384,21.9616,99.9815
278,279,9292,1469,2549,233.594,12.6873,77.3127,99.853
279,280,7765,1944,2583,42.4109,38.7068,51.2932,99.8468
280,281,3496,97,2587,244.535,24.3591,65.6409,99.9319
281,282,17698,2666,2625,61.1707,30.9937,59.0063,99.9768
282,283,1930,697,2566,231.242,27.4109,62.5891,99.9769
283,284,4212,641,2588,58.3989,70.362,19.638,99.9923
284,285,24235,1578,2663,244.668,10.906,79.094,99.9928
285,286,10569,2800,2648,232.635,22.5115,67.4885,99.99
286,287,4022,3305,2622,239.44,2.82659,87.1734,99.9527
287,288,3637,699,2648,55.4991,3.42431,86.5757,99.9971
288,289,3737,3388,2673,72.0943,17.6296,72.3704,99.8831
289,290,583,67,2634,236.515,19.2021,70.7979,99.9298
290,291,8532,138,2712,56.2169,36.4765,53.5235,99.9188
291,292,27952,622,2724,63.6654,18.5475,71.4525,99.977
292,293,23103,1451,2756,67.4621,18.258,71.742,98.512
293,294,1449,3325,2664,46.7469,61.069,28.931,99.9741
294,295,3144,2001,2664,56.6242,25.5032,64.4968,99.9712
295,296,2918,1959,2684,241.703,46.8728,43.1272,99.9597
296,297,3704,332,2667,238.233,22.4994,67.5006,99.9972
297,298,3489,98,2681,53.3355,23.283,66.717,99.9676
298,299,24841,227,2751,234.906,32.2588,57.7412,99.8983
299,300,34904,1848,2762,220.737,64.5616,25.4384,99.9917
300,301,2194,3258,2681,68.5543,30.0425,59.9575,99.8333
301,302,27452,2705,2746,235.564,28.9666,61.0334,99.9724
302,303,170626,2749,2970,244.892,31.1415,58.8585,84.2287
303,304,19227,2109,2775,247.738,45.2056,44.7944,99.9912
304,305,599,3328,2717,72.8126,28.0532,61.9468,99.9832
305,306,34479,813,2831,75.2938,46.2381,43.7619,99.9893
306,307,5493,1332,2752,37.1213,31.0098,58.9902,99.9846
307,308,26197,3171,2809,247.942,2.52508,87.4749,99.9956
308,309,4342,1177,2766,1.97009,77.0349,12.9651,99.9973
309,310,1407,1986,2744,67.1118,44.3863,45.6137,99.9821
310,311,5346,2289,2756,45.2686,49.6522,40.3478,99.9544
311,312,15051,1259,2813,61.4816,23.3661,66.6339,99.9938
312,313,970,83,2747,241.595,28.6331,61.3669,99.9838
313,314,50516,1614,2961,35.4486,29.5377,60.4623,99.917
314,315,55871,443,2877,239.689,23.9412,66.0588,99.8168
315,316,6877,3289,2803,63.0694,8.967210000000003,81.0328,99.991
316,317,732,881,2768,40.8006,36.9004,53.0996,99.9898
317,318,10001,2360,2809,19.9742,68.3901,21.6099,99.949
318,319,1657,2844,2777,67.2483,24.5616,65.4384,99.9967
319,320,10951,1678,2836,59.42100000000001,48.807,41.19300000000001,99.8537
320,321,2486,2232,2792,236.496,40.0048,49.9952,99.9837
321,322,15312,2020,2835,47.3563,52.1783,37.8217,99.9938
322,323,510,3382,2792,45.1863,62.416,27.584,99.9004
323,324,561,920,2806,247.898,52.13399999999999,37.866,99.9888
324,325,26269,1413,2922,68.8598,0.382988,89.617,81.7424
325,326,1032,2276,2817,238.445,36.6288,53.3712,99.9958
326,327,45631,709,2951,63.0681,45.2813,44.7187,98.0261
327,328,1759,3390,2849,265.077,56.6101,33.3899,99.9849
328,329,4689,2227,2851,230.292,24.673,65.327,99.9936
329,330,25403,138,2974,21.9388,73.4683,16.5317,99.8415
330,331,1907,1904,2856,48.6462,48.5934,41.4066,99.9828
331,332,5937,3307,2933,263.732,56.3127,33.6873,99.9909
332,333,5075,243,2864,54.0871,25.4823,64.5177,99.9894
333,334,7325,3251,2922,239.833,54.0744,35.9256,99.9868
334,335,15479,1741,2948,217.239,60.098,29.902,99.9526
335,336,599,1861,2876,69.8104,24.4565,65.5435,99.979
336,337,53958,2067,3035,245.185,27.2262,62.7738,99.9463
337,338,88283,3072,3091,256.624,43.7235,46.2765,97.2462
338,339,3441,1917,2900,58.5464,48.4859,41.5141,99.9952
339,340,2509,1993,2908,214.673,60.7616,29.2385,99.9715
340,341,2042,2085,2902,54.0136,43.0879,46.9121,99.9965
341,342,795,2432,2897,62.2705,28.5968,61.4032,99.9926
342,343,1647,262,2907,59.1961,49.9583,40.0417,99.9625
343,344,3008,1837,2914,57.6525,42.5124,47.4876,99.9962
344,345,37363,1303,3006,242.859,45.3974,44.6026,90.2072
345,346,5421,289,2955,32.1181,70.0368,19.9632,99.9846
346,347,8055,1890,2972,234.572,19.5422,70.4578,99.8902
347,348,1093,1951,2951,210.88,64.2118,25.7882,99.9368
348,349,3880,2011,2967,234.275,16.5765,73.4235,99.9854
349,350,1391,196,2965,247.391,24.4692,65.5308,99.978
350,351,17605,549,3039,242.28,36.8661,53.1339,99.7469
351,352,767,229,2979,60.6516,48.9375,41.0625,99.9847
352,353,52865,232,3139,245.71400000000003,30.6913,59.3087,99.9641
353,354,601,3397,3016,264.976,56.7016,33.2984,99.9756
354,355,182874,494,3389,62.7302,35.1204,54.8796,97.3927
355,356,21101,1828,3102,194.71400000000003,77.4394,12.5606,99.9905
356,357,7917,803,3073,246.348,54.2759,35.7241,99.9769
357,358,11323,1188,3093,236.775,46.9431,43.0569,99.9673
358,359,5521,1527,3074,58.3575,51.0074,38.9926,99.9959
359,360,1565,3302,3058,46.9151,59.3436,30.6564,99.9825
360,361,19943,660,3146,68.3841,41.7703,48.2297,99.9559
361,362,2181,392,3083,237.265,39.31,50.69,99.9942
362,363,4007,2677,3106,51.2121,46.8961,43.1039,99.9639
363,364,12304,3250,3129,242.825,13.1654,76.8346,99.9811
364,365,367246,1596,3555,61.3584,2.27262,87.7274,91.9189
365,366,19419,1103,3192,62.6013,15.9638,74.0362,99.9824
366,367,9082,330,3194,64.2995,45.8782,44.1218,99.9066
367,368,1743,77,3140,249.897,21.0071,68.9929,99.9134
368,369,2625,783,3137,70.7007,1.33538,88.6646,99.9914
369,370,252034,1069,3484,263.945,35.6147,54.3853,97.8479
370,371,4537,3119,3159,230.579,64.5008,25.4992,99.992
371,372,92002,2102,3299,55.1567,5.1971,84.8029,67.3839
372,373,2455,834,3182,42.8724,45.7491,44.2509,99.9929
373,374,11105,755,3214,248.56,52.9089,37.0911,99.9927
374,375,33120,3192,3263,75.7064,3.27713,86.7229,99.9686
375,376,4168,884,3219,70.7034,40.6846,49.3154,99.9971
376,377,8010,1765,3254,256.214,4.78022,85.2198,99.9926
377,378,1884,2379,3209,237.104,5.93214,84.0679,99.9774
378,379,2262,3302,3227,58.3429,83.3453,6.654730000000002,99.9875
379,380,1489,57,3233,250.0,21.3081,68.6919,99.9488
380,381,5075,2387,3264,59.0611,13.9539,76.0461,99.9977
381,382,8792,852,3281,229.208,24.0457,65.9543,99.9749
382,383,1269,2927,3264,50.4884,62.0075,27.9925,99.9895
383,384,5203,1823,3303,35.5477,43.727,46.273,99.9965
384,385,10110,2816,3296,278.802,48.7246,41.2754,99.9894
385,386,2392,205,3292,69.4916,42.7852,47.2148,99.9892
386,387,2832,753,3301,249.458,1.29653,88.7035,99.9925
387,388,537,1889,3280,240.004,73.9589,16.0411,99.9935
388,389,5349,1091,3320,60.5756,55.0132,34.9868,99.9996
389,390,1726,342,3306,249.361,49.2194,40.7806,99.9954
390,391,835,304,3309,236.85,43.5246,46.4754,99.9964
391,392,2568,3351,3329,82.5476,16.6876,73.3124,99.9696
392,393,5069,255,3341,56.1591,40.6515,49.3485,99.9927
393,394,1079,136,3317,49.9562,82.4686,7.53142,99.9927
394,395,2868,2950,3345,54.8064,60.0731,29.9269,99.54
395,396,2327,183,3335,233.659,6.90415,83.0958,99.999
396,397,1294,2834,3338,233.205,1.47654,88.5235,99.9666
397,398,11620,809,3373,248.71400000000003,42.3895,47.6105,99.9837
398,399,1549,2899,3345,48.0973,11.6829,78.3171,99.995
399,400,1934,2761,3347,292.518,58.9266,31.0734,99.998
400,401,333001,3008,3658,247.332,43.806,46.194,99.8869
401,402,552,128,3355,24.5713,80.2522,9.74781,99.9642
402,403,2400,304,3366,59.518,49.0784,40.9216,99.991
403,404,11309,2773,3418,63.654,15.9848,74.0152,99.9947
404,405,8347,181,3419,238.327,43.5378,46.4622,99.9633
405,406,13876,2566,3532,315.5370000000001,87.4049,2.5951,99.9174
406,407,5105,2633,3454,247.318,4.29156,85.7084,99.9928
407,408,626,2712,3463,54.7459,8.719560000000001,81.2804,99.9955
408,409,3419,1872,3485,59.2534,2.67491,87.3251,99.9826
409,410,4326,716,3508,342.6430000000001,81.4296,8.57041,99.9222
410,411,65648,1966,3693,75.4101,13.1072,76.8928,99.9828
411,412,7033,148,3636,116.332,86.9387,3.06129,99.9399
412,413,150502,395,3755,240.804,19.8739,70.1261,92.1132
413,414,4700,2662,3583,320.394,77.5057,12.4943,99.9927
414,415,8303,2104,3627,54.8666,12.9626,77.0374,99.9875
415,416,8855,2657,3639,57.9144,6.56657,83.4334,99.9586
416,417,754,2591,3595,248.835,1.09527,88.9047,99.9945
417,418,1788,3374,3636,257.867,4.95708,85.0429,99.9357
418,419,29012,2463,3681,232.67,29.9878,60.0122,99.9564
419,420,10307,671,3674,329.189,83.2111,6.788880000000002,99.9555
420,421,14503,1181,3681,65.5798,20.2434,69.7566,99.9715
421,422,4150,1390,3665,250.665,44.2929,45.7071,99.9835
422,423,2768,2355,3655,54.4132,11.9303,78.0697,99.9857
423,424,1911,2243,3663,55.5563,11.8698,78.1302,99.9969
424,425,1486,1072,3679,50.7281,0.314316,89.6857,99.9901
425,426,3441,2175,3690,306.209,62.9116,27.0884,99.9965
426,427,17435,2271,3776,221.914,76.0438,13.9562,99.8857
427,428,35254,3286,3941,257.466,8.43175,81.5683,87.0751
428,429,7876,2178,3746,236.199,21.9272,68.0728,99.8752
429,430,8296,1384,3779,52.7919,44.7813,45.2187,99.9156
430,431,520732,1202,4146,63.146,33.1609,56.8391,69.7684
431,432,5238,2527,3742,242.936,0.168846,89.8312,99.9866
432,433,4194,741,3736,54.3514,21.9791,68.0209,99.9964
433,434,655,3355,3742,258.742,5.64446,84.3555,99.9651
434,435,6990,2564,3794,233.158,30.1178,59.8822,99.9981
435,436,377061,2327,4121,239.304,23.48,66.52,93.5206
436,437,4788,1682,3809,55.1543,32.7415,57.2585,99.9932
437,438,1724,108,3784,63.8519,0.07226560000000001,89.9277,99.9893
438,439,914,1225,3778,267.463,36.0686,53.9314,99.9973
439,440,2264,3366,3835,259.191,5.52993,84.4701,99.9364
440,441,1202,2332,3797,244.544,28.8576,61.1424,99.9842
441,442,13621,3089,3874,53.9395,0.219086,89.7809,99.9897
442,443,2421,1289,3821,231.427,39.1927,50.8073,99.9836
443,444,17037,2657,3862,55.1243,6.04542,83.9546,99.955
444,445,580,93,3837,78.2458,70.85,19.15,99.8863
445,446,677,1308,3854,48.7432,40.0106,49.9894,99.9953
446,447,1645,1348,3869,62.0248,3.74259,86.2574,99.9849
447,448,6750,119,3890,17.6159,84.0691,5.93088,99.8548
448,449,1257,2185,3861,239.67,31.6275,58.3725,99.8541
449,450,942,3008,3890,262.842,65.7985,24.2015,99.9682
450,451,2791,2117,3915,237.181,74.1365,15.8635,99.9913
451,452,70039,1636,4065,71.7749,16.7324,73.2676,98.396
452,453,45024,286,3988,41.3535,55.1745,34.8255,81.5198
453,454,42638,1884,4134,76.3297,75.6626,14.3374,99.9968
454,455,38493,2762,4098,252.396,16.6322,73.3678,99.781
455,456,1371,92,3991,70.1208,36.4839,53.5161,99.825
456,457,82048,3005,4143,72.5482,13.5673,76.4327,99.0064
457,458,39399,585,4096,50.4556,19.5499,70.4501,99.7016
458,459,862,3162,4019,264.001,67.6479,22.3521,99.9857
459,460,1457,3192,4031,247.708,82.9498,7.05015,99.9698
460,461,8117,370,4069,186.859,83.7713,6.22869,99.9806
461,462,563,87,4049,75.8246,33.8233,56.1767,99.9865
462,463,2963,724,4053,243.025,21.8142,68.1858,99.996
463,464,21416,162,4125,59.8467,14.4126,75.5874,99.9909
464,465,980,3100,4089,218.816,18.0595,71.9405,99.9956
465,466,581,16,4098,50.7346,23.8185,66.1815,99.9512
466,467,722,2621,4099,57.9511,26.5404,63.4596,99.9939
467,468,4645,290,4159,187.55900000000003,84.2619,5.73813,99.9911
468,469,4850,3224,4152,240.799,49.2226,40.7774,99.9864
469,470,1955,3273,4152,240.299,4.00934,85.9907,99.9898
470,471,991,3335,4150,243.025,4.2079900000000015,85.792,99.9147
471,472,1695,3355,4184,243.663,47.6893,42.3107,99.9644
472,473,5676,2056,4212,249.884,15.1506,74.8494,99.9952
473,474,1314,243,4181,238.259,63.2153,26.7847,99.997
474,475,3595,665,4192,232.86,36.2856,53.7144,99.9779
475,476,1291,1627,4187,244.838,16.4834,73.5166,99.9947
476,477,1144,1583,4193,57.3914,53.4634,36.5366,99.9796
477,478,83369,2648,4422,250.129,38.0058,51.9942,83.1647
478,479,5758,167,4221,248.536,66.7653,23.2347,99.9801
479,480,33072,3218,4286,246.725,31.6929,58.3071,99.9298
480,481,1265,2005,4212,251.666,47.8228,42.1772,99.9926
481,482,685,37,4239,240.701,64.035,25.965,99.8156
482,483,120749,618,4463,237.571,29.7306,60.2694,82.2729
483,484,1912,241,4230,61.3534,23.4712,66.5288,99.9969
484,485,798,579,4239,47.6926,26.7354,63.2646,99.9803
485,486,26465,169,4380,228.362,51.0615,38.9385,99.9459
486,487,930,547,4235,47.51600000000001,26.8672,63.1328,99.9031
487,488,15112,1986,4326,257.011,47.8201,42.1799,99.9258
488,489,881,355,4248,280.319,10.5478,79.4522,99.9815
489,490,23587,1149,4313,256.461,11.3531,78.6469,99.9969
490,491,28650,2900,4377,59.7845,18.0799,71.9201,99.2274
491,492,7811,243,4297,242.79,63.5826,26.4174,99.964
492,493,2464,623,4297,224.317,66.5638,23.4362,99.9859
493,494,10248,1299,4314,249.094,11.897,78.10300000000002,99.9851
494,495,825,168,4279,226.705,50.4534,39.5466,99.9979
495,496,2959,1359,4296,257.093,31.7173,58.2827,99.9959
496,497,3449,326,4301,235.25,66.5173,23.4827,99.9648
497,498,5169,553,4312,234.899,36.4931,53.5069,99.9714
498,499,2205,2952,4302,237.098,61.899,28.101,99.9951
499,500,1052,858,4296,232.055,21.6968,68.3032,99.996
500,501,805,2057,4307,56.1991,58.1252,31.8748,99.9923
501,502,1383,3057,4311,252.605,58.0128,31.9872,99.9934
502,503,502,493,4306,220.712,68.2599,21.7401,99.9841
503,504,4999,590,4362,237.763,37.6049,52.3951,99.9882
504,505,5426,422,4362,251.603,72.5478,17.4522,99.7564
505,506,64221,2146,4502,45.4345,66.6457,23.3543,73.0118
506,507,990,487,4340,51.3782,82.8328,7.16715,99.9887
507,508,14348,1241,4411,48.56800000000001,78.5019,11.4981,99.9914
508,509,3057,352,4362,235.664,63.1937,26.8063,99.9915
509,510,2820,684,4358,67.5154,22.4299,67.5701,99.9898
510,511,10659,3035,4392,81.3892,45.04600000000001,44.95399999999999,99.9734
511,512,1331,313,4352,250.266,70.5921,19.4079,99.993
512,513,16612,1911,4449,264.895,45.9076,44.0924,99.9571
513,514,573,39,4383,226.808,50.6257,39.3743,99.9385
514,515,4110,2856,4390,245.676,52.1668,37.8332,99.9934
515,516,5027,1099,4412,243.752,49.203,40.797,99.9825
516,517,1623,3169,4401,249.168,31.9959,58.0041,99.9608
517,518,898,480,4382,241.147,57.3106,32.6894,99.9885
518,519,2279,1010,4424,237.489,33.7359,56.2641,99.9911
519,520,3308,335,4435,257.29,69.5594,20.4406,99.9162
520,521,605,2819,4422,54.3772,14.6516,75.3484,99.9832
521,522,526,466,4429,57.0317,37.4851,52.5149,99.9807
522,523,3080,423,4442,76.7848,80.6514,9.34856,99.9665
523,524,3073,1037,4460,242.842,46.8279,43.1721,99.9827
524,525,10388,2806,4504,244.365,50.9761,39.0239,99.9915
525,526,931,3101,4465,85.9969,46.1016,43.8984,99.876
526,527,44546,1116,4536,66.5194,26.2756,63.7244,57.2311
527,528,778,288,4470,246.298,73.3406,16.6594,99.987
528,529,546,3053,4477,85.1421,43.9719,46.0281,99.9637
529,530,576,30,4500,58.8752,40.5892,49.4108,99.6481
530,531,16060,1808,4546,106.057,83.4955,6.50445,99.8914
531,532,1294,2992,4514,61.8212,24.5841,65.4159,99.9709
532,533,895,2877,4510,252.821,46.7329,43.2671,99.9951
533,534,5130,1328,4543,62.2372,60.0023,29.9977,99.9851
534,535,12334,234,4567,72.8595,64.601,25.399,99.9294
535,536,4643,2883,4552,252.853,46.6735,43.3265,99.8855
536,537,851,148,4538,61.9291,40.5662,49.4338,99.9716
537,538,4419,2723,4570,267.71,78.8175,11.1825,99.9619
538,539,12524,898,4621,203.39,71.6003,18.3997,25.5026
539,540,511,34,4568,60.7108,40.7467,49.2533,99.9616
540,541,11084,1398,4595,60.7179,61.3573,28.6427,99.4555
541,542,10400,2407,4618,50.8382,35.5067,54.4933,99.9147
542,543,9645,1962,4598,57.6587,26.7962,63.2038,99.9493
543,544,1210,957,4569,62.4274,7.98491,82.0151,99.9204
544,545,32979,2107,4655,248.389,11.5233,78.4767,99.9863
545,546,5572,984,4616,50.1418,5.79082,84.2092,99.9803
546,547,4197,1715,4608,50.4379,59.2449,30.7551,99.9786
547,548,7917,761,4628,61.5658,6.84589,83.1541,99.9869
548,549,3545,2725,4619,255.655,78.2898,11.7102,99.9809
549,550,1349,829,4618,74.90899999999998,22.6035,67.3965,99.9909
550,551,5805,664,4649,225.437,60.6783,29.3217,99.9399
551,552,9740,1898,4661,219.366,68.9048,21.0952,98.9275
552,553,1051,51,4637,55.5659,5.76308,84.2369,99.9647
553,554,992,2558,4630,62.0648,16.6921,73.3079,99.8365
554,555,3087,558,4636,223.454,18.55,71.45,99.9809
555,556,706,2533,4626,232.623,37.1999,52.8001,99.9962
556,557,1208,1638,4628,30.8554,61.4401,28.5599,99.7906
557,558,2990,1181,4653,93.9653,59.697,30.303,99.9805
558,559,2188,1796,4641,63.00100000000001,0.497398,89.5026,99.8801
559,560,2079,257,4635,229.495,50.9638,39.0362,99.9787
560,561,1522,1479,4658,47.0967,15.5991,74.4009,99.3379
561,562,5502,1378,4653,230.94,47.2062,42.7938,96.3041
562,563,1106,1573,4645,36.6259,6.176,83.824,99.8512
563,564,532,2642,4627,56.0743,17.1969,72.8031,99.9821
564,565,1139,2487,4639,62.8428,18.9376,71.0624,99.8392
565,566,1066,1130,4658,78.0204,77.6787,12.3213,99.9738
566,567,4132,1077,4649,60.6137,10.2488,79.7512,99.9662
567,568,2093,1534,4660,186.348,2.094,87.906,99.8768
568,569,823,2604,4645,258.665,59.8883,30.1117,99.9892
569,570,1240,1225,4659,91.1581,60.0271,29.9729,99.9322
570,571,654,2653,4653,58.3557,18.0839,71.9161,99.9284
571,572,3948,2334,4679,247.34,44.9072,45.0928,99.9928
572,573,1645,1440,4683,80.7755,0.955315,89.0447,99.6945
573,574,3537,2512,4673,57.4614,14.6914,75.3086,99.8297
574,575,548,2600,4667,265.682,60.4264,29.5736,99.9416
575,576,627,334,4669,56.3471,13.4567,76.5433,99.9696
576,577,747,1716,4675,300.4190000000001,46.6972,43.3028,99.6382
577,578,875,1618,4679,20.0067,5.12263,84.8774,99.617
578,579,1267,1590,4696,94.2724,1.33463,88.6654,99.9753
579,580,1654,1022,4689,48.6512,5.60175,84.3983,99.9278
580,581,926,805,4681,60.9557,8.45074,81.5493,99.6194
581,582,583,1414,4693,94.7811,5.61552,84.3845,99.953
582,583,4135,224,4702,228.263,48.0072,41.9928,98.5614
583,584,2364,1760,4692,207.0,80.9227,9.07735,99.3586
584,585,2667,574,4709,225.692,61.0072,28.9928,99.8378
585,586,1013,1337,4698,217.145,50.5477,39.4523,97.9584
586,587,1440,1654,4708,339.326,36.7536,53.2464,99.7624
587,588,6542,104,4745,52.5978,7.36092,82.6391,99.1942
588,589,803,330,4723,325.815,23.282,66.718,97.7373
589,590,648,1776,4721,248.99400000000003,45.4927,44.5073,99.8408
590,591,607,1696,4719,330.259,41.6199,48.3801,99.9956
591,592,769,489,4725,303.584,68.7534,21.2466,99.4203
592,593,557,1940,4761,63.41,45.4969,44.5031,99.9651
593,594,2669,2008,4801,250.01,10.907,79.093,99.969
594,595,824,2219,4804,248.562,11.4871,78.5129,99.8528
595,596,512,2155,4809,249.152,11.1087,78.8913,99.9294
