,Grain No.,Size [Pixel],center x-coordinate,center y-coordinate,mean azimuth [degree],mean latitude [degree],mean colatitude [degree],Regelungsgrad [%]
0,1,5263,372,127,135.178,31.0028,58.9972,99.6967
1,2,1776,257,126,121.989,72.671,17.329,99.9614
2,3,1868,834,127,137.379,36.9858,53.0142,99.9912
3,4,29600,446,217,316.148,0.4980770000000001,89.5019,78.1793
4,5,28650,635,240,136.403,36.0303,53.9697,99.9731
5,6,2383,727,158,297.039,65.3709,24.6291,99.9893
6,7,4547,1006,146,152.489,37.2868,52.7132,99.933
7,8,4126,1391,149,322.642,39.5897,50.4103,99.9323
8,9,34693,1183,212,315.21,24.1142,65.8858,99.9798
9,10,4093,1520,160,147.94299999999996,36.4578,53.5422,99.952
10,11,1599,262,158,125.45,71.8779,18.1221,99.9801
11,12,13272,829,187,138.275,36.4288,53.5712,99.9957
12,13,10089,1651,184,143.764,17.8191,72.1809,99.9757
13,14,6748,1810,175,169.79,71.7971,18.2028,99.9516
14,15,3039,1945,165,320.065,15.847,74.153,99.1202
15,16,24411,980,244,133.47799999999998,0.434441,89.5656,99.9661
16,17,3005,297,176,311.567,19.2948,70.7052,99.9935
17,18,37383,2016,317,313.5420000000001,20.5252,69.4748,93.6914
18,19,1381,2141,168,133.799,11.4864,78.5136,99.9704
19,20,43012,2442,285,272.17,82.6319,7.36809,96.8922
20,21,6198,2225,192,347.023,76.723,13.277,99.9367
21,22,43455,2754,290,145.968,9.31744,80.6826,97.3107
22,23,6485,1887,212,330.297,16.2971,73.7029,99.9969
23,24,10444,2673,220,284.572,77.5439,12.4561,99.9796
24,25,1940,2829,175,315.269,62.0243,27.9757,99.9862
25,26,944,2588,172,319.571,11.4131,78.5869,99.9352
26,27,913,2318,182,322.868,6.77084,83.2292,99.985
27,28,32679,2995,274,314.455,29.2889,60.7111,89.2351
28,29,2115,1353,184,150.756,63.2669,26.7331,99.9933
29,30,2372,1448,189,307.791,55.6864,34.3136,99.9932
30,31,25409,3289,276,125.97,44.0936,45.9064,99.9221
31,32,7509,3413,217,135.257,8.362860000000001,81.6371,99.7111
32,33,18718,1757,270,324.951,18.1025,71.8975,99.6744
33,34,1184,3244,194,320.591,22.4239,67.5761,99.9601
34,35,7010,2561,227,314.962,68.5922,21.4078,99.9903
35,36,3046,1514,220,138.564,64.1611,25.8389,99.7681
36,37,2869,554,234,311.632,49.0259,40.9741,99.9766
37,38,10821,1917,287,152.786,57.1064,32.8936,99.9617
38,39,4610,1427,238,304.194,24.1225,65.8775,99.998
39,40,7456,1347,257,143.454,49.6244,40.3756,99.997
40,41,28407,1565,316,164.122,71.289,18.711,99.9531
41,42,7076,735,272,323.393,17.9754,72.0246,99.9956
42,43,7632,2269,252,133.547,17.3946,72.6054,99.9817
43,44,799,778,244,159.039,59.3341,30.6659,99.9954
44,45,6010,266,298,135.904,20.0351,69.9649,99.9836
45,46,5236,2120,279,148.787,11.6684,78.3316,99.9847
46,47,16908,3449,345,173.40900000000005,66.6183,23.3817,99.9294
47,48,4896,831,283,312.7270000000001,11.116,78.884,99.9294
48,49,84398,3021,501,146.62,27.903,62.097,99.5044
49,50,825,410,268,136.033,39.3327,50.6673,99.9981
50,51,617,3157,280,152.373,18.8283,71.1717,99.6431
51,52,2503,1445,286,300.503,56.3004,33.6996,99.9914
52,53,718,2574,275,316.975,14.6736,75.3264,99.9851
53,54,2611,1254,295,302.005,25.997,64.003,99.9936
54,55,1982,341,286,113.788,84.3721,5.62786,99.9388
55,56,2257,448,297,135.287,3.01615,86.9838,99.999
56,57,7728,1081,334,136.398,17.2916,72.7084,99.9905
57,58,1166,3527,295,133.909,60.4104,29.5896,99.6314
58,59,7650,2188,340,321.835,14.5841,75.4159,99.9257
59,60,2652,2060,309,324.331,17.9374,72.0626,99.9958
60,61,520,2554,297,316.877,7.2466,82.7534,99.9495
61,62,8832,340,344,322.437,1.38219,88.6178,99.8834
62,63,5345,1389,353,312.125,43.6113,46.3887,99.9169
63,64,4681,889,326,161.963,71.7388,18.2612,99.933
64,65,3734,2821,345,174.88,72.1066,17.8934,99.9599
65,66,2728,1305,331,312.224,27.7781,62.2219,99.8223
66,67,519,2442,312,278.069,79.4708,10.5292,99.9843
67,68,2413,1640,321,145.691,56.8355,33.1645,99.9298
68,69,6124,961,367,130.95600000000002,30.4238,59.5762,99.974
69,70,1701,1789,341,140.91,34.2257,55.7743,99.9914
70,71,785,815,331,159.1,68.7949,21.2051,99.9943
71,72,4123,1165,355,139.583,13.6535,76.3465,99.997
72,73,28325,574,445,145.502,71.9007,18.0993,99.8257
73,74,4817,743,364,136.05,62.6319,27.3681,99.929
74,75,2728,1682,362,139.52100000000002,36.1699,53.8301,99.9839
75,76,4376,2105,364,323.666,29.126,60.874,99.9974
76,77,24206,1163,472,323.14,28.6631,61.3369,99.9402
77,78,1971,2362,389,265.341,79.4148,10.5852,99.99
78,79,2059,1826,358,167.213,78.8767,11.1233,99.992
79,80,2559,2270,362,313.691,3.80499,86.195,99.9986
80,81,4932,2422,385,307.988,7.0529899999999985,82.947,99.9963
81,82,11287,3255,422,317.528,2.12067,87.8793,99.5145
82,83,9416,476,386,139.624,11.5801,78.4199,99.4594
83,84,13425,830,405,324.634,22.4048,67.5952,99.9492
84,85,4686,1310,386,139.44299999999998,18.879,71.12100000000002,99.7255
85,86,1860,359,370,139.621,39.5153,50.4847,99.9918
86,87,9722,1459,410,320.699,66.86,23.14,99.9606
87,88,8314,1866,421,319.547,11.6376,78.3624,99.9615
88,89,1187,1118,380,313.816,0.477127,89.5229,99.9929
89,90,2365,2229,396,147.314,20.2876,69.7124,99.997
90,91,19941,306,495,141.0,21.7387,68.2613,99.7484
91,92,639,3391,398,134.403,0.883415,89.1166,99.968
92,93,828,1771,388,152.975,65.9451,24.0549,99.9868
93,94,16317,2798,436,320.463,21.0409,68.9591,99.9721
94,95,10582,1049,437,324.757,18.8023,71.1977,99.9893
95,96,6777,2263,435,140.971,5.2984800000000005,84.7015,96.5355
96,97,8671,3405,447,142.083,12.8314,77.1686,99.9579
97,98,2374,1539,426,324.051,61.8166,28.1834,99.9222
98,99,1722,2911,411,167.96,75.9918,14.0082,99.9876
99,100,4842,2080,442,163.35299999999995,68.1688,21.8312,99.9975
100,101,6987,3064,461,145.02200000000005,37.9728,52.0272,99.9849
101,102,26946,2091,556,318.436,7.01858,82.9814,94.3806
102,103,503,1697,423,141.812,34.2482,55.7518,99.976
103,104,14325,1740,473,139.34,7.527889999999998,82.4721,99.1856
104,105,3612,1271,445,319.96,13.3,76.7,99.9901
105,106,13381,2536,468,145.814,11.222,78.778,99.9326
106,107,3008,397,436,136.846,36.3274,53.6726,99.9865
107,108,4094,3520,453,321.394,61.8354,28.1646,99.4796
108,109,702,2625,442,203.664,83.4308,6.56922,99.968
109,110,568,918,435,177.012,76.9417,13.0583,99.9618
110,111,1387,3593,445,320.548,64.1669,25.8331,99.93
111,112,10162,712,484,315.623,3.85477,86.1452,99.9847
112,113,7114,2350,491,144.328,15.7129,74.2871,99.8312
113,114,1040,1593,447,138.866,36.0932,53.9068,99.9358
114,115,2609,2957,470,132.1,42.2666,47.7334,99.9907
115,116,6921,3312,491,139.187,48.5015,41.4985,99.9674
116,117,939,1653,444,317.562,58.2487,31.7513,99.9815
117,118,4452,2427,496,308.64,64.775,25.225,99.8173
118,119,14951,1332,515,310.797,41.8734,48.1266,99.948
119,120,2072,2905,458,141.882,23.7633,66.2367,99.9823
120,121,786,251,459,322.942,31.5879,58.4121,99.9716
121,122,1120,1426,470,147.863,83.0906,6.909439999999999,99.9757
122,123,11486,933,504,161.499,70.9856,19.0144,99.3516
123,124,2241,1608,481,310.753,40.5199,49.4801,99.9932
124,125,2057,388,490,313.772,28.5411,61.4589,99.9864
125,126,2044,813,482,142.121,24.0423,65.9577,99.9434
126,127,7786,1515,511,145.058,74.8679,15.1321,99.3111
127,128,4786,1980,517,323.096,55.9108,34.0892,99.8473
128,129,1395,2036,495,140.748,27.7396,62.2604,99.9825
129,130,13540,2231,539,320.907,28.9338,61.0662,99.9769
130,131,8851,3447,524,137.995,6.52844,83.4716,99.9656
131,132,12186,2677,562,76.6605,83.1329,6.86713,99.1361
132,133,5521,3202,526,304.775,53.6902,36.3098,99.9328
133,134,2020,2735,508,140.414,24.5444,65.4556,99.9903
134,135,6193,1906,537,137.66899999999998,11.9713,78.0287,99.9781
135,136,7992,1215,567,114.998,80.4594,9.54061,99.545
136,137,15357,475,583,136.87,20.4992,69.5008,87.2637
137,138,1472,1741,523,154.134,72.9354,17.0646,99.1089
138,139,2438,752,540,144.291,38.3806,51.6194,99.9969
139,140,21235,1804,622,315.85,7.73843,82.2616,99.7508
140,141,5199,1425,554,121.742,72.0463,17.9537,99.7554
141,142,3889,2507,544,312.275,38.6865,51.3135,99.8316
142,143,3355,807,544,160.535,74.893,15.107,99.9541
143,144,1072,1583,525,324.0370000000001,64.2113,25.7887,99.6731
144,145,6323,1613,566,324.975,41.8508,48.1492,99.9273
145,146,16012,617,593,140.289,39.4543,50.5457,99.9708
146,147,957,1034,552,321.858,8.31986,81.6801,99.7972
147,148,11741,899,599,134.137,18.2456,71.7544,99.9928
148,149,11466,2339,586,318.482,13.3734,76.6266,99.9797
149,150,16761,3358,607,316.714,6.67885,83.3212,99.9581
150,151,2367,1733,575,323.005,69.5533,20.4467,99.9749
151,152,5233,3492,597,319.2990000000001,31.8529,58.1471,99.86
152,153,1909,2458,570,138.065,25.4882,64.5118,99.9828
153,154,621,1696,566,131.111,74.8134,15.1866,99.9907
154,155,9735,2652,633,319.32,37.5584,52.4416,99.9792
155,156,10864,1015,621,315.939,0.0592422,89.9408,99.9843
156,157,4206,3224,585,80.7947,81.3154,8.6846,99.9444
157,158,15994,2192,679,141.735,19.5545,70.4455,99.6642
158,159,5059,1100,595,139.138,10.0746,79.9254,99.9954
159,160,9390,1541,629,322.259,55.4679,34.5321,99.9385
160,161,8817,1940,633,313.925,4.28228,85.7177,99.9858
161,162,2084,370,598,294.603,74.27600000000002,15.724,99.9436
162,163,9677,737,637,313.996,31.507,58.493,99.9661
163,164,5169,261,619,319.416,62.9811,27.0189,99.9805
164,165,3868,1289,609,315.173,42.8911,47.1089,99.9862
165,166,38196,2928,697,316.94,54.9355,35.0645,99.8209
166,167,2077,1346,632,82.3839,79.8562,10.1438,99.9877
167,168,18057,1410,676,316.426,15.6475,74.3525,99.9473
168,169,1286,2545,613,134.938,2.78989,87.2101,99.9147
169,170,3957,2428,634,315.967,1.20651,88.7935,99.9948
170,171,4348,817,640,314.858,18.851,71.149,99.9265
171,172,944,1621,616,140.089,67.1202,22.8798,99.9927
172,173,1035,328,622,145.49,48.9904,41.0096,99.9954
173,174,941,1674,618,111.464,68.4935,21.5065,99.9494
174,175,509,3603,629,227.745,81.3126,8.687380000000001,99.9688
175,176,2502,1863,652,133.114,67.2475,22.7525,99.9656
176,177,4117,2268,650,145.07399999999996,8.56209,81.4379,99.9934
177,178,881,3229,623,170.833,74.2653,15.7347,99.9808
178,179,34669,380,716,315.067,5.67196,84.32799999999997,94.9104
179,180,22195,2468,737,321.425,43.6066,46.3934,99.5069
180,181,37992,1234,732,125.025,49.9464,40.0536,99.9619
181,182,7543,3184,677,316.121,56.7478,33.2522,99.989
182,183,527,1702,644,322.993,70.9995,19.0005,99.9913
183,184,1917,686,652,209.515,86.4225,3.57747,99.9843
184,185,1345,1645,648,101.285,66.5358,23.4642,99.9845
185,186,30672,2603,759,351.411,82.4086,7.5914,99.9384
186,187,2676,321,660,137.458,18.0566,71.9434,99.9946
187,188,3051,2364,662,141.761,12.6587,77.3413,99.9692
188,189,1164,3445,661,323.348,30.6015,59.3985,99.9871
189,190,3602,3512,696,314.7940000000001,16.4706,73.5294,99.9592
190,191,2634,3262,671,318.467,26.7132,63.2868,99.9971
191,192,2196,3586,679,314.099,16.3618,73.6382,99.9693
192,193,789,3125,671,139.792,42.1875,47.8125,99.9728
193,194,21710,2738,787,319.97,2.00936,87.9906,99.781
194,195,11415,1724,740,311.668,0.296265,89.7037,99.6906
195,196,6625,1969,734,136.69799999999998,8.49496,81.505,71.3202
196,197,20392,879,734,315.868,62.7497,27.2503,99.9922
197,198,14978,1070,747,136.29399999999998,0.871864,89.1281,99.8813
198,199,1929,2102,686,312.46,56.1431,33.8569,99.9969
199,200,1430,966,696,313.133,52.4281,37.5719,99.9636
200,201,4859,1617,700,211.485,74.7595,15.2405,99.9555
201,202,9561,3421,725,103.844,74.8597,15.1403,99.931
202,203,8095,589,722,150.71200000000005,58.5134,31.4866,99.9521
203,204,22152,723,790,319.496,14.2087,75.7913,97.9167
204,205,745,636,683,134.865,29.3257,60.6743,99.9976
205,206,2097,1012,694,315.4890000000001,60.4162,29.5838,99.968
206,207,2248,2304,710,122.939,66.6972,23.3028,99.9877
207,208,526,1521,702,132.879,18.1057,71.8943,99.8755
208,209,11598,3251,747,152.082,69.8608,20.1392,99.8688
209,210,924,672,703,139.342,23.1654,66.8346,99.9944
210,211,2607,2357,713,137.781,21.423,68.577,99.992
211,212,34126,1998,841,137.299,10.4315,79.5685,50.4835
212,213,4844,1900,733,324.293,83.9409,6.0591,99.9845
213,214,3799,2143,770,326.726,33.7408,56.2592,99.8891
214,215,1827,3357,745,160.214,73.5266,16.4734,99.9942
215,216,1616,1633,744,320.131,25.3035,64.6965,99.9978
216,217,5112,1529,775,144.73,74.4343,15.5657,99.99
217,218,1238,3594,758,325.573,14.8202,75.1798,99.952
218,219,3533,1606,780,212.886,71.7689,18.2311,99.9623
219,220,744,544,759,134.217,18.6135,71.3865,99.9782
220,221,6650,2283,781,320.643,36.7224,53.2776,99.9777
221,222,4243,3039,791,138.213,36.5044,53.4956,99.9807
222,223,6444,3121,799,309.204,19.1325,70.8675,99.9449
223,224,924,365,779,332.5540000000001,44.0737,45.9263,99.8405
224,225,16548,1457,838,311.269,3.55617,86.4438,62.8286
225,226,11270,3478,827,328.165,19.0923,70.9077,99.9508
226,227,1270,1351,779,138.495,13.6228,76.3772,99.9731
227,228,20133,1728,831,131.121,15.7612,74.2388,99.9621
228,229,15536,310,873,317.782,63.6885,26.3115,99.9874
229,230,5653,1868,848,311.34,65.8815,24.1185,99.9334
230,231,9397,3344,816,144.438,44.5303,45.4697,99.9925
231,232,9951,2174,868,138.171,16.9171,73.0829,99.9367
232,233,563,1105,791,138.6,21.0974,68.9026,97.7665
233,234,10685,576,830,258.309,76.52199999999998,13.478,99.9862
234,235,14413,446,841,317.832,38.509,51.49100000000001,99.6834
235,236,11144,2981,855,312.384,40.0122,49.9878,99.8636
236,237,15798,2372,858,159.92600000000004,55.7919,34.2081,99.987
237,238,7185,3213,829,141.482,12.6594,77.3406,99.9926
238,239,6585,1001,855,139.297,43.7759,46.2241,99.6152
239,240,2180,888,813,302.1140000000001,55.4907,34.5093,99.9893
240,241,933,3602,838,329.045,20.1121,69.8879,99.9882
241,242,9737,1231,899,147.0,26.5861,63.4139,99.935
242,243,2997,1154,848,138.501,35.4444,54.5556,99.8251
243,244,3906,2797,847,142.726,58.4342,31.5658,99.9922
244,245,2928,1078,843,143.41299999999995,15.3033,74.6967,99.9924
245,246,3127,910,849,314.487,62.618,27.382,99.9856
246,247,1070,2854,826,307.758,46.664,43.33600000000001,99.9879
247,248,11484,1361,893,318.058,45.4057,44.5943,99.9389
248,249,6488,1561,881,315.818,0.971069,89.0289,99.9789
249,250,1560,3086,848,145.657,64.9348,25.0652,99.9955
250,251,1707,2936,846,139.309,25.1717,64.8283,99.8589
251,252,9623,2289,901,137.558,27.5011,62.4989,99.9784
252,253,7274,760,889,143.135,50.3136,39.6864,99.9847
253,254,9053,2080,891,323.869,2.4190400000000003,87.581,99.9784
254,255,4391,2500,878,138.19299999999998,8.77629,81.2237,97.6485
255,256,17280,893,929,140.526,10.8836,79.1164,99.9457
256,257,4976,2877,878,301.388,23.0522,66.9478,99.9762
257,258,6746,3302,908,145.357,15.5324,74.4676,99.9556
258,259,612,249,869,312.5440000000001,14.9116,75.0884,99.9707
259,260,3044,3375,890,341.273,53.7333,36.2667,99.8675
260,261,12802,1757,934,138.3,29.6193,60.3807,99.7125
261,262,7572,1130,916,139.507,35.2671,54.7329,99.9348
262,263,613,3426,872,316.853,4.61379,85.3862,99.9945
263,264,5742,414,905,141.19299999999996,11.9302,78.0698,99.9947
264,265,5539,613,910,306.91,57.2396,32.7604,99.9852
265,266,668,3155,888,317.332,33.6815,56.3185,99.5977
266,267,3435,2634,902,137.27700000000002,11.3294,78.6706,99.996
267,268,2176,3243,902,324.586,63.8937,26.1063,99.9956
268,269,3270,2950,921,142.33700000000005,19.3295,70.6705,99.9453
269,270,3927,1651,906,134.141,8.19007,81.8099,99.9972
270,271,786,2453,901,157.9,63.3109,26.6891,99.9911
271,272,4932,3425,925,318.129,50.2926,39.7074,99.9918
272,273,5312,2798,922,317.4840000000001,14.6668,75.3332,99.9865
273,274,1684,3094,907,144.967,25.1157,64.8843,99.99
274,275,904,3200,903,142.347,31.3549,58.6451,99.9814
275,276,561,1299,909,321.936,11.2827,78.7173,99.9936
276,277,2137,3482,927,321.694,59.9918,30.0082,99.9751
277,278,3482,543,934,143.16899999999995,3.17396,86.82600000000002,99.997
278,279,7175,2234,949,140.49200000000002,69.7374,20.2626,99.9532
279,280,4514,2561,941,324.525,28.2488,61.7512,99.9424
280,281,2947,1853,928,319.511,29.8557,60.1443,99.9892
281,282,2037,1436,937,314.076,24.159,65.84100000000001,99.9761
282,283,4606,2698,947,315.366,45.0655,44.9345,99.9656
283,284,19554,1188,1045,136.511,1.4237,88.5763,99.8206
284,285,4492,664,958,136.514,24.011,65.98899999999999,99.8577
285,286,738,1069,930,319.154,44.1251,45.8749,99.978
286,287,17536,2454,1005,248.882,80.5636,9.4364,99.151
287,288,12383,3064,987,147.512,68.8551,21.1449,99.9261
288,289,1235,776,946,307.823,59.6301,30.3699,99.9696
289,290,2398,3171,953,135.072,35.7284,54.2716,99.984
290,291,1835,3597,960,311.659,8.775780000000001,81.2242,99.9471
291,292,1711,2857,950,138.80700000000002,54.8606,35.1394,99.9957
292,293,4865,2906,977,314.085,27.8677,62.1323,99.9948
293,294,4183,3250,964,324.566,0.947487,89.0525,99.9023
294,295,3353,483,966,135.614,30.5486,59.4514,99.4321
295,296,2700,1551,962,320.994,7.69482,82.3052,99.9734
296,297,960,370,947,141.35,23.4387,66.5613,99.9842
297,298,3298,1630,957,308.385,68.9906,21.0094,99.987
298,299,805,2019,947,134.868,11.0442,78.9558,99.9963
299,300,4027,711,996,328.048,16.1527,73.8473,99.5754
300,301,8802,2124,988,137.77700000000002,30.8006,59.1994,99.9583
301,302,1957,2368,972,320.886,2.13161,87.8684,99.2674
302,303,13787,1043,1019,143.04,23.9526,66.0474,99.5402
303,304,5426,2614,997,141.52,40.0948,49.9052,99.8736
304,305,1507,951,979,317.321,24.8231,65.1769,99.9947
305,306,762,3498,971,143.64,44.3428,45.6572,99.7567
306,307,9580,400,1017,317.245,36.2523,53.7477,99.9647
307,308,3559,1399,987,307.996,12.6428,77.3572,99.9807
308,309,1768,3326,974,318.892,11.1325,78.8675,99.9912
309,310,957,2970,976,161.555,63.832,26.168000000000006,99.9922
310,311,621,1070,970,319.223,6.39249,83.6075,99.9905
311,312,1975,274,993,146.584,7.426,82.574,99.9769
312,313,791,2037,977,137.097,27.0647,62.9353,99.9854
313,314,6010,2784,998,299.974,31.3648,58.6352,99.9743
314,315,870,1685,984,315.025,7.977339999999999,82.0227,99.9896
315,316,4208,3433,999,143.829,15.8784,74.1216,99.9736
316,317,4033,585,997,139.22799999999998,15.362,74.638,89.9649
317,318,8560,1344,1028,53.3247,83.3486,6.65142,49.9181
318,319,11129,3151,1040,138.78,4.80862,85.1914,99.7012
319,320,541,3523,992,328.2390000000001,27.8503,62.1497,99.9468
320,321,5499,2292,1024,115.424,69.0326,20.9674,98.8003
321,322,2145,316,1010,312.529,7.850119999999999,82.1499,99.9742
322,323,1800,1512,997,139.58,8.0858,81.9142,98.4523
323,324,8570,1719,1051,149.227,11.4611,78.5389,99.9722
324,325,13836,1901,1074,310.58,66.5507,23.4493,99.6221
325,326,12968,1589,1042,319.907,17.9744,72.0256,99.8193
326,327,2580,1887,1014,138.885,33.7731,56.2269,99.9612
327,328,3938,2041,1021,134.922,11.8764,78.1236,99.1475
328,329,831,2548,1006,317.365,15.0085,74.9915,99.8244
329,330,15879,751,1083,150.92,44.6353,45.3647,95.1709
330,331,3622,884,1011,319.87,20.5791,69.4209,99.9035
331,332,683,3362,1002,318.665,3.4115800000000003,86.5884,99.9915
332,333,5821,1808,1028,301.626,68.4467,21.5533,99.391
333,334,1025,2219,1006,139.4,15.1568,74.8432,99.9914
334,335,1096,3490,1017,149.257,1.64798,88.352,99.9486
335,336,9456,2676,1055,320.097,8.215710000000001,81.7843,99.9753
336,337,2177,1458,1025,129.869,44.7686,45.2314,99.9213
337,338,4851,493,1043,154.741,66.0618,23.9382,99.9001
338,339,1571,3322,1017,321.2920000000001,41.4671,48.5329,99.9904
339,340,2436,2984,1036,329.341,64.1238,25.8762,99.7017
340,341,1952,3257,1026,322.751,18.4246,71.5754,99.9744
341,342,932,2355,1029,317.915,9.08423,80.9158,99.9123
342,343,8098,2836,1062,327.126,1.96841,88.0316,83.8164
343,344,771,954,1033,139.17700000000002,1.84988,88.1501,99.9941
344,345,6097,2157,1074,299.622,54.2232,35.7768,99.6686
345,346,7480,3376,1066,141.98,27.3121,62.6879,97.5467
346,347,2090,255,1050,154.71200000000005,69.8476,20.1524,99.9794
347,348,4200,2012,1076,312.651,22.4789,67.5211,99.5753
348,349,880,577,1040,160.786,54.1552,35.8448,99.9888
349,350,2545,747,1057,141.179,19.7267,70.2733,99.9941
350,351,840,2230,1047,315.908,12.2298,77.7702,99.9784
351,352,4168,634,1097,316.527,17.5024,72.4976,99.1229
352,353,1289,3593,1055,315.021,10.393,79.607,99.8809
353,354,3415,319,1071,319.631,6.34879,83.6512,99.9765
354,355,1759,2532,1059,313.757,24.7443,65.2557,99.9463
355,356,2054,3289,1065,126.652,59.1281,30.8719,99.7128
356,357,565,1284,1061,316.503,22.4304,67.5696,99.9433
357,358,3183,885,1075,166.99400000000003,81.6986,8.30137,99.9903
358,359,574,941,1076,318.148,71.8656,18.1344,99.7326
359,360,676,1307,1065,135.955,45.9728,44.0272,99.9922
360,361,1177,2948,1067,2.58277,77.4,12.6,99.9742
361,362,1555,2085,1076,320.601,5.0078,84.9922,99.9624
362,363,1111,599,1069,329.446,3.21313,86.7869,99.9906
363,364,3576,3517,1086,319.35,67.7657,22.2343,99.78
364,365,1218,1347,1077,140.726,17.0991,72.9009,99.9842
365,366,2412,2754,1079,319.464,33.5712,56.4288,99.9753
366,367,5147,2341,1093,317.115,7.8092,82.1908,99.5663
367,368,7691,2556,1108,314.337,32.918,57.082,99.976
368,369,2261,3050,1077,318.07,12.9815,77.0185,99.8654
369,370,3105,1055,1094,324.121,51.0108,38.9892,99.9928
370,371,27772,1439,1206,314.889,38.1545,51.8455,87.5345
371,372,5547,561,1110,143.37,26.8919,63.1081,99.9126
372,373,1185,1109,1084,149.124,7.13915,82.8608,99.9652
373,374,2641,3216,1098,149.349,24.5193,65.4807,99.9967
374,375,1190,1653,1097,132.958,7.266489999999999,82.7335,99.8562
375,376,6639,3454,1119,327.213,56.0404,33.9596,99.9788
376,377,2800,2218,1098,135.534,4.24402,85.756,99.9907
377,378,957,2271,1090,322.605,16.3635,73.6365,99.851
378,379,2573,370,1106,317.714,30.0934,59.9066,99.9685
379,380,695,3385,1093,141.13,12.9013,77.0987,99.9952
380,381,11794,2490,1160,319.369,14.2125,75.7875,99.8859
381,382,11564,3142,1150,316.495,76.3588,13.6412,99.9354
382,383,14838,1577,1165,316.671,4.53036,85.4696,99.1268
383,384,6194,2976,1114,140.655,18.5408,71.4592,99.7986
384,385,994,831,1103,153.116,39.747,50.253,99.9788
385,386,1211,1246,1105,146.917,23.5149,66.4851,99.9957
386,387,2397,495,1119,143.918,48.1788,41.8212,99.984
387,388,2931,1694,1124,135.834,35.1708,54.8292,99.9848
388,389,8150,423,1158,318.228,28.2345,61.7655,99.7335
389,390,1361,3591,1127,145.339,27.0418,62.9582,99.8896
390,391,947,2697,1107,142.033,49.8835,40.1165,99.9881
391,392,2452,1408,1118,317.232,31.4096,58.5904,99.9931
392,393,3104,2885,1130,314.483,55.5958,34.4042,99.9926
393,394,998,286,1116,322.656,12.6002,77.3998,99.4354
394,395,12819,993,1166,145.899,56.9783,33.0217,59.6384
395,396,3200,1754,1135,146.088,19.7305,70.2695,99.9241
396,397,3846,1996,1147,135.296,0.119911,89.8801,99.9557
397,398,1211,323,1123,320.24,30.3376,59.6624,99.9834
398,399,2511,1093,1137,315.238,21.4326,68.5674,99.9557
399,400,5631,2378,1149,337.249,63.8905,26.1095,99.9772
400,401,6528,3372,1166,138.904,5.77831,84.2217,99.7903
401,402,2070,2075,1127,138.481,42.8864,47.1136,99.987
402,403,8446,1306,1194,316.8520000000001,8.94457,81.0554,99.9434
403,404,842,2760,1122,145.786,3.2878800000000004,86.7121,99.9971
404,405,70911,2451,1334,136.671,7.894189999999999,82.1058,99.2905
405,406,11001,3262,1184,148.53,20.3687,69.6313,99.8847
406,407,1191,1943,1128,144.842,47.2705,42.7295,99.9973
407,408,4098,2152,1153,312.978,25.1675,64.8325,99.9932
408,409,785,718,1136,147.18200000000004,3.38156,86.6184,99.9956
409,410,1254,3322,1139,282.331,75.0218,14.9782,99.9437
410,411,3695,243,1162,307.598,17.8331,72.1669,99.9877
411,412,9827,2824,1176,307.845,46.5961,43.4039,99.9923
412,413,45049,1940,1244,318.753,14.4688,75.5312,97.9847
413,414,4367,853,1161,152.524,27.3952,62.6048,99.9769
414,415,609,2203,1137,320.838,9.72584,80.2742,99.8926
415,416,2335,3529,1154,309.676,15.3442,74.6558,99.9718
416,417,3508,2658,1165,152.336,60.2977,29.7023,99.9814
417,418,3934,1212,1162,333.967,33.9441,56.0559,99.9979
418,419,4667,2591,1184,134.11,5.87134,84.1287,99.971
419,420,786,1431,1152,131.358,72.1088,17.8912,99.9873
420,421,1145,2947,1150,319.817,0.0304337,89.9696,99.9913
421,422,4768,2734,1179,142.944,28.2226,61.7774,99.9926
422,423,1802,360,1167,145.333,28.5517,61.4483,99.9969
423,424,2240,2057,1170,133.94899999999998,73.75,16.25,99.9937
424,425,1275,522,1167,312.564,28.7235,61.2765,99.9841
425,426,9955,698,1222,320.567,6.9027699999999985,83.0972,99.8837
426,427,2349,299,1182,128.311,68.0961,21.9039,99.984
427,428,1271,491,1187,139.58100000000002,38.7501,51.2499,99.9604
428,429,704,3591,1174,136.606,20.3208,69.6792,99.7807
429,430,35750,3006,1331,137.56799999999998,10.4343,79.5657,98.7307
430,431,5721,576,1200,6.30238,77.0374,12.9626,99.9904
431,432,2935,1134,1186,140.77200000000005,45.7504,44.2496,99.9941
432,433,962,775,1179,321.202,39.4615,50.5385,99.8471
433,434,2768,2926,1195,303.243,60.9598,29.0402,99.8599
434,435,6897,3467,1209,312.509,39.6493,50.3507,99.9283
435,436,3525,3057,1211,319.88,47.4766,42.5234,99.994
436,437,3730,1690,1199,326.177,25.0289,64.9711,99.9953
437,438,4716,943,1223,316.421,21.1569,68.8431,99.9837
438,439,1996,879,1203,301.5490000000001,26.723000000000006,63.277,99.9671
439,440,525,1077,1186,321.321,51.7331,38.2669,99.9343
440,441,4473,804,1223,142.834,56.6318,33.3682,99.9984
441,442,1820,2406,1209,318.673,65.1223,24.8777,99.993
442,443,10893,2706,1264,318.101,27.1061,62.8939,99.8618
443,444,861,454,1212,144.316,14.3713,75.6287,99.945
444,445,1353,1242,1208,125.3,65.1522,24.8478,99.9917
445,446,1154,2079,1205,140.155,16.424,73.57600000000002,99.9976
446,447,736,1182,1205,319.139,30.8142,59.1858,99.9949
447,448,2517,2137,1231,142.454,44.8048,45.1952,99.9569
448,449,2798,1779,1227,326.815,52.1387,37.8613,99.9434
449,450,68317,489,1380,136.945,6.4732,83.5268,79.4651
450,451,5707,253,1251,298.6690000000001,74.6143,15.3857,99.8778
451,452,2147,2621,1230,152.879,75.3317,14.6683,99.9892
452,453,3843,3192,1241,131.526,3.61485,86.3852,99.9775
453,454,7261,3376,1250,319.709,1.58726,88.4127,98.8651
454,455,1098,742,1226,148.496,5.76167,84.2383,99.998
455,456,798,535,1243,316.139,8.2942,81.7058,99.9298
456,457,3306,2368,1249,327.861,6.8589600000000015,83.141,99.9967
457,458,2257,1187,1237,143.031,42.9607,47.0393,99.983
458,459,1134,3590,1262,319.084,13.4123,76.5877,99.9463
459,460,16709,1110,1302,298.573,88.6527,1.34727,99.9
460,461,4196,874,1259,140.80200000000005,46.3749,43.6251,99.9848
461,462,42971,1717,1373,141.939,7.596019999999998,82.404,98.8679
462,463,1035,3109,1242,317.712,8.04308,81.9569,99.9988
463,464,1071,1035,1246,322.03,12.1522,77.8478,99.9842
464,465,6749,2833,1270,108.041,78.5217,11.4783,99.9691
465,466,829,2578,1251,139.513,3.5336300000000005,86.4664,99.9896
466,467,539,2764,1248,153.18200000000004,76.5983,13.4017,99.9948
467,468,2282,1596,1264,312.505,18.5685,71.4315,99.9937
468,469,8010,1245,1303,315.713,1.18815,88.8119,99.9722
469,470,3083,585,1269,153.89600000000004,61.0243,28.9757,99.9943
470,471,746,3242,1270,305.8520000000001,83.6499,6.35011,99.989
471,472,25140,3469,1371,301.526,31.5951,58.4049,99.9487
472,473,6476,2186,1308,318.267,10.5076,79.4924,99.998
473,474,2687,3316,1279,320.637,30.6598,59.3402,99.7994
474,475,4216,3124,1289,136.351,12.2578,77.7422,99.999
475,476,1992,676,1274,315.066,19.4707,70.5293,99.9975
476,477,7337,1822,1303,117.882,74.5959,15.4041,99.9707
477,478,757,2538,1269,317.355,46.5863,43.4137,99.9566
478,479,2305,3057,1281,314.527,53.0774,36.9226,99.9955
479,480,1819,2630,1296,311.921,43.57,46.43,99.99
480,481,35692,984,1383,134.872,15.2355,74.7645,97.9503
481,482,19390,1322,1424,143.234,47.3303,42.6697,99.5989
482,483,14078,2299,1391,294.101,67.27,22.73,99.7349
483,484,12616,649,1331,140.482,41.3713,48.6287,99.7879
484,485,916,794,1291,134.033,41.3999,48.6001,99.9985
485,486,14381,3208,1355,326.603,28.3086,61.6914,99.9767
486,487,19232,1545,1355,175.36,78.298,11.702,99.9538
487,488,3615,836,1336,157.41299999999995,66.9932,23.0068,99.9899
488,489,10346,3322,1343,323.524,15.6577,74.3423,99.3818
489,490,1392,529,1320,146.33100000000005,49.0268,40.9732,99.991
490,491,4181,3550,1376,133.209,51.6065,38.3935,99.9738
491,492,13345,2126,1382,135.0,1.13803,88.86200000000002,99.9475
492,493,11418,2692,1383,319.983,72.9768,17.0232,99.9771
493,494,3622,789,1360,311.301,31.6103,58.3897,99.9769
494,495,7606,2823,1363,139.115,10.9464,79.0536,99.8527
495,496,9229,278,1377,293.811,78.3813,11.6187,99.9187
496,497,10505,1979,1390,141.438,9.41709,80.5829,99.9823
497,498,1703,3588,1346,131.781,52.2842,37.7158,99.9409
498,499,12498,1397,1390,146.369,33.549,56.451,99.9903
499,500,8254,2396,1374,316.228,10.737,79.263,99.772
500,501,1348,2907,1345,315.656,73.4534,16.5466,99.8922
501,502,1401,735,1357,141.412,10.9916,79.0084,99.9967
502,503,1728,1870,1395,144.287,36.6801,53.3199,99.9939
503,504,6248,2234,1419,163.99599999999995,77.2292,12.7708,99.9833
504,505,6650,3139,1426,141.04399999999995,14.7688,75.2312,99.9947
505,506,1874,855,1415,301.471,51.6876,38.3124,99.9903
506,507,1544,2919,1402,324.646,0.417496,89.5825,99.9932
507,508,889,817,1412,140.145,11.5654,78.4346,99.996
508,509,612,1221,1405,141.219,46.9693,43.0307,99.9602
509,510,14336,730,1491,314.838,18.7602,71.2398,99.6556
510,511,7340,3340,1448,316.188,49.1992,40.8008,99.99
511,512,13822,1507,1474,141.162,36.5103,53.4897,99.859
512,513,4999,2752,1449,305.605,46.7515,43.2485,99.9859
513,514,2059,1183,1427,188.867,84.8535,5.14649,99.9886
514,515,23963,336,1487,306.342,43.2999,46.7001,53.6377
515,516,10747,2855,1468,302.024,61.2346,28.7654,99.9839
516,517,776,295,1427,140.484,37.0333,52.9667,99.9905
517,518,1321,1259,1432,192.212,84.971,5.028980000000002,99.9916
518,519,4767,2418,1445,141.023,8.783710000000001,81.2163,99.9963
519,520,6640,3264,1467,310.714,42.2897,47.7103,99.997
520,521,5805,1905,1456,201.887,80.2254,9.77461,99.959
521,522,16660,2079,1499,135.28,50.4696,39.5304,99.7066
522,523,8999,1817,1513,314.78,23.4426,66.5574,99.9165
523,524,2502,2504,1447,312.835,44.7645,45.2355,99.9808
524,525,874,2929,1436,316.2290000000001,57.7895,32.2105,99.9918
525,526,1421,1135,1447,314.948,25.7723,64.2277,99.9753
526,527,2279,1634,1453,144.053,55.8721,34.1279,99.987
527,528,34576,898,1554,320.639,32.966,57.034,93.68
528,529,977,1236,1456,313.334,22.4774,67.5226,99.5883
529,530,920,1359,1449,180.603,72.8855,17.1145,99.9885
530,531,1014,3606,1449,308.982,68.3853,21.6147,99.8066
531,532,1961,3561,1468,311.975,67.4413,22.5587,99.9838
532,533,526,1588,1448,138.158,41.7736,48.2264,99.8711
533,534,2094,3180,1475,320.876,3.98483,86.0152,99.9943
534,535,7239,2922,1520,323.015,8.63594,81.3641,99.7192
535,536,2662,819,1483,135.526,12.3836,77.6164,99.9912
536,537,17494,2194,1545,138.90200000000002,12.7002,77.2998,99.6479
537,538,10734,1172,1500,137.77,19.3324,70.6676,79.3389
538,539,973,2287,1479,318.495,10.2816,79.7184,99.9872
539,540,508,2698,1475,167.517,65.6765,24.3235,99.971
540,541,1541,1020,1474,315.88,85.0386,4.9614,99.9461
541,542,1900,3586,1502,306.259,68.7199,21.2801,99.8625
542,543,9714,2443,1514,312.7290000000001,21.2453,68.7547,99.9749
543,544,3090,1970,1500,140.428,0.518654,89.4813,99.9715
544,545,3930,3429,1504,147.942,72.6405,17.3595,99.9923
545,546,733,1419,1495,178.987,72.1877,17.8123,99.9822
546,547,3833,3109,1504,309.72,51.6522,38.3478,99.9954
547,548,3055,1259,1528,312.01,17.5366,72.4634,99.9611
548,549,3022,2772,1515,310.789,31.2321,58.7679,99.9832
549,550,9263,3022,1535,137.115,53.621,36.379,99.6463
550,551,20411,1575,1583,318.175,17.945,72.055,99.9368
551,552,714,2716,1510,142.196,20.2621,69.7379,99.9886
552,553,3598,3524,1554,304.2990000000001,42.5364,47.4636,99.8763
553,554,13296,2328,1575,151.886,65.7609,24.2391,99.8418
554,555,30014,3287,1574,315.172,28.6672,61.3328,99.956
555,556,10878,407,1563,32.712,89.1114,0.8885639999999999,99.9324
556,557,3284,647,1553,310.01,13.284,76.71600000000002,99.9977
557,558,4180,1759,1564,126.815,79.0259,10.9741,99.922
558,559,40354,1930,1639,79.5776,88.7821,1.21788,99.3899
559,560,28557,1449,1713,318.692,39.0578,50.9422,96.2823
560,561,1329,1512,1549,136.85,35.7961,54.2039,99.9352
561,562,4246,1146,1565,17.7977,83.5651,6.43494,99.9953
562,563,12972,3469,1614,126.047,21.1958,68.8042,99.9602
563,564,3376,2785,1568,309.254,45.3008,44.6992,99.9515
564,565,9340,1683,1608,136.839,23.7444,66.2556,99.9923
565,566,18154,2501,1624,321.022,56.2575,33.7425,99.9657
566,567,1467,3108,1573,312.84,6.96363,83.0364,99.9227
567,568,64849,1177,1689,142.72899999999996,48.9728,41.0272,99.7971
568,569,5609,1383,1598,311.405,16.8956,73.1044,99.9813
569,570,2079,2708,1585,263.383,80.2245,9.77551,99.9956
570,571,13523,537,1614,142.983,24.6697,65.3303,99.9953
571,572,701,599,1571,134.578,15.1286,74.8714,99.9942
572,573,650,2441,1580,310.133,57.8646,32.1354,99.8898
573,574,9116,2801,1630,319.123,9.71272,80.2873,99.2333
574,575,2651,2974,1589,312.488,14.1359,75.8641,99.9557
575,576,3831,3583,1630,133.369,17.5575,72.4425,99.8804
576,577,4870,997,1602,139.857,27.6317,62.3683,99.981
577,578,593,741,1575,309.451,82.7993,7.2007,99.9963
578,579,1904,3552,1632,135.838,16.8339,73.1661,99.9783
579,580,35406,2729,1719,318.866,3.63702,86.363,98.0439
580,581,14709,276,1647,318.91,4.10841,85.8916,99.9772
581,582,12317,3084,1633,138.72299999999998,19.8823,70.1177,99.8947
582,583,10121,912,1661,307.261,51.3131,38.6869,99.9602
583,584,9890,626,1663,114.143,83.4288,6.5712199999999985,99.9223
584,585,2638,2081,1645,319.309,4.76809,85.2319,98.1308
585,586,873,2130,1621,314.753,15.9351,74.0649,99.9866
586,587,37228,2934,1739,320.899,7.41086,82.5891,76.7911
587,588,1713,359,1635,148.636,17.8156,72.1844,99.9933
588,589,637,2243,1619,299.355,64.877,25.123,99.9592
589,590,10941,799,1673,278.685,77.8146,12.1854,99.9983
590,591,1444,1315,1632,133.753,34.8014,55.1986,99.996
591,592,3571,427,1651,320.987,12.3087,77.6913,99.997
592,593,67563,3211,1762,141.579,25.5827,64.4173,99.9593
593,594,1357,2293,1642,309.428,61.4161,28.5839,99.9805
594,595,2643,3405,1665,312.791,7.90269,82.0973,99.9951
595,596,21279,1592,1742,138.486,10.8191,79.1809,99.9955
596,597,18125,2398,1734,312.879,54.898,35.102,99.9502
597,598,14345,2229,1704,139.99,62.4892,27.5108,99.9857
598,599,31210,1800,1796,315.842,5.80451,84.1955,99.0023
599,600,552,482,1663,147.221,59.0596,30.9404,99.9915
600,601,1618,2414,1691,138.25,40.6004,49.3996,99.9727
601,602,114916,451,1874,158.93200000000004,59.7876,30.2124,46.1183
602,603,2144,1692,1701,146.334,31.3168,58.6832,99.9907
603,604,5068,523,1726,316.839,2.80682,87.1932,99.9772
604,605,903,3367,1689,68.3587,78.1259,11.8741,99.9902
605,606,5390,970,1725,138.863,1.5557,88.4443,99.9937
606,607,14702,2575,1738,148.127,47.8415,42.1585,99.9437
607,608,5531,737,1730,133.665,1.22095,88.779,99.9955
608,609,4840,3463,1720,70.2221,79.3794,10.6206,99.9793
609,610,1477,1723,1724,139.19799999999998,18.0997,71.9003,99.9927
610,611,1013,2127,1710,151.601,62.8548,27.1452,99.9885
611,612,2684,3550,1727,146.753,23.3272,66.6728,99.9892
612,613,647,627,1713,318.936,10.9483,79.0517,99.9964
613,614,12106,2121,1763,129.542,82.5302,7.46984,99.9733
614,615,3612,3403,1743,150.688,61.8061,28.1939,99.9682
615,616,8551,720,1762,316.2870000000001,20.5238,69.4762,99.1445
616,617,544,1874,1725,314.9,14.9772,75.0228,99.9858
617,618,3394,244,1749,136.991,36.9595,53.0405,99.9799
618,619,738,3581,1751,145.616,24.4535,65.5465,99.8763
619,620,1067,824,1745,323.111,57.06399999999999,32.936,99.9964
620,621,1249,908,1762,319.301,11.1456,78.8544,98.3317
621,622,8906,2015,1811,144.06799999999996,31.0404,58.9596,99.9883
622,623,2519,3524,1780,315.765,41.1091,48.8909,99.9784
623,624,7401,1195,1798,316.33,15.4583,74.5417,99.9577
624,625,2491,1669,1785,196.62,83.7533,6.24669,99.978
625,626,1399,1727,1776,151.329,81.0982,8.901810000000003,99.9883
626,627,1685,2670,1787,137.066,48.1364,41.8636,99.9705
627,628,13393,2356,1826,131.627,44.4545,45.5455,99.9825
628,629,2854,2922,1791,144.385,5.6482199999999985,84.3518,99.8078
629,630,1719,3490,1801,319.642,77.6333,12.3667,99.9715
630,631,1894,2255,1793,318.81,50.5423,39.4577,99.9473
631,632,49708,3463,1979,316.243,3.00668,86.9933,99.4749
632,633,11517,1009,1849,315.658,12.1137,77.8863,99.6308
633,634,2591,281,1804,167.597,74.4964,15.5036,99.9796
634,635,5106,3445,1821,319.307,20.802,69.19800000000001,99.9956
635,636,16923,1343,1846,159.192,72.1632,17.8368,99.9777
636,637,1071,1938,1800,138.775,3.27399,86.726,99.956
637,638,33278,818,1875,130.697,16.3398,73.6602,99.9943
638,639,893,235,1810,301.889,74.8061,15.1939,99.9863
639,640,16460,2552,1872,140.111,47.7395,42.2605,99.8886
640,641,891,2704,1814,147.697,50.5967,39.4033,99.9894
641,642,11368,1666,1870,312.21,43.4258,46.5742,99.8808
642,643,1076,3563,1823,311.025,42.175,47.825,99.8798
643,644,23603,2170,1909,161.379,58.9613,31.0387,99.976
644,645,1935,1221,1831,136.24200000000002,24.9618,65.0382,99.9852
645,646,10099,2290,1899,319.096,14.6878,75.3122,99.5866
646,647,1755,3587,1850,135.76,26.1847,63.8153,99.8862
647,648,4566,2693,1870,325.703,1.96582,88.0342,99.9444
648,649,7900,2055,1873,311.933,52.7435,37.2565,99.9412
649,650,12849,1183,1900,137.028,44.6018,45.3982,99.6835
650,651,7580,1915,1893,136.93200000000002,81.7249,8.27507,99.9326
651,652,8749,2786,1874,134.806,21.5834,68.4166,99.995
652,653,17624,3145,1914,138.083,50.9926,39.0074,99.9761
653,654,3495,2642,1885,311.458,30.6226,59.3774,99.9926
654,655,749,1531,1865,148.656,79.4279,10.5721,99.9867
655,656,2370,1232,1871,135.204,29.3576,60.6424,99.9859
656,657,7323,2452,1910,311.605,58.1077,31.8923,91.8054
657,658,5823,1490,1911,299.691,67.2384,22.7616,80.1305
658,659,3793,2878,1915,306.73,48.3135,41.6865,99.9716
659,660,771,3552,1891,318.164,19.8149,70.1851,99.9017
660,661,3304,3037,1913,320.767,11.7131,78.2869,99.9896
661,662,29301,939,2044,308.806,31.1756,58.8244,99.4691
662,663,30252,1485,2042,313.271,7.666639999999999,82.3334,99.6424
663,664,1286,3589,1918,137.944,27.5841,62.4159,99.9208
664,665,722,1417,1906,319.909,37.8828,52.1172,99.9962
665,666,7050,1359,1954,186.452,73.3978,16.6022,99.8512
666,667,13786,3300,1963,307.637,31.5496,58.4504,99.8766
667,668,10067,2947,1968,317.736,52.7924,37.2076,99.8725
668,669,12919,1784,1969,299.782,73.4603,16.5397,99.9082
669,670,89854,2647,2150,317.592,21.8156,68.1844,99.603
670,671,1580,1858,1929,163.388,73.4326,16.5674,99.9711
671,672,31439,2810,2011,138.733,9.18953,80.8105,99.5323
672,673,1404,957,1936,318.081,71.0249,18.9751,99.9519
673,674,2247,2657,1961,137.213,23.6408,66.3592,99.9011
674,675,24802,1153,2003,311.172,14.4462,75.5538,99.6226
675,676,12421,2015,1991,141.885,51.6575,38.3425,99.7773
676,677,666,677,1943,158.72299999999996,75.5706,14.4294,99.9713
677,678,1689,1442,1959,320.147,20.5881,69.4119,99.9755
678,679,4973,3072,1970,321.539,0.862366,89.1376,99.9925
679,680,554,1899,1957,146.559,12.2928,77.7072,99.9961
680,681,1360,2626,1970,224.013,76.2824,13.7176,99.9802
681,682,3234,1616,1975,318.014,31.17,58.83,99.9921
682,683,4099,2255,1989,311.355,26.3497,63.6503,99.9923
683,684,2851,883,2000,144.634,72.3466,17.6533,97.4501
684,685,8036,783,2018,142.465,16.6533,73.3467,99.8255
685,686,1127,562,1992,332.096,50.8777,39.1223,99.9019
686,687,1219,214,2012,136.569,16.765,73.235,99.937
687,688,27289,1738,2065,145.936,79.0157,10.9843,99.1578
688,689,2703,1337,2006,136.786,24.5099,65.4901,99.984
689,690,2047,1673,2004,183.352,78.2236,11.7764,99.8927
690,691,27668,2265,2098,310.696,67.2898,22.7102,92.9657
691,692,7790,396,2050,126.679,22.1075,67.8925,99.9571
692,693,33730,3101,2137,320.142,0.484818,89.5152,98.8194
693,694,1159,2092,2012,313.867,9.72991,80.2701,99.9844
694,695,2232,573,2024,321.011,68.3847,21.6153,99.826
695,696,3896,2411,2047,322.095,7.58056,82.4194,99.9313
696,697,628,2689,2017,205.502,77.3813,12.6187,99.9757
697,698,32308,450,2149,137.341,4.99797,85.00200000000002,90.8096
698,699,21169,602,2122,308.749,56.8249,33.1751,99.9929
699,700,6031,3028,2051,311.6020000000001,71.2788,18.7212,99.3676
700,701,5497,303,2086,130.48,38.3877,51.6123,99.9795
701,702,1365,240,2062,132.463,53.777,36.223,99.974
702,703,61004,1949,2155,318.383,17.9909,72.0091,94.377
703,704,5183,3304,2082,120.582,65.6074,24.3926,99.6056
704,705,1509,1142,2062,143.045,40.5336,49.4664,99.9973
705,706,5546,2441,2098,133.67,49.9874,40.0126,99.9635
706,707,20404,1291,2126,128.645,86.8392,3.16078,99.8859
707,708,2710,1079,2088,147.576,39.9258,50.0742,99.9953
708,709,12956,711,2130,291.145,63.1512,26.8488,99.9794
709,710,15854,1037,2173,131.188,16.8226,73.1774,99.9923
710,711,1279,1559,2109,162.88,89.336,0.663966,99.9495
711,712,3979,1173,2129,141.935,38.7109,51.2891,99.9975
712,713,534,1143,2100,143.752,44.1026,45.8974,99.9766
713,714,2077,3550,2107,132.97799999999998,12.8967,77.1033,99.8746
714,715,3385,244,2122,311.257,19.7427,70.2573,99.9692
715,716,3256,2482,2130,140.27700000000002,39.1421,50.8579,99.67
716,717,1577,2757,2105,255.748,84.2541,5.74593,99.9944
717,718,1136,3052,2107,148.576,39.9316,50.0684,99.9726
718,719,2938,2843,2115,309.829,31.8478,58.1522,99.9945
719,720,533,3220,2105,115.219,62.3853,27.6147,99.9906
720,721,1094,2977,2126,312.777,29.0843,60.9157,99.7133
721,722,1412,2354,2127,311.223,69.2358,20.7642,99.9826
722,723,535,2380,2110,324.328,23.3865,66.6135,99.2182
723,724,1127,2904,2118,318.273,47.8689,42.1311,99.98
724,725,13810,3491,2179,136.877,5.9667,84.0333,99.9744
725,726,593,1601,2110,139.5,15.6201,74.3799,99.9973
726,727,2758,3270,2143,315.868,43.0999,46.9001,99.9938
727,728,1762,3025,2128,142.291,39.584,50.416,99.9971
728,729,570,1120,2129,315.77,43.6974,46.3026,99.9906
729,730,1865,3385,2132,164.09599999999998,80.4287,9.57134,99.9713
730,731,2120,3197,2139,313.885,20.6328,69.3672,99.987
731,732,653,1776,2130,154.118,83.2297,6.7702800000000005,99.9961
732,733,4843,798,2174,317.009,18.5605,71.4395,99.9733
733,734,1590,2937,2141,298.472,63.1665,26.8335,99.9656
734,735,3885,2796,2150,134.642,11.996,78.00399999999998,99.9668
735,736,1783,3340,2147,319.425,3.06358,86.9364,99.997
736,737,4079,1509,2174,145.701,13.3786,76.6214,99.9972
737,738,728,1603,2144,318.333,17.582,72.418,99.9957
738,739,19467,1684,2272,318.423,5.23197,84.76799999999999,99.8404
739,740,506,3427,2149,136.922,15.063,74.937,99.9734
740,741,2352,861,2164,314.744,38.8832,51.1168,99.9923
741,742,10566,2151,2191,141.882,68.8637,21.1363,99.8772
742,743,4268,266,2191,5.54116,88.6631,1.33691,99.9988
743,744,4257,1568,2184,138.906,19.0662,70.9338,99.999
744,745,10571,2395,2217,324.566,9.67686,80.3231,99.9496
745,746,1640,310,2177,46.8917,89.2737,0.726316,99.9832
746,747,9005,3195,2205,143.858,10.4707,79.5293,99.9894
747,748,883,1109,2177,313.435,59.753,30.247,99.9904
748,749,1205,1399,2178,325.466,16.0558,73.9442,99.9946
749,750,12433,679,2237,128.458,16.6076,73.3924,99.9792
750,751,1311,1178,2173,129.344,14.2639,75.7361,99.995
751,752,637,3399,2172,131.542,3.66492,86.3351,99.9541
752,753,23550,901,2292,311.707,7.67138,82.3286,99.7766
753,754,745,1832,2190,312.915,64.73899999999999,25.261,99.9926
754,755,15120,3324,2245,317.379,11.7174,78.2826,99.9954
755,756,1801,3570,2210,321.904,6.0210599999999985,83.9789,99.7903
756,757,533,2482,2185,320.257,20.0893,69.9107,99.3782
757,758,2845,1442,2215,192.517,85.9114,4.08857,99.986
758,759,11903,1155,2259,320.936,74.6926,15.3074,99.7788
759,760,658,2792,2198,139.572,33.9216,56.0784,99.9786
760,761,15151,1605,2252,322.514,75.612,14.388,99.9622
761,762,8826,331,2261,301.13,48.2667,41.7333,99.9951
762,763,1404,2926,2221,135.339,31.889,58.111,99.1604
763,764,5997,1281,2220,308.016,73.4169,16.5831,99.9899
764,765,8180,2488,2245,140.023,13.9285,76.0715,99.8492
765,766,4802,3408,2243,134.264,39.1624,50.8376,99.979
766,767,1021,1772,2230,302.749,62.0008,27.9992,99.9885
767,768,1027,3067,2236,324.717,36.4616,53.5384,99.9934
768,769,8908,778,2265,112.218,70.194,19.806,99.9835
769,770,906,1089,2239,134.148,11.8005,78.1995,99.9944
770,771,3926,1377,2247,321.289,6.07536,83.9246,99.9934
771,772,6043,2028,2268,139.298,3.43451,86.5655,99.9949
772,773,566,2030,2222,143.923,12.0262,77.9738,99.0425
773,774,1546,1497,2235,320.9890000000001,13.8382,76.1618,99.9965
774,775,2742,2278,2244,315.938,48.6268,41.3732,99.9869
775,776,11406,2105,2287,319.269,2.49798,87.50200000000002,99.9914
776,777,8973,3529,2296,320.4290000000001,11.2729,78.7271,99.8965
777,778,4577,3101,2275,316.306,17.9666,72.0334,99.9434
778,779,1777,261,2258,309.233,35.8265,54.1735,99.9976
779,780,1830,484,2260,136.458,72.6089,17.3911,99.985
780,781,7609,2207,2285,307.695,64.3958,25.6042,99.9846
781,782,12092,3212,2306,146.852,19.1125,70.8875,99.9908
782,783,47972,1318,2383,133.691,10.4601,79.5399,99.477
783,784,1660,2691,2277,212.242,86.6519,3.3481400000000003,99.9953
784,785,6488,2944,2304,133.58100000000002,28.0419,61.9581,99.9812
785,786,2604,978,2275,143.762,27.3518,62.6482,99.971
786,787,2009,1466,2284,132.628,22.0597,67.9403,99.9424
787,788,52211,475,2367,138.668,57.575,32.425,99.8375
788,789,14465,2484,2336,317.386,4.51826,85.4817,99.9195
789,790,3110,1062,2296,144.433,34.1045,55.8955,99.9729
790,791,2333,1395,2299,137.403,85.4331,4.56695,99.9805
791,792,2292,2308,2289,137.128,34.4295,55.5705,99.9962
792,793,2077,2601,2291,227.024,83.2865,6.71352,99.9955
793,794,4054,3450,2321,133.58,43.1628,46.8372,56.7086
794,795,4001,256,2335,310.556,11.9687,78.0313,99.9635
795,796,4804,1881,2319,311.186,16.6786,73.3214,99.9952
796,797,3914,3025,2321,141.025,9.93963,80.0604,99.9426
797,798,4891,1763,2328,286.867,63.6612,26.3388,99.9931
798,799,954,1003,2311,140.05200000000002,16.0593,73.9407,99.9829
799,800,11377,1921,2366,139.105,21.2876,68.7124,99.8507
800,801,2133,2662,2327,134.972,30.7413,59.2587,99.942
801,802,676,296,2323,135.41299999999998,51.8961,38.1039,99.9916
802,803,7846,1511,2376,137.245,50.2103,39.7897,99.968
803,804,11500,2293,2361,314.158,20.2293,69.7707,99.9973
804,805,1145,219,2331,321.9190000000001,23.0914,66.9086,99.9527
805,806,1938,1437,2340,306.39,41.2851,48.7149,99.9929
806,807,4903,3133,2358,318.651,46.6834,43.3166,99.9487
807,808,5922,692,2348,297.076,84.3513,5.6486800000000015,99.981
808,809,5859,3336,2355,318.353,43.1558,46.8442,99.9909
809,810,3989,2588,2363,127.473,78.2256,11.7744,99.9803
810,811,2201,1018,2355,306.306,70.3109,19.6891,99.9742
811,812,10707,2398,2398,324.023,44.3938,45.6062,99.9943
812,813,1614,1061,2356,306.613,71.7026,18.2974,99.9562
813,814,1197,1694,2358,324.381,84.1007,5.8993,99.9941
814,815,1736,1147,2355,307.128,41.0711,48.9289,99.9766
815,816,722,1396,2348,136.607,2.97311,87.0269,99.9423
816,817,616,3414,2346,138.741,79.4328,10.5672,99.9747
817,818,7156,2887,2383,314.687,39.0654,50.9346,99.9942
818,819,5846,813,2384,133.315,3.32711,86.6729,99.9923
819,820,8797,2111,2378,149.278,50.2267,39.7733,99.9498
820,821,5042,1780,2382,143.41899999999995,4.21242,85.7876,99.9843
821,822,10701,2647,2427,188.386,81.0162,8.98382,99.8312
822,823,729,2022,2357,318.462,29.469,60.53100000000001,99.888
823,824,15046,2758,2405,134.783,70.3354,19.6646,99.9749
824,825,12313,3026,2397,137.378,1.95726,88.0427,99.7636
825,826,1288,3574,2390,141.138,6.24825,83.7518,99.9568
826,827,3112,3537,2386,140.685,5.6845300000000005,84.3155,99.9911
827,828,3718,1122,2391,314.719,9.94746,80.0525,99.9497
828,829,1821,2205,2394,307.279,52.3144,37.6856,99.9602
829,830,1362,3416,2391,139.00799999999998,26.0118,63.9882,99.9943
830,831,1091,728,2386,137.39700000000002,25.0579,64.9421,99.9956
831,832,9291,1628,2418,137.366,7.15641,82.8436,99.9712
832,833,1172,218,2413,135.645,31.1055,58.8945,99.9238
833,834,6778,918,2420,132.03,18.2255,71.7745,99.9707
834,835,1617,2001,2401,321.43,10.2769,79.7231,99.9692
835,836,5219,665,2408,138.763,38.0626,51.9374,99.9976
836,837,1298,1022,2398,283.991,71.5547,18.4453,99.9914
837,838,533,238,2397,138.123,46.0094,43.9906,99.9934
838,839,1933,1730,2409,142.904,61.1406,28.8594,99.9705
839,840,7902,3367,2435,316.028,11.1461,78.8539,99.9815
840,841,1937,1947,2407,319.622,4.36866,85.6313,99.4518
841,842,9368,3144,2471,310.966,16.6397,73.3603,99.911
842,843,1971,1065,2416,313.646,31.8736,58.1264,99.9951
843,844,3856,3459,2436,320.201,46.0143,43.9857,99.9789
844,845,6705,740,2445,318.315,43.981,46.019,99.9354
845,846,7931,3523,2473,139.311,35.6855,54.3145,99.9116
846,847,27582,3319,2519,145.106,72.9735,17.0265,99.7324
847,848,11473,2466,2478,140.48,65.551,24.449,99.9652
848,849,68300,907,2594,140.844,42.0585,47.9415,73.4478
849,850,531,3298,2423,139.43,31.8423,58.1577,99.994
850,851,8008,2135,2464,162.882,65.1259,24.8741,99.9891
851,852,16585,1997,2493,319.112,22.3657,67.6343,99.7741
852,853,20166,2901,2491,316.375,17.9583,72.0417,99.9766
853,854,13843,1848,2481,157.532,62.8338,27.1662,99.7514
854,855,4752,2304,2454,141.327,35.4855,54.5145,99.9716
855,856,28456,328,2539,314.427,35.8881,54.1119,97.7959
856,857,1423,2552,2444,211.746,79.67399999999998,10.326,99.9296
857,858,1376,1023,2443,306.44,36.122,53.878,99.9782
858,859,12346,2226,2498,142.624,51.0952,38.9048,99.9219
859,860,5007,1121,2466,310.752,66.947,23.053,99.9747
860,861,8453,1194,2509,141.622,37.6225,52.3775,99.9586
861,862,1316,3571,2490,138.747,36.4263,53.5737,99.9493
862,863,11605,3044,2535,221.375,86.9888,3.01116,99.4346
863,864,522,2602,2481,189.927,82.0418,7.95818,99.9097
864,865,33829,1622,2539,300.775,61.3901,28.6099,98.9146
865,866,8211,1040,2531,323.862,9.56316,80.4368,99.9745
866,867,1982,947,2485,320.698,4.28506,85.7149,99.9296
867,868,13317,2789,2543,308.744,73.3998,16.6002,98.9307
868,869,953,2355,2489,311.571,25.7618,64.2382,99.989
869,870,12724,1290,2538,315.074,50.3399,39.6601,99.9244
870,871,6314,269,2532,147.66899999999995,55.3533,34.6467,99.992
871,872,10661,511,2528,137.151,49.0813,40.9187,99.8877
872,873,6377,1395,2546,131.678,36.5668,53.4332,99.9211
873,874,16578,2598,2558,318.694,25.3908,64.6092,99.8381
874,875,19794,3452,2631,135.317,49.8389,40.1611,99.813
875,876,9532,2077,2564,142.219,65.1754,24.8246,99.7697
876,877,2254,2404,2541,319.106,42.6388,47.3612,99.9739
877,878,1673,2340,2542,137.58700000000002,52.4886,37.5114,99.8702
878,879,5165,1823,2560,144.912,9.58071,80.4193,99.9161
879,880,888,3150,2534,135.38299999999998,21.7346,68.2654,99.9322
880,881,5081,1105,2564,306.9840000000001,45.6041,44.3959,99.9929
881,882,2060,3155,2571,140.881,22.994,67.006,99.9713
882,883,505,2145,2552,315.286,28.1118,61.8882,99.9958
883,884,1071,2469,2560,316.324,25.8095,64.1905,99.4189
884,885,10456,1918,2613,130.96200000000002,54.6873,35.3127,99.6168
885,886,1348,1621,2554,311.29,40.1056,49.8944,99.9895
886,887,5056,534,2586,327.7680000000001,55.487,34.513000000000005,99.993
887,888,10450,3226,2603,318.231,5.70401,84.296,99.9772
888,889,731,646,2568,134.64,28.5892,61.4108,99.9923
889,890,7520,475,2618,136.44799999999998,44.5134,45.4866,99.811
890,891,8729,2220,2593,317.737,57.9236,32.0764,99.9856
891,892,2056,3542,2585,135.045,66.2473,23.7527,99.8486
892,893,566,730,2564,136.134,15.1232,74.8768,99.9989
893,894,811,3574,2593,130.985,69.83800000000001,20.162,99.6454
894,895,7708,2403,2603,142.847,1.50691,88.4931,99.9651
895,896,949,202,2603,332.237,76.2831,13.7169,99.9775
896,897,7642,2973,2627,320.375,1.89773,88.1023,99.6627
897,898,692,220,2590,332.051,76.3782,13.6218,99.9856
898,899,25040,2768,2658,138.591,54.3279,35.6721,99.983
899,900,9976,624,2649,133.672,28.1827,61.8173,99.9378
900,901,943,690,2585,145.15200000000004,54.3969,35.6031,99.9842
901,902,558,2904,2580,298.263,44.9235,45.0765,99.99
902,903,2749,3104,2599,149.933,70.8688,19.1312,99.9904
903,904,9432,1206,2620,141.64700000000005,47.5544,42.4456,99.8209
904,905,1124,2140,2608,136.835,19.739,70.26100000000001,99.9889
905,906,5916,750,2616,307.837,61.7968,28.2032,99.9757
906,907,6781,1722,2631,128.757,59.9922,30.0078,99.9703
907,908,668,1843,2620,324.046,12.3479,77.6521,99.9223
908,909,8050,1447,2630,141.828,48.1526,41.8474,99.9626
909,910,60908,1403,2735,312.6670000000001,30.2659,59.7341,99.9507
910,911,1255,2666,2608,316.025,15.7981,74.2019,99.9888
911,912,3084,2004,2629,311.43,15.5329,74.4671,99.9942
912,913,921,658,2619,141.997,33.4012,56.5988,99.6239
913,914,2088,1794,2635,306.317,39.7328,50.2672,99.9741
914,915,847,393,2621,205.571,87.1704,2.82965,99.972
915,916,1813,3301,2620,313.472,17.574,72.426,99.9606
916,917,787,3520,2620,142.792,51.2181,38.7819,99.982
917,918,23949,2262,2702,311.666,29.6794,60.3206,99.9129
918,919,4722,2497,2646,319.32,20.3967,69.6033,99.9109
919,920,2205,2351,2650,139.795,22.7977,67.2023,99.9816
920,921,6833,2605,2649,134.664,38.1278,51.8722,99.9969
921,922,12152,869,2677,324.498,6.78455,83.2154,99.9885
922,923,8127,408,2669,314.053,34.7421,55.2579,99.9928
923,924,5204,2075,2663,137.641,20.257,69.743,99.9934
924,925,6635,3079,2672,141.768,40.1928,49.8072,99.9935
925,926,1623,2877,2645,311.64,42.0135,47.9865,99.9911
926,927,1858,3146,2654,173.982,83.887,6.11303,99.9833
927,928,525,3543,2649,318.755,50.9405,39.0595,99.9879
928,929,6910,2403,2700,315.765,22.5842,67.4158,98.5715
929,930,1422,3278,2661,314.9770000000001,2.69377,87.3062,99.9943
930,931,3402,1206,2685,141.328,28.3881,61.6119,99.9969
931,932,15082,733,2729,316.146,42.4558,47.5442,99.969
932,933,851,3332,2664,322.301,72.8411,17.1589,99.8627
933,934,11452,1864,2717,136.069,42.1096,47.8904,99.9859
934,935,4815,2531,2702,135.954,0.40583,89.5942,99.9124
935,936,27982,1755,2774,320.829,46.5146,43.4854,99.8188
936,937,7381,1609,2717,136.608,33.4932,56.5068,99.9961
937,938,11359,1976,2722,143.361,64.7875,25.2125,99.9486
938,939,1796,558,2685,314.626,63.4929,26.5071,99.9926
939,940,1819,1155,2693,138.95600000000002,12.9527,77.0473,99.9608
940,941,73201,2948,2899,143.513,33.6789,56.3211,51.0198
941,942,4342,314,2712,134.102,46.1857,43.8143,99.9379
942,943,7994,3213,2719,129.387,36.4693,53.5307,99.9894
943,944,3178,3366,2700,136.576,26.678,63.322,99.9962
944,945,2653,3522,2732,315.82,16.8135,73.1865,99.9804
945,946,735,203,2695,315.425,29.7242,60.2758,99.9574
946,947,4059,253,2712,321.171,59.8752,30.1248,99.9924
947,948,3485,3560,2731,314.4190000000001,17.122,72.878,99.9315
948,949,739,801,2691,143.743,74.321,15.679,99.9934
949,950,2199,3306,2710,126.09,56.0045,33.9955,99.994
950,951,1526,1665,2707,315.218,19.6679,70.3321,99.9786
951,952,32356,2425,2841,306.985,61.1855,28.8145,71.8589
952,953,4628,2698,2734,315.397,50.6273,39.3727,99.957
953,954,2096,487,2705,309.616,54.651,35.34900000000001,99.9911
954,955,2966,2160,2733,312.744,13.8097,76.1903,99.9975
955,956,6272,2085,2738,139.577,4.04073,85.9593,99.9856
956,957,52063,3453,2867,319.243,22.0456,67.9544,99.8723
957,958,19855,553,2772,135.74,15.9316,74.0684,98.7204
958,959,11411,2644,2769,312.219,44.2698,45.7302,99.9588
959,960,1085,3134,2721,123.008,58.4123,31.5877,99.9901
960,961,811,2338,2733,143.765,54.0417,35.9583,99.9884
961,962,3858,388,2737,306.362,58.4881,31.5119,99.9878
962,963,2507,2208,2743,134.886,49.5147,40.4853,99.9947
963,964,10134,927,2783,134.58700000000002,78.8662,11.1338,67.5529
964,965,1686,1171,2737,140.644,7.899889999999999,82.1001,99.985
965,966,10506,3078,2783,313.6140000000001,26.2018,63.7982,98.4196
966,967,4070,3346,2776,308.306,19.5709,70.4291,99.9687
967,968,3458,1236,2791,303.345,51.5645,38.4355,99.9924
968,969,1185,438,2762,308.326,15.3874,74.6126,99.9939
969,970,11547,806,2832,318.85,2.37924,87.6208,99.5411
970,971,7777,1554,2804,314.685,68.6516,21.3484,99.961
971,972,800,203,2777,311.822,28.0254,61.9746,99.8448
972,973,12560,283,2814,138.781,27.6233,62.3767,99.9312
973,974,1685,2375,2781,141.509,52.817,37.183,99.9784
974,975,10987,3222,2800,141.424,54.6229,35.3771,99.9812
975,976,3752,2776,2781,315.411,10.644,79.35600000000002,99.9973
976,977,11889,1091,2821,314.42,8.528319999999999,81.4717,99.4271
977,978,907,2014,2780,313.623,43.6393,46.3607,99.7899
978,979,107477,531,2985,137.774,10.2565,79.7435,65.6311
979,980,854,997,2788,136.833,27.2941,62.7059,99.989
980,981,10533,2236,2831,323.084,14.1827,75.8173,99.3523
981,982,6133,2098,2824,313.212,14.5938,75.4062,99.9882
982,983,2663,2033,2807,144.488,54.6217,35.3783,99.9666
983,984,3791,633,2820,304.9290000000001,63.424,26.576,99.9874
984,985,4499,1184,2834,137.503,4.7834400000000015,85.2166,100.0
985,986,2265,1930,2810,311.454,50.2343,39.7657,99.9565
986,987,8350,2599,2836,139.453,3.65826,86.3417,99.997
987,988,1772,2156,2823,134.02700000000002,55.6942,34.3058,99.9622
988,989,1045,869,2824,138.868,40.6956,49.3044,99.9981
989,990,995,1630,2819,315.44,14.7031,75.2969,99.9929
990,991,2053,3302,2849,304.725,63.3748,26.6252,99.9572
991,992,78467,1512,2993,140.497,30.5921,59.4079,99.2053
992,993,10961,2803,2870,156.409,63.5144,26.4856,99.9892
993,994,11906,702,2874,345.67,84.2978,5.70217,99.9694
994,995,29756,919,2942,301.466,82.1118,7.88818,99.3149
995,996,3595,3048,2856,317.648,35.781,54.219,99.9414
996,997,9255,1775,2877,309.05,45.6125,44.3875,99.9794
997,998,641,2536,2849,287.269,56.2994,33.7006,99.9833
998,999,1037,3109,2854,320.697,13.4186,76.5814,99.7701
999,1000,8823,2005,2878,140.872,58.3274,31.6726,99.387
1000,1001,11951,3184,2902,138.945,62.3047,27.6953,99.9901
1001,1002,14173,1625,2918,140.276,16.7812,73.2188,99.7261
1002,1003,4265,1905,2882,309.393,43.4129,46.5871,99.9777
1003,1004,4815,2682,2883,147.398,52.4784,37.5216,99.9951
1004,1005,6161,2144,2911,311.933,21.5645,68.4355,99.3841
1005,1006,1887,2499,2885,139.69299999999998,26.6801,63.3199,99.9962
1006,1007,1027,236,2883,309.911,17.9487,72.0513,99.9836
1007,1008,13526,299,2961,307.607,45.2596,44.7404,64.5275
1008,1009,3506,1093,2898,137.422,27.717,62.283,99.84
1009,1010,3058,1163,2900,321.31,54.7251,35.2749,99.9955
1010,1011,3245,3093,2900,138.231,36.7502,53.2498,99.9735
1011,1012,4527,2249,2920,299.5,58.36600000000001,31.634,99.9888
1012,1013,839,3258,2903,308.725,28.0607,61.9393,99.9753
1013,1014,4327,2594,2936,290.295,55.3596,34.6404,99.8493
1014,1015,8100,1713,2947,303.811,50.5599,39.4401,99.9917
1015,1016,3556,1884,2947,311.593,23.2221,66.7779,99.9782
1016,1017,958,223,2933,162.576,69.8081,20.1919,99.98
1017,1018,2497,2520,2934,128.249,77.4023,12.5977,99.9893
1018,1019,13802,2772,2970,249.747,81.63600000000002,8.36401,99.8963
1019,1020,3384,2048,2943,313.387,28.7005,61.2995,99.9631
1020,1021,6240,2660,2963,143.09,76.5946,13.4055,99.9801
1021,1022,4569,1955,2976,140.77,2.48663,87.5134,99.9667
1022,1023,9032,1098,2980,321.86,8.497630000000001,81.5024,99.9404
1023,1024,6185,1216,2970,320.725,3.7458,86.2542,99.002
1024,1025,1033,1805,2954,311.1690000000001,30.9636,59.0364,99.9533
1025,1026,564,1772,2949,308.277,45.7727,44.2273,99.9456
1026,1027,45875,2191,3044,148.58,50.0297,39.9703,52.2761
1027,1028,2927,2168,2964,165.977,67.7903,22.2097,99.9937
1028,1029,568,1832,2956,131.389,65.2764,24.7236,99.9473
1029,1030,2756,2421,2969,135.16899999999998,27.1676,62.8324,99.9864
1030,1031,30859,3410,3059,133.91299999999998,24.8071,65.1929,99.9807
1031,1032,9157,3256,2997,270.084,81.9845,8.01552,99.9237
1032,1033,37418,2626,3074,136.033,74.5971,15.4029,99.5627
1033,1034,1607,2020,2975,307.982,36.5995,53.4005,99.9807
1034,1035,798,2874,2974,150.361,62.2345,27.7655,99.9542
1035,1036,17203,3125,3050,137.196,61.5574,28.4426,99.7368
1036,1037,757,208,2989,308.212,10.4207,79.5793,99.8989
1037,1038,5775,1327,3042,309.453,40.0264,49.9736,99.9232
1038,1039,1590,1789,2991,310.681,34.3049,55.6951,99.9259
1039,1040,2860,2480,3007,290.921,53.6512,36.3488,99.9514
1040,1041,588,2575,2992,279.502,81.5283,8.471739999999999,99.9801
1041,1042,846,1862,2997,135.44899999999998,20.085,69.915,99.8259
1042,1043,3346,842,3026,305.29,51.7223,38.2777,99.8853
1043,1044,2050,2846,3022,321.322,30.8765,59.1235,99.9874
1044,1045,34089,1178,3118,316.066,28.8578,61.1422,99.9862
1045,1046,1455,2411,3013,258.15,79.6009,10.3991,99.9925
1046,1047,18365,1887,3085,134.614,62.1206,27.8794,99.8124
1047,1048,9941,3519,3104,315.473,7.35458,82.6454,99.8295
1048,1049,55050,715,3189,136.428,6.54445,83.4556,98.8787
1049,1050,1071,247,3036,147.46,66.7265,23.2735,99.9653
1050,1051,678,201,3036,141.208,53.2913,36.7087,99.98
1051,1052,25783,996,3108,134.874,38.1212,51.8788,99.9423
1052,1053,527,1295,3044,146.95,29.6664,60.3336,99.9582
1053,1054,820,300,3041,141.606,45.0999,44.9001,99.9942
1054,1055,7436,2395,3087,295.941,53.1024,36.8976,99.9701
1055,1056,1303,1551,3068,331.385,67.1684,22.8316,99.9842
1056,1057,12374,235,3161,311.4790000000001,14.6707,75.3293,99.875
1057,1058,563,1452,3066,312.398,37.782,52.218,99.8615
1058,1059,19178,3157,3145,315.106,20.2861,69.7139,97.8665
1059,1060,546,3306,3076,151.519,45.11600000000001,44.88399999999999,99.8837
1060,1061,23026,1494,3197,139.797,5.956169999999998,84.0438,85.314
1061,1062,1714,2454,3106,137.829,26.7262,63.2738,99.9802
1062,1063,7591,1619,3128,315.566,54.3235,35.6765,99.9521
1063,1064,642,1851,3088,310.273,27.1488,62.8512,99.9949
1064,1065,5997,2812,3129,310.334,53.7668,36.2332,99.9917
1065,1066,2356,3054,3114,81.8915,77.1825,12.8175,99.9906
1066,1067,30052,342,3214,136.145,41.9328,48.0672,99.6782
1067,1068,1353,3537,3112,317.605,67.5427,22.4573,99.9903
1068,1069,3215,1375,3126,136.804,57.9214,32.0786,99.939
1069,1070,81325,1937,3270,140.363,1.81724,88.1828,98.5229
1070,1071,21808,2237,3198,145.161,31.9268,58.0732,99.9874
1071,1072,5283,1528,3158,319.087,54.0743,35.9257,99.9781
1072,1073,19888,3332,3216,312.834,12.684,77.316,99.9891
1073,1074,2061,1310,3134,304.017,38.4491,51.5509,99.9883
1074,1075,16519,2951,3190,303.346,77.5625,12.4375,49.5348
1075,1076,3127,2331,3153,140.68,26.2733,63.7267,99.7821
1076,1077,4335,2722,3158,307.948,4.25684,85.7432,99.9975
1077,1078,2894,3236,3164,313.58,30.217,59.783,99.9449
1078,1079,12951,2468,3186,320.45,29.7285,60.2715,99.9866
1079,1080,5335,483,3192,317.9790000000001,55.5916,34.4084,99.9784
1080,1081,1626,2146,3158,321.99,31.235,58.765,99.9948
1081,1082,1688,1808,3161,312.8590000000001,42.4575,47.5425,99.9931
1082,1083,12091,2615,3210,318.17,17.7369,72.2631,99.9902
1083,1084,4185,1257,3196,156.359,79.7402,10.2598,99.9946
1084,1085,944,843,3169,128.312,71.0566,18.9434,99.9895
1085,1086,897,3569,3169,326.617,57.8989,32.1011,99.9411
1086,1087,2349,1328,3186,296.014,65.045,24.955,99.9951
1087,1088,589,804,3175,315.01,5.51849,84.4815,99.9879
1088,1089,2324,2825,3192,140.123,15.9626,74.0374,99.6632
1089,1090,3189,1854,3198,119.736,66.9515,23.0485,99.9962
1090,1091,4181,3549,3237,316.124,32.5542,57.4458,99.9557
1091,1092,916,2130,3200,323.75,11.9808,78.0192,99.9919
1092,1093,6000,953,3239,318.7270000000001,63.9655,26.0345,99.9553
1093,1094,8504,1661,3238,314.725,11.6444,78.3556,99.9315
1094,1095,5206,870,3233,137.74,89.4718,0.528231,99.984
1095,1096,16790,2744,3277,165.62400000000005,81.6888,8.3112,99.9601
1096,1097,3282,1069,3222,140.97899999999996,86.1808,3.81916,99.9913
1097,1098,983,3498,3207,317.038,33.1005,56.8995,99.8521
1098,1099,1761,814,3215,314.25,31.4412,58.5588,99.9959
1099,1100,1732,1012,3224,308.92,21.4472,68.5528,99.9954
1100,1101,23769,3165,3264,300.492,80.2352,9.76481,99.9392
1101,1102,1124,2367,3217,313.943,12.0283,77.9717,99.9972
1102,1103,2433,2896,3227,132.737,70.4807,19.5193,99.9937
1103,1104,684,1364,3224,299.163,74.5296,15.4704,99.9632
1104,1105,3926,3478,3239,141.40200000000004,59.1916,30.8084,99.9237
1105,1106,1908,521,3245,135.358,33.0566,56.9434,99.959
1106,1107,4596,1408,3284,311.482,31.0007,58.9993,99.8312
1107,1108,45668,1004,3384,139.965,9.15495,80.8451,84.5694
1108,1109,1463,2518,3237,322.392,54.6546,35.3454,99.99
1109,1110,6357,2861,3279,313.2940000000001,39.3137,50.6863,99.9591
1110,1111,8899,1323,3284,297.675,64.16199999999999,25.838,99.9442
1111,1112,2702,2375,3258,162.086,70.1684,19.8316,99.9942
1112,1113,3484,3038,3296,318.15,73.2337,16.7663,99.9592
1113,1114,16728,613,3331,317.068,26.5083,63.4917,99.7925
1114,1115,1511,2479,3264,143.14700000000005,21.0121,68.9879,99.9972
1115,1116,576,1023,3261,314.319,9.83764,80.1624,99.8694
1116,1117,1589,2313,3274,311.682,60.5952,29.4048,99.983
1117,1118,10446,2506,3342,233.996,80.805,9.19503,99.9381
1118,1119,16783,3463,3350,313.143,50.6874,39.3126,99.9436
1119,1120,6019,2441,3307,121.335,71.842,18.158,99.9614
1120,1121,2521,2247,3281,139.754,4.2039300000000015,85.7961,99.9908
1121,1122,7590,1593,3319,306.401,30.0868,59.9132,99.9916
1122,1123,2742,2642,3283,248.63,80.5941,9.40588,99.989
1123,1124,3609,225,3296,191.211,75.8855,14.1145,99.987
1124,1125,1477,2940,3296,317.867,58.8466,31.1534,99.9097
1125,1126,11692,2165,3341,145.66,19.3344,70.6656,98.7624
1126,1127,3098,2354,3307,314.267,8.44995,81.55,99.996
1127,1128,5833,3539,3368,310.331,51.6588,38.3412,99.8691
1128,1129,18977,780,3385,317.247,2.6160400000000004,87.384,99.8717
1129,1130,18621,1450,3381,136.129,26.0653,63.9347,84.3182
1130,1131,12129,3331,3358,130.42,66.9402,23.0598,99.9837
1131,1132,37967,512,3449,143.125,39.3548,50.6452,64.672
1132,1133,550,2658,3313,143.83100000000005,23.8586,66.1414,99.9976
1133,1134,2139,261,3330,137.362,34.9256,55.0744,99.9521
1134,1135,2093,886,3336,323.971,18.8134,71.1866,99.983
1135,1136,5796,530,3353,136.27100000000002,22.3329,67.6671,99.998
1136,1137,2921,3410,3366,144.98,24.2014,65.7986,99.9914
1137,1138,6800,2823,3392,317.3640000000001,6.31094,83.6891,99.9684
1138,1139,9944,1192,3380,321.637,23.8673,66.1327,99.2892
1139,1140,3954,1633,3370,321.258,7.77377,82.2262,99.9946
1140,1141,946,2247,3334,151.20600000000005,23.281,66.719,99.6314
1141,1142,47648,2949,3488,310.651,82.5966,7.40335,57.9554
1142,1143,2635,1085,3350,148.096,69.268,20.732,99.9697
1143,1144,15212,3110,3402,136.73,8.99918,81.0008,99.8413
1144,1145,1904,3138,3345,137.3,19.966,70.03399999999999,99.9525
1145,1146,1151,1527,3351,323.702,6.66573,83.3343,99.9953
1146,1147,6092,2343,3361,274.812,80.6154,9.38457,99.9733
1147,1148,2922,2629,3355,241.3,79.6841,10.3159,99.99
1148,1149,6599,1711,3376,311.922,41.7202,48.2798,99.9919
1149,1150,11173,1327,3402,140.764,0.944389,89.0556,99.8747
1150,1151,4278,978,3387,143.811,69.1078,20.8922,99.9825
1151,1152,3785,2035,3373,164.614,73.4746,16.5254,99.9905
1152,1153,821,2247,3363,129.347,57.4652,32.5348,99.9094
1153,1154,1058,1116,3379,322.088,7.5880800000000015,82.4119,99.9758
1154,1155,1552,2708,3374,139.439,41.3962,48.6038,99.994
1155,1156,14396,1050,3455,308.77,54.9496,35.0504,99.8698
1156,1157,7866,3256,3404,314.908,31.8032,58.1968,99.9924
1157,1158,22728,278,3446,286.274,82.3893,7.61074,76.8815
1158,1159,5103,2762,3407,310.885,45.1451,44.8549,99.9575
1159,1160,1218,1502,3382,140.893,16.4579,73.5421,99.9203
1160,1161,1729,3159,3387,307.865,79.7894,10.2106,99.9737
1161,1162,4393,585,3407,165.571,78.9681,11.0319,99.9948
1162,1163,13447,2254,3444,261.545,80.8382,9.16176,99.9251
1163,1164,894,2176,3382,132.292,9.03999,80.96,99.9893
1164,1165,3069,2674,3408,310.344,52.7675,37.2325,99.7551
1165,1166,2727,2597,3408,310.127,53.8421,36.1579,99.9852
1166,1167,1288,2144,3405,273.645,78.9374,11.0626,99.4812
1167,1168,46259,1562,3577,330.247,67.0408,22.9592,99.8764
1168,1169,895,2377,3402,138.32399999999998,0.0996094,89.9004,99.975
1169,1170,520,419,3406,141.874,1.16364,88.8364,99.9889
1170,1171,11917,2405,3486,319.539,8.42341,81.5766,99.1538
1171,1172,1176,3179,3413,148.097,76.0928,13.9072,99.9884
1172,1173,5865,1788,3432,322.423,64.6151,25.3849,99.9894
1173,1174,895,2012,3413,142.47,3.87267,86.1273,99.8528
1174,1175,7981,1249,3446,295.2,83.8372,6.1628,99.9589
1175,1176,1429,1658,3429,216.057,79.6971,10.3029,99.9809
1176,1177,12021,2510,3458,309.828,22.8265,67.1735,99.9668
1177,1178,4338,2321,3474,134.325,57.927,32.073,99.9101
1178,1179,1060,1617,3431,139.299,17.5078,72.4922,99.9981
1179,1180,3026,2166,3455,321.047,36.8639,53.1361,99.9882
1180,1181,2418,3075,3448,319.72,0.220444,89.7796,99.9962
1181,1182,2015,2004,3450,320.006,18.3041,71.6959,99.5507
1182,1183,19884,2717,3504,142.763,4.24817,85.7518,99.761
1183,1184,1384,3556,3451,319.371,32.5927,57.4073,99.962
1184,1185,2293,3398,3453,156.481,51.9444,38.0556,99.9896
1185,1186,3068,2074,3453,210.777,81.0786,8.92136,99.9829
1186,1187,9050,401,3509,303.052,83.21,6.7900399999999985,99.6138
1187,1188,7892,1925,3496,126.768,54.3444,35.6556,99.619
1188,1189,887,3131,3462,166.918,75.9358,14.0642,99.947
1189,1190,9189,1823,3495,134.673,56.6111,33.3889,99.6885
1190,1191,4188,2597,3498,309.778,62.6976,27.3024,99.9711
1191,1192,1775,3449,3477,140.168,1.05,88.95,99.8674
1192,1193,18443,1684,3536,325.038,10.6843,79.3157,99.9358
1193,1194,1955,1389,3485,321.393,16.9637,73.0363,99.9961
1194,1195,887,3314,3469,318.219,9.29694,80.7031,99.92
1195,1196,1701,792,3493,296.695,48.0623,41.9377,99.8928
1196,1197,27273,1201,3545,318.922,27.8013,62.1987,57.2472
1197,1198,889,3361,3480,136.062,18.2102,71.7898,99.987
1198,1199,14289,729,3582,313.528,7.15164,82.8484,99.7385
1199,1200,9967,3208,3519,142.481,51.9453,38.0547,99.9622
1200,1201,810,3563,3498,303.043,59.3118,30.6882,99.9194
1201,1202,14986,2051,3565,307.236,42.8922,47.1078,99.8756
1202,1203,2099,1998,3513,135.96200000000002,6.1914099999999985,83.8086,99.9554
1203,1204,5716,2145,3526,212.076,81.0273,8.972710000000003,99.5958
1204,1205,7298,3510,3540,309.378,61.3872,28.6128,99.9514
1205,1206,42946,3387,3643,320.938,12.45,77.55,99.0324
1206,1207,613,1358,3515,134.21,48.1032,41.8968,99.9045
1207,1208,1529,1425,3522,294.884,61.8142,28.1858,99.47
1208,1209,26175,385,3621,313.702,2.0042,87.9958,99.2044
1209,1210,9485,3140,3602,144.291,25.6177,64.3823,99.2275
1210,1211,11857,824,3614,129.608,69.4963,20.5037,99.9457
1211,1212,10857,2215,3574,144.011,4.28678,85.7132,99.8921
1212,1213,2670,1172,3567,317.336,11.3779,78.6221,99.9701
1213,1214,3343,641,3557,134.316,6.83864,83.1614,99.991
1214,1215,1641,2321,3550,320.328,30.8084,59.1916,99.9812
1215,1216,2022,1344,3562,141.388,9.34969,80.6503,99.9832
1216,1217,3090,251,3566,318.934,49.5965,40.4035,99.9657
1217,1218,2660,1855,3562,315.408,4.5684,85.4316,99.979
1218,1219,11674,2750,3590,304.838,64.1977,25.8023,99.7867
1219,1220,8258,2408,3598,160.406,59.8342,30.1658,99.9326
1220,1221,12457,566,3623,334.551,78.303,11.697,99.9157
1221,1222,573,2551,3565,143.795,8.83605,81.1639,99.9915
1222,1223,5951,3251,3609,322.027,53.1822,36.8178,99.9913
1223,1224,2996,940,3588,319.716,21.1963,68.8037,99.968
1224,1225,1618,1801,3587,135.47799999999998,14.1883,75.8117,99.9937
1225,1226,26529,1896,3698,139.569,18.7979,71.2021,99.0086
1226,1227,1028,679,3585,272.918,81.3792,8.62079,99.9823
1227,1228,935,212,3591,308.666,0.548561,89.4514,99.9734
1228,1229,6736,3080,3633,316.48,6.40481,83.5952,99.9776
1229,1230,1135,2286,3596,313.988,27.4135,62.5865,99.9747
1230,1231,10442,2321,3647,315.268,13.3441,76.6559,99.9793
1231,1232,4628,1425,3605,321.177,74.10300000000002,15.897,99.9611
1232,1233,501,183,3591,203.579,70.0764,19.9236,99.9784
1233,1234,2123,1769,3616,141.506,31.7978,58.2022,99.9826
1234,1235,2181,3018,3608,313.034,28.7023,61.2977,98.932
1235,1236,2720,1024,3615,132.565,54.5043,35.4957,99.9897
1236,1237,2298,2624,3604,149.528,23.6521,66.3479,99.9032
1237,1238,2849,2556,3616,312.314,19.5575,70.4425,99.9949
1238,1239,2475,1199,3623,326.148,8.36717,81.6328,99.9954
1239,1240,2461,3548,3654,322.0540000000001,7.61844,82.3816,99.7883
1240,1241,15328,2486,3688,315.219,44.3761,45.6239,99.9725
1241,1242,1341,3507,3617,138.859,10.134,79.866,99.9952
1242,1243,617,1328,3609,146.16899999999995,1.53413,88.4659,99.9586
1243,1244,34908,968,3691,140.375,1.33154,88.6685,98.5052
1244,1245,19492,1360,3682,143.845,0.057296800000000016,89.9427,97.8524
1245,1246,2918,3200,3646,141.355,11.577,78.423,99.998
1246,1247,5793,1990,3647,327.511,60.0131,29.9869,99.9904
1247,1248,1142,181,3625,320.939,49.1271,40.8729,99.8941
1248,1249,1718,1074,3625,143.41,45.1616,44.8384,99.9732
1249,1250,2633,2659,3640,139.668,17.0179,72.9821,99.7826
1250,1251,3310,249,3648,292.206,58.1865,31.8135,99.9959
1251,1252,892,2179,3630,148.048,19.2733,70.7267,99.9988
1252,1253,1036,2834,3639,310.084,38.0048,51.9952,99.8854
1253,1254,1083,762,3637,305.403,67.9066,22.0934,99.9977
1254,1255,1649,1817,3647,313.418,0.342285,89.6577,99.998
1255,1256,1998,2996,3646,312.899,5.16674,84.8333,99.9939
1256,1257,2918,2238,3654,132.77200000000002,30.6555,59.3445,99.9924
1257,1258,1069,2722,3654,138.299,20.2229,69.7771,99.2403
1258,1259,10175,2145,3685,162.126,74.7108,15.2892,99.9713
1259,1260,6015,2943,3682,291.515,71.0322,18.9678,99.9162
1260,1261,36326,2801,3777,322.336,1.8619900000000005,88.13799999999998,98.6134
1261,1262,7426,202,3743,138.966,2.09437,87.9056,99.8564
1262,1263,1186,1712,3664,316.504,0.15173299999999998,89.8483,99.9778
1263,1264,790,2559,3658,144.92600000000004,50.5609,39.4391,99.9955
1264,1265,26968,684,3784,139.94299999999998,0.605476,89.3945,99.7532
1265,1266,3759,1212,3677,140.045,22.4044,67.5956,99.9727
1266,1267,1343,1767,3666,302.624,85.235,4.76498,99.9896
1267,1268,26066,2638,3747,141.003,21.9929,68.0071,99.6874
1268,1269,15832,314,3729,140.31799999999998,16.5496,73.4504,99.849
1269,1270,776,224,3682,293.061,54.1294,35.8706,99.9957
1270,1271,2378,3023,3703,315.882,40.4266,49.5734,99.9964
1271,1272,2515,2384,3694,134.826,57.1888,32.8112,99.9717
1272,1273,6559,2043,3715,130.19799999999998,54.6093,35.3907,99.9102
1273,1274,2630,3494,3704,260.621,83.3319,6.66812,99.9703
1274,1275,5870,498,3720,144.996,12.5482,77.4518,99.9437
1275,1276,903,3157,3697,309.881,36.584,53.416,99.9758
1276,1277,13957,3280,3747,318.1690000000001,58.1039,31.8961,99.8739
1277,1278,9492,1702,3728,314.301,4.58823,85.4118,99.9968
1278,1279,1526,1797,3700,143.857,30.3369,59.6631,99.9961
1279,1280,3772,1136,3720,130.358,60.8209,29.1791,99.9898
1280,1281,4087,1200,3739,140.92700000000005,33.7652,56.2348,99.9911
1281,1282,14960,3174,3811,150.606,30.6518,59.3482,99.5546
1282,1283,3682,1469,3749,142.441,19.5163,70.4837,99.9639
1283,1284,4949,2254,3753,294.842,70.8134,19.1866,99.9472
1284,1285,8805,3067,3764,143.90200000000004,35.8094,54.1906,99.9891
1285,1286,896,1266,3724,323.171,14.5024,75.4976,99.9975
1286,1287,576,1518,3716,144.143,40.6338,49.3662,99.9773
1287,1288,12673,722,3781,144.08100000000005,21.6803,68.3197,99.9801
1288,1289,661,3131,3728,147.636,7.796839999999999,82.2032,99.9981
1289,1290,607,1358,3734,151.773,64.5273,25.4727,99.2766
1290,1291,4335,2171,3758,314.4770000000001,25.5907,64.4093,99.4046
1291,1292,8315,2970,3789,316.584,21.4663,68.5337,99.9229
1292,1293,13669,424,3837,310.643,67.3743,22.6257,54.3896
1293,1294,643,3514,3737,137.8,24.2433,65.7567,99.9893
1294,1295,1123,2321,3737,140.92,2.18218,87.8178,99.9951
1295,1296,3273,1082,3788,210.614,82.9293,7.070710000000001,99.7811
1296,1297,4114,1811,3753,294.032,78.3888,11.6112,99.9843
1297,1298,6073,2430,3771,308.701,55.1171,34.8829,99.8247
1298,1299,9644,1583,3778,317.362,11.4976,78.5024,99.9166
1299,1300,2508,1503,3782,332.0019999999999,59.5986,30.4014,99.9714
1300,1301,8904,3535,3817,312.707,70.044,19.956,99.924
1301,1302,5567,903,3800,312.689,11.4348,78.5652,99.9082
1302,1303,1514,3139,3761,315.34,80.1652,9.83481,99.9881
1303,1304,26401,549,3851,298.6740000000001,77.2724,12.7276,99.9342
1304,1305,581,1318,3756,323.139,14.1029,75.8971,99.9962
1305,1306,2384,1260,3779,312.064,74.5324,15.4676,99.9905
1306,1307,5210,1125,3801,323.306,3.36986,86.6301,99.9822
1307,1308,5051,2044,3784,316.901,62.5507,27.4493,99.9905
1308,1309,10768,1017,3831,193.567,87.6714,2.32864,99.9137
1309,1310,3360,2316,3785,316.161,4.01896,85.98100000000002,99.9962
1310,1311,7632,1376,3800,135.69799999999998,18.0691,71.9309,99.5307
1311,1312,5977,819,3806,125.824,75.9214,14.0786,99.9882
1312,1313,8301,1643,3876,306.303,77.1424,12.8576,99.8203
1313,1314,4483,1204,3815,135.673,5.6624300000000005,84.3376,99.9952
1314,1315,47619,2003,3980,317.502,18.307,71.693,96.7828
1315,1316,15661,1756,3830,309.384,32.4315,57.5685,99.9771
1316,1317,1510,2383,3799,135.31799999999998,44.8467,45.1533,99.9126
1317,1318,805,246,3796,80.0544,84.1512,5.84881,99.9987
1318,1319,3002,2119,3813,139.569,40.3992,49.6008,99.9978
1319,1320,4932,2519,3822,137.885,10.8899,79.1101,99.9959
1320,1321,46663,2237,3935,135.222,5.89957,84.1004,99.0726
1321,1322,23494,3391,3893,318.2870000000001,39.3372,50.6628,99.7689
1322,1323,1067,272,3817,142.606,80.905,9.09504,99.9815
1323,1324,6724,325,3849,320.595,5.5493,84.4507,99.9849
1324,1325,793,1285,3817,296.149,71.2432,18.7568,99.9914
1325,1326,2752,2364,3842,293.436,54.9133,35.0867,99.9891
1326,1327,20082,2886,3932,316.255,32.0529,57.9471,99.9591
1327,1328,525,1044,3825,322.113,0.199738,89.8003,99.9951
1328,1329,91526,1347,4058,140.179,1.85712,88.1429,99.6653
1329,1330,851,2425,3834,302.98,56.9733,33.0267,99.8892
1330,1331,576,3182,3827,143.60299999999995,38.095,51.905,99.9847
1331,1332,2450,2839,3842,142.506,42.1055,47.8945,99.988
1332,1333,843,3302,3840,138.78799999999998,30.6897,59.3103,99.7136
1333,1334,2049,859,3854,298.083,59.6346,30.3654,99.9962
1334,1335,5197,2071,3862,135.634,42.2781,47.7219,99.8701
1335,1336,3779,233,3856,204.782,86.3261,3.67394,99.9928
1336,1337,893,2675,3847,315.378,11.0241,78.9759,99.9668
1337,1338,4469,2977,3880,312.116,36.6485,53.3515,99.9894
1338,1339,2684,3033,3867,317.9290000000001,13.6253,76.3747,99.9648
1339,1340,29862,3217,3943,138.422,28.9515,61.0485,99.9797
1340,1341,44557,2642,4003,139.912,33.1819,56.8181,98.388
1341,1342,4589,1290,3870,149.982,35.7591,54.2409,99.9284
1342,1343,643,1360,3858,144.78,38.0917,51.9083,99.976
1343,1344,21292,1135,3926,320.475,28.8892,61.1108,99.9199
1344,1345,877,1896,3865,304.226,24.4448,65.5552,99.9947
1345,1346,9504,2448,3907,321.052,20.491,69.509,99.9281
1346,1347,5760,933,3901,305.975,57.9616,32.0384,99.9094
1347,1348,1481,1690,3889,286.257,68.5151,21.4849,99.9964
1348,1349,11308,1833,3923,137.38299999999998,25.6078,64.3922,99.9775
1349,1350,3861,2716,3910,326.962,12.7458,77.2542,99.9695
1350,1351,9274,1587,3945,152.512,38.2013,51.7987,99.9972
1351,1352,713,375,3888,330.036,55.6465,34.3535,99.9606
1352,1353,11525,737,3962,163.592,68.6304,21.3696,99.7577
1353,1354,1372,195,3916,167.312,64.2442,25.7558,99.9804
1354,1355,7937,268,3936,170.40900000000005,63.4238,26.5762,99.9406
1355,1356,31433,576,3990,318.529,14.0664,75.9336,98.3557
1356,1357,8968,1263,3956,141.22799999999995,13.2031,76.7969,99.3715
1357,1358,2197,3064,3926,306.586,65.9189,24.0811,99.9322
1358,1359,2631,3516,3930,320.172,21.107,68.893,99.9718
1359,1360,3419,990,3933,317.981,30.0526,59.9474,99.9865
1360,1361,3499,2098,3947,314.469,14.8755,75.1245,99.9771
1361,1362,3215,1702,3959,143.235,24.0654,65.9346,99.9978
1362,1363,5922,861,3974,310.715,23.2648,66.7352,99.9897
1363,1364,9105,1766,3998,132.664,0.631195,89.3688,99.9803
1364,1365,8493,3035,3982,138.959,30.8692,59.1308,99.8257
1365,1366,1028,3571,3940,150.453,61.4956,28.5044,99.9807
1366,1367,872,3105,3952,148.987,34.0065,55.9935,99.596
1367,1368,1640,2803,3963,318.807,5.2284,84.7716,99.9685
1368,1369,5252,2403,3985,323.988,45.8361,44.1639,99.9854
1369,1370,4477,2145,3990,173.313,76.1437,13.8563,99.9867
1370,1371,6712,2546,4004,306.368,53.7763,36.2237,99.9606
1371,1372,1380,1920,3972,136.05100000000002,34.0303,55.9697,99.9733
1372,1373,2536,3520,3984,314.6740000000001,31.3492,58.6508,99.9802
1373,1374,3055,928,3996,149.38299999999995,65.952,24.048,99.7524
1374,1375,7495,991,4022,143.25,33.2789,56.7211,99.9224
1375,1376,3358,239,4007,151.525,65.8927,24.1073,99.9424
1376,1377,2486,3407,3997,132.082,39.9915,50.0085,99.9924
1377,1378,965,1658,3992,147.46200000000005,25.6651,64.3349,99.9889
1378,1379,3544,3473,4016,308.59,23.9191,66.0809,99.9625
1379,1380,9307,2497,4052,135.45600000000002,15.7247,74.2753,99.9609
1380,1381,60953,2459,4185,135.989,32.5335,57.4665,52.0764
1381,1382,8077,1864,4043,311.35,73.3072,16.6928,95.5388
1382,1383,6981,1190,4046,154.977,12.7817,77.2183,99.9551
1383,1384,706,2989,3998,152.257,51.4931,38.5069,99.9481
1384,1385,844,2796,4005,150.26,59.5915,30.4085,99.9696
1385,1386,51849,3195,4105,141.4,38.008,51.992,99.4354
1386,1387,88968,394,4189,140.106,24.6083,65.3917,86.5075
1387,1388,5339,1566,4043,134.47899999999998,0.810135,89.1899,99.9796
1388,1389,647,614,4011,327.986,83.3079,6.69211,99.6049
1389,1390,613,256,4015,169.868,62.2469,27.7531,99.9494
1390,1391,156300,2920,4287,308.888,38.332,51.668,96.6754
1391,1392,3820,1096,4039,145.447,80.3983,9.60169,99.9038
1392,1393,3292,1507,4058,314.205,47.1361,42.8639,99.962
1393,1394,760,3575,4047,137.10399999999998,12.0297,77.9703,99.7908
1394,1395,774,1689,4039,300.034,72.5788,17.4212,99.8452
1395,1396,515,1634,4031,295.48,43.012,46.988,99.8791
1396,1397,4015,3501,4071,294.6020000000001,71.9979,18.0021,99.83
1397,1398,5442,870,4059,134.975,68.8,21.2,99.9785
1398,1399,1026,602,4042,153.675,71.6355,18.3645,99.9908
1399,1400,534,3006,4059,312.368,56.4604,33.5396,99.2776
1400,1401,12100,558,4145,318.218,8.17947,81.8205,99.689
1401,1402,3285,2782,4067,136.96200000000002,33.1872,56.8128,99.8666
1402,1403,16226,3483,4127,141.91899999999995,12.0255,77.9745,99.4676
1403,1404,6656,1019,4113,137.632,7.18858,82.8114,99.9855
1404,1405,13505,1649,4116,140.579,28.356,61.644,99.9858
1405,1406,5684,2477,4104,138.245,41.2417,48.7583,99.9472
1406,1407,2389,1728,4073,136.763,21.7188,68.2812,99.9977
1407,1408,1734,619,4073,347.699,78.9951,11.0049,99.9952
1408,1409,7130,1098,4113,140.092,27.2475,62.7525,99.9819
1409,1410,37528,807,4183,316.947,27.2669,62.7331,99.6266
1410,1411,2615,2718,4102,317.545,21.7261,68.2739,99.9961
1411,1412,2256,1537,4120,142.67,25.8899,64.1101,99.9914
1412,1413,7544,1816,4123,196.0,79.6715,10.3285,99.9915
1413,1414,1900,934,4116,317.575,51.1748,38.8252,99.9049
1414,1415,5813,604,4151,137.408,57.56399999999999,32.436,99.9836
1415,1416,15090,1915,4198,324.205,56.0625,33.9375,83.54299999999998
1416,1417,1835,189,4134,139.072,17.0682,72.9318,99.9813
1417,1418,2141,878,4117,137.17,58.7255,31.2745,99.9918
1418,1419,1961,1734,4128,310.74,70.7217,19.2783,99.9365
1419,1420,2274,1491,4140,132.165,2.39915,87.6009,99.9886
1420,1421,6181,2030,4154,314.951,37.7975,52.2025,99.9809
1421,1422,7615,2152,4163,135.707,64.9011,25.0989,99.9828
1422,1423,1146,1180,4132,318.507,21.4899,68.5101,99.9755
1423,1424,1074,2211,4129,132.57299999999998,29.3893,60.6107,97.9714
1424,1425,6436,1579,4183,297.006,73.131,16.869,99.9833
1425,1426,2896,967,4167,143.447,39.4722,50.5278,99.9955
1426,1427,4615,3347,4182,295.591,69.6988,20.3012,99.9831
1427,1428,45356,3352,4283,320.654,14.2323,75.7677,99.8027
1428,1429,1523,1519,4180,134.077,36.7003,53.2997,99.9951
1429,1430,1549,688,4178,318.902,10.7877,79.2123,99.9923
1430,1431,1982,1800,4177,136.611,60.4982,29.5018,99.9901
1431,1432,20116,292,4227,236.983,85.0623,4.93769,99.9821
1432,1433,646,1437,4172,315.256,48.1927,41.8073,99.9521
1433,1434,56213,1759,4306,138.914,12.8522,77.1478,98.5135
1434,1435,2922,1024,4196,317.655,52.9128,37.0872,99.8932
1435,1436,8724,2274,4220,333.18,64.1981,25.8019,99.9863
1436,1437,2236,1476,4202,134.02200000000002,3.26545,86.7346,99.639
1437,1438,2545,745,4201,181.54,80.4719,9.52813,99.9962
1438,1439,1751,1371,4197,210.708,82.228,7.772010000000001,99.9961
1439,1440,6951,1313,4228,137.866,35.9573,54.0427,99.9721
1440,1441,1581,2093,4202,311.555,6.49016,83.5098,99.9942
1441,1442,743,2689,4204,144.38299999999995,22.4598,67.5402,99.9868
1442,1443,4926,3538,4242,315.493,2.13988,87.8601,99.9058
1443,1444,23752,1489,4308,143.002,31.7567,58.2433,98.4723
1444,1445,7897,204,4298,316.894,9.29412,80.7059,99.9408
1445,1446,1250,3210,4217,321.706,15.8149,74.1851,99.9942
1446,1447,756,2023,4213,310.337,5.79828,84.2017,99.9564
1447,1448,44764,2091,4309,256.47,74.6188,15.3812,99.9733
1448,1449,1074,2352,4228,147.19799999999995,41.7601,48.2399,99.9819
1449,1450,41123,692,4355,140.636,37.7251,52.2749,99.9892
1450,1451,5874,1081,4263,145.612,28.7514,61.2486,99.9907
1451,1452,604,2378,4238,133.345,21.7547,68.2453,99.9933
1452,1453,13365,980,4305,210.133,80.4589,9.54106,97.4783
1453,1454,2348,2708,4256,311.124,43.7108,46.2892,99.9949
1454,1455,2521,1542,4261,143.732,13.6961,76.3039,99.8764
1455,1456,3988,2454,4314,146.607,40.5712,49.4288,99.9656
1456,1457,7470,544,4319,314.725,6.78383,83.2162,99.9529
1457,1458,9538,2291,4313,325.213,8.926960000000003,81.07300000000002,99.9973
1458,1459,982,1601,4284,310.4840000000001,84.7435,5.25654,99.9838
1459,1460,32840,2400,4411,315.293,18.5192,71.4808,99.4125
1460,1461,7784,1293,4308,324.401,58.362,31.638,99.9154
1461,1462,6073,3196,4333,169.74,81.7502,8.249839999999999,99.9579
1462,1463,2523,783,4317,183.805,76.0512,13.9488,99.9849
1463,1464,1052,1211,4311,144.871,28.55,61.45,99.9042
1464,1465,1917,868,4305,135.93,35.2351,54.7649,99.9779
1465,1466,3792,3536,4326,284.226,71.8481,18.1519,99.9379
1466,1467,68920,1320,4475,140.716,0.250969,89.749,99.1212
1467,1468,5147,3478,4340,282.811,72.9892,17.0108,99.9914
1468,1469,16530,1114,4360,317.061,26.3663,63.6337,99.9862
1469,1470,19411,2625,4381,145.306,14.4633,75.5367,99.9934
1470,1471,819,840,4333,314.346,57.185,32.815,99.9765
1471,1472,605,1240,4347,329.279,76.1063,13.8937,99.9957
1472,1473,2458,871,4362,144.611,53.6176,36.3824,99.9929
1473,1474,1625,2523,4387,143.537,36.156,53.844,99.9945
1474,1475,5634,1629,4421,317.712,19.6869,70.3131,99.9918
1475,1476,913,235,4375,151.433,78.0248,11.9752,99.9881
1476,1477,69999,3230,4512,320.055,13.7959,76.2041,97.5901
1477,1478,2270,976,4397,313.06,27.6444,62.3556,99.979
1478,1479,7246,2184,4412,150.513,62.591,27.409,99.9916
1479,1480,5144,1037,4425,314.192,33.7838,56.2162,99.9503
1480,1481,19826,897,4469,147.366,9.52802,80.472,80.6765
1481,1482,5033,205,4426,310.758,29.8886,60.1114,99.9818
1482,1483,2741,471,4432,316.466,6.47771,83.5223,99.8852
1483,1484,3936,552,4418,326.337,7.91522,82.0848,99.9687
1484,1485,3616,1538,4424,139.83,44.2739,45.7261,99.9949
1485,1486,1110,1916,4396,321.092,23.424,66.57600000000001,99.9608
1486,1487,1558,3228,4408,205.568,79.9095,10.0905,99.9915
1487,1488,1695,505,4434,139.922,23.7936,66.2064,99.9581
1488,1489,131357,1866,4541,321.02,16.8743,73.1257,86.0815
1489,1490,1005,3271,4414,321.498,27.3959,62.6041,99.9183
1490,1491,1504,3311,4422,203.251,80.773,9.22701,99.985
1491,1492,6881,2255,4461,319.187,56.3496,33.6504,99.9106
1492,1493,18022,1507,4554,183.602,81.3515,8.64852,98.9929
1493,1494,6119,278,4448,141.70600000000005,49.0541,40.9459,99.9263
1494,1495,6608,3540,4506,324.068,7.61282,82.3872,99.8762
1495,1496,44371,2635,4544,143.183,52.304,37.696,71.5339
1496,1497,5150,417,4475,309.195,15.7636,74.2364,99.4318
1497,1498,31284,604,4521,320.688,21.8446,68.1554,90.0186
1498,1499,5516,1126,4471,320.692,56.8764,33.1236,99.9815
1499,1500,4219,347,4484,314.219,11.2295,78.7705,99.228
1500,1501,2550,2978,4469,145.161,19.0147,70.9853,99.9704
1501,1502,1421,2736,4461,152.107,61.445,28.555,99.9958
1502,1503,9190,1059,4527,143.378,27.9487,62.0513,99.9248
1503,1504,2003,1183,4489,322.421,74.8323,15.1677,99.9511
1504,1505,1636,3282,4490,191.577,78.262,11.738,99.9374
1505,1506,1674,2151,4478,312.775,9.12518,80.8748,99.9809
1506,1507,4987,3457,4554,314.972,41.1431,48.8569,99.8936
1507,1508,4314,2205,4509,313.334,37.1683,52.8317,99.8879
1508,1509,10745,260,4538,142.15,37.8754,52.1246,65.9282
1509,1510,790,2322,4498,326.122,23.5153,66.4847,99.738
1510,1511,830,2927,4496,145.192,32.5545,57.4455,99.9332
1511,1512,3915,2365,4529,320.221,8.59782,81.4022,99.9451
1512,1513,1077,385,4522,136.57299999999998,22.9859,67.0141,99.9918
1513,1514,659,2961,4532,138.00799999999998,7.32613,82.6739,99.9855
1514,1515,3589,734,4549,302.445,44.3964,45.6036,99.8965
1515,1516,25682,2868,4631,134.243,49.3406,40.6594,76.7387
1516,1517,23134,936,4600,319.283,19.0099,70.9901,99.4422
1517,1518,609,3264,4534,219.34,81.0129,8.98708,99.9856
1518,1519,516,2142,4551,136.162,0.191452,89.8085,99.7628
1519,1520,3692,2432,4556,317.759,49.3495,40.6505,99.8471
1520,1521,1695,3344,4556,132.338,73.6324,16.3676,99.6531
1521,1522,2251,1525,4560,143.291,6.9889100000000015,83.0111,99.9799
1522,1523,19019,2252,4629,314.192,14.0479,75.9521,99.6296
1523,1524,11355,443,4592,138.506,9.66158,80.3384,99.1621
1524,1525,9651,2294,4591,142.063,12.4064,77.5936,99.9933
1525,1526,4286,320,4599,314.12,21.2455,68.7545,99.9931
1526,1527,646,1153,4564,139.126,50.363,39.637,99.9943
1527,1528,2388,1200,4581,135.434,66.7607,23.2393,99.9928
1528,1529,11403,3353,4633,315.779,42.8327,47.1673,99.9403
1529,1530,11576,1124,4611,6.79172,85.2168,4.78319,99.9604
1530,1531,10387,2468,4635,134.572,78.4395,11.5605,99.9308
1531,1532,1542,2828,4593,317.747,5.90038,84.0996,99.9974
1532,1533,5944,768,4615,307.945,45.3585,44.6415,99.9932
1533,1534,16426,3482,4658,318.082,16.6735,73.3265,99.9539
1534,1535,1567,1391,4620,308.9790000000001,14.1716,75.8284,99.9863
1535,1536,1489,2781,4609,150.247,83.6466,6.35339,99.9909
1536,1537,8129,605,4628,328.95,71.165,18.835,99.9786
1537,1538,3153,3008,4646,133.881,60.0041,29.9959,99.9756
1538,1539,4004,1455,4638,143.714,64.0967,25.9033,99.9876
1539,1540,1173,831,4630,324.684,4.80566,85.1943,99.9909
1540,1541,8332,3213,4671,316.368,15.8646,74.1354,99.9819
1541,1542,7467,2603,4660,309.839,53.584,36.416,99.9858
1542,1543,2797,3167,4646,319.16,53.4746,36.5254,99.9957
1543,1544,4439,3073,4654,316.034,42.5634,47.4366,99.9943
1544,1545,2112,2128,4655,308.957,1.4501,88.5499,99.9879
