,Grain No.,Size [Pixel],center x-coordinate,center y-coordinate,mean azimuth [degree],mean latitude [degree],mean colatitude [degree],Regelungsgrad [%]
0,1,24017,312,237,10.6582,66.5326,23.4674,99.935
1,2,5867,493,167,24.3825,21.4721,68.5279,99.6837
2,3,24394,150,254,203.732,10.5399,79.4601,99.9916
3,4,1945,214,162,203.412,25.0568,64.9432,99.9803
4,5,11700,698,189,305.58,72.154,17.846,99.9769
5,6,38922,963,217,25.8592,26.2094,63.7906,78.0256
6,7,1650,590,163,215.34,34.9491,55.0509,99.9825
7,8,3036,1176,175,208.80900000000003,1.42259,88.5774,99.9953
8,9,16359,1264,235,26.4613,1.80164,88.1984,99.9924
9,10,37547,1325,315,29.986,7.7177,82.2823,98.114
10,11,7242,1442,191,185.699,73.2051,16.7949,99.9821
11,12,385623,1292,722,213.129,36.5883,53.4117,75.2221
12,13,4830,1686,189,22.9506,7.32632,82.6737,99.9544
13,14,8498,2015,191,203.593,71.6902,18.3098,99.9224
14,15,9332,440,216,201.408,18.3171,71.6829,99.9837
15,16,21090,1804,249,198.919,2.04754,87.9525,99.5599
16,17,2138,2415,190,211.012,70.3965,19.6035,99.9827
17,18,49363,2133,261,183.705,73.0584,16.9416,99.9048
18,19,30072,2330,322,19.6593,6.85349,83.1465,99.902
19,20,8597,2522,205,20.0672,5.56884,84.4312,99.8183
20,21,12142,2651,237,11.2332,79.8392,10.1608,99.9335
21,22,3283,2754,215,12.8521,56.1639,33.8361,99.9931
22,23,873,2805,188,25.1623,24.1852,65.8148,99.982
23,24,5787,2901,208,11.5445,54.6326,35.3674,99.9698
24,25,36982,3349,298,19.2152,12.5709,77.4291,99.5883
25,26,29148,3021,261,188.011,60.504,29.496,99.9118
26,27,1363,574,216,349.9480000000001,88.78399999999998,1.21595,99.977
27,28,6861,3249,218,23.6984,52.153,37.847,99.9966
28,29,3251,2816,240,221.398,44.2569,45.7431,99.9352
29,30,20501,500,309,195.715,47.8756,42.1244,99.8622
30,31,2686,794,246,232.43400000000003,76.0619,13.9381,99.9774
31,32,14832,2478,289,0.544463,78.6381,11.3619,99.9696
32,33,3741,1141,256,27.4893,28.9691,61.0309,99.9957
33,34,85750,874,406,31.3295,38.4826,51.5174,88.7448
34,35,13685,3171,323,219.794,43.8231,46.1769,99.8631
35,36,513,2685,255,3.11905,81.8916,8.1084,99.4991
36,37,3352,880,289,198.473,19.8812,70.1188,99.9961
37,38,70955,2030,490,206.13,26.5424,63.4576,95.7256
38,39,5505,1180,305,24.9863,5.57489,84.4251,99.9946
39,40,4258,1693,319,25.3065,5.21893,84.7811,99.9503
40,41,174966,2783,485,205.857,4.7809599999999985,85.219,92.662
41,42,2035,2861,312,329.583,79.4467,10.5533,99.9905
42,43,228344,466,572,207.789,51.4345,38.5655,97.9901
43,44,5920,1084,336,218.033,1.0932,88.9068,99.9917
44,45,2346,1516,327,211.735,30.6846,59.3154,99.81
45,46,1198,347,345,192.401,47.5006,42.4994,99.9984
46,47,3847,1782,357,209.642,35.5004,54.4996,99.9577
47,48,802,3462,353,16.873,15.5536,74.4464,99.879
48,49,11538,420,399,22.8304,19.4748,70.5252,99.5538
49,50,5118,577,389,233.377,74.5137,15.4863,99.9799
50,51,3208,317,391,197.461,51.3065,38.6935,99.9652
51,52,16104,1257,441,27.5931,19.3164,70.6836,99.9798
52,53,529,2209,375,201.569,56.5317,33.4683,99.9682
53,54,2905,2138,399,206.148,54.7581,35.2419,99.9483
54,55,2662,1104,398,27.21,5.82416,84.1758,99.9909
55,56,1199,3406,391,190.242,6.29804,83.70200000000001,99.9989
56,57,837,2673,406,25.2466,76.2166,13.7834,99.8963
57,58,2146,2242,403,198.654,7.31085,82.6891,99.9966
58,59,29346,3373,490,21.9918,31.873,58.127,99.7775
59,60,2145,3197,421,21.4142,32.1747,57.8253,99.9956
60,61,1206,1845,418,189.999,65.6922,24.3078,99.9834
61,62,12337,708,450,14.2356,19.1186,70.8814,99.8474
62,63,7828,1889,454,208.221,63.9913,26.0087,99.9455
63,64,32182,2378,555,203.107,12.0789,77.9211,90.2396
64,65,1955,3233,447,19.3206,33.0491,56.9509,99.2317
65,66,5760,1083,448,307.187,78.5018,11.4982,99.9587
66,67,1051,2727,451,310.036,77.6128,12.3872,99.9508
67,68,5328,2241,485,181.203,67.7734,22.2266,99.9087
68,69,29203,3160,537,26.2318,32.0001,57.9999,95.1209
69,70,880,1960,483,217.12,69.2555,20.7445,99.9548
70,71,3323,2855,502,26.2891,44.7076,45.2924,99.7666
71,72,3188,2957,515,30.1847,41.0334,48.9666,99.9923
72,73,643,3007,517,30.6245,39.3459,50.6541,99.6212
73,74,620,3405,513,196.401,59.115,30.885,99.9821
74,75,599,1905,511,306.05,87.9012,2.09882,99.9979
75,76,5951,1809,545,343.5680000000001,81.4242,8.5758,98.9769
76,77,518,2887,538,208.256,10.3556,79.6444,96.0411
77,78,4790,1700,572,214.189,1.54926,88.4507,99.9996
78,79,21116,1846,630,38.5524,13.3457,76.6543,99.9973
79,80,2067,1621,593,229.383,79.6315,10.3685,99.9758
80,81,3505,2617,587,321.327,74.8532,15.1468,99.9821
81,82,5608,2719,614,17.7677,40.9474,49.0526,99.9841
82,83,7285,3282,645,25.38,24.6521,65.3479,99.7082
83,84,2521,3397,615,198.215,73.4803,16.5197,99.9809
84,85,12813,2266,641,193.035,9.43686,80.5631,99.9544
85,86,25667,1089,701,32.1043,18.1337,71.8663,99.9858
86,87,3925,1700,632,28.7411,43.5066,46.4934,99.9978
87,88,6618,3198,647,193.467,71.8681,18.1319,99.9874
88,89,9515,2666,687,207.051,68.7717,21.2283,99.9642
89,90,682,1759,632,28.1015,21.6041,68.3959,99.4767
90,91,438693,2578,980,23.3541,3.88134,86.1187,77.1322
91,92,7988,2555,671,203.907,72.816,17.184,99.9593
92,93,4145,1481,680,32.746,47.2315,42.7685,99.9287
93,94,12600,1643,713,13.9988,43.1971,46.8029,99.9693
94,95,22490,3349,721,35.8384,64.5877,25.4123,99.9759
95,96,108941,2790,837,203.638,6.574110000000001,83.4259,99.8353
96,97,2233,1734,690,40.7209,10.0503,79.9497,99.9712
97,98,11541,3108,739,211.106,53.8277,36.1723,99.9627
98,99,2310,2263,710,9.31568,59.4378,30.5622,99.9594
99,100,4747,2427,712,200.627,67.347,22.653,99.9878
100,101,635,1437,704,30.4148,20.181,69.819,99.9878
101,102,1145,1566,711,203.482,6.553610000000001,83.4464,99.9969
102,103,624,3195,720,198.805,72.8119,17.1881,99.959
103,104,3481,2559,725,29.497,33.2548,56.7452,99.9512
104,105,726,322,709,210.216,4.43556,85.5644,99.9873
105,106,1023,2929,722,197.948,79.4037,10.5963,99.9894
106,107,9408,345,759,197.2,60.7618,29.2382,99.9214
107,108,247212,1589,1062,213.165,0.805687,89.1943,99.3432
108,109,4531,175,747,199.201,60.5612,29.4388,99.9971
109,110,110820,574,970,25.0915,3.45258,86.5474,96.0343
110,111,4269,722,749,4.66516,62.4713,27.5287,99.9863
111,112,51213,221,888,202.732,45.7407,44.2593,99.7768
112,113,1110,840,748,202.595,12.2179,77.7821,99.9959
113,114,7527,3204,783,9.59248,3.29427,86.7057,99.9367
114,115,1476,3438,762,194.393,44.4848,45.5152,99.8832
115,116,2245,1494,784,20.1386,66.3197,23.6803,99.9114
116,117,3179,1948,787,224.325,63.4094,26.5906,99.9816
117,118,587,812,780,266.822,79.6466,10.3534,99.8411
118,119,15446,792,840,244.322,77.6346,12.3654,99.9346
119,120,5789,3434,827,201.143,11.7811,78.2189,99.976
120,121,1655,892,814,15.2923,19.7673,70.2327,99.9888
121,122,5671,1923,849,214.627,65.2076,24.7924,99.9827
122,123,2120,3281,829,33.1306,56.1073,33.8927,99.9833
123,124,13800,3364,873,198.247,43.9622,46.0378,99.8951
124,125,966,3061,822,22.9663,58.177,31.823,99.9915
125,126,556,1871,826,192.763,56.1197,33.8803,99.9956
126,127,3398,366,861,2.79771,64.548,25.452,99.9948
127,128,2876,3056,882,3.3997,64.5316,25.4684,99.9914
128,129,2136,104,891,239.057,69.7611,20.2389,99.979
129,130,7784,2340,928,193.238,28.3931,61.6069,99.9034
130,131,555,1995,922,191.326,64.9095,25.0905,99.992
131,132,12636,713,969,17.04,20.3419,69.6581,99.9829
132,133,1075,2978,937,23.5641,58.4128,31.5872,98.896
133,134,2562,3036,936,26.8342,58.7542,31.2458,99.971
134,135,2205,468,962,205.635,45.3584,44.6416,99.9691
135,136,663,2591,950,213.808,60.2567,29.7433,99.9762
136,137,6469,3011,996,8.9752,67.4327,22.5673,99.9412
137,138,1897,1833,1007,196.106,66.2961,23.7039,99.2353
138,139,5247,1359,1020,210.151,3.48611,86.5139,99.9409
139,140,4806,429,1021,273.773,83.02799999999998,6.97202,99.362
140,141,47686,256,1112,7.64,63.8341,26.1659,99.9057
141,142,30124,830,1124,15.5106,39.7124,50.2876,99.956
142,143,3162,105,1068,21.6145,57.3704,32.6296,99.9478
143,144,7521,1796,1098,251.791,82.39,7.60998,99.9414
144,145,769,483,1052,12.8662,76.8101,13.1899,99.9317
145,146,667,464,1079,13.8825,19.679,70.321,99.9902
146,147,23931,1037,1155,201.925,22.1218,67.8782,99.7897
147,148,24084,356,1254,204.526,39.0795,50.9205,99.4745
148,149,40841,1961,1285,31.6671,2.2711900000000003,87.7288,98.254
149,150,2982,2537,1120,205.032,11.5577,78.4423,99.7967
150,151,10455,2132,1158,215.015,67.6299,22.3701,99.8792
151,152,10831,499,1197,22.6454,44.5478,45.4522,99.9224
152,153,25529,1988,1195,212.803,77.4627,12.5373,99.935
153,154,502,2056,1152,212.412,66.8671,23.1329,99.8865
154,155,15510,3144,1184,205.709,66.1917,23.8083,99.956
155,156,2756,2649,1173,207.656,39.8419,50.1581,99.9872
156,157,52022,3061,1310,223.321,85.71700000000001,4.28299,99.8862
157,158,20700,3279,1250,24.3498,42.731,47.269,99.9452
158,159,21271,2746,1238,18.0042,44.6899,45.3101,99.9788
159,160,16779,727,1262,217.749,58.6861,31.3139,99.9842
160,161,987,1108,1215,35.1582,65.1174,24.8826,99.8909
161,162,209823,1103,1496,204.626,38.9504,51.0496,81.0547
162,163,32830,2545,1297,203.673,31.839,58.161,99.8203
163,164,1386,2231,1207,19.9674,41.5958,48.4042,99.9394
164,165,2494,298,1208,8.87391,68.2614,21.7386,99.9756
165,166,1169,2478,1208,210.562,11.563,78.437,99.9747
166,167,2892,2160,1246,24.5862,46.0839,43.9161,99.9795
167,168,955,2207,1232,20.8759,14.5979,75.4021,99.8591
168,169,35797,2319,1311,209.325,51.8906,38.1094,99.9921
169,170,1544,1762,1241,20.2195,18.6085,71.3915,99.9982
170,171,4191,1641,1255,190.093,82.2263,7.77367,99.9653
171,172,6863,222,1255,204.991,47.118,42.882,99.9852
172,173,67194,3321,1406,205.661,26.027,63.973,99.8464
173,174,2317,118,1255,210.913,32.3356,57.6644,99.8198
174,175,23822,2868,1354,210.504,47.912,42.088,99.9952
175,176,5773,409,1303,29.0973,11.7983,78.2017,99.9932
176,177,10596,2749,1351,23.3715,36.0007,53.9993,99.954
177,178,18562,540,1346,202.473,10.8473,79.1527,99.8717
178,179,25261,803,1366,234.3,64.8485,25.1515,99.9586
179,180,2488,498,1304,349.963,74.7325,15.2675,99.984
180,181,5855,177,1336,195.021,7.81579,82.1842,99.982
181,182,774,94,1311,211.995,31.8349,58.1651,99.0736
182,183,2702,115,1352,196.414,7.7975,82.2025,99.9779
183,184,2047,1783,1335,222.919,73.1687,16.8313,99.9088
184,185,16992,2591,1408,205.197,48.0281,41.9719,99.4951
185,186,41673,2083,1500,284.878,83.7352,6.26485,87.3828
186,187,10927,1852,1381,29.7325,16.785,73.215,99.8456
187,188,132308,628,1563,19.463,44.4116,45.5884,71.5092
188,189,1358,2180,1373,33.2584,3.24297,86.757,99.999
189,190,3600,217,1375,210.031,31.5096,58.4904,99.9952
190,191,35405,258,1459,27.1052,21.2749,68.7251,83.419
191,192,1010,1447,1384,221.148,55.2201,34.7799,99.9921
192,193,50644,1694,1492,27.6117,32.7245,57.2755,99.9794
193,194,4847,935,1404,27.9381,29.9876,60.0124,99.6373
194,195,1016,2141,1388,8.39201,87.3328,2.66719,99.9817
195,196,2448,2992,1400,22.1389,36.607,53.393,99.9749
196,197,3910,1569,1412,198.438,3.13618,86.8638,99.9943
197,198,9875,1017,1453,9.164,81.5301,8.46986,99.8849
198,199,13015,2318,1449,82.7225,82.8773,7.12268,99.8479
199,200,5413,1535,1454,3.4450300000000005,61.7195,28.2805,99.4518
200,201,5109,2488,1435,52.7836,79.5774,10.4226,99.9147
201,202,1519,2208,1419,139.409,78.0587,11.9413,99.985
202,203,12813,2829,1470,23.3399,10.252,79.748,99.9887
203,204,592,2729,1422,204.171,38.1886,51.8114,99.9837
204,205,1011,2162,1435,203.563,62.3036,27.6964,99.9963
205,206,570,2120,1438,164.673,76.4368,13.5632,99.995
206,207,30705,1847,1591,25.714,0.796616,89.2034,99.7218
207,208,6674,1254,1464,20.8361,28.8453,61.1547,99.9662
208,209,84359,2527,1573,24.1293,24.9547,65.0453,98.4454
209,210,654,2033,1454,2.3040700000000003,87.45100000000002,2.5489900000000003,99.9942
210,211,23936,3049,1543,212.473,41.7996,48.2004,99.923
211,212,558,2902,1500,15.4265,34.4235,55.5765,98.216
212,213,1472,3350,1514,189.5,85.0497,4.95031,99.958
213,214,20528,246,1582,209.768,45.8801,44.1199,99.9122
214,215,20498,2868,1587,15.1039,53.0042,36.9958,87.2523
215,216,6504,3366,1567,26.6508,12.7287,77.2713,92.2875
216,217,1171,3281,1557,204.879,55.1478,34.8522,99.7682
217,218,1699,759,1565,211.733,63.4275,26.5725,99.9933
218,219,5286,3209,1577,15.2875,20.7387,69.2613,99.9166
219,220,142994,1337,1840,207.898,7.65955,82.3405,99.239
220,221,2161,1371,1608,339.2580000000001,66.2672,23.7328,99.943
221,222,15557,1953,1653,25.822,9.11651,80.8835,99.7654
222,223,23487,2503,1713,203.857,3.99364,86.0064,99.9176
223,224,2866,1704,1622,208.048,2.40254,87.5975,98.8623
224,225,4930,3403,1623,9.88151,24.9925,65.0075,99.9485
225,226,21469,207,1707,207.454,57.6399,32.3601,99.9226
226,227,3295,1608,1619,230.026,66.3508,23.6492,99.9926
227,228,2565,809,1626,21.0361,27.8146,62.1854,99.9661
228,229,2405,2396,1620,196.71,32.0658,57.9342,99.974
229,230,44697,3321,1728,203.836,29.292,60.708,99.3221
230,231,5846,2120,1653,359.903,73.256,16.744,99.9515
231,232,1070,2052,1629,31.6712,20.7184,69.2816,99.9911
232,233,9089,369,1656,26.5511,15.5904,74.4096,99.9077
233,234,13968,3147,1671,15.0032,0.559067,89.4409,100.001
234,235,535,85,1640,214.329,58.4503,31.5497,99.9286
235,236,75810,2851,1769,196.19,66.4726,23.5274,96.8289
236,237,732,1184,1664,23.2751,8.08025,81.9198,99.9805
237,238,2092,3000,1676,20.9053,1.40273,88.5973,99.9987
238,239,2142,1624,1666,31.4637,17.7396,72.2604,99.9957
239,240,5240,1725,1679,27.22,15.0304,74.9696,99.9951
240,241,6889,2392,1684,20.7078,24.0866,65.9134,99.9959
241,242,1751,2957,1676,203.535,0.489792,89.5102,98.1127
242,243,8444,2300,1694,206.629,51.5403,38.4597,99.991
243,244,1042,1701,1706,191.683,0.841362,89.1586,99.927
244,245,1031,2017,1697,26.6287,85.3701,4.62995,99.9894
245,246,1920,2060,1696,28.5146,28.5905,61.4095,99.9959
246,247,123310,429,1979,203.428,22.0325,67.9675,71.8052
247,248,452655,2193,2098,204.588,7.88903,82.111,91.7387
248,249,33056,1032,1841,204.42,1.56273,88.4373,83.9278
249,250,41798,1684,1849,209.748,13.9313,76.0687,98.1979
250,251,2282,2629,1719,204.585,32.6711,57.3289,99.9974
251,252,1870,1773,1735,207.97,25.6044,64.3956,99.9902
252,253,6296,216,1757,27.065,27.5416,62.4584,99.9973
253,254,3368,1807,1766,213.848,72.3575,17.6425,99.9573
254,255,1185,1913,1750,5.42101,82.6993,7.300680000000002,99.9812
255,256,4499,569,1800,214.047,55.8635,34.1365,99.9429
256,257,4735,2354,1792,21.3995,76.8729,13.1271,99.9853
257,258,12798,154,1822,202.306,76.0755,13.9245,99.9771
258,259,1251,714,1797,201.085,56.3016,33.6984,99.9085
259,260,564,986,1776,194.611,41.111,48.889,99.3026
260,261,2694,2426,1796,20.3424,24.2819,65.7181,99.996
261,262,743,1440,1784,18.1886,14.4581,75.5419,99.9949
262,263,1645,1870,1796,25.3542,26.5601,63.4399,99.719
263,264,6014,1121,1852,192.25,64.9122,25.0878,99.972
264,265,6547,1386,1839,28.8706,20.8678,69.1322,99.9982
265,266,555,999,1799,200.521,17.2673,72.7327,99.5908
266,267,2696,2934,1825,28.5123,29.5767,60.4233,99.994
267,268,60558,3173,1928,211.357,32.4977,57.5023,99.9632
268,269,43388,2491,1919,198.99400000000003,63.6575,26.3425,65.5162
269,270,15827,829,1868,193.44,66.2048,23.7952,99.9589
270,271,507,2562,1821,17.2866,14.1726,75.8274,99.9914
271,272,11004,631,1887,200.093,54.5226,35.4774,99.9747
272,273,36361,1560,1965,29.6402,74.6604,15.3396,97.1339
273,274,3839,2867,1847,194.751,10.4297,79.5703,99.959
274,275,3702,1837,1850,193.568,71.4761,18.5239,99.9692
275,276,14177,3400,1917,23.3495,4.11606,85.8839,99.9714
276,277,6825,280,1857,345.481,86.6698,3.33023,99.9912
277,278,2353,704,1865,26.087,0.603745,89.3963,99.9956
278,279,1132,3001,1861,25.2215,60.8402,29.1598,99.9578
279,280,4469,1780,1901,31.8072,27.809,62.191,99.9339
280,281,1610,2329,1869,15.0478,59.9489,30.0511,99.9962
281,282,1213,100,1878,336.3130000000001,82.098,7.90203,99.963
282,283,32992,2939,2010,30.8309,74.1171,15.8829,64.1068
283,284,3356,2671,1901,225.692,78.3937,11.6063,99.9245
284,285,780,1446,1885,287.836,84.1484,5.8516,99.9896
285,286,13847,143,1965,17.929000000000006,73.0793,16.9207,98.9403
286,287,128788,805,2102,31.3395,36.6305,53.3695,99.9756
287,288,1376,1415,1922,36.2576,1.89028,88.1097,99.9933
288,289,1828,523,1946,20.0811,10.1239,79.8761,96.8676
289,290,1004,911,1931,192.703,8.94092,81.0591,99.9946
290,291,21208,3362,2079,353.24300000000005,82.1394,7.86057,99.5463
291,292,10611,972,1979,188.218,71.3395,18.6605,99.8927
292,293,4757,2315,1960,21.9327,59.0487,30.9513,99.992
293,294,1105,1591,1950,225.226,60.5507,29.4493,99.9841
294,295,1093,555,1965,205.218,1.84085,88.1591,99.9945
295,296,736,2833,1963,202.811,0.325203,89.6748,99.9743
296,297,1283,1627,1977,198.784,59.8344,30.1656,99.9879
297,298,806,206,1992,42.9001,80.93,9.06995,99.7492
298,299,11884,2327,2026,7.7959,53.9552,36.0448,78.5622
299,300,911,2616,1995,14.4531,43.783,46.217,99.6665
300,301,1819,3388,2002,202.128,9.18809,80.8119,99.9914
301,302,3654,1110,2028,209.675,58.497,31.503,99.7345
302,303,738,2435,2027,15.077,7.39743,82.6026,99.9973
303,304,16258,173,2139,20.8276,15.9062,74.0938,99.7487
304,305,22916,3215,2121,27.5436,24.7823,65.2177,99.9898
305,306,634,1103,2064,204.99,76.2449,13.7551,99.9069
306,307,641,149,2073,11.4322,63.3728,26.6272,99.9291
307,308,53563,1476,2187,27.6597,34.6138,55.3862,99.7543
308,309,2905,2761,2094,20.8626,4.11394,85.8861,99.9835
309,310,22623,1236,2164,38.2755,50.9085,39.0915,99.9687
310,311,9146,3082,2125,192.201,33.6751,56.3249,99.951
311,312,683,2696,2103,4.33061,50.8615,39.1385,99.7125
312,313,17379,295,2196,203.157,32.0819,57.9181,99.9908
313,314,1154,94,2125,200.793,33.1944,56.8056,99.9512
314,315,2678,1074,2140,188.285,77.2695,12.7305,99.9853
315,316,3104,1133,2157,211.04,0.261192,89.7388,99.9974
316,317,7491,1981,2206,213.453,71.6423,18.3577,99.8388
317,318,49846,2743,2287,345.695,68.5622,21.4378,99.3246
318,319,12747,3326,2215,29.2822,14.1297,75.8703,99.9868
319,320,15146,2370,2259,199.381,59.3344,30.6656,99.9426
320,321,32623,1023,2276,204.226,10.0909,79.9091,99.8539
321,322,952,2880,2199,202.091,6.26987,83.7301,99.9931
322,323,12135,153,2323,194.605,51.8256,38.1744,99.5287
323,324,9459,582,2248,218.451,62.4361,27.5639,99.8925
324,325,932,3424,2206,352.342,74.107,15.893,99.9864
325,326,6558,3189,2235,323.2990000000001,74.9401,15.0599,99.9886
326,327,46613,478,2327,29.8986,32.0775,57.9225,99.8767
327,328,2172,2576,2236,211.501,66.6437,23.3563,99.9349
328,329,5087,3403,2272,7.6285,84.6582,5.34181,99.9851
329,330,2725,2477,2280,13.474,3.89851,86.1015,99.9694
330,331,2000,1251,2282,26.9511,37.6161,52.3839,99.7441
331,332,3885,2904,2283,5.0159400000000005,85.1161,4.88395,99.8897
332,333,632,157,2264,19.1215,15.5117,74.4883,99.9731
333,334,773,2507,2288,13.4671,3.60728,86.3927,99.9999
334,335,36795,1131,2376,221.469,53.0931,36.9069,99.9838
335,336,1441,3228,2281,22.1377,10.1853,79.8147,99.9264
336,337,21816,1867,2315,26.1713,35.0402,54.9598,99.9626
337,338,6380,3188,2318,29.2107,73.5446,16.4554,99.9285
338,339,935,670,2279,14.9142,2.47878,87.5212,99.9447
339,340,11409,2551,2365,195.513,34.494,55.506,99.9952
340,341,31333,3027,2349,318.137,76.6029,13.3971,99.9433
341,342,11072,872,2358,200.172,59.0529,30.9471,99.992
342,343,33545,3375,2432,22.7888,0.0512695,89.9487,96.8111
343,344,14585,2315,2357,30.044,42.7961,47.2039,99.9851
344,345,2386,1298,2351,24.4211,4.70539,85.2946,99.9806
345,346,10102,1383,2371,36.9681,39.5844,50.4156,99.8951
346,347,3219,729,2342,29.7054,28.9061,61.0939,99.9736
347,348,65328,284,2464,202.629,16.8189,73.1811,99.3892
348,349,542,2502,2331,16.961,4.8268900000000015,85.1731,99.9991
349,350,24934,1924,2431,198.152,58.0635,31.9365,99.8279
350,351,3480,780,2372,22.8376,1.09776,88.9022,99.7697
351,352,56784,2478,2591,213.041,11.474,78.52600000000002,95.1928
352,353,75293,1677,2500,205.192,2.95306,87.0469,99.9064
353,354,3485,2018,2397,200.504,69.436,20.564,99.9588
354,355,14202,3248,2426,349.8830000000001,74.3308,15.6692,99.9327
355,356,582,647,2380,14.9558,4.13108,85.8689,99.9987
356,357,51263,1383,2563,33.7502,69.2649,20.7351,78.561
357,358,6161,2898,2412,28.7992,51.1505,38.8495,99.9854
358,359,710,3171,2383,282.076,76.0834,13.9166,99.9828
359,360,1759,2403,2401,254.802,80.7912,9.20881,99.9851
360,361,4521,684,2419,210.683,53.863,36.137,99.9374
361,362,4117,835,2428,201.242,8.413310000000001,81.5867,99.6125
362,363,817,2617,2407,260.85400000000004,81.7662,8.2338,99.9277
363,364,63817,1041,2631,27.8691,55.79600000000001,34.204,89.9554
364,365,224040,2825,2665,26.6534,56.3919,33.6081,87.8365
365,366,27783,1183,2498,207.02,71.2722,18.7278,98.3435
366,367,1124,1410,2431,32.6163,55.4706,34.5294,99.975
367,368,14749,3074,2471,32.1175,21.4768,68.5232,99.9937
368,369,648,2418,2436,289.2,79.5513,10.4487,99.9505
369,370,12265,556,2532,21.5876,1.6276700000000002,88.3723,67.4015
370,371,2812,700,2463,20.1854,2.716,87.28399999999998,99.9878
371,372,1549,2377,2463,203.955,8.33276,81.6672,99.9955
372,373,1126,534,2473,218.516,44.8207,45.1793,99.9921
373,374,5229,787,2474,31.0625,55.7986,34.2014,99.9463
374,375,963,2033,2459,200.549,4.454280000000002,85.5457,99.9511
375,376,1474,2417,2487,263.84,78.3992,11.6008,99.9926
376,377,6434,474,2502,53.1213,85.5718,4.42824,98.8404
377,378,114917,2215,2705,216.099,29.3547,60.6453,95.6674
378,379,1047,875,2480,21.6447,8.70727,81.2927,99.7587
379,380,2380,2350,2516,44.1864,45.1694,44.8306,95.8974
380,381,8349,756,2531,203.032,9.27264,80.7274,99.9661
381,382,20324,1961,2592,208.461,26.7666,63.2334,74.59100000000002
382,383,66108,701,2710,188.222,73.5718,16.4282,99.644
383,384,15588,866,2601,194.126,36.5157,53.4843,99.9824
384,385,79003,423,2758,206.399,5.21534,84.7847,97.0012
385,386,1740,95,2582,5.8571300000000015,81.6652,8.33482,99.9416
386,387,3700,1213,2598,203.86900000000003,55.1457,34.8543,99.9963
387,388,3489,1852,2637,203.481,60.7312,29.2688,99.9664
388,389,8661,3394,2634,12.279000000000002,71.3082,18.6918,99.9528
389,390,1624,80,2625,1.60814,82.0991,7.9009,99.9825
390,391,8633,1588,2638,24.7551,32.7397,57.2603,99.9963
391,392,883,3253,2629,6.19787,69.6942,20.3058,99.9902
392,393,755,1475,2617,206.975,13.805,76.195,99.9935
393,394,3375,527,2635,3.64016,82.2434,7.756639999999999,99.9833
394,395,11029,2822,2669,205.273,1.46133,88.5387,99.9809
395,396,1900,2622,2641,12.827,72.2271,17.7729,99.9925
396,397,3532,1683,2659,48.7273,87.1807,2.81929,99.9895
397,398,15288,1893,2744,25.4516,20.0485,69.9515,99.9366
398,399,2461,1813,2660,29.604,18.4755,71.5245,99.9551
399,400,7242,3184,2678,28.0811,29.9775,60.0225,99.9492
400,401,1613,1229,2661,210.599,4.53638,85.4636,99.994
401,402,4023,182,2685,198.969,24.646,65.354,98.7805
402,403,969,2327,2662,359.158,75.7209,14.2791,99.9737
403,404,25675,162,2776,30.1475,2.3055,87.6945,99.9489
404,405,15813,1724,2723,207.821,27.7308,62.2692,99.9948
405,406,1195,3305,2678,230.803,77.0813,12.9187,99.9822
406,407,1262,1529,2697,119.51,87.4541,2.54591,99.987
407,408,3876,860,2717,216.568,1.06035,88.9397,99.9772
408,409,9139,942,2761,198.035,40.5804,49.4196,99.7472
409,410,15517,1442,2774,32.7666,64.0041,25.9959,97.9348
410,411,7848,1255,2737,197.211,39.7115,50.2885,99.9967
411,412,1437,1600,2702,23.8443,34.0118,55.9882,99.9918
412,413,24700,3333,2751,26.2288,59.2539,30.7461,99.4345
413,414,1457,1390,2709,204.379,75.0955,14.9045,99.9859
414,415,3959,284,2727,202.211,37.5959,52.4041,99.998
415,416,523,1561,2709,115.616,86.1015,3.898530000000001,99.9847
416,417,5283,2019,2729,335.159,83.9419,6.05809,99.9573
417,418,19048,3112,2816,217.269,4.79219,85.2078,99.9966
418,419,8212,1568,2770,28.8119,16.4248,73.5752,99.9974
419,420,1713,2408,2762,31.7257,30.4193,59.5807,99.8684
420,421,10030,641,2796,26.2661,14.544,75.456,99.9976
421,422,2696,2074,2783,31.9243,22.8525,67.1475,99.9981
422,423,1584,560,2780,21.7232,56.937,33.063,99.7367
423,424,51348,1892,2947,212.631,23.0196,66.9804,77.3606
424,425,9460,877,2812,19.2564,32.9072,57.0928,99.9961
425,426,912,1203,2777,27.8765,61.3973,28.6027,99.5755
426,427,4316,2820,2795,24.1622,44.4406,45.5594,99.8806
427,428,21553,1183,2823,20.6311,52.9269,37.0731,99.9772
428,429,50905,1665,2861,23.6514,6.98045,83.0195,99.9837
429,430,10591,555,2845,32.3996,56.3771,33.6229,99.9052
430,431,192598,3132,3082,22.1107,8.902239999999997,81.0978,79.8982
431,432,2428,258,2822,207.207,2.55527,87.4447,99.9939
432,433,3388,279,2858,15.01,59.5768,30.4232,99.9317
433,434,17357,999,2905,204.759,16.8277,73.1723,99.9862
434,435,4171,112,2856,29.4727,2.42186,87.5781,99.9743
435,436,4054,1343,2862,192.585,40.3214,49.6786,99.9972
436,437,3048,3417,2850,200.504,14.3116,75.6884,99.9923
437,438,15537,2731,2923,27.4106,1.94561,88.0544,99.2067
438,439,837,2049,2850,23.7372,86.3486,3.65136,99.946
439,440,4020,2824,2882,33.0711,18.4125,71.5875,99.9702
440,441,1575,1394,2861,14.8243,43.1689,46.8311,99.9947
441,442,988,1225,2855,203.694,22.1843,67.8157,99.9962
442,443,6831,1278,2912,9.45897,56.7836,33.2164,99.9873
443,444,6719,873,2891,14.2639,68.6359,21.3641,99.9942
444,445,2897,1439,2900,195.49400000000003,37.5205,52.4795,99.4349
445,446,715,1847,2896,11.3332,83.0708,6.92917,99.9125
446,447,2395,2057,2903,150.24,85.7031,4.296869999999998,99.9508
447,448,2431,2877,2932,4.52175,53.2135,36.7865,99.67
448,449,35582,1241,2973,15.8044,54.0368,35.9632,98.9746
449,450,513,2127,2894,319.405,88.0635,1.93649,99.9875
450,451,886,1229,2907,228.125,80.9834,9.01659,99.986
451,452,975,644,2908,22.6439,33.1952,56.8048,99.9966
452,453,10316,216,2933,205.72,37.8532,52.1468,99.8922
453,454,601,2115,2914,218.693,87.9149,2.08506,99.9829
454,455,13228,746,2971,28.5728,70.1305,19.8695,99.3684
455,456,13665,373,2963,30.8938,56.8449,33.1551,99.87
456,457,59860,2272,3078,36.337,36.82,53.18,99.8845
457,458,3373,863,2958,23.5325,24.3016,65.6984,99.9339
458,459,1439,2019,2942,111.199,86.7122,3.2878300000000005,99.989
459,460,22929,2513,3016,204.029,67.5137,22.4863,81.243
460,461,2180,2840,2952,200.545,3.72139,86.2786,99.9884
461,462,4402,2144,2968,143.561,81.3202,8.67981,99.9575
462,463,37676,1551,3035,200.995,31.5358,58.4642,45.3618
463,464,1360,1606,2951,200.301,39.4564,50.5436,99.8682
464,465,1553,1723,2961,13.4675,60.6831,29.3169,99.8641
465,466,14611,2060,3018,254.818,81.7036,8.29635,58.7997
466,467,8667,2672,3027,229.95,73.9306,16.0693,99.0416
467,468,1492,2718,2990,191.69,71.2305,18.7695,99.98
468,469,13388,207,3039,191.032,28.1316,61.8684,99.4053
469,470,18340,522,3037,23.7989,63.2311,26.7689,99.432
470,471,1137,75,3007,25.1676,54.9514,35.0486,99.9314
471,472,927,149,2992,252.871,88.3487,1.65126,99.6033
472,473,99169,2547,3222,14.8792,43.6329,46.3671,72.7726
473,474,11443,1035,3041,302.347,77.5531,12.4469,98.2452
474,475,1707,3275,3008,12.1413,50.6761,39.3239,99.9137
475,476,5206,866,3038,26.0692,43.9946,46.0054,99.9267
476,477,1612,316,3017,203.387,16.83,73.17,99.9691
477,478,7928,724,3048,21.4844,11.6474,78.3526,99.9656
478,479,631,104,3029,27.2906,56.2261,33.7739,99.9346
479,480,6038,925,3074,201.517,42.718,47.282,99.2283
480,481,3020,2857,3039,231.771,72.5985,17.4015,99.3309
481,482,8966,352,3068,209.883,44.7628,45.2372,99.9913
482,483,659,2152,3030,217.471,70.3241,19.6759,99.3656
483,484,4522,1215,3055,260.138,77.4412,12.5588,99.9833
484,485,953,1134,3051,17.5593,37.2555,52.7445,99.6988
485,486,899,2174,3064,261.35200000000003,77.9608,12.0392,99.9833
486,487,2099,3260,3075,10.4508,52.11600000000001,37.884,99.9167
487,488,6879,1921,3103,25.9713,73.8695,16.1305,99.9558
488,489,1022,2144,3074,262.06,76.9112,13.0888,99.9795
489,490,7519,2013,3114,24.468000000000004,58.5111,31.4889,99.9723
490,491,33146,173,3170,19.9112,24.0418,65.9582,99.8931
491,492,3986,788,3120,19.603,46.5755,43.4245,99.4864
492,493,144439,657,3222,204.11900000000003,29.5257,60.4743,98.5486
493,494,2921,1304,3088,191.253,38.6977,51.3023,99.9963
494,495,5923,1138,3099,13.5149,57.0812,32.9188,99.9971
495,496,38886,3207,3225,207.05,47.0588,42.9412,99.9145
496,497,547,3133,3081,202.147,41.0192,48.9808,99.7592
497,498,713,3035,3093,251.699,73.9155,16.0845,99.8326
498,499,5065,1337,3124,305.016,86.4711,3.52886,99.9315
499,500,24818,1743,3161,205.128,13.6629,76.3371,99.1288
500,501,4317,2112,3126,71.6128,84.0745,5.92549,99.963
501,502,2041,554,3114,27.7087,55.2785,34.7215,99.9918
502,503,18289,1529,3191,203.545,27.6237,62.3763,99.4769
503,504,2405,1224,3119,194.902,4.66178,85.3382,99.8322
504,505,1116,871,3115,17.7754,37.6816,52.3184,99.99
505,506,1208,350,3120,13.8691,64.6315,25.3685,99.9624
506,507,9059,1419,3165,194.481,4.38779,85.6122,99.9873
507,508,1996,3285,3120,29.7327,2.36471,87.6353,99.9955
508,509,608,1023,3122,11.5944,49.9288,40.0712,99.7852
509,510,1818,407,3132,19.5262,47.7737,42.2263,99.9935
510,511,1676,1883,3165,210.399,32.567,57.433,99.8912
511,512,2615,863,3174,198.763,34.1358,55.8642,99.9931
512,513,910,900,3165,15.7562,55.9632,34.0368,99.9815
513,514,1739,1254,3172,192.014,75.2621,14.7379,99.7609
514,515,1025,2685,3190,294.942,88.9425,1.05749,99.9886
515,516,19807,1957,3236,222.151,40.5916,49.4084,99.254
516,517,1398,2048,3194,72.8365,86.4127,3.5873,99.9796
517,518,569,1588,3202,3.5606,59.0113,30.9887,99.9921
518,519,4894,2600,3223,26.8758,34.7085,55.2915,99.9596
519,520,5124,2851,3249,2.27981,65.8131,24.1869,99.9645
520,521,2909,1287,3220,205.827,2.60997,87.39,99.9984
521,522,1458,2104,3227,208.029,38.9976,51.0024,99.8841
522,523,8530,1194,3275,250.58,83.9389,6.06107,99.9793
523,524,6589,2575,3272,189.872,27.8769,62.1231,99.6628
524,525,6866,1686,3254,22.5928,32.0526,57.9474,99.8934
525,526,3433,2264,3250,207.163,38.8342,51.1658,99.7861
526,527,19497,2704,3303,0.398365,67.1906,22.8094,99.9422
527,528,2664,238,3246,208.117,49.1263,40.8737,99.9866
528,529,3306,1607,3248,41.4555,84.5125,5.4875,99.9684
529,530,52520,593,3383,25.9542,34.6739,55.3261,99.8848
530,531,2541,614,3257,191.901,15.1726,74.8274,99.9818
531,532,6462,1809,3285,19.6411,34.3096,55.6904,99.934
532,533,882,2192,3255,24.4799,53.2812,36.7188,99.9701
533,534,621611,1715,3696,206.978,18.3992,71.6008,81.4847
534,535,5267,1411,3299,31.0361,1.10906,88.8909,99.9381
535,536,12668,2847,3328,211.946,20.2783,69.7217,99.9497
536,537,13221,1494,3336,20.9867,30.5091,59.4909,99.9404
537,538,1948,125,3304,237.29,83.4673,6.53265,99.988
538,539,506,778,3284,19.0218,25.422,64.578,99.9932
539,540,1112,1257,3293,248.07,86.1683,3.83175,99.9886
540,541,8076,1060,3315,23.5082,38.6909,51.3091,99.7919
541,542,10978,1292,3346,17.6409,28.6862,61.3138,99.7561
542,543,26991,887,3360,208.752,31.4508,58.5492,99.9316
543,544,3457,2036,3353,203.231,33.4991,56.5009,99.6673
544,545,13518,3323,3368,26.258000000000006,29.0561,60.9439,99.9963
545,546,34145,3106,3434,196.3,36.984,53.01600000000001,99.8243
546,547,1514,144,3343,29.8778,23.2055,66.7945,99.9897
547,548,6670,1097,3377,21.7477,61.1383,28.8617,99.9395
548,549,16885,161,3415,231.593,81.8948,8.1052,99.9399
549,550,7270,277,3420,197.735,17.393,72.607,99.9216
550,551,2792,340,3371,34.3114,25.31,64.69,99.9965
551,552,1026,1187,3359,13.9182,41.644,48.356,99.5658
552,553,47901,3268,3535,359.005,60.3717,29.6283,99.5615
553,554,7646,1346,3404,206.718,4.26125,85.7388,99.9829
554,555,2707,574,3391,200.36,4.18256,85.8174,99.9977
555,556,3188,1198,3394,17.8088,28.7763,61.2237,99.9577
556,557,43802,2692,3503,24.8195,26.1963,63.8037,59.7948
557,558,5599,2040,3419,19.9285,36.8944,53.1056,99.9953
558,559,31244,2862,3577,18.3541,17.2532,72.7468,49.4683
559,560,40528,1139,3475,204.653,76.4561,13.5439,99.2688
560,561,547,3073,3418,17.0279,29.0259,60.9741,99.9379
561,562,4561,2479,3438,213.613,15.8287,74.1713,99.9912
562,563,62558,522,3582,22.5775,2.05581,87.9442,79.9217
563,564,3773,2203,3446,12.1353,73.8823,16.1177,99.9896
564,565,4143,347,3461,210.702,43.234,46.76600000000001,99.899
565,566,1477,2418,3449,19.0331,30.5982,59.4018,99.9603
566,567,8606,867,3471,20.7674,47.9619,42.0381,98.6717
567,568,1078,3269,3451,211.543,6.99517,83.0048,99.9742
568,569,811,235,3453,204.491,21.6648,68.3352,99.9939
569,570,727,1576,3464,176.354,75.5625,14.4375,99.9823
570,571,708,1103,3463,14.2602,23.4966,66.5034,99.9914
571,572,741,235,3484,206.283,84.6261,5.37392,99.9934
572,573,8104,1119,3528,204.463,49.6695,40.3305,99.9103
573,574,568,2419,3486,215.986,13.1792,76.8208,99.9942
574,575,2275,156,3498,35.1778,37.7153,52.2847,93.0655
575,576,13357,2532,3578,21.7402,28.94,61.06,99.7544
576,577,23210,330,3570,355.9890000000001,79.6897,10.3103,99.9455
577,578,902,2594,3514,24.3672,9.38132,80.6187,99.979
578,579,1849,3406,3543,22.934,19.9254,70.0746,99.9417
579,580,4562,169,3545,343.749,88.0869,1.9131,99.9783
580,581,15278,777,3602,219.291,48.6743,41.3257,99.927
581,582,16626,2430,3636,14.4344,64.8372,25.1628,99.9082
582,583,3652,3021,3580,32.7033,71.3301,18.6699,99.6564
583,584,6356,870,3583,359.806,44.7969,45.2031,99.9728
584,585,1184,3067,3552,18.6805,5.4135800000000005,84.5864,99.844
585,586,1088,2939,3554,17.5949,59.1908,30.8092,99.6038
586,587,97033,1176,3703,220.145,73.0183,16.9817,99.8469
587,588,4285,596,3576,253.266,78.4973,11.5027,99.9875
588,589,2668,120,3580,25.9756,16.5093,73.4907,99.9196
589,590,1746,2968,3579,212.337,1.52044,88.4796,91.6359
590,591,962,985,3569,196.411,16.9719,73.0281,99.9544
591,592,530,1023,3577,305.219,82.5424,7.457560000000001,99.9454
592,593,1771,1058,3585,260.488,81.8116,8.188369999999999,99.9944
593,594,1526,3096,3583,204.998,3.4924699999999995,86.5075,99.4228
594,595,1110,216,3592,24.7627,32.3736,57.6264,99.8501
595,596,1016,1902,3594,191.566,1.6843099999999998,88.3157,99.9969
596,597,1634,973,3600,208.818,44.3488,45.6512,99.9707
597,598,8861,3377,3644,24.3202,0.95858,89.0414,99.9784
598,599,5016,2925,3628,20.3395,64.4033,25.5967,99.9707
599,600,16185,2613,3690,11.9863,68.2746,21.7254,99.9356
600,601,154369,3150,3945,208.502,8.41248,81.5875,72.1483
601,602,17851,622,3674,10.1823,76.9167,13.0833,99.951
602,603,1336,100,3623,228.817,62.8614,27.1386,99.947
603,604,4835,172,3645,206.071,22.2918,67.7082,99.9932
604,605,16509,3273,3688,26.0642,3.17132,86.8287,99.9866
605,606,6906,959,3653,197.262,5.77012,84.2299,99.9699
606,607,176855,2641,3982,202.128,6.02664,83.9734,86.9866
607,608,135202,2025,3942,209.24,53.9694,36.0306,85.2105
608,609,4310,882,3671,197.836,13.5707,76.4293,99.9282
609,610,1229,2807,3664,19.524,33.5051,56.4949,99.9769
610,611,1083,73,3665,228.541,62.3018,27.6983,99.9479
611,612,2318,719,3675,203.986,13.9424,76.0576,99.997
612,613,3135,2521,3725,198.392,12.8719,77.1281,99.9141
613,614,6523,881,3724,203.579,15.1824,74.8176,99.9687
614,615,17813,156,3770,213.989,58.0517,31.9483,99.9567
615,616,78599,676,3822,201.454,6.8136100000000015,83.1864,99.8036
616,617,730,83,3701,222.291,89.5869,0.4130680000000001,99.9765
617,618,10672,319,3743,320.143,88.6926,1.30739,100.004
618,619,1419,2475,3733,241.879,67.4403,22.5597,99.9834
619,620,10308,3372,3769,212.165,5.96749,84.0325,99.9865
620,621,4093,2270,3751,202.438,9.04894,80.9511,99.9834
621,622,16821,3234,3812,89.3368,81.9565,8.043510000000001,99.97
622,623,895,1274,3778,19.3879,59.8591,30.1409,99.9949
623,624,776,2185,3771,214.632,71.3256,18.6744,99.9738
624,625,675,3324,3797,74.4776,80.2528,9.74723,99.9709
625,626,1969,2237,3788,29.0889,4.82651,85.1735,99.9986
626,627,15172,346,3840,216.676,88.6532,1.34676,99.9954
627,628,2606,2343,3832,9.47912,36.3303,53.6697,99.9505
628,629,1984,76,3820,38.7029,17.8514,72.1486,99.8918
629,630,4899,2286,3850,20.7397,70.048,19.952,99.9196
630,631,1023,2057,3845,25.8617,11.4828,78.5172,99.9978
631,632,10759,137,3887,25.7186,24.8372,65.1628,98.6157
632,633,7989,2523,3887,17.5122,28.4914,61.5086,99.9826
633,634,14200,2888,3962,194.573,74.2011,15.7989,99.9148
634,635,7370,2106,3929,21.2634,48.1058,41.8942,99.9787
635,636,3657,622,3907,26.1608,36.0074,53.9926,99.9867
636,637,103743,282,4033,26.931,9.35566,80.6443,72.6414
637,638,650,1050,3900,28.1671,3.55554,86.4445,99.99
638,639,657,296,3895,13.915,10.7309,79.2691,99.0748
639,640,555,1500,3917,198.115,9.18585,80.8141,99.9933
640,641,29873,631,4015,29.3997,37.3711,52.6289,93.5028
641,642,1109,73,3954,22.38,27.1182,62.8818,99.9635
642,643,1466,1513,3960,201.076,30.8143,59.1857,99.9885
643,644,705,2546,3960,33.5784,52.672,37.328,99.9858
644,645,4798,3052,4011,202.55,72.6345,17.3655,99.9257
645,646,156925,1542,4176,203.61,9.67216,80.3278,99.9247
646,647,1443,2781,4026,191.483,81.7089,8.29107,99.5812
647,648,694,514,3992,202.24,58.762,31.238000000000003,99.9947
648,649,11955,799,4059,199.264,36.4483,53.5517,99.9337
649,650,1131,872,4040,20.7034,75.04899999999998,14.951,99.9745
650,651,1208,1782,4054,5.02786,66.6029,23.3971,99.9949
651,652,931,718,4061,218.146,40.4617,49.5383,99.9965
652,653,1388,1342,4071,22.5298,46.9319,43.0681,99.9674
653,654,7836,884,4115,32.6455,71.1903,18.8097,99.9808
654,655,29713,2153,4143,36.8019,44.5745,45.4255,99.8741
655,656,11799,349,4146,205.359,66.6096,23.3904,99.966
656,657,2019,3007,4109,195.575,1.96049,88.0395,99.9827
657,658,26003,677,4179,324.7290000000001,81.5037,8.49634,99.9432
658,659,3085,1232,4108,22.4427,48.3926,41.6074,99.9721
659,660,880,2869,4110,198.891,84.4871,5.51288,99.9662
660,661,13591,3326,4157,18.082,78.2244,11.7756,99.9639
661,662,879,2326,4116,52.6422,82.2378,7.76221,99.992
662,663,3777,503,4136,328.129,80.7509,9.24913,99.9947
663,664,19747,3008,4211,212.771,39.5579,50.4421,99.9623
664,665,1642,2331,4151,196.927,19.5346,70.4654,99.9928
665,666,42457,2059,4296,29.6636,15.5866,74.4134,99.9439
666,667,12328,562,4215,18.2236,6.22553,83.7745,99.9838
667,668,785,1265,4152,3.3278,80.5174,9.48259,99.8596
668,669,16299,2832,4190,48.4558,87.331,2.66895,99.9688
669,670,5417,1105,4157,27.0951,4.70822,85.2918,99.9937
670,671,40946,1135,4285,219.097,78.5551,11.4449,99.8699
671,672,57827,917,4302,207.694,5.63457,84.3654,99.8469
672,673,15135,795,4219,16.8751,6.40258,83.5974,99.9618
673,674,83692,403,4346,205.581,36.9871,53.0129,98.0895
674,675,269297,1922,4496,27.7025,43.1996,46.8004,78.8512
675,676,15996,199,4266,254.854,84.6009,5.39913,99.9493
676,677,4380,2160,4248,235.592,69.2637,20.7363,99.9722
677,678,53138,2666,4321,22.2407,36.2542,53.7458,99.9885
678,679,6871,3302,4256,161.45600000000005,83.0282,6.9717600000000015,99.8811
679,680,650,3389,4220,204.538,84.3129,5.6871,99.715
680,681,1966,2232,4242,197.849,24.6197,65.3803,99.9992
681,682,15657,2439,4310,114.218,83.9508,6.04919,99.9555
682,683,7132,3382,4324,18.8905,26.4618,63.5382,99.9131
683,684,13368,2279,4314,339.44199999999995,85.6985,4.30147,99.8844
684,685,64661,3237,4440,216.575,82.9253,7.07465,99.407
685,686,2479,2838,4288,115.226,87.4955,2.50452,99.9949
686,687,6775,1462,4339,32.7958,76.1087,13.8912,99.9824
687,688,5402,81,4352,26.354,24.0469,65.9531,99.6632
688,689,844,2364,4296,192.656,7.48952,82.5105,99.9884
689,690,26774,2984,4373,22.0151,1.15605,88.8439,93.7731
690,691,108908,1241,4511,204.905,3.92914,86.0709,87.6282
691,692,7332,3304,4334,342.129,85.4818,4.51818,99.9767
692,693,741,691,4307,193.732,4.085,85.915,99.5887
693,694,9676,721,4371,198.772,28.8682,61.1318,99.9375
694,695,625,1398,4337,21.2887,49.4973,40.5027,99.9644
695,696,1850,128,4363,3.5378,44.1174,45.8826,99.9872
696,697,726,2516,4370,38.2756,29.9556,60.0444,99.9926
697,698,2379,652,4405,29.9104,14.0421,75.9579,99.88
698,699,3979,1565,4383,178.678,72.7078,17.2922,99.9839
699,700,6768,2344,4404,195.966,4.3750800000000005,85.6249,99.621
700,701,48000,2804,4515,19.4989,76.5202,13.4798,68.0743
701,702,1771,2423,4389,37.3303,30.7814,59.2186,99.9044
702,703,4981,2508,4411,204.024,24.1852,65.8148,99.7753
703,704,927,153,4396,37.4507,47.0426,42.9574,99.9935
704,705,6070,1469,4426,16.1797,47.9287,42.0713,99.9858
705,706,11769,2245,4450,22.977,57.9468,32.0532,99.9914
706,707,4401,614,4440,220.424,76.5913,13.4087,99.9465
707,708,2185,106,4417,12.8043,80.5922,9.40777,99.9912
708,709,3441,967,4425,189.924,30.3762,59.6238,99.9949
709,710,1976,159,4439,10.2521,44.0066,45.9934,99.9914
710,711,5563,753,4450,193.519,7.64871,82.3513,99.9814
711,712,6346,1023,4471,209.394,69.548,20.452,96.5971
712,713,49432,469,4548,33.6151,41.8876,48.1124,83.7309
713,714,2130,2552,4454,41.1642,57.4591,32.5409,99.3111
714,715,8059,3060,4483,195.824,72.6572,17.3428,99.7279
715,716,2011,943,4471,194.618,10.2138,79.7862,99.9256
716,717,39630,2553,4569,201.521,38.6249,51.3751,99.8672
717,718,14012,113,4520,26.4867,22.5497,67.4503,99.4159
718,719,32327,855,4566,214.578,60.8454,29.1546,98.3193
719,720,2468,226,4493,350.797,76.2951,13.7049,99.8187
720,721,702,2312,4495,24.7095,12.0458,77.9542,99.7614
721,722,638,728,4481,70.1242,88.2575,1.74249,99.9968
722,723,1837,300,4503,217.11,67.9395,22.0605,99.8764
723,724,2801,2966,4534,215.0,57.5149,32.4851,99.5523
724,725,2663,720,4519,10.9838,80.1725,9.82749,99.5592
725,726,4735,183,4557,33.4437,46.7734,43.2266,99.9573
726,727,5665,262,4565,26.6021,23.456,66.544,99.9753
727,728,1721,675,4546,204.537,22.2352,67.7648,99.9975
728,729,669,3066,4532,26.7095,17.5607,72.4393,99.9841
729,730,1370,612,4546,289.685,71.928,18.072,99.9924
730,731,4496,3019,4573,29.383000000000006,49.0447,40.9553,99.9581
731,732,10845,3177,4606,190.456,63.9063,26.0937,99.9171
732,733,2488,3079,4590,217.918,62.108,27.892,99.7853
733,734,2401,733,4579,188.613,52.6585,37.3415,99.9544
734,735,2422,668,4585,25.3954,79.9075,10.0925,99.9709
735,736,4909,3363,4612,206.076,5.00862,84.9914,99.979
736,737,1932,2967,4601,31.6386,65.008,24.992,99.9924
737,738,7188,2608,4641,259.41,78.4775,11.5225,99.9647
738,739,2490,101,4618,212.441,68.3237,21.6763,99.9529
739,740,4293,247,4617,13.3376,8.30204,81.69800000000002,99.9258
740,741,5038,2926,4633,221.241,59.6277,30.3723,99.8524
741,742,658,370,4623,208.767,68.8101,21.1899,99.9923
742,743,2396,2828,4641,227.78,80.6395,9.36049,99.9916
743,744,2052,1232,4629,209.566,31.4645,58.5355,99.9474
744,745,743,673,4627,216.829,69.3183,20.6817,99.9635
745,746,9930,3059,4660,199.903,83.2808,6.7192,99.8847
746,747,2508,3300,4652,20.5785,68.15899999999999,21.841,99.9823
747,748,543,1307,4651,217.384,60.203,29.797,99.981
748,749,1191,2696,4670,24.4814,36.4088,53.5912,99.8299
749,750,3799,2814,4673,196.902,7.75076,82.2492,99.4645
750,751,657,3223,4676,190.599,81.3491,8.65092,99.9218
751,752,1191,3282,4685,319.573,82.9128,7.08719,99.9625
