,Grain No.,Size [Pixel],center x-coordinate,center y-coordinate,mean azimuth [degree],mean latitude [degree],mean colatitude [degree],Regelungsgrad [%]
0,1,84638,557,298,97.8218,14.6088,75.3912,99.794
1,2,2599,420,149,102.982,4.30342,85.6966,99.9792
2,3,6013,661,156,104.164,23.9865,66.0135,99.9747
3,4,7957,775,182,274.282,50.8757,39.1243,99.979
4,5,54467,261,374,94.1624,3.31055,86.6895,99.9733
5,6,522,860,137,269.815,10.3309,79.6691,99.9763
6,7,6903,959,172,285.878,17.0092,72.9908,99.9612
7,8,124127,1103,368,278.038,11.7943,78.2057,99.8755
8,9,2041,1293,165,281.363,12.572,77.428,99.9774
9,10,1172,1368,156,280.282,11.9668,78.0332,99.9879
10,11,3109,1517,179,275.809,45.2444,44.7556,99.9473
11,12,2602,876,165,270.463,10.1841,79.8159,99.9961
12,13,60984,1476,315,98.369,18.319000000000006,71.681,99.7514
13,14,695,1592,169,275.421,40.0368,49.9632,99.9713
14,15,2623,372,194,163.91,76.2256,13.7744,99.9844
15,16,380285,2572,466,271.814,32.0284,57.9716,87.3813
16,17,884,3369,186,275.421,9.79589,80.2041,99.8956
17,18,132941,1752,392,282.725,28.2258,61.7742,89.1675
18,19,5295,296,195,91.7443,30.4595,59.5405,99.9937
19,20,761,1565,201,286.943,11.7634,78.2366,99.9974
20,21,10793,2833,220,276.655,71.7706,18.2294,99.9859
21,22,12265,3115,244,269.36400000000003,60.4247,29.5753,99.9664
22,23,4872,855,237,276.071,11.5886,78.4114,99.9961
23,24,2595,3003,224,101.678,17.3699,72.6301,99.9411
24,25,6991,3290,246,101.547,22.7066,67.2934,99.9789
25,26,5927,2948,256,257.802,49.7635,40.2365,99.9913
26,27,1704,162,247,93.5042,3.27336,86.7266,99.9828
27,28,1637,1535,244,96.4932,22.3688,67.6312,99.9951
28,29,10599,763,299,96.3127,7.7900800000000014,82.2099,99.9811
29,30,840,387,248,103.68,24.3412,65.6588,99.998
30,31,763,113,260,96.457,3.37793,86.6221,99.9867
31,32,108438,3162,426,275.264,30.6234,59.3766,99.953
32,33,6304,3364,304,274.426,6.99815,83.0019,99.9475
33,34,1005,1648,261,274.79400000000004,67.2287,22.7713,99.9952
34,35,98323,2016,570,272.385,4.53677,85.4632,99.7662
35,36,40671,882,403,97.7536,25.0687,64.9313,99.9479
36,37,9507,1337,385,271.92400000000004,5.4191699999999985,84.5808,99.99
37,38,1131,2053,384,283.449,28.7687,61.2313,99.9986
38,39,10463,2918,471,266.563,55.0594,34.9406,99.9818
39,40,950,392,406,103.491,20.2945,69.7055,99.9894
40,41,4951,1418,444,89.6933,20.4732,69.5268,99.9872
41,42,38099,2366,529,267.579,2.50362,87.4964,99.9632
42,43,12360,440,471,158.685,77.3827,12.6173,99.8813
43,44,55789,1250,558,275.589,16.1898,73.8102,92.877
44,45,34079,687,516,125.416,67.5215,22.4785,99.6034
45,46,10689,147,538,261.876,41.8323,48.1677,99.9496
46,47,1491,2095,489,258.384,55.7449,34.2551,99.9918
47,48,1427,1011,504,273.963,43.007,46.993,99.8362
48,49,9251,2184,526,274.181,35.28,54.72,99.9722
49,50,8624,1473,544,106.302,32.4732,57.5268,56.1045
50,51,1624,2675,506,100.527,62.7508,27.2492,99.9811
51,52,103112,405,715,100.341,8.395480000000001,81.6045,99.5843
52,53,3585,873,532,100.816,89.5244,0.475601,99.8295
53,54,2236,918,556,87.9754,47.8397,42.1603,99.9967
54,55,5007,2971,573,97.8397,15.6092,74.3908,99.9837
55,56,5926,820,591,95.7894,7.490480000000002,82.5095,99.9871
56,57,743,3209,575,266.181,31.8323,58.1677,99.9961
57,58,17783,1511,724,272.074,57.29,32.71,99.8784
58,59,60436,3162,693,265.826,35.584,54.416,99.8752
59,60,1688,2261,628,128.201,69.6689,20.3311,99.971
60,61,7833,3278,615,271.11400000000003,2.7339900000000004,87.266,99.9863
61,62,8847,1405,642,92.4937,22.6239,67.3761,99.9901
62,63,20749,865,677,187.458,87.4406,2.55941,99.8909
63,64,1011,882,604,121.086,68.5197,21.4803,99.9943
64,65,18298,1823,739,270.772,30.9359,59.0641,99.955
65,66,15213,2342,672,264.636,5.22175,84.7783,99.8677
66,67,1024,690,619,90.7044,61.722,28.278,99.8937
67,68,618,1041,615,278.403,28.6073,61.3927,99.9884
68,69,29837,662,713,86.9076,54.7423,35.2577,99.9624
69,70,12120,1609,681,275.0,2.2815,87.7185,99.9905
70,71,1547,1468,636,90.8509,32.6426,57.3574,99.9294
71,72,6134,1729,663,283.749,13.5629,76.4371,99.947
72,73,12706,2500,736,90.0297,18.6796,71.3204,99.6302
73,74,674,1782,668,280.285,54.8748,35.1252,99.9962
74,75,3531,2124,685,127.612,69.7663,20.2337,99.9852
75,76,788,1331,681,88.0782,33.9316,56.0684,99.9561
76,77,2756,253,700,275.386,1.84769,88.1523,99.9662
77,78,3552,298,726,257.909,65.4879,24.5121,99.9949
78,79,1654,152,714,265.434,52.4866,37.5134,99.9894
79,80,9984,1301,748,100.928,1.76604,88.234,99.7231
80,81,5774,511,733,279.295,29.263,60.737,99.8011
81,82,7298,440,749,91.0403,19.0864,70.9136,99.9863
82,83,6761,223,773,104.963,60.6826,29.3174,99.9014
83,84,10687,1710,783,281.798,56.2494,33.7506,99.918
84,85,30038,1109,805,108.912,7.4253300000000015,82.5747,99.9778
85,86,1885,2175,733,92.8065,71.7852,18.2148,99.9802
86,87,4055,1384,754,81.4004,85.6626,4.33739,99.9791
87,88,16473,2247,804,273.559,27.3667,62.6333,99.9614
88,89,1930,2328,741,233.395,68.2612,21.7388,99.9981
89,90,597,1219,728,110.099,22.9667,67.0333,99.9982
90,91,1832,1659,744,268.391,2.84747,87.1525,99.9834
91,92,55328,927,894,128.558,72.209,17.791,99.9132
92,93,31500,2427,855,83.5011,12.588,77.41199999999998,99.9519
93,94,11447,2604,814,100.082,44.8806,45.1194,99.9895
94,95,1086,258,755,276.813,4.16289,85.8371,99.9948
95,96,11567,3155,813,96.5531,1.75764,88.2424,99.9572
96,97,32988,244,903,96.7494,1.10005,88.8999,99.866
97,98,1409,1609,764,275.325,9.13358,80.8664,99.9865
98,99,4682,2145,789,128.648,64.8955,25.1045,99.9887
99,100,4145,1226,798,106.493,15.263,74.737,99.9968
100,101,63213,2074,924,266.905,44.9186,45.0814,84.4522
101,102,6465,631,807,97.8035,1.99989,88.0001,99.9885
102,103,4628,2332,827,264.244,72.3615,17.6385,99.9924
103,104,16490,1566,890,268.568,49.6481,40.3519,99.9631
104,105,14385,557,875,95.0934,14.8666,75.1334,99.9575
105,106,52835,1384,920,103.927,39.108,50.892,96.1527
106,107,13668,1883,874,264.648,45.867,44.133,99.9069
107,108,19927,3264,887,266.317,35.5815,54.4185,99.9905
108,109,2214,752,838,127.235,72.1897,17.8103,99.9891
109,110,2086,3073,848,199.23,74.7398,15.2602,99.9559
110,111,3204,3353,857,278.195,1.75008,88.2499,99.9748
111,112,766,801,837,88.0291,53.081,36.919,99.9986
112,113,3163,715,868,102.486,19.1791,70.8209,99.9799
113,114,2490,1220,855,279.064,8.14733,81.8527,99.9598
114,115,20972,2972,922,85.1859,11.3855,78.6145,99.888
115,116,1567,1713,856,93.179,10.1634,79.8366,99.9975
116,117,3470,1793,868,272.526,66.1016,23.8984,99.996
117,118,1678,1641,873,94.9281,10.0425,79.9575,99.9649
118,119,4012,633,877,106.011,9.1846,80.8154,99.996
119,120,1999,1726,891,280.151,58.2055,31.7945,99.9964
120,121,5365,3121,926,101.167,27.1259,62.8741,99.9605
121,122,3564,2687,906,261.54200000000003,61.8822,28.1178,99.9972
122,123,53611,2679,1027,273.068,37.461,52.539,99.3079
123,124,57518,2202,1210,95.7341,63.463,26.537,99.9196
124,125,8980,125,1018,95.1232,5.51961,84.4804,99.9714
125,126,1533,170,923,116.265,46.5155,43.4845,99.9926
126,127,821,1212,907,278.39,5.81081,84.1892,99.9793
127,128,9882,2340,972,259.569,47.407,42.593,99.9556
128,129,658,2561,918,268.273,5.10551,84.8945,99.99
129,130,4952,689,952,102.878,10.7132,79.2868,99.992
130,131,12451,3331,1022,260.02,73.577,16.423,99.901
131,132,1070,742,921,100.476,34.7254,55.2746,99.9937
132,133,66036,1882,1086,271.518,1.34299,88.65700000000002,41.9802
133,134,9185,1779,953,226.506,88.9114,1.08858,99.8678
134,135,5846,2852,952,267.846,50.4979,39.5021,99.9927
135,136,1466,1155,942,302.395,67.3065,22.6935,99.988
136,137,7668,808,973,100.372,22.8137,67.1863,99.9723
137,138,7740,3235,997,267.764,26.4444,63.5556,99.9628
138,139,1527,3088,936,270.48900000000003,26.6035,63.3965,99.9969
139,140,6235,2493,980,273.825,0.0568695,89.9431,99.9193
140,141,1201,1071,943,304.566,70.035,19.965,99.9849
141,142,25111,1141,1039,273.099,22.341,67.65899999999999,99.878
142,143,4272,624,988,123.343,75.5756,14.4244,99.7696
143,144,3111,3044,986,261.344,41.2722,48.7278,99.9867
144,145,2415,184,990,238.841,71.3981,18.6019,99.7247
145,146,14075,3125,1030,273.612,19.6006,70.3994,96.7732
146,147,583,763,981,262.526,34.8164,55.1836,99.9923
147,148,2996,690,1030,94.3592,5.69652,84.3035,99.9468
148,149,6352,1548,1026,117.401,78.9922,11.0078,99.5374
149,150,530,1059,1006,289.832,75.4949,14.5051,99.9021
150,151,22067,451,1072,269.951,48.2295,41.7705,99.8982
151,152,896,2855,1016,263.898,33.3218,56.6782,99.9788
152,153,3361,2979,1032,108.101,53.6166,36.3834,99.9031
153,154,2674,754,1035,51.1535,87.3809,2.61913,99.9692
154,155,3505,232,1044,94.0801,58.7367,31.2633,99.9646
155,156,4808,1339,1048,276.651,73.7388,16.2612,99.9476
156,157,1800,2891,1036,259.918,42.9634,47.0366,99.9807
157,158,5004,589,1055,103.184,77.8553,12.1447,99.9826
158,159,9468,1615,1083,95.5391,6.09352,83.9065,99.9515
159,160,1024,2457,1030,269.755,15.7577,74.2423,99.9844
160,161,50499,864,1157,95.4802,9.52599,80.47399999999998,99.9983
161,162,22948,287,1139,270.12,60.5194,29.4806,99.9454
162,163,7141,2381,1080,90.0527,9.39635,80.6037,99.9518
163,164,4516,1687,1089,261.192,56.6476,33.3524,99.9928
164,165,1362,2453,1063,270.844,1.56804,88.432,99.9949
165,166,9840,1256,1105,109.078,67.0568,22.9432,99.9878
166,167,22661,2989,1164,264.985,39.5979,50.4021,98.9271
167,168,1341,1473,1075,91.0867,1.87619,88.1238,99.8575
168,169,11508,2907,1152,96.4644,27.6955,62.3045,99.9905
169,170,6872,674,1117,98.7087,25.809,64.191,99.9887
170,171,2096,1533,1102,95.2199,25.985,64.015,99.9936
171,172,24321,3195,1159,264.529,39.3753,50.6247,99.6098
172,173,19500,1469,1160,96.5164,25.7857,64.2143,99.6385
173,174,42044,2483,1216,271.383,75.5699,14.4301,99.9882
174,175,4591,2173,1111,279.708,18.1766,71.8234,99.9957
175,176,2216,1008,1100,100.788,17.0797,72.9203,99.9119
176,177,18932,2700,1185,110.595,65.783,24.217,99.9774
177,178,5796,1352,1171,90.7189,3.70229,86.2977,99.9894
178,179,1741,1365,1111,278.26,54.0905,35.9095,99.9929
179,180,1500,1913,1131,265.315,49.2592,40.7408,99.9166
180,181,2722,3348,1143,262.498,38.8151,51.1849,99.9685
181,182,11770,1042,1180,282.827,72.4893,17.5107,99.8096
182,183,4216,579,1164,269.634,17.5726,72.4274,99.9345
183,184,6451,136,1163,94.3185,24.8487,65.1513,99.9228
184,185,502,1738,1125,109.174,11.9861,78.0139,99.9925
185,186,3082,2627,1145,94.9461,0.294289,89.7057,99.997
186,187,1131,1575,1148,110.491,41.5821,48.4179,99.9976
187,188,11377,2353,1220,269.8,23.3714,66.6286,99.9854
188,189,12009,403,1198,92.0526,27.5241,62.4759,99.7983
189,190,9507,711,1206,99.2455,7.38087,82.6191,99.9872
190,191,717,1178,1144,91.3774,0.611069,89.3889,99.9941
191,192,544,1679,1151,104.909,48.5571,41.4429,99.9334
192,193,16994,3296,1243,102.285,37.6276,52.3724,99.9475
193,194,1023,554,1156,261.798,72.2214,17.7786,99.9956
194,195,2673,512,1184,106.752,68.5346,21.4654,99.9904
195,196,45201,1183,1265,132.30700000000002,77.8457,12.1543,99.8656
196,197,29953,1682,1255,251.054,71.7796,18.2204,99.9791
197,198,1059,1745,1174,123.985,75.0936,14.9064,99.9731
198,199,23936,211,1266,93.6184,13.7794,76.2206,99.9541
199,200,2361,635,1195,252.97,71.1656,18.8344,99.9907
200,201,885,2119,1174,279.768,17.6518,72.3482,99.9945
201,202,1207,1293,1195,274.61,17.9168,72.0832,99.9497
202,203,552,1911,1177,95.3652,8.49821,81.5018,99.9946
203,204,15923,2796,1249,93.1746,16.2188,73.7812,99.9856
204,205,5213,1859,1211,94.9902,4.86569,85.1343,99.8697
205,206,1261,3044,1197,255.291,50.8698,39.1302,99.9804
206,207,10574,2244,1272,273.515,13.0768,76.9232,99.9745
207,208,6880,3092,1247,264.911,64.9377,25.0623,99.9725
208,209,6525,2053,1254,272.373,46.1098,43.8902,99.986
209,210,1310,1775,1230,271.578,83.6236,6.37643,99.9791
210,211,14600,475,1291,110.856,61.7388,28.2612,99.9027
211,212,1542,1417,1261,93.8261,0.618736,89.3813,99.9451
212,213,7495,624,1268,114.719,73.9289,16.0711,99.9928
213,214,93700,1454,1517,96.7533,13.2094,76.7906,94.9391
214,215,3176,1362,1254,274.045,17.3542,72.6458,99.9641
215,216,506,550,1240,260.078,51.1457,38.8543,99.9917
216,217,24874,1881,1329,102.992,36.3813,53.6187,99.9456
217,218,23156,2997,1353,86.0284,12.9503,77.0497,99.9414
218,219,5720,926,1304,102.058,63.4869,26.5131,99.9912
219,220,605,2677,1288,263.219,49.265,40.735,99.9899
220,221,2172,344,1290,99.941,8.97376,81.0262,99.9921
221,222,973,692,1288,272.039,4.943980000000002,85.056,99.9972
222,223,647,150,1284,95.1124,33.7315,56.2685,99.9928
223,224,974,2565,1294,276.718,63.4351,26.5649,99.9496
224,225,1494,740,1294,259.339,56.2852,33.7148,99.9041
225,226,4656,997,1323,266.446,75.7341,14.2659,99.5421
226,227,10916,2725,1348,102.783,7.041289999999999,82.9587,99.9869
227,228,7285,2017,1326,265.628,42.8173,47.1827,81.8952
228,229,2183,3185,1302,99.4041,31.5987,58.4013,99.9745
229,230,27361,872,1385,273.557,27.1017,62.8983,99.9301
230,231,5575,2883,1334,97.0161,68.9866,21.0134,99.9847
231,232,6331,2622,1328,96.716,9.59618,80.4038,99.9764
232,233,4497,1638,1324,107.316,37.1441,52.8559,99.9778
233,234,910,363,1314,269.095,61.7544,28.2456,99.995
234,235,10536,3112,1367,99.3713,16.4953,73.5047,99.9925
235,236,2523,587,1329,98.6554,9.54178,80.4582,99.9931
236,237,8374,2306,1363,277.547,22.9108,67.0892,99.9769
237,238,1362,385,1327,97.2164,11.3613,78.6387,99.9963
238,239,1284,2371,1328,268.403,14.4372,75.5628,99.9318
239,240,574,181,1323,97.0376,32.263000000000005,57.737,99.9055
240,241,19834,3263,1384,250.243,80.3897,9.61027,99.9707
241,242,2959,706,1351,272.281,3.63671,86.3633,99.9473
242,243,765,2246,1335,268.575,69.8409,20.1591,99.9957
243,244,872,624,1341,262.274,67.2165,22.7835,99.9955
244,245,3828,433,1355,98.4962,31.2114,58.7886,99.9894
245,246,1721,1626,1367,96.955,26.3058,63.6942,99.9597
246,247,2147,1119,1358,277.404,3.65261,86.3474,99.9864
247,248,1015,1586,1348,247.062,71.7025,18.2975,99.9199
248,249,2283,2537,1354,256.841,48.1105,41.8895,99.96
249,250,44576,399,1498,268.499,60.672,29.328000000000007,96.2378
250,251,3200,2822,1373,261.01,52.2147,37.7853,99.9881
251,252,4117,1228,1393,273.33,0.0961227,89.9039,99.817
252,253,1787,209,1370,275.284,66.1117,23.8883,99.9953
253,254,4989,517,1387,263.516,66.3747,23.6253,99.9044
254,255,541,176,1365,269.601,28.947,61.053,99.9785
255,256,1013,1301,1370,95.147,1.03396,88.96600000000002,99.9252
256,257,7372,2467,1415,89.2333,60.5984,29.4016,52.9203
257,258,560,1362,1373,92.5484,11.2789,78.7211,99.9938
258,259,9165,2005,1428,264.19,44.1258,45.8742,92.574
259,260,4119,2391,1392,272.123,68.8546,21.1454,99.9964
260,261,824,1029,1371,276.083,8.71824,81.2818,99.9949
261,262,2377,138,1390,278.501,2.8649400000000003,87.1351,99.9843
262,263,12737,671,1421,121.764,63.0152,26.9848,99.9921
263,264,9274,1733,1405,273.03,53.0099,36.9901,99.9836
264,265,12842,2608,1414,99.1402,68.834,21.166,99.9717
265,266,3819,1079,1404,132.29399999999998,82.8001,7.199910000000001,99.9886
266,267,1999,1163,1402,126.674,83.1924,6.8076300000000005,99.9822
267,268,8160,251,1436,95.4003,3.687980000000001,86.31200000000003,99.9632
268,269,60988,2846,1559,94.7074,14.5704,75.4296,99.2005
269,270,1207,560,1400,280.493,8.65207,81.3479,99.982
270,271,1968,108,1432,115.656,82.5183,7.4817300000000015,99.9798
271,272,2768,2343,1434,268.637,55.7761,34.2239,99.971
272,273,11687,3177,1471,270.643,73.1462,16.8538,99.8554
273,274,1325,180,1423,93.2624,37.2398,52.7602,99.972
274,275,37666,1851,1563,121.261,69.4487,20.5513,99.6932
275,276,4940,3053,1457,272.409,28.5226,61.4774,99.9821
276,277,5385,553,1467,256.41700000000003,67.2014,22.7986,99.9373
277,278,7484,1651,1468,108.254,40.3375,49.6625,99.9831
278,279,2454,2716,1454,108.455,73.6517,16.3483,99.9775
279,280,4689,1060,1463,103.911,9.75715,80.2429,99.9819
280,281,4831,1144,1467,274.766,36.7011,53.2989,99.9863
281,282,35677,2267,1508,273.931,27.791,62.209,62.0883
282,283,14549,1252,1539,271.711,24.023000000000003,65.977,99.992
283,284,5111,2062,1480,237.635,79.5864,10.4136,99.9903
284,285,51773,936,1601,276.505,8.56149,81.4385,99.7691
285,286,710,2507,1457,261.586,46.7108,43.2892,99.9934
286,287,2868,612,1490,273.559,3.82626,86.1737,99.9726
287,288,24650,2603,1537,265.134,48.2593,41.7407,99.975
288,289,37821,3239,1591,276.516,6.35763,83.6424,89.7414
289,290,19717,157,1576,93.8109,6.96519,83.0348,99.725
290,291,631,664,1480,98.6996,72.1281,17.8719,99.9941
291,292,2110,2964,1496,270.26,28.9746,61.0254,99.9762
292,293,2140,1025,1512,116.146,81.1554,8.844560000000003,99.5683
293,294,1192,2492,1498,271.288,67.4939,22.5061,99.9778
294,295,2332,748,1507,94.4835,16.0726,73.9274,99.9895
295,296,5640,250,1531,100.629,16.81,73.19,94.5844
296,297,14552,3062,1559,250.384,74.3724,15.6276,99.9084
297,298,997,704,1501,273.582,3.1649700000000003,86.835,99.9971
298,299,3250,1979,1532,264.325,30.7479,59.2521,99.9172
299,300,28900,1124,1609,105.547,43.8546,46.1454,99.872
300,301,845,667,1514,101.445,38.8428,51.1572,99.8011
301,302,7184,1688,1558,132.60299999999998,83.6256,6.37437,99.8268
302,303,6137,299,1600,96.4947,9.52033,80.4797,99.9499
303,304,8187,564,1565,97.2131,4.23291,85.7671,99.9805
304,305,2539,1608,1549,268.52,52.3299,37.6701,99.931
305,306,6941,2446,1580,275.678,49.6688,40.3312,99.7459
306,307,7758,1912,1567,231.637,83.1773,6.82274,99.9655
307,308,1365,2722,1544,237.9,82.1142,7.88582,99.8857
308,309,6803,654,1577,277.125,47.158,42.842,99.994
309,310,1042,718,1546,90.6159,0.8676149999999999,89.1324,99.9957
310,311,7552,2045,1586,276.79200000000003,0.0767365,89.9233,99.9827
311,312,1957,1755,1570,274.008,2.5220700000000003,87.4779,99.9956
312,313,4066,1538,1588,268.249,39.7534,50.2466,99.9871
313,314,1157,1016,1561,124.654,77.2749,12.7251,99.9846
314,315,8372,2239,1600,94.8674,8.88213,81.1179,99.9927
315,316,554,2377,1565,270.942,53.9687,36.0313,99.9907
316,317,3376,2696,1595,91.0314,72.5145,17.4855,99.9958
317,318,622,1314,1579,270.981,24.0821,65.9179,99.9897
318,319,1543,87,1604,235.651,74.185,15.815,99.9683
319,320,2197,1600,1601,83.48,35.893,54.107,99.9967
320,321,3089,2525,1602,92.3015,28.6878,61.3122,99.9747
321,322,699,2386,1592,266.987,47.9832,42.0168,99.9961
322,323,7005,2145,1630,266.747,49.0814,40.9186,99.9722
323,324,18358,749,1659,272.271,1.95444,88.0456,99.9958
324,325,2618,494,1615,271.03,20.3501,69.6499,99.9229
325,326,13185,2473,1705,91.1256,23.5933,66.4067,98.9073
326,327,2397,2968,1626,268.663,25.1494,64.8506,99.97
327,328,1664,1664,1623,264.018,29.1135,60.8865,99.9973
328,329,2080,2369,1627,96.3953,36.1914,53.8086,99.9863
329,330,1088,1988,1623,284.951,85.8942,4.10582,99.9867
330,331,2269,244,1649,238.392,72.8819,17.1181,99.9898
331,332,4846,580,1654,97.0154,5.0975800000000016,84.9024,99.9842
332,333,3117,2716,1660,264.243,49.1042,40.8958,99.9616
333,334,2251,2286,1652,85.2862,1.51045,88.4895,99.9885
334,335,768,863,1642,90.8137,28.1045,61.8955,99.9959
335,336,1907,2656,1657,90.0421,28.6982,61.3018,99.9935
336,337,5454,2050,1698,267.789,49.5036,40.4964,99.9652
337,338,11197,1711,1693,86.0436,8.35849,81.6415,99.9782
338,339,621,2424,1648,261.379,71.9662,18.0338,99.9755
339,340,27357,3265,1788,98.1816,48.1397,41.8603,99.9173
340,341,7479,2558,1704,92.9292,28.4472,61.5528,99.9528
341,342,5465,1585,1670,88.3891,77.9336,12.0664,99.9889
342,343,26479,3092,1738,267.579,2.1792700000000003,87.8207,99.9827
343,344,38770,2914,1794,267.381,43.3351,46.6649,99.9383
344,345,859,351,1656,265.541,60.6441,29.3559,99.9847
345,346,3415,1988,1682,116.602,65.9299,24.0701,99.9477
346,347,6042,523,1699,75.8294,71.8468,18.1532,99.9632
347,348,669,1318,1664,270.683,24.1699,65.8301,99.9888
348,349,10355,2342,1708,261.216,72.9055,17.0945,99.9949
349,350,2315,1355,1690,86.324,32.655,57.345,99.9536
350,351,575,644,1679,148.93,79.5642,10.4358,99.9922
351,352,1062,89,1694,93.3858,11.5767,78.4233,99.9815
352,353,42173,2227,1819,97.2816,56.9938,33.0062,99.7897
353,354,2395,878,1707,95.4764,41.3561,48.6439,99.9223
354,355,4448,311,1722,98.1102,4.4379800000000005,85.56200000000003,99.9657
355,356,1549,2634,1696,96.8914,16.0375,73.9625,99.9796
356,357,23317,453,1770,233.258,76.1529,13.8471,99.9461
357,358,36238,1781,1846,235.208,75.6833,14.3167,99.8541
358,359,2046,243,1732,91.2624,6.74603,83.25399999999998,99.862
359,360,807,266,1702,94.1526,30.9931,59.0069,99.994
360,361,5186,1297,1715,86.9712,14.3594,75.6406,99.9746
361,362,16167,2690,1760,264.289,34.5012,55.4988,99.9262
362,363,15266,1158,1794,92.3157,7.98756,82.0124,99.9692
363,364,10056,137,1761,265.406,66.3151,23.6849,99.9931
364,365,968,835,1719,276.995,11.1889,78.8111,99.8592
365,366,1598,648,1726,273.789,12.4489,77.5511,99.9947
366,367,1666,1549,1722,264.448,74.84899999999998,15.151,99.9935
367,368,599,931,1718,93.5363,56.6184,33.3816,99.9825
368,369,3699,588,1758,273.4,9.27222,80.7278,99.9843
369,370,11121,1635,1766,102.438,19.1405,70.8595,99.982
370,371,2469,1839,1739,269.58,26.7845,63.2155,99.9922
371,372,20951,1989,1826,98.2619,18.99,71.01,99.634
372,373,1764,3335,1749,263.033,62.0546,27.9454,99.9508
373,374,21401,727,1808,128.03,79.5246,10.4754,99.9622
374,375,3332,1285,1769,88.2494,61.8583,28.1417,99.9499
375,376,4710,911,1773,278.664,52.9427,37.0573,99.9792
376,377,3921,1896,1772,113.677,72.5801,17.4199,99.9896
377,378,1388,631,1768,274.524,13.9432,76.0568,99.9978
378,379,4337,831,1795,270.183,12.1357,77.8643,99.9422
379,380,1048,2059,1767,278.249,0.0200958,89.9799,99.9936
380,381,9109,941,1838,89.0606,49.9223,40.0777,99.8467
381,382,28780,2426,1849,94.5885,24.938,65.062,99.759
382,383,1228,2405,1781,266.711,40.549,49.451,99.9969
383,384,537,199,1788,250.318,76.3714,13.6286,99.955
384,385,3679,2103,1822,122.601,78.5703,11.4297,99.9072
385,386,7298,1339,1831,100.064,51.8124,38.1876,99.9311
386,387,2273,91,1828,265.948,28.7019,61.2981,99.9807
387,388,41481,370,1892,275.921,3.5732,86.4268,97.9884
388,389,2482,2586,1805,98.9069,48.8821,41.1179,99.9841
389,390,1212,226,1805,91.778,0.0582809,89.9417,99.9753
390,391,2788,1564,1811,92.9656,19.1014,70.8986,99.9883
391,392,1023,618,1811,90.8573,7.0537100000000015,82.9463,99.9972
392,393,997,1887,1815,92.642,71.9811,18.0189,99.9854
393,394,4469,1034,1842,107.041,38.8078,51.1922,99.9857
394,395,18969,1257,1904,281.131,42.1651,47.8349,99.9827
395,396,908,198,1834,94.8473,23.6178,66.3822,99.9897
396,397,1169,2204,1830,264.028,72.8808,17.1192,99.9691
397,398,14503,2662,1866,236.634,83.3422,6.65782,99.9657
398,399,5975,1397,1891,98.0062,10.1779,79.8221,99.9936
399,400,3029,145,1865,93.2507,37.2769,52.7231,99.9887
400,401,669,1436,1837,91.2726,28.4554,61.5446,99.9784
401,402,4794,1624,1878,97.8204,21.2152,68.7848,99.9417
402,403,1108,2222,1851,99.4032,63.2433,26.7567,99.9982
403,404,1179,632,1848,273.849,8.94333,81.0567,99.9711
404,405,2005,1674,1871,263.329,43.8515,46.1485,99.9755
405,406,3150,1559,1871,248.555,62.5969,27.4031,99.9691
406,407,765,1513,1850,105.162,5.2773900000000005,84.7226,99.9928
407,408,16103,1493,1948,274.931,8.19978,81.8002,99.8562
408,409,1616,3178,1864,113.795,53.6803,36.3197,99.9957
409,410,11598,3109,1911,96.9024,0.926056,89.0739,99.9818
410,411,27167,537,2035,116.48,62.0187,27.9813,99.5255
411,412,552,3031,1854,283.277,78.3083,11.6917,99.9987
412,413,1522,864,1876,255.628,46.9176,43.0824,99.9814
413,414,1567,1904,1883,270.821,27.2311,62.7689,99.9705
414,415,822,101,1888,93.1693,37.5111,52.4889,99.9748
415,416,3382,2178,1893,104.033,70.1835,19.8165,99.9941
416,417,1033,2787,1869,95.5985,28.8606,61.1394,99.9953
417,418,13521,2100,1945,271.548,28.2762,61.7238,99.7562
418,419,3146,1134,1915,265.247,61.2341,28.7659,99.9854
419,420,18821,772,1949,92.2328,11.4871,78.5129,99.9904
420,421,4572,3274,1901,96.6069,8.04573,81.9543,99.9911
421,422,11686,1038,1933,93.7672,7.34768,82.6523,99.9449
422,423,9351,3037,1954,269.521,42.8675,47.1325,99.8864
423,424,1930,647,1904,278.53,8.70116,81.2988,99.997
424,425,9592,2539,1948,103.996,37.6123,52.3877,99.9188
425,426,8344,2827,1947,256.457,60.8575,29.1425,99.9912
426,427,864,2780,1906,263.7,49.8635,40.1365,99.97
427,428,3883,3198,1934,111.908,62.244,27.756,99.9799
428,429,12404,2743,1969,92.7914,4.00851,85.9915,99.8357
429,430,27020,1593,2049,107.944,48.9484,41.0516,99.8595
430,431,6492,884,1952,155.436,79.7761,10.2239,99.9908
431,432,10691,2931,1969,229.144,79.8343,10.1657,99.988
432,433,874,941,1928,81.6257,73.4806,16.5194,99.9935
433,434,2099,2619,1951,103.283,39.7257,50.2743,99.9803
434,435,23767,1853,2014,151.935,75.3027,14.6973,99.8463
435,436,687,1979,1937,101.764,42.5617,47.4383,99.91
436,437,772,3341,1934,95.932,9.08065,80.9193,99.9735
437,438,1661,160,1975,93.7024,37.1298,52.8702,99.9315
438,439,24588,3271,2030,101.395,47.6129,42.3871,99.9206
439,440,6574,1164,1978,110.29,39.7985,50.2015,99.942
440,441,5148,330,1965,97.2427,18.3162,71.6838,99.9897
441,442,27750,1366,2037,97.5211,26.4361,63.5639,91.6927
442,443,1014,95,1983,92.3347,37.5034,52.4966,99.9262
443,444,4195,2007,1988,99.8603,16.5853,73.4147,64.5472
444,445,3160,687,1978,277.69,8.48338,81.5166,99.9953
445,446,26322,2420,2031,92.593,52.3836,37.6164,99.8021
446,447,4765,2177,2006,264.36400000000003,56.0511,33.9489,99.983
447,448,13637,977,2061,98.9746,62.7294,27.2706,99.8111
448,449,23673,1717,2093,283.842,86.8205,3.17946,99.8845
449,450,40769,327,2091,95.714,4.02681,85.9732,99.5872
450,451,43485,1142,2119,98.6158,2.76505,87.235,99.946
451,452,10878,2248,2038,128.563,85.7274,4.27256,67.488
452,453,2500,427,2007,160.14700000000005,79.8259,10.1741,99.7154
453,454,61695,2623,2140,274.666,50.5794,39.4206,99.9777
454,455,2057,3144,2006,108.904,57.7487,32.2513,99.9942
455,456,17001,1965,2076,108.055,78.1804,11.8196,99.9099
456,457,2528,170,2040,251.025,87.0792,2.92078,99.9453
457,458,1615,1756,2018,103.592,50.6785,39.3215,99.9027
458,459,2148,833,2027,88.8952,41.6946,48.3054,99.8979
459,460,777,1238,2013,93.9969,52.8079,37.1921,99.8954
460,461,1019,903,2021,90.213,46.2921,43.7079,99.7821
461,462,15489,657,2080,97.0807,10.8148,79.1852,99.9583
462,463,32085,2934,2119,86.0123,35.0279,54.9721,99.9012
463,464,4414,3082,2077,98.9019,40.2041,49.7959,99.9283
464,465,9205,2098,2082,109.861,59.7321,30.2679,99.9183
465,466,750,2792,2051,88.0532,30.5344,59.4656,99.978
466,467,18447,801,2126,88.5679,45.0982,44.9018,99.9659
467,468,44563,3213,2218,280.177,55.7097,34.2903,99.9704
468,469,1000,2289,2067,87.3002,67.3624,22.6376,99.9968
469,470,7323,2783,2136,16.2503,84.7544,5.24563,99.93
470,471,2136,91,2099,101.068,57.9502,32.0498,99.9447
471,472,4119,184,2124,93.7819,3.89641,86.1036,99.9651
472,473,1328,2321,2102,268.01,65.9703,24.0297,99.998
473,474,40938,2254,2201,94.329,19.8591,70.1409,99.6674
474,475,1421,916,2122,106.369,49.2095,40.7905,99.9112
475,476,1586,3345,2120,277.905,5.61244,84.3876,99.9769
476,477,1923,1499,2122,272.331,46.9343,43.0657,99.9693
477,478,2155,571,2125,92.9884,3.87285,86.1272,99.994
478,479,1430,1385,2122,114.69,46.6207,43.3793,99.9968
479,480,21082,1367,2202,90.4869,24.8107,65.1893,99.9585
480,481,4651,2437,2154,93.4558,12.5408,77.4592,99.9279
481,482,8989,1901,2168,94.6568,44.8396,45.1604,99.9621
482,483,4314,2081,2181,102.545,42.9496,47.0504,99.9557
483,484,24377,186,2241,97.236,25.2543,64.7457,99.9766
484,485,908,516,2151,272.463,8.71364,81.2864,99.9485
485,486,1679,3284,2151,268.202,67.8073,22.1927,99.9799
486,487,23247,879,2264,267.355,22.1559,67.8441,99.9037
487,488,9173,1009,2201,99.035,12.5435,77.4565,99.841
488,489,32039,1955,2327,156.453,81.7676,8.2324,99.8036
489,490,747,2390,2171,275.488,52.0427,37.9573,99.9938
490,491,7757,673,2199,87.6741,0.552246,89.4478,99.9942
491,492,12922,569,2226,81.8319,68.8795,21.1205,99.986
492,493,508,1518,2168,277.361,60.8813,29.1187,99.9949
493,494,19418,1631,2233,281.565,38.7127,51.2873,99.9818
494,495,4640,272,2211,184.845,82.8136,7.18637,99.9662
495,496,1633,3069,2186,162.60399999999996,76.8918,13.1082,99.9871
496,497,13813,2446,2261,115.847,47.3656,42.6344,99.8692
497,498,93509,1673,2465,269.586,33.8459,56.1541,34.7133
498,499,19725,3091,2298,96.7683,36.6997,53.3003,99.9743
499,500,9966,1768,2239,272.205,66.7438,23.2562,99.9514
500,501,1622,3348,2213,281.866,65.8677,24.1323,99.9385
501,502,37292,2974,2407,93.5854,38.8156,51.1844,99.6279
502,503,972,1849,2214,208.647,80.101,9.89896,99.9723
503,504,728,2520,2216,275.643,50.8336,39.1664,99.9752
504,505,4518,732,2250,282.4190000000001,5.15695,84.84299999999998,99.9513
505,506,1045,3005,2223,271.224,68.3608,21.6392,99.9965
506,507,19408,1170,2293,273.736,0.467583,89.5324,99.9162
507,508,5315,461,2271,270.202,24.4196,65.5804,99.5954
508,509,7424,2948,2257,233.055,81.8398,8.160169999999999,99.9963
509,510,584,786,2225,266.376,30.7918,59.2082,99.9836
510,511,9752,371,2295,271.30400000000003,52.351000000000006,37.649,99.9469
511,512,4749,2147,2267,137.167,81.0017,8.99831,99.9968
512,513,935,2798,2261,94.9665,13.0512,76.9488,99.9752
513,514,7149,1840,2278,277.927,31.072,58.928,99.9932
514,515,17314,1009,2321,278.79900000000004,5.18246,84.8175,99.8248
515,516,14530,2062,2331,193.927,79.3295,10.6705,99.8834
516,517,533,789,2263,282.028,5.40716,84.5928,99.9921
517,518,1443,1309,2283,264.462,42.3985,47.6015,99.9903
518,519,729,447,2276,87.3306,11.9372,78.0628,99.9938
519,520,2487,1647,2302,90.2527,0.00710297,89.9929,99.9903
520,521,35083,150,2422,104.064,14.9321,75.0679,99.9201
521,522,25108,656,2387,103.948,57.649,32.351,99.9687
522,523,4532,551,2319,278.773,13.7747,76.2253,99.9772
523,524,13873,2717,2347,99.6763,45.3737,44.6263,99.9686
524,525,2019,2791,2301,94.6054,11.1578,78.8422,99.9927
525,526,999,2630,2304,286.524,66.6164,23.3836,99.9984
526,527,3168,1271,2324,266.867,40.4758,49.5242,99.9895
527,528,764,1405,2305,271.198,29.3681,60.6319,99.9962
528,529,18256,2240,2373,266.849,7.85933,82.1407,99.9547
529,530,1663,2000,2322,275.398,4.28361,85.7164,99.9645
530,531,9617,1342,2359,282.518,8.25202,81.748,99.9964
531,532,1860,2539,2331,279.011,0.452736,89.5473,99.8762
532,533,9728,2342,2389,266.92900000000003,53.597,36.403,99.9347
533,534,7670,1699,2362,282.212,15.7167,74.2833,99.9723
534,535,5779,785,2357,134.321,74.4546,15.5454,99.989
535,536,6114,2497,2373,266.695,17.0934,72.9066,99.9115
536,537,8129,1814,2367,148.128,74.86399999999998,15.136,99.9777
537,538,3529,2117,2356,155.58,77.9214,12.0786,99.9667
538,539,6270,2593,2369,263.857,34.1212,55.8788,99.9821
539,540,43195,505,2537,89.4851,5.71005,84.2899,99.7921
540,541,879,291,2347,96.367,23.0168,66.9832,99.9819
541,542,5539,1406,2391,265.978,14.933,75.067,99.987
542,543,5873,3223,2403,90.4346,9.09837,80.9016,99.9246
543,544,535,1642,2350,96.1553,70.2784,19.7216,99.9911
544,545,13922,929,2450,264.433,24.3701,65.6299,99.7887
545,546,1390,1576,2374,255.05900000000003,40.7093,49.2907,99.9896
546,547,696,2805,2379,90.2241,37.877,52.12300000000001,99.9128
547,548,20687,309,2473,252.30900000000003,69.0075,20.9925,99.4727
548,549,7643,1095,2424,128.289,66.273,23.727,99.9528
549,550,896,379,2383,92.3611,12.2681,77.7319,99.984
550,551,1765,2670,2401,94.3025,17.6551,72.3449,99.9149
551,552,551,1620,2381,259.797,40.7879,49.2121,99.9836
552,553,711,2381,2378,215.914,82.7846,7.215439999999999,99.9775
553,554,11397,2463,2445,109.28,45.4887,44.5113,99.7968
554,555,25221,1271,2464,266.483,22.675,67.325,99.7695
555,556,827,3163,2408,91.1379,35.5188,54.4812,99.992
556,557,745,1138,2391,259.397,16.3338,73.6662,99.9956
557,558,1336,246,2409,264.177,41.8129,48.1871,99.9466
558,559,6449,439,2426,94.6725,25.538,64.462,99.7548
559,560,1819,2145,2405,136.108,71.8753,18.1247,99.9697
560,561,6395,1565,2430,268.54200000000003,17.7295,72.2705,99.9847
561,562,2476,2629,2424,96.2642,34.4973,55.5027,99.9713
562,563,3266,822,2435,258.185,41.4922,48.5078,99.9909
563,564,641,1029,2411,268.862,27.3222,62.6778,99.942
564,565,1264,870,2419,95.8301,61.1302,28.8698,99.9949
565,566,2381,1651,2441,271.795,28.3921,61.6079,99.9906
566,567,1060,2724,2433,268.231,9.24931,80.7507,99.9707
567,568,3550,2111,2454,160.42700000000005,80.395,9.60505,99.9792
568,569,3078,2570,2452,97.8457,34.5982,55.4018,99.9739
569,570,4068,2815,2456,238.058,74.5467,15.4533,99.9982
570,571,13250,743,2490,95.7281,43.6841,46.3159,99.84
571,572,6238,2743,2480,245.828,71.6871,18.3129,99.9981
572,573,3639,2369,2471,85.7015,16.6625,73.3375,99.988
573,574,6617,3180,2476,98.4012,19.6748,70.3252,99.9851
574,575,7507,2658,2503,269.406,8.67888,81.3211,99.9122
575,576,5795,1417,2496,118.092,72.2534,17.7466,99.9308
576,577,1036,3249,2468,264.298,8.64526,81.3547,99.9897
577,578,1013,2261,2474,225.308,72.5259,17.4741,99.9894
578,579,21316,1039,2529,103.571,59.0807,30.9193,99.7215
579,580,37327,2214,2545,92.0411,18.4551,71.5449,77.3213
580,581,17074,2884,2560,94.288,15.9432,74.0568,99.9597
581,582,34514,3098,2597,241.595,82.6547,7.34532,56.4003
582,583,18656,2537,2567,89.8308,24.7345,65.2655,99.9294
583,584,1333,2314,2511,121.201,80.0393,9.96068,99.9346
584,585,601,2789,2515,87.1386,37.5095,52.4905,99.9977
585,586,3820,1244,2539,95.8298,14.9632,75.0368,99.9724
586,587,6254,3306,2578,279.223,6.06157,83.9384,99.9588
587,588,686,845,2525,269.697,16.5144,73.4856,99.9879
588,589,10784,2773,2589,84.9812,13.1307,76.8693,99.2658
589,590,27155,831,2614,252.961,60.4236,29.5764,99.9019
590,591,1598,3245,2546,268.55,1.95196,88.04799999999999,99.8923
591,592,12616,134,2590,95.9677,18.6074,71.3926,99.8764
592,593,8809,1152,2600,92.84,13.4884,76.5116,99.6307
593,594,23304,1457,2638,95.9095,27.6904,62.3096,99.7576
594,595,689,650,2557,95.3959,35.1922,54.8078,99.9908
595,596,2874,909,2568,87.2778,14.3465,75.6535,99.992
596,597,1370,1123,2558,274.5,3.64587,86.3541,99.9961
597,598,2704,2026,2571,96.8258,42.5169,47.4831,99.9864
598,599,5688,1337,2608,111.592,73.8581,16.1419,99.9857
599,600,4896,1692,2586,277.98400000000004,16.1726,73.8274,99.971
600,601,632,2084,2571,100.535,26.6468,63.3532,99.9935
601,602,13768,239,2682,273.14,22.9796,67.0204,99.9746
602,603,9413,2213,2648,269.648,43.2438,46.7562,99.9518
603,604,1171,1245,2585,276.904,3.86139,86.1386,99.9931
604,605,1352,1286,2595,265.03,21.4934,68.5066,99.996
605,606,1816,2371,2596,94.3461,6.568410000000001,83.4316,99.9893
606,607,9105,3221,2651,90.3305,0.289009,89.711,99.9958
607,608,4060,428,2617,94.9809,14.1165,75.8835,99.8415
608,609,5030,2688,2622,103.132,31.3541,58.6459,99.9862
609,610,1566,1813,2607,275.083,19.7773,70.2227,99.9889
610,611,2470,2022,2616,133.00799999999998,76.9159,13.0841,99.994
611,612,13541,2078,2684,90.3493,22.9871,67.0129,99.9682
612,613,1292,2443,2609,273.016,10.1616,79.8384,99.9011
613,614,14777,334,2695,101.497,26.5635,63.4365,99.8386
614,615,15763,2977,2702,104.257,71.9302,18.0698,72.6141
615,616,818,997,2616,95.0088,19.5654,70.4346,99.9839
616,617,10051,1239,2676,274.558,19.8018,70.1982,99.9555
617,618,7706,1763,2661,272.41900000000004,4.72487,85.2751,99.9597
618,619,26491,1950,2728,161.469,79.4721,10.5279,99.9881
619,620,624,2411,2628,94.2624,8.3508,81.6492,99.9944
620,621,2537,684,2649,97.6218,36.8386,53.1614,99.9549
621,622,3824,620,2660,278.814,12.7656,77.2344,99.9976
622,623,4527,1007,2659,277.907,0.675018,89.325,99.9918
623,624,13574,2563,2691,273.809,68.3335,21.6665,99.9636
624,625,12454,2304,2686,268.335,22.7071,67.2929,99.8942
625,626,6539,105,2691,97.8826,32.2962,57.7038,99.9422
626,627,5449,1847,2686,261.383,17.6928,72.3072,99.9737
627,628,6823,2453,2676,90.4277,30.2302,59.7698,99.801
628,629,6610,1701,2706,89.2168,1.28198,88.71799999999998,99.9955
629,630,878,1070,2651,271.201,6.32709,83.6729,99.9862
630,631,6428,1620,2685,153.814,81.809,8.19103,99.9706
631,632,4648,2748,2687,274.512,38.1742,51.8258,99.9574
632,633,4920,2877,2687,270.539,25.3304,64.6696,99.9946
633,634,1325,416,2671,266.874,20.8626,69.1374,99.9636
634,635,8325,1350,2712,262.177,53.6843,36.3157,99.9825
635,636,5803,1154,2712,93.8566,18.8582,71.1418,99.9768
636,637,7180,753,2700,270.621,67.704,22.296,99.9947
637,638,1959,519,2700,268.981,65.6864,24.3136,99.9931
638,639,534,456,2687,267.812,27.6847,62.3153,99.8443
639,640,735,156,2694,101.283,21.2915,68.7085,99.9699
640,641,7986,1044,2721,99.4706,9.51689,80.4831,99.961
641,642,7587,856,2725,105.175,57.4608,32.5392,99.9816
642,643,2479,3261,2709,264.617,43.3268,46.6732,99.9916
643,644,1406,665,2707,265.92,64.0806,25.9194,99.9965
644,645,6214,2384,2744,74.8276,83.7611,6.23891,99.9486
645,646,2928,1284,2728,93.1437,7.915780000000002,82.0842,99.9932
646,647,19842,2722,2796,74.1415,81.1918,8.8082,99.7148
647,648,9724,457,2759,46.5417,87.4376,2.56239,99.9809
648,649,1851,1528,2731,268.78700000000003,14.7796,75.2204,99.9703
649,650,1561,2688,2723,269.847,7.87942,82.1206,99.9797
650,651,5431,154,2764,101.106,24.3443,65.6557,99.9483
651,652,3173,1588,2736,274.93,10.558,79.442,99.9552
652,653,5802,629,2763,274.95,59.8455,30.1545,99.9938
653,654,6320,3087,2754,98.8136,8.58545,81.4146,99.9715
654,655,1524,2318,2751,260.60400000000004,46.2704,43.7296,99.922
655,656,2296,3189,2744,96.362,21.5224,68.4776,99.9971
656,657,2168,951,2751,93.7934,5.02885,84.9712,99.5766
657,658,1294,1821,2739,275.885,34.6983,55.3017,99.9964
658,659,1661,3307,2752,96.771,12.1811,77.8189,99.9733
659,660,2027,1773,2747,275.486,5.23332,84.7667,99.9957
660,661,1781,2633,2751,268.677,35.6265,54.3735,99.991
661,662,3599,1437,2756,277.487,7.50407,82.4959,99.8741
662,663,6398,2135,2777,101.059,2.84696,87.15299999999998,99.976
663,664,2554,1465,2795,96.0593,5.62737,84.3726,99.8599
664,665,1855,555,2755,89.2896,32.1637,57.8363,99.9918
665,666,7262,719,2786,268.236,2.86921,87.1308,99.9741
666,667,3651,3248,2768,284.468,16.1748,73.8252,99.9932
667,668,2305,2257,2760,193.316,75.7902,14.2098,99.9496
668,669,3609,902,2780,94.9642,6.732410000000002,83.2676,99.9733
669,670,5782,2577,2789,269.856,5.9770699999999986,84.0229,99.9679
670,671,4825,2826,2798,274.692,34.211,55.789,99.7518
671,672,5004,348,2818,272.931,22.1914,67.8086,99.9867
672,673,11217,1627,2793,278.249,15.7339,74.2661,99.9752
673,674,2607,2917,2784,267.663,76.8198,13.1802,99.9947
674,675,18702,3098,2864,102.405,65.5935,24.4065,99.9662
675,676,707,1245,2773,105.804,25.0259,64.9741,99.9917
676,677,14723,1857,2834,117.925,81.172,8.82805,99.9373
677,678,15819,2457,2832,260.647,51.1015,38.8985,99.9641
678,679,4936,1162,2787,328.735,86.5307,3.46927,99.9318
679,680,21797,1042,2849,272.951,0.8002779999999999,89.1997,99.9655
680,681,10162,1306,2846,285.378,6.22927,83.7707,99.9385
681,682,581,519,2786,275.059,7.18496,82.815,99.9936
682,683,1406,841,2788,125.359,74.2702,15.7298,99.9982
683,684,2421,1383,2801,102.309,11.2518,78.7482,99.9901
684,685,6383,3200,2829,99.2999,6.92934,83.0707,99.999
685,686,2716,3005,2817,275.923,30.7585,59.2415,99.9514
686,687,2488,2959,2809,267.213,21.3751,68.6249,99.9857
687,688,14103,2313,2857,108.108,54.3994,35.6006,99.9412
688,689,15589,526,2858,275.105,13.6094,76.3906,99.9381
689,690,2102,113,2816,96.1145,19.081,70.919,99.9903
690,691,1622,2183,2804,198.989,75.8936,14.1064,99.9928
691,692,3536,2234,2827,284.503,84.4399,5.56012,99.9856
692,693,4683,813,2842,94.2197,8.29231,81.7077,99.9359
693,694,3666,1222,2830,233.579,75.1357,14.8643,99.9869
694,695,849,2884,2821,265.54200000000003,42.3203,47.6797,99.9975
695,696,11509,1703,2912,96.9683,50.7809,39.2191,99.8836
696,697,1157,1511,2821,264.865,40.6798,49.3202,99.9943
697,698,14163,230,2866,96.736,26.4255,63.5745,99.8148
698,699,2009,3257,2843,260.945,24.2893,65.7107,99.9021
699,700,2801,394,2841,119.211,81.3652,8.634780000000001,99.9951
700,701,2637,2846,2839,96.8922,16.8361,73.1639,99.9953
701,702,3633,2049,2844,114.116,63.9698,26.0302,99.9729
702,703,4314,656,2843,103.966,56.3685,33.6315,99.992
703,704,1136,2000,2830,281.083,19.4603,70.5397,99.9966
704,705,4373,907,2845,239.125,68.3884,21.6116,99.9914
705,706,2457,1742,2844,279.775,13.395,76.605,99.9962
706,707,10010,2107,2889,105.085,59.8316,30.1684,99.9366
707,708,816,1149,2829,272.241,41.6904,48.3096,99.9861
708,709,4496,737,2870,259.98900000000003,37.8849,52.1151,99.977
709,710,21191,1426,2910,100.346,32.3315,57.6685,99.8348
710,711,17123,2562,2905,268.34,41.0446,48.9554,99.9702
711,712,672,2171,2844,103.72,57.3658,32.6342,99.9545
712,713,6052,1536,2873,116.261,75.2084,14.7916,99.9591
713,714,525,1310,2837,282.6020000000001,13.5718,76.4282,99.9852
714,715,2869,2935,2853,92.3313,23.092,66.908,99.9241
715,716,9898,1597,2925,98.1236,31.1611,58.8389,99.9563
716,717,674,1129,2858,270.84,39.0452,50.9548,99.9984
717,718,1212,2792,2866,270.938,36.751,53.249,99.9994
718,719,12847,2751,2921,266.28700000000003,37.3985,52.6015,99.9398
719,720,11411,625,2929,264.581,31.0414,58.9586,99.8722
720,721,5508,1192,2897,231.594,76.3205,13.6795,99.96
721,722,7234,383,2907,88.0552,72.1364,17.8636,99.9954
722,723,17526,2222,2962,268.346,0.27356,89.7264,99.9647
723,724,14097,2905,2937,268.53,4.67242,85.3276,99.7924
724,725,5503,1800,2903,96.1329,66.4056,23.5944,99.9669
725,726,1949,2993,2905,274.72700000000003,36.7553,53.2447,99.9948
726,727,836,881,2888,94.2018,8.67018,81.3298,99.9939
727,728,22060,2101,3013,275.587,15.3797,74.6203,99.7549
728,729,1701,835,2899,96.1961,28.5097,61.4903,99.992
729,730,13449,3268,2941,265.503,39.3069,50.6931,99.9665
730,731,3756,2395,2916,269.45,42.9463,47.0537,99.9835
731,732,2068,780,2915,96.811,16.3438,73.6562,99.9939
732,733,706,1653,2919,96.1991,29.8123,60.1877,99.9025
733,734,16790,995,2972,104.959,45.7034,44.2966,99.8483
734,735,3231,1887,2920,273.898,17.5712,72.4288,99.9945
735,736,1160,3033,2920,266.934,72.7261,17.2739,99.9989
736,737,509,3159,2923,101.274,31.6974,58.3026,99.9949
737,738,1205,207,2927,273.745,6.935,83.065,99.9952
738,739,15166,1253,2978,252.114,59.7419,30.2581,99.8941
739,740,2649,866,2946,255.348,70.6058,19.3942,99.9525
740,741,9597,114,2969,105.777,40.6727,49.3273,99.8387
741,742,1251,1623,2932,95.7754,47.6173,42.3827,99.9945
742,743,7944,449,2969,101.884,46.4777,43.5223,99.7833
743,744,5069,709,2958,272.713,28.5418,61.4582,99.9885
744,745,6468,268,2958,96.2273,37.1238,52.8762,99.9736
745,746,2963,1933,2954,128.136,84.4608,5.53918,99.923
746,747,1950,1991,2958,216.317,87.4913,2.5087,99.991
747,748,11213,2443,3006,91.406,3.20471,86.7953,99.9002
748,749,1382,2832,2952,272.41900000000004,17.9076,72.0924,99.9737
749,750,26664,679,3030,91.9553,2.88726,87.1127,79.8193
750,751,1267,1115,2951,271.02,39.2801,50.7199,99.9847
751,752,12071,2332,3010,280.022,25.8854,64.1146,99.9597
752,753,2070,2671,2961,271.615,6.6395300000000015,83.3605,99.9946
753,754,2750,3028,2962,89.1648,29.2396,60.7604,99.989
754,755,3237,1519,2987,92.0906,49.9891,40.0109,99.8381
755,756,5546,1850,2990,270.448,5.04675,84.9532,99.6738
756,757,1891,532,2967,275.208,6.7088199999999985,83.2912,99.9828
757,758,3392,1788,2987,281.691,19.794,70.206,99.9735
758,759,1265,2975,2972,265.588,41.4905,48.5095,99.9898
759,760,21067,309,3055,94.5015,17.034000000000002,72.96600000000002,99.2244
760,761,63041,3148,3106,276.862,78.953,11.047,86.4713
761,762,618,909,2975,103.295,46.0841,43.9159,99.9889
762,763,559,3088,2964,271.17900000000003,75.9279,14.0721,99.9984
763,764,5533,184,3013,102.173,55.0451,34.9549,99.825
764,765,4938,2628,3007,266.938,46.0265,43.9735,99.9696
765,766,13591,1122,3047,270.068,52.9169,37.0831,99.9663
766,767,2224,2541,2984,98.9619,7.04431,82.9557,99.9983
767,768,11229,1368,3059,96.6729,7.066560000000001,82.9334,98.986
768,769,4464,2834,3004,302.785,75.765,14.235,99.9921
769,770,2282,2996,3012,99.6086,1.03908,88.9609,99.9957
770,771,10823,2765,3043,321.06,87.6829,2.31714,99.7769
771,772,2493,1435,3020,254.637,58.6912,31.3088,99.8947
772,773,2358,866,3019,268.48400000000004,21.6433,68.3567,99.9667
773,774,28217,1721,3101,90.3161,19.471,70.529,99.7723
774,775,10178,1964,3043,280.976,36.7554,53.2446,98.3748
775,776,3100,1646,3033,90.0392,49.3398,40.6602,99.7376
776,777,6541,962,3065,274.442,23.0827,66.9173,99.7187
777,778,1278,2555,3020,95.4905,46.0842,43.9158,99.9843
778,779,9657,457,3059,280.491,60.7753,29.2247,99.8832
779,780,5530,2671,3068,94.955,27.9805,62.0195,99.9644
780,781,527,3302,3027,271.358,35.1515,54.8485,99.9728
781,782,10146,2973,3113,268.577,44.403,45.597,58.06800000000001
782,783,2485,1582,3043,93.3371,11.163,78.837,99.9835
783,784,1223,2512,3041,84.7457,15.3724,74.6276,99.9941
784,785,1112,84,3046,98.7816,41.4219,48.5781,99.9627
785,786,4735,2575,3071,89.9613,1.06515,88.9349,99.9801
786,787,2163,1495,3054,96.9232,29.7032,60.2968,99.9896
787,788,3433,1541,3079,100.028,55.1331,34.8669,99.9965
788,789,2857,773,3079,98.7037,2.73123,87.2688,99.8898
789,790,2485,905,3089,272.073,1.7644,88.2356,99.9912
790,791,1820,2078,3071,95.1108,64.1669,25.8331,99.9872
791,792,14547,152,3112,227.756,79.7073,10.2927,99.9662
792,793,1426,2492,3084,94.3741,67.9185,22.0815,99.9635
793,794,1504,3327,3084,277.428,2.10213,87.8979,99.8761
794,795,12779,1232,3137,92.8734,43.2154,46.7846,99.9441
795,796,595,2851,3078,272.25,38.8499,51.1501,99.9428
796,797,2108,1449,3096,87.3455,24.7865,65.2135,99.8059
797,798,20660,2459,3152,79.0467,73.4335,16.5665,99.979
798,799,1557,588,3089,103.181,70.8363,19.1637,99.9884
799,800,750,854,3079,86.7246,20.3477,69.6523,99.9839
800,801,24721,1860,3176,89.6105,0.824585,89.1754,99.9307
801,802,8357,2306,3114,95.9084,84.1851,5.81487,99.9856
802,803,2608,1321,3111,85.5398,43.9522,46.0478,99.9344
803,804,1060,1039,3100,270.226,18.5252,71.4748,99.9953
804,805,629,2118,3097,99.5183,3.85975,86.1403,99.9965
805,806,6088,2024,3135,271.217,82.5111,7.488939999999999,99.9788
806,807,1875,2218,3110,308.404,88.3091,1.6909,99.9969
807,808,6350,802,3130,272.059,31.5219,58.4781,99.9944
808,809,13502,2907,3180,102.343,50.1188,39.8812,99.9799
809,810,10691,394,3157,98.9932,19.5028,70.4972,99.2825
810,811,542,2731,3099,270.16900000000004,24.45,65.55,99.9682
811,812,627,1589,3113,272.886,49.0727,40.9273,99.9929
812,813,664,1498,3115,93.5334,11.8978,78.1022,99.98
813,814,729,715,3115,88.2138,4.72349,85.2765,99.9939
814,815,741,2089,3114,271.952,4.87019,85.1298,99.9962
815,816,703,868,3126,94.2966,3.23116,86.7688,99.8833
816,817,6306,1444,3171,88.7139,6.8689100000000005,83.1311,99.8115
817,818,20294,576,3169,267.206,22.8946,67.1054,99.9488
818,819,18946,2746,3194,275.328,26.5801,63.4199,99.976
819,820,4208,1557,3149,100.871,17.0178,72.9822,99.9816
820,821,4719,2599,3163,269.755,19.3968,70.6032,99.9915
821,822,2007,2828,3136,274.831,33.7307,56.2693,99.9764
822,823,3034,3330,3161,89.9254,23.6748,66.3252,99.9242
823,824,1259,2663,3137,262.411,51.2636,38.7364,99.9803
824,825,974,2552,3137,260.106,43.0231,46.9769,99.9959
825,826,4728,1135,3177,99.5937,37.7894,52.2106,99.9356
826,827,7069,1047,3193,90.2037,15.9433,74.0567,99.9412
827,828,4323,976,3165,99.8297,27.4728,62.5272,99.9179
828,829,6184,2124,3173,99.3744,6.62962,83.3704,99.9635
829,830,1447,915,3153,95.5688,2.43745,87.5626,99.9786
830,831,24810,712,3266,103.519,62.9717,27.0283,99.7922
831,832,24255,1331,3262,96.4324,9.47645,80.5236,99.8274
832,833,1858,2004,3182,273.156,2.29137,87.7086,99.8631
833,834,1134,66,3168,109.829,48.8705,41.1295,99.9647
834,835,1948,1606,3199,285.205,47.2595,42.7405,99.9695
835,836,3564,2229,3221,267.66900000000004,82.4679,7.5321,99.7699
836,837,1607,2288,3172,132.57399999999998,78.8964,11.1036,99.9893
837,838,7212,288,3190,103.737,44.6986,45.3014,99.9501
838,839,5635,2641,3231,263.643,68.6634,21.3366,99.9755
839,840,10690,2320,3234,91.5922,10.2839,79.7161,99.9775
840,841,1997,130,3188,274.795,52.4582,37.5418,99.9773
841,842,2063,1498,3206,96.9275,8.07408,81.9259,99.8026
842,843,1706,1807,3187,95.9924,24.7571,65.2429,99.998
843,844,3011,3306,3208,96.8098,31.0707,58.9293,99.7862
844,845,5322,846,3213,121.742,67.0815,22.9185,99.9877
845,846,3757,2060,3218,87.7604,63.7994,26.2006,99.9333
846,847,29179,493,3307,98.9339,37.5794,52.4206,62.7991
847,848,2087,3006,3215,277.702,28.5405,61.4595,99.9896
848,849,14917,224,3285,272.719,52.3445,37.6555,99.9915
849,850,560,77,3224,274.745,51.5472,38.4528,99.9653
850,851,515,1362,3218,173.845,80.6295,9.37051,99.9813
851,852,1749,1554,3221,281.308,19.3294,70.6706,99.9614
852,853,791,2839,3223,84.6877,18.3861,71.6139,99.9938
853,854,6278,1191,3261,93.4064,8.82629,81.1737,99.9388
854,855,1289,2154,3227,93.3684,3.69003,86.31,99.9407
855,856,13238,971,3311,260.33,35.2941,54.7059,85.1395
856,857,1781,1652,3231,273.225,0.459549,89.5405,99.9942
857,858,31911,2523,3321,92.9514,16.1414,73.8586,99.7485
858,859,26506,1937,3323,91.7981,56.6052,33.3948,99.9028
859,860,527,122,3243,273.60900000000004,52.7071,37.2929,99.9784
860,861,7322,2378,3289,91.7041,71.6687,18.3313,99.9438
861,862,25096,1081,3339,77.9631,0.0136566,89.9863,99.9758
862,863,1143,299,3250,100.806,25.4729,64.5271,99.9934
863,864,1553,411,3248,87.0435,41.9909,48.0091,99.9956
864,865,2946,3100,3254,276.511,77.0123,12.9877,99.957
865,866,11939,3209,3285,101.555,33.2715,56.7285,99.9438
866,867,5847,364,3278,43.0899,86.0884,3.91156,99.9886
867,868,8795,1599,3291,100.185,18.8635,71.1365,99.9816
868,869,1936,2989,3273,103.36,36.3843,53.6157,99.845
869,870,4722,3322,3280,86.8918,22.5107,67.4893,99.9894
870,871,2039,911,3276,95.2585,0.07635499999999999,89.9236,99.9911
871,872,1603,1510,3267,266.759,18.9244,71.0756,99.9936
872,873,1063,2863,3260,283.7270000000001,81.3885,8.61149,99.9952
873,874,10733,2787,3331,274.441,32.8417,57.1583,99.9704
874,875,3066,2151,3269,286.648,81.7271,8.27289,99.9908
875,876,6847,828,3295,269.957,30.0786,59.9214,99.9673
876,877,1684,2053,3273,265.073,55.1375,34.8625,99.9964
877,878,15230,2940,3326,91.4386,55.9879,34.0121,99.9531
878,879,1101,1836,3271,97.1226,23.6424,66.3576,99.9987
879,880,8849,2232,3319,253.484,81.5827,8.4173,99.8147
880,881,4718,2724,3290,262.685,63.027,26.973000000000006,99.9986
881,882,903,82,3279,249.218,74.9637,15.0363,99.9885
882,883,661,1880,3268,98.3662,12.5646,77.4354,99.9988
883,884,5167,1701,3307,270.29900000000004,44.8691,45.1309,99.9876
884,885,5092,2121,3315,91.6999,10.6741,79.3259,99.9632
885,886,3236,1781,3321,105.705,12.7272,77.2728,99.9797
886,887,9919,1529,3338,97.0204,0.527512,89.4725,99.9245
887,888,1789,328,3317,262.762,32.898,57.102,99.9808
888,889,1101,1829,3305,277.915,5.3066900000000015,84.6933,99.996
889,890,8963,1398,3350,98.2534,17.9541,72.0459,99.9778
890,891,1529,1207,3322,268.74,42.417,47.583,99.9975
891,892,12532,3086,3381,90.7933,29.7878,60.2122,99.8314
892,893,3493,2674,3336,275.012,6.75432,83.2457,99.9833
893,894,9888,869,3368,275.248,17.1772,72.8228,99.9884
894,895,1842,3151,3349,92.2929,18.9291,71.0709,99.986
895,896,1121,1167,3335,97.8027,67.1312,22.8688,99.9987
896,897,16090,3255,3385,96.4588,9.23409,80.7659,99.9349
897,898,880,3337,3340,88.8285,16.8924,73.1076,99.9812
898,899,1624,2067,3349,269.406,8.84995,81.15,99.9895
899,900,2213,2837,3352,84.6513,17.1583,72.8417,99.9977
900,901,2725,2358,3356,101.054,38.7515,51.2485,99.9949
901,902,3445,376,3362,93.3044,15.3467,74.6533,99.9936
902,903,1978,632,3356,175.655,81.2541,8.7459,99.9949
903,904,21050,1178,3473,99.058,66.18,23.82,99.8494
904,905,17694,1651,3446,98.9359,34.0242,55.9758,99.8293
905,906,16322,748,3436,163.701,78.6403,11.3597,99.9596
906,907,18662,1770,3469,270.564,15.2765,74.7235,99.7073
907,908,26085,320,3460,97.2672,56.5213,33.4787,99.8497
908,909,7468,2431,3412,269.707,17.1116,72.8884,99.9774
909,910,21729,2151,3440,196.802,77.4608,12.5392,99.9294
910,911,3175,546,3383,266.293,35.9368,54.0632,99.9618
911,912,1614,323,3377,87.5192,24.4367,65.5633,99.9801
912,913,1693,2647,3377,271.126,38.0901,51.9099,99.9964
913,914,12639,2300,3424,100.522,11.4805,78.5195,99.9878
914,915,3249,1462,3401,97.3925,2.44275,87.5573,99.944
915,916,10043,620,3432,103.348,53.9807,36.0193,99.9811
916,917,598,1727,3385,263.371,36.9923,53.0077,99.9823
917,918,2263,2716,3397,108.608,51.5189,38.4811,99.9932
918,919,6690,1942,3436,274.559,17.1779,72.8221,99.8854
919,920,4283,172,3414,263.724,47.1127,42.8873,99.992
920,921,1137,1956,3401,84.042,2.1524400000000004,87.8476,99.9461
921,922,9009,2973,3467,269.73400000000004,3.70455,86.2954,74.6663
922,923,1208,509,3412,194.594,75.333,14.667,99.9928
923,924,4037,1522,3431,92.6421,18.9948,71.0052,99.9523
924,925,6099,1310,3427,244.377,81.4465,8.55348,99.916
925,926,3541,2846,3417,94.5226,36.4133,53.5867,99.9745
926,927,2738,106,3430,96.9557,18.8069,71.1931,99.9719
927,928,1542,1254,3404,264.326,80.6645,9.33553,99.9532
928,929,6686,2991,3438,92.7779,24.7309,65.2691,99.9786
929,930,7038,962,3444,101.854,23.1989,66.8011,99.8702
930,931,12443,2669,3466,87.8493,14.6883,75.3117,99.9993
931,932,13572,1345,3500,270.434,40.7856,49.2144,51.4172
932,933,5904,2045,3455,277.613,62.4004,27.5996,99.9939
933,934,1731,2592,3440,103.029,52.1602,37.8398,99.985
934,935,32484,820,3567,94.8116,9.18337,80.8166,97.4927
935,936,20332,2773,3541,96.4776,6.630330000000002,83.3697,99.2009
936,937,8365,3256,3463,94.2478,8.77029,81.2297,99.7429
937,938,11353,210,3523,270.441,59.4537,30.5463,99.9794
938,939,1300,1587,3449,97.2318,7.59765,82.4024,99.9224
939,940,2473,2543,3462,99.276,70.7311,19.2689,99.9489
940,941,31867,3096,3574,102.907,61.2015,28.7985,98.7873
941,942,16355,2424,3512,269.693,10.7133,79.2867,99.9743
942,943,14994,1476,3514,274.519,19.5653,70.4347,99.9373
943,944,5288,549,3482,96.8861,18.3706,71.6294,99.9284
944,945,1041,2907,3464,95.3738,2.0306,87.9694,99.9961
945,946,2979,470,3486,256.076,77.3225,12.6775,99.7773
946,947,845,2870,3464,254.196,77.1544,12.8456,99.9963
947,948,12112,1042,3511,103.761,29.1985,60.8015,91.7872
948,949,1921,1235,3477,95.0852,1.82755,88.1724,99.994
949,950,4216,2015,3510,160.55700000000004,76.1486,13.8514,99.8822
950,951,3339,2242,3502,88.4985,39.393,50.607,99.9607
951,952,6701,1854,3516,88.0293,11.0452,78.9548,99.9776
952,953,2561,1570,3496,278.126,4.1311,85.8689,99.9735
953,954,2992,1951,3510,113.575,76.6091,13.3909,59.8972
954,955,1638,679,3509,259.98400000000004,53.5444,36.4556,99.9664
955,956,3139,2588,3514,93.9397,16.7482,73.2518,99.9948
956,957,57538,2904,3673,269.036,78.5366,11.4634,99.903
957,958,1430,3233,3513,121.167,63.0973,26.9027,99.9951
958,959,8968,122,3564,87.6734,3.2805,86.7195,99.9536
959,960,21973,477,3593,92.0426,32.3092,57.6908,99.8134
960,961,2511,617,3531,261.709,54.9234,35.0766,99.9608
961,962,1269,2541,3521,85.0292,5.01817,84.9818,99.9677
962,963,849,1250,3517,275.916,0.00442505,89.9956,99.9942
963,964,119857,2288,3688,102.506,43.6503,46.3497,99.623
964,965,2306,3292,3555,96.6916,2.29877,87.7012,99.9776
965,966,2040,1657,3551,101.505,9.77426,80.2257,99.9983
966,967,505,536,3535,130.63299999999998,86.5487,3.45128,99.9955
967,968,14557,968,3602,272.051,16.8641,73.1359,99.8982
968,969,31979,719,3673,101.009,66.9874,23.0126,99.8447
969,970,1415,1922,3558,275.597,82.8572,7.142760000000001,99.9774
970,971,3930,2652,3571,84.4173,5.47262,84.5274,99.9893
971,972,14889,1421,3617,103.87,5.01472,84.9853,99.9273
972,973,1791,578,3567,252.257,71.6851,18.3149,99.9326
973,974,5121,2581,3593,90.8203,26.1329,63.8671,99.994
974,975,27425,1150,3649,112.248,81.961,8.03903,99.9188
975,976,12137,2016,3614,269.811,3.69051,86.3095,99.9237
976,977,580,3224,3571,93.7515,59.2498,30.7502,99.8971
977,978,3302,1696,3581,189.595,84.1263,5.87373,99.9961
978,979,6148,327,3589,276.541,14.8418,75.1582,99.9886
979,980,1229,1799,3573,94.1181,28.353,61.647,99.9961
980,981,643,2516,3566,88.8762,22.0532,67.9468,99.998
981,982,6449,1550,3609,92.6238,25.8561,64.1439,99.989
982,983,7600,1887,3606,273.54400000000004,1.52383,88.4762,99.9813
983,984,656,1286,3591,274.05,47.3635,42.6365,99.9913
984,985,7767,1812,3646,300.513,83.1545,6.8455,99.9617
985,986,13357,3151,3697,90.3848,59.1284,30.8716,99.9789
986,987,24612,1639,3692,102.134,43.4108,46.5892,99.9498
987,988,9034,1315,3676,276.62,45.1495,44.8505,99.7916
988,989,12227,225,3647,200.33,83.0016,6.99838,99.9851
989,990,4659,3270,3649,263.851,35.8717,54.1283,99.9489
990,991,959,2634,3628,94.0535,4.19839,85.8016,99.983
991,992,628,2663,3625,91.6123,26.0835,63.9165,99.9914
992,993,4715,105,3648,88.9893,6.01121,83.9888,99.9653
993,994,4682,370,3655,95.2627,7.89548,82.1045,99.9881
994,995,7480,2602,3687,88.9342,15.0371,74.9629,99.9206
995,996,944,1978,3645,274.11400000000003,20.9382,69.0618,99.9986
996,997,8075,2729,3676,277.822,24.6319,65.3681,99.9917
997,998,2884,1525,3683,259.74,59.4174,30.5826,99.9742
998,999,9877,978,3729,273.881,49.7618,40.2382,99.9188
999,1000,6191,446,3704,275.765,19.9105,70.0895,99.8458
1000,1001,898,1909,3677,91.5289,39.9278,50.0722,99.8394
1001,1002,3784,561,3705,94.194,23.8602,66.1398,99.9373
1002,1003,6823,1780,3714,272.065,17.0052,72.9948,99.9471
1003,1004,1491,508,3685,97.1466,18.1457,71.8543,99.9979
1004,1005,11627,343,3749,162.648,82.6531,7.34687,99.9438
1005,1006,62985,2627,3847,93.9423,31.9548,58.0452,99.8438
1006,1007,877,910,3693,270.278,16.3409,73.6591,99.9962
1007,1008,1379,1393,3707,101.798,48.619,41.381,99.9525
1008,1009,12154,171,3763,249.613,57.0893,32.9107,99.9533
1009,1010,5568,261,3722,269.48900000000003,44.6249,45.3751,99.9971
1010,1011,4291,1462,3718,277.168,26.81,63.19,99.9493
1011,1012,1992,2017,3708,90.6786,33.7977,56.2023,99.998
1012,1013,5926,1958,3736,284.397,30.9222,59.0778,99.9789
1013,1014,622,3213,3712,271.264,72.2246,17.7754,99.9872
1014,1015,23350,1185,3771,276.552,62.9084,27.0916,100.002
1015,1016,2223,78,3732,99.1288,12.3297,77.6703,99.9861
1016,1017,3016,1883,3736,306.31,84.1793,5.8207,99.9747
1017,1018,624,1841,3745,99.6997,9.49495,80.5051,99.9723
1018,1019,1857,1373,3751,275.798,24.312,65.688,99.9638
1019,1020,2187,710,3747,266.141,22.0864,67.9136,99.9981
1020,1021,2973,1554,3766,277.515,15.3352,74.6648,99.9965
1021,1022,4172,1705,3767,271.84,27.2577,62.7423,99.9973
1022,1023,2531,2751,3757,273.584,4.98682,85.0132,99.9986
1023,1024,93859,1335,3983,100.592,31.1404,58.8596,83.5862
1024,1025,18829,515,3824,95.9984,79.8507,10.1493,99.9655
1025,1026,5139,433,3820,97.0829,38.3209,51.6791,72.1322
1026,1027,18228,1343,3841,115.307,59.6006,30.3994,99.9821
1027,1028,634,2547,3755,88.0108,10.8155,79.1845,99.7271
1028,1029,2353,3048,3779,99.8267,12.264,77.736,99.9206
1029,1030,8395,684,3816,105.201,31.0931,58.9069,99.992
1030,1031,17325,1839,3838,260.404,75.5056,14.4944,99.978
1031,1032,2025,620,3779,270.18,22.9552,67.0448,99.982
1032,1033,5397,852,3801,82.0337,15.3006,74.6994,99.9946
1033,1034,7749,2110,3811,107.153,30.2793,59.7207,99.9952
1034,1035,9872,778,3849,284.068,6.44221,83.5578,99.9782
1035,1036,795,253,3779,94.6497,27.6071,62.3929,99.9961
1036,1037,1434,3090,3792,90.8723,0.129135,89.8709,99.9822
1037,1038,3795,2578,3809,261.89,37.9197,52.0803,99.9982
1038,1039,2842,1937,3828,114.798,75.2566,14.7434,57.1366
1039,1040,6566,2008,3827,278.611,82.8824,7.11764,99.7119
1040,1041,1136,1404,3799,274.221,17.6505,72.3495,99.9589
1041,1042,14718,1693,3850,270.897,31.8699,58.1301,99.9811
1042,1043,49965,945,3915,265.132,9.47419,80.5258,94.6691
1043,1044,1853,1047,3808,91.1447,0.790718,89.2093,99.9952
1044,1045,1996,387,3810,270.661,38.8259,51.1741,99.9959
1045,1046,2296,3134,3814,96.2847,9.92023,80.0798,99.9844
1046,1047,6361,2984,3877,260.712,77.9223,12.0777,99.9477
1047,1048,18490,173,3900,250.735,51.3303,38.6697,99.521
1048,1049,1236,2374,3822,274.115,27.5971,62.4029,99.9977
1049,1050,1702,604,3830,267.136,20.4606,69.5394,99.9802
1050,1051,5185,128,3843,114.497,47.9175,42.0825,99.9662
1051,1052,6182,3046,3851,97.0759,33.2349,56.7651,99.9965
1052,1053,543,352,3837,269.666,19.6939,70.3061,99.998
1053,1054,1358,2149,3861,261.30400000000003,45.1836,44.8164,99.9646
1054,1055,5676,1135,3864,110.392,21.2427,68.7573,99.9934
1055,1056,172943,432,4077,90.4645,6.15749,83.8425,91.8705
1056,1057,1899,636,3865,282.503,10.3167,79.6833,99.9162
1057,1058,9324,2349,3889,269.719,21.007,68.993,99.9532
1058,1059,851,1917,3864,273.218,65.0819,24.9181,99.9803
1059,1060,1142,1225,3864,268.747,54.3072,35.6928,99.9939
1060,1061,4758,2908,3894,92.4578,32.6224,57.3776,99.9814
1061,1062,739,2277,3883,100.547,35.3397,54.6603,99.9961
1062,1063,1478,2084,3888,113.94,51.8975,38.1025,99.994
1063,1064,3495,589,3898,284.639,6.49125,83.5088,99.9947
1064,1065,1376,2022,3896,104.368,37.2595,52.7405,99.9846
1065,1066,6367,1298,3925,108.471,42.6592,47.3408,99.9855
1066,1067,5810,3230,3926,263.081,15.9052,74.0948,99.9916
1067,1068,3614,701,3906,106.76,62.0101,27.9899,99.9959
1068,1069,5945,2162,3928,247.701,72.7032,17.2968,99.9499
1069,1070,726,1310,3895,275.28700000000003,26.7032,63.2968,99.9858
1070,1071,61681,2081,4028,104.251,43.3548,46.6452,58.5316
1071,1072,166878,1862,4196,273.089,33.8115,56.1885,66.1943
1072,1073,78412,3034,4155,97.357,44.1572,45.8428,98.5302
1073,1074,3323,3160,3921,273.663,10.6364,79.3636,99.9921
1074,1075,4241,1190,3924,271.481,31.3304,58.6696,99.9925
1075,1076,505,1756,3906,100.928,45.3533,44.6467,99.9901
1076,1077,876,534,3911,98.5569,8.1637,81.8363,99.9959
1077,1078,33349,2653,3994,272.985,19.2802,70.7198,99.9809
1078,1079,7347,1099,3969,273.758,13.7119,76.2881,99.9677
1079,1080,3700,1711,3940,110.871,51.4267,38.5733,99.9895
1080,1081,886,2788,3938,97.9433,48.0844,41.9156,99.9856
1081,1082,31341,2380,4043,271.013,26.5906,63.4094,99.9462
1082,1083,2848,2980,3954,213.05,81.3785,8.62152,99.9929
1083,1084,15541,2857,3997,97.7316,47.6618,42.3382,99.967
1084,1085,622,546,3941,265.36400000000003,61.847,28.153,99.9935
1085,1086,1733,2031,3961,258.865,84.794,5.20598,99.9969
1086,1087,1166,782,3953,107.439,56.2094,33.7906,99.9887
1087,1088,1128,1277,3952,273.608,17.8399,72.1601,99.9938
1088,1089,11466,3224,4000,153.495,88.6472,1.35277,99.9674
1089,1090,1628,3112,3960,256.79200000000003,68.5339,21.4661,99.987
1090,1091,14717,173,4036,167.84,78.0149,11.9851,99.8948
1091,1092,754,2208,3982,103.784,51.25,38.75,99.9928
1092,1093,2670,2498,3993,92.6316,13.9418,76.0582,99.9964
1093,1094,1571,75,4005,95.1567,22.372,67.628,99.9715
1094,1095,5524,2749,4067,272.798,19.397,70.60300000000002,99.9909
1095,1096,5145,2521,4060,263.92,41.3136,48.6864,99.9753
1096,1097,2251,821,4062,271.449,23.6026,66.3974,99.9871
1097,1098,15481,3203,4082,111.495,49.4454,40.5546,99.845
1098,1099,2161,94,4077,273.582,0.424225,89.5758,99.926
1099,1100,5462,1493,4063,103.339,65.6869,24.3131,99.9847
1100,1101,44543,837,4226,109.612,56.4513,33.5487,99.6275
1101,1102,28861,1263,4229,103.927,32.3146,57.6854,99.9341
1102,1103,5230,2239,4104,102.188,23.792,66.208,99.9839
1103,1104,963,858,4063,103.691,33.3869,56.6131,99.9973
1104,1105,2368,605,4084,96.8296,4.95669,85.0433,99.9788
1105,1106,631,1381,4064,280.438,64.8433,25.1567,99.9037
1106,1107,8057,1418,4122,95.6286,20.9626,69.0374,99.8839
1107,1108,18396,2323,4233,97.2831,52.96100000000001,37.039,99.955
1108,1109,4818,3053,4108,93.0932,30.751,59.249,99.9399
1109,1110,2701,2770,4116,269.322,41.2923,48.7077,99.964
1110,1111,10748,2568,4128,106.512,66.9701,23.0299,99.9626
1111,1112,41082,1427,4267,110.689,57.9486,32.0514,93.5876
1112,1113,7765,1598,4167,261.47900000000004,46.5365,43.4635,99.992
1113,1114,59683,1034,4255,133.689,72.9322,17.0678,72.21600000000002
1114,1115,19245,3270,4202,284.577,65.259,24.741,99.889
1115,1116,4939,2805,4158,269.744,41.7488,48.2512,99.9086
1116,1117,4415,2672,4154,107.595,67.7532,22.2468,99.9911
1117,1118,1083,2446,4152,99.6967,52.1472,37.8528,99.9682
1118,1119,1580,113,4194,271.64,3.59364,86.4064,99.9951
1119,1120,3158,2229,4184,96.0971,49.632,40.368,99.9975
1120,1121,2148,2120,4174,282.551,23.2116,66.7884,99.989
1121,1122,11634,2524,4213,255.8,53.9923,36.0077,99.9351
1122,1123,619,2189,4164,282.428,24.9651,65.0349,99.9918
1123,1124,7506,2266,4237,279.124,23.9379,66.0621,99.9942
1124,1125,35043,2386,4346,95.3484,37.312,52.688,99.6687
1125,1126,34114,636,4323,89.0436,8.92914,81.0709,99.4391
1126,1127,1475,2052,4202,96.7023,4.58621,85.4138,99.9814
1127,1128,11968,2153,4250,256.843,74.7599,15.2401,99.9958
1128,1129,8991,2778,4238,274.54200000000003,13.2061,76.7939,99.9492
1129,1130,1464,2693,4216,274.985,12.6777,77.3223,99.981
1130,1131,1350,1376,4205,100.691,59.7658,30.2342,99.8681
1131,1132,806,2659,4206,273.60200000000003,12.3686,77.6314,99.9936
1132,1133,7823,1561,4268,99.0284,66.078,23.922,99.9917
1133,1134,4302,2591,4257,257.003,53.3335,36.6665,99.8591
1134,1135,4306,1669,4244,118.732,60.9208,29.0792,100.0
1135,1136,1626,2876,4247,106.921,62.4409,27.5591,99.9947
1136,1137,28201,1688,4350,271.376,29.6839,60.3161,99.9838
1137,1138,26380,359,4306,128.755,67.8212,22.1788,99.9072
1138,1139,1305,2930,4272,98.2267,6.3865300000000005,83.6135,99.9739
1139,1140,6191,2655,4300,275.004,38.0052,51.9948,99.9841
1140,1141,3219,2735,4293,99.1491,1.831,88.169,99.9899
1141,1142,781,3154,4284,286.875,62.852,27.148000000000003,99.9921
1142,1143,7605,76,4327,112.848,56.3884,33.6116,99.9328
1143,1144,62407,2878,4398,97.8724,12.5941,77.4059,99.7732
1144,1145,11126,546,4359,277.778,12.7759,77.2241,99.9551
1145,1146,13890,1507,4392,203.711,75.8274,14.1726,99.8734
1146,1147,57875,252,4483,271.071,17.894000000000005,72.10600000000002,98.4713
1147,1148,3527,2231,4325,100.42,32.1195,57.8805,99.9812
1148,1149,14911,3121,4370,284.238,61.3281,28.6719,99.9931
1149,1150,1022,2482,4339,273.923,3.91534,86.0847,99.9965
1150,1151,5101,688,4347,273.654,12.3465,77.6535,99.99
1151,1152,4428,3236,4341,267.422,73.7944,16.2056,99.8097
1152,1153,2546,2514,4344,273.677,4.74659,85.2534,99.9915
1153,1154,8656,2617,4377,100.485,31.124,58.87600000000001,99.9801
1154,1155,5178,2164,4349,92.4608,10.5594,79.4406,99.9871
1155,1156,48853,1354,4480,249.311,73.7483,16.2517,83.4089
1156,1157,550,2102,4331,279.05,22.2919,67.7081,99.9909
1157,1158,5934,1005,4370,101.836,43.5253,46.4747,99.9912
1158,1159,1507,1126,4354,271.951,35.2288,54.7712,99.9783
1159,1160,986,2092,4356,281.368,21.1505,68.8495,99.9486
1160,1161,4717,2547,4403,274.445,4.0125199999999985,85.9875,99.9985
1161,1162,2544,2239,4380,94.1617,53.2307,36.7693,99.9936
1162,1163,1172,490,4377,93.2421,12.5381,77.4619,99.9961
1163,1164,3306,2310,4397,273.221,1.6848,88.3152,99.989
1164,1165,29718,3257,4524,280.38,8.53105,81.4689,99.9635
1165,1166,2373,3312,4407,281.8040000000001,64.9833,25.0167,99.9676
1166,1167,1754,1777,4386,96.6366,41.2916,48.7084,99.9814
1167,1168,13603,754,4452,274.411,64.6546,25.3454,99.9671
1168,1169,5926,1611,4436,97.1941,43.1201,46.8799,99.9902
1169,1170,6452,125,4415,105.366,59.5007,30.4993,99.9894
1170,1171,639,337,4384,275.034,10.9419,79.0581,99.9845
1171,1172,2916,450,4406,98.9006,44.2519,45.7481,99.9534
1172,1173,889,2450,4405,275.828,27.2769,62.7231,99.9776
1173,1174,2862,1167,4420,273.318,35.1027,54.8973,99.9409
1174,1175,26196,1814,4482,93.4222,31.0028,58.9972,92.2212
1175,1176,6041,853,4424,154.115,76.5628,13.4372,99.9175
1176,1177,8300,75,4519,272.84,34.0947,55.9053,99.8924
1177,1178,5320,942,4452,280.9,3.512,86.488,99.9014
1178,1179,29046,3121,4554,268.149,59.5855,30.4145,99.9232
1179,1180,13197,497,4501,278.305,43.4202,46.5798,99.983
1180,1181,8920,2673,4478,90.1705,43.4032,46.5968,99.8553
1181,1182,14961,428,4557,92.3853,51.2971,38.7029,99.906
1182,1183,980,2718,4440,269.258,16.0084,73.9916,99.9923
1183,1184,1234,1005,4449,149.249,77.2628,12.7372,99.9939
1184,1185,6487,2530,4478,276.143,27.0295,62.9705,99.993
1185,1186,1148,1080,4460,277.072,36.6319,53.3681,99.9579
1186,1187,891,1031,4470,275.793,33.2864,56.7136,99.865
1187,1188,1634,3017,4466,204.473,79.7356,10.2644,99.996
1188,1189,770,1573,4470,278.553,8.849969999999997,81.15,99.989
1189,1190,2854,2140,4490,112.951,73.7146,16.2854,99.9943
1190,1191,1036,2194,4477,270.52,16.0178,73.9822,99.9935
1191,1192,18467,2212,4540,254.317,47.7921,42.2079,99.9474
1192,1193,12091,1142,4549,98.5876,3.3812900000000004,86.6187,99.9823
1193,1194,1585,1495,4487,278.351,11.0527,78.9473,99.9919
1194,1195,49637,2479,4591,279.817,8.04243,81.9576,74.5014
1195,1196,3093,1041,4498,272.942,17.9518,72.0482,99.9765
1196,1197,13393,855,4544,95.3838,24.8516,65.1484,84.8581
1197,1198,1567,2983,4503,278.002,48.0685,41.9315,99.9843
1198,1199,1015,2773,4495,270.581,17.5678,72.4322,99.9905
1199,1200,4554,3041,4512,97.6912,8.14401,81.85600000000002,99.9847
1200,1201,634,905,4486,278.858,11.7408,78.2592,99.9559
1201,1202,4295,1672,4511,265.471,73.0764,16.9236,99.9084
1202,1203,1941,2073,4502,109.268,63.9506,26.0494,99.9962
1203,1204,1745,959,4521,103.347,37.5797,52.4203,99.8979
1204,1205,9412,2817,4549,274.42,48.5617,41.4383,99.9764
1205,1206,38667,2006,4608,108.258,73.529,16.471,99.8026
1206,1207,15523,618,4585,273.085,18.8132,71.1868,99.9641
1207,1208,6985,1049,4574,97.0387,20.0629,69.9371,99.9947
1208,1209,2762,1703,4573,271.52,6.07849,83.9215,99.9965
1209,1210,2516,733,4569,102.246,77.3293,12.6707,99.9916
1210,1211,12461,1596,4604,278.004,15.5393,74.4607,99.9931
1211,1212,2682,2716,4561,250.83900000000003,87.2805,2.71948,99.9983
1212,1213,13864,2972,4640,274.431,47.4036,42.5964,99.9212
1213,1214,1737,1200,4575,96.0984,34.9454,55.0546,99.9979
1214,1215,5052,1449,4603,165.457,79.0897,10.9103,99.9728
1215,1216,8266,2282,4631,252.692,47.9179,42.0821,99.9742
1216,1217,739,1655,4564,97.9563,41.6073,48.3927,99.9978
1217,1218,9431,1799,4613,89.10700000000001,6.529719999999998,83.4703,99.9927
1218,1219,2839,966,4596,98.0475,20.241,69.759,99.9838
1219,1220,589,3009,4577,282.333,9.12344,80.8766,99.9964
1220,1221,6596,1250,4621,110.501,63.0225,26.9775,99.9582
1221,1222,3888,1359,4596,274.24,21.3709,68.6291,99.9963
1222,1223,830,833,4586,96.1316,61.4155,28.5845,99.9947
1223,1224,4020,2660,4613,262.583,39.0443,50.9557,99.9871
1224,1225,5242,2878,4630,99.7502,77.774,12.226,99.9885
1225,1226,2079,1011,4628,277.383,6.75173,83.2483,99.9939
1226,1227,3773,860,4621,282.281,56.1793,33.8207,99.9754
1227,1228,1469,102,4607,268.589,29.2643,60.7357,99.9757
1228,1229,8479,2769,4633,103.109,76.7528,13.2472,99.9721
1229,1230,3457,766,4622,281.029,56.9354,33.0646,99.9758
1230,1231,2640,1482,4632,212.753,74.4176,15.5824,99.9921
1231,1232,744,916,4635,104.473,64.1479,25.8521,99.9858
1232,1233,3690,1102,4647,261.46,53.3997,36.6003,99.9813
1233,1234,1539,1365,4640,98.0269,60.3233,29.6767,99.9952
1234,1235,790,961,4637,99.6,19.4446,70.5554,99.9693
1235,1236,2675,1707,4655,104.743,43.8164,46.1836,99.9679
1236,1237,596,395,4653,94.4744,51.9989,38.0011,99.9533
1237,1238,612,1322,4646,167.882,79.4096,10.5904,99.9839
1238,1239,1338,2603,4661,260.177,35.0622,54.9378,99.9964
1239,1240,956,1524,4658,86.0572,25.4525,64.5475,99.9876
1240,1241,4120,2679,4681,285.941,11.3236,78.6764,99.9026
1241,1242,696,329,4656,268.671,24.1015,65.8985,99.9463
1242,1243,1696,3190,4683,251.201,75.4729,14.5271,99.991
1243,1244,2357,3133,4681,284.37,9.66799,80.332,99.9909
1244,1245,2450,2799,4698,108.18,48.9635,41.0365,99.9319
1245,1246,804,2879,4691,244.073,75.5983,14.4017,99.982
1246,1247,1614,3240,4697,114.035,45.0524,44.9476,99.9289
