,Grain No.,Size [Pixel],center x-coordinate,center y-coordinate,mean azimuth [degree],mean latitude [degree],mean colatitude [degree],Regelungsgrad [%]
0,1,14088,404,210,158.83100000000005,32.7024,57.2976,99.8958
1,2,8869,505,197,333.035,44.4178,45.5822,99.9279
2,3,2239,606,173,164.17700000000005,32.7,57.3,99.944
3,4,34252,674,279,346.2390000000001,47.6669,42.3331,99.947
4,5,9006,892,203,167.06599999999997,50.022,39.978,99.9754
5,6,1265,772,164,337.67800000000005,55.3421,34.6579,99.9303
6,7,6772,1003,208,156.347,65.0295,24.9705,99.9526
7,8,1786,258,194,169.13099999999997,26.8852,63.1148,99.988
8,9,95398,1592,292,163.673,7.8048199999999985,82.1952,98.7364
9,10,30838,1139,260,351.2519999999999,41.202,48.798,99.6994
10,11,2675,773,197,348.1140000000001,41.4028,48.5972,99.9586
11,12,1552,1543,201,334.695,43.5208,46.4792,96.9424
12,13,506,1628,196,173.195,67.32600000000001,22.674,99.9528
13,14,749,1870,201,168.69099999999997,44.8572,45.1428,99.9623
14,15,2114,1719,203,163.732,3.69638,86.3036,99.94
15,16,13782,2011,240,166.273,65.3058,24.6942,99.9596
16,17,11453,300,249,346.702,28.5854,61.4146,99.9932
17,18,983,1607,226,346.724,60.0257,29.9743,99.8174
18,19,11980,2151,285,170.213,17.0514,72.9486,99.9161
19,20,1883,2191,225,169.59599999999998,38.5194,51.4806,99.9538
20,21,10947,2321,246,173.33900000000003,1.13663,88.8634,99.9603
21,22,36472,920,330,168.597,7.9792,82.0208,99.841
22,23,19565,2578,289,165.612,33.0085,56.9915,99.6633
23,24,1372,2483,231,346.9380000000001,19.185,70.815,99.8995
24,25,7502,2813,268,338.582,47.2669,42.7331,99.9867
25,26,18400,3343,304,346.722,12.9819,77.0181,99.4721
26,27,2752,2731,283,156.47799999999995,29.4366,60.5634,99.7124
27,28,14244,3131,268,158.319,62.1599,27.8401,99.8426
28,29,35602,2993,403,173.07,5.8364,84.1636,99.7649
29,30,2564,3429,261,324.963,82.4998,7.500189999999999,99.936
30,31,1421,490,264,170.61700000000005,5.49308,84.5069,99.9478
31,32,5049,2689,300,339.5130000000001,38.1418,51.8582,99.5796
32,33,2755,222,289,170.604,29.1387,60.8613,99.992
33,34,4520,2426,275,348.63,65.9899,24.0101,99.9936
34,35,5973,2048,331,350.171,8.79002,81.21,99.9847
35,36,7871,393,322,162.56799999999996,48.4259,41.5741,98.997
36,37,35054,1302,401,172.09,58.6087,31.3912,99.9214
37,38,206594,451,578,165.832,20.2387,69.7613,83.23
38,39,16656,2327,338,169.71599999999995,39.1,50.9,99.814
39,40,1807,1555,331,169.835,3.29401,86.706,99.991
40,41,27232,1904,396,345.083,59.1035,30.8965,99.9755
41,42,2245,3180,324,119.354,84.5328,5.46716,99.92
42,43,1253,2488,323,149.082,46.0466,43.9534,99.9797
43,44,7641,2902,348,167.533,27.3196,62.6804,99.9877
44,45,18451,3111,396,153.072,25.8426,64.1574,99.9521
45,46,5672,248,359,343.8640000000001,28.8655,61.1345,99.9894
46,47,6517,2839,375,167.521,15.5083,74.4917,99.8908
47,48,542,1042,349,214.11900000000003,79.9141,10.0859,99.7977
48,49,10447,1632,414,168.63,1.63596,88.36399999999998,99.9888
49,50,3800,2499,380,163.852,25.6846,64.3154,99.9716
50,51,4332,3423,391,311.385,80.1669,9.8331,99.9809
51,52,20278,2220,411,351.316,0.528397,89.4716,99.9819
52,53,15783,3298,414,159.205,22.05,67.95,99.9165
53,54,6852,1109,380,169.618,50.6857,39.3143,99.9651
54,55,28076,2664,417,357.434,0.084343,89.9157,99.8647
55,56,1399,896,362,152.937,56.8359,33.1641,99.9922
56,57,2362,2443,376,150.435,46.7881,43.2119,99.9937
57,58,3421,3196,395,344.2480000000001,9.98199,80.018,99.722
58,59,2354,653,374,160.882,60.8344,29.1656,99.835
59,60,932,3221,375,343.247,1.31538,88.6846,99.9946
60,61,1824,1378,382,347.51,48.6532,41.3468,99.9853
61,62,2843,2733,394,347.0540000000001,31.7563,58.2437,99.9954
62,63,987,1525,394,221.041,84.5443,5.45566,99.9648
63,64,2292,2040,411,329.236,31.6063,58.3937,99.9505
64,65,2980,2074,437,333.96,60.0233,29.9767,99.8634
65,66,836,2368,420,333.969,60.0626,29.9374,99.8523
66,67,9276,2370,472,327.019,62.7619,27.2381,99.9695
67,68,961,1535,427,337.713,38.5407,51.4593,99.9976
68,69,528,2408,418,355.421,0.0813904,89.9186,99.9537
69,70,1046,2863,437,148.157,59.97,30.03,99.8825
70,71,4648,1110,453,171.50099999999995,38.2396,51.7604,99.9886
71,72,536,3444,440,237.818,84.689,5.31102,99.9821
72,73,2580,1989,459,328.6140000000001,29.5773,60.4227,99.956
73,74,60364,2565,570,166.84400000000005,23.6172,66.3828,99.836
74,75,30914,2079,536,164.35,16.3205,73.6795,99.7844
75,76,24486,3364,557,160.252,17.6923,72.3077,99.8012
76,77,39569,849,622,338.84,25.5146,64.4854,97.1363
77,78,1508,3337,470,354.107,71.5033,18.4967,99.9911
78,79,22879,3179,564,165.796,6.138,83.86200000000002,83.2861
79,80,6284,1012,490,211.566,78.6154,11.3846,99.818
80,81,644,1751,472,169.245,0.301491,89.6985,99.9619
81,82,3736,2565,484,340.608,51.3836,38.6164,99.9063
82,83,2662,1550,488,336.867,39.3189,50.6811,99.9703
83,84,1503,2811,487,336.13,37.4118,52.5882,99.9469
84,85,862,2876,472,338.547,40.5472,49.4528,99.9787
85,86,1789,2853,499,164.74200000000005,37.4664,52.5336,99.992
86,87,15669,1218,524,157.755,62.8913,27.1087,99.2343
87,88,11464,1396,512,172.77700000000004,59.5953,30.4047,99.5862
88,89,2068,3437,497,344.969,13.2452,76.7548,99.97
89,90,95101,1782,614,346.205,40.6795,49.3205,98.1486
90,91,790,2906,500,176.188,1.90702,88.09299999999998,99.9826
91,92,9451,2249,549,328.272,58.4585,31.5415,99.4977
92,93,3902,1531,556,241.406,81.3407,8.659289999999999,99.8101
93,94,2038,367,535,151.401,26.3162,63.6838,99.9861
94,95,14009,2956,589,164.013,42.9963,47.0037,98.661
95,96,2880,1037,553,153.826,66.1131,23.8869,99.9411
96,97,871,2807,535,171.696,32.5749,57.4251,99.9616
97,98,11523,1134,597,167.266,12.0596,77.9404,99.9841
98,99,1058,1392,550,172.71599999999995,62.0415,27.9585,99.9572
99,100,802,1471,567,327.181,36.2674,53.7326,99.9866
100,101,5709,1360,594,161.375,0.090126,89.9099,99.9832
101,102,1571,3034,578,163.83100000000005,34.9101,55.0899,99.6044
102,103,6125,442,589,339.833,13.3094,76.6906,99.9757
103,104,9715,2793,594,356.19,76.0442,13.9558,99.9907
104,105,7983,969,608,217.769,82.7515,7.24845,99.8712
105,106,5484,217,645,349.606,27.3599,62.6401,99.9914
106,107,2431,3075,614,343.045,9.84032,80.1597,99.9806
107,108,53220,2109,695,167.308,28.5942,61.4058,99.4427
108,109,12080,713,655,163.299,4.18665,85.8134,99.9752
109,110,692,2871,601,175.451,6.29334,83.7067,99.9883
110,111,1527,1220,613,144.964,86.8679,3.13207,99.9892
111,112,2345,3237,620,345.346,20.9496,69.0504,99.9637
112,113,997,1497,617,182.319,30.1002,59.8998,99.9597
113,114,17742,1253,675,156.917,63.4921,26.5079,99.9743
114,115,14276,1030,691,158.248,63.6719,26.3281,99.9379
115,116,61516,1516,775,170.72400000000005,38.3832,51.6168,99.8099
116,117,5332,549,651,339.842,32.4773,57.5227,99.9775
117,118,2564,2864,658,355.543,3.5522,86.4478,99.9947
118,119,2376,913,670,343.435,3.50883,86.4912,99.9683
119,120,3530,3199,662,174.55200000000005,44.737,45.26300000000001,99.9854
120,121,6031,1567,680,97.0993,82.3892,7.61084,99.9107
121,122,5796,3356,665,350.708,59.0954,30.9046,99.9468
122,123,18818,2379,698,331.765,69.3058,20.6942,99.9676
123,124,26994,2719,727,339.315,56.1075,33.8925,99.9734
124,125,1278,3418,662,349.231,64.8032,25.1968,99.9939
125,126,1486,2924,669,356.547,5.5399699999999985,84.46,99.99
126,127,31037,3176,792,345.23800000000006,11.2801,78.7199,99.8605
127,128,1488,3265,676,180.326,43.5265,46.4735,99.978
128,129,1036,2727,674,356.274,77.73,12.27,99.9916
129,130,1666,658,687,170.615,4.17132,85.8287,99.9791
130,131,3618,601,699,331.6,66.6803,23.3197,99.7593
131,132,555,2982,683,175.574,5.42976,84.5702,99.9782
132,133,14052,3335,755,160.99200000000005,12.0955,77.9045,99.9575
133,134,1846,2535,713,214.772,79.5121,10.4879,99.9909
134,135,18037,2870,760,346.3130000000001,44.17100000000001,45.82899999999999,99.9054
135,136,1246,2243,716,350.337,43.1198,46.8802,99.9973
136,137,1088,2996,726,171.22099999999998,56.4664,33.5336,98.8034
137,138,1488,3038,723,170.30200000000005,49.4889,40.5111,99.9846
138,139,1088,1313,733,167.084,20.9805,69.0195,99.9863
139,140,2232,3415,747,163.084,22.2962,67.7038,99.9272
140,141,5300,1084,758,164.264,17.6064,72.3936,99.9669
141,142,10013,3075,780,352.30800000000005,44.0482,45.9518,99.9421
142,143,2270,656,751,339.3230000000001,6.16025,83.8398,99.9776
143,144,18077,2574,831,163.154,20.8263,69.1737,99.7611
144,145,10016,1242,785,163.076,17.0063,72.9937,99.9752
145,146,28777,2355,819,354.8830000000001,81.7495,8.25048,99.9669
146,147,1205,2611,755,176.168,24.4525,65.5475,99.9979
147,148,14191,2143,797,216.739,78.2399,11.7601,99.9604
148,149,9546,499,815,347.267,6.5610800000000005,83.4389,99.9088
149,150,1295,2443,760,204.78,74.8905,15.1094,99.7189
150,151,1646,2992,779,350.74300000000005,21.9088,68.0912,99.9084
151,152,1740,1328,774,164.296,60.7482,29.2518,99.7437
152,153,43822,684,858,187.885,64.3487,25.6513,99.9469
153,154,59574,1782,904,176.855,0.76088,89.2391,99.3671
154,155,26909,875,901,167.755,58.3174,31.6826,99.9377
155,156,14483,1028,833,164.775,13.6986,76.3014,98.4756
156,157,684,1018,797,173.646,57.5762,32.4238,99.9939
157,158,2451,1136,809,356.464,49.7488,40.2512,99.7723
158,159,4740,1391,819,350.0180000000001,47.5262,42.4738,99.9657
159,160,1101,2941,805,166.226,45.9227,44.0773,99.8913
160,161,1418,387,807,343.658,20.4611,69.5389,99.9865
161,162,1370,2918,828,166.313,17.7114,72.2886,99.9953
162,163,7110,3032,853,339.73800000000006,64.6975,25.3025,99.9917
163,164,1631,2681,841,352.621,80.4725,9.52745,99.9979
164,165,55077,3352,1005,174.018,41.3914,48.6086,99.7915
165,166,8518,2866,872,166.168,24.689,65.311,99.6914
166,167,7251,413,866,177.667,78.2945,11.7055,99.9684
167,168,641,1630,851,173.27700000000004,8.34412,81.6559,99.8757
168,169,2103,2229,858,167.28599999999997,30.7364,59.2636,99.9829
169,170,53726,1218,960,337.9,4.89492,85.1051,99.9593
170,171,2094,2743,858,166.15200000000004,44.0958,45.9042,99.8891
171,172,1988,2056,865,166.162,21.9966,68.0034,99.9766
172,173,48276,2218,972,162.631,50.1514,39.8486,95.4152
173,174,11401,1991,928,358.639,16.1719,73.8281,99.8554
174,175,2084,2964,883,172.572,43.4374,46.5626,99.9891
175,176,11460,2408,933,354.196,13.5709,76.4291,99.8557
176,177,2505,2751,897,336.925,48.6539,41.3461,99.9683
177,178,1770,2666,893,338.333,57.2954,32.7046,99.9969
178,179,666,1124,900,349.66,6.102519999999998,83.8975,99.9466
179,180,9442,481,928,179.75400000000005,75.2517,14.7483,91.4576
180,181,12298,1034,941,174.44099999999997,18.7502,71.2498,55.19
181,182,597,3436,918,352.541,11.6419,78.3581,99.958
182,183,565,1910,896,168.15,60.6766,29.3234,99.6917
183,184,9890,3008,939,166.59400000000005,26.1908,63.8092,99.9446
184,185,5566,3184,940,166.893,26.225,63.775,99.9934
185,186,61710,2560,1045,153.065,33.3221,56.6779,99.9278
186,187,11569,1408,967,343.59,6.18115,83.8188,99.9715
187,188,105839,2974,1077,351.009,25.0707,64.9293,97.1101
188,189,1150,1345,934,352.61800000000005,5.06873,84.9313,99.987
189,190,44697,1543,1069,165.192,68.7149,21.2851,99.5397
190,191,731,3104,942,346.526,37.1799,52.8201,99.9888
191,192,2267,1608,951,176.771,63.9801,26.0198,99.908
192,193,2973,3071,979,173.747,42.7676,47.2324,99.9875
193,194,20355,237,1070,175.148,9.96246,80.0375,99.8499
194,195,3163,3255,970,1.45385,20.109,69.891,99.9703
195,196,9137,328,1056,344.605,78.4544,11.5456,99.0481
196,197,528,1572,976,148.819,78.1198,11.8802,99.8024
197,198,507,559,970,175.959,58.1036,31.8964,99.9711
198,199,95695,608,1081,168.128,6.865360000000001,83.1346,74.8592
199,200,748,2074,980,0.525033,11.7115,78.2885,99.983
200,201,41765,1944,1075,349.32199999999995,34.7387,55.2613,97.7192
201,202,675,3108,1002,351.899,22.3548,67.6452,99.9934
202,203,1086,1054,1021,150.887,82.1354,7.86457,99.7779
203,204,4864,2366,1053,337.034,57.9882,32.0118,99.7132
204,205,56765,891,1166,347.101,12.5734,77.4266,99.7312
205,206,40453,1265,1126,164.638,20.6749,69.3251,99.9311
206,207,2787,3248,1087,347.471,8.50337,81.4966,99.9955
207,208,5217,2171,1110,329.996,80.0694,9.93064,99.9633
208,209,36363,1758,1210,168.75099999999995,61.7613,28.2387,99.921
209,210,199311,2711,1456,163.923,19.6381,70.3619,95.709
210,211,1315,3191,1115,352.8830000000001,7.55043,82.4496,99.948
211,212,1579,2391,1124,162.908,54.1411,35.8589,99.9931
212,213,12592,2498,1211,158.075,76.3473,13.6527,93.9256
213,214,903,3142,1117,357.936,8.45213,81.5479,99.9904
214,215,11380,2083,1170,203.521,76.5476,13.4524,99.9384
215,216,36817,2240,1221,347.9890000000001,9.79258,80.2074,99.9311
216,217,18802,1906,1208,169.158,3.3450800000000003,86.6549,99.6005
217,218,5615,3296,1183,158.792,14.9954,75.0046,99.9579
218,219,3673,2913,1170,323.4840000000001,47.6704,42.3296,99.5858
219,220,13541,322,1223,341.709,66.1023,23.8977,99.9425
220,221,149299,1411,1377,173.838,40.6521,49.3479,86.4004
221,222,66450,2320,1364,177.207,71.6407,18.3593,99.7925
222,223,1631,3221,1181,173.83700000000005,38.8215,51.1785,99.9621
223,224,17266,510,1261,170.162,11.7659,78.2341,99.586
224,225,19704,2649,1257,351.472,6.79142,83.2086,99.9835
225,226,1358,2570,1197,159.338,26.2199,63.7801,99.9207
226,227,978,1606,1198,348.457,1.90042,88.0996,99.9876
227,228,9475,1149,1225,357.274,83.2102,6.78978,99.9749
228,229,2534,1048,1222,175.75400000000005,79.72,10.28,99.9723
229,230,2969,229,1212,347.3119999999999,7.91351,82.0865,99.9796
230,231,3343,1643,1241,186.26,79.5767,10.4233,99.9665
231,232,1521,606,1224,351.7,3.35065,86.6493,99.9768
232,233,21194,669,1303,341.311,18.3024,71.6976,99.9289
233,234,2112,3178,1237,159.144,15.3959,74.6041,99.9763
234,235,38794,3304,1322,153.69899999999996,42.0877,47.9123,99.8487
235,236,25572,1167,1340,336.724,18.4864,71.5136,99.992
236,237,750,2726,1241,346.395,9.88098,80.119,99.9987
237,238,1462,954,1242,321.338,77.6211,12.3789,99.9815
238,239,5173,190,1316,167.947,16.5338,73.4662,99.9788
239,240,1844,2055,1252,169.766,2.84641,87.1536,99.9891
240,241,7296,895,1291,168.93400000000003,13.2762,76.7238,99.9899
241,242,888,1079,1261,169.93599999999995,14.427,75.57300000000002,99.9937
242,243,2141,233,1279,338.9980000000001,13.5576,76.4424,99.7487
243,244,15767,3118,1317,317.625,77.9656,12.0344,99.9352
244,245,30682,969,1383,170.312,17.6234,72.3766,92.5426
245,246,27034,2029,1364,354.6269999999999,18.8393,71.1607,99.852
246,247,805,2998,1299,199.061,81.4086,8.591439999999999,99.9352
247,248,7788,1801,1344,169.107,74.703,15.297,99.9345
248,249,1459,341,1312,160.39600000000004,69.5089,20.4911,99.9838
249,250,21693,553,1391,175.78,33.4561,56.5439,99.9552
250,251,4317,803,1354,170.743,68.9845,21.0155,99.9951
251,252,48309,346,1438,334.548,63.8929,26.1071,87.4026
252,253,2022,3302,1362,166.787,37.4074,52.5926,99.6734
253,254,4581,242,1369,160.201,69.7135,20.2865,99.973
254,255,1451,1916,1372,338.7030000000001,48.0885,41.9115,99.313
255,256,1502,1838,1365,170.68,58.4639,31.5361,99.989
256,257,2080,2139,1379,171.285,53.9522,36.0478,99.9919
257,258,678,2564,1372,347.122,4.44608,85.5539,99.9915
258,259,990,3044,1373,342.884,38.9442,51.0558,99.9542
259,260,7685,2456,1409,170.79,82.7268,7.273239999999999,99.9733
260,261,1164,730,1383,170.265,13.1712,76.8288,99.9871
261,262,563,3118,1393,160.624,33.5079,56.4921,99.9876
262,263,13231,1841,1435,330.552,46.396,43.604,99.9119
263,264,2294,2596,1429,344.574,8.927430000000003,81.0726,99.9872
264,265,8299,802,1449,334.458,66.1127,23.8873,99.925
265,266,2167,3141,1422,167.343,39.2241,50.7759,99.8861
266,267,930,2942,1419,169.81099999999995,2.8577,87.1423,99.9936
267,268,6976,3094,1473,331.631,54.1451,35.8549,99.9165
268,269,4668,1080,1445,172.604,37.6847,52.3153,99.9941
269,270,3042,1580,1441,339.349,18.8867,71.1133,99.9877
270,271,22645,3356,1510,351.306,37.807,52.19300000000001,99.9414
271,272,6972,707,1462,200.897,88.3068,1.6931599999999998,99.9692
272,273,3492,3195,1448,335.654,10.3191,79.6809,99.9975
273,274,917,855,1436,73.2248,85.8481,4.1519,99.963
274,275,1108,1959,1453,345.894,19.7016,70.2984,99.9148
275,276,126285,2092,1819,336.464,26.0871,63.9129,99.348
276,277,1038,658,1482,170.634,79.9526,10.0474,65.8911
277,278,2950,1716,1476,336.035,43.6315,46.3685,99.9914
278,279,3562,1987,1494,198.245,68.4891,21.5109,99.7489
279,280,769,882,1470,170.17700000000005,75.3907,14.6093,99.9718
280,281,2189,2678,1476,353.775,11.1535,78.8465,99.9143
281,282,37445,3020,1569,170.643,40.7567,49.2433,84.9406
282,283,12154,1534,1524,343.464,45.5577,44.4423,99.9138
283,284,2360,620,1503,167.988,3.59406,86.4059,98.9754
284,285,725,1448,1496,161.74,37.361,52.639,99.9789
285,286,6899,3220,1507,213.043,83.3505,6.6494800000000005,99.9702
286,287,20743,1704,1555,157.549,45.6192,44.3808,92.7246
287,288,549,3028,1487,349.19199999999995,1.96352,88.0365,99.9962
288,289,3037,560,1503,300.027,88.6474,1.35263,98.0149
289,290,8853,1862,1508,343.047,10.5777,79.4223,97.3927
290,291,19015,2277,1564,208.302,81.5133,8.48674,97.5862
291,292,5623,1010,1533,4.52883,7.868310000000001,82.1317,99.6896
292,293,45012,979,1683,167.16400000000004,41.9904,48.0096,94.582
293,294,24942,806,1602,142.96,84.069,5.93105,99.8914
294,295,1696,710,1530,166.938,81.4096,8.59043,99.6534
295,296,2377,482,1543,169.032,74.8733,15.1267,99.8725
296,297,32225,325,1595,168.791,4.9248699999999985,85.0751,99.9311
297,298,68232,1366,1646,344.911,11.1296,78.8704,99.1656
298,299,6291,658,1581,314.551,85.5394,4.46061,99.8957
299,300,2626,1312,1559,165.498,35.5125,54.4875,99.9896
300,301,631,566,1541,172.63,37.1538,52.8462,99.998
301,302,3687,1885,1563,341.02,42.3587,47.6413,99.3504
302,303,36336,585,1715,168.78900000000004,77.429,12.571,99.8293
303,304,1422,3281,1570,166.991,36.4748,53.5252,99.9913
304,305,9883,464,1669,336.79,30.8917,59.1083,99.5566
305,306,12277,2170,1614,163.374,31.5774,58.4226,99.9912
306,307,4483,179,1641,343.149,6.73792,83.2621,99.9753
307,308,3359,3057,1614,332.855,53.2761,36.7239,99.9944
308,309,905,1621,1597,166.40900000000005,37.423,52.577,99.9827
309,310,9211,3310,1630,316.711,81.8364,8.1636,99.9592
310,311,1029,2269,1609,339.978,83.406,6.593960000000001,99.9729
311,312,6686,1839,1656,335.719,21.5629,68.4371,99.9916
312,313,7051,1695,1662,177.74200000000005,66.6473,23.3527,99.9824
313,314,8125,686,1663,347.664,22.8775,67.1225,99.9742
314,315,2647,1901,1669,163.474,67.6093,22.3907,99.951
315,316,1947,2028,1649,321.685,72.9697,17.0303,99.961
316,317,630,2854,1638,332.5080000000001,52.6012,37.3988,99.8902
317,318,7845,1958,1699,341.575,47.2081,42.7919,76.3224
318,319,3778,2811,1663,171.62400000000005,33.3266,56.6734,99.9738
319,320,7223,237,1692,343.824,1.05187,88.9481,99.8797
320,321,6434,3103,1692,343.925,44.1498,45.8502,99.9205
321,322,4518,1760,1693,151.119,25.1646,64.8354,99.984
322,323,13645,3332,1726,342.269,7.6742,82.3258,99.9373
323,324,63009,2972,1774,353.43300000000005,28.262,61.738,99.7705
324,325,183416,2423,2018,163.756,12.4397,77.5603,92.6826
325,326,992,2916,1681,337.0730000000001,54.2418,35.7582,99.9895
326,327,1068,3177,1679,338.8930000000001,85.2776,4.72236,99.9916
327,328,814,2033,1680,336.079,26.5428,63.4572,99.9902
328,329,2045,1205,1703,334.84,55.9505,34.0495,99.9586
329,330,1158,2511,1709,248.469,84.8305,5.16947,99.9847
330,331,12359,324,1750,333.805,11.3744,78.6256,99.9785
331,332,10903,782,1771,157.251,12.7904,77.2096,99.8835
332,333,15334,3248,1763,159.987,3.07176,86.9282,99.9339
333,334,611,817,1722,126.159,85.92399999999998,4.07605,99.8778
334,335,848,2464,1730,158.43,20.4715,69.5285,99.6847
335,336,43960,1447,1902,345.732,40.1618,49.8382,81.4591
336,337,4124,1866,1756,350.277,2.01592,87.9841,99.9682
337,338,11567,1599,1781,155.26,19.9761,70.0239,99.9555
338,339,1340,2567,1735,154.77200000000005,27.3068,62.6932,99.9825
339,340,8367,1725,1767,346.777,47.3189,42.6811,99.9958
340,341,1220,1259,1742,174.554,74.0716,15.9284,99.9961
341,342,1701,1341,1769,170.013,9.47861,80.5214,99.9898
342,343,859,2519,1751,293.2340000000001,82.1238,7.87617,99.9766
343,344,3408,191,1782,172.109,8.52383,81.4762,99.9886
344,345,2324,1135,1756,153.10299999999995,2.16664,87.8334,99.9927
345,346,2850,424,1771,161.275,13.4222,76.5778,99.9981
346,347,195848,1211,2084,154.815,16.2824,73.7176,91.7413
347,348,567,2559,1757,295.375,84.8437,5.1562800000000015,99.9754
348,349,29714,2672,1847,156.816,31.1213,58.8787,99.5626
349,350,11629,1929,1838,170.84400000000005,38.4546,51.5454,99.8501
350,351,623,1005,1786,180.3,75.206,14.794,99.9668
351,352,1092,1868,1795,350.0440000000001,10.566,79.434,99.9944
352,353,1958,456,1806,344.7580000000001,10.4098,79.5902,99.7462
353,354,64717,1608,1975,148.963,39.6585,50.3415,99.8251
354,355,2703,1381,1815,340.35,36.8317,53.1683,99.627
355,356,880,241,1807,165.269,6.16539,83.8346,99.8803
356,357,1701,925,1811,344.333,41.5641,48.4359,99.998
357,358,13821,546,1871,337.331,0.935577,89.0644,99.9804
358,359,12492,355,1843,340.68,76.8684,13.1316,99.9872
359,360,822,861,1830,157.486,14.5094,75.4906,99.9854
360,361,813,660,1829,163.804,79.8592,10.1408,99.9376
361,362,1337,2264,1834,169.628,34.9222,55.0778,99.9954
362,363,97542,3201,2003,314.132,84.1813,5.81874,99.2531
363,364,47487,635,1976,161.72299999999996,5.3259,84.6741,99.8313
364,365,25807,220,1978,160.52,1.94316,88.0568,99.9198
365,366,7903,272,1899,338.569,55.3581,34.6419,99.9777
366,367,579,955,1844,179.98,67.5446,22.4554,99.9894
367,368,849,459,1847,311.857,73.3859,16.6141,99.9691
368,369,2628,806,1869,109.936,83.235,6.764989999999999,99.9908
369,370,647,608,1846,325.776,75.6247,14.3753,99.991
370,371,680,882,1854,138.92600000000002,86.2422,3.75781,99.9952
371,372,6066,924,1890,177.458,69.1425,20.8575,99.715
372,373,678,2887,1857,154.763,40.3123,49.6877,99.4489
373,374,23473,2341,1922,158.882,48.5628,41.4372,99.9931
374,375,638,1030,1862,180.379,73.5039,16.4961,99.9686
375,376,14498,2864,1961,162.138,13.6403,76.3597,98.0077
376,377,1053,471,1880,344.961,16.5611,73.4389,99.9479
377,378,1447,2918,1907,157.394,37.9777,52.0223,99.9946
378,379,629,854,1900,160.59,85.9604,4.039630000000002,99.9878
379,380,3102,2972,1910,164.108,13.299,76.70100000000002,99.9266
380,381,19584,415,1951,174.72799999999995,6.32175,83.6782,99.9159
381,382,1994,2564,1932,338.5780000000001,27.369,62.631,99.8458
382,383,4354,1830,1929,348.49300000000005,45.5037,44.4963,99.9748
383,384,591,3394,1932,299.807,85.4801,4.51993,99.9727
384,385,1291,809,1925,158.561,84.8069,5.19309,99.989
385,386,2339,1383,1928,162.384,51.6417,38.3583,99.9969
386,387,1299,1317,1936,164.378,5.51514,84.4849,99.9763
387,388,3411,897,1952,323.163,61.6231,28.3769,99.5692
388,389,45117,1749,2072,344.305,32.1081,57.8919,99.9864
389,390,2123,2964,1978,349.62,10.3192,79.6808,99.9476
390,391,12481,1877,2050,145.80700000000004,36.0246,53.9754,99.9288
391,392,2942,805,1990,314.0420000000001,68.6049,21.3951,99.2894
392,393,10882,929,2022,165.546,24.2807,65.7193,99.8202
393,394,5351,764,2034,339.464,9.06617,80.9338,99.9431
394,395,1506,656,2023,345.121,7.19227,82.8077,99.4783
395,396,8045,367,2040,337.51199999999994,48.4256,41.5744,99.9409
396,397,1162,702,2025,157.54399999999995,64.5568,25.4432,99.7079
397,398,3972,2971,2050,165.264,13.4369,76.5631,99.8085
398,399,1465,2923,2031,162.999,33.8291,56.1709,99.7515
399,400,1943,152,2060,167.082,24.8052,65.1948,99.9745
400,401,9550,2151,2075,171.795,41.6999,48.3001,99.9872
401,402,846,3024,2055,163.892,32.7697,57.2303,99.9405
402,403,5882,1965,2086,164.918,53.1423,36.8577,99.9745
403,404,656,2738,2056,349.6980000000001,11.1477,78.8523,99.8974
404,405,1908,2669,2069,340.641,36.0742,53.9258,99.9046
405,406,13774,2864,2113,350.3180000000001,9.94714,80.0529,99.9909
406,407,1812,428,2076,339.704,58.8088,31.1912,99.9681
407,408,573,720,2070,161.773,20.6231,69.3769,99.6218
408,409,7200,2730,2105,165.308,35.8445,54.1555,99.9805
409,410,41058,927,2194,342.473,5.5206800000000005,84.4793,97.1644
410,411,535,902,2084,194.31,61.9189,28.0811,99.9297
411,412,12494,3027,2142,354.985,26.2688,63.7312,99.9865
412,413,1134,199,2097,165.222,23.3633,66.6367,99.8811
413,414,2765,202,2130,344.1330000000001,44.5229,45.4771,99.4959
414,415,8786,512,2134,341.8119999999999,48.5434,41.4566,99.9782
415,416,17614,341,2152,165.83,23.1336,66.8664,99.8711
416,417,11117,690,2168,158.72299999999996,64.9731,25.0269,99.9128
417,418,39476,2868,2247,349.327,28.4167,61.5833,99.6925
418,419,9769,1543,2164,354.875,65.8941,24.1059,99.8739
419,420,1157,2028,2132,344.721,37.3938,52.6062,99.9648
420,421,3427,2565,2145,173.449,14.4278,75.5722,99.7567
421,422,1547,2086,2132,335.371,27.2234,62.7766,99.9913
422,423,623,594,2161,150.181,62.855,27.145,99.9736
423,424,30084,1914,2223,157.245,5.70063,84.2994,99.9004
424,425,800,620,2151,170.415,16.0396,73.9604,99.9974
425,426,871,825,2161,348.8880000000001,6.32616,83.6738,99.7948
426,427,832,3391,2180,346.801,6.07551,83.9245,99.9501
427,428,1949,218,2169,236.572,81.6049,8.39506,99.9839
428,429,1286,2695,2164,352.519,12.005999999999998,77.994,99.9975
429,430,1755,770,2179,350.043,7.77787,82.2221,99.9782
430,431,53309,2030,2391,343.1,61.1367,28.8633,99.7069
431,432,1515,3326,2191,348.084,5.3914,84.6086,99.9839
432,433,671,831,2174,341.836,0.7776569999999999,89.2223,99.9951
433,434,213478,497,2543,163.782,10.8159,79.1841,59.4268
434,435,11843,2618,2232,352.7580000000001,14.3951,75.6049,99.9661
435,436,2009,165,2190,336.858,64.7724,25.2276,99.9333
436,437,1425,2674,2197,336.588,32.7053,57.2947,99.9863
437,438,3160,1662,2205,326.927,48.8285,41.1715,99.8507
438,439,943,2526,2185,166.275,35.9692,54.0308,99.9855
439,440,929,565,2189,350.339,6.710369999999998,83.2896,99.9963
440,441,4077,862,2235,346.809,22.4851,67.5149,99.8231
441,442,3130,2837,2203,162.338,3.23183,86.7682,99.998
442,443,959,2714,2205,164.266,37.5521,52.4479,99.9759
443,444,6434,3192,2242,172.815,43.9277,46.0723,99.9725
444,445,14165,614,2252,334.4890000000001,53.76,36.24,99.9913
445,446,49298,2482,2389,170.47,38.0167,51.9833,83.9234
446,447,44169,3201,2323,316.269,74.5142,15.4858,99.8366
447,448,12056,1617,2254,165.93099999999995,13.0962,76.9038,99.9865
448,449,664,1513,2214,149.085,15.6484,74.3516,99.9624
449,450,528,215,2231,27.6646,88.5933,1.40667,99.9791
450,451,5505,1747,2243,336.707,50.6487,39.3513,99.9961
451,452,1732,3256,2227,339.345,11.9072,78.0928,99.9844
452,453,1959,278,2227,44.677,88.2453,1.75469,99.9942
453,454,661,2534,2224,163.13,17.3976,72.6024,99.99
454,455,1084,3300,2232,166.50099999999995,48.0896,41.9104,99.992
455,456,1795,3361,2236,335.961,15.8697,74.1303,99.963
456,457,3134,365,2246,343.23800000000006,4.80791,85.1921,99.9798
457,458,31720,808,2367,342.958,26.3662,63.6338,98.0266
458,459,3683,171,2278,346.077,34.7909,55.2091,99.9901
459,460,679,845,2242,350.291,4.1945,85.8055,99.7891
460,461,4435,847,2282,161.485,1.20087,88.7991,99.9857
461,462,1184,2708,2251,160.17700000000005,18.7403,71.2597,99.9925
462,463,753,2541,2255,165.335,35.5566,54.4434,99.9013
463,464,865,209,2267,146.624,89.0511,0.948945,99.9944
464,465,4083,1543,2291,152.785,24.2912,65.7088,99.9365
465,466,2201,1072,2284,349.811,22.1036,67.8964,99.9958
466,467,2569,3005,2295,348.555,1.39034,88.6097,99.9992
467,468,4729,269,2314,143.67,88.1951,1.80494,99.9831
468,469,3155,2692,2305,162.759,35.2929,54.7071,99.8694
469,470,2164,3045,2337,168.52200000000005,41.7996,48.2004,99.8791
470,471,42708,1632,2395,319.333,75.2328,14.7672,99.9443
471,472,1668,1794,2323,206.454,76.7128,13.2872,99.9894
472,473,32017,2132,2402,169.737,21.3711,68.6289,99.9647
473,474,1346,2616,2323,176.705,67.6354,22.3646,99.9967
474,475,10609,669,2372,352.918,11.1384,78.8616,99.9255
475,476,944,622,2320,170.416,86.3184,3.68158,99.9866
476,477,212078,2755,2709,166.696,24.0263,65.9737,97.5258
477,478,47093,1837,2477,162.55200000000005,28.7482,61.2518,80.1013
478,479,7426,2334,2361,353.872,39.2483,50.7517,99.9374
479,480,7175,537,2358,165.72099999999998,42.12600000000001,47.874,99.9605
480,481,1261,958,2356,349.034,6.9763600000000014,83.0236,99.4831
481,482,3808,179,2357,194.592,86.9181,3.0819400000000003,99.9813
482,483,2162,1092,2364,169.37,0.607895,89.3921,99.984
483,484,1580,272,2356,328.648,59.9036,30.0964,99.99
484,485,5766,733,2417,327.135,68.4665,21.5335,99.9007
485,486,91346,1198,2466,334.5730000000001,68.8515,21.1485,84.9344
486,487,6050,2598,2414,355.342,13.4217,76.5783,99.9809
487,488,4311,562,2410,165.187,30.9682,59.0318,99.6048
488,489,92848,3202,2561,342.08,31.8361,58.1639,99.9569
489,490,23444,2330,2464,159.787,17.0852,72.9148,99.9373
490,491,12424,896,2508,165.25099999999995,31.869,58.131,99.9105
491,492,624,3358,2446,299.519,75.645,14.3551,99.9666
492,493,591,3387,2470,296.823,76.4214,13.5786,99.9631
493,494,1627,1508,2480,164.642,8.91023,81.0898,99.9927
494,495,1725,1567,2489,208.223,69.5149,20.4851,99.9717
495,496,14977,2615,2555,346.086,68.6764,21.3236,98.9046
496,497,1756,1658,2514,338.711,59.1472,30.8528,99.6649
497,498,39653,2103,2639,154.247,10.5069,79.4931,99.8668
498,499,1086,1611,2517,163.464,41.7478,48.2522,99.9785
499,500,10631,1501,2563,173.11900000000003,73.4589,16.5411,99.6399
500,501,2710,169,2553,343.874,47.1289,42.8711,99.9635
501,502,16109,2984,2612,352.175,3.08672,86.9133,99.7241
502,503,1378,2309,2549,343.653,0.0734558,89.9265,99.6506
503,504,1481,2247,2559,346.046,13.6884,76.3116,99.6086
504,505,1614,1585,2559,161.564,7.97388,82.0261,99.9956
505,506,17397,1625,2619,341.891,51.9717,38.0283,99.9526
506,507,24765,1342,2629,338.43,7.206110000000002,82.7939,99.8829
507,508,833,2275,2564,348.636,4.39077,85.6092,99.8859
508,509,516,2323,2555,347.6690000000001,2.94939,87.0506,99.9778
509,510,8357,2880,2599,346.741,9.05795,80.9421,99.9271
510,511,11926,1187,2624,168.454,56.6351,33.3649,99.9566
511,512,31987,248,2689,153.286,62.6967,27.3033,99.917
512,513,1191,863,2592,164.024,15.3769,74.6231,99.9829
513,514,124035,2407,2757,178.84900000000005,56.8733,33.1267,97.793
514,515,2278,295,2611,166.18,53.6688,36.3312,99.9145
515,516,34466,932,2700,162.273,68.5224,21.4776,92.2881
516,517,897,1100,2608,348.555,45.2854,44.7146,99.9895
517,518,9802,1832,2635,172.488,55.6407,34.3593,99.8594
518,519,23337,3120,2750,170.71400000000003,27.5622,62.4378,99.7575
519,520,5358,1033,2626,326.139,76.8886,13.1114,99.9705
520,521,41514,1456,2774,169.584,12.7417,77.2583,99.4049
521,522,11916,2873,2683,345.208,33.361,56.639,99.9495
522,523,3595,2183,2673,163.82399999999996,41.9006,48.0994,99.9857
523,524,70418,1709,2800,163.71,36.4498,53.5502,99.989
524,525,54518,1215,2811,351.898,23.0678,66.9322,99.9654
525,526,15453,1947,2740,349.468,40.0256,49.9744,99.9025
526,527,1434,1095,2701,176.196,11.3506,78.6494,99.9873
527,528,981,784,2705,161.77700000000004,17.5897,72.4103,99.9922
528,529,1402,2820,2710,4.78357,66.8376,23.1624,99.6671
529,530,518,3376,2746,174.40099999999995,5.0837900000000005,84.9162,99.987
530,531,8006,165,2774,288.5540000000001,78.3586,11.6414,99.9698
531,532,18314,1033,2833,174.315,12.5424,77.4576,99.6595
532,533,1407,1542,2741,166.655,75.4712,14.5288,99.488
533,534,6153,750,2767,351.836,29.5504,60.4496,99.9674
534,535,1341,2145,2771,163.315,29.2325,60.7675,99.1161
535,536,942,2866,2745,354.9980000000001,18.1471,71.8529,99.9969
536,537,1006,1381,2757,348.8180000000001,8.42635,81.5737,99.837
537,538,7293,3293,2821,350.84,0.0276184,89.9724,99.8596
538,539,4528,3019,2783,351.019,10.02,79.98,99.9937
539,540,4753,252,2812,344.759,34.1413,55.8587,99.9874
540,541,26251,1849,2932,173.477,55.8208,34.1792,99.9002
541,542,800,2564,2792,170.479,38.7654,51.2346,99.5925
542,543,167761,483,2971,167.093,12.3475,77.6525,95.3961
543,544,570,853,2796,172.795,2.5791,87.4209,99.8745
544,545,19529,2201,2893,164.514,32.4035,57.5965,99.1609
545,546,3873,1984,2828,152.17,8.40607,81.5939,99.9744
546,547,822,700,2820,253.377,84.7379,5.26205,99.993
547,548,30410,2066,2933,353.305,26.6042,63.3958,99.5394
548,549,19388,857,2893,169.169,6.12363,83.8764,99.9015
549,550,2167,390,2858,343.091,32.5142,57.4858,99.9275
550,551,9955,3004,2877,163.99,55.2945,34.7055,99.9704
551,552,1094,1523,2855,356.338,7.0110100000000015,82.98899999999998,99.9931
552,553,7743,3183,2892,352.237,6.2613,83.7387,99.9607
553,554,1075,3250,2870,350.36,41.4424,48.5576,99.9605
554,555,735,3385,2888,350.212,16.8173,73.1827,99.9352
555,556,1050,1945,2887,163.201,31.4204,58.5796,99.9667
556,557,793,1072,2889,170.179,9.71552,80.2845,99.9947
557,558,1716,2341,2890,191.257,65.8587,24.1413,99.9851
558,559,7026,1563,2933,185.46,60.3652,29.6348,99.9796
559,560,3952,3087,2909,210.946,84.6195,5.38052,99.9323
560,561,1139,1515,2943,186.965,59.8811,30.1189,99.3237
561,562,14282,3297,2961,349.0030000000001,37.8812,52.1188,99.4741
562,563,580,470,2910,199.438,86.6632,3.3368300000000004,99.6357
563,564,10100,1310,2958,0.515239,13.4654,76.5346,99.9904
564,565,5385,1948,2958,157.661,36.524,53.476000000000006,99.9351
565,566,561,2365,2924,341.793,32.6578,57.3422,99.9862
566,567,36181,1056,3032,167.218,32.1325,57.8675,90.7549
567,568,5196,2322,2959,209.027,63.8004,26.1996,99.9893
568,569,23036,2944,2997,344.61800000000005,15.5876,74.4124,92.9232
569,570,10932,1644,2990,340.0180000000001,48.3495,41.6505,99.3909
570,571,12175,1470,3012,173.542,9.64178,80.3582,99.7999
571,572,1027,3123,2962,350.791,7.63893,82.3611,99.9855
572,573,5313,1196,2984,351.35,6.4069699999999985,83.59299999999998,99.9847
573,574,559,2524,2984,358.912,24.5269,65.4731,99.9674
574,575,7559,2467,3026,357.9790000000001,27.859,62.14100000000001,99.8379
575,576,15260,940,3078,346.788,18.5563,71.4437,99.5216
576,577,29691,3195,3065,156.221,48.8398,41.1602,99.6911
577,578,55640,2269,3123,189.558,70.9786,19.0214,86.0021
578,579,6072,836,3053,167.002,46.5826,43.4174,99.625
579,580,2129,1348,3019,334.63,45.1388,44.8612,99.7235
580,581,19140,1631,3094,168.19400000000005,72.9646,17.0354,99.6634
581,582,11825,1259,3064,171.562,10.1034,79.8966,99.9894
582,583,125626,2996,3290,182.733,53.6829,36.3171,87.3405
583,584,512,131,3037,335.641,48.9482,41.0518,99.9881
584,585,1548,668,3044,344.913,30.9951,59.0049,99.9906
585,586,1598,378,3055,190.427,78.53699999999998,11.463,99.9651
586,587,23098,1873,3099,170.412,22.2853,67.7147,99.9341
587,588,20133,2058,3124,336.968,65.3609,24.6391,99.9494
588,589,1062,3310,3073,343.36300000000006,6.83632,83.1637,99.6986
589,590,10244,1398,3102,356.394,45.1772,44.8228,99.9492
590,591,10615,145,3162,157.691,63.2051,26.7949,99.9678
591,592,592,3353,3081,339.309,6.61435,83.3857,99.9394
592,593,889,3375,3096,174.417,40.0534,49.9466,99.9532
593,594,35742,2765,3175,163.227,65.041,24.959,99.9506
594,595,3139,1201,3109,332.166,42.3991,47.6009,99.976
595,596,23536,412,3156,336.147,46.8802,43.1198,99.8088
596,597,11955,248,3136,158.209,27.0529,62.9471,99.9968
597,598,5737,2389,3140,330.55800000000005,44.2523,45.7477,99.99
598,599,53606,699,3232,165.757,59.2667,30.7333,99.9618
599,600,27836,927,3260,159.091,39.575,50.425,99.727
600,601,11507,2625,3172,185.24,52.1848,37.8152,99.9685
601,602,8934,1333,3166,170.475,64.6894,25.3106,99.9774
602,603,448650,2647,3685,175.215,7.88213,82.1179,83.9794
603,604,7768,1099,3175,344.9790000000001,21.1916,68.8084,99.8973
604,605,5525,1857,3170,165.85,67.3907,22.6093,99.9877
605,606,2708,3334,3178,158.822,48.2265,41.7735,99.9532
606,607,974,3288,3157,343.349,20.6905,69.3095,99.9928
607,608,1696,3178,3164,154.461,37.8656,52.1344,99.9836
608,609,28430,1631,3208,329.2530000000001,56.5735,33.4265,99.9772
609,610,6537,1217,3195,172.47,50.8234,39.1766,99.9959
610,611,18697,2177,3256,328.922,67.7024,22.2976,99.8648
611,612,29843,325,3264,177.891,61.5749,28.4251,99.9126
612,613,577,3374,3215,177.31799999999996,67.2719,22.7281,99.7577
613,614,6254,1038,3254,163.116,36.6853,53.3147,99.7709
614,615,4824,3288,3231,350.819,36.1208,53.8792,99.9893
615,616,12253,1852,3243,345.612,32.9677,57.0323,99.9843
616,617,145952,1936,3530,164.885,3.3370300000000004,86.663,70.2466
617,618,25884,1330,3293,340.185,12.3687,77.6313,99.9833
618,619,2176,1092,3228,169.851,12.8834,77.1166,99.9675
619,620,31417,1528,3322,191.255,75.983,14.017,99.9678
620,621,4127,3331,3310,183.11900000000003,64.4473,25.5527,99.8491
621,622,2947,1176,3248,173.57,59.8642,30.1358,99.9948
622,623,704,2839,3257,339.191,50.7347,39.2653,99.9851
623,624,19548,1708,3343,168.40900000000005,22.1858,67.8142,99.9236
624,625,2012,2654,3278,342.7,51.3716,38.6284,99.8715
625,626,15458,246,3357,338.86,44.5886,45.4114,99.9719
626,627,3237,2809,3303,163.165,64.9015,25.0985,99.9893
627,628,3344,1116,3302,174.959,59.5475,30.4525,99.9423
628,629,7805,2098,3345,350.792,23.2145,66.7855,99.3046
629,630,633,1023,3301,163.733,34.5848,55.4152,99.9963
630,631,2851,2676,3328,351.775,30.9304,59.0696,99.9965
631,632,1838,411,3325,340.751,41.3884,48.6116,99.9718
632,633,5382,535,3341,175.57299999999995,21.3118,68.6882,99.9759
633,634,4919,1845,3338,37.1475,81.1477,8.852310000000003,99.9852
634,635,61527,1099,3401,166.567,35.4134,54.5866,99.5784
635,636,16164,2193,3387,335.798,45.3291,44.6709,99.7129
636,637,6236,655,3380,181.765,8.61533,81.3847,99.9849
637,638,2071,2749,3346,231.945,67.5638,22.4362,99.9647
638,639,3125,3252,3341,158.906,41.721,48.279,99.9872
639,640,6981,753,3368,337.649,18.7974,71.2026,99.9913
640,641,586,595,3352,180.449,11.514,78.486,99.9995
641,642,3183,152,3367,316.36,73.9727,16.0273,99.823
642,643,72975,3209,3504,172.0,6.6284800000000015,83.3715,99.9423
643,644,2121,2030,3373,337.664,44.5295,45.4705,99.9242
644,645,2992,3083,3380,165.118,57.1845,32.8155,99.9948
645,646,1972,368,3370,343.09,7.36602,82.634,99.9924
646,647,15465,424,3441,176.92,12.1539,77.8461,99.8434
647,648,1090,2644,3382,192.814,76.7617,13.2383,99.9918
648,649,4348,1811,3393,172.55599999999995,31.8228,58.1772,98.4573
649,650,1296,2694,3377,339.454,51.1606,38.8394,99.9901
650,651,381967,1426,3790,352.205,20.1474,69.8526,96.5886
651,652,2240,2741,3407,351.936,23.0239,66.9761,99.5973
652,653,1098,155,3401,343.163,17.3546,72.6454,99.7568
653,654,6268,1755,3441,344.806,11.8956,78.1044,99.9983
654,655,9062,794,3442,177.817,9.74447,80.2555,99.9897
655,656,6706,554,3446,176.49400000000003,21.4,68.6,99.9015
656,657,12900,229,3452,180.791,54.5297,35.4703,99.9508
657,658,770,2254,3438,186.061,67.318,22.682,99.8539
658,659,523,640,3447,179.384,12.5224,77.4776,99.9845
659,660,2682,1823,3475,0.686634,57.6063,32.3937,99.9521
660,661,3372,2130,3486,354.733,17.0682,72.9318,99.9712
661,662,41582,910,3629,342.608,70.7171,19.2829,82.6776
662,663,687,2240,3464,353.009,17.7054,72.2946,99.9944
663,664,851,2189,3478,183.235,67.1204,22.8796,99.9814
664,665,23275,771,3558,177.095,12.905,77.095,99.9165
665,666,15012,581,3542,168.425,37.1703,52.8297,98.4111
666,667,1059,106,3501,343.486,15.3523,74.6477,99.9077
667,668,10880,307,3557,291.197,73.4765,16.5235,99.4541
668,669,16170,1056,3561,172.665,2.68485,87.3151,99.8355
669,670,995,2776,3526,339.866,80.5177,9.48235,99.5277
670,671,5416,207,3547,347.028,21.8857,68.1143,99.9934
671,672,541,150,3531,268.444,71.4533,18.5467,99.892
672,673,7731,444,3552,243.978,82.0443,7.95568,99.9042
673,674,659,134,3530,300.873,68.4333,21.5667,99.988
674,675,11174,2974,3608,351.8730000000001,15.2483,74.7517,99.8442
675,676,93729,519,3818,161.213,4.21212,85.7879,98.7475
676,677,3676,115,3607,350.958,43.5722,46.4278,99.9489
677,678,25527,2704,3676,348.5180000000001,10.4488,79.5512,99.5535
678,679,909,2903,3580,350.837,2.14284,87.8572,99.9402
679,680,4520,2843,3599,349.523,71.507,18.493,99.9171
680,681,48133,203,3716,350.417,9.41189,80.5881,99.9599
681,682,4363,3090,3629,353.786,87.4539,2.5461400000000003,99.9832
682,683,29623,679,3697,356.82199999999995,0.515877,89.4841,99.9357
683,684,4074,1088,3641,182.965,63.1096,26.8904,99.8212
684,685,1783,2051,3636,162.539,37.9965,52.0035,99.9437
685,686,643,2217,3619,175.511,54.1986,35.8014,99.9889
686,687,17862,3292,3733,157.57299999999995,23.967,66.033,99.9723
687,688,1087,2026,3677,181.826,32.083,57.917,99.9921
688,689,1327,3295,3688,174.52700000000004,77.1963,12.8037,99.9778
689,690,10536,2000,3730,165.957,62.0369,27.9631,99.9254
690,691,1167,369,3701,276.67,67.0366,22.9634,99.9441
691,692,3151,1024,3724,186.852,61.0587,28.9413,99.9408
692,693,662,2977,3717,181.0,0.0,90.0,100.001
693,694,12865,365,3776,9.30805,37.4061,52.5939,99.9956
694,695,1962,3210,3746,173.679,6.123480000000002,83.8765,99.9716
695,696,9028,947,3784,355.43,5.19822,84.8018,96.5702
696,697,697,1085,3750,177.81400000000005,89.57799999999997,0.4219729999999999,99.9802
697,698,4908,2256,3788,173.91400000000004,22.6972,67.3028,99.9845
698,699,7229,764,3815,196.456,70.399,19.601,99.8086
699,700,508,681,3757,203.607,74.0133,15.9867,99.952
700,701,3420,1882,3781,356.326,16.2605,73.7395,99.9627
701,702,718,659,3769,202.202,72.2029,17.7971,99.9885
702,703,42776,2068,3847,170.361,40.6077,49.3923,98.6079
703,704,8259,3274,3848,178.399,0.942223,89.0578,99.9703
704,705,1212,824,3794,210.099,76.5638,13.4362,99.9905
705,706,3301,3216,3842,347.1740000000001,76.0192,13.9808,99.9811
706,707,10822,271,3878,161.493,4.59431,85.4057,99.9935
707,708,1839,853,3837,341.473,30.983,59.017,99.9899
708,709,9138,1845,3903,344.4430000000001,9.87926,80.1207,99.8088
709,710,1257,908,3843,201.327,85.0517,4.94831,99.956
710,711,1692,667,3847,207.972,73.6911,16.3089,99.9283
711,712,73884,1077,4071,358.177,1.61821,88.3818,100.013
712,713,1441,2288,3861,172.208,62.9469,27.0531,99.9661
713,714,10502,2371,3901,326.953,60.8986,29.1014,99.9783
714,715,5019,380,3890,176.928,0.589363,89.4106,99.9134
715,716,2134,138,3863,349.321,4.48189,85.5181,99.9594
716,717,7385,149,3933,184.495,82.5332,7.46685,99.6991
717,718,525,1057,3860,335.966,54.5706,35.4294,99.991
718,719,2224,1583,3880,339.458,54.9447,35.0553,99.9669
719,720,80570,2005,4067,165.81799999999996,44.8598,45.1402,93.7387
720,721,43786,799,3990,171.726,67.8331,22.1669,99.3349
721,722,2200,2262,3902,352.619,17.3647,72.6353,99.9049
722,723,1580,3314,3903,358.8590000000001,0.145706,89.8543,99.9813
723,724,14840,3229,3966,182.317,3.74448,86.2555,99.8453
724,725,3267,1619,3937,350.495,8.386330000000001,81.6137,99.8981
725,726,3040,1543,3932,353.31699999999995,8.26394,81.7361,99.9876
726,727,2355,303,3941,250.784,81.4177,8.58234,99.9862
727,728,2251,1656,3964,347.168,8.74821,81.2518,99.8065
728,729,70068,2725,4172,169.704,16.8678,73.1322,99.6443
729,730,125214,2321,4109,160.564,10.0121,79.9879,99.9168
730,731,1077,165,3939,350.32199999999995,3.65721,86.3428,99.9628
731,732,1150,3335,3957,156.286,23.519,66.48100000000001,99.9554
732,733,1356,349,3966,171.382,52.8089,37.1911,99.9775
733,734,1402,3120,3969,1.29984,4.52041,85.4796,99.9864
734,735,19652,528,4073,344.2480000000001,30.1484,59.8516,99.2139
735,736,70759,308,4110,172.933,77.9633,12.0367,99.5624
736,737,762,1781,3995,164.407,55.486,34.514,99.9642
737,738,1409,3163,4008,164.14,80.0482,9.95178,99.9611
738,739,3105,2595,4047,254.113,81.0214,8.978589999999997,98.093
739,740,13310,3089,4096,356.584,69.134,20.866,99.4037
740,741,6953,1800,4088,170.187,60.19600000000001,29.804,99.9312
741,742,640,934,4047,358.237,0.804817,89.1952,99.6756
742,743,4657,2027,4058,355.851,63.8028,26.1972,99.7044
743,744,1495,1765,4054,160.98,56.7808,33.2192,99.9938
744,745,145981,722,4317,341.5080000000001,24.8317,65.1683,97.8427
745,746,3496,1319,4077,166.28900000000004,41.9956,48.0044,99.8147
746,747,27270,3235,4146,182.16,3.4289300000000003,86.5711,99.9216
747,748,9671,1661,4103,173.725,4.37978,85.6202,99.9513
748,749,532,3149,4062,183.388,4.39853,85.6015,99.9864
749,750,8116,1037,4095,355.5019999999999,35.3519,54.6481,99.9689
750,751,814,3017,4078,180.992,0.00383759,89.9962,100.002
751,752,573,944,4081,2.32651,37.4824,52.5176,99.3681
752,753,1047,2619,4097,161.895,68.2729,21.7271,99.987
753,754,3798,930,4128,319.563,79.46,10.54,99.9868
754,755,2470,2561,4116,340.681,0.7403109999999999,89.2597,99.9075
755,756,38848,1861,4326,331.935,69.2866,20.7134,72.6619
756,757,2388,2666,4128,247.415,83.7739,6.2261,99.9716
757,758,3870,3185,4157,357.106,71.0371,18.9629,99.7857
758,759,522,2969,4131,176.15400000000002,4.84197,85.15799999999999,99.9983
759,760,8656,1294,4162,165.942,52.8687,37.1313,96.2719
760,761,1347,1629,4164,162.518,2.46309,87.5369,99.9967
761,762,10787,2564,4210,345.532,18.7765,71.2235,99.9932
762,763,3340,144,4167,342.55300000000005,56.1416,33.8584,99.7653
763,764,1264,1614,4193,169.102,1.39976,88.6002,99.9984
764,765,7672,1709,4190,332.227,67.2421,22.7579,99.9562
765,766,5626,1902,4221,167.69799999999995,64.5569,25.4431,99.9312
766,767,118882,1458,4413,171.71200000000005,8.94357,81.0564,45.2935
767,768,3133,198,4221,163.851,15.5816,74.4184,99.9936
768,769,21825,3126,4243,187.469,73.7207,16.2793,99.9614
769,770,6827,136,4245,343.374,24.303,65.697,99.6359
770,771,2233,586,4232,154.17700000000005,37.91,52.09,99.9595
771,772,29514,3001,4326,177.511,62.9079,27.0921,96.8102
772,773,16173,1198,4314,348.652,72.1388,17.8612,99.8966
773,774,16072,1632,4269,349.201,0.473526,89.5265,99.9942
774,775,9730,2462,4278,181.45,80.2351,9.76494,99.9585
775,776,64164,1029,4399,178.12599999999995,70.5176,19.4824,93.9651
776,777,20959,2830,4365,173.68900000000005,11.3786,78.6214,99.9928
777,778,11014,298,4287,345.11800000000005,19.9423,70.0577,99.9857
778,779,20808,497,4355,347.1930000000001,33.4355,56.5645,99.939
779,780,21196,2106,4321,335.775,59.0177,30.9823,99.9813
780,781,2353,393,4289,164.37599999999995,11.3757,78.6243,99.9877
781,782,28353,217,4390,343.521,44.0117,45.9883,97.5088
782,783,1137,207,4294,180.138,61.9958,28.0042,99.9946
783,784,8437,3191,4325,168.41,17.848,72.152,99.9847
784,785,26166,2306,4383,171.71900000000005,58.3618,31.6382,99.9219
785,786,762,2552,4312,163.209,15.8291,74.1709,99.9931
786,787,4788,3299,4348,285.411,83.664,6.33596,99.9869
787,788,1531,1978,4336,173.638,62.1631,27.8369,99.9831
788,789,22382,420,4436,163.605,38.1338,51.8662,99.7513
789,790,6443,1764,4349,174.192,11.3996,78.6004,99.9976
790,791,11940,2633,4382,177.813,80.6653,9.33469,99.9127
791,792,3154,2490,4363,177.795,5.36034,84.6397,99.9866
792,793,5986,2423,4369,345.23800000000006,37.4118,52.5882,99.672
793,794,2160,1844,4348,186.946,66.8357,23.1643,99.9795
794,795,1186,3237,4360,182.465,4.32224,85.6778,99.9964
795,796,12690,1275,4424,163.365,24.075,65.925,99.9758
796,797,1548,3019,4390,176.563,61.7545,28.2455,99.9965
797,798,2111,2035,4402,357.182,7.170039999999998,82.83,99.9823
798,799,52788,2369,4571,346.094,32.1883,57.8117,94.3868
799,800,128380,2879,4543,326.309,76.8337,13.1663,59.0345
800,801,17471,2183,4451,356.409,3.70753,86.2925,99.8797
801,802,2918,3076,4428,172.33599999999996,12.1254,77.8746,99.9885
802,803,3775,1745,4443,166.24,17.7263,72.2737,99.9559
803,804,1833,2596,4441,348.759,7.318510000000002,82.6815,99.9926
804,805,1214,2927,4439,164.893,0.159592,89.8404,99.7114
805,806,1598,3012,4432,338.61,54.0698,35.9302,99.9938
806,807,604,2410,4442,344.232,10.3216,79.6784,99.9877
807,808,7686,2804,4464,338.6690000000001,0.5992810000000001,89.4007,99.2811
808,809,16798,2012,4504,166.926,11.1,78.9,99.8129
809,810,729,338,4455,352.525,31.6522,58.3478,99.9914
810,811,40279,203,4580,163.398,21.3791,68.6209,99.3109
811,812,4327,875,4495,325.9840000000001,62.9149,27.0851,99.8803
812,813,1521,3319,4495,151.912,50.1054,39.8946,99.9768
813,814,28992,1739,4584,169.701,44.1355,45.8645,96.6197
814,815,1643,1856,4498,343.69199999999995,29.5437,60.4563,98.4184
815,816,1828,2287,4513,345.29,8.97264,81.0274,99.6977
816,817,5037,347,4523,339.492,1.83361,88.1664,99.9099
817,818,1202,2107,4518,357.4790000000001,4.68851,85.3115,99.4994
818,819,36787,1108,4616,181.355,49.0196,40.9804,99.9427
819,820,13886,2121,4574,174.77900000000002,11.4747,78.5253,99.693
820,821,1630,294,4540,166.405,33.7296,56.2704,99.9967
821,822,7029,439,4563,157.852,0.270058,89.7299,99.9493
822,823,5074,1885,4558,161.922,46.7842,43.2158,99.8794
823,824,1721,1964,4553,345.9380000000001,27.651,62.349,99.9566
824,825,20180,3214,4620,164.52900000000002,23.1253,66.8747,99.8989
825,826,1651,677,4555,355.037,0.197624,89.8024,99.9934
826,827,3281,957,4563,339.555,35.5794,54.4206,99.993
827,828,2088,1809,4576,339.3280000000001,39.9592,50.0408,99.9757
828,829,1094,754,4567,164.081,73.669,16.331,99.943
829,830,2132,1324,4578,336.846,55.8827,34.1173,99.9934
830,831,1950,1385,4575,171.19099999999997,5.88779,84.1122,99.9659
831,832,635,900,4570,170.937,70.4436,19.5564,99.9829
832,833,18010,861,4628,337.11,26.8298,63.1702,99.3645
833,834,43536,542,4651,345.14,49.577,40.423,98.9696
834,835,1486,2699,4577,156.34,3.03078,86.9692,99.9982
835,836,1673,1580,4592,170.252,44.401,45.599,99.6005
836,837,1032,937,4602,182.452,49.5112,40.4888,99.5722
837,838,11109,2141,4661,163.593,12.7279,77.2721,99.9678
838,839,1673,1517,4587,170.71599999999995,7.5259399999999985,82.4741,99.9809
839,840,529,367,4586,162.221,33.5532,56.4468,99.9928
840,841,1108,1988,4608,191.634,83.3833,6.61666,98.2277
841,842,826,1942,4608,169.614,12.4548,77.5452,99.9753
842,843,25978,1508,4656,347.066,26.528,63.472,99.9682
843,844,6219,1875,4636,199.424,84.5261,5.47386,99.9792
844,845,1386,1360,4632,173.44099999999997,49.1292,40.8708,99.9922
845,846,2514,2487,4644,356.61800000000005,50.5863,39.4137,99.9971
846,847,2973,3297,4647,333.741,79.9434,10.0566,99.9733
847,848,9296,2770,4687,345.52,75.2518,14.7482,99.9191
848,849,15613,2906,4685,172.197,46.5972,43.4028,99.961
849,850,842,1955,4642,171.25099999999995,17.2282,72.7718,99.9805
850,851,6245,2458,4683,174.03799999999995,60.2195,29.7805,99.965
851,852,5193,1287,4670,332.526,56.1887,33.8113,99.8986
852,853,8476,2016,4687,164.852,22.1164,67.8836,99.9695
853,854,1051,762,4656,165.43599999999995,27.3747,62.6253,99.8317
854,855,694,1694,4658,171.90099999999995,46.3163,43.6837,99.8858
855,856,2785,3094,4680,171.972,47.6327,42.3673,99.9983
856,857,931,1354,4682,169.329,50.1323,39.8677,99.8804
857,858,2774,1753,4694,171.393,29.086,60.914,99.9899
858,859,1276,1696,4698,338.092,51.79600000000001,38.204,99.9833
859,860,3208,2672,4708,160.595,0.0695038,89.9305,99.9836
860,861,6455,3259,4718,167.59599999999998,58.1077,31.8923,99.9872
861,862,1563,1931,4706,167.761,47.7317,42.2683,99.7745
862,863,4111,3045,4722,346.847,41.2324,48.7676,99.99
863,864,2436,2586,4711,166.55,63.4693,26.5307,99.9596
864,865,523,2222,4704,167.083,77.3109,12.6891,99.7242
865,866,1166,2531,4720,344.093,40.2371,49.7629,99.9959
866,867,1203,2293,4715,165.088,63.8457,26.1543,99.9402
867,868,568,573,4718,356.9190000000001,0.110229,89.8898,99.8789
868,869,830,3144,4733,357.968,56.9436,33.0564,99.9866
