,Grain No.,Size [Pixel],center x-coordinate,center y-coordinate,mean azimuth [degree],mean latitude [degree],mean colatitude [degree],Regelungsgrad [%]
0,1,6343,327,400,327.789,51.7479,38.2521,99.8299
1,2,8240,423,435,344.468,27.4301,62.5699,99.9385
2,3,3396,513,451,159.194,36.0863,53.9137,99.8542
3,4,10045,302,531,168.09400000000005,77.485,12.515,99.939
4,5,1378,611,463,152.099,22.3007,67.6993,99.9689
5,6,133389,549,635,154.45600000000005,20.4013,69.5987,99.9511
6,7,12976,892,638,157.22299999999996,1.03134,88.9687,99.9942
7,8,2409,800,621,165.196,51.8104,38.1896,99.9968
8,9,2650,996,625,159.25,27.8561,62.1439,99.8
9,10,2764,1080,656,333.499,28.902,61.098,99.9754
10,11,19022,1023,735,155.399,1.88036,88.1196,82.4442
11,12,37869,235,874,154.687,0.0283585,89.9716,99.8042
12,13,1901,1252,711,330.856,21.4452,68.5548,99.969
13,14,1443,1072,693,148.613,77.4356,12.5644,99.9879
14,15,16308,1216,775,329.731,25.0628,64.9372,99.588
15,16,16670,900,792,342.3280000000001,23.1297,66.8703,99.7823
16,17,18383,318,796,274.651,70.8119,19.1881,99.9456
17,18,20077,749,791,154.702,30.4605,59.5395,99.975
18,19,5432,1384,772,147.575,48.307,41.69300000000001,99.9896
19,20,2279,643,791,167.74900000000005,50.9668,39.0332,99.9637
20,21,2367,587,813,163.859,50.1706,39.8294,99.9809
21,22,1455,1037,803,147.085,30.9396,59.0604,99.9953
22,23,74789,1466,919,331.441,39.5713,50.4287,99.9584
23,24,2807,1105,819,161.276,36.8542,53.1458,99.9821
24,25,8880,1666,913,152.13,18.8828,71.1172,99.3814
25,26,12446,1024,896,147.39,22.1545,67.8455,99.9363
26,27,30296,521,902,337.923,0.797783,89.2022,99.9293
27,28,121385,1046,1032,337.0630000000001,25.7612,64.2388,65.9571
28,29,1481,658,878,331.45,11.74,78.26,99.994
29,30,2389,834,881,344.176,27.7199,62.2801,99.827
30,31,4655,1786,901,314.184,45.9431,44.0569,99.9917
31,32,2114,1099,882,333.38699999999994,40.5457,49.4543,99.9398
32,33,6166,748,898,166.043,54.6531,35.3469,99.9551
33,34,1603,1830,892,314.296,44.8024,45.1976,99.9459
34,35,598,82,932,277.78700000000003,72.9528,17.0472,99.9853
35,36,190242,1845,1132,151.709,56.8764,33.1236,99.986
36,37,604,378,960,153.047,42.9495,47.0505,99.9742
37,38,61881,491,1138,160.29,31.2552,58.7448,76.4001
38,39,56864,223,1097,327.599,9.4162,80.5838,99.8594
39,40,11667,645,1066,151.999,24.2485,65.7515,99.993
40,41,1265,1349,1038,319.7290000000001,59.7252,30.2748,99.8123
41,42,2549,817,1085,337.967,4.13863,85.8614,99.936
42,43,1648,1396,1076,329.641,39.189,50.81100000000001,99.9401
43,44,10953,1282,1103,327.944,65.1411,24.8589,99.9894
44,45,6486,677,1126,350.353,58.6101,31.3899,99.9815
45,46,1062,1175,1098,332.968,31.8746,58.1254,97.9998
46,47,4920,368,1157,329.07199999999995,44.4916,45.5084,99.9752
47,48,39645,1366,1195,150.19299999999996,42.8082,47.1918,99.1921
48,49,874,99,1118,152.19299999999996,44.1577,45.8423,99.9416
49,50,911,2283,1111,153.292,8.27105,81.729,99.9926
50,51,531,2327,1112,154.91,9.53139,80.4686,99.5584
51,52,8751,2240,1162,337.456,2.43591,87.5641,99.9833
52,53,900,760,1120,168.456,62.8287,27.1713,99.9757
53,54,808,1207,1136,337.476,5.96333,84.0367,99.9865
54,55,59344,745,1384,148.53,2.13026,87.8697,99.6573
55,56,763,2380,1134,169.30599999999995,54.5211,35.4789,99.9435
56,57,2445,1168,1164,310.259,71.9091,18.0909,99.2629
57,58,10387,2346,1211,169.923,52.2279,37.7721,99.9722
58,59,1447,2431,1154,140.468,16.3702,73.6298,99.9234
59,60,980,779,1162,333.524,13.3371,76.6629,97.9347
60,61,4537,708,1181,157.82,10.1709,79.8291,99.9912
61,62,24782,168,1286,142.351,55.8632,34.1368,99.9856
62,63,2045,2308,1203,331.099,26.5295,63.4705,99.9445
63,64,16188,624,1255,138.06799999999998,78.3375,11.6625,99.7635
64,65,111319,2526,1358,337.334,33.5896,56.4104,98.4938
65,66,14270,1143,1283,292.586,72.5596,17.4404,99.9191
66,67,12726,297,1259,133.097,78.2711,11.7288,99.9512
67,68,16797,2139,1274,154.234,30.9375,59.0625,99.8862
68,69,889,1509,1274,333.526,74.5821,15.4179,99.9471
69,70,2948,1446,1304,341.81,79.259,10.741,99.9618
70,71,619,370,1283,152.555,40.142,49.858,99.669
71,72,69738,2111,1398,334.598,30.1243,59.8757,99.4583
72,73,41168,1316,1369,156.77,39.1842,50.8158,99.9886
73,74,39659,943,1377,108.487,79.6047,10.3953,99.9234
74,75,1863,1929,1292,157.076,57.5721,32.4279,99.9923
75,76,9016,1560,1336,147.188,42.5074,47.4926,99.9474
76,77,862,1655,1298,156.025,35.2479,54.7521,99.9791
77,78,2972,1858,1316,150.692,27.6281,62.3719,99.9956
78,79,3217,410,1320,156.33100000000005,4.35425,85.6458,99.9916
79,80,6566,1747,1370,341.5680000000001,41.2481,48.7519,99.9796
80,81,34218,313,1439,291.258,78.7176,11.2824,99.5621
81,82,4500,2827,1349,316.65,75.4724,14.5276,99.983
82,83,136456,3116,1626,151.261,12.3699,77.6301,82.4551
83,84,3938,1639,1372,339.4890000000001,39.9897,50.0103,99.9926
84,85,567,419,1356,321.146,77.7541,12.2459,99.9598
85,86,4487,124,1382,311.639,60.9015,29.0985,99.9951
86,87,548,1866,1363,150.356,58.3443,31.6557,99.9549
87,88,7347,1138,1391,320.278,60.6912,29.3088,99.9929
88,89,1657,505,1391,301.583,79.9516,10.0484,99.9635
89,90,960,1834,1384,337.4480000000001,20.5818,69.4182,99.997
90,91,1359,437,1382,157.45600000000005,5.87756,84.1224,99.9827
91,92,662,542,1374,141.105,69.4704,20.5296,99.9791
92,93,29360,1701,1487,332.64,30.1342,59.8658,66.7729
93,94,1835,2885,1386,161.463,39.8274,50.1726,99.9937
94,95,3758,1509,1409,338.704,20.0603,69.9397,99.9825
95,96,1206,2950,1398,158.966,40.8778,49.1222,99.9724
96,97,4626,2847,1436,334.115,10.5973,79.4027,99.7581
97,98,12361,2736,1465,162.489,38.1441,51.8559,99.911
98,99,37195,513,1531,334.581,18.5875,71.4125,71.0418
99,100,12126,1833,1469,321.061,4.79642,85.2036,99.9893
100,101,1225,2906,1430,334.369,36.1698,53.8302,99.9889
101,102,537,108,1434,147.746,13.071,76.929,99.9864
102,103,676,3229,1431,155.266,1.8196900000000005,88.1803,99.4364
103,104,1263,1549,1451,164.231,72.1519,17.8481,99.9694
104,105,597,87,1447,146.452,13.2727,76.7273,99.9722
105,106,5470,1071,1470,336.653,3.657880000000001,86.3421,99.9254
106,107,771,1514,1460,165.77200000000005,73.0347,16.9653,99.975
107,108,6017,829,1484,330.271,84.822,5.177969999999998,99.4314
108,109,21590,1340,1520,332.232,79.6688,10.3312,99.036
109,110,671,1934,1471,328.976,11.14,78.86,98.7741
110,111,777,133,1461,183.767,77.9812,12.0188,99.9871
111,112,6868,2893,1500,316.232,78.8292,11.1708,99.9233
112,113,35606,1029,1578,150.497,4.52586,85.4741,91.9721
113,114,9368,1145,1512,94.2639,80.5862,9.41375,97.9223
114,115,4442,1450,1535,331.415,11.8078,78.1922,98.9095
115,116,49540,2256,1585,151.002,67.2075,22.7925,96.8493
116,117,13798,163,1552,131.666,75.4699,14.5301,99.8658
117,118,7462,1569,1531,151.834,7.42744,82.5726,99.7809
118,119,366912,1903,2106,330.6230000000001,8.32157,81.6784,76.7009
119,120,7258,1908,1539,333.95,68.63,21.37,99.4076
120,121,3172,2559,1531,159.315,54.6259,35.3741,99.6717
121,122,866,232,1519,138.171,76.7522,13.2478,99.9928
122,123,34759,2499,1634,148.692,19.6788,70.3212,95.7563
123,124,60992,347,1701,331.4980000000001,44.06800000000001,45.932,99.8354
124,125,1640,1646,1547,164.262,79.6412,10.3588,99.1907
125,126,62280,2755,1634,325.468,64.6012,25.3988,99.7717
126,127,941,604,1542,331.2390000000001,70.8559,19.1441,99.9911
127,128,628,822,1542,150.263,16.2257,73.7743,99.9979
128,129,6357,815,1591,1.31577,75.6062,14.3938,99.9052
129,130,16539,603,1633,313.623,76.8288,13.1712,99.9315
130,131,29201,1546,1644,148.752,29.9967,60.0033,99.9237
131,132,1071,54,1620,138.33,76.0817,13.9183,99.9496
132,133,666,1916,1586,336.144,21.7732,68.2268,99.9537
133,134,2140,1863,1601,344.592,15.9713,74.0287,99.9695
134,135,8495,1331,1636,28.5086,83.2759,6.72409,99.9741
135,136,9764,183,1673,304.634,77.209,12.791,99.9711
136,137,18813,1778,1687,150.219,0.403671,89.5963,99.9367
137,138,1224,129,1636,146.609,73.7113,16.2887,99.9763
138,139,2834,1127,1636,326.445,7.9198,82.0802,99.9728
139,140,8260,2083,1660,330.19199999999995,20.4413,69.5587,99.8992
140,141,16401,1195,1679,146.389,79.7149,10.2851,99.9403
141,142,783,1812,1630,344.401,13.4758,76.5242,99.9841
142,143,559,865,1629,159.675,3.70427,86.2957,99.9938
143,144,1232,2247,1643,175.55700000000004,73.9753,16.0247,99.9178
144,145,906,2205,1639,327.841,64.7762,25.2238,99.9552
145,146,170684,869,1802,337.21,24.2246,65.7754,92.5743
146,147,14401,1443,1736,169.261,77.1945,12.8055,99.8433
147,148,2376,1290,1691,164.08700000000005,78.7129,11.2871,99.9825
148,149,2984,2193,1688,331.94,1.1058,88.8942,99.9967
149,150,856,3324,1714,151.708,16.2213,73.7787,99.714
150,151,6314,2151,1754,150.216,18.7821,71.2179,99.9869
151,152,13153,2843,1774,164.635,39.8843,50.1157,99.9401
152,153,14244,1420,1827,151.14700000000005,28.9667,61.0333,98.0749
153,154,11043,2274,1750,289.975,81.3018,8.698160000000001,99.9776
154,155,17195,1602,1782,153.786,68.6137,21.3863,99.9378
155,156,3910,2399,1746,163.215,38.0333,51.9667,99.9874
156,157,10266,174,1808,348.176,3.73917,86.2608,99.9797
157,158,11017,2630,1793,162.59799999999996,27.626,62.374,93.0871
158,159,1429,1326,1754,169.41299999999995,75.9632,14.0368,99.9934
159,160,3558,3119,1797,334.171,50.3139,39.6861,99.9268
160,161,557,56,1779,144.336,75.8957,14.1043,99.9387
161,162,126362,2413,2068,339.684,9.74358,80.2564,77.6107
162,163,12947,3103,1873,326.952,60.0088,29.9912,99.8012
163,164,635,3157,1797,330.772,53.5281,36.4719,99.952
164,165,1422,259,1800,348.379,3.81643,86.1836,99.9893
165,166,7239,2730,1849,178.37099999999995,77.8845,12.1155,99.9344
166,167,2915,878,1827,155.455,73.41199999999998,16.588,99.993
167,168,770,2247,1810,320.047,62.4008,27.5992,99.9948
168,169,13186,2155,1864,318.922,62.7066,27.2934,99.9786
169,170,1438,222,1851,174.98,63.4727,26.5273,99.9925
170,171,2482,2891,1854,319.246,70.8722,19.1278,99.9676
171,172,943,685,1841,343.177,77.329,12.671,99.9961
172,173,12291,2822,1909,336.423,33.5698,56.4302,99.9637
173,174,23155,2594,1902,318.514,71.2838,18.7162,99.9578
174,175,1782,3040,1861,154.972,3.82671,86.1733,99.9935
175,176,27714,1314,1973,332.48,24.0441,65.9559,97.553
176,177,1066,680,1872,152.727,74.7984,15.2016,99.9976
177,178,1404,1650,1886,149.13299999999995,27.6425,62.3575,99.9815
178,179,118874,394,2070,336.83,4.27283,85.7272,98.3337
179,180,8022,1569,1913,319.725,54.9478,35.0522,99.9937
180,181,5955,1404,1912,314.36,46.7144,43.2856,99.9808
181,182,2470,401,1882,139.907,26.809,63.191,99.9673
182,183,10779,2034,1921,147.793,30.5765,59.4235,99.9884
183,184,25249,941,1988,335.593,3.36974,86.6303,99.4591
184,185,95316,3090,2102,324.491,14.791,75.209,96.4494
185,186,37862,698,2010,149.512,77.6229,12.3771,99.4832
186,187,4727,796,1940,171.108,73.3598,16.6402,99.8708
187,188,4543,1494,1945,324.84,13.7406,76.2594,99.9937
188,189,7731,494,1967,156.404,74.4806,15.5194,99.9161
189,190,10362,2710,1987,180.772,71.3083,18.6917,99.9737
190,191,10815,2916,2008,145.691,18.306,71.694,99.9743
191,192,961,550,1955,330.43,52.3247,37.6753,99.9783
192,193,46686,1076,2111,150.10299999999995,53.7286,36.2714,99.9306
193,194,706,2612,1980,328.982,40.8892,49.1108,99.9821
194,195,9722,2808,2047,157.02100000000004,32.8882,57.1118,61.3947
195,196,683,1176,1990,313.095,79.4365,10.5635,99.9904
196,197,920,141,2015,158.295,4.07912,85.9209,99.753
197,198,614,1504,2010,165.66400000000004,67.9626,22.0374,99.494
198,199,1262,1178,2023,157.263,75.4826,14.5174,98.2843
199,200,10182,3270,2132,153.912,35.4272,54.5728,99.8962
200,201,619,2188,2034,345.467,14.126,75.874,95.8932
201,202,32616,1564,2127,157.23,81.6929,8.307139999999999,99.7999
202,203,3180,1383,2066,154.127,34.0721,55.9279,99.9885
203,204,544,1434,2039,321.024,30.8402,59.1598,99.9043
204,205,1336,954,2055,335.9240000000001,26.6206,63.3794,99.9244
205,206,48047,2677,2176,328.33,39.3384,50.6616,99.9248
206,207,685,138,2061,159.293,4.41316,85.5868,99.9988
207,208,1485,1299,2053,150.709,34.8448,55.1552,99.9822
208,209,544,1343,2071,330.796,29.5242,60.4758,99.9911
209,210,716,1430,2093,125.371,79.3645,10.6355,99.963
210,211,1786,1293,2090,147.766,60.3729,29.6271,99.9969
211,212,12765,815,2147,145.278,56.7983,33.2017,99.9928
212,213,766,1235,2093,149.425,33.3555,56.6445,99.9925
213,214,3778,921,2142,332.055,31.7087,58.2913,99.9636
214,215,166086,1384,2406,328.621,8.058010000000001,81.94200000000002,82.8189
215,216,57702,216,2299,159.312,83.8589,6.14111,99.892
216,217,2103,719,2126,336.306,71.5403,18.4597,99.9949
217,218,11087,137,2185,329.9790000000001,50.395,39.605,99.6285
218,219,3215,1182,2175,148.578,60.2299,29.7701,99.985
219,220,543,669,2139,144.889,10.1259,79.8741,99.9924
220,221,24370,2246,2269,324.911,38.9931,51.0069,99.9039
221,222,272254,696,2518,338.761,11.3218,78.6782,98.8122
222,223,10828,2917,2251,317.712,81.8191,8.18092,99.8422
223,224,3688,890,2205,152.969,66.2083,23.7917,99.9766
224,225,10883,1743,2234,136.18,71.904,18.096,99.9535
225,226,37963,406,2313,339.217,65.4145,24.5855,99.9902
226,227,2790,1462,2220,328.969,47.2002,42.7998,99.983
227,228,145485,2773,2477,148.178,24.5828,65.4172,99.8315
228,229,35136,1595,2296,330.439,46.4585,43.5415,99.8899
229,230,2301,2392,2286,340.505,76.71600000000002,13.284,99.9875
230,231,6579,3226,2314,333.778,26.3217,63.6783,98.8062
231,232,37946,575,2444,143.60299999999995,10.1137,79.8863,99.8414
232,233,2921,3133,2321,283.559,80.2599,9.74009,99.9803
233,234,74357,2144,2484,342.994,70.8984,19.1016,99.4728
234,235,21235,2413,2404,337.1930000000001,1.88293,88.1171,99.9765
235,236,6052,1051,2372,342.2990000000001,43.3777,46.6223,99.9919
236,237,11795,3238,2401,158.428,6.00282,83.9972,99.9826
237,238,10923,3034,2412,247.241,82.7521,7.24788,99.9047
238,239,2417,1768,2392,130.631,35.5112,54.4888,99.9943
239,240,1870,2892,2404,286.068,78.7199,11.2801,99.9278
240,241,68230,2429,2616,328.906,25.6388,64.3612,98.3849
241,242,40492,296,2501,327.265,43.4841,46.5159,91.7143
242,243,1356,54,2442,152.524,80.73,9.27001,99.9303
243,244,1896,1076,2423,154.39600000000004,28.4799,61.5201,99.999
244,245,768,1127,2427,159.624,2.36635,87.6337,99.9987
245,246,1499,1311,2433,141.873,56.3179,33.6821,99.9959
246,247,30645,1186,2531,150.862,24.5467,65.4533,99.4866
247,248,14199,2984,2519,330.945,28.6828,61.3172,99.4473
248,249,4600,1115,2470,151.648,3.08562,86.9144,99.98
249,250,12445,3187,2506,326.626,4.82957,85.1704,98.4836
250,251,9936,1923,2542,152.724,32.7064,57.2936,99.9241
251,252,1187,3292,2512,319.35,32.1869,57.8131,99.8063
252,253,3367,135,2512,324.749,52.4567,37.5433,99.9556
253,254,780,96,2500,162.24200000000005,69.5884,20.4116,99.9885
254,255,744,57,2507,159.501,72.3406,17.6594,99.7155
255,256,2354,2268,2543,144.907,8.200619999999999,81.7994,99.9583
256,257,1748,1467,2553,142.18200000000004,56.5872,33.4128,99.9815
257,258,1288,99,2576,163.828,83.3586,6.64139,99.9814
258,259,555,60,2555,137.974,86.2582,3.74175,99.8847
259,260,264699,3035,2942,153.005,14.111,75.889,93.362
260,261,4404,313,2575,113.573,70.7165,19.2835,99.9634
261,262,5937,1858,2608,144.66899999999995,57.4616,32.5384,99.9773
262,263,3648,2572,2586,337.0080000000001,52.9749,37.0251,99.9962
263,264,635,3311,2583,199.891,79.3724,10.6276,99.9523
264,265,89742,2078,2769,157.00799999999995,40.9945,49.0055,99.9641
265,266,1913,1980,2614,162.137,60.0686,29.9314,99.9851
266,267,1005,142,2611,119.434,69.1805,20.8195,99.9915
267,268,24215,1192,2697,329.456,5.79833,84.2017,99.7712
268,269,9483,1029,2666,139.15,20.4732,69.5268,99.9724
269,270,3422,114,2650,161.57299999999995,54.7358,35.2642,99.9832
270,271,22759,2655,2715,156.11700000000005,7.88815,82.1118,99.9564
271,272,730,3284,2636,203.307,79.6842,10.3158,99.9386
272,273,868,1949,2643,355.661,69.7301,20.2699,99.9498
273,274,3439,1336,2652,158.49,45.7989,44.2011,99.9972
274,275,23604,1836,2753,316.648,56.4473,33.5527,99.9814
275,276,1000,155,2660,156.78799999999995,51.6244,38.3756,99.8909
276,277,3153,1130,2671,131.41,26.3045,63.6955,99.9751
277,278,2828,2997,2693,321.905,34.093,55.907,99.9571
278,279,1580,1521,2696,342.4890000000001,20.422,69.578,99.9787
279,280,4003,899,2699,326.367,26.9004,63.0996,99.9728
280,281,3423,1319,2726,129.411,36.4396,53.5604,99.9957
281,282,6248,1615,2718,339.4380000000001,14.5384,75.4616,97.9487
282,283,1109,64,2715,245.538,82.7658,7.23416,99.9155
283,284,1542,2942,2710,321.187,33.9657,56.0343,99.799
284,285,1348,148,2708,219.606,83.1584,6.84163,99.9912
285,286,1977,959,2722,147.625,32.3485,57.6515,99.9261
286,287,1347,835,2720,148.966,6.35757,83.6424,99.9712
287,288,23766,738,2774,327.66,46.7709,43.2291,99.9868
288,289,104669,1389,2910,338.971,18.1656,71.8344,97.5984
289,290,754,1062,2724,132.658,26.9608,63.0392,99.9951
290,291,769,100,2727,233.041,83.9616,6.03842,99.9939
291,292,1630,1241,2747,146.542,70.5676,19.4324,99.9928
292,293,6608,2283,2774,338.774,51.8568,38.1432,99.9931
293,294,7696,164,2775,329.702,53.5544,36.4456,99.9922
294,295,743,1035,2743,342.27,12.3588,77.6412,99.967
295,296,58486,452,2930,329.788,48.2697,41.7303,96.7994
296,297,642,47,2772,178.16299999999995,70.2041,19.7959,99.9574
297,298,17897,924,2818,340.163,10.2751,79.7249,99.7795
298,299,1755,621,2783,356.974,73.0101,16.9899,99.994
299,300,3135,1023,2777,131.134,27.5303,62.4697,99.8983
300,301,4705,2564,2789,152.819,46.4681,43.5319,99.9325
301,302,10098,1612,2797,354.704,58.5336,31.4664,98.979
302,303,8747,1732,2825,333.4240000000001,4.40448,85.5955,99.8036
303,304,3477,1200,2793,127.738,23.0045,66.9955,99.9384
304,305,1730,85,2789,143.14,50.2762,39.7238,99.9501
305,306,38453,2380,2888,145.672,12.5086,77.4914,99.7955
306,307,8410,2605,2848,153.267,42.1407,47.8593,99.9619
307,308,61841,946,3020,148.463,8.31377,81.6862,86.2518
308,309,3677,267,2829,146.093,46.1881,43.8119,99.9939
309,310,4072,2688,2844,153.07399999999996,46.7682,43.2318,99.9973
310,311,1138,2859,2815,152.69299999999996,7.04242,82.9576,99.9558
311,312,1317,3301,2854,155.137,44.2451,45.7549,99.9376
312,313,4176,587,2845,144.39,43.9552,46.0448,99.9967
313,314,2144,121,2845,332.004,30.6289,59.3711,99.9921
314,315,2376,647,2851,321.008,46.5403,43.4597,99.9971
315,316,7693,1199,2866,154.586,67.0154,22.9846,99.984
316,317,48591,260,2993,141.768,17.18,72.82,99.9372
317,318,28019,2197,2933,226.57,81.8234,8.17656,99.9086
318,319,741,3278,2865,157.096,43.6489,46.3511,99.9725
319,320,25381,816,2911,160.798,81.9806,8.01944,99.9465
320,321,5977,81,2953,324.319,25.2969,64.7031,99.8088
321,322,1260,1526,2864,140.214,51.9081,38.0919,99.7671
322,323,2545,1686,2883,132.134,34.3143,55.6857,99.9966
323,324,808,2490,2878,232.569,82.4859,7.5141300000000015,99.9334
324,325,10889,1865,2919,337.156,36.5712,53.4288,99.9918
325,326,713,55,2915,326.201,24.7073,65.2927,99.9378
326,327,23612,2532,2982,240.252,81.928,8.07198,99.3806
327,328,1867,584,2896,149.125,46.8766,43.1234,99.9879
328,329,7670,2734,2904,322.77,33.2802,56.7198,99.9343
329,330,960,35,2943,326.49,24.221,65.779,99.9422
330,331,83376,1757,3074,150.625,71.9036,18.0964,99.3066
331,332,891,1142,2904,127.643,26.0563,63.9437,99.9217
332,333,11992,620,2950,145.931,19.9032,70.0968,99.9873
333,334,3488,3247,2938,335.5619999999999,38.2489,51.7511,99.8838
334,335,71910,2606,3161,335.476,8.25098,81.749,77.6328
335,336,1567,2055,2958,344.462,62.0656,27.9344,99.9926
336,337,6026,1117,3002,159.384,70.1519,19.8481,98.736
337,338,372759,2335,3393,142.276,45.1022,44.8978,88.4979
338,339,21323,1498,3063,136.924,17.8451,72.1549,99.8704
339,340,45917,687,3102,151.033,42.0704,47.9296,99.9154
340,341,1265,1063,3012,138.204,66.2457,23.7543,98.1691
341,342,5212,91,3084,152.26,40.105,49.895,99.8264
342,343,13357,178,3118,325.056,25.9303,64.0697,99.9862
343,344,611,1142,3056,148.59,49.049,40.951,99.9622
344,345,81896,1027,3266,182.071,60.1891,29.8109,99.9267
345,346,15155,1195,3146,330.43,44.9345,45.0655,99.951
346,347,242773,562,3497,329.635,45.6674,44.3326,77.0635
347,348,882,1304,3107,339.3180000000001,18.1626,71.8374,99.983
348,349,104209,1475,3295,296.563,77.4728,12.5272,94.3548
349,350,730,304,3125,154.861,43.137,46.863,99.9969
350,351,5363,231,3195,156.27100000000004,30.9956,59.0044,99.9796
351,352,1015,130,3174,151.438,34.7767,55.2233,99.9795
352,353,20810,370,3226,142.327,17.4846,72.5154,99.6222
353,354,573,558,3159,160.091,17.5658,72.4342,99.9941
354,355,181680,2883,3452,144.886,67.1376,22.8624,99.624
355,356,1250,1698,3201,142.365,37.0931,52.9069,99.9862
356,357,1024,87,3196,155.025,56.8388,33.1612,99.9654
357,358,682,26,3224,335.417,14.7784,75.2216,99.8541
358,359,13443,3095,3270,156.542,43.5622,46.4378,99.9842
359,360,1597,127,3230,159.02,52.1881,37.8119,99.9932
360,361,7772,1950,3249,155.06,16.2422,73.7578,99.8861
361,362,2634,805,3240,182.776,59.6931,30.3069,99.9715
362,363,2344,47,3283,334.145,11.984000000000002,78.016,99.9227
363,364,3921,651,3272,332.7530000000001,46.655,43.345,99.9727
364,365,1693,254,3241,337.023,49.1981,40.8019,99.9717
365,366,33141,1781,3322,160.524,42.0125,47.9875,99.989
366,367,5120,162,3270,143.27700000000004,47.8592,42.1408,99.9838
367,368,18687,759,3329,328.522,59.2008,30.7992,99.6908
368,369,1329,1295,3261,152.05,41.9662,48.0338,99.9964
369,370,26336,189,3385,154.785,45.3887,44.6113,99.8553
370,371,729804,1680,3783,330.01199999999994,11.5526,78.4474,83.0658
371,372,4589,3239,3329,322.972,80.7629,9.23708,99.9717
372,373,1171,3160,3322,327.376,79.8011,10.1989,99.9589
373,374,1518,88,3350,337.11800000000005,60.681,29.319000000000006,99.9522
374,375,1173,1953,3337,341.8130000000001,26.8067,63.1933,99.9599
375,376,1142,697,3336,326.963,43.161,46.839,99.8777
376,377,907,59,3357,337.94699999999995,58.3346,31.6654,99.922
377,378,3969,3103,3363,164.72,74.5237,15.4763,99.9729
378,379,1336,835,3360,343.435,35.0698,54.9302,99.9776
379,380,1133,3154,3383,316.494,81.8275,8.17251,99.9754
380,381,1853,677,3386,325.869,39.9441,50.0559,99.9535
381,382,3601,3192,3442,316.096,82.2512,7.748839999999999,99.9687
382,383,8922,60,3494,154.243,47.4591,42.5409,99.8362
383,384,15364,831,3441,342.7630000000001,35.1312,54.8688,99.8962
384,385,651,53,3406,153.123,48.1687,41.8313,99.9656
385,386,517,767,3409,324.415,49.6414,40.3586,99.9773
386,387,5923,3096,3454,317.164,76.5854,13.4146,99.9837
387,388,562,3265,3426,324.009,80.9204,9.07961,99.9527
388,389,807,1839,3445,157.244,47.99800000000001,42.002,99.9942
389,390,773,1149,3467,159.91,20.5641,69.4359,99.9869
390,391,19059,1065,3526,168.737,81.3195,8.680480000000001,98.1196
391,392,2626,3165,3530,141.915,61.628,28.372,99.8417
392,393,1462,1392,3525,152.55700000000004,67.1253,22.8748,99.549
393,394,816,3223,3536,148.591,39.3699,50.6301,99.9616
394,395,10292,381,3572,152.236,26.543000000000006,63.457,99.9965
395,396,21996,225,3605,337.851,30.0344,59.9656,99.9582
396,397,36177,2065,3646,158.83700000000005,84.3775,5.62253,99.934
397,398,1370,79,3587,336.58,74.6059,15.3941,99.9732
398,399,547,1490,3578,151.79399999999995,73.1304,16.8696,99.9937
399,400,3641,3205,3606,134.702,69.1142,20.8858,99.9353
400,401,539,1555,3613,141.936,36.185,53.815,99.981
401,402,2351,66,3632,336.94199999999995,34.1189,55.8811,99.8875
402,403,7104,975,3687,149.27,0.142647,89.8574,99.9183
403,404,841,2550,3653,117.218,78.0565,11.9435,99.9819
404,405,526,387,3642,343.921,68.6932,21.3068,99.9971
405,406,13441,2482,3752,331.849,13.5873,76.4127,99.5397
406,407,537,3152,3667,137.888,68.5458,21.4542,99.9692
407,408,9645,119,3714,334.83,7.48418,82.5158,99.9101
408,409,45797,3122,3813,339.4380000000001,4.64763,85.3524,99.9009
409,410,16005,2846,3742,123.914,77.6119,12.3881,99.9483
410,411,536,201,3700,337.932,30.3528,59.6472,99.9889
411,412,105385,903,3908,322.221,48.4931,41.5069,98.5738
412,413,1880,51,3762,332.987,6.35909,83.6409,99.9764
413,414,49542,638,3936,328.246,78.7691,11.2309,62.1034
414,415,5257,521,3754,336.055,37.8096,52.1904,99.955
415,416,1855,3258,3761,340.414,4.24996,85.75,99.7725
416,417,14014,396,3802,334.2940000000001,29.7374,60.2626,99.9615
417,418,16028,200,3804,156.601,27.2648,62.7352,99.9636
418,419,1297,769,3749,335.119,42.57,47.43,99.9728
419,420,1098,2397,3784,0.660512,80.5016,9.49838,99.8967
420,421,6144,2544,3814,338.24300000000005,25.4,64.6,99.944
421,422,1148,2964,3820,134.638,77.9575,12.0425,99.9084
422,423,4221,303,3841,337.835,63.8063,26.1937,99.9968
423,424,628,2943,3802,338.255,4.31487,85.6851,99.9043
424,425,6103,514,3838,319.688,61.2764,28.7236,99.9849
425,426,9595,2752,3858,330.971,25.2746,64.7254,99.9796
426,427,7602,104,3871,153.591,30.2719,59.7281,99.7915
427,428,575,650,3817,320.817,58.1203,31.8797,99.9887
428,429,3290,2420,3854,325.763,11.7658,78.2342,99.9761
429,430,7115,2862,3857,150.438,38.7653,51.2347,99.9792
430,431,2157,2660,3856,155.153,66.7239,23.2761,99.8223
431,432,534,3232,3842,352.064,3.04942,86.9506,99.9279
432,433,13846,2980,3927,328.911,32.8229,57.1771,99.9695
433,434,1270,862,3845,153.858,6.42583,83.5742,99.9781
434,435,2661,2355,3865,146.57,60.719,29.281,99.9913
435,436,7663,2593,3881,327.404,10.2732,79.7268,99.9958
436,437,12312,447,3915,146.17,11.826,78.17399999999998,99.9248
437,438,40173,1268,3984,165.58,48.3153,41.6847,99.6505
438,439,3003,2512,3904,9.66901,82.8306,7.16938,99.9254
439,440,44067,303,3993,343.05,58.5972,31.4028,99.9214
440,441,944,3221,3899,340.672,4.86713,85.1329,99.9528
441,442,21770,2439,3983,123.225,81.7766,8.22337,86.5291
442,443,64248,2728,4065,145.424,65.1285,24.8715,99.334
443,444,78858,2986,4090,160.243,7.03413,82.9659,96.982
444,445,11238,136,3966,144.351,45.2883,44.7117,99.8959
445,446,1380,2568,3937,152.872,60.2641,29.7359,99.9855
446,447,572,30,3954,142.76,44.7138,45.2862,99.8994
447,448,3939,3229,4022,166.41,5.33177,84.6682,99.8643
448,449,7661,508,4006,329.032,46.3815,43.6185,99.9846
449,450,8224,2307,4039,327.898,9.36621,80.6338,98.5937
450,451,1693,20,4024,311.249,39.398,50.602,99.8371
451,452,40375,2553,4154,335.548,3.76052,86.2395,99.9617
452,453,5016,93,4044,314.157,38.4859,51.5141,99.9512
453,454,84626,1102,4146,158.145,42.4322,47.5678,99.961
454,455,1523,1331,4045,332.31699999999995,42.7836,47.2164,99.981
455,456,3028,798,4091,159.128,41.2817,48.7183,99.9926
456,457,2457,1357,4089,347.659,67.0067,22.9934,99.96
457,458,13360,2175,4145,348.886,77.8671,12.1329,99.9773
458,459,14006,538,4114,161.966,42.4273,47.5727,99.888
459,460,12444,2413,4171,137.186,68.0334,21.9666,99.6567
460,461,4432,368,4123,255.335,77.6001,12.3999,99.9541
461,462,2116,2280,4115,138.428,66.3324,23.6676,99.9315
462,463,5122,3228,4150,124.284,55.1341,34.8659,99.9729
463,464,618,2670,4135,146.83,63.019,26.981,99.6422
464,465,751,28,4149,340.6690000000001,62.9625,27.0375,99.9634
465,466,3899,1431,4146,323.007,46.6329,43.3671,99.9681
466,467,10432,718,4171,150.35299999999995,44.3939,45.6061,99.8037
467,468,5453,101,4182,315.58,39.2367,50.7633,99.9285
468,469,666,284,4135,147.125,48.4511,41.5489,99.9348
469,470,1189,803,4156,130.474,58.1324,31.8676,99.9896
470,471,14902,477,4184,147.953,45.9272,44.0728,99.7248
471,472,19964,2148,4210,316.011,4.89679,85.1032,99.9343
472,473,1622,248,4185,305.522,50.69600000000001,39.304,99.9023
473,474,6583,2357,4205,348.584,80.4823,9.51774,99.9713
474,475,1525,3283,4218,121.161,56.6113,33.3887,99.7319
475,476,855,801,4188,156.259,42.6211,47.3789,99.9739
476,477,5952,1753,4213,150.643,38.3455,51.6545,99.9883
477,478,2080,854,4207,148.861,44.0337,45.9663,99.9152
478,479,1246,300,4198,258.991,76.9323,13.0677,99.9555
479,480,1215,186,4216,333.24,44.32,45.68,99.837
480,481,1241,3015,4263,343.903,63.2427,26.7573,99.924
481,482,566,2958,4264,347.168,62.662,27.338,99.9437
