,Grain No.,Size [Pixel],center x-coordinate,center y-coordinate,mean azimuth [degree],mean latitude [degree],mean colatitude [degree],Regelungsgrad [%]
0,1,38720,316,73,218.398,52.3116,37.6884,99.9109
1,2,3477,128,50,248.803,44.3918,45.6082,99.9766
2,3,612,678,27,359.684,82.634,7.36598,99.9808
3,4,7087,956,55,228.555,80.0375,9.96253,99.8944
4,5,46629,558,167,63.2287,26.9877,63.0123,94.7778
5,6,7140,1255,76,205.443,77.1508,12.8492,99.9641
6,7,581,1389,28,206.072,79.532,10.468,99.8979
7,8,14357,1476,103,49.1477,56.672,33.328,99.7792
8,9,4046,866,60,342.13,82.94,7.06003,99.9817
9,10,3927,1169,60,54.2723,9.8156,80.1844,99.9738
10,11,21176,755,107,51.1025,4.06871,85.9313,99.623
11,12,582,1749,33,237.167,8.29646,81.7035,99.9524
12,13,46270,1946,136,27.2935,78.8482,11.1518,99.8297
13,14,3374,2249,64,55.619,22.1082,67.8918,99.961
14,15,4658,2358,61,238.915,66.2283,23.7717,99.9497
15,16,14482,1116,114,243.629,67.5791,22.4209,99.9469
16,17,18778,1307,134,51.6417,31.14,58.86,99.9654
17,18,1072,1552,52,33.7628,81.1267,8.873289999999997,99.9741
18,19,642,1701,51,59.4114,0.412193,89.5878,99.9937
19,20,5157,1639,79,79.2792,8.19488,81.8051,99.9789
20,21,533,669,60,247.92,69.3659,20.6341,99.9882
21,22,4376,2139,88,244.457,41.9701,48.0299,99.5083
22,23,19680,2646,101,238.688,73.5787,16.4213,99.8365
23,24,10845,2964,92,226.325,4.33676,85.6632,99.136
24,25,879,2517,69,245.512,14.0604,75.9396,99.8899
25,26,28409,2762,178,50.1842,14.8145,75.1855,99.7041
26,27,6500,3320,104,59.0108,33.1362,56.8638,99.8649
27,28,9564,3119,117,54.4668,64.9618,25.0382,99.9635
28,29,678,3226,80,49.9874,33.9764,56.0236,99.9931
29,30,2968,3201,108,58.2181,15.3343,74.6657,99.9759
30,31,989,1699,87,291.253,84.4856,5.51438,99.9901
31,32,508,2071,83,250.242,64.1173,25.8827,99.9167
32,33,1371,2300,94,244.283,14.3512,75.6488,99.9953
33,34,4218,2483,111,239.204,12.5855,77.4145,99.9446
34,35,1007,1575,91,62.5175,26.4865,63.5135,99.9898
35,36,6188,985,132,234.307,6.45905,83.541,99.9831
36,37,4888,113,113,238.897,26.751,63.249,99.9654
37,38,13276,2390,145,39.0702,8.71368,81.2863,99.9954
38,39,25519,2183,200,235.813,66.6869,23.3131,99.8366
39,40,23627,3264,209,53.6237,35.2157,54.7843,99.9027
40,41,131403,823,362,241.329,40.3377,49.6623,99.7953
41,42,1399,3441,126,61.5684,13.4619,76.5381,99.7529
42,43,2872,2284,148,242.413,6.5251800000000015,83.4748,99.9164
43,44,2483,2922,136,45.881,36.8503,53.1497,99.9879
44,45,11554,132,199,45.919,34.8846,55.1154,99.9748
45,46,87311,1535,323,67.1812,25.9317,64.0683,99.3603
46,47,1966,3475,166,58.7668,17.6478,72.3522,99.846
47,48,26978,1775,245,228.777,84.1765,5.82346,99.9081
48,49,15679,2989,201,235.277,26.2867,63.7133,99.5023
49,50,7928,2553,193,66.2615,18.8922,71.1078,99.8624
50,51,9762,617,200,343.285,81.3938,8.60624,99.9724
51,52,8877,235,216,254.969,80.1591,9.84092,99.9809
52,53,13885,363,221,48.8352,85.1631,4.8368699999999984,99.9139
53,54,1015,2890,171,240.193,66.7298,23.2702,99.9895
54,55,1002,433,190,322.14,83.2342,6.765789999999999,99.9825
55,56,1645,1432,180,47.4704,87.1257,2.87433,99.9794
56,57,5835,1089,206,353.375,87.4319,2.56811,99.968
57,58,648,3391,187,249.562,65.6122,24.3878,99.9827
58,59,7967,2353,225,63.5524,20.1085,69.8915,99.9329
59,60,13904,1303,272,235.322,2.52098,87.479,99.9774
60,61,5607,3381,241,260.628,68.0718,21.9282,99.9593
61,62,2919,701,217,224.832,4.17732,85.8227,99.9946
62,63,672,3427,209,268.672,68.6117,21.3883,99.7162
63,64,19632,3117,293,321.964,75.4366,14.5634,99.8589
64,65,2642,3473,240,62.0688,18.8737,71.1263,99.904
65,66,19297,2677,328,325.868,76.546,13.454,99.9637
66,67,1720,1194,236,37.0256,79.1401,10.8599,99.972
67,68,12918,1163,299,231.882,12.5968,77.4032,98.6943
68,69,17535,2942,309,43.481,21.9604,68.0396,99.8562
69,70,1004,2445,258,233.866,60.4712,29.5288,99.9725
70,71,4630,2192,282,241.873,26.4452,63.5548,99.977
71,72,21393,2546,336,75.24,65.1765,24.8235,99.8977
72,73,9673,253,308,226.363,65.2756,24.7244,99.958
73,74,516,1968,261,59.958,4.14663,85.8534,99.9957
74,75,1184,1993,285,52.3632,8.08164,81.9184,99.7585
75,76,8543,1920,312,72.3654,51.5781,38.4219,99.9458
76,77,2100,137,287,48.8947,7.66775,82.3323,99.9964
77,78,24183,2330,351,235.307,2.14439,87.8556,99.3373
78,79,3672,3462,316,213.516,63.592,26.408,99.807
79,80,1414,446,293,75.467,84.8354,5.16456,99.9912
80,81,998,344,293,243.376,79.12899999999998,10.871,99.9917
81,82,1416,2803,311,273.535,79.1553,10.8447,99.9935
82,83,6076,2054,325,80.464,54.8773,35.1227,99.9588
83,84,20101,3354,360,207.657,59.58,30.42,99.9721
84,85,1829,3230,304,53.0466,8.68524,81.3148,99.9823
85,86,8146,2147,345,63.4914,28.7864,61.2136,99.9722
86,87,79135,280,451,236.246,49.0055,40.9945,97.9101
87,88,30488,2875,416,267.866,78.6496,11.3504,99.9426
88,89,15440,515,393,63.4926,43.9888,46.0112,99.6655
89,90,20925,3148,417,254.036,65.6051,24.3949,99.9408
90,91,754,1522,340,74.5902,27.1835,62.8165,99.9207
91,92,3073,2446,372,76.5874,66.9679,23.0321,99.9871
92,93,944,1203,370,260.838,61.102,28.898000000000003,99.9836
93,94,524,673,364,236.993,62.8167,27.1833,99.9859
94,95,7956,1886,425,46.7958,69.27199999999999,20.728,99.8683
95,96,3328,2217,408,244.02,36.9325,53.0675,99.9607
96,97,78804,1298,569,236.389,13.6421,76.3579,99.0313
97,98,3195,1146,397,4.70777,83.9728,6.02716,99.9249
98,99,19319,2100,453,245.092,37.1877,52.8123,99.9722
99,100,2459,1799,411,237.631,27.4781,62.5219,99.9756
100,101,10327,3414,499,53.5871,32.2724,57.7276,99.8715
101,102,6254,1712,473,56.5139,6.51115,83.4888,99.9186
102,103,508,58,442,132.203,11.61,78.39,98.1884
103,104,4894,2583,449,91.0797,52.4966,37.5034,99.9175
104,105,2731,1138,468,226.199,80.1943,9.80566,99.5929
105,106,55356,3295,630,229.11900000000003,55.7821,34.2179,96.5604
106,107,28850,970,500,227.539,66.5347,23.4653,99.2048
107,108,2984,2466,446,148.579,75.9362,14.0638,99.8802
108,109,1033,3371,439,54.2102,51.8571,38.1429,99.9391
109,110,25051,2746,512,53.1433,53.0802,36.9198,99.6445
110,111,3954,2391,475,230.718,12.9869,77.0131,99.9256
111,112,1091,835,454,189.422,81.791,8.209,99.939
112,113,567,878,450,194.562,79.5217,10.4783,99.8907
113,114,4384,2274,487,80.0594,62.1151,27.8849,99.8947
114,115,823,1984,468,58.4495,6.22384,83.7762,99.9006
115,116,1382,1885,479,229.831,55.3266,34.6734,99.9799
116,117,2715,542,484,55.2227,0.252747,89.7473,99.9691
117,118,6662,471,523,41.4517,45.1199,44.8801,99.8072
118,119,16904,2438,566,73.4085,52.2446,37.7554,98.8002
119,120,13772,1974,546,121.762,86.3027,3.69729,99.5549
120,121,26774,1548,597,11.5023,68.6274,21.3726,99.8821
121,122,13710,3111,545,220.227,45.5585,44.4415,99.1475
122,123,2729,1663,532,11.3217,70.0606,19.9394,99.358
123,124,5892,1786,530,128.066,85.6916,4.30839,99.4717
124,125,14126,2598,565,250.077,46.7874,43.2126,99.8663
125,126,1598,3024,521,249.911,64.1984,25.8016,99.8543
126,127,2649,2949,544,236.032,51.7353,38.2647,99.1819
127,128,5494,2193,548,83.3121,62.9497,27.0503,98.7616
128,129,1716,1105,533,64.8595,37.7676,52.2324,99.5829
129,130,9992,568,600,238.857,69.7016,20.2984,99.9562
130,131,7788,2859,597,58.549,63.2985,26.7015,99.8714
131,132,3520,1150,575,246.844,37.6233,52.3767,99.6905
132,133,30297,149,687,62.5547,30.4808,59.5192,99.8298
133,134,2123,2117,571,48.6229,64.5994,25.4006,99.9599
134,135,12533,286,596,34.8654,10.4287,79.5713,99.9912
135,136,53234,2243,681,256.351,49.2751,40.7249,99.8661
136,137,926,882,586,247.83,48.9986,41.0014,99.987
137,138,7236,983,604,65.7051,29.8593,60.1407,99.5455
138,139,11690,1103,650,60.8436,25.776,64.22399999999999,99.9675
139,140,953,1846,608,112.894,83.9479,6.05207,99.992
140,141,3559,825,616,249.651,48.9428,41.0572,99.9788
141,142,4715,1681,610,58.5683,61.8606,28.1394,99.9037
142,143,7461,3176,637,237.211,37.5674,52.4326,99.9804
143,144,3476,2965,625,64.10300000000001,58.9166,31.0834,99.5021
144,145,9806,1776,644,53.5619,16.2997,73.7003,99.9908
145,146,60591,2698,794,244.265,49.9167,40.0833,99.8012
146,147,541,481,603,53.9681,48.1509,41.8491,99.8489
147,148,4307,256,651,6.18649,87.4061,2.59393,99.9612
148,149,1083,2498,623,254.096,1.71812,88.2819,99.573
149,150,1892,2087,626,276.209,64.9389,25.0611,99.9617
150,151,6774,750,644,231.313,68.2686,21.7314,99.9282
151,152,1007,3040,631,220.02,46.1546,43.8454,99.9644
152,153,3997,2800,655,77.8637,46.6574,43.3426,99.9823
153,154,16928,914,698,53.3959,11.3883,78.6117,99.7975
154,155,48939,507,758,60.625,4.08904,85.911,99.7422
155,156,4899,3404,674,35.2382,46.027,43.973,99.9575
156,157,3050,3104,658,47.3167,39.7248,50.2752,99.9941
157,158,28402,700,764,56.6528,23.2822,66.7178,99.7105
158,159,755,3457,658,253.587,20.4767,69.5233,99.912
159,160,1528,2907,658,45.9875,47.2133,42.7867,99.9592
160,161,2032,1027,667,258.36400000000003,76.2326,13.7674,99.9858
161,162,5026,2603,688,64.082,58.5262,31.4738,99.937
162,163,2402,374,695,57.0517,49.1777,40.8223,99.953
163,164,44853,3119,803,61.8322,19.6917,70.3083,99.9249
164,165,999,2064,685,351.001,88.6667,1.33332,99.9956
165,166,2333,1935,688,256.591,67.9996,22.0004,99.9865
166,167,3594,821,712,38.5156,24.6226,65.3774,99.9552
167,168,3423,1877,703,53.9153,12.8146,77.1854,99.9977
168,169,4194,1472,699,232.574,0.609749,89.3903,99.9716
169,170,2301,2007,714,199.453,88.3571,1.64288,99.9736
170,171,2509,2854,696,233.574,63.3928,26.6072,99.9758
171,172,31917,2479,780,251.864,1.81199,88.18799999999997,99.5556
172,173,4871,1574,720,243.971,0.193497,89.8065,99.9701
173,174,659,3461,712,248.973,19.3893,70.6107,99.5431
174,175,15902,2929,764,55.2282,1.98654,88.0135,99.9663
175,176,1914,1043,710,247.391,56.7386,33.2614,99.9864
176,177,5381,1808,735,236.997,62.9912,27.0088,99.9788
177,178,6006,3186,734,72.8,22.8918,67.1082,99.643
178,179,2299,325,722,229.83900000000003,61.2491,28.7509,99.9932
179,180,6427,259,762,50.0954,11.8447,78.1553,99.9922
180,181,1012,1659,712,51.1392,31.1966,58.8034,99.9892
181,182,12054,1029,765,242.887,71.5239,18.4761,99.7407
182,183,1474,1719,730,56.1079,13.0157,76.9843,99.9841
183,184,856,1405,726,258.203,74.3772,15.6228,99.9926
184,185,608,3469,747,247.279,19.083,70.917,99.8623
185,186,3129,1322,750,152.268,81.3845,8.61555,99.9663
186,187,1654,73,754,60.2571,5.3392,84.6608,99.9401
187,188,882,1436,746,255.042,73.6346,16.3654,99.9796
188,189,11833,3406,800,250.981,19.64,70.36,99.9678
189,190,589,855,755,57.7154,19.136,70.86399999999998,99.7224
190,191,4569,1497,766,50.7487,29.4844,60.5156,99.8531
191,192,33351,1973,833,44.7591,28.6052,61.3948,99.7919
192,193,4466,1397,776,50.0738,27.3009,62.6991,99.9938
193,194,38083,1717,856,100.838,88.0938,1.90619,99.7815
194,195,548,2370,762,63.2014,20.4755,69.5245,99.9883
195,196,6406,2299,803,250.276,37.7579,52.2421,99.9532
196,197,2872,337,788,68.7771,69.1935,20.8066,99.9869
197,198,33421,1298,898,237.998,28.3883,61.6117,99.9346
198,199,5643,1375,832,54.8023,27.1318,62.8682,99.9877
199,200,9314,864,862,43.92,19.0104,70.9896,99.5403
200,201,1198,1814,799,70.4443,77.9465,12.0535,99.9859
201,202,1003,1124,796,51.4854,6.44833,83.5517,99.9941
202,203,5211,2374,855,59.5246,37.7397,52.2603,99.9612
203,204,744,1291,809,248.889,13.5028,76.4972,99.9794
204,205,3042,1457,847,53.5001,3.19513,86.8049,99.9822
205,206,3344,2148,828,65.4838,17.0253,72.9747,99.9873
206,207,2729,2229,836,241.547,57.9514,32.0486,99.9785
207,208,551,2858,820,46.7103,52.8749,37.1251,99.9898
208,209,3405,180,834,76.5629,67.8874,22.1126,99.9804
209,210,1214,1315,831,62.9354,14.8883,75.1117,99.9671
210,211,855,288,823,59.0073,32.4992,57.5008,99.9716
211,212,819,376,823,49.5021,57.0445,32.9555,99.9912
212,213,1385,1115,837,238.229,70.6448,19.3552,99.9938
213,214,5500,1014,880,209.277,86.1016,3.89838,99.6068
214,215,6971,1519,869,3.20994,76.8575,13.1425,99.9699
215,216,1858,2924,832,238.029,22.9092,67.0908,99.9917
216,217,506,932,835,238.345,69.632,20.368,99.9144
217,218,20277,746,902,66.8648,5.56331,84.4367,99.9536
218,219,2228,244,858,230.652,41.2258,48.7742,99.8766
219,220,6536,3004,874,225.095,71.0452,18.9548,99.8235
220,221,3327,2433,899,73.9277,4.42783,85.5722,99.9814
221,222,2258,88,873,53.9228,65.0337,24.9663,99.944
222,223,8406,359,895,228.35,40.9746,49.0254,99.9819
223,224,39532,2167,986,55.9193,11.9684,78.0316,99.9389
224,225,19574,2901,942,226.318,50.4885,39.5115,99.9692
225,226,2339,472,884,229.442,61.848,28.152,98.5196
226,227,1101,1076,876,52.2795,8.66432,81.3357,99.9821
227,228,9576,2312,921,66.7236,18.3169,71.6831,99.9778
228,229,3525,2056,899,81.959,77.7317,12.2683,99.9636
229,230,571,956,887,55.8795,17.4741,72.5259,99.8105
230,231,13527,166,922,54.6292,35.8028,54.1972,99.6936
231,232,2014,274,911,228.818,60.5793,29.4207,99.9643
232,233,11843,498,943,59.9138,59.7216,30.2784,99.9538
233,234,14413,3375,934,57.6497,10.593,79.407,99.9804
234,235,5694,1597,931,259.004,71.436,18.564,99.9868
235,236,1498,3278,910,225.783,73.9102,16.0898,99.9863
236,237,14810,1942,1008,48.6195,19.1602,70.8398,99.703
237,238,8888,1667,967,237.234,43.0186,46.9814,99.9376
238,239,17449,2563,969,61.7183,44.5738,45.4262,99.8205
239,240,684,607,917,59.0567,22.7627,67.2373,99.9902
240,241,44555,3119,1018,238.69,62.5719,27.4281,99.2815
241,242,58898,1025,1052,243.143,27.0143,62.9857,99.6988
242,243,13002,1530,1008,32.2541,82.1148,7.885219999999999,98.8813
243,244,595,2116,929,93.8182,77.8703,12.1297,99.9809
244,245,733,1544,941,29.3212,76.6764,13.3236,99.9764
245,246,3118,1089,961,54.551,31.6015,58.3985,99.9787
246,247,52044,2735,1088,239.459,28.0287,61.9713,83.8168
247,248,40492,732,1036,54.6297,31.0142,58.9858,97.8777
248,249,1444,258,969,57.4866,35.6038,54.3962,99.9852
249,250,1387,1221,970,67.7559,20.2419,69.7581,99.9572
250,251,1428,373,966,53.2548,30.3998,59.6002,99.9824
251,252,3591,79,1005,47.1768,62.7938,27.2062,99.2062
252,253,7161,2428,997,239.52,62.40600000000001,27.594,99.6398
253,254,3236,1840,976,52.2453,31.6995,58.3005,99.9873
254,255,3531,311,996,54.5604,24.2076,65.7924,99.9385
255,256,1157,546,989,44.6822,43.1264,46.8736,99.9706
256,257,8017,199,1012,62.5445,27.5354,62.4646,99.7946
257,258,8798,3320,1017,78.1998,62.8978,27.1022,99.8666
258,259,12277,401,1044,35.7853,41.0031,48.9969,99.9633
259,260,16858,1323,1045,46.5035,10.6763,79.3237,98.7518
260,261,14808,2324,1057,229.885,5.888730000000002,84.1113,99.9861
261,262,9271,1842,1038,62.3371,20.8882,69.1118,99.8342
262,263,1980,1434,1020,49.7999,9.64088,80.3591,99.9467
263,264,2674,1199,1058,2.9911,77.9717,12.0283,99.8032
264,265,3190,1713,1039,228.293,34.5461,55.4539,99.9425
265,266,7599,473,1114,248.213,46.7555,43.2445,99.7125
266,267,2029,533,1048,67.1861,65.0987,24.9013,99.9645
267,268,1258,2530,1046,261.105,0.6287,89.3713,99.9445
268,269,1041,3413,1048,48.3946,8.71691,81.2831,99.9424
269,270,3133,2989,1077,64.4012,37.5003,52.4997,98.5926
270,271,9876,2009,1154,237.722,21.5928,68.4072,99.2919
271,272,43002,354,1206,235.314,62.7789,27.2211,99.6667
272,273,2482,2480,1064,238.056,13.0921,76.9079,99.8202
273,274,2928,213,1068,46.566,58.983,31.017,99.9963
274,275,988,3447,1061,54.9347,9.14297,80.857,99.6888
275,276,4713,3302,1088,238.402,17.8115,72.1885,99.9317
276,277,706,133,1061,213.959,35.092,54.908,99.9865
277,278,1467,1653,1066,325.161,69.6653,20.3347,99.9864
278,279,694,263,1070,221.955,50.6874,39.3126,99.4142
279,280,518,593,1071,246.939,13.6472,76.3528,99.9322
280,281,3039,2556,1093,238.385,1.32797,88.67200000000003,99.9758
281,282,1948,1879,1086,66.0351,43.173,46.827,99.9819
282,283,6237,2413,1109,237.312,34.0657,55.9343,99.9514
283,284,17723,1429,1176,284.217,66.4038,23.5962,99.8522
284,285,7547,2828,1121,55.1184,36.9091,53.0909,99.9728
285,286,53944,1644,1170,236.603,35.6568,54.3432,99.815
286,287,615,81,1085,40.079,58.0214,31.9786,99.955
287,288,1253,860,1100,233.788,12.9569,77.0431,99.9917
288,289,6164,3397,1121,56.6327,22.8785,67.1215,99.9813
289,290,3197,677,1115,71.8203,5.03867,84.9613,99.9934
290,291,512,715,1090,238.746,67.5879,22.4121,99.9913
291,292,965,631,1112,239.528,68.5835,21.4164,99.9723
292,293,1479,139,1106,46.8619,41.7976,48.2024,99.9689
293,294,30432,2092,1246,56.74100000000001,21.8349,68.1651,99.8656
294,295,7892,1221,1132,37.8871,66.2018,23.7982,99.9017
295,296,16215,2221,1161,243.664,14.7285,75.2715,99.9322
296,297,2559,197,1128,215.231,41.2608,48.7392,99.9921
297,298,2098,102,1128,51.0437,43.8021,46.1979,99.6115
298,299,9759,1909,1155,56.8778,19.6428,70.3572,99.9444
299,300,13984,2443,1200,57.6276,50.2749,39.7251,99.8005
300,301,2866,577,1153,58.4258,16.0398,73.9602,99.9625
301,302,538,3463,1155,60.8099,24.6573,65.3427,99.9119
302,303,2720,835,1162,250.21,25.5852,64.4148,99.9856
303,304,1074,3292,1138,247.132,24.52,65.48,99.9609
304,305,12165,3335,1245,62.19,22.2146,67.7854,99.9155
305,306,14160,1331,1212,219.437,21.9999,68.0001,99.9681
306,307,1426,3177,1160,59.8956,27.7215,62.2785,99.9794
307,308,2633,531,1180,238.439,68.8462,21.1538,99.9844
308,309,822,2538,1164,246.306,80.0772,9.92285,99.9382
309,310,19044,2553,1275,241.012,78.9315,11.0685,99.8663
310,311,11042,158,1200,70.419,44.1756,45.8244,99.8936
311,312,10696,3102,1199,330.821,84.4626,5.53736,99.9525
312,313,7627,1126,1207,216.627,17.7969,72.2031,99.9851
313,314,2549,2903,1180,196.821,71.9275,18.0725,99.9888
314,315,2918,3215,1182,247.07,23.8858,66.1142,99.9189
315,316,3563,2788,1178,214.543,65.1928,24.8072,99.9869
316,317,553,3008,1173,202.961,73.8892,16.1108,99.9485
317,318,2061,2339,1185,250.061,41.6624,48.3376,99.9848
318,319,2215,909,1176,156.35399999999996,87.3962,2.60376,99.9302
319,320,1445,656,1174,245.639,73.1672,16.8328,99.9923
320,321,4630,3398,1216,85.0281,62.9104,27.0896,99.8864
321,322,1256,780,1185,238.798,14.2167,75.7833,99.9944
322,323,60667,616,1350,66.1254,47.6124,42.3876,99.7755
323,324,8152,973,1261,96.6522,82.1686,7.83135,99.976
324,325,2479,1882,1229,55.5192,62.5174,27.4826,99.9317
325,326,1140,862,1223,56.2209,1.26702,88.73299999999998,99.993
326,327,3210,1063,1237,74.88,60.4262,29.5738,99.9805
327,328,1104,1187,1218,68.1155,39.9432,50.0568,99.9458
328,329,21974,1257,1311,57.4832,10.6393,79.3607,99.9289
329,330,5315,2222,1248,233.256,62.7736,27.2264,99.9945
330,331,21775,2814,1280,59.0115,34.6069,55.3931,99.9655
331,332,4039,789,1256,43.5354,21.2231,68.7769,99.6678
332,333,14457,3002,1264,239.511,29.2731,60.7269,99.8668
333,334,869,1768,1227,246.767,21.7667,68.2333,99.9351
334,335,1579,1686,1237,250.092,24.0022,65.9978,99.993
335,336,3405,3190,1258,245.837,19.9618,70.0382,99.956
336,337,1104,3229,1251,163.213,77.0285,12.9715,99.9689
337,338,4400,105,1260,208.179,29.88,60.12,99.9903
338,339,1131,3269,1236,245.161,24.0567,65.9433,99.9931
339,340,647,892,1254,243.538,65.6229,24.3771,99.9891
340,341,2869,1642,1272,76.0135,39.4354,50.5646,99.9758
341,342,5592,2297,1288,56.1869,29.4108,60.5892,99.9748
342,343,1830,3419,1282,57.6078,23.6992,66.3008,99.9806
343,344,14579,1743,1311,54.6264,26.8011,63.1989,99.9894
344,345,24356,3215,1348,49.6892,52.3033,37.6967,99.92
345,346,2031,222,1281,48.4887,26.1094,63.8906,99.9571
346,347,1662,3448,1294,64.1141,25.3188,64.6812,99.954
347,348,1632,1842,1281,46.2218,43.4063,46.5937,99.9917
348,349,1066,3259,1281,238.534,34.3061,55.6939,99.9985
349,350,2069,1120,1296,237.173,10.5084,79.4916,99.9845
350,351,245108,1842,1789,252.282,39.4343,50.5657,98.4902
351,352,98624,2553,1437,223.133,30.7874,59.2126,99.9074
352,353,29206,913,1361,234.481,12.86,77.14,99.5475
353,354,83456,1363,1542,243.23,9.93625,80.0638,96.4251
354,355,1722,736,1314,71.0309,41.1884,48.8116,99.9657
355,356,975,1072,1295,222.227,37.4899,52.5101,99.9796
356,357,13319,219,1374,69.3863,83.4912,6.50882,99.7866
357,358,641,342,1302,67.1608,78.8091,11.1909,99.9845
358,359,10051,1638,1362,56.7869,31.1222,58.8778,99.8438
359,360,9031,138,1339,290.16,70.9622,19.0378,99.9294
360,361,8110,3058,1343,76.3924,56.56,33.44,99.9477
361,362,3752,2927,1341,234.971,8.16052,81.8395,99.9876
362,363,1388,1549,1330,250.421,24.2811,65.7189,99.9527
363,364,3517,2250,1336,68.9378,43.4816,46.5184,99.9749
364,365,1438,1171,1330,243.925,73.6474,16.3526,99.8869
365,366,560,933,1327,237.833,64.5255,25.4745,99.9774
366,367,2141,1377,1347,66.3911,64.3565,25.6435,99.9589
367,368,54197,358,1561,50.4699,19.6817,70.3183,99.3968
368,369,1936,2008,1361,234.166,30.0237,59.9763,99.691
369,370,659,3422,1350,50.3302,69.7896,20.2104,99.9856
370,371,1170,1147,1352,239.993,73.0251,16.9749,99.9802
371,372,7919,2184,1385,233.025,59.7127,30.2873,99.9674
372,373,2857,703,1365,71.7136,44.3458,45.6542,99.555
373,374,3364,1110,1375,64.1958,36.8902,53.1098,99.7407
374,375,1258,486,1374,59.8656,22.8491,67.1509,99.8388
375,376,1348,2975,1381,73.7853,56.4246,33.5754,99.6816
376,377,4157,2062,1391,229.46400000000003,28.217,61.783,99.9372
377,378,824,2885,1376,238.81,25.504,64.49600000000001,99.9881
378,379,549,3447,1388,226.997,38.5541,51.4459,99.8882
379,380,764,457,1390,70.3196,46.0822,43.9178,99.9816
380,381,8707,3007,1460,239.087,27.2748,62.7252,99.8847
381,382,599,705,1395,68.6358,47.8282,42.1718,99.9463
382,383,189555,711,1767,63.5012,17.7814,72.2186,99.7276
383,384,2265,1710,1414,231.198,27.957,62.043,99.9587
384,385,15810,2863,1455,248.508,75.9662,14.0338,99.8268
385,386,1359,3366,1400,56.7053,73.1902,16.8098,99.9713
386,387,4555,1362,1453,51.3174,60.9765,29.0235,99.9245
387,388,10151,1197,1453,234.5,60.0472,29.9528,99.947
388,389,63554,2202,1558,50.534,29.793000000000006,60.207,99.9005
389,390,3790,3127,1430,244.181,29.927,60.073,99.9826
390,391,25761,258,1509,63.9489,42.743,47.257,99.7184
391,392,3323,1985,1437,216.578,88.2225,1.77751,99.9771
392,393,818,993,1421,70.8366,66.7935,23.2065,99.9269
393,394,888,2109,1420,240.605,17.0867,72.9133,99.9927
394,395,31840,3349,1576,62.3552,49.2372,40.7628,99.8526
395,396,2972,1098,1430,62.6637,11.0974,78.9026,99.9754
396,397,3677,1309,1434,84.3679,44.8756,45.1244,99.9645
397,398,5968,485,1456,202.342,32.5103,57.4897,99.9283
398,399,6188,3239,1452,229.062,11.1961,78.8039,99.9704
399,400,1070,3399,1433,58.2784,59.018,30.982,99.99
400,401,1214,113,1458,40.5341,30.8685,59.1315,99.9783
401,402,17575,2026,1515,62.1982,18.5031,71.4969,99.6814
402,403,2868,1503,1470,67.0183,37.4064,52.5936,99.9467
403,404,574,1621,1452,243.418,22.4159,67.5841,99.9575
404,405,585,1040,1462,77.7222,63.8807,26.1193,99.9665
405,406,15863,3114,1515,75.8526,50.2448,39.7552,99.5872
406,407,910,77,1491,293.831,70.7574,19.2426,98.7119
407,408,5849,1589,1515,245.159,28.1752,61.8248,99.8531
408,409,8095,1099,1527,66.4685,60.8678,29.1322,98.9897
409,410,1256,1041,1512,66.9434,62.1938,27.8062,98.5272
410,411,2648,528,1517,56.9954,37.6569,52.3431,99.8282
411,412,14244,3242,1589,244.547,8.406039999999999,81.594,99.9281
412,413,12563,2935,1567,68.0306,51.8492,38.1508,98.7438
413,414,1308,2403,1529,70.1236,30.533,59.467,99.3229
414,415,4158,2799,1550,71.4413,54.1053,35.8947,98.7312
415,416,691,465,1529,204.436,42.999,47.00100000000001,99.9443
416,417,7990,552,1596,69.6934,51.7285,38.2715,99.8988
417,418,33458,1602,1678,254.106,60.1909,29.8091,99.8504
418,419,5005,2610,1590,279.72700000000003,70.3726,19.6274,99.8915
419,420,72085,999,1713,50.6648,66.3306,23.6694,99.8424
420,421,1216,473,1569,251.723,49.5297,40.4703,99.7482
421,422,37744,159,1731,73.1591,39.9297,50.0703,99.8535
422,423,23021,2788,1658,183.911,81.5039,8.49611,99.9008
423,424,2519,3146,1595,50.839,17.5848,72.4152,99.9879
424,425,16454,3070,1674,68.6227,28.7307,61.2693,99.9072
425,426,10190,2413,1636,62.5697,1.6439099999999998,88.3561,99.9289
426,427,508,466,1611,59.9772,37.245,52.755,99.7668
427,428,982,78,1617,70.2573,39.4093,50.5907,99.9781
428,429,679,1685,1624,64.613,6.8489,83.1511,99.958
429,430,3493,2251,1644,249.733,82.2054,7.794580000000002,99.9687
430,431,2523,3136,1641,234.858,10.5205,79.4795,99.9898
431,432,21028,2587,1725,260.539,70.6772,19.3228,99.9434
432,433,60567,2850,1794,261.22700000000003,66.0302,23.9698,99.818
433,434,4471,1423,1683,46.3532,63.2977,26.7023,99.9717
434,435,111256,2251,1872,64.4999,54.0347,35.9653,72.5566
435,436,8065,3264,1739,41.7573,39.333,50.667,99.9628
436,437,10006,1504,1752,259.291,41.1328,48.8672,99.898
437,438,1138,3414,1706,53.62300000000001,2.76404,87.236,99.9756
438,439,1011,492,1696,263.129,49.1454,40.8546,99.967
439,440,18438,3206,1788,214.724,62.5929,27.4071,99.9528
440,441,4436,2461,1727,75.0154,24.5197,65.4803,99.1627
441,442,20996,369,1823,250.383,50.8132,39.1868,99.9142
442,443,2855,453,1736,251.529,3.34067,86.6593,99.8051
443,444,1483,1299,1740,61.9316,55.9697,34.0303,99.992
444,445,3654,1209,1751,8.87991,80.5176,9.4824,99.9056
445,446,2074,1351,1755,48.2228,63.4007,26.5993,99.9846
446,447,656,3328,1733,59.2349,13.2405,76.7595,99.9964
447,448,10931,1467,1813,63.9451,56.651,33.349000000000004,99.771
448,449,810,393,1746,246.973,66.4434,23.5566,99.9788
449,450,5276,3398,1794,228.163,75.4999,14.5001,99.9938
450,451,1014,2696,1750,145.696,84.0897,5.91029,99.9749
451,452,1777,2638,1769,246.903,23.5664,66.4336,99.9401
452,453,4929,1277,1797,240.631,5.44611,84.5539,99.9933
453,454,4806,3336,1806,240.925,8.800419999999997,81.1996,99.9585
454,455,4800,466,1805,246.072,67.1004,22.8996,99.7876
455,456,74473,1105,1940,68.3627,0.992355,89.0076,99.8747
456,457,106834,3032,1977,83.3918,36.4371,53.5629,98.9974
457,458,8213,106,1882,246.55,9.27272,80.7273,99.937
458,459,1487,2605,1819,245.616,25.4566,64.5434,99.974
459,460,3207,1345,1851,66.5383,1.6836400000000002,88.3164,99.9919
460,461,9749,2492,1855,216.97,77.5748,12.4252,99.8378
461,462,3424,1412,1850,57.221,17.6816,72.3184,99.9848
462,463,1839,283,1853,69.12,18.8678,71.1322,99.9951
463,464,2938,214,1870,245.676,9.07002,80.93,99.9964
464,465,37955,1560,1970,253.87,25.4772,64.5228,99.7951
465,466,1812,3397,1890,242.426,15.3964,74.6036,99.9875
466,467,113459,2648,2058,245.992,27.8596,62.1404,99.7977
467,468,4163,936,1900,55.8201,44.6787,45.3213,99.9825
468,469,27246,3279,2021,42.9722,36.5811,53.4189,99.8222
469,470,510,1302,1887,253.277,75.6981,14.3019,99.8486
470,471,3600,274,1908,228.443,70.9899,19.0101,99.9609
471,472,900,3429,1904,243.493,15.7832,74.2168,99.9531
472,473,4237,878,1936,58.9694,17.4127,72.5873,99.9898
473,474,2765,1342,1937,93.8393,40.118,49.882,99.948
474,475,3295,1413,1926,90.335,40.3363,49.6637,99.9793
475,476,3542,1698,1943,243.71,57.8617,32.1383,99.9729
476,477,625,66,1912,79.97800000000002,38.053,51.947,99.9791
477,478,2204,193,1921,32.516,33.2284,56.7716,99.9873
478,479,18210,304,1972,242.337,52.1006,37.8994,98.825
479,480,4143,1887,1964,253.204,25.611,64.389,99.992
480,481,893,62,1950,81.1816,37.9351,52.0649,99.9874
481,482,8547,1996,2050,63.4339,47.8873,42.1127,99.6751
482,483,634,545,1961,263.483,35.4559,54.5441,99.9206
483,484,1718,3382,1978,35.2831,18.000999999999994,71.999,99.9842
484,485,537,3230,1960,249.586,23.2287,66.7713,99.9825
485,486,6785,2026,1989,249.556,10.6604,79.3396,99.967
486,487,10941,137,2027,50.9111,3.81837,86.1816,99.9813
487,488,1446,1736,1998,255.223,21.5122,68.4878,99.9113
488,489,1692,61,2014,58.3957,41.9802,48.0198,99.6856
489,490,5377,1318,2019,279.208,72.3711,17.6289,98.2935
490,491,524,1416,1996,252.317,73.6516,16.3484,99.9737
491,492,21822,558,2121,51.5975,76.8785,13.1215,99.7926
492,493,21729,3350,2149,57.5599,31.9243,58.0757,99.9805
493,494,1676,1209,2023,65.6031,56.9863,33.0137,99.2722
494,495,7662,432,2070,233.367,7.85579,82.1442,99.426
495,496,3217,898,2064,28.3121,54.3822,35.6178,99.9765
496,497,54955,335,2158,247.497,45.4181,44.5819,99.879
497,498,5538,1442,2066,77.6222,41.0737,48.9263,99.6037
498,499,40000,2459,2209,231.485,64.8503,25.1497,99.6178
499,500,50235,1245,2161,249.243,60.6396,29.3604,99.9578
500,501,891,2085,2058,263.306,42.8639,47.1361,99.9848
501,502,3268,2261,2088,226.351,19.8743,70.1257,99.9547
502,503,21283,1056,2158,310.582,69.688,20.312,99.9413
503,504,29614,97,2196,247.152,63.3002,26.6998,99.9251
504,505,10766,1600,2140,76.8552,43.2447,46.7553,99.8243
505,506,60838,2031,2222,227.299,17.9117,72.0883,99.7918
506,507,29530,2306,2241,255.05900000000003,28.0872,61.9128,99.9547
507,508,1637,2827,2104,247.571,31.4287,58.5713,99.9718
508,509,18645,869,2166,283.478,68.2978,21.7022,99.9348
509,510,22866,699,2198,54.4451,32.6916,57.3084,99.9496
510,511,5321,2231,2129,231.798,65.5496,24.4504,99.9558
511,512,22075,1455,2185,232.36900000000003,23.6779,66.3221,99.9467
512,513,127583,3070,2317,246.537,11.7649,78.2351,99.76
513,514,1136,2868,2144,259.781,34.4723,55.5277,99.9354
514,515,18345,317,2296,77.2377,36.0822,53.9178,99.9305
515,516,35858,2690,2324,52.2213,56.7176,33.2824,99.953
516,517,6565,998,2276,69.8563,1.51712,88.4829,99.9244
517,518,7016,2818,2279,52.7266,23.888,66.112,99.9633
518,519,913,1344,2246,257.115,58.7328,31.2672,99.9874
519,520,9034,897,2289,126.279,80.8518,9.14817,99.9324
520,521,5222,1576,2271,251.101,9.71715,80.2829,99.8654
521,522,7955,177,2327,216.556,72.2297,17.7703,99.9151
522,523,51550,658,2381,46.9669,67.1363,22.8637,99.8659
523,524,1447,1488,2273,266.431,57.4035,32.5965,99.9107
524,525,10835,1700,2310,247.022,9.33867,80.6613,99.9929
525,526,238372,1091,2543,245.529,16.4526,73.5474,99.9218
526,527,4217,3378,2302,53.8152,68.6719,21.3281,99.9876
527,528,936,3423,2304,54.5445,68.4834,21.5166,99.9398
528,529,190134,546,2670,240.145,13.1568,76.8432,99.434
529,530,28657,2139,2384,50.877,27.3394,62.6606,99.9937
530,531,2588,1411,2307,298.988,73.5551,16.4449,99.918
531,532,22398,1762,2410,303.262,74.8862,15.1138,99.9344
532,533,43891,1512,2412,58.1146,41.8576,48.1424,99.9059
533,534,6952,105,2385,266.103,59.1451,30.8549,99.98
534,535,81422,1974,2517,48.112,56.1292,33.8708,98.716
535,536,10233,2538,2391,248.611,43.5637,46.4363,99.8458
536,537,14477,2315,2384,52.4288,60.7826,29.2174,99.9544
537,538,773,3349,2352,61.9072,44.6245,45.3755,99.9957
538,539,751,3422,2368,68.7754,39.1631,50.8369,99.9555
539,540,1031,823,2364,250.147,63.6983,26.3017,99.9878
540,541,3887,877,2389,175.125,76.5513,13.4487,99.9724
541,542,1372,3315,2378,261.874,39.9007,50.0993,99.9622
542,543,2667,1392,2377,256.895,23.8792,66.1208,99.9404
543,544,547,2433,2362,239.231,43.4267,46.5733,99.6705
544,545,5317,3369,2430,69.2677,39.6317,50.3683,99.9165
545,546,1073,3072,2396,36.1352,39.8255,50.1745,99.9878
546,547,9341,3276,2469,68.8204,35.1012,54.8988,99.9719
547,548,594,3420,2428,68.6872,39.6081,50.3919,99.9557
548,549,10060,797,2454,77.8967,34.9909,55.0091,99.8916
549,550,15073,112,2498,245.255,4.70021,85.2998,99.9084
550,551,11967,3177,2490,235.553,74.1293,15.8707,99.5224
551,552,84055,2276,2604,225.832,75.1607,14.8393,99.0994
552,553,8182,2757,2461,250.93400000000003,40.9669,49.0331,99.9452
553,554,51656,2824,2595,247.32,47.1205,42.8795,99.7784
554,555,3553,2612,2500,98.5414,72.4103,17.5897,99.7114
555,556,6879,1611,2510,243.043,6.34525,83.6548,99.9568
556,557,976,720,2482,231.78,66.9903,23.0097,99.8918
557,558,3919,3393,2535,255.268,43.7407,46.2593,99.969
558,559,4160,2674,2531,65.574,80.4673,9.53267,97.7713
559,560,68549,276,2625,58.1683,27.7037,62.2963,99.9493
560,561,1245,3350,2513,87.3784,58.555,31.445,99.9815
561,562,2792,1726,2522,302.6670000000001,67.7761,22.2239,99.0973
562,563,2791,698,2567,253.814,73.4673,16.5327,99.9448
563,564,6154,3313,2575,64.5475,34.4704,55.5296,99.8375
564,565,1506,1668,2556,241.795,32.3927,57.6073,99.9845
565,566,1621,2527,2551,245.573,38.7095,51.2905,99.8147
566,567,846,3040,2553,71.5303,45.761,44.239,99.2752
567,568,2676,1534,2564,323.803,63.1139,26.8861,99.9657
568,569,785,67,2562,238.241,69.2106,20.7894,99.9778
569,570,71039,1680,2697,253.226,47.105,42.895,99.8644
570,571,3789,2602,2614,62.948,71.9593,18.0407,99.822
571,572,87286,3256,2843,38.6324,40.5437,49.4563,99.8225
572,573,21762,3075,2639,45.6577,63.4932,26.5068,99.9572
573,574,12471,69,2673,257.948,66.9853,23.0147,99.939
574,575,847,2562,2594,66.2885,65.8277,24.1723,99.9799
575,576,4097,2504,2614,254.359,13.7066,76.2934,99.9868
576,577,88680,1615,2847,62.5236,12.6362,77.3638,93.1011
577,578,2525,3355,2650,68.6772,34.2512,55.7488,99.8739
578,579,59590,2346,2787,166.852,84.3512,5.64875,99.82
579,580,923,1870,2642,292.598,78.446,11.554,99.9872
580,581,9018,2703,2716,62.8453,28.6693,61.3307,99.9326
581,582,1465,3181,2686,43.8626,63.735,26.265,99.977
582,583,1637,2501,2680,58.5209,2.8105,87.1895,99.9736
583,584,23779,1345,2754,70.9629,6.21473,83.7853,99.9238
584,585,8809,1911,2732,305.628,83.6651,6.3349,99.9393
585,586,3946,2971,2711,66.51,28.1986,61.8014,99.669
586,587,11466,1064,2792,247.891,20.2878,69.7122,99.0967
587,588,10351,1992,2758,49.0624,26.9998,63.0002,99.9615
588,589,5429,2625,2733,242.178,38.867,51.133,99.9772
589,590,15211,966,2749,268.957,65.7031,24.2969,99.3669
590,591,2378,3049,2720,209.439,75.3427,14.6573,99.9754
591,592,662,2069,2700,55.6288,41.3372,48.6628,99.9898
592,593,10724,2573,2785,244.067,10.5487,79.4513,99.9742
593,594,5402,149,2742,50.0896,59.0202,30.9798,99.978
594,595,18004,2879,2788,203.757,70.5222,19.4778,99.9087
595,596,1013,3344,2733,264.168,40.7537,49.2463,99.9826
596,597,2867,1227,2754,69.0355,36.6752,53.3248,99.9689
597,598,36814,3055,2884,265.509,5.70396,84.296,99.8425
598,599,670,1879,2786,299.135,79.3752,10.6248,99.9718
599,600,1321,67,2791,244.003,10.9973,79.0027,99.9578
600,601,1626,769,2789,71.9184,42.2957,47.7043,99.9952
601,602,2413,1274,2804,244.681,16.2073,73.7927,99.9974
602,603,32861,240,2906,230.927,55.8086,34.1914,99.9402
603,604,559,3374,2815,37.3473,39.8251,50.1749,99.85
604,605,7425,2474,2827,77.1431,28.7313,61.2687,99.2765
605,606,2416,1109,2825,249.149,27.4635,62.5365,99.9803
606,607,7199,121,2854,52.4427,60.1231,29.8769,99.9846
607,608,9349,2731,2851,61.2833,78.1636,11.8364,99.9742
608,609,828,2662,2822,73.0564,70.8584,19.1416,99.99
609,610,2066,2215,2832,246.355,26.3049,63.6951,99.9937
610,611,1234,960,2828,245.088,18.8394,71.1606,99.878
611,612,120753,1947,3017,254.312,36.1449,53.8551,99.1127
612,613,2267,55,2862,254.715,23.4656,66.5344,99.9824
613,614,14125,2571,2915,84.9496,3.4046800000000004,86.5953,99.9308
614,615,118112,1313,3129,225.246,55.3959,34.6041,99.7345
615,616,14980,944,2913,240.353,23.0575,66.9425,99.9269
616,617,1407,2170,2862,251.973,38.5374,51.4626,99.9125
617,618,14200,2841,2918,250.582,23.6017,66.3983,99.9879
618,619,15309,2713,2955,83.7228,59.1864,30.8136,99.7734
619,620,13091,531,2925,139.399,83.3348,6.66515,99.9801
620,621,6526,1115,2929,55.7201,24.634,65.366,99.9787
621,622,2569,2464,2900,62.1981,31.3908,58.6092,99.7056
622,623,17717,1424,3003,238.588,52.1096,37.8904,99.1761
623,624,302059,550,3242,63.3574,0.667633,89.3324,99.8388
624,625,7804,68,2969,242.754,7.281810000000001,82.7182,99.9497
625,626,548,1046,2917,85.477,49.8988,40.1012,99.9859
626,627,596,1020,2948,263.552,3.90407,86.0959,99.9236
627,628,3536,623,2946,60.209,35.9877,54.0123,99.978
628,629,20514,2953,3022,79.1219,12.5728,77.4272,99.1252
629,630,17602,2445,3029,67.2899,67.064,22.936,98.8483
630,631,1771,1198,2960,259.588,3.0111,86.9889,99.9805
631,632,3318,1719,2969,223.896,47.4388,42.5612,99.9679
632,633,30519,2259,3046,66.7831,5.14518,84.8548,99.9607
633,634,31210,619,3075,247.801,65.6211,24.3789,99.6957
634,635,2276,952,2991,102.143,69.7712,20.2288,99.2019
635,636,24874,1083,3049,77.5237,49.2355,40.7645,99.5317
636,637,2750,2562,3021,173.588,81.2051,8.79493,99.9655
637,638,72119,2629,3166,61.9919,2.97864,87.0214,99.9184
638,639,2304,1590,3031,46.6299,18.9691,71.0309,99.9446
639,640,756,2823,3023,242.614,16.0842,73.9158,99.9646
640,641,25516,113,3124,76.8467,8.37182,81.6282,99.9388
641,642,610,3415,3031,227.238,58.5004,31.4996,99.8871
642,643,50756,3198,3239,79.1266,12.3989,77.6011,99.5349
643,644,1645,3088,3041,70.7821,20.0205,69.9795,99.8615
644,645,2733,1516,3069,43.9861,13.0553,76.9447,99.9912
645,646,56930,2943,3220,260.025,4.8501699999999985,85.1498,99.6892
646,647,5646,3327,3136,228.829,62.1832,27.8168,99.9581
647,648,1844,683,3095,253.563,28.7311,61.2689,99.9849
648,649,2086,3072,3093,69.2013,32.3776,57.6224,99.9913
649,650,4233,3266,3110,242.583,9.42789,80.5721,99.9854
650,651,20593,2309,3175,61.0204,13.6806,76.3194,99.9747
651,652,2145,2421,3139,51.7178,26.8373,63.1627,99.9604
652,653,2688,3099,3157,60.4025,71.3436,18.6564,99.9317
653,654,906,3401,3145,250.144,7.71175,82.2883,99.7542
654,655,52261,1729,3283,63.271,6.34116,83.6588,99.939
655,656,8091,1008,3182,55.0393,23.9647,66.0353,99.9908
656,657,21063,2067,3241,69.6273,5.82607,84.1739,99.9712
657,658,2695,1804,3169,242.873,1.64399,88.35600000000002,99.9906
658,659,13460,2814,3243,81.3942,10.158,79.842,99.9405
659,660,2727,2165,3172,53.8373,12.4424,77.5576,99.9886
660,661,7044,1962,3227,35.3773,31.9604,58.0396,99.9767
661,662,26744,3303,3415,228.32,3.87167,86.1283,99.9228
662,663,4340,43,3287,63.5137,5.18457,84.8154,99.9151
663,664,525,62,3218,67.8647,5.9111699999999985,84.0888,99.9513
664,665,20502,3076,3371,63.9402,32.0856,57.9144,99.9338
665,666,134803,2361,3397,75.7731,74.1025,15.8975,99.5065
666,667,14688,1928,3332,76.2733,9.26446,80.7355,99.1556
667,668,90154,1719,3471,229.161,50.2276,39.7724,99.5252
668,669,4105,1513,3285,225.826,23.5408,66.4592,99.9688
669,670,67144,192,3418,251.048,37.7278,52.2722,99.8763
670,671,669,998,3279,82.8673,6.30124,83.6988,99.8048
671,672,28490,1409,3358,78.2713,41.2343,48.7657,99.475
672,673,1327,1088,3286,55.332,23.2252,66.7748,99.9842
673,674,15413,2777,3357,77.6382,64.9273,25.0727,99.9716
674,675,10706,895,3350,118.925,75.771,14.229,99.9215
675,676,3097,1867,3341,253.517,49.0373,40.9627,99.9875
676,677,739,1132,3315,245.035,15.4813,74.5187,99.9753
677,678,9680,1056,3385,246.274,17.5856,72.4144,99.8986
678,679,17358,1191,3386,229.875,16.6802,73.3198,99.9858
679,680,1289,993,3324,248.162,6.8084,83.1916,99.9827
680,681,1087,2672,3354,53.0575,69.737,20.263,99.9842
681,682,112346,843,3606,75.2454,11.3318,78.6682,99.6793
682,683,3338,2019,3395,80.0383,74.5785,15.4215,99.9761
683,684,11522,2093,3431,262.242,45.3992,44.6008,99.9641
684,685,89230,1214,3621,97.1255,51.6171,38.3829,99.3626
685,686,4108,2715,3418,253.407,37.7538,52.2462,99.9754
686,687,32016,2920,3522,54.5412,25.4226,64.5774,99.8837
687,688,562,982,3411,328.2630000000001,85.4047,4.59529,99.958
688,689,939,1100,3429,219.973,18.0042,71.9958,99.9767
689,690,89374,2604,3659,259.672,24.2241,65.7759,99.7042
690,691,566,3359,3448,231.702,2.25671,87.7433,99.9221
691,692,22208,3156,3571,40.0279,40.5068,49.4932,99.9672
692,693,4382,2771,3496,32.7003,44.6104,45.3896,99.9746
693,694,46873,1466,3595,66.485,13.6636,76.3364,99.6712
694,695,2986,1144,3495,79.8404,70.5607,19.4393,99.3034
695,696,9010,1026,3527,219.251,85.7855,4.21454,98.4602
696,697,1632,2139,3500,82.3721,16.3697,73.6303,99.8964
697,698,9851,3078,3570,245.719,10.1789,79.8211,99.9484
698,699,9957,134,3563,67.6447,20.8408,69.1592,99.9832
699,700,17786,3273,3608,72.0208,8.37827,81.6217,99.9764
700,701,121279,2050,3680,49.1576,48.3638,41.6362,95.7299
701,702,1499,42,3548,327.127,72.4585,17.5415,99.9788
702,703,800,2032,3538,229.163,48.3974,41.6026,99.8744
703,704,7038,358,3579,77.9382,75.7755,14.2245,99.9725
704,705,211486,2858,3928,244.831,5.21322,84.7868,99.3159
705,706,40811,619,3671,245.833,8.85525,81.1448,99.967
706,707,3320,2495,3582,53.8115,68.5966,21.4034,99.701
707,708,31624,232,3664,238.867,49.0234,40.9766,99.9597
708,709,8540,57,3631,231.711,16.8497,73.1503,99.9856
709,710,4681,450,3634,73.9514,10.933,79.067,99.7244
710,711,7498,2895,3633,34.4587,42.51300000000001,47.487,99.9559
711,712,3815,3053,3689,79.6538,8.37928,81.6207,99.3991
712,713,1492,2361,3626,43.667,64.1943,25.8057,99.9502
713,714,5189,388,3669,329.7630000000001,81.5449,8.455119999999999,99.9659
714,715,1020,3017,3650,245.281,8.63823,81.3618,99.9842
715,716,603,2991,3672,87.6381,9.17975,80.8203,99.9864
716,717,5856,3202,3702,248.458,58.8224,31.1776,99.9923
717,718,1443,87,3700,338.4890000000001,75.7676,14.2324,99.9837
718,719,1046,3273,3704,226.105,69.0732,20.9268,99.9935
719,720,779,26,3704,221.96,52.6819,37.3181,99.9846
720,721,3403,472,3731,245.683,45.6699,44.3301,99.9811
721,722,124493,1490,3892,33.277,75.6896,14.3104,99.1336
722,723,103803,2155,3929,265.557,44.0156,45.9844,99.5007
723,724,2426,2440,3723,45.9728,77.8211,12.1789,99.8174
724,725,6968,337,3757,223.423,7.40595,82.594,99.9954
725,726,2781,415,3739,239.221,35.2011,54.7989,99.976
726,727,887,3323,3733,226.995,4.90074,85.0993,99.9894
727,728,2232,47,3749,237.826,54.1066,35.8934,99.9448
728,729,41406,3191,3822,227.698,24.0038,65.9962,99.9812
729,730,22828,190,3830,250.527,7.0759,82.9241,99.9253
730,731,4305,2409,3771,40.8675,63.4391,26.5609,99.9518
731,732,29279,1115,3867,54.3103,82.2961,7.7039300000000015,99.7034
732,733,2936,551,3787,15.6266,76.6141,13.3859,99.9723
733,734,3867,1803,3817,230.097,36.9352,53.0648,99.9963
734,735,40629,649,3898,236.325,42.2649,47.7351,99.9851
735,736,1383,964,3786,248.94,4.9597,85.0403,99.9843
736,737,1502,3329,3815,226.488,4.79491,85.2051,99.9909
737,738,1097,446,3791,222.885,9.40555,80.5945,98.9712
738,739,10730,100,3876,65.0045,47.9345,42.0655,99.9695
739,740,3719,550,3858,250.893,51.1294,38.8706,99.98
740,741,49623,308,3932,237.422,50.758,39.242,99.618
741,742,2507,505,3827,231.328,5.04629,84.9537,99.9853
742,743,1064,2360,3822,261.148,42.6912,47.3088,99.979
743,744,29684,926,3899,242.217,14.9084,75.0916,99.9233
744,745,3409,1060,3854,36.5579,75.8432,14.1568,99.9569
745,746,3309,1898,3860,229.394,36.8379,53.1621,99.9902
746,747,12922,2462,3884,63.9422,82.4494,7.55055,99.9342
747,748,17397,3317,3984,55.9544,43.0832,46.9168,99.8219
748,749,8893,1239,3913,66.0857,1.44844,88.5516,99.9696
749,750,34406,1687,3954,253.825,65.2793,24.7207,99.6324
750,751,732,2664,3866,51.9224,82.3932,7.60682,99.8824
751,752,1286,2303,3871,56.0422,85.1688,4.8312,99.959
752,753,19863,1950,3954,38.6237,16.9995,73.0005,99.8486
753,754,37595,664,4052,22.556,73.5783,16.4217,99.3497
754,755,522,471,3922,56.9648,67.313,22.687,99.9835
755,756,10168,472,4009,61.5138,64.315,25.685,99.5687
756,757,5752,3180,3975,68.29899999999999,3.08149,86.9185,99.9698
757,758,9757,1311,4008,65.0637,41.4451,48.5549,99.425
758,759,1160,3240,3973,238.711,1.65137,88.3486,99.8706
759,760,58471,916,4118,29.499,47.4283,42.5717,99.8858
760,761,39988,1887,4109,42.7722,65.3088,24.6912,99.7518
761,762,36437,1247,4112,229.433,31.7302,58.2698,99.8025
762,763,38771,2437,4095,232.98,5.15369,84.8463,99.8876
763,764,17768,346,4077,265.68,51.1513,38.8487,99.8918
764,765,2289,98,4032,248.885,45.7802,44.2198,99.966
765,766,541,1050,4024,243.947,2.01048,87.9895,99.9384
766,767,19269,1706,4116,260.317,45.9107,44.0893,99.8679
767,768,740,1237,4033,247.646,54.5132,35.4868,99.8495
768,769,3944,51,4076,63.1726,29.5298,60.4702,99.9788
769,770,14220,157,4091,285.233,59.6567,30.3433,99.9676
770,771,11578,3272,4128,48.9586,78.6983,11.3017,99.9094
771,772,5810,1096,4113,231.054,39.3521,50.6479,99.977
772,773,37705,2991,4190,39.4907,48.468,41.532,99.8665
773,774,10086,1592,4133,70.6477,0.399345,89.6007,99.9595
774,775,2915,2696,4102,250.389,47.5474,42.4526,99.9607
775,776,6284,2594,4129,251.891,73.7433,16.2567,99.9363
776,777,21127,504,4167,251.947,26.8631,63.1369,99.8619
777,778,1014,3084,4120,60.1346,50.1138,39.8862,99.9656
778,779,11762,2409,4176,76.2137,71.1704,18.8296,99.766
779,780,1030,2886,4125,77.2198,3.4087,86.5913,99.9896
780,781,28045,79,4283,60.2333,38.3321,51.6679,99.8813
781,782,10811,3185,4198,58.7329,39.1458,50.8542,99.9803
782,783,3130,2279,4161,248.05900000000003,52.4298,37.5702,99.9874
783,784,29181,2121,4219,60.5936,10.0759,79.9241,99.9769
784,785,16674,327,4209,79.2741,77.9359,12.0641,99.9648
785,786,9256,774,4194,59.208,22.5576,67.4424,99.9898
786,787,892,1138,4157,243.286,0.102867,89.8971,99.997
787,788,3473,168,4182,244.679,52.56800000000001,37.432,99.9805
788,789,29580,1199,4294,56.3488,15.0503,74.9497,99.8419
789,790,2180,1552,4202,5.24367,65.7063,24.2937,99.9082
790,791,28744,722,4268,260.768,49.0258,40.9742,99.8995
791,792,8492,1388,4239,230.709,40.2339,49.7661,99.9312
792,793,10894,213,4256,57.7456,37.2673,52.7327,99.9732
793,794,25980,3244,4303,58.678,48.742,41.258,99.8822
794,795,15032,1940,4268,231.96400000000003,1.50493,88.4951,99.9755
795,796,15883,2274,4262,233.799,2.87278,87.1272,99.6878
796,797,58026,1698,4302,250.579,2.31525,87.6847,99.9567
797,798,94391,2588,4422,242.003,57.6291,32.3709,99.4592
798,799,1157,2648,4237,47.4474,47.8663,42.1337,99.9209
799,800,8180,2716,4264,68.3323,52.4909,37.5091,99.9707
800,801,17471,1049,4304,249.405,57.9604,32.0396,99.9154
801,802,2952,133,4273,60.2158,28.8437,61.1563,99.9618
802,803,209023,619,4513,245.49400000000003,39.1764,50.8236,99.4535
803,804,2513,528,4295,347.025,74.2409,15.7591,99.9517
804,805,2261,2436,4281,40.9526,61.3297,28.6703,99.9295
805,806,1826,2839,4276,264.487,70.4056,19.5944,99.963
806,807,831,3032,4277,27.956,67.4694,22.5306,99.9852
807,808,7582,335,4312,244.057,37.3663,52.6337,99.9565
808,809,542,2489,4291,43.6747,62.2125,27.7875,99.9001
809,810,7576,2944,4327,235.44,16.8155,73.1845,99.9027
810,811,101973,1407,4483,58.7482,8.78077,81.2192,99.1678
811,812,13063,947,4371,56.6222,17.4315,72.5685,99.8994
812,813,1006,2861,4306,265.398,70.5192,19.4808,99.9825
813,814,1582,3022,4304,27.6984,66.5945,23.4055,99.9515
814,815,8421,3099,4367,64.2182,12.3799,77.6201,99.8901
815,816,49278,2052,4444,44.7685,66.2847,23.7153,99.6255
816,817,6102,2157,4359,244.633,47.9889,42.0111,99.9851
817,818,2060,1494,4338,19.4789,68.3114,21.6886,99.9573
818,819,588,2816,4328,265.954,70.0754,19.9246,99.9896
819,820,3524,210,4353,228.362,16.3624,73.6376,99.9143
820,821,826,2497,4333,238.605,1.9023,88.0977,99.9934
821,822,962,226,4334,61.2024,17.1712,72.8288,99.9846
822,823,6245,421,4365,52.1021,19.1134,70.8866,99.9517
823,824,5524,2253,4347,232.285,3.59386,86.4061,99.9798
824,825,11376,750,4379,242.278,23.7961,66.2039,99.9575
825,826,2006,3343,4370,48.6172,40.3057,49.6943,99.9712
826,827,2158,347,4375,60.438,13.5982,76.4018,99.9953
827,828,1681,1888,4381,54.4868,66.6724,23.3276,99.9662
828,829,1615,3017,4386,38.9722,3.04887,86.9511,99.983
829,830,2068,25,4401,246.51,52.7147,37.2853,99.9738
830,831,11458,2944,4431,74.1878,32.4752,57.5248,99.653
831,832,3262,3274,4404,72.3418,51.6914,38.3086,99.9743
832,833,794,3313,4392,66.5842,51.0156,38.9844,99.9886
833,834,2719,2872,4427,69.0878,32.1934,57.8066,99.9782
834,835,20507,942,4464,36.0769,55.0375,34.9625,99.5816
835,836,889,2218,4402,69.2759,38.1988,51.8012,99.9205
836,837,1396,1050,4395,29.6185,49.3086,40.6914,99.9678
837,838,37213,3121,4483,55.8969,56.6095,33.3905,99.877
838,839,22988,2301,4525,40.2594,3.4499699999999995,86.55,99.9393
839,840,1765,1823,4425,237.59,24.3122,65.6878,99.9368
840,841,1983,3333,4431,50.326,1.949,88.051,99.9742
841,842,16089,2545,4482,247.383,30.6149,59.3851,99.9426
842,843,3876,1751,4458,61.6126,56.7714,33.2286,99.9788
843,844,1489,123,4440,229.658,11.1001,78.8999,99.9774
844,845,1150,1860,4450,43.2299,30.8921,59.1079,99.9704
845,846,737,1101,4449,240.736,33.8503,56.1497,99.9518
846,847,926,58,4455,246.223,52.7838,37.2162,99.9827
847,848,1030,846,4461,238.685,22.0111,67.9889,99.9752
848,849,1241,14,4474,125.217,79.1926,10.8073,99.9478
849,850,91282,1928,4601,58.6272,1.7085,88.2915,90.0198
850,851,7174,150,4497,241.954,18.2089,71.7911,96.1802
851,852,8692,3301,4519,300.627,81.3584,8.641630000000001,87.1447
852,853,7425,2875,4520,60.5944,56.7037,33.2963,99.6997
853,854,1474,2806,4499,235.201,28.3765,61.6235,99.9876
854,855,20995,67,4592,238.387,31.8832,58.1168,99.9672
855,856,3969,1550,4545,38.6267,74.9378,15.0622,99.3922
856,857,36600,2760,4695,254.846,28.0525,61.9475,99.9385
857,858,16790,2580,4648,63.5527,5.7350900000000005,84.2649,99.9207
858,859,23424,1250,4643,39.6763,62.6167,27.3833,99.628
859,860,129586,3110,4725,58.5211,1.6517400000000002,88.3483,99.8882
860,861,508,3334,4574,231.788,73.8697,16.1303,99.9847
861,862,86193,2421,4777,240.389,51.6588,38.3412,99.7863
862,863,128180,1683,4768,64.6396,57.2015,32.7985,99.8796
863,864,1020,278,4611,228.251,15.4404,74.5596,99.9809
864,865,36482,678,4685,60.5821,5.43791,84.5621,99.981
865,866,6063,3359,4722,62.2983,1.37276,88.6272,99.8812
866,867,36654,932,4726,54.8508,51.1184,38.8816,99.931
867,868,5176,194,4645,250.779,17.8463,72.1537,99.9946
868,869,2284,1193,4645,46.3925,5.2400400000000005,84.76,99.9886
869,870,18742,365,4686,236.55,76.3509,13.6491,99.9272
870,871,1502,1842,4651,33.3647,61.3509,28.6491,99.9506
871,872,1968,2278,4664,58.9767,36.026,53.974,99.979
872,873,1955,2230,4688,232.857,49.4292,40.5708,99.9926
873,874,20357,1204,4778,235.442,34.9351,55.0649,99.9001
874,875,40961,2092,4819,28.8417,64.3129,25.6871,99.9718
875,876,5851,2247,4754,53.2024,2.81767,87.1823,99.9968
876,877,20285,2834,4814,53.789,56.1172,33.8828,99.6128
877,878,3186,2669,4842,59.2989,5.0299,84.9701,99.9496
878,879,793,1104,4828,240.034,34.7833,55.2167,99.9703
879,880,733,1468,4854,80.2639,59.8909,30.1091,99.8435
880,881,676,1300,4850,242.298,36.5573,53.4427,99.6968
881,882,1152,1516,4858,79.3399,60.9327,29.0673,99.7402
882,883,1891,3251,4877,62.3296,2.14243,87.8576,99.9494
883,884,1609,3300,4888,58.6722,1.8001900000000002,88.1998,99.7478
884,885,1249,2756,4892,57.9371,4.5333,85.4667,99.9595
885,886,522,2929,4902,64.238,2.33722,87.6628,99.915
886,887,520,2818,4896,64.8292,57.0647,32.9353,99.9378
887,888,1906,2460,4913,245.697,53.2834,36.7166,99.9333
888,889,866,1989,4916,40.7698,66.8191,23.1809,99.6859
889,890,2335,2139,4920,31.5563,68.0294,21.9706,99.867
