,Grain No.,Size [Pixel],center x-coordinate,center y-coordinate,mean azimuth [degree],mean latitude [degree],mean colatitude [degree],Regelungsgrad [%]
0,1,6359,217,165,121.332,8.22003,81.78,99.9695
1,2,23867,362,196,112.52,18.2654,71.7346,99.9883
2,3,195826,834,334,128.412,24.6364,65.3636,99.8478
3,4,940,267,154,116.314,38.3798,51.6202,99.9969
4,5,4745,554,180,291.468,27.6826,62.3174,99.9559
5,6,220335,1564,384,307.969,48.6975,41.3025,99.8154
6,7,3584,667,202,292.9790000000001,26.4605,63.5395,99.9715
7,8,667,675,173,234.772,6.41631,83.5837,99.8473
8,9,2670,167,206,139.504,58.7081,31.2919,99.9538
9,10,41573,2245,258,296.059,57.4619,32.5381,99.9674
10,11,848,2058,198,35.8237,45.2783,44.7217,99.9861
11,12,1443,2509,193,307.93,38.9459,51.0541,99.9769
12,13,114690,2546,419,351.611,82.883,7.1170100000000005,44.7538
13,14,197913,2130,553,302.408,6.79983,83.2002,70.5852
14,15,26940,102,337,116.731,15.2131,74.7869,99.9734
15,16,3034,3059,236,307.326,31.7777,58.2223,99.9587
16,17,41885,3296,316,307.611,12.9527,77.0473,99.6981
17,18,206365,3065,545,130.399,33.914,56.08600000000001,48.8777
18,19,8670,272,285,189.46400000000003,80.0724,9.92757,99.9724
19,20,1026,3400,245,124.554,42.2831,47.7169,99.9674
20,21,3634,200,265,118.808,56.2316,33.7684,99.9533
21,22,14131,1235,279,158.878,77.9143,12.0857,99.9188
22,23,20669,3137,343,110.445,25.8313,64.1687,99.9582
23,24,1459,2718,287,109.272,26.5677,63.4323,99.9953
24,25,4810,446,314,127.374,80.8299,9.17005,99.9918
25,26,18607,2130,373,297.124,60.2262,29.7738,99.9888
26,27,5931,368,345,119.346,55.4326,34.5674,99.9644
27,28,30752,1302,381,307.444,7.6301,82.3699,99.9481
28,29,22886,233,414,291.575,59.8276,30.1724,99.9551
29,30,22140,2724,413,110.987,23.2755,66.7245,99.989
30,31,2788,2820,375,310.345,37.6947,52.3053,99.9887
31,32,5119,452,389,113.996,47.0059,42.9941,99.9836
32,33,3846,361,411,194.194,81.5357,8.464269999999999,99.9671
33,34,631,2294,402,310.059,40.2669,49.7331,99.9976
34,35,1698,453,431,102.925,49.2315,40.7685,99.8667
35,36,4005,3184,436,129.90200000000002,4.1216800000000005,85.8783,99.995
36,37,15418,653,512,295.753,11.0829,78.9171,99.5433
37,38,6952,3314,472,302.978,23.3391,66.6609,99.989
38,39,5468,3384,515,110.803,27.6381,62.3619,99.6893
39,40,1666,466,451,109.457,48.1134,41.8866,99.9145
40,41,788,367,468,206.477,84.5959,5.4041,99.9614
41,42,1417,946,475,130.166,52.6263,37.3737,99.9967
42,43,177301,458,909,104.51,9.76132,80.2387,50.7706
43,44,15974,109,534,109.052,8.523660000000001,81.4763,83.6375
44,45,16605,1911,550,301.779,9.5814,80.4186,99.95
45,46,3548,2369,515,78.3077,85.4567,4.54325,99.9903
46,47,16156,306,556,124.343,56.7041,33.2959,99.7121
47,48,1774,752,505,115.83,50.5736,39.4264,99.9374
48,49,9420,1575,568,298.262,86.1057,3.89425,99.986
49,50,50521,1043,692,130.82,48.6619,41.3381,99.8545
50,51,50263,1433,729,283.083,28.3167,61.6833,99.7221
51,52,1538,2747,534,103.508,31.1918,58.8082,99.9769
52,53,4725,708,571,116.422,23.9678,66.0322,99.9812
53,54,4791,783,563,292.942,21.2233,68.7767,99.9726
54,55,6780,1151,585,123.861,45.9798,44.0202,99.9712
55,56,6491,2697,592,115.682,30.3204,59.6796,99.9627
56,57,927,190,569,115.204,55.399,34.601,99.8926
57,58,1597,238,577,113.207,39.2677,50.7323,99.9941
58,59,1519,884,581,293.209,23.5782,66.4218,99.9803
59,60,14506,877,656,298.993,59.3761,30.6239,99.9866
60,61,150566,1802,861,126.129,65.7528,24.2472,95.9468
61,62,2671,355,626,266.813,56.1122,33.8878,99.9956
62,63,58916,2913,761,359.145,77.0167,12.9833,59.2512
63,64,2220,2741,623,292.958,22.2513,67.7487,99.9977
64,65,102592,833,855,292.61,2.88647,87.1135,67.6655
65,66,1100,191,623,108.28,2.0409900000000003,87.959,99.9666
66,67,16039,2425,741,126.866,18.1774,71.8226,99.8764
67,68,5212,2432,652,300.145,41.9851,48.0149,99.9946
68,69,1433,100,640,237.471,73.2857,16.7143,99.987
69,70,11719,1195,696,304.163,24.5405,65.4595,99.9762
70,71,3680,280,665,291.306,50.4136,39.5864,99.9922
71,72,1677,1284,658,300.476,27.7321,62.2679,99.9506
72,73,9028,216,732,112.855,1.91193,88.0881,99.8751
73,74,91739,2715,836,116.247,27.1292,62.8708,99.9877
74,75,1419,2592,679,116.455,31.786,58.214,99.9844
75,76,1685,162,702,103.892,2.92151,87.0785,99.7684
76,77,549,115,681,289.64,2.58051,87.4195,99.9871
77,78,19478,1298,781,305.467,52.4168,37.5832,99.9388
78,79,1383,1374,696,117.678,0.311867,89.6881,99.9484
79,80,17798,300,774,112.146,1.7345700000000002,88.2654,99.9861
80,81,3868,396,709,294.201,46.6926,43.3074,99.9919
81,82,17159,2461,846,112.608,33.9984,56.0016,99.9437
82,83,1839,564,723,122.827,9.62817,80.3718,99.9622
83,84,4193,433,753,266.321,62.9259,27.0741,99.9888
84,85,727,1430,734,116.414,0.904953,89.095,99.9554
85,86,29260,144,903,290.697,1.28447,88.7155,98.8875
86,87,526,90,747,96.5501,2.34193,87.6581,99.9186
87,88,22060,3341,875,305.616,0.7062149999999999,89.2938,99.8118
88,89,1396,1253,753,109.65,22.3249,67.6751,99.997
89,90,16618,2291,818,279.821,36.1047,53.8953,99.9787
90,91,519,3313,762,117.753,50.7415,39.2585,99.9981
91,92,1624,374,786,114.406,6.2994,83.7006,99.9893
92,93,15917,659,854,123.756,6.18115,83.8188,99.9889
93,94,7898,1158,828,126.226,14.6053,75.3947,99.9443
94,95,518,3385,796,119.775,51.9413,38.0587,99.9895
95,96,42496,1535,923,306.283,9.07689,80.9231,90.9709
96,97,2345,1360,833,296.051,18.892,71.108,99.9993
97,98,72233,2041,959,295.126,21.1608,68.8392,58.4287
98,99,688,104,810,95.9592,3.2227900000000003,86.7772,99.8193
99,100,738,58,812,286.824,3.77425,86.2257,99.6701
100,101,591,1592,805,297.263,55.2134,34.7866,99.9888
101,102,671,1641,814,281.248,29.8103,60.1897,99.9966
102,103,15141,315,904,119.574,52.2364,37.7636,99.9532
103,104,2341,2198,850,296.385,42.6511,47.3489,99.9979
104,105,2139,2515,851,102.33,44.2709,45.7291,99.9923
105,106,2397,217,880,298.592,2.70026,87.2997,99.9296
106,107,628,1016,842,303.291,52.2885,37.7115,99.9928
107,108,39139,3212,1016,125.536,3.87131,86.1287,50.9459
108,109,1516,2318,871,295.155,40.0869,49.9131,99.929
109,110,5884,3293,913,297.145,8.55994,81.4401,99.991
110,111,1777,1234,890,120.195,46.7985,43.2015,99.9734
111,112,16971,3053,937,103.942,74.4586,15.5414,99.9884
112,113,5000,1063,911,150.165,79.2958,10.7042,99.996
113,114,1270,1198,891,305.288,52.0285,37.9715,99.9972
114,115,31800,1180,991,128.857,50.9269,39.0731,99.9482
115,116,79071,2574,1044,109.99,19.7186,70.2814,99.7127
116,117,7152,2291,963,269.499,46.5908,43.4092,99.9929
117,118,7279,906,955,308.34,51.9445,38.0555,99.9291
118,119,9539,1350,1003,298.224,18.5866,71.4134,99.9374
119,120,4036,839,947,298.783,14.2333,75.7667,99.9945
120,121,33125,756,1066,121.637,21.6424,68.3576,99.9225
121,122,6818,2852,989,292.281,43.596,46.404,99.9901
122,123,10514,1784,978,113.866,39.2124,50.7876,99.9765
123,124,6796,1658,994,317.112,47.5385,42.4615,99.9477
124,125,1517,1426,985,281.112,30.1635,59.8365,99.9874
125,126,3666,1472,1016,295.128,53.4201,36.5799,99.8539
126,127,4931,3269,1028,309.96,19.7146,70.2854,99.473
127,128,7213,643,1040,293.608,44.8931,45.1069,99.8685
128,129,20428,3051,1080,296.834,18.4523,71.5477,89.3128
129,130,2962,3371,1037,297.391,8.26482,81.7352,99.9837
130,131,614,1398,1022,119.46,30.7633,59.2367,99.9871
131,132,2675,1092,1045,295.007,18.8566,71.1434,99.978
132,133,2851,1711,1056,113.406,14.4957,75.5043,99.9912
133,134,8705,578,1095,291.88,46.5678,43.4322,99.9783
134,135,2545,1411,1053,284.547,64.5342,25.4658,99.9833
135,136,570,92,1056,110.324,1.79185,88.2081,99.9245
136,137,17685,175,1152,300.21,15.1479,74.8521,99.7232
137,138,80934,1020,1270,304.795,19.7872,70.2128,99.7263
138,139,3386,1655,1066,124.329,55.5007,34.4993,99.9906
139,140,51807,2151,1227,300.625,49.192,40.808,99.9314
140,141,12028,2878,1113,294.561,3.06846,86.9315,99.974
141,142,18104,1413,1152,283.022,51.1207,38.8793,99.9744
142,143,119134,2718,1247,298.939,44.5984,45.4016,99.967
143,144,8051,2308,1122,299.117,31.9441,58.0559,99.9944
144,145,140896,3227,1335,126.038,5.91415,84.0859,99.8492
145,146,2187,1142,1095,295.759,23.8676,66.1324,99.9841
146,147,26196,1562,1159,280.548,63.1059,26.8941,99.9834
147,148,547,1305,1105,298.824,17.4216,72.5784,99.9831
148,149,43320,1283,1224,115.109,43.3526,46.6474,99.9762
149,150,2699,2045,1129,116.936,42.8228,47.1772,99.9461
150,151,2981,256,1168,306.647,14.4275,75.5725,99.9536
151,152,7509,1132,1157,145.654,76.2168,13.7832,99.9458
152,153,4933,1738,1164,312.131,49.7322,40.2678,99.9905
153,154,23109,653,1212,99.095,33.1622,56.8378,99.9782
154,155,504,755,1143,273.332,39.2699,50.7301,99.9875
155,156,4407,1687,1197,299.665,11.0667,78.9333,99.9924
156,157,450507,2339,1691,302.904,46.1473,43.8527,80.0172
157,158,5518,1916,1206,114.976,43.5237,46.4763,99.9827
158,159,2427,1630,1223,308.728,51.428,38.572,99.9968
159,160,15806,1786,1277,127.302,24.3611,65.6389,99.9595
160,161,32547,161,1431,302.211,14.3623,75.6377,99.147
161,162,25867,317,1339,307.744,8.67853,81.3215,99.9512
162,163,504,1842,1220,311.668,48.9437,41.0563,99.9849
163,164,4471,841,1259,308.073,1.58158,88.4184,99.9952
164,165,137091,1856,1542,294.561,1.2411299999999998,88.7589,99.7297
165,166,67158,680,1416,297.276,21.3551,68.6449,93.8794
166,167,1073,1436,1242,126.686,13.7366,76.2634,99.9977
167,168,1121,216,1263,303.107,9.81249,80.1875,99.8759
168,169,2185,784,1275,101.295,34.3321,55.6679,99.9963
169,170,3062,1668,1283,128.782,25.3236,64.6764,99.9812
170,171,35916,403,1433,105.712,37.6731,52.3269,93.8878
171,172,117612,1551,1606,110.548,36.7553,53.2447,99.7988
172,173,2099,1598,1281,312.143,19.5107,70.4893,99.9958
173,174,68121,1303,1433,284.626,53.7254,36.2746,99.8464
174,175,1606,1709,1297,276.361,61.2276,28.7724,99.9969
175,176,2156,1633,1318,278.16700000000003,61.5676,28.4324,99.9938
176,177,3116,846,1349,308.85,14.185,75.815,99.9939
177,178,18111,1714,1412,305.5,5.48386,84.5161,99.9942
178,179,5150,2050,1383,298.626,24.6182,65.3818,99.9657
179,180,2175,439,1363,293.705,53.8178,36.1822,99.996
180,181,168545,2984,1588,123.811,65.0714,24.9286,49.8351
181,182,602,1207,1384,115.521,44.5595,45.4405,99.995
182,183,711,236,1399,300.027,10.7214,79.2786,99.938
183,184,72594,918,1543,298.516,8.676219999999999,81.3238,99.8926
184,185,1023,1006,1443,320.451,66.1129,23.8871,99.994
185,186,305245,505,2220,120.043,21.3396,68.6604,78.6815
186,187,578,2110,1441,119.404,41.7143,48.2857,99.9913
187,188,5632,3156,1484,129.336,69.6395,20.3605,99.9803
188,189,10985,637,1599,298.942,53.151,36.849,99.9834
189,190,25965,1281,1620,303.72,43.7866,46.2134,99.9532
190,191,13372,1089,1667,116.434,42.9011,47.0989,99.9925
191,192,1555,239,1608,211.517,82.5371,7.462919999999999,99.6729
192,193,2044,1115,1588,118.995,3.8615,86.1385,99.996
193,194,1223,2642,1575,115.683,44.256,45.744,99.9717
194,195,2953,180,1629,254.282,84.9107,5.08935,99.9226
195,196,19186,308,1682,257.588,84.8562,5.14384,99.8966
196,197,2143,580,1639,325.946,66.3657,23.6343,99.9885
197,198,702,1414,1596,284.671,9.36237,80.6376,99.9973
198,199,2688,729,1626,312.38,62.5796,27.4204,99.9621
199,200,2351,2618,1614,341.685,79.5851,10.4149,99.9975
200,201,1528,103,1629,120.46,16.4912,73.5088,99.8577
201,202,5980,385,1635,306.022,10.0009,79.9991,99.9897
202,203,541,1034,1617,124.749,51.1041,38.8959,99.9942
203,204,628,3314,1619,297.547,12.2735,77.7265,99.9928
204,205,8116,2597,1679,133.845,69.7957,20.2043,99.9809
205,206,4277,1410,1664,126.668,16.5461,73.4539,99.9975
206,207,982,683,1644,327.367,65.0037,24.9963,99.9924
207,208,15430,2816,1732,283.27,51.9111,38.0889,99.9623
208,209,74347,956,1837,311.19,29.5529,60.4471,99.8701
209,210,924,1166,1667,303.736,0.807632,89.1924,99.9978
210,211,843,701,1677,98.2799,31.7244,58.2756,99.9986
211,212,48051,1254,1808,100.356,57.6814,32.3186,99.9358
212,213,1271,2641,1685,353.9790000000001,78.5865,11.4135,99.9958
213,214,767,136,1704,302.934,11.7361,78.2639,99.8499
214,215,35655,751,1812,323.409,61.3564,28.6436,99.7582
215,216,22715,2705,1799,298.968,15.2858,74.7142,99.988
216,217,24395,3340,1850,127.959,5.31302,84.68700000000003,99.8923
217,218,5130,1121,1771,111.549,22.8105,67.1895,99.9817
218,219,244632,3083,2037,111.514,21.9147,68.0853,99.8712
219,220,5722,306,1786,309.601,54.4188,35.5812,99.9715
220,221,698,127,1779,96.0482,48.2539,41.7461,99.9289
221,222,9482,1862,1806,122.872,34.1138,55.8862,99.987
222,223,4316,2434,1815,115.32,8.781369999999999,81.2186,99.9953
223,224,183966,1818,2059,308.522,64.9051,25.0949,94.4264
224,225,4003,168,1832,100.682,48.1095,41.8905,99.952
225,226,688,238,1808,311.877,54.8678,35.1322,99.9665
226,227,1720,2845,1830,162.57,75.7833,14.2167,99.998
227,228,25204,376,1909,112.862,32.3502,57.6498,99.8129
228,229,23072,236,1918,108.821,28.9588,61.0412,99.9536
229,230,3486,2787,1851,137.907,43.5481,46.4519,99.9947
230,231,21201,1338,1954,304.861,35.3271,54.6729,99.9305
231,232,6752,2805,1933,98.4018,20.7846,69.2154,99.9843
232,233,12113,1187,1971,121.463,34.3719,55.6281,99.9688
233,234,6050,2090,1945,103.984,11.7437,78.2563,99.9884
234,235,222674,1200,2156,72.8916,76.9037,13.0963,95.0409
235,236,3944,2897,1960,110.361,64.1981,25.8019,99.9942
236,237,5078,2737,1968,112.38,5.4972,84.5028,99.9883
237,238,2718,135,2005,106.773,29.1664,60.8336,99.8825
238,239,4489,1576,1972,280.23900000000003,57.1134,32.8866,99.9804
239,240,672,2184,1952,297.282,7.32288,82.6771,99.9531
240,241,4709,180,2004,107.851,28.9765,61.0235,99.6954
241,242,709,73,1969,81.5921,51.0129,38.9871,99.9708
242,243,1868,2138,1991,114.83,7.98488,82.0151,99.9878
243,244,73555,659,2137,115.353,32.0402,57.9598,99.9758
244,245,7605,2678,2036,108.743,21.9701,68.0299,99.9915
245,246,11354,2049,2073,296.447,17.041,72.959,99.8541
246,247,11886,2791,2039,273.972,65.6775,24.3225,99.9968
247,248,779,2014,2020,79.1243,65.2575,24.7425,99.9686
248,249,2069,357,2024,226.423,85.95,4.04997,99.9112
249,250,9895,294,2064,96.2445,53.4701,36.5299,99.9778
250,251,9831,122,2089,95.5868,49.8785,40.1215,99.6523
251,252,13521,1344,2108,299.539,45.9914,44.0086,99.9424
252,253,128480,2383,2283,115.257,7.313569999999999,82.6864,99.7607
253,254,4562,2136,2113,291.375,40.7681,49.2319,99.9558
254,255,1235,2616,2104,90.8808,44.2024,45.7976,99.9942
255,256,4862,2668,2122,122.764,1.0033299999999998,88.9967,99.9941
256,257,7134,2718,2160,91.0065,43.4993,46.5007,99.9792
257,258,7274,845,2163,109.324,27.347,62.653,99.9872
258,259,5680,3351,2220,113.545,8.60341,81.3966,99.983
259,260,4236,1656,2153,111.349,9.83173,80.1683,99.9916
260,261,864,314,2133,254.847,59.2829,30.7171,99.9908
261,262,4955,2234,2153,166.709,75.6742,14.3258,99.8858
262,263,1970,293,2163,108.581,30.8609,59.1391,99.9689
263,264,1104,1414,2159,284.529,52.3476,37.6524,99.9843
264,265,2191,2161,2180,301.213,18.1002,71.8998,99.9948
265,266,3114,268,2218,215.191,85.7323,4.26767,99.9496
266,267,20148,145,2249,106.419,29.8178,60.1822,99.9647
267,268,214398,2855,2489,277.809,54.4934,35.5066,99.8525
268,269,523,234,2189,119.91,21.8509,68.1491,99.9753
269,270,2382,315,2220,231.735,86.9646,3.03538,99.993
270,271,1632,2103,2226,313.971,45.3372,44.6628,99.9813
271,272,48490,1569,2362,276.523,45.3818,44.6182,99.9132
272,273,25267,347,2334,283.846,47.2293,42.7707,99.8603
273,274,23643,3245,2344,285.668,46.892,43.108,99.9549
274,275,161937,1975,2506,120.116,1.52797,88.47200000000002,83.7977
275,276,51163,775,2397,302.402,20.6771,69.3229,99.9266
276,277,510,233,2296,281.282,48.2578,41.7422,99.9582
277,278,52792,188,2490,300.576,22.9512,67.0488,99.5479
278,279,3564,3087,2323,268.904,52.5161,37.4839,99.9972
279,280,60279,1002,2447,242.43400000000003,43.6591,46.3409,99.87
280,281,2710,3032,2331,269.993,53.2582,36.7418,99.9913
281,282,3831,243,2368,282.643,47.8036,42.1964,99.9666
282,283,11184,2277,2392,303.701,10.0582,79.9418,99.9945
283,284,16587,1328,2390,283.962,38.4834,51.5166,99.9841
284,285,2174,1263,2350,312.228,10.2416,79.7584,99.9755
285,286,1117,915,2347,305.348,35.3444,54.6556,99.9959
286,287,1387,3350,2368,111.495,0.498764,89.5012,99.9827
287,288,1233,3124,2372,262.31,55.7405,34.2595,99.9924
288,289,581,2362,2381,170.168,76.1918,13.8082,99.9874
289,290,668,910,2379,308.072,7.846789999999999,82.1532,99.9814
290,291,11960,2047,2439,125.534,6.988169999999998,83.0118,99.9832
291,292,16152,3328,2498,305.125,34.344,55.65600000000001,99.9603
292,293,63769,1158,2586,313.699,11.2606,78.7394,91.512
293,294,5070,2607,2447,73.4475,65.14,24.86,99.9903
294,295,4093,1647,2442,107.62,7.63743,82.3626,99.997
295,296,1740,1384,2429,307.303,5.57639,84.4236,99.9928
296,297,115255,2405,2744,122.396,3.6526,86.3474,78.4286
297,298,3072,3265,2468,274.883,39.4296,50.5704,99.9711
298,299,1044,3211,2450,264.022,55.8777,34.1223,99.9808
299,300,8531,1338,2498,102.657,35.3902,54.6098,99.9907
300,301,540,23,2472,58.473,49.137,40.863,99.862
301,302,500,1414,2476,318.933,52.4297,37.5703,99.9875
302,303,20363,1610,2557,119.516,65.1386,24.8614,99.9538
303,304,87129,138,2776,103.018,56.5678,33.4322,99.7956
304,305,65595,3227,2700,84.3474,71.3552,18.6448,99.972
305,306,5568,1382,2556,267.993,57.0542,32.9458,99.8986
306,307,11874,1481,2593,124.232,6.48087,83.5191,99.8442
307,308,81820,2665,2780,303.373,11.1329,78.8671,99.8872
308,309,1710,14,2600,105.623,10.7078,79.2922,99.9677
309,310,25898,1831,2651,97.2421,68.8622,21.1378,99.9877
310,311,1019,1309,2593,316.685,34.5055,55.4945,99.9901
311,312,113534,909,2803,304.785,21.3197,68.6803,99.8821
312,313,2583,2368,2610,311.715,28.6457,61.3543,99.9958
313,314,5992,797,2630,307.784,12.4522,77.5478,99.9906
314,315,11533,1355,2644,301.54,19.5554,70.4446,99.9914
315,316,15730,3067,2689,125.436,21.5121,68.4879,99.9928
316,317,8180,1609,2662,302.939,19.1362,70.8638,99.9831
317,318,593,1695,2635,123.139,25.491,64.509,99.996
318,319,4572,2302,2680,311.499,42.4201,47.5799,99.9975
319,320,13839,693,2691,105.731,24.706,65.294,99.9799
320,321,1011,1688,2664,222.285,70.0242,19.9758,99.9973
321,322,1944,1503,2680,312.964,53.0541,36.9459,99.9945
322,323,19201,1586,2731,242.368,70.9272,19.0728,92.3106
323,324,58127,1255,2826,309.187,11.8642,78.1358,99.6431
324,325,34251,2126,2756,186.137,73.1159,16.8841,99.97
325,326,24116,1843,2792,303.875,24.6549,65.3451,99.9613
326,327,584,263,2728,96.7732,55.9412,34.0588,99.9624
327,328,1566,1728,2741,77.3494,84.2853,5.71474,99.9982
328,329,14473,595,2794,107.107,20.8419,69.1581,99.917
329,330,858,1951,2754,102.849,74.6106,15.3894,99.9848
330,331,75439,1566,2881,111.678,42.9716,47.0284,99.9528
331,332,4444,3000,2779,118.949,7.876689999999999,82.1233,99.9914
332,333,5744,692,2809,108.365,53.0561,36.9439,99.9213
333,334,1313,2499,2778,132.744,27.3204,62.6796,99.9669
334,335,64837,3059,2943,125.524,53.81100000000001,36.189,72.357
335,336,8841,3069,2830,129.18200000000002,24.8315,65.1685,99.9897
336,337,4956,353,2837,293.585,82.3537,7.64625,99.9873
337,338,965,439,2827,107.238,20.9067,69.0933,99.2504
338,339,53625,2029,2926,291.09,58.1816,31.8184,99.9427
339,340,15663,601,2905,108.213,20.4869,69.5131,99.8702
340,341,12533,482,2904,116.915,0.366951,89.633,99.8185
341,342,11147,3299,2919,114.08,10.1539,79.8461,99.9898
342,343,6186,1849,2912,99.6197,46.6281,43.3719,99.985
343,344,6915,358,2907,115.452,12.5232,77.4768,99.9693
344,345,1751,2199,2900,91.1126,43.92,46.08,99.9962
345,346,5088,1763,2922,304.0540000000001,28.7915,61.2085,99.9735
346,347,2917,2625,2909,116.471,14.4351,75.5649,99.9827
347,348,9222,2571,2950,126.0,72.4049,17.5951,99.9713
348,349,6159,1373,2948,306.027,30.0466,59.9534,99.9823
349,350,21447,2751,2973,112.209,18.4731,71.5269,99.9822
350,351,504,329,2924,292.833,24.9729,65.0271,99.9938
351,352,4393,2221,2967,299.116,7.7507,82.2493,99.9911
352,353,3079,1279,2969,298.579,11.1543,78.8457,99.9822
353,354,1607,681,2969,299.519,4.30823,85.6918,99.9913
354,355,3738,1782,2981,300.06,2.25221,87.7478,99.981
355,356,643,2293,2993,312.724,27.9356,62.0644,99.9922
356,357,734,2261,2994,306.092,27.0975,62.9025,99.9961
357,358,2279,3285,3018,123.887,8.80875,81.1913,99.9834
