,Grain No.,Size [Pixel],center x-coordinate,center y-coordinate,mean azimuth [degree],mean latitude [degree],mean colatitude [degree],Regelungsgrad [%]
0,1,945,1897,38,95.7319,19.636,70.36399999999999,99.9921
1,2,3504,1970,50,324.439,51.4331,38.5669,99.6644
2,3,13654,1910,101,169.90400000000002,66.8157,23.1843,99.8075
3,4,23401,2148,90,278.355,7.195689999999999,82.8043,99.9312
4,5,4715,2308,76,292.184,53.2762,36.7238,99.9783
5,6,672,2415,50,310.784,24.4855,65.5145,99.9919
6,7,29432,255,138,102.825,46.0361,43.9639,99.9803
7,8,18305,2499,104,119.839,42.5611,47.4389,99.9125
8,9,2623,2657,85,282.468,47.4395,42.5605,99.9688
9,10,768,2741,60,278.934,47.7824,42.2176,99.978
10,11,1277,2805,63,27.3107,5.7663,84.2337,99.7553
11,12,549,1478,59,34.1733,65.0292,24.9708,99.9686
12,13,1569,408,94,273.541,47.1402,42.8598,99.9788
13,14,12941,1469,105,69.4104,69.6638,20.3362,99.9715
14,15,2113,1634,91,259.878,52.0905,37.9095,99.8902
15,16,4941,1725,101,271.913,2.65721,87.3428,99.9739
16,17,2053,2780,85,322.296,69.303,20.697,99.8148
17,18,2090,1309,104,285.244,3.4616,86.5384,99.9883
18,19,3174,1228,102,284.658,42.4352,47.5648,99.9819
19,20,4344,463,117,252.903,83.2467,6.75325,45.8677
20,21,3940,979,95,75.8478,66.0504,23.9496,99.9644
21,22,1980,1126,102,233.492,12.0462,77.9538,99.9514
22,23,3287,2704,119,118.947,42.6441,47.3559,99.9402
23,24,4791,588,108,92.0568,54.4793,35.5207,99.94
24,25,619,757,93,287.273,41.4047,48.5953,99.9679
25,26,2709,826,103,287.733,41.7063,48.2937,99.973
26,27,1509,704,106,286.539,41.0152,48.9848,99.991
27,28,569,2356,107,110.878,33.5455,56.4545,99.9844
28,29,1197,2834,108,297.8040000000001,78.2691,11.7309,99.8625
29,30,794,938,124,76.8343,65.8698,24.1302,99.9939
30,31,689,869,123,74.9829,75.4699,14.5301,99.9935
31,32,1416,2866,127,245.19,80.7789,9.22108,99.8955
32,33,587,1755,124,172.62900000000005,67.235,22.765,99.9959
33,34,8666,994,166,277.522,5.73359,84.2664,99.8993
34,35,1684,2380,136,112.738,33.9647,56.0353,99.9882
35,36,43715,1135,277,235.407,12.0587,77.9413,99.8376
36,37,4566,1200,160,285.504,42.7001,47.2999,99.9953
37,38,24106,871,233,74.7454,74.7495,15.2505,99.9646
38,39,1418,1313,144,285.15,3.61039,86.3896,99.9983
39,40,10118,633,186,95.0453,53.2225,36.7775,99.9818
40,41,26693,1550,199,89.1651,74.7144,15.2856,93.9671
41,42,923,2939,157,77.2379,31.8111,58.1889,99.8647
42,43,525,559,140,93.3067,54.091,35.909,99.9854
43,44,69373,787,388,294.379,28.6991,61.3009,99.744
44,45,619,512,147,292.18,11.3921,78.6079,99.7774
45,46,2005,1260,166,97.7902,2.21605,87.78399999999998,99.9948
46,47,20364,1863,184,171.43900000000005,66.2169,23.7831,99.8791
47,48,5467,1347,190,94.8344,50.8168,39.1832,99.9935
48,49,1599,1704,155,272.711,2.37377,87.6262,99.9807
49,50,15412,139,265,102.559,60.4016,29.5984,99.9609
50,51,3500,2067,166,280.657,7.204389999999999,82.7956,99.9919
51,52,33422,2118,270,104.645,39.3109,50.6891,99.9588
52,53,8777,2241,194,278.685,5.45556,84.5444,99.9903
53,54,4798,2707,179,120.89,42.3961,47.6039,99.9948
54,55,142155,2715,443,280.529,35.1375,54.8625,44.6262
55,56,2364,436,177,273.528,47.2287,42.7713,99.9973
56,57,631,497,172,291.69,10.1639,79.8361,99.997
57,58,4835,2883,208,124.135,48.4868,41.5132,99.9476
58,59,6557,554,218,295.81,28.2134,61.7866,99.9899
59,60,18955,2386,226,113.336,33.0247,56.9753,99.954
60,61,9611,2639,235,256.324,59.2009,30.7991,99.9495
61,62,13942,2812,243,125.735,47.9112,42.0888,99.9939
62,63,7799,302,232,103.488,45.8425,44.1575,99.9922
63,64,3471,1284,220,82.4839,72.5378,17.4622,99.9644
64,65,2412,3040,207,19.4381,13.3121,76.6879,99.3074
65,66,3415,3208,218,265.498,44.7728,45.2272,99.8658
66,67,19917,440,326,82.7569,53.4857,36.5143,99.9738
67,68,8316,377,254,248.079,40.9835,49.0165,99.9793
68,69,5954,1426,232,81.986,27.2862,62.7138,99.9928
69,70,4231,1738,233,68.1183,64.0262,25.9738,99.9966
70,71,554,3107,221,100.809,5.3476599999999985,84.6523,99.9962
71,72,852,3135,234,269.185,43.7809,46.2191,99.9974
72,73,7548,1588,273,86.9021,1.7559,88.2441,99.9902
73,74,9887,1926,286,76.97399999999998,22.2811,67.7189,99.9413
74,75,2298,3277,257,271.236,40.7893,49.2107,99.9572
75,76,687,2982,249,266.879,53.9755,36.0245,93.9013
76,77,2898,1351,267,284.4190000000001,38.3087,51.6913,99.9973
77,78,9751,2750,320,269.63,46.0103,43.9897,99.9882
78,79,1327,2286,264,291.119,27.3679,62.6321,99.9974
79,80,3058,1830,272,111.179,70.0207,19.9793,99.9968
80,81,5516,3083,284,99.8565,5.07009,84.9299,99.8915
81,82,6057,1657,315,131.284,66.85600000000001,23.144,99.9921
82,83,17635,1988,381,266.707,18.4626,71.5374,99.8312
83,84,10036,2980,322,87.9502,15.2915,74.7085,99.9403
84,85,7528,516,307,251.12,41.8465,48.1535,99.9927
85,86,10682,997,340,107.899,7.5467,82.4533,99.956
86,87,3484,1159,317,82.0973,46.9673,43.0327,99.9493
87,88,11140,584,347,253.18,35.5822,54.4178,99.97
88,89,1673,3323,290,291.184,5.00204,84.99799999999998,99.9925
89,90,11025,1696,370,278.728,34.4798,55.5202,99.8623
90,91,31429,229,381,108.319,60.652,29.348000000000006,99.9618
91,92,5608,1449,314,276.742,47.9496,42.0504,99.9863
92,93,7023,2268,321,151.467,55.4585,34.5415,99.9393
93,94,6680,2673,334,277.887,8.417760000000001,81.5822,99.9889
94,95,614,3167,296,265.526,45.1453,44.8547,99.9789
95,96,3608,1779,337,81.0292,22.5775,67.4225,99.9974
96,97,765,901,301,98.1316,1.16042,88.8396,99.9993
97,98,737,2346,309,130.827,48.0357,41.9643,99.9888
98,99,1823,1319,333,233.907,6.87144,83.1286,99.994
99,100,8114,1846,360,291.073,55.1078,34.8922,99.9868
100,101,942,3225,324,271.188,40.2255,49.7745,99.9839
101,102,3393,1389,342,84.65,12.5363,77.4637,99.9918
102,103,4761,2387,339,147.803,56.3272,33.6728,99.9804
103,104,2798,873,340,238.268,21.3931,68.6069,99.9851
104,105,15278,1245,428,85.3497,50.2509,39.7491,99.8693
105,106,774,3056,324,96.2108,5.74819,84.2518,99.996
106,107,591,3307,321,291.307,5.4283800000000015,84.5716,99.9955
107,108,611,3346,323,290.686,5.20634,84.7937,99.9923
108,109,10848,3118,368,84.8097,62.4526,27.5474,99.9877
109,110,855,676,344,273.526,24.1895,65.8105,99.118
110,111,1540,1537,344,259.153,51.8034,38.1966,99.9958
111,112,608,915,343,246.472,24.6449,65.3551,99.4245
112,113,1340,2322,352,101.685,46.5598,43.4402,99.9963
113,114,199407,3177,646,291.367,5.07522,84.9248,99.9002
114,115,3037,1595,364,174.801,69.2873,20.7127,99.9982
115,116,1020,2458,363,144.23,54.144,35.856,99.981
116,117,11901,2409,426,117.026,36.7985,53.2015,99.9433
117,118,15510,1371,438,284.743,22.8085,67.1915,99.9874
118,119,18002,1509,428,129.18200000000002,65.0779,24.9221,99.8927
119,120,1106,1930,376,278.011,6.5359099999999986,83.4641,99.9944
120,121,1449,358,387,249.049,41.8535,48.1465,99.9953
121,122,1897,623,388,286.4170000000001,63.6623,26.3377,99.9969
122,123,22951,2283,483,269.41,40.7284,49.2716,99.9566
123,124,2152,2184,400,276.23900000000003,38.0875,51.9125,99.9967
124,125,53633,2068,547,245.46,10.5272,79.4728,99.9593
125,126,683,561,390,105.908,30.5994,59.4006,99.996
126,127,578,1901,397,281.689,6.08469,83.9153,99.9837
127,128,6349,326,427,80.1564,54.4524,35.5476,99.9963
128,129,13478,616,451,104.95,12.8218,77.1782,99.9878
129,130,20791,1728,469,78.7599,66.7915,23.2085,96.3143
130,131,57313,1014,568,113.563,44.5692,45.4308,99.4257
131,132,796,2223,420,109.084,47.764,42.236,99.9982
132,133,1724,3041,431,256.631,43.437,46.563,99.9908
133,134,598,1190,426,89.3535,50.0523,39.9477,99.9946
134,135,2339,1866,436,286.266,3.45854,86.5415,99.9907
135,136,19979,356,608,252.901,35.8375,54.1625,99.9614
136,137,84430,519,651,108.32,8.20887,81.7911,99.98
137,138,17071,2437,532,251.667,49.4957,40.5043,94.343
138,139,696,2187,484,104.919,47.3541,42.6459,99.9787
139,140,16514,180,531,117.201,73.862,16.137999999999998,99.9362
140,141,7751,1891,526,100.447,10.1794,79.8206,99.1684
141,142,29568,1328,607,264.692,51.7282,38.2718,99.9885
142,143,33426,1574,576,102.954,22.234,67.766,98.1693
143,144,13622,274,597,293.283,36.1329,53.8671,99.9857
144,145,670,1425,524,97.9376,20.995,69.005,99.9474
145,146,19323,1196,615,266.595,57.1604,32.8396,99.9767
146,147,2449,2175,550,107.571,10.8936,79.1064,99.9977
147,148,19109,1809,607,97.5961,39.2657,50.7343,99.9796
148,149,1720,899,566,237.217,64.8452,25.1548,99.9953
149,150,3038,701,565,240.331,68.9027,21.0973,99.9744
150,151,42081,2465,717,100.339,26.7626,63.2374,99.7247
151,152,10997,2924,593,271.443,32.5359,57.4641,99.9746
152,153,5020,2823,609,280.06,13.6828,76.3172,99.9961
153,154,11902,2202,641,286.755,4.59644,85.4036,99.9969
154,155,5735,2311,631,286.086,72.4029,17.5971,99.9942
155,156,925,1917,608,271.151,49.744,40.256,99.9953
156,157,609,1720,612,110.974,11.4021,78.5979,99.9972
157,158,12021,159,658,286.564,9.98808,80.0119,99.9888
158,159,40143,1571,747,248.174,44.2485,45.7515,99.9542
159,160,2270,812,648,107.752,41.7601,48.2399,99.9987
160,161,986,762,633,267.78700000000003,55.4796,34.5204,99.9629
161,162,3725,1964,650,269.291,50.4704,39.5296,99.9619
162,163,3089,2943,659,93.7939,38.5262,51.4738,99.9943
163,164,2533,1145,651,252.058,66.0941,23.9059,99.999
164,165,1765,667,652,113.089,42.8582,47.1418,99.994
165,166,4107,2614,663,69.8108,6.645969999999998,83.354,99.9621
166,167,731,740,661,271.943,55.2361,34.7639,99.993
167,168,789,1882,660,282.896,64.0846,25.9154,99.9913
168,169,52868,1787,796,279.105,2.67049,87.3295,99.9264
169,170,617,2858,656,256.001,44.102,45.898,99.9938
170,171,2321,943,694,87.2461,24.2238,65.7762,99.9683
171,172,2322,2559,686,281.94,46.0177,43.9823,99.8993
172,173,633,693,674,272.955,55.1089,34.8911,99.9866
173,174,2438,1433,699,228.731,61.2069,28.7931,99.9759
174,175,23161,2312,798,271.099,54.9103,35.0897,99.9899
175,176,1808,1932,688,115.264,57.8552,32.1448,99.9966
176,177,4163,784,702,269.649,18.5175,71.4825,99.9994
177,178,21818,2204,764,120.672,9.56463,80.4354,99.9177
178,179,19482,2791,753,74.4924,63.17100000000001,26.829,99.9677
179,180,3377,1125,711,263.695,56.9881,33.0119,99.9967
180,181,13671,857,752,103.45,75.7393,14.2608,99.9844
181,182,6061,734,745,108.42,40.5835,49.4165,99.95
182,183,2188,631,714,110.548,45.2488,44.7512,99.9926
183,184,41951,2702,860,268.998,49.5623,40.4377,99.9753
184,185,18354,2007,777,111.19,12.6006,77.3994,99.5406
185,186,42449,1325,828,225.06,65.8647,24.1353,99.0394
186,187,12321,2565,869,270.722,49.6921,40.3079,99.9909
187,188,5275,110,776,319.673,64.8144,25.1856,99.9102
188,189,4007,234,756,284.208,26.8085,63.1915,99.9643
189,190,1411,672,736,268.612,20.2265,69.7735,99.9922
190,191,3377,173,750,109.659,56.9532,33.0468,99.9957
191,192,20556,317,815,108.253,59.0703,30.9297,99.9627
192,193,54859,1135,880,110.458,58.1309,31.8691,95.7492
193,194,7491,953,785,102.128,41.6689,48.3311,99.9539
194,195,18136,654,836,252.043,42.7531,47.2469,99.9928
195,196,4094,2929,806,22.3189,85.126,4.87399,99.9722
196,197,2519,1465,799,91.031,4.23885,85.7611,99.9185
197,198,1618,2071,830,289.425,1.31238,88.6876,99.8881
198,199,9212,185,843,109.585,52.3096,37.6904,99.9968
199,200,43388,2162,986,103.274,12.5138,77.4862,68.9843
200,201,1125,750,821,270.395,17.9576,72.0424,99.999
201,202,1491,794,826,270.082,17.9394,72.0606,99.9983
202,203,121148,2625,1030,100.734,27.3817,62.6183,46.4932
203,204,45526,954,983,164.965,88.1766,1.82338,50.6655
204,205,9607,435,887,113.734,65.5036,24.4964,99.9952
205,206,10310,3197,885,307.222,68.632,21.368,99.9935
206,207,4617,3364,874,119.501,47.2538,42.7462,99.9229
207,208,818,831,849,47.2369,75.476,14.524,99.99
208,209,22296,2372,911,118.967,9.99388,80.0061,99.9743
209,210,1030,864,858,99.6758,45.0447,44.9553,99.9924
210,211,5741,1454,883,195.169,67.1992,22.8008,99.9864
211,212,5622,780,886,284.288,32.8057,57.1943,99.9934
212,213,78549,1873,998,106.645,10.9214,79.0786,99.9423
213,214,564,114,867,274.284,37.3853,52.6147,99.9911
214,215,16611,1548,936,88.0161,82.2995,7.70046,99.9678
215,216,4011,126,924,69.4013,33.2125,56.7875,99.9526
216,217,12194,533,931,274.409,32.7596,57.2404,99.9872
217,218,5240,850,922,99.8756,41.6507,48.3493,99.9865
218,219,2940,696,916,109.963,42.3872,47.6128,99.9981
219,220,2249,295,904,275.88,36.2327,53.7673,99.9885
220,221,44077,1363,1059,104.353,61.8041,28.1959,99.8321
221,222,29212,3302,1006,93.9591,5.41829,84.5817,99.9537
222,223,73009,342,1039,126.74,81.9643,8.03572,74.4654
223,224,683,347,918,117.344,62.7613,27.2387,99.994
224,225,11806,657,1002,314.079,66.1657,23.8343,99.9463
225,226,7133,631,972,277.893,61.2416,28.7584,99.9619
226,227,1978,1627,955,69.8791,81.5775,8.42245,99.9685
227,228,11257,3128,969,250.037,32.6232,57.3768,99.9696
228,229,2509,785,960,253.306,44.8323,45.1677,99.9969
229,230,1072,1364,952,91.4293,5.5623,84.4377,99.9947
230,231,16303,783,1061,165.144,83.3162,6.6837800000000005,99.9026
231,232,1377,109,1014,267.04900000000004,24.1544,65.8456,99.9648
232,233,2279,1629,1012,115.401,62.5233,27.4767,99.8617
233,234,674,2205,1015,90.8245,69.0081,20.9919,99.9898
234,235,142892,3062,1203,35.574,80.5156,9.48438,95.4598
235,236,18243,1597,1079,101.545,41.0018,48.9982,98.061
236,237,4003,1165,1067,273.759,14.7457,75.2543,99.9972
237,238,1884,1100,1060,112.627,16.514,73.486,99.9981
238,239,9562,127,1117,270.445,29.2328,60.7672,99.9928
239,240,1671,635,1067,275.086,61.4885,28.5115,99.9791
240,241,18558,217,1170,296.999,52.0281,37.9719,99.996
241,242,37507,657,1196,99.9522,55.9751,34.0249,99.9902
242,243,1402,965,1096,275.258,3.53506,86.4649,99.9878
243,244,38923,1194,1199,112.733,37.1208,52.8792,99.9881
244,245,18987,2096,1141,275.942,52.8547,37.1453,99.9889
245,246,41740,1476,1236,291.931,54.4451,35.5549,97.6067
246,247,4343,558,1122,316.27,65.8624,24.1376,99.9697
247,248,629,2505,1108,80.5894,19.6279,70.3721,99.9549
248,249,68842,1784,1215,234.55900000000003,61.2102,28.7898,99.9587
249,250,4097,3369,1150,294.81,49.0588,40.9412,99.9239
250,251,3617,1028,1158,249.156,15.4922,74.5078,99.9955
251,252,10442,890,1177,117.318,5.13889,84.8611,99.9986
252,253,1791,2794,1141,77.7532,18.0189,71.9811,99.9957
253,254,58173,2507,1263,281.098,64.1193,25.8807,98.1305
254,255,23673,984,1297,112.674,32.5218,57.4782,98.3618
255,256,2037,2362,1177,66.5411,66.6268,23.3732,99.9962
256,257,1039,2774,1170,92.072,5.17287,84.8271,99.9425
257,258,7611,2735,1204,98.5742,37.2294,52.7706,99.9926
258,259,7222,2011,1221,275.66700000000003,41.8607,48.1393,99.9706
259,260,10099,368,1218,249.756,82.6004,7.399560000000001,99.9907
260,261,2094,1089,1202,270.018,11.1855,78.8145,99.9961
261,262,19534,2280,1244,97.9918,53.2969,36.7031,99.869
262,263,38419,811,1329,105.212,25.341,64.65899999999999,99.9822
263,264,6333,500,1234,268.266,33.6337,56.3663,99.9577
264,265,976,3430,1221,196.953,37.3653,52.6347,99.5464
265,266,2765,1048,1237,287.376,27.7408,62.2592,99.9904
266,267,2007,1359,1217,257.35900000000004,57.6125,32.3875,99.9918
267,268,994,3342,1212,6.77458,82.1538,7.846239999999999,99.958
268,269,537,2814,1214,115.336,17.3929,72.6071,99.9972
269,270,3065,2157,1224,278.078,4.82677,85.1732,99.9954
270,271,5277,3366,1266,101.215,7.79828,82.2017,99.9391
271,272,12184,498,1314,85.2915,11.5998,78.4002,99.9673
272,273,5152,906,1287,252.108,14.8072,75.1928,99.9903
273,274,1810,2230,1239,264.976,52.726000000000006,37.274,99.9961
274,275,1780,301,1243,269.325,63.4609,26.5391,99.9951
275,276,763,2847,1251,33.8218,83.3688,6.63123,99.9869
276,277,1722,2123,1254,283.871,12.2602,77.7398,99.9315
277,278,17236,171,1301,265.748,64.135,25.865,99.9664
278,279,6988,2810,1311,96.782,44.1847,45.8153,99.973
279,280,4810,1104,1298,318.148,60.5381,29.4619,99.9891
280,281,10229,1286,1303,318.46,59.8223,30.1777,99.9946
281,282,42893,1945,1388,281.386,0.282066,89.7179,94.4184
282,283,4363,2112,1291,102.575,51.5294,38.4706,99.9862
283,284,3241,2707,1284,114.338,45.2966,44.7034,99.9958
284,285,714,2766,1261,351.601,84.7561,5.2439300000000015,99.9981
285,286,9465,420,1330,268.746,31.3415,58.6585,99.9781
286,287,2447,1551,1293,292.423,54.0862,35.9138,99.8829
287,288,5548,300,1316,265.073,35.4996,54.5004,99.9608
288,289,2226,2011,1306,289.678,13.5575,76.4425,99.9985
289,290,2417,2760,1306,256.873,55.8338,34.1662,99.9893
290,291,8044,2070,1349,244.285,48.1393,41.8607,99.9738
291,292,8332,649,1354,267.956,32.6073,57.3927,99.9542
292,293,566,1042,1302,85.1859,18.5898,71.4102,99.9988
293,294,2449,3280,1319,91.6145,55.0202,34.9798,99.994
294,295,39383,1495,1448,271.897,13.0342,76.9658,97.0483
295,296,11528,2238,1378,109.47,25.3805,64.6195,99.8818
296,297,1464,2649,1327,78.202,13.9578,76.0422,99.9966
297,298,1641,3306,1347,96.0471,53.827,36.173,99.9707
298,299,2776,2588,1338,114.295,64.5295,25.4705,99.995
299,300,18887,2734,1410,261.061,53.8358,36.1642,99.9665
300,301,36956,3205,1485,98.446,47.7622,42.2378,99.8091
301,302,1463,3368,1347,271.451,15.1032,74.8968,99.9619
302,303,3617,2857,1362,108.561,36.0428,53.9572,99.9935
303,304,5065,1125,1367,114.554,82.9485,7.05152,99.9841
304,305,4975,2157,1397,283.232,5.22671,84.7733,99.8269
305,306,6742,223,1392,64.3167,41.1914,48.8086,99.9778
306,307,788,1192,1360,112.883,36.5254,53.4746,99.9605
307,308,9367,1244,1406,288.605,12.3565,77.6435,99.9958
308,309,2379,1387,1383,278.183,19.8211,70.1789,99.9799
309,310,16501,2413,1411,288.311,11.4501,78.5499,99.9612
310,311,4662,2619,1411,278.366,40.1336,49.8664,99.9177
311,312,5122,1643,1415,95.3788,74.8564,15.1436,99.9959
312,313,5389,3096,1411,257.56,39.6818,50.3182,99.9928
313,314,2417,299,1385,80.7248,3.27922,86.7208,99.9956
314,315,19590,1319,1467,70.0763,30.2758,59.7242,95.9065
315,316,8764,573,1427,98.8682,18.3798,71.6202,99.9451
316,317,5957,395,1402,80.2185,63.2615,26.7385,99.9837
317,318,6957,3357,1409,186.061,77.1705,12.8295,99.9706
318,319,3984,697,1416,109.183,18.243,71.757,99.9917
319,320,907,2660,1401,281.045,41.8188,48.1812,99.9594
320,321,3071,1741,1404,85.9346,4.471,85.529,99.9907
321,322,50547,1065,1561,95.3822,21.8214,68.1786,91.9956
322,323,35817,2931,1527,102.954,26.455,63.545,99.6589
323,324,1387,2551,1398,274.288,69.4264,20.5736,99.9888
324,325,2502,110,1410,275.22,2.84033,87.1597,99.9931
325,326,4188,3294,1473,102.79,46.0884,43.9116,99.8764
326,327,2768,2108,1427,92.7419,13.9189,76.0811,99.994
327,328,1517,1683,1425,284.736,31.3317,58.6683,99.9727
328,329,3589,933,1429,102.72,52.394,37.606,99.993
329,330,12329,146,1495,265.981,28.9226,61.0774,99.1196
330,331,11732,3076,1520,287.137,35.138000000000005,54.862,99.6302
331,332,1330,636,1423,270.172,17.2241,72.7759,99.9994
332,333,540,990,1421,285.486,48.7969,41.2031,99.9796
333,334,5408,742,1457,259.688,47.2914,42.7086,99.982
334,335,1388,295,1427,262.025,22.1509,67.8491,99.9964
335,336,126600,1943,1724,101.659,42.4642,47.5358,68.0267
336,337,2923,1843,1444,294.69,60.6198,29.3802,99.9933
337,338,45862,325,1566,90.3492,1.99725,88.0027,99.7341
338,339,6646,2208,1470,109.485,71.6435,18.3565,99.9873
339,340,5598,484,1465,114.173,37.4867,52.5133,99.9283
340,341,9916,2548,1504,269.155,37.0388,52.9612,99.9816
341,342,1485,2581,1447,267.588,7.7617600000000015,82.2382,99.9928
342,343,1159,1951,1462,195.188,82.1629,7.83705,99.9887
343,344,1402,108,1457,257.587,65.3102,24.6898,99.9846
344,345,810,233,1452,272.762,36.0401,53.9599,99.9954
345,346,23464,2372,1518,115.004,45.6488,44.3512,91.0825
346,347,2423,3329,1480,93.5634,21.3409,68.6591,99.9839
347,348,5634,977,1487,257.245,64.8636,25.1364,99.9206
348,349,1733,2828,1489,97.5449,21.6736,68.3264,99.9625
349,350,2839,3380,1495,244.46,60.9467,29.0533,99.9658
350,351,12581,614,1524,271.02,18.478,71.52199999999998,99.6349
351,352,1082,1624,1478,103.157,53.4031,36.5969,99.9954
352,353,1599,2786,1487,250.221,26.3398,63.6602,99.9909
353,354,6995,2135,1529,275.016,56.9243,33.0757,99.8567
354,355,3996,815,1501,78.54,57.6101,32.3899,99.983
355,356,13123,899,1554,107.543,51.982,38.018,99.9925
356,357,1656,1682,1504,88.902,8.683760000000001,81.3162,99.9923
357,358,4602,2657,1524,219.966,81.4492,8.55082,79.688
358,359,5401,1619,1523,108.201,76.8734,13.1266,99.7371
359,360,761,693,1511,258.453,49.9951,40.0049,99.9837
360,361,1552,729,1518,103.36,37.1499,52.8501,99.9581
361,362,1246,3022,1518,83.6331,39.3235,50.6765,99.9873
362,363,2965,518,1535,78.4587,73.7106,16.2894,99.9858
363,364,12727,2788,1561,277.863,41.5254,48.4746,99.83
364,365,1855,2239,1535,239.343,73.1782,16.8218,99.7248
365,366,4993,3342,1588,91.8039,0.934929,89.0651,99.9643
366,367,2399,1546,1553,94.272,57.1945,32.8055,99.9514
367,368,3826,472,1576,91.8349,1.2285,88.7715,99.9894
368,369,69603,704,1682,109.06,21.0641,68.9359,99.9916
369,370,1807,415,1562,253.12,52.8507,37.1493,99.9901
370,371,2161,1691,1575,93.3039,24.6508,65.3492,99.9148
371,372,38507,1201,1702,98.4752,16.3325,73.6675,99.866
372,373,1144,205,1574,71.7391,70.7267,19.2733,99.9953
373,374,858,2498,1567,271.048,11.9381,78.0619,99.9874
374,375,1451,2195,1569,193.56,63.9259,26.0741,99.9968
375,376,28938,1433,1663,275.578,9.000060000000003,80.9999,95.4593
376,377,20285,1598,1660,262.265,34.4269,55.5731,99.9685
377,378,3241,2110,1596,286.422,14.4815,75.5185,99.9383
378,379,3142,2667,1581,108.997,37.7296,52.2704,99.9903
379,380,2397,166,1589,65.5892,71.654,18.346,99.9813
380,381,9021,2247,1626,84.1524,42.2499,47.7501,99.9421
381,382,17540,2577,1638,112.613,47.7097,42.2903,99.9698
382,383,3943,3074,1618,89.9048,16.1538,73.8462,99.9673
383,384,7675,1232,1623,276.92,29.5582,60.4418,99.9967
384,385,5580,534,1615,294.56,49.1022,40.8978,99.991
385,386,1028,115,1601,92.7711,30.1218,59.8782,99.9898
386,387,58965,2480,1824,266.112,6.07589,83.9241,52.0273
387,388,685,3300,1604,91.7531,1.27385,88.7262,99.9917
388,389,1787,1751,1600,310.199,59.7519,30.2481,99.998
389,390,1746,3274,1626,91.765,1.36877,88.6312,99.9916
390,391,1916,2172,1611,118.16,57.4221,32.5779,99.9979
391,392,5870,2866,1652,275.438,54.6448,35.3552,99.8411
392,393,2674,2325,1630,112.883,40.2735,49.7265,99.9949
393,394,35872,2764,1717,267.892,7.09377,82.9062,100.024
394,395,5623,452,1654,95.4561,53.4516,36.5484,99.9534
395,396,55857,3134,1753,109.79,28.097,61.903,99.9937
396,397,8066,150,1663,141.515,64.9355,25.0645,99.9698
397,398,1311,3383,1639,108.616,52.1935,37.8065,99.9545
398,399,17756,1714,1712,121.68,52.6657,37.3343,99.9817
399,400,3391,230,1667,250.645,59.4387,30.5613,99.8529
400,401,18883,2117,1713,257.03700000000003,62.2956,27.7044,99.994
401,402,5451,2312,1694,103.665,44.4045,45.5955,99.9984
402,403,5255,1804,1716,280.834,18.1135,71.8865,99.9959
403,404,12708,3342,1742,110.807,51.642,38.358,99.9278
404,405,1480,968,1692,85.0693,31.8573,58.1427,99.8857
405,406,574,2938,1693,103.361,27.0125,62.9875,99.9927
406,407,1356,512,1701,286.188,51.9744,38.0256,99.9944
407,408,54023,376,1869,265.983,9.95289,80.0471,42.8416
408,409,3889,2555,1720,268.302,36.0365,53.9635,99.992
409,410,19772,122,1859,253.509,71.4285,18.5715,99.9794
410,411,3418,1006,1731,280.226,25.7768,64.2232,99.961
411,412,1962,2266,1726,281.276,6.85992,83.1401,99.9941
412,413,1820,2638,1720,284.21,62.1695,27.8305,99.9904
413,414,19675,213,1809,79.6486,46.3516,43.6484,99.9909
414,415,26290,892,1826,99.8121,26.6661,63.3339,99.9446
415,416,1828,3283,1789,106.374,27.8729,62.1271,99.982
416,417,5031,266,1763,259.492,78.7806,11.2194,99.9955
417,418,679,940,1721,264.245,79.8839,10.1161,99.9816
418,419,69548,1412,1915,109.264,29.7725,60.2275,76.953
419,420,8812,2928,1769,94.6424,24.1756,65.8244,99.8933
420,421,2482,2398,1746,99.6659,54.8582,35.1418,99.9962
421,422,773,3434,1781,103.905,52.0603,37.9397,99.7959
422,423,1772,2249,1762,107.477,53.3999,36.6001,99.9881
423,424,1188,2609,1760,271.732,52.2824,37.7176,99.9934
424,425,581,2681,1749,266.464,52.4388,37.5612,99.9977
425,426,3838,2170,1776,106.019,1.30966,88.6903,99.9982
426,427,20226,2327,1840,265.204,24.9725,65.0275,99.9867
427,428,5474,1296,1798,255.063,35.6491,54.3509,99.9661
428,429,580,971,1762,267.534,80.5373,9.46265,99.9941
429,430,2221,1844,1779,266.77,5.7584800000000005,84.2415,99.9905
430,431,7663,1163,1815,254.167,34.7197,55.2803,99.9719
431,432,5450,1027,1798,266.29200000000003,27.7968,62.2032,99.9692
432,433,3658,782,1794,275.857,35.6157,54.3843,99.9965
433,434,28002,1629,1851,105.562,20.8404,69.1596,99.9804
434,435,3805,2544,1800,91.5838,44.4978,45.5022,99.9931
435,436,882,512,1789,263.30400000000003,33.048,56.952,99.9897
436,437,1758,2620,1797,111.044,49.3282,40.6718,99.9972
437,438,13502,2957,1875,266.818,1.67918,88.3208,87.5729
438,439,4074,2234,1824,97.1057,17.9149,72.0851,99.9878
439,440,1249,421,1802,271.541,3.5129,86.4871,99.9972
440,441,4814,567,1823,281.941,52.1581,37.8419,99.9956
441,442,3823,1759,1830,246.026,74.4671,15.5329,99.7673
442,443,2566,2659,1833,266.92,51.274,38.726,99.9735
443,444,4268,1827,1833,88.851,19.5199,70.4801,99.9741
444,445,7978,2144,1857,93.6357,21.7842,68.2158,99.9874
445,446,758,1883,1828,83.1992,36.1515,53.8485,99.9951
446,447,36221,636,1932,264.965,24.9472,65.0528,91.1224
447,448,16034,1070,1897,263.411,38.0372,51.9628,99.9946
448,449,20281,2711,1891,101.788,36.5314,53.4686,99.9532
449,450,625,2613,1829,102.379,50.77,39.23,99.8708
450,451,105842,2796,2073,87.0291,5.5179,84.4821,99.7359
451,452,913,431,1837,255.99,58.8327,31.1673,99.9966
452,453,1379,3372,1862,280.043,55.7333,34.2667,99.9334
453,454,8489,1892,1886,251.352,76.622,13.378,99.9946
454,455,40578,3177,1995,270.126,43.5704,46.4296,94.2225
455,456,6616,3296,1931,265.789,43.0876,46.9124,99.9606
456,457,1342,1230,1855,116.52,36.7081,53.2919,99.9981
457,458,3469,3021,1890,99.7591,32.9574,57.0426,99.9526
458,459,2791,527,1889,94.4123,27.1637,62.8363,99.9975
459,460,28734,831,1964,258.589,42.0328,47.9672,99.9722
460,461,14846,2208,1942,289.9890000000001,16.6617,73.3383,99.9468
461,462,19600,1200,1961,275.23400000000004,35.3554,54.6446,90.5954
462,463,15541,1783,1963,133.91,79.1941,10.8059,99.9695
463,464,2219,3144,1889,249.336,43.885,46.115,99.9794
464,465,4500,985,1936,252.885,77.8693,12.1307,99.9847
465,466,1462,158,1906,104.856,58.9955,31.0045,99.9932
466,467,865,2365,1915,282.165,59.5733,30.4267,99.9949
467,468,5941,3054,1964,257.747,47.1158,42.8842,99.9737
468,469,3913,3359,1972,276.015,55.7458,34.2542,99.9434
469,470,1672,1703,1937,273.098,75.1546,14.8454,99.9773
470,471,72671,2256,2089,101.924,0.5036470000000001,89.4964,84.3152
471,472,2986,1883,1965,268.892,16.3855,73.6145,99.9979
472,473,84594,1681,2162,86.8341,10.6118,79.3882,99.9815
473,474,1047,2389,1959,281.983,59.6139,30.3861,99.9904
474,475,1218,1257,1975,276.546,2.93415,87.0658,99.995
475,476,3086,91,2002,215.861,82.2097,7.790260000000001,99.8973
476,477,19258,475,2101,101.934,16.2266,73.7734,83.0261
477,478,7316,1089,2015,259.548,58.88399999999999,31.116,99.9809
478,479,3239,1702,2035,260.10900000000004,48.6434,41.3566,99.9791
479,480,3954,1895,2041,268.04900000000004,17.0474,72.9526,99.9861
480,481,45922,298,2098,265.703,38.4697,51.5303,99.9992
481,482,1781,1011,2010,91.1806,61.5804,28.4196,99.8998
482,483,634,2534,2011,268.083,2.96105,87.0389,99.9043
483,484,942,1149,2024,265.965,37.7312,52.2688,99.9975
484,485,1074,2990,2026,96.8477,74.8829,15.1171,99.9902
485,486,1331,1863,2025,86.8241,28.2722,61.7278,99.9795
486,487,733,141,2029,96.9873,34.9453,55.0547,99.9781
487,488,101236,921,2325,99.9534,52.9429,37.0571,64.531
488,489,22084,3330,2119,136.403,80.5631,9.4369,97.8217
489,490,19248,681,2098,266.956,43.0888,46.9112,99.9934
490,491,5438,569,2059,279.996,32.1601,57.8399,99.994
491,492,11551,2545,2137,99.832,12.5063,77.4937,99.9923
492,493,5794,1777,2066,227.113,81.4342,8.56575,99.9964
493,494,4756,1266,2097,265.101,54.4745,35.5255,99.9876
494,495,909,1427,2053,113.448,37.916,52.084,99.8613
495,496,18948,3071,2131,276.579,7.55248,82.4475,99.9621
496,497,3387,1045,2097,275.285,80.8424,9.15764,99.9872
497,498,1662,1931,2069,84.97,29.1795,60.8205,99.9978
498,499,15105,105,2147,88.0465,12.7996,77.2004,99.9793
499,500,9974,1169,2101,101.096,45.2094,44.7906,99.976
500,501,13196,800,2127,278.213,52.8489,37.1511,99.9968
501,502,1610,1986,2097,101.527,24.6661,65.3339,99.933
502,503,8861,1351,2128,98.664,49.0589,40.9411,99.9949
503,504,1595,1836,2094,224.462,83.3283,6.67174,99.9972
504,505,1807,3239,2113,153.963,76.7394,13.2606,99.9949
505,506,7588,1065,2168,122.085,39.1483,50.8517,99.8667
506,507,647,1957,2103,75.2654,62.2026,27.7974,99.9531
507,508,12890,583,2172,81.2415,50.0312,39.9688,99.9802
508,509,8926,1885,2157,291.045,64.2777,25.7223,99.9928
509,510,43935,2293,2233,100.335,62.0952,27.9048,99.8939
510,511,1442,1939,2132,104.534,3.5398400000000003,86.4602,99.9946
511,512,1378,1797,2126,98.7463,53.7919,36.2081,99.9943
512,513,1540,1440,2131,270.656,7.47727,82.5227,99.9766
513,514,11801,830,2210,125.268,41.0151,48.9849,99.9835
514,515,4264,1985,2186,78.6474,60.6504,29.3496,99.9323
515,516,1101,3218,2146,102.289,41.4709,48.5291,99.9903
516,517,94492,1321,2316,270.293,12.3488,77.6512,75.7084
517,518,4985,1215,2177,120.353,48.2904,41.7096,99.9864
518,519,10144,1319,2208,106.916,62.6032,27.3968,99.9755
519,520,693,1987,2160,275.348,11.7966,78.2034,99.9882
520,521,32941,3013,2247,75.41,76.1821,13.8179,99.9673
521,522,34591,197,2303,99.2856,7.853839999999999,82.1462,99.9935
522,523,936,1133,2173,253.645,51.5506,38.4494,99.9917
523,524,4170,2634,2196,282.503,12.51,77.49,99.9959
524,525,5156,3209,2201,85.4044,77.0015,12.9985,100.0
525,526,7836,2505,2229,100.285,69.1585,20.8415,99.9709
526,527,8381,703,2233,275.711,15.5256,74.4744,99.9934
527,528,9063,1118,2246,254.217,36.7354,53.2646,99.9195
528,529,3245,3351,2223,141.361,76.4747,13.5253,99.8334
529,530,1614,3394,2210,147.031,80.3228,9.67719,99.93
530,531,948,2236,2193,271.159,42.6492,47.3508,99.9965
531,532,1256,346,2206,220.773,60.3133,29.6867,99.9978
532,533,5359,2654,2254,104.838,46.2325,43.7675,99.9662
533,534,25864,1964,2318,274.89,24.6656,65.3344,99.8416
534,535,54974,382,2405,279.252,10.9826,79.0174,99.7198
535,536,895,485,2240,33.946,84.0884,5.911569999999998,99.9846
536,537,21667,551,2323,103.862,1.19326,88.8067,99.9788
537,538,3768,3203,2261,102.268,9.97802,80.02199999999998,99.9171
538,539,792,1053,2255,264.097,47.683,42.317,99.9939
539,540,1705,2733,2259,89.4249,65.5197,24.4803,99.9966
540,541,1034,409,2256,285.213,0.355904,89.6441,99.9242
541,542,4754,2465,2289,265.606,36.9656,53.0344,99.9292
542,543,4020,3278,2288,266.456,37.2151,52.7849,99.9521
543,544,779,444,2274,275.48900000000003,4.43085,85.5692,99.9881
544,545,10648,655,2336,267.29900000000004,13.8114,76.1886,99.9888
545,546,33830,2604,2365,103.474,12.9176,77.0824,99.9703
546,547,13357,99,2411,99.0426,35.8302,54.1698,99.7174
547,548,1228,1395,2288,270.903,12.0492,77.9508,99.9971
548,549,4530,2231,2335,282.591,26.6193,63.3807,99.995
549,550,570,471,2291,86.1496,5.06796,84.932,99.9833
550,551,1742,3343,2291,268.358,23.266,66.734,99.9778
551,552,868,1366,2295,282.216,8.43535,81.5647,99.997
552,553,835,2705,2294,89.5846,66.0607,23.9393,99.9805
553,554,8314,2792,2323,275.564,1.61961,88.3804,99.9936
554,555,6173,3156,2328,99.6297,33.2441,56.7559,99.9839
555,556,737,405,2294,276.617,5.93542,84.0646,99.966
556,557,4960,2180,2329,110.27,41.2745,48.7255,99.9949
557,558,2614,3251,2332,263.084,33.2118,56.7882,99.6159
558,559,2171,448,2325,102.0,62.6829,27.3171,99.9843
559,560,28493,2831,2415,106.932,75.1577,14.8423,99.9695
560,561,1405,2033,2322,100.083,6.31312,83.6869,99.9863
561,562,16889,2326,2384,100.064,51.8471,38.1529,99.9728
562,563,707,2933,2321,259.143,14.2088,75.7912,99.9922
563,564,1344,1418,2329,120.733,41.5477,48.4523,99.9912
564,565,5477,1548,2358,98.677,25.6698,64.3302,99.9865
565,566,23493,3042,2409,282.266,10.0551,79.9449,99.9573
566,567,15789,1840,2414,276.124,36.3168,53.6832,99.9934
567,568,21167,2092,2424,280.812,13.462,76.538,99.9828
568,569,569,1603,2335,280.194,60.3756,29.6244,99.9952
569,570,2185,1746,2361,92.0672,29.5181,60.4819,99.9925
570,571,19670,3310,2418,266.574,37.6968,52.3032,99.9632
571,572,2356,2932,2370,79.7381,9.46873,80.5313,99.9809
572,573,17153,1674,2410,96.7495,26.9618,63.0382,99.9916
573,574,7731,3190,2409,265.961,37.3641,52.6359,99.9928
574,575,1149,2433,2373,98.5914,65.1945,24.8055,99.9917
575,576,14235,2466,2447,102.039,24.9331,65.0669,99.7543
576,577,680,3131,2377,69.0337,70.0043,19.9957,99.9956
577,578,9325,1512,2443,97.1606,22.7418,67.2582,99.8798
578,579,2669,1262,2410,258.236,40.1175,49.8825,99.997
579,580,3517,2224,2409,264.289,29.7647,60.2353,99.9973
580,581,839,2405,2408,261.448,42.4467,47.5533,99.9934
581,582,15961,777,2486,277.033,17.081,72.919,99.9918
582,583,3181,232,2444,101.031,24.0896,65.9104,99.9936
583,584,2947,1231,2441,264.157,28.3068,61.6932,99.9828
584,585,2004,1416,2445,270.782,16.0728,73.9272,99.9932
585,586,528,2031,2429,91.0565,19.6256,70.3744,99.9974
586,587,10898,583,2515,99.6075,62.3954,27.6046,99.8992
587,588,7999,1609,2483,116.766,41.8386,48.1614,99.9533
588,589,3154,2201,2463,277.77,19.3201,70.6799,99.9778
589,590,976,577,2450,274.344,21.0932,68.9068,99.9949
590,591,14694,2003,2536,266.161,13.7394,76.2606,93.9575
591,592,11329,3109,2513,82.0522,6.5612,83.4388,98.95
592,593,23022,1123,2541,100.212,54.9321,35.0679,70.9014
593,594,6643,1273,2505,259.118,40.4954,49.5046,99.9938
594,595,30612,2302,2540,279.581,13.3492,76.6508,99.9768
595,596,9064,2565,2512,202.702,81.4756,8.52438,99.6785
596,597,1188,3207,2479,83.9829,61.2326,28.7674,99.9927
597,598,5932,1357,2503,277.072,35.2864,54.7136,99.9853
598,599,5499,2650,2505,253.422,58.8702,31.1298,99.954
599,600,4245,1736,2504,135.474,67.2707,22.7293,99.9197
600,601,2217,1445,2500,91.9331,21.2838,68.7162,99.9452
601,602,3799,651,2522,101.712,15.9782,74.0218,99.9192
602,603,15646,1835,2548,276.692,1.57878,88.4212,99.7393
603,604,5850,2958,2513,97.239,47.1295,42.8705,99.8132
604,605,2769,705,2514,251.984,56.963,33.037,99.9873
605,606,3747,1935,2559,109.94,61.019,28.981,99.9308
606,607,1483,203,2500,277.367,12.3538,77.6462,99.9751
607,608,14337,2731,2572,288.887,85.0457,4.954280000000002,99.3787
608,609,2298,150,2517,275.821,7.592410000000001,82.4076,99.9921
609,610,5260,2804,2550,262.238,33.9991,56.0009,99.9645
610,611,5159,2126,2535,110.458,38.6823,51.3177,99.0284
611,612,2456,3278,2524,100.433,3.5516,86.4484,99.957
612,613,605,3329,2508,119.941,66.7095,23.2905,99.9818
613,614,6532,3187,2551,267.545,13.0365,76.9635,99.9694
614,615,14815,439,2593,265.405,28.2009,61.7991,99.9149
615,616,15901,282,2576,273.781,8.80139,81.1986,99.9427
616,617,9910,1644,2573,289.893,64.9458,25.0542,99.9674
617,618,851,1492,2533,280.634,36.566,53.434,97.6115
618,619,3965,1544,2555,273.862,39.1286,50.8714,99.9695
619,620,9474,2884,2569,273.573,45.8171,44.1829,99.9459
620,621,5986,160,2592,99.7974,26.7781,63.2219,99.9802
621,622,2329,886,2564,99.1103,15.4206,74.5794,99.9815
622,623,11429,1437,2585,158.613,75.4433,14.5567,99.9783
623,624,2276,3324,2561,98.7109,19.8006,70.1994,99.977
624,625,36442,2471,2641,98.6914,10.3601,79.6399,99.7763
625,626,627,919,2548,269.53,16.4298,73.5702,99.997
626,627,6096,1227,2603,95.9568,6.36826,83.6317,99.996
627,628,13926,1298,2632,107.61,48.1485,41.8515,99.9716
628,629,1101,171,2560,79.5372,67.2687,22.7313,99.9973
629,630,3242,1719,2580,53.2304,76.4895,13.5105,99.991
630,631,24701,795,2667,229.181,63.0301,26.9699,99.9392
631,632,1048,3265,2565,83.5727,77.61399999999998,12.386,99.7062
632,633,3667,688,2583,97.1692,62.18899999999999,27.811,99.98
633,634,3390,2178,2599,99.1583,49.8797,40.1203,99.9857
634,635,1057,2639,2571,103.776,33.7335,56.2665,99.9958
635,636,6904,3012,2619,259.35,15.085,74.915,99.9319
636,637,668,100,2587,72.5443,66.3362,23.6638,99.9215
637,638,587,3350,2587,66.1089,0.13735999999999998,89.8626,99.9574
638,639,769,2592,2583,276.37,9.93495,80.065,99.994
639,640,1822,74,2613,265.242,2.80173,87.1983,99.9837
640,641,3957,2214,2642,100.028,49.3298,40.6702,99.9776
641,642,1518,304,2602,257.295,50.9992,39.0008,99.9923
642,643,1841,3074,2594,270.615,75.2866,14.7134,99.9966
643,644,2156,606,2603,133.546,86.7845,3.21552,99.982
644,645,3255,2116,2611,277.297,17.6402,72.3598,99.9949
645,646,4389,3289,2625,295.665,76.5717,13.4283,99.9742
646,647,3997,1865,2612,45.1619,81.5644,8.43564,99.9939
647,648,20512,2594,2744,106.913,23.9853,66.0147,99.9706
648,649,16314,1551,2657,95.2529,29.7167,60.2833,99.9687
649,650,19999,3171,2685,81.2233,39.8943,50.1057,99.9891
650,651,24405,2873,2686,100.724,10.6823,79.3177,99.9652
651,652,1246,895,2618,270.096,16.2619,73.7381,99.995
652,653,664,1992,2620,82.6498,33.731,56.269,99.9967
653,654,4168,3090,2650,273.086,3.99832,86.0017,99.9945
654,655,17482,962,2688,99.2971,48.1563,41.8437,99.9301
655,656,2902,715,2647,276.543,4.77032,85.2297,99.9914
656,657,831,678,2621,275.60400000000004,4.63129,85.3687,99.9951
657,658,11305,580,2673,95.8878,37.2104,52.7896,99.9881
658,659,1950,1362,2647,97.6798,73.5617,16.4383,99.9973
659,660,41374,1883,2768,210.446,83.5409,6.45913,99.9514
660,661,8412,2073,2663,106.77,49.8876,40.1124,99.9702
661,662,3968,1729,2650,108.526,3.10578,86.8942,99.9966
662,663,3866,1786,2676,77.3352,42.3966,47.6034,99.9969
663,664,538,313,2646,272.002,7.39561,82.6044,99.9927
664,665,11869,3331,2734,103.072,59.7662,30.2338,99.9666
665,666,2474,1163,2667,101.213,73.5137,16.4862,99.9897
666,667,1216,343,2658,256.991,50.3811,39.6189,99.9715
667,668,1558,666,2660,280.842,12.9494,77.0506,99.9897
668,669,16250,127,2729,100.725,36.8528,53.1472,99.9919
669,670,18072,1453,2781,95.7457,58.5593,31.4407,58.0002
670,671,1015,2162,2663,79.7289,26.7926,63.2074,99.9986
671,672,16592,470,2728,254.719,47.6735,42.3265,99.9955
672,673,4640,1689,2693,296.522,58.7544,31.2456,99.9855
673,674,6389,1994,2732,253.915,4.30933,85.6907,99.9622
674,675,781,2249,2669,78.215,35.7231,54.2769,99.9319
675,676,1487,3269,2681,82.3463,40.1844,49.8156,99.9706
676,677,8522,2719,2697,99.9152,31.3643,58.6357,99.9884
677,678,897,184,2674,64.5245,69.9663,20.0337,99.9854
678,679,6991,1081,2699,275.09,42.3705,47.6295,99.9778
679,680,2375,379,2682,97.9615,29.4009,60.5991,99.9983
680,681,2011,296,2691,270.663,30.6169,59.3831,99.9986
681,682,1584,228,2695,264.223,36.3248,53.6752,99.9704
682,683,1184,2285,2688,349.94699999999995,81.8084,8.19157,99.9749
683,684,10337,1349,2742,102.394,37.5279,52.4721,99.9902
684,685,21674,2974,2791,275.078,8.5102,81.4898,84.462
685,686,2972,717,2711,257.605,22.2635,67.7365,99.9763
686,687,3403,1211,2726,277.073,39.4164,50.5836,99.9732
687,688,4192,306,2740,95.0549,19.5747,70.4253,99.9921
688,689,22556,2290,2765,274.258,71.1115,18.8885,99.9732
689,690,9234,1598,2744,100.425,32.3643,57.6357,99.9883
690,691,13221,850,2773,93.6688,10.519,79.48100000000002,99.997
691,692,9174,2091,2742,32.0943,82.229,7.77103,99.9713
692,693,854,1160,2718,101.884,31.4139,58.5861,99.9907
693,694,30289,3100,2852,263.574,23.1315,66.8685,99.9556
694,695,2281,236,2735,117.086,78.5267,11.4733,99.9821
695,696,18227,1715,2803,102.315,25.7185,64.2815,99.9853
696,697,6408,2447,2755,13.3761,80.9922,9.00778,84.7101
697,698,1803,372,2741,278.27,10.01,79.99,99.9568
698,699,3834,2643,2754,270.701,46.1635,43.8365,99.9948
699,700,21683,674,2825,94.7772,15.164,74.836,99.9489
700,701,32366,1151,2819,270.302,66.5146,23.4854,99.946
701,702,10454,3221,2809,155.19299999999996,71.825,18.175,99.9951
702,703,10253,3301,2858,154.49200000000005,71.292,18.708,99.8975
703,704,9514,2736,2781,276.31,77.2619,12.7381,99.9902
704,705,6475,2161,2797,89.3625,41.6774,48.3226,99.9597
705,706,605,331,2764,263.141,58.2463,31.7537,99.9981
706,707,7115,983,2810,93.5913,6.56495,83.4351,99.955
707,708,3456,239,2801,263.4,35.0309,54.9691,99.9864
708,709,1943,559,2797,94.7387,35.603,54.397,99.9934
709,710,1304,342,2790,90.859,12.7463,77.2537,99.9981
710,711,4483,2873,2801,98.1634,27.0865,62.9135,99.9965
711,712,42521,412,2882,262.888,29.3808,60.6192,99.9579
712,713,1579,1416,2825,254.269,11.4778,78.5222,99.9753
713,714,15100,1564,2853,104.886,27.0119,62.9881,99.9916
714,715,10502,2074,2872,83.8619,12.8816,77.1184,99.9782
715,716,569,2811,2810,103.938,12.8644,77.1356,99.9978
716,717,839,3137,2804,273.123,3.902730000000001,86.0973,99.9966
717,718,2635,493,2816,253.777,24.7192,65.2808,99.9899
718,719,19620,1338,2904,295.624,60.3718,29.6282,99.9017
719,720,9784,878,2902,278.483,35.4175,54.5825,99.9588
720,721,619,2474,2818,270.397,37.3692,52.6308,99.9598
721,722,561,2070,2822,83.2559,9.42163,80.5784,99.938
722,723,30457,2472,2912,92.8062,12.7051,77.2949,91.8768
723,724,778,1484,2835,103.943,42.9006,47.0994,99.9843
724,725,621,95,2820,270.843,1.53777,88.4622,99.9921
725,726,1541,875,2832,86.066,20.2825,69.7175,99.9971
726,727,1208,787,2832,92.64,12.7701,77.2299,99.9987
727,728,855,105,2838,270.973,1.51462,88.4854,99.9954
728,729,1193,164,2826,85.3237,25.6029,64.3971,99.9957
729,730,1534,2754,2832,152.306,78.8384,11.1616,99.9983
730,731,753,230,2840,268.894,24.2688,65.7312,99.9972
731,732,7550,1979,2889,265.39,50.7609,39.2391,99.9283
732,733,1719,2796,2845,274.268,70.1302,19.8698,99.9351
733,734,7040,2692,2875,98.8434,18.0476,71.9524,99.943
734,735,6267,2189,2884,96.4912,44.6111,45.3889,99.9528
735,736,9029,142,2884,270.258,70.5829,19.4171,99.8947
736,737,544,1256,2858,269.29900000000004,65.9806,24.0194,99.9905
737,738,8688,1016,2903,93.5527,21.2795,68.7205,99.9789
738,739,30170,2795,2955,268.353,14.2999,75.7001,99.9976
739,740,1673,851,2877,95.6778,13.3599,76.6401,99.9989
740,741,697,788,2869,320.339,85.2101,4.78987,99.9888
741,742,593,2337,2878,85.8617,17.5616,72.4384,99.9947
742,743,10478,592,2932,264.269,23.3553,66.6447,99.9942
743,744,1143,2270,2881,88.3638,16.6645,73.3355,99.9712
744,745,3123,1264,2911,81.4865,20.6659,69.3341,99.9962
745,746,2457,2592,2891,99.7266,17.9927,72.0073,99.9965
746,747,4325,236,2919,76.7546,68.3156,21.6844,99.938
747,748,7656,1739,2916,104.529,8.902389999999997,81.0976,99.9813
748,749,1925,780,2910,100.551,6.698289999999999,83.3017,99.9962
749,750,2986,1223,2928,279.254,4.12544,85.8746,99.9943
750,751,4273,1659,2923,302.358,73.2145,16.7855,99.9894
751,752,693,2309,2896,109.408,45.5416,44.4584,99.9973
752,753,1693,666,2916,206.356,65.743,24.257,99.9953
753,754,2662,2646,2919,235.708,57.5733,32.4267,99.997
754,755,2460,2907,2917,270.079,68.8533,21.1467,99.9854
755,756,3015,2221,2922,88.2231,18.6385,71.3615,99.967
756,757,4027,1161,2929,107.892,21.7512,68.2488,99.9965
757,758,1374,1860,2917,93.3875,21.9396,68.0604,99.9925
758,759,11376,929,2988,108.231,58.3485,31.6515,98.8171
759,760,4064,2317,2936,267.871,70.4637,19.5363,99.979
760,761,9986,1832,2970,268.962,67.1103,22.8897,99.9509
761,762,7772,3216,2973,89.7938,47.8726,42.1274,99.9583
762,763,4976,1585,2953,279.546,41.4346,48.5654,99.9752
763,764,6550,150,2962,101.366,3.10357,86.8964,99.966
764,765,3731,1939,2964,95.6223,0.0751495,89.9249,99.7449
765,766,633,487,2938,277.022,5.53981,84.4602,99.9598
766,767,19675,1415,3019,98.4965,36.7923,53.2077,99.8756
767,768,3394,2955,2955,182.183,65.8795,24.1205,99.9768
768,769,4231,2604,2961,102.795,5.88128,84.1187,99.9319
769,770,13196,2405,3003,101.604,3.0862700000000003,86.9137,90.9656
770,771,10690,3076,2989,275.453,2.48983,87.5102,99.963
771,772,6283,3295,3023,253.131,76.3191,13.6809,98.9501
772,773,1352,1094,2948,84.844,12.1079,77.8921,99.9938
773,774,22180,2106,3016,267.465,18.6358,71.3642,98.3532
774,775,2593,3352,2986,259.155,71.7487,18.2513,99.9527
775,776,7946,669,3003,100.041,43.3341,46.6659,99.9342
776,777,651,1510,2957,264.747,53.4493,36.5507,99.9862
777,778,1470,726,2963,276.41700000000003,17.8163,72.1837,99.9866
778,779,35115,810,3088,274.736,45.8214,44.1786,99.8572
779,780,699,2152,2963,359.481,84.9381,5.06187,99.9927
780,781,27809,306,3080,74.5014,72.7439,17.2561,99.8773
781,782,5081,493,2998,88.1118,61.4327,28.5673,99.932
782,783,1183,1182,2971,94.1238,14.2123,75.7877,99.9006
783,784,2716,230,2979,268.959,66.5486,23.4514,99.9936
784,785,1605,2201,2977,271.193,27.7988,62.2012,99.9941
785,786,827,3279,2990,98.224,48.9435,41.0565,99.9526
786,787,13735,1084,3018,91.6198,39.9962,50.0038,99.9017
787,788,7622,94,3016,77.8177,59.8673,30.1327,99.9337
788,789,9529,1528,3054,105.134,56.5669,33.4331,99.6653
789,790,1714,1689,2988,109.153,56.161,33.839,99.9774
790,791,20128,2283,3066,103.269,6.3186,83.6814,47.4664
791,792,1353,1904,2996,268.926,7.82367,82.1763,99.9938
792,793,767,560,2988,252.38,76.3511,13.6489,99.9976
793,794,11661,1743,3055,93.0264,30.6108,59.3892,99.9044
794,795,1215,2997,2992,260.11,14.6031,75.3969,99.9826
795,796,16391,1265,3069,307.7340000000001,72.1809,17.8191,99.9251
796,797,4733,1617,3036,190.023,75.4283,14.5717,99.4172
797,798,720,2908,3001,110.79,34.9575,55.0425,99.9919
798,799,37955,2678,3096,262.931,20.6402,69.3598,99.9768
799,800,570,1659,3013,95.2948,29.4365,60.5635,99.9053
800,801,690,1563,3008,115.289,57.3551,32.6449,99.9454
801,802,27501,2986,3108,71.1442,58.6447,31.3553,99.9205
802,803,1515,1327,3025,253.801,45.6838,44.3162,99.9411
803,804,3095,558,3036,276.454,9.69946,80.3005,99.9831
804,805,1132,218,3025,281.115,13.9783,76.0217,99.9958
805,806,1667,412,3028,294.867,69.6541,20.3459,99.9986
806,807,2731,1935,3039,98.1102,46.5465,43.4535,99.8594
807,808,12582,3156,3071,74.507,73.1352,16.8648,89.6228
808,809,7096,1000,3082,271.112,6.27297,83.727,99.9985
809,810,3299,1861,3052,124.33,81.1243,8.87566,99.9364
810,811,4091,459,3067,263.934,48.1031,41.8969,99.9853
811,812,6917,181,3086,91.4801,83.1935,6.806539999999999,99.9775
812,813,2814,1156,3066,277.228,23.0465,66.9535,99.9972
813,814,911,2497,3055,103.241,38.0356,51.9644,99.8456
814,815,911,1356,3060,96.904,33.4531,56.5469,99.9894
815,816,1883,2040,3061,260.668,6.53316,83.4668,99.9945
816,817,4580,527,3092,94.6845,69.9405,20.0595,99.9956
817,818,3011,1987,3082,99.269,2.32221,87.6778,99.9959
818,819,33899,2082,3190,276.871,39.6851,50.3149,99.9715
819,820,5717,2524,3113,288.594,37.1771,52.8229,99.99
820,821,767,1195,3078,130.77100000000002,67.5147,22.4853,99.994
821,822,7226,945,3136,99.5138,1.87985,88.1201,77.9363
822,823,1279,2833,3082,97.2162,3.33481,86.6652,99.9595
823,824,13030,3307,3136,108.13,48.7921,41.2079,99.9699
824,825,1256,1601,3081,96.0246,29.7199,60.2801,99.9611
825,826,5129,90,3116,249.95,51.1385,38.8615,99.955
826,827,2194,1477,3100,275.233,23.0373,66.9627,99.9968
827,828,2186,2421,3098,91.028,30.7216,59.2784,99.945
828,829,1786,667,3094,114.985,54.9256,35.0744,99.9945
829,830,5202,604,3119,278.305,11.1078,78.8922,99.995
830,831,11958,1852,3128,250.95,28.0551,61.9449,99.9964
831,832,3130,1078,3127,109.964,30.2695,59.7305,99.9954
832,833,975,2479,3103,103.229,37.1597,52.8403,99.9918
833,834,13077,2853,3159,261.541,59.1485,30.8515,99.9293
834,835,4734,1963,3141,279.274,32.9962,57.0038,99.9105
835,836,22539,344,3220,254.483,11.9435,78.0565,99.9877
836,837,985,1216,3119,254.895,54.0111,35.9889,99.9989
837,838,3292,1158,3129,267.205,5.69891,84.3011,99.9593
838,839,705,1659,3114,274.106,22.5986,67.4014,99.9987
839,840,4503,1562,3165,96.8245,35.2657,54.7343,99.9608
840,841,2827,734,3133,246.501,72.9764,17.0236,99.9963
841,842,10036,2305,3182,76.7738,18.3497,71.6503,99.8813
842,843,4882,1741,3147,104.032,64.3317,25.6683,99.9936
843,844,16641,1631,3214,272.916,20.2195,69.7805,99.9955
844,845,2032,3176,3135,244.31,65.9557,24.0443,99.9891
845,846,982,2438,3138,78.1852,16.2332,73.7668,99.9345
846,847,9971,3089,3206,98.8474,42.227,47.773,99.9722
847,848,12281,459,3188,96.8988,51.918,38.082,86.5273
848,849,5907,1494,3184,106.488,4.06145,85.9385,99.9965
849,850,1148,141,3151,250.735,51.8182,38.1818,99.9124
850,851,2180,1323,3156,100.831,14.3032,75.6968,99.9988
851,852,21388,679,3214,304.643,80.0521,9.94789,99.9842
852,853,11700,1370,3204,321.999,59.5915,30.4085,99.9868
853,854,7100,1448,3252,278.838,19.0008,70.9992,99.8899
854,855,12781,2413,3248,256.42900000000003,15.7618,74.2382,99.8618
855,856,6888,1228,3187,96.5613,32.3464,57.6536,99.9943
856,857,4044,2474,3187,93.896,32.1582,57.8418,99.8432
857,858,2181,2550,3171,284.201,43.9883,46.0117,99.997
858,859,1248,193,3166,286.652,67.4289,22.5711,99.9749
859,860,2651,2210,3175,115.886,22.5245,67.4755,99.9945
860,861,5051,3166,3199,275.42900000000003,22.4245,67.5755,99.9533
861,862,2331,563,3176,276.988,23.8881,66.1119,99.9972
862,863,9724,1042,3205,130.812,73.9995,16.0004,99.995
863,864,49052,2633,3285,86.5556,68.459,21.541,99.9771
864,865,3717,95,3208,284.007,64.7528,25.2472,99.9862
865,866,2493,1084,3247,65.9609,62.4597,27.5403,99.9235
866,867,3151,1160,3217,131.732,75.5602,14.4398,99.9931
867,868,2468,169,3206,284.955,64.4353,25.5647,99.9699
868,869,13100,1836,3240,278.712,33.1564,56.8436,99.9741
869,870,812,1945,3187,93.8742,53.2411,36.7589,99.8931
870,871,16132,894,3267,269.623,4.26524,85.7348,99.9131
871,872,2217,1704,3223,272.357,9.43911,80.5609,99.9789
872,873,1463,1775,3199,81.5017,30.0802,59.9198,99.9987
873,874,14938,3263,3285,101.888,41.5304,48.4696,99.8913
874,875,2082,2888,3219,94.7679,4.29501,85.705,99.9353
875,876,1056,1746,3224,102.42,67.5369,22.4631,99.9888
876,877,131204,2736,3457,96.7982,43.0571,46.9429,95.4673
877,878,4046,545,3247,88.3041,61.9158,28.0842,99.9712
878,879,2694,1916,3244,92.5247,51.495,38.505,99.977
879,880,10734,2329,3281,102.711,38.0607,51.9393,99.9917
880,881,4857,1270,3251,99.1381,13.628,76.372,99.992
881,882,9073,1532,3298,232.961,43.6594,46.3406,99.9912
882,883,863,2844,3243,290.1670000000001,45.3992,44.6008,99.9948
883,884,3062,152,3263,287.63,50.722,39.278,99.9991
884,885,731,2491,3242,285.741,43.1103,46.8897,99.9702
885,886,1860,3190,3275,100.068,42.4361,47.5639,99.9917
886,887,1596,3339,3260,111.336,48.7798,41.2202,99.9738
887,888,5274,241,3276,276.324,9.84227,80.1577,99.99
888,889,5066,98,3294,106.131,78.3222,11.6778,99.9919
889,890,5500,1192,3286,87.3261,24.6787,65.3213,99.9875
890,891,7659,3126,3300,272.151,26.6421,63.3579,99.9805
891,892,12233,795,3336,271.436,64.3999,25.6001,99.991
892,893,25942,1670,3350,280.071,36.6838,53.3162,99.9953
893,894,11902,977,3335,265.116,41.3576,48.6424,99.9429
894,895,47231,2271,3430,279.155,73.7529,16.2471,100.023
895,896,97078,1928,3481,251.197,14.1447,75.8553,93.0454
896,897,11451,2144,3314,106.996,56.1283,33.8717,99.9923
897,898,1603,1329,3289,259.075,47.5871,42.4129,99.9966
898,899,2322,609,3295,104.098,22.209,67.791,99.9926
899,900,44620,487,3476,260.22,12.4766,77.5234,99.8859
900,901,1169,663,3290,109.663,22.3968,67.6032,99.9994
901,902,19359,1422,3374,67.5275,45.709,44.291,99.9386
902,903,50864,1140,3443,101.076,33.1778,56.8222,73.2855
903,904,2277,176,3318,282.6020000000001,51.95399999999999,38.046,99.9969
904,905,6590,1292,3334,60.6089,50.8954,39.1046,99.9947
905,906,699,3337,3335,72.8856,9.48495,80.5151,99.9392
906,907,18926,306,3365,104.757,3.32343,86.6766,99.9936
907,908,1245,720,3323,109.062,19.6927,70.3073,99.997
908,909,869,673,3325,96.4252,1.38098,88.619,99.997
909,910,646,68,3348,291.176,53.999,36.001,99.955
910,911,104086,777,3518,104.89,37.1561,52.8439,67.3216
911,912,799,135,3348,275.119,9.82,80.18,99.9953
912,913,608,2775,3351,290.3040000000001,40.5543,49.4457,99.9917
913,914,11046,3133,3392,100.562,15.7042,74.2958,99.9722
914,915,1272,1238,3369,90.8396,29.4078,60.5922,99.9561
915,916,885,100,3363,135.713,49.8073,40.1927,99.9944
916,917,5030,2410,3378,287.073,51.0508,38.9492,99.9749
917,918,1867,2483,3382,261.60400000000004,77.497,12.503,99.9852
918,919,5077,169,3389,77.6932,34.9653,55.0347,99.9924
919,920,587,3317,3374,262.978,15.1182,74.8818,99.9455
920,921,1353,2092,3390,77.4965,50.5054,39.4946,99.9897
921,922,842,2130,3386,108.027,57.1937,32.8063,99.9859
922,923,28019,3303,3497,99.7701,23.5006,66.4994,99.9027
923,924,16243,1363,3484,268.779,8.5413,81.4587,99.9743
924,925,6811,2632,3407,110.465,44.695,45.305,99.9896
925,926,7712,1525,3441,64.572,45.0511,44.9489,99.9915
926,927,10716,78,3463,107.103,53.7352,36.2648,99.9001
927,928,5277,1282,3433,264.849,17.7486,72.2514,99.9887
928,929,10801,980,3438,58.9386,56.0223,33.9777,99.8493
929,930,3987,3038,3437,282.772,32.5839,57.4161,99.9873
930,931,19014,1726,3483,65.3113,78.1141,11.8859,99.8412
931,932,6147,2500,3441,107.441,35.0397,54.9603,99.8957
932,933,2930,2113,3453,106.677,48.9295,41.0705,99.995
933,934,35372,315,3517,105.255,3.3378300000000003,86.6622,99.9924
934,935,1702,822,3448,95.087,27.7995,62.2005,99.9811
935,936,12761,138,3520,78.2163,35.657,54.343,99.9841
936,937,5869,1593,3475,248.419,19.9376,70.0624,99.9897
937,938,541,2421,3451,286.362,50.6377,39.3623,99.9876
938,939,15129,3089,3520,100.123,65.3695,24.6305,99.8357
939,940,720,2992,3455,112.855,62.768,27.232,99.9961
940,941,729,1077,3463,277.151,20.455,69.545,99.9042
941,942,903,3218,3481,97.3797,48.8346,41.1654,99.9781
942,943,5954,3023,3516,60.6244,28.2267,61.7733,99.9769
943,944,1851,2866,3506,271.431,33.6876,56.3124,99.9904
944,945,961,1814,3497,279.545,15.9928,74.0072,99.995
945,946,17379,2123,3548,104.619,57.2718,32.7282,99.6704
946,947,5669,1007,3531,62.5558,61.5524,28.4476,99.9781
947,948,36234,1468,3629,99.1748,9.98383,80.0162,97.5743
948,949,1742,1611,3536,120.298,68.194,21.806,99.7707
949,950,8134,3220,3560,279.533,22.3094,67.6906,85.7554
950,951,16079,221,3613,279.35200000000003,11.3003,78.6997,99.9782
951,952,3235,1294,3560,279.121,31.9853,58.0147,99.9929
952,953,833,2942,3548,32.6353,73.553,16.447,99.7687
953,954,1934,1564,3570,273.629,20.0411,69.9589,99.9981
954,955,149117,3006,3842,32.6289,69.336,20.664,89.9038
955,956,2874,2363,3574,291.212,50.9479,39.0521,99.9833
956,957,1238,2247,3557,90.0401,40.6647,49.3353,99.9976
957,958,22131,803,3652,247.916,64.7166,25.2834,100.003
958,959,33758,3130,3692,96.6271,59.0906,30.9094,99.9502
959,960,1016,840,3571,107.235,79.2935,10.7065,99.996
960,961,1543,1358,3582,262.754,30.7442,59.2558,99.9929
961,962,11204,1706,3625,281.402,33.6593,56.3407,99.9877
962,963,5201,2735,3597,87.449,44.5263,45.4737,99.9907
963,964,39657,2222,3680,112.392,19.2976,70.7024,99.978
964,965,1864,1605,3586,102.219,58.6304,31.3696,99.9989
965,966,5380,1242,3605,83.6784,39.1037,50.8963,99.9753
966,967,2224,56,3613,104.951,49.4928,40.5072,99.8568
967,968,514,853,3607,96.5437,26.7937,63.2063,99.9966
968,969,15101,1188,3680,89.1319,42.7221,47.2779,99.9764
969,970,8828,1330,3674,96.5534,33.4151,56.5849,99.9897
970,971,904,2067,3614,276.97700000000003,30.1121,59.8879,99.9983
971,972,522,1646,3622,282.322,0.91172,89.0883,99.9987
972,973,2065,110,3640,279.94,6.01187,83.9881,99.9662
973,974,14706,645,3697,92.0462,48.1172,41.8828,99.9945
974,975,24885,2679,3708,293.208,61.3027,28.6973,99.94
975,976,1012,704,3625,275.527,20.8035,69.1965,99.903
976,977,10859,3325,3739,90.7543,7.66258,82.3374,99.9638
977,978,14764,1609,3697,108.557,37.366,52.63399999999999,99.9884
978,979,7890,1793,3672,244.46,18.873,71.127,99.993
979,980,49061,462,3881,261.55400000000003,85.0848,4.9152,82.5741
980,981,23501,2092,3764,96.3103,40.0514,49.9486,99.9722
981,982,780,3226,3665,92.8749,7.651910000000001,82.3481,99.9916
982,983,1734,409,3661,270.191,42.21,47.79,99.9873
983,984,1152,1263,3657,88.0665,26.94,63.06,99.9865
984,985,5006,352,3683,104.422,54.4213,35.5787,99.9931
985,986,2184,60,3679,282.725,17.8517,72.1483,99.8343
986,987,6782,158,3701,102.893,53.2918,36.7082,99.9971
987,988,8578,2341,3716,87.6801,39.8039,50.1961,99.9952
988,989,7281,1105,3724,109.576,56.7108,33.2892,99.9954
989,990,16261,2437,3759,88.2143,52.2912,37.7088,99.8334
990,991,7180,559,3757,109.027,1.25818,88.7418,99.9869
991,992,3394,2516,3706,103.164,44.8411,45.1589,99.986
992,993,757,3204,3699,94.8701,18.681,71.319,99.963
993,994,1001,230,3704,118.112,47.6093,42.3907,99.9893
994,995,621,278,3695,279.687,9.27954,80.7205,99.9978
995,996,14420,361,3795,275.34,45.2044,44.7956,99.9647
996,997,72619,1955,3880,276.082,55.6564,34.3436,94.8024
997,998,13964,813,3769,92.2047,62.4187,27.5813,99.9829
998,999,46079,199,3888,100.052,48.9874,41.0126,84.9764
999,1000,2603,1741,3736,78.6168,14.5651,75.4349,99.9986
1000,1001,1044,115,3730,280.499,20.1419,69.8581,99.9969
1001,1002,64647,2701,3888,107.589,19.2873,70.7127,99.8789
1002,1003,6818,1287,3778,276.217,15.1477,74.8523,99.9623
1003,1004,9051,1671,3787,299.666,75.2322,14.7678,99.98
1004,1005,6496,68,3780,282.152,59.7121,30.2879,99.9629
1005,1006,985,3228,3745,95.6214,57.2779,32.7221,99.918
1006,1007,1875,1367,3759,255.597,4.1378,85.8622,99.9893
1007,1008,7660,1028,3778,269.646,22.9071,67.0929,99.9818
1008,1009,5328,1449,3765,98.4759,36.9602,53.0398,99.8112
1009,1010,3624,705,3767,276.345,16.3158,73.6842,99.9678
1010,1011,10893,952,3818,263.817,55.4765,34.5235,65.5932
1011,1012,2228,1164,3766,282.937,38.6772,51.3228,99.9671
1012,1013,1262,1533,3769,290.906,75.2755,14.7245,99.9987
1013,1014,1236,1765,3783,105.295,41.6944,48.3056,99.9618
1014,1015,2141,1398,3791,275.42400000000004,9.46487,80.5351,99.9935
1015,1016,11397,1163,3838,280.31,34.6458,55.3542,99.9792
1016,1017,2597,645,3814,89.1347,65.9919,24.0081,99.9865
1017,1018,23787,1567,3868,97.1082,9.71808,80.2819,99.9886
1018,1019,13007,3251,3903,22.2908,70.0165,19.9835,99.7679
1019,1020,29301,2342,3902,109.442,40.3167,49.6833,99.9547
1020,1021,13809,711,3886,275.303,20.4295,69.5705,99.9626
1021,1022,9014,1303,3875,276.915,16.4153,73.5847,99.9141
1022,1023,4058,1071,3838,88.7876,42.2493,47.7507,99.9916
1023,1024,2077,2249,3835,101.397,19.0357,70.9643,99.9801
1024,1025,5196,522,3843,280.18,42.5725,47.4275,99.9948
1025,1026,18766,1395,3903,101.168,19.9717,70.0283,99.872
1026,1027,3578,891,3841,125.715,54.1731,35.8269,99.9744
1027,1028,8551,2198,3891,95.9682,42.0892,47.9108,99.9591
1028,1029,2195,589,3848,278.259,43.2151,46.7849,99.9825
1029,1030,13691,1786,3889,82.6696,14.6247,75.3753,99.9086
1030,1031,2009,1255,3846,266.89,72.6766,17.3234,99.9976
1031,1032,7896,2490,3903,274.866,48.6914,41.3086,99.97
1032,1033,8593,99,3895,109.541,36.4415,53.5585,99.9617
1033,1034,105198,884,4053,258.29200000000003,20.8567,69.1433,96.8193
1034,1035,7337,635,3918,88.0981,27.3585,62.6415,99.9779
1035,1036,1202,2842,3869,256.913,57.5559,32.4441,99.9934
1036,1037,648,1684,3868,106.248,1.86436,88.1356,99.9949
1037,1038,13850,1191,3953,87.6789,48.1619,41.8381,99.9327
1038,1039,9039,330,3954,271.124,27.5638,62.4362,99.9214
1039,1040,5062,565,3927,118.487,35.8015,54.1985,99.9331
1040,1041,3743,3328,3931,244.165,1.28888,88.7111,99.2453
1041,1042,7720,1052,3939,267.031,25.9404,64.0596,99.9376
1042,1043,788,1110,3913,279.006,37.1616,52.8384,99.9957
1043,1044,35701,1691,4006,280.623,30.7485,59.2515,99.9454
1044,1045,1167,172,3922,116.006,46.5397,43.4603,99.9932
1045,1046,58465,1385,4074,283.047,71.4661,18.5339,74.65
1046,1047,1044,2554,3952,273.182,50.4859,39.5141,99.9922
1047,1048,1862,1273,3960,133.878,75.3059,14.6941,99.991
1048,1049,5081,2182,3991,94.5333,46.2607,43.7393,99.9794
1049,1050,20195,2456,4018,73.4702,66.4374,23.5626,99.6797
1050,1051,639,298,3961,78.9646,61.1791,28.8209,99.9667
1051,1052,3216,2626,3972,96.5525,68.3917,21.6083,99.9414
1052,1053,2351,47,3999,258.8,24.8464,65.1536,99.942
1053,1054,52611,2913,4136,283.466,34.4089,55.5911,85.4456
1054,1055,34935,2043,4104,275.849,39.6329,50.3671,99.4643
1055,1056,5213,2263,4023,270.576,41.7207,48.2793,99.9311
1056,1057,7951,600,4030,82.314,3.25549,86.7445,99.9838
1057,1058,2898,246,3996,98.8461,3.60728,86.3927,99.9955
1058,1059,867,1097,3985,110.452,51.4366,38.5634,99.9862
1059,1060,5230,1155,4033,282.774,37.1951,52.8049,99.9844
1060,1061,537,1756,3999,83.0518,11.4153,78.5847,99.9948
1061,1062,2700,1850,4028,118.127,68.2891,21.7109,99.751
1062,1063,5208,2606,4039,275.767,48.9072,41.0928,99.894
1063,1064,2214,2688,4054,82.6023,66.5075,23.4925,99.6172
1064,1065,2155,2336,4032,83.3846,48.4938,41.5062,99.8865
1065,1066,5523,1105,4071,288.888,51.7632,38.2368,99.997
1066,1067,3020,334,4051,125.275,63.1219,26.8781,99.9819
1067,1068,11601,2195,4124,90.2971,2.77778,87.2222,99.9922
1068,1069,19126,190,4119,283.185,10.2251,79.7749,99.9934
1069,1070,1824,674,4079,119.393,58.1544,31.8456,99.9978
1070,1071,78124,334,4210,128.153,59.7151,30.2849,100.007
1071,1072,6767,1537,4104,284.675,16.0042,73.9958,99.9865
1072,1073,48956,2486,4172,99.7599,23.3213,66.6787,65.9092
1073,1074,24138,2278,4205,100.042,43.9453,46.0547,99.9835
1074,1075,1273,39,4095,114.229,55.506,34.494,99.9066
1075,1076,1473,1898,4082,83.8178,11.0564,78.9436,99.9847
1076,1077,139482,3069,4409,259.348,51.7453,38.2547,76.8398
1077,1078,3851,603,4096,263.467,44.4955,45.5045,99.9906
1078,1079,63224,1761,4237,116.166,68.1162,21.8838,99.9313
1079,1080,16171,2722,4150,283.232,48.9435,41.0565,99.9616
1080,1081,5781,1827,4124,98.5583,43.3078,46.6922,99.9934
1081,1082,1094,3317,4106,100.313,4.69426,85.3057,99.971
1082,1083,2023,100,4121,269.922,44.0571,45.9429,99.9921
1083,1084,14675,1203,4161,83.8282,42.7116,47.2884,99.9971
1084,1085,32774,3261,4296,263.868,41.7729,48.2271,99.9174
1085,1086,1463,678,4129,271.421,17.1025,72.8975,99.9978
1086,1087,668,626,4129,272.91900000000004,17.622,72.378,99.9987
1087,1088,55198,1427,4288,324.366,86.0862,3.91382,97.839
1088,1089,26986,1121,4246,275.876,11.4097,78.5903,100.004
1089,1090,2851,3313,4190,248.46,45.2647,44.7353,99.7882
1090,1091,3588,543,4180,272.29,28.2755,61.7245,99.9853
1091,1092,8764,633,4188,298.758,62.9134,27.0866,99.9995
1092,1093,6829,732,4219,121.179,45.5554,44.4446,99.7918
1093,1094,1051,46,4197,184.868,64.9979,25.0021,99.8907
1094,1095,7186,810,4217,283.68,24.3197,65.6803,99.9815
1095,1096,2985,2088,4205,109.236,65.3369,24.6631,99.9947
1096,1097,6478,2169,4244,283.557,19.8245,70.1755,99.9681
1097,1098,10969,2684,4247,92.2604,3.85596,86.14399999999998,99.9849
1098,1099,738,874,4208,110.053,43.168,46.832,99.9886
1099,1100,10835,96,4284,278.204,55.7523,34.2477,99.9711
1100,1101,62839,517,4363,276.77,45.4691,44.5309,95.4426
1101,1102,2196,2775,4239,277.146,41.768,48.232,99.9961
1102,1103,16496,2809,4289,257.54900000000004,26.3582,63.6418,99.9491
1103,1104,6308,2437,4281,103.279,42.4012,47.5988,99.8307
1104,1105,690,491,4236,124.363,49.2898,40.7102,99.9892
1105,1106,1993,1389,4238,113.845,68.6248,21.3752,99.9961
1106,1107,3419,2063,4260,98.9881,33.6386,56.3614,99.997
1107,1108,5265,1560,4268,288.62,17.1408,72.8592,99.9961
1108,1109,37680,927,4364,112.943,43.3827,46.6173,99.9116
1109,1110,5522,1939,4284,279.098,34.3649,55.6351,99.738
1110,1111,545,531,4256,158.48,75.2747,14.7253,99.9789
1111,1112,1377,2487,4271,286.885,24.6565,65.3435,99.9921
1112,1113,14599,1617,4331,88.1661,21.6633,68.3367,99.997
1113,1114,5866,2591,4299,269.879,20.3185,69.6815,99.9815
1114,1115,9552,2148,4320,298.561,22.5136,67.4864,99.9781
1115,1116,5637,2038,4317,123.63,37.1791,52.8209,99.9832
1116,1117,836,802,4291,159.05100000000004,67.7301,22.2699,99.9937
1117,1118,1574,722,4297,284.863,24.7542,65.2458,99.9988
1118,1119,1824,2369,4301,281.246,23.805,66.195,99.994
1119,1120,2890,2498,4330,122.17,40.8555,49.1445,99.9928
1120,1121,44294,685,4478,284.906,55.7516,34.2484,85.7514
1121,1122,1802,1088,4327,353.403,85.8925,4.107469999999998,99.9908
1122,1123,5539,1894,4379,75.5288,65.1621,24.8379,99.9442
1123,1124,6145,2989,4377,262.414,19.4646,70.5354,99.9776
1124,1125,119089,2285,4551,103.984,59.217,30.783,88.5639
1125,1126,1755,681,4352,110.867,1.28537,88.7146,99.9988
1126,1127,40495,2693,4479,280.585,7.4157600000000015,82.5842,83.6082
1127,1128,9319,1205,4420,291.911,58.8636,31.1364,99.9398
1128,1129,9627,2247,4419,110.646,5.8968,84.1032,99.9726
1129,1130,18571,1999,4408,299.491,23.1538,66.8462,99.9872
1130,1131,12209,1105,4386,281.058,31.6219,58.3781,99.9649
1131,1132,6070,2522,4388,79.4547,70.0197,19.9803,99.9966
1132,1133,47489,117,4478,98.0098,16.2842,73.7158,99.9757
1133,1134,1903,2433,4374,285.506,22.5221,67.4779,99.8467
1134,1135,1002,2769,4355,293.943,60.6067,29.3933,99.9973
1135,1136,9610,2588,4411,103.559,9.78155,80.2185,99.9665
1136,1137,22641,1303,4461,272.324,43.2445,46.7555,99.9643
1137,1138,8096,2120,4409,282.763,27.1569,62.8431,99.9916
1138,1139,3465,1540,4403,85.8669,23.3893,66.6107,99.9909
1139,1140,2401,1489,4395,278.48400000000004,41.7194,48.2806,99.9944
1140,1141,955,3116,4392,262.468,18.1452,71.8548,99.9946
1141,1142,16078,347,4476,74.9533,41.3176,48.6824,99.9609
1142,1143,1446,374,4398,82.3276,27.9022,62.0978,99.9959
1143,1144,652,809,4391,307.935,80.1699,9.83011,99.9887
1144,1145,1632,1831,4400,127.923,47.5367,42.4633,99.9926
1145,1146,1605,2774,4401,259.124,26.2085,63.7915,99.974
1146,1147,69784,1770,4526,229.238,48.8302,41.1698,99.9565
1147,1148,2943,2187,4423,142.615,53.4874,36.5126,99.9967
1148,1149,1817,1153,4434,272.78,12.5283,77.4717,99.9962
1149,1150,796,613,4422,117.169,62.067,27.933000000000003,99.9949
1150,1151,596,802,4426,311.44,74.8851,15.1149,99.9689
1151,1152,1426,270,4429,72.0105,2.89696,87.103,99.9934
1152,1153,1869,3149,4449,262.511,16.3842,73.6158,99.9895
1153,1154,2934,2489,4456,104.194,9.07579,80.9242,99.9895
1154,1155,740,727,4447,315.625,77.32600000000002,12.674,99.7589
1155,1156,27678,1481,4596,283.283,25.1721,64.8279,97.7862
1156,1157,5412,842,4485,88.5276,6.8907300000000005,83.1093,99.9929
1157,1158,766,1499,4455,82.8968,21.4859,68.5141,99.9824
1158,1159,674,2306,4457,101.855,31.0422,58.9578,99.9974
1159,1160,21584,1107,4547,291.741,70.9815,19.0185,98.669
1160,1161,9018,246,4523,254.497,55.8383,34.1617,99.9861
1161,1162,5036,993,4479,308.071,85.7495,4.2505,99.9779
1162,1163,1276,1483,4483,293.485,56.3658,33.6342,99.9894
1163,1164,1175,1410,4505,120.358,73.4336,16.5664,99.9645
1164,1165,38359,935,4619,146.688,80.2255,9.77446,98.6514
1165,1166,2214,1453,4531,122.123,52.6299,37.3701,99.871
1166,1167,25460,516,4633,298.0440000000001,13.4148,76.5852,99.687
1167,1168,2815,2834,4565,263.715,55.7307,34.2693,99.9835
1168,1169,1485,793,4545,128.983,83.0514,6.94862,99.879
1169,1170,1936,1391,4549,273.302,22.5912,67.4088,99.9953
1170,1171,1835,372,4569,76.5556,3.95043,86.0496,99.9899
1171,1172,8432,1279,4580,292.523,57.8706,32.1294,99.9282
1172,1173,15699,1640,4640,107.112,38.6062,51.3938,99.9562
1173,1174,1895,307,4583,75.8514,5.0303900000000015,84.9696,99.9962
1174,1175,10839,204,4634,275.41900000000004,30.5007,59.4993,99.9875
1175,1176,14103,1955,4645,293.783,29.7607,60.2393,99.939
1176,1177,14842,742,4642,273.607,8.05872,81.9413,99.9753
1177,1178,2584,138,4605,124.945,63.6293,26.3707,99.9782
1178,1179,4055,2276,4638,127.511,52.0923,37.9077,99.9715
1179,1180,10501,2741,4659,269.136,56.5764,33.4236,99.9502
1180,1181,778,2822,4600,271.353,56.1866,33.8134,99.9858
1181,1182,1908,335,4625,272.536,65.3788,24.6212,99.9886
1182,1183,1576,2643,4620,111.993,18.1544,71.8456,99.9623
1183,1184,4619,1530,4652,260.123,50.3254,39.6746,99.9689
1184,1185,532,63,4624,93.7446,9.34008,80.6599,99.9628
1185,1186,3658,404,4632,114.576,43.1695,46.8305,99.9722
1186,1187,20242,3021,4655,264.247,39.6697,50.3303,99.9283
1187,1188,6554,3218,4648,287.536,43.7899,46.2101,99.955
1188,1189,5785,2581,4665,262.964,34.2741,55.7259,99.9319
1189,1190,7351,1115,4682,292.722,58.9997,31.0002,99.9612
1190,1191,2424,1297,4662,215.941,30.4522,59.5478,99.9505
1191,1192,1503,1341,4672,274.931,23.5916,66.4084,99.9952
1192,1193,2199,369,4671,75.4675,4.23795,85.762,99.9886
1193,1194,3566,1239,4673,63.8568,8.83232,81.1677,99.9778
1194,1195,2885,290,4674,76.2717,5.15191,84.8481,99.9893
1195,1196,1559,2347,4675,120.325,38.848,51.152,99.9629
1196,1197,1233,3275,4664,266.353,39.4569,50.5431,99.9847
1197,1198,3118,647,4684,296.931,14.6609,75.3391,99.9282
1198,1199,888,847,4676,268.039,15.6563,74.3437,99.9945
1199,1200,508,828,4681,79.1298,6.67703,83.323,99.9929
1200,1201,515,1061,4656,112.228,75.0023,14.9977,99.952
1201,1202,675,809,4675,271.532,7.511310000000001,82.4887,99.9721
1202,1203,755,2309,4667,91.8556,56.3556,33.6444,99.9964
1203,1204,680,1541,4704,89.8902,35.3045,54.6955,99.9852
1204,1205,604,1578,4705,27.3816,14.0823,75.9177,99.9709
