,Grain No.,Size [Pixel],center x-coordinate,center y-coordinate,mean azimuth [degree],mean latitude [degree],mean colatitude [degree],Regelungsgrad [%]
0,1,9099,2062,330,284.9790000000001,10.2651,79.7349,99.7166
1,2,630,903,278,275.863,13.6004,76.3996,99.9672
2,3,521,970,279,293.061,45.8368,44.1632,99.7419
3,4,1810,1461,303,284.668,19.187,70.813,99.961
4,5,44473,737,406,277.722,22.3727,67.6273,99.8781
5,6,58419,1087,452,107.765,11.7644,78.2356,99.0627
6,7,856,1379,289,271.016,7.20719,82.7928,99.8497
7,8,5854,1612,336,281.431,26.5686,63.4314,99.9291
8,9,12412,2285,357,288.446,1.69904,88.301,99.9495
9,10,946,2160,308,288.208,3.0253400000000004,86.9747,99.9659
10,11,4837,1859,329,117.356,52.0621,37.9379,99.9289
11,12,1597,1263,321,120.603,47.7739,42.2261,99.7722
12,13,730,850,303,277.413,22.1585,67.8415,99.9792
13,14,2691,1001,324,115.115,54.919,35.081,99.3413
14,15,4139,2394,327,279.648,40.0296,49.9704,99.9163
15,16,591,558,310,116.682,14.8694,75.1306,99.9925
16,17,46192,1986,460,112.812,58.6567,31.3433,99.3777
17,18,3670,2920,313,110.925,57.3285,32.6715,99.93
18,19,6503,2657,353,110.165,1.25566,88.7443,99.9616
19,20,24468,2841,388,118.359,62.9191,27.0809,99.9327
20,21,20368,3232,389,290.693,33.1972,56.8028,99.9706
21,22,2044,1720,325,101.289,15.921,74.079,99.9063
22,23,884,1787,319,97.5123,65.8502,24.1498,99.8353
23,24,536,2207,313,277.543,61.897,28.103,99.98
24,25,1263,2578,319,112.699,1.57201,88.428,99.8464
25,26,1354,2736,319,296.791,48.2397,41.7603,99.9729
26,27,2101,3034,322,117.263,65.0685,24.9315,99.8444
27,28,20678,2551,419,111.966,25.2509,64.7491,99.6345
28,29,5303,489,349,106.385,15.7506,74.2494,98.4126
29,30,2801,933,347,101.29,30.9686,59.0314,99.9412
30,31,508,220,320,106.904,15.1578,74.8422,99.9936
31,32,801,583,342,279.089,57.5682,32.4318,99.9604
32,33,687,789,343,106.626,64.4766,25.5234,99.9254
33,34,718,1410,334,267.66700000000003,65.0104,24.9896,99.9955
34,35,1407,1315,337,266.92,67.0164,22.9836,99.9926
35,36,6576,276,372,183.27,75.7164,14.2836,99.7916
36,37,6192,3065,372,291.814,30.2084,59.7916,99.9902
37,38,8196,175,381,155.781,76.2726,13.7274,99.9616
38,39,12526,1791,403,168.59900000000005,73.3121,16.6879,99.9398
39,40,1767,346,354,160.046,81.8629,8.13711,99.9771
40,41,2589,2706,386,295.935,47.5064,42.4936,99.9802
41,42,1372,2986,356,100.383,55.6547,34.3453,99.8189
42,43,984,2423,356,263.726,56.8998,33.1002,99.9425
43,44,9344,2168,413,253.109,79.7498,10.2502,99.9332
44,45,963,2602,362,289.902,28.0887,61.9113,99.9954
45,46,584,1481,359,274.543,49.6894,40.3106,99.9877
46,47,4103,1445,388,265.863,64.8974,25.1026,99.9739
47,48,1034,1678,369,292.272,15.0331,74.9669,99.9929
48,49,2260,1315,370,266.747,67.7196,22.2804,99.9161
49,50,16121,1577,450,122.586,44.7792,45.2208,99.7048
50,51,1754,3119,394,242.233,84.0705,5.92946,99.9849
51,52,4672,914,404,279.031,61.3552,28.6448,99.9698
52,53,723,395,374,102.209,16.2029,73.7971,99.9762
53,54,5350,467,401,98.8966,3.13227,86.8677,99.453
54,55,25500,1382,507,110.711,51.4608,38.5392,99.8098
55,56,2854,2964,406,109.121,61.5006,28.4994,99.98
56,57,797,3324,387,79.0955,30.8641,59.1359,99.9687
57,58,47235,2481,570,271.308,66.8806,23.1194,98.7817
58,59,1771,376,409,279.78,11.8363,78.1637,99.992
59,60,3508,589,433,112.722,27.034,62.966,99.9757
60,61,5431,1665,431,258.372,70.9399,19.06,99.973
61,62,598,2928,424,120.783,61.9572,28.0428,99.9743
62,63,11742,2322,463,107.838,49.6168,40.3832,99.9447
63,64,9154,1287,456,109.283,31.8667,58.1333,99.9463
64,65,860,764,419,119.015,66.206,23.794,99.9895
65,66,10159,1178,479,124.452,71.8625,18.1375,99.0671
66,67,1731,329,425,103.301,17.4798,72.5202,99.99
67,68,588,3011,434,164.90200000000004,84.6784,5.32163,99.9423
68,69,11653,1768,488,283.093,40.4782,49.5218,99.8797
69,70,39267,2794,599,113.679,18.0183,71.9817,99.823
70,71,862,3397,456,261.273,23.1212,66.8788,99.6925
71,72,5903,295,487,178.857,79.2094,10.7907,98.7493
72,73,1576,495,443,111.891,21.8304,68.1696,99.4432
73,74,111545,3042,624,103.593,5.25132,84.7487,99.1974
74,75,8496,525,503,282.754,52.7089,37.2911,99.3386
75,76,2461,2661,463,278.089,30.0572,59.9428,99.9359
76,77,1492,194,445,277.372,22.3802,67.6198,99.9844
77,78,4416,2195,476,291.536,1.60427,88.3957,99.8771
78,79,1237,3035,455,112.808,2.04287,87.9571,99.9818
79,80,502,1497,451,275.645,28.2204,61.7796,99.1727
80,81,4430,426,473,106.884,28.5771,61.4229,99.9594
81,82,2599,349,472,98.4355,3.4856300000000005,86.5144,99.9879
82,83,2076,229,478,273.616,25.0995,64.9005,99.9808
83,84,860,3341,465,223.818,75.7496,14.2504,99.9414
84,85,2607,917,490,281.832,9.96011,80.0399,99.9892
85,86,2471,170,484,283.608,5.86794,84.1321,99.9892
86,87,9998,3247,533,286.311,1.77528,88.2247,99.8711
87,88,11981,1519,530,112.895,18.34,71.66,99.5166
88,89,2562,3346,516,239.938,70.8505,19.1495,99.6456
89,90,814,745,513,112.9,32.4106,57.5894,99.7899
90,91,2630,601,515,291.904,5.53827,84.4617,99.9774
91,92,878,1241,514,117.295,67.6351,22.3649,98.2955
92,93,1689,780,525,102.358,8.71165,81.2883,99.9943
93,94,19824,2624,625,100.086,8.57367,81.4263,99.9616
94,95,5150,2149,539,112.65,57.0857,32.9143,98.5913
95,96,46200,2326,659,286.047,43.24,46.76,99.8333
96,97,2334,2680,539,243.153,72.9307,17.0693,97.9097
97,98,845,358,518,104.527,33.1141,56.8859,99.9869
98,99,937,2211,532,258.431,74.9593,15.0407,97.6414
99,100,6926,199,540,281.82,79.3398,10.6602,99.9703
100,101,27719,664,596,111.049,30.8902,59.1098,99.7717
101,102,10840,853,582,107.889,30.2378,59.7622,99.942
102,103,64699,1697,694,112.502,9.57702,80.423,99.9214
103,104,953,443,546,105.619,23.2963,66.7037,99.9915
104,105,842,3424,541,331.065,42.3141,47.6859,99.3544
105,106,1470,387,549,267.376,65.9291,24.0709,99.9896
106,107,3820,1864,568,280.533,65.64,24.36,99.9614
107,108,1980,3372,571,329.231,42.1131,47.8869,99.6008
108,109,5417,287,589,101.381,15.4658,74.5342,99.9915
109,110,597,1913,553,112.6,13.8677,76.1323,99.979
110,111,4144,1274,598,293.903,51.8674,38.1326,99.9294
111,112,16914,1499,693,282.575,23.2316,66.7684,95.5101
112,113,5143,1194,619,108.841,73.8237,16.1763,99.9485
113,114,6631,2179,628,107.365,3.98191,86.0181,99.9833
114,115,1028,471,598,292.899,75.842,14.158,99.9893
115,116,3798,2106,613,282.255,8.913680000000003,81.0863,99.9799
116,117,1718,225,602,95.3446,64.3963,25.6037,99.9927
117,118,18902,349,665,294.082,73.0213,16.9787,99.8378
118,119,679,3333,598,115.913,35.8801,54.1199,99.9753
119,120,7515,1922,635,280.763,38.3569,51.6431,99.9551
120,121,172860,845,801,283.1020000000001,5.05434,84.9457,99.2506
121,122,697,3380,605,314.555,44.7085,45.2915,99.8337
122,123,2506,1837,628,102.525,6.913869999999998,83.0861,99.9884
123,124,1582,1532,613,291.267,11.2282,78.7718,99.9918
124,125,6041,2011,665,282.318,5.82717,84.1728,95.5612
125,126,9951,2724,656,282.743,51.2943,38.7057,99.9652
126,127,14906,3265,722,291.95,18.4463,71.5537,99.9775
127,128,933,1418,628,274.319,2.49405,87.506,99.9941
128,129,2983,149,643,277.806,3.61687,86.3831,99.99
129,130,24714,198,776,101.872,19.5319,70.4681,99.5759
130,131,22841,449,728,97.2984,6.35848,83.6415,98.7615
131,132,17696,1344,706,96.0691,39.668,50.332,99.9592
132,133,512,3431,645,154.355,56.442,33.558,99.7925
133,134,636,3378,644,159.281,56.575,33.425,99.9858
134,135,515,1241,656,284.756,46.9142,43.0858,99.9795
135,136,2394,1537,675,117.648,16.2632,73.7368,99.9934
136,137,538,1206,661,270.878,21.9272,68.0728,99.9067
137,138,25560,2071,764,126.541,74.068,15.932,99.9319
138,139,1651,3373,672,172.09400000000005,49.0208,40.9792,99.6365
139,140,6320,1886,704,260.986,65.3586,24.6414,99.976
140,141,860,3429,673,169.12400000000005,49.7724,40.2276,99.6808
141,142,26942,1162,768,110.24,60.4516,29.5484,99.841
142,143,2327,1446,708,113.091,61.8014,28.1986,99.9752
143,144,1843,3348,701,43.7455,43.2042,46.7958,99.9732
144,145,12747,2231,759,204.26,82.8889,7.11113,99.9412
145,146,703,3429,714,126.072,19.4203,70.5797,99.7229
146,147,658,3409,730,141.395,13.9152,76.0848,99.719
147,148,1864,1267,727,107.711,18.1097,71.8903,99.9335
148,149,1768,2741,721,102.387,13.1423,76.8577,99.9796
149,150,701,1966,727,103.076,46.0256,43.9744,99.9753
150,151,1793,3404,757,151.626,8.24062,81.7594,99.5577
151,152,4238,252,746,250.712,81.1896,8.8104,99.9846
152,153,3696,2651,783,286.7340000000001,0.19101,89.809,99.9406
153,154,1454,2707,776,201.906,79.5846,10.4154,99.9168
154,155,10516,1844,799,244.727,84.2545,5.74547,99.9645
155,156,38948,2448,861,137.805,61.7261,28.2739,99.8913
156,157,8332,1426,807,104.967,7.34903,82.65100000000002,99.9812
157,158,1034,3365,781,288.446,15.9082,74.0918,99.9859
158,159,32108,3071,878,288.502,31.8558,58.1442,99.7668
159,160,2540,2745,787,100.755,8.87981,81.1202,99.9901
160,161,24342,3259,918,107.652,16.3411,73.6589,99.891
161,162,3772,1327,808,102.719,3.51436,86.4856,99.9806
162,163,651,537,784,129.433,53.6185,36.3815,99.9849
163,164,1259,2807,788,289.964,47.5647,42.4353,99.9881
164,165,4598,473,827,123.531,55.3834,34.6166,99.714
165,166,18946,2194,880,287.093,11.0098,78.9902,99.8839
166,167,21710,2646,884,109.791,16.1775,73.8225,99.9412
167,168,3107,319,807,183.833,79.2318,10.7682,99.9887
168,169,16390,1887,890,277.193,17.7331,72.2669,99.4321
169,170,676,2881,813,280.978,43.71100000000001,46.289,99.9894
170,171,23361,1242,895,135.465,71.2773,18.7227,99.9101
171,172,25185,1511,877,236.33,78.892,11.108,99.8595
172,173,6996,2289,900,284.581,28.856,61.144,99.9688
173,174,731,544,831,115.426,26.7652,63.2348,99.9972
174,175,13372,2833,875,135.667,78.7401,11.2599,99.8745
175,176,88825,344,1005,104.269,57.7715,32.2285,61.3115
176,177,1993,296,872,278.905,4.24522,85.7548,99.9934
177,178,1863,531,872,277.168,71.1264,18.8736,99.9867
178,179,2647,1658,896,286.827,22.1428,67.8572,99.8935
179,180,8231,1944,921,138.632,74.8266,15.1734,99.8408
180,181,1448,1606,884,293.353,50.1333,39.8667,99.9867
181,182,6099,2742,927,102.233,3.05762,86.9424,99.9741
182,183,5105,2083,921,136.069,70.5075,19.4925,99.9793
183,184,56672,979,1040,287.731,34.5283,55.4717,99.3212
184,185,17662,2816,993,284.638,30.1488,59.8512,99.7934
185,186,91884,1684,1114,104.514,23.8811,66.1189,99.5398
186,187,7075,2559,963,107.142,2.15987,87.8401,99.9629
187,188,5377,264,941,100.421,3.06687,86.9331,99.9892
188,189,15040,2026,1020,264.997,75.7367,14.2633,97.7934
189,190,4378,1346,962,110.764,28.7484,61.2516,99.9656
190,191,24842,1493,1018,291.639,28.6789,61.3211,98.9654
191,192,10969,2146,1003,119.702,61.5184,28.4816,98.7781
192,193,2095,3140,974,283.371,56.5106,33.4894,99.9268
193,194,8779,652,988,111.307,34.4189,55.5811,99.5708
194,195,522,2332,955,282.047,10.5154,79.4846,99.9698
195,196,790,2457,961,113.703,30.7656,59.2344,99.7234
196,197,6118,2919,1009,254.883,61.2347,28.7653,99.8631
197,198,13681,2322,1056,103.089,49.2984,40.7016,70.6742
198,199,19750,1254,1082,91.0135,66.9364,23.0636,99.2373
199,200,13628,3211,1060,106.973,7.6649600000000015,82.335,99.8614
200,201,3212,2460,999,283.026,61.91,28.09,99.9277
201,202,8369,3113,1059,106.663,16.8612,73.1388,99.9496
202,203,781,2585,994,283.742,3.02603,86.97399999999998,99.9856
203,204,2067,2260,1005,145.976,62.301,27.699,99.9802
204,205,952,2622,1012,127.579,43.6074,46.3926,99.9521
205,206,1224,1733,1026,281.746,20.7825,69.2175,99.91
206,207,7230,2688,1056,117.643,46.6745,43.3255,99.2873
207,208,820,1202,1026,279.769,56.5912,33.4088,99.1091
208,209,2442,1944,1037,127.803,66.9213,23.0787,99.2772
209,210,2104,1332,1033,308.798,67.3009,22.6991,99.141
210,211,606,2553,1035,112.645,23.0366,66.9634,99.9248
211,212,5762,3016,1060,106.478,1.77123,88.2288,99.6524
212,213,696,1228,1034,316.676,63.8964,26.1036,99.9764
213,214,31403,2483,1142,106.234,24.2443,65.7557,98.9557
214,215,1820,679,1054,108.854,56.9931,33.0069,99.9891
215,216,3779,2585,1078,283.534,3.16135,86.8386,99.9595
216,217,3358,2637,1100,109.274,17.1556,72.8444,99.9862
217,218,4503,2884,1076,85.8275,63.9069,26.0931,99.9493
218,219,63181,809,1224,118.87,64.4855,25.5145,99.7782
219,220,8261,565,1120,289.278,23.2966,66.7034,99.9447
220,221,1597,3278,1082,100.084,52.9292,37.0708,99.881
221,222,2624,1647,1090,105.689,18.667,71.333,99.9724
222,223,1488,2194,1079,285.217,12.5019,77.4981,99.9929
223,224,1326,1413,1084,270.781,26.407,63.593,99.9393
224,225,16549,1880,1164,274.871,26.2348,63.7652,99.9791
225,226,1405,2970,1095,93.7461,23.4998,66.5002,98.9845
226,227,30209,2125,1177,110.561,6.3489900000000015,83.65100000000002,99.9651
227,228,23319,2857,1152,110.19,47.9178,42.0822,99.7924
228,229,2628,267,1109,277.7,4.20255,85.7975,99.9752
229,230,1486,2241,1102,290.273,29.8198,60.1802,99.9938
230,231,10397,455,1157,97.7079,0.394844,89.6052,99.1084
231,232,6947,3062,1132,111.988,21.7718,68.2282,99.9624
232,233,8109,355,1129,292.518,59.7171,30.2829,99.9627
233,234,1156,603,1114,294.959,9.24767,80.7523,99.9958
234,235,14342,1988,1172,285.119,9.03375,80.9662,98.7233
235,236,79444,1342,1265,102.706,17.1623,72.8377,99.7548
236,237,8760,2688,1170,287.503,65.1972,24.8028,99.941
237,238,561,1488,1128,105.585,44.1578,45.8422,99.4652
238,239,17664,638,1196,108.766,38.3817,51.6183,99.5663
239,240,1833,2358,1133,129.93200000000002,68.6071,21.3929,99.9738
240,241,4700,3304,1186,98.5952,14.9085,75.0915,99.9697
241,242,644,2241,1135,289.348,30.1083,59.8917,99.9857
242,243,1963,2609,1178,110.606,17.2996,72.7004,99.9816
243,244,2804,3061,1174,102.606,63.1037,26.8963,99.9888
244,245,1907,271,1180,293.991,59.359,30.641,99.9939
245,246,25922,1046,1259,293.584,25.9803,64.0197,99.7842
246,247,2226,225,1186,125.143,68.6522,21.3478,99.9867
247,248,1759,3269,1170,113.975,21.8215,68.1785,99.9931
248,249,2568,3157,1167,283.257,16.7356,73.2644,99.9867
249,250,5795,1132,1186,115.371,38.7637,51.2363,99.9763
250,251,2500,3216,1175,111.567,13.7998,76.2002,99.9905
251,252,1242,906,1178,107.524,64.8218,25.1782,99.9927
252,253,5766,2370,1187,290.846,42.3973,47.6027,99.97
253,254,532,2293,1174,102.216,24.1726,65.8274,99.9712
254,255,1929,2237,1186,295.171,71.9766,18.0234,99.985
255,256,1441,536,1200,284.184,34.6697,55.3303,99.9746
256,257,1029,938,1189,108.873,39.9343,50.0657,99.9803
257,258,1696,353,1186,97.688,33.9641,56.0359,99.9643
258,259,3981,3127,1217,109.843,8.05514,81.9449,99.8598
259,260,6856,2774,1233,29.2652,87.6582,2.3418,99.964
260,261,54014,2992,1362,287.983,11.7748,78.2252,77.2308
261,262,1052,2278,1209,285.928,23.3508,66.6492,99.9967
262,263,562,1703,1212,107.377,16.7801,73.2199,99.9927
263,264,14518,252,1275,287.157,51.8745,38.1255,99.9708
264,265,6999,2274,1247,104.414,23.3625,66.6375,99.9777
265,266,7537,366,1260,280.492,50.2389,39.7611,99.9579
266,267,1824,3214,1224,282.749,18.4943,71.5057,99.9918
267,268,826,2194,1229,284.785,12.7236,77.2764,99.9959
268,269,16046,2584,1280,146.016,67.7941,22.2059,99.9732
269,270,1481,3260,1248,280.05,4.28925,85.7107,99.991
270,271,7606,1961,1269,191.84,80.6751,9.32487,99.9634
271,272,6435,458,1274,280.931,13.6041,76.3959,62.0239
272,273,5797,3171,1295,288.089,32.0736,57.9264,99.966
273,274,9458,567,1287,279.266,63.3996,26.6004,99.8661
274,275,21535,2406,1320,102.639,28.7697,61.2303,99.8449
275,276,14682,1762,1309,140.30200000000002,67.2344,22.7656,99.9572
276,277,783,3309,1271,285.997,0.6312479999999999,89.3688,99.9466
277,278,1071,3227,1277,274.297,26.6048,63.3952,99.9936
278,279,1263,163,1301,286.008,51.7985,38.2015,99.9808
279,280,4663,2281,1317,139.984,72.618,17.382,99.9613
280,281,21515,1873,1358,278.188,14.4118,75.5882,99.922
281,282,545,2887,1298,114.432,44.9624,45.0376,99.9858
282,283,9440,2761,1318,147.813,87.6634,2.33657,99.9748
283,284,590,3279,1289,287.145,22.5367,67.4633,99.984
284,285,2158,3105,1304,120.681,41.4479,48.5521,99.9759
285,286,1087,2048,1297,291.666,85.8359,4.16405,99.9961
286,287,1725,3240,1313,287.139,30.46,59.54,99.9781
287,288,1306,1155,1316,290.116,29.6428,60.3572,99.9928
288,289,9070,2136,1335,287.709,12.3903,77.6097,99.8979
289,290,1003,1613,1309,291.538,53.9662,36.0338,99.9933
290,291,512,1665,1312,275.252,68.1955,21.8045,99.98
291,292,2226,1577,1340,279.10200000000003,65.5874,24.4126,99.9012
292,293,2739,387,1346,288.411,52.8749,37.1251,99.9557
293,294,5801,3299,1366,286.629,0.596191,89.4038,99.9836
294,295,7507,309,1364,122.287,68.3692,21.6308,99.9633
295,296,1523,1206,1354,288.8590000000001,25.0506,64.9494,99.9936
296,297,26231,2617,1406,287.047,10.4127,79.5873,99.9066
297,298,1522,2053,1337,289.921,85.3965,4.60351,99.9968
298,299,20286,761,1406,111.333,25.8795,64.1205,99.8177
299,300,113592,1221,1513,282.439,22.2106,67.7894,98.4667
300,301,7045,2834,1388,241.878,84.2032,5.7968199999999985,99.9603
301,302,535,440,1354,269.475,49.9653,40.0347,99.9894
302,303,25243,3175,1441,120.178,44.0725,45.9275,99.8443
303,304,48602,545,1441,230.238,72.5289,17.4711,99.1422
304,305,3057,2350,1401,116.305,54.6319,35.3681,99.9769
305,306,5816,958,1400,108.229,27.0229,62.9771,99.5544
306,307,1765,1525,1364,285.778,33.5976,56.4024,99.9895
307,308,5429,187,1407,268.173,44.7095,45.2905,99.9821
308,309,742,218,1376,268.823,43.6606,46.3394,99.9893
309,310,905,2227,1364,266.124,71.0553,18.9447,99.9908
310,311,1725,2755,1372,110.698,37.4748,52.5252,99.9743
311,312,8468,890,1440,100.839,6.10203,83.898,99.9824
312,313,8643,1619,1408,266.877,66.8664,23.1336,99.9716
313,314,1259,2281,1378,283.784,9.79982,80.2002,99.9852
314,315,3841,1028,1406,110.446,5.41205,84.588,99.9839
315,316,708,2483,1392,282.948,35.7623,54.2377,98.8606
316,317,9912,2222,1442,121.487,50.6831,39.3169,99.8417
317,318,7390,2000,1432,241.635,85.4092,4.59082,99.9667
318,319,3326,2300,1420,101.179,5.57638,84.4236,99.9718
319,320,1436,2145,1414,251.641,78.4427,11.5573,99.9932
320,321,3026,248,1436,119.541,48.3363,41.6637,99.9926
321,322,109576,1917,1590,286.714,21.9374,68.0626,46.1642
322,323,4697,1773,1457,111.309,37.5762,52.4238,99.9434
323,324,47330,2751,1566,276.953,37.3719,52.6281,99.7195
324,325,11886,253,1490,112.665,19.2062,70.7938,68.048
325,326,5813,1889,1459,233.802,74.4157,15.5843,99.9399
326,327,750,2503,1438,286.533,34.1115,55.8885,99.9903
327,328,4106,2443,1471,110.944,68.0089,21.9911,99.7766
328,329,637,3336,1456,269.392,34.6113,55.3887,99.9292
329,330,663,1799,1451,105.898,34.7576,55.2424,99.9862
330,331,1816,146,1481,291.687,35.2086,54.7914,99.8976
331,332,4710,1622,1468,283.011,26.9352,63.0648,99.9775
332,333,5760,3282,1516,274.118,34.8408,55.1592,99.8766
333,334,13922,2339,1514,253.884,73.9744,16.0256,98.4102
334,335,2182,2856,1477,119.427,46.8927,43.1073,99.9913
335,336,1429,980,1475,104.757,5.8944800000000015,84.1055,99.028
336,337,602,1672,1486,121.277,38.8311,51.1689,99.9779
337,338,40273,343,1587,281.09,50.782,39.218,99.741
338,339,3088,1559,1532,285.922,1.03217,88.9678,99.9561
339,340,2682,923,1518,108.961,62.6077,27.3923,99.033
340,341,10254,759,1533,282.936,9.70745,80.2925,99.9481
341,342,2049,2548,1518,129.439,45.7846,44.2154,99.8219
342,343,6344,3203,1541,110.495,39.4561,50.5439,99.5322
343,344,646,3328,1513,272.04200000000003,35.1094,54.8906,99.7661
344,345,36786,2587,1651,109.514,10.643,79.357,99.9287
345,346,3201,581,1556,293.706,78.3557,11.6443,99.9615
346,347,4117,854,1562,281.964,17.017,72.983,99.9842
347,348,115816,2933,1721,105.953,2.83266,87.1673,98.621
348,349,568,1602,1534,286.3540000000001,27.3259,62.6741,99.9222
349,350,6768,2448,1592,283.87,74.9507,15.0493,99.7049
350,351,2503,2281,1571,69.7433,86.4524,3.5476,99.819
351,352,1267,194,1576,285.6020000000001,47.8049,42.1951,99.9693
352,353,45312,708,1670,275.587,3.88137,86.1186,99.7995
353,354,4397,1518,1590,299.416,56.8545,33.1455,99.9796
354,355,7584,519,1612,295.5420000000001,65.0126,24.9874,99.8917
355,356,14058,978,1675,108.352,18.1559,71.8441,98.5454
356,357,591,3330,1561,277.48900000000003,35.6019,54.3981,99.7148
357,358,40681,1398,1675,100.136,43.2001,46.7999,99.6132
358,359,2788,3229,1591,106.688,46.7712,43.2288,99.9846
359,360,16017,1602,1650,110.7,40.5689,49.4311,99.947
360,361,6401,424,1657,279.565,31.7672,58.2328,99.9495
361,362,1139,1874,1615,284.935,76.6491,13.3509,99.9597
362,363,3935,3252,1642,96.7645,45.1979,44.8021,99.9722
363,364,20879,202,1721,289.967,33.8094,56.1906,99.9834
364,365,4040,2322,1636,122.642,86.6895,3.3105,99.9648
365,366,1314,874,1636,100.829,18.7235,71.2765,99.9943
366,367,2294,3193,1652,103.861,4.49896,85.501,99.9838
367,368,861,3294,1644,94.7686,46.5576,43.4424,99.9888
368,369,5785,584,1670,288.855,5.11016,84.8898,99.9672
369,370,94270,2244,1824,276.54,17.2221,72.7779,99.5536
370,371,66401,1968,1808,105.216,15.2053,74.7947,96.5006
371,372,7318,2411,1710,274.608,53.3767,36.6233,99.9059
372,373,2252,907,1680,280.606,16.5603,73.4397,99.9902
373,374,5886,1147,1715,105.531,70.5013,19.4987,99.8759
374,375,758,3287,1684,96.3638,46.3325,43.6675,99.9884
375,376,2730,1081,1691,107.889,19.4412,70.5588,99.9885
376,377,3324,2345,1694,78.8271,81.4509,8.5491,99.9859
377,378,765,2480,1683,286.791,52.7536,37.2464,99.5066
378,379,8838,510,1738,126.892,43.2051,46.7949,99.8335
379,380,37996,3172,1811,112.928,7.82332,82.1767,99.9424
380,381,6328,1250,1725,285.783,24.7273,65.2727,99.9801
381,382,2898,292,1720,105.071,49.9812,40.0188,99.9921
382,383,5633,3292,1760,113.76,64.2829,25.7171,99.98
383,384,28203,2505,1891,103.738,2.81882,87.1812,98.6311
384,385,3293,864,1749,283.097,47.7055,42.2945,99.9778
385,386,2719,401,1747,277.322,48.8364,41.1636,99.9829
386,387,7707,1564,1763,307.927,64.3473,25.6527,99.9876
387,388,908,914,1732,272.524,35.5589,54.4411,99.9835
388,389,579,2456,1758,271.334,53.4944,36.5056,99.4854
389,390,568,972,1757,286.77,12.3726,77.6274,98.7679
390,391,54201,1237,1861,241.056,71.9135,18.0865,99.8047
391,392,45954,760,1859,281.069,12.3591,77.6409,99.8438
392,393,1538,925,1773,101.475,21.1494,68.8506,99.9632
393,394,28123,1012,1879,275.415,66.7986,23.2014,99.5745
394,395,3011,2656,1807,277.367,10.9851,79.0149,99.9875
395,396,8160,2570,1812,279.815,29.1631,60.8369,99.8823
396,397,8754,359,1822,280.403,49.6239,40.3761,99.9588
397,398,941,470,1796,283.7870000000001,23.4926,66.5074,98.6908
398,399,741,1405,1787,286.918,59.1719,30.8281,99.9963
399,400,1798,1464,1798,288.923,11.7987,78.2013,99.1197
400,401,2065,938,1822,181.181,77.9448,12.0552,99.967
401,402,3818,1607,1821,219.133,80.6566,9.34342,99.9536
402,403,1658,899,1811,270.85400000000004,35.4484,54.5516,99.9742
403,404,14950,583,1892,115.919,35.9461,54.0539,99.9548
404,405,5546,266,1838,111.519,48.4286,41.5714,99.9837
405,406,55528,1735,1930,297.443,68.2534,21.7466,99.7035
406,407,1930,1418,1825,97.6407,45.5515,44.4485,99.978
407,408,1387,436,1838,222.017,84.8481,5.15191,99.9666
408,409,6703,204,1890,289.16,28.9147,61.0853,99.9811
409,410,3270,1545,1844,249.985,77.1285,12.8715,99.9538
410,411,2545,3055,1861,113.407,27.8176,62.1824,99.9799
411,412,1656,1477,1843,282.415,31.2425,58.7575,98.8923
412,413,43068,3018,1992,111.678,11.9265,78.0735,74.4567
413,414,1067,3014,1847,125.486,51.5642,38.4358,99.9437
414,415,5868,3307,1908,287.895,13.9102,76.0898,99.9879
415,416,1070,156,1863,105.867,15.6952,74.3048,99.9045
416,417,1119,481,1863,286.688,63.5965,26.4035,99.7324
417,418,4072,3199,1901,281.596,5.68041,84.3196,99.9739
418,419,125404,1392,2084,284.555,35.5973,54.4027,97.6312
419,420,10143,460,1931,281.168,63.2715,26.7285,99.7654
420,421,3035,3243,1921,286.362,0.8964690000000001,89.1035,99.9862
421,422,2359,297,1920,111.834,49.5006,40.4994,99.9882
422,423,11942,2691,1950,114.5,23.7575,66.2425,99.9754
423,424,4631,2109,1961,127.994,50.2623,39.7377,99.9778
424,425,1014,362,1932,267.626,69.8681,20.1319,99.9927
425,426,1101,1152,1924,130.987,55.9615,34.0385,99.9912
426,427,13343,865,2001,105.498,75.3179,14.6821,98.6554
427,428,2920,2172,1950,114.636,28.5638,61.4362,99.995
428,429,5942,227,1975,103.725,15.4054,74.5946,99.9618
429,430,920,2923,1956,283.951,1.92068,88.0793,99.9537
430,431,27829,2519,2069,280.898,73.5919,16.4081,98.144
431,432,12294,1131,1991,115.942,70.2085,19.7915,98.8365
432,433,31476,2831,2037,120.345,52.5355,37.4645,99.2358
433,434,11711,720,2000,116.047,46.7827,43.2173,99.1823
434,435,56565,1946,2122,283.6,17.2838,72.7162,99.0257
435,436,35582,355,2051,106.735,36.2403,53.7597,99.7663
436,437,6841,3278,2006,196.933,82.8343,7.165660000000001,99.3156
437,438,570,163,1970,104.682,15.2708,74.7292,99.9608
438,439,25475,575,2068,287.838,7.698110000000002,82.3019,99.5885
439,440,11781,962,2054,110.38,72.4473,17.5527,99.1622
440,441,763,2060,1994,103.799,8.92216,81.0778,99.9926
441,442,1509,2634,2003,274.194,41.7327,48.2673,99.9942
442,443,3433,3182,2010,277.014,45.3619,44.6381,99.9877
443,444,3972,167,2036,283.893,18.8743,71.1257,99.9615
444,445,1258,3332,2040,191.173,83.5878,6.41215,98.2275
445,446,2306,2184,2024,280.94,30.6465,59.3535,99.8679
446,447,892,1036,2015,118.91,28.9185,61.0815,99.8494
447,448,1985,1682,2032,111.79,23.0476,66.9524,99.9786
448,449,5541,3241,2053,126.466,51.2389,38.7611,99.3516
449,450,10483,2351,2066,102.256,45.3669,44.6331,99.7033
450,451,13179,2097,2085,115.745,49.1313,40.8687,99.6741
451,452,4967,2646,2068,106.843,54.7416,35.2584,99.4128
452,453,22276,1042,2153,116.156,0.217743,89.7823,99.6335
453,454,6803,727,2092,119.675,46.6944,43.3056,99.9816
454,455,2223,1649,2084,306.935,61.0738,28.9262,99.9914
455,456,11062,2201,2119,114.003,52.9731,37.0269,99.9754
456,457,21934,1649,2176,106.197,2.80842,87.1916,99.9234
457,458,8701,244,2162,288.5490000000001,25.8262,64.1738,99.9643
458,459,1146,812,2090,95.8724,73.3629,16.6371,99.994
459,460,2589,969,2100,284.58,13.8287,76.1713,98.4631
460,461,1035,2270,2088,109.878,67.0197,22.9803,99.9927
461,462,41619,3205,2188,285.205,22.1049,67.8951,99.8334
462,463,3170,189,2127,279.347,70.5937,19.4063,99.9897
463,464,1898,432,2105,100.679,18.9713,71.0287,99.9659
464,465,33458,2700,2190,139.957,82.4297,7.57028,99.7445
465,466,1281,156,2135,284.261,70.2367,19.7633,99.9693
466,467,8690,1807,2145,100.796,0.366905,89.6331,99.9371
467,468,4753,2304,2157,282.6740000000001,27.8047,62.1953,99.9891
468,469,13921,873,2198,103.0,13.9625,76.0375,99.9644
469,470,6039,764,2152,295.503,69.9933,20.0066,99.9056
470,471,51787,2443,2313,115.744,28.9229,61.0771,96.9066
471,472,518,2828,2132,277.848,10.9474,79.0526,99.9945
472,473,3530,2973,2165,288.316,2.83155,87.1684,98.415
473,474,2042,2855,2163,145.52700000000004,86.5774,3.4226300000000003,99.9883
474,475,3477,2917,2178,279.552,6.4146,83.5854,99.954
475,476,4531,670,2181,110.467,20.6235,69.3765,99.99
476,477,1009,473,2168,274.954,67.6912,22.3088,99.7774
477,478,2726,608,2180,112.948,32.0572,57.9428,99.9869
478,479,1081,409,2171,99.8511,18.8632,71.1368,99.9934
479,480,3148,543,2184,113.65,19.2415,70.7585,99.9672
480,481,10459,2176,2232,113.973,31.7454,58.2546,99.8996
481,482,2772,353,2193,101.412,16.642,73.358,99.993
482,483,2763,3051,2199,128.424,46.9493,43.0507,99.995
483,484,3844,1344,2214,269.388,6.07195,83.928,99.987
484,485,15462,2316,2299,279.038,3.13908,86.8609,99.8875
485,486,16168,1824,2246,279.111,65.8821,24.1179,99.9463
486,487,1631,2233,2193,113.799,18.66,71.34,99.986
487,488,824,1740,2200,282.091,22.1638,67.8362,99.9964
488,489,10021,199,2273,280.793,5.32534,84.6747,99.9297
489,490,6679,2543,2225,118.81,1.96817,88.0318,99.9897
490,491,1137,437,2200,106.078,35.5078,54.4922,99.9899
491,492,36868,784,2330,105.479,7.30785,82.6921,99.8205
492,493,1154,3100,2204,116.763,14.7035,75.2965,99.9846
493,494,14650,2809,2272,281.003,43.5657,46.4343,99.9652
494,495,32378,325,2351,281.956,21.9944,68.0056,99.8957
495,496,36117,499,2349,258.403,66.0676,23.9324,99.5156
496,497,5172,596,2248,110.634,17.1543,72.8457,99.9822
497,498,3380,1012,2246,115.086,15.3712,74.6288,99.9913
498,499,12685,1304,2308,125.072,67.3538,22.6462,99.9077
499,500,2615,2992,2249,288.119,44.0147,45.9853,99.4949
500,501,970,652,2236,107.145,20.0983,69.9017,99.992
501,502,1242,2920,2235,276.203,15.129,74.87100000000002,99.9876
502,503,5162,2084,2258,248.427,80.5577,9.44234,99.982
503,504,25379,1674,2325,286.231,0.15171099999999998,89.8483,99.9433
504,505,895,1097,2246,112.865,15.1905,74.8095,99.9974
505,506,1880,688,2251,289.712,67.7684,22.2316,99.9891
506,507,3544,936,2286,123.601,76.6684,13.3316,99.7192
507,508,8590,1224,2314,118.432,52.9895,37.0105,99.9108
508,509,6970,3032,2310,141.16299999999995,67.209,22.791,99.9711
509,510,4301,1134,2300,287.053,30.8815,59.1185,99.9833
510,511,1036,2592,2274,289.676,69.6172,20.3828,99.9739
511,512,19870,3134,2343,291.687,6.53329,83.4667,99.9581
512,513,8739,1553,2312,280.16700000000003,44.4063,45.5937,99.9765
513,514,2755,1419,2277,267.171,49.254,40.746,99.9762
514,515,13004,1981,2359,283.422,51.8955,38.1045,74.9095
515,516,1253,1062,2280,136.023,76.3183,13.6817,99.9879
516,517,1486,2952,2300,111.651,17.7124,72.2876,99.078
517,518,3923,250,2300,286.709,75.7495,14.2505,99.9925
518,519,4621,2882,2307,109.228,50.7916,39.2084,99.9599
519,520,25565,1398,2408,279.319,1.56709,88.4329,99.5738
520,521,9940,2242,2342,242.49400000000003,78.8225,11.1775,99.9589
521,522,1263,641,2290,114.316,25.2712,64.7288,99.9906
522,523,667,1108,2279,293.6690000000001,47.3006,42.6994,99.9909
523,524,850,1505,2280,130.211,66.2469,23.7531,99.9935
524,525,4934,3310,2346,112.63,13.7376,76.2624,99.8817
525,526,10637,1031,2338,112.281,6.70051,83.2995,99.7436
526,527,13681,2102,2349,284.698,32.9348,57.0652,99.9309
527,528,1378,1478,2313,288.329,68.0373,21.9627,99.8703
528,529,1021,2698,2308,115.97,23.8961,66.1039,99.9965
529,530,6460,3236,2369,133.815,70.7939,19.2061,99.9695
530,531,1692,366,2322,101.012,14.8265,75.1735,99.9864
531,532,1596,876,2339,110.043,43.3134,46.6866,99.9896
532,533,27276,2967,2431,280.625,42.7323,47.2677,99.3253
533,534,1006,2548,2331,265.778,73.354,16.646,99.9976
534,535,1377,2669,2340,115.065,2.95853,87.0415,99.9941
535,536,7725,2801,2402,284.403,13.5339,76.4661,99.9756
536,537,3123,1873,2393,106.911,13.092,76.908,99.9818
537,538,31321,946,2488,288.615,0.612984,89.387,99.1819
538,539,2361,699,2374,107.673,25.5663,64.4337,99.9765
539,540,4210,2858,2397,278.85400000000004,20.0382,69.9618,99.9906
540,541,757,1831,2385,267.868,65.4542,24.5458,99.9973
541,542,15673,1219,2439,285.788,2.1123,87.8877,99.9585
542,543,106317,1687,2518,105.346,13.3892,76.6108,73.0547
543,544,518,996,2385,127.122,77.9271,12.0729,99.9911
544,545,17286,638,2465,110.346,5.38248,84.6175,99.9303
545,546,626,1128,2393,124.893,50.3544,39.6456,99.9633
546,547,6915,1088,2441,274.151,54.3771,35.6229,99.9677
547,548,6218,2045,2445,267.982,50.5514,39.4486,99.9863
548,549,9311,2583,2464,286.366,15.7813,74.2187,99.9419
549,550,10894,3284,2467,297.473,15.3299,74.6701,99.9279
550,551,3341,2689,2437,262.671,74.9633,15.0367,99.9435
551,552,9713,2207,2450,282.422,64.9699,25.0301,99.869
552,553,11150,772,2472,285.816,1.7397200000000002,88.2603,94.1626
553,554,1433,2125,2437,243.642,75.0512,14.9488,99.9884
554,555,7247,3155,2484,115.082,15.424,74.57600000000002,99.9483
555,556,1313,258,2435,105.232,10.5137,79.4863,99.9932
556,557,1349,3233,2436,110.765,14.1573,75.8427,99.963
557,558,9618,2282,2492,213.279,71.6738,18.3262,99.5739
558,559,1157,210,2451,109.362,35.0542,54.9458,99.9606
559,560,2114,2341,2502,144.405,80.3179,9.68213,98.2128
560,561,6073,2837,2504,105.945,21.3218,68.6782,99.9774
561,562,659,2372,2486,114.886,39.6838,50.3162,99.9758
562,563,1636,3099,2485,111.097,7.85544,82.1446,99.973
563,564,10271,333,2496,160.08,82.1283,7.87173,98.6899
564,565,15992,2696,2536,109.88,25.3227,64.6773,99.8901
565,566,2085,504,2501,124.094,45.8031,44.1969,99.0443
566,567,142036,2256,2710,127.137,52.4454,37.5546,99.6862
567,568,870,2406,2505,154.218,76.86,13.14,99.964
568,569,1865,2516,2503,257.353,64.6549,25.3451,99.9916
569,570,21153,1267,2559,284.1140000000001,9.11269,80.8873,99.8386
570,571,22334,3025,2563,117.481,65.9895,24.0105,98.4532
571,572,8422,235,2583,104.916,35.9222,54.0778,99.9785
572,573,24653,1102,2613,114.207,35.4846,54.5154,99.938
573,574,8439,2023,2587,277.442,17.0176,72.9824,99.8886
574,575,5393,3215,2538,283.421,39.0049,50.9951,99.6978
575,576,3512,455,2558,290.584,26.2248,63.7752,99.2304
576,577,639,2443,2511,195.804,81.359,8.64102,99.9927
577,578,4305,356,2568,109.668,86.6766,3.32337,99.9923
578,579,5825,1967,2556,281.203,37.0823,52.9177,98.9254
579,580,1628,2568,2545,103.179,23.371,66.62899999999999,99.8046
580,581,1541,2782,2553,277.783,53.6549,36.3451,99.1949
581,582,7415,832,2572,105.858,42.532,47.468,99.9664
582,583,3064,585,2578,117.749,84.5796,5.42036,99.9738
583,584,4715,3302,2614,281.068,56.4428,33.5572,99.8278
584,585,43223,725,2671,179.935,81.3795,8.620460000000001,99.7966
585,586,9609,2251,2595,288.384,1.42847,88.5715,99.9731
586,587,50236,484,2780,289.021,19.1505,70.8495,98.8851
587,588,724,639,2552,110.558,1.10447,88.8955,99.9872
588,589,983,3269,2561,103.971,24.9578,65.0422,99.9606
589,590,2180,1162,2574,282.24,2.3069,87.6931,99.9522
590,591,6668,3237,2622,113.797,6.30026,83.6997,99.991
591,592,16697,1830,2661,102.729,15.1964,74.8036,99.9184
592,593,1206,2760,2598,118.319,51.9984,38.0016,99.9816
593,594,571,2802,2600,109.169,5.61564,84.3844,99.9951
594,595,2006,2886,2613,284.7870000000001,48.6137,41.3863,99.9253
595,596,719,1224,2607,280.172,12.667,77.333,99.9883
596,597,128818,3136,2823,297.4120000000001,18.6313,71.3687,99.9349
597,598,603,2832,2618,289.785,54.3502,35.6498,99.9922
598,599,6394,1389,2671,230.384,78.9048,11.0952,99.9886
599,600,1990,537,2633,111.488,4.93687,85.0631,99.9956
600,601,1068,301,2629,285.325,71.0419,18.9581,99.9883
601,602,20735,2748,2706,112.209,19.5229,70.4771,99.9525
602,603,1952,1596,2643,113.466,42.9239,47.0761,99.9922
603,604,1587,410,2653,171.132,88.2479,1.75212,99.9851
604,605,1637,1013,2645,323.918,82.4911,7.50891,99.9657
605,606,3068,217,2655,111.237,47.6709,42.3291,99.9774
606,607,30421,1403,2735,97.9201,12.6235,77.3765,98.8264
607,608,672,2804,2637,302.057,62.2658,27.7342,99.9802
608,609,1630,874,2651,98.4326,11.3948,78.6052,99.9697
609,610,3093,611,2695,285.521,1.76373,88.2363,99.8919
610,611,12368,2896,2689,289.885,65.1822,24.8178,99.882
611,612,1001,596,2659,148.395,82.0554,7.94457,99.9867
612,613,18307,935,2709,112.606,33.2424,56.7576,99.2797
613,614,534,2854,2643,294.267,56.4797,33.5203,99.7597
614,615,2630,356,2660,284.601,67.9322,22.0678,99.9898
615,616,828,1048,2658,286.5420000000001,1.7322799999999998,88.2677,99.9818
616,617,1833,1264,2689,288.236,14.8804,75.1196,99.9767
617,618,14862,254,2744,285.881,28.1842,61.8158,99.7363
618,619,2303,1228,2704,113.523,44.8935,45.1065,99.9696
619,620,9717,1586,2718,113.931,44.3576,45.6424,99.9296
620,621,1555,2534,2683,286.955,32.0247,57.9753,99.9941
621,622,8240,2630,2715,104.733,18.3842,71.6158,99.9757
622,623,38016,1706,2808,212.805,78.5402,11.4598,99.7414
623,624,2276,1520,2704,120.115,50.1469,39.8531,99.9803
624,625,45706,1105,2830,291.9770000000001,11.5599,78.4401,99.9251
625,626,5789,329,2748,104.401,61.9003,28.0997,99.9594
626,627,18014,2432,2784,280.301,15.9244,74.0756,98.6256
627,628,1337,2508,2731,108.961,22.4972,67.5028,99.9528
628,629,1640,815,2744,126.025,76.0031,13.9969,99.9787
629,630,3368,169,2752,283.324,26.6051,63.3949,99.9726
630,631,1068,2555,2725,105.197,0.116028,89.884,99.9718
631,632,46061,1921,2875,121.981,75.9799,14.0201,49.50899999999999
632,633,3254,631,2758,282.79,30.2145,59.7855,99.9536
633,634,1060,2675,2748,97.7721,2.3388,87.6612,99.9936
634,635,1164,1220,2747,123.208,46.8483,43.1517,99.9964
635,636,25457,2677,2874,265.318,57.617,32.383,99.8734
636,637,2724,2896,2763,93.5367,10.6241,79.3759,99.9723
637,638,6337,2543,2809,109.975,20.9852,69.0148,99.9806
638,639,585,1269,2766,112.106,37.4835,52.5165,99.9877
639,640,42851,881,2879,110.919,41.3069,48.6931,99.5169
640,641,3375,2839,2797,279.433,14.8925,75.1075,99.9618
641,642,1104,1287,2796,94.6998,9.53908,80.4609,99.9949
642,643,4647,1238,2838,287.865,17.2351,72.7649,99.9915
643,644,9674,315,2886,289.33,20.9576,69.0424,99.9418
644,645,23394,1532,2870,102.352,6.34309,83.6569,99.5226
645,646,1149,632,2817,286.264,9.06873,80.9313,99.7555
646,647,14269,1328,2868,102.255,61.7549,28.2451,99.9497
647,648,9574,599,2882,115.316,20.7158,69.2842,99.9611
648,649,32769,278,2977,278.933,6.1506300000000005,83.8494,99.905
649,650,568,172,2858,278.764,5.64224,84.3578,99.97
650,651,3199,2839,2837,279.731,14.8509,75.1491,99.9622
651,652,2332,683,2844,135.42,72.4901,17.5099,99.9873
652,653,4610,2319,2885,278.595,67.1516,22.8484,99.9659
653,654,3531,2796,2889,104.313,9.28175,80.7182,99.9366
654,655,2525,3348,2933,104.974,28.9938,61.0062,99.9704
655,656,6820,2484,2909,282.0420000000001,67.3753,22.6247,99.8461
656,657,3342,422,2881,105.449,30.7768,59.2232,99.8033
657,658,8699,2897,2944,265.539,64.6713,25.3287,99.931
658,659,799,2844,2875,100.632,4.16689,85.8331,99.9918
659,660,1100,2378,2885,282.64,33.1377,56.8623,99.9951
660,661,1376,2548,2892,119.121,44.8646,45.1354,99.9685
661,662,2103,2059,2899,266.291,70.0731,19.9269,99.9755
662,663,558,1486,2892,286.4170000000001,62.1154,27.8846,99.9916
663,664,1787,2404,2906,276.317,67.6748,22.3252,99.9431
664,665,4021,684,2918,282.225,30.3688,59.6312,99.9815
665,666,2759,3319,2957,104.016,29.1255,60.8745,99.9855
666,667,6086,375,2932,277.588,7.994639999999999,82.0054,99.9838
667,668,3482,2092,2948,108.789,12.0484,77.9516,99.9854
668,669,2452,745,2919,288.559,15.9742,74.0258,99.9944
669,670,3295,1371,2929,278.356,30.8944,59.1056,99.9745
670,671,1897,2814,2932,104.115,2.43729,87.5627,99.9166
671,672,1085,1218,2927,207.147,73.6945,16.3055,99.9856
672,673,5489,2981,2959,289.05,14.7299,75.2701,99.2886
673,674,3700,2323,2949,105.447,15.7705,74.2295,99.9788
674,675,7191,1805,2966,273.197,28.6736,61.3264,99.9756
675,676,5154,1261,2974,144.779,69.1844,20.8156,99.9741
676,677,22575,2533,3037,294.033,66.2742,23.7258,98.5645
677,678,6401,1633,2960,274.378,26.9813,63.0187,99.9458
678,679,3324,2635,2978,124.094,39.0806,50.9194,99.9562
679,680,670,613,2960,113.675,21.4559,68.5441,99.9907
680,681,15368,1329,3031,281.468,31.1421,58.8579,99.7705
681,682,2122,2419,2972,194.423,77.8285,12.1715,99.9853
682,683,16882,1136,3020,274.881,24.6646,65.3354,99.8971
683,684,19261,706,3062,100.599,5.47334,84.5267,98.4333
684,685,2324,1456,2993,101.246,4.78925,85.2107,98.8261
685,686,22093,835,3051,106.545,42.1007,47.8993,99.6059
686,687,27199,1624,3033,276.785,21.6436,68.3564,96.37
687,688,32263,522,3065,112.083,32.4065,57.5935,99.5268
688,689,3068,1011,2987,124.342,38.9064,51.0936,99.8924
689,690,4778,2330,3000,105.051,15.6365,74.3635,99.9737
690,691,521,2238,2980,266.453,68.5163,21.4837,99.9918
691,692,3782,2720,3001,125.691,37.0419,52.9581,99.9698
692,693,1146,2795,2993,267.368,62.1654,27.8346,99.9787
693,694,6276,2136,3027,290.818,65.6982,24.3018,98.4557
694,695,1437,2020,2996,128.513,40.2416,49.7584,99.9864
695,696,3827,3285,3022,275.61400000000003,65.7984,24.2016,99.9323
696,697,4462,960,3034,282.461,22.4189,67.5811,98.6198
697,698,64270,2191,3185,284.061,64.413,25.587,99.5615
698,699,2974,2404,3023,112.294,50.2696,39.7304,99.6542
699,700,16760,2038,3075,122.316,43.4086,46.5914,99.7633
700,701,2516,3006,3025,115.104,17.5606,72.4394,99.9636
701,702,5712,2745,3059,293.536,60.6685,29.3315,98.6754
702,703,2071,2942,3052,281.808,10.3188,79.6812,98.9414
703,704,11860,2861,3076,112.805,49.1032,40.8968,99.6825
704,705,2447,1854,3031,164.445,84.4096,5.59037,98.1369
705,706,741,3350,3038,98.0598,11.3141,78.6859,99.9295
706,707,47472,1418,3201,111.092,46.9263,43.0737,99.5014
707,708,581,1026,3040,99.8131,65.2655,24.7345,99.9913
708,709,9463,3198,3082,111.048,20.492,69.508,99.9415
709,710,12065,3046,3129,288.797,29.0535,60.9465,99.9533
710,711,3099,1213,3090,111.484,25.7857,64.2143,99.9903
711,712,8748,1896,3112,140.101,87.2724,2.72764,99.9769
712,713,620,2369,3069,103.806,15.215,74.785,99.9884
713,714,2389,242,3103,288.096,32.1978,57.8022,99.9562
714,715,4412,1044,3093,284.273,18.1511,71.8489,99.9735
715,716,4641,3292,3114,283.0,3.4961900000000004,86.5038,99.9918
716,717,13567,2592,3142,116.391,49.2072,40.7928,99.9302
717,718,11152,2980,3184,298.148,55.6518,34.3482,99.5813
718,719,16042,2390,3199,98.6759,17.4395,72.5605,99.1441
719,720,3085,2687,3112,105.573,14.209,75.791,99.9913
720,721,2436,351,3110,285.222,32.5584,57.4416,99.9653
721,722,698,2143,3101,249.234,84.494,5.50602,99.9837
722,723,4733,1132,3119,107.364,7.39317,82.6068,99.9791
723,724,5597,1597,3112,280.785,2.68648,87.3135,99.9711
724,725,3740,1699,3115,282.4790000000001,11.5153,78.4847,99.9747
725,726,2103,2769,3116,116.983,51.672,38.328,99.9913
726,727,1966,1525,3130,283.333,35.0356,54.9644,99.9617
727,728,2964,986,3133,286.416,24.4163,65.5837,99.9882
728,729,1465,1245,3127,284.8640000000001,16.8337,73.1663,99.9926
729,730,6876,1791,3151,103.323,29.6187,60.3813,99.9757
730,731,2902,1313,3133,98.9783,9.91241,80.0876,99.9864
731,732,9650,300,3162,283.16,27.7484,62.2516,99.9798
732,733,5154,899,3150,84.022,75.2034,14.7966,99.9918
733,734,7364,3207,3165,108.971,37.7039,52.2961,99.9757
734,735,6824,632,3202,271.101,30.6109,59.3891,99.9821
735,736,7092,1058,3169,297.628,34.3398,55.6602,99.9935
736,737,3369,3123,3164,289.235,11.6775,78.3225,99.9867
737,738,6465,499,3191,283.884,29.3232,60.6768,99.9024
738,739,2576,2056,3150,114.795,69.2481,20.7519,99.9801
739,740,9543,2757,3186,126.985,55.2962,34.7038,99.9608
740,741,1563,1161,3171,118.166,76.5961,13.4039,99.9865
741,742,39202,1633,3255,108.689,17.2597,72.7403,99.9125
742,743,38157,2881,3272,287.288,31.5186,58.4814,99.6847
743,744,2046,3307,3170,288.195,4.25558,85.7444,99.9915
744,745,4209,423,3180,118.785,61.8833,28.1167,99.9052
745,746,9233,772,3194,275.815,0.0830536,89.9169,99.9534
746,747,7539,1216,3203,280.153,69.2263,20.7737,99.9636
747,748,6897,1751,3222,275.816,1.95638,88.0436,99.9813
748,749,2590,568,3189,238.499,74.7538,15.2462,99.9902
749,750,1147,688,3178,112.58,32.218,57.782,99.9969
750,751,13231,1948,3200,118.39,67.9593,22.0407,99.9098
751,752,1788,1290,3180,276.103,29.3618,60.6382,99.9919
752,753,9785,2708,3267,120.934,54.2311,35.7689,99.7706
753,754,959,2495,3182,114.801,53.479,36.521,99.9655
754,755,4232,979,3206,287.496,69.2272,20.7728,99.9065
755,756,1381,2424,3202,93.9219,2.25948,87.7405,99.9865
756,757,9111,3088,3240,280.125,13.7176,76.2824,99.9801
757,758,910,2534,3192,122.123,54.4574,35.5426,99.9931
758,759,33771,936,3311,108.996,32.2329,57.7671,99.3112
759,760,7098,229,3288,290.335,55.182,34.818000000000005,99.9852
760,761,781,674,3208,279.736,0.276802,89.7232,99.9919
761,762,27675,3293,3339,296.596,17.7329,72.2671,99.981
762,763,3043,2470,3225,109.994,17.2312,72.7688,99.6485
763,764,15331,724,3290,111.335,31.7275,58.2725,99.9836
764,765,1444,3344,3232,295.427,19.0413,70.9587,99.9115
765,766,43674,2514,3400,122.581,69.3419,20.6581,98.0639
766,767,18467,343,3275,155.82399999999996,76.1848,13.8152,99.9634
767,768,1228,2601,3220,118.251,26.2019,63.7981,99.9841
768,769,803,2662,3221,279.237,58.9918,31.0082,99.9901
769,770,675,3237,3229,113.837,48.9832,41.0168,99.9798
770,771,655,171,3243,293.676,54.2315,35.7685,99.9702
771,772,5313,3181,3268,111.859,8.24927,81.7507,99.9846
772,773,7150,542,3273,283.9240000000001,34.0074,55.9926,99.9434
773,774,8388,1115,3270,111.609,27.9072,62.0928,99.9421
774,775,6256,459,3289,287.933,12.1796,77.8204,99.039
775,776,9494,1930,3293,268.759,58.2476,31.7524,99.4693
776,777,4129,1795,3287,107.79,20.4206,69.5794,99.9853
777,778,13325,2592,3301,285.171,26.3268,63.6732,99.9565
778,779,10652,1239,3321,264.147,69.4628,20.5372,99.9822
779,780,663,3358,3291,295.431,18.7221,71.2779,99.882
780,781,99846,556,3500,111.734,12.27,77.73,99.6889
781,782,3728,3110,3318,290.051,4.71777,85.2822,99.9587
782,783,5038,2278,3325,267.066,65.9347,24.0653,99.9888
783,784,12568,1827,3359,103.487,17.9899,72.0101,99.9694
784,785,2759,180,3368,290.875,54.287,35.713,99.9307
785,786,1388,3041,3312,289.97,16.5599,73.4401,99.9924
786,787,1697,3209,3327,119.319,47.7474,42.2526,99.9896
787,788,3541,1490,3338,294.648,42.1852,47.8148,99.9958
788,789,2582,1111,3334,114.557,18.795,71.205,99.9726
789,790,1051,2373,3328,256.633,80.6179,9.38213,99.9837
790,791,732,1998,3331,291.7340000000001,14.2852,75.7148,99.992
791,792,40269,2748,3448,127.531,37.9069,52.0931,99.8974
792,793,7981,243,3420,106.453,28.9194,61.0806,99.9237
793,794,12024,2152,3378,108.961,10.3237,79.6763,99.9595
794,795,5007,2042,3375,231.833,80.0427,9.95725,99.958
795,796,2594,799,3350,119.177,64.9658,25.0342,99.9579
796,797,1235,1557,3341,119.587,54.6403,35.3597,99.9947
797,798,500,1611,3341,106.119,2.31698,87.68299999999998,99.9902
798,799,5147,1280,3380,282.525,37.5109,52.4891,99.9661
799,800,18939,3100,3396,292.024,10.557,79.443,99.8895
800,801,22709,2311,3422,129.113,45.0888,44.9112,99.9572
801,802,5161,309,3379,107.658,36.6107,53.3893,99.9921
802,803,1957,1156,3377,147.466,69.0917,20.9083,99.9961
803,804,93188,1568,3501,145.786,71.2299,18.7701,99.0941
804,805,8283,1953,3406,291.215,0.54068,89.4593,99.2757
805,806,8334,1055,3407,161.44299999999996,67.7886,22.2114,99.9881
806,807,578,363,3366,104.079,29.1906,60.8094,99.9681
807,808,45965,985,3492,280.526,22.2042,67.7958,99.177
808,809,1831,2905,3383,284.196,44.5642,45.4358,99.9899
809,810,2091,724,3425,260.503,70.5135,19.4865,99.9594
810,811,22480,301,3530,108.007,44.4964,45.5036,99.8422
811,812,31779,2956,3514,126.879,38.6921,51.3079,99.4414
812,813,734,751,3409,106.137,6.6418800000000005,83.3581,99.9921
813,814,1632,1781,3420,280.29400000000004,24.0635,65.9365,99.9658
814,815,2229,1222,3429,114.087,33.443000000000005,56.557,99.9903
815,816,8794,1890,3459,116.603,51.962,38.038,99.8984
816,817,54127,3195,3569,114.253,47.845,42.155,99.3605
817,818,828,2204,3450,268.485,58.4135,31.5865,99.9935
818,819,16145,2111,3500,112.028,36.6887,53.3113,99.7311
819,820,5326,2008,3486,172.888,82.0573,7.94275,99.9255
820,821,124734,860,3772,106.59,10.4657,79.5343,52.2774
821,822,12032,2383,3531,105.605,9.376,80.624,99.8431
822,823,9213,1298,3508,277.60200000000003,25.6201,64.3799,99.5837
823,824,1956,1170,3483,154.284,71.2659,18.7341,99.9809
824,825,2699,257,3499,287.9120000000001,62.8946,27.1054,99.5303
825,826,18809,3308,3680,285.972,3.3075300000000003,86.6925,99.9908
826,827,2243,1844,3507,280.263,43.8006,46.1994,99.7761
827,828,28888,2163,3608,112.048,10.0831,79.9169,99.7962
828,829,846,170,3517,104.03,27.3308,62.6692,99.9581
829,830,2315,2830,3535,292.31,47.2632,42.7368,99.2335
830,831,10545,1774,3563,108.913,28.9202,61.0798,99.8741
831,832,11907,1915,3569,109.282,17.1263,72.8737,99.5418
832,833,647,1171,3522,109.095,75.2853,14.7147,98.1334
833,834,635,2287,3532,279.07,11.9341,78.0659,99.9773
834,835,751,1560,3546,116.026,77.3722,12.6278,99.9476
835,836,4454,2541,3567,113.323,14.2234,75.7766,99.9455
836,837,49369,1214,3655,109.643,75.0484,14.9516,99.8182
837,838,5243,1489,3579,121.111,29.6905,60.3095,99.9719
838,839,2947,2630,3565,86.9195,73.9194,16.0806,99.4501
839,840,2336,1360,3569,98.9234,32.4019,57.5981,99.987
840,841,7423,3054,3613,293.413,23.1147,66.8853,99.9558
841,842,6016,2331,3601,289.103,75.2315,14.7685,99.9365
842,843,3430,184,3632,281.058,29.78,60.22,99.9371
843,844,31671,2436,3728,293.682,54.5883,35.4117,61.26300000000001
844,845,21353,2645,3675,286.257,38.6976,51.3024,99.9614
845,846,5590,2801,3614,285.725,41.2327,48.7673,99.985
846,847,4201,2514,3627,115.568,7.159560000000001,82.8404,99.9407
847,848,4325,690,3641,224.484,80.4529,9.54708,99.9587
848,849,19500,367,3670,282.163,61.4172,28.5828,99.8909
849,850,9637,2012,3651,108.744,36.2036,53.7964,99.9759
850,851,1711,3359,3641,284.085,2.7229,87.2771,99.9572
851,852,32052,1864,3707,294.597,43.3028,46.6972,99.8131
852,853,1296,1524,3627,120.831,28.2697,61.7303,99.9952
853,854,7851,504,3663,290.762,13.919,76.081,99.9742
854,855,93393,2998,3807,115.12,16.1358,73.8642,99.4663
855,856,1239,2729,3650,280.863,28.0135,61.9865,99.9693
856,857,3519,1732,3673,106.313,26.3113,63.6887,99.9842
857,858,11435,1047,3695,120.731,46.4749,43.5251,99.9691
858,859,862,270,3651,280.423,32.539,57.46100000000001,99.987
859,860,10636,2219,3725,104.917,37.2227,52.7773,99.9545
860,861,16803,1351,3714,113.867,50.402,39.598,99.8914
861,862,87558,1541,3876,227.39,82.6497,7.3502800000000015,91.0591
862,863,570,1685,3661,280.285,56.4686,33.5314,99.9949
863,864,5019,2796,3687,102.426,42.6873,47.3127,99.9682
864,865,1616,2281,3677,295.608,83.601,6.39896,99.9925
865,866,4820,227,3723,105.221,26.2853,63.7147,99.9868
866,867,2544,2535,3704,281.238,46.9012,43.0988,99.9854
867,868,4600,2734,3729,274.567,41.2087,48.7913,99.9885
868,869,5448,714,3759,111.052,45.3651,44.6349,99.9812
869,870,2190,2030,3728,113.772,18.5362,71.4638,99.996
870,871,12101,483,3769,110.862,14.2627,75.7373,99.6344
871,872,2763,2080,3779,108.699,25.5246,64.4754,99.9324
872,873,670,189,3730,106.081,25.7808,64.2192,99.8836
873,874,995,2308,3725,250.701,79.0576,10.9423,99.9921
874,875,1584,320,3729,112.872,44.8185,45.1815,99.9899
875,876,3500,2795,3766,106.536,19.9832,70.0168,99.9457
876,877,2400,2145,3761,131.241,60.5185,29.4815,99.937
877,878,91371,2723,3921,178.52900000000002,75.3314,14.6686,99.092
878,879,8497,2308,3782,119.869,70.5585,19.4415,99.9841
879,880,1108,2064,3763,281.534,29.2575,60.7425,99.9963
880,881,23645,374,3847,272.93,25.1873,64.8127,99.5489
881,882,6005,261,3804,116.399,45.2364,44.7636,99.9939
882,883,8823,1688,3804,138.215,76.3539,13.6461,99.9565
883,884,33457,1055,3869,290.472,3.0766,86.9234,99.9301
884,885,1143,564,3771,122.524,42.2461,47.7539,99.9906
885,886,3055,3184,3783,296.081,8.637310000000001,81.3627,99.9922
886,887,518,302,3767,104.403,22.6742,67.3258,99.9936
887,888,5709,2018,3815,287.8590000000001,3.70397,86.296,99.9851
888,889,2054,617,3797,221.739,75.2508,14.7492,99.9804
889,890,26693,682,3884,107.923,5.59772,84.4023,99.8385
890,891,11622,1793,3838,111.543,15.8656,74.1344,99.9749
891,892,5189,3238,3822,109.526,17.4921,72.5079,99.9896
892,893,19641,1900,3884,276.882,23.9096,66.0904,99.1212
893,894,2375,1335,3812,105.002,20.2667,69.7333,99.9711
894,895,2614,2179,3822,131.72,56.0777,33.9223,99.9909
895,896,1135,1967,3811,115.439,14.7096,75.2904,99.9922
896,897,547,2141,3801,103.214,24.6084,65.3916,99.9956
897,898,1802,1187,3820,121.153,49.0696,40.9304,99.9943
898,899,2247,2344,3817,278.76,1.40351,88.5965,99.9583
899,900,1218,2222,3822,274.338,60.8909,29.1091,99.9897
900,901,1747,3325,3831,113.418,35.292,54.708,99.9871
901,902,11307,1246,3867,108.651,21.2979,68.7021,99.9115
902,903,1661,3293,3835,100.492,24.9354,65.0646,99.9933
903,904,2795,2114,3837,286.874,5.69942,84.3006,99.9812
904,905,673,197,3838,276.15,27.8228,62.1772,99.9496
905,906,2111,3181,3844,111.968,29.9223,60.0777,99.9809
906,907,2064,506,3847,293.313,8.51484,81.4852,99.9957
907,908,572,2298,3845,142.993,76.4372,13.5628,99.991
908,909,1929,2350,3856,228.803,78.1225,11.8775,99.9928
909,910,605,231,3853,275.04200000000003,27.7858,62.2142,99.995
910,911,6997,1706,3899,113.181,36.6975,53.3025,99.9732
911,912,9731,2165,3907,286.252,7.40983,82.5902,99.9317
912,913,3269,2020,3883,119.228,29.2252,60.7748,99.9896
913,914,2303,196,3903,192.022,78.1697,11.8303,99.9554
914,915,15787,281,3981,118.977,41.528,48.472,99.9022
915,916,8095,602,3925,284.13,18.0841,71.9159,99.932
916,917,7897,2511,3921,281.024,43.3887,46.6113,99.9014
917,918,24479,3267,3967,278.528,35.0406,54.9594,99.924
918,919,84811,2240,4035,105.956,2.33363,87.6664,99.4057
919,920,4825,3162,3917,126.142,36.7069,53.2931,99.9923
920,921,734,3314,3882,106.647,32.1422,57.8578,99.993
921,922,5201,501,3907,291.202,18.2383,71.7617,99.9836
922,923,1642,1449,3911,110.818,16.1053,73.8947,99.2857
923,924,2163,2065,3929,267.106,57.5854,32.4146,99.8882
924,925,664,231,3933,194.884,80.4854,9.51457,99.9866
925,926,3712,1776,3939,127.023,45.165,44.835,99.9877
926,927,28028,516,4028,283.459,7.8867,82.1133,99.5036
927,928,573,2593,3913,283.057,45.3728,44.6272,99.9901
928,929,21780,1221,3970,283.401,31.3224,58.6776,99.8915
929,930,2664,340,3941,190.335,78.5795,11.4205,99.9933
930,931,5729,2002,3970,274.455,56.42,33.58,99.8377
931,932,54898,1341,4070,102.291,7.86579,82.1342,99.4519
932,933,3011,186,3991,123.636,41.2097,48.7903,99.5439
933,934,16652,1928,4053,271.707,60.7309,29.2691,98.0426
934,935,9847,812,4046,282.2940000000001,15.1,74.9,99.9501
935,936,1225,2451,3983,183.814,72.9265,17.0735,99.9872
936,937,828,3372,4010,280.343,0.32048000000000004,89.6795,99.9647
937,938,35009,1750,4090,283.502,17.1754,72.8246,99.9062
938,939,10597,2458,4055,282.939,40.9232,49.0768,99.1498
939,940,983,3147,4008,122.503,25.757,64.243,99.9936
940,941,37580,1067,4130,119.485,68.4202,21.5798,99.6467
941,942,820,2036,4014,119.568,35.7907,54.2093,99.9913
942,943,9608,2979,4051,293.578,14.5258,75.4742,99.6452
943,944,9263,733,4060,280.456,28.3695,61.6305,99.9311
944,945,11261,3196,4073,293.688,2.27819,87.7218,98.0117
945,946,1479,3186,4030,114.673,17.98,72.02,99.973
946,947,14959,2540,4095,108.254,5.87182,84.1282,99.9502
947,948,2638,413,4053,284.029,37.708,52.292,99.6873
948,949,4469,351,4070,280.99,10.7991,79.2009,99.9803
949,950,12700,2737,4083,67.6779,83.4937,6.50635,99.4445
950,951,5277,644,4087,104.372,35.8716,54.1284,99.9928
951,952,1903,3047,4114,115.25,10.6155,79.3845,99.9612
952,953,11203,3125,4126,293.886,15.331,74.669,99.9788
953,954,4402,3318,4123,108.855,59.9146,30.0854,99.9798
954,955,160638,1600,4358,290.494,40.5587,49.4413,99.8533
955,956,16277,298,4153,115.076,47.0509,42.9491,99.9759
956,957,44575,476,4249,281.853,24.8688,65.1312,97.7389
957,958,697,3013,4099,296.633,10.5092,79.4908,99.9959
958,959,18697,2412,4189,279.901,56.5687,33.4313,99.3228
959,960,42281,2998,4257,113.363,22.2256,67.7744,98.9316
960,961,2149,2970,4118,114.955,11.6308,78.3692,99.9635
961,962,18188,773,4168,265.661,14.6355,75.3645,99.9684
962,963,2677,2027,4131,136.276,82.0965,7.903510000000002,99.9868
963,964,24041,2782,4196,281.949,33.8473,56.1527,99.9552
964,965,1458,186,4141,117.155,48.8213,41.1787,99.8638
965,966,1860,1728,4151,286.55,28.2492,61.7508,99.9869
966,967,1837,970,4148,287.4,12.1044,77.8956,99.9881
967,968,67962,1941,4292,106.518,27.9656,62.0344,99.2163
968,969,4671,547,4154,117.897,44.9114,45.0886,99.9922
969,970,8393,2577,4186,295.4890000000001,51.1855,38.8145,99.9755
970,971,5246,2083,4172,116.02,28.0714,61.9286,99.9917
971,972,1488,3257,4157,280.243,27.4247,62.5753,99.9829
972,973,1555,3365,4169,110.589,59.2952,30.7048,99.9493
973,974,2311,659,4175,119.05,43.6116,46.3884,99.9957
974,975,556,3001,4160,110.213,23.676,66.324,99.9758
975,976,53784,1276,4289,102.313,31.7441,58.2559,99.8356
976,977,2373,3011,4206,112.979,12.1395,77.8605,99.9676
977,978,5592,2662,4214,283.323,62.3601,27.6399,99.9683
978,979,4351,3175,4187,122.264,55.9994,34.0006,99.9133
979,980,953,2151,4184,288.764,46.6475,43.3525,99.9922
980,981,1036,3055,4192,112.181,12.3351,77.6649,99.9968
981,982,36306,3270,4293,127.794,39.5429,50.4571,99.9312
982,983,4460,933,4215,108.345,44.6484,45.3516,99.1245
983,984,12363,223,4283,283.221,23.0006,66.9994,99.8357
984,985,644,1135,4194,106.292,7.32942,82.6706,99.9932
985,986,1543,2238,4221,286.502,3.23296,86.76700000000002,99.9569
986,987,5405,2142,4240,126.268,56.7235,33.2765,99.9822
987,988,2435,378,4229,107.816,39.6421,50.3579,99.9938
988,989,995,2189,4217,288.788,6.23175,83.7682,99.9955
989,990,2177,628,4228,112.74,31.5617,58.4383,99.9929
990,991,36021,653,4371,115.723,45.4338,44.5662,99.8573
991,992,39355,844,4344,272.589,13.9798,76.0202,98.9087
992,993,5114,2251,4275,282.121,22.3274,67.6726,99.9071
993,994,1398,729,4243,124.997,79.3404,10.6596,99.9918
994,995,594,301,4236,282.085,21.311,68.689,99.9978
995,996,46116,2560,4381,159.13,74.7606,15.2394,99.8239
996,997,692,2312,4256,102.76,6.96585,83.0341,99.9638
997,998,16867,1035,4324,284.842,11.1764,78.8236,99.9374
998,999,6887,309,4302,262.532,62.7837,27.2163,99.9949
999,1000,1727,3374,4298,121.187,41.8289,48.1711,99.8785
1000,1001,551,2502,4282,113.644,87.5831,2.41687,99.9958
1001,1002,31632,2726,4397,111.876,0.226334,89.7737,99.9743
1002,1003,19581,2167,4358,111.334,24.8022,65.1978,99.9782
1003,1004,2159,2313,4313,276.3,24.9677,65.0323,99.9927
1004,1005,7352,2842,4342,97.1285,2.43726,87.5627,99.9785
1005,1006,6955,2424,4348,170.415,81.8449,8.15512,99.9171
1006,1007,14631,3063,4392,292.432,9.14493,80.8551,99.9682
1007,1008,9675,2315,4366,101.761,20.4959,69.5041,99.9629
1008,1009,5697,395,4374,106.664,41.4537,48.5463,99.7558
1009,1010,1291,327,4358,274.055,11.5331,78.4669,99.9951
1010,1011,2945,3151,4370,111.527,15.4689,74.5311,99.9891
1011,1012,5662,1290,4394,117.443,52.3242,37.6758,99.9649
1012,1013,687,1247,4364,262.665,68.7198,21.2802,99.9835
1013,1014,1128,2891,4382,272.986,9.46886,80.5311,99.9847
1014,1015,9122,2920,4434,97.6282,0.778229,89.2218,98.5002
1015,1016,22889,1098,4458,118.488,48.0116,41.9884,99.4266
1016,1017,3112,295,4400,282.133,22.3929,67.6071,99.9914
1017,1018,1996,2063,4396,283.368,43.9823,46.0177,99.9846
1018,1019,4178,521,4428,288.733,18.1555,71.8445,99.9818
1019,1020,6738,358,4449,281.953,16.3502,73.6498,99.9705
1020,1021,8010,1789,4452,282.311,26.21,63.79,99.9718
1021,1022,2056,3295,4415,104.166,9.62306,80.3769,99.993
1022,1023,9821,3161,4464,119.816,36.7247,53.2753,99.9567
1023,1024,2903,2831,4433,111.207,47.9909,42.0091,99.9856
1024,1025,83212,3203,4649,288.12,6.942539999999998,83.0575,99.8421
1025,1026,1673,2027,4430,254.955,69.9726,20.0274,99.9356
1026,1027,18903,2342,4468,224.238,69.7597,20.2404,99.9433
1027,1028,5266,455,4457,288.885,3.85107,86.1489,99.52
1028,1029,5115,868,4450,283.516,23.0793,66.9207,99.9803
1029,1030,10801,3335,4482,288.414,24.062,65.938,99.9889
1030,1031,580,219,4449,273.406,33.9311,56.0689,99.8451
1031,1032,1202,1905,4441,106.156,31.5415,58.4585,99.9791
1032,1033,3562,2185,4459,280.238,43.5806,46.4194,99.9083
1033,1034,1463,294,4460,277.85,39.8779,50.1221,99.9632
1034,1035,838,2086,4439,112.006,35.4497,54.5503,99.9913
1035,1036,1267,1246,4452,99.7676,22.6022,67.3978,99.8988
1036,1037,25638,967,4546,106.397,21.991,68.009,99.3335
1037,1038,4114,2984,4478,288.315,18.2924,71.7076,99.9876
1038,1039,30391,1263,4535,281.759,35.6724,54.3276,64.8041
1039,1040,3678,1972,4483,123.446,38.9193,51.0807,99.9256
1040,1041,852,1866,4468,117.55,43.151,46.849,99.9806
1041,1042,628,1415,4469,185.664,80.2487,9.75125,99.9886
1042,1043,29590,2111,4555,105.601,5.50082,84.4992,99.3035
1043,1044,9758,571,4526,288.811,2.40363,87.5964,99.9752
1044,1045,1173,1891,4489,116.456,43.2498,46.7502,99.954
1045,1046,12749,2860,4537,104.896,20.5742,69.4258,99.9114
1046,1047,4744,3051,4504,133.10399999999998,50.2824,39.7176,99.9881
1047,1048,11402,2253,4551,280.221,10.7209,79.2791,99.9643
1048,1049,3364,818,4520,273.955,12.7694,77.2306,99.9771
1049,1050,2730,470,4520,292.526,42.6626,47.3374,99.6529
1050,1051,23380,264,4646,105.401,8.12402,81.876,99.8638
1051,1052,4900,1824,4544,268.844,16.1306,73.8694,99.9452
1052,1053,13434,2544,4566,280.117,26.6077,63.3923,99.8585
1053,1054,2724,1928,4528,113.646,32.3815,57.6185,99.0464
1054,1055,2478,754,4508,284.378,5.94376,84.0562,99.9858
1055,1056,6483,2462,4532,169.27700000000004,73.5124,16.4876,98.3763
1056,1057,5594,672,4541,275.327,13.8679,76.1321,99.9741
1057,1058,9680,350,4542,277.377,25.7559,64.2441,99.8896
1058,1059,1159,870,4524,291.872,77.1312,12.8688,98.9656
1059,1060,14535,1408,4575,280.021,50.2068,39.7932,99.6721
1060,1061,1469,198,4545,106.64,6.47349,83.5265,99.7691
1061,1062,776,2954,4534,128.946,57.6134,32.3866,99.9809
1062,1063,8705,2733,4563,108.442,32.3917,57.6083,91.445
1063,1064,39161,2957,4676,116.004,39.0538,50.9462,97.6593
1064,1065,926,746,4548,105.299,18.913,71.087,99.9878
1065,1066,6195,507,4594,287.398,31.8343,58.1657,99.9856
1066,1067,7843,743,4593,104.926,37.9195,52.0805,99.9552
1067,1068,12792,1969,4613,111.147,57.8284,32.1716,99.8801
1068,1069,8327,431,4617,113.609,37.9531,52.0469,99.3511
1069,1070,1551,1877,4578,283.165,28.0306,61.9694,99.9836
1070,1071,2591,849,4590,97.2853,23.3628,66.6372,99.9787
1071,1072,556,2684,4573,142.782,87.1206,2.87936,99.992
1072,1073,2124,613,4596,277.77,3.39066,86.6093,99.9809
1073,1074,2691,2731,4596,106.949,0.551125,89.4489,99.9916
1074,1075,840,1300,4583,295.027,77.508,12.492,99.9868
1075,1076,3751,1107,4600,280.33,60.3963,29.6037,99.925
1076,1077,11191,393,4677,106.291,8.16122,81.8388,98.8476
1077,1078,1769,2606,4604,128.866,87.1851,2.81494,99.9854
1078,1079,2612,2662,4610,112.007,60.7369,29.2631,99.9948
1079,1080,13826,2360,4649,97.0916,38.1761,51.8239,99.6447
1080,1081,6130,1844,4638,102.007,2.9483900000000003,87.0516,99.9886
1081,1082,5918,1750,4638,288.2870000000001,27.3133,62.6867,99.9439
1082,1083,3547,1546,4617,289.642,22.5186,67.4814,99.9763
1083,1084,18406,2217,4701,286.566,10.1717,79.8283,99.8921
1084,1085,747,573,4615,277.557,16.7407,73.2593,99.9956
1085,1086,17320,695,4680,286.935,38.1538,51.8462,99.9563
1086,1087,8474,837,4668,271.312,42.6663,47.3337,99.9535
1087,1088,7954,2750,4657,98.8757,35.0693,54.9307,99.9241
1088,1089,4209,2068,4672,115.107,32.4912,57.5088,99.9864
1089,1090,3282,912,4680,110.945,44.0937,45.9063,99.6041
1090,1091,701,1624,4640,291.092,28.2763,61.7237,99.9959
1091,1092,8869,1466,4673,288.511,22.6535,67.3465,99.7857
1092,1093,11645,1208,4682,284.605,0.698036,89.302,99.98
1093,1094,6753,1106,4707,271.048,59.9958,30.0042,99.9742
1094,1095,522,1027,4656,274.769,59.1309,30.8691,99.9796
1095,1096,3970,970,4674,108.317,72.2525,17.7475,99.9816
1096,1097,537,1564,4671,287.926,22.7307,67.2693,99.9627
1097,1098,19567,2570,4723,223.083,85.6364,4.36359,99.8936
1098,1099,31363,1682,4721,289.264,27.3731,62.6269,99.959
1099,1100,14597,562,4712,295.335,3.86762,86.1324,99.9583
1100,1101,1962,1349,4676,116.931,38.5261,51.4739,99.9657
1101,1102,800,2582,4669,200.05900000000003,88.3792,1.62076,99.9681
1102,1103,2713,1993,4695,304.994,72.8659,17.1341,99.9319
1103,1104,3487,2444,4720,281.534,55.284,34.716,99.8567
1104,1105,631,1928,4688,291.376,25.5708,64.4292,99.581
1105,1106,4475,1035,4718,105.733,8.28548,81.7145,99.9884
1106,1107,3600,2690,4724,276.334,17.9511,72.0489,99.9948
1107,1108,3496,2761,4715,298.713,68.5037,21.4963,99.9779
1108,1109,4559,1377,4725,263.704,70.1051,19.8949,99.9867
1109,1110,5514,1907,4745,278.281,28.1439,61.8561,99.6073
1110,1111,4747,2383,4742,187.833,78.1863,11.8137,99.9821
1111,1112,2638,803,4736,281.187,32.6379,57.3621,99.9965
1112,1113,699,2080,4719,298.245,73.6499,16.3501,99.9457
1113,1114,2653,968,4740,291.426,44.9521,45.0479,99.9921
1114,1115,7018,1251,4746,283.06,11.594,78.406,99.9664
1115,1116,4959,2831,4754,108.711,10.8512,79.1488,99.9941
1116,1117,2370,889,4740,291.225,48.8426,41.1574,99.931
1117,1118,566,1509,4738,287.166,22.5578,67.4422,99.9574
1118,1119,4511,2005,4759,116.2,43.4339,46.5661,99.9632
1119,1120,680,2126,4760,287.8540000000001,10.2197,79.7803,99.9727
1120,1121,638,1466,4764,277.574,60.3156,29.6844,99.9844
1121,1122,543,1433,4763,275.516,57.2063,32.7937,99.9709
1122,1123,973,2707,4765,110.367,7.78222,82.2178,99.9827
1123,1124,535,2773,4773,263.063,82.9281,7.071910000000001,99.9874
1124,1125,994,3364,4771,280.689,7.63726,82.3627,99.6977
1125,1126,528,2207,4775,288.344,10.3559,79.6441,99.9725
1126,1127,1565,2698,4785,109.444,7.82948,82.1705,99.9241
1127,1128,669,3070,4795,109.371,26.4262,63.5738,99.9558
