,Grain No.,Size [Pixel],center x-coordinate,center y-coordinate,mean azimuth [degree],mean latitude [degree],mean colatitude [degree],Regelungsgrad [%]
0,1,30612,932,298,138.048,63.4917,26.5083,77.2192
1,2,5311,747,269,137.667,17.0192,72.9808,99.9411
2,3,6195,1277,293,307.207,41.8664,48.1336,99.9846
3,4,2027,1334,275,133.993,65.0121,24.9879,99.9166
4,5,1529,610,270,296.656,82.26700000000002,7.73295,99.9837
5,6,9757,1126,304,309.397,17.9369,72.0631,99.9734
6,7,10185,1203,341,303.062,0.21858200000000005,89.7814,99.9602
7,8,1574,492,269,209.277,81.253,8.746960000000001,99.8696
8,9,5752,1433,295,159.399,67.3021,22.6979,99.8247
9,10,267762,378,652,310.117,2.99455,87.0054,94.6652
10,11,1767,655,280,217.767,77.6792,12.3208,99.9943
11,12,22560,1614,328,128.482,10.4287,79.5713,98.6741
12,13,18582,580,375,176.72799999999995,76.881,13.1191,99.9051
13,14,1307,1725,307,142.322,18.2062,71.7938,99.993
14,15,1346,704,297,302.338,75.003,14.997,99.9846
15,16,3131,648,334,256.628,81.5475,8.45252,99.9755
16,17,308986,1281,632,14.8923,86.046,3.95404,78.947
17,18,3040,708,355,266.321,82.915,7.08502,99.9965
18,19,873,753,334,289.795,81.5814,8.41858,99.8631
19,20,5106,849,359,135.274,6.10723,83.8928,99.9754
20,21,809,1740,346,128.42700000000002,32.9173,57.0827,99.9922
21,22,26844,2497,458,133.59799999999998,54.1909,35.8091,99.9307
22,23,3101,768,375,313.66,73.4277,16.5723,99.9966
23,24,19670,1079,434,227.686,84.2327,5.76735,99.7804
24,25,9072,1756,439,136.205,15.1587,74.8413,99.9865
25,26,602,2636,386,315.155,17.3082,72.6918,99.9841
26,27,10886,2721,434,320.253,27.9815,62.0185,99.9479
27,28,1417,140,410,301.088,55.1441,34.8559,99.875
28,29,1268,2825,402,139.954,50.6172,39.3828,99.9759
29,30,9091,972,470,282.961,36.2659,53.7341,99.964
30,31,720,1647,417,314.757,55.9265,34.0735,99.9796
31,32,2306,2626,431,122.048,48.7824,41.2176,99.9926
32,33,17995,243,520,293.391,35.0436,54.9564,99.3965
33,34,1989,1260,436,280.575,82.2352,7.76478,99.9626
34,35,1746,1211,437,304.17,22.1871,67.8129,99.9968
35,36,822,2841,436,303.083,40.1113,49.8887,99.9893
36,37,8653,2933,481,124.036,58.4668,31.5332,99.9276
37,38,955,163,452,127.39,26.7915,63.2085,99.9503
38,39,3802,1645,479,132.253,30.8777,59.1223,99.9952
39,40,1036,1359,458,138.509,29.8182,60.1818,99.8889
40,41,730,1699,466,315.567,56.1695,33.8305,99.9161
41,42,10996,2811,512,131.00799999999998,36.3834,53.6166,99.9903
42,43,20570,2659,540,301.772,58.5966,31.4034,99.9549
43,44,1731,132,499,189.262,86.1755,3.82454,57.6945
44,45,841,2359,504,118.143,61.7191,28.2809,99.9922
45,46,130811,1948,769,304.777,9.4987,80.5013,58.3819
46,47,4892,3053,510,305.621,15.1042,74.8958,99.9532
47,48,4115,259,522,146.065,49.757,40.243,99.9474
48,49,3731,791,535,286.081,45.2077,44.7923,99.9884
49,50,2177,2553,518,131.237,28.9436,61.0564,99.9922
50,51,8616,3154,555,311.3,27.536,62.464,96.142
51,52,41272,2252,640,128.27100000000002,6.938510000000001,83.0615,99.9842
52,53,22149,2949,619,120.319,50.4451,39.5549,96.7335
53,54,1041,3015,548,303.978,14.4023,75.5977,99.966
54,55,7441,134,596,297.235,66.1422,23.8578,99.9136
55,56,21833,653,626,132.968,1.57461,88.4254,99.9724
56,57,23060,2474,638,306.37,40.5566,49.4434,99.9767
57,58,698,2365,582,138.983,49.3501,40.6499,99.7439
58,59,2075,2546,574,167.201,67.3817,22.6183,99.9967
59,60,6290,818,603,72.34,73.1725,16.8275,99.9924
60,61,7339,2778,605,291.624,31.7705,58.2295,99.9911
61,62,710,753,582,320.155,16.2511,73.7489,99.9844
62,63,9521,3062,634,303.574,35.8405,54.1595,99.9888
63,64,1756,3318,599,136.716,43.7613,46.2387,99.9452
64,65,1389,3257,592,304.5370000000001,8.67326,81.3267,99.9943
65,66,4598,3175,614,141.583,42.0323,47.9677,99.9674
66,67,5912,904,641,83.9802,76.1792,13.8208,99.992
67,68,1201,2593,620,136.96200000000002,42.1379,47.8621,99.998
68,69,3750,3290,648,283.423,76.6491,13.3509,99.988
69,70,2877,3222,642,137.385,37.9432,52.0568,99.993
70,71,847,3373,623,308.32,17.0472,72.9528,99.9642
71,72,4688,2374,676,313.68,8.07197,81.928,99.9249
72,73,11897,2677,675,141.238,46.6913,43.3087,99.9883
73,74,4518,2080,681,312.121,11.5505,78.4495,99.9372
74,75,2048,1953,655,139.691,11.5025,78.4975,99.9867
75,76,2305,3144,664,141.616,42.8542,47.1458,99.9879
76,77,4121,2766,666,123.617,41.3469,48.6531,99.9526
77,78,682,1735,649,315.288,31.8934,58.1066,99.9518
78,79,4726,793,683,96.5605,80.2148,9.78516,99.994
79,80,7275,2887,680,122.822,39.9088,50.0912,99.9932
80,81,813,849,672,95.9022,80.0878,9.91219,99.9915
81,82,10000,3393,705,129.944,17.1742,72.8258,99.9205
82,83,15790,2602,736,295.891,42.7827,47.2173,99.9916
83,84,702,170,674,124.201,25.3405,64.6595,99.8707
84,85,1572,2116,688,304.688,47.588,42.412,99.9871
85,86,3862,1744,693,309.522,0.0840683,89.9159,99.9922
86,87,3166,3261,705,134.803,34.0078,55.9922,99.9932
87,88,9482,566,754,315.047,4.42161,85.5784,99.979
88,89,24715,875,771,309.718,73.816,16.184,99.9789
89,90,39867,3080,822,309.263,46.2338,43.7662,99.9524
90,91,510,3310,697,282.42,76.6332,13.3668,99.9927
91,92,1643,506,726,126.52,11.548,78.452,99.9318
92,93,26549,1679,753,314.199,32.8796,57.1204,99.8995
93,94,6015,648,733,301.199,4.78329,85.2167,99.9923
94,95,8623,2849,750,312.857,17.2287,72.7713,99.9867
95,96,1811,719,742,127.979,32.0719,57.9281,99.9823
96,97,13310,2151,782,138.208,32.8263,57.1737,99.995
97,98,3763,2756,752,140.939,50.0999,39.9001,99.9922
98,99,4654,2929,775,310.6740000000001,46.4622,43.5378,99.908
99,100,21442,2443,796,125.34,15.0191,74.9809,97.9027
100,101,13455,3257,790,129.83,63.8728,26.1272,99.982
101,102,6738,769,811,290.5370000000001,42.0797,47.9203,99.9983
102,103,801,1908,765,320.017,18.4445,71.5555,99.9733
103,104,9818,3367,806,127.25,56.8074,33.1926,99.9354
104,105,1155,2337,768,298.437,60.1111,29.8889,99.9911
105,106,20869,2256,866,308.146,29.2018,60.7982,99.7682
106,107,3430,2961,800,313.082,4.97579,85.0242,99.9899
107,108,1847,3439,806,132.947,56.1553,33.8447,99.9662
108,109,17162,657,864,292.621,41.4029,48.5971,99.9852
109,110,635,109,797,117.34,36.5254,53.4746,99.9387
110,111,1324,2780,796,310.676,4.9057900000000005,85.0942,99.9909
111,112,4577,709,830,134.92600000000002,7.21523,82.7848,99.985
112,113,10231,2720,852,298.173,33.2097,56.7903,99.9909
113,114,2716,2860,812,309.577,7.69694,82.3031,99.9859
114,115,247585,1294,1245,298.773,34.0347,55.9653,82.1746
115,116,4737,1897,853,127.893,32.0533,57.9467,99.9568
116,117,21654,1813,906,317.671,56.2681,33.7319,99.9794
117,118,1843,2802,839,319.541,5.920719999999998,84.0793,99.9658
118,119,573,2645,821,314.4790000000001,10.7913,79.2087,99.9827
119,120,45208,2554,943,314.754,10.6638,79.3362,99.9547
120,121,2454,2063,852,312.4290000000001,10.7189,79.2811,99.9831
121,122,17589,3219,895,204.007,70.6583,19.3417,99.9809
122,123,811,2117,865,312.011,47.5004,42.4996,99.9917
123,124,1997,949,858,158.94,59.324,30.676,99.9952
124,125,3533,2854,871,294.626,36.4395,53.5605,99.9834
125,126,9339,2921,912,303.0,41.2831,48.7169,99.9706
126,127,19883,2358,936,287.193,74.2135,15.7865,99.9803
127,128,6144,3394,900,124.337,63.1894,26.8106,99.8889
128,129,1284,3331,884,304.745,37.895,52.105,99.9942
129,130,25493,908,939,187.921,88.7551,1.2449,100.015
130,131,4270,2160,900,299.61,38.4957,51.5043,99.9955
131,132,5810,2814,919,130.768,43.5186,46.4814,99.991
132,133,8194,1616,938,301.9890000000001,5.78181,84.2182,99.9941
133,134,5524,1327,926,129.842,10.6552,79.3448,99.9821
134,135,31493,1153,954,306.191,60.87,29.13,99.9745
135,136,610,1568,897,351.457,75.4134,14.5866,99.9948
136,137,49424,666,1027,127.824,15.3174,74.6826,79.5453
137,138,32812,1401,1013,122.475,5.73473,84.2653,99.8767
138,139,1363,2774,921,294.931,38.304,51.69600000000001,99.9883
139,140,2099,777,939,119.818,0.204155,89.7958,99.9767
140,141,907,2732,930,302.032,40.6252,49.3748,99.9927
141,142,855,3331,944,306.746,37.4043,52.5957,99.8787
142,143,2819,1951,956,270.509,75.2004,14.7996,99.9868
143,144,15800,3022,1013,318.3,21.5645,68.4355,99.872
144,145,572,1884,941,138.362,71.9211,18.0789,99.9902
145,146,1114,3411,960,300.922,8.55847,81.4415,99.9895
146,147,7263,2748,989,299.016,18.8429,71.1571,99.9753
147,148,11928,2665,1033,122.394,40.9632,49.0368,99.9373
148,149,1467,3126,973,318.237,51.188,38.812,99.9668
149,150,6544,3252,990,306.191,37.252,52.74800000000001,99.9774
150,151,2647,2220,980,128.127,34.969,55.03100000000001,99.9898
151,152,39544,1748,1099,313.378,10.4664,79.5336,82.0709
152,153,1998,1579,989,119.536,2.1,87.9,99.8651
153,154,3379,2879,988,129.236,42.5583,47.4417,99.9824
154,155,19232,3345,1050,286.068,66.7813,23.2187,48.6181
155,156,909,3175,986,316.769,50.8581,39.1419,99.9896
156,157,17545,401,1046,287.957,47.291,42.709,99.9767
157,158,1792,1726,1002,299.505,4.60786,85.3921,99.996
158,159,89135,2947,1190,290.677,42.0048,47.9952,89.4278
159,160,91187,1771,1282,315.842,10.3812,79.6188,99.6926
160,161,10112,2196,1041,121.095,14.7631,75.2369,99.9856
161,162,14161,2376,1062,282.142,61.6898,28.3102,79.7128
162,163,4515,3159,1044,315.664,24.4321,65.5679,99.9713
163,164,19091,190,1109,126.991,59.612,30.388,99.9265
164,165,10088,1194,1065,115.981,6.27048,83.7295,99.9858
165,166,1644,2281,1051,295.221,61.9082,28.0918,99.9017
166,167,19315,592,1151,158.44299999999996,52.926,37.074,99.4349
167,168,7715,3156,1133,132.124,32.6422,57.3578,99.8819
168,169,1674,3255,1097,298.296,32.0158,57.9842,99.9865
169,170,3867,3216,1113,296.898,35.2604,54.7396,99.992
170,171,18682,2113,1174,133.649,58.82899999999999,31.171,99.9875
171,172,4877,2480,1108,320.418,38.5531,51.4469,99.9783
172,173,25477,426,1176,103.824,27.7353,62.2647,99.9692
173,174,1704,3040,1101,315.135,48.1692,41.8308,99.9889
174,175,4347,2696,1115,314.832,18.4446,71.5554,99.9982
175,176,2267,2231,1118,311.072,69.5373,20.4627,99.9849
176,177,1570,2565,1112,130.446,48.0587,41.9413,99.9978
177,178,5011,835,1139,119.98,47.1434,42.8566,99.9865
178,179,63353,2347,1245,315.146,30.8804,59.1196,99.1273
179,180,1791,2610,1132,300.837,26.8836,63.1164,99.9946
180,181,4996,3418,1165,258.29400000000004,78.7713,11.2287,99.9823
181,182,660395,605,2047,308.478,2.10732,87.8927,48.1233
182,183,18193,768,1219,142.22799999999995,30.7944,59.2056,99.836
183,184,547,1366,1124,300.626,44.9264,45.0736,99.9855
184,185,3947,124,1149,120.621,10.3061,79.6939,99.713
185,186,1666,2431,1143,314.855,28.7334,61.2666,99.9968
186,187,5702,3297,1173,316.021,13.0973,76.9027,99.9783
187,188,738,1631,1142,119.561,3.37144,86.6286,99.9939
188,189,680,2032,1153,126.362,33.9097,56.0903,99.99
189,190,35203,2633,1247,121.904,5.23615,84.7639,99.9967
190,191,2569,2693,1159,150.329,68.7763,21.2237,99.9938
191,192,1760,3017,1172,129.035,40.004,49.996,99.9704
192,193,5957,1329,1201,167.135,54.4493,35.5507,99.9984
193,194,6019,3366,1207,127.378,16.479,73.521,99.9601
194,195,5609,1622,1215,137.151,19.8292,70.1708,99.996
195,196,2326,2399,1193,154.22299999999996,70.0067,19.9933,99.9302
196,197,749,536,1185,138.63299999999998,20.9029,69.0971,99.944
197,198,47378,960,1338,136.22799999999998,21.6755,68.3245,72.4825
198,199,1875,1391,1208,124.583,6.45743,83.5426,99.7405
199,200,737,2862,1207,117.898,40.5184,49.4816,99.9949
200,201,7826,1938,1264,318.322,30.4469,59.5531,99.976
201,202,719,3202,1219,135.371,14.3852,75.6148,99.9874
202,203,7194,3258,1280,299.6740000000001,34.9094,55.0906,99.97
203,204,31359,734,1343,294.9240000000001,23.6773,66.3227,99.9957
204,205,691,1292,1249,303.74,40.0272,49.9728,99.9855
205,206,3530,1360,1269,118.077,1.03921,88.9608,99.9942
206,207,1957,2902,1268,166.90400000000002,70.0666,19.9334,99.866
207,208,23603,3367,1392,148.491,70.7971,19.2029,99.8678
208,209,5391,2133,1282,315.897,28.5717,61.4283,99.9962
209,210,575,1578,1267,306.068,46.6743,43.3257,99.9882
210,211,71028,1998,1435,161.235,66.0047,23.9953,95.2273
211,212,557,2066,1285,314.397,9.22741,80.7726,99.9335
212,213,3944,3302,1339,151.856,70.219,19.781,99.9846
213,214,1297,2854,1308,300.293,22.0922,67.9078,99.9956
214,215,21469,3197,1393,276.119,42.2433,47.7567,99.9489
215,216,44622,2658,1398,312.269,64.9763,25.0237,99.9627
216,217,21317,2983,1411,135.974,6.54329,83.4567,99.8229
217,218,658,224,1316,311.081,20.8006,69.1994,99.9995
218,219,881,2817,1311,165.34799999999996,83.6199,6.38006,99.9918
219,220,832,126,1315,109.016,13.2972,76.7028,99.9548
220,221,4392,2237,1354,126.244,54.7201,35.2799,99.867
221,222,5301,2158,1351,317.6,5.92123,84.0788,99.9515
222,223,5086,1551,1357,154.036,58.0263,31.9737,99.9763
223,224,1708,2549,1331,298.265,37.5314,52.4686,99.9971
224,225,1383,1907,1340,307.691,76.6508,13.3492,99.9903
225,226,3438,2841,1369,117.758,57.5869,32.4131,99.9971
226,227,5087,2303,1403,123.211,36.4992,53.5008,99.9939
227,228,1327,845,1390,112.925,66.5833,23.4167,99.9771
228,229,2845,2163,1405,302.759,59.4584,30.5416,99.997
229,230,29364,2357,1484,308.788,56.0547,33.9453,99.9682
230,231,19816,3095,1522,314.634,10.589,79.411,99.0241
231,232,1260,3000,1410,303.821,35.8512,54.1488,99.9874
232,233,729,644,1408,288.217,62.0424,27.9576,99.9956
233,234,71346,2808,1591,306.11,29.2654,60.7346,99.9535
234,235,1487,2226,1430,315.814,57.1016,32.8984,99.9904
235,236,2730,850,1433,132.88,66.4468,23.5532,99.9938
236,237,701,1227,1455,157.697,59.3108,30.6892,99.9879
237,238,2060,2140,1453,127.928,53.9798,36.0202,99.9963
238,239,2551,2491,1464,299.9190000000001,26.4386,63.5614,99.9573
239,240,849,922,1475,149.683,74.1531,15.8469,99.9755
240,241,39444,1003,1564,116.313,63.2793,26.7207,98.1141
241,242,710,3266,1472,274.85,41.083,48.917,99.9962
242,243,2435,2613,1501,319.5440000000001,70.2101,19.7899,99.9906
243,244,758,2957,1492,136.856,5.48909,84.5109,99.9401
244,245,1476,2563,1497,309.583,3.34887,86.6511,99.943
245,246,245613,1483,1845,131.83,54.3239,35.6761,98.6044
246,247,1111,3294,1511,298.334,36.961,53.039,99.9928
247,248,632,3343,1498,297.5490000000001,38.4915,51.5085,99.9823
248,249,58817,2526,1655,312.289,9.12187,80.8781,99.8257
249,250,742,2984,1519,285.471,39.8613,50.1387,99.8823
250,251,3636,3235,1533,126.251,28.2911,61.7089,99.9692
251,252,32354,1815,1593,322.332,68.2879,21.7121,99.8617
252,253,6728,3334,1552,265.635,82.0135,7.98647,99.3891
253,254,1277,3184,1555,163.912,69.4597,20.5403,99.5915
254,255,51350,856,1667,132.59,19.5921,70.4079,99.8011
255,256,84039,2004,1800,73.9256,85.5463,4.45373,97.2195
256,257,18347,2096,1641,132.542,39.5634,50.4366,99.9914
257,258,1450,585,1550,114.615,28.5449,61.4551,99.9943
258,259,15670,1295,1593,300.789,58.8885,31.1115,99.9699
259,260,7248,2671,1574,132.625,46.3616,43.6384,99.9824
260,261,614,532,1556,127.924,13.8489,76.1511,99.9835
261,262,2519,2334,1573,309.49,40.5649,49.4351,99.9933
262,263,25656,2247,1692,129.38299999999998,18.9912,71.0088,99.8736
263,264,9856,662,1620,126.956,39.4047,50.5953,99.9982
264,265,917,2235,1586,310.4240000000001,41.7808,48.2192,99.9517
265,266,1301,2382,1584,127.459,22.6661,67.3339,99.9914
266,267,39824,165,1734,302.579,5.32902,84.671,99.7759
267,268,40289,1795,1770,313.495,10.2622,79.7378,99.4798
268,269,3087,3126,1611,170.642,71.0704,18.9296,99.9908
269,270,6692,3315,1633,169.683,74.9897,15.0103,99.9396
270,271,11928,3208,1649,313.578,23.077,66.923,99.9956
271,272,3323,3396,1635,175.09099999999995,76.3749,13.6251,99.9705
272,273,6451,2971,1672,302.183,55.8389,34.1611,98.2686
273,274,20712,577,1685,292.723,63.6806,26.3194,99.9885
274,275,18149,1205,1699,58.2008,68.9991,21.0009,99.9831
275,276,2927,3031,1671,128.778,8.40615,81.5938,99.9763
276,277,2293,2536,1677,300.85,47.5514,42.4486,99.9886
277,278,1243,3119,1666,136.201,42.833,47.167,99.9708
278,279,3477,1079,1685,299.176,33.3754,56.6246,99.997
279,280,3086,2901,1683,291.808,45.3619,44.6381,99.9772
280,281,2521,1586,1675,283.379,73.1168,16.8832,99.988
281,282,1556,3078,1683,313.124,23.8376,66.1624,99.9944
282,283,3817,2169,1720,309.092,40.6547,49.3453,99.9767
283,284,3145,3335,1719,89.7483,67.407,22.593000000000004,99.9781
284,285,103037,2533,1895,351.522,38.49,51.51,99.0462
285,286,53652,3086,1823,153.56,29.3107,60.6893,99.9254
286,287,17652,1070,1774,126.045,71.4331,18.5669,99.9704
287,288,2592,3235,1729,92.8159,66.8007,23.1993,99.9871
288,289,2048,704,1722,131.436,59.7774,30.2226,99.9014
289,290,2869,3162,1738,131.094,6.8047,83.1953,99.9568
290,291,1384,3284,1746,92.8327,67.196,22.804,99.9608
291,292,534,3428,1752,300.72,53.0274,36.9726,99.9556
292,293,4253,3375,1794,298.715,53.7741,36.2259,99.9443
293,294,727,2346,1758,333.782,36.8962,53.1038,99.9912
294,295,62237,703,1868,322.569,56.9777,33.0223,99.9789
295,296,3504,572,1781,284.175,57.4965,32.5035,99.9896
296,297,13411,988,1886,342.085,70.9164,19.0836,84.7169
297,298,31323,2864,1865,129.71,0.26216100000000003,89.7378,99.991
298,299,4440,3281,1812,154.484,30.3178,59.6822,99.984
299,300,7423,2199,1824,133.615,29.2872,60.7128,99.9474
300,301,919,3425,1812,300.343,53.308,36.692,99.9626
301,302,1081,2138,1809,307.263,49.9798,40.0202,99.9969
302,303,6347,226,1825,304.237,27.5703,62.4297,99.9969
303,304,1415,1184,1821,318.9770000000001,75.2006,14.7994,99.9937
304,305,21605,900,1938,298.664,0.5732729999999999,89.4267,99.9716
305,306,826,561,1824,191.069,78.2726,11.7274,99.9955
306,307,8428,3323,1890,301.493,52.9698,37.0302,99.9579
307,308,2274,2280,1842,298.6620000000001,38.1736,51.8264,99.975
308,309,3698,100,1880,292.122,54.2247,35.7753,99.8938
309,310,1936,2319,1854,337.341,41.1484,48.8516,99.9957
310,311,67938,270,2000,126.107,57.2621,32.7379,63.8277
311,312,5338,1072,1868,312.43,37.4339,52.5661,99.9929
312,313,5925,1158,1899,312.795,6.2119300000000015,83.7881,99.996
313,314,2563,3387,1902,130.485,20.648000000000003,69.352,99.9694
314,315,49830,3048,2089,290.512,48.018,41.982,98.4331
315,316,14951,2257,1936,313.82,1.10966,88.8903,99.9945
316,317,29558,3252,2000,124.059,4.50127,85.4987,99.9727
317,318,9587,1077,1949,136.026,53.3682,36.6318,99.9956
318,319,20495,2826,2001,298.8590000000001,38.7892,51.2108,99.9516
319,320,1096,2362,1936,280.112,52.5552,37.4448,99.9873
320,321,34727,1771,2029,328.307,41.9929,48.0071,99.9315
321,322,2555,198,1955,285.96,53.9364,36.0636,99.9955
322,323,5008,3393,1998,111.205,57.9205,32.0795,99.9172
323,324,6435,3131,2005,310.2290000000001,23.0094,66.9906,99.9854
324,325,34398,2191,2042,263.434,70.7032,19.2968,47.0911
325,326,2634,1094,2019,126.664,33.2552,56.7448,99.9738
326,327,18822,1272,2073,321.597,31.456,58.544,99.9638
327,328,2643,932,2033,131.435,28.5963,61.4037,99.9773
328,329,3885,2633,2047,301.1790000000001,37.5416,52.4584,99.9601
329,330,12580,1967,2090,326.338,42.4792,47.5208,99.9294
330,331,48101,2464,2157,123.918,15.2578,74.7422,77.4828
331,332,701,1358,2041,20.6664,65.3913,24.6087,99.9964
332,333,1015,72,2060,113.29,32.7723,57.2277,99.9025
333,334,13101,1119,2113,304.94,2.53899,87.461,99.9301
334,335,3630,976,2062,234.415,83.7531,6.24686,99.9917
335,336,1139,1889,2051,130.109,56.1201,33.8799,99.8133
336,337,78441,2682,2234,294.656,40.7198,49.2802,99.9814
337,338,1211,425,2072,133.34799999999998,20.0508,69.9492,99.9913
338,339,2252,1033,2081,137.555,33.9121,56.0879,99.9915
339,340,34509,2914,2198,122.78,6.34882,83.6512,91.0115
340,341,8125,3346,2123,120.878,18.9782,71.0218,99.9053
341,342,49869,1742,2184,141.759,36.8673,53.1327,99.9582
342,343,2619,910,2123,298.128,29.0902,60.9098,99.9791
343,344,40248,195,2199,143.291,51.2034,38.7966,99.5677
344,345,6362,3241,2133,124.264,19.0152,70.9848,99.9925
345,346,11146,966,2210,321.144,14.892,75.108,99.6312
346,347,1618,2089,2115,127.798,32.4117,57.5883,99.9969
347,348,2541,2046,2132,125.247,48.1474,41.8526,99.9967
348,349,5790,1207,2142,146.92700000000005,63.3869,26.6131,99.989
349,350,25524,2170,2197,321.375,63.7037,26.2963,99.9651
350,351,1240,1034,2129,187.474,81.4499,8.55008,99.9901
351,352,573,2295,2135,125.541,29.0129,60.9871,99.9886
352,353,545,1653,2136,137.589,43.6662,46.3338,99.2028
353,354,2052,342,2165,129.254,54.923,35.077,99.9845
354,355,1745,381,2160,141.108,24.7543,65.2457,99.987
355,356,1359,1981,2165,125.987,43.9071,46.0929,99.9651
356,357,27140,1062,2263,314.189,62.9998,27.0002,99.9762
357,358,242330,1916,2580,124.47,26.7847,63.2153,54.6289
358,359,172349,1362,2516,136.70600000000002,9.54948,80.4505,84.8314
359,360,2341,1940,2195,141.754,60.984,29.016,99.9944
360,361,39235,3187,2275,280.297,57.8518,32.1482,99.9634
361,362,17762,3350,2289,214.767,63.9304,26.0696,99.8597
362,363,2419,2324,2212,296.827,83.0417,6.95834,99.9831
363,364,27026,1584,2286,118.93,41.9598,48.0402,99.9578
364,365,694,1979,2203,114.269,42.3257,47.6743,99.9945
365,366,27647,383,2289,135.094,12.1522,77.8478,99.9651
366,367,2764,1499,2241,320.643,17.768,72.232,99.9967
367,368,2281,3410,2318,213.029,64.0297,25.9703,99.9498
368,369,30553,2316,2327,304.4,13.1288,76.8712,99.9942
369,370,572,3293,2255,211.041,62.7393,27.2607,99.9928
370,371,16039,165,2345,124.621,2.31808,87.6819,99.6191
371,372,4399,1436,2305,202.252,85.6522,4.3478,99.981
372,373,2867,122,2287,120.962,47.2921,42.7079,99.8709
373,374,19362,2830,2396,155.137,29.6825,60.3175,99.9563
374,375,52263,2153,2415,128.92600000000002,53.2825,36.7175,99.9756
375,376,6629,1694,2354,126.518,24.1441,65.8559,99.9732
376,377,71700,2460,2619,126.514,2.15269,87.8473,89.44
377,378,1030,3294,2366,216.966,62.508,27.492,99.9977
378,379,4069,2931,2361,116.689,58.9376,31.0624,99.764
379,380,1009,3084,2348,299.563,51.0414,38.9586,99.9954
380,381,16330,3168,2468,123.025,21.3205,68.6795,99.806
381,382,2812,1757,2381,354.5130000000001,68.9595,21.0405,99.8663
382,383,9554,3069,2420,153.41299999999995,31.0927,58.9073,99.9874
383,384,3326,92,2397,128.97299999999998,41.424,48.576,99.7118
384,385,4781,285,2394,267.762,58.0466,31.9534,99.9783
385,386,4534,1485,2413,57.5273,70.1062,19.8938,99.7448
386,387,28346,401,2495,309.505,37.6968,52.3032,99.9448
387,388,62720,2701,2512,125.63,29.4156,60.5844,96.9582
388,389,705,988,2380,116.562,23.8253,66.1747,99.9847
389,390,5706,1083,2396,312.98,40.6187,49.3813,99.996
390,391,5537,3238,2431,324.3520000000001,60.8369,29.1631,99.981
391,392,1017,3274,2403,290.73,27.6096,62.3904,99.9909
392,393,859,3189,2403,156.475,29.4312,60.5688,99.9948
393,394,7137,3360,2440,320.0420000000001,60.0088,29.9912,99.7881
394,395,520,3415,2413,321.27,59.0115,30.9885,99.9575
395,396,43155,2995,2550,123.76,48.091,41.909,97.2488
396,397,8534,207,2447,138.47799999999998,35.7794,54.2206,99.9615
397,398,33407,1156,2515,315.746,11.0947,78.9053,99.9398
398,399,590,1741,2448,330.436,76.0079,13.9921,99.6926
399,400,2298,1277,2456,312.078,63.577,26.423,99.9774
400,401,1376,1785,2455,116.948,42.6795,47.3205,99.9937
401,402,6947,3283,2508,136.58700000000002,16.4036,73.5964,99.9538
402,403,5119,274,2511,272.126,57.2572,32.7428,99.9691
403,404,2269,152,2493,273.606,64.4677,25.5323,99.9741
404,405,5640,529,2534,120.046,43.0845,46.9155,99.9593
405,406,19273,2263,2544,339.954,60.6907,29.3093,99.983
406,407,738,2896,2500,302.998,38.3491,51.6509,99.8796
407,408,2728,3362,2508,314.7990000000001,18.6964,71.3036,99.6651
408,409,827,2506,2519,336.394,73.9133,16.0868,99.9899
409,410,1228,208,2536,308.623,39.5782,50.4218,99.9748
410,411,34628,149,2654,283.8,40.8479,49.1521,99.8902
411,412,2437,176,2556,140.744,35.7864,54.2136,99.9968
412,413,29282,2596,2663,120.608,46.2787,43.7213,99.8376
413,414,675,3345,2559,310.242,45.4005,44.5995,99.7379
414,415,3811,3095,2625,307.334,53.5474,36.4526,99.9885
415,416,15697,3178,2644,132.31799999999998,2.20333,87.7967,99.9929
416,417,419227,683,3071,328.491,49.0541,40.9459,51.3335
417,418,574,2621,2594,123.724,22.0638,67.9362,99.9961
418,419,2669,3331,2614,311.585,45.0182,44.9818,99.9053
419,420,2694,3255,2614,126.793,23.7167,66.2833,99.9874
420,421,22823,1606,2684,251.962,84.3056,5.694369999999998,99.9765
421,422,5087,3300,2663,313.635,44.6466,45.3534,99.9902
422,423,16401,2244,2650,163.74,38.8501,51.1499,99.9909
423,424,513,3409,2636,309.623,46.0687,43.9313,99.9543
424,425,28923,1175,2728,136.079,41.3408,48.6592,99.9518
425,426,27651,2782,2745,291.44,25.5094,64.4906,99.92
426,427,4100,1748,2667,139.123,8.355839999999999,81.6442,99.9749
427,428,2832,2873,2680,120.436,77.3022,12.6978,99.9946
428,429,12499,1799,2744,262.797,80.8733,9.12673,99.9857
429,430,735,2916,2693,135.696,11.0216,78.9784,99.9285
430,431,3108,3045,2698,121.862,5.75243,84.2476,99.9881
431,432,9638,3301,2753,140.536,42.9472,47.0528,99.8974
432,433,29800,2978,2813,135.215,10.7437,79.2563,99.3726
433,434,5852,204,2748,298.694,55.3893,34.6107,99.9937
434,435,4280,2087,2748,136.533,19.1229,70.8771,99.9954
435,436,94509,3192,2921,142.701,41.8236,48.1764,99.9765
436,437,53432,2352,2858,151.072,78.3878,11.6122,95.7419
437,438,574,3055,2734,294.732,27.7444,62.2556,99.9788
438,439,3559,917,2777,132.07299999999998,46.191,43.809,99.966
439,440,7501,1693,2788,119.73,10.0793,79.9207,99.9973
440,441,148224,1173,3269,314.898,0.27989200000000003,89.7201,93.6928
441,442,5969,134,2825,142.314,41.6031,48.3969,99.9585
442,443,1518,2618,2798,330.08,75.7688,14.2312,99.9926
443,444,42200,2909,2980,331.44199999999995,5.14599,84.854,99.6304
444,445,651,2693,2808,295.406,24.2496,65.7504,99.9919
445,446,1406,2723,2834,304.784,23.1646,66.8354,99.1701
446,447,3561,193,2852,315.782,38.6744,51.3256,99.6859
447,448,44979,1495,2974,126.576,1.2702,88.7298,99.9916
448,449,9742,1765,2868,316.309,14.3235,75.6765,99.9981
449,450,44790,1748,2959,126.162,72.0743,17.9257,99.7202
450,451,6523,1281,2867,131.685,69.6396,20.3604,99.9734
451,452,3336,2658,2856,203.305,78.535,11.465,99.9967
452,453,504,1153,2851,138.055,40.3882,49.6118,99.9664
453,454,8260,2560,2908,136.783,3.22795,86.772,99.9911
454,455,3862,2219,2921,207.515,67.6395,22.3605,99.9899
455,456,37566,175,2986,315.745,30.6726,59.3274,98.6482
456,457,672,80,2876,294.26,36.115,53.885,99.9317
457,458,69829,1326,3077,291.796,40.6235,49.3765,99.954
458,459,13761,1190,2946,311.722,16.5015,73.4985,99.9893
459,460,3027,1884,2898,221.831,77.7486,12.2514,99.9892
460,461,60548,2696,3038,213.33900000000003,80.7528,9.24724,99.5797
461,462,3861,2639,2914,317.197,76.8824,13.1176,99.9856
462,463,19589,1975,3004,127.813,64.1156,25.8844,99.6301
463,464,1493,2987,2954,300.125,23.2693,66.7307,98.3531
464,465,1698,3405,2983,135.768,44.0233,45.9767,99.6051
465,466,3719,2134,2969,310.514,48.0157,41.9843,99.9723
466,467,580,285,2975,318.7390000000001,24.7429,65.2571,99.9687
467,468,110927,2395,3173,131.69899999999998,40.852,49.148,83.0827
468,469,1140,1680,2985,124.827,57.0284,32.9716,99.9109
469,470,28185,1682,3097,317.769,15.8347,74.1653,99.8884
470,471,21653,2064,3068,311.728,26.3026,63.6974,74.9729
471,472,1839,2996,3013,200.74400000000003,58.2977,31.7023,99.9774
472,473,2407,3388,3085,137.295,43.795,46.205,99.5407
473,474,202902,510,3407,310.4240000000001,4.27325,85.7268,81.0942
474,475,54853,3184,3182,137.803,16.6613,73.3387,99.9906
475,476,1009,2570,3070,292.032,23.7467,66.2533,99.9966
476,477,1617,2884,3068,189.071,75.7399,14.2601,99.9905
477,478,19886,143,3142,291.0,38.9896,51.0104,99.9277
478,479,296798,1898,3382,144.088,22.6128,67.3872,81.0742
479,480,6418,312,3113,288.012,41.0441,48.9559,99.9852
480,481,2856,2911,3111,113.813,25.8351,64.1649,99.9869
481,482,589,1814,3113,132.077,71.1019,18.8981,99.8688
482,483,32102,2919,3230,143.156,28.6729,61.3271,83.0364
483,484,2919,1882,3144,302.129,32.6937,57.3063,99.9967
484,485,782,44,3146,90.7323,59.4974,30.5026,99.9806
485,486,12320,1625,3193,292.882,56.7865,33.2135,99.9545
486,487,1256,2955,3165,184.358,76.63,13.37,99.9914
487,488,2999,2640,3181,201.647,77.60600000000002,12.394,99.9953
488,489,505,255,3166,296.401,83.1491,6.85094,99.9975
489,490,1138,1816,3176,266.41,45.5686,44.4314,99.9968
490,491,4943,147,3222,130.608,6.17071,83.8293,99.9758
491,492,2118,2754,3190,175.55200000000005,77.1443,12.8556,99.9835
492,493,36716,2609,3320,326.134,5.12622,84.8738,99.9922
493,494,6931,78,3239,139.338,17.1425,72.8575,99.5449
494,495,2458,1849,3226,112.402,39.5341,50.4659,99.9963
495,496,8586,1677,3275,126.503,2.23322,87.7668,99.6751
496,497,3955,1790,3242,299.035,60.9636,29.0364,99.943
497,498,6839,2836,3284,187.614,70.8834,19.1166,99.9484
498,499,6503,2763,3297,181.209,72.2465,17.7535,99.9536
499,500,808,3391,3249,247.945,55.7874,34.2126,99.9717
500,501,34287,3267,3438,192.524,55.8896,34.1104,59.4903
501,502,1380,1520,3269,251.779,69.6781,20.3219,99.9962
502,503,100260,194,3489,128.36700000000002,23.4771,66.5229,97.8126
503,504,1865,3058,3289,154.898,64.1954,25.8046,99.9917
504,505,6291,1299,3297,324.397,35.3004,54.6996,99.9987
505,506,16669,2323,3405,127.888,24.034,65.96600000000001,99.9422
506,507,1073,1720,3302,158.039,58.1457,31.8543,99.9918
507,508,3417,1377,3323,131.283,22.1063,67.8937,99.996
508,509,22526,3178,3388,144.312,43.0006,46.9994,99.9502
509,510,2160,299,3328,290.258,36.9608,53.0392,99.9903
510,511,1671,3054,3329,125.057,1.7525,88.2475,99.9969
511,512,23228,2772,3416,190.014,78.4456,11.5544,99.977
512,513,35466,2969,3435,289.972,69.428,20.572,99.5955
513,514,10904,352,3400,81.7837,50.4549,39.5451,99.8925
514,515,1180,1072,3405,128.813,27.9846,62.0154,99.9259
515,516,4818,2407,3439,125.757,37.7703,52.2297,99.9335
516,517,6497,2531,3475,127.41,37.3471,52.6529,99.995
517,518,3866,591,3467,91.2064,54.8209,35.1791,99.9747
518,519,6040,1102,3467,166.783,52.677,37.323,99.9945
519,520,68448,2739,3586,289.444,86.2438,3.75624,99.4929
520,521,602,2285,3454,142.814,34.9841,55.0159,99.9893
521,522,11620,3100,3528,126.841,4.63512,85.3649,99.9726
522,523,3569,2464,3497,171.37599999999995,64.9742,25.0258,99.9667
523,524,5553,1399,3548,322.083,31.0826,58.9174,99.8395
524,525,33465,2334,3592,286.707,84.1762,5.82379,99.7729
525,526,96855,1573,3653,308.141,57.2338,32.7662,93.9784
526,527,7798,1011,3579,101.402,46.5013,43.4987,99.9702
527,528,4674,2770,3569,135.07,39.9842,50.0158,99.9867
528,529,48985,2513,3745,312.839,5.49595,84.5041,98.799
529,530,314645,1180,4013,133.658,16.2204,73.7796,97.646
530,531,26372,1106,3655,311.857,68.6482,21.3518,99.9417
531,532,835,1699,3579,134.635,5.41561,84.5844,99.9968
532,533,2762,2843,3593,208.004,72.747,17.253,99.9943
533,534,4420,3149,3605,314.954,66.3588,23.6412,99.9974
534,535,5621,327,3639,77.1366,49.5831,40.4169,99.979
535,536,8660,1888,3634,144.718,31.8419,58.1581,99.9962
536,537,50621,3048,3773,297.1090000000001,23.1805,66.8195,99.9491
537,538,9856,3239,3653,137.563,7.300910000000001,82.6991,99.9783
538,539,9410,825,3637,97.2927,59.5669,30.4331,99.9889
539,540,25596,1271,3687,317.422,27.58,62.42,99.9958
540,541,1236,3323,3646,241.047,62.3777,27.6223,99.9879
541,542,20807,249,3704,306.608,2.16262,87.8374,99.9948
542,543,36387,2147,3766,314.279,52.986,37.014,99.9662
543,544,90386,2796,3823,257.289,51.6561,38.3439,99.9297
544,545,6909,1993,3701,191.245,75.9207,14.0793,99.9887
545,546,22039,134,3757,187.367,45.6295,44.3705,99.9625
546,547,9409,2284,3718,132.393,44.6975,45.3025,99.9911
547,548,8956,1826,3716,255.316,73.0964,16.9036,99.9808
548,549,562,3248,3684,234.85,64.152,25.848000000000006,99.9404
549,550,60052,769,3815,313.735,9.37675,80.6233,99.9915
550,551,1443,1918,3707,304.914,41.7939,48.2061,99.9739
551,552,16908,3161,3783,138.52200000000002,8.67667,81.3233,99.97
552,553,872,3379,3739,313.865,18.124,71.876,99.8499
553,554,133975,324,4000,213.112,72.066,17.934,45.869
554,555,1569,1905,3740,80.3922,64.1692,25.8308,99.9933
555,556,2556,32,3773,287.007,74.8261,15.1739,99.973
556,557,2394,3258,3759,296.6790000000001,60.4105,29.5895,99.9037
557,558,6065,2364,3787,328.412,5.46815,84.5319,99.836
558,559,14427,3290,3836,305.024,25.6442,64.3558,99.9849
559,560,31917,1925,3872,140.113,32.327,57.673,97.4363
560,561,6909,1657,3801,102.664,83.4593,6.54071,99.956
561,562,15861,1456,3843,306.348,56.4509,33.5491,99.89
562,563,628,1871,3784,81.6631,64.8483,25.1517,99.9909
563,564,5723,1815,3810,120.23,83.1807,6.819260000000001,99.9048
564,565,1357,1904,3785,302.403,40.0941,49.9059,99.9966
565,566,6836,1335,3823,279.909,46.1232,43.8768,99.9673
566,567,1271,3368,3826,302.759,26.1434,63.8566,99.9594
567,568,6167,2264,3817,325.693,56.1795,33.8205,99.9978
568,569,17835,581,3888,330.6280000000001,48.7017,41.2983,99.8654
569,570,24015,2059,3940,125.158,11.5003,78.4997,99.9744
570,571,3487,347,3858,127.55,47.4813,42.5187,99.9915
571,572,15507,1606,3898,315.468,11.1953,78.8047,99.8542
572,573,46274,2290,3944,322.201,6.9828,83.0172,98.4128
573,574,10115,60,3880,122.408,16.1289,73.8711,99.9033
574,575,1574,1713,3849,114.092,52.892,37.108,99.9957
575,576,535,154,3839,306.368,2.89423,87.1058,99.9963
576,577,12274,1741,3916,141.62,80.0908,9.90923,99.9648
577,578,1841,402,3889,319.4190000000001,15.1897,74.8103,99.9978
578,579,2511,2621,3916,288.177,86.0634,3.93664,99.9868
579,580,17519,3044,4012,313.258,71.9567,18.0433,99.5822
580,581,710,3368,3909,133.688,38.6232,51.3768,99.8929
581,582,16855,2612,3998,256.765,57.7943,32.2057,99.8521
582,583,72843,3222,4072,324.38,4.24265,85.7574,89.2155
583,584,2269,2004,3949,309.764,32.6731,57.3269,99.9892
584,585,1497,2933,3946,156.987,62.2463,27.7537,99.9791
585,586,8638,782,3961,283.9240000000001,39.2317,50.7683,99.9058
586,587,3040,2535,3985,230.251,86.2163,3.78367,99.954
587,588,16927,548,4024,132.215,47.0158,42.9842,90.5674
588,589,1454,2977,3973,302.656,68.2775,21.7225,99.9915
589,590,51082,2785,4099,325.148,10.5805,79.4195,99.9656
590,591,2046,2478,3982,315.9290000000001,5.13224,84.8678,99.9537
591,592,78560,1803,4102,306.623,38.9196,51.0804,99.8707
592,593,2895,32,3996,139.561,38.3456,51.6544,99.9236
593,594,85394,726,4206,105.065,0.420746,89.5793,99.9515
594,595,59936,2444,4125,289.655,66.3967,23.6033,72.1522
595,596,1163,1598,4017,123.231,80.7126,9.28739,99.2083
596,597,41164,2101,4147,131.446,28.2627,61.7373,99.9955
597,598,3468,28,4069,117.352,2.01611,87.9839,99.8588
598,599,6317,621,4086,314.907,7.28441,82.7156,99.988
599,600,2198,2518,4058,322.303,85.0008,4.9992,99.6532
600,601,96497,172,4263,152.57299999999995,19.661,70.339,99.8126
601,602,52670,2943,4223,260.565,57.4985,32.5015,99.8013
602,603,998,2489,4092,138.875,52.428,37.572,99.9961
603,604,6326,2272,4160,306.383,46.2599,43.7401,99.9975
604,605,3692,370,4138,127.396,27.7121,62.2879,99.994
605,606,6802,1652,4159,119.992,65.4909,24.5091,99.96
606,607,9321,1547,4185,119.077,5.19977,84.8002,99.9835
607,608,4117,526,4191,312.254,8.20177,81.7982,99.9955
608,609,12626,1021,4221,115.856,50.4053,39.5947,99.9722
609,610,5244,1121,4223,302.247,56.0588,33.9412,99.9837
610,611,128036,1984,4394,121.177,24.0845,65.9155,87.3284
611,612,4989,2233,4228,308.433,40.5593,49.4407,99.9509
612,613,2806,3077,4223,146.05100000000004,31.3604,58.6396,99.986
613,614,14408,962,4297,180.932,78.1117,11.8883,84.6633
614,615,5915,2328,4243,125.038,33.9892,56.0108,99.9833
615,616,786,2626,4207,323.8,36.4841,53.5159,99.993
616,617,993,3353,4229,312.136,23.3314,66.6686,99.8608
617,618,1475,3285,4226,139.92700000000002,30.9058,59.0942,99.9662
618,619,42959,1529,4325,118.759,47.9647,42.0353,99.8834
619,620,51310,3156,4355,134.734,7.78815,82.2118,99.7504
620,621,7121,491,4289,106.664,63.1287,26.8713,99.9641
621,622,19275,2724,4296,135.607,13.9288,76.0712,99.9978
622,623,4346,2158,4268,191.047,64.4015,25.5985,99.9977
623,624,3051,3317,4277,307.245,22.4666,67.5334,99.9003
624,625,13028,2519,4304,149.644,71.3528,18.6472,99.9602
625,626,6686,2611,4294,336.473,11.0561,78.9439,99.9932
626,627,17736,2280,4336,138.486,24.5848,65.4152,99.9943
627,628,8843,1100,4321,137.041,63.128,26.872,99.9825
628,629,55138,1546,4484,141.722,63.7335,26.2665,85.9121
629,630,73535,2464,4482,334.675,11.3878,78.6122,99.8621
630,631,9528,3311,4455,95.1825,9.21874,80.7813,99.9688
631,632,18058,42,4431,302.05,25.9409,64.0591,69.9366
632,633,6069,1194,4358,108.2,53.37,36.63,99.9851
633,634,12101,1380,4386,286.017,37.1018,52.8982,99.9049
634,635,4721,785,4361,317.764,37.8418,52.1582,99.9449
635,636,8490,429,4379,147.315,9.31346,80.6865,99.9085
636,637,166674,599,4488,131.827,9.01242,80.9876,63.3628
637,638,1165,2810,4367,247.926,54.1396,35.8604,99.9964
638,639,4968,2681,4388,141.506,45.8905,44.1095,99.9973
639,640,93864,2802,4524,308.505,16.0037,73.9963,97.9029
640,641,23331,1125,4449,137.248,44.8306,45.1694,99.9139
641,642,595,2131,4374,299.916,41.6145,48.3855,99.6776
642,643,894,3364,4423,97.6248,9.001330000000003,80.9987,99.8767
643,644,716,2983,4394,262.137,58.035,31.965,99.9873
644,645,504,951,4396,133.805,33.9908,56.0092,99.9888
645,646,3547,1280,4423,295.176,40.5588,49.4412,99.9953
646,647,585,2158,4442,309.329,45.3756,44.6244,99.9897
647,648,2281,750,4465,164.835,71.4792,18.5208,99.9956
648,649,10452,2259,4517,297.747,45.8912,44.1088,53.3592
649,650,1434,1723,4455,130.216,51.101000000000006,38.899,99.966
650,651,7237,3196,4493,252.143,56.1702,33.8298,99.8801
651,652,765,713,4460,314.7270000000001,37.8118,52.1882,99.998
652,653,551,1283,4470,207.207,75.9841,14.0159,99.9863
653,654,20141,1705,4554,322.262,6.970439999999999,83.0296,99.9711
654,655,7714,3085,4513,308.844,20.454,69.546,99.9634
655,656,48638,1154,4563,128.32299999999998,11.409,78.59100000000002,99.9718
656,657,6783,1836,4535,274.079,61.6035,28.3965,99.6101
657,658,10997,132,4567,110.802,38.2995,51.7005,99.9806
658,659,1029,177,4526,290.249,27.1898,62.8102,99.9918
659,660,4729,1945,4567,308.248,40.1281,49.8719,99.9365
660,661,16758,3247,4602,128.001,25.0933,64.9067,93.0536
661,662,512,3356,4538,99.1052,14.936,75.064,99.6893
662,663,9633,1406,4591,214.609,79.9321,10.0679,99.9719
663,664,4078,2270,4580,129.428,25.8442,64.1558,99.9963
664,665,2196,34,4573,145.197,28.4605,61.5395,99.8094
665,666,5564,3103,4598,108.241,12.5573,77.4427,99.9858
666,667,744,3173,4590,130.53,37.1177,52.8823,99.5171
667,668,6688,2862,4622,254.834,53.0197,36.9803,99.9783
668,669,7933,1850,4616,133.38299999999998,62.9524,27.0476,99.9797
669,670,14533,2098,4623,340.408,86.9428,3.05717,99.9786
670,671,538,3047,4612,125.697,20.0602,69.9398,99.9982
671,672,2134,794,4611,110.84,19.8552,70.1448,99.9723
672,673,2016,2775,4640,126.226,20.8916,69.1084,99.9767
673,674,657,1601,4629,312.369,37.6661,52.3339,99.9554
674,675,1531,2289,4635,314.656,16.1534,73.8466,99.8571
675,676,1500,1681,4633,278.908,61.2086,28.7914,99.9812
676,677,784,3053,4642,130.10399999999998,40.2949,49.7051,99.9914
677,678,2040,3085,4657,129.536,40.12300000000001,49.877,99.9001
678,679,795,2970,4655,309.523,6.24125,83.7588,99.9474
