,Grain No.,Size [Pixel],center x-coordinate,center y-coordinate,mean azimuth [degree],mean latitude [degree],mean colatitude [degree],Regelungsgrad [%]
0,1,2882,1012,258,96.8323,45.6709,44.3291,99.9393
1,2,7208,2713,272,277.122,12.1315,77.8685,99.9532
2,3,10609,1570,276,281.97,70.5059,19.4941,99.9339
3,4,32023,1877,316,281.111,9.69682,80.3032,99.9837
4,5,439125,2450,687,283.726,0.988426,89.0116,58.9502
5,6,3538,940,269,93.9227,45.5115,44.4885,99.9836
6,7,5039,721,254,109.278,26.0012,63.9988,99.9548
7,8,715,791,255,279.719,12.1904,77.8096,99.9593
8,9,1563,1705,260,93.616,1.19574,88.8043,99.9888
9,10,11172,2598,294,285.316,8.77224,81.2278,99.8953
10,11,18275,436,326,109.42,25.509,64.491,99.9616
11,12,4994,2398,272,273.837,8.23311,81.7669,99.9786
12,13,36477,618,347,281.128,19.4597,70.5403,99.9881
13,14,959,1103,266,106.219,15.3805,74.6195,99.973
14,15,2988,832,271,280.334,22.8394,67.1606,99.9947
15,16,683,2845,255,277.86400000000003,10.0846,79.9154,99.984
16,17,629,2496,274,272.208,3.17267,86.8273,99.9638
17,18,546,1146,265,66.1908,62.0212,27.9788,99.9873
18,19,4795,1642,302,93.2737,1.4165,88.5835,99.9808
19,20,38323,1294,387,104.659,45.6609,44.3391,99.9318
20,21,21822,858,366,103.502,43.8059,46.1941,99.9964
21,22,5274,1429,306,92.4955,3.20719,86.7928,99.9847
22,23,88951,1796,513,101.213,41.4674,48.5326,99.737
23,24,5832,1146,328,283.44,35.023,54.977,99.9942
24,25,730,1337,291,90.6085,4.0265,85.9735,99.9833
25,26,3052,2531,325,100.278,59.2221,30.7779,99.9144
26,27,2685,1089,313,102.906,48.5677,41.4323,99.9966
27,28,88209,1006,522,94.407,16.2009,73.7991,46.0617
28,29,1476,791,314,272.283,16.1121,73.8879,99.9846
29,30,3511,311,338,233.398,85.5721,4.42788,99.9941
30,31,13831,2467,385,285.266,51.44300000000001,38.557,99.888
31,32,914,3260,310,90.5506,8.6436,81.3564,99.982
32,33,1848,252,322,102.62,3.97805,86.0219,99.9573
33,34,1732,3345,319,90.4723,8.391960000000001,81.608,99.9828
34,35,2281,3127,323,99.8291,11.0875,78.9125,99.9725
35,36,179284,3093,728,99.5016,2.33967,87.6603,99.5182
36,37,73745,3309,510,278.811,1.6442599999999998,88.3557,99.7555
37,38,1136,3477,338,274.786,4.52059,85.4794,99.9684
38,39,2699,1496,354,107.565,45.0791,44.9209,99.8923
39,40,2651,3396,350,263.988,78.7515,11.2485,99.9838
40,41,22812,1523,465,275.505,0.717201,89.2828,99.9222
41,42,9207,1984,405,286.209,12.4075,77.5925,98.7311
42,43,11382,712,456,277.873,53.8065,36.1935,99.7915
43,44,42625,2838,447,270.159,51.5344,38.4656,99.9065
44,45,2329,2961,358,267.59,48.9156,41.0844,99.9905
45,46,6057,214,388,105.631,13.3523,76.6477,99.999
46,47,1201,3317,352,279.303,1.70393,88.2961,99.9525
47,48,566,2046,346,105.554,6.976260000000001,83.0237,99.9921
48,49,19460,148,537,114.723,22.1492,67.8508,99.9301
49,50,6625,2673,391,105.621,58.2718,31.7282,99.9728
50,51,4355,1596,406,289.029,69.582,20.418,99.9922
51,52,1368,2568,371,292.182,5.82449,84.1755,99.992
52,53,919,2043,381,283.775,10.1267,79.8733,99.9109
53,54,889,1102,391,283.31,34.5957,55.4043,99.994
54,55,43350,284,548,274.964,22.2489,67.7511,99.9714
55,56,831,287,395,231.785,85.2563,4.74371,99.9955
56,57,15885,410,435,226.844,85.1879,4.81214,99.9908
57,58,5030,1141,421,277.97700000000003,34.9784,55.0216,99.9952
58,59,597,525,401,83.3527,70.5874,19.4126,99.9982
59,60,744,3306,405,280.54400000000004,1.7472599999999998,88.2527,99.9738
60,61,4537,2601,420,282.862,46.0599,43.9401,99.9507
61,62,1327,2155,416,105.108,14.2378,75.7622,99.9929
62,63,525,3494,439,266.42400000000004,70.5322,19.4678,99.9854
63,64,812,2032,444,280.752,55.9716,34.0284,99.9788
64,65,5327,801,463,60.5801,60.396,29.604,99.9963
65,66,1690,1157,465,288.288,47.9298,42.0702,99.9844
66,67,142094,440,733,101.241,3.70204,86.29799999999999,99.5531
67,68,45375,1420,604,106.761,3.27621,86.7238,85.0681
68,69,517,726,492,98.8165,56.0922,33.9078,99.9005
69,70,917,384,502,144.518,49.7651,40.2349,99.9267
70,71,674,1303,513,108.637,8.57368,81.4263,99.9921
71,72,13432,1233,606,97.5261,43.3272,46.6728,99.9285
72,73,13461,875,636,115.623,36.5858,53.4142,99.9896
73,74,30451,732,676,274.964,17.3915,72.6085,99.9267
74,75,18513,1616,652,102.069,63.081,26.919,99.8675
75,76,1656,3214,615,105.938,8.423810000000001,81.5762,99.969
76,77,4593,942,637,280.28700000000003,23.5927,66.4073,99.9879
77,78,730,1580,613,109.217,14.8828,75.1172,99.9965
78,79,509,1622,630,102.393,42.409,47.591,99.9911
79,80,3845,197,687,282.6620000000001,15.7496,74.2504,99.9662
80,81,847,1443,652,275.773,25.1889,64.8111,99.9978
81,82,3978,1281,685,274.569,29.7877,60.2123,99.9872
82,83,1534,235,692,100.231,7.3395100000000015,82.6605,99.9942
83,84,10489,1781,751,109.528,49.0604,40.9396,99.9482
84,85,3760,1064,704,109.958,8.00675,81.9932,99.9961
85,86,7005,1688,734,283.925,48.3594,41.6406,99.979
86,87,3892,1122,711,278.998,8.26805,81.7319,99.9897
87,88,10808,2304,730,277.466,0.111229,89.8888,99.9897
88,89,21553,158,810,110.64,15.7868,74.2132,99.9682
89,90,1660,3372,722,265.433,57.5489,32.4511,99.9914
90,91,327927,1510,1043,270.941,32.3377,57.6623,96.0086
91,92,2104,1418,728,274.961,27.2642,62.7358,99.9968
92,93,20958,1970,795,272.654,22.6719,67.3281,99.8117
93,94,2491,2198,739,278.823,1.45248,88.5475,99.9893
94,95,14401,2911,825,276.078,41.7545,48.2455,99.9731
95,96,3036,3210,759,275.947,42.742,47.258,99.9641
96,97,609,1840,723,101.491,57.9884,32.0116,99.9868
97,98,1000,1333,744,272.686,30.2217,59.7783,99.9592
98,99,1874,1372,750,97.587,45.7621,44.2379,99.9632
99,100,20153,989,784,282.688,19.5975,70.4025,99.636
100,101,720749,660,1489,107.195,3.4151800000000003,86.5848,72.4114
101,102,4059,2421,772,119.844,28.3272,61.6728,99.9858
102,103,48074,590,900,272.733,42.4851,47.5149,99.9604
103,104,4776,1594,769,281.12,27.36,62.64,99.9984
104,105,1027,1839,754,108.888,46.1465,43.8535,99.9946
105,106,5686,2258,797,102.556,64.6907,25.3093,99.9477
106,107,26434,2097,861,268.14,64.4875,25.5125,99.9997
107,108,2289,1468,796,272.254,27.3658,62.6342,99.9781
108,109,16270,1875,850,125.484,82.1366,7.86338,99.9365
109,110,3311,1688,800,109.989,59.7789,30.2211,99.9884
110,111,6428,3159,836,278.076,41.2989,48.7011,99.9795
111,112,10708,2229,880,110.837,47.0124,42.9876,99.9903
112,113,648,1646,841,275.716,46.793,43.207,99.9702
113,114,3710,2319,862,120.975,68.6479,21.3521,99.9841
114,115,16899,1136,894,100.164,44.1665,45.8335,99.98
115,116,2202,1691,854,108.912,38.1591,51.8409,99.9976
116,117,14586,3387,930,326.256,85.4735,4.52649,99.9769
117,118,6838,1687,948,116.098,20.3825,69.6175,99.9967
118,119,25105,2180,1048,225.356,84.6903,5.30967,99.4095
119,120,1718,3474,963,274.327,1.3763,88.6237,99.9833
120,121,37573,2011,1072,99.3992,4.35224,85.6478,99.7561
121,122,4765,3277,960,282.387,36.7993,53.2007,99.9915
122,123,94411,220,1160,113.401,28.4555,61.5445,99.6924
123,124,1552,2874,983,107.222,36.8748,53.1252,99.9518
124,125,1805,2837,1001,108.872,36.7729,53.2271,99.9929
125,126,2274,3459,1014,274.893,1.57332,88.4267,99.9765
126,127,969,2123,1009,137.403,81.2746,8.72541,99.9961
127,128,101866,3246,1147,105.934,3.13222,86.8678,95.9894
128,129,22937,2399,1120,95.8062,1.95999,88.04,99.9616
129,130,1318,2895,1048,278.672,32.9328,57.0672,99.8095
130,131,5176,2818,1067,91.1948,67.8497,22.1503,99.7918
131,132,7179,2285,1086,239.504,87.009,2.99101,99.9562
132,133,847,2946,1067,277.256,34.6732,55.3268,99.9861
133,134,1318,2887,1099,100.944,37.3631,52.6369,99.9851
134,135,845,3477,1105,99.3273,22.3802,67.6198,99.9902
135,136,3091,1886,1104,273.895,34.9243,55.0757,99.9825
136,137,29199,3009,1228,105.61,70.8667,19.1333,87.6885
137,138,24948,2687,1183,112.237,47.2286,42.7714,99.9649
138,139,75725,1180,1301,270.838,28.8041,61.1959,99.9973
139,140,12425,2819,1171,277.715,39.0324,50.9676,99.9489
140,141,68126,2466,1282,266.449,61.1234,28.8766,95.4818
141,142,2278,2231,1158,94.2591,3.64658,86.3534,99.981
142,143,2889,2070,1186,148.346,82.865,7.13501,99.9743
143,144,1217,2268,1197,110.639,84.8162,5.18384,99.9966
144,145,2389,3110,1203,267.603,67.8543,22.1457,99.9897
145,146,3027,1934,1215,101.25,35.9854,54.0146,99.9945
146,147,21029,3437,1307,99.9202,22.6171,67.3829,99.9434
147,148,6250,2139,1225,269.684,37.1203,52.8797,99.9907
148,149,21280,2892,1289,211.43400000000003,81.7377,8.26225,99.9631
149,150,5545,2004,1248,107.1,48.7055,41.2945,99.9374
150,151,9667,2259,1298,105.974,1.7567099999999998,88.2433,99.9431
151,152,1742,2062,1246,230.478,85.5908,4.40918,99.9956
152,153,130820,1639,1430,93.2094,5.43398,84.566,93.3762
153,154,12981,3200,1337,280.745,38.4935,51.5065,99.9756
154,155,4771,1461,1282,282.555,23.713,66.28699999999999,99.923
155,156,18837,242,1304,288.798,84.881,5.11899,100.001
156,157,2135,340,1282,119.068,14.9119,75.0881,99.9942
157,158,1293,1385,1270,286.74,8.74034,81.2597,99.9983
158,159,4478,1929,1286,119.688,56.0828,33.9172,99.994
159,160,3396,407,1276,116.66,28.4144,61.5856,99.994
160,161,17084,2098,1325,267.909,29.3161,60.6839,99.9629
161,162,20003,2680,1351,290.457,10.5426,79.4574,99.9914
162,163,1539,2808,1301,273.99,42.094,47.90600000000001,99.9963
163,164,12301,1924,1376,104.55,60.63399999999999,29.366,99.9808
164,165,1504,1991,1311,105.272,36.7796,53.2204,99.5054
165,166,20338,3045,1393,276.76,16.3677,73.6323,99.8686
166,167,5396,2143,1403,145.39,81.755,8.24501,99.8734
167,168,3505,408,1337,119.216,13.9476,76.0524,99.9841
168,169,150847,2637,1543,134.34799999999998,66.2428,23.7573,81.5968
169,170,16672,313,1419,273.196,26.4628,63.5372,99.989
170,171,2481,1022,1384,289.764,37.2518,52.7482,99.9506
171,172,753,3307,1357,281.475,38.8983,51.1017,99.9278
172,173,996,3348,1374,284.572,17.8427,72.1573,99.8259
173,174,6280,420,1401,278.628,31.6928,58.3072,99.9872
174,175,2390,2337,1391,105.305,43.6982,46.3018,99.9925
175,176,5914,2027,1417,275.305,23.6834,66.3166,99.9652
176,177,1533,2396,1398,286.822,13.1897,76.8103,99.9948
177,178,3836,3366,1414,280.67400000000004,13.1541,76.8459,99.9617
178,179,1507,2215,1398,147.10299999999995,83.8334,6.16656,99.9252
179,180,960,1257,1407,286.548,29.4595,60.5405,99.9984
180,181,7057,3258,1446,106.273,6.6494100000000005,83.3506,99.9663
181,182,1884,2288,1427,107.733,4.1630400000000005,85.837,99.9789
182,183,524,2924,1418,268.523,56.394,33.606,99.9942
183,184,4907,878,1446,256.143,76.84100000000002,13.159,99.9624
184,185,1618,1288,1442,288.188,33.1065,56.8935,99.9956
185,186,230306,1528,1707,101.449,43.4853,46.5147,69.0989
186,187,8886,2166,1465,264.081,32.0946,57.9054,99.869
187,188,2286,2333,1459,284.699,17.037,72.96300000000002,99.9816
188,189,2173,3429,1456,117.35,65.973,24.027,99.7952
189,190,7750,3142,1472,282.886,34.3207,55.6793,99.982
190,191,11550,3342,1534,99.4432,44.6266,45.3734,99.8354
191,192,2534,2011,1487,264.973,34.0574,55.9426,99.9123
192,193,6208,2215,1514,255.451,36.3957,53.6043,99.9826
193,194,43767,3145,1607,280.808,19.9578,70.0422,99.8343
194,195,30101,2942,1614,114.171,48.0822,41.9178,99.7834
195,196,1072,2054,1492,275.896,26.3988,63.6012,99.9597
196,197,1184,3244,1503,104.877,27.3887,62.6113,99.9915
197,198,2839,2104,1540,99.8251,22.7626,67.2374,99.9669
198,199,29032,2024,1705,104.517,18.9745,71.0255,93.6766
199,200,5403,2266,1561,103.809,4.2033,85.7967,99.9951
200,201,4338,2154,1573,276.927,20.2642,69.7358,99.9812
201,202,506,3413,1557,94.5154,45.1364,44.8636,99.9803
202,203,4823,1174,1591,104.207,12.2537,77.7463,99.6625
203,204,9332,3291,1633,273.596,8.667689999999999,81.3323,99.9912
204,205,1515,124,1581,96.6045,22.3169,67.6831,99.9841
205,206,3804,3422,1617,96.021,44.2679,45.7321,99.9607
206,207,210336,2309,1836,279.664,17.1368,72.8632,98.9667
207,208,22351,169,1709,95.6255,23.2701,66.7299,99.9518
208,209,1805,2795,1632,102.616,7.1299199999999985,82.8701,99.9957
209,210,17440,3407,1734,280.402,26.4624,63.5376,99.9484
210,211,4930,1041,1664,292.473,2.73392,87.2661,99.9751
211,212,27085,1902,1735,103.457,36.2728,53.7272,99.9349
212,213,15185,1274,1733,285.11,5.5313300000000005,84.4687,99.975
213,214,1256,1118,1665,292.72,2.98484,87.0152,99.9909
214,215,1312,1159,1664,284.9190000000001,6.53185,83.4682,99.9722
215,216,3430,1071,1723,109.928,9.45819,80.5418,99.9341
216,217,9286,2833,1712,108.864,42.3399,47.6601,99.9836
217,218,33605,3031,1774,111.178,1.66977,88.3302,99.8845
218,219,23747,1155,1804,284.597,71.4413,18.5587,99.9983
219,220,7221,1566,1734,274.795,81.6275,8.37252,99.995
220,221,1969,2762,1750,115.269,46.4099,43.5901,99.9476
221,222,15544,3261,1790,110.348,1.83192,88.1681,99.9877
222,223,4493,3331,1796,102.058,44.8229,45.1771,99.9697
223,224,41763,2827,1943,262.19,67.1153,22.8847,99.8265
224,225,1783,853,1776,124.304,75.5166,14.4834,99.9954
225,226,24006,2690,1887,279.818,69.2081,20.7919,99.9328
226,227,8165,3174,1843,116.069,21.4584,68.5416,99.994
227,228,10701,751,1860,103.339,5.67767,84.3223,99.9962
228,229,84938,178,2105,285.514,1.01985,88.9801,83.5275
229,230,4260,1565,1839,270.866,47.3413,42.6587,99.9947
230,231,1466,116,1830,94.6317,45.4201,44.5799,99.9823
231,232,7390,1270,1871,102.602,52.5766,37.4234,99.958
232,233,24085,3402,1921,101.225,19.3908,70.6092,99.9064
233,234,232328,1044,2210,279.958,12.197,77.803,47.8815
234,235,34215,2966,1951,284.183,25.0159,64.9841,99.8768
235,236,18341,1532,1929,284.155,67.763,22.237,99.9776
236,237,8489,2015,1964,108.558,35.2212,54.7788,99.9272
237,238,2760,3209,1906,115.934,21.7576,68.2424,99.9931
238,239,15370,3157,1962,277.724,31.1944,58.8056,99.9925
239,240,821,3281,1919,110.811,1.95465,88.0453,99.9867
240,241,70282,710,2101,275.769,22.9193,67.0807,99.9653
241,242,33469,1667,2030,249.269,74.4105,15.5895,99.7975
242,243,52563,3165,2068,291.432,48.1077,41.8923,59.7492
243,244,2455,801,1958,277.161,30.5049,59.4951,99.9784
244,245,619,875,1946,276.91700000000003,31.0352,58.9648,99.9918
245,246,1113,256,1965,117.036,2.27518,87.7248,99.9889
246,247,48380,2564,2055,286.751,1.26921,88.7308,99.9169
247,248,22697,1987,2114,290.866,77.6451,12.3549,99.7681
248,249,1194,265,2016,285.87,43.9224,46.0776,99.9909
249,250,5596,1875,2043,257.611,75.3346,14.6654,99.7678
250,251,1033,2732,2056,285.2920000000001,68.8567,21.1433,99.8057
251,252,2608,3402,2072,112.486,1.61397,88.38600000000002,99.8555
252,253,65075,2268,2211,280.98,45.7812,44.2188,99.8108
253,254,8166,1306,2125,130.52100000000002,57.5877,32.4123,99.9956
254,255,1139,1403,2073,115.398,46.9601,43.0399,99.9954
255,256,541,2958,2079,268.868,69.2174,20.7826,99.9766
256,257,11952,1756,2136,282.365,32.3759,57.6241,99.9922
257,258,11947,2725,2146,100.78,47.2219,42.7781,99.9649
258,259,103244,1530,2286,281.2,3.59952,86.4005,97.2247
259,260,2397,1479,2122,103.845,62.7594,27.2406,99.9858
260,261,8421,313,2154,111.829,16.39,73.61,99.9895
261,262,9425,2450,2135,120.406,70.9742,19.0258,99.9815
262,263,44960,1843,2241,104.053,36.6819,53.3181,99.9517
263,264,1571,3237,2124,276.666,31.9095,58.0905,99.9975
264,265,56217,3009,2315,289.8040000000001,19.9276,70.0724,53.6409
265,266,511,870,2126,279.003,46.8164,43.1836,99.986
266,267,581,3326,2144,280.983,76.5644,13.4356,99.9908
267,268,538,1628,2139,109.205,4.49469,85.5053,99.9974
268,269,17760,3206,2195,109.899,2.70567,87.2943,99.9853
269,270,30834,1205,2243,109.693,36.28,53.72,99.9908
270,271,10593,2788,2224,109.667,22.085,67.915,99.9306
271,272,16596,2477,2239,272.34,31.3561,58.6439,99.9527
272,273,8361,2609,2239,100.928,17.6135,72.3865,99.9807
273,274,39645,619,2325,116.885,17.7269,72.2731,99.9793
274,275,741,2551,2200,273.83,29.9609,60.0391,99.9751
275,276,1157,2095,2213,150.701,64.0841,25.9159,99.9921
276,277,5427,334,2250,97.6621,33.6907,56.3093,99.9572
277,278,13796,3151,2260,105.44,64.6253,25.3747,99.9534
278,279,630,2693,2227,262.612,63.3844,26.6156,99.9955
279,280,864,395,2252,276.324,37.8527,52.1473,99.9846
280,281,4244,2033,2251,120.522,54.0969,35.9031,99.9949
281,282,12577,2865,2289,120.618,71.6345,18.3655,99.9942
282,283,33497,454,2382,119.591,3.64214,86.3579,99.8375
283,284,39467,2109,2368,280.42,23.5895,66.4105,99.9783
284,285,3050,2705,2281,112.896,3.71878,86.2812,99.9615
285,286,1470,2650,2271,110.411,21.6207,68.3793,99.9844
286,287,13875,1962,2341,97.9354,30.0225,59.9775,99.7954
287,288,3503,2227,2282,142.775,62.2639,27.7361,99.9933
288,289,12866,3408,2330,280.82,0.812263,89.1877,99.9656
289,290,3380,1126,2319,108.817,56.4403,33.5597,99.9738
290,291,1296,1054,2302,263.236,45.4686,44.5314,99.9922
291,292,671,842,2306,263.696,46.6758,43.3242,99.9728
292,293,3734,2770,2325,297.949,0.7372890000000001,89.2627,99.9882
293,294,7406,3248,2328,105.814,65.6059,24.3941,99.9521
294,295,5217,323,2327,276.444,40.1586,49.8414,99.9924
295,296,1845,733,2337,100.562,5.3430800000000005,84.6569,99.9859
296,297,5273,2677,2336,101.007,2.72061,87.2794,99.9506
297,298,2951,1359,2329,287.573,9.52758,80.4724,99.9935
298,299,2219,886,2326,336.7390000000001,79.3961,10.6039,99.9957
299,300,6279,1231,2350,109.981,0.427238,89.5728,99.99
300,301,8922,2276,2388,287.058,61.6962,28.3038,99.956
301,302,43611,2555,2422,292.463,5.51654,84.4835,99.9634
302,303,1262,98,2342,287.052,74.7367,15.2633,99.9751
303,304,55314,1812,2475,88.3721,60.1807,29.8193,99.8512
304,305,2752,1091,2354,109.689,29.5342,60.4658,99.9871
305,306,126639,1320,2605,110.966,59.1714,30.8286,98.1148
306,307,51849,343,2548,278.048,39.8196,50.1804,99.3149
307,308,678,1035,2349,337.051,80.1528,9.8472,99.9958
308,309,768,2822,2374,299.615,5.962269999999998,84.0377,99.976
309,310,96942,2679,2596,273.632,49.4021,40.5979,99.9617
310,311,12982,2903,2437,110.747,9.13911,80.8609,99.9579
311,312,1998,3218,2373,102.697,45.4638,44.5362,99.9847
312,313,186669,3256,2729,109.074,9.48473,80.5153,99.1488
313,314,9130,124,2449,101.039,37.0859,52.9141,99.9152
314,315,607,1230,2405,109.669,0.0403137,89.9597,99.9232
315,316,5795,3198,2437,273.208,36.317,53.683,99.9976
316,317,532,233,2417,110.581,8.739410000000001,81.2606,99.9923
317,318,5951,2384,2466,280.868,11.7222,78.2778,99.996
318,319,606,875,2438,108.274,29.5152,60.4848,99.9718
319,320,1165,1976,2454,102.821,11.2643,78.7357,99.9082
320,321,47041,2253,2574,118.938,50.3424,39.6576,99.8996
321,322,739,932,2458,104.937,40.1029,49.8971,99.9864
322,323,13887,608,2554,263.836,40.8165,49.1835,99.9344
323,324,15011,2087,2524,281.014,61.2657,28.7343,99.8315
324,325,110520,890,2747,110.374,23.5235,66.4765,99.6707
325,326,21015,472,2597,93.8034,28.3611,61.6389,99.9841
326,327,549693,2850,3230,279.84,17.9281,72.0719,86.7423
327,328,53808,1613,2642,279.768,21.8135,68.1865,99.962
328,329,16780,167,2558,106.171,12.3472,77.6528,99.8646
329,330,3517,669,2552,120.796,9.93266,80.0673,99.942
330,331,1449,2894,2534,110.999,9.90349,80.0965,99.9849
331,332,15433,2417,2618,103.678,2.77648,87.2235,99.9267
332,333,3490,1760,2603,121.998,54.4408,35.5592,99.9808
333,334,9054,1995,2634,88.8357,19.5846,70.4154,99.9066
334,335,81240,186,2820,281.812,44.6983,45.3017,81.2862
335,336,3670,2104,2632,342.21,87.3045,2.69552,99.9952
336,337,2514,287,2651,273.913,38.1577,51.8423,99.9919
337,338,44887,1829,2731,287.91,4.37664,85.6234,99.9627
338,339,108316,2072,2868,105.698,50.4933,39.5067,99.6954
339,340,1084,360,2690,269.423,43.1017,46.8983,99.9942
340,341,8674,657,2766,265.529,43.1263,46.8737,99.9388
341,342,3882,1510,2704,109.546,0.914169,89.0858,99.9638
342,343,1194,329,2689,108.442,10.9159,79.0841,99.995
343,344,60802,2385,2834,281.046,25.1826,64.8174,99.8861
344,345,6335,578,2763,113.166,25.3613,64.6387,99.9969
345,346,9516,3362,2795,106.439,46.7459,43.2541,99.9049
346,347,19793,2690,2803,110.27,8.445219999999999,81.5548,99.9894
347,348,78637,458,2918,102.378,9.53756,80.4624,99.6608
348,349,15128,1248,2855,274.907,50.488,39.512,99.9856
349,350,54190,1094,2935,94.5073,48.0873,41.9127,99.9841
350,351,37208,1730,2906,303.006,59.7961,30.2039,99.9352
351,352,1777,617,2808,270.89,43.0731,46.9269,99.9905
352,353,21962,3107,2875,112.242,59.0002,30.9998,99.9793
353,354,7125,2557,2861,109.827,17.3188,72.6812,99.9791
354,355,198020,1253,3126,109.823,24.5994,65.4006,99.7431
355,356,17139,761,2955,107.687,38.9054,51.0946,99.9563
356,357,672,3387,2877,111.149,81.9569,8.04306,99.9821
357,358,1455,2559,2921,285.402,10.0234,79.9766,99.9913
358,359,616,3383,2925,113.378,82.1894,7.8106300000000015,99.9818
359,360,8735,668,3008,300.027,1.74741,88.2526,99.9311
360,361,12638,1955,3026,114.373,34.8172,55.1828,99.513
361,362,961,276,2969,111.981,20.3026,69.6974,99.9867
362,363,1474,3415,2986,279.54400000000004,26.5549,63.4451,99.9611
363,364,11409,2433,3013,121.589,53.2047,36.7953,99.7594
364,365,6639,2308,3020,282.199,24.2746,65.7254,99.9718
365,366,1694,1272,3007,286.372,15.5355,74.4645,99.9706
366,367,48837,185,3155,275.575,17.6226,72.3774,99.9056
367,368,20277,619,3120,111.935,54.3884,35.6116,99.9947
368,369,30715,2213,3119,320.966,77.3341,12.6659,99.959
369,370,9136,3405,3100,282.381,3.86917,86.1308,99.9567
370,371,8521,323,3108,42.7419,81.7665,8.23347,99.986
371,372,17115,775,3116,94.2802,70.7717,19.2283,99.983
372,373,3446,1706,3088,214.772,77.4038,12.5962,99.9783
373,374,96934,1690,3202,107.329,7.65073,82.3493,99.4941
374,375,2794,410,3108,43.8098,81.3815,8.6185,99.9759
375,376,10918,2003,3149,249.21,35.9812,54.0188,99.8604
376,377,12187,3086,3145,127.841,51.7597,38.2403,99.9497
377,378,537,2380,3084,96.3512,51.2229,38.7771,99.7521
378,379,1026,383,3095,257.893,38.8661,51.1339,99.9681
379,380,11414,508,3149,274.675,17.9121,72.0879,99.988
380,381,5634,2349,3164,297.257,59.8528,30.1472,99.989
381,382,16598,2102,3224,243.67,80.0196,9.98036,99.7053
382,383,132324,486,3366,96.9122,7.7738,82.2262,99.8989
383,384,60505,3299,3293,125.059,47.7079,42.2921,99.5725
384,385,2121,702,3198,90.5753,66.1069,23.8931,99.9802
385,386,938,758,3207,194.7,89.4486,0.551429,99.9891
386,387,3949,3109,3234,92.1154,41.2522,48.7478,99.9961
387,388,15539,880,3255,103.872,47.2165,42.7835,99.9576
388,389,21918,2256,3277,109.126,52.0925,37.9075,99.9814
389,390,3098,620,3240,119.739,83.574,6.42596,99.9909
390,391,13801,1973,3303,124.265,40.0091,49.9909,99.8055
391,392,851,557,3238,282.933,18.3264,71.6736,99.9749
392,393,1026,757,3245,99.2605,73.5873,16.4127,99.9788
393,394,11271,1371,3286,41.4707,88.2477,1.7523400000000002,99.8675
394,395,549,1465,3261,251.566,43.6193,46.3807,99.9738
395,396,1867,561,3285,128.30100000000002,81.97200000000002,8.027989999999999,99.9945
396,397,19905,2365,3377,111.553,45.5966,44.4034,99.1979
397,398,49528,1866,3441,276.758,36.168,53.832,99.888
398,399,1643,2068,3300,296.519,60.4616,29.5384,99.9873
399,400,1208,793,3301,103.46,9.03133,80.9687,99.907
400,401,1109,121,3310,105.015,27.5493,62.4507,99.9657
401,402,1498,82,3330,273.698,12.3628,77.6372,99.9639
402,403,820,578,3317,307.129,4.952380000000002,85.0476,99.9898
403,404,903,538,3325,96.7322,58.6094,31.3906,99.9934
404,405,397776,285,3887,102.188,56.0827,33.9173,87.50399999999998
405,406,9589,911,3371,278.816,0.908623,89.0914,99.9511
406,407,776,3137,3339,111.694,2.83441,87.1656,99.9892
407,408,2125,1318,3365,120.323,46.8853,43.1147,99.9899
408,409,3746,1470,3381,305.985,67.2245,22.7755,99.9871
409,410,6012,1382,3388,288.387,35.162,54.838,99.9695
410,411,15286,2116,3395,277.747,8.01517,81.9848,99.9822
411,412,11634,1696,3395,280.335,7.229939999999999,82.7701,99.9049
412,413,4068,3138,3404,116.013,35.9888,54.0112,99.9969
413,414,4661,2486,3408,284.332,4.86295,85.1371,99.9083
414,415,30651,2646,3472,260.027,48.0895,41.9105,99.967
415,416,7855,1030,3432,269.562,49.5713,40.4287,99.9435
416,417,7604,1574,3440,282.338,19.7693,70.2307,99.9259
417,418,159625,759,3634,109.88,51.6152,38.3848,99.9627
418,419,555,1160,3401,97.0065,65.1675,24.8325,99.9792
419,420,88674,2135,3608,108.599,11.4651,78.5349,99.8549
420,421,1120,1116,3410,116.526,45.5638,44.4362,99.9968
421,422,56617,3308,3545,281.574,24.5943,65.4057,99.896
422,423,4737,3102,3450,137.056,56.7934,33.2066,99.9957
423,424,34089,1233,3531,255.99,41.1908,48.8092,99.9496
424,425,3948,3184,3464,126.427,53.3259,36.6741,99.9914
425,426,10735,1447,3481,83.443,65.569,24.431,99.9156
426,427,66658,2447,3651,112.878,37.0478,52.9522,99.7887
427,428,1860,1348,3466,296.94,2.27748,87.7225,99.9761
428,429,29526,1078,3629,132.41,59.253,30.747,99.9817
429,430,1188,1673,3501,277.466,67.6063,22.3937,99.9716
430,431,365174,1398,3974,296.9790000000001,2.86117,87.1388,99.9796
431,432,908,2346,3488,125.119,42.1194,47.8806,99.9903
432,433,6127,2340,3577,287.036,1.0168,88.9832,99.9777
433,434,2849,1727,3559,285.08,23.1504,66.8496,99.8103
434,435,6522,1843,3578,110.712,14.5829,75.4171,99.9718
435,436,28315,2699,3681,112.47,38.0352,51.9648,99.953
436,437,755,1655,3566,283.347,67.3681,22.6319,99.9303
437,438,3046,2298,3618,276.85,12.4461,77.5539,99.9355
438,439,11378,2603,3646,117.772,3.36681,86.6332,99.9943
439,440,13724,1735,3670,298.933,58.2744,31.7256,99.3915
440,441,11901,1872,3671,167.18099999999995,73.7958,16.2042,99.99
441,442,1583,1960,3665,278.711,14.7786,75.2214,99.8894
442,443,12621,1193,3712,274.678,10.0078,79.9922,99.9748
443,444,90225,2217,3953,275.005,54.8404,35.1596,99.9248
444,445,8818,2547,3747,107.164,17.0091,72.9909,99.9914
445,446,8471,2007,3740,275.68,19.9942,70.0058,99.9053
446,447,21935,889,3763,297.865,66.9706,23.0293,99.9797
447,448,9911,3344,3728,282.541,38.1157,51.8843,99.9161
448,449,7442,2777,3733,284.133,16.3096,73.6904,99.9865
449,450,7858,1676,3739,174.733,72.0072,17.9928,99.9933
450,451,7031,3225,3756,109.259,13.3527,76.6473,99.982
451,452,1187,1865,3732,132.175,69.4226,20.5774,99.9343
452,453,200036,922,4127,93.1665,61.293,28.707,80.5518
453,454,31592,1892,3846,98.9277,6.77257,83.2274,99.8225
454,455,3284,1738,3796,247.916,33.5205,56.4795,99.9693
455,456,1075,945,3769,272.338,48.2754,41.7246,99.9858
456,457,13081,3147,3819,288.673,19.595,70.405,99.9899
457,458,9211,1609,3845,301.34,56.5634,33.4366,99.992
458,459,5885,3272,3826,282.883,24.4222,65.5778,99.9935
459,460,76844,3336,4057,97.7744,10.0117,79.9883,99.0666
460,461,2270,2713,3814,297.15,42.3393,47.6607,99.8868
461,462,46176,2766,3999,293.433,80.8643,9.13568,99.7455
462,463,535,1747,3837,106.316,22.5229,67.4771,99.9715
463,464,698,2587,3828,290.441,2.53907,87.4609,99.9436
464,465,1051,2539,3843,289.639,0.02742,89.9726,99.9552
465,466,191317,2518,4143,105.187,78.0083,11.9917,99.898
466,467,6102,3213,3903,132.5,52.2183,37.7817,99.9948
467,468,985,869,3872,98.6587,38.8856,51.1144,99.8935
468,469,1176,2491,3875,261.618,82.4426,7.557360000000001,99.9719
469,470,1970,2884,3897,294.107,38.7628,51.2372,99.9946
470,471,25824,2044,3977,106.017,10.2269,79.7731,99.9967
471,472,27357,3111,3990,275.391,49.5527,40.4473,99.9495
472,473,3928,844,3944,119.79,54.0266,35.9734,99.9709
473,474,25079,700,3993,283.281,51.0277,38.9723,97.5191
474,475,4843,2826,3947,103.811,63.2791,26.7209,99.9735
475,476,9425,1837,3958,261.358,76.8309,13.1691,99.9859
476,477,5421,2910,3969,257.66,67.8606,22.1393,99.9599
477,478,17256,1917,4068,276.184,54.9803,35.0197,99.763
478,479,46467,2946,4151,100.618,62.6303,27.3697,99.7817
479,480,1367,549,4041,286.759,9.34711,80.6529,99.9644
480,481,58473,595,4274,95.6417,37.7358,52.2642,99.968
481,482,4584,510,4102,287.268,11.0107,78.9893,99.961
482,483,9045,1811,4101,271.811,87.2996,2.70041,99.9963
483,484,10734,3122,4114,263.363,51.301,38.699,99.9777
484,485,35782,1891,4217,286.9890000000001,8.09499,81.905,99.9718
485,486,1065,2192,4147,87.5741,78.4955,11.5045,99.9773
486,487,14915,3168,4222,98.0543,63.4875,26.5125,99.9829
487,488,3859,1733,4184,271.93,15.5586,74.4414,99.9958
488,489,19676,1418,4328,275.095,25.7998,64.2002,95.4144
489,490,1265,2838,4191,94.7088,46.5678,43.4322,99.991
490,491,4602,2126,4215,91.9438,19.574,70.426,99.9882
491,492,5486,3064,4242,285.611,22.9013,67.0987,99.9398
492,493,25002,2072,4312,279.101,19.4163,70.5837,99.9802
493,494,9120,2769,4246,287.867,3.59785,86.4022,99.7461
494,495,655,2858,4221,104.135,6.19243,83.8076,99.9546
495,496,8836,1569,4248,273.255,16.4469,73.5531,99.9863
496,497,31706,1676,4354,345.944,84.3429,5.6571099999999985,99.9658
497,498,1224,3424,4308,94.3935,9.28815,80.7119,99.9735
498,499,33523,2240,4357,107.12,9.14911,80.8509,99.9615
499,500,1530,1462,4262,164.25400000000005,71.5728,18.4272,99.9912
500,501,2409,2783,4284,304.649,73.8072,16.1928,99.9669
501,502,20095,3313,4384,109.142,10.1268,79.8732,99.7641
502,503,14442,453,4373,290.327,3.02496,86.975,99.9894
503,504,12822,3000,4350,288.133,38.0804,51.9196,99.9743
504,505,8562,2851,4361,288.821,77.8597,12.1402,99.9591
505,506,15018,1949,4364,103.377,18.2518,71.7482,99.7924
506,507,20871,3142,4357,100.339,9.53516,80.4648,99.978
507,508,5723,1146,4339,283.222,23.3985,66.6015,99.9979
508,509,53643,207,4484,278.366,7.42926,82.5707,91.2793
509,510,17801,1534,4392,278.66200000000003,5.28985,84.7102,99.9349
510,511,3990,1788,4350,103.131,5.38002,84.62,99.9929
511,512,4628,2764,4379,116.403,68.3694,21.6306,99.9924
512,513,21289,2901,4499,112.14,59.809,30.191,85.2576
513,514,28836,1191,4422,277.011,6.9549,83.0451,99.9527
514,515,715,2812,4364,284.2920000000001,2.77657,87.2234,99.9294
515,516,21487,2424,4454,231.152,85.8796,4.1203699999999985,99.9462
516,517,1056,1837,4387,101.685,1.44836,88.5516,99.5516
517,518,47060,1998,4504,263.61,20.8085,69.1915,91.303
518,519,1540,3047,4416,277.875,56.4572,33.5428,99.9863
519,520,1552,3418,4435,277.251,13.3082,76.6918,99.9516
520,521,1789,793,4441,288.448,38.378,51.622,99.991
521,522,811,2785,4430,112.672,28.9276,61.0724,99.9927
522,523,5678,3213,4465,280.983,45.7491,44.2509,99.976
523,524,5209,1805,4471,178.97400000000005,79.3135,10.6865,99.9238
524,525,987,2501,4443,269.499,65.0846,24.9154,99.9815
525,526,26327,1181,4565,291.117,14.9175,75.0825,87.2696
526,527,1667,2303,4450,272.447,82.505,7.495039999999999,99.9933
527,528,40154,2678,4507,111.385,17.5635,72.4365,98.1812
528,529,32327,1318,4573,92.5187,63.7753,26.2247,99.9166
529,530,8421,3088,4479,288.446,23.147,66.85300000000001,99.9572
530,531,13163,497,4492,279.124,18.2432,71.7568,92.831
531,532,31211,784,4541,110.997,80.1595,9.84045,78.4544
532,533,44074,1512,4615,114.949,6.15275,83.8473,99.9806
533,534,1228,396,4470,290.088,79.4455,10.5544,99.978
534,535,543,3003,4465,109.352,1.09562,88.9044,99.9859
535,536,24187,1646,4542,116.554,42.059,47.941,99.9155
536,537,79646,2140,4667,277.53,3.89001,86.11,82.0766
537,538,1840,821,4478,279.509,12.253,77.747,99.992
538,539,731,2274,4485,106.627,8.02999,81.97,99.9931
539,540,742,3193,4496,273.97,54.9156,35.0844,99.9942
540,541,845,892,4495,91.1173,69.0367,20.9633,99.9678
541,542,9220,1039,4551,110.518,42.5684,47.4316,88.9309
542,543,2433,2986,4519,125.968,50.6474,39.3526,99.9937
543,544,2949,3171,4525,289.961,14.1096,75.8904,99.9556
544,545,3368,952,4544,288.769,15.4787,74.5213,99.9441
545,546,60126,1825,4697,134.66299999999998,74.3664,15.6336,99.8624
546,547,1681,3360,4549,291.394,1.77023,88.2298,99.7906
547,548,49175,3059,4627,112.182,34.5028,55.4972,64.1584
548,549,9939,377,4570,282.095,20.0461,69.9539,99.9672
549,550,106095,779,4692,101.673,42.2483,47.7517,99.9722
550,551,6316,111,4575,103.437,2.68088,87.3191,99.8187
551,552,830,3410,4601,276.633,46.8844,43.1156,99.9239
552,553,28392,2520,4653,284.76,50.522,39.478,99.8984
553,554,7641,2284,4620,297.175,81.7338,8.26624,99.9898
554,555,15452,2757,4627,288.982,9.76595,80.2341,99.9734
555,556,5722,805,4639,279.23900000000003,12.7094,77.2906,99.9884
556,557,11385,412,4653,272.801,72.78699999999998,17.213,47.4549
557,558,43807,2330,4737,107.274,4.2300900000000015,85.7699,99.9033
558,559,4663,1426,4649,287.872,32.7973,57.2027,99.9542
559,560,12889,3226,4681,112.559,49.3358,40.6642,99.9563
560,561,889,140,4652,101.068,0.5144350000000001,89.4856,99.9524
561,562,1233,1051,4645,281.063,16.6654,73.3346,99.9945
562,563,1609,1717,4659,132.58,74.9831,15.0169,99.9942
563,564,619,285,4658,103.137,63.0181,26.9819,99.9429
564,565,18605,1353,4737,83.5627,49.8493,40.1507,99.9401
565,566,2236,1799,4673,95.5028,22.8453,67.1547,99.9909
566,567,18394,1217,4753,279.943,18.6884,71.3116,98.7795
567,568,5337,2557,4743,281.117,51.0061,38.9939,99.6975
568,569,2978,2688,4683,287.65,8.8884,81.1116,99.9589
569,570,1443,2805,4692,286.606,9.38699,80.613,99.9478
570,571,514,322,4697,285.697,23.5607,66.4393,99.9595
571,572,3380,3004,4752,115.047,58.6395,31.3605,99.8829
572,573,4904,3158,4770,122.4,45.5012,44.4988,99.7049
573,574,1022,1613,4730,109.639,53.2056,36.7944,99.9989
574,575,1243,810,4749,101.538,42.6551,47.3449,99.9436
575,576,773,1615,4763,99.5651,18.0563,71.9437,99.9903
576,577,1344,1482,4764,100.419,18.4344,71.5656,99.9971
577,578,21925,1504,4825,98.1018,18.8602,71.1398,99.8972
578,579,12128,1817,4839,132.524,73.0571,16.9429,99.8283
579,580,3651,2191,4858,274.745,69.0642,20.9358,99.9644
580,581,747,1081,4854,104.209,41.9522,48.0478,99.9701
581,582,589,2248,4861,107.565,5.43503,84.565,99.9258
582,583,1046,1980,4880,275.004,15.1842,74.8158,99.8713
