,Grain No.,Size [Pixel],center x-coordinate,center y-coordinate,mean azimuth [degree],mean latitude [degree],mean colatitude [degree],Regelungsgrad [%]
0,1,1901,201,204,59.3795,31.7471,58.2529,99.9474
1,2,4104,415,234,63.62600000000001,4.02377,85.9762,99.9124
2,3,5599,519,218,59.6187,29.753,60.247,99.9854
3,4,2352,608,210,237.939,14.8988,75.1012,99.9895
4,5,25777,705,271,59.2803,6.13882,83.8612,99.9495
5,6,44685,1129,243,73.0082,73.3972,16.6028,99.9953
6,7,601,1455,205,86.0104,13.9297,76.0703,99.9779
7,8,83014,1512,390,255.875,5.39185,84.6081,97.973
8,9,880,1565,199,256.486,5.1921599999999986,84.8078,99.8726
9,10,41127,1845,278,249.81,5.50448,84.4955,99.9684
10,11,579,2029,195,311.103,85.6844,4.31561,99.993
11,12,7554,2166,231,234.852,39.2847,50.7153,99.9516
12,13,8855,2361,232,252.98,16.0109,73.9891,99.9867
13,14,16574,2649,240,142.704,78.7044,11.2956,99.9748
14,15,12457,2799,251,239.157,26.4969,63.5031,99.9429
15,16,8200,2918,224,62.085,24.7056,65.2944,99.9117
16,17,13074,317,250,231.224,1.6825599999999998,88.3174,99.9868
17,18,2293,3252,215,52.6904,25.9853,64.0147,99.883
18,19,6001,1658,259,255.131,3.11029,86.8897,99.9656
19,20,44010,2521,325,80.655,62.0076,27.9924,99.9224
20,21,2396,3075,213,54.9527,26.3794,63.6206,99.6589
21,22,1508,3341,216,230.365,60.364,29.636,99.7837
22,23,2862,1396,223,232.492,46.664,43.33600000000001,99.9987
23,24,1068,2086,219,309.08,85.8781,4.1218900000000005,99.9943
24,25,3342,3416,257,229.751,58.1396,31.8604,99.5846
25,26,16974,2048,285,66.9515,40.0822,49.9178,99.9672
26,27,31590,3111,305,228.871,43.8562,46.1438,99.8646
27,28,1220,2250,238,193.41,70.4053,19.5947,99.9661
28,29,6460,225,286,59.7753,28.9843,61.0157,99.956
29,30,1778,452,249,234.69,65.4981,24.5019,99.9765
30,31,4545,3360,267,224.4,55.1821,34.8179,99.9475
31,32,1712,170,239,232.981,66.7811,23.2189,99.9916
32,33,2130,3274,256,49.2423,25.8601,64.1399,99.9965
33,34,3362,825,274,181.672,79.0606,10.9394,99.9943
34,35,8585,2261,298,175.419,71.4807,18.5193,99.9833
35,36,1286,494,269,245.676,15.96,74.04,99.9661
36,37,13646,2943,325,239.33,25.3161,64.6839,99.9932
37,38,1318,154,289,234.692,8.26859,81.7314,99.9753
38,39,9758,875,331,56.7798,27.0483,62.9517,99.9673
39,40,44510,435,371,225.361,73.405,16.595,99.0953
40,41,5583,978,302,232.075,24.8273,65.1727,99.9695
41,42,20951,3321,361,224.259,64.7227,25.2773,99.9633
42,43,777,2180,297,189.356,67.9263,22.0737,99.8951
43,44,1515,1109,303,78.5248,43.4075,46.5925,99.9894
44,45,2412,2325,319,96.3657,66.2866,23.7134,99.9983
45,46,686,1065,312,260.422,3.84387,86.1561,99.9905
46,47,640,1034,315,250.30900000000003,28.7144,61.2856,99.9042
47,48,1760,1803,335,66.5657,65.7058,24.2942,99.9966
48,49,22030,1261,381,79.6608,1.93981,88.0602,99.98
49,50,28179,2794,382,65.4188,51.9509,38.0491,99.9635
50,51,12217,192,391,65.5515,27.6704,62.3296,99.9527
51,52,3670,1738,349,231.251,73.1851,16.815,99.9952
52,53,537,942,334,241.595,78.9247,11.0753,99.9901
53,54,17728,2232,408,77.2691,44.4392,45.5608,99.9657
54,55,33136,1160,473,265.136,27.926,62.074,99.7532
55,56,855,283,335,235.605,67.196,22.804,99.9921
56,57,877,2354,349,84.7713,60.1157,29.8843,99.9935
57,58,4111,1043,371,258.586,8.186060000000001,81.8139,99.9593
58,59,55083,2095,477,219.292,84.4868,5.51322,99.8133
59,60,13466,766,397,187.209,76.8634,13.1366,99.9762
60,61,852,973,356,79.8473,2.05953,87.9405,99.9774
61,62,772,2383,369,56.4553,34.5487,55.4513,99.9857
62,63,983,919,391,60.4349,24.7101,65.2899,99.8952
63,64,5968,636,402,66.1871,17.5208,72.4792,99.9975
64,65,567,2247,375,212.18400000000003,84.6781,5.32186,99.995
65,66,9216,3046,418,62.8957,31.077,58.923,99.9896
66,67,20019,1007,484,82.176,12.8807,77.1193,99.1649
67,68,21203,1737,460,204.413,72.1149,17.8851,99.9505
68,69,3731,550,421,210.716,80.5828,9.4172,99.989
69,70,5566,3184,431,73.7742,78.3933,11.6067,99.9764
70,71,948,1651,405,82.3448,1.10751,88.8925,99.9184
71,72,1876,1331,439,250.262,31.4851,58.5149,99.9668
72,73,11802,1884,451,218.258,69.5924,20.4076,99.9674
73,74,796,2339,411,245.823,23.9824,66.0176,99.972
74,75,56861,2531,514,57.5907,35.6085,54.3915,99.9553
75,76,4626,273,450,59.0959,30.1527,59.8473,99.988
76,77,75819,2926,609,241.549,45.5165,44.4835,99.982
77,78,8079,3362,450,237.552,39.6705,50.3295,99.9883
78,79,8908,848,465,77.7411,2.5429,87.4571,99.971
79,80,1371,1366,443,249.124,6.190930000000002,83.8091,99.9743
80,81,4694,2719,458,53.8136,7.08564,82.9144,99.9828
81,82,5899,627,493,59.9839,32.4167,57.5833,99.9454
82,83,1152,2336,449,229.75,63.1693,26.8307,99.9975
83,84,2153,3243,462,56.6746,61.0448,28.9552,99.9391
84,85,234993,475,839,248.246,22.5951,67.4049,95.6167
85,86,3141,685,480,235.471,18.5698,71.4302,99.9774
86,87,12425,253,515,65.0809,32.5624,57.4376,71.9369
87,88,2346,1326,488,76.1258,62.0587,27.9413,99.9486
88,89,2960,564,494,241.192,4.42886,85.5711,99.9386
89,90,2792,2805,510,242.347,39.8564,50.1436,99.986
90,91,7107,3338,514,78.5555,77.375,12.625,99.9861
91,92,20798,726,555,57.1188,34.8826,55.1174,99.9814
92,93,1027,521,512,58.6724,42.2657,47.7343,99.9743
93,94,24741,2318,625,244.949,10.9565,79.0435,99.9895
94,95,7801,3257,529,243.74400000000003,25.7758,64.2242,99.9924
95,96,12323,886,584,265.184,7.46457,82.5354,99.8954
96,97,3563,3172,520,203.816,64.1066,25.8934,99.9961
97,98,5767,2744,553,241.747,45.9236,44.0764,99.9869
98,99,748,3423,526,233.718,51.9957,38.0043,99.9556
99,100,561,1860,511,241.191,52.3362,37.6638,99.9758
100,101,5786,1324,567,188.084,74.3302,15.6698,99.9593
101,102,7609,1842,579,63.9526,52.4991,37.5009,99.9557
102,103,22977,1697,598,79.2084,29.1031,60.8969,99.9847
103,104,844,1901,537,246.061,53.1255,36.8745,99.9523
104,105,9867,3368,595,63.947,47.3419,42.6581,99.9502
105,106,1011,537,560,58.2036,30.9099,59.0901,99.9863
106,107,14646,1394,628,240.601,11.7366,78.2634,99.9394
107,108,17513,2128,628,108.676,74.8753,15.1247,99.9771
108,109,38685,1982,682,78.5964,76.3872,13.6128,99.9894
109,110,609,950,568,261.941,3.2940400000000003,86.706,99.9688
110,111,12790,3170,630,85.4374,78.7388,11.2612,99.9022
111,112,747,908,573,78.0391,2.03571,87.9643,99.9973
112,113,1954,2769,600,66.1131,31.1706,58.8294,99.9934
113,114,8832,1209,618,74.2209,4.25821,85.7418,99.9354
114,115,5099,2458,623,220.663,64.8589,25.1411,99.9417
115,116,7721,1100,625,261.328,5.99969,84.0003,99.9928
116,117,26808,2995,720,57.7576,32.9506,57.0494,99.9746
117,118,802,553,594,56.5918,29.0712,60.9288,99.9967
118,119,1150,1038,601,260.522,25.8775,64.1225,99.9981
119,120,97429,1390,762,76.0174,59.3486,30.6514,99.9998
120,121,31075,657,741,112.376,66.8587,23.1413,99.9737
121,122,2386,3278,624,61.5463,18.4017,71.5983,99.9885
122,123,1418,1791,621,231.364,43.1879,46.8121,99.9914
123,124,61477,928,797,61.682,31.7107,58.2893,99.9641
124,125,10952,766,668,250.48,35.9219,54.0781,99.9341
125,126,5832,2588,644,59.8675,25.1386,64.8614,99.9962
126,127,8804,2764,675,55.3914,29.0187,60.9813,99.9629
127,128,1273,2501,649,57.6987,34.9351,55.0649,99.9297
128,129,1936,151,690,81.5951,55.4678,34.5322,99.9868
129,130,1337,1843,659,334.99300000000005,82.1683,7.83166,99.998
130,131,8016,3092,719,233.866,33.2581,56.7419,99.9729
131,132,52393,3314,776,55.5584,78.5096,11.4904,99.9716
132,133,24523,1787,741,68.9701,24.6459,65.3541,99.9853
133,134,1396,3218,666,249.963,66.5146,23.4854,99.9972
134,135,4096,2433,726,65.3397,49.1945,40.8055,99.9756
135,136,12793,1075,809,256.014,37.2274,52.7726,99.8697
136,137,12813,2509,761,78.1159,11.5665,78.4335,99.8796
137,138,9185,1142,721,270.666,12.8987,77.1013,99.987
138,139,2009,2678,704,75.6756,58.0194,31.9806,99.9329
139,140,7948,2611,740,237.647,68.2759,21.7241,99.3985
140,141,1040,988,711,255.4,37.3054,52.6946,99.9726
141,142,3417,2377,726,241.131,20.5411,69.4589,99.9107
142,143,3092,2238,729,68.6071,57.2514,32.7486,99.9224
143,144,6000,2128,760,83.3359,17.8161,72.1839,99.8662
144,145,22107,1628,817,231.588,40.5159,49.4841,99.992
145,146,1228,2178,725,251.292,69.2202,20.7798,99.9968
146,147,1284,2471,737,244.326,12.6021,77.3979,99.99
147,148,3097,2326,763,81.3056,20.0985,69.9015,99.9931
148,149,1469,2689,767,61.2995,3.2783,86.7217,99.9085
149,150,650,755,752,254.497,39.9104,50.0896,99.9973
150,151,4975,1937,793,79.5507,17.6457,72.3543,99.9359
151,152,7357,2257,811,236.503,24.3272,65.6728,99.9884
152,153,1672,2384,783,69.7993,12.1611,77.8389,99.9987
153,154,3778,160,839,241.833,6.15928,83.8407,99.9318
154,155,39763,868,969,249.362,21.5887,68.4113,98.916
155,156,16852,2206,888,80.2253,41.5967,48.4033,99.9862
156,157,16219,2589,873,63.1731,3.09417,86.9058,99.87
157,158,2861,2701,827,241.912,46.0844,43.9156,99.9935
158,159,24585,1814,920,69.0243,9.25882,80.7412,99.9761
159,160,789,2340,813,237.124,21.5644,68.4356,99.9928
160,161,4473,3172,845,233.435,33.6415,56.3585,99.9981
161,162,4239,3111,854,239.587,6.8963899999999985,83.1036,99.9877
162,163,95656,2617,964,32.4119,78.7205,11.2795,61.609
163,164,1513,2584,820,76.3106,11.7878,78.2122,99.8974
164,165,73756,2028,969,252.271,64.154,25.846,99.9643
165,166,46349,3128,943,66.6287,47.3914,42.6086,99.9585
166,167,658,3426,868,51.761,77.4785,12.5215,99.9297
167,168,2312,1880,856,60.8506,26.9455,63.0545,99.9272
168,169,2798,2919,872,77.1775,17.3425,72.6575,99.9863
169,170,837,237,867,55.3077,27.3239,62.6761,99.9748
170,171,33284,1691,980,63.1296,41.3747,48.6253,99.9851
171,172,9581,224,925,63.9768,36.3231,53.6769,99.9893
172,173,14031,1438,920,255.451,43.7127,46.2873,99.8629
173,174,659,1125,896,252.954,44.2715,45.7285,99.9615
174,175,1288,1588,906,64.597,40.1354,49.8646,99.9975
175,176,126262,1121,1130,64.4935,2.92888,87.0711,100.044
176,177,1637,1162,914,245.379,34.6352,55.3648,99.9949
177,178,9729,2956,989,65.2773,32.0377,57.9623,99.9309
178,179,2489,2660,932,200.892,70.6577,19.3423,99.9912
179,180,5132,3383,943,241.693,5.59395,84.4061,99.9825
180,181,708,2362,918,237.13,55.5913,34.4087,99.9917
181,182,713,3148,922,86.1776,76.6712,13.3288,99.9962
182,183,1007,1557,936,65.7881,40.4073,49.5927,99.9948
183,184,5767,1051,959,70.9518,62.1064,27.8936,99.9699
184,185,27526,2300,1015,70.9078,16.1841,73.8159,82.5618
185,186,1588,153,979,245.482,15.1512,74.8488,99.9895
186,187,9730,1496,999,78.5324,73.4338,16.5662,99.8706
187,188,3096,1398,984,87.6792,56.9056,33.0944,99.9508
188,189,98823,3280,1154,60.7415,28.2632,61.7368,99.8379
189,190,2725,187,1018,231.945,52.1772,37.8228,99.8589
190,191,512,801,987,146.34,71.7712,18.2288,99.9892
191,192,1408,209,1011,61.3316,56.7789,33.2211,99.9427
192,193,4327,2897,1039,210.17,70.4247,19.5753,99.9765
193,194,35937,418,1116,63.51,31.7296,58.2704,99.708
194,195,652,2761,1029,59.8013,45.3374,44.6626,99.991
195,196,5519,1407,1050,244.484,37.5806,52.4194,99.9926
196,197,1279,236,1055,61.1368,44.986,45.014,99.9977
197,198,536,1581,1049,84.9452,58.8468,31.1532,99.9949
198,199,25396,2906,1167,54.2933,33.1043,56.8957,99.8524
199,200,1702,1868,1061,233.459,45.5383,44.4617,99.9853
200,201,3191,1497,1089,36.2039,83.0044,6.99563,99.98
201,202,2597,1625,1078,236.11,44.4081,45.5919,99.9483
202,203,13405,2195,1137,251.782,1.78729,88.2127,99.989
203,204,2842,1559,1078,68.7364,71.1923,18.8077,99.9951
204,205,3702,2316,1096,134.286,84.7481,5.25194,99.9911
205,206,1037,2431,1074,221.541,72.8649,17.1351,99.9927
206,207,6407,193,1131,66.2676,55.657,34.343,99.9838
207,208,19010,234,1206,61.6719,43.3119,46.6881,99.9291
208,209,15481,1732,1131,63.7367,25.7609,64.2391,99.9595
209,210,23173,2696,1188,56.3371,33.6269,56.3731,99.9075
210,211,1186,153,1105,60.4384,27.2324,62.7676,99.9949
211,212,9141,2466,1127,230.536,65.5991,24.4009,99.9917
212,213,7290,1407,1117,67.2713,70.7409,19.2591,99.9542
213,214,5508,3028,1142,66.931,25.1644,64.8356,99.9597
214,215,40599,1888,1258,90.1522,76.4174,13.5826,99.9087
215,216,1653,1925,1118,60.3637,56.5371,33.4629,99.9921
216,217,49967,1645,1296,236.799,18.5308,71.4692,99.9053
217,218,3269,2977,1150,69.8042,59.9459,30.0541,99.9447
218,219,29537,2833,1267,69.8204,2.8775,87.1225,99.9548
219,220,26314,2390,1267,242.897,41.7163,48.2837,99.9909
220,221,22974,2032,1199,230.076,17.2994,72.7006,99.9188
221,222,21258,2273,1212,62.0834,2.37416,87.6258,99.9933
222,223,36771,1464,1268,80.0738,70.9792,19.0208,99.9591
223,224,44719,669,1294,248.618,23.4287,66.5713,99.957
224,225,2113,763,1184,250.094,34.6585,55.3415,99.9966
225,226,741,1775,1184,92.9965,73.7753,16.2247,99.9814
226,227,3971,2587,1224,231.539,62.6939,27.3061,99.9654
227,228,4173,2529,1205,81.6798,58.418,31.582,99.9957
228,229,31124,1242,1326,229.391,39.3481,50.6519,99.8856
229,230,5538,284,1220,66.0841,56.029,33.971,99.9912
230,231,22037,3128,1271,234.667,32.0184,57.9816,99.9746
231,232,12962,480,1286,67.1054,39.5949,50.4051,99.9657
232,233,16146,346,1301,88.5308,51.2345,38.7655,99.9879
233,234,3144,546,1249,249.87,22.8145,67.1855,99.9964
234,235,834,1184,1236,243.406,31.7224,58.2776,99.9877
235,236,41879,2519,1354,227.363,66.6467,23.3533,99.9165
236,237,2673,1099,1276,90.1647,76.0684,13.9316,99.9948
237,238,3450,782,1308,242.422,27.814,62.18600000000001,99.9937
238,239,7488,2074,1313,74.0597,11.6141,78.3859,99.9769
239,240,32760,2214,1375,234.663,34.0509,55.9491,99.9922
240,241,34185,3090,1418,34.6339,73.00399999999998,16.996,99.907
241,242,1992,556,1316,137.687,67.5507,22.4493,99.9935
242,243,711,2973,1309,231.46400000000003,57.7036,32.2964,99.9755
243,244,8109,2718,1354,61.9495,35.1343,54.8657,99.9973
244,245,11823,1583,1419,237.662,35.2433,54.7567,99.9822
245,246,23155,1065,1387,250.358,25.6718,64.3282,99.9624
246,247,3027,942,1364,113.311,80.3311,9.66888,99.9586
247,248,14025,3249,1384,225.341,28.5007,61.4993,99.9301
248,249,12512,412,1404,254.012,29.481,60.519,99.9572
249,250,39155,894,1489,255.141,36.0009,53.9991,99.9277
250,251,9182,208,1383,84.7477,71.5884,18.4116,99.9563
251,252,4224,880,1374,259.713,27.8969,62.1031,99.9971
252,253,40634,1846,1442,63.4865,9.4571,80.5429,99.9844
253,254,988,3422,1358,239.941,30.4456,59.5544,99.9892
254,255,1263,2912,1370,55.0427,72.9582,17.0418,99.9869
255,256,7503,1398,1389,242.163,31.9797,58.0203,99.9932
256,257,1481,2957,1374,69.02199999999999,2.83324,87.1668,99.989
257,258,2468,559,1389,260.07,21.0109,68.9891,99.9797
258,259,1062,498,1384,73.2614,32.2235,57.7765,99.9866
259,260,1644,295,1378,247.448,29.8627,60.1373,99.9902
260,261,5111,753,1424,259.529,0.8920520000000001,89.1079,99.9851
261,262,11515,2076,1439,72.6103,35.0436,54.9564,99.9778
262,263,44461,2477,1500,64.3435,62.4609,27.5391,65.0405
263,264,6509,3391,1411,74.3617,68.8709,21.1291,99.9852
264,265,18174,2822,1475,76.2742,35.3254,54.6746,99.9864
265,266,5556,1478,1428,83.9602,62.619,27.381,99.9401
266,267,504,1317,1398,82.87899999999998,61.7721,28.2279,99.9947
267,268,30876,424,1498,261.93,34.6893,55.3107,49.5949
268,269,1799,2945,1429,239.211,54.6873,35.3127,99.9765
269,270,11853,1224,1482,51.4449,58.6198,31.3802,99.9424
270,271,1020,1327,1429,74.4574,78.8112,11.1888,99.9906
271,272,2464,554,1457,259.065,2.11647,87.8835,99.975
272,273,751,942,1424,276.367,18.3724,71.6276,99.9793
273,274,629,2323,1439,65.4077,22.7902,67.2098,99.9943
274,275,10499,3342,1483,61.8281,9.2276,80.7724,99.9821
275,276,1216,594,1455,237.301,26.233,63.767,99.8229
276,277,3408,646,1471,81.3101,0.124084,89.8759,99.9854
277,278,1025,3246,1450,237.992,52.7699,37.2301,99.9955
278,279,11431,3003,1500,231.402,39.6696,50.3304,99.9723
279,280,4127,1314,1492,234.037,40.4544,49.5456,99.9903
280,281,68567,1440,1623,70.5656,51.3145,38.6855,99.9695
281,282,13359,2734,1524,234.605,63.1996,26.8004,99.9624
282,283,6653,1520,1500,240.368,25.8982,64.1018,99.9648
283,284,733,2273,1472,69.9429,4.83258,85.1674,99.9829
284,285,1758,1072,1480,234.276,33.8493,56.1507,99.9909
285,286,1813,2912,1490,35.7984,73.0959,16.9041,99.9733
286,287,17762,673,1562,247.377,23.6289,66.3711,98.3218
287,288,9799,2160,1527,232.823,67.7551,22.2449,99.855
288,289,2158,208,1506,74.7766,53.4389,36.5611,64.569
289,290,10548,3177,1564,63.0793,40.0353,49.9647,99.9853
290,291,1172,3419,1511,57.1878,20.2448,69.7552,99.9847
291,292,25017,1050,1600,250.243,14.2441,75.7559,99.9539
292,293,24067,1993,1626,64.8592,7.1608800000000015,82.8391,75.2293
293,294,1128,2667,1539,77.6138,38.0326,51.9674,99.9444
294,295,1274,277,1524,246.163,15.8496,74.1504,99.9821
295,296,8204,3284,1586,59.4372,17.1394,72.8606,99.9692
296,297,50813,406,1692,243.635,3.25902,86.741,99.9678
297,298,17260,1875,1583,55.1902,36.8208,53.1792,99.9907
298,299,19130,1223,1635,240.817,22.9218,67.0782,99.8407
299,300,7032,1726,1569,73.9739,67.9604,22.0396,99.9625
300,301,25690,238,1635,251.661,30.6594,59.3406,99.9476
301,302,50090,2870,1696,57.2273,19.647,70.35300000000001,99.9783
302,303,19502,812,1625,254.208,23.4019,66.5981,99.9525
303,304,9904,3378,1585,73.5857,57.9261,32.0739,98.7641
304,305,2381,3067,1563,234.764,55.1291,34.8709,99.3559
305,306,1452,1135,1566,50.28100000000001,57.6249,32.3751,99.9796
306,307,1613,1170,1577,42.0511,48.0936,41.9064,99.9686
307,308,2189,1632,1572,55.2676,21.2688,68.7312,99.9357
308,309,10790,2556,1612,73.2663,15.2485,74.7515,99.9309
309,310,6758,586,1623,254.6,6.7493300000000005,83.2507,99.668
310,311,8002,2226,1609,254.634,1.8399,88.1601,99.9973
311,312,9545,2730,1611,63.966,2.2672,87.7328,99.8913
312,313,18617,2094,1676,77.3146,10.5603,79.4397,99.981
313,314,33223,2379,1658,39.4068,75.2071,14.7929,99.9719
314,315,1983,3080,1608,241.891,60.6892,29.3108,99.9955
315,316,2281,717,1612,257.93,9.76622,80.2338,99.9975
316,317,4336,3244,1660,229.981,42.1268,47.8732,99.951
317,318,8410,532,1680,248.487,16.6712,73.3288,99.8189
318,319,26009,3008,1733,254.509,13.3429,76.6571,50.3456
319,320,7078,1695,1639,47.6613,71.4412,18.5588,99.9955
320,321,1062,1807,1633,68.4757,25.8856,64.1144,99.9541
321,322,1486,156,1648,69.5656,8.3697,81.6303,99.89
322,323,7035,3143,1657,230.69,45.1021,44.8979,99.9926
323,324,12351,2582,1702,64.1044,21.9598,68.0402,99.9959
324,325,733,2735,1643,238.834,45.2576,44.7424,99.9531
325,326,1637,904,1653,240.285,11.0082,78.9918,99.9065
326,327,5184,2198,1676,71.1679,48.4154,41.5846,99.9398
327,328,524,3396,1655,86.177,66.7066,23.2934,99.9944
328,329,2323,3323,1663,62.6649,16.7778,73.2222,99.9807
329,330,10662,2646,1763,237.797,47.44600000000001,42.554,99.9765
330,331,1401,1786,1662,59.0052,20.6448,69.3552,99.9753
331,332,998,1637,1667,52.6949,23.6519,66.3481,99.9889
332,333,21403,909,1774,253.281,13.2094,76.7906,99.9913
333,334,6467,2713,1719,64.1419,1.33372,88.6663,99.9959
334,335,6734,1096,1696,247.284,2.79771,87.2023,99.9994
335,336,7968,1274,1733,234.621,37.7287,52.2713,99.9426
336,337,39789,703,1781,79.8623,11.4729,78.5271,99.8871
337,338,1742,754,1690,257.965,9.79811,80.2019,99.9975
338,339,1726,1856,1680,255.21,80.6109,9.38912,99.9124
339,340,29979,3370,1791,52.3452,24.1906,65.8094,99.9831
340,341,1930,1707,1698,243.634,20.4904,69.5096,99.9805
341,342,2427,3166,1709,243.013,5.56344,84.4366,99.9903
342,343,922,1018,1708,219.805,51.6777,38.3223,99.9439
343,344,20172,1587,1763,139.423,80.7816,9.2184,99.9741
344,345,582,1762,1706,247.279,19.0323,70.9677,99.9929
345,346,71962,1883,1889,247.48,45.6399,44.3601,99.4947
346,347,4510,189,1743,77.5784,74.0561,15.9439,99.9741
347,348,2270,2270,1734,65.744,45.3999,44.6001,99.9914
348,349,43222,3211,1843,59.6944,67.2789,22.7211,99.9769
349,350,632,1800,1715,290.619,80.5084,9.4916,99.9984
350,351,2361,308,1758,250.301,7.448410000000001,82.5516,99.9767
351,352,1386,3106,1740,46.0612,59.1359,30.8641,99.9835
352,353,980,2162,1728,68.3414,23.212,66.788,99.9723
353,354,11291,1737,1780,89.3495,65.8911,24.1089,99.9884
354,355,4694,2511,1767,74.733,46.5307,43.4693,99.9906
355,356,8416,1015,1776,251.262,0.666908,89.3331,99.9886
356,357,12739,2205,1807,71.1709,22.4447,67.5553,99.9262
357,358,4757,1125,1769,249.178,15.125,74.875,99.999
358,359,39061,2359,1877,73.4416,26.7683,63.2317,99.9875
359,360,12739,2490,1892,76.2619,60.5113,29.4887,99.8588
360,361,6787,3058,1829,74.7792,20.1015,69.8985,99.9875
361,362,10591,1248,1817,233.611,11.1552,78.8448,99.9872
362,363,1444,2025,1785,64.8067,3.88763,86.1124,99.9943
363,364,5062,256,1823,70.5524,39.6448,50.3552,99.9807
364,365,4925,175,1820,251.044,33.3683,56.6317,99.9766
365,366,17129,2105,1861,229.072,80.9597,9.04031,99.9499
366,367,24430,567,1936,240.411,30.3541,59.6459,99.9566
367,368,288200,1532,2233,236.659,25.0755,64.9245,82.3069
368,369,9621,1097,1844,231.604,29.432,60.56800000000001,99.9925
369,370,5347,2555,1832,65.9918,19.4489,70.5511,99.9862
370,371,1133,1337,1820,84.1713,73.5022,16.4978,99.9971
371,372,23573,329,1942,253.378,33.2342,56.7658,99.8488
372,373,19636,2708,1910,249.16,51.3231,38.6769,99.1847
373,374,1152,1531,1819,67.434,19.3754,70.6246,99.9617
374,375,12029,935,1948,243.22,18.3186,71.6814,97.0137
375,376,1451,503,1839,231.815,10.7528,79.2472,99.9861
376,377,2242,1564,1851,55.4027,14.182,75.818,99.996
377,378,4991,1184,1874,239.267,30.4632,59.5368,99.9843
378,379,4682,432,1869,228.022,44.3351,45.6649,99.9879
379,380,12468,2847,1883,71.3914,47.9341,42.0659,99.9233
380,381,812,205,1858,123.87,77.1281,12.8719,99.9931
381,382,8585,1309,1897,62.0636,30.8709,59.1291,99.8678
382,383,2609,1613,1866,237.415,8.13631,81.8637,99.9887
383,384,12117,1046,1924,221.293,71.6836,18.3164,99.9631
384,385,1971,2588,1872,69.0809,16.9046,73.0954,99.9503
385,386,1996,3075,1874,67.7764,2.84694,87.1531,99.996
386,387,82131,789,2043,71.8378,17.7848,72.2152,99.9711
387,388,617,272,1869,224.38,41.81800000000001,48.182,99.9987
388,389,1360,841,1880,82.9062,8.2291,81.7709,99.9922
389,390,1191,809,1881,232.234,49.7193,40.2807,99.9921
390,391,10488,455,1951,59.6988,1.30003,88.7,99.8457
391,392,995,1640,1892,69.8167,34.4063,55.5937,99.9963
392,393,14069,196,1958,252.342,15.0562,74.9438,99.9468
393,394,1031,876,1909,245.927,9.21969,80.7803,99.9905
394,395,9169,2231,1949,220.225,70.51100000000002,19.489,99.9935
395,396,2739,2598,1925,71.0727,18.8572,71.1428,99.9819
396,397,2968,3353,1939,60.5366,11.2875,78.7125,99.9865
397,398,21943,3000,1982,48.6033,54.3274,35.6726,99.9226
398,399,23630,2090,2006,72.5786,32.7149,57.2851,99.9713
399,400,821,2913,1932,69.3229,48.0819,41.9181,99.9369
400,401,1553,1609,1946,70.6934,34.5993,55.4007,99.9821
401,402,12029,1210,1982,74.5964,71.5454,18.4546,99.8568
402,403,868,1240,1942,234.533,12.3016,77.6984,99.9752
403,404,2716,2618,1961,74.998,11.5759,78.4241,99.9859
404,405,867,3416,1951,241.977,19.8101,70.1899,99.9956
405,406,1189,2830,1957,238.919,59.4625,30.5375,99.9828
406,407,47341,3160,2099,234.52,13.036,76.964,89.5574
407,408,15092,3374,2057,237.257,59.8827,30.1173,99.948
408,409,7979,3275,2006,236.841,52.3637,37.6363,99.9413
409,410,63966,2683,2078,250.682,11.6973,78.3027,51.7281
410,411,2742,2867,1990,240.234,59.2394,30.7606,99.9821
411,412,552,1306,1976,62.5439,70.3493,19.6507,99.9826
412,413,5131,1338,2028,50.5919,69.9337,20.0663,99.8962
413,414,1176,985,1995,246.818,58.6809,31.3191,99.9844
414,415,2794,2501,2002,62.944,49.3252,40.6748,99.9894
415,416,1851,1051,2001,57.342,79.7666,10.2334,99.9628
416,417,1823,2321,2021,67.388,45.3507,44.6493,99.9923
417,418,11369,1156,2040,69.7178,7.48566,82.5143,99.996
418,419,1859,501,2022,238.087,0.154678,89.8453,99.9666
419,420,3276,2265,2021,236.363,50.3062,39.6938,99.9915
420,421,4211,1030,2053,243.896,47.9121,42.0879,99.9944
421,422,940,453,2037,240.302,30.8977,59.1023,99.9843
422,423,922,254,2034,259.941,0.131828,89.8682,99.909
423,424,9048,2169,2092,67.4799,4.3139,85.6861,99.992
424,425,2337,2366,2049,242.824,64.0354,25.9646,99.9695
425,426,3641,299,2073,252.098,8.62337,81.3766,99.9888
426,427,8596,191,2090,256.764,24.1187,65.8813,99.9918
427,428,47468,2007,2193,237.38,24.0966,65.9034,99.9535
428,429,553,3292,2064,234.423,11.9233,78.0767,99.9775
429,430,2105,387,2069,65.8712,1.32379,88.6762,99.9981
430,431,2967,416,2102,248.503,28.7534,61.2466,99.8512
431,432,1473,1274,2067,58.6883,15.1152,74.8848,99.9977
432,433,6077,485,2093,248.596,63.0897,26.9103,99.9851
433,434,2536,1202,2090,237.56,71.1739,18.8261,99.9894
434,435,32664,2306,2166,65.5426,6.662089999999999,83.3379,99.9403
435,436,14868,1863,2164,50.6166,48.3814,41.6186,99.9935
436,437,6055,1070,2133,236.085,47.9716,42.0284,99.983
437,438,3081,1336,2107,85.3162,74.3724,15.6276,99.9983
438,439,21273,2956,2209,66.1256,5.39321,84.6068,99.9466
439,440,1515,556,2100,253.247,30.6719,59.3281,99.9803
440,441,40235,576,2238,242.071,21.6896,68.3104,99.9727
441,442,721,341,2101,82.4818,11.9611,78.0389,99.9822
442,443,590,2887,2102,66.1195,38.3405,51.6595,99.9869
443,444,5584,2564,2133,63.6024,32.6407,57.3593,99.9122
444,445,623,1117,2108,235.256,47.9657,42.0343,99.9938
445,446,6615,1233,2137,233.963,37.6097,52.3903,99.7155
446,447,3764,2907,2142,75.7669,56.1123,33.8877,99.9839
447,448,19922,233,2211,68.5041,4.67199,85.32799999999997,99.9687
448,449,12401,422,2197,69.3054,5.10599,84.89399999999998,99.9727
449,450,808,296,2141,86.0943,10.4765,79.5235,99.9689
450,451,6923,3383,2160,54.3917,3.68339,86.3166,99.9696
451,452,558,2176,2134,236.71,65.8791,24.1209,99.9902
452,453,11664,2437,2201,215.435,63.8154,26.1846,99.991
453,454,38659,2630,2282,233.107,17.8717,72.1283,99.9814
454,455,1238,338,2162,85.1274,9.08521,80.9148,99.988
455,456,13727,3306,2235,59.1269,19.6348,70.3652,99.9885
456,457,30687,1241,2225,237.627,70.925,19.075,99.9834
457,458,7819,704,2204,252.467,17.2157,72.7843,99.9972
458,459,2054,2521,2187,76.232,49.0064,40.9936,99.9925
459,460,36693,914,2255,234.912,36.1566,53.8434,99.9813
460,461,9031,3115,2232,237.255,53.0202,36.9798,99.9296
461,462,3323,2840,2214,230.349,18.2375,71.7625,99.9961
462,463,13506,2159,2268,226.469,65.2302,24.7698,99.9824
463,464,1233,358,2214,76.7602,16.9549,73.0451,99.9952
464,465,4846,323,2252,77.333,12.5095,77.4905,99.9886
465,466,662,3029,2228,230.916,22.5746,67.4254,99.9376
466,467,1805,2266,2246,213.311,66.946,23.054,99.9939
467,468,3337,2228,2284,63.7563,7.2843300000000015,82.7157,99.9963
468,469,15817,2807,2305,66.0185,2.08581,87.9142,99.9799
469,470,15459,737,2325,63.1287,71.0681,18.9319,99.972
470,471,5343,174,2305,244.378,5.84954,84.1505,99.9592
471,472,1813,1103,2257,237.27,12.2474,77.7526,99.9976
472,473,1039,2894,2245,244.047,0.672134,89.3279,99.9885
473,474,5479,3389,2274,67.0292,22.2097,67.7903,99.9863
474,475,8654,2523,2340,68.9553,7.777439999999999,82.2226,99.8966
475,476,7304,1764,2290,64.7386,55.1862,34.8138,99.986
476,477,20831,1844,2353,63.4849,17.7837,72.2163,99.815
477,478,26865,451,2375,81.524,11.4837,78.5163,99.8568
478,479,5434,3063,2315,61.6595,4.48372,85.5163,99.9346
479,480,824,1862,2267,70.0586,67.2166,22.7834,99.9987
480,481,42790,3174,2409,62.8508,21.5356,68.4644,99.9798
481,482,63226,999,2478,65.2489,55.047,34.953,75.4569
482,483,42804,266,2439,246.823,2.81787,87.1821,99.9054
483,484,2797,2458,2330,231.246,69.6979,20.3021,99.9806
484,485,20032,2389,2384,74.9212,32.3757,57.6243,99.881
485,486,2998,3025,2358,227.609,50.7535,39.2465,99.7929
486,487,11673,3373,2355,74.1509,56.5314,33.4686,99.9358
487,488,1072,2258,2329,214.538,67.4316,22.5684,99.9983
488,489,18921,2208,2404,236.581,24.0859,65.9141,99.7742
489,490,9127,1666,2397,73.5288,51.9064,38.0936,99.9919
490,491,63734,1983,2478,70.7425,41.0815,48.9185,99.9291
491,492,804,1705,2345,35.0397,69.6304,20.3696,99.9957
492,493,541,251,2351,238.753,15.6204,74.3796,99.9906
493,494,8377,857,2389,235.966,58.9364,31.0636,99.9916
494,495,633,2974,2350,227.491,18.0765,71.9235,99.9369
495,496,12786,2779,2402,78.7406,48.5586,41.4414,99.9868
496,497,2327,3271,2375,67.2604,61.9032,28.0968,99.9909
497,498,3091,2901,2391,230.829,19.579,70.421,99.9969
498,499,36758,2978,2497,69.6768,3.7544,86.2456,99.9203
499,500,6938,1558,2424,68.9511,54.4894,35.5106,99.6645
500,501,7764,606,2400,252.915,24.6529,65.3471,99.9816
501,502,660,1174,2376,241.306,71.7478,18.2522,99.9933
502,503,901,3337,2395,76.9901,57.0564,32.9436,99.9746
503,504,605,1611,2397,64.8272,73.032,16.968,99.9979
504,505,4924,1274,2405,238.989,71.2247,18.7753,99.9912
505,506,185669,2673,2755,241.579,4.2748,85.7252,99.618
506,507,3206,2332,2422,234.037,20.0599,69.9401,99.9919
507,508,28766,1157,2519,60.6013,31.8074,58.1926,99.8714
508,509,941,3301,2412,64.9018,20.1217,69.8783,99.9862
509,510,134213,614,2706,72.5139,1.47424,88.5258,99.8868
510,511,62956,3212,2634,214.305,53.2039,36.7961,66.2134
511,512,1721,1334,2436,48.7149,76.3191,13.6809,99.9938
512,513,28636,805,2526,253.618,11.8399,78.1601,99.9312
513,514,1152,1786,2442,61.272,48.1461,41.8539,99.9963
514,515,1459,2284,2453,72.0265,41.4473,48.5527,99.9892
515,516,1797,3301,2463,78.3517,57.1607,32.8393,99.9698
516,517,2317,1803,2480,63.4892,13.4962,76.5038,99.9878
517,518,41813,2762,2556,60.8841,9.53669,80.4633,99.9086
518,519,1961,3412,2530,243.072,13.0802,76.9198,99.9722
519,520,9458,2349,2502,74.2939,53.908,36.092,99.966
520,521,14908,428,2568,261.757,17.6271,72.3729,99.9721
521,522,1024,1061,2476,227.617,56.6835,33.3165,99.9914
522,523,21136,2215,2560,66.6266,8.73475,81.2653,99.8306
523,524,25840,281,2619,76.4649,6.38357,83.6164,99.8589
524,525,3332,1772,2565,261.341,67.2055,22.7945,99.9665
525,526,9623,1438,2609,245.711,25.9187,64.0813,51.3294
526,527,535,3128,2549,47.4781,54.0046,35.9954,99.9907
527,528,546,169,2556,243.225,4.09585,85.9042,99.9583
528,529,2977,1078,2608,60.12600000000001,23.6135,66.3865,99.809
529,530,589,1254,2561,65.9768,13.6604,76.3396,99.9896
530,531,708,3428,2588,246.092,13.151,76.84899999999998,99.976
531,532,691,515,2577,78.5819,8.665569999999999,81.3344,99.8594
532,533,567,2324,2571,62.0895,35.3816,54.6184,99.9903
533,534,250520,1937,2932,56.9257,18.7923,71.2077,68.0304
534,535,3564,1273,2606,63.886,28.1845,61.8155,99.9743
535,536,6099,2875,2644,244.172,6.46972,83.5303,99.8941
536,537,1121,3391,2601,66.1885,2.23535,87.7646,99.9917
537,538,573,1232,2597,67.3501,11.6382,78.3618,99.9915
538,539,502,154,2607,74.1555,75.3155,14.6845,99.9665
539,540,589,1722,2598,46.7541,65.7925,24.2075,99.9854
540,541,828,3352,2601,244.479,12.4182,77.5818,99.9651
541,542,13641,2994,2662,83.8883,66.4768,23.5232,99.9031
542,543,16813,1237,2673,67.5295,13.2476,76.7524,99.9222
543,544,2281,2294,2633,226.971,79.0344,10.9656,99.9767
544,545,1866,1716,2637,254.968,71.22,18.78,99.9722
545,546,18309,3355,2698,211.086,76.7699,13.2301,99.8522
546,547,810,1052,2659,66.3441,16.2433,73.7567,99.9713
547,548,14440,1748,2747,67.9267,2.43468,87.5653,99.9745
548,549,44481,1417,2729,109.495,85.1139,4.88612,95.2897
549,550,20261,2276,2739,67.14,19.6544,70.3456,99.9592
550,551,989,2689,2662,62.3797,20.4611,69.5389,99.9849
551,552,4749,821,2690,250.305,15.1913,74.8087,99.9758
552,553,3524,1043,2710,218.549,28.8203,61.1797,99.9587
553,554,20316,2885,2764,85.316,64.2762,25.7238,99.9512
554,555,3482,316,2715,240.511,23.9819,66.0181,99.9698
555,556,1564,2710,2707,62.8593,22.3241,67.6759,99.9976
556,557,27895,977,2769,61.7708,21.6071,68.3929,99.9896
557,558,558,258,2707,245.631,6.576510000000002,83.4235,98.5117
558,559,13282,3254,2769,248.75,20.9069,69.0931,99.9681
559,560,1828,847,2741,235.478,58.684,31.316,99.828
560,561,7972,1661,2778,239.533,4.15477,85.8452,99.9534
561,562,594,386,2729,74.3047,13.6419,76.3581,99.9953
562,563,3022,194,2759,190.852,83.1839,6.816110000000001,99.9823
563,564,21665,404,2853,76.5139,9.30419,80.6958,99.6603
564,565,187964,1397,3093,233.719,2.88184,87.1182,69.8043
565,566,879,814,2758,245.814,55.778,34.222,99.9634
566,567,1511,279,2762,69.7625,19.4072,70.5928,99.9987
567,568,4203,168,2821,75.2034,23.7758,66.2242,99.9644
568,569,583,1114,2764,220.432,28.6925,61.3075,99.9715
569,570,8291,3032,2833,59.3152,22.2977,67.7023,99.9845
570,571,4197,308,2812,243.21400000000003,3.30426,86.6957,99.9923
571,572,4054,242,2819,222.52,73.1029,16.8971,99.9888
572,573,517,1706,2796,64.6991,29.1862,60.8138,99.9828
573,574,6710,3363,2826,218.955,60.2309,29.7691,99.9314
574,575,5331,2228,2828,237.205,38.7471,51.2529,99.9915
575,576,13317,840,2872,99.6115,80.6534,9.34665,99.9973
576,577,4138,1603,2819,83.7191,84.2212,5.77876,99.9858
577,578,2785,501,2849,228.425,65.4379,24.5621,99.7357
578,579,1379,2341,2813,221.711,77.3289,12.6711,99.9985
579,580,49312,2515,2906,246.482,22.1974,67.8026,99.7943
580,581,6886,3404,2905,85.1265,77.99600000000002,12.004,99.9607
581,582,5954,3218,2865,49.657,21.3799,68.6201,99.9681
582,583,35350,1023,2953,69.7944,23.64,66.36,99.93
583,584,6626,750,2892,65.7937,11.9185,78.0815,99.881
584,585,3662,3290,2864,109.103,80.9892,9.01077,99.9977
585,586,3059,2320,2881,73.1732,19.9502,70.0498,99.9916
586,587,13968,220,2921,74.5542,2.36899,87.631,99.9854
587,588,6685,3161,2911,222.518,59.5707,30.4293,99.9918
588,589,1626,1098,2895,228.011,60.8636,29.1364,99.9975
589,590,4081,1650,2883,71.895,74.1157,15.8843,99.9695
590,591,15053,1589,2946,77.7736,85.6424,4.35757,99.9876
591,592,6565,2250,2900,66.9674,19.0852,70.9148,99.99
592,593,1909,2164,2896,235.712,36.3564,53.6436,99.9668
593,594,2891,308,2918,251.034,11.3261,78.6739,99.9581
594,595,2013,3273,2916,241.342,32.1495,57.8505,99.9908
595,596,1534,3327,2929,96.5802,77.2668,12.7332,99.9889
596,597,2925,2167,2947,230.799,29.8789,60.1211,99.9498
597,598,5867,480,2968,247.652,13.8372,76.1628,99.9546
598,599,2819,2762,2946,64.4019,8.626339999999999,81.3737,99.9936
599,600,826,3362,2950,242.24400000000003,29.7472,60.2528,99.9401
600,601,1616,2319,2945,219.536,77.1517,12.8483,99.9963
601,602,50613,3267,3093,51.5631,12.2648,77.7352,99.7215
602,603,3765,383,2970,251.625,12.2631,77.7369,99.9161
603,604,3224,1134,2977,211.024,70.4437,19.5563,99.993
604,605,6650,2230,2997,63.8193,15.9358,74.0642,99.4772
605,606,6474,2658,2983,242.23,40.9871,49.0129,99.9578
606,607,35236,710,3083,68.2168,11.9125,78.0875,99.8539
607,608,1231,2299,2975,248.117,16.4314,73.5686,99.9727
608,609,543,1167,2971,228.259,67.8336,22.1664,99.7038
609,610,2424,2815,2982,231.003,73.7869,16.2131,99.9826
610,611,713,870,2970,66.7978,22.7006,67.2994,99.9756
611,612,17653,312,3039,51.5806,65.6761,24.3239,99.9839
612,613,2276,2351,2985,192.933,77.3699,12.6301,99.9973
613,614,3722,3141,3006,90.8105,60.1834,29.8166,99.9676
614,615,1891,701,2984,239.36,58.1353,31.8647,99.9904
615,616,5262,835,3038,66.5991,21.6198,68.3802,99.8222
616,617,3571,3406,3008,65.2264,8.22183,81.7782,99.929
617,618,114855,2897,3248,63.8908,16.5975,73.4025,99.4466
618,619,6352,185,3025,256.526,41.9001,48.0999,99.9449
619,620,6525,1812,3027,60.2975,58.3928,31.6072,99.9507
620,621,2261,2817,3032,244.642,6.3735300000000015,83.6265,99.9887
621,622,4506,2570,3043,62.3055,17.906,72.094,99.7295
622,623,24531,931,3104,225.349,69.89399999999999,20.106,99.4177
623,624,3797,2166,3051,216.205,64.479,25.521,99.9908
624,625,61798,2388,3145,65.4068,17.6137,72.3863,96.3556
625,626,43557,513,3138,237.486,28.4771,61.5229,99.9762
626,627,1036,2507,3027,144.064,76.55,13.45,99.9722
627,628,5492,3386,3071,95.2686,74.7694,15.2306,99.944
628,629,595,2257,3030,217.393,65.1728,24.8272,99.9879
629,630,1693,1692,3046,218.498,47.7425,42.2575,99.9632
630,631,11056,3084,3102,60.0335,20.5291,69.4709,99.968
631,632,5664,2547,3116,240.429,0.639397,89.3606,99.9303
632,633,17165,1662,3140,54.2462,6.25764,83.7424,99.9859
633,634,1134,1185,3074,70.8982,74.8912,15.1088,99.9799
634,635,25039,1300,3154,58.7301,39.9207,50.0793,99.9743
635,636,545,2906,3084,237.533,41.0587,48.9413,99.9942
636,637,18613,2123,3150,69.1416,21.7854,68.2146,99.9471
637,638,2328,175,3113,246.824,7.3002,82.6998,99.9482
638,639,10588,1163,3145,240.546,25.662,64.33800000000001,99.971
639,640,2566,1543,3103,64.3734,69.7291,20.2709,99.9842
640,641,508,3160,3100,76.9759,57.1909,32.8091,99.9948
641,642,11602,2934,3141,63.7547,28.462,61.538,99.9583
642,643,54308,391,3274,252.245,58.5901,31.4099,99.9646
643,644,1568,221,3135,228.835,60.5681,29.4319,99.9875
644,645,1217,2614,3126,242.183,38.2651,51.7349,99.968
645,646,2746,1528,3136,41.9789,74.9495,15.0505,99.9962
646,647,1507,3424,3167,69.4478,19.2305,70.7695,99.983
647,648,958,1057,3144,60.9696,57.6381,32.3619,99.9918
648,649,16736,216,3232,60.744,19.0324,70.9676,99.9334
649,650,32644,834,3260,235.956,29.8971,60.1029,99.9382
650,651,764,1093,3157,214.674,72.1474,17.8526,99.9898
651,652,1575,660,3181,56.8543,28.1465,61.8535,99.9861
652,653,28884,2611,3285,268.115,82.2935,7.70648,99.9721
653,654,888,1000,3172,57.2292,56.8336,33.1664,99.9967
654,655,1363,2984,3186,67.7783,21.2208,68.7792,99.9936
655,656,63738,1075,3310,62.9215,13.6725,76.3275,99.777
656,657,4932,1597,3229,213.477,79.4446,10.5554,99.9883
657,658,9721,2919,3247,248.117,71.446,18.554,99.9896
658,659,83153,2230,3371,134.011,78.8514,11.1486,99.9748
659,660,11842,3361,3255,196.423,72.583,17.417,99.9939
660,661,1099,1708,3229,237.909,14.8543,75.1457,99.9892
661,662,6647,3247,3265,234.147,59.1737,30.8263,99.9843
662,663,16427,626,3305,51.181,62.576,27.424,99.9606
663,664,7029,2403,3286,69.9852,34.2142,55.7858,99.9431
664,665,1347,718,3253,72.1973,10.5205,79.4795,99.9964
665,666,6294,1669,3291,67.5739,4.8839,85.1161,99.993
666,667,70406,3282,3446,54.238,9.43926,80.5607,99.9833
667,668,1410,950,3299,56.3563,57.0401,32.9599,99.9581
668,669,1008,1885,3297,67.9491,23.0921,66.9079,99.9744
669,670,878,212,3305,244.21400000000003,31.9026,58.0974,99.9973
670,671,17563,676,3397,67.8551,18.9577,71.0423,99.789
671,672,2376,1739,3315,226.981,71.4566,18.5434,99.9889
672,673,100556,1820,3446,63.4575,31.4654,58.5346,99.9621
673,674,7900,178,3363,245.941,64.232,25.768,99.9718
674,675,7747,1240,3368,67.5983,1.76653,88.2335,99.8887
675,676,6668,273,3356,63.2537,22.8537,67.1463,99.9635
676,677,2772,3186,3351,81.6077,74.3006,15.6994,99.9977
677,678,3778,2466,3393,136.003,86.225,3.77502,99.9499
678,679,53516,2892,3530,74.7377,51.489,38.511,99.8428
679,680,5871,1553,3388,66.8408,31.3402,58.6598,99.9766
680,681,11879,1311,3406,60.0837,39.0457,50.9543,99.9946
681,682,62878,781,3502,237.954,20.9021,69.0979,69.1293
682,683,2250,2413,3377,73.7836,52.4338,37.5662,99.987
683,684,4056,2553,3391,70.8987,36.7637,53.2363,99.9766
684,685,7060,517,3423,71.7378,18.6615,71.3385,99.9705
685,686,719,2721,3403,211.407,66.385,23.615,99.9357
686,687,3686,213,3427,227.922,58.0441,31.9559,99.9908
687,688,568,439,3402,69.2287,19.7525,70.2475,99.9877
688,689,13894,1143,3474,238.879,63.4863,26.5137,99.9153
689,690,5264,298,3438,229.457,37.03,52.97,99.9346
690,691,10886,2590,3441,65.2844,13.3648,76.6352,99.9714
691,692,9359,2050,3502,248.87,3.82835,86.1717,99.9638
692,693,1729,1070,3436,207.945,78.2047,11.7954,99.9958
693,694,53618,2730,3586,69.4311,15.7258,74.2742,99.9576
694,695,10120,3038,3478,229.854,63.9266,26.0734,99.9861
695,696,6489,460,3498,247.315,18.739,71.26100000000002,99.9114
696,697,16037,1593,3517,62.7196,21.8643,68.1357,99.752
697,698,14908,2428,3517,76.7477,53.4491,36.5509,99.8217
698,699,9866,1040,3542,53.9133,27.4883,62.5117,99.8669
699,700,5343,951,3510,202.239,77.5043,12.4957,99.9103
700,701,593,2113,3461,58.756,4.9585300000000005,85.0415,99.9921
701,702,8867,198,3502,66.3996,33.5108,56.4892,99.9519
702,703,500,1216,3470,237.18400000000003,9.38416,80.6158,99.9907
703,704,44795,1250,3590,64.4374,37.7507,52.2493,99.9854
704,705,4684,2523,3501,125.313,84.249,5.75098,99.9747
705,706,5970,2108,3541,239.723,31.1751,58.8249,99.9701
706,707,22678,405,3595,214.411,80.8164,9.18363,51.71100000000001
707,708,59490,3109,3692,68.8306,15.513,74.487,99.8667
708,709,2417,2325,3546,65.1569,1.50154,88.4985,99.988
709,710,2596,525,3554,61.6515,32.1659,57.8341,99.9773
710,711,4596,256,3561,86.6825,84.7001,5.2999,99.992
711,712,16758,3367,3622,60.6442,3.07058,86.9294,99.9792
712,713,844,2177,3558,63.0796,39.9544,50.0456,99.9923
713,714,40351,1524,3658,61.3781,19.5759,70.4241,99.9795
714,715,21417,2191,3616,59.2097,4.59927,85.4007,99.9807
715,716,3162,872,3618,233.86900000000003,28.9194,61.0806,99.9632
716,717,18181,782,3636,63.4363,7.68128,82.3187,99.9962
717,718,4390,161,3632,62.1924,7.29543,82.7046,99.9824
718,719,1262,388,3592,227.737,40.2726,49.7274,97.8893
719,720,3975,227,3612,63.8059,29.7871,60.2129,99.9352
720,721,2331,2390,3590,250.457,83.7464,6.25365,99.9972
721,722,34351,2724,3715,83.8103,54.8407,35.1593,99.9668
722,723,4251,3254,3625,62.1672,44.5469,45.4531,99.9215
723,724,6496,548,3629,75.9366,27.3202,62.6798,99.9729
724,725,7853,1990,3621,63.6945,39.3483,50.6517,99.9496
725,726,5021,2482,3613,12.467,88.2462,1.7537900000000002,99.9865
726,727,22931,1758,3674,67.1328,46.5793,43.4207,99.9726
727,728,2745,1662,3614,53.0635,77.3806,12.6194,99.9962
728,729,3226,2347,3629,69.7944,17.3085,72.6915,99.9971
729,730,3228,680,3634,214.362,81.7091,8.29093,99.9948
730,731,1785,1052,3648,63.1219,4.78503,85.215,99.9697
731,732,968,366,3628,223.142,34.1394,55.8606,99.9609
732,733,5752,2570,3672,229.342,20.0476,69.9524,99.9874
733,734,1010,639,3646,74.6675,22.749,67.251,99.9122
734,735,15764,321,3686,64.5783,18.1476,71.8524,99.9345
735,736,32254,2435,3736,77.832,61.6101,28.3899,96.8067
736,737,2753,962,3653,53.2089,31.3552,58.6448,99.9642
737,738,1864,1979,3669,73.9191,5.80481,84.1952,99.9912
738,739,6665,1304,3686,241.21400000000003,6.43294,83.5671,99.9874
739,740,2588,219,3692,245.449,1.22948,88.7705,99.9953
740,741,33562,1847,3780,27.4864,85.1964,4.80359,99.9092
741,742,9972,607,3731,92.6103,71.9078,18.0922,99.9444
742,743,1260,2065,3676,234.30900000000003,1.78719,88.2128,99.9846
743,744,2933,2508,3682,242.49,22.6579,67.3421,99.9712
744,745,32731,2215,3796,241.067,40.129,49.871,99.9101
745,746,97534,979,3992,85.1446,56.8412,33.1588,17.9643
746,747,967,660,3685,278.23900000000003,87.0028,2.99722,99.9943
747,748,15177,3303,3778,234.823,27.6421,62.3579,99.9928
748,749,623,1018,3685,70.2932,22.0912,67.9088,99.9962
749,750,1448,542,3708,96.9582,70.1257,19.8743,99.9891
750,751,3278,1376,3731,237.37,23.6028,66.3972,99.9543
751,752,6376,1211,3725,67.4765,61.1508,28.8492,99.9655
752,753,1991,2123,3719,49.6265,15.799,74.20100000000002,99.9954
753,754,26132,757,3781,68.126,13.9254,76.0746,99.9917
754,755,2337,2605,3736,248.901,19.0158,70.9842,99.9473
755,756,3428,3366,3724,56.4553,58.2893,31.7107,99.9455
756,757,2628,170,3720,236.117,28.6914,61.3086,99.9866
757,758,4580,2071,3738,56.8838,74.9228,15.0772,99.9141
758,759,2515,1993,3721,59.38399999999999,52.5252,37.4748,99.9343
759,760,513,839,3723,147.134,81.5433,8.45675,99.9935
760,761,1567,384,3753,62.8615,30.0914,59.9086,99.9767
761,762,1602,465,3735,242.117,12.5913,77.4087,99.9774
762,763,1515,3421,3769,67.4609,11.4239,78.5761,99.8647
763,764,641,1645,3738,20.2886,83.306,6.69395,99.994
764,765,31383,1656,3849,34.5714,77.5453,12.4547,99.9509
765,766,36885,516,3862,76.9679,23.6757,66.3243,99.9627
766,767,3974,242,3768,62.937,5.95978,84.0402,99.9907
767,768,41871,1489,3909,59.6046,24.5912,65.4088,94.1677
768,769,821,858,3763,55.7661,10.5526,79.4474,99.9945
769,770,4120,1208,3776,60.9845,40.8681,49.1319,99.9621
770,771,15208,1955,3829,245.11,9.91443,80.0856,99.9429
771,772,4052,184,3797,231.036,24.8696,65.1304,99.9828
772,773,5402,342,3785,63.002,20.8642,69.1358,99.9867
773,774,4285,2314,3785,91.2804,72.9451,17.0549,99.9959
774,775,7666,1343,3805,34.1349,83.8521,6.147869999999998,99.9613
775,776,1319,3226,3784,81.1618,71.9395,18.0605,99.9733
776,777,718,3371,3775,233.419,34.3323,55.6677,99.9902
777,778,862,2990,3781,235.498,60.0078,29.9922,99.9449
778,779,13637,2624,3874,250.785,8.98524,81.0148,99.9321
779,780,5752,671,3844,71.1895,5.47791,84.5221,99.9907
780,781,10071,2097,3848,68.1509,6.90172,83.0983,99.985
781,782,5126,2430,3840,248.817,42.1206,47.8794,99.9813
782,783,3911,999,3827,67.9708,2.37798,87.62200000000001,99.9637
783,784,5684,287,3843,73.5121,32.9203,57.0797,99.9556
784,785,1464,3389,3816,73.5523,57.4602,32.5398,99.9884
785,786,6564,1222,3838,63.2175,15.6541,74.3459,99.9592
786,787,11385,2867,3866,238.252,17.7209,72.2791,99.951
787,788,1018,2986,3835,231.664,61.4175,28.5825,99.9803
788,789,7124,2951,3872,239.066,32.4628,57.5372,86.171
789,790,9796,2735,3859,230.575,74.8575,15.1425,99.9919
790,791,2079,377,3840,73.9516,31.6853,58.3147,99.965
791,792,7688,3200,3883,249.607,6.37778,83.6222,99.9761
792,793,5465,1551,3861,235.098,62.3328,27.6672,99.9876
793,794,6170,3131,3863,62.3293,33.0796,56.9204,99.9843
794,795,3725,2329,3845,69.3815,17.2694,72.7306,99.944
795,796,8654,2034,3887,61.2463,6.1602,83.8398,99.9934
796,797,596,2485,3837,59.9502,19.7756,70.2244,99.9969
797,798,13198,3347,3901,242.179,61.8475,28.1525,99.9834
798,799,712,1281,3841,70.8039,38.5948,51.4052,99.9952
799,800,4385,1125,3870,72.7285,44.4886,45.5114,99.9794
800,801,6978,1312,3905,64.9103,15.7224,74.2776,99.9521
801,802,7821,2515,3904,245.368,30.4321,59.5679,99.987
802,803,12910,202,3941,240.372,66.0748,23.9252,99.8652
803,804,721,197,3862,62.11,14.899,75.101,99.9869
804,805,3620,637,3907,242.192,37.6136,52.3864,99.986
805,806,14173,343,3926,220.033,74.1123,15.8877,99.6858
806,807,620,841,3877,190.054,86.2425,3.75755,99.9892
807,808,14099,2386,3964,245.83900000000003,8.55492,81.4451,99.6991
808,809,1485,3262,3889,234.223,26.9144,63.0856,99.9645
809,810,2973,1046,3903,66.806,27.5826,62.4174,99.9799
810,811,1218,3049,3889,239.908,5.7142300000000015,84.2858,99.9771
811,812,750,1181,3894,228.16,41.2244,48.7756,99.9806
812,813,42144,727,4029,200.35,82.1146,7.88538,99.9866
813,814,1367,2305,3916,78.3856,39.111,50.889,99.9775
814,815,656,753,3887,241.029,7.87482,82.1252,99.9921
815,816,4913,1234,3924,57.5091,21.0144,68.9856,99.9972
816,817,8744,2791,3936,245.287,12.5025,77.4975,99.9916
817,818,1076,894,3903,208.893,78.1957,11.8043,99.9811
818,819,4262,839,3938,241.977,0.8104020000000001,89.1896,99.9213
819,820,1834,2165,3917,237.577,14.3884,75.6116,99.998
820,821,63872,3037,4037,248.164,17.0265,72.9735,81.4952
821,822,12632,2012,3970,215.349,75.7863,14.2137,99.99
822,823,9352,1119,3953,238.157,54.469,35.531,99.9402
823,824,2974,1866,3940,67.4107,22.9341,67.0659,99.9871
824,825,922,3230,3936,245.813,51.9465,38.0535,99.9942
825,826,8919,1761,3965,235.692,5.39405,84.6059,99.9057
826,827,1880,1924,3952,62.0933,10.6813,79.3187,99.9829
827,828,5450,1374,3965,114.296,80.7025,9.29752,99.9931
828,829,68981,3236,4138,65.2904,19.2187,70.7813,88.853
829,830,1062,2439,3947,120.398,86.8911,3.10892,99.9868
830,831,10342,2617,3982,52.3319,15.0962,74.9038,99.9701
831,832,1622,2949,3954,60.7577,72.0068,17.9932,99.9856
832,833,17110,2139,4026,68.8542,34.0168,55.9832,75.8435
833,834,1386,2259,3963,221.845,74.9436,15.0564,99.9962
834,835,2818,1016,3982,68.3326,2.22421,87.7758,99.9356
835,836,654,3243,3967,239.246,9.05428,80.9457,99.9904
836,837,8920,2319,4012,66.0765,15.1147,74.8853,99.9813
837,838,1802,452,3990,242.693,38.1419,51.8581,99.9403
838,839,1646,1869,3985,239.231,4.9961,85.0039,99.8826
839,840,4410,1278,3986,226.801,41.0505,48.9495,99.9951
840,841,4475,1617,3992,233.029,7.110360000000001,82.8896,99.9739
841,842,2617,2218,3988,247.039,71.0981,18.9019,99.9968
842,843,22873,2410,4099,65.1668,26.5446,63.4554,99.8591
843,844,688,3267,3983,252.075,67.2774,22.7227,99.9981
844,845,777,584,3993,230.722,48.0744,41.9256,99.9803
845,846,2900,825,4000,65.9786,47.1434,42.8566,99.9628
846,847,1801,1185,3994,232.795,22.9003,67.0997,99.9569
847,848,6365,2821,4013,216.599,71.5338,18.4662,95.4193
848,849,2637,505,3999,68.7507,9.0793,80.9207,99.986
849,850,5981,406,4020,71.4031,17.2508,72.7492,99.8143
850,851,853,1828,3994,226.753,35.4666,54.5334,99.9977
851,852,979,286,3999,221.74,74.2656,15.7344,99.4064
852,853,1097,241,4016,59.4555,22.2803,67.7197,99.2499
853,854,2465,887,4024,221.437,48.0204,41.9796,99.978
854,855,4145,2742,4044,63.6405,75.7306,14.2694,99.7237
855,856,540,2750,4004,53.6615,14.7173,75.2827,99.9944
856,857,30227,1276,4098,50.7586,26.9278,63.0722,99.9607
857,858,79254,1969,4193,247.98,63.548,26.452,70.7247
858,859,18268,1077,4061,66.9165,7.04587,82.9541,99.9443
859,860,5521,2547,4047,243.189,18.3892,71.6108,99.9585
860,861,1358,1688,4015,229.728,54.2459,35.7541,99.9859
861,862,707,1401,4014,62.9548,21.5334,68.4666,99.9747
862,863,598,549,4016,68.0092,17.9167,72.0833,99.9885
863,864,7730,1758,4050,62.8951,7.95596,82.044,99.0757
864,865,8040,352,4062,206.538,67.1164,22.8836,99.8645
865,866,7559,1481,4064,74.6385,51.2449,38.7551,99.9812
866,867,15705,1667,4123,65.0338,42.4612,47.5388,99.928
867,868,1007,497,4053,64.6669,17.615,72.385,99.9721
868,869,6181,1387,4074,54.0739,9.6912,80.3088,99.9911
869,870,2117,576,4064,58.0351,5.5848900000000015,84.4151,99.9662
870,871,8628,2656,4079,59.9571,1.46603,88.53399999999998,99.9782
871,872,900,190,4049,182.327,77.8021,12.1979,99.9812
872,873,1229,268,4056,114.248,80.4449,9.55508,99.9745
873,874,933,525,4059,236.411,36.4587,53.5413,99.8517
874,875,551,476,4057,74.0076,6.0631900000000005,83.9368,99.996
875,876,2216,2277,4071,58.5235,29.5083,60.4917,99.9946
876,877,1403,226,4066,198.575,68.8553,21.1447,99.9575
877,878,529,159,4062,246.785,5.15881,84.8412,99.9878
878,879,5570,1803,4102,233.338,31.1466,58.8534,99.9807
879,880,7278,628,4113,70.625,13.1406,76.8594,99.9884
880,881,698,2841,4080,221.591,62.7573,27.2427,99.9841
881,882,2275,2572,4101,65.99,25.5845,64.4155,99.9509
882,883,4284,169,4122,59.151,12.6368,77.3632,99.9818
883,884,5655,453,4118,67.2255,19.5685,70.4315,99.2659
884,885,9720,292,4138,65.2197,12.5152,77.4848,99.9885
885,886,13025,2777,4143,256.822,66.2442,23.7558,99.9691
886,887,833,2874,4100,256.766,63.1738,26.8262,99.9912
887,888,12552,1499,4158,69.1882,34.3541,55.6459,99.8832
888,889,3049,549,4121,237.781,19.6594,70.3406,99.9882
889,890,16463,2261,4191,59.2404,54.4281,35.5719,99.9492
890,891,6315,3379,4140,250.067,65.8248,24.1752,99.9821
891,892,3159,416,4160,216.146,67.6626,22.3374,99.7968
892,893,1029,1579,4128,60.4703,16.852999999999998,73.14699999999998,99.9991
893,894,879,352,4133,130.287,81.9631,8.03688,99.9894
894,895,32527,2593,4206,64.2635,15.9998,74.0002,99.9451
895,896,27803,1154,4236,64.5735,49.3909,40.6091,99.9897
896,897,629,1426,4141,64.5571,19.5257,70.4743,99.9894
897,898,1606,1773,4156,239.272,7.553269999999999,82.4467,99.9961
898,899,2861,658,4177,242.416,19.9794,70.0206,99.9908
899,900,2358,2823,4202,211.548,68.7253,21.2747,99.9482
900,901,4329,219,4198,111.969,80.5908,9.40922,99.8929
901,902,1728,490,4170,57.1188,14.0977,75.9023,99.9962
902,903,1469,2655,4169,234.121,73.1812,16.8188,99.9773
903,904,13329,1304,4208,129.412,81.6154,8.38464,99.9969
904,905,12816,3375,4235,229.453,54.8447,35.1553,99.9821
905,906,11240,548,4218,232.693,44.6272,45.3728,99.9917
906,907,19065,1617,4257,234.879,21.7542,68.2458,99.8019
907,908,603,360,4180,131.616,80.3675,9.63254,99.9974
908,909,1570,712,4205,54.8072,26.7276,63.2724,99.9838
909,910,2753,3006,4209,115.07,86.6398,3.36016,99.9915
910,911,1377,814,4196,63.8027,24.8545,65.1455,99.9648
911,912,3460,1782,4204,69.1921,64.4776,25.5224,99.9755
912,913,557,400,4187,64.7906,18.8655,71.1345,99.9882
913,914,1701,760,4202,67.6252,23.1959,66.8041,99.9768
914,915,2657,160,4238,62.3586,53.4162,36.5838,99.9729
915,916,853,2880,4201,346.11,56.8517,33.1483,99.9918
916,917,41445,2977,4412,81.0871,37.0179,52.9821,85.6784
917,918,569,1875,4213,239.598,23.662,66.33800000000001,99.9968
918,919,12019,393,4267,239.788,34.9174,55.0826,99.9486
919,920,847,1844,4217,237.626,18.5851,71.4149,99.9938
920,921,652,335,4219,200.279,64.4827,25.5173,99.9647
921,922,2878,2570,4245,237.914,5.81979,84.1802,99.9965
922,923,898,809,4223,235.653,80.8982,9.10183,99.9962
923,924,1173,1431,4237,53.5359,42.6949,47.3051,99.9767
924,925,11595,2155,4262,62.9091,43.6026,46.3974,99.9768
925,926,19026,2426,4314,130.345,85.1104,4.88956,99.8347
926,927,757,653,4223,74.2918,8.719339999999999,81.2807,99.9969
927,928,5985,1387,4274,56.6291,33.0273,56.9727,99.6287
928,929,702,2847,4250,252.607,64.605,25.395,99.9883
929,930,2286,2884,4244,157.239,88.2481,1.7518900000000002,99.9903
930,931,8896,3042,4279,61.7363,33.4449,56.5551,99.985
931,932,961,249,4236,251.433,9.116,80.884,99.9919
932,933,3757,1508,4245,62.9168,14.1095,75.8905,99.9246
933,934,22120,1751,4314,77.8368,70.4636,19.5364,99.9798
934,935,1579,730,4241,69.9981,17.0935,72.9065,99.9403
935,936,892,867,4237,238.503,10.0031,79.9969,99.9919
936,937,1326,2795,4248,249.36900000000003,65.5258,24.4742,99.9842
937,938,2304,305,4262,63.7268,11.0306,78.9694,99.974
938,939,693,1844,4241,70.0731,66.0275,23.9725,99.9889
939,940,20205,878,4331,63.2807,48.1451,41.8549,96.7767
940,941,1922,2029,4263,55.9651,19.4913,70.5087,99.9951
941,942,7497,673,4275,67.1199,11.1956,78.8044,99.9639
942,943,550,780,4248,239.61,15.5753,74.4247,99.9978
943,944,7498,2258,4306,243.938,0.264915,89.7351,99.9937
944,945,612,923,4286,61.3955,13.5212,76.4788,99.9621
945,946,776,3269,4265,57.6838,33.304,56.69600000000001,99.9886
946,947,8069,222,4302,234.443,36.1672,53.8328,99.9689
947,948,3791,1280,4296,64.2168,29.6643,60.3357,99.9829
948,949,13740,517,4319,53.0502,59.2971,30.7029,99.965
949,950,20577,3338,4359,232.376,39.0859,50.9141,99.9783
950,951,1606,776,4286,296.659,72.2537,17.7463,99.9974
951,952,5903,2818,4298,130.69799999999998,87.1188,2.8812,99.9858
952,953,5927,1486,4311,65.1565,60.5257,29.4743,99.9471
953,954,1466,1984,4299,236.493,6.85169,83.1483,99.9838
954,955,28020,2595,4357,136.278,82.4203,7.57967,99.9081
955,956,933,2897,4286,129.468,76.1891,13.8109,99.9963
956,957,7146,688,4332,80.4469,65.8445,24.1555,99.9958
957,958,1147,2053,4302,234.221,87.4128,2.58721,99.9686
958,959,7636,2178,4360,64.0933,27.5435,62.4565,99.9237
959,960,2241,312,4322,62.8696,26.8093,63.1907,99.9696
960,961,9695,3124,4363,72.7236,34.3609,55.6391,99.9954
961,962,2395,598,4352,229.324,43.0756,46.9244,99.9822
962,963,70659,1392,4451,71.2623,51.4778,38.5222,66.7345
963,964,1818,3209,4326,228.627,59.7767,30.2233,99.9956
964,965,1372,2002,4333,57.9406,26.6838,63.3162,99.9872
965,966,6825,180,4380,70.4164,28.9565,61.0435,99.9275
966,967,1529,271,4345,232.893,46.9873,43.0127,99.9553
967,968,2608,2332,4340,250.766,45.3448,44.6552,99.9942
968,969,3216,2752,4343,233.828,67.4423,22.5577,99.9934
969,970,5782,2078,4358,47.2698,29.7475,60.2525,99.949
970,971,3212,2865,4365,73.8619,83.8343,6.16571,99.9925
971,972,1187,425,4350,239.271,33.2392,56.7608,99.8994
972,973,3706,3060,4382,61.0054,34.6173,55.3827,99.9482
973,974,6555,1123,4360,238.728,14.5914,75.4086,99.9408
974,975,976,2815,4348,62.3207,38.3689,51.6311,99.9962
975,976,10141,1569,4385,235.585,19.8472,70.1528,99.9626
976,977,2087,1028,4358,69.3071,19.1522,70.8478,99.9847
977,978,627,764,4358,65.4507,19.3557,70.6443,99.9535
978,979,2208,3199,4369,86.55,80.6738,9.32616,99.9982
979,980,8788,2365,4396,243.572,4.6349800000000005,85.365,99.9865
980,981,1013,389,4367,66.1601,11.2564,78.7436,99.9874
981,982,38381,540,4496,244.25,28.1589,61.8411,99.3461
982,983,6184,3255,4404,236.993,5.95325,84.0467,99.8528
983,984,3045,306,4382,236.496,52.8666,37.1334,99.8055
984,985,886,2136,4376,57.2037,31.4436,58.5564,99.9839
985,986,4064,2039,4400,67.2825,47.7465,42.2535,99.9843
986,987,9920,2300,4450,176.985,82.5478,7.45225,99.9443
987,988,11014,491,4421,62.6521,11.3266,78.6734,99.9734
988,989,2157,801,4393,241.482,19.8571,70.1429,99.9808
989,990,1986,601,4395,244.103,8.08404,81.916,99.9885
990,991,27264,2741,4559,240.322,9.06531,80.9347,99.8746
991,992,4980,668,4405,109.318,83.12100000000002,6.879,99.9945
992,993,4227,1711,4419,239.051,58.4502,31.5498,99.9833
993,994,1316,2769,4387,64.6696,14.5286,75.4714,99.9884
994,995,8803,2838,4436,60.8968,36.5171,53.4829,99.9516
995,996,6603,746,4429,61.2237,35.5796,54.4204,99.995
996,997,14581,877,4450,84.5268,72.10300000000002,17.897000000000006,99.9715
997,998,2319,1019,4407,241.085,7.05775,82.9422,99.9487
998,999,1950,1490,4412,225.518,55.0003,34.9997,99.9944
999,1000,566,1654,4395,231.178,80.0671,9.9329,99.9972
1000,1001,3218,1153,4412,237.399,5.55406,84.4459,99.9965
1001,1002,996,982,4420,243.983,11.854,78.146,99.9798
1002,1003,14022,3172,4479,239.586,56.1597,33.8403,99.9755
1003,1004,28298,1047,4498,70.4476,20.9137,69.0863,98.3871
1004,1005,32347,1772,4501,246.55900000000003,0.055770900000000005,89.9442,99.39
1005,1006,49976,2315,4544,241.71,43.8533,46.1467,47.7584
1006,1007,2868,241,4442,232.65,52.2232,37.7768,99.9817
1007,1008,2493,1782,4422,59.7027,21.0046,68.9954,99.9602
1008,1009,4605,2152,4441,232.919,6.04368,83.9563,99.9783
1009,1010,5427,3389,4458,62.6687,29.5274,60.4726,99.9811
1010,1011,985,2216,4428,66.2826,5.26529,84.7347,99.9914
1011,1012,29468,275,4528,67.9896,29.598000000000006,60.402,67.8243
1012,1013,7338,2596,4473,77.9642,48.5943,41.4057,99.9291
1013,1014,1573,286,4460,245.925,47.1091,42.8909,99.9807
1014,1015,582,1765,4467,225.845,78.812,11.188,99.9967
1015,1016,1312,3276,4480,253.304,0.543716,89.4563,99.9907
1016,1017,1720,2675,4484,231.026,48.2743,41.7257,99.9974
1017,1018,3493,1993,4485,240.143,32.9396,57.0604,99.8839
1018,1019,4793,2516,4502,242.68400000000003,1.5521200000000002,88.4479,96.174
1019,1020,6809,2813,4509,58.5449,25.6229,64.3771,99.9557
1020,1021,1849,1945,4516,244.517,36.327,53.673,99.9366
1021,1022,3680,788,4528,80.285,81.9043,8.09571,98.6606
1022,1023,608,1193,4501,73.2221,74.8443,15.1557,99.989
1023,1024,3080,1258,4525,62.8983,75.544,14.456,99.904
1024,1025,2422,2650,4529,129.02,88.2357,1.76425,99.2031
1025,1026,841,867,4517,90.6628,72.0908,17.9092,99.9835
1026,1027,13786,3215,4580,233.063,25.9345,64.0655,70.4895
1027,1028,1130,3363,4531,250.902,3.42803,86.572,99.9876
1028,1029,21009,837,4616,60.8338,10.7323,79.2677,99.9812
1029,1030,5158,678,4555,233.122,36.612,53.38800000000001,99.952
1030,1031,1037,1970,4545,226.396,62.6076,27.3924,99.9456
1031,1032,28533,314,4656,182.493,83.9148,6.08525,99.4055
1032,1033,993,2590,4568,239.821,10.4005,79.5995,99.9386
1033,1034,2057,3086,4554,179.605,88.5386,1.46139,83.3124
1034,1035,7704,1193,4605,62.5362,1.34864,88.6514,99.9823
1035,1036,15704,1824,4599,251.18400000000003,7.51538,82.4846,99.6658
1036,1037,820,2979,4551,71.9987,15.6492,74.3508,99.9893
1037,1038,12488,1296,4623,62.9897,73.9021,16.0979,99.9418
1038,1039,1302,1087,4560,70.6427,22.5255,67.4745,99.9819
1039,1040,761,2170,4558,65.5204,39.7312,50.2688,99.9903
1040,1041,3874,2867,4585,69.4842,15.6769,74.3231,99.9919
1041,1042,1292,1552,4566,242.944,6.55616,83.4438,99.9933
1042,1043,543,2828,4561,58.7383,22.2052,67.7948,99.9907
1043,1044,3412,2630,4589,27.2422,86.3368,3.66324,99.9924
1044,1045,1767,2552,4573,81.946,48.6052,41.3948,99.995
1045,1046,3374,1121,4606,358.439,82.6015,7.39854,99.9829
1046,1047,545,1471,4571,243.415,23.1796,66.8204,99.9837
1047,1048,650,1605,4571,65.1944,0.263573,89.7364,99.9836
1048,1049,12847,3082,4633,227.275,62.8081,27.1919,99.9089
1049,1050,1597,1502,4584,265.35900000000004,87.4967,2.50327,99.9962
1050,1051,6355,1999,4595,223.047,62.9181,27.0819,99.9822
1051,1052,2597,2320,4600,63.327,15.4847,74.5153,99.9791
1052,1053,12251,1017,4622,68.9221,10.9424,79.0576,99.9392
1053,1054,3064,2970,4588,71.1845,15.2536,74.7464,99.9916
1054,1055,4789,2375,4640,69.9343,2.95826,87.0417,99.9703
1055,1056,1794,2095,4595,60.109,43.7354,46.2646,99.997
1056,1057,7722,2145,4631,237.436,36.001,53.999,99.966
1057,1058,2055,2219,4584,66.0995,39.3558,50.6442,99.9716
1058,1059,1429,3355,4596,61.839,19.8527,70.1473,99.951
1059,1060,2797,3266,4608,243.376,5.5647,84.4353,99.9747
1060,1061,1341,3310,4600,67.211,54.7905,35.2095,99.9931
1061,1062,11771,1566,4631,63.9839,32.0223,57.9777,99.9695
1062,1063,1801,358,4616,96.2658,85.595,4.4050400000000005,99.9813
1063,1064,13474,715,4656,235.628,40.9261,49.0739,99.9877
1064,1065,5244,2920,4635,71.7274,23.3195,66.6805,99.9851
1065,1066,3660,3390,4624,237.593,70.8579,19.1421,99.9127
1066,1067,4035,1378,4616,232.874,26.7341,63.2659,99.9938
1067,1068,4786,2275,4628,57.7997,6.17715,83.8229,99.9736
1068,1069,769,319,4606,69.6299,72.2083,17.7917,99.9957
1069,1070,1434,591,4620,238.731,28.3391,61.6609,99.9905
1070,1071,19411,547,4675,58.8705,19.2979,70.7021,99.9768
1071,1072,1340,271,4617,351.28,88.2263,1.77371,99.9631
1072,1073,2849,2561,4630,239.592,12.0227,77.9773,99.9856
1073,1074,7203,2050,4669,202.033,72.6299,17.3701,99.8806
1074,1075,6429,1427,4668,63.5,44.9897,45.0103,99.9481
1075,1076,541,1657,4629,78.1911,61.2268,28.7732,99.9982
1076,1077,3952,2683,4660,230.436,74.3664,15.6336,99.9763
1077,1078,5557,2994,4665,238.083,53.9959,36.0041,99.9534
1078,1079,1976,3204,4649,64.0932,23.5238,66.4762,99.9918
1079,1080,2885,2850,4654,244.264,17.9859,72.0141,99.9616
1080,1081,3784,1730,4652,231.552,79.9286,10.0714,99.9949
1081,1082,2386,3303,4654,70.0994,27.591,62.409,99.9278
1082,1083,1241,1812,4651,58.344,7.63065,82.3694,99.9874
1083,1084,5846,1972,4685,59.6468,5.14996,84.85,99.8622
1084,1085,4192,1859,4687,66.4586,57.341,32.659,99.9652
1085,1086,2304,2344,4670,186.081,80.4566,9.54345,99.987
1086,1087,5857,2185,4686,54.9513,40.4432,49.5568,99.9175
1087,1088,4183,1142,4681,63.4035,3.96394,86.0361,99.9644
1088,1089,2021,2259,4676,62.0002,40.325,49.675,99.9805
1089,1090,1085,1076,4671,67.0499,35.5056,54.4944,99.9338
1090,1091,2915,1205,4689,66.0664,8.20253,81.7975,99.9893
1091,1092,1933,2622,4683,234.876,38.4168,51.5832,99.9966
1092,1093,1086,3203,4683,67.0892,22.9401,67.0599,99.8172
1093,1094,1413,1912,4677,66.4395,22.0068,67.9932,99.9753
1094,1095,2858,2553,4699,61.74,28.2145,61.7855,99.6757
1095,1096,1814,3397,4684,66.4163,21.7228,68.2772,99.6959
1096,1097,4953,968,4697,67.0587,34.4592,55.5408,99.9612
1097,1098,1787,1595,4685,63.3442,31.1345,58.8655,99.9505
1098,1099,1207,1732,4686,225.647,79.30199999999998,10.698,99.9889
1099,1100,1303,1659,4692,248.658,26.752,63.24800000000001,99.9704
1100,1101,2629,1786,4705,252.626,21.8898,68.1102,99.9561
1101,1102,1971,1264,4703,63.1527,17.3264,72.6736,99.9867
1102,1103,2010,1082,4707,64.8592,35.9036,54.0964,99.9552
1103,1104,1090,2860,4691,69.9886,15.4765,74.5235,99.9635
1104,1105,2547,3224,4705,242.439,50.438,39.562,99.9228
1105,1106,2448,3309,4705,67.2571,40.6993,49.3007,99.8991
1106,1107,635,2120,4696,235.748,36.192,53.808,99.9953
1107,1108,513,2469,4698,64.562,5.02594,84.9741,99.9938
1108,1109,1900,1525,4701,216.227,81.2563,8.74366,99.9838
1109,1110,1367,2867,4709,70.0389,15.2191,74.7809,99.8876
1110,1111,881,2970,4708,238.655,53.8022,36.1978,99.9744
1111,1112,1250,1696,4715,210.612,80.8447,9.15526,99.9371
1112,1113,632,890,4717,68.0094,37.3887,52.6113,99.8541
1113,1114,526,2752,4712,243.811,11.7468,78.2532,99.9357
1114,1115,507,2430,4712,180.516,76.8884,13.1116,99.9629
1115,1116,1128,2633,4714,237.276,39.494,50.506,99.9465
1116,1117,1133,2284,4716,206.37,73.435,16.565,99.9659
1117,1118,1964,1539,4718,221.574,81.9612,8.038789999999999,99.9489
