,Grain No.,Size [Pixel],center x-coordinate,center y-coordinate,mean azimuth [degree],mean latitude [degree],mean colatitude [degree],Regelungsgrad [%]
0,1,160840,372,390,185.344,67.0146,22.9854,86.477
1,2,34328,797,244,166.715,33.2203,56.7797,99.538
2,3,116134,1089,307,298.404,30.5174,59.4826,99.9619
3,4,4786,98,190,323.72,62.81399999999999,27.186,98.7768
4,5,33298,1350,346,311.748,38.8977,51.1023,99.9529
5,6,2664,1434,185,348.021,45.5762,44.4238,99.9815
6,7,1346,3239,194,265.036,58.5686,31.4314,99.9583
7,8,1017,3422,198,262.967,57.3037,32.6963,99.9392
8,9,795,3190,207,265.851,59.9651,30.0349,99.9812
9,10,25529,1505,304,0.339918,2.40004,87.6,99.8095
10,11,2710,2412,215,113.044,35.1215,54.8785,99.9049
11,12,7645,2319,234,337.653,34.6228,55.3772,99.6531
12,13,124443,1925,473,21.2047,53.9816,36.0184,99.9168
13,14,11025,2524,268,306.16,24.8374,65.1626,99.7561
14,15,4082,2913,231,174.662,3.37509,86.6249,99.9873
15,16,3906,1933,238,162.489,71.4917,18.5083,99.9507
16,17,825,1669,261,0.7192930000000001,1.27939,88.7206,100.0
17,18,1910,1629,268,1.2013,1.32241,88.6776,99.9847
18,19,656,1654,264,0.818818,1.33703,88.663,99.9959
19,20,3337,3169,268,108.986,33.8079,56.1921,99.9244
20,21,64340,2654,360,15.5308,60.3631,29.6369,99.8132
21,22,5162,646,278,134.79,31.797,58.203,98.3865
22,23,842,3256,263,266.812,59.113,30.887,99.9867
23,24,19953,148,354,190.324,77.0374,12.9626,99.752
24,25,2190,2206,285,326.722,32.0818,57.9182,99.9356
25,26,1243,1606,307,0.863294,1.32054,88.6795,99.994
26,27,3513,2272,297,319.222,33.4874,56.5126,99.8972
27,28,92811,2330,529,175.817,8.23799,81.762,99.5563
28,29,2423,2967,321,175.365,2.71523,87.2848,99.9914
29,30,16116,2888,379,174.87400000000005,2.05714,87.9429,99.9875
30,31,147142,667,550,348.064,10.734000000000002,79.266,99.5239
31,32,2521,568,329,136.327,25.8472,64.1528,99.9955
32,33,1514,279,314,141.303,12.4866,77.5134,99.9968
33,34,1639,1750,341,1.15925,7.8877,82.1123,99.9806
34,35,7292,2166,343,339.577,28.404,61.596,99.9947
35,36,17774,3182,407,121.299,30.8329,59.1671,99.9618
36,37,3566,3298,408,259.066,83.0833,6.91668,99.9862
37,38,12729,2065,429,175.72,6.66638,83.3336,99.979
38,39,4287,2408,408,12.785,56.8903,33.1097,99.981
39,40,731,3101,392,173.662,6.20682,83.7932,99.9812
40,41,12956,1977,557,173.58,10.1666,79.8334,97.1841
41,42,6443,2511,418,13.0143,59.8922,30.1078,99.9409
42,43,13359,1653,450,357.209,6.50143,83.4986,99.9516
43,44,3219,3422,454,251.085,63.2047,26.7953,99.757
44,45,1082,2881,410,177.418,2.45396,87.546,99.9986
45,46,2777,3068,455,174.333,5.39832,84.6017,99.9846
46,47,3253,90,481,62.7364,72.357,17.643,99.8556
47,48,7644,1436,487,345.71,47.444,42.556,99.9671
48,49,3253,2115,484,173.143,29.922,60.078,99.9299
49,50,3332,2334,471,290.573,48.3331,41.6669,99.9879
50,51,525,2989,451,174.287,1.0587799999999998,88.9412,99.9972
51,52,2724,2842,493,177.574,1.8489,88.1511,99.9829
52,53,4630,2396,481,174.688,6.43861,83.5614,99.985
53,54,26538,1266,561,172.266,3.25393,86.7461,99.7685
54,55,3543,2954,483,174.873,0.790443,89.2096,99.9925
55,56,11059,3329,519,183.084,75.6163,14.3837,99.6945
56,57,2676,2502,486,175.562,7.30559,82.6944,99.6609
57,58,30016,1067,561,140.589,47.2078,42.7922,95.0801
58,59,7508,1577,516,23.6186,54.9778,35.0222,99.975
59,60,15113,137,605,172.222,52.1962,37.8038,99.2771
60,61,1115,1336,492,12.169,76.0474,13.9526,99.9654
61,62,5677,3234,535,189.16,63.9467,26.0533,99.9034
62,63,521,2623,505,177.171,6.17157,83.8284,99.9942
63,64,41361,2597,666,314.564,38.7933,51.2067,99.9557
64,65,697,2599,507,177.1,8.43336,81.5666,99.9919
65,66,8828,1514,565,11.8508,49.2786,40.7214,99.9179
66,67,517,1352,513,352.98,3.43232,86.5677,99.5258
67,68,34276,2889,597,176.283,3.73557,86.2644,99.912
68,69,732,3092,522,180.985,0.0113144,89.9887,100.001
69,70,14163,3130,598,287.587,55.0688,34.9312,99.9085
70,71,1539,1390,555,0.621741,73.4006,16.5994,99.9729
71,72,2298,1670,555,315.534,43.9362,46.0638,99.9938
72,73,3199,1734,561,176.343,29.3732,60.6268,99.9952
73,74,2165,940,570,332.6,9.92371,80.0763,99.9932
74,75,3173,2141,594,177.572,8.05725,81.9427,99.9791
75,76,3707,1594,614,165.312,67.9024,22.0976,99.991
76,77,10620,1709,659,355.296,54.7464,35.2536,99.4618
77,78,1065,1755,599,18.5388,53.8034,36.1966,99.9867
78,79,3068,1817,607,176.335,29.22,60.78,99.9966
79,80,3263,3388,631,259.093,64.8836,25.1164,99.937
80,81,6105,1487,641,354.397,4.65257,85.3474,99.8619
81,82,1359,904,608,357.171,12.0419,77.9581,99.9836
82,83,13009,746,644,356.1280000000001,32.2972,57.7028,99.9496
83,84,17033,3261,650,20.5011,72.4694,17.5306,99.6922
84,85,2990,1390,629,353.8540000000001,5.16156,84.8384,99.9979
85,86,3562,2730,634,335.916,29.2837,60.7163,99.9634
86,87,92629,1209,781,1.52834,28.5791,61.4209,99.9213
87,88,1295,3028,628,179.21400000000003,3.4977400000000003,86.5023,99.99
88,89,8832,2070,663,316.2290000000001,41.4956,48.5044,99.9361
89,90,2035,976,653,347.8,1.74371,88.2563,99.3748
90,91,1587,1646,645,24.1155,54.7414,35.2586,99.9665
91,92,8166,887,671,180.563,37.7978,52.2022,99.9938
92,93,633,1774,645,167.521,53.3832,36.6168,99.7698
93,94,23818,2781,734,2.61843,20.7602,69.2398,99.814
94,95,4851,3097,688,174.84900000000005,13.6178,76.3822,99.9936
95,96,33142,2275,761,287.38,55.3265,34.6735,99.7873
96,97,60315,1481,889,172.80599999999995,37.5064,52.4936,91.4017
97,98,1113,1012,681,351.495,0.7957989999999999,89.2042,99.9667
98,99,13879,1637,748,359.457,0.5792010000000001,89.4208,99.9428
99,100,1347,1534,698,179.313,0.303322,89.6967,99.9862
100,101,238330,3085,939,173.267,46.5294,43.4706,98.3823
101,102,773,692,691,351.204,6.05066,83.9493,99.9867
102,103,76312,445,823,328.532,24.0326,65.9674,99.7871
103,104,6341,3375,743,345.67,69.9641,20.0359,99.5393
104,105,53482,894,833,352.606,0.981796,89.0182,91.1357
105,106,2608,3184,719,1.89308,77.6912,12.3088,99.9965
106,107,872,2107,720,9.70282,67.5762,22.4238,99.9879
107,108,4789,3275,737,169.394,24.9676,65.0324,99.8019
108,109,935,2260,730,314.411,38.7458,51.2542,99.9868
109,110,823,2665,728,290.124,51.0177,38.9823,99.9926
110,111,11194,137,796,26.543000000000006,74.6048,15.3952,99.8187
111,112,12627,1807,781,295.7920000000001,48.1074,41.8926,99.9856
112,113,737,2114,745,315.276,40.9576,49.0424,99.9936
113,114,9879,2658,804,359.041,43.1517,46.8483,99.9838
114,115,2122,3320,787,315.48,40.5868,49.4132,99.7424
115,116,734,1565,783,1.0271,7.24131,82.7587,99.981
116,117,18393,2054,859,2.58638,66.1351,23.8649,99.941
117,118,1441,1692,809,357.866,1.37188,88.6281,99.9692
118,119,1268,2155,797,280.158,56.0519,33.9481,99.9965
119,120,2471,587,807,186.825,54.9925,35.0075,99.9954
120,121,14832,2479,847,142.575,60.9305,29.0694,85.1542
121,122,8311,97,892,5.13365,34.0417,55.9583,99.8193
122,123,1611,1924,819,146.654,30.1534,59.8466,99.9954
123,124,650,3388,816,303.779,45.8548,44.1452,99.8842
124,125,2018,2178,836,5.43466,0.80497,89.195,99.9884
125,126,3412,1624,866,8.077580000000001,12.3663,77.6337,99.9942
126,127,38030,1797,1018,3.90952,0.804611,89.1954,99.7931
127,128,1438,2578,855,284.0420000000001,47.8643,42.1357,99.8927
128,129,59973,2388,984,3.1713400000000003,25.5042,64.4958,99.7262
129,130,19594,2599,937,118.568,74.8404,15.1596,99.9799
130,131,39501,328,946,171.49200000000005,45.7287,44.2713,99.7259
131,132,743,3423,887,171.21200000000005,47.804,42.19600000000001,99.8967
132,133,7727,766,934,16.8232,70.3595,19.6405,99.9854
133,134,110653,2152,1090,283.6670000000001,57.2851,32.7149,99.814
134,135,4579,1163,937,143.738,28.336,61.664,99.9961
135,136,7634,1677,974,330.5130000000001,70.6569,19.3431,99.7184
136,137,1301,2457,939,287.638,53.334,36.666,99.9892
137,138,360495,428,1449,346.594,26.9659,63.0341,93.5418
138,139,15131,1301,1021,328.646,68.6195,21.3805,99.8971
139,140,26539,170,1042,11.779000000000002,71.3937,18.6063,99.8305
140,141,14187,1110,1018,3.15122,12.8744,77.1256,99.8274
141,142,26840,576,1027,357.249,39.7407,50.2593,55.7463
142,143,3617,1212,987,0.107391,21.4289,68.5711,99.9605
143,144,697,84,970,179.44799999999995,39.315,50.685,99.9489
144,145,680,61,1008,5.81763,35.0838,54.9162,99.8832
145,146,27152,2738,1075,54.5194,80.2402,9.75977,80.3621
146,147,2957,1028,1050,146.47,27.3034,62.6966,99.9541
147,148,11092,1453,1070,178.791,4.22139,85.7786,99.868
148,149,24731,1648,1106,177.97799999999995,52.8635,37.1365,99.9838
149,150,5588,379,1071,325.765,26.7967,63.2033,99.9728
150,151,19871,985,1129,322.331,42.5987,47.4013,99.9601
151,152,7178,479,1110,146.356,26.9609,63.0391,99.9606
152,153,28460,292,1156,171.465,43.8643,46.1357,99.9888
153,154,5031,87,1118,5.11046,33.5391,56.4609,99.9707
154,155,17086,837,1135,170.37099999999995,38.1049,51.8951,99.9838
155,156,3822,2914,1112,351.523,15.755,74.245,99.9736
156,157,22014,1292,1176,173.553,60.3358,29.6642,99.9817
157,158,8794,1117,1117,3.87624,19.2589,70.7411,99.9815
158,159,3748,1281,1097,322.765,41.4667,48.5333,99.9964
159,160,48484,2522,1215,200.163,66.8916,23.1084,99.9381
160,161,72818,3100,1244,330.966,73.5698,16.4302,99.7514
161,162,2162,2834,1154,174.783,44.5702,45.4298,99.7752
162,163,6165,1156,1184,323.367,41.8471,48.1529,99.9966
163,164,50529,1522,1240,139.425,28.4186,61.5814,99.8891
164,165,760,1418,1127,334.541,67.1331,22.8669,99.9913
165,166,2111,2640,1140,175.93,42.7541,47.2459,99.9391
166,167,1225,720,1145,169.733,0.79528,89.2047,99.9953
167,168,2849,1382,1172,322.856,41.1029,48.8971,99.9943
168,169,3535,401,1188,166.97400000000005,20.5396,69.4604,99.993
169,170,14279,141,1227,170.362,24.41,65.59,99.9148
170,171,36361,2767,1295,88.3738,64.8631,25.1369,99.9068
171,172,79074,1826,1315,341.357,67.8009,22.1991,95.1839
172,173,2171,1076,1207,176.155,59.1,30.9,99.9964
173,174,234058,1105,1463,155.194,61.6504,28.3496,83.1474
174,175,10328,2091,1250,162.586,59.1526,30.8474,99.9495
175,176,2823,404,1243,152.208,28.9535,61.0465,99.8813
176,177,517,3401,1235,138.642,3.23552,86.7645,99.9378
177,178,551,2884,1243,327.861,71.9771,18.0229,99.9935
178,179,17126,2251,1282,197.058,58.0222,31.9778,99.9809
179,180,5094,3369,1322,149.517,2.8818200000000003,87.1182,99.5266
180,181,2140,2910,1277,83.8362,65.1798,24.8202,99.9891
181,182,621,451,1267,353.5619999999999,5.25142,84.7486,99.9948
182,183,22064,1307,1333,179.68599999999995,54.1101,35.8899,99.9841
183,184,9271,2526,1338,171.40200000000004,4.04836,85.9516,99.9423
184,185,3706,2592,1315,163.392,7.57487,82.4251,99.9599
185,186,10676,2861,1370,353.904,11.3936,78.6064,99.9838
186,187,2785,105,1335,355.136,24.3514,65.6486,99.9417
187,188,746,2026,1317,161.30200000000005,59.7153,30.2847,99.9566
188,189,24966,2113,1418,299.389,40.1541,49.8459,99.9655
189,190,21340,2260,1382,138.188,21.4361,68.5639,99.9848
190,191,52596,731,1478,196.117,12.8975,77.1025,99.9394
191,192,2473,2628,1346,171.035,5.13852,84.8615,99.9876
192,193,32657,3238,1540,183.679,2.7480900000000004,87.2519,99.9888
193,194,131782,2698,1548,17.3208,47.3636,42.6364,99.8737
194,195,69116,1637,1520,109.908,55.9917,34.0083,99.146
195,196,6516,1982,1412,132.878,35.2518,54.7482,99.9695
196,197,716,2945,1380,177.255,3.06136,86.9386,99.7954
197,198,802,2887,1403,93.6794,60.547,29.453000000000007,99.9953
198,199,78096,3069,1554,353.771,35.0052,54.9948,99.9622
199,200,4082,2345,1469,136.316,21.4933,68.5067,99.6945
200,201,28028,2381,1554,168.227,0.831451,89.1685,98.5615
201,202,532,1957,1450,134.336,34.6355,55.3645,99.9636
202,203,66357,2017,1604,358.405,19.9057,70.0943,99.5425
203,204,9248,1823,1573,223.291,74.1101,15.8899,99.8291
204,205,3165,2313,1598,349.7990000000001,3.70741,86.2926,99.9909
205,206,4795,1239,1607,2.94053,5.76319,84.2368,99.96
206,207,33851,1291,1688,313.238,50.2907,39.7093,99.8297
207,208,3580,1512,1631,166.544,31.9128,58.0872,99.9778
208,209,7554,754,1670,15.5241,12.0744,77.9256,99.9944
209,210,352227,715,2102,354.316,19.3317,70.6683,94.8383
210,211,53504,2307,1739,353.365,4.0967,85.9033,99.9271
211,212,13296,1749,1687,184.949,0.6621630000000001,89.3378,99.9579
212,213,1708,396,1654,359.074,60.9806,29.0194,99.9835
213,214,2915,1444,1668,140.455,52.1831,37.8169,99.9368
214,215,900,2454,1671,246.448,70.1695,19.8305,99.9438
215,216,174102,1426,1914,201.272,65.3031,24.6969,93.912
216,217,1203,2428,1682,170.768,23.3044,66.6956,99.9934
217,218,9929,2893,1725,131.752,28.8163,61.1837,99.9968
218,219,9729,2709,1733,226.296,74.64399999999998,15.356,99.9492
219,220,8922,2510,1755,244.588,71.1953,18.8047,99.8671
220,221,31222,2620,1841,168.854,26.8579,63.1421,99.9582
221,222,1584,2627,1716,245.331,73.4267,16.5733,99.9888
222,223,2738,283,1717,33.2853,78.6806,11.3194,99.9949
223,224,4924,870,1754,114.524,54.6736,35.3264,99.9775
224,225,582,1850,1726,181.324,0.168419,89.8316,99.9822
225,226,8019,331,1771,197.838,50.9226,39.0774,99.9636
226,227,8189,2815,1778,353.0730000000001,34.8965,55.1035,99.9945
227,228,18151,3307,1829,193.509,81.209,8.791030000000001,99.9191
228,229,13569,2064,1792,304.913,39.1036,50.8964,99.9865
229,230,564771,2809,2182,343.532,23.2374,66.7626,53.2543
230,231,5267,1952,1782,182.708,0.602432,89.3976,99.9526
231,232,38359,1771,1889,112.318,55.0852,34.9148,99.7656
232,233,1371,2150,1799,232.831,66.8375,23.1625,99.9778
233,234,33281,2262,1914,87.3636,70.1517,19.8483,99.9149
234,235,5559,388,1865,358.06,64.7171,25.2829,99.9697
235,236,5174,1990,1872,341.477,40.3889,49.6111,99.746
236,237,25541,2103,1953,356.245,5.15536,84.8446,99.3611
237,238,8452,1929,1900,172.74900000000005,27.4785,62.5215,99.9536
238,239,762,2777,1854,169.30700000000004,26.7537,63.2463,99.9937
239,240,79577,376,2067,358.288,6.09365,83.9063,99.7736
240,241,923,1561,1875,117.317,54.0551,35.9449,99.9935
241,242,7552,92,1937,120.087,41.4094,48.5906,99.8398
242,243,774,2794,1885,197.271,70.641,19.359,99.9819
243,244,966,2648,1895,231.333,71.4414,18.5586,99.9945
244,245,1043,1075,1893,186.73,19.637,70.363,99.8471
245,246,6579,2732,1923,222.413,73.0922,16.9078,99.9618
246,247,17743,1627,1984,4.60916,1.3060200000000002,88.694,99.8562
247,248,6911,1841,1985,345.7580000000001,40.5409,49.4591,99.9606
248,249,4176,1907,1962,188.098,54.3562,35.6438,99.9941
249,250,23806,225,2069,314.52,29.9171,60.0829,99.8297
250,251,1725,1693,1980,183.848,62.0246,27.9754,99.977
251,252,102498,1954,2217,163.14600000000004,41.1721,48.8279,85.6553
252,253,3421,3378,2023,14.1706,66.1699,23.8301,99.5998
253,254,25385,86,2209,155.22799999999995,65.7859,24.2141,99.3959
254,255,1440,115,2023,136.736,40.5497,49.4503,99.9771
255,256,1474,41,2065,157.209,59.5553,30.4447,99.9463
256,257,958,1781,2033,344.436,41.4557,48.5443,99.9228
257,258,605,1386,2031,92.2832,59.9969,30.0031,99.994
258,259,3260,1333,2060,15.6545,27.0964,62.9036,99.9923
259,260,1792,1256,2063,184.78,22.2945,67.7055,99.9848
260,261,606,1577,2076,186.106,1.58198,88.41799999999998,99.9977
261,262,1129,1839,2060,184.842,1.67225,88.3278,99.9528
262,263,7502,1195,2094,159.181,64.6125,25.3875,99.9815
263,264,1832,1806,2082,184.593,1.7641099999999998,88.2359,99.9586
264,265,8107,2214,2097,36.219,72.7473,17.2527,99.8843
265,266,1594,2075,2082,4.97283,2.34206,87.6579,99.9571
266,267,557,2893,2075,176.372,1.28285,88.7171,99.9995
267,268,3211,1781,2109,184.08,2.64841,87.3516,99.8828
268,269,7709,558,2126,1.23901,1.61962,88.3804,99.9868
269,270,4853,2125,2119,350.047,0.6234970000000001,89.3765,99.9868
270,271,43546,243,2267,161.039,61.1799,28.8201,99.9266
271,272,54254,1466,2336,153.08700000000005,36.1892,53.8108,99.8894
272,273,4151,1889,2125,166.725,24.7729,65.2271,99.9898
273,274,4947,1609,2135,174.362,50.6486,39.3514,99.9938
274,275,2518,1126,2160,176.41400000000004,2.86389,87.1361,99.9851
275,276,539,1091,2136,180.924,2.73396,87.266,99.9762
276,277,6376,3276,2219,183.304,3.36398,86.63600000000002,99.9764
277,278,23900,1205,2233,183.635,22.5313,67.4687,99.976
278,279,30977,2269,2245,173.463,42.5653,47.4347,99.9963
279,280,7826,2158,2205,336.449,59.2966,30.7034,99.9983
280,281,4522,1347,2199,183.74400000000003,20.8719,69.1281,99.9582
281,282,6956,982,2208,305.807,30.5995,59.4005,99.9868
282,283,540,2607,2210,171.66299999999995,0.897285,89.1027,99.9849
283,284,2808,1625,2235,358.94699999999995,9.77811,80.2219,99.9873
284,285,2221,1681,2240,358.466,6.3912900000000015,83.6087,99.9942
285,286,768,526,2210,0.459804,6.00179,83.9982,99.988
286,287,2541,1432,2237,195.622,62.6771,27.3229,99.9939
287,288,755,609,2244,173.116,2.41856,87.5814,99.9989
288,289,4598,522,2277,181.679,16.0884,73.9116,99.9897
289,290,1062,568,2265,179.264,5.13969,84.8603,99.9435
290,291,21472,1610,2320,183.665,62.9861,27.0139,99.7698
291,292,630,1110,2261,10.2791,0.203568,89.7964,99.9513
292,293,526,3317,2263,183.143,3.7468,86.2532,99.9861
293,294,1039,615,2274,177.243,2.03455,87.9655,99.9954
294,295,802,715,2271,6.52191,43.8679,46.1321,98.682
295,296,68864,863,2407,352.348,56.4815,33.5185,99.8599
296,297,94427,1897,2492,358.446,53.881,36.119,99.8816
297,298,751,3384,2296,146.313,40.0989,49.9011,99.7273
298,299,15372,1091,2336,174.863,38.149,51.851000000000006,99.9047
299,300,5032,1274,2315,173.395,0.926964,89.073,99.9802
300,301,620,1489,2292,192.739,66.2377,23.7623,99.9876
301,302,5863,1440,2337,352.865,31.3834,58.6166,99.9731
302,303,634,343,2348,179.78400000000005,30.418000000000006,59.582,99.9957
303,304,1671,1763,2358,193.698,59.3129,30.6871,99.9971
304,305,509,3184,2353,176.796,28.1487,61.8513,99.9395
305,306,1659,3358,2382,149.22799999999995,36.6959,53.3041,99.0521
306,307,24069,1245,2460,2.37487,71.0096,18.9904,97.4459
307,308,6558,100,2408,347.027,37.6699,52.3301,98.9212
308,309,2328,172,2397,350.967,29.5818,60.4182,99.9598
309,310,11805,3236,2427,176.47400000000005,29.895,60.105,99.7429
310,311,52049,743,2580,329.099,3.3203,86.6797,99.8786
311,312,608,222,2403,146.859,30.6712,59.3288,99.9872
312,313,2192,1395,2426,172.96200000000005,52.1129,37.8871,99.9869
313,314,1926,1080,2423,331.475,35.7646,54.2354,99.9908
314,315,10485,1129,2474,319.263,64.0067,25.9933,99.9643
315,316,12734,2164,2472,321.847,67.96300000000001,22.037,99.9852
316,317,3516,175,2457,336.593,49.3411,40.6589,99.8437
317,318,1846,3322,2454,318.9770000000001,1.93495,88.065,99.9235
318,319,27861,1381,2539,325.059,14.7111,75.2889,99.8822
319,320,993,1464,2453,171.97,52.7652,37.2348,99.9439
320,321,3874,3119,2475,26.4326,66.7253,23.2747,99.9921
321,322,7844,75,2512,327.907,58.7628,31.2372,99.0662
322,323,114728,977,2729,19.8869,65.6936,24.3064,51.3941
323,324,2017,2401,2472,120.086,70.003,19.997,99.9928
324,325,798,297,2469,178.628,35.4448,54.5552,99.9736
325,326,2370,230,2483,147.705,31.8655,58.1345,99.9489
326,327,9089,2443,2524,315.332,42.6164,47.3836,99.9504
327,328,7153,3327,2513,127.255,4.06019,85.9398,99.4986
328,329,10256,2270,2519,168.51,23.1473,66.8527,88.8354
329,330,64766,577,2698,184.652,3.41939,86.5806,99.9906
330,331,6891,3235,2530,146.579,17.3314,72.6686,99.8552
331,332,20260,2567,2594,345.71,38.6475,51.3525,99.8988
332,333,9903,1573,2556,358.296,57.7875,32.2125,99.9435
333,334,6938,2344,2579,329.9240000000001,67.7336,22.2664,99.8086
334,335,10357,2883,2557,350.338,4.5155699999999985,85.4844,98.9159
335,336,8533,103,2585,344.38,36.9057,53.0943,99.6375
336,337,633,3179,2530,137.185,2.36476,87.6352,99.8192
337,338,9983,1695,2564,164.912,58.4207,31.5793,99.9747
338,339,1322,513,2545,163.309,28.0342,61.9658,99.9896
339,340,3478,1491,2583,172.924,27.5311,62.4689,99.9602
340,341,71567,1265,2728,95.2528,56.4785,33.5215,99.7689
341,342,1168,1095,2558,43.4728,81.7445,8.2555,99.9915
342,343,1894,2151,2564,148.41,9.01968,80.9803,99.8086
343,344,46662,2865,2721,352.401,1.06031,88.9397,99.9332
344,345,1742,3175,2571,23.1707,64.1417,25.8583,99.9761
345,346,2962,3342,2583,126.698,11.3273,78.6727,99.4646
346,347,2497,2253,2581,170.015,25.9813,64.0187,99.9865
347,348,6490,2656,2590,0.00514354,59.2811,30.7189,99.9697
348,349,1028,2895,2587,341.68,4.61325,85.3867,99.9605
349,350,602,2846,2585,338.559,5.28641,84.7136,99.9964
350,351,909,2738,2605,176.34400000000005,0.990913,89.0091,99.9963
351,352,32731,3249,2683,266.463,71.7826,18.2174,99.9713
352,353,1067,2991,2605,340.981,5.10065,84.8993,99.9723
353,354,1504,439,2614,324.378,51.499,38.501,99.9827
354,355,11974,2223,2645,339.374,66.2005,23.7995,99.9413
355,356,701,3168,2604,0.968889,72.7933,17.2067,99.9857
356,357,102910,2446,2791,0.682286,52.5011,37.4989,96.9148
357,358,535,407,2610,150.58700000000005,32.7976,57.2024,99.9817
358,359,9113,1624,2646,76.1498,60.0305,29.9695,99.9723
359,360,5217,1726,2642,350.47,61.1489,28.8511,99.9864
360,361,14149,2048,2685,173.701,21.5582,68.4418,99.9862
361,362,1626,35,2666,180.956,48.6674,41.3326,99.7812
362,363,3567,387,2649,324.297,51.5998,38.4002,99.9208
363,364,9698,1508,2668,179.28799999999995,46.2496,43.7504,99.9656
364,365,654,2877,2643,173.562,0.374847,89.6252,99.9987
365,366,22813,198,2709,300.824,58.2655,31.7345,99.987
366,367,8340,3025,2690,309.744,68.4098,21.5902,99.9797
367,368,2794,336,2675,150.704,30.4821,59.5179,99.9747
368,369,29986,2156,2776,147.752,7.0801300000000005,82.9199,99.9292
369,370,26302,1842,2715,335.135,31.8061,58.1939,99.9827
370,371,5688,1462,2752,181.43400000000003,0.8836290000000001,89.1164,99.1349
371,372,78219,1787,2838,349.591,55.6335,34.3665,98.7161
372,373,13866,81,2783,170.5,41.8311,48.1689,99.364
373,374,3007,3371,2732,293.2940000000001,74.8664,15.1336,99.9663
374,375,862,1984,2697,151.685,6.54415,83.4558,99.9748
375,376,2901,299,2713,172.757,39.0346,50.9654,99.9963
376,377,2171,758,2722,351.006,48.5603,41.4397,99.9943
377,378,25656,3159,2802,355.918,62.3945,27.6055,99.89
378,379,32071,2676,2845,196.451,57.2218,32.7782,99.9906
379,380,2056,381,2738,328.327,51.463,38.537,99.9609
380,381,27527,346,2815,149.381,29.8886,60.1114,99.9355
381,382,2071,2755,2757,140.91899999999995,33.6155,56.3845,99.9923
382,383,16110,675,2893,157.154,26.3126,63.6874,99.8507
383,384,3918,2808,2829,327.012,55.3777,34.6223,99.9594
384,385,24684,3249,2887,177.225,26.2063,63.7937,99.6508
385,386,619,507,2813,187.267,3.30061,86.6994,99.985
386,387,718,3050,2816,293.022,66.4883,23.5117,99.9571
387,388,14542,2263,2883,351.676,66.7758,23.2242,99.916
388,389,9916,1481,2872,119.661,75.1044,14.8956,99.9612
389,390,68422,2845,3022,340.011,20.7349,69.2651,92.4814
390,391,821,183,2830,163.093,12.8218,77.1782,99.873
391,392,13555,2080,2889,354.3230000000001,31.0228,58.9772,99.9571
392,393,8728,502,2876,357.29,45.9966,44.0034,99.9772
393,394,3522,1029,2875,337.64,13.1264,76.8736,99.9447
394,395,6641,234,2894,347.91,4.83095,85.1691,99.783
395,396,587,184,2860,159.395,85.8363,4.16372,99.8207
396,397,5097,2771,2909,353.35,66.6046,23.3954,99.9849
397,398,3532,156,2914,355.7680000000001,13.1349,76.8651,99.9883
398,399,4606,2975,2896,304.335,66.666,23.334,99.9275
399,400,1146,1334,2878,333.474,40.4307,49.5693,99.8773
400,401,3364,1648,2893,356.027,7.94525,82.0547,99.9933
401,402,628,417,2880,344.09,12.1596,77.8404,99.9563
402,403,8576,3067,2929,353.655,1.68902,88.311,99.9689
403,404,8711,794,2928,154.08,58.4925,31.5075,99.9713
404,405,19424,425,2957,338.8880000000001,32.7137,57.2863,99.661
405,406,2455,1375,2896,163.043,31.3073,58.6927,99.4818
406,407,23050,1259,2960,156.813,76.905,13.095,99.8559
407,408,694,568,2896,168.94400000000005,26.0175,63.9825,99.6104
408,409,26869,1540,3026,353.306,4.0326900000000006,85.9673,99.2217
409,410,36845,1007,3005,318.589,36.9092,53.0908,99.3861
410,411,5875,1643,2963,171.87599999999995,66.7455,23.2545,99.9429
411,412,1675,1153,2947,321.03,33.318000000000005,56.682,99.9937
412,413,26673,2172,3014,160.77200000000005,12.8039,77.1961,99.8847
413,414,22143,1388,3034,350.576,21.1674,68.8326,99.5197
414,415,3658,3370,2984,11.8429,86.7723,3.22768,99.9749
415,416,8876,1784,2970,231.608,83.9296,6.0704400000000005,99.8136
416,417,10616,2334,2999,153.077,5.27117,84.7288,99.9653
417,418,62134,702,3080,347.673,47.1726,42.8274,98.9839
418,419,7727,3270,2981,150.404,70.3335,19.6665,99.9113
419,420,2815,195,2979,160.439,66.6291,23.3709,99.9359
420,421,2204,2548,2962,331.1980000000001,2.56799,87.432,99.9904
421,422,11778,299,3001,167.604,35.9446,54.0554,99.7978
422,423,4662,2676,2996,180.388,44.3086,45.6914,99.9892
423,424,652,3137,2972,178.74599999999995,5.5629300000000015,84.4371,99.9535
424,425,2572,2030,2993,322.39,1.12959,88.8704,99.9821
425,426,687,2619,2977,182.6,45.1604,44.8396,99.9466
426,427,503,1904,2975,232.867,85.7348,4.26517,99.9485
427,428,680,1936,2989,153.188,2.10546,87.8945,99.9375
428,429,1799,130,3008,356.222,7.08189,82.9181,99.5371
429,430,88857,3157,3139,172.58900000000003,76.6236,13.3764,68.83800000000001
430,431,948,1978,2995,351.6790000000001,32.14,57.86,99.9781
431,432,21119,1798,3064,143.72299999999996,85.0362,4.96381,99.4448
432,433,19066,2511,3061,50.0289,84.5688,5.43116,99.6461
433,434,2610,1716,3018,151.055,55.6008,34.3992,99.8795
434,435,1438,1619,3024,154.308,8.0308,81.9692,99.9438
435,436,3263,217,3041,175.468,8.42052,81.5795,99.9973
436,437,21334,1970,3097,35.2748,74.1739,15.8261,99.8145
437,438,7164,1084,3077,131.382,58.0555,31.9445,99.9185
438,439,1018,513,3042,172.66099999999997,0.713425,89.2866,99.9951
439,440,2409,2617,3052,160.47299999999996,71.5054,18.4946,99.7215
440,441,7457,331,3085,160.877,1.11526,88.8847,99.9777
441,442,29551,220,3133,344.2290000000001,28.7316,61.2684,98.9782
442,443,4437,414,3081,169.17700000000005,1.06004,88.94,99.9449
443,444,4382,141,3085,356.0680000000001,55.6816,34.3184,99.8967
444,445,7922,2105,3098,343.551,41.151,48.849,99.7509
445,446,925,2984,3079,159.981,39.52,50.48,99.7002
446,447,529,1286,3069,349.444,13.6493,76.3507,99.9959
447,448,16038,510,3140,332.709,50.3217,39.6783,99.9357
448,449,624,2399,3075,168.27599999999995,4.9146800000000015,85.0853,99.997
449,450,3063,2247,3113,167.493,71.1608,18.8392,99.8683
450,451,2076,1244,3091,350.612,12.1785,77.8215,99.9874
451,452,3983,2351,3109,349.158,51.9491,38.0509,99.9949
452,453,1079,1447,3098,331.6040000000001,0.325813,89.6742,85.7867
453,454,2697,1616,3101,16.8885,77.1355,12.8645,99.9922
454,455,10219,903,3155,159.403,33.8927,56.1073,92.5127
455,456,705,1167,3090,353.129,7.74425,82.2558,99.9948
456,457,2384,2300,3111,165.61,30.5737,59.4263,99.9967
457,458,10899,1657,3178,324.889,24.5574,65.4426,99.9568
458,459,15002,2634,3152,324.168,41.8097,48.1903,99.9367
459,460,1192,742,3115,163.10399999999996,23.8516,66.1484,99.9978
460,461,49678,2344,3216,175.9,82.241,7.75898,76.8222
461,462,650,2555,3107,156.157,74.6225,15.3775,99.993
462,463,619,1268,3114,352.639,7.27618,82.7238,99.9993
463,464,1455,671,3114,139.43200000000002,47.1126,42.8874,99.9968
464,465,569,1189,3118,126.403,56.1104,33.8896,99.9151
465,466,134175,1330,3426,337.162,50.9156,39.0844,99.6934
466,467,7251,1060,3167,358.547,64.2943,25.7057,99.9992
467,468,12106,1389,3175,345.63199999999995,31.5693,58.4307,99.8273
468,469,5371,1724,3179,141.674,52.8672,37.1328,99.9646
469,470,1929,1805,3146,36.0396,72.0208,17.9792,99.9464
470,471,1707,1579,3148,343.146,24.7522,65.2478,99.9946
471,472,2015,2884,3164,29.6136,84.8353,5.16467,99.9923
472,473,49735,1943,3271,314.091,78.7661,11.2339,71.3429
473,474,2126,2511,3175,161.267,29.0331,60.9669,99.9916
474,475,1131,1850,3165,141.053,61.7184,28.2816,99.9913
475,476,2104,1771,3177,147.357,6.802389999999999,83.1976,99.9981
476,477,33105,979,3290,334.2990000000001,34.5322,55.4678,76.1355
477,478,24735,97,3254,343.5780000000001,60.0552,29.9448,99.6555
478,479,18906,303,3240,348.314,7.344130000000002,82.6559,99.9818
479,480,2880,2721,3205,345.446,44.7751,45.2249,99.9846
480,481,4281,3160,3213,75.2301,80.8875,9.11255,99.9934
481,482,8824,1572,3221,341.321,51.4273,38.5727,99.9752
482,483,1200,1155,3193,128.315,52.3768,37.6232,99.9766
483,484,6677,806,3227,133.343,55.7838,34.2162,99.9577
484,485,1631,1198,3198,353.996,4.4642,85.5358,99.9966
485,486,975,1474,3200,169.327,0.163002,89.837,99.9922
486,487,641,1122,3204,146.028,49.0452,40.9548,99.9971
487,488,24907,2945,3285,95.0692,71.8414,18.1586,84.6469
488,489,26830,389,3342,323.194,16.5307,73.4693,80.155
489,490,2315,528,3226,323.651,39.565,50.435,99.9117
490,491,3611,677,3232,315.655,76.333,13.667,99.9821
491,492,8773,2736,3258,359.852,73.5143,16.4857,99.9868
492,493,17630,2163,3317,340.842,19.9486,70.0514,98.9167
493,494,7374,1499,3262,278.836,77.1999,12.8001,99.9795
494,495,1270,2636,3235,124.103,16.1725,73.8275,99.431
495,496,7457,2545,3289,149.195,71.1988,18.8012,99.9607
496,497,1904,1140,3239,131.769,52.8233,37.1767,99.9969
497,498,2275,212,3267,125.266,49.9811,40.0189,99.9976
498,499,4040,2638,3300,338.528,20.6693,69.3307,99.8519
499,500,18438,728,3317,159.37,39.2323,50.7677,99.9391
500,501,2116,1729,3262,266.322,86.096,3.90397,99.9067
501,502,10965,3211,3290,356.033,35.5257,54.4743,99.9734
502,503,3279,853,3284,331.111,11.3268,78.6732,99.9953
503,504,1627,2595,3277,123.917,18.6912,71.3088,99.9866
504,505,798,530,3263,160.275,40.9405,49.0595,99.9878
505,506,9292,1161,3323,172.574,0.121689,89.8783,99.9818
506,507,3186,604,3287,339.81699999999995,81.5755,8.42455,99.9916
507,508,3101,416,3300,346.798,15.2174,74.7826,99.8635
508,509,1279,903,3290,353.157,81.5801,8.419939999999999,99.986
509,510,981,2844,3286,142.989,37.7544,52.2456,99.9893
510,511,657,3356,3291,147.338,72.9534,17.0466,99.9604
511,512,1151,1707,3301,353.087,7.22981,82.7702,99.9966
512,513,937,1614,3291,336.482,0.371582,89.6284,99.9933
513,514,550,2770,3291,142.155,37.6074,52.3926,99.9948
514,515,5150,1750,3333,327.3640000000001,24.4645,65.5355,99.772
515,516,1807,3109,3303,332.783,6.31629,83.6837,99.9977
516,517,4844,530,3327,294.588,73.6307,16.3693,99.9957
517,518,35987,2352,3416,168.21400000000003,36.0772,53.9228,99.8459
518,519,10576,2810,3343,134.08100000000002,62.5196,27.4804,99.9711
519,520,80927,144,3525,340.783,43.2706,46.7294,99.5163
520,521,559,1668,3309,275.774,86.3458,3.65417,99.9943
521,522,632,3290,3316,352.707,51.4404,38.5596,99.7927
522,523,15959,1617,3378,151.326,23.1756,66.8244,99.9873
523,524,43420,3223,3418,2.67137,54.2508,35.7492,97.3228
524,525,2987,1835,3336,148.089,49.3546,40.6454,98.2257
525,526,2394,2705,3334,126.093,21.9851,68.0149,99.9919
526,527,906,3352,3326,325.371,23.8658,66.1342,99.7576
527,528,1722,2081,3345,145.722,24.4645,65.5355,99.9072
528,529,652,1061,3339,147.72799999999995,37.7379,52.2621,99.9668
529,530,20245,619,3417,343.426,39.8112,50.1888,99.9901
530,531,639,2595,3344,352.292,2.29022,87.7098,99.9909
531,532,10993,2027,3391,149.386,36.5972,53.4028,98.5379
532,533,776,2891,3361,337.365,36.9324,53.0676,99.9826
533,534,2278,2517,3364,349.598,1.44373,88.5563,99.8164
534,535,13161,1021,3416,174.11,21.2203,68.7797,99.9179
535,536,652,2664,3354,5.85569,74.8875,15.1125,99.6184
536,537,3214,2447,3374,173.21,72.1948,17.8052,99.9899
537,538,17407,2654,3419,159.001,17.358,72.642,99.9343
538,539,3315,2942,3385,351.622,46.5072,43.4928,99.9749
539,540,1426,56,3386,142.441,7.31761,82.6824,99.8214
540,541,10295,840,3410,334.441,82.98299999999998,7.01698,99.8564
541,542,8184,1763,3405,314.9290000000001,54.0493,35.9507,99.9604
542,543,2529,2748,3395,334.218,38.3025,51.6975,99.9972
543,544,1385,525,3381,355.1430000000001,5.29796,84.70200000000001,99.9795
544,545,12825,1151,3430,165.896,24.6997,65.3003,99.9379
545,546,1815,292,3408,152.583,51.4455,38.5545,99.9927
546,547,508,1110,3385,342.1330000000001,51.9666,38.0334,99.8504
547,548,1012,2155,3389,353.775,41.4753,48.5247,99.9901
548,549,3625,463,3413,155.743,68.4792,21.5208,99.9937
549,550,6057,3006,3440,153.017,60.4288,29.5712,99.9944
550,551,23279,2816,3478,342.343,25.4781,64.5219,99.0535
551,552,1677,2904,3414,334.932,39.1598,50.8402,99.9634
552,553,3715,757,3430,345.2680000000001,60.6949,29.3051,99.989
553,554,43244,2209,3507,351.32199999999995,6.77946,83.2205,99.4462
554,555,17396,2506,3459,199.125,68.8343,21.1657,99.9636
555,556,20194,602,3509,250.384,81.5453,8.45466,99.5844
556,557,1537,256,3434,237.595,79.1502,10.8498,99.9939
557,558,8981,1554,3460,226.878,77.567,12.433,99.9783
558,559,3573,1876,3447,198.105,82.296,7.70395,99.9847
559,560,21664,1981,3552,154.715,2.09442,87.9056,84.4227
560,561,5897,2960,3496,147.25,20.5131,69.4869,99.9681
561,562,1779,1674,3463,284.19,85.2288,4.77118,99.9941
562,563,3822,926,3475,8.94766,56.7174,33.2826,99.9666
563,564,21313,500,3569,155.842,17.2899,72.7101,99.7222
564,565,3368,296,3473,234.197,79.6032,10.3968,99.9517
565,566,3727,1813,3478,159.255,39.6135,50.3865,99.9409
566,567,1927,3238,3465,140.20600000000002,53.2493,36.7507,99.9812
567,568,1163,3303,3460,326.5370000000001,26.9682,63.0318,99.8538
568,569,34235,757,3569,339.08,42.984,47.01600000000001,99.7023
569,570,33337,1079,3550,156.34799999999996,41.5642,48.4358,99.9583
570,571,12617,3134,3511,139.16899999999998,57.3244,32.6756,99.9143
571,572,13112,1708,3559,305.36,83.8532,6.14676,99.6111
572,573,8452,3258,3532,329.376,16.4132,73.5868,99.8058
573,574,9756,2636,3533,345.958,43.3872,46.6128,99.0049
574,575,9772,1852,3536,171.62599999999995,38.5215,51.4785,95.5485
575,576,17886,378,3597,335.176,56.1764,33.8236,99.1582
576,577,2141,1369,3511,170.68,1.77972,88.2203,99.4571
577,578,2491,910,3542,157.672,8.379710000000001,81.6203,99.9464
578,579,95869,2807,3709,161.632,52.9826,37.0174,99.6828
579,580,1815,2064,3537,144.529,12.9155,77.0845,99.9717
580,581,2739,2913,3550,355.349,36.3566,53.6434,99.8432
581,582,4384,1564,3586,166.755,12.8208,77.1792,99.9325
582,583,26702,2630,3620,258.847,81.3864,8.61364,99.9607
583,584,43264,3132,3702,356.165,37.5647,52.4353,99.9321
584,585,946,2101,3575,164.083,40.9451,49.0549,99.9948
585,586,25669,3297,3692,147.269,4.01382,85.9862,98.5387
586,587,5445,455,3607,348.255,11.8292,78.1708,99.837
587,588,798,1626,3584,351.0,40.2705,49.7295,99.994
588,589,588,946,3588,138.009,59.1398,30.8602,99.9778
589,590,4727,897,3620,143.248,31.5761,58.4239,99.9903
590,591,766,2390,3596,351.2030000000001,4.3591,85.6409,99.9984
591,592,35303,1675,3681,173.405,20.3179,69.6821,99.7679
592,593,5123,2128,3621,170.90599999999995,12.492,77.508,99.9619
593,594,26084,1885,3706,192.812,58.3913,31.6087,74.8123
594,595,27240,2299,3673,349.8730000000001,24.4124,65.5876,99.8941
595,596,6620,356,3650,171.649,8.47446,81.5255,99.9799
596,597,1085,963,3622,324.398,16.1161,73.8839,99.9634
597,598,1109,1507,3631,167.429,12.91,77.09,99.9536
598,599,1579,2479,3642,144.541,14.8988,75.1012,99.9931
599,600,43786,964,3836,336.869,9.56547,80.4345,99.1733
600,601,1112,1815,3660,177.80900000000003,12.8998,77.1002,99.9964
601,602,21396,832,3706,142.086,48.6873,41.3127,99.9489
602,603,6177,282,3679,166.16400000000004,12.0645,77.9355,99.9049
603,604,10972,180,3722,156.44899999999996,13.5699,76.4301,99.7573
604,605,4184,2053,3665,351.927,51.4708,38.5292,99.979
605,606,2936,3191,3691,175.28799999999995,54.7853,35.2147,99.9587
606,607,8276,1467,3736,40.696,75.0622,14.9378,97.394
607,608,4264,1391,3706,337.38199999999995,7.82442,82.1756,99.9723
608,609,3123,2136,3686,340.728,49.5797,40.4203,99.997
609,610,2205,2376,3689,299.516,80.8682,9.13179,99.9958
610,611,1164,1557,3696,64.8595,72.9567,17.0433,99.9811
611,612,16291,1133,3764,163.99,33.9635,56.0365,99.9464
612,613,1188,1189,3687,355.088,1.17179,88.8282,99.9953
613,614,2653,1243,3699,167.833,60.5986,29.4014,99.9964
614,615,14230,612,3741,355.934,1.81541,88.1846,99.98
615,616,28813,2468,3780,354.862,49.1771,40.8229,99.9678
616,617,5572,1583,3742,120.102,86.2356,3.76442,99.9871
617,618,35575,2154,3798,159.159,18.8384,71.1616,99.9276
618,619,1816,702,3723,162.73,1.92653,88.0735,99.9955
619,620,584,3036,3712,165.831,48.9568,41.0432,99.9896
620,621,31441,456,3836,142.47,27.6831,62.3169,99.8608
621,622,1041,731,3732,169.294,1.72357,88.2764,99.9913
622,623,5733,1226,3762,146.872,39.1656,50.8344,99.6817
623,624,2433,1282,3728,2.783,52.6569,37.3431,99.9976
624,625,3691,2823,3741,149.597,16.3167,73.6833,99.9778
625,626,661,964,3729,161.485,17.1172,72.8828,99.8032
626,627,803,2359,3726,10.7447,79.8365,10.1635,99.9967
627,628,1087,2165,3729,325.79,5.70911,84.2909,99.8716
628,629,10530,339,3778,327.283,31.3302,58.6698,99.3544
629,630,4366,1322,3767,163.222,55.7408,34.2592,99.9614
630,631,1101,307,3743,157.108,16.4949,73.5051,99.9899
631,632,6006,1986,3820,161.889,33.7877,56.2123,99.6432
632,633,9668,1614,3800,160.667,17.9065,72.0935,99.8953
633,634,1405,3022,3753,137.237,5.60074,84.3993,99.9883
634,635,1174,1394,3760,4.02654,50.2873,39.7127,99.911
635,636,4880,2321,3784,134.012,55.8848,34.1152,99.9941
636,637,1409,24,3770,356.784,83.935,6.06505,99.9751
637,638,24695,141,3883,349.617,5.4846900000000005,84.5153,99.9174
638,639,4068,721,3791,341.329,8.56198,81.438,99.946
639,640,6141,821,3806,11.1201,68.7987,21.2013,99.9709
640,641,3140,2875,3800,357.7,58.284,31.716,99.9056
641,642,12736,3039,3845,34.3114,57.9346,32.0654,99.8653
642,643,4018,389,3815,322.081,58.849,31.151,99.9408
643,644,1514,43,3819,122.925,66.0597,23.9403,99.8875
644,645,742,216,3795,137.67700000000002,35.1855,54.8145,99.6909
645,646,1460,1058,3808,144.362,77.7574,12.2426,99.8819
646,647,17525,3261,3939,162.251,44.1505,45.8495,97.6701
647,648,30812,1698,3879,172.39,1.48502,88.515,99.964
648,649,6188,1880,3818,337.595,4.19159,85.8084,99.9333
649,650,6856,1440,3833,5.12443,50.4871,39.5129,99.9379
650,651,693,1330,3816,151.658,1.49827,88.5017,99.9901
651,652,2718,214,3840,343.952,54.8772,35.1228,99.8588
652,653,6747,657,3845,157.869,45.2321,44.7679,99.9915
653,654,41893,1303,3913,175.958,51.5989,38.4011,99.9767
654,655,1247,3323,3830,150.715,57.5754,32.4246,99.774
655,656,584,2024,3838,85.7858,58.9521,31.0479,99.9447
656,657,750,3289,3830,148.036,51.1272,38.8728,99.897
657,658,4981,570,3875,198.151,13.8364,76.1636,99.97
658,659,1862,2074,3853,72.01899999999998,62.9255,27.0745,99.9794
659,660,580,743,3831,185.144,14.1507,75.8493,99.9952
660,661,1250,2615,3850,139.312,25.8107,64.1893,99.9868
661,662,899,773,3836,182.758,22.2221,67.7779,99.9763
662,663,863,1085,3837,316.566,55.1101,34.8899,99.9741
663,664,2055,2376,3853,160.644,41.3841,48.6159,99.5758
664,665,2805,3340,3876,350.916,71.1106,18.8894,99.6722
665,666,3736,273,3874,358.477,46.3542,43.6458,99.6619
666,667,20087,2952,3910,185.121,37.8222,52.1778,99.9279
667,668,4234,1526,3878,155.839,6.33009,83.6699,99.9892
668,669,4011,1036,3878,317.83,59.0759,30.9241,99.9964
669,670,22146,2561,3928,223.826,42.411,47.589,99.9364
670,671,23487,802,3917,349.029,6.06351,83.9365,99.9766
671,672,51276,1897,3984,335.0490000000001,21.3161,68.6839,99.4119
672,673,2018,1127,3883,160.343,14.7553,75.2447,99.9923
673,674,5158,2384,3898,182.681,43.2866,46.7134,98.562
674,675,6699,1475,3930,169.327,7.05399,82.946,99.7764
675,676,37055,2129,4013,155.401,46.3516,43.6484,95.8477
676,677,18661,2206,3928,212.82,83.65100000000002,6.349,99.9791
677,678,3583,658,3911,353.246,4.49078,85.5092,99.9931
678,679,13673,2811,3943,345.1430000000001,37.9712,52.0288,99.769
679,680,2188,1090,3917,349.6269999999999,9.90373,80.0963,99.9802
680,681,725,2719,3898,155.4,33.5955,56.4045,99.9921
681,682,6957,3198,3952,142.571,13.0891,76.9109,99.9672
682,683,4426,2684,3948,183.855,23.9229,66.0771,99.8469
683,684,4166,3098,3930,1.01241,78.5759,11.4241,99.9953
684,685,724,3366,3922,348.8640000000001,73.1494,16.8506,99.8787
685,686,663,367,3924,132.485,2.84761,87.1524,99.9402
686,687,10449,1038,3971,325.373,49.5674,40.4326,99.975
687,688,6006,1134,3971,351.486,1.218,88.78200000000002,99.5566
688,689,7401,574,3951,147.787,50.0378,39.9622,99.9765
689,690,1650,1552,3941,145.533,54.7852,35.2148,99.9935
690,691,12981,2391,3964,3.54937,58.6466,31.3534,99.9722
691,692,49769,243,4106,333.934,53.4067,36.5933,99.1671
692,693,9648,1186,4006,344.80800000000005,1.51122,88.4888,98.2757
693,694,98332,507,4175,191.032,15.0946,74.9054,99.7092
694,695,2113,3130,3970,31.9017,59.6282,30.3718,99.9578
695,696,6493,39,3994,5.06037,64.1198,25.8802,99.7459
696,697,2283,1608,3968,336.266,24.8549,65.1451,99.98
697,698,4507,2745,3993,176.078,37.8945,52.1055,99.9833
698,699,4690,657,4004,191.094,14.7022,75.2978,99.7706
699,700,1172,1536,3984,326.81,42.8225,47.1775,99.9638
700,701,2440,728,4000,272.205,81.6325,8.36753,99.7051
701,702,561,3079,3985,158.132,34.0306,55.9694,99.977
702,703,10234,2603,4048,6.9081899999999985,58.5933,31.4067,99.9236
703,704,41401,1572,4067,132.91,67.4296,22.5704,68.8528
704,705,3833,1761,4027,186.463,14.3986,75.6014,99.8973
705,706,14431,2948,4041,37.5338,57.99,32.01,99.832
706,707,3498,811,4006,178.19099999999997,55.3739,34.6261,99.9882
707,708,19646,3185,4070,334.2530000000001,1.31591,88.6841,99.8939
708,709,50081,2442,4131,342.912,38.4728,51.5272,99.4493
709,710,5795,122,4051,154.701,1.26611,88.7339,99.9851
710,711,14696,1301,4101,326.466,49.8598,40.1402,99.8653
711,712,2713,2809,4048,319.67,64.9093,25.0907,99.8074
712,713,1544,3050,4043,149.62,50.4037,39.5963,99.9633
713,714,2082,728,4050,189.892,12.6992,77.3008,99.9977
714,715,6981,2647,4095,20.1001,56.0212,33.9788,99.9972
715,716,25909,1052,4106,173.234,45.3817,44.6183,99.8012
716,717,11802,820,4081,305.657,80.5844,9.41559,99.9868
717,718,667,1064,4047,153.60399999999996,3.21104,86.789,99.9955
718,719,7110,2734,4077,340.579,35.3819,54.6181,99.9729
719,720,1452,2843,4072,164.49,26.0587,63.9413,99.9932
720,721,12960,1719,4138,137.006,42.2469,47.7531,99.9913
721,722,4112,41,4086,135.384,26.0189,63.9811,99.8206
722,723,2468,1221,4083,9.49891,70.5175,19.4825,99.9924
723,724,3255,1447,4120,138.069,46.0776,43.9224,99.7798
724,725,581,2381,4068,340.334,42.953,47.047,99.7563
725,726,7684,3063,4112,351.213,43.9718,46.0282,99.9578
726,727,3520,3322,4101,353.36300000000006,55.9873,34.0127,99.4757
727,728,24360,2235,4188,349.487,27.9494,62.0506,99.9834
728,729,4312,2030,4123,353.458,83.0751,6.92495,99.9913
729,730,30873,2898,4173,356.6,40.6014,49.3986,99.7412
730,731,1290,2328,4097,109.249,70.8966,19.1034,99.9855
731,732,5387,2117,4122,15.9683,42.6706,47.3294,99.9961
732,733,656,2795,4106,2.84973,55.1754,34.8246,99.9976
733,734,882,1826,4108,154.123,8.74783,81.2522,99.9896
734,735,3040,1889,4121,354.94699999999995,40.3221,49.6779,99.9559
735,736,6854,71,4138,332.661,63.2811,26.7189,99.8827
736,737,2306,3141,4132,183.329,38.2445,51.7555,99.9968
737,738,31677,1211,4230,6.22536,84.4803,5.51967,99.9476
738,739,14091,948,4181,171.308,29.5581,60.4419,99.9438
739,740,2145,1777,4154,334.051,21.132,68.868,99.9947
740,741,4320,2725,4155,156.16299999999995,58.987,31.013,99.9902
741,742,14974,1888,4187,315.891,65.3401,24.6598,99.9862
742,743,8351,1338,4191,16.1745,67.4301,22.5699,99.9571
743,744,580,362,4154,190.062,13.1144,76.8856,99.9893
744,745,514,771,4142,4.52398,2.89316,87.1068,99.9972
745,746,2433,3318,4165,183.068,52.34,37.66,99.4657
746,747,3371,2595,4186,170.513,24.9142,65.0858,99.8555
747,748,10504,159,4203,199.71,84.8229,5.1771400000000005,99.9959
748,749,78761,1458,4407,160.882,27.6683,62.3317,92.5923
749,750,4853,2070,4180,175.951,16.2649,73.7351,99.9883
750,751,31844,3147,4221,223.641,63.5138,26.4862,99.9639
751,752,23729,2681,4257,328.889,46.2542,43.7458,99.9494
752,753,22761,779,4254,346.016,44.3694,45.6306,99.9317
753,754,1971,855,4185,358.773,12.0515,77.9485,99.9716
754,755,1509,2156,4179,340.73,35.571,54.429,99.9958
755,756,7531,1593,4202,324.887,44.2484,45.7516,99.9102
756,757,2942,71,4204,151.89600000000004,48.8922,41.1078,99.8814
757,758,3774,29,4235,134.578,25.9996,64.0004,99.8253
758,759,2805,1744,4224,165.327,21.6442,68.3558,99.9903
759,760,9796,2117,4251,318.039,77.5047,12.4953,99.9617
760,761,4862,3331,4251,352.7940000000001,60.2657,29.7343,99.5844
761,762,1366,2748,4225,359.112,43.8437,46.1563,99.9954
762,763,13307,1953,4263,173.007,31.0844,58.9156,99.963
763,764,17524,1795,4298,310.681,35.9246,54.0754,99.9926
764,765,5533,1022,4264,140.974,6.35229,83.6477,99.9835
765,766,550,497,4230,156.711,55.7033,34.2967,99.9958
766,767,5212,1572,4265,141.233,49.0925,40.9075,99.9928
767,768,16376,2919,4290,123.186,71.2159,18.7841,99.9831
768,769,10725,913,4299,188.889,70.5339,19.4661,99.938
769,770,8727,2312,4287,157.924,82.2111,7.7889300000000015,99.9857
770,771,4019,1685,4265,333.607,61.4939,28.5061,99.9663
771,772,1398,645,4262,179.135,39.5457,50.4543,99.997
772,773,889,2394,4268,348.09,5.79047,84.2095,99.9987
773,774,1417,3272,4280,345.17,38.7157,51.2843,99.9973
774,775,25808,1227,4347,137.533,46.9986,43.0014,99.8982
775,776,8197,2520,4304,179.264,20.951,69.04899999999999,99.9521
776,777,87067,1916,4472,342.61300000000006,46.3815,43.6185,93.6747
777,778,2223,687,4300,139.78,22.5022,67.4978,99.9981
778,779,5367,109,4315,309.512,86.3651,3.63491,99.9797
779,780,4161,1607,4322,337.269,60.8935,29.1065,99.996
780,781,1462,3227,4295,136.101,22.3525,67.6475,99.9978
781,782,35493,294,4382,166.34599999999998,35.2368,54.7632,99.8421
782,783,1403,22,4303,300.13,85.1972,4.80277,99.9584
783,784,24146,3024,4400,218.692,66.0779,23.9221,99.9578
784,785,28989,2480,4396,175.981,37.6832,52.3168,99.7805
785,786,6951,3105,4326,346.102,41.3235,48.6765,99.9934
786,787,35171,619,4419,170.579,64.6279,25.3721,99.8951
787,788,5101,1669,4337,169.87099999999995,14.2936,75.7064,99.6958
788,789,3875,2781,4335,124.666,32.6371,57.3629,99.989
789,790,4879,617,4321,341.311,47.702,42.298,99.9911
790,791,7788,3215,4342,214.237,64.4296,25.5704,99.9774
791,792,1000,2380,4325,177.293,35.8338,54.1662,99.9765
792,793,54880,2255,4439,324.505,53.6363,36.3637,99.8768
793,794,1112,39,4350,292.532,86.1297,3.87032,99.9651
794,795,6465,3292,4374,225.506,70.9764,19.0236,99.8287
795,796,898,987,4349,141.519,5.9744,84.0256,99.9969
796,797,3165,818,4359,151.002,0.483765,89.5162,99.9871
797,798,1377,1036,4351,335.167,87.2355,2.7644900000000003,99.9725
798,799,1766,2688,4355,169.324,37.4532,52.5468,99.9576
799,800,1506,647,4356,176.96400000000003,43.2177,46.7823,99.8705
800,801,2754,1087,4375,80.3714,87.7364,2.26356,99.9823
801,802,10249,2893,4399,201.658,52.605,37.395,99.9809
802,803,5623,2633,4400,122.687,32.2854,57.7146,99.9867
803,804,1250,909,4367,165.227,27.0035,62.9965,99.9538
804,805,1016,111,4366,152.487,39.0148,50.9852,99.9941
805,806,22422,2787,4436,350.916,56.2495,33.7505,99.9666
806,807,3430,1731,4391,165.023,34.1846,55.8154,99.9931
807,808,11917,1626,4429,358.208,67.7396,22.2604,99.9943
808,809,11623,986,4422,7.267139999999999,6.09455,83.9054,99.9559
809,810,15085,95,4427,298.991,82.2651,7.7349,99.8323
810,811,1847,3152,4394,187.314,24.9555,65.0445,99.9904
811,812,8989,1216,4426,161.60399999999996,24.5709,65.4291,99.9137
812,813,1417,871,4395,345.422,41.9149,48.0851,99.9923
813,814,728,2337,4391,337.756,28.124,61.87600000000001,99.9931
814,815,33776,893,4526,147.636,40.771,49.229,99.8027
815,816,19944,1067,4522,329.676,76.5306,13.4694,99.3802
816,817,2391,2343,4434,170.32299999999995,19.8183,70.1817,99.9619
817,818,1083,486,4432,348.76199999999994,49.7804,40.2196,99.9436
818,819,2703,1707,4445,167.047,5.17508,84.8249,99.9714
819,820,12397,1169,4500,129.95,2.07917,87.9208,99.9369
820,821,1673,755,4451,313.952,64.6594,25.3406,99.982
821,822,6367,2345,4478,131.718,48.0866,41.9134,99.9198
822,823,4328,1330,4477,313.575,44.2872,45.7128,99.9591
823,824,1221,505,4457,319.456,58.4955,31.5045,99.9744
824,825,13377,212,4500,169.457,25.0272,64.9728,99.7447
825,826,4027,2624,4487,2.2795400000000003,7.999919999999999,82.0001,99.9647
826,827,3021,2543,4489,148.083,51.5236,38.4764,99.9287
827,828,13066,704,4526,165.298,35.1626,54.8374,99.882
828,829,2210,2151,4482,184.39,76.2135,13.7865,99.9963
829,830,538,438,4477,348.099,68.5447,21.4553,99.9629
830,831,3156,2720,4495,1.97354,9.82294,80.1771,99.9965
831,832,699,476,4487,348.449,45.1533,44.8467,99.926
832,833,10117,375,4514,153.714,64.7452,25.2548,99.9401
833,834,1444,971,4486,338.386,59.5695,30.4305,99.9713
834,835,20171,63,4571,334.9430000000001,84.7546,5.2453699999999985,99.9251
835,836,5239,1699,4518,157.755,13.6419,76.3581,99.8052
836,837,4013,1228,4537,311.683,44.5673,45.4327,99.9855
837,838,4084,2173,4546,161.061,15.962,74.038,99.0357
838,839,61359,401,4633,343.847,36.2705,53.7295,99.4089
839,840,6940,1593,4577,323.018,33.0087,56.9913,99.9256
840,841,6355,592,4588,290.942,53.6588,36.3412,99.9517
841,842,6283,833,4589,149.322,27.2438,62.7562,99.9358
842,843,2585,2093,4566,169.63,16.2282,73.7718,99.8979
843,844,4866,1293,4584,316.372,29.2262,60.7738,99.9291
844,845,821,161,4556,351.01199999999994,42.6091,47.3909,99.9027
845,846,6446,717,4604,161.952,22.8256,67.1744,99.8876
846,847,3110,1509,4591,325.517,36.6581,53.3419,99.9958
847,848,1027,1221,4580,322.594,72.4968,17.5032,99.996
848,849,4725,1664,4607,4.58306,63.9949,26.0051,99.9788
849,850,4222,1151,4616,320.065,32.4032,57.5968,99.9124
850,851,858,134,4620,347.69699999999995,5.09282,84.9072,99.9927
851,852,2332,176,4625,350.291,5.07566,84.9243,99.9945
852,853,694,1329,4616,154.499,32.2965,57.7035,99.8052
853,854,1847,1209,4616,153.982,22.7523,67.2477,99.9953
854,855,2243,806,4624,169.56599999999997,74.4919,15.5081,99.9834
855,856,1468,1361,4636,335.019,41.1966,48.8034,99.9409
856,857,3155,1249,4649,310.506,71.5374,18.4626,99.9878
857,858,1436,1052,4649,163.265,44.7211,45.2789,99.9449
858,859,866,1324,4656,320.914,31.1554,58.8446,99.9481
859,860,846,39,4701,351.081,17.0844,72.9156,99.958
