,Grain No.,Size [Pixel],center x-coordinate,center y-coordinate,mean azimuth [degree],mean latitude [degree],mean colatitude [degree],Regelungsgrad [%]
0,1,24955,1814,103,120.277,41.9112,48.0888,99.9295
1,2,1810,1950,43,281.789,29.4483,60.5517,99.9917
2,3,14638,2036,111,115.495,32.5795,57.4205,99.1959
3,4,5730,2157,72,99.8806,68.3456,21.6544,99.9799
4,5,3817,2262,56,98.5914,21.255,68.745,99.9956
5,6,45689,2263,179,99.6297,17.855,72.145,99.9456
6,7,3077,2562,71,278.91,42.3597,47.6403,99.9699
7,8,131694,2920,324,100.956,20.1085,69.8915,99.9562
8,9,674,2991,57,106.244,10.5352,79.4648,99.9373
9,10,8277,3058,110,119.925,10.6132,79.3868,99.9696
10,11,11343,3184,90,285.494,15.3143,74.6857,99.9919
11,12,4468,3314,101,295.091,8.806410000000003,81.1936,99.9851
12,13,764,1690,72,115.325,42.8133,47.1867,99.9942
13,14,15015,2694,134,93.2827,18.9986,71.0014,99.9897
14,15,872,2604,104,99.3586,38.9181,51.0819,99.964
15,16,161941,1640,403,271.237,28.2062,61.7938,93.8859
16,17,1038,1956,108,271.52,19.4421,70.5579,99.9929
17,18,1251,2130,113,265.85400000000004,52.1695,37.8305,99.9799
18,19,41685,2584,258,105.227,38.7898,51.2102,99.8896
19,20,27829,1422,218,115.197,41.8786,48.1214,99.8291
20,21,95326,3241,440,99.0723,22.1063,67.8937,99.9595
21,22,2336,3220,141,293.51,3.43802,86.56200000000003,99.9965
22,23,650,3358,152,99.2366,21.8337,68.1663,99.9934
23,24,5542,3121,180,128.013,27.5063,62.4937,99.9879
24,25,700,2742,179,95.4895,19.5204,70.4796,99.9673
25,26,5367,2371,210,91.0,17.5821,72.4179,99.9991
26,27,55773,1944,324,274.2,19.0522,70.9478,99.8868
27,28,12148,1178,222,277.973,67.5695,22.4304,99.9593
28,29,22528,3301,293,91.0,21.9439,68.0561,99.9978
29,30,24745,227,300,124.483,84.3496,5.65042,99.8999
30,31,19626,1013,286,95.6479,10.3064,79.6936,98.7714
31,32,30715,511,260,106.268,18.8314,71.1686,95.0991
32,33,624,129,214,145.882,84.3686,5.63145,99.8969
33,34,4440,2055,232,109.216,35.4498,54.5502,99.9731
34,35,24665,865,308,103.686,29.988000000000003,60.012,99.9143
35,36,1473,1303,262,111.717,37.1511,52.8489,99.9927
36,37,623,2442,266,271.0,0.256805,89.7432,99.9995
37,38,13873,603,331,113.594,84.3984,5.60159,99.9528
38,39,1919,2409,291,110.979,37.1617,52.8383,99.966
39,40,969,1255,287,278.83,28.1964,61.8036,99.992
40,41,3999,1178,295,267.163,67.7049,22.2951,99.9847
41,42,1947,328,305,284.44,23.5182,66.4818,99.9878
42,43,1991,2480,318,283.526,0.472,89.52799999999998,99.8592
43,44,1598,2368,319,91.0,18.2623,71.7377,99.9991
44,45,500,2885,312,101.057,19.8305,70.1695,99.9985
45,46,543,154,342,130.20600000000002,84.2463,5.75371,99.9071
46,47,12808,1373,371,110.93,30.4587,59.5413,99.9414
47,48,52596,745,468,105.566,10.4523,79.5477,99.9318
48,49,6247,1138,367,117.18,40.4492,49.5508,99.9866
49,50,1598,2329,359,91.0,17.5693,72.4307,99.997
50,51,21540,2726,431,107.124,3.11386,86.8861,99.9906
51,52,603,2809,355,100.968,19.7743,70.2257,99.9967
52,53,1904,2865,359,91.0,19.7719,70.2281,99.9995
53,54,1171,1225,356,261.117,67.7438,22.2562,99.996
54,55,1737,341,365,283.918,50.5892,39.4108,99.9499
55,56,8688,417,393,130.971,67.4346,22.5654,99.9791
56,57,2025,503,369,287.176,71.0857,18.9143,99.8541
57,58,6885,2107,395,284.945,35.753,54.247,99.9925
58,59,1514,1065,382,133.083,65.79,24.21,99.9825
59,60,1514,1272,412,103.846,31.3464,58.6536,99.9783
60,61,3087,307,403,284.775,21.9159,68.0841,99.9899
61,62,8552,2369,436,98.9749,17.1574,72.8426,99.9778
62,63,40985,2532,502,247.779,47.7836,42.2164,99.8001
63,64,935,147,401,284.462,12.63,77.37,99.6995
64,65,73565,341,568,282.661,42.3787,47.6213,91.7784
65,66,3012,1214,417,270.956,42.7462,47.2538,99.8721
66,67,833,2381,403,91.0,16.8707,73.1293,99.999
67,68,1146,173,418,287.355,13.0546,76.9454,99.9678
68,69,1738,610,424,107.555,8.242469999999999,81.7575,99.9866
69,70,593,1048,417,278.084,43.1765,46.8235,99.958
70,71,1646,1112,427,110.054,42.875,47.125,99.9726
71,72,4631,935,482,147.632,73.3359,16.6641,99.6284
72,73,49534,2202,532,273.933,0.350502,89.6495,97.2629
73,74,1143,1164,433,271.795,47.2766,42.7234,99.9887
74,75,1358,908,434,136.429,61.5127,28.4873,99.9867
75,76,14682,1264,536,276.415,42.0488,47.9512,99.9425
76,77,2234,1122,481,280.697,39.173,50.827,99.9714
77,78,709,336,459,117.589,45.5721,44.4279,99.9725
78,79,881,1166,463,261.076,44.5997,45.4003,99.7218
79,80,9663,1941,527,106.766,35.54,54.46,99.8576
80,81,621,1501,477,142.815,57.0353,32.9647,99.6601
81,82,929,1190,487,273.462,40.9112,49.0888,99.9093
82,83,11419,1068,539,317.129,77.3645,12.6355,99.3812
83,84,558,133,500,292.105,53.9152,36.0848,99.7846
84,85,2710,2394,505,212.647,89.0515,0.948532,99.9886
85,86,4361,2773,529,284.208,15.6876,74.3124,99.9815
86,87,992,578,517,125.655,73.2948,16.7052,99.2463
87,88,1059,1158,520,129.213,40.0081,49.9919,99.6325
88,89,975,3405,540,264.627,3.52945,86.4706,99.9322
89,90,6519,2666,567,282.052,6.13211,83.8679,99.9664
90,91,2007,944,558,103.494,31.9577,58.0423,99.9702
91,92,1164,880,567,112.221,69.0626,20.9374,99.9608
92,93,158533,696,767,299.6740000000001,80.4128,9.58722,99.7883
93,94,10788,350,619,274.275,27.3257,62.6743,99.9791
94,95,28418,2032,674,103.742,47.54600000000001,42.45399999999999,99.9459
95,96,2349,2393,584,91.2854,0.0692902,89.9307,99.9953
96,97,1371,986,577,99.8786,24.0483,65.9517,99.9818
97,98,12412,1529,641,110.956,27.872,62.128,99.9174
98,99,15801,2746,638,271.134,44.3805,45.6195,99.9009
99,100,3190,3017,605,160.278,79.1385,10.8615,99.883
100,101,20098,3158,696,108.738,64.0803,25.9197,99.8438
101,102,2046,3100,607,168.438,82.8008,7.1992,99.9584
102,103,2508,1036,610,127.849,39.5599,50.4401,99.9914
103,104,11796,2932,645,266.093,45.3933,44.6067,99.9823
104,105,854,2168,616,274.24,1.68245,88.3176,99.8873
105,106,11463,1644,713,105.597,48.3863,41.6137,99.9714
106,107,944,1204,615,124.83,40.8498,49.1502,99.9793
107,108,1668,1609,619,108.551,49.1819,40.8181,99.9934
108,109,3996,856,630,91.0,69.6912,20.3088,99.9998
109,110,647,259,608,286.932,39.1341,50.8659,99.9893
110,111,7792,1915,712,91.0,47.8169,42.1831,99.9959
111,112,4948,2135,642,280.808,1.45352,88.5465,99.9936
112,113,1639,1111,614,127.57,39.3186,50.6814,99.9917
113,114,1032,908,625,116.49,68.012,21.988000000000003,99.9902
114,115,39277,2509,708,291.118,88.2792,1.72079,99.8643
115,116,568,1772,631,277.35,17.6371,72.3629,99.9763
116,117,2124,2289,652,91.0,0.482384,89.5176,99.9969
117,118,524,1183,654,126.337,40.1104,49.8896,99.9933
118,119,9023,1722,735,91.0,48.4822,41.5178,99.9926
119,120,7551,3295,710,91.0,21.8742,68.1258,99.9984
120,121,719,3054,656,125.267,22.6228,67.3772,99.9912
121,122,5831,2150,719,296.235,11.0639,78.9361,99.9726
122,123,5646,1575,723,105.28,5.0591800000000005,84.9408,99.9883
123,124,1096,1843,688,271.0,38.3945,51.6055,99.9995
124,125,14509,3059,799,297.01,2.05792,87.9421,99.987
125,126,4695,2908,741,278.764,35.6197,54.3803,99.9872
126,127,567,767,708,304.683,78.5336,11.4664,99.9976
127,128,594,2725,708,273.92400000000004,44.824,45.176,99.9879
128,129,1878,1203,760,271.0,42.2676,47.7324,99.997
129,130,861,1679,752,105.519,47.9221,42.0779,99.997
130,131,549,1977,756,269.91,33.5582,56.4418,99.9716
131,132,5514,1299,806,271.0,42.9059,47.0941,99.9993
132,133,594,2152,763,296.47,10.4548,79.5452,99.9954
133,134,5712,1029,800,276.193,44.9435,45.0565,99.9629
134,135,8009,1524,814,262.357,28.411,61.589,99.7932
135,136,1431,3371,794,283.865,47.2463,42.7537,99.9946
136,137,6029,2662,856,277.134,24.6356,65.3644,99.987
137,138,3844,1351,834,271.0,42.9006,47.0994,99.9995
138,139,1096,2717,792,271.0,25.0088,64.9912,99.9996
139,140,5882,2979,853,91.5243,13.4809,76.5191,99.9677
140,141,22510,2550,867,223.014,68.0302,21.9698,97.3711
141,142,2959,1128,802,302.418,79.4886,10.5114,99.9613
142,143,28202,378,878,282.231,2.79623,87.2038,99.9757
143,144,1402,2734,834,321.48,16.5209,73.4791,99.9833
144,145,1086,2133,808,270.616,30.7565,59.2435,99.9885
145,146,2218,1192,831,271.0,42.9424,47.0576,99.9991
146,147,4163,1816,844,91.0003,47.8886,42.1114,99.9985
147,148,6720,2021,876,298.112,11.5411,78.4589,99.8866
148,149,84556,264,1117,110.998,0.125595,89.8744,99.9223
149,150,669,1925,819,104.251,47.0649,42.9351,99.9582
150,151,3899,2104,865,252.868,45.5912,44.4088,99.9865
151,152,2097,1329,885,255.563,41.7493,48.2507,99.9872
152,153,3204,3378,873,280.194,45.6886,44.3114,99.9902
153,154,5802,955,890,100.03,19.9982,70.0018,99.9371
154,155,553,2206,844,297.415,13.9066,76.0934,99.9917
155,156,3378,3137,870,286.681,1.38571,88.6143,99.9884
156,157,5635,1895,910,107.227,46.8441,43.1559,99.9319
157,158,1363,3318,859,286.781,43.8559,46.1441,99.9882
158,159,763,1959,857,104.864,47.3208,42.6792,99.9867
159,160,38612,1716,1012,107.119,47.7975,42.2025,99.97
160,161,27095,1120,933,101.203,4.13973,85.8603,99.9579
161,162,1029,1238,868,256.69,41.8702,48.1298,99.9942
162,163,504,2155,872,298.074,15.1144,74.8856,99.9674
163,164,1599,2896,871,91.4033,13.7274,76.2726,99.9972
164,165,813,153,874,110.997,1.89758,88.1024,99.9259
165,166,741,1530,870,99.6898,34.8326,55.1674,99.8153
166,167,3186,1462,901,95.6454,33.5821,56.4179,99.9255
167,168,3166,2448,908,89.8106,35.0712,54.9288,99.985
168,169,763,1583,878,108.89,12.7768,77.2232,99.9642
169,170,9061,1585,934,261.907,27.4834,62.5166,99.9363
170,171,1002,2176,903,292.303,4.03078,85.9692,99.9573
171,172,81160,3203,1064,99.41,25.8128,64.1872,98.5966
172,173,890,184,926,111.492,0.548607,89.4514,99.9415
173,174,2773,1818,923,92.1726,7.72302,82.277,99.9912
174,175,994,2074,919,267.036,62.9745,27.0255,99.9843
175,176,15523,2994,971,113.41,26.1416,63.8584,99.7593
176,177,5964,1374,953,259.943,37.132,52.868,99.9221
177,178,2983,2321,940,277.67,0.752731,89.2473,99.9688
178,179,4000,3154,945,111.615,74.9249,15.0751,99.9686
179,180,14026,528,988,103.367,20.3925,69.6075,99.434
180,181,1440,2889,945,275.775,24.6513,65.3487,99.8956
181,182,861,2142,928,293.344,2.63542,87.3646,99.9436
182,183,1492,913,957,98.8002,4.99557,85.0044,99.6163
183,184,2777,3100,955,104.463,58.874,31.126,99.9567
184,185,2630,1289,958,107.893,30.371,59.629,99.9878
185,186,607,160,956,282.081,55.0585,34.9415,99.956
186,187,12180,1983,1010,132.536,63.3814,26.6186,99.6291
187,188,1621,2752,968,97.896,24.6739,65.3261,99.9858
188,189,1110,2207,950,266.579,69.8542,20.1458,99.9802
189,190,12087,2120,994,296.501,9.72092,80.2791,99.9798
190,191,58428,2588,1079,257.556,57.986,32.014,99.9579
191,192,729,2847,954,145.279,79.6238,10.3762,99.9783
192,193,6544,1093,1006,264.653,28.8088,61.1912,99.9256
193,194,40378,1496,1072,97.9672,3.95482,86.0452,99.931
194,195,2216,1933,973,290.633,14.0541,75.9459,99.9673
195,196,1956,2414,973,36.4538,87.5508,2.44925,99.9919
196,197,12219,2809,1032,107.828,63.4475,26.5525,99.9861
197,198,2740,2217,999,204.47,64.5274,25.4726,99.9604
198,199,16943,425,1051,276.866,19.7991,70.2009,99.351
199,200,37480,2272,1103,96.9374,17.2676,72.7324,99.9778
200,201,30930,681,1077,186.46,72.7019,17.2981,99.581
201,202,639,3080,996,101.953,17.8514,72.1486,99.9879
202,203,716,2890,1020,267.959,23.9472,66.0528,99.9632
203,204,12857,1251,1058,169.025,78.6243,11.3757,99.9716
204,205,3306,2419,1037,103.429,0.486183,89.5138,99.9803
205,206,15920,1024,1103,86.7863,30.7677,59.2323,99.9724
206,207,508,2926,1032,145.44,76.56,13.44,99.9715
207,208,2564,1834,1050,258.067,46.2747,43.7253,99.9541
208,209,4661,867,1053,278.497,74.9867,15.0133,99.9377
209,210,759,135,1044,103.865,4.61696,85.383,99.9439
210,211,3947,557,1073,283.019,1.46371,88.5363,99.9422
211,212,8781,2132,1112,265.777,65.8585,24.1415,99.9025
212,213,3625,1158,1106,255.868,44.347,45.653,99.9721
213,214,13898,1997,1108,296.204,32.4731,57.5269,99.4954
214,215,692,2868,1078,165.896,80.2533,9.74673,99.9924
215,216,3664,796,1098,315.985,79.5894,10.4106,99.9874
216,217,1122,1349,1099,96.8212,4.2154300000000005,85.7846,99.9958
217,218,1715,2915,1082,269.86,24.6743,65.3257,99.9964
218,219,835,2730,1105,175.373,78.4247,11.5753,99.9834
219,220,550,2881,1121,157.201,82.4753,7.52465,99.9946
220,221,661,142,1115,109.952,0.297722,89.7023,99.835
221,222,893,1852,1126,91.0,6.26621,83.7338,99.9969
222,223,2754,911,1135,287.557,6.22825,83.7718,99.9708
223,224,16808,2853,1243,89.1169,25.6979,64.3021,99.9927
224,225,7369,523,1169,282.44,26.1162,63.8838,99.4923
225,226,61495,3246,1293,279.121,7.2054,82.7946,99.9377
226,227,1053,1724,1147,271.092,37.0237,52.9763,99.9968
227,228,2433,2896,1174,91.0,86.8264,3.17361,99.9992
228,229,1223,3408,1163,98.8796,59.2019,30.7981,99.9816
229,230,1076,133,1170,292.886,0.661057,89.3389,99.8489
230,231,20613,1082,1228,90.3819,24.4487,65.5513,99.9775
231,232,570,1381,1150,309.372,54.774,35.226,99.9722
232,233,589,2713,1168,93.4368,29.0984,60.9016,99.9677
233,234,29954,2301,1266,91.0,18.1261,71.8739,99.9881
234,235,10057,444,1217,83.4847,23.0622,66.9378,99.1879
235,236,584,2431,1166,113.841,37.5024,52.4976,99.9488
236,237,904,1667,1164,262.702,27.8349,62.1651,99.9894
237,238,593,2745,1175,89.1971,26.0641,63.9359,99.9985
238,239,1590,1607,1181,111.338,12.0765,77.9235,99.991
239,240,6481,2006,1224,295.039,4.96391,85.0361,99.7444
240,241,84676,744,1410,102.617,33.4502,56.5498,99.8092
241,242,22423,2532,1289,288.766,12.7504,77.2496,99.9382
242,243,4922,1428,1224,268.192,54.6876,35.3124,99.8993
243,244,137560,487,1542,89.7382,4.35915,85.6409,99.4579
244,245,1244,2110,1202,291.003,33.309,56.691,99.9881
245,246,7469,1602,1249,102.322,1.45869,88.5413,99.7002
246,247,658,1537,1209,261.767,31.109,58.89100000000001,99.9815
247,248,3984,3025,1238,121.879,20.9591,69.0409,99.9664
248,249,4322,950,1246,271.11400000000003,14.8187,75.1813,99.8927
249,250,1922,3396,1251,83.6174,60.3883,29.6117,99.9868
250,251,509,138,1236,288.956,1.02345,88.9765,99.878
251,252,17522,2070,1334,123.254,23.2834,66.7166,99.9737
252,253,2961,2642,1308,88.8736,26.1351,63.8649,99.9966
253,254,18019,1478,1327,256.348,29.5512,60.4488,99.5377
254,255,2584,387,1282,202.94,77.7374,12.2627,99.9726
255,256,3595,1154,1335,123.609,53.4067,36.5933,99.9827
256,257,88254,3077,1452,90.0079,8.967789999999997,81.0322,99.9438
257,258,5537,1957,1340,280.869,53.702,36.298,99.9176
258,259,2140,394,1324,88.6102,5.9798,84.0202,99.9417
259,260,1769,1095,1330,298.824,81.0039,8.99606,99.9851
260,261,1877,354,1348,210.152,79.6032,10.3968,99.9808
261,262,4935,1364,1378,213.354,82.3073,7.69274,99.9873
262,263,3734,1030,1344,287.293,0.539589,89.4604,99.7399
263,264,525,2816,1349,89.8046,25.8792,64.1208,99.995
264,265,952,951,1332,287.498,1.73792,88.2621,99.9122
265,266,604,1650,1327,123.534,21.7231,68.2769,99.9907
266,267,50484,1751,1474,111.192,35.2133,54.7867,99.7638
267,268,1978,423,1366,205.222,78.2285,11.7715,99.9908
268,269,1846,183,1378,273.908,49.8374,40.1626,99.9967
269,270,1704,2414,1361,90.9998,25.1061,64.8939,99.9977
270,271,1274,2711,1369,88.82,25.9361,64.0639,99.9983
271,272,11534,2492,1431,90.9061,25.5617,64.4383,99.8232
272,273,21831,1006,1495,195.474,81.4225,8.57752,99.5349
273,274,23486,2199,1451,113.083,15.3812,74.6188,99.6034
274,275,2900,1233,1397,213.852,81.9238,8.07616,99.9723
275,276,10585,1128,1463,93.14,28.316,61.684,99.872
276,277,40415,1535,1491,276.796,78.737,11.263,99.8531
277,278,1105,2598,1389,118.825,42.3325,47.6675,99.9662
278,279,39057,2369,1525,107.204,33.9205,56.0795,99.9691
279,280,1065,3414,1435,94.4871,57.9449,32.0551,99.9715
280,281,894,2700,1411,90.2373,25.9951,64.0049,99.9886
281,282,5541,221,1462,103.084,26.8448,63.1552,99.961
282,283,645,410,1416,205.071,76.6729,13.3271,99.9847
283,284,2136,1078,1455,287.394,5.88084,84.1192,99.9075
284,285,2286,2590,1442,254.931,60.3621,29.6379,99.9712
285,286,1592,2065,1439,283.372,53.3689,36.6311,99.9852
286,287,3718,2791,1484,256.493,68.2344,21.7656,99.9506
287,288,17395,2643,1504,118.938,20.3849,69.6151,99.9674
288,289,797,183,1447,271.442,31.8843,58.1157,99.9822
289,290,59936,1885,1601,294.503,65.8716,24.1284,99.7663
290,291,7602,1268,1460,98.7841,3.55972,86.4403,99.9877
291,292,1834,1400,1452,256.317,37.6225,52.3775,99.978
292,293,24744,1354,1608,268.773,20.4327,69.5673,99.9198
293,294,780,3419,1493,95.2811,57.7309,32.2691,99.9827
294,295,1502,264,1502,108.007,59.9133,30.0867,99.5605
295,296,1752,2759,1507,56.2001,73.8575,16.1425,99.9839
296,297,26067,2131,1586,278.534,2.81108,87.1889,99.9671
297,298,13127,1210,1553,279.617,5.5606,84.4394,99.9622
298,299,6048,2519,1575,109.349,13.7605,76.2395,99.8808
299,300,3309,933,1568,84.5148,5.00333,84.9967,99.9761
300,301,43187,3050,1615,104.275,77.2523,12.7477,99.8048
301,302,12543,209,1610,276.742,11.717,78.283,99.9394
302,303,572,1714,1535,239.483,69.3647,20.6353,99.7445
303,304,2223,875,1557,286.824,22.738000000000003,67.262,99.991
304,305,1808,3415,1583,89.0599,57.7926,32.2074,99.7679
305,306,123748,2750,1737,281.774,23.3895,66.6105,99.8852
306,307,4923,3337,1601,280.281,20.8477,69.1523,99.9731
307,308,58885,982,1733,171.61900000000003,74.6229,15.3771,99.9154
308,309,583,878,1607,284.269,1.10886,88.8911,99.9824
309,310,8569,1504,1663,288.673,10.1768,79.8232,99.7634
310,311,2089,674,1676,104.002,23.7933,66.2067,99.9871
311,312,503,1232,1622,280.656,6.39791,83.6021,99.9842
312,313,5257,3320,1655,55.4892,82.5854,7.4146,99.9851
313,314,583,3238,1652,261.22700000000003,73.5879,16.4121,99.9957
314,315,23971,2063,1733,240.935,71.0375,18.9625,99.7431
315,316,2056,2263,1676,292.899,67.3791,22.6209,99.9923
316,317,1009,1203,1651,282.953,10.1483,79.8517,99.9713
317,318,12458,329,1726,275.631,46.3711,43.6289,99.9588
318,319,1827,2373,1707,288.012,68.3846,21.6154,99.9862
319,320,884,3167,1683,91.0224,76.6022,13.3978,99.999
320,321,2061,2340,1735,290.913,68.13600000000001,21.864,99.9958
321,322,23994,3333,1761,101.747,54.5076,35.4924,99.841
322,323,16212,1558,1766,270.051,20.2485,69.7515,99.9586
323,324,627,2206,1698,294.7920000000001,67.3123,22.6877,99.9939
324,325,730,3225,1704,287.5420000000001,23.7688,66.2312,99.985
325,326,63553,347,1929,105.198,26.5553,63.4447,99.6915
326,327,1947,414,1743,272.53,47.0716,42.9284,99.9912
327,328,3706,3183,1757,282.897,23.6943,66.3057,99.9911
328,329,526,3139,1722,91.1874,77.1271,12.8729,99.9972
329,330,802,1409,1741,276.255,22.5791,67.4209,99.9536
330,331,773,688,1753,104.052,23.464,66.536,99.9914
331,332,699,2196,1761,293.293,67.5391,22.4609,99.9964
332,333,6531,452,1820,271.117,46.5693,43.4307,99.535
333,334,1554,3097,1758,280.30400000000003,23.13,66.87,99.9874
334,335,1234,1670,1779,288.887,60.746,29.254,99.9909
335,336,9621,1170,1834,268.312,23.7808,66.2192,99.9112
336,337,54746,2290,1905,287.693,67.0951,22.9049,99.9222
337,338,3561,206,1872,105.971,26.8943,63.1057,99.9872
338,339,16567,2576,1851,110.661,13.3016,76.6984,99.9113
339,340,37152,1926,1907,112.059,32.2682,57.7318,99.5922
340,341,1768,3409,1813,96.8613,53.9763,36.0237,99.8909
341,342,112955,1247,1967,285.342,2.22091,87.7791,99.8008
342,343,65358,3163,1943,110.146,1.863,88.137,99.7488
343,344,2280,614,1823,279.916,46.4385,43.5615,99.9805
344,345,1851,715,1832,262.198,44.6911,45.3089,99.9862
345,346,8569,2697,1872,264.663,47.0902,42.9098,99.9691
346,347,29080,1646,1967,287.652,59.7015,30.2985,99.709
347,348,38476,618,1948,31.5314,80.7596,9.24039,99.4715
348,349,565,762,1866,174.005,72.5521,17.4479,99.9854
349,350,2047,1270,1871,271.0,2.45661,87.5434,99.9997
350,351,13567,934,1922,260.81,24.7054,65.2946,99.8237
351,352,4362,3362,1909,271.567,23.6535,66.3465,99.9827
352,353,1291,3411,1889,274.957,23.2228,66.7772,99.8895
353,354,8360,806,1958,129.584,65.9111,24.0889,99.9586
354,355,932,754,1914,282.837,23.7366,66.2634,99.9275
355,356,506,2670,1911,273.327,44.4635,45.5365,99.9807
356,357,3229,2053,1949,107.187,2.74903,87.251,99.9456
357,358,32648,2530,2050,274.535,9.79309,80.2069,99.8394
358,359,687,2618,1942,105.557,33.7266,56.2734,99.9871
359,360,73112,2978,2104,290.235,18.3165,71.6835,99.8101
360,361,1202,2804,1966,108.731,47.6445,42.3555,99.9936
361,362,773,216,1972,102.903,45.6066,44.3934,99.9634
362,363,46486,2697,2104,109.219,46.8463,43.1537,99.946
363,364,8985,1989,2017,109.44,36.5554,53.4446,99.6443
364,365,1474,2380,1984,274.551,31.7764,58.2236,99.917
365,366,60079,301,2163,102.559,35.6698,54.3302,99.2721
366,367,9232,3351,2016,103.381,40.6692,49.3308,99.7333
367,368,77064,1919,2248,285.115,9.16174,80.8383,99.8194
368,369,723,3274,1988,103.369,54.9198,35.0802,99.985
369,370,88240,2310,2151,288.675,15.9796,74.0204,99.8949
370,371,1819,1752,2022,122.594,46.69,43.31,99.7792
371,372,609,598,2012,130.309,52.484,37.516,99.2423
372,373,8474,1169,2065,183.556,76.7836,13.2164,99.96
373,374,1075,835,2030,186.251,79.0298,10.9702,99.9509
374,375,740,2584,2024,277.317,22.6748,67.3252,99.9874
375,376,1082,524,2033,110.856,46.6395,43.3605,99.9822
376,377,55063,3316,2197,285.586,12.1225,77.8775,99.7046
377,378,3765,780,2063,274.883,40.8134,49.1866,99.8554
378,379,10026,606,2096,283.985,43.5164,46.4836,99.8848
379,380,37124,1459,2183,285.509,8.84463,81.1554,99.731
380,381,1555,1315,2099,98.2906,5.58681,84.4132,99.9911
381,382,3314,870,2107,283.906,3.97147,86.0285,99.9644
382,383,19173,1592,2228,295.869,19.175,70.825,99.9743
383,384,1483,690,2117,286.594,2.70728,87.2927,99.9922
384,385,610,798,2115,284.071,3.61339,86.3866,99.9956
385,386,18105,1051,2168,279.67900000000003,35.3226,54.6774,99.9801
386,387,35769,595,2244,287.927,2.62276,87.3772,99.8282
387,388,637,1214,2133,283.558,2.34178,87.6582,99.9661
388,389,915,912,2145,151.66899999999995,78.8263,11.1737,99.9863
389,390,653,1182,2178,98.877,2.38573,87.6143,99.9974
390,391,1552,2327,2197,100.65,5.88539,84.1146,99.9894
391,392,2516,930,2211,283.177,5.77728,84.2227,99.9978
392,393,28933,2824,2355,270.337,65.5055,24.4945,99.8568
393,394,540,2283,2221,91.0,5.51308,84.4869,99.9961
394,395,566,1149,2218,100.099,2.49853,87.5015,99.9916
395,396,2149,1182,2237,91.0,2.3025900000000004,87.6974,99.998
396,397,2358,1119,2259,100.555,2.23014,87.7699,99.9898
397,398,1088,3102,2254,111.333,38.4459,51.5541,99.9952
398,399,1531,3165,2267,286.172,40.769,49.231,99.9945
399,400,1537,2872,2275,269.891,64.5364,25.4636,99.9942
400,401,1221,3036,2265,115.626,38.2613,51.7387,99.9852
401,402,1691,1051,2282,259.911,53.8852,36.1148,99.8545
402,403,37900,464,2371,133.826,63.3973,26.6027,99.6746
403,404,8224,3264,2352,114.196,27.8985,62.1015,99.9708
404,405,6565,2044,2307,277.182,22.7299,67.2701,99.922
405,406,982,2312,2289,91.0021,5.01949,84.9805,99.9931
406,407,5663,2614,2323,94.0173,36.2731,53.7269,99.9918
407,408,21919,990,2363,278.357,35.3915,54.6085,99.9641
408,409,9718,1657,2356,290.377,8.27172,81.7283,99.9736
409,410,689,3120,2294,116.117,27.4778,62.5222,99.9943
410,411,12508,227,2397,96.5694,8.50797,81.492,99.9773
411,412,5390,2149,2356,108.451,11.2307,78.7693,99.9528
412,413,587,1509,2326,105.837,4.6494800000000005,85.3505,99.9921
413,414,601,1752,2314,288.3590000000001,8.55512,81.4449,99.9785
414,415,15031,3034,2372,284.236,5.12541,84.8746,99.9539
415,416,1405,3120,2343,117.455,27.9609,62.0391,99.9408
416,417,24764,2409,2420,118.401,42.5799,47.4201,99.7948
417,418,3233,285,2367,109.745,42.5122,47.4878,99.9881
418,419,926,3163,2352,118.329,28.6088,61.3912,99.991
419,420,1623,834,2356,284.451,1.94911,88.0509,99.9844
420,421,828,2271,2354,117.296,43.953,46.047,99.9451
421,422,1570,1787,2367,284.866,54.4237,35.5763,99.976
422,423,1199,1107,2368,268.413,53.3395,36.6605,99.854
423,424,688,1307,2360,287.2,7.803,82.197,99.4771
424,425,4672,3424,2410,172.737,75.2257,14.7743,99.9627
425,426,830,2237,2383,106.682,9.48335,80.5166,99.9717
426,427,5966,2737,2426,110.822,46.5577,43.4423,99.9856
427,428,10276,1236,2419,290.807,9.84054,80.1595,99.8687
428,429,15334,2608,2416,172.201,87.265,2.73502,99.9609
429,430,15539,808,2444,286.948,2.07195,87.928,99.8565
430,431,6677,676,2423,114.812,35.3276,54.6724,99.9681
431,432,9501,1407,2419,250.703,78.3158,11.6842,99.9416
432,433,3793,3360,2427,106.861,43.6257,46.3743,99.972
433,434,1727,3309,2401,105.951,44.0442,45.9558,99.9887
434,435,880,2196,2409,99.7775,2.46727,87.5327,99.9364
435,436,9870,1091,2455,192.121,77.8961,12.1039,99.9132
436,437,58207,3319,2572,125.536,36.2928,53.7072,99.4879
437,438,11878,1585,2460,246.717,78.7154,11.2846,99.933
438,439,943,1503,2411,107.06,4.812130000000002,85.1879,99.9302
439,440,60482,324,2611,269.62,24.6881,65.3119,99.9422
440,441,7920,2957,2457,277.901,15.8771,74.1229,99.9817
441,442,13020,2748,2529,275.274,69.156,20.844,99.3666
442,443,1187,583,2419,97.9915,13.0572,76.9428,99.9665
443,444,33866,2284,2535,99.4898,47.3389,42.6611,99.9053
444,445,986,1677,2434,115.795,46.5321,43.4679,99.9632
445,446,18022,3108,2506,116.079,27.5203,62.4797,99.826
446,447,61106,553,2618,278.687,16.2828,73.7172,99.4771
447,448,1724,1932,2464,267.42,37.2774,52.7226,99.9923
448,449,221328,822,2839,112.999,12.4934,77.5066,99.8895
449,450,71473,1278,2560,290.02,13.0281,76.9719,99.7537
450,451,1329,2151,2477,288.619,0.328217,89.6718,99.9809
451,452,777,1835,2474,124.367,50.0797,39.9203,99.9702
452,453,668,1749,2485,117.808,52.0213,37.9787,99.9162
453,454,783,402,2487,115.309,49.2202,40.7798,99.4993
454,455,1786,2780,2492,15.3736,85.0033,4.99669,99.9657
455,456,8041,1873,2580,284.8,7.213310000000001,82.7867,99.8756
456,457,24592,2081,2567,286.059,39.1011,50.8989,99.9299
457,458,8740,1959,2587,104.956,8.171710000000001,81.8283,99.8009
458,459,2706,2537,2516,255.977,61.8688,28.1312,99.7411
459,460,2423,2890,2528,266.841,42.1326,47.8674,99.9746
460,461,1208,437,2516,110.379,68.3346,21.6654,99.879
461,462,88109,2452,2748,101.114,20.8511,69.1489,99.6652
462,463,2730,1767,2524,282.933,9.33411,80.6659,99.5924
463,464,680,2966,2525,115.861,28.7188,61.2812,99.6342
464,465,7182,1666,2565,292.495,7.19987,82.8001,99.9832
465,466,917,2563,2543,120.726,51.4587,38.5413,99.9494
466,467,1091,215,2589,99.5932,41.163,48.837,99.9931
467,468,2807,1560,2566,105.171,0.974709,89.0253,99.878
468,469,923,727,2564,291.756,30.6398,59.3602,99.9906
469,470,2787,1787,2571,102.218,7.939139999999999,82.0609,99.9889
470,471,34478,3113,2641,103.178,18.0888,71.9112,99.9669
471,472,38071,2685,2726,96.2165,7.242939999999999,82.7571,99.9549
472,473,2956,2711,2615,264.245,72.9982,17.0018,99.9476
473,474,24433,1573,2685,268.271,60.2149,29.7851,99.9688
474,475,10998,2765,2780,91.0,7.1609300000000005,82.8391,99.9933
475,476,76600,1367,2878,273.98,29.0002,60.9998,97.1719
476,477,6333,2906,2682,280.353,71.9331,18.0669,99.9845
477,478,9636,2107,2709,98.0589,34.2417,55.7583,99.9858
478,479,831,212,2683,99.2656,40.9524,49.0476,99.9893
479,480,3608,3441,2725,100.459,27.4453,62.5547,99.7858
480,481,625,1757,2683,91.0,7.2321399999999985,82.7679,99.9987
481,482,851,2043,2676,286.263,5.44234,84.5577,99.9893
482,483,10936,3291,2744,273.85,39.8677,50.1323,99.9173
483,484,4313,2970,2721,282.619,65.7198,24.2801,99.9479
484,485,9208,1977,2736,109.284,52.0765,37.9235,99.9824
485,486,82589,3145,2881,277.452,14.3235,75.6765,99.8948
486,487,2400,1638,2762,267.462,57.3352,32.6648,99.655
487,488,14458,411,2859,100.851,74.9233,15.0767,99.9533
488,489,2796,1555,2792,266.586,48.4195,41.5805,99.9613
489,490,2766,277,2792,307.251,55.3597,34.6403,99.9966
490,491,1785,2941,2818,109.333,3.90382,86.0962,99.54
491,492,1659,2038,2807,112.422,5.80049,84.1995,99.9889
492,493,7486,2107,2865,272.628,34.0834,55.9166,99.9191
493,494,755,2681,2810,96.8579,7.53155,82.4685,99.996
494,495,11016,1958,2874,277.60200000000003,59.9576,30.0424,99.8896
495,496,2059,2706,2862,91.0,7.47788,82.5221,100.0
496,497,822,2725,2849,97.7896,7.594010000000001,82.406,99.9972
497,498,5228,3408,2856,102.678,29.0442,60.9558,99.7569
498,499,20318,1602,2898,275.54400000000004,55.9245,34.0755,99.9632
499,500,8476,275,2871,275.523,15.2642,74.7358,99.9873
500,501,133364,2759,3091,110.469,4.9729,85.0271,99.6603
501,502,8024,3002,2922,252.967,72.5785,17.4215,99.9295
502,503,45520,1906,3089,212.949,71.1716,18.8284,99.785
503,504,50035,1692,3033,275.697,16.4709,73.5291,99.9447
504,505,2085,3389,2906,255.235,72.7149,17.2851,99.9904
505,506,156994,404,3199,296.718,51.9418,38.0582,99.7966
506,507,21590,2267,3015,115.334,13.1769,76.8231,99.9603
507,508,8185,2128,2965,207.779,67.0068,22.9932,99.9626
508,509,598,2205,2942,240.193,71.192,18.808,99.6769
509,510,54734,1126,3068,110.573,49.7649,40.2351,99.873
510,511,22398,3278,3020,255.36,73.89699999999998,16.102999999999998,98.6418
511,512,1548,2531,2965,280.959,38.3641,51.6359,99.9085
512,513,10852,2030,3007,118.993,13.2226,76.7774,99.9486
513,514,5167,2455,2985,105.748,29.6574,60.3426,99.9387
514,515,5367,3431,3019,258.438,62.2362,27.7638,99.1986
515,516,1626,919,3011,279.42,11.0665,78.9335,99.8987
516,517,1725,2943,3019,288.01,8.39488,81.6051,99.9064
517,518,31746,2530,3148,279.997,12.9418,77.0582,99.9908
518,519,34632,3377,3184,280.66,37.0823,52.9177,99.8301
519,520,2411,2144,3062,265.644,33.7799,56.2201,99.9837
520,521,22286,937,3155,296.585,11.3078,78.6922,99.2387
521,522,2173,2418,3065,278.011,7.32706,82.6729,99.9842
522,523,551,234,3078,291.266,53.7993,36.2007,99.9889
523,524,64501,1490,3260,281.75,51.207,38.793,99.9129
524,525,9329,2095,3117,258.144,50.1947,39.8053,99.9912
525,526,704,1469,3069,285.524,54.0769,35.9231,99.9759
526,527,1432,1354,3086,274.84,42.5492,47.4508,99.9494
527,528,4369,2338,3123,287.809,65.8011,24.1989,99.9926
528,529,2392,2199,3113,116.577,11.9907,78.0093,99.9835
529,530,19629,3229,3181,107.819,2.07882,87.9212,99.8614
530,531,4661,1485,3124,276.5,42.1315,47.8685,99.8372
531,532,1010,826,3114,93.0988,22.8502,67.1498,99.9598
532,533,1593,2262,3119,259.635,29.8101,60.1899,99.9973
533,534,1395,602,3131,291.688,7.320810000000002,82.6792,99.9737
534,535,1053,2437,3131,104.481,33.9804,56.0196,99.9635
535,536,2054,1668,3153,268.59,40.6084,49.3916,99.9195
536,537,18866,667,3232,289.766,5.64737,84.3526,99.9602
537,538,4742,821,3181,93.9393,24.8729,65.1271,99.9777
538,539,187040,3059,3456,273.17,37.4024,52.5976,99.9146
539,540,888,3126,3157,274.306,13.7688,76.2312,99.9865
540,541,284249,2422,3559,270.809,36.184,53.816,99.8633
541,542,4998,2045,3189,276.587,35.1712,54.8288,99.9787
542,543,3196,1361,3230,283.495,64.1275,25.8725,99.9846
543,544,638,240,3222,103.91,31.8752,58.1248,99.9826
544,545,22854,1025,3320,120.771,73.2509,16.7491,99.9764
545,546,589,2270,3247,261.186,31.296,58.70399999999999,99.6233
546,547,605,223,3257,103.195,31.5633,58.4367,99.9791
547,548,64069,862,3437,281.226,44.0103,45.9897,99.8294
548,549,3276,1992,3272,269.831,55.4904,34.5096,99.8711
549,550,5257,1880,3292,275.399,58.1923,31.8077,99.9551
550,551,643,2249,3260,260.694,29.7276,60.2724,99.9788
551,552,19637,3308,3374,120.44,31.8229,58.1771,99.9214
552,553,1484,1939,3309,265.009,33.5453,56.4547,99.9309
553,554,1241,2618,3301,113.79,18.5378,71.4622,99.9925
554,555,3320,1137,3347,111.998,47.8717,42.1283,99.9683
555,556,5032,2610,3365,286.857,35.4388,54.5612,99.6329
556,557,31168,662,3447,110.115,30.7065,59.2935,99.7584
557,558,1401,1979,3362,275.60400000000004,51.5066,38.4934,99.7342
558,559,8647,3416,3424,110.267,42.3626,47.6374,99.9674
559,560,2757,1286,3373,271.0,60.235,29.765,99.9965
560,561,919,1657,3357,285.368,60.0369,29.9631,99.9607
561,562,3627,1348,3387,255.187,59.0989,30.9011,99.9472
562,563,83220,1771,3540,100.154,30.7371,59.2629,99.8939
563,564,12686,1672,3413,280.555,52.8342,37.1658,99.9145
564,565,30089,325,3518,297.124,62.7799,27.2201,99.947
565,566,5871,2657,3444,265.936,56.3291,33.6709,99.9841
566,567,12360,1257,3467,307.624,55.1021,34.8979,99.7568
567,568,20707,1464,3467,283.805,12.5918,77.4082,99.7791
568,569,188409,946,3769,94.6694,5.95147,84.0485,99.4152
569,570,3142,960,3441,95.5788,21.8728,68.1272,99.9699
570,571,2308,3354,3498,279.145,30.5047,59.4953,99.9869
571,572,74743,495,3677,107.051,31.7508,58.2492,99.4282
572,573,1784,541,3511,301.688,50.6501,39.3499,99.503
573,574,3879,2705,3556,122.204,73.733,16.267,99.7299
574,575,22638,752,3599,305.845,45.7866,44.2134,99.9422
575,576,38684,1421,3664,99.8017,28.8825,61.1175,99.7658
576,577,1857,1220,3539,99.961,62.7164,27.2836,99.968
577,578,6474,3409,3560,293.068,61.5566,28.4434,98.9923
578,579,32797,2089,3644,289.035,35.3538,54.6462,99.9361
579,580,1074,2083,3539,282.702,43.2905,46.7095,99.8581
580,581,583,3306,3563,102.207,29.7364,60.2636,99.899
581,582,1962,1223,3582,91.0,62.5972,27.4028,99.9987
582,583,625,603,3577,64.1006,80.9453,9.05469,99.9811
583,584,3513,2764,3609,267.517,37.9251,52.0749,99.9812
584,585,9569,2919,3635,275.768,12.8271,77.1729,99.9726
585,586,37036,3331,3697,290.496,55.2695,34.7305,99.8921
586,587,861,1158,3606,262.134,54.2927,35.7073,99.9903
587,588,941,1522,3639,270.503,48.8701,41.1299,99.9833
588,589,5822,296,3666,283.851,5.99306,84.0069,99.9958
589,590,637,1148,3653,286.564,36.7799,53.2201,99.9943
590,591,138296,1985,3925,284.535,28.8427,61.1573,99.1307
591,592,5392,2993,3687,110.639,21.2277,68.7723,99.9894
592,593,7718,851,3738,288.012,68.6556,21.3444,99.9449
593,594,45780,1686,3821,281.99,14.7315,75.2685,99.8851
594,595,1011,922,3725,281.7,67.7807,22.2193,99.9754
595,596,734,2930,3729,290.833,37.8049,52.1951,99.6293
596,597,10164,340,3787,294.524,59.6241,30.3759,99.9924
597,598,3810,2847,3786,271.0,6.767710000000001,83.2323,99.9952
598,599,1108,3426,3771,94.6619,31.319000000000006,58.681,99.9882
599,600,1239,266,3783,317.308,58.7017,31.2983,99.9898
600,601,145886,3033,3997,280.881,10.9645,79.0355,99.71
601,602,4699,2786,3818,270.898,37.4398,52.5602,99.9961
602,603,19836,1562,3921,134.34799999999998,54.3817,35.6183,99.9562
603,604,12064,3386,3882,280.279,58.4475,31.5525,99.9626
604,605,5261,1479,3860,137.434,59.1092,30.8908,99.9374
605,606,2523,3296,3853,99.9254,29.9626,60.0374,99.9249
606,607,1233,272,3846,283.36,23.4248,66.5752,99.9904
607,608,70485,2294,4017,139.257,63.7804,26.2196,99.554
608,609,1194,396,3854,111.733,26.8134,63.1866,99.9801
609,610,22449,1374,3935,113.252,36.6048,53.3952,99.7505
610,611,690,502,3859,99.9619,4.69068,85.3093,99.9887
611,612,37190,344,3975,259.281,30.1446,59.8554,99.233
612,613,1919,572,3897,296.76,62.4456,27.5544,99.9879
613,614,1877,1222,3904,307.253,64.2972,25.7028,99.9639
614,615,37259,497,4043,282.212,27.1336,62.8664,99.8091
615,616,7028,1156,3927,280.30400000000003,23.9375,66.0625,99.9646
616,617,233222,2608,4253,323.445,64.5275,25.4725,99.5378
617,618,576,2808,3917,323.746,64.6847,25.3153,99.9416
618,619,132151,1044,4260,117.161,37.7804,52.2196,99.3922
619,620,14165,3353,3981,278.54400000000004,7.11977,82.8802,99.8686
620,621,2904,1725,3978,120.289,43.8062,46.1938,99.9609
621,622,18958,815,4073,99.1389,46.7483,43.2517,99.8008
622,623,2110,1245,4000,119.252,38.4198,51.5802,99.7349
623,624,12807,1570,4032,284.9890000000001,33.9645,56.0355,99.7526
624,625,11456,3274,4044,285.041,42.8994,47.1006,99.4875
625,626,39872,950,4129,102.343,16.6192,73.3808,99.185
626,627,17600,1716,4110,286.76,41.4966,48.5034,99.8276
627,628,514,220,4017,317.334,58.8032,31.1968,99.8721
628,629,15360,1817,4120,100.875,11.6506,78.3494,99.9215
629,630,738,1303,4015,276.486,36.8873,53.1127,99.3781
630,631,58152,1369,4177,103.983,10.0918,79.9082,99.3297
631,632,4228,649,4073,302.802,42.1509,47.8491,99.9877
632,633,691,708,4043,94.4543,3.15775,86.8422,99.9589
633,634,3012,1642,4094,107.072,11.5883,78.4117,99.9795
634,635,2983,3394,4075,276.409,18.4318,71.5682,99.6425
635,636,546,1215,4078,309.757,57.5909,32.4091,99.9747
636,637,2889,258,4115,107.452,46.0665,43.9335,99.9666
637,638,1037,693,4095,102.197,48.3355,41.6645,99.9797
638,639,1386,1544,4105,108.82,48.6994,41.3006,99.9797
639,640,73694,1546,4310,280.697,44.3028,45.6972,99.8288
640,641,156142,458,4409,110.663,38.8125,51.1875,63.6287
641,642,1986,2989,4136,326.698,58.9933,31.0067,99.9721
642,643,22423,3337,4225,274.284,11.6015,78.3985,99.8603
643,644,3926,3381,4138,282.904,29.0638,60.9362,99.9895
644,645,11118,596,4182,278.034,50.06399999999999,39.936,99.9478
645,646,12458,722,4236,246.789,80.0489,9.95114,99.956
646,647,7725,2090,4231,108.039,9.77603,80.22399999999998,99.9523
647,648,664,3421,4179,291.899,64.3567,25.6433,99.9905
648,649,5355,1860,4238,285.339,43.2225,46.7775,99.9812
649,650,1579,2198,4188,108.427,41.4223,48.5777,99.9809
650,651,14042,1934,4254,292.092,50.7503,39.2497,99.5239
651,652,114360,3080,4391,108.26,2.91142,87.0886,99.6028
652,653,5167,449,4228,104.94,40.545,49.455,99.7571
653,654,512,399,4198,97.5126,41.7728,48.2272,99.9909
654,655,84495,1766,4438,275.048,25.4623,64.5377,96.6847
655,656,14589,2167,4291,283.423,27.7774,62.2226,99.9706
656,657,5850,1704,4272,287.957,42.7582,47.2418,99.9857
657,658,1561,3419,4300,285.576,1.63933,88.3607,99.9949
658,659,737,523,4265,245.696,79.3566,10.6434,99.9399
659,660,1860,616,4275,108.023,54.6629,35.3371,99.9923
660,661,1456,686,4310,313.082,58.8488,31.1512,99.9926
661,662,5923,2277,4331,266.301,25.1032,64.8968,99.9762
662,663,538,733,4326,277.236,17.4925,72.5075,99.983
663,664,918,776,4328,94.0118,46.1225,43.8775,99.9848
664,665,12904,3375,4406,109.567,31.6693,58.3307,99.9248
665,666,8721,2081,4384,106.599,10.4411,79.5589,99.9687
666,667,55261,1252,4480,293.717,13.3609,76.6391,99.9423
667,668,2392,1750,4375,277.823,46.7553,43.2447,99.9893
668,669,715,1683,4370,302.357,17.6809,72.3191,99.9778
669,670,9870,781,4435,93.5453,46.2042,43.7958,99.9747
670,671,58552,2304,4508,284.863,23.2643,66.7357,95.3998
671,672,5596,2173,4411,270.02,23.7339,66.2661,99.9771
672,673,15140,981,4537,282.5440000000001,17.1468,72.8532,98.81
673,674,6186,2072,4468,281.916,52.3857,37.6143,99.9794
674,675,14562,3303,4500,142.965,75.7899,14.2101,99.9836
675,676,1198,1998,4469,116.066,34.1317,55.8683,99.9856
676,677,12088,1924,4516,296.203,23.3714,66.6286,99.8318
677,678,6174,2821,4523,287.78,19.4548,70.5452,99.9375
678,679,1358,750,4531,104.303,39.4155,50.5845,99.949
679,680,2670,1456,4534,109.508,38.6447,51.3553,99.8039
680,681,5398,751,4566,309.4290000000001,44.6079,45.3921,99.9825
681,682,1350,1046,4543,100.678,37.9415,52.0585,99.9726
682,683,1603,1394,4565,103.269,38.5486,51.4514,99.9276
683,684,785,232,4583,298.705,33.7444,56.2556,99.9818
684,685,532,2204,4577,281.434,28.4708,61.5292,99.8958
685,686,1204,1046,4582,100.016,37.3548,52.6452,99.9923
686,687,798,1431,4581,104.713,43.9133,46.0867,99.9517
687,688,1170,1129,4584,294.582,12.6095,77.3905,99.9803
688,689,540,1679,4599,319.992,77.6594,12.3406,99.7767
