,Grain No.,Size [Pixel],center x-coordinate,center y-coordinate,mean azimuth [degree],mean latitude [degree],mean colatitude [degree],Regelungsgrad [%]
0,1,1708,2930,188,252.755,31.013,58.987,99.251
1,2,3190,3044,200,137.55100000000002,13.1424,76.8576,93.3327
2,3,1052,341,229,307.015,25.4974,64.5026,98.151
3,4,20199,1951,314,119.277,19.3765,70.6235,99.8301
4,5,2827,230,252,306.902,18.6411,71.3589,99.7722
5,6,79534,547,446,124.164,31.1526,58.8474,67.294
6,7,1505,1258,235,102.528,32.7764,57.2236,99.6184
7,8,1305,3151,225,143.72299999999996,49.7174,40.2826,99.8089
8,9,1167,194,242,290.188,16.3028,73.6972,99.9787
9,10,12700,3273,306,122.508,59.0165,30.9835,99.6407
10,11,7208,362,323,292.643,41.8505,48.1495,99.3655
11,12,875,699,250,44.847,6.10573,83.8943,99.3968
12,13,3977,1207,281,297.902,6.66645,83.3335,98.6168
13,14,2565,2947,257,298.903,40.6579,49.3421,99.8677
14,15,2953,1113,254,301.887,2.40815,87.5919,99.7761
15,16,13120,2824,303,298.356,0.706825,89.2932,99.9514
16,17,6507,2161,282,292.378,23.5696,66.4304,99.8573
17,18,1404,1033,264,117.47,8.9534,81.0466,99.4626
18,19,1012,3170,244,118.822,58.19600000000001,31.804,99.8989
19,20,12314,809,304,124.328,42.9588,47.0412,99.5443
20,21,1415,3091,253,114.655,11.3855,78.6145,99.9033
21,22,3603,2743,268,299.027,9.84063,80.1594,99.9132
22,23,8865,2475,290,98.0003,62.2252,27.7748,99.781
23,24,25077,2652,336,115.711,32.6001,57.3999,99.4703
24,25,854,908,280,299.436,15.0736,74.9264,99.6368
25,26,638,285,272,305.855,19.0297,70.9703,99.6918
26,27,2748,691,280,144.761,73.0174,16.9826,99.8939
27,28,5258,1702,286,302.991,48.2924,41.7076,99.9731
28,29,4778,2371,300,110.526,40.3132,49.6868,99.9455
29,30,952,629,277,130.289,38.3993,51.6007,99.9574
30,31,5404,1809,312,145.607,70.646,19.354,99.6741
31,32,69367,3123,432,122.032,11.9285,78.0715,99.2675
32,33,2837,1285,317,276.54400000000004,58.3811,31.6189,99.965
33,34,2885,2068,291,294.892,3.25305,86.7469,99.9808
34,35,41140,1508,394,302.144,15.8327,74.1673,99.8829
35,36,6666,2235,326,292.6690000000001,9.46717,80.5328,99.9294
36,37,1215,955,293,95.5697,48.0891,41.9109,99.9806
37,38,2635,1383,296,116.983,40.7168,49.2832,99.9538
38,39,1834,1328,318,276.388,57.7305,32.2695,99.9522
39,40,5675,1614,319,123.344,46.6371,43.3629,99.952
40,41,517,2941,288,291.0490000000001,8.405619999999999,81.5944,99.9832
41,42,2548,1866,309,292.087,28.4338,61.5662,99.9875
42,43,11260,1142,338,293.064,8.77098,81.229,99.6328
43,44,2225,2917,317,108.981,9.94241,80.0576,99.958
44,45,3879,113,325,294.228,37.1301,52.8699,99.8423
45,46,2009,185,302,146.882,71.3433,18.6567,99.9455
46,47,654,2304,301,104.049,46.449,43.551,99.9476
47,48,1799,1029,307,111.111,3.01025,86.9897,99.9831
48,49,1557,284,322,144.467,76.1422,13.8578,99.8784
49,50,535,238,313,278.699,59.3973,30.6027,99.984
50,51,7201,1719,351,290.687,20.5392,69.4608,99.9973
51,52,882,2975,321,289.634,10.7713,79.2287,99.9792
52,53,1222,907,336,298.297,5.4574099999999985,84.5426,99.9266
53,54,12551,940,401,287.873,4.221430000000002,85.7786,99.8599
54,55,5640,2425,353,109.421,20.8727,69.1273,99.9137
55,56,10877,2062,372,297.168,0.596962,89.40299999999998,99.9663
56,57,916,1011,341,296.844,6.63657,83.3634,99.945
57,58,4359,190,348,98.0839,15.5448,74.4552,99.9825
58,59,24740,1087,454,302.6020000000001,21.8017,68.1983,99.5436
59,60,7477,2553,399,297.35,44.3122,45.6878,99.6639
60,61,13148,829,406,300.904,16.8502,73.1498,99.815
61,62,3249,2949,387,281.181,49.5485,40.4515,99.9763
62,63,1197,2172,370,123.529,15.349,74.65100000000002,99.9961
63,64,562,2315,360,275.481,38.6602,51.3398,99.9859
64,65,7519,2872,417,290.892,52.2834,37.7166,99.9588
65,66,1410,1780,381,120.71,20.2038,69.7962,99.9956
66,67,41484,1737,516,280.876,58.2907,31.7093,48.1049
67,68,1276,2834,387,277.98,46.5458,43.4542,99.9742
68,69,3747,1659,405,125.237,34.4567,55.5433,99.9968
69,70,42844,186,490,100.341,19.2105,70.7895,97.3559
70,71,3274,2467,402,290.482,0.379601,89.6204,99.9574
71,72,12707,714,441,124.431,31.4622,58.5378,99.9301
72,73,9867,2117,469,288.3520000000001,37.8027,52.1973,99.8824
73,74,10085,2199,443,296.36,8.33533,81.6647,99.9967
74,75,1065,2355,405,294.7,0.355392,89.6446,99.8732
75,76,4043,2398,440,101.263,2.30399,87.696,99.9266
76,77,1340,1291,400,277.423,58.5642,31.4358,99.9833
77,78,17156,2752,490,305.876,38.6095,51.3905,99.9382
78,79,7266,337,441,294.127,41.7392,48.2608,99.9146
79,80,8842,1709,458,295.885,31.221,58.779,99.9718
80,81,32928,1212,566,124.448,31.3494,58.6506,95.836
81,82,970,2312,420,106.432,48.3762,41.6238,99.9931
82,83,2380,1797,427,304.089,11.67,78.33,99.9968
83,84,7906,1298,453,115.302,9.86084,80.1392,99.9855
84,85,1139,3286,445,128.062,11.9877,78.0123,99.9844
85,86,6690,2284,468,291.737,0.676193,89.3238,99.9981
86,87,29822,2000,534,175.54,78.0436,11.9564,99.2997
87,88,11633,1396,499,128.809,50.0096,39.9904,99.8416
88,89,1365,2351,455,120.503,34.5897,55.4103,99.9943
89,90,633,1820,459,122.87,18.5752,71.4248,99.9915
90,91,956,2600,461,126.877,41.6592,48.3408,99.926
91,92,11177,2884,529,118.117,24.2149,65.7851,99.953
92,93,598,1630,471,297.425,51.0166,38.9834,99.9947
93,94,937,2474,493,221.08,75.0401,14.9599,99.9528
94,95,1210,2629,477,121.196,16.8661,73.1339,99.9695
95,96,758,1050,482,132.583,46.9196,43.0804,99.9873
96,97,13237,2258,555,131.97899999999998,57.4989,32.5011,62.9751
97,98,2875,834,507,6.1645,80.0985,9.90151,99.7446
98,99,45514,2428,617,289.655,51.5441,38.4559,90.5527
99,100,2729,1015,517,289.789,2.12507,87.8749,99.8784
100,101,13469,2987,566,117.733,45.78100000000001,44.219,99.7148
101,102,47088,932,697,301.664,69.7704,20.2296,55.0422
102,103,515,868,510,13.046,80.0794,9.92056,99.7214
103,104,40939,2837,687,107.718,27.3758,62.6242,99.883
104,105,12255,2603,605,308.1790000000001,38.2457,51.7543,99.9562
105,106,1258,311,538,101.013,56.9048,33.0952,99.9455
106,107,2181,2154,555,124.705,10.4142,79.5858,99.9847
107,108,619,1493,533,298.94,3.0864,86.9136,99.9296
108,109,17573,507,605,287.039,42.411,47.589,99.9619
109,110,57511,1795,750,124.088,2.13424,87.8658,99.7887
110,111,1003,3177,548,127.222,46.9327,43.0673,99.7512
111,112,15806,816,605,295.077,22.4635,67.5365,99.9388
112,113,125305,1425,786,299.965,2.67953,87.3205,99.0098
113,114,942,2820,580,298.907,36.4854,53.5146,99.9899
114,115,1755,2697,589,118.055,13.8172,76.1828,99.99
115,116,872,708,593,120.564,32.5791,57.4209,99.9827
116,117,2905,3229,602,295.21,61.6497,28.3503,99.9573
117,118,3473,2105,614,122.726,10.7096,79.2904,99.9812
118,119,4785,1067,654,114.06,78.0543,11.9457,99.9337
119,120,10636,269,678,285.525,39.7866,50.2134,99.9547
120,121,3294,121,627,99.0301,30.5304,59.4696,99.9603
121,122,11741,2152,679,302.39,43.1469,46.8531,99.9957
122,123,2162,3174,631,125.046,52.2797,37.7203,99.5599
123,124,12996,1676,672,299.371,27.2142,62.7858,99.9768
124,125,1393,331,623,289.718,32.2217,57.7783,99.9866
125,126,9864,659,670,298.216,28.4806,61.5194,99.9777
126,127,23538,778,761,292.433,3.57365,86.4264,99.8987
127,128,709,2216,627,309.654,3.89737,86.1026,99.9809
128,129,11679,2668,733,117.405,38.8167,51.1833,99.9673
129,130,1345,365,638,125.634,65.6982,24.3018,99.9908
130,131,43648,556,774,127.464,59.4519,30.5481,99.8692
131,132,9476,1897,692,279.78,20.9548,69.0452,99.9667
132,133,1274,1974,645,114.305,38.9508,51.0492,99.9498
133,134,11411,161,707,101.22,30.4899,59.5101,99.894
134,135,23487,2290,757,119.0,8.7341,81.2659,99.9832
135,136,9199,3032,700,301.426,61.7851,28.2149,99.9652
136,137,16927,3201,723,296.861,26.1546,63.8454,99.7025
137,138,943,2093,663,283.593,25.9937,64.0063,99.9982
138,139,1725,3096,671,131.512,47.7055,42.2945,99.9941
139,140,21669,356,751,290.2390000000001,20.2836,69.7164,99.956
140,141,25137,2005,767,119.694,22.6887,67.3113,96.1881
141,142,31484,2534,827,301.175,24.6464,65.3536,88.4952
142,143,1325,1824,680,148.806,72.4206,17.5794,99.9958
143,144,899,3124,699,125.42,23.6337,66.3663,99.9919
144,145,685,1160,695,273.97700000000003,59.6348,30.3652,99.984
145,146,1067,832,698,298.475,21.232,68.768,99.2425
146,147,26323,1052,759,296.307,26.1223,63.8777,99.9798
147,148,643,1192,717,285.409,56.2275,33.7725,99.9697
148,149,594,62,745,53.1118,80.6543,9.34574,99.9888
149,150,3374,2401,760,284.039,47.20399999999999,42.79600000000001,99.9962
150,151,2270,1613,769,299.187,59.8029,30.1971,99.9624
151,152,8078,723,812,117.348,3.39194,86.6081,99.9862
152,153,2343,2461,768,284.552,28.4372,61.5628,99.9132
153,154,8855,2743,807,299.182,0.479607,89.5204,99.9847
154,155,12989,3137,833,300.38,36.3038,53.6962,99.785
155,156,26422,3005,875,293.127,55.0979,34.9021,98.7165
156,157,6025,3259,835,291.079,38.6563,51.3437,99.6964
157,158,11588,2114,812,302.592,70.3838,19.6162,99.9838
158,159,1126,1253,771,121.472,32.5735,57.4265,99.9979
159,160,5329,136,798,112.275,51.4958,38.5042,99.7347
160,161,508,3047,768,133.311,46.2832,43.7168,99.9287
161,162,14573,208,874,50.4335,82.7841,7.215889999999999,99.9099
162,163,8411,2224,817,127.346,0.811058,89.1889,99.9932
163,164,730,1165,787,127.582,32.6442,57.3558,99.9956
164,165,965,2922,803,111.587,85.9499,4.05009,99.9941
165,166,538,1212,800,119.047,1.25368,88.7463,99.9911
166,167,795,2947,810,111.325,84.0831,5.91689,99.9976
167,168,1358,1244,812,110.343,25.9894,64.0106,99.9975
168,169,9217,1651,864,307.202,4.85712,85.1429,99.8551
169,170,2669,1920,838,307.165,12.0815,77.9185,99.9884
170,171,26397,1196,920,118.231,20.6906,69.3094,99.9728
171,172,1962,2435,824,294.553,12.9118,77.0882,99.9828
172,173,5235,2890,860,121.911,41.9904,48.0096,99.9942
173,174,5187,359,842,191.913,82.6486,7.351380000000002,99.9204
174,175,1054,112,848,98.1821,51.2501,38.7499,99.8762
175,176,4807,471,866,311.741,54.7442,35.2558,99.9894
176,177,5613,1084,883,134.31799999999998,76.8998,13.1002,99.964
177,178,1032,2620,856,287.515,48.2174,41.7826,99.9946
178,179,3096,1257,871,114.743,38.6642,51.3358,99.9944
179,180,5776,2670,896,111.096,86.2257,3.77429,99.9252
180,181,9987,1570,900,293.436,59.9587,30.0413,99.9936
181,182,9903,523,915,105.706,30.3386,59.6614,99.8025
182,183,1771,2421,872,171.565,76.035,13.9649,99.9964
183,184,5010,2045,909,283.538,51.0156,38.9844,99.9859
184,185,66304,2235,976,139.894,66.3381,23.6619,80.2795
185,186,962,417,885,295.569,5.12814,84.8719,99.9928
186,187,27928,2855,979,122.908,19.3657,70.6343,99.98
187,188,50533,3188,1154,299.724,2.73524,87.2648,99.5663
188,189,116142,349,1092,296.779,11.2529,78.7471,99.3869
189,190,7059,119,935,281.322,17.5172,72.4828,99.844
190,191,627,2734,888,110.778,87.3975,2.60252,99.9904
191,192,2419,1753,900,117.783,32.4672,57.5328,99.993
192,193,5318,741,909,131.155,60.5449,29.4551,99.9663
193,194,767,941,899,294.995,0.449936,89.5501,99.9892
194,195,9178,995,954,300.42,42.7698,47.2302,99.9686
195,196,55600,3006,1094,303.6040000000001,26.0219,63.9781,90.8947
196,197,2848,887,932,119.585,18.5876,71.4124,99.9954
197,198,2868,1319,954,300.088,25.7992,64.2008,99.9512
198,199,3102,2592,958,121.695,28.6024,61.3976,99.9776
199,200,1021,931,926,150.673,81.2877,8.71233,99.9867
200,201,831,2623,932,295.749,47.0241,42.9759,99.9965
201,202,722,63,942,118.297,3.91438,86.0856,99.82
202,203,320947,782,1390,157.3,69.6469,20.3531,94.1204
203,204,6865,2728,970,121.008,30.4019,59.5981,99.9863
204,205,13749,1981,1004,118.56,29.8927,60.1073,99.5546
205,206,16516,1727,996,298.701,33.2575,56.7425,81.7849
206,207,3596,779,974,291.751,68.1092,21.8908,99.9563
207,208,2252,1620,964,122.671,38.6733,51.3267,99.9876
208,209,945,422,959,277.645,42.2005,47.7995,99.9828
209,210,2443,1684,967,127.156,23.1814,66.8186,99.9948
210,211,811,740,955,281.496,0.470619,89.5294,99.9878
211,212,1833,1880,962,123.074,33.756,56.244,99.9812
212,213,103913,1188,1152,119.607,4.95792,85.0421,99.9369
213,214,653,3246,969,282.955,46.7771,43.2229,99.9675
214,215,23254,2419,1075,91.9729,24.3821,65.6179,99.8491
215,216,32151,904,1067,88.60799999999998,63.8526,26.1474,99.8374
216,217,2111,2548,988,102.844,24.1673,65.8327,99.9974
217,218,7020,2637,1019,121.397,21.6732,68.3268,99.979
218,219,1130,574,999,136.005,63.8206,26.1794,99.8304
219,220,6387,1884,1023,306.112,14.1186,75.8814,99.9755
220,221,517,1591,998,290.5440000000001,54.1761,35.8239,99.9857
221,222,1111,3256,1015,282.956,47.1046,42.8954,99.9632
222,223,898,114,1017,270.683,28.0849,61.9151,99.9862
223,224,15982,2572,1092,129.268,39.4949,50.5051,99.9245
224,225,9953,2756,1074,301.926,43.0986,46.9014,99.9434
225,226,2864,104,1055,95.8415,42.2774,47.7226,99.97
226,227,16483,1558,1107,312.814,53.8256,36.1744,99.9685
227,228,5005,1777,1051,123.067,7.82746,82.1725,99.8116
228,229,10651,797,1110,97.3516,86.8631,3.13688,99.9754
229,230,1985,3116,1062,292.546,34.1361,55.8639,99.7851
230,231,3615,2048,1082,126.392,43.5482,46.4518,99.9859
231,232,3067,1721,1093,119.177,9.16728,80.8327,99.9978
232,233,917,2664,1075,298.987,28.8096,61.1904,99.9931
233,234,1067,1653,1083,126.47,24.0232,65.9768,99.998
234,235,28314,2201,1179,293.358,16.8425,73.1575,99.9069
235,236,8469,1419,1145,122.813,40.903,49.097,99.9852
236,237,552,1872,1094,128.29399999999998,31.4486,58.5514,99.5948
237,238,597,1898,1090,118.938,10.9273,79.0727,99.9953
238,239,2972,1835,1115,293.21,43.2616,46.7384,99.9957
239,240,54398,1980,1243,299.658,38.7608,51.2392,99.5601
240,241,978,124,1110,279.36400000000003,44.7017,45.2983,99.9606
241,242,22100,1756,1205,138.844,36.6024,53.3976,99.9807
242,243,4617,1661,1143,307.249,45.525,44.475,99.9826
243,244,13060,2672,1175,120.648,21.0924,68.9076,99.9837
244,245,8928,160,1190,97.6295,10.5483,79.4517,99.9633
245,246,741,94,1148,271.839,9.37695,80.6231,99.9866
246,247,712,558,1147,127.636,29.2234,60.7766,99.9835
247,248,642,2101,1147,302.795,39.2649,50.7351,99.9903
248,249,12023,2405,1195,121.57,26.5869,63.4131,99.9896
249,250,616,2518,1147,117.9,14.8211,75.1789,99.9721
250,251,1307,1839,1161,293.741,48.2106,41.7894,99.9548
251,252,1302,438,1165,107.125,18.0823,71.9177,99.9965
252,253,22575,1538,1236,115.448,53.229,36.771,99.9429
253,254,4755,893,1208,289.081,11.8956,78.1044,99.9731
254,255,13716,2830,1214,107.656,35.967,54.033,99.9766
255,256,12832,2544,1232,111.705,26.1999,63.8001,99.9505
256,257,7877,1049,1237,102.37,50.0884,39.9116,99.9826
257,258,32598,1386,1310,292.197,1.6754,88.3246,99.898
258,259,12360,970,1272,98.092,13.4577,76.5423,99.651
259,260,580,95,1226,92.0994,66.0524,23.9476,99.9719
260,261,9923,3037,1255,296.569,61.3532,28.6468,99.9281
261,262,58677,2767,1346,127.974,39.9425,50.0575,99.9507
262,263,22942,2227,1309,281.459,51.8474,38.1526,99.9878
263,264,15651,2357,1305,273.425,31.5686,58.4314,99.9758
264,265,4028,125,1281,146.842,72.1156,17.8844,99.7204
265,266,2286,2454,1257,124.883,40.8255,49.1745,99.9817
266,267,1671,1651,1268,312.756,53.0676,36.9324,99.9943
267,268,4122,1716,1299,119.111,12.7629,77.2371,99.9969
268,269,9508,204,1338,304.288,30.0929,59.9071,99.9702
269,270,12182,2466,1338,303.796,41.5187,48.4813,99.8837
270,271,601,2950,1298,227.666,69.3207,20.6793,99.9784
271,272,1266,365,1313,268.775,10.863,79.137,99.9967
272,273,28058,1778,1390,312.016,52.6964,37.3036,99.846
273,274,5187,1578,1363,313.601,52.907,37.093,99.9551
274,275,92770,1537,1591,119.046,4.78828,85.2117,99.8245
275,276,4031,2978,1342,129.858,3.28185,86.7181,99.994
276,277,8547,1044,1356,101.323,18.5194,71.4806,99.8413
277,278,131830,3025,1538,183.622,63.2483,26.7517,99.7664
278,279,13570,289,1396,120.303,62.5814,27.4186,99.969
279,280,1278,3107,1346,125.033,3.13475,86.8652,99.9894
280,281,1322,3255,1346,202.874,82.8312,7.16879,99.9588
281,282,725,2588,1339,103.237,23.9008,66.0992,99.994
282,283,15599,122,1433,74.0266,62.9446,27.0554,99.9573
283,284,584,1956,1349,309.502,54.2556,35.7444,99.983
284,285,36415,2546,1445,203.747,72.8667,17.1333,99.9101
285,286,3440,1312,1376,119.141,14.0212,75.9788,99.9801
286,287,1599,1929,1372,292.57,39.9124,50.0876,99.9534
287,288,830,1506,1366,118.199,3.05593,86.9441,99.8985
288,289,39321,2166,1499,303.579,16.9819,73.0181,99.988
289,290,32786,1325,1524,95.5533,57.8886,32.1114,99.5913
290,291,3224,1504,1405,103.074,55.6276,34.3724,99.8004
291,292,2227,2301,1397,124.573,59.7088,30.2912,99.9955
292,293,12095,2031,1478,123.693,17.9668,72.0332,99.8725
293,294,124932,319,1632,134.804,49.9912,40.0088,66.4333
294,295,1592,1930,1418,127.338,59.7149,30.2851,99.9774
295,296,1246,2264,1428,122.186,36.1791,53.8209,99.9947
296,297,8331,2342,1462,278.36,17.6223,72.3777,99.9745
297,298,68429,1924,1626,116.046,70.2834,19.7166,99.5738
298,299,878,2848,1469,125.324,4.11353,85.8865,99.959
299,300,4830,1750,1505,144.162,47.1527,42.8473,99.978
300,301,1063,2698,1493,95.922,59.104,30.896,99.9953
301,302,19538,2324,1576,134.252,10.1044,79.8956,99.9294
302,303,987,2615,1530,92.6829,51.0964,38.9036,99.543
303,304,5133,3254,1555,292.48,17.0159,72.9841,99.8785
304,305,8632,2664,1565,125.017,7.75558,82.2444,99.9665
305,306,2681,2434,1544,274.812,31.5442,58.4558,99.9116
306,307,2881,2529,1560,281.366,35.1814,54.8186,99.9221
307,308,31749,1775,1651,69.0639,74.0506,15.9494,99.9533
308,309,1443,261,1577,127.403,45.4098,44.5902,99.9989
309,310,2105,2466,1600,135.836,10.5738,79.4262,99.9179
310,311,1692,2086,1606,297.029,0.379601,89.6204,99.9963
311,312,12804,2549,1642,296.853,15.179,74.821,99.9972
312,313,8696,2733,1645,296.55,14.6147,75.3853,99.9819
313,314,30839,727,1677,236.746,79.0477,10.9523,99.9858
314,315,4387,2391,1638,115.804,42.0797,47.9203,99.9891
315,316,1305,197,1633,129.907,48.0968,41.9032,99.9981
316,317,18489,1191,1691,98.1009,65.5244,24.4756,99.9401
317,318,625,66,1643,118.674,25.8322,64.1678,99.4388
318,319,5592,2650,1673,80.7299,51.3802,38.6198,99.9658
319,320,1689,2138,1648,119.018,14.6573,75.3427,99.9951
320,321,79849,2167,1815,119.553,51.87600000000001,38.124,99.9311
321,322,10742,2300,1746,309.065,32.7279,57.2721,99.9891
322,323,19259,2870,1727,138.458,32.8598,57.1402,99.9928
323,324,3703,361,1688,117.526,33.3511,56.6489,99.9941
324,325,12381,2391,1704,130.901,69.362,20.638,99.9815
325,326,2228,3245,1700,110.287,29.7034,60.2966,99.9041
326,327,588,298,1670,162.564,83.3997,6.6003,99.9922
327,328,2852,234,1697,115.173,22.1662,67.8338,99.9897
328,329,1473,295,1694,127.785,20.4497,69.5503,99.8994
329,330,21331,2709,1759,301.329,27.6606,62.3394,99.9841
330,331,41101,836,1782,293.216,8.4492,81.5508,99.917
331,332,52216,1528,1830,313.746,49.8354,40.1646,99.9591
332,333,47082,2550,1841,106.368,18.545,71.455,99.7966
333,334,10823,296,1776,110.362,36.6755,53.3245,99.9381
334,335,50217,3025,1835,275.797,52.2773,37.7227,99.7146
335,336,9851,1284,1780,298.465,23.8364,66.1636,99.9954
336,337,4036,2414,1775,302.284,5.77176,84.2282,99.9966
337,338,57503,1165,1878,120.64,10.8139,79.1861,99.9897
338,339,3538,3188,1784,115.964,29.0912,60.9088,99.9785
339,340,86865,1700,1984,262.513,44.5896,45.4104,99.738
340,341,2544,621,1774,117.281,0.8734280000000001,89.1266,99.9962
341,342,55057,317,1939,125.562,27.2522,62.7478,99.9729
342,343,114917,992,2066,295.743,2.1788,87.8212,99.9289
343,344,45366,518,1954,301.949,53.6979,36.3021,77.4471
344,345,231324,2633,2085,300.893,8.72222,81.2778,99.235
345,346,603,2520,1829,303.009,6.14732,83.8527,99.9974
346,347,1679,604,1862,300.816,25.5816,64.4184,99.9914
347,348,30835,706,1928,326.405,64.4875,25.5125,99.9886
348,349,603,3210,1853,111.94,29.6814,60.3186,99.9448
349,350,926,3237,1885,113.379,26.828000000000007,63.172,99.5991
350,351,673,1851,1871,121.859,12.9595,77.0405,99.7686
351,352,921,88,1896,290.488,32.4275,57.5725,99.8031
352,353,15036,1967,1931,143.157,67.9088,22.0912,99.9488
353,354,1433,1866,1902,119.7,8.6637,81.3363,99.9796
354,355,33969,1299,2023,108.434,47.9869,42.0131,99.7912
355,356,601,3241,1926,111.098,67.8432,22.1568,99.6036
356,357,2244,3130,1936,296.101,18.6788,71.3212,99.9907
357,358,3972,2110,1945,323.753,49.4934,40.5066,99.9977
358,359,1621,826,1944,307.597,41.8643,48.1357,99.994
359,360,1574,2302,1959,313.985,47.8742,42.1258,99.9893
360,361,33758,1450,2059,115.844,66.3287,23.6713,99.5483
361,362,2988,3081,1968,161.041,56.4,33.6,99.9952
362,363,4325,3184,1990,273.71,71.666,18.334,99.9865
363,364,1723,352,1970,296.677,4.52374,85.4763,99.9888
364,365,1135,3263,1980,250.903,71.5951,18.4049,99.9036
365,366,1596,2074,1983,109.394,70.1506,19.8494,99.9891
366,367,10857,2172,2012,284.523,29.1641,60.8359,99.9386
367,368,21407,777,2065,150.65,65.1313,24.8687,99.9698
368,369,1313,1920,1998,279.329,26.7108,63.2892,99.9544
369,370,1768,2004,2006,300.6790000000001,12.4345,77.5655,99.8901
370,371,1291,1946,2030,264.97900000000004,43.6098,46.3902,99.8387
371,372,1285,2259,2043,305.745,35.3385,54.6615,99.9756
372,373,902,3147,2055,290.071,71.0696,18.9304,99.2289
373,374,5508,635,2088,120.343,30.5353,59.4647,99.944
374,375,2025,2046,2036,115.821,67.0785,22.9215,99.2256
375,376,2922,425,2058,201.36,69.9778,20.0222,99.9922
376,377,46067,187,2180,114.223,22.5313,67.4687,99.7735
377,378,3575,3250,2068,292.433,25.7556,64.2444,69.2589
378,379,7266,1875,2082,90.0056,48.3481,41.6519,99.9626
379,380,3420,1986,2076,301.904,47.6438,42.3562,99.8353
380,381,1783,2219,2091,284.703,27.4744,62.5256,99.8819
381,382,2346,1794,2078,304.742,54.8864,35.1136,99.9901
382,383,136482,2033,2301,140.09799999999998,63.6502,26.3498,99.8319
383,384,3377,3119,2113,300.981,29.2646,60.7354,99.9456
384,385,59946,488,2207,299.831,2.92793,87.0721,99.1527
385,386,2139,3009,2107,293.844,11.8787,78.1213,99.9946
386,387,19136,3201,2164,288.156,71.0146,18.9854,99.9534
387,388,11931,2274,2188,97.5413,37.4306,52.5694,99.9732
388,389,1149,1722,2110,126.351,34.4376,55.5624,99.6463
389,390,3015,3082,2158,295.199,5.25346,84.7465,99.8837
390,391,2434,665,2126,305.613,9.35258,80.6474,99.9958
391,392,6857,2878,2165,122.2,15.1959,74.8041,99.9962
392,393,35433,1786,2208,104.407,75.4862,14.5138,99.9532
393,394,932,722,2145,309.06,40.3306,49.6694,99.9927
394,395,34167,1207,2266,240.172,53.4994,36.5006,99.9668
395,396,11315,791,2213,305.036,9.53847,80.4615,99.9675
396,397,2473,1512,2174,124.772,11.707,78.293,99.9974
397,398,36878,3002,2290,286.87,26.2324,63.7676,99.5843
398,399,5200,714,2212,110.253,59.2086,30.7914,99.9962
399,400,9491,1364,2215,275.22700000000003,35.1149,54.8851,99.9913
400,401,918,2699,2220,309.443,25.0374,64.9626,99.9973
401,402,3487,419,2257,310.254,45.2122,44.7878,99.9661
402,403,898,1521,2219,311.281,72.7852,17.2148,99.9915
403,404,11723,1445,2286,105.481,2.09116,87.9088,99.7309
404,405,13657,2845,2265,178.638,83.8766,6.12345,99.9733
405,406,980,79,2249,265.736,67.3553,22.6447,99.9784
406,407,25691,2632,2323,313.885,31.9818,58.0182,99.9691
407,408,20270,3195,2301,303.182,7.42795,82.5721,99.8643
408,409,9206,1594,2280,265.444,30.197,59.803,99.9905
409,410,2900,1520,2271,262.462,34.5212,55.4788,99.981
410,411,1560,1665,2257,304.078,18.8224,71.1776,99.9833
411,412,95876,290,2435,130.037,48.5229,41.4771,99.8096
412,413,908,2217,2257,284.003,23.2282,66.7718,99.9811
413,414,3738,862,2284,133.74,56.2662,33.7338,99.9973
414,415,34857,610,2396,120.097,5.81499,84.185,99.9607
415,416,94249,1153,2475,118.54,9.69195,80.3081,99.8715
416,417,5596,577,2311,296.243,0.0193024,89.9807,99.993
417,418,2957,761,2313,133.659,56.6073,33.3927,99.9949
418,419,1010,1726,2304,116.964,9.94962,80.0504,99.995
419,420,13173,1744,2391,307.231,21.1152,68.8848,99.6359
420,421,1275,82,2348,270.01,69.0307,20.9693,99.9822
421,422,49795,2832,2436,278.813,38.0912,51.9088,99.8506
422,423,7235,859,2349,325.266,62.8375,27.1625,99.9354
423,424,22985,2243,2416,135.795,52.0487,37.9513,99.9206
424,425,2358,1757,2355,266.125,28.8889,61.1111,99.9819
425,426,14346,3087,2416,118.948,68.3294,21.6706,99.975
426,427,1053,2366,2343,112.66,79.0049,10.9951,99.9735
427,428,9600,1625,2388,110.423,53.4308,36.5692,99.9814
428,429,5833,2647,2396,108.106,39.849,50.151,99.9723
429,430,4242,1531,2364,101.014,56.1732,33.8268,99.9918
430,431,2006,2326,2359,304.219,30.3898,59.6102,99.9914
431,432,2777,2127,2365,111.186,49.8177,40.1823,99.9881
432,433,2012,760,2369,325.438,64.2265,25.7735,99.9078
433,434,12707,2420,2428,98.6064,36.0654,53.9346,99.5736
434,435,43225,900,2496,160.922,22.5342,67.4658,99.8173
435,436,3283,2504,2398,118.768,47.5646,42.4354,99.8981
436,437,32878,1389,2474,279.768,59.2285,30.7715,99.7518
437,438,8139,2694,2451,305.837,17.567,72.433,99.9065
438,439,15906,3192,2453,215.702,76.1322,13.8678,99.9436
439,440,14722,744,2487,116.672,0.458878,89.5411,99.982
440,441,2706,2346,2449,115.08,16.8696,73.1304,99.9602
441,442,9526,1589,2473,308.2290000000001,18.7699,71.2301,99.9836
442,443,6165,2539,2487,122.007,22.4132,67.5868,99.9872
443,444,151394,1761,2749,268.214,35.7896,54.2104,97.7374
444,445,2307,2325,2489,283.798,18.0354,71.9646,99.9731
445,446,5037,650,2502,306.173,82.2388,7.76116,99.6941
446,447,1237,2218,2485,295.936,47.8771,42.1229,99.9911
447,448,8143,2615,2534,125.502,26.895,63.105,99.919
448,449,14219,1780,2553,139.17700000000002,76.1912,13.8088,99.5601
449,450,5459,1935,2544,308.552,18.9854,71.0146,99.9255
450,451,5866,2999,2525,126.693,8.13316,81.8668,99.9526
451,452,575,1864,2503,307.117,19.4016,70.5984,99.9853
452,453,997,1888,2522,261.657,32.873000000000005,57.127,99.9252
453,454,21066,658,2614,304.43,18.4804,71.5196,99.991
454,455,8888,103,2596,114.041,1.55424,88.4458,99.5366
455,456,24973,3158,2578,286.974,35.1268,54.8732,91.6231
456,457,24567,2173,2610,302.121,30.0983,59.9017,99.9702
457,458,10711,2468,2569,114.396,47.2184,42.7816,99.6943
458,459,7896,1525,2575,128.02,14.8082,75.1918,99.9838
459,460,39461,492,2668,306.6020000000001,3.1376,86.8624,99.9716
460,461,587,3300,2545,236.384,65.2625,24.7375,99.3861
461,462,1049,1589,2539,140.795,43.4149,46.5851,99.951
462,463,13454,2334,2590,97.1596,35.019,54.981,99.9422
463,464,628,2032,2555,298.236,46.2313,43.7687,99.9197
464,465,16206,1358,2634,100.563,52.0403,37.9597,99.9796
465,466,6985,1456,2612,294.721,33.2972,56.7028,99.8729
466,467,23501,2833,2667,113.151,11.9756,78.0244,99.9413
467,468,13302,231,2606,295.741,24.5846,65.4154,99.9015
468,469,8646,2995,2599,195.022,57.3666,32.6334,99.9582
469,470,10537,2706,2608,129.643,11.3753,78.6247,99.9485
470,471,3186,2048,2595,118.514,16.398,73.602,99.9986
471,472,555,2911,2586,189.324,54.7088,35.2912,99.9074
472,473,24199,928,2668,132.983,54.9871,35.0129,98.0613
473,474,10024,358,2647,276.953,33.3259,56.6741,99.9937
474,475,17068,2620,2687,300.367,29.1472,60.8528,99.9907
475,476,1795,2550,2615,122.787,46.1335,43.8665,99.9378
476,477,1004,2407,2625,88.8794,40.2242,49.7758,99.9728
477,478,10823,3229,2686,116.36,9.52805,80.4719,99.942
478,479,28584,2968,2730,269.272,75.4867,14.5133,99.8558
479,480,45359,2471,2785,296.974,42.9519,47.0481,96.4605
480,481,530,196,2642,116.314,10.7005,79.2995,99.9109
481,482,2358,2054,2660,128.702,44.6826,45.3174,99.9654
482,483,2595,1064,2673,284.877,3.91077,86.0892,99.9073
483,484,3676,1241,2685,265.737,59.1351,30.8649,99.9657
484,485,5835,2712,2711,300.545,0.99704,89.00299999999999,99.9583
485,486,4561,848,2692,115.824,12.0356,77.9644,99.9943
486,487,3488,772,2695,333.49300000000005,67.598,22.402,99.9942
487,488,1867,213,2691,297.654,43.7545,46.2455,99.9944
488,489,54503,701,2807,163.287,60.0709,29.9291,100.004
489,490,753,261,2682,319.881,77.0732,12.9268,99.9969
490,491,2064,2535,2706,125.445,44.9843,45.0157,99.9695
491,492,2120,138,2718,294.031,47.8961,42.1039,99.9476
492,493,1474,1938,2694,109.595,26.3702,63.6298,99.9058
493,494,17267,2211,2729,125.369,46.7612,43.2388,99.7545
494,495,550,56,2692,303.35,48.8282,41.1718,99.7606
495,496,671,356,2711,125.237,51.2682,38.7318,99.9336
496,497,24205,1467,2813,271.187,29.1446,60.8554,96.7302
497,498,547,285,2702,126.643,51.9688,38.0312,99.9954
498,499,1799,2346,2714,282.457,48.7472,41.2528,99.978
499,500,1228,2128,2708,291.938,42.4615,47.5385,99.9871
500,501,58238,1290,2836,117.853,33.9123,56.0877,99.978
501,502,2549,1100,2727,108.746,49.58,40.42,99.9961
502,503,7573,3189,2777,193.199,57.6463,32.3537,99.895
503,504,1071,1162,2711,287.5420000000001,3.3951300000000004,86.6049,99.9783
504,505,8299,257,2778,297.156,43.6391,46.3609,99.8944
505,506,10681,900,2781,131.472,59.6861,30.3139,99.9324
506,507,1387,1137,2755,286.61,0.505058,89.4949,99.9339
507,508,8503,2724,2792,280.373,48.9009,41.0991,99.9616
508,509,36668,146,2920,111.347,15.8854,74.1146,99.7569
509,510,8325,3074,2794,101.444,24.6042,65.3958,99.9379
510,511,9208,320,2826,274.203,21.2847,68.7153,99.9056
511,512,52539,1074,2905,120.841,20.2827,69.7173,99.9843
512,513,1983,397,2781,162.02,59.732,30.268,99.996
513,514,26436,2293,2839,109.479,79.3638,10.6362,99.9701
514,515,4201,2603,2793,299.716,0.462265,89.5377,99.9941
515,516,5915,1562,2838,132.114,6.38328,83.6167,99.9848
516,517,5726,2108,2825,105.29,79.5099,10.4901,99.9833
517,518,17642,510,2875,297.837,27.7799,62.2201,99.9839
518,519,2325,2813,2804,255.21400000000003,58.5547,31.4453,99.9921
519,520,30024,2018,2891,5.43553,78.4228,11.5772,99.8307
520,521,1150,405,2837,273.959,20.2524,69.7476,99.9904
521,522,4865,2210,2883,125.69,48.7135,41.2865,99.9606
522,523,2239,2768,2843,301.3520000000001,35.4076,54.5924,99.9961
523,524,2263,84,2854,278.486,73.8104,16.1896,99.9679
524,525,17508,3119,2950,134.343,6.6941,83.3059,99.342
525,526,4060,3048,2853,287.754,9.8465,80.1535,99.9916
526,527,2864,3228,2854,281.635,36.5006,53.4994,99.9375
527,528,15879,2808,2913,283.25,48.2012,41.7988,99.971
528,529,9422,2654,2889,113.526,22.1161,67.8839,99.992
529,530,8576,2919,2916,261.118,47.1889,42.8111,99.8713
530,531,91638,379,3053,294.628,10.747,79.253,71.8057
531,532,2876,417,2894,117.622,53.3066,36.6934,99.99
532,533,1301,626,2878,125.234,50.6484,39.3516,99.9901
533,534,4764,2999,2919,286.009,24.8311,65.1689,99.9879
534,535,32795,898,2987,326.303,73.8145,16.1855,99.8426
535,536,2606,3203,2915,99.882,23.0838,66.9162,99.9766
536,537,2074,3261,2912,161.317,72.7482,17.2518,99.954
537,538,3642,2181,2955,284.153,32.1869,57.8131,99.9476
538,539,23268,1543,3064,129.237,58.2043,31.7957,99.6594
539,540,6767,2421,2977,299.982,14.4968,75.5032,99.8893
540,541,6987,641,2966,308.646,6.67162,83.3284,99.9495
541,542,120484,2703,3085,305.45,13.0311,76.9689,97.8929
542,543,1245,487,2949,100.587,29.3786,60.6214,99.9765
543,544,17312,716,3029,302.681,22.0585,67.9415,99.9157
544,545,2801,2227,2983,124.304,14.5376,75.4624,99.9907
545,546,640,1912,2956,293.886,0.434837,89.5652,99.965
546,547,23793,3201,3087,302.927,44.5143,45.4857,99.8876
547,548,9409,2313,2999,277.414,34.7554,55.2446,99.9424
548,549,7545,1969,3018,115.581,8.17552,81.8245,99.9038
549,550,3039,1852,3011,71.2879,77.2698,12.7302,99.3957
550,551,11279,1436,3020,129.471,2.48772,87.5123,99.9549
551,552,4144,2114,2991,155.488,78.229,11.771,99.9846
552,553,5181,3034,3017,270.02,48.2099,41.7901,99.905
553,554,12579,1294,3036,304.963,19.4979,70.5021,99.9757
554,555,10339,1659,3037,262.651,31.0308,58.9692,99.9291
555,556,762,1913,2991,28.5263,83.0681,6.93192,99.9098
556,557,887,2042,2994,297.215,48.8998,41.1002,99.9853
557,558,14305,1762,3076,127.159,42.2401,47.7599,99.9483
558,559,1260,213,3023,115.131,15.952,74.048,99.9919
559,560,634,631,3022,131.481,39.9755,50.0245,99.9941
560,561,8573,2087,3060,125.222,52.2564,37.7436,99.8509
561,562,968,1901,3043,310.821,25.9405,64.0595,99.8669
562,563,4652,2191,3071,121.849,46.5451,43.4549,99.8512
563,564,3257,2359,3074,122.131,4.91348,85.0865,99.9818
564,565,3571,2425,3065,102.718,16.5543,73.4457,99.7085
565,566,7824,1246,3110,114.461,19.1941,70.8059,99.9938
566,567,104589,1025,3237,126.065,29.9296,60.0704,99.9709
567,568,4010,2284,3091,105.013,86.2964,3.70356,99.9741
568,569,601,1525,3069,122.987,8.77524,81.2248,99.9894
569,570,2340,1869,3079,111.7,48.0066,41.9934,99.9667
570,571,3622,111,3105,279.26,34.6337,55.3663,99.976
571,572,5273,842,3090,119.736,47.3924,42.6076,99.8059
572,573,1676,3072,3094,114.765,0.230293,89.7697,99.9971
573,574,2589,1360,3109,121.107,65.4168,24.5832,99.9955
574,575,1316,1931,3094,113.635,17.607,72.393,99.9336
575,576,83979,2067,3350,140.226,32.3585,57.6415,95.8466
576,577,55073,1834,3256,292.95,39.1357,50.8643,99.9111
577,578,24341,1323,3205,302.41,18.0529,71.9471,99.727
578,579,8813,2412,3142,116.875,3.10011,86.8999,99.9494
579,580,1513,384,3138,118.654,0.954277,89.0457,99.6486
580,581,2373,704,3121,272.111,54.0822,35.9178,99.9968
581,582,5098,772,3144,278.465,46.2429,43.7571,99.9881
582,583,2002,1685,3140,292.267,38.9686,51.0314,99.9743
583,584,18577,2246,3186,293.212,55.7484,34.2516,99.9851
584,585,8147,2104,3161,108.542,84.1961,5.8039,99.9378
585,586,49275,2934,3269,155.80100000000004,73.9632,16.0368,99.5369
586,587,27919,690,3226,134.821,42.0165,47.9835,99.9366
587,588,2763,2341,3157,107.942,31.7644,58.2356,99.9879
588,589,12090,94,3237,127.352,26.8231,63.1769,99.7516
589,590,557,1652,3140,110.982,43.8309,46.1691,99.9022
590,591,775,1620,3151,282.045,54.8657,35.1343,99.9917
591,592,8614,359,3230,94.2123,50.7137,39.2863,99.8627
592,593,15014,2756,3224,137.727,36.5201,53.4799,99.7194
593,594,3319,1714,3193,111.622,41.6785,48.3215,99.9614
594,595,2301,1635,3193,110.965,42.4637,47.5363,99.8534
595,596,647,598,3171,21.3509,85.9306,4.0694300000000005,99.9853
596,597,5495,161,3211,288.587,26.336,63.664,99.9738
597,598,34119,2360,3308,192.1,75.1718,14.8282,92.6476
598,599,30843,464,3308,47.6455,87.5627,2.4372700000000003,99.9782
599,600,1282,1580,3220,113.954,42.0629,47.9371,99.9526
600,601,26439,3152,3291,149.217,64.6243,25.3757,99.9531
601,602,55087,1596,3340,134.499,45.0654,44.9346,99.9088
602,603,1594,2407,3213,107.295,23.1525,66.8475,99.989
603,604,1111,3091,3218,312.124,42.5453,47.4547,99.9941
604,605,15667,1362,3273,315.1620000000001,64.9937,25.0063,99.9356
605,606,23172,281,3312,126.45,35.2161,54.7839,99.9679
606,607,5537,685,3284,44.6166,88.0882,1.91182,99.9978
607,608,11023,834,3306,284.508,20.5119,69.4881,99.975
608,609,52540,2721,3395,137.976,26.7523,63.2477,99.9958
609,610,91849,698,3482,300.552,9.11328,80.8867,98.4841
610,611,15187,171,3350,293.288,17.892,72.108,99.88
611,612,2480,2997,3318,163.344,63.9913,26.0087,99.9196
612,613,930,2189,3315,138.404,79.8738,10.1262,99.9937
613,614,913,2243,3315,143.407,80.3477,9.65231,99.9963
614,615,195133,2407,3613,127.322,10.8885,79.1115,72.5428
615,616,6652,1274,3373,110.222,44.6304,45.3696,99.9802
616,617,1573,1422,3353,278.03700000000003,13.1029,76.8971,99.989
617,618,11001,359,3425,295.428,15.0414,74.9586,99.9797
618,619,19809,1222,3448,280.275,48.8723,41.1277,99.9766
619,620,68841,1195,3545,118.511,42.3837,47.6163,97.2245
620,621,11953,2986,3431,307.672,24.5885,65.4115,99.9775
621,622,5230,1093,3402,275.446,14.5273,75.4727,99.9692
622,623,2151,3174,3382,303.225,38.5037,51.4963,99.9905
623,624,1453,762,3393,115.043,27.9096,62.0904,99.9932
624,625,1950,1915,3385,173.96400000000003,71.6858,18.3142,99.9704
625,626,36625,3118,3479,298.303,25.0931,64.9069,99.8144
626,627,3112,1963,3415,305.446,2.49608,87.5039,99.9743
627,628,2628,1468,3416,205.017,85.0989,4.90109,99.9785
628,629,17655,141,3488,141.931,63.9577,26.0423,99.8687
629,630,7379,1887,3460,103.855,38.733,51.267,99.9017
630,631,3789,814,3442,96.2216,42.8934,47.1066,99.9802
631,632,16133,1785,3502,301.721,0.678604,89.3214,99.9504
632,633,34522,1587,3561,129.79399999999998,5.3983,84.6017,97.5403
633,634,60220,1399,3685,297.822,39.2278,50.7722,99.9187
634,635,1959,2893,3451,282.7340000000001,21.8109,68.1891,99.9942
635,636,135253,474,3731,114.914,52.4172,37.5828,95.7463
636,637,1485,1973,3470,99.7974,71.9284,18.0716,99.9905
637,638,2674,2218,3471,113.154,83.8712,6.12876,99.9958
638,639,8874,2643,3538,160.1,56.8612,33.1388,99.9023
639,640,505,624,3489,299.928,33.6269,56.3731,99.9686
640,641,93498,2923,3692,107.221,38.436,51.56399999999999,64.3907
641,642,6531,929,3574,96.1379,38.4182,51.5818,99.7823
642,643,24697,258,3618,282.892,22.8624,67.1376,99.9836
643,644,14689,2703,3614,290.329,11.545,78.455,99.8265
644,645,1432,498,3548,293.588,35.1435,54.8565,99.992
645,646,42239,1819,3653,256.893,70.4213,19.5787,99.9544
646,647,3223,3214,3595,112.667,17.7899,72.2101,99.9904
647,648,1523,584,3581,121.918,36.9547,53.0453,99.9905
648,649,1407,1682,3582,121.647,66.794,23.206,99.9843
649,650,993,554,3593,124.633,35.0657,54.9343,99.9517
650,651,9577,2070,3631,307.214,7.43542,82.5646,99.9784
651,652,7196,120,3636,106.852,10.5193,79.4807,99.938
652,653,6102,3150,3639,137.55200000000002,69.3584,20.6416,99.9685
653,654,2369,1131,3642,309.568,7.780689999999999,82.2193,99.9795
654,655,711,47,3632,121.098,3.10365,86.8963,99.4247
655,656,3837,900,3663,118.083,6.2823699999999985,83.7176,99.9872
656,657,1130,621,3643,295.493,32.7047,57.2953,99.9818
657,658,1094,1004,3635,117.162,40.5403,49.4597,99.9969
658,659,10468,781,3689,114.78,59.1206,30.8794,99.9908
659,660,1647,963,3650,121.76,41.005,48.995,99.9677
660,661,2485,3223,3677,120.24,15.2016,74.7984,99.9617
661,662,56644,2057,3773,127.276,19.954,70.046,99.9769
662,663,7487,104,3708,95.3053,17.0714,72.9286,99.9369
663,664,5091,1039,3680,298.722,33.2177,56.7823,99.9922
664,665,6999,2647,3709,120.169,22.9461,67.0539,99.9012
665,666,16693,1634,3740,291.274,83.1922,6.80778,99.96
666,667,2440,700,3685,299.499,19.1173,70.8827,99.9961
667,668,14174,1200,3755,280.336,66.3183,23.6817,99.9794
668,669,41090,1005,3833,307.558,8.987060000000003,81.0129,98.9517
669,670,812,872,3695,119.364,41.4985,48.5015,99.9964
670,671,18339,202,3781,290.723,10.1794,79.8206,99.9446
671,672,2022,2724,3712,196.764,62.2833,27.7167,99.994
672,673,4052,3169,3740,120.363,18.0478,71.9522,99.9679
673,674,20592,814,3793,301.123,18.4214,71.5786,99.8555
674,675,4304,81,3773,285.531,7.48418,82.5158,99.9344
675,676,9158,1769,3786,116.372,20.8305,69.1695,99.9912
676,677,2171,2706,3759,297.068,58.8022,31.1978,99.9971
677,678,1091,2608,3750,110.407,52.5498,37.4502,99.9969
678,679,5712,3085,3773,294.283,25.1928,64.8072,99.9908
679,680,7414,1132,3805,108.468,36.1046,53.8954,99.9933
680,681,5215,1528,3794,127.119,32.6796,57.3204,99.9847
681,682,1041,3255,3786,115.757,17.1497,72.8503,99.9252
682,683,20065,2706,3840,312.192,2.07518,87.9248,99.9973
683,684,9887,3117,3829,119.733,13.4037,76.5963,99.9688
684,685,16426,1909,3883,131.928,31.8595,58.1405,99.977
685,686,88273,1417,3995,135.594,37.0544,52.9456,99.964
686,687,27590,3192,3931,118.403,15.4798,74.5202,99.6094
687,688,4615,1600,3831,112.576,13.982,76.018,99.9949
688,689,62541,2174,3980,129.702,25.177,64.82300000000001,96.8937
689,690,6349,266,3843,300.5490000000001,0.930069,89.0699,99.9957
690,691,7176,3049,3874,302.257,7.26273,82.7373,99.9771
691,692,2809,2293,3861,118.176,2.21848,87.7815,99.9634
692,693,4417,81,3868,110.512,66.3438,23.6562,99.9552
693,694,50382,1748,3983,295.455,39.3383,50.6617,98.8387
694,695,508,2325,3833,120.675,21.0339,68.9661,99.9937
695,696,869,2252,3848,305.458,21.8573,68.1427,99.9962
696,697,1304,1210,3855,137.227,41.8821,48.1179,99.9904
697,698,2004,2372,3862,132.19799999999998,72.921,17.079,99.9843
698,699,641,585,3852,294.618,10.9145,79.0855,99.9942
699,700,4481,1304,3872,111.273,64.9676,25.0324,99.9897
700,701,2204,814,3868,101.884,36.4536,53.5464,99.9916
701,702,7268,2832,3904,116.023,71.4118,18.5882,99.8994
702,703,21405,226,3927,124.639,25.4357,64.5643,99.9434
703,704,719,741,3868,299.658,27.5962,62.4038,99.9718
704,705,9658,635,3910,119.667,76.656,13.344,99.9917
705,706,1406,873,3878,294.349,5.24627,84.7537,99.9937
706,707,51802,771,4033,112.697,5.02986,84.9701,53.481
707,708,5950,2357,3934,298.686,28.8665,61.1335,99.9586
708,709,1963,1178,3898,275.384,65.6335,24.3665,99.9835
709,710,4795,2983,3934,308.976,16.1221,73.8779,99.406
710,711,679,2385,3902,129.856,26.3587,63.6413,99.958
711,712,9549,2725,3946,282.639,39.736,50.264,99.9797
712,713,6718,880,3944,103.578,35.9792,54.0208,99.9768
713,714,46564,1117,4105,293.536,78.1801,11.8199,99.8183
714,715,1424,1108,3919,108.723,1.00459,88.9954,99.9771
715,716,1429,2581,3921,306.509,28.6264,61.3736,99.9632
716,717,5000,2034,3938,133.05,21.7633,68.2367,99.9574
717,718,572,2500,3921,149.86,77.8755,12.1245,99.9593
718,719,670,705,3935,291.502,14.5249,75.4751,99.9942
719,720,1530,2620,3946,289.096,58.7868,31.2132,99.9935
720,721,5758,1636,3976,297.111,41.6301,48.3699,99.9637
721,722,5993,75,3985,285.785,31.2712,58.7288,99.8043
722,723,24155,1180,4028,108.618,68.9819,21.0181,99.4271
723,724,5198,2465,3973,299.331,21.5588,68.4412,99.935
724,725,32396,2961,4043,130.66,53.197,36.803,99.5225
725,726,1220,511,3971,123.256,76.039,13.961,99.9965
726,727,52072,245,4102,277.238,79.8922,10.1078,99.9387
727,728,2699,2532,3969,134.89,36.4816,53.5184,99.997
728,729,48435,2635,4132,291.469,19.8716,70.1284,99.9476
729,730,38279,454,4144,307.807,16.4819,73.5181,99.8793
730,731,3278,2400,4003,281.357,64.6711,25.3289,99.8926
731,732,677,649,3979,283.132,22.6769,67.3231,99.7468
732,733,610,2335,3978,116.785,3.1970400000000003,86.803,99.9968
733,734,1534,2811,3988,313.629,3.3793900000000003,86.6206,99.9949
734,735,56404,1974,4140,302.011,36.3432,53.6568,65.3592
735,736,3787,376,4026,303.772,0.8618469999999999,89.1382,99.9759
736,737,7704,2538,4055,132.494,35.0049,54.9951,99.9561
737,738,3311,482,4036,306.5490000000001,4.38727,85.6127,99.978
738,739,2286,2006,4014,151.92,83.1873,6.81273,99.7203
739,740,3925,593,4032,293.279,5.09171,84.9083,99.977
740,741,1433,2342,4017,128.281,32.113,57.887,99.9827
741,742,594,2507,4011,96.519,68.7863,21.2136,99.9887
742,743,6300,2778,4043,293.7870000000001,32.0575,57.9425,99.9218
743,744,12034,3102,4063,290.118,24.0303,65.9697,99.928
744,745,8863,2406,4065,307.027,13.9189,76.0811,99.8459
745,746,974,3206,4036,117.026,39.5015,50.4985,99.9699
746,747,18177,1575,4138,304.622,23.4701,66.5299,99.9204
747,748,2085,3249,4057,115.374,25.0096,64.9904,99.9377
748,749,928,82,4069,270.007,79.6305,10.3695,99.9759
749,750,16252,2850,4148,145.97799999999995,37.726,52.274,99.9782
750,751,4757,1987,4116,298.858,1.84311,88.1569,99.9616
751,752,1345,969,4084,108.028,60.8506,29.1494,99.9699
752,753,5917,1517,4098,122.321,23.9692,66.0308,99.9849
753,754,7886,584,4123,110.839,0.5622560000000001,89.4377,99.979
754,755,608,3175,4100,106.539,7.74265,82.2573,99.9943
755,756,15453,2309,4152,357.436,74.3996,15.6004,99.8477
756,757,11662,2448,4162,138.59799999999998,39.4335,50.5665,99.987
757,758,101714,870,4369,111.928,28.3634,61.6366,63.3516
758,759,4009,3098,4135,300.691,21.428,68.572,99.9887
759,760,988,2757,4125,296.563,31.2931,58.7069,99.9966
760,761,9481,823,4172,114.577,62.1208,27.8792,99.9889
761,762,7615,726,4173,285.891,16.4204,73.5796,99.9916
762,763,67861,1740,4309,153.127,23.0974,66.9026,99.9218
763,764,1654,3217,4145,105.704,8.93811,81.0619,99.9857
764,765,3484,3169,4187,17.2442,86.1223,3.87773,99.9703
765,766,523,900,4146,289.468,15.3592,74.6408,99.9707
766,767,12461,2746,4223,317.182,5.94784,84.0522,99.9116
767,768,19646,2959,4225,308.812,39.1274,50.8726,99.9686
768,769,3154,3247,4190,112.821,0.901192,89.0988,99.9745
769,770,1621,1606,4172,122.494,12.0205,77.9795,99.9975
770,771,887,1874,4182,285.062,30.5462,59.4538,99.9979
771,772,2331,2222,4201,123.451,19.0942,70.9058,99.9993
772,773,48724,3065,4334,288.004,25.9277,64.0723,99.9553
773,774,9024,602,4213,287.63,17.2254,72.7746,99.9887
774,775,672,3201,4219,340.335,86.0015,3.99846,99.9847
775,776,2385,1612,4218,113.952,4.8334199999999985,85.1666,99.9973
776,777,5592,1141,4249,98.2275,70.5342,19.4658,99.9428
777,778,2218,2401,4229,320.722,4.6114,85.3886,99.9911
778,779,1037,327,4218,290.932,16.3629,73.6371,99.9968
779,780,19731,662,4283,109.372,1.8559,88.1441,99.995
780,781,2910,1204,4237,303.406,64.7501,25.2499,99.9895
781,782,6547,2494,4254,305.893,56.717,33.283,99.9961
782,783,3903,2030,4246,122.721,20.7169,69.2831,99.9984
783,784,107038,2164,4374,328.629,70.4492,19.5508,94.2834
784,785,14078,1266,4292,314.4190000000001,65.71,24.29,99.9141
785,786,10437,120,4282,311.464,24.0079,65.9921,99.7334
786,787,12477,1420,4286,118.307,52.6504,37.3496,99.8672
787,788,40613,305,4323,111.61,12.2104,77.7896,99.999
788,789,3874,3238,4269,120.799,10.4806,79.5194,99.925
789,790,32641,703,4382,113.843,42.3969,47.6031,99.9847
790,791,5199,2793,4304,308.762,13.8306,76.1694,99.7641
791,792,4006,1895,4317,119.999,20.7357,69.2643,99.9889
792,793,1304,1569,4279,291.241,59.4435,30.5565,99.9983
793,794,13058,2425,4350,310.047,45.5987,44.4013,99.9615
794,795,6743,1518,4326,127.137,17.4949,72.5051,99.9927
795,796,178204,2522,4658,283.192,70.2729,19.7271,84.2607
796,797,788,1604,4296,124.843,11.4099,78.5901,99.9895
797,798,2504,448,4336,271.092,20.7668,69.2332,99.9894
798,799,5319,2631,4322,135.997,77.6531,12.3469,99.9412
799,800,1922,486,4322,269.86400000000003,19.8758,70.1242,99.8755
800,801,10736,2879,4346,124.569,2.4664,87.5336,99.9896
801,802,4040,2737,4338,151.601,80.5419,9.45809,99.9586
802,803,21014,3208,4407,319.344,46.3308,43.6692,99.8785
803,804,1524,1572,4326,126.247,46.7232,43.2768,99.9967
804,805,13662,521,4403,294.43,16.3953,73.6047,99.9429
805,806,26937,1263,4390,116.253,39.2163,50.7837,99.9672
806,807,7761,2665,4409,315.534,5.51921,84.4808,99.9851
807,808,986,40,4376,310.582,46.6844,43.3156,99.8686
808,809,64868,192,4535,114.164,13.0757,76.9243,90.237
809,810,85711,1606,4543,129.243,4.048030000000002,85.95200000000001,80.4893
810,811,21931,2770,4454,100.455,29.8635,60.1365,99.8855
811,812,16622,1869,4461,127.038,19.4655,70.5345,99.9828
812,813,605,73,4399,302.031,47.9856,42.0144,99.9634
813,814,4501,1072,4421,103.153,53.4075,36.5925,99.9885
814,815,842,511,4397,266.256,16.4116,73.5884,99.985
815,816,577,462,4391,305.9240000000001,26.666,63.334,99.9252
816,817,2148,403,4436,260.994,14.6262,75.3738,99.9899
817,818,56401,1250,4562,106.36,46.5747,43.4253,63.1755
818,819,872,441,4437,307.699,23.2006,66.7994,99.6289
819,820,6422,1134,4460,285.351,12.1784,77.8216,99.99
820,821,627,1668,4430,284.701,17.335,72.665,99.9862
821,822,25188,2925,4518,185.731,82.165,7.834989999999999,69.8913
822,823,548,204,4439,308.1690000000001,26.0352,63.9648,99.9742
823,824,2455,2859,4465,305.378,13.0286,76.9714,99.975
824,825,33655,2165,4567,102.442,3.5744300000000004,86.4256,89.0685
825,826,22127,1021,4538,118.153,25.7406,64.2594,83.3894
826,827,13007,3146,4528,126.686,50.1206,39.8794,99.6317
827,828,6375,386,4529,125.401,34.8512,55.1488,77.5457
828,829,101430,793,4694,315.838,45.7116,44.2884,99.9638
829,830,32920,1894,4651,275.646,67.0927,22.9073,99.9088
830,831,7924,483,4600,292.647,11.1598,78.8402,99.9708
831,832,18388,2992,4621,297.42,30.9207,59.0793,99.9432
832,833,2340,317,4605,125.248,44.3753,45.6247,99.9972
833,834,9386,2778,4610,312.635,7.62988,82.3701,99.9877
834,835,41082,3165,4685,320.769,45.1149,44.8851,99.9274
835,836,2776,413,4595,305.027,26.2752,63.7248,99.8934
836,837,2199,358,4594,276.59,24.8381,65.1619,99.9878
837,838,7565,579,4621,279.633,63.5006,26.4994,99.995
838,839,5315,1599,4632,293.2940000000001,38.7877,51.2123,99.9959
839,840,7094,2014,4636,126.717,1.09,88.91,99.8626
840,841,7987,2704,4651,286.605,23.5351,66.4649,99.995
841,842,67373,1439,4758,298.467,10.5798,79.4202,98.9008
842,843,14079,2838,4727,280.164,32.2236,57.7764,99.9729
843,844,20201,349,4720,133.08,67.3176,22.6824,99.9299
844,845,31329,2238,4770,297.648,11.5843,78.4157,99.9352
845,846,15300,507,4716,285.413,9.48254,80.5175,99.987
846,847,28736,1150,4732,308.529,9.70914,80.2909,99.8351
847,848,3931,613,4688,125.017,48.4401,41.5599,99.9976
848,849,4657,2078,4681,295.482,10.9625,79.0375,99.9677
849,850,3380,248,4689,303.637,37.5357,52.4643,99.9364
850,851,46751,2993,4827,286.325,22.5772,67.4228,98.7629
851,852,1410,140,4703,103.471,16.9637,73.0363,99.9925
852,853,31377,2030,4795,305.464,0.85025,89.1497,99.7477
853,854,2756,1002,4726,98.467,49.8156,40.1844,99.9747
854,855,857,2768,4711,120.347,25.3471,64.6529,99.9973
855,856,33889,1737,4794,132.091,30.5555,59.4445,99.6108
856,857,1998,108,4734,108.204,42.899,47.101000000000006,99.9841
857,858,12572,236,4792,307.645,16.1727,73.8273,99.8552
858,859,4067,939,4745,284.194,7.7161399999999984,82.2839,99.9745
859,860,1385,1982,4734,286.333,51.6629,38.3371,99.9889
860,861,4226,2529,4766,120.481,22.7229,67.2771,99.9466
861,862,4633,90,4789,128.232,64.3329,25.6671,99.9395
862,863,17731,429,4821,258.321,69.7646,20.2354,88.9373
863,864,1452,2958,4771,308.223,16.7354,73.2646,99.9376
864,865,11628,160,4837,127.138,18.9622,71.0378,99.9489
865,866,8656,954,4832,302.963,8.61768,81.3823,99.9197
866,867,654,1012,4788,99.4181,50.8095,39.1905,99.995
867,868,1293,1883,4788,307.856,10.8772,79.1228,99.9977
868,869,6156,1054,4829,97.126,54.0199,35.9801,99.9744
869,870,1989,1221,4804,115.599,54.2714,35.7286,99.9487
870,871,10799,535,4859,120.624,15.4282,74.5718,99.9087
871,872,1182,3248,4820,319.036,46.159,43.841,99.8197
872,873,941,2348,4817,115.969,22.7568,67.2432,99.9852
873,874,785,2778,4809,278.461,32.8312,57.1688,99.9404
874,875,20969,2787,4914,103.89,22.1708,67.8292,99.2457
875,876,2469,1206,4850,297.741,12.1037,77.8963,99.9839
876,877,1403,611,4871,285.3590000000001,23.2178,66.7822,99.9687
877,878,2172,335,4890,272.60200000000003,10.136,79.86399999999998,99.9591
878,879,555,870,4873,280.441,62.2053,27.7947,99.9826
879,880,5922,2902,4969,234.065,17.3589,72.6411,98.3338
