,Grain No.,Size [Pixel],center x-coordinate,center y-coordinate,mean azimuth [degree],mean latitude [degree],mean colatitude [degree],Regelungsgrad [%]
0,1,5000,950,173,119.073,59.1003,30.8997,97.314
1,2,47497,2979,292,104.86,7.72554,82.2745,95.929
2,3,8844,816,225,97.4912,4.3373800000000005,85.6626,98.336
3,4,978,3139,174,110.372,58.4879,31.5121,99.9133
4,5,685,1718,172,134.987,74.9569,15.0431,99.9474
5,6,92554,1377,346,275.106,23.7152,66.2848,96.8012
6,7,2165,3160,217,122.6,48.0679,41.9321,99.9056
7,8,1562,907,214,77.182,44.292,45.708,97.4919
8,9,59731,1042,310,102.985,42.5903,47.4097,99.9567
9,10,9761,1708,222,279.348,14.1289,75.8711,99.9918
10,11,2928,1533,204,97.9583,19.5786,70.4214,99.7763
11,12,587,2862,200,105.43,4.80917,85.1908,99.9762
12,13,790,2533,205,280.208,21.5087,68.4913,99.8565
13,14,1165,2781,208,285.578,2.69214,87.3079,99.968
14,15,19270,2341,267,106.882,5.427219999999998,84.5728,99.9737
15,16,7549,1877,233,139.656,71.5563,18.4437,99.985
16,17,37277,2498,322,278.863,19.1786,70.8214,99.8395
17,18,5164,3196,272,112.742,49.7873,40.2127,99.9498
18,19,730,883,232,97.2758,39.1146,50.8854,99.7961
19,20,105783,438,385,102.799,42.3296,47.6704,99.9311
20,21,1294,1457,226,97.2234,19.3297,70.6703,99.9779
21,22,27907,2170,315,273.589,69.1394,20.8606,99.9863
22,23,31718,2703,296,286.991,2.1298,87.8702,99.9608
23,24,3144,2027,243,275.039,14.3835,75.6165,99.9608
24,25,2078,759,271,287.612,7.1372800000000005,82.8627,99.4713
25,26,1384,2096,257,267.361,69.7069,20.2931,99.9949
26,27,1823,1993,267,275.503,13.6252,76.3748,99.9434
27,28,508,3238,265,118.7,48.2635,41.7365,99.9054
28,29,4901,3181,337,112.728,49.5901,40.4099,99.9643
29,30,80440,1724,417,280.975,14.4563,75.5437,99.8908
30,31,4257,1595,292,100.203,18.9092,71.0908,99.9878
31,32,3736,109,313,113.318,2.3802,87.6198,97.0629
32,33,525,1934,270,290.212,17.4848,72.5152,99.9939
33,34,7421,1909,303,290.277,17.5239,72.4761,99.9846
34,35,876,1993,297,273.339,14.4987,75.5013,99.8402
35,36,4348,2845,339,108.704,32.5123,57.4877,99.9855
36,37,1956,3236,337,111.538,49.8445,40.1555,99.9654
37,38,9750,2000,374,290.814,62.1326,27.8674,99.8949
38,39,937,3297,337,283.761,41.3441,48.6559,99.9525
39,40,29290,747,437,280.72900000000004,13.1077,76.8923,99.9228
40,41,517,3354,343,282.755,35.1584,54.8416,99.9712
41,42,1390,75,362,272.839,73.7639,16.2361,99.5917
42,43,5428,2356,394,110.205,52.3466,37.6534,99.9736
43,44,12377,2080,451,114.55,16.3499,73.6501,99.957
44,45,3003,1914,382,101.826,8.45775,81.5423,99.9477
45,46,540,2275,377,273.473,69.5207,20.4793,99.9404
46,47,62396,2787,520,105.962,11.4421,78.5579,99.891
47,48,17220,138,451,279.367,13.6481,76.3519,99.8739
48,49,537,3309,391,281.386,40.1408,49.8592,99.7387
49,50,751,2237,402,94.7411,13.7734,76.2266,99.9679
50,51,39420,987,473,103.719,21.9314,68.0686,92.0384
51,52,4834,2651,418,109.726,31.7756,58.2244,99.9733
52,53,1137,3383,413,280.94,33.4839,56.5161,99.7269
53,54,786,2291,405,108.495,6.4753300000000005,83.5247,99.9923
54,55,2946,2453,419,89.4473,14.2404,75.7596,99.9716
55,56,2290,3180,425,104.473,9.87949,80.1205,99.7481
56,57,1391,2154,418,270.041,32.1436,57.8564,99.9955
57,58,3589,3336,459,272.463,32.5486,57.4514,99.9913
58,59,2276,1882,449,277.659,40.8113,49.1887,99.9666
59,60,4318,1964,455,102.42,26.0683,63.9317,99.8579
60,61,16040,3010,492,120.964,40.2395,49.7605,99.74
61,62,13576,2298,527,108.854,39.5411,50.4589,99.6992
62,63,5126,2485,469,94.1072,15.2092,74.7908,99.5528
63,64,516,2185,450,110.869,22.1438,67.8562,99.9843
64,65,1462,1274,467,105.195,37.433,52.567,99.989
65,66,1889,3438,484,100.629,48.2107,41.7893,99.9526
66,67,1219,2611,457,110.334,31.9047,58.0953,99.9844
67,68,1196,2191,469,111.221,23.0435,66.9565,99.9865
68,69,973,2392,468,274.856,18.9959,71.0041,99.9874
69,70,2621,3171,494,103.89,9.03164,80.9684,99.9278
70,71,1714,3258,487,278.876,4.0424,85.9576,99.9677
71,72,9496,2591,524,137.547,69.3987,20.6013,99.4749
72,73,1032,3405,498,108.501,5.52496,84.475,99.7724
73,74,3201,1285,517,101.092,37.2957,52.7043,99.3639
74,75,30329,2421,610,282.328,42.9951,47.0049,99.8126
75,76,5237,3332,558,99.3459,6.7255600000000015,83.2744,99.9082
76,77,2157,2226,511,267.839,31.7673,58.2327,99.9836
77,78,3164,2350,527,105.819,49.1547,40.8453,99.5289
78,79,3342,117,538,281.861,1.88616,88.1138,99.9604
79,80,664,1171,506,285.647,9.3401,80.6599,99.9783
80,81,3503,2017,530,295.425,59.4401,30.5599,99.6163
81,82,37863,1374,669,108.61,34.4025,55.5975,99.6691
82,83,8674,1483,569,285.138,23.2793,66.7207,99.74
83,84,15076,1962,589,100.08,38.3577,51.6423,99.7995
84,85,6589,2185,554,289.983,7.51723,82.4828,65.2805
85,86,200564,315,771,102.833,9.72074,80.2793,91.6095
86,87,611,2855,513,289.087,23.3688,66.6312,99.9874
87,88,17003,1211,578,285.807,8.560039999999999,81.44,99.9644
88,89,1017,597,524,282.063,12.4097,77.5903,99.9674
89,90,1403,76,560,98.8645,12.0417,77.9583,99.9071
90,91,12259,725,556,280.885,12.2728,77.7272,99.902
91,92,1180,3253,545,279.16900000000004,3.21743,86.7826,99.9549
92,93,1451,2536,561,101.57,16.2496,73.7504,99.9902
93,94,1775,299,561,101.145,0.8701549999999999,89.1298,99.9819
94,95,111453,3158,822,111.389,8.84009,81.1599,99.7387
95,96,5383,1863,610,75.0603,72.7457,17.2543,99.9682
96,97,6977,1044,585,105.37,19.169,70.831,99.9592
97,98,4863,1572,594,297.382,25.5813,64.4187,99.9696
98,99,2991,876,559,102.564,18.7048,71.2952,99.988
99,100,2974,3187,586,104.172,10.0117,79.9883,99.9524
100,101,5499,943,596,269.201,81.1833,8.81666,99.9841
101,102,17477,1744,601,101.188,28.0944,61.9056,99.9772
102,103,11118,747,640,119.789,53.6527,36.3473,99.947
103,104,2202,3373,615,278.813,47.6587,42.3413,99.9593
104,105,546,2127,575,86.4846,69.1954,20.8046,99.9464
105,106,9332,2099,633,283.973,18.251,71.749,99.9406
106,107,1617,753,593,112.283,9.98669,80.0133,99.9938
107,108,260977,2333,930,279.68,47.7789,42.2211,99.3357
108,109,12853,1150,657,100.908,26.3972,63.6028,99.9805
109,110,1772,2201,626,106.324,40.6509,49.3491,99.9932
110,111,1165,2505,636,59.0827,85.4776,4.52245,99.9874
111,112,44542,2897,745,120.86,60.185,29.815,99.9701
112,113,51586,1642,740,277.302,1.32083,88.6792,99.9471
113,114,540,787,619,281.529,10.0969,79.9031,99.9881
114,115,10106,2285,679,293.225,59.2839,30.7161,99.9936
115,116,507,3230,637,104.535,12.5161,77.4839,99.9633
116,117,5439,1492,664,281.552,8.153839999999999,81.8462,99.6849
117,118,4610,940,675,131.36700000000002,74.4545,15.5455,99.932
118,119,2368,1028,673,128.33700000000002,80.3042,9.69578,99.9328
119,120,7690,861,692,103.842,15.3384,74.6616,99.9945
120,121,32747,1974,727,283.568,9.64834,80.3517,99.7295
121,122,4186,638,711,126.636,53.6177,36.3823,99.9728
122,123,2980,1263,702,189.518,75.2779,14.7221,99.9374
123,124,1700,2198,675,281.991,19.23,70.77,99.9843
124,125,3850,1081,699,278.91700000000003,51.9354,38.0646,99.9903
125,126,2025,3390,694,98.0198,50.7398,39.2602,99.9838
126,127,170012,934,1051,107.012,33.0079,56.9921,98.8257
127,128,1198,1814,710,274.555,23.4311,66.5689,99.956
128,129,1733,2180,708,293.499,51.7539,38.2461,99.9718
129,130,10639,699,795,96.4115,24.7288,65.2712,99.9467
130,131,18393,788,817,110.492,10.6317,79.3683,99.9565
131,132,3692,1224,748,94.8719,40.5662,49.4338,99.9757
132,133,2926,2221,741,104.304,36.4037,53.5963,99.9945
133,134,2218,833,741,281.027,6.9460000000000015,83.054,99.9915
134,135,10931,1488,812,282.158,20.8225,69.1775,99.8515
135,136,4973,1146,754,190.572,73.7923,16.2077,99.9977
136,137,11346,2141,793,289.059,14.1432,75.8568,99.9873
137,138,1586,3330,760,284.177,47.3492,42.6508,99.9909
138,139,13244,2628,850,188.189,80.8398,9.16025,99.9802
139,140,1608,2840,774,277.732,45.9665,44.0335,99.9812
140,141,1698,607,782,106.166,54.2501,35.7499,99.9982
141,142,67263,1304,949,106.352,16.1887,73.8113,99.9899
142,143,2425,2051,809,297.066,58.6137,31.3863,99.9828
143,144,1352,3308,799,106.433,31.8729,58.1271,99.9812
144,145,21542,2823,894,188.551,80.8022,9.19781,99.9814
145,146,3307,498,812,284.096,14.3642,75.6358,99.9799
146,147,980,574,814,271.272,57.4335,32.5665,99.9809
147,148,27617,509,972,275.663,52.0137,37.9863,99.7157
148,149,7385,1170,833,265.078,5.24421,84.7558,99.9924
149,150,1607,2578,837,274.334,46.4133,43.5867,99.6271
150,151,5914,654,860,106.941,54.4345,35.5655,99.9627
151,152,3230,3419,871,106.931,8.63223,81.3678,99.9521
152,153,1164,2535,869,187.752,80.124,9.87599,99.9954
153,154,1237,2081,865,113.329,32.1186,57.8814,99.9368
154,155,3840,576,893,277.108,53.9343,36.0657,99.9787
155,156,1581,2329,873,283.944,51.0294,38.9706,99.9773
156,157,32781,1550,959,279.391,26.0149,63.9851,99.8961
157,158,5222,410,906,294.795,0.372208,89.6278,99.9745
158,159,2799,2939,903,102.179,48.3939,41.6061,99.9891
159,160,899,2272,885,277.379,43.9171,46.0829,99.9704
160,161,130862,2331,1173,109.364,13.124,76.876,99.8991
161,162,778,3332,892,109.703,31.1053,58.8947,99.9954
162,163,3140,740,913,266.74,34.6567,55.3433,99.9845
163,164,2480,3039,911,105.646,47.2897,42.7103,99.9918
164,165,32655,683,1003,284.358,18.6236,71.3764,99.9937
165,166,561,2432,907,100.456,15.7915,74.2085,99.9885
166,167,3827,2204,930,113.104,19.175,70.825,99.9925
167,168,1112,3341,930,107.4,29.0629,60.9371,99.9917
168,169,1274,2895,943,106.682,7.88744,82.1126,99.9851
169,170,5993,369,973,268.269,33.4703,56.5297,99.998
170,171,21803,2940,1009,117.083,0.630714,89.3693,99.9883
171,172,11989,1726,1015,111.795,15.6877,74.3123,99.9722
172,173,3490,3225,977,112.604,30.0605,59.9395,99.9905
173,174,10199,3369,1031,121.727,44.3918,45.6082,99.9749
174,175,17977,3212,1044,290.994,59.4888,30.5112,92.055
175,176,3923,2160,1004,293.442,49.947,40.053,99.9767
176,177,7838,394,1048,112.449,0.956573,89.0434,99.9659
177,178,7139,1128,1031,102.205,49.1026,40.8974,99.7683
178,179,1801,1042,1022,110.724,12.0036,77.9964,99.9809
179,180,18848,1651,1096,293.5370000000001,58.4273,31.5727,99.9646
180,181,193344,1872,1266,120.94,48.2789,41.7211,99.4495
181,182,3015,312,1071,273.067,31.8002,58.1998,99.9953
182,183,4583,86,1111,85.3983,53.662,36.338,99.9643
183,184,22051,3007,1154,279.60900000000004,40.2259,49.7741,99.7722
184,185,3199,1439,1088,108.29,7.28792,82.7121,99.9676
185,186,1402,1083,1101,263.828,3.94109,86.0589,99.9782
186,187,131465,574,1313,266.027,47.4105,42.5895,93.3077
187,188,67221,3269,1247,110.364,30.0713,59.9287,99.9319
188,189,28302,1518,1176,271.45,43.8331,46.1669,99.918
189,190,19899,1290,1151,133.234,82.1001,7.89988,99.977
190,191,4988,1144,1127,286.651,20.4816,69.5184,99.991
191,192,7130,175,1138,270.87,13.3546,76.6454,99.9858
192,193,1436,2886,1112,280.853,19.2852,70.7148,99.9934
193,194,18698,316,1203,102.568,33.7981,56.2019,99.9474
194,195,19014,2872,1208,120.218,44.6478,45.3522,99.993
195,196,868,1090,1170,111.441,7.42426,82.5757,99.9885
196,197,14884,1182,1243,100.09,59.024,30.976,99.9394
197,198,673,1787,1176,282.1670000000001,9.94981,80.0502,99.9918
198,199,1825,133,1205,87.2185,54.1999,35.8001,99.9947
199,200,1039,194,1205,268.746,39.0127,50.9873,99.9963
200,201,2196,2757,1234,277.259,21.5119,68.4881,99.9675
201,202,663,3079,1219,281.441,44.3663,45.6337,99.984
202,203,11057,1375,1255,107.507,6.29261,83.7074,99.9842
203,204,10112,2699,1309,296.591,58.3169,31.6831,99.9838
204,205,24072,167,1333,269.623,11.0259,78.9741,99.9934
205,206,33516,3118,1396,285.628,11.644,78.35600000000002,99.9163
206,207,17300,2843,1323,59.1337,65.7345,24.2655,99.9821
207,208,104226,1943,1486,104.085,64.5984,25.4016,99.6907
208,209,49324,303,1423,303.73,78.9907,11.0093,99.9702
209,210,25240,1379,1357,278.056,21.7657,68.2343,99.9906
210,211,25439,2972,1411,279.277,43.7615,46.2385,99.9291
211,212,2087,2213,1314,280.081,22.2781,67.7219,99.9936
212,213,886,2607,1299,285.502,45.2969,44.7031,99.897
213,214,378952,1099,1736,103.884,7.08438,82.9156,97.6622
214,215,1348,1217,1311,111.719,2.71834,87.2817,99.9888
215,216,14876,2505,1365,287.236,50.1869,39.8131,99.856
216,217,49753,2331,1500,264.737,70.9936,19.0064,99.366
217,218,1372,2621,1345,124.544,44.7997,45.2003,99.9974
218,219,31467,1280,1451,127.392,59.5496,30.4504,99.9008
219,220,3442,790,1376,91.6088,10.7946,79.2054,99.8738
220,221,1628,2597,1381,293.73,55.908,34.092,99.9793
221,222,13319,2737,1422,124.758,41.6884,48.3116,99.9707
222,223,4541,2861,1403,294.34,15.1841,74.8159,99.9952
223,224,15688,3352,1449,264.483,72.7907,17.2093,99.9889
224,225,23131,2568,1481,119.875,66.154,23.846,99.8273
225,226,2964,3245,1446,54.2994,82.083,7.91702,99.9596
226,227,113175,2887,1616,297.706,0.633095,89.3669,76.0448
227,228,758,3425,1481,255.352,71.6333,18.3667,99.8583
228,229,9334,126,1550,273.692,48.0525,41.9475,99.9722
229,230,5336,3251,1514,93.928,31.7531,58.2469,99.9807
230,231,14930,329,1578,294.478,1.02054,88.9795,99.9514
231,232,617,2081,1525,286.701,18.8146,71.1854,99.9803
232,233,20938,441,1602,276.682,3.59077,86.4092,99.9371
233,234,2589,3344,1541,276.012,23.7148,66.2852,99.983
234,235,842,1618,1536,138.41899999999998,39.6554,50.3446,99.1294
235,236,39818,1594,1632,116.059,41.9312,48.0688,99.8268
236,237,1925,1394,1558,286.421,46.8,43.2,99.9405
237,238,1880,2141,1568,116.983,50.4824,39.5176,99.6818
238,239,8833,2539,1592,289.051,15.0263,74.9737,99.9076
239,240,19349,169,1671,102.423,10.3413,79.6587,99.9905
240,241,53840,3189,1727,280.135,21.8818,68.1182,99.8459
241,242,21537,2184,1691,116.854,48.6288,41.3712,99.6678
242,243,4140,3257,1580,275.921,24.106,65.89399999999999,99.9908
243,244,55665,2494,1712,285.253,18.3866,71.6134,99.5915
244,245,12553,3345,1630,67.0097,80.3576,9.64239,99.9944
245,246,31789,1845,1700,78.4931,42.04,47.96,99.9819
246,247,1319,2345,1579,115.759,53.8379,36.1621,99.9805
247,248,767,3412,1586,53.2497,78.9118,11.0882,99.9156
248,249,3681,1426,1607,276.47,67.6899,22.3101,99.9412
249,250,5832,505,1654,104.868,67.2131,22.7869,99.9669
250,251,718,83,1622,283.185,11.413,78.587,99.9936
251,252,125423,302,1863,286.814,0.410095,89.5899,99.9936
252,253,12019,1414,1690,273.373,47.2554,42.7446,99.9445
253,254,1821,2602,1682,288.579,71.555,18.445,99.9877
254,255,1296,337,1673,282.876,10.6172,79.3828,99.9948
255,256,1888,2047,1685,83.3843,41.4928,48.5072,99.9932
256,257,14485,1696,1746,106.464,4.65773,85.3423,99.9318
257,258,2524,348,1723,104.559,19.0131,70.9869,99.9973
258,259,801,3401,1716,286.514,36.3757,53.6243,99.9883
259,260,660,452,1706,107.201,16.8822,73.1178,99.9511
260,261,74275,2838,1876,296.415,67.8897,22.1103,90.4828
261,262,1492,513,1729,282.245,7.70713,82.2929,99.9901
262,263,57707,2097,1881,285.0490000000001,14.1217,75.8783,99.8203
263,264,2356,1163,1787,276.395,43.3721,46.6279,99.9796
264,265,2584,550,1772,96.3169,13.9467,76.0533,99.9917
265,266,197603,2464,2048,106.046,30.9891,59.0109,99.8321
266,267,16342,3347,1837,279.819,40.3413,49.6587,99.9739
267,268,5773,3251,1799,257.056,66.5047,23.4953,99.9965
268,269,22006,1823,1888,123.277,63.8691,26.1309,99.95
269,270,53153,1131,1962,105.046,20.5214,69.4786,99.845
270,271,2472,850,1826,98.6517,71.9036,18.0964,99.96
271,272,11801,1224,1892,279.247,17.0332,72.9668,99.8161
272,273,17572,642,1855,146.631,79.6546,10.3454,99.9386
273,274,1980,1585,1829,266.401,48.0073,41.9927,99.2639
274,275,7263,3028,1852,285.6620000000001,17.4331,72.5669,99.9859
275,276,2177,1664,1825,288.625,17.6898,72.3102,99.9794
276,277,912,902,1826,92.1771,14.3347,75.6653,99.9951
277,278,3633,738,1889,265.678,20.2129,69.7871,99.9919
278,279,2040,74,1889,119.88,37.9083,52.0917,99.8143
279,280,1207,934,1860,111.846,71.1187,18.8813,99.9939
280,281,19609,809,1956,152.41899999999995,78.5587,11.4413,99.7484
281,282,2909,890,1887,112.538,79.9939,10.0061,99.9934
282,283,1596,1680,1879,121.376,63.042,26.958,99.9539
283,284,13999,2668,1931,99.594,20.0957,69.9043,99.9839
284,285,814,3107,1873,256.339,65.8536,24.1464,99.9654
285,286,2281,3271,1890,260.091,66.384,23.6159,99.9946
286,287,681,1721,1888,113.23,7.669980000000002,82.33,99.9772
287,288,3907,3093,1921,130.982,47.1945,42.8055,99.9954
288,289,10126,3195,1946,282.409,37.1647,52.8353,99.9934
289,290,43635,528,2056,266.466,19.9495,70.0505,99.9692
290,291,9193,1647,1975,278.27,29.9898,60.0102,99.8211
291,292,55859,3236,2037,277.221,36.5604,53.4396,73.8578
292,293,2270,920,1941,100.23,22.4003,67.5997,99.7435
293,294,796,1669,1934,289.798,33.988,56.012,99.7437
294,295,5824,3012,1986,305.036,75.4096,14.5904,99.9247
295,296,603,1163,1949,279.894,14.4888,75.5112,99.8387
296,297,9796,695,2008,92.4235,25.3978,64.6022,99.9419
297,298,1584,181,1970,283.43,14.7255,75.2745,99.9967
298,299,107666,1973,2125,119.839,38.9923,51.0077,99.8224
299,300,4779,948,2003,109.446,78.3396,11.6604,99.6379
300,301,2528,244,2003,82.3823,80.5623,9.43775,99.942
301,302,32777,212,2118,106.304,33.234,56.76600000000001,99.9462
302,303,934,51,2055,104.45,11.5537,78.4463,99.9601
303,304,2342,80,2057,299.53,74.2336,15.7664,99.9535
304,305,5069,866,2063,93.1637,21.3858,68.6142,99.9138
305,306,742,414,2034,69.9841,79.6447,10.3553,99.9758
306,307,1792,110,2043,105.924,9.81238,80.1876,99.9964
307,308,10766,988,2098,106.916,9.99019,80.0098,99.8855
308,309,1846,2933,2048,126.366,58.2265,31.7735,99.8646
309,310,1612,2151,2043,283.343,21.841,68.15899999999999,99.9387
310,311,273397,1755,2404,290.16,65.9912,24.0088,99.7175
311,312,69499,849,2213,54.1981,84.5649,5.43509,99.9561
312,313,10465,2824,2140,121.599,56.2624,33.7376,99.9586
313,314,950,1224,2082,282.531,14.5029,75.4971,99.9928
314,315,161058,2893,2423,291.274,11.809,78.191,83.6249
315,316,40838,3261,2180,88.3103,36.2143,53.7857,99.9308
316,317,35767,1155,2178,279.58,55.151,34.849000000000004,99.9813
317,318,5049,3021,2147,126.133,56.5489,33.4511,99.8668
318,319,8425,635,2154,287.499,0.882561,89.1174,99.9672
319,320,2233,81,2134,105.596,39.0499,50.9501,99.9957
320,321,11410,2223,2184,288.246,16.9017,73.0983,99.7074
321,322,4309,371,2144,68.9962,80.2994,9.70058,99.9968
322,323,1809,3423,2182,302.888,70.7306,19.2694,99.9188
323,324,4556,104,2195,105.369,15.5492,74.4508,99.9885
324,325,6548,2752,2214,286.803,67.791,22.209,99.9628
325,326,47919,385,2275,291.949,6.53775,83.4622,99.9839
326,327,66733,3222,2373,101.266,37.4484,52.5516,99.9095
327,328,87789,653,2398,273.975,7.04644,82.9536,100.034
328,329,13449,2656,2276,111.819,11.3806,78.6194,99.9824
329,330,2028,189,2232,146.866,77.0527,12.9473,99.9916
330,331,945,70,2241,109.072,34.4954,55.5046,99.9938
331,332,6583,3374,2313,301.473,69.0479,20.9522,99.9968
332,333,2183,3420,2297,299.164,68.3945,21.6055,99.7649
333,334,14903,105,2334,103.47,7.08063,82.9194,99.8656
334,335,14928,209,2327,148.72899999999996,76.7012,13.2988,99.9963
335,336,21153,2251,2330,290.508,10.5269,79.4731,99.9722
336,337,1931,1464,2278,108.073,18.833,71.167,99.7046
337,338,562,2573,2284,100.16,21.736,68.264,99.9159
338,339,1861,954,2294,274.683,40.0674,49.9326,99.9383
339,340,15817,1242,2359,100.985,23.6495,66.3505,99.9497
340,341,2948,3023,2312,133.969,55.9231,34.0769,99.9471
341,342,106297,1182,2468,105.953,44.6383,45.3617,99.4662
342,343,2250,2103,2324,125.691,31.0044,58.9956,99.6211
343,344,9095,416,2404,284.046,38.2628,51.7372,99.9634
344,345,55106,2421,2432,322.469,86.5193,3.48074,99.9413
345,346,3445,1393,2362,102.966,10.1595,79.8405,99.8944
346,347,1553,3400,2405,283.437,11.4898,78.5102,99.9862
347,348,1462,880,2426,87.90899999999998,58.6131,31.3869,99.9769
348,349,918,163,2411,101.614,31.6824,58.3176,99.9952
349,350,1754,305,2421,103.416,1.11749,88.8825,99.9903
350,351,7968,108,2487,88.6302,71.3681,18.6319,99.9329
351,352,19628,196,2529,106.51,0.522224,89.4778,99.6007
352,353,4196,259,2448,102.23,30.831,59.169,99.9887
353,354,8814,2148,2515,117.96,43.2077,46.7923,99.7314
354,355,21469,2787,2523,286.311,44.7444,45.2556,99.9408
355,356,2318,3402,2500,105.741,22.3329,67.6671,99.9539
356,357,16726,372,2540,102.399,33.1436,56.8564,99.9871
357,358,85535,927,2657,106.288,73.5793,16.4207,99.797
358,359,5181,936,2499,99.8944,7.429360000000001,82.5706,99.9097
359,360,39833,493,2620,284.528,17.8551,72.1449,53.4992
360,361,14272,2632,2581,104.298,29.2332,60.7668,99.9351
361,362,1110,301,2529,102.738,30.2211,59.7789,99.9935
362,363,37257,3156,2608,306.163,70.5807,19.4193,99.9453
363,364,6156,2454,2550,288.002,24.0016,65.9984,99.7226
364,365,25736,2012,2645,293.18,11.2538,78.7462,99.869
365,366,1544,2361,2548,287.019,17.4074,72.5926,99.9875
366,367,18627,2450,2650,287.444,18.7234,71.2766,99.6915
367,368,7197,1359,2629,113.496,56.0802,33.9198,99.9293
368,369,27621,3334,2646,282.784,0.0785217,89.9215,99.5816
369,370,26829,2227,2619,113.091,17.7517,72.2483,99.944
370,371,18894,1496,2645,316.995,70.3107,19.6893,99.9423
371,372,587,2375,2594,82.5016,80.3585,9.64146,99.9892
372,373,57725,209,2709,279.758,8.9879,81.0121,99.9978
373,374,13156,625,2724,98.9399,77.357,12.643,99.9388
374,375,2879,2565,2649,117.841,51.0875,38.9125,99.9065
375,376,17911,2725,2696,113.005,73.187,16.813,99.888
376,377,20513,1216,2688,274.063,73.6814,16.3186,99.9113
377,378,585,3000,2631,290.486,44.6717,45.3283,99.9891
378,379,1202,382,2652,290.612,2.25952,87.7405,99.9949
379,380,12582,554,2715,97.6497,16.7398,73.2602,99.9929
380,381,2414,3004,2676,103.875,14.8505,75.1495,99.9963
381,382,76168,816,2861,95.2195,59.2382,30.7618,99.9417
382,383,21192,1569,2770,120.238,54.7945,35.2055,99.9348
383,384,779,2629,2688,115.875,47.6268,42.3732,99.9593
384,385,3466,1364,2707,276.026,69.4852,20.5148,99.9476
385,386,54176,3153,2816,116.222,72.7197,17.2803,99.9544
386,387,12045,2277,2740,290.932,21.8129,68.1871,99.9794
387,388,648,2149,2701,276.116,53.8426,36.1574,99.991
388,389,1846,2186,2726,274.159,37.8366,52.1634,99.994
389,390,47343,1831,2813,105.2,26.901,63.099,99.882
390,391,16667,2828,2775,103.443,26.2773,63.7227,99.9611
391,392,15021,3371,2804,298.656,75.1669,14.8331,99.9729
392,393,4843,2538,2748,115.821,20.8744,69.1256,99.975
393,394,47302,2233,2899,104.383,41.3758,48.6242,99.7895
394,395,11816,2633,2783,285.2940000000001,18.4477,71.5523,99.9723
395,396,3022,1427,2738,290.408,7.52959,82.4704,99.9413
396,397,24858,2431,2813,153.61,82.6,7.39998,99.9259
397,398,698,381,2744,94.3444,15.377,74.623,99.9972
398,399,1389,2924,2766,272.808,22.7353,67.2647,99.9868
399,400,4205,1297,2765,115.416,56.6801,33.3199,99.9923
400,401,2445,1173,2789,103.976,28.3867,61.6133,99.9958
401,402,37365,369,2854,120.52,81.7535,8.24654,92.5804
402,403,6710,81,2830,104.78,24.3185,65.6815,99.9071
403,404,1140,3308,2781,200.394,86.5493,3.45071,99.9964
404,405,10388,1381,2865,107.683,20.9187,69.0813,99.9472
405,406,4814,2241,2818,289.108,18.6367,71.3633,99.9754
406,407,243129,3058,3052,101.835,4.04237,85.9576,65.8289
407,408,3235,2051,2817,114.285,19.6966,70.3034,99.9378
408,409,31382,1644,2949,110.074,5.47366,84.5263,99.9248
409,410,8043,1283,2835,100.612,9.51659,80.4834,99.9641
410,411,570,1453,2821,105.018,45.5792,44.4208,99.632
411,412,5288,1095,2840,112.11,33.3681,56.6319,99.9366
412,413,6044,631,2853,276.119,4.65726,85.3427,99.9951
413,414,10066,2575,2890,275.621,38.5143,51.4857,99.969
414,415,100877,1918,3039,289.936,36.0744,53.9256,99.8702
415,416,1532,2727,2864,100.359,28.0693,61.9307,99.9861
416,417,822,2189,2860,292.823,3.51772,86.4823,99.992
417,418,11642,1198,2920,334.4290000000001,81.9963,8.003739999999999,99.9882
418,419,4494,2668,2880,103.248,14.3241,75.6759,99.993
419,420,5695,134,2904,270.945,12.109000000000002,77.891,99.9886
420,421,32497,1480,2960,295.464,31.3297,58.6703,99.8619
421,422,40680,631,2994,276.964,13.6811,76.3189,97.4842
422,423,7842,220,2915,246.847,86.8552,3.14479,99.9728
423,424,1539,1104,2876,100.001,41.0941,48.9059,99.9772
424,425,2597,957,2898,96.6008,47.19600000000001,42.804,99.8652
425,426,7193,688,2920,278.223,30.4131,59.5869,99.9867
426,427,5278,433,2915,94.0475,15.6662,74.3338,99.9156
427,428,1943,1019,2907,96.876,58.6413,31.3587,99.9911
428,429,4328,1290,2919,297.336,65.8536,24.1464,99.9925
429,430,741,66,2915,103.828,8.2869,81.7131,99.9602
430,431,33674,1074,3029,265.505,48.7131,41.2869,99.9717
431,432,6195,2671,2964,104.359,28.1962,61.8038,99.9833
432,433,757,487,2931,275.142,34.3366,55.6634,99.9976
433,434,3181,2465,2947,113.898,23.9079,66.0921,99.7093
434,435,1618,1894,2938,113.74,59.2205,30.7795,99.9918
435,436,1088,1007,2947,103.929,43.4919,46.5081,99.9369
436,437,18183,2544,3013,289.0490000000001,24.4057,65.5943,99.9662
437,438,601,2192,2961,292.493,40.9941,49.0059,99.983
438,439,4461,401,2985,285.205,79.7566,10.2434,99.9355
439,440,6062,110,2999,284.145,82.7361,7.26393,99.9779
440,441,3201,196,2994,106.983,2.31097,87.689,99.9701
441,442,844,1317,2977,104.591,43.2232,46.7768,99.945
442,443,255092,459,3479,277.793,31.7049,58.2951,75.4201
443,444,7459,2394,3035,295.6040000000001,88.5204,1.47956,99.1801
444,445,5109,1231,3028,102.04,44.6931,45.3069,99.8196
445,446,1572,2146,3013,105.713,2.49261,87.5074,99.9909
446,447,6071,2235,3052,125.023,44.3357,45.6643,99.9022
447,448,29819,553,3114,85.6173,68.0761,21.9239,99.947
448,449,2631,1324,3041,91.2226,1.28607,88.7139,99.991
449,450,47975,2522,3165,107.153,28.9528,61.0472,99.7454
450,451,3969,2119,3073,123.189,44.7652,45.2348,99.9937
451,452,2504,1460,3068,285.122,8.44539,81.5546,99.7506
452,453,637,840,3079,89.7109,58.2069,31.7931,99.9771
453,454,969,1406,3075,90.5296,66.2229,23.7771,99.9936
454,455,1875,93,3073,278.782,26.8528,63.1472,99.9857
455,456,5716,1011,3108,103.619,3.92055,86.0795,99.995
456,457,4932,727,3113,287.643,45.2057,44.7943,99.9846
457,458,114412,2195,3269,286.982,1.90382,88.0962,99.7404
458,459,53359,1612,3276,106.145,21.1931,68.8069,99.9671
459,460,46008,1263,3212,296.805,28.9881,61.0119,99.964
460,461,4485,928,3118,99.773,75.3721,14.6279,47.6477
461,462,2568,1370,3102,102.984,59.2971,30.7029,99.9733
462,463,995,680,3085,279.861,35.1828,54.8172,99.9936
463,464,1704,1514,3096,297.186,30.9628,59.0372,99.9936
464,465,1895,1153,3098,94.7987,69.3671,20.6329,99.9659
465,466,678,1553,3104,110.57,4.7407900000000005,85.2592,99.9704
466,467,1652,1123,3132,102.29,65.0218,24.9782,99.8748
467,468,48582,98,3386,285.717,2.59868,87.4013,99.8874
468,469,1366,2264,3122,292.889,40.7976,49.2024,99.9797
469,470,2725,1418,3132,105.752,54.8759,35.1241,99.9702
470,471,1284,1596,3119,119.724,41.4249,48.5751,99.9695
471,472,14657,793,3187,316.02,78.4895,11.5105,99.9082
472,473,5600,1481,3178,110.375,29.8328,60.1672,99.832
473,474,108344,953,3409,280.596,7.7866399999999985,82.2134,98.2145
474,475,56729,3104,3337,281.942,36.7472,53.2528,99.8504
475,476,22460,1098,3265,91.6485,50.5785,39.4215,99.9736
476,477,3331,3186,3191,261.498,70.6164,19.3836,99.8692
477,478,142691,2679,3437,112.05,27.4034,62.5966,90.1902
478,479,55877,1801,3346,77.9477,71.5892,18.4108,99.9633
479,480,3920,1427,3208,121.27,36.5256,53.4744,99.8059
480,481,37928,635,3311,292.175,11.8496,78.1504,99.9449
481,482,1781,2962,3214,119.784,28.2914,61.7086,99.9885
482,483,762,3235,3213,284.767,53.9134,36.0866,99.9877
483,484,1935,3192,3233,249.04,70.5182,19.4818,99.9945
484,485,11349,2615,3292,92.6404,9.18285,80.8172,99.9681
485,486,1315,3123,3233,109.775,27.3542,62.6458,99.9919
486,487,13728,183,3302,108.068,3.35472,86.6453,99.9972
487,488,1308,1383,3253,89.0429,48.2531,41.7469,99.9906
488,489,553,1954,3268,110.263,0.480728,89.5193,99.8701
489,490,28014,1457,3381,332.477,86.6521,3.3479,99.9659
490,491,48898,1282,3444,92.3807,1.33984,88.6602,100.019
491,492,9351,2482,3355,254.412,67.9659,22.0341,99.9292
492,493,17516,3350,3394,131.257,61.9842,28.0158,99.892
493,494,13589,299,3392,273.154,26.2682,63.7318,99.9976
494,495,1717,121,3362,274.22,82.979,7.02102,99.9918
495,496,1636,2231,3359,288.95,39.9316,50.0684,99.9803
496,497,1329,3258,3388,289.957,25.1709,64.8291,99.9927
497,498,26845,773,3483,276.065,81.1855,8.81447,99.9082
498,499,2723,3007,3396,127.337,7.94388,82.0561,99.9957
499,500,2667,192,3398,273.031,16.8908,73.1092,99.9885
500,501,811,228,3409,273.862,17.3174,72.6826,99.9812
501,502,7139,2074,3428,289.6,41.5104,48.4896,99.9765
502,503,2147,2172,3412,109.627,71.7682,18.2318,99.9594
503,504,4408,1947,3440,100.637,70.6205,19.3795,99.9014
504,505,678,2489,3420,333.896,67.5715,22.4285,99.9689
505,506,12437,2212,3469,126.071,58.2048,31.7952,99.9834
506,507,1893,2982,3458,265.41900000000004,81.2097,8.79025,99.9805
507,508,5335,2928,3464,252.386,82.3217,7.6783100000000015,99.985
508,509,6072,1673,3479,116.432,1.80141,88.1986,99.9422
509,510,1197,2417,3448,102.735,17.1607,72.8393,99.9917
510,511,29743,3259,3546,275.16900000000004,36.4668,53.5332,73.7617
511,512,6821,3274,3489,291.641,25.4317,64.5683,99.9934
512,513,27483,248,3541,323.796,85.0699,4.9301,99.4657
513,514,45140,2002,3591,109.925,37.8966,52.1034,99.8172
514,515,6030,2862,3516,264.641,76.4827,13.5173,99.4397
515,516,3765,2339,3498,104.304,17.3461,72.6539,99.9901
516,517,11328,1537,3526,282.819,42.2478,47.7522,99.8025
517,518,6900,3068,3529,98.3165,14.8257,75.1743,99.9765
518,519,515,2300,3503,113.029,37.1633,52.8367,99.9412
519,520,6005,1426,3545,95.727,57.2259,32.7741,99.3508
520,521,13335,1795,3546,283.37,7.3464800000000015,82.6535,99.983
521,522,12378,2159,3573,290.557,46.2724,43.7276,99.8543
522,523,75020,1262,3709,329.4430000000001,85.6872,4.3128,99.898
523,524,728,974,3522,307.408,81.4611,8.5389,99.678
524,525,30917,2956,3621,46.5021,73.5526,16.4474,99.8145
525,526,1086,2251,3538,287.545,43.5764,46.4236,99.9111
526,527,596,2303,3545,267.892,44.168,45.832,99.9379
527,528,81164,1624,3787,285.306,7.2547,82.7453,99.9163
528,529,11810,841,3596,280.384,5.36953,84.6305,99.9815
529,530,12718,2792,3622,260.778,41.8252,48.1748,99.9877
530,531,7460,343,3603,120.109,48.8425,41.1575,99.9648
531,532,15288,2312,3613,294.017,9.11809,80.8819,99.9297
532,533,3839,1734,3614,91.2867,81.2639,8.7361,99.9861
533,534,691,1883,3577,104.583,38.7878,51.2122,99.9968
534,535,18535,2670,3673,107.632,10.7599,79.2401,99.9778
535,536,7629,3315,3628,292.689,40.0891,49.9109,99.9683
536,537,5328,1875,3662,93.5579,79.7119,10.2881,99.9591
537,538,35623,1461,3730,255.069,76.0141,13.9859,62.5297
538,539,2648,2518,3607,281.595,25.3507,64.6493,99.9929
539,540,29664,3150,3687,97.1726,14.3015,75.6985,99.8868
540,541,578,1151,3616,92.9392,1.81582,88.1842,99.9642
541,542,743993,2537,4238,110.396,64.9006,25.0994,55.1835
542,543,899,128,3632,268.29,84.9222,5.07775,99.9866
543,544,11323,229,3680,212.59,81.5282,8.47183,99.9813
544,545,1295,412,3648,288.213,12.9048,77.0952,99.9849
545,546,9505,2234,3705,292.853,47.7653,42.2347,99.8838
546,547,1528,3402,3707,82.4465,45.3931,44.6069,99.9323
547,548,21380,860,3709,98.108,12.617,77.383,99.9512
548,549,7863,2135,3685,288.774,34.7763,55.2237,99.2525
549,550,13386,3346,3737,82.8757,46.6565,43.3435,99.9435
550,551,2642,44,3687,253.005,68.9703,21.0297,99.9796
551,552,8157,106,3711,294.44,21.9966,68.0034,99.8637
552,553,4659,1147,3702,294.59,10.0532,79.9468,99.9911
553,554,31678,2794,3791,271.95,21.7881,68.2119,99.9255
554,555,2722,2323,3695,292.139,39.2622,50.7378,99.9655
555,556,10539,1841,3756,108.614,38.3712,51.6288,99.9839
556,557,986,2364,3714,290.1670000000001,8.106869999999999,81.8931,99.9664
557,558,2236,308,3728,275.782,14.5169,75.4831,99.9949
558,559,1050,1967,3726,279.148,35.9491,54.0509,99.9708
559,560,1924,1076,3732,127.785,67.5879,22.4121,99.9979
560,561,4413,753,3749,276.725,31.062,58.938,99.993
561,562,15722,2973,3783,111.946,29.0718,60.9282,99.7291
562,563,7724,3164,3779,282.559,12.8657,77.1343,99.9718
563,564,3421,1774,3780,105.978,80.047,9.953,99.87
564,565,1100,180,3749,107.917,40.8284,49.1716,99.9828
565,566,73808,990,3959,258.564,78.0905,11.9095,76.7362
566,567,17169,1134,3838,100.827,17.4896,72.5104,99.9927
567,568,18373,1943,3833,275.506,36.915,53.085,99.7688
568,569,1427,3264,3765,101.031,61.8218,28.1782,99.9431
569,570,2114,234,3770,282.903,9.70341,80.2966,99.9948
570,571,546,1971,3754,112.492,37.1184,52.8816,99.985
571,572,20311,166,3862,68.6622,60.4873,29.5127,99.9906
572,573,8606,75,3819,256.339,68.7403,21.2597,99.9876
573,574,593,277,3778,279.141,38.813,51.187,99.949
574,575,2533,1209,3803,276.058,67.7201,22.2799,99.9955
575,576,2127,3394,3813,287.261,37.7296,52.2704,99.8738
576,577,2607,873,3820,94.1873,22.9677,67.0323,99.9958
577,578,7666,461,3843,113.768,55.175,34.825,99.9689
578,579,1773,3054,3817,117.796,9.5163,80.4837,99.9781
579,580,14707,3139,3880,282.59,9.62222,80.3778,99.947
580,581,671,542,3819,103.426,6.06859,83.9314,99.9848
581,582,13013,2869,3892,282.643,38.9316,51.0684,99.9707
582,583,10179,786,3878,103.123,15.2912,74.7088,99.9896
583,584,950,3317,3843,294.188,39.2133,50.7867,99.9943
584,585,6892,3283,3875,270.964,17.3127,72.6873,99.9882
585,586,4290,544,3874,198.628,84.9528,5.04718,99.9908
586,587,1972,2228,3857,291.043,39.7363,50.2637,99.9912
587,588,14575,2989,3903,276.368,21.2401,68.7599,99.637
588,589,2226,1196,3880,131.55,68.8628,21.1372,99.9967
589,590,879,1796,3855,77.8988,79.4034,10.5966,99.9763
590,591,211171,3255,4407,111.497,9.52458,80.4754,98.3858
591,592,19959,1850,3953,109.235,78.0662,11.9338,99.8852
592,593,44616,233,4000,102.211,3.83276,86.1672,99.9645
593,594,1178,3233,3913,110.789,15.3919,74.6081,99.9973
594,595,3160,607,3921,256.317,77.0178,12.9822,99.9975
595,596,1687,1458,3930,76.3882,79.8308,10.1692,99.9925
596,597,1891,451,3918,115.061,49.9845,40.0155,99.9419
597,598,559,846,3925,148.459,82.4391,7.560939999999999,99.9855
598,599,49436,759,4075,121.948,43.7422,46.2578,99.9754
599,600,30061,3021,4059,294.425,36.3715,53.6285,99.8085
600,601,523,520,3922,105.947,16.7714,73.2286,99.9788
601,602,725,52,3945,293.688,16.6519,73.3481,99.9219
602,603,3916,90,3965,77.6243,54.6829,35.3171,99.6816
603,604,13445,3242,3980,288.987,38.0086,51.9914,99.9438
604,605,5204,799,3959,104.473,18.5666,71.4334,99.9928
605,606,9716,1203,3967,133.125,66.2962,23.7037,99.9943
606,607,548,545,3940,110.775,69.9185,20.0815,99.9981
607,608,7791,453,3973,230.641,75.9395,14.0605,99.9483
608,609,1340,1695,3970,90.3024,80.0004,9.99959,99.9754
609,610,3309,1379,3976,285.454,57.6909,32.3091,99.9762
610,611,864,610,3958,280.79400000000004,14.153,75.847,99.998
611,612,96452,1571,4107,112.346,20.6666,69.3334,99.9964
612,613,6348,2813,4000,274.113,20.8835,69.1165,99.9817
613,614,7403,3146,4006,220.07,80.0949,9.90514,99.9776
614,615,5205,563,4001,117.004,32.6846,57.3154,99.9884
615,616,42302,1150,4065,279.573,5.69658,84.3034,96.1323
616,617,671,1308,3999,195.247,78.1234,11.8766,99.9742
617,618,1804,828,4020,106.969,36.798,53.202,99.9759
618,619,19848,1849,4063,110.304,67.9349,22.0651,99.7694
619,620,147048,368,4220,106.992,52.81,37.19,99.9517
620,621,18358,1944,4152,287.217,18.3588,71.6412,99.8256
621,622,645,1357,4040,103.179,37.1552,52.8448,99.9912
622,623,26659,610,4153,280.999,14.634,75.366,99.9954
623,624,361346,924,4445,138.893,74.5346,15.4654,83.4081
624,625,1439,1958,4094,116.423,15.4523,74.5477,99.9972
625,626,5246,3131,4135,101.545,63.1084,26.8916,99.9558
626,627,946,2087,4139,290.988,20.2116,69.7884,99.9238
627,628,3175,2046,4170,197.489,85.5399,4.46015,99.984
628,629,40438,3077,4295,121.377,56.3619,33.6381,99.9202
629,630,1362,1791,4175,267.332,86.0028,3.99724,99.9899
630,631,1193,57,4188,273.771,37.0226,52.9774,99.9838
631,632,280120,1833,4444,292.317,5.0659,84.9341,84.8677
632,633,3000,3379,4248,98.5642,36.7726,53.2274,99.9476
633,634,654,986,4216,120.579,6.29723,83.7028,99.9916
634,635,18560,83,4375,279.955,3.83054,86.1695,99.9478
635,636,1533,1688,4267,321.135,75.6697,14.3303,99.9968
636,637,603,2703,4294,109.806,8.72885,81.2711,99.996
637,638,16169,196,4383,147.589,53.4337,36.5663,99.991
638,639,10692,1618,4376,284.731,3.64143,86.3586,99.9938
639,640,5314,294,4352,276.143,39.1908,50.8092,99.9942
640,641,515,637,4376,161.31,83.3577,6.64231,99.9329
641,642,1247,2671,4390,292.957,35.9283,54.0717,99.9953
642,643,3595,2521,4428,112.364,13.8576,76.1424,99.9652
643,644,1254,2635,4426,272.336,22.8749,67.1251,99.9949
644,645,49122,294,4534,279.983,7.43547,82.5645,99.9095
645,646,4591,444,4463,272.862,56.0008,33.9992,99.9882
646,647,1852,2587,4448,294.815,35.8422,54.1578,99.9945
647,648,2007,124,4464,277.47,29.5003,60.4997,99.9823
648,649,736,494,4463,272.67900000000003,56.2371,33.7629,99.9929
649,650,58236,1398,4602,272.931,53.2203,36.7797,99.9363
650,651,989,2471,4503,118.721,32.0325,57.9675,99.9953
651,652,6313,85,4542,104.056,63.1688,26.8312,99.9656
652,653,8755,2097,4577,105.296,67.0973,22.9027,99.7163
653,654,37629,819,4666,109.123,16.7136,73.2864,99.651
654,655,16810,130,4660,114.257,13.7387,76.2613,99.3773
655,656,755,1277,4592,272.588,35.3616,54.6384,99.9946
656,657,20158,1019,4688,303.506,80.7092,9.29083,99.9497
657,658,2825,2153,4621,108.86,63.8645,26.1355,99.8542
658,659,724,894,4605,147.03,82.5479,7.452089999999999,99.8826
659,660,2812,42,4639,110.433,60.5937,29.4063,99.6806
660,661,16444,1553,4693,83.2877,50.4063,39.5937,99.9249
661,662,11885,2193,4688,108.575,6.5640800000000015,83.4359,99.9897
662,663,32276,2403,4715,118.967,9.80822,80.1918,99.9245
663,664,4537,249,4686,104.315,68.9519,21.0481,99.5367
664,665,877,2120,4666,291.233,67.7293,22.2707,99.9983
665,666,590,230,4680,271.16900000000004,58.232,31.768,99.9965
666,667,14961,2073,4738,108.766,58.0802,31.9198,99.8806
667,668,14225,1668,4737,109.263,8.64356,81.3564,99.9217
668,669,10656,281,4749,277.269,53.1732,36.8268,97.9472
669,670,546,1703,4698,84.6942,47.5434,42.4566,99.9917
670,671,11970,1345,4740,284.121,13.9514,76.0486,99.9166
671,672,3574,3049,4746,287.16,55.5291,34.4709,99.9807
672,673,1277,1446,4757,272.48400000000004,53.3769,36.6231,99.9803
673,674,635,1022,4764,248.507,83.3932,6.6067800000000005,99.9096
674,675,1152,2997,4779,99.0489,9.2746,80.7254,99.9769
675,676,796,3093,4778,143.55,83.9457,6.05431,99.9626
676,677,629,3138,4790,278.001,51.7414,38.2586,99.9612
