,Datei Name,e1,e2,e3,mean grain size,depth,Regelungsgrad [%],Nr der Körner,bag,cut,Azimuth delta[deg]
116,grains_EGRIP1057_4_20.txt.csv,0.00944693,0.30252199999999996,0.6880310000000001,4395,1430.0000000000002,57.3499,2104,2600,1,61
235,grains_EGRIP1637_4_20.txt.csv,0.0186395,0.291729,0.689632,3197,1430.09,56.7041,1036,2600,2,61
10,grains_EGRIP646_5_20.txt.csv,0.00938752,0.301349,0.689263,4582,1430.1800000000005,57.4283,2707,2600,3,61
475,grains_EGRIP2966_6_20.txt.csv,0.013935299999999998,0.28229099999999996,0.703774,4270,1466.3000000000006,60.232,2178,2666,1,166
131,grains_EGRIP1146_1_20.txt.csv,0.013595500000000002,0.300536,0.685868,3688,1466.39,55.9366,2717,2666,2,166
426,grains_EGRIP2726_5_20.txt.csv,0.0155468,0.293769,0.690684,3594,1466.4800000000002,56.5979,3180,2666,3,166
33,grains_EGRIP724_5_20.txt.csv,0.0160518,0.296512,0.6874359999999999,3312,1466.5700000000006,58.1077,2990,2666,4,166
270,grains_EGRIP2075_4_20.txt.csv,0.0120983,0.303261,0.6846409999999999,4216,1466.66,57.0742,2525,2666,5,166
80,grains_EGRIP936_1_20.txt.csv,0.0135631,0.298462,0.687975,4153,1466.7500000000002,57.5271,2864,2666,6,166
234,grains_EGRIP1637_3_20.txt.csv,0.0153764,0.299519,0.685104,4391,1482.8000000000006,57.099,2348,2696,1,162
437,grains_EGRIP2786_4_20.txt.csv,0.013292700000000005,0.315202,0.671506,4782,1482.89,54.7884,2475,2696,2,162
121,grains_EGRIP1096_3_20.txt.csv,0.0134635,0.306371,0.6801649999999999,4350,1482.9800000000002,55.7441,2533,2696,3,162
257,grains_EGRIP2026_3_20.txt.csv,0.013018799999999999,0.29044899999999996,0.696533,4773,1483.0700000000006,58.225,2341,2696,4,162
43,grains_EGRIP776_3_20.txt.csv,0.0137304,0.2179760000000001,0.7682939999999999,3209,1483.16,70.5188,2730,2696,5,162
373,grains_EGRIP2506_2_20.txt.csv,0.014504,0.305357,0.680139,3641,1483.2500000000002,56.3057,2856,2696,6,162
135,grains_EGRIP1146_5_20.txt.csv,0.012112000000000001,0.33419299999999996,0.653695,3939,1499.39,50.8477,2574,2726,2,299
446,grains_EGRIP2846_1_20.txt.csv,0.011902,0.31656,0.671538,4125,1499.4800000000002,55.5823,2250,2726,3,299
50,grains_EGRIP796_4_20.txt.csv,0.012014200000000001,0.350579,0.637407,4373,1499.5700000000006,50.0337,2497,2726,4,299
273,grains_EGRIP2106_1_20.txt.csv,0.012030599999999999,0.381909,0.60606,4217,1499.66,40.6416,2434,2726,5,299
64,grains_EGRIP836_6_20.txt.csv,0.0116513,0.35484899999999997,0.6335,4136,1499.7500000000002,39.9108,2503,2726,6,299
281,grains_EGRIP2136_3_20.txt.csv,0.011899,0.341864,0.646237,4106,1515.8000000000006,51.3507,2588,2756,1,299
67,grains_EGRIP837_3_volume_vertical_20.txt.csv,0.0101783,0.366195,0.623627,4242,1515.89,47.2271,2385,2756,2,299
365,grains_EGRIP2475_6_20.txt.csv,0.0112705,0.322246,0.666483,3897,1515.9800000000002,53.2706,2683,2756,3,299
222,grains_EGRIP1588_6_20.txt.csv,0.0101817,0.340469,0.64935,4674,1516.0700000000006,52.9607,2275,2756,4,299
459,grains_EGRIP2906_2_20.txt.csv,0.0120266,0.339667,0.648307,4043,1516.16,52.1185,2562,2756,5,299
145,grains_EGRIP1208_3_volume_vertical_20.txt.csv,0.010479200000000001,0.349051,0.64047,4428,1516.2500000000002,51.3044,2370,2756,6,299
314,grains_EGRIP2256_3_20.txt.csv,0.0108215,0.288492,0.700687,3749,1532.3000000000006,58.9184,3036,2786,1,295
110,grains_EGRIP1016_4_20.txt.csv,0.00973033,0.286433,0.7038369999999999,3980,1532.39,60.1242,2745,2786,2,295
328,grains_EGRIP2316_5_20.txt.csv,0.00953739,0.29188400000000003,0.698579,4493,1532.4800000000002,58.3813,2525,2786,3,295
191,grains_EGRIP1444_3_20.txt.csv,0.00985514,0.271543,0.7186020000000001,3518,1532.5700000000006,62.2834,2744,2786,4,295
499,grains_EGRIP3086_6_20.txt.csv,0.00961942,0.280219,0.710162,3868,1532.66,61.6223,2803,2786,5,295
177,grains_EGRIP1377_2_20.txt.csv,0.0114098,0.261788,0.726803,3052,1532.7500000000002,64.0002,3238,2786,6,295
162,grains_EGRIP1276_5_20.txt.csv,0.010687,0.29645,0.692864,4578,1581.8000000000006,58.1004,2462,2876,1,279
501,grains_EGRIP3117_2_20.txt.csv,0.0113897,0.30140300000000003,0.687208,4469,1581.89,57.2207,2615,2876,2,279
203,grains_EGRIP1507_4_20.txt.csv,0.0106319,0.269595,0.719773,4050,1581.9800000000002,62.5531,2711,2876,3,279
347,grains_EGRIP2416_6_20.txt.csv,0.011579299999999999,0.27734000000000003,0.7110810000000001,3870,1582.0700000000006,61.1263,2860,2876,4,279
112,grains_EGRIP1016_6_20.txt.csv,0.0116198,0.30415,0.684231,3832,1582.16,56.0131,2823,2876,5,279
299,grains_EGRIP2206_3_20.txt.csv,0.0111439,0.304527,0.684329,3924,1582.2500000000002,56.6543,2867,2876,6,279
321,grains_EGRIP2286_4_20.txt.csv,0.0111485,0.33682,0.652031,5578,1598.3000000000006,51.4785,2087,2906,1,284
96,grains_EGRIP977_5_20.txt.csv,0.0106347,0.322617,0.666748,6677,1598.39,53.9386,1874,2906,2,284
353,grains_EGRIP2436_6_20.txt.csv,0.0120104,0.35434699999999997,0.6336430000000001,5185,1598.4800000000002,21.1997,2342,2906,3,284
214,grains_EGRIP1558_3_20.txt.csv,0.0117329,0.329531,0.658736,5821,1598.5700000000006,52.9755,2028,2906,4,284
489,grains_EGRIP3056_2_20.txt.csv,0.009931200000000001,0.312014,0.678055,6597,1598.66,55.7402,1906,2906,5,284
183,grains_EGRIP1400_2_volume_vertical_20.txt.csv,0.011112700000000001,0.318422,0.670465,5988,1598.7500000000002,54.504,2050,2906,6,284
178,grains_EGRIP1377_3_20.txt.csv,0.013527700000000002,0.322063,0.664409,3146,1614.8000000000006,54.9342,3046,2936,1,307
498,grains_EGRIP3086_5_20.txt.csv,0.013622,0.377127,0.609251,3000,1614.89,46.1453,3252,2936,2,307
193,grains_EGRIP1444_5_20.txt.csv,0.0124837,0.342134,0.645382,3579,1614.9800000000002,51.1421,2843,2936,3,307
107,grains_EGRIP1016_1_20.txt.csv,0.0121248,0.368032,0.619843,3597,1615.16,47.3539,2851,2936,5,307
318,grains_EGRIP2286_1_20.txt.csv,0.0128285,0.325846,0.661326,3356,1615.2500000000002,53.861000000000004,3106,2936,6,307
361,grains_EGRIP2475_2_20.txt.csv,0.013775200000000001,0.301008,0.6852159999999999,4160,1631.3000000000006,57.1896,2629,2966,1,320
45,grains_EGRIP776_5_20.txt.csv,0.0139209,0.302616,0.6834640000000001,4156,1631.39,56.6507,2775,2966,2,320
280,grains_EGRIP2136_2_20.txt.csv,0.013193,0.300414,0.686393,4079,1631.4800000000002,56.7963,2740,2966,3,320
139,grains_EGRIP1185_3_20.txt.csv,0.012299299999999999,0.321365,0.6663359999999999,4383,1631.5700000000006,54.4053,2522,2966,4,320
439,grains_EGRIP2786_6_20.txt.csv,0.0117483,0.303809,0.684443,4595,1631.66,56.8479,2482,2966,5,320
218,grains_EGRIP1588_1_20.txt.csv,0.0119369,0.334964,0.653099,4380,1631.7500000000002,50.5489,2544,2966,6,320
124,grains_EGRIP1096_6_20.txt.csv,0.0147447,0.32247600000000004,0.662779,3395,1680.8000000000006,53.5517,3007,3056,1,8
467,grains_EGRIP2936_4_20.txt.csv,0.015127000000000003,0.296854,0.6880189999999999,3518,1680.89,57.512,3084,3056,2,8
236,grains_EGRIP1637_5_20.txt.csv,0.013722799999999999,0.28213299999999997,0.704144,2973,1680.9800000000002,59.7433,3129,3056,3,8
378,grains_EGRIP2535_1_20.txt.csv,0.0132437,0.30576,0.680996,3694,1681.0700000000006,56.6268,3009,3056,4,8
75,grains_EGRIP896_2_20.txt.csv,0.014535399999999999,0.29600000000000004,0.689465,2959,1681.16,57.6623,3397,3056,5,8
260,grains_EGRIP2026_6_20.txt.csv,0.014962799999999997,0.327945,0.657092,3553,1681.2500000000002,52.5818,2632,3056,6,8
161,grains_EGRIP1276_4_20.txt.csv,0.0129584,0.278184,0.708858,2657,1697.3000000000006,60.8995,3266,3086,1,247
502,grains_EGRIP3117_3_20.txt.csv,0.0104572,0.281491,0.708051,3094,1697.39,60.5807,3585,3086,2,247
205,grains_EGRIP1507_6_20.txt.csv,0.010743899999999999,0.260232,0.729024,2518,1697.4800000000002,63.9017,3748,3086,3,247
345,grains_EGRIP2416_4_20.txt.csv,0.0109583,0.262694,0.726348,2855,1697.5700000000006,63.5057,3461,3086,4,247
111,grains_EGRIP1016_5_20.txt.csv,0.0111941,0.265484,0.723322,2805,1697.66,63.203,3635,3086,5,247
300,grains_EGRIP2206_4_20.txt.csv,0.010417399999999999,0.260928,0.728654,2908,1697.7500000000002,63.3986,3649,3086,6,247
