,Grain No.,Size [Pixel],center x-coordinate,center y-coordinate,mean azimuth [degree],mean latitude [degree],mean colatitude [degree],Regelungsgrad [%]
0,1,11431,215,95,352.8040000000001,54.7322,35.2678,99.9124
1,2,525,506,85,355.426,11.0467,78.9533,99.7148
2,3,4146,705,94,2.15869,52.7993,37.2007,99.9258
3,4,2006,821,94,7.3460899999999985,55.4048,34.5952,99.927
4,5,19383,364,185,178.518,42.5809,47.4191,99.9454
5,6,1260,891,97,350.744,29.7654,60.2346,99.9874
6,7,1856,436,105,355.63,9.08607,80.9139,99.981
7,8,1008,950,94,174.56599999999997,22.1734,67.8266,99.9599
8,9,3974,981,120,343.607,48.4654,41.5346,99.8442
9,10,1028,1414,98,212.532,70.0756,19.9244,99.836
10,11,726,1033,99,353.6380000000001,37.0819,52.9181,99.9716
11,12,1616,863,118,342.256,46.5006,43.4994,99.7082
12,13,14325,1212,135,357.80800000000005,10.686,79.314,99.9809
13,14,18795,669,190,355.344,18.8519,71.1481,99.4452
14,15,1939,575,126,357.27,12.0512,77.9488,99.9807
15,16,240743,1489,525,173.34400000000005,21.2882,68.7118,85.4232
16,17,1035,639,122,357.162,9.81207,80.1879,99.9054
17,18,1045,1353,116,178.923,4.7299,85.2701,99.9967
18,19,5264,467,149,353.8540000000001,19.493,70.507,99.752
19,20,2453,1110,150,0.999958,0.000190735,89.9998,100.001
20,21,623,1064,137,359.528,10.8698,79.1302,99.9908
21,22,7057,228,155,350.664,8.98573,81.0143,99.9909
22,23,115341,2071,348,171.959,26.1441,63.8559,98.8857
23,24,929,816,148,356.367,13.4262,76.5738,99.9892
24,25,18745,1798,189,358.17,2.65855,87.3414,99.9348
25,26,1740,2225,136,353.233,53.0767,36.9233,99.9962
26,27,1833,2320,144,169.775,40.6217,49.3783,99.5132
27,28,148771,2455,412,175.03900000000004,41.237,48.76300000000001,98.4209
28,29,4833,2166,165,167.61700000000005,34.8877,55.1123,99.9971
29,30,47912,1020,269,189.466,77.6818,12.3182,89.4674
30,31,32330,2925,211,172.75099999999995,13.1002,76.8998,96.982
31,32,14721,174,226,354.491,34.8576,55.1424,99.9488
32,33,1948,3190,160,347.631,12.6141,77.3859,99.955
33,34,1106,994,166,355.501,36.557,53.44300000000001,99.9364
34,35,18967,2278,233,1.56879,50.4834,39.5166,99.8883
35,36,1341,1933,166,352.612,44.03100000000001,45.969,99.9824
36,37,6995,540,228,167.419,83.8876,6.11241,99.9827
37,38,13802,3099,228,169.43900000000005,20.0767,69.9233,99.9729
38,39,1954,3258,192,142.273,74.8945,15.1055,99.9346
39,40,775,506,206,183.576,2.3428,87.6572,96.1225
40,41,11287,1613,236,358.662,1.80259,88.1974,99.986
41,42,503,3182,184,176.484,5.73008,84.2699,99.9975
42,43,619,820,196,355.7990000000001,23.0936,66.9064,99.9832
43,44,988,457,213,174.442,0.723,89.277,99.9845
44,45,1388,1202,216,358.201,11.4725,78.5275,99.997
45,46,811,776,210,356.175,2.7395400000000003,87.2605,99.9837
46,47,747,3194,206,147.482,75.3442,14.6558,99.9752
47,48,5878,851,246,355.564,6.50805,83.492,99.9879
48,49,10131,3215,262,333.00699999999995,19.6849,70.3151,99.9605
49,50,687,2957,243,173.96099999999996,12.3424,77.6576,99.9991
50,51,522,733,239,353.579,15.2616,74.7384,99.9924
51,52,559,1728,241,354.26199999999994,12.3282,77.6718,99.9898
52,53,1211,3320,254,357.69,61.9548,28.0452,99.958
53,54,16396,798,308,344.471,53.5527,36.4473,99.8176
54,55,2930,265,265,177.75099999999995,30.9169,59.0831,99.9548
55,56,3800,2725,256,355.8730000000001,53.2977,36.7023,99.9885
56,57,1910,1236,270,178.68099999999995,9.80859,80.1914,99.995
57,58,1249,1697,266,359.242,2.22739,87.7726,99.9843
58,59,3005,2135,268,353.57199999999995,5.6048,84.3952,99.9931
59,60,1337,2628,265,342.034,73.3795,16.6205,99.9898
60,61,1690,464,273,355.621,13.2046,76.7954,99.9901
61,62,1843,2803,276,159.11700000000005,61.4399,28.5601,99.9959
62,63,1731,1300,291,350.521,48.1218,41.8782,99.6913
63,64,6498,2378,303,177.15400000000002,6.19441,83.8056,99.9958
64,65,941,2959,273,173.707,50.5246,39.4754,99.9933
65,66,8859,386,302,353.923,1.46679,88.5332,99.9937
66,67,775,2923,282,177.398,50.1769,39.8231,99.9918
67,68,1492,2213,297,281.9170000000001,87.8165,2.18346,99.9904
68,69,2494,1864,297,7.18589,16.7284,73.2716,99.9949
69,70,1397,3314,294,178.016,49.7755,40.2245,99.968
70,71,2839,566,311,179.215,4.59013,85.4099,99.9808
71,72,3595,2637,309,163.70600000000005,58.5887,31.4113,99.9038
72,73,1392,2715,292,353.477,24.306,65.694,99.997
73,74,810,289,294,173.102,5.171119999999998,84.8289,99.9976
74,75,2079,644,318,176.428,6.49012,83.5099,99.9953
75,76,3824,688,334,352.886,55.9952,34.0048,99.9856
76,77,32709,3017,420,181.023,58.9837,31.0163,99.9455
77,78,3457,3102,325,344.723,27.1721,62.8279,99.9897
78,79,6206,2889,341,350.835,31.7772,58.2228,99.9896
79,80,10105,1227,346,349.305,21.2907,68.7093,99.9652
80,81,2204,2823,322,4.09917,72.5588,17.4412,99.9363
81,82,2130,512,329,1.20894,12.2336,77.7664,99.8361
82,83,2350,1605,333,355.25699999999995,27.4411,62.5589,99.9863
83,84,76819,2747,480,10.1006,77.145,12.8551,99.6407
84,85,2176,1834,337,184.515,80.9025,9.09748,99.9856
85,86,6247,334,354,192.613,79.2336,10.7664,99.8305
86,87,909,930,318,168.076,77.8058,12.1942,99.9832
87,88,683,2285,318,177.012,5.7020300000000015,84.29799999999999,99.9974
88,89,26415,304,414,348.019,65.1867,24.8133,99.9157
89,90,1355,1699,329,359.624,43.2039,46.7961,99.897
90,91,1978,3178,327,171.07,10.5921,79.4079,99.9938
91,92,990,1927,331,178.644,8.7106,81.2894,99.9154
92,93,5696,463,372,176.22400000000005,3.98236,86.0176,99.9708
93,94,5960,1574,417,355.605,47.3987,42.6013,99.8856
94,95,24850,3224,423,352.00699999999995,53.1891,36.8109,99.9547
95,96,588,1648,341,166.36700000000005,55.8317,34.1683,99.9974
96,97,1135,932,346,356.5730000000001,4.79241,85.2076,99.9915
97,98,1071,1906,352,181.429,6.9697,83.0303,99.9664
98,99,9020,568,399,198.575,79.60600000000002,10.394,99.9901
99,100,6505,1087,436,163.842,76.9893,13.0107,99.9543
100,101,40735,783,451,196.989,82.3132,7.68677,99.8091
101,102,6286,1882,415,359.311,39.4013,50.5987,99.8758
102,103,1372,639,391,189.238,64.2275,25.7725,98.9057
103,104,2035,2849,400,178.40900000000005,27.6036,62.3964,99.8423
104,105,1093,373,386,310.03,81.6831,8.3169,99.9903
105,106,5765,1169,422,358.487,52.9941,37.0059,99.9784
106,107,876,172,412,346.106,47.7903,42.2097,99.9657
107,108,23069,934,494,174.362,6.922160000000001,83.0778,99.9074
108,109,17622,1300,479,349.639,46.9911,43.0089,98.2663
109,110,5241,1766,438,170.03599999999997,56.5452,33.4548,99.9196
110,111,3297,2887,445,352.069,9.16698,80.833,99.9765
111,112,842,3288,461,172.78900000000004,21.967,68.033,99.9438
112,113,2708,648,457,2.44442,53.3684,36.6316,99.9954
113,114,801,486,465,177.266,9.54772,80.4523,99.7266
114,115,2845,3125,484,359.427,21.9258,68.0742,99.9849
115,116,13907,1877,505,351.5080000000001,43.9524,46.0476,99.3149
116,117,10689,582,497,187.877,20.9671,69.0329,97.3634
117,118,2064,255,483,317.7990000000001,80.3224,9.6776,99.8562
118,119,53664,1004,652,178.782,22.6877,67.3123,99.3183
119,120,1151,1985,503,267.513,81.8929,8.10707,99.9754
120,121,963,2066,494,284.3040000000001,83.2627,6.73729,99.9924
121,122,799,205,503,19.6102,87.1887,2.81125,99.5843
122,123,15348,3145,554,174.524,23.0571,66.9429,99.7546
123,124,2465,1400,516,173.166,7.59254,82.4075,99.7076
124,125,55912,429,650,178.399,24.9667,65.0333,97.0788
125,126,561,3303,518,170.03,62.8309,27.1691,99.9623
126,127,8564,3021,580,177.649,50.7069,39.2931,90.8342
127,128,1118,288,535,348.291,82.2344,7.765589999999999,99.8475
128,129,1586,1358,542,173.477,5.38269,84.6173,99.9801
129,130,1223,263,547,339.167,84.0997,5.90033,99.9835
130,131,4681,2085,569,6.74188,45.0297,44.9703,99.9772
131,132,5921,472,568,344.147,65.3476,24.6524,99.9713
132,133,7809,3251,606,174.012,11.6798,78.3202,99.8202
133,134,2158,675,565,174.34900000000005,3.05358,86.9464,99.9885
134,135,2705,579,578,178.59099999999995,6.87621,83.1238,99.9963
135,136,9354,1213,606,178.236,5.732480000000002,84.2675,99.947
136,137,51024,1830,694,303.731,87.8894,2.11063,99.9606
137,138,1299,626,577,180.186,2.9220200000000003,87.07799999999997,99.9567
138,139,15745,2014,622,173.59900000000005,66.8176,23.1824,99.9719
139,140,4924,734,617,176.407,6.96223,83.0378,99.9974
140,141,913,289,594,350.756,44.3342,45.6658,99.9777
141,142,4153,861,605,346.7390000000001,48.6529,41.3471,99.9927
142,143,27575,1128,698,355.1280000000001,31.7275,58.2725,99.9346
143,144,1026,2971,619,181.71400000000003,38.2872,51.7128,99.9493
144,145,10261,2294,651,194.223,64.9779,25.0221,99.9842
145,146,25723,2580,711,172.387,16.2027,73.7973,99.6724
146,147,585,2916,618,166.65200000000004,39.6445,50.3555,99.9066
147,148,31220,747,689,172.715,15.13,74.87,99.834
148,149,1446,305,644,175.605,27.7474,62.2526,99.9724
149,150,2053,3030,642,350.84,24.8904,65.1096,99.743
150,151,25611,2877,721,196.418,69.3015,20.6985,99.9808
151,152,2670,3163,648,353.34,23.176,66.824,99.9944
152,153,10369,2728,675,146.143,83.5505,6.4495,99.975
153,154,3991,3118,675,172.88099999999997,56.8201,33.1799,99.754
154,155,1410,2839,655,179.34799999999996,37.465,52.535,99.9958
155,156,13594,2275,723,175.69299999999996,26.6859,63.3141,99.7508
156,157,1339,2126,677,173.55,18.1569,71.8431,99.9908
157,158,1051,2508,677,4.73805,51.1418,38.8582,99.9293
158,159,1533,1272,695,178.23,23.7864,66.2136,99.983
159,160,6694,3016,729,159.99,77.248,12.752,76.2973
160,161,34164,1926,852,181.71,76.777,13.223,78.0083
161,162,3083,3277,712,173.692,10.1719,79.8281,99.6806
162,163,536,2380,678,178.403,5.2165300000000006,84.7835,99.9956
163,164,2988,2430,699,178.701,5.66057,84.3394,99.9169
164,165,1033,3187,687,181.373,36.641,53.359,99.9933
165,166,932,3086,692,176.247,33.8284,56.1716,99.9959
166,167,9991,663,750,173.237,21.244,68.756,99.8239
167,168,2349,2106,729,181.852,28.4708,61.5292,99.9332
168,169,8552,2076,780,167.674,39.0741,50.9259,99.8736
169,170,2551,3206,744,357.849,1.45502,88.545,99.9869
170,171,789,2974,734,345.601,28.7278,61.2722,99.9786
171,172,1125,1589,744,182.345,7.0843,82.9157,99.996
172,173,3561,2408,756,176.606,6.40166,83.5983,99.9979
173,174,16437,1187,799,185.579,7.89231,82.1077,99.8834
174,175,17728,2722,796,184.036,53.7297,36.2703,99.9828
175,176,1072,2200,755,168.928,37.7947,52.2053,99.7154
176,177,26112,2291,859,166.447,58.0796,31.9204,99.9711
177,178,12485,473,826,183.102,65.4624,24.5376,91.7867
178,179,2004,3090,778,178.257,1.67103,88.329,99.9949
179,180,9985,2487,821,352.83,23.9461,66.0539,90.2569
180,181,2988,2183,788,172.31,11.2666,78.7334,99.9941
181,182,214263,2885,1020,355.675,26.7796,63.2204,71.6386
182,183,700,3296,786,352.802,22.9251,67.0749,99.9016
183,184,1450,3134,791,178.921,54.3683,35.6317,99.9965
184,185,10903,585,835,0.703492,21.7615,68.2385,99.9799
185,186,63808,706,911,355.43,37.3554,52.6446,99.8693
186,187,8220,1396,844,352.217,19.9438,70.0562,99.9554
187,188,722,1706,818,3.61274,5.48251,84.5175,99.9775
188,189,1039,1550,824,353.009,22.8455,67.1545,99.9751
189,190,4897,3266,848,176.468,19.8867,70.1133,99.9811
190,191,11999,1020,866,355.5619999999999,62.4098,27.5902,99.8129
191,192,1036,2371,825,357.22,9.79358,80.2064,99.9959
192,193,1826,2551,843,358.881,10.9007,79.0993,99.989
193,194,13956,1438,932,172.877,42.5478,47.4522,90.1297
194,195,998,2331,837,355.7630000000001,1.43365,88.5664,99.9715
195,196,3240,2640,844,359.423,27.6061,62.3939,99.9867
196,197,7616,2112,881,178.483,1.13315,88.8669,99.9917
197,198,5911,1638,879,354.997,41.2128,48.7872,99.686
198,199,1677,1703,856,2.68215,3.07955,86.9204,99.9932
199,200,10517,359,933,350.892,31.3579,58.6421,99.7802
200,201,557,3197,874,177.542,5.8059400000000005,84.1941,99.9976
201,202,1326,2025,889,9.18675,6.654,83.346,99.9961
202,203,1212,452,882,163.015,24.9153,65.0847,99.9775
203,204,37156,1724,991,181.977,6.9447,83.0553,99.7108
204,205,839,3071,885,3.74517,5.64466,84.3553,99.9911
205,206,6201,1144,916,174.00400000000005,16.7523,73.2477,99.9729
206,207,5208,1551,899,356.6,52.3873,37.6127,99.9543
207,208,1322,2472,896,349.699,2.16479,87.8352,99.9341
208,209,897,3293,901,178.65400000000002,6.4714,83.5286,99.9947
209,210,950,3220,897,187.03,69.79899999999999,20.201,99.9779
210,211,7672,1036,951,3.7475,2.19003,87.81,99.9975
211,212,1859,1960,922,171.40900000000005,20.3647,69.6353,99.9676
212,213,10766,438,981,173.00599999999997,49.6839,40.3161,99.9333
213,214,1011,2020,928,346.98,44.1383,45.8617,99.9804
214,215,24490,2481,999,341.997,62.4972,27.5028,99.866
215,216,1994,2070,950,174.028,60.3387,29.6613,99.989
216,217,4432,2339,953,357.477,1.10851,88.8915,99.9896
217,218,740,2161,940,171.503,4.9189300000000005,85.0811,99.9493
218,219,2422,2242,948,171.437,46.1819,43.8181,99.997
219,220,1019,2548,944,335.233,79.3301,10.6699,99.9736
220,221,3377,2657,965,181.656,25.9689,64.0311,99.9684
221,222,15449,1302,999,356.44,32.3819,57.6181,97.6559
222,223,4881,1204,968,348.19699999999995,31.8052,58.1948,99.9814
223,224,1177,1503,969,359.635,56.5548,33.4452,99.8528
224,225,909,2291,957,177.295,1.43286,88.5671,99.997
225,226,777,2200,970,183.868,3.41805,86.58200000000002,99.9914
226,227,31777,1017,1061,178.144,44.6353,45.3647,91.3668
227,228,35791,1951,1094,347.05800000000005,71.7576,18.2424,99.6088
228,229,13105,797,1007,177.134,77.5987,12.4013,99.6553
229,230,967,2369,993,178.614,36.3437,53.6563,99.7959
230,231,1529,2104,998,356.266,27.7533,62.2467,99.9534
231,232,9874,2288,1036,175.84,5.44147,84.5585,99.9401
232,233,2429,2611,1010,353.658,48.5177,41.4823,99.9939
233,234,31629,2165,1105,162.571,46.8816,43.1184,99.6087
234,235,2615,1464,1031,175.46599999999995,16.7318,73.2682,94.0734
235,236,902,694,1014,324.0,81.4598,8.54018,98.4698
236,237,1658,1520,1045,177.877,12.3055,77.6945,99.9614
237,238,4453,342,1058,355.69699999999995,45.0082,44.9918,99.863
238,239,988,292,1038,354.161,46.1464,43.8536,99.8372
239,240,678,1562,1030,180.995,10.6629,79.3371,99.8825
240,241,4286,482,1052,163.122,72.3833,17.6167,99.9552
241,242,6810,3302,1080,171.987,47.5657,42.4343,99.9079
242,243,2314,1603,1056,176.09900000000005,48.5061,41.4939,99.5172
243,244,3517,1256,1084,176.518,13.1504,76.8496,99.989
244,245,70630,1399,1196,343.4430000000001,46.5573,43.4427,91.8635
245,246,4284,797,1078,348.909,48.3604,41.6396,99.9507
246,247,8358,1171,1103,353.236,26.156,63.844,99.9862
247,248,3766,1828,1076,351.9980000000001,35.9973,54.0027,99.9919
248,249,1150,584,1068,177.37599999999995,35.6773,54.3227,99.9983
249,250,9391,1688,1113,171.918,10.6739,79.3261,99.9141
250,251,827,441,1070,173.951,48.5292,41.4708,99.9821
251,252,1303,672,1084,345.61800000000005,62.3053,27.6947,99.9948
252,253,4385,2417,1104,357.3730000000001,77.0656,12.9344,99.99
253,254,1457,735,1102,206.719,72.5056,17.4944,99.9458
254,255,5823,524,1104,354.3730000000001,45.6807,44.3193,99.9628
255,256,1651,854,1096,348.732,27.8541,62.1459,99.9937
256,257,6315,399,1122,175.09900000000005,54.456,35.54400000000001,99.9891
257,258,2449,1595,1108,5.47016,12.3041,77.6959,99.9915
258,259,668,2342,1091,336.5180000000001,67.9313,22.0687,98.3
259,260,582,2482,1099,171.329,56.5334,33.4666,99.9539
260,261,43334,712,1183,208.95,82.5627,7.43733,99.9723
261,262,1180,2339,1117,277.66,83.715,6.28497,99.9862
262,263,3622,3063,1139,179.579,27.0824,62.9176,99.9956
263,264,4356,3162,1146,30.059,76.4036,13.5964,99.9801
264,265,1242,911,1118,173.435,6.11765,83.8823,99.9787
265,266,10697,328,1173,178.386,25.638,64.362,99.9719
266,267,577,3215,1137,9.12793,65.9056,24.0944,97.2247
267,268,3287,3262,1151,28.7256,78.3689,11.6312,99.9874
268,269,8227,934,1170,174.114,17.7822,72.2178,99.9707
269,270,567,1569,1136,0.07449750000000001,2.19701,87.803,99.9966
270,271,11896,2854,1179,175.78099999999995,58.3859,31.6141,99.8484
271,272,4713,499,1163,334.874,62.1357,27.8643,99.9619
272,273,1841,1714,1156,180.441,35.486,54.514,99.9917
273,274,1359,1195,1146,237.286,79.0942,10.9058,99.9894
274,275,214361,3030,1456,182.928,50.5108,39.4892,98.4758
275,276,35326,2347,1257,183.082,1.47801,88.522,99.9654
276,277,87439,1820,1287,170.83700000000005,48.8129,41.1871,99.9874
277,278,5060,1595,1189,345.751,56.9068,33.0932,99.9438
278,279,1262,2460,1188,317.269,71.4023,18.5977,99.9747
279,280,1040,2061,1182,352.75,81.9291,8.07093,99.9549
280,281,17587,1105,1213,168.858,78.9537,11.0463,99.9672
281,282,3838,2251,1208,250.386,81.5816,8.41843,99.9949
282,283,10374,441,1232,151.171,71.3161,18.6839,99.9631
283,284,1836,3155,1196,347.8,63.1642,26.8358,99.9958
284,285,1564,3016,1194,181.193,35.097,54.903,99.9905
285,286,618,2119,1193,269.639,84.704,5.29602,99.9891
286,287,105766,349,1438,178.804,23.3417,66.6583,92.3867
287,288,3958,2767,1240,353.546,41.361,48.639,99.9729
288,289,1105,2060,1219,174.78099999999995,1.10533,88.8947,99.9823
289,290,3506,326,1236,180.591,21.4398,68.5602,99.959
290,291,791,2079,1236,177.16,1.52541,88.4746,99.9984
291,292,5897,2550,1251,273.814,87.163,2.83697,99.9829
292,293,7422,2113,1276,356.325,1.34016,88.6598,99.9696
293,294,244465,943,1575,185.421,47.0148,42.9852,98.3522
294,295,5092,2471,1252,175.283,8.01905,81.9809,99.9556
295,296,1066,2672,1233,272.262,85.9149,4.08514,99.9931
296,297,40782,1027,1322,353.821,39.7864,50.2136,99.9634
297,298,801,1561,1237,206.187,77.8556,12.1444,99.98
298,299,767,2839,1238,175.84,11.3792,78.6208,99.9993
299,300,4150,2885,1267,281.636,86.7439,3.25606,99.9478
300,301,28641,1242,1352,334.1280000000001,42.0194,47.9806,99.9863
301,302,1095,507,1254,187.541,36.8858,53.1142,99.9732
302,303,1940,2194,1265,357.483,0.0991287,89.9009,99.9483
303,304,40828,2781,1376,350.371,47.9378,42.0622,99.9927
304,305,7598,513,1318,355.316,42.0133,47.9867,99.9446
305,306,1255,2500,1302,336.249,74.1284,15.8716,99.9855
306,307,1076,2199,1318,276.378,81.5325,8.46751,99.8921
307,308,568,2635,1325,176.097,12.8541,77.1459,99.9877
308,309,21367,1406,1394,217.774,69.5155,20.4845,99.9681
309,310,61419,2088,1450,169.74400000000003,10.0428,79.9572,99.751
310,311,6689,2537,1356,4.0598,1.98939,88.0106,99.9781
311,312,772,2176,1334,264.307,82.6272,7.37278,99.9905
312,313,996,2432,1364,5.87415,1.08401,88.916,99.9552
313,314,687,1852,1365,187.80900000000003,73.0607,16.9393,99.9635
314,315,574,1577,1367,353.147,28.7456,61.2544,99.996
315,316,14103,2557,1434,331.881,77.3786,12.6214,98.7127
316,317,77152,1588,1552,184.13,15.4801,74.5199,96.1534
317,318,12509,2396,1447,197.538,71.7178,18.2821,99.9778
318,319,2393,549,1402,175.829,56.2119,33.7881,99.9931
319,320,2300,1780,1418,0.214153,0.134346,89.8657,99.9635
320,321,2534,1685,1424,179.57,3.25117,86.7488,99.8829
321,322,2505,600,1424,355.587,45.6514,44.3486,99.9812
322,323,537,1889,1413,190.533,73.7778,16.2222,99.8878
323,324,2071,1164,1463,359.202,20.3766,69.6234,99.9801
324,325,6203,1332,1477,187.81,46.6872,43.3128,99.9933
325,326,13201,1990,1521,168.868,31.0903,58.9097,99.8284
326,327,3595,1078,1495,0.514672,20.0974,69.9026,99.0153
327,328,5501,2299,1489,347.787,32.0991,57.9009,99.9919
328,329,1005,1636,1474,180.503,1.7376200000000002,88.2624,99.9991
329,330,4141,91,1522,184.201,50.8174,39.1826,99.9663
330,331,1760,2690,1477,196.447,70.618,19.382,99.9851
331,332,9852,1258,1519,353.386,3.79707,86.2029,99.9081
332,333,876,1430,1481,355.161,7.263,82.73700000000002,99.9932
333,334,1215,2589,1500,170.893,57.3395,32.6605,99.9386
334,335,6854,2447,1525,9.95573,53.2893,36.7107,99.9409
335,336,2461,150,1524,187.132,9.04253,80.9575,99.9814
336,337,1892,1194,1548,177.82299999999995,4.42368,85.5763,99.8954
337,338,23162,2551,1610,199.218,82.5882,7.41178,99.7033
338,339,29019,269,1605,357.475,78.0413,11.9587,99.9691
339,340,17790,2174,1587,160.195,56.6715,33.3285,99.9326
340,341,24590,2300,1627,181.658,43.1892,46.8108,99.9672
341,342,1372,1146,1566,178.28799999999995,12.1496,77.8504,99.9784
342,343,958,1053,1557,3.19477,11.7239,78.2761,99.9943
343,344,8178,118,1614,179.15099999999995,30.2788,59.7212,99.8381
344,345,1453,2058,1577,346.694,32.914,57.08600000000001,99.9867
345,346,12838,577,1627,334.97,46.6119,43.3881,99.9929
346,347,1272,1219,1586,352.399,2.59673,87.4033,99.9834
347,348,72536,789,1807,359.584,25.2239,64.7761,99.5487
348,349,6496,1944,1627,340.1430000000001,57.2587,32.7413,99.9926
349,350,7474,1171,1634,356.7340000000001,32.219,57.78100000000001,99.9904
350,351,1043,818,1630,350.6140000000001,37.1231,52.8769,99.9945
351,352,6160,1775,1643,183.257,48.4435,41.5565,99.978
352,353,18443,3250,1690,179.375,68.1727,21.8273,99.9855
353,354,2422,2033,1648,5.97326,11.5341,78.4659,99.9895
354,355,6972,2467,1664,336.546,63.4419,26.5581,99.9567
355,356,733,3326,1656,350.255,31.9829,58.0171,99.991
356,357,8099,2040,1687,341.2580000000001,57.1083,32.8917,99.925
357,358,299989,2934,2118,357.3540000000001,7.224710000000001,82.7753,98.3998
358,359,5880,2777,1678,182.193,78.0248,11.9752,99.9852
359,360,7094,1880,1686,175.394,62.596,27.404,99.9739
360,361,1217,793,1663,347.0019999999999,26.8039,63.1961,99.9949
361,362,25329,2407,1762,206.278,79.5645,10.4355,99.9347
362,363,10750,125,1709,351.969,36.266,53.734,99.9422
363,364,1124,1119,1671,1.89076,51.9888,38.0112,99.7832
364,365,5910,1518,1698,182.637,64.8401,25.1599,99.3486
365,366,65579,2724,1812,167.622,60.9821,29.0179,99.9654
366,367,8716,1770,1718,358.156,5.35464,84.6454,99.9947
367,368,62051,441,1922,176.525,14.0473,75.9527,43.4798
368,369,69452,1469,1864,3.93061,6.31162,83.6884,99.8227
369,370,89491,2432,1913,353.056,34.0387,55.9613,97.6084
370,371,18779,240,1752,348.021,27.2883,62.7117,99.9287
371,372,1067,367,1717,346.839,41.5744,48.4256,99.9961
372,373,696,1636,1732,0.18839,9.14787,80.8521,99.9891
373,374,5678,2538,1762,349.476,15.5294,74.4706,99.9676
374,375,147258,2082,1952,348.8880000000001,26.6587,63.3413,98.5275
375,376,3295,2081,1744,173.388,29.6121,60.3879,99.9936
376,377,9823,1696,1793,183.80900000000003,46.0389,43.9611,99.9259
377,378,1258,3125,1742,337.0019999999999,66.8054,23.1946,99.962
378,379,15329,3225,1815,5.3430300000000015,11.734000000000002,78.266,99.9489
379,380,4443,2139,1776,199.24400000000003,6.97945,83.0205,99.9912
380,381,12744,318,1824,183.917,68.1226,21.8774,99.9805
381,382,1393,2225,1786,190.489,77.9107,12.0893,99.9929
382,383,15061,1221,1856,1.31899,24.5693,65.4307,99.9488
383,384,5497,1285,1873,188.192,66.6936,23.3064,99.9214
384,385,5839,173,1873,353.3769999999999,11.1477,78.8523,99.9889
385,386,10006,586,1863,357.033,21.0799,68.9201,99.9008
386,387,2253,2066,1823,183.485,80.2245,9.77555,99.9913
387,388,31940,1721,1929,181.131,47.5266,42.4734,99.935
388,389,9041,3235,1902,332.49300000000005,70.9371,19.0629,99.9908
389,390,1197,762,1869,176.546,66.0846,23.9154,99.9696
390,391,10170,698,1930,173.542,65.2169,24.7831,99.9737
391,392,2494,242,1896,351.117,30.1442,59.8558,99.987
392,393,3477,2234,1903,358.691,24.5413,65.4587,99.9973
393,394,52056,1343,2033,185.35,67.5637,22.4363,74.9395
394,395,607,1133,1899,1.77825,26.2654,63.7346,99.9861
395,396,4269,2096,1924,166.523,59.8074,30.1927,99.9628
396,397,1139,316,1909,2.94469,27.9906,62.0094,99.9987
397,398,566,636,1924,184.495,68.4367,21.5633,99.8897
398,399,1266,376,1936,357.184,17.8119,72.1881,99.9236
399,400,6441,2821,1943,194.479,58.8906,31.1094,99.993
400,401,69623,941,2121,200.521,63.5034,26.4966,55.144
401,402,1692,1126,1937,3.62122,13.5468,76.4532,99.9978
402,403,3108,261,1984,177.255,11.5508,78.4492,99.9499
403,404,1097,2722,1940,351.425,23.0417,66.9583,99.9929
404,405,13182,379,1997,171.225,51.8646,38.1354,99.9379
405,406,542,303,1946,0.394397,13.7955,76.2045,99.9998
406,407,5245,604,1994,354.745,12.7358,77.2642,99.933
407,408,637,3324,1976,177.64,1.92168,88.0783,99.9194
408,409,976,1108,1983,358.18,26.4459,63.5541,99.972
409,410,9919,1817,2048,183.578,77.3706,12.6294,98.9713
410,411,1274,677,2009,358.205,22.4526,67.5474,97.2392
411,412,7855,821,2050,183.7,2.16834,87.8317,99.9837
412,413,53616,560,2165,173.547,12.854,77.146,99.7389
413,414,752,657,2038,353.715,15.6079,74.3921,99.9842
414,415,51445,1710,2161,352.418,27.2719,62.7281,99.9726
415,416,766,1750,2039,173.486,19.8414,70.1586,99.9605
416,417,2677,1916,2063,340.971,22.3625,67.6375,99.9865
417,418,777,1977,2061,201.721,84.26799999999999,5.732,99.9618
418,419,2024,567,2057,170.044,50.9005,39.0995,99.987
419,420,19611,2470,2148,207.71400000000003,72.1562,17.8438,99.9288
420,421,1691,229,2087,8.55311,6.92748,83.0725,99.9867
421,422,3293,2690,2089,349.8180000000001,35.3406,54.6594,99.8536
422,423,662,1100,2087,3.83353,24.3404,65.6596,99.986
423,424,4279,1884,2108,183.226,71.1087,18.8913,99.8057
424,425,3889,1031,2110,187.209,4.13705,85.8629,99.9967
425,426,23109,2039,2202,183.499,13.1739,76.8261,81.6687
426,427,6429,3323,2168,184.148,53.96100000000001,36.039,99.9299
427,428,21952,1438,2162,180.107,19.9425,70.0575,99.8845
428,429,22244,3237,2232,185.844,48.7223,41.2777,99.9917
429,430,1106,3254,2113,2.09865,19.5751,70.4249,99.9916
430,431,2148,2618,2129,189.681,58.2722,31.7278,99.7832
431,432,1089,1120,2127,357.594,46.0331,43.9669,99.6095
432,433,3085,2725,2138,172.21599999999995,11.6761,78.3239,99.9956
433,434,72442,2299,2283,5.25772,24.9947,65.0053,99.9924
434,435,27738,249,2248,357.7480000000001,10.3881,79.6119,99.8896
435,436,16790,1113,2181,346.177,18.1443,71.8557,99.5439
436,437,733,1217,2130,190.016,73.4003,16.5997,99.945
437,438,512,2662,2139,358.86300000000006,6.26708,83.7329,99.9977
438,439,7655,1896,2180,350.728,20.7063,69.2937,99.995
439,440,17352,1273,2213,355.2630000000001,46.8799,43.1201,99.9665
440,441,564,2686,2166,347.031,77.2652,12.7348,99.9234
441,442,61250,646,2284,352.624,36.4182,53.5818,99.9906
442,443,3000,2634,2198,359.402,5.13415,84.8659,99.9389
443,444,10256,1575,2225,13.5607,25.2798,64.7202,99.8989
444,445,81728,3142,2465,1.1041,36.6777,53.3223,74.7448
445,446,152463,2490,2582,173.951,17.8342,72.1658,68.4074
446,447,1504,1002,2227,348.712,78.8696,11.1304,99.9635
447,448,30868,1110,2332,7.300510000000001,8.74032,81.2597,99.7218
448,449,962,2011,2238,339.064,86.5412,3.45882,99.9927
449,450,1795,1046,2259,167.96400000000003,34.4397,55.5603,99.9937
450,451,12149,1465,2292,164.46900000000005,61.6764,28.3236,99.9273
451,452,1603,1889,2259,177.21900000000005,26.1345,63.8655,99.9766
452,453,285958,1323,2677,3.50348,23.8203,66.1797,98.0417
453,454,2418,996,2282,354.411,16.694000000000006,73.306,99.9841
454,455,785,1952,2278,250.703,89.6286,0.371414,99.9662
455,456,31116,1681,2335,179.442,26.9186,63.0814,99.9483
456,457,3494,1870,2319,176.578,6.3141300000000005,83.6859,99.9853
457,458,2879,2013,2303,291.451,73.8051,16.195,99.9816
458,459,1670,3294,2326,175.41,15.5673,74.4327,99.8744
459,460,2276,2111,2314,184.561,3.731030000000001,86.26899999999998,99.9945
460,461,1615,2169,2320,297.895,75.3783,14.6217,99.9855
461,462,22903,2022,2369,187.688,16.9404,73.0596,99.9178
462,463,4677,862,2364,7.57096,28.2705,61.7295,99.9897
463,464,8244,961,2404,354.666,81.2328,8.76719,99.958
464,465,757,262,2367,1.83498,2.00347,87.9965,99.9793
465,466,3197,816,2392,357.9840000000001,14.063,75.937,99.4742
466,467,1225,411,2364,178.785,62.7235,27.2765,99.9743
467,468,1945,3088,2370,191.698,52.6873,37.3127,99.9934
468,469,796,3205,2373,183.361,54.0297,35.9703,99.9553
469,470,1058,499,2363,182.645,66.7605,23.2395,99.9773
470,471,668,904,2361,183.158,3.6655,86.3345,99.9971
471,472,2030,1836,2380,172.15599999999995,89.0048,0.995243,99.982
472,473,93925,642,2553,358.3280000000001,23.7448,66.2552,99.9437
473,474,24170,325,2490,2.63215,3.30649,86.6935,99.7484
474,475,4916,1547,2408,171.111,52.4685,37.5315,99.9928
475,476,1201,474,2406,3.4922699999999995,2.44435,87.5556,99.9965
476,477,8391,156,2444,356.045,7.27992,82.7201,99.9939
477,478,2607,1626,2415,9.52232,10.4112,79.5888,99.9572
478,479,21806,2078,2471,179.82,59.8055,30.1945,99.8344
479,480,2633,413,2414,167.79,40.8465,49.1535,99.8145
480,481,1564,1803,2411,180.01,3.0167900000000003,86.9832,99.9981
481,482,3456,242,2432,356.175,79.9191,10.0809,99.9849
482,483,9357,1709,2450,350.853,27.7654,62.2346,99.9956
483,484,4351,897,2454,4.04584,5.50574,84.4943,99.9491
484,485,1425,1853,2441,187.182,12.3928,77.6072,99.9609
485,486,12494,1915,2485,353.5180000000001,63.9098,26.0902,99.898
486,487,2111,2987,2448,216.065,77.2939,12.7061,99.9647
487,488,45730,1625,2549,191.856,63.5576,26.4424,78.6207
488,489,58340,1043,2713,172.58599999999996,27.8003,62.1997,99.337
489,490,1052,84,2476,356.524,8.035680000000001,81.9643,99.9205
490,491,966,855,2471,183.274,11.6105,78.3895,99.9942
491,492,11043,2254,2521,0.586942,72.4747,17.5253,99.6386
492,493,1278,232,2485,174.051,44.9355,45.0645,99.9927
493,494,837,3214,2492,183.848,56.3012,33.6988,99.9921
494,495,8595,2970,2533,2.75988,25.2428,64.7572,99.8723
495,496,720,2271,2503,1.47642,74.0514,15.9486,99.8718
496,497,6713,149,2529,182.226,4.55681,85.4432,99.9634
497,498,6181,422,2578,351.56,78.7149,11.2851,99.4844
498,499,7030,2147,2559,4.9332,45.7191,44.2809,99.9866
499,500,529,1982,2533,354.846,8.92119,81.0788,99.8769
500,501,9146,1922,2585,352.4430000000001,6.36266,83.6373,99.8711
501,502,897,1747,2565,3.82975,11.6785,78.3215,99.9095
502,503,525,378,2563,173.16,43.5013,46.4987,99.9777
503,504,3343,110,2590,343.684,80.3055,9.69453,99.9749
504,505,1563,2052,2583,349.773,9.78791,80.2121,99.9829
505,506,1631,1764,2591,3.23644,21.9671,68.0329,99.9543
506,507,762,2708,2576,181.0,0.0,90.0,100.002
507,508,1615,2253,2584,8.57966,44.6918,45.3082,99.9554
508,509,1135,2739,2591,357.033,3.22702,86.773,99.9983
509,510,17934,826,2656,357.2580000000001,39.6648,50.3352,99.9922
510,511,2694,2947,2601,0.605,3.66795,86.33200000000002,99.323
511,512,2964,2830,2601,7.782610000000001,43.8297,46.1703,99.993
512,513,25151,2133,2674,0.339553,69.5022,20.4978,99.9678
513,514,59507,277,2687,173.293,43.048,46.952,99.9803
514,515,1031,495,2616,3.76826,22.9876,67.0124,99.9379
515,516,3143,2885,2630,350.21,51.1414,38.8586,99.9786
516,517,4712,1726,2640,169.76,2.7277,87.2723,99.993
517,518,2714,2017,2640,13.3286,59.304,30.696,99.9927
518,519,669,2284,2619,357.055,6.89018,83.1098,99.9908
519,520,17593,2678,2698,354.29,10.5292,79.4708,99.8404
520,521,1217,2242,2633,352.787,11.15,78.85,99.9937
521,522,6157,1873,2642,12.3704,58.3683,31.6317,99.9585
522,523,2606,1773,2686,180.349,3.35935,86.6406,99.9747
523,524,1013,1965,2631,345.459,69.6549,20.3451,99.9491
524,525,1041,1295,2657,4.98929,7.513789999999998,82.4862,99.6028
525,526,5408,912,2678,350.807,73.9096,16.0904,99.9874
526,527,1516,1262,2645,10.329,3.07058,86.9294,99.9826
527,528,71662,1903,2855,353.205,51.489,38.511,61.0839
528,529,2973,3275,2699,6.30754,9.97203,80.028,99.9902
529,530,10528,2253,2703,354.6430000000001,16.1986,73.8014,99.9789
530,531,667,54,2668,340.543,81.2468,8.75318,99.9629
531,532,1779,3003,2662,244.041,79.9485,10.0515,99.9782
532,533,74741,2990,2793,7.5258699999999985,27.9518,62.0482,99.9443
533,534,8157,3211,2699,187.974,53.7134,36.2866,99.9638
534,535,3561,1707,2695,162.298,3.45926,86.5407,99.9879
535,536,4593,1597,2690,8.85797,51.3409,38.6591,99.9179
536,537,3757,2862,2691,352.825,10.422,79.578,99.9883
537,538,4291,1283,2710,357.296,23.8371,66.1629,99.9834
538,539,2872,512,2736,173.868,15.9901,74.0099,99.9884
539,540,3381,614,2727,176.425,61.1741,28.8259,99.8877
540,541,3915,102,2756,182.781,8.62416,81.3758,99.9415
541,542,1415,487,2747,177.125,11.3314,78.6686,99.9857
542,543,5937,1837,2741,352.184,72.016,17.984,99.9876
543,544,506,2554,2712,353.3780000000001,78.4467,11.5533,99.9092
544,545,12819,2743,2757,347.86,51.1415,38.8585,99.9975
545,546,10428,3203,2788,10.0595,7.82701,82.17299999999999,99.9667
546,547,2286,654,2753,332.361,76.8941,13.1059,99.9933
547,548,4012,1258,2761,174.94299999999996,4.40684,85.5932,99.9951
548,549,23140,830,2824,7.86947,53.9249,36.0751,99.9946
549,550,23877,960,2877,9.35351,30.0482,59.9518,99.893
550,551,110800,606,2957,5.91844,52.1871,37.8129,73.6404
551,552,1014,2291,2791,355.332,12.5496,77.4504,99.9805
552,553,22212,2154,2816,175.97400000000005,29.8524,60.1476,99.8679
553,554,2414,1799,2790,197.31,57.5665,32.4335,99.9971
554,555,14093,679,2827,8.697239999999999,24.0471,65.9529,99.5389
555,556,3475,2636,2798,166.71900000000005,54.9237,35.0763,99.9928
556,557,2789,1341,2789,359.504,48.8063,41.1937,99.8153
557,558,3320,1164,2794,333.025,65.9786,24.0214,99.9872
558,559,670,1096,2790,11.1294,32.8849,57.1151,99.9969
559,560,711,3278,2815,160.071,82.0417,7.95834,99.9877
560,561,14182,2544,2859,12.6131,69.2588,20.7412,99.9691
561,562,3840,86,2821,4.04205,12.9671,77.0329,99.997
562,563,13143,1597,2847,175.955,28.8927,61.1073,99.974
563,564,2720,1257,2815,172.27200000000005,34.5797,55.4203,99.9045
564,565,881,163,2816,113.224,83.8161,6.1839,99.9917
565,566,4818,250,2864,358.195,23.0789,66.9211,99.9848
566,567,1321,1179,2827,356.195,4.94634,85.0537,99.995
567,568,224151,2782,3078,5.86857,44.5965,45.4035,96.3103
568,569,16132,2240,2923,3.807830000000001,32.3671,57.6329,99.6214
569,570,2360,3237,2858,160.20600000000005,81.8747,8.12533,99.9801
570,571,1511,98,2864,332.95,84.7951,5.20486,99.9847
571,572,3889,3287,2892,8.56697,7.326,82.67399999999998,99.9738
572,573,1335,599,2864,179.394,8.389710000000001,81.6103,99.9958
573,574,13003,2079,2911,189.273,60.4072,29.5929,99.4675
574,575,7766,3175,2904,191.648,10.0726,79.9274,99.9963
575,576,1848,2339,2895,2.23074,3.5426300000000004,86.4574,99.9753
576,577,1072,1573,2900,8.83056,48.2784,41.7216,99.9875
577,578,2164,678,2908,334.004,75.2173,14.7827,99.9695
578,579,2697,385,2909,138.995,78.6648,11.3352,99.9409
579,580,1878,1675,2904,30.7878,83.1371,6.86287,99.9613
580,581,604,575,2901,5.44991,14.5578,75.4422,99.9853
581,582,6339,768,2942,0.00563608,22.9482,67.0518,99.9851
582,583,31540,1650,2987,184.741,60.4658,29.5342,99.7896
583,584,928,2096,2923,10.9334,54.1974,35.8026,99.9961
584,585,659,824,2918,200.951,69.8843,20.1157,99.9923
585,586,4002,2349,2953,359.27,4.17622,85.8238,99.9868
586,587,4223,3237,2966,127.203,80.2322,9.76781,99.9889
587,588,749,335,2943,359.311,23.6399,66.3601,99.9797
588,589,1514,3182,2954,11.3897,7.52183,82.4782,99.9892
589,590,28475,205,3044,349.5180000000001,63.5814,26.4186,65.9216
590,591,2808,1084,2972,345.5180000000001,65.4925,24.5075,99.9508
591,592,787,3322,2991,350.80800000000005,42.0099,47.9901,99.8822
592,593,2956,2096,2985,332.275,83.083,6.91702,99.9682
593,594,629,3303,2980,352.153,40.0772,49.9228,99.9949
594,595,537,1831,2976,0.935897,23.6544,66.3456,99.9816
595,596,1099,2442,2978,49.7191,86.1421,3.85788,99.9629
596,597,16596,2320,3028,356.8130000000001,20.7168,69.2832,98.1338
597,598,852,2035,2992,354.083,11.6652,78.3348,99.9963
598,599,7557,3246,3035,8.218589999999999,19.2066,70.7934,99.9514
599,600,2260,1800,3032,173.607,68.4258,21.5742,99.5201
600,601,12622,2143,3061,176.054,65.7977,24.2023,99.5881
601,602,3343,407,3057,168.717,66.7622,23.2378,99.978
602,603,25263,507,3171,2.1803,30.7514,59.2486,99.4157
603,604,7023,1125,3080,185.65,2.53601,87.464,99.9655
604,605,820,999,3053,354.457,25.5217,64.4783,99.9565
605,606,13645,1789,3094,213.837,70.1214,19.8786,99.9545
606,607,2046,1212,3068,168.565,71.381,18.619,99.9849
607,608,1240,1276,3064,182.452,2.53146,87.4685,99.9989
608,609,3431,1530,3087,177.127,42.3252,47.6748,99.9865
609,610,16683,2037,3113,4.43708,55.2014,34.7986,99.9639
610,611,4697,3267,3104,173.545,49.5788,40.4212,99.9815
611,612,1303,3312,3112,173.435,53.0061,36.9939,99.9108
612,613,4397,1059,3117,182.918,2.39754,87.6025,99.9486
613,614,150123,2195,3254,175.602,23.7112,66.2888,99.766
614,615,7587,1439,3110,17.7109,78.2553,11.7447,99.9801
615,616,3138,1647,3094,4.58225,3.5047,86.4953,99.9861
616,617,1931,948,3095,6.26337,1.0741,88.9259,99.9371
617,618,85075,225,3270,175.351,20.8843,69.1157,99.9382
618,619,1774,1317,3108,183.547,2.70493,87.2951,99.9649
619,620,2658,986,3126,186.967,0.675751,89.3242,99.9249
620,621,3003,781,3107,11.9241,25.8964,64.1036,99.9585
621,622,15420,1225,3148,1.77162,43.8422,46.1578,99.9559
622,623,114066,1594,3311,204.222,68.6116,21.3884,99.2532
623,624,1689,1909,3108,351.208,0.932594,89.0674,99.998
624,625,1463,899,3105,186.471,2.55368,87.4463,99.986
625,626,6654,589,3137,179.958,70.1891,19.8109,99.9897
626,627,5888,2332,3124,11.2303,54.3504,35.6496,99.9919
627,628,8425,377,3182,178.83700000000005,11.2826,78.7174,99.9312
628,629,6422,721,3154,186.973,62.0733,27.9267,99.9792
629,630,36209,888,3232,218.828,84.1898,5.8102,81.2359
630,631,2082,1338,3152,172.842,43.9122,46.0878,99.964
631,632,14290,3227,3202,103.022,84.6002,5.399769999999998,99.9579
632,633,1572,1020,3162,194.093,0.415138,89.5849,99.9979
633,634,14850,2991,3207,171.997,42.3568,47.6432,99.9727
634,635,7304,1422,3192,181.801,80.6098,9.39015,99.9786
635,636,4634,640,3202,177.701,59.6258,30.3742,99.9923
636,637,532,769,3179,187.055,0.474869,89.5251,99.9979
637,638,1282,2878,3180,353.057,64.1732,25.8268,99.9886
638,639,1004,1497,3193,202.46400000000003,72.14699999999998,17.852999999999994,99.3951
639,640,13751,1037,3255,7.17395,31.5969,58.4031,99.992
640,641,41545,2789,3330,171.533,5.31567,84.6843,99.9763
641,642,694,676,3229,185.389,11.3686,78.6314,99.9792
642,643,4455,1129,3252,175.137,59.2037,30.7963,99.9847
643,644,3070,389,3238,178.675,19.0709,70.9291,99.9536
644,645,12507,3120,3357,165.623,58.4401,31.5599,99.8567
645,646,824,708,3250,182.876,9.79679,80.2032,99.9923
646,647,1758,450,3265,180.821,16.705,73.295,99.3947
647,648,837,1180,3250,7.85515,2.62964,87.3704,99.9746
648,649,20063,745,3324,177.22299999999996,10.7313,79.2687,99.9991
649,650,1526,2927,3268,227.129,84.5195,5.48051,99.9802
650,651,566,629,3258,182.417,9.57197,80.428,99.9968
651,652,1549,2275,3275,358.695,10.5931,79.4069,99.9951
652,653,42482,2992,3403,5.7862800000000005,12.8825,77.1175,77.1446
653,654,10705,559,3308,167.50099999999995,58.573,31.427,99.9495
654,655,2504,2980,3294,164.291,57.3879,32.6121,99.9825
655,656,15613,1203,3354,0.688137,1.28986,88.7101,100.014
656,657,16802,3225,3347,349.9240000000001,33.9409,56.0591,99.9901
657,658,4415,1341,3324,0.5178119999999999,1.18752,88.8125,99.9977
658,659,4393,2017,3333,173.372,49.7056,40.2944,99.9706
659,660,2280,1099,3333,358.765,33.2622,56.7378,99.9956
660,661,655,45,3335,1.10021,51.2553,38.7447,99.9199
661,662,815,2637,3342,173.636,4.52556,85.4744,99.9992
662,663,20307,2145,3384,1.89643,8.618319999999999,81.3817,99.5959
663,664,23166,902,3430,10.3229,14.4294,75.5706,99.8573
664,665,4399,414,3356,2.1785,41.0865,48.9135,99.9646
665,666,1595,1124,3371,1.704,2.71412,87.2859,99.9939
666,667,10409,1902,3400,358.41,8.2856,81.7144,99.8438
667,668,1251,620,3370,175.65400000000002,2.16801,87.83200000000002,99.9939
668,669,14870,1059,3435,349.543,22.5608,67.4392,99.9495
669,670,5251,499,3383,357.341,34.0632,55.9368,99.9891
670,671,4142,574,3395,177.767,1.94339,88.0566,99.9789
671,672,1770,2011,3382,359.999,10.3496,79.6504,99.986
672,673,3112,1859,3401,344.021,37.8376,52.1624,99.9111
673,674,1519,2866,3416,171.128,4.76446,85.2355,99.9935
674,675,1140,625,3414,354.856,2.17847,87.8215,99.993
675,676,10304,2282,3445,9.03296,64.8304,25.1696,99.9729
676,677,1219,704,3399,182.816,63.6495,26.3505,99.9951
677,678,4868,411,3424,343.082,29.186,60.81399999999999,99.9175
678,679,1363,2664,3446,176.18,3.52995,86.47,99.9975
679,680,576,2629,3415,330.6880000000001,83.2036,6.79645,99.9895
680,681,15805,3214,3493,44.7771,86.5723,3.42766,99.7885
681,682,21805,1240,3525,175.706,7.49375,82.5062,49.0277
682,683,995,687,3438,9.50542,12.7381,77.2619,99.9954
683,684,1000,747,3432,4.88176,39.396,50.604,99.9798
684,685,7100,2055,3465,181.61,34.0942,55.9058,99.976
685,686,9651,2540,3471,357.585,7.5205,82.4795,99.9343
686,687,3776,149,3456,172.045,46.5451,43.4549,99.9867
687,688,674,481,3439,165.56400000000005,56.4651,33.5349,99.962
688,689,8718,337,3489,168.86900000000003,51.3613,38.6387,98.9287
689,690,11428,783,3482,1.49155,71.6404,18.3596,99.86
690,691,2627,2631,3466,2.48073,4.1155,85.8845,99.9973
691,692,784,1300,3460,1.77805,7.5588,82.4412,99.9889
692,693,23431,1773,3558,169.77700000000004,0.967239,89.0328,99.6766
693,694,6465,526,3482,351.241,32.4069,57.5931,99.6077
694,695,10342,246,3519,353.413,23.6982,66.3018,99.5658
695,696,1391,1848,3466,173.90099999999995,50.0362,39.9638,99.971
696,697,651,448,3461,168.322,44.957,45.043,99.5481
697,698,17439,1392,3543,342.4,78.3529,11.6471,92.0957
698,699,2349,1584,3482,349.196,2.57177,87.4282,99.9889
699,700,12018,1678,3522,170.524,49.0579,40.9421,99.9742
700,701,1168,648,3482,8.021519999999999,12.7617,77.2383,99.9942
701,702,2054,2411,3497,335.255,67.5218,22.4782,99.905
702,703,14082,2907,3541,356.94199999999995,1.97479,88.0252,99.8311
703,704,17364,2178,3540,186.705,51.3611,38.6389,99.9751
704,705,722,414,3484,353.9240000000001,16.1009,73.8991,99.9693
705,706,830,1494,3490,3.32855,1.30176,88.6982,99.9866
706,707,733,39,3508,352.72,34.3259,55.6741,99.8943
707,708,1737,2369,3512,356.302,13.4141,76.5859,99.9853
708,709,25382,1957,3564,183.283,6.75422,83.2458,99.9389
709,710,3481,663,3519,183.18400000000003,61.2635,28.7365,99.9208
710,711,3879,3147,3529,171.53900000000004,25.9834,64.0166,99.923
711,712,4902,403,3542,355.514,5.49415,84.5059,99.9003
712,713,2128,590,3527,174.08700000000005,59.5288,30.4712,99.9201
713,714,2046,2280,3529,348.949,4.49737,85.5026,99.5363
714,715,5771,875,3543,189.577,61.8139,28.1861,99.9741
715,716,28930,1065,3581,202.16,65.2218,24.7782,99.9551
716,717,1056,2672,3529,171.449,27.7996,62.2004,99.8787
717,718,519,2447,3531,354.661,70.6363,19.3637,99.8261
718,719,754,2474,3524,350.402,69.1383,20.8617,99.982
719,720,16045,2554,3588,180.173,8.32227,81.6777,99.961
720,721,669,2325,3530,177.172,52.5119,37.4881,99.9202
721,722,1302,3082,3538,1.47694,11.6048,78.3952,99.9783
722,723,4747,121,3565,359.55,68.6852,21.3148,99.9708
723,724,2934,208,3561,167.766,22.276,67.72399999999999,99.9592
724,725,509,1533,3534,185.002,2.94336,87.0566,99.9712
725,726,1838,2632,3551,58.9277,87.1187,2.8813,99.2005
726,727,3081,1193,3558,349.89,40.2311,49.7689,99.9888
727,728,39936,610,3599,352.858,35.6098,54.3902,92.9789
728,729,1546,1477,3560,196.937,76.9673,13.0327,99.9898
729,730,979,2346,3557,132.365,79.0074,10.9926,99.9594
730,731,9302,160,3636,172.394,35.2933,54.7067,99.9042
731,732,4920,2414,3588,15.8095,80.2353,9.76474,99.9703
732,733,2384,926,3595,201.663,65.7592,24.2408,99.9687
733,734,3966,1520,3596,340.6380000000001,71.6356,18.3644,99.9822
734,735,828,2266,3579,351.781,5.50602,84.494,99.8988
735,736,652,3114,3568,359.63699999999994,13.4442,76.5558,99.9902
736,737,2130,2094,3589,352.902,6.70839,83.2916,99.9977
737,738,4182,1581,3601,334.392,2.03919,87.9608,99.989
738,739,32314,2292,3720,352.5780000000001,10.6825,79.3175,99.9271
739,740,755,2964,3595,180.166,0.484993,89.515,99.9918
740,741,788,2644,3577,12.2657,77.7736,12.2264,99.9109
741,742,5994,3050,3612,173.243,1.6439400000000002,88.3561,99.9736
742,743,875,308,3586,172.09599999999998,27.9421,62.0579,99.9943
743,744,4047,354,3616,355.847,55.6463,34.3537,99.9585
744,745,7998,2732,3618,28.1425,87.54899999999998,2.451,99.9453
745,746,1164,2131,3614,351.577,4.22617,85.7738,99.9294
746,747,9264,2844,3648,358.776,39.6182,50.3818,99.9148
747,748,1544,1229,3608,196.368,65.5013,24.4987,99.993
748,749,48816,1938,3756,177.453,27.4595,62.5405,99.5396
749,750,6509,844,3634,171.488,56.1143,33.8857,99.9077
750,751,648,47,3620,165.595,47.5717,42.4283,99.9452
751,752,726,2364,3607,169.05,76.8514,13.1486,99.9857
752,753,19706,3170,3678,2.50468,47.9385,42.0615,99.8479
753,754,2717,3239,3624,171.21099999999996,11.4568,78.5432,99.9954
754,755,4456,1612,3650,160.726,3.67018,86.3298,99.8595
755,756,1565,239,3631,355.431,58.0329,31.9671,99.9951
756,757,10513,531,3674,172.99400000000003,0.00363922,89.9964,99.9938
757,758,28924,1761,3712,349.608,50.201,39.799,99.9982
758,759,3484,2909,3645,168.388,24.8647,65.1353,99.9456
759,760,22584,1373,3702,342.124,50.7503,39.2497,99.9825
760,761,2901,2383,3656,359.021,1.42635,88.5736,99.9855
761,762,3127,1471,3652,160.381,4.06087,85.9391,99.9701
762,763,1909,2480,3650,181.302,7.41263,82.5874,99.9989
763,764,23108,914,3711,350.865,27.1097,62.8903,99.2421
764,765,1383,309,3645,181.235,39.0865,50.9135,99.8583
765,766,4279,629,3675,179.174,62.7654,27.2346,99.9884
766,767,69249,1011,3821,172.257,21.0945,68.9055,99.5978
767,768,17146,3023,3719,356.552,38.4577,51.5423,99.8156
768,769,18466,2624,3688,179.245,52.5493,37.4507,99.304
769,770,19373,2156,3737,348.992,35.7019,54.2981,99.2551
770,771,4510,287,3697,358.538,57.15,32.85,99.9287
771,772,1368,1519,3684,335.307,2.14823,87.8518,99.9825
772,773,691,3276,3686,0.881569,51.6487,38.3513,99.9645
773,774,855,2411,3684,357.311,6.07677,83.9232,99.951
774,775,1983,1891,3682,169.111,29.6423,60.3577,99.9931
775,776,586,826,3685,350.902,25.6998,64.3002,99.9086
776,777,3439,1247,3711,343.256,7.1908,82.8092,99.9884
777,778,8473,118,3775,179.483,59.1661,30.8339,99.9442
778,779,6214,716,3705,182.849,4.98399,85.016,99.9692
779,780,3042,360,3730,180.256,37.2681,52.7319,99.9438
780,781,568,2163,3697,179.503,26.2897,63.7103,99.94
781,782,7237,1593,3721,24.0921,80.1068,9.8932,99.9916
782,783,33370,2418,3889,358.74300000000005,30.1747,59.8253,60.0316
783,784,4601,223,3727,181.974,59.2974,30.7026,99.9953
784,785,2315,2744,3723,353.05800000000005,67.9664,22.0336,99.9962
785,786,4202,2664,3749,175.93099999999995,3.5567,86.4433,99.997
786,787,8059,756,3787,170.576,44.1407,45.8593,98.1805
787,788,41409,2777,3803,1.61877,46.937,43.063,98.0292
788,789,15908,634,3786,342.92800000000005,56.6977,33.3023,99.9976
789,790,9037,1508,3790,170.872,45.3147,44.6853,99.9554
790,791,1407,472,3756,176.701,2.09934,87.9007,99.9995
791,792,1081,2412,3790,359.352,0.986168,89.0138,99.9182
792,793,6959,1286,3776,179.253,30.3043,59.6957,99.9462
793,794,15247,3234,3848,186.335,57.5117,32.4883,99.9888
794,795,6306,1617,3785,355.449,72.5994,17.4006,99.9859
795,796,22933,3077,3847,176.12400000000005,22.2995,67.7005,99.9359
796,797,596,183,3772,180.033,57.4158,32.5842,99.9151
797,798,93303,497,4003,177.674,5.0029,84.9971,98.9674
798,799,54858,192,3966,351.101,56.9529,33.0471,99.5314
799,800,3078,2541,3791,171.192,35.5885,54.4115,99.7949
800,801,2305,942,3787,174.847,52.4551,37.5449,99.9594
801,802,6044,195,3823,172.722,15.2501,74.7499,99.6509
802,803,2933,2212,3809,178.993,7.90955,82.0904,99.9961
803,804,8983,1196,3834,349.93300000000005,25.0419,64.9581,99.9961
804,805,3973,2059,3818,178.35299999999995,7.37736,82.6226,99.994
805,806,1153,819,3801,356.3040000000001,32.569,57.431,99.9971
806,807,28886,1482,3882,177.59400000000005,21.9265,68.0735,99.6258
807,808,4493,2935,3832,180.037,10.390999999999998,79.609,99.6157
808,809,3334,1703,3825,5.16299,17.0494,72.9506,99.9929
809,810,1053,1342,3815,171.75099999999995,12.1226,77.8774,99.9438
810,811,3510,1014,3826,164.989,47.7308,42.2692,99.8969
811,812,2173,365,3861,183.668,4.90311,85.0969,99.9515
812,813,3391,1295,3845,171.641,13.6628,76.3372,99.8136
813,814,694,2507,3825,1.0599299999999998,2.6248400000000003,87.3752,99.9743
814,815,27135,2012,3923,359.616,7.4432,82.5568,97.7747
815,816,3258,1639,3846,1.8957,11.7504,78.2496,99.9547
816,817,54966,2242,3978,171.94099999999997,25.6953,64.3047,99.7636
817,818,5719,2524,3867,3.02822,5.07413,84.9259,99.9905
818,819,595,1342,3854,167.933,22.6054,67.3946,99.9787
819,820,1347,2110,3869,1.53685,9.10909,80.8909,99.9961
820,821,75388,3076,4027,346.63199999999995,60.5238,29.4762,56.3835
821,822,1995,1744,3879,0.400237,30.2219,59.7781,99.9565
822,823,1747,746,3876,175.957,51.3841,38.6159,99.9808
823,824,52274,2715,4010,169.97400000000005,32.9704,57.0296,78.6289
824,825,2357,2930,3890,1.7906799999999998,51.6064,38.3936,99.9583
825,826,512,786,3886,174.762,43.0004,46.9996,99.2547
826,827,50666,1105,3992,180.348,11.0494,78.9506,76.234
827,828,7339,1317,3925,349.297,32.3987,57.6013,99.9691
828,829,5742,711,3927,341.3040000000001,41.0682,48.9318,99.2061
829,830,996,62,3932,355.783,57.8488,32.1512,99.9653
830,831,3750,110,3922,166.49,29.9432,60.0568,99.9839
831,832,2896,2854,3914,186.585,47.6372,42.3628,99.9919
832,833,5320,1678,3941,1.1900700000000002,13.0579,76.9421,99.9963
833,834,1285,1771,3931,344.728,88.4154,1.58461,99.4704
834,835,12860,1818,3984,354.0019999999999,11.2303,78.7697,99.9879
835,836,1602,1896,3933,354.656,23.7668,66.2332,99.8875
836,837,2172,2499,3941,177.205,11.1845,78.8155,99.9953
837,838,1343,3266,3962,158.143,71.5614,18.4386,99.9889
838,839,4257,832,3971,348.80800000000005,2.13188,87.8681,99.9954
839,840,2564,1602,3964,355.6230000000001,30.2557,59.7443,99.9927
840,841,32656,1411,4035,354.13,9.48553,80.5145,99.2661
841,842,3902,2530,3982,8.14865,68.6908,21.3092,99.9481
842,843,5944,617,3985,352.222,70.4811,19.5189,99.8827
843,844,9915,734,4001,352.7530000000001,36.2739,53.7261,99.8794
844,845,128747,2034,4231,351.807,10.4094,79.5906,71.9328
845,846,791,1688,3974,356.781,11.7759,78.2241,99.9581
846,847,25261,268,4065,172.247,26.4698,63.5302,99.7682
847,848,2734,3088,4008,341.8640000000001,75.7149,14.2851,99.9837
848,849,730,515,3995,355.99,73.1787,16.8213,98.8531
849,850,1234,1574,3998,170.37900000000005,27.1752,62.8248,99.9866
850,851,2908,1695,4012,332.195,82.8628,7.13722,99.3417
851,852,8076,860,4055,178.53599999999997,10.7494,79.2506,99.9729
852,853,43598,2542,4121,351.206,34.0848,55.9152,99.0738
853,854,27723,1665,4110,1.86731,83.7013,6.29874,99.8234
854,855,587,2158,4025,351.397,67.4873,22.5127,99.8694
855,856,1557,678,4047,178.054,59.3397,30.6603,99.9947
856,857,3632,2138,4086,348.2480000000001,30.3487,59.6513,99.989
857,858,9850,2917,4104,313.969,86.0083,3.99172,99.9803
858,859,10815,1803,4130,355.644,44.5863,45.4137,99.7327
859,860,3052,780,4082,179.921,8.253110000000001,81.7469,99.9968
860,861,2059,698,4091,172.893,38.8909,51.1091,99.8584
861,862,9072,1124,4112,354.64,9.08576,80.9142,99.982
862,863,7913,1532,4121,176.15400000000002,17.5254,72.4746,99.9881
863,864,1647,2365,4121,348.326,30.7677,59.2323,99.9849
864,865,82097,838,4275,176.548,27.7762,62.2238,93.8499
865,866,2645,1010,4147,181.83900000000003,7.33962,82.6604,99.9731
866,867,19517,725,4185,336.094,2.92238,87.0776,99.9705
867,868,37794,1435,4198,167.294,61.1341,28.8659,99.9832
868,869,7919,2090,4159,343.136,76.2527,13.7473,99.8578
869,870,2347,2683,4153,351.384,34.0173,55.9827,99.9947
870,871,7519,1266,4226,349.765,57.2451,32.7549,99.9946
871,872,4940,1201,4158,182.844,6.3503300000000005,83.6497,99.9982
872,873,4872,2310,4166,170.732,45.1899,44.8101,99.9762
873,874,235911,2745,4448,177.47,51.9891,38.0109,91.8229
874,875,35015,124,4229,357.209,58.2085,31.7915,99.9761
875,876,2255,1116,4164,352.124,58.0711,31.9289,99.7105
876,877,4954,2942,4180,178.215,3.2885699999999995,86.7114,99.9895
877,878,17993,3135,4273,192.952,69.3964,20.6036,99.9172
878,879,41167,2766,4273,2.59875,22.7533,67.2467,99.9637
879,880,4216,2641,4205,187.368,67.1145,22.8855,99.9859
880,881,133331,432,4429,346.482,37.9272,52.0728,88.4708
881,882,12277,3050,4224,348.659,13.5549,76.4451,99.9657
882,883,962,568,4206,345.2480000000001,52.5507,37.4493,99.9882
883,884,29169,1136,4277,355.2290000000001,48.9731,41.0269,99.9903
884,885,3152,1669,4219,340.353,77.0318,12.9682,99.9928
885,886,956,3218,4226,337.8830000000001,63.9089,26.0911,99.9953
886,887,8667,2928,4270,186.811,67.7724,22.2276,99.9722
887,888,1032,1779,4228,354.394,80.7871,9.21292,99.9902
888,889,1570,536,4248,352.134,42.1555,47.8445,99.63
889,890,21341,1727,4329,174.715,8.114460000000001,81.8855,99.9963
890,891,7890,2281,4291,357.461,22.898000000000003,67.102,99.9929
891,892,2401,1674,4264,158.094,59.67100000000001,30.329,99.9891
892,893,1474,3200,4274,353.685,13.1282,76.8718,99.9583
893,894,1049,2621,4265,356.098,25.1136,64.8864,99.9881
894,895,1352,1824,4283,325.651,80.2965,9.70355,99.8925
895,896,777,1623,4267,354.707,55.6551,34.3449,99.9954
896,897,263799,1598,4512,359.088,29.2929,60.7071,98.1638
897,898,1404,528,4280,349.071,23.6108,66.3892,99.9765
898,899,7285,1562,4300,161.741,56.7088,33.2912,99.9875
899,900,22260,189,4367,354.982,4.74421,85.2558,99.9845
900,901,1877,81,4321,170.428,56.4227,33.5773,99.967
901,902,3090,3200,4336,1.37088,35.9519,54.0481,99.992
902,903,6143,1829,4351,161.756,55.4491,34.5509,99.9836
903,904,21577,639,4385,186.867,47.4382,42.5618,99.9737
904,905,2686,1219,4361,356.44699999999995,7.11298,82.887,99.7325
905,906,3105,791,4380,145.776,83.9789,6.02112,99.9491
906,907,1463,2277,4361,179.616,43.4951,46.5049,99.9731
907,908,1152,2795,4363,170.771,46.0191,43.9809,99.9954
908,909,34140,1091,4450,358.668,5.01511,84.9849,99.8101
909,910,2456,1256,4408,353.325,8.03928,81.9607,99.9816
910,911,2244,1852,4412,355.87,79.2282,10.7718,99.9804
911,912,2097,2285,4413,353.903,37.1974,52.8026,99.9983
912,913,1021,1191,4406,3.86129,6.70062,83.2994,99.9727
913,914,3063,2163,4437,176.955,10.1641,79.8359,99.9879
914,915,626,825,4427,164.218,33.4547,56.5453,99.9776
915,916,8745,2235,4467,176.93400000000003,42.9747,47.0253,99.9655
916,917,645,195,4463,354.028,4.9211800000000006,85.0788,99.9825
917,918,878,129,4471,210.755,76.4559,13.5441,99.9779
918,919,8265,3198,4508,0.97917,23.5779,66.4221,99.9517
919,920,25191,824,4556,175.937,62.7545,27.2455,99.9215
920,921,1641,910,4488,354.1330000000001,11.7371,78.2629,99.9892
921,922,16855,2614,4535,2.84864,1.22073,88.7793,99.8439
922,923,1497,2155,4502,344.397,34.6923,55.3077,99.9685
923,924,972,3262,4522,357.6140000000001,10.8673,79.1327,99.9013
924,925,4056,2335,4532,219.522,85.0412,4.95883,98.622
925,926,666,2695,4518,0.620875,1.47556,88.5244,99.9982
926,927,26464,2237,4588,173.62099999999995,18.2394,71.7606,99.985
927,928,13482,994,4594,357.324,11.5738,78.4262,99.9368
928,929,998,166,4547,166.644,64.1356,25.8644,99.9306
929,930,551,2599,4558,349.185,32.1412,57.8588,99.9545
930,931,740,707,4549,166.662,77.34,12.66,99.9771
931,932,14422,646,4613,170.36900000000003,76.2811,13.7189,99.9331
932,933,972,345,4572,335.361,85.4621,4.53786,99.9844
933,934,1968,211,4585,134.106,77.8867,12.1133,99.981
934,935,1371,269,4587,350.973,2.41432,87.5857,99.9873
935,936,783,2522,4590,184.649,8.27631,81.7237,99.9248
936,937,844,3203,4590,358.702,10.4772,79.5228,99.9735
937,938,1881,173,4618,174.398,29.6547,60.3453,99.8895
938,939,15189,2475,4636,356.295,6.6254300000000015,83.3746,97.457
939,940,2032,2724,4608,350.097,30.9589,59.0411,99.9566
940,941,687,2580,4607,183.974,6.926080000000002,83.0739,99.9793
941,942,2660,345,4618,172.74,68.4711,21.5289,99.9688
942,943,3151,2616,4636,166.878,58.3672,31.6328,99.7926
943,944,1510,508,4622,174.40400000000002,69.9455,20.0545,99.9826
944,945,661,3265,4629,348.264,24.2232,65.7768,99.1539
945,946,6639,2068,4653,193.469,46.0886,43.9114,99.9808
946,947,795,2270,4651,357.386,1.8371,88.1629,99.9957
947,948,1425,2361,4664,173.511,70.58800000000002,19.412,99.9752
948,949,1352,2653,4667,189.362,70.5555,19.4445,99.9916
949,950,1235,3090,4680,163.99400000000003,65.9935,24.0065,99.7535
950,951,1788,2780,4689,162.517,61.5895,28.4105,99.9242
