,Grain No.,Size [Pixel],center x-coordinate,center y-coordinate,mean azimuth [degree],mean latitude [degree],mean colatitude [degree],Regelungsgrad [%]
0,1,5015,293,205,281.834,24.327,65.673,99.9851
1,2,582,351,149,88.785,2.44699,87.553,99.9759
2,3,14583,402,220,88.3654,0.27195,89.7281,99.7975
3,4,4841,518,186,66.8833,70.132,19.8679,99.811
4,5,31627,188,268,270.008,26.9815,63.0185,99.9562
5,6,36506,618,315,279.54900000000004,18.129,71.87100000000002,99.8481
6,7,10404,817,216,260.888,17.7296,72.2704,99.8544
7,8,17757,980,238,85.3267,47.9376,42.0624,99.674
8,9,30383,1207,236,314.56,84.0894,5.91059,99.9096
9,10,2436,617,203,70.3002,72.405,17.595,99.9615
10,11,69952,1626,313,279.21,63.3838,26.6162,99.8348
11,12,43906,1912,308,266.148,54.9991,35.0009,96.2901
12,13,3258,1425,199,265.697,5.02709,84.9729,99.7124
13,14,2095,2038,202,93.659,18.546,71.454,99.9594
14,15,1934,2192,203,286.311,62.2297,27.7703,99.9552
15,16,17202,2411,242,99.0225,30.1656,59.8344,99.8444
16,17,6792,2611,215,83.07,59.3997,30.6003,99.9749
17,18,1504,2729,215,273.336,63.4648,26.5352,99.9893
18,19,4012,539,249,259.175,59.4155,30.5845,99.9187
19,20,13913,2133,289,93.6416,43.5105,46.4895,99.9687
20,21,8100,2840,246,85.1719,60.9619,29.0381,99.8502
21,22,776,2522,221,271.52,24.137,65.863,99.974
22,23,3633,2993,250,88.1459,64.6575,25.3425,99.7613
23,24,541,2304,234,81.6346,50.6992,39.3008,99.9568
24,25,516,3080,224,278.296,11.7533,78.2467,99.9662
25,26,1338,1418,235,265.473,4.79884,85.2012,99.9905
26,27,7059,747,270,300.577,82.9519,7.04812,99.9826
27,28,2455,3119,251,272.341,8.15242,81.8476,99.7559
28,29,4711,2054,295,268.465,46.006,43.994,99.9961
29,30,8042,2616,275,87.6028,59.2487,30.7513,99.9769
30,31,644,1465,256,273.157,63.9446,26.0554,99.9924
31,32,2825,2304,276,82.7706,50.6734,39.3266,99.9654
32,33,8683,899,326,265.709,16.3009,73.6991,99.9051
33,34,26588,1407,355,258.98900000000003,29.2952,60.7048,99.9452
34,35,2931,2722,280,267.855,9.24016,80.7598,99.9858
35,36,27934,2227,375,265.01,10.5034,79.4966,99.9495
36,37,4514,2950,306,259.007,7.3189899999999986,82.681,99.9645
37,38,16872,3059,354,261.872,9.27379,80.7262,99.8796
38,39,1485,471,289,270.61,4.71312,85.2869,99.9946
39,40,23426,2767,368,90.7503,55.8303,34.1697,99.9541
40,41,1682,3165,288,272.464,6.47694,83.5231,99.7538
41,42,3494,333,312,89.3635,3.90169,86.0983,99.993
42,43,1683,396,297,98.355,62.364,27.636,99.9777
43,44,912,1250,300,268.847,40.454,49.54600000000001,99.9931
44,45,964,1292,293,81.7487,30.1178,59.8822,99.9876
45,46,41255,2584,424,269.083,38.8877,51.1123,99.677
46,47,6238,2891,323,81.9647,65.7417,24.2583,99.9893
47,48,1364,3163,329,271.01,8.01251,81.9875,99.9875
48,49,12390,2406,380,258.699,25.8447,64.1553,99.9567
49,50,1919,1117,327,272.668,46.324,43.676,99.9832
50,51,12664,1001,364,262.35400000000004,16.1014,73.8986,99.111
51,52,20893,771,392,275.004,7.921810000000002,82.0782,99.8984
52,53,8228,1256,358,108.469,62.1497,27.8503,99.9462
53,54,1267,3264,342,277.387,11.3564,78.6436,99.9044
54,55,2304,2339,346,259.545,44.8393,45.1607,99.9959
55,56,1134,1177,335,86.9271,35.6953,54.3047,99.9848
56,57,40208,394,430,85.2639,9.73657,80.2634,99.7871
57,58,1257,3144,360,274.689,8.35555,81.6444,99.9934
58,59,4352,3232,394,268.99,7.707610000000002,82.2924,99.9852
59,60,1466,1169,371,282.0370000000001,64.0486,25.9514,99.9879
60,61,2695,2049,377,275.125,35.0692,54.9308,99.9877
61,62,3183,116,398,273.569,33.0657,56.9343,99.9843
62,63,8005,212,410,278.93,24.8464,65.1536,99.955
63,64,500,3184,376,272.594,5.15111,84.8489,99.9057
64,65,17091,2963,451,259.17400000000004,29.5963,60.4037,99.5721
65,66,1237,1121,384,268.806,36.9684,53.0316,99.993
66,67,1265,1730,403,84.3809,16.8052,73.1948,99.9963
67,68,675,925,404,269.81,8.1285,81.8715,99.9921
68,69,8511,1917,430,80.531,33.8937,56.1063,99.9724
69,70,6497,3143,440,106.913,37.3494,52.6506,99.9857
70,71,26715,2316,506,269.396,38.3573,51.6427,99.5977
71,72,66081,1160,555,281.071,69.1829,20.8171,98.6599
72,73,12092,1164,472,86.9493,24.644,65.35600000000001,99.9741
73,74,577,1211,410,85.5082,37.4152,52.5848,99.9941
74,75,2816,1095,431,267.712,38.6312,51.3688,99.9752
75,76,44072,1740,548,269.851,61.1786,28.8214,98.8045
76,77,5256,2471,476,82.7012,43.6198,46.3802,99.944
77,78,14030,2866,482,261.381,47.8334,42.1666,99.915
78,79,1298,2089,428,266.428,55.6233,34.3767,99.9943
79,80,974,2131,427,268.447,42.2828,47.7172,99.9917
80,81,2879,1019,445,254.968,70.5262,19.4738,99.7141
81,82,3751,1655,459,81.2564,12.6978,77.3022,99.9742
82,83,38788,840,555,267.331,13.0916,76.9084,99.6719
83,84,42364,580,587,273.897,11.5238,78.4762,99.8885
84,85,10554,692,510,291.157,80.7016,9.29845,97.7775
85,86,624,94,463,132.329,74.8372,15.1628,99.9575
86,87,826,113,477,126.952,75.8442,14.1558,99.918
87,88,13861,207,508,276.499,2.06847,87.9315,98.0618
88,89,7269,2081,493,200.178,76.6503,13.3497,99.581
89,90,686,2710,467,212.513,76.1636,13.8364,99.9876
90,91,2830,2765,484,89.8102,48.0089,41.9911,99.9909
91,92,2477,1965,483,103.356,55.2822,34.7178,99.892
92,93,1694,2166,488,262.42900000000003,16.5179,73.4821,99.971
93,94,70910,3030,657,269.981,51.4356,38.5644,99.2115
94,95,684,1075,472,267.196,15.1837,74.8163,99.9928
95,96,34077,1476,570,270.209,30.0128,59.9872,99.2065
96,97,4370,2537,527,102.867,30.1079,59.8921,99.5029
97,98,3255,1920,531,266.351,47.8499,42.1501,99.3148
98,99,8462,3230,588,262.35400000000004,47.5721,42.4279,99.7777
99,100,1236,1999,525,264.0,61.0792,28.9208,98.4917
100,101,12991,2716,620,85.6884,21.9174,68.0826,99.9227
101,102,9747,134,610,270.914,24.7386,65.2614,99.9797
102,103,43487,283,672,101.009,10.1838,79.8162,99.943
103,104,2170,1864,551,269.825,56.2991,33.7009,99.643
104,105,3029,2796,560,74.4017,57.981,32.019,99.552
105,106,972,390,536,314.836,74.1271,15.8729,99.9495
106,107,4168,2130,570,272.422,36.0651,53.9349,99.9665
107,108,9667,2426,633,91.6064,29.7212,60.2788,99.9393
108,109,3390,386,597,84.7343,20.7405,69.2595,99.9798
109,110,6037,1993,580,263.369,33.6753,56.3247,99.2257
110,111,21254,2302,642,87.2371,24.8193,65.1807,99.9679
111,112,726,2830,576,263.035,29.5722,60.4278,99.9722
112,113,622,2905,568,262.1,31.9681,58.0319,99.9729
113,114,4804,467,616,88.2986,74.7407,15.2593,62.3385
114,115,24205,2575,670,264.315,41.5962,48.4038,99.8718
115,116,1489,2878,595,70.5705,57.3247,32.6753,99.988
116,117,6613,1911,630,95.4674,57.4543,32.5457,99.9878
117,118,15139,2038,657,91.6591,54.8872,35.1128,99.7538
118,119,23302,1489,716,84.7944,26.2542,63.7458,99.0406
119,120,1859,2841,624,76.1426,49.1113,40.8887,99.9928
120,121,102174,1285,799,269.161,38.6074,51.3926,99.7801
121,122,2597,1693,638,85.2717,25.0696,64.9304,99.9846
122,123,572,438,632,92.9432,29.6297,60.3703,99.9966
123,124,553,906,642,262.585,15.6994,74.3006,99.9916
124,125,864,2883,648,79.4708,41.8297,48.1703,99.8982
125,126,6964,2217,703,268.638,37.0473,52.9527,99.927
126,127,1434,3258,688,284.822,67.4404,22.5596,99.9005
127,128,2585,1626,673,97.3166,50.03100000000001,39.969,99.9911
128,129,1723,441,670,91.3588,21.4856,68.5144,99.7668
129,130,515,1852,676,269.936,59.3101,30.6899,99.995
130,131,2319,3204,689,262.703,49.0624,40.9376,99.9385
131,132,25125,1030,880,244.586,79.0086,10.9914,75.7706
132,133,2303,399,698,85.8394,3.3597300000000003,86.6403,99.9925
133,134,1413,706,690,87.1573,1.79465,88.2054,99.914
134,135,10863,136,728,276.57,19.2784,70.7216,99.9732
135,136,2793,1719,700,331.0,84.9602,5.03979,99.9443
136,137,19567,1991,759,268.053,67.0582,22.9418,99.7316
137,138,10464,653,736,106.378,9.62659,80.3734,99.9611
138,139,1773,2785,706,80.6581,41.2003,48.7997,99.9927
139,140,4547,1891,709,267.825,60.1857,29.8143,99.896
140,141,27621,2707,817,86.5472,27.4007,62.5993,99.9734
141,142,4876,769,722,267.305,19.1608,70.8392,99.9861
142,143,14400,908,757,262.879,67.0832,22.9168,99.902
143,144,24562,2429,790,268.578,40.0993,49.9007,99.7656
144,145,2819,2490,728,92.1017,63.0782,26.9218,99.8069
145,146,1982,1625,739,89.2903,30.8233,59.1767,99.9826
146,147,12645,445,803,268.91900000000004,47.5522,42.4478,99.851
147,148,2820,2174,747,257.4,77.7587,12.2413,99.973
148,149,508,507,737,110.251,27.9096,62.0904,99.9913
149,150,1145,1801,745,77.5263,2.85255,87.1475,99.9917
150,151,7525,3152,816,95.7286,31.0224,58.9776,99.9869
151,152,2664,1718,769,43.74100000000001,88.3516,1.64841,99.9324
152,153,16599,1837,837,257.04200000000003,62.1338,27.8662,99.8164
153,154,1868,380,778,272.216,47.7375,42.2625,99.991
154,155,1102,2805,760,292.312,77.0271,12.9729,99.9927
155,156,74387,640,925,283.654,14.9217,75.0783,99.8813
156,157,1960,811,768,269.141,7.7607,82.2393,99.9933
157,158,2624,3221,789,275.80400000000003,66.3454,23.6546,99.897
158,159,10661,2251,816,266.935,38.8876,51.1124,99.9791
159,160,3022,744,789,273.778,49.3238,40.6762,99.9852
160,161,37270,1676,902,262.594,64.9428,25.0572,99.7023
161,162,2728,2606,794,259.552,51.2837,38.7163,99.9922
162,163,8044,1062,833,276.78,40.9116,49.0884,99.9635
163,164,4763,136,822,268.141,75.8189,14.1811,99.9905
164,165,13854,2072,831,89.48200000000001,33.8969,56.1031,99.686
165,166,1743,832,803,114.402,80.9558,9.04422,99.9939
166,167,6920,2807,849,82.5258,34.0565,55.9435,99.9812
167,168,1182,2863,805,100.038,61.6247,28.3753,99.9932
168,169,2732,2589,850,260.385,55.4776,34.5224,99.8629
169,170,1563,227,813,285.156,72.2955,17.7045,99.9538
170,171,4187,2934,823,248.37,44.8984,45.1016,99.9832
171,172,1003,279,815,130.955,85.01100000000002,4.98896,99.9969
172,173,27397,3063,906,83.7889,4.25242,85.7476,99.7369
173,174,5921,842,882,91.0024,15.8948,74.1052,99.988
174,175,3819,344,841,284.68,66.6656,23.3344,99.9073
175,176,7014,1525,868,269.145,58.0612,31.9388,99.7478
176,177,11664,243,892,81.6581,45.1237,44.8763,99.9322
177,178,24482,2338,962,86.7221,71.0333,18.9667,99.5279
178,179,7661,2880,892,253.106,15.3507,74.6493,99.9937
179,180,1334,274,850,277.076,17.167,72.833,99.995
180,181,1525,3233,863,265.289,23.5538,66.4462,99.854
181,182,4533,918,870,22.2193,84.3424,5.65764,99.9873
182,183,944,2541,864,87.8529,26.6063,63.3937,99.9973
183,184,69060,2089,988,267.55400000000003,29.2065,60.7935,99.4741
184,185,9781,121,936,290.18,10.6573,79.3427,99.9545
185,186,1385,2936,899,81.1687,28.7201,61.2799,99.9784
186,187,576,2512,896,269.237,7.8974199999999986,82.1026,99.9457
187,188,14502,2456,949,89.9983,33.3827,56.6173,99.6035
188,189,6588,385,925,277.866,5.994669999999998,84.0053,99.9872
189,190,2684,3211,943,265.766,19.2642,70.7358,99.6797
190,191,1008,1784,896,92.9467,41.6519,48.3481,99.9954
191,192,1626,449,908,100.124,66.1248,23.8752,99.9957
192,193,47231,1260,1027,80.9106,33.2489,56.7511,99.694
193,194,23707,1868,980,83.8554,27.089,62.911,99.9237
194,195,1675,2545,919,85.7612,38.4217,51.5783,99.9751
195,196,4547,2630,944,99.3005,36.4359,53.5641,99.9227
196,197,55307,951,1058,85.165,13.5768,76.4232,99.4199
197,198,1635,2970,928,78.0333,13.3619,76.6381,99.7466
198,199,6696,1519,943,238.979,67.9404,22.0596,99.912
199,200,1961,3157,971,94.1487,17.3186,72.6814,99.93
200,201,42078,190,1073,272.904,21.6883,68.3117,99.9932
201,202,732,3186,949,268.233,18.8536,71.1464,99.9666
202,203,16285,2723,1006,96.8926,44.54600000000001,45.45399999999999,99.833
203,204,4841,2825,976,92.5768,47.1405,42.8595,99.9872
204,205,587,342,968,272.91,25.3577,64.6423,99.9922
205,206,14240,493,1026,94.4501,75.3684,14.6316,99.0998
206,207,753,537,971,281.057,16.3052,73.6948,99.894
207,208,1515,2588,985,86.0475,9.18233,80.8177,99.9596
208,209,1085,2548,973,89.8922,22.6906,67.3094,99.9798
209,210,34894,3025,1089,36.3743,88.1598,1.84016,98.877
210,211,3928,1497,998,106.733,54.2594,35.7406,99.0035
211,212,5565,394,1018,302.19,79.9557,10.0443,99.0067
212,213,58268,1618,1127,85.5386,8.03761,81.9624,99.8708
213,214,693,3242,997,84.395,52.7609,37.2391,99.9875
214,215,36886,372,1144,101.882,4.581169999999998,85.4188,99.6323
215,216,4503,3149,1036,95.3374,18.9502,71.0498,99.8806
216,217,2722,2532,1037,272.418,60.3516,29.6484,99.2166
217,218,42332,761,1173,86.334,6.6464,83.3536,99.9374
218,219,1030,2257,1028,260.928,27.8978,62.1022,99.9607
219,220,1318,2458,1043,263.971,59.006,30.994,99.2557
220,221,2833,2833,1065,93.1297,33.9816,56.0184,99.9255
221,222,2590,1115,1057,85.6149,50.6817,39.3183,99.9844
222,223,12877,2647,1087,39.6901,76.4341,13.5659,99.7575
223,224,1199,1506,1047,278.318,42.2737,47.7263,99.9811
224,225,706,77,1060,290.181,10.3386,79.6614,99.9615
225,226,526,3204,1061,261.742,38.8482,51.1518,99.509
226,227,5958,1450,1105,263.062,42.8153,47.1847,99.6706
227,228,2487,2223,1074,268.214,33.6555,56.3445,99.99
228,229,4202,1181,1105,285.173,54.6335,35.3665,99.982
229,230,1557,2546,1085,66.8427,65.4115,24.5885,99.9903
230,231,6846,2922,1107,110.801,77.7417,12.2583,99.9919
231,232,1718,372,1109,265.379,14.3464,75.6536,99.9479
232,233,12003,2324,1159,271.059,58.5016,31.4984,99.8208
233,234,1100,2432,1100,266.372,55.58600000000001,34.414,99.9754
234,235,4625,546,1128,102.714,9.39799,80.602,99.9617
235,236,6762,1805,1132,270.369,54.2968,35.7032,99.9824
236,237,43607,2173,1190,258.262,1.0421200000000002,88.9579,99.8487
237,238,1230,2496,1107,88.264,12.7845,77.2155,99.5391
238,239,3715,2826,1124,262.356,47.1107,42.8893,99.891
239,240,1889,1382,1131,268.212,39.5949,50.4051,99.9889
240,241,1099,3246,1135,261.89,50.2603,39.7397,99.9565
241,242,1636,1890,1133,93.8389,65.1209,24.8791,99.9821
242,243,535,2457,1124,254.209,39.4444,50.5556,99.9784
243,244,3089,2705,1146,40.8252,71.4893,18.5107,99.9498
244,245,2950,3161,1164,305.15,70.3118,19.6882,99.957
245,246,1880,3114,1141,96.2975,33.6412,56.3588,99.9853
246,247,66909,2732,1253,78.6208,9.78469,80.2153,99.7879
247,248,11930,2484,1191,90.1497,27.7066,62.2934,99.343
248,249,630,1156,1145,283.524,64.1636,25.8364,99.9977
249,250,2243,2411,1163,256.071,0.5683590000000001,89.4316,99.9534
250,251,6126,1221,1180,82.8853,31.5328,58.4672,99.9731
251,252,9426,628,1207,102.813,4.42326,85.5767,99.9453
252,253,2754,1354,1170,268.67,40.8915,49.1085,99.9893
253,254,1063,1918,1158,278.607,81.3178,8.682160000000001,99.9987
254,255,1461,1996,1167,280.89,80.4402,9.55979,99.9932
255,256,3526,1729,1195,269.302,55.1441,34.8559,99.9931
256,257,30188,1023,1272,276.36,63.0318,26.9682,96.878
257,258,23738,2986,1251,48.5716,78.7533,11.2467,99.9073
258,259,1407,3214,1173,95.2022,28.6784,61.3216,99.9606
259,260,2426,1147,1199,277.388,56.6026,33.3974,99.9918
260,261,5509,1412,1204,71.0591,34.5589,55.4411,99.9519
261,262,916,1853,1173,86.6383,65.8546,24.1454,99.9851
262,263,7965,884,1244,264.194,55.8447,34.1553,99.9573
263,264,12152,531,1254,282.1690000000001,42.3709,47.6291,71.68
264,265,4330,1315,1219,81.7741,15.6564,74.3436,99.9822
265,266,22022,1861,1262,285.574,79.0285,10.9715,99.9414
266,267,862,1774,1210,259.466,2.37708,87.6229,98.9846
267,268,1389,1477,1218,263.771,43.5791,46.4209,99.2038
268,269,650,220,1213,273.017,6.8665,83.1335,99.993
269,270,1622,2031,1233,282.6620000000001,79.5401,10.4599,99.9934
270,271,619,82,1224,275.461,73.1451,16.8549,99.9467
271,272,590,278,1217,278.838,60.6002,29.3998,99.9952
272,273,1938,1108,1233,276.397,65.2925,24.7075,99.9786
273,274,1411,3177,1224,277.79200000000003,42.3473,47.6527,99.9961
274,275,569,2397,1240,262.795,56.8712,33.1288,99.9872
275,276,13525,278,1274,100.632,0.700279,89.2997,99.9502
276,277,32220,1252,1342,96.1411,43.24100000000001,46.75899999999999,99.8825
277,278,778,2091,1240,97.6702,35.5947,54.4053,99.9935
278,279,1026,1990,1257,81.4537,23.9649,66.0351,99.2674
279,280,1624,388,1259,257.717,65.9635,24.0365,99.9962
280,281,17285,2568,1348,262.237,46.3396,43.6604,99.9487
281,282,5920,1494,1280,270.255,26.1369,63.8631,98.6959
282,283,6174,1727,1280,88.6139,53.3861,36.6139,99.9879
283,284,2215,1438,1293,66.7511,35.3053,54.6947,99.991
284,285,776,1361,1261,82.9189,23.2074,66.7926,99.9913
285,286,14420,3168,1349,277.113,42.9286,47.0714,99.9819
286,287,3596,3110,1280,299.987,75.2249,14.7751,99.99
287,288,4529,1162,1293,267.668,43.9059,46.0941,99.9752
288,289,6970,181,1317,275.388,8.90034,81.0997,99.9466
289,290,11271,2449,1312,78.1492,0.923592,89.0764,99.4133
290,291,4606,2290,1290,285.569,75.0793,14.9207,99.9948
291,292,5238,2072,1292,269.468,55.3855,34.6145,99.9854
292,293,3629,123,1324,284.8540000000001,11.6463,78.3537,99.9506
293,294,2718,3235,1321,269.6,43.2189,46.7811,99.976
294,295,4689,664,1305,96.2441,25.8131,64.1869,99.9856
295,296,681,430,1289,264.454,31.7998,58.2002,99.9949
296,297,11089,1397,1390,84.9118,39.5705,50.4295,99.5695
297,298,21476,312,1374,267.368,63.4458,26.5542,99.9861
298,299,4726,1625,1336,266.021,39.7351,50.2649,99.9798
299,300,2918,2012,1328,268.37,57.4886,32.5114,99.974
300,301,528,75,1311,287.462,11.3918,78.6082,99.9128
301,302,6628,653,1373,102.54,22.2114,67.7886,99.903
302,303,884,2137,1306,271.16900000000004,33.0904,56.9096,99.9937
303,304,2186,544,1312,82.3932,80.0274,9.97256,99.984
304,305,106693,1041,1531,95.5533,2.7506,87.2494,97.5947
305,306,3877,807,1334,95.1683,25.7491,64.2509,99.9911
306,307,19952,456,1399,272.208,36.0254,53.9746,99.5562
307,308,7302,1540,1372,88.309,23.6121,66.3879,99.9901
308,309,59947,2194,1433,89.5415,27.0635,62.9365,99.809
309,310,570,2958,1329,256.92,35.4497,54.5503,99.9941
310,311,7242,1940,1394,263.219,79.1093,10.8907,99.9902
311,312,1051,735,1335,99.1474,10.7426,79.2574,99.9962
312,313,6001,3057,1376,261.482,40.3465,49.6535,99.9619
313,314,4077,1749,1372,262.75,54.7681,35.2319,99.9855
314,315,4888,585,1389,102.349,21.6425,68.3575,99.9764
315,316,4242,1461,1393,261.639,25.7004,64.2996,99.3789
316,317,13743,1649,1414,98.4404,53.6311,36.3689,99.9099
317,318,707,3261,1377,268.426,43.4123,46.5877,99.9867
318,319,2619,2939,1375,267.777,21.421,68.579,99.7892
319,320,9455,743,1408,272.225,23.1315,66.8685,99.9694
320,321,26021,2846,1443,87.5852,58.0183,31.9817,99.9217
321,322,16423,136,1440,280.694,25.7922,64.2078,99.9687
322,323,8936,2385,1422,295.92,75.4372,14.5628,99.9628
323,324,3643,2488,1405,91.1823,43.6651,46.3349,99.4573
324,325,1360,1342,1404,85.0177,55.5824,34.4176,99.9868
325,326,2998,557,1437,104.099,25.5936,64.4064,99.9836
326,327,76469,1810,1557,85.73899999999998,36.6224,53.3776,99.6689
327,328,3665,3087,1437,262.659,57.4161,32.5839,99.9792
328,329,7878,2705,1458,82.6209,6.24273,83.7573,99.9485
329,330,3154,1294,1443,107.038,67.2299,22.7701,99.8278
330,331,1428,2996,1442,110.902,32.3909,57.6091,99.6756
331,332,7045,2473,1470,80.3923,3.43597,86.564,99.4029
332,333,50818,2628,1589,268.345,41.4517,48.5483,99.8102
333,334,680,3221,1441,98.642,65.8552,24.1448,99.9747
334,335,1271,3167,1448,260.03700000000003,39.7258,50.2742,99.9754
335,336,5734,1557,1473,269.157,26.9194,63.0806,99.9253
336,337,43383,558,1576,84.4768,68.7926,21.2074,99.3959
337,338,1298,804,1460,92.1146,4.65961,85.3404,99.9914
338,339,2466,888,1468,266.334,24.4749,65.5251,99.9913
339,340,43362,240,1569,103.982,5.2944900000000015,84.7055,97.7701
340,341,696,843,1467,91.0938,4.29611,85.7039,99.9816
341,342,13889,3029,1544,86.8252,20.7853,69.2147,81.7674
342,343,7165,1993,1523,265.813,50.7396,39.2604,98.3513
343,344,1836,285,1474,102.102,0.533226,89.4668,99.9909
344,345,780,333,1471,271.696,2.67905,87.3209,99.9933
345,346,14723,730,1513,284.838,24.7868,65.2132,80.2226
346,347,4133,3190,1494,273.514,55.7875,34.2125,99.9883
347,348,7866,1456,1537,266.315,38.615,51.385,99.0592
348,349,2931,1371,1493,96.0757,67.7537,22.2463,99.6678
349,350,1961,3083,1489,94.9704,11.8841,78.1159,99.9938
350,351,2853,3237,1525,266.001,56.1039,33.8961,99.7641
351,352,3873,1300,1525,258.825,49.0162,40.9838,99.57
352,353,1849,2058,1508,240.157,79.00399999999998,10.996,99.7255
353,354,5737,2377,1527,263.33,20.4338,69.5662,99.9759
354,355,715,856,1512,92.1925,1.78877,88.2112,99.9584
355,356,1096,106,1542,275.834,12.7533,77.2467,99.9714
356,357,15540,1555,1588,307.608,66.5681,23.4319,99.6188
357,358,729,1531,1528,279.383,45.7603,44.2397,99.5037
358,359,19035,2460,1602,27.529,86.087,3.91302,99.7621
359,360,11819,1368,1593,271.923,45.6247,44.3753,99.9544
360,361,9076,75,1738,294.164,39.1729,50.8271,99.7873
361,362,13381,3145,1624,94.5406,15.242,74.758,99.9552
362,363,699,2854,1559,94.3474,71.7502,18.2499,99.605
363,364,31128,420,1670,268.564,37.5878,52.4122,99.7228
364,365,4906,2316,1591,80.8237,45.0014,44.9986,99.9686
365,366,49287,804,1681,92.245,2.22733,87.7727,99.7076
366,367,7071,2206,1594,81.9009,4.553719999999998,85.4463,99.9367
367,368,1482,2931,1569,260.677,11.3087,78.6913,99.9965
368,369,5106,1238,1597,77.12899999999998,64.9908,25.0092,99.9897
369,370,4754,2031,1600,287.067,80.1288,9.87125,99.9625
370,371,3763,2906,1619,84.0257,73.6074,16.3926,99.9742
371,372,2222,3229,1612,87.0089,15.5266,74.4734,99.9917
372,373,10830,2813,1636,27.844,82.9979,7.00206,99.9807
373,374,6681,2091,1637,296.629,77.8615,12.1385,99.9623
374,375,3475,2974,1626,270.381,40.2519,49.7481,99.2236
375,376,16477,1290,1694,282.691,67.5144,22.4856,99.9397
376,377,2161,304,1661,267.502,35.0849,54.9151,99.9917
377,378,8792,121,1743,294.0,40.4424,49.5576,99.9708
378,379,11366,2389,1697,79.1072,19.5143,70.4857,99.9597
379,380,15684,2192,1685,263.972,32.2899,57.7101,99.9644
380,381,4373,1443,1663,77.0458,31.7592,58.2408,99.7642
381,382,5714,1554,1671,275.221,68.2324,21.7676,99.9876
382,383,2759,3030,1658,279.728,32.6491,57.3509,99.9885
383,384,1386,1203,1663,86.2765,17.3556,72.6444,99.9449
384,385,2565,3063,1691,271.545,0.8535159999999999,89.1465,99.9832
385,386,3560,2306,1692,273.468,58.892,31.108,99.9888
386,387,2060,2632,1691,29.7103,84.3648,5.63517,99.9869
387,388,4723,2688,1704,62.2639,62.797,27.203000000000007,99.9767
388,389,1955,1025,1680,90.2775,6.07052,83.9295,99.9813
389,390,2906,2960,1690,262.274,1.63737,88.3626,98.5848
390,391,16434,1615,1735,84.5625,24.2947,65.7053,99.9233
391,392,2482,678,1693,277.636,12.6518,77.3482,99.9938
392,393,2803,2853,1697,79.4566,9.78943,80.2106,99.9547
393,394,1104,3241,1692,274.255,29.4515,60.5485,99.9656
394,395,3787,1749,1703,266.022,59.17,30.83,99.9858
395,396,851,3211,1700,275.04400000000004,29.7996,60.2004,99.9621
396,397,1621,2755,1691,83.8437,30.1741,59.8259,99.9791
397,398,2716,1383,1704,277.911,72.6196,17.3804,99.982
398,399,2576,250,1707,91.596,29.2622,60.7378,99.9955
399,400,1177,930,1700,268.059,48.7409,41.2591,99.992
400,401,5820,2007,1728,273.027,30.3455,59.6545,99.3912
401,402,2425,2076,1704,89.2042,6.3379400000000015,83.6621,99.9844
402,403,767,1803,1698,81.8869,13.7843,76.2157,99.9936
403,404,1261,1937,1698,255.532,11.103,78.89699999999998,99.9725
404,405,3041,181,1717,99.2951,15.4738,74.5262,99.9982
405,406,2526,1210,1737,85.9904,10.3782,79.6218,99.8997
406,407,2955,3097,1727,72.5998,75.7836,14.2164,99.9874
407,408,3830,1474,1748,272.117,71.7489,18.2511,99.6684
408,409,55187,2993,1837,270.157,42.054,47.94600000000001,87.5344
409,410,22383,337,1803,91.7849,23.5658,66.4342,99.9829
410,411,1036,1845,1729,259.501,10.0805,79.9195,99.9928
411,412,1289,556,1731,278.36400000000003,10.9982,79.0018,99.9951
412,413,2046,1808,1741,260.871,10.1198,79.8802,99.9938
413,414,8845,2755,1771,69.5658,59.0229,30.9771,99.978
414,415,1984,625,1749,262.33,75.1683,14.8317,99.9816
415,416,703,1719,1747,270.119,56.1463,33.8537,99.9956
416,417,7344,2135,1793,85.6387,8.370519999999999,81.6295,99.827
417,418,3638,683,1761,270.585,2.07055,87.9295,99.9908
418,419,1711,2092,1746,286.78,62.0477,27.9523,99.9929
419,420,19279,1397,1838,86.4825,45.9025,44.0975,99.814
420,421,200542,2113,2076,261.366,34.4861,55.5139,98.8122
421,422,541,1897,1743,259.125,83.4735,6.52645,99.9805
422,423,4744,2255,1782,244.134,68.597,21.403,99.987
423,424,1154,522,1757,276.073,37.5419,52.4581,99.9944
424,425,60331,190,1993,273.872,54.202,35.798,87.79899999999998
425,426,8115,2651,1790,85.583,0.509758,89.4902,99.985
426,427,1903,2463,1763,83.8698,3.64488,86.3551,99.2632
427,428,7948,1869,1798,240.73,83.5362,6.46381,99.9703
428,429,1670,1686,1779,269.914,56.4549,33.5451,99.9972
429,430,3791,3132,1782,274.132,28.3752,61.6248,99.9747
430,431,4101,1768,1784,252.334,78.2723,11.7277,99.9391
431,432,5677,1980,1785,85.7813,11.4896,78.5104,98.739
432,433,6685,1171,1799,273.605,59.2159,30.7841,99.9907
433,434,21958,1043,1831,94.8334,20.0074,69.9926,99.6139
434,435,13988,581,1837,275.22700000000003,4.77504,85.225,99.7709
435,436,4859,2558,1815,269.587,66.7483,23.2517,99.9283
436,437,809,3174,1793,94.8492,22.6272,67.3728,99.9872
437,438,745,3238,1790,262.177,58.506,31.494,99.9704
438,439,989,1358,1782,280.865,64.872,25.128,99.9925
439,440,1195,2423,1800,251.96400000000003,69.0323,20.9677,99.9869
440,441,12865,1245,1851,264.28700000000003,29.1949,60.8051,99.8584
441,442,2457,928,1811,82.1358,7.99332,82.0067,99.9817
442,443,2217,2481,1805,261.013,66.5521,23.4479,99.7956
443,444,12275,708,1849,275.546,37.1194,52.8806,99.9636
444,445,6172,1619,1831,269.42400000000004,53.4694,36.5306,99.9964
445,446,1430,876,1818,255.397,32.7865,57.2135,99.996
446,447,941,2370,1816,74.52600000000002,36.2543,53.7457,99.9893
447,448,15124,467,1876,89.4099,32.3516,57.6484,99.399
448,449,2027,2183,1818,264.10200000000003,48.4094,41.5906,99.9922
449,450,838,1531,1816,280.02,66.2934,23.7066,99.955
450,451,13009,2809,1866,133.836,84.0398,5.96019,99.9188
451,452,66646,1681,1988,262.67400000000004,22.0621,67.9379,99.6793
452,453,872,1915,1843,259.956,40.2352,49.7648,99.9949
453,454,9426,1996,1861,265.246,10.3628,79.6372,99.0347
454,455,1050,2626,1843,91.9825,26.3045,63.6955,99.991
455,456,644,3169,1841,89.9557,64.2359,25.7641,99.9969
456,457,2122,1817,1852,259.4,10.4047,79.5953,99.9937
457,458,1861,3238,1869,85.4528,20.9789,69.0211,99.7677
458,459,1174,1539,1849,99.1235,43.7252,46.2748,99.9903
459,460,6072,147,1892,275.171,49.7924,40.2076,99.9964
460,461,1004,2482,1847,265.309,1.54461,88.4554,99.2311
461,462,1941,2687,1865,243.326,66.0674,23.9326,99.9924
462,463,16735,2393,1965,252.614,85.7671,4.2329,99.4314
463,464,4929,2586,1893,87.6481,0.733246,89.2668,99.9838
464,465,11915,885,1902,87.29700000000003,23.8493,66.1507,99.9642
465,466,1190,1148,1879,100.957,59.6317,30.3683,99.9931
466,467,1539,3168,1894,93.3521,63.9318,26.0682,99.9864
467,468,10449,1893,1914,139.28,76.6393,13.3607,99.9624
468,469,33570,2631,2017,252.942,66.3691,23.6309,99.1022
469,470,86417,657,2057,277.611,67.6887,22.3113,99.1301
470,471,4141,1559,1911,276.73,65.9028,24.0972,99.9773
471,472,19031,1032,1966,98.1576,5.24699,84.75299999999999,99.7654
472,473,8933,2497,1939,263.601,39.0479,50.9521,99.4373
473,474,3620,2700,1913,273.547,28.3451,61.6549,99.9851
474,475,1309,1484,1922,275.276,67.5667,22.4333,99.6083
475,476,1833,1275,1917,256.346,81.6513,8.34866,99.9889
476,477,1383,2929,1919,263.454,18.667,71.333,99.9498
477,478,4632,2778,1945,89.189,17.5748,72.4252,99.9736
478,479,663,86,1924,278.268,54.5086,35.4914,99.9667
479,480,2123,1438,1935,256.899,19.746,70.25399999999999,99.9708
480,481,2993,402,1948,91.937,24.4191,65.5809,99.9928
481,482,2091,1368,1943,88.8718,36.2224,53.7776,99.9766
482,483,21475,336,2036,273.822,49.9214,40.0786,99.8303
483,484,1860,2154,1947,84.1298,6.35541,83.6446,99.9873
484,485,856,128,1951,274.958,55.2133,34.7867,99.989
485,486,3470,1245,1952,86.9983,72.82300000000002,17.177,99.9963
486,487,2379,1151,1956,91.9176,59.3234,30.6766,99.9807
487,488,5053,3165,1992,95.2814,18.5354,71.4646,99.9465
488,489,12835,2870,1995,256.726,58.8205,31.1795,99.7559
489,490,1185,88,1965,277.185,54.285,35.715,99.967
490,491,3265,1344,1978,94.1688,57.3323,32.6677,99.9785
491,492,1007,819,1955,268.666,7.90278,82.0972,99.9879
492,493,11874,450,2030,92.4884,1.22643,88.7736,99.3405
493,494,49587,970,2159,82.7401,50.1126,39.8874,98.4666
494,495,3505,1437,2000,255.482,12.8705,77.1295,99.9579
495,496,1523,3119,1993,266.606,64.5485,25.4515,99.9822
496,497,3701,3241,2018,68.5599,75.2137,14.7863,99.6207
497,498,27421,3004,2102,81.4421,26.7081,63.2919,99.4954
498,499,11867,1198,2032,95.2815,60.8513,29.1487,98.8108
499,500,8524,2460,2065,265.401,82.4936,7.50644,97.9911
500,501,4535,1338,2056,260.386,12.1751,77.8249,99.9826
501,502,39729,3134,2199,265.328,13.3647,76.6353,99.9209
502,503,2748,830,2071,293.927,69.8765,20.1235,99.9655
503,504,6305,2790,2069,79.9475,3.38703,86.613,99.8971
504,505,8235,1434,2093,259.986,64.8883,25.1117,99.7708
505,506,9804,1089,2113,86.4467,29.3235,60.6765,99.9254
506,507,1805,2318,2077,278.812,67.8566,22.1434,99.9698
507,508,45516,1231,2189,77.1355,69.6776,20.3224,99.8641
508,509,30345,1574,2186,88.1829,18.2845,71.7155,99.9497
509,510,5712,2749,2130,269.046,19.4113,70.5887,99.9906
510,511,916,2858,2093,278.048,41.7816,48.2184,99.9869
511,512,748,3240,2102,56.8684,72.2811,17.7189,99.9605
512,513,57664,1734,2346,271.612,55.4795,34.5205,99.3637
513,514,660,891,2102,289.622,71.012,18.988,99.9861
514,515,3959,2412,2147,267.963,42.418,47.582,99.8685
515,516,1063,860,2124,258.43,0.757195,89.2428,99.9774
516,517,2550,2612,2140,69.1625,84.2645,5.7355,99.9827
517,518,2369,2555,2125,74.2821,85.4581,4.54194,99.9793
518,519,792,2472,2127,273.289,35.1609,54.8391,99.3614
519,520,2155,477,2158,283.607,52.1019,37.8981,99.7283
520,521,47453,2898,2255,77.6829,59.5317,30.4683,99.8195
521,522,7483,2656,2193,77.9558,61.0141,28.9859,99.9416
522,523,5286,332,2169,87.5175,51.1866,38.8134,99.9915
523,524,1034,1398,2150,80.9639,34.0203,55.9797,99.9937
524,525,18176,2524,2215,61.691,68.3674,21.6326,99.9603
525,526,2981,436,2178,88.7473,28.7897,61.2103,99.9905
526,527,5228,900,2191,259.597,37.5172,52.4828,99.9907
527,528,9330,251,2204,92.0596,66.3461,23.6539,99.9922
528,529,1626,850,2174,280.41200000000003,72.7351,17.2649,99.9835
529,530,6710,802,2226,257.6,31.0782,58.9218,99.9918
530,531,982,1401,2182,283.599,68.76100000000001,21.239,99.9906
531,532,3643,3210,2283,95.8286,22.4815,67.5185,99.9364
532,533,1070,1427,2200,256.637,13.8721,76.1279,99.9634
533,534,633,108,2216,92.8567,67.5745,22.4255,99.9835
534,535,7844,134,2291,94.8433,66.5937,23.4063,99.9475
535,536,31597,2714,2311,265.522,40.0153,49.9847,99.951
536,537,1335,2155,2210,261.091,30.8798,59.1202,99.9968
537,538,26226,655,2302,109.088,32.8928,57.1072,99.9469
538,539,4381,2392,2210,351.855,79.7022,10.2978,99.9904
539,540,575,750,2208,285.76,72.305,17.695,99.9942
540,541,1525,179,2212,98.6191,53.9271,36.0729,99.9964
541,542,856,71,2218,87.618,69.4553,20.5447,99.8204
542,543,63011,287,2371,101.456,30.0496,59.9504,99.6031
543,544,2261,505,2221,104.671,29.607,60.393,99.9944
544,545,1667,1333,2234,282.236,58.1787,31.8213,99.9828
545,546,1913,1492,2226,82.6852,63.8143,26.1857,99.9625
546,547,23096,453,2374,97.0976,31.3756,58.6244,99.4306
547,548,11820,1281,2322,277.059,68.6353,21.3647,99.9776
548,549,4701,78,2327,101.161,67.376,22.624,99.9436
549,550,6800,854,2283,251.989,37.5404,52.4596,99.9778
550,551,619,2345,2249,81.111,83.9252,6.07483,99.994
551,552,8458,556,2295,105.579,26.6416,63.3584,99.9468
552,553,1204,317,2258,275.983,51.1393,38.8607,99.994
553,554,2771,2028,2276,263.0,20.6621,69.3379,99.9869
554,555,31999,1395,2378,268.236,68.84899999999999,21.151,99.7225
555,556,19526,1072,2359,266.023,36.4587,53.5413,99.9758
556,557,4070,2613,2290,268.449,38.1199,51.8801,99.9712
557,558,6615,754,2320,107.691,71.7833,18.2167,99.9516
558,559,9453,2396,2324,101.393,84.3195,5.68051,99.9766
559,560,2535,3229,2315,92.187,23.388,66.612,99.983
560,561,38771,2044,2405,77.3159,22.7745,67.2255,99.5436
561,562,10944,1851,2358,84.2944,21.3352,68.6648,99.8218
562,563,18010,2301,2396,84.2477,24.0212,65.9788,99.8747
563,564,755,2546,2320,94.5846,69.666,20.334,99.9905
564,565,509,1559,2325,266.565,3.47684,86.5232,99.9902
565,566,880,2161,2338,104.032,69.2229,20.7771,99.9858
566,567,63496,764,2508,272.24,37.3838,52.6162,28.9193
567,568,20584,2519,2410,105.939,37.9322,52.0678,99.7561
568,569,52562,2954,2476,78.1229,12.8409,77.1591,99.4123
569,570,663,3143,2352,275.219,53.5312,36.4688,99.9976
570,571,2190,2185,2376,259.829,30.7543,59.2457,99.9899
571,572,7459,1641,2394,89.9122,15.2003,74.7997,99.979
572,573,10656,722,2418,101.474,30.1135,59.8865,99.9752
573,574,15236,1529,2432,113.151,62.4083,27.5917,99.844
574,575,2223,3181,2398,80.6253,66.7784,23.2216,99.9915
575,576,1169,3245,2397,86.3041,8.01571,81.9843,99.9814
576,577,4390,3143,2416,88.0638,59.7088,30.2912,99.9297
577,578,13143,549,2460,105.308,22.6448,67.3552,99.9605
578,579,986,3207,2412,66.1663,64.7939,25.2062,99.9864
579,580,4898,1803,2429,93.8653,58.3552,31.6448,99.9696
580,581,987,126,2413,117.906,26.6802,63.3198,99.9741
581,582,2831,1873,2417,252.447,26.5313,63.4687,99.9951
582,583,29626,2747,2547,68.3814,62.0389,27.9611,98.9945
583,584,586,2225,2425,71.9141,26.9651,63.0349,99.988
584,585,4822,1078,2453,98.1602,17.1018,72.8982,99.9399
585,586,2673,2651,2447,267.947,42.2138,47.7862,99.9945
586,587,611,57,2445,118.265,27.3965,62.6035,99.9357
587,588,849,126,2457,97.3027,25.7089,64.2911,98.5018
588,589,8545,1165,2490,84.7916,79.6395,10.3605,99.0004
589,590,1207,1426,2449,113.876,57.8768,32.1232,99.9849
590,591,2009,163,2453,96.6561,41.4462,48.5538,99.9925
591,592,4894,1012,2472,273.164,56.7675,33.2325,99.9539
592,593,1960,938,2466,94.7411,20.4092,69.5908,99.9813
593,594,1487,2209,2459,278.134,65.3299,24.6701,99.9858
594,595,1336,97,2456,117.673,26.4215,63.5785,99.9906
595,596,1273,641,2454,283.259,50.5805,39.4195,99.9845
596,597,8128,2390,2485,84.2188,15.7725,74.2275,99.9829
597,598,676,3222,2455,77.3412,56.73,33.27,99.9627
598,599,970,2268,2472,276.382,64.4868,25.5132,99.9548
599,600,970,3114,2471,259.77,58.4416,31.5584,99.9961
600,601,2333,1846,2475,84.9005,23.3947,66.6053,99.958
601,602,4055,2534,2502,268.44,39.6582,50.3418,99.877
602,603,915,55,2500,94.7633,21.9104,68.0896,99.8943
603,604,3300,478,2507,92.6337,22.1176,67.8824,99.5953
604,605,35399,2008,2565,146.865,85.3647,4.63532,98.926
605,606,2553,1422,2508,272.212,68.4445,21.5555,98.6438
606,607,1647,1895,2499,238.371,1.97553,88.0245,99.9902
607,608,22778,1447,2615,91.8534,55.0712,34.9288,97.8708
608,609,667,2192,2501,80.5918,16.8124,73.1876,99.9867
609,610,2462,1362,2513,112.874,58.3088,31.6912,99.0528
610,611,1094,2289,2500,284.154,65.5971,24.4029,99.9837
611,612,14708,3127,2590,275.106,54.0152,35.9848,99.4012
612,613,2739,966,2519,265.41200000000003,72.047,17.953,98.5136
613,614,1129,106,2509,278.122,54.122,35.878,99.9662
614,615,6376,1279,2526,89.8244,63.2108,26.7892,98.9694
615,616,675,2651,2504,90.1142,14.4162,75.5838,99.9865
616,617,2458,2682,2528,97.8183,60.9167,29.0833,99.7348
617,618,825,2593,2516,88.994,12.7375,77.2625,99.9731
618,619,1721,1556,2522,276.45,35.9359,54.0641,99.6999
619,620,1800,3203,2547,261.157,62.8092,27.1908,99.9087
620,621,509,1814,2515,264.246,3.3122800000000003,86.6877,99.9446
621,622,2802,2452,2545,89.3279,9.26353,80.7365,99.5655
622,623,15672,2189,2609,267.061,16.5679,73.4321,99.9083
623,624,1770,189,2538,276.507,19.0398,70.9602,99.9979
624,625,1277,899,2539,86.6675,20.6478,69.3522,99.9554
625,626,3602,2521,2573,260.882,0.230003,89.77,99.8537
626,627,14295,407,2592,268.551,25.6981,64.3019,99.6846
627,628,7392,2316,2567,257.868,42.0221,47.9779,99.8196
628,629,3122,150,2565,97.128,22.0601,67.9399,99.9987
629,630,3180,2607,2566,283.004,77.6892,12.3108,99.4522
630,631,1025,234,2546,93.2143,37.5771,52.4229,99.9804
631,632,5404,1025,2563,102.252,42.3952,47.6048,99.9302
632,633,10444,1199,2593,96.6881,6.8860899999999985,83.1139,99.9668
633,634,705,1825,2550,37.0132,86.4452,3.55479,99.9822
634,635,6890,3014,2581,280.339,8.80058,81.1994,99.3159
635,636,3204,1113,2567,83.0802,46.5775,43.4225,99.8916
636,637,3403,500,2581,101.639,40.6219,49.3781,99.9942
637,638,771,932,2557,94.1255,41.2896,48.7104,99.989
638,639,2099,1591,2576,278.425,35.1196,54.8804,99.9831
639,640,979,317,2572,97.559,30.0292,59.9708,99.9293
640,641,2234,1335,2593,70.1697,62.9083,27.0917,99.9591
641,642,4690,2404,2605,78.5316,18.523,71.477,99.9784
642,643,708,2560,2587,282.607,77.2152,12.7848,99.7418
643,644,12404,832,2647,266.632,40.3131,49.6869,99.9006
644,645,2173,1532,2585,91.2587,66.567,23.433000000000003,99.986
645,646,1531,200,2589,91.3172,14.1925,75.8075,99.9961
646,647,1367,1657,2589,272.353,32.7431,57.2569,99.9913
647,648,2747,3210,2625,258.39,43.9829,46.0171,99.9272
648,649,1788,543,2608,262.271,71.8968,18.1032,99.9911
649,650,902,957,2588,89.6083,24.4789,65.5211,98.9331
650,651,4523,1723,2607,278.35,73.827,16.173,99.9738
651,652,7691,260,2617,97.8788,17.304000000000002,72.696,99.9904
652,653,755,1300,2587,91.2533,8.688830000000001,81.3112,99.9824
653,654,679,3077,2599,266.301,18.6646,71.3354,99.9888
654,655,2986,1823,2615,82.8582,7.013039999999998,82.98700000000002,99.9805
655,656,1010,1280,2614,93.9744,34.8429,55.1571,99.9923
656,657,3822,2465,2636,98.6887,22.473000000000006,67.527,99.6461
657,658,20684,1081,2676,108.891,46.3881,43.6119,99.9401
658,659,2823,911,2641,74.7627,3.34294,86.6571,99.9211
659,660,15089,2658,2679,259.42400000000004,6.43871,83.5613,99.9339
660,661,1631,3011,2631,267.871,6.19097,83.809,99.9719
661,662,21376,1620,2680,262.501,23.5172,66.4828,99.9386
662,663,527,150,2616,92.0498,17.3496,72.6504,99.9993
663,664,31307,2339,2725,66.2181,75.3363,14.6637,99.9406
664,665,596,1388,2628,58.0951,62.0744,27.9256,99.9925
665,666,1605,95,2637,92.955,11.034,78.96600000000002,99.9974
666,667,53258,301,2754,289.119,60.6376,29.3624,99.8652
667,668,9211,543,2668,101.73,21.5776,68.4224,99.9551
668,669,17015,2550,2729,82.4991,52.6842,37.3158,99.9593
669,670,1685,1341,2641,84.1652,47.9389,42.0611,99.9954
670,671,22865,966,2742,87.6988,18.8553,71.1447,98.8833
671,672,937,1270,2646,89.7678,33.5744,56.4256,99.9903
672,673,1943,2853,2652,73.8018,65.7754,24.2246,99.9457
673,674,1511,1884,2644,259.60400000000004,2.60447,87.3955,99.9908
674,675,865,1778,2657,266.67400000000004,74.3115,15.6885,99.9969
675,676,1226,3050,2673,274.112,40.879,49.121,99.9764
676,677,1241,1315,2670,74.3622,68.0128,21.9872,99.9915
677,678,9274,1264,2712,278.107,40.3498,49.6502,99.9423
678,679,1576,1816,2676,205.93,88.2662,1.7337599999999995,99.9512
679,680,6894,112,2702,269.891,29.4475,60.5525,99.9946
680,681,15203,1913,2718,127.193,84.4848,5.5151900000000005,99.9687
681,682,523,1985,2662,263.927,32.1,57.9,99.9782
682,683,634,634,2671,96.4723,43.4694,46.5306,99.994
683,684,3413,2451,2703,259.401,9.77534,80.2247,99.1788
684,685,27946,2842,2745,74.5545,2.02694,87.9731,99.9367
685,686,4515,2089,2705,80.0612,41.2351,48.7649,99.9847
686,687,1478,1177,2689,71.9846,60.8798,29.1202,99.9965
687,688,1353,3163,2691,96.1025,10.3513,79.6487,99.99
688,689,960,1743,2687,270.33,36.0267,53.9733,99.9923
689,690,1712,563,2703,97.4502,12.5802,77.4198,99.9796
690,691,13743,686,2729,273.986,3.74007,86.2599,99.9571
691,692,8201,2205,2732,291.296,55.6764,34.3236,99.978
692,693,617,3011,2703,91.4994,4.69243,85.3076,99.99
693,694,2147,1375,2716,279.868,52.3848,37.6152,99.9693
694,695,5887,855,2758,271.586,45.7991,44.2009,99.9346
695,696,965,3099,2707,263.255,20.2992,69.7008,99.9917
696,697,1387,1785,2713,85.7519,14.4588,75.5412,99.9907
697,698,1630,3040,2726,265.585,17.4134,72.5866,99.98
698,699,5903,466,2744,100.542,12.3133,77.6867,99.0302
699,700,10603,3127,2786,271.843,39.0325,50.9675,99.951
700,701,843,1727,2723,92.583,57.7343,32.2657,99.9834
701,702,1751,3231,2737,86.0464,10.3795,79.6205,99.5786
702,703,683,1527,2741,68.1337,71.4653,18.5347,99.9928
703,704,6790,2033,2775,269.077,9.03199,80.968,99.9806
704,705,1272,1159,2738,282.965,58.7564,31.2436,99.9976
705,706,3071,2982,2759,88.4244,5.15867,84.8413,99.9195
706,707,21589,586,2815,280.005,20.0014,69.9986,99.9249
707,708,1394,1476,2747,292.285,52.8978,37.1022,99.947
708,709,7861,2127,2778,262.441,42.6265,47.3735,99.9846
709,710,1832,3196,2771,263.076,37.4295,52.5705,99.9851
710,711,1390,64,2778,80.0817,21.4284,68.5716,99.9322
711,712,838,148,2753,82.4955,67.35300000000001,22.647,99.9971
712,713,7968,1795,2780,166.83700000000005,79.2912,10.7088,99.9599
713,714,50541,1468,2876,95.5225,75.7436,14.2564,99.1974
714,715,1679,1586,2756,260.052,0.789284,89.2107,99.9886
715,716,55415,1186,2899,96.9606,37.6609,52.3391,99.7597
716,717,3254,3020,2792,87.6624,9.35102,80.649,99.9595
717,718,15899,2650,2842,78.696,35.908,54.092,99.926
718,719,1040,1708,2774,203.835,85.7273,4.27267,99.9851
719,720,2639,729,2794,87.5196,17.0085,72.9915,99.9801
720,721,11187,114,2851,78.6674,7.0461,82.9539,99.9173
721,722,1002,405,2782,79.4689,17.7277,72.2723,99.987
722,723,1658,1747,2789,220.441,80.5153,9.48473,99.9721
723,724,5600,1673,2815,98.5097,75.0328,14.9672,99.9592
724,725,1618,1971,2790,89.1577,14.5322,75.4678,99.7017
725,726,8099,1565,2809,282.569,56.6976,33.3024,99.9653
726,727,568,799,2776,267.48400000000004,54.3351,35.6649,99.9964
727,728,2241,2963,2817,93.9914,8.48328,81.5167,98.5211
728,729,8613,2269,2830,280.002,55.9284,34.0716,99.9798
729,730,958,48,2809,83.8403,21.4931,68.5069,99.9655
730,731,4282,167,2825,86.2459,24.9515,65.0485,99.9618
731,732,766,1877,2795,81.5918,10.7261,79.2739,99.9971
732,733,4507,483,2855,279.894,53.6204,36.3796,99.8797
733,734,1318,446,2809,260.451,30.986,59.014,99.5122
734,735,5692,770,2832,266.769,24.1999,65.8001,99.989
735,736,18537,2506,2892,89.9715,32.0558,57.9442,99.7764
736,737,1237,892,2825,87.6406,57.5418,32.4582,99.99
737,738,595,1845,2831,82.9646,9.85136,80.1486,99.993
738,739,30210,2094,2901,269.71,9.50526,80.4947,99.8633
739,740,6394,3048,2860,286.1040000000001,61.2141,28.7859,99.9816
740,741,34221,1864,2919,239.938,73.7538,16.2462,99.7862
741,742,54633,2879,2929,258.121,23.668000000000006,66.332,99.1583
742,743,1421,3224,2842,61.3489,69.164,20.836,99.8921
743,744,32826,918,2912,102.716,70.7308,19.2692,99.8892
744,745,3931,3200,2898,62.0849,68.5601,21.4399,99.9689
745,746,557,1642,2858,143.283,85.4318,4.56821,99.9901
746,747,1558,1718,2870,265.194,4.26395,85.736,99.9699
747,748,1379,722,2873,89.9861,9.04512,80.9549,99.9929
748,749,4899,2364,2891,74.5536,9.9941,80.0059,99.9917
749,750,596,44,2885,106.501,26.235,63.765,99.9447
750,751,945,3151,2897,79.5371,71.2399,18.7601,99.9926
751,752,3280,2417,2920,48.2915,80.0089,9.99113,99.981
752,753,5877,2271,2919,61.7452,81.2926,8.707410000000001,99.9328
753,754,24263,422,2989,90.8559,14.5948,75.4052,99.4031
754,755,24027,3096,3009,269.41700000000003,35.5981,54.4019,99.6621
755,756,2982,616,2912,284.567,54.8726,35.1274,99.9945
756,757,2403,316,2926,264.389,43.6281,46.3719,99.9906
757,758,8567,528,2954,269.96,2.80479,87.1952,99.8369
758,759,2730,1388,2956,101.355,77.5398,12.4602,99.9786
759,760,2391,183,2931,99.5016,47.6169,42.3831,99.9642
760,761,4721,78,2955,265.248,8.60297,81.39699999999998,99.893
761,762,4231,1677,2934,268.136,7.1599,82.8401,99.9836
762,763,30786,2675,3003,267.692,17.5674,72.4326,99.9029
763,764,25397,685,3060,285.202,62.9191,27.0809,99.3368
764,765,1887,678,2939,88.2675,9.51682,80.4832,99.9911
765,766,2960,243,2939,273.2,28.022,61.978,99.9913
766,767,5935,126,2992,257.73900000000003,21.3993,68.6007,99.9849
767,768,8614,2190,2996,127.604,79.6399,10.3601,99.7695
768,769,627,630,2952,266.142,67.6935,22.3065,99.996
769,770,21908,1049,3039,287.461,49.5425,40.4575,99.5393
770,771,6841,3200,3025,259.664,33.5679,56.4321,99.8595
771,772,3568,639,2988,88.95200000000001,20.5235,69.4765,99.6579
772,773,5430,1469,3030,77.8144,3.42547,86.5745,99.649
773,774,45088,2355,3095,255.504,5.35487,84.6451,99.8319
774,775,13078,1341,3034,101.005,72.2143,17.7857,98.8924
775,776,17718,265,3048,83.9088,39.4023,50.5977,77.2881
776,777,4533,2479,3027,264.377,15.5349,74.4651,99.6005
777,778,6336,1698,2998,268.033,31.4089,58.5911,99.8974
778,779,1184,188,2998,89.0525,1.04332,88.9567,99.9976
779,780,996,225,3007,270.478,60.5188,29.4812,99.7961
780,781,1772,1936,3015,81.2304,17.1521,72.8479,99.7176
781,782,35157,849,3104,79.1661,25.9702,64.0298,92.3126
782,783,3872,570,3029,282.023,42.2145,47.7855,99.8669
783,784,20394,2063,3073,266.556,9.42774,80.5723,99.4196
784,785,28357,1853,3145,86.0285,30.9991,59.0009,99.8053
785,786,759,954,3017,96.0377,15.408,74.592,99.1014
786,787,544,634,3023,297.1,60.9705,29.0295,99.8631
787,788,5055,1420,3093,79.2921,9.26189,80.7381,99.747
788,789,4900,150,3065,270.243,38.3997,51.6003,99.997
789,790,22318,2920,3109,82.1854,8.68621,81.3138,98.6613
790,791,1554,1586,3051,284.53,76.366,13.634,99.9866
791,792,28554,1646,3113,82.1279,17.421,72.579,99.9113
792,793,839,1909,3055,284.901,72.719,17.281,99.9895
793,794,11299,533,3117,97.5112,23.8977,66.1023,99.9733
794,795,842,1155,3057,95.5005,12.1427,77.8573,99.9951
795,796,16274,2606,3138,267.624,11.2596,78.7404,99.9511
796,797,16376,109,3180,269.142,4.96117,85.0388,99.9493
797,798,11285,2181,3134,260.36400000000003,28.8862,61.1138,99.9764
798,799,10377,314,3134,269.529,32.2306,57.7694,99.9818
799,800,1930,392,3122,82.0052,46.9641,43.0359,99.9831
800,801,1811,415,3095,84.2983,21.6864,68.3136,99.9834
801,802,690,1131,3092,96.6419,16.5537,73.4463,99.9093
802,803,517,1191,3086,73.6008,20.1456,69.8544,99.9958
803,804,3539,1226,3127,272.907,43.4074,46.5926,99.9893
804,805,10406,2747,3128,86.1516,49.5097,40.4903,99.9856
805,806,2189,3183,3119,262.249,48.9464,41.0536,99.9379
806,807,9101,2007,3158,274.509,5.99081,84.0092,99.5054
807,808,2819,1884,3108,51.0023,60.567,29.433000000000003,99.9954
808,809,11207,2479,3207,314.271,76.28,13.72,99.8421
809,810,1977,1278,3132,93.7107,72.5028,17.4972,99.9969
810,811,2868,3150,3161,277.612,50.4076,39.5924,99.9774
811,812,7639,1070,3149,98.1646,11.2626,78.7374,99.9774
812,813,788,455,3128,271.79900000000004,25.9823,64.0177,99.3982
813,814,1611,188,3139,90.3118,31.4211,58.5789,99.9982
814,815,4215,1512,3147,80.7609,5.1493699999999984,84.8506,99.9681
815,816,1091,1930,3144,78.2718,49.1052,40.8948,99.8655
816,817,15100,716,3202,86.6359,37.0366,52.9634,99.9415
817,818,1390,972,3151,101.106,16.8518,73.1482,99.9902
818,819,11415,3082,3198,274.73900000000003,5.23526,84.7647,99.9639
819,820,7374,1203,3209,82.7663,28.5797,61.4203,99.9661
820,821,6564,1393,3196,62.0749,58.1084,31.8916,99.9099
821,822,3303,442,3177,91.3518,7.6627100000000015,82.3373,98.791
822,823,5900,1140,3224,80.5175,49.4202,40.5798,99.9908
823,824,6759,1305,3193,93.8199,21.1871,68.8129,99.9793
824,825,12790,363,3240,89.7693,60.8728,29.1272,99.8952
825,826,534,939,3170,260.483,2.14973,87.8503,99.2678
826,827,2640,1776,3186,278.237,67.48100000000001,22.519,99.965
827,828,3244,988,3204,98.2373,63.4201,26.5799,99.9755
828,829,10084,2939,3225,83.9091,13.7357,76.2643,98.8017
829,830,6019,2694,3213,80.7931,70.2775,19.7225,99.9898
830,831,7316,2759,3248,261.821,30.6264,59.3736,99.9618
831,832,13359,202,3249,251.706,85.8418,4.15817,99.9567
832,833,881,477,3200,98.2463,21.3522,68.6478,99.9939
833,834,3855,1582,3202,78.16199999999998,27.4806,62.5194,99.9622
834,835,11975,2853,3269,261.111,5.565169999999998,84.4348,99.9801
835,836,3633,2239,3214,266.458,10.2497,79.7503,99.981
836,837,4194,57,3255,273.257,4.15026,85.8497,99.8919
837,838,1035,1501,3191,85.0751,16.8333,73.1667,99.9791
838,839,31395,2096,3297,82.2956,12.9526,77.0474,99.9433
839,840,3055,1460,3224,93.9476,68.8002,21.1998,99.8906
840,841,4359,855,3252,261.695,23.9444,66.0556,99.8237
841,842,7213,1693,3242,86.6177,10.2954,79.7046,99.9388
842,843,1343,906,3211,86.9593,38.1528,51.8472,99.988
843,844,2986,1758,3231,263.96,12.7243,77.2757,99.9889
844,845,6314,547,3257,100.901,60.8679,29.1321,99.9865
845,846,3316,1055,3221,53.9318,68.4272,21.5728,99.9944
846,847,1473,489,3238,275.899,26.6923,63.3077,99.9096
847,848,2429,1997,3225,276.086,14.2755,75.7245,99.9851
848,849,835,2192,3229,64.4284,68.705,21.295,99.9956
849,850,2985,637,3239,86.9362,29.2433,60.7567,99.9868
850,851,1232,919,3236,80.0045,44.9433,45.0567,99.9475
851,852,4642,2609,3243,266.73400000000004,6.55502,83.445,99.9743
852,853,4915,3140,3269,85.3821,2.04517,87.9548,99.9869
853,854,767,1346,3238,259.562,8.03474,81.9653,99.9922
854,855,1337,3215,3250,81.5556,28.9865,61.0135,99.7936
855,856,1604,1821,3246,260.44,12.6995,77.3005,99.9873
856,857,644,2541,3237,97.1682,6.872910000000001,83.1271,99.9707
857,858,18234,1576,3297,99.0898,58.078,31.922,99.9477
858,859,6242,2353,3271,263.253,10.2477,79.7523,99.9781
859,860,1611,967,3263,270.14,26.4584,63.5416,99.7806
860,861,1918,2229,3278,269.598,4.11951,85.8805,99.9929
861,862,36656,1360,3334,108.857,70.7107,19.2893,99.9301
862,863,36535,1107,3351,278.636,58.5431,31.4569,99.7739
863,864,12455,467,3327,102.268,64.6564,25.3435,99.8276
864,865,1616,605,3285,89.8234,29.6576,60.3424,99.9974
865,866,850,248,3269,88.9625,38.8902,51.1098,99.9976
866,867,1409,1784,3276,266.624,6.20103,83.79899999999998,99.9931
867,868,3203,1980,3287,72.9899,85.3233,4.67672,99.9811
868,869,869,2657,3274,260.099,22.767,67.233,99.9964
869,870,3327,274,3304,88.4317,39.8841,50.1159,99.9719
870,871,35322,737,3353,87.1944,14.5827,75.4173,99.8899
871,872,10991,1890,3336,79.445,0.952072,89.0479,99.8249
872,873,920,2524,3282,267.791,3.19441,86.8056,99.9899
873,874,1292,801,3282,269.865,41.3471,48.6529,99.9973
874,875,22297,2282,3383,78.2142,10.0398,79.9602,99.9244
875,876,3804,2569,3305,91.2908,45.0492,44.9508,99.9888
876,877,2564,3000,3292,67.83800000000001,82.8941,7.10595,99.9927
877,878,584,2201,3298,60.1065,69.73,20.27,99.9956
878,879,607,1210,3284,85.8822,48.3403,41.6597,99.9845
879,880,25538,2477,3370,95.7934,61.1251,28.8749,99.8108
880,881,3203,3082,3310,91.4137,42.0372,47.9628,99.991
881,882,22971,933,3397,87.2384,47.8023,42.1977,99.5298
882,883,7169,2951,3350,70.8445,84.2667,5.73326,95.0652
883,884,11851,2651,3353,262.317,4.56895,85.4311,99.9651
884,885,9667,1694,3352,98.9866,41.6886,48.3114,99.9687
885,886,7024,2760,3349,260.106,2.68107,87.3189,99.9907
886,887,1140,318,3312,87.4932,23.2151,66.7849,99.9911
887,888,11558,1795,3373,101.483,63.9256,26.0744,99.9715
888,889,3945,2829,3354,78.33800000000002,9.06202,80.938,99.8252
889,890,793,120,3321,275.639,27.1215,62.8785,99.9964
890,891,5234,2192,3375,83.5261,17.7842,72.2158,99.9777
891,892,1876,3057,3347,89.5529,2.37746,87.6225,99.9879
892,893,1864,377,3350,97.2328,53.3316,36.6684,99.9776
893,894,870,251,3350,87.7402,23.8402,66.1598,99.9945
894,895,4579,583,3397,264.207,10.2827,79.7173,99.9405
895,896,1422,3139,3357,283.217,54.785,35.215,99.9787
896,897,5134,204,3371,263.182,5.38165,84.6184,99.997
897,898,1970,298,3367,91.1124,41.8557,48.1443,99.9958
898,899,723,346,3357,89.9349,41.9854,48.0146,99.9916
899,900,5330,121,3396,267.754,6.4511400000000005,83.5489,99.9771
900,901,3146,1533,3393,92.2366,3.97124,86.0288,99.9631
901,902,2666,59,3401,268.626,6.73539,83.2646,99.9277
902,903,31689,438,3478,88.9565,9.08035,80.9197,99.1436
903,904,3640,3080,3395,92.5042,4.24097,85.759,99.9684
904,905,3566,1483,3413,91.3223,22.0069,67.9931,99.9914
905,906,2049,328,3402,101.979,44.6183,45.3817,99.991
906,907,4549,3136,3436,266.791,46.316,43.684,99.9919
907,908,25734,1963,3490,109.032,50.9755,39.0245,99.0861
908,909,5016,529,3424,269.184,26.7257,63.2743,99.9916
909,910,500,2032,3396,93.9549,6.36574,83.6343,99.9546
910,911,2372,1594,3407,277.193,55.0883,34.9117,99.9912
911,912,4616,2707,3430,94.1276,66.1488,23.8511,99.971
912,913,5339,2925,3422,85.5582,19.5648,70.4352,99.1306
913,914,20771,2610,3521,84.7653,74.3236,15.6764,99.332
914,915,5707,3024,3437,84.6911,3.96901,86.031,99.9798
915,916,850,1720,3421,270.087,65.88600000000001,24.114,99.9635
916,917,2061,1885,3434,100.216,64.0525,25.9475,99.9787
917,918,15731,2775,3478,265.37,22.6898,67.3102,99.7769
918,919,14669,188,3480,92.1643,18.3239,71.6761,99.2904
919,920,14004,1387,3486,237.801,72.1213,17.8787,98.9256
920,921,1346,2080,3424,89.3849,2.07807,87.9219,99.8976
921,922,1135,2405,3424,89.4216,37.3511,52.6489,99.9249
922,923,817,2134,3428,80.1062,3.790880000000001,86.2091,99.6401
923,924,22988,1195,3524,92.2183,13.2651,76.7349,99.6202
924,925,1341,1630,3437,267.055,14.2158,75.7842,99.9926
925,926,7278,1788,3486,262.735,18.417,71.583,99.9747
926,927,29373,700,3524,268.328,27.9286,62.0714,99.7968
927,928,8375,818,3473,96.7023,19.9675,70.0325,99.9732
928,929,22166,1686,3536,82.4951,11.6848,78.3152,99.9604
929,930,17907,2352,3515,94.1773,62.6066,27.3934,99.2958
930,931,2164,1523,3460,271.455,11.3567,78.6433,99.9802
931,932,4241,2444,3468,89.0585,23.7481,66.2519,99.1193
932,933,8831,1572,3502,94.3064,34.8764,55.1236,99.6479
933,934,1890,53,3496,275.922,58.5859,31.4141,99.8339
934,935,716,3176,3461,256.313,45.8918,44.1082,99.9598
935,936,15530,2131,3516,268.291,1.0401200000000002,88.9599,99.7401
936,937,23518,1036,3540,102.198,19.291,70.709,99.9219
937,938,13392,3102,3559,272.298,58.7171,31.2829,99.4472
938,939,833,1024,3464,104.31,51.4943,38.5057,99.9938
939,940,637,2067,3459,276.116,30.8386,59.1614,99.993
940,941,979,3209,3480,86.4649,13.3557,76.6443,99.8841
941,942,855,1133,3475,104.971,33.2918,56.7082,99.9904
942,943,8725,2958,3507,272.647,22.8901,67.1099,98.8713
943,944,1088,2523,3494,99.9534,73.3972,16.6028,99.9721
944,945,5909,2844,3516,112.107,66.0655,23.9345,99.7529
945,946,10731,285,3526,266.259,22.1884,67.8116,99.9926
946,947,708,1492,3499,91.9014,20.9181,69.0819,99.9814
947,948,1662,2236,3504,83.8977,15.8837,74.1163,99.991
948,949,1155,3139,3506,97.4368,32.1128,57.8872,99.9823
949,950,2756,3192,3545,87.3811,12.947,77.053,99.7419
950,951,4547,907,3541,280.406,67.7404,22.2596,99.715
951,952,2269,2489,3541,104.903,53.8384,36.1616,99.1543
952,953,9845,2996,3620,284.795,76.6509,13.3491,99.4664
953,954,2771,1444,3566,288.5,71.098,18.902,99.6808
954,955,19086,2318,3657,255.584,38.0339,51.9661,99.9253
955,956,6218,2907,3589,90.1215,34.0232,55.9768,99.6249
956,957,918,1497,3563,92.3526,35.2253,54.7747,99.9821
957,958,1416,99,3570,84.2496,79.3097,10.6903,99.995
958,959,15699,1321,3617,293.295,59.1068,30.8932,99.9432
959,960,2239,490,3574,277.571,17.4716,72.5284,99.9747
960,961,1993,1819,3563,87.0195,32.8396,57.1604,99.9809
961,962,12368,393,3611,82.7771,63.2787,26.7213,99.8296
962,963,1020,2536,3565,64.0811,72.1879,17.8121,99.9534
963,964,1548,58,3582,80.7741,79.6039,10.3961,99.9737
964,965,4588,2745,3595,265.832,36.0839,53.9161,99.9799
965,966,1360,1383,3578,109.666,72.8537,17.1463,99.988
966,967,2307,198,3583,93.437,19.8469,70.1531,99.9967
967,968,91816,1846,3807,263.998,54.0332,35.9668,99.6085
968,969,4817,2395,3592,256.252,2.77431,87.2257,99.8807
969,970,11770,2170,3626,78.4577,31.3573,58.6427,99.9546
970,971,2010,726,3583,88.8322,1.6487,88.3513,99.9938
971,972,7722,178,3633,88.3443,28.2197,61.7803,99.9495
972,973,30073,2848,3698,270.381,11.0255,78.9745,99.7882
973,974,908,1210,3584,91.4549,34.0021,55.9979,99.9901
974,975,23591,581,3667,279.435,19.4824,70.5176,99.9582
975,976,523,1565,3581,88.5329,37.4117,52.5883,99.9035
976,977,29370,782,3690,94.5825,13.6802,76.3198,99.8148
977,978,9711,934,3639,85.4583,19.1755,70.8245,98.9247
978,979,4806,298,3620,266.524,12.897,77.10300000000002,99.9679
979,980,5956,2502,3629,83.2386,2.2103200000000003,87.7897,99.9295
980,981,40516,1162,3724,95.6631,33.5418,56.4582,99.8164
981,982,20481,1733,3674,274.066,63.6225,26.3775,99.904
982,983,3576,2077,3624,86.7739,22.5692,67.4308,99.9923
983,984,2383,1436,3625,87.0164,36.6589,53.3411,99.3165
984,985,765,1526,3609,288.129,61.8259,28.1741,99.9849
985,986,3533,1604,3634,86.3975,57.7809,32.2191,99.9878
986,987,808,2026,3606,273.904,19.0832,70.9168,99.9815
987,988,3489,2670,3631,83.7078,11.9115,78.0885,99.9946
988,989,1424,1238,3625,275.85,51.3899,38.6101,99.9917
989,990,4178,1507,3648,95.1565,40.2395,49.7605,99.9643
990,991,1051,3042,3621,276.568,49.7651,40.2349,99.9936
991,992,4603,3063,3661,92.9473,13.7753,76.2247,99.9762
992,993,5548,57,3689,90.2258,3.90079,86.0992,99.8933
993,994,1417,103,3648,87.8363,3.18263,86.8174,99.993
994,995,1226,2029,3649,273.052,13.6242,76.3758,99.994
995,996,2838,251,3668,95.21,16.3544,73.6456,99.9987
996,997,3556,2592,3669,87.7529,12.4952,77.5048,99.9924
997,998,3997,2734,3690,71.5298,68.3469,21.6531,99.9675
998,999,1922,3198,3697,79.9121,50.4709,39.5291,99.9522
999,1000,809,344,3677,256.722,15.6265,74.3735,99.9764
1000,1001,10891,1449,3724,287.186,54.8443,35.1557,99.4016
1001,1002,34088,2310,3787,271.579,54.5797,35.4203,99.8921
1002,1003,1298,134,3685,83.4227,41.7733,48.2267,99.9957
1003,1004,1136,1038,3679,101.487,14.8752,75.1248,99.9357
1004,1005,50637,2588,3813,82.6769,32.3612,57.6388,99.9456
1005,1006,15781,1577,3739,90.8268,23.6312,66.3688,99.9194
1006,1007,4301,2029,3728,266.483,0.813225,89.1868,99.9062
1007,1008,1214,373,3695,85.1275,21.4584,68.5416,99.9738
1008,1009,2781,2469,3708,264.205,28.2233,61.7767,99.9058
1009,1010,1597,304,3695,270.98900000000003,56.6708,33.3292,99.9952
1010,1011,8941,2110,3731,316.4840000000001,74.5997,15.4003,99.973
1011,1012,3749,3093,3718,270.399,10.6567,79.3433,99.9833
1012,1013,5455,1350,3730,92.9871,39.6961,50.3039,99.9404
1013,1014,12862,431,3757,79.6853,52.5883,37.4117,99.7235
1014,1015,20083,228,3760,280.978,67.5667,22.4333,99.9864
1015,1016,961,982,3703,68.0974,79.8264,10.1736,99.9955
1016,1017,2847,3140,3748,269.698,43.7954,46.2046,99.9856
1017,1018,830,123,3747,87.4465,25.6389,64.3611,99.9926
1018,1019,4876,644,3758,274.748,58.0575,31.9425,99.967
1019,1020,22414,922,3861,86.1521,47.2517,42.7483,88.0904
1020,1021,1161,3034,3723,87.8605,6.60085,83.3992,99.9678
1021,1022,1013,100,3755,88.7793,23.6567,66.3433,99.9857
1022,1023,2343,2967,3750,265.597,6.52032,83.4797,99.9814
1023,1024,977,348,3754,84.5167,20.4032,69.5968,99.9705
1024,1025,905,843,3752,92.3912,16.8864,73.1136,99.9841
1025,1026,4103,1662,3775,92.2867,43.1515,46.8485,99.9872
1026,1027,42648,3026,3876,99.9055,25.4009,64.5991,99.6369
1027,1028,650,320,3761,87.0921,18.6949,71.3051,99.9715
1028,1029,574,2441,3764,85.6268,43.8158,46.1842,99.4429
1029,1030,27419,580,3862,93.1365,35.8452,54.1548,99.6207
1030,1031,26182,2789,3856,98.6892,71.785,18.215,99.9129
1031,1032,784,2715,3765,261.316,24.3017,65.6983,99.9953
1032,1033,5386,45,3820,68.6965,66.7544,23.2456,99.9396
1033,1034,2003,2169,3794,300.98,78.4971,11.5029,99.9899
1034,1035,7387,845,3809,280.978,67.3903,22.6097,99.984
1035,1036,1983,2120,3795,280.55,55.0205,34.9795,99.979
1036,1037,626,1341,3788,269.825,45.2232,44.7768,99.9947
1037,1038,3396,363,3812,72.0106,56.6211,33.3789,99.7372
1038,1039,3081,2015,3818,300.439,78.7762,11.2238,99.9664
1039,1040,3874,1088,3816,288.6620000000001,67.4422,22.5578,99.9756
1040,1041,45323,1505,3941,94.6626,21.3207,68.6793,98.1518
1041,1042,4260,1287,3830,81.773,7.854319999999999,82.1457,99.9734
1042,1043,533,3142,3820,95.4142,26.1439,63.8561,99.9898
1043,1044,8560,730,3854,101.872,40.1129,49.8871,99.965
1044,1045,625,1354,3815,271.84,47.378,42.622,99.9954
1045,1046,843,108,3835,86.8639,44.776,45.224,99.9275
1046,1047,24561,238,3912,94.1595,25.0209,64.9791,99.9652
1047,1048,3840,1541,3855,277.107,48.463,41.537,99.9785
1048,1049,1720,324,3838,93.7085,62.56,27.44,99.9932
1049,1050,8946,2062,3871,261.256,37.9711,52.0289,99.9852
1050,1051,6797,1184,3850,265.357,25.8357,64.1643,99.9723
1051,1052,1858,2157,3849,257.581,72.5432,17.4568,99.9899
1052,1053,1727,810,3855,104.106,77.9123,12.0877,99.9908
1053,1054,2940,1346,3866,264.659,18.9195,71.0805,99.9903
1054,1055,846,1612,3852,89.5582,20.6257,69.3743,99.9891
1055,1056,7067,478,3908,94.6571,83.3809,6.619089999999999,99.9475
1056,1057,1450,3135,3866,241.508,79.6524,10.3476,99.9877
1057,1058,46060,425,4057,91.2593,11.6339,78.3661,99.0564
1058,1059,19516,1096,3925,274.726,40.6538,49.3462,99.9474
1059,1060,4258,2256,3878,292.308,78.7325,11.2675,99.9241
1060,1061,773,3205,3885,136.846,82.1395,7.86045,99.9709
1061,1062,2532,1634,3900,86.28299999999999,19.6667,70.3333,99.802
1062,1063,4412,1976,3933,267.63,3.02831,86.9717,99.8193
1063,1064,12126,78,3954,73.7905,65.3447,24.6553,99.6198
1064,1065,27424,2116,3978,84.4182,61.8628,28.1372,99.5895
1065,1066,35455,1293,3978,88.1281,30.7017,59.2983,99.8079
1066,1067,6810,2313,3920,269.718,56.5364,33.4636,99.9862
1067,1068,675,136,3940,67.2469,67.3917,22.6083,99.9762
1068,1069,7107,2492,3953,93.7946,13.0969,76.9031,99.956
1069,1070,10979,720,4018,96.0745,34.0619,55.9381,99.7746
1070,1071,2308,792,3937,277.219,66.0449,23.9551,99.9879
1071,1072,656,3136,3915,272.166,17.7876,72.2124,99.9878
1072,1073,13941,2752,3953,169.57,84.5327,5.4673,99.9403
1073,1074,15461,2367,3994,261.866,21.0112,68.9888,99.8616
1074,1075,1148,749,3935,100.231,33.4106,56.5894,99.988
1075,1076,7895,935,3972,263.961,69.2894,20.7106,99.5162
1076,1077,1105,158,3965,66.8401,67.2965,22.7035,99.9937
1077,1078,1634,745,3967,103.682,41.5134,48.4866,99.9752
1078,1079,18208,2880,4027,271.566,64.7172,25.2828,98.909
1079,1080,972,460,3972,275.363,28.235,61.765,99.9941
1080,1081,2397,1914,3982,258.907,11.9571,78.0429,99.6322
1081,1082,17392,1661,4056,81.8042,20.2503,69.7497,99.9062
1082,1083,21841,2627,4051,97.2589,25.8071,64.1929,99.8126
1083,1084,3864,561,4023,107.341,52.32899999999999,37.671,99.3878
1084,1085,966,841,3999,255.254,29.3056,60.6944,99.8335
1085,1086,1928,797,4011,94.7417,41.8774,48.1226,99.6348
1086,1087,5108,2227,4019,261.925,3.42607,86.5739,99.9129
1087,1088,3335,3009,4020,94.7401,7.14633,82.8537,99.9831
1088,1089,539,346,3997,264.773,6.28918,83.7108,99.9737
1089,1090,39340,998,4108,84.1955,34.8872,55.1128,99.6996
1090,1091,10069,1974,4045,71.255,84.3903,5.6097199999999985,98.582
1091,1092,4791,621,4032,271.914,16.9557,73.0443,99.9851
1092,1093,10858,3072,4056,112.886,31.0288,58.9712,99.9345
1093,1094,6175,151,4078,258.43,74.9063,15.0937,99.7534
1094,1095,1554,522,4023,282.497,63.8807,26.1193,99.4385
1095,1096,13259,266,4051,262.94,21.1449,68.8551,99.9935
1096,1097,7968,1472,4066,298.387,82.1138,7.886239999999999,99.5521
1097,1098,11421,1835,4061,89.3659,50.1617,39.8383,99.8018
1098,1099,10583,1162,4070,309.008,70.2474,19.7526,99.6092
1099,1100,11214,59,4109,9.89252,83.5206,6.47938,99.8888
1100,1101,14005,2456,4100,90.204,32.8918,57.1082,99.396
1101,1102,2369,192,4073,263.215,21.0757,68.9243,99.9965
1102,1103,8644,835,4086,266.30400000000003,13.8544,76.1456,99.9789
1103,1104,32245,709,4204,83.7567,37.0207,52.9793,99.8847
1104,1105,6130,2760,4099,47.1286,82.3708,7.62918,99.9694
1105,1106,2085,3157,4092,87.4116,4.86083,85.1392,99.8501
1106,1107,581,3115,4085,94.027,4.01265,85.9874,99.9795
1107,1108,73687,2042,4221,91.9942,32.5013,57.4987,99.642
1108,1109,14712,2317,4121,266.828,40.4163,49.5837,99.9689
1109,1110,12074,1732,4141,273.407,54.9426,35.0574,99.9715
1110,1111,6672,1438,4114,91.2032,16.3456,73.6544,99.0551
1111,1112,9250,315,4145,270.773,20.7582,69.2418,99.983
1112,1113,95712,2927,4320,87.1434,10.2892,79.7108,99.3057
1113,1114,11679,571,4135,275.392,10.3186,79.6814,99.9526
1114,1115,2687,1273,4105,78.9861,9.00742,80.9926,99.9847
1115,1116,1034,2555,4094,349.577,81.4654,8.53464,99.9881
1116,1117,1089,1218,4093,54.6996,65.4624,24.5376,99.9953
1117,1118,2373,1321,4127,306.455,83.4326,6.5674,99.9893
1118,1119,18693,1211,4211,63.7427,67.2426,22.7574,99.9063
1119,1120,8405,3074,4184,93.6071,13.4804,76.5196,99.9618
1120,1121,1254,1367,4136,68.0087,67.4033,22.5967,99.9937
1121,1122,6090,2525,4165,267.808,22.176,67.824,99.9739
1122,1123,7809,2718,4169,338.3780000000001,81.5128,8.48723,99.9476
1123,1124,588,245,4132,289.48,74.1071,15.8929,99.9943
1124,1125,1677,3147,4151,86.0664,12.6023,77.3977,99.9542
1125,1126,50844,1419,4323,102.835,87.9771,2.0228900000000003,34.6298
1126,1127,53156,840,4321,267.356,9.35261,80.6474,99.6843
1127,1128,10103,165,4197,260.408,64.3183,25.6817,99.9677
1128,1129,20306,1590,4225,273.454,23.1165,66.8835,99.9542
1129,1130,4022,2207,4180,257.901,51.8337,38.1663,99.9902
1130,1131,678,1094,4166,277.335,31.7109,58.2891,99.9868
1131,1132,537,1626,4161,283.869,71.0854,18.9146,99.9988
1132,1133,4066,2402,4206,329.349,80.2359,9.76406,99.9889
1133,1134,12832,384,4248,92.3684,13.4882,76.5118,99.6369
1134,1135,4110,2284,4217,77.1893,59.3864,30.6136,99.9842
1135,1136,7327,1845,4228,261.965,44.9508,45.0492,99.9862
1136,1137,5487,1743,4221,92.2356,9.84168,80.1583,99.9611
1137,1138,8401,2603,4226,334.54,78.3047,11.6953,99.9439
1138,1139,1032,288,4210,91.4786,11.8675,78.1325,99.9516
1139,1140,13029,1097,4305,267.682,26.5727,63.4273,99.8592
1140,1141,2238,3173,4221,96.975,24.8888,65.1112,99.9283
1141,1142,1073,1322,4216,258.966,83.68700000000003,6.313,99.9926
1142,1143,3336,2343,4238,282.127,71.9347,18.0653,99.9681
1143,1144,1021,636,4231,83.4963,37.1907,52.8093,99.977
1144,1145,1415,2238,4234,85.6448,74.4308,15.5692,99.9958
1145,1146,2475,567,4233,95.8654,24.9453,65.0547,99.9923
1146,1147,2365,2688,4236,264.847,14.9794,75.0206,99.9681
1147,1148,1025,244,4238,271.80400000000003,19.2592,70.7408,99.9973
1148,1149,751,2755,4231,269.41700000000003,62.5611,27.4389,99.9934
1149,1150,601,2801,4224,310.567,83.4906,6.50936,99.9836
1150,1151,35498,2500,4323,77.0118,20.4491,69.5509,99.7483
1151,1152,1373,56,4251,250.541,64.5162,25.4838,99.9375
1152,1153,23171,1724,4337,274.35200000000003,48.9366,41.0634,99.981
1153,1154,610,289,4245,270.747,19.4131,70.5869,99.9963
1154,1155,16606,556,4306,87.0843,25.8151,64.1849,99.948
1155,1156,1652,3189,4264,97.2011,26.8625,63.1375,99.9312
1156,1157,26120,2742,4333,274.318,63.7676,26.2324,99.8655
1157,1158,2648,119,4273,87.6671,9.2108,80.7892,99.9929
1158,1159,9184,3079,4382,97.1012,12.9622,77.0378,99.9531
1159,1160,1396,1023,4271,75.0132,68.0435,21.9565,99.9967
1160,1161,712,3116,4293,92.8524,13.8262,76.1738,99.9028
1161,1162,13083,2325,4330,295.411,65.773,24.227,99.9744
1162,1163,778,175,4266,269.361,26.6756,63.3244,99.9987
1163,1164,9511,225,4326,273.818,13.4882,76.5118,99.9861
1164,1165,35100,387,4386,262.974,45.1401,44.8599,99.9022
1165,1166,20146,1205,4345,267.22,33.0216,56.9784,99.9572
1166,1167,1827,2234,4293,93.0443,19.6409,70.3591,99.9908
1167,1168,4076,1525,4317,96.7909,18.7622,71.2378,99.9879
1168,1169,18593,994,4370,94.3376,26.2824,63.7176,99.9242
1169,1170,1959,58,4314,104.903,85.96700000000001,4.03296,99.9336
1170,1171,1694,1633,4319,96.2889,17.0296,72.9704,99.9796
1171,1172,3300,872,4334,270.69,13.8498,76.1502,99.9838
1172,1173,5515,150,4352,259.465,0.783745,89.2163,99.9935
1173,1174,33620,1964,4400,82.9921,44.9152,45.0848,99.7926
1174,1175,10780,77,4412,262.205,0.871605,89.1284,99.9233
1175,1176,982,3109,4352,90.0501,16.3009,73.6991,99.841
1176,1177,1689,1385,4337,86.5346,14.3933,75.6067,99.9924
1177,1178,1304,2628,4348,86.69,35.5068,54.4932,99.9834
1178,1179,1503,3197,4370,262.873,65.9996,24.0003,99.8978
1179,1180,1962,3119,4392,92.2494,12.9534,77.0466,99.9801
1180,1181,4955,611,4384,214.478,85.4001,4.59985,99.9949
1181,1182,3717,1812,4377,115.64,78.6771,11.3229,99.9935
1182,1183,824,1332,4358,260.695,33.197,56.803,99.9974
1183,1184,521,3161,4368,94.554,15.586,74.414,99.9684
1184,1185,2986,2241,4393,88.8837,43.3384,46.6616,99.9924
1185,1186,1021,1612,4384,260.269,73.5555,16.4445,99.958
1186,1187,2389,671,4395,96.6262,27.842,62.158,99.9625
1187,1188,5861,2180,4414,264.633,49.9994,40.0006,99.9842
1188,1189,658,1350,4374,247.305,71.7702,18.2298,99.9914
1189,1190,6669,1255,4443,81.3986,27.5241,62.4759,99.9707
1190,1191,9894,2398,4425,81.8525,35.2502,54.7498,99.6912
1191,1192,3154,189,4422,265.596,11.1911,78.8089,99.9891
1192,1193,3205,2569,4414,253.526,65.8086,24.1914,99.9945
1193,1194,4465,2713,4451,83.4187,36.1108,53.8892,99.9606
1194,1195,21572,543,4488,95.9395,30.7523,59.2477,58.7711
1195,1196,7300,1458,4463,91.3549,16.8008,73.1992,99.6588
1196,1197,7864,2272,4468,291.235,75.1479,14.8521,99.9819
1197,1198,4397,1797,4455,90.554,14.9247,75.0753,99.9662
1198,1199,3319,284,4471,262.057,44.8152,45.1848,99.9852
1199,1200,630,3199,4447,237.485,65.1093,24.8907,99.8717
1200,1201,15983,838,4500,92.1953,12.5613,77.4387,85.6354
1201,1202,13342,1120,4468,88.5807,6.98727,83.0127,99.9579
1202,1203,5688,1613,4467,78.9421,82.9777,7.02233,99.9642
1203,1204,4511,1851,4474,78.9691,17.4971,72.5029,99.9928
1204,1205,1275,1750,4445,38.8557,80.0098,9.99021,99.9874
1205,1206,765,1552,4442,100.077,84.2388,5.76116,99.9946
1206,1207,1455,535,4454,91.7977,14.0596,75.9404,99.9934
1207,1208,3233,2601,4463,110.647,60.0336,29.9664,99.993
1208,1209,1040,1671,4443,92.9872,54.1989,35.8011,99.9967
1209,1210,526,981,4461,90.9473,21.231,68.76899999999999,99.9923
1210,1211,2177,3129,4491,89.5115,10.1102,79.8898,99.1154
1211,1212,31962,166,4538,265.67,20.4358,69.5642,93.6621
1212,1213,1503,1309,4478,251.18400000000003,72.0537,17.9463,99.9909
1213,1214,22186,2591,4536,262.553,0.531227,89.4688,53.4597
1214,1215,2307,2658,4486,84.3494,19.2737,70.7263,99.993
1215,1216,953,1701,4473,89.8054,32.6942,57.3058,99.8649
1216,1217,14317,2404,4523,264.504,58.0625,31.9375,99.727
1217,1218,8936,1987,4547,87.6613,44.4918,45.5082,99.3075
1218,1219,870,1736,4509,87.1641,81.3804,8.6196,99.9956
1219,1220,14286,2182,4590,92.2753,28.1704,61.8296,99.4413
1220,1221,4454,1639,4513,79.3996,82.3242,7.67577,99.8312
1221,1222,866,2630,4515,73.6862,14.9383,75.0617,99.9802
1222,1223,1709,1860,4522,83.8484,19.8995,70.1005,99.8426
1223,1224,16438,1241,4586,75.2747,4.58894,85.4111,99.7779
1224,1225,8199,1104,4547,86.2963,6.89017,83.1098,99.9824
1225,1226,4208,2091,4581,84.3341,9.76431,80.2357,99.8526
1226,1227,12335,2900,4562,81.9665,11.9174,78.0826,99.7863
1227,1228,1472,364,4542,81.6247,79.7289,10.2711,99.9632
1228,1229,14889,1842,4609,260.336,9.48841,80.5116,99.6639
1229,1230,9412,1370,4603,84.421,4.56494,85.4351,99.4712
1230,1231,656,3050,4537,103.549,70.012,19.988,99.9884
1231,1232,1435,1496,4553,88.7369,5.4660199999999985,84.53399999999998,99.9757
1232,1233,6017,1612,4550,38.3314,78.827,11.173,99.9084
1233,1234,1696,1436,4549,85.8494,21.4339,68.5661,99.9124
1234,1235,5980,2301,4580,80.6454,35.4018,54.5982,99.8782
1235,1236,972,3163,4563,87.2384,8.31405,81.686,99.9523
1236,1237,4064,1972,4615,85.9654,16.0274,73.9726,99.79
1237,1238,616,416,4550,92.7686,78.5783,11.4217,99.983
1238,1239,14395,1659,4609,47.8118,77.6064,12.3936,99.8741
1239,1240,791,783,4547,90.4795,2.68934,87.3107,99.9927
1240,1241,11583,798,4587,91.2283,3.49166,86.5083,99.6986
1241,1242,771,956,4555,92.5439,3.23902,86.76100000000002,99.9967
1242,1243,573,2378,4563,80.9751,34.8218,55.1782,99.9694
1243,1244,10617,2853,4621,79.4075,3.83123,86.1688,99.2591
1244,1245,2224,566,4567,97.7946,8.84033,81.1597,99.9438
1245,1246,23400,465,4616,268.808,30.4424,59.5576,98.6841
1246,1247,4785,299,4603,259.911,77.3454,12.6546,99.9179
1247,1248,1533,2668,4577,301.481,70.4271,19.5729,99.8621
1248,1249,2643,3047,4587,79.3979,69.1182,20.8818,99.9618
1249,1250,982,1425,4580,90.2956,21.8024,68.1976,99.0566
1250,1251,1782,69,4586,265.44,23.3955,66.6045,99.9784
1251,1252,1213,1047,4579,258.35400000000004,28.8619,61.1381,99.994
1252,1253,1118,641,4591,89.831,18.0842,71.9158,99.9808
1253,1254,919,1123,4592,89.4849,6.92375,83.0762,99.9684
1254,1255,7584,966,4621,290.398,78.9479,11.0521,99.6766
1255,1256,688,675,4598,82.7616,18.9845,71.0155,99.9783
1256,1257,1464,1493,4626,94.2728,5.31901,84.681,99.944
1257,1258,1082,1528,4604,90.625,5.48923,84.5108,99.9871
1258,1259,607,3144,4611,266.639,19.8363,70.1637,99.9829
1259,1260,1119,3081,4623,255.091,81.8835,8.116530000000001,99.9733
1260,1261,2879,1090,4629,290.333,77.2505,12.7495,99.972
1261,1262,4681,2325,4638,84.5757,31.8834,58.1166,99.9137
1262,1263,2407,2708,4625,329.598,88.6244,1.37558,99.8457
1263,1264,4567,112,4658,86.2906,5.3902,84.6098,99.7314
1264,1265,5350,2580,4651,264.469,1.03966,88.9603,99.9348
1265,1266,536,33,4622,293.884,77.2418,12.7582,99.9704
1266,1267,528,651,4628,98.7196,9.75739,80.2426,99.9347
1267,1268,1842,2464,4639,268.242,59.3199,30.6801,99.8904
1268,1269,1240,3174,4648,266.126,20.1872,69.8128,99.9823
1269,1270,2089,681,4668,274.756,29.7022,60.2978,99.6482
1270,1271,1637,2080,4642,83.3999,5.93044,84.0696,99.9609
1271,1272,1199,2241,4651,95.7502,32.6088,57.3912,99.9367
1272,1273,1756,2679,4655,188.124,87.3504,2.6495900000000003,99.8191
1273,1274,2085,2992,4672,91.0897,0.6385270000000001,89.3615,99.8373
1274,1275,1296,1797,4656,264.589,6.64763,83.3524,99.8883
1275,1276,720,1981,4670,265.563,10.4763,79.5237,99.9289
1276,1277,567,174,4671,278.84,9.30475,80.6953,99.4863
1277,1278,546,3132,4668,276.944,22.1715,67.8285,99.8808
1278,1279,720,288,4681,240.862,27.4295,62.5705,99.9866
1279,1280,517,332,4687,294.571,33.1741,56.8259,99.9791
1280,1281,536,538,4676,324.574,13.7813,76.2187,97.4157
1281,1282,601,598,4689,9.63118,2.20671,87.7933,99.9499
1282,1283,544,497,4690,199.552,9.02484,80.9752,99.194
