,Grain No.,Size [Pixel],center x-coordinate,center y-coordinate,mean azimuth [degree],mean latitude [degree],mean colatitude [degree],Regelungsgrad [%]
0,1,16696,875,306,159.22,40.6035,49.3965,99.9485
1,2,17265,249,341,14.6031,84.3305,5.6695,99.9822
2,3,120467,1132,436,165.145,49.7573,40.2427,62.6424
3,4,9668,453,317,13.0429,83.9432,6.056780000000002,99.9452
4,5,8980,705,325,347.88699999999994,23.0898,66.9102,99.9669
5,6,31080,1497,355,348.449,13.9643,76.0357,99.8737
6,7,5032,628,350,26.8066,86.6469,3.35313,99.993
7,8,7281,1887,307,156.49200000000005,77.0846,12.9154,99.8758
8,9,160511,1687,576,166.872,19.2583,70.7417,56.3577
9,10,20886,2295,337,171.463,34.4705,55.5295,99.8302
10,11,791,2504,303,154.121,22.4808,67.5192,99.6898
11,12,1575,2049,312,350.218,32.0144,57.9856,99.7945
12,13,10377,3027,364,336.316,33.217,56.783,99.6191
13,14,543,3006,312,16.4427,35.8739,54.1261,99.3362
14,15,26325,2489,400,175.899,2.1611,87.8389,99.8731
15,16,23385,2672,384,342.839,28.3666,61.6334,99.8471
16,17,38374,2065,465,221.272,79.4715,10.5285,99.5079
17,18,26608,2838,407,348.584,7.02111,82.9789,99.8134
18,19,1286,3312,324,346.246,39.4898,50.5102,99.0107
19,20,172178,418,582,159.063,42.2204,47.7796,88.8759
20,21,765,2777,333,133.085,85.1439,4.85607,99.9434
21,22,534,3336,336,149.64,32.1157,57.8843,99.932
22,23,1183,1332,361,155.293,67.5226,22.4774,99.9383
23,24,677,2018,338,178.65200000000004,7.20441,82.7956,99.9956
24,25,5095,3152,358,229.505,81.1495,8.85047,99.9922
25,26,4280,3229,372,347.217,54.7075,35.2925,99.9478
26,27,1352,124,355,159.221,30.9129,59.0871,99.9699
27,28,10876,793,393,347.745,72.9128,17.0872,99.9769
28,29,1346,3309,380,3.7212,85.7673,4.23267,99.9581
29,30,5505,895,394,162.907,0.877281,89.1227,99.951
30,31,9710,2243,427,342.161,32.5687,57.4313,99.865
31,32,3268,157,410,351.771,34.1915,55.8085,99.8978
32,33,7726,1585,423,172.206,10.3741,79.6259,99.9695
33,34,977,2836,401,149.819,38.9581,51.0419,99.9105
34,35,628,712,397,163.363,2.05265,87.9473,99.9579
35,36,594,692,398,169.35,1.63801,88.36200000000002,99.9959
36,37,14963,3142,459,177.21599999999995,0.5158689999999999,89.4841,99.9306
37,38,660,3310,417,1.2933,72.7466,17.2534,99.9431
38,39,676,3327,434,284.53,32.1683,57.8317,98.4172
39,40,3103,2357,438,176.294,75.7684,14.2316,99.9792
40,41,12353,2942,478,357.712,1.56019,88.4398,100.004
41,42,13072,3193,542,4.07411,76.4469,13.5531,99.9212
42,43,895,3268,448,3.72778,77.0626,12.9374,99.9859
43,44,1425,2833,451,155.056,37.682,52.31800000000001,99.9776
44,45,4177,233,467,172.39,9.61647,80.3835,99.9828
45,46,8394,1363,486,173.42,8.36824,81.6318,98.0591
46,47,6519,2152,483,358.3930000000001,4.98364,85.0164,99.9901
47,48,513,1492,450,158.749,67.9161,22.0839,99.8726
48,49,1005,297,463,344.245,62.0804,27.9196,99.9693
49,50,2594,836,484,347.852,59.3513,30.6486,99.4407
50,51,2424,2596,479,358.173,0.0342102,89.9658,99.9783
51,52,5723,161,524,352.6230000000001,71.2469,18.7531,99.5132
52,53,7083,2308,528,172.766,0.94516,89.0548,99.781
53,54,702,2702,473,359.644,5.02302,84.977,99.992
54,55,8955,2843,534,319.128,87.1912,2.80882,99.7159
55,56,6225,2227,515,169.532,77.6772,12.3228,99.4252
56,57,24026,2601,568,159.618,37.3162,52.6838,99.955
57,58,1875,3272,517,350.89,26.6868,63.3132,99.8813
58,59,4271,1403,539,143.142,74.8722,15.1278,99.0945
59,60,556,2454,505,355.741,3.54031,86.4597,99.9893
60,61,1898,3051,514,4.03694,78.3718,11.6282,99.9932
61,62,23086,3035,618,162.733,41.4284,48.5716,91.4815
62,63,515,3317,505,359.38199999999995,31.5583,58.4417,99.6871
63,64,1090,2373,534,343.969,7.075360000000001,82.9246,98.1728
64,65,1227,2044,525,174.93099999999995,62.4088,27.5912,99.9053
65,66,646,2438,530,174.31400000000005,0.08480069999999999,89.9152,99.6838
66,67,22034,2761,613,329.51199999999994,76.1609,13.8391,99.9255
67,68,1177,852,566,347.2530000000001,61.5303,28.4697,99.6925
68,69,12663,2026,621,234.859,87.0199,2.98006,99.9707
69,70,1065,2468,562,112.415,80.6758,9.32415,99.9889
70,71,39190,2329,648,163.664,35.3803,54.6197,99.9781
71,72,67986,1111,680,172.855,8.616710000000001,81.3833,99.8759
72,73,545,2332,580,169.803,0.7497560000000001,89.2502,99.976
73,74,1793,624,575,337.819,52.5531,37.4469,99.9925
74,75,521,2933,577,178.0,1.6149,88.3851,99.9995
75,76,3843,3265,636,349.552,23.9236,66.0764,99.9607
76,77,3043,734,593,345.543,56.1866,33.8134,99.9877
77,78,1371,795,592,168.27700000000004,5.63019,84.3698,99.993
78,79,1089,1517,596,157.06,73.6726,16.3274,99.9926
79,80,31591,1920,711,10.5905,75.4536,14.5464,99.9622
80,81,6984,2883,649,162.514,34.5565,55.4435,99.9121
81,82,756,1397,601,148.058,72.2832,17.7168,99.9823
82,83,696,3232,613,351.1380000000001,22.6118,67.3882,99.9924
83,84,1931,146,636,152.475,34.8401,55.1599,99.9509
84,85,917,1244,612,341.11300000000006,20.8954,69.1046,99.8954
85,86,6316,2516,651,154.681,35.9927,54.0073,99.9814
86,87,5485,1442,637,168.396,5.74041,84.2596,99.9838
87,88,1729,1847,613,279.393,85.9318,4.06818,99.9738
88,89,661,855,621,165.612,23.4197,66.5803,99.6481
89,90,1158,1627,653,227.02,80.0105,9.98955,99.9031
90,91,27771,708,682,34.4307,73.2506,16.7494,99.9185
91,92,362876,2918,1010,350.556,35.7812,54.2188,89.8319
92,93,764,1762,632,217.311,88.5254,1.47459,99.9853
93,94,1861,2944,650,339.606,85.3258,4.67424,99.9945
94,95,768,1805,634,340.45,9.1255,80.8745,99.9962
95,96,4051,532,679,170.41099999999997,9.71486,80.2851,99.9947
96,97,13024,1525,683,339.776,13.617,76.383,99.958
97,98,1163,1837,658,349.996,8.6304,81.3696,99.9588
98,99,967,1790,675,161.235,1.7966799999999998,88.2033,99.975
99,100,2507,2634,682,351.18300000000005,75.3846,14.6154,99.9243
100,101,7926,2110,704,12.8889,75.0296,14.9704,99.9885
101,102,2592,2705,691,345.108,23.2072,66.7928,99.9925
102,103,16898,429,744,347.7630000000001,30.2053,59.7947,99.969
103,104,55159,2545,810,166.917,79.045,10.955,95.2096
104,105,8192,2928,728,151.636,82.4954,7.50462,99.9943
105,106,5853,2195,750,161.641,15.357,74.643,99.9845
106,107,678,3267,713,352.032,34.1643,55.8357,99.8125
107,108,553,897,707,28.2736,73.8387,16.1613,99.9928
108,109,26897,1286,797,349.415,18.3158,71.6842,99.879
109,110,16916,2316,775,160.38,50.56,39.44,99.959
110,111,3544,1598,747,171.56799999999996,0.343742,89.6563,99.9879
111,112,66399,822,842,166.386,59.8503,30.1497,99.8771
112,113,3166,917,753,351.56699999999995,74.5105,15.4895,99.9874
113,114,1919,1771,755,349.021,1.7896,88.2104,99.985
114,115,1591,854,766,340.712,20.809,69.191,99.9963
115,116,2146,1689,760,352.14,2.1819,87.8181,99.9841
116,117,4321,2103,779,168.38,44.5586,45.4414,99.9416
117,118,677,798,756,341.835,16.0128,73.9872,99.9864
118,119,11392,2041,829,343.463,35.5581,54.4419,99.9911
119,120,1097,1733,782,353.446,41.3858,48.6142,99.9953
120,121,543,537,777,343.33,43.9041,46.0959,99.5167
121,122,2077,158,804,172.918,60.5779,29.4221,99.8736
122,123,2417,1841,801,349.242,41.8022,48.1978,99.9925
123,124,16851,2376,876,159.596,46.1423,43.8577,99.9961
124,125,756,1700,795,348.959,38.201,51.799,99.9931
125,126,15049,1785,877,189.843,70.6002,19.3998,99.9724
126,127,3444,455,825,176.94099999999997,63.3154,26.6846,99.9244
127,128,2266,829,832,342.789,68.6193,21.3807,99.994
128,129,15378,2723,866,343.832,18.8414,71.1586,99.957
129,130,3190,2178,838,344.74,35.8483,54.1517,99.999
130,131,6079,1682,870,176.405,3.41656,86.5834,99.9954
131,132,21622,1356,901,162.172,56.2493,33.7507,99.9746
132,133,25852,1998,897,161.062,37.7235,52.2765,99.909
133,134,2599,151,855,351.662,23.0937,66.9063,99.978
134,135,14527,575,921,168.76,58.8821,31.1179,99.5566
135,136,514,585,836,167.762,70.79899999999998,19.201,99.9537
136,137,1977,2132,853,168.38099999999997,47.9308,42.0692,99.8606
137,138,4521,484,872,164.628,11.2575,78.7425,99.9802
138,139,593,202,853,332.13,44.1485,45.8515,99.9355
139,140,1220,2226,871,11.2738,77.3167,12.6833,99.9921
140,141,5237,1172,895,336.3590000000001,43.6192,46.3808,99.6381
141,142,5814,664,936,181.232,62.3027,27.6973,99.9859
142,143,793,687,872,337.853,66.4158,23.5842,99.9916
143,144,2219,2297,902,165.15,52.8111,37.1889,99.9929
144,145,112137,490,1062,347.96,80.4136,9.58641,87.5402
145,146,438003,2010,1399,345.146,8.805769999999997,81.1942,66.1071
146,147,16042,180,958,344.19,48.2798,41.7202,99.9835
147,148,42223,1075,981,351.941,42.8029,47.1971,62.1166
148,149,15942,1453,970,158.46,48.4677,41.5323,99.9478
149,150,1017,1153,929,348.667,14.7716,75.2284,99.9793
150,151,1053,1728,937,343.435,14.9857,75.0143,99.9779
151,152,4871,1676,966,181.063,66.118,23.882,99.9733
152,153,9006,1907,970,167.65200000000004,61.6487,28.3513,99.9558
153,154,606,1749,960,180.02700000000004,59.6058,30.3942,99.9904
154,155,5730,1601,997,348.282,50.0048,39.9952,99.9244
155,156,3697,1789,992,350.446,6.26472,83.7353,99.9821
156,157,12995,673,1039,158.856,8.285839999999999,81.7142,99.9634
157,158,28393,1281,1119,338.52,42.9434,47.0566,99.9127
158,159,5756,912,1043,4.05382,67.96,22.04,99.8352
159,160,28271,1511,1170,167.884,28.0284,61.9716,49.1073
160,161,2024,1698,1041,159.863,74.207,15.793,99.4103
161,162,634,1627,1033,172.67700000000005,73.0555,16.9445,99.3874
162,163,6376,1618,1087,348.5630000000001,25.821,64.179,99.993
163,164,4691,1170,1087,3.04355,63.3187,26.6813,99.9948
164,165,1438,2391,1062,156.774,58.1267,31.8733,99.9947
165,166,4525,160,1117,142.91899999999995,82.3317,7.66828,99.9636
166,167,13599,1056,1106,350.816,71.9681,18.0319,99.9615
167,168,6378,1417,1104,162.819,37.1325,52.8675,99.9943
168,169,4752,2439,1114,139.283,76.6105,13.3895,99.9805
169,170,602,3310,1079,175.58599999999996,31.1085,58.8915,99.449
170,171,264322,1151,1417,348.509,11.2423,78.7577,76.0671
171,172,13348,2360,1148,341.6690000000001,44.2215,45.7785,99.9971
172,173,510,78,1109,157.957,79.5153,10.4847,99.9486
173,174,720,209,1137,166.553,74.3907,15.6093,99.8632
174,175,44265,486,1279,168.634,4.40186,85.5981,94.6234
175,176,830,1575,1147,165.53,67.4391,22.5609,99.9786
176,177,2287,2822,1170,154.61700000000005,36.6049,53.3951,99.9956
177,178,13277,1407,1211,5.17938,75.803,14.197,99.9537
178,179,1369,1603,1171,165.362,73.6572,16.3428,99.9785
179,180,7001,1145,1199,338.923,64.4059,25.5941,99.861
180,181,857,90,1166,184.665,29.1332,60.8668,99.9127
181,182,20509,218,1272,342.542,19.8709,70.1291,99.0725
182,183,19140,2293,1248,344.027,37.9369,52.0631,99.9962
183,184,4898,293,1223,166.735,15.1545,74.8455,99.1366
184,185,18276,3158,1253,354.759,7.81915,82.1809,99.9687
185,186,5472,563,1221,351.406,9.44151,80.5585,99.9959
186,187,892,1609,1205,166.949,68.0204,21.9796,99.5236
187,188,14328,2484,1262,152.07399999999996,58.5794,31.4206,99.8949
188,189,14371,677,1270,350.469,33.9914,56.0086,99.9964
189,190,1460,345,1238,349.838,69.4252,20.5748,99.9488
190,191,732,3303,1232,7.2267199999999985,35.2843,54.7157,99.7562
191,192,7084,2647,1254,154.63,60.4368,29.5632,99.9326
192,193,4813,1609,1267,173.248,5.89422,84.1058,99.9855
193,194,19216,2201,1348,157.672,60.5331,29.4669,99.9585
194,195,5041,802,1269,168.56400000000005,37.6244,52.3756,99.9982
195,196,591,3246,1294,352.415,10.7754,79.2246,99.9625
196,197,10029,2730,1348,357.585,5.02208,84.9779,99.9392
197,198,1965,342,1293,170.937,68.6821,21.3179,99.9873
198,199,118512,745,1549,345.0490000000001,65.0219,24.9781,99.6835
199,200,4149,2673,1341,358.971,9.68884,80.3112,99.9741
200,201,23919,1681,1436,354.497,4.679880000000002,85.3201,99.8311
201,202,68711,2489,1435,170.933,66.9609,23.0391,99.6967
202,203,2273,3063,1324,154.50799999999995,39.3535,50.6465,99.9745
203,204,14989,171,1410,340.196,77.4948,12.5052,99.6399
204,205,657,85,1311,352.625,75.5413,14.4587,99.8383
205,206,742,3093,1321,154.15200000000004,38.8388,51.1612,99.9869
206,207,10790,3156,1375,354.255,12.4113,77.5887,99.99
207,208,4311,1551,1347,349.082,12.5366,77.4634,99.9142
208,209,5058,352,1345,168.93900000000005,31.1465,58.8535,99.9969
209,210,2649,2522,1346,347.21,21.0934,68.9066,99.9827
210,211,3716,664,1357,157.49200000000005,47.2705,42.7295,99.9943
211,212,775,2796,1365,347.86,56.5198,33.4802,99.4475
212,213,210489,384,1651,331.539,49.5895,40.4105,99.9057
213,214,4854,3038,1399,343.449,51.3274,38.6726,99.9921
214,215,3363,3251,1424,352.261,10.402,79.598,99.9375
215,216,1436,2838,1381,355.996,4.74931,85.2507,99.9958
216,217,12369,1562,1437,179.38099999999997,1.62019,88.3798,99.8513
217,218,31148,2950,1469,170.28,62.0175,27.9825,98.7885
218,219,583,1610,1380,174.055,4.9726599999999985,85.0273,99.9911
219,220,2047,3212,1439,353.957,9.93879,80.0612,99.9901
220,221,8513,2793,1455,352.444,12.9173,77.0827,99.9893
221,222,13383,2261,1466,163.05100000000004,58.8293,31.1707,99.9948
222,223,1217,857,1422,167.05200000000005,36.3449,53.6551,99.9765
223,224,14929,3125,1503,183.876,74.9209,15.0791,99.9379
224,225,13612,2671,1511,177.69099999999997,7.75143,82.2486,99.9272
225,226,923,2168,1462,192.86,81.4823,8.51774,99.8597
226,227,37674,1558,1598,157.57,61.1618,28.8382,99.8733
227,228,2053,2344,1495,167.722,13.5982,76.4018,99.954
228,229,6656,3211,1549,351.222,11.5223,78.4777,98.4022
229,230,81823,2424,1720,163.954,75.1195,14.8805,87.9801
230,231,248679,2945,1897,314.538,82.6371,7.362889999999998,53.2919
231,232,596,1821,1540,173.03400000000005,5.82295,84.177,99.896
232,233,8377,1774,1583,151.567,63.3167,26.6833,99.9659
233,234,30136,1813,1670,176.08,2.04798,87.95200000000001,99.9316
234,235,6337,3120,1637,190.819,74.6869,15.3131,99.9142
235,236,795,98,1621,344.122,28.5758,61.4242,99.9173
236,237,1491,3174,1618,193.675,77.917,12.083,99.7191
237,238,14468,1013,1677,164.158,39.6713,50.3287,99.9821
238,239,504,3215,1636,59.6183,71.1197,18.8803,99.9308
239,240,646,3237,1661,63.4164,71.487,18.513,99.9738
240,241,28368,1534,1741,175.19400000000005,52.3158,37.6842,99.9817
241,242,3744,3078,1694,174.391,24.2461,65.7539,99.9937
242,243,22832,3153,1776,161.567,18.8564,71.1436,99.9373
243,244,8311,2628,1723,180.503,78.6644,11.3356,99.9867
244,245,600,3228,1702,337.25699999999995,57.9497,32.0503,99.9185
245,246,20593,807,1800,1.15942,5.4383599999999985,84.5616,99.892
246,247,8735,1138,1748,160.987,3.53081,86.4692,99.9861
247,248,46816,1027,1885,1.01649,4.71971,85.2803,99.9332
248,249,106537,1460,1975,38.7093,81.8989,8.10113,82.6665
249,250,7263,1350,1769,351.409,9.91627,80.0837,99.8944
250,251,1510,912,1773,0.292572,6.74327,83.2567,99.9894
251,252,4911,2316,1755,163.38,75.2682,14.7318,99.9727
252,253,6268,1282,1779,345.232,55.5835,34.4165,99.963
253,254,2877,1712,1757,180.155,14.3337,75.6663,99.9992
254,255,2261,1067,1765,170.266,2.76035,87.2397,99.985
255,256,12853,1720,1832,179.528,19.8754,70.1246,99.9608
256,257,1288,752,1767,359.316,3.87389,86.1261,99.9987
257,258,18612,1193,1836,353.306,8.72337,81.2766,99.9937
258,259,6022,147,1793,159.97299999999996,33.8742,56.1258,99.9742
259,260,16804,2635,1840,177.861,6.44816,83.5518,99.9379
260,261,1861,3218,1853,159.608,19.9911,70.0089,99.972
261,262,2606,2551,1829,165.16099999999997,24.0036,65.9964,99.8429
262,263,1804,2807,1836,175.21599999999995,8.68555,81.3145,99.9918
263,264,5364,1555,1831,176.1,2.3259,87.6741,99.9993
264,265,2232,2752,1838,164.79,74.7078,15.2922,99.9958
265,266,27322,192,1917,346.75,38.586,51.414,99.9817
266,267,6256,871,1890,224.971,80.773,9.22701,99.9485
267,268,10752,2243,1915,169.456,44.247,45.753,99.9962
268,269,6422,662,1894,168.87,63.5552,26.4448,99.9931
269,270,26773,2690,1954,342.256,56.3337,33.6663,99.9804
270,271,3392,2161,1909,159.214,21.4631,68.5369,99.9806
271,272,151801,2382,2157,188.221,25.9701,64.0299,98.6807
272,273,4587,1634,1916,177.641,1.7962900000000002,88.2037,99.9995
273,274,505829,696,2212,150.27100000000004,53.02,36.98,95.8096
274,275,16335,1766,1956,351.599,54.2151,35.7849,99.9082
275,276,11743,717,1984,12.4756,76.6735,13.3265,99.2242
276,277,2144,1801,1928,151.49200000000005,54.1003,35.8997,99.9944
277,278,3540,1212,1933,340.011,53.441,36.559,99.9881
278,279,839,3196,1948,340.5540000000001,56.2254,33.7746,99.9767
279,280,597,1941,1937,174.419,72.79899999999998,17.201,99.9746
280,281,662,1914,1956,167.437,46.0064,43.9936,99.9424
281,282,1674,1932,1977,169.24599999999995,72.0674,17.9326,99.7457
282,283,583,2864,1967,175.524,7.698169999999998,82.3018,99.9994
283,284,21672,2223,2024,173.583,78.941,11.059,99.3356
284,285,33121,1983,2089,345.971,54.2524,35.7476,75.822
285,286,2746,1769,2016,165.063,78.3506,11.6494,99.174
286,287,1523,1892,2031,169.465,17.4481,72.5519,99.7975
287,288,12158,1809,2076,351.631,34.7982,55.2018,99.9871
288,289,4127,1703,2078,334.956,66.6478,23.3522,99.8727
289,290,82554,1503,2260,350.386,35.6901,54.3099,61.9828
290,291,106449,2827,2279,175.93900000000005,6.5823100000000005,83.4177,100.099
291,292,4352,3210,2158,339.8830000000001,58.2873,31.7127,99.8607
292,293,1311,2047,2126,338.541,67.81,22.19,99.6337
293,294,12289,2121,2171,169.287,5.0129199999999985,84.9871,99.9771
294,295,24659,1767,2245,155.174,59.4157,30.5843,99.9167
295,296,2358,155,2165,40.7806,84.272,5.728,99.9256
296,297,1217,120,2187,33.1598,84.719,5.28099,99.9583
297,298,2230,715,2176,176.19,53.2938,36.7062,99.9918
298,299,2638,1698,2182,178.608,23.9605,66.0395,99.9975
299,300,994,2013,2184,177.049,7.93964,82.0604,99.9534
300,301,194118,2233,2473,169.30599999999995,42.3397,47.6603,96.9891
301,302,9240,1293,2211,2.84863,35.8347,54.1653,99.9913
302,303,568,1982,2179,182.958,22.3427,67.6573,99.9911
303,304,970,2136,2222,160.945,7.523989999999999,82.476,99.9987
304,305,738,3212,2225,333.8540000000001,53.8361,36.1639,99.9062
305,306,3026,1882,2253,355.5030000000001,53.3282,36.6718,99.925
306,307,1720,1994,2246,351.06699999999995,52.9846,37.0154,99.9508
307,308,3684,1945,2257,174.46599999999995,24.8927,65.1073,88.1129
308,309,517,3246,2235,347.0680000000001,47.3605,42.6395,98.9199
309,310,549,1367,2234,170.94099999999997,5.264880000000002,84.7351,99.993
310,311,7518,1370,2298,145.611,83.6971,6.30294,99.9658
311,312,44838,176,2471,168.453,26.2382,63.7618,99.6257
312,313,1712,3209,2273,339.4190000000001,58.18600000000001,31.814,99.8097
313,314,28821,1857,2362,5.39544,73.6297,16.3703,99.983
314,315,2646,105,2374,350.95,58.0009,31.9991,99.956
315,316,910,1326,2340,164.887,60.6566,29.3434,99.9625
316,317,4567,2965,2356,179.386,51.8305,38.1695,99.8636
317,318,44051,3092,2442,351.09,7.72099,82.279,99.8798
318,319,2473,750,2356,170.827,33.2935,56.7065,99.9925
319,320,880,2588,2350,175.622,15.3492,74.6508,99.9868
320,321,7903,1299,2391,148.717,80.8749,9.12514,99.9789
321,322,919,3225,2383,350.1269999999999,6.53077,83.4692,99.7771
322,323,1302,2590,2375,177.24400000000003,10.077,79.923,99.9877
323,324,8751,2001,2432,121.412,77.7839,12.2161,99.9346
324,325,2271,1666,2423,349.732,9.34522,80.6548,99.9952
325,326,3612,1714,2411,343.955,10.2595,79.7405,99.9969
326,327,1935,2533,2395,164.38,81.9087,8.09131,99.9964
327,328,8384,2647,2437,178.002,48.5018,41.4982,99.9951
328,329,9316,784,2430,169.838,60.044,29.956,99.9953
329,330,8887,1206,2453,357.844,2.40158,87.5984,99.9238
330,331,11709,2532,2473,354.736,43.2771,46.7229,99.7726
331,332,12933,1578,2455,166.80900000000003,66.0923,23.9077,99.8067
332,333,1439,2501,2432,168.66299999999995,16.3771,73.6229,99.9546
333,334,738,2710,2463,179.896,4.35484,85.6452,99.9997
334,335,25701,574,2525,164.877,21.8314,68.1686,99.786
335,336,29444,1727,2511,159.57299999999995,8.20832,81.7917,96.5147
336,337,48577,1379,2542,186.511,88.6365,1.36351,97.6128
337,338,5687,2764,2491,179.916,49.2289,40.7711,99.9682
338,339,681,106,2455,177.542,30.6482,59.3518,99.914
339,340,1612,3215,2503,351.466,6.7835600000000005,83.2164,99.6774
340,341,668,3195,2493,351.6230000000001,7.7485300000000015,82.2515,99.9823
341,342,19144,1061,2525,349.338,25.2129,64.7871,96.4438
342,343,22696,790,2544,4.33771,67.4085,22.5915,99.3821
343,344,33640,2710,2583,169.351,37.0454,52.9546,86.1106
344,345,7860,2915,2526,154.961,48.7328,41.2672,99.8368
345,346,25228,434,2607,155.783,38.1541,51.8459,99.9736
346,347,48016,2510,2702,164.69799999999995,50.289,39.711,98.3613
347,348,92225,3035,2728,341.36300000000006,26.9043,63.0957,62.2222
348,349,75476,1051,2698,161.067,26.9736,63.0264,98.6159
349,350,500,1457,2554,163.41,69.747,20.253,99.9818
350,351,56918,1821,2687,67.4607,80.8768,9.12323,99.8402
351,352,971,3208,2578,178.072,27.2374,62.7626,99.928
352,353,60711,1603,2740,172.398,26.9439,63.0561,99.4584
353,354,6027,1261,2605,163.422,68.2063,21.7937,99.9821
354,355,3997,2648,2604,166.71200000000005,45.6509,44.3491,99.9968
355,356,2087,1167,2594,1.54851,67.6644,22.3356,99.9785
356,357,1380,719,2608,161.76,51.3169,38.6831,99.9876
357,358,8587,296,2628,345.374,20.3695,69.6305,99.9397
358,359,952,66,2608,171.079,40.2953,49.7047,99.7544
359,360,4175,637,2618,1.19106,65.2656,24.7344,99.9708
360,361,3316,123,2651,171.104,37.5803,52.4197,99.9096
361,362,2060,1188,2632,58.1591,80.4524,9.54762,99.9926
362,363,10994,2731,2656,348.727,10.3854,79.6146,99.8953
363,364,6518,547,2690,155.33,70.2639,19.7361,99.9228
364,365,10273,811,2678,167.342,33.8946,56.1054,99.9841
365,366,4298,712,2668,166.074,23.7309,66.2691,99.9983
366,367,1023,1250,2647,54.955,82.6276,7.3723800000000015,99.9932
367,368,661,71,2656,167.785,41.2807,48.7193,99.9648
368,369,10350,628,2707,129.797,75.8104,14.1896,99.9776
369,370,608,2295,2677,350.1930000000001,13.1923,76.8077,99.9821
370,371,1959,352,2700,173.642,4.54132,85.4587,99.997
371,372,30849,2153,2767,175.138,10.3168,79.6832,99.8406
372,373,3012,79,2706,158.662,24.0918,65.9082,99.5623
373,374,2996,1356,2716,148.524,25.0166,64.9834,99.914
374,375,1471,2000,2701,179.368,24.8754,65.1246,99.9851
375,376,2286,144,2704,172.458,23.9055,66.0945,99.9852
376,377,3142,406,2716,347.86800000000005,17.9688,72.0312,99.994
377,378,1038,891,2708,3.53413,64.935,25.065,99.9324
378,379,1320,1301,2716,3.17482,69.2668,20.7332,99.9976
379,380,1237,746,2727,170.489,51.4536,38.5464,99.9764
380,381,20916,2765,2768,161.889,68.3428,21.6572,99.9531
381,382,58725,405,2822,174.365,33.3865,56.6135,99.6257
382,383,2617,2178,2728,182.02,21.7686,68.2314,99.9964
383,384,1191,477,2728,137.329,75.7658,14.2342,99.9821
384,385,2472,3000,2736,170.699,65.5862,24.4138,99.9914
385,386,881,2392,2722,162.976,47.9391,42.0609,99.9952
386,387,7147,3145,2780,351.3,12.4965,77.5035,99.9844
387,388,3128,3211,2764,348.3,14.6846,75.3154,99.8575
388,389,1420,515,2742,139.64600000000002,75.002,14.998,99.9664
389,390,17009,860,2787,345.787,3.3145,86.6855,99.6058
390,391,3658,2013,2809,178.46900000000005,8.77519,81.2248,99.9021
391,392,692,1282,2746,358.551,30.1785,59.8215,99.9957
392,393,19820,1398,2820,161.724,21.126,68.874,99.5567
393,394,506,2347,2754,358.6090000000001,11.6023,78.3977,99.998
394,395,973,1252,2759,357.05,70.63,19.37,99.9805
395,396,9774,155,2791,169.05599999999995,58.0207,31.9793,99.9791
396,397,1240,1373,2765,126.251,74.5891,15.4109,99.9846
397,398,769,79,2761,161.905,32.0105,57.9895,99.8514
398,399,11428,2305,2815,359.092,11.3175,78.6825,99.798
399,400,9043,686,2799,351.779,6.77568,83.2243,99.6094
400,401,4192,1237,2808,128.744,75.852,14.148,99.9637
401,402,2198,1800,2804,178.893,26.518,63.482,99.9892
402,403,3376,3062,2825,145.322,57.9527,32.0473,99.9982
403,404,4800,3224,2842,343.3230000000001,35.9072,54.0928,99.6635
404,405,20550,2508,2864,345.2630000000001,56.676,33.324,91.3492
405,406,10875,2784,2881,167.141,12.0932,77.9068,99.9019
406,407,15011,1580,2862,174.923,54.8723,35.1277,99.9944
407,408,16310,685,2895,7.51323,78.0106,11.9894,99.9053
408,409,5894,1145,2863,0.0774816,28.83,61.17,99.9977
409,410,2864,3157,2855,344.017,34.9371,55.0629,99.9709
410,411,18559,1852,2887,166.775,39.5823,50.4177,99.3855
411,412,8166,2647,2895,165.72,17.1405,72.8595,99.9374
412,413,678,1960,2837,170.613,26.6355,63.3645,99.6805
413,414,5420,2887,2877,351.412,13.0711,76.9289,99.952
414,415,7170,178,2865,158.925,57.2861,32.7139,99.9918
415,416,52832,2262,3001,165.634,65.1518,24.8482,58.3112
416,417,17914,977,2896,348.903,77.5462,12.4537,99.953
417,418,616,1092,2857,167.55900000000003,46.9255,43.0745,99.9906
418,419,1963,1253,2865,151.221,52.9308,37.0692,99.9635
419,420,2598,1703,2872,172.13,42.9756,47.0244,99.9903
420,421,2212,855,2878,175.745,1.74002,88.26,99.9521
421,422,4495,798,2901,170.377,9.11466,80.8853,99.9858
422,423,7473,1334,2910,172.918,6.26585,83.7341,99.9798
423,424,1797,1275,2896,151.411,49.4535,40.5465,99.4288
424,425,6072,2376,2893,173.75400000000005,26.2645,63.7355,99.9722
425,426,11491,2279,2927,165.891,23.8332,66.1668,99.959
426,427,1353,97,2887,345.039,20.5614,69.4386,99.9375
427,428,1045,324,2882,343.301,25.1718,64.8282,99.9955
428,429,2907,295,2916,166.67700000000005,52.6505,37.3495,99.9756
429,430,4079,1225,2918,149.112,52.8214,37.1786,99.9963
430,431,3225,1079,2931,350.314,27.2219,62.7781,99.9362
431,432,15081,193,2972,175.604,75.0053,14.9947,98.6252
432,433,2817,1482,2929,165.81,55.7251,34.2749,99.9594
433,434,885,2717,2928,174.178,7.2319,82.7681,99.9966
434,435,2368,854,2940,175.459,9.73917,80.2608,99.9766
435,436,2270,1955,2928,169.50799999999995,0.6619109999999999,89.3381,93.6008
436,437,1272,2559,2919,1.52225,63.6951,26.3049,99.9685
437,438,743,118,2917,173.893,9.05451,80.9455,99.9749
438,439,4474,586,2941,166.282,23.9082,66.0918,99.9901
439,440,2823,1546,2938,113.684,81.4631,8.53693,99.9907
440,441,1421,441,2921,343.302,10.3198,79.6802,99.9561
441,442,634,1169,2923,163.806,15.1238,74.8762,99.9868
442,443,3938,2141,2931,189.639,86.2869,3.71309,99.9947
443,444,2028,264,2940,159.398,52.1037,37.8963,99.9565
444,445,4771,1406,2941,65.6976,85.5203,4.47969,99.9918
445,446,7253,1628,2958,168.627,26.294,63.706,99.991
446,447,545,348,2925,342.048,8.98224,81.0178,99.9829
447,448,604,3171,2935,20.3824,66.3843,23.6157,99.9868
448,449,6454,2860,2954,147.643,72.3746,17.6254,99.9795
449,450,536,3263,2934,295.525,40.1595,49.8405,99.9346
450,451,2476,3216,2953,332.911,26.6127,63.3873,99.0373
451,452,1326,403,2952,158.672,49.529,40.471,99.9878
452,453,3167,2424,2968,356.103,13.3751,76.6249,99.9947
453,454,2050,2356,2960,166.68900000000005,18.3272,71.6728,99.9833
454,455,617,2966,2951,358.211,25.595,64.405,99.8666
455,456,6490,1139,2974,166.825,32.5161,57.4839,99.9848
456,457,2270,2519,2962,170.85,32.6835,57.3165,99.9891
457,458,1519,370,2961,159.286,50.9224,39.0776,99.9783
458,459,26331,839,3031,167.84799999999996,13.8822,76.1178,97.4025
459,460,9665,2769,2994,4.94548,84.8206,5.17937,99.8485
460,461,4386,533,2985,335.233,3.49391,86.5061,99.8244
461,462,34333,1820,3019,164.71900000000005,27.2294,62.7706,87.4718
462,463,15921,2562,3027,337.61800000000005,9.28156,80.7184,99.5398
463,464,11892,1337,3007,154.39700000000005,76.9528,13.0472,99.0134
464,465,127981,2926,3341,159.613,54.282,35.718,68.617
465,466,927,3014,2968,90.744,82.7503,7.24972,99.9917
466,467,610,1218,2963,170.96400000000003,9.76215,80.2378,99.996
467,468,20326,1092,3038,163.957,50.1621,39.8379,99.726
468,469,910,1489,2967,121.284,70.7568,19.2432,99.9909
469,470,812,968,2986,174.912,32.2602,57.7398,99.8973
470,471,688,322,2980,349.374,9.96992,80.0301,99.9843
471,472,21531,628,3068,359.789,52.4938,37.5062,99.7596
472,473,853,3087,2984,179.764,71.3769,18.6231,99.9942
473,474,4200,2680,3024,171.16,9.4829,80.5171,99.9553
474,475,5358,1489,3010,164.202,31.1362,58.8638,99.9484
475,476,568,3043,2985,60.0801,87.6458,2.35418,99.9956
476,477,1473,1200,3000,152.381,71.5927,18.4073,99.7039
477,478,1100,3237,3000,176.36700000000005,72.7025,17.2975,99.9525
478,479,2345,1239,3026,174.428,6.9363600000000005,83.0636,99.8726
479,480,21606,2048,3073,170.445,4.58408,85.4159,99.068
480,481,565,380,2999,155.35,51.6547,38.3453,99.8494
481,482,90442,447,3236,343.87,0.20973200000000006,89.7903,44.1874
482,483,1171,419,3004,158.216,45.4752,44.5248,99.2335
483,484,637,3199,3016,156.61700000000005,53.8382,36.1618,99.9569
484,485,573,1978,3017,0.995104,0.00307465,89.9969,100.0
485,486,46823,1612,3173,342.807,61.6455,28.3545,99.7971
486,487,3974,460,3039,152.52700000000004,53.9388,36.0612,99.9501
487,488,7644,3085,3054,166.158,7.86246,82.1375,99.7542
488,489,29890,174,3154,146.57,64.9606,25.0394,99.803
489,490,19301,1420,3106,348.282,67.8232,22.1768,99.9619
490,491,3483,82,3077,160.387,16.2788,73.7212,99.8656
491,492,829,547,3049,153.931,4.82154,85.1785,99.9846
492,493,566,516,3059,358.094,52.6704,37.3296,99.9469
493,494,943,1271,3062,351.82199999999995,10.9799,79.0201,99.9973
494,495,6463,2604,3105,166.75599999999997,32.973,57.027,97.396
495,496,8815,2264,3112,32.2833,83.1244,6.87558,99.9105
496,497,701,2718,3070,162.60399999999996,40.7408,49.2592,99.9429
497,498,64266,880,3236,165.699,32.6086,57.3914,38.4555
498,499,1102,3208,3090,354.3880000000001,5.6898,84.3102,99.9897
499,500,2217,506,3099,335.266,0.974525,89.0255,99.9849
500,501,1627,1317,3091,164.407,25.5831,64.4169,99.7941
501,502,3063,1073,3114,249.43,88.0308,1.96921,99.9409
502,503,5309,1267,3113,170.114,33.5781,56.4219,99.9939
503,504,13953,2694,3153,177.007,10.6971,79.3029,99.9671
504,505,4889,1819,3116,170.805,74.8766,15.1234,99.9591
505,506,20906,2182,3177,351.531,30.5302,59.4698,99.9709
506,507,1210,3150,3117,343.487,47.8019,42.1981,99.9665
507,508,3122,3181,3153,340.064,48.8414,41.1586,99.6513
508,509,7494,698,3159,354.2390000000001,68.1573,21.8427,99.9885
509,510,10988,1744,3167,160.799,26.6573,63.3427,99.9534
510,511,19424,2341,3224,350.865,9.74763,80.2524,99.9871
511,512,2074,1199,3133,180.751,6.54044,83.4596,99.9961
512,513,1925,3229,3155,346.30300000000005,49.5991,40.4009,99.9081
513,514,1810,3078,3140,63.7666,82.3738,7.62622,99.9893
514,515,43692,2802,3253,166.90400000000002,11.9604,78.0396,99.7104
515,516,1902,2087,3148,81.3901,80.3543,9.64572,99.9636
516,517,7786,2485,3178,9.60056,49.9208,40.0792,99.9625
517,518,22807,1958,3225,169.42700000000005,19.6024,70.3976,98.61
518,519,710,77,3167,151.74,63.6133,26.3867,99.9425
519,520,5445,3120,3213,342.837,44.9239,45.0761,99.9192
520,521,1266,1062,3155,7.97089,1.63215,88.3679,99.9909
521,522,12485,1230,3235,174.347,16.8427,73.1573,99.9807
522,523,17914,1279,3279,174.72099999999998,11.6268,78.3732,99.9636
523,524,13870,1478,3223,338.27,9.63052,80.3695,99.9764
524,525,4548,3074,3203,153.799,73.328,16.672,99.9793
525,526,562,1211,3174,178.232,19.3172,70.6828,99.9962
526,527,9673,2060,3276,173.407,40.2832,49.7168,99.9802
527,528,3676,630,3225,50.1446,81.2473,8.75272,99.9532
528,529,1302,1386,3212,169.997,9.36884,80.6312,99.9911
529,530,15645,696,3275,168.673,30.7969,59.2031,99.9038
530,531,2332,3207,3238,343.24300000000005,59.2473,30.7527,99.5942
531,532,4966,1822,3229,175.627,25.2047,64.7953,99.9841
532,533,11738,2424,3263,6.07059,63.3406,26.6594,99.9764
533,534,546,579,3213,357.524,59.6239,30.3761,99.9292
534,535,3926,2522,3245,157.202,36.5957,53.4043,99.9832
535,536,1727,2634,3231,359.287,1.6856400000000002,88.3144,99.9954
536,537,3214,518,3244,61.1161,79.5773,10.4227,99.9462
537,538,7384,1128,3263,181.741,5.28432,84.7157,99.9693
538,539,974,1025,3235,1.72839,0.823784,89.1762,99.9989
539,540,8409,2593,3296,154.253,41.4564,48.5436,99.9124
540,541,1790,2261,3258,351.494,64.025,25.975,99.9941
541,542,6857,284,3271,140.207,62.1543,27.8457,99.9504
542,543,6096,1883,3289,171.044,32.8685,57.1315,99.986
543,544,4678,3132,3296,162.394,61.0183,28.9817,99.9922
544,545,12181,2178,3291,161.566,40.4449,49.5551,99.9938
545,546,8972,1794,3315,32.9953,89.0585,0.941492,99.95
546,547,8832,1035,3311,176.542,1.67989,88.3201,99.991
547,548,510,2626,3267,176.365,4.36222,85.6378,99.9126
548,549,2843,3207,3302,153.086,65.1324,24.8676,99.6902
549,550,558,1552,3285,173.426,6.694039999999998,83.306,99.9989
550,551,1072,1661,3288,176.445,2.0321,87.9679,99.9926
551,552,17307,201,3353,165.361,36.2905,53.7095,99.975
552,553,4766,1353,3313,174.06599999999997,1.87355,88.1264,99.8506
553,554,12611,1473,3329,351.58,41.4952,48.5048,99.8695
554,555,544,1696,3302,355.648,1.07589,88.9241,99.9991
555,556,5150,2536,3337,358.796,2.29791,87.7021,99.99
556,557,4483,3049,3343,330.839,10.1431,79.8569,99.983
557,558,13191,348,3378,159.20600000000005,76.9328,13.0672,99.8354
558,559,10503,1665,3380,353.155,42.5808,47.4192,99.9962
559,560,3730,2663,3355,341.487,74.9659,15.0341,99.9944
560,561,1174,99,3339,352.232,38.1641,51.8359,99.8792
561,562,6474,2456,3360,168.547,50.3563,39.6437,99.3156
562,563,4305,2145,3354,167.511,25.4439,64.5561,99.9862
563,564,8333,2242,3372,351.305,64.7877,25.2123,99.9432
564,565,28053,2008,3413,185.806,71.0078,18.9922,92.7444
565,566,19607,1077,3412,26.567,74.8089,15.1911,99.9633
566,567,543,2372,3350,155.958,76.7886,13.2114,99.9012
567,568,1796,1297,3366,347.374,32.4697,57.5303,99.9378
568,569,10076,1738,3422,162.213,17.2346,72.7654,99.9831
569,570,934,2004,3352,343.184,40.2454,49.7546,99.9899
570,571,5467,3101,3394,348.08,35.9873,54.0127,99.9202
571,572,682,1358,3358,349.115,38.0349,51.9651,99.9706
572,573,4853,1472,3401,162.708,47.7958,42.2042,99.266
573,574,5346,3218,3418,170.384,40.8122,49.1878,97.8149
574,575,1110,3264,3374,178.53599999999997,63.7008,26.2992,99.852
575,576,2418,2729,3382,152.627,23.0437,66.9563,99.9353
576,577,38271,741,3466,163.509,28.7527,61.2473,98.8432
577,578,744,1221,3378,346.348,43.5937,46.4063,99.9561
578,579,10646,2365,3415,164.683,26.2483,63.7517,99.9906
579,580,9529,1328,3417,157.812,15.3462,74.6538,99.9876
580,581,1130,1810,3390,157.86,0.186554,89.8134,99.9104
581,582,521,3166,3409,168.548,36.4044,53.5956,99.987
582,583,21537,1224,3497,157.192,18.5845,71.4155,96.0296
583,584,21390,2676,3468,172.358,7.5787,82.4213,99.9445
584,585,6294,1830,3467,347.547,0.14971900000000002,89.8503,99.7025
585,586,2352,85,3442,165.188,23.0631,66.9369,98.9451
586,587,2496,2540,3423,166.157,30.9947,59.0053,99.9687
587,588,9496,1590,3452,163.47899999999996,58.7436,31.2564,99.9968
588,589,1584,1994,3422,343.7940000000001,61.6094,28.3906,99.9757
589,590,5805,2246,3458,170.017,9.03431,80.9657,99.9941
590,591,1637,2791,3422,349.541,77.8857,12.1143,99.9822
591,592,60478,1277,3643,339.4190000000001,8.34281,81.6572,99.0778
592,593,2541,2179,3448,164.775,25.5367,64.4633,99.9853
593,594,548,3204,3431,185.848,33.169000000000004,56.831,99.7207
594,595,2922,169,3445,168.59599999999998,66.3964,23.6036,99.9707
595,596,1943,1877,3468,159.217,15.4626,74.5374,99.9281
596,597,4393,2452,3456,359.834,59.0517,30.9483,99.9736
597,598,3455,3135,3472,0.8475030000000001,55.397,34.603,99.9719
598,599,26835,237,3508,348.737,23.9388,66.0612,82.8415
599,600,1489,3039,3452,171.366,45.3008,44.6992,99.7301
600,601,6273,2571,3479,169.91099999999997,36.3541,53.6459,99.9897
601,602,16574,1518,3526,345.309,75.5805,14.4195,99.7473
602,603,4098,2314,3479,170.687,48.2668,41.7332,99.9881
603,604,1821,3055,3472,159.311,4.9026,85.0974,99.9781
604,605,3541,467,3475,178.92700000000005,76.29,13.71,99.9856
605,606,1302,2812,3456,143.22,65.3201,24.6799,99.9656
606,607,564,1790,3471,164.30599999999995,8.408430000000001,81.5916,99.8921
607,608,82538,2565,3628,351.73,55.547,34.453,72.3629
608,609,1697,3198,3499,7.97635,59.3943,30.6057,99.8861
609,610,2782,1340,3486,347.011,9.15413,80.8459,99.92
610,611,890,1659,3489,23.8042,82.2818,7.71823,99.9438
611,612,9436,954,3529,345.466,28.1525,61.8475,99.8594
612,613,6496,1075,3500,45.7227,88.9419,1.05814,99.4163
613,614,7734,362,3551,354.266,77.4733,12.5267,99.6278
614,615,3759,1935,3503,164.769,44.81800000000001,45.182,99.8815
615,616,6946,2234,3527,171.665,18.5023,71.4977,99.5809
616,617,22813,528,3609,174.321,0.737259,89.2627,95.7973
617,618,1864,2131,3507,176.447,4.40936,85.5906,99.9846
618,619,18881,2079,3563,346.722,8.46171,81.5383,56.4492
619,620,23718,1702,3571,168.334,46.2362,43.7638,99.9938
620,621,11917,659,3564,350.886,32.9029,57.0971,99.9827
621,622,1615,1343,3535,342.22,76.762,13.238,99.7984
622,623,2595,1876,3543,25.2532,84.4895,5.51054,99.7924
623,624,18201,1102,3598,163.523,31.8668,58.1332,99.858
624,625,1618,3216,3558,42.0802,85.8699,4.13008,99.8706
625,626,1920,827,3551,348.834,8.68263,81.3174,99.9515
626,627,600,1035,3546,36.5863,79.9114,10.0886,99.9749
627,628,2970,2718,3578,173.933,39.312,50.688,99.9985
628,629,19733,1809,3642,172.82299999999995,10.0823,79.9177,99.9414
629,630,20062,2254,3627,168.765,25.8607,64.1393,99.7858
630,631,22910,855,3613,358.075,85.9954,4.0046300000000015,99.9473
631,632,15155,1531,3673,350.7519999999999,6.1609099999999986,83.8391,99.8168
632,633,9694,1927,3645,5.27706,71.3775,18.6225,97.7727
633,634,4952,134,3624,156.829,4.14622,85.8538,99.9829
634,635,646,3073,3591,152.664,5.95165,84.0483,99.9929
635,636,26364,352,3669,349.81,26.0557,63.9443,99.9693
636,637,3939,2024,3618,357.034,15.4765,74.5235,99.9806
637,638,2326,3136,3626,156.17600000000004,51.8626,38.1374,99.9512
638,639,1331,3039,3625,335.0030000000001,0.368393,89.6316,99.902
639,640,1713,611,3625,162.636,8.05718,81.9428,99.984
640,641,1990,226,3640,335.87,70.7783,19.2217,99.9587
641,642,2515,3074,3648,351.061,0.193962,89.806,99.9052
642,643,828,2104,3635,353.736,9.61171,80.3883,99.9773
643,644,6351,721,3674,345.94699999999995,8.47738,81.5226,99.9424
644,645,2271,655,3684,353.358,6.67324,83.3268,99.9778
645,646,17245,2076,3734,341.561,32.9144,57.0856,99.7584
646,647,24959,539,3766,176.893,85.5118,4.4882300000000015,99.881
647,648,2674,174,3674,351.901,56.2401,33.7599,99.9974
648,649,1206,2953,3665,149.267,67.3354,22.6646,99.9578
649,650,2471,1993,3695,167.65200000000004,68.5677,21.4323,95.9237
650,651,2425,839,3675,163.59,31.0212,58.9788,99.974
651,652,857,963,3683,136.092,70.4284,19.5716,99.7243
652,653,27155,3030,3747,352.024,18.9209,71.0791,99.7292
653,654,9204,1638,3708,164.17,19.0032,70.9968,99.9905
654,655,3390,882,3707,347.706,6.46574,83.5343,99.9885
655,656,17930,993,3761,348.407,28.481,61.519,99.9535
656,657,728,3161,3691,351.439,14.8045,75.1955,99.9886
657,658,569,931,3693,131.273,72.3419,17.6581,99.8767
658,659,14883,1438,3755,347.897,80.458,9.54205,76.8456
659,660,2789,101,3708,322.746,69.5789,20.4211,99.9731
660,661,9998,219,3733,350.5680000000001,62.6502,27.3498,99.9768
661,662,13601,1884,3766,355.652,15.3787,74.6213,99.858
662,663,3582,814,3732,338.974,58.441,31.559,99.9738
663,664,1634,2030,3716,351.81,66.9089,23.0911,99.9976
664,665,2480,2609,3720,348.1090000000001,8.330639999999999,81.6694,99.9939
665,666,46990,2598,3825,160.237,9.73869,80.2613,99.9621
666,667,25049,2355,3790,354.276,14.6861,75.3139,93.037
667,668,5368,3148,3769,352.015,15.7308,74.2692,99.8968
668,669,2635,2690,3732,149.27200000000005,65.0675,24.9325,99.9984
669,670,10332,2174,3770,2.82634,10.2798,79.7202,99.9709
670,671,5412,699,3740,336.333,57.6615,32.3385,99.9825
671,672,783,770,3734,170.64,0.659401,89.3406,99.9873
672,673,5678,1726,3747,21.1565,81.0222,8.97776,99.9761
673,674,3832,2760,3763,352.206,4.5305800000000005,85.4694,99.995
674,675,5080,2849,3772,154.834,62.6619,27.3381,99.9938
675,676,2225,1238,3754,343.657,61.3499,28.6501,99.9842
676,677,7287,1313,3825,166.69299999999996,84.0653,5.93473,99.971
677,678,3723,136,3782,155.61,67.1615,22.8385,99.9459
678,679,4227,875,3791,347.767,52.4512,37.5488,99.9541
679,680,1276,1174,3758,177.109,86.4864,3.51357,99.9938
680,681,33379,1825,3881,353.625,4.37975,85.6203,99.8861
681,682,547,1139,3766,154.528,47.416,42.584,99.9684
682,683,3856,369,3793,324.366,71.9674,18.0326,99.974
683,684,598,2228,3767,45.4802,77.3462,12.6538,99.9971
684,685,922,310,3783,348.793,8.44556,81.5544,99.996
685,686,45631,1543,3883,174.535,9.08955,80.9105,97.8033
686,687,1318,807,3784,333.963,78.7774,11.2226,99.9933
687,688,1204,227,3800,351.53,10.7085,79.2915,99.9867
688,689,1814,182,3807,341.749,62.9559,27.0441,99.9948
689,690,1570,432,3814,339.713,3.5523,86.4477,99.8308
690,691,1642,757,3801,347.583,30.4954,59.5046,99.9952
691,692,5498,1236,3811,355.017,18.3526,71.6474,99.9116
692,693,4994,1678,3814,353.852,24.0628,65.9372,99.9968
693,694,686,2480,3797,10.1298,72.7515,17.2485,99.9912
694,695,858,268,3806,350.208,7.9370699999999985,82.0629,99.9479
695,696,2167,613,3814,350.602,9.94447,80.0555,99.9986
696,697,19850,2887,3871,155.217,42.2457,47.7543,99.7081
697,698,4530,719,3843,335.099,81.8209,8.179110000000001,99.9845
698,699,513,1373,3811,165.669,46.1911,43.8089,98.6252
699,700,30585,2105,3931,158.928,72.3135,17.6865,99.8202
700,701,75952,752,4024,350.925,49.326,40.674,80.065
701,702,1210,320,3830,43.3877,84.7176,5.28238,99.7429
702,703,8741,2285,3861,164.695,48.1785,41.8215,99.7726
703,704,7063,1100,3852,169.05900000000003,78.9899,11.0101,99.9906
704,705,1508,404,3844,348.17800000000005,10.5842,79.4158,99.9868
705,706,618,663,3827,348.222,38.098,51.902,99.9671
706,707,1267,1175,3842,348.327,39.4196,50.5804,99.9716
707,708,2286,1374,3845,167.437,25.9849,64.0151,99.9959
708,709,2485,266,3849,329.0440000000001,63.6231,26.3769,99.9811
709,710,24017,3012,3951,359.214,64.0629,25.9371,99.9062
710,711,2109,3132,3855,159.94799999999995,7.37325,82.6267,99.9936
711,712,677,3158,3865,170.104,4.293080000000002,85.7069,99.9973
712,713,529,201,3843,351.725,9.79832,80.2017,99.9584
713,714,38068,510,3943,355.964,1.1267200000000002,88.8733,99.8333
714,715,630,222,3855,352.787,13.0993,76.9007,99.9951
715,716,1959,355,3864,343.461,6.16835,83.8316,99.9378
716,717,5362,1039,3913,160.89700000000005,37.1317,52.8683,99.9671
717,718,504,113,3865,330.574,88.6514,1.34857,99.9885
718,719,4903,479,3880,342.7519999999999,28.8159,61.1841,99.99
719,720,1117,1932,3872,159.859,1.31988,88.6801,99.8958
720,721,7426,2745,3907,349.63199999999995,54.2783,35.7217,99.9949
721,722,640,3088,3882,357.277,61.1288,28.8712,99.9851
722,723,2263,989,3893,339.858,3.5551800000000005,86.4448,99.986
723,724,5431,1190,3889,351.286,13.9876,76.0124,99.9537
724,725,25771,186,3946,164.821,32.7253,57.2747,99.9336
725,726,772,3115,3890,159.274,7.0007100000000015,82.9993,99.997
726,727,1648,333,3906,326.665,65.2342,24.7658,99.9883
727,728,8850,691,3940,172.05200000000005,20.1947,69.8053,99.9778
728,729,2815,1270,3923,165.61900000000003,20.3871,69.6129,99.9704
729,730,24365,2378,3988,176.94400000000005,10.4367,79.5633,99.8116
730,731,1756,2261,3934,180.501,8.80158,81.1984,99.9962
731,732,1379,2380,3932,180.71,8.500119999999999,81.4999,99.9996
732,733,6208,761,3955,342.195,59.9561,30.0439,99.9929
733,734,22968,1197,3994,127.9,69.559,20.441,98.8127
734,735,924,1326,3931,119.397,72.2367,17.7633,99.8928
735,736,3569,2004,3960,149.96,73.9183,16.0818,99.9199
736,737,3087,2798,3945,170.41299999999995,6.98822,83.0118,99.9963
737,738,5826,3136,3969,354.319,61.2493,28.7507,99.9096
738,739,1766,2511,3954,182.88,10.2264,79.7736,99.9957
739,740,929,3096,3942,170.75799999999995,8.12567,81.8743,99.9443
740,741,1563,2232,3964,178.926,14.5335,75.4665,99.9929
741,742,49658,2670,4059,355.659,62.7587,27.2413,99.8475
742,743,1390,3067,3959,171.83900000000003,7.6517300000000015,82.3483,99.9916
743,744,1461,2574,3950,173.30700000000004,8.653789999999999,81.3462,99.9891
744,745,1473,3200,3960,349.809,62.6674,27.3326,99.8717
745,746,780,334,3949,9.3913,64.2033,25.7967,99.9939
746,747,20353,2864,4034,163.58,27.743,62.257,99.757
747,748,1305,1481,3963,351.21,2.79884,87.2012,99.9847
748,749,1531,1694,3963,305.225,79.1186,10.8814,99.9751
749,750,1761,1762,3969,351.8880000000001,9.76894,80.2311,99.9973
750,751,2170,1954,3987,155.591,73.8595,16.1405,99.9807
751,752,2465,2506,4007,172.49200000000005,9.66328,80.3367,99.9165
752,753,2185,1627,3990,350.772,8.61078,81.3892,99.9858
753,754,3410,1065,3997,345.867,58.1951,31.8049,99.9772
754,755,11193,1694,4031,345.968,0.15424300000000002,89.8458,99.2358
755,756,1203,1312,3979,343.655,6.66595,83.334,99.9827
756,757,640,2142,3982,184.594,8.39366,81.6063,99.9973
757,758,1977,1408,3989,347.827,5.96114,84.0389,99.9713
758,759,1280,349,3989,343.986,36.1798,53.8202,99.9491
759,760,17444,1536,4043,156.81799999999996,78.9437,11.0563,99.4928
760,761,635,1352,3987,352.329,10.5506,79.4494,99.8479
761,762,2834,1812,4005,340.48800000000006,10.2939,79.7061,99.767
762,763,52370,960,4120,104.084,79.4882,10.5118,96.0039
763,764,13492,2008,4062,355.085,6.00549,83.9945,99.8081
764,765,9532,1362,4060,341.237,24.8876,65.1124,99.9345
765,766,17446,361,4068,355.023,7.15624,82.8438,99.9188
766,767,18097,243,4106,159.053,45.6339,44.3661,99.9671
767,768,1740,3138,4034,339.485,62.3237,27.6763,99.9552
768,769,1488,1845,4045,348.711,49.3341,40.6659,99.9943
769,770,5949,1110,4059,348.527,30.3206,59.6794,99.9002
770,771,1257,1138,4030,344.11800000000005,54.0635,35.9365,99.9805
771,772,23649,126,4121,354.9430000000001,51.288,38.712,99.9491
772,773,1629,1786,4056,170.05700000000004,2.10245,87.8976,99.9933
773,774,19470,3102,4149,140.941,64.9626,25.0374,99.9795
774,775,16973,2315,4120,335.615,44.4246,45.5754,99.9672
775,776,673,2522,4088,169.582,12.2245,77.7755,99.9702
776,777,1489,2219,4082,182.09,1.56044,88.4396,99.9658
777,778,5093,1956,4098,355.9369999999999,4.73303,85.26700000000002,99.7567
778,779,13085,1886,4145,355.341,7.82468,82.1753,99.8671
779,780,931,2489,4096,172.19799999999995,11.0575,78.9425,99.9889
780,781,2000,1209,4091,352.8830000000001,8.35266,81.6473,99.994
781,782,1414,1505,4089,352.856,7.20875,82.7913,99.6144
782,783,7258,2958,4116,337.041,61.4962,28.5038,99.9613
783,784,2560,1568,4104,160.304,1.19355,88.8064,99.965
784,785,13301,1738,4126,344.845,14.2895,75.7105,99.9499
785,786,4627,1419,4126,170.774,4.16959,85.8304,99.9755
786,787,1008,2189,4102,6.21324,1.0290700000000002,88.9709,99.9598
787,788,2834,3178,4173,139.273,66.1161,23.8839,99.929
788,789,883,852,4111,342.5680000000001,12.5629,77.4371,99.7967
789,790,11030,1230,4143,324.285,79.2868,10.7132,99.9459
790,791,1408,1553,4129,169.36900000000003,1.64799,88.352,99.9965
791,792,814,2146,4125,187.672,4.15495,85.8451,99.9915
792,793,107774,531,4289,164.40099999999995,37.0058,52.9942,100.003
793,794,21581,2869,4192,161.44899999999996,47.1614,42.8386,99.9914
794,795,636,1357,4129,350.11,14.053,75.947,99.9833
795,796,9764,2479,4160,158.921,1.59921,88.4008,98.8187
796,797,13851,1510,4193,165.785,20.2185,69.7815,99.9798
797,798,16171,2158,4197,165.053,55.0209,34.9791,99.8511
798,799,1929,1991,4145,164.222,53.2128,36.7872,99.9665
799,800,1585,2644,4158,164.981,66.161,23.839,99.996
800,801,1173,2593,4160,151.122,1.33253,88.6675,99.9893
801,802,4839,3026,4172,17.3416,85.5425,4.45747,99.9956
802,803,2956,2062,4166,341.36,67.5678,22.4322,99.9934
803,804,22393,1707,4215,344.472,70.9688,19.0312,99.9252
804,805,3282,1370,4195,169.106,9.29672,80.7033,99.755
805,806,775,986,4175,343.384,11.4562,78.5438,99.9798
806,807,1417,2001,4188,353.05800000000005,66.2448,23.7553,98.9952
807,808,582,1311,4177,351.905,4.15864,85.8414,99.9939
808,809,82791,1382,4383,164.107,10.6273,79.3727,95.3464
809,810,4939,1238,4212,347.231,7.32684,82.6732,99.9899
810,811,4347,2466,4221,343.547,1.27686,88.7231,99.3939
811,812,8354,2278,4248,170.493,62.4077,27.5923,99.9885
812,813,3558,2675,4224,179.81,3.76801,86.23200000000001,99.9992
813,814,1355,1108,4209,146.07399999999996,70.2628,19.7372,99.8644
814,815,86060,200,4387,337.061,57.3599,32.6401,94.1804
815,816,7203,848,4259,156.165,65.9503,24.0497,99.9649
816,817,1558,1168,4212,171.791,0.93354,89.0665,99.9833
817,818,2447,2341,4217,168.165,56.0942,33.9058,99.9418
818,819,1066,1863,4217,161.109,15.1336,74.8664,99.9781
819,820,637,2998,4214,334.371,9.4361,80.5639,99.9967
820,821,17144,3074,4310,337.13,8.03497,81.965,99.5315
821,822,9544,2705,4256,177.055,3.934180000000001,86.0658,99.9957
822,823,504,1051,4220,155.968,68.1154,21.8846,99.9189
823,824,9432,1001,4271,165.891,24.1124,65.8876,99.9893
824,825,4741,1333,4249,166.167,18.4323,71.5677,99.9837
825,826,2154,2028,4234,350.526,30.0313,59.9687,99.9945
826,827,1948,2575,4245,339.13,29.9747,60.0253,99.9919
827,828,22986,1046,4345,334.6740000000001,85.6005,4.39953,99.6783
828,829,88336,1940,4423,341.521,38.6451,51.3549,99.942
829,830,1618,2205,4257,347.636,4.38786,85.6121,99.9955
830,831,2170,2522,4258,350.691,32.8669,57.1331,99.9934
831,832,7602,2065,4282,351.256,68.6069,21.3931,99.99
832,833,1837,2980,4276,335.746,9.7622,80.2378,99.995
833,834,1049,2393,4273,350.1880000000001,42.5415,47.4585,99.7098
834,835,14126,2812,4342,173.02900000000002,57.786,32.214,99.9982
835,836,1326,1628,4277,155.241,20.2783,69.7217,99.5276
836,837,6335,2903,4302,170.90599999999995,3.06694,86.9331,99.8654
837,838,2816,1726,4293,157.63299999999995,20.9306,69.0694,99.9807
838,839,1956,1577,4289,155.42600000000004,68.0894,21.9106,99.9944
839,840,6434,2657,4324,352.17,10.5951,79.4049,99.9936
840,841,5201,2366,4309,347.476,29.8579,60.1421,99.9909
841,842,141152,802,4522,350.8730000000001,10.9975,79.0025,96.4982
842,843,1224,2168,4287,352.546,35.5899,54.4101,99.9726
843,844,117234,2543,4463,168.479,58.2915,31.7085,35.1329
844,845,14192,1689,4358,160.83100000000005,35.62,54.38,99.9719
845,846,887,3197,4307,323.4,10.9606,79.0394,99.8902
846,847,713,2244,4311,355.527,5.79938,84.2006,99.9993
847,848,7525,2189,4341,160.595,64.0774,25.9226,99.9816
848,849,2895,2294,4340,351.945,11.2175,78.7825,99.9862
849,850,6714,1582,4353,164.33700000000005,21.7097,68.2903,99.7025
850,851,1240,2994,4357,345.606,9.24981,80.7502,99.9612
851,852,3864,2949,4369,171.63,25.0135,64.9865,99.9675
852,853,2727,2125,4370,153.01,14.725,75.275,99.9951
853,854,683,2722,4364,351.338,27.4159,62.5841,99.9975
854,855,4392,2083,4404,186.867,54.0423,35.9577,99.9956
855,856,2703,1449,4399,294.652,85.4177,4.58234,99.9936
856,857,2557,3205,4414,6.09687,37.7662,52.2338,98.8589
857,858,610,2670,4380,352.372,28.266,61.734,99.9574
858,859,21258,3043,4445,354.199,30.4359,59.5641,99.2461
859,860,11337,2224,4436,165.96,61.6026,28.3974,99.9261
860,861,727,3141,4408,354.43,29.747,60.253,99.9229
861,862,1840,1148,4430,334.038,4.77398,85.226,99.9978
862,863,1828,2879,4438,351.228,22.4978,67.5022,99.9853
863,864,2082,1670,4432,334.88699999999994,77.8198,12.1802,99.9937
864,865,1151,2142,4433,170.322,72.6461,17.3539,99.9973
865,866,6122,1224,4457,334.531,4.80197,85.198,99.9964
866,867,1383,1733,4428,176.065,3.64246,86.3575,99.996
867,868,60778,316,4617,347.589,62.5994,27.4006,99.8392
868,869,913,2823,4439,350.7030000000001,21.3394,68.6606,99.9914
869,870,6376,1297,4491,309.552,85.6669,4.33314,99.3912
870,871,766,324,4457,336.011,62.7636,27.2364,99.9667
871,872,6469,2849,4505,352.36300000000006,29.6152,60.3848,99.9626
872,873,1821,1712,4469,162.653,37.271,52.729,99.9744
873,874,522,1662,4463,10.2083,74.9492,15.0508,99.201
874,875,2191,2313,4494,0.6274069999999999,9.16644,80.8336,99.9736
875,876,39179,2973,4581,171.9,50.7532,39.2468,99.1785
876,877,2464,73,4507,172.884,58.0685,31.9315,99.7635
877,878,11156,1726,4520,357.409,57.8819,32.1181,99.9731
878,879,941,3145,4503,173.795,10.2151,79.7849,99.9596
879,880,11692,1354,4551,352.646,8.22441,81.7756,99.9114
880,881,17486,1106,4559,354.362,16.8152,73.1848,66.6809
881,882,2527,2219,4517,0.619001,8.689,81.311,99.9894
882,883,1097,2153,4522,171.232,15.6703,74.3297,99.9093
883,884,760,3211,4518,167.67700000000005,56.3173,33.6827,99.9198
884,885,73510,1761,4663,349.9890000000001,11.8562,78.1438,77.8079
885,886,506,3148,4542,175.16299999999995,9.37316,80.6268,99.9371
886,887,1176,1579,4548,354.861,82.0042,7.9957600000000015,99.8223
887,888,3741,2796,4578,173.34900000000005,13.379,76.62100000000002,99.9512
888,889,1125,3205,4566,173.87900000000005,60.6451,29.3549,99.8498
889,890,9206,88,4610,157.35299999999995,65.2436,24.7564,99.9376
890,891,1201,2144,4571,188.44,0.15466300000000002,89.8453,99.9883
891,892,3900,1245,4591,177.495,1.75188,88.2481,99.9982
892,893,3553,2082,4598,2.37984,3.75792,86.2421,99.9809
893,894,2251,2772,4613,353.439,43.8276,46.1724,99.92
894,895,9915,1476,4628,140.404,82.6989,7.301139999999998,99.9527
895,896,2012,3176,4614,170.235,62.1925,27.8075,99.8185
896,897,783,3127,4588,339.997,63.8739,26.1261,99.9935
897,898,822,1447,4598,359.186,6.53635,83.4636,99.9804
898,899,2370,173,4604,167.053,63.2616,26.7384,99.924
899,900,1577,2347,4602,5.79649,3.38117,86.6188,99.9688
900,901,1198,1188,4606,175.108,1.10402,88.896,99.9977
901,902,531,2824,4605,176.419,9.61063,80.3894,99.9965
902,903,18526,2008,4691,172.843,3.4701800000000005,86.5298,99.9809
903,904,3229,546,4637,148.982,30.8795,59.1205,99.9947
904,905,72945,1212,4704,181.557,26.3418,63.6582,99.8829
905,906,19372,2501,4686,183.778,1.40838,88.5916,99.9172
906,907,10834,2346,4696,168.605,7.65762,82.3424,99.9191
907,908,628,2648,4632,177.53400000000005,7.2534399999999986,82.7466,99.9968
908,909,2193,2690,4653,182.718,5.33202,84.66799999999998,99.9981
909,910,16583,2767,4699,16.6667,75.9042,14.0958,99.9412
910,911,21794,685,4726,172.829,33.854,56.146,99.6553
911,912,2850,1563,4679,357.849,26.0396,63.9604,99.9745
912,913,1212,2645,4662,310.273,79.7479,10.2521,99.9958
913,914,1232,2964,4666,343.161,70.1276,19.8724,99.9848
914,915,29296,2188,4741,335.94199999999995,64.1719,25.8281,99.9778
915,916,8186,1510,4726,0.206179,27.6166,62.3834,99.9893
916,917,2223,520,4694,172.866,6.88192,83.1181,99.9947
917,918,2265,478,4712,149.94299999999996,30.7974,59.2026,99.9812
918,919,7387,2944,4704,173.29,31.722,58.278,99.9795
919,920,11546,368,4735,13.5632,74.8255,15.1745,99.9134
920,921,2115,361,4700,359.959,58.3431,31.6569,99.9936
921,922,13593,3116,4739,339.166,70.5719,19.4281,99.9256
922,923,747,2540,4706,173.87599999999995,6.98798,83.012,99.9903
923,924,7543,2596,4751,181.022,7.0801,82.9199,99.9809
924,925,2326,1592,4744,185.233,4.16175,85.8382,99.9946
925,926,2042,2861,4740,354.6090000000001,1.05345,88.9465,99.997
926,927,3533,534,4764,353.021,64.8167,25.1833,99.8558
927,928,3101,2705,4761,356.6980000000001,2.73895,87.2611,99.9405
928,929,8877,2945,4784,344.374,70.3716,19.6284,99.9688
929,930,892,2510,4770,174.433,6.05405,83.9459,99.9733
930,931,688,1577,4788,181.776,59.0626,30.9374,99.904
931,932,1059,2807,4793,349.834,42.6968,47.3032,99.7972
932,933,1378,2727,4796,355.552,3.55536,86.4446,99.979
933,934,661,2348,4796,165.71,7.85532,82.1447,99.9713
