,Grain No.,Size [Pixel],center x-coordinate,center y-coordinate,mean azimuth [degree],mean latitude [degree],mean colatitude [degree],Regelungsgrad [%]
0,1,1792,430,179,133.299,68.1619,21.8381,99.9929
1,2,1624,387,196,141.851,49.0595,40.9405,99.9702
2,3,1388,654,205,137.645,40.2055,49.7945,99.9749
3,4,1213,491,182,133.963,67.7937,22.2063,99.946
4,5,56275,3220,298,138.39600000000002,13.2261,76.7739,99.64
5,6,40834,993,296,141.714,36.6831,53.3169,66.5014
6,7,7456,580,210,317.043,23.1748,66.8252,99.9624
7,8,3176,702,209,317.019,64.155,25.845,99.9417
8,9,14780,1172,234,135.268,5.997730000000002,84.0023,99.6185
9,10,5265,1295,202,58.3867,76.1501,13.8499,99.9942
10,11,44803,1556,311,139.401,39.5908,50.4092,71.9195
11,12,21267,1927,275,128.059,4.75131,85.2487,99.9794
12,13,6284,2058,237,294.046,81.5675,8.43253,99.956
13,14,1052,1440,210,138.631,16.8291,73.1709,99.9881
14,15,8326,1791,229,310.269,17.3847,72.6153,99.9818
15,16,5797,1677,238,316.592,5.01015,84.9898,98.7545
16,17,12217,2238,240,142.941,39.9586,50.0414,99.7077
17,18,4110,2419,228,317.653,27.4678,62.5322,99.9778
18,19,1910,3437,245,310.945,79.8862,10.1138,99.4424
19,20,15549,1365,277,139.102,10.8567,79.1433,99.9972
20,21,27884,2444,300,320.032,14.218,75.782,99.064
21,22,10182,2630,261,317.367,64.8737,25.1263,99.9448
22,23,7758,2774,248,316.092,8.18172,81.8183,99.009
23,24,6466,864,253,311.117,65.5151,24.4849,99.9286
24,25,5198,3548,301,137.895,41.0924,48.9076,99.6207
25,26,750,3145,240,118.264,77.6613,12.3387,99.9791
26,27,4039,2902,256,135.935,34.0423,55.9577,99.9847
27,28,1846,365,254,138.513,4.6141,85.3859,99.9728
28,29,17297,533,312,312.858,51.2882,38.7118,99.8831
29,30,1048,667,257,324.5,42.8151,47.1849,99.9882
30,31,714,3032,237,129.797,73.4861,16.5139,99.9785
31,32,1821,936,263,325.326,40.2051,49.7949,99.991
32,33,1860,764,267,268.367,79.5559,10.4441,99.9945
33,34,1390,612,270,318.913,41.0658,48.9342,99.9767
34,35,31786,2107,347,304.394,57.2173,32.7827,99.7773
35,36,5128,709,300,308.892,68.8408,21.1592,99.1602
36,37,19857,1195,341,328.042,40.1219,49.8781,99.9763
37,38,1206,1817,302,297.957,83.2451,6.75494,99.9641
38,39,11913,1776,358,141.54399999999995,11.2526,78.7474,99.9591
39,40,1197,2866,300,264.192,81.3275,8.67254,99.9977
40,41,1386,640,302,134.064,2.43951,87.5605,99.998
41,42,30286,2772,375,140.95,41.6483,48.3517,99.877
42,43,3423,2946,313,137.611,61.4449,28.5551,99.9806
43,44,13997,828,356,291.684,80.12,9.88003,99.8887
44,45,15472,2251,402,134.096,7.238010000000001,82.762,99.9117
45,46,4366,928,330,143.999,2.05064,87.9494,99.8697
46,47,5880,3475,343,315.416,17.0599,72.9401,99.9908
47,48,760,356,321,317.472,32.7045,57.2955,99.9811
48,49,2699,1705,339,316.954,21.2282,68.7718,99.9875
49,50,3494,3558,393,139.518,36.4954,53.5046,98.7187
50,51,5615,2571,365,317.707,11.7843,78.2157,99.989
51,52,641,2891,343,306.964,61.1049,28.8951,99.9948
52,53,575,443,341,159.186,63.05,26.95,99.9748
53,54,763,649,339,253.067,87.8318,2.16821,99.9941
54,55,8450,1880,391,307.525,60.0691,29.9309,99.9686
55,56,15709,3134,438,137.518,56.8523,33.1477,99.7042
56,57,6049,675,379,139.32,19.3688,70.6312,99.9623
57,58,4886,1352,370,137.751,42.5833,47.4167,99.9878
58,59,1152,1281,370,147.616,14.3156,75.6844,99.9926
59,60,26397,3417,444,143.91899999999995,29.1794,60.8206,99.9514
60,61,8199,2407,401,145.356,64.2175,25.7825,99.9748
61,62,1619,800,372,137.471,32.465,57.535,99.9989
62,63,15199,2956,414,332.741,60.4616,29.5384,99.9886
63,64,2081,3245,404,252.118,80.0837,9.91633,99.9886
64,65,8726,3658,431,134.054,6.925489999999999,83.0745,99.9752
65,66,2152,464,392,261.79200000000003,79.8642,10.1358,99.9972
66,67,2071,1700,387,138.619,59.9069,30.0931,99.9398
67,68,3003,1959,403,141.02200000000005,27.2086,62.7914,99.9906
68,69,10659,2498,456,179.15200000000004,75.695,14.305,99.9507
69,70,17299,1424,439,135.75,69.0171,20.9829,99.3964
70,71,9370,2340,443,144.914,24.6599,65.3401,99.9947
71,72,14431,475,478,313.878,13.8632,76.1368,77.6345
72,73,4130,2619,414,163.529,74.0215,15.9785,99.9831
73,74,9747,588,449,133.863,59.5554,30.4446,99.9856
74,75,1914,727,416,140.66299999999998,31.9067,58.0933,99.9802
75,76,35976,1063,518,137.151,0.691154,89.3088,71.8301
76,77,612,1306,409,312.77,34.0514,55.9486,99.9735
77,78,1731,3191,418,305.408,25.1013,64.8987,99.9954
78,79,1502,800,413,132.56,4.3734,85.6266,99.9544
79,80,4116,1278,452,149.484,61.4192,28.5808,99.9765
80,81,10759,2701,478,317.217,21.3746,68.6254,99.9912
81,82,12356,1727,468,319.365,26.3206,63.6794,99.996
82,83,560,2039,422,310.6690000000001,1.89235,88.1077,99.7881
83,84,5201,3077,464,138.041,11.017,78.983,99.9784
84,85,6255,762,464,136.554,9.46812,80.5319,99.9577
85,86,1420,2002,455,311.138,2.83054,87.1695,99.9177
86,87,2110,1618,452,129.53799999999998,1.17706,88.8229,99.9964
87,88,3067,1846,459,318.903,6.51277,83.4872,99.9482
88,89,902,680,443,318.051,3.81843,86.1816,99.9949
89,90,3285,3585,463,315.019,9.02119,80.9788,99.9665
90,91,2499,3243,463,327.782,38.5469,51.4531,99.9921
91,92,2953,2589,474,326.873,6.58475,83.4153,99.986
92,93,1514,2052,472,311.185,29.8152,60.1848,99.9666
93,94,16221,2145,508,169.071,88.3144,1.68563,99.5919
94,95,3498,856,469,334.689,37.4407,52.5593,99.9823
95,96,917,1524,458,311.298,14.4657,75.5343,99.9832
96,97,4188,1941,477,281.819,82.305,7.695010000000001,99.9944
97,98,3778,1198,485,145.635,72.1214,17.8786,99.9105
98,99,13233,2889,520,156.063,61.1052,28.8948,88.73
99,100,37991,742,600,172.077,88.2371,1.76292,95.0871
100,101,13044,1552,570,141.444,22.2069,67.7931,99.9736
101,102,3617,2998,512,145.115,57.1949,32.8051,99.938
102,103,5422,1621,516,140.72799999999998,2.98022,87.0198,99.9688
103,104,598,1501,487,312.013,7.800960000000001,82.199,99.9779
104,105,2499,631,509,131.92,2.12154,87.8785,99.9488
105,106,10438,1917,528,141.866,29.8563,60.1437,98.1604
106,107,1848,1364,503,313.887,27.1403,62.8597,99.9765
107,108,3365,2410,518,139.012,1.00453,88.9955,99.8781
108,109,3531,3318,519,344.662,82.9437,7.05632,99.9343
109,110,626,1475,505,312.784,28.8241,61.1759,99.7201
110,111,32322,1346,666,255.916,85.25299999999999,4.74696,99.8738
111,112,1707,3700,533,304.5490000000001,53.3981,36.6019,99.9339
112,113,1606,3261,517,317.454,1.70606,88.2939,99.9105
113,114,16931,2609,559,318.834,24.9473,65.0527,99.3516
114,115,550,2780,518,136.263,9.04812,80.9519,99.9548
115,116,557,3584,510,137.107,14.9134,75.0866,99.9823
116,117,9079,3432,555,143.093,51.5166,38.4834,99.846
117,118,4432,3067,538,140.811,19.7375,70.2625,99.9697
118,119,5833,3595,546,147.417,69.0904,20.9096,99.8401
119,120,2182,2289,534,317.592,46.1172,43.8828,67.8729
120,121,5314,568,554,142.89600000000004,18.7389,71.2611,99.9705
121,122,2179,1703,538,176.87400000000005,87.4694,2.53061,99.5583
122,123,11331,1824,614,343.6430000000001,69.6619,20.3381,99.9591
123,124,6351,1403,565,308.445,14.2529,75.7471,99.9941
124,125,7945,943,582,319.7340000000001,45.9383,44.0617,99.9452
125,126,1850,895,541,137.97,7.5563,82.4437,99.9953
126,127,23866,2714,645,138.317,56.6081,33.3919,99.7662
127,128,838,641,554,317.509,21.5312,68.4688,99.9961
128,129,9936,493,598,273.16200000000003,85.2999,4.70011,99.9838
129,130,23689,3204,611,333.661,68.2321,21.7679,99.8455
130,131,4938,2195,579,142.72299999999996,14.1977,75.8023,99.9753
131,132,49854,2212,742,315.918,22.6321,67.3679,99.303
132,133,2536,3340,573,309.151,12.3965,77.6035,99.9817
133,134,17011,1171,638,314.22,48.4955,41.5045,99.9915
134,135,957,2504,567,179.42,80.7998,9.20022,99.8704
135,136,12641,1490,641,308.915,48.2518,41.7482,85.5626
136,137,1613,2339,577,177.484,84.1283,5.87173,99.9169
137,138,15368,2005,640,307.687,44.7824,45.2176,99.8001
138,139,4401,2402,583,313.236,11.3662,78.6338,99.8523
139,140,2367,3014,586,317.378,0.743446,89.2566,99.9272
140,141,612,2253,567,164.68400000000003,84.1805,5.81955,99.9928
141,142,1432,356,577,139.843,7.6959,82.3041,99.9529
142,143,2700,1641,583,315.735,25.1395,64.8605,99.9544
143,144,12856,1735,632,133.855,24.0728,65.9272,99.8416
144,145,629,3286,583,129.895,64.0724,25.9276,99.8336
145,146,3601,2483,605,314.283,17.7472,72.2528,99.9776
146,147,1123,1893,588,316.2920000000001,35.6244,54.3756,99.9882
147,148,2577,2292,605,315.536,8.55984,81.4402,99.9582
148,149,8446,2920,604,335.469,62.4856,27.5144,99.9631
149,150,4199,3549,600,140.83,0.621414,89.3786,99.9978
150,151,72055,975,750,138.032,22.2571,67.7429,99.0805
151,152,12276,3410,659,120.768,63.0467,26.9533,99.9771
152,153,1753,417,629,311.801,7.19371,82.8063,99.9666
153,154,1340,1080,632,309.218,57.5256,32.4744,99.9723
154,155,1866,363,630,311.013,7.07442,82.9256,99.8577
155,156,1471,1619,631,317.628,16.0356,73.9644,99.9974
156,157,900,2555,629,239.898,86.27,3.72998,99.9894
157,158,4198,2414,642,312.488,39.6061,50.3939,99.9904
158,159,8808,3527,680,163.407,78.9212,11.0787,87.9974
159,160,1511,1902,645,139.09,83.8843,6.11566,99.9816
160,161,12597,3072,681,130.61,62.1509,27.8491,99.9823
161,162,61313,564,779,156.219,76.4916,13.5084,99.3036
162,163,3431,2262,653,141.783,16.1836,73.8164,99.9835
163,164,6838,1947,691,311.816,29.4716,60.5284,99.9921
164,165,3523,2338,661,318.382,38.3413,51.6587,99.9973
165,166,928,3360,645,142.946,1.34186,88.6581,99.9978
166,167,3138,2839,652,318.618,75.8757,14.1243,99.9784
167,168,659,2897,645,131.38,50.9958,39.0042,99.9601
168,169,1601,1654,664,308.358,83.7969,6.20311,99.9924
169,170,1646,2523,692,13.9386,85.1935,4.8065,99.9144
170,171,792,3737,667,315.8640000000001,51.7159,38.2841,99.8864
171,172,4001,3159,690,146.638,70.2516,19.7484,99.994
172,173,5435,2967,695,318.035,17.3935,72.6065,99.6793
173,174,3149,2575,684,320.152,82.8479,7.1521300000000005,99.9725
174,175,2865,455,687,141.843,18.8305,71.1695,99.2847
175,176,3302,1445,708,129.067,23.9458,66.0542,99.9711
176,177,9459,2443,720,316.61,27.2897,62.7103,99.9841
177,178,3837,3609,712,319.325,50.4168,39.5832,99.9559
178,179,7550,386,731,317.039,16.2538,73.7462,99.8871
179,180,5016,1601,707,141.969,51.6164,38.3836,99.9903
180,181,3267,816,713,316.423,17.6843,72.3157,99.9985
181,182,1397,2924,694,294.666,77.2487,12.7513,99.9858
182,183,1169,2408,693,130.972,13.3556,76.6444,99.991
183,184,13142,3308,749,129.042,37.8381,52.1619,99.9916
184,185,526,1694,690,316.715,8.708789999999999,81.2912,99.9977
185,186,9213,1869,736,134.458,32.9098,57.0902,99.9957
186,187,784,2836,700,304.466,78.3448,11.6552,99.9555
187,188,12118,1710,748,324.308,65.0412,24.9588,99.8789
188,189,3484,1264,762,136.32299999999998,25.597,64.403,99.962
189,190,4606,2260,748,142.335,19.9863,70.0137,99.9916
190,191,42994,2744,820,319.133,2.31014,87.6899,99.8151
191,192,1039,1157,722,144.825,0.917213,89.0828,99.9988
192,193,1029,3399,729,217.302,85.9193,4.08075,99.978
193,194,6014,3545,754,153.529,44.8095,45.1905,99.9693
194,195,2551,2601,744,140.512,72.8604,17.1397,99.9935
195,196,2667,3209,738,108.106,83.4999,6.5000800000000005,99.9926
196,197,1388,2545,737,315.216,8.41602,81.584,99.9785
197,198,2122,1550,742,14.3506,88.2139,1.78608,99.9628
198,199,17765,1292,820,314.8040000000001,7.79081,82.2092,99.7783
199,200,1066,1192,745,126.62,77.0701,12.9299,99.9964
200,201,2469,3000,751,314.9770000000001,56.3213,33.6787,99.9469
201,202,3124,437,777,138.411,15.3439,74.6561,99.9779
202,203,43454,2135,892,142.416,34.9443,55.0557,99.8242
203,204,1369,2891,756,313.332,59.3509,30.6491,99.996
204,205,27388,3070,828,309.771,28.9267,61.0733,99.986
205,206,889,1479,760,118.11,62.3171,27.6829,99.9675
206,207,3406,3417,776,317.241,16.0923,73.9077,99.9815
207,208,1307,3482,764,318.089,39.8476,50.1524,99.9801
208,209,2700,1982,777,137.483,26.164,63.83600000000001,99.9751
209,210,787,1609,768,318.812,6.43123,83.5688,99.9222
210,211,918,3238,774,123.901,60.0889,29.9111,99.9891
211,212,20652,1864,857,313.942,60.6239,29.3761,99.4616
212,213,5913,2555,809,136.15,34.7189,55.2811,99.9457
213,214,2027,3731,840,132.701,20.2021,69.7979,99.7315
214,215,12860,1549,843,135.433,25.3716,64.6284,99.9837
215,216,1363,2416,793,130.528,11.1881,78.8119,99.9924
216,217,7345,2911,835,311.43,70.4499,19.5501,99.9715
217,218,2542,1941,811,144.965,35.8333,54.1667,99.9788
218,219,10907,3623,845,311.832,20.5518,69.4482,99.8338
219,220,760,1465,794,284.2920000000001,86.1719,3.82812,99.9898
220,221,31157,2496,936,142.654,65.3674,24.6326,92.9458
221,222,9755,3205,853,157.062,79.9394,10.0606,99.9851
222,223,2378,701,808,141.559,39.0108,50.9892,99.9971
223,224,4486,3465,824,152.089,45.0638,44.9362,99.2547
224,225,647,632,800,142.265,47.3686,42.6314,99.9924
225,226,10570,1691,842,315.99,29.3314,60.6686,99.9878
226,227,7377,3376,853,137.871,60.9977,29.0023,99.9904
227,228,5540,668,858,151.547,62.6738,27.3262,99.9956
228,229,26532,1498,1002,315.96,10.2664,79.7336,99.7717
229,230,2206,3537,865,133.71,27.3455,62.6545,99.9693
230,231,9381,2391,876,312.455,69.8858,20.1142,99.9816
231,232,749,3288,833,136.584,2.97412,87.0259,99.9987
232,233,13503,1063,914,321.634,9.20396,80.796,99.9064
233,234,11901,1226,922,140.694,58.615,31.385,99.9785
234,235,1405,1081,856,310.655,25.1341,64.8659,99.9786
235,236,3015,750,874,141.674,85.1927,4.80734,99.9781
236,237,10835,833,908,140.81,7.70335,82.2967,99.9921
237,238,4554,1631,905,311.496,16.7383,73.2617,99.9914
238,239,1293,1157,900,322.495,3.3884199999999995,86.6116,99.9597
239,240,93284,1900,1062,315.28,21.8162,68.1838,51.0381
240,241,579,2942,889,136.68200000000002,3.10763,86.8924,99.9906
241,242,4183,3123,922,137.892,2.73336,87.2666,99.9871
242,243,9584,3538,937,311.92,4.09335,85.9066,99.9807
243,244,2998,1727,911,5.6788,83.8646,6.1353800000000005,99.9916
244,245,2630,3318,947,153.321,54.3882,35.6118,99.9613
245,246,10174,3389,927,313.121,17.7175,72.2825,99.9318
246,247,1284,2767,910,304.849,77.332,12.668,99.9142
247,248,10495,1395,942,132.775,27.7298,62.2702,99.986
248,249,628,352,909,137.327,20.8992,69.1008,99.8897
249,250,5432,3259,945,141.921,51.6563,38.3437,99.8805
250,251,1307,3716,917,137.485,33.1437,56.8563,99.9432
251,252,1545,2598,915,319.377,67.8027,22.1973,99.9778
252,253,639,1315,914,137.571,12.6734,77.3266,99.9936
253,254,18236,944,993,309.777,33.1622,56.8378,99.7618
254,255,2571,440,919,311.396,36.9604,53.0396,99.9703
255,256,27286,2765,1013,314.246,2.5709,87.4291,96.1003
256,257,1869,2944,925,130.61700000000002,8.75131,81.2487,99.9725
257,258,3061,737,948,142.54399999999995,38.6693,51.3307,99.9911
258,259,17748,639,998,136.349,13.4534,76.5466,99.6586
259,260,3725,504,941,137.829,41.3198,48.6802,99.8584
260,261,1218,2833,924,314.619,20.5628,69.4372,99.9828
261,262,4173,3199,964,139.274,11.2237,78.7763,99.7622
262,263,6190,3000,966,134.454,50.9048,39.0952,99.8974
263,264,6881,3622,985,149.53799999999995,43.4815,46.5185,99.1781
264,265,5564,1299,978,282.252,71.4629,18.5371,99.9755
265,266,1186,3738,956,135.591,23.2255,66.7745,99.8789
266,267,6042,380,993,309.2940000000001,5.495,84.505,99.8768
267,268,952,1589,947,312.515,57.3251,32.6749,99.964
268,269,860,1900,942,144.57399999999996,26.8802,63.1198,99.9783
269,270,5125,2895,972,137.088,18.3655,71.6345,99.9709
270,271,8146,2297,979,313.6620000000001,32.075,57.925,99.9903
271,272,779,2373,952,317.576,14.5851,75.4149,99.9964
272,273,4882,556,989,142.835,48.1371,41.8629,99.9706
273,274,6068,1164,991,317.26,41.1723,48.8277,99.4948
274,275,2841,1689,969,136.25,52.65600000000001,37.344,99.9859
275,276,1165,2824,954,140.995,30.8786,59.1214,99.9243
276,277,3698,3103,974,324.046,12.3651,77.6349,99.7087
277,278,2609,1634,973,311.351,28.1286,61.8714,99.9891
278,279,10232,425,1049,138.749,25.6816,64.3184,99.842
279,280,10468,818,1042,155.036,87.9924,2.0076,99.8616
280,281,3246,3446,986,316.4,44.1316,45.8684,99.9745
281,282,1833,1034,990,314.082,46.9421,43.0579,99.9712
282,283,28488,3349,1072,145.922,18.872,71.128,86.8278
283,284,2150,499,1008,316.526,23.5952,66.4048,99.954
284,285,4383,2377,1017,136.005,23.8341,66.1659,99.9885
285,286,2553,2655,1019,171.204,79.2483,10.7517,99.7872
286,287,2810,3718,1016,135.015,0.846367,89.1536,99.9725
287,288,2960,1376,1026,218.633,77.0653,12.9347,97.5391
288,289,15250,3024,1050,325.332,73.7329,16.267,99.145
289,290,17877,2580,1086,132.982,53.2377,36.7623,99.8474
290,291,3277,3537,1024,159.122,60.9156,29.0844,99.8231
291,292,5504,1605,1067,318.265,37.1868,52.8132,99.9387
292,293,7314,3167,1048,305.158,44.5072,45.4928,99.8672
293,294,14676,1089,1067,125.638,10.2824,79.7176,99.5395
294,295,4864,719,1048,140.237,41.2199,48.7801,99.8875
295,296,1535,2189,1048,134.90200000000002,28.0719,61.9281,99.9219
296,297,7233,2305,1074,313.578,6.7564199999999985,83.2436,99.9912
297,298,11856,1230,1114,313.877,30.8016,59.1984,99.9564
298,299,6453,1370,1100,121.832,22.6772,67.3228,99.9527
299,300,563,1649,1046,153.513,70.9007,19.0993,99.9967
300,301,2958,2426,1064,309.008,68.6665,21.3335,99.9109
301,302,5182,2225,1100,132.194,74.574,15.4261,99.8856
302,303,12111,3609,1107,139.207,38.5514,51.4486,99.7835
303,304,5724,3708,1107,134.433,11.7644,78.2356,99.8115
304,305,20901,493,1128,139.70600000000002,52.5344,37.4656,99.7303
305,306,4414,892,1095,313.606,73.5067,16.4933,99.9892
306,307,8610,1674,1123,143.69299999999996,4.24637,85.7536,99.9925
307,308,611,2370,1081,131.88,22.0242,67.9758,99.9774
308,309,3325,3216,1106,308.2340000000001,62.2132,27.7868,99.9875
309,310,9522,973,1154,310.016,10.33,79.67,99.7209
310,311,2404,2170,1102,137.871,0.349991,89.65,99.9931
311,312,6354,2696,1120,318.376,30.6802,59.3198,99.9959
312,313,1343,342,1102,135.971,22.4236,67.5764,99.9505
313,314,1965,708,1116,243.11900000000003,87.615,2.38499,99.9878
314,315,5071,3481,1112,317.913,36.4355,53.5645,99.9489
315,316,1971,1809,1104,143.119,22.4032,67.5968,99.9696
316,317,4211,3095,1112,135.847,6.73015,83.2699,99.9884
317,318,8680,2880,1155,134.39,48.1455,41.8545,99.9157
318,319,3208,2105,1130,136.38299999999998,2.80771,87.1923,99.9927
319,320,18630,1105,1183,131.469,65.9589,24.0411,99.9712
320,321,1113,2428,1112,187.08,86.8064,3.19359,99.9899
321,322,4649,2928,1134,152.7,29.7902,60.2098,99.9356
322,323,1527,662,1122,139.971,42.7813,47.2187,99.997
323,324,3616,2349,1129,131.32299999999998,72.0971,17.9029,99.9842
324,325,1724,1309,1130,298.899,26.5,63.5,99.9936
325,326,3787,1542,1149,324.8040000000001,57.9444,32.0556,99.9769
326,327,35265,796,1200,318.944,16.2904,73.7096,99.9703
327,328,7436,2775,1160,144.52100000000004,37.6085,52.3915,99.9795
328,329,10739,3064,1182,153.935,24.4294,65.5706,99.9096
329,330,1612,2516,1144,138.127,34.0518,55.9482,99.9808
330,331,1667,1595,1150,142.139,33.8293,56.1707,99.9939
331,332,515,1432,1136,130.125,36.0465,53.9535,99.9919
332,333,7202,2412,1186,312.457,25.1792,64.8208,99.8784
333,334,15628,3246,1188,314.7390000000001,13.8609,76.1391,99.0382
334,335,1823,2264,1146,142.306,2.6612,87.3388,99.997
335,336,12150,562,1192,129.754,58.8422,31.1578,99.9452
336,337,613,2990,1139,144.026,22.7059,67.2941,99.9156
337,338,48171,3471,1333,134.963,64.9257,25.0743,99.2755
338,339,2475,2171,1162,321.373,11.9356,78.0644,99.9835
339,340,5688,2614,1188,145.44,29.1268,60.8732,99.926
340,341,1903,633,1167,315.291,40.2303,49.7697,99.9913
341,342,4975,3544,1179,334.126,57.4869,32.5131,99.9761
342,343,15043,1476,1261,131.418,8.794780000000001,81.2052,85.8987
343,344,14345,1384,1236,315.928,63.8817,26.1183,99.9477
344,345,27720,2488,1310,314.422,16.1956,73.8044,71.6673
345,346,6398,1297,1216,305.4,16.9964,73.0036,99.3119
346,347,9190,2317,1197,308.488,33.8203,56.1797,99.9655
347,348,2704,1853,1185,314.92,12.4571,77.5429,99.7522
348,349,1621,2125,1187,135.358,16.1628,73.8372,99.9746
349,350,2060,3615,1192,322.994,15.0581,74.9419,99.9949
350,351,15606,2927,1251,323.043,31.5852,58.4148,79.8157
351,352,4869,2177,1217,313.093,5.50368,84.4963,99.8224
352,353,1999,344,1205,310.876,56.7709,33.2291,99.9714
353,354,1511,454,1191,325.0440000000001,3.4682699999999995,86.5317,99.9983
354,355,2744,1607,1193,324.541,59.0966,30.9034,99.971
355,356,1366,1951,1191,145.135,20.3372,69.6628,99.9933
356,357,874,1238,1195,306.505,7.316389999999998,82.6836,99.9755
357,358,8212,3141,1241,143.993,25.1581,64.8419,99.9926
358,359,20583,2723,1291,321.092,13.4131,76.5869,98.9909
359,360,9388,3365,1251,327.622,5.8366,84.1634,99.9893
360,361,1138,3648,1211,310.918,65.9399,24.0601,99.9653
361,362,9258,1897,1266,281.085,85.3474,4.65257,99.9709
362,363,4335,950,1235,133.092,1.6647599999999998,88.3352,99.5841
363,364,17442,2209,1295,138.09,13.4359,76.5641,99.6042
364,365,547,2795,1215,321.66,5.939019999999998,84.061,99.887
365,366,4094,1640,1237,320.467,26.9717,63.0283,99.9494
366,367,7431,1200,1259,119.655,11.7728,78.2272,99.6889
367,368,12087,531,1279,328.646,40.0212,49.9788,99.7663
368,369,23286,1939,1353,317.515,23.177,66.82300000000001,87.5117
369,370,640,547,1225,321.613,18.4903,71.5097,99.9904
370,371,8729,2603,1256,141.138,16.5704,73.4296,99.8224
371,372,1833,1714,1243,150.719,56.8553,33.1447,99.8891
372,373,5623,2095,1291,325.9120000000001,11.5364,78.4636,99.7402
373,374,6040,2034,1289,320.366,49.875,40.125,99.995
374,375,2432,2428,1259,142.976,10.8695,79.1305,99.9975
375,376,2920,375,1258,143.95,3.68983,86.3102,99.9312
376,377,1245,1846,1256,309.701,17.6296,72.3704,99.984
377,378,6558,1574,1285,133.828,5.97644,84.0236,99.9753
378,379,24466,1123,1340,137.639,33.7299,56.2701,99.9143
379,380,3922,1780,1268,252.534,79.5484,10.4516,99.9947
380,381,691,734,1260,157.52700000000004,68.0403,21.9597,99.9974
381,382,3900,3279,1281,121.129,82.7201,7.27993,99.9809
382,383,3797,2330,1269,129.30200000000002,38.9857,51.0143,99.9971
383,384,3938,3079,1293,317.101,10.0126,79.9874,99.9754
384,385,15374,713,1333,311.621,47.2674,42.7326,99.9942
385,386,1776,881,1282,136.904,3.14732,86.8527,99.6326
386,387,2930,417,1285,149.283,5.03419,84.9658,99.9562
387,388,2890,1297,1302,303.16,61.4598,28.5402,99.938
388,389,14218,2914,1341,142.569,29.3949,60.6051,99.9324
389,390,831,1654,1277,139.83,49.7385,40.2615,99.9958
390,391,2019,938,1286,319.303,12.0023,77.9977,99.9861
391,392,1338,1725,1290,320.4,26.631,63.369,99.9979
392,393,2393,2380,1310,143.904,37.6171,52.3829,99.9931
393,394,748,3630,1293,140.713,15.5692,74.4308,99.9585
394,395,46337,1755,1433,136.755,1.00606,88.9939,99.7268
395,396,542,1813,1297,133.44799999999998,44.6686,45.3314,99.9836
396,397,7749,3159,1326,139.85,43.1473,46.8527,99.9656
397,398,1579,3720,1322,316.44,19.4802,70.5198,99.9561
398,399,3907,3604,1335,316.091,19.337,70.663,99.5581
399,400,4737,361,1338,140.64,42.2218,47.7782,99.9482
400,401,7661,2615,1341,147.09799999999996,69.2423,20.7577,99.9736
401,402,1782,572,1321,315.589,9.98842,80.0116,99.3054
402,403,23093,889,1368,141.564,16.9006,73.0994,98.4806
403,404,1851,1250,1329,308.692,66.7227,23.2773,99.9181
404,405,551,3696,1321,317.177,19.5381,70.4619,99.967
405,406,2296,2317,1323,325.277,4.84856,85.1514,99.9621
406,407,1463,449,1328,310.475,10.9182,79.0818,99.9975
407,408,3641,3015,1362,142.754,47.5753,42.4247,99.9013
408,409,1831,1778,1323,145.613,46.5656,43.4344,99.9969
409,410,3547,3342,1337,318.315,19.9898,70.0102,98.965
410,411,10367,461,1387,324.563,2.85622,87.1438,99.9027
411,412,3233,3258,1351,147.181,3.4087300000000003,86.5913,99.9973
412,413,614,2801,1331,326.052,16.7687,73.2313,99.9924
413,414,1216,1748,1347,318.66,11.5843,78.4157,99.9827
414,415,982,1524,1345,306.253,34.3445,55.6555,99.9965
415,416,3831,2763,1367,133.58,48.1529,41.8471,99.9971
416,417,19137,624,1402,146.494,53.2403,36.7597,99.9233
417,418,11311,1510,1400,304.469,71.9157,18.0843,98.6731
418,419,995,2148,1355,315.769,53.6567,36.3433,99.9402
419,420,9573,2310,1383,319.425,2.22739,87.7726,99.8922
420,421,3115,1340,1382,288.098,75.2166,14.7834,99.9268
421,422,1787,3205,1368,241.08,84.1464,5.8535900000000005,99.9893
422,423,676,1281,1365,321.13,61.9885,28.0115,99.9737
423,424,512,3145,1365,137.078,38.9698,51.0302,99.9426
424,425,2639,2064,1392,321.025,53.7973,36.2027,99.3298
425,426,930,3565,1376,129.46200000000002,48.7362,41.2638,99.9847
426,427,98082,1468,1680,314.3040000000001,14.8496,75.1504,95.4767
427,428,3438,2567,1398,144.922,5.55865,84.4414,99.9742
428,429,585,3075,1375,135.636,27.7284,62.2716,99.929
429,430,1927,3337,1393,324.306,0.448463,89.5515,99.9838
430,431,34566,3282,1506,319.329,3.96342,86.0366,96.9966
431,432,5442,1074,1412,136.233,14.0745,75.9255,99.9772
432,433,15645,2888,1432,302.073,82.8341,7.16593,99.9132
433,434,4355,3158,1423,144.161,50.4039,39.5961,99.9846
434,435,3317,3616,1407,316.622,47.9523,42.0477,99.9763
435,436,25106,2138,1459,325.129,33.8474,56.1526,99.9542
436,437,721,2460,1399,275.325,78.4036,11.5964,99.9966
437,438,523,3730,1395,287.445,68.2798,21.7202,99.9364
438,439,1335,1297,1398,311.326,15.135,74.865,99.9802
439,440,778,3122,1398,312.453,36.4855,53.5145,99.9874
440,441,1414,356,1414,142.906,2.15224,87.8478,99.7975
441,442,1599,2404,1417,273.78,75.5542,14.4458,99.9975
442,443,2120,3712,1436,312.367,48.1319,41.8681,99.9835
443,444,19353,2705,1462,319.358,32.4898,57.5102,99.9504
444,445,916,401,1417,144.595,51.806,38.194,99.9898
445,446,1309,3047,1430,2.3766,86.353,3.64696,99.9801
446,447,8803,3562,1461,116.967,46.9134,43.0866,99.9688
447,448,3523,1154,1452,139.684,21.0841,68.9159,99.9717
448,449,1462,2290,1441,317.513,13.0318,76.9682,99.9942
449,450,18882,887,1495,313.387,32.9494,57.0506,98.5077
450,451,2279,1001,1453,127.961,55.049,34.951,99.6553
451,452,1423,1636,1449,133.938,52.79600000000001,37.204,99.9924
452,453,560,3095,1439,142.812,23.8539,66.1461,99.9934
453,454,4332,1720,1483,132.4,55.6088,34.3912,99.9554
454,455,1502,2336,1449,313.906,30.1048,59.8952,99.9928
455,456,21406,405,1507,142.778,5.24342,84.7566,99.899
456,457,956,1333,1452,121.109,10.661,79.339,99.9948
457,458,2520,1951,1468,138.399,18.2796,71.7204,99.9912
458,459,7118,1627,1502,320.0,10.6578,79.3422,99.4317
459,460,947,522,1457,300.903,60.0704,29.9296,99.9884
460,461,532,3308,1463,219.13,82.1557,7.84425,99.9041
461,462,983,1555,1461,131.66899999999998,74.5598,15.4402,99.9808
462,463,2297,769,1477,310.396,29.1225,60.8775,99.9849
463,464,9376,1503,1501,187.543,76.6136,13.3864,97.8473
464,465,6444,579,1490,315.607,4.00964,85.9904,80.7976
465,466,7164,1070,1518,132.877,19.4121,70.5879,99.2593
466,467,46823,2349,1539,318.176,14.0453,75.9547,99.1463
467,468,2552,3065,1480,317.0540000000001,31.6038,58.3962,99.9925
468,469,859,1110,1472,309.821,33.5411,56.4589,99.9789
469,470,913,706,1472,306.717,75.8154,14.1846,99.9871
470,471,26273,584,1571,142.166,3.88799,86.11200000000002,99.6884
471,472,3273,2829,1506,132.631,68.8552,21.1448,99.9803
472,473,6564,2587,1523,142.775,67.683,22.317,99.6963
473,474,4145,3675,1535,319.522,72.3532,17.6468,99.8539
474,475,822,3504,1505,329.764,2.11406,87.8859,99.5831
475,476,45448,1966,1629,316.937,47.3557,42.6443,99.894
476,477,3408,3013,1527,316.497,13.1596,76.8404,99.5729
477,478,2265,983,1534,315.045,51.2195,38.7805,97.2439
478,479,20533,3580,1643,313.993,65.018,24.982,99.8009
479,480,2503,1156,1526,309.53,46.1979,43.8021,99.8556
480,481,2630,3413,1525,321.135,7.52078,82.4792,99.746
481,482,886,3098,1521,339.1980000000001,87.9104,2.08961,99.9816
482,483,2998,761,1548,138.55700000000002,41.5919,48.4081,99.9256
483,484,7679,2885,1557,123.644,62.5233,27.4767,99.6343
484,485,29613,2643,1625,139.483,0.4522020000000001,89.5478,99.5193
485,486,4915,1687,1548,162.075,53.6538,36.3462,99.7755
486,487,8126,3517,1572,315.99,53.5824,36.4176,99.8696
487,488,975,3164,1530,311.507,47.5806,42.4194,99.967
488,489,2936,2035,1569,140.493,14.5401,75.4599,99.97
489,490,7344,1173,1575,320.551,15.0904,74.9096,99.9736
490,491,28269,1312,1632,306.938,52.6247,37.3753,99.995
491,492,5206,2781,1588,315.935,24.1156,65.8844,99.6098
492,493,6682,3215,1591,134.285,48.1763,41.8237,99.9278
493,494,21202,3080,1606,138.64700000000002,17.058,72.942,99.5461
494,495,9596,663,1630,312.36,25.7774,64.2226,99.9062
495,496,1759,1017,1570,314.638,50.2499,39.7501,99.9401
496,497,11860,815,1620,314.511,15.985,74.015,99.9727
497,498,2334,890,1587,143.356,10.5399,79.4601,99.9854
498,499,1299,1636,1589,123.246,75.6875,14.3125,99.872
499,500,26106,2267,1657,316.166,42.5331,47.4669,99.9768
500,501,55616,1024,1719,317.08,42.2939,47.7061,96.1063
501,502,4529,3710,1646,126.798,24.3858,65.6142,99.9324
502,503,2038,1707,1594,316.223,17.9626,72.0374,99.9977
503,504,543,3683,1618,130.319,24.2745,65.7255,99.9747
504,505,2673,3458,1623,130.83700000000002,55.4668,34.5332,99.9411
505,506,928,3644,1617,129.689,24.5823,65.4177,99.9698
506,507,4331,384,1632,318.258,15.3195,74.6805,99.9793
507,508,3712,2126,1623,320.994,13.7203,76.2797,99.9879
508,509,2719,724,1639,321.241,4.00657,85.9934,99.9968
509,510,1588,1782,1619,310.898,57.2531,32.7469,99.9741
510,511,14832,2834,1686,134.885,60.756,29.244,99.9818
511,512,28714,1687,1715,319.382,55.0704,34.9296,99.9957
512,513,24056,3382,1685,145.991,14.9897,75.0103,99.9755
513,514,3607,1168,1641,312.008,38.1354,51.8646,99.9948
514,515,2355,2498,1643,130.18200000000002,40.1484,49.8516,99.9657
515,516,5810,448,1656,311.8640000000001,32.2242,57.7758,99.9481
516,517,3476,2930,1650,136.66899999999998,5.4053,84.5947,99.9967
517,518,52084,2970,1833,317.688,0.191772,89.8082,99.5542
518,519,17245,2472,1721,137.153,72.8389,17.1611,99.9614
519,520,1109,335,1673,311.793,32.9166,57.0834,99.9096
520,521,2174,1123,1671,128.107,34.3977,55.6023,99.9759
521,522,15866,3179,1712,324.998,57.4939,32.5061,99.9381
522,523,2564,2669,1679,144.017,22.6155,67.3845,99.9981
523,524,1874,532,1674,142.55200000000005,30.6183,59.3817,99.9538
524,525,1436,3643,1699,316.1,63.0264,26.9736,99.9758
525,526,24900,790,1784,126.682,71.5259,18.4741,99.9439
526,527,2535,2378,1700,315.52,27.6451,62.3549,99.9172
527,528,1818,1203,1693,321.382,13.1366,76.8634,99.9118
528,529,1370,609,1683,144.37,31.4555,58.5445,99.9765
529,530,2142,1252,1701,134.004,34.507,55.493,99.9629
530,531,12470,1832,1755,311.443,53.0007,36.9993,99.9697
531,532,4019,703,1740,321.389,14.7242,75.2758,99.9806
532,533,1505,3091,1694,134.505,33.5322,56.4678,99.9586
533,534,7199,879,1775,134.183,12.3187,77.6813,99.8153
534,535,5044,1911,1723,306.637,60.3209,29.6791,99.979
535,536,61874,477,1838,150.099,53.8438,36.1562,99.9586
536,537,921,1403,1711,133.217,13.4352,76.5648,99.9972
537,538,8547,2302,1753,132.459,70.7794,19.2206,99.9931
538,539,4342,2694,1731,144.514,73.182,16.817999999999998,99.9797
539,540,2930,3055,1733,131.886,63.3515,26.6485,99.9802
540,541,65691,2214,1854,137.618,26.945,63.055,99.8293
541,542,1464,380,1726,310.131,8.49151,81.5085,99.9734
542,543,689,3362,1724,214.441,86.0935,3.9065,99.9765
543,544,99649,1298,1963,314.17,47.2117,42.7883,74.5552
544,545,45245,3419,1827,318.024,12.8632,77.1368,97.9618
545,546,11422,2802,1786,130.352,49.0967,40.9033,99.9909
546,547,1072,642,1741,136.836,66.7046,23.2954,99.9818
547,548,1264,3713,1758,142.68,74.7543,15.2457,99.9347
548,549,19435,3657,1891,135.806,15.1815,74.8185,99.7278
549,550,1069,1404,1747,114.428,74.3913,15.6087,99.9925
550,551,44586,1707,1951,137.97,15.0181,74.9819,95.6312
551,552,601,1988,1757,314.223,80.7228,9.27718,99.9846
552,553,5330,2630,1775,131.655,29.49,60.51,99.9782
553,554,1845,1374,1781,129.631,33.2555,56.7445,99.9961
554,555,742,3680,1784,136.69299999999998,17.4229,72.5771,99.9763
555,556,1523,643,1777,331.344,78.1115,11.8885,99.9926
556,557,12959,2507,1855,305.094,54.5172,35.4828,99.9766
557,558,3102,1956,1794,317.693,22.843000000000004,67.157,98.2072
558,559,3648,953,1824,141.52,38.8383,51.1617,99.4314
559,560,3902,3189,1796,135.213,11.8995,78.1005,99.9882
560,561,8726,1840,1866,317.921,21.8777,68.1223,99.6949
561,562,1626,2351,1802,133.879,70.0438,19.9562,99.998
562,563,2920,2556,1811,302.655,84.4431,5.55693,99.9897
563,564,32725,703,1957,317.253,15.9104,74.0896,99.0647
564,565,5526,2751,1837,141.981,55.3905,34.6095,99.9912
565,566,4083,3572,1830,314.392,50.3493,39.6507,99.9968
566,567,28417,3161,1896,316.2920000000001,10.107,79.893,99.9678
567,568,9921,628,1864,135.80100000000002,13.521,76.479,99.9867
568,569,11700,2655,1875,310.152,41.14,48.86,99.9039
569,570,67240,2003,1999,314.396,27.0335,62.9665,98.5495
570,571,2469,1933,1859,311.178,85.1142,4.88584,99.9695
571,572,2458,2709,1868,316.908,11.4754,78.5246,99.9987
572,573,13668,1369,1906,140.39,32.7395,57.2605,99.9675
573,574,5082,874,1907,139.238,6.02991,83.9701,99.988
574,575,1324,766,1883,134.029,20.0968,69.9032,99.9947
575,576,7752,2799,1926,143.067,35.3663,54.6337,99.9961
576,577,73293,2480,2034,142.363,39.0774,50.9226,99.0525
577,578,6018,3303,1931,253.949,76.9061,13.0939,99.9748
578,579,6164,3405,1930,317.871,13.4532,76.5468,99.9561
579,580,4917,932,1936,136.931,21.8156,68.1844,99.98
580,581,630,419,1913,145.757,34.0613,55.9387,99.9927
581,582,3158,2728,1968,220.576,77.4564,12.5436,99.9867
582,583,6619,413,1999,314.719,57.0685,32.9315,99.9795
583,584,4136,2909,1990,317.309,20.5904,69.4096,99.9696
584,585,1842,1334,1962,139.253,56.7043,33.2957,99.9961
585,586,46475,3444,2051,140.694,31.6075,58.3925,98.7224
586,587,1744,371,1972,142.19899999999996,24.7439,65.2561,99.9299
587,588,20803,1011,2040,134.952,50.0725,39.9275,87.0821
588,589,1801,1587,1971,225.163,84.5073,5.49267,99.9877
589,590,870,2867,1963,237.08,72.6911,17.3089,99.9815
590,591,32377,3082,2059,317.759,47.3819,42.6181,90.2885
591,592,535,346,1970,140.761,25.3581,64.6419,99.9473
592,593,2145,1652,1975,141.888,28.4274,61.5726,99.9691
593,594,6930,1171,1999,103.167,86.9345,3.06554,99.6956
594,595,1926,2640,1987,239.606,77.0641,12.9359,99.9397
595,596,2234,3260,1991,137.716,45.5293,44.4707,99.9675
596,597,2583,858,2010,140.291,34.1463,55.8537,99.9791
597,598,10272,2772,2029,273.685,85.3212,4.67885,99.4025
598,599,738,1667,2014,135.766,25.7351,64.2649,99.9657
599,600,566,2866,2002,139.987,2.40556,87.5944,99.9882
600,601,1955,671,2018,309.9,58.8966,31.1034,99.9545
601,602,5208,2239,2044,141.644,78.5903,11.4097,99.6205
602,603,4391,3336,2035,163.004,76.4514,13.5486,99.3375
603,604,920,1629,2015,321.341,33.6071,56.3929,99.9692
604,605,799,1589,2018,138.599,17.2395,72.7605,99.9835
605,606,548,325,2028,133.726,74.8438,15.1562,99.9898
606,607,31746,842,2135,318.009,12.6477,77.3523,99.888
607,608,505,347,2032,137.593,74.268,15.732,99.977
608,609,38839,445,2151,137.319,48.4127,41.5873,99.9762
609,610,6483,869,2059,141.216,14.0229,75.9771,99.9971
610,611,3386,3266,2054,272.456,73.9319,16.0681,98.8438
611,612,1139,2881,2053,314.796,15.6595,74.3405,99.9705
612,613,9724,1120,2123,117.323,80.8309,9.16914,99.8645
613,614,30052,608,2136,151.49200000000005,47.9842,42.0158,99.9933
614,615,16944,1874,2131,315.767,12.462,77.538,99.1404
615,616,1628,2839,2070,88.962,83.7174,6.28261,99.6954
616,617,7621,2931,2107,122.917,80.5021,9.49794,99.8905
617,618,15440,3621,2121,317.045,13.0002,76.9998,99.9328
618,619,982,1835,2067,139.665,76.9501,13.0499,99.9797
619,620,14593,1345,2139,143.935,16.2911,73.7089,99.954
620,621,1610,2332,2078,144.246,13.9964,76.0036,99.9931
621,622,1761,2703,2083,321.643,11.8727,78.1273,99.9943
622,623,4963,1191,2124,309.903,59.9365,30.0635,99.9954
623,624,1061,1079,2097,321.474,23.2958,66.7042,99.9954
624,625,4132,2215,2102,135.702,31.176,58.824,99.9601
625,626,1960,2127,2109,134.476,79.4206,10.5794,99.9808
626,627,935,2868,2101,93.3253,85.4819,4.51807,99.9867
627,628,39014,1540,2242,147.186,71.8469,18.1531,86.1152
628,629,4020,2783,2143,107.176,82.8399,7.1601,99.9611
629,630,4651,2686,2137,127.026,84.6138,5.38616,99.8972
630,631,767,1904,2107,139.29,5.01705,84.9829,99.9457
631,632,17293,2315,2166,308.474,26.6432,63.3568,99.9464
632,633,1556,3118,2128,322.765,1.26726,88.7327,99.9817
633,634,1153,3149,2140,128.952,36.4831,53.5169,99.996
634,635,25204,3330,2213,116.527,74.1545,15.8455,99.9423
635,636,2042,1706,2144,127.721,80.8555,9.14451,99.998
636,637,7355,3476,2189,314.58,5.7576800000000015,84.2423,99.9216
637,638,5660,2567,2159,303.346,68.0392,21.9608,99.9758
638,639,16222,2054,2219,135.714,3.95039,86.0496,99.4164
639,640,1035,2422,2146,310.865,45.7759,44.2241,99.9664
640,641,536,1823,2148,307.992,14.3716,75.6284,99.99
641,642,1176,2724,2148,301.961,72.2425,17.7575,99.9946
642,643,108223,3109,2468,137.15,16.8857,73.1143,98.2388
643,644,37420,2220,2265,142.68,54.7927,35.2073,99.7694
644,645,2582,996,2168,134.441,36.2898,53.7102,99.9961
645,646,15696,1747,2216,135.106,11.2841,78.7159,99.933
646,647,5557,1049,2202,317.243,25.793000000000006,64.207,99.9787
647,648,11147,1301,2211,317.181,18.8444,71.1556,98.4404
648,649,10117,826,2216,145.116,21.8903,68.1097,99.9952
649,650,1611,2123,2182,142.369,78.5816,11.4184,99.996
650,651,2313,1174,2188,322.753,7.18532,82.8147,99.9875
651,652,20636,1884,2251,316.709,20.2744,69.7256,99.8107
652,653,20773,3102,2227,168.36700000000005,82.8345,7.16545,99.9759
653,654,14544,3573,2225,316.272,41.2538,48.7462,99.9831
654,655,22652,2623,2246,319.126,63.7279,26.2721,99.8069
655,656,29382,742,2281,131.27,45.7473,44.2527,99.9926
656,657,1114,3701,2212,232.013,88.3219,1.67806,99.9805
657,658,5076,2790,2242,309.283,38.788,51.212,99.9919
658,659,1379,325,2229,141.685,69.2041,20.7959,99.9842
659,660,6406,405,2249,144.644,67.1895,22.8105,99.967
660,661,22452,1138,2321,308.827,44.6757,45.3243,99.9698
661,662,10789,1310,2282,135.95600000000002,79.2173,10.7827,99.9579
662,663,2452,3648,2268,281.215,70.47800000000002,19.522,99.9947
663,664,5188,3695,2329,283.678,73.7544,16.2456,99.8197
664,665,80372,2484,2472,137.94899999999998,5.01158,84.9884,98.6782
665,666,16003,996,2311,311.8540000000001,43.396,46.604,55.4222
666,667,27784,3194,2338,137.835,32.0661,57.9339,99.629
667,668,14793,2857,2319,153.697,81.7445,8.255519999999999,99.9593
668,669,4013,1687,2297,140.73,54.1786,35.8214,99.9913
669,670,10116,621,2332,318.1690000000001,23.047,66.953,99.9312
670,671,12053,2372,2349,314.509,25.7298,64.2702,99.997
671,672,15643,465,2354,129.567,35.2913,54.7087,99.9437
672,673,8049,3498,2332,137.497,40.3814,49.6186,99.9495
673,674,539,2739,2292,159.374,81.6292,8.37081,99.9966
674,675,741,315,2307,312.149,15.7091,74.2909,99.9218
675,676,952,1771,2306,139.416,51.8121,38.1879,99.9939
676,677,3793,3651,2327,293.459,74.2958,15.7042,99.9561
677,678,643,342,2309,311.311,16.4259,73.5741,99.961
678,679,568,2645,2303,296.061,70.4706,19.5294,99.9968
679,680,943,2763,2315,320.605,62.5671,27.4329,99.9926
680,681,17632,3370,2357,142.184,9.52711,80.4729,99.9027
681,682,11767,2020,2372,140.593,21.0555,68.9445,99.9749
682,683,11588,3594,2379,322.286,16.1523,73.8477,99.9976
683,684,53898,1613,2442,318.088,2.10918,87.8908,99.4057
684,685,4565,1750,2355,319.046,28.1536,61.8464,99.8989
685,686,16272,2653,2373,327.28,59.0932,30.9068,99.9944
686,687,11827,1833,2388,317.635,51.0171,38.9829,99.9536
687,688,2952,1935,2369,319.858,31.611,58.389,99.951
688,689,7149,378,2367,146.08100000000005,50.0299,39.9701,99.9602
689,690,32719,1297,2415,134.7,29.0733,60.9267,99.939
690,691,777,1341,2341,308.64,60.1468,29.8532,99.9198
691,692,682,1826,2340,138.631,5.24409,84.7559,99.9838
692,693,75480,777,2475,318.224,35.2876,54.7124,99.0595
693,694,22732,2266,2454,152.17700000000005,72.7638,17.2362,99.9518
694,695,1872,2749,2375,138.405,12.8575,77.1425,99.9981
695,696,44680,520,2522,137.654,6.56042,83.4396,99.8768
696,697,14247,2135,2418,318.812,4.221430000000002,85.7786,99.9957
697,698,3895,2799,2403,316.318,35.0884,54.9116,99.9954
698,699,2046,2866,2400,139.529,18.7771,71.2229,99.9893
699,700,1028,2913,2400,144.126,34.9767,55.0233,99.8326
700,701,658,321,2412,154.113,63.0209,26.9791,99.9779
701,702,101154,1197,2637,137.41899999999998,12.1859,77.8141,99.9491
702,703,13734,3547,2467,136.225,74.8277,15.1723,99.7092
703,704,11322,2030,2494,311.873,25.5666,64.4334,99.7354
704,705,84730,1822,2628,138.763,21.9709,68.0291,99.9803
705,706,18837,2734,2486,323.7920000000001,27.8,62.2,99.9889
706,707,5547,3124,2452,142.624,51.8686,38.1314,99.921
707,708,5895,3417,2462,131.804,62.0113,27.9887,99.9793
708,709,1203,3713,2449,315.56,3.4262900000000003,86.5737,99.9702
709,710,1459,2850,2446,129.95600000000002,10.8858,79.1142,99.9803
710,711,561,3342,2453,307.446,29.4792,60.5208,99.9917
711,712,6044,2871,2498,130.969,15.7349,74.2651,99.9731
712,713,9463,360,2531,114.21,71.4866,18.5134,99.9683
713,714,3404,1003,2507,137.134,33.7437,56.2563,99.9111
714,715,7774,1411,2500,311.559,41.0518,48.9482,99.9545
715,716,904,321,2494,114.144,72.8209,17.1791,99.9501
716,717,9486,3565,2536,319.557,42.4706,47.5294,99.9837
717,718,83673,3600,2787,322.387,4.4584800000000016,85.5415,99.91
718,719,677,3362,2503,130.19799999999998,54.4936,35.5064,99.9924
719,720,1656,3410,2523,130.905,48.1299,41.8701,99.997
720,721,2416,939,2529,298.487,67.2881,22.7119,99.9368
721,722,4585,1501,2554,145.917,11.9379,78.0621,99.9758
722,723,6060,1982,2547,301.635,72.5583,17.4417,99.4334
723,724,21496,2148,2592,140.67,22.8832,67.1168,99.8921
724,725,2761,1050,2562,317.659,47.7429,42.2571,99.9849
725,726,1159,1562,2544,131.377,67.9355,22.0645,99.9105
726,727,2315,788,2561,143.067,21.1793,68.8207,99.9953
727,728,4004,2843,2590,320.974,68.1412,21.8588,99.2557
728,729,3776,2771,2573,141.985,38.0796,51.9204,99.9681
729,730,32513,2984,2723,136.2,49.5779,40.4221,99.7781
730,731,24232,3442,2655,138.22,29.9406,60.0594,99.9449
731,732,947,2292,2560,317.1620000000001,3.56151,86.4385,99.9891
732,733,5919,1391,2599,135.261,24.1726,65.8274,99.9959
733,734,1317,961,2587,135.885,28.8708,61.1292,99.9188
734,735,615,989,2577,314.445,26.4102,63.5898,99.9702
735,736,10209,2693,2640,316.615,5.9253300000000015,84.0747,99.9544
736,737,31045,1561,2690,141.814,60.6734,29.3266,99.9877
737,738,2742,927,2619,315.53,26.4954,63.5046,99.9837
738,739,36902,1424,2784,312.673,40.5113,49.4887,99.9163
739,740,45336,2317,2691,147.42600000000004,51.4375,38.5625,99.9773
740,741,161362,2402,3083,308.205,77.5414,12.4586,64.9968
741,742,14306,2017,2672,132.321,43.6054,46.3946,99.9767
742,743,23885,3090,2674,138.67700000000002,38.0558,51.9442,99.9375
743,744,6117,813,2628,144.643,1.10342,88.8966,99.9778
744,745,824,738,2610,319.386,58.0005,31.9995,99.9853
745,746,6987,865,2673,322.933,51.3746,38.6254,99.9514
746,747,8923,394,2654,320.559,48.9326,41.0674,99.9843
747,748,2700,2749,2636,142.709,1.52167,88.4783,99.9963
748,749,879,318,2627,129.415,62.5752,27.4248,99.975
749,750,13530,2832,2692,141.187,37.9618,52.0382,99.9578
750,751,1319,3692,2637,319.3640000000001,4.8226900000000015,85.1773,99.9071
751,752,502,1468,2632,136.849,59.633,30.367,99.9949
752,753,10616,721,2681,153.086,84.7562,5.24383,99.9902
753,754,2478,998,2657,166.39,76.2086,13.7914,99.9894
754,755,1960,625,2662,148.803,54.6422,35.3578,99.9975
755,756,9522,984,2707,134.731,62.9677,27.0323,90.6923
756,757,3993,2520,2701,327.913,81.0874,8.91257,99.9825
757,758,30481,648,2766,140.96200000000005,61.6003,28.3997,99.9723
758,759,60686,440,2821,147.342,54.4555,35.5445,99.9608
759,760,592,313,2689,123.449,64.2105,25.7895,99.9748
760,761,528,3311,2698,84.2796,9.14432,80.8557,99.4705
761,762,9126,3356,2750,128.221,85.5901,4.40989,99.9753
762,763,12629,2143,2752,140.653,14.7169,75.2831,99.9227
763,764,6950,1697,2745,311.221,41.8398,48.1602,99.9883
764,765,1588,1308,2726,294.9840000000001,84.3619,5.63811,99.9924
765,766,1111,2753,2732,318.217,36.3105,53.6895,99.9595
766,767,2972,803,2743,313.295,28.0263,61.9737,99.9645
767,768,7329,3236,2762,133.8,61.7474,28.2526,99.9717
768,769,5881,868,2756,140.429,16.3616,73.6384,99.9964
769,770,73202,956,2931,166.852,83.084,6.916,98.0892
770,771,9067,2697,2796,137.874,5.21633,84.7837,99.9831
771,772,4664,3160,2781,323.016,61.6342,28.3658,99.9934
772,773,8763,1973,2809,132.672,44.8518,45.1482,99.945
773,774,39940,2880,2867,141.408,68.8149,21.1851,99.4819
774,775,1114,951,2771,323.676,51.5053,38.4947,99.9469
775,776,1337,2038,2773,137.29,5.23917,84.7608,99.9782
776,777,23051,2232,2854,136.308,2.73739,87.2626,99.9923
777,778,64485,1618,2907,144.566,71.2764,18.7236,99.7208
778,779,8654,2083,2851,127.901,77.3057,12.6943,99.988
779,780,2889,3306,2824,138.531,47.6135,42.3865,99.982
780,781,700,2322,2838,321.806,13.2579,76.7421,99.7113
781,782,22934,3419,2901,127.486,71.5917,18.4083,99.9801
782,783,7110,3244,2879,318.014,63.0335,26.9665,99.9768
783,784,5941,2379,2865,148.938,78.0894,11.9106,99.9885
784,785,3766,3161,2851,137.143,44.9717,45.0283,99.985
785,786,3869,748,2867,179.487,84.4324,5.56761,99.9741
786,787,26273,1180,2905,141.469,28.877,61.12300000000001,99.9642
787,788,1433,3030,2862,61.8347,88.8337,1.16634,99.9898
788,789,4298,1988,2882,136.18200000000002,3.75359,86.2464,99.997
789,790,1368,677,2872,314.03,56.0517,33.9483,99.9964
790,791,6161,3085,2896,137.69899999999998,1.41592,88.5841,99.995
791,792,1205,817,2885,309.994,16.840999999999998,73.15899999999998,99.9795
792,793,39019,2704,2949,318.59,50.7561,39.2439,99.9951
793,794,1156,2333,2897,144.816,37.7697,52.2303,99.9948
794,795,1543,3182,2900,137.628,61.8373,28.1627,99.9666
795,796,627,3708,2894,313.487,55.37300000000001,34.626999999999995,99.9285
796,797,121175,2122,3079,140.465,39.1465,50.8535,99.7319
797,798,19492,565,2955,141.609,22.8429,67.1571,99.9101
798,799,4058,752,2923,135.39,63.6766,26.3234,99.9969
799,800,9611,2090,2934,322.547,22.9223,67.0777,99.9949
800,801,11537,3361,2977,136.68200000000002,40.0278,49.9722,99.957
801,802,8285,1788,2964,310.041,36.8931,53.1069,99.9878
802,803,5309,805,2961,313.398,43.1421,46.8579,99.9931
803,804,2174,2175,2945,323.757,49.2348,40.7652,99.9951
804,805,11618,3078,2975,295.474,69.4029,20.5971,99.9649
805,806,1775,369,2958,138.16299999999998,23.1351,66.8649,99.6935
806,807,55468,1290,3080,322.631,14.4488,75.5512,99.7714
807,808,1280,1685,2945,314.315,41.2671,48.7329,99.9897
808,809,34352,3148,3075,78.3043,83.7579,6.2421,99.482
809,810,12270,650,3004,135.89700000000002,16.2059,73.7941,99.9385
810,811,3662,3265,2983,134.734,61.1474,28.8526,99.9418
811,812,5687,344,3008,145.776,41.5069,48.4931,85.7709
812,813,8538,1706,3010,317.545,14.7204,75.2796,99.974
813,814,2107,2337,2979,312.375,39.0013,50.9987,99.9957
814,815,8672,1627,3026,153.346,83.0437,6.95632,98.9647
815,816,23278,2890,3061,322.045,8.084660000000001,81.9153,98.9095
816,817,1088,2042,2979,133.834,11.3585,78.6415,99.9918
817,818,39781,738,3115,312.962,13.3664,76.6336,99.9373
818,819,3926,1114,3024,145.47,57.0033,32.9967,99.9289
819,820,1471,3323,3013,320.847,6.14566,83.8543,99.9922
820,821,1310,418,3017,320.263,58.8597,31.1403,99.9926
821,822,17317,2650,3074,311.231,4.34046,85.6595,99.9814
822,823,39165,3561,3184,319.245,22.0033,67.9967,96.5684
823,824,1017,3665,3037,316.735,33.436,56.56399999999999,99.9569
824,825,1032,3567,3023,311.21,29.7781,60.2219,99.9766
825,826,3606,3453,3052,137.512,4.9175,85.0825,99.9552
826,827,9314,490,3070,159.933,83.9665,6.03348,99.918
827,828,813,3690,3060,34.0437,68.3153,21.6847,99.6543
828,829,1099,1056,3051,139.44899999999998,10.9675,79.0325,99.9937
829,830,43794,3231,3279,319.397,1.78355,88.2164,99.3556
830,831,2196,1732,3081,139.79,88.2848,1.71521,99.9779
831,832,1844,384,3068,140.108,3.92234,86.0777,99.9791
832,833,2032,3332,3065,326.993,37.5411,52.4589,99.9499
833,834,718,559,3054,131.043,62.6914,27.3086,99.9793
834,835,5651,2998,3101,135.687,13.1395,76.8605,99.8703
835,836,1990,310,3097,137.345,78.7308,11.2692,99.9901
836,837,2827,339,3101,140.933,78.0184,11.9816,99.9905
837,838,5841,1506,3086,320.776,39.5985,50.4015,99.9519
838,839,84812,1850,3351,134.067,33.6285,56.3715,33.8499
839,840,19298,1644,3144,316.342,15.2467,74.7533,99.9492
840,841,4430,3377,3119,110.859,81.9002,8.099839999999999,99.7826
841,842,986,1121,3103,318.473,36.1785,53.8215,99.9972
842,843,783,3345,3108,315.67,12.559,77.441,99.9885
843,844,31583,435,3236,142.365,42.6207,47.3793,99.9144
844,845,2975,1060,3136,131.343,2.17843,87.8216,99.8284
845,846,1463,3465,3117,319.405,18.0825,71.9175,99.8242
846,847,2033,3295,3130,92.3153,78.3192,11.6808,99.9913
847,848,4882,550,3141,142.597,20.4378,69.5622,99.9968
848,849,2976,1158,3133,144.09,39.4948,50.5052,99.9321
849,850,1588,3691,3135,141.481,8.96194,81.0381,99.726
850,851,4704,2824,3142,137.936,78.6707,11.3293,99.9916
851,852,571,2555,3123,209.599,76.5186,13.4814,99.9087
852,853,8455,2739,3178,315.873,35.8332,54.1668,99.949
853,854,1057,998,3136,310.619,0.310349,89.6897,99.9868
854,855,3971,2650,3149,134.826,82.5417,7.458260000000001,99.9045
855,856,3559,3642,3175,144.88,8.39418,81.6058,99.9788
856,857,9555,3425,3183,309.504,50.9906,39.0094,99.9558
857,858,3906,2559,3159,316.52,4.05234,85.9477,99.6977
858,859,128036,852,3332,140.82299999999995,48.3444,41.6556,98.4168
859,860,33887,1519,3252,143.466,70.7123,19.2877,99.7189
860,861,58926,2901,3277,134.859,6.68261,83.3174,87.5531
861,862,633,1624,3159,314.297,38.8365,51.1635,99.9971
862,863,1394,1417,3173,139.155,62.6925,27.3075,99.9918
863,864,13991,2608,3224,142.09,16.5992,73.4008,99.2276
864,865,13495,333,3248,319.6140000000001,0.0410995,89.9589,99.9755
865,866,8208,1112,3220,265.04400000000004,82.5613,7.43871,99.9925
866,867,1235,566,3186,327.507,62.7974,27.2026,99.9958
867,868,29698,1321,3288,308.097,11.2406,78.7594,99.9952
868,869,800,1184,3190,135.966,4.95058,85.0494,99.9915
869,870,586,515,3191,132.378,17.6435,72.3565,99.9893
870,871,7020,3133,3233,312.705,10.1006,79.8994,99.9686
871,872,2892,3588,3217,321.63,46.8433,43.1567,99.9977
872,873,690,3081,3199,131.762,43.9674,46.0326,99.9855
873,874,3024,3331,3223,320.815,22.5872,67.4128,99.9988
874,875,6029,3668,3258,135.599,1.12203,88.87799999999999,99.8999
875,876,2572,521,3233,314.378,16.6479,73.3521,99.9693
876,877,2838,1688,3232,141.656,14.0146,75.9854,99.9969
877,878,7452,1187,3265,308.65,37.1756,52.8244,99.9969
878,879,2966,2562,3246,132.399,2.59189,87.4081,99.8235
879,880,1077,1991,3243,135.754,67.1768,22.8232,99.9867
880,881,576,3424,3246,318.738,22.8064,67.1936,99.9382
881,882,704,750,3249,135.028,8.71912,81.2809,99.9955
882,883,15820,2091,3292,136.856,3.20094,86.7991,99.8303
883,884,16194,3384,3354,141.112,18.4206,71.5794,99.9744
884,885,4852,2515,3286,309.851,17.745,72.255,99.9004
885,886,8782,3053,3317,314.444,65.9987,24.0013,99.934
886,887,7380,3457,3323,310.539,52.4381,37.5619,99.7318
887,888,51017,1670,3359,141.296,40.9944,49.0056,99.8607
888,889,13109,559,3347,136.181,3.7734,86.2266,99.6102
889,890,3425,1109,3314,134.79399999999998,67.4827,22.5173,99.9802
890,891,3301,2643,3308,137.55200000000002,1.2565,88.7435,97.7907
891,892,823,3119,3301,162.505,58.4257,31.5743,99.9208
892,893,8147,2014,3383,131.069,16.8676,73.1324,99.9533
893,894,954,3515,3306,306.093,49.2298,40.7702,99.9844
894,895,932,1209,3316,310.55,5.58298,84.417,99.9788
895,896,3649,2692,3354,133.05100000000002,36.2513,53.7487,98.8663
896,897,13474,2567,3389,134.55100000000002,59.6529,30.3471,99.6166
897,898,3367,2761,3365,132.67700000000002,43.6793,46.3207,99.9833
898,899,8054,1121,3371,140.215,49.4053,40.5947,99.9378
899,900,1291,3676,3346,124.265,77.4001,12.5999,99.9648
900,901,1002,1185,3338,139.392,6.34474,83.6553,99.9797
901,902,616,3653,3347,130.528,76.5104,13.4896,99.9946
902,903,24891,1434,3477,314.271,18.3145,71.6855,99.1818
903,904,712,299,3360,160.52100000000004,68.2597,21.7403,99.9939
904,905,1224,379,3373,158.72,66.8531,23.1469,99.9638
905,906,588,348,3368,140.30100000000002,23.2214,66.7786,99.9725
906,907,9071,2303,3398,319.9770000000001,5.60544,84.3946,99.9203
907,908,9408,1248,3424,189.679,82.7417,7.25833,99.9442
908,909,1804,1442,3389,89.9611,87.0299,2.97012,99.9762
909,910,1225,3623,3377,317.776,41.0148,48.9852,99.9881
910,911,2292,1048,3384,137.10399999999998,9.72543,80.2746,99.9986
911,912,2258,3117,3396,141.407,67.1357,22.8643,99.9944
912,913,2743,3316,3405,142.227,58.6178,31.3822,99.9857
913,914,3462,2733,3413,298.441,57.6568,32.3432,99.9093
914,915,904,301,3401,138.335,24.9212,65.0788,99.9496
915,916,8895,2650,3465,319.235,7.45628,82.5437,99.4005
916,917,18468,516,3476,140.51,11.784,78.21600000000002,99.8919
917,918,5689,607,3432,314.325,48.9077,41.0923,99.992
918,919,8311,3543,3441,320.867,44.955,45.045,99.9921
919,920,4224,3658,3425,137.062,2.40607,87.5939,99.8762
920,921,1939,365,3414,129.84,7.478839999999999,82.5212,99.9681
921,922,4301,2809,3448,129.247,41.2079,48.7921,99.9157
922,923,550,2861,3404,309.097,31.7664,58.2336,99.9514
923,924,50831,3143,3560,123.018,63.3232,26.6768,99.4756
924,925,836,2896,3416,129.296,41.604,48.396,99.9869
925,926,681,2257,3420,130.071,79.1816,10.8184,99.8363
926,927,5129,2194,3454,138.959,16.0551,73.9449,99.9859
927,928,52269,2926,3600,132.247,46.1167,43.8833,99.3567
928,929,1495,2795,3426,138.858,27.523000000000003,62.477,99.9954
929,930,12153,3452,3488,132.64700000000002,21.0641,68.9359,99.555
930,931,1001,2922,3436,313.312,30.0882,59.9118,99.8147
931,932,936,3607,3443,307.519,45.7343,44.2657,99.9899
932,933,1792,3115,3456,132.196,39.6509,50.3491,99.9948
933,934,11178,383,3488,139.74200000000002,50.0647,39.9353,99.8542
934,935,1577,2278,3458,136.77100000000002,14.9499,75.0501,99.9874
935,936,504,3065,3457,158.851,78.637,11.363,99.9676
936,937,4062,1193,3487,319.07,0.148537,89.8515,99.7421
937,938,5930,3328,3492,320.7390000000001,3.5305800000000005,86.4694,99.9915
938,939,111470,2461,3714,143.798,63.7033,26.2967,55.1741
939,940,555,2532,3462,316.888,73.6044,16.3956,99.9846
940,941,10615,2729,3552,316.143,26.4787,63.5213,99.8005
941,942,2589,1575,3497,305.78,43.0788,46.9212,99.8033
942,943,853,3680,3476,310.712,26.758000000000006,63.242,99.929
943,944,875,2246,3491,310.659,48.9574,41.0426,99.9871
944,945,18019,860,3557,128.278,67.3536,22.6464,99.8528
945,946,2421,777,3513,137.645,38.1205,51.8795,99.991
946,947,10446,3570,3547,318.118,20.6972,69.3028,98.7914
947,948,7166,2811,3518,141.246,3.16034,86.8397,99.9807
948,949,4094,1637,3508,312.696,23.3888,66.6112,99.9752
949,950,1346,1689,3514,141.15200000000004,61.925,28.075,99.9259
950,951,6672,2069,3534,140.312,7.6025800000000014,82.3974,98.9038
951,952,10514,1307,3535,142.217,46.3847,43.6153,99.889
952,953,993,3653,3505,132.816,1.18888,88.8111,99.8749
953,954,1414,1544,3529,145.253,32.769,57.231,99.9648
954,955,9541,984,3546,320.449,14.7781,75.2219,99.966
955,956,3104,2602,3521,139.107,16.643,73.357,99.9645
956,957,2649,1079,3534,312.673,45.0496,44.9504,99.978
957,958,14424,616,3590,312.2290000000001,19.9572,70.0428,99.9907
958,959,38052,1453,3739,313.075,46.3504,43.6496,70.9853
959,960,8880,715,3585,135.447,11.667,78.333,99.9907
960,961,915,299,3547,345.478,85.6163,4.3836900000000005,99.9918
961,962,3240,472,3567,134.941,39.1025,50.8975,99.9817
962,963,7278,332,3589,313.608,0.588806,89.4112,99.9773
963,964,1426,1190,3559,139.545,58.0635,31.9365,99.963
964,965,3176,3367,3557,130.596,23.866,66.134,99.9611
965,966,946,3661,3564,145.35299999999995,20.3398,69.6602,99.9539
966,967,935,520,3555,318.319,4.21628,85.7837,99.9803
967,968,1431,1640,3566,310.055,17.0969,72.9031,99.9928
968,969,17721,1976,3596,327.68,76.3432,13.6568,99.9279
969,970,630,2575,3553,318.626,12.5459,77.4541,99.9605
970,971,4289,1584,3582,144.371,62.817,27.183000000000003,99.985
971,972,1657,777,3568,313.04,15.9162,74.0838,99.9906
972,973,15621,1112,3613,140.424,26.9809,63.0191,99.9597
973,974,10109,1297,3613,301.157,41.894,48.106,99.9572
974,975,626,2167,3567,11.1496,87.6704,2.32961,99.9857
975,976,5253,2215,3590,337.62,77.0514,12.9486,99.9922
976,977,1854,397,3577,143.987,14.214,75.786,99.9881
977,978,3910,1698,3597,317.642,60.3983,29.6017,99.9743
978,979,14259,2589,3636,316.2,7.99567,82.0043,99.9497
979,980,15199,3310,3635,146.436,52.0389,37.9611,99.7321
980,981,7956,3578,3634,310.588,42.0315,47.9685,99.9388
981,982,1486,3424,3611,313.991,7.2244,82.7756,99.4924
982,983,35575,456,3769,319.81,3.20012,86.7999,68.9054
983,984,3718,3479,3618,137.95,25.1167,64.8833,99.9881
984,985,3667,517,3626,142.15,21.9687,68.0313,99.9658
985,986,1738,2542,3606,323.611,63.2327,26.7673,99.9932
986,987,5384,3666,3689,142.858,20.1339,69.8661,99.8378
987,988,11660,1003,3682,303.155,74.5127,15.4873,99.9806
988,989,1954,1640,3618,301.851,45.1199,44.8801,99.9936
989,990,4686,1992,3633,318.442,9.54517,80.4548,99.9979
990,991,5579,930,3657,140.134,8.474310000000001,81.5257,99.9401
991,992,6605,1822,3653,142.167,29.5762,60.4238,99.9975
992,993,656,773,3620,308.985,35.0265,54.9735,99.9925
993,994,2865,1560,3633,303.337,38.6985,51.3015,99.7089
994,995,3790,2305,3644,126.367,37.79,52.21,99.9939
995,996,1054,1764,3638,142.43200000000004,29.6313,60.3687,99.9855
996,997,972,2130,3639,139.346,19.4735,70.5265,99.9864
997,998,63903,780,3753,165.195,74.7873,15.2127,99.8944
998,999,5078,1204,3664,142.525,49.0344,40.9656,99.9908
999,1000,5349,1684,3678,141.268,37.2869,52.7131,99.9764
1000,1001,807,2191,3639,137.985,19.2816,70.7184,99.9977
1001,1002,9775,2231,3691,318.335,15.3418,74.6582,99.6872
1002,1003,5793,1913,3676,134.539,55.5372,34.4628,99.972
1003,1004,13987,2651,3698,133.971,9.28973,80.7103,99.1602
1004,1005,661,2360,3646,314.34,15.5675,74.4325,99.9956
1005,1006,661,292,3657,143.07,15.5266,74.4734,99.9758
1006,1007,827,2153,3655,322.395,4.5941,85.4059,99.9743
1007,1008,5281,1602,3686,311.181,57.7715,32.2285,99.9846
1008,1009,533,1498,3653,124.58,57.615,32.385,99.9665
1009,1010,6586,1363,3709,128.488,45.2757,44.7243,99.4272
1010,1011,3861,3387,3688,130.45,55.3691,34.6309,99.987
1011,1012,2647,3217,3677,312.276,31.0135,58.9865,99.9564
1012,1013,4575,1291,3682,130.108,53.1604,36.8396,99.9332
1013,1014,46662,2129,3796,148.041,62.0822,27.9178,99.0067
1014,1015,4579,3530,3686,321.152,13.96,76.04,99.9625
1015,1016,2322,3448,3686,137.525,47.5182,42.4818,99.9564
1016,1017,2858,1749,3707,315.335,19.8986,70.1014,99.9706
1017,1018,5929,516,3727,151.434,61.066,28.934,99.9908
1018,1019,1580,585,3696,311.525,9.0858,80.9142,99.997
1019,1020,2919,356,3709,304.318,62.4585,27.5415,99.9585
1020,1021,4686,3608,3752,145.614,18.774,71.226,99.9884
1021,1022,7776,2779,3733,147.157,19.4893,70.5107,99.9293
1022,1023,5058,1091,3708,162.093,68.184,21.816,99.916
1023,1024,8076,3198,3728,145.27700000000004,27.3521,62.6479,99.9812
1024,1025,1144,1838,3705,319.23,62.2858,27.7142,99.9975
1025,1026,7137,2881,3744,319.0440000000001,14.2959,75.7041,99.9473
1026,1027,1211,1274,3720,140.363,36.5327,53.4673,99.9972
1027,1028,2832,1155,3732,308.64,65.7835,24.2165,99.9797
1028,1029,780,1623,3721,300.626,48.2135,41.7865,99.9478
1029,1030,637,3480,3721,324.2340000000001,40.1163,49.8837,99.9961
1030,1031,1020,2689,3733,330.111,68.5092,21.4908,99.9718
1031,1032,9648,1201,3780,138.19799999999998,14.1852,75.8148,99.9715
1032,1033,37838,3477,3828,318.166,44.3707,45.6293,98.1917
1033,1034,17419,3088,3789,321.0370000000001,44.2251,45.7749,99.9958
1034,1035,15466,1832,3771,135.67,2.34247,87.6575,99.9629
1035,1036,4621,3305,3752,312.7,41.1405,48.8595,99.954
1036,1037,1214,3358,3740,322.995,28.3064,61.6936,99.9802
1037,1038,3617,2296,3761,141.55700000000004,9.41023,80.5898,99.902
1038,1039,7238,1678,3783,294.742,47.5922,42.4078,99.935
1039,1040,1039,294,3759,134.634,6.05341,83.9466,99.9798
1040,1041,503,2997,3746,318.941,10.0083,79.9917,99.9967
1041,1042,1604,2728,3762,141.864,43.4586,46.5414,99.963
1042,1043,14595,1566,3833,314.472,7.785139999999998,82.2149,99.9807
1043,1044,662,354,3764,138.018,7.885560000000001,82.1144,99.9797
1044,1045,19284,1281,3838,314.736,12.317,77.683,99.8615
1045,1046,14579,2958,3840,134.317,6.727410000000001,83.2726,84.5036
1046,1047,3941,1111,3784,309.937,70.0508,19.9492,99.9946
1047,1048,18275,2034,3841,313.934,12.6286,77.3714,99.6173
1048,1049,1006,3246,3775,140.048,25.3783,64.6217,99.9589
1049,1050,12625,3636,3841,139.835,17.2171,72.7829,99.8801
1050,1051,14468,997,3835,302.066,47.5045,42.4955,99.9563
1051,1052,3769,316,3817,125.264,0.356323,89.6437,99.9321
1052,1053,777,2705,3778,126.933,59.3866,30.6134,99.9832
1053,1054,1416,525,3795,319.006,18.9409,71.0591,99.9524
1054,1055,22087,2825,3908,139.566,59.897,30.103,99.909
1055,1056,4264,2765,3821,318.565,4.0140699999999985,85.9859,99.9594
1056,1057,869,622,3807,142.77700000000004,38.6825,51.3175,99.9948
1057,1058,9824,2319,3853,144.846,34.5193,55.4807,99.8717
1058,1059,7919,3242,3840,124.566,60.8112,29.1888,99.9715
1059,1060,6143,3330,3860,317.443,0.15945399999999998,89.8405,99.9315
1060,1061,14051,1702,3871,135.756,73.0251,16.9749,99.9173
1061,1062,794,2701,3817,307.399,10.7918,79.2082,99.9865
1062,1063,18567,686,3889,147.675,63.3556,26.6444,99.984
1063,1064,13666,1879,3874,132.046,64.2982,25.7018,99.8269
1064,1065,24318,1383,3962,128.634,12.2357,77.7643,99.8072
1065,1066,2061,2395,3867,128.847,35.3127,54.6873,99.9916
1066,1067,1721,1111,3856,311.363,38.7571,51.2429,99.9704
1067,1068,16461,3134,3915,312.976,14.7388,75.2612,99.0157
1068,1069,10588,2705,3911,150.32,26.698,63.302,99.995
1069,1070,4350,1042,3882,137.35299999999998,12.8251,77.1749,99.9984
1070,1071,571,3193,3865,144.459,62.006,27.994,99.9342
1071,1072,2329,348,3887,319.699,57.5642,32.4358,99.9668
1072,1073,2468,401,3892,313.246,25.029,64.971,99.9931
1073,1074,2043,1982,3889,318.1790000000001,1.0552700000000002,88.9447,99.988
1074,1075,3962,567,3916,313.074,39.312,50.688,99.9858
1075,1076,1031,1085,3909,300.626,47.9453,42.0547,99.9943
1076,1077,1043,869,3902,139.11,28.928,61.072,99.9798
1077,1078,6927,1139,3934,327.504,47.4974,42.5026,99.9948
1078,1079,15440,831,3975,138.102,7.00264,82.9974,99.6542
1079,1080,14423,2015,3982,154.053,67.3994,22.6006,99.8554
1080,1081,728,3682,3911,107.647,61.3894,28.6106,99.9139
1081,1082,8200,3246,3954,142.656,41.2526,48.7474,99.9734
1082,1083,10216,1786,3949,308.943,5.6136599999999985,84.3863,99.9972
1083,1084,16332,1594,3974,137.59799999999998,20.7202,69.2798,98.6415
1084,1085,4321,1251,3931,137.857,21.2897,68.7103,99.8455
1085,1086,11686,3044,3972,147.687,61.3605,28.6395,99.9622
1086,1087,1751,1520,3930,136.14,3.36406,86.6359,99.9915
1087,1088,22273,2316,4006,307.457,10.7646,79.2354,99.6061
1088,1089,6210,411,3952,137.774,37.3643,52.6357,99.9176
1089,1090,3208,3556,3938,153.81799999999996,55.7366,34.2634,99.9714
1090,1091,2529,935,3933,144.232,35.1033,54.8967,99.977
1091,1092,854,3331,3935,312.194,38.3263,51.6737,99.9928
1092,1093,50194,3203,4117,316.608,5.7011,84.2989,89.3698
1093,1094,1101,2963,3944,315.547,17.9849,72.0151,99.864
1094,1095,6725,600,3975,143.662,88.2815,1.7185099999999998,99.9735
1095,1096,2232,1192,3963,319.995,31.7468,58.2532,99.9853
1096,1097,769,1920,3949,125.858,49.4756,40.5244,99.9913
1097,1098,6993,490,3987,138.063,32.1188,57.8812,99.545
1098,1099,1513,2380,3963,326.823,79.5201,10.4799,99.9932
1099,1100,19996,3610,4019,312.451,25.0913,64.9087,99.9283
1100,1101,1711,2921,3965,314.935,4.82045,85.1796,99.9414
1101,1102,7773,2116,3996,319.574,7.715160000000001,82.2848,99.9876
1102,1103,2946,988,3965,301.545,45.9132,44.0868,99.9369
1103,1104,14255,1018,4051,309.767,77.2588,12.7412,99.8173
1104,1105,690,2486,3967,149.312,52.2644,37.7356,99.9823
1105,1106,3887,3297,3980,311.401,24.4433,65.5567,99.9888
1106,1107,6860,3482,4007,136.366,10.088,79.91199999999998,99.9844
1107,1108,1696,2454,3981,131.069,13.6072,76.3928,99.938
1108,1109,838,2856,3981,342.965,63.9962,26.0038,99.9947
1109,1110,6202,1290,4043,307.813,37.5583,52.4417,99.8133
1110,1111,14050,641,4047,137.784,1.71947,88.2805,99.0378
1111,1112,2536,1925,4005,135.92,35.9325,54.0675,99.9193
1112,1113,8816,367,4079,161.766,76.2804,13.7196,99.982
1113,1114,23874,2740,4042,317.997,64.9125,25.0875,99.5726
1114,1115,6265,1857,4032,310.582,44.6386,45.3614,99.9012
1115,1116,6446,2229,4028,316.636,18.77,71.23,73.0687
1116,1117,3219,932,4007,139.024,31.171,58.82899999999999,99.9015
1117,1118,783,2876,4003,312.518,0.426682,89.5733,99.9559
1118,1119,9438,1103,4060,306.736,13.4514,76.5486,99.9932
1119,1120,9076,1187,4056,312.528,45.7529,44.2471,99.9921
1120,1121,44428,1666,4113,136.514,2.813,87.18700000000003,99.86
1121,1122,1533,2976,4015,319.186,7.70283,82.2972,99.9586
1122,1123,870,2432,4016,316.4290000000001,32.1899,57.8101,99.9046
1123,1124,1350,1782,4017,141.614,67.7782,22.2218,99.8132
1124,1125,976,281,4030,159.631,76.5574,13.4426,99.9904
1125,1126,1592,2547,4019,315.624,13.2198,76.7802,99.9931
1126,1127,4011,2909,4070,315.8640000000001,2.99178,87.0082,99.8682
1127,1128,14833,821,4089,138.114,1.42809,88.5719,99.7741
1128,1129,1398,438,4042,319.582,75.613,14.387,99.9876
1129,1130,3208,506,4048,138.394,27.7149,62.2851,99.9787
1130,1131,996,715,4041,148.26,43.7739,46.2261,99.9799
1131,1132,1727,2506,4050,147.21,54.7137,35.2863,99.9222
1132,1133,9487,3052,4094,125.49,46.3396,43.6604,99.9048
1133,1134,10810,3388,4102,139.46,59.9331,30.0669,99.7609
1134,1135,8434,2214,4113,293.075,66.8191,23.1809,99.9592
1135,1136,1998,1472,4067,316.473,16.3861,73.6139,99.9868
1136,1137,2787,2967,4073,323.506,40.585,49.415,99.9622
1137,1138,508,1981,4059,314.045,44.9688,45.0312,99.9905
1138,1139,912,2148,4066,135.421,27.7046,62.2954,99.9821
1139,1140,3490,1416,4080,312.716,3.5891300000000004,86.4109,99.9522
1140,1141,5302,1518,4097,142.998,44.0434,45.9566,99.988
1141,1142,13493,2499,4111,316.601,50.6505,39.3495,99.9514
1142,1143,10487,2114,4131,276.247,69.3762,20.6238,99.9958
1143,1144,12333,703,4134,321.81,59.8911,30.1089,99.8762
1144,1145,25213,1236,4184,311.219,37.1218,52.8782,98.4946
1145,1146,3459,1946,4097,135.895,41.4375,48.5625,99.9759
1146,1147,5689,2633,4096,312.5420000000001,9.09952,80.9005,99.9886
1147,1148,9831,1865,4130,310.681,30.866,59.13399999999999,99.9942
1148,1149,8157,3558,4118,145.134,56.7894,33.2106,99.7791
1149,1150,1734,551,4116,252.629,83.46600000000002,6.53405,99.9977
1150,1151,2323,1356,4101,320.011,42.4307,47.5693,99.9874
1151,1152,80540,474,4315,135.684,6.62736,83.3726,93.2987
1152,1153,1934,936,4103,143.017,30.4165,59.5835,99.9774
1153,1154,30202,1995,4204,297.625,82.0409,7.95907,99.9557
1154,1155,1133,2712,4102,315.533,22.3235,67.6765,99.9976
1155,1156,7349,3287,4147,144.39,84.7544,5.24565,99.9827
1156,1157,1067,3647,4109,138.80700000000002,56.3874,33.6126,99.9419
1157,1158,42466,2349,4214,141.839,36.5645,53.4355,99.9091
1158,1159,655,3678,4121,70.9125,71.2769,18.7231,99.947
1159,1160,2110,2760,4125,311.575,7.30397,82.696,99.9899
1160,1161,1312,3437,4125,319.7990000000001,44.8266,45.1734,99.9505
1161,1162,4501,1325,4155,315.392,1.95112,88.0489,99.9933
1162,1163,1275,2956,4124,319.718,19.3391,70.6609,99.9842
1163,1164,5113,1402,4157,138.657,64.8241,25.1759,99.9751
1164,1165,696,3004,4130,308.819,61.0406,28.9594,99.9534
1165,1166,732,1545,4129,143.933,39.9346,50.0654,99.9623
1166,1167,6170,574,4162,136.80200000000002,19.6312,70.3688,99.9781
1167,1168,4190,973,4155,148.55100000000004,47.7821,42.2179,99.9946
1168,1169,1174,2590,4138,146.895,48.768,41.232,99.9914
1169,1170,4235,2689,4153,139.697,6.13588,83.8641,99.9976
1170,1171,3201,2817,4147,140.21200000000002,27.8531,62.1469,99.9916
1171,1172,14430,2930,4207,308.363,67.3667,22.6333,99.9185
1172,1173,2932,3650,4175,131.19299999999998,59.9833,30.0167,99.9533
1173,1174,33643,953,4307,309.613,41.4012,48.5988,65.2836
1174,1175,1525,1131,4158,142.634,46.032,43.968,99.9904
1175,1176,888,373,4166,345.025,76.86,13.14,99.982
1176,1177,14370,1045,4216,320.522,4.06307,85.9369,99.956
1177,1178,1454,2622,4176,149.317,48.1805,41.8195,99.9815
1178,1179,25125,3513,4237,134.156,57.5059,32.4941,99.9682
1179,1180,2786,3019,4177,130.142,22.1107,67.8893,99.9961
1180,1181,9062,803,4232,324.1790000000001,4.1139800000000015,85.88600000000002,99.8713
1181,1182,3360,2742,4187,318.6090000000001,12.7395,77.2605,99.9753
1182,1183,1196,3560,4170,306.314,48.326,41.674,99.9936
1183,1184,5185,321,4195,320.343,11.4173,78.5827,99.9605
1184,1185,2003,2577,4176,139.284,11.0737,78.9263,99.9951
1185,1186,1233,3412,4176,315.583,15.6801,74.3199,99.9947
1186,1187,831,3606,4186,314.568,69.4339,20.5661,99.9865
1187,1188,48607,2720,4288,325.2290000000001,7.19175,82.8083,99.963
1188,1189,5042,1683,4203,142.839,18.2615,71.7385,99.9868
1189,1190,3165,2209,4214,139.259,55.7616,34.2384,99.9989
1190,1191,7649,1850,4229,291.257,75.4682,14.5318,99.8679
1191,1192,6263,3370,4237,131.614,39.7495,50.2505,99.9943
1192,1193,805,722,4200,277.378,68.6024,21.3976,99.9835
1193,1194,24439,1542,4256,312.934,34.397,55.603,99.9171
1194,1195,2023,2154,4233,132.842,30.2679,59.7321,99.9914
1195,1196,9575,656,4239,151.80100000000004,54.2533,35.7467,99.8395
1196,1197,13477,2532,4279,131.839,62.7524,27.2476,99.8582
1197,1198,1038,1357,4222,287.85,77.1193,12.8807,99.9904
1198,1199,790,2109,4222,308.249,49.956,40.044,99.9856
1199,1200,634,740,4228,278.371,68.5835,21.4165,99.9939
1200,1201,4445,3010,4260,319.553,36.0403,53.9597,99.9871
1201,1202,13842,3284,4322,154.826,69.9475,20.0525,99.9103
1202,1203,8389,1140,4285,314.714,20.2807,69.7193,98.4754
1203,1204,2393,1781,4268,138.287,39.8499,50.1501,99.9788
1204,1205,885,1699,4244,137.39600000000002,38.6215,51.3785,99.992
1205,1206,626,550,4249,328.293,74.7155,15.2845,99.9939
1206,1207,1660,1386,4262,142.143,41.14100000000001,48.859,99.9971
1207,1208,1734,2189,4268,139.64,78.164,11.836,99.9909
1208,1209,4164,3613,4291,128.453,7.486639999999999,82.5134,99.9508
1209,1210,15275,3167,4310,133.404,37.9027,52.0973,99.9585
1210,1211,955,2108,4272,311.6740000000001,48.5886,41.4114,99.9868
1211,1212,11026,1331,4321,315.535,13.3058,76.6942,99.9991
1212,1213,7262,1732,4307,139.694,1.69409,88.3059,99.7054
1213,1214,2461,2233,4297,310.915,21.6796,68.3204,99.9975
1214,1215,12339,2066,4357,145.393,39.0268,50.9732,98.8888
1215,1216,2404,2061,4300,314.4240000000001,49.8488,40.1512,99.9857
1216,1217,4776,1853,4313,318.105,60.1138,29.8862,99.966
1217,1218,1754,2421,4293,130.46,67.9976,22.0024,98.4365
1218,1219,2260,1204,4306,136.561,16.8271,73.1729,99.9958
1219,1220,3054,733,4317,128.875,30.448,59.552,99.9807
1220,1221,2729,1435,4304,280.349,78.5025,11.4975,99.9775
1221,1222,34854,2981,4436,140.578,40.0727,49.9273,99.6165
1222,1223,49745,739,4497,319.692,7.2355399999999985,82.7645,99.7447
1223,1224,778,1249,4299,133.541,6.876810000000001,83.1232,99.9849
1224,1225,4491,3394,4339,143.606,53.8894,36.1106,99.9923
1225,1226,1454,1075,4320,312.318,22.8996,67.1004,99.6851
1226,1227,864,1489,4308,158.799,83.6245,6.37551,99.9879
1227,1228,2173,1628,4326,145.813,24.8001,65.1999,99.9821
1228,1229,3778,1991,4323,313.7270000000001,6.6727300000000005,83.3273,99.9967
1229,1230,2051,2187,4323,136.231,57.07,32.93,99.9969
1230,1231,7514,2399,4357,312.14,26.0833,63.9167,99.9463
1231,1232,23978,848,4394,129.905,31.914,58.08600000000001,99.9741
1232,1233,5545,3499,4341,313.52,78.2181,11.7819,99.9691
1233,1234,795,2457,4326,314.246,27.8276,62.1724,99.9701
1234,1235,38097,2777,4437,132.914,11.2146,78.7854,99.9931
1235,1236,14313,3584,4389,315.246,3.26872,86.7313,99.3772
1236,1237,8147,1896,4364,141.576,63.7735,26.2265,99.958
1237,1238,9488,1205,4377,144.541,38.551,51.449,99.9961
1238,1239,2637,681,4356,130.293,8.455639999999999,81.5444,99.9944
1239,1240,1020,3350,4337,319.295,29.3,60.7,99.9955
1240,1241,13493,3120,4398,318.763,37.4413,52.5587,99.9972
1241,1242,2397,1496,4354,142.582,38.9911,51.0089,99.9769
1242,1243,4088,1419,4379,144.907,41.1128,48.8872,99.9411
1243,1244,11861,2297,4388,148.35299999999995,51.4927,38.5073,98.7603
1244,1245,4323,1728,4365,146.025,42.87300000000001,47.127,99.9732
1245,1246,4151,1558,4373,142.372,33.7991,56.2009,99.9953
1246,1247,12418,2531,4408,144.154,42.5075,47.4925,99.9775
1247,1248,518,2475,4360,127.988,60.6411,29.3589,99.9871
1248,1249,5891,2167,4395,137.726,46.9072,43.0928,99.9916
1249,1250,5338,1109,4403,325.491,0.514397,89.4856,99.9853
1250,1251,8042,1652,4421,140.312,0.568703,89.4313,99.889
1251,1252,1006,736,4384,315.972,26.2191,63.7809,99.9957
1252,1253,694,308,4390,152.274,64.8075,25.1925,99.9791
1253,1254,2259,3467,4391,139.761,19.6187,70.3813,99.9983
1254,1255,1293,1268,4394,136.849,1.51104,88.48899999999998,99.9925
1255,1256,1210,3326,4394,133.909,38.2149,51.7851,99.9961
1256,1257,3695,291,4483,150.507,64.32,25.68,99.8924
1257,1258,7838,3404,4432,310.6620000000001,30.9094,59.0906,99.8663
1258,1259,4557,1335,4405,276.21,78.3369,11.6631,99.9942
1259,1260,537,349,4403,213.645,79.9908,10.0092,99.9471
1260,1261,1316,393,4408,200.689,82.17200000000003,7.8279999999999985,99.8531
1261,1262,3541,1736,4418,145.179,18.9964,71.0036,99.9949
1262,1263,3257,1800,4430,140.85299999999995,73.4902,16.5098,99.9951
1263,1264,2154,1467,4433,138.313,21.2261,68.7739,99.9539
1264,1265,12656,2078,4461,154.475,53.5676,36.4324,99.996
1265,1266,1437,1863,4414,317.241,62.3553,27.6447,99.9907
1266,1267,5510,1948,4440,140.755,59.0569,30.9431,99.9242
1267,1268,13059,1547,4490,141.32399999999996,22.6415,67.3585,99.0196
1268,1269,1227,1589,4428,274.39,88.3866,1.61338,99.9899
1269,1270,1393,2243,4434,321.115,15.2569,74.7431,99.9845
1270,1271,12632,3259,4469,141.415,16.1089,73.8911,99.6216
1271,1272,4661,2913,4464,313.073,77.5149,12.4851,99.9493
1272,1273,24854,1334,4537,315.026,18.6873,71.3127,99.9163
1273,1274,2818,1264,4442,130.86,51.7468,38.2532,99.8181
1274,1275,16349,408,4519,147.705,62.8464,27.1536,99.9454
1275,1276,88673,3485,4615,137.328,24.684,65.316,51.207
1276,1277,43750,2295,4529,317.653,18.0825,71.9175,83.8965
1277,1278,821,2460,4452,146.525,53.7518,36.2482,99.9729
1278,1279,1596,1160,4453,150.667,71.12899999999998,18.871,99.9911
1279,1280,4576,2172,4468,311.634,20.2878,69.7122,99.9832
1280,1281,793,1375,4449,139.835,39.7888,50.2112,99.9898
1281,1282,61422,1929,4604,312.281,37.6638,52.3362,81.6802
1282,1283,5615,2588,4479,313.824,5.0521,84.9479,99.9834
1283,1284,824,1090,4459,148.305,43.6694,46.3306,99.9897
1284,1285,9725,995,4505,302.017,60.4896,29.5104,99.9254
1285,1286,1651,1190,4480,323.36,2.65668,87.3433,99.9879
1286,1287,553,1496,4468,154.039,58.5762,31.4238,99.8797
1287,1288,8275,1710,4515,314.992,32.305,57.695,99.8558
1288,1289,1634,1291,4490,316.428,46.0895,43.9105,99.9757
1289,1290,3582,1218,4527,143.797,0.911797,89.0882,99.8406
1290,1291,885,1797,4483,307.372,69.1777,20.8223,99.9895
1291,1292,4071,3411,4507,146.316,14.0808,75.9192,99.9209
1292,1293,844,3101,4494,315.32,9.24241,80.7576,99.9876
1293,1294,4194,3141,4552,140.461,37.1369,52.8631,99.9049
1294,1295,29417,1158,4617,143.029,66.9687,23.0313,88.8613
1295,1296,2331,1779,4531,152.89600000000004,49.7321,40.2679,99.6324
1296,1297,150908,2581,4664,136.279,19.9676,70.0324,65.8139
1297,1298,1586,3117,4536,132.526,7.80002,82.2,99.9873
1298,1299,1253,2867,4532,138.737,41.4318,48.5682,99.9678
1299,1300,1757,541,4551,318.557,40.3459,49.6541,99.9371
1300,1301,738,3533,4537,305.766,74.7078,15.2922,99.9784
1301,1302,26898,540,4611,138.826,12.1341,77.8659,99.7316
1302,1303,604,3078,4549,139.001,32.7138,57.2862,99.9736
1303,1304,9396,1613,4616,148.028,55.6125,34.3875,99.986
1304,1305,4382,3485,4587,132.011,15.5646,74.4354,99.978
1305,1306,3327,1010,4570,316.288,5.040769999999998,84.9592,99.9706
1306,1307,4252,1425,4588,138.558,29.5923,60.4077,99.9905
1307,1308,3967,929,4586,141.743,48.0115,41.9885,99.9787
1308,1309,13163,1519,4628,139.48,2.46812,87.5319,99.9958
1309,1310,1627,277,4591,314.8590000000001,20.3882,69.6118,99.9599
1310,1311,622,1679,4572,305.34,22.1199,67.8801,99.9874
1311,1312,8293,1736,4617,312.949,14.6155,75.3845,99.9859
1312,1313,1725,2854,4605,313.584,51.1179,38.8821,99.9839
1313,1314,11280,3231,4644,134.418,31.1517,58.8483,99.9821
1314,1315,2269,319,4625,146.851,29.6107,60.3893,99.8664
1315,1316,2057,2235,4615,319.0370000000001,21.5619,68.4381,99.9914
1316,1317,689,866,4609,311.875,15.4873,74.5127,99.9801
1317,1318,2324,3658,4643,319.035,27.41,62.59,99.9309
1318,1319,1494,2580,4632,157.878,73.7343,16.2657,99.9372
1319,1320,3601,3099,4635,224.36900000000003,87.75,2.25003,99.9905
1320,1321,1069,3153,4620,139.56,2.19217,87.8078,99.994
1321,1322,6378,2052,4649,314.55,70.7922,19.2078,99.9909
1322,1323,3982,721,4650,134.72799999999998,41.3861,48.6139,99.9968
1323,1324,3532,1667,4662,144.014,29.7662,60.2338,99.934
1324,1325,656,2164,4622,141.783,0.000297546,89.9997,99.9789
1325,1326,23693,919,4699,312.559,57.4457,32.5543,99.9773
1326,1327,1383,2529,4640,135.46,41.8768,48.1232,99.9804
1327,1328,1150,853,4645,135.22899999999998,41.1272,48.8728,99.9827
1328,1329,18320,659,4705,317.4840000000001,3.89691,86.1031,99.9594
1329,1330,2007,1364,4652,142.485,26.6717,63.3283,99.9923
1330,1331,978,1409,4657,307.513,9.00587,80.9941,99.9932
1331,1332,682,1127,4653,311.719,11.5119,78.4881,99.9926
1332,1333,698,2486,4656,154.624,64.7822,25.2178,99.9808
1333,1334,12560,3102,4711,148.697,82.8269,7.17307,99.9239
1334,1335,5271,2620,4727,316.225,42.8677,47.1323,99.7238
1335,1336,1721,2573,4681,136.44299999999998,41.2407,48.7593,99.8483
1336,1337,11194,1777,4711,317.198,5.45024,84.5498,99.962
1337,1338,899,281,4697,323.46,81.8133,8.18667,99.9883
1338,1339,2059,1445,4692,160.47299999999996,85.8099,4.19015,99.9845
1339,1340,607,3012,4674,212.702,81.8539,8.14613,99.9843
1340,1341,3465,445,4697,342.232,82.238,7.76204,99.9358
1341,1342,4330,2491,4701,141.701,31.2393,58.7607,99.9467
1342,1343,4299,782,4719,142.46200000000005,59.2249,30.7751,99.9729
1343,1344,9625,1363,4719,165.93200000000004,57.3138,32.6862,99.9462
1344,1345,1746,1179,4709,312.483,12.7636,77.2364,99.9946
1345,1346,11347,1610,4754,315.445,1.35327,88.6467,99.9853
1346,1347,14873,3226,4770,137.328,0.0656433,89.9344,99.8192
1347,1348,21928,1161,4749,307.757,36.0232,53.9768,99.9708
1348,1349,646,3662,4703,247.286,82.6152,7.38483,99.9417
1349,1350,4270,1528,4728,308.047,10.0752,79.9248,99.861
1350,1351,3731,3358,4744,105.686,69.1385,20.8615,99.9895
1351,1352,1653,2549,4726,156.148,66.388,23.612,99.9917
1352,1353,4372,1704,4760,316.177,33.227,56.773,99.9945
1353,1354,2707,513,4745,307.254,76.57600000000002,13.424,99.981
1354,1355,3634,596,4752,309.188,9.80254,80.1975,99.9733
1355,1356,4348,1467,4767,150.213,34.3913,55.6087,99.9759
1356,1357,669,2939,4740,290.913,73.5423,16.4577,99.9702
1357,1358,2824,384,4753,332.696,83.2144,6.78557,99.9736
1358,1359,1850,2750,4756,308.743,44.2199,45.7801,99.9949
1359,1360,3272,2683,4756,145.725,48.2247,41.7753,99.9981
1360,1361,2132,299,4749,141.703,44.7573,45.2427,99.9029
1361,1362,10890,2341,4780,311.001,28.0485,61.9515,99.9798
1362,1363,1386,2428,4748,143.118,48.2986,41.7014,99.9192
1363,1364,3290,2498,4758,150.16299999999995,50.4467,39.5533,99.9909
1364,1365,2356,911,4766,134.525,12.9328,77.0672,99.9598
1365,1366,1070,461,4763,302.009,72.6894,17.3106,99.9859
1366,1367,1829,2565,4773,133.178,16.4093,73.5907,99.9974
1367,1368,6409,2938,4800,148.725,50.3914,39.6086,99.9665
1368,1369,1274,994,4775,133.616,13.0727,76.9273,99.9569
1369,1370,743,3056,4776,193.18400000000003,79.3212,10.6788,99.9827
1370,1371,742,1770,4776,318.676,24.178,65.822,99.9951
1371,1372,2269,1365,4783,304.567,73.8132,16.1868,99.9857
1372,1373,4839,1935,4798,314.25,33.0841,56.9159,99.1459
1373,1374,2773,2468,4801,313.142,7.8986399999999986,82.1014,99.9836
1374,1375,589,1136,4787,140.19,19.7822,70.2178,99.9575
1375,1376,9259,3397,4818,143.88,20.336,69.664,99.9738
1376,1377,2803,2569,4807,313.311,3.02615,86.9738,99.6365
1377,1378,4664,2678,4811,319.017,38.475,51.525,99.978
1378,1379,3806,2777,4812,288.956,76.1295,13.8705,99.9871
1379,1380,900,3601,4799,137.011,33.6145,56.3855,99.9711
1380,1381,1056,3055,4814,170.65400000000002,83.8003,6.19965,99.9702
1381,1382,1218,2063,4807,308.623,49.621,40.379,99.9947
1382,1383,3840,3537,4828,308.684,51.6478,38.3522,99.9635
1383,1384,1134,1758,4804,200.666,77.0022,12.9978,99.9586
1384,1385,2368,3125,4820,138.77,16.9092,73.0908,99.9725
1385,1386,3128,3637,4836,301.8520000000001,68.0277,21.9723,99.9294
1386,1387,1280,2874,4827,316.199,40.0234,49.9766,99.9882
1387,1388,870,3281,4833,142.75,83.7145,6.2855300000000005,99.9878
