,Grain No.,Size [Pixel],center x-coordinate,center y-coordinate,mean azimuth [degree],mean latitude [degree],mean colatitude [degree],Regelungsgrad [%]
0,1,7430,424,158,341.832,37.9476,52.0524,96.9878
1,2,5488,275,179,148.56799999999996,53.4612,36.5388,99.3654
2,3,11110,1069,192,335.19699999999995,0.381516,89.6185,99.9195
3,4,22438,753,206,347.712,51.1698,38.8302,99.9458
4,5,4737,951,210,156.986,25.2525,64.7475,99.9907
5,6,42201,1411,238,168.205,28.0717,61.9283,99.8445
6,7,517,1689,174,327.156,12.6091,77.3909,99.7046
7,8,689,602,173,332.5180000000001,41.9357,48.0643,99.9184
8,9,8729,1783,199,149.014,53.6197,36.3803,99.5942
9,10,12981,501,251,147.563,68.669,21.331,99.3521
10,11,1601,1211,185,352.151,46.3197,43.6803,99.7386
11,12,2000,1651,192,148.813,50.9636,39.0364,99.6384
12,13,4843,1590,205,9.79316,58.8912,31.1088,99.5858
13,14,813,1969,184,326.779,40.1854,49.8146,99.6808
14,15,1459,1911,186,138.858,21.7424,68.2576,99.8457
15,16,1805,2877,193,132.798,41.5046,48.4954,99.6425
16,17,976,2245,196,357.25699999999995,77.3627,12.6373,99.8932
17,18,2048,207,209,145.009,74.1302,15.8698,99.629
18,19,3540,486,216,144.274,31.4669,58.5331,99.9568
19,20,119337,2086,445,329.236,31.4654,58.5346,88.98899999999998
20,21,853,2385,192,350.751,77.6821,12.3179,99.893
21,22,9310,2008,247,132.053,48.4696,41.5304,99.6165
22,23,18555,2282,270,155.414,25.4267,64.5733,99.2747
23,24,22048,3034,251,340.242,62.4103,27.5897,99.8173
24,25,1220,3401,197,136.761,37.1693,52.8307,99.9477
25,26,21307,2549,274,157.29,35.1768,54.8232,99.78
26,27,1931,367,217,141.224,64.9611,25.0389,99.9401
27,28,1123,1138,212,323.04,21.2084,68.7916,99.9977
28,29,545,2743,216,315.079,45.5637,44.4363,99.7708
29,30,1606,3482,225,333.112,52.3134,37.6866,99.9746
30,31,2665,2693,219,149.864,24.4487,65.5513,99.7876
31,32,74378,2778,356,323.151,32.8666,57.1334,99.9838
32,33,53939,3139,375,140.89,21.0788,68.9212,99.0817
33,34,7815,2427,242,127.156,23.8054,66.1946,99.6277
34,35,4507,1705,252,10.0776,55.7236,34.2764,99.9657
35,36,1464,3432,222,341.5030000000001,19.9302,70.0698,99.9605
36,37,712,2872,220,347.2519999999999,52.0302,37.9698,99.9537
37,38,7337,1205,258,225.265,69.0139,20.9861,99.9802
38,39,1963,234,248,158.592,18.0061,71.9939,99.8281
39,40,12107,337,302,337.545,23.5933,66.4067,99.9416
40,41,17447,3336,313,144.07,49.254,40.746,99.457
41,42,21772,1812,309,154.401,13.4323,76.5677,99.1388
42,43,3335,3392,260,331.648,29.9984,60.0016,99.6638
43,44,28657,810,312,331.801,13.6166,76.3834,98.6865
44,45,522,166,244,156.933,62.7805,27.2195,99.6742
45,46,98441,1221,432,332.705,30.3138,59.6862,81.9154
46,47,2972,2661,265,336.675,15.8158,74.1842,99.9944
47,48,1732,603,275,156.101,15.9417,74.0583,99.987
48,49,3358,190,290,165.447,53.1989,36.8011,99.7437
49,50,1716,649,275,335.811,10.0213,79.9787,99.9738
50,51,920,366,266,140.879,65.3176,24.6824,99.9936
51,52,2649,1605,293,281.024,69.064,20.936,99.9424
52,53,654,1644,280,282.29,73.7023,16.2977,99.9595
53,54,1593,2960,299,347.266,49.8846,40.1154,99.9664
54,55,8794,3453,358,305.391,60.2942,29.7058,99.8828
55,56,5276,265,338,339.074,1.2466700000000002,88.7533,97.3548
56,57,48664,645,441,156.981,16.5609,73.4391,99.9549
57,58,995,1323,309,216.962,69.2772,20.7228,99.9663
58,59,5891,940,337,143.59,60.2912,29.7088,99.9867
59,60,6887,1433,359,146.639,53.6766,36.3234,99.936
60,61,9565,2381,347,343.714,18.3968,71.6032,99.966
61,62,1008,1685,332,339.015,41.2496,48.7504,99.9781
62,63,6513,468,361,153.439,41.966,48.034,99.9348
63,64,21287,1553,398,150.253,39.3537,50.6463,99.73
64,65,7915,191,398,338.177,27.6844,62.3156,99.5808
65,66,709,2184,346,135.966,56.2555,33.7445,99.9968
66,67,950,234,356,344.07199999999995,14.0757,75.9243,99.4688
67,68,3097,2268,364,136.204,57.6535,32.3465,99.9967
68,69,136575,1913,730,151.614,13.9707,76.0293,86.1628
69,70,38145,951,492,153.403,35.9462,54.0538,98.0401
70,71,5515,539,421,166.372,72.4605,17.5395,99.9845
71,72,4143,2217,392,158.36700000000005,14.5728,75.4272,99.9822
72,73,35284,2493,463,116.473,68.985,21.015,99.5104
73,74,19459,3354,455,138.256,35.6878,54.3122,98.9553
74,75,17751,361,424,149.29,7.9145699999999986,82.0854,99.9954
75,76,3174,1130,397,332.894,34.4512,55.5488,99.9902
76,77,5593,2161,425,338.472,27.0322,62.9678,99.8781
77,78,1128,1844,398,157.94,1.06795,88.9321,99.9991
78,79,693,2357,433,159.673,3.04937,86.9506,99.4961
79,80,910,805,440,352.233,1.3951,88.6049,99.987
80,81,631,2333,448,132.717,48.5884,41.4116,99.6101
81,82,1501,2295,446,342.537,60.0833,29.9167,99.9934
82,83,1782,1984,447,155.091,7.954860000000001,82.0451,99.8934
83,84,13510,2933,510,148.13299999999995,82.2863,7.71365,98.9681
84,85,51341,2828,645,157.77,4.977519999999998,85.0225,99.0095
85,86,57368,467,646,305.009,65.5388,24.4612,78.1347
86,87,3703,1904,476,158.748,4.32786,85.6721,99.9776
87,88,4790,3077,503,157.67,61.169,28.831,99.9798
88,89,6433,266,510,157.514,58.7846,31.2154,99.952
89,90,1934,176,491,142.941,50.8095,39.1905,99.87
90,91,5895,2390,528,159.447,7.82764,82.1724,99.8344
91,92,10252,3178,524,147.996,15.8924,74.1076,99.977
92,93,2969,2663,506,133.362,67.9738,22.0262,99.9593
93,94,882,817,507,339.585,8.26418,81.7358,99.6486
94,95,2591,1492,520,321.339,75.1119,14.8881,99.2821
95,96,33218,1636,613,151.27,71.2358,18.7642,99.7238
96,97,7845,3362,529,336.019,35.536,54.464,98.6372
97,98,13797,267,634,156.895,28.3653,61.6347,98.3344
98,99,5852,3306,583,342.4530000000001,28.7223,61.2777,98.8123
99,100,13166,2640,614,158.314,4.62749,85.3725,99.9205
100,101,3618,2760,558,101.032,75.4986,14.5014,98.1497
101,102,1048,850,532,123.8,62.1627,27.8373,99.9914
102,103,51837,714,674,319.628,77.7846,12.2154,99.888
103,104,2756,162,575,313.699,56.4696,33.5304,99.9326
104,105,11103,1096,614,159.931,51.8804,38.1196,99.9149
105,106,11170,1464,616,76.6358,75.6036,14.3964,99.8904
106,107,2230,2385,582,169.27599999999995,34.6649,55.3351,99.5484
107,108,10204,3026,608,326.009,37.7118,52.2882,99.9717
108,109,2476,857,580,339.7390000000001,29.914,60.08600000000001,99.9868
109,110,9486,2504,615,154.714,20.5919,69.4081,99.5972
110,111,1254,3464,584,340.421,85.605,4.39498,99.9562
111,112,2088,3167,587,157.982,15.4825,74.5175,99.9803
112,113,761,3257,591,224.61900000000003,85.7341,4.26586,99.961
113,114,882,1179,594,135.18,8.08993,81.9101,99.9925
114,115,11739,366,672,325.048,31.2052,58.7948,99.81
115,116,2198,2708,601,335.856,35.6705,54.3295,99.9294
116,117,15891,1357,670,344.211,35.1972,54.8028,99.9839
117,118,834,815,609,157.937,47.4384,42.5616,99.9982
118,119,525,1534,603,327.795,68.4023,21.5977,99.9947
119,120,15819,3168,661,326.253,36.8757,53.1243,99.9428
120,121,10216,916,650,134.123,65.0822,24.9178,99.8738
121,122,1384,1014,631,344.721,30.3317,59.6683,99.9862
122,123,3233,1183,651,354.02,7.489689999999999,82.5103,99.8362
123,124,30656,2329,712,155.388,61.7424,28.2576,99.7487
124,125,26056,2127,728,313.43,36.5,53.5,99.9948
125,126,51363,3298,813,220.651,78.441,11.559,99.238
126,127,3131,1243,656,347.541,12.0061,77.9939,99.9822
127,128,7387,172,704,156.868,15.1639,74.8361,99.8022
128,129,655,227,638,151.874,56.9472,33.0528,99.9674
129,130,41570,2500,814,342.93,32.3873,57.6127,96.3039
130,131,4736,2454,679,155.939,8.57463,81.4254,99.9646
131,132,2264,1098,679,324.974,34.3136,55.6864,99.9809
132,133,14683,1768,732,129.37,73.1689,16.8311,99.9341
133,134,5058,2021,712,157.959,32.7544,57.2456,99.9876
134,135,507,3272,682,50.3778,84.0893,5.9107400000000005,99.9877
135,136,19817,302,780,325.298,34.0424,55.9576,99.8223
136,137,8034,1009,742,333.755,32.166,57.834,99.9736
137,138,2309,3041,703,141.515,2.9416900000000004,87.0583,99.997
138,139,963,893,704,339.49,31.1915,58.8085,99.9018
139,140,17516,1135,773,157.486,50.4877,39.5123,99.9818
140,141,74138,1284,909,327.92800000000005,26.5306,63.4694,99.9532
141,142,173790,1718,964,161.221,46.4186,43.5814,99.2217
142,143,1001,2577,700,155.033,24.0833,65.9167,99.9961
143,144,120554,2966,1139,160.95600000000005,7.0176,82.9824,87.70200000000001
144,145,852,3255,716,160.142,9.80896,80.191,99.9927
145,146,1606,1418,738,164.822,18.9979,71.0021,99.994
146,147,1902,3108,732,32.4091,87.9486,2.05138,99.9954
147,148,3372,707,752,160.154,47.7061,42.2939,99.9964
148,149,3480,2808,757,324.283,1.98848,88.0115,99.9955
149,150,24942,900,826,136.847,63.5105,26.4895,99.988
150,151,1072,3184,743,28.6909,87.491,2.50897,99.9907
151,152,9029,1896,807,134.113,73.5698,16.4302,99.9489
152,153,828,3053,759,169.81099999999995,4.1620599999999985,85.8379,99.9968
153,154,2119,2737,768,321.252,39.0718,50.9282,99.9854
154,155,28288,2713,850,161.577,21.5272,68.4728,99.9566
155,156,882,2921,781,65.0669,74.262,15.738,99.9762
156,157,2529,595,802,139.984,22.4654,67.5346,99.997
157,158,28683,256,892,133.135,32.8172,57.1828,99.9528
158,159,385099,695,1354,342.3769999999999,8.73978,81.2602,88.5715
159,160,4135,3171,844,145.68,85.897,4.10296,99.9422
160,161,2630,2797,815,322.04,27.8544,62.1456,99.9939
161,162,5805,3342,827,152.339,37.7846,52.2154,99.1774
162,163,6321,3105,850,146.737,86.2103,3.78972,99.9535
163,164,16486,3415,895,339.611,18.4956,71.5044,99.632
164,165,8205,1046,852,150.102,0.962303,89.0377,99.9921
165,166,3474,2250,835,158.565,31.7706,58.2294,99.229
166,167,11400,2276,902,154.225,9.56577,80.4342,99.9804
167,168,1074,1846,826,114.636,67.3475,22.6525,99.7745
168,169,681,2294,847,155.108,59.1062,30.8938,99.981
169,170,2761,546,870,350.455,5.55871,84.4413,99.9696
170,171,1757,1822,865,323.293,10.8462,79.1538,99.9909
171,172,1821,982,870,152.359,50.8164,39.1836,99.9702
172,173,1809,2897,901,308.14,30.0392,59.9608,99.9918
173,174,8338,3279,925,334.353,11.765999999999998,78.234,99.9886
174,175,1149,447,892,68.7698,84.6015,5.39853,99.8652
175,176,4965,1107,958,144.97799999999995,57.0826,32.9174,99.9882
176,177,3821,837,925,213.948,71.5305,18.4695,99.9932
177,178,617,2565,915,344.9430000000001,7.85177,82.1482,99.715
178,179,10009,1028,991,138.102,23.9512,66.0488,99.7387
179,180,4118,172,958,153.09799999999996,26.8635,63.1365,99.5051
180,181,1593,1067,923,134.85299999999998,21.1544,68.8456,99.9762
181,182,44982,2360,1031,176.187,68.3249,21.6751,99.4405
182,183,9026,2627,955,156.93200000000004,61.743,28.257,99.9892
183,184,44847,2782,1036,351.134,33.1191,56.8809,99.9609
184,185,864,2543,940,179.19099999999997,1.52632,88.4737,99.967
185,186,48572,896,1065,326.176,26.7683,63.2317,99.9459
186,187,1855,406,963,107.786,84.6534,5.34665,99.9761
187,188,653,3483,983,358.8280000000001,65.5774,24.4226,99.6637
188,189,4378,3386,985,326.632,62.9281,27.0719,99.7766
189,190,1510,3452,986,356.986,71.2291,18.7709,99.9378
190,191,2538,360,995,97.5262,76.903,13.097,99.498
191,192,2139,2530,994,335.9369999999999,6.35559,83.6444,99.7168
192,193,40208,3250,1109,161.317,8.71969,81.2803,69.5109
193,194,1478,2180,1011,21.4531,71.2214,18.7786,99.9921
194,195,4304,296,1023,333.7390000000001,43.0869,46.9131,99.9554
195,196,17383,2540,1097,321.653,35.1987,54.8013,99.8855
196,197,10405,1175,1050,327.958,49.2464,40.7536,99.9961
197,198,6476,3068,1056,315.449,38.334,51.666,99.9007
198,199,2194,639,1024,337.212,53.9866,36.0134,99.9822
199,200,2211,238,1058,158.903,26.2481,63.7519,99.8496
200,201,12961,3401,1069,149.196,4.44589,85.5541,99.0848
201,202,501,3464,1024,323.262,66.5144,23.4856,99.896
202,203,1086,2664,1042,130.797,16.8021,73.1979,99.2107
203,204,1100,177,1045,335.75699999999995,43.7382,46.2618,99.9858
204,205,6419,2186,1077,322.512,41.4826,48.5174,99.9714
205,206,9786,1457,1084,355.42800000000005,51.1221,38.8779,99.9363
206,207,12348,1062,1133,157.877,38.1103,51.8897,99.9508
207,208,7157,160,1133,330.847,50.295,39.705,99.5221
208,209,7509,2627,1109,332.464,54.0461,35.9539,99.9969
209,210,5194,1675,1083,333.6869999999999,22.0285,67.9715,99.9969
210,211,12507,1718,1149,345.343,48.904,41.096,99.9918
211,212,6238,1267,1140,149.205,34.4663,55.5337,99.9955
212,213,747,1213,1111,135.755,62.5824,27.4177,99.9749
213,214,932,1548,1109,338.033,44.8422,45.1578,99.9967
214,215,2002,1611,1123,134.143,36.3452,53.6548,99.9927
215,216,13982,1179,1192,134.925,20.5772,69.4228,99.841
216,217,9618,1382,1157,312.873,26.4489,63.5511,99.994
217,218,117311,2365,1312,350.3119999999999,47.5899,42.4101,99.9603
218,219,7492,2352,1172,149.157,17.8066,72.1934,99.9813
219,220,9270,743,1175,152.94799999999995,5.9246,84.0754,99.9139
220,221,687,2204,1138,337.03,43.1644,46.8356,99.5521
221,222,20548,1453,1239,148.607,25.2314,64.7686,94.0872
222,223,8035,3417,1189,116.9,37.1335,52.8665,99.9252
223,224,18965,560,1211,327.017,86.2608,3.73916,99.9653
224,225,12500,3123,1210,338.784,11.1725,78.8275,99.9976
225,226,1128,1777,1163,150.025,21.6891,68.3109,99.9891
226,227,4895,2804,1182,331.102,53.0778,36.9222,99.9961
227,228,2006,2596,1174,347.365,60.3952,29.6048,99.9858
228,229,2689,1612,1178,327.68300000000005,40.8902,49.1098,99.9874
229,230,502,2749,1160,338.659,49.3651,40.6349,99.785
230,231,1139,335,1174,320.046,22.5873,67.4127,99.9947
231,232,55882,1832,1411,336.843,45.0424,44.9576,99.6168
232,233,12933,694,1249,350.311,34.5936,55.4064,99.7939
233,234,1787,2679,1181,146.254,63.6994,26.3006,99.9932
234,235,2711,2455,1195,141.16299999999995,60.5628,29.4372,99.9621
235,236,724,2635,1187,154.13,29.5358,60.4642,99.9954
236,237,7592,2722,1232,324.012,48.0342,41.9658,99.9844
237,238,72943,1632,1322,164.07,39.7392,50.2608,99.9883
238,239,7475,888,1232,153.502,32.9532,57.0468,99.9661
239,240,591,3465,1208,157.445,13.29,76.71,99.9019
240,241,1307,944,1204,343.3540000000001,71.1435,18.8565,99.9927
241,242,2623,1061,1231,355.478,51.5571,38.4429,99.9732
242,243,2541,171,1217,339.932,29.9801,60.0199,99.5324
243,244,1044,1185,1213,149.755,32.5931,57.4069,99.9935
244,245,3555,1322,1225,342.016,50.2436,39.7564,99.998
245,246,6659,2067,1236,131.984,74.85600000000002,15.144,99.9854
246,247,18544,3292,1268,313.563,48.1567,41.8433,99.2782
247,248,1378,1265,1252,142.16,28.6801,61.3199,99.9341
248,249,82774,1248,1450,157.137,51.5968,38.4032,80.5087
249,250,2344,1011,1258,162.077,28.8032,61.1968,99.9836
250,251,68046,216,1472,150.395,18.9799,71.0201,99.4323
251,252,688,3468,1276,302.472,50.8462,39.1538,99.9424
252,253,2155,2101,1291,341.3119999999999,31.7699,58.2301,99.8562
253,254,23564,1351,1351,0.396603,46.4074,43.5926,99.9225
254,255,3786,2762,1320,146.138,60.1281,29.8719,99.9288
255,256,543,2711,1301,336.536,2.81923,87.1808,99.9971
256,257,822,2675,1309,139.501,54.7141,35.2859,99.9891
257,258,11516,3287,1369,346.478,32.9636,57.0364,99.9531
258,259,54209,2003,1434,155.05200000000005,33.6728,56.3272,99.9636
259,260,34531,3406,1464,136.47799999999998,35.1873,54.8127,99.6714
260,261,4096,2701,1363,353.641,56.0646,33.9354,99.9897
261,262,16458,3144,1386,158.08100000000005,24.197,65.803,99.7909
262,263,1012,653,1366,172.345,7.17806,82.8219,99.9903
263,264,182874,2866,1617,348.242,27.8577,62.1423,89.6594
264,265,60720,414,1540,310.126,0.809357,89.1906,99.8552
265,266,2016,2753,1424,338.57199999999995,34.9219,55.0781,99.9224
266,267,11567,2449,1459,155.875,17.9068,72.0932,99.9601
267,268,70520,1600,1592,277.41900000000004,65.8968,24.1032,99.5055
268,269,24681,3215,1527,312.082,47.5727,42.4273,99.8519
269,270,653,2582,1457,154.91899999999995,19.3824,70.6176,99.9627
270,271,61980,2352,1594,150.1,48.3326,41.6674,96.8552
271,272,5948,3325,1526,342.064,15.8318,74.1682,99.8366
272,273,3038,2427,1523,343.816,57.6389,32.3611,99.9286
273,274,8013,2091,1573,149.725,4.2281,85.7719,99.9629
274,275,16004,688,1609,327.7,56.4612,33.5388,99.9087
275,276,2882,1994,1560,343.765,48.1306,41.8694,99.8809
276,277,1560,2626,1577,137.88299999999998,59.5251,30.4749,99.7201
277,278,14038,344,1662,304.56,55.6617,34.3383,99.915
278,279,6839,1129,1644,168.095,6.38287,83.6171,99.9868
279,280,9477,3071,1637,315.112,44.6048,45.3952,99.9788
280,281,198828,1168,1938,154.235,44.6489,45.3511,99.8686
281,282,5816,1916,1627,354.117,37.5101,52.4899,99.8312
282,283,1120,2162,1603,155.82299999999995,35.936,54.06399999999999,99.8456
283,284,1244,1861,1611,171.12599999999995,26.7624,63.2376,99.9972
284,285,3945,156,1634,119.59,78.2311,11.7689,99.9564
285,286,3768,2022,1625,292.748,60.3586,29.6414,99.9845
286,287,4011,3346,1633,145.814,54.8947,35.1053,99.6109
287,288,10732,1335,1641,331.371,3.7289,86.2711,99.9864
288,289,3728,578,1669,353.4890000000001,35.2076,54.7924,99.9902
289,290,536,2162,1638,168.91400000000004,26.519,63.481,99.9985
290,291,3903,1977,1672,168.921,28.4421,61.5579,99.9561
291,292,737,2131,1648,157.007,6.27456,83.7254,99.9776
292,293,23574,1933,1726,155.968,31.7285,58.2715,99.854
293,294,3076,3438,1678,148.282,36.7272,53.2728,99.6904
294,295,994,3301,1660,356.414,47.1353,42.8647,99.9307
295,296,11587,3197,1711,346.259,6.64682,83.3532,99.9698
296,297,743,2063,1666,147.88,4.47178,85.5282,99.9985
297,298,5914,1755,1716,169.926,27.1882,62.8118,99.9917
298,299,3211,3362,1689,148.19299999999996,36.8489,53.1511,99.1655
299,300,4942,2140,1689,352.403,54.4585,35.5415,99.9767
300,301,1480,1717,1693,157.349,8.771510000000001,81.2285,99.9929
301,302,14216,2630,1730,45.234,71.7429,18.2571,99.9856
302,303,15651,500,1766,323.691,57.6291,32.3709,99.7987
303,304,1013,2083,1701,153.936,13.5575,76.4425,99.9967
304,305,3150,2251,1710,10.8633,74.9303,15.0697,99.9901
305,306,4884,1405,1733,345.39,71.1537,18.8463,99.9966
306,307,5106,2491,1725,322.249,46.5346,43.4654,99.919
307,308,2293,632,1726,157.018,12.3027,77.6973,99.9488
308,309,60126,3260,1851,341.8040000000001,45.2402,44.7598,99.1038
309,310,1685,1113,1725,170.78900000000004,5.877269999999998,84.1227,99.9953
310,311,2532,3258,1726,146.247,36.5521,53.4479,99.9962
311,312,4155,588,1757,299.791,53.9155,36.0845,99.838
312,313,1024,2179,1732,163.762,82.0067,7.993339999999999,99.9939
313,314,8387,2353,1769,320.45,47.8417,42.1583,99.9874
314,315,4521,289,1757,138.438,32.8574,57.1426,99.9947
315,316,32602,2178,1818,159.57399999999996,7.9344899999999985,82.0655,99.7733
316,317,631,3432,1747,332.945,57.4161,32.5839,99.959
317,318,3608,215,1768,159.504,15.7894,74.2106,99.9837
318,319,2274,1788,1763,135.338,30.619,59.381,99.9883
319,320,1975,2432,1775,154.441,36.2218,53.7782,99.99
320,321,2604,1479,1768,157.977,33.0629,56.9371,99.9525
321,322,1582,3452,1790,119.482,23.0069,66.9931,99.7229
322,323,146884,1910,2031,337.5,1.83026,88.1697,99.903
323,324,1009,341,1786,299.123,45.3591,44.6409,99.995
324,325,519,761,1785,170.58,4.27705,85.723,99.9902
325,326,3910,1416,1799,299.261,70.9437,19.0563,99.9877
326,327,11407,2526,1827,142.944,18.484,71.516,99.9767
327,328,1153,397,1793,161.033,14.5722,75.4278,99.9965
328,329,26754,301,1873,104.939,70.6144,19.3856,99.974
329,330,2044,1521,1806,303.6020000000001,69.9165,20.0835,99.9758
330,331,8553,2033,1844,334.855,56.8895,33.1105,99.9911
331,332,143909,2865,2032,165.37099999999995,76.4559,13.5441,86.7057
332,333,6361,1654,1850,268.16,65.7332,24.2668,99.9932
333,334,2630,469,1835,161.29399999999995,16.505,73.495,99.7398
334,335,10421,2356,1887,144.47299999999996,17.5704,72.4296,99.851
335,336,33765,191,1974,99.8123,75.1715,14.8285,99.745
336,337,1678,414,1844,324.388,61.2801,28.7199,99.8155
337,338,19964,1499,1902,230.02,68.1416,21.8584,99.9239
338,339,11143,2456,1893,166.637,10.7932,79.2068,99.75
339,340,3320,629,1856,141.686,34.9281,55.0719,99.9722
340,341,3124,3436,1870,307.441,29.051,60.949,99.4399
341,342,4873,495,1885,170.074,2.09104,87.90899999999998,99.9081
342,343,5968,2244,1905,162.083,80.1496,9.8504,99.9015
343,344,602,2558,1884,157.31799999999996,37.2105,52.7895,99.9834
344,345,6490,648,1910,351.911,60.3784,29.6216,99.7521
345,346,26745,1637,1995,341.74,29.8083,60.1917,99.8894
346,347,3449,3058,1915,133.713,14.2754,75.7246,99.9821
347,348,29958,2138,2037,166.139,51.6806,38.3194,48.9238
348,349,1024,3434,1921,29.5014,75.8773,14.1227,99.8636
349,350,1381,2556,1949,171.435,9.21284,80.7872,99.9959
350,351,28738,798,2055,149.47,36.4964,53.5036,99.97
351,352,2425,755,1944,151.156,43.2717,46.7283,99.9647
352,353,3618,2128,1948,159.116,30.1083,59.8917,99.9529
353,354,26355,366,2039,333.51,42.63,47.37,73.0666
354,355,697,2240,1949,159.93200000000004,22.5568,67.4432,99.9912
355,356,51895,2443,2041,15.682,81.0164,8.98361,97.1286
356,357,1187,2200,1962,141.986,81.7147,8.28532,99.8579
357,358,24724,3413,2081,132.35,62.6974,27.3026,99.8094
358,359,48870,3197,2034,145.032,38.1189,51.8811,79.1216
359,360,1102,315,1973,165.799,18.2575,71.7425,99.9974
360,361,10510,624,2006,167.12599999999995,7.31636,82.6836,96.8127
361,362,2102,3213,1985,157.172,51.7873,38.2127,99.9926
362,363,646,743,1978,0.892488,52.5373,37.4627,99.6765
363,364,5300,1482,2036,1.31846,64.2994,25.7006,99.8259
364,365,844,689,2050,175.65200000000004,6.11784,83.8822,99.9986
365,366,10990,1554,2093,156.05,43.5242,46.4758,99.9395
366,367,1160,652,2051,161.23,16.4136,73.5864,99.9736
367,368,933,590,2063,159.30100000000004,16.6576,73.3424,99.9827
368,369,191757,381,2377,313.318,30.5599,59.4401,84.4235
369,370,6240,3164,2130,176.507,50.49800000000001,39.502,99.9744
370,371,552,3156,2085,150.346,57.144,32.856,99.9895
371,372,558893,2767,2535,147.296,15.7949,74.2051,96.8959
372,373,1761,911,2112,169.166,5.89394,84.1061,99.9917
373,374,7903,847,2169,161.1,4.47896,85.521,99.9871
374,375,12512,1431,2148,0.245004,62.5164,27.4836,99.9942
375,376,5231,1694,2125,318.543,65.4494,24.5506,99.9904
376,377,11671,2317,2158,351.673,65.6778,24.3222,99.942
377,378,1219,877,2123,336.647,63.4654,26.5346,99.92
378,379,32866,1326,2214,135.718,16.9,73.1,99.9759
379,380,2633,267,2156,311.2390000000001,47.182,42.81800000000001,99.9857
380,381,5344,657,2146,51.7108,51.6311,38.3689,99.9819
381,382,91477,1692,2355,161.68200000000004,21.4099,68.5901,91.0518
382,383,2681,204,2145,162.761,30.8353,59.1647,99.9093
383,384,10719,1586,2202,319.718,43.4333,46.5667,99.9948
384,385,9635,148,2222,304.452,50.63,39.37,99.785
385,386,6652,1205,2218,307.0370000000001,65.1873,24.8127,99.9808
386,387,50727,3327,2286,323.028,66.3255,23.6745,99.3896
387,388,1694,315,2197,161.85,30.0364,59.9636,99.9867
388,389,9599,969,2253,343.386,62.1819,27.8181,99.8851
389,390,5015,734,2223,340.494,64.1317,25.8683,99.9958
390,391,150915,1149,2522,161.469,35.3281,54.6719,97.6118
391,392,35502,2113,2284,329.838,33.768,56.232,99.4474
392,393,3364,811,2243,6.98975,43.6384,46.3616,99.9951
393,394,1581,919,2218,155.249,26.5168,63.4832,99.9904
394,395,7107,1505,2250,347.62,5.22641,84.7736,99.9715
395,396,1994,862,2248,49.1654,72.9071,17.0929,99.9696
396,397,71909,752,2453,193.754,30.553,59.447,99.9268
397,398,1747,893,2299,150.247,44.2192,45.7808,99.9931
398,399,29630,1327,2420,355.571,5.71364,84.2864,99.8734
399,400,14229,1418,2358,67.9049,74.2342,15.7658,99.9679
400,401,1777,1876,2312,133.002,22.0557,67.9443,99.9956
401,402,1400,847,2318,336.539,61.1277,28.8723,99.9967
402,403,25316,532,2423,179.115,59.6468,30.3532,99.9395
403,404,2485,129,2351,302.495,17.5896,72.4104,99.7645
404,405,42845,1909,2459,318.441,47.1439,42.8561,97.6704
405,406,37434,941,2444,131.779,16.6827,73.3173,99.9394
406,407,74333,3290,2510,321.813,12.393,77.607,55.0319
407,408,720,1852,2377,146.076,57.5583,32.4417,99.9968
408,409,24141,2141,2439,347.732,18.1805,71.8195,99.9702
409,410,7364,1518,2415,348.2290000000001,6.50846,83.4915,99.9584
410,411,1793,1908,2385,141.007,19.1431,70.8569,99.9959
411,412,1629,3051,2388,285.583,63.7303,26.2697,99.9783
412,413,2938,3057,2425,284.14,63.7479,26.2521,99.9773
413,414,1177,118,2442,142.78799999999995,57.108,32.892,99.9388
414,415,2293,3445,2479,128.29,17.9697,72.0303,99.8527
415,416,105259,1642,2705,333.956,47.0527,42.9473,99.8235
416,417,670,3058,2486,160.575,57.3565,32.6435,99.9959
417,418,82636,2247,2636,319.642,47.7868,42.2132,99.9742
418,419,4805,595,2514,155.515,16.5532,73.4468,99.9798
419,420,3264,3093,2539,286.401,61.4464,28.5536,99.007
420,421,25873,1963,2656,157.015,19.1495,70.8505,99.8354
421,422,510,96,2560,309.466,37.9944,52.0056,99.9638
422,423,2584,2052,2577,318.498,22.9803,67.0197,99.9885
423,424,2868,542,2574,358.7340000000001,61.1453,28.8547,99.9623
424,425,4309,613,2600,192.782,29.3384,60.6616,99.9927
425,426,6689,1844,2594,33.1315,78.4646,11.5354,99.9555
426,427,7250,706,2620,309.785,39.5125,50.4875,99.9952
427,428,3307,488,2628,27.216,69.738,20.262,99.861
428,429,1352,3167,2627,313.334,56.254,33.746,99.892
429,430,1052,3341,2623,295.428,71.5484,18.4516,99.9732
430,431,464824,444,3164,10.7267,69.27199999999999,20.728,81.5722
431,432,1283,72,2640,319.6690000000001,37.2646,52.7354,97.5303
432,433,2307,2014,2670,38.8745,81.8183,8.18175,99.9878
433,434,230132,932,3057,318.712,46.0807,43.9193,92.4979
434,435,18176,1171,2716,174.502,61.9287,28.0713,99.9891
435,436,431070,1497,3285,159.14,15.299,74.70100000000002,87.6594
436,437,3318,645,2689,181.985,58.9596,31.0404,99.9865
437,438,2301,3363,2715,288.311,72.6796,17.3204,99.9748
438,439,4569,2065,2719,99.7886,78.831,11.169,99.9855
439,440,4567,695,2735,285.397,68.3136,21.6864,99.9901
440,441,21622,1882,2831,147.06,35.9837,54.0163,99.9849
441,442,3338,3367,2788,303.858,58.4521,31.5479,99.8606
442,443,36321,2392,2841,305.54,60.5059,29.4941,99.9019
443,444,4914,3306,2783,314.933,54.7462,35.2538,99.8179
444,445,32181,2102,2846,40.2416,84.4831,5.51692,99.8528
445,446,18429,3415,3033,128.609,26.6646,63.3354,99.4792
446,447,2427,2951,2820,143.981,7.17433,82.8257,99.9635
447,448,23900,3321,2922,121.838,30.7643,59.2357,98.9455
448,449,4341,2851,2855,306.586,36.1909,53.8091,99.9954
449,450,11843,392,2909,113.068,47.9952,42.0048,99.8555
450,451,21751,2687,2918,317.263,62.1467,27.8533,99.9702
451,452,953,1127,2848,348.146,2.22102,87.779,99.998
452,453,507,3356,2847,136.843,71.8105,18.1895,99.9248
453,454,649,3449,2874,137.63299999999998,24.5063,65.4937,99.9285
454,455,1436,1206,2864,341.314,3.53185,86.4681,99.9923
455,456,500,3089,2861,156.499,20.9178,69.0822,99.9146
456,457,25218,2445,2972,340.6330000000001,51.6357,38.3643,89.4233
457,458,3113,1786,2912,344.264,38.5703,51.4297,99.9679
458,459,3284,2263,2900,294.487,49.1678,40.8322,99.99
459,460,1305,500,2897,114.293,42.2194,47.7806,99.9946
460,461,1006,2896,2899,143.132,10.3333,79.6667,99.9595
461,462,3211,2002,2906,355.577,13.1828,76.8172,99.9843
462,463,27864,1938,3009,347.4190000000001,4.56291,85.4371,99.7786
463,464,33918,1781,3029,150.628,28.6654,61.3346,86.848
464,465,33658,2874,3001,337.316,13.3235,76.6765,99.7942
465,466,9644,2212,2985,134.154,86.7043,3.2957400000000003,99.9158
466,467,55267,2638,3104,307.155,33.826,56.174,52.637
467,468,43343,3265,3104,296.838,53.3472,36.6528,99.1429
468,469,978,2291,3005,321.802,33.1628,56.8372,99.9753
469,470,11631,2109,3046,148.39700000000005,35.0015,54.9985,99.9934
470,471,916,2722,3010,316.38,38.7812,51.2188,99.9941
471,472,693,2519,3001,115.043,21.5767,68.4233,99.9345
472,473,582,348,3007,359.646,62.7,27.3,99.931
473,474,5899,619,3060,114.839,43.2511,46.7489,99.9552
474,475,4986,311,3030,107.907,49.1601,40.8399,99.9746
475,476,18842,2252,3105,319.886,18.7334,71.2666,99.959
476,477,550,254,3063,111.064,47.5776,42.4224,99.7342
477,478,687,221,3052,167.954,11.6701,78.3299,99.9928
478,479,117269,3000,3377,99.0864,71.268,18.732,99.2959
479,480,13876,2045,3130,148.422,35.1629,54.8371,99.9919
480,481,652,2812,3082,122.549,26.8881,63.1119,99.9976
481,482,591,3439,3112,138.3,22.7373,67.2627,99.8901
482,483,8507,171,3112,102.431,51.4416,38.5584,99.9346
483,484,513,2404,3084,337.139,15.0733,74.9267,99.9599
484,485,9712,2358,3171,133.001,29.5093,60.4907,99.9608
485,486,34192,1367,3241,311.266,34.7015,55.2985,99.9778
486,487,2516,2877,3113,278.627,63.0684,26.9316,99.9554
487,488,1076,2153,3110,320.507,31.6237,58.3763,99.9796
488,489,711,2919,3096,278.29200000000003,66.5929,23.4071,99.9927
489,490,40415,2490,3246,155.094,29.831,60.169,99.9532
490,491,513,3104,3118,305.967,50.4678,39.5322,99.9923
491,492,12454,141,3248,116.529,50.2086,39.7914,99.9307
492,493,5931,1964,3159,330.224,66.1323,23.8677,99.9918
493,494,778,1068,3144,301.916,67.003,22.997,99.7878
494,495,804,125,3146,101.981,43.7667,46.2333,99.9871
495,496,839,2121,3156,321.1740000000001,31.4069,58.5931,99.9729
496,497,8282,3113,3198,345.395,24.8116,65.1884,99.9719
497,498,8574,1237,3192,138.767,58.2242,31.7758,99.9737
498,499,1547,135,3176,114.493,50.7505,39.2495,99.884
499,500,17137,2214,3220,321.472,16.7784,73.2216,99.9789
500,501,1367,832,3184,3.38222,67.273,22.727,99.9988
501,502,3495,207,3205,5.74814,47.4669,42.5331,99.9875
502,503,775,3002,3192,94.0219,69.0253,20.9747,99.9942
503,504,9182,3264,3256,154.313,22.655,67.345,99.822
504,505,5225,3359,3258,162.716,37.8504,52.1496,99.4959
505,506,8106,799,3256,319.6740000000001,37.3555,52.6445,99.972
506,507,23772,2721,3292,312.214,63.7869,26.2131,99.9605
507,508,6913,2028,3267,343.376,41.732,48.268,99.9647
508,509,1716,2079,3235,11.2151,67.8933,22.1067,99.9884
509,510,1468,1443,3236,132.07399999999998,15.2424,74.7576,99.9824
510,511,1251,1925,3231,330.3769999999999,69.2782,20.7218,99.994
511,512,1094,2731,3230,76.3059,71.0719,18.9281,99.9945
512,513,52115,1872,3388,168.72299999999996,73.6406,16.3594,78.0019
513,514,597,3081,3257,87.0996,72.3592,17.6408,99.9964
514,515,2208,3150,3271,77.3284,74.5709,15.4291,99.9366
515,516,105286,2227,3428,229.87,78.0873,11.9127,99.2965
516,517,32545,3323,3411,141.641,21.4366,68.5634,98.0592
517,518,959,89,3316,157.06,82.5724,7.42761,99.9806
518,519,5135,135,3352,148.304,82.93,7.07003,99.9373
519,520,1026,3152,3317,81.3248,75.639,14.361,99.9666
520,521,389609,617,3781,331.157,11.2818,78.7182,68.7432
521,522,1798,877,3357,3.97027,66.0585,23.9415,99.9751
522,523,22159,2556,3414,124.521,28.9966,61.0034,99.9091
523,524,1468,86,3377,132.405,50.0858,39.9142,99.9701
524,525,2299,1760,3378,165.28799999999995,62.6016,27.3984,99.9947
525,526,6587,2019,3400,327.636,21.0154,68.9846,99.9983
526,527,44299,1205,3536,322.707,44.6459,45.3541,99.9456
527,528,589,568,3411,356.091,51.32899999999999,38.671,99.99
528,529,8927,139,3449,114.335,47.0626,42.9374,99.7658
529,530,179565,2527,3704,329.756,37.5096,52.4904,76.7
530,531,3756,2564,3463,313.68,25.6653,64.3347,99.9952
531,532,690,3437,3465,135.099,23.5209,66.4791,99.8099
532,533,7379,192,3506,122.569,36.0409,53.9591,99.7421
533,534,569950,1915,4108,152.537,18.0463,71.9537,90.3612
534,535,740,101,3531,132.377,36.0627,53.9373,99.9127
535,536,9677,3292,3567,337.594,19.3167,70.6833,99.327
536,537,14034,2844,3611,330.376,12.1119,77.8881,99.9365
537,538,19377,1337,3622,323.8,53.1292,36.8708,99.9928
538,539,21218,3356,3679,153.259,14.7666,75.2334,99.0932
539,540,5191,879,3593,343.55,53.2987,36.7013,99.987
540,541,12579,3193,3622,166.308,30.4723,59.5277,99.9922
541,542,1833,87,3591,103.312,48.4508,41.5492,99.9738
542,543,763,2331,3588,260.344,80.8424,9.15755,99.9897
543,544,14779,2961,3635,326.4890000000001,37.7921,52.2079,97.4848
544,545,12137,1644,3647,356.9980000000001,68.622,21.378,99.9422
545,546,11672,1223,3674,324.933,53.4072,36.5928,99.9968
546,547,1950,598,3633,106.688,43.3918,46.6082,99.9927
547,548,11105,3120,3693,327.399,15.017,74.983,99.8155
548,549,13651,374,3691,171.852,80.1908,9.80915,99.9923
549,550,7299,3039,3717,58.9183,69.8199,20.1801,99.9571
550,551,1142,3253,3689,232.99,76.9025,13.0975,99.9664
551,552,1253,2899,3694,331.824,13.4651,76.5349,99.9346
552,553,11782,1161,3765,355.254,0.549454,89.4505,99.9943
553,554,111532,2915,3834,155.843,26.3963,63.6037,99.4837
554,555,8333,1413,3782,323.463,43.5424,46.4576,99.9171
555,556,1761,3409,3773,15.6972,84.3575,5.6425,99.7882
556,557,4618,1331,3754,174.515,38.7629,51.2371,99.9135
557,558,24637,1260,3864,154.89600000000004,34.7239,55.2761,99.9859
558,559,3678,3277,3803,337.543,30.2005,59.7995,99.9555
559,560,1148,677,3799,123.0,35.2298,54.7702,99.9986
560,561,1657,3084,3807,325.569,13.3485,76.6515,99.9856
561,562,771,1336,3809,323.485,44.7148,45.2852,99.9932
562,563,504,2544,3813,125.53,62.3685,27.6315,99.936
563,564,1516,3358,3834,17.4506,87.0998,2.9001900000000003,99.9562
564,565,47075,1308,4013,147.295,24.0048,65.9952,90.3773
565,566,3258,773,3846,152.564,27.9552,62.0448,99.998
566,567,88748,692,4006,204.933,83.6411,6.35892,64.7471
567,568,17500,3372,3953,140.986,7.94378,82.0562,99.1583
568,569,1611,2549,3845,135.129,59.3758,30.6242,99.9909
569,570,14316,3202,3927,130.124,60.6276,29.3724,99.8477
570,571,4500,2861,3877,335.5730000000001,8.0882,81.9118,99.9872
571,572,5362,2772,3884,321.358,46.8337,43.1663,99.9715
572,573,550,2911,3878,151.85,56.7915,33.2085,99.9916
573,574,10403,3268,3968,129.395,60.8448,29.1552,99.8741
574,575,14456,854,3927,138.25,19.3444,70.6556,99.9717
575,576,1650,1158,3921,80.4567,78.8481,11.1519,99.9906
576,577,22390,2653,4013,154.201,23.8329,66.1671,99.9479
577,578,7721,2848,3966,22.3676,72.433,17.567,99.9403
578,579,1377,734,3933,350.466,22.7589,67.2411,99.9956
579,580,775,2923,3932,147.185,55.34,34.66,99.7054
580,581,3512,997,3962,160.95,22.4815,67.5185,99.986
581,582,10315,1110,3988,333.3540000000001,22.5913,67.4087,99.9689
582,583,542,2785,3964,313.427,46.7865,43.2135,99.9957
583,584,7166,3113,4023,352.957,50.1368,39.8632,99.8277
584,585,28014,2386,4112,335.591,63.8547,26.1453,79.5103
585,586,1099,403,4021,144.97899999999996,40.6335,49.3665,99.9554
586,587,543,2469,4023,163.251,29.0566,60.9434,99.956
587,588,1545,2783,4028,146.748,51.224,38.776,99.9649
588,589,9894,2867,4066,111.834,52.0032,37.9968,99.5212
589,590,4578,2710,4076,140.714,55.8337,34.1663,99.8651
590,591,14274,1015,4119,171.81099999999995,52.4479,37.5521,99.9814
591,592,839,3416,4056,148.46,6.08922,83.9108,99.6469
592,593,9971,728,4086,335.952,20.9086,69.0914,99.9786
593,594,12769,1634,4078,356.3780000000001,45.9423,44.0577,99.9946
594,595,14145,1130,4115,351.569,27.4638,62.5362,99.9732
595,596,825,2502,4056,162.759,28.5565,61.4435,98.5961
596,597,1833,3366,4080,120.057,28.7802,61.2198,99.8144
597,598,215250,1137,4481,330.516,1.23097,88.76899999999998,90.3076
598,599,853,3163,4057,142.234,55.0733,34.9267,99.409
599,600,54043,3281,4207,345.546,27.9014,62.0986,98.8639
600,601,51836,2937,4177,142.821,53.2344,36.7656,92.6616
601,602,23444,366,4153,138.898,27.2146,62.7854,99.9865
602,603,6726,2529,4121,356.3780000000001,67.1793,22.8207,99.9879
603,604,53284,608,4224,350.61300000000006,29.2763,60.7237,99.9142
604,605,16368,1568,4187,154.423,33.8321,56.1679,99.9952
605,606,8560,2278,4153,1.31628,80.4815,9.51848,99.9712
606,607,2212,2732,4126,171.31,47.8807,42.1193,99.9018
607,608,32685,892,4235,352.146,50.0246,39.9754,99.7652
608,609,30027,1610,4260,61.6492,74.7063,15.2937,99.8267
609,610,10520,2629,4172,162.16,22.4841,67.5159,99.9971
610,611,536,46,4160,333.1430000000001,42.3522,47.6478,99.9031
611,612,4165,3119,4203,346.088,75.1506,14.8494,99.9177
612,613,2492,794,4184,336.265,28.2255,61.7745,99.6602
613,614,2065,2364,4175,351.404,79.5691,10.4309,99.9816
614,615,26152,1175,4244,324.137,57.8303,32.1697,99.8759
615,616,3254,2157,4181,87.86399999999998,74.49,15.51,99.9967
616,617,904,1064,4201,135.303,56.6318,33.3682,97.8151
617,618,5382,2520,4210,116.827,75.8239,14.1761,99.9834
618,619,1280,3177,4207,345.12,74.2154,15.7846,99.9893
619,620,32194,2285,4291,164.06900000000005,17.6159,72.3841,99.9795
620,621,20502,397,4311,338.961,69.2557,20.7443,99.9156
621,622,7188,2771,4242,318.278,71.5965,18.4036,99.9472
622,623,11968,2120,4266,97.6427,74.3573,15.6427,99.9825
623,624,9749,302,4259,184.035,76.0878,13.9122,99.9893
624,625,25941,2571,4314,354.468,28.3937,61.6063,99.8662
625,626,867,2669,4237,348.857,26.0947,63.9053,99.9906
626,627,58065,172,4397,154.713,66.6918,23.3082,99.7195
627,628,2998,2481,4276,324.665,49.0737,40.9263,99.9973
628,629,3243,2719,4289,137.545,4.86691,85.1331,99.7605
629,630,1988,2983,4269,309.55,66.6356,23.3644,99.9922
630,631,26849,3053,4338,352.045,27.1804,62.8196,99.906
631,632,8055,708,4311,319.581,68.8262,21.1737,99.9845
632,633,579,1305,4275,3.3793900000000003,65.3011,24.6989,99.9896
633,634,12623,2033,4334,312.724,49.8626,40.1374,99.9784
634,635,823,1185,4292,3.95471,65.6963,24.3037,99.994
635,636,8479,2837,4334,175.98,71.7671,18.2329,99.9782
636,637,52173,791,4421,0.453937,59.4213,30.5787,99.8187
637,638,12345,1102,4350,174.358,76.8348,13.1652,99.9892
638,639,7159,3236,4361,348.602,19.5876,70.4124,99.8907
639,640,22811,2401,4415,322.879,49.4933,40.5067,99.986
640,641,1254,2761,4350,350.686,24.701,65.29899999999999,99.9866
641,642,13571,559,4399,349.0030000000001,7.12086,82.8791,99.9836
642,643,754,2707,4352,178.97799999999995,71.9146,18.0854,99.9533
643,644,2609,1649,4391,208.07,78.1888,11.8112,99.9652
644,645,18811,1545,4414,4.17019,65.5001,24.4999,99.9945
645,646,13539,3340,4415,130.843,26.2582,63.7418,99.5188
646,647,12318,1000,4424,150.705,32.4246,57.5754,99.996
647,648,3688,1728,4406,343.05,41.7063,48.2937,99.9691
648,649,226363,2843,4618,304.802,68.907,21.093000000000004,66.2551
649,650,2110,2611,4387,178.418,76.65100000000002,13.349,99.4146
650,651,10428,3129,4462,318.93,43.3642,46.6358,99.9292
651,652,660,2768,4389,337.251,48.7975,41.2025,99.9671
652,653,18181,396,4431,147.016,36.9471,53.0529,99.9736
653,654,6665,3209,4442,320.371,43.9852,46.0148,99.9558
654,655,1477,1186,4415,13.8064,58.3401,31.6599,99.9578
655,656,5178,1105,4426,322.079,57.6411,32.3589,99.9929
656,657,2559,2995,4428,148.675,55.5237,34.4763,99.9915
657,658,620,2625,4420,339.242,41.4483,48.5517,99.9916
658,659,3355,2519,4450,157.296,2.22892,87.7711,99.9725
659,660,3895,1257,4453,152.463,6.89048,83.1095,99.9902
660,661,1821,3034,4453,331.88199999999995,44.4478,45.5522,99.8519
661,662,94586,2277,4639,174.892,35.4835,54.5165,99.8219
662,663,680,647,4459,0.732178,81.3717,8.62835,99.9979
663,664,13484,503,4508,137.843,21.1319,68.8681,99.9436
664,665,9083,3361,4515,334.0680000000001,59.3819,30.6181,99.4032
665,666,12604,3272,4568,154.579,36.8245,53.1755,97.9824
666,667,959,1477,4496,149.738,29.4998,60.5002,99.9926
667,668,62881,521,4619,355.019,6.39874,83.6013,99.6569
668,669,1697,1785,4544,311.279,49.0842,40.9158,99.9452
669,670,4609,149,4554,143.29399999999995,22.5902,67.4098,99.8294
670,671,22040,215,4644,150.885,24.704,65.296,99.232
671,672,5000,2057,4594,356.407,53.6398,36.3602,99.9969
672,673,1531,47,4583,14.7052,58.2958,31.7042,99.8832
673,674,44698,1275,4679,15.3755,37.3238,52.6762,99.9255
674,675,25030,1862,4644,341.117,42.0489,47.9511,99.9581
675,676,7150,3359,4630,300.185,23.5151,66.4849,99.9097
676,677,888,110,4593,20.1085,38.5351,51.4649,99.9018
677,678,6755,3181,4642,1.62719,33.8058,56.1942,99.9685
678,679,772,82,4624,18.6143,63.9297,26.0703,99.8832
679,680,732,927,4637,10.0065,59.0864,30.9136,99.9771
680,681,1249,54,4667,348.16,36.7563,53.2437,99.9509
681,682,1113,1485,4652,350.88699999999994,46.5997,43.4003,99.9242
682,683,715,77,4660,343.467,47.8365,42.1635,99.7029
683,684,1287,3304,4678,180.539,73.0396,16.9604,99.9633
684,685,3567,2721,4683,161.27,2.51717,87.4828,99.9635
685,686,7768,3291,4717,298.946,41.725,48.275,99.4809
686,687,1382,3385,4689,293.236,47.3887,42.6113,99.9468
687,688,3361,1134,4711,359.624,69.472,20.528,99.9726
688,689,12776,1948,4743,119.883,62.6103,27.3897,99.7597
689,690,44721,2629,4786,340.6380000000001,0.194664,89.8053,99.8443
690,691,2234,2659,4731,348.241,0.975174,89.0248,99.988
691,692,10436,2108,4748,156.661,2.883,87.117,99.8044
692,693,2031,3210,4742,304.011,40.5498,49.4502,99.6788
693,694,794,1846,4735,157.333,2.49052,87.5095,99.9016
694,695,3699,381,4746,241.974,57.1524,32.8476,99.5449
695,696,1168,1378,4753,311.62,57.6198,32.3802,99.8134
696,697,14121,3283,4798,307.478,39.2397,50.7603,99.7971
697,698,15227,1136,4813,312.625,60.591,29.409,99.1413
698,699,1689,1354,4788,299.03,36.4536,53.5464,99.9259
699,700,1696,2320,4809,297.286,28.112,61.88800000000001,99.8662
700,701,3151,2401,4834,342.43,2.07618,87.9238,99.7763
701,702,1050,2473,4830,347.444,1.24559,88.7544,99.996
702,703,538,997,4825,321.736,56.9533,33.0467,99.9546
