,Grain No.,Size [Pixel],center x-coordinate,center y-coordinate,mean azimuth [degree],mean latitude [degree],mean colatitude [degree],Regelungsgrad [%]
0,1,26497,1234,175,217.80900000000003,50.6841,39.3159,99.8797
1,2,1598,1838,125,221.09,12.7214,77.2786,99.8595
2,3,576,1980,111,2.79718,80.6185,9.38148,99.746
3,4,373213,2816,501,36.927,16.8912,73.1088,99.3897
4,5,29289,2026,194,29.2232,30.0969,59.9031,99.7751
5,6,656,2017,117,358.45,80.3565,9.64347,99.3186
6,7,44671,1482,223,30.1116,28.0376,61.9624,98.3264
7,8,1688,1552,125,30.1432,72.8827,17.1173,99.9302
8,9,13849,1681,165,276.942,77.3822,12.6178,99.9227
9,10,58590,2525,256,37.4556,3.45467,86.5453,99.7506
10,11,5983,2624,138,230.718,81.4524,8.5476,99.9286
11,12,870,2719,121,231.186,51.5253,38.4747,99.9427
12,13,92263,2268,339,217.701,35.1365,54.8635,99.5047
13,14,15763,3232,186,24.4598,64.0453,25.9547,99.7786
14,15,206170,921,423,40.634,12.6734,77.3266,87.53299999999999
15,16,17518,2798,178,212.196,5.117,84.883,99.9868
16,17,1931,1095,157,28.839,9.85546,80.1445,99.6085
17,18,3378,2427,151,218.927,2.54034,87.4597,99.9792
18,19,21459,1846,219,40.294,10.6338,79.3662,99.9344
19,20,994,3310,161,229.966,12.1531,77.8469,99.9643
20,21,1587,837,196,27.7609,34.3539,55.6461,99.9198
21,22,2032,1923,205,230.819,53.611,36.389,99.9961
22,23,13689,608,242,29.7674,20.1977,69.8023,99.9441
23,24,1721,516,216,239.227,76.9018,13.0981,99.9374
24,25,18359,725,275,38.2167,4.18294,85.8171,99.9865
25,26,2412,3318,261,232.134,57.3492,32.6508,99.9023
26,27,34855,336,301,236.557,76.4771,13.5229,99.9697
27,28,2187,1307,252,218.583,28.0762,61.9238,99.9951
28,29,3845,483,261,213.316,36.5433,53.4567,95.9025
29,30,1342,1713,242,43.594,12.3362,77.6638,99.994
30,31,10698,1675,286,205.952,50.9517,39.0483,99.9704
31,32,29745,3246,347,217.117,61.1028,28.8972,99.9788
32,33,557,157,268,13.851,85.28399999999998,4.71601,99.9588
33,34,5026,1799,300,12.4365,71.5407,18.4593,99.9963
34,35,1259,1341,296,29.4957,54.18600000000001,35.814,99.9928
35,36,64040,1367,468,38.8576,3.90884,86.0912,79.6049
36,37,812,2142,297,32.8192,31.6237,58.3763,99.992
37,38,2040,132,301,217.036,5.33415,84.6658,99.5912
38,39,82637,2022,470,16.1074,71.597,18.403,99.849
39,40,6024,515,338,24.0397,64.6936,25.3064,99.9884
40,41,4145,176,361,209.655,24.1202,65.8798,99.9484
41,42,547,610,329,308.208,74.5549,15.4451,99.989
42,43,26794,1762,391,7.7422,69.7798,20.2202,99.9903
43,44,7387,736,357,323.44,79.6325,10.3675,99.9776
44,45,21707,2593,412,35.9895,73.0872,16.9128,85.5726
45,46,1150,1331,346,170.826,79.1145,10.8855,99.9871
46,47,5461,1613,382,31.3751,23.338,66.66199999999999,99.9937
47,48,24283,299,444,34.4102,17.0452,72.9548,99.2688
48,49,26751,532,435,218.511,36.725,53.275,99.953
49,50,4217,406,424,30.3256,10.9262,79.0738,99.9413
50,51,5908,1296,401,225.933,70.3579,19.6421,99.9869
51,52,2403,129,403,211.708,25.2863,64.7137,99.8116
52,53,2266,1578,429,215.404,31.2262,58.7738,99.9645
53,54,3584,1917,436,196.361,64.7331,25.2669,99.9911
54,55,2722,3309,435,42.4475,74.0089,15.9911,99.9414
55,56,6196,1176,449,238.982,74.8271,15.1729,99.9735
56,57,2783,1090,453,64.04899999999999,80.2595,9.74053,99.9924
57,58,1898,2378,443,44.2066,25.2942,64.7058,99.9891
58,59,81816,1627,599,358.04,62.3692,27.6308,97.9381
59,60,5864,1315,456,239.256,62.8228,27.1772,99.9857
60,61,3664,129,466,32.8046,26.216,63.784,99.929
61,62,1141,212,468,29.1476,20.4741,69.5259,99.6014
62,63,2517,1232,492,221.95,37.7965,52.2035,99.993
63,64,1084,1566,487,16.2259,55.9524,34.0476,98.1474
64,65,44642,474,692,18.2128,59.6334,30.3666,81.4508
65,66,693,3351,488,26.591,49.0363,40.9637,99.8283
66,67,4739,2182,540,15.3474,70.5398,19.4602,99.7177
67,68,1199,85,506,43.4148,58.4655,31.5345,99.9007
68,69,5598,2585,537,43.3891,52.5675,37.4325,99.8638
69,70,4344,251,525,35.0551,1.44858,88.5514,99.1177
70,71,1311,192,529,29.4545,45.7642,44.2358,99.9915
71,72,7934,46,650,47.1127,57.2295,32.7705,99.8452
72,73,5739,2134,572,216.962,31.57,58.43,99.9866
73,74,4317,848,552,222.185,30.6879,59.3121,99.9719
74,75,1587,3331,564,33.3158,65.5852,24.4148,99.7391
75,76,1774,340,559,32.8861,6.0425900000000015,83.9574,99.9767
76,77,22592,1855,633,25.3959,71.3676,18.6324,99.9781
77,78,1288,167,566,204.48,33.0587,56.9413,99.9888
78,79,5480,1119,603,47.3238,83.2533,6.74672,99.987
79,80,8851,264,621,29.6375,47.975,42.025,99.9883
80,81,180342,3136,1011,226.603,10.1961,79.8039,99.3354
81,82,2931,191,607,213.586,38.9555,51.0445,99.9912
82,83,4214,1427,615,231.67,59.0761,30.9239,99.994
83,84,5340,336,619,212.218,5.16626,84.8337,99.9883
84,85,5451,1202,622,356.125,72.9897,17.0103,99.9976
85,86,548,841,609,220.703,67.6878,22.3122,99.9927
86,87,2337,2191,630,218.203,47.9653,42.0347,99.998
87,88,14924,651,693,36.7995,26.5597,63.4403,99.9637
88,89,1499,2351,630,28.7936,71.3472,18.6529,99.9964
89,90,24318,1301,708,127.102,86.0669,3.93308,99.9501
90,91,1327,144,642,40.7918,57.3419,32.6581,99.989
91,92,16805,857,691,222.586,49.3135,40.6865,99.9728
92,93,886,2138,639,220.933,25.1687,64.8313,99.994
93,94,17666,2262,703,36.5735,1.14389,88.8561,99.9969
94,95,1214,723,654,224.223,37.4836,52.5164,99.9985
95,96,557,1112,663,342.971,73.8766,16.1234,99.9624
96,97,11603,119,733,41.1646,56.9035,33.0965,99.9823
97,98,10767,1166,706,219.345,29.7315,60.2685,99.986
98,99,5321,207,696,181.071,77.7133,12.2867,99.9889
99,100,620,1972,667,210.03,21.8885,68.1115,99.9942
100,101,535,2711,665,21.4039,58.0631,31.9369,99.9852
101,102,15086,2119,736,30.0631,46.2765,43.7235,99.9742
102,103,572,1072,676,1.21166,74.7469,15.2531,99.993
103,104,2307,3129,690,222.424,52.9004,37.0996,99.996
104,105,73913,2914,885,235.06,78.6659,11.3341,51.4358
105,106,141654,297,933,215.474,6.79237,83.2076,99.9634
106,107,21367,1924,764,223.911,73.2985,16.7015,97.9749
107,108,14079,1737,748,32.7316,50.3916,39.6084,99.9875
108,109,35927,2687,825,240.067,15.5047,74.4953,99.9439
109,110,27022,924,815,220.009,49.2634,40.7366,76.3819
110,111,2575,1083,719,34.9015,21.4875,68.5125,99.9339
111,112,1026,3080,713,41.4673,14.5249,75.4751,99.997
112,113,7859,3047,770,247.534,72.4367,17.5633,99.9874
113,114,6572,3149,755,227.701,16.8788,73.1212,99.9964
114,115,515,779,726,51.9721,74.0004,15.9996,99.9848
115,116,31761,685,821,42.6572,46.4954,43.5046,99.9534
116,117,2421,562,763,26.4791,51.591,38.409,99.9847
117,118,31403,1543,835,216.141,36.4056,53.5944,99.9694
118,119,819,1388,754,22.3293,77.7877,12.2123,99.8734
119,120,4577,826,787,39.5075,53.145,36.855,99.9926
120,121,13514,1368,813,210.185,0.298157,89.7018,99.9795
121,122,68764,1236,927,40.347,16.8754,73.1246,99.3874
122,123,43228,1853,886,22.1743,75.2312,14.7688,92.526
123,124,70577,2192,878,38.6743,67.0073,22.9927,99.9622
124,125,1396,1640,792,212.186,41.2377,48.7623,99.9968
125,126,1988,2802,829,211.84,61.0758,28.9242,99.9958
126,127,2618,1452,856,206.593,30.6656,59.3344,99.9942
127,128,8573,983,888,220.007,16.3279,73.6721,99.6713
128,129,1651,85,860,216.598,6.88428,83.1157,99.7432
129,130,3547,2812,878,25.1056,59.9969,30.0031,99.9739
130,131,1392,904,865,209.141,43.3635,46.6365,99.9435
131,132,1599,2555,863,286.516,76.7123,13.2877,99.9833
132,133,4906,559,897,212.315,68.9693,21.0307,99.9917
133,134,4811,1059,924,174.83599999999996,84.985,5.01499,99.9301
134,135,1510,797,901,203.11,74.3882,15.6118,99.9826
135,136,3110,1387,902,31.0222,18.4954,71.5046,99.6379
136,137,1333,2567,901,40.9559,1.30928,88.6907,99.9918
137,138,728,893,904,38.069,30.05,59.95,99.9644
138,139,30440,2564,995,241.88,87.5076,2.49242,99.5308
139,140,1523,1706,918,34.9912,52.9957,37.0043,99.8797
140,141,9097,638,953,216.678,33.3203,56.6797,99.9877
141,142,71278,1745,1040,25.9031,59.8224,30.1776,99.9519
142,143,1651,1448,923,207.522,30.6527,59.3473,99.9881
143,144,7361,2735,967,229.3,7.426539999999998,82.5735,99.9714
144,145,560,744,926,43.8222,48.2463,41.7537,99.9605
145,146,12703,917,991,34.7777,33.0777,56.9223,99.9056
146,147,1080,2790,926,225.465,26.1639,63.8361,99.9926
147,148,16313,2349,978,47.1743,59.7761,30.2239,99.9637
148,149,2156,3051,961,33.9194,15.4593,74.5407,99.6887
149,150,6181,1853,968,224.18,12.764,77.236,99.9947
150,151,520,785,956,213.01,36.656,53.344,99.7483
151,152,1727,1474,966,353.952,83.1122,6.88783,99.9738
152,153,3580,1024,984,211.922,26.505,63.495,99.9486
153,154,10152,750,1005,26.0939,49.0712,40.9288,99.8093
154,155,4489,570,1000,38.1631,47.0563,42.9437,99.9564
155,156,663,1511,979,222.027,5.22349,84.7765,99.9769
156,157,16907,499,1051,218.11900000000003,29.1013,60.8987,99.9317
157,158,29161,1506,1104,34.8014,5.7366,84.2634,88.5552
158,159,26132,3256,1060,49.1652,19.7027,70.2973,99.9687
159,160,8207,1125,1024,210.186,58.3034,31.6966,99.9641
160,161,6887,2065,1018,231.577,63.2574,26.7426,99.6397
161,162,20809,2177,1092,24.6086,63.9182,26.0818,99.8528
162,163,4378,970,1064,38.2673,23.446,66.554,99.9394
163,164,6122,1062,1064,24.624,42.1327,47.8673,99.9871
164,165,3600,2759,1062,44.1022,60.1393,29.8607,99.8656
165,166,2346,633,1053,35.5973,13.6517,76.3483,99.9776
166,167,8212,744,1095,31.6333,28.8588,61.1412,99.9929
167,168,3864,2401,1060,215.992,7.23186,82.7681,99.9832
168,169,3562,809,1066,213.919,33.0058,56.9942,99.9726
169,170,1671,2653,1065,34.9553,33.8588,56.1412,99.9914
170,171,3324,1235,1076,204.539,60.8901,29.1099,99.9883
171,172,3063,2314,1085,34.5738,56.5904,33.4096,99.9954
172,173,20392,2818,1152,223.775,4.1814300000000015,85.8186,99.9936
173,174,9100,695,1152,214.17,34.0353,55.9647,99.9663
174,175,18484,866,1144,23.0013,74.2984,15.7016,99.9847
175,176,6563,2086,1112,33.3113,71.9888,18.0112,99.9891
176,177,5004,2535,1118,241.371,62.6845,27.3155,99.9313
177,178,1426,1164,1097,40.5265,13.4694,76.5306,99.9826
178,179,3498,2597,1107,48.2313,65.3934,24.6066,99.9787
179,180,14752,2406,1133,210.664,50.0158,39.9842,78.88600000000002
180,181,530,2492,1097,35.6522,60.2508,29.7492,99.9778
181,182,97496,1885,1303,310.981,83.0034,6.9965600000000014,66.0857
182,183,2217,578,1107,24.7094,65.6729,24.3271,99.9381
183,184,1725,613,1124,34.2785,28.2684,61.7316,99.986
184,185,8201,2663,1139,46.3476,19.9203,70.0797,99.9976
185,186,2572,1083,1111,212.08900000000003,27.6424,62.3576,99.9849
186,187,1615,1018,1117,243.145,83.1378,6.862189999999999,99.9943
187,188,2656,1274,1126,38.0919,78.1534,11.8466,99.99
188,189,837,2738,1115,43.4174,65.2912,24.7088,99.9264
189,190,20325,1427,1201,228.745,85.7688,4.23119,99.9781
190,191,3463,1781,1136,220.076,58.4155,31.5845,99.9947
191,192,1764,3114,1131,26.4285,60.1353,29.8647,99.9968
192,193,8216,201,1161,22.9329,69.038,20.962,99.9879
193,194,762,1192,1134,267.397,81.7627,8.23733,99.99
194,195,1433,1348,1145,9.39074,58.5364,31.4636,99.9961
195,196,6107,1002,1167,25.8091,67.4582,22.5418,99.9749
196,197,8710,2213,1174,25.1917,28.2627,61.7373,99.9656
197,198,8851,1673,1177,215.471,28.4232,61.5768,99.9991
198,199,36247,539,1299,32.6513,29.4337,60.5663,89.2114
199,200,2414,556,1157,10.386,77.2414,12.7586,99.9944
200,201,2483,1133,1162,212.018,57.1695,32.8305,99.9901
201,202,828,635,1152,20.9007,75.9156,14.0844,99.9877
202,203,4270,1302,1171,204.927,13.6532,76.3468,99.9942
203,204,1211,1070,1156,37.1006,21.2655,68.7345,99.9915
204,205,18533,3258,1260,357.454,66.6877,23.3123,99.8779
205,206,1282,1229,1164,19.4414,58.4426,31.5574,99.9968
206,207,102772,3167,1444,40.9948,2.27868,87.7213,99.3818
207,208,1528,299,1180,19.597,37.9216,52.0784,99.9871
208,209,628,67,1169,23.2458,68.9349,21.0651,99.988
209,210,1050,100,1177,18.7378,36.5651,53.4349,99.9916
210,211,65941,2399,1288,35.2526,53.307,36.69300000000001,99.738
211,212,6148,2557,1200,38.2428,38.749,51.25100000000001,99.9984
212,213,19737,2696,1247,229.831,10.4565,79.5435,99.9691
213,214,8664,1206,1217,23.2133,57.7042,32.2958,99.9855
214,215,643,1892,1180,209.748,61.2025,28.7975,99.9967
215,216,10748,605,1223,48.9049,84.6508,5.3492,99.9679
216,217,2632,247,1218,201.109,5.87395,84.1261,99.9788
217,218,1434,1571,1206,15.6777,85.8319,4.16814,99.9979
218,219,1735,838,1212,24.3477,25.6312,64.3688,99.9984
219,220,1866,936,1211,227.169,20.3994,69.6006,99.9974
220,221,64659,998,1333,35.1208,41.7475,48.2525,99.6719
221,222,662,2483,1214,304.275,85.9432,4.05681,99.9784
222,223,3018,102,1231,209.005,4.68018,85.3198,99.9519
223,224,938,186,1217,23.7521,69.4071,20.5929,99.9975
224,225,24597,366,1294,25.6647,66.9837,23.0162,99.9801
225,226,1684,159,1236,211.322,4.16903,85.831,99.9705
226,227,1277,2085,1224,23.8786,63.9633,26.0367,99.9883
227,228,6754,776,1271,27.5286,10.3447,79.6553,99.9881
228,229,32979,1262,1328,206.53,16.3909,73.6091,99.7333
229,230,13377,1518,1294,202.212,12.5511,77.4489,99.779
230,231,33906,2153,1354,16.5711,78.3079,11.6921,99.9232
231,232,1592,810,1245,214.671,36.4957,53.5043,99.9947
232,233,1027,714,1238,203.761,85.3387,4.6612800000000005,99.9921
233,234,1656,2841,1243,263.655,73.994,16.006,99.9605
234,235,14204,2761,1326,43.0099,0.209,89.791,99.9342
235,236,4852,182,1287,203.746,20.1457,69.8543,99.993
236,237,2397,112,1280,203.166,19.3197,70.6803,99.9945
237,238,15017,762,1338,210.693,81.559,8.44097,99.8732
238,239,4461,247,1305,214.141,34.894,55.106,99.9892
239,240,775,78,1292,210.86900000000003,18.3658,71.6342,99.9841
240,241,825,1579,1316,186.903,86.0517,3.94834,99.9957
241,242,10367,2620,1378,59.7144,61.635,28.365,99.9926
242,243,1282,2847,1352,275.04900000000004,69.1412,20.8588,99.9546
243,244,1030,2868,1330,39.7807,13.3455,76.6545,99.2905
244,245,4758,149,1350,209.502,10.368,79.632,99.9305
245,246,6934,1670,1352,213.519,36.4704,53.5296,99.9888
246,247,693,158,1332,203.664,19.9758,70.0242,99.9884
247,248,7863,2355,1411,23.9515,29.2171,60.7829,99.9684
248,249,2584,1583,1365,21.4172,74.1496,15.8504,99.9322
249,250,11975,323,1401,208.942,42.9447,47.0553,99.9273
250,251,790,1454,1360,20.9633,75.2652,14.7348,99.9853
251,252,6802,467,1431,227.719,18.44,71.56,58.3055
252,253,45380,1383,1473,215.153,64.6012,25.3988,79.7447
253,254,538,2067,1372,214.759,23.4849,66.5151,99.9944
254,255,5075,707,1401,21.8613,78.5165,11.4835,99.9563
255,256,2739,1800,1391,209.742,55.4451,34.5549,99.9905
256,257,2668,2840,1396,33.9741,13.7427,76.2573,99.9628
257,258,535372,2781,2020,46.9777,9.08934,80.9107,93.1489
258,259,5954,206,1416,209.657,0.30600700000000003,89.694,99.9944
259,260,1035,2294,1392,209.471,23.9774,66.0226,99.9934
260,261,5948,1714,1408,95.9538,87.2112,2.78881,99.986
261,262,3404,2769,1405,268.651,72.6698,17.3302,99.9895
262,263,1604,434,1405,38.6415,75.8869,14.1131,99.9777
263,264,9419,1078,1442,221.752,31.9782,58.0218,99.9659
264,265,8340,1588,1432,213.824,37.2471,52.7529,99.9667
265,266,1086,820,1396,24.6015,44.3204,45.6796,99.9924
266,267,5291,2716,1444,37.2619,15.173,74.827,99.9937
267,268,4621,1845,1443,232.452,73.015,16.985,99.9971
268,269,7032,810,1446,228.373,75.6171,14.3829,99.937
269,270,3669,2079,1461,208.706,1.94325,88.0567,99.9732
270,271,801,2291,1428,26.5899,26.9807,63.0193,99.9969
271,272,7319,1765,1474,215.81,18.3457,71.6543,99.9908
272,273,136150,529,1601,219.847,59.074,30.926,99.9635
273,274,3343,1397,1441,212.717,5.14014,84.8599,99.9811
274,275,632,544,1447,21.9077,80.7779,9.22211,99.9855
275,276,810,158,1448,209.341,0.703987,89.296,99.9686
276,277,807,1668,1461,12.0359,73.7939,16.2061,99.9945
277,278,1414,2583,1462,38.0544,16.0939,73.9061,99.9405
278,279,4422,2659,1474,251.995,74.7377,15.2623,99.9702
279,280,36387,2181,1592,274.508,75.3583,14.6417,99.4339
280,281,6549,2176,1502,210.463,25.7858,64.2142,99.9747
281,282,730,2393,1479,28.7678,25.1589,64.8411,99.9954
282,283,22753,197,1599,34.8641,29.2289,60.7711,99.9283
283,284,60698,1184,1582,210.371,8.47908,81.5209,99.9542
284,285,549,166,1477,204.013,18.1435,71.8565,99.9806
285,286,570,1684,1487,219.12,17.9741,72.0259,99.9958
286,287,998,1634,1487,34.1773,82.6893,7.31072,99.9949
287,288,5589,2394,1513,227.466,54.8443,35.1557,99.7886
288,289,57129,1623,1607,212.801,46.3598,43.6402,77.8916
289,290,2131,767,1510,29.4125,29.0998,60.9002,99.9756
290,291,7288,841,1526,287.408,84.9556,5.04438,99.5402
291,292,3137,108,1505,30.8193,16.5909,73.4091,99.9289
292,293,1319,1221,1516,29.3397,46.4211,43.5789,99.987
293,294,11089,1841,1550,212.13,46.1655,43.8345,99.9871
294,295,17130,2900,1590,27.8008,69.8067,20.1933,99.9283
295,296,4098,2082,1539,237.544,80.9059,9.09405,99.1713
296,297,3794,2340,1561,30.0057,22.4608,67.5392,99.9727
297,298,996,78,1531,32.5108,16.7913,73.2087,99.9448
298,299,11150,1976,1587,35.6342,65.6268,24.3732,99.7835
299,300,7621,916,1587,239.064,82.4286,7.571389999999999,99.985
300,301,588,24,1561,213.721,31.4187,58.5813,99.8584
301,302,58682,3101,1699,59.3359,27.1919,62.8081,99.9826
302,303,1107,1081,1590,243.678,81.9561,8.0439,99.9944
303,304,10001,311,1647,206.609,27.9425,62.0575,99.9895
304,305,23886,2328,1679,231.316,53.7468,36.2532,99.976
305,306,8339,3303,1648,34.3075,72.2785,17.7215,99.9757
306,307,19268,843,1678,32.288000000000004,68.6909,21.3091,99.9939
307,308,4231,2727,1638,216.576,42.261,47.739,99.9911
308,309,894,2323,1605,279.747,73.3917,16.6083,99.9961
309,310,42334,1984,1752,209.682,37.4934,52.5066,99.9594
310,311,12826,1828,1681,32.0443,11.0127,78.9873,99.9239
311,312,417586,953,2049,212.761,10.8536,79.1464,76.2819
312,313,27234,1444,1727,214.216,80.1078,9.89218,99.9648
313,314,1940,2803,1646,58.2105,18.5157,71.4843,99.9961
314,315,913,76,1639,36.3054,25.1808,64.8192,99.9579
315,316,1241,24,1667,36.0758,28.1818,61.8182,99.6033
316,317,6884,953,1699,32.2512,14.6253,75.3747,99.9761
317,318,1104,1354,1665,233.068,83.0203,6.97974,99.996
318,319,5717,1716,1693,23.2554,70.5585,19.4415,99.9792
319,320,36050,2887,1757,55.8469,19.202,70.798,99.9823
320,321,2709,85,1693,35.4681,29.3407,60.6593,99.9845
321,322,1083,2774,1682,20.1004,77.183,12.817,99.9929
322,323,28416,3304,1823,51.8598,3.75034,86.2497,99.1043
323,324,1599,213,1700,34.4179,33.9597,56.0403,99.8947
324,325,12944,2198,1755,28.1582,2.07869,87.9213,99.9325
325,326,7432,324,1740,216.036,35.0841,54.9159,99.9933
326,327,8907,248,1772,51.307,51.0254,38.9746,99.9911
327,328,874,1279,1735,42.0551,33.2466,56.7534,99.9955
328,329,17096,1740,1807,29.1679,62.1372,27.8628,99.969
329,330,33507,1336,1852,222.996,27.2318,62.7682,99.9947
330,331,9686,1619,1788,226.682,75.5434,14.4566,99.9901
331,332,54636,219,1890,30.2506,13.2382,76.7618,95.7329
332,333,27332,2317,1875,277.076,85.163,4.83699,99.9043
333,334,2588,363,1814,46.2235,51.6795,38.3205,99.9949
334,335,26456,2123,1896,57.1697,70.3755,19.6245,99.9269
335,336,18090,3203,1889,44.5911,10.7311,79.2689,99.9983
336,337,13261,409,1943,175.41299999999995,88.1955,1.80445,99.8843
337,338,2505,1525,1848,42.7498,45.4155,44.5845,99.9973
338,339,582,1630,1835,20.8962,62.1585,27.8415,99.9942
339,340,780,2206,1836,215.427,5.3409,84.6591,99.9966
340,341,39160,1861,1930,263.251,83.4294,6.570639999999999,99.9224
341,342,10131,506,1880,30.2175,10.8089,79.1911,99.9457
342,343,28258,784,1980,26.9674,47.9839,42.0161,99.8865
343,344,3033,2981,1860,214.679,29.5381,60.4619,99.9834
344,345,2047,1578,1865,44.3259,3.5211900000000003,86.4788,99.9904
345,346,89342,1637,2076,226.664,69.1408,20.8592,90.1394
346,347,1731,1612,1897,224.236,64.3561,25.6439,99.998
347,348,2306,957,1899,278.184,77.8481,12.1519,99.9835
348,349,33262,912,2027,39.9072,29.6917,60.3083,99.5557
349,350,1834,1550,1913,53.7229,63.95,26.0501,99.9802
350,351,5772,1621,1945,214.685,33.4031,56.5969,99.9726
351,352,790,104,1968,28.6021,15.0085,74.9915,99.9916
352,353,8996,2052,2033,211.165,28.3353,61.6647,99.9096
353,354,999,3182,1978,235.182,1.10893,88.8911,99.991
354,355,9250,3261,2022,56.7714,25.034,64.96600000000001,99.9787
355,356,567,2112,1982,38.8616,50.0416,39.9584,99.9356
356,357,2737,2190,1992,215.812,30.5713,59.4287,99.993
357,358,993,3327,1993,61.5047,25.6421,64.3579,99.9828
358,359,7974,2342,2023,37.9653,40.9605,49.0395,99.9553
359,360,18401,353,2073,210.21,6.6501600000000005,83.3498,99.9604
360,361,652,1571,2019,213.453,29.9841,60.0159,99.959
361,362,7866,2258,2064,47.3592,14.7849,75.2151,99.9816
362,363,580,155,2032,36.195,14.6241,75.3759,99.9833
363,364,36987,1976,2137,278.437,86.1058,3.89418,95.6223
364,365,1666,114,2029,37.4053,13.7001,76.2999,99.6732
365,366,10516,3330,2129,42.603,21.5301,68.4699,99.7883
366,367,673,2133,2028,31.2368,46.7304,43.2696,99.6207
367,368,4387,2178,2061,316.452,83.262,6.737989999999999,99.5696
368,369,29866,180,2147,42.2141,17.1086,72.8914,99.9837
369,370,638,278,2039,357.694,77.3668,12.6332,99.9976
370,371,1912,2316,2110,227.093,10.3037,79.6963,99.5689
371,372,3325,670,2077,35.7081,54.3914,35.6086,99.9934
372,373,4736,2112,2093,32.3863,68.6646,21.3354,99.9933
373,374,1645,3297,2093,55.3,27.8756,62.1244,99.9848
374,375,742,2338,2095,48.2983,15.1855,74.8145,99.9938
375,376,10350,3242,2149,60.9048,28.231,61.769,99.9909
376,377,32550,959,2225,42.3919,0.566963,89.43299999999998,48.4217
377,378,43973,734,2216,210.604,34.9851,55.0149,99.9198
378,379,3700,637,2140,208.235,6.10637,83.8936,99.9893
379,380,4345,1834,2160,317.742,82.9199,7.08011,99.9495
380,381,128154,2215,2321,34.0282,22.8566,67.1434,99.9056
381,382,1390,576,2140,210.413,52.0912,37.9088,99.9942
382,383,11655,2399,2176,36.84,39.2267,50.7733,99.9362
383,384,33150,315,2260,30.5402,45.923,44.077,99.993
384,385,51605,1504,2349,43.485,33.355,56.645,98.499
385,386,26453,1880,2277,210.545,54.8988,35.1012,99.9569
386,387,829,2366,2213,243.124,86.9521,3.04793,99.9916
387,388,52823,2595,2348,226.213,62.6753,27.3247,99.9554
388,389,6830,1042,2284,40.0502,17.3483,72.6517,99.8401
389,390,2268,2527,2236,31.3245,35.212,54.788,99.9975
390,391,3151,849,2260,225.662,54.2888,35.7112,99.9893
391,392,836,3353,2248,42.7438,20.4456,69.5544,99.8395
392,393,1312,2493,2265,222.528,64.0476,25.9524,99.908
393,394,730,3298,2248,40.7462,3.94669,86.0533,99.9643
394,395,509,3263,2269,236.993,2.84702,87.15299999999998,99.9948
395,396,2176,3339,2288,44.4927,1.3545200000000002,88.6455,99.9353
396,397,9085,1657,2345,52.4769,71.0979,18.9021,99.9046
397,398,8553,3282,2338,63.1007,28.4797,61.5203,99.9317
398,399,11577,619,2342,321.845,76.4118,13.5882,99.9947
399,400,54615,1800,2447,40.5303,33.7719,56.2281,99.1543
400,401,2474,816,2336,23.7202,68.8553,21.1447,99.9976
401,402,68742,1060,2448,263.223,84.8866,5.11341,99.8942
402,403,1515,221,2362,215.175,25.6695,64.3305,99.9778
403,404,48689,721,2489,218.586,11.938,78.062,82.9688
404,405,1558,168,2370,219.349,13.7975,76.2025,99.9505
405,406,2228,906,2363,27.3688,40.6359,49.3641,99.9954
406,407,802,3361,2361,43.0969,24.6891,65.3109,99.8752
407,408,1810,118,2366,216.897,13.5698,76.4302,99.9492
408,409,41688,251,2523,355.629,77.3907,12.6093,99.9622
409,410,11029,3009,2406,203.493,79.7255,10.2745,99.9886
410,411,9082,714,2417,335.485,81.028,8.97199,99.9676
411,412,1353,1408,2368,34.2529,22.095,67.905,99.9803
412,413,25305,2717,2466,201.398,77.862,12.138,99.9554
413,414,25010,3133,2498,45.6506,64.8724,25.1276,99.8877
414,415,5284,1905,2411,227.509,76.4592,13.5408,99.9883
415,416,17063,3249,2455,6.756289999999999,75.6959,14.3041,99.9902
416,417,2199,1596,2411,40.0151,1.8897,88.1103,99.9869
417,418,2061,94,2405,217.79,13.7027,76.2973,99.9819
418,419,1814,587,2411,28.9386,26.9511,63.0489,99.992
419,420,17445,1369,2502,224.382,51.7688,38.2312,99.6507
420,421,701,29,2416,31.0316,35.845,54.155,99.946
421,422,1840,158,2454,356.723,80.1879,9.81211,99.9833
422,423,1230,3331,2430,47.3478,25.5266,64.4734,99.7766
423,424,624,138,2421,219.523,65.4917,24.5083,99.9944
424,425,685,29,2457,233.74400000000003,54.8288,35.1712,99.9826
425,426,8458,2334,2498,144.151,80.9138,9.08616,99.6657
426,427,1392,119,2482,355.1880000000001,80.2967,9.70334,99.9026
427,428,1156,79,2483,357.772,76.2765,13.7235,99.2318
428,429,4256,1598,2493,228.271,40.9855,49.0145,99.9931
429,430,881,2508,2470,32.6741,39.281,50.719,99.9928
430,431,3084,1651,2505,34.4959,24.732,65.268,99.98
431,432,27309,2106,2573,35.6453,8.938130000000003,81.0619,99.7748
432,433,2865,31,2539,351.719,78.6045,11.3955,99.9391
433,434,2384,2432,2493,210.542,38.5884,51.4116,99.9288
434,435,17539,509,2550,218.961,53.1545,36.8455,99.9346
435,436,13098,1230,2536,221.813,33.3793,56.6207,99.9883
436,437,4627,2574,2531,36.7201,46.222,43.778,99.9229
437,438,35107,1573,2622,33.5389,52.4249,37.5751,99.9818
438,439,28024,2224,2632,225.507,11.3199,78.6801,99.9717
439,440,10663,2541,2573,27.5689,73.3694,16.6306,99.6236
440,441,3604,3335,2566,36.3219,5.5752,84.4248,99.1464
441,442,12887,854,2570,200.386,79.1561,10.8439,99.9912
442,443,47936,1930,2641,46.017,32.6586,57.3414,84.7257
443,444,227518,2228,2910,218.571,55.1633,34.8367,53.7025
444,445,5109,3041,2565,223.11900000000003,13.21,76.79,99.9278
445,446,4979,1664,2573,37.3028,2.2913900000000003,87.7086,99.9863
446,447,8055,1337,2588,208.05900000000003,50.632,39.368,99.9898
447,448,34276,2731,2641,4.74293,82.7606,7.239389999999998,99.882
448,449,1430,114,2581,355.321,77.441,12.559,99.8686
449,450,7291,432,2601,17.0173,68.0814,21.9186,99.9936
450,451,732,3274,2570,240.794,4.75589,85.2441,99.9963
451,452,344656,595,2841,218.523,25.7625,64.2375,58.6517
452,453,1933,3172,2604,63.6,81.6659,8.33414,99.9913
453,454,8994,3313,2657,49.7203,50.8091,39.1909,99.8821
454,455,8142,1749,2644,35.9932,15.6727,74.3273,99.9928
455,456,1783,3239,2613,230.321,53.1472,36.8528,99.9882
456,457,4724,1217,2612,45.0781,63.5706,26.4294,99.9774
457,458,1082,2286,2614,212.6,35.3499,54.6501,99.9915
458,459,23343,3136,2671,51.8414,49.9787,40.0213,99.9935
459,460,570,21,2626,229.442,54.2031,35.7969,99.9283
460,461,6588,96,2672,27.3692,34.7119,55.2881,99.9028
461,462,101956,1446,2834,36.0019,10.0109,79.9891,73.7481
462,463,4840,166,2677,205.438,47.4041,42.5959,99.9706
463,464,19601,1151,2790,29.3692,34.3098,55.6902,99.9858
464,465,616,2862,2663,54.1322,65.2177,24.7823,99.9874
465,466,4098,1526,2716,38.9382,0.7612,89.2388,99.996
466,467,676,22,2711,220.9,53.0266,36.9734,98.6966
467,468,1528,2146,2706,265.263,77.7385,12.2615,99.9844
468,469,755,1741,2699,34.126,22.77,67.23,99.5686
469,470,8584,2975,2733,31.5943,4.3619900000000005,85.63799999999998,99.8951
470,471,130607,2771,2930,61.9247,11.9057,78.0943,99.9375
471,472,175960,3159,2989,54.8769,21.991,68.009,97.616
472,473,10196,1233,2784,221.373,39.8104,50.1896,99.9828
473,474,13675,1675,2758,221.668,50.0523,39.9477,99.865
474,475,18962,1869,2832,39.9528,23.7118,66.2882,99.9009
475,476,1528,3077,2735,16.1293,76.0892,13.9108,99.9959
476,477,5746,2090,2756,31.054,22.4068,67.5932,99.9957
477,478,1796,70,2775,26.5462,38.8282,51.1718,99.8702
478,479,4756,1813,2807,31.365,15.9794,74.0206,99.996
479,480,1552,1974,2798,57.1291,81.8665,8.133510000000001,99.9908
480,481,7325,361,2844,19.0138,28.684,61.316,99.9897
481,482,914,1711,2799,46.576,50.6988,39.3012,99.9994
482,483,2690,1015,2826,223.218,45.1164,44.8836,99.9956
483,484,17015,2004,2862,214.846,10.6888,79.3112,99.9254
484,485,4889,1643,2853,239.438,72.1466,17.8534,99.9923
485,486,1393,20,2856,34.8654,19.0035,70.9965,99.5114
486,487,2304,1694,2842,33.3663,17.197,72.803,99.9933
487,488,5817,1772,2860,46.9055,51.392,38.608,99.9688
488,489,7387,2488,2876,46.0605,35.9005,54.0995,99.9828
489,490,2782,1276,2862,29.1468,34.6772,55.3228,99.9974
490,491,578,41,2866,226.44,22.6673,67.3327,99.9246
491,492,34469,728,2967,32.4023,34.0253,55.9747,99.9483
492,493,1723,2557,2866,249.737,82.57600000000002,7.42397,99.9926
493,494,982,1230,2872,163.417,85.794,4.20596,99.993
494,495,16139,179,2938,215.547,49.2908,40.7092,99.9946
495,496,7506,824,2907,17.2133,45.4144,44.5856,99.9981
496,497,24406,2443,3011,217.805,52.9702,37.0298,70.3345
497,498,12074,1704,2948,208.131,45.7807,44.2193,99.9701
498,499,5029,1118,2925,203.348,64.74,25.26,99.9925
499,500,96924,1272,3062,34.0561,30.2939,59.7061,96.7423
500,501,2189,28,2938,312.503,80.7251,9.27494,99.9368
501,502,3420,1981,2942,222.365,39.3521,50.6479,99.9815
502,503,4820,914,2960,249.861,84.2002,5.79978,99.9566
503,504,5352,92,2994,215.822,49.7857,40.2143,99.929
504,505,5410,2799,2976,38.3999,14.9955,75.0045,99.9953
505,506,1905,2521,2945,222.263,67.7646,22.2354,99.9973
506,507,4691,1047,2985,208.066,37.8668,52.1332,99.9558
507,508,24004,2628,3111,33.5347,4.01886,85.9811,99.9472
508,509,3904,1765,2998,211.167,63.6996,26.3004,99.9541
509,510,1403,2980,2984,225.225,39.0337,50.9663,99.9925
510,511,4759,3343,3033,57.6776,13.9904,76.0096,99.7097
511,512,20004,835,3103,227.051,52.7055,37.2945,99.7281
512,513,1833,19,3065,220.017,50.2408,39.7592,99.7953
513,514,92814,1630,3169,36.4438,42.6825,47.3175,95.7574
514,515,1822,163,3062,216.474,48.9996,41.0004,99.9936
515,516,10850,125,3126,217.36900000000003,50.0361,39.9639,99.9646
516,517,5674,2570,3072,44.4517,37.635,52.365,99.9467
517,518,13678,2921,3119,47.967,19.7374,70.2626,99.9572
518,519,2055,1080,3094,209.136,36.9583,53.0417,99.9962
519,520,1189,740,3087,17.2133,45.6397,44.3603,99.9952
520,521,74829,931,3246,299.4120000000001,77.903,12.097,71.9312
521,522,21958,2273,3145,221.193,11.993,78.007,99.9788
522,523,1625,188,3108,349.1430000000001,82.9505,7.049460000000002,99.994
523,524,36122,2484,3210,276.783,84.4371,5.56291,99.9404
524,525,778,1122,3109,40.2672,26.6507,63.3493,99.9779
525,526,1151,724,3129,228.623,52.6088,37.3912,99.9591
526,527,2596,688,3131,38.1437,13.7691,76.2309,99.9867
527,528,1554,1892,3134,230.247,74.0622,15.9378,99.9771
528,529,6153,606,3162,312.954,78.3421,11.6579,99.9962
529,530,509,1858,3147,213.364,64.2431,25.7569,99.9972
530,531,505,14,3149,49.1111,25.1718,64.8282,99.9521
531,532,5441,1116,3192,341.376,87.9342,2.06578,99.9967
532,533,1125,96,3176,217.467,50.4346,39.5654,99.9804
533,534,66815,2064,3353,43.7817,86.3934,3.60663,99.7625
534,535,26217,466,3249,28.2082,77.1212,12.8788,99.9873
535,536,1561,19,3212,317.514,74.6408,15.3592,99.9296
536,537,15081,656,3223,210.167,45.3455,44.6545,99.9325
537,538,161875,2937,3466,49.2026,31.6711,58.3289,77.9868
538,539,5439,2351,3223,333.9890000000001,84.42200000000003,5.57798,99.9488
539,540,7375,294,3208,322.436,71.6499,18.3501,99.9817
540,541,11361,3288,3255,54.0435,31.4375,58.5625,99.9567
541,542,2147,1185,3218,35.3947,40.361,49.639,99.9894
542,543,43726,1808,3337,29.3327,6.2038,83.7962,97.7742
543,544,2340,90,3241,236.569,68.4847,21.5153,99.9732
544,545,4951,2238,3241,47.4268,33.7582,56.2418,99.9779
545,546,4006,225,3259,222.941,13.3098,76.6902,99.9854
546,547,7635,1324,3243,23.5422,74.4876,15.5124,99.9962
547,548,857,43,3234,240.194,68.7465,21.2535,99.9325
548,549,3351,1241,3243,37.5739,33.832,56.168,99.9987
549,550,1949,174,3242,222.28,13.0576,76.9424,99.9948
550,551,2101,2847,3241,39.1208,15.3025,74.6975,99.9777
551,552,2770,2786,3242,217.987,83.2709,6.729139999999999,99.9774
552,553,2783,2609,3260,56.6524,13.825,76.175,99.9973
553,554,1989,2169,3260,337.459,82.1861,7.81388,99.9889
554,555,7881,1136,3277,13.4377,69.7626,20.2374,99.9869
555,556,54123,2650,3393,69.4906,44.2744,45.7256,99.8746
556,557,3812,381,3291,276.656,79.2988,10.7012,99.9941
557,558,1365,1686,3264,211.991,48.3558,41.6442,99.9965
558,559,22206,176,3351,229.545,70.0609,19.9391,99.6934
559,560,13268,304,3316,31.1059,77.4901,12.5099,99.998
560,561,1153,2755,3277,54.0759,13.0636,76.9364,99.9765
561,562,43704,2453,3485,207.573,15.4389,74.5611,99.8734
562,563,9413,2338,3326,53.4033,17.0726,72.9274,99.9974
563,564,6977,706,3307,31.9484,77.1313,12.8687,99.9972
564,565,1107,28,3300,40.6399,14.6707,75.3293,99.8081
565,566,33362,1281,3383,212.815,45.4084,44.5916,99.9797
566,567,1284,74,3294,38.4037,14.0513,75.9487,99.9931
567,568,11725,3217,3356,44.967,28.8667,61.1333,99.9752
568,569,2908,1256,3302,253.321,74.1283,15.8717,99.9707
569,570,14507,615,3347,207.586,13.4031,76.5969,99.9922
570,571,61181,1609,3441,12.867,83.8278,6.17225,99.7748
571,572,606,3359,3310,56.4382,31.4909,58.5091,99.9643
572,573,3131,1170,3350,32.8776,34.5034,55.4966,99.4576
573,574,2252,3292,3338,88.9999,86.9533,3.04671,99.9945
574,575,7423,2290,3415,207.81,15.6294,74.3706,99.69
575,576,5210,1095,3356,218.409,30.7263,59.2737,99.9928
576,577,884,3357,3346,57.1429,21.7084,68.2916,99.9364
577,578,34014,443,3430,206.099,65.7054,24.2946,99.9801
578,579,16794,648,3455,33.4481,3.77195,86.2281,98.4776
579,580,63566,3263,3565,225.496,1.92181,88.0782,99.3273
580,581,286503,1002,4032,29.6351,0.742432,89.2576,88.8079
581,582,732,26,3400,223.913,71.5223,18.4777,99.9613
582,583,843,341,3386,208.352,33.8793,56.1207,99.9949
583,584,4291,1087,3414,354.782,73.4405,16.5595,99.9715
584,585,10256,157,3439,42.7279,26.8676,63.1324,99.9809
585,586,682,69,3431,44.8802,25.8073,64.1927,99.9674
586,587,2027,28,3458,41.06,25.0839,64.9161,99.9445
587,588,190468,1373,3668,225.767,46.4231,43.5769,94.5917
588,589,2053,2345,3457,254.312,85.4244,4.57556,99.9807
589,590,61850,2165,3553,194.387,75.1323,14.8677,99.7272
590,591,2629,283,3461,36.4232,26.5908,63.4092,99.9943
591,592,6605,1844,3486,224.313,28.4028,61.5972,99.9977
592,593,9696,1086,3527,33.0238,23.5217,66.4783,92.7673
593,594,548,1910,3475,65.6572,83.9527,6.04732,99.9707
594,595,953,692,3501,210.013,67.8785,22.1215,99.9111
595,596,760,1096,3478,192.091,1.15975,88.8402,99.9891
596,597,1144,2790,3493,209.205,14.056,75.944,99.9761
597,598,722,1988,3493,192.759,74.7592,15.2408,99.9618
598,599,3574,1780,3524,38.5433,2.79708,87.2029,99.9654
599,600,10149,151,3525,213.153,19.8174,70.1826,99.9374
600,601,9237,721,3549,24.747,54.1794,35.8206,99.9633
601,602,15288,2611,3569,60.8372,39.1476,50.8524,99.9438
602,603,112673,284,3722,218.381,24.747,65.253,99.9678
603,604,1349,1974,3536,78.4129,82.8816,7.11844,99.409
604,605,2026,2708,3551,211.766,15.023,74.977,99.9124
605,606,3876,1865,3577,24.849,79.9602,10.0398,99.9909
606,607,3979,557,3568,195.186,4.56436,85.4356,99.9966
607,608,4597,1459,3590,38.3641,1.14355,88.8564,99.9632
608,609,18386,481,3635,201.149,41.2374,48.7626,99.9804
609,610,123288,731,3840,14.0046,66.1795,23.8205,84.2191
610,611,746,21,3581,217.212,17.5809,72.4191,99.7905
611,612,9996,1796,3614,228.381,46.7932,43.2068,99.9961
612,613,4398,2371,3588,28.8083,55.6773,34.3227,99.9976
613,614,1702,134,3587,216.629,23.9495,66.0505,99.7505
614,615,883,734,3580,210.867,69.0579,20.9421,99.9955
615,616,934,195,3597,212.078,21.87,68.13,99.7367
616,617,1840,71,3610,218.635,17.0398,72.9602,99.9538
617,618,71078,2073,3725,222.401,21.0877,68.9123,97.6773
618,619,3495,123,3648,215.481,22.7571,67.2429,99.3862
619,620,3232,2321,3642,296.798,83.9537,6.04627,99.9935
620,621,1952,2383,3648,226.537,11.2125,78.7875,99.9946
621,622,41306,3141,3734,46.8431,1.6943400000000002,88.3057,99.8874
622,623,2483,2634,3656,281.263,81.5155,8.48452,99.9979
623,624,36748,2425,3772,33.7497,56.8943,33.1057,99.9507
624,625,15368,1737,3731,222.992,51.6347,38.3653,99.9944
625,626,8519,2586,3717,218.003,61.6259,28.3741,99.9289
626,627,4470,2669,3710,50.5671,42.5595,47.4405,99.998
627,628,608,24,3684,45.7088,24.0967,65.9033,99.9597
628,629,1743,2748,3693,208.01,14.3524,75.6476,99.9924
629,630,1246,76,3700,45.0547,23.8008,66.1992,99.9873
630,631,4437,2974,3715,206.484,12.5507,77.4493,99.9652
631,632,26602,2830,3776,58.7783,41.0392,48.9608,99.9791
632,633,730,2880,3732,212.907,14.3431,75.6569,99.9936
633,634,24814,2112,3847,237.495,74.3911,15.6089,99.8928
634,635,629,27,3768,220.656,25.1508,64.8492,99.8173
635,636,17155,1894,3831,57.3416,70.8196,19.1804,99.9598
636,637,25627,2669,3888,211.011,13.2962,76.7038,99.6936
637,638,573,537,3778,194.376,1.07,88.93,99.9778
638,639,4598,2547,3799,218.797,64.9222,25.0778,99.8444
639,640,11583,2214,3861,37.4584,22.7419,67.2581,99.9977
640,641,38889,1677,3864,223.831,28.0907,61.9093,99.9827
641,642,1828,3349,3825,40.8879,57.7991,32.2009,99.9778
642,643,3065,26,3867,222.537,25.0391,64.9609,99.753
643,644,61159,1214,3938,41.8649,19.7522,70.2478,99.9809
644,645,2259,3305,3818,229.753,8.45218,81.5478,99.9517
645,646,56991,506,3923,204.274,43.5913,46.4087,98.7637
646,647,28547,3084,3909,205.882,13.0034,76.9966,99.9803
647,648,17253,3248,3901,229.633,20.9006,69.0994,99.9878
648,649,11877,2810,3864,49.2371,9.96825,80.0317,99.9937
649,650,37232,2918,3968,45.604,14.2483,75.7517,69.285
650,651,1938,588,3849,215.373,21.0963,68.9037,99.9903
651,652,6205,2517,3870,228.75,10.3177,79.6823,99.9797
652,653,5934,1995,3907,227.21,39.5891,50.4109,99.9958
653,654,1594,603,3885,358.73,74.9978,15.0022,99.9974
654,655,10042,3166,3972,226.426,10.5172,79.4828,99.9539
655,656,3171,3344,3935,41.6024,56.8904,33.1096,99.8822
656,657,5964,2480,3939,60.7509,38.7795,51.2205,99.9929
657,658,2747,134,3941,206.203,52.5432,37.4568,99.9859
658,659,1490,1933,3927,221.661,75.384,14.616,99.9516
659,660,2661,1874,3932,221.764,78.207,11.793,99.9594
660,661,654,855,3920,197.96,5.49693,84.5031,99.9921
661,662,2469,2274,3930,206.491,31.1549,58.8451,99.9965
662,663,6560,2580,3945,16.6092,69.5529,20.4471,99.9632
663,664,79984,2517,4046,244.627,61.01600000000001,28.984,60.9406
664,665,83109,332,4096,215.131,28.5918,61.4082,78.7642
665,666,4304,1794,3952,281.887,81.2022,8.797789999999997,99.9905
666,667,85134,1520,4057,216.706,31.7141,58.2859,92.8455
667,668,528,93,3940,219.952,24.805,65.195,99.9642
668,669,651,2131,3943,225.024,52.6762,37.3238,99.9982
669,670,22993,2136,4009,28.6383,55.4268,34.5732,99.8526
670,671,3003,1962,3977,205.052,77.764,12.236,99.9922
671,672,32432,3279,4096,42.6509,20.1269,69.8731,99.9459
672,673,27997,1793,4058,38.3169,35.4235,54.5765,99.9665
673,674,763,89,3982,206.831,51.6622,38.3378,99.9822
674,675,25539,1945,4093,218.86900000000003,3.35067,86.6493,99.9296
675,676,12034,116,4070,30.8762,42.0609,47.9391,99.9547
676,677,6722,3021,4056,228.073,51.4236,38.5764,99.9819
677,678,7201,2830,4068,49.026,65.4748,24.5252,99.7892
678,679,3970,2234,4067,217.751,56.1565,33.8435,99.924
679,680,5450,2060,4068,247.257,81.2532,8.7468,99.9166
680,681,9492,3140,4095,239.385,52.5101,37.4899,99.9861
681,682,4286,1158,4074,215.238,30.4696,59.5304,99.9639
682,683,1882,527,4079,214.237,21.6736,68.3264,99.9338
683,684,699,1678,4067,50.2074,48.2169,41.7831,99.9895
684,685,20000,1249,4181,324.561,87.838,2.16202,99.9656
685,686,43613,2340,4212,212.217,14.3804,75.6196,93.3368
686,687,564,22,4099,221.196,48.8355,41.1645,99.958
687,688,691,1079,4089,250.654,82.6878,7.31221,99.9844
688,689,959,1141,4102,244.886,83.3737,6.626289999999999,99.9971
689,690,12656,2126,4160,21.5484,68.2397,21.7603,99.9356
690,691,1917,2839,4124,31.5875,70.8939,19.1061,99.9931
691,692,25397,2995,4185,31.0312,35.7756,54.2244,72.2619
692,693,554,1182,4111,212.111,31.9186,58.0814,99.7563
693,694,25099,479,4258,215.879,16.6892,73.3108,99.8256
694,695,40889,681,4210,20.1413,68.3734,21.6266,99.9792
695,696,2984,786,4133,25.6172,43.4976,46.5024,99.991
696,697,246446,1721,4502,216.22,38.2904,51.7096,86.3395
697,698,9145,2742,4189,230.09,59.98,30.02,99.9873
698,699,590,841,4155,208.209,83.49600000000002,6.50397,99.9534
699,700,4234,1337,4185,41.8779,17.8075,72.1925,99.9551
700,701,3536,1716,4174,226.018,76.6293,13.3707,99.9962
701,702,110988,2762,4451,215.683,46.0551,43.9449,52.6005
702,703,549,3151,4154,231.787,64.7489,25.2511,99.7276
703,704,2350,146,4185,216.381,20.6291,69.3709,99.966
704,705,36667,1542,4267,205.867,46.3314,43.6686,99.9978
705,706,2923,2642,4186,39.3117,13.9256,76.0744,99.9986
706,707,6191,2547,4209,47.8588,27.0622,62.9378,99.9793
707,708,2889,2477,4200,24.2254,65.426,24.574,99.9963
708,709,2651,3165,4193,247.86,65.8035,24.1965,99.9964
709,710,717,3125,4182,40.9412,23.9172,66.0828,99.9924
710,711,4567,2655,4222,212.604,56.9956,33.0044,99.9248
711,712,3229,245,4216,210.502,22.7447,67.2553,99.9513
712,713,3411,97,4228,215.811,21.8782,68.1218,99.9632
713,714,1753,190,4225,221.73,79.5776,10.4224,99.9892
714,715,5259,2200,4233,23.4123,62.5844,27.4156,99.9716
715,716,25905,3241,4303,220.372,66.9285,23.0715,99.9863
716,717,2929,1696,4228,47.7502,46.4689,43.5311,99.9931
717,718,4781,3093,4231,35.8039,60.6112,29.3888,99.9686
718,719,1192,3353,4248,223.163,43.7915,46.2085,99.9745
719,720,574,852,4225,202.255,84.3742,5.62581,99.9841
720,721,1407,3328,4259,222.173,43.1808,46.8192,99.9766
721,722,11120,1413,4300,215.015,21.1618,68.8382,99.9479
722,723,1043,1361,4238,33.2749,55.7017,34.2983,99.994
723,724,1332,985,4265,33.7071,28.2218,61.7782,99.976
724,725,7345,2106,4305,208.726,10.3874,79.6126,99.9491
725,726,3894,802,4288,218.662,46.9237,43.0763,99.9778
726,727,26316,2497,4334,211.967,36.7463,53.2537,99.9128
727,728,5543,2728,4279,204.826,27.8729,62.1271,99.8397
728,729,1763,2601,4285,213.892,52.3415,37.6585,99.9731
729,730,2557,2651,4288,230.19,39.711,50.289,99.991
730,731,4331,1877,4303,36.1222,16.0727,73.9273,99.9813
731,732,20974,140,4344,38.7832,13.0891,76.9109,99.9712
732,733,5668,2838,4292,219.723,47.4558,42.5442,99.9946
733,734,742,3084,4268,233.889,49.3755,40.6245,99.9965
734,735,538,13,4300,226.562,50.9758,39.0242,99.9137
735,736,20556,3123,4390,222.341,41.2613,48.7387,99.8245
736,737,4880,3054,4324,42.0009,19.9699,70.0301,99.9969
737,738,513,2247,4294,218.916,19.1497,70.8503,99.9985
738,739,1583,2206,4296,21.1255,79.8819,10.1181,99.9968
739,740,14331,258,4368,32.7593,7.21352,82.7865,99.8122
740,741,9569,590,4329,196.94,71.959,18.041,99.9748
741,742,5964,2754,4357,234.347,88.506,1.49397,99.9922
742,743,1079,1826,4332,224.346,49.1925,40.8075,99.9804
743,744,2895,2279,4353,323.639,83.5951,6.40486,99.9516
744,745,2451,3333,4349,49.1131,20.2798,69.7202,99.9389
745,746,565,2717,4326,212.463,54.7061,35.2939,99.9935
746,747,13396,2180,4366,29.9363,20.3828,69.6172,99.996
747,748,1985,743,4336,225.063,23.9085,66.0915,99.9961
748,749,12259,2632,4384,242.518,86.6941,3.30595,99.9782
749,750,11746,402,4391,217.301,33.0462,56.9538,99.921
750,751,3028,1597,4381,28.6078,21.4231,68.5769,99.9826
751,752,2136,665,4371,213.817,15.1222,74.8778,99.9924
752,753,1581,1836,4371,250.616,71.6044,18.3956,99.9973
753,754,1181,1797,4374,247.45,77.2812,12.7188,99.9966
754,755,12372,2067,4435,216.84,54.8727,35.1273,99.98
755,756,16431,2278,4434,225.275,16.567,73.433,99.3561
756,757,1007,1653,4374,208.83,17.1966,72.8034,99.998
757,758,59212,543,4489,230.899,61.3269,28.6731,57.5096
758,759,3207,3325,4403,233.334,62.5608,27.4392,99.9404
759,760,6430,1446,4419,34.207,4.90399,85.096,97.0551
760,761,20452,91,4514,28.5201,0.5437770000000001,89.4562,99.7753
761,762,2210,1216,4414,218.72,46.8598,43.1402,99.9968
762,763,2873,1698,4421,213.349,42.1778,47.8222,99.8573
763,764,2917,1749,4428,33.8209,24.8246,65.1754,99.9886
764,765,2562,2773,4424,226.229,4.81406,85.1859,99.9934
765,766,1140,1516,4405,31.2333,21.0207,68.9793,99.9513
766,767,1073,2237,4417,261.172,85.8995,4.1005,99.9504
767,768,63647,1129,4543,219.871,45.5475,44.4525,99.5718
768,769,6213,300,4449,19.111,53.3759,36.6241,99.9959
769,770,14447,2618,4473,204.858,74.2314,15.7686,99.9408
770,771,3188,2499,4441,235.909,50.3434,39.6566,99.9777
771,772,22077,3292,4507,39.4101,12.4239,77.5761,99.8081
772,773,1058,402,4443,215.014,15.6442,74.3558,99.9783
773,774,728,1269,4438,215.22,24.5404,65.4596,99.9654
774,775,7537,189,4486,214.574,17.3661,72.6339,99.909
775,776,2885,1231,4477,215.83,21.751,68.249,99.9304
776,777,1714,1419,4472,29.4157,17.947,72.053,94.5809
777,778,2284,2761,4480,224.662,28.8254,61.1746,99.9973
778,779,1070,1398,4498,217.674,49.3212,40.6788,99.9723
779,780,727,3169,4500,233.381,65.1087,24.8913,99.9902
780,781,1227,3208,4504,45.6169,46.664,43.33600000000001,99.9947
781,782,3632,3111,4516,225.171,59.227,30.773000000000003,99.9714
782,783,3498,2323,4528,358.914,82.7914,7.20862,99.7003
783,784,1046,2248,4531,351.642,82.0789,7.9211,99.943
784,785,67494,867,4647,214.956,49.1777,40.8223,99.0042
785,786,18597,254,4594,30.355,76.1584,13.8416,99.9978
786,787,7865,3007,4567,218.191,26.0087,63.9913,99.9701
787,788,21588,3180,4590,214.781,39.6659,50.3341,99.3922
788,789,19944,615,4616,34.3636,15.8608,74.1392,99.9115
789,790,4620,2196,4586,223.18400000000003,53.4428,36.5572,99.9804
790,791,10222,2419,4659,9.22494,80.8044,9.19561,99.4952
791,792,16329,2329,4617,49.5019,24.9902,65.0098,99.9937
792,793,3881,2861,4589,37.2671,32.1061,57.8939,99.9854
793,794,1076,2734,4586,218.967,52.9369,37.0631,99.9693
794,795,6287,1837,4609,31.2047,50.5489,39.4511,99.9738
795,796,1006,384,4584,174.683,85.0549,4.94514,99.9718
796,797,21698,2139,4650,330.48800000000006,80.9866,9.01342,99.7406
797,798,1108,163,4602,34.169000000000004,6.50226,83.4977,99.9958
798,799,1387,1767,4605,212.081,42.4404,47.5596,99.8025
799,800,8021,1220,4646,36.1022,8.7346,81.2654,99.9288
800,801,30219,2621,4665,33.1526,22.2027,67.7973,99.9098
801,802,1021,2938,4617,42.6042,32.8339,57.1661,99.9585
802,803,6846,3015,4646,13.1228,80.6304,9.36956,99.9702
803,804,1438,445,4618,185.446,85.3273,4.67267,99.9789
804,805,39842,340,4704,212.031,25.9723,64.0277,99.9206
805,806,5662,1968,4657,31.929,51.2958,38.7042,99.9871
806,807,3274,509,4665,31.6128,13.8008,76.1992,99.9576
807,808,2833,2862,4642,226.707,38.7885,51.2115,99.9928
808,809,1213,544,4658,35.8899,3.84698,86.15299999999998,99.1546
809,810,663,82,4638,296.152,84.1493,5.8507099999999985,99.9921
810,811,2292,150,4649,213.861,11.369000000000002,78.631,99.9852
811,812,5649,69,4694,212.33900000000003,8.74986,81.2501,98.9254
812,813,3409,2800,4675,207.145,40.8377,49.1623,99.9903
813,814,13950,1811,4713,41.0121,25.4743,64.5257,99.9287
814,815,6786,3200,4671,216.266,12.2147,77.7853,99.9371
815,816,568,1881,4659,28.4882,23.688,66.312,99.9664
816,817,1026,97,4661,295.533,84.2653,5.7347,99.9924
817,818,8812,1277,4701,40.3607,21.7148,68.2852,99.9805
818,819,5635,3095,4682,38.6076,3.17457,86.8254,99.9933
819,820,685,1024,4670,218.025,42.7385,47.2615,99.9887
820,821,7201,2885,4695,221.99,54.5924,35.4076,99.9865
821,822,20704,690,4743,30.3504,54.8643,35.1357,99.6379
822,823,1320,2125,4691,212.112,49.264,40.736,99.9585
823,824,7314,2285,4717,239.413,71.4904,18.5096,99.9768
824,825,4745,1065,4721,232.835,67.7764,22.2236,99.9885
825,826,1342,2985,4699,42.0986,71.6516,18.3484,99.9541
826,827,9725,1621,4741,33.9564,7.69125,82.3088,99.9633
827,828,1101,2466,4700,32.2791,70.6506,19.3494,99.9975
828,829,7616,1958,4729,224.696,59.0979,30.9021,99.9897
829,830,8348,2076,4742,303.203,82.8405,7.15952,99.9817
830,831,1568,2510,4723,224.0,39.0377,50.9623,99.9966
831,832,2703,2747,4726,36.9927,30.4638,59.5362,99.9504
832,833,767,1549,4728,37.3946,18.4274,71.5726,99.967
833,834,13338,1192,4778,206.921,38.2639,51.7361,99.9462
834,835,2650,2178,4742,35.3896,1.24721,88.7528,99.9578
835,836,1715,1104,4754,14.2895,38.9417,51.0583,99.9721
836,837,3306,98,4758,353.107,80.8009,9.19906,99.9222
837,838,1153,506,4758,228.194,72.6544,17.3456,99.9895
838,839,606,192,4763,207.09,6.900639999999999,83.0994,99.9908
839,840,2864,838,4785,219.979,1.92484,88.0752,99.9792
840,841,883,1972,4772,207.454,40.2106,49.7894,99.9731
841,842,2196,994,4798,40.3762,48.1718,41.8282,99.9824
842,843,732,1561,4793,209.466,19.6772,70.3228,99.9007
843,844,2869,1063,4804,225.135,46.5627,43.4373,99.9544
844,845,1070,940,4816,34.1336,39.0714,50.9286,99.9791
