,Grain No.,Size [Pixel],center x-coordinate,center y-coordinate,mean azimuth [degree],mean latitude [degree],mean colatitude [degree],Regelungsgrad [%]
0,1,1513,191,179,357.973,0.888451,89.1115,99.9938
1,2,1673,258,167,159.035,21.7712,68.2288,99.9575
2,3,35065,308,301,338.954,10.3317,79.6683,99.3661
3,4,106954,871,386,337.954,33.2447,56.7553,99.1466
4,5,3772,675,183,157.24,3.3387800000000003,86.6612,99.9864
5,6,1531,800,176,157.632,3.16026,86.8397,99.9908
6,7,3671,885,200,337.624,28.4887,61.5113,99.8981
7,8,5542,993,205,356.37,3.25296,86.74700000000001,99.8223
8,9,3825,739,215,302.023,76.1969,13.8031,99.9722
9,10,501,151,197,339.9290000000001,8.80391,81.1961,99.9489
10,11,13792,1180,226,357.509,2.99242,87.0076,99.9371
11,12,1320,378,238,333.69199999999995,8.31793,81.6821,99.9174
12,13,2253,1436,211,335.34,14.3786,75.6214,99.9364
13,14,505,1612,208,329.728,45.1168,44.8832,99.9528
14,15,2136,798,228,349.096,33.6841,56.3159,99.9936
15,16,1637,1602,228,328.874,45.9572,44.0428,99.9486
16,17,1388,1077,252,352.615,5.466080000000002,84.5339,99.9771
17,18,2038,1706,236,325.447,30.9817,59.0183,99.9426
18,19,22035,833,300,155.907,13.1048,76.8952,99.9763
19,20,697,1537,254,339.459,11.6707,78.3293,99.835
20,21,3846,2021,257,154.514,14.6093,75.3907,99.7073
21,22,226308,1192,598,344.191,8.40015,81.5999,99.0446
22,23,1305,1804,252,157.583,43.6749,46.3251,99.9747
23,24,582,2332,259,153.803,6.15347,83.8465,99.8656
24,25,1038,2482,259,308.056,69.0502,20.9498,99.9277
25,26,2821,1572,278,332.9240000000001,19.0678,70.9322,99.9188
26,27,962,2215,255,159.204,8.13696,81.863,99.9679
27,28,639,2271,255,344.207,5.1041300000000005,84.8959,99.4153
28,29,1087,1267,285,343.23,14.5462,75.4538,99.9883
29,30,677,1436,282,334.153,31.5062,58.4938,99.9688
30,31,643,2295,275,342.385,10.3495,79.6505,99.9558
31,32,1516,2381,282,172.61700000000005,83.4883,6.51173,99.9579
32,33,9976,2555,309,331.46,8.95098,81.04899999999998,99.8744
33,34,645,2719,289,342.107,39.799,50.201,99.981
34,35,3737,2988,307,324.871,37.1314,52.8686,99.7624
35,36,2315,2768,303,353.3540000000001,22.1905,67.8095,99.7648
36,37,1318,2875,304,348.681,4.4263,85.5737,99.9761
37,38,1320,3100,326,150.529,73.4755,16.5245,99.9554
38,39,5182,149,415,340.022,18.6419,71.3581,99.4498
39,40,966,3142,377,154.056,71.9451,18.0549,99.9722
40,41,7561,2723,387,335.1330000000001,26.3551,63.6449,99.9426
41,42,44252,1929,487,157.629,20.3986,69.6014,99.8585
42,43,24783,626,426,154.906,14.7843,75.2157,99.9813
43,44,967,1385,373,337.042,30.5378,59.4622,99.9803
44,45,2358,1585,388,336.4,32.0617,57.9383,99.9391
45,46,613,1808,367,168.17,3.0799,86.9201,99.9159
46,47,23934,410,440,342.894,33.9907,56.0093,99.9757
47,48,15517,1719,429,341.811,4.1122,85.8878,99.9552
48,49,1108,2239,388,343.737,52.9328,37.0672,99.987
49,50,2022,2113,409,172.524,5.25355,84.7465,99.9877
50,51,121402,2456,629,158.304,8.636289999999999,81.3637,91.2848
51,52,22298,2904,525,165.53099999999995,26.3617,63.6383,77.6463
52,53,2644,2397,411,154.187,7.223789999999998,82.7762,99.9871
53,54,727,2620,418,334.131,9.2994,80.7006,99.9877
54,55,2295,2232,421,345.266,36.9277,53.0723,99.9585
55,56,683,1941,425,346.884,17.7523,72.2477,99.9795
56,57,1768,2165,440,176.153,4.02405,85.976,99.9979
57,58,593,2893,430,148.766,14.1253,75.8747,99.9282
58,59,512,3103,436,144.58700000000005,18.5444,71.4556,99.9385
59,60,128808,2084,704,345.269,5.75138,84.2486,98.3817
60,61,13202,2384,499,329.8640000000001,60.5555,29.4445,99.832
61,62,4466,2765,481,231.586,83.0463,6.95367,99.9418
62,63,64143,435,608,341.754,34.0397,55.9603,99.4935
63,64,1051,3083,462,140.78,20.7316,69.2684,99.8499
64,65,7641,240,522,162.304,41.8862,48.1138,99.9862
65,66,2820,2890,480,235.083,77.9922,12.0078,99.9467
66,67,555,129,480,346.3830000000001,14.8447,75.1553,99.7977
67,68,730,1802,477,349.085,15.6696,74.3304,99.9949
68,69,2174,3142,495,321.284,16.792,73.208,99.6608
69,70,5647,1607,524,338.052,31.7534,58.2466,99.9492
70,71,5619,347,526,344.7630000000001,20.7316,69.2684,99.7569
71,72,3664,1733,504,153.16,49.9218,40.0782,99.9064
72,73,1417,696,524,343.814,8.81436,81.1856,99.9608
73,74,16203,1669,597,162.637,15.8786,74.1214,99.9611
74,75,1518,120,568,338.23800000000006,41.5928,48.4072,99.8382
75,76,579,149,531,335.779,46.7177,43.2823,99.919
76,77,3853,3142,582,319.301,71.5775,18.4225,99.6005
77,78,7524,1779,595,332.476,68.1854,21.8146,99.9552
78,79,2887,1317,584,337.735,73.187,16.813,99.8266
79,80,799,535,559,352.825,23.3577,66.6423,99.997
80,81,1733,2746,593,329.423,33.1663,56.8337,99.9213
81,82,635,3071,591,330.906,70.1984,19.8016,99.9662
82,83,57776,651,752,337.472,76.7053,13.2947,99.7591
83,84,1432,148,605,331.689,46.7983,43.2017,99.8449
84,85,2624,2977,611,326.106,35.7166,54.2834,99.9501
85,86,20695,2777,670,328.855,2.95169,87.0483,99.2556
86,87,547,2684,611,168.226,23.4667,66.5333,99.9747
87,88,24260,3039,724,44.4615,83.3108,6.689210000000001,99.8305
88,89,5303,2903,642,117.645,75.8795,14.1205,99.9896
89,90,788,1323,633,349.689,0.90583,89.0942,99.9885
90,91,5351,1310,677,333.404,74.2964,15.7036,99.9613
91,92,5690,1585,703,351.315,3.75821,86.2418,99.6709
92,93,10342,2914,726,130.93200000000002,82.8479,7.15211,99.9792
93,94,4926,793,703,341.459,0.529518,89.4705,99.9934
94,95,5108,1789,704,341.372,68.6392,21.3608,99.9566
95,96,1602,2635,688,290.249,82.1363,7.86373,99.981
96,97,608,1686,679,340.514,0.133881,89.8661,99.9834
97,98,629,3149,707,337.955,2.3588400000000003,87.6412,99.972
98,99,3427,478,712,164.8,6.26262,83.7374,99.9683
99,100,2380,1681,712,341.694,4.5279099999999985,85.4721,99.9729
100,101,205044,1436,1033,168.048,0.105461,89.8945,97.6388
101,102,527412,2204,1385,158.572,1.76295,88.23700000000002,93.4366
102,103,3513,1865,735,147.472,58.8986,31.1014,99.9846
103,104,31114,257,856,342.843,6.2227,83.7773,99.98
104,105,2432,1618,761,345.396,68.906,21.094,99.9864
105,106,30727,1713,838,170.148,0.103752,89.8962,99.8943
106,107,608,2733,731,335.951,6.13706,83.8629,99.3629
107,108,677,347,752,340.331,3.81227,86.1877,99.9913
108,109,21477,2938,830,166.389,32.4206,57.5794,99.7765
109,110,5495,2709,792,331.926,37.1178,52.8822,99.9753
110,111,1726,1794,765,344.283,5.67955,84.3204,99.9919
111,112,15198,820,816,162.263,9.10117,80.8988,99.8864
112,113,1086,381,779,209.621,7.41208,82.5879,99.9903
113,114,26517,524,860,3.80335,71.3851,18.6149,99.937
114,115,1187,1562,797,173.905,5.359380000000002,84.6406,99.9749
115,116,17654,398,877,337.8640000000001,20.2045,69.7955,99.913
116,117,5362,2145,833,156.416,60.6836,29.3164,99.9648
117,118,539,1797,803,343.497,1.24932,88.7507,99.9972
118,119,27529,2739,907,151.063,73.1322,16.8678,99.8467
119,120,3799,1875,832,162.917,8.43927,81.5607,99.6686
120,121,17761,1178,903,324.459,47.1361,42.8639,99.9775
121,122,873,2644,838,345.474,14.9024,75.0976,99.9934
122,123,2437,118,874,342.875,6.955189999999999,83.0448,99.9155
123,124,3895,1318,869,350.591,20.7543,69.2457,99.8994
124,125,23449,2555,930,335.181,34.1267,55.8733,99.9643
125,126,985,3137,880,125.738,80.0616,9.93843,99.9751
126,127,7911,1884,909,156.981,16.7991,73.2009,99.9847
127,128,5705,1072,904,202.42,6.85249,83.1475,99.8644
128,129,44670,2953,979,346.24300000000005,50.19600000000001,39.804,99.2434
129,130,29577,905,963,178.03099999999995,22.7705,67.2295,75.5242
130,131,32573,1759,1010,163.438,2.036,87.964,99.8305
131,132,1532,658,926,154.793,24.8698,65.1302,99.9762
132,133,16781,2167,987,353.754,38.0559,51.9441,99.938
133,134,1212,608,949,320.098,81.7838,8.21621,99.9796
134,135,15170,309,1003,334.898,23.0435,66.9565,99.9535
135,136,773,1048,950,325.2390000000001,47.2234,42.7766,99.9815
136,137,1239,647,987,156.09,27.8489,62.1511,99.9752
137,138,17512,1948,1027,179.171,81.9188,8.08124,98.5974
138,139,406506,650,1313,160.056,6.280469999999998,83.7195,70.956
139,140,5056,2654,1020,355.786,22.9958,67.0042,95.4933
140,141,5127,1074,1052,324.038,49.4121,40.5879,99.2892
141,142,2921,723,993,146.299,60.824,29.176,99.3735
142,143,551,528,987,4.53785,69.3501,20.6499,99.9236
143,144,847,2274,998,162.18200000000004,15.5541,74.4459,99.7467
144,145,2529,578,1005,198.54,2.30653,87.6935,99.7957
145,146,948,96,1035,164.055,30.971,59.029,99.9126
146,147,706,2400,998,160.472,17.4557,72.5443,99.9783
147,148,523,415,1012,347.6880000000001,61.6282,28.3718,99.3852
148,149,982,1115,1011,160.701,29.2724,60.7276,99.8248
149,150,2690,2792,1037,348.857,20.9134,69.0866,99.6708
150,151,564,643,1031,208.481,9.23875,80.7612,99.9722
151,152,5449,598,1089,200.179,8.18147,81.8185,99.9674
152,153,1966,3111,1081,297.885,76.0726,13.9274,99.6245
153,154,2713,975,1063,327.907,47.7765,42.2235,99.756
154,155,19864,2828,1115,168.18900000000005,38.8585,51.1415,99.7837
155,156,2585,1686,1089,342.254,1.6807900000000002,88.3192,99.9933
156,157,18563,232,1220,351.355,7.77618,82.2238,99.9786
157,158,1789,645,1075,131.895,64.2681,25.7319,99.9843
158,159,13383,2089,1116,328.31,84.3521,5.64792,99.9171
159,160,2269,2696,1095,169.979,40.1945,49.8055,99.9594
160,161,8340,2637,1128,1.68118,77.5741,12.4259,99.9112
161,162,1354,3072,1116,308.095,73.7239,16.2761,99.9431
162,163,754,848,1104,211.861,2.25196,87.74799999999998,99.9737
163,164,1217,1001,1117,327.269,46.5758,43.4242,99.9697
164,165,2063,1993,1112,147.281,61.3883,28.6117,99.9658
165,166,752,3037,1115,158.045,47.0834,42.9166,99.9614
166,167,11138,1915,1156,344.6880000000001,1.76763,88.2324,99.9615
167,168,15298,3036,1230,161.509,42.1003,47.8997,99.8122
168,169,612,2572,1133,354.776,30.4646,59.5354,99.9768
169,170,2311,1839,1169,172.468,3.4197300000000004,86.5803,99.964
170,171,595,3110,1150,110.87,76.1598,13.8402,99.979
171,172,600,2518,1159,339.399,19.5329,70.4671,99.95
172,173,1609,2211,1162,305.268,86.5824,3.41759,99.9898
173,174,782,93,1189,349.48,10.9696,79.0304,99.9229
174,175,4587,2809,1193,163.982,7.52821,82.4718,99.9891
175,176,3106,2603,1207,151.387,61.0597,28.9403,99.9611
176,177,1611,3102,1226,156.75,45.4729,44.5271,99.898
177,178,6301,2734,1233,151.635,39.0851,50.9149,99.9571
178,179,20514,2968,1310,155.77200000000005,37.2581,52.7419,99.948
179,180,13355,2857,1279,162.658,43.1255,46.8745,99.3151
180,181,15043,1687,1268,341.029,0.492996,89.507,99.9487
181,182,67077,1392,1353,342.202,6.46371,83.5363,98.7423
182,183,1350,1916,1228,163.86,3.62201,86.37799999999999,99.9792
183,184,890,1837,1243,166.988,5.52331,84.4767,99.9971
184,185,1035,3124,1276,156.562,44.5559,45.4441,99.8909
185,186,38728,2064,1373,349.816,44.5101,45.4899,99.9787
186,187,4601,95,1374,351.564,35.1391,54.8609,99.8082
187,188,1290,2739,1320,359.93,14.5683,75.4317,99.9863
188,189,1243,3102,1329,155.895,41.5672,48.4328,99.8826
189,190,606,2693,1334,0.317382,15.1673,74.8327,99.9755
190,191,44356,1065,1464,346.015,23.0639,66.9361,99.5917
191,192,13877,2803,1408,359.543,14.4941,75.5059,99.9832
192,193,2615,3099,1397,151.451,36.4872,53.5128,99.651
193,194,2451,3035,1399,153.003,34.4866,55.5134,99.9754
194,195,5469,826,1409,339.103,10.9924,79.0076,99.9901
195,196,503,2527,1389,341.181,37.6056,52.3944,99.901
196,197,5091,2693,1442,163.949,4.9581800000000005,85.0418,99.9807
197,198,35879,2947,1502,358.86800000000005,3.29225,86.7077,99.847
198,199,9148,217,1505,235.695,83.5704,6.42962,98.7947
199,200,1379,88,1479,210.713,81.8315,8.16854,99.9206
200,201,1493,967,1494,156.92600000000004,26.9196,63.0804,99.7034
201,202,911,2036,1481,350.195,7.95812,82.0419,99.9241
202,203,712,2189,1475,336.164,41.68600000000001,48.31399999999999,99.9939
203,204,30465,2754,1583,144.284,63.2859,26.7141,99.5657
204,205,126835,840,1761,355.777,32.5833,57.4167,99.1976
205,206,3323,1273,1534,327.546,48.578,41.422,99.8648
206,207,350954,1536,1922,170.00099999999995,4.70382,85.2962,61.4453
207,208,540,311,1536,295.562,84.0279,5.97207,99.9779
208,209,13929,1166,1625,149.27100000000004,39.2736,50.7264,99.9828
209,210,1786,197,1636,256.403,84.1985,5.80154,99.9779
210,211,3427,1310,1610,336.125,3.68761,86.3124,99.935
211,212,3943,3022,1619,144.991,15.6652,74.3348,99.861
212,213,1775,3089,1641,150.862,42.7873,47.2127,99.6395
213,214,14289,741,1680,352.098,21.2511,68.7489,99.9271
214,215,4860,2914,1638,342.4480000000001,19.3343,70.6657,99.948
215,216,2304,69,1681,336.3930000000001,18.4511,71.5489,99.9289
216,217,2495,1872,1675,181.225,4.31834,85.6817,99.9893
217,218,2358,3037,1704,328.475,58.4296,31.5704,99.98
218,219,47350,2884,1798,154.637,5.34936,84.6506,98.8458
219,220,826,1781,1694,348.017,41.2382,48.7618,99.953
220,221,34258,2670,1837,165.446,21.1412,68.8588,99.9034
221,222,8867,2097,1739,349.045,47.0243,42.9757,99.9246
222,223,8671,1856,1743,136.612,77.9862,12.0138,99.9619
223,224,773,3077,1739,322.922,60.6039,29.3961,99.9311
224,225,4793,2509,1755,166.287,15.2907,74.7093,99.8513
225,226,698,660,1733,358.806,32.2323,57.7677,99.9803
226,227,2937,1745,1761,343.2580000000001,15.3966,74.6034,99.949
227,228,3778,54,1835,338.5780000000001,45.6005,44.3995,99.8439
228,229,13224,2232,1796,181.026,6.5301800000000005,83.4698,99.9997
229,230,56026,1944,1876,178.2,6.7054,83.2946,99.8919
230,231,11285,1058,1831,154.966,28.6382,61.3618,99.9869
231,232,3323,3019,1804,146.77100000000004,27.3054,62.6946,99.9898
232,233,1027,2338,1797,180.622,6.60352,83.3965,99.9949
233,234,996,2129,1824,347.644,50.5506,39.4494,99.5844
234,235,1433,2569,1814,165.89700000000005,15.4583,74.5417,99.9856
235,236,521,2357,1817,177.725,6.21592,83.7841,99.9986
236,237,93391,2402,1995,343.353,3.93428,86.0657,99.1728
237,238,4648,3029,1883,150.575,68.0573,21.9427,99.9789
238,239,27930,1007,1978,168.37900000000005,5.97455,84.0255,81.8195
239,240,4609,1529,1863,348.855,53.2742,36.7258,99.9956
240,241,4529,2550,1875,341.8540000000001,4.67939,85.3206,99.9857
241,242,17090,2964,1971,330.534,5.83513,84.1649,83.2767
242,243,3468,1785,1938,180.59,6.30031,83.6997,99.9947
243,244,2042,601,1914,333.935,1.07343,88.9266,99.963
244,245,11886,2762,1979,165.54,29.5304,60.4696,99.7963
245,246,3264,1072,1935,336.582,6.02691,83.9731,99.9494
246,247,2867,1347,1963,159.933,11.1436,78.8564,99.9894
247,248,14250,601,2012,318.955,59.1568,30.8432,99.8286
248,249,8417,112,2039,15.6549,49.327,40.673,99.4901
249,250,13330,1227,2016,326.911,61.177,28.823,99.7108
250,251,949,1140,1971,345.273,51.7922,38.2078,99.8494
251,252,39449,2031,2076,334.098,44.6716,45.3284,99.9665
252,253,680,1828,1979,179.90599999999995,4.11676,85.8832,99.9984
253,254,2181,3065,2045,344.352,18.8103,71.1897,99.7715
254,255,937,32,2015,13.5295,41.9975,48.0025,99.6764
255,256,1641,2612,1999,172.955,4.13915,85.8608,99.7162
256,257,1545,3034,2022,346.381,18.387,71.613,99.9801
257,258,2786,698,2015,169.649,12.0108,77.9892,99.8692
258,259,3152,2878,2034,162.77700000000004,23.5045,66.4955,99.87
259,260,3588,2144,2035,351.195,42.1773,47.8227,99.9253
260,261,1003,79,2043,13.2599,44.6173,45.3827,99.9475
261,262,2190,2792,2024,161.659,3.36485,86.6351,99.9587
262,263,514949,1315,2529,349.543,2.6938,87.3062,89.8353
263,264,15898,844,2069,177.25,5.42329,84.5767,99.8284
264,265,2483,2313,2042,347.64,43.2015,46.7985,99.9812
265,266,6181,595,2090,159.878,11.8138,78.1862,99.9502
266,267,6714,2697,2076,350.201,2.52398,87.476,99.8481
267,268,64527,2822,2208,349.531,7.69073,82.3093,99.5172
268,269,17434,2296,2127,350.483,15.5846,74.4154,99.9821
269,270,4625,2796,2089,346.661,4.21138,85.7886,99.9611
270,271,43966,550,2240,351.088,31.2843,58.7157,99.5737
271,272,879,781,2083,178.417,1.46935,88.5307,99.973
272,273,4344,247,2135,346.986,41.1051,48.8949,99.8432
273,274,3485,1259,2110,162.207,31.9196,58.0804,99.9175
274,275,418829,2301,2521,343.32199999999995,24.6624,65.3376,98.8534
275,276,569,646,2107,5.9511400000000005,0.5979770000000001,89.402,99.9918
276,277,20306,759,2173,163.435,8.4855,81.5145,99.9392
277,278,1281,2894,2137,155.921,6.93739,83.0626,99.6595
278,279,4221,108,2208,338.776,50.1595,39.8405,99.8587
279,280,2783,1982,2206,184.001,43.5003,46.4997,99.9865
280,281,2331,495,2213,353.56,21.3057,68.6943,99.8548
281,282,1523,2369,2207,148.61,59.5494,30.4506,99.9863
282,283,2154,25,2236,339.723,51.0836,38.9164,99.9151
283,284,2011,1939,2219,148.733,21.5912,68.4088,99.9755
284,285,2037,2012,2242,150.07299999999995,21.1857,68.8143,99.9489
285,286,65448,2912,2439,155.882,47.7047,42.2953,54.0709
286,287,4889,740,2280,202.228,77.3283,12.6717,99.9804
287,288,3252,1108,2283,161.246,9.56117,80.4388,99.7921
288,289,1059,143,2271,337.955,33.097,56.903,99.8488
289,290,627,2352,2270,154.421,59.2602,30.7398,99.9884
290,291,4532,1930,2289,173.878,8.71901,81.281,99.9635
291,292,3832,640,2312,355.912,23.0705,66.9295,99.9797
292,293,805,1164,2330,169.678,16.3297,73.6703,99.9341
293,294,1069,1139,2326,168.09,19.7576,70.2424,99.9917
294,295,35827,694,2400,332.713,5.37575,84.6243,99.9626
295,296,6898,855,2381,155.409,30.9758,59.0242,99.9131
296,297,1152,120,2366,171.92,10.7806,79.2194,99.9814
297,298,1790,2795,2338,340.5130000000001,9.40735,80.5927,99.6332
298,299,872,56,2343,340.5730000000001,25.2863,64.7137,99.9753
299,300,1144,1395,2354,177.696,1.7694,88.2306,99.9791
300,301,5809,1930,2395,330.33,24.5988,65.4012,99.9305
301,302,2391,477,2438,160.511,19.9898,70.0102,99.9451
302,303,12955,1509,2464,174.359,72.3454,17.6546,99.9163
303,304,570,3063,2429,150.92600000000004,42.2713,47.7287,99.7398
304,305,3827,2749,2453,158.74,2.9178900000000003,87.0821,99.9947
305,306,606,2529,2437,337.63199999999995,2.50653,87.4935,99.9973
306,307,3436,3025,2462,153.66299999999995,40.2948,49.7052,99.9116
307,308,3945,1704,2481,336.8119999999999,25.0715,64.9285,99.9943
308,309,88840,2533,2704,163.84900000000005,71.78399999999998,18.216,99.1234
309,310,26734,571,2581,333.271,6.1864,83.8136,99.0188
310,311,790,419,2491,160.139,18.9888,71.0112,99.842
311,312,540,1606,2486,183.667,46.2283,43.7717,99.7729
312,313,873,473,2505,160.214,21.4722,68.5278,99.8986
313,314,74808,1679,2690,349.63699999999994,1.09818,88.9018,99.8463
314,315,12788,1633,2578,164.014,0.787994,89.212,99.741
315,316,593,456,2544,161.608,19.6258,70.3742,99.8225
316,317,48863,699,2715,341.0030000000001,26.0434,63.9566,99.5815
317,318,1375,1907,2570,164.283,2.11349,87.8865,99.9885
318,319,6383,59,2623,172.575,12.1607,77.8393,99.9854
319,320,2801,1832,2581,350.855,3.11801,86.882,99.7414
320,321,10115,2197,2664,218.443,83.0136,6.98637,99.8456
321,322,1146,1762,2635,162.66899999999995,0.595512,89.4045,99.9911
322,323,29809,962,2754,148.359,67.8807,22.1193,99.9253
323,324,8792,2996,2727,159.299,23.9174,66.0826,99.7837
324,325,3453,2061,2695,239.579,82.5809,7.41914,99.9708
325,326,1435,486,2668,335.745,27.3906,62.6094,99.8873
326,327,1834,2112,2680,337.742,8.68435,81.3157,99.9928
327,328,2949,2499,2681,331.704,1.82294,88.1771,98.3094
328,329,7770,542,2722,166.407,22.8073,67.1927,99.9095
329,330,1180,446,2693,1.59576,86.3718,3.62817,99.9844
330,331,82133,2315,2877,162.21200000000005,37.2779,52.7221,97.9611
331,332,533,1078,2696,2.08304,4.69781,85.3022,99.9912
332,333,13916,800,2760,355.477,3.3281400000000003,86.6719,99.9875
333,334,1253,1122,2745,330.552,77.3996,12.6004,99.8218
334,335,537,433,2746,1.93592,87.0432,2.95678,99.9656
335,336,777,407,2762,16.9687,88.4912,1.50883,99.9938
336,337,2959,1187,2778,155.555,16.3195,73.6805,99.9453
337,338,1641,473,2781,166.699,5.43658,84.5634,99.8879
338,339,2336,1906,2782,184.432,79.932,10.068,97.6686
339,340,4644,81,2829,152.834,16.1474,73.8526,99.8426
340,341,1671,333,2786,0.0207953,88.5409,1.45911,99.9937
341,342,1340,2909,2780,165.783,54.5017,35.4983,99.9938
342,343,1648,514,2797,172.429,3.62978,86.3702,99.977
343,344,12355,2876,2859,352.499,21.6271,68.3729,99.9653
344,345,14220,1157,2857,149.898,47.9167,42.0833,99.9312
345,346,4257,445,2838,325.1020000000001,88.1925,1.80754,99.9842
346,347,551,142,2828,152.00799999999995,16.6265,73.3735,99.9616
347,348,5403,2609,2853,162.481,71.3661,18.6339,99.555
348,349,332241,1006,3191,340.4530000000001,6.50574,83.4943,80.9048
349,350,4029,344,2876,201.112,88.5088,1.49122,99.9871
350,351,5855,2195,2897,178.042,69.8234,20.1766,99.9401
351,352,1531,514,2871,163.216,22.8146,67.1854,99.981
352,353,609,2679,2861,156.542,24.4911,65.5089,99.9598
353,354,526,394,2883,181.724,88.8203,1.17969,99.9926
354,355,243758,456,3171,344.1690000000001,18.9295,71.0705,99.8793
355,356,1328,3018,2916,341.751,52.8581,37.1419,99.8736
356,357,17080,2892,3050,344.353,45.7552,44.2448,99.9515
357,358,1602,197,2938,158.974,19.6656,70.3344,99.9464
358,359,44333,2484,3046,340.589,55.1901,34.8099,99.8506
359,360,67225,2043,3110,332.492,53.6661,36.3339,99.8467
360,361,30735,1342,3028,332.648,30.4696,59.5304,99.5079
361,362,118905,2746,3197,158.08,9.25257,80.7474,97.845
362,363,7624,2982,3089,343.7340000000001,50.851000000000006,39.149,99.8026
363,364,1350,241,2961,161.116,17.9573,72.0427,99.9884
364,365,3409,751,3012,332.061,9.733,80.267,99.5672
365,366,7444,2629,2994,347.177,17.0734,72.9266,99.9857
366,367,1258,1792,2976,349.589,7.54695,82.45299999999997,99.9364
367,368,1258,1244,2982,179.72,79.8464,10.1536,99.9778
368,369,625,2061,2981,329.56,52.7474,37.2526,99.9306
369,370,8389,1867,3006,353.2290000000001,2.6597,87.3403,99.9089
370,371,765,193,3018,338.981,21.5993,68.4007,99.9471
371,372,682,1486,3060,152.02100000000004,15.8975,74.1025,99.981
372,373,7323,1517,3107,157.832,11.4172,78.5828,99.9798
373,374,1285,2119,3082,349.51,60.8122,29.1877,99.9934
374,375,519,6,3096,301.397,62.7943,27.2057,99.9544
375,376,19061,2244,3164,151.034,7.15245,82.8475,99.9704
376,377,6131,1650,3128,350.059,31.7603,58.2397,99.9749
377,378,16107,1371,3181,303.314,73.2759,16.7241,99.9248
378,379,12802,1570,3202,311.8040000000001,70.8924,19.1076,99.8893
379,380,1305,3012,3149,345.417,47.3502,42.6498,99.9619
380,381,2518,2426,3176,331.13699999999994,56.2508,33.7492,99.9824
381,382,10164,1728,3227,162.74200000000005,59.88,30.12,99.9759
382,383,12666,2000,3251,148.523,49.9911,40.0089,99.9504
383,384,5763,1667,3215,327.7290000000001,37.0896,52.9104,99.9862
384,385,7195,2400,3225,169.023,73.7943,16.2057,99.9586
385,386,6431,1478,3241,153.339,25.5649,64.4351,99.9788
386,387,2669,1849,3222,150.871,53.5497,36.4503,99.992
387,388,6144,2973,3295,156.164,10.5845,79.4155,99.8252
388,389,18351,1773,3319,330.026,52.8726,37.1274,99.9252
389,390,2300,802,3249,336.99,39.0934,50.9066,99.9508
390,391,4972,1430,3290,149.578,12.1201,77.8799,99.9242
391,392,17154,2328,3318,341.3540000000001,54.8137,35.1863,99.9913
392,393,19750,2182,3331,166.739,32.6678,57.3322,99.8985
393,394,45791,2534,3380,161.02700000000004,57.5955,32.4045,99.853
394,395,7989,1348,3296,328.039,56.3634,33.6366,99.9687
395,396,551,1907,3259,145.534,52.8056,37.1944,99.9808
396,397,1297,2579,3278,338.73,49.4908,40.5092,99.9972
397,398,1590,1861,3303,329.972,53.2867,36.7133,99.9838
398,399,18311,1496,3380,327.543,55.4465,34.5535,99.9205
399,400,73082,1937,3473,170.215,0.822998,89.177,99.673
400,401,3131,2043,3348,343.287,30.5908,59.4092,99.9693
401,402,1280,1358,3362,173.225,0.993263,89.0067,99.9834
402,403,24400,1571,3463,153.408,25.7632,64.2368,99.9757
403,404,657,138,3373,346.422,44.0129,45.9871,99.86
404,405,8134,1674,3416,164.50799999999995,57.5764,32.4236,99.9953
405,406,15021,240,3485,350.415,21.7922,68.2078,91.4129
406,407,549,113,3376,346.875,44.1427,45.8573,99.9247
407,408,804,2982,3420,325.798,38.2755,51.7245,99.9512
408,409,4672,727,3432,149.892,16.9943,73.0057,99.9677
409,410,7518,2132,3433,348.037,5.21442,84.7856,99.895
410,411,1142,2860,3420,164.14,47.6623,42.3377,99.7882
411,412,8098,2199,3477,328.68,56.1244,33.8756,99.8501
412,413,241491,2421,3723,164.171,35.1642,54.8358,98.3452
413,414,1205,2884,3437,164.081,50.0434,39.9566,99.9905
414,415,834,2906,3457,329.464,33.2057,56.7943,99.9326
415,416,13021,2757,3478,165.763,49.8111,40.1889,99.9874
416,417,127961,651,3554,352.815,32.4697,57.5303,77.946
417,418,18125,1793,3591,333.151,51.2292,38.7708,99.9349
418,419,35999,1425,3590,150.759,40.0625,49.9375,99.4995
419,420,33333,2850,3602,154.51,37.1354,52.8646,99.5371
420,421,55137,1123,3637,150.695,31.7108,58.2892,99.6453
421,422,12546,2148,3591,353.704,58.6206,31.3794,99.8755
422,423,29390,1638,3627,144.809,2.85953,87.1405,99.9795
423,424,14187,271,3614,150.245,13.0065,76.9935,99.9371
424,425,694,1915,3630,163.645,2.87458,87.1254,99.9547
425,426,3365,2051,3643,342.027,30.8295,59.1705,99.9099
426,427,5683,2217,3658,166.563,34.6236,55.3764,99.9645
427,428,94114,458,3754,344.541,6.61723,83.3828,98.6694
428,429,8129,1896,3703,159.857,0.643219,89.3568,99.9632
429,430,4993,2315,3692,342.298,11.3847,78.6153,99.9763
430,431,12531,2740,3743,334.491,49.0177,40.9823,99.9797
431,432,34323,2048,3769,329.34,52.4279,37.5721,99.9251
432,433,42459,1663,3800,340.731,37.2131,52.7869,97.8698
433,434,8329,1345,3749,341.03,8.22645,81.7736,99.9549
434,435,14958,1010,3740,168.495,18.9551,71.0449,99.9116
435,436,4295,800,3721,343.233,0.477844,89.5222,99.8853
436,437,10236,1501,3741,339.6930000000001,10.1209,79.8791,99.634
437,438,24256,839,3822,324.573,44.7024,45.2976,99.9646
438,439,170563,1182,3964,152.776,37.7043,52.2957,99.4357
439,440,2786,2948,3758,349.711,64.3528,25.6472,99.8561
440,441,4498,1246,3766,153.70600000000005,38.3243,51.6757,99.9935
441,442,10649,2841,3797,149.759,13.9971,76.0029,99.9694
442,443,37320,1789,3908,170.25400000000005,52.0798,37.9202,99.8683
443,444,2765,1681,3781,339.006,46.598,43.402,99.9732
444,445,1443,1454,3796,154.813,37.1635,52.8365,99.8334
445,446,2950,2620,3819,164.82,53.1345,36.8655,99.9308
446,447,1429,2928,3828,172.894,77.1753,12.8247,99.9339
447,448,8447,1429,3856,347.809,27.3062,62.6938,99.5924
448,449,44201,325,3975,343.031,5.162730000000002,84.8373,97.7547
449,450,1151,406,3841,350.1880000000001,1.83768,88.1623,99.9756
450,451,1476,2689,3849,311.494,45.5712,44.4288,99.9918
451,452,6494,690,3877,216.337,79.4431,10.5569,99.9553
452,453,14879,575,3916,354.086,4.9074,85.0926,99.9682
453,454,6064,2785,3898,150.309,33.8122,56.1878,99.9382
454,455,11710,453,3919,351.327,11.3569,78.6431,93.9163
455,456,96520,2065,4087,193.812,76.0486,13.9514,90.9268
456,457,1863,2902,3911,151.321,37.102,52.898,99.9329
457,458,514,1582,3891,166.834,50.7457,39.2543,99.9928
458,459,3546,2684,3912,159.32,4.69621,85.3038,99.9682
459,460,21136,184,3991,152.058,13.1395,76.8605,99.1541
460,461,2502,2010,3912,205.788,76.0945,13.9055,99.6008
461,462,606,149,3923,348.6880000000001,0.362709,89.6373,99.9985
462,463,843,348,3939,346.786,19.3098,70.6902,99.0866
463,464,8439,752,3977,327.148,37.2581,52.7419,99.9636
464,465,70520,916,4247,153.702,5.63753,84.3625,91.9986
465,466,10705,2872,4005,153.30200000000005,3.07191,86.9281,99.9029
466,467,11488,1588,4012,320.0440000000001,46.5501,43.4499,99.8553
467,468,13795,2751,3992,316.894,34.2994,55.7006,99.9882
468,469,55423,2493,4083,153.85299999999995,9.3317,80.6683,77.3411
469,470,782,2011,3968,341.754,18.9145,71.0855,99.1017
470,471,18364,581,4032,256.91200000000003,83.6431,6.35695,98.2256
471,472,58402,1710,4129,155.372,2.72903,87.271,99.9692
472,473,1120,2646,4017,153.872,4.66922,85.3308,99.9947
473,474,4235,1330,4043,140.821,49.7943,40.2057,99.7702
474,475,876,1669,4019,357.6690000000001,83.7877,6.21226,99.1026
475,476,3794,95,4074,324.1020000000001,26.9164,63.0836,99.9828
476,477,1115,2685,4042,332.297,32.3419,57.6581,99.7391
477,478,621,1629,4045,147.51,55.6309,34.3691,99.9892
478,479,2779,1235,4077,157.013,48.8598,41.1402,99.9886
479,480,89344,2757,4253,156.751,18.4551,71.5449,99.9407
480,481,8097,740,4121,237.945,83.6222,6.37783,99.9298
481,482,4593,167,4104,161.358,1.62513,88.3749,99.6608
482,483,7521,1311,4116,323.7920000000001,49.0147,40.9853,99.9464
483,484,2579,2339,4103,334.93,46.5229,43.4771,99.9766
484,485,1997,614,4134,251.177,84.6551,5.3449300000000015,99.9937
485,486,1953,292,4123,163.384,21.8117,68.1883,99.6756
486,487,10210,1228,4183,321.98,46.1923,43.8077,99.9165
487,488,882,403,4121,317.282,65.7068,24.2932,99.96
488,489,9514,256,4165,161.197,26.9433,63.0567,99.9806
489,490,764,467,4131,322.9840000000001,63.7128,26.2872,99.8488
490,491,32677,1400,4227,340.82,0.345268,89.6547,99.2037
491,492,1908,679,4146,194.477,80.3916,9.60844,99.9928
492,493,551,1170,4149,321.773,51.9754,38.0246,99.6953
493,494,3923,131,4175,329.32199999999995,4.2691,85.7309,99.9934
494,495,2588,510,4167,335.145,10.6681,79.3319,99.928
495,496,15694,405,4221,149.297,50.3412,39.6588,99.7587
496,497,4083,2259,4177,215.182,81.456,8.54395,99.9401
497,498,5637,601,4185,152.506,41.3378,48.6622,99.9524
498,499,6282,704,4211,327.278,59.9916,30.0084,99.9657
499,500,1879,182,4201,162.58,14.3169,75.6831,99.5916
500,501,1365,893,4192,330.651,12.1366,77.8634,99.977
501,502,5970,2054,4214,337.858,24.9428,65.0572,99.913
502,503,1014,2336,4190,338.0080000000001,48.6514,41.3486,99.9947
503,504,4784,1936,4224,153.05700000000004,38.4927,51.5073,99.9844
504,505,24233,2475,4287,324.27,39.6722,50.3278,99.0144
505,506,5383,1040,4222,151.90200000000004,25.9226,64.0774,99.9317
506,507,16161,1176,4281,162.746,6.17245,83.8275,99.9743
507,508,1751,776,4223,146.066,38.937,51.063,99.9847
508,509,19492,534,4288,160.80100000000004,40.2614,49.7386,99.971
509,510,9518,273,4266,165.085,9.57883,80.4212,99.9384
510,511,3482,2323,4258,158.078,33.7309,56.2691,99.9778
511,512,4767,1591,4264,150.233,58.5326,31.4674,99.8915
512,513,12086,1824,4271,330.423,14.7303,75.2697,99.9785
513,514,7415,170,4279,352.18300000000005,80.866,9.13398,99.9633
514,515,574,2270,4239,161.424,36.261,53.739,99.9164
515,516,5398,2000,4270,151.504,23.6925,66.3075,99.9839
516,517,11012,989,4312,156.49200000000005,53.3836,36.6164,99.9555
517,518,1520,2537,4259,324.118,41.8101,48.1899,99.9851
518,519,8814,685,4302,154.89700000000005,64.9011,25.0989,99.9295
519,520,2078,2085,4287,145.007,40.5188,49.4812,99.9695
520,521,538,2878,4298,154.439,18.8304,71.1696,99.9519
521,522,557,346,4287,141.524,78.9793,11.0207,99.975
522,523,2254,1660,4300,24.1196,85.2543,4.74566,99.9875
523,524,10293,1568,4333,156.576,10.5098,79.4902,99.9455
524,525,5913,1469,4333,169.98,49.3014,40.6986,99.8713
525,526,9798,806,4371,160.634,60.9736,29.0264,99.4065
526,527,17626,353,4387,158.80200000000005,72.7685,17.2315,99.9084
527,528,1787,1289,4312,154.602,22.1654,67.8346,99.9906
528,529,757,2305,4296,157.968,33.6197,56.3803,99.9764
529,530,1734,1932,4319,146.221,37.8823,52.1177,99.9374
530,531,502,1073,4311,142.95600000000005,34.0988,55.9012,99.8685
531,532,1027,1339,4318,156.985,8.7254,81.2746,99.9294
532,533,42905,2119,4420,331.539,52.8129,37.1871,99.8636
533,534,1238,2122,4318,156.15200000000004,31.1488,58.8512,99.9408
534,535,3259,2318,4330,157.657,32.6721,57.3279,99.9805
535,536,2332,225,4340,149.998,52.6082,37.3918,99.9748
536,537,3206,579,4347,331.1740000000001,5.337280000000002,84.6627,99.99
537,538,1712,1766,4345,328.971,24.8878,65.1122,99.975
538,539,2057,1063,4341,143.526,33.273,56.727,99.9693
539,540,3950,1863,4368,160.064,5.51272,84.4873,99.9876
540,541,1637,1917,4355,146.247,37.4928,52.5072,99.9143
541,542,6012,1217,4367,336.411,6.2887,83.7113,99.9833
542,543,2228,2128,4375,155.043,30.9749,59.0251,99.9554
543,544,648,2236,4340,332.142,50.3895,39.6105,99.9598
544,545,10959,1330,4379,336.8730000000001,10.2845,79.7155,99.9745
545,546,1980,671,4360,147.36,56.2529,33.7471,99.9896
546,547,1670,2381,4369,335.24,25.3561,64.6439,99.9841
547,548,2295,2914,4389,341.017,13.6275,76.3725,99.9519
548,549,48180,2486,4489,191.389,82.9048,7.095210000000002,86.9974
549,550,1771,1637,4373,161.291,75.9767,14.0233,99.9762
550,551,6870,616,4427,158.33,68.2308,21.7692,99.9667
551,552,4149,2336,4392,324.452,32.8527,57.1473,99.9963
552,553,2283,182,4392,153.53799999999995,7.82476,82.1752,99.9912
553,554,11532,1723,4421,328.9890000000001,4.55796,85.44200000000002,99.9768
554,555,1180,1026,4388,144.472,41.971,48.029,99.9921
555,556,6080,505,4408,330.506,16.8602,73.1398,99.9534
556,557,3386,1134,4423,222.962,81.9666,8.033430000000001,99.9575
557,558,7580,1828,4432,158.062,21.6835,68.3165,99.8072
558,559,21445,1424,4452,338.156,76.8164,13.1836,99.9018
559,560,2851,1571,4402,357.886,79.694,10.306,99.8136
560,561,2500,246,4427,151.457,54.3931,35.6069,99.9831
561,562,7042,718,4434,161.435,71.2244,18.7756,99.6056
562,563,2244,1212,4421,155.436,16.4501,73.5499,99.9752
563,564,1688,575,4429,152.4,4.4435699999999985,85.5564,99.9981
564,565,785,398,4435,152.566,48.5646,41.4354,99.7868
565,566,5448,1647,4466,151.145,30.9265,59.0735,99.9812
566,567,39977,1006,4600,147.006,41.8287,48.1713,99.8475
567,568,11986,780,4489,335.87,5.545719999999998,84.4543,99.8501
568,569,553,1938,4438,148.555,35.495,54.505,99.936
569,570,20207,442,4507,336.039,1.22064,88.7794,99.4457
570,571,18813,244,4528,153.504,31.3822,58.6178,99.9374
571,572,3556,2329,4473,316.7340000000001,64.5821,25.4179,99.9617
572,573,4795,1235,4478,316.26,64.543,25.457,99.8893
573,574,517,487,4463,162.764,71.6296,18.3704,99.9812
574,575,5793,1152,4501,337.846,6.72657,83.2734,99.8146
575,576,793,1884,4470,329.167,58.9071,31.0929,99.9604
576,577,776,1954,4470,336.602,11.4054,78.5946,99.9605
577,578,1132,2821,4476,324.509,39.3202,50.6798,99.9654
578,579,1284,645,4484,157.135,29.5114,60.4886,99.9939
579,580,20326,1558,4555,344.466,54.8132,35.1868,99.8204
580,581,12800,1901,4520,327.84,36.5861,53.4139,50.5512
581,582,6300,2716,4505,338.706,0.6354449999999999,89.3646,99.9629
582,583,1334,1758,4510,163.825,6.04533,83.9547,99.1115
583,584,545,7,4517,142.86700000000005,48.43899999999999,41.56100000000001,99.8801
584,585,4581,1283,4534,3.32915,65.4435,24.5565,99.6611
585,586,3770,2091,4535,329.206,54.2968,35.7032,99.8615
586,587,1422,2261,4512,152.16,28.8945,61.1055,99.5981
587,588,629,625,4518,152.887,32.5996,57.4004,99.9453
588,589,1971,2614,4528,336.676,14.9526,75.0474,99.9689
589,590,700,83,4528,329.636,56.8602,33.1398,99.8792
590,591,569,594,4527,145.46200000000005,81.3503,8.6497,99.9893
591,592,5096,2225,4549,159.991,12.7749,77.2251,99.9485
592,593,626,1698,4528,137.931,82.213,7.7869899999999985,97.7254
593,594,2989,1370,4549,341.519,52.5009,37.4991,99.9343
594,595,7820,62,4593,332.353,55.4083,34.5917,99.8769
595,596,4776,788,4564,162.418,68.547,21.453000000000007,99.9151
596,597,1355,854,4550,141.071,38.4715,51.5285,99.9938
597,598,1152,695,4544,150.298,32.0472,57.9528,99.9806
598,599,7057,2638,4580,164.452,67.462,22.538,99.8051
599,600,3069,1093,4563,153.591,57.614,32.386,99.9814
600,601,849,1433,4558,151.7,22.7673,67.2327,99.9302
601,602,3381,2140,4586,152.575,39.504,50.496,99.9659
602,603,3104,161,4583,149.56,45.1725,44.8275,99.9476
603,604,2052,1732,4567,197.21400000000003,78.278,11.722,99.8147
604,605,10540,1732,4612,320.296,74.4844,15.5156,99.9372
605,606,9367,1229,4610,154.852,21.1355,68.8645,99.7996
606,607,8802,533,4586,122.137,72.4877,17.5123,99.9614
607,608,596,1669,4556,324.394,73.0486,16.9514,99.9917
608,609,8234,1928,4607,331.496,62.4573,27.5427,83.1906
609,610,6528,2032,4595,160.157,53.4395,36.5605,99.897
610,611,39425,2384,4680,155.786,1.77715,88.2229,99.0905
611,612,20389,678,4629,328.28,38.9872,51.0128,99.9838
612,613,5760,414,4615,144.678,38.4814,51.5186,99.9634
613,614,891,1376,4589,345.365,44.0934,45.9066,99.9858
614,615,1864,1319,4607,330.49,61.3547,28.6453,99.9615
615,616,513,834,4596,355.78,70.8655,19.1345,99.8939
616,617,9226,2149,4649,336.1430000000001,4.23364,85.7664,99.9185
617,618,26500,1426,4668,148.403,48.1954,41.8046,99.977
618,619,21086,1937,4691,165.905,73.9985,16.0015,99.922
619,620,1512,319,4622,338.16,30.2451,59.7549,99.4042
620,621,817,200,4620,343.8590000000001,22.2994,67.7006,99.9514
621,622,18821,1696,4693,157.88299999999995,21.5806,68.4194,99.9067
622,623,5037,824,4652,145.749,68.083,21.917,99.8287
623,624,1723,2438,4635,338.445,75.12899999999998,14.871,99.9586
624,625,1154,2515,4630,161.121,65.2381,24.7619,99.9419
625,626,1463,1175,4655,333.649,52.6348,37.3652,99.9955
626,627,636,1822,4658,325.851,30.795,59.205,99.8938
627,628,605,926,4663,144.865,67.2027,22.7973,99.9547
628,629,3345,2823,4693,143.108,14.3109,75.6891,99.742
629,630,1033,2221,4687,322.508,76.5099,13.4901,99.9796
630,631,1507,2279,4705,156.32299999999995,9.94447,80.0555,99.9828
631,632,13109,2140,4734,328.202,80.4296,9.57039,99.9321
632,633,959,1242,4697,154.597,53.2295,36.7705,99.9808
633,634,2511,2287,4762,334.774,4.77447,85.2255,99.9521
634,635,4649,2848,4794,320.69,60.503,29.497,99.8616
635,636,683,2441,4785,344.247,85.859,4.14104,99.9204
636,637,1083,2721,4796,171.28099999999995,68.0223,21.9777,99.7984
