,Grain No.,Size [Pixel],center x-coordinate,center y-coordinate,mean azimuth [degree],mean latitude [degree],mean colatitude [degree],Regelungsgrad [%]
0,1,3984,549,38,60.8383,32.3192,57.6808,99.4651
1,2,669,646,17,335.277,81.9431,8.05686,99.9473
2,3,126424,979,238,54.7803,15.1717,74.8283,98.8818
3,4,9082,770,61,55.6784,1.34861,88.6514,99.9965
4,5,5553,1160,48,229.828,9.678,80.322,99.8835
5,6,142920,1450,201,234.805,34.6527,55.3473,91.2258
6,7,552,842,31,229.985,4.7912,85.2088,99.9979
7,8,2290,1784,37,229.997,40.1271,49.8729,99.7453
8,9,2042,1891,45,239.341,39.1811,50.8189,99.9024
9,10,2364,1941,65,246.02,49.3339,40.6661,99.9556
10,11,563,1034,52,215.775,46.6154,43.3846,99.9874
11,12,10374,2078,102,50.62300000000001,29.3134,60.6866,99.5194
12,13,5301,2194,76,64.965,38.1493,51.8507,99.956
13,14,34625,2018,236,223.49400000000003,27.35,62.65,76.0332
14,15,938,592,61,219.71400000000003,1.38537,88.6146,99.9975
15,16,2376,1770,74,56.4605,25.6206,64.3794,99.9806
16,17,854,1880,73,245.413,49.354,40.646,99.9779
17,18,835,1724,78,230.547,67.0384,22.9616,99.3136
18,19,10096,1191,132,257.053,77.543,12.457,99.9805
19,20,26048,1775,166,230.594,72.0195,17.9805,99.9905
20,21,760,1863,91,239.641,47.8366,42.1634,99.9933
21,22,799,562,83,56.8681,75.1512,14.8488,99.9868
22,23,3150,437,92,60.7813,31.2045,58.7955,99.4218
23,24,4081,703,103,52.3968,3.36461,86.6354,99.9982
24,25,3775,2406,113,50.3776,64.888,25.112,99.8998
25,26,3546,501,111,55.8316,29.3045,60.6955,99.896
26,27,1875,2271,111,196.013,84.6908,5.30921,99.9082
27,28,3269,650,145,49.0598,30.9425,59.0575,99.9615
28,29,3933,594,119,54.7089,72.5434,17.4566,99.9721
29,30,1032,1963,115,44.5177,18.7101,71.2899,99.9924
30,31,2044,1896,133,41.2725,20.3144,69.6856,99.9801
31,32,13348,2275,151,195.93,82.7662,7.23378,99.9823
32,33,1354,403,143,219.929,68.1723,21.8277,99.8701
33,34,28871,2527,223,225.873,48.1629,41.8371,99.1122
34,35,1342,780,132,234.328,17.9391,72.0609,99.9646
35,36,21492,2191,225,227.814,3.85125,86.1488,99.8314
36,37,8430,732,179,235.452,14.2993,75.7007,99.9915
37,38,3153,463,165,64.3981,36.5585,53.4415,99.994
38,39,5922,567,175,58.4611,13.8556,76.1444,99.7628
39,40,1857,2661,157,218.016,56.2638,33.7362,99.9344
40,41,8649,2396,207,54.1745,3.60991,86.3901,99.9855
41,42,40158,2936,263,50.9217,27.4792,62.5208,42.1199
42,43,3048,1908,194,226.459,11.7199,78.2801,99.9907
43,44,1330,488,205,65.6775,36.0682,53.9318,99.9776
44,45,6073,2678,214,226.754,12.0412,77.9588,99.8396
45,46,531,2324,205,48.7736,75.8638,14.1362,99.989
46,47,16976,671,284,50.0174,37.01300000000001,52.987,99.9549
47,48,12070,568,268,46.44,40.7419,49.2581,99.984
48,49,1033,519,225,59.1721,53.023,36.977,99.9874
49,50,2335,807,245,52.95,24.9626,65.0374,99.9498
50,51,9093,1706,261,59.0907,41.1662,48.8338,99.995
51,52,17959,1856,298,234.481,6.27952,83.7205,99.9881
52,53,792,1217,238,222.09,8.03716,81.9628,99.9815
53,54,1551,3070,234,237.431,1.38627,88.6137,99.984
54,55,1577,478,252,230.55900000000003,27.5445,62.4555,99.9677
55,56,1070,3161,248,56.8558,47.4579,42.5421,99.9184
56,57,4177,1201,285,239.627,48.0344,41.9656,99.9866
57,58,12978,2669,311,42.0323,26.2062,63.7938,99.9706
58,59,7828,3209,306,38.705,55.517,34.483000000000004,99.9108
59,60,6360,2303,290,221.866,9.63754,80.3625,99.9951
60,61,11034,2847,309,207.851,35.1734,54.8266,99.9265
61,62,11346,3329,331,59.2992,26.155,63.845,99.7872
62,63,1462,1796,284,231.826,41.0484,48.9516,99.9642
63,64,4163,2379,315,41.9573,22.1612,67.8388,99.9931
64,65,5208,2230,326,43.9322,61.0469,28.9531,99.8994
65,66,980,425,298,58.1749,13.6953,76.3047,99.8891
66,67,1292,3172,291,234.655,0.4599,89.5401,99.9983
67,68,3830,3447,307,235.166,46.131,43.869,99.9451
68,69,4083,473,306,54.0943,12.4113,77.5887,99.9161
69,70,4651,2526,319,226.995,25.9405,64.0595,99.9909
70,71,18855,1631,385,230.384,16.4464,73.5536,99.9928
71,72,907,2133,312,38.5188,64.0028,25.9972,99.9893
72,73,662,2173,309,224.549,14.4392,75.5608,99.9983
73,74,1280,2092,323,222.459,12.3842,77.6158,99.976
74,75,841,2429,316,237.816,60.6303,29.3696,99.997
75,76,1438,3727,316,146.063,60.0319,29.9681,98.5349
76,77,824,3427,323,62.1855,56.4912,33.5088,99.9623
77,78,2387,3540,338,65.5646,56.3371,33.6629,99.9411
78,79,3871,2485,363,225.488,52.6281,37.3719,99.9771
79,80,1435,695,338,70.8154,53.1486,36.8514,99.9805
80,81,2598,2850,353,45.1059,64.6913,25.3087,99.9867
81,82,6126,3632,373,220.507,40.1041,49.8959,99.785
82,83,35887,1871,503,189.354,79.0373,10.9627,95.5894
83,84,742,1190,345,228.724,17.2159,72.7841,99.9977
84,85,30347,2150,450,225.142,34.6879,55.3121,98.4244
85,86,4543,2748,361,242.338,65.1381,24.8619,99.9733
86,87,12045,1298,394,58.3937,2.39267,87.6073,99.9967
87,88,2851,1221,364,227.79,24.5001,65.4999,99.9974
88,89,14502,499,418,225.39,16.4706,73.5294,99.8984
89,90,6507,3232,385,236.691,1.62025,88.3798,99.9995
90,91,1232,2310,353,42.2769,22.6088,67.3912,99.9978
91,92,693,3471,350,229.885,44.5443,45.4557,99.9949
92,93,2933,3150,370,61.2933,49.849,40.151,99.9978
93,94,11367,2420,401,233.624,23.6505,66.3495,99.9832
94,95,5981,3716,390,52.0863,29.8891,60.1109,99.5405
95,96,4881,574,386,77.6084,53.8785,36.1215,99.9696
96,97,649,1861,354,220.271,32.4491,57.5509,99.9915
97,98,17577,2835,421,58.2874,37.6068,52.3932,99.9236
98,99,25117,3519,443,61.2051,61.2527,28.7473,87.7553
99,100,566,3773,370,139.317,34.6051,55.3949,99.8395
100,101,1261,1729,378,236.463,41.6954,48.3046,99.9986
101,102,13818,1785,433,47.1849,2.68965,87.3103,99.9928
102,103,1692,1557,389,225.626,0.685104,89.3149,99.9868
103,104,7980,1892,410,228.1,28.9647,61.0353,99.9973
104,105,5885,3049,389,64.9408,81.5344,8.46562,99.989
105,106,35397,2594,483,61.0824,28.1342,61.8658,99.9795
106,107,2249,637,403,230.24400000000003,26.6741,63.3259,99.9979
107,108,3583,1057,406,219.566,46.6977,43.3023,99.9826
108,109,109929,648,656,52.959,12.6931,77.3069,97.5195
109,110,1182,2333,386,220.943,2.55513,87.4449,99.9788
110,111,1161,1189,394,241.082,43.557,46.44300000000001,99.9918
111,112,1018,411,410,239.805,10.0551,79.9449,99.9654
112,113,5402,2707,441,233.649,54.3619,35.6381,99.9754
113,114,724,3571,394,229.928,43.1496,46.8504,99.9922
114,115,985,804,402,229.371,40.2962,49.7038,99.9978
115,116,5249,1388,421,54.6605,14.0229,75.9771,99.9959
116,117,4061,3357,407,106.431,71.875,18.125,99.9915
117,118,813,1457,399,226.93,38.1663,51.8337,99.9915
118,119,10686,3137,453,46.5234,39.9847,50.0153,99.8413
119,120,1109,430,434,225.366,15.135,74.865,99.9317
120,121,2029,1702,428,224.895,37.1963,52.8037,99.9953
121,122,2567,944,435,54.698,24.905,65.095,99.9078
122,123,3149,2194,438,50.9211,65.0767,24.9233,99.9854
123,124,138354,3221,647,235.496,57.2505,32.7495,70.9919
124,125,5606,3306,463,56.5821,51.8558,38.1442,99.9861
125,126,106911,1337,582,232.066,23.3564,66.6436,95.5383
126,127,966,3248,430,240.627,30.9954,59.0046,99.8861
127,128,3820,1013,455,52.7872,43.8074,46.1926,99.9737
128,129,7528,2283,465,229.302,10.0418,79.9582,99.995
129,130,3736,3660,467,48.9136,41.2644,48.7356,99.9606
130,131,1047,3374,444,56.838,15.8904,74.1096,99.9968
131,132,954,3700,448,53.8531,43.541,46.459,99.955
132,133,4549,3215,485,64.2524,49.3283,40.6717,99.9893
133,134,1475,2876,472,51.8514,53.842,36.158,99.9957
134,135,9604,2427,484,226.278,51.4201,38.5799,99.9868
135,136,9661,3416,501,45.6454,7.00758,82.9924,99.9647
136,137,677,2141,466,231.03,35.4908,54.5092,99.9966
137,138,3114,3736,501,230.39,78.0797,11.9203,99.7148
138,139,3845,1646,491,198.572,72.3853,17.6147,99.948
139,140,13022,1043,571,48.0388,7.51739,82.4826,99.8543
140,141,1931,1715,496,44.7849,53.7811,36.2189,99.9971
141,142,32618,961,652,63.26300000000001,75.8555,14.1445,46.2715
142,143,1519,3637,506,57.1619,42.8999,47.1001,99.9696
143,144,471788,2693,981,228.416,24.4979,65.5021,43.9275
144,145,995,430,516,52.7221,24.4114,65.5886,99.9331
145,146,31815,2963,677,51.1988,10.4316,79.5684,62.0081
146,147,3269,2334,528,54.3146,26.7047,63.2953,48.4076
147,148,8001,1638,553,232.917,24.6688,65.3312,99.6412
148,149,14185,1990,565,237.478,5.423019999999998,84.57700000000001,99.7587
149,150,686,400,532,53.3885,24.097,65.903,99.869
150,151,20656,2378,587,41.3965,11.9341,78.0659,99.9274
151,152,5451,2219,570,55.6852,63.0292,26.9708,70.3953
152,153,4428,664,574,215.822,34.7912,55.2088,99.995
153,154,11253,782,591,62.6715,13.7356,76.2644,99.9976
154,155,6373,3676,573,57.9677,40.5059,49.4941,99.911
155,156,3688,3489,582,57.5685,19.1639,70.8361,99.8977
156,157,909,454,580,51.529,22.8288,67.1712,99.9905
157,158,1658,3738,573,63.0023,41.4327,48.5673,99.8821
158,159,29969,3626,658,228.392,25.3921,64.6079,99.7541
159,160,2579,2868,570,246.614,60.89100000000001,29.109,99.981
160,161,3563,1561,603,60.0999,77.0262,12.9738,99.9938
161,162,1771,2672,594,47.1614,2.283,87.71700000000001,99.9983
162,163,1133,409,591,60.6838,25.33,64.67,99.5917
163,164,7830,597,617,233.597,20.1431,69.8569,99.994
164,165,1966,876,615,293.9770000000001,82.5498,7.45017,99.9766
165,166,12261,1686,681,232.93,10.4977,79.5023,98.9774
166,167,9720,2063,648,62.9765,27.3249,62.6751,99.8654
167,168,2379,3742,627,53.944,51.4508,38.5492,99.9562
168,169,126598,1904,868,230.709,3.25442,86.7456,86.616
169,170,2011,1617,637,236.923,3.24323,86.7568,99.9927
170,171,5785,829,668,216.268,64.4444,25.5556,99.9784
171,172,7537,674,678,264.86400000000003,84.8224,5.17759,99.9887
172,173,18514,1175,693,50.8579,59.887,30.113000000000003,99.9909
173,174,818,1032,653,222.924,31.5077,58.4923,99.9945
174,175,6319,1592,701,235.766,21.9766,68.0234,99.9994
175,176,5491,746,709,232.774,12.4687,77.5313,99.984
176,177,2098,406,699,56.9768,63.5507,26.4493,99.8721
177,178,947,2388,673,56.0357,68.763,21.237,99.9988
178,179,6897,3542,701,218.066,76.9753,13.0248,99.981
179,180,707,553,675,234.314,12.1073,77.8927,99.9035
180,181,3480,592,697,229.356,4.05788,85.9421,99.9973
181,182,4544,457,737,231.015,31.8672,58.1328,99.9922
182,183,15315,2183,771,57.1156,25.9201,64.0799,99.9858
183,184,989,887,704,53.8948,40.1016,49.8984,99.9978
184,185,1038,2114,706,82.3581,66.3343,23.6657,99.9988
185,186,534,2367,728,58.6264,66.7389,23.2611,99.9943
186,187,3662,777,755,228.365,28.6212,61.3788,99.9883
187,188,5677,2073,752,56.0536,72.7356,17.2644,99.991
188,189,90884,878,960,54.5593,30.2403,59.7597,61.3812
189,190,1687,639,735,58.302,23.6417,66.3583,99.9989
190,191,5068,2678,745,69.31,49.5859,40.4141,99.9972
191,192,13516,1336,830,229.348,23.9251,66.0749,99.8358
192,193,69227,3521,892,39.2049,0.961655,89.0383,98.2096
193,194,1534,597,755,41.6172,6.62115,83.3788,99.9957
194,195,7696,1062,808,229.156,16.3966,73.6034,99.9526
195,196,1871,3670,766,234.94,8.2261,81.7739,99.9782
196,197,21111,1516,827,56.0127,11.1917,78.8083,99.9048
197,198,600,3419,764,52.0911,34.7171,55.2829,99.9905
198,199,1015,1602,761,226.745,76.98,13.02,99.9588
199,200,26469,1220,819,56.6044,10.69,79.31,99.985
200,201,18644,1678,822,222.742,75.6959,14.3041,99.9819
201,202,12104,2568,801,244.925,53.0304,36.9696,99.9854
202,203,2124,3728,775,225.578,14.5643,75.4357,99.6578
203,204,5324,3133,822,43.9266,36.1239,53.8761,99.6144
204,205,5275,2673,819,203.116,77.4491,12.5509,99.9936
205,206,1889,3700,814,232.39,2.35838,87.6416,99.919
206,207,684,446,809,57.3646,25.0985,64.9015,99.9598
207,208,2506,404,870,53.3841,69.1437,20.8563,99.6382
208,209,3374,3058,837,40.6111,35.6999,54.3001,99.9931
209,210,5594,2083,858,90.6352,68.1171,21.8829,99.991
210,211,2964,2233,844,56.9921,1.26197,88.738,99.9967
211,212,1052,2606,844,218.868,6.09785,83.9021,99.997
212,213,1972,457,852,50.522,45.8294,44.1706,99.993
213,214,807,1794,842,43.6135,13.4541,76.5459,99.9981
214,215,1459,3731,868,223.722,49.1938,40.8062,99.9384
215,216,3251,3283,868,225.329,62.75,27.25,99.9923
216,217,2121,1154,872,45.9098,43.3927,46.6073,99.9874
217,218,5790,1091,892,57.7265,1.6703400000000002,88.3297,99.9726
218,219,5085,2165,881,15.1676,84.7754,5.22465,99.997
219,220,12460,2290,900,52.6904,74.5761,15.4239,99.9731
220,221,1713,740,879,237.773,11.6637,78.3363,99.9976
221,222,3833,3105,894,210.11,71.9699,18.0301,99.9969
222,223,58080,1475,1058,61.2498,51.0915,38.9085,78.817
223,224,17392,3170,941,218.431,30.1877,59.8123,99.963
224,225,1714,3753,910,235.79,31.1259,58.8741,99.7354
225,226,664,1776,874,230.36,19.8984,70.1016,99.997
226,227,10322,1755,935,54.6081,15.2013,74.7987,99.9221
227,228,1661,2403,903,192.145,79.4552,10.5448,99.976
228,229,580,2577,893,234.162,11.2857,78.7143,99.9965
229,230,1295,680,902,48.3645,22.0955,67.9045,99.9945
230,231,1937,442,922,64.072,77.2954,12.7046,99.9936
231,232,16681,2058,1040,51.8507,49.992,40.008,72.0837
232,233,1537,1669,915,124.18,77.8576,12.1424,99.9929
233,234,3201,492,932,79.7678,78.6382,11.3618,99.9864
234,235,1291,1631,916,50.3671,22.6426,67.3574,99.9961
235,236,79019,1179,1100,42.7552,81.6934,8.30662,99.6523
236,237,5754,3667,955,226.704,48.4927,41.5073,99.9941
237,238,896,3281,933,32.1955,83.89,6.10997,99.9481
238,239,994,3724,934,232.361,50.8327,39.1673,99.9868
239,240,4470,1609,963,232.803,45.8005,44.1995,99.962
240,241,6429,3333,961,86.5197,70.7077,19.2923,99.9487
241,242,11409,2796,970,233.191,5.77441,84.2256,99.951
242,243,587,1131,941,47.933,20.2598,69.7402,99.9922
243,244,7020,681,988,48.1017,20.8684,69.1316,99.9547
244,245,13412,582,1025,46.2801,40.8347,49.1653,99.9433
245,246,3004,2183,962,214.74400000000003,58.1226,31.8774,99.9813
246,247,4845,505,989,238.199,17.2367,72.7633,99.7719
247,248,2489,1704,973,230.114,53.0224,36.9776,99.9802
248,249,29117,3624,1083,227.072,15.725,74.275,89.5931
249,250,869,1324,974,48.5416,9.0323,80.9677,99.9944
250,251,622,435,977,239.988,17.6553,72.3447,99.9446
251,252,2936,1057,998,54.7627,23.8057,66.1943,99.5812
252,253,683,3750,998,226.568,15.5392,74.4608,99.9021
253,254,4470,1584,1017,227.216,54.426,35.574,99.9732
254,255,1698,406,1027,46.3186,37.4127,52.5873,99.9407
255,256,945,642,1003,222.567,2.9283,87.0717,99.9756
256,257,4008,3302,1013,181.01,74.1165,15.8835,99.8316
257,258,1649,1364,1015,61.3074,22.3571,67.6429,99.9856
258,259,38000,2240,1107,49.9824,19.689,70.311,99.985
259,260,14313,1737,1086,222.028,47.8854,42.1146,99.6902
260,261,55526,544,1186,48.473,37.2581,52.7419,99.0388
261,262,32999,3286,1157,228.469,12.2655,77.7345,99.9529
262,263,6314,3461,1079,46.2593,18.1298,71.8702,99.9331
263,264,4659,3287,1073,228.725,60.0342,29.9658,99.9329
264,265,1971,831,1066,62.1354,81.1646,8.83542,99.9967
265,266,5016,890,1090,235.597,3.71147,86.2885,99.9907
266,267,12157,1205,1119,339.148,87.015,2.98505,99.9786
267,268,4232,1545,1083,63.8848,68.7055,21.2945,99.9922
268,269,14600,1647,1133,56.9636,26.7044,63.2956,99.9789
269,270,1794,684,1075,40.0296,30.6468,59.3532,99.998
270,271,2462,651,1093,50.4013,2.68717,87.3128,99.9988
271,272,1339,533,1095,52.837,28.4342,61.5658,99.9632
272,273,1499,3693,1118,54.9824,32.355,57.645,99.9794
273,274,718,3335,1104,47.3345,18.279,71.721,99.9967
274,275,607,388,1115,59.5535,45.1474,44.8526,99.8174
275,276,1249,947,1125,55.7246,23.8101,66.1899,99.9987
276,277,8920,1906,1194,229.353,14.761,75.23899999999998,99.9445
277,278,2036,3656,1144,51.4993,31.9375,58.0625,99.9951
278,279,63402,2017,1349,52.0504,67.536,22.464,99.8494
279,280,2672,3411,1167,222.231,20.42,69.58,99.9978
280,281,4927,3476,1165,186.008,79.4819,10.5181,99.9784
281,282,12249,2101,1187,223.101,26.5779,63.4221,99.984
282,283,119002,1337,1392,233.258,3.37966,86.6203,95.6325
283,284,2544,969,1164,54.8808,26.2716,63.7284,99.983
284,285,2495,917,1172,48.2668,20.1453,69.8547,99.9958
285,286,9994,3598,1216,240.94,49.4753,40.5247,99.9601
286,287,25704,789,1270,48.849,22.4295,67.5705,99.8985
287,288,8447,3677,1236,283.004,83.2559,6.744110000000001,99.9539
288,289,905,2451,1177,215.325,59.6979,30.3021,99.9946
289,290,603,2413,1170,224.526,11.9074,78.0926,99.999
290,291,696,3739,1190,287.9,79.6372,10.3628,99.8075
291,292,587,2255,1188,213.379,52.7394,37.2606,99.9982
292,293,17660,1779,1251,56.3829,6.8514,83.1486,99.9381
293,294,13838,2227,1251,214.331,76.3705,13.6295,99.9713
294,295,1058,388,1213,50.6262,42.6511,47.3489,99.3204
295,296,6062,1652,1237,40.0107,25.9879,64.0121,99.9257
296,297,5679,963,1242,45.664,33.6231,56.3769,95.3188
297,298,75770,3414,1514,47.5147,0.181953,89.818,80.2612
298,299,1672,3514,1230,223.364,2.85299,87.147,99.9939
299,300,7800,3361,1258,226.548,27.5547,62.4453,99.985
300,301,2702,1091,1243,236.34,4.47359,85.5264,99.9931
301,302,12489,3174,1277,216.668,33.2955,56.7045,99.9982
302,303,1093,400,1257,37.0413,32.5843,57.4157,99.1259
303,304,1561,2330,1254,220.687,61.0206,28.9794,99.998
304,305,2912,1887,1273,33.6345,67.6725,22.3274,99.9931
305,306,7630,2719,1290,43.3582,46.7642,43.2358,99.9974
306,307,7758,1040,1309,59.7417,31.4948,58.5052,99.7662
307,308,13402,3042,1336,132.534,84.4534,5.54655,99.9665
308,309,49715,832,1488,231.212,4.09255,85.9074,32.9736
309,310,1834,3434,1284,46.042,26.2276,63.7724,99.9459
310,311,10775,3561,1325,54.789,45.8626,44.1374,99.988
311,312,58226,1613,1479,52.1455,0.967316,89.0327,97.1398
312,313,5551,566,1335,42.5554,37.0555,52.9445,99.9101
313,314,752,1093,1294,242.8,3.80254,86.1975,99.9835
314,315,25396,3207,1368,235.51,1.30245,88.6975,99.9682
315,316,809,1568,1298,66.9232,15.5565,74.4435,99.9325
316,317,11123,2597,1343,54.3666,53.6571,36.3429,99.8675
317,318,3097,1711,1330,55.175,8.29848,81.7015,99.9934
318,319,4579,2297,1320,63.4372,59.9348,30.0652,99.7505
319,320,13281,663,1358,228.376,60.0948,29.9052,99.9936
320,321,646,3742,1302,222.348,31.7834,58.2166,99.8242
321,322,298994,719,1826,56.088,4.41679,85.5832,71.3366
322,323,986,3651,1317,226.931,7.394360000000002,82.6056,99.99
323,324,927,2797,1321,226.436,22.1652,67.8348,99.994
324,325,30625,1052,1451,63.0787,1.94257,88.0574,99.9489
325,326,572,1024,1318,240.348,4.4027,85.5973,99.9971
326,327,877,1252,1317,84.7486,79.359,10.640999999999998,99.9344
327,328,3786,1858,1334,59.0875,3.00254,86.9975,99.9962
328,329,3738,3694,1354,222.245,20.5152,69.4848,99.9806
329,330,1602,1768,1334,44.1562,66.8296,23.1704,99.9985
330,331,2343,3739,1371,225.457,22.0719,67.9281,99.7279
331,332,730,2417,1336,53.2919,53.6744,36.3256,99.9963
332,333,6332,1558,1396,221.677,57.3968,32.6032,99.9968
333,334,58048,2714,1478,230.69,14.7533,75.2467,99.5638
334,335,19665,2184,1417,228.508,43.6852,46.3148,99.9817
335,336,22074,2496,1442,230.86,35.6978,54.3022,89.1179
336,337,3718,3633,1383,193.722,82.6323,7.367669999999999,99.9726
337,338,982,2278,1357,225.386,24.8003,65.1997,99.9988
338,339,984,2330,1359,61.1503,59.6731,30.3269,99.9828
339,340,3579,1808,1378,69.9085,15.9925,74.0075,99.9973
340,341,3109,839,1392,37.0395,49.7441,40.2559,99.9762
341,342,4817,772,1403,208.228,51.7256,38.2744,99.995
342,343,12871,2326,1443,229.886,45.2124,44.7876,99.9958
343,344,681,2293,1387,46.3802,67.6602,22.3398,99.9986
344,345,2201,3339,1409,41.0594,29.5138,60.4862,99.9962
345,346,3889,3684,1429,46.7549,6.93186,83.0681,99.9765
346,347,2180,2075,1423,223.758,23.2749,66.7251,99.9429
347,348,18413,1797,1463,38.2179,69.1895,20.8105,99.9864
348,349,2823,634,1434,229.849,17.9934,72.0066,99.9849
349,350,40497,3138,1524,46.169,22.5342,67.4658,99.2992
350,351,626,3300,1426,218.1,61.1153,28.8847,99.9988
351,352,697,425,1437,53.0071,16.3368,73.6632,99.296
352,353,5994,3075,1457,235.471,37.9197,52.0803,99.9925
353,354,11239,3553,1491,52.567,8.90755,81.0924,99.6942
354,355,4208,3624,1463,95.3698,72.1286,17.8714,99.9846
355,356,789,402,1453,53.5724,16.5244,73.4756,99.8976
356,357,1690,2886,1446,231.056,61.6938,28.3062,99.971
357,358,4484,769,1459,229.53,6.6773,83.3227,99.9423
358,359,9276,2430,1509,72.4296,46.3398,43.6602,99.8614
359,360,5700,3319,1484,74.5731,59.1996,30.8004,99.9727
360,361,11641,2220,1533,226.582,15.3714,74.6286,99.9251
361,362,9523,2880,1529,43.8764,37.9294,52.0706,99.9251
362,363,1666,3728,1500,54.4496,24.02,65.98,99.8196
363,364,10664,3685,1553,50.2361,20.7662,69.2338,99.8003
364,365,10221,1918,1535,53.86,21.6719,68.3281,99.8106
365,366,3171,2360,1519,54.3538,33.1435,56.8565,70.9625
366,367,3995,1199,1542,54.0413,2.64848,87.3515,99.9687
367,368,2224,3351,1531,65.4979,65.165,24.835,99.9251
368,369,2330,423,1560,54.4944,11.2338,78.7662,99.6827
369,370,5281,1138,1568,3.31397,83.8883,6.11169,99.965
370,371,12064,2113,1595,231.829,1.95139,88.0486,99.9921
371,372,11468,2302,1603,231.53,54.6551,35.3449,99.9087
372,373,18371,1845,1616,222.676,41.3531,48.6469,99.7122
373,374,941,3366,1562,224.81,28.7372,61.2628,99.6028
374,375,1438,2387,1566,53.5966,46.8923,43.1077,99.9913
375,376,6300,1035,1596,49.9534,1.6493099999999998,88.3507,99.9528
376,377,123281,1387,1852,230.817,28.3813,61.6187,98.8713
377,378,2583,1407,1577,60.3525,6.24005,83.7599,99.9926
378,379,2790,2028,1577,262.932,62.4095,27.5905,99.9965
379,380,10666,2496,1612,41.7118,2.49213,87.5079,98.0743
380,381,874,2920,1562,48.7967,16.6327,73.3673,99.9907
381,382,20735,3575,1628,65.9432,71.0824,18.9176,99.9449
382,383,1054,3004,1582,226.122,25.7168,64.2832,99.9514
383,384,3874,3207,1594,45.5102,25.6711,64.3289,99.7669
384,385,1625,1975,1609,55.5013,20.7668,69.2332,99.952
385,386,14575,2923,1635,228.737,63.5673,26.4327,99.9675
386,387,652,2694,1600,230.039,48.5946,41.4054,99.9968
387,388,3155,1109,1617,209.795,69.9155,20.0845,99.9842
388,389,1425,434,1607,224.883,4.37096,85.62899999999998,99.4103
389,390,4141,1213,1646,239.867,9.5022,80.4978,99.9474
390,391,4672,2773,1628,274.31,83.4908,6.50917,99.936
391,392,7781,2387,1653,243.224,62.3374,27.6626,99.8965
392,393,892,3133,1631,231.56,39.774,50.226000000000006,99.8667
393,394,563,2209,1613,42.2277,47.5118,42.4882,99.9982
394,395,6729,717,1655,233.311,28.6341,61.3659,99.9867
395,396,2831,1714,1636,78.1211,66.5331,23.4669,99.9482
396,397,2064,2016,1637,230.871,42.1495,47.8505,99.993
397,398,513,3029,1627,59.2723,66.4884,23.5116,99.996
398,399,5626,1766,1670,234.764,4.38192,85.6181,99.9904
399,400,11218,3186,1684,105.61,77.7647,12.2353,99.9802
400,401,1200,2662,1634,233.948,82.8309,7.169110000000001,99.8531
401,402,673,2702,1637,231.542,47.5558,42.4442,99.9886
402,403,1917,2627,1650,52.4559,14.1411,75.8589,99.986
403,404,29695,1122,1716,232.621,12.4152,77.5848,99.9622
404,405,1261,2216,1645,228.822,17.6045,72.3955,99.9977
405,406,57289,2035,1765,54.7995,33.1162,56.8838,67.9334
406,407,1963,410,1653,52.5333,12.9105,77.0895,99.6296
407,408,3947,1589,1665,55.5325,25.5744,64.4256,99.993
408,409,19171,2642,1714,209.306,73.3626,16.6374,99.9918
409,410,5554,3688,1690,221.041,29.9617,60.0383,99.9686
410,411,7243,2795,1694,224.62,55.0556,34.9444,99.9897
411,412,1228,2256,1664,41.67100000000001,31.8257,58.1743,99.9968
412,413,11770,3028,1705,228.625,29.0073,60.9927,99.2192
413,414,875,1681,1670,41.459,29.6239,60.3761,99.986
414,415,28315,670,1788,231.292,17.7751,72.2249,99.9687
415,416,1086,803,1683,234.62,50.9564,39.0436,99.9979
416,417,5986,1313,1706,213.831,66.1847,23.8153,99.9661
417,418,5133,2514,1722,219.842,13.0205,76.9795,99.9746
418,419,742,3510,1698,225.995,37.7202,52.2798,99.8591
419,420,3679,398,1734,61.4283,59.3378,30.6622,99.5078
420,421,1042,3112,1697,236.852,80.8486,9.15135,99.9934
421,422,280164,2237,2048,50.1827,6.42425,83.5758,84.353
422,423,2284,2446,1700,227.779,28.5713,61.4287,99.9657
423,424,3884,1681,1715,78.0367,66.5054,23.4946,99.9621
424,425,1142,826,1701,221.351,63.4059,26.5941,99.9983
425,426,21299,2235,1810,43.0879,60.6103,29.3897,99.94
426,427,4172,3635,1738,50.40600000000001,19.5562,70.4438,99.9922
427,428,3446,751,1724,221.873,54.3679,35.6321,99.9948
428,429,15143,3311,1782,48.5375,14.4869,75.5131,99.9686
429,430,5348,2875,1722,67.3252,84.8665,5.13349,99.9962
430,431,1279,1821,1716,244.376,14.0735,75.9265,99.9985
431,432,1036,3731,1741,238.199,56.5304,33.4696,99.9009
432,433,1264,429,1743,237.215,57.0723,32.9277,99.7906
433,434,52626,3524,1860,56.426,11.4883,78.5117,47.8708
434,435,1046,1760,1734,44.6342,27.8383,62.1617,99.9633
435,436,34194,1822,1850,240.644,4.25002,85.75,98.2816
436,437,1890,541,1743,228.352,56.4361,33.5639,99.9864
437,438,234367,3133,2072,232.213,29.1514,60.8486,90.7151
438,439,23271,1639,1843,231.437,11.5801,78.4199,99.8865
439,440,1065,2990,1766,343.392,84.5196,5.48037,99.9934
440,441,52935,2891,1884,54.6613,48.4223,41.5777,99.955
441,442,1402,3679,1778,227.721,56.8477,33.1523,99.9925
442,443,1991,2775,1774,58.367,42.8531,47.1469,99.9976
443,444,3399,3726,1831,243.977,77.0104,12.9896,99.849
444,445,2590,928,1817,58.6361,41.575,48.425,99.9627
445,446,2244,3417,1808,228.014,55.5795,34.4205,99.9977
446,447,1673,2172,1811,228.958,55.3339,34.6661,99.9993
447,448,1119,2508,1813,236.752,6.37156,83.6284,99.9954
448,449,2807,3660,1828,64.7213,58.2669,31.7331,99.9953
449,450,1263,1710,1818,56.9407,2.65576,87.3442,99.9976
450,451,5797,1178,1851,48.973,20.6664,69.3336,99.9958
451,452,1847,3690,1870,242.49400000000003,75.7483,14.2517,99.9941
452,453,45818,1108,2045,234.82,38.231,51.769,98.7828
453,454,778,894,1856,53.3361,41.3188,48.6812,99.9701
454,455,8377,2091,1897,48.3484,72.7758,17.2242,99.9515
455,456,803,3602,1871,69.0527,54.112,35.88800000000001,99.9972
456,457,1540,1732,1913,227.871,2.82373,87.1763,99.9876
457,458,1159,1036,1892,65.9775,63.0133,26.9867,99.9978
458,459,678,473,1935,225.917,59.7073,30.2927,99.9197
459,460,6122,2616,1956,62.2953,43.5281,46.4719,99.9694
460,461,2011,1686,1937,214.429,45.4802,44.5198,99.9977
461,462,1898,1075,1945,66.0284,3.90331,86.0967,99.9963
462,463,6310,1380,1968,198.653,71.9077,18.0924,99.9862
463,464,2875,1613,1951,230.653,2.01861,87.9814,99.9772
464,465,1141,1950,1949,215.937,57.4288,32.5712,99.9891
465,466,1431,1549,1948,235.275,28.9091,61.0909,99.9958
466,467,16746,1803,2017,219.72,48.7901,41.2099,80.1402
467,468,98924,3501,2219,58.1035,15.3432,74.6568,94.9986
468,469,1151,3732,1978,224.352,62.9279,27.0721,99.9652
469,470,1554,402,1985,64.5004,67.6133,22.3867,99.6944
470,471,817,1239,1973,192.672,71.8877,18.1123,99.996
471,472,1378,1519,1986,225.533,24.3252,65.6748,99.9934
472,473,14312,1674,2037,52.8776,19.9017,70.0983,99.9403
473,474,10633,1554,2040,69.8663,70.2565,19.7435,99.7347
474,475,27161,476,2251,53.8573,28.8424,61.1576,61.08
475,476,17095,2722,2038,51.6555,45.1544,44.8456,50.4538
476,477,5326,1423,2039,218.144,49.6001,40.3999,99.7679
477,478,2390,3729,2036,58.7874,44.8882,45.1118,99.9349
478,479,114701,2432,2269,52.2479,24.6243,65.3757,64.0954
479,480,3814,386,2135,58.8895,66.2554,23.7446,99.7769
480,481,2020,2550,2074,305.323,87.9933,2.00672,99.9967
481,482,1119,1339,2083,46.6809,3.14933,86.8507,99.9853
482,483,3789,1300,2108,206.689,70.8669,19.1331,99.9857
483,484,2700,1384,2092,190.718,73.1107,16.8893,99.9952
484,485,697,1478,2079,56.3764,40.3223,49.6777,99.9685
485,486,12269,2678,2122,231.993,50.0941,39.9059,99.8824
486,487,845,1165,2094,194.564,70.2045,19.7955,99.9968
487,488,605,3717,2094,229.83900000000003,67.2519,22.7481,99.9526
488,489,154280,1501,2359,53.5323,4.8501,85.1499,91.0237
489,490,23337,2827,2228,52.9909,56.7008,33.2992,99.9264
490,491,3573,1747,2134,54.2179,5.48283,84.5172,99.9883
491,492,1350,1633,2117,221.988,20.1273,69.8727,99.9991
492,493,3752,637,2137,229.625,18.9748,71.0252,99.8933
493,494,1739,1578,2125,52.8268,40.9564,49.0436,99.8957
494,495,1529,488,2133,44.8156,18.5124,71.4876,99.9976
495,496,9498,725,2157,84.58,68.2594,21.7406,99.9885
496,497,1275,2526,2117,222.155,38.9835,51.0165,99.995
497,498,4589,1800,2146,50.4624,29.6211,60.3789,99.9723
498,499,1215,1431,2122,223.977,24.1653,65.8347,99.998
499,500,1022,872,2126,56.2702,65.4685,24.5315,99.9967
500,501,658,1840,2126,56.7216,14.1604,75.8396,99.8255
501,502,536,2573,2125,54.858,28.2212,61.7788,99.9904
502,503,3086,1353,2153,235.831,19.2238,70.7762,99.9875
503,504,6404,1685,2157,54.4285,13.0323,76.9677,99.9896
504,505,1017,1389,2148,218.673,25.7178,64.2822,99.9927
505,506,557,1419,2157,46.4834,4.01011,85.9899,99.9722
506,507,28196,785,2229,238.78,39.4899,50.5101,99.9463
507,508,33094,2631,2232,213.7,77.9008,12.0992,99.9602
508,509,840,423,2181,57.8808,65.8368,24.1632,99.9748
509,510,1361,596,2168,80.3293,68.5283,21.4717,99.9865
510,511,3852,3353,2213,225.388,48.2056,41.7944,99.9242
511,512,46906,1049,2287,232.473,25.4926,64.5074,99.6782
512,513,15524,552,2255,228.933,21.1453,68.8547,99.9698
513,514,1235,1309,2180,57.5025,6.52312,83.4769,99.9989
514,515,1194,2768,2181,229.277,18.3431,71.6569,99.9978
515,516,22954,3114,2254,51.5259,3.81145,86.1885,99.9892
516,517,4690,1601,2197,234.922,3.71687,86.2831,99.9767
517,518,4696,618,2220,60.1112,37.865,52.135,99.9987
518,519,801,1759,2201,238.71,0.715508,89.2845,99.9976
519,520,899,1807,2212,224.944,4.06689,85.9331,99.989
520,521,2357,1698,2217,51.3847,32.1886,57.8114,99.9989
521,522,14398,1783,2287,234.387,8.97152,81.0285,99.9902
522,523,2215,1664,2248,71.9228,84.5818,5.41825,99.9956
523,524,1474,3551,2248,208.015,66.9913,23.0087,99.9957
524,525,530,395,2251,51.6865,4.92597,85.074,99.9211
525,526,885,911,2246,234.879,26.1549,63.8451,99.847
526,527,590,3688,2263,215.073,33.7539,56.2461,99.5079
527,528,2889,3618,2268,226.775,7.2054100000000005,82.7946,99.9839
528,529,1580,949,2265,240.852,40.1073,49.8927,99.9939
529,530,826,2238,2276,211.504,60.8511,29.1489,99.9919
530,531,21536,3244,2421,108.938,82.90299999999998,7.096989999999999,99.962
531,532,630,380,2301,81.6107,67.3106,22.6894,99.7441
532,533,5995,3557,2317,240.649,71.9737,18.0263,99.9652
533,534,12500,3650,2348,52.8005,20.882,69.118,99.9942
534,535,33550,2213,2406,232.039,33.9876,56.0124,99.994
535,536,1787,1425,2327,216.63,71.956,18.044,99.8448
536,537,22284,689,2383,50.2727,49.1535,40.8465,99.74
537,538,2165,3160,2326,55.539,8.25129,81.7487,99.9829
538,539,2657,3350,2350,225.791,3.17493,86.8251,99.9954
539,540,2606,3043,2340,63.9952,56.3075,33.6925,99.9977
540,541,3888,2746,2344,180.152,71.185,18.815,99.9968
541,542,718,2823,2337,218.198,84.1666,5.83345,99.9718
542,543,2532,867,2368,213.855,73.5985,16.4015,99.996
543,544,25078,1851,2464,51.2824,73.3562,16.6438,99.8874
544,545,624,827,2345,48.527,45.3913,44.6087,99.9958
545,546,9894,3111,2393,230.368,21.8321,68.1679,99.8438
546,547,2388,432,2393,223.757,47.4605,42.5395,99.985
547,548,3742,952,2387,223.527,54.8767,35.1233,99.9652
548,549,870,1428,2367,55.1289,0.173218,89.8268,99.9758
549,550,183310,2705,2603,233.34,0.703125,89.2969,86.8323
550,551,76392,1073,2518,48.0833,36.3934,53.6066,58.4968
551,552,1788,1178,2386,44.4493,58.0474,31.9526,99.9805
552,553,9430,3673,2428,214.33900000000003,75.2069,14.7931,99.9573
553,554,1925,2017,2382,234.574,44.5148,45.4852,99.9904
554,555,975,2085,2383,209.827,60.58,29.42,99.9978
555,556,8804,839,2444,225.391,72.0781,17.9219,99.9306
556,557,6989,505,2431,237.151,34.2921,55.7079,99.99
557,558,3429,3386,2437,50.2627,44.0068,45.9932,99.9893
558,559,2284,901,2415,226.669,28.2997,61.7003,99.8952
559,560,8691,2075,2447,229.459,10.1467,79.8533,99.9167
560,561,1613,1795,2437,236.655,4.08515,85.9148,99.9935
561,562,618,3126,2433,238.417,52.7301,37.2699,99.9954
562,563,2238,432,2473,223.52,13.2769,76.7231,99.9145
563,564,2995,943,2479,245.427,81.7263,8.27373,99.788
564,565,3976,2519,2487,229.586,23.3656,66.6344,99.9701
565,566,10314,795,2504,231.153,24.1677,65.8323,99.9287
566,567,33279,589,2531,68.4124,83.4854,6.51457,80.8759
567,568,1221,3164,2466,59.0457,10.7483,79.2517,99.9974
568,569,1313,3492,2478,245.393,78.436,11.5641,99.9946
569,570,30144,3639,2565,46.3626,1.00187,88.9981,99.9101
570,571,1220,2348,2471,41.5654,50.9376,39.0624,99.9987
571,572,630,1619,2479,55.5176,86.4268,3.5732,99.9962
572,573,24923,3426,2557,233.073,1.41842,88.5816,99.6182
573,574,16772,3109,2532,115.146,84.6729,5.32712,99.5051
574,575,1184,1279,2503,41.8285,26.1523,63.8477,99.9869
575,576,2697,2273,2508,73.9056,80.9209,9.07906,99.9411
576,577,748,3721,2516,222.607,52.2694,37.7306,99.957
577,578,1300,2841,2546,222.109,50.0278,39.9722,99.9246
578,579,41992,2019,2606,51.6894,8.77132,81.2287,61.1198
579,580,2055,904,2532,223.185,44.1339,45.8661,99.8894
580,581,2775,3221,2552,226.348,76.5484,13.4516,99.6138
581,582,674,408,2540,38.5544,23.79,66.21,99.9654
582,583,2143,1410,2546,224.271,35.9676,54.0324,99.9655
583,584,278668,1550,2963,236.608,3.50026,86.4997,81.2294
584,585,2843,3277,2543,53.6323,18.3359,71.6641,99.9881
585,586,1837,749,2548,217.073,40.17,49.83,99.997
586,587,9183,1545,2598,236.862,49.1133,40.8867,99.9819
587,588,7587,707,2616,59.6909,71.11,18.89,99.9917
588,589,8547,1671,2603,251.175,3.15707,86.8429,99.9858
589,590,6384,821,2586,216.86900000000003,67.4662,22.5338,99.977
590,591,29998,468,2765,58.5855,41.1902,48.8098,86.7357
591,592,1177,3572,2578,228.86,77.9246,12.0754,99.7712
592,593,2856,2062,2605,58.2421,30.4116,59.5884,99.9393
593,594,10779,1818,2611,242.304,3.1316,86.8684,99.9581
594,595,2187,407,2606,54.2722,63.6825,26.3175,99.9823
595,596,13083,3302,2643,57.4839,46.6152,43.3848,99.956
596,597,1223,3181,2595,42.0056,15.4104,74.5896,99.9879
597,598,2506,1743,2610,60.9229,5.63063,84.3694,99.9921
598,599,1536,762,2628,239.669,5.0679,84.9321,99.9979
599,600,24277,2133,2699,229.459,15.5888,74.4112,99.9895
600,601,10423,2775,2646,53.4609,57.8834,32.1166,99.9971
601,602,2833,371,2683,56.1906,64.31,25.69,99.9383
602,603,1200,3063,2599,56.7449,12.6898,77.3102,99.9969
603,604,6340,1333,2646,45.9245,22.3823,67.6177,99.9865
604,605,1623,3134,2618,229.877,24.7192,65.2808,99.9415
605,606,2936,2334,2640,224.72,29.9822,60.0178,99.9883
606,607,59623,719,2761,51.0679,3.1692400000000003,86.8308,99.7559
607,608,1216,1257,2616,235.274,49.6113,40.3887,99.9977
608,609,63066,3524,2756,57.5766,20.0121,69.9879,99.8592
609,610,13022,3063,2677,225.593,78.7457,11.2543,99.9562
610,611,7175,3195,2664,56.6593,65.9751,24.0249,99.9937
611,612,42030,1172,2704,150.23,83.4612,6.53885,99.9449
612,613,4459,1591,2661,246.82,53.06,36.94,99.986
613,614,954,502,2658,201.368,59.0423,30.9577,99.9944
614,615,2932,2544,2675,12.3808,79.863,10.137,99.9963
615,616,956,1503,2657,223.495,40.6276,49.3724,99.986
616,617,31891,1781,2740,53.4753,21.7845,68.2155,99.8323
617,618,14038,2660,2716,49.5284,62.7354,27.2646,99.949
618,619,96602,894,2920,70.3608,83.9236,6.07641,74.7375
619,620,714,1653,2674,54.8094,9.50502,80.495,99.9949
620,621,12902,2273,2728,52.9782,14.4993,75.5007,99.9158
621,622,9751,1535,2734,231.074,72.6923,17.3077,99.9765
622,623,3000,1980,2722,45.1996,70.5561,19.4439,99.9625
623,624,4711,3703,2757,251.567,80.3026,9.69745,99.9507
624,625,18177,578,2778,222.953,6.66166,83.3383,99.9909
625,626,11432,3216,2751,45.4416,36.6302,53.3698,99.9971
626,627,8214,2148,2749,237.373,66.5296,23.4704,99.9969
627,628,33699,3303,2850,229.21400000000003,8.53833,81.4617,99.9468
628,629,12591,2554,2773,225.866,7.9184199999999985,82.0816,99.9769
629,630,4392,2755,2754,227.755,8.88313,81.1169,99.9945
630,631,2853,3111,2759,94.8522,80.2767,9.72329,99.9227
631,632,4386,2414,2774,38.5401,80.2642,9.73583,99.9875
632,633,47076,1905,2893,65.5269,54.5385,35.4615,99.9318
633,634,905,1152,2774,65.822,64.9801,25.0199,99.9984
634,635,8970,1194,2837,50.243,70.2084,19.7917,99.968
635,636,11907,416,2913,228.648,39.8155,50.1845,99.9405
636,637,689,2286,2785,65.4056,60.4452,29.5548,99.9457
637,638,4034,2859,2801,46.8615,21.5724,68.4276,99.9164
638,639,2961,2359,2814,223.265,6.35307,83.6469,99.9933
639,640,1121,2787,2803,54.2859,15.0957,74.9043,99.9773
640,641,19460,3139,2877,57.6275,49.1387,40.8613,99.995
641,642,155131,2559,3057,228.821,40.9405,49.0595,89.6546
642,643,1242,1277,2811,231.378,35.699,54.301,99.9982
643,644,31743,2304,2920,67.4546,53.8032,36.1968,99.9125
644,645,9304,2462,2858,213.621,66.851,23.149,73.3993
645,646,5990,1061,2851,63.3449,57.7441,32.2559,99.9974
646,647,4954,2131,2835,55.7596,17.9038,72.0962,99.9395
647,648,3811,1129,2842,68.8839,66.4038,23.5962,99.9963
648,649,4348,2016,2858,49.2847,74.5608,15.4392,99.9866
649,650,1218,2735,2822,56.2673,59.5186,30.4814,99.999
650,651,7335,3679,2861,45.6949,19.6836,70.3164,99.9936
651,652,2738,1302,2867,48.9811,48.1544,41.8456,99.9729
652,653,6586,2871,2932,199.989,61.3364,28.6636,99.9957
653,654,29335,2156,2947,113.113,74.7085,15.2915,99.9604
654,655,1525,1351,2870,235.427,34.847,55.153,99.9971
655,656,44410,584,2984,227.498,21.5109,68.4891,98.6338
656,657,705,902,2867,223.102,60.8851,29.1149,99.9919
657,658,247762,2826,3294,234.64,25.6198,64.3802,81.5596
658,659,2764,3386,2894,53.761,20.6122,69.3878,99.9898
659,660,6391,3633,2927,46.3826,19.7944,70.2056,99.9949
660,661,2419,1804,2904,230.351,4.13212,85.8679,99.9982
661,662,26780,1077,3011,230.483,24.0885,65.9115,99.8387
662,663,1569,3442,2911,57.0161,65.9774,24.0226,99.9759
663,664,17993,3547,3000,56.2784,11.2014,78.7986,99.9731
664,665,41161,3410,3099,51.3577,5.32408,84.6759,99.9577
665,666,1756,3390,2961,57.7701,69.6594,20.3406,99.969
666,667,5196,2366,2992,209.247,65.6333,24.3667,99.9161
667,668,29944,3181,3031,42.6758,73.0154,16.9846,99.567
668,669,19414,3649,3076,222.036,14.1269,75.8731,99.9581
669,670,4471,3335,3010,51.6141,13.5229,76.4771,99.9857
670,671,543,2808,3008,66.9921,56.6354,33.3646,99.9588
671,672,994,3488,3026,53.4674,57.6162,32.3838,99.9971
672,673,10996,2070,3114,52.3137,6.73262,83.2674,99.9
673,674,94907,536,3388,185.623,83.8731,6.12692,41.89100000000001
674,675,612,2120,3062,228.098,25.3774,64.6226,99.5689
675,676,11406,2201,3113,51.3181,20.7507,69.2493,99.9877
676,677,2522,2318,3088,50.6003,57.2928,32.7072,99.9743
677,678,2109,669,3097,64.7293,20.035,69.965,99.9956
678,679,1395,3123,3095,64.6987,4.96951,85.0305,99.9969
679,680,13479,2667,3132,45.0157,7.423889999999999,82.5761,99.8904
680,681,2535,585,3100,61.0954,43.3674,46.6326,99.9969
681,682,725,521,3090,226.09,75.4552,14.5448,99.9986
682,683,674,2327,3102,224.673,26.9832,63.0168,99.9807
683,684,11975,1438,3164,64.40899999999999,66.116,23.884,99.9596
684,685,31795,1131,3195,57.4214,3.67007,86.3299,99.9632
685,686,1033,2340,3125,64.05199999999999,52.7585,37.2415,99.9944
686,687,2373,3148,3132,49.8651,10.7331,79.2669,99.9631
687,688,1218,537,3120,69.2973,55.4904,34.5096,99.9806
688,689,2087,762,3133,47.31800000000001,67.8479,22.1521,99.9967
689,690,49725,1694,3304,48.5658,44.4977,45.5023,99.966
690,691,8465,606,3153,223.182,79.0477,10.9523,99.9409
691,692,632,2223,3129,50.6777,5.11031,84.8897,99.9806
692,693,43412,3302,3264,73.8298,79.7383,10.2617,99.6061
693,694,4127,3512,3176,224.624,67.5894,22.4106,99.99
694,695,22155,924,3217,52.3752,23.926,66.074,82.7464
695,696,2605,822,3166,204.41,85.1186,4.8814199999999985,99.9891
696,697,1082,2311,3158,46.5787,56.6145,33.3855,99.9994
697,698,30451,683,3254,68.7588,55.7976,34.2024,99.6623
698,699,2473,3582,3179,223.769,22.6941,67.3059,99.9992
699,700,8447,2130,3207,224.775,68.5782,21.4218,99.9828
700,701,3903,2270,3197,50.735,56.5394,33.4606,99.8391
701,702,1410,3687,3193,44.9829,13.7144,76.2856,99.9861
702,703,5118,780,3200,56.6345,46.8014,43.1986,99.9968
703,704,4055,3104,3205,59.2149,1.4739799999999998,88.52600000000002,99.9984
704,705,2240,1267,3226,54.9296,17.5947,72.4053,99.9607
705,706,11941,2632,3235,57.6665,49.265,40.735,99.9868
706,707,27852,1937,3307,53.4315,8.389610000000001,81.6104,99.395
707,708,1751,2069,3219,50.4084,17.0354,72.9646,99.9631
708,709,3401,3531,3232,240.912,59.1727,30.8273,99.974
709,710,4555,3613,3226,224.407,55.8524,34.1476,99.9965
710,711,7853,1349,3247,203.12,58.2297,31.7703,99.8144
711,712,1284,2198,3215,230.377,44.6305,45.3695,99.9837
712,713,1046,510,3224,225.586,26.9247,63.0753,99.9956
713,714,3784,2015,3239,231.11,67.4959,22.5041,99.9894
714,715,1155,1535,3227,57.5055,48.0636,41.9364,99.9935
715,716,8139,3479,3282,232.234,19.2666,70.7334,83.8734
716,717,3248,1038,3272,233.588,11.7335,78.2665,99.9961
717,718,3003,1490,3246,51.389,30.5522,59.4478,99.9002
718,719,6086,3173,3266,46.0495,10.5646,79.4354,100.0
719,720,2183,3685,3256,241.337,60.771,29.229,99.9877
720,721,4263,2226,3278,54.4441,1.90057,88.0994,99.9742
721,722,1410,2175,3250,232.961,48.9693,41.0307,99.9945
722,723,5002,1824,3270,49.1914,1.46643,88.5336,99.9874
723,724,5833,987,3288,46.0863,68.9223,21.0777,99.995
724,725,754,2845,3252,62.6412,76.6241,13.3759,99.9943
725,726,125379,1287,3494,215.646,42.7087,47.2913,61.3537
726,727,2843,3404,3267,57.9463,7.81705,82.18299999999998,99.9908
727,728,5400,834,3293,223.117,38.0527,51.9473,99.9975
728,729,8946,3658,3320,243.975,48.2357,41.7643,99.9806
729,730,580,1569,3259,52.9814,74.5588,15.4412,99.9976
730,731,2232,384,3291,245.987,72.5829,17.4171,99.7548
731,732,8808,522,3305,58.0432,67.7414,22.2586,99.9784
732,733,23380,1240,3326,74.1484,48.5505,41.4495,99.9506
733,734,4164,2075,3292,230.915,49.9192,40.0808,99.9445
734,735,1299,2261,3270,63.8534,58.1231,31.8769,99.9978
735,736,1096,1496,3279,57.4711,49.1094,40.8906,99.9928
736,737,3131,1779,3300,202.013,74.8327,15.1673,99.9837
737,738,15895,2100,3368,238.908,20.5554,69.4446,99.9448
738,739,10764,1568,3335,49.8958,2.5493900000000003,87.4506,99.9982
739,740,3664,656,3320,231.577,48.6249,41.3751,99.9979
740,741,22346,2274,3369,41.9633,20.5023,69.4977,99.8641
741,742,18344,3562,3372,241.972,14.6457,75.3543,99.992
742,743,922,1667,3308,200.776,74.195,15.805,99.9886
743,744,2391,603,3331,71.9909,55.6251,34.3749,99.9586
744,745,17550,3233,3411,59.7556,2.0696,87.9304,99.9084
745,746,1126,405,3345,58.1261,48.7167,41.2833,99.6095
746,747,1126,2627,3335,49.5105,5.63068,84.3693,99.9989
747,748,7822,1065,3373,214.033,58.933,31.067,99.9539
748,749,786,372,3351,241.739,72.0479,17.9521,99.7854
749,750,8516,861,3373,204.169,62.0056,27.9944,99.9675
750,751,82131,916,3583,75.0202,77.6177,12.3823,80.5356
751,752,4245,1144,3392,229.359,33.3861,56.6139,99.9978
752,753,960,1839,3384,212.698,75.0976,14.9024,99.9625
753,754,3545,2550,3409,61.3659,48.6946,41.3054,99.9965
754,755,513,394,3378,49.3614,46.4695,43.5305,99.916
755,756,27808,1926,3465,124.549,74.885,15.115,99.8885
756,757,7951,1627,3442,52.4906,7.454439999999999,82.5456,99.9981
757,758,6024,394,3432,50.0782,47.4911,42.5089,99.6713
758,759,32934,3374,3487,227.42,60.8546,29.1454,99.9367
759,760,21177,3647,3500,236.197,0.0964813,89.9035,99.954
760,761,45632,2230,3504,230.527,3.32925,86.6708,99.3454
761,762,24201,3074,3491,42.8034,5.18385,84.8162,99.9376
762,763,908,2508,3450,68.2765,75.0703,14.9297,99.9945
763,764,1261,2585,3453,9.72882,78.5071,11.4929,99.9813
764,765,815,3723,3475,239.315,0.580299,89.4197,99.9389
765,766,2111,3543,3477,71.7134,63.4167,26.5833,99.9273
766,767,880,2543,3473,237.35,8.9664,81.0336,99.9954
767,768,1139,2976,3476,72.1596,59.107,30.893,99.9818
768,769,807,3159,3496,52.539,38.7799,51.2201,99.9922
769,770,3429,2592,3498,222.86900000000003,65.2274,24.7726,99.9525
770,771,582,1293,3487,62.212,36.0285,53.9715,99.9947
771,772,916,1594,3498,71.1171,71.7556,18.2444,99.9946
772,773,7706,1493,3536,58.8912,35.2498,54.7502,99.9703
773,774,53540,1661,3604,232.314,23.8884,66.1116,99.9806
774,775,28635,3255,3623,15.9664,76.0772,13.9228,99.8716
775,776,3255,895,3508,53.252,67.875,22.125,99.9555
776,777,348458,1993,3989,56.1066,40.1989,49.8011,75.5237
777,778,31764,2880,3611,39.4689,87.7692,2.23081,99.8378
778,779,12962,3514,3563,59.8201,62.2925,27.7075,99.8507
779,780,1703,956,3552,51.5962,24.6729,65.3271,99.9786
780,781,3129,368,3563,74.9893,59.2,30.8,99.711
781,782,887,1391,3546,54.9342,28.5059,61.4941,99.9943
782,783,6433,673,3573,51.581,50.883,39.117,99.9534
783,784,209152,2458,4025,236.233,13.0788,76.9212,66.5115
784,785,756,787,3566,68.822,71.6623,18.3377,99.9907
785,786,6412,1475,3635,55.2262,12.2337,77.7663,77.9956
786,787,5495,3033,3594,15.5822,76.1098,13.8902,99.9833
787,788,12933,573,3631,228.068,73.34899999999998,16.651,99.9008
788,789,3427,3654,3617,242.563,57.3269,32.6731,99.9621
789,790,7290,1385,3651,43.6229,35.8701,54.1299,99.9926
790,791,543,2538,3592,50.5408,16.3497,73.6503,99.9894
791,792,5211,2587,3622,220.582,59.5545,30.4455,99.9981
792,793,609,3370,3596,242.41,61.8909,28.1091,99.997
793,794,1446,745,3614,65.984,73.1264,16.8736,99.9894
794,795,39638,3507,3682,228.928,11.1664,78.8336,99.9837
795,796,228134,717,3974,52.875,3.12353,86.8765,44.0591
796,797,537,3100,3611,56.2258,41.011,48.989,99.9961
797,798,2696,368,3642,227.861,35.8079,54.1921,99.3035
798,799,80736,2641,3775,59.7781,17.7124,72.2876,99.9818
799,800,11341,1135,3682,52.7824,50.9085,39.0915,99.8444
800,801,779,3141,3623,56.1689,34.6173,55.3827,99.9972
801,802,7198,2987,3696,63.95,39.8257,50.1743,99.9822
802,803,4979,709,3653,37.8911,70.319,19.681,99.9989
803,804,11941,3062,3702,45.5365,1.47697,88.523,99.9973
804,805,13940,3163,3719,65.6998,52.6233,37.3767,99.9968
805,806,2480,1840,3660,51.4709,3.78637,86.2136,99.9955
806,807,18927,686,3723,220.705,47.0582,42.9418,99.9032
807,808,1390,3686,3687,248.354,58.8458,31.1542,99.9172
808,809,11297,1495,3713,213.169,58.4548,31.5452,99.9651
809,810,1047,786,3679,49.3522,49.4618,40.5382,99.9773
810,811,27129,2954,3791,68.9369,58.7838,31.2162,99.9398
811,812,2135,2195,3745,63.4124,36.3033,53.6967,99.9873
812,813,4859,3389,3735,59.7119,58.5133,31.4867,99.9982
813,814,1680,3344,3747,50.3775,23.4892,66.5108,99.9915
814,815,9089,3278,3778,60.2683,58.3686,31.6314,99.9945
815,816,4622,1102,3778,234.675,5.59116,84.4088,99.7922
816,817,3398,3700,3767,176.865,80.5355,9.46446,99.9268
817,818,5686,1216,3758,52.0214,32.1099,57.8901,99.9962
818,819,1990,980,3752,74.4695,57.2242,32.7758,99.9979
819,820,56196,1341,3861,48.5115,49.6007,40.3993,60.0992
820,821,12462,635,3781,66.3362,65.7346,24.2653,99.9795
821,822,941,1434,3747,45.8367,35.1683,54.8317,99.9753
822,823,1239,1636,3740,56.0708,17.8291,72.1709,99.9748
823,824,4553,3651,3785,181.047,79.8117,10.1883,99.9579
824,825,4348,2825,3822,220.146,73.3805,16.6195,99.9921
825,826,5643,2228,3790,68.2277,15.7193,74.2807,99.5943
826,827,588,366,3755,235.676,41.9327,48.0673,99.898
827,828,4792,1022,3793,50.6822,50.7792,39.2208,99.9231
828,829,13208,1611,3801,55.9799,65.125,24.875,99.9291
829,830,1876,3607,3787,237.093,61.6391,28.3609,99.9884
830,831,582,1479,3769,53.3,20.1414,69.8586,99.987
831,832,14851,834,3834,48.4921,6.96074,83.0393,99.9919
832,833,1345,362,3791,220.863,32.749,57.25100000000001,99.7094
833,834,1039,1457,3797,53.1465,71.5563,18.4437,99.8917
834,835,8720,3387,3821,219.769,48.8779,41.1221,99.8183
835,836,3867,1498,3825,51.6423,12.5114,77.4886,99.7413
836,837,5773,3525,3816,69.867,36.7694,53.2306,99.9913
837,838,1425,3202,3812,56.2007,32.4509,57.5491,99.9841
838,839,1326,1189,3814,237.266,5.81156,84.1884,99.9858
839,840,3331,631,3837,69.1485,59.2943,30.7057,99.9994
840,841,10924,3122,3876,219.996,13.8442,76.1558,99.9155
841,842,1131,360,3840,223.294,57.0908,32.9092,99.6609
842,843,3566,2106,3846,227.874,48.9265,41.0735,99.9988
843,844,4609,3575,3860,57.4508,33.9797,56.0203,99.9952
844,845,33936,1645,3924,54.0478,18.374,71.626,99.8878
845,846,1482,2270,3846,261.273,67.3208,22.6792,99.9992
846,847,2289,3647,3858,65.6799,45.8218,44.1782,99.9961
847,848,10765,3252,3884,61.7807,85.6481,4.35188,99.9417
848,849,32439,3490,3994,230.522,33.555,56.445,99.9552
849,850,1369,2872,3868,60.0098,18.9992,71.0008,99.988
850,851,10063,2965,3896,63.2841,13.9425,76.0575,99.9495
851,852,1329,3697,3872,223.527,30.8241,59.1759,99.7774
852,853,17678,3354,3945,66.2854,43.3548,46.6452,99.9877
853,854,11864,3580,3954,69.83800000000001,37.0798,52.9202,99.9843
854,855,27952,1110,3966,46.3631,36.3491,53.6509,99.9914
855,856,2651,2820,3900,224.584,73.8651,16.1349,99.9948
856,857,79205,2786,4039,221.92,56.2681,33.7319,94.105
857,858,1121,3657,3911,53.4574,20.9721,69.0279,99.9928
858,859,1833,3706,3942,222.201,29.1934,60.8066,99.7864
859,860,2154,1322,3939,47.416,36.4172,53.5828,99.9884
860,861,44108,3088,4070,49.3402,27.2864,62.7136,99.8771
861,862,8868,2578,3982,51.1792,10.4235,79.5765,99.9897
862,863,11038,3659,4008,217.412,38.4967,51.5033,79.4753
863,864,2503,3230,3955,60.7922,27.648000000000003,62.352,99.9976
864,865,812,3144,3961,323.836,83.751,6.24904,99.9591
865,866,102461,1384,4216,170.266,82.2671,7.732939999999998,53.1658
866,867,13602,1747,4019,318.4770000000001,87.0809,2.91913,99.7088
867,868,7873,1545,4024,225.216,36.9299,53.0701,99.493
868,869,924,3184,3973,49.4094,26.0007,63.9993,99.9961
869,870,6047,1467,4029,48.9269,11.6163,78.3837,99.9617
870,871,5708,3233,4018,218.394,39.8103,50.1897,99.9531
871,872,8259,1786,4088,54.1976,16.9277,73.0723,99.8271
872,873,3911,3304,4044,51.3298,67.3563,22.6437,99.8496
873,874,8221,3357,4078,62.9475,74.4125,15.5875,99.8248
874,875,2084,352,4073,38.6773,28.3251,61.6749,99.9005
875,876,1837,1837,4065,31.2392,48.4818,41.5182,99.9872
876,877,22336,1661,4146,51.7292,25.9883,64.0117,99.8669
877,878,3868,724,4097,53.228,33.855,56.145,99.9967
878,879,6065,3241,4105,51.6953,64.9269,25.0731,99.9966
879,880,3106,1498,4115,48.4328,40.9039,49.0961,99.9636
880,881,4917,3592,4121,52.6181,10.3254,79.6746,99.9905
881,882,640,1203,4096,60.4214,55.2859,34.7141,99.9952
882,883,8386,583,4134,55.3966,37.6876,52.3124,99.9132
883,884,1043,384,4119,38.355,28.9324,61.0676,99.9791
884,885,3465,1558,4123,229.392,35.2302,54.7698,99.9994
885,886,109861,2890,4309,48.066,59.31,30.69,97.9364
886,887,42018,3344,4205,229.361,29.1151,60.8849,99.9337
887,888,1454,3465,4126,52.8075,11.8236,78.1764,99.9901
888,889,4312,2569,4166,56.0942,7.5863,82.4137,99.9733
889,890,7640,1194,4169,45.1153,46.3076,43.6924,99.9944
890,891,1410,2915,4147,222.267,62.4647,27.5353,99.9711
891,892,2661,1126,4160,47.5748,15.6937,74.3063,99.9966
892,893,1665,2507,4158,221.114,81.3205,8.67953,99.9859
893,894,1649,3653,4154,54.0838,16.8392,73.1608,99.9834
894,895,11609,729,4197,215.959,76.0878,13.9122,99.9233
895,896,16996,438,4323,69.2547,79.3403,10.6597,74.443
896,897,9517,3542,4197,41.256,63.4075,26.5925,99.9941
897,898,7364,484,4207,223.925,14.704,75.296,99.9686
898,899,9291,1519,4202,227.933,50.9566,39.0434,99.995
899,900,43467,641,4307,223.691,41.3038,48.6962,99.9012
900,901,792,3635,4185,54.8781,37.3213,52.6787,99.9855
901,902,539,359,4187,63.0187,44.809,45.191,99.884
902,903,53002,1210,4314,49.1949,5.58327,84.4167,99.9798
903,904,857,2295,4191,214.552,36.6776,53.3224,99.9989
904,905,15760,2281,4236,64.9513,63.7808,26.2192,99.9351
905,906,1012,1082,4203,214.177,77.9055,12.0945,99.9974
906,907,5537,511,4267,55.0262,36.6593,53.3407,99.9969
907,908,770,3692,4212,230.707,40.7778,49.2222,99.9561
908,909,10563,3148,4269,52.412,13.4707,76.5293,99.947
909,910,3816,3622,4236,228.593,13.1088,76.8912,99.9711
910,911,92989,889,4405,58.9795,70.3529,19.6471,67.7999
911,912,2175,364,4237,58.3729,43.4374,46.5626,99.7289
912,913,3789,1656,4235,37.6145,46.5567,43.4433,99.9777
913,914,7507,1068,4280,41.2849,22.4516,67.5484,99.9081
914,915,609,1611,4252,54.0918,16.4892,73.5108,99.9987
915,916,64280,2278,4388,227.532,29.5898,60.4102,99.8774
916,917,6450,1698,4295,239.923,48.5746,41.4254,99.9952
917,918,31898,3587,4375,56.9412,14.2827,75.7173,96.355
918,919,6525,1767,4365,38.7091,49.8432,40.1568,99.8353
919,920,934,763,4273,55.1248,37.9792,52.0208,99.9899
920,921,4189,3481,4311,55.2261,16.7051,73.2949,99.4054
921,922,2317,3054,4302,217.272,62.8615,27.1385,99.8273
922,923,17852,3251,4347,47.1484,1.65207,88.3479,99.9942
923,924,16263,3397,4385,217.081,62.3995,27.6005,99.9119
924,925,1628,2112,4305,122.186,82.1811,7.81889,99.9973
925,926,536,473,4305,67.3324,41.9446,48.0554,99.9937
926,927,35294,1610,4422,230.226,31.5045,58.4955,99.9661
927,928,8253,3110,4360,207.054,77.3144,12.6856,99.9925
928,929,3926,375,4363,227.013,78.0814,11.9186,99.8562
929,930,1750,463,4355,56.8774,63.6228,26.3772,99.9977
930,931,1721,1258,4376,55.207,44.2137,45.7863,99.9953
931,932,776,3343,4374,45.8612,21.4976,68.5024,99.9907
932,933,1059,2504,4389,222.602,50.1365,39.8635,99.9936
933,934,2038,1294,4415,44.9976,1.7245400000000002,88.2755,99.9962
934,935,3369,3691,4432,58.7378,25.3424,64.6576,99.9411
935,936,1670,562,4400,46.5453,19.7014,70.2986,99.9961
936,937,992,353,4422,237.856,20.1423,69.8577,99.8562
937,938,945,599,4410,45.4791,25.1052,64.8948,99.9963
938,939,2482,648,4419,227.409,26.5989,63.4011,99.9902
939,940,10270,3299,4444,40.1149,67.8699,22.1301,99.9679
940,941,7127,3162,4437,51.2482,10.6072,79.3928,99.9608
941,942,2303,1049,4434,56.0854,43.5616,46.4384,99.9785
942,943,1905,3484,4438,223.802,61.49800000000001,28.502,99.965
943,944,31223,1294,4512,237.442,66.0517,23.9483,72.102
944,945,7123,2521,4453,223.129,49.6647,40.3353,99.9857
945,946,54521,2225,4545,230.74,14.7374,75.2626,77.4526
946,947,23621,2608,4525,224.544,18.9127,71.0873,92.0485
947,948,36520,1693,4557,217.847,82.7492,7.25085,70.6508
948,949,2950,1804,4455,49.8251,13.8425,76.1575,99.9849
949,950,1046,698,4441,48.1419,25.0592,64.9408,99.981
950,951,16734,552,4485,184.702,86.6388,3.36115,99.9471
951,952,3946,1873,4461,90.1474,78.4825,11.5175,99.9963
952,953,25261,3533,4531,230.838,3.9465,86.0535,84.4944
953,954,5171,3099,4498,51.7562,33.8624,56.1376,99.9933
954,955,3383,417,4480,221.58900000000003,59.505,30.495,99.8701
955,956,8806,2749,4511,48.6622,23.6857,66.3143,99.9896
956,957,3889,2814,4488,237.598,23.6793,66.3207,99.9351
957,958,4899,1116,4481,48.4383,43.0834,46.9166,99.9933
958,959,815,663,4473,228.28,72.0423,17.9577,99.9875
959,960,14650,3168,4546,65.7711,81.4845,8.51548,60.8303
960,961,774,2388,4497,120.849,83.0981,6.90194,99.9912
961,962,734,3608,4504,234.519,3.70881,86.2912,99.9877
962,963,3639,1871,4520,38.5873,68.4387,21.5613,99.9488
963,964,25119,3298,4592,216.821,69.4399,20.5601,99.6729
964,965,692,351,4521,56.8729,40.6303,49.3697,99.8025
965,966,853,3700,4529,226.645,13.9521,76.0479,99.8819
966,967,24384,640,4593,228.393,30.0939,59.9061,99.8435
967,968,820,3014,4520,231.238,66.6994,23.3006,99.9567
968,969,4968,411,4557,213.032,28.6472,61.3528,99.6046
969,970,10392,1089,4573,226.306,10.515999999999998,79.484,99.9613
970,971,6566,1495,4546,49.7109,35.3908,54.6092,99.9821
971,972,1102,2843,4537,219.3,77.0929,12.9071,99.7041
972,973,1647,2959,4546,40.858,27.8353,62.1647,99.9619
973,974,27032,2933,4647,250.627,64.4944,25.5056,58.9675
974,975,19703,477,4657,202.949,76.2497,13.7503,97.7849
975,976,3216,2670,4579,34.3389,53.9023,36.0977,99.9965
976,977,5899,1271,4585,45.2533,27.8981,62.1019,99.9584
977,978,7666,983,4596,63.1853,11.3926,78.6074,99.8798
978,979,8416,2828,4607,54.3506,0.383751,89.6162,99.9361
979,980,23767,1873,4697,44.503,10.6196,79.3804,58.2958
980,981,6824,893,4622,228.679,17.4313,72.5687,49.4865
981,982,5060,2046,4595,50.4653,31.1044,58.8956,99.9828
982,983,5619,1833,4588,224.21400000000003,7.21445,82.7855,99.9534
983,984,5271,2734,4597,232.816,25.5186,64.4814,99.856
984,985,15494,1169,4669,49.1902,8.73477,81.2652,99.9709
985,986,4806,829,4614,239.135,3.00089,86.9991,99.9977
986,987,1174,466,4594,57.5646,9.8912,80.1088,99.997
987,988,1367,2408,4598,55.7726,43.2082,46.7918,99.9337
988,989,30693,3408,4704,55.0771,51.9904,38.0096,99.9695
989,990,20573,1449,4657,226.299,42.3767,47.6233,98.0027
990,991,1178,3679,4605,53.3877,34.3882,55.6118,99.9004
991,992,736,778,4604,47.7141,27.3116,62.6884,99.9968
992,993,1387,3634,4612,49.4202,33.4011,56.5989,99.9927
993,994,1243,2215,4612,224.014,21.9618,68.0382,99.9974
994,995,3346,1302,4615,42.3674,61.9216,28.0784,99.9898
995,996,1940,3163,4614,231.018,73.0895,16.9105,99.9697
996,997,4130,3533,4623,62.6651,72.4348,17.5652,99.9962
997,998,7676,2508,4647,55.8997,47.9031,42.0969,99.9107
998,999,5451,3036,4633,244.522,64.3516,25.6484,99.8969
999,1000,1343,3593,4627,52.9632,39.9986,50.0014,99.9961
1000,1001,11167,1983,4679,219.633,0.5474399999999999,89.4526,99.9941
1001,1002,809,2363,4623,231.144,45.9699,44.0301,99.9944
1002,1003,523,2673,4624,221.125,3.10516,86.8948,99.9955
1003,1004,2262,2743,4642,63.7023,47.2725,42.7275,99.9878
1004,1005,4004,1829,4648,223.197,35.8835,54.1165,99.997
1005,1006,31139,2410,4764,222.546,24.3441,65.6559,84.2491
1006,1007,8985,986,4681,212.978,52.5108,37.4892,99.9982
1007,1008,3860,2342,4665,224.316,59.0819,30.9181,99.8446
1008,1009,40632,2682,4747,236.399,24.9521,65.0479,99.9378
1009,1010,1449,770,4649,218.376,29.1045,60.8955,99.9952
1010,1011,614,3122,4644,240.413,63.4601,26.5399,99.9358
1011,1012,20411,2234,4708,233.566,77.4294,12.5706,99.981
1012,1013,7423,609,4688,50.3291,13.0903,76.9097,99.7521
1013,1014,4389,1757,4672,219.405,23.6584,66.3416,99.9873
1014,1015,5720,3656,4674,231.751,1.12396,88.876,99.7545
1015,1016,18100,1300,4712,48.1898,37.9043,52.0957,99.998
1016,1017,2840,3164,4675,45.5822,34.8167,55.1833,99.9913
1017,1018,10091,2087,4728,224.893,45.9066,44.0934,99.923
1018,1019,12570,3574,4718,226.981,27.1222,62.8778,99.9293
1019,1020,2789,1059,4686,55.8479,21.5536,68.4464,99.996
1020,1021,9973,887,4710,225.952,36.5466,53.4534,99.9412
1021,1022,13146,1659,4707,228.111,1.17717,88.8228,99.9978
1022,1023,777,1525,4666,58.9065,63.3121,26.6879,99.9914
1023,1024,830,358,4681,219.886,46.2928,43.7072,99.7103
1024,1025,3684,725,4692,50.9685,5.57811,84.4219,99.9816
1025,1026,1133,2050,4683,30.3906,66.8527,23.1473,99.9975
1026,1027,78573,3099,4849,59.0188,35.3688,54.6312,99.9152
1027,1028,738,1563,4681,53.0045,8.54771,81.4523,99.9958
1028,1029,7039,3027,4705,218.019,34.3246,55.6754,99.9646
1029,1030,12105,467,4800,222.293,14.0554,75.9446,97.8788
1030,1031,612,1491,4682,42.6554,62.0551,27.9449,99.9868
1031,1032,2673,3279,4703,50.8175,15.0501,74.9499,99.9983
1032,1033,1693,1526,4704,42.5727,21.0955,68.9045,99.985
1033,1034,521,397,4720,217.404,41.3212,48.6788,99.973
1034,1035,580,1088,4703,229.634,37.0725,52.9275,99.9964
1035,1036,648,780,4708,53.3193,33.2476,56.7524,99.9979
1036,1037,972,3226,4708,49.3435,61.8046,28.1954,99.9919
1037,1038,1821,2519,4714,62.6082,66.3169,23.6831,99.9978
1038,1039,3950,1586,4746,59.5298,67.5709,22.4291,99.9983
1039,1040,980,806,4726,53.0102,3.75589,86.2441,99.9992
1040,1041,1167,712,4732,51.4595,33.8163,56.1837,99.8542
1041,1042,34735,1215,4817,49.7855,22.9046,67.0954,99.5868
1042,1043,15218,575,4815,195.277,73.2188,16.7812,99.9382
1043,1044,1987,3665,4738,232.467,27.315,62.685,99.9515
1044,1045,3250,3515,4768,49.4029,12.7689,77.2311,99.967
1045,1046,1326,871,4759,231.327,79.5621,10.4379,99.9616
1046,1047,6920,1520,4772,220.632,28.7504,61.2496,99.9888
1047,1048,1520,771,4757,228.823,36.4902,53.5098,99.9944
1048,1049,3525,1396,4769,227.517,26.2704,63.7296,99.9477
1049,1050,2674,1741,4770,48.8399,70.1484,19.8516,99.9769
1050,1051,9876,2541,4800,58.9456,34.2016,55.7984,99.8172
1051,1052,1292,2961,4754,240.322,72.2472,17.7528,99.9974
1052,1053,1738,3689,4776,48.3983,37.9837,52.0163,99.9615
1053,1054,33311,1942,4868,50.5677,1.57877,88.4212,91.6375
1054,1055,1865,827,4767,223.785,37.11,52.89,99.9907
1055,1056,1582,406,4802,227.272,14.1317,75.8683,99.7984
1056,1057,8379,720,4804,225.766,41.1257,48.8743,99.9957
1057,1058,5199,2899,4785,52.6903,20.1931,69.8069,99.9868
1058,1059,518,2814,4766,224.44,27.2353,62.7647,99.9965
1059,1060,955,373,4769,223.555,21.8355,68.1645,99.8043
1060,1061,6642,646,4828,55.8205,17.4163,72.5837,99.9791
1061,1062,5600,2167,4798,80.907,79.0932,10.9068,99.9794
1062,1063,6444,3314,4797,224.205,67.6678,22.3322,99.9969
1063,1064,700,936,4775,225.225,3.7904,86.2096,99.9879
1064,1065,8459,1018,4818,219.312,29.3513,60.6487,99.9584
1065,1066,1285,3576,4788,40.7609,40.1976,49.8024,99.9795
1066,1067,13433,2231,4860,227.354,19.0003,70.9997,99.8672
1067,1068,16289,1679,4849,49.2896,68.999,21.001,99.9955
1068,1069,1769,1457,4801,87.6024,76.2864,13.7136,99.9957
1069,1070,2718,2868,4826,59.9294,42.8473,47.1527,99.9468
1070,1071,10190,883,4855,53.9507,24.6286,65.3714,99.9782
1071,1072,6729,807,4831,193.067,71.3705,18.6295,99.999
1072,1073,2799,1574,4823,40.0198,25.2894,64.7106,99.9735
1073,1074,13588,2091,4859,223.343,8.240839999999999,81.7592,99.9836
1074,1075,12920,3494,4844,226.732,66.3588,23.6412,99.9701
1075,1076,5857,2817,4862,51.2499,18.8905,71.1095,99.9868
1076,1077,2675,1786,4816,50.9131,10.8963,79.1037,99.9651
1077,1078,551,364,4809,49.3505,63.9562,26.0438,99.9381
1078,1079,4650,3651,4831,237.594,19.5679,70.4321,99.9542
1079,1080,3305,1154,4851,39.8995,0.905067,89.0949,99.9966
1080,1081,26241,1433,4903,222.739,13.0579,76.9421,99.9002
1081,1082,12341,3356,4920,52.6703,22.0226,67.9774,99.9008
1082,1083,627,359,4837,30.823,19.2351,70.7649,99.8377
1083,1084,30424,2471,4916,48.4921,43.4517,46.5483,64.7728
1084,1085,800,1601,4843,223.36900000000003,13.5927,76.4073,99.9954
1085,1086,23053,1769,4927,222.24400000000003,12.1419,77.8581,99.9951
1086,1087,3805,2720,4872,63.5118,32.2534,57.7466,99.9607
1087,1088,24980,988,4928,39.9397,15.8657,74.1343,82.7227
1088,1089,12878,1155,4928,48.277,74.1702,15.8298,99.9408
1089,1090,4505,2286,4882,232.126,28.3607,61.6393,99.9926
1090,1091,6661,482,4902,220.506,37.809,52.191,99.948
1091,1092,1000,696,4871,188.754,73.9326,16.0674,99.9967
1092,1093,22237,3551,4934,234.936,21.0512,68.9488,98.4068
1093,1094,1051,3381,4879,53.4576,21.3803,68.6197,99.9855
1094,1095,2053,400,4893,226.774,42.7105,47.2895,99.9185
1095,1096,3438,379,4921,42.4013,15.1703,74.8297,99.8348
1096,1097,8817,1582,4919,218.946,30.4654,59.5346,99.9489
1097,1098,2279,3689,4927,45.847,40.9138,49.0862,99.8994
1098,1099,3129,2885,4900,61.3839,28.468000000000004,61.532,99.9888
1099,1100,845,3630,4880,215.823,68.2109,21.7891,99.9938
1100,1101,3266,745,4897,233.016,26.0048,63.9952,99.9977
1101,1102,13943,2630,4954,230.99,18.9798,71.0202,99.9975
1102,1103,1491,821,4917,46.3247,10.527,79.473,99.9917
1103,1104,2273,663,4920,50.9437,33.2297,56.7703,99.9759
1104,1105,5519,2043,4941,227.001,18.5122,71.4878,99.9714
1105,1106,6144,2755,4949,49.6081,18.8357,71.1643,99.9499
1106,1107,7985,3292,4956,232.87,65.7689,24.2311,99.9894
1107,1108,6710,2837,4956,55.0302,34.0699,55.9301,99.9879
1108,1109,1991,2302,4936,177.143,80.1282,9.87177,99.9926
1109,1110,7037,787,4960,233.312,6.6569600000000015,83.34299999999998,99.8492
1110,1111,757,712,4940,54.0412,32.7623,57.2377,99.9345
1111,1112,4828,472,4967,43.8629,62.5277,27.4723,99.8739
1112,1113,9882,605,4962,222.479,15.4626,74.5374,99.771
1113,1114,837,3677,4936,228.003,67.2554,22.7446,99.9814
1114,1115,10546,2169,4968,229.394,1.93763,88.0624,99.9045
1115,1116,3683,1402,4979,54.4957,29.8384,60.1616,99.9101
1116,1117,2613,2958,4976,231.076,9.43929,80.5607,99.9931
1117,1118,3841,1255,4977,47.7368,8.816410000000003,81.1836,99.99
1118,1119,532,3173,4969,304.776,85.0367,4.96329,99.9988
1119,1120,3185,2310,4980,231.227,55.9758,34.0242,99.9973
1120,1121,3630,1561,4983,56.7336,61.9272,28.0728,99.9909
1121,1122,1220,2908,4980,228.219,15.4305,74.5695,99.7366
1122,1123,2203,2012,4987,44.9527,62.0256,27.9744,99.9774
1123,1124,835,2714,4986,205.092,75.9544,14.0456,99.9836
1124,1125,1129,3506,4985,124.518,82.0816,7.9184,99.9977
1125,1126,1391,1829,4988,223.231,25.2491,64.7509,99.9977
1126,1127,1260,3203,4988,228.159,66.1355,23.8645,99.9984
1127,1128,915,2509,4988,238.489,23.4057,66.5943,99.9926
1128,1129,1385,394,4989,50.8832,47.6367,42.3633,99.8649
1129,1130,1095,1656,4991,36.7063,70.3494,19.6506,99.9925
1130,1131,557,3043,4993,232.396,9.08389,80.9161,99.9954
