,Grain No.,Size [Pixel],center x-coordinate,center y-coordinate,mean azimuth [degree],mean latitude [degree],mean colatitude [degree],Regelungsgrad [%]
0,1,30862,2437,173,143.373,25.3714,64.6286,99.2555
1,2,902,2552,63,331.519,24.8677,65.1323,99.8401
2,3,1890,2736,59,144.804,24.0823,65.9177,99.8354
3,4,3538,2871,68,139.79,31.9123,58.0877,99.9442
4,5,39423,2638,198,313.242,42.105,47.895,99.9272
5,6,17552,2995,134,143.203,6.81272,83.1873,99.5545
6,7,5094,2310,105,148.963,2.8033,87.1967,99.8281
7,8,597,2281,65,122.751,67.0658,22.9342,99.9113
8,9,6090,3103,107,138.627,54.5148,35.4852,99.9481
9,10,39281,3338,129,136.766,33.3565,56.6435,98.1502
10,11,10254,1505,118,329.88699999999994,48.2739,41.7261,99.7994
11,12,16118,1996,107,125.889,56.4058,33.5942,99.8129
12,13,3132,768,90,140.235,3.8838,86.1162,99.8659
13,14,867,1871,85,323.399,20.688,69.312,99.9515
14,15,2880,448,102,319.435,16.3483,73.6517,99.9298
15,16,2018,359,100,148.665,12.2547,77.7453,98.6506
16,17,2305,1723,82,135.744,6.31607,83.6839,99.8394
17,18,1272,1610,84,137.338,29.9115,60.0885,99.9771
18,19,12617,959,137,322.249,28.3026,61.6974,99.9312
19,20,107713,1216,389,148.376,8.49527,81.5047,73.3132
20,21,834,870,86,139.19,50.5013,39.4987,99.9367
21,22,799,1186,88,32.4007,80.1808,9.81919,99.9875
22,23,1792,2374,105,126.893,67.1309,22.8691,99.9849
23,24,34167,2173,174,138.493,47.9299,42.0701,99.9406
24,25,3637,255,104,330.956,51.3316,38.6684,99.9604
25,26,4490,2807,105,324.132,73.6588,16.3412,99.8164
26,27,1473,1044,94,321.089,14.5625,75.4375,99.8881
27,28,10777,1840,147,319.724,53.655,36.345,99.9871
28,29,654,647,96,142.843,14.9615,75.0385,99.4586
29,30,88087,514,293,144.412,29.3502,60.6498,96.0048
30,31,8729,1725,132,322.033,0.8435819999999999,89.1564,99.9754
31,32,11478,134,145,135.683,17.8857,72.1143,99.9438
32,33,5029,2742,142,322.619,1.77078,88.2292,99.986
33,34,2569,771,139,139.597,9.49682,80.5032,99.971
34,35,1032,1054,117,323.15,15.0913,74.9087,99.683
35,36,61581,1068,282,321.228,4.20555,85.7944,98.3783
36,37,2167,371,140,140.013,44.5926,45.4074,99.9915
37,38,4483,697,141,324.915,14.2758,75.7242,99.998
38,39,1368,853,137,321.201,10.4687,79.5313,99.8459
39,40,601,798,118,324.082,13.9463,76.0537,99.9937
40,41,915,2903,128,133.516,31.9537,58.0463,99.9898
41,42,38842,1685,243,142.886,9.66357,80.3364,99.681
42,43,1156,234,146,141.964,34.2499,55.7501,99.9522
43,44,1795,281,156,140.334,42.4122,47.5878,99.6398
44,45,1349,1371,153,31.6958,81.4571,8.542910000000001,99.986
45,46,17328,2860,228,319.4790000000001,74.0387,15.9613,99.3224
46,47,2175,791,182,323.193,9.57925,80.4207,98.5021
47,48,2836,2348,188,160.299,87.3048,2.69515,99.9911
48,49,2233,222,189,323.486,74.863,15.137,99.9834
49,50,33178,787,288,144.238,5.245419999999998,84.7546,98.993
50,51,12722,1456,217,143.482,3.39889,86.6011,99.9452
51,52,36282,1886,324,334.663,86.4195,3.58048,99.673
52,53,35963,3053,274,141.134,3.73682,86.2632,99.2626
53,54,2573,1539,204,141.359,34.6865,55.3135,99.9595
54,55,674,3199,189,142.465,42.2508,47.7492,99.9672
55,56,4159,3258,197,138.843,42.4801,47.5199,99.9688
56,57,17142,2014,271,133.64,37.3949,52.6051,99.7545
57,58,1167,3406,214,109.979,80.9335,9.06646,99.9903
58,59,710,264,198,143.96,45.227,44.773,99.9958
59,60,1670,3320,221,114.383,82.7243,7.27575,99.9702
60,61,20353,335,310,134.084,62.6283,27.3717,99.8904
61,62,2045,3369,220,117.988,81.1702,8.829839999999997,99.9739
62,63,27582,154,307,323.066,16.5197,73.4803,99.3147
63,64,1754,184,219,136.68,13.3456,76.6544,99.987
64,65,16691,875,308,322.23,33.698,56.302,99.9331
65,66,2253,270,243,320.968,14.8973,75.1027,99.9709
66,67,1560,214,260,324.693,4.07849,85.9215,99.6551
67,68,37501,2156,359,144.752,22.8941,67.1059,99.8429
68,69,55679,3254,421,143.058,5.28694,84.7131,98.6691
69,70,13908,3429,362,21.8628,81.2066,8.79345,99.9682
70,71,5790,1568,292,298.93,82.8087,7.19129,99.9747
71,72,2385,1435,288,327.805,47.1507,42.8493,99.9884
72,73,9473,2573,313,142.388,38.8209,51.1791,99.8273
73,74,531,815,257,325.216,8.28927,81.7107,99.9952
74,75,4204,766,304,326.652,6.51517,83.4848,99.7112
75,76,556,2474,281,139.253,47.4608,42.5392,99.9221
76,77,3625,3353,332,131.099,53.6786,36.3214,99.9779
77,78,9512,1385,397,146.24,33.0545,56.9455,99.5733
78,79,10621,2771,344,320.7940000000001,26.1968,63.8032,99.958
79,80,10345,2423,363,322.31,57.9056,32.0944,99.857
80,81,6327,2316,351,119.113,84.1746,5.82544,99.9709
81,82,1684,1052,321,325.129,24.197,65.803,99.973
82,83,17350,2520,427,148.195,19.6624,70.3376,98.8765
83,84,12566,1561,380,143.161,36.9646,53.0354,99.4804
84,85,1118,439,329,331.889,23.7364,66.2636,99.9686
85,86,1779,3175,339,330.153,18.0194,71.9806,96.6214
86,87,2752,2640,350,327.94699999999995,54.2417,35.7583,99.9904
87,88,106957,3028,606,146.694,0.783836,89.2162,98.7628
88,89,2074,2870,356,321.709,17.8311,72.1689,99.9899
89,90,1381,3493,387,19.8302,81.262,8.73798,99.9343
90,91,936,1463,374,331.96,49.2076,40.7924,99.9855
91,92,3747,1692,390,320.357,30.276,59.724,99.8448
92,93,763,426,376,139.374,70.0057,19.9943,99.988
93,94,16423,641,447,329.605,19.1704,70.8296,99.923
94,95,3963,2656,413,147.3,57.2379,32.7621,99.9762
95,96,1116,566,404,317.111,8.67269,81.3273,99.9733
96,97,5258,2795,413,310.576,40.7226,49.2774,99.9818
97,98,16375,225,456,137.977,49.6137,40.3863,99.8351
98,99,7888,343,435,321.492,27.5172,62.4828,99.725
99,100,5505,1728,439,143.597,63.1339,26.8661,99.9701
100,101,3505,2715,434,323.067,30.3531,59.6469,99.9861
101,102,536,963,401,128.36,76.6625,13.3375,99.988
102,103,12691,1499,460,321.651,22.0186,67.9814,99.9677
103,104,958,2040,431,348.5,86.60799999999998,3.392,99.9601
104,105,7058,2366,451,146.97899999999996,3.21545,86.7846,99.9571
105,106,963,1240,420,125.137,79.6177,10.3823,99.9897
106,107,5517,2284,445,145.48,36.4052,53.5948,99.9584
107,108,3345,2213,464,318.622,56.532,33.468,99.9756
108,109,4586,778,450,326.645,4.24487,85.7551,99.8967
109,110,10656,1653,489,326.501,32.4043,57.5957,99.789
110,111,13325,1915,484,324.296,5.873480000000002,84.1265,99.9839
111,112,4268,2468,472,135.101,38.2311,51.7689,99.9663
112,113,5933,124,480,341.954,80.1368,9.86324,99.5259
113,114,696,1391,452,312.8520000000001,28.6319,61.3681,99.9919
114,115,6847,2778,491,325.084,53.19300000000001,36.807,99.8385
115,116,888,1298,467,140.061,27.8608,62.1392,99.9592
116,117,4206,2652,486,322.035,0.266884,89.7331,99.9858
117,118,12078,812,535,325.742,20.4221,69.5779,99.9329
118,119,7447,1788,515,142.644,17.9444,72.0556,99.9683
119,120,2990,1436,503,138.079,10.1639,79.8361,99.9579
120,121,99986,2059,677,144.097,1.1253,88.8747,96.5049
121,122,1134,3222,484,324.788,14.5256,75.4744,99.8745
122,123,580,3492,494,18.8928,81.3897,8.61032,99.9699
123,124,2000,2581,506,149.483,76.694,13.306,99.9438
124,125,11615,2287,552,140.36700000000002,32.3896,57.6104,99.8933
125,126,599,3431,491,321.889,15.5792,74.4208,99.9922
126,127,8725,2397,538,143.642,38.4315,51.5685,99.8341
127,128,1685,3088,514,325.349,21.4362,68.5638,99.9827
128,129,6412,705,538,329.9890000000001,42.8028,47.1972,99.836
129,130,29226,521,670,322.375,33.0631,56.9369,99.5134
130,131,35386,177,672,325.399,8.95861,81.0414,99.0724
131,132,3957,3229,544,322.91,72.7999,17.2001,99.8397
132,133,2459,3042,543,139.97799999999998,68.6573,21.3427,99.3885
133,134,1979,357,526,163.857,87.3681,2.63188,99.9881
134,135,10240,3399,595,149.72,21.3985,68.6015,98.3384
135,136,1295,597,535,46.3943,83.4437,6.55625,99.9947
136,137,1476,102,533,129.361,64.8726,25.1274,99.9949
137,138,1731,1610,534,325.759,5.57185,84.4282,99.7759
138,139,4289,2706,586,346.831,80.5787,9.42131,99.6044
139,140,1187,939,540,317.782,16.8848,73.1152,99.8032
140,141,10404,1380,577,131.231,36.2515,53.7485,99.924
141,142,21172,1650,635,141.813,34.8284,55.1716,99.7752
142,143,519,899,545,138.846,13.0595,76.9405,99.9716
143,144,1533,2640,540,334.84,18.8123,71.1877,98.8253
144,145,2359,298,552,141.109,1.87167,88.1283,99.9774
145,146,25038,2766,691,324.521,20.5262,69.4738,99.8286
146,147,36526,1501,733,144.083,10.9579,79.0421,98.0678
147,148,12337,3310,656,148.25,22.1931,67.8069,98.6838
148,149,2824,1852,566,334.155,62.1158,27.8842,99.9879
149,150,4797,1698,581,324.7270000000001,15.7837,74.2163,99.977
150,151,2096,138,580,341.6880000000001,80.5179,9.48214,99.9688
151,152,1492,388,565,145.246,66.5444,23.4556,99.9938
152,153,1533,1245,567,126.476,36.2231,53.7769,99.9711
153,154,1679,1923,567,317.306,29.546,60.45399999999999,99.9836
154,155,569,2575,556,334.014,17.157,72.843,99.8223
155,156,1349,89,573,323.78,3.19372,86.8063,99.9668
156,157,821,2838,567,325.757,3.37362,86.6264,99.7887
157,158,1116,1446,579,324.817,42.3439,47.6561,99.9934
158,159,2913,2645,585,141.845,9.42958,80.5704,99.9907
159,160,10776,945,627,350.71,79.0994,10.9006,99.9573
160,161,8297,616,617,141.20600000000005,12.5471,77.4529,99.9871
161,162,5148,333,603,146.42600000000004,48.2021,41.7979,99.7927
162,163,5508,2421,615,331.876,43.0591,46.9409,99.9852
163,164,13833,2554,658,330.584,36.5801,53.4199,99.7891
164,165,724,866,585,142.995,0.06657410000000001,89.9334,99.9893
165,166,881,2996,596,160.876,29.0042,60.9958,99.8949
166,167,8885,289,653,144.293,20.4467,69.5533,99.914
167,168,4071,3490,642,139.857,5.85044,84.1496,99.8927
168,169,2842,2488,601,326.641,27.2931,62.7069,99.9443
169,170,878,2041,604,343.611,29.1085,60.8915,99.9894
170,171,807,1851,602,321.612,35.2614,54.7386,99.7518
171,172,577,843,606,134.745,30.4987,59.5013,99.9179
172,173,1237,1232,619,113.163,83.809,6.1909800000000015,99.9928
173,174,2789,1051,619,146.023,17.7563,72.2437,99.9981
174,175,6105,1150,629,325.291,14.612,75.388,99.1772
175,176,551,2739,616,149.95,10.8947,79.1053,99.9973
176,177,948,1745,634,146.29,52.0616,37.9384,99.9496
177,178,1737,740,642,317.661,54.5018,35.4982,99.9817
178,179,3143,802,642,138.615,41.1777,48.8223,99.9947
179,180,1578,2365,645,327.367,28.7964,61.2036,99.6566
180,181,1374,1893,627,138.572,22.3342,67.6658,99.7574
181,182,616,2815,628,152.1,1.64893,88.3511,98.5643
182,183,4169,424,663,149.891,14.3786,75.6214,99.98
183,184,5127,1834,659,326.795,2.58281,87.4172,99.6234
184,185,3952,687,668,0.293308,75.3099,14.6901,99.9702
185,186,9208,2646,678,141.69299999999996,21.2614,68.7386,99.9657
186,187,2517,3415,647,318.518,42.1924,47.8076,99.9663
187,188,822,2487,647,323.711,21.8612,68.1388,99.9604
188,189,748,863,649,322.243,27.0215,62.9785,99.9195
189,190,3173,2297,657,328.266,23.1883,66.8117,99.9893
190,191,1875,2846,664,145.05700000000004,14.9951,75.0049,99.9573
191,192,31661,1201,703,140.906,11.7072,78.2928,99.6381
192,193,4891,2895,696,139.42600000000002,14.2033,75.7967,99.9894
193,194,4512,392,713,324.664,36.4252,53.5748,99.9145
194,195,39534,2429,764,141.55100000000004,13.4058,76.5942,99.4247
195,196,511,1344,670,129.797,49.7567,40.2433,99.9825
196,197,4566,739,709,13.5289,82.1782,7.82177,99.9755
197,198,12321,918,725,148.376,21.5879,68.4121,99.961
198,199,525,852,680,336.684,67.3505,22.6495,99.9869
199,200,14996,1636,776,328.059,47.2279,42.7721,99.8421
200,201,2602,805,703,322.89,52.8094,37.1906,99.9949
201,202,3999,3436,725,320.2990000000001,40.5077,49.4923,99.9364
202,203,646,635,691,145.31,42.6275,47.3725,99.9813
203,204,1433,2990,717,326.05,26.1784,63.8216,99.7587
204,205,1165,1429,726,148.981,81.0143,8.9857,99.9587
205,206,604,3487,729,318.944,41.463,48.537,99.9509
206,207,2615,2275,756,150.322,27.9597,62.0403,99.9549
207,208,1622,3259,729,322.835,15.9823,74.0177,99.9968
208,209,8680,649,791,145.238,16.0642,73.9358,99.9534
209,210,2955,1385,747,139.14600000000002,2.7511400000000004,87.2489,99.9968
210,211,9661,752,790,318.2920000000001,47.5188,42.4812,99.9764
211,212,2336,92,771,132.98,37.0924,52.9076,99.9888
212,213,605,1575,748,145.536,73.2683,16.7317,99.9929
213,214,751,797,748,144.513,53.1866,36.8134,99.9731
214,215,9581,2209,811,343.088,62.49800000000001,27.502,99.951
215,216,590,3520,749,322.19,4.52796,85.47200000000002,99.9065
216,217,1166,2631,763,219.66,80.077,9.92301,99.9625
217,218,24582,1185,877,135.191,73.7423,16.2577,99.6718
218,219,4724,1729,788,134.731,5.63695,84.3631,99.9994
219,220,1136,959,761,319.483,19.1425,70.8575,99.9888
220,221,35461,400,865,142.22899999999996,23.1738,66.8262,99.8304
221,222,660,1144,761,132.094,36.8634,53.1366,99.9951
222,223,774,3215,775,325.06,19.3313,70.6687,99.8385
223,224,2390,2684,796,331.625,30.7261,59.2739,99.7962
224,225,4452,1054,789,129.871,36.4454,53.5546,99.8205
225,226,1227,3331,769,320.778,12.0683,77.9317,99.9866
226,227,11462,1970,834,329.935,33.1923,56.8077,99.9396
227,228,22172,1304,873,134.259,47.8177,42.1823,99.8882
228,229,1277,1410,785,319.559,39.069,50.931,99.9856
229,230,44577,3333,887,323.5440000000001,1.93872,88.0613,98.3736
230,231,1445,292,791,8.825389999999997,85.1257,4.8743300000000005,99.9965
231,232,1815,585,798,317.603,48.6689,41.3311,99.9598
232,233,2177,985,804,137.266,5.35616,84.6438,99.9959
233,234,24449,157,857,321.626,21.8497,68.1503,99.671
234,235,3655,3268,809,117.098,79.6126,10.3874,99.9273
235,236,26166,2991,884,328.214,26.6117,63.3883,99.7537
236,237,4568,904,821,324.558,39.5917,50.4083,99.9656
237,238,3673,3023,830,331.872,57.2318,32.7682,99.9121
238,239,10001,1768,854,323.121,27.568,62.432,99.8625
239,240,978,849,820,145.399,38.198,51.802,99.9968
240,241,505,1896,813,141.217,10.6126,79.3874,99.9432
241,242,1646,3208,832,328.869,61.0635,28.9365,99.9873
242,243,1708,3087,832,336.273,62.2475,27.7525,99.8953
243,244,2248,497,830,138.219,15.3887,74.6113,99.95
244,245,1359,3141,827,119.609,70.8204,19.1796,99.9875
245,246,1184,2565,827,318.531,44.7193,45.2807,99.9945
246,247,14418,572,880,335.916,60.2576,29.7424,99.9752
247,248,9090,2787,852,140.345,24.6254,65.3746,99.9754
248,249,2485,2306,842,129.381,54.1289,35.8711,99.9772
249,250,1024,1045,833,143.127,46.0851,43.9149,99.9737
250,251,5322,789,857,321.021,30.0002,59.9998,98.7222
251,252,43114,955,956,141.119,19.521,70.479,99.7391
252,253,10103,1890,889,326.795,55.609,34.391,99.9649
253,254,1701,2592,865,320.747,20.7016,69.2984,99.9882
254,255,3210,1087,869,144.112,52.4275,37.5725,99.9785
255,256,780,2542,860,355.829,73.5895,16.4105,99.9485
256,257,1325,2475,891,3.07323,77.6417,12.3583,99.9183
257,258,510,1675,873,333.712,5.5906400000000005,84.4094,99.7095
258,259,736,2254,867,157.638,65.1775,24.8225,99.9637
259,260,583,2426,871,144.02200000000005,32.3262,57.6738,99.9607
260,261,4797,693,902,134.986,54.5323,35.4677,99.9787
261,262,15287,2311,951,323.585,23.0404,66.9596,99.9868
262,263,502,2506,882,150.82399999999996,36.9081,53.0919,99.9975
263,264,15088,2700,939,318.6090000000001,43.5751,46.4249,99.9352
264,265,58985,1438,992,319.485,9.86185,80.1382,99.8344
265,266,23816,2150,965,323.436,8.44271,81.5573,99.9888
266,267,637,2204,882,144.778,18.2246,71.7754,99.9976
267,268,525,2317,887,159.36700000000005,65.7347,24.2653,99.9854
268,269,668,2799,905,120.991,52.7147,37.2853,99.9819
269,270,29109,1797,980,172.02700000000004,73.908,16.092,99.3293
270,271,7462,2859,950,125.67,51.7391,38.2609,99.8906
271,272,18094,275,971,133.386,40.1233,49.8767,99.5737
272,273,774,2405,910,10.509,79.9601,10.0399,99.9685
273,274,18291,777,987,331.271,7.15865,82.8413,95.4985
274,275,1414,3508,924,140.847,19.6644,70.3356,99.864
275,276,639,3166,916,328.797,61.5935,28.4065,99.9901
276,277,3427,2560,949,145.17,62.2362,27.7638,99.9211
277,278,5091,2016,960,315.889,28.6963,61.3037,99.9795
278,279,986,2388,952,152.506,44.226000000000006,45.774,99.8808
279,280,7235,2472,973,154.05100000000004,39.6788,50.3212,99.5128
280,281,965,172,948,188.031,81.5768,8.423160000000001,99.9963
281,282,1231,1659,954,142.79399999999995,56.3529,33.6471,99.95
282,283,4288,3005,967,136.205,28.2907,61.7093,99.8817
283,284,1511,3452,956,147.732,52.477,37.523,99.9819
284,285,865,2944,972,324.208,14.5684,75.4316,99.9922
285,286,3780,678,978,330.219,57.2508,32.7492,99.9419
286,287,4460,99,979,152.92600000000004,23.7196,66.2804,99.7989
287,288,644,3379,968,140.31799999999998,15.300999999999998,74.699,99.8999
288,289,8888,587,1009,142.704,42.1722,47.8278,99.8822
289,290,2981,432,991,325.302,6.56308,83.4369,99.9662
290,291,3343,3061,1000,330.506,66.8998,23.1002,99.987
291,292,6548,281,1026,138.813,11.0355,78.9645,99.9086
292,293,1770,3505,1004,137.239,32.5363,57.4637,99.7763
293,294,2269,490,1008,137.577,37.0452,52.9548,99.7776
294,295,4365,1949,1024,145.57299999999995,9.42397,80.57600000000002,99.9155
295,296,3916,3432,1015,320.207,51.011,38.989,99.9696
296,297,18435,2318,1078,320.058,47.5471,42.4529,99.3997
297,298,16873,3192,1041,322.903,45.1158,44.8842,98.6255
298,299,1178,2582,1001,321.048,9.004010000000003,80.99600000000002,99.9892
299,300,5490,2803,1050,333.531,44.8763,45.1237,99.4602
300,301,1362,1647,1005,143.569,9.65993,80.3401,99.9814
301,302,719,45,1013,136.77200000000002,62.0827,27.9173,99.8145
302,303,5823,3349,1041,135.73,34.2005,55.7995,99.7144
303,304,28368,1107,1095,321.644,31.6849,58.3151,99.9767
304,305,28754,2606,1083,326.842,33.6348,56.3652,99.797
305,306,5390,2029,1051,333.865,52.1744,37.8256,99.8244
306,307,23268,2958,1094,143.356,4.2673,85.7327,83.1359
307,308,2788,423,1040,149.25799999999995,45.1187,44.8813,99.8287
308,309,18283,1674,1094,323.872,1.0518,88.9482,99.6919
309,310,2501,144,1055,320.153,9.03587,80.9641,99.9771
310,311,1953,1593,1053,125.459,55.1708,34.8292,99.7599
311,312,517,861,1041,329.885,2.69266,87.3073,99.9651
312,313,2221,2099,1052,128.751,62.3827,27.6173,99.4129
313,314,1446,804,1052,319.698,36.1104,53.8896,99.9898
314,315,1030,1189,1046,340.819,87.0629,2.93712,99.983
315,316,1772,66,1058,143.409,18.6821,71.3179,98.9969
316,317,2433,324,1069,149.982,21.6845,68.3155,99.7808
317,318,630,438,1057,326.078,1.55322,88.4468,99.9428
318,319,1625,3512,1078,319.999,6.650930000000002,83.3491,99.8142
319,320,1202,562,1062,136.472,40.9496,49.0504,99.9902
320,321,622,2455,1056,318.712,46.5655,43.4345,99.8663
321,322,3089,192,1076,144.31,46.0339,43.9661,99.9711
322,323,33685,1895,1173,129.438,66.5788,23.4212,99.7909
323,324,2397,869,1083,323.913,43.3467,46.6533,99.9878
324,325,1975,526,1081,125.961,68.4564,21.5436,99.981
325,326,32107,715,1169,141.791,24.4583,65.5417,99.93
326,327,1334,1204,1081,131.644,61.8902,28.1098,99.9913
327,328,12286,416,1117,138.906,13.0874,76.9126,99.9338
328,329,3334,2167,1095,162.21,73.7624,16.2376,99.9478
329,330,2452,3402,1097,130.671,50.544,39.456,99.9176
330,331,1811,1545,1094,148.343,42.9733,47.0267,99.9136
331,332,2850,3445,1113,127.366,46.9071,43.0929,99.9623
332,333,38435,2503,1191,148.355,15.3062,74.6938,96.8253
333,334,894,3062,1107,330.3830000000001,47.7679,42.2321,99.706
334,335,19995,3345,1166,145.07299999999995,20.7935,69.2065,99.6685
335,336,1106,1788,1095,144.596,3.73691,86.2631,99.9958
336,337,1692,248,1099,141.424,53.3545,36.6455,99.9929
337,338,912,575,1097,140.336,36.9804,53.0196,99.9976
338,339,4712,2750,1130,135.757,49.6438,40.3562,99.9818
339,340,1399,112,1117,135.984,78.5786,11.4214,99.9677
340,341,2759,1252,1126,315.863,0.393913,89.6061,99.9918
341,342,9644,3183,1141,326.515,13.1186,76.8814,99.969
342,343,30073,517,1215,324.334,45.6031,44.3969,99.9675
343,344,758,2113,1107,338.788,49.2092,40.7908,99.9829
344,345,4914,2856,1143,131.382,47.6273,42.3727,99.6011
345,346,2073,1444,1125,313.2920000000001,41.0785,48.9215,99.9849
346,347,4136,2042,1137,323.6790000000001,2.18024,87.8198,99.9877
347,348,127253,969,1346,319.958,13.5048,76.4952,98.4083
348,349,1133,535,1130,332.19699999999995,12.0069,77.9931,99.9775
349,350,1770,149,1138,143.423,66.7946,23.2054,99.9625
350,351,5228,1357,1142,318.0490000000001,0.057876599999999986,89.9421,99.9986
351,352,873,1281,1149,126.321,58.8261,31.1739,99.8236
352,353,14736,2132,1188,139.909,7.505619999999999,82.4944,99.7909
353,354,141604,432,1427,323.122,5.29511,84.7049,97.864
354,355,1651,1553,1158,333.275,69.3587,20.6413,99.8873
355,356,34464,1445,1235,313.527,56.559,33.441,99.9108
356,357,117091,3214,1343,148.525,41.6786,48.3214,99.6897
357,358,4753,1740,1175,314.18,79.4513,10.5487,99.9843
358,359,1301,54,1166,329.9530000000001,47.0568,42.9432,99.8864
359,360,7881,2894,1197,139.696,36.9579,53.0421,98.8019
360,361,3014,3494,1179,319.164,4.7729,85.2271,99.2097
361,362,1430,1021,1180,141.187,76.0157,13.9843,99.9377
362,363,12835,2289,1192,328.856,65.5108,24.4891,99.9512
363,364,9851,1647,1210,323.567,54.1205,35.8795,99.9663
364,365,2953,380,1196,330.041,12.2836,77.7164,99.9836
365,366,4932,2756,1208,16.3289,70.4471,19.5529,99.9082
366,367,1451,135,1184,336.589,82.5761,7.423889999999999,99.9798
367,368,8898,1145,1235,325.471,2.99807,87.0019,99.9205
368,369,18829,2013,1249,144.116,18.6974,71.3026,99.9883
369,370,4434,1226,1230,142.411,72.9253,17.0747,99.9752
370,371,6033,305,1231,141.586,31.7383,58.2617,99.9909
371,372,1770,3233,1225,321.291,25.4269,64.5731,99.7204
372,373,2036,73,1222,328.334,47.9089,42.0911,99.8197
373,374,20620,1780,1278,141.19899999999996,4.28752,85.7125,99.9896
374,375,63364,2770,1344,142.314,9.864,80.13600000000002,99.5006
375,376,766,1571,1234,143.371,63.463,26.537,99.9824
376,377,3312,2198,1253,320.844,49.6766,40.3234,99.9967
377,378,940,2794,1238,355.4480000000001,73.4715,16.5285,99.9894
378,379,2296,1614,1257,314.326,56.0507,33.9493,99.9906
379,380,19825,2348,1320,320.756,50.3884,39.6116,99.9603
380,381,3126,3507,1288,128.085,76.3505,13.6495,99.942
381,382,1444,113,1274,353.814,85.3553,4.64473,99.9726
382,383,22501,1270,1347,130.937,52.901,37.099,99.968
383,384,1144,2871,1268,311.2990000000001,9.6553,80.3447,99.9674
384,385,3160,2243,1326,141.404,62.2952,27.7048,99.976
385,386,198965,2203,1561,140.77100000000004,1.97889,88.0211,98.1423
386,387,846,1647,1308,321.861,36.7819,53.2181,99.9756
387,388,53221,1403,1431,132.226,48.07899999999999,41.92100000000001,99.802
388,389,520,390,1314,145.414,10.7638,79.2362,99.7814
389,390,21238,2593,1407,322.367,44.7264,45.2736,99.9743
390,391,685,1678,1321,240.096,85.1376,4.86238,99.993
391,392,2546,1175,1340,143.75799999999995,59.8814,30.1186,99.9691
392,393,1010,2467,1330,135.539,65.362,24.638,99.9789
393,394,7012,1602,1373,317.466,36.6513,53.3487,99.984
394,395,10305,637,1397,329.18300000000005,54.2622,35.7378,99.9734
395,396,1500,1661,1364,323.9290000000001,51.3849,38.6151,99.9942
396,397,672,47,1348,155.342,67.6682,22.3318,99.9823
397,398,2628,143,1366,181.168,69.1402,20.8598,99.9235
398,399,28112,1769,1455,210.436,86.6135,3.38645,99.5667
399,400,2923,2920,1386,2.28771,81.9386,8.0614,99.9706
400,401,1809,2473,1372,140.469,2.65042,87.3496,99.9885
401,402,584,180,1377,327.386,54.4468,35.5532,99.9697
402,403,938,2206,1380,323.516,49.9769,40.0231,99.9876
403,404,1233,62,1378,330.184,55.3955,34.6045,99.8087
404,405,14258,871,1424,160.68,70.4072,19.5928,99.9606
405,406,5324,3442,1422,142.75,39.6172,50.3828,99.8883
406,407,1239,2445,1411,323.693,37.743,52.257,99.9792
407,408,767,47,1413,333.1140000000001,52.4052,37.5948,99.5593
408,409,3093,1648,1432,329.624,40.3167,49.6833,99.9965
409,410,15729,2520,1512,137.35399999999998,46.6186,43.3814,99.4567
410,411,703,100,1417,325.706,56.0591,33.9409,99.9351
411,412,18545,200,1515,318.736,49.555,40.445,99.9273
412,413,34423,745,1585,144.75799999999995,18.0584,71.9416,99.5969
413,414,3998,3082,1458,328.426,38.154,51.846,99.9732
414,415,3050,946,1464,294.935,75.5598,14.4402,99.9752
415,416,2091,2940,1453,307.621,52.039,37.961,99.9343
416,417,7583,276,1501,144.75,27.8612,62.1388,99.9634
417,418,2851,72,1479,158.19,43.7865,46.2135,99.6661
418,419,10212,2697,1518,144.148,1.32966,88.6703,99.5528
419,420,1590,1670,1485,319.9790000000001,82.5678,7.43215,99.9138
420,421,24465,3383,1556,141.798,59.999,30.001,99.4692
421,422,65937,1536,1601,133.68,63.9995,26.0005,99.5643
422,423,1479,3514,1498,320.401,35.3964,54.6036,99.9357
423,424,629,1211,1488,308.285,73.2097,16.7903,99.9396
424,425,159117,2874,1732,325.2990000000001,44.0704,45.9296,99.4636
425,426,4162,3135,1534,316.688,30.5151,59.4849,98.8066
426,427,7046,3058,1537,317.503,49.764,40.236,99.6282
427,428,3619,897,1523,318.673,21.8124,68.1876,99.982
428,429,11108,1906,1603,138.556,37.0269,52.9731,99.8831
429,430,1044,656,1535,334.58,48.274,41.726000000000006,99.9969
430,431,34978,136,1672,158.781,55.1881,34.8119,99.959
431,432,1211,1281,1553,133.711,27.4219,62.5781,99.995
432,433,3556,351,1580,320.08,49.0487,40.9513,99.9717
433,434,3151,406,1575,150.246,5.17927,84.8207,99.9962
434,435,1076,3503,1568,137.296,64.3904,25.6096,99.3417
435,436,8308,862,1604,328.282,67.8224,22.1776,99.9636
436,437,14307,1020,1634,324.811,72.3838,17.6162,99.9553
437,438,13940,1147,1654,136.686,52.5781,37.4219,99.895
438,439,68944,1741,1733,318.791,26.3317,63.6683,99.9708
439,440,1470,2443,1585,319.567,38.9708,51.0292,99.9728
440,441,2027,50,1582,160.70600000000005,55.6665,34.3335,99.9455
441,442,1180,1340,1585,344.207,68.0682,21.9318,99.9478
442,443,2731,926,1607,147.67,5.30783,84.6922,99.9967
443,444,57157,2560,1696,138.059,26.303,63.697,99.961
444,445,1356,1283,1602,339.1090000000001,67.1511,22.8489,99.9843
445,446,9236,3037,1616,146.843,44.8796,45.1204,99.879
446,447,824,3178,1593,317.618,9.79068,80.2093,99.9808
447,448,507,1099,1607,323.121,13.9918,76.0082,99.8306
448,449,36048,1312,1724,145.55700000000004,1.6794099999999998,88.3206,99.9729
449,450,1235,3240,1621,318.131,9.2327,80.7673,99.9765
450,451,3048,319,1633,134.139,18.7861,71.2139,99.9419
451,452,243073,453,2224,322.378,7.10873,82.8913,74.9192
452,453,2140,1994,1640,326.7,10.1653,79.8347,99.9908
453,454,1905,2060,1629,320.068,12.1801,77.8199,99.9879
454,455,9982,3419,1675,341.858,70.9485,19.0515,99.9649
455,456,2428,55,1655,158.975,56.0002,33.9998,99.9569
456,457,2709,707,1660,333.339,64.6447,25.3553,99.9825
457,458,1172,2217,1649,326.497,48.6767,41.3233,99.9953
458,459,18763,3377,1754,329.415,49.1995,40.8005,99.8098
459,460,19412,2056,1698,142.056,41.6323,48.3677,99.9248
460,461,26521,356,1732,337.375,61.4846,28.5154,99.9889
461,462,1433,3253,1668,145.16,61.3478,28.6522,99.986
462,463,8540,877,1721,324.815,15.3776,74.6224,99.9398
463,464,14132,231,1778,319.98,50.326,39.674,99.9952
464,465,554,3301,1698,143.086,57.8963,32.1037,99.9857
465,466,30986,1003,1813,146.694,41.1295,48.8705,99.8699
466,467,965,1013,1723,325.985,17.4618,72.5382,99.9931
467,468,5829,785,1769,317.842,33.9825,56.0175,99.9938
468,469,1844,559,1748,143.711,7.55405,82.446,99.9966
469,470,1858,2110,1740,358.629,81.668,8.332,99.9884
470,471,3741,1062,1764,318.882,25.3947,64.6053,99.9844
471,472,4024,3516,1783,321.259,19.6019,70.3981,99.9408
472,473,1645,2875,1764,141.547,37.301,52.699,99.9857
473,474,547,1142,1760,319.224,52.7824,37.2176,99.9962
474,475,98242,1993,1935,329.992,54.9423,35.0577,99.9225
475,476,5253,1566,1797,339.432,73.4751,16.5249,99.9623
476,477,14985,2141,1813,139.166,13.4916,76.5084,99.9977
477,478,12292,1228,1828,67.1538,80.3013,9.69866,99.9594
478,479,43096,3242,1927,143.599,48.4491,41.5509,98.7553
479,480,25383,2815,1873,141.252,26.9766,63.0234,99.8875
480,481,1162,3115,1797,322.016,11.1653,78.8347,99.995
481,482,513,1467,1791,323.206,6.39555,83.6044,99.9794
482,483,3037,3361,1815,155.056,46.1107,43.8893,99.9182
483,484,3365,660,1813,143.192,7.79105,82.209,99.9112
484,485,5541,1513,1855,136.42700000000002,73.0452,16.9548,99.887
485,486,2750,820,1832,321.432,63.3561,26.6439,99.9878
486,487,21846,1417,1894,134.69299999999998,9.10864,80.8914,99.9338
487,488,1769,867,1845,136.77,14.8899,75.1101,99.9963
488,489,3390,105,1850,139.378,23.379,66.62100000000001,99.9639
489,490,4707,767,1868,323.737,9.33779,80.6622,99.9558
490,491,15089,649,1886,127.199,68.3467,21.6533,99.962
491,492,3602,56,1895,140.155,51.2604,38.7396,99.866
492,493,1606,3144,1851,148.126,66.6588,23.3412,99.9481
493,494,7644,1768,1887,142.52200000000005,0.8859100000000001,89.1141,99.9815
494,495,1441,269,1867,323.536,61.4456,28.5544,99.9968
495,496,1090,3340,1863,137.41299999999998,37.5485,52.4515,99.991
496,497,4042,206,1886,318.592,45.2148,44.7852,99.9959
497,498,1068,3528,1877,137.56799999999998,13.2766,76.7234,99.935
498,499,1256,2209,1883,333.588,43.1778,46.8222,99.9962
499,500,753,986,1883,324.442,12.8687,77.1313,98.3868
500,501,5592,872,1916,143.94,32.3757,57.6243,99.9573
501,502,10285,3450,1935,149.131,69.1892,20.8108,99.9382
502,503,11986,1170,1952,315.785,36.8994,53.1006,98.5368
503,504,916,3386,1895,322.54,13.9253,76.0747,99.9968
504,505,15351,152,1958,140.316,52.1755,37.8245,99.8832
505,506,4835,1268,1914,147.738,43.5716,46.4284,99.9962
506,507,2080,3339,1911,149.08100000000005,69.2709,20.7291,99.9823
507,508,14640,2488,1985,150.031,29.2553,60.7447,99.9305
508,509,5129,1722,1941,130.253,51.1848,38.8152,99.9736
509,510,597,2294,1923,333.86300000000006,39.7872,50.2128,99.9496
510,511,10383,2990,1951,316.629,30.6321,59.3679,99.9
511,512,2592,1064,1923,325.33,15.9428,74.0572,99.9938
512,513,7040,944,1956,323.538,14.394,75.60600000000002,99.8195
513,514,3114,3088,1941,327.471,13.7694,76.2306,99.906
514,515,16725,2326,1977,151.718,27.5911,62.4089,99.9806
515,516,1615,1596,1936,151.247,26.7357,63.2643,99.8893
516,517,8502,390,1974,137.245,23.0624,66.9376,99.9581
517,518,27534,749,1987,144.382,17.7156,72.2844,99.9877
518,519,1357,3525,1965,134.868,0.066124,89.9339,99.6902
519,520,864,1106,1937,140.74200000000005,53.1814,36.8186,99.9669
520,521,1362,2734,1944,317.656,53.3673,36.6327,99.991
521,522,9951,1354,2005,327.733,66.6104,23.3896,99.2706
522,523,4550,1272,1976,147.64700000000005,21.0684,68.9316,99.8828
523,524,15609,1710,2036,142.691,18.0999,71.9001,99.7975
524,525,893,574,1960,139.97,2.33912,87.6609,99.5217
525,526,527,1677,1960,139.995,37.1,52.9,99.5181
526,527,5771,291,1982,151.623,53.9021,36.0979,99.9066
527,528,1302,1024,1973,217.634,81.389,8.61102,99.9706
528,529,719,3366,1961,138.58,32.2493,57.7507,99.9804
529,530,1056,2889,1970,130.18,65.4897,24.5103,99.9788
530,531,1218,2422,1987,319.677,59.5178,30.4822,99.8584
531,532,1704,1084,1980,315.284,38.5486,51.4514,99.9374
532,533,6396,2241,2009,298.321,71.5819,18.4181,99.3889
533,534,2622,1535,1992,131.403,65.8241,24.1759,99.9666
534,535,2283,3356,1998,144.739,49.4243,40.5757,99.9776
535,536,1047,2696,2002,323.2990000000001,9.91299,80.087,99.9677
536,537,4275,601,2027,146.27,73.4738,16.5262,99.448
537,538,755,2664,1987,317.2290000000001,52.1631,37.8369,99.9782
538,539,3047,3125,2008,140.496,24.892,65.108,99.979
539,540,7031,2604,2027,331.871,44.9098,45.0902,99.9742
540,541,11275,2782,2042,328.13,82.9994,7.00065,99.4369
541,542,4376,1464,2021,326.644,37.7133,52.2867,99.8959
542,543,28008,2969,2077,141.50799999999995,43.5148,46.4852,99.5293
543,544,682,1608,2008,320.558,13.8653,76.1347,99.9916
544,545,9647,1009,2031,142.585,19.7049,70.2951,99.9623
545,546,13180,105,2066,322.398,53.0712,36.9288,99.9306
546,547,34733,198,2169,333.796,66.4583,23.5417,99.945
547,548,1818,3506,2037,346.585,79.41,10.59,99.907
548,549,1889,3439,2041,339.465,74.6561,15.3439,99.6685
549,550,59309,1282,2301,321.918,4.10693,85.8931,94.5599
550,551,17555,925,2112,327.7990000000001,38.1986,51.8014,99.8446
551,552,27833,1564,2108,140.084,69.4177,20.5823,99.9319
552,553,1290,2426,2042,323.444,33.3329,56.6671,99.9709
553,554,30460,3189,2124,320.822,13.903,76.097,99.4846
554,555,2420,226,2065,139.653,5.20686,84.7931,99.2195
555,556,7000,1161,2080,323.321,14.7756,75.2244,99.9922
556,557,1045,667,2047,329.99300000000005,60.2953,29.7046,99.9639
557,558,4011,2697,2081,324.764,4.53544,85.4646,99.9396
558,559,1271,1102,2060,351.9530000000001,83.464,6.53597,99.9465
559,560,3177,2306,2097,321.57,33.3523,56.6477,99.9019
560,561,76559,2858,2218,139.745,10.9904,79.0096,96.4413
561,562,22965,1855,2148,139.244,14.2673,75.7327,99.9562
562,563,5986,2533,2110,334.524,59.613,30.387,99.8969
563,564,8495,1977,2103,323.322,68.5667,21.4333,99.9641
564,565,33269,745,2164,138.439,73.405,16.595,99.8916
565,566,12821,2421,2120,324.279,56.3003,33.6997,99.846
566,567,3749,630,2102,140.608,2.45974,87.5403,99.9975
567,568,39049,2113,2176,146.97299999999996,0.33573200000000003,89.6643,98.6584
568,569,16533,3398,2148,131.186,36.2371,53.7629,99.8635
569,570,682,1242,2091,109.06,77.2463,12.7537,99.9923
570,571,833,3379,2083,359.291,68.4004,21.5996,99.9847
571,572,716,2882,2093,329.022,2.70435,87.2956,99.9838
572,573,6078,1319,2161,148.787,25.2033,64.7967,99.9448
573,574,5391,1053,2146,141.25,9.09801,80.902,99.8319
574,575,25933,1199,2193,141.192,1.5238,88.4762,99.8064
575,576,4098,3523,2162,139.731,10.4223,79.5777,99.8283
576,577,788,3286,2118,5.56153,70.3672,19.6328,99.9832
577,578,1102,830,2133,135.075,42.2538,47.7462,99.9947
578,579,10000,1725,2168,320.89,36.1686,53.8314,99.9735
579,580,3011,2334,2157,318.987,46.4989,43.5011,99.9783
580,581,532,25,2149,154.338,13.5414,76.4586,99.9058
581,582,897,997,2174,139.01,38.4938,51.5062,99.971
582,583,9793,2298,2225,321.441,2.7451,87.2549,98.1599
583,584,4213,3169,2201,135.409,43.7634,46.2366,99.9587
584,585,6461,2567,2212,332.876,62.7261,27.2739,99.8676
585,586,9888,597,2235,321.765,15.9949,74.0051,99.9944
586,587,529,330,2185,141.203,15.7486,74.2514,99.9941
587,588,6439,2430,2216,326.426,42.3561,47.6439,99.9853
588,589,5137,914,2220,134.96200000000002,5.9057,84.0943,99.954
589,590,1773,1559,2198,136.842,13.2848,76.7152,99.9959
590,591,694,1967,2193,315.745,37.5463,52.4537,99.9523
591,592,6487,3477,2231,138.705,24.821,65.179,99.9025
592,593,642,1620,2203,323.117,32.5334,57.4666,99.9949
593,594,1333,1660,2213,143.64700000000005,44.1591,45.8409,99.9893
594,595,5730,2177,2236,322.001,75.8974,14.1026,99.9719
595,596,2890,985,2241,322.345,32.7301,57.2699,99.7505
596,597,2051,3243,2225,146.764,55.2962,34.7038,99.9333
597,598,4204,217,2247,136.053,31.315,58.685,99.9471
598,599,1986,299,2237,323.19,47.5023,42.4977,99.993
599,600,1952,2513,2240,139.835,14.3444,75.6556,99.9788
600,601,1480,1919,2225,132.708,53.0001,36.9999,99.9455
601,602,5083,1478,2258,139.257,6.602060000000002,83.3979,88.4683
602,603,3804,1038,2250,11.4598,80.449,9.55096,99.9686
603,604,49945,1649,2359,322.231,14.8605,75.1395,99.634
604,605,1155,3203,2239,133.985,39.1295,50.8705,99.9803
605,606,1699,1726,2244,315.127,37.79,52.21,99.9959
606,607,5930,1852,2270,135.878,51.0857,38.9143,99.9461
607,608,27051,3369,2313,148.268,17.5311,72.4689,99.9075
608,609,768,31,2264,30.0346,14.5953,75.4047,99.5144
609,610,3101,1933,2277,322.898,11.0274,78.9726,99.9821
610,611,6272,1113,2279,141.916,61.7905,28.2095,99.9829
611,612,1758,1686,2273,138.484,8.040189999999999,81.9598,99.9959
612,613,2301,697,2261,127.169,61.3873,28.6127,99.9879
613,614,5969,2478,2289,139.781,31.8047,58.1953,99.9442
614,615,611,877,2262,141.187,24.7753,65.2247,99.9966
615,616,3117,2715,2276,145.013,0.252014,89.74799999999998,99.9833
616,617,5717,2616,2290,144.17,28.527,61.473,99.9871
617,618,1109,2356,2273,320.469,57.812,32.188,99.7718
618,619,534,3546,2281,142.386,9.50219,80.4978,99.9173
619,620,1118,788,2272,123.291,61.8261,28.1739,99.9767
620,621,1516,1787,2283,327.557,40.0185,49.9815,99.9855
621,622,132703,3231,2616,324.481,6.791989999999998,83.208,96.6363
622,623,2075,914,2290,147.44899999999996,59.7774,30.2226,99.9591
623,624,861,1973,2286,139.153,14.1573,75.8427,99.9827
624,625,1895,3152,2304,124.719,66.5811,23.4189,99.9787
625,626,2626,2299,2299,142.356,15.9619,74.0381,99.9992
626,627,4082,2779,2304,315.555,0.504875,89.4951,99.9917
627,628,2352,672,2302,140.119,74.1827,15.8173,99.989
628,629,2249,1759,2307,342.79,62.9089,27.0911,99.9667
629,630,2489,2244,2308,147.937,86.3022,3.69777,99.9782
630,631,5110,738,2315,147.387,19.0823,70.9177,99.9975
631,632,1134,2189,2293,137.855,1.42251,88.5775,99.9664
632,633,713,2125,2298,151.735,2.39954,87.6005,99.8034
633,634,7231,812,2336,127.681,54.9436,35.0564,99.9889
634,635,5172,1061,2333,322.386,3.19297,86.807,95.9216
635,636,13576,2393,2343,139.144,29.6702,60.3298,99.6762
636,637,541,2554,2303,135.465,11.37,78.63,99.955
637,638,11555,1349,2381,324.307,48.4667,41.5333,99.8548
638,639,1303,944,2313,335.19699999999995,65.1638,24.8362,99.9921
639,640,704,21,2330,299.956,2.20597,87.794,99.8406
640,641,729,571,2306,124.779,63.6142,26.3858,99.9694
641,642,3251,1204,2331,136.91,7.3756,82.6244,99.9838
642,643,3768,624,2345,326.578,51.3102,38.6898,99.9887
643,644,7373,3504,2363,329.096,1.09719,88.9028,99.4818
644,645,13399,2172,2368,137.77100000000002,30.2577,59.7423,99.9707
645,646,557,3035,2315,140.32,38.2116,51.7884,99.9889
646,647,3200,1880,2334,322.097,37.3145,52.6855,99.9958
647,648,18003,1979,2369,329.5680000000001,71.0547,18.9453,99.9206
648,649,10004,2728,2362,314.237,83.1705,6.82952,99.9561
649,650,12433,2613,2385,321.431,17.3698,72.6302,99.9739
650,651,27131,917,2413,319.956,48.5047,41.4953,99.8709
651,652,824,1155,2327,136.705,79.0535,10.9465,99.9837
652,653,3323,1815,2359,317.345,37.022,52.978,99.8035
653,654,6854,514,2362,130.082,60.3798,29.6202,99.9249
654,655,655,884,2338,323.137,29.8969,60.1031,99.9893
655,656,2409,2524,2349,149.106,11.9199,78.0801,99.9786
656,657,12084,3005,2399,325.159,14.2923,75.7077,99.8838
657,658,532,36,2383,28.2914,4.15008,85.8499,99.545
658,659,2062,676,2369,138.97,7.1128,82.8872,99.9813
659,660,627,1416,2360,143.392,43.4735,46.5265,99.9859
660,661,5486,739,2407,321.07,46.2023,43.7977,99.9915
661,662,2859,2834,2383,133.743,29.3252,60.6748,99.9745
662,663,12638,2272,2434,141.006,42.8335,47.1665,99.9899
663,664,933,3077,2387,153.91899999999995,68.7884,21.2116,99.9783
664,665,1660,1431,2391,325.084,52.1507,37.8493,99.9731
665,666,782,2896,2389,323.572,39.5293,50.4707,99.9921
666,667,949,1496,2400,142.189,21.5462,68.4538,99.9697
667,668,1208,2501,2396,138.311,15.1683,74.8317,99.9858
668,669,13700,2082,2447,324.596,33.8973,56.1027,99.992
669,670,8952,2370,2456,319.374,22.1955,67.8045,99.9843
670,671,6739,2482,2427,147.84799999999996,12.0339,77.9661,99.9046
671,672,3471,1856,2436,139.334,5.250380000000002,84.7496,99.9967
672,673,504,802,2408,137.692,8.18806,81.8119,99.9608
673,674,554,1547,2407,146.341,55.2661,34.7339,99.9816
674,675,6516,1277,2453,323.211,41.1385,48.8615,99.9854
675,676,2509,2780,2426,321.4,20.1627,69.8373,99.9906
676,677,1137,3328,2416,120.155,70.673,19.327,99.882
677,678,626,1044,2419,336.815,65.7979,24.2021,99.9932
678,679,22842,1407,2504,146.259,2.87987,87.1201,87.1254
679,680,8298,156,2468,158.792,78.0585,11.9415,99.6388
680,681,889,1534,2445,323.458,2.07876,87.9212,99.9754
681,682,3123,1592,2463,318.671,52.6136,37.3864,99.9288
682,683,2864,2615,2453,314.652,24.1285,65.8715,99.9825
683,684,6828,1975,2488,144.02100000000004,33.745,56.255,99.8789
684,685,514,1087,2446,181.87,87.57799999999997,2.42204,99.9284
685,686,4655,2586,2491,136.121,19.8032,70.1968,99.9003
686,687,7715,2886,2501,307.651,72.2183,17.7817,99.8504
687,688,5317,3478,2482,145.216,9.84786,80.1521,99.9631
688,689,3270,2689,2471,317.795,51.8014,38.1986,99.9628
689,690,11989,1903,2539,320.9120000000001,26.3231,63.6769,99.7641
690,691,1302,2430,2475,166.487,79.2163,10.7837,99.9584
691,692,1217,3020,2468,137.665,13.1423,76.8577,99.9958
692,693,3474,2777,2483,159.218,66.2862,23.7138,99.7616
693,694,2161,3405,2482,333.235,0.282967,89.71700000000001,99.979
694,695,15736,2146,2533,328.851,59.2985,30.7015,86.6595
695,696,9315,2455,2529,330.733,47.4746,42.5254,99.8389
696,697,1244,1061,2481,325.158,66.8278,23.1722,99.9804
697,698,1508,1339,2485,319.295,26.4316,63.5684,99.952
698,699,2981,3011,2507,324.846,24.1127,65.8873,99.7417
699,700,33189,1726,2568,323.069,33.067,56.933,99.4865
700,701,1329,91,2498,143.734,12.845,77.155,99.7743
701,702,910,230,2498,318.4840000000001,17.3265,72.6735,99.7889
702,703,14548,281,2549,320.3,15.0271,74.9729,99.8886
703,704,648,952,2493,323.822,25.9705,64.0295,99.9389
704,705,20455,1574,2605,143.204,57.6216,32.3784,99.8697
705,706,3913,990,2531,1.01202,83.5067,6.49335,98.8778
706,707,2495,1270,2519,320.698,29.7884,60.2116,99.6685
707,708,797,914,2516,148.746,9.40677,80.5932,99.9516
708,709,10041,2306,2571,143.577,9.33916,80.6608,99.9885
709,710,115062,2792,2792,322.838,12.9329,77.0671,89.8455
710,711,6854,849,2567,335.023,39.2955,50.7045,99.9903
711,712,10490,3393,2562,324.957,38.6809,51.3191,99.8729
712,713,90546,146,2842,137.332,6.469130000000002,83.5309,99.5274
713,714,970,3501,2551,292.302,82.3307,7.66932,99.1513
714,715,3422,2931,2551,323.199,9.86074,80.1393,99.8981
715,716,14093,1128,2594,151.299,33.86,56.14,99.9241
716,717,1209,2005,2557,131.202,47.2814,42.7186,99.8879
717,718,956,441,2554,332.298,68.2548,21.7452,99.9856
718,719,3882,2968,2592,136.299,86.2985,3.70153,99.8364
719,720,7368,1434,2612,322.688,13.281,76.719,99.9644
720,721,1859,1470,2574,322.692,25.8777,64.1223,99.6336
721,722,14291,2719,2617,138.924,46.8155,43.1845,99.9796
722,723,4294,1022,2617,326.209,38.1454,51.8546,99.9695
723,724,3574,400,2589,331.099,68.3511,21.6489,99.9394
724,725,45850,2483,2685,312.576,47.6394,42.3606,99.966
725,726,14890,922,2692,142.842,28.1186,61.8814,99.3257
726,727,5310,1999,2621,326.986,6.4377,83.5623,99.9762
727,728,1468,2173,2588,322.4840000000001,34.4783,55.5217,99.9854
728,729,25346,1340,2662,137.565,41.3513,48.6487,99.9777
729,730,2983,2086,2607,321.0440000000001,31.1289,58.8711,99.9634
730,731,122272,770,2825,321.634,4.98994,85.0101,99.6816
731,732,4018,351,2631,145.539,9.49853,80.5015,99.9917
732,733,9640,1914,2657,121.53,79.7496,10.2504,99.7942
733,734,2587,3425,2628,356.216,80.0422,9.95778,99.9529
734,735,49366,2182,2725,316.998,17.0633,72.9367,99.9939
735,736,679,3344,2625,317.928,29.1638,60.8362,99.974
736,737,47822,382,2738,108.377,77.1277,12.8723,99.8875
737,738,1809,850,2628,322.251,65.9556,24.0444,99.9746
738,739,49278,3046,2733,138.759,47.0451,42.9549,99.9082
739,740,820,3493,2629,299.153,81.9094,8.09061,99.9732
740,741,3936,585,2648,152.32399999999996,36.154,53.846,99.9905
741,742,1994,296,2650,131.55,83.8603,6.13966,99.9921
742,743,6829,1153,2691,143.188,16.0868,73.9132,99.951
743,744,1076,2640,2650,323.161,46.2755,43.7245,99.9926
744,745,8410,3508,2708,331.656,25.1626,64.8374,99.8912
745,746,3070,1817,2670,135.27200000000002,63.8631,26.1369,99.9832
746,747,778,2057,2654,145.892,45.7321,44.2679,99.9958
747,748,30609,1042,2755,322.575,21.1362,68.8638,99.9902
748,749,9659,1222,2718,327.092,56.466,33.534,99.9764
749,750,1628,3428,2681,319.422,1.7382,88.2618,99.9531
750,751,738,1499,2675,139.313,80.1667,9.83331,99.9144
751,752,261797,1621,2973,323.555,20.8545,69.1455,95.9567
752,753,1177,3385,2690,336.338,82.5152,7.48485,99.9682
753,754,5308,2047,2717,326.2920000000001,9.58144,80.4186,99.9904
754,755,4090,1753,2710,336.209,58.6751,31.3249,99.9777
755,756,1118,923,2712,139.349,35.2878,54.7122,99.9907
756,757,11236,3360,2764,131.412,56.4051,33.5949,99.9782
757,758,10610,2035,2830,132.839,18.585,71.415,99.9492
758,759,10662,1296,2793,139.94899999999998,17.9415,72.0585,99.9962
759,760,620,3451,2748,140.238,10.0986,79.9014,99.9268
760,761,4674,2385,2769,105.107,73.6266,16.3734,99.9782
761,762,4567,2279,2797,195.433,83.9311,6.06886,99.9758
762,763,816,3220,2785,136.10299999999998,88.9391,1.06091,99.9766
763,764,10708,2571,2821,139.556,7.957160000000001,82.0428,99.996
764,765,3966,2327,2825,141.611,16.7788,73.2212,99.9428
765,766,25322,3465,2888,327.944,73.8435,16.1565,99.3772
766,767,752,1174,2789,150.322,30.6678,59.3322,99.9975
767,768,9176,544,2835,314.383,44.5126,45.4874,99.9729
768,769,4726,3134,2826,147.002,39.0379,50.9621,99.9902
769,770,6436,1175,2842,321.759,2.52563,87.4744,99.8953
770,771,2272,2384,2834,138.295,6.64845,83.3516,99.9927
771,772,38198,357,2906,318.771,61.3342,28.6658,96.477
772,773,3315,3203,2857,320.152,31.7615,58.2385,99.9938
773,774,2467,203,2848,330.495,73.4683,16.5317,99.9914
774,775,10617,2663,2905,144.47,18.7996,71.2004,99.9546
775,776,1766,2248,2858,318.506,11.0247,78.9753,99.4469
776,777,29659,1224,2938,145.20600000000005,6.906810000000001,83.0932,99.7962
777,778,2248,1031,2876,143.241,61.2122,28.7877,99.9522
778,779,9040,2506,2893,140.44799999999998,66.3263,23.6737,99.9646
779,780,2005,1964,2874,151.585,3.66075,86.3392,99.9928
780,781,26678,1812,2933,210.056,79.1646,10.8355,99.9277
781,782,55852,2310,2973,325.513,46.4363,43.5637,99.897
782,783,22964,3088,2943,359.695,72.7514,17.2486,99.9424
783,784,4046,2013,2908,137.174,24.0967,65.9033,99.991
784,785,3379,1078,2925,140.736,20.8663,69.1337,99.9754
785,786,2327,534,2926,134.032,58.5787,31.4213,99.9828
786,787,16827,566,2994,115.444,78.0107,11.9893,98.9347
787,788,8223,2130,2948,186.83,71.1852,18.8148,99.9658
788,789,2460,2569,2957,322.714,36.821,53.179,99.9931
789,790,2299,2631,2965,321.631,11.0567,78.9433,99.985
790,791,26712,2007,3044,322.402,18.4685,71.5315,99.9133
791,792,6407,3384,2999,141.876,46.139,43.861,99.9889
792,793,102262,829,3132,116.998,73.3754,16.6246,99.6643
793,794,2991,2972,2993,147.06799999999996,32.4748,57.5252,99.9265
794,795,2908,2103,3016,134.032,25.7818,64.2182,99.9467
795,796,6427,2575,3025,135.464,5.12066,84.8793,99.9794
796,797,13769,455,3059,143.225,1.23773,88.7623,99.8881
797,798,661,2512,3002,146.767,17.0634,72.9366,99.9858
798,799,663,2701,3000,138.122,38.0182,51.9818,99.9808
799,800,1139,3162,3013,328.3280000000001,1.38396,88.616,99.9903
800,801,9142,1122,3036,329.139,57.1182,32.8818,99.671
801,802,644,327,3003,323.63,32.9773,57.0227,91.7061
802,803,59081,3463,3193,334.8,9.71818,80.2818,87.1062
803,804,718,2651,3021,148.45600000000005,18.8422,71.1578,99.9887
804,805,1743,916,3034,144.826,38.0219,51.9781,99.988
805,806,23272,2481,3143,133.474,40.5579,49.4421,99.5331
806,807,4239,285,3048,321.089,53.0178,36.9822,99.997
807,808,23547,3011,3097,145.61,8.9717,81.0283,99.8883
808,809,23629,2686,3106,135.42600000000002,5.86977,84.1302,99.99
809,810,40289,3220,3146,340.795,66.3223,23.6777,99.8393
810,811,18561,1234,3125,148.405,35.003,54.997,99.9554
811,812,54677,321,3206,315.442,33.1766,56.8234,78.5586
812,813,11663,2138,3143,131.514,26.2976,63.7024,99.7747
813,814,4048,2562,3123,323.563,36.1162,53.8838,99.9609
814,815,4887,2839,3101,150.835,45.4931,44.5069,99.9191
815,816,13070,2299,3115,74.8829,82.2806,7.71943,99.9743
816,817,4350,233,3129,322.952,10.9309,79.0691,99.9565
817,818,3245,303,3109,133.02,47.8414,42.1586,99.9958
818,819,5001,1132,3131,322.828,23.0823,66.9177,99.9623
819,820,2941,1323,3129,328.756,39.3357,50.6643,99.9656
820,821,2513,2927,3144,312.903,38.5781,51.4219,99.9401
821,822,5599,508,3166,322.306,43.1145,46.8855,99.9444
822,823,5782,2040,3183,329.575,9.72728,80.2727,99.9826
823,824,2570,614,3162,324.742,43.1173,46.8827,99.8779
824,825,11717,2809,3179,327.575,37.4145,52.5855,99.975
825,826,7756,1357,3186,328.671,28.2669,61.7331,99.8734
826,827,962,2388,3170,324.505,44.1983,45.8017,99.9045
827,828,1509,573,3181,103.72,73.4776,16.5224,99.9901
828,829,4523,3085,3210,318.617,28.1805,61.8195,99.7822
829,830,1251,184,3176,325.452,51.3428,38.6572,99.6508
830,831,946,1006,3175,148.613,29.9711,60.0289,99.8998
831,832,8648,2233,3216,103.432,82.1167,7.883269999999999,99.9867
832,833,5588,1114,3207,125.018,77.367,12.633,99.9701
833,834,972,3030,3195,316.175,26.3364,63.6636,99.9873
834,835,1022,2578,3205,325.6090000000001,16.3985,73.6015,99.9682
835,836,29346,2930,3297,312.668,78.1062,11.8938,91.1985
836,837,4382,1832,3225,149.004,11.2278,78.7722,99.955
837,838,12919,2648,3265,135.757,48.1519,41.8481,99.854
838,839,522,1934,3194,157.88299999999995,69.9523,20.0477,99.9694
839,840,11650,2327,3262,141.42600000000004,61.2174,28.7826,99.9415
840,841,18493,3185,3298,325.056,10.7817,79.2183,99.6523
841,842,4802,2431,3230,320.193,9.40381,80.5962,99.4631
842,843,92160,1828,3361,322.215,6.9417300000000015,83.0583,95.7555
843,844,3872,1554,3247,133.124,64.1042,25.8958,99.8724
844,845,4460,1195,3240,138.42,28.4459,61.5541,99.9946
845,846,1439,554,3228,148.601,13.0125,76.9875,99.9951
846,847,9433,1074,3262,138.781,3.66199,86.338,99.8866
847,848,35386,542,3313,314.154,69.0342,20.9658,84.9884
848,849,1468,3332,3247,320.221,40.4087,49.5913,99.9251
849,850,517,2721,3229,144.224,6.3523,83.6477,98.4855
850,851,4874,2803,3257,146.171,48.3485,41.6515,99.9297
851,852,2368,1679,3245,147.28799999999995,15.4722,74.5278,99.9969
852,853,6145,2039,3265,326.601,2.5202,87.4798,99.9858
853,854,2382,2124,3252,328.642,9.50885,80.4911,99.9966
854,855,9097,882,3336,155.718,70.0749,19.9251,99.9543
855,856,936,739,3264,145.754,2.20109,87.7989,99.9935
856,857,11583,2755,3311,319.814,12.5918,77.4082,99.9881
857,858,7164,2455,3303,327.80800000000005,25.995,64.005,99.6028
858,859,4034,1255,3295,328.895,7.13007,82.8699,99.895
859,860,16746,1011,3348,326.4790000000001,17.4858,72.5142,99.2615
860,861,5266,2209,3291,320.596,81.5293,8.47071,99.9855
861,862,1092,1409,3280,329.122,24.8445,65.1555,99.83
862,863,16645,118,3332,324.25,22.9259,67.0741,99.1181
863,864,1656,1362,3296,329.465,45.2511,44.7489,99.9882
864,865,1587,2136,3296,322.117,31.3766,58.6234,99.9888
865,866,3281,358,3330,134.262,75.149,14.851,99.9895
866,867,890,1204,3300,139.065,21.3996,68.6004,99.9949
867,868,26702,149,3468,138.254,7.960210000000001,82.0398,99.7444
868,869,501,754,3298,325.823,45.8871,44.1129,99.9958
869,870,758,3384,3300,141.203,50.7185,39.2815,99.982
870,871,749,1328,3308,325.398,34.2122,55.7878,99.6741
871,872,9551,2585,3348,138.344,9.67058,80.3294,99.9964
872,873,12265,708,3372,325.832,5.48411,84.5159,99.9664
873,874,15889,3320,3373,330.624,77.7451,12.2549,99.978
874,875,1904,1136,3329,327.696,5.0802,84.9198,99.7683
875,876,666,3544,3321,317.583,23.7939,66.2061,99.9038
876,877,1394,2063,3323,146.053,59.3484,30.6516,99.9903
877,878,16175,2242,3390,127.659,51.819,38.181,99.9637
878,879,1024,1411,3329,326.746,32.4062,57.5938,99.5038
879,880,2559,792,3343,328.806,26.2512,63.7488,99.9925
880,881,4936,1299,3352,327.248,33.5418,56.4582,99.9921
881,882,37975,3005,3468,138.567,16.062,73.938,94.5455
882,883,2745,2129,3345,289.593,84.8004,5.19955,99.9964
883,884,996,2373,3341,328.599,88.2574,1.7426,99.9884
884,885,17723,1256,3428,327.004,20.5432,69.4568,98.721
885,886,1312,620,3351,143.33100000000005,25.8407,64.1593,99.9969
886,887,1331,1158,3357,314.898,2.18629,87.8137,99.9692
887,888,979,1377,3351,330.004,45.1585,44.8415,99.9786
888,889,8870,294,3387,140.114,35.4517,54.5483,99.9978
889,890,14314,2394,3423,230.612,85.8749,4.12514,99.9269
890,891,10619,3162,3410,282.862,78.5556,11.4444,99.9987
891,892,5140,2520,3401,321.411,25.0246,64.9754,99.9948
892,893,16159,2738,3431,141.048,2.6217,87.3783,97.9797
893,894,2399,392,3388,310.376,40.886,49.114,99.9728
894,895,2421,1895,3383,136.39600000000002,23.3227,66.6773,99.9901
895,896,6117,1668,3409,327.9980000000001,50.6983,39.3017,99.9929
896,897,1727,2924,3378,142.71,30.9074,59.0926,99.9486
897,898,24789,1161,3507,147.366,44.5385,45.4615,99.9087
898,899,15736,1405,3441,143.405,48.6589,41.3411,99.9562
899,900,622,2782,3388,148.303,53.2983,36.7017,99.982
900,901,3823,592,3401,320.247,65.1093,24.8907,99.9927
901,902,647,808,3392,319.137,43.1762,46.8238,99.982
902,903,6840,1065,3436,326.464,0.548027,89.45200000000001,99.9833
903,904,1555,436,3409,129.291,67.9014,22.0986,99.9663
904,905,28152,941,3520,316.4170000000001,43.6467,46.3533,99.8855
905,906,4575,1587,3435,239.155,86.5579,3.4420800000000003,99.9851
906,907,3090,1857,3422,132.086,50.5727,39.4273,99.9888
907,908,26197,783,3517,135.564,62.7873,27.2127,99.623
908,909,32715,3441,3533,145.287,50.9679,39.0321,99.3348
909,910,1384,880,3420,145.34799999999996,9.86465,80.1354,99.9918
910,911,1025,1787,3414,320.367,75.292,14.708,99.977
911,912,1391,3531,3422,141.434,12.1405,77.8595,99.8683
912,913,3723,3257,3440,324.3540000000001,7.25005,82.75,99.9874
913,914,764,41,3424,202.328,46.6023,43.3977,99.0725
914,915,3893,607,3451,310.085,45.1836,44.8164,99.9724
915,916,18356,2618,3499,133.672,38.7329,51.2671,99.8416
916,917,543,3098,3439,322.694,7.325080000000002,82.6749,99.9727
917,918,1437,266,3442,323.483,55.3824,34.6176,99.9955
918,919,1316,218,3445,316.291,66.1414,23.8586,99.9822
919,920,2755,390,3449,126.494,57.3027,32.6973,99.9847
920,921,74307,2368,3631,138.131,5.20915,84.7908,99.6553
921,922,17347,529,3523,138.325,49.3261,40.6739,99.8195
922,923,13346,1829,3498,323.996,23.1955,66.8045,99.9503
923,924,598,1743,3459,248.709,84.4237,5.57635,99.9771
924,925,2875,429,3496,309.808,42.3798,47.6202,99.8405
925,926,71088,340,3634,135.909,72.49,17.51,99.7986
926,927,1618,3358,3464,155.246,57.1817,32.8183,99.9928
927,928,8004,678,3499,325.46,56.0656,33.9344,99.8188
928,929,23618,1722,3556,136.655,28.7694,61.2306,97.1679
929,930,744,2321,3476,137.629,16.5501,73.4499,99.9798
930,931,28599,3243,3554,315.17,0.241669,89.7583,99.9725
931,932,9103,2856,3519,318.974,5.97145,84.0285,99.8608
932,933,1216,2726,3494,254.143,84.5987,5.40135,99.9868
933,934,1937,1560,3504,151.517,6.4757,83.5243,99.6244
934,935,32541,1931,3606,323.29,70.2619,19.7381,99.317
935,936,89368,1559,3725,323.322,1.7401,88.2599,99.1558
936,937,824,40,3529,167.72,31.223000000000006,58.777,99.4627
937,938,1982,631,3548,356.796,80.6738,9.32619,99.9665
938,939,2003,2724,3548,147.886,15.6874,74.3126,99.2964
939,940,7617,2508,3586,323.36,32.3789,57.6211,99.9887
940,941,3720,1065,3570,327.695,8.09517,81.9048,99.8752
941,942,3475,3097,3573,130.262,73.0105,16.9895,99.688
942,943,1124,2085,3569,137.933,5.40311,84.5969,99.9939
943,944,8810,2788,3603,143.014,77.8025,12.1975,99.9323
944,945,2711,1575,3581,140.00799999999998,6.30486,83.6951,99.9872
945,946,1852,65,3584,151.662,39.7968,50.2032,99.9166
946,947,2870,1645,3596,143.406,14.2849,75.7151,99.9832
947,948,16080,631,3665,323.449,5.65521,84.3448,99.9568
948,949,27442,1350,3694,318.832,21.1499,68.8501,99.8176
949,950,14744,2130,3651,141.836,42.1973,47.8027,99.9706
950,951,1929,2895,3593,140.73,16.5052,73.4948,99.9905
951,952,619,2577,3584,336.793,54.0571,35.9429,99.9914
952,953,12788,2667,3639,339.7480000000001,63.916,26.084,99.9147
953,954,1370,841,3612,318.158,44.6123,45.3877,99.9806
954,955,11668,182,3636,322.9170000000001,29.1114,60.8886,99.9014
955,956,15271,1057,3670,327.615,31.5489,58.4511,99.9233
956,957,868,603,3617,10.7436,85.2273,4.77274,99.9865
957,958,7782,2391,3678,29.2167,81.6454,8.35459,99.935
958,959,41950,2922,3713,323.535,37.4596,52.5404,99.6955
959,960,667,84,3622,324.836,17.8576,72.1424,99.8862
960,961,2652,2976,3646,140.826,44.9492,45.0508,99.9903
961,962,759,3089,3623,330.9480000000001,26.0624,63.9376,99.992
962,963,5159,3209,3651,146.386,39.8813,50.1187,99.9916
963,964,8996,3437,3666,330.399,20.3663,69.6337,99.7977
964,965,1355,555,3632,68.1189,84.0767,5.92328,99.9472
965,966,2000,1202,3641,311.983,37.0342,52.9658,99.9975
966,967,3037,2536,3642,321.525,19.2561,70.7439,99.8581
967,968,4888,699,3659,322.138,43.5518,46.4482,99.9973
968,969,50468,894,3814,322.145,14.9026,75.0974,98.8825
969,970,16969,1717,3704,138.738,21.3212,68.6788,99.9606
970,971,3054,3141,3663,141.001,53.2503,36.7497,99.9871
971,972,526,1305,3647,135.671,59.5095,30.4905,99.962
972,973,2871,790,3663,321.599,48.3125,41.6875,99.9912
973,974,1276,55,3651,154.415,38.9523,51.0477,99.8455
974,975,1055,1337,3657,321.446,5.85698,84.14299999999999,99.9935
975,976,911,2021,3652,142.511,24.3776,65.6224,99.9896
976,977,1446,3510,3688,215.748,85.0756,4.92442,99.9797
977,978,67261,1155,3827,141.235,57.3034,32.6966,99.9014
978,979,6923,2200,3711,149.406,21.3143,68.6857,99.985
979,980,1401,498,3673,321.996,51.1022,38.8978,99.9736
980,981,1321,964,3670,130.391,61.9232,28.0768,99.7914
981,982,3286,3344,3687,140.741,27.1456,62.8544,99.9914
982,983,1161,2053,3684,142.49,21.9893,68.0107,99.9184
983,984,12239,2593,3723,319.599,38.1104,51.8896,99.9931
984,985,641,42,3679,219.863,61.9346,28.0654,99.9093
985,986,4588,156,3709,324.277,52.1016,37.8984,99.9025
986,987,2532,729,3708,146.916,40.6423,49.3577,99.997
987,988,6065,3245,3718,322.749,8.472760000000001,81.5272,95.8185
988,989,74971,2044,3837,143.191,36.1118,53.8882,96.0434
989,990,8349,74,3783,138.071,56.8427,33.1573,99.9356
990,991,25614,2304,3804,324.319,32.0083,57.9917,99.6942
991,992,3300,2719,3723,76.2708,82.4415,7.55847,99.9799
992,993,4246,3117,3723,348.39,66.3161,23.6839,99.9841
993,994,44323,547,3801,136.654,56.9211,33.0789,99.875
994,995,1057,788,3719,141.495,60.4113,29.5887,99.9877
995,996,7775,145,3789,133.844,57.1994,32.8006,99.9298
996,997,7477,2073,3754,323.387,20.9406,69.0594,99.9726
997,998,2905,2458,3754,317.842,26.2773,63.7227,99.9668
998,999,2933,3398,3746,133.24,44.9233,45.0767,99.9858
999,1000,4775,774,3768,323.732,23.528,66.472,99.9428
1000,1001,552,3480,3738,150.241,13.4372,76.5628,99.9666
1001,1002,2488,3546,3776,141.339,1.12863,88.8714,99.9377
1002,1003,17961,3324,3822,142.657,12.2438,77.7562,99.8187
1003,1004,34546,2711,3844,146.826,72.2984,17.7016,99.9545
1004,1005,2336,1015,3766,326.243,50.0055,39.9945,99.9919
1005,1006,1036,1811,3760,321.147,5.18751,84.8125,99.8556
1006,1007,26337,3466,3886,323.269,42.6844,47.3156,99.8182
1007,1008,41334,3103,3842,326.541,24.0594,65.9406,99.9913
1008,1009,7461,2404,3822,139.995,10.1747,79.8253,99.9633
1009,1010,527,199,3799,327.19,49.8324,40.1676,99.9971
1010,1011,579,2455,3795,319.617,39.7915,50.2085,99.9938
1011,1012,4405,343,3819,318.7,18.8568,71.1432,99.9965
1012,1013,2254,2885,3828,142.75,28.0061,61.9939,99.9292
1013,1014,2997,1835,3840,321.793,28.3653,61.6347,99.9762
1014,1015,1024,2836,3820,316.425,11.6118,78.3882,99.9987
1015,1016,4552,224,3852,140.248,54.6215,35.3785,99.9878
1016,1017,7902,1372,3844,160.24200000000005,81.6199,8.38007,99.9544
1017,1018,745,48,3854,139.69,57.794,32.206,99.9473
1018,1019,114127,381,3996,318.655,8.96434,81.0357,71.6884
1019,1020,60694,1499,4015,323.506,51.9738,38.0262,99.8829
1020,1021,1883,739,3870,319.293,39.9002,50.0998,99.9929
1021,1022,1433,157,3866,325.057,32.4245,57.5755,99.9631
1022,1023,1065,326,3872,125.042,53.0189,36.9811,99.8257
1023,1024,52605,1261,4014,318.322,23.6675,66.3325,99.9548
1024,1025,790,1768,3866,318.207,75.1019,14.8981,99.9898
1025,1026,1626,2824,3887,142.55100000000004,29.1222,60.8778,99.967
1026,1027,9186,2489,3933,129.987,27.643,62.357,99.9879
1027,1028,1199,2892,3885,136.09799999999998,53.0459,36.9541,99.9831
1028,1029,2734,1843,3905,317.442,41.503,48.497,99.9916
1029,1030,2660,99,3909,324.428,14.4913,75.5087,99.4324
1030,1031,6898,2395,3942,136.134,58.5421,31.4579,99.9576
1031,1032,865,3091,3904,150.594,69.2792,20.7208,99.9671
1032,1033,31154,3355,4062,321.223,16.1582,73.8418,99.6336
1033,1034,13360,1778,3957,146.035,35.0173,54.9827,99.9931
1034,1035,5749,3212,3928,145.151,72.9162,17.0838,99.9843
1035,1036,9762,2859,3960,143.298,53.5625,36.4375,99.9619
1036,1037,1710,988,3929,183.878,88.5064,1.49364,99.9915
1037,1038,1980,751,3914,321.172,8.39935,81.6006,99.9939
1038,1039,51202,1883,4127,143.336,3.05359,86.9464,98.6164
1039,1040,40812,3056,4009,319.402,2.44655,87.5535,98.7914
1040,1041,4334,715,3948,147.974,61.7882,28.2118,99.9869
1041,1042,6369,1644,3958,319.76,72.6209,17.3791,99.956
1042,1043,3309,2315,3944,142.841,61.7991,28.2009,99.9888
1043,1044,43931,2717,4119,326.2270000000001,2.31197,87.68799999999997,99.7797
1044,1045,50248,957,4078,320.468,14.2216,75.7784,97.2045
1045,1046,1314,3262,3978,148.586,53.9297,36.0703,99.9024
1046,1047,888,2588,3962,331.926,37.9754,52.0246,99.9846
1047,1048,562,81,3954,141.219,58.8114,31.1886,99.9924
1048,1049,948,2111,3962,133.509,55.3018,34.6982,99.9918
1049,1050,35037,2251,4100,140.875,16.5348,73.4652,99.8415
1050,1051,6173,2163,4005,133.55,57.5766,32.4234,99.6676
1051,1052,728,2765,3964,133.497,27.3427,62.6573,99.9927
1052,1053,8676,765,4029,133.69799999999998,80.8855,9.11449,75.559
1053,1054,2697,2639,3980,142.115,23.6949,66.3051,99.9749
1054,1055,24786,2078,4078,326.317,47.83,42.17,99.9527
1055,1056,3568,79,4028,136.736,60.6044,29.3956,99.8239
1056,1057,15873,2454,4034,143.497,1.10963,88.8904,99.0879
1057,1058,10602,1802,4063,321.249,54.5122,35.4878,99.8628
1058,1059,4809,1694,4028,137.11,63.9992,26.0008,99.48
1059,1060,3831,3534,4035,322.21,4.63435,85.3656,99.8945
1060,1061,732,49,4054,140.61,59.6543,30.3457,99.9149
1061,1062,14987,2606,4108,327.843,67.8646,22.1354,99.5453
1062,1063,11484,638,4095,144.143,64.4932,25.5068,99.9037
1063,1064,1572,695,4051,143.798,48.7556,41.2444,99.9016
1064,1065,2754,3230,4075,132.497,59.8988,30.1012,99.514
1065,1066,2800,496,4074,325.435,35.454,54.54600000000001,99.9879
1066,1067,3643,3315,4058,302.522,85.9611,4.03886,99.1851
1067,1068,1469,2991,4065,323.393,59.4391,30.5609,99.4434
1068,1069,12607,210,4148,321.66,11.5812,78.4188,99.8904
1069,1070,2674,1416,4091,139.042,11.6086,78.3914,99.9762
1070,1071,3216,1134,4097,132.954,55.9244,34.0756,99.9534
1071,1072,8534,2818,4155,1.54548,79.4608,10.5392,99.8419
1072,1073,747,266,4079,128.547,59.4692,30.5308,99.9887
1073,1074,4642,1725,4111,137.66299999999998,43.9384,46.0616,99.872
1074,1075,7530,3093,4135,347.325,73.2944,16.7056,99.9616
1075,1076,9628,3480,4126,130.855,73.29,16.71,99.9674
1076,1077,732,1650,4096,324.964,67.391,22.609,99.9072
1077,1078,922,3033,4094,321.474,3.87982,86.1202,99.9634
1078,1079,10216,2469,4137,104.763,78.3116,11.6884,99.9775
1079,1080,6596,762,4128,144.15,46.2646,43.7354,99.933
1080,1081,573,551,4098,317.673,20.0954,69.9046,99.9733
1081,1082,1634,51,4129,143.895,58.5328,31.4672,99.8829
1082,1083,3196,2923,4116,329.31699999999995,42.8177,47.1823,99.9516
1083,1084,2128,3182,4131,326.619,24.1971,65.8029,99.5783
1084,1085,2212,82,4143,137.19,60.0994,29.9006,99.9733
1085,1086,12371,2355,4179,147.19,52.7286,37.2714,99.8627
1086,1087,891,2985,4114,343.664,67.4375,22.5625,99.984
1087,1088,1828,532,4123,117.182,67.8546,22.1454,99.9823
1088,1089,1033,484,4128,138.111,54.8126,35.1874,99.9899
1089,1090,5931,1729,4168,150.108,34.5565,55.4435,99.1568
1090,1091,955,1480,4150,142.376,13.8377,76.1623,99.9818
1091,1092,2291,3016,4150,322.421,25.9076,64.0924,99.9839
1092,1093,2201,841,4166,320.052,36.0972,53.9028,99.9885
1093,1094,733,1814,4138,136.446,47.4021,42.5979,99.9785
1094,1095,18603,3238,4216,131.629,61.8008,28.1992,99.9696
1095,1096,4600,432,4163,142.371,62.6309,27.3691,99.9795
1096,1097,2928,1206,4173,153.929,87.2157,2.78428,99.991
1097,1098,22887,2877,4241,320.93,4.10393,85.8961,99.6463
1098,1099,1760,1155,4162,328.9369999999999,64.6446,25.3554,99.9708
1099,1100,1311,2084,4147,131.429,37.851,52.149,99.9694
1100,1101,576,1614,4143,142.165,1.86764,88.1324,99.9891
1101,1102,2004,598,4162,147.703,32.4649,57.5351,99.9888
1102,1103,711,1303,4153,140.96200000000005,87.44,2.55998,99.9865
1103,1104,15538,518,4217,318.33,39.2964,50.7036,99.9946
1104,1105,1079,1832,4163,313.063,60.2565,29.7435,99.9942
1105,1106,7262,646,4216,141.857,24.486,65.514,98.8397
1106,1107,1493,1996,4170,320.8,9.64445,80.3556,99.9937
1107,1108,1970,1357,4172,142.675,18.9977,71.0023,99.9459
1108,1109,832,1022,4167,322.797,10.0433,79.9567,99.9917
1109,1110,1200,1584,4180,149.303,43.9502,46.0498,99.9901
1110,1111,3975,716,4191,311.22,76.7014,13.2986,99.9714
1111,1112,7615,1378,4230,148.076,23.4263,66.5737,99.9448
1112,1113,33649,962,4278,135.741,39.2474,50.7526,74.4826
1113,1114,41106,2064,4288,132.671,72.4839,17.5161,99.7144
1114,1115,1678,1692,4190,321.052,57.8905,32.1095,99.9875
1115,1116,4896,822,4217,134.707,64.0638,25.9362,99.9838
1116,1117,1095,1293,4181,315.447,46.063,43.937,99.9538
1117,1118,639,263,4185,322.55,41.76,48.24,99.9971
1118,1119,1125,1041,4202,148.715,1.90093,88.0991,99.9818
1119,1120,952,2576,4190,327.9380000000001,54.6756,35.3244,99.9962
1120,1121,2096,324,4202,132.90200000000002,47.4042,42.5958,99.9689
1121,1122,4253,1641,4219,149.879,35.8919,54.1081,99.8013
1122,1123,5286,1469,4215,110.44,84.6411,5.35891,99.9895
1123,1124,891,2518,4192,137.961,61.3118,28.6882,99.994
1124,1125,3776,107,4241,136.812,21.2326,68.7674,99.8884
1125,1126,9516,3024,4244,129.186,70.6835,19.3165,99.9753
1126,1127,599,1813,4194,317.97,47.6505,42.3495,99.9851
1127,1128,773,3478,4204,324.928,60.5208,29.4792,99.9495
1128,1129,686,3518,4204,326.535,62.5495,27.4505,99.9751
1129,1130,37819,2335,4362,142.398,5.20333,84.7967,95.8477
1130,1131,9499,187,4271,138.503,10.739,79.26100000000002,99.973
1131,1132,1823,1264,4219,147.692,9.59113,80.4089,99.9969
1132,1133,12739,307,4256,138.05200000000002,50.69600000000001,39.304,99.9533
1133,1134,7715,434,4294,318.019,14.9675,75.0325,99.9822
1134,1135,13504,2520,4278,321.242,43.7989,46.2011,99.9938
1135,1136,45657,3395,4443,322.803,12.8007,77.1993,99.6062
1136,1137,733,1229,4227,327.336,60.7416,29.2584,99.9453
1137,1138,4185,1309,4259,323.108,13.6139,76.3861,99.2736
1138,1139,3460,1173,4248,331.995,65.7,24.3,99.965
1139,1140,7389,1539,4267,150.205,22.5536,67.4464,99.8579
1140,1141,2002,1751,4238,326.441,48.8682,41.1318,99.9929
1141,1142,671,1117,4233,317.761,1.93988,88.0601,99.9951
1142,1143,752,2699,4241,350.19,74.1642,15.8358,99.9897
1143,1144,2547,3512,4248,328.606,17.7583,72.2417,98.0426
1144,1145,600,2273,4244,317.817,37.8353,52.1647,99.8311
1145,1146,1454,3123,4258,316.521,56.8279,33.1721,99.9935
1146,1147,9014,728,4288,139.70600000000002,2.16037,87.8396,99.9922
1147,1148,1609,1709,4264,310.735,55.0752,34.9248,99.9577
1148,1149,4347,3353,4276,137.814,66.8903,23.1097,99.9542
1149,1150,23895,1094,4370,319.014,7.633889999999999,82.3661,99.8955
1150,1151,14919,1904,4334,149.33700000000005,14.4774,75.5226,99.8654
1151,1152,18041,1233,4358,332.575,24.2224,65.7776,99.9063
1152,1153,1568,622,4280,145.588,35.87699999999999,54.12300000000001,99.9963
1153,1154,3205,1639,4281,138.351,64.351,25.649,99.8807
1154,1155,2390,1454,4287,137.90200000000002,24.6094,65.3906,99.9517
1155,1156,75159,467,4503,137.929,31.496,58.504,65.2806
1156,1157,3550,2745,4291,323.033,65.2108,24.7892,99.9897
1157,1158,4928,3506,4319,147.168,4.23286,85.7671,98.5016
1158,1159,10944,2224,4331,327.81,79.8831,10.1169,99.9696
1159,1160,12157,1376,4350,133.702,34.2686,55.7314,99.9645
1160,1161,10596,3026,4324,144.954,33.8708,56.1292,99.9371
1161,1162,26631,1613,4391,136.81799999999998,30.3528,59.6472,99.6432
1162,1163,8388,3202,4340,143.605,4.44068,85.5593,99.9461
1163,1164,28934,272,4372,322.841,13.3299,76.6701,95.2447
1164,1165,1412,492,4313,148.342,36.7335,53.2665,99.9837
1165,1166,1221,121,4323,135.14700000000002,43.6247,46.3753,99.9511
1166,1167,3930,2582,4341,143.225,42.1437,47.8563,99.8266
1167,1168,2567,3140,4326,136.72799999999998,33.3124,56.6876,99.9947
1168,1169,93612,2558,4500,148.3,3.69272,86.3073,94.7138
1169,1170,6503,745,4367,318.217,13.1377,76.8623,99.9949
1170,1171,1051,1436,4329,147.77700000000004,24.9452,65.0548,99.9493
1171,1172,4159,2596,4378,314.298,47.1329,42.8671,99.9601
1172,1173,2367,2924,4347,328.64,68.5508,21.4492,99.9786
1173,1174,713,658,4340,333.9290000000001,43.2872,46.7128,99.8788
1174,1175,8035,3544,4401,145.636,28.9251,61.0749,99.8842
1175,1176,37510,787,4472,131.155,72.1175,17.8825,96.6423
1176,1177,3243,1823,4368,324.943,79.7675,10.2325,99.9804
1177,1178,5165,2471,4368,319.393,35.3365,54.6635,99.9696
1178,1179,3102,1498,4374,136.139,2.22588,87.7741,99.9453
1179,1180,4720,1775,4386,323.847,1.23237,88.7676,99.6109
1180,1181,2547,2966,4373,318.187,67.7143,22.2857,99.9571
1181,1182,5180,499,4410,319.376,30.9396,59.0604,99.9917
1182,1183,22454,2847,4455,317.163,49.5437,40.4563,99.8431
1183,1184,1437,3118,4390,139.954,68.7398,21.2602,99.9756
1184,1185,10793,3216,4446,142.31,27.812,62.188,99.9427
1185,1186,6650,433,4432,141.65200000000004,9.45232,80.5477,99.9719
1186,1187,12275,3027,4439,147.07,52.7925,37.2075,99.988
1187,1188,4904,2016,4422,321.61,19.9646,70.0354,99.9917
1188,1189,15777,1338,4448,139.52200000000002,63.8898,26.1102,99.9843
1189,1190,546,1465,4404,136.409,35.1052,54.8948,99.9706
1190,1191,518,695,4422,119.704,86.2231,3.77694,99.9886
1191,1192,7605,931,4447,134.526,48.8451,41.1549,99.878
1192,1193,15461,2141,4465,138.903,39.9418,50.0582,99.9032
1193,1194,1651,1746,4433,143.07399999999996,38.5034,51.4966,99.986
1194,1195,4144,1505,4446,338.969,55.4813,34.5187,99.9932
1195,1196,2610,557,4450,139.501,35.7321,54.2679,99.9718
1196,1197,16757,180,4484,144.29,16.9957,73.0043,98.7566
1197,1198,27417,3115,4541,321.302,4.1383,85.8617,99.6824
1198,1199,33221,1095,4527,142.688,27.341,62.659,99.7614
1199,1200,960,1833,4437,325.346,21.3404,68.6596,99.9921
1200,1201,2372,3496,4450,138.827,13.8188,76.1812,99.9674
1201,1202,1595,1151,4459,149.10399999999996,70.6708,19.3292,99.9803
1202,1203,774,2520,4452,179.991,80.2075,9.79252,99.9803
1203,1204,733,1886,4449,138.791,39.4926,50.5074,99.9945
1204,1205,13489,2012,4510,315.119,23.2448,66.7552,99.9836
1205,1206,2801,377,4470,317.584,35.6849,54.3151,99.9889
1206,1207,1365,3539,4475,139.286,18.3858,71.6142,99.8398
1207,1208,5423,2942,4517,314.85,60.7285,29.2715,99.5269
1208,1209,24057,1825,4525,63.3987,84.6011,5.39895,98.7525
1209,1210,13790,3309,4552,141.957,22.6408,67.3592,99.7957
1210,1211,2832,1464,4508,145.715,29.4272,60.5728,99.9816
1211,1212,4313,1399,4512,326.524,49.2854,40.7146,99.9511
1212,1213,8879,1519,4548,313.486,0.448639,89.5514,99.8439
1213,1214,7994,3514,4550,146.486,3.17696,86.823,83.9001
1214,1215,22639,1706,4579,322.036,25.911,64.089,99.9683
1215,1216,1452,894,4530,322.8,4.05039,85.9496,99.0184
1216,1217,12434,2180,4608,320.343,34.5952,55.4048,99.748
1217,1218,3427,1362,4570,142.64700000000005,14.7849,75.2151,99.9338
1218,1219,555,2223,4544,310.01,45.6129,44.3871,99.8001
1219,1220,2018,2736,4562,336.827,68.7286,21.2714,99.4924
1220,1221,3163,2101,4585,323.744,10.7765,79.2235,99.9969
1221,1222,1363,757,4570,156.732,9.80653,80.1935,99.9812
1222,1223,19606,935,4616,149.64700000000005,20.9244,69.0756,99.4932
1223,1224,8127,2924,4606,136.611,36.7176,53.2824,99.7543
1224,1225,2038,1421,4585,314.275,1.57826,88.4217,99.982
1225,1226,1339,2810,4572,322.922,12.6491,77.3509,99.9745
1226,1227,1784,125,4581,321.524,10.0257,79.9743,99.9768
1227,1228,1551,1298,4582,323.262,5.29366,84.7063,99.9867
1228,1229,11342,1570,4626,136.575,27.406,62.594,99.3544
1229,1230,4277,623,4605,147.505,6.86568,83.1343,99.9905
1230,1231,4798,1100,4617,325.139,37.374,52.62600000000001,99.9544
1231,1232,3145,2784,4609,133.69799999999998,57.3847,32.6153,99.9676
1232,1233,1978,1992,4596,144.673,77.0266,12.9734,99.9929
1233,1234,748,1143,4590,138.27700000000002,19.2229,70.7771,99.9956
1234,1235,8572,733,4626,146.58700000000005,38.4823,51.5177,99.9762
1235,1236,4009,1968,4638,326.35,44.8317,45.1683,99.9379
1236,1237,3037,3229,4610,33.8355,73.2457,16.7543,99.9683
1237,1238,1572,2455,4607,149.058,72.1812,17.8188,99.9836
1238,1239,652,324,4607,146.433,22.2644,67.7356,99.9272
1239,1240,1830,1203,4608,144.336,33.7251,56.2749,99.9758
1240,1241,748,1457,4615,119.607,74.3683,15.6317,99.9784
1241,1242,9316,2461,4642,315.675,29.1607,60.8393,99.808
1242,1243,10008,1267,4640,140.719,4.32099,85.679,99.6114
1243,1244,1791,145,4625,317.442,34.2436,55.7564,99.98
1244,1245,3441,3509,4628,139.898,20.5152,69.4848,99.2836
1245,1246,1686,2696,4614,143.561,2.34603,87.654,99.9599
1246,1247,1346,3031,4610,316.515,10.2346,79.7654,99.9393
1247,1248,1534,2298,4620,150.053,64.7875,25.2125,99.9551
1248,1249,926,451,4620,145.74200000000005,65.4715,24.5285,99.9843
1249,1250,521,2859,4620,317.41,52.0722,37.9278,99.9781
1250,1251,1462,373,4628,143.63299999999995,66.486,23.514,99.987
1251,1252,2469,1826,4645,138.283,34.0851,55.9149,99.8846
1252,1253,633,2124,4641,332.37,23.5734,66.4266,99.8911
1253,1254,792,326,4642,108.933,75.916,14.084,99.9967
1254,1255,1979,2092,4660,150.308,28.2581,61.7419,99.6899
1255,1256,674,3173,4654,322.781,3.04503,86.955,99.9758
1256,1257,768,599,4648,147.638,38.0474,51.9526,99.9392
1257,1258,519,459,4650,153.22,26.3432,63.6568,99.9873
1258,1259,1697,2036,4667,147.594,11.8883,78.1117,99.8834
1259,1260,1051,2832,4671,182.611,4.49295,85.507,99.9617
1260,1261,896,2305,4670,317.35,4.98511,85.0149,99.7101
1261,1262,623,2257,4668,264.295,30.8811,59.1189,99.9037
1262,1263,900,1464,4669,321.309,7.61172,82.3883,99.0002
1263,1264,915,2756,4679,51.7502,38.9367,51.0633,99.5434
