,Grain No.,Size [Pixel],center x-coordinate,center y-coordinate,mean azimuth [degree],mean latitude [degree],mean colatitude [degree],Regelungsgrad [%]
0,1,770,171,205,208.065,2.88959,87.1104,99.989
1,2,516,274,213,131.292,16.784000000000002,73.21600000000002,99.9857
2,3,8905,184,316,319.772,6.70258,83.2974,99.9523
3,4,8041,647,270,307.277,26.2057,63.7943,99.9023
4,5,12339,374,255,131.355,17.6632,72.3368,99.9633
5,6,1042,938,233,316.017,25.7237,64.2763,99.9542
6,7,11621,994,281,141.735,14.5809,75.4191,99.9528
7,8,4186,518,250,331.971,70.2351,19.7649,99.8162
8,9,38824,1967,305,319.052,10.2586,79.7414,98.533
9,10,1427,241,264,146.606,47.7545,42.2455,99.7955
10,11,33662,2485,368,137.155,23.2946,66.7054,99.8729
11,12,3182,752,270,336.5490000000001,69.8437,20.1563,99.9168
12,13,18638,1341,331,140.987,23.0669,66.9331,99.9551
13,14,542,1689,250,321.963,12.4966,77.5034,99.8885
14,15,1041,1273,268,144.707,31.3915,58.6085,99.9326
15,16,3613,1537,290,138.86700000000002,15.8953,74.1047,99.9436
16,17,2860,1422,273,123.349,18.5523,71.4477,99.9217
17,18,6275,2896,302,147.075,66.2045,23.7955,99.9645
18,19,50911,2272,380,174.993,72.1635,17.8365,99.9134
19,20,2500,3289,289,206.672,74.2232,15.7768,99.9014
20,21,20632,3394,329,320.505,16.2288,73.7712,99.7986
21,22,4791,3075,294,318.543,29.5257,60.4743,99.9422
22,23,3662,2755,290,281.4840000000001,83.7617,6.23835,99.9823
23,24,1426,886,276,319.173,72.7761,17.2239,99.3978
24,25,530,1672,278,322.506,35.613,54.387,99.9609
25,26,1568,2616,282,138.77100000000002,59.9465,30.0535,99.7806
26,27,517,2867,270,119.16,66.3379,23.6621,99.741
27,28,2125,2554,281,310.84,53.9765,36.0235,99.9574
28,29,1643,2983,289,309.413,16.8063,73.1937,99.8687
29,30,5584,3159,329,316.3520000000001,45.719,44.28100000000001,99.9023
30,31,1565,554,292,150.026,46.9034,43.0966,99.9187
31,32,21275,1634,387,315.206,66.4224,23.5776,99.2959
32,33,13381,1213,358,137.773,1.46133,88.5387,99.792
33,34,11386,782,317,327.014,73.0592,16.9408,99.8934
34,35,3709,1472,320,137.028,2.0042,87.9958,99.9898
35,36,43727,952,410,321.939,8.05615,81.9438,99.183
36,37,690,2651,301,142.659,51.0316,38.9684,99.9432
37,38,532,3232,302,158.66899999999995,68.6516,21.3484,99.879
38,39,4536,1694,327,319.259,74.1235,15.8765,99.98
39,40,22621,1925,421,314.617,19.6747,70.3253,99.8848
40,41,6284,302,340,144.361,44.5161,45.4839,99.9057
41,42,1643,470,319,320.348,39.3804,50.6196,99.9856
42,43,2641,391,327,318.194,18.0943,71.9057,99.9978
43,44,37716,2969,412,141.921,52.75899999999999,37.241,99.9002
44,45,1400,3220,336,147.043,59.8034,30.1966,99.9735
45,46,12053,544,392,293.742,80.4359,9.56414,97.1846
46,47,687,2606,328,139.94799999999998,23.5377,66.4623,99.9955
47,48,8557,2752,370,260.877,83.2636,6.73642,99.9669
48,49,528,2901,341,309.756,16.8741,73.1259,99.9476
49,50,5390,3275,369,167.821,64.4001,25.5999,99.9203
50,51,7331,1812,379,323.865,64.1229,25.8771,99.9734
51,52,2723,2660,372,321.273,14.8398,75.1602,99.5528
52,53,1558,1508,366,310.866,68.1381,21.8619,99.8607
53,54,691,3508,362,146.906,61.5641,28.4359,99.9581
54,55,3796,2597,387,308.741,60.0141,29.9859,99.9664
55,56,10584,736,415,141.437,53.4957,36.5043,99.9103
56,57,17947,295,447,315.836,14.4748,75.5252,99.4658
57,58,9392,418,419,137.144,17.9322,72.0678,99.9589
58,59,5490,189,437,149.779,58.2106,31.7894,99.804
59,60,4092,1381,404,140.099,17.8283,72.1717,99.9939
60,61,824,3450,383,314.22,11.3649,78.6351,99.9897
61,62,7250,642,425,315.862,72.4449,17.5551,99.8542
62,63,16859,3179,444,148.79399999999995,86.0503,3.94965,99.9865
63,64,2656,2095,427,311.146,75.1719,14.8281,99.9501
64,65,4514,1156,432,140.183,13.6121,76.3879,99.8957
65,66,5254,1759,448,306.35,32.8408,57.1592,99.9046
66,67,97321,1612,707,315.9770000000001,18.1503,71.8497,99.7351
67,68,6986,1046,449,153.513,37.1702,52.8298,99.9839
68,69,3321,3417,450,169.74599999999995,59.2976,30.7024,99.9873
69,70,5806,2763,456,138.467,45.6269,44.3731,99.9457
70,71,3429,3475,450,170.062,59.5796,30.4204,99.968
71,72,684,3302,425,137.187,58.3659,31.6341,99.9828
72,73,1586,2829,434,146.19899999999996,27.3875,62.6125,99.9728
73,74,861,2426,439,137.925,2.7132400000000003,87.2868,99.9982
74,75,4051,2669,462,244.503,78.5988,11.4012,99.9802
75,76,810,1366,444,168.986,69.1572,20.8428,99.9708
76,77,14864,1365,496,166.93400000000003,63.9364,26.0636,99.564
77,78,1627,1583,463,319.021,72.5353,17.4647,99.9772
78,79,6182,2133,495,149.704,57.9212,32.0788,99.8143
79,80,7043,3329,514,147.594,62.1697,27.8303,99.7971
80,81,576,772,469,321.911,73.311,16.689,99.955
81,82,2945,1236,486,300.701,72.6621,17.3379,99.9907
82,83,119576,2904,656,321.444,7.002269999999998,82.9977,99.4635
83,84,3400,2441,492,301.938,62.8373,27.1627,99.977
84,85,1171,3072,498,156.681,73.7856,16.2144,99.9428
85,86,3022,1862,500,305.319,64.5939,25.4061,99.9086
86,87,18016,2245,558,137.83,30.0909,59.9091,99.8488
87,88,10475,580,530,136.94299999999998,66.9872,23.0128,99.7984
88,89,1236,477,485,315.538,40.8524,49.1476,99.9632
89,90,19098,1113,542,156.80100000000004,49.7052,40.2948,99.8341
90,91,20582,959,576,134.289,15.2703,74.7297,99.9123
91,92,537,2047,498,139.86700000000002,3.86212,86.1379,99.3475
92,93,1994,1665,504,158.464,67.1435,22.8565,99.8995
93,94,16154,2014,563,139.392,11.003,78.997,99.8886
94,95,2700,3253,504,310.317,58.5512,31.4488,99.9464
95,96,3416,1795,527,139.029,36.9662,53.0338,99.4933
96,97,546,3393,500,322.388,19.4535,70.5465,99.9862
97,98,5702,784,528,135.37,59.916,30.084,99.4905
98,99,1554,2566,527,251.238,82.2684,7.731619999999999,99.749
99,100,656,217,510,317.853,34.5029,55.4971,99.9231
100,101,10173,2438,560,144.995,73.1001,16.8999,99.2819
101,102,7412,1749,566,132.58700000000002,23.8684,66.1316,99.9269
102,103,15674,453,644,136.13299999999998,9.6372,80.3628,97.2963
103,104,572,2174,520,151.22299999999996,81.8622,8.137839999999999,99.9526
104,105,1632,336,540,313.026,21.0395,68.9605,99.9535
105,106,946,671,530,317.846,29.2659,60.7341,99.997
106,107,12235,1281,580,152.75,50.2588,39.7412,99.9787
107,108,2436,195,557,318.378,49.3512,40.6488,99.9749
108,109,1553,382,555,320.742,60.1272,29.8728,99.9877
109,110,5290,1884,567,326.576,57.144,32.856,99.9901
110,111,2931,3467,569,313.331,3.184,86.816,99.9399
111,112,2367,1184,593,317.456,0.849701,89.1503,99.9436
112,113,5781,295,586,139.4,6.59053,83.4095,99.9961
113,114,2869,700,572,321.8590000000001,66.6997,23.3003,99.9672
114,115,14736,1660,620,136.55,41.0736,48.9264,99.9664
115,116,706,3253,565,315.4890000000001,53.3252,36.6748,99.8367
116,117,8368,1404,605,133.041,15.128,74.872,99.9897
117,118,1370,1585,580,141.637,69.3263,20.6737,99.9858
118,119,13351,3384,640,137.67600000000002,43.4891,46.5109,99.9531
119,120,9061,2611,620,137.717,77.937,12.0631,99.9714
120,121,10110,798,632,321.316,17.9509,72.0491,99.9416
121,122,1118,505,590,317.745,12.6184,77.3816,99.9227
122,123,9576,2360,637,316.308,35.6316,54.3684,99.9794
123,124,503,639,587,186.536,72.5943,17.4057,99.9768
124,125,17657,188,714,141.20600000000005,9.56035,80.4397,99.9886
125,126,623,1823,593,320.811,46.9564,43.0436,99.9875
126,127,7474,556,634,328.1330000000001,45.5372,44.4628,99.9957
127,128,19391,317,661,312.887,41.3017,48.6983,99.7184
128,129,12715,3121,654,316.161,18.3868,71.6132,99.8611
129,130,2312,3262,608,304.623,59.0876,30.9124,99.8286
130,131,1780,710,614,140.68200000000002,21.3409,68.6591,99.9952
131,132,3999,2152,632,171.304,79.1191,10.8809,99.9765
132,133,11755,2529,664,318.988,5.9775800000000014,84.0224,99.8416
133,134,8832,3476,711,135.855,41.2951,48.7049,99.8284
134,135,21516,2238,695,147.172,15.327,74.673,99.9906
135,136,3726,3018,643,134.876,77.4459,12.5541,99.9797
136,137,2730,634,638,141.751,11.2296,78.7704,99.7616
137,138,2180,1849,644,143.43200000000004,62.8639,27.1361,99.9933
138,139,13032,1941,695,325.01,3.71086,86.2891,99.9596
139,140,32925,1161,751,141.276,4.02566,85.9743,99.0333
140,141,1384,1808,637,317.837,9.29183,80.7082,99.9971
141,142,32753,970,704,318.116,4.6847900000000005,85.3152,99.51
142,143,2499,2019,648,322.64,18.044,71.956,99.9408
143,144,3063,3231,652,139.031,8.50985,81.4902,99.9942
144,145,2645,3302,680,312.1690000000001,58.3623,31.6377,99.9815
145,146,2232,1756,664,291.582,75.007,14.993,99.9943
146,147,8732,700,690,139.80700000000002,51.5725,38.4275,99.9754
147,148,5144,2057,695,322.903,54.1604,35.8396,99.9479
148,149,733,1131,679,149.14,16.3833,73.6167,99.7621
149,150,21563,2426,748,314.881,49.5674,40.4326,99.7959
150,151,671,1359,679,317.263,16.4417,73.5583,99.9893
151,152,6798,551,727,315.754,40.1861,49.8139,99.9902
152,153,26986,3192,777,149.35,71.1863,18.8137,99.604
153,154,16355,1378,769,303.83,83.4699,6.53009,99.9474
154,155,1350,2625,735,168.933,74.5401,15.4599,99.9678
155,156,58600,2713,911,320.87,9.5934,80.4066,98.9504
156,157,535,777,719,138.411,55.7076,34.2924,99.9968
157,158,581,3378,718,313.776,16.8374,73.1626,99.9933
158,159,2433,2707,741,312.314,45.7874,44.2126,99.9912
159,160,17062,601,804,159.766,62.6322,27.3678,99.9371
160,161,799,2761,739,147.711,31.5878,58.4122,99.7983
161,162,1692,2100,749,316.583,41.1654,48.8346,99.9967
162,163,808,2050,737,327.284,12.4549,77.5451,99.9939
163,164,5866,3400,782,139.338,11.5455,78.4545,99.8289
164,165,5473,418,764,149.438,62.6477,27.3523,99.967
165,166,3955,3281,776,320.897,19.1699,70.8301,99.9986
166,167,2728,2162,769,312.659,48.5673,41.4327,99.9874
167,168,931,1217,759,138.524,30.8437,59.1563,99.9287
168,169,8024,734,806,302.893,67.8456,22.1544,99.9937
169,170,806,324,764,148.529,3.07425,86.9258,99.9857
170,171,20505,912,835,144.643,56.1308,33.8692,99.8715
171,172,1575,1982,783,316.645,49.2004,40.7996,99.9188
172,173,1626,2031,772,320.656,49.2954,40.7046,99.9735
173,174,752,3336,775,134.334,68.8162,21.1838,99.9829
174,175,2210,2222,795,139.493,1.3691799999999998,88.6308,99.9922
175,176,2400,803,809,122.173,67.7868,22.2132,98.9814
176,177,1108,1254,788,141.52100000000004,6.54456,83.4554,99.9987
177,178,877,1165,782,143.653,0.903069,89.0969,99.9953
178,179,11031,236,845,335.19699999999995,1.75941,88.2406,99.9821
179,180,3550,364,805,322.582,37.7265,52.2735,99.9915
180,181,1636,2557,809,131.31,68.6374,21.3626,99.9758
181,182,16130,2089,843,138.197,18.5997,71.4003,98.8441
182,183,2305,2510,825,323.133,6.51663,83.4834,99.972
183,184,5033,3353,835,144.44899999999996,44.4011,45.5989,99.9891
184,185,946,2923,814,137.954,52.1699,37.8301,99.9765
185,186,2667,1772,816,137.98,4.40762,85.5924,99.9948
186,187,2540,469,823,142.814,1.6847599999999998,88.3152,99.9802
187,188,8099,1188,851,313.652,40.106,49.894,99.9815
188,189,639,2294,814,309.415,55.1728,34.8272,99.9761
189,190,744,2871,813,240.313,79.8696,10.1304,99.9954
190,191,15708,2389,875,133.446,28.3098,61.6902,99.9239
191,192,764,1232,824,324.64,0.555573,89.4444,99.9936
192,193,896,1705,820,323.097,0.5630189999999999,89.43700000000003,99.9939
193,194,40271,2230,951,140.689,1.3213,88.6787,99.3552
194,195,730,1949,832,147.795,48.0254,41.9746,99.8383
195,196,16975,1386,868,166.15400000000002,77.7493,12.2507,99.9083
196,197,1168,302,853,310.487,17.4252,72.5748,99.9873
197,198,33077,2902,958,148.687,50.5828,39.4172,99.7775
198,199,34207,1733,968,137.878,36.6197,53.3803,99.6059
199,200,3238,3486,885,324.022,3.70275,86.2972,99.9582
200,201,2931,1721,863,316.822,65.8887,24.1113,99.9914
201,202,11649,370,899,142.062,5.41547,84.5845,99.9571
202,203,2205,165,874,148.47,9.02509,80.9749,99.983
203,204,10520,1906,916,169.33,69.3867,20.6133,99.8447
204,205,25097,2538,938,314.628,60.0728,29.9272,99.6896
205,206,744,2665,862,125.476,68.6021,21.3979,99.972
206,207,916,628,877,315.775,28.1225,61.8775,99.913
207,208,1634,3412,877,163.236,73.7411,16.2589,99.9431
208,209,3124,3154,883,140.281,7.4846,82.5154,99.985
209,210,5999,701,900,136.798,2.0742,87.9258,99.8694
210,211,6075,478,904,322.4190000000001,37.3082,52.6918,99.9051
211,212,744,1981,875,153.906,70.1768,19.8232,99.9819
212,213,4596,781,901,131.922,20.9017,69.0983,99.988
213,214,578,290,897,314.678,20.0089,69.9911,99.9352
214,215,20003,3291,1012,140.561,7.4994,82.5006,99.9272
215,216,7465,1185,944,143.245,1.812,88.18799999999997,99.891
216,217,1089,563,896,317.355,29.1782,60.8218,99.9851
217,218,3640,3340,917,278.837,72.8978,17.1022,99.9948
218,219,7099,2019,957,223.33,78.1933,11.8067,99.8345
219,220,2578,2079,930,299.165,67.184,22.816,99.972
220,221,5487,982,929,315.75,33.1553,56.8447,99.9632
221,222,16857,1347,956,133.63299999999998,16.9908,73.0092,99.9571
222,223,1048,259,916,147.87,3.67325,86.3268,99.289
223,224,23754,578,986,142.856,25.0557,64.9443,99.9481
224,225,5764,3153,944,160.373,64.1172,25.8828,99.9807
225,226,12689,908,972,319.635,2.66305,87.337,99.4296
226,227,598,564,925,149.734,56.0149,33.9851,99.9823
227,228,5787,1559,954,145.725,1.70789,88.2921,99.7807
228,229,5369,3397,967,137.701,40.2392,49.7608,99.9142
229,230,33081,1217,1043,318.306,7.28785,82.7122,99.7624
230,231,4347,203,962,189.74,75.4555,14.5445,99.9335
231,232,1522,3073,949,154.053,72.1075,17.8926,99.9875
232,233,6646,3028,993,313.4770000000001,0.563606,89.4364,99.9605
233,234,14719,273,1008,324.893,42.9709,47.0291,77.5431
234,235,5492,430,999,308.351,39.7064,50.2936,99.666
235,236,649,2406,972,307.934,64.9577,25.0423,99.9627
236,237,1891,3477,998,315.0490000000001,23.5499,66.4501,99.9805
237,238,1843,840,995,175.36,79.3741,10.6259,99.9864
238,239,989,3336,981,146.0,22.4426,67.5574,99.8367
239,240,17060,1918,1041,138.33,6.79418,83.2058,99.9612
240,241,17803,3135,1098,316.401,21.271,68.729,99.1464
241,242,5463,3213,1023,327.841,36.732,53.268,99.9892
242,243,1302,2382,993,312.062,60.974,29.026,99.9922
243,244,6782,1821,1057,169.048,71.7442,18.2558,99.6992
244,245,1749,1484,1009,321.836,26.7778,63.2222,99.8698
245,246,1221,776,1001,318.84,49.8356,40.1644,99.8223
246,247,5210,710,1037,133.874,82.6417,7.358289999999998,99.9248
247,248,20428,2471,1101,312.4,41.7064,48.2936,92.8881
248,249,1366,1544,1017,322.22,66.6365,23.3635,99.657
249,250,946,1040,1030,145.22299999999996,71.6424,18.3576,99.955
250,251,1149,2064,1024,136.49200000000002,8.46917,81.5308,99.9436
251,252,1359,1615,1036,137.725,4.68649,85.3135,99.9721
252,253,3748,3422,1040,140.267,23.9749,66.0251,99.9391
253,254,13447,944,1072,320.078,64.1317,25.8683,99.9307
254,255,12646,770,1108,324.981,35.6599,54.3401,99.816
255,256,641,3088,1035,309.585,20.8124,69.1876,99.9331
256,257,12682,2595,1093,312.764,21.2702,68.7298,99.9421
257,258,1955,1569,1062,332.287,56.7713,33.2287,99.9818
258,259,9915,311,1072,145.954,14.5653,75.4347,95.6146
259,260,8837,1398,1078,316.991,77.7472,12.2528,99.9862
260,261,4609,2116,1082,257.579,86.3315,3.668530000000001,99.9724
261,262,1257,3048,1061,138.24,8.177810000000001,81.8222,99.8036
262,263,3236,1507,1070,140.55100000000002,0.17213399999999998,89.8279,99.9579
263,264,12027,2854,1119,313.37,31.0165,58.9835,99.9099
264,265,3088,2053,1094,137.303,6.820689999999999,83.1793,99.9561
265,266,534,2169,1061,313.956,81.783,8.217,99.9916
266,267,4578,2337,1134,299.236,82.3708,7.62915,99.8984
267,268,898,154,1075,138.35,12.2377,77.7623,99.9247
268,269,2023,1153,1069,321.5,14.6766,75.3234,99.8952
269,270,7934,628,1098,324.379,2.94196,87.05799999999998,99.9718
270,271,3322,2381,1104,129.717,17.5171,72.4829,99.9957
271,272,527,2250,1070,132.1,11.5566,78.4434,99.8952
272,273,1497,2291,1078,133.946,11.5892,78.4108,99.9936
273,274,10679,514,1126,325.383,37.0154,52.9846,99.9705
274,275,2061,1055,1092,150.72299999999996,66.9056,23.0944,99.9781
275,276,10353,1597,1150,319.324,1.34911,88.6509,99.8629
276,277,1978,3066,1086,138.274,4.40393,85.5961,99.7508
277,278,29296,964,1232,139.365,25.5676,64.4324,73.6771
278,279,4764,3222,1113,146.174,77.9583,12.0417,99.9911
279,280,3775,429,1111,312.095,15.8859,74.1141,99.9946
280,281,3199,3452,1108,316.972,37.9476,52.0524,99.9432
281,282,1419,2013,1103,217.487,78.5402,11.4598,99.977
282,283,8827,2237,1127,142.202,59.6482,30.3518,99.9806
283,284,1730,3369,1120,153.143,2.30337,87.6966,97.6153
284,285,3106,1119,1122,160.425,68.1787,21.8213,99.9717
285,286,20108,2985,1184,318.1020000000001,26.4597,63.5403,98.7967
286,287,938,3405,1113,142.877,26.4033,63.5967,99.9332
287,288,2910,1185,1118,318.563,29.0914,60.9086,99.9944
288,289,3724,2690,1120,318.689,5.19025,84.8098,99.9413
289,290,1451,302,1115,328.769,1.34867,88.6513,99.7179
290,291,1990,181,1121,350.4,68.2167,21.7833,99.8013
291,292,13791,339,1196,320.4890000000001,22.7177,67.2823,99.9529
292,293,1043,1678,1134,313.733,38.7252,51.2748,99.9775
293,294,41119,1296,1235,329.22,46.2179,43.7821,96.5583
294,295,1909,1897,1129,329.7030000000001,63.1518,26.8482,99.901
295,296,578,3504,1126,315.915,12.9152,77.0848,99.9718
296,297,3758,244,1146,326.206,26.0359,63.9641,99.9906
297,298,4326,2766,1155,140.425,36.5532,53.4468,99.9877
298,299,1391,3268,1156,314.889,51.5728,38.4272,99.9942
299,300,3006,1800,1140,323.565,12.3772,77.6228,99.4832
300,301,10891,2110,1197,277.13,86.899,3.10097,99.9466
301,302,8838,1045,1174,318.749,5.91285,84.0872,99.9978
302,303,4446,1955,1168,149.571,63.3765,26.6235,99.9893
303,304,504,1579,1148,331.163,64.3209,25.6791,99.9582
304,305,43419,1766,1307,322.647,2.1404,87.8596,99.588
305,306,42995,589,1255,316.421,19.5301,70.4699,99.4649
306,307,951,1148,1161,324.749,36.6814,53.3186,99.9899
307,308,1127,2590,1165,314.14,59.8291,30.1709,99.9953
308,309,3148,3411,1179,148.268,70.1562,19.8438,99.9846
309,310,557,2634,1167,136.986,53.3964,36.6036,99.9865
310,311,531,1554,1166,316.771,7.11423,82.8858,99.9694
311,312,26039,202,1310,148.032,45.9614,44.0386,99.0328
312,313,3885,1193,1187,156.94,64.7753,25.2247,99.9775
313,314,3502,451,1192,139.214,47.5036,42.4964,99.9787
314,315,3478,1648,1191,129.725,8.0469,81.9531,99.9884
315,316,1843,2676,1175,150.023,41.2345,48.7655,99.997
316,317,1263,279,1189,150.44299999999996,36.0422,53.9578,99.9886
317,318,1236,2017,1190,140.499,52.2343,37.7657,99.9791
318,319,14094,2487,1243,317.9840000000001,3.82561,86.1744,99.0744
319,320,6660,3342,1227,135.548,48.2147,41.7853,99.9634
320,321,1160,1891,1188,132.653,18.2631,71.7369,99.9882
321,322,4764,2215,1209,151.061,47.7475,42.2525,99.8971
322,323,8688,2619,1239,312.088,78.9832,11.0168,99.9051
323,324,15206,2831,1231,139.83,7.2240199999999986,82.77600000000002,99.9956
324,325,1405,399,1202,311.521,18.3515,71.6485,99.9827
325,326,11492,2360,1253,320.166,20.0374,69.9626,99.71
326,327,14937,3266,1268,131.569,30.2096,59.7904,99.9578
327,328,9782,2719,1270,317.964,70.3697,19.6303,99.9471
328,329,11106,3117,1240,320.91,19.7328,70.2672,99.9757
329,330,1507,1855,1233,133.424,18.3309,71.6691,99.9899
330,331,3800,1394,1233,141.442,45.524,44.476000000000006,99.9026
331,332,796,1977,1221,322.9840000000001,59.7338,30.2662,99.9306
332,333,2766,380,1251,149.648,37.8898,52.1102,99.9869
333,334,1825,1906,1244,144.139,0.429688,89.5703,99.984
334,335,9534,3445,1275,315.592,24.3845,65.6155,99.983
335,336,2634,1293,1253,144.665,19.5124,70.4876,99.9929
336,337,2157,435,1256,313.252,32.1789,57.8211,99.9919
337,338,5929,2265,1266,136.329,4.56577,85.4342,99.9402
338,339,6031,2025,1274,315.732,27.8261,62.1739,99.9821
339,340,1416,2906,1262,313.985,28.833,61.167,99.9978
340,341,14692,1340,1346,141.55700000000004,51.075,38.925,99.8993
341,342,19592,1591,1345,147.077,59.5944,30.4056,99.9113
342,343,2133,1709,1280,160.71,72.5504,17.4496,99.9845
343,344,4146,898,1280,105.192,83.5138,6.4862199999999985,99.9961
344,345,970,152,1274,139.899,10.1128,79.8872,99.9844
345,346,1042,826,1277,91.2052,80.6224,9.37758,99.9959
346,347,56448,3007,1417,145.248,49.658,40.342,99.323
347,348,2365,1955,1293,136.817,14.2652,75.7348,99.7223
348,349,1222,2140,1287,318.44,57.7369,32.2631,99.9939
349,350,8368,2856,1335,286.395,81.0396,8.96044,99.9876
350,351,24881,865,1368,147.262,58.2854,31.7146,99.9591
351,352,736,257,1301,316.408,57.3528,32.6472,99.965
352,353,3233,1502,1317,137.653,21.6357,68.3643,99.9473
353,354,4673,3210,1325,149.798,59.5596,30.4404,99.9839
354,355,1919,381,1309,134.982,16.8121,73.1879,99.9915
355,356,32897,2370,1392,318.465,31.9303,58.0697,99.6773
356,357,4637,2570,1329,138.659,48.5144,41.4856,99.9696
357,358,1080,3108,1307,316.069,26.8354,63.1646,99.9859
358,359,554,1755,1310,324.821,7.87282,82.1272,99.739
359,360,4261,2184,1342,148.94899999999996,54.0851,35.9149,99.876
360,361,5111,1435,1339,157.951,63.9215,26.0785,99.9813
361,362,977,2646,1323,315.173,23.6534,66.3466,99.9788
362,363,2737,2471,1329,220.673,75.2916,14.7084,99.9272
363,364,1698,2077,1325,322.89,11.7274,78.2726,99.989
364,365,791,2318,1322,135.32299999999998,0.970871,89.0291,99.9971
365,366,8675,560,1368,276.199,67.623,22.377,99.9282
366,367,8750,1950,1360,323.568,11.2302,78.7698,99.9195
367,368,683,1717,1333,148.159,60.4925,29.5075,99.9691
368,369,2086,334,1349,301.99,54.426,35.574,99.9722
369,370,113297,1086,1618,142.395,10.1092,79.8908,98.2766
370,371,934,3383,1336,168.072,69.9758,20.0242,99.9879
371,372,13252,322,1434,306.222,29.2221,60.7779,99.9305
372,373,5347,2662,1377,298.318,80.7202,9.27977,99.9819
373,374,14540,2763,1425,316.1690000000001,10.5121,79.4879,99.6137
374,375,1730,668,1365,280.047,68.1331,21.8669,99.9927
375,376,4035,3361,1380,147.993,55.9084,34.0916,99.8496
376,377,732,3436,1362,131.941,27.3005,62.6995,99.9835
377,378,2856,2084,1379,140.16,17.2524,72.7476,99.9165
378,379,8987,3264,1413,313.952,29.5874,60.4126,99.9903
379,380,13927,519,1448,143.007,6.21194,83.7881,99.8762
380,381,3941,400,1415,134.674,28.4997,61.5003,99.9774
381,382,22183,1478,1496,136.732,23.5654,66.4346,99.8369
382,383,1662,621,1401,315.298,31.3463,58.6537,99.9652
383,384,12515,2611,1447,315.129,24.8401,65.1599,99.9858
384,385,2140,1012,1415,142.526,5.75819,84.2418,99.9108
385,386,64523,2244,1534,313.4170000000001,17.2327,72.7673,99.8671
386,387,7773,3441,1487,138.84799999999998,58.7623,31.2377,99.9195
387,388,16667,758,1449,136.569,54.6017,35.3983,99.7623
388,389,35883,1812,1542,140.656,51.0705,38.9295,99.453
389,390,1268,3395,1428,135.361,75.5902,14.4098,99.9923
390,391,1748,1978,1437,148.321,47.4444,42.5556,99.9105
391,392,990,2038,1449,140.205,18.3047,71.6953,99.9722
392,393,805,1549,1437,323.039,6.3556300000000014,83.6444,99.9942
393,394,5368,1933,1482,312.654,28.2846,61.7154,99.976
394,395,68183,1339,1617,140.874,1.05851,88.9415,99.9135
395,396,73744,341,1718,140.829,9.04006,80.9599,99.7399
396,397,3407,3219,1467,145.86700000000005,44.0968,45.9032,99.9823
397,398,15236,1663,1499,140.266,18.1258,71.8742,99.9712
398,399,1400,847,1470,309.078,47.8306,42.1694,99.9745
399,400,81499,2986,1651,319.303,17.9096,72.0904,99.5607
400,401,803,1559,1473,150.056,58.4672,31.5328,99.9258
401,402,2308,3369,1481,320.595,6.91904,83.081,99.9976
402,403,1729,2555,1490,271.37,80.1501,9.84994,99.986
403,404,1302,160,1488,146.09,48.2652,41.7348,99.266
404,405,14131,663,1536,316.147,20.0633,69.9367,99.9284
405,406,30813,516,1599,309.8590000000001,55.005,34.995,99.7428
406,407,12710,3337,1544,135.534,23.8135,66.1865,99.8053
407,408,8230,2494,1542,141.69799999999995,31.4897,58.5103,99.8617
408,409,3325,897,1521,130.601,57.0034,32.9966,99.247
409,410,503,1998,1499,154.99,49.8248,40.1752,99.9767
410,411,12157,2782,1552,139.865,14.5572,75.4428,99.9621
411,412,1264,299,1520,152.876,29.3932,60.6068,99.9394
412,413,9781,3236,1556,137.19899999999998,34.2081,55.7919,99.6063
413,414,1983,2095,1527,152.207,52.7476,37.2524,99.6186
414,415,1943,2704,1521,145.59,26.5744,63.4256,99.9879
415,416,528,2659,1507,147.412,48.3252,41.6748,99.9958
416,417,28851,1614,1655,144.06799999999996,5.77848,84.2215,99.5211
417,418,896,397,1523,147.048,31.656,58.344,99.9921
418,419,12055,2039,1584,135.254,8.078289999999999,81.9217,99.9421
419,420,2825,2430,1564,298.314,55.6672,34.3328,99.9324
420,421,2866,2576,1553,141.616,19.9079,70.0921,99.9732
421,422,2067,369,1550,140.695,5.75462,84.2454,99.9869
422,423,2810,2654,1567,209.011,86.5136,3.48641,99.7977
423,424,39600,856,1665,310.493,33.6135,56.3865,99.9685
424,425,1764,2848,1576,142.227,0.279358,89.7206,99.9752
425,426,544,946,1569,162.748,77.1703,12.8297,99.9186
426,427,5192,356,1605,146.07399999999996,68.0164,21.9836,99.9867
427,428,34931,656,1726,132.653,18.5211,71.4789,99.7522
428,429,12882,1926,1652,315.543,8.29768,81.7023,99.9617
429,430,53857,2539,1684,137.225,19.5016,70.4984,99.5864
430,431,4495,3025,1653,318.599,0.478249,89.5218,99.9663
431,432,521,3223,1620,138.148,60.2173,29.7827,99.9984
432,433,12911,3285,1691,321.22,14.6385,75.3615,99.879
433,434,2833,2801,1635,322.03,6.2423199999999985,83.7577,99.9928
434,435,26133,2151,1701,317.025,38.4427,51.5573,99.9797
435,436,13815,3395,1678,138.957,46.7549,43.2451,99.9475
436,437,1983,1179,1651,137.863,20.5309,69.4691,99.9668
437,438,5767,3200,1695,140.579,61.871,28.129,99.9822
438,439,1240,1510,1680,127.899,55.1508,34.8492,99.9821
439,440,8685,1822,1708,138.11700000000002,2.96118,87.0388,99.9612
440,441,5913,2025,1689,317.001,27.3003,62.6997,99.9882
441,442,2396,164,1710,323.473,85.0119,4.98806,99.9592
442,443,5062,531,1728,318.907,35.9917,54.0083,99.9674
443,444,31920,237,1820,148.14,42.1621,47.8379,99.9285
444,445,648,1695,1709,149.678,74.7675,15.2325,99.9601
445,446,1635,1733,1722,156.032,73.7393,16.2607,99.9948
446,447,15505,1974,1779,146.293,7.9900600000000015,82.0099,98.688
447,448,543,2426,1734,302.168,61.6561,28.3439,99.8144
448,449,764,3459,1746,134.97,11.42,78.58,99.9836
449,450,970,1496,1746,166.84900000000005,70.9678,19.0322,99.9934
450,451,4701,2726,1782,136.54,5.93424,84.0658,99.998
451,452,6186,2258,1785,311.785,62.703,27.297,99.9432
452,453,1467,2891,1764,132.993,21.4113,68.5887,99.9894
453,454,4033,1114,1778,188.249,71.9381,18.0619,99.985
454,455,1651,1753,1768,94.4741,78.3932,11.6068,99.9855
455,456,924,3172,1762,324.939,45.7678,44.2322,99.9858
456,457,4863,1199,1801,313.994,1.7743099999999998,88.2257,99.9371
457,458,1977,1454,1783,236.469,78.6452,11.3548,99.9549
458,459,5556,2452,1805,316.514,3.98079,86.0192,99.949
459,460,2029,3408,1769,308.337,9.83723,80.1628,99.9929
460,461,655,1353,1773,169.515,77.6834,12.3166,99.9932
461,462,7035,1693,1818,143.351,21.5392,68.4608,99.8983
462,463,4483,1813,1792,312.022,18.6278,71.3722,99.9867
463,464,8906,688,1843,158.77100000000004,69.2341,20.7659,99.8473
464,465,10264,2505,1847,324.395,15.2796,74.7204,99.9668
465,466,4801,3251,1798,134.628,14.2394,75.7606,99.9414
466,467,12717,3156,1869,142.865,5.90817,84.0918,99.8326
467,468,6186,3375,1823,313.517,62.8265,27.1735,99.9464
468,469,13964,1315,1852,305.945,12.6498,77.3502,99.9228
469,470,9059,1575,1820,157.409,71.6903,18.3097,99.9564
470,471,6111,788,1805,133.97299999999998,6.55955,83.4405,99.9611
471,472,2804,2181,1808,146.783,27.7511,62.2489,99.9755
472,473,1550,2655,1796,138.766,26.3872,63.6128,99.9597
473,474,737,2570,1798,136.877,24.049,65.95100000000001,99.933
474,475,928,2129,1806,317.612,27.468000000000004,62.532,99.9653
475,476,21568,2900,1864,307.822,40.8946,49.1054,99.9549
476,477,4600,2377,1832,309.7290000000001,35.9541,54.0459,99.9855
477,478,1854,2604,1829,321.427,0.452065,89.5479,98.0002
478,479,1388,3090,1816,143.625,47.2664,42.7336,99.9849
479,480,3327,1407,1833,241.043,83.4383,6.5617100000000015,99.973
480,481,1802,1876,1839,223.33900000000003,87.3154,2.6846400000000004,99.9493
481,482,8183,2778,1862,143.25,39.4053,50.5947,99.9678
482,483,5041,1146,1854,180.57,71.8203,18.1797,99.49
483,484,77805,746,2048,137.137,10.1424,79.8576,97.5967
484,485,1195,3056,1835,142.67600000000004,33.7435,56.2565,99.9943
485,486,15567,2664,1896,144.928,54.6584,35.3416,99.9751
486,487,639,2285,1840,315.843,3.32942,86.6706,99.9831
487,488,3193,3208,1851,136.04,24.3532,65.6468,99.9775
488,489,3997,1232,1885,145.245,78.1856,11.8144,99.737
489,490,3629,2234,1870,145.266,16.6159,73.3841,99.8751
490,491,663,1829,1845,256.981,83.8723,6.12766,99.9836
491,492,3953,3313,1864,137.519,23.7147,66.2853,99.9838
492,493,558,2120,1846,317.629,29.4872,60.5128,99.987
493,494,1482,2171,1863,314.599,1.21778,88.7822,99.9967
494,495,4364,1936,1874,137.005,13.4948,76.5052,99.8852
495,496,10876,1594,1898,325.326,0.6735,89.3265,98.7798
496,497,11608,3039,1906,316.637,3.04482,86.9552,99.6605
497,498,4116,2053,1865,139.513,17.7247,72.2753,99.9664
498,499,1735,1795,1866,128.244,51.0876,38.9124,99.9833
499,500,935,525,1872,324.306,20.9852,69.0148,99.9875
500,501,1602,1470,1897,277.54,67.7269,22.2731,99.979
501,502,2395,3422,1896,312.714,9.329,80.671,99.9918
502,503,3333,2267,1914,314.927,2.29153,87.7085,99.993
503,504,6606,2344,1908,141.736,12.3553,77.6447,99.7198
504,505,3139,1741,1900,143.17700000000005,11.2852,78.7148,99.9563
505,506,706,2547,1895,146.167,14.4411,75.5589,99.9957
506,507,956,2144,1891,148.545,21.1016,68.8984,99.9871
507,508,3228,1856,1910,313.069,21.0372,68.9628,99.9917
508,509,1098,148,1898,322.725,5.59442,84.4056,99.9684
509,510,953,1413,1901,320.127,3.5891,86.4109,99.357
510,511,5011,3260,1917,315.616,8.11698,81.883,99.9823
511,512,4960,984,1972,322.401,55.5322,34.4678,98.6364
512,513,1695,661,1904,148.601,39.6924,50.3076,99.9556
513,514,11099,2001,1965,319.079,17.5521,72.4479,99.9355
514,515,651,1120,1897,162.715,78.8129,11.1871,99.9631
515,516,2567,2447,1930,138.64600000000002,23.4004,66.5996,99.9646
516,517,6311,2088,1958,325.465,55.1076,34.8924,99.935
517,518,5361,611,1938,309.592,14.0956,75.9044,99.9622
518,519,8222,897,1957,325.249,15.8492,74.1508,99.9898
519,520,17135,1797,1993,137.46,48.3624,41.6376,99.7333
520,521,5057,2182,1958,133.35299999999998,8.88228,81.1177,99.9846
521,522,867,348,1935,322.495,3.0630900000000003,86.9369,99.9567
522,523,14501,2578,1975,289.112,71.3387,18.6613,99.8895
523,524,10940,1341,1982,310.56,25.4517,64.5483,99.8737
524,525,2330,1437,1939,310.822,12.1335,77.8665,99.9846
525,526,2497,2782,1957,142.47799999999995,34.7104,55.2896,99.9562
526,527,500,3406,1927,319.546,16.1336,73.8664,99.9775
527,528,25138,296,2004,138.793,67.5963,22.4037,99.7405
528,529,1151,163,1944,141.972,5.541,84.459,99.9376
529,530,8387,3142,2025,143.688,60.9718,29.0282,99.8603
530,531,1602,1499,1957,191.667,76.7504,13.2496,99.9387
531,532,9011,2427,1991,316.569,12.1501,77.8499,99.938
532,533,5042,1689,1967,324.678,52.3032,37.6968,99.9596
533,534,523,2219,1942,140.33700000000002,3.76925,86.2308,99.9385
534,535,2918,476,1951,134.778,68.4782,21.5218,99.9516
535,536,7491,3392,1980,310.5420000000001,7.0647,82.9353,99.9505
536,537,3824,1588,1972,138.627,1.6601,88.3399,99.943
537,538,8449,1244,2032,302.277,61.4047,28.5953,99.7479
538,539,3980,3075,1985,139.066,4.23318,85.7668,99.9864
539,540,24324,2318,2046,125.731,71.1525,18.8475,99.6571
540,541,7883,532,1998,137.162,10.1156,79.8844,99.9611
541,542,1323,2828,1971,297.557,70.0875,19.9125,99.9697
542,543,7909,3247,2000,320.582,3.5741,86.4259,99.9948
543,544,2621,1911,1991,138.388,17.7906,72.2094,99.9859
544,545,66000,2689,2100,136.06,5.9922900000000014,84.0077,98.9774
545,546,11573,1135,2029,311.648,17.5807,72.4193,99.8781
546,547,590,2139,1981,144.035,20.6745,69.3255,99.9754
547,548,10314,2990,2020,135.942,46.7316,43.2684,99.4206
548,549,10531,638,2039,290.879,71.0934,18.9066,99.9865
549,550,638,1516,1988,145.55700000000004,47.4294,42.5706,99.9771
550,551,869,924,2003,142.012,3.50058,86.4994,99.9692
551,552,1676,440,2028,318.423,13.9745,76.0255,99.9799
552,553,15493,1491,2050,320.6140000000001,64.2587,25.7414,99.7822
553,554,7344,3360,2049,77.6495,78.6323,11.3677,99.9216
554,555,2116,1973,2049,132.128,24.0019,65.9981,99.7026
555,556,14645,2172,2073,323.956,27.7508,62.2492,99.9837
556,557,1636,1635,2038,320.231,6.42561,83.5744,99.9805
557,558,11896,975,2100,317.873,2.5390200000000003,87.461,56.4213
558,559,5175,1695,2067,138.436,8.90812,81.0919,99.9934
559,560,10860,1860,2082,275.18,67.9779,22.0221,99.9271
560,561,1015,890,2048,144.175,18.6223,71.3777,99.9673
561,562,4417,2544,2061,312.499,45.4507,44.5493,99.4299
562,563,628,1202,2044,133.565,16.598,73.402,99.9916
563,564,1099,2620,2054,135.111,26.4395,63.5605,99.9233
564,565,4200,3281,2094,192.671,79.0562,10.9438,99.9866
565,566,14012,284,2111,317.6670000000001,2.55265,87.4473,99.9935
566,567,1093,2088,2072,315.744,17.3341,72.6659,99.9924
567,568,980,3453,2075,298.264,69.5533,20.4467,99.9772
568,569,5113,498,2078,138.865,2.08642,87.9136,99.9553
569,570,2040,3216,2076,226.995,80.6646,9.33537,99.8929
570,571,5192,1318,2084,321.492,9.3571,80.6429,99.9726
571,572,22555,209,2185,143.344,10.5369,79.4631,99.5321
572,573,8074,1154,2118,141.2,44.5867,45.4133,99.9783
573,574,586,2719,2079,138.08700000000002,17.4705,72.5295,99.9911
574,575,793,1398,2084,280.431,66.222,23.778,99.9858
575,576,33300,1570,2200,148.252,58.2505,31.7495,99.9227
576,577,7406,3026,2114,147.412,74.4293,15.5707,99.9518
577,578,15565,438,2150,132.33100000000002,17.3603,72.6397,99.7023
578,579,25809,1996,2192,140.623,42.4865,47.5135,99.8403
579,580,690,910,2106,137.713,5.06573,84.9343,99.993
580,581,3855,3411,2120,138.697,56.7354,33.2646,99.956
581,582,2503,2086,2147,134.013,13.3077,76.6923,99.9449
582,583,673,1072,2116,323.32,4.9229400000000005,85.0771,99.9903
583,584,667,1206,2124,315.14,16.398,73.602,99.9743
584,585,1790,1390,2128,128.183,25.474,64.52600000000001,99.9746
585,586,4636,2267,2147,131.85299999999998,20.7331,69.2669,99.978
586,587,1910,1907,2132,314.347,12.8345,77.1655,99.9913
587,588,7034,1463,2156,134.459,33.2405,56.7595,99.7818
588,589,23473,2188,2240,322.081,0.6089100000000001,89.3911,99.6921
589,590,19917,3373,2206,140.872,15.1123,74.8877,99.9874
590,591,13700,3224,2183,161.64,81.0073,8.99268,99.9679
591,592,24685,1756,2238,138.781,48.6296,41.3704,99.9195
592,593,7178,2747,2176,318.5490000000001,35.5677,54.4323,99.9742
593,594,3041,3108,2150,138.787,28.4726,61.5274,99.9925
594,595,11194,1351,2252,315.389,17.8063,72.1937,99.7937
595,596,528,1297,2139,325.596,58.9735,31.0265,99.9859
596,597,929,893,2169,135.03799999999998,53.5085,36.4915,99.9734
597,598,65599,1004,2297,140.635,6.29585,83.7042,99.1961
598,599,1068,2854,2172,318.434,35.5737,54.4263,99.9688
599,600,1342,2945,2171,320.474,21.0319,68.9681,99.9882
600,601,7947,952,2245,314.827,48.1136,41.8864,99.7964
601,602,1262,2894,2182,326.835,3.34331,86.6567,99.786
602,603,5280,3060,2201,138.553,0.405022,89.595,99.9966
603,604,8304,801,2212,315.633,23.4623,66.5377,99.7806
604,605,4254,2360,2198,324.9170000000001,63.63399999999999,26.366,99.9774
605,606,668,1893,2183,139.856,59.04600000000001,30.954,99.8601
606,607,583,1863,2183,139.741,53.5927,36.4073,99.6902
607,608,832,3140,2192,135.922,21.3886,68.6114,99.9902
608,609,709,1377,2196,193.462,71.9945,18.0055,99.963
609,610,2743,1656,2215,326.992,43.0654,46.9346,99.9832
610,611,2582,562,2218,148.914,75.8913,14.1087,99.9846
611,612,2407,2995,2224,137.36700000000002,18.7915,71.2085,99.9377
612,613,2821,891,2224,139.885,6.4436300000000015,83.5564,99.9915
613,614,3779,1428,2239,321.654,6.92315,83.0769,99.9371
614,615,29468,2522,2284,135.542,0.865967,89.134,73.5084
615,616,845,2821,2215,322.526,53.5092,36.4908,99.9963
616,617,3623,2930,2229,311.079,55.3504,34.6496,99.965
617,618,3204,2103,2247,139.058,3.96432,86.0357,99.9889
618,619,30266,380,2302,313.3,37.3351,52.6649,99.9519
619,620,1186,2682,2227,131.92700000000002,5.18854,84.8115,99.9512
620,621,6606,3123,2263,178.42700000000005,84.1155,5.884530000000002,99.9673
621,622,815,2277,2232,309.201,66.4196,23.5804,99.996
622,623,2364,2412,2247,313.485,50.093,39.907,99.9847
623,624,5345,2793,2264,299.714,69.1806,20.8194,99.955
624,625,7597,2313,2281,314.457,45.1465,44.8535,99.9165
625,626,24462,1255,2333,94.8796,88.86,1.13995,100.024
626,627,3240,3043,2271,135.629,0.821785,89.1782,99.9797
627,628,17804,3283,2323,315.492,1.0285,88.9715,99.623
628,629,1287,2694,2266,307.716,61.3393,28.6607,99.9937
629,630,637,263,2260,321.647,22.3331,67.6669,99.9803
630,631,4715,1955,2305,136.641,22.5126,67.4874,99.8958
631,632,6970,2903,2304,322.013,28.2459,61.7541,99.9901
632,633,7080,160,2317,320.951,0.679268,89.3207,99.9008
633,634,3608,819,2293,313.074,27.6291,62.3709,99.9876
634,635,574,870,2271,144.804,63.1342,26.8658,99.99
635,636,1433,2993,2290,323.543,6.44878,83.5512,99.5927
636,637,2745,2140,2305,319.183,34.8061,55.1939,99.9917
637,638,1040,3417,2296,136.261,9.77735,80.2226,99.995
638,639,540,211,2288,321.259,14.1027,75.8973,99.8908
639,640,3545,2647,2315,135.414,35.0614,54.9386,99.9914
640,641,6444,518,2323,317.279,16.3642,73.6358,99.8678
641,642,7030,2737,2323,142.937,31.0689,58.9311,99.9826
642,643,2733,1832,2311,318.9240000000001,15.8231,74.1769,99.9959
643,644,11485,666,2362,289.615,63.7991,26.2009,99.9902
644,645,5623,1886,2344,130.283,61.383,28.617,99.9385
645,646,5332,1429,2340,134.653,13.0189,76.9811,99.9696
646,647,6460,570,2373,136.661,6.03189,83.9681,99.9832
647,648,6154,3136,2349,312.083,20.1393,69.8607,99.6613
648,649,5086,2037,2353,341.576,70.3926,19.6074,99.9918
649,650,7670,3039,2373,323.765,64.0248,25.9752,99.8263
650,651,21779,2297,2414,306.648,19.1865,70.8135,99.8281
651,652,879,3432,2331,314.143,3.78527,86.2147,99.9882
652,653,6091,3412,2394,316.776,46.8385,43.1615,99.9476
653,654,717,2318,2347,310.593,62.4604,27.5396,99.9496
654,655,12142,2806,2400,133.91899999999998,8.31737,81.6826,99.9278
655,656,3275,1493,2371,317.661,14.403,75.597,99.9872
656,657,7922,234,2393,314.843,69.828,20.172,99.9881
657,658,3173,2595,2367,320.173,53.5263,36.4737,99.9922
658,659,16962,2106,2439,153.28,57.0658,32.9342,99.8363
659,660,5540,2938,2380,309.938,7.81319,82.1868,99.8968
660,661,1748,1653,2359,156.289,57.0501,32.9499,99.8685
661,662,3325,1573,2376,313.82,40.1117,49.8883,99.9858
662,663,7806,2700,2426,145.44,22.8443,67.1557,99.9577
663,664,13537,461,2435,148.884,60.4886,29.5114,99.4304
664,665,20277,1829,2446,296.5420000000001,68.3485,21.6515,99.9793
665,666,2095,1944,2383,303.784,18.6696,71.3304,99.9814
666,667,5401,1370,2403,320.9190000000001,20.1206,69.8794,99.9117
667,668,3505,2529,2398,326.552,16.5832,73.4168,99.9648
668,669,5932,1701,2405,324.047,35.3424,54.6576,99.9856
669,670,5341,3203,2412,141.326,5.85141,84.1486,99.984
670,671,1240,146,2401,132.7,29.0439,60.9561,99.8505
671,672,1339,1984,2428,152.895,52.8946,37.1054,99.9497
672,673,812,1628,2406,144.401,55.99800000000001,34.001999999999995,99.9795
673,674,1122,3117,2404,302.931,68.5817,21.4183,99.9902
674,675,1142,1175,2407,140.815,30.0782,59.9218,99.9612
675,676,4957,2653,2427,325.774,9.45602,80.544,99.9042
676,677,1525,1441,2418,305.88,78.9505,11.0495,99.9699
677,678,527,926,2404,306.683,85.0574,4.94264,99.9961
678,679,8138,1051,2441,320.096,17.2329,72.7671,99.9596
679,680,14965,810,2475,316.866,42.9585,47.0415,99.2612
680,681,10636,996,2493,322.342,25.7443,64.2557,99.6089
681,682,1599,614,2431,135.879,2.5849,87.4151,99.9928
682,683,4872,3298,2452,316.971,26.4393,63.5607,99.9889
683,684,879,332,2427,152.094,61.1108,28.8892,99.9718
684,685,8993,172,2483,318.927,14.4943,75.5057,99.9676
685,686,1648,1126,2453,155.623,60.2072,29.7928,99.9725
686,687,3405,1586,2438,159.05700000000004,61.5587,28.4413,99.9865
687,688,11595,2913,2479,141.39600000000004,56.07899999999999,33.921,99.9403
688,689,2344,3156,2455,132.55100000000002,11.4878,78.5122,99.9937
689,690,784,569,2435,318.316,14.119000000000002,75.881,99.9806
690,691,683,3357,2440,318.365,12.3725,77.6275,99.9516
691,692,3393,2463,2454,141.579,5.724469999999998,84.2755,99.9791
692,693,803,2994,2437,138.24,2.31076,87.6892,99.9754
693,694,18906,2355,2497,325.198,10.52,79.48,99.9762
694,695,1267,3084,2449,138.858,17.5604,72.4396,99.977
695,696,1069,917,2460,325.358,49.6295,40.3705,99.9793
696,697,1554,1170,2453,319.5370000000001,21.747,68.253,99.9116
697,698,607,1953,2461,147.237,54.4859,35.5141,99.9792
698,699,5701,2557,2485,316.836,79.7927,10.2073,99.9172
699,700,3514,1389,2469,316.894,7.567639999999999,82.4324,99.9956
700,701,5598,376,2473,308.675,12.2075,77.7925,99.969
701,702,3106,3021,2472,319.297,13.4773,76.5227,99.9495
702,703,17741,1263,2523,330.849,72.0398,17.9602,99.8497
703,704,1127,1979,2466,150.694,53.2372,36.7628,99.9856
704,705,4723,3225,2483,146.495,21.2343,68.7657,99.9798
705,706,6247,1517,2495,141.505,15.287,74.71300000000002,99.9381
706,707,7189,1616,2505,141.135,0.998032,89.00200000000002,99.0676
707,708,642,290,2459,317.3520000000001,25.7612,64.2388,99.9782
708,709,625,3376,2465,311.7940000000001,6.73295,83.2671,99.9609
709,710,11029,594,2514,316.222,5.45665,84.5434,99.9739
710,711,27650,3324,2598,314.092,18.2693,71.7307,97.1913
711,712,4673,264,2502,151.721,63.9275,26.0725,99.4449
712,713,1160,1449,2486,315.212,72.5724,17.4276,99.9795
713,714,8004,1723,2523,136.465,23.2111,66.7889,99.8876
714,715,10060,1992,2537,136.116,49.6132,40.3868,99.1259
715,716,4676,2800,2510,324.373,10.8937,79.1063,99.4934
716,717,1012,3070,2504,308.773,68.2995,21.7005,99.9837
717,718,987,2663,2499,257.627,75.0722,14.9278,99.9616
718,719,2217,1893,2518,316.277,27.7505,62.2495,99.6652
719,720,1332,1110,2509,204.676,76.3778,13.6222,99.9614
720,721,1723,2486,2528,143.547,12.4629,77.5371,99.9227
721,722,1288,1411,2516,137.27,24.5924,65.4076,99.9068
722,723,870,3147,2517,320.547,9.74213,80.2579,99.9857
723,724,659,511,2519,133.709,56.7569,33.2431,99.517
724,725,1507,3441,2526,303.156,35.0769,54.9231,99.9476
725,726,5554,381,2543,323.907,57.1263,32.8737,99.978
726,727,9264,2610,2561,138.965,2.35956,87.6404,99.7288
727,728,5086,2988,2560,319.49,24.6593,65.3407,99.8355
728,729,4741,3245,2546,45.3066,80.7696,9.23043,99.8733
729,730,5510,685,2553,314.386,25.1821,64.8179,99.9877
730,731,1096,912,2525,319.81,2.2543,87.7457,99.9841
731,732,1297,2753,2547,141.72,0.390785,89.6092,99.849
732,733,6814,1458,2588,310.617,1.62604,88.374,99.6645
733,734,621,2914,2535,324.954,3.96718,86.0328,99.9533
734,735,776,2712,2539,297.568,74.0452,15.9548,99.6397
735,736,1767,3108,2552,289.519,83.2947,6.70533,99.8792
736,737,3206,3180,2568,140.19,20.0084,69.9916,99.9612
737,738,3633,214,2563,133.424,24.6837,65.3163,99.9906
738,739,2878,978,2564,326.403,1.39093,88.6091,99.9792
739,740,3164,2222,2576,314.1,5.25738,84.7426,99.7553
740,741,1795,537,2556,142.83700000000005,57.9338,32.0662,99.9645
741,742,22248,2101,2613,134.094,28.3583,61.6417,99.898
742,743,3882,1383,2600,308.1620000000001,29.9813,60.0187,99.9379
743,744,1786,2265,2557,323.127,23.8823,66.1177,99.9896
744,745,7715,739,2606,137.93200000000002,3.61504,86.385,99.6473
745,746,2052,902,2564,133.111,77.8489,12.1511,99.9898
746,747,1319,454,2562,142.907,7.1018300000000005,82.8982,99.6486
747,748,2077,1542,2569,333.514,55.2877,34.7123,99.9898
748,749,5306,1648,2597,327.002,81.7845,8.21552,99.8997
749,750,23949,1060,2649,142.95600000000005,16.8177,73.1823,99.6082
750,751,1283,1868,2564,132.614,50.5576,39.4424,99.985
751,752,3744,2402,2586,318.231,29.5455,60.4545,99.9842
752,753,874,149,2564,141.713,36.0238,53.9762,99.9688
753,754,1775,319,2581,151.667,70.4275,19.5725,99.9826
754,755,2225,1164,2577,311.9290000000001,53.1698,36.8302,99.9268
755,756,7681,820,2616,137.363,15.3553,74.6447,99.934
756,757,6658,1792,2613,125.68,9.28748,80.7125,99.972
757,758,1600,2907,2579,322.502,60.4451,29.5549,99.9774
758,759,3183,2696,2603,311.562,20.4881,69.5119,99.9956
759,760,9367,217,2624,149.132,55.8121,34.1879,99.9385
760,761,3038,432,2606,323.5,4.02714,85.9729,99.9861
761,762,1396,1721,2584,135.886,15.316,74.684,99.9975
762,763,4147,2772,2616,141.438,63.3321,26.6679,99.9789
763,764,8245,546,2619,320.849,31.1991,58.8009,99.9612
764,765,3044,2364,2621,315.4890000000001,27.2457,62.7543,99.9185
765,766,11420,2497,2635,148.548,55.7597,34.2403,99.8642
766,767,1443,2839,2594,323.763,59.9325,30.0675,99.9875
767,768,5577,3020,2633,139.352,27.548,62.452,99.9181
768,769,1228,1001,2606,136.518,3.9669,86.0331,99.994
769,770,4508,3139,2634,313.408,42.0471,47.9529,99.9876
770,771,2992,629,2626,320.632,38.9133,51.0867,99.9886
771,772,9582,2286,2651,137.869,6.75484,83.2452,99.8236
772,773,4143,1316,2636,317.7340000000001,14.9639,75.0361,99.9746
773,774,15074,1908,2735,137.63,7.2065,82.7935,99.4602
774,775,1808,366,2622,328.0730000000001,7.38681,82.6132,99.982
775,776,4056,1514,2634,166.18200000000004,83.6811,6.31893,99.9881
776,777,9563,2640,2664,320.319,5.27948,84.7205,99.8392
777,778,697,919,2620,317.192,75.283,14.717,99.9213
778,779,810,1159,2625,311.391,54.8109,35.1891,99.9791
779,780,11388,1237,2677,135.974,13.6011,76.3989,99.8119
780,781,1218,3194,2630,319.095,16.6329,73.3671,99.9907
781,782,531,2898,2621,143.911,51.429,38.571,99.9061
782,783,14598,1740,2686,323.7870000000001,0.560326,89.4397,99.6438
783,784,8981,3092,2703,135.553,15.1425,74.8575,99.9865
784,785,741,1907,2636,138.718,11.4003,78.5997,99.8273
785,786,4287,1586,2672,133.903,27.9621,62.0379,99.9878
786,787,665,2911,2641,135.879,64.2781,25.7219,99.7186
787,788,57772,722,2779,320.888,5.573180000000002,84.4268,99.635
788,789,677,2721,2647,140.053,35.2856,54.7144,99.95
789,790,1383,3416,2646,318.664,12.8425,77.1575,99.9872
790,791,611,2859,2647,124.365,31.4925,58.5075,99.9793
791,792,6794,403,2683,316.961,24.2389,65.7611,99.9926
792,793,10947,3332,2719,141.995,5.16935,84.8307,99.9464
793,794,11278,670,2693,143.032,29.6783,60.3217,99.8769
794,795,547,2976,2661,141.455,32.0174,57.9826,99.8164
795,796,17322,314,2741,136.681,44.275,45.725,99.793
796,797,12456,496,2726,142.685,0.0620193,89.93799999999997,99.5973
797,798,2796,2249,2696,132.233,29.0574,60.9426,99.9606
798,799,10624,1373,2720,313.631,29.8971,60.1029,99.913
799,800,8872,2811,2726,133.556,30.2209,59.7791,99.951
800,801,512,3449,2668,309.157,31.8614,58.1386,99.912
801,802,3567,1864,2701,304.573,77.6491,12.3509,99.9458
802,803,6258,2729,2719,143.835,38.441,51.559,99.9926
803,804,1202,2604,2678,138.281,10.7386,79.2614,99.9963
804,805,4951,2903,2699,250.814,85.2807,4.71933,99.9738
805,806,15694,2080,2739,140.065,59.6577,30.3423,99.983
806,807,1990,557,2687,167.342,68.2394,21.7606,99.98
807,808,7892,2429,2731,134.7,56.9364,33.0636,99.8285
808,809,779,3401,2696,133.572,34.2765,55.7235,99.9729
809,810,1552,157,2702,314.252,22.3197,67.6803,99.9785
810,811,4518,2501,2718,135.365,49.9469,40.0531,99.9841
811,812,5866,2198,2734,134.61,18.1318,71.8682,99.9973
812,813,8547,3013,2761,293.773,80.4465,9.55355,99.9449
813,814,671,1516,2702,132.208,24.1879,65.8121,99.9771
814,815,29283,1506,2867,314.307,20.8031,69.1969,98.8158
815,816,1881,1212,2729,323.1740000000001,81.9048,8.095239999999999,99.9765
816,817,3730,3426,2772,97.6593,81.4281,8.57193,99.9764
817,818,3352,1574,2742,316.226,61.484,28.516,99.7215
818,819,877,224,2738,319.387,7.413989999999999,82.586,99.9562
819,820,7269,2017,2810,288.92,79.0107,10.9894,99.9811
820,821,5473,2344,2754,317.061,44.0037,45.9963,99.991
821,822,3482,2586,2747,133.579,52.1046,37.8954,99.9853
822,823,2512,1140,2746,318.44,24.3885,65.6115,99.3277
823,824,2388,1017,2744,141.859,62.0247,27.9753,99.9575
824,825,4004,920,2759,319.562,40.3494,49.6506,99.9624
825,826,3184,1778,2764,142.475,61.3019,28.6981,99.9772
826,827,1229,2275,2757,318.2390000000001,16.4937,73.5063,99.9973
827,828,1242,168,2758,313.607,53.9205,36.0795,99.9422
828,829,6748,1283,2795,139.727,21.4467,68.5533,99.9794
829,830,2138,1714,2771,314.822,16.703,73.297,99.9978
830,831,710,1075,2765,135.937,19.3191,70.6809,99.9718
831,832,8582,1636,2801,313.901,13.2115,76.7885,99.9893
832,833,5431,2958,2792,139.525,21.0755,68.9245,99.9257
833,834,8315,1186,2804,133.54,1.19091,88.8091,99.9868
834,835,2074,2545,2782,314.595,28.2168,61.7832,99.2157
835,836,42907,3154,2899,321.659,1.41293,88.5871,99.0226
836,837,3214,3095,2785,139.417,23.7608,66.2392,99.9742
837,838,5311,423,2810,159.727,72.5928,17.4072,99.9687
838,839,21245,2647,2848,155.138,56.2699,33.7301,99.832
839,840,973,1013,2782,140.627,53.5363,36.4637,99.9832
840,841,7290,2511,2839,313.692,18.5749,71.4251,99.5937
841,842,9406,2865,2820,142.222,4.34679,85.6532,99.7462
842,843,4429,1392,2818,199.145,82.1396,7.86044,99.9752
843,844,2119,2396,2804,316.058,27.5073,62.4927,99.9966
844,845,772,3155,2804,249.063,82.6676,7.33235,99.9913
845,846,9844,2163,2838,323.628,25.3281,64.6719,99.9325
846,847,5249,163,2853,131.904,4.658,85.34200000000001,99.8716
847,848,6478,225,2833,323.024,8.38309,81.6169,99.9948
848,849,1951,1749,2813,144.343,45.6067,44.3933,99.9736
849,850,3043,2322,2829,173.955,64.4621,25.5379,99.9665
850,851,2163,992,2821,324.88,29.3263,60.6737,99.9963
851,852,11739,3313,2881,136.393,12.7193,77.2807,99.9449
852,853,690,1108,2822,129.334,1.78499,88.215,99.9021
853,854,60513,1022,2961,320.695,0.8937069999999999,89.1063,99.3381
854,855,1106,1088,2848,328.497,36.5744,53.4256,99.9852
855,856,2740,3402,2844,135.892,34.1593,55.8407,99.992
856,857,7927,815,2870,157.024,52.4499,37.5501,99.9814
857,858,650,1564,2830,136.625,25.8551,64.1449,99.9348
858,859,9468,1886,2890,314.693,41.25899999999999,48.74100000000001,99.9053
859,860,977,1698,2848,144.997,60.238,29.762,99.9581
860,861,8879,2251,2880,166.15599999999995,71.3425,18.6575,99.983
861,862,1365,3459,2866,312.592,33.4721,56.5279,99.9241
862,863,2685,1793,2856,318.255,4.0052,85.9948,99.7213
863,864,6883,2411,2876,149.74,53.0171,36.9829,99.9856
864,865,2442,1250,2861,137.923,13.592,76.408,99.999
865,866,4428,1367,2876,160.446,57.4621,32.5379,99.9562
866,867,1413,576,2870,138.718,29.2251,60.7749,99.9908
867,868,3546,1648,2891,320.671,22.2932,67.7068,99.9611
868,869,4114,1302,2896,314.505,5.19511,84.8049,99.9933
869,870,1315,1981,2866,317.925,29.5307,60.4693,99.9893
870,871,14682,2751,2926,136.149,2.18168,87.8183,99.9036
871,872,1620,2994,2869,303.784,84.9255,5.07447,99.985
872,873,4673,421,2890,139.335,43.3097,46.6903,99.9533
873,874,1979,281,2873,316.358,32.0485,57.9515,99.9944
874,875,8461,2011,2910,143.659,57.1083,32.8917,99.8569
875,876,901,356,2873,138.582,6.81539,83.1846,99.9875
876,877,4242,1182,2896,319.077,40.6972,49.3028,99.9502
877,878,10873,2862,2912,228.974,79.4422,10.5578,99.965
878,879,603,1417,2888,155.26,61.0128,28.9872,99.8051
879,880,2838,501,2892,149.57299999999995,25.0744,64.9256,99.9726
880,881,3633,1470,2913,320.14,11.7149,78.2851,99.8962
881,882,6386,742,2939,136.918,4.6976900000000015,85.3023,99.9454
882,883,9557,1718,2933,320.718,12.7091,77.2909,99.9644
883,884,3931,2102,2920,325.373,42.0255,47.9745,99.9723
884,885,5411,2333,2935,312.055,40.0135,49.9865,99.9091
885,886,1884,340,2911,137.635,75.3228,14.6772,99.7873
886,887,2853,2953,2924,143.586,38.2723,51.7277,99.8751
887,888,501,1248,2899,287.015,62.4887,27.5113,99.9513
888,889,1524,3421,2911,138.638,3.19236,86.8076,99.9907
889,890,2990,864,2931,305.79,28.5972,61.4028,99.9879
890,891,7683,572,2949,178.483,72.1937,17.8063,99.9635
891,892,6703,179,2946,142.856,28.2645,61.7355,99.8531
892,893,5788,1814,2953,308.339,26.9748,63.0252,99.9605
893,894,12538,251,2984,138.08,7.84037,82.1596,98.0382
894,895,667,3222,2922,314.026,0.753296,89.2467,99.9544
895,896,521,2998,2931,163.73,61.0349,28.9651,99.9853
896,897,850,1359,2933,176.148,76.9589,13.0411,99.9397
897,898,5254,2455,2968,140.737,21.2946,68.7054,99.7738
898,899,2709,2528,2937,149.311,52.3053,37.6947,99.9882
899,900,4298,1245,2953,137.732,13.4203,76.5797,99.9805
900,901,1638,2403,2953,156.392,56.0781,33.9219,99.9889
901,902,6682,382,2982,318.062,1.06695,88.9331,99.721
902,903,2620,2145,2959,306.962,40.6173,49.3827,99.9871
903,904,2113,469,2950,321.438,65.0357,24.9643,99.8697
904,905,892,644,2944,249.942,87.3619,2.63812,99.9948
905,906,8980,3455,2999,323.7990000000001,13.5011,76.4989,99.8989
906,907,5280,3306,2971,309.457,23.1333,66.8667,99.9806
907,908,8065,2227,2979,307.956,9.01296,80.987,99.9884
908,909,1476,3381,2971,124.093,9.98526,80.0147,99.8924
909,910,2615,2600,2968,318.844,43.3374,46.6626,99.9096
910,911,2378,1634,2984,140.52200000000002,37.0464,52.9536,99.9594
911,912,5154,2052,2991,134.9,13.9008,76.0992,99.6962
912,913,4833,1937,3000,146.338,47.1109,42.8891,99.7201
913,914,7864,2701,3026,308.199,72.363,17.637,99.7514
914,915,1767,1388,2987,324.078,0.6864399999999999,89.3136,99.7484
915,916,5482,2268,3041,198.812,70.311,19.689,99.5912
916,917,839,825,2978,323.599,3.57527,86.4247,99.9804
917,918,1034,665,2983,315.006,28.2065,61.7935,99.9936
918,919,798,706,2980,140.884,33.6023,56.3977,99.9815
919,920,4581,2965,3005,310.772,56.5053,33.4947,99.8275
920,921,25065,1324,3091,319.396,8.06612,81.9339,99.8931
921,922,2576,1874,3004,141.711,38.7169,51.2831,99.8464
922,923,2068,867,2998,142.847,11.6797,78.3203,99.8996
923,924,1385,2534,2993,290.829,80.5348,9.46525,99.992
924,925,1611,2863,2989,308.699,78.4043,11.5957,99.9822
925,926,2972,1503,3017,263.703,77.3895,12.6105,99.9175
926,927,6901,796,3030,316.02,13.9011,76.0989,96.2268
927,928,4743,438,3036,343.47,67.9781,22.0219,99.7216
928,929,1899,3218,3018,306.77,12.2087,77.7913,99.9861
929,930,2380,1671,3019,141.502,8.02939,81.9706,99.9311
930,931,1365,1564,3009,318.246,46.2843,43.7157,99.9252
931,932,6868,597,3042,317.538,29.4808,60.5192,98.9846
932,933,8506,3318,3038,318.89,29.4964,60.5036,99.3507
933,934,2893,2353,3036,138.535,12.8262,77.1738,99.9715
934,935,7608,1753,3042,334.155,64.6346,25.3654,99.5522
935,936,4449,2509,3051,322.847,3.17301,86.82700000000001,99.9348
936,937,1815,2908,3030,312.1020000000001,21.9509,68.0491,99.9453
937,938,4895,2591,3041,145.583,29.3546,60.6454,99.9311
938,939,1077,3093,3027,320.442,5.61102,84.389,99.9846
939,940,2050,1222,3043,302.3540000000001,42.9796,47.0204,99.8317
940,941,2686,2786,3050,130.07299999999998,24.6305,65.3695,99.8776
941,942,5873,2147,3051,141.662,0.0864563,89.9135,99.9075
942,943,1382,289,3035,138.34,25.3869,64.6131,99.951
943,944,2922,2850,3051,143.775,57.5467,32.4533,99.5898
944,945,1430,3045,3034,307.144,40.9076,49.0924,99.8052
945,946,6155,1883,3066,139.88,14.7636,75.2364,99.7903
946,947,1857,1981,3046,315.057,11.0872,78.9128,99.9128
947,948,14670,2032,3107,172.764,75.5949,14.4051,99.9336
948,949,2060,143,3057,141.737,29.1893,60.8107,99.9573
949,950,7711,713,3072,132.461,75.1149,14.8851,99.9238
950,951,4721,2418,3069,322.587,57.0925,32.9075,99.8776
951,952,2148,1595,3053,328.94699999999995,56.232,33.768,99.9727
952,953,3352,530,3053,176.104,81.0876,8.91235,99.994
953,954,930,3152,3058,313.781,40.0358,49.9642,98.727
954,955,2268,343,3066,319.45,13.7632,76.2368,99.9491
955,956,963,1042,3064,321.909,2.24084,87.7592,99.9557
956,957,6830,2986,3090,138.016,9.80665,80.1934,99.4468
957,958,23333,327,3150,140.888,6.26814,83.7319,99.1919
958,959,606,180,3065,134.769,52.8624,37.1376,99.9893
959,960,10363,1444,3129,146.408,46.7768,43.2232,99.8953
960,961,8964,1547,3119,142.804,31.8858,58.1142,99.9892
961,962,5026,1144,3096,148.512,17.3117,72.6883,99.9727
962,963,1279,3067,3082,318.017,63.3043,26.6957,99.9421
963,964,4087,2303,3112,144.247,2.42748,87.5725,99.9303
964,965,801,2489,3087,137.34799999999998,4.6120199999999985,85.38799999999998,99.9733
965,966,4889,3261,3096,142.648,32.2397,57.7603,99.9189
966,967,780,3355,3088,323.423,36.6867,53.3133,99.9851
967,968,1048,3454,3094,139.822,24.3533,65.6467,99.9327
968,969,3546,2228,3109,153.122,66.8175,23.1825,99.9865
969,970,1196,2359,3099,324.832,55.7544,34.2456,99.991
970,971,1281,1689,3100,135.31,9.70013,80.2999,99.9979
971,972,2054,3142,3099,138.15200000000002,32.1817,57.8183,99.9952
972,973,786,423,3087,124.317,42.3632,47.6368,99.754
973,974,634,1062,3095,145.411,81.2501,8.74995,99.9483
974,975,1405,1774,3096,138.268,33.6786,56.3214,99.9856
975,976,1062,189,3095,136.711,47.3226,42.6774,99.992
976,977,8533,2149,3144,153.876,13.8445,76.1555,99.9443
977,978,2910,2594,3105,336.122,78.9492,11.0508,99.98
978,979,4632,455,3134,139.028,50.3636,39.6364,99.7629
979,980,16982,961,3139,316.857,16.4225,73.5775,99.9045
980,981,9841,2722,3122,323.492,40.7264,49.2736,99.8312
981,982,4705,576,3147,316.071,10.6734,79.3266,99.2973
982,983,7710,2876,3126,194.147,80.1227,9.87728,99.967
983,984,10112,1862,3135,318.147,20.6221,69.3779,99.9874
984,985,1619,1625,3115,307.2920000000001,33.4197,56.5803,99.9306
985,986,1066,801,3107,309.653,39.1967,50.8033,99.9802
986,987,27436,2465,3268,324.641,9.95665,80.0434,98.5375
987,988,595,3419,3113,322.1140000000001,20.0324,69.9676,99.9806
988,989,977,632,3122,324.099,9.40881,80.5912,99.9053
989,990,3401,1733,3142,321.902,65.4586,24.5414,99.9485
990,991,5513,182,3156,143.327,21.0259,68.9741,99.5654
991,992,12951,3366,3223,314.349,34.0074,55.9926,99.9295
992,993,8220,2510,3163,139.804,12.3793,77.6207,99.9228
993,994,11456,724,3151,321.362,24.9216,65.0784,99.9981
994,995,19153,1149,3186,144.52200000000005,48.2946,41.7054,99.9593
995,996,840,1282,3126,142.67700000000005,22.6982,67.3018,99.995
996,997,946,3163,3136,139.75799999999998,29.521,60.479,99.9793
997,998,779,147,3133,139.293,46.5681,43.4319,99.9874
998,999,1386,3405,3146,315.152,27.2437,62.7563,99.9912
999,1000,14927,1617,3198,140.843,2.262,87.738,99.9462
1000,1001,7690,3261,3162,145.259,22.6037,67.3963,99.9261
1001,1002,22250,3062,3225,142.02,5.58962,84.4104,99.3286
1002,1003,3269,2608,3154,152.165,37.5295,52.4705,99.9929
1003,1004,2687,524,3164,139.754,48.2815,41.7185,99.9676
1004,1005,4910,1268,3181,321.518,59.3221,30.6779,99.9567
1005,1006,5330,2959,3180,145.704,16.174,73.82600000000002,99.9851
1006,1007,2546,3465,3175,321.199,6.16247,83.8375,99.9649
1007,1008,2309,2268,3167,310.6790000000001,11.4318,78.5682,99.9061
1008,1009,3898,2356,3228,142.8,64.7975,25.2025,99.9382
1009,1010,737,2771,3169,332.1140000000001,71.8491,18.1509,99.9939
1010,1011,889,3160,3175,326.6090000000001,58.1894,31.8106,99.9818
1011,1012,1491,825,3187,318.9240000000001,36.815,53.185,99.9945
1012,1013,5000,904,3197,138.628,8.55322,81.4468,99.975
1013,1014,777,2722,3178,319.645,52.4899,37.5101,99.9794
1014,1015,5512,2882,3210,144.178,3.97952,86.0205,99.9663
1015,1016,2996,2688,3206,312.732,10.1554,79.8446,99.943
1016,1017,2545,2810,3201,139.839,32.4436,57.5564,99.8083
1017,1018,3032,3206,3206,324.401,43.052,46.948,99.9976
1018,1019,568,628,3192,141.245,36.4375,53.5625,99.9636
1019,1020,11001,1914,3221,318.838,14.9041,75.0959,98.9116
1020,1021,651,2140,3189,332.392,22.1651,67.8349,99.8649
1021,1022,539,1497,3192,322.588,45.7819,44.2181,99.9914
1022,1023,2844,2029,3206,135.111,11.8149,78.1851,99.8969
1023,1024,523,2466,3192,331.48800000000006,1.17077,88.8292,99.9856
1024,1025,3634,217,3212,142.876,4.131480000000002,85.8685,99.9927
1025,1026,45516,2656,3322,320.321,5.65014,84.3499,99.3393
1026,1027,1259,760,3196,139.696,41.9359,48.0641,99.9799
1027,1028,2626,2253,3207,321.259,14.933,75.067,99.9891
1028,1029,20816,486,3271,151.054,62.2617,27.7383,99.837
1029,1030,1120,1755,3199,321.193,25.9328,64.0672,99.994
1030,1031,1276,2184,3204,133.069,48.4846,41.5154,99.935
1031,1032,7723,3446,3262,135.196,10.0953,79.9047,99.9248
1032,1033,1536,2764,3218,132.721,28.9006,61.0994,99.1695
1033,1034,3706,285,3245,322.802,30.4035,59.5965,99.9866
1034,1035,858,2305,3223,139.436,5.06583,84.9342,99.9382
1035,1036,31508,1326,3309,333.1280000000001,19.2673,70.7327,98.8215
1036,1037,7013,3314,3245,144.477,13.3451,76.6549,99.9966
1037,1038,44462,558,3362,321.077,20.6082,69.3918,99.0248
1038,1039,558,1506,3221,325.17,28.306,61.694,99.8286
1039,1040,804,2074,3221,144.791,59.2317,30.7683,99.9883
1040,1041,2896,2123,3236,325.218,21.2306,68.7694,99.9881
1041,1042,6891,1699,3253,149.999,71.6634,18.3366,99.9295
1042,1043,585,603,3221,309.526,32.5795,57.4205,99.9941
1043,1044,1229,1380,3226,134.907,19.358,70.642,99.9876
1044,1045,1995,776,3234,320.901,52.6746,37.3254,99.9678
1045,1046,837,998,3228,148.035,5.06041,84.9396,98.4044
1046,1047,527,1471,3224,320.058,37.488,52.512,99.9148
1047,1048,1269,821,3239,328.615,0.482681,89.5173,99.9947
1048,1049,7894,2230,3269,138.391,43.1662,46.8338,99.9521
1049,1050,9610,1820,3269,149.406,67.169,22.831,99.8048
1050,1051,510,3239,3238,311.899,31.168000000000006,58.832,99.9952
1051,1052,777,885,3241,313.728,51.8075,38.1925,99.9502
1052,1053,3485,1084,3256,322.732,2.94878,87.0512,99.9583
1053,1054,10570,3192,3298,136.636,16.6475,73.3525,99.9535
1054,1055,1592,2934,3253,286.175,70.9583,19.0417,99.9475
1055,1056,1844,1516,3265,325.441,14.2159,75.7841,99.9604
1056,1057,2493,972,3262,318.47,12.7995,77.2005,98.9794
1057,1058,3164,2808,3271,332.714,15.699000000000002,74.301,99.6204
1058,1059,2497,238,3270,104.319,76.2971,13.7029,99.9922
1059,1060,645,347,3258,146.255,3.12985,86.8701,99.9729
1060,1061,5362,2051,3296,324.2340000000001,57.2941,32.7059,99.9246
1061,1062,11529,987,3324,140.476,17.1421,72.8579,99.6055
1062,1063,17244,814,3336,135.316,11.9198,78.0802,99.954
1063,1064,4895,1140,3313,145.158,3.12347,86.8765,99.7981
1064,1065,6789,2328,3311,144.118,36.7959,53.2041,99.991
1065,1066,1562,337,3289,314.16,2.81861,87.1814,99.9982
1066,1067,3318,2147,3295,139.75799999999998,2.22997,87.77,99.982
1067,1068,2300,1499,3300,326.1140000000001,5.8887800000000015,84.1112,99.9977
1068,1069,2235,1198,3309,141.561,35.4097,54.5903,99.9947
1069,1070,6454,192,3321,315.238,1.60838,88.3916,99.9879
1070,1071,9750,1613,3318,316.511,5.7304900000000005,84.2695,99.9673
1071,1072,25548,2972,3400,137.112,0.31723,89.6828,99.9293
1072,1073,8074,1945,3334,294.099,62.1335,27.8665,99.955
1073,1074,4040,2831,3332,134.403,28.5146,61.4854,99.9119
1074,1075,579,2887,3299,283.741,71.4108,18.5892,99.9939
1075,1076,1404,3292,3308,312.701,47.3397,42.6603,99.9705
1076,1077,524,658,3303,135.188,33.4374,56.5626,99.9802
1077,1078,3426,289,3328,142.049,40.941,49.059,99.9872
1078,1079,2166,1844,3324,319.777,10.3777,79.6223,99.9799
1079,1080,23236,2075,3408,137.096,2.61849,87.3815,98.1003
1080,1081,20576,2406,3420,143.707,1.35544,88.6446,98.895
1081,1082,2454,1446,3331,150.915,55.2318,34.7682,99.9674
1082,1083,4007,1771,3345,324.254,33.2282,56.7718,99.9878
1083,1084,2557,907,3355,329.92,51.4943,38.5057,99.9849
1084,1085,2787,361,3357,299.836,56.1531,33.8469,99.9219
1085,1086,1635,2195,3346,324.13,30.518,59.482,99.9964
1086,1087,1744,3124,3353,324.017,21.3684,68.6316,99.998
1087,1088,565,2267,3349,327.6620000000001,17.2686,72.7314,99.9919
1088,1089,18975,3413,3510,132.067,0.518784,89.4812,88.5326
1089,1090,14897,1537,3390,144.696,19.4534,70.5466,99.8218
1090,1091,15038,3314,3458,326.9,59.1391,30.8609,99.4391
1091,1092,8647,1094,3408,321.621,2.87636,87.1236,99.7883
1092,1093,2129,3042,3368,322.186,37.229,52.771,99.9822
1093,1094,4284,3146,3391,328.22,5.5353,84.4647,99.8604
1094,1095,1235,1689,3364,316.172,16.0712,73.9288,99.9895
1095,1096,1039,1864,3367,153.44,62.8992,27.1008,99.9829
1096,1097,517,3216,3366,143.529,16.6752,73.3248,99.9863
1097,1098,2447,198,3377,315.344,9.64025,80.3597,99.9891
1098,1099,2448,749,3398,135.806,28.5337,61.4663,99.9908
1099,1100,770,707,3375,314.593,61.4539,28.5461,99.9375
1100,1101,11347,2265,3426,150.59,53.6504,36.3496,99.9523
1101,1102,1201,241,3390,322.449,11.6153,78.3847,99.9654
1102,1103,2220,297,3419,314.558,65.2342,24.7658,99.8301
1103,1104,1477,2385,3397,313.826,9.9319,80.0681,99.9753
1104,1105,10493,1752,3411,321.56,10.9291,79.0709,99.9065
1105,1106,5255,3234,3415,316.064,46.1009,43.8991,99.9721
1106,1107,705,147,3394,319.257,32.8602,57.1398,99.9594
1107,1108,585,963,3391,314.894,0.837952,89.162,99.936
1108,1109,872,329,3399,308.525,43.7844,46.2156,99.9921
1109,1110,932,3059,3396,318.321,27.36,62.64,99.9914
1110,1111,1988,2767,3413,317.455,35.894,54.106,99.9952
1111,1112,2011,1251,3415,129.599,16.0434,73.9566,99.9471
1112,1113,19603,1386,3491,144.001,56.3997,33.6003,99.2562
1113,1114,1516,3412,3416,144.43200000000004,60.9635,29.0365,99.9905
1114,1115,11964,937,3457,311.159,34.8409,55.1591,99.8607
1115,1116,1917,1859,3415,131.496,55.1217,34.8783,99.9875
1116,1117,1688,2818,3416,134.499,22.5045,67.4955,99.9827
1117,1118,781,700,3416,127.955,14.1406,75.8594,99.9638
1118,1119,1026,613,3423,310.1040000000001,0.466927,89.5331,99.9804
1119,1120,1336,178,3424,166.176,78.8366,11.1634,99.9811
1120,1121,27987,1630,3521,146.349,40.8525,49.1475,97.8477
1121,1122,5878,2623,3471,300.422,35.3294,54.6706,99.9714
1122,1123,1111,815,3429,139.784,1.30585,88.6942,99.979
1123,1124,528,1205,3430,318.693,10.8921,79.1079,99.8009
1124,1125,1986,3167,3448,146.07399999999996,6.72253,83.2775,99.5421
1125,1126,13268,1916,3495,129.816,9.71877,80.2812,99.8418
1126,1127,4187,1181,3481,132.088,14.1613,75.8387,99.9199
1127,1128,827,2555,3446,338.735,86.4081,3.59194,99.9645
1128,1129,1097,788,3460,128.064,15.5179,74.4821,99.8473
1129,1130,5363,2841,3477,140.346,23.4583,66.5417,99.9794
1130,1131,6055,199,3488,143.346,45.21100000000001,44.789,99.6981
1131,1132,813,1290,3454,252.269,78.9682,11.0318,99.9868
1132,1133,3954,2196,3488,313.166,9.71269,80.2873,99.9764
1133,1134,24697,623,3527,318.805,14.7602,75.2398,98.8843
1134,1135,7306,3029,3510,340.38,66.0697,23.9303,99.8881
1135,1136,2206,1513,3466,321.224,13.7991,76.2009,99.9913
1136,1137,553,147,3463,13.6488,79.016,10.984000000000002,99.9521
1137,1138,2437,841,3499,146.371,61.7546,28.2454,99.4517
1138,1139,8143,1252,3526,315.207,20.1132,69.8868,99.7864
1139,1140,3781,2960,3508,331.331,23.9777,66.0223,99.7011
1140,1141,8229,2029,3524,315.224,70.3933,19.6067,99.4935
1141,1142,675,1786,3470,316.925,1.03127,88.9687,99.9849
1142,1143,677,2531,3477,145.917,56.4021,33.5979,99.954
1143,1144,5175,2462,3520,323.579,14.099,75.90100000000002,99.1515
1144,1145,1305,2906,3513,316.323,3.94554,86.0545,99.9107
1145,1146,10952,327,3555,306.032,75.1458,14.8542,99.9848
1146,1147,2935,1765,3517,144.14600000000004,45.6927,44.3073,99.6274
1147,1148,2818,258,3507,142.034,87.7271,2.27292,99.9833
1148,1149,7410,1059,3525,319.447,7.21617,82.7838,99.9556
1149,1150,770,1129,3496,145.144,71.5493,18.4507,99.7055
1150,1151,2683,2788,3508,150.67,55.9649,34.0351,99.9262
1151,1152,2991,2339,3513,322.009,17.8805,72.1195,99.9734
1152,1153,799,382,3491,139.91899999999998,29.0581,60.9419,99.8545
1153,1154,1346,1157,3505,154.816,62.0248,27.9752,99.4805
1154,1155,23773,2665,3602,139.395,18.957,71.043,99.3338
1155,1156,2265,1718,3519,310.235,31.3732,58.6268,99.8002
1156,1157,579,2566,3491,316.718,14.7045,75.2955,99.9723
1157,1158,11005,3137,3538,142.15,28.7991,61.2009,99.8932
1158,1159,2018,1309,3520,141.453,16.5755,73.4245,99.9577
1159,1160,890,2152,3513,152.651,59.1207,30.8793,99.9869
1160,1161,677,763,3504,322.752,22.5337,67.4663,99.9643
1161,1162,4759,1493,3549,135.175,41.4391,48.5609,99.6646
1162,1163,2233,2251,3528,142.632,15.4161,74.5839,99.7822
1163,1164,1561,798,3522,316.156,6.054130000000002,83.9459,99.9811
1164,1165,10626,442,3553,127.601,19.3125,70.6875,99.8134
1165,1166,27245,2217,3592,314.71,25.2353,64.7647,99.7336
1166,1167,25595,926,3636,314.643,6.75294,83.2471,80.7646
1167,1168,1740,2851,3547,134.418,16.3315,73.6685,99.9088
1168,1169,4552,2526,3552,342.276,73.8945,16.1055,99.7106
1169,1170,2046,3228,3563,322.566,62.0919,27.9081,99.9621
1170,1171,4937,1140,3565,316.204,22.5894,67.4106,99.9811
1171,1172,8688,1789,3597,319.032,30.0975,59.9025,99.6799
1172,1173,5963,205,3568,321.55,1.18429,88.8157,99.8046
1173,1174,854,1210,3556,136.8,5.48856,84.5114,99.9801
1174,1175,844,759,3555,126.648,22.1124,67.8876,99.9913
1175,1176,2023,859,3570,140.438,9.47218,80.5278,99.9919
1176,1177,12808,1421,3619,139.83,38.7292,51.2708,99.4508
1177,1178,4523,2880,3591,140.453,26.0868,63.9132,99.9945
1178,1179,1413,2797,3572,317.272,37.9351,52.0649,99.9896
1179,1180,1898,539,3585,138.16,44.5222,45.4778,99.9879
1180,1181,586,1741,3575,310.546,21.8746,68.1254,99.7244
1181,1182,1689,2942,3590,143.395,3.42657,86.5734,99.474
1182,1183,9403,1930,3614,319.572,15.0322,74.9678,99.983
1183,1184,2285,2702,3611,133.671,3.50339,86.4966,99.9696
1184,1185,1247,1532,3589,314.93,13.0036,76.9964,99.9912
1185,1186,10761,2421,3625,137.679,8.61984,81.3802,99.9869
1186,1187,1288,3163,3593,300.593,53.6404,36.3596,99.9641
1187,1188,8992,835,3620,136.713,2.8978,87.1022,99.8796
1188,1189,5764,1614,3632,321.649,10.3159,79.6841,99.7785
1189,1190,19566,1850,3703,140.315,11.6263,78.3737,99.4526
1190,1191,9531,670,3649,324.026,49.0031,40.9969,99.9634
1191,1192,6482,2749,3649,315.208,11.2547,78.7453,99.9741
1192,1193,18610,2553,3690,319.105,30.1812,59.8188,99.2925
1193,1194,5963,1053,3639,316.59,42.40600000000001,47.594,99.9909
1194,1195,5090,3101,3619,304.98,53.6618,36.3382,99.9595
1195,1196,5957,1160,3642,138.292,3.3315300000000003,86.6685,99.9949
1196,1197,4185,1274,3620,314.901,28.6298,61.3702,99.9775
1197,1198,11290,3357,3648,314.277,27.5507,62.4493,99.9558
1198,1199,1219,3231,3611,303.338,55.1557,34.8443,99.9924
1199,1200,17908,2995,3683,146.414,55.8469,34.1531,99.8779
1200,1201,5062,277,3637,315.855,14.9511,75.0489,99.9977
1201,1202,1680,2817,3629,310.741,45.1316,44.8684,99.9896
1202,1203,30379,408,3706,319.426,45.1143,44.8857,99.9106
1203,1204,519,458,3617,139.078,41.0542,48.9458,99.9966
1204,1205,612,203,3617,143.498,2.81002,87.19,99.763
1205,1206,2094,731,3636,140.539,62.4292,27.5708,99.9729
1206,1207,629,3186,3621,315.019,6.46355,83.5365,99.9887
1207,1208,2018,144,3635,138.458,46.5335,43.4665,99.9573
1208,1209,10602,2044,3663,131.683,57.1259,32.8741,99.9816
1209,1210,804,1726,3641,315.648,18.512,71.488,99.6734
1210,1211,2168,1540,3643,322.178,52.121,37.879,99.9877
1211,1212,28335,2179,3733,310.088,15.8838,74.1162,99.9782
1212,1213,11970,3228,3682,139.44899999999998,22.7887,67.2113,99.4718
1213,1214,2661,579,3666,315.128,18.0452,71.9548,99.9406
1214,1215,5884,1241,3690,140.303,33.0631,56.9369,99.9743
1215,1216,876,3191,3648,314.693,2.6842,87.3158,99.9854
1216,1217,2544,2866,3664,309.445,48.6452,41.3548,99.726
1217,1218,12180,1360,3714,137.457,47.5204,42.4796,99.9658
1218,1219,9695,2392,3701,153.6,76.8833,13.1167,99.8906
1219,1220,8648,1050,3758,313.576,41.653,48.347,99.8117
1220,1221,1874,3088,3686,134.463,22.0734,67.9266,99.9961
1221,1222,832,762,3672,142.285,36.5496,53.4504,99.9957
1222,1223,3777,812,3690,312.2940000000001,31.8483,58.1517,99.9941
1223,1224,4245,1108,3714,314.184,12.4688,77.5312,99.8383
1224,1225,1513,170,3684,326.405,48.675,41.325,99.973
1225,1226,10775,1674,3754,143.282,68.0062,21.9938,99.8716
1226,1227,687,2778,3685,321.556,40.8413,49.1587,99.9937
1227,1228,1012,252,3682,316.081,8.987039999999997,81.013,99.9938
1228,1229,19643,1492,3774,314.918,41.4141,48.5859,98.7124
1229,1230,3315,1576,3703,136.763,4.31029,85.6897,99.9767
1230,1231,964,1961,3688,313.194,43.0757,46.9243,99.9725
1231,1232,4050,3445,3725,339.343,64.4828,25.5172,99.9174
1232,1233,5768,2838,3707,301.528,58.3905,31.6095,99.9691
1233,1234,2416,648,3706,318.226,45.8115,44.1885,99.9947
1234,1235,4179,1179,3724,143.891,29.8784,60.1216,99.9909
1235,1236,7509,767,3755,135.05700000000002,32.1061,57.8939,99.9825
1236,1237,9506,514,3769,312.28,8.90915,81.0909,99.8914
1237,1238,8090,216,3742,314.506,17.8292,72.1708,98.8533
1238,1239,4172,984,3738,143.546,37.5036,52.4964,99.9896
1239,1240,29356,3168,3803,145.359,12.1787,77.8213,99.8496
1240,1241,5376,1991,3761,142.077,59.7879,30.2121,99.9443
1241,1242,2270,2063,3731,311.563,41.2176,48.7824,99.9591
1242,1243,639,2469,3736,139.822,67.3943,22.6057,99.9738
1243,1244,3275,1241,3760,275.366,81.1946,8.80538,99.992
1244,1245,12535,1750,3790,315.608,22.9329,67.0671,99.8756
1245,1246,6575,2880,3773,314.811,15.2027,74.7973,99.9906
1246,1247,3746,690,3765,312.598,20.9337,69.0663,99.9722
1247,1248,5345,2636,3780,139.718,5.74303,84.257,99.8917
1248,1249,6201,2315,3779,145.119,21.1038,68.8962,99.9797
1249,1250,10327,3313,3775,143.207,0.25550100000000003,89.7445,99.8935
1250,1251,6753,613,3783,149.166,44.6795,45.3205,99.9925
1251,1252,3726,2804,3790,142.65,31.109,58.89100000000001,99.9095
1252,1253,27028,946,3866,144.138,16.0496,73.9504,75.2294
1253,1254,631,2409,3756,321.566,35.9639,54.0361,99.9776
1254,1255,2180,2740,3771,312.191,8.52261,81.4774,99.9875
1255,1256,2694,2478,3788,322.057,11.2993,78.7007,99.4648
1256,1257,8732,2992,3806,140.385,16.3149,73.6851,99.9755
1257,1258,3371,1307,3797,138.144,26.494,63.506,99.9894
1258,1259,740,2698,3773,140.94,3.93481,86.0652,99.9982
1259,1260,1706,230,3786,142.977,27.4948,62.5052,99.9967
1260,1261,579,1383,3787,140.127,35.9408,54.0592,99.9285
1261,1262,2943,1889,3804,300.768,58.6445,31.3555,99.9756
1262,1263,11009,2425,3881,315.344,32.8202,57.1798,99.5384
1263,1264,12510,1571,3891,143.406,36.1798,53.8202,99.8846
1264,1265,2170,3382,3818,140.80200000000005,31.6369,58.3631,99.9951
1265,1266,19223,2023,3859,144.418,36.7325,53.2675,99.9515
1266,1267,8028,2260,3844,315.284,44.1839,45.8161,99.9683
1267,1268,2986,1167,3828,145.116,40.6106,49.3894,99.9895
1268,1269,7611,279,3844,137.36,7.103839999999999,82.8962,99.8928
1269,1270,1244,774,3819,319.824,1.74905,88.2509,99.9834
1270,1271,1029,562,3822,316.258,46.5159,43.4841,99.9929
1271,1272,8716,2554,3841,324.237,20.0295,69.9705,99.9792
1272,1273,3387,189,3850,319.939,39.8216,50.1784,99.9931
1273,1274,10088,1271,3859,313.136,18.286,71.714,99.842
1274,1275,23135,659,3891,149.422,30.8837,59.1163,99.9949
1275,1276,6645,1399,3854,310.937,38.0327,51.9673,99.9514
1276,1277,4070,2924,3849,147.64700000000005,21.6673,68.3327,99.9849
1277,1278,4440,454,3856,147.275,53.3761,36.6239,99.9297
1278,1279,4043,3285,3856,319.569,11.7667,78.2333,99.9286
1279,1280,4132,2837,3851,323.1,21.6572,68.3428,99.9708
1280,1281,583,142,3834,145.02,59.4614,30.5385,99.9406
1281,1282,1190,392,3837,321.547,6.98354,83.0165,99.9921
1282,1283,1371,1924,3850,140.42700000000002,39.0946,50.9054,99.9219
1283,1284,987,2679,3839,321.099,39.3491,50.6509,99.9744
1284,1285,724,2439,3843,320.819,33.4208,56.5792,99.6908
1285,1286,4898,2731,3861,283.363,69.4879,20.5121,99.9887
1286,1287,9359,1102,3886,159.42600000000004,63.8325,26.1675,99.9556
1287,1288,2837,2343,3870,326.694,44.5947,45.4053,99.9498
1288,1289,11010,3422,3918,137.89,6.65605,83.3439,99.3975
1289,1290,5227,815,3884,313.166,45.5325,44.4675,99.979
1290,1291,3383,2125,3884,316.557,28.1452,61.8548,99.9858
1291,1292,7204,1872,3896,312.061,17.7652,72.2348,99.9812
1292,1293,3765,500,3900,137.825,45.2876,44.7124,99.9765
1293,1294,8921,3033,3904,138.047,47.346,42.654,99.9834
1294,1295,1126,560,3865,132.96,3.98918,86.0108,99.9961
1295,1296,13589,1675,3925,140.251,34.3122,55.6878,99.9188
1296,1297,3441,1786,3882,310.206,44.6894,45.3106,99.9743
1297,1298,2880,1213,3895,147.821,47.5877,42.4123,99.8761
1298,1299,2872,2189,3901,138.713,21.1377,68.8623,99.7319
1299,1300,4477,355,3893,140.859,22.5104,67.4896,99.9827
1300,1301,1669,2660,3889,145.453,13.2864,76.7136,99.9898
1301,1302,1511,3150,3884,329.18300000000005,18.9367,71.0633,99.9896
1302,1303,1101,144,3903,319.487,39.2387,50.7613,99.9737
1303,1304,1800,2602,3893,321.892,36.8654,53.1346,99.9904
1304,1305,19737,373,3964,142.705,29.125,60.875,99.7975
1305,1306,8519,2797,3923,317.094,9.91128,80.0887,99.8028
1306,1307,8414,2930,3935,318.313,38.5617,51.4383,99.9336
1307,1308,4931,1943,3951,317.697,5.83988,84.1601,99.96
1308,1309,7549,1335,3944,312.0,44.7952,45.2048,99.9664
1309,1310,782,1508,3911,311.589,34.7407,55.2593,99.9914
1310,1311,551,764,3912,146.263,43.6065,46.3935,99.9474
1311,1312,811,3336,3912,313.85,21.9978,68.0022,99.9792
1312,1313,2206,3112,3924,312.045,52.8387,37.1613,99.9746
1313,1314,20266,2265,3983,312.1790000000001,22.7923,67.2077,99.4605
1314,1315,8598,2499,3949,324.09,57.4269,32.5731,99.9568
1315,1316,4927,2650,3948,316.031,31.2951,58.7049,99.9655
1316,1317,680,1411,3920,140.839,53.4783,36.5217,99.985
1317,1318,637,2355,3921,188.025,65.4544,24.5456,99.9679
1318,1319,4788,3316,3960,144.882,27.7629,62.2371,99.9595
1319,1320,925,3187,3935,144.181,22.3197,67.6803,99.9459
1320,1321,1940,530,3946,314.735,43.6193,46.3807,99.9682
1321,1322,1329,2589,3947,320.949,2.95923,87.0408,99.9901
1322,1323,787,2702,3934,313.472,29.486,60.514,99.9729
1323,1324,12131,178,3994,310.902,57.8975,32.1025,99.8379
1324,1325,9770,848,3972,133.85399999999998,11.204,78.796,99.9747
1325,1326,753,3370,3941,134.428,11.4704,78.5296,99.9747
1326,1327,735,1193,3942,319.95,34.9126,55.0874,99.9848
1327,1328,4260,2164,3958,324.2290000000001,9.7599,80.2401,99.9221
1328,1329,6255,1470,3967,327.313,65.1205,24.8795,99.9172
1329,1330,4155,1761,3964,316.028,8.39268,81.6073,99.9408
1330,1331,4878,1832,3989,155.10299999999995,56.7057,33.2943,99.8176
1331,1332,3418,741,3970,331.5440000000001,72.7649,17.2351,99.9794
1332,1333,1824,1999,3960,138.506,23.7532,66.2468,99.9852
1333,1334,10631,2066,4007,314.779,53.0831,36.9169,99.7485
1334,1335,1821,1228,3967,135.19899999999998,4.90418,85.0958,99.983
1335,1336,1669,3229,3961,318.825,14.6976,75.3024,99.9922
1336,1337,15191,1037,4017,321.178,50.5137,39.4863,99.518
1337,1338,7630,3113,3997,138.928,25.0768,64.9232,99.9146
1338,1339,4714,1154,3989,143.89,41.6918,48.3082,99.9607
1339,1340,23315,1685,4043,317.076,9.681,80.319,99.1931
1340,1341,2022,558,3988,323.53,13.4626,76.5374,99.9842
1341,1342,11908,2707,4027,320.506,45.9084,44.0916,98.9545
1342,1343,5804,2810,4004,316.939,21.8861,68.1139,99.9827
1343,1344,1072,1886,3997,304.572,44.0907,45.9093,99.9746
1344,1345,1402,1278,3993,311.274,25.7273,64.2727,99.9868
1345,1346,3175,656,4005,315.9120000000001,35.2988,54.7012,99.8644
1346,1347,3909,3258,4028,142.972,6.2645800000000005,83.7354,99.8662
1347,1348,15306,328,4050,306.238,50.3612,39.6388,99.8375
1348,1349,12009,2968,4048,154.764,67.6752,22.3248,99.8671
1349,1350,1326,596,4005,143.899,35.6189,54.3811,99.8273
1350,1351,5098,2530,4021,145.489,32.0554,57.9446,99.9558
1351,1352,4625,2396,4022,193.366,68.0285,21.9715,99.8631
1352,1353,842,2969,4000,325.965,16.2456,73.7544,99.9636
1353,1354,15555,1373,4048,134.181,55.8615,34.1385,99.8074
1354,1355,6045,505,4048,135.57,16.9221,73.0779,99.9303
1355,1356,672,932,4012,310.273,51.7923,38.2077,99.7433
1356,1357,1235,3208,4018,145.724,33.6595,56.3405,99.9886
1357,1358,2655,1238,4029,131.275,8.834589999999997,81.1654,99.9719
1358,1359,7978,3337,4056,131.986,29.3405,60.6595,99.239
1359,1360,1271,777,4016,154.179,86.1876,3.81239,99.9751
1360,1361,2628,2589,4044,316.411,28.3879,61.6121,99.8118
1361,1362,2032,1922,4032,139.451,3.43127,86.5687,99.8168
1362,1363,2409,692,4037,142.903,53.6666,36.3334,99.9706
1363,1364,10283,1515,4092,139.983,37.3686,52.6314,99.7434
1364,1365,15193,926,4089,316.319,0.488075,89.5119,99.7766
1365,1366,11495,1126,4088,146.28,26.8932,63.1068,99.6546
1366,1367,28158,712,4123,134.416,0.539162,89.4608,99.7458
1367,1368,1473,3454,4052,313.66,3.1798900000000003,86.8201,99.9432
1368,1369,3238,3205,4079,324.1690000000001,57.4608,32.5392,99.8989
1369,1370,764,2159,4055,286.14,78.1489,11.8511,99.9906
1370,1371,818,3403,4059,159.02,72.5846,17.4153,99.9506
1371,1372,4846,1975,4082,140.894,1.5357,88.4643,98.8953
1372,1373,4133,819,4085,134.486,17.0178,72.9822,99.9906
1373,1374,517,2847,4061,139.71200000000002,13.9464,76.0536,99.9858
1374,1375,7474,2400,4094,137.707,18.4937,71.5063,99.9473
1375,1376,8505,2506,4104,151.547,28.0838,61.9162,99.8166
1376,1377,4196,171,4083,137.375,35.1323,54.8677,99.9595
1377,1378,20421,1889,4135,134.04,0.143311,89.8567,99.8631
1378,1379,5002,1222,4106,319.653,30.6219,59.3781,99.9121
1379,1380,2911,2207,4087,129.736,49.7484,40.2516,99.9752
1380,1381,5653,2608,4114,142.428,14.3429,75.6571,99.9137
1381,1382,2783,2793,4088,132.173,48.6369,41.3631,99.9069
1382,1383,8042,264,4121,315.177,58.8223,31.1777,99.834
1383,1384,5463,3086,4116,320.2940000000001,7.29807,82.7019,99.924
1384,1385,2812,2060,4091,318.194,60.1925,29.8075,99.9819
1385,1386,4829,2712,4113,312.9240000000001,27.4878,62.5122,99.9669
1386,1387,837,2321,4087,134.89700000000002,2.62445,87.3755,99.9973
1387,1388,25852,453,4215,310.324,56.495,33.505,98.365
1388,1389,3564,2272,4116,300.334,52.9069,37.0931,99.9395
1389,1390,7987,2914,4125,318.802,10.7655,79.2345,99.9675
1390,1391,701,1596,4093,138.779,47.382,42.618,99.9699
1391,1392,16101,2155,4157,136.286,18.7058,71.2942,99.9855
1392,1393,3440,1287,4124,132.856,38.9737,51.0263,99.977
1393,1394,1828,3438,4114,319.569,32.7215,57.2785,99.9051
1394,1395,5426,1656,4132,145.458,63.265,26.735,99.97
1395,1396,27286,3295,4205,144.26,19.5323,70.4677,99.9871
1396,1397,55761,1386,4320,326.346,8.67419,81.3258,98.5913
1397,1398,1937,3389,4129,314.458,12.5735,77.4265,99.9648
1398,1399,3925,2817,4150,290.568,60.726000000000006,29.274,99.8419
1399,1400,3793,3004,4143,316.2990000000001,23.1469,66.8531,99.993
1400,1401,1654,585,4127,129.94799999999998,16.7301,73.2699,99.974
1401,1402,4924,3176,4153,312.293,41.51600000000001,48.484,99.9283
1402,1403,5733,1449,4159,333.764,57.643,32.357,99.9651
1403,1404,28088,170,4251,144.875,20.4701,69.5299,99.6749
1404,1405,5458,2033,4155,319.371,54.1549,35.8451,99.9666
1405,1406,2267,857,4149,145.334,52.0953,37.9047,99.9705
1406,1407,2519,544,4151,317.776,5.37931,84.6207,99.9978
1407,1408,8692,1762,4185,139.864,36.3019,53.6981,99.9815
1408,1409,1021,368,4144,139.468,7.35303,82.647,99.9856
1409,1410,1816,1578,4156,141.564,46.4227,43.5773,99.9806
1410,1411,24772,992,4228,319.284,23.1521,66.8479,98.7855
1411,1412,33909,2674,4327,139.013,12.1111,77.8889,99.706
1412,1413,533,123,4146,140.35399999999998,7.45248,82.5475,99.9513
1413,1414,5546,1152,4165,323.625,16.7718,73.2282,99.9648
1414,1415,10117,2336,4186,316.221,35.622,54.378,99.9363
1415,1416,5975,3111,4196,143.41,23.9951,66.0049,99.9487
1416,1417,1280,3457,4163,146.217,25.8456,64.1544,99.9728
1417,1418,6060,606,4192,138.266,19.7555,70.2445,99.9801
1418,1419,15573,2580,4213,320.9290000000001,12.6243,77.3757,99.9754
1419,1420,1201,665,4178,148.88299999999995,50.0204,39.9796,99.9927
1420,1421,4913,1865,4203,155.376,70.9841,19.0159,99.982
1421,1422,16676,2438,4267,322.986,45.3969,44.6031,99.6992
1422,1423,2269,2877,4194,323.221,21.0823,68.9177,99.9786
1423,1424,8450,3421,4234,137.908,41.2625,48.7375,99.7541
1424,1425,1907,1625,4193,141.46200000000005,4.30841,85.6916,99.9958
1425,1426,976,3046,4188,313.362,24.469,65.531,99.973
1426,1427,3556,348,4202,139.481,7.15048,82.8495,99.9107
1427,1428,1119,525,4197,315.033,1.91349,88.0865,99.999
1428,1429,12638,2936,4244,307.5440000000001,60.5692,29.4308,99.8752
1429,1430,1436,1510,4199,315.976,2.02896,87.971,99.9922
1430,1431,1239,1667,4203,147.827,59.4431,30.5569,99.9814
1431,1432,608,1225,4194,135.394,37.3471,52.6529,99.9947
1432,1433,6220,1609,4239,331.66,65.217,24.783,99.9462
1433,1434,1979,1285,4213,312.289,15.7949,74.2051,99.9938
1434,1435,31220,1140,4328,149.468,28.5608,61.4392,99.4437
1435,1436,791,2841,4207,294.188,62.9012,27.0988,99.9939
1436,1437,2606,258,4220,144.55100000000004,38.5769,51.4231,99.9903
1437,1438,1205,1715,4218,143.201,4.63577,85.3642,99.9947
1438,1439,8684,2204,4258,321.778,57.8358,32.1642,99.9687
1439,1440,2778,2774,4236,311.374,28.2456,61.7544,99.9175
1440,1441,962,1417,4214,320.853,12.6826,77.3174,99.98
1441,1442,3180,1999,4239,291.825,79.8785,10.1215,99.9751
1442,1443,4763,1253,4259,315.079,2.6236200000000003,87.3764,99.9717
1443,1444,34255,667,4328,141.529,35.7138,54.2862,99.9699
1444,1445,2299,975,4248,144.814,29.6644,60.3356,99.996
1445,1446,10603,1490,4264,138.287,59.9528,30.0472,99.9607
1446,1447,11941,2333,4289,310.953,56.9003,33.0997,99.9908
1447,1448,715,2077,4228,316.659,1.88249,88.1175,99.9802
1448,1449,7018,550,4278,153.364,44.5689,45.4311,99.992
1449,1450,16555,309,4327,315.525,31.3,58.7,99.9883
1450,1451,5919,3057,4277,322.595,21.6122,68.3878,99.928
1451,1452,2052,785,4257,152.033,16.1679,73.8321,99.8554
1452,1453,46461,1957,4322,141.269,15.2124,74.7876,99.5529
1453,1454,6676,3151,4286,140.52100000000002,0.972061,89.0279,99.9698
1454,1455,1490,2647,4278,149.505,35.1425,54.8575,99.9964
1455,1456,1336,841,4278,133.236,78.0689,11.9311,99.7291
1456,1457,1277,1708,4282,155.915,72.0699,17.9301,99.9916
1457,1458,5980,3242,4325,315.545,31.0999,58.9001,99.9882
1458,1459,1343,2816,4293,143.289,16.7934,73.2066,99.9829
1459,1460,2432,2778,4301,142.732,7.7672,82.2328,99.9974
1460,1461,2844,2548,4300,143.532,20.3306,69.6694,99.9971
1461,1462,27480,892,4373,313.59,40.5658,49.4342,99.668
1462,1463,14428,1626,4342,320.375,33.5624,56.4376,99.8406
1463,1464,4258,2864,4324,141.259,12.6459,77.3541,99.9729
1464,1465,1487,3446,4321,149.895,27.3918,62.6082,99.8995
1465,1466,6783,2238,4337,315.454,27.1787,62.8213,99.942
1466,1467,770,3302,4327,149.789,30.0298,59.9702,99.9465
1467,1468,11741,2529,4364,321.801,26.5386,63.4614,99.9334
1468,1469,2958,3017,4332,134.657,14.2495,75.7505,99.6592
1469,1470,3238,2943,4337,324.843,12.1543,77.8457,99.9631
1470,1471,3419,3402,4359,134.429,3.95543,86.0446,99.6174
1471,1472,2095,1743,4351,322.519,9.06602,80.934,99.9965
1472,1473,746,2589,4329,134.655,14.8467,75.1533,99.9965
1473,1474,1253,2747,4341,318.972,46.4358,43.5642,99.995
1474,1475,527,1694,4342,330.2390000000001,66.805,23.195,99.9939
1475,1476,3940,242,4377,141.928,2.82694,87.1731,99.9879
1476,1477,2411,1802,4357,134.066,11.4099,78.5901,99.978
1477,1478,1803,2145,4358,323.318,41.3899,48.6101,99.9812
1478,1479,7372,3128,4377,137.04399999999998,10.2329,79.7671,99.9874
1479,1480,1317,2770,4379,137.945,23.1191,66.8809,99.949
1480,1481,1918,2839,4376,306.1670000000001,20.2311,69.7689,99.9763
1481,1482,3883,498,4382,148.903,58.5762,31.4238,99.9753
1482,1483,2779,2218,4384,313.122,42.9983,47.0017,99.9798
1483,1484,966,3066,4376,142.666,27.7017,62.2983,99.9967
1484,1485,5257,3304,4396,318.671,52.9557,37.0443,99.9932
1485,1486,8050,3007,4421,311.045,34.2457,55.7543,99.7804
1486,1487,1582,2915,4378,139.998,19.5074,70.4926,99.8391
1487,1488,30785,3176,4483,73.0777,82.9912,7.0087600000000005,99.9577
1488,1489,750,2302,4386,313.105,18.9889,71.0111,99.9801
1489,1490,2353,1786,4408,152.97799999999995,71.7719,18.2281,99.9547
1490,1491,13015,2062,4447,143.311,33.032,56.968,99.9752
1491,1492,1931,3380,4406,166.19099999999997,75.2657,14.7343,99.9737
1492,1493,26121,2402,4477,312.003,33.0806,56.9194,99.8074
1493,1494,3206,437,4415,293.54,75.0228,14.9772,99.9721
1494,1495,3725,1264,4422,144.263,79.2972,10.7028,99.9791
1495,1496,3944,2155,4429,135.134,25.4636,64.5364,99.9724
1496,1497,10019,2831,4458,140.088,10.6425,79.3575,99.8748
1497,1498,13064,1008,4477,319.519,10.5212,79.4788,99.9021
1498,1499,1788,168,4411,251.887,86.1141,3.88595,99.8693
1499,1500,1373,2463,4412,147.553,37.9107,52.0893,99.9932
1500,1501,1145,2890,4417,323.067,13.3326,76.6674,99.9669
1501,1502,5371,1589,4447,145.514,40.1287,49.8713,99.9786
1502,1503,4604,367,4442,158.355,58.1627,31.8373,99.9723
1503,1504,10451,2251,4462,140.458,26.5453,63.4547,99.9929
1504,1505,3490,259,4448,289.06,65.709,24.291,99.9741
1505,1506,728,872,4426,323.696,38.6504,51.3496,99.9814
1506,1507,3846,2756,4469,320.782,28.9898,61.0102,99.9866
1507,1508,679,1202,4445,315.053,46.1034,43.8966,99.8917
1508,1509,15395,1808,4495,304.27,63.3689,26.6311,99.9715
1509,1510,24920,517,4518,140.304,20.6773,69.3227,99.9635
1510,1511,2867,3419,4450,133.151,7.07567,82.9243,99.8651
1511,1512,1129,2504,4444,153.561,57.4915,32.5085,99.9898
1512,1513,663,3341,4445,313.41,29.5969,60.4031,99.9293
1513,1514,1205,697,4454,139.13,12.0967,77.9033,99.9656
1514,1515,5893,903,4490,144.08,61.0931,28.9069,99.5485
1515,1516,8294,1657,4498,142.19,5.5541800000000014,84.4458,99.9257
1516,1517,8238,644,4518,317.5370000000001,56.1252,33.8748,99.7124
1517,1518,33068,778,4548,321.944,1.22506,88.7749,99.9416
1518,1519,1705,1151,4468,150.678,35.0693,54.9307,99.9821
1519,1520,1410,150,4474,147.159,51.8749,38.1251,99.509
1520,1521,3969,1409,4505,136.55100000000002,71.4827,18.5173,99.8926
1521,1522,8092,1909,4533,139.618,27.8488,62.1512,99.8619
1522,1523,13186,1320,4511,176.458,75.1708,14.8292,99.908
1523,1524,662,1942,4466,318.985,22.248,67.752,99.9739
1524,1525,1448,3298,4470,3.30426,84.3444,5.65562,99.9517
1525,1526,609,191,4463,141.39600000000004,48.9594,41.0406,99.9918
1526,1527,3511,2984,4499,157.145,62.6259,27.3741,99.9587
1527,1528,15032,1532,4527,318.375,16.8381,73.1619,99.9582
1528,1529,6966,3338,4528,320.21,6.7182,83.2818,99.5667
1529,1530,1832,2663,4484,314.73,6.78978,83.2102,99.9865
1530,1531,8368,2248,4555,320.283,49.392,40.608,99.5781
1531,1532,1615,1723,4500,134.77,21.6134,68.3866,99.9469
1532,1533,10185,3414,4576,164.565,85.1529,4.84707,99.3041
1533,1534,555,2886,4489,140.577,29.1666,60.8334,99.9922
1534,1535,30281,2038,4635,138.064,17.4911,72.5089,99.4273
1535,1536,14800,1120,4548,136.796,11.7225,78.2775,99.8608
1536,1537,3243,419,4536,284.51,75.57600000000002,14.424,99.9459
1537,1538,9209,290,4537,135.208,21.6017,68.3983,99.9476
1538,1539,7360,2922,4553,146.001,56.1244,33.8756,99.4337
1539,1540,6376,1993,4553,318.338,22.8997,67.1003,99.9336
1540,1541,6332,2562,4554,138.57399999999998,15.3228,74.6772,99.9441
1541,1542,25687,2685,4594,316.8590000000001,14.1512,75.8488,99.9264
1542,1543,622,930,4550,141.40200000000004,68.8479,21.1521,99.9827
1543,1544,5289,1232,4578,132.704,28.3135,61.6865,99.9904
1544,1545,3499,1820,4574,329.119,50.6498,39.3502,99.9568
1545,1546,18117,1792,4644,323.438,23.4186,66.5814,99.9799
1546,1547,1241,3013,4576,151.476,65.5222,24.4778,99.9286
1547,1548,554,191,4573,121.702,59.1288,30.8712,99.9685
1548,1549,16085,1019,4635,325.039,11.3537,78.6463,99.7747
1549,1550,9818,2831,4607,131.873,48.9357,41.0643,99.9624
1550,1551,767,145,4562,316.258,33.1214,56.8786,99.969
1551,1552,4095,3155,4587,147.892,71.2285,18.7715,99.9675
1552,1553,6400,598,4610,144.97,3.62857,86.3714,99.9493
1553,1554,26358,1488,4683,321.788,18.5032,71.4968,99.9118
1554,1555,2244,1620,4595,317.172,25.4622,64.5378,99.9794
1555,1556,864,2416,4579,129.71200000000002,31.4065,58.5935,99.8211
1556,1557,797,220,4583,316.334,33.312,56.688,99.9632
1557,1558,1600,360,4583,318.909,44.8619,45.1381,99.9887
1558,1559,6666,914,4629,321.806,33.3061,56.6939,99.8196
1559,1560,5102,1418,4601,145.52,63.6673,26.3327,99.9469
1560,1561,2491,3057,4595,318.361,37.1192,52.8808,99.9906
1561,1562,5442,3239,4612,319.858,0.8728100000000001,89.1272,99.9933
1562,1563,1035,119,4602,135.234,46.1019,43.8981,99.9344
1563,1564,33937,2406,4718,135.34799999999998,15.8561,74.1439,64.6786
1564,1565,7775,2473,4630,134.338,50.5292,39.4708,99.9526
1565,1566,18455,215,4652,313.12,22.1772,67.8228,99.9301
1566,1567,18090,473,4669,318.594,51.5111,38.4889,99.9028
1567,1568,2323,1156,4617,314.565,45.7009,44.2991,99.9585
1568,1569,2271,1674,4618,141.629,47.7808,42.2192,99.9577
1569,1570,3994,2553,4637,318.357,40.4362,49.5638,99.9782
1570,1571,914,680,4619,155.621,72.0401,17.9599,99.9833
1571,1572,3351,843,4635,139.666,18.3261,71.6739,99.9934
1572,1573,1696,2976,4626,144.49,34.1279,55.8721,99.8195
1573,1574,2099,357,4633,314.276,4.60456,85.3954,99.9972
1574,1575,1700,1924,4651,306.26,63.9245,26.0755,99.7364
1575,1576,1081,1944,4624,172.96599999999995,72.8822,17.1178,99.9887
1576,1577,11325,3071,4677,311.891,16.2959,73.7041,99.9963
1577,1578,13297,1280,4665,136.05200000000002,20.7445,69.2555,99.9864
1578,1579,1201,2747,4638,138.94,51.8531,38.1469,99.9377
1579,1580,3651,2934,4655,165.919,68.4532,21.5468,99.9836
1580,1581,23424,3195,4737,145.189,13.0294,76.9706,98.7247
1581,1582,4753,2224,4675,318.022,4.22256,85.7774,99.8498
1582,1583,10019,3379,4680,320.16,4.678719999999998,85.3213,99.3617
1583,1584,4291,700,4673,310.697,7.060060000000001,82.9399,99.9972
1584,1585,788,1129,4682,308.193,52.4338,37.5662,99.647
1585,1586,5340,2151,4692,310.999,26.211,63.789,99.9875
1586,1587,1179,2270,4662,318.887,18.438,71.562,99.9985
1587,1588,4360,1696,4683,160.165,74.2818,15.7182,99.9911
1588,1589,990,609,4670,137.648,26.4926,63.5074,99.9975
1589,1590,1433,644,4681,312.569,52.2925,37.7075,99.9944
1590,1591,618,1168,4666,327.6980000000001,20.6962,69.3038,98.502
1591,1592,1837,2773,4678,139.664,49.008,40.992,99.7431
1592,1593,1690,329,4683,319.058,30.4813,59.5187,99.974
1593,1594,3157,2875,4692,134.273,45.5162,44.4838,99.9087
1594,1595,1642,1196,4694,317.677,24.8113,65.1887,99.995
1595,1596,3393,826,4700,312.305,3.9294,86.0706,99.9941
1596,1597,3857,1647,4716,316.318,3.50622,86.4938,99.9592
1597,1598,1980,2538,4702,318.714,33.8664,56.1336,99.9938
1598,1599,4267,2994,4722,143.915,27.5989,62.4011,99.9585
1599,1600,20767,2075,4758,321.485,5.37593,84.6241,99.9857
1600,1601,4679,2623,4728,150.13,26.87,63.13,99.971
1601,1602,8334,938,4735,312.969,4.32449,85.6755,99.944
1602,1603,2600,3370,4714,135.934,13.8778,76.1222,99.9924
1603,1604,1801,762,4711,156.21,68.8495,21.1505,99.986
1604,1605,738,876,4708,134.761,23.2077,66.7923,99.9886
1605,1606,7423,2802,4753,156.67600000000004,64.9753,25.0247,99.9673
1606,1607,3523,187,4723,141.053,13.8094,76.1906,99.9835
1607,1608,3487,1583,4732,185.585,72.3076,17.6924,99.9905
1608,1609,3615,1342,4748,316.3590000000001,48.5921,41.4079,99.9307
1609,1610,937,1068,4718,128.391,3.5060800000000003,86.4939,99.9749
1610,1611,2823,303,4735,315.332,52.0544,37.9456,99.869
1611,1612,4122,654,4739,143.9,68.8287,21.1713,99.9088
1612,1613,3158,1144,4729,138.062,13.855,76.145,99.9811
1613,1614,5301,1258,4749,326.784,38.8525,51.1475,99.9601
1614,1615,3560,2953,4766,138.784,8.0191,81.9809,98.8064
1615,1616,6045,1774,4747,134.609,17.8892,72.1108,99.9566
1616,1617,3288,1039,4750,325.021,2.62433,87.3757,99.9801
1617,1618,860,395,4732,130.512,2.74017,87.2598,99.9651
1618,1619,2593,749,4746,158.842,66.2453,23.7547,99.8732
1619,1620,4077,2267,4757,315.418,11.446,78.554,99.9961
1620,1621,1200,842,4748,131.833,18.912,71.08800000000002,99.933
1621,1622,978,1856,4749,320.07,31.5298,58.4702,99.9902
1622,1623,1201,496,4744,322.356,31.7773,58.2227,99.9892
1623,1624,2220,2600,4766,143.94,34.7832,55.2168,99.9841
1624,1625,3045,1152,4763,137.762,13.6636,76.3364,99.9826
1625,1626,3724,3063,4793,144.718,30.0952,59.9048,99.9779
1626,1627,4040,3347,4773,322.96,12.5735,77.4265,99.991
1627,1628,563,1893,4768,152.389,66.5851,23.4149,99.9798
1628,1629,2435,2677,4784,134.118,45.0826,44.9174,99.9914
1629,1630,5451,1680,4783,137.07299999999998,17.6187,72.3813,99.8111
1630,1631,575,2902,4784,299.993,41.3137,48.6863,99.9589
1631,1632,7084,3237,4812,320.387,3.1937900000000004,86.8062,99.9234
1632,1633,1721,1524,4787,152.666,14.1356,75.8644,99.9192
1633,1634,754,1460,4787,145.376,14.4263,75.5737,99.9675
1634,1635,1256,1879,4790,157.096,63.5616,26.4384,99.9659
1635,1636,711,3016,4792,318.624,4.32113,85.6789,99.9979
1636,1637,3853,2581,4807,316.7340000000001,16.1203,73.8797,99.9791
1637,1638,1389,2208,4802,326.521,62.9129,27.0871,99.9747
1638,1639,7660,3377,4827,313.238,27.5722,62.4278,99.8618
1639,1640,729,1956,4803,142.16,21.1822,68.8178,99.9551
1640,1641,2113,2742,4813,141.04,3.90086,86.0991,99.9872
1641,1642,911,2912,4821,142.379,69.7239,20.2761,99.9496
1642,1643,1702,2990,4832,166.954,78.8272,11.1728,99.9587
1643,1644,681,2812,4826,141.601,69.2404,20.7596,99.8794
1644,1645,789,2456,4819,317.31,12.7944,77.2056,99.8246
1645,1646,632,2488,4850,319.026,15.2314,74.7686,99.6435
1646,1647,524,3154,4851,321.606,17.1781,72.8219,99.9511
