,Grain No.,Size [Pixel],center x-coordinate,center y-coordinate,mean azimuth [degree],mean latitude [degree],mean colatitude [degree],Regelungsgrad [%]
0,1,23481,1321,150,46.1201,26.6935,63.3065,96.8578
1,2,2258,850,152,326.381,41.0851,48.9149,98.1149
2,3,244926,1785,475,46.4774,37.6184,52.3816,96.3377
3,4,578,937,128,95.8788,16.953,73.047,99.753
4,5,555,608,132,273.738,55.4837,34.5163,99.9732
5,6,2035,1692,157,50.9475,14.5081,75.4919,99.7427
6,7,1298,2458,154,45.9782,39.2961,50.7039,99.7017
7,8,18275,1787,235,12.0858,53.4553,36.5447,99.9504
8,9,1919,1937,150,226.365,22.1577,67.8423,99.2906
9,10,36148,546,271,207.204,18.8079,71.1921,99.8993
10,11,645,2672,152,36.9466,49.8698,40.1302,99.5628
11,12,717,2850,151,61.8493,52.2357,37.7643,99.9696
12,13,1015,662,159,321.763,44.1778,45.8222,99.769
13,14,3231,348,161,47.864,15.7543,74.2457,99.9131
14,15,1224,2335,162,31.1335,30.02,59.98,99.9554
15,16,4390,3188,209,38.9724,3.82586,86.1741,99.9455
16,17,1445,267,182,47.6192,15.8627,74.1373,99.8177
17,18,3220,2868,182,68.7336,53.9905,36.0095,99.8955
18,19,1112,2783,176,55.7374,58.8363,31.1637,99.8247
19,20,566,2957,171,45.0827,3.71737,86.2826,99.9113
20,21,762,1923,175,229.887,20.6287,69.3713,99.8456
21,22,2843,223,205,101.453,73.9112,16.0888,99.9711
22,23,10931,782,223,323.105,44.6478,45.3522,99.9701
23,24,833,298,191,78.4393,76.5104,13.4896,99.9889
24,25,1884,3019,205,40.0725,4.0380699999999985,85.9619,99.7751
25,26,11253,3101,281,39.0197,4.1715,85.8285,99.9562
26,27,96119,1167,358,54.6859,32.1876,57.8124,99.9698
27,28,1078,984,229,53.7688,32.1074,57.8926,99.9835
28,29,3741,1883,250,228.169,19.4076,70.5924,99.9826
29,30,4180,377,283,43.8832,17.6928,72.3072,99.9678
30,31,1486,886,259,325.944,45.5192,44.4808,99.6513
31,32,1086,840,254,324.52,43.7856,46.2144,99.9862
32,33,3993,1335,310,66.7451,33.1834,56.8166,99.9664
33,34,8781,2175,311,223.294,14.7958,75.2042,99.983
34,35,23463,2517,325,196.53,19.5562,70.4438,68.071
35,36,3910,211,300,184.868,58.038,31.962,99.949
36,37,6008,2664,285,204.63,13.3583,76.6417,99.8614
37,38,975,2740,282,39.8552,54.3323,35.6677,99.9363
38,39,2509,2339,278,28.7944,28.6574,61.3426,99.986
39,40,540,346,276,68.5829,77.8566,12.1434,99.9966
40,41,3711,883,304,324.784,44.1222,45.8778,99.9733
41,42,15260,2826,355,63.8154,53.1297,36.8703,99.9835
42,43,70420,2236,416,10.4822,52.1664,37.8336,99.943
43,44,1036,3225,304,45.4889,4.42812,85.5719,99.7327
44,45,23727,698,371,248.258,59.611,30.389,99.9777
45,46,2217,410,319,336.395,41.7892,48.2108,99.99
46,47,1499,307,319,215.479,21.173,68.827,99.9932
47,48,38474,886,426,222.62,6.1098,83.8902,99.9482
48,49,40682,2661,447,0.768713,83.2498,6.7502,99.9279
49,50,651,2438,348,7.9453,0.121696,89.8783,99.997
50,51,940,370,355,19.9693,53.6418,36.3582,99.9801
51,52,8978,463,400,35.5214,25.3402,64.6598,86.4404
52,53,3451,322,380,35.8334,26.8198,63.1802,99.9876
53,54,370521,585,955,240.458,31.7494,58.2506,66.4767
54,55,2085,545,395,209.29,48.1986,41.8014,99.9899
55,56,1722,3113,417,75.3784,52.3617,37.6383,99.9546
56,57,4798,2925,442,180.429,38.1843,51.8157,99.9577
57,58,23170,282,643,278.476,58.9741,31.0259,99.9849
58,59,30115,3172,552,242.984,30.3199,59.6801,99.7301
59,60,938,191,414,44.5349,27.5357,62.4643,98.7701
60,61,1736,3074,440,72.48100000000002,52.3896,37.6104,99.9548
61,62,2209,2488,441,29.7871,7.60354,82.3965,99.8571
62,63,2133,551,437,55.6328,25.381,64.619,99.988
63,64,164897,2428,694,228.692,58.431,31.569000000000006,99.9323
64,65,5900,2834,481,205.296,7.04609,82.9539,99.9528
65,66,1523,603,446,24.2808,40.1425,49.8575,99.9881
66,67,564,2375,438,29.3467,5.89524,84.1048,99.9584
67,68,7049,176,556,280.334,59.2489,30.7511,99.8062
68,69,1533,761,471,321.678,45.8334,44.1666,99.978
69,70,717,646,468,253.293,62.5996,27.4004,99.9761
70,71,6397,1367,498,250.819,69.7004,20.2996,99.8894
71,72,1422,1821,485,225.313,70.3394,19.6606,99.9871
72,73,7234,1538,516,61.6149,48.7996,41.2004,99.8552
73,74,1263,685,489,22.3863,31.8088,58.1912,99.9902
74,75,2158,1452,502,64.6992,44.63399999999999,45.36600000000001,99.9494
75,76,70585,2041,677,212.808,1.75568,88.2443,97.5124
76,77,5552,2888,538,223.219,16.8318,73.1682,99.9548
77,78,81268,960,702,253.621,80.1971,9.80287,99.7492
78,79,744,1123,508,239.702,80.8975,9.1025,99.9173
79,80,65635,2917,720,4.03411,80.5035,9.49652,99.8553
80,81,153533,1365,687,324.585,49.5004,40.4996,99.8473
81,82,16615,1642,574,58.6784,28.5835,61.4165,99.9881
82,83,759,680,533,51.0062,30.3853,59.6147,99.9728
83,84,1062,133,547,274.705,60.1472,29.8528,99.9615
84,85,34979,652,692,51.9296,28.7973,61.2027,99.899
85,86,3093,1764,571,241.55900000000003,54.3279,35.6721,99.9961
86,87,628,137,563,254.462,54.9627,35.0373,99.9931
87,88,885,785,592,258.768,80.6731,9.32689,99.9773
88,89,3576,3078,651,243.587,29.7986,60.2014,99.8127
89,90,6710,790,665,245.406,48.9703,41.0297,99.9947
90,91,15642,1127,720,34.3881,2.8612900000000003,87.1387,99.99
91,92,36270,2677,734,357.161,72.5113,17.4887,99.9649
92,93,3022,3191,749,301.583,66.4158,23.5842,99.8222
93,94,114238,2140,1006,64.7211,47.9626,42.0374,53.8593
94,95,2509,1695,816,11.4689,47.2037,42.7963,99.9953
95,96,1428,3195,809,49.651,19.9092,70.0908,99.947
96,97,4238,1904,839,235.841,54.393,35.607,99.9945
97,98,84685,2640,970,232.393,0.0636826,89.9363,99.9496
98,99,2872,1223,862,238.954,2.48587,87.5141,99.9852
99,100,2832,1336,856,4.9366,71.9887,18.0113,99.987
100,101,801,2061,861,352.908,72.3012,17.6988,99.9798
101,102,6207,281,895,57.7665,47.3245,42.6755,99.9928
102,103,820,2014,879,3.57712,71.611,18.389,99.8763
103,104,4894,353,895,58.1613,47.3626,42.6374,99.9933
104,105,2435,956,893,154.377,77.543,12.457,99.975
105,106,5385,1470,914,358.576,73.6793,16.3207,99.9457
106,107,8182,1259,907,54.7705,21.0561,68.9439,99.8206
107,108,1814,197,931,350.1380000000001,53.3274,36.6726,99.8673
108,109,35964,1662,964,49.7456,27.6534,62.3466,99.9843
109,110,12329,2074,932,33.3808,10.6012,79.3988,99.8797
110,111,28251,2906,953,21.4543,84.956,5.04403,99.9023
111,112,4096,1391,911,54.508,20.091,69.90899999999999,99.959
112,113,62201,1174,1000,240.515,4.8642,85.1358,99.8442
113,114,913,2149,960,210.425,36.04,53.96,99.9719
114,115,2780,308,970,228.293,16.1259,73.8741,99.984
115,116,5033,257,1021,227.526,16.3882,73.6118,99.9289
116,117,318399,1366,1383,174.486,73.7898,16.2102,99.6691
117,118,20765,1202,1070,10.104,29.0064,60.9936,99.9149
118,119,50183,2945,1209,49.6808,20.7435,69.2565,86.0251
119,120,7360,343,1076,54.8112,33.0623,56.9377,99.9582
120,121,97222,2508,1245,209.542,65.7578,24.2422,51.8777
121,122,4737,1096,1100,211.897,36.7139,53.2861,99.9861
122,123,40527,321,1298,20.6562,30.7979,59.2021,99.9544
123,124,4283,1387,1101,41.1298,50.8783,39.1217,99.9857
124,125,88992,2016,1232,202.344,7.13605,82.8639,50.2438
125,126,3497,932,1106,225.767,46.0606,43.9394,99.9926
126,127,38280,1101,1218,223.022,44.3203,45.6797,99.9886
127,128,1821,3194,1151,56.5516,16.347,73.653,98.9072
128,129,3631,965,1169,113.037,84.1045,5.89548,99.9857
129,130,1820,1248,1164,237.454,7.24987,82.7501,99.782
130,131,5815,2010,1187,122.327,79.9228,10.0772,99.9554
131,132,2199,1702,1177,8.820839999999997,40.2549,49.7451,99.9939
132,133,13170,2716,1214,13.7581,52.5227,37.4773,99.9884
133,134,1258,2300,1191,110.703,77.1364,12.8636,99.9525
134,135,3672,3197,1235,48.0734,13.8894,76.1106,99.5954
135,136,1513,1747,1208,126.562,78.2368,11.7632,99.9937
136,137,14332,930,1306,244.023,33.0624,56.9376,99.9298
137,138,870,2346,1223,110.991,77.3574,12.6426,99.9859
138,139,7978,875,1267,52.3318,25.0222,64.9778,99.9928
139,140,579,1710,1216,219.24,36.3826,53.6174,99.9947
140,141,711,195,1264,20.6601,29.7541,60.2459,99.8507
141,142,553,565,1229,37.7946,14.0178,75.9822,99.9971
142,143,1596,623,1246,39.7068,16.105999999999998,73.89399999999998,99.9908
143,144,13199,2839,1318,12.5533,80.1289,9.87107,99.988
144,145,7042,734,1277,125.075,77.8514,12.1486,99.9182
145,146,7879,807,1310,229.594,6.59484,83.4052,99.9919
146,147,1367,2212,1269,39.2453,4.57027,85.4297,99.994
147,148,9484,2720,1287,245.264,56.2511,33.7489,99.9274
148,149,791,2405,1286,232.602,12.4793,77.5207,99.97
149,150,3914,2651,1327,61.004,26.5111,63.4889,99.9958
150,151,8399,1028,1350,44.3734,11.9679,78.0321,99.9576
151,152,16992,1848,1376,59.8869,65.7342,24.2658,99.9748
152,153,7076,176,1388,25.3513,30.38,59.62,98.9428
153,154,1481,1779,1333,219.086,22.9896,67.0104,99.9943
154,155,5723,723,1358,145.524,74.1386,15.8614,99.9948
155,156,6251,1949,1392,294.48,85.3541,4.64593,99.9802
156,157,5356,2234,1366,240.126,47.151,42.849,99.9932
157,158,7539,2742,1381,46.377,33.4293,56.5707,99.9783
158,159,300086,2176,1582,209.64,35.9594,54.0406,60.7929
159,160,511,3213,1368,50.7644,68.5975,21.4025,99.9718
160,161,17415,1725,1444,215.11,50.4233,39.5767,99.9746
161,162,2471,2918,1370,222.728,2.84615,87.1539,99.9814
162,163,30971,785,1483,41.255,52.182,37.81800000000001,88.2073
163,164,19493,622,1484,33.0556,14.9781,75.0219,99.8521
164,165,48057,2907,1529,49.7534,14.494000000000002,75.506,57.5146
165,166,760,150,1430,30.0128,48.0973,41.9027,99.8993
166,167,37405,352,1525,29.5184,42.4674,47.5326,99.9336
167,168,605,3222,1455,51.6599,68.5917,21.4083,99.9687
168,169,5097,1652,1501,48.40600000000001,32.8016,57.1984,99.8455
169,170,555,1019,1491,164.641,75.2408,14.7592,99.8795
170,171,8685,1561,1539,237.605,20.1136,69.8864,99.9664
171,172,4261,509,1553,27.9545,58.747,31.253,99.9545
172,173,97039,2751,1727,239.643,18.3404,71.6596,99.6488
173,174,2542,2395,1564,249.148,52.562,37.438,99.9882
174,175,1384,864,1564,21.8409,58.4836,31.5164,99.9624
175,176,2262,213,1595,47.6447,4.99266,85.0073,99.9503
176,177,62206,985,1698,43.7493,27.1664,62.8336,99.7124
177,178,6560,707,1599,41.2746,8.39201,81.608,99.7669
178,179,19301,592,1655,43.1608,20.0605,69.9395,99.7419
179,180,12160,1519,1634,228.088,9.58189,80.4181,99.9749
180,181,2517,807,1604,19.1549,58.8043,31.1957,99.9902
181,182,76711,381,1750,226.94,19.9522,70.0478,99.868
182,183,10951,2419,1689,236.922,61.2854,28.7146,99.9847
183,184,7609,2083,1634,205.919,32.1704,57.8296,99.9721
184,185,554,2365,1630,36.6745,69.6598,20.3402,99.9842
185,186,37547,778,1750,60.0666,37.0881,52.9119,99.9602
186,187,558,2106,1688,40.0127,26.6479,63.3521,99.9878
187,188,5135,1551,1720,243.225,79.2848,10.7152,99.9191
188,189,26321,1406,1769,260.031,63.705,26.295,99.8963
189,190,726,3210,1731,252.349,34.2373,55.7627,99.902
190,191,15561,2129,1787,248.525,69.3398,20.6602,99.9779
191,192,3540,2469,1744,230.05900000000003,36.4212,53.5788,99.982
192,193,2527,629,1741,155.66,72.5683,17.4317,99.9966
193,194,37068,1719,1842,204.172,2.9025,87.0975,99.8448
194,195,19962,374,1837,238.246,37.7448,52.2552,99.9967
195,196,2481,2034,1783,211.561,64.2171,25.7829,99.7895
196,197,29745,1332,1913,219.702,0.999168,89.0008,99.727
197,198,1580,282,1801,238.209,37.7815,52.2185,99.985
198,199,1421,3205,1807,34.7539,41.7567,48.2433,99.8307
199,200,4144,1565,1797,197.598,68.6864,21.3136,99.9759
200,201,565,2507,1779,220.032,74.7494,15.2506,99.9762
201,202,11823,653,1838,15.9064,56.04,33.96,99.988
202,203,867,2441,1790,50.3714,8.30145,81.6986,99.9065
203,204,31887,2276,1891,233.838,39.1035,50.8965,99.9927
204,205,240525,2433,2134,42.71,4.78333,85.2167,99.3069
205,206,3424,1955,1818,44.4894,7.67836,82.3216,99.9876
206,207,31146,2491,1912,210.048,44.7046,45.2954,99.9578
207,208,17366,1501,1872,49.7789,19.9015,70.0985,99.9716
208,209,4784,923,1848,13.8404,59.2282,30.7718,99.9905
209,210,3957,1882,1856,9.86328,54.1102,35.8898,99.9852
210,211,109838,1223,2054,223.78,37.9161,52.0839,99.9668
211,212,8093,2000,1874,205.343,15.5851,74.4149,99.0742
212,213,17967,810,1914,235.797,8.74156,81.2584,99.9614
213,214,6331,2120,1895,42.2827,30.4965,59.5035,99.9821
214,215,1059,2398,1884,235.529,11.3125,78.6875,99.9939
215,216,1366,998,1896,61.4201,41.06100000000001,48.93899999999999,99.9846
216,217,64569,468,2086,229.846,30.701,59.299,96.4546
217,218,1863,1601,1913,230.422,33.0242,56.9758,99.9893
218,219,2499,700,1911,234.172,79.544,10.456,99.9281
219,220,3336,2663,1913,25.6316,19.8874,70.1126,99.9921
220,221,24318,1823,1980,225.454,28.095,61.905,98.0652
221,222,702,610,1905,46.4361,9.23248,80.7675,99.9728
222,223,886,1990,1913,44.676,6.12464,83.8754,99.9819
223,224,38103,960,2031,222.503,47.791,42.209,99.7161
224,225,15450,594,1985,38.3123,48.0788,41.9212,99.9573
225,226,6452,1985,1956,202.133,24.7758,65.2242,99.9543
226,227,5881,2087,1971,24.6441,13.8558,76.1442,99.8874
227,228,5699,1622,1976,28.1242,49.4272,40.5728,99.9384
228,229,1409,711,1965,238.458,79.8827,10.1173,99.9814
229,230,3717,1513,1972,268.048,76.9191,13.0809,99.9417
230,231,666,685,1959,241.771,80.1744,9.82557,99.9605
231,232,1575,2638,1960,57.8226,53.2619,36.7381,99.9756
232,233,65357,2960,2229,233.355,12.3413,77.6587,88.4117
233,234,537,2386,1975,45.2374,4.32353,85.6765,99.9845
234,235,649,2815,1996,230.313,29.9959,60.0041,99.9928
235,236,5572,796,2007,213.745,5.29523,84.7048,99.9383
236,237,563,3216,2004,46.2607,53.6125,36.3875,99.9456
237,238,86047,1901,2221,13.8254,53.0265,36.9735,97.355
238,239,4262,1683,2037,32.7317,21.1626,68.8374,99.9224
239,240,4248,1512,2047,202.365,8.61678,81.3832,99.8604
240,241,13876,2848,2076,50.8389,53.5198,36.4802,99.9428
241,242,12646,708,2078,64.3672,49.8481,40.1519,99.9488
242,243,863,3267,2045,246.488,57.8386,32.1614,99.3915
243,244,56860,1543,2183,282.786,76.4495,13.5505,99.8964
244,245,17722,309,2133,218.699,3.16857,86.8314,99.9044
245,246,505,3216,2056,261.111,52.2069,37.7931,99.698
246,247,102335,2711,2265,26.8554,22.9019,67.0981,99.9632
247,248,27357,1722,2212,239.039,1.51978,88.4802,99.9842
248,249,2694,826,2131,47.2107,29.7377,60.2623,99.989
249,250,89448,950,2292,215.091,15.7021,74.2979,99.8802
250,251,622,190,2155,219.914,2.00342,87.9966,99.9322
251,252,1592,3225,2149,207.978,23.2932,66.7068,99.6115
252,253,11711,723,2174,223.584,29.5267,60.4733,99.9793
253,254,945,2542,2151,279.21,68.899,21.101,99.9687
254,255,792,616,2167,38.465,27.2712,62.7288,99.9671
255,256,1585,3215,2209,223.548,15.6211,74.3789,99.7874
256,257,2693,577,2217,36.6393,73.3373,16.6627,99.9882
257,258,927,521,2228,254.4,48.6677,41.3323,99.992
258,259,38301,372,2356,252.109,49.4684,40.5316,99.9874
259,260,181835,586,2574,38.8692,3.35134,86.6487,93.9124
260,261,856,732,2242,223.556,28.0579,61.9421,99.9587
261,262,29290,1130,2370,219.651,51.3697,38.6303,99.8525
262,263,1126,2106,2246,287.268,67.1653,22.8347,99.9827
263,264,1032,3215,2262,219.666,13.5351,76.4649,99.5994
264,265,3158,445,2302,40.2885,7.42266,82.5773,99.9812
265,266,1045,781,2272,184.053,58.5827,31.4173,99.9873
266,267,97153,1428,2522,61.2181,34.0095,55.9905,99.823
267,268,15266,2118,2317,32.05,40.5336,49.4664,99.621
268,269,819,1400,2287,50.2971,6.9405199999999985,83.0595,99.9766
269,270,567,270,2289,253.158,48.495,41.505,99.9783
270,271,2970,3222,2342,222.349,14.3686,75.6314,99.7553
271,272,16603,1687,2407,220.814,30.543000000000006,59.457,99.9734
272,273,7850,1539,2359,40.1015,10.4701,79.5299,99.9522
273,274,1498,268,2376,253.178,48.0637,41.9363,99.9803
274,275,6352,2184,2390,43.4133,55.7188,34.2812,99.9735
275,276,6236,1423,2405,64.4666,6.4797699999999985,83.5202,99.9925
276,277,7195,2520,2447,10.4078,8.79337,81.2066,99.9611
277,278,1827,3215,2427,224.415,15.1921,74.8079,99.7202
278,279,2917,1197,2417,50.0687,56.4388,33.5612,99.9641
279,280,3920,1582,2413,221.556,30.192,59.808,99.8539
280,281,5128,2598,2450,47.362,6.14164,83.8584,99.8352
281,282,1295,1650,2406,79.3139,49.2747,40.7253,99.9741
282,283,25616,2878,2508,242.618,51.5091,38.4909,99.949
283,284,49890,1928,2490,44.9593,4.07155,85.9285,99.9526
284,285,3147,2318,2430,25.9637,39.2296,50.7704,99.9937
285,286,770,3260,2419,351.481,60.4081,29.5919,98.9407
286,287,4590,2118,2452,7.79212,62.8082,27.1918,99.9898
287,288,2082,265,2468,37.2831,29.1272,60.8728,99.9287
288,289,1465,305,2460,36.3651,29.7732,60.2268,99.9797
289,290,536,3261,2460,301.9240000000001,59.1963,30.8037,99.8194
290,291,3087,2660,2483,208.95,6.24974,83.7503,99.9854
291,292,15919,1192,2575,27.0155,34.4795,55.5205,99.5143
292,293,1571,830,2484,36.5271,37.4983,52.5017,99.9526
293,294,1401,2224,2472,7.79772,61.8974,28.1026,99.9852
294,295,17249,2217,2532,44.926,55.9291,34.0709,99.963
295,296,12678,2759,2551,228.92,9.18983,80.8102,99.9716
296,297,6983,3227,2547,300.678,70.9735,19.0265,99.5621
297,298,1389,2259,2500,10.0236,9.54597,80.454,99.9771
298,299,5794,1105,2546,222.699,22.6493,67.3507,99.9712
299,300,18651,338,2571,11.6146,59.1964,30.8036,99.9744
300,301,50095,2491,2617,233.95,74.4449,15.5551,99.8725
301,302,11146,2628,2549,240.336,51.1316,38.8684,99.8207
302,303,20927,929,2559,226.947,33.266,56.734,99.8525
303,304,312361,2051,2813,41.4068,16.0631,73.9369,99.0016
304,305,961,1052,2543,220.102,21.8747,68.1253,99.9505
305,306,6479,1244,2581,216.71400000000003,50.5776,39.4224,99.8829
306,307,645,181,2567,10.844,59.3997,30.6003,99.8986
307,308,2407,212,2607,13.1054,64.9809,25.0191,99.932
308,309,20992,1651,2652,71.2632,48.7424,41.2576,99.9817
309,310,24961,617,2663,233.213,47.1636,42.8364,99.925
310,311,37534,2889,2707,235.429,10.4202,79.5798,98.4818
311,312,148729,921,2852,40.7411,33.2532,56.7468,95.8285
312,313,1013,2650,2594,208.129,44.6095,45.3905,99.9659
313,314,3205,2299,2627,17.2968,9.23363,80.7664,99.9818
314,315,569,2530,2619,244.332,52.8404,37.1596,99.9897
315,316,11748,1084,2700,42.7955,48.2368,41.7632,99.9753
316,317,11579,299,2695,12.0833,57.448,32.552,99.978
317,318,4925,1227,2672,205.845,13.3179,76.6821,99.9877
318,319,2273,1970,2656,217.133,44.6,45.4,99.9742
319,320,6718,2703,2681,239.717,50.039,39.961,99.9856
320,321,3523,3201,2712,238.616,39.0071,50.9929,99.9329
321,322,1252,1284,2694,32.6806,32.0309,57.9691,99.9163
322,323,38039,1399,2835,198.613,4.20938,85.7906,99.9491
323,324,5068,1468,2760,350.247,54.1683,35.8317,99.9389
324,325,1058,187,2747,11.7888,58.9124,31.0876,99.9441
325,326,70757,1294,2941,337.941,73.521,16.479,99.8236
326,327,7402,2516,2763,79.3162,66.8844,23.1156,99.9879
327,328,1717,2959,2753,235.188,37.4349,52.5651,99.972
328,329,93441,2716,2877,219.791,23.6929,66.3071,99.9649
329,330,2733,316,2781,224.74400000000003,42.6398,47.3602,99.9221
330,331,1025,360,2775,224.676,42.5288,47.4712,99.9972
331,332,1092,3208,2796,208.612,3.1927,86.8073,99.9647
332,333,2545,184,2873,37.7971,76.4216,13.5784,99.9658
333,334,27912,1574,2911,228.539,25.946,64.054,99.9697
334,335,2707,1665,2827,222.232,10.8587,79.1413,99.9791
335,336,3349,252,2878,34.6424,76.3419,13.6581,99.9758
336,337,6843,300,2899,31.7761,76.7352,13.2648,99.9845
337,338,2634,852,2873,231.719,48.2767,41.7233,99.973
338,339,1787,728,2885,234.725,47.4324,42.5676,99.9914
339,340,728,3023,2889,200.799,87.6561,2.34389,99.9728
340,341,41386,441,3034,43.4925,6.20303,83.79700000000003,65.1736
341,342,882,2801,2898,55.499,22.0697,67.9303,99.9882
342,343,24253,602,2968,14.8126,60.3005,29.6995,99.9878
343,344,6663,3022,2963,350.582,75.3982,14.6018,99.9481
344,345,10870,2456,2989,63.2495,15.034,74.96600000000002,99.446
345,346,3369,3205,2979,235.346,19.5408,70.4592,99.6273
346,347,1435,1684,2958,336.821,73.5162,16.4838,99.9748
347,348,2206,2388,3015,42.2503,52.3286,37.6714,99.9149
348,349,17145,2925,3039,56.9972,19.1094,70.8906,99.9487
349,350,10150,259,3020,38.8058,7.6071300000000015,82.3929,99.832
350,351,14132,2783,3056,239.731,9.28152,80.7185,99.9902
351,352,123881,1846,3181,227.325,26.547,63.453,99.676
352,353,6808,2546,3037,219.587,22.7002,67.2998,99.6146
353,354,4878,1971,3042,14.5944,3.98112,86.0189,99.5136
354,355,564,1583,3017,348.922,56.183,33.817,99.9474
355,356,1607,2631,3029,63.4886,9.27183,80.7282,99.9493
356,357,3892,1527,3052,221.315,12.2372,77.7628,99.9706
357,358,16442,862,3090,46.7655,35.2561,54.7439,99.9788
358,359,3696,1213,3056,32.7015,32.8789,57.1211,99.9963
359,360,47021,2216,3174,225.566,3.99656,86.0034,99.977
360,361,20810,985,3119,217.741,39.8275,50.1725,99.9084
361,362,624,2710,3063,64.0262,8.37325,81.6268,99.9752
362,363,2818,2301,3078,349.347,68.487,21.513,99.9903
363,364,11517,2644,3111,356.644,81.55199999999998,8.44797,99.977
364,365,64331,369,3255,219.664,45.1522,44.8478,99.9014
365,366,36484,2461,3154,18.408,68.7742,21.2258,99.8947
366,367,9614,688,3142,199.018,72.9197,17.0803,99.963
367,368,2925,1985,3101,235.034,17.2993,72.7007,99.9854
368,369,14367,1212,3129,222.85,26.3695,63.6305,99.994
369,370,79692,2842,3295,256.345,34.3768,55.6232,99.5574
370,371,4097,597,3126,17.7554,55.7643,34.2357,99.9552
371,372,1885,3201,3133,232.227,19.8288,70.1712,99.9086
372,373,77817,1343,3293,1.04025,59.2998,30.7002,99.9127
373,374,15280,729,3220,11.6022,58.1102,31.8898,99.9099
374,375,16908,2638,3224,60.9959,17.7564,72.2436,99.1762
375,376,130547,903,3350,190.969,72.8544,17.1455,99.7572
376,377,2488,492,3163,218.588,60.9959,29.0041,99.9923
377,378,812,602,3172,46.2191,44.7658,45.2342,99.9385
378,379,6982,2957,3224,228.261,5.3239800000000015,84.676,99.965
379,380,4403,555,3200,46.7164,45.3948,44.6052,99.9594
380,381,3536,1614,3217,359.699,57.1827,32.8173,99.9828
381,382,8175,1260,3226,241.017,1.1807299999999998,88.8193,99.9911
382,383,4411,242,3284,222.149,45.6935,44.3065,99.952
383,384,3064,1561,3230,225.784,27.1961,62.8039,99.9736
384,385,1290,1177,3220,0.0663696,60.7525,29.2475,99.9973
385,386,3093,623,3239,211.703,48.2068,41.7932,99.9909
386,387,5311,2390,3268,58.1932,8.634160000000001,81.3658,99.9877
387,388,7931,2462,3292,49.4398,1.03336,88.9666,98.7727
388,389,4770,1196,3281,358.624,72.6848,17.3152,99.9938
389,390,10539,1813,3306,258.547,76.03699999999998,13.963,99.9873
390,391,12334,1574,3322,246.058,62.2361,27.7639,99.99
391,392,621,1526,3281,278.873,74.7138,15.2862,99.9656
392,393,1306,572,3286,46.8184,42.7722,47.2278,99.9627
393,394,216348,2140,3715,217.69,62.2819,27.7181,98.3761
394,395,15054,2558,3366,18.2393,69.631,20.369,99.9854
395,396,8117,549,3347,37.334,4.6731099999999985,85.3269,99.993
396,397,53587,1582,3490,253.084,76.2341,13.7659,99.7815
397,398,3151,1911,3355,242.971,60.1387,29.8613,99.9901
398,399,4009,2200,3384,84.286,70.3535,19.6465,99.9779
399,400,11222,2424,3414,223.256,3.3360300000000005,86.664,99.9676
400,401,13895,2664,3422,57.3422,20.302,69.69800000000001,99.9673
401,402,4559,1817,3398,81.3349,67.9767,22.0233,99.9312
402,403,42213,585,3521,219.306,5.38023,84.6198,99.0144
403,404,8532,1929,3415,232.063,12.4547,77.5453,99.9611
404,405,19575,2790,3471,43.1715,30.738000000000003,59.262,99.9524
405,406,10454,1382,3469,254.856,77.3223,12.6777,99.8556
406,407,1240,3196,3415,167.78400000000005,57.7089,32.2911,99.9229
407,408,558,2011,3418,337.142,79.7234,10.2766,99.9633
408,409,4593,386,3446,199.299,12.6595,77.3405,99.9628
409,410,696,340,3433,174.946,78.8506,11.1494,99.9934
410,411,1908,299,3447,175.604,78.8617,11.1383,99.9892
411,412,21457,1033,3497,45.4649,8.07455,81.9255,99.9409
412,413,1162,1279,3442,32.8694,29.7873,60.2127,99.9932
413,414,18961,1806,3491,204.035,15.7775,74.2225,98.9048
414,415,546,2219,3439,236.137,21.7288,68.2712,99.9966
415,416,596,444,3454,195.95,8.572980000000001,81.42699999999998,99.8047
416,417,813,647,3452,45.2768,43.658,46.342,99.9826
417,418,53518,2575,3644,34.3142,22.5914,67.4086,99.4165
418,419,4294,1960,3490,239.118,60.8004,29.1996,99.806
419,420,9091,1161,3512,32.8527,29.488000000000003,60.512,99.8954
420,421,543,2031,3459,85.5867,70.4693,19.5307,99.9661
421,422,4862,3206,3530,239.319,13.1386,76.8614,99.7427
422,423,12758,307,3549,152.635,78.1369,11.8631,99.9726
423,424,8786,2413,3540,239.267,20.0517,69.9483,99.8541
424,425,3776,1237,3499,239.09,1.01832,88.9817,99.9696
425,426,31108,2049,3588,206.149,17.7451,72.2549,99.9143
426,427,1651,405,3502,9.72728,62.1371,27.8629,99.9295
427,428,215858,1384,3739,30.7587,12.0597,77.9403,99.5482
428,429,2469,1612,3524,204.588,12.597,77.403,99.9597
429,430,5211,2911,3572,352.63199999999995,82.9206,7.07942,99.8949
430,431,544,419,3529,9.27446,62.8699,27.1301,99.9789
431,432,10356,1643,3594,210.003,57.0634,32.9366,99.9692
432,433,1509,387,3556,147.421,78.76,11.24,99.9814
433,434,408079,690,4024,38.6101,2.12154,87.8785,47.0829
434,435,17258,1851,3600,72.5899,70.0381,19.9619,99.9316
435,436,58323,2788,3665,66.4407,77.1417,12.8583,99.9679
436,437,63357,846,3691,45.9664,7.73032,82.2697,99.9537
437,438,13621,2322,3640,267.967,81.5493,8.450660000000001,99.9987
438,439,2248,911,3616,28.2483,14.6012,75.3988,99.976
439,440,1508,506,3657,225.996,75.0073,14.9927,99.9945
440,441,19477,2476,3739,27.7595,29.2886,60.7114,99.9603
441,442,32732,633,3829,237.658,76.2026,13.7974,99.967
442,443,17775,2335,3751,241.916,15.1972,74.8028,99.9738
443,444,1257,268,3699,143.338,78.5013,11.4987,99.9923
444,445,1377,619,3707,22.558000000000003,10.0913,79.9087,99.9964
445,446,2446,514,3715,40.743,8.26335,81.7366,99.9882
446,447,1128,655,3712,22.1551,10.1605,79.8395,99.9944
447,448,3451,2942,3762,283.029,86.2824,3.71757,90.5113
448,449,542,2670,3722,37.2338,85.64,4.36,99.9897
449,450,521,2106,3746,43.4241,14.4694,75.5306,99.8873
450,451,32122,2860,3938,211.045,6.650710000000001,83.3493,98.1773
451,452,15183,1340,3858,244.911,78.1534,11.8466,99.9543
452,453,804,189,3821,218.325,10.0475,79.9525,99.8804
453,454,43022,2597,3927,205.39,5.8444699999999985,84.1555,99.9619
454,455,1682,1541,3825,201.779,39.9356,50.0644,99.9929
455,456,6302,2734,3853,67.7795,84.8562,5.14377,99.9718
456,457,2709,2909,3834,184.092,64.4271,25.5729,99.9753
457,458,1225,2812,3830,26.0934,57.4717,32.5283,99.9853
458,459,141323,1655,4100,219.22,24.3555,65.6445,84.9905
459,460,1197,2804,3868,44.3732,21.7837,68.2163,99.9962
460,461,14751,1448,3937,56.1943,45.6562,44.3438,99.9519
461,462,3016,1041,3888,66.108,50.3163,39.6837,99.9759
462,463,1135,186,3944,219.374,7.32286,82.6771,99.741
463,464,2488,2198,3945,35.8337,33.6762,56.3238,99.9965
464,465,2721,1365,3970,35.0855,12.3468,77.6532,99.9885
465,466,25185,2099,4045,49.8624,15.3272,74.6728,99.9267
466,467,17217,1301,4039,57.0684,89.8182,0.181847,99.9801
467,468,823,3211,3981,45.3651,43.0118,46.9882,99.8428
468,469,34114,2270,4073,219.618,39.4584,50.5416,99.1857
469,470,1242,2752,3989,55.6963,20.0923,69.9077,99.9435
470,471,47607,1945,4185,222.975,8.09371,81.9063,90.434
471,472,271217,2370,4325,218.832,25.1297,64.8703,86.4787
472,473,894,1886,3996,45.3287,20.2247,69.7753,99.9872
473,474,2390,220,4058,230.654,3.19747,86.8025,99.9419
474,475,1732,3205,4062,50.2639,42.9871,47.0129,99.6321
475,476,72671,2790,4175,57.1165,27.9555,62.0445,99.8112
476,477,1913,1393,4048,248.258,66.6146,23.3854,99.9961
477,478,3614,1224,4081,307.665,89.5855,0.414487,99.9931
478,479,12514,298,4143,230.694,5.6525,84.3475,99.9401
479,480,73966,1165,4232,49.8055,12.2586,77.7414,99.9448
480,481,2276,415,4116,12.9481,54.7414,35.2586,99.9634
481,482,3806,1349,4200,246.024,62.5651,27.4349,99.9779
482,483,31042,383,4295,26.914,27.1297,62.8703,62.112
483,484,541,786,4186,49.4999,52.5556,37.4444,99.9818
484,485,1545,3209,4230,103.125,71.1177,18.8823,99.9459
485,486,5506,302,4240,235.602,11.3228,78.6772,99.8541
486,487,14995,731,4269,12.0046,56.2883,33.7117,99.9939
487,488,16951,1592,4296,216.067,87.8931,2.10691,99.9898
488,489,20611,2811,4331,44.5718,6.50665,83.4933,99.8638
489,490,18543,1396,4318,213.945,6.601369999999998,83.3986,99.9835
490,491,1128,3187,4277,60.7761,83.4727,6.52726,99.964
491,492,700,224,4277,50.3903,1.35732,88.6427,99.9822
492,493,1693,2883,4292,53.4782,28.0953,61.9047,99.9871
493,494,1328,1847,4292,204.351,49.7133,40.2867,99.9716
494,495,672,1545,4286,208.979,39.5497,50.4503,99.9969
495,496,1481,190,4314,217.052,63.9298,26.0702,99.9854
496,497,3814,272,4349,236.926,9.0084,80.9916,99.734
497,498,11738,1747,4338,54.466,39.1671,50.8329,99.996
498,499,24109,664,4400,212.614,62.5899,27.4101,99.993
499,500,1488,504,4316,228.247,3.8214,86.1786,99.9461
500,501,19059,809,4416,222.751,52.932,37.06800000000001,99.9519
501,502,1847,730,4343,181.722,73.2106,16.7894,99.994
502,503,5209,1308,4373,207.931,35.8,54.2,99.9947
503,504,667,1840,4347,221.387,41.8264,48.1736,99.9931
504,505,23648,316,4447,230.866,7.37708,82.6229,89.0443
505,506,3498,523,4362,212.635,2.57547,87.4245,99.9937
506,507,4321,472,4398,219.0,43.923,46.077,99.9876
507,508,2474,1963,4375,237.512,43.9267,46.0733,99.9942
508,509,4671,3168,4401,216.131,50.8892,39.1108,99.9428
509,510,5346,1610,4392,34.7661,36.4587,53.5413,99.9923
510,511,5407,1507,4389,200.151,86.6315,3.3684800000000004,99.9458
511,512,30957,2770,4461,26.4393,26.6219,63.3781,99.9535
512,513,25883,1788,4459,226.175,60.2833,29.7167,99.9212
513,514,666,1140,4399,52.2709,1.04174,88.9583,99.9954
514,515,2139,1686,4411,204.126,48.231,41.769,99.9922
515,516,6195,588,4445,219.137,43.5529,46.4471,99.9656
516,517,36635,1350,4493,216.564,29.5906,60.4094,91.435
517,518,22072,2009,4503,44.732,6.013330000000002,83.9867,99.7119
518,519,1053,1351,4426,131.83,83.056,6.944,99.9814
519,520,2171,1918,4435,221.828,44.0619,45.9381,99.9802
520,521,2200,1967,4444,225.877,64.2964,25.7036,99.9679
521,522,5122,1107,4455,225.603,12.3536,77.6464,99.9872
522,523,16623,1610,4505,215.043,68.9298,21.0702,60.8835
523,524,1783,548,4467,218.459,41.9625,48.0375,99.9769
524,525,14056,3122,4564,225.592,60.3798,29.6202,89.8862
525,526,1398,492,4457,212.351,61.8075,28.1925,99.9715
526,527,1918,3097,4517,183.162,74.9557,15.0443,99.9605
527,528,1982,1514,4498,238.631,36.2146,53.7854,99.9915
528,529,14299,893,4539,46.044,5.86626,84.1337,99.7883
529,530,15365,1117,4543,336.92800000000005,67.3522,22.6478,99.9666
530,531,784,2943,4530,28.8403,27.4111,62.5889,99.8273
531,532,7565,692,4534,211.907,61.6038,28.3962,99.884
532,533,1496,562,4529,36.1615,2.04352,87.9565,99.8766
533,534,2643,1884,4540,55.4888,35.4584,54.5416,99.981
534,535,3017,2127,4565,229.93,63.3262,26.6738,99.9727
535,536,3949,1756,4552,51.9899,39.8042,50.1958,99.9875
536,537,2908,1314,4560,231.357,16.6534,73.3466,99.8431
537,538,916,1510,4552,108.738,79.584,10.416,99.9892
538,539,1019,2072,4561,53.9332,34.6723,55.3277,99.9921
539,540,7679,2871,4600,30.7181,27.7723,62.2277,99.681
540,541,1507,1747,4585,217.757,28.5739,61.4261,99.9137
541,542,887,2203,4585,226.865,64.52,25.48,99.9095
542,543,521,3017,4578,237.377,46.7319,43.2681,99.917
543,544,1725,1304,4584,232.385,16.324,73.676,99.7714
544,545,1456,1572,4588,232.738,13.634,76.366,99.925
545,546,825,1419,4588,235.918,36.6415,53.3585,99.9795
546,547,1388,2654,4601,33.7382,29.369,60.631,99.8406
547,548,639,2095,4591,55.3991,35.9731,54.0269,99.9553
548,549,603,1660,4592,121.079,81.9605,8.039539999999999,99.9568
