<?xml version="1.0" encoding="UTF-8" standalone="no"?>
<!-- Created with Inkscape (http://www.inkscape.org/) -->
<svg
   xmlns:dc="http://purl.org/dc/elements/1.1/"
   xmlns:cc="http://creativecommons.org/ns#"
   xmlns:rdf="http://www.w3.org/1999/02/22-rdf-syntax-ns#"
   xmlns:svg="http://www.w3.org/2000/svg"
   xmlns="http://www.w3.org/2000/svg"
   xmlns:sodipodi="http://sodipodi.sourceforge.net/DTD/sodipodi-0.dtd"
   xmlns:inkscape="http://www.inkscape.org/namespaces/inkscape"
   width="128"
   height="128"
   id="svg2629"
   sodipodi:version="0.32"
   inkscape:version="0.46"
   sodipodi:docbase="D:\PT_Tübingen\Eule"
   sodipodi:docname="Icon-Eule.svg"
   inkscape:output_extension="org.inkscape.output.svg.inkscape"
   version="1.0">
  <defs
     id="defs2631">
    <inkscape:perspective
       sodipodi:type="inkscape:persp3d"
       inkscape:vp_x="0 : 526.18109 : 1"
       inkscape:vp_y="0 : 1000 : 0"
       inkscape:vp_z="744.09448 : 526.18109 : 1"
       inkscape:persp3d-origin="372.04724 : 350.78739 : 1"
       id="perspective366" />
  </defs>
  <sodipodi:namedview
     id="base"
     pagecolor="#ffffff"
     bordercolor="#666666"
     borderopacity="1.0"
     inkscape:pageopacity="0.0"
     inkscape:pageshadow="2"
     inkscape:zoom="5.2249848"
     inkscape:cx="91.091783"
     inkscape:cy="40.556818"
     inkscape:document-units="px"
     inkscape:current-layer="layer1"
     inkscape:window-width="1407"
     inkscape:window-height="851"
     inkscape:window-x="0"
     inkscape:window-y="25"
     showgrid="false" />
  <metadata
     id="metadata2634">
    <rdf:RDF>
      <cc:Work
         rdf:about="">
        <dc:format>image/svg+xml</dc:format>
        <dc:type
           rdf:resource="http://purl.org/dc/dcmitype/StillImage" />
      </cc:Work>
    </rdf:RDF>
  </metadata>
  <g
     inkscape:label="Ebene 1"
     inkscape:groupmode="layer"
     id="layer1"
     transform="translate(-473.20308,-764.51056)">
    <g
       id="g4571"
       transform="matrix(0.642401,0,0,0.642401,173.21695,273.3882)">
      <g
         style="fill:#7382b3"
         transform="matrix(3.2884899,0,0,3.6779045,475.88775,772.2304)"
         id="g2460">
        <g
           style="fill:#7382b3"
           id="g2431"
           transform="translate(0.1156007,0.1560565)">
          <path
             id="path2391"
             d="M 29.131049,40.475344 L 29.131049,30.933514 L 42.077279,30.933514 L 55.023505,30.933514 L 55.023505,40.475344 L 55.023505,50.017174 L 42.077279,50.017174 L 29.131049,50.017174 L 29.131049,40.475344 z"
             style="opacity:1;fill:#7382b3;fill-opacity:1" />
          <g
             style="fill:#7382b3"
             transform="translate(5e-5,0)"
             id="g2427">
            <path
               style="opacity:1;fill:#7382b3;fill-opacity:1"
               d="M -0.084918801,45.770544 L -0.084918801,41.523894 L 0.59664025,41.523894 L 1.2781993,41.523894 L 1.2781993,45.770544 L 1.2781993,50.017174 L 0.59664025,50.017174 L -0.084918801,50.017174 L -0.084918801,45.770544 z"
               id="path2407" />
            <path
               style="opacity:1;fill:#7382b3;fill-opacity:1"
               d="M -0.084918801,35.180154 L -0.084918801,30.933514 L 0.59664025,30.933514 L 1.2781993,30.933514 L 1.2781993,35.180154 L 1.2781993,39.426794 L 0.59664025,39.426794 L -0.084918801,39.426794 L -0.084918801,35.180154 z"
               id="path2377" />
          </g>
          <g
             style="fill:#7382b3"
             transform="translate(-10.088719,0)"
             id="g2419">
            <path
               style="opacity:1;fill:#7382b3;fill-opacity:1"
               d="M 20.466707,45.770544 L 20.466707,41.523894 L 22.930806,41.523894 L 25.394904,41.523894 L 25.394904,45.770544 L 25.394904,50.017174 L 22.930806,50.017174 L 20.466707,50.017174 L 20.466707,45.770544 z"
               id="path2399" />
            <path
               style="opacity:1;fill:#7382b3;fill-opacity:1"
               d="M 20.466707,35.180154 L 20.466707,30.933514 L 22.930806,30.933514 L 25.394904,30.933514 L 25.394904,35.180154 L 25.394904,39.426794 L 22.930806,39.426794 L 20.466707,39.426794 L 20.466707,35.180154 z"
               id="path2371" />
          </g>
          <g
             style="fill:#7382b3"
             transform="translate(-17.8228,0)"
             id="g2415">
            <path
               style="opacity:1;fill:#7382b3;fill-opacity:1"
               d="M 36.037711,45.770544 L 36.037711,41.523894 L 39.943568,41.523894 L 43.849426,41.523894 L 43.849426,45.770544 L 43.849426,50.017174 L 39.943568,50.017174 L 36.037711,50.017174 L 36.037711,45.770544 z"
               id="path2395" />
            <path
               style="opacity:1;fill:#7382b3;fill-opacity:1"
               d="M 36.037711,35.180154 L 36.037711,30.933514 L 39.943568,30.933514 L 43.849426,30.933514 L 43.849426,35.180154 L 43.849426,39.426794 L 39.943568,39.426794 L 36.037711,39.426794 L 36.037711,35.180154 z"
               id="path2367" />
          </g>
          <g
             style="fill:#7382b3"
             transform="translate(-4.6829739,0)"
             id="g2423">
            <path
               style="opacity:1;fill:#7382b3;fill-opacity:1"
               d="M 8.4083555,45.770544 L 8.4083555,41.523894 L 10.16468,41.523894 L 11.921005,41.523894 L 11.921005,45.770544 L 11.921005,50.017174 L 10.16468,50.017174 L 8.4083555,50.017174 L 8.4083555,45.770544 z"
               id="path2403" />
            <path
               style="opacity:1;fill:#7382b3;fill-opacity:1"
               d="M 8.4083555,35.153944 L 8.4083555,30.933514 L 10.16468,30.933514 L 11.921005,30.933514 L 11.921005,35.153944 L 11.921005,39.374374 L 10.16468,39.374374 L 8.4083555,39.374374 L 8.4083555,35.153944 z"
               id="path2363" />
          </g>
        </g>
        <text
           xml:space="preserve"
           style="font-size:41.30266953px;font-style:normal;font-weight:normal;text-align:start;text-anchor:start;fill:#7382b3;fill-opacity:1;stroke:none;stroke-width:1px;stroke-linecap:butt;stroke-linejoin:miter;stroke-opacity:1;font-family:Times New Roman"
           x="-0.28631601"
           y="28.128128"
           id="text2348"><tspan
             sodipodi:role="line"
             id="tspan2350"
             x="-0.28631601"
             y="28.128128">TG</tspan></text>
      </g>
      <g
         inkscape:export-ydpi="90"
         inkscape:export-xdpi="90"
         inkscape:export-filename="D:\PT_Tübingen\Eule\schema_orange-rötlich_3.png"
         id="g5587">
        <path
           style="fill:none;fill-opacity:0.75;fill-rule:evenodd;stroke:#000000;stroke-width:1px;stroke-linecap:butt;stroke-linejoin:miter;stroke-opacity:1"
           d="M 591.79453,866.48676 C 591.79453,867.93037 591.53219,863.59997 591.18206,862.19946 C 591.07659,861.77757 591.18206,861.11804 591.18206,860.66828"
           id="path3105" />
        <path
           style="fill:none;fill-opacity:0.75;fill-rule:evenodd;stroke:#000000;stroke-width:1px;stroke-linecap:butt;stroke-linejoin:miter;stroke-opacity:1"
           d="M 590.87583,860.36205 C 590.87583,860.36205 590.87583,860.36205 590.87583,860.36205 z"
           id="path3107" />
        <g
           id="g3109"
           style="fill:#ea8400;fill-opacity:1"
           transform="translate(4.275961,142.85491)">
          <path
             sodipodi:nodetypes="cssssscccccssc"
             id="path3111"
             d="M 486.37189,783.81727 C 478.5476,775.69792 477.08461,772.29298 475.97859,759.62808 C 475.15703,750.22077 475.22325,748.34971 476.56293,743.1129 C 480.29099,728.53991 487.59205,716.89764 498.73842,714.91344 C 505.09831,713.7813 515.01676,713.74638 519.78299,716.03176 C 523.9323,718.02129 529.70062,723.80754 531.54615,727.83138 C 533.60259,732.31508 533.41696,740.28032 531.14277,745.14065 C 524.25355,757.38211 526.02283,755.37271 523.50409,757.80928 C 521.50861,759.5066 519.21026,766.41009 518.50326,772.83013 L 517.98769,777.51199 L 511.05054,779.28881 C 507.23511,780.26611 501.60451,782.16918 498.53809,783.51787 C 493.79258,785.60503 489.29174,786.35262 489.75198,787.71554 C 490.83346,790.91814 491.52185,789.16145 486.37189,783.81727 z"
             style="fill:#ea8400;fill-opacity:1;stroke:none;stroke-opacity:1" />
          <g
             transform="translate(-11.678773,54.618276)"
             style="fill:#ea8400;fill-opacity:1"
             id="g3113">
            <path
               style="opacity:1;fill:#ea8400;fill-opacity:1;stroke:none;stroke-opacity:1"
               d="M 632.64174,697.12413 C 628.8551,690.59562 622.64911,684.76669 618.81576,682.25207 C 616.4165,680.67819 619.06258,679.44251 623.34223,678.88361 C 627.17882,678.38256 627.37165,678.1679 627.3881,674.68431 C 627.39914,672.33338 627.86788,672.02623 630.39964,672.02623 C 633.60269,672.02623 633.66486,673.67857 631.40922,667.21579 C 630.79333,665.45118 630.05583,663.24377 629.86495,662.03113 C 629.41906,659.1985 630.96753,653.74689 631.99069,653.74689 C 632.52825,653.74689 633.21319,652.05032 632.85947,646.48683 C 631.91909,631.69529 630.82682,625.21568 628.87733,620.89702 C 624.33639,612.00104 635.58247,627.44635 624.75966,615.46347 C 622.61598,617.60711 619.00753,616.66015 615.88737,616.63442 C 613.39296,615.61293 613.92267,614.9965 610.44325,610.98579 C 609.79066,609.32819 603.38522,609.74119 602.835,609.07822 C 601.56011,607.54204 602.36284,599.57425 604.1259,596.88348 C 605.89577,594.18234 619.39066,587.19453 622.97639,587.19453 C 635.22942,587.19453 659.58488,616.53456 663.55258,635.94426 C 664.90552,642.56319 663.55747,654.85467 661.14678,662.036 C 657.10936,674.06335 645.42035,695.86437 638.06436,704.58755 C 637.81836,704.87921 634.61648,702.41989 633.23626,698.38745 L 632.64174,697.12413 z"
               id="path3115"
               sodipodi:nodetypes="cssssssssccccsssssscc" />
            <path
               style="opacity:1;fill:#ea8400;fill-opacity:1;stroke:none;stroke-opacity:1"
               d="M 592.35287,593.31606 C 585.51359,590.2228 588.69813,583.95735 597.10961,583.95735 L 600.33669,583.95735 L 598.58671,588.86373 C 596.77347,593.94758 595.60089,594.78504 592.35287,593.31604 L 592.35287,593.31606 z"
               id="path3117" />
          </g>
        </g>
        <g
           id="g3119"
           style="fill:#ea8400;fill-opacity:1"
           transform="translate(-7.402812,197.47319)">
          <path
             sodipodi:nodetypes="csssssccsssccscccsssssccsccsscccssssssssccssssssssssssssssc"
             id="path3121"
             d="M 621.56988,570.96875 C 620.92011,570.91879 619.68708,571.46469 617.87783,572.625 C 613.71997,575.29155 612.74651,574.87679 612.74652,573.53125 C 612.74652,572.42507 611.78371,573.19757 611.11952,574.5 C 610.1192,576.46155 609.00815,578.15697 606.83299,580 C 603.99501,582.40467 602.40261,584.54625 600.88818,587.5625 C 598.58913,592.14151 597.53827,595.74114 599.60535,597.0625 L 599.41762,597.53125 C 598.64694,598.07038 599.14965,598.48341 597.5716,597.28125 C 597.01481,596.85711 595.77673,595.41616 594.5621,594.86114 C 590.25811,592.89441 585.13328,592.08348 578.74867,592.32989 C 568.54385,592.7237 555.83414,596.35931 548.94927,600.92364 C 543.67549,603.23365 545.01004,605.93855 544.20389,606.2825 C 539.19545,600.54415 535.08681,598.49123 527.29878,596.55557 C 522.58663,595.3844 521.78903,594.96933 520.94607,593.21875 L 520.3203,591.23614 L 519.28664,593.23727 C 519.00969,594.04905 518.99925,595.17565 518.99924,596.13659 C 518.99924,598.23563 519.10214,598.02338 516.2528,597.44216 C 515.16668,597.22061 513.5158,597.53339 513.4663,597.47338 C 512.98481,596.88951 514.13826,598.69122 514.73126,599.67477 C 516.38552,602.41855 516.73873,604.64192 517.19612,608.65625 C 517.81897,614.1228 518.57882,616.74347 521.59505,621.4317 L 521.30879,624.52204 C 520.67983,625.29783 519.02146,630.11 518.28541,633.49307 C 517.20462,638.46066 517.1225,647.06744 518.21009,651.79977 C 519.41879,654.38524 518.81171,658.29739 521.33666,658.76386 C 521.00106,659.30059 522.95982,659.14466 523.59979,659.14466 C 524.86544,659.14466 528.16965,660.13138 530.14955,661.0567 C 531.20354,661.54929 532.80444,662.4537 532.80441,662.40159 C 533.9664,663.39853 535.06303,663.54602 536.15228,664.375 C 535.50787,664.3207 534.8634,664.2605 534.1811,664.21875 C 534.08049,664.31925 539.6266,670.63539 539.97414,671.78125 C 541.0132,675.20713 541.83476,679.25533 542.03918,682 C 542.32875,685.88794 542.98872,686.9271 545.12514,688.37614 C 550.3968,691.95164 561.22121,695.91215 567.3782,696.3125 C 569.08814,696.42369 572.0367,696.54311 572.60338,696.71875 C 573.17005,696.89435 574.82117,696.84244 576.17027,696.96875 C 577.51937,697.09505 578.89923,697.14567 579.23654,697.09375 C 579.57381,697.04186 580.95249,696.85973 582.27152,696.6875 C 583.87316,696.47838 585.10641,696.13209 586.02614,695.59375 C 590.92235,693.99306 595.04083,691.8586 599.91824,689.96875 C 609.0339,686.78355 615.40543,682.99363 620.75637,677.3125 C 626.62323,671.08368 628.2003,665.86405 630.01777,653.3125 C 631.42635,643.58469 631.66849,633.26633 630.54967,631.6875 C 630.1825,631.16937 630.11279,629.91934 630.11164,628.65625 C 630.10952,626.3499 629.79048,625.40059 628.04841,621.25 C 627.03238,618.82932 626.45888,617.47077 626.138,617.59375 C 625.89663,617.68626 623.16428,617.52392 620.85024,617.63426 C 617.33164,617.80202 616.47389,618.62482 615.68764,618.21875 C 614.46235,617.58589 611.34393,614.1789 611.18209,613.3125 C 610.66085,610.52161 609.97016,609.75334 609.36622,609.82409 C 603.8974,610.4647 603.45986,610.47767 602.42246,608.45602 C 601.12466,605.92689 600.98088,601.42374 602.39003,598.21875 C 603.93318,594.70898 612.31118,589.15681 618.31587,587.4375 C 619.32769,587.14778 620.33108,586.38813 620.53736,586.21875 C 620.81327,585.99218 621.27608,584.54507 621.2257,580.34375 C 621.16717,575.46193 621.29895,573.7948 621.75761,572.78125 C 622.27473,571.63844 622.21964,571.01871 621.56988,570.96875 z"
             style="opacity:1;fill:#ea8400;fill-opacity:1;stroke:none;stroke-opacity:1" />
          <path
             id="path3123"
             d="M 629.44134,670.80722 C 628.65536,670.53074 627.71964,669.1671 627.55393,668.0567 C 627.41284,667.1113 627.74501,666.66398 628.58815,666.66398 C 629.75067,666.66398 630.94642,668.02181 630.94642,669.34187 C 630.94642,670.34863 630.20094,671.07442 629.44134,670.80722 z"
             style="opacity:1;fill:#ea8400;fill-opacity:1;stroke:none;stroke-opacity:1" />
          <path
             id="path3125"
             d="M 623.57457,677.80782 C 622.52995,677.60929 623.64726,675.13095 625.62603,673.2574 L 626.40769,672.5173 L 626.32764,674.01931 C 626.25905,675.30602 626.17169,675.65737 625.71808,676.47046 C 625.13134,677.52226 624.417,677.96794 623.57457,677.80782 z"
             style="opacity:1;fill:#ea8400;fill-opacity:1;stroke:none;stroke-opacity:1" />
        </g>
        <path
           style="fill:#bb4100;fill-opacity:1;stroke:none;stroke-opacity:1"
           d="M 561.12361,929.67465 C 552.65989,920.42157 544.34578,917.65556 530.05491,919.33843 C 525.65053,919.8571 521.94046,919.93111 521.51579,919.47764 C 520.46859,918.35945 522.27862,905.18029 525.86423,900.72619 C 527.96264,898.37814 528.50211,895.98517 530.23981,893.38297 C 531.73933,891.28532 533.43952,888.36334 533.44608,887.82653 C 533.48307,884.79969 534.71529,884.61583 538.8981,887.25757 C 546.00572,891.74653 550.4585,893.28857 563.21015,893.94798 C 574.62395,894.53819 575.05129,894.49913 579.85859,892.42577 C 582.5723,891.25539 585.04836,890.46661 585.361,890.67292 C 586.21051,891.23353 613.16573,879.52361 600.49434,885.44073 C 598.29684,886.46689 605.53828,881.60033 607.30924,880.24886 C 610.36075,877.92021 611.09585,876.33552 613.21193,877.51072 C 614.43998,878.19276 616.95688,881.30961 617.88869,882.38239 C 620.67827,885.59404 630.54953,903.76387 633.17638,910.61993 C 634.52339,914.13548 635.08706,918.56199 635.80348,920.16313 C 636.51991,921.76427 636.99945,924.24466 636.86912,925.6751 L 636.63223,928.27587 L 629.85836,925.95395 C 617.91257,921.85912 600.63971,917.05505 595.66615,916.44409 C 591.83996,915.97407 590.40865,916.21708 588.53031,914.30038 C 586.87749,912.61381 585.30668,911.01374 583.48474,911.01374 C 580.50791,911.01374 579.01066,912.47238 577.21011,917.12671 C 576.52886,918.88767 574.1786,922.42311 571.98734,924.98318 C 569.79606,927.54326 567.47393,930.5004 566.82703,931.55461 C 566.18011,932.60882 565.4136,933.47133 565.12365,933.47133 C 564.83369,933.47133 563.03368,931.76282 561.12363,929.67465 L 561.12361,929.67465 z"
           id="path3127"
           sodipodi:nodetypes="cssccssssssssssscccssssssscc" />
        <path
           style="fill:#eec73e;fill-opacity:1;stroke:none;stroke-opacity:1"
           d="M 563.1178,885.49579 C 559.56193,884.72642 556.54745,875.81876 556.1034,871.32965 C 555.41081,864.32805 560.71568,850.55166 564.37532,848.15378 C 566.53369,846.73956 568.896,846.23165 570.87383,847.04107 C 571.87449,847.45058 573.23757,848.01338 573.81539,847.94162 C 574.51424,847.85482 575.94124,849.24146 577.22392,851.51426 C 578.28447,853.39342 579.19471,855.82947 580.03451,856.49004 C 581.77448,857.85873 588.33693,859.76931 590.05792,859.76931 C 591.01413,859.76931 590.59765,860.76139 590.77282,863.55095 C 590.95311,866.42235 591.1652,867.3413 590.11249,867.8214 C 587.61795,868.95904 581.7875,877.07184 579.15751,878.16927 C 576.24198,881.96499 570.85727,885.35733 567.45482,886.0358 L 563.1178,885.49579 z M 571.86812,861.91178 C 572.91144,859.38877 572.96862,858.69284 572.3125,856.50291 C 570.65056,850.95582 567.32717,853.39689 567.32717,860.16468 C 567.32717,864.67461 567.58125,865.25601 569.4345,864.98688 C 570.25371,864.86791 571.07464,863.83057 571.86811,861.91178 L 571.86812,861.91178 z M 564.44355,861.30695 C 565.16971,859.82133 565.48858,858.01438 565.36523,856.08417 L 565.17662,853.1329 L 563.39422,855.46296 C 561.10944,858.44977 560.27514,864.1452 562.17394,863.79331 C 562.81156,863.67514 563.83291,862.55628 564.44356,861.30695 L 564.44355,861.30695 z"
           id="path3129"
           sodipodi:nodetypes="csssssssssccccsssccccccscc" />
        <path
           style="fill:#552200;fill-opacity:1;stroke:none;stroke-opacity:1"
           d="M 478.7163,962.03259 C 477.05917,961.71739 476.42171,961.32105 475.67662,960.14293 C 474.84646,958.8303 473.6022,957.97243 477.65828,955.7853 C 489.4208,949.44276 506.40202,946.46227 540.75737,942.22826 L 551.28918,940.93029 L 555.26479,943.61468 C 560.0939,946.8754 562.12599,947.71383 564.70692,947.51043 C 567.03414,947.32702 568.83792,946.40944 573.21926,943.18019 C 575.55058,941.4619 577.0375,940.58447 578.02025,940.34717 C 579.79883,939.9177 585.17312,940.38421 590.76613,941.45355 C 594.95531,942.25448 600.88332,942.92133 610.36964,943.65873 C 617.84311,944.23966 622.32921,944.81291 630.24304,946.19826 C 642.63023,948.36669 646.58135,949.58346 647.74865,951.58928 C 648.18329,952.33612 648.17171,952.4511 647.52496,953.80923 C 646.06614,956.87261 644.57041,957.06225 628.15063,956.26568 C 622.31976,955.98282 614.15933,955.61326 610.01636,955.44446 C 597.64708,954.94049 585.23816,954.15824 581.61784,952.43631 C 578.30839,950.86223 578.42798,950.83165 576.66096,951.80502 C 575.54211,952.42133 574.2439,952.34324 573.11133,953.84849 C 570.94151,956.73232 570.01272,957.41801 568.06094,957.57697 C 565.96367,957.74776 562.76885,957.08187 558.50092,953.68618 C 556.74893,952.29225 555.90744,952.51284 555.47569,952.32804 C 554.35762,951.84942 553.05116,950.96738 552.29512,951.52513 C 550.99435,952.48474 543.98798,952.74942 521.4374,955.90849 C 506.22109,958.04012 502.92901,958.56123 493.53851,960.32477 C 486.80734,961.5889 481.50754,962.39119 480.42603,962.30979 C 480.19587,962.29249 479.42648,962.16779 478.7163,962.03259 L 478.7163,962.03259 z"
           id="path3131"
           sodipodi:nodetypes="csscccsssssssssssssssssssscc" />
        <path
           style="fill:#ffe680;fill-opacity:1;stroke:none;stroke-width:4;stroke-miterlimit:4;stroke-dasharray:none;stroke-opacity:1"
           d="M 594.44327,823.78807 C 589.41399,823.93657 584.47617,826.02725 580.78622,829.43169 C 578.70163,831.30336 577.32752,833.85211 576.69632,836.55684 C 576.55161,837.11705 576.29049,837.74565 575.64795,837.8469 C 573.58842,838.38289 571.42974,838.31592 569.32187,838.56603 C 567.04022,838.80978 564.71711,838.98694 562.52449,839.69253 C 562.08011,839.80858 561.93688,839.16819 561.71781,838.90468 C 559.88449,835.17536 557.2795,831.74345 553.86446,829.33125 C 551.49989,827.77539 548.57022,827.74124 545.84788,827.47934 C 543.12323,827.34866 540.37068,827.1463 537.65553,827.48561 C 534.50772,828.16432 531.83166,830.17012 529.52596,832.33197 C 526.05551,835.69227 523.68447,840.30559 523.50645,845.17552 C 523.31153,848.42782 523.26461,851.83124 524.64507,854.85937 C 526.21009,858.4181 528.91602,861.33538 531.81054,863.86833 C 533.7599,865.55953 536.29447,866.55707 538.88595,866.52013 C 542.55692,866.51006 546.15632,865.6459 549.72434,864.8691 C 552.46217,864.24773 555.18841,862.98444 556.91168,860.68777 C 559.25621,857.71469 559.71819,853.82256 561.38196,850.50895 C 562.51065,848.39965 564.49194,846.58867 566.89689,846.17736 C 569.29154,845.96896 571.73316,846.34019 573.9059,847.34186 C 575.19311,847.96058 576.63063,848.74525 577.2205,850.11659 C 577.46787,851.32422 577.64896,852.61564 578.47604,853.59442 C 580.55802,856.24789 583.77857,857.70108 586.93205,858.65107 C 589.71608,859.50514 592.67876,859.52078 595.54814,859.2349 C 598.89133,858.73266 602.13217,857.22592 604.39651,854.67104 C 607.68604,851.03518 608.99947,845.97044 608.88908,841.15216 C 608.72333,835.36891 606.20969,829.54087 601.68341,825.85182 C 599.62426,824.30219 596.97682,823.74385 594.44327,823.78807 z M 594.87957,828.15732 C 595.92109,828.1047 596.97384,828.1901 597.90854,828.68151 C 600.3918,829.88586 602.11335,832.26329 603.13156,834.77084 C 604.7244,839.0205 604.78761,843.90665 603.006,848.11402 C 601.66253,851.40978 598.32713,853.57311 594.90468,854.1186 C 592.90171,854.42664 590.62038,854.15165 589.11354,852.66218 C 588.59967,852.13569 588.29443,851.26889 587.49076,851.15241 C 586.91657,850.80618 586.05159,850.71346 585.64827,851.36271 C 584.30326,850.38661 583.09812,849.20174 582.02919,847.93196 C 581.00013,846.34177 581.34806,844.34263 581.41398,842.55828 C 581.61076,839.06026 582.63606,835.52872 584.87298,832.78082 C 587.26637,829.83515 591.06789,828.00252 594.87957,828.15732 z M 543.14221,833.12609 C 546.02579,833.11135 548.93836,833.85263 551.37419,835.39783 C 552.59199,836.15486 553.53709,837.33637 553.82196,838.75986 C 554.65684,842.09943 554.81492,845.57459 554.7519,849.02101 C 554.71789,851.54998 554.39386,854.23878 552.79412,856.31265 C 551.13994,858.56756 548.69627,860.25253 545.93577,860.78862 C 542.66599,861.47264 539.19644,860.93357 536.34036,859.20979 C 534.52573,858.10362 532.68154,856.80255 531.57875,854.93156 C 530.58189,852.8682 530.23642,850.56514 529.81159,848.33687 C 529.43597,846.3713 529.62333,844.32556 530.42165,842.49263 C 531.67114,839.08268 533.93883,835.83635 537.32658,834.30287 C 539.13792,833.42002 541.14838,833.11195 543.14221,833.12609 z"
           id="path3133" />
        <g
           id="g3135"
           style="fill:#ea8400;fill-opacity:1"
           transform="translate(4.275961,142.85491)">
          <path
             id="path3137"
             d="M 548.64239,753.46111 C 546.3282,753.56018 544.46176,755.33842 543.35499,757.23917 C 541.97372,759.70077 541.84572,762.71699 542.54203,765.4066 C 543.00555,766.8831 544.72565,767.30088 546.09952,767.16802 C 548.34151,767.13087 550.56432,766.01949 551.7808,764.10208 C 553.22645,762.13341 553.36871,759.4937 552.68199,757.21081 C 552.31602,755.64299 551.4473,753.89686 549.71689,753.55249 C 549.36454,753.47673 549.00252,753.44662 548.64239,753.46111 z"
             style="opacity:1;fill:#ea8400;fill-opacity:1;stroke:none;stroke-width:4;stroke-miterlimit:4;stroke-dasharray:none;stroke-opacity:1" />
          <path
             id="path3139"
             d="M 567.88878,754.50725 C 566.31862,754.72947 565.36269,756.21731 564.61948,757.47226 C 563.78468,759.03932 563.07513,761.04935 564.05715,762.71879 C 564.97089,764.24802 566.33645,765.46526 567.6367,766.6481 C 568.79149,767.5266 570.27316,766.77284 571.3486,766.14079 C 573.51298,764.9484 575.44944,762.78567 575.44176,760.19167 C 575.39815,758.10475 573.37095,756.70901 571.47311,756.41448 C 570.7288,756.29903 569.75727,756.22127 569.45799,755.39268 C 569.12642,754.85205 568.54451,754.45009 567.88878,754.50725 z"
             style="opacity:1;fill:#ea8400;fill-opacity:1;stroke:none;stroke-width:4;stroke-miterlimit:4;stroke-dasharray:none;stroke-opacity:1" />
          <path
             id="path3141"
             d="M 589.35664,751.76586 C 587.81413,751.75071 586.28547,752.70945 585.82435,754.21735 C 585.11534,756.32942 584.86996,758.64549 585.32019,760.83763 C 585.56893,762.23561 586.92566,763.19526 588.31365,763.12842 C 591.04947,763.28883 593.89615,762.26147 595.72799,760.18852 C 597.01531,758.76025 597.32489,756.53475 596.31722,754.86646 C 595.03759,752.67954 592.34905,751.94384 589.97738,751.76586 C 589.7706,751.75704 589.56343,751.75635 589.35664,751.76586 z"
             style="opacity:1;fill:#ea8400;fill-opacity:1;stroke:none;stroke-width:4;stroke-miterlimit:4;stroke-dasharray:none;stroke-opacity:1" />
          <path
             id="path3143"
             d="M 579.19462,767.87069 C 577.64443,768.18043 576.42274,769.33666 575.28794,770.36767 C 574.22947,771.48488 572.99725,772.81907 573.08165,774.46261 C 573.17075,775.61396 574.48796,776.2444 575.50492,775.83721 C 577.67069,775.16104 579.88457,774.65444 582.0715,774.05613 C 583.06615,773.80016 584.05835,772.8463 583.69742,771.74014 C 583.22365,770.40852 582.02993,769.49643 580.9907,768.60488 C 580.471,768.22228 579.86972,767.82912 579.19462,767.87069 z"
             style="opacity:1;fill:#ea8400;fill-opacity:1;stroke:none;stroke-width:4;stroke-miterlimit:4;stroke-dasharray:none;stroke-opacity:1" />
          <path
             id="path3145"
             d="M 559.01553,769.62266 C 555.8126,769.63864 553.09644,772.89616 553.67771,776.03812 C 554.08607,777.99208 555.73517,779.66547 557.68265,780.08087 C 559.07848,780.10705 560.02863,778.87769 561.01012,778.06422 C 562.4839,776.72627 563.99893,774.95406 563.83343,772.83039 C 563.58723,770.56285 561.0349,769.50943 559.01553,769.62266 z"
             style="opacity:1;fill:#ea8400;fill-opacity:1;stroke:none;stroke-width:4;stroke-miterlimit:4;stroke-dasharray:none;stroke-opacity:1" />
        </g>
        <path
           style="fill:#000000"
           d="M 474.4832,961.93459 C 471.61846,959.06987 473.85452,953.6073 478.29076,952.63294 C 479.95407,952.26762 482.09531,950.84013 483.04908,949.46075 C 484.00285,948.08137 485.78035,946.02589 486.99909,944.89302 C 488.21783,943.76014 488.9988,942.48345 488.73457,942.05592 C 488.47034,941.62839 489.16069,940.99087 490.26868,940.63921 C 491.76727,940.16357 492.2832,939.12973 492.2832,936.6024 C 492.2832,934.22842 492.88569,932.88253 494.2832,932.1346 C 495.3832,931.5459 496.2832,931.31265 496.2832,931.61626 C 496.2832,931.91988 498.4207,931.08524 501.0332,929.76151 C 507.30165,926.58534 520.83558,922.47316 530.7832,920.72221 C 535.32339,919.92306 537.26953,919.30105 535.2832,919.28395 C 531.27061,919.24941 525.57837,920.25073 516.2832,922.62621 C 512.7082,923.53985 509.1082,924.44119 508.2832,924.6292 C 507.4582,924.81722 504.6083,925.94544 501.95009,927.13638 C 499.29188,928.32731 496.90065,929.08538 496.63625,928.82098 C 495.79559,927.98032 507.13538,923.09176 513.66232,921.48108 L 519.94987,919.92947 L 519.9723,915.78204 C 519.99484,911.61624 522.82364,903.34171 523.86817,904.38624 C 524.17547,904.69354 523.71956,907.02836 522.85505,909.57473 C 521.18829,914.48405 520.78542,919.15509 522.0332,919.10372 C 522.4457,919.08674 526.12304,918.63937 530.20506,918.10956 C 537.76795,917.12798 549.04983,918.1786 550.20716,919.97227 C 550.52398,920.46329 551.7832,921.17705 553.00542,921.55839 C 554.22763,921.93973 557.49013,924.79021 560.25542,927.89279 C 563.70949,931.76818 565.2832,932.96538 565.2832,931.71769 C 565.2832,930.71882 567.9832,927.23487 571.2832,923.97559 C 575.16352,920.14315 577.2832,917.23619 577.2832,915.7471 C 577.2832,913.09937 580.13281,910.1346 582.67768,910.1346 C 585.24671,910.1346 588.2832,912.00648 588.2832,913.59019 C 588.2832,914.56823 590.26733,915.17018 595.0332,915.638 C 601.38713,916.26171 605.97566,917.43082 627.6869,923.95788 C 635.8539,926.41312 636.70715,926.91317 637.9991,930.00133 C 638.77377,931.85304 639.17425,933.97612 638.88907,934.71931 C 638.60388,935.46249 638.80823,936.34106 639.34319,936.67167 C 639.87814,937.00229 640.07333,937.66517 639.77694,938.14473 C 638.62406,940.01013 642.72623,947.09339 645.52433,948.06881 C 648.8798,949.23854 649.82361,951.25632 648.32502,954.05646 C 647.41508,955.7567 647.50273,956.1346 648.80703,956.1346 C 649.75122,956.1346 650.11225,956.60218 649.69248,957.28138 C 649.17217,958.12327 644.43735,958.21214 631.88347,957.61565 C 622.47832,957.16877 611.8582,956.71996 608.2832,956.61829 C 598.98266,956.3538 587.64476,955.20222 581.39128,953.88691 C 576.12728,952.77972 575.94821,952.81696 573.84348,955.45654 C 572.13277,957.60197 570.74962,958.20109 567.14513,958.35797 C 563.3669,958.5224 561.91532,958.01129 558.51741,955.3201 C 556.27053,953.54054 554.18782,952.47992 553.88915,952.96317 C 553.59049,953.44642 549.61947,954.14982 545.06466,954.52629 C 540.50986,954.90276 533.8582,955.62947 530.2832,956.1412 C 526.7082,956.65294 518.3832,957.80247 511.7832,958.69572 C 505.1832,959.58897 496.01175,960.95314 491.40221,961.72719 C 481.14048,963.45039 476.06129,963.51269 474.4832,961.93459 z M 491.92273,959.69252 C 501.46999,957.94099 509.33204,956.85856 532.7832,954.06694 C 542.6832,952.88845 551.2107,951.52157 551.7332,951.02942 C 553.38471,949.47384 555.13693,950.03616 559.85114,953.6346 C 565.66859,958.07515 569.3587,958.24168 572.24109,954.19374 C 574.69841,950.74276 577.80253,949.49079 579.79716,951.14619 C 581.88541,952.87928 599.16988,955.07817 611.7832,955.21537 C 617.8332,955.28118 627.2832,955.64708 632.7832,956.02847 C 642.94232,956.73296 645.66796,956.18026 646.81832,953.18249 C 647.99873,950.10639 643.69957,948.67916 625.29727,946.03793 C 620.63001,945.36806 614.78001,944.71933 612.29727,944.59632 C 603.86222,944.1784 590.78608,942.9422 590.05805,942.49385 C 589.65922,942.24824 586.50922,941.8154 583.05805,941.53198 C 577.09592,941.04236 576.53418,941.19404 571.7864,944.57564 C 565.62764,948.9622 562.51615,949.06479 556.06288,945.09405 L 551.12137,942.05351 L 540.95228,943.12676 C 507.32453,946.67583 489.82879,950.25126 478.89112,955.80957 C 474.77704,957.90026 474.80739,957.85636 476.26314,959.61043 C 477.8434,961.51452 481.87615,961.53566 491.92273,959.69252 z M 507.7662,946.15377 C 516.00685,944.46152 527.93185,942.65236 534.2662,942.13342 C 540.60055,941.61449 547.26752,940.89184 549.08169,940.52755 C 551.76482,939.98877 553.164,940.41902 556.58169,942.83382 C 558.89252,944.46656 561.48177,946.05393 562.33557,946.3613 C 564.04257,946.97582 570.9282,944.44627 570.02016,943.53823 C 569.70904,943.22711 568.54554,943.45902 567.43459,944.05358 C 566.32364,944.64814 564.46927,945.1346 563.31376,945.1346 C 560.63036,945.1346 556.11737,942.21194 556.88439,940.97088 C 557.22227,940.42417 558.46815,940.68099 559.84062,941.58026 C 563.01014,943.65702 563.2832,943.57141 563.2832,940.50098 C 563.2832,937.87975 557.07189,930.85732 551.2832,926.93392 C 549.61655,925.80432 549.29238,925.22202 550.31069,925.18705 C 552.08203,925.12623 556.00961,927.65684 558.53954,930.48905 C 559.50553,931.57046 560.53955,932.21158 560.83736,931.91377 C 561.6493,931.10183 553.25267,924.10264 549.56532,922.51773 C 547.79548,921.75701 544.35612,921.1346 541.92228,921.1346 C 532.36482,921.1346 508.42485,927.37389 501.02356,931.79373 C 498.69136,933.18644 497.6832,934.026 498.7832,933.65941 C 503.44767,932.1049 517.58378,928.1346 518.45408,928.1346 C 518.97502,928.1346 519.14563,928.54818 518.83322,929.05367 C 518.52081,929.55915 515.90675,930.47731 513.0242,931.09403 C 507.43331,932.29018 496.2832,936.11452 496.2832,936.83598 C 496.2832,937.07435 497.2957,936.94766 498.5332,936.55445 C 504.09652,934.78672 511.2832,933.47121 511.2832,934.22057 C 511.2832,934.67344 509.5957,935.33232 507.5332,935.68475 C 501.72644,936.67696 493.98609,939.52595 493.55102,940.83115 C 493.11129,942.15032 495.42795,941.646 508.58482,937.55841 C 517.37701,934.82685 517.2832,934.84446 517.2832,935.92599 C 517.2832,936.36125 512.94441,937.82136 507.64144,939.17067 C 497.39217,941.77855 486.24643,946.74491 485.47951,949.04567 C 484.92061,950.72239 486.54535,950.51156 507.7662,946.15377 z M 557.97744,937.603 C 556.43427,936.24538 554.52177,935.1346 553.72744,935.1346 C 552.93311,935.1346 552.2832,934.6846 552.2832,934.1346 C 552.2832,933.5846 552.76278,933.1346 553.34894,933.1346 C 555.64532,933.1346 562.2832,937.75753 562.2832,939.35684 C 562.2832,940.72007 560.86297,940.14157 557.97744,937.603 z M 637.2832,944.71384 C 635.3582,944.00993 630.0707,942.83555 625.5332,942.10412 C 620.9957,941.37269 617.2832,940.47345 617.2832,940.10581 C 617.2832,939.45633 622.5525,940.11088 632.78241,942.03111 C 635.53198,942.54723 637.9363,942.81483 638.12534,942.62579 C 638.91061,941.84052 632.27352,939.21101 626.49212,938.01688 C 623.07721,937.31154 620.2832,936.34416 620.2832,935.86714 C 620.2832,935.39011 621.2957,935.29086 622.5332,935.64656 C 626.82497,936.88018 627.80719,937.11047 632.5332,937.99119 C 637.71756,938.95733 638.92007,937.97966 634.5332,936.36515 C 629.41731,934.48233 616.38765,931.11066 611.79466,930.48112 C 609.28333,930.1369 606.98933,929.46812 606.69688,928.99493 C 605.92518,927.74629 606.7398,927.87142 617.7832,930.69787 C 630.68342,933.99955 636.24741,935.00153 636.79164,934.12095 C 637.5184,932.94502 636.10057,932.1346 633.31653,932.1346 C 631.8682,932.1346 630.2557,931.75094 629.7332,931.28203 C 629.2107,930.81311 626.63411,929.85138 624.00744,929.14485 C 621.38077,928.43832 618.99171,927.47198 618.69842,926.99743 C 617.92926,925.7529 619.02448,925.92257 626.12229,928.1475 C 632.95677,930.28989 635.71545,930.64301 634.86476,929.26657 C 634.37315,928.47112 619.69519,923.64387 606.2832,919.86674 C 588.359,914.81886 576.95761,918.23007 568.30692,931.22896 C 565.4375,935.54066 564.68906,937.5398 565.04255,939.94827 C 565.49546,943.03416 565.53671,943.05486 568.34254,941.60392 C 571.64286,939.89725 572.63874,939.75031 571.8093,941.09238 C 571.48373,941.61915 572.41574,941.42842 573.88044,940.66853 C 576.68788,939.21201 584.41402,939.37734 593.7832,941.09442 C 596.5332,941.5984 602.6082,942.28105 607.2832,942.61141 C 611.9582,942.94177 618.2582,943.6453 621.2832,944.17481 C 626.84451,945.1483 632.30251,945.71765 637.7832,945.89603 L 640.7832,945.99368 L 637.2832,944.71384 z M 566.28694,938.3846 C 566.29132,936.33316 569.09561,931.6225 572.30777,928.2708 C 574.56169,925.91896 581.67751,922.19845 584.00182,922.15656 C 586.38079,922.11369 584.21771,924.63703 581.75297,924.77996 C 577.87703,925.00473 572.68626,929.59967 570.11448,935.0825 C 567.71036,940.2079 566.28041,941.44155 566.28694,938.3846 z M 569.2832,938.23819 C 569.2832,937.74517 570.87386,935.94517 572.818,934.23819 C 576.35731,931.13064 579.2832,930.20534 579.2832,932.19362 C 579.2832,932.77608 578.8218,932.96747 578.25787,932.61895 C 577.69394,932.27042 575.62394,933.59386 573.65787,935.55993 C 569.89671,939.32109 569.2832,939.69669 569.2832,938.23819 z M 584.5332,916.43957 C 587.76386,915.7876 587.94701,915.04531 585.43753,912.77427 C 583.70679,911.20797 583.42658,911.23397 580.93753,913.19186 C 577.89002,915.58903 577.25244,918.74734 580.0332,917.67156 C 580.9957,917.2992 583.0207,916.7448 584.5332,916.43957 z M 488.21683,926.06955 C 482.12113,919.10574 480.44995,915.4707 479.18382,906.42157 C 477.92903,897.4535 478.59454,889.27083 481.29879,880.41751 C 484.01164,871.53604 485.90464,868.21999 491.10662,863.23673 C 498.08621,856.55061 502.64316,854.90258 511.84552,855.73648 C 516.01531,856.11433 520.8909,857.16985 522.68017,858.08207 L 525.93338,859.74066 L 524.44395,856.75502 C 521.35466,850.56238 522.14216,837.73804 525.80229,834.6346 C 526.45095,834.0846 526.95293,833.1846 526.9178,832.6346 C 526.88267,832.0846 528.86302,830.51408 531.31857,829.14456 C 534.89951,827.14738 537.19083,826.65255 542.8949,826.64456 C 550.6519,826.6337 550.60335,826.00248 542.56411,822.34379 C 540.48461,821.3974 538.65665,819.86288 538.50197,818.93376 C 538.29388,817.68376 540.76443,818.67893 548.00197,822.76048 C 558.61665,828.74655 561.80928,831.1346 559.19749,831.1346 C 558.36463,831.1346 557.06237,830.5721 556.30358,829.8846 C 555.54479,829.1971 556.578,830.62601 558.59961,833.05996 C 562.23906,837.44174 562.33932,837.48605 568.78282,837.55996 C 575.19107,837.63346 575.30595,837.58752 576.30991,834.54955 C 579.03882,826.29191 592.97521,819.759 600.52436,823.19862 C 601.80876,823.78383 604.38465,826.49744 606.24855,829.22885 C 609.36429,833.79473 609.64273,834.82446 609.70271,842.00268 C 609.76125,849.0084 609.48908,850.1759 607.05276,853.37007 C 603.83753,857.58546 598.24531,860.53088 593.44242,860.50017 C 589.42961,860.47451 581.50756,858.2331 579.1028,855.524 C 578.17859,854.48282 576.93483,852.34852 576.3389,850.78111 C 575.62889,848.91363 574.75418,848.12363 573.80133,848.48927 C 573.00158,848.79616 572.08128,848.61691 571.75621,848.09093 C 571.43113,847.56495 569.83875,847.1346 568.21757,847.1346 C 564.68329,847.1346 561.41937,850.5069 559.73951,855.8942 C 559.09803,857.95142 557.99499,861.51958 557.28831,863.82343 C 553.99355,874.56486 560.78768,887.7307 568.61207,885.76691 C 570.74909,885.23055 571.54542,884.18288 572.48431,880.6725 C 573.13438,878.24195 574.0103,876.46594 574.4308,876.72582 C 575.54142,877.41223 578.14802,873.06052 578.91084,869.24638 C 579.27205,867.44036 580.198,865.72079 580.96852,865.42511 C 583.15488,864.58613 583.69137,865.86929 581.90225,867.65841 C 581.01177,868.54889 580.2832,870.0778 580.2832,871.05599 C 580.2832,872.03418 578.9332,874.69814 577.2832,876.9759 C 574.07203,881.4088 573.77597,882.1346 575.17895,882.1346 C 575.67162,882.1346 577.47676,879.94969 579.19038,877.27925 C 583.21203,871.01205 593.73162,864.72765 593.25527,866.83254 C 593.07938,867.60974 586.88851,871.77598 586.00624,872.26972 C 585.14948,872.74919 582.7815,875.41238 580.74406,878.18791 C 578.44394,881.3213 576.42241,883.11214 575.41142,882.91199 C 574.5159,882.7347 573.32364,883.49228 572.76195,884.59551 C 571.01197,888.03269 566.69935,888.87322 562.46009,886.60335 C 557.28636,883.83313 554.7405,878.34286 554.93941,870.3846 C 555.09196,864.28103 554.66588,863.24084 552.7332,864.99864 C 550.68237,866.8639 542.57666,868.06047 537.46535,867.25248 C 534.61517,866.80192 532.28807,866.47858 532.29402,866.53394 C 532.29998,866.58931 532.97498,868.84362 533.79402,871.54353 C 534.61307,874.24344 535.2832,878.17184 535.2832,880.2733 C 535.2832,883.82807 535.64353,884.29994 540.45768,887.04941 C 543.30364,888.67481 548.81614,890.80027 552.70768,891.77265 C 556.7288,892.77742 558.93879,893.71762 557.82712,893.95062 C 554.35429,894.67854 545.65827,892.13022 540.01134,888.72982 L 534.51008,885.41713 L 533.19784,889.39323 C 531.42108,894.77687 525.77931,898.61115 521.09382,897.61941 C 519.27298,897.234 516.84989,896.06321 515.70918,895.01764 C 513.6494,893.12967 513.61203,893.14881 510.26873,897.80427 C 508.4172,900.38249 506.72619,901.96358 506.51094,901.31782 C 506.29568,900.67205 507.74412,898.24577 509.72969,895.92608 C 511.71526,893.60639 514.75875,888.76684 516.49301,885.17153 C 518.68171,880.6341 519.77289,879.20542 520.0604,880.50078 C 520.28821,881.52717 519.29423,884.53568 517.85155,887.18635 L 515.22851,892.00574 L 517.44442,894.07017 C 520.28318,896.71488 522.70895,896.67969 526.55939,893.93793 C 528.25611,892.72977 529.31152,892.27977 528.90475,892.93793 C 528.49798,893.5961 528.40758,894.1346 528.70386,894.1346 C 529.00014,894.1346 530.09777,892.4471 531.14304,890.3846 C 535.98627,880.82804 534.29287,870.16354 526.84154,863.29514 C 521.89838,858.73869 517.20755,857.11468 509.2832,857.21625 C 502.80091,857.29935 498.68116,858.6938 494.68986,862.15581 C 488.16969,867.81134 485.33138,872.18731 482.69151,880.65429 C 480.29743,888.33294 480.07952,890.29586 480.49861,900.40739 C 481.03125,913.25816 482.45491,917.58787 488.136,923.6346 C 493.14943,928.9707 494.72281,931.1346 493.58928,931.1346 C 493.07293,931.1346 490.65533,928.85533 488.21683,926.06955 z M 549.12143,864.07098 C 554.87878,862.80028 557.29712,860.21504 559.25003,853.24333 C 560.66249,848.20102 563.99272,845.1346 568.05638,845.1346 C 573.11581,845.1346 578.2832,847.88313 578.2832,850.57423 C 578.2832,854.64651 586.01505,858.52213 592.47484,858.52213 C 600.07407,858.52213 605.30896,854.63046 607.26265,847.27198 C 609.21824,839.90636 607.0944,832.08247 601.79624,827.1346 C 595.393,821.15471 579.7902,826.99681 577.78533,836.12491 C 577.19333,838.82027 576.83618,838.9897 570.97189,839.35714 C 567.56811,839.57041 564.06001,840.08106 563.17612,840.4919 C 561.98856,841.04389 561.25321,840.47642 560.35918,838.31803 C 559.69376,836.71156 557.6273,833.92198 555.76706,832.11896 C 552.69736,829.14369 551.6938,828.7964 544.90722,828.36087 C 538.49102,827.9491 536.9376,828.18507 533.96326,830.02331 C 528.5951,833.34102 525.03266,838.68664 524.50075,844.22227 C 523.77779,851.74629 524.91454,855.38961 529.54931,860.40304 C 534.95484,866.25021 537.27642,866.68529 549.12143,864.07098 z M 534.51515,859.18767 C 531.03647,856.66772 530.28111,855.44151 529.30192,850.72475 C 528.28858,845.84355 528.38641,844.68971 530.15197,840.69836 C 532.60891,835.14404 537.14156,832.1435 543.08286,832.13834 C 547.85743,832.13419 552.73965,834.23464 554.13895,836.89495 C 555.78446,840.02334 556.31297,850.43356 555.01243,854.09997 C 552.19381,862.04606 541.9657,864.58481 534.51515,859.18767 z M 539.89691,856.98942 C 539.97074,854.9502 540.84747,853.20533 542.39691,852.01394 C 543.87576,850.87682 544.24608,850.17062 543.37075,850.15684 C 541.57681,850.12859 532.2832,844.2055 532.2832,843.09041 C 532.2832,842.1495 548.97799,850.679 551.24749,852.77941 C 552.52537,853.96209 552.49355,854.1346 550.99749,854.1346 C 549.94987,854.1346 549.2832,854.91238 549.2832,856.1346 C 549.2832,860.66533 552.55347,857.63333 554.16325,851.61011 C 555.64074,846.08187 553.72016,838.52481 550.16724,835.88667 C 544.40817,831.6104 535.52686,833.9341 532.32132,840.55585 C 528.96248,847.49429 530.28925,854.66078 535.5573,858.03481 C 539.72169,860.70198 539.76285,860.69207 539.89691,856.98942 z M 546.6465,857.85822 C 547.74035,857.05837 548.14511,855.93833 547.73064,854.85822 C 546.49188,851.63008 541.2832,853.15159 541.2832,856.74159 C 541.2832,859.44854 543.76498,859.96524 546.6465,857.85822 z M 587.80827,852.53252 C 586.87055,851.10138 586.32667,849.07638 586.59964,848.03252 C 587.18978,845.77583 586.6448,845.63014 584.73965,847.53529 C 583.53873,848.73622 583.54891,849.11023 584.81108,850.15774 C 585.62075,850.8297 586.2832,851.85858 586.2832,852.44414 C 586.2832,853.02969 584.89258,852.18709 583.19293,850.57169 C 580.3305,847.85115 580.13147,847.22427 580.49339,842.0692 C 581.1256,833.06413 586.93135,827.1346 595.11622,827.1346 C 603.02422,827.1346 607.86579,839.01782 603.86198,848.6003 C 601.16045,855.06596 591.08524,857.5338 587.80827,852.53252 z M 599.26052,851.35404 C 601.59726,849.46187 603.74284,841.15817 602.72427,837.94892 C 602.20468,836.31184 601.91234,836.28147 599.46831,837.61069 C 597.9915,838.41388 595.70768,839.92231 594.39315,840.96276 L 592.00309,842.85449 L 594.24731,845.09871 C 595.93407,846.78547 596.34767,848.06226 595.91237,850.23877 C 595.24565,853.57235 596.1493,853.87336 599.26052,851.35404 z M 594.09388,849.44205 C 594.4878,846.68799 590.52572,844.144 589.17134,846.28135 C 587.91525,848.2636 588.09803,850.89151 589.5332,851.48383 C 591.89338,852.45791 593.78355,851.6117 594.09388,849.44205 z M 599.2832,835.11357 L 601.7832,833.10728 L 599.42242,831.12094 C 592.67679,825.44524 582.2832,832.97595 582.2832,843.53923 L 582.2832,847.00809 L 589.5332,842.06398 C 593.5207,839.34471 597.9082,836.21703 599.2832,835.11357 z M 558.52828,921.97968 C 556.34819,919.79959 557.06094,915.45459 559.97459,913.16271 C 563.15236,910.66308 566.03422,910.84747 567.89786,913.66967 C 569.98405,916.82888 566.83114,922.53169 562.77828,922.92968 C 561.12557,923.09197 559.21307,922.66447 558.52828,921.97968 z M 564.96875,919.96029 C 568.04764,917.06782 567.95177,914.34051 564.74291,913.53513 C 559.82488,912.30079 556.52691,918.64122 560.66798,921.36929 C 562.25885,922.41732 562.40396,922.36978 564.96875,919.96029 z M 632.82646,913.08285 C 631.28487,908.65439 629.048,903.59189 627.85565,901.83285 C 626.66329,900.07381 624.59848,896.6096 623.26718,894.1346 C 621.93587,891.6596 620.19761,888.84434 619.40438,887.87847 C 617.63058,885.71864 618.80041,884.19445 620.69713,886.19412 C 621.4486,886.98639 623.136,889.6596 624.4469,892.1346 C 625.75781,894.6096 627.62095,897.81402 628.58723,899.25554 C 630.61425,902.27951 637.23768,918.02511 637.2649,919.8846 C 637.31524,923.32365 635.33499,920.28898 632.82646,913.08285 z M 546.22685,909.0293 C 543.76536,904.42998 548.48817,895.1346 553.28648,895.1346 C 555.85508,895.1346 558.72465,901.2396 557.83053,904.80206 C 556.3665,910.63521 548.60044,913.4644 546.22685,909.0293 z M 554.53796,907.3846 C 556.53442,905.15175 556.88025,903.32526 555.96382,899.85397 C 554.48836,894.26519 547.38159,898.26192 547.315,904.71793 C 547.29751,906.41377 547.5832,908.10127 547.94987,908.46793 C 549.22413,909.74219 552.98255,909.12417 554.53796,907.3846 z M 569.73775,908.68005 C 565.49241,904.43472 567.20751,897.1346 572.45026,897.1346 C 575.65627,897.1346 580.2832,900.96187 580.2832,903.6138 C 580.2832,905.86242 575.29046,911.1346 573.16102,911.1346 C 572.62822,911.1346 571.08775,910.03005 569.73775,908.68005 z M 575.32602,908.11168 C 578.23675,906.55391 579.67584,903.31263 578.23015,901.57068 C 577.57464,900.78083 576.23091,900.1346 575.24409,900.1346 C 574.25727,900.1346 573.27331,899.60493 573.05752,898.95755 C 572.49044,897.25631 570.32546,898.89324 569.18892,901.88259 C 568.39628,903.96737 568.62324,904.86765 570.42491,906.78545 C 572.96933,909.49385 572.81928,909.45325 575.32602,908.11168 z M 589.8399,904.91209 C 587.98966,902.2705 587.86528,899.79711 589.4329,896.81886 C 591.77752,892.36445 596.09343,891.85392 599.82865,895.58915 C 603.02588,898.78637 602.92479,900.64686 599.36012,904.21152 C 595.83481,907.73684 592.0153,908.01791 589.8399,904.91209 z M 598.11779,903.53791 C 601.62014,901.08476 600.72605,896.99286 596.44702,895.89147 C 594.19516,895.31185 592.65133,895.41412 591.69702,896.20612 C 590.26106,897.39787 589.73183,903.2499 590.94987,904.46793 C 592.13271,905.65078 595.77616,905.17804 598.11779,903.53791 z M 630.85797,901.25558 C 630.55396,900.76368 630.98733,899.79512 631.82101,899.10322 C 635.94942,895.67694 648.98208,872.02234 653.29102,860.1346 C 656.5144,851.24179 657.18847,837.40535 654.75967,829.98812 C 649.23457,813.11519 635.76501,795.29532 622.78778,787.69015 C 616.28348,783.87838 611.32055,784.84922 599.46644,792.25224 C 596.41594,794.15731 594.60321,798.43569 595.0878,802.58662 C 595.45557,805.73678 595.82612,806.1346 598.39261,806.1346 C 599.98243,806.1346 602.81438,806.27836 602.81438,806.82836 C 602.81438,808.04911 597.29632,808.42909 595.4243,807.24297 C 593.0524,805.74012 592.91009,798.05419 595.18703,794.42845 C 597.33803,791.00325 605.91825,785.47032 610.65763,784.45227 C 613.49262,783.8433 613.52425,783.7591 612.96252,778.31642 C 612.64677,775.25712 612.85023,771.94361 613.4191,770.88066 C 614.96725,767.98792 614.0507,767.92855 610.02941,770.66109 C 605.69787,773.60444 605.29507,773.66534 605.24406,771.3846 C 605.22033,770.3239 604.68204,770.83501 603.87744,772.6822 C 603.14732,774.35838 601.36339,776.50726 599.91315,777.4575 C 594.59204,780.94402 589.95763,790.83246 592.31403,793.67175 C 594.06369,795.77996 592.6746,796.78068 590.53933,794.95026 C 587.0858,791.98978 580.31021,790.1346 572.9513,790.1346 C 561.01977,790.1346 543.79014,795.59056 539.00797,800.88313 C 537.46077,802.59548 537.42102,803.00409 538.69853,804.06433 C 539.50471,804.7334 539.91912,805.91981 539.61943,806.70078 C 539.23102,807.71296 538.45836,807.2087 536.92887,804.94483 C 534.29727,801.04968 525.41554,795.65894 519.07188,794.10658 C 515.72015,793.28638 514.16426,792.33521 513.68035,790.81056 C 513.00893,788.69508 512.98862,788.69863 512.10557,791.08574 C 511.61355,792.4158 511.4518,794.13157 511.74612,794.89856 C 512.16258,795.98384 511.6076,796.14512 509.24342,795.62586 L 506.20559,794.95864 L 508.24066,798.29662 C 509.35994,800.13251 510.27741,803.25495 510.27946,805.23538 C 510.28431,809.90813 511.96974,814.83988 514.9213,818.81788 C 517.60868,822.43982 518.19216,825.13386 515.87223,823.20849 C 514.09308,821.73193 513.51044,822.60288 511.6811,829.47351 C 509.87532,836.25568 509.91623,845.80633 511.77442,851.25887 C 513.04987,855.00147 513.0559,855.36199 511.81613,853.75051 C 508.92203,849.98872 507.8886,841.87973 509.23758,833.51744 C 510.51392,825.60549 512.00715,821.1346 513.37332,821.1346 C 513.79632,821.1346 513.03253,819.14881 511.67601,816.72173 C 510.31949,814.29466 508.93754,809.90716 508.60501,806.97173 C 508.27248,804.03631 507.16403,799.96503 506.1418,797.92444 C 503.70295,793.05597 503.75913,792.83069 507.2832,793.34791 C 509.77016,793.71292 510.30293,793.43306 510.39855,791.71141 C 510.46199,790.56916 510.61845,789.1846 510.74624,788.6346 C 510.87402,788.0846 511.04711,786.8471 511.13089,785.8846 C 511.36298,783.21798 512.61887,783.82421 514.2832,787.40624 C 515.45828,789.9353 516.86627,790.98191 520.7832,792.23796 C 523.5332,793.1198 528.16619,795.30851 531.07873,797.10175 C 535.80771,800.01336 536.55661,800.20542 538.07873,798.89695 C 544.27676,793.56893 557.8104,789.11171 569.93442,788.40548 C 578.97437,787.8789 579.09239,787.83865 579.64104,785.09538 C 580.27624,781.91941 585.40702,779.63224 590.28906,780.34877 C 592.59512,780.68723 594.11895,779.8716 598.21366,776.10713 C 601.80849,772.80223 603.2832,770.69103 603.2832,768.84955 C 603.2832,765.05769 605.0788,764.56647 605.99632,768.10731 L 606.7851,771.1513 L 612.11787,767.56 C 615.05089,765.58479 617.71614,764.23421 618.04065,764.55871 C 618.36515,764.88322 617.70732,767.05805 616.5788,769.39166 C 613.94263,774.84286 614.61702,782.44254 617.7832,782.96399 C 624.98559,784.15017 640.00295,797.94654 647.78513,810.5266 C 658.49179,827.83415 660.85015,842.72999 655.38216,858.51091 C 649.0927,876.66263 632.99705,904.71669 630.85797,901.25558 z M 590.32732,787.3846 C 591.12257,785.3221 591.92547,783.2971 592.11155,782.8846 C 592.78947,781.38176 584.89541,782.17557 583.11194,783.78959 C 579.59335,786.97387 581.61908,789.78442 588.33231,791.03251 C 588.63432,791.08866 589.53208,789.4471 590.32732,787.3846 z M 584.2832,890.50167 C 584.2832,889.78357 587.25633,888.33385 591.03997,887.20704 C 604.86262,883.09047 616.15579,873.42759 619.42452,862.92008 C 622.66636,852.49904 624.60138,830.06731 622.37708,828.69262 C 621.87871,828.38461 621.69452,827.27771 621.96776,826.23282 C 622.24101,825.18794 621.57606,822.32442 620.49011,819.86945 L 618.51565,815.40585 L 613.46385,815.89126 C 608.88312,816.33141 608.16274,816.10896 605.73839,813.50564 C 603.3071,810.89487 603.11191,810.1073 603.58518,804.81796 C 604.15454,798.45465 607.40562,792.41094 611.81252,789.52343 C 616.05687,786.74243 615.48769,788.48292 610.41279,793.80364 C 606.44643,797.96213 605.47467,799.72103 604.92404,803.73829 C 603.87985,811.35653 607.94824,815.43942 614.85605,813.70567 C 617.66995,812.99943 619.42375,810.10545 620.35326,804.6346 L 621.03287,800.6346 L 621.15803,804.95034 C 621.22688,807.324 620.81587,810.1393 620.24469,811.20656 C 619.43265,812.72386 619.74704,814.0725 621.68631,817.39082 C 623.80269,821.01218 624.32108,823.68792 625.22076,835.6346 C 626.50244,852.65385 626.50002,852.38664 625.36587,851.6857 C 624.86135,851.37388 623.99712,853.23537 623.44537,855.82234 C 622.59781,859.79631 622.7401,861.10988 624.3627,864.29043 C 627.02728,869.51345 626.84053,870.4434 623.23337,869.91398 C 620.6312,869.53206 620.2071,869.77227 620.34406,871.55048 C 620.71973,876.42799 620.3883,876.9431 617.0332,876.6963 C 614.65863,876.52162 612.70574,877.31145 609.7832,879.62849 C 603.52661,884.58882 599.12063,886.94694 591.41636,889.45859 C 586.15603,891.17349 584.2832,891.44736 584.2832,890.50167 z M 618.7982,872.18104 C 618.95998,869.98504 618.88821,869.95429 617.62687,871.67928 C 615.97135,873.94334 615.89197,875.43168 617.45453,874.91082 C 618.09876,874.69608 618.70341,873.46768 618.7982,872.18104 z M 623.2832,866.69362 C 623.2832,865.10099 621.46884,863.61563 620.59313,864.49134 C 619.77049,865.31398 621.05465,868.1346 622.25182,868.1346 C 622.81908,868.1346 623.2832,867.48616 623.2832,866.69362 z M 567.94987,864.46793 C 566.72366,863.24172 567.26125,855.39771 568.65052,854.24471 C 571.52264,851.86107 573.73237,857.9991 571.58094,862.3846 C 570.23251,865.13324 569.20481,865.72288 567.94987,864.46793 z M 570.81833,861.07776 C 571.17756,860.49651 571.1732,858.83247 570.80864,857.37992 C 570.28737,855.30304 569.95013,855.04817 569.2298,856.18675 C 568.02748,858.08721 568.02366,862.1346 569.22418,862.1346 C 569.74172,862.1346 570.45909,861.65902 570.81833,861.07776 z M 561.2832,861.24538 C 561.2832,859.65632 562.16823,857.29382 563.24993,855.99538 L 565.21666,853.6346 L 565.24993,857.31317 C 565.26848,859.36392 564.58782,861.68712 563.71177,862.56317 C 561.55627,864.71867 561.2832,864.57049 561.2832,861.24538 z M 575.3908,830.3846 C 579.06793,825.62671 588.6569,814.66503 588.94975,814.8846 C 589.13315,815.0221 589.29451,815.4721 589.30834,815.8846 C 589.34895,817.09583 576.14893,832.1346 575.04519,832.1346 C 574.4914,832.1346 574.64693,831.3471 575.3908,830.3846 z M 562.74208,826.06807 C 562.37955,825.48148 562.4146,824.69398 562.81997,824.31807 C 563.22534,823.94216 563.76707,824.22461 564.02382,824.94573 C 564.38418,825.95789 564.92302,825.86555 566.38691,824.54074 C 568.43403,822.68813 569.06552,823.95228 567.0832,825.9346 C 565.59688,827.42092 563.61583,827.48182 562.74208,826.06807 z"
           id="path3147"
           sodipodi:nodetypes="cssssssssssssssscccsssssssssssssssssssssssssssssssssccssssssssssssscccssccssssssssssssssssssssssssssssssccssssccssssssssssssssssssssssssssssccccssssccssssccsssccsssscccssssssssssssssssssssssssssssssssssssssssssssssssscccssssssscccsssssssssssccsssssssssssssssccsssssccssssssssssccssccssssssssccsscccsccsscccccccccsssccssccsssssssccssccsssccsssccsssssccsssccsssccsssssssssssssssssssssssssssscccsssssssssssssssssssssssscccsssssccsssccsssscccsssssscccsssssssssssccssccssccssccssscccccsccsssccssssc" />
        <path
           style="fill:#ffffff;fill-opacity:1;stroke:none;stroke-opacity:1"
           d="M 537.93298,859.40402 C 533.62708,857.18837 531.43521,854.44853 530.74073,850.41372 C 530.4114,848.5004 530.48617,846.60325 530.97336,844.5108 L 531.19121,843.57512 L 532.85843,844.44411 C 533.77539,844.92205 535.14853,845.73163 535.90984,846.24317 C 538.7532,848.15369 541.79552,849.81817 542.93735,850.08799 C 543.23017,850.15718 543.52964,850.2297 543.60284,850.24915 C 543.91911,850.33319 543.71237,850.75673 543.07111,851.33848 C 540.5409,853.63386 540.00397,854.62928 539.84537,857.31872 C 539.7246,859.36656 539.56362,859.87418 539.03493,859.87418 C 538.93139,859.87418 538.43551,859.66261 537.93298,859.40402 L 537.93298,859.40402 z"
           id="path3149" />
        <path
           style="fill:#ffffff;fill-opacity:1;stroke:none;stroke-opacity:1"
           d="M 549.82894,858.09068 C 549.5166,857.81714 549.37924,857.2859 549.37924,856.35146 C 549.37924,854.99954 549.7371,854.43289 550.71971,854.2289 C 551.2732,854.11399 551.29728,854.11968 552.08227,854.5505 C 552.99332,855.05052 552.98028,854.94847 552.28803,856.16131 C 551.56389,857.43002 550.72594,858.27701 550.19491,858.27701 C 550.11064,858.27701 549.94596,858.19316 549.82894,858.09068 L 549.82894,858.09068 z"
           id="path3151" />
        <path
           style="fill:#ffffff;fill-opacity:1;stroke:none;stroke-opacity:1"
           d="M 586.06533,851.69738 C 585.9333,851.37791 585.52356,850.8489 584.93495,850.23796 C 584.42715,849.7109 583.97911,849.17425 583.93932,849.04541 C 583.834,848.70442 584.09673,848.27414 584.90183,847.46903 C 585.74622,846.62464 586.36291,846.19522 586.60031,846.28632 C 586.74157,846.34053 586.7617,846.46228 586.71236,846.96421 C 586.49475,849.17783 586.50061,849.3939 586.8047,850.36974 C 586.96461,850.88289 587.18941,851.48706 587.30424,851.71235 C 587.56109,852.21623 587.50007,852.29946 587.08858,852.00646 C 586.69488,851.72612 586.44918,851.72071 586.34949,851.99019 C 586.28535,852.16357 586.23771,852.11449 586.06533,851.69738 L 586.06533,851.69738 z"
           id="path3153" />
        <path
           style="fill:#ffffff;fill-opacity:1;stroke:none;stroke-opacity:1"
           d="M 595.97964,852.75842 C 595.74824,852.50272 595.746,851.41704 595.97424,850.13149 C 596.21326,848.78515 596.12638,847.9176 595.65265,846.92005 C 595.33334,846.24767 595.04528,845.89518 593.67368,844.49839 L 592.06843,842.86365 L 593.27044,841.90612 C 596.69691,839.17657 600.63013,836.76856 601.66207,836.76856 C 602.16323,836.76856 602.36352,836.99157 602.63419,837.85097 C 603.39433,840.26458 602.51799,845.47363 600.7387,849.11793 C 600.25116,850.1165 600.01269,850.46886 599.43669,851.04182 C 598.36672,852.10615 597.01773,852.95314 596.39255,852.95314 C 596.26236,852.95314 596.07656,852.86552 595.97964,852.75842 z"
           id="path3155" />
        <g
           id="g3157"
           style="fill:#439b9e;fill-opacity:1"
           transform="translate(-7.402812,197.47319)">
          <path
             id="path3159"
             d="M 597.37084,654.10669 C 596.29769,653.73602 595.80414,652.94216 595.8084,651.59352 C 595.8125,650.29954 596.40273,648.87353 597.16995,648.30404 C 597.58348,647.99708 598.49971,648.01625 599.19546,648.34643 C 600.31699,648.87865 601.26229,650.07546 601.44724,651.19732 C 601.58394,652.02648 601.18215,653.14103 600.52896,653.74461 C 599.89542,654.33003 598.4855,654.49168 597.37084,654.10668 L 597.37084,654.10669 z"
             style="opacity:1;fill:#439b9e;fill-opacity:1;stroke:none;stroke-opacity:1" />
          <path
             id="path3161"
             d="M 550.0403,661.50773 C 549.31147,661.2364 548.97503,660.78829 548.79756,659.85247 C 548.50535,658.31167 549.42737,656.68774 550.9858,655.99837 C 551.60729,655.72346 552.72453,655.62289 553.33174,655.78721 C 554.81409,656.18835 555.6286,657.90342 554.9765,659.25048 C 554.28802,660.67269 551.37518,662.00469 550.0403,661.50773 L 550.0403,661.50773 z"
             style="opacity:1;fill:#439b9e;fill-opacity:1;stroke:none;stroke-opacity:1" />
        </g>
        <path
           style="fill:#cb7f00;fill-opacity:1;stroke:none;stroke-opacity:1"
           d="M 568.87024,861.90286 C 568.20951,861.24214 568.26871,858.40265 568.97656,856.80242 C 569.43657,855.7625 569.98752,855.33978 570.24816,855.82679 C 570.41973,856.14736 570.75269,857.29372 570.88047,858.00376 C 571.0267,858.81632 571.02696,860.4124 570.88092,860.79892 C 570.71991,861.22507 570.26541,861.67882 569.76968,861.90834 C 569.23007,862.15817 569.1249,862.15753 568.87024,861.90287 L 568.87024,861.90286 z"
           id="path3163" />
        <g
           id="g3165"
           style="fill:#f4eed7"
           transform="translate(-7.402812,197.47319)">
          <path
             id="path3167"
             d="M 493.19962,752.26513 C 492.25169,751.63851 494.29975,749.94454 498.54728,747.84204 C 503.37351,745.45309 506.89696,744.21102 518.71312,740.73331 C 524.09555,739.14916 525.26706,738.59144 524.60429,737.92867 C 524.16331,737.48768 523.40281,737.6746 514.29566,740.46234 C 507.33215,742.5939 502.49243,743.91652 501.65615,743.91652 C 500.85949,743.91652 501.08307,743.17836 502.05847,742.58817 C 503.85767,741.49952 508.15019,740.00204 512.55501,738.92635 C 517.47139,737.72573 518.99507,737.17074 518.69736,736.68904 C 518.36829,736.15658 514.74396,736.67077 509.54173,737.98795 C 506.8514,738.66913 504.52103,739.1834 504.36314,739.13077 C 503.61481,738.88133 512.42816,735.89448 519.66983,733.94333 C 524.86082,732.54471 526.4637,731.89272 526.4637,731.17988 C 526.4637,730.22247 524.22005,730.70168 512.71931,734.1154 C 509.41871,735.0951 506.61868,735.89585 506.49702,735.89485 C 506.12747,735.89181 507.82521,734.81754 509.79597,733.80739 C 519.19174,728.9914 543.85671,723.05656 551.04533,723.88203 C 553.75666,724.19337 556.33112,724.87629 557.85454,725.68826 C 561.26806,727.50764 568.72483,733.83004 567.84778,734.16126 C 567.63689,734.24089 566.73084,733.58372 565.77368,732.65691 C 562.70306,729.68367 559.42758,727.60028 557.82365,727.60028 C 556.45793,727.60028 556.89931,728.25712 559.69655,730.38741 C 564.26636,733.86763 568.75426,738.69195 570.02355,741.48853 C 570.80619,743.21289 570.72307,745.29926 569.87174,745.29926 C 569.67077,745.29926 568.75439,744.85133 567.83536,744.30387 C 565.80339,743.09343 564.39433,742.91676 564.26111,743.85572 C 564.14469,744.67631 565.40261,745.85786 567.47742,746.87674 C 569.55603,747.89748 571.83891,747.88984 574.51997,746.85314 C 576.52858,746.07646 577.20999,745.96394 577.20999,746.40893 C 577.20999,746.79423 574.41618,747.99619 572.26398,748.53681 C 570.06038,749.09033 570.03259,749.08053 565.4405,746.1288 C 563.47213,744.86356 561.36387,743.60204 560.75547,743.32542 C 559.51757,742.76261 557.69659,742.68287 555.22454,743.08327 C 554.31194,743.23107 549.83188,743.72758 545.26887,744.18661 C 531.73162,745.54843 526.33969,746.36862 510.70055,749.44496 C 496.23585,752.29029 493.82531,752.67874 493.19962,752.26513 L 493.19962,752.26513 z M 569.69761,741.99548 C 569.91244,740.52726 563.19375,735.62013 560.96869,735.62013 C 560.02967,735.62013 559.36646,736.22728 559.61059,736.86346 C 559.76786,737.2733 559.98656,737.39056 561.99993,738.14453 C 562.53228,738.34388 564.0212,739.30979 565.30863,740.291 C 568.83172,742.97609 569.5153,743.24155 569.69761,741.99548 L 569.69761,741.99548 z"
             style="opacity:1;fill:#f4eed7;fill-opacity:1;stroke:none;stroke-opacity:1" />
          <path
             id="path3169"
             d="M 642.19842,748.15715 C 638.60782,747.90474 634.01508,747.37996 629.06246,746.65621 C 626.02045,746.21165 619.61148,745.47616 614.82032,745.02178 C 610.02915,744.56739 603.55796,743.82647 600.4399,743.37527 C 589.66756,741.81649 584.369,741.73703 581.21958,743.08702 C 579.6386,743.76472 579.37542,743.77515 579.47937,743.15602 C 579.60087,742.43238 578.57948,742.64499 575.83522,743.91458 C 574.54201,744.51286 573.37927,744.89772 573.25136,744.7698 C 572.94534,744.46378 572.52362,742.61727 572.5153,741.54693 C 572.49781,739.29751 574.49065,735.4119 577.89439,731.05888 C 581.85823,725.98956 586.03775,723.06931 591.80635,721.33852 C 596.57336,719.90825 604.48182,720.15674 611.4475,721.95567 C 618.58229,723.7983 636.19354,729.32373 640.20615,730.97856 C 641.33164,731.44272 642.17522,731.94976 642.11394,732.12525 C 641.91294,732.70079 639.67214,732.27785 633.38516,730.47771 C 626.90233,728.62148 625.88218,728.4362 625.88218,729.11491 C 625.88218,729.78544 626.96469,730.30518 631.58365,731.85231 C 633.99951,732.66152 636.50314,733.59299 637.14727,733.92226 C 637.86687,734.2901 639.20444,734.61073 640.61644,734.75385 C 643.24504,735.02029 644.13425,735.39189 644.13425,736.22394 C 644.13425,736.78267 644.0403,736.80104 641.99101,736.64286 C 639.23934,736.43046 635.33567,735.59914 624.2229,732.85897 C 613.86982,730.30612 613.3273,730.23242 613.98891,731.46862 C 614.29029,732.0318 616.25993,732.60885 620.62779,733.41364 C 627.657,734.70878 642.20041,738.80058 643.82227,739.93941 C 645.89917,741.39776 640.04498,740.71909 631.75583,738.54056 C 628.82726,737.77089 627.80672,737.71672 627.60791,738.32039 C 627.43816,738.83566 629.05444,739.43348 634.17857,740.75075 C 639.28489,742.06345 642.89673,743.30824 644.54907,744.32485 L 645.65525,745.00544 L 644.73903,745.01408 C 644.2351,745.01883 640.56395,744.47093 636.5809,743.79652 C 628.65079,742.45381 624.9443,742.03771 624.68282,742.46082 C 624.38119,742.94887 625.89692,743.37672 632.35442,744.62632 C 639.84385,746.07559 643.86099,747.02163 645.70674,747.77078 L 647.03798,748.3111 L 645.24043,748.27787 C 644.25178,748.25959 642.88287,748.20527 642.19842,748.15715 L 642.19842,748.15715 z M 575.18288,741.91156 C 575.48989,741.56933 576.3993,740.04487 577.20377,738.52387 C 579.11163,734.91671 580.68201,732.72231 582.62898,730.94288 C 584.75153,729.003 586.58825,727.99928 588.9956,727.4637 C 591.28269,726.95487 592.49242,726.17353 592.36595,725.28686 C 592.23609,724.37623 590.50633,724.54633 587.74438,725.74136 C 581.28211,728.53743 577.36281,732.16792 574.55053,737.96297 C 573.00579,741.14614 573.43955,743.8548 575.18288,741.91156 L 575.18288,741.91156 z M 579.89209,739.39756 C 583.12586,736.33309 584.53611,735.34358 585.66983,735.34358 C 586.74277,735.34358 587.02736,735.01244 586.61563,734.24311 C 585.81311,732.74357 582.75329,734.19284 579.07668,737.81388 C 577.2098,739.65254 576.6569,740.36927 576.6569,740.95062 C 576.6569,741.42416 576.80574,741.70415 577.05748,741.70415 C 577.2778,741.70415 578.55337,740.66619 579.89208,739.39757 L 579.89209,739.39756 z"
             style="opacity:1;fill:#f4eed7;fill-opacity:1;stroke:none;stroke-opacity:1" />
          <path
             id="path3171"
             d="M 502.17047,733.45512 C 501.91875,733.17696 501.71279,732.82668 501.71279,732.6767 C 501.71279,732.2882 503.53113,731.47193 504.39659,731.47193 C 504.79765,731.47193 507.44245,730.54395 510.27391,729.40974 C 514.31301,727.79179 516.85397,726.99197 522.06921,725.69694 C 532.86792,723.01544 538.88872,721.89907 541.39722,722.1132 C 542.22865,722.18417 541.19833,722.47464 537.24902,723.28268 C 525.93449,725.59767 515.93557,728.70465 507.75755,732.44661 C 504.24019,734.05603 502.92855,734.29279 502.17047,733.45512 L 502.17047,733.45512 z"
             style="opacity:1;fill:#f4eed7;fill-opacity:1;stroke:none;stroke-opacity:1" />
        </g>
      </g>
    </g>
  </g>
</svg>
