These are genes that were found to be correlated to ATML1 at the 24hr and 32hr timepoints using a Spearman correlation test with Bonferroni-corrected p-value less than or equal to 0.05 that also appeared on the list of VLCFA-associated genes.,
gene_ID,gene_name
AT1G01610,GPAT4
AT1G02205,CER1
AT1G17840,ABCG11
AT1G51500,CER5
AT2G26910,ABCG32
AT3G28910,MYB30
AT4G16760,ACX1
AT5G02890,
AT5G10480,PAS2
AT5G57800,CER3