"locus","short_name","GO_ID","GO_ontology","GO_term"
"AT1G01120","KCS1","GO:0000038","BP","very long-chain fatty acid metabolic process"
"AT1G01120","KCS1","GO:0010025","BP","wax biosynthetic process"
"AT1G01120","KCS1","GO:0042761","BP","very long-chain fatty acid biosynthetic process"
"AT1G01610",NA,"GO:0010143","BP","cutin biosynthetic process"
"AT1G02205","CER1","GO:0010025","BP","wax biosynthetic process"
"AT1G02390",NA,"GO:0010143","BP","cutin biosynthetic process"
"AT1G04220","KCS2",NA,NA,NA
"AT1G06080",NA,"GO:0042761","BP","very long-chain fatty acid biosynthetic process"
"AT1G06350",NA,"GO:0010025","BP","wax biosynthetic process"
"AT1G06360",NA,"GO:0010025","BP","wax biosynthetic process"
"AT1G06520",NA,"GO:0010143","BP","cutin biosynthetic process"
"AT1G07720","KCS3",NA,NA,NA
"AT1G10670",NA,"GO:0010025","BP","wax biosynthetic process"
"AT1G11660",NA,"GO:1904276","BP","regulation of wax biosynthetic process"
"AT1G13580",NA,"GO:0042761","BP","very long-chain fatty acid biosynthetic process"
"AT1G14790",NA,"GO:0010025","BP","wax biosynthetic process"
"AT1G15360",NA,"GO:0010143","BP","cutin biosynthetic process"
"AT1G15360",NA,"GO:0010166","BP","wax metabolic process"
"AT1G16060",NA,"GO:1901959","BP","positive regulation of cutin biosynthetic process"
"AT1G17840",NA,"GO:0080051","BP","cutin transport"
"AT1G19440",NA,"GO:0000038","BP","very long-chain fatty acid metabolic process"
"AT1G21540",NA,"GO:0010025","BP","wax biosynthetic process"
"AT1G25450","KCS5","GO:0000038","BP","very long-chain fatty acid metabolic process"
"AT1G36160","ACC1",NA,NA,NA
"AT1G49430",NA,"GO:0010025","BP","wax biosynthetic process"
"AT1G49430",NA,"GO:0010143","BP","cutin biosynthetic process"
"AT1G49430",NA,"GO:0031957","MF","very long-chain fatty acid-CoA ligase activity"
"AT1G51460",NA,"GO:0080051","BP","cutin transport"
"AT1G51500",NA,"GO:0010025","BP","wax biosynthetic process"
"AT1G54350",NA,"GO:0042760","BP","very long-chain fatty acid catabolic process"
"AT1G57750",NA,"GO:0010025","BP","wax biosynthetic process"
"AT1G64400","LACS3",NA,NA,NA
"AT1G64670",NA,"GO:0010143","BP","cutin biosynthetic process"
"AT1G64670",NA,"GO:1901959","BP","positive regulation of cutin biosynthetic process"
"AT1G67730","KCR1","GO:0042761","BP","very long-chain fatty acid biosynthetic process"
"AT1G68530","KCS6","GO:0000038","BP","very long-chain fatty acid metabolic process"
"AT1G68530","KCS6","GO:0010025","BP","wax biosynthetic process"
"AT1G71160",NA,"GO:0000038","BP","very long-chain fatty acid metabolic process"
"AT1G75000","ELO3","GO:0042761","BP","very long-chain fatty acid biosynthetic process"
"AT1G76630",NA,"GO:1904278","BP","positive regulation of wax biosynthetic process"
"AT1G79700",NA,"GO:1901959","BP","positive regulation of cutin biosynthetic process"
"AT1G79700",NA,"GO:1904278","BP","positive regulation of wax biosynthetic process"
"AT1G80950",NA,"GO:0000038","BP","very long-chain fatty acid metabolic process"
"AT2G04350","LACS8",NA,NA,NA
"AT2G15090",NA,"GO:0000038","BP","very long-chain fatty acid metabolic process"
"AT2G16280","KCS9","GO:0000038","BP","very long-chain fatty acid metabolic process"
"AT2G26250","KCS10","GO:0000038","BP","very long-chain fatty acid metabolic process"
"AT2G26910",NA,"GO:0080051","BP","cutin transport"
"AT2G31360",NA,"GO:0042761","BP","very long-chain fatty acid biosynthetic process"
"AT2G32720",NA,"GO:0042761","BP","very long-chain fatty acid biosynthetic process"
"AT2G34770",NA,"GO:0000038","BP","very long-chain fatty acid metabolic process"
"AT2G35690",NA,"GO:0000038","BP","very long-chain fatty acid metabolic process"
"AT2G38110",NA,"GO:0010143","BP","cutin biosynthetic process"
"AT2G38530",NA,"GO:1901957","BP","regulation of cutin biosynthetic process"
"AT2G45670",NA,"GO:0000038","BP","very long-chain fatty acid metabolic process"
"AT2G46720",NA,"GO:0000038","BP","very long-chain fatty acid metabolic process"
"AT2G47240",NA,"GO:0031957","MF","very long-chain fatty acid-CoA ligase activity"
"AT2G47240",NA,"GO:0010143","BP","cutin biosynthetic process"
"AT2G47240",NA,"GO:0010025","BP","wax biosynthetic process"
"AT3G01140",NA,"GO:1901957","BP","regulation of cutin biosynthetic process"
"AT3G05600",NA,"GO:0010143","BP","cutin biosynthetic process"
"AT3G05970","LACS6",NA,NA,NA
"AT3G06460",NA,"GO:0042761","BP","very long-chain fatty acid biosynthetic process"
"AT3G06470",NA,"GO:0042761","BP","very long-chain fatty acid biosynthetic process"
"AT3G10280",NA,"GO:0000038","BP","very long-chain fatty acid metabolic process"
"AT3G10570",NA,"GO:0010143","BP","cutin biosynthetic process"
"AT3G11325",NA,"GO:0010143","BP","cutin biosynthetic process"
"AT3G11430",NA,"GO:0010143","BP","cutin biosynthetic process"
"AT3G12990",NA,"GO:0010025","BP","wax biosynthetic process"
"AT3G16090",NA,"GO:1904276","BP","regulation of wax biosynthetic process"
"AT3G23840",NA,"GO:0042761","BP","very long-chain fatty acid biosynthetic process"
"AT3G25540","LOH1","GO:0042761","BP","very long-chain fatty acid biosynthetic process"
"AT3G27670",NA,"GO:0010025","BP","wax biosynthetic process"
"AT3G28910",NA,"GO:0042761","BP","very long-chain fatty acid biosynthetic process"
"AT3G46960",NA,"GO:1904278","BP","positive regulation of wax biosynthetic process"
"AT3G47600",NA,"GO:1904278","BP","positive regulation of wax biosynthetic process"
"AT3G48720",NA,"GO:0010143","BP","cutin biosynthetic process"
"AT3G49210",NA,"GO:0010025","BP","wax biosynthetic process"
"AT3G52160","KCS15",NA,NA,NA
"AT3G54010","PAS1","GO:0042761","BP","very long-chain fatty acid biosynthetic process"
"AT3G54320",NA,"GO:1901959","BP","positive regulation of cutin biosynthetic process"
"AT3G54610",NA,"GO:1904278","BP","positive regulation of wax biosynthetic process"
"AT3G55360","CER10","GO:0042761","BP","very long-chain fatty acid biosynthetic process"
"AT3G55360","CER10","GO:0010025","BP","wax biosynthetic process"
"AT3G55360","CER10","GO:0009923","CC","fatty acid elongase complex"
"AT3G60500",NA,"GO:0010025","BP","wax biosynthetic process"
"AT4G00400",NA,"GO:0010143","BP","cutin biosynthetic process"
"AT4G01950",NA,"GO:0010143","BP","cutin biosynthetic process"
"AT4G13840",NA,"GO:0042761","BP","very long-chain fatty acid biosynthetic process"
"AT4G13840",NA,"GO:0010025","BP","wax biosynthetic process"
"AT4G16760",NA,"GO:0000038","BP","very long-chain fatty acid metabolic process"
"AT4G22330",NA,"GO:0010025","BP","wax biosynthetic process"
"AT4G23850","LACS4",NA,NA,NA
"AT4G24510","CER2","GO:0010025","BP","wax biosynthetic process"
"AT4G24510","CER2","GO:0042761","BP","very long-chain fatty acid biosynthetic process"
"AT4G29830",NA,"GO:1904278","BP","positive regulation of wax biosynthetic process"
"AT4G30140",NA,"GO:0050525","MF","cutinase activity"
"AT4G33790",NA,"GO:0010025","BP","wax biosynthetic process"
"AT4G34100","CER9","GO:0010143","BP","cutin biosynthetic process"
"AT4G34100","CER9","GO:0010025","BP","wax biosynthetic process"
"AT4G34250","KCS16","GO:0000038","BP","very long-chain fatty acid metabolic process"
"AT4G34510",NA,"GO:0000038","BP","very long-chain fatty acid metabolic process"
"AT4G34520",NA,"GO:0000038","BP","very long-chain fatty acid metabolic process"
"AT4G35550",NA,"GO:0010025","BP","wax biosynthetic process"
"AT4G36830","ELO4","GO:0042761","BP","very long-chain fatty acid biosynthetic process"
"AT4G39850",NA,"GO:0042760","BP","very long-chain fatty acid catabolic process"
"AT5G01270",NA,"GO:0010025","BP","wax biosynthetic process"
"AT5G02890",NA,"GO:0010025","BP","wax biosynthetic process"
"AT5G04530","KCS19",NA,NA,NA
"AT5G06090",NA,"GO:0010143","BP","cutin biosynthetic process"
"AT5G10480","PAS2","GO:0042761","BP","very long-chain fatty acid biosynthetic process"
"AT5G10480","PAS2","GO:0009923","CC","fatty acid elongase complex"
"AT5G12420",NA,"GO:0010025","BP","wax biosynthetic process"
"AT5G15310",NA,"GO:1901957","BP","regulation of cutin biosynthetic process"
"AT5G23190",NA,"GO:0042761","BP","very long-chain fatty acid biosynthetic process"
"AT5G23570",NA,"GO:0010025","BP","wax biosynthetic process"
"AT5G23940",NA,"GO:0010143","BP","cutin biosynthetic process"
"AT5G37300",NA,"GO:0010025","BP","wax biosynthetic process"
"AT5G43760","KCS20",NA,NA,NA
"AT5G47120",NA,"GO:0000038","BP","very long-chain fatty acid metabolic process"
"AT5G49070",NA,"GO:0000038","BP","very long-chain fatty acid metabolic process"
"AT5G57800","CER3","GO:0010025","BP","wax biosynthetic process"
"AT5G59770",NA,"GO:0042761","BP","very long-chain fatty acid biosynthetic process"
"AT5G61590",NA,"GO:1904277","BP","negative regulation of wax biosynthetic process"
"AT5G62470",NA,"GO:0010025","BP","wax biosynthetic process"
"AT5G62470",NA,"GO:1904278","BP","positive regulation of wax biosynthetic process"
