These are genes that were found to be correlated to ATML1 at the 24hr and 32hr timepoints using a Spearman correlation test with Bonferroni-corrected p-value less than or equal to 0.05.,
gene_ID,gene_name
AT1G01610,GPAT4
AT1G02205,CER1
AT1G07810,ECA1
AT1G09070,SRC2
AT1G09310,
AT1G10522,PRIN2
AT1G15520,ABCG40
AT1G17500,
AT1G17840,ABCG11
AT1G19430,
AT1G20810,
AT1G24996,
AT1G26570,UGD1
AT1G29170,WAVE2
AT1G41830,SKS6
AT1G51500,CER5
AT1G52720,
AT1G56580,SVB
AT1G61890,
AT1G62740,Hop2
AT1G62760,ATPMEI10
AT1G62975,
AT1G63010,VPT1
AT1G64710,
AT1G68470,
AT1G71140,DTX14
AT1G71960,ABCG25
AT1G74650,MYB31
AT1G78210,
AT1G80080,TMM
AT2G04100,
AT2G05510,
AT2G14880,SWIB2
AT2G15050,LTP
AT2G15480,UGT73B5
AT2G20950,
AT2G22770,NAI1
AT2G23010,SCPL9
AT2G23150,NRAMP3
AT2G23210,
AT2G23450,
AT2G26910,ABCG32
AT2G27150,AAO3
AT2G30550,DALL3
AT2G32650,
AT2G35940,BLH1
AT2G38750,ANNAT4
AT2G39310,JAL22
AT2G43535,
AT3G03640,BGLU25
AT3G06210,
AT3G12700,NANA
AT3G12880,
AT3G16250,PnsB3
AT3G16400,NSP1
AT3G16420,PBP1
AT3G16460,JAL34
AT3G17810,PYD1
AT3G18350,
AT3G18370,ATSYTF
AT3G19660,
AT3G23560,ALF5
AT3G23920,BAM1
AT3G24810,ICK3
AT3G25700,
AT3G26380,APSE
AT3G26450,
AT3G26470,
AT3G26744,ICE1
AT3G28910,MYB30
AT3G44990,XTH31
AT3G45290,MLO3
AT3G47060,ftsh7
AT3G50740,UGT72E1
AT3G50970,LTI30
AT3G55500,EXPA16
AT3G57400,
AT3G58750,CSY2
AT3G61490,
AT3G63200,PLP9
AT4G01110,
AT4G01460,
AT4G01750,RGXT2
AT4G02410,LECRK-IV.3
AT4G02940,ALKBH10B
AT4G16760,ACX1
AT4G18220,
AT4G21960,PRXR1
AT4G23670,
AT4G23990,CSLG3
AT4G25960,ABCB2
AT4G27700,
AT4G29040,RPT2a
AT4G30470,
AT4G32000,
AT4G33220,PME44
AT4G34131,UGT73B3
AT4G34190,1-Sep
AT4G34480,
AT4G34710,ADC2
AT4G39510,CYP96A12
AT4G39710,PnsL4
AT5G02890,
AT5G03830,
AT5G07000,ST2B
AT5G09620,
AT5G10480,PAS2
AT5G14750,MYB66
AT5G14780,FDH
AT5G15740,RRT1
AT5G17330,GAD
AT5G17700,
AT5G18170,GDH1
AT5G18460,
AT5G20960,AO1
AT5G23920,
AT5G24314,PTAC7
AT5G26340,MSS1
AT5G27860,
AT5G34850,PAP26
AT5G38140,NF-YC12
AT5G38200,
AT5G38430,RBCS1B
AT5G45280,PAE11
AT5G49630,AAP6
AT5G51500,
AT5G51580,
AT5G57800,CER3
AT5G63180,
AT5G67360,ARA12
ATCG00160,RPS2
ATCG00330,RPS14
ATCG00380,RPS4
ATCG00470,ATPE
ATCG00790,RPL16
ATCG00800,RPS3
ATCG00810,RPL22
ATCG00900,RPS7.1
ATCG01040,YCF5
ATCG01130,YCF1.2
ATCG01240,RPS7.2