GLOBAL ATTRIBUTES,,,,,,,,,,,,,,,,,
title,,,,,,,,,,,,,,,,,
project,Integrated Marine Observing System (IMOS),,,,,,,,,,,,,,,,
original_project_name,MERIS validation,,,,,,,,,,,,,,,,
institution,CSIRO Land and Water,,,,,,,,,,,,,,,,
abstract,This record contains in situ water optical property data collected in the Great Barrier Reef (Australia) on the RSV Lady Basten between 21-29 Oct 2002. A total of 28 stations were sampled during the field campaign AO02. The data can be used for Ocean Colour sensor validation| optical water quality monitoring and modelling. CLW deployed the optical instruments TriOS RAMSES (hyperspectral irradiance)| WETLabs AC-9 (absorption and attenuation coefficicents)| HOBILabs Hydroscat-6 (backscattering coefficient) during this cruise.This data was part of the dataset described in Oubelkheir et al. 2004| Bio-optical characterisation of Australian ocean| coastal and estuarine waters In SPIE| Ocean Optics XVII| Fremantle (Aus.) and Blondeau-Patissier et al. 2009| JGR| VOL. 114| C05003| doi:10.1029/2008JC005039. Funding for this study was provided by CSIRO Earth Observation Centre| CSIRO Land and Water| CSIRO Marine Research and the Australian Institute of Marine Sciences. We also thank the captains and crews of the RSV Lady Basten.,,,,,,,,,,,,,,,,
conventions,IMOS biological data format (v1.0),,,,,,,,,,,,,,,,
date_created,2002-10-22T06:46:02Z,,,,,,,,,,,,,,,,
date_modified,2002-10-22T07:48:59Z,,,,,,,,,,,,,,,,
history,Data has been quality controlled by in-house procedures. HS-6 data were corrected for temperature using CTD data and the Sigma correction method| recommended by the manufacturer| was applied using absorption and attenuation data from the AC-9. The Sigma correction is an adjustment to improve the accuracy of backscattering measurements| in particular in highly-attenuating water. The correction is detailed in HOBI-labs Inc.| 2003. The backscattering coefficient bb is estimated using the method described in Maffione and Dana| 1997| Applied Optics| 36(24)| pp.6057-6067.,,,,,,,,,,,,,,,,
comment,The HydroScat-6 (HS-6) is a self-contained instrument for measuring optical backscattering at six different wavelengths in natural waters. The particulate backscattering coefficient| bbp (lambda)| is a measure of light scattering by particles at angles between 90 and 180 degrees. bbp was estimated by subtracting bbw (lambda)| the backscattering coefficient of pure sea-water| from bb (lambda). The pure seawater backscattering coefficient was calculated using a backscattering ratio of 0.5 (Gordon et al.| 1988| Journal of Geophysical Research) and the seawater scattering coefficients| bw(lambda)| of Morel (1974| Optical properties of pure water and pure seawater| p. 1-24| in Optical Aspects of Oceanography).,,,,,,,,,,,,,,,,
source,Particulate Scattering coefficients determined using an HS-6 (www.hobilabs.com),,,,,,,,,,,,,,,,
keywords,Oceans>Ocean Optics > Scattering ;Oceans>Ocean Optics>Ocean Colour;,,,,,,,,,,,,,,,,
cruise_id,LB3172,,,,,,,,,,,,,,,,
vessel_name,RSV Lady Basten,,,,,,,,,,,,,,,,
platform_code,VLAB_450301529,,,,,,,,,,,,,,,,
references,https://marlin.csiro.au/geonetwork/srv/eng/catalog.search#/metadata/de47e8c0-5315-446e-b637-cf2630ea5f61,,,,,,,,,,,,,,,,
naming_authority,CSIRO Land and Water (CLW),,,,,,,,,,,,,,,,
cdm_data_type,profile,,,,,,,,,,,,,,,,
geospatial_lat_min,,,,,,,,,,,,,,,,,
geospatial_lat_max,,,,,,,,,,,,,,,,,
geospatial_lon_min,,,,,,,,,,,,,,,,,
geospatial_lon_max,,,,,,,,,,,,,,,,,
geospatial_vertical_min,0,,,,,,,,,,,,,,,,
geospatial_vertical_max,0,,,,,,,,,,,,,,,,
local_time_zone,10,,,,,,,,,,,,,,,,
data_centre,eMarine Information Infrastructure (eMII),,,,,,,,,,,,,,,,
data_centre_email,info@emii.org.au,,,,,,,,,,,,,,,,
author,Brando Vittorio,,,,,,,,,,,,,,,,
author_email,vittorio.brando@csiro.au,,,,,,,,,,,,,,,,
principal_investigator,Furnas Miles,,,,,,,,,,,,,,,,
principal_investigator_email,m.furnas@aims.gov.au,,,,,,,,,,,,,,,,
publisher,Australian Ocean Data Network,,,,,,,,,,,,,,,,
publisher_email,info@aodn.org.au,,,,,,,,,,,,,,,,
institution,IMOS Satellite Remote Sensing - Ocean Colour Sub-facility - Bio-Optical Database of Australian Waters,,,,,,,,,,,,,,,,
institution_principal_investigator,"Schroeder, Thomas",,,,,,,,,,,,,,,,
institution_principal_investigator_email,Thomas.Schroeder@csiro.au, ,,,,,,,,,,,,,,,
citation,To cite this data set in a publication use the format <<IMOS [year-of-data-downloaded] [Title] [data-access-url] accessed [date-of-access]>>,,,,,,,,,,,,,,,,
acknowledgement,Data was sourced from the Commonwealth Scientific and Industrial Research Organisation (CSIRO),,,,,,,,,,,,,,,,
distribution_statement,"Any users of IMOS data are required to clearly acknowledge the source of the material- Data or products or services from IMOS are provided ""as is"" without any warranty as to fitness for a particular purpose.",,,,,,,,,,,,,,,,
,,,,,,,,,,,,,,,,,
TABLE ROWS,,,,,,,,,,,,,,,,,
Row name,CF standard_name,IMOS long_name,Units,Fill value,Comments,,,,,,,,,,,,
Wavelength,radiation_wavelength,Wavelength of measurement,nm,-999,,,,,,,,,,,,,
,,,,,,,,,,,,,,,,,
TABLE COLUMNS,,,,,,,,,,,,,,,,,
Column name,CF standard_name,IMOS long_name,Units,Fill value,Comments,,,,,,,,,,,,
Time,time,analysis_time,YYYY-MM-DDThh:mm:ssZ,,UTC date and time,,,,,,,,,,,,
Station_Code,,,,,National Reference Station code (6 letters),,,,,,,,,,,,
Latitude,latitude,latitude,degrees_north,-999,North positive,,,,,,,,,,,,
Longitude,longitude,longitude,degrees_east,-999,East positive,,,,,,,,,,,,
Depth,depth,depth,m ,-999,positive down,,,,,,,,,,,,
bb_corr,,corrected_volume_total_backwards_scattering_coefficient_of_(bbw_+_bbp)_in_sea_water,m-1,-999,bbw:volume_backwards_scattering_coefficient_of_radiative_flux_in_sea_water ; bbp=volume_backwards_scattering_coefficient_of_particules_in_sea_water,,,,,,,,,,,,
bb_uncorr,,volume_total_backwards_scattering_coefficient_of_(bbw_+_bbp)_in_sea_water,m-1,-999,bbw:volume_backwards_scattering_coefficient_of_radiative_flux_in_sea_water ; bbp=volume_backwards_scattering_coefficient_of_particules_in_sea_water,,,,,,,,,,,,
,,,,,,,,,,,,,,,,,
,,,,,,,,,,,,,,,,,
DATA,,,,,,,,,,,,,,,,,
,Time,Station_Code,Latitude,Longitude,Depth,bb_corr,bb_corr,bb_corr,bb_corr,bb_corr,bb_corr,bb_uncorr,bb_uncorr,bb_uncorr,bb_uncorr,bb_uncorr,bb_uncorr
Wavelength,,,,,,442,448,555,589,676,852,442,448,555,589,676,852
,2002-10-22T06:46:02Z,SAT007,-18.29,147.39,0,0.004807,0.002339,0.001657,0.001208,0.001626,0.000577,0.004781,0.002328,0.001649,0.001227,0.00163,0.000416
,2002-10-22T06:46:06Z,SAT007,-18.29,147.39,0.2,0.004316,0.002281,0.00182,0.001498,0.001707,0.00062,0.004291,0.00227,0.001811,0.001521,0.00171,0.000447
,2002-10-22T06:46:23Z,SAT007,-18.29,147.39,0.4,0.005495,0.002809,0.001944,0.001559,0.002267,0.000826,0.005463,0.002795,0.001934,0.001584,0.002271,0.000596
,2002-10-22T06:58:58Z,SAT007,-18.29,147.39,0.6,0.004557,0.002485,0.001449,0.001124,0.001529,0.00062,0.00453,0.002473,0.001442,0.001141,0.00153,0.000447
,2002-10-22T06:49:39Z,SAT007,-18.29,147.39,0.8,0.004834,0.002415,0.001764,0.001179,0.001483,0.00074,0.004804,0.002402,0.001755,0.001198,0.001484,0.000534
,2002-10-22T07:01:44Z,SAT007,-18.29,147.39,1,0.004072,0.002412,0.00168,0.001128,0.001395,0.000594,0.004046,0.002399,0.001672,0.001145,0.001395,0.000428
,2002-10-22T06:49:33Z,SAT007,-18.29,147.39,1.2,0.004683,0.002406,0.001669,0.001438,0.001587,0.000766,0.004653,0.002393,0.00166,0.001461,0.001587,0.000553
,2002-10-22T07:01:34Z,SAT007,-18.29,147.39,1.4,0.004795,0.002299,0.00141,0.001099,0.001637,0.000662,0.004763,0.002286,0.001403,0.001116,0.001637,0.000478
,2002-10-22T06:59:11Z,SAT007,-18.29,147.39,1.6,0.004566,0.002464,0.001517,0.001156,0.001581,0.000619,0.004536,0.002451,0.001509,0.001174,0.00158,0.000447
,2002-10-22T06:49:12Z,SAT007,-18.29,147.39,1.8,0.004349,0.002319,0.00172,0.00117,0.001741,0.000679,0.00432,0.002306,0.001711,0.001188,0.00174,0.000491
,2002-10-22T07:01:27Z,SAT007,-18.29,147.39,2,0.00446,0.002338,0.001596,0.00108,0.001529,0.000525,0.004431,0.002325,0.001588,0.001097,0.001529,0.000379
,2002-10-22T07:01:26Z,SAT007,-18.29,147.39,2.2,0.004624,0.002318,0.001557,0.001097,0.001526,0.000654,0.004594,0.002306,0.001549,0.001114,0.001525,0.000472
,2002-10-22T06:59:15Z,SAT007,-18.29,147.39,2.4,0.004677,0.002263,0.001607,0.001133,0.001766,0.000628,0.004647,0.002251,0.001599,0.001151,0.001765,0.000453
,2002-10-22T07:01:22Z,SAT007,-18.29,147.39,2.6,0.004531,0.002318,0.001652,0.001087,0.001542,0.000602,0.004501,0.002306,0.001644,0.001104,0.001541,0.000435
,2002-10-22T06:49:09Z,SAT007,-18.29,147.39,2.8,0.004643,0.002506,0.001495,0.001229,0.00166,0.000636,0.004612,0.002492,0.001487,0.001249,0.001659,0.00046
,2002-10-22T06:59:19Z,SAT007,-18.29,147.39,3,0.004239,0.002313,0.00154,0.00109,0.001518,0.000516,0.004209,0.002299,0.001532,0.001106,0.001516,0.000373
,2002-10-22T07:01:19Z,SAT007,-18.29,147.39,3.2,0.004538,0.002339,0.001405,0.00104,0.001529,0.000533,0.004507,0.002325,0.001398,0.001056,0.001527,0.000385
,2002-10-22T06:49:01Z,SAT007,-18.29,147.39,3.4,0.004674,0.002358,0.001535,0.001143,0.001724,0.000808,0.004641,0.002344,0.001526,0.001161,0.001723,0.000584
,2002-10-22T06:51:04Z,SAT007,-18.29,147.39,3.6,0.004392,0.002346,0.001591,0.001197,0.001607,0.000757,0.004361,0.002331,0.001582,0.001215,0.001605,0.000546
,2002-10-22T06:59:25Z,SAT007,-18.29,147.39,3.8,0.004398,0.002547,0.001535,0.001163,0.001652,0.000705,0.004367,0.002531,0.001526,0.00118,0.00165,0.000509
,2002-10-22T06:46:37Z,SAT007,-18.29,147.39,4,0.003999,0.002307,0.001552,0.001122,0.001616,0.000688,0.00397,0.002293,0.001543,0.001139,0.001614,0.000497
,2002-10-22T06:59:26Z,SAT007,-18.29,147.39,4.2,0.004186,0.002385,0.001507,0.001182,0.00165,0.000602,0.004157,0.00237,0.001498,0.0012,0.001648,0.000435
,2002-10-22T07:02:15Z,SAT007,-18.29,147.39,4.4,0.004451,0.002317,0.001506,0.001143,0.001613,0.000593,0.004419,0.002302,0.001498,0.001161,0.001611,0.000428
,2002-10-22T06:46:40Z,SAT007,-18.29,147.39,4.6,0.004022,0.002365,0.001568,0.001134,0.001603,0.000533,0.003994,0.002351,0.00156,0.001151,0.001602,0.000385
,2002-10-22T06:48:55Z,SAT007,-18.29,147.39,4.8,0.004015,0.002565,0.001714,0.001157,0.001688,0.000808,0.003988,0.00255,0.001705,0.001174,0.001687,0.000584
,2002-10-22T06:48:56Z,SAT007,-18.29,147.39,5,0.004302,0.002448,0.001467,0.001149,0.001724,0.000688,0.004274,0.002434,0.001459,0.001167,0.001723,0.000497
,2002-10-22T06:59:33Z,SAT007,-18.29,147.39,5.2,0.004049,0.002309,0.001416,0.001095,0.001494,0.000585,0.004023,0.002296,0.001409,0.001112,0.001493,0.000422
,2002-10-22T06:51:15Z,SAT007,-18.29,147.39,5.4,0.004295,0.00238,0.001534,0.001162,0.001475,0.000662,0.004268,0.002367,0.001526,0.00118,0.001475,0.000478
,2002-10-22T06:46:42Z,SAT007,-18.29,147.39,5.6,0.004183,0.002445,0.001427,0.001225,0.001643,0.000748,0.004157,0.002431,0.00142,0.001245,0.001643,0.00054
,2002-10-22T06:59:35Z,SAT007,-18.29,147.39,5.8,0.004271,0.002464,0.001253,0.001139,0.0015,0.000593,0.004244,0.002451,0.001247,0.001157,0.0015,0.000428
,2002-10-22T06:59:39Z,SAT007,-18.29,147.39,6,0.004154,0.002341,0.001556,0.001141,0.001546,0.000679,0.004128,0.002328,0.001549,0.001159,0.001546,0.000491
,2002-10-22T06:59:37Z,SAT007,-18.29,147.39,6.2,0.004242,0.002228,0.001714,0.001097,0.001399,0.000602,0.004215,0.002216,0.001705,0.001114,0.001399,0.000435
,2002-10-22T07:00:57Z,SAT007,-18.29,147.39,6.4,0.004413,0.002348,0.0015,0.001135,0.001671,0.00068,0.004384,0.002335,0.001493,0.001153,0.001671,0.000491
,2002-10-22T06:46:42Z,SAT007,-18.29,147.39,6.6,-999,-999,-999,-999,-999,-999,-999,-999,-999,-999,-999,-999
,2002-10-22T07:00:56Z,SAT007,-18.29,147.39,6.8,0.004789,0.002293,0.001607,0.001101,0.001635,0.000748,0.004758,0.00228,0.001599,0.001118,0.001634,0.00054
,2002-10-22T06:59:41Z,SAT007,-18.29,147.39,7,0.003822,0.002543,0.001731,0.001156,0.001728,0.000654,0.003796,0.002528,0.001722,0.001174,0.001726,0.000472
,2002-10-22T07:00:55Z,SAT007,-18.29,147.39,7.2,0.004609,0.00244,0.001518,0.001126,0.001536,0.000619,0.004577,0.002425,0.001509,0.001143,0.001534,0.000447
,2002-10-22T07:00:54Z,SAT007,-18.29,147.39,7.4,0.004727,0.002411,0.001568,0.001137,0.0016,0.000748,0.004693,0.002396,0.00156,0.001155,0.001598,0.00054
,2002-10-22T06:55:44Z,SAT007,-18.29,147.39,7.6,0.004357,0.002323,0.001596,0.001155,0.001595,0.000817,0.004326,0.002309,0.001588,0.001173,0.001593,0.00059
,2002-10-22T07:00:50Z,SAT007,-18.29,147.39,7.8,0.004487,0.00233,0.001518,0.001115,0.00149,0.000739,0.004454,0.002315,0.001509,0.001132,0.001488,0.000534
,2002-10-22T06:51:29Z,SAT007,-18.29,147.39,8,0.004517,0.002265,0.001574,0.001128,0.001528,0.000842,0.004483,0.002251,0.001565,0.001145,0.001525,0.000609
,2002-10-22T06:59:49Z,SAT007,-18.29,147.39,8.2,0.004658,0.002317,0.001558,0.001081,0.001555,0.000593,0.004623,0.002302,0.001549,0.001097,0.001552,0.000428
,2002-10-22T06:51:30Z,SAT007,-18.29,147.39,8.4,0.004934,0.002223,0.001524,0.001234,0.001612,0.00061,0.004897,0.002209,0.001515,0.001252,0.001609,0.000441
,2002-10-22T06:48:20Z,SAT007,-18.29,147.39,8.6,0.004981,0.002149,0.001659,0.001127,0.001615,0.000645,0.004944,0.002135,0.001649,0.001143,0.001612,0.000466
,2002-10-22T06:48:19Z,SAT007,-18.29,147.39,8.8,0.004423,0.002298,0.001603,0.001067,0.001621,0.000585,0.00439,0.002283,0.001593,0.001083,0.001618,0.000422
,2002-10-22T06:59:52Z,SAT007,-18.29,147.39,9,0.0044,0.002561,0.001699,0.00115,0.001681,0.000662,0.004367,0.002544,0.001688,0.001167,0.001678,0.000478
,2002-10-22T06:47:47Z,SAT007,-18.29,147.39,9.2,0.004412,0.002606,0.001569,0.001075,0.001503,0.000705,0.004379,0.002589,0.00156,0.001091,0.0015,0.000509
,2002-10-22T06:47:46Z,SAT007,-18.29,147.39,9.4,0.004658,0.002366,0.001659,0.001144,0.001658,0.00061,0.004623,0.002351,0.001649,0.001161,0.001655,0.000441
,2002-10-22T06:47:36Z,SAT007,-18.29,147.39,9.6,0.004429,0.002405,0.001732,0.001083,0.001691,0.000662,0.004396,0.002389,0.001722,0.001099,0.001689,0.000478
,2002-10-22T06:55:39Z,SAT007,-18.29,147.39,9.8,0.004658,0.002437,0.001412,0.001173,0.001378,0.000645,0.004623,0.002422,0.001403,0.00119,0.001376,0.000466
,2002-10-22T07:00:41Z,SAT007,-18.29,147.39,10,0.00477,0.002538,0.00158,0.001111,0.001636,0.000679,0.004734,0.002521,0.001571,0.001128,0.001634,0.000491
,2002-10-22T07:00:24Z,SAT007,-18.29,147.39,10.2,0.004553,0.00235,0.001772,0.001104,0.001582,0.000679,0.004518,0.002335,0.001761,0.00112,0.00158,0.000491
,2002-10-22T06:51:39Z,SAT007,-18.29,147.39,10.4,0.004576,0.002437,0.001563,0.001084,0.001636,0.000593,0.004542,0.002422,0.001554,0.0011,0.001634,0.000428
,2002-10-22T07:00:04Z,SAT007,-18.29,147.39,10.6,0.004076,0.002417,0.001468,0.001107,0.001593,0.000593,0.004046,0.002402,0.001459,0.001124,0.001591,0.000428
,2002-10-22T07:02:34Z,SAT007,-18.29,147.39,10.8,0.004416,0.002385,0.001383,0.001111,0.001678,0.000997,0.004384,0.00237,0.001375,0.001128,0.001676,0.00072
,2002-10-22T06:51:41Z,SAT007,-18.29,147.39,11,0.004175,0.002213,0.001473,0.001144,0.001576,0.000783,0.004145,0.002199,0.001465,0.001161,0.001575,0.000565
,2002-10-22T06:51:42Z,SAT007,-18.29,147.39,11.2,0.004422,0.002346,0.001507,0.001136,0.00166,0.000843,0.00439,0.002331,0.001498,0.001153,0.001659,0.000609
,2002-10-22T06:51:43Z,SAT007,-18.29,147.39,11.4,0.004416,0.002433,0.001563,0.001063,0.001585,0.000602,0.004384,0.002418,0.001554,0.001079,0.001584,0.000435
,2002-10-22T06:51:45Z,SAT007,-18.29,147.39,11.6,0.004622,0.002349,0.001653,0.001171,0.00194,0.000757,0.004588,0.002335,0.001644,0.001188,0.00194,0.000546
,2002-10-22T06:51:46Z,SAT007,-18.29,147.39,11.8,0.004615,0.0023,0.001529,0.001113,0.001698,0.000748,0.004583,0.002286,0.001521,0.00113,0.001698,0.00054
,2002-10-22T06:55:33Z,SAT007,-18.29,147.39,12,0.004415,0.002423,0.001507,0.001134,0.001485,0.000774,0.004384,0.002409,0.001498,0.001151,0.001484,0.000559
,2002-10-22T07:02:39Z,SAT007,-18.29,147.39,12.2,0.004473,0.002404,0.001652,0.001176,0.001714,0.000851,0.004443,0.002389,0.001644,0.001194,0.001714,0.000615
,2002-10-22T06:51:47Z,SAT007,-18.29,147.39,12.4,0.00496,0.00228,0.001512,0.00109,0.002065,0.000671,0.004927,0.002267,0.001504,0.001106,0.002064,0.000484
,2002-10-22T06:51:50Z,SAT007,-18.29,147.39,12.6,0.00442,0.002277,0.001495,0.001151,0.001676,0.000791,0.00439,0.002264,0.001487,0.001169,0.001676,0.000571
,2002-10-22T06:51:48Z,SAT007,-18.29,147.39,12.8,0.005001,0.002354,0.001534,0.001087,0.001627,0.000791,0.004967,0.002341,0.001526,0.001104,0.001627,0.000571
,2002-10-22T06:55:30Z,SAT007,-18.29,147.39,13,0.004562,0.00243,0.0014,0.001111,0.001566,0.000826,0.00453,0.002415,0.001392,0.001128,0.001566,0.000596
,2002-10-22T07:02:42Z,SAT007,-18.29,147.39,13.2,0.004532,0.002267,0.00168,0.001135,0.00174,0.001178,0.004501,0.002254,0.001672,0.001153,0.00174,0.000851
,2002-10-22T06:47:19Z,SAT007,-18.29,147.39,13.4,-999,-999,-999,-999,-999,-999,-999,-999,-999,-999,-999,-999
,2002-10-22T06:51:53Z,SAT007,-18.29,147.39,13.6,0.00442,0.002572,0.001692,0.001143,0.001687,0.000843,0.00439,0.002557,0.001683,0.001161,0.001687,0.000609
,2002-10-22T06:51:57Z,SAT007,-18.29,147.39,13.8,0.004625,0.002306,0.001562,0.001126,0.001621,0.00068,0.004594,0.002293,0.001554,0.001143,0.001621,0.000491
,2002-10-22T06:51:54Z,SAT007,-18.29,147.39,14,0.004507,0.002529,0.001691,0.001112,0.001644,0.000697,0.004478,0.002515,0.001683,0.00113,0.001644,0.000503
,2002-10-22T06:55:27Z,SAT007,-18.29,147.39,14.2,0.004314,0.002451,0.001405,0.001114,0.001649,0.000731,0.004285,0.002438,0.001398,0.001132,0.00165,0.000528
,2002-10-22T06:51:58Z,SAT007,-18.29,147.39,14.4,0.004965,0.002322,0.001568,0.001133,0.00166,0.00068,0.004932,0.002309,0.00156,0.001151,0.00166,0.000491
,2002-10-22T06:47:25Z,SAT007,-18.29,147.39,14.6,-999,-999,-999,-999,-999,-999,-999,-999,-999,-999,-999,-999
,2002-10-22T06:52:02Z,SAT007,-18.29,147.39,14.8,0.00449,0.00225,0.001517,0.001137,0.00169,0.00074,0.00446,0.002238,0.001509,0.001155,0.001691,0.000534
,2002-10-22T06:52:01Z,SAT007,-18.29,147.39,15,0.004437,0.002241,0.00146,0.001121,0.001643,0.000662,0.004408,0.002228,0.001454,0.001139,0.001644,0.000478
,2002-10-22T06:52:00Z,SAT007,-18.29,147.39,15.2,0.004578,0.002212,0.00159,0.001131,0.001473,0.000456,0.004548,0.002199,0.001582,0.001149,0.001474,0.000329
,2002-10-22T07:02:48Z,SAT007,-18.29,147.39,15.4,0.004161,0.00239,0.001747,0.0012,0.00155,0.000723,0.004134,0.002377,0.001739,0.001219,0.00155,0.000522
,2002-10-22T07:02:49Z,SAT007,-18.29,147.39,15.6,0.004225,0.002338,0.001539,0.001152,0.001375,0.000714,0.004198,0.002325,0.001532,0.001171,0.001376,0.000515
,2002-10-22T06:52:04Z,SAT007,-18.29,147.39,15.8,0.004489,0.002205,0.001477,0.001116,0.001727,0.000817,0.00446,0.002193,0.00147,0.001134,0.001728,0.00059
,2002-10-22T07:02:51Z,SAT007,-18.29,147.39,16,0.004266,0.002318,0.0015,0.001267,0.001475,0.000886,0.004239,0.002306,0.001493,0.001287,0.001475,0.00064
,2002-10-22T06:55:22Z,SAT007,-18.29,147.39,16.2,0.004647,0.002376,0.001556,0.001232,0.00156,0.000792,0.004618,0.002364,0.001549,0.001252,0.001561,0.000571
,2002-10-22T06:52:06Z,SAT007,-18.29,147.39,16.4,0.004325,0.002444,0.001511,0.001133,0.001624,0.000688,0.004297,0.002431,0.001504,0.001151,0.001625,0.000497
,2002-10-22T07:02:53Z,SAT007,-18.29,147.39,16.6,0.004202,0.002254,0.001477,0.001156,0.001619,0.0008,0.004174,0.002241,0.00147,0.001174,0.001619,0.000578
,2002-10-22T06:55:21Z,SAT007,-18.29,147.39,16.8,0.004542,0.002399,0.001292,0.001121,0.001711,0.000714,0.004513,0.002386,0.001286,0.001139,0.001712,0.000515
,2002-10-22T06:55:19Z,SAT007,-18.29,147.39,17,0.004348,0.002518,0.001556,0.001098,0.001637,0.000964,0.00432,0.002505,0.001549,0.001116,0.001637,0.000696
,2002-10-22T06:47:39Z,SAT007,-18.29,147.39,17.2,-999,-999,-999,-999,-999,-999,-999,-999,-999,-999,-999,-999
,2002-10-22T07:02:55Z,SAT007,-18.29,147.39,17.4,0.004547,0.002418,0.001601,0.0012,0.001549,0.000757,0.004518,0.002406,0.001593,0.001219,0.00155,0.000546
,2002-10-22T07:02:56Z,SAT007,-18.29,147.39,17.6,0.004401,0.00227,0.001859,0.001177,0.001578,0.000757,0.004373,0.002257,0.00185,0.001196,0.001579,0.000546
,2002-10-22T06:52:12Z,SAT007,-18.29,147.39,17.8,0.004226,0.002228,0.001595,0.001143,0.001518,0.000671,0.004198,0.002216,0.001588,0.001161,0.001518,0.000484
,2002-10-22T07:02:58Z,SAT007,-18.29,147.39,18,0.004565,0.002415,0.001674,0.001171,0.001662,0.000809,0.004536,0.002402,0.001666,0.00119,0.001662,0.000584
,2002-10-22T06:47:44Z,SAT007,-18.29,147.39,18.2,-999,-999,-999,-999,-999,-999,-999,-999,-999,-999,-999,-999
,2002-10-22T06:55:17Z,SAT007,-18.29,147.39,18.4,0.004542,0.00235,0.001399,0.001093,0.001544,0.000757,0.004513,0.002338,0.001392,0.00111,0.001545,0.000546
,2002-10-22T06:52:19Z,SAT007,-18.29,147.39,18.6,0.004513,0.002214,0.001567,0.0011,0.001648,0.000602,0.004483,0.002203,0.00156,0.001118,0.001648,0.000435
,2002-10-22T07:03:02Z,SAT007,-18.29,147.39,18.8,0.004454,0.002425,0.001702,0.001114,0.001614,0.000774,0.004425,0.002412,0.001694,0.001132,0.001614,0.000559
,2002-10-22T06:52:21Z,SAT007,-18.29,147.39,19,0.004625,0.002205,0.001461,0.001144,0.001651,0.0008,0.004594,0.002193,0.001454,0.001163,0.001651,0.000578
,2002-10-22T07:03:01Z,SAT007,-18.29,147.39,19.2,0.004302,0.002296,0.00164,0.00115,0.001445,0.000774,0.004274,0.002283,0.001632,0.001169,0.001445,0.000559
,2002-10-22T06:55:14Z,SAT007,-18.29,147.39,19.4,0.004471,0.002402,0.001449,0.001067,0.001587,0.000723,0.004443,0.002389,0.001442,0.001085,0.001587,0.000522
,2002-10-22T06:52:22Z,SAT007,-18.29,147.39,19.6,0.004677,0.002276,0.001584,0.001129,0.001662,0.00074,0.004647,0.002264,0.001577,0.001147,0.001662,0.000534
,2002-10-22T06:52:24Z,SAT007,-18.29,147.39,19.8,0.004474,0.002471,0.001809,0.001146,0.001549,0.000964,0.004443,0.002457,0.0018,0.001165,0.001548,0.000696
,2002-10-22T06:55:13Z,SAT007,-18.29,147.39,20,0.004775,0.002374,0.001635,0.001099,0.00162,0.000757,0.00474,0.00236,0.001627,0.001116,0.001619,0.000546
,2002-10-22T07:03:04Z,SAT007,-18.29,147.39,20.2,0.004276,0.002378,0.001568,0.001173,0.001791,0.000818,0.004244,0.002364,0.00156,0.001192,0.00179,0.00059
,2002-10-22T06:47:55Z,SAT007,-18.29,147.39,20.4,-999,-999,-999,-999,-999,-999,-999,-999,-999,-999,-999,-999
,2002-10-22T06:55:10Z,SAT007,-18.29,147.39,20.6,0.004,0.002339,0.001613,0.001076,0.00172,0.000809,0.00397,0.002325,0.001604,0.001093,0.001719,0.000584
,2002-10-22T07:03:07Z,SAT007,-18.29,147.39,20.8,0.004433,0.002293,0.001697,0.001141,0.001658,0.000637,0.004402,0.00228,0.001688,0.001159,0.001657,0.00046
,2002-10-22T07:03:08Z,SAT007,-18.29,147.39,21,0.004275,0.002439,0.001781,0.001116,0.001561,0.00068,0.004244,0.002425,0.001772,0.001134,0.001561,0.000491
,2002-10-22T07:03:09Z,SAT007,-18.29,147.39,21.2,0.004498,0.002361,0.001573,0.001189,0.001638,0.00049,0.004466,0.002348,0.001565,0.001208,0.001637,0.000354
,2002-10-22T06:52:32Z,SAT007,-18.29,147.39,21.4,0.004287,0.002277,0.001702,0.001158,0.001568,0.000611,0.004256,0.002264,0.001694,0.001176,0.001568,0.000441
,2002-10-22T06:52:34Z,SAT007,-18.29,147.39,21.6,0.004523,0.002277,0.001489,0.00111,0.001577,0.000792,0.004489,0.002264,0.001481,0.001128,0.001577,0.000571
,2002-10-22T06:55:07Z,SAT007,-18.29,147.39,21.8,0.004582,0.00231,0.001422,0.00106,0.001458,0.000818,0.004548,0.002296,0.001414,0.001077,0.001457,0.00059
,2002-10-22T06:52:35Z,SAT007,-18.29,147.39,22,0.004472,0.002259,0.001579,0.001304,0.001751,0.000723,0.004437,0.002244,0.001571,0.001324,0.001749,0.000522
,2002-10-22T06:52:36Z,SAT007,-18.29,147.39,22.2,0.004043,0.002268,0.00168,0.001099,0.001523,0.000878,0.004011,0.002254,0.001672,0.001116,0.001522,0.000633
,2002-10-22T06:52:37Z,SAT007,-18.29,147.39,22.4,0.004326,0.002233,0.001647,0.001124,0.001578,0.000904,0.004291,0.002219,0.001638,0.001141,0.001577,0.000652
,2002-10-22T07:03:11Z,SAT007,-18.29,147.39,22.6,0.004495,0.002346,0.001608,0.001187,0.001768,0.000749,0.00446,0.002331,0.001599,0.001206,0.001767,0.00054
,2002-10-22T07:03:14Z,SAT007,-18.29,147.39,22.8,0.004471,0.002239,0.001349,0.001135,0.001676,0.000594,0.004437,0.002225,0.001342,0.001153,0.001675,0.000428
,2002-10-22T07:03:15Z,SAT007,-18.29,147.39,23,0.004812,0.002288,0.00163,0.00116,0.001758,0.000792,0.004775,0.002273,0.001621,0.001178,0.001756,0.000571
,2002-10-22T07:03:12Z,SAT007,-18.29,147.39,23.2,0.004553,0.00221,0.00159,0.001137,0.001574,0.00074,0.004518,0.002196,0.001582,0.001155,0.001573,0.000534
,2002-10-22T06:52:42Z,SAT007,-18.29,147.39,23.4,0.00413,0.002476,0.001871,0.00125,0.001601,0.000757,0.004099,0.00246,0.001862,0.00127,0.0016,0.000546
,2002-10-22T06:52:43Z,SAT007,-18.29,147.39,23.6,0.004447,0.002375,0.001602,0.00113,0.001544,0.000835,0.004414,0.00236,0.001593,0.001147,0.001543,0.000602
,2002-10-22T06:52:45Z,SAT007,-18.29,147.39,23.8,0.004448,0.002369,0.001456,0.001072,0.001623,0.000757,0.004414,0.002354,0.001448,0.001089,0.001621,0.000546
,2002-10-22T07:03:17Z,SAT007,-18.29,147.39,24,0.004649,0.002292,0.001343,0.001185,0.001666,0.000568,0.004612,0.002277,0.001336,0.001204,0.001664,0.00041
,2002-10-22T06:52:47Z,SAT007,-18.29,147.39,24.2,0.004473,0.002117,0.001569,0.001105,0.001648,0.000878,0.004437,0.002103,0.00156,0.001122,0.001646,0.000633
,2002-10-22T06:48:16Z,SAT007,-18.29,147.39,24.4,-999,-999,-999,-999,-999,-999,-999,-999,-999,-999,-999,-999
,2002-10-22T07:03:21Z,SAT007,-18.29,147.39,24.6,0.004477,0.002294,0.001304,0.001158,0.001502,0.000637,0.004443,0.00228,0.001297,0.001176,0.0015,0.00046
,2002-10-22T07:03:19Z,SAT007,-18.29,147.39,24.8,0.004477,0.002181,0.001624,0.001203,0.001612,0.000654,0.004443,0.002167,0.001616,0.001221,0.001611,0.000472
,2002-10-22T06:52:49Z,SAT007,-18.29,147.39,25,0.004366,0.002236,0.001366,0.001099,0.001525,0.000783,0.004332,0.002222,0.001358,0.001116,0.001523,0.000565
,2002-10-22T07:03:22Z,SAT007,-18.29,147.39,25.2,0.004233,0.002299,0.001591,0.001126,0.001682,0.000903,0.004198,0.002283,0.001582,0.001143,0.00168,0.000652
,2002-10-22T06:54:51Z,SAT007,-18.29,147.39,25.4,0.004639,0.002309,0.001552,0.001101,0.001515,0.00074,0.0046,0.002293,0.001543,0.001118,0.001513,0.000534
,2002-10-22T06:48:22Z,SAT007,-18.29,147.39,25.6,-999,-999,-999,-999,-999,-999,-999,-999,-999,-999,-999,-999
,2002-10-22T06:52:58Z,SAT007,-18.29,147.39,25.8,0.004202,0.002324,0.001366,0.001109,0.001573,0.000662,0.004169,0.002309,0.001358,0.001126,0.001571,0.000478
,2002-10-22T06:52:56Z,SAT007,-18.29,147.39,26,0.004079,0.002123,0.001771,0.001094,0.001573,0.000516,0.004046,0.002109,0.001761,0.00111,0.001571,0.000373
,2002-10-22T06:54:46Z,SAT007,-18.29,147.39,26.2,0.004549,0.002262,0.001546,0.001266,0.001628,0.000688,0.004513,0.002248,0.001537,0.001286,0.001627,0.000497
,2002-10-22T06:54:49Z,SAT007,-18.29,147.39,26.4,0.004749,0.002253,0.001636,0.001139,0.001616,0.000852,0.004711,0.002238,0.001627,0.001157,0.001614,0.000615
,2002-10-22T07:03:24Z,SAT007,-18.29,147.39,26.6,0.004438,0.00224,0.001591,0.001168,0.001773,0.000705,0.004402,0.002225,0.001582,0.001186,0.001771,0.000509
,2002-10-22T07:03:27Z,SAT007,-18.29,147.39,26.8,0.00435,0.00226,0.001698,0.001186,0.001586,0.000748,0.004314,0.002244,0.001688,0.001204,0.001584,0.00054
,2002-10-22T06:54:45Z,SAT007,-18.29,147.39,27,0.004388,0.002312,0.001692,0.001088,0.001714,0.000766,0.004349,0.002296,0.001683,0.001104,0.001712,0.000553
,2002-10-22T06:53:04Z,SAT007,-18.29,147.39,27.2,0.00435,0.002357,0.001433,0.001128,0.001573,0.000817,0.004314,0.002341,0.001426,0.001145,0.001571,0.00059
,2002-10-22T06:54:42Z,SAT007,-18.29,147.39,27.4,0.004497,0.00224,0.001473,0.001143,0.001611,0.000714,0.00446,0.002225,0.001465,0.001161,0.001609,0.000515
,2002-10-22T06:54:44Z,SAT007,-18.29,147.39,27.6,0.004356,0.002295,0.001366,0.001088,0.001527,0.000637,0.00432,0.00228,0.001358,0.001104,0.001525,0.00046
,2002-10-22T06:54:40Z,SAT007,-18.29,147.39,27.8,0.004637,0.002315,0.001557,0.001097,0.001381,0.000774,0.0046,0.002299,0.001549,0.001114,0.001379,0.000559
,2002-10-22T07:03:31Z,SAT007,-18.29,147.39,28,0.004385,0.002214,0.001749,0.001113,0.001595,0.000551,0.004349,0.002199,0.001739,0.00113,0.001593,0.000397
,2002-10-22T06:53:09Z,SAT007,-18.29,147.39,28.2,0.004297,0.002328,0.001344,0.001053,0.001452,0.000637,0.004262,0.002312,0.001336,0.001069,0.00145,0.00046
,2002-10-22T06:53:08Z,SAT007,-18.29,147.39,28.4,0.004386,0.00225,0.001445,0.001138,0.001568,0.000663,0.004349,0.002235,0.001437,0.001155,0.001566,0.000478
,2002-10-22T06:48:38Z,SAT007,-18.29,147.39,28.6,-999,-999,-999,-999,-999,-999,-999,-999,-999,-999,-999,-999
,2002-10-22T06:54:39Z,SAT007,-18.29,147.39,28.8,0.004398,0.002228,0.001479,0.001117,0.001442,0.000903,0.004361,0.002212,0.00147,0.001134,0.00144,0.000652
,2002-10-22T06:53:12Z,SAT007,-18.29,147.39,29,0.004438,0.002211,0.001681,0.001101,0.001697,0.000792,0.004402,0.002196,0.001672,0.001118,0.001694,0.000571
,2002-10-22T07:03:34Z,SAT007,-18.29,147.39,29.2,0.004515,0.00226,0.001653,0.001153,0.001631,0.00074,0.004478,0.002244,0.001644,0.001171,0.001628,0.000534
,2002-10-22T06:53:13Z,SAT007,-18.29,147.39,29.4,0.004304,0.002383,0.001479,0.001146,0.001602,0.000705,0.004268,0.002367,0.00147,0.001163,0.0016,0.000509
,2002-10-22T06:53:14Z,SAT007,-18.29,147.39,29.6,0.004426,0.002328,0.001563,0.001111,0.001574,0.000723,0.00439,0.002312,0.001554,0.001128,0.001571,0.000522
,2002-10-22T07:03:38Z,SAT007,-18.29,147.39,29.8,0.004392,0.002341,0.001496,0.00113,0.00149,0.000645,0.004355,0.002325,0.001487,0.001147,0.001488,0.000466
,2002-10-22T07:03:37Z,SAT007,-18.29,147.39,30,0.004145,0.002211,0.001513,0.00109,0.001618,0.000714,0.00411,0.002196,0.001504,0.001106,0.001616,0.000515
,2002-10-22T07:03:36Z,SAT007,-18.29,147.39,30.2,0.004269,0.002312,0.001603,0.00115,0.001624,0.000757,0.004233,0.002296,0.001593,0.001167,0.001621,0.000546
,2002-10-22T06:53:20Z,SAT007,-18.29,147.39,30.4,0.004286,0.002283,0.001597,0.001123,0.001267,0.000731,0.00425,0.002267,0.001588,0.001139,0.001265,0.000528
,2002-10-22T06:54:29Z,SAT007,-18.29,147.39,30.6,0.004369,0.002312,0.001569,0.001096,0.001686,0.000602,0.004332,0.002296,0.00156,0.001112,0.001684,0.000435
,2002-10-22T06:54:32Z,SAT007,-18.29,147.39,30.8,0.004569,0.002257,0.001704,0.001081,0.00164,0.000731,0.00453,0.002241,0.001694,0.001097,0.001637,0.000528
,2002-10-22T06:54:28Z,SAT007,-18.29,147.39,31,0.004164,0.002293,0.001749,0.001152,0.001578,0.000645,0.004128,0.002277,0.001739,0.001169,0.001575,0.000466
,2002-10-22T06:48:52Z,SAT007,-18.29,147.39,31.2,-999,-999,-999,-999,-999,-999,-999,-999,-999,-999,-999,-999
,2002-10-22T06:53:24Z,SAT007,-18.29,147.39,31.4,0.004616,0.002348,0.001547,0.001117,0.001522,0.000766,0.004577,0.002331,0.001537,0.001134,0.00152,0.000553
,2002-10-22T06:53:27Z,SAT007,-18.29,147.39,31.6,0.004198,0.002371,0.001507,0.001063,0.001561,0.000662,0.004163,0.002354,0.001498,0.001079,0.001559,0.000478
,2002-10-22T06:53:26Z,SAT007,-18.29,147.39,31.8,0.00434,0.002221,0.001631,0.001063,0.001465,0.000705,0.004303,0.002206,0.001621,0.001079,0.001463,0.000509
,2002-10-22T07:03:43Z,SAT007,-18.29,147.39,32,0.00447,0.00229,0.001373,0.001081,0.001489,0.000576,0.004431,0.002273,0.001364,0.001097,0.001486,0.000416
,2002-10-22T06:54:24Z,SAT007,-18.29,147.39,32.2,0.004652,0.002355,0.001665,0.001109,0.001706,0.000723,0.004612,0.002338,0.001655,0.001126,0.001703,0.000522
,2002-10-22T06:48:58Z,SAT007,-18.29,147.39,32.4,-999,-999,-999,-999,-999,-999,-999,-999,-999,-999,-999,-999
,2002-10-22T06:53:30Z,SAT007,-18.29,147.39,32.6,0.004558,0.00227,0.001704,0.001182,0.001586,0.000697,0.004518,0.002254,0.001694,0.0012,0.001584,0.000503
,2002-10-22T06:53:31Z,SAT007,-18.29,147.39,32.8,0.004487,0.002254,0.001535,0.001148,0.001595,0.000576,0.004449,0.002238,0.001526,0.001165,0.001593,0.000416
,2002-10-22T06:54:22Z,SAT007,-18.29,147.39,33,0.004475,0.002293,0.001529,0.001147,0.001542,0.000809,0.004437,0.002277,0.001521,0.001165,0.001539,0.000584
,2002-10-22T06:53:33Z,SAT007,-18.29,147.39,33.2,0.004499,0.002406,0.001737,0.001136,0.001568,0.000783,0.00446,0.002389,0.001727,0.001153,0.001566,0.000565
,2002-10-22T06:53:35Z,SAT007,-18.29,147.39,33.4,0.004163,0.00226,0.001682,0.001157,0.001569,0.000714,0.004128,0.002244,0.001672,0.001174,0.001566,0.000515
,2002-10-22T06:53:36Z,SAT007,-18.29,147.39,33.6,0.004228,0.002357,0.001462,0.001161,0.001674,0.00068,0.004192,0.002341,0.001454,0.001178,0.001671,0.000491
,2002-10-22T06:54:18Z,SAT007,-18.29,147.39,33.8,0.004322,0.002293,0.001541,0.001134,0.001562,0.00055,0.004285,0.002277,0.001532,0.001151,0.001559,0.000397
,2002-10-22T06:53:38Z,SAT007,-18.29,147.39,34,0.004317,0.002448,0.0027,0.00114,0.00167,0.000688,0.004279,0.002431,0.002683,0.001157,0.001667,0.000497
,2002-10-22T07:03:50Z,SAT007,-18.29,147.39,34.2,0.00437,0.002364,0.001423,0.001134,0.001649,0.0008,0.004332,0.002348,0.001414,0.001151,0.001646,0.000578
,2002-10-22T06:54:15Z,SAT007,-18.29,147.39,34.4,0.004417,0.002345,0.001451,0.001142,0.001492,0.000723,0.004379,0.002328,0.001442,0.001159,0.00149,0.000522
,2002-10-22T06:53:40Z,SAT007,-18.29,147.39,34.6,0.004622,0.002248,0.001603,0.001129,0.001606,0.000654,0.004583,0.002232,0.001593,0.001145,0.001603,0.000472
,2002-10-22T07:03:52Z,SAT007,-18.29,147.39,34.8,0.004245,0.002269,0.001445,0.001161,0.001791,0.000688,0.004209,0.002254,0.001437,0.001178,0.001788,0.000497
,2002-10-22T06:54:05Z,SAT007,-18.29,147.39,35,0.004358,0.002276,0.001491,0.0012,0.001553,0.000551,0.00432,0.002261,0.001481,0.001217,0.00155,0.000397
,2002-10-22T06:53:50Z,SAT007,-18.29,147.39,35.2,0.004011,0.002374,0.001609,0.001092,0.001626,0.000499,0.003976,0.002357,0.001599,0.001108,0.001623,0.00036
,2002-10-22T06:53:54Z,SAT007,-18.29,147.39,35.4,0.004381,0.002264,0.00153,0.001133,0.001587,0.000499,0.004344,0.002248,0.001521,0.001149,0.001584,0.00036
,2002-10-22T06:53:51Z,SAT007,-18.29,147.39,35.6,0.004511,0.002387,0.00153,0.00115,0.001647,0.000516,0.004472,0.00237,0.001521,0.001167,0.001644,0.000373
,2002-10-22T06:49:16Z,SAT007,-18.29,147.39,35.8,-999,-999,-999,-999,-999,-999,-999,-999,-999,-999,-999,-999
,2002-10-22T07:03:56Z,SAT007,-18.29,147.39,36,0.004346,0.002341,0.001642,0.001178,0.001699,0.000774,0.004309,0.002325,0.001632,0.001196,0.001696,0.000559
,2002-10-22T07:03:57Z,SAT007,-18.29,147.39,36.2,0.004404,0.002315,0.001856,0.001177,0.001759,0.000654,0.004367,0.002299,0.001845,0.001194,0.001756,0.000472
,2002-10-22T06:49:19Z,SAT007,-18.29,147.39,36.4,-999,-999,-999,-999,-999,-999,-999,-999,-999,-999,-999,-999
,2002-10-22T07:03:58Z,SAT007,-18.29,147.39,36.6,0.004399,0.002335,0.001473,0.001163,0.001649,0.000791,0.004361,0.002319,0.001465,0.00118,0.001646,0.000571
,2002-10-22T06:49:21Z,SAT007,-18.29,147.39,36.8,-999,-999,-999,-999,-999,-999,-999,-999,-999,-999,-999,-999
,2002-10-22T06:49:22Z,SAT007,-18.29,147.39,37,-999,-999,-999,-999,-999,-999,-999,-999,-999,-999,-999,-999
,2002-10-22T07:03:59Z,SAT007,-18.29,147.39,37.2,0.004522,0.002357,0.001591,0.001125,0.001599,0.000748,0.004483,0.002341,0.001582,0.001141,0.001596,0.00054
,2002-10-22T06:49:24Z,SAT007,-18.29,147.39,37.4,-999,-999,-999,-999,-999,-999,-999,-999,-999,-999,-999,-999
,2002-10-22T06:49:25Z,SAT007,-18.29,147.39,37.6,-999,-999,-999,-999,-999,-999,-999,-999,-999,-999,-999,-999
,2002-10-22T06:49:26Z,SAT007,-18.29,147.39,37.8,-999,-999,-999,-999,-999,-999,-999,-999,-999,-999,-999,-999
,2002-10-22T06:49:27Z,SAT007,-18.29,147.39,38,-999,-999,-999,-999,-999,-999,-999,-999,-999,-999,-999,-999
,2002-10-22T06:49:29Z,SAT007,-18.29,147.39,38.2,-999,-999,-999,-999,-999,-999,-999,-999,-999,-999,-999,-999
,2002-10-22T06:49:30Z,SAT007,-18.29,147.39,38.4,-999,-999,-999,-999,-999,-999,-999,-999,-999,-999,-999,-999
,2002-10-22T06:49:31Z,SAT007,-18.29,147.39,38.6,-999,-999,-999,-999,-999,-999,-999,-999,-999,-999,-999,-999
,2002-10-22T06:49:32Z,SAT007,-18.29,147.39,38.8,-999,-999,-999,-999,-999,-999,-999,-999,-999,-999,-999,-999
,2002-10-22T06:49:33Z,SAT007,-18.29,147.39,39,-999,-999,-999,-999,-999,-999,-999,-999,-999,-999,-999,-999
,2002-10-22T06:49:34Z,SAT007,-18.29,147.39,39.2,-999,-999,-999,-999,-999,-999,-999,-999,-999,-999,-999,-999
,2002-10-22T06:49:35Z,SAT007,-18.29,147.39,39.4,-999,-999,-999,-999,-999,-999,-999,-999,-999,-999,-999,-999
,2002-10-22T06:49:36Z,SAT007,-18.29,147.39,39.6,-999,-999,-999,-999,-999,-999,-999,-999,-999,-999,-999,-999
,2002-10-22T06:49:37Z,SAT007,-18.29,147.39,39.8,-999,-999,-999,-999,-999,-999,-999,-999,-999,-999,-999,-999
,2002-10-22T06:49:38Z,SAT007,-18.29,147.39,40,-999,-999,-999,-999,-999,-999,-999,-999,-999,-999,-999,-999
,2002-10-22T06:49:39Z,SAT007,-18.29,147.39,40.2,-999,-999,-999,-999,-999,-999,-999,-999,-999,-999,-999,-999
,2002-10-22T06:49:40Z,SAT007,-18.29,147.39,40.4,-999,-999,-999,-999,-999,-999,-999,-999,-999,-999,-999,-999
,2002-10-22T06:49:42Z,SAT007,-18.29,147.39,40.6,-999,-999,-999,-999,-999,-999,-999,-999,-999,-999,-999,-999
,2002-10-22T06:49:43Z,SAT007,-18.29,147.39,40.8,-999,-999,-999,-999,-999,-999,-999,-999,-999,-999,-999,-999
,2002-10-22T06:49:44Z,SAT007,-18.29,147.39,41,-999,-999,-999,-999,-999,-999,-999,-999,-999,-999,-999,-999
,2002-10-22T06:49:45Z,SAT007,-18.29,147.39,41.2,-999,-999,-999,-999,-999,-999,-999,-999,-999,-999,-999,-999
,2002-10-22T06:49:46Z,SAT007,-18.29,147.39,41.4,-999,-999,-999,-999,-999,-999,-999,-999,-999,-999,-999,-999
,2002-10-22T06:49:47Z,SAT007,-18.29,147.39,41.6,-999,-999,-999,-999,-999,-999,-999,-999,-999,-999,-999,-999
,2002-10-22T06:49:48Z,SAT007,-18.29,147.39,41.8,-999,-999,-999,-999,-999,-999,-999,-999,-999,-999,-999,-999
,2002-10-22T06:49:49Z,SAT007,-18.29,147.39,42,-999,-999,-999,-999,-999,-999,-999,-999,-999,-999,-999,-999
,2002-10-22T06:49:50Z,SAT007,-18.29,147.39,42.2,-999,-999,-999,-999,-999,-999,-999,-999,-999,-999,-999,-999
,2002-10-22T06:49:51Z,SAT007,-18.29,147.39,42.4,-999,-999,-999,-999,-999,-999,-999,-999,-999,-999,-999,-999
,2002-10-22T06:49:52Z,SAT007,-18.29,147.39,42.6,-999,-999,-999,-999,-999,-999,-999,-999,-999,-999,-999,-999
,2002-10-22T06:49:53Z,SAT007,-18.29,147.39,42.8,-999,-999,-999,-999,-999,-999,-999,-999,-999,-999,-999,-999
,2002-10-22T06:49:54Z,SAT007,-18.29,147.39,43,-999,-999,-999,-999,-999,-999,-999,-999,-999,-999,-999,-999
,2002-10-22T06:49:55Z,SAT007,-18.29,147.39,43.2,-999,-999,-999,-999,-999,-999,-999,-999,-999,-999,-999,-999
,2002-10-22T06:49:56Z,SAT007,-18.29,147.39,43.4,-999,-999,-999,-999,-999,-999,-999,-999,-999,-999,-999,-999
,2002-10-22T06:49:57Z,SAT007,-18.29,147.39,43.6,-999,-999,-999,-999,-999,-999,-999,-999,-999,-999,-999,-999
,2002-10-22T06:49:58Z,SAT007,-18.29,147.39,43.8,-999,-999,-999,-999,-999,-999,-999,-999,-999,-999,-999,-999
,2002-10-22T06:49:59Z,SAT007,-18.29,147.39,44,-999,-999,-999,-999,-999,-999,-999,-999,-999,-999,-999,-999
,2002-10-22T06:50:00Z,SAT007,-18.29,147.39,44.2,-999,-999,-999,-999,-999,-999,-999,-999,-999,-999,-999,-999
,2002-10-22T06:50:01Z,SAT007,-18.29,147.39,44.4,-999,-999,-999,-999,-999,-999,-999,-999,-999,-999,-999,-999
,2002-10-22T06:50:02Z,SAT007,-18.29,147.39,44.6,-999,-999,-999,-999,-999,-999,-999,-999,-999,-999,-999,-999
,2002-10-22T06:50:03Z,SAT007,-18.29,147.39,44.8,-999,-999,-999,-999,-999,-999,-999,-999,-999,-999,-999,-999
,2002-10-22T06:50:04Z,SAT007,-18.29,147.39,45,-999,-999,-999,-999,-999,-999,-999,-999,-999,-999,-999,-999
,2002-10-22T06:50:05Z,SAT007,-18.29,147.39,45.2,-999,-999,-999,-999,-999,-999,-999,-999,-999,-999,-999,-999
,2002-10-22T06:50:07Z,SAT007,-18.29,147.39,45.4,-999,-999,-999,-999,-999,-999,-999,-999,-999,-999,-999,-999
,2002-10-22T06:50:08Z,SAT007,-18.29,147.39,45.6,-999,-999,-999,-999,-999,-999,-999,-999,-999,-999,-999,-999
,2002-10-22T06:50:10Z,SAT007,-18.29,147.39,45.8,-999,-999,-999,-999,-999,-999,-999,-999,-999,-999,-999,-999
,2002-10-22T06:50:11Z,SAT007,-18.29,147.39,46,-999,-999,-999,-999,-999,-999,-999,-999,-999,-999,-999,-999
,2002-10-22T06:50:12Z,SAT007,-18.29,147.39,46.2,-999,-999,-999,-999,-999,-999,-999,-999,-999,-999,-999,-999
,2002-10-22T06:50:13Z,SAT007,-18.29,147.39,46.4,-999,-999,-999,-999,-999,-999,-999,-999,-999,-999,-999,-999
,2002-10-22T06:50:16Z,SAT007,-18.29,147.39,46.6,-999,-999,-999,-999,-999,-999,-999,-999,-999,-999,-999,-999
,2002-10-22T06:50:18Z,SAT007,-18.29,147.39,46.8,-999,-999,-999,-999,-999,-999,-999,-999,-999,-999,-999,-999
,2002-10-22T06:50:19Z,SAT007,-18.29,147.39,47,-999,-999,-999,-999,-999,-999,-999,-999,-999,-999,-999,-999
,2002-10-22T06:50:23Z,SAT007,-18.29,147.39,47.2,-999,-999,-999,-999,-999,-999,-999,-999,-999,-999,-999,-999
,2002-10-22T06:50:24Z,SAT007,-18.29,147.39,47.4,-999,-999,-999,-999,-999,-999,-999,-999,-999,-999,-999,-999
,2002-10-22T06:50:25Z,SAT007,-18.29,147.39,47.6,-999,-999,-999,-999,-999,-999,-999,-999,-999,-999,-999,-999
,2002-10-22T06:50:28Z,SAT007,-18.29,147.39,47.8,-999,-999,-999,-999,-999,-999,-999,-999,-999,-999,-999,-999
,2002-10-22T06:50:29Z,SAT007,-18.29,147.39,48,-999,-999,-999,-999,-999,-999,-999,-999,-999,-999,-999,-999
,2002-10-22T06:50:30Z,SAT007,-18.29,147.39,48.2,-999,-999,-999,-999,-999,-999,-999,-999,-999,-999,-999,-999
,2002-10-22T06:50:31Z,SAT007,-18.29,147.39,48.4,-999,-999,-999,-999,-999,-999,-999,-999,-999,-999,-999,-999
,2002-10-22T06:50:32Z,SAT007,-18.29,147.39,48.6,-999,-999,-999,-999,-999,-999,-999,-999,-999,-999,-999,-999
,2002-10-22T06:50:34Z,SAT007,-18.29,147.39,48.8,-999,-999,-999,-999,-999,-999,-999,-999,-999,-999,-999,-999
,2002-10-22T06:50:35Z,SAT007,-18.29,147.39,49,-999,-999,-999,-999,-999,-999,-999,-999,-999,-999,-999,-999
,2002-10-22T06:50:36Z,SAT007,-18.29,147.39,49.2,-999,-999,-999,-999,-999,-999,-999,-999,-999,-999,-999,-999
,2002-10-22T06:50:38Z,SAT007,-18.29,147.39,49.4,-999,-999,-999,-999,-999,-999,-999,-999,-999,-999,-999,-999
,2002-10-22T06:50:41Z,SAT007,-18.29,147.39,49.6,-999,-999,-999,-999,-999,-999,-999,-999,-999,-999,-999,-999
,2002-10-22T06:50:42Z,SAT007,-18.29,147.39,49.8,-999,-999,-999,-999,-999,-999,-999,-999,-999,-999,-999,-999
,2002-10-22T06:50:43Z,SAT007,-18.29,147.39,50,-999,-999,-999,-999,-999,-999,-999,-999,-999,-999,-999,-999
,2002-10-22T06:50:45Z,SAT007,-18.29,147.39,50.2,-999,-999,-999,-999,-999,-999,-999,-999,-999,-999,-999,-999
,2002-10-22T06:50:46Z,SAT007,-18.29,147.39,50.4,-999,-999,-999,-999,-999,-999,-999,-999,-999,-999,-999,-999
,2002-10-22T06:50:47Z,SAT007,-18.29,147.39,50.6,-999,-999,-999,-999,-999,-999,-999,-999,-999,-999,-999,-999
,2002-10-22T06:50:48Z,SAT007,-18.29,147.39,50.8,-999,-999,-999,-999,-999,-999,-999,-999,-999,-999,-999,-999
,2002-10-22T06:50:49Z,SAT007,-18.29,147.39,51,-999,-999,-999,-999,-999,-999,-999,-999,-999,-999,-999,-999
,2002-10-22T06:50:50Z,SAT007,-18.29,147.39,51.2,-999,-999,-999,-999,-999,-999,-999,-999,-999,-999,-999,-999
,2002-10-22T06:50:51Z,SAT007,-18.29,147.39,51.4,-999,-999,-999,-999,-999,-999,-999,-999,-999,-999,-999,-999
,2002-10-22T06:50:52Z,SAT007,-18.29,147.39,51.6,-999,-999,-999,-999,-999,-999,-999,-999,-999,-999,-999,-999
,2002-10-22T06:50:53Z,SAT007,-18.29,147.39,51.8,-999,-999,-999,-999,-999,-999,-999,-999,-999,-999,-999,-999
,2002-10-22T06:50:54Z,SAT007,-18.29,147.39,52,-999,-999,-999,-999,-999,-999,-999,-999,-999,-999,-999,-999
,2002-10-22T06:50:55Z,SAT007,-18.29,147.39,52.2,-999,-999,-999,-999,-999,-999,-999,-999,-999,-999,-999,-999
,2002-10-22T06:50:56Z,SAT007,-18.29,147.39,52.4,-999,-999,-999,-999,-999,-999,-999,-999,-999,-999,-999,-999
,2002-10-22T06:50:57Z,SAT007,-18.29,147.39,52.6,-999,-999,-999,-999,-999,-999,-999,-999,-999,-999,-999,-999
,2002-10-22T06:50:58Z,SAT007,-18.29,147.39,52.8,-999,-999,-999,-999,-999,-999,-999,-999,-999,-999,-999,-999
,2002-10-22T06:50:59Z,SAT007,-18.29,147.39,53,-999,-999,-999,-999,-999,-999,-999,-999,-999,-999,-999,-999
,2002-10-22T06:51:00Z,SAT007,-18.29,147.39,53.2,-999,-999,-999,-999,-999,-999,-999,-999,-999,-999,-999,-999
,2002-10-22T06:51:01Z,SAT007,-18.29,147.39,53.4,-999,-999,-999,-999,-999,-999,-999,-999,-999,-999,-999,-999
,2002-10-22T06:51:02Z,SAT007,-18.29,147.39,53.6,-999,-999,-999,-999,-999,-999,-999,-999,-999,-999,-999,-999
,2002-10-22T06:51:03Z,SAT007,-18.29,147.39,53.8,-999,-999,-999,-999,-999,-999,-999,-999,-999,-999,-999,-999
,2002-10-22T06:51:04Z,SAT007,-18.29,147.39,54,-999,-999,-999,-999,-999,-999,-999,-999,-999,-999,-999,-999
,2002-10-22T06:51:05Z,SAT007,-18.29,147.39,54.2,-999,-999,-999,-999,-999,-999,-999,-999,-999,-999,-999,-999
,2002-10-22T06:51:06Z,SAT007,-18.29,147.39,54.4,-999,-999,-999,-999,-999,-999,-999,-999,-999,-999,-999,-999
,2002-10-22T06:51:07Z,SAT007,-18.29,147.39,54.6,-999,-999,-999,-999,-999,-999,-999,-999,-999,-999,-999,-999
,2002-10-22T06:51:08Z,SAT007,-18.29,147.39,54.8,-999,-999,-999,-999,-999,-999,-999,-999,-999,-999,-999,-999
,2002-10-22T06:51:11Z,SAT007,-18.29,147.39,55,-999,-999,-999,-999,-999,-999,-999,-999,-999,-999,-999,-999
,2002-10-22T06:51:12Z,SAT007,-18.29,147.39,55.2,-999,-999,-999,-999,-999,-999,-999,-999,-999,-999,-999,-999
,2002-10-22T06:51:13Z,SAT007,-18.29,147.39,55.4,-999,-999,-999,-999,-999,-999,-999,-999,-999,-999,-999,-999
,2002-10-22T06:51:14Z,SAT007,-18.29,147.39,55.6,-999,-999,-999,-999,-999,-999,-999,-999,-999,-999,-999,-999
,2002-10-22T06:51:15Z,SAT007,-18.29,147.39,55.8,-999,-999,-999,-999,-999,-999,-999,-999,-999,-999,-999,-999
,2002-10-22T06:51:16Z,SAT007,-18.29,147.39,56,-999,-999,-999,-999,-999,-999,-999,-999,-999,-999,-999,-999
,2002-10-22T06:51:17Z,SAT007,-18.29,147.39,56.2,-999,-999,-999,-999,-999,-999,-999,-999,-999,-999,-999,-999
,2002-10-22T06:51:18Z,SAT007,-18.29,147.39,56.4,-999,-999,-999,-999,-999,-999,-999,-999,-999,-999,-999,-999
,2002-10-22T06:51:19Z,SAT007,-18.29,147.39,56.6,-999,-999,-999,-999,-999,-999,-999,-999,-999,-999,-999,-999
,2002-10-22T06:51:20Z,SAT007,-18.29,147.39,56.8,-999,-999,-999,-999,-999,-999,-999,-999,-999,-999,-999,-999
,2002-10-22T06:51:21Z,SAT007,-18.29,147.39,57,-999,-999,-999,-999,-999,-999,-999,-999,-999,-999,-999,-999
,2002-10-22T06:51:22Z,SAT007,-18.29,147.39,57.2,-999,-999,-999,-999,-999,-999,-999,-999,-999,-999,-999,-999
,2002-10-22T06:51:23Z,SAT007,-18.29,147.39,57.4,-999,-999,-999,-999,-999,-999,-999,-999,-999,-999,-999,-999
,2002-10-22T06:51:24Z,SAT007,-18.29,147.39,57.6,-999,-999,-999,-999,-999,-999,-999,-999,-999,-999,-999,-999
,2002-10-22T06:51:25Z,SAT007,-18.29,147.39,57.8,-999,-999,-999,-999,-999,-999,-999,-999,-999,-999,-999,-999
,2002-10-22T06:51:26Z,SAT007,-18.29,147.39,58,-999,-999,-999,-999,-999,-999,-999,-999,-999,-999,-999,-999
,2002-10-22T06:51:27Z,SAT007,-18.29,147.39,58.2,-999,-999,-999,-999,-999,-999,-999,-999,-999,-999,-999,-999
,2002-10-22T06:51:28Z,SAT007,-18.29,147.39,58.4,-999,-999,-999,-999,-999,-999,-999,-999,-999,-999,-999,-999
,2002-10-22T06:51:29Z,SAT007,-18.29,147.39,58.6,-999,-999,-999,-999,-999,-999,-999,-999,-999,-999,-999,-999
,2002-10-22T06:51:30Z,SAT007,-18.29,147.39,58.8,-999,-999,-999,-999,-999,-999,-999,-999,-999,-999,-999,-999
,2002-10-22T06:51:31Z,SAT007,-18.29,147.39,59,-999,-999,-999,-999,-999,-999,-999,-999,-999,-999,-999,-999
,2002-10-22T06:51:32Z,SAT007,-18.29,147.39,59.2,-999,-999,-999,-999,-999,-999,-999,-999,-999,-999,-999,-999
,2002-10-22T06:51:33Z,SAT007,-18.29,147.39,59.4,-999,-999,-999,-999,-999,-999,-999,-999,-999,-999,-999,-999
,2002-10-22T06:51:34Z,SAT007,-18.29,147.39,59.6,-999,-999,-999,-999,-999,-999,-999,-999,-999,-999,-999,-999
,2002-10-22T06:51:36Z,SAT007,-18.29,147.39,59.8,-999,-999,-999,-999,-999,-999,-999,-999,-999,-999,-999,-999
,2002-10-22T06:51:37Z,SAT007,-18.29,147.39,60,-999,-999,-999,-999,-999,-999,-999,-999,-999,-999,-999,-999
,2002-10-22T06:51:38Z,SAT007,-18.29,147.39,60.2,-999,-999,-999,-999,-999,-999,-999,-999,-999,-999,-999,-999
,2002-10-22T06:51:39Z,SAT007,-18.29,147.39,60.4,-999,-999,-999,-999,-999,-999,-999,-999,-999,-999,-999,-999
,2002-10-22T06:51:40Z,SAT007,-18.29,147.39,60.6,-999,-999,-999,-999,-999,-999,-999,-999,-999,-999,-999,-999
,2002-10-22T06:51:41Z,SAT007,-18.29,147.39,60.8,-999,-999,-999,-999,-999,-999,-999,-999,-999,-999,-999,-999
,2002-10-22T06:51:42Z,SAT007,-18.29,147.39,61,-999,-999,-999,-999,-999,-999,-999,-999,-999,-999,-999,-999
,2002-10-22T06:51:43Z,SAT007,-18.29,147.39,61.2,-999,-999,-999,-999,-999,-999,-999,-999,-999,-999,-999,-999
,2002-10-22T06:51:44Z,SAT007,-18.29,147.39,61.4,-999,-999,-999,-999,-999,-999,-999,-999,-999,-999,-999,-999
,2002-10-22T06:51:45Z,SAT007,-18.29,147.39,61.6,-999,-999,-999,-999,-999,-999,-999,-999,-999,-999,-999,-999
,2002-10-22T06:51:46Z,SAT007,-18.29,147.39,61.8,-999,-999,-999,-999,-999,-999,-999,-999,-999,-999,-999,-999
,2002-10-22T06:51:47Z,SAT007,-18.29,147.39,62,-999,-999,-999,-999,-999,-999,-999,-999,-999,-999,-999,-999
,2002-10-22T06:51:48Z,SAT007,-18.29,147.39,62.2,-999,-999,-999,-999,-999,-999,-999,-999,-999,-999,-999,-999
,2002-10-22T06:51:49Z,SAT007,-18.29,147.39,62.4,-999,-999,-999,-999,-999,-999,-999,-999,-999,-999,-999,-999
,2002-10-22T06:51:50Z,SAT007,-18.29,147.39,62.6,-999,-999,-999,-999,-999,-999,-999,-999,-999,-999,-999,-999
,2002-10-22T06:51:51Z,SAT007,-18.29,147.39,62.8,-999,-999,-999,-999,-999,-999,-999,-999,-999,-999,-999,-999
,2002-10-22T06:51:52Z,SAT007,-18.29,147.39,63,-999,-999,-999,-999,-999,-999,-999,-999,-999,-999,-999,-999
,2002-10-22T06:51:53Z,SAT007,-18.29,147.39,63.2,-999,-999,-999,-999,-999,-999,-999,-999,-999,-999,-999,-999
,2002-10-22T06:51:54Z,SAT007,-18.29,147.39,63.4,-999,-999,-999,-999,-999,-999,-999,-999,-999,-999,-999,-999
,2002-10-22T06:51:55Z,SAT007,-18.29,147.39,63.6,-999,-999,-999,-999,-999,-999,-999,-999,-999,-999,-999,-999
,2002-10-22T06:51:56Z,SAT007,-18.29,147.39,63.8,-999,-999,-999,-999,-999,-999,-999,-999,-999,-999,-999,-999
,2002-10-22T06:51:57Z,SAT007,-18.29,147.39,64,-999,-999,-999,-999,-999,-999,-999,-999,-999,-999,-999,-999
,2002-10-22T06:51:58Z,SAT007,-18.29,147.39,64.2,-999,-999,-999,-999,-999,-999,-999,-999,-999,-999,-999,-999
,2002-10-22T06:51:59Z,SAT007,-18.29,147.39,64.4,-999,-999,-999,-999,-999,-999,-999,-999,-999,-999,-999,-999
,2002-10-22T06:52:01Z,SAT007,-18.29,147.39,64.6,-999,-999,-999,-999,-999,-999,-999,-999,-999,-999,-999,-999
,2002-10-22T06:52:02Z,SAT007,-18.29,147.39,64.8,-999,-999,-999,-999,-999,-999,-999,-999,-999,-999,-999,-999
,2002-10-22T06:52:03Z,SAT007,-18.29,147.39,65,-999,-999,-999,-999,-999,-999,-999,-999,-999,-999,-999,-999
,2002-10-22T06:52:04Z,SAT007,-18.29,147.39,65.2,-999,-999,-999,-999,-999,-999,-999,-999,-999,-999,-999,-999
,2002-10-22T06:52:05Z,SAT007,-18.29,147.39,65.4,-999,-999,-999,-999,-999,-999,-999,-999,-999,-999,-999,-999
,2002-10-22T06:52:06Z,SAT007,-18.29,147.39,65.6,-999,-999,-999,-999,-999,-999,-999,-999,-999,-999,-999,-999
,2002-10-22T06:52:07Z,SAT007,-18.29,147.39,65.8,-999,-999,-999,-999,-999,-999,-999,-999,-999,-999,-999,-999
,2002-10-22T06:52:08Z,SAT007,-18.29,147.39,66,-999,-999,-999,-999,-999,-999,-999,-999,-999,-999,-999,-999
,2002-10-22T06:52:09Z,SAT007,-18.29,147.39,66.2,-999,-999,-999,-999,-999,-999,-999,-999,-999,-999,-999,-999
,2002-10-22T06:52:10Z,SAT007,-18.29,147.39,66.4,-999,-999,-999,-999,-999,-999,-999,-999,-999,-999,-999,-999
,2002-10-22T06:52:11Z,SAT007,-18.29,147.39,66.6,-999,-999,-999,-999,-999,-999,-999,-999,-999,-999,-999,-999
,2002-10-22T06:52:12Z,SAT007,-18.29,147.39,66.8,-999,-999,-999,-999,-999,-999,-999,-999,-999,-999,-999,-999
,2002-10-22T06:52:13Z,SAT007,-18.29,147.39,67,-999,-999,-999,-999,-999,-999,-999,-999,-999,-999,-999,-999
,2002-10-22T06:52:14Z,SAT007,-18.29,147.39,67.2,-999,-999,-999,-999,-999,-999,-999,-999,-999,-999,-999,-999
,2002-10-22T06:52:15Z,SAT007,-18.29,147.39,67.4,-999,-999,-999,-999,-999,-999,-999,-999,-999,-999,-999,-999
,2002-10-22T06:52:16Z,SAT007,-18.29,147.39,67.6,-999,-999,-999,-999,-999,-999,-999,-999,-999,-999,-999,-999
,2002-10-22T06:52:17Z,SAT007,-18.29,147.39,67.8,-999,-999,-999,-999,-999,-999,-999,-999,-999,-999,-999,-999
,2002-10-22T06:52:18Z,SAT007,-18.29,147.39,68,-999,-999,-999,-999,-999,-999,-999,-999,-999,-999,-999,-999
,2002-10-22T06:52:19Z,SAT007,-18.29,147.39,68.2,-999,-999,-999,-999,-999,-999,-999,-999,-999,-999,-999,-999
,2002-10-22T06:52:20Z,SAT007,-18.29,147.39,68.4,-999,-999,-999,-999,-999,-999,-999,-999,-999,-999,-999,-999
,2002-10-22T06:52:21Z,SAT007,-18.29,147.39,68.6,-999,-999,-999,-999,-999,-999,-999,-999,-999,-999,-999,-999
,2002-10-22T06:52:22Z,SAT007,-18.29,147.39,68.8,-999,-999,-999,-999,-999,-999,-999,-999,-999,-999,-999,-999
,2002-10-22T06:52:23Z,SAT007,-18.29,147.39,69,-999,-999,-999,-999,-999,-999,-999,-999,-999,-999,-999,-999
,2002-10-22T06:52:25Z,SAT007,-18.29,147.39,69.2,-999,-999,-999,-999,-999,-999,-999,-999,-999,-999,-999,-999
,2002-10-22T06:52:26Z,SAT007,-18.29,147.39,69.4,-999,-999,-999,-999,-999,-999,-999,-999,-999,-999,-999,-999
,2002-10-22T06:52:27Z,SAT007,-18.29,147.39,69.6,-999,-999,-999,-999,-999,-999,-999,-999,-999,-999,-999,-999
,2002-10-22T06:52:28Z,SAT007,-18.29,147.39,69.8,-999,-999,-999,-999,-999,-999,-999,-999,-999,-999,-999,-999
,2002-10-22T06:52:29Z,SAT007,-18.29,147.39,70,-999,-999,-999,-999,-999,-999,-999,-999,-999,-999,-999,-999
,2002-10-22T06:52:30Z,SAT007,-18.29,147.39,70.2,-999,-999,-999,-999,-999,-999,-999,-999,-999,-999,-999,-999
,2002-10-22T06:52:31Z,SAT007,-18.29,147.39,70.4,-999,-999,-999,-999,-999,-999,-999,-999,-999,-999,-999,-999
,2002-10-22T06:52:32Z,SAT007,-18.29,147.39,70.6,-999,-999,-999,-999,-999,-999,-999,-999,-999,-999,-999,-999
,2002-10-22T06:52:33Z,SAT007,-18.29,147.39,70.8,-999,-999,-999,-999,-999,-999,-999,-999,-999,-999,-999,-999
,2002-10-22T06:52:34Z,SAT007,-18.29,147.39,71,-999,-999,-999,-999,-999,-999,-999,-999,-999,-999,-999,-999
,2002-10-22T06:52:35Z,SAT007,-18.29,147.39,71.2,-999,-999,-999,-999,-999,-999,-999,-999,-999,-999,-999,-999
,2002-10-22T06:52:36Z,SAT007,-18.29,147.39,71.4,-999,-999,-999,-999,-999,-999,-999,-999,-999,-999,-999,-999
,2002-10-22T06:52:37Z,SAT007,-18.29,147.39,71.6,-999,-999,-999,-999,-999,-999,-999,-999,-999,-999,-999,-999
,2002-10-22T06:52:38Z,SAT007,-18.29,147.39,71.8,-999,-999,-999,-999,-999,-999,-999,-999,-999,-999,-999,-999
,2002-10-22T06:52:39Z,SAT007,-18.29,147.39,72,-999,-999,-999,-999,-999,-999,-999,-999,-999,-999,-999,-999
,2002-10-22T06:52:40Z,SAT007,-18.29,147.39,72.2,-999,-999,-999,-999,-999,-999,-999,-999,-999,-999,-999,-999
,2002-10-22T06:52:41Z,SAT007,-18.29,147.39,72.4,-999,-999,-999,-999,-999,-999,-999,-999,-999,-999,-999,-999
,2002-10-22T06:52:42Z,SAT007,-18.29,147.39,72.6,-999,-999,-999,-999,-999,-999,-999,-999,-999,-999,-999,-999
,2002-10-22T06:52:43Z,SAT007,-18.29,147.39,72.8,-999,-999,-999,-999,-999,-999,-999,-999,-999,-999,-999,-999
,2002-10-22T06:52:44Z,SAT007,-18.29,147.39,73,-999,-999,-999,-999,-999,-999,-999,-999,-999,-999,-999,-999
,2002-10-22T06:52:45Z,SAT007,-18.29,147.39,73.2,-999,-999,-999,-999,-999,-999,-999,-999,-999,-999,-999,-999
,2002-10-22T06:52:46Z,SAT007,-18.29,147.39,73.4,-999,-999,-999,-999,-999,-999,-999,-999,-999,-999,-999,-999
,2002-10-22T06:52:47Z,SAT007,-18.29,147.39,73.6,-999,-999,-999,-999,-999,-999,-999,-999,-999,-999,-999,-999
,2002-10-22T06:52:48Z,SAT007,-18.29,147.39,73.8,-999,-999,-999,-999,-999,-999,-999,-999,-999,-999,-999,-999
,2002-10-22T06:52:50Z,SAT007,-18.29,147.39,74,-999,-999,-999,-999,-999,-999,-999,-999,-999,-999,-999,-999
,2002-10-22T06:52:51Z,SAT007,-18.29,147.39,74.2,-999,-999,-999,-999,-999,-999,-999,-999,-999,-999,-999,-999
,2002-10-22T06:52:52Z,SAT007,-18.29,147.39,74.4,-999,-999,-999,-999,-999,-999,-999,-999,-999,-999,-999,-999
,2002-10-22T06:52:53Z,SAT007,-18.29,147.39,74.6,-999,-999,-999,-999,-999,-999,-999,-999,-999,-999,-999,-999
,2002-10-22T06:52:54Z,SAT007,-18.29,147.39,74.8,-999,-999,-999,-999,-999,-999,-999,-999,-999,-999,-999,-999
,2002-10-22T06:52:55Z,SAT007,-18.29,147.39,75,-999,-999,-999,-999,-999,-999,-999,-999,-999,-999,-999,-999
,2002-10-22T06:52:56Z,SAT007,-18.29,147.39,75.2,-999,-999,-999,-999,-999,-999,-999,-999,-999,-999,-999,-999
,2002-10-22T06:52:57Z,SAT007,-18.29,147.39,75.4,-999,-999,-999,-999,-999,-999,-999,-999,-999,-999,-999,-999
,2002-10-22T06:52:58Z,SAT007,-18.29,147.39,75.6,-999,-999,-999,-999,-999,-999,-999,-999,-999,-999,-999,-999
,2002-10-22T06:52:59Z,SAT007,-18.29,147.39,75.8,-999,-999,-999,-999,-999,-999,-999,-999,-999,-999,-999,-999
,2002-10-22T06:53:00Z,SAT007,-18.29,147.39,76,-999,-999,-999,-999,-999,-999,-999,-999,-999,-999,-999,-999
,2002-10-22T06:53:01Z,SAT007,-18.29,147.39,76.2,-999,-999,-999,-999,-999,-999,-999,-999,-999,-999,-999,-999
,2002-10-22T06:53:02Z,SAT007,-18.29,147.39,76.4,-999,-999,-999,-999,-999,-999,-999,-999,-999,-999,-999,-999
,2002-10-22T06:53:03Z,SAT007,-18.29,147.39,76.6,-999,-999,-999,-999,-999,-999,-999,-999,-999,-999,-999,-999
,2002-10-22T06:53:04Z,SAT007,-18.29,147.39,76.8,-999,-999,-999,-999,-999,-999,-999,-999,-999,-999,-999,-999
,2002-10-22T06:53:05Z,SAT007,-18.29,147.39,77,-999,-999,-999,-999,-999,-999,-999,-999,-999,-999,-999,-999
,2002-10-22T06:53:06Z,SAT007,-18.29,147.39,77.2,-999,-999,-999,-999,-999,-999,-999,-999,-999,-999,-999,-999
,2002-10-22T06:53:07Z,SAT007,-18.29,147.39,77.4,-999,-999,-999,-999,-999,-999,-999,-999,-999,-999,-999,-999
,2002-10-22T06:53:08Z,SAT007,-18.29,147.39,77.6,-999,-999,-999,-999,-999,-999,-999,-999,-999,-999,-999,-999
,2002-10-22T06:53:09Z,SAT007,-18.29,147.39,77.8,-999,-999,-999,-999,-999,-999,-999,-999,-999,-999,-999,-999
,2002-10-22T06:53:10Z,SAT007,-18.29,147.39,78,-999,-999,-999,-999,-999,-999,-999,-999,-999,-999,-999,-999
,2002-10-22T06:53:11Z,SAT007,-18.29,147.39,78.2,-999,-999,-999,-999,-999,-999,-999,-999,-999,-999,-999,-999
,2002-10-22T06:53:12Z,SAT007,-18.29,147.39,78.4,-999,-999,-999,-999,-999,-999,-999,-999,-999,-999,-999,-999
,2002-10-22T06:53:13Z,SAT007,-18.29,147.39,78.6,-999,-999,-999,-999,-999,-999,-999,-999,-999,-999,-999,-999
,2002-10-22T06:53:15Z,SAT007,-18.29,147.39,78.8,-999,-999,-999,-999,-999,-999,-999,-999,-999,-999,-999,-999
,2002-10-22T06:53:16Z,SAT007,-18.29,147.39,79,-999,-999,-999,-999,-999,-999,-999,-999,-999,-999,-999,-999
,2002-10-22T06:53:17Z,SAT007,-18.29,147.39,79.2,-999,-999,-999,-999,-999,-999,-999,-999,-999,-999,-999,-999
,2002-10-22T06:53:18Z,SAT007,-18.29,147.39,79.4,-999,-999,-999,-999,-999,-999,-999,-999,-999,-999,-999,-999
,2002-10-22T06:53:19Z,SAT007,-18.29,147.39,79.6,-999,-999,-999,-999,-999,-999,-999,-999,-999,-999,-999,-999
,2002-10-22T06:53:20Z,SAT007,-18.29,147.39,79.8,-999,-999,-999,-999,-999,-999,-999,-999,-999,-999,-999,-999
,2002-10-22T06:53:21Z,SAT007,-18.29,147.39,80,-999,-999,-999,-999,-999,-999,-999,-999,-999,-999,-999,-999
,2002-10-22T06:53:22Z,SAT007,-18.29,147.39,80.2,-999,-999,-999,-999,-999,-999,-999,-999,-999,-999,-999,-999
,2002-10-22T06:53:23Z,SAT007,-18.29,147.39,80.4,-999,-999,-999,-999,-999,-999,-999,-999,-999,-999,-999,-999
,2002-10-22T06:53:24Z,SAT007,-18.29,147.39,80.6,-999,-999,-999,-999,-999,-999,-999,-999,-999,-999,-999,-999
,2002-10-22T06:53:25Z,SAT007,-18.29,147.39,80.8,-999,-999,-999,-999,-999,-999,-999,-999,-999,-999,-999,-999
,2002-10-22T06:53:26Z,SAT007,-18.29,147.39,81,-999,-999,-999,-999,-999,-999,-999,-999,-999,-999,-999,-999
,2002-10-22T06:53:27Z,SAT007,-18.29,147.39,81.2,-999,-999,-999,-999,-999,-999,-999,-999,-999,-999,-999,-999
,2002-10-22T06:53:28Z,SAT007,-18.29,147.39,81.4,-999,-999,-999,-999,-999,-999,-999,-999,-999,-999,-999,-999
,2002-10-22T06:53:29Z,SAT007,-18.29,147.39,81.6,-999,-999,-999,-999,-999,-999,-999,-999,-999,-999,-999,-999
,2002-10-22T06:53:30Z,SAT007,-18.29,147.39,81.8,-999,-999,-999,-999,-999,-999,-999,-999,-999,-999,-999,-999
,2002-10-22T06:53:31Z,SAT007,-18.29,147.39,82,-999,-999,-999,-999,-999,-999,-999,-999,-999,-999,-999,-999
,2002-10-22T06:53:32Z,SAT007,-18.29,147.39,82.2,-999,-999,-999,-999,-999,-999,-999,-999,-999,-999,-999,-999
,2002-10-22T06:53:33Z,SAT007,-18.29,147.39,82.4,-999,-999,-999,-999,-999,-999,-999,-999,-999,-999,-999,-999
,2002-10-22T06:53:34Z,SAT007,-18.29,147.39,82.6,-999,-999,-999,-999,-999,-999,-999,-999,-999,-999,-999,-999
,2002-10-22T06:53:35Z,SAT007,-18.29,147.39,82.8,-999,-999,-999,-999,-999,-999,-999,-999,-999,-999,-999,-999
,2002-10-22T06:53:36Z,SAT007,-18.29,147.39,83,-999,-999,-999,-999,-999,-999,-999,-999,-999,-999,-999,-999
,2002-10-22T06:53:37Z,SAT007,-18.29,147.39,83.2,-999,-999,-999,-999,-999,-999,-999,-999,-999,-999,-999,-999
,2002-10-22T06:53:38Z,SAT007,-18.29,147.39,83.4,-999,-999,-999,-999,-999,-999,-999,-999,-999,-999,-999,-999
,2002-10-22T06:53:40Z,SAT007,-18.29,147.39,83.6,-999,-999,-999,-999,-999,-999,-999,-999,-999,-999,-999,-999
,2002-10-22T06:53:41Z,SAT007,-18.29,147.39,83.8,-999,-999,-999,-999,-999,-999,-999,-999,-999,-999,-999,-999
,2002-10-22T06:53:42Z,SAT007,-18.29,147.39,84,-999,-999,-999,-999,-999,-999,-999,-999,-999,-999,-999,-999
,2002-10-22T06:53:43Z,SAT007,-18.29,147.39,84.2,-999,-999,-999,-999,-999,-999,-999,-999,-999,-999,-999,-999
,2002-10-22T06:53:44Z,SAT007,-18.29,147.39,84.4,-999,-999,-999,-999,-999,-999,-999,-999,-999,-999,-999,-999
,2002-10-22T06:53:45Z,SAT007,-18.29,147.39,84.6,-999,-999,-999,-999,-999,-999,-999,-999,-999,-999,-999,-999
,2002-10-22T06:53:46Z,SAT007,-18.29,147.39,84.8,-999,-999,-999,-999,-999,-999,-999,-999,-999,-999,-999,-999
,2002-10-22T06:53:47Z,SAT007,-18.29,147.39,85,-999,-999,-999,-999,-999,-999,-999,-999,-999,-999,-999,-999
,2002-10-22T06:53:48Z,SAT007,-18.29,147.39,85.2,-999,-999,-999,-999,-999,-999,-999,-999,-999,-999,-999,-999
,2002-10-22T06:53:49Z,SAT007,-18.29,147.39,85.4,-999,-999,-999,-999,-999,-999,-999,-999,-999,-999,-999,-999
,2002-10-22T06:53:50Z,SAT007,-18.29,147.39,85.6,-999,-999,-999,-999,-999,-999,-999,-999,-999,-999,-999,-999
,2002-10-22T06:53:51Z,SAT007,-18.29,147.39,85.8,-999,-999,-999,-999,-999,-999,-999,-999,-999,-999,-999,-999
,2002-10-22T06:53:52Z,SAT007,-18.29,147.39,86,-999,-999,-999,-999,-999,-999,-999,-999,-999,-999,-999,-999
,2002-10-22T06:53:53Z,SAT007,-18.29,147.39,86.2,-999,-999,-999,-999,-999,-999,-999,-999,-999,-999,-999,-999
,2002-10-22T06:53:54Z,SAT007,-18.29,147.39,86.4,-999,-999,-999,-999,-999,-999,-999,-999,-999,-999,-999,-999
,2002-10-22T06:53:55Z,SAT007,-18.29,147.39,86.6,-999,-999,-999,-999,-999,-999,-999,-999,-999,-999,-999,-999
,2002-10-22T06:53:56Z,SAT007,-18.29,147.39,86.8,-999,-999,-999,-999,-999,-999,-999,-999,-999,-999,-999,-999
,2002-10-22T06:53:57Z,SAT007,-18.29,147.39,87,-999,-999,-999,-999,-999,-999,-999,-999,-999,-999,-999,-999
,2002-10-22T06:53:58Z,SAT007,-18.29,147.39,87.2,-999,-999,-999,-999,-999,-999,-999,-999,-999,-999,-999,-999
,2002-10-22T06:53:59Z,SAT007,-18.29,147.39,87.4,-999,-999,-999,-999,-999,-999,-999,-999,-999,-999,-999,-999
,2002-10-22T06:54:00Z,SAT007,-18.29,147.39,87.6,-999,-999,-999,-999,-999,-999,-999,-999,-999,-999,-999,-999
,2002-10-22T06:54:01Z,SAT007,-18.29,147.39,87.8,-999,-999,-999,-999,-999,-999,-999,-999,-999,-999,-999,-999
,2002-10-22T06:54:02Z,SAT007,-18.29,147.39,88,-999,-999,-999,-999,-999,-999,-999,-999,-999,-999,-999,-999
,2002-10-22T06:54:03Z,SAT007,-18.29,147.39,88.2,-999,-999,-999,-999,-999,-999,-999,-999,-999,-999,-999,-999
,2002-10-22T06:54:05Z,SAT007,-18.29,147.39,88.4,-999,-999,-999,-999,-999,-999,-999,-999,-999,-999,-999,-999
,2002-10-22T06:54:06Z,SAT007,-18.29,147.39,88.6,-999,-999,-999,-999,-999,-999,-999,-999,-999,-999,-999,-999
,2002-10-22T06:54:07Z,SAT007,-18.29,147.39,88.8,-999,-999,-999,-999,-999,-999,-999,-999,-999,-999,-999,-999
,2002-10-22T06:54:08Z,SAT007,-18.29,147.39,89,-999,-999,-999,-999,-999,-999,-999,-999,-999,-999,-999,-999
,2002-10-22T06:54:09Z,SAT007,-18.29,147.39,89.2,-999,-999,-999,-999,-999,-999,-999,-999,-999,-999,-999,-999
,2002-10-22T06:54:10Z,SAT007,-18.29,147.39,89.4,-999,-999,-999,-999,-999,-999,-999,-999,-999,-999,-999,-999
,2002-10-22T06:54:11Z,SAT007,-18.29,147.39,89.6,-999,-999,-999,-999,-999,-999,-999,-999,-999,-999,-999,-999
,2002-10-22T06:54:12Z,SAT007,-18.29,147.39,89.8,-999,-999,-999,-999,-999,-999,-999,-999,-999,-999,-999,-999
,2002-10-22T06:54:13Z,SAT007,-18.29,147.39,90,-999,-999,-999,-999,-999,-999,-999,-999,-999,-999,-999,-999
,2002-10-22T06:54:14Z,SAT007,-18.29,147.39,90.2,-999,-999,-999,-999,-999,-999,-999,-999,-999,-999,-999,-999
,2002-10-22T06:54:15Z,SAT007,-18.29,147.39,90.4,-999,-999,-999,-999,-999,-999,-999,-999,-999,-999,-999,-999
,2002-10-22T06:54:16Z,SAT007,-18.29,147.39,90.6,-999,-999,-999,-999,-999,-999,-999,-999,-999,-999,-999,-999
,2002-10-22T06:54:17Z,SAT007,-18.29,147.39,90.8,-999,-999,-999,-999,-999,-999,-999,-999,-999,-999,-999,-999
,2002-10-22T06:54:18Z,SAT007,-18.29,147.39,91,-999,-999,-999,-999,-999,-999,-999,-999,-999,-999,-999,-999
,2002-10-22T06:54:19Z,SAT007,-18.29,147.39,91.2,-999,-999,-999,-999,-999,-999,-999,-999,-999,-999,-999,-999
,2002-10-22T06:54:20Z,SAT007,-18.29,147.39,91.4,-999,-999,-999,-999,-999,-999,-999,-999,-999,-999,-999,-999
,2002-10-22T06:54:21Z,SAT007,-18.29,147.39,91.6,-999,-999,-999,-999,-999,-999,-999,-999,-999,-999,-999,-999
,2002-10-22T06:54:22Z,SAT007,-18.29,147.39,91.8,-999,-999,-999,-999,-999,-999,-999,-999,-999,-999,-999,-999
,2002-10-22T06:54:23Z,SAT007,-18.29,147.39,92,-999,-999,-999,-999,-999,-999,-999,-999,-999,-999,-999,-999
,2002-10-22T06:54:24Z,SAT007,-18.29,147.39,92.2,-999,-999,-999,-999,-999,-999,-999,-999,-999,-999,-999,-999
,2002-10-22T06:54:25Z,SAT007,-18.29,147.39,92.4,-999,-999,-999,-999,-999,-999,-999,-999,-999,-999,-999,-999
,2002-10-22T06:54:26Z,SAT007,-18.29,147.39,92.6,-999,-999,-999,-999,-999,-999,-999,-999,-999,-999,-999,-999
,2002-10-22T06:54:27Z,SAT007,-18.29,147.39,92.8,-999,-999,-999,-999,-999,-999,-999,-999,-999,-999,-999,-999
,2002-10-22T06:54:28Z,SAT007,-18.29,147.39,93,-999,-999,-999,-999,-999,-999,-999,-999,-999,-999,-999,-999
,2002-10-22T06:54:30Z,SAT007,-18.29,147.39,93.2,-999,-999,-999,-999,-999,-999,-999,-999,-999,-999,-999,-999
,2002-10-22T06:54:31Z,SAT007,-18.29,147.39,93.4,-999,-999,-999,-999,-999,-999,-999,-999,-999,-999,-999,-999
,2002-10-22T06:54:32Z,SAT007,-18.29,147.39,93.6,-999,-999,-999,-999,-999,-999,-999,-999,-999,-999,-999,-999
,2002-10-22T06:54:33Z,SAT007,-18.29,147.39,93.8,-999,-999,-999,-999,-999,-999,-999,-999,-999,-999,-999,-999
,2002-10-22T06:54:34Z,SAT007,-18.29,147.39,94,-999,-999,-999,-999,-999,-999,-999,-999,-999,-999,-999,-999
,2002-10-22T06:54:35Z,SAT007,-18.29,147.39,94.2,-999,-999,-999,-999,-999,-999,-999,-999,-999,-999,-999,-999
,2002-10-22T06:54:36Z,SAT007,-18.29,147.39,94.4,-999,-999,-999,-999,-999,-999,-999,-999,-999,-999,-999,-999
,2002-10-22T06:54:37Z,SAT007,-18.29,147.39,94.6,-999,-999,-999,-999,-999,-999,-999,-999,-999,-999,-999,-999
,2002-10-22T06:54:38Z,SAT007,-18.29,147.39,94.8,-999,-999,-999,-999,-999,-999,-999,-999,-999,-999,-999,-999
,2002-10-22T06:54:39Z,SAT007,-18.29,147.39,95,-999,-999,-999,-999,-999,-999,-999,-999,-999,-999,-999,-999
,2002-10-22T06:54:40Z,SAT007,-18.29,147.39,95.2,-999,-999,-999,-999,-999,-999,-999,-999,-999,-999,-999,-999
,2002-10-22T06:54:42Z,SAT007,-18.29,147.39,95.4,-999,-999,-999,-999,-999,-999,-999,-999,-999,-999,-999,-999
,2002-10-22T06:54:42Z,SAT007,-18.29,147.39,95.6,-999,-999,-999,-999,-999,-999,-999,-999,-999,-999,-999,-999
,2002-10-22T06:54:43Z,SAT007,-18.29,147.39,95.8,-999,-999,-999,-999,-999,-999,-999,-999,-999,-999,-999,-999
,2002-10-22T06:54:44Z,SAT007,-18.29,147.39,96,-999,-999,-999,-999,-999,-999,-999,-999,-999,-999,-999,-999
,2002-10-22T06:54:45Z,SAT007,-18.29,147.39,96.2,-999,-999,-999,-999,-999,-999,-999,-999,-999,-999,-999,-999
,2002-10-22T06:54:46Z,SAT007,-18.29,147.39,96.4,-999,-999,-999,-999,-999,-999,-999,-999,-999,-999,-999,-999
,2002-10-22T06:54:47Z,SAT007,-18.29,147.39,96.6,-999,-999,-999,-999,-999,-999,-999,-999,-999,-999,-999,-999
,2002-10-22T06:54:48Z,SAT007,-18.29,147.39,96.8,-999,-999,-999,-999,-999,-999,-999,-999,-999,-999,-999,-999
,2002-10-22T06:54:49Z,SAT007,-18.29,147.39,97,-999,-999,-999,-999,-999,-999,-999,-999,-999,-999,-999,-999
,2002-10-22T06:54:50Z,SAT007,-18.29,147.39,97.2,-999,-999,-999,-999,-999,-999,-999,-999,-999,-999,-999,-999
,2002-10-22T06:54:51Z,SAT007,-18.29,147.39,97.4,-999,-999,-999,-999,-999,-999,-999,-999,-999,-999,-999,-999
,2002-10-22T06:54:52Z,SAT007,-18.29,147.39,97.6,-999,-999,-999,-999,-999,-999,-999,-999,-999,-999,-999,-999
,2002-10-22T06:54:53Z,SAT007,-18.29,147.39,97.8,-999,-999,-999,-999,-999,-999,-999,-999,-999,-999,-999,-999
,2002-10-22T06:54:55Z,SAT007,-18.29,147.39,98,-999,-999,-999,-999,-999,-999,-999,-999,-999,-999,-999,-999
,2002-10-22T06:54:56Z,SAT007,-18.29,147.39,98.2,-999,-999,-999,-999,-999,-999,-999,-999,-999,-999,-999,-999
,2002-10-22T06:54:57Z,SAT007,-18.29,147.39,98.4,-999,-999,-999,-999,-999,-999,-999,-999,-999,-999,-999,-999
,2002-10-22T06:54:58Z,SAT007,-18.29,147.39,98.6,-999,-999,-999,-999,-999,-999,-999,-999,-999,-999,-999,-999
,2002-10-22T06:54:59Z,SAT007,-18.29,147.39,98.8,-999,-999,-999,-999,-999,-999,-999,-999,-999,-999,-999,-999
,2002-10-22T06:55:00Z,SAT007,-18.29,147.39,99,-999,-999,-999,-999,-999,-999,-999,-999,-999,-999,-999,-999
,2002-10-22T06:55:01Z,SAT007,-18.29,147.39,99.2,-999,-999,-999,-999,-999,-999,-999,-999,-999,-999,-999,-999
,2002-10-22T06:55:02Z,SAT007,-18.29,147.39,99.4,-999,-999,-999,-999,-999,-999,-999,-999,-999,-999,-999,-999
,2002-10-22T06:55:03Z,SAT007,-18.29,147.39,99.6,-999,-999,-999,-999,-999,-999,-999,-999,-999,-999,-999,-999
,2002-10-22T06:55:04Z,SAT007,-18.29,147.39,99.8,-999,-999,-999,-999,-999,-999,-999,-999,-999,-999,-999,-999
,2002-10-22T06:55:05Z,SAT007,-18.29,147.39,100,-999,-999,-999,-999,-999,-999,-999,-999,-999,-999,-999,-999
