GLOBAL ATTRIBUTES,,Comments,,,,,,,,,,,,,,,,,,,,,,,,,,,,,,,,,,,,,,,,,,,,,,,,,,,,,,,,,,,,,,,,,,,,,,,,,,,,,,,,,
title,,,,,,,,,,,,,,,,,,,,,,,,,,,,,,,,,,,,,,,,,,,,,,,,,,,,,,,,,,,,,,,,,,,,,,,,,,,,,,,,,,,
project,Integrated Marine Observing System (IMOS),,,,,,,,,,,,,,,,,,,,,,,,,,,,,,,,,,,,,,,,,,,,,,,,,,,,,,,,,,,,,,,,,,,,,,,,,,,,,,,,,,
original_project_name,Remote Sensing 2004-2007,,,,,,,,,,,,,,,,,,,,,,,,,,,,,,,,,,,,,,,,,,,,,,,,,,,,,,,,,,,,,,,,,,,,,,,,,,,,,,,,,,
institution,CMAR,,,,,,,,,,,,,,,,,,,,,,,,,,,,,,,,,,,,,,,,,,,,,,,,,,,,,,,,,,,,,,,,,,,,,,,,,,,,,,,,,,
abstract,"The data were collected at a total of 8 stations on the charter vessel Megaptera. These samples were taken along the Heron Island transects. The data were collected to determine the bio-optical charateristics of this region. The data can be used for Ocean Colour sensor validation.  Parameters measured are pigments, and the absorption coefficient for dissolved (CDOM), phytoplankton (a/ph) and detrital or non-algal (a/d) components of the water column.",,,,,,,,,,,,,,,,,,,,,,,,,,,,,,,,,,,,,,,,,,,,,,,,,,,,,,,,,,,,,,,,,,,,,,,,,,,,,,,,,,
conventions,IMOS biological data format (v1.0),,,,,,,,,,,,,,,,,,,,,,,,,,,,,,,,,,,,,,,,,,,,,,,,,,,,,,,,,,,,,,,,,,,,,,,,,,,,,,,,,,
date_created,,,,,,,,,,,,,,,,,,,,,,,,,,,,,,,,,,,,,,,,,,,,,,,,,,,,,,,,,,,,,,,,,,,,,,,,,,,,,,,,,,,
date_modified,,,,,,,,,,,,,,,,,,,,,,,,,,,,,,,,,,,,,,,,,,,,,,,,,,,,,,,,,,,,,,,,,,,,,,,,,,,,,,,,,,,
history,data has been quality controlled by in-house procedures,,,,,,,,,,,,,,,,,,,,,,,,,,,,,,,,,,,,,,,,,,,,,,,,,,,,,,,,,,,,,,,,,,,,,,,,,,,,,,,,,,
comment,the ad data is derived as follows; An exponential function a(λ) = a(350).exp(-S(λ -350)) + b was fitted to all detrital spectra over the wavelength range 350 to 750 nm. A non-linear least-squares technique was used to fit the equation to the untransformed data. ,,,,,,,,,,,,,,,,,,,,,,,,,,,,,,,,,,,,,,,,,,,,,,,,,,,,,,,,,,,,,,,,,,,,,,,,,,,,,,,,,,
source,"Absorption coefficients of non-algal detrital matter in discrete sea-water samples, determined using a laboratory spectrophotometer",,,,,,,,,,,,,,,,,,,,,,,,,,,,,,,,,,,,,,,,,,,,,,,,,,,,,,,,,,,,,,,,,,,,,,,,,,,,,,,,,,
keywords,Oceans>Ocean Optics > Absorption ;Oceans>Ocean Optics>Ocean Colour;,,,,,,,,,,,,,,,,,,,,,,,,,,,,,,,,,,,,,,,,,,,,,,,,,,,,,,,,,,,,,,,,,,,,,,,,,,,,,,,,,,
vessel_name,Megaptera,,,,,,,,,,,,,,,,,,,,,,,,,,,,,,,,,,,,,,,,,,,,,,,,,,,,,,,,,,,,,,,,,,,,,,,,,,,,,,,,,,
platform_code,,,,,,,,,,,,,,,,,,,,,,,,,,,,,,,,,,,,,,,,,,,,,,,,,,,,,,,,,,,,,,,,,,,,,,,,,,,,,,,,,,,
cruise_id,MG052004,,,,,,,,,,,,,,,,,,,,,,,,,,,,,,,,,,,,,,,,,,,,,,,,,,,,,,,,,,,,,,,,,,,,,,,,,,,,,,,,,,
references,https://marlin.csiro.au/geonetwork/srv/eng/catalog.search#/metadata/dbb7b9ed-75fe-0db5-e043-08114f8c1662,,,,,,,,,,,,,,,,,,,,,,,,,,,,,,,,,,,,,,,,,,,,,,,,,,,,,,,,,,,,,,,,,,,,,,,,,,,,,,,,,,
naming_authority,CSIRO Marine and Atmospheric Research (CMAR),,,,,,,,,,,,,,,,,,,,,,,,,,,,,,,,,,,,,,,,,,,,,,,,,,,,,,,,,,,,,,,,,,,,,,,,,,,,,,,,,,
cdm_data_type,Point,,,,,,,,,,,,,,,,,,,,,,,,,,,,,,,,,,,,,,,,,,,,,,,,,,,,,,,,,,,,,,,,,,,,,,,,,,,,,,,,,,
geospatial_lat_min,-23.447133,calculated automatically from table,,,,,,,,,,,,,,,,,,,,,,,,,,,,,,,,,,,,,,,,,,,,,,,,,,,,,,,,,,,,,,,,,,,,,,,,,,,,,,,,,
geospatial_lat_max,-23.41215539,calculated automatically from table,,,,,,,,,,,,,,,,,,,,,,,,,,,,,,,,,,,,,,,,,,,,,,,,,,,,,,,,,,,,,,,,,,,,,,,,,,,,,,,,,
geospatial_lon_min,151.8635967,calculated automatically from table,,,,,,,,,,,,,,,,,,,,,,,,,,,,,,,,,,,,,,,,,,,,,,,,,,,,,,,,,,,,,,,,,,,,,,,,,,,,,,,,,
geospatial_lon_max,151.9489766,calculated automatically from table,,,,,,,,,,,,,,,,,,,,,,,,,,,,,,,,,,,,,,,,,,,,,,,,,,,,,,,,,,,,,,,,,,,,,,,,,,,,,,,,,
geospatial_vertical_min,0,calculated automatically from table,,,,,,,,,,,,,,,,,,,,,,,,,,,,,,,,,,,,,,,,,,,,,,,,,,,,,,,,,,,,,,,,,,,,,,,,,,,,,,,,,
geospatial_vertical_max,0,calculated automatically from table,,,,,,,,,,,,,,,,,,,,,,,,,,,,,,,,,,,,,,,,,,,,,,,,,,,,,,,,,,,,,,,,,,,,,,,,,,,,,,,,,
local_time_zone,+10,,,,,,,,,,,,,,,,,,,,,,,,,,,,,,,,,,,,,,,,,,,,,,,,,,,,,,,,,,,,,,,,,,,,,,,,,,,,,,,,,,
data_centre,eMarine Information Infrastructure (eMII),,,,,,,,,,,,,,,,,,,,,,,,,,,,,,,,,,,,,,,,,,,,,,,,,,,,,,,,,,,,,,,,,,,,,,,,,,,,,,,,,,
data_centre_email,info@emii.org.au,,,,,,,,,,,,,,,,,,,,,,,,,,,,,,,,,,,,,,,,,,,,,,,,,,,,,,,,,,,,,,,,,,,,,,,,,,,,,,,,,,
author,"Clementson, Lesley",,,,,,,,,,,,,,,,,,,,,,,,,,,,,,,,,,,,,,,,,,,,,,,,,,,,,,,,,,,,,,,,,,,,,,,,,,,,,,,,,,
author_email,Lesley.Clementson@csiro.au,,,,,,,,,,,,,,,,,,,,,,,,,,,,,,,,,,,,,,,,,,,,,,,,,,,,,,,,,,,,,,,,,,,,,,,,,,,,,,,,,,
principal_investigator,"Barton, Ian",,,,,,,,,,,,,,,,,,,,,,,,,,,,,,,,,,,,,,,,,,,,,,,,,,,,,,,,,,,,,,,,,,,,,,,,,,,,,,,,,,
principal_investigator_email,Ian.Barton@csiro.au,,,,,,,,,,,,,,,,,,,,,,,,,,,,,,,,,,,,,,,,,,,,,,,,,,,,,,,,,,,,,,,,,,,,,,,,,,,,,,,,,,
publisher,Australian Ocean Data Network,,,,,,,,,,,,,,,,,,,,,,,,,,,,,,,,,,,,,,,,,,,,,,,,,,,,,,,,,,,,,,,,,,,,,,,,,,,,,,,,,,
publisher_email,info@aodn.org.au,,,,,,,,,,,,,,,,,,,,,,,,,,,,,,,,,,,,,,,,,,,,,,,,,,,,,,,,,,,,,,,,,,,,,,,,,,,,,,,,,,
institution,IMOS Satellite Remote Sensing - Ocean Colour Sub-facility - Bio-Optical Database of Australian Waters,,,,,,,,,,,,,,,,,,,,,,,,,,,,,,,,,,,,,,,,,,,,,,,,,,,,,,,,,,,,,,,,,,,,,,,,,,,,,,,,,,
institution_principal_investigator,"Schroeder, Thomas",,,,,,,,,,,,,,,,,,,,,,,,,,,,,,,,,,,,,,,,,,,,,,,,,,,,,,,,,,,,,,,,,,,,,,,,,,,,,,,,,,
institution_principal_investigator_email,Thomas.Schroeder@csiro.au,,,,,,,,,,,,,,,,,,,,,,,,,,,,,,,,,,,,,,,,,,,,,,,,,,,,,,,,,,,,,,,,,,,,,,,,,,,,,,,,,,
citation,"To cite this data set in a publication, use the format ""IMOS [year-of-data-downloaded], [Title], [data-access-url], accessed [date-of-access]""",,,,,,,,,,,,,,,,,,,,,,,,,,,,,,,,,,,,,,,,,,,,,,,,,,,,,,,,,,,,,,,,,,,,,,,,,,,,,,,,,,
acknowledgement,Data was sourced from the Commonwealth Scientific and Industrial Research Organisation (CSIRO),,,,,,,,,,,,,,,,,,,,,,,,,,,,,,,,,,,,,,,,,,,,,,,,,,,,,,,,,,,,,,,,,,,,,,,,,,,,,,,,,,
distribution_statement,"Any users of IMOS data are required to clearly acknowledge the source of the material. Data, products and services from IMOS are provided ""as is"" without any warranty as to fitness for a particular purpose.",,,,,,,,,,,,,,,,,,,,,,,,,,,,,,,,,,,,,,,,,,,,,,,,,,,,,,,,,,,,,,,,,,,,,,,,,,,,,,,,,,
,,,,,,,,,,,,,,,,,,,,,,,,,,,,,,,,,,,,,,,,,,,,,,,,,,,,,,,,,,,,,,,,,,,,,,,,,,,,,,,,,,,
,,,,,,,,,,,,,,,,,,,,,,,,,,,,,,,,,,,,,,,,,,,,,,,,,,,,,,,,,,,,,,,,,,,,,,,,,,,,,,,,,,,
TABLE ROWS,,,,,,,,,,,,,,,,,,,,,,,,,,,,,,,,,,,,,,,,,,,,,,,,,,,,,,,,,,,,,,,,,,,,,,,,,,,,,,,,,,,
Row name,CF standard_name,IMOS long_name,Units,Fill value,Comments,,,,,,,,,,,,,,,,,,,,,,,,,,,,,,,,,,,,,,,,,,,,,,,,,,,,,,,,,,,,,,,,,,,,,,,,,,,,,,
Time,time,analysis_time,YYYY-MM-DDThh:mm:ssZ,,UTC date and time,,,,,,,,,,,,,,,,,,,,,,,,,,,,,,,,,,,,,,,,,,,,,,,,,,,,,,,,,,,,,,,,,,,,,,,,,,,,,,
Station_Code,,,,,National Reference Station code (6 letters),,,,,,,,,,,,,,,,,,,,,,,,,,,,,,,,,,,,,,,,,,,,,,,,,,,,,,,,,,,,,,,,,,,,,,,,,,,,,,
Latitude,latitude,latitude,degrees_north,,North positive,,,,,,,,,,,,,,,,,,,,,,,,,,,,,,,,,,,,,,,,,,,,,,,,,,,,,,,,,,,,,,,,,,,,,,,,,,,,,,
Longitude,longitude,longitude,degrees_east,,East positive,,,,,,,,,,,,,,,,,,,,,,,,,,,,,,,,,,,,,,,,,,,,,,,,,,,,,,,,,,,,,,,,,,,,,,,,,,,,,,
Depth,depth,depth,m ,,positive down,,,,,,,,,,,,,,,,,,,,,,,,,,,,,,,,,,,,,,,,,,,,,,,,,,,,,,,,,,,,,,,,,,,,,,,,,,,,,,
,,,,,,,,,,,,,,,,,,,,,,,,,,,,,,,,,,,,,,,,,,,,,,,,,,,,,,,,,,,,,,,,,,,,,,,,,,,,,,,,,,,
TABLE COLUMNS,,,,,,,,,,,,,,,,,,,,,,,,,,,,,,,,,,,,,,,,,,,,,,,,,,,,,,,,,,,,,,,,,,,,,,,,,,,,,,,,,,,
Table name,CF standard_name,IMOS long_name,Units,Fill value,Comments,,,,,,,,,,,,,,,,,,,,,,,,,,,,,,,,,,,,,,,,,,,,,,,,,,,,,,,,,,,,,,,,,,,,,,,,,,,,,,
Wavelength,radiation_wavelength,Wavelength of measurement,nm,-999,,,,,,,,,,,,,,,,,,,,,,,,,,,,,,,,,,,,,,,,,,,,,,,,,,,,,,,,,,,,,,,,,,,,,,,,,,,,,,,
ad,,volume_absorption_coefficient_of_non-algal_detritus_in_sea_water,m-1,-999,,,,,,,,,,,,,,,,,,,,,,,,,,,,,,,,,,,,,,,,,,,,,,,,,,,,,,,,,,,,,,,,,,,,,,,,,,,,,,,
,,,,,,,,,,,,,,,,,,,,,,,,,,,,,,,,,,,,,,,,,,,,,,,,,,,,,,,,,,,,,,,,,,,,,,,,,,,,,,,,,,,
DATA,,,,,,,,,,,,,,,,,,,,,,,,,,,,,,,,,,,,,,,,,,,,,,,,,,,,,,,,,,,,,,,,,,,,,,,,,,,,,,,,,,,
,Wavelength ,ad,ad,ad,ad,ad,ad,ad,ad,,,,,,,,,,,,,,,,,,,,,,,,,,,,,,,,,,,,,,,,,,,,,,,,,,,,,,,,,,,,,,,,,,,,,,,,,,
Time,,2004-05-19T01:25:00Z,2004-05-19T01:35:00Z,2004-05-20T05:00:00Z,2004-05-20T22:45:00Z,2004-05-21T00:20:00Z,2004-05-22T23:15:00Z,2004-05-23T04:00:00Z,2004-05-24T00:15:00Z,,,,,,,,,,,,,,,,,,,,,,,,,,,,,,,,,,,,,,,,,,,,,,,,,,,,,,,,,,,,,,,,,,,,,,,,,,
Station_Code,,HEO-1,HEO-2,HE2054-3,HE2154-4,HE2154-5,HE2354-7,HE2354-8,HE2454-9,,,,,,,,,,,,,,,,,,,,,,,,,,,,,,,,,,,,,,,,,,,,,,,,,,,,,,,,,,,,,,,,,,,,,,,,,,
Latitude,,-23.44535,-23.443366666666666,-23.43398183,-23.44291066,-23.44154048,-23.41215539,-23.444367,-23.447133,,,,,,,,,,,,,,,,,,,,,,,,,,,,,,,,,,,,,,,,,,,,,,,,,,,,,,,,,,,,,,,,,,,,,,,,,,
Longitude,,151.90801666666667,151.89998333333,151.9177933,151.9489766,151.9047029,151.8635967,151.91877,151.91195,,,,,,,,,,,,,,,,,,,,,,,,,,,,,,,,,,,,,,,,,,,,,,,,,,,,,,,,,,,,,,,,,,,,,,,,,,
Depth,,0.7,30,0,0,0,0,0,0,,,,,,,,,,,,,,,,,,,,,,,,,,,,,,,,,,,,,,,,,,,,,,,,,,,,,,,,,,,,,,,,,,,,,,,,,,
,800,7.7879343e-05,9.7751642e-05,0.00025667955,0.00017827095,0.0002839491,8.3105474e-05,0.0001336112,5.6535794e-05,,,,,,,,,,,,,,,,,,,,,,,,,,,,,,,,,,,,,,,,,,,,,,,,,,,,,,,,,,,,,,,,,,,,,,,,,,
,798.66669,7.8992835e-05,9.9038859e-05,0.0002596026,0.00018072566,0.00028697646,8.4277694e-05,0.00013555484,5.7384529e-05,,,,,,,,,,,,,,,,,,,,,,,,,,,,,,,,,,,,,,,,,,,,,,,,,,,,,,,,,,,,,,,,,,,,,,,,,,
,797.33337,8.0122246e-05,0.00010034303,0.00026255894,0.00018321416,0.0002900361,8.5466449e-05,0.00013752676,5.8246007e-05,,,,,,,,,,,,,,,,,,,,,,,,,,,,,,,,,,,,,,,,,,,,,,,,,,,,,,,,,,,,,,,,,,,,,,,,,,
,796,8.1267859e-05,0.00010166443,0.00026554908,0.00018573705,0.0002931285,8.6672027e-05,0.00013952746,5.9120457e-05,,,,,,,,,,,,,,,,,,,,,,,,,,,,,,,,,,,,,,,,,,,,,,,,,,,,,,,,,,,,,,,,,,,,,,,,,,
,794.66669,8.2429798e-05,0.00010300317,0.00026857314,0.00018829456,0.00029625373,8.7894555e-05,0.00014155717,6.0007994e-05,,,,,,,,,,,,,,,,,,,,,,,,,,,,,,,,,,,,,,,,,,,,,,,,,,,,,,,,,,,,,,,,,,,,,,,,,,
,793.33337,8.360835e-05,0.00010435954,0.00027163164,0.00019088729,0.00029941228,8.9134326e-05,0.0001436164,6.0908856e-05,,,,,,,,,,,,,,,,,,,,,,,,,,,,,,,,,,,,,,,,,,,,,,,,,,,,,,,,,,,,,,,,,,,,,,,,,,
,792,8.4803808e-05,0.00010573384,0.00027472511,0.00019351583,0.00030260465,9.0391643e-05,0.00014570569,6.1823284e-05,,,,,,,,,,,,,,,,,,,,,,,,,,,,,,,,,,,,,,,,,,,,,,,,,,,,,,,,,,,,,,,,,,,,,,,,,,
,790.66669,8.6016303e-05,0.00010712617,0.00027785366,0.00019618045,0.00030583091,9.1666637e-05,0.00014782527,6.2751397e-05,,,,,,,,,,,,,,,,,,,,,,,,,,,,,,,,,,,,,,,,,,,,,,,,,,,,,,,,,,,,,,,,,,,,,,,,,,
,789.33337,8.7246134e-05,0.00010853683,0.00028101784,0.00019888177,0.00030909157,9.2959614e-05,0.00014997569,6.3693444e-05,,,,,,,,,,,,,,,,,,,,,,,,,,,,,,,,,,,,,,,,,,,,,,,,,,,,,,,,,,,,,,,,,,,,,,,,,,
,788,8.8493606e-05,0.00010996614,0.00028421821,0.0002016204,0.00031238714,9.427089e-05,0.00015215749,6.4649677e-05,,,,,,,,,,,,,,,,,,,,,,,,,,,,,,,,,,,,,,,,,,,,,,,,,,,,,,,,,,,,,,,,,,,,,,,,,,
,786.66669,8.9758857e-05,0.0001114142,0.00028745487,0.00020439661,0.0003157177,9.5600601e-05,0.00015437093,6.5620221e-05,,,,,,,,,,,,,,,,,,,,,,,,,,,,,,,,,,,,,,,,,,,,,,,,,,,,,,,,,,,,,,,,,,,,,,,,,,
,785.33337,9.1042197e-05,0.00011288133,0.00029072839,0.00020721106,0.00031908377,9.6949068e-05,0.00015661656,6.6605335e-05,,,,,,,,,,,,,,,,,,,,,,,,,,,,,,,,,,,,,,,,,,,,,,,,,,,,,,,,,,,,,,,,,,,,,,,,,,
,784,9.2343947e-05,0.00011436784,0.00029403934,0.00021006439,0.00032248588,9.8316618e-05,0.00015889497,6.7605284e-05,,,,,,,,,,,,,,,,,,,,,,,,,,,,,,,,,,,,,,,,,,,,,,,,,,,,,,,,,,,,,,,,,,,,,,,,,,
,782.66669,9.3664248e-05,0.00011587387,0.00029738784,0.00021295687,0.00032592411,9.9703395e-05,0.00016120642,6.8620199e-05,,,,,,,,,,,,,,,,,,,,,,,,,,,,,,,,,,,,,,,,,,,,,,,,,,,,,,,,,,,,,,,,,,,,,,,,,,
,781.33337,9.5003427e-05,0.00011739972,0.00030077448,0.00021588919,0.00032939899,0.00010110973,0.0001635515,6.965035e-05,,,,,,,,,,,,,,,,,,,,,,,,,,,,,,,,,,,,,,,,,,,,,,,,,,,,,,,,,,,,,,,,,,,,,,,,,,
,780,9.6361815e-05,0.00011894574,0.00030419984,0.00021886201,0.00033291109,0.00010253597,0.00016593079,7.0696015e-05,,,,,,,,,,,,,,,,,,,,,,,,,,,,,,,,,,,,,,,,,,,,,,,,,,,,,,,,,,,,,,,,,,,,,,,,,,
,778.66669,9.7739562e-05,0.00012051205,0.00030766405,0.00022187564,0.00033646046,0.00010398227,0.00016834459,7.1757329e-05,,,,,,,,,,,,,,,,,,,,,,,,,,,,,,,,,,,,,,,,,,,,,,,,,,,,,,,,,,,,,,,,,,,,,,,,,,
,777.33337,9.9137008e-05,0.00012209898,0.00031116771,0.00022493076,0.00034004768,0.00010544896,0.0001707935,7.2834575e-05,,,,,,,,,,,,,,,,,,,,,,,,,,,,,,,,,,,,,,,,,,,,,,,,,,,,,,,,,,,,,,,,,,,,,,,,,,
,776,0.0001005545,0.00012370688,0.00031471143,0.00022802809,0.00034367332,0.00010693641,0.00017327815,7.3928045e-05,,,,,,,,,,,,,,,,,,,,,,,,,,,,,,,,,,,,,,,,,,,,,,,,,,,,,,,,,,,,,,,,,,,,,,,,,,
,774.66669,0.00010199219,0.00012533589,0.00031829535,0.00023116793,0.00034733744,0.00010844477,0.00017579883,7.5037879e-05,,,,,,,,,,,,,,,,,,,,,,,,,,,,,,,,,,,,,,,,,,,,,,,,,,,,,,,,,,,,,,,,,,,,,,,,,,
,773.33337,0.00010345044,0.00012698634,0.00032192008,0.000234351,0.00035104062,0.0001099744,0.00017835618,7.6164375e-05,,,,,,,,,,,,,,,,,,,,,,,,,,,,,,,,,,,,,,,,,,,,,,,,,,,,,,,,,,,,,,,,,,,,,,,,,,
,772,0.00010492961,0.0001286586,0.00032558626,0.00023757805,0.00035478346,0.00011152569,0.00018095085,7.7307834e-05,,,,,,,,,,,,,,,,,,,,,,,,,,,,,,,,,,,,,,,,,,,,,,,,,,,,,,,,,,,,,,,,,,,,,,,,,,
,770.66669,0.00010642985,0.00013035281,0.00032929402,0.00024084939,0.00035856603,0.00011309878,0.00018358315,7.8468407e-05,,,,,,,,,,,,,,,,,,,,,,,,,,,,,,,,,,,,,,,,,,,,,,,,,,,,,,,,,,,,,,,,,,,,,,,,,,
,769.33337,0.00010795155,0.00013206933,0.000333044,0.00024416577,0.00036238894,0.00011469406,0.00018625374,7.9646403e-05,,,,,,,,,,,,,,,,,,,,,,,,,,,,,,,,,,,,,,,,,,,,,,,,,,,,,,,,,,,,,,,,,,,,,,,,,,
,768,0.00010949507,0.00013380853,0.00033683686,0.00024752797,0.00036625277,0.00011631192,0.0001889633,8.0842139e-05,,,,,,,,,,,,,,,,,,,,,,,,,,,,,,,,,,,,,,,,,,,,,,,,,,,,,,,,,,,,,,,,,,,,,,,,,,
,766.66669,0.0001110606,0.00013557055,0.00034067274,0.00025093631,0.00037015763,0.00011795253,0.00019171215,8.205577e-05,,,,,,,,,,,,,,,,,,,,,,,,,,,,,,,,,,,,,,,,,,,,,,,,,,,,,,,,,,,,,,,,,,,,,,,,,,
,765.33337,0.0001126485,0.00013735578,0.0003445523,0.00025439158,0.00037410411,0.00011961627,0.00019450099,8.3287621e-05,,,,,,,,,,,,,,,,,,,,,,,,,,,,,,,,,,,,,,,,,,,,,,,,,,,,,,,,,,,,,,,,,,,,,,,,,,
,764,0.00011425919,0.0001391646,0.00034847622,0.00025789459,0.00037809286,0.00012130356,0.00019733053,8.4538022e-05,,,,,,,,,,,,,,,,,,,,,,,,,,,,,,,,,,,,,,,,,,,,,,,,,,,,,,,,,,,,,,,,,,,,,,,,,,
,762.66669,0.00011589282,0.00014099715,0.00035244465,0.00026144568,0.00038212395,0.00012301458,0.00020020111,8.5807137e-05,,,,,,,,,,,,,,,,,,,,,,,,,,,,,,,,,,,,,,,,,,,,,,,,,,,,,,,,,,,,,,,,,,,,,,,,,,
,761.33337,0.00011754982,0.00014285384,0.00035645827,0.00026504566,0.00038619801,0.00012474972,0.00020311343,8.7095305e-05,,,,,,,,,,,,,,,,,,,,,,,,,,,,,,,,,,,,,,,,,,,,,,,,,,,,,,,,,,,,,,,,,,,,,,,,,,
,760,0.00011923058,0.00014473506,0.00036051779,0.00026869538,0.00039031571,0.00012650943,0.00020606827,8.8402871e-05,,,,,,,,,,,,,,,,,,,,,,,,,,,,,,,,,,,,,,,,,,,,,,,,,,,,,,,,,,,,,,,,,,,,,,,,,,
,758.66669,0.0001209353,0.00014664096,0.00036462334,0.00027239519,0.00039447711,0.00012829387,0.00020906595,8.9730007e-05,,,,,,,,,,,,,,,,,,,,,,,,,,,,,,,,,,,,,,,,,,,,,,,,,,,,,,,,,,,,,,,,,,,,,,,,,,
,757.33337,0.00012266439,0.00014857197,0.00036877565,0.00027614594,0.00039868288,0.00013010348,0.00021210723,9.1077066e-05,,,,,,,,,,,,,,,,,,,,,,,,,,,,,,,,,,,,,,,,,,,,,,,,,,,,,,,,,,,,,,,,,,,,,,,,,,
,756,0.00012441828,0.00015052849,0.00037297544,0.00027994851,0.00040293369,0.0001319387,0.0002151929,9.244441e-05,,,,,,,,,,,,,,,,,,,,,,,,,,,,,,,,,,,,,,,,,,,,,,,,,,,,,,,,,,,,,,,,,,,,,,,,,,
,754.66669,0.00012619717,0.00015251068,0.00037722287,0.00028380327,0.00040722962,0.00013379973,0.00021832332,9.3832219e-05,,,,,,,,,,,,,,,,,,,,,,,,,,,,,,,,,,,,,,,,,,,,,,,,,,,,,,,,,,,,,,,,,,,,,,,,,,
,753.33337,0.00012800149,0.00015451898,0.00038151866,0.0002877111,0.00041157136,0.000135687,0.00022149927,9.5240862e-05,,,,,,,,,,,,,,,,,,,,,,,,,,,,,,,,,,,,,,,,,,,,,,,,,,,,,,,,,,,,,,,,,,,,,,,,,,
,752,0.0001298317,0.00015655382,0.00038586357,0.00029167293,0.00041595958,0.00013760098,0.00022472157,9.6670718e-05,,,,,,,,,,,,,,,,,,,,,,,,,,,,,,,,,,,,,,,,,,,,,,,,,,,,,,,,,,,,,,,,,,,,,,,,,,
,750.66669,0.00013168799,0.00015861536,0.00039025776,0.00029568912,0.00042039439,0.00013954187,0.0002279906,9.8121973e-05,,,,,,,,,,,,,,,,,,,,,,,,,,,,,,,,,,,,,,,,,,,,,,,,,,,,,,,,,,,,,,,,,,,,,,,,,,
,749.33337,0.00013357081,0.00016070404,0.000394702,0.00029976062,0.00042487649,0.00014151014,0.00023130719,9.9595016e-05,,,,,,,,,,,,,,,,,,,,,,,,,,,,,,,,,,,,,,,,,,,,,,,,,,,,,,,,,,,,,,,,,,,,,,,,,,
,748,0.00013548065,0.00016282033,0.00039919705,0.00030388837,0.00042940657,0.00014350627,0.00023467217,0.00010109024,,,,,,,,,,,,,,,,,,,,,,,,,,,,,,,,,,,,,,,,,,,,,,,,,,,,,,,,,,,,,,,,,,,,,,,,,,
,746.66669,0.00013741771,0.00016496439,0.00040374308,0.00030807277,0.00043398475,0.00014553045,0.00023808595,0.00010260784,,,,,,,,,,,,,,,,,,,,,,,,,,,,,,,,,,,,,,,,,,,,,,,,,,,,,,,,,,,,,,,,,,,,,,,,,,
,745.33337,0.00013938246,0.00016713668,0.00040834089,0.00031231478,0.00043861174,0.00014758319,0.0002415494,0.00010414823,,,,,,,,,,,,,,,,,,,,,,,,,,,,,,,,,,,,,,,,,,,,,,,,,,,,,,,,,,,,,,,,,,,,,,,,,,
,744,0.00014137539,0.00016933768,0.00041299126,0.0003166154,0.00044328827,0.00014966498,0.00024506338,0.00010571181,,,,,,,,,,,,,,,,,,,,,,,,,,,,,,,,,,,,,,,,,,,,,,,,,,,,,,,,,,,,,,,,,,,,,,,,,,
,742.66669,0.00014339673,0.00017156756,0.00041769439,0.00032097505,0.00044801445,0.00015177604,0.00024862832,0.0001072988,,,,,,,,,,,,,,,,,,,,,,,,,,,,,,,,,,,,,,,,,,,,,,,,,,,,,,,,,,,,,,,,,,,,,,,,,,
,741.33337,0.00014544696,0.0001738268,0.00042245107,0.00032539472,0.00045279102,0.00015391687,0.00025224512,0.0001089096,,,,,,,,,,,,,,,,,,,,,,,,,,,,,,,,,,,,,,,,,,,,,,,,,,,,,,,,,,,,,,,,,,,,,,,,,,
,740,0.00014752661,0.0001761159,0.00042726214,0.00032987546,0.00045761874,0.000156088,0.00025591471,0.00011054467,,,,,,,,,,,,,,,,,,,,,,,,,,,,,,,,,,,,,,,,,,,,,,,,,,,,,,,,,,,,,,,,,,,,,,,,,,
,738.66669,0.00014963589,0.00017843504,0.00043212777,0.00033441768,0.0004624977,0.00015828965,0.0002596375,0.00011220421,,,,,,,,,,,,,,,,,,,,,,,,,,,,,,,,,,,,,,,,,,,,,,,,,,,,,,,,,,,,,,,,,,,,,,,,,,
,737.33337,0.00015177533,0.00018078471,0.00043704882,0.00033902245,0.00046742868,0.00016052236,0.00026341446,0.00011388866,,,,,,,,,,,,,,,,,,,,,,,,,,,,,,,,,,,,,,,,,,,,,,,,,,,,,,,,,,,,,,,,,,,,,,,,,,
,736,0.00015394546,0.00018316544,0.00044202614,0.00034369085,0.00047241247,0.00016278667,0.00026724653,0.00011559847,,,,,,,,,,,,,,,,,,,,,,,,,,,,,,,,,,,,,,,,,,,,,,,,,,,,,,,,,,,,,,,,,,,,,,,,,,
,734.66669,0.00015614652,0.00018557741,0.00044705991,0.0003484233,0.00047744916,0.00016508281,0.00027113417,0.00011733388,,,,,,,,,,,,,,,,,,,,,,,,,,,,,,,,,,,,,,,,,,,,,,,,,,,,,,,,,,,,,,,,,,,,,,,,,,
,733.33337,0.00015837905,0.00018802114,0.000452151,0.00035322093,0.00048253955,0.00016741134,0.00027507836,0.00011909534,,,,,,,,,,,,,,,,,,,,,,,,,,,,,,,,,,,,,,,,,,,,,,,,,,,,,,,,,,,,,,,,,,,,,,,,,,
,732,0.0001606436,0.00019049716,0.00045730031,0.00035808483,0.00048768445,0.00016977282,0.00027908012,0.00012088332,,,,,,,,,,,,,,,,,,,,,,,,,,,,,,,,,,,,,,,,,,,,,,,,,,,,,,,,,,,,,,,,,,,,,,,,,,
,730.66669,0.00016294043,0.00019300567,0.00046250802,0.00036301549,0.00049288396,0.0001721675,0.0002831399,0.00012269806,,,,,,,,,,,,,,,,,,,,,,,,,,,,,,,,,,,,,,,,,,,,,,,,,,,,,,,,,,,,,,,,,,,,,,,,,,
,729.33337,0.00016527009,0.00019554722,0.00046777503,0.00036801404,0.00049813891,0.00017459596,0.00028725874,0.00012454005,,,,,,,,,,,,,,,,,,,,,,,,,,,,,,,,,,,,,,,,,,,,,,,,,,,,,,,,,,,,,,,,,,,,,,,,,,
,728,0.00016763317,0.00019812235,0.00047310228,0.00037308165,0.00050345013,0.00017705879,0.0002914377,0.00012640978,,,,,,,,,,,,,,,,,,,,,,,,,,,,,,,,,,,,,,,,,,,,,,,,,,,,,,,,,,,,,,,,,,,,,,,,,,
,726.66669,0.00017002993,0.00020073127,0.00047848994,0.0003782188,0.00050881773,0.00017955624,0.00029567725,0.00012830749,,,,,,,,,,,,,,,,,,,,,,,,,,,,,,,,,,,,,,,,,,,,,,,,,,,,,,,,,,,,,,,,,,,,,,,,,,
,725.33337,0.00017246096,0.00020337455,0.00048393895,0.00038342669,0.00051424256,0.00018208892,0.00029997847,0.00013023369,,,,,,,,,,,,,,,,,,,,,,,,,,,,,,,,,,,,,,,,,,,,,,,,,,,,,,,,,,,,,,,,,,,,,,,,,,
,724,0.00017492686,0.00020605276,0.00048945028,0.00038870654,0.00051972548,0.00018465744,0.00030434246,0.00013218889,,,,,,,,,,,,,,,,,,,,,,,,,,,,,,,,,,,,,,,,,,,,,,,,,,,,,,,,,,,,,,,,,,,,,,,,,,
,722.66669,0.0001774279,0.00020876611,0.00049502411,0.00039405884,0.00052526661,0.00018726208,0.00030876974,0.00013417336,,,,,,,,,,,,,,,,,,,,,,,,,,,,,,,,,,,,,,,,,,,,,,,,,,,,,,,,,,,,,,,,,,,,,,,,,,
,721.33337,0.00017996471,0.0002115152,0.00050066142,0.00039948484,0.00053086681,0.00018990345,0.00031326142,0.00013618762,,,,,,,,,,,,,,,,,,,,,,,,,,,,,,,,,,,,,,,,,,,,,,,,,,,,,,,,,,,,,,,,,,,,,,,,,,
,720,0.0001825379,0.00021430061,0.00050636318,0.00040498581,0.00053652698,0.0001925822,0.00031781865,0.00013823221,,,,,,,,,,,,,,,,,,,,,,,,,,,,,,,,,,,,,,,,,,,,,,,,,,,,,,,,,,,,,,,,,,,,,,,,,,
,718.66669,0.00018514776,0.00021712257,0.00051212962,0.00041056227,0.00054224724,0.00019529861,0.00032244196,0.0001403074,,,,,,,,,,,,,,,,,,,,,,,,,,,,,,,,,,,,,,,,,,,,,,,,,,,,,,,,,,,,,,,,,,,,,,,,,,
,717.33337,0.00018779494,0.0002199817,0.00051796172,0.00041621552,0.00054802848,0.00019805334,0.00032713253,0.00014241374,,,,,,,,,,,,,,,,,,,,,,,,,,,,,,,,,,,,,,,,,,,,,,,,,,,,,,,,,,,,,,,,,,,,,,,,,,
,716,0.00019048009,0.0002228786,0.00052386051,0.00042194687,0.00055387163,0.00020084705,0.00033189156,0.00014455181,,,,,,,,,,,,,,,,,,,,,,,,,,,,,,,,,,,,,,,,,,,,,,,,,,,,,,,,,,,,,,,,,,,,,,,,,,
,714.66669,0.0001932035,0.00022581352,0.00052982621,0.00042775688,0.00055977681,0.00020368005,0.00033671959,0.00014672187,,,,,,,,,,,,,,,,,,,,,,,,,,,,,,,,,,,,,,,,,,,,,,,,,,,,,,,,,,,,,,,,,,,,,,,,,,
,713.33337,0.00019596586,0.00022878709,0.00053585984,0.00043364688,0.00056574494,0.000206553,0.00034161786,0.00014892451,,,,,,,,,,,,,,,,,,,,,,,,,,,,,,,,,,,,,,,,,,,,,,,,,,,,,,,,,,,,,,,,,,,,,,,,,,
,712,0.00019876784,0.00023179995,0.00054196246,0.00043961827,0.00057177699,0.0002094666,0.00034658761,0.00015116033,,,,,,,,,,,,,,,,,,,,,,,,,,,,,,,,,,,,,,,,,,,,,,,,,,,,,,,,,,,,,,,,,,,,,,,,,,
,710.66669,0.00020160975,0.00023485235,0.0005481343,0.0004456716,0.00057787307,0.00021242118,0.00035162942,0.0001534296,,,,,,,,,,,,,,,,,,,,,,,,,,,,,,,,,,,,,,,,,,,,,,,,,,,,,,,,,,,,,,,,,,,,,,,,,,
,709.33331,0.00020449243,0.00023794509,0.00055437671,0.00045180857,0.00058403442,0.00021541756,0.00035674482,0.00015573305,,,,,,,,,,,,,,,,,,,,,,,,,,,,,,,,,,,,,,,,,,,,,,,,,,,,,,,,,,,,,,,,,,,,,,,,,,
,708,0.00020741619,0.0002410784,0.00056068992,0.00045802976,0.00059026119,0.00021845607,0.00036193439,0.00015807097,,,,,,,,,,,,,,,,,,,,,,,,,,,,,,,,,,,,,,,,,,,,,,,,,,,,,,,,,,,,,,,,,,,,,,,,,,
,706.66669,0.00021038176,0.00024425298,0.00056707503,0.00046433661,0.00059655434,0.00022153744,0.00036719946,0.00016044398,,,,,,,,,,,,,,,,,,,,,,,,,,,,,,,,,,,,,,,,,,,,,,,,,,,,,,,,,,,,,,,,,,,,,,,,,,
,705.33331,0.00021338986,0.00024746952,0.00057353314,0.00047073059,0.00060291488,0.00022466242,0.00037254136,0.00016285274,,,,,,,,,,,,,,,,,,,,,,,,,,,,,,,,,,,,,,,,,,,,,,,,,,,,,,,,,,,,,,,,,,,,,,,,,,
,704,0.00021644083,0.00025072825,0.00058006451,0.00047721233,0.00060934294,0.00022783133,0.00037796073,0.00016529754,,,,,,,,,,,,,,,,,,,,,,,,,,,,,,,,,,,,,,,,,,,,,,,,,,,,,,,,,,,,,,,,,,,,,,,,,,
,702.66669,0.00021953543,0.00025402991,0.00058667025,0.00048378331,0.00061583953,0.00023104494,0.00038345893,0.00016777905,,,,,,,,,,,,,,,,,,,,,,,,,,,,,,,,,,,,,,,,,,,,,,,,,,,,,,,,,,,,,,,,,,,,,,,,,,
,701.33331,0.00022267441,0.00025737519,0.00059335153,0.00049044508,0.00062240569,0.00023430403,0.00038903738,0.00017029792,,,,,,,,,,,,,,,,,,,,,,,,,,,,,,,,,,,,,,,,,,,,,,,,,,,,,,,,,,,,,,,,,,,,,,,,,,
,700,0.00022585813,0.00026076437,0.00060010858,0.00049719828,0.00062904155,0.00023760894,0.00039469671,0.0001728545,,,,,,,,,,,,,,,,,,,,,,,,,,,,,,,,,,,,,,,,,,,,,,,,,,,,,,,,,,,,,,,,,,,,,,,,,,
,698.66669,0.00022908737,0.00026419817,0.00060694258,0.00050404446,0.00063574817,0.00024096046,0.00040043837,0.00017544945,,,,,,,,,,,,,,,,,,,,,,,,,,,,,,,,,,,,,,,,,,,,,,,,,,,,,,,,,,,,,,,,,,,,,,,,,,
,697.33331,0.00023236293,0.00026767736,0.00061385473,0.00051098523,0.00064252659,0.00024435942,0.00040626383,0.00017808348,,,,,,,,,,,,,,,,,,,,,,,,,,,,,,,,,,,,,,,,,,,,,,,,,,,,,,,,,,,,,,,,,,,,,,,,,,
,696,0.00023568518,0.0002712022,0.00062084527,0.00051802125,0.00064937698,0.00024780616,0.00041217375,0.00018075693,,,,,,,,,,,,,,,,,,,,,,,,,,,,,,,,,,,,,,,,,,,,,,,,,,,,,,,,,,,,,,,,,,,,,,,,,,
,694.66669,0.00023905492,0.00027477346,0.00062791542,0.00052515415,0.0006563004,0.00025130152,0.00041816965,0.00018347052,,,,,,,,,,,,,,,,,,,,,,,,,,,,,,,,,,,,,,,,,,,,,,,,,,,,,,,,,,,,,,,,,,,,,,,,,,
,693.33331,0.000242473,0.00027839191,0.00063506642,0.00053238561,0.00066329796,0.00025484634,0.00042425306,0.00018622498,,,,,,,,,,,,,,,,,,,,,,,,,,,,,,,,,,,,,,,,,,,,,,,,,,,,,,,,,,,,,,,,,,,,,,,,,,
,692,0.0002459398,0.00028205784,0.00064229852,0.0005397163,0.0006703698,0.000258441,0.00043042467,0.00018902065,,,,,,,,,,,,,,,,,,,,,,,,,,,,,,,,,,,,,,,,,,,,,,,,,,,,,,,,,,,,,,,,,,,,,,,,,,
,690.66669,0.00024945616,0.00028577205,0.00064961298,0.00054714794,0.00067751704,0.00026208637,0.00043668607,0.0001918583,,,,,,,,,,,,,,,,,,,,,,,,,,,,,,,,,,,,,,,,,,,,,,,,,,,,,,,,,,,,,,,,,,,,,,,,,,
,689.33331,0.00025302296,0.00028953534,0.00065701108,0.00055468225,0.00068474082,0.00026578333,0.00044303884,0.00019473868,,,,,,,,,,,,,,,,,,,,,,,,,,,,,,,,,,,,,,,,,,,,,,,,,,,,,,,,,,,,,,,,,,,,,,,,,,
,688,0.00025664059,0.00029334801,0.00066449308,0.00056231996,0.00069204127,0.00026953226,0.00044948374,0.00019766216,,,,,,,,,,,,,,,,,,,,,,,,,,,,,,,,,,,,,,,,,,,,,,,,,,,,,,,,,,,,,,,,,,,,,,,,,,
,686.66669,0.00026030995,0.00029721089,0.00067206029,0.00057006283,0.00069941957,0.00027333407,0.00045602239,0.00020062954,,,,,,,,,,,,,,,,,,,,,,,,,,,,,,,,,,,,,,,,,,,,,,,,,,,,,,,,,,,,,,,,,,,,,,,,,,
,685.33331,0.00026403194,0.00030112481,0.00067971403,0.00057791269,0.00070687687,0.00027718968,0.00046265646,0.0002036416,,,,,,,,,,,,,,,,,,,,,,,,,,,,,,,,,,,,,,,,,,,,,,,,,,,,,,,,,,,,,,,,,,,,,,,,,,
,684,0.00026780698,0.0003050901,0.00068745458,0.00058587027,0.00071441333,0.0002810995,0.00046938673,0.00020669874,,,,,,,,,,,,,,,,,,,,,,,,,,,,,,,,,,,,,,,,,,,,,,,,,,,,,,,,,,,,,,,,,,,,,,,,,,
,682.66669,0.00027163599,0.0003091076,0.00069528327,0.00059393742,0.00072203015,0.00028506447,0.00047621491,0.00020980178,,,,,,,,,,,,,,,,,,,,,,,,,,,,,,,,,,,,,,,,,,,,,,,,,,,,,,,,,,,,,,,,,,,,,,,,,,
,681.33331,0.00027551992,0.00031317819,0.00070320148,0.00060211603,0.00072972853,0.00028908555,0.00048314274,0.00021295154,,,,,,,,,,,,,,,,,,,,,,,,,,,,,,,,,,,,,,,,,,,,,,,,,,,,,,,,,,,,,,,,,,,,,,,,,,
,680,0.00027945921,0.0003173022,0.0007112095,0.00061040688,0.00073750863,0.00029316316,0.00049017103,0.00021614845,,,,,,,,,,,,,,,,,,,,,,,,,,,,,,,,,,,,,,,,,,,,,,,,,,,,,,,,,,,,,,,,,,,,,,,,,,
,678.66669,0.00028345482,0.00032148051,0.00071930872,0.00061881189,0.00074537168,0.00029729829,0.00049730155,0.00021939334,,,,,,,,,,,,,,,,,,,,,,,,,,,,,,,,,,,,,,,,,,,,,,,,,,,,,,,,,,,,,,,,,,,,,,,,,,
,677.33331,0.00028750774,0.00032571404,0.00072750054,0.00062733303,0.00075331892,0.00030149194,0.00050453614,0.00022268711,,,,,,,,,,,,,,,,,,,,,,,,,,,,,,,,,,,,,,,,,,,,,,,,,,,,,,,,,,,,,,,,,,,,,,,,,,
,676,0.00029161843,0.00033000312,0.00073578528,0.0006359711,0.00076135054,0.00030574455,0.00051187564,0.00022603017,,,,,,,,,,,,,,,,,,,,,,,,,,,,,,,,,,,,,,,,,,,,,,,,,,,,,,,,,,,,,,,,,,,,,,,,,,
,674.66669,0.00029578788,0.00033434868,0.00074416436,0.00064472812,0.00076946778,0.00031005714,0.00051932191,0.00022942341,,,,,,,,,,,,,,,,,,,,,,,,,,,,,,,,,,,,,,,,,,,,,,,,,,,,,,,,,,,,,,,,,,,,,,,,,,
,673.33331,0.00030001715,0.00033875167,0.00075263925,0.00065360612,0.00077767194,0.00031443077,0.00052687684,0.00023286776,,,,,,,,,,,,,,,,,,,,,,,,,,,,,,,,,,,,,,,,,,,,,,,,,,,,,,,,,,,,,,,,,,,,,,,,,,
,672,0.00030430669,0.00034321244,0.00076121026,0.00066260597,0.0007859632,0.00031886588,0.00053454133,0.00023636365,,,,,,,,,,,,,,,,,,,,,,,,,,,,,,,,,,,,,,,,,,,,,,,,,,,,,,,,,,,,,,,,,,,,,,,,,,
,670.66669,0.00030865756,0.00034773194,0.00076987889,0.00067172973,0.00079434285,0.00032336355,0.00054231731,0.00023991203,,,,,,,,,,,,,,,,,,,,,,,,,,,,,,,,,,,,,,,,,,,,,,,,,,,,,,,,,,,,,,,,,,,,,,,,,,
,669.33331,0.00031307084,0.00035231117,0.00077864663,0.00068097956,0.00080281224,0.00032792487,0.00055020678,0.00024351384,,,,,,,,,,,,,,,,,,,,,,,,,,,,,,,,,,,,,,,,,,,,,,,,,,,,,,,,,,,,,,,,,,,,,,,,,,
,668,0.00031754702,0.00035695049,0.00078751381,0.00069035632,0.00081137153,0.00033255032,0.00055821065,0.00024716956,,,,,,,,,,,,,,,,,,,,,,,,,,,,,,,,,,,,,,,,,,,,,,,,,,,,,,,,,,,,,,,,,,,,,,,,,,
,666.66669,0.00032208719,0.0003616509,0.00079648197,0.00069986219,0.00082002208,0.00033724102,0.00056633095,0.00025088016,,,,,,,,,,,,,,,,,,,,,,,,,,,,,,,,,,,,,,,,,,,,,,,,,,,,,,,,,,,,,,,,,,,,,,,,,,
,665.33331,0.0003266925,0.00036641343,0.00080555268,0.00070949941,0.00082876526,0.00034199809,0.00057456976,0.00025464663,,,,,,,,,,,,,,,,,,,,,,,,,,,,,,,,,,,,,,,,,,,,,,,,,,,,,,,,,,,,,,,,,,,,,,,,,,
,664,0.00033136343,0.00037123845,0.00081472627,0.00071926887,0.00083760126,0.00034682205,0.00058292803,0.00025846948,,,,,,,,,,,,,,,,,,,,,,,,,,,,,,,,,,,,,,,,,,,,,,,,,,,,,,,,,,,,,,,,,,,,,,,,,,
,662.66669,0.00033610115,0.00037612701,0.00082400433,0.00072917286,0.00084653146,0.00035171405,0.0005914079,0.00026234972,,,,,,,,,,,,,,,,,,,,,,,,,,,,,,,,,,,,,,,,,,,,,,,,,,,,,,,,,,,,,,,,,,,,,,,,,,
,661.33331,0.00034090683,0.00038108017,0.00083338848,0.00073921368,0.00085555728,0.00035667528,0.00060001152,0.00026628839,,,,,,,,,,,,,,,,,,,,,,,,,,,,,,,,,,,,,,,,,,,,,,,,,,,,,,,,,,,,,,,,,,,,,,,,,,
,660,0.00034578099,0.00038609833,0.00084287906,0.0007493923,0.00086467892,0.00036170626,0.0006087399,0.000270286,,,,,,,,,,,,,,,,,,,,,,,,,,,,,,,,,,,,,,,,,,,,,,,,,,,,,,,,,,,,,,,,,,,,,,,,,,
,658.66669,0.00035072485,0.00039118256,0.00085247772,0.00075971107,0.00087389782,0.00036680821,0.00061759525,0.00027434363,,,,,,,,,,,,,,,,,,,,,,,,,,,,,,,,,,,,,,,,,,,,,,,,,,,,,,,,,,,,,,,,,,,,,,,,,,
,657.33331,0.00035573962,0.00039633399,0.00086218614,0.00077017241,0.00088321543,0.00037198235,0.00062657983,0.00027846237,,,,,,,,,,,,,,,,,,,,,,,,,,,,,,,,,,,,,,,,,,,,,,,,,,,,,,,,,,,,,,,,,,,,,,,,,,
,656,0.00036082586,0.00040155301,0.00087200466,0.00078077732,0.00089263195,0.00037722924,0.0006356947,0.00028264275,,,,,,,,,,,,,,,,,,,,,,,,,,,,,,,,,,,,,,,,,,,,,,,,,,,,,,,,,,,,,,,,,,,,,,,,,,
,654.66669,0.00036598482,0.00040684076,0.000881935,0.00079152825,0.00090214887,0.00038255014,0.00064494217,0.00028688588,,,,,,,,,,,,,,,,,,,,,,,,,,,,,,,,,,,,,,,,,,,,,,,,,,,,,,,,,,,,,,,,,,,,,,,,,,
,653.33331,0.00037121778,0.00041219838,0.00089197889,0.00080242771,0.00091176769,0.00038794634,0.00065432459,0.00029119291,,,,,,,,,,,,,,,,,,,,,,,,,,,,,,,,,,,,,,,,,,,,,,,,,,,,,,,,,,,,,,,,,,,,,,,,,,
,652,0.00037652532,0.00041762631,0.0009021367,0.00081347676,0.00092148863,0.00039341841,0.00066384306,0.00029556441,,,,,,,,,,,,,,,,,,,,,,,,,,,,,,,,,,,,,,,,,,,,,,,,,,,,,,,,,,,,,,,,,,,,,,,,,,
,650.66669,0.00038190875,0.00042312572,0.00091241018,0.00082467794,0.00093131321,0.00039896766,0.0006735,0.00030000152,,,,,,,,,,,,,,,,,,,,,,,,,,,,,,,,,,,,,,,,,,,,,,,,,,,,,,,,,,,,,,,,,,,,,,,,,,
,649.33331,0.0003873694,0.0004286978,0.00092280114,0.00083603389,0.00094124299,0.00040459544,0.00068329787,0.00030450546,,,,,,,,,,,,,,,,,,,,,,,,,,,,,,,,,,,,,,,,,,,,,,,,,,,,,,,,,,,,,,,,,,,,,,,,,,
,648,0.00039290787,0.00043434299,0.00093330994,0.00084754567,0.00095127818,0.00041030235,0.00069323782,0.00030907681,,,,,,,,,,,,,,,,,,,,,,,,,,,,,,,,,,,,,,,,,,,,,,,,,,,,,,,,,,,,,,,,,,,,,,,,,,
,646.66669,0.00039852553,0.00044006253,0.00094393843,0.00085921597,0.00096142036,0.00041608975,0.00070332236,0.00031371678,,,,,,,,,,,,,,,,,,,,,,,,,,,,,,,,,,,,,,,,,,,,,,,,,,,,,,,,,,,,,,,,,,,,,,,,,,
,645.33331,0.00040422377,0.00044585765,0.00095468844,0.00087104751,0.00097167115,0.00042195906,0.00071355408,0.00031842663,,,,,,,,,,,,,,,,,,,,,,,,,,,,,,,,,,,,,,,,,,,,,,,,,,,,,,,,,,,,,,,,,,,,,,,,,,
,644,0.00041000322,0.00045172881,0.00096556038,0.00088304141,0.00098203075,0.00042791088,0.00072393416,0.00032320696,,,,,,,,,,,,,,,,,,,,,,,,,,,,,,,,,,,,,,,,,,,,,,,,,,,,,,,,,,,,,,,,,,,,,,,,,,
,642.66669,0.0004158653,0.00045767728,0.00097655613,0.00089520047,0.00099250081,0.00043394665,0.00073446525,0.00032805906,,,,,,,,,,,,,,,,,,,,,,,,,,,,,,,,,,,,,,,,,,,,,,,,,,,,,,,,,,,,,,,,,,,,,,,,,,
,641.33331,0.00042181147,0.00046370437,0.0009876776,0.00090752752,0.001003083,0.00044006785,0.00074515002,0.00033298423,,,,,,,,,,,,,,,,,,,,,,,,,,,,,,,,,,,,,,,,,,,,,,,,,,,,,,,,,,,,,,,,,,,,,,,,,,
,640,0.00042784238,0.00046981054,0.00099892522,0.00092002374,0.0010137775,0.0004462751,0.00075598973,0.00033798311,,,,,,,,,,,,,,,,,,,,,,,,,,,,,,,,,,,,,,,,,,,,,,,,,,,,,,,,,,,,,,,,,,,,,,,,,,
,638.66669,0.00043395953,0.00047599712,0.0010103009,0.00093269202,0.001024586,0.0004525699,0.00076698713,0.00034305703,,,,,,,,,,,,,,,,,,,,,,,,,,,,,,,,,,,,,,,,,,,,,,,,,,,,,,,,,,,,,,,,,,,,,,,,,,
,637.33331,0.00044016441,0.00048226545,0.0010218067,0.00094553534,0.0010355103,0.00045895379,0.00077814502,0.00034820736,,,,,,,,,,,,,,,,,,,,,,,,,,,,,,,,,,,,,,,,,,,,,,,,,,,,,,,,,,,,,,,,,,,,,,,,,,
,636,0.00044645773,0.00048861604,0.001033443,0.0009585549,0.0010465505,0.00046542744,0.00078946471,0.00035343478,,,,,,,,,,,,,,,,,,,,,,,,,,,,,,,,,,,,,,,,,,,,,,,,,,,,,,,,,,,,,,,,,,,,,,,,,,
,634.66669,0.00045284102,0.00049505026,0.0010452118,0.00097175375,0.0010577085,0.00047199239,0.00080094907,0.00035874067,,,,,,,,,,,,,,,,,,,,,,,,,,,,,,,,,,,,,,,,,,,,,,,,,,,,,,,,,,,,,,,,,,,,,,,,,,
,633.33331,0.00045931588,0.0005015695,0.0010571151,0.00098513495,0.0010689859,0.00047865025,0.00081260103,0.00036412646,,,,,,,,,,,,,,,,,,,,,,,,,,,,,,,,,,,,,,,,,,,,,,,,,,,,,,,,,,,,,,,,,,,,,,,,,,
,632,0.00046588302,0.00050817429,0.0010691535,0.00099869978,0.001080383,0.00048540171,0.00082442196,0.00036959286,,,,,,,,,,,,,,,,,,,,,,,,,,,,,,,,,,,,,,,,,,,,,,,,,,,,,,,,,,,,,,,,,,,,,,,,,,
,630.66669,0.00047254405,0.00051486605,0.001081329,0.0010124514,0.0010919017,0.00049224841,0.00083641484,0.00037514132,,,,,,,,,,,,,,,,,,,,,,,,,,,,,,,,,,,,,,,,,,,,,,,,,,,,,,,,,,,,,,,,,,,,,,,,,,
,629.33331,0.00047930063,0.00052164625,0.0010936436,0.001026393,0.0011035437,0.000499192,0.00084858274,0.00038077333,,,,,,,,,,,,,,,,,,,,,,,,,,,,,,,,,,,,,,,,,,,,,,,,,,,,,,,,,,,,,,,,,,,,,,,,,,
,628,0.0004861535,0.00052851541,0.001106098,0.001040526,0.0011153092,0.00050623321,0.00086092709,0.00038648964,,,,,,,,,,,,,,,,,,,,,,,,,,,,,,,,,,,,,,,,,,,,,,,,,,,,,,,,,,,,,,,,,,,,,,,,,,
,626.66669,0.00049310436,0.00053547503,0.0011186942,0.0010548535,0.0011272003,0.00051337374,0.00087345102,0.00039229176,,,,,,,,,,,,,,,,,,,,,,,,,,,,,,,,,,,,,,,,,,,,,,,,,,,,,,,,,,,,,,,,,,,,,,,,,,
,625.33331,0.00050015491,0.00054252662,0.0011314344,0.001069379,0.0011392186,0.00052061532,0.00088615771,0.00039818126,,,,,,,,,,,,,,,,,,,,,,,,,,,,,,,,,,,,,,,,,,,,,,,,,,,,,,,,,,,,,,,,,,,,,,,,,,
,624,0.00050730595,0.00054967075,0.0011443191,0.0010841038,0.0011513646,0.00052795871,0.00089904867,0.0004041589,,,,,,,,,,,,,,,,,,,,,,,,,,,,,,,,,,,,,,,,,,,,,,,,,,,,,,,,,,,,,,,,,,,,,,,,,,
,622.66669,0.00051455924,0.00055690894,0.0011573506,0.0010990314,0.00116364,0.00053540568,0.00091212715,0.00041022628,,,,,,,,,,,,,,,,,,,,,,,,,,,,,,,,,,,,,,,,,,,,,,,,,,,,,,,,,,,,,,,,,,,,,,,,,,
,621.33331,0.00052191656,0.00056424279,0.001170531,0.0011141652,0.0011760469,0.00054295804,0.00092539649,0.00041638502,,,,,,,,,,,,,,,,,,,,,,,,,,,,,,,,,,,,,,,,,,,,,,,,,,,,,,,,,,,,,,,,,,,,,,,,,,
,620,0.00052937874,0.00057167288,0.0011838609,0.0011295068,0.0011885855,0.00055061658,0.00093885825,0.00042263594,,,,,,,,,,,,,,,,,,,,,,,,,,,,,,,,,,,,,,,,,,,,,,,,,,,,,,,,,,,,,,,,,,,,,,,,,,
,618.66669,0.00053694761,0.00057920081,0.0011973427,0.0011450595,0.0012012577,0.00055838314,0.00095251584,0.00042898071,,,,,,,,,,,,,,,,,,,,,,,,,,,,,,,,,,,,,,,,,,,,,,,,,,,,,,,,,,,,,,,,,,,,,,,,,,
,617.33331,0.00054462505,0.00058682822,0.0012109786,0.0011608272,0.0012140657,0.00056625962,0.00096637275,0.00043542102,,,,,,,,,,,,,,,,,,,,,,,,,,,,,,,,,,,,,,,,,,,,,,,,,,,,,,,,,,,,,,,,,,,,,,,,,,
,616,0.00055241191,0.00059455572,0.0012247691,0.0011768112,0.0012270096,0.00057424683,0.00098043059,0.00044195771,,,,,,,,,,,,,,,,,,,,,,,,,,,,,,,,,,,,,,,,,,,,,,,,,,,,,,,,,,,,,,,,,,,,,,,,,,
,614.66669,0.0005603101,0.00060238497,0.0012387167,0.0011930153,0.0012400915,0.00058234671,0.00099469294,0.00044859254,,,,,,,,,,,,,,,,,,,,,,,,,,,,,,,,,,,,,,,,,,,,,,,,,,,,,,,,,,,,,,,,,,,,,,,,,,
,613.33331,0.00056832159,0.00061031769,0.0012528238,0.0012094434,0.0012533136,0.00059056121,0.0010091634,0.00045532728,,,,,,,,,,,,,,,,,,,,,,,,,,,,,,,,,,,,,,,,,,,,,,,,,,,,,,,,,,,,,,,,,,,,,,,,,,
,612,0.00057644725,0.0006183545,0.0012670909,0.0012260968,0.0012666759,0.0005988912,0.0010238437,0.00046216282,,,,,,,,,,,,,,,,,,,,,,,,,,,,,,,,,,,,,,,,,,,,,,,,,,,,,,,,,,,,,,,,,,,,,,,,,,
,610.66669,0.00058468909,0.00062649714,0.0012815205,0.0012429796,0.0012801808,0.00060733869,0.0010387376,0.00046910098,,,,,,,,,,,,,,,,,,,,,,,,,,,,,,,,,,,,,,,,,,,,,,,,,,,,,,,,,,,,,,,,,,,,,,,,,,
,609.33331,0.00059304916,0.00063474739,0.001296115,0.0012600956,0.0012938302,0.00061590573,0.0010538489,0.00047614361,,,,,,,,,,,,,,,,,,,,,,,,,,,,,,,,,,,,,,,,,,,,,,,,,,,,,,,,,,,,,,,,,,,,,,,,,,
,608,0.00060152837,0.0006431059,0.0013108751,0.0012774465,0.0013076246,0.00062459321,0.0010691792,0.00048329165,,,,,,,,,,,,,,,,,,,,,,,,,,,,,,,,,,,,,,,,,,,,,,,,,,,,,,,,,,,,,,,,,,,,,,,,,,
,606.66669,0.00061012881,0.00065157447,0.0013258033,0.0012950363,0.001321566,0.00063340323,0.0010847326,0.000490547,,,,,,,,,,,,,,,,,,,,,,,,,,,,,,,,,,,,,,,,,,,,,,,,,,,,,,,,,,,,,,,,,,,,,,,,,,
,605.33331,0.00061885262,0.00066015496,0.0013409022,0.0013128692,0.0013356567,0.00064233793,0.0011005129,0.00049791161,,,,,,,,,,,,,,,,,,,,,,,,,,,,,,,,,,,,,,,,,,,,,,,,,,,,,,,,,,,,,,,,,,,,,,,,,,
,604,0.00062770075,0.00066884804,0.0013561723,0.0013309468,0.001349897,0.00065139825,0.0011165221,0.00050538643,,,,,,,,,,,,,,,,,,,,,,,,,,,,,,,,,,,,,,,,,,,,,,,,,,,,,,,,,,,,,,,,,,,,,,,,,,
,602.66669,0.0006366754,0.0006776556,0.0013716163,0.0013492733,0.0013642891,0.00066058636,0.0011327642,0.00051297348,,,,,,,,,,,,,,,,,,,,,,,,,,,,,,,,,,,,,,,,,,,,,,,,,,,,,,,,,,,,,,,,,,,,,,,,,,
,601.33331,0.00064577878,0.00068657954,0.0013872369,0.001367853,0.0013788353,0.0006699045,0.0011492433,0.00052067477,,,,,,,,,,,,,,,,,,,,,,,,,,,,,,,,,,,,,,,,,,,,,,,,,,,,,,,,,,,,,,,,,,,,,,,,,,
,600,0.0006550119,0.00069562059,0.0014030347,0.0013866876,0.001393536,0.00067935365,0.0011659614,0.00052849133,,,,,,,,,,,,,,,,,,,,,,,,,,,,,,,,,,,,,,,,,,,,,,,,,,,,,,,,,,,,,,,,,,,,,,,,,,
,598.66669,0.00066437703,0.00070478069,0.0014190124,0.0014057817,0.0014083933,0.00068893607,0.0011829226,0.00053642523,,,,,,,,,,,,,,,,,,,,,,,,,,,,,,,,,,,,,,,,,,,,,,,,,,,,,,,,,,,,,,,,,,,,,,,,,,
,597.33331,0.00067387649,0.00071406184,0.0014351727,0.0014251395,0.0014234098,0.00069865411,0.0012001314,0.00054447861,,,,,,,,,,,,,,,,,,,,,,,,,,,,,,,,,,,,,,,,,,,,,,,,,,,,,,,,,,,,,,,,,,,,,,,,,,
,596,0.00068351134,0.00072346478,0.0014515164,0.001444763,0.0014385857,0.00070850878,0.0012175898,0.00055265252,,,,,,,,,,,,,,,,,,,,,,,,,,,,,,,,,,,,,,,,,,,,,,,,,,,,,,,,,,,,,,,,,,,,,,,,,,
,594.66669,0.00069328395,0.00073299154,0.0014680462,0.0014646567,0.0014539234,0.00071850245,0.0012353021,0.00056094914,,,,,,,,,,,,,,,,,,,,,,,,,,,,,,,,,,,,,,,,,,,,,,,,,,,,,,,,,,,,,,,,,,,,,,,,,,
,593.33331,0.00070319674,0.0007426442,0.001484765,0.0014848252,0.0014694253,0.00072863755,0.0012532728,0.0005693707,,,,,,,,,,,,,,,,,,,,,,,,,,,,,,,,,,,,,,,,,,,,,,,,,,,,,,,,,,,,,,,,,,,,,,,,,,
,592,0.0007132508,0.00075242352,0.0015016734,0.0015052706,0.0014850918,0.00073891513,0.0012715042,0.0005779183,,,,,,,,,,,,,,,,,,,,,,,,,,,,,,,,,,,,,,,,,,,,,,,,,,,,,,,,,,,,,,,,,,,,,,,,,,
,590.66669,0.0007234486,0.00076233162,0.0015187744,0.0015259974,0.0015009253,0.00074933769,0.0012900008,0.00058659421,,,,,,,,,,,,,,,,,,,,,,,,,,,,,,,,,,,,,,,,,,,,,,,,,,,,,,,,,,,,,,,,,,,,,,,,,,
,589.33331,0.00073379269,0.00077237065,0.0015360709,0.0015470106,0.0015169283,0.00075990775,0.0013087674,0.00059540078,,,,,,,,,,,,,,,,,,,,,,,,,,,,,,,,,,,,,,,,,,,,,,,,,,,,,,,,,,,,,,,,,,,,,,,,,,
,588,0.00074428421,0.00078254141,0.0015535636,0.0015683122,0.0015331013,0.00077062641,0.001327806,0.00060433915,,,,,,,,,,,,,,,,,,,,,,,,,,,,,,,,,,,,,,,,,,,,,,,,,,,,,,,,,,,,,,,,,,,,,,,,,,
,586.66669,0.00075492572,0.00079284611,0.0015712555,0.0015899071,0.0015494466,0.00078149626,0.0013471216,0.00061341171,,,,,,,,,,,,,,,,,,,,,,,,,,,,,,,,,,,,,,,,,,,,,,,,,,,,,,,,,,,,,,,,,,,,,,,,,,
,585.33331,0.00076571988,0.00080328698,0.0015891497,0.0016118004,0.001565967,0.00079251994,0.0013667192,0.00062262089,,,,,,,,,,,,,,,,,,,,,,,,,,,,,,,,,,,,,,,,,,,,,,,,,,,,,,,,,,,,,,,,,,,,,,,,,,
,584,0.00077666787,0.00081386486,0.0016072468,0.0016339941,0.0015826628,0.0008036986,0.0013866009,0.0006319679,,,,,,,,,,,,,,,,,,,,,,,,,,,,,,,,,,,,,,,,,,,,,,,,,,,,,,,,,,,,,,,,,,,,,,,,,,
,582.66669,0.0007877724,0.00082458203,0.0016255501,0.0016564934,0.0015995366,0.00081503494,0.0014067718,0.00064145523,,,,,,,,,,,,,,,,,,,,,,,,,,,,,,,,,,,,,,,,,,,,,,,,,,,,,,,,,,,,,,,,,,,,,,,,,,
,581.33331,0.00079903621,0.00083544083,0.0016440626,0.0016793036,0.001616591,0.00082653172,0.001427237,0.00065108543,,,,,,,,,,,,,,,,,,,,,,,,,,,,,,,,,,,,,,,,,,,,,,,,,,,,,,,,,,,,,,,,,,,,,,,,,,
,580,0.00081046055,0.00084644212,0.0016627851,0.0017024268,0.0016338266,0.00083819012,0.0014479991,0.00066085976,,,,,,,,,,,,,,,,,,,,,,,,,,,,,,,,,,,,,,,,,,,,,,,,,,,,,,,,,,,,,,,,,,,,,,,,,,
,578.66669,0.00082204823,0.00085758827,0.0016817208,0.0017258684,0.0016512458,0.00085001297,0.0014690632,0.00067078082,,,,,,,,,,,,,,,,,,,,,,,,,,,,,,,,,,,,,,,,,,,,,,,,,,,,,,,,,,,,,,,,,,,,,,,,,,
,577.33331,0.00083380213,0.00086888173,0.001700873,0.0017496339,0.0016688516,0.00086200314,0.0014904346,0.00068085129,,,,,,,,,,,,,,,,,,,,,,,,,,,,,,,,,,,,,,,,,,,,,,,,,,,,,,,,,,,,,,,,,,,,,,,,,,
,576,0.00084572354,0.00088032337,0.0017202425,0.0017737255,0.0016866443,0.00087416188,0.001512116,0.00069107247,,,,,,,,,,,,,,,,,,,,,,,,,,,,,,,,,,,,,,,,,,,,,,,,,,,,,,,,,,,,,,,,,,,,,,,,,,
,574.66669,0.00085781539,0.00089191568,0.0017398325,0.0017981489,0.0017046267,0.00088649212,0.0015341128,0.0007014471,,,,,,,,,,,,,,,,,,,,,,,,,,,,,,,,,,,,,,,,,,,,,,,,,,,,,,,,,,,,,,,,,,,,,,,,,,
,573.33331,0.0008700807,0.00090366119,0.0017596465,0.0018229096,0.0017228016,0.00089899686,0.0015564306,0.00071197796,,,,,,,,,,,,,,,,,,,,,,,,,,,,,,,,,,,,,,,,,,,,,,,,,,,,,,,,,,,,,,,,,,,,,,,,,,
,572,0.00088252081,0.00091556082,0.0017796853,0.0018480102,0.0017411695,0.0009116774,0.001579072,0.00072266643,,,,,,,,,,,,,,,,,,,,,,,,,,,,,,,,,,,,,,,,,,,,,,,,,,,,,,,,,,,,,,,,,,,,,,,,,,
,570.66669,0.00089513878,0.00092761715,0.0017999522,0.0018734565,0.0017597332,0.00092453681,0.0016020428,0.00073351536,,,,,,,,,,,,,,,,,,,,,,,,,,,,,,,,,,,,,,,,,,,,,,,,,,,,,,,,,,,,,,,,,,,,,,,,,,
,569.33331,0.00090793775,0.0009398328,0.0018204509,0.0018992542,0.0017784957,0.0009375782,0.0016253488,0.00074452766,,,,,,,,,,,,,,,,,,,,,,,,,,,,,,,,,,,,,,,,,,,,,,,,,,,,,,,,,,,,,,,,,,,,,,,,,,
,568,0.00092091913,0.00095220875,0.0018411821,0.0019254061,0.0017974574,0.00095080294,0.0016489928,0.00075570478,,,,,,,,,,,,,,,,,,,,,,,,,,,,,,,,,,,,,,,,,,,,,,,,,,,,,,,,,,,,,,,,,,,,,,,,,,
,566.66669,0.00093408611,0.00096474766,0.0018621494,0.001951918,0.0018166213,0.00096421422,0.0016729808,0.00076704969,,,,,,,,,,,,,,,,,,,,,,,,,,,,,,,,,,,,,,,,,,,,,,,,,,,,,,,,,,,,,,,,,,,,,,,,,,
,565.33331,0.00094744196,0.00097745228,0.0018833564,0.0019787962,0.0018359903,0.00097781529,0.0016973188,0.00077856545,,,,,,,,,,,,,,,,,,,,,,,,,,,,,,,,,,,,,,,,,,,,,,,,,,,,,,,,,,,,,,,,,,,,,,,,,,
,564,0.00096098815,0.00099032361,0.001904804,0.0020060433,0.001855565,0.00099160759,0.0017220097,0.00079025355,,,,,,,,,,,,,,,,,,,,,,,,,,,,,,,,,,,,,,,,,,,,,,,,,,,,,,,,,,,,,,,,,,,,,,,,,,
,562.66669,0.00097472802,0.0010033644,0.0019264958,0.0020336655,0.0018753483,0.0010055944,0.0017470598,0.00080211712,,,,,,,,,,,,,,,,,,,,,,,,,,,,,,,,,,,,,,,,,,,,,,,,,,,,,,,,,,,,,,,,,,,,,,,,,,
,561.33331,0.00098866498,0.0010165776,0.0019484356,0.0020616694,0.0018953435,0.0010197792,0.0017724755,0.00081415935,,,,,,,,,,,,,,,,,,,,,,,,,,,,,,,,,,,,,,,,,,,,,,,,,,,,,,,,,,,,,,,,,,,,,,,,,,
,560,0.0010028006,0.0010299641,0.0019706243,0.0020900576,0.001915551,0.0010341634,0.0017982597,0.0008263818,,,,,,,,,,,,,,,,,,,,,,,,,,,,,,,,,,,,,,,,,,,,,,,,,,,,,,,,,,,,,,,,,,,,,,,,,,
,558.66669,0.0010171383,0.001043527,0.0019930657,0.0021188367,0.0019359739,0.0010487505,0.001824419,0.00083878774,,,,,,,,,,,,,,,,,,,,,,,,,,,,,,,,,,,,,,,,,,,,,,,,,,,,,,,,,,,,,,,,,,,,,,,,,,
,557.33331,0.0010316816,0.001057269,0.0020157636,0.0021480134,0.0019566155,0.001063544,0.0018509601,0.0008513805,,,,,,,,,,,,,,,,,,,,,,,,,,,,,,,,,,,,,,,,,,,,,,,,,,,,,,,,,,,,,,,,,,,,,,,,,,
,556,0.0010464322,0.0010711914,0.002038719,0.0021775905,0.0019774762,0.0010785456,0.0018778861,0.00086416173,,,,,,,,,,,,,,,,,,,,,,,,,,,,,,,,,,,,,,,,,,,,,,,,,,,,,,,,,,,,,,,,,,,,,,,,,,
,554.66669,0.0010613938,0.0010852971,0.0020619359,0.0022075749,0.0019985594,0.0010937587,0.0019052037,0.00087713484,,,,,,,,,,,,,,,,,,,,,,,,,,,,,,,,,,,,,,,,,,,,,,,,,,,,,,,,,,,,,,,,,,,,,,,,,,
,553.33331,0.0010765699,0.0010995892,0.0020854181,0.0022379735,0.0020198683,0.0011091871,0.00193292,0.00089030331,,,,,,,,,,,,,,,,,,,,,,,,,,,,,,,,,,,,,,,,,,,,,,,,,,,,,,,,,,,,,,,,,,,,,,,,,,
,552,0.0010919623,0.0011140689,0.0021091668,0.0022687894,0.0020414034,0.0011248324,0.0019610383,0.00090366886,,,,,,,,,,,,,,,,,,,,,,,,,,,,,,,,,,,,,,,,,,,,,,,,,,,,,,,,,,,,,,,,,,,,,,,,,,
,550.66669,0.0011075748,0.0011287392,0.0021331858,0.0023000295,0.0020631681,0.0011406984,0.0019895655,0.00091723506,,,,,,,,,,,,,,,,,,,,,,,,,,,,,,,,,,,,,,,,,,,,,,,,,,,,,,,,,,,,,,,,,,,,,,,,,,
,549.33331,0.0011234112,0.0011436034,0.0021574796,0.0023317013,0.0020851658,0.0011567889,0.0020185091,0.00093100556,,,,,,,,,,,,,,,,,,,,,,,,,,,,,,,,,,,,,,,,,,,,,,,,,,,,,,,,,,,,,,,,,,,,,,,,,,
,548,0.0011394734,0.0011586626,0.0021820488,0.0023638077,0.0021073971,0.0011731057,0.0020478724,0.00094498215,,,,,,,,,,,,,,,,,,,,,,,,,,,,,,,,,,,,,,,,,,,,,,,,,,,,,,,,,,,,,,,,,,,,,,,,,,
,546.66669,0.0011557652,0.0011739202,0.0022068979,0.0023963562,0.0021298654,0.0011896526,0.0020776629,0.00095916856,,,,,,,,,,,,,,,,,,,,,,,,,,,,,,,,,,,,,,,,,,,,,,,,,,,,,,,,,,,,,,,,,,,,,,,,,,
,545.33331,0.0011722907,0.0011893794,0.0022320311,0.0024293544,0.0021525743,0.0012064337,0.0021078881,0.00097356861,,,,,,,,,,,,,,,,,,,,,,,,,,,,,,,,,,,,,,,,,,,,,,,,,,,,,,,,,,,,,,,,,,,,,,,,,,
,544,0.0011890517,0.0012050414,0.0022574493,0.0024628054,0.0021755243,0.0012234507,0.0021385515,0.00098818417,,,,,,,,,,,,,,,,,,,,,,,,,,,,,,,,,,,,,,,,,,,,,,,,,,,,,,,,,,,,,,,,,,,,,,,,,,
,542.66669,0.0012060523,0.0012209097,0.002283157,0.0024967171,0.0021987189,0.0012407077,0.0021696611,0.0010030191,,,,,,,,,,,,,,,,,,,,,,,,,,,,,,,,,,,,,,,,,,,,,,,,,,,,,,,,,,,,,,,,,,,,,,,,,,
,541.33331,0.0012232968,0.0012369877,0.0023091587,0.0025310973,0.0022221619,0.001258209,0.0022012247,0.0010180775,,,,,,,,,,,,,,,,,,,,,,,,,,,,,,,,,,,,,,,,,,,,,,,,,,,,,,,,,,,,,,,,,,,,,,,,,,
,540,0.0012407871,0.0012532766,0.0023354552,0.0025659492,0.0022458538,0.0012759563,0.0022332459,0.0010333613,,,,,,,,,,,,,,,,,,,,,,,,,,,,,,,,,,,,,,,,,,,,,,,,,,,,,,,,,,,,,,,,,,,,,,,,,,
,538.66669,0.0012585274,0.0012697801,0.0023620513,0.0026012811,0.0022697983,0.0012939539,0.002265733,0.0010488745,,,,,,,,,,,,,,,,,,,,,,,,,,,,,,,,,,,,,,,,,,,,,,,,,,,,,,,,,,,,,,,,,,,,,,,,,,
,537.33331,0.0012765222,0.0012865016,0.0023889514,0.0026371012,0.0022939992,0.0013122063,0.0022986942,0.0010646213,,,,,,,,,,,,,,,,,,,,,,,,,,,,,,,,,,,,,,,,,,,,,,,,,,,,,,,,,,,,,,,,,,,,,,,,,,
,536,0.0012947735,0.0013034426,0.0024161567,0.0026734128,0.002318457,0.0013307152,0.0023321333,0.0010806037,,,,,,,,,,,,,,,,,,,,,,,,,,,,,,,,,,,,,,,,,,,,,,,,,,,,,,,,,,,,,,,,,,,,,,,,,,
,534.66669,0.0013132857,0.0013206066,0.0024436717,0.0027102244,0.0023431755,0.0013494852,0.0023660589,0.0010968262,,,,,,,,,,,,,,,,,,,,,,,,,,,,,,,,,,,,,,,,,,,,,,,,,,,,,,,,,,,,,,,,,,,,,,,,,,
,533.33331,0.0013320635,0.0013379975,0.0024715014,0.0027475446,0.0023681588,0.0013685209,0.0024004796,0.0011132929,,,,,,,,,,,,,,,,,,,,,,,,,,,,,,,,,,,,,,,,,,,,,,,,,,,,,,,,,,,,,,,,,,,,,,,,,,
,532,0.0013511088,0.0013556166,0.0024996467,0.002785377,0.0023934072,0.0013878242,0.0024353994,0.001130006,,,,,,,,,,,,,,,,,,,,,,,,,,,,,,,,,,,,,,,,,,,,,,,,,,,,,,,,,,,,,,,,,,,,,,,,,,
,530.66669,0.0013704265,0.0013734677,0.0025281126,0.0028237303,0.0024189249,0.0014073997,0.0024708272,0.0011469701,,,,,,,,,,,,,,,,,,,,,,,,,,,,,,,,,,,,,,,,,,,,,,,,,,,,,,,,,,,,,,,,,,,,,,,,,,
,529.33331,0.0013900213,0.0013915547,0.0025569039,0.0028626135,0.0024447157,0.0014272523,0.0025067721,0.0011641896,,,,,,,,,,,,,,,,,,,,,,,,,,,,,,,,,,,,,,,,,,,,,,,,,,,,,,,,,,,,,,,,,,,,,,,,,,
,528,0.0014098953,0.001409879,0.0025860218,0.0029020303,0.0024707804,0.001447384,0.0025432381,0.0011816668,,,,,,,,,,,,,,,,,,,,,,,,,,,,,,,,,,,,,,,,,,,,,,,,,,,,,,,,,,,,,,,,,,,,,,,,,,
,526.66669,0.0014300535,0.0014284446,0.0026154712,0.0029419899,0.002497123,0.0014677997,0.0025802347,0.0011994064,,,,,,,,,,,,,,,,,,,,,,,,,,,,,,,,,,,,,,,,,,,,,,,,,,,,,,,,,,,,,,,,,,,,,,,,,,
,525.33331,0.0014505009,0.0014472556,0.0026452575,0.0029825015,0.0025237476,0.0014885043,0.0026177711,0.0012174132,,,,,,,,,,,,,,,,,,,,,,,,,,,,,,,,,,,,,,,,,,,,,,,,,,,,,,,,,,,,,,,,,,,,,,,,,,
,524,0.0014712396,0.0014663134,0.0026753815,0.0030235692,0.0025506549,0.0015094999,0.0026558519,0.0012356894,,,,,,,,,,,,,,,,,,,,,,,,,,,,,,,,,,,,,,,,,,,,,,,,,,,,,,,,,,,,,,,,,,,,,,,,,,
,522.66669,0.0014922749,0.0014856222,0.0027058486,0.0030652023,0.0025778491,0.0015307917,0.0026944866,0.00125424,,,,,,,,,,,,,,,,,,,,,,,,,,,,,,,,,,,,,,,,,,,,,,,,,,,,,,,,,,,,,,,,,,,,,,,,,,
,521.33331,0.0015136119,0.0015051861,0.0027366641,0.0031074106,0.0026053344,0.0015523849,0.0027336852,0.00127307,,,,,,,,,,,,,,,,,,,,,,,,,,,,,,,,,,,,,,,,,,,,,,,,,,,,,,,,,,,,,,,,,,,,,,,,,,
,520,0.001535253,0.0015250068,0.002767829,0.0031501981,0.0026331115,0.0015742816,0.0027734522,0.0012921818,,,,,,,,,,,,,,,,,,,,,,,,,,,,,,,,,,,,,,,,,,,,,,,,,,,,,,,,,,,,,,,,,,,,,,,,,,
,518.66669,0.0015572035,0.0015450884,0.0027993489,0.0031935748,0.0026611848,0.0015964872,0.0028137976,0.0013115805,,,,,,,,,,,,,,,,,,,,,,,,,,,,,,,,,,,,,,,,,,,,,,,,,,,,,,,,,,,,,,,,,,,,,,,,,,
,517.33331,0.0015794689,0.0015654355,0.0028312292,0.0032375509,0.0026895587,0.001619007,0.0028547319,0.0013312713,,,,,,,,,,,,,,,,,,,,,,,,,,,,,,,,,,,,,,,,,,,,,,,,,,,,,,,,,,,,,,,,,,,,,,,,,,
,516,0.0016020516,0.0015860495,0.0028634711,0.0032821304,0.0027182338,0.0016418435,0.0028962597,0.0013512568,,,,,,,,,,,,,,,,,,,,,,,,,,,,,,,,,,,,,,,,,,,,,,,,,,,,,,,,,,,,,,,,,,,,,,,,,,
,514.66669,0.0016249571,0.001606935,0.0028960802,0.0033273237,0.0027472146,0.001665002,0.0029383917,0.0013715424,,,,,,,,,,,,,,,,,,,,,,,,,,,,,,,,,,,,,,,,,,,,,,,,,,,,,,,,,,,,,,,,,,,,,,,,,,
,513.33331,0.0016481913,0.0016280965,0.0029290621,0.0033731415,0.0027765058,0.0016884883,0.0029811385,0.0013921334,,,,,,,,,,,,,,,,,,,,,,,,,,,,,,,,,,,,,,,,,,,,,,,,,,,,,,,,,,,,,,,,,,,,,,,,,,
,512,0.0016717565,0.0016495357,0.0029624181,0.003419588,0.0028061079,0.0017123048,0.0030245052,0.0014130326,,,,,,,,,,,,,,,,,,,,,,,,,,,,,,,,,,,,,,,,,,,,,,,,,,,,,,,,,,,,,,,,,,,,,,,,,,
,510.66669,0.0016956587,0.0016712572,0.0029961539,0.0034666741,0.0028360256,0.0017364572,0.0030685027,0.0014342456,,,,,,,,,,,,,,,,,,,,,,,,,,,,,,,,,,,,,,,,,,,,,,,,,,,,,,,,,,,,,,,,,,,,,,,,,,
,509.33331,0.0017199038,0.0016932657,0.0030302755,0.0035144108,0.0028662637,0.0017609515,0.0031131423,0.001455778,,,,,,,,,,,,,,,,,,,,,,,,,,,,,,,,,,,,,,,,,,,,,,,,,,,,,,,,,,,,,,,,,,,,,,,,,,
,508,0.0017444943,0.001715563,0.0030647841,0.0035628025,0.0028968227,0.0017857901,0.0031584293,0.0014776327,,,,,,,,,,,,,,,,,,,,,,,,,,,,,,,,,,,,,,,,,,,,,,,,,,,,,,,,,,,,,,,,,,,,,,,,,,
,506.66669,0.0017694365,0.001738154,0.0030996857,0.0036118606,0.0029277076,0.001810979,0.003204375,0.0014998154,,,,,,,,,,,,,,,,,,,,,,,,,,,,,,,,,,,,,,,,,,,,,,,,,,,,,,,,,,,,,,,,,,,,,,,,,,
,505.33331,0.0017947365,0.0017610435,0.0031349864,0.0036615965,0.0029589232,0.0018365244,0.0032509913,0.0015223322,,,,,,,,,,,,,,,,,,,,,,,,,,,,,,,,,,,,,,,,,,,,,,,,,,,,,,,,,,,,,,,,,,,,,,,,,,
,504,0.001820397,0.0017842333,0.0031706875,0.0037120149,0.0029904702,0.001862429,0.0032982835,0.001545186,,,,,,,,,,,,,,,,,,,,,,,,,,,,,,,,,,,,,,,,,,,,,,,,,,,,,,,,,,,,,,,,,,,,,,,,,,
,502.66669,0.0018464244,0.0018077285,0.0032067951,0.0037631276,0.0030223535,0.001888699,0.0033462637,0.0015683829,,,,,,,,,,,,,,,,,,,,,,,,,,,,,,,,,,,,,,,,,,,,,,,,,,,,,,,,,,,,,,,,,,,,,,,,,,
,501.33331,0.0018728251,0.0018315342,0.0032433156,0.0038149464,0.0030545782,0.0019153407,0.0033949441,0.0015919291,,,,,,,,,,,,,,,,,,,,,,,,,,,,,,,,,,,,,,,,,,,,,,,,,,,,,,,,,,,,,,,,,,,,,,,,,,
,500,0.0018996021,0.0018556523,0.0032802502,0.0038674764,0.003087145,0.001942357,0.0034443304,0.0016158277,,,,,,,,,,,,,,,,,,,,,,,,,,,,,,,,,,,,,,,,,,,,,,,,,,,,,,,,,,,,,,,,,,,,,,,,,,
,498.66669,0.0019267619,0.001880088,0.0033176056,0.0039207297,0.003120059,0.0019697543,0.0034944352,0.0016400851,,,,,,,,,,,,,,,,,,,,,,,,,,,,,,,,,,,,,,,,,,,,,,,,,,,,,,,,,,,,,,,,,,,,,,,,,,
,497.33331,0.0019543114,0.0019048466,0.003355388,0.0039747188,0.0031533255,0.0019975394,0.0035452711,0.0016647078,,,,,,,,,,,,,,,,,,,,,,,,,,,,,,,,,,,,,,,,,,,,,,,,,,,,,,,,,,,,,,,,,,,,,,,,,,
,496,0.0019822534,0.0019299301,0.003393599,0.0040294487,0.0031869451,0.0020257152,0.0035968443,0.001689699,,,,,,,,,,,,,,,,,,,,,,,,,,,,,,,,,,,,,,,,,,,,,,,,,,,,,,,,,,,,,,,,,,,,,,,,,,
,494.66669,0.002010595,0.0019553439,0.0034322451,0.0040849323,0.0032209231,0.0020542883,0.0036491676,0.0017150654,,,,,,,,,,,,,,,,,,,,,,,,,,,,,,,,,,,,,,,,,,,,,,,,,,,,,,,,,,,,,,,,,,,,,,,,,,
,493.33331,0.0020393431,0.0019810935,0.0034713331,0.0041411825,0.003255265,0.0020832658,0.0037022546,0.0017408137,,,,,,,,,,,,,,,,,,,,,,,,,,,,,,,,,,,,,,,,,,,,,,,,,,,,,,,,,,,,,,,,,,,,,,,,,,
,492,0.0020685009,0.002007181,0.0035108645,0.0041982046,0.0032899715,0.0021126507,0.0037561114,0.0017669474,,,,,,,,,,,,,,,,,,,,,,,,,,,,,,,,,,,,,,,,,,,,,,,,,,,,,,,,,,,,,,,,,,,,,,,,,,
,490.66669,0.0020980756,0.0020336121,0.003550846,0.0042560118,0.003325048,0.0021424501,0.0038107516,0.0017934735,,,,,,,,,,,,,,,,,,,,,,,,,,,,,,,,,,,,,,,,,,,,,,,,,,,,,,,,,,,,,,,,,,,,,,,,,,
,489.33331,0.0021280746,0.0020603924,0.0035912847,0.0043146178,0.0033605,0.0021726712,0.0038661892,0.001820399,,,,,,,,,,,,,,,,,,,,,,,,,,,,,,,,,,,,,,,,,,,,,,,,,,,,,,,,,,,,,,,,,,,,,,,,,,
,488,0.002158501,0.0020875242,0.003632182,0.004374028,0.0033963285,0.0022033172,0.0039224308,0.0018477275,,,,,,,,,,,,,,,,,,,,,,,,,,,,,,,,,,,,,,,,,,,,,,,,,,,,,,,,,,,,,,,,,,,,,,,,,,
,486.66669,0.0021893625,0.0021150132,0.0036735451,0.0044342563,0.0034325389,0.0022343955,0.0039794904,0.0018754662,,,,,,,,,,,,,,,,,,,,,,,,,,,,,,,,,,,,,,,,,,,,,,,,,,,,,,,,,,,,,,,,,,,,,,,,,,
,485.33331,0.0022206667,0.0021428655,0.0037153812,0.0044953167,0.0034691371,0.0022659136,0.0040373828,0.0019036227,,,,,,,,,,,,,,,,,,,,,,,,,,,,,,,,,,,,,,,,,,,,,,,,,,,,,,,,,,,,,,,,,,,,,,,,,,
,484,0.002252417,0.0021710833,0.0037576917,0.004557215,0.0035061238,0.0022978748,0.0040961147,0.0019322006,,,,,,,,,,,,,,,,,,,,,,,,,,,,,,,,,,,,,,,,,,,,,,,,,,,,,,,,,,,,,,,,,,,,,,,,,,
,482.66669,0.0022846213,0.0021996726,0.0038004841,0.0046199657,0.0035435048,0.0023302868,0.004155701,0.0019612075,,,,,,,,,,,,,,,,,,,,,,,,,,,,,,,,,,,,,,,,,,,,,,,,,,,,,,,,,,,,,,,,,,,,,,,,,,
,481.33331,0.0023172875,0.0022286398,0.0038437658,0.0046835833,0.0035812861,0.0023631575,0.0042161569,0.0019906512,,,,,,,,,,,,,,,,,,,,,,,,,,,,,,,,,,,,,,,,,,,,,,,,,,,,,,,,,,,,,,,,,,,,,,,,,,
,480,0.0023504192,0.0022579871,0.0038875384,0.004748074,0.0036194684,0.0023964903,0.0042774894,0.0020205355,,,,,,,,,,,,,,,,,,,,,,,,,,,,,,,,,,,,,,,,,,,,,,,,,,,,,,,,,,,,,,,,,,,,,,,,,,
,478.66669,0.0023840247,0.0022877208,0.0039318095,0.0048134527,0.0036580579,0.0024302933,0.0043397141,0.0020508685,,,,,,,,,,,,,,,,,,,,,,,,,,,,,,,,,,,,,,,,,,,,,,,,,,,,,,,,,,,,,,,,,,,,,,,,,,
,477.33331,0.0024181122,0.0023178474,0.0039765868,0.0048797347,0.0036970606,0.0024645747,0.0044028469,0.0020816583,,,,,,,,,,,,,,,,,,,,,,,,,,,,,,,,,,,,,,,,,,,,,,,,,,,,,,,,,,,,,,,,,,,,,,,,,,
,476,0.0024526855,0.0023483694,0.0040218719,0.0049469263,0.0037364773,0.0024993381,0.0044668952,0.0021129089,,,,,,,,,,,,,,,,,,,,,,,,,,,,,,,,,,,,,,,,,,,,,,,,,,,,,,,,,,,,,,,,,,,,,,,,,,
,474.66669,0.0024877532,0.0023792933,0.0040676728,0.0050150431,0.0037763143,0.0025345918,0.0045318752,0.0021446287,,,,,,,,,,,,,,,,,,,,,,,,,,,,,,,,,,,,,,,,,,,,,,,,,,,,,,,,,,,,,,,,,,,,,,,,,,
,473.33331,0.0025233238,0.0024106259,0.0041139973,0.005084101,0.0038165778,0.0025703444,0.0045978035,0.0021768261,,,,,,,,,,,,,,,,,,,,,,,,,,,,,,,,,,,,,,,,,,,,,,,,,,,,,,,,,,,,,,,,,,,,,,,,,,
,472,0.0025594014,0.0024423696,0.0041608473,0.0051541067,0.0038572688,0.0026065996,0.0046646879,0.0022095054,,,,,,,,,,,,,,,,,,,,,,,,,,,,,,,,,,,,,,,,,,,,,,,,,,,,,,,,,,,,,,,,,,,,,,,,,,
,470.66669,0.0025959949,0.0024745313,0.0042082308,0.0052250762,0.0038983936,0.0026433663,0.0047325452,0.0022426753,,,,,,,,,,,,,,,,,,,,,,,,,,,,,,,,,,,,,,,,,,,,,,,,,,,,,,,,,,,,,,,,,,,,,,,,,,
,469.33331,0.0026331132,0.002507118,0.0042561561,0.0052970264,0.0039399588,0.0026806532,0.0048013928,0.0022763447,,,,,,,,,,,,,,,,,,,,,,,,,,,,,,,,,,,,,,,,,,,,,,,,,,,,,,,,,,,,,,,,,,,,,,,,,,
,468,0.0026707605,0.0025401324,0.004304625,0.0053699639,0.0039819652,0.0027184644,0.0048712388,0.002310518,,,,,,,,,,,,,,,,,,,,,,,,,,,,,,,,,,,,,,,,,,,,,,,,,,,,,,,,,,,,,,,,,,,,,,,,,,
,466.66669,0.0027089461,0.0025735815,0.0043536458,0.0054439057,0.0040244194,0.002756809,0.0049421008,0.0023452043,,,,,,,,,,,,,,,,,,,,,,,,,,,,,,,,,,,,,,,,,,,,,,,,,,,,,,,,,,,,,,,,,,,,,,,,,,
,465.33331,0.0027476795,0.0026074726,0.0044032271,0.0055188691,0.0040673283,0.0027956961,0.0050139969,0.002380413,,,,,,,,,,,,,,,,,,,,,,,,,,,,,,,,,,,,,,,,,,,,,,,,,,,,,,,,,,,,,,,,,,,,,,,,,,
,464,0.0027869648,0.0026418084,0.0044533709,0.0055948613,0.0041106927,0.00283513,0.0050869356,0.0024161486,,,,,,,,,,,,,,,,,,,,,,,,,,,,,,,,,,,,,,,,,,,,,,,,,,,,,,,,,,,,,,,,,,,,,,,,,,
,462.66669,0.0028268119,0.0026765964,0.0045040856,0.0056718999,0.0041545194,0.0028751201,0.0051609354,0.0024524207,,,,,,,,,,,,,,,,,,,,,,,,,,,,,,,,,,,,,,,,,,,,,,,,,,,,,,,,,,,,,,,,,,,,,,,,,,
,461.33331,0.0028672305,0.0027118441,0.0045553802,0.0057500028,0.0041988154,0.0029156762,0.0052360151,0.002489239,,,,,,,,,,,,,,,,,,,,,,,,,,,,,,,,,,,,,,,,,,,,,,,,,,,,,,,,,,,,,,,,,,,,,,,,,,
,460,0.0029082251,0.0027475543,0.0046072566,0.0058291776,0.0042435817,0.0029568024,0.0053121835,0.0025266084,,,,,,,,,,,,,,,,,,,,,,,,,,,,,,,,,,,,,,,,,,,,,,,,,,,,,,,,,,,,,,,,,,,,,,,,,,
,458.66669,0.0029498059,0.0027837348,0.0046597238,0.0059094426,0.0042888252,0.0029985088,0.0053894599,0.0025645387,,,,,,,,,,,,,,,,,,,,,,,,,,,,,,,,,,,,,,,,,,,,,,,,,,,,,,,,,,,,,,,,,,,,,,,,,,
,457.33331,0.0029919832,0.0028203934,0.0047127909,0.0059908165,0.0043345532,0.0030408053,0.0054678641,0.0026030403,,,,,,,,,,,,,,,,,,,,,,,,,,,,,,,,,,,,,,,,,,,,,,,,,,,,,,,,,,,,,,,,,,,,,,,,,,
,456,0.0030347615,0.002857533,0.0047664599,0.0060733072,0.0043807666,0.0030836965,0.0055474053,0.002642118,,,,,,,,,,,,,,,,,,,,,,,,,,,,,,,,,,,,,,,,,,,,,,,,,,,,,,,,,,,,,,,,,,,,,,,,,,
,454.66666,0.0030781524,0.0028951626,0.0048207414,0.0061569357,0.0044274739,0.0031271938,0.0056281054,0.0026817834,,,,,,,,,,,,,,,,,,,,,,,,,,,,,,,,,,,,,,,,,,,,,,,,,,,,,,,,,,,,,,,,,,,,,,,,,,
,453.33331,0.0031221638,0.0029332876,0.004875641,0.0062417156,0.004474679,0.0031713045,0.0057099794,0.0027220442,,,,,,,,,,,,,,,,,,,,,,,,,,,,,,,,,,,,,,,,,,,,,,,,,,,,,,,,,,,,,,,,,,,,,,,,,,
,452,0.0031668034,0.0029719139,0.0049311645,0.0063276611,0.0045223865,0.0032160364,0.0057930426,0.0027629085,,,,,,,,,,,,,,,,,,,,,,,,,,,,,,,,,,,,,,,,,,,,,,,,,,,,,,,,,,,,,,,,,,,,,,,,,,
,450.66666,0.0032120823,0.0030110497,0.0049873216,0.006414792,0.0045706036,0.0032614004,0.0058773161,0.0028043873,,,,,,,,,,,,,,,,,,,,,,,,,,,,,,,,,,,,,,,,,,,,,,,,,,,,,,,,,,,,,,,,,,,,,,,,,,
,449.33331,0.0032580086,0.0030507008,0.0050441183,0.0065031226,0.0046193348,0.0033074042,0.0059628154,0.0028464887,,,,,,,,,,,,,,,,,,,,,,,,,,,,,,,,,,,,,,,,,,,,,,,,,,,,,,,,,,,,,,,,,,,,,,,,,,
,448,0.0033045904,0.0030908732,0.0051015604,0.0065926675,0.0046685845,0.0033540558,0.0060495566,0.0028892212,,,,,,,,,,,,,,,,,,,,,,,,,,,,,,,,,,,,,,,,,,,,,,,,,,,,,,,,,,,,,,,,,,,,,,,,,,
,446.66666,0.0033518394,0.0031315755,0.0051596581,0.0066834475,0.0047183604,0.0034013666,0.0061375617,0.0029325962,,,,,,,,,,,,,,,,,,,,,,,,,,,,,,,,,,,,,,,,,,,,,,,,,,,,,,,,,,,,,,,,,,,,,,,,,,
,445.33331,0.0033997639,0.0031728138,0.0052184173,0.0067754774,0.004768667,0.0034493447,0.006226847,0.0029766224,,,,,,,,,,,,,,,,,,,,,,,,,,,,,,,,,,,,,,,,,,,,,,,,,,,,,,,,,,,,,,,,,,,,,,,,,,
,444,0.0034483725,0.0032145942,0.0052778443,0.0068687725,0.0048195088,0.0034979984,0.0063174291,0.0030213086,,,,,,,,,,,,,,,,,,,,,,,,,,,,,,,,,,,,,,,,,,,,,,,,,,,,,,,,,,,,,,,,,,,,,,,,,,
,442.66666,0.0034976773,0.0032569257,0.0053379495,0.0069633544,0.0048708939,0.0035473396,0.006409331,0.0030666666,,,,,,,,,,,,,,,,,,,,,,,,,,,,,,,,,,,,,,,,,,,,,,,,,,,,,,,,,,,,,,,,,,,,,,,,,,
,441.33331,0.003547687,0.0032998147,0.0053987392,0.0070592386,0.0049228267,0.0035973767,0.0065025698,0.0031127055,,,,,,,,,,,,,,,,,,,,,,,,,,,,,,,,,,,,,,,,,,,,,,,,,,,,,,,,,,,,,,,,,,,,,,,,,,
,440,0.0035984106,0.0033432675,0.0054602197,0.007156441,0.0049753121,0.0036481185,0.0065971628,0.0031594346,,,,,,,,,,,,,,,,,,,,,,,,,,,,,,,,,,,,,,,,,,,,,,,,,,,,,,,,,,,,,,,,,,,,,,,,,,
,438.66666,0.0036498606,0.0033872935,0.0055224019,0.007254984,0.0050283584,0.0036995772,0.0066931341,0.0032068663,,,,,,,,,,,,,,,,,,,,,,,,,,,,,,,,,,,,,,,,,,,,,,,,,,,,,,,,,,,,,,,,,,,,,,,,,,
,437.33331,0.0037020462,0.0034318992,0.0055852921,0.0073548839,0.0050819701,0.0037517617,0.0067905014,0.00325501,,,,,,,,,,,,,,,,,,,,,,,,,,,,,,,,,,,,,,,,,,,,,,,,,,,,,,,,,,,,,,,,,,,,,,,,,,
,436,0.0037549768,0.0034770913,0.0056488971,0.0074561572,0.0051361522,0.0038046811,0.006889283,0.0033038754,,,,,,,,,,,,,,,,,,,,,,,,,,,,,,,,,,,,,,,,,,,,,,,,,,,,,,,,,,,,,,,,,,,,,,,,,,
,434.66666,0.0038086654,0.0035228795,0.0057132279,0.0075588273,0.0051909133,0.0038583482,0.0069895039,0.0033534755,,,,,,,,,,,,,,,,,,,,,,,,,,,,,,,,,,,,,,,,,,,,,,,,,,,,,,,,,,,,,,,,,,,,,,,,,,
,433.33331,0.0038631215,0.0035692707,0.0057782913,0.0076629111,0.0052462582,0.0039127723,0.0070911826,0.0034038202,,,,,,,,,,,,,,,,,,,,,,,,,,,,,,,,,,,,,,,,,,,,,,,,,,,,,,,,,,,,,,,,,,,,,,,,,,
,432,0.0039183551,0.0036162717,0.0058440942,0.0077684257,0.0053021919,0.0039679627,0.0071943382,0.0034549196,,,,,,,,,,,,,,,,,,,,,,,,,,,,,,,,,,,,,,,,,,,,,,,,,,,,,,,,,,,,,,,,,,,,,,,,,,
,430.66666,0.0039743797,0.0036638928,0.0059106479,0.0078753957,0.0053587232,0.004023933,0.0072989969,0.0035067873,,,,,,,,,,,,,,,,,,,,,,,,,,,,,,,,,,,,,,,,,,,,,,,,,,,,,,,,,,,,,,,,,,,,,,,,,,
,429.33331,0.0040312052,0.0037121409,0.0059779596,0.0079838385,0.0054158573,0.0040806927,0.0074051779,0.0035594336,,,,,,,,,,,,,,,,,,,,,,,,,,,,,,,,,,,,,,,,,,,,,,,,,,,,,,,,,,,,,,,,,,,,,,,,,,
,428,0.004088842,0.0037610233,0.0060460363,0.0080937722,0.0054735992,0.0041382518,0.0075129012,0.0036128691,,,,,,,,,,,,,,,,,,,,,,,,,,,,,,,,,,,,,,,,,,,,,,,,,,,,,,,,,,,,,,,,,,,,,,,,,,
,426.66666,0.0041473042,0.0038105505,0.0061148898,0.0082052221,0.0055319581,0.0041966241,0.0076221941,0.0036671081,,,,,,,,,,,,,,,,,,,,,,,,,,,,,,,,,,,,,,,,,,,,,,,,,,,,,,,,,,,,,,,,,,,,,,,,,,
,425.33331,0.0042066022,0.0038607299,0.0061845274,0.0083182067,0.0055909392,0.0042558197,0.0077330768,0.0037221613,,,,,,,,,,,,,,,,,,,,,,,,,,,,,,,,,,,,,,,,,,,,,,,,,,,,,,,,,,,,,,,,,,,,,,,,,,
,424,0.0042667468,0.003911569,0.0062549565,0.0084327444,0.0056505477,0.004315849,0.00784557,0.0037780397,,,,,,,,,,,,,,,,,,,,,,,,,,,,,,,,,,,,,,,,,,,,,,,,,,,,,,,,,,,,,,,,,,,,,,,,,,
,422.66666,0.0043277526,0.0039630787,0.0063261892,0.008548862,0.0057107932,0.0043767264,0.0079597024,0.0038347583,,,,,,,,,,,,,,,,,,,,,,,,,,,,,,,,,,,,,,,,,,,,,,,,,,,,,,,,,,,,,,,,,,,,,,,,,,
,421.33331,0.0043896307,0.0040152666,0.0063982331,0.0086665784,0.005771681,0.0044384624,0.0080754949,0.0038923284,,,,,,,,,,,,,,,,,,,,,,,,,,,,,,,,,,,,,,,,,,,,,,,,,,,,,,,,,,,,,,,,,,,,,,,,,,
,420,0.0044523921,0.0040681406,0.0064710959,0.008785913,0.0058332166,0.0045010679,0.0081929693,0.0039507614,,,,,,,,,,,,,,,,,,,,,,,,,,,,,,,,,,,,,,,,,,,,,,,,,,,,,,,,,,,,,,,,,,,,,,,,,,
,418.66666,0.0045160524,0.0041217122,0.0065447901,0.0089068936,0.0058954097,0.0045645579,0.0083121554,0.0040100731,,,,,,,,,,,,,,,,,,,,,,,,,,,,,,,,,,,,,,,,,,,,,,,,,,,,,,,,,,,,,,,,,,,,,,,,,,
,417.33331,0.0045806227,0.0041759891,0.0066193235,0.0090295401,0.0059582658,0.0046289434,0.0084330753,0.0040702751,,,,,,,,,,,,,,,,,,,,,,,,,,,,,,,,,,,,,,,,,,,,,,,,,,,,,,,,,,,,,,,,,,,,,,,,,,
,416,0.0046461149,0.0042309796,0.0066947039,0.0091538725,0.0060217907,0.0046942357,0.0085557514,0.0041313795,,,,,,,,,,,,,,,,,,,,,,,,,,,,,,,,,,,,,,,,,,,,,,,,,,,,,,,,,,,,,,,,,,,,,,,,,,
,414.66666,0.004712545,0.0042866954,0.0067709446,0.0092799199,0.0060859943,0.0047604504,0.008680215,0.0041934027,,,,,,,,,,,,,,,,,,,,,,,,,,,,,,,,,,,,,,,,,,,,,,,,,,,,,,,,,,,,,,,,,,,,,,,,,,
,413.33331,0.0047799248,0.004343145,0.0068480535,0.0094077028,0.0061508825,0.0048275991,0.0088064891,0.004256357,,,,,,,,,,,,,,,,,,,,,,,,,,,,,,,,,,,,,,,,,,,,,,,,,,,,,,,,,,,,,,,,,,,,,,,,,,
,412,0.0048482665,0.0044003365,0.0069260388,0.0095372424,0.0062164609,0.0048956934,0.0089345973,0.004320255,,,,,,,,,,,,,,,,,,,,,,,,,,,,,,,,,,,,,,,,,,,,,,,,,,,,,,,,,,,,,,,,,,,,,,,,,,
,410.66666,0.0049175869,0.0044582826,0.007004914,0.0096685687,0.0062827401,0.0049647499,0.0090645721,0.0043851137,,,,,,,,,,,,,,,,,,,,,,,,,,,,,,,,,,,,,,,,,,,,,,,,,,,,,,,,,,,,,,,,,,,,,,,,,,
,409.33331,0.0049878984,0.0045169917,0.0070846873,0.0098017033,0.006349726,0.0050347803,0.0091964376,0.0044509461,,,,,,,,,,,,,,,,,,,,,,,,,,,,,,,,,,,,,,,,,,,,,,,,,,,,,,,,,,,,,,,,,,,,,,,,,,
,408,0.0050592137,0.0045764725,0.0071653674,0.009936668,0.0064174244,0.005105797,0.0093302184,0.0045177653,,,,,,,,,,,,,,,,,,,,,,,,,,,,,,,,,,,,,,,,,,,,,,,,,,,,,,,,,,,,,,,,,,,,,,,,,,
,406.66666,0.0051315502,0.0046367381,0.0072469681,0.010073494,0.0064858463,0.005177817,0.0094659484,0.0045855892,,,,,,,,,,,,,,,,,,,,,,,,,,,,,,,,,,,,,,,,,,,,,,,,,,,,,,,,,,,,,,,,,,,,,,,,,,
,405.33331,0.005204921,0.0046977971,0.007329498,0.010212205,0.0065549976,0.0052508529,0.0096036529,0.0046544313,,,,,,,,,,,,,,,,,,,,,,,,,,,,,,,,,,,,,,,,,,,,,,,,,,,,,,,,,,,,,,,,,,,,,,,,,,
,404,0.0052793391,0.0047596589,0.0074129659,0.010352822,0.0066248846,0.0053249173,0.0097433574,0.0047243053,,,,,,,,,,,,,,,,,,,,,,,,,,,,,,,,,,,,,,,,,,,,,,,,,,,,,,,,,,,,,,,,,,,,,,,,,,
,402.66666,0.005354823,0.0048223367,0.0074973864,0.010495379,0.0066955184,0.0054000281,0.0098850975,0.0047952299,,,,,,,,,,,,,,,,,,,,,,,,,,,,,,,,,,,,,,,,,,,,,,,,,,,,,,,,,,,,,,,,,,,,,,,,,,
,401.33331,0.0054313861,0.0048858398,0.0075827681,0.010639898,0.0067669052,0.0054761984,0.0100289,0.0048672193,,,,,,,,,,,,,,,,,,,,,,,,,,,,,,,,,,,,,,,,,,,,,,,,,,,,,,,,,,,,,,,,,,,,,,,,,,
,400,0.0055090422,0.0049501778,0.0076691202,0.010786405,0.0068390514,0.0055534414,0.01017479,0.0049402877,,,,,,,,,,,,,,,,,,,,,,,,,,,,,,,,,,,,,,,,,,,,,,,,,,,,,,,,,,,,,,,,,,,,,,,,,,
,398.66666,0.0055878104,0.0050153644,0.0077564578,0.010934932,0.0069119686,0.0056317757,0.010322806,0.0050144548,,,,,,,,,,,,,,,,,,,,,,,,,,,,,,,,,,,,,,,,,,,,,,,,,,,,,,,,,,,,,,,,,,,,,,,,,,
,397.33331,0.0056677047,0.0050814095,0.0078447899,0.011085504,0.0069856632,0.0057112149,0.010472976,0.0050897353,,,,,,,,,,,,,,,,,,,,,,,,,,,,,,,,,,,,,,,,,,,,,,,,,,,,,,,,,,,,,,,,,,,,,,,,,,
,396,0.0057487396,0.0051483227,0.0079341259,0.011238146,0.0070601418,0.0057917728,0.010625327,0.0051661443,,,,,,,,,,,,,,,,,,,,,,,,,,,,,,,,,,,,,,,,,,,,,,,,,,,,,,,,,,,,,,,,,,,,,,,,,,
,394.66666,0.005830935,0.0052161187,0.0080244814,0.011392893,0.0071354162,0.0058734689,0.010779897,0.0052437021,,,,,,,,,,,,,,,,,,,,,,,,,,,,,,,,,,,,,,,,,,,,,,,,,,,,,,,,,,,,,,,,,,,,,,,,,,
,393.33331,0.0059143055,0.0052848074,0.0081158659,0.011549772,0.0072114932,0.0059563173,0.010936716,0.0053224242,,,,,,,,,,,,,,,,,,,,,,,,,,,,,,,,,,,,,,,,,,,,,,,,,,,,,,,,,,,,,,,,,,,,,,,,,,
,392,0.0059988662,0.005354399,0.0082082889,0.011708806,0.0072883795,0.0060403325,0.011095813,0.0054023264,,,,,,,,,,,,,,,,,,,,,,,,,,,,,,,,,,,,,,,,,,,,,,,,,,,,,,,,,,,,,,,,,,,,,,,,,,
,390.66666,0.0060846379,0.0054249087,0.0083017666,0.011870035,0.0073660874,0.0061255346,0.011257227,0.0054834299,,,,,,,,,,,,,,,,,,,,,,,,,,,,,,,,,,,,,,,,,,,,,,,,,,,,,,,,,,,,,,,,,,,,,,,,,,
,389.33331,0.0061716358,0.0054963468,0.0083963088,0.012033483,0.0074446237,0.0062119386,0.01142099,0.005565751,,,,,,,,,,,,,,,,,,,,,,,,,,,,,,,,,,,,,,,,,,,,,,,,,,,,,,,,,,,,,,,,,,,,,,,,,,
,388,0.0062598757,0.0055687241,0.0084919255,0.012199179,0.0075239956,0.0062995593,0.011587132,0.0056493061,,,,,,,,,,,,,,,,,,,,,,,,,,,,,,,,,,,,,,,,,,,,,,,,,,,,,,,,,,,,,,,,,,,,,,,,,,
,386.66666,0.0063493793,0.0056420561,0.0085886333,0.012367159,0.0076042156,0.006388418,0.011755694,0.0057341175,,,,,,,,,,,,,,,,,,,,,,,,,,,,,,,,,,,,,,,,,,,,,,,,,,,,,,,,,,,,,,,,,,,,,,,,,,
,385.33331,0.0064401626,0.0057163537,0.0086864424,0.012537453,0.0076852908,0.0064785301,0.011926708,0.0058202021,,,,,,,,,,,,,,,,,,,,,,,,,,,,,,,,,,,,,,,,,,,,,,,,,,,,,,,,,,,,,,,,,,,,,,,,,,
,384,0.0065322418,0.0057916281,0.0087853632,0.012710088,0.0077672286,0.0065699111,0.012100206,0.005907577,,,,,,,,,,,,,,,,,,,,,,,,,,,,,,,,,,,,,,,,,,,,,,,,,,,,,,,,,,,,,,,,,,,,,,,,,,
,382.66666,0.0066256396,0.0058678954,0.0088854127,0.012885104,0.0078500419,0.0066625833,0.012276232,0.0059962658,,,,,,,,,,,,,,,,,,,,,,,,,,,,,,,,,,,,,,,,,,,,,,,,,,,,,,,,,,,,,,,,,,,,,,,,,,
,381.33331,0.0067203729,0.0059451671,0.0089866016,0.013062529,0.0079337381,0.0067565626,0.012454819,0.0060862859,,,,,,,,,,,,,,,,,,,,,,,,,,,,,,,,,,,,,,,,,,,,,,,,,,,,,,,,,,,,,,,,,,,,,,,,,,
,380,0.0068164584,0.0060234545,0.0090889405,0.013242394,0.0080183247,0.0068518653,0.012635999,0.0061776554,,,,,,,,,,,,,,,,,,,,,,,,,,,,,,,,,,,,,,,,,,,,,,,,,,,,,,,,,,,,,,,,,,,,,,,,,,
,378.66666,0.00691392,0.0061027747,0.0091924473,0.01342474,0.0081038152,0.0069485146,0.01281982,0.0062703988,,,,,,,,,,,,,,,,,,,,,,,,,,,,,,,,,,,,,,,,,,,,,,,,,,,,,,,,,,,,,,,,,,,,,,,,,,
,377.33331,0.007012775,0.0061831393,0.0092971327,0.013609596,0.0081902171,0.0070465271,0.013006314,0.0063645344,,,,,,,,,,,,,,,,,,,,,,,,,,,,,,,,,,,,,,,,,,,,,,,,,,,,,,,,,,,,,,,,,,,,,,,,,,
,376,0.0071130412,0.0062645604,0.009403008,0.013796994,0.0082775382,0.0071459199,0.013195517,0.0064600811,,,,,,,,,,,,,,,,,,,,,,,,,,,,,,,,,,,,,,,,,,,,,,,,,,,,,,,,,,,,,,,,,,,,,,,,,,
,374.66666,0.0072147434,0.0063470556,0.0095100914,0.013986976,0.0083657924,0.007246717,0.013387477,0.0065570644,,,,,,,,,,,,,,,,,,,,,,,,,,,,,,,,,,,,,,,,,,,,,,,,,,,,,,,,,,,,,,,,,,,,,,,,,,
,373.33331,0.0073178996,0.006430637,0.0096183942,0.014179575,0.0084549874,0.0073489358,0.013582229,0.0066555036,,,,,,,,,,,,,,,,,,,,,,,,,,,,,,,,,,,,,,,,,,,,,,,,,,,,,,,,,,,,,,,,,,,,,,,,,,
,372,0.0074225283,0.0065153172,0.009727928,0.014374821,0.0085451314,0.0074525941,0.01377981,0.0067554184,,,,,,,,,,,,,,,,,,,,,,,,,,,,,,,,,,,,,,,,,,,,,,,,,,,,,,,,,,,,,,,,,,,,,,,,,,
,370.66666,0.0075286555,0.0066011145,0.0098387117,0.01457276,0.0086362387,0.007557717,0.01398027,0.0068568356,,,,,,,,,,,,,,,,,,,,,,,,,,,,,,,,,,,,,,,,,,,,,,,,,,,,,,,,,,,,,,,,,,,,,,,,,,
,369.33331,0.0076363,0.0066880416,0.0099507569,0.014773424,0.0087283172,0.0076643227,0.014183646,0.0069597752,,,,,,,,,,,,,,,,,,,,,,,,,,,,,,,,,,,,,,,,,,,,,,,,,,,,,,,,,,,,,,,,,,,,,,,,,,
,368,0.0077454812,0.0067761114,0.010064076,0.014976847,0.0088213753,0.0077724296,0.014389976,0.0070642578,,,,,,,,,,,,,,,,,,,,,,,,,,,,,,,,,,,,,,,,,,,,,,,,,,,,,,,,,,,,,,,,,,,,,,,,,,
,366.66666,0.0078562259,0.0068653429,0.010178687,0.015183076,0.0089154278,0.0078820639,0.014599312,0.0071703115,,,,,,,,,,,,,,,,,,,,,,,,,,,,,,,,,,,,,,,,,,,,,,,,,,,,,,,,,,,,,,,,,,,,,,,,,,
,365.33331,0.007968554,0.0069557495,0.010294604,0.015392144,0.0090104831,0.0079932447,0.014811693,0.0072779572,,,,,,,,,,,,,,,,,,,,,,,,,,,,,,,,,,,,,,,,,,,,,,,,,,,,,,,,,,,,,,,,,,,,,,,,,,
,364,0.0080824856,0.0070473445,0.010411839,0.015604087,0.0091065496,0.0081059911,0.015027159,0.0073872165,,,,,,,,,,,,,,,,,,,,,,,,,,,,,,,,,,,,,,,,,,,,,,,,,,,,,,,,,,,,,,,,,,,,,,,,,,
,362.66666,0.0081980489,0.0071401478,0.010530411,0.015818953,0.0092036426,0.0082203305,0.015245765,0.0074981187,,,,,,,,,,,,,,,,,,,,,,,,,,,,,,,,,,,,,,,,,,,,,,,,,,,,,,,,,,,,,,,,,,,,,,,,,,
,361.33331,0.0083152643,0.0072341732,0.010650333,0.016036777,0.0093017707,0.0083362827,0.01546755,0.0076106857,,,,,,,,,,,,,,,,,,,,,,,,,,,,,,,,,,,,,,,,,,,,,,,,,,,,,,,,,,,,,,,,,,,,,,,,,,
,360,0.0084341531,0.0073294345,0.010771619,0.016257596,0.0094009428,0.0084538677,0.015692557,0.00772494,,,,,,,,,,,,,,,,,,,,,,,,,,,,,,,,,,,,,,,,,,,,,,,,,,,,,,,,,,,,,,,,,,,,,,,,,,
,358.66666,0.0085547444,0.0074259526,0.010894288,0.01648146,0.0095011746,0.0085731141,0.015920842,0.0078409123,,,,,,,,,,,,,,,,,,,,,,,,,,,,,,,,,,,,,,,,,,,,,,,,,,,,,,,,,,,,,,,,,,,,,,,,,,
,357.33331,0.0086770599,0.0075237415,0.011018355,0.016708407,0.0096024749,0.0086940425,0.016152449,0.0079586256,,,,,,,,,,,,,,,,,,,,,,,,,,,,,,,,,,,,,,,,,,,,,,,,,,,,,,,,,,,,,,,,,,,,,,,,,,
,356,0.0088011215,0.007622816,0.011143831,0.016938474,0.009704853,0.0088166738,0.016387419,0.0080781033,,,,,,,,,,,,,,,,,,,,,,,,,,,,,,,,,,,,,,,,,,,,,,,,,,,,,,,,,,,,,,,,,,,,,,,,,,
,354.66666,0.0089269598,0.0077231974,0.011270739,0.017171714,0.0098083251,0.0089410378,0.016625812,0.0081993776,,,,,,,,,,,,,,,,,,,,,,,,,,,,,,,,,,,,,,,,,,,,,,,,,,,,,,,,,,,,,,,,,,,,,,,,,,
,353.33331,0.0090545972,0.0078249007,0.011399093,0.017408166,0.0099129002,0.0090671559,0.016867674,0.0083224724,,,,,,,,,,,,,,,,,,,,,,,,,,,,,,,,,,,,,,,,,,,,,,,,,,,,,,,,,,,,,,,,,,,,,,,,,,
,352,0.0091840567,0.0079279409,0.011528905,0.017647868,0.010018588,0.0091950501,0.017113048,0.0084474123,,,,,,,,,,,,,,,,,,,,,,,,,,,,,,,,,,,,,,,,,,,,,,,,,,,,,,,,,,,,,,,,,,,,,,,,,,
,350.66666,0.0093153702,0.0080323404,0.011660199,0.017890876,0.010125405,0.0093247513,0.017361998,0.0085742309,,,,,,,,,,,,,,,,,,,,,,,,,,,,,,,,,,,,,,,,,,,,,,,,,,,,,,,,,,,,,,,,,,,,,,,,,,
