GLOBAL ATTRIBUTES,,,,,,,,,,,,,,,,,
title,,,,,,,,,,,,,,,,,
project,Integrated Marine Observing System (IMOS),,,,,,,,,,,,,,,,
original_project_name,MERIS validation,,,,,,,,,,,,,,,,
institution,CSIRO Land and Water,,,,,,,,,,,,,,,,
abstract,This record contains in situ water optical property data collected in the Great Barrier Reef (Australia) on the RSV Lady Basten between 21-29 Oct 2002. A total of 28 stations were sampled during the field campaign AO02. The data can be used for Ocean Colour sensor validation| optical water quality monitoring and modelling. CLW deployed the optical instruments TriOS RAMSES (hyperspectral irradiance)| WETLabs AC-9 (absorption and attenuation coefficicents)| HOBILabs Hydroscat-6 (backscattering coefficient) during this cruise.This data was part of the dataset described in Oubelkheir et al. 2004| Bio-optical characterisation of Australian ocean| coastal and estuarine waters In SPIE| Ocean Optics XVII| Fremantle (Aus.) and Blondeau-Patissier et al. 2009| JGR| VOL. 114| C05003| doi:10.1029/2008JC005039. Funding for this study was provided by CSIRO Earth Observation Centre| CSIRO Land and Water| CSIRO Marine Research and the Australian Institute of Marine Sciences. We also thank the captains and crews of the RSV Lady Basten.,,,,,,,,,,,,,,,,
conventions,IMOS biological data format (v1.0),,,,,,,,,,,,,,,,
date_created,2002-10-27T21:19:49Z,,,,,,,,,,,,,,,,
date_modified,2002-10-27T22:00:13Z,,,,,,,,,,,,,,,,
history,Data has been quality controlled by in-house procedures. HS-6 data were corrected for temperature using CTD data and the Sigma correction method| recommended by the manufacturer| was applied using absorption and attenuation data from the AC-9. The Sigma correction is an adjustment to improve the accuracy of backscattering measurements| in particular in highly-attenuating water. The correction is detailed in HOBI-labs Inc.| 2003. The backscattering coefficient bb is estimated using the method described in Maffione and Dana| 1997| Applied Optics| 36(24)| pp.6057-6067.,,,,,,,,,,,,,,,,
comment,The HydroScat-6 (HS-6) is a self-contained instrument for measuring optical backscattering at six different wavelengths in natural waters. The particulate backscattering coefficient| bbp (lambda)| is a measure of light scattering by particles at angles between 90 and 180 degrees. bbp was estimated by subtracting bbw (lambda)| the backscattering coefficient of pure sea-water| from bb (lambda). The pure seawater backscattering coefficient was calculated using a backscattering ratio of 0.5 (Gordon et al.| 1988| Journal of Geophysical Research) and the seawater scattering coefficients| bw(lambda)| of Morel (1974| Optical properties of pure water and pure seawater| p. 1-24| in Optical Aspects of Oceanography).,,,,,,,,,,,,,,,,
source,Particulate Scattering coefficients determined using an HS-6 (www.hobilabs.com),,,,,,,,,,,,,,,,
keywords,Oceans>Ocean Optics > Scattering ;Oceans>Ocean Optics>Ocean Colour;,,,,,,,,,,,,,,,,
cruise_id,LB3172,,,,,,,,,,,,,,,,
vessel_name,RSV Lady Basten,,,,,,,,,,,,,,,,
platform_code,VLAB_450301529,,,,,,,,,,,,,,,,
references,https://marlin.csiro.au/geonetwork/srv/eng/catalog.search#/metadata/de47e8c0-5315-446e-b637-cf2630ea5f61,,,,,,,,,,,,,,,,
naming_authority,CSIRO Land and Water (CLW),,,,,,,,,,,,,,,,
cdm_data_type,profile,,,,,,,,,,,,,,,,
geospatial_lat_min,,,,,,,,,,,,,,,,,
geospatial_lat_max,,,,,,,,,,,,,,,,,
geospatial_lon_min,,,,,,,,,,,,,,,,,
geospatial_lon_max,,,,,,,,,,,,,,,,,
geospatial_vertical_min,0,,,,,,,,,,,,,,,,
geospatial_vertical_max,0,,,,,,,,,,,,,,,,
local_time_zone,10,,,,,,,,,,,,,,,,
data_centre,eMarine Information Infrastructure (eMII),,,,,,,,,,,,,,,,
data_centre_email,info@emii.org.au,,,,,,,,,,,,,,,,
author,Brando Vittorio,,,,,,,,,,,,,,,,
author_email,vittorio.brando@csiro.au,,,,,,,,,,,,,,,,
principal_investigator,Furnas Miles,,,,,,,,,,,,,,,,
principal_investigator_email,m.furnas@aims.gov.au,,,,,,,,,,,,,,,,
publisher,Australian Ocean Data Network,,,,,,,,,,,,,,,,
publisher_email,info@aodn.org.au,,,,,,,,,,,,,,,,
institution,IMOS Satellite Remote Sensing - Ocean Colour Sub-facility - Bio-Optical Database of Australian Waters,,,,,,,,,,,,,,,,
institution_principal_investigator,"Schroeder, Thomas",,,,,,,,,,,,,,,,
institution_principal_investigator_email,Thomas.Schroeder@csiro.au, ,,,,,,,,,,,,,,,
citation,To cite this data set in a publication use the format <<IMOS [year-of-data-downloaded] [Title] [data-access-url] accessed [date-of-access]>>,,,,,,,,,,,,,,,,
acknowledgement,Data was sourced from the Commonwealth Scientific and Industrial Research Organisation (CSIRO),,,,,,,,,,,,,,,,
distribution_statement,"Any users of IMOS data are required to clearly acknowledge the source of the material- Data or products or services from IMOS are provided ""as is"" without any warranty as to fitness for a particular purpose.",,,,,,,,,,,,,,,,
,,,,,,,,,,,,,,,,,
TABLE ROWS,,,,,,,,,,,,,,,,,
Row name,CF standard_name,IMOS long_name,Units,Fill value,Comments,,,,,,,,,,,,
Wavelength,radiation_wavelength,Wavelength of measurement,nm,-999,,,,,,,,,,,,,
,,,,,,,,,,,,,,,,,
TABLE COLUMNS,,,,,,,,,,,,,,,,,
Column name,CF standard_name,IMOS long_name,Units,Fill value,Comments,,,,,,,,,,,,
Time,time,analysis_time,YYYY-MM-DDThh:mm:ssZ,,UTC date and time,,,,,,,,,,,,
Station_Code,,,,,National Reference Station code (6 letters),,,,,,,,,,,,
Latitude,latitude,latitude,degrees_north,-999,North positive,,,,,,,,,,,,
Longitude,longitude,longitude,degrees_east,-999,East positive,,,,,,,,,,,,
Depth,depth,depth,m ,-999,positive down,,,,,,,,,,,,
bb_corr,,corrected_volume_total_backwards_scattering_coefficient_of_(bbw_+_bbp)_in_sea_water,m-1,-999,bbw:volume_backwards_scattering_coefficient_of_radiative_flux_in_sea_water ; bbp=volume_backwards_scattering_coefficient_of_particules_in_sea_water,,,,,,,,,,,,
bb_uncorr,,volume_total_backwards_scattering_coefficient_of_(bbw_+_bbp)_in_sea_water,m-1,-999,bbw:volume_backwards_scattering_coefficient_of_radiative_flux_in_sea_water ; bbp=volume_backwards_scattering_coefficient_of_particules_in_sea_water,,,,,,,,,,,,
,,,,,,,,,,,,,,,,,
,,,,,,,,,,,,,,,,,
DATA,,,,,,,,,,,,,,,,,
,Time,Station_Code,Latitude,Longitude,Depth,bb_corr,bb_corr,bb_corr,bb_corr,bb_corr,bb_corr,bb_uncorr,bb_uncorr,bb_uncorr,bb_uncorr,bb_uncorr,bb_uncorr
Wavelength,,,,,,442,448,555,589,676,852,442,448,555,589,676,852
,2002-10-27T21:20:14Z,SAT018,-20.46,149.06,0,0.020802,0.014439,0.01343,0.008312,0.014649,0.008211,0.020022,0.013973,0.013041,0.008245,0.014338,0.005819
,2002-10-27T21:20:58Z,SAT018,-20.46,149.06,0.2,0.020926,0.015087,0.012469,0.008359,0.012333,0.007992,0.020142,0.014601,0.01211,0.008292,0.012071,0.005664
,2002-10-27T21:21:07Z,SAT018,-20.46,149.06,0.4,0.019175,0.01266,0.009469,0.00807,0.013684,0.008114,0.018458,0.012256,0.009199,0.008007,0.013395,0.00575
,2002-10-27T21:21:08Z,SAT018,-20.46,149.06,0.6,0.020299,0.012386,0.010966,0.00853,0.013758,0.009323,0.019541,0.011991,0.010654,0.008465,0.013468,0.006607
,2002-10-27T21:21:09Z,SAT018,-20.46,149.06,0.8,0.01987,0.012798,0.010548,0.008657,0.013709,0.008372,0.01912,0.012388,0.010247,0.00859,0.013416,0.005931
,2002-10-27T21:21:11Z,SAT018,-20.46,149.06,1,0.018848,0.013573,0.010625,0.009288,0.012802,0.008523,0.018098,0.013114,0.010305,0.009201,0.012512,0.00603
,2002-10-27T21:19:53Z,SAT018,-20.46,149.06,1.2,-999,-999,-999,-999,-999,-999,-999,-999,-999,-999,-999,-999
,2002-10-27T21:21:13Z,SAT018,-20.46,149.06,1.4,0.019282,0.012893,0.01017,0.008718,0.013647,0.008363,0.018458,0.012421,0.009839,0.008617,0.013304,0.005906
,2002-10-27T21:21:14Z,SAT018,-20.46,149.06,1.6,0.020397,0.013535,0.01149,0.008557,0.014587,0.008307,0.019541,0.013048,0.01112,0.008461,0.014224,0.005868
,2002-10-27T21:19:55Z,SAT018,-20.46,149.06,1.8,-999,-999,-999,-999,-999,-999,-999,-999,-999,-999,-999,-999
,2002-10-27T21:21:15Z,SAT018,-20.46,149.06,2,0.02158,0.013701,0.010823,0.008436,0.013092,0.009331,0.020683,0.013214,0.01048,0.008344,0.012767,0.006595
,2002-10-27T21:21:17Z,SAT018,-20.46,149.06,2.2,0.020833,0.013705,0.010769,0.008704,0.013271,0.008134,0.019962,0.013214,0.010421,0.008605,0.012939,0.00575
,2002-10-27T21:21:18Z,SAT018,-20.46,149.06,2.4,0.020029,0.012477,0.009809,0.009387,0.015559,0.010617,0.01918,0.012024,0.00949,0.009277,0.015164,0.007502
,2002-10-27T21:21:19Z,SAT018,-20.46,149.06,2.6,0.019989,0.013861,0.012347,0.008405,0.013087,0.009193,0.01912,0.013346,0.011935,0.008299,0.012744,0.006489
,2002-10-27T21:21:20Z,SAT018,-20.46,149.06,2.8,0.021481,0.013714,0.011736,0.008526,0.014096,0.009934,0.020563,0.013214,0.011353,0.008426,0.013742,0.007017
,2002-10-27T21:21:21Z,SAT018,-20.46,149.06,3,0.021922,0.014125,0.011614,0.008454,0.017659,0.009364,0.020984,0.01361,0.011237,0.008356,0.017219,0.006614
,2002-10-27T21:21:22Z,SAT018,-20.46,149.06,3.2,0.020628,0.015173,0.014093,0.009876,0.014375,0.009854,0.019721,0.014601,0.013624,0.009752,0.014004,0.006949
,2002-10-27T21:21:23Z,SAT018,-20.46,149.06,3.4,0.021951,0.013628,0.012048,0.009075,0.014891,0.009195,0.020984,0.013114,0.011644,0.00896,0.014504,0.006483
,2002-10-27T21:21:24Z,SAT018,-20.46,149.06,3.6,0.021955,0.014141,0.012773,0.010013,0.014772,0.009376,0.020984,0.01361,0.012343,0.009885,0.014388,0.006614
,2002-10-27T21:21:25Z,SAT018,-20.46,149.06,3.8,0.022101,0.013879,0.012363,0.009582,0.01526,0.010039,0.021104,0.013346,0.011935,0.009452,0.014851,0.007079
,2002-10-27T21:21:26Z,SAT018,-20.46,149.06,4,0.022128,0.01407,0.012562,0.009954,0.015947,0.010043,0.021104,0.013511,0.01211,0.009807,0.015502,0.007079
,2002-10-27T21:21:28Z,SAT018,-20.46,149.06,4.2,0.0256,0.013727,0.011049,0.016406,0.017019,0.010074,0.024411,0.01318,0.010654,0.016164,0.016538,0.007104
,2002-10-27T21:21:29Z,SAT018,-20.46,149.06,4.4,0.021885,0.013589,0.012225,0.009915,0.015671,0.010719,0.020803,0.013015,0.01176,0.009748,0.015207,0.007551
,2002-10-27T21:21:30Z,SAT018,-20.46,149.06,4.6,0.025019,0.015059,0.01207,0.011112,0.025153,0.014536,0.02381,0.014436,0.011623,0.010933,0.024416,0.01024
,2002-10-27T21:21:31Z,SAT018,-20.46,149.06,4.8,0.022177,0.015637,0.013461,0.010336,0.017107,0.011059,0.021111,0.014997,0.012964,0.010171,0.016611,0.007794
,2002-10-27T21:21:32Z,SAT018,-20.46,149.06,5,0.023821,0.015473,0.014636,0.011351,0.017409,0.01091,0.022662,0.014832,0.014088,0.011164,0.016899,0.007688
,2002-10-27T21:21:33Z,SAT018,-20.46,149.06,5.2,0.023526,0.018166,0.01678,0.010655,0.016853,0.010986,0.022295,0.017343,0.016123,0.010461,0.016321,0.007731
,2002-10-27T21:21:34Z,SAT018,-20.46,149.06,5.4,0.026273,0.01585,0.015314,0.010602,0.019316,0.011184,0.024884,0.015129,0.014708,0.010405,0.018704,0.007868
,2002-10-27T21:21:35Z,SAT018,-20.46,149.06,5.6,0.025401,0.015154,0.011812,0.010425,0.018551,0.01057,0.024062,0.014469,0.011337,0.010226,0.017965,0.007433
,2002-10-27T21:21:36Z,SAT018,-20.46,149.06,5.8,0.022933,0.015688,0.012368,0.012217,0.016953,0.011015,0.021718,0.014964,0.011863,0.011977,0.01641,0.007744
,2002-10-27T21:21:37Z,SAT018,-20.46,149.06,6,0.02527,0.015676,0.012866,0.009992,0.018076,0.010563,0.023945,0.014964,0.012349,0.009801,0.017502,0.007427
,2002-10-27T21:21:38Z,SAT018,-20.46,149.06,6.2,0.025628,0.017594,0.013708,0.010635,0.017607,0.012512,0.024248,0.016781,0.013149,0.010424,0.017036,0.008793
,2002-10-27T21:21:39Z,SAT018,-20.46,149.06,6.4,0.025163,0.015345,0.011981,0.012621,0.018008,0.011029,0.023735,0.014601,0.011466,0.012341,0.01739,0.007738
,2002-10-27T21:21:41Z,SAT018,-20.46,149.06,6.6,0.025752,0.016018,0.01276,0.012538,0.017675,0.013266,0.024388,0.015295,0.012249,0.012298,0.017118,0.009327
,2002-10-27T21:21:42Z,SAT018,-20.46,149.06,6.8,0.025363,0.017913,0.014397,0.01127,0.017075,0.011924,0.023928,0.017045,0.013769,0.011015,0.016488,0.008359
,2002-10-27T21:21:43Z,SAT018,-20.46,149.06,7,0.025563,0.017195,0.014196,0.011244,0.018772,0.012233,0.024091,0.016352,0.013562,0.010976,0.018093,0.008564
,2002-10-27T21:21:44Z,SAT018,-20.46,149.06,7.2,0.028102,0.017287,0.013719,0.011381,0.018782,0.011954,0.026569,0.016484,0.013149,0.011147,0.018161,0.00839
,2002-10-27T21:21:45Z,SAT018,-20.46,149.06,7.4,0.026067,0.01764,0.014821,0.011988,0.018428,0.011545,0.024645,0.016814,0.0142,0.011741,0.017828,0.008104
,2002-10-27T21:21:46Z,SAT018,-20.46,149.06,7.6,0.039092,0.018706,0.014748,0.011137,0.027243,0.011579,0.036812,0.017772,0.014077,0.010868,0.026281,0.008104
,2002-10-27T21:21:47Z,SAT018,-20.46,149.06,7.8,0.027793,0.017443,0.013775,0.011381,0.020277,0.012435,0.026126,0.01655,0.013132,0.011092,0.019538,0.008694
,2002-10-27T21:21:49Z,SAT018,-20.46,149.06,8,0.02576,0.019325,0.018624,0.011631,0.018699,0.011781,0.024102,0.018268,0.017716,0.011309,0.017956,0.00821
,2002-10-27T21:21:50Z,SAT018,-20.46,149.06,8.2,0.026225,0.018451,0.014275,0.0109,0.018696,0.015447,0.02465,0.017508,0.013629,0.010637,0.018018,0.010812
,2002-10-27T21:20:16Z,SAT018,-20.46,149.06,8.4,-999,-999,-999,-999,-999,-999,-999,-999,-999,-999,-999,-999
,2002-10-27T21:21:51Z,SAT018,-20.46,149.06,8.6,0.025815,0.018767,0.013673,0.012968,0.017639,0.011484,0.024382,0.017871,0.013087,0.012684,0.017036,0.008048
,2002-10-27T21:21:53Z,SAT018,-20.46,149.06,8.8,0.026233,0.018555,0.015011,0.013045,0.018592,0.011404,0.024773,0.017673,0.014379,0.012771,0.017963,0.008005
,2002-10-27T21:21:54Z,SAT018,-20.46,149.06,9,0.025934,0.016657,0.012958,0.011081,0.017996,0.012325,0.024312,0.015757,0.012355,0.0108,0.017323,0.008626
,2002-10-27T21:21:55Z,SAT018,-20.46,149.06,9.2,0.025742,0.017867,0.012937,0.011659,0.018572,0.012138,0.024196,0.016946,0.012327,0.011353,0.017858,0.008477
,2002-10-27T21:21:56Z,SAT018,-20.46,149.06,9.4,0.027881,0.017753,0.015365,0.012589,0.019634,0.012496,0.026277,0.01688,0.014686,0.012296,0.018931,0.008756
,2002-10-27T21:20:20Z,SAT018,-20.46,149.06,9.6,-999,-999,-999,-999,-999,-999,-999,-999,-999,-999,-999,-999
,2002-10-27T21:20:21Z,SAT018,-20.46,149.06,9.8,-999,-999,-999,-999,-999,-999,-999,-999,-999,-999,-999,-999
,2002-10-27T21:20:21Z,SAT018,-20.46,149.06,10,-999,-999,-999,-999,-999,-999,-999,-999,-999,-999,-999,-999
,2002-10-27T21:20:22Z,SAT018,-20.46,149.06,10.2,-999,-999,-999,-999,-999,-999,-999,-999,-999,-999,-999,-999
,2002-10-27T21:20:23Z,SAT018,-20.46,149.06,10.4,-999,-999,-999,-999,-999,-999,-999,-999,-999,-999,-999,-999
,2002-10-27T21:20:23Z,SAT018,-20.46,149.06,10.6,-999,-999,-999,-999,-999,-999,-999,-999,-999,-999,-999,-999
,2002-10-27T21:20:24Z,SAT018,-20.46,149.06,10.8,-999,-999,-999,-999,-999,-999,-999,-999,-999,-999,-999,-999
,2002-10-27T21:20:25Z,SAT018,-20.46,149.06,11,-999,-999,-999,-999,-999,-999,-999,-999,-999,-999,-999,-999
,2002-10-27T21:20:25Z,SAT018,-20.46,149.06,11.2,-999,-999,-999,-999,-999,-999,-999,-999,-999,-999,-999,-999
,2002-10-27T21:20:26Z,SAT018,-20.46,149.06,11.4,-999,-999,-999,-999,-999,-999,-999,-999,-999,-999,-999,-999
,2002-10-27T21:20:27Z,SAT018,-20.46,149.06,11.6,-999,-999,-999,-999,-999,-999,-999,-999,-999,-999,-999,-999
,2002-10-27T21:20:27Z,SAT018,-20.46,149.06,11.8,-999,-999,-999,-999,-999,-999,-999,-999,-999,-999,-999,-999
,2002-10-27T21:20:28Z,SAT018,-20.46,149.06,12,-999,-999,-999,-999,-999,-999,-999,-999,-999,-999,-999,-999
,2002-10-27T21:20:28Z,SAT018,-20.46,149.06,12.2,-999,-999,-999,-999,-999,-999,-999,-999,-999,-999,-999,-999
,2002-10-27T21:20:29Z,SAT018,-20.46,149.06,12.4,-999,-999,-999,-999,-999,-999,-999,-999,-999,-999,-999,-999
,2002-10-27T21:20:30Z,SAT018,-20.46,149.06,12.6,-999,-999,-999,-999,-999,-999,-999,-999,-999,-999,-999,-999
,2002-10-27T21:20:30Z,SAT018,-20.46,149.06,12.8,-999,-999,-999,-999,-999,-999,-999,-999,-999,-999,-999,-999
,2002-10-27T21:20:31Z,SAT018,-20.46,149.06,13,-999,-999,-999,-999,-999,-999,-999,-999,-999,-999,-999,-999
,2002-10-27T21:20:32Z,SAT018,-20.46,149.06,13.2,-999,-999,-999,-999,-999,-999,-999,-999,-999,-999,-999,-999
,2002-10-27T21:20:32Z,SAT018,-20.46,149.06,13.4,-999,-999,-999,-999,-999,-999,-999,-999,-999,-999,-999,-999
,2002-10-27T21:20:33Z,SAT018,-20.46,149.06,13.6,-999,-999,-999,-999,-999,-999,-999,-999,-999,-999,-999,-999
,2002-10-27T21:20:34Z,SAT018,-20.46,149.06,13.8,-999,-999,-999,-999,-999,-999,-999,-999,-999,-999,-999,-999
,2002-10-27T21:20:34Z,SAT018,-20.46,149.06,14,-999,-999,-999,-999,-999,-999,-999,-999,-999,-999,-999,-999
,2002-10-27T21:20:35Z,SAT018,-20.46,149.06,14.2,-999,-999,-999,-999,-999,-999,-999,-999,-999,-999,-999,-999
,2002-10-27T21:20:36Z,SAT018,-20.46,149.06,14.4,-999,-999,-999,-999,-999,-999,-999,-999,-999,-999,-999,-999
,2002-10-27T21:20:36Z,SAT018,-20.46,149.06,14.6,-999,-999,-999,-999,-999,-999,-999,-999,-999,-999,-999,-999
,2002-10-27T21:20:37Z,SAT018,-20.46,149.06,14.8,-999,-999,-999,-999,-999,-999,-999,-999,-999,-999,-999,-999
,2002-10-27T21:20:38Z,SAT018,-20.46,149.06,15,-999,-999,-999,-999,-999,-999,-999,-999,-999,-999,-999,-999
,2002-10-27T21:20:38Z,SAT018,-20.46,149.06,15.2,-999,-999,-999,-999,-999,-999,-999,-999,-999,-999,-999,-999
,2002-10-27T21:20:39Z,SAT018,-20.46,149.06,15.4,-999,-999,-999,-999,-999,-999,-999,-999,-999,-999,-999,-999
,2002-10-27T21:20:39Z,SAT018,-20.46,149.06,15.6,-999,-999,-999,-999,-999,-999,-999,-999,-999,-999,-999,-999
,2002-10-27T21:20:40Z,SAT018,-20.46,149.06,15.8,-999,-999,-999,-999,-999,-999,-999,-999,-999,-999,-999,-999
,2002-10-27T21:20:41Z,SAT018,-20.46,149.06,16,-999,-999,-999,-999,-999,-999,-999,-999,-999,-999,-999,-999
,2002-10-27T21:20:41Z,SAT018,-20.46,149.06,16.2,-999,-999,-999,-999,-999,-999,-999,-999,-999,-999,-999,-999
,2002-10-27T21:20:42Z,SAT018,-20.46,149.06,16.4,-999,-999,-999,-999,-999,-999,-999,-999,-999,-999,-999,-999
,2002-10-27T21:20:43Z,SAT018,-20.46,149.06,16.6,-999,-999,-999,-999,-999,-999,-999,-999,-999,-999,-999,-999
,2002-10-27T21:20:43Z,SAT018,-20.46,149.06,16.8,-999,-999,-999,-999,-999,-999,-999,-999,-999,-999,-999,-999
,2002-10-27T21:20:44Z,SAT018,-20.46,149.06,17,-999,-999,-999,-999,-999,-999,-999,-999,-999,-999,-999,-999
,2002-10-27T21:20:45Z,SAT018,-20.46,149.06,17.2,-999,-999,-999,-999,-999,-999,-999,-999,-999,-999,-999,-999
,2002-10-27T21:20:45Z,SAT018,-20.46,149.06,17.4,-999,-999,-999,-999,-999,-999,-999,-999,-999,-999,-999,-999
,2002-10-27T21:20:46Z,SAT018,-20.46,149.06,17.6,-999,-999,-999,-999,-999,-999,-999,-999,-999,-999,-999,-999
,2002-10-27T21:20:47Z,SAT018,-20.46,149.06,17.8,-999,-999,-999,-999,-999,-999,-999,-999,-999,-999,-999,-999
,2002-10-27T21:20:47Z,SAT018,-20.46,149.06,18,-999,-999,-999,-999,-999,-999,-999,-999,-999,-999,-999,-999
,2002-10-27T21:20:48Z,SAT018,-20.46,149.06,18.2,-999,-999,-999,-999,-999,-999,-999,-999,-999,-999,-999,-999
,2002-10-27T21:20:48Z,SAT018,-20.46,149.06,18.4,-999,-999,-999,-999,-999,-999,-999,-999,-999,-999,-999,-999
,2002-10-27T21:20:49Z,SAT018,-20.46,149.06,18.6,-999,-999,-999,-999,-999,-999,-999,-999,-999,-999,-999,-999
,2002-10-27T21:20:50Z,SAT018,-20.46,149.06,18.8,-999,-999,-999,-999,-999,-999,-999,-999,-999,-999,-999,-999
,2002-10-27T21:20:50Z,SAT018,-20.46,149.06,19,-999,-999,-999,-999,-999,-999,-999,-999,-999,-999,-999,-999
,2002-10-27T21:20:51Z,SAT018,-20.46,149.06,19.2,-999,-999,-999,-999,-999,-999,-999,-999,-999,-999,-999,-999
,2002-10-27T21:20:52Z,SAT018,-20.46,149.06,19.4,-999,-999,-999,-999,-999,-999,-999,-999,-999,-999,-999,-999
,2002-10-27T21:20:52Z,SAT018,-20.46,149.06,19.6,-999,-999,-999,-999,-999,-999,-999,-999,-999,-999,-999,-999
,2002-10-27T21:20:53Z,SAT018,-20.46,149.06,19.8,-999,-999,-999,-999,-999,-999,-999,-999,-999,-999,-999,-999
,2002-10-27T21:20:54Z,SAT018,-20.46,149.06,20,-999,-999,-999,-999,-999,-999,-999,-999,-999,-999,-999,-999
,2002-10-27T21:20:54Z,SAT018,-20.46,149.06,20.2,-999,-999,-999,-999,-999,-999,-999,-999,-999,-999,-999,-999
,2002-10-27T21:20:55Z,SAT018,-20.46,149.06,20.4,-999,-999,-999,-999,-999,-999,-999,-999,-999,-999,-999,-999
,2002-10-27T21:20:56Z,SAT018,-20.46,149.06,20.6,-999,-999,-999,-999,-999,-999,-999,-999,-999,-999,-999,-999
,2002-10-27T21:20:56Z,SAT018,-20.46,149.06,20.8,-999,-999,-999,-999,-999,-999,-999,-999,-999,-999,-999,-999
,2002-10-27T21:20:57Z,SAT018,-20.46,149.06,21,-999,-999,-999,-999,-999,-999,-999,-999,-999,-999,-999,-999
,2002-10-27T21:20:58Z,SAT018,-20.46,149.06,21.2,-999,-999,-999,-999,-999,-999,-999,-999,-999,-999,-999,-999
,2002-10-27T21:20:58Z,SAT018,-20.46,149.06,21.4,-999,-999,-999,-999,-999,-999,-999,-999,-999,-999,-999,-999
,2002-10-27T21:20:59Z,SAT018,-20.46,149.06,21.6,-999,-999,-999,-999,-999,-999,-999,-999,-999,-999,-999,-999
,2002-10-27T21:20:59Z,SAT018,-20.46,149.06,21.8,-999,-999,-999,-999,-999,-999,-999,-999,-999,-999,-999,-999
,2002-10-27T21:21:00Z,SAT018,-20.46,149.06,22,-999,-999,-999,-999,-999,-999,-999,-999,-999,-999,-999,-999
,2002-10-27T21:21:01Z,SAT018,-20.46,149.06,22.2,-999,-999,-999,-999,-999,-999,-999,-999,-999,-999,-999,-999
,2002-10-27T21:21:01Z,SAT018,-20.46,149.06,22.4,-999,-999,-999,-999,-999,-999,-999,-999,-999,-999,-999,-999
,2002-10-27T21:21:02Z,SAT018,-20.46,149.06,22.6,-999,-999,-999,-999,-999,-999,-999,-999,-999,-999,-999,-999
,2002-10-27T21:21:03Z,SAT018,-20.46,149.06,22.8,-999,-999,-999,-999,-999,-999,-999,-999,-999,-999,-999,-999
,2002-10-27T21:21:03Z,SAT018,-20.46,149.06,23,-999,-999,-999,-999,-999,-999,-999,-999,-999,-999,-999,-999
,2002-10-27T21:21:04Z,SAT018,-20.46,149.06,23.2,-999,-999,-999,-999,-999,-999,-999,-999,-999,-999,-999,-999
,2002-10-27T21:21:05Z,SAT018,-20.46,149.06,23.4,-999,-999,-999,-999,-999,-999,-999,-999,-999,-999,-999,-999
,2002-10-27T21:21:05Z,SAT018,-20.46,149.06,23.6,-999,-999,-999,-999,-999,-999,-999,-999,-999,-999,-999,-999
,2002-10-27T21:21:06Z,SAT018,-20.46,149.06,23.8,-999,-999,-999,-999,-999,-999,-999,-999,-999,-999,-999,-999
,2002-10-27T21:21:07Z,SAT018,-20.46,149.06,24,-999,-999,-999,-999,-999,-999,-999,-999,-999,-999,-999,-999
,2002-10-27T21:21:07Z,SAT018,-20.46,149.06,24.2,-999,-999,-999,-999,-999,-999,-999,-999,-999,-999,-999,-999
,2002-10-27T21:21:08Z,SAT018,-20.46,149.06,24.4,-999,-999,-999,-999,-999,-999,-999,-999,-999,-999,-999,-999
,2002-10-27T21:21:09Z,SAT018,-20.46,149.06,24.6,-999,-999,-999,-999,-999,-999,-999,-999,-999,-999,-999,-999
,2002-10-27T21:21:09Z,SAT018,-20.46,149.06,24.8,-999,-999,-999,-999,-999,-999,-999,-999,-999,-999,-999,-999
,2002-10-27T21:21:10Z,SAT018,-20.46,149.06,25,-999,-999,-999,-999,-999,-999,-999,-999,-999,-999,-999,-999
,2002-10-27T21:21:10Z,SAT018,-20.46,149.06,25.2,-999,-999,-999,-999,-999,-999,-999,-999,-999,-999,-999,-999
,2002-10-27T21:21:11Z,SAT018,-20.46,149.06,25.4,-999,-999,-999,-999,-999,-999,-999,-999,-999,-999,-999,-999
,2002-10-27T21:21:12Z,SAT018,-20.46,149.06,25.6,-999,-999,-999,-999,-999,-999,-999,-999,-999,-999,-999,-999
,2002-10-27T21:21:12Z,SAT018,-20.46,149.06,25.8,-999,-999,-999,-999,-999,-999,-999,-999,-999,-999,-999,-999
,2002-10-27T21:21:13Z,SAT018,-20.46,149.06,26,-999,-999,-999,-999,-999,-999,-999,-999,-999,-999,-999,-999
,2002-10-27T21:21:14Z,SAT018,-20.46,149.06,26.2,-999,-999,-999,-999,-999,-999,-999,-999,-999,-999,-999,-999
,2002-10-27T21:21:14Z,SAT018,-20.46,149.06,26.4,-999,-999,-999,-999,-999,-999,-999,-999,-999,-999,-999,-999
,2002-10-27T21:21:15Z,SAT018,-20.46,149.06,26.6,-999,-999,-999,-999,-999,-999,-999,-999,-999,-999,-999,-999
,2002-10-27T21:21:16Z,SAT018,-20.46,149.06,26.8,-999,-999,-999,-999,-999,-999,-999,-999,-999,-999,-999,-999
,2002-10-27T21:21:16Z,SAT018,-20.46,149.06,27,-999,-999,-999,-999,-999,-999,-999,-999,-999,-999,-999,-999
,2002-10-27T21:21:17Z,SAT018,-20.46,149.06,27.2,-999,-999,-999,-999,-999,-999,-999,-999,-999,-999,-999,-999
,2002-10-27T21:21:18Z,SAT018,-20.46,149.06,27.4,-999,-999,-999,-999,-999,-999,-999,-999,-999,-999,-999,-999
,2002-10-27T21:21:18Z,SAT018,-20.46,149.06,27.6,-999,-999,-999,-999,-999,-999,-999,-999,-999,-999,-999,-999
,2002-10-27T21:21:19Z,SAT018,-20.46,149.06,27.8,-999,-999,-999,-999,-999,-999,-999,-999,-999,-999,-999,-999
,2002-10-27T21:21:20Z,SAT018,-20.46,149.06,28,-999,-999,-999,-999,-999,-999,-999,-999,-999,-999,-999,-999
,2002-10-27T21:21:20Z,SAT018,-20.46,149.06,28.2,-999,-999,-999,-999,-999,-999,-999,-999,-999,-999,-999,-999
,2002-10-27T21:21:21Z,SAT018,-20.46,149.06,28.4,-999,-999,-999,-999,-999,-999,-999,-999,-999,-999,-999,-999
,2002-10-27T21:21:21Z,SAT018,-20.46,149.06,28.6,-999,-999,-999,-999,-999,-999,-999,-999,-999,-999,-999,-999
,2002-10-27T21:21:22Z,SAT018,-20.46,149.06,28.8,-999,-999,-999,-999,-999,-999,-999,-999,-999,-999,-999,-999
,2002-10-27T21:21:23Z,SAT018,-20.46,149.06,29,-999,-999,-999,-999,-999,-999,-999,-999,-999,-999,-999,-999
,2002-10-27T21:21:23Z,SAT018,-20.46,149.06,29.2,-999,-999,-999,-999,-999,-999,-999,-999,-999,-999,-999,-999
,2002-10-27T21:21:24Z,SAT018,-20.46,149.06,29.4,-999,-999,-999,-999,-999,-999,-999,-999,-999,-999,-999,-999
,2002-10-27T21:21:25Z,SAT018,-20.46,149.06,29.6,-999,-999,-999,-999,-999,-999,-999,-999,-999,-999,-999,-999
,2002-10-27T21:21:25Z,SAT018,-20.46,149.06,29.8,-999,-999,-999,-999,-999,-999,-999,-999,-999,-999,-999,-999
,2002-10-27T21:21:26Z,SAT018,-20.46,149.06,30,-999,-999,-999,-999,-999,-999,-999,-999,-999,-999,-999,-999
,2002-10-27T21:21:27Z,SAT018,-20.46,149.06,30.2,-999,-999,-999,-999,-999,-999,-999,-999,-999,-999,-999,-999
,2002-10-27T21:21:27Z,SAT018,-20.46,149.06,30.4,-999,-999,-999,-999,-999,-999,-999,-999,-999,-999,-999,-999
,2002-10-27T21:21:28Z,SAT018,-20.46,149.06,30.6,-999,-999,-999,-999,-999,-999,-999,-999,-999,-999,-999,-999
,2002-10-27T21:21:29Z,SAT018,-20.46,149.06,30.8,-999,-999,-999,-999,-999,-999,-999,-999,-999,-999,-999,-999
,2002-10-27T21:21:29Z,SAT018,-20.46,149.06,31,-999,-999,-999,-999,-999,-999,-999,-999,-999,-999,-999,-999
,2002-10-27T21:21:30Z,SAT018,-20.46,149.06,31.2,-999,-999,-999,-999,-999,-999,-999,-999,-999,-999,-999,-999
,2002-10-27T21:21:31Z,SAT018,-20.46,149.06,31.4,-999,-999,-999,-999,-999,-999,-999,-999,-999,-999,-999,-999
,2002-10-27T21:21:31Z,SAT018,-20.46,149.06,31.6,-999,-999,-999,-999,-999,-999,-999,-999,-999,-999,-999,-999
,2002-10-27T21:21:32Z,SAT018,-20.46,149.06,31.8,-999,-999,-999,-999,-999,-999,-999,-999,-999,-999,-999,-999
,2002-10-27T21:21:32Z,SAT018,-20.46,149.06,32,-999,-999,-999,-999,-999,-999,-999,-999,-999,-999,-999,-999
,2002-10-27T21:21:33Z,SAT018,-20.46,149.06,32.2,-999,-999,-999,-999,-999,-999,-999,-999,-999,-999,-999,-999
,2002-10-27T21:21:34Z,SAT018,-20.46,149.06,32.4,-999,-999,-999,-999,-999,-999,-999,-999,-999,-999,-999,-999
,2002-10-27T21:21:34Z,SAT018,-20.46,149.06,32.6,-999,-999,-999,-999,-999,-999,-999,-999,-999,-999,-999,-999
,2002-10-27T21:21:35Z,SAT018,-20.46,149.06,32.8,-999,-999,-999,-999,-999,-999,-999,-999,-999,-999,-999,-999
,2002-10-27T21:21:36Z,SAT018,-20.46,149.06,33,-999,-999,-999,-999,-999,-999,-999,-999,-999,-999,-999,-999
,2002-10-27T21:21:36Z,SAT018,-20.46,149.06,33.2,-999,-999,-999,-999,-999,-999,-999,-999,-999,-999,-999,-999
,2002-10-27T21:21:37Z,SAT018,-20.46,149.06,33.4,-999,-999,-999,-999,-999,-999,-999,-999,-999,-999,-999,-999
,2002-10-27T21:21:38Z,SAT018,-20.46,149.06,33.6,-999,-999,-999,-999,-999,-999,-999,-999,-999,-999,-999,-999
,2002-10-27T21:21:38Z,SAT018,-20.46,149.06,33.8,-999,-999,-999,-999,-999,-999,-999,-999,-999,-999,-999,-999
,2002-10-27T21:21:39Z,SAT018,-20.46,149.06,34,-999,-999,-999,-999,-999,-999,-999,-999,-999,-999,-999,-999
,2002-10-27T21:21:40Z,SAT018,-20.46,149.06,34.2,-999,-999,-999,-999,-999,-999,-999,-999,-999,-999,-999,-999
,2002-10-27T21:21:40Z,SAT018,-20.46,149.06,34.4,-999,-999,-999,-999,-999,-999,-999,-999,-999,-999,-999,-999
,2002-10-27T21:21:41Z,SAT018,-20.46,149.06,34.6,-999,-999,-999,-999,-999,-999,-999,-999,-999,-999,-999,-999
,2002-10-27T21:21:42Z,SAT018,-20.46,149.06,34.8,-999,-999,-999,-999,-999,-999,-999,-999,-999,-999,-999,-999
,2002-10-27T21:21:42Z,SAT018,-20.46,149.06,35,-999,-999,-999,-999,-999,-999,-999,-999,-999,-999,-999,-999
,2002-10-27T21:21:43Z,SAT018,-20.46,149.06,35.2,-999,-999,-999,-999,-999,-999,-999,-999,-999,-999,-999,-999
,2002-10-27T21:21:43Z,SAT018,-20.46,149.06,35.4,-999,-999,-999,-999,-999,-999,-999,-999,-999,-999,-999,-999
,2002-10-27T21:21:44Z,SAT018,-20.46,149.06,35.6,-999,-999,-999,-999,-999,-999,-999,-999,-999,-999,-999,-999
,2002-10-27T21:21:45Z,SAT018,-20.46,149.06,35.8,-999,-999,-999,-999,-999,-999,-999,-999,-999,-999,-999,-999
,2002-10-27T21:21:45Z,SAT018,-20.46,149.06,36,-999,-999,-999,-999,-999,-999,-999,-999,-999,-999,-999,-999
,2002-10-27T21:21:46Z,SAT018,-20.46,149.06,36.2,-999,-999,-999,-999,-999,-999,-999,-999,-999,-999,-999,-999
,2002-10-27T21:21:47Z,SAT018,-20.46,149.06,36.4,-999,-999,-999,-999,-999,-999,-999,-999,-999,-999,-999,-999
,2002-10-27T21:21:47Z,SAT018,-20.46,149.06,36.6,-999,-999,-999,-999,-999,-999,-999,-999,-999,-999,-999,-999
,2002-10-27T21:21:48Z,SAT018,-20.46,149.06,36.8,-999,-999,-999,-999,-999,-999,-999,-999,-999,-999,-999,-999
,2002-10-27T21:21:49Z,SAT018,-20.46,149.06,37,-999,-999,-999,-999,-999,-999,-999,-999,-999,-999,-999,-999
,2002-10-27T21:21:49Z,SAT018,-20.46,149.06,37.2,-999,-999,-999,-999,-999,-999,-999,-999,-999,-999,-999,-999
,2002-10-27T21:21:50Z,SAT018,-20.46,149.06,37.4,-999,-999,-999,-999,-999,-999,-999,-999,-999,-999,-999,-999
,2002-10-27T21:21:51Z,SAT018,-20.46,149.06,37.6,-999,-999,-999,-999,-999,-999,-999,-999,-999,-999,-999,-999
,2002-10-27T21:21:51Z,SAT018,-20.46,149.06,37.8,-999,-999,-999,-999,-999,-999,-999,-999,-999,-999,-999,-999
,2002-10-27T21:21:52Z,SAT018,-20.46,149.06,38,-999,-999,-999,-999,-999,-999,-999,-999,-999,-999,-999,-999
,2002-10-27T21:21:53Z,SAT018,-20.46,149.06,38.2,-999,-999,-999,-999,-999,-999,-999,-999,-999,-999,-999,-999
,2002-10-27T21:21:53Z,SAT018,-20.46,149.06,38.4,-999,-999,-999,-999,-999,-999,-999,-999,-999,-999,-999,-999
,2002-10-27T21:21:54Z,SAT018,-20.46,149.06,38.6,-999,-999,-999,-999,-999,-999,-999,-999,-999,-999,-999,-999
,2002-10-27T21:21:54Z,SAT018,-20.46,149.06,38.8,-999,-999,-999,-999,-999,-999,-999,-999,-999,-999,-999,-999
,2002-10-27T21:21:55Z,SAT018,-20.46,149.06,39,-999,-999,-999,-999,-999,-999,-999,-999,-999,-999,-999,-999
,2002-10-27T21:21:56Z,SAT018,-20.46,149.06,39.2,-999,-999,-999,-999,-999,-999,-999,-999,-999,-999,-999,-999
,2002-10-27T21:21:56Z,SAT018,-20.46,149.06,39.4,-999,-999,-999,-999,-999,-999,-999,-999,-999,-999,-999,-999
,2002-10-27T21:22:32Z,SAT018,-20.46,149.06,39.6,-999,-999,-999,-999,-999,-999,-999,-999,-999,-999,-999,-999
,2002-10-27T21:22:33Z,SAT018,-20.46,149.06,39.8,-999,-999,-999,-999,-999,-999,-999,-999,-999,-999,-999,-999
,2002-10-27T21:22:33Z,SAT018,-20.46,149.06,40,-999,-999,-999,-999,-999,-999,-999,-999,-999,-999,-999,-999
,2002-10-27T21:22:34Z,SAT018,-20.46,149.06,40.2,-999,-999,-999,-999,-999,-999,-999,-999,-999,-999,-999,-999
,2002-10-27T21:22:35Z,SAT018,-20.46,149.06,40.4,-999,-999,-999,-999,-999,-999,-999,-999,-999,-999,-999,-999
,2002-10-27T21:22:35Z,SAT018,-20.46,149.06,40.6,-999,-999,-999,-999,-999,-999,-999,-999,-999,-999,-999,-999
,2002-10-27T21:22:36Z,SAT018,-20.46,149.06,40.8,-999,-999,-999,-999,-999,-999,-999,-999,-999,-999,-999,-999
,2002-10-27T21:22:37Z,SAT018,-20.46,149.06,41,-999,-999,-999,-999,-999,-999,-999,-999,-999,-999,-999,-999
,2002-10-27T21:22:37Z,SAT018,-20.46,149.06,41.2,-999,-999,-999,-999,-999,-999,-999,-999,-999,-999,-999,-999
,2002-10-27T21:22:38Z,SAT018,-20.46,149.06,41.4,-999,-999,-999,-999,-999,-999,-999,-999,-999,-999,-999,-999
,2002-10-27T21:22:39Z,SAT018,-20.46,149.06,41.6,-999,-999,-999,-999,-999,-999,-999,-999,-999,-999,-999,-999
,2002-10-27T21:22:39Z,SAT018,-20.46,149.06,41.8,-999,-999,-999,-999,-999,-999,-999,-999,-999,-999,-999,-999
,2002-10-27T21:22:40Z,SAT018,-20.46,149.06,42,-999,-999,-999,-999,-999,-999,-999,-999,-999,-999,-999,-999
,2002-10-27T21:22:40Z,SAT018,-20.46,149.06,42.2,-999,-999,-999,-999,-999,-999,-999,-999,-999,-999,-999,-999
,2002-10-27T21:22:41Z,SAT018,-20.46,149.06,42.4,-999,-999,-999,-999,-999,-999,-999,-999,-999,-999,-999,-999
,2002-10-27T21:22:42Z,SAT018,-20.46,149.06,42.6,-999,-999,-999,-999,-999,-999,-999,-999,-999,-999,-999,-999
,2002-10-27T21:22:42Z,SAT018,-20.46,149.06,42.8,-999,-999,-999,-999,-999,-999,-999,-999,-999,-999,-999,-999
,2002-10-27T21:22:43Z,SAT018,-20.46,149.06,43,-999,-999,-999,-999,-999,-999,-999,-999,-999,-999,-999,-999
,2002-10-27T21:22:44Z,SAT018,-20.46,149.06,43.2,-999,-999,-999,-999,-999,-999,-999,-999,-999,-999,-999,-999
,2002-10-27T21:22:44Z,SAT018,-20.46,149.06,43.4,-999,-999,-999,-999,-999,-999,-999,-999,-999,-999,-999,-999
,2002-10-27T21:22:45Z,SAT018,-20.46,149.06,43.6,-999,-999,-999,-999,-999,-999,-999,-999,-999,-999,-999,-999
,2002-10-27T21:22:46Z,SAT018,-20.46,149.06,43.8,-999,-999,-999,-999,-999,-999,-999,-999,-999,-999,-999,-999
,2002-10-27T21:22:46Z,SAT018,-20.46,149.06,44,-999,-999,-999,-999,-999,-999,-999,-999,-999,-999,-999,-999
,2002-10-27T21:22:47Z,SAT018,-20.46,149.06,44.2,-999,-999,-999,-999,-999,-999,-999,-999,-999,-999,-999,-999
,2002-10-27T21:22:48Z,SAT018,-20.46,149.06,44.4,-999,-999,-999,-999,-999,-999,-999,-999,-999,-999,-999,-999
,2002-10-27T21:22:48Z,SAT018,-20.46,149.06,44.6,-999,-999,-999,-999,-999,-999,-999,-999,-999,-999,-999,-999
,2002-10-27T21:22:49Z,SAT018,-20.46,149.06,44.8,-999,-999,-999,-999,-999,-999,-999,-999,-999,-999,-999,-999
,2002-10-27T21:22:50Z,SAT018,-20.46,149.06,45,-999,-999,-999,-999,-999,-999,-999,-999,-999,-999,-999,-999
,2002-10-27T21:22:50Z,SAT018,-20.46,149.06,45.2,-999,-999,-999,-999,-999,-999,-999,-999,-999,-999,-999,-999
,2002-10-27T21:22:51Z,SAT018,-20.46,149.06,45.4,-999,-999,-999,-999,-999,-999,-999,-999,-999,-999,-999,-999
,2002-10-27T21:22:51Z,SAT018,-20.46,149.06,45.6,-999,-999,-999,-999,-999,-999,-999,-999,-999,-999,-999,-999
,2002-10-27T21:22:52Z,SAT018,-20.46,149.06,45.8,-999,-999,-999,-999,-999,-999,-999,-999,-999,-999,-999,-999
,2002-10-27T21:22:53Z,SAT018,-20.46,149.06,46,-999,-999,-999,-999,-999,-999,-999,-999,-999,-999,-999,-999
,2002-10-27T21:22:53Z,SAT018,-20.46,149.06,46.2,-999,-999,-999,-999,-999,-999,-999,-999,-999,-999,-999,-999
,2002-10-27T21:22:54Z,SAT018,-20.46,149.06,46.4,-999,-999,-999,-999,-999,-999,-999,-999,-999,-999,-999,-999
,2002-10-27T21:22:55Z,SAT018,-20.46,149.06,46.6,-999,-999,-999,-999,-999,-999,-999,-999,-999,-999,-999,-999
,2002-10-27T21:22:55Z,SAT018,-20.46,149.06,46.8,-999,-999,-999,-999,-999,-999,-999,-999,-999,-999,-999,-999
,2002-10-27T21:22:56Z,SAT018,-20.46,149.06,47,-999,-999,-999,-999,-999,-999,-999,-999,-999,-999,-999,-999
,2002-10-27T21:22:57Z,SAT018,-20.46,149.06,47.2,-999,-999,-999,-999,-999,-999,-999,-999,-999,-999,-999,-999
,2002-10-27T21:22:57Z,SAT018,-20.46,149.06,47.4,-999,-999,-999,-999,-999,-999,-999,-999,-999,-999,-999,-999
,2002-10-27T21:22:58Z,SAT018,-20.46,149.06,47.6,-999,-999,-999,-999,-999,-999,-999,-999,-999,-999,-999,-999
,2002-10-27T21:22:59Z,SAT018,-20.46,149.06,47.8,-999,-999,-999,-999,-999,-999,-999,-999,-999,-999,-999,-999
,2002-10-27T21:22:59Z,SAT018,-20.46,149.06,48,-999,-999,-999,-999,-999,-999,-999,-999,-999,-999,-999,-999
,2002-10-27T21:23:00Z,SAT018,-20.46,149.06,48.2,-999,-999,-999,-999,-999,-999,-999,-999,-999,-999,-999,-999
,2002-10-27T21:23:01Z,SAT018,-20.46,149.06,48.4,-999,-999,-999,-999,-999,-999,-999,-999,-999,-999,-999,-999
,2002-10-27T21:23:01Z,SAT018,-20.46,149.06,48.6,-999,-999,-999,-999,-999,-999,-999,-999,-999,-999,-999,-999
,2002-10-27T21:23:02Z,SAT018,-20.46,149.06,48.8,-999,-999,-999,-999,-999,-999,-999,-999,-999,-999,-999,-999
,2002-10-27T21:23:02Z,SAT018,-20.46,149.06,49,-999,-999,-999,-999,-999,-999,-999,-999,-999,-999,-999,-999
,2002-10-27T21:23:03Z,SAT018,-20.46,149.06,49.2,-999,-999,-999,-999,-999,-999,-999,-999,-999,-999,-999,-999
,2002-10-27T21:23:04Z,SAT018,-20.46,149.06,49.4,-999,-999,-999,-999,-999,-999,-999,-999,-999,-999,-999,-999
,2002-10-27T21:23:04Z,SAT018,-20.46,149.06,49.6,-999,-999,-999,-999,-999,-999,-999,-999,-999,-999,-999,-999
,2002-10-27T21:23:05Z,SAT018,-20.46,149.06,49.8,-999,-999,-999,-999,-999,-999,-999,-999,-999,-999,-999,-999
,2002-10-27T21:23:06Z,SAT018,-20.46,149.06,50,-999,-999,-999,-999,-999,-999,-999,-999,-999,-999,-999,-999
,2002-10-27T21:23:06Z,SAT018,-20.46,149.06,50.2,-999,-999,-999,-999,-999,-999,-999,-999,-999,-999,-999,-999
,2002-10-27T21:23:07Z,SAT018,-20.46,149.06,50.4,-999,-999,-999,-999,-999,-999,-999,-999,-999,-999,-999,-999
,2002-10-27T21:23:08Z,SAT018,-20.46,149.06,50.6,-999,-999,-999,-999,-999,-999,-999,-999,-999,-999,-999,-999
,2002-10-27T21:23:08Z,SAT018,-20.46,149.06,50.8,-999,-999,-999,-999,-999,-999,-999,-999,-999,-999,-999,-999
,2002-10-27T21:23:09Z,SAT018,-20.46,149.06,51,-999,-999,-999,-999,-999,-999,-999,-999,-999,-999,-999,-999
,2002-10-27T21:23:10Z,SAT018,-20.46,149.06,51.2,-999,-999,-999,-999,-999,-999,-999,-999,-999,-999,-999,-999
,2002-10-27T21:23:10Z,SAT018,-20.46,149.06,51.4,-999,-999,-999,-999,-999,-999,-999,-999,-999,-999,-999,-999
,2002-10-27T21:23:11Z,SAT018,-20.46,149.06,51.6,-999,-999,-999,-999,-999,-999,-999,-999,-999,-999,-999,-999
,2002-10-27T21:23:11Z,SAT018,-20.46,149.06,51.8,-999,-999,-999,-999,-999,-999,-999,-999,-999,-999,-999,-999
,2002-10-27T21:23:12Z,SAT018,-20.46,149.06,52,-999,-999,-999,-999,-999,-999,-999,-999,-999,-999,-999,-999
,2002-10-27T21:23:13Z,SAT018,-20.46,149.06,52.2,-999,-999,-999,-999,-999,-999,-999,-999,-999,-999,-999,-999
,2002-10-27T21:23:13Z,SAT018,-20.46,149.06,52.4,-999,-999,-999,-999,-999,-999,-999,-999,-999,-999,-999,-999
,2002-10-27T21:23:14Z,SAT018,-20.46,149.06,52.6,-999,-999,-999,-999,-999,-999,-999,-999,-999,-999,-999,-999
,2002-10-27T21:23:15Z,SAT018,-20.46,149.06,52.8,-999,-999,-999,-999,-999,-999,-999,-999,-999,-999,-999,-999
,2002-10-27T21:23:15Z,SAT018,-20.46,149.06,53,-999,-999,-999,-999,-999,-999,-999,-999,-999,-999,-999,-999
,2002-10-27T21:23:16Z,SAT018,-20.46,149.06,53.2,-999,-999,-999,-999,-999,-999,-999,-999,-999,-999,-999,-999
,2002-10-27T21:23:17Z,SAT018,-20.46,149.06,53.4,-999,-999,-999,-999,-999,-999,-999,-999,-999,-999,-999,-999
,2002-10-27T21:23:17Z,SAT018,-20.46,149.06,53.6,-999,-999,-999,-999,-999,-999,-999,-999,-999,-999,-999,-999
,2002-10-27T21:23:18Z,SAT018,-20.46,149.06,53.8,-999,-999,-999,-999,-999,-999,-999,-999,-999,-999,-999,-999
,2002-10-27T21:23:19Z,SAT018,-20.46,149.06,54,-999,-999,-999,-999,-999,-999,-999,-999,-999,-999,-999,-999
,2002-10-27T21:23:19Z,SAT018,-20.46,149.06,54.2,-999,-999,-999,-999,-999,-999,-999,-999,-999,-999,-999,-999
,2002-10-27T21:23:20Z,SAT018,-20.46,149.06,54.4,-999,-999,-999,-999,-999,-999,-999,-999,-999,-999,-999,-999
,2002-10-27T21:23:21Z,SAT018,-20.46,149.06,54.6,-999,-999,-999,-999,-999,-999,-999,-999,-999,-999,-999,-999
,2002-10-27T21:23:21Z,SAT018,-20.46,149.06,54.8,-999,-999,-999,-999,-999,-999,-999,-999,-999,-999,-999,-999
,2002-10-27T21:23:22Z,SAT018,-20.46,149.06,55,-999,-999,-999,-999,-999,-999,-999,-999,-999,-999,-999,-999
,2002-10-27T21:23:22Z,SAT018,-20.46,149.06,55.2,-999,-999,-999,-999,-999,-999,-999,-999,-999,-999,-999,-999
,2002-10-27T21:23:23Z,SAT018,-20.46,149.06,55.4,-999,-999,-999,-999,-999,-999,-999,-999,-999,-999,-999,-999
,2002-10-27T21:23:24Z,SAT018,-20.46,149.06,55.6,-999,-999,-999,-999,-999,-999,-999,-999,-999,-999,-999,-999
,2002-10-27T21:23:24Z,SAT018,-20.46,149.06,55.8,-999,-999,-999,-999,-999,-999,-999,-999,-999,-999,-999,-999
,2002-10-27T21:23:25Z,SAT018,-20.46,149.06,56,-999,-999,-999,-999,-999,-999,-999,-999,-999,-999,-999,-999
,2002-10-27T21:23:26Z,SAT018,-20.46,149.06,56.2,-999,-999,-999,-999,-999,-999,-999,-999,-999,-999,-999,-999
,2002-10-27T21:23:26Z,SAT018,-20.46,149.06,56.4,-999,-999,-999,-999,-999,-999,-999,-999,-999,-999,-999,-999
,2002-10-27T21:23:27Z,SAT018,-20.46,149.06,56.6,-999,-999,-999,-999,-999,-999,-999,-999,-999,-999,-999,-999
,2002-10-27T21:23:28Z,SAT018,-20.46,149.06,56.8,-999,-999,-999,-999,-999,-999,-999,-999,-999,-999,-999,-999
,2002-10-27T21:23:28Z,SAT018,-20.46,149.06,57,-999,-999,-999,-999,-999,-999,-999,-999,-999,-999,-999,-999
,2002-10-27T21:23:29Z,SAT018,-20.46,149.06,57.2,-999,-999,-999,-999,-999,-999,-999,-999,-999,-999,-999,-999
,2002-10-27T21:23:30Z,SAT018,-20.46,149.06,57.4,-999,-999,-999,-999,-999,-999,-999,-999,-999,-999,-999,-999
,2002-10-27T21:23:30Z,SAT018,-20.46,149.06,57.6,-999,-999,-999,-999,-999,-999,-999,-999,-999,-999,-999,-999
,2002-10-27T21:23:31Z,SAT018,-20.46,149.06,57.8,-999,-999,-999,-999,-999,-999,-999,-999,-999,-999,-999,-999
,2002-10-27T21:23:32Z,SAT018,-20.46,149.06,58,-999,-999,-999,-999,-999,-999,-999,-999,-999,-999,-999,-999
,2002-10-27T21:23:32Z,SAT018,-20.46,149.06,58.2,-999,-999,-999,-999,-999,-999,-999,-999,-999,-999,-999,-999
,2002-10-27T21:23:33Z,SAT018,-20.46,149.06,58.4,-999,-999,-999,-999,-999,-999,-999,-999,-999,-999,-999,-999
,2002-10-27T21:23:33Z,SAT018,-20.46,149.06,58.6,-999,-999,-999,-999,-999,-999,-999,-999,-999,-999,-999,-999
,2002-10-27T21:23:34Z,SAT018,-20.46,149.06,58.8,-999,-999,-999,-999,-999,-999,-999,-999,-999,-999,-999,-999
,2002-10-27T21:23:35Z,SAT018,-20.46,149.06,59,-999,-999,-999,-999,-999,-999,-999,-999,-999,-999,-999,-999
,2002-10-27T21:23:35Z,SAT018,-20.46,149.06,59.2,-999,-999,-999,-999,-999,-999,-999,-999,-999,-999,-999,-999
,2002-10-27T21:23:36Z,SAT018,-20.46,149.06,59.4,-999,-999,-999,-999,-999,-999,-999,-999,-999,-999,-999,-999
,2002-10-27T21:23:37Z,SAT018,-20.46,149.06,59.6,-999,-999,-999,-999,-999,-999,-999,-999,-999,-999,-999,-999
,2002-10-27T21:23:37Z,SAT018,-20.46,149.06,59.8,-999,-999,-999,-999,-999,-999,-999,-999,-999,-999,-999,-999
,2002-10-27T21:23:38Z,SAT018,-20.46,149.06,60,-999,-999,-999,-999,-999,-999,-999,-999,-999,-999,-999,-999
,2002-10-27T21:23:39Z,SAT018,-20.46,149.06,60.2,-999,-999,-999,-999,-999,-999,-999,-999,-999,-999,-999,-999
,2002-10-27T21:23:39Z,SAT018,-20.46,149.06,60.4,-999,-999,-999,-999,-999,-999,-999,-999,-999,-999,-999,-999
,2002-10-27T21:25:29Z,SAT018,-20.46,149.06,60.6,-999,-999,-999,-999,-999,-999,-999,-999,-999,-999,-999,-999
,2002-10-27T21:25:30Z,SAT018,-20.46,149.06,60.8,-999,-999,-999,-999,-999,-999,-999,-999,-999,-999,-999,-999
,2002-10-27T21:25:30Z,SAT018,-20.46,149.06,61,-999,-999,-999,-999,-999,-999,-999,-999,-999,-999,-999,-999
,2002-10-27T21:25:31Z,SAT018,-20.46,149.06,61.2,-999,-999,-999,-999,-999,-999,-999,-999,-999,-999,-999,-999
,2002-10-27T21:25:32Z,SAT018,-20.46,149.06,61.4,-999,-999,-999,-999,-999,-999,-999,-999,-999,-999,-999,-999
,2002-10-27T21:25:32Z,SAT018,-20.46,149.06,61.6,-999,-999,-999,-999,-999,-999,-999,-999,-999,-999,-999,-999
,2002-10-27T21:25:33Z,SAT018,-20.46,149.06,61.8,-999,-999,-999,-999,-999,-999,-999,-999,-999,-999,-999,-999
,2002-10-27T21:25:33Z,SAT018,-20.46,149.06,62,-999,-999,-999,-999,-999,-999,-999,-999,-999,-999,-999,-999
,2002-10-27T21:25:34Z,SAT018,-20.46,149.06,62.2,-999,-999,-999,-999,-999,-999,-999,-999,-999,-999,-999,-999
,2002-10-27T21:25:35Z,SAT018,-20.46,149.06,62.4,-999,-999,-999,-999,-999,-999,-999,-999,-999,-999,-999,-999
,2002-10-27T21:25:35Z,SAT018,-20.46,149.06,62.6,-999,-999,-999,-999,-999,-999,-999,-999,-999,-999,-999,-999
,2002-10-27T21:25:36Z,SAT018,-20.46,149.06,62.8,-999,-999,-999,-999,-999,-999,-999,-999,-999,-999,-999,-999
,2002-10-27T21:25:37Z,SAT018,-20.46,149.06,63,-999,-999,-999,-999,-999,-999,-999,-999,-999,-999,-999,-999
,2002-10-27T21:25:37Z,SAT018,-20.46,149.06,63.2,-999,-999,-999,-999,-999,-999,-999,-999,-999,-999,-999,-999
,2002-10-27T21:25:38Z,SAT018,-20.46,149.06,63.4,-999,-999,-999,-999,-999,-999,-999,-999,-999,-999,-999,-999
,2002-10-27T21:25:40Z,SAT018,-20.46,149.06,63.6,-999,-999,-999,-999,-999,-999,-999,-999,-999,-999,-999,-999
,2002-10-27T21:25:40Z,SAT018,-20.46,149.06,63.8,-999,-999,-999,-999,-999,-999,-999,-999,-999,-999,-999,-999
,2002-10-27T21:25:40Z,SAT018,-20.46,149.06,64,-999,-999,-999,-999,-999,-999,-999,-999,-999,-999,-999,-999
,2002-10-27T21:25:41Z,SAT018,-20.46,149.06,64.2,-999,-999,-999,-999,-999,-999,-999,-999,-999,-999,-999,-999
,2002-10-27T21:25:41Z,SAT018,-20.46,149.06,64.4,-999,-999,-999,-999,-999,-999,-999,-999,-999,-999,-999,-999
,2002-10-27T21:25:42Z,SAT018,-20.46,149.06,64.6,-999,-999,-999,-999,-999,-999,-999,-999,-999,-999,-999,-999
,2002-10-27T21:25:43Z,SAT018,-20.46,149.06,64.8,-999,-999,-999,-999,-999,-999,-999,-999,-999,-999,-999,-999
,2002-10-27T21:25:43Z,SAT018,-20.46,149.06,65,-999,-999,-999,-999,-999,-999,-999,-999,-999,-999,-999,-999
,2002-10-27T21:25:44Z,SAT018,-20.46,149.06,65.2,-999,-999,-999,-999,-999,-999,-999,-999,-999,-999,-999,-999
,2002-10-27T21:25:44Z,SAT018,-20.46,149.06,65.4,-999,-999,-999,-999,-999,-999,-999,-999,-999,-999,-999,-999
,2002-10-27T21:25:45Z,SAT018,-20.46,149.06,65.6,-999,-999,-999,-999,-999,-999,-999,-999,-999,-999,-999,-999
,2002-10-27T21:25:46Z,SAT018,-20.46,149.06,65.8,-999,-999,-999,-999,-999,-999,-999,-999,-999,-999,-999,-999
,2002-10-27T21:25:46Z,SAT018,-20.46,149.06,66,-999,-999,-999,-999,-999,-999,-999,-999,-999,-999,-999,-999
,2002-10-27T21:25:47Z,SAT018,-20.46,149.06,66.2,-999,-999,-999,-999,-999,-999,-999,-999,-999,-999,-999,-999
,2002-10-27T21:25:48Z,SAT018,-20.46,149.06,66.4,-999,-999,-999,-999,-999,-999,-999,-999,-999,-999,-999,-999
,2002-10-27T21:25:48Z,SAT018,-20.46,149.06,66.6,-999,-999,-999,-999,-999,-999,-999,-999,-999,-999,-999,-999
,2002-10-27T21:25:49Z,SAT018,-20.46,149.06,66.8,-999,-999,-999,-999,-999,-999,-999,-999,-999,-999,-999,-999
,2002-10-27T21:25:50Z,SAT018,-20.46,149.06,67,-999,-999,-999,-999,-999,-999,-999,-999,-999,-999,-999,-999
,2002-10-27T21:25:50Z,SAT018,-20.46,149.06,67.2,-999,-999,-999,-999,-999,-999,-999,-999,-999,-999,-999,-999
,2002-10-27T21:25:51Z,SAT018,-20.46,149.06,67.4,-999,-999,-999,-999,-999,-999,-999,-999,-999,-999,-999,-999
,2002-10-27T21:25:52Z,SAT018,-20.46,149.06,67.6,-999,-999,-999,-999,-999,-999,-999,-999,-999,-999,-999,-999
,2002-10-27T21:25:52Z,SAT018,-20.46,149.06,67.8,-999,-999,-999,-999,-999,-999,-999,-999,-999,-999,-999,-999
,2002-10-27T21:25:53Z,SAT018,-20.46,149.06,68,-999,-999,-999,-999,-999,-999,-999,-999,-999,-999,-999,-999
,2002-10-27T21:25:54Z,SAT018,-20.46,149.06,68.2,-999,-999,-999,-999,-999,-999,-999,-999,-999,-999,-999,-999
,2002-10-27T21:25:54Z,SAT018,-20.46,149.06,68.4,-999,-999,-999,-999,-999,-999,-999,-999,-999,-999,-999,-999
,2002-10-27T21:25:55Z,SAT018,-20.46,149.06,68.6,-999,-999,-999,-999,-999,-999,-999,-999,-999,-999,-999,-999
,2002-10-27T21:25:55Z,SAT018,-20.46,149.06,68.8,-999,-999,-999,-999,-999,-999,-999,-999,-999,-999,-999,-999
,2002-10-27T21:25:56Z,SAT018,-20.46,149.06,69,-999,-999,-999,-999,-999,-999,-999,-999,-999,-999,-999,-999
,2002-10-27T21:25:57Z,SAT018,-20.46,149.06,69.2,-999,-999,-999,-999,-999,-999,-999,-999,-999,-999,-999,-999
,2002-10-27T21:25:57Z,SAT018,-20.46,149.06,69.4,-999,-999,-999,-999,-999,-999,-999,-999,-999,-999,-999,-999
,2002-10-27T21:25:58Z,SAT018,-20.46,149.06,69.6,-999,-999,-999,-999,-999,-999,-999,-999,-999,-999,-999,-999
,2002-10-27T21:25:59Z,SAT018,-20.46,149.06,69.8,-999,-999,-999,-999,-999,-999,-999,-999,-999,-999,-999,-999
,2002-10-27T21:25:59Z,SAT018,-20.46,149.06,70,-999,-999,-999,-999,-999,-999,-999,-999,-999,-999,-999,-999
,2002-10-27T21:26:00Z,SAT018,-20.46,149.06,70.2,-999,-999,-999,-999,-999,-999,-999,-999,-999,-999,-999,-999
,2002-10-27T21:26:01Z,SAT018,-20.46,149.06,70.4,-999,-999,-999,-999,-999,-999,-999,-999,-999,-999,-999,-999
,2002-10-27T21:26:01Z,SAT018,-20.46,149.06,70.6,-999,-999,-999,-999,-999,-999,-999,-999,-999,-999,-999,-999
,2002-10-27T21:26:02Z,SAT018,-20.46,149.06,70.8,-999,-999,-999,-999,-999,-999,-999,-999,-999,-999,-999,-999
,2002-10-27T21:26:03Z,SAT018,-20.46,149.06,71,-999,-999,-999,-999,-999,-999,-999,-999,-999,-999,-999,-999
,2002-10-27T21:26:03Z,SAT018,-20.46,149.06,71.2,-999,-999,-999,-999,-999,-999,-999,-999,-999,-999,-999,-999
,2002-10-27T21:26:04Z,SAT018,-20.46,149.06,71.4,-999,-999,-999,-999,-999,-999,-999,-999,-999,-999,-999,-999
,2002-10-27T21:26:05Z,SAT018,-20.46,149.06,71.6,-999,-999,-999,-999,-999,-999,-999,-999,-999,-999,-999,-999
,2002-10-27T21:26:05Z,SAT018,-20.46,149.06,71.8,-999,-999,-999,-999,-999,-999,-999,-999,-999,-999,-999,-999
,2002-10-27T21:26:06Z,SAT018,-20.46,149.06,72,-999,-999,-999,-999,-999,-999,-999,-999,-999,-999,-999,-999
,2002-10-27T21:26:06Z,SAT018,-20.46,149.06,72.2,-999,-999,-999,-999,-999,-999,-999,-999,-999,-999,-999,-999
,2002-10-27T21:26:07Z,SAT018,-20.46,149.06,72.4,-999,-999,-999,-999,-999,-999,-999,-999,-999,-999,-999,-999
,2002-10-27T21:26:08Z,SAT018,-20.46,149.06,72.6,-999,-999,-999,-999,-999,-999,-999,-999,-999,-999,-999,-999
,2002-10-27T21:26:08Z,SAT018,-20.46,149.06,72.8,-999,-999,-999,-999,-999,-999,-999,-999,-999,-999,-999,-999
,2002-10-27T21:26:09Z,SAT018,-20.46,149.06,73,-999,-999,-999,-999,-999,-999,-999,-999,-999,-999,-999,-999
,2002-10-27T21:26:10Z,SAT018,-20.46,149.06,73.2,-999,-999,-999,-999,-999,-999,-999,-999,-999,-999,-999,-999
,2002-10-27T21:26:10Z,SAT018,-20.46,149.06,73.4,-999,-999,-999,-999,-999,-999,-999,-999,-999,-999,-999,-999
,2002-10-27T21:26:11Z,SAT018,-20.46,149.06,73.6,-999,-999,-999,-999,-999,-999,-999,-999,-999,-999,-999,-999
,2002-10-27T21:26:12Z,SAT018,-20.46,149.06,73.8,-999,-999,-999,-999,-999,-999,-999,-999,-999,-999,-999,-999
,2002-10-27T21:26:12Z,SAT018,-20.46,149.06,74,-999,-999,-999,-999,-999,-999,-999,-999,-999,-999,-999,-999
,2002-10-27T21:26:13Z,SAT018,-20.46,149.06,74.2,-999,-999,-999,-999,-999,-999,-999,-999,-999,-999,-999,-999
,2002-10-27T21:26:14Z,SAT018,-20.46,149.06,74.4,-999,-999,-999,-999,-999,-999,-999,-999,-999,-999,-999,-999
,2002-10-27T21:26:14Z,SAT018,-20.46,149.06,74.6,-999,-999,-999,-999,-999,-999,-999,-999,-999,-999,-999,-999
,2002-10-27T21:26:15Z,SAT018,-20.46,149.06,74.8,-999,-999,-999,-999,-999,-999,-999,-999,-999,-999,-999,-999
,2002-10-27T21:26:16Z,SAT018,-20.46,149.06,75,-999,-999,-999,-999,-999,-999,-999,-999,-999,-999,-999,-999
,2002-10-27T21:26:16Z,SAT018,-20.46,149.06,75.2,-999,-999,-999,-999,-999,-999,-999,-999,-999,-999,-999,-999
,2002-10-27T21:26:17Z,SAT018,-20.46,149.06,75.4,-999,-999,-999,-999,-999,-999,-999,-999,-999,-999,-999,-999
,2002-10-27T21:26:17Z,SAT018,-20.46,149.06,75.6,-999,-999,-999,-999,-999,-999,-999,-999,-999,-999,-999,-999
,2002-10-27T21:26:18Z,SAT018,-20.46,149.06,75.8,-999,-999,-999,-999,-999,-999,-999,-999,-999,-999,-999,-999
,2002-10-27T21:26:19Z,SAT018,-20.46,149.06,76,-999,-999,-999,-999,-999,-999,-999,-999,-999,-999,-999,-999
,2002-10-27T21:26:19Z,SAT018,-20.46,149.06,76.2,-999,-999,-999,-999,-999,-999,-999,-999,-999,-999,-999,-999
,2002-10-27T21:26:20Z,SAT018,-20.46,149.06,76.4,-999,-999,-999,-999,-999,-999,-999,-999,-999,-999,-999,-999
,2002-10-27T21:26:21Z,SAT018,-20.46,149.06,76.6,-999,-999,-999,-999,-999,-999,-999,-999,-999,-999,-999,-999
,2002-10-27T21:26:21Z,SAT018,-20.46,149.06,76.8,-999,-999,-999,-999,-999,-999,-999,-999,-999,-999,-999,-999
,2002-10-27T21:26:22Z,SAT018,-20.46,149.06,77,-999,-999,-999,-999,-999,-999,-999,-999,-999,-999,-999,-999
,2002-10-27T21:26:23Z,SAT018,-20.46,149.06,77.2,-999,-999,-999,-999,-999,-999,-999,-999,-999,-999,-999,-999
,2002-10-27T21:26:23Z,SAT018,-20.46,149.06,77.4,-999,-999,-999,-999,-999,-999,-999,-999,-999,-999,-999,-999
,2002-10-27T21:26:24Z,SAT018,-20.46,149.06,77.6,-999,-999,-999,-999,-999,-999,-999,-999,-999,-999,-999,-999
,2002-10-27T21:26:25Z,SAT018,-20.46,149.06,77.8,-999,-999,-999,-999,-999,-999,-999,-999,-999,-999,-999,-999
,2002-10-27T21:26:25Z,SAT018,-20.46,149.06,78,-999,-999,-999,-999,-999,-999,-999,-999,-999,-999,-999,-999
,2002-10-27T21:26:26Z,SAT018,-20.46,149.06,78.2,-999,-999,-999,-999,-999,-999,-999,-999,-999,-999,-999,-999
,2002-10-27T21:26:27Z,SAT018,-20.46,149.06,78.4,-999,-999,-999,-999,-999,-999,-999,-999,-999,-999,-999,-999
,2002-10-27T21:26:27Z,SAT018,-20.46,149.06,78.6,-999,-999,-999,-999,-999,-999,-999,-999,-999,-999,-999,-999
,2002-10-27T21:26:28Z,SAT018,-20.46,149.06,78.8,-999,-999,-999,-999,-999,-999,-999,-999,-999,-999,-999,-999
,2002-10-27T21:26:28Z,SAT018,-20.46,149.06,79,-999,-999,-999,-999,-999,-999,-999,-999,-999,-999,-999,-999
,2002-10-27T21:26:29Z,SAT018,-20.46,149.06,79.2,-999,-999,-999,-999,-999,-999,-999,-999,-999,-999,-999,-999
,2002-10-27T21:26:30Z,SAT018,-20.46,149.06,79.4,-999,-999,-999,-999,-999,-999,-999,-999,-999,-999,-999,-999
,2002-10-27T21:26:30Z,SAT018,-20.46,149.06,79.6,-999,-999,-999,-999,-999,-999,-999,-999,-999,-999,-999,-999
,2002-10-27T21:26:31Z,SAT018,-20.46,149.06,79.8,-999,-999,-999,-999,-999,-999,-999,-999,-999,-999,-999,-999
,2002-10-27T21:26:32Z,SAT018,-20.46,149.06,80,-999,-999,-999,-999,-999,-999,-999,-999,-999,-999,-999,-999
,2002-10-27T21:26:32Z,SAT018,-20.46,149.06,80.2,-999,-999,-999,-999,-999,-999,-999,-999,-999,-999,-999,-999
,2002-10-27T21:26:33Z,SAT018,-20.46,149.06,80.4,-999,-999,-999,-999,-999,-999,-999,-999,-999,-999,-999,-999
,2002-10-27T21:26:34Z,SAT018,-20.46,149.06,80.6,-999,-999,-999,-999,-999,-999,-999,-999,-999,-999,-999,-999
,2002-10-27T21:26:34Z,SAT018,-20.46,149.06,80.8,-999,-999,-999,-999,-999,-999,-999,-999,-999,-999,-999,-999
,2002-10-27T21:26:35Z,SAT018,-20.46,149.06,81,-999,-999,-999,-999,-999,-999,-999,-999,-999,-999,-999,-999
,2002-10-27T21:26:36Z,SAT018,-20.46,149.06,81.2,-999,-999,-999,-999,-999,-999,-999,-999,-999,-999,-999,-999
,2002-10-27T21:26:36Z,SAT018,-20.46,149.06,81.4,-999,-999,-999,-999,-999,-999,-999,-999,-999,-999,-999,-999
,2002-10-27T21:26:37Z,SAT018,-20.46,149.06,81.6,-999,-999,-999,-999,-999,-999,-999,-999,-999,-999,-999,-999
,2002-10-27T21:26:38Z,SAT018,-20.46,149.06,81.8,-999,-999,-999,-999,-999,-999,-999,-999,-999,-999,-999,-999
,2002-10-27T21:26:38Z,SAT018,-20.46,149.06,82,-999,-999,-999,-999,-999,-999,-999,-999,-999,-999,-999,-999
,2002-10-27T21:26:39Z,SAT018,-20.46,149.06,82.2,-999,-999,-999,-999,-999,-999,-999,-999,-999,-999,-999,-999
,2002-10-27T21:26:39Z,SAT018,-20.46,149.06,82.4,-999,-999,-999,-999,-999,-999,-999,-999,-999,-999,-999,-999
,2002-10-27T21:26:40Z,SAT018,-20.46,149.06,82.6,-999,-999,-999,-999,-999,-999,-999,-999,-999,-999,-999,-999
,2002-10-27T21:26:41Z,SAT018,-20.46,149.06,82.8,-999,-999,-999,-999,-999,-999,-999,-999,-999,-999,-999,-999
,2002-10-27T21:26:41Z,SAT018,-20.46,149.06,83,-999,-999,-999,-999,-999,-999,-999,-999,-999,-999,-999,-999
,2002-10-27T21:26:42Z,SAT018,-20.46,149.06,83.2,-999,-999,-999,-999,-999,-999,-999,-999,-999,-999,-999,-999
,2002-10-27T21:26:43Z,SAT018,-20.46,149.06,83.4,-999,-999,-999,-999,-999,-999,-999,-999,-999,-999,-999,-999
,2002-10-27T21:26:43Z,SAT018,-20.46,149.06,83.6,-999,-999,-999,-999,-999,-999,-999,-999,-999,-999,-999,-999
,2002-10-27T21:26:44Z,SAT018,-20.46,149.06,83.8,-999,-999,-999,-999,-999,-999,-999,-999,-999,-999,-999,-999
,2002-10-27T21:26:45Z,SAT018,-20.46,149.06,84,-999,-999,-999,-999,-999,-999,-999,-999,-999,-999,-999,-999
,2002-10-27T21:26:45Z,SAT018,-20.46,149.06,84.2,-999,-999,-999,-999,-999,-999,-999,-999,-999,-999,-999,-999
,2002-10-27T21:26:46Z,SAT018,-20.46,149.06,84.4,-999,-999,-999,-999,-999,-999,-999,-999,-999,-999,-999,-999
,2002-10-27T21:26:47Z,SAT018,-20.46,149.06,84.6,-999,-999,-999,-999,-999,-999,-999,-999,-999,-999,-999,-999
,2002-10-27T21:26:47Z,SAT018,-20.46,149.06,84.8,-999,-999,-999,-999,-999,-999,-999,-999,-999,-999,-999,-999
,2002-10-27T21:26:48Z,SAT018,-20.46,149.06,85,-999,-999,-999,-999,-999,-999,-999,-999,-999,-999,-999,-999
,2002-10-27T21:26:48Z,SAT018,-20.46,149.06,85.2,-999,-999,-999,-999,-999,-999,-999,-999,-999,-999,-999,-999
,2002-10-27T21:26:49Z,SAT018,-20.46,149.06,85.4,-999,-999,-999,-999,-999,-999,-999,-999,-999,-999,-999,-999
,2002-10-27T21:26:50Z,SAT018,-20.46,149.06,85.6,-999,-999,-999,-999,-999,-999,-999,-999,-999,-999,-999,-999
,2002-10-27T21:26:50Z,SAT018,-20.46,149.06,85.8,-999,-999,-999,-999,-999,-999,-999,-999,-999,-999,-999,-999
,2002-10-27T21:26:51Z,SAT018,-20.46,149.06,86,-999,-999,-999,-999,-999,-999,-999,-999,-999,-999,-999,-999
,2002-10-27T21:26:52Z,SAT018,-20.46,149.06,86.2,-999,-999,-999,-999,-999,-999,-999,-999,-999,-999,-999,-999
,2002-10-27T21:26:52Z,SAT018,-20.46,149.06,86.4,-999,-999,-999,-999,-999,-999,-999,-999,-999,-999,-999,-999
,2002-10-27T21:26:53Z,SAT018,-20.46,149.06,86.6,-999,-999,-999,-999,-999,-999,-999,-999,-999,-999,-999,-999
,2002-10-27T21:26:54Z,SAT018,-20.46,149.06,86.8,-999,-999,-999,-999,-999,-999,-999,-999,-999,-999,-999,-999
,2002-10-27T21:26:54Z,SAT018,-20.46,149.06,87,-999,-999,-999,-999,-999,-999,-999,-999,-999,-999,-999,-999
,2002-10-27T21:26:55Z,SAT018,-20.46,149.06,87.2,-999,-999,-999,-999,-999,-999,-999,-999,-999,-999,-999,-999
,2002-10-27T21:26:56Z,SAT018,-20.46,149.06,87.4,-999,-999,-999,-999,-999,-999,-999,-999,-999,-999,-999,-999
,2002-10-27T21:26:56Z,SAT018,-20.46,149.06,87.6,-999,-999,-999,-999,-999,-999,-999,-999,-999,-999,-999,-999
,2002-10-27T21:26:57Z,SAT018,-20.46,149.06,87.8,-999,-999,-999,-999,-999,-999,-999,-999,-999,-999,-999,-999
,2002-10-27T21:26:58Z,SAT018,-20.46,149.06,88,-999,-999,-999,-999,-999,-999,-999,-999,-999,-999,-999,-999
,2002-10-27T21:26:58Z,SAT018,-20.46,149.06,88.2,-999,-999,-999,-999,-999,-999,-999,-999,-999,-999,-999,-999
,2002-10-27T21:26:59Z,SAT018,-20.46,149.06,88.4,-999,-999,-999,-999,-999,-999,-999,-999,-999,-999,-999,-999
,2002-10-27T21:26:59Z,SAT018,-20.46,149.06,88.6,-999,-999,-999,-999,-999,-999,-999,-999,-999,-999,-999,-999
,2002-10-27T21:27:00Z,SAT018,-20.46,149.06,88.8,-999,-999,-999,-999,-999,-999,-999,-999,-999,-999,-999,-999
,2002-10-27T21:27:01Z,SAT018,-20.46,149.06,89,-999,-999,-999,-999,-999,-999,-999,-999,-999,-999,-999,-999
,2002-10-27T21:27:01Z,SAT018,-20.46,149.06,89.2,-999,-999,-999,-999,-999,-999,-999,-999,-999,-999,-999,-999
,2002-10-27T21:27:02Z,SAT018,-20.46,149.06,89.4,-999,-999,-999,-999,-999,-999,-999,-999,-999,-999,-999,-999
,2002-10-27T21:27:03Z,SAT018,-20.46,149.06,89.6,-999,-999,-999,-999,-999,-999,-999,-999,-999,-999,-999,-999
,2002-10-27T21:27:03Z,SAT018,-20.46,149.06,89.8,-999,-999,-999,-999,-999,-999,-999,-999,-999,-999,-999,-999
,2002-10-27T21:27:04Z,SAT018,-20.46,149.06,90,-999,-999,-999,-999,-999,-999,-999,-999,-999,-999,-999,-999
,2002-10-27T21:27:05Z,SAT018,-20.46,149.06,90.2,-999,-999,-999,-999,-999,-999,-999,-999,-999,-999,-999,-999
,2002-10-27T21:27:05Z,SAT018,-20.46,149.06,90.4,-999,-999,-999,-999,-999,-999,-999,-999,-999,-999,-999,-999
,2002-10-27T21:27:06Z,SAT018,-20.46,149.06,90.6,-999,-999,-999,-999,-999,-999,-999,-999,-999,-999,-999,-999
,2002-10-27T21:27:07Z,SAT018,-20.46,149.06,90.8,-999,-999,-999,-999,-999,-999,-999,-999,-999,-999,-999,-999
,2002-10-27T21:27:07Z,SAT018,-20.46,149.06,91,-999,-999,-999,-999,-999,-999,-999,-999,-999,-999,-999,-999
,2002-10-27T21:27:08Z,SAT018,-20.46,149.06,91.2,-999,-999,-999,-999,-999,-999,-999,-999,-999,-999,-999,-999
,2002-10-27T21:27:09Z,SAT018,-20.46,149.06,91.4,-999,-999,-999,-999,-999,-999,-999,-999,-999,-999,-999,-999
,2002-10-27T21:27:09Z,SAT018,-20.46,149.06,91.6,-999,-999,-999,-999,-999,-999,-999,-999,-999,-999,-999,-999
,2002-10-27T21:27:10Z,SAT018,-20.46,149.06,91.8,-999,-999,-999,-999,-999,-999,-999,-999,-999,-999,-999,-999
,2002-10-27T21:27:10Z,SAT018,-20.46,149.06,92,-999,-999,-999,-999,-999,-999,-999,-999,-999,-999,-999,-999
,2002-10-27T21:27:11Z,SAT018,-20.46,149.06,92.2,-999,-999,-999,-999,-999,-999,-999,-999,-999,-999,-999,-999
,2002-10-27T21:27:12Z,SAT018,-20.46,149.06,92.4,-999,-999,-999,-999,-999,-999,-999,-999,-999,-999,-999,-999
,2002-10-27T21:27:12Z,SAT018,-20.46,149.06,92.6,-999,-999,-999,-999,-999,-999,-999,-999,-999,-999,-999,-999
,2002-10-27T21:27:13Z,SAT018,-20.46,149.06,92.8,-999,-999,-999,-999,-999,-999,-999,-999,-999,-999,-999,-999
,2002-10-27T21:27:14Z,SAT018,-20.46,149.06,93,-999,-999,-999,-999,-999,-999,-999,-999,-999,-999,-999,-999
,2002-10-27T21:27:14Z,SAT018,-20.46,149.06,93.2,-999,-999,-999,-999,-999,-999,-999,-999,-999,-999,-999,-999
,2002-10-27T21:27:15Z,SAT018,-20.46,149.06,93.4,-999,-999,-999,-999,-999,-999,-999,-999,-999,-999,-999,-999
,2002-10-27T21:27:16Z,SAT018,-20.46,149.06,93.6,-999,-999,-999,-999,-999,-999,-999,-999,-999,-999,-999,-999
,2002-10-27T21:27:16Z,SAT018,-20.46,149.06,93.8,-999,-999,-999,-999,-999,-999,-999,-999,-999,-999,-999,-999
,2002-10-27T21:27:17Z,SAT018,-20.46,149.06,94,-999,-999,-999,-999,-999,-999,-999,-999,-999,-999,-999,-999
,2002-10-27T21:27:18Z,SAT018,-20.46,149.06,94.2,-999,-999,-999,-999,-999,-999,-999,-999,-999,-999,-999,-999
,2002-10-27T21:27:18Z,SAT018,-20.46,149.06,94.4,-999,-999,-999,-999,-999,-999,-999,-999,-999,-999,-999,-999
,2002-10-27T21:27:19Z,SAT018,-20.46,149.06,94.6,-999,-999,-999,-999,-999,-999,-999,-999,-999,-999,-999,-999
,2002-10-27T21:27:20Z,SAT018,-20.46,149.06,94.8,-999,-999,-999,-999,-999,-999,-999,-999,-999,-999,-999,-999
,2002-10-27T21:27:20Z,SAT018,-20.46,149.06,95,-999,-999,-999,-999,-999,-999,-999,-999,-999,-999,-999,-999
,2002-10-27T21:27:21Z,SAT018,-20.46,149.06,95.2,-999,-999,-999,-999,-999,-999,-999,-999,-999,-999,-999,-999
,2002-10-27T21:27:21Z,SAT018,-20.46,149.06,95.4,-999,-999,-999,-999,-999,-999,-999,-999,-999,-999,-999,-999
,2002-10-27T21:27:22Z,SAT018,-20.46,149.06,95.6,-999,-999,-999,-999,-999,-999,-999,-999,-999,-999,-999,-999
,2002-10-27T21:27:23Z,SAT018,-20.46,149.06,95.8,-999,-999,-999,-999,-999,-999,-999,-999,-999,-999,-999,-999
,2002-10-27T21:27:23Z,SAT018,-20.46,149.06,96,-999,-999,-999,-999,-999,-999,-999,-999,-999,-999,-999,-999
,2002-10-27T21:27:24Z,SAT018,-20.46,149.06,96.2,-999,-999,-999,-999,-999,-999,-999,-999,-999,-999,-999,-999
,2002-10-27T21:27:25Z,SAT018,-20.46,149.06,96.4,-999,-999,-999,-999,-999,-999,-999,-999,-999,-999,-999,-999
,2002-10-27T21:27:25Z,SAT018,-20.46,149.06,96.6,-999,-999,-999,-999,-999,-999,-999,-999,-999,-999,-999,-999
,2002-10-27T21:27:26Z,SAT018,-20.46,149.06,96.8,-999,-999,-999,-999,-999,-999,-999,-999,-999,-999,-999,-999
,2002-10-27T21:27:27Z,SAT018,-20.46,149.06,97,-999,-999,-999,-999,-999,-999,-999,-999,-999,-999,-999,-999
,2002-10-27T21:27:27Z,SAT018,-20.46,149.06,97.2,-999,-999,-999,-999,-999,-999,-999,-999,-999,-999,-999,-999
,2002-10-27T21:27:28Z,SAT018,-20.46,149.06,97.4,-999,-999,-999,-999,-999,-999,-999,-999,-999,-999,-999,-999
,2002-10-27T21:27:29Z,SAT018,-20.46,149.06,97.6,-999,-999,-999,-999,-999,-999,-999,-999,-999,-999,-999,-999
,2002-10-27T21:27:29Z,SAT018,-20.46,149.06,97.8,-999,-999,-999,-999,-999,-999,-999,-999,-999,-999,-999,-999
,2002-10-27T21:27:30Z,SAT018,-20.46,149.06,98,-999,-999,-999,-999,-999,-999,-999,-999,-999,-999,-999,-999
,2002-10-27T21:27:31Z,SAT018,-20.46,149.06,98.2,-999,-999,-999,-999,-999,-999,-999,-999,-999,-999,-999,-999
,2002-10-27T21:27:31Z,SAT018,-20.46,149.06,98.4,-999,-999,-999,-999,-999,-999,-999,-999,-999,-999,-999,-999
,2002-10-27T21:27:32Z,SAT018,-20.46,149.06,98.6,-999,-999,-999,-999,-999,-999,-999,-999,-999,-999,-999,-999
,2002-10-27T21:27:32Z,SAT018,-20.46,149.06,98.8,-999,-999,-999,-999,-999,-999,-999,-999,-999,-999,-999,-999
,2002-10-27T21:27:33Z,SAT018,-20.46,149.06,99,-999,-999,-999,-999,-999,-999,-999,-999,-999,-999,-999,-999
,2002-10-27T21:27:34Z,SAT018,-20.46,149.06,99.2,-999,-999,-999,-999,-999,-999,-999,-999,-999,-999,-999,-999
,2002-10-27T21:27:34Z,SAT018,-20.46,149.06,99.4,-999,-999,-999,-999,-999,-999,-999,-999,-999,-999,-999,-999
,2002-10-27T21:27:35Z,SAT018,-20.46,149.06,99.6,-999,-999,-999,-999,-999,-999,-999,-999,-999,-999,-999,-999
,2002-10-27T21:27:36Z,SAT018,-20.46,149.06,99.8,-999,-999,-999,-999,-999,-999,-999,-999,-999,-999,-999,-999
,2002-10-27T21:27:36Z,SAT018,-20.46,149.06,100,-999,-999,-999,-999,-999,-999,-999,-999,-999,-999,-999,-999
