GLOBAL ATTRIBUTES,,,,,,,,,,,,,,,,,
title,,,,,,,,,,,,,,,,,
project,Integrated Marine Observing System (IMOS),,,,,,,,,,,,,,,,
original_project_name,MERIS validation,,,,,,,,,,,,,,,,
original_institution,CSIRO Land and Water,,,,,,,,,,,,,,,,
abstract,This record contains in situ water optical property data collected in the South Great Barrier Reef| Australia on the RSV Lady Basten between 23-28 Aug 2005. A total of 22 stations were sampled during the field campaign AA05. The data can be used for Ocean Colour sensor validation| optical water quality monitoring and modelling. CLW deployed the optical instruments TriOS RAMSES (hyperspectral irradiance)| WETLabs AC-9 (absorption and attenuation coefficicents)| HOBILabs Hydroscat-6 (backscattering coefficient) during this cruise.This data was part of the dataset described in Blondeau-Patissier et al. 2009| JGR| VOL. 114| C05003| doi:10.1029/2008JC005039. Funding for this study was provided by CSIRO Earth Observation Centre| CSIRO Land and Water| CSIRO Marine Research and the Australian Institute of Marine Sciences. We also thank the captains and crews of the RSV Lady Basten.,,,,,,,,,,,,,,,,
conventions,IMOS biological data format (v1.0),,,,,,,,,,,,,,,,
date_created,2005-08-28T04:29:51Z,,,,,,,,,,,,,,,,
date_modified,2006-02-06T22:27:01Z,,,,,,,,,,,,,,,,
history,Data has been quality controlled by in-house procedures. HS-6 data were corrected for temperature using CTD data and the Sigma correction method| recommended by the manufacturer| was applied using absorption and attenuation data from the AC-9. The Sigma correction is an adjustment to improve the accuracy of backscattering measurements| in particular in highly-attenuating water. The correction is detailed in HOBI-labs Inc.| 2003. The backscattering coefficient bb is estimated using the method described in Maffione and Dana| 1997| Applied Optics| 36(24)| pp.6057-6067.,,,,,,,,,,,,,,,,
comment,The HydroScat-6 (HS-6) is a self-contained instrument for measuring optical backscattering at six different wavelengths in natural waters. The particulate backscattering coefficient| bbp (lambda)| is a measure of light scattering by particles at angles between 90 and 180 degrees. bbp was estimated by subtracting bbw (lambda)| the backscattering coefficient of pure sea-water| from bb (lambda). The pure seawater backscattering coefficient was calculated using a backscattering ratio of 0.5 (Gordon et al.| 1988| Journal of Geophysical Research) and the seawater scattering coefficients| bw(lambda)| of Morel (1974| Optical properties of pure water and pure seawater| p. 1-24| in Optical Aspects of Oceanography).,,,,,,,,,,,,,,,,
source,Particulate Scattering coefficients determined using an HS-6 (www.hobilabs.com),,,,,,,,,,,,,,,,
keywords,Oceans>Ocean Optics > Scattering ;Oceans>Ocean Optics>Ocean Colour;,,,,,,,,,,,,,,,,
cruise_id,LB4083,,,,,,,,,,,,,,,,
vessel_name,RSV Lady Basten,,,,,,,,,,,,,,,,
platform_code,VLAB_450301529,,,,,,,,,,,,,,,,
references,https://marlin.csiro.au/geonetwork/srv/eng/catalog.search#/metadata/d3c5d7ba-b861-72d5-e043-08114f8c2cf2,,,,,,,,,,,,,,,,
naming_authority,CSIRO Land and Water (CLW),,,,,,,,,,,,,,,,
cdm_data_type,profile,,,,,,,,,,,,,,,,
geospatial_lat_min,-19.72,,,,,,,,,,,,,,,,
geospatial_lat_max,-19.72,,,,,,,,,,,,,,,,
geospatial_lon_min,147.71,,,,,,,,,,,,,,,,
geospatial_lon_max,147.71,,,,,,,,,,,,,,,,
geospatial_vertical_min,0,,,,,,,,,,,,,,,,
geospatial_vertical_max,100,,,,,,,,,,,,,,,,
local_time_zone,10,,,,,,,,,,,,,,,,
data_centre,eMarine Information Infrastructure (eMII),,,,,,,,,,,,,,,,
data_centre_email,info@emii.org.au,,,,,,,,,,,,,,,,
author,Brando Vittorio,,,,,,,,,,,,,,,,
author_email,vittorio.brando@csiro.au,,,,,,,,,,,,,,,,
principal_investigator,Furnas Miles,,,,,,,,,,,,,,,,
principal_investigator_email,m.furnas@aims.gov.au,,,,,,,,,,,,,,,,
institution,IMOS Satellite Remote Sensing - Ocean Colour Sub-facility - Bio-Optical database of Australian Waters,,,,,,,,,,,,,,,,
institution_principal_investigator,"Schroeder, Thomas",,,,,,,,,,,,,,,,
institution_principal_investigator_email,Thomas.Schroeder@csiro.au,,,,,,,,,,,,,,,,
publisher,Australian Ocean Data Network,,,,,,,,,,,,,,,,
publisher_email,info@aodn.org.au,,,,,,,,,,,,,,,,
citation,To cite this data set in a publication use the format <<IMOS [year-of-data-downloaded] [Title] [data-access-url] accessed [date-of-access]>>,,,,,,,,,,,,,,,,
acknowledgement,Data was sourced from the Commonwealth Scientific and Industrial Research Organisation (CSIRO),,,,,,,,,,,,,,,,
distribution_statement,"Any users of IMOS data are required to clearly acknowledge the source of the material- Data or products or services from IMOS are provided ""as is"" without any warranty as to fitness for a particular purpose.",,,,,,,,,,,,,,,,
,,,,,,,,,,,,,,,,,
TABLE ROWS,,,,,,,,,,,,,,,,,
Row name,CF standard_name,IMOS long_name,Units,Fill value,Comments,,,,,,,,,,,,
Wavelength,radiation_wavelength,Wavelength of measurement,nm,-999,,,,,,,,,,,,,
,,,,,,,,,,,,,,,,,
TABLE COLUMNS,,,,,,,,,,,,,,,,,
Column name,CF standard_name,IMOS long_name,Units,Fill value,Comments,,,,,,,,,,,,
Time,time,analysis_time,YYYY-MM-DDThh:mm:ssZ,,UTC date and time,,,,,,,,,,,,
Station_Code,,,,,National Reference Station code (6 letters),,,,,,,,,,,,
Latitude,latitude,latitude,degrees_north,-999,North positive,,,,,,,,,,,,
Longitude,longitude,longitude,degrees_east,-999,East positive,,,,,,,,,,,,
Depth,depth,depth,m ,-999,positive down,,,,,,,,,,,,
bb_corr,,corrected_volume_total_backwards_scattering_coefficient_of_(bbw_+_bbp)_in_sea_water,m-1,-999,bbw:volume_backwards_scattering_coefficient_of_radiative_flux_in_sea_water ; bbp=volume_backwards_scattering_coefficient_of_particules_in_sea_water,,,,,,,,,,,,
bb_uncorr,,volume_total_backwards_scattering_coefficient_of_(bbw_+_bbp)_in_sea_water,m-1,-999,bbw:volume_backwards_scattering_coefficient_of_radiative_flux_in_sea_water ; bbp=volume_backwards_scattering_coefficient_of_particules_in_sea_water,,,,,,,,,,,,
,,,,,,,,,,,,,,,,,
,,,,,,,,,,,,,,,,,
DATA,,,,,,,,,,,,,,,,,
,Time,Station_Code,Latitude,Longitude,Depth,bb_corr,bb_corr,bb_corr,bb_corr,bb_corr,bb_corr,bb_uncorr,bb_uncorr,bb_uncorr,bb_uncorr,bb_uncorr,bb_uncorr
Wavelength,,,,,,442,448,555,589,676,852,442,448,555,589,676,852
,2005-08-28T04:32:20Z,WQS020,-19.72,147.71,0,0.083125,0.074478,0.067937,0.064046,0.057447,0.052878,0.067299,0.062147,0.057746,0.054754,0.049823,0.038176
,2005-08-28T04:32:11Z,WQS020,-19.72,147.71,0.2,0.083969,0.075844,0.067991,0.06455,0.0571,0.055666,0.067648,0.063017,0.057568,0.054978,0.049355,0.040046
,2005-08-28T04:32:02Z,WQS020,-19.72,147.71,0.4,0.087882,0.077263,0.068972,0.067333,0.061153,0.057005,0.070353,0.063842,0.058109,0.057072,0.052629,0.040821
,2005-08-28T04:33:09Z,WQS020,-19.72,147.71,0.6,0.079999,0.072119,0.065114,0.061031,0.055251,0.052796,0.063548,0.059191,0.054525,0.051426,0.047298,0.037595
,2005-08-28T04:32:00Z,WQS020,-19.72,147.71,0.8,0.083956,0.077942,0.072355,0.067631,0.059073,0.057711,0.066689,0.064016,0.060579,0.056998,0.050571,0.041083
,2005-08-28T04:33:13Z,WQS020,-19.72,147.71,1,0.078331,0.072204,0.063597,0.061315,0.054799,0.052066,0.062239,0.059321,0.053258,0.051687,0.046923,0.037071
,2005-08-28T04:33:16Z,WQS020,-19.72,147.71,1.2,0.08131,0.073771,0.067013,0.061207,0.057791,0.054556,0.065118,0.060973,0.056535,0.051949,0.049776,0.039077
,2005-08-28T04:33:18Z,WQS020,-19.72,147.71,1.4,0.079001,0.072529,0.063774,0.061764,0.055389,0.05206,0.063286,0.059974,0.053815,0.052435,0.047718,0.037299
,2005-08-28T04:29:55Z,WQS020,-19.72,147.71,1.6,-999,-999,-999,-999,-999,-999,-999,-999,-999,-999,-999,-999
,2005-08-28T04:33:24Z,WQS020,-19.72,147.71,1.8,0.08034,0.072145,0.063686,0.060561,0.054893,0.050638,0.06442,0.059756,0.053734,0.051426,0.047344,0.036307
,2005-08-28T04:33:26Z,WQS020,-19.72,147.71,2,0.078325,0.070465,0.063472,0.061122,0.053508,0.051574,0.062675,0.058278,0.05346,0.0518,0.046035,0.0369
,2005-08-28T04:29:55Z,WQS020,-19.72,147.71,2.2,-999,-999,-999,-999,-999,-999,-999,-999,-999,-999,-999,-999
,2005-08-28T04:33:29Z,WQS020,-19.72,147.71,2.4,0.081238,0.072615,0.065614,0.062106,0.056798,0.05256,0.064769,0.0598,0.055147,0.05251,0.048747,0.037561
,2005-08-28T04:31:54Z,WQS020,-19.72,147.71,2.6,0.087387,0.076248,0.068275,0.065294,0.060554,0.055911,0.06983,0.06293,0.05748,0.055315,0.052068,0.040034
,2005-08-28T04:33:34Z,WQS020,-19.72,147.71,2.8,0.087462,0.077936,0.071968,0.069522,0.064146,0.057737,0.070179,0.064495,0.060757,0.059054,0.055295,0.041402
,2005-08-28T04:30:57Z,WQS020,-19.72,147.71,3,0.087765,0.07966,0.073046,0.071586,0.062425,0.056959,0.070353,0.065842,0.061572,0.0607,0.053705,0.040764
,2005-08-28T04:30:24Z,WQS020,-19.72,147.71,3.2,0.087097,0.080258,0.071164,0.069382,0.060939,0.056909,0.06887,0.065581,0.059393,0.058269,0.052068,0.040433
,2005-08-28T04:33:42Z,WQS020,-19.72,147.71,3.4,0.093803,0.084055,0.074803,0.070877,0.067271,0.061146,0.073407,0.068146,0.061854,0.058979,0.057025,0.043055
,2005-08-28T04:33:44Z,WQS020,-19.72,147.71,3.6,0.102755,0.089506,0.081425,0.079436,0.074098,0.070467,0.080125,0.072276,0.06727,0.066047,0.062684,0.04954
,2005-08-28T04:33:45Z,WQS020,-19.72,147.71,3.8,0.096772,0.086473,0.079034,0.074053,0.068402,0.065609,0.075501,0.069755,0.065188,0.061485,0.057774,0.046064
,2005-08-28T04:33:48Z,WQS020,-19.72,147.71,4,0.089861,0.080544,0.072309,0.069169,0.062068,0.06042,0.06983,0.064755,0.059417,0.057222,0.052255,0.042302
,2005-08-28T04:30:00Z,WQS020,-19.72,147.71,4.2,-999,-999,-999,-999,-999,-999,-999,-999,-999,-999,-999,-999
,2005-08-28T04:33:51Z,WQS020,-19.72,147.71,4.4,0.104982,0.097206,0.088973,0.083571,0.075708,0.071024,0.079514,0.07671,0.071492,0.067693,0.062544,0.048788
,2005-08-28T04:30:00Z,WQS020,-19.72,147.71,4.6,-999,-999,-999,-999,-999,-999,-999,-999,-999,-999,-999,-999
,2005-08-28T04:33:58Z,WQS020,-19.72,147.71,4.8,0.11503,0.103013,0.092887,0.089282,0.083452,0.076306,0.087017,0.081057,0.075027,0.072554,0.068951,0.052503
,2005-08-28T04:34:00Z,WQS020,-19.72,147.71,5,0.118173,0.104863,0.095521,0.092459,0.086047,0.081268,0.087715,0.081144,0.075875,0.073938,0.070167,0.055125
,2005-08-28T04:30:02Z,WQS020,-19.72,147.71,5.2,-999,-999,-999,-999,-999,-999,-999,-999,-999,-999,-999,-999
,2005-08-28T04:34:05Z,WQS020,-19.72,147.71,5.4,0.099367,0.086862,0.076936,0.074962,0.068745,0.062334,0.07236,0.066146,0.060038,0.058942,0.055248,0.041641
,2005-08-28T04:30:02Z,WQS020,-19.72,147.71,5.6,-999,-999,-999,-999,-999,-999,-999,-999,-999,-999,-999,-999
,2005-08-28T04:30:02Z,WQS020,-19.72,147.71,5.8,-999,-999,-999,-999,-999,-999,-999,-999,-999,-999,-999,-999
,2005-08-28T04:34:09Z,WQS020,-19.72,147.71,6,0.106708,0.098829,0.089689,0.084504,0.076542,0.070975,0.082132,0.078884,0.073001,0.069301,0.063947,0.049323
,2005-08-28T04:30:04Z,WQS020,-19.72,147.71,6.2,-999,-999,-999,-999,-999,-999,-999,-999,-999,-999,-999,-999
,2005-08-28T04:34:13Z,WQS020,-19.72,147.71,6.4,0.102313,0.090993,0.084989,0.080557,0.07318,0.069056,0.077856,0.071972,0.068699,0.065598,0.060673,0.047659
,2005-08-28T04:34:16Z,WQS020,-19.72,147.71,6.6,0.104213,0.096411,0.088702,0.083424,0.075448,0.072295,0.078729,0.07571,0.071177,0.067431,0.06217,0.04954
,2005-08-28T04:34:19Z,WQS020,-19.72,147.71,6.8,0.106435,0.092985,0.086597,0.080339,0.075964,0.070416,0.080387,0.073058,0.06949,0.064963,0.062684,0.048343
,2005-08-28T04:34:22Z,WQS020,-19.72,147.71,7,0.105669,0.097105,0.088138,0.082952,0.076264,0.073188,0.079252,0.076014,0.070556,0.066833,0.062638,0.049928
,2005-08-28T04:30:06Z,WQS020,-19.72,147.71,7.2,-999,-999,-999,-999,-999,-999,-999,-999,-999,-999,-999,-999
,2005-08-28T04:34:25Z,WQS020,-19.72,147.71,7.4,0.111799,0.099964,0.092997,0.086403,0.081814,0.077429,0.084575,0.078492,0.074995,0.070123,0.067455,0.053233
,2005-08-28T04:34:28Z,WQS020,-19.72,147.71,7.6,0.107197,0.099588,0.090224,0.085601,0.077555,0.074689,0.081259,0.078362,0.07288,0.0696,0.063994,0.051421
,2005-08-28T04:30:06Z,WQS020,-19.72,147.71,7.8,-999,-999,-999,-999,-999,-999,-999,-999,-999,-999,-999,-999
,2005-08-28T04:30:07Z,WQS020,-19.72,147.71,8,-999,-999,-999,-999,-999,-999,-999,-999,-999,-999,-999,-999
,2005-08-28T04:30:07Z,WQS020,-19.72,147.71,8.2,-999,-999,-999,-999,-999,-999,-999,-999,-999,-999,-999,-999
,2005-08-28T04:30:07Z,WQS020,-19.72,147.71,8.4,-999,-999,-999,-999,-999,-999,-999,-999,-999,-999,-999,-999
,2005-08-28T04:30:07Z,WQS020,-19.72,147.71,8.6,-999,-999,-999,-999,-999,-999,-999,-999,-999,-999,-999,-999
,2005-08-28T04:30:07Z,WQS020,-19.72,147.71,8.8,-999,-999,-999,-999,-999,-999,-999,-999,-999,-999,-999,-999
,2005-08-28T04:30:07Z,WQS020,-19.72,147.71,9,-999,-999,-999,-999,-999,-999,-999,-999,-999,-999,-999,-999
,2005-08-28T04:30:10Z,WQS020,-19.72,147.71,9.2,-999,-999,-999,-999,-999,-999,-999,-999,-999,-999,-999,-999
,2005-08-28T04:30:10Z,WQS020,-19.72,147.71,9.4,-999,-999,-999,-999,-999,-999,-999,-999,-999,-999,-999,-999
,2005-08-28T04:30:10Z,WQS020,-19.72,147.71,9.6,-999,-999,-999,-999,-999,-999,-999,-999,-999,-999,-999,-999
,2005-08-28T04:30:10Z,WQS020,-19.72,147.71,9.8,-999,-999,-999,-999,-999,-999,-999,-999,-999,-999,-999,-999
,2005-08-28T04:30:10Z,WQS020,-19.72,147.71,10,-999,-999,-999,-999,-999,-999,-999,-999,-999,-999,-999,-999
,2005-08-28T04:30:12Z,WQS020,-19.72,147.71,10.2,-999,-999,-999,-999,-999,-999,-999,-999,-999,-999,-999,-999
,2005-08-28T04:30:12Z,WQS020,-19.72,147.71,10.4,-999,-999,-999,-999,-999,-999,-999,-999,-999,-999,-999,-999
,2005-08-28T04:30:12Z,WQS020,-19.72,147.71,10.6,-999,-999,-999,-999,-999,-999,-999,-999,-999,-999,-999,-999
,2005-08-28T04:30:12Z,WQS020,-19.72,147.71,10.8,-999,-999,-999,-999,-999,-999,-999,-999,-999,-999,-999,-999
,2005-08-28T04:30:12Z,WQS020,-19.72,147.71,11,-999,-999,-999,-999,-999,-999,-999,-999,-999,-999,-999,-999
,2005-08-28T04:30:13Z,WQS020,-19.72,147.71,11.2,-999,-999,-999,-999,-999,-999,-999,-999,-999,-999,-999,-999
,2005-08-28T04:30:13Z,WQS020,-19.72,147.71,11.4,-999,-999,-999,-999,-999,-999,-999,-999,-999,-999,-999,-999
,2005-08-28T04:30:13Z,WQS020,-19.72,147.71,11.6,-999,-999,-999,-999,-999,-999,-999,-999,-999,-999,-999,-999
,2005-08-28T04:30:13Z,WQS020,-19.72,147.71,11.8,-999,-999,-999,-999,-999,-999,-999,-999,-999,-999,-999,-999
,2005-08-28T04:30:13Z,WQS020,-19.72,147.71,12,-999,-999,-999,-999,-999,-999,-999,-999,-999,-999,-999,-999
,2005-08-28T04:30:13Z,WQS020,-19.72,147.71,12.2,-999,-999,-999,-999,-999,-999,-999,-999,-999,-999,-999,-999
,2005-08-28T04:30:15Z,WQS020,-19.72,147.71,12.4,-999,-999,-999,-999,-999,-999,-999,-999,-999,-999,-999,-999
,2005-08-28T04:30:15Z,WQS020,-19.72,147.71,12.6,-999,-999,-999,-999,-999,-999,-999,-999,-999,-999,-999,-999
,2005-08-28T04:30:15Z,WQS020,-19.72,147.71,12.8,-999,-999,-999,-999,-999,-999,-999,-999,-999,-999,-999,-999
,2005-08-28T04:30:15Z,WQS020,-19.72,147.71,13,-999,-999,-999,-999,-999,-999,-999,-999,-999,-999,-999,-999
,2005-08-28T04:30:15Z,WQS020,-19.72,147.71,13.2,-999,-999,-999,-999,-999,-999,-999,-999,-999,-999,-999,-999
,2005-08-28T04:30:17Z,WQS020,-19.72,147.71,13.4,-999,-999,-999,-999,-999,-999,-999,-999,-999,-999,-999,-999
,2005-08-28T04:30:17Z,WQS020,-19.72,147.71,13.6,-999,-999,-999,-999,-999,-999,-999,-999,-999,-999,-999,-999
,2005-08-28T04:30:17Z,WQS020,-19.72,147.71,13.8,-999,-999,-999,-999,-999,-999,-999,-999,-999,-999,-999,-999
,2005-08-28T04:30:17Z,WQS020,-19.72,147.71,14,-999,-999,-999,-999,-999,-999,-999,-999,-999,-999,-999,-999
,2005-08-28T04:30:17Z,WQS020,-19.72,147.71,14.2,-999,-999,-999,-999,-999,-999,-999,-999,-999,-999,-999,-999
,2005-08-28T04:30:20Z,WQS020,-19.72,147.71,14.4,-999,-999,-999,-999,-999,-999,-999,-999,-999,-999,-999,-999
,2005-08-28T04:30:20Z,WQS020,-19.72,147.71,14.6,-999,-999,-999,-999,-999,-999,-999,-999,-999,-999,-999,-999
,2005-08-28T04:30:20Z,WQS020,-19.72,147.71,14.8,-999,-999,-999,-999,-999,-999,-999,-999,-999,-999,-999,-999
,2005-08-28T04:30:20Z,WQS020,-19.72,147.71,15,-999,-999,-999,-999,-999,-999,-999,-999,-999,-999,-999,-999
,2005-08-28T04:30:20Z,WQS020,-19.72,147.71,15.2,-999,-999,-999,-999,-999,-999,-999,-999,-999,-999,-999,-999
,2005-08-28T04:30:20Z,WQS020,-19.72,147.71,15.4,-999,-999,-999,-999,-999,-999,-999,-999,-999,-999,-999,-999
,2005-08-28T04:30:22Z,WQS020,-19.72,147.71,15.6,-999,-999,-999,-999,-999,-999,-999,-999,-999,-999,-999,-999
,2005-08-28T04:30:22Z,WQS020,-19.72,147.71,15.8,-999,-999,-999,-999,-999,-999,-999,-999,-999,-999,-999,-999
,2005-08-28T04:30:22Z,WQS020,-19.72,147.71,16,-999,-999,-999,-999,-999,-999,-999,-999,-999,-999,-999,-999
,2005-08-28T04:30:22Z,WQS020,-19.72,147.71,16.2,-999,-999,-999,-999,-999,-999,-999,-999,-999,-999,-999,-999
,2005-08-28T04:30:22Z,WQS020,-19.72,147.71,16.4,-999,-999,-999,-999,-999,-999,-999,-999,-999,-999,-999,-999
,2005-08-28T04:30:24Z,WQS020,-19.72,147.71,16.6,-999,-999,-999,-999,-999,-999,-999,-999,-999,-999,-999,-999
,2005-08-28T04:30:24Z,WQS020,-19.72,147.71,16.8,-999,-999,-999,-999,-999,-999,-999,-999,-999,-999,-999,-999
,2005-08-28T04:30:24Z,WQS020,-19.72,147.71,17,-999,-999,-999,-999,-999,-999,-999,-999,-999,-999,-999,-999
,2005-08-28T04:30:24Z,WQS020,-19.72,147.71,17.2,-999,-999,-999,-999,-999,-999,-999,-999,-999,-999,-999,-999
,2005-08-28T04:30:24Z,WQS020,-19.72,147.71,17.4,-999,-999,-999,-999,-999,-999,-999,-999,-999,-999,-999,-999
,2005-08-28T04:30:26Z,WQS020,-19.72,147.71,17.6,-999,-999,-999,-999,-999,-999,-999,-999,-999,-999,-999,-999
,2005-08-28T04:30:26Z,WQS020,-19.72,147.71,17.8,-999,-999,-999,-999,-999,-999,-999,-999,-999,-999,-999,-999
,2005-08-28T04:30:26Z,WQS020,-19.72,147.71,18,-999,-999,-999,-999,-999,-999,-999,-999,-999,-999,-999,-999
,2005-08-28T04:30:26Z,WQS020,-19.72,147.71,18.2,-999,-999,-999,-999,-999,-999,-999,-999,-999,-999,-999,-999
,2005-08-28T04:30:26Z,WQS020,-19.72,147.71,18.4,-999,-999,-999,-999,-999,-999,-999,-999,-999,-999,-999,-999
,2005-08-28T04:30:26Z,WQS020,-19.72,147.71,18.6,-999,-999,-999,-999,-999,-999,-999,-999,-999,-999,-999,-999
,2005-08-28T04:30:27Z,WQS020,-19.72,147.71,18.8,-999,-999,-999,-999,-999,-999,-999,-999,-999,-999,-999,-999
,2005-08-28T04:30:27Z,WQS020,-19.72,147.71,19,-999,-999,-999,-999,-999,-999,-999,-999,-999,-999,-999,-999
,2005-08-28T04:30:27Z,WQS020,-19.72,147.71,19.2,-999,-999,-999,-999,-999,-999,-999,-999,-999,-999,-999,-999
,2005-08-28T04:30:27Z,WQS020,-19.72,147.71,19.4,-999,-999,-999,-999,-999,-999,-999,-999,-999,-999,-999,-999
,2005-08-28T04:30:27Z,WQS020,-19.72,147.71,19.6,-999,-999,-999,-999,-999,-999,-999,-999,-999,-999,-999,-999
,2005-08-28T04:30:30Z,WQS020,-19.72,147.71,19.8,-999,-999,-999,-999,-999,-999,-999,-999,-999,-999,-999,-999
,2005-08-28T04:30:30Z,WQS020,-19.72,147.71,20,-999,-999,-999,-999,-999,-999,-999,-999,-999,-999,-999,-999
,2005-08-28T04:30:30Z,WQS020,-19.72,147.71,20.2,-999,-999,-999,-999,-999,-999,-999,-999,-999,-999,-999,-999
,2005-08-28T04:30:30Z,WQS020,-19.72,147.71,20.4,-999,-999,-999,-999,-999,-999,-999,-999,-999,-999,-999,-999
,2005-08-28T04:30:30Z,WQS020,-19.72,147.71,20.6,-999,-999,-999,-999,-999,-999,-999,-999,-999,-999,-999,-999
,2005-08-28T04:30:32Z,WQS020,-19.72,147.71,20.8,-999,-999,-999,-999,-999,-999,-999,-999,-999,-999,-999,-999
,2005-08-28T04:30:32Z,WQS020,-19.72,147.71,21,-999,-999,-999,-999,-999,-999,-999,-999,-999,-999,-999,-999
,2005-08-28T04:30:32Z,WQS020,-19.72,147.71,21.2,-999,-999,-999,-999,-999,-999,-999,-999,-999,-999,-999,-999
,2005-08-28T04:30:32Z,WQS020,-19.72,147.71,21.4,-999,-999,-999,-999,-999,-999,-999,-999,-999,-999,-999,-999
,2005-08-28T04:30:32Z,WQS020,-19.72,147.71,21.6,-999,-999,-999,-999,-999,-999,-999,-999,-999,-999,-999,-999
,2005-08-28T04:30:32Z,WQS020,-19.72,147.71,21.8,-999,-999,-999,-999,-999,-999,-999,-999,-999,-999,-999,-999
,2005-08-28T04:30:34Z,WQS020,-19.72,147.71,22,-999,-999,-999,-999,-999,-999,-999,-999,-999,-999,-999,-999
,2005-08-28T04:30:34Z,WQS020,-19.72,147.71,22.2,-999,-999,-999,-999,-999,-999,-999,-999,-999,-999,-999,-999
,2005-08-28T04:30:34Z,WQS020,-19.72,147.71,22.4,-999,-999,-999,-999,-999,-999,-999,-999,-999,-999,-999,-999
,2005-08-28T04:30:34Z,WQS020,-19.72,147.71,22.6,-999,-999,-999,-999,-999,-999,-999,-999,-999,-999,-999,-999
,2005-08-28T04:30:34Z,WQS020,-19.72,147.71,22.8,-999,-999,-999,-999,-999,-999,-999,-999,-999,-999,-999,-999
,2005-08-28T04:30:36Z,WQS020,-19.72,147.71,23,-999,-999,-999,-999,-999,-999,-999,-999,-999,-999,-999,-999
,2005-08-28T04:30:36Z,WQS020,-19.72,147.71,23.2,-999,-999,-999,-999,-999,-999,-999,-999,-999,-999,-999,-999
,2005-08-28T04:30:36Z,WQS020,-19.72,147.71,23.4,-999,-999,-999,-999,-999,-999,-999,-999,-999,-999,-999,-999
,2005-08-28T04:30:36Z,WQS020,-19.72,147.71,23.6,-999,-999,-999,-999,-999,-999,-999,-999,-999,-999,-999,-999
,2005-08-28T04:30:36Z,WQS020,-19.72,147.71,23.8,-999,-999,-999,-999,-999,-999,-999,-999,-999,-999,-999,-999
,2005-08-28T04:30:37Z,WQS020,-19.72,147.71,24,-999,-999,-999,-999,-999,-999,-999,-999,-999,-999,-999,-999
,2005-08-28T04:30:37Z,WQS020,-19.72,147.71,24.2,-999,-999,-999,-999,-999,-999,-999,-999,-999,-999,-999,-999
,2005-08-28T04:30:37Z,WQS020,-19.72,147.71,24.4,-999,-999,-999,-999,-999,-999,-999,-999,-999,-999,-999,-999
,2005-08-28T04:30:37Z,WQS020,-19.72,147.71,24.6,-999,-999,-999,-999,-999,-999,-999,-999,-999,-999,-999,-999
,2005-08-28T04:30:37Z,WQS020,-19.72,147.71,24.8,-999,-999,-999,-999,-999,-999,-999,-999,-999,-999,-999,-999
,2005-08-28T04:30:37Z,WQS020,-19.72,147.71,25,-999,-999,-999,-999,-999,-999,-999,-999,-999,-999,-999,-999
,2005-08-28T04:30:40Z,WQS020,-19.72,147.71,25.2,-999,-999,-999,-999,-999,-999,-999,-999,-999,-999,-999,-999
,2005-08-28T04:30:40Z,WQS020,-19.72,147.71,25.4,-999,-999,-999,-999,-999,-999,-999,-999,-999,-999,-999,-999
,2005-08-28T04:30:40Z,WQS020,-19.72,147.71,25.6,-999,-999,-999,-999,-999,-999,-999,-999,-999,-999,-999,-999
,2005-08-28T04:30:40Z,WQS020,-19.72,147.71,25.8,-999,-999,-999,-999,-999,-999,-999,-999,-999,-999,-999,-999
,2005-08-28T04:30:40Z,WQS020,-19.72,147.71,26,-999,-999,-999,-999,-999,-999,-999,-999,-999,-999,-999,-999
,2005-08-28T04:30:42Z,WQS020,-19.72,147.71,26.2,-999,-999,-999,-999,-999,-999,-999,-999,-999,-999,-999,-999
,2005-08-28T04:30:42Z,WQS020,-19.72,147.71,26.4,-999,-999,-999,-999,-999,-999,-999,-999,-999,-999,-999,-999
,2005-08-28T04:30:42Z,WQS020,-19.72,147.71,26.6,-999,-999,-999,-999,-999,-999,-999,-999,-999,-999,-999,-999
,2005-08-28T04:30:42Z,WQS020,-19.72,147.71,26.8,-999,-999,-999,-999,-999,-999,-999,-999,-999,-999,-999,-999
,2005-08-28T04:30:42Z,WQS020,-19.72,147.71,27,-999,-999,-999,-999,-999,-999,-999,-999,-999,-999,-999,-999
,2005-08-28T04:30:43Z,WQS020,-19.72,147.71,27.2,-999,-999,-999,-999,-999,-999,-999,-999,-999,-999,-999,-999
,2005-08-28T04:30:43Z,WQS020,-19.72,147.71,27.4,-999,-999,-999,-999,-999,-999,-999,-999,-999,-999,-999,-999
,2005-08-28T04:30:43Z,WQS020,-19.72,147.71,27.6,-999,-999,-999,-999,-999,-999,-999,-999,-999,-999,-999,-999
,2005-08-28T04:30:43Z,WQS020,-19.72,147.71,27.8,-999,-999,-999,-999,-999,-999,-999,-999,-999,-999,-999,-999
,2005-08-28T04:30:43Z,WQS020,-19.72,147.71,28,-999,-999,-999,-999,-999,-999,-999,-999,-999,-999,-999,-999
,2005-08-28T04:30:43Z,WQS020,-19.72,147.71,28.2,-999,-999,-999,-999,-999,-999,-999,-999,-999,-999,-999,-999
,2005-08-28T04:30:46Z,WQS020,-19.72,147.71,28.4,-999,-999,-999,-999,-999,-999,-999,-999,-999,-999,-999,-999
,2005-08-28T04:30:46Z,WQS020,-19.72,147.71,28.6,-999,-999,-999,-999,-999,-999,-999,-999,-999,-999,-999,-999
,2005-08-28T04:30:46Z,WQS020,-19.72,147.71,28.8,-999,-999,-999,-999,-999,-999,-999,-999,-999,-999,-999,-999
,2005-08-28T04:30:46Z,WQS020,-19.72,147.71,29,-999,-999,-999,-999,-999,-999,-999,-999,-999,-999,-999,-999
,2005-08-28T04:30:46Z,WQS020,-19.72,147.71,29.2,-999,-999,-999,-999,-999,-999,-999,-999,-999,-999,-999,-999
,2005-08-28T04:30:48Z,WQS020,-19.72,147.71,29.4,-999,-999,-999,-999,-999,-999,-999,-999,-999,-999,-999,-999
,2005-08-28T04:30:48Z,WQS020,-19.72,147.71,29.6,-999,-999,-999,-999,-999,-999,-999,-999,-999,-999,-999,-999
,2005-08-28T04:30:48Z,WQS020,-19.72,147.71,29.8,-999,-999,-999,-999,-999,-999,-999,-999,-999,-999,-999,-999
,2005-08-28T04:30:48Z,WQS020,-19.72,147.71,30,-999,-999,-999,-999,-999,-999,-999,-999,-999,-999,-999,-999
,2005-08-28T04:30:48Z,WQS020,-19.72,147.71,30.2,-999,-999,-999,-999,-999,-999,-999,-999,-999,-999,-999,-999
,2005-08-28T04:30:50Z,WQS020,-19.72,147.71,30.4,-999,-999,-999,-999,-999,-999,-999,-999,-999,-999,-999,-999
,2005-08-28T04:30:50Z,WQS020,-19.72,147.71,30.6,-999,-999,-999,-999,-999,-999,-999,-999,-999,-999,-999,-999
,2005-08-28T04:30:50Z,WQS020,-19.72,147.71,30.8,-999,-999,-999,-999,-999,-999,-999,-999,-999,-999,-999,-999
,2005-08-28T04:30:50Z,WQS020,-19.72,147.71,31,-999,-999,-999,-999,-999,-999,-999,-999,-999,-999,-999,-999
,2005-08-28T04:30:50Z,WQS020,-19.72,147.71,31.2,-999,-999,-999,-999,-999,-999,-999,-999,-999,-999,-999,-999
,2005-08-28T04:30:50Z,WQS020,-19.72,147.71,31.4,-999,-999,-999,-999,-999,-999,-999,-999,-999,-999,-999,-999
,2005-08-28T04:30:52Z,WQS020,-19.72,147.71,31.6,-999,-999,-999,-999,-999,-999,-999,-999,-999,-999,-999,-999
,2005-08-28T04:30:52Z,WQS020,-19.72,147.71,31.8,-999,-999,-999,-999,-999,-999,-999,-999,-999,-999,-999,-999
,2005-08-28T04:30:52Z,WQS020,-19.72,147.71,32,-999,-999,-999,-999,-999,-999,-999,-999,-999,-999,-999,-999
,2005-08-28T04:30:52Z,WQS020,-19.72,147.71,32.2,-999,-999,-999,-999,-999,-999,-999,-999,-999,-999,-999,-999
,2005-08-28T04:30:52Z,WQS020,-19.72,147.71,32.4,-999,-999,-999,-999,-999,-999,-999,-999,-999,-999,-999,-999
,2005-08-28T04:30:54Z,WQS020,-19.72,147.71,32.6,-999,-999,-999,-999,-999,-999,-999,-999,-999,-999,-999,-999
,2005-08-28T04:30:54Z,WQS020,-19.72,147.71,32.8,-999,-999,-999,-999,-999,-999,-999,-999,-999,-999,-999,-999
,2005-08-28T04:30:54Z,WQS020,-19.72,147.71,33,-999,-999,-999,-999,-999,-999,-999,-999,-999,-999,-999,-999
,2005-08-28T04:30:54Z,WQS020,-19.72,147.71,33.2,-999,-999,-999,-999,-999,-999,-999,-999,-999,-999,-999,-999
,2005-08-28T04:30:54Z,WQS020,-19.72,147.71,33.4,-999,-999,-999,-999,-999,-999,-999,-999,-999,-999,-999,-999
,2005-08-28T04:30:56Z,WQS020,-19.72,147.71,33.6,-999,-999,-999,-999,-999,-999,-999,-999,-999,-999,-999,-999
,2005-08-28T04:30:56Z,WQS020,-19.72,147.71,33.8,-999,-999,-999,-999,-999,-999,-999,-999,-999,-999,-999,-999
,2005-08-28T04:30:56Z,WQS020,-19.72,147.71,34,-999,-999,-999,-999,-999,-999,-999,-999,-999,-999,-999,-999
,2005-08-28T04:30:56Z,WQS020,-19.72,147.71,34.2,-999,-999,-999,-999,-999,-999,-999,-999,-999,-999,-999,-999
,2005-08-28T04:30:56Z,WQS020,-19.72,147.71,34.4,-999,-999,-999,-999,-999,-999,-999,-999,-999,-999,-999,-999
,2005-08-28T04:30:56Z,WQS020,-19.72,147.71,34.6,-999,-999,-999,-999,-999,-999,-999,-999,-999,-999,-999,-999
,2005-08-28T04:30:57Z,WQS020,-19.72,147.71,34.8,-999,-999,-999,-999,-999,-999,-999,-999,-999,-999,-999,-999
,2005-08-28T04:30:57Z,WQS020,-19.72,147.71,35,-999,-999,-999,-999,-999,-999,-999,-999,-999,-999,-999,-999
,2005-08-28T04:30:57Z,WQS020,-19.72,147.71,35.2,-999,-999,-999,-999,-999,-999,-999,-999,-999,-999,-999,-999
,2005-08-28T04:30:57Z,WQS020,-19.72,147.71,35.4,-999,-999,-999,-999,-999,-999,-999,-999,-999,-999,-999,-999
,2005-08-28T04:30:57Z,WQS020,-19.72,147.71,35.6,-999,-999,-999,-999,-999,-999,-999,-999,-999,-999,-999,-999
,2005-08-28T04:31:00Z,WQS020,-19.72,147.71,35.8,-999,-999,-999,-999,-999,-999,-999,-999,-999,-999,-999,-999
,2005-08-28T04:31:00Z,WQS020,-19.72,147.71,36,-999,-999,-999,-999,-999,-999,-999,-999,-999,-999,-999,-999
,2005-08-28T04:31:00Z,WQS020,-19.72,147.71,36.2,-999,-999,-999,-999,-999,-999,-999,-999,-999,-999,-999,-999
,2005-08-28T04:31:00Z,WQS020,-19.72,147.71,36.4,-999,-999,-999,-999,-999,-999,-999,-999,-999,-999,-999,-999
,2005-08-28T04:31:00Z,WQS020,-19.72,147.71,36.6,-999,-999,-999,-999,-999,-999,-999,-999,-999,-999,-999,-999
,2005-08-28T04:31:01Z,WQS020,-19.72,147.71,36.8,-999,-999,-999,-999,-999,-999,-999,-999,-999,-999,-999,-999
,2005-08-28T04:31:01Z,WQS020,-19.72,147.71,37,-999,-999,-999,-999,-999,-999,-999,-999,-999,-999,-999,-999
,2005-08-28T04:31:01Z,WQS020,-19.72,147.71,37.2,-999,-999,-999,-999,-999,-999,-999,-999,-999,-999,-999,-999
,2005-08-28T04:31:01Z,WQS020,-19.72,147.71,37.4,-999,-999,-999,-999,-999,-999,-999,-999,-999,-999,-999,-999
,2005-08-28T04:31:01Z,WQS020,-19.72,147.71,37.6,-999,-999,-999,-999,-999,-999,-999,-999,-999,-999,-999,-999
,2005-08-28T04:31:01Z,WQS020,-19.72,147.71,37.8,-999,-999,-999,-999,-999,-999,-999,-999,-999,-999,-999,-999
,2005-08-28T04:31:04Z,WQS020,-19.72,147.71,38,-999,-999,-999,-999,-999,-999,-999,-999,-999,-999,-999,-999
,2005-08-28T04:31:04Z,WQS020,-19.72,147.71,38.2,-999,-999,-999,-999,-999,-999,-999,-999,-999,-999,-999,-999
,2005-08-28T04:31:04Z,WQS020,-19.72,147.71,38.4,-999,-999,-999,-999,-999,-999,-999,-999,-999,-999,-999,-999
,2005-08-28T04:31:04Z,WQS020,-19.72,147.71,38.6,-999,-999,-999,-999,-999,-999,-999,-999,-999,-999,-999,-999
,2005-08-28T04:31:04Z,WQS020,-19.72,147.71,38.8,-999,-999,-999,-999,-999,-999,-999,-999,-999,-999,-999,-999
,2005-08-28T04:31:05Z,WQS020,-19.72,147.71,39,-999,-999,-999,-999,-999,-999,-999,-999,-999,-999,-999,-999
,2005-08-28T04:31:05Z,WQS020,-19.72,147.71,39.2,-999,-999,-999,-999,-999,-999,-999,-999,-999,-999,-999,-999
,2005-08-28T04:31:05Z,WQS020,-19.72,147.71,39.4,-999,-999,-999,-999,-999,-999,-999,-999,-999,-999,-999,-999
,2005-08-28T04:31:05Z,WQS020,-19.72,147.71,39.6,-999,-999,-999,-999,-999,-999,-999,-999,-999,-999,-999,-999
,2005-08-28T04:31:05Z,WQS020,-19.72,147.71,39.8,-999,-999,-999,-999,-999,-999,-999,-999,-999,-999,-999,-999
,2005-08-28T04:31:08Z,WQS020,-19.72,147.71,40,-999,-999,-999,-999,-999,-999,-999,-999,-999,-999,-999,-999
,2005-08-28T04:31:08Z,WQS020,-19.72,147.71,40.2,-999,-999,-999,-999,-999,-999,-999,-999,-999,-999,-999,-999
,2005-08-28T04:31:08Z,WQS020,-19.72,147.71,40.4,-999,-999,-999,-999,-999,-999,-999,-999,-999,-999,-999,-999
,2005-08-28T04:31:08Z,WQS020,-19.72,147.71,40.6,-999,-999,-999,-999,-999,-999,-999,-999,-999,-999,-999,-999
,2005-08-28T04:31:08Z,WQS020,-19.72,147.71,40.8,-999,-999,-999,-999,-999,-999,-999,-999,-999,-999,-999,-999
,2005-08-28T04:31:08Z,WQS020,-19.72,147.71,41,-999,-999,-999,-999,-999,-999,-999,-999,-999,-999,-999,-999
,2005-08-28T04:31:09Z,WQS020,-19.72,147.71,41.2,-999,-999,-999,-999,-999,-999,-999,-999,-999,-999,-999,-999
,2005-08-28T04:31:09Z,WQS020,-19.72,147.71,41.4,-999,-999,-999,-999,-999,-999,-999,-999,-999,-999,-999,-999
,2005-08-28T04:31:09Z,WQS020,-19.72,147.71,41.6,-999,-999,-999,-999,-999,-999,-999,-999,-999,-999,-999,-999
,2005-08-28T04:31:09Z,WQS020,-19.72,147.71,41.8,-999,-999,-999,-999,-999,-999,-999,-999,-999,-999,-999,-999
,2005-08-28T04:31:09Z,WQS020,-19.72,147.71,42,-999,-999,-999,-999,-999,-999,-999,-999,-999,-999,-999,-999
,2005-08-28T04:31:12Z,WQS020,-19.72,147.71,42.2,-999,-999,-999,-999,-999,-999,-999,-999,-999,-999,-999,-999
,2005-08-28T04:31:12Z,WQS020,-19.72,147.71,42.4,-999,-999,-999,-999,-999,-999,-999,-999,-999,-999,-999,-999
,2005-08-28T04:31:12Z,WQS020,-19.72,147.71,42.6,-999,-999,-999,-999,-999,-999,-999,-999,-999,-999,-999,-999
,2005-08-28T04:31:12Z,WQS020,-19.72,147.71,42.8,-999,-999,-999,-999,-999,-999,-999,-999,-999,-999,-999,-999
,2005-08-28T04:31:12Z,WQS020,-19.72,147.71,43,-999,-999,-999,-999,-999,-999,-999,-999,-999,-999,-999,-999
,2005-08-28T04:31:14Z,WQS020,-19.72,147.71,43.2,-999,-999,-999,-999,-999,-999,-999,-999,-999,-999,-999,-999
,2005-08-28T04:31:14Z,WQS020,-19.72,147.71,43.4,-999,-999,-999,-999,-999,-999,-999,-999,-999,-999,-999,-999
,2005-08-28T04:31:14Z,WQS020,-19.72,147.71,43.6,-999,-999,-999,-999,-999,-999,-999,-999,-999,-999,-999,-999
,2005-08-28T04:31:14Z,WQS020,-19.72,147.71,43.8,-999,-999,-999,-999,-999,-999,-999,-999,-999,-999,-999,-999
,2005-08-28T04:31:14Z,WQS020,-19.72,147.71,44,-999,-999,-999,-999,-999,-999,-999,-999,-999,-999,-999,-999
,2005-08-28T04:31:14Z,WQS020,-19.72,147.71,44.2,-999,-999,-999,-999,-999,-999,-999,-999,-999,-999,-999,-999
,2005-08-28T04:31:15Z,WQS020,-19.72,147.71,44.4,-999,-999,-999,-999,-999,-999,-999,-999,-999,-999,-999,-999
,2005-08-28T04:31:15Z,WQS020,-19.72,147.71,44.6,-999,-999,-999,-999,-999,-999,-999,-999,-999,-999,-999,-999
,2005-08-28T04:31:15Z,WQS020,-19.72,147.71,44.8,-999,-999,-999,-999,-999,-999,-999,-999,-999,-999,-999,-999
,2005-08-28T04:31:15Z,WQS020,-19.72,147.71,45,-999,-999,-999,-999,-999,-999,-999,-999,-999,-999,-999,-999
,2005-08-28T04:31:15Z,WQS020,-19.72,147.71,45.2,-999,-999,-999,-999,-999,-999,-999,-999,-999,-999,-999,-999
,2005-08-28T04:31:18Z,WQS020,-19.72,147.71,45.4,-999,-999,-999,-999,-999,-999,-999,-999,-999,-999,-999,-999
,2005-08-28T04:31:18Z,WQS020,-19.72,147.71,45.6,-999,-999,-999,-999,-999,-999,-999,-999,-999,-999,-999,-999
,2005-08-28T04:31:18Z,WQS020,-19.72,147.71,45.8,-999,-999,-999,-999,-999,-999,-999,-999,-999,-999,-999,-999
,2005-08-28T04:31:18Z,WQS020,-19.72,147.71,46,-999,-999,-999,-999,-999,-999,-999,-999,-999,-999,-999,-999
,2005-08-28T04:31:18Z,WQS020,-19.72,147.71,46.2,-999,-999,-999,-999,-999,-999,-999,-999,-999,-999,-999,-999
,2005-08-28T04:31:20Z,WQS020,-19.72,147.71,46.4,-999,-999,-999,-999,-999,-999,-999,-999,-999,-999,-999,-999
,2005-08-28T04:31:20Z,WQS020,-19.72,147.71,46.6,-999,-999,-999,-999,-999,-999,-999,-999,-999,-999,-999,-999
,2005-08-28T04:31:20Z,WQS020,-19.72,147.71,46.8,-999,-999,-999,-999,-999,-999,-999,-999,-999,-999,-999,-999
,2005-08-28T04:31:20Z,WQS020,-19.72,147.71,47,-999,-999,-999,-999,-999,-999,-999,-999,-999,-999,-999,-999
,2005-08-28T04:31:20Z,WQS020,-19.72,147.71,47.2,-999,-999,-999,-999,-999,-999,-999,-999,-999,-999,-999,-999
,2005-08-28T04:31:20Z,WQS020,-19.72,147.71,47.4,-999,-999,-999,-999,-999,-999,-999,-999,-999,-999,-999,-999
,2005-08-28T04:31:22Z,WQS020,-19.72,147.71,47.6,-999,-999,-999,-999,-999,-999,-999,-999,-999,-999,-999,-999
,2005-08-28T04:31:22Z,WQS020,-19.72,147.71,47.8,-999,-999,-999,-999,-999,-999,-999,-999,-999,-999,-999,-999
,2005-08-28T04:31:22Z,WQS020,-19.72,147.71,48,-999,-999,-999,-999,-999,-999,-999,-999,-999,-999,-999,-999
,2005-08-28T04:31:22Z,WQS020,-19.72,147.71,48.2,-999,-999,-999,-999,-999,-999,-999,-999,-999,-999,-999,-999
,2005-08-28T04:31:22Z,WQS020,-19.72,147.71,48.4,-999,-999,-999,-999,-999,-999,-999,-999,-999,-999,-999,-999
,2005-08-28T04:31:24Z,WQS020,-19.72,147.71,48.6,-999,-999,-999,-999,-999,-999,-999,-999,-999,-999,-999,-999
,2005-08-28T04:31:24Z,WQS020,-19.72,147.71,48.8,-999,-999,-999,-999,-999,-999,-999,-999,-999,-999,-999,-999
,2005-08-28T04:31:24Z,WQS020,-19.72,147.71,49,-999,-999,-999,-999,-999,-999,-999,-999,-999,-999,-999,-999
,2005-08-28T04:31:24Z,WQS020,-19.72,147.71,49.2,-999,-999,-999,-999,-999,-999,-999,-999,-999,-999,-999,-999
,2005-08-28T04:31:24Z,WQS020,-19.72,147.71,49.4,-999,-999,-999,-999,-999,-999,-999,-999,-999,-999,-999,-999
,2005-08-28T04:31:26Z,WQS020,-19.72,147.71,49.6,-999,-999,-999,-999,-999,-999,-999,-999,-999,-999,-999,-999
,2005-08-28T04:31:26Z,WQS020,-19.72,147.71,49.8,-999,-999,-999,-999,-999,-999,-999,-999,-999,-999,-999,-999
,2005-08-28T04:31:26Z,WQS020,-19.72,147.71,50,-999,-999,-999,-999,-999,-999,-999,-999,-999,-999,-999,-999
,2005-08-28T04:31:26Z,WQS020,-19.72,147.71,50.2,-999,-999,-999,-999,-999,-999,-999,-999,-999,-999,-999,-999
,2005-08-28T04:31:26Z,WQS020,-19.72,147.71,50.4,-999,-999,-999,-999,-999,-999,-999,-999,-999,-999,-999,-999
,2005-08-28T04:31:26Z,WQS020,-19.72,147.71,50.6,-999,-999,-999,-999,-999,-999,-999,-999,-999,-999,-999,-999
,2005-08-28T04:31:28Z,WQS020,-19.72,147.71,50.8,-999,-999,-999,-999,-999,-999,-999,-999,-999,-999,-999,-999
,2005-08-28T04:31:28Z,WQS020,-19.72,147.71,51,-999,-999,-999,-999,-999,-999,-999,-999,-999,-999,-999,-999
,2005-08-28T04:31:28Z,WQS020,-19.72,147.71,51.2,-999,-999,-999,-999,-999,-999,-999,-999,-999,-999,-999,-999
,2005-08-28T04:31:28Z,WQS020,-19.72,147.71,51.4,-999,-999,-999,-999,-999,-999,-999,-999,-999,-999,-999,-999
,2005-08-28T04:31:28Z,WQS020,-19.72,147.71,51.6,-999,-999,-999,-999,-999,-999,-999,-999,-999,-999,-999,-999
,2005-08-28T04:31:29Z,WQS020,-19.72,147.71,51.8,-999,-999,-999,-999,-999,-999,-999,-999,-999,-999,-999,-999
,2005-08-28T04:31:29Z,WQS020,-19.72,147.71,52,-999,-999,-999,-999,-999,-999,-999,-999,-999,-999,-999,-999
,2005-08-28T04:31:29Z,WQS020,-19.72,147.71,52.2,-999,-999,-999,-999,-999,-999,-999,-999,-999,-999,-999,-999
,2005-08-28T04:31:29Z,WQS020,-19.72,147.71,52.4,-999,-999,-999,-999,-999,-999,-999,-999,-999,-999,-999,-999
,2005-08-28T04:31:29Z,WQS020,-19.72,147.71,52.6,-999,-999,-999,-999,-999,-999,-999,-999,-999,-999,-999,-999
,2005-08-28T04:31:32Z,WQS020,-19.72,147.71,52.8,-999,-999,-999,-999,-999,-999,-999,-999,-999,-999,-999,-999
,2005-08-28T04:31:32Z,WQS020,-19.72,147.71,53,-999,-999,-999,-999,-999,-999,-999,-999,-999,-999,-999,-999
,2005-08-28T04:31:32Z,WQS020,-19.72,147.71,53.2,-999,-999,-999,-999,-999,-999,-999,-999,-999,-999,-999,-999
,2005-08-28T04:31:32Z,WQS020,-19.72,147.71,53.4,-999,-999,-999,-999,-999,-999,-999,-999,-999,-999,-999,-999
,2005-08-28T04:31:32Z,WQS020,-19.72,147.71,53.6,-999,-999,-999,-999,-999,-999,-999,-999,-999,-999,-999,-999
,2005-08-28T04:31:32Z,WQS020,-19.72,147.71,53.8,-999,-999,-999,-999,-999,-999,-999,-999,-999,-999,-999,-999
,2005-08-28T04:31:34Z,WQS020,-19.72,147.71,54,-999,-999,-999,-999,-999,-999,-999,-999,-999,-999,-999,-999
,2005-08-28T04:31:34Z,WQS020,-19.72,147.71,54.2,-999,-999,-999,-999,-999,-999,-999,-999,-999,-999,-999,-999
,2005-08-28T04:31:34Z,WQS020,-19.72,147.71,54.4,-999,-999,-999,-999,-999,-999,-999,-999,-999,-999,-999,-999
,2005-08-28T04:31:34Z,WQS020,-19.72,147.71,54.6,-999,-999,-999,-999,-999,-999,-999,-999,-999,-999,-999,-999
,2005-08-28T04:31:34Z,WQS020,-19.72,147.71,54.8,-999,-999,-999,-999,-999,-999,-999,-999,-999,-999,-999,-999
,2005-08-28T04:31:35Z,WQS020,-19.72,147.71,55,-999,-999,-999,-999,-999,-999,-999,-999,-999,-999,-999,-999
,2005-08-28T04:31:35Z,WQS020,-19.72,147.71,55.2,-999,-999,-999,-999,-999,-999,-999,-999,-999,-999,-999,-999
,2005-08-28T04:31:35Z,WQS020,-19.72,147.71,55.4,-999,-999,-999,-999,-999,-999,-999,-999,-999,-999,-999,-999
,2005-08-28T04:31:35Z,WQS020,-19.72,147.71,55.6,-999,-999,-999,-999,-999,-999,-999,-999,-999,-999,-999,-999
,2005-08-28T04:31:35Z,WQS020,-19.72,147.71,55.8,-999,-999,-999,-999,-999,-999,-999,-999,-999,-999,-999,-999
,2005-08-28T04:31:38Z,WQS020,-19.72,147.71,56,-999,-999,-999,-999,-999,-999,-999,-999,-999,-999,-999,-999
,2005-08-28T04:31:38Z,WQS020,-19.72,147.71,56.2,-999,-999,-999,-999,-999,-999,-999,-999,-999,-999,-999,-999
,2005-08-28T04:31:38Z,WQS020,-19.72,147.71,56.4,-999,-999,-999,-999,-999,-999,-999,-999,-999,-999,-999,-999
,2005-08-28T04:31:38Z,WQS020,-19.72,147.71,56.6,-999,-999,-999,-999,-999,-999,-999,-999,-999,-999,-999,-999
,2005-08-28T04:31:38Z,WQS020,-19.72,147.71,56.8,-999,-999,-999,-999,-999,-999,-999,-999,-999,-999,-999,-999
,2005-08-28T04:31:38Z,WQS020,-19.72,147.71,57,-999,-999,-999,-999,-999,-999,-999,-999,-999,-999,-999,-999
,2005-08-28T04:31:40Z,WQS020,-19.72,147.71,57.2,-999,-999,-999,-999,-999,-999,-999,-999,-999,-999,-999,-999
,2005-08-28T04:31:40Z,WQS020,-19.72,147.71,57.4,-999,-999,-999,-999,-999,-999,-999,-999,-999,-999,-999,-999
,2005-08-28T04:31:40Z,WQS020,-19.72,147.71,57.6,-999,-999,-999,-999,-999,-999,-999,-999,-999,-999,-999,-999
,2005-08-28T04:31:40Z,WQS020,-19.72,147.71,57.8,-999,-999,-999,-999,-999,-999,-999,-999,-999,-999,-999,-999
,2005-08-28T04:31:40Z,WQS020,-19.72,147.71,58,-999,-999,-999,-999,-999,-999,-999,-999,-999,-999,-999,-999
,2005-08-28T04:31:42Z,WQS020,-19.72,147.71,58.2,-999,-999,-999,-999,-999,-999,-999,-999,-999,-999,-999,-999
,2005-08-28T04:31:42Z,WQS020,-19.72,147.71,58.4,-999,-999,-999,-999,-999,-999,-999,-999,-999,-999,-999,-999
,2005-08-28T04:31:42Z,WQS020,-19.72,147.71,58.6,-999,-999,-999,-999,-999,-999,-999,-999,-999,-999,-999,-999
,2005-08-28T04:31:42Z,WQS020,-19.72,147.71,58.8,-999,-999,-999,-999,-999,-999,-999,-999,-999,-999,-999,-999
,2005-08-28T04:31:42Z,WQS020,-19.72,147.71,59,-999,-999,-999,-999,-999,-999,-999,-999,-999,-999,-999,-999
,2005-08-28T04:31:44Z,WQS020,-19.72,147.71,59.2,-999,-999,-999,-999,-999,-999,-999,-999,-999,-999,-999,-999
,2005-08-28T04:31:44Z,WQS020,-19.72,147.71,59.4,-999,-999,-999,-999,-999,-999,-999,-999,-999,-999,-999,-999
,2005-08-28T04:31:44Z,WQS020,-19.72,147.71,59.6,-999,-999,-999,-999,-999,-999,-999,-999,-999,-999,-999,-999
,2005-08-28T04:31:44Z,WQS020,-19.72,147.71,59.8,-999,-999,-999,-999,-999,-999,-999,-999,-999,-999,-999,-999
,2005-08-28T04:31:44Z,WQS020,-19.72,147.71,60,-999,-999,-999,-999,-999,-999,-999,-999,-999,-999,-999,-999
,2005-08-28T04:31:44Z,WQS020,-19.72,147.71,60.2,-999,-999,-999,-999,-999,-999,-999,-999,-999,-999,-999,-999
,2005-08-28T04:31:46Z,WQS020,-19.72,147.71,60.4,-999,-999,-999,-999,-999,-999,-999,-999,-999,-999,-999,-999
,2005-08-28T04:31:46Z,WQS020,-19.72,147.71,60.6,-999,-999,-999,-999,-999,-999,-999,-999,-999,-999,-999,-999
,2005-08-28T04:31:46Z,WQS020,-19.72,147.71,60.8,-999,-999,-999,-999,-999,-999,-999,-999,-999,-999,-999,-999
,2005-08-28T04:31:46Z,WQS020,-19.72,147.71,61,-999,-999,-999,-999,-999,-999,-999,-999,-999,-999,-999,-999
,2005-08-28T04:31:46Z,WQS020,-19.72,147.71,61.2,-999,-999,-999,-999,-999,-999,-999,-999,-999,-999,-999,-999
,2005-08-28T04:31:47Z,WQS020,-19.72,147.71,61.4,-999,-999,-999,-999,-999,-999,-999,-999,-999,-999,-999,-999
,2005-08-28T04:31:47Z,WQS020,-19.72,147.71,61.6,-999,-999,-999,-999,-999,-999,-999,-999,-999,-999,-999,-999
,2005-08-28T04:31:47Z,WQS020,-19.72,147.71,61.8,-999,-999,-999,-999,-999,-999,-999,-999,-999,-999,-999,-999
,2005-08-28T04:31:47Z,WQS020,-19.72,147.71,62,-999,-999,-999,-999,-999,-999,-999,-999,-999,-999,-999,-999
,2005-08-28T04:31:47Z,WQS020,-19.72,147.71,62.2,-999,-999,-999,-999,-999,-999,-999,-999,-999,-999,-999,-999
,2005-08-28T04:31:50Z,WQS020,-19.72,147.71,62.4,-999,-999,-999,-999,-999,-999,-999,-999,-999,-999,-999,-999
,2005-08-28T04:31:50Z,WQS020,-19.72,147.71,62.6,-999,-999,-999,-999,-999,-999,-999,-999,-999,-999,-999,-999
,2005-08-28T04:31:50Z,WQS020,-19.72,147.71,62.8,-999,-999,-999,-999,-999,-999,-999,-999,-999,-999,-999,-999
,2005-08-28T04:31:50Z,WQS020,-19.72,147.71,63,-999,-999,-999,-999,-999,-999,-999,-999,-999,-999,-999,-999
,2005-08-28T04:31:50Z,WQS020,-19.72,147.71,63.2,-999,-999,-999,-999,-999,-999,-999,-999,-999,-999,-999,-999
,2005-08-28T04:31:50Z,WQS020,-19.72,147.71,63.4,-999,-999,-999,-999,-999,-999,-999,-999,-999,-999,-999,-999
,2005-08-28T04:31:52Z,WQS020,-19.72,147.71,63.6,-999,-999,-999,-999,-999,-999,-999,-999,-999,-999,-999,-999
,2005-08-28T04:31:52Z,WQS020,-19.72,147.71,63.8,-999,-999,-999,-999,-999,-999,-999,-999,-999,-999,-999,-999
,2005-08-28T04:31:52Z,WQS020,-19.72,147.71,64,-999,-999,-999,-999,-999,-999,-999,-999,-999,-999,-999,-999
,2005-08-28T04:31:52Z,WQS020,-19.72,147.71,64.2,-999,-999,-999,-999,-999,-999,-999,-999,-999,-999,-999,-999
,2005-08-28T04:31:52Z,WQS020,-19.72,147.71,64.4,-999,-999,-999,-999,-999,-999,-999,-999,-999,-999,-999,-999
,2005-08-28T04:31:54Z,WQS020,-19.72,147.71,64.6,-999,-999,-999,-999,-999,-999,-999,-999,-999,-999,-999,-999
,2005-08-28T04:31:54Z,WQS020,-19.72,147.71,64.8,-999,-999,-999,-999,-999,-999,-999,-999,-999,-999,-999,-999
,2005-08-28T04:31:54Z,WQS020,-19.72,147.71,65,-999,-999,-999,-999,-999,-999,-999,-999,-999,-999,-999,-999
,2005-08-28T04:31:54Z,WQS020,-19.72,147.71,65.2,-999,-999,-999,-999,-999,-999,-999,-999,-999,-999,-999,-999
,2005-08-28T04:31:54Z,WQS020,-19.72,147.71,65.4,-999,-999,-999,-999,-999,-999,-999,-999,-999,-999,-999,-999
,2005-08-28T04:31:56Z,WQS020,-19.72,147.71,65.6,-999,-999,-999,-999,-999,-999,-999,-999,-999,-999,-999,-999
,2005-08-28T04:31:56Z,WQS020,-19.72,147.71,65.8,-999,-999,-999,-999,-999,-999,-999,-999,-999,-999,-999,-999
,2005-08-28T04:31:56Z,WQS020,-19.72,147.71,66,-999,-999,-999,-999,-999,-999,-999,-999,-999,-999,-999,-999
,2005-08-28T04:31:56Z,WQS020,-19.72,147.71,66.2,-999,-999,-999,-999,-999,-999,-999,-999,-999,-999,-999,-999
,2005-08-28T04:31:56Z,WQS020,-19.72,147.71,66.4,-999,-999,-999,-999,-999,-999,-999,-999,-999,-999,-999,-999
,2005-08-28T04:31:56Z,WQS020,-19.72,147.71,66.6,-999,-999,-999,-999,-999,-999,-999,-999,-999,-999,-999,-999
,2005-08-28T04:31:57Z,WQS020,-19.72,147.71,66.8,-999,-999,-999,-999,-999,-999,-999,-999,-999,-999,-999,-999
,2005-08-28T04:31:57Z,WQS020,-19.72,147.71,67,-999,-999,-999,-999,-999,-999,-999,-999,-999,-999,-999,-999
,2005-08-28T04:31:57Z,WQS020,-19.72,147.71,67.2,-999,-999,-999,-999,-999,-999,-999,-999,-999,-999,-999,-999
,2005-08-28T04:31:57Z,WQS020,-19.72,147.71,67.4,-999,-999,-999,-999,-999,-999,-999,-999,-999,-999,-999,-999
,2005-08-28T04:31:57Z,WQS020,-19.72,147.71,67.6,-999,-999,-999,-999,-999,-999,-999,-999,-999,-999,-999,-999
,2005-08-28T04:32:00Z,WQS020,-19.72,147.71,67.8,-999,-999,-999,-999,-999,-999,-999,-999,-999,-999,-999,-999
,2005-08-28T04:32:00Z,WQS020,-19.72,147.71,68,-999,-999,-999,-999,-999,-999,-999,-999,-999,-999,-999,-999
,2005-08-28T04:32:00Z,WQS020,-19.72,147.71,68.2,-999,-999,-999,-999,-999,-999,-999,-999,-999,-999,-999,-999
,2005-08-28T04:32:00Z,WQS020,-19.72,147.71,68.4,-999,-999,-999,-999,-999,-999,-999,-999,-999,-999,-999,-999
,2005-08-28T04:32:00Z,WQS020,-19.72,147.71,68.6,-999,-999,-999,-999,-999,-999,-999,-999,-999,-999,-999,-999
,2005-08-28T04:32:02Z,WQS020,-19.72,147.71,68.8,-999,-999,-999,-999,-999,-999,-999,-999,-999,-999,-999,-999
,2005-08-28T04:32:02Z,WQS020,-19.72,147.71,69,-999,-999,-999,-999,-999,-999,-999,-999,-999,-999,-999,-999
,2005-08-28T04:32:02Z,WQS020,-19.72,147.71,69.2,-999,-999,-999,-999,-999,-999,-999,-999,-999,-999,-999,-999
,2005-08-28T04:32:02Z,WQS020,-19.72,147.71,69.4,-999,-999,-999,-999,-999,-999,-999,-999,-999,-999,-999,-999
,2005-08-28T04:32:02Z,WQS020,-19.72,147.71,69.6,-999,-999,-999,-999,-999,-999,-999,-999,-999,-999,-999,-999
,2005-08-28T04:32:02Z,WQS020,-19.72,147.71,69.8,-999,-999,-999,-999,-999,-999,-999,-999,-999,-999,-999,-999
,2005-08-28T04:32:04Z,WQS020,-19.72,147.71,70,-999,-999,-999,-999,-999,-999,-999,-999,-999,-999,-999,-999
,2005-08-28T04:32:04Z,WQS020,-19.72,147.71,70.2,-999,-999,-999,-999,-999,-999,-999,-999,-999,-999,-999,-999
,2005-08-28T04:32:04Z,WQS020,-19.72,147.71,70.4,-999,-999,-999,-999,-999,-999,-999,-999,-999,-999,-999,-999
,2005-08-28T04:32:04Z,WQS020,-19.72,147.71,70.6,-999,-999,-999,-999,-999,-999,-999,-999,-999,-999,-999,-999
,2005-08-28T04:32:04Z,WQS020,-19.72,147.71,70.8,-999,-999,-999,-999,-999,-999,-999,-999,-999,-999,-999,-999
,2005-08-28T04:32:06Z,WQS020,-19.72,147.71,71,-999,-999,-999,-999,-999,-999,-999,-999,-999,-999,-999,-999
,2005-08-28T04:32:06Z,WQS020,-19.72,147.71,71.2,-999,-999,-999,-999,-999,-999,-999,-999,-999,-999,-999,-999
,2005-08-28T04:32:06Z,WQS020,-19.72,147.71,71.4,-999,-999,-999,-999,-999,-999,-999,-999,-999,-999,-999,-999
,2005-08-28T04:32:06Z,WQS020,-19.72,147.71,71.6,-999,-999,-999,-999,-999,-999,-999,-999,-999,-999,-999,-999
,2005-08-28T04:32:06Z,WQS020,-19.72,147.71,71.8,-999,-999,-999,-999,-999,-999,-999,-999,-999,-999,-999,-999
,2005-08-28T04:32:08Z,WQS020,-19.72,147.71,72,-999,-999,-999,-999,-999,-999,-999,-999,-999,-999,-999,-999
,2005-08-28T04:32:08Z,WQS020,-19.72,147.71,72.2,-999,-999,-999,-999,-999,-999,-999,-999,-999,-999,-999,-999
,2005-08-28T04:32:08Z,WQS020,-19.72,147.71,72.4,-999,-999,-999,-999,-999,-999,-999,-999,-999,-999,-999,-999
,2005-08-28T04:32:08Z,WQS020,-19.72,147.71,72.6,-999,-999,-999,-999,-999,-999,-999,-999,-999,-999,-999,-999
,2005-08-28T04:32:08Z,WQS020,-19.72,147.71,72.8,-999,-999,-999,-999,-999,-999,-999,-999,-999,-999,-999,-999
,2005-08-28T04:32:08Z,WQS020,-19.72,147.71,73,-999,-999,-999,-999,-999,-999,-999,-999,-999,-999,-999,-999
,2005-08-28T04:32:11Z,WQS020,-19.72,147.71,73.2,-999,-999,-999,-999,-999,-999,-999,-999,-999,-999,-999,-999
,2005-08-28T04:32:11Z,WQS020,-19.72,147.71,73.4,-999,-999,-999,-999,-999,-999,-999,-999,-999,-999,-999,-999
,2005-08-28T04:32:11Z,WQS020,-19.72,147.71,73.6,-999,-999,-999,-999,-999,-999,-999,-999,-999,-999,-999,-999
,2005-08-28T04:32:11Z,WQS020,-19.72,147.71,73.8,-999,-999,-999,-999,-999,-999,-999,-999,-999,-999,-999,-999
,2005-08-28T04:32:11Z,WQS020,-19.72,147.71,74,-999,-999,-999,-999,-999,-999,-999,-999,-999,-999,-999,-999
,2005-08-28T04:32:18Z,WQS020,-19.72,147.71,74.2,-999,-999,-999,-999,-999,-999,-999,-999,-999,-999,-999,-999
,2005-08-28T04:32:18Z,WQS020,-19.72,147.71,74.4,-999,-999,-999,-999,-999,-999,-999,-999,-999,-999,-999,-999
,2005-08-28T04:32:18Z,WQS020,-19.72,147.71,74.6,-999,-999,-999,-999,-999,-999,-999,-999,-999,-999,-999,-999
,2005-08-28T04:32:18Z,WQS020,-19.72,147.71,74.8,-999,-999,-999,-999,-999,-999,-999,-999,-999,-999,-999,-999
,2005-08-28T04:32:18Z,WQS020,-19.72,147.71,75,-999,-999,-999,-999,-999,-999,-999,-999,-999,-999,-999,-999
,2005-08-28T04:32:20Z,WQS020,-19.72,147.71,75.2,-999,-999,-999,-999,-999,-999,-999,-999,-999,-999,-999,-999
,2005-08-28T04:32:20Z,WQS020,-19.72,147.71,75.4,-999,-999,-999,-999,-999,-999,-999,-999,-999,-999,-999,-999
,2005-08-28T04:32:20Z,WQS020,-19.72,147.71,75.6,-999,-999,-999,-999,-999,-999,-999,-999,-999,-999,-999,-999
,2005-08-28T04:32:20Z,WQS020,-19.72,147.71,75.8,-999,-999,-999,-999,-999,-999,-999,-999,-999,-999,-999,-999
,2005-08-28T04:32:20Z,WQS020,-19.72,147.71,76,-999,-999,-999,-999,-999,-999,-999,-999,-999,-999,-999,-999
,2005-08-28T04:32:20Z,WQS020,-19.72,147.71,76.2,-999,-999,-999,-999,-999,-999,-999,-999,-999,-999,-999,-999
,2005-08-28T04:32:24Z,WQS020,-19.72,147.71,76.4,-999,-999,-999,-999,-999,-999,-999,-999,-999,-999,-999,-999
,2005-08-28T04:32:24Z,WQS020,-19.72,147.71,76.6,-999,-999,-999,-999,-999,-999,-999,-999,-999,-999,-999,-999
,2005-08-28T04:32:24Z,WQS020,-19.72,147.71,76.8,-999,-999,-999,-999,-999,-999,-999,-999,-999,-999,-999,-999
,2005-08-28T04:32:24Z,WQS020,-19.72,147.71,77,-999,-999,-999,-999,-999,-999,-999,-999,-999,-999,-999,-999
,2005-08-28T04:32:24Z,WQS020,-19.72,147.71,77.2,-999,-999,-999,-999,-999,-999,-999,-999,-999,-999,-999,-999
,2005-08-28T04:32:28Z,WQS020,-19.72,147.71,77.4,-999,-999,-999,-999,-999,-999,-999,-999,-999,-999,-999,-999
,2005-08-28T04:32:28Z,WQS020,-19.72,147.71,77.6,-999,-999,-999,-999,-999,-999,-999,-999,-999,-999,-999,-999
,2005-08-28T04:32:28Z,WQS020,-19.72,147.71,77.8,-999,-999,-999,-999,-999,-999,-999,-999,-999,-999,-999,-999
,2005-08-28T04:32:28Z,WQS020,-19.72,147.71,78,-999,-999,-999,-999,-999,-999,-999,-999,-999,-999,-999,-999
,2005-08-28T04:32:28Z,WQS020,-19.72,147.71,78.2,-999,-999,-999,-999,-999,-999,-999,-999,-999,-999,-999,-999
,2005-08-28T04:32:30Z,WQS020,-19.72,147.71,78.4,-999,-999,-999,-999,-999,-999,-999,-999,-999,-999,-999,-999
,2005-08-28T04:32:30Z,WQS020,-19.72,147.71,78.6,-999,-999,-999,-999,-999,-999,-999,-999,-999,-999,-999,-999
,2005-08-28T04:32:30Z,WQS020,-19.72,147.71,78.8,-999,-999,-999,-999,-999,-999,-999,-999,-999,-999,-999,-999
,2005-08-28T04:32:30Z,WQS020,-19.72,147.71,79,-999,-999,-999,-999,-999,-999,-999,-999,-999,-999,-999,-999
,2005-08-28T04:32:30Z,WQS020,-19.72,147.71,79.2,-999,-999,-999,-999,-999,-999,-999,-999,-999,-999,-999,-999
,2005-08-28T04:32:30Z,WQS020,-19.72,147.71,79.4,-999,-999,-999,-999,-999,-999,-999,-999,-999,-999,-999,-999
,2005-08-28T04:32:34Z,WQS020,-19.72,147.71,79.6,-999,-999,-999,-999,-999,-999,-999,-999,-999,-999,-999,-999
,2005-08-28T04:32:34Z,WQS020,-19.72,147.71,79.8,-999,-999,-999,-999,-999,-999,-999,-999,-999,-999,-999,-999
,2005-08-28T04:32:34Z,WQS020,-19.72,147.71,80,-999,-999,-999,-999,-999,-999,-999,-999,-999,-999,-999,-999
,2005-08-28T04:32:34Z,WQS020,-19.72,147.71,80.2,-999,-999,-999,-999,-999,-999,-999,-999,-999,-999,-999,-999
,2005-08-28T04:32:34Z,WQS020,-19.72,147.71,80.4,-999,-999,-999,-999,-999,-999,-999,-999,-999,-999,-999,-999
,2005-08-28T04:32:36Z,WQS020,-19.72,147.71,80.6,-999,-999,-999,-999,-999,-999,-999,-999,-999,-999,-999,-999
,2005-08-28T04:32:36Z,WQS020,-19.72,147.71,80.8,-999,-999,-999,-999,-999,-999,-999,-999,-999,-999,-999,-999
,2005-08-28T04:32:36Z,WQS020,-19.72,147.71,81,-999,-999,-999,-999,-999,-999,-999,-999,-999,-999,-999,-999
,2005-08-28T04:32:36Z,WQS020,-19.72,147.71,81.2,-999,-999,-999,-999,-999,-999,-999,-999,-999,-999,-999,-999
,2005-08-28T04:32:36Z,WQS020,-19.72,147.71,81.4,-999,-999,-999,-999,-999,-999,-999,-999,-999,-999,-999,-999
,2005-08-28T04:32:39Z,WQS020,-19.72,147.71,81.6,-999,-999,-999,-999,-999,-999,-999,-999,-999,-999,-999,-999
,2005-08-28T04:32:39Z,WQS020,-19.72,147.71,81.8,-999,-999,-999,-999,-999,-999,-999,-999,-999,-999,-999,-999
,2005-08-28T04:32:39Z,WQS020,-19.72,147.71,82,-999,-999,-999,-999,-999,-999,-999,-999,-999,-999,-999,-999
,2005-08-28T04:32:39Z,WQS020,-19.72,147.71,82.2,-999,-999,-999,-999,-999,-999,-999,-999,-999,-999,-999,-999
,2005-08-28T04:32:39Z,WQS020,-19.72,147.71,82.4,-999,-999,-999,-999,-999,-999,-999,-999,-999,-999,-999,-999
,2005-08-28T04:32:39Z,WQS020,-19.72,147.71,82.6,-999,-999,-999,-999,-999,-999,-999,-999,-999,-999,-999,-999
,2005-08-28T04:32:41Z,WQS020,-19.72,147.71,82.8,-999,-999,-999,-999,-999,-999,-999,-999,-999,-999,-999,-999
,2005-08-28T04:32:41Z,WQS020,-19.72,147.71,83,-999,-999,-999,-999,-999,-999,-999,-999,-999,-999,-999,-999
,2005-08-28T04:32:41Z,WQS020,-19.72,147.71,83.2,-999,-999,-999,-999,-999,-999,-999,-999,-999,-999,-999,-999
,2005-08-28T04:32:41Z,WQS020,-19.72,147.71,83.4,-999,-999,-999,-999,-999,-999,-999,-999,-999,-999,-999,-999
,2005-08-28T04:32:41Z,WQS020,-19.72,147.71,83.6,-999,-999,-999,-999,-999,-999,-999,-999,-999,-999,-999,-999
,2005-08-28T04:32:46Z,WQS020,-19.72,147.71,83.8,-999,-999,-999,-999,-999,-999,-999,-999,-999,-999,-999,-999
,2005-08-28T04:32:46Z,WQS020,-19.72,147.71,84,-999,-999,-999,-999,-999,-999,-999,-999,-999,-999,-999,-999
,2005-08-28T04:32:46Z,WQS020,-19.72,147.71,84.2,-999,-999,-999,-999,-999,-999,-999,-999,-999,-999,-999,-999
,2005-08-28T04:32:46Z,WQS020,-19.72,147.71,84.4,-999,-999,-999,-999,-999,-999,-999,-999,-999,-999,-999,-999
,2005-08-28T04:32:46Z,WQS020,-19.72,147.71,84.6,-999,-999,-999,-999,-999,-999,-999,-999,-999,-999,-999,-999
,2005-08-28T04:32:47Z,WQS020,-19.72,147.71,84.8,-999,-999,-999,-999,-999,-999,-999,-999,-999,-999,-999,-999
,2005-08-28T04:32:47Z,WQS020,-19.72,147.71,85,-999,-999,-999,-999,-999,-999,-999,-999,-999,-999,-999,-999
,2005-08-28T04:32:47Z,WQS020,-19.72,147.71,85.2,-999,-999,-999,-999,-999,-999,-999,-999,-999,-999,-999,-999
,2005-08-28T04:32:47Z,WQS020,-19.72,147.71,85.4,-999,-999,-999,-999,-999,-999,-999,-999,-999,-999,-999,-999
,2005-08-28T04:32:47Z,WQS020,-19.72,147.71,85.6,-999,-999,-999,-999,-999,-999,-999,-999,-999,-999,-999,-999
,2005-08-28T04:32:47Z,WQS020,-19.72,147.71,85.8,-999,-999,-999,-999,-999,-999,-999,-999,-999,-999,-999,-999
,2005-08-28T04:32:52Z,WQS020,-19.72,147.71,86,-999,-999,-999,-999,-999,-999,-999,-999,-999,-999,-999,-999
,2005-08-28T04:32:52Z,WQS020,-19.72,147.71,86.2,-999,-999,-999,-999,-999,-999,-999,-999,-999,-999,-999,-999
,2005-08-28T04:32:52Z,WQS020,-19.72,147.71,86.4,-999,-999,-999,-999,-999,-999,-999,-999,-999,-999,-999,-999
,2005-08-28T04:32:52Z,WQS020,-19.72,147.71,86.6,-999,-999,-999,-999,-999,-999,-999,-999,-999,-999,-999,-999
,2005-08-28T04:32:52Z,WQS020,-19.72,147.71,86.8,-999,-999,-999,-999,-999,-999,-999,-999,-999,-999,-999,-999
,2005-08-28T04:32:53Z,WQS020,-19.72,147.71,87,-999,-999,-999,-999,-999,-999,-999,-999,-999,-999,-999,-999
,2005-08-28T04:32:53Z,WQS020,-19.72,147.71,87.2,-999,-999,-999,-999,-999,-999,-999,-999,-999,-999,-999,-999
,2005-08-28T04:32:53Z,WQS020,-19.72,147.71,87.4,-999,-999,-999,-999,-999,-999,-999,-999,-999,-999,-999,-999
,2005-08-28T04:32:53Z,WQS020,-19.72,147.71,87.6,-999,-999,-999,-999,-999,-999,-999,-999,-999,-999,-999,-999
,2005-08-28T04:32:53Z,WQS020,-19.72,147.71,87.8,-999,-999,-999,-999,-999,-999,-999,-999,-999,-999,-999,-999
,2005-08-28T04:32:58Z,WQS020,-19.72,147.71,88,-999,-999,-999,-999,-999,-999,-999,-999,-999,-999,-999,-999
,2005-08-28T04:32:58Z,WQS020,-19.72,147.71,88.2,-999,-999,-999,-999,-999,-999,-999,-999,-999,-999,-999,-999
,2005-08-28T04:32:58Z,WQS020,-19.72,147.71,88.4,-999,-999,-999,-999,-999,-999,-999,-999,-999,-999,-999,-999
,2005-08-28T04:32:58Z,WQS020,-19.72,147.71,88.6,-999,-999,-999,-999,-999,-999,-999,-999,-999,-999,-999,-999
,2005-08-28T04:32:58Z,WQS020,-19.72,147.71,88.8,-999,-999,-999,-999,-999,-999,-999,-999,-999,-999,-999,-999
,2005-08-28T04:32:58Z,WQS020,-19.72,147.71,89,-999,-999,-999,-999,-999,-999,-999,-999,-999,-999,-999,-999
,2005-08-28T04:33:00Z,WQS020,-19.72,147.71,89.2,-999,-999,-999,-999,-999,-999,-999,-999,-999,-999,-999,-999
,2005-08-28T04:33:00Z,WQS020,-19.72,147.71,89.4,-999,-999,-999,-999,-999,-999,-999,-999,-999,-999,-999,-999
,2005-08-28T04:33:00Z,WQS020,-19.72,147.71,89.6,-999,-999,-999,-999,-999,-999,-999,-999,-999,-999,-999,-999
,2005-08-28T04:33:00Z,WQS020,-19.72,147.71,89.8,-999,-999,-999,-999,-999,-999,-999,-999,-999,-999,-999,-999
,2005-08-28T04:33:00Z,WQS020,-19.72,147.71,90,-999,-999,-999,-999,-999,-999,-999,-999,-999,-999,-999,-999
,2005-08-28T04:33:04Z,WQS020,-19.72,147.71,90.2,-999,-999,-999,-999,-999,-999,-999,-999,-999,-999,-999,-999
,2005-08-28T04:33:04Z,WQS020,-19.72,147.71,90.4,-999,-999,-999,-999,-999,-999,-999,-999,-999,-999,-999,-999
,2005-08-28T04:33:04Z,WQS020,-19.72,147.71,90.6,-999,-999,-999,-999,-999,-999,-999,-999,-999,-999,-999,-999
,2005-08-28T04:33:04Z,WQS020,-19.72,147.71,90.8,-999,-999,-999,-999,-999,-999,-999,-999,-999,-999,-999,-999
,2005-08-28T04:33:04Z,WQS020,-19.72,147.71,91,-999,-999,-999,-999,-999,-999,-999,-999,-999,-999,-999,-999
,2005-08-28T04:33:06Z,WQS020,-19.72,147.71,91.2,-999,-999,-999,-999,-999,-999,-999,-999,-999,-999,-999,-999
,2005-08-28T04:33:06Z,WQS020,-19.72,147.71,91.4,-999,-999,-999,-999,-999,-999,-999,-999,-999,-999,-999,-999
,2005-08-28T04:33:06Z,WQS020,-19.72,147.71,91.6,-999,-999,-999,-999,-999,-999,-999,-999,-999,-999,-999,-999
,2005-08-28T04:33:06Z,WQS020,-19.72,147.71,91.8,-999,-999,-999,-999,-999,-999,-999,-999,-999,-999,-999,-999
,2005-08-28T04:33:06Z,WQS020,-19.72,147.71,92,-999,-999,-999,-999,-999,-999,-999,-999,-999,-999,-999,-999
,2005-08-28T04:33:06Z,WQS020,-19.72,147.71,92.2,-999,-999,-999,-999,-999,-999,-999,-999,-999,-999,-999,-999
,2005-08-28T04:33:08Z,WQS020,-19.72,147.71,92.4,-999,-999,-999,-999,-999,-999,-999,-999,-999,-999,-999,-999
,2005-08-28T04:33:08Z,WQS020,-19.72,147.71,92.6,-999,-999,-999,-999,-999,-999,-999,-999,-999,-999,-999,-999
,2005-08-28T04:33:08Z,WQS020,-19.72,147.71,92.8,-999,-999,-999,-999,-999,-999,-999,-999,-999,-999,-999,-999
,2005-08-28T04:33:08Z,WQS020,-19.72,147.71,93,-999,-999,-999,-999,-999,-999,-999,-999,-999,-999,-999,-999
,2005-08-28T04:33:08Z,WQS020,-19.72,147.71,93.2,-999,-999,-999,-999,-999,-999,-999,-999,-999,-999,-999,-999
,2005-08-28T04:33:09Z,WQS020,-19.72,147.71,93.4,-999,-999,-999,-999,-999,-999,-999,-999,-999,-999,-999,-999
,2005-08-28T04:33:09Z,WQS020,-19.72,147.71,93.6,-999,-999,-999,-999,-999,-999,-999,-999,-999,-999,-999,-999
,2005-08-28T04:33:09Z,WQS020,-19.72,147.71,93.8,-999,-999,-999,-999,-999,-999,-999,-999,-999,-999,-999,-999
,2005-08-28T04:33:09Z,WQS020,-19.72,147.71,94,-999,-999,-999,-999,-999,-999,-999,-999,-999,-999,-999,-999
,2005-08-28T04:33:09Z,WQS020,-19.72,147.71,94.2,-999,-999,-999,-999,-999,-999,-999,-999,-999,-999,-999,-999
,2005-08-28T04:33:12Z,WQS020,-19.72,147.71,94.4,-999,-999,-999,-999,-999,-999,-999,-999,-999,-999,-999,-999
,2005-08-28T04:33:12Z,WQS020,-19.72,147.71,94.6,-999,-999,-999,-999,-999,-999,-999,-999,-999,-999,-999,-999
,2005-08-28T04:33:12Z,WQS020,-19.72,147.71,94.8,-999,-999,-999,-999,-999,-999,-999,-999,-999,-999,-999,-999
,2005-08-28T04:33:12Z,WQS020,-19.72,147.71,95,-999,-999,-999,-999,-999,-999,-999,-999,-999,-999,-999,-999
,2005-08-28T04:33:12Z,WQS020,-19.72,147.71,95.2,-999,-999,-999,-999,-999,-999,-999,-999,-999,-999,-999,-999
,2005-08-28T04:33:12Z,WQS020,-19.72,147.71,95.4,-999,-999,-999,-999,-999,-999,-999,-999,-999,-999,-999,-999
,2005-08-28T04:33:13Z,WQS020,-19.72,147.71,95.6,-999,-999,-999,-999,-999,-999,-999,-999,-999,-999,-999,-999
,2005-08-28T04:33:13Z,WQS020,-19.72,147.71,95.8,-999,-999,-999,-999,-999,-999,-999,-999,-999,-999,-999,-999
,2005-08-28T04:33:13Z,WQS020,-19.72,147.71,96,-999,-999,-999,-999,-999,-999,-999,-999,-999,-999,-999,-999
,2005-08-28T04:33:13Z,WQS020,-19.72,147.71,96.2,-999,-999,-999,-999,-999,-999,-999,-999,-999,-999,-999,-999
,2005-08-28T04:33:13Z,WQS020,-19.72,147.71,96.4,-999,-999,-999,-999,-999,-999,-999,-999,-999,-999,-999,-999
,2005-08-28T04:33:16Z,WQS020,-19.72,147.71,96.6,-999,-999,-999,-999,-999,-999,-999,-999,-999,-999,-999,-999
,2005-08-28T04:33:16Z,WQS020,-19.72,147.71,96.8,-999,-999,-999,-999,-999,-999,-999,-999,-999,-999,-999,-999
,2005-08-28T04:33:16Z,WQS020,-19.72,147.71,97,-999,-999,-999,-999,-999,-999,-999,-999,-999,-999,-999,-999
,2005-08-28T04:33:16Z,WQS020,-19.72,147.71,97.2,-999,-999,-999,-999,-999,-999,-999,-999,-999,-999,-999,-999
,2005-08-28T04:33:16Z,WQS020,-19.72,147.71,97.4,-999,-999,-999,-999,-999,-999,-999,-999,-999,-999,-999,-999
,2005-08-28T04:33:18Z,WQS020,-19.72,147.71,97.6,-999,-999,-999,-999,-999,-999,-999,-999,-999,-999,-999,-999
,2005-08-28T04:33:18Z,WQS020,-19.72,147.71,97.8,-999,-999,-999,-999,-999,-999,-999,-999,-999,-999,-999,-999
,2005-08-28T04:33:18Z,WQS020,-19.72,147.71,98,-999,-999,-999,-999,-999,-999,-999,-999,-999,-999,-999,-999
,2005-08-28T04:33:18Z,WQS020,-19.72,147.71,98.2,-999,-999,-999,-999,-999,-999,-999,-999,-999,-999,-999,-999
,2005-08-28T04:33:18Z,WQS020,-19.72,147.71,98.4,-999,-999,-999,-999,-999,-999,-999,-999,-999,-999,-999,-999
,2005-08-28T04:33:18Z,WQS020,-19.72,147.71,98.6,-999,-999,-999,-999,-999,-999,-999,-999,-999,-999,-999,-999
,2005-08-28T04:33:20Z,WQS020,-19.72,147.71,98.8,-999,-999,-999,-999,-999,-999,-999,-999,-999,-999,-999,-999
,2005-08-28T04:33:20Z,WQS020,-19.72,147.71,99,-999,-999,-999,-999,-999,-999,-999,-999,-999,-999,-999,-999
,2005-08-28T04:33:20Z,WQS020,-19.72,147.71,99.2,-999,-999,-999,-999,-999,-999,-999,-999,-999,-999,-999,-999
,2005-08-28T04:33:20Z,WQS020,-19.72,147.71,99.4,-999,-999,-999,-999,-999,-999,-999,-999,-999,-999,-999,-999
,2005-08-28T04:33:20Z,WQS020,-19.72,147.71,99.6,-999,-999,-999,-999,-999,-999,-999,-999,-999,-999,-999,-999
,2005-08-28T04:33:22Z,WQS020,-19.72,147.71,99.8,-999,-999,-999,-999,-999,-999,-999,-999,-999,-999,-999,-999
,2005-08-28T04:33:22Z,WQS020,-19.72,147.71,100,-999,-999,-999,-999,-999,-999,-999,-999,-999,-999,-999,-999
