GLOBAL ATTRIBUTES,,Comments,,,,,,,,,,,,,,,,,,,,,,,,,,,,,,,,,,,,,,,,,,,,,,,,,,,,,,,,,,,,,,,,,,,,,,,,,,,
title,,,,,,,,,,,,,,,,,,,,,,,,,,,,,,,,,,,,,,,,,,,,,,,,,,,,,,,,,,,,,,,,,,,,,,,,,,,,,
project,Integrated Marine Observing System (IMOS),,,,,,,,,,,,,,,,,,,,,,,,,,,,,,,,,,,,,,,,,,,,,,,,,,,,,,,,,,,,,,,,,,,,,,,,,,,,
original_project_name,Remote Sensing 2004-2007,,,,,,,,,,,,,,,,,,,,,,,,,,,,,,,,,,,,,,,,,,,,,,,,,,,,,,,,,,,,,,,,,,,,,,,,,,,,
institution,CMAR,,,,,,,,,,,,,,,,,,,,,,,,,,,,,,,,,,,,,,,,,,,,,,,,,,,,,,,,,,,,,,,,,,,,,,,,,,,,
abstract,"This record contains data generated from samples collected on the charter vessel Rum Rambler between 15 and 19 August 2004. The data can be used for Ocean Colour sensor validation. Parameters measured are the concentration of chlorophyll and carotenoid pigments and retrieved chlorophyll a estimate, the absorption coefficient for dissolved (CDOM) particulate (a/p) and detrital or non-algal (a/d) components of the water column. 26 stations were sampled. The data was used primarily to validate ocean colour sensors MERIS, MODIS and SeaWIFs and the SST sensor AATSR. Samples were collected and analysed for pigments, total suspended solids (TSS) and absorption coefficient, dissolved and particulate. CLW deployed instruments RAMSES, AC-9, Hydroscat and Hydrorad.",,,,,,,,,,,,,,,,,,,,,,,,,,,,,,,,,,,,,,,,,,,,,,,,,,,,,,,,,,,,,,,,,,,,,,,,,,,,
conventions,IMOS biological data format (v1.0),,,,,,,,,,,,,,,,,,,,,,,,,,,,,,,,,,,,,,,,,,,,,,,,,,,,,,,,,,,,,,,,,,,,,,,,,,,,
date_created,,,,,,,,,,,,,,,,,,,,,,,,,,,,,,,,,,,,,,,,,,,,,,,,,,,,,,,,,,,,,,,,,,,,,,,,,,,,,
date_modified,,,,,,,,,,,,,,,,,,,,,,,,,,,,,,,,,,,,,,,,,,,,,,,,,,,,,,,,,,,,,,,,,,,,,,,,,,,,,
history,data has been quality controlled by in-house procedures,,,,,,,,,,,,,,,,,,,,,,,,,,,,,,,,,,,,,,,,,,,,,,,,,,,,,,,,,,,,,,,,,,,,,,,,,,,,
comment,"A value of -999 means the pigment was not measured, while 0.000 means it was measured but below the detection limit.",,,,,,,,,,,,,,,,,,,,,,,,,,,,,,,,,,,,,,,,,,,,,,,,,,,,,,,,,,,,,,,,,,,,,,,,,,,,
source,High Performance Liquid Chromatography of pigments in discrete sea-water samples,,,,,,,,,,,,,,,,,,,,,,,,,,,,,,,,,,,,,,,,,,,,,,,,,,,,,,,,,,,,,,,,,,,,,,,,,,,,
keywords,Oceans>Ocean Chemistry>Pigments;Oceans>ocean Chemistry>Ocean Colour;Oceans>Ocean Chemistry>Chlorophyll a,,,,,,,,,,,,,,,,,,,,,,,,,,,,,,,,,,,,,,,,,,,,,,,,,,,,,,,,,,,,,,,,,,,,,,,,,,,,
cruise_id,FK04,,,,,,,,,,,,,,,,,,,,,,,,,,,,,,,,,,,,,,,,,,,,,,,,,,,,,,,,,,,,,,,,,,,,,,,,,,,,
vessel_name,Rum Rambler,,,,,,,,,,,,,,,,,,,,,,,,,,,,,,,,,,,,,,,,,,,,,,,,,,,,,,,,,,,,,,,,,,,,,,,,,,,,
platform_code,,,,,,,,,,,,,,,,,,,,,,,,,,,,,,,,,,,,,,,,,,,,,,,,,,,,,,,,,,,,,,,,,,,,,,,,,,,,,
references,https://marlin.csiro.au/geonetwork/srv/eng/catalog.search;jsessionid=node01sxocmphc9mdcwyado7bnhi2v65557.node0#/metadata/c0afce0a-5213-20d3-e044-00144f7bc0f4,,,,,,,,,,,,,,,,,,,,,,,,,,,,,,,,,,,,,,,,,,,,,,,,,,,,,,,,,,,,,,,,,,,,,,,,,,,,
naming_authority,CSIRO Marine and Atmospheric Research (CMAR),,,,,,,,,,,,,,,,,,,,,,,,,,,,,,,,,,,,,,,,,,,,,,,,,,,,,,,,,,,,,,,,,,,,,,,,,,,,
cdm_data_type,Point,,,,,,,,,,,,,,,,,,,,,,,,,,,,,,,,,,,,,,,,,,,,,,,,,,,,,,,,,,,,,,,,,,,,,,,,,,,,
geospatial_lat_min,-23.417866666666665,calculated automatically from table,,,,,,,,,,,,,,,,,,,,,,,,,,,,,,,,,,,,,,,,,,,,,,,,,,,,,,,,,,,,,,,,,,,,,,,,,,,
geospatial_lat_max,-23.300216666666667,calculated automatically from table,,,,,,,,,,,,,,,,,,,,,,,,,,,,,,,,,,,,,,,,,,,,,,,,,,,,,,,,,,,,,,,,,,,,,,,,,,,
geospatial_lon_min,150.8419,calculated automatically from table,,,,,,,,,,,,,,,,,,,,,,,,,,,,,,,,,,,,,,,,,,,,,,,,,,,,,,,,,,,,,,,,,,,,,,,,,,,
geospatial_lon_max,151.0126,calculated automatically from table,,,,,,,,,,,,,,,,,,,,,,,,,,,,,,,,,,,,,,,,,,,,,,,,,,,,,,,,,,,,,,,,,,,,,,,,,,,
geospatial_vertical_min,0,calculated automatically from table,,,,,,,,,,,,,,,,,,,,,,,,,,,,,,,,,,,,,,,,,,,,,,,,,,,,,,,,,,,,,,,,,,,,,,,,,,,
geospatial_vertical_max,0,calculated automatically from table,,,,,,,,,,,,,,,,,,,,,,,,,,,,,,,,,,,,,,,,,,,,,,,,,,,,,,,,,,,,,,,,,,,,,,,,,,,
local_time_zone,+10,,,,,,,,,,,,,,,,,,,,,,,,,,,,,,,,,,,,,,,,,,,,,,,,,,,,,,,,,,,,,,,,,,,,,,,,,,,,
data_centre,eMarine Information Infrastructure (eMII),,,,,,,,,,,,,,,,,,,,,,,,,,,,,,,,,,,,,,,,,,,,,,,,,,,,,,,,,,,,,,,,,,,,,,,,,,,,
data_centre_email,info@emii.org.au,,,,,,,,,,,,,,,,,,,,,,,,,,,,,,,,,,,,,,,,,,,,,,,,,,,,,,,,,,,,,,,,,,,,,,,,,,,,
author,"Clementson, Lesley",,,,,,,,,,,,,,,,,,,,,,,,,,,,,,,,,,,,,,,,,,,,,,,,,,,,,,,,,,,,,,,,,,,,,,,,,,,,
author_email,Lesley.Clementson@csiro.au,,,,,,,,,,,,,,,,,,,,,,,,,,,,,,,,,,,,,,,,,,,,,,,,,,,,,,,,,,,,,,,,,,,,,,,,,,,,
principal_investigator,"Dekker, Arnold",,,,,,,,,,,,,,,,,,,,,,,,,,,,,,,,,,,,,,,,,,,,,,,,,,,,,,,,,,,,,,,,,,,,,,,,,,,,
principal_investigator_email,Arnold.Dekker@csiro.au,,,,,,,,,,,,,,,,,,,,,,,,,,,,,,,,,,,,,,,,,,,,,,,,,,,,,,,,,,,,,,,,,,,,,,,,,,,,
institution,IMOS Satellite Remote Sensing - Ocean Colour Sub-facility - Bio-Optical database of Australian Waters,,,,,,,,,,,,,,,,,,,,,,,,,,,,,,,,,,,,,,,,,,,,,,,,,,,,,,,,,,,,,,,,,,,,,,,,,,,,
institution_principal_investigator,"Schroeder, Thomas",,,,,,,,,,,,,,,,,,,,,,,,,,,,,,,,,,,,,,,,,,,,,,,,,,,,,,,,,,,,,,,,,,,,,,,,,,,,
institution_principal_investigator_email,Thomas.Schroeder@csiro.au,,,,,,,,,,,,,,,,,,,,,,,,,,,,,,,,,,,,,,,,,,,,,,,,,,,,,,,,,,,,,,,,,,,,,,,,,,,,
publisher,Australian Ocean Data Network,,,,,,,,,,,,,,,,,,,,,,,,,,,,,,,,,,,,,,,,,,,,,,,,,,,,,,,,,,,,,,,,,,,,,,,,,,,,
publisher_email,info@aodn.org.au,,,,,,,,,,,,,,,,,,,,,,,,,,,,,,,,,,,,,,,,,,,,,,,,,,,,,,,,,,,,,,,,,,,,,,,,,,,,
citation,"To cite this data set in a publication, use the format ""IMOS [year-of-data-downloaded], [Title], [data-access-url], accessed [date-of-access]""",,,,,,,,,,,,,,,,,,,,,,,,,,,,,,,,,,,,,,,,,,,,,,,,,,,,,,,,,,,,,,,,,,,,,,,,,,,,
acknowledgement,Data was sourced from the Commonwealth Scientific and Industrial Research Organisation (CSIRO),,,,,,,,,,,,,,,,,,,,,,,,,,,,,,,,,,,,,,,,,,,,,,,,,,,,,,,,,,,,,,,,,,,,,,,,,,,,
distribution_statement,"Any users of IMOS data are required to clearly acknowledge the source of the material. Data, products and services from IMOS are provided ""as is"" without any warranty as to fitness for a particular purpose.",,,,,,,,,,,,,,,,,,,,,,,,,,,,,,,,,,,,,,,,,,,,,,,,,,,,,,,,,,,,,,,,,,,,,,,,,,,,
,,,,,,,,,,,,,,,,,,,,,,,,,,,,,,,,,,,,,,,,,,,,,,,,,,,,,,,,,,,,,,,,,,,,,,,,,,,,,
,,,,,,,,,,,,,,,,,,,,,,,,,,,,,,,,,,,,,,,,,,,,,,,,,,,,,,,,,,,,,,,,,,,,,,,,,,,,,
TABLE COLUMNS,,,,,,,,,,,,,,,,,,,,,,,,,,,,,,,,,,,,,,,,,,,,,,,,,,,,,,,,,,,,,,,,,,,,,,,,,,,,,
Column name,CF standard_name,IMOS long_name,Units,Fill value,Comments,,,,,,,,,,,,,,,,,,,,,,,,,,,,,,,,,,,,,,,,,,,,,,,,,,,,,,,,,,,,,,,,,,,,,,,,
Time,time,analysis_time,YYYY-MM-DDThh:mm:ssZ,,UTC date and time,,,,,,,,,,,,,,,,,,,,,,,,,,,,,,,,,,,,,,,,,,,,,,,,,,,,,,,,,,,,,,,,,,,,,,,,
Station_Code,,,,,National Reference Station code (6 letters),,,,,,,,,,,,,,,,,,,,,,,,,,,,,,,,,,,,,,,,,,,,,,,,,,,,,,,,,,,,,,,,,,,,,,,,
Latitude,latitude,latitude,degrees_north,,North positive,,,,,,,,,,,,,,,,,,,,,,,,,,,,,,,,,,,,,,,,,,,,,,,,,,,,,,,,,,,,,,,,,,,,,,,,
Longitude,longitude,longitude,degrees_east,,East positive,,,,,,,,,,,,,,,,,,,,,,,,,,,,,,,,,,,,,,,,,,,,,,,,,,,,,,,,,,,,,,,,,,,,,,,,
Depth,depth,depth,m ,,positive down,,,,,,,,,,,,,,,,,,,,,,,,,,,,,,,,,,,,,,,,,,,,,,,,,,,,,,,,,,,,,,,,,,,,,,,,
CPHL_c3,,mass_concentration_of_HPLC_chlorophyll_c3_in_sea_water,mg m-3,-999,,,,,,,,,,,,,,,,,,,,,,,,,,,,,,,,,,,,,,,,,,,,,,,,,,,,,,,,,,,,,,,,,,,,,,,,,
Mg_DVP,,mass_concentration_of_HPLC_Mg_2_4_divinyl_pheoporphyrin_a5_monomethyl_ester_in_sea_water,mg m-3,-999,,,,,,,,,,,,,,,,,,,,,,,,,,,,,,,,,,,,,,,,,,,,,,,,,,,,,,,,,,,,,,,,,,,,,,,,,
CPHL_c2,,mass_concentration_of_HPLC_chlorophyll_c2_in_sea_water,mg m-3,-999,,,,,,,,,,,,,,,,,,,,,,,,,,,,,,,,,,,,,,,,,,,,,,,,,,,,,,,,,,,,,,,,,,,,,,,,,
CPHL_c1,,mass_concentration_of_HPLC_chlorophyll_c1_in_sea_water,mg m-3,-999,,,,,,,,,,,,,,,,,,,,,,,,,,,,,,,,,,,,,,,,,,,,,,,,,,,,,,,,,,,,,,,,,,,,,,,,,
CPHL_c1c2,,mass_concentration_of_HPLC_chlorophyll_c1_c2_in_sea_water,mg m-3,-999,"Samples analysed prior to August 2004, Wright et al (1991) method used -chlorophyll_c1_plus_chlorophyll_c2_coelute",,,,,,,,,,,,,,,,,,,,,,,,,,,,,,,,,,,,,,,,,,,,,,,,,,,,,,,,,,,,,,,,,,,,,,,,
CPHLIDE_a,,mass_concentration_of_HPLC_chlorophyllide_a_in_sea_water,mg m-3,-999,,,,,,,,,,,,,,,,,,,,,,,,,,,,,,,,,,,,,,,,,,,,,,,,,,,,,,,,,,,,,,,,,,,,,,,,,
Phide_a,,mass_concentration_of_HPLC_Pheophorbide_a_in_sea_water,mg m-3,-999,,,,,,,,,,,,,,,,,,,,,,,,,,,,,,,,,,,,,,,,,,,,,,,,,,,,,,,,,,,,,,,,,,,,,,,,,
Perid,,mass_concentration_of_HPLC_Peridinin_in_sea_water,mg m-3,-999,,,,,,,,,,,,,,,,,,,,,,,,,,,,,,,,,,,,,,,,,,,,,,,,,,,,,,,,,,,,,,,,,,,,,,,,,
Pyrophide_a,,mass_concentration_of_HPLC_Pyropheophorbide_a_in_sea_water,mg m-3,-999,,,,,,,,,,,,,,,,,,,,,,,,,,,,,,,,,,,,,,,,,,,,,,,,,,,,,,,,,,,,,,,,,,,,,,,,,
But_fuco,,mass_concentration_of_HPLC_19-Butanoyloxyfucoxanthin_in_sea_water,mg m-3,-999,,,,,,,,,,,,,,,,,,,,,,,,,,,,,,,,,,,,,,,,,,,,,,,,,,,,,,,,,,,,,,,,,,,,,,,,,
Fuco,,mass_concentration_of_HPLC_Fucoxanthin_in_sea_water,mg m-3,-999,,,,,,,,,,,,,,,,,,,,,,,,,,,,,,,,,,,,,,,,,,,,,,,,,,,,,,,,,,,,,,,,,,,,,,,,,
Neo,,mass_concentration_of_HPLC_Neoxanthin_in_sea_water,mg m-3,-999,,,,,,,,,,,,,,,,,,,,,,,,,,,,,,,,,,,,,,,,,,,,,,,,,,,,,,,,,,,,,,,,,,,,,,,,,
Keto_Hex_fuco,,mass_concentration_of_HPLC_4- keto-19'-Hexanoyloxyfucoxanthin_in_sea_water,mg m-3,-999,,,,,,,,,,,,,,,,,,,,,,,,,,,,,,,,,,,,,,,,,,,,,,,,,,,,,,,,,,,,,,,,,,,,,,,,,
Pras,,mass_concentration_of_HPLC_Prasinoxanthin_in_sea_water,mg m-3,-999,,,,,,,,,,,,,,,,,,,,,,,,,,,,,,,,,,,,,,,,,,,,,,,,,,,,,,,,,,,,,,,,,,,,,,,,,
Viola,,mass_concentration_of_HPLC_Violaxanthin_in_sea_water,mg m-3,-999,,,,,,,,,,,,,,,,,,,,,,,,,,,,,,,,,,,,,,,,,,,,,,,,,,,,,,,,,,,,,,,,,,,,,,,,,
Hex_fuco,,mass_concentration_of_HPLC_19-Hexanoyloxyfucoxanthin_in_sea_water,mg m-3,-999,,,,,,,,,,,,,,,,,,,,,,,,,,,,,,,,,,,,,,,,,,,,,,,,,,,,,,,,,,,,,,,,,,,,,,,,,
Asta,,mass_concentration_of_HPLC_Astaxanthin_in_sea_water,mg m-3,-999,,,,,,,,,,,,,,,,,,,,,,,,,,,,,,,,,,,,,,,,,,,,,,,,,,,,,,,,,,,,,,,,,,,,,,,,,
Diadchr,,mass_concentration_of_HPLC_Diadinochrome_in_sea_water,mg m-3,-999,,,,,,,,,,,,,,,,,,,,,,,,,,,,,,,,,,,,,,,,,,,,,,,,,,,,,,,,,,,,,,,,,,,,,,,,,
Diadino,,mass_concentration_of_HPLC_Diadinoxanthin_in_sea_water,mg m-3,-999,,,,,,,,,,,,,,,,,,,,,,,,,,,,,,,,,,,,,,,,,,,,,,,,,,,,,,,,,,,,,,,,,,,,,,,,,
Dino,,mass_concentration_of_HPLC_Dinoxanthin_in_sea_water,mg m-3,-999,,,,,,,,,,,,,,,,,,,,,,,,,,,,,,,,,,,,,,,,,,,,,,,,,,,,,,,,,,,,,,,,,,,,,,,,,
Anth,,mass_concentration_of_HPLC_Antheraxanthin_in_sea_water,mg m-3,-999,,,,,,,,,,,,,,,,,,,,,,,,,,,,,,,,,,,,,,,,,,,,,,,,,,,,,,,,,,,,,,,,,,,,,,,,,
Allo,,mass_concentration_of_HPLC_Alloxanthin_in_sea_water,mg m-3,-999,,,,,,,,,,,,,,,,,,,,,,,,,,,,,,,,,,,,,,,,,,,,,,,,,,,,,,,,,,,,,,,,,,,,,,,,,
Diato,,mass_concentration_of_HPLC_Diatoxanthin_in_sea_water,mg m-3,-999,,,,,,,,,,,,,,,,,,,,,,,,,,,,,,,,,,,,,,,,,,,,,,,,,,,,,,,,,,,,,,,,,,,,,,,,,
Zea,,mass_concentration_of_HPLC_Zeaxanthin_in_sea_water,mg m-3,-999,,,,,,,,,,,,,,,,,,,,,,,,,,,,,,,,,,,,,,,,,,,,,,,,,,,,,,,,,,,,,,,,,,,,,,,,,
Lut,,mass_concentration_of_HPLC_Lutein_in_sea_water,mg m-3,-999,,,,,,,,,,,,,,,,,,,,,,,,,,,,,,,,,,,,,,,,,,,,,,,,,,,,,,,,,,,,,,,,,,,,,,,,,
Cantha,,mass_concentration_of_HPLC_canthaxanthin_in_sea_water,mg m-3,-999,,,,,,,,,,,,,,,,,,,,,,,,,,,,,,,,,,,,,,,,,,,,,,,,,,,,,,,,,,,,,,,,,,,,,,,,,
Gyro,,mass_concentration_of_HPLC_Gyroxanthin-Diester_in_sea_water,mg m-3,-999,,,,,,,,,,,,,,,,,,,,,,,,,,,,,,,,,,,,,,,,,,,,,,,,,,,,,,,,,,,,,,,,,,,,,,,,,
DV_CPHL_b,,mass_concentration_of_HPLC_Divinyl_Chorophyll_b_in_sea_water,mg m-3,-999,,,,,,,,,,,,,,,,,,,,,,,,,,,,,,,,,,,,,,,,,,,,,,,,,,,,,,,,,,,,,,,,,,,,,,,,,
CPHL_b,,mass_concentration_of_HPLC_chlorophyll_b_in_sea_water,mg m-3,-999,,,,,,,,,,,,,,,,,,,,,,,,,,,,,,,,,,,,,,,,,,,,,,,,,,,,,,,,,,,,,,,,,,,,,,,,,
DV_CPHL_b_plus_CPHL_b,,mass_concentration_of_HPLC_Divinyl_Chorophyll_b_+_chlorophyll_b_in_sea_water,mg m-3,-999,"Samples analysed prior to August 2004, Wright et al (1991) method used -Divinyl_Chlorophyll_b_plus_chlorophyll_b_coelute ",,,,,,,,,,,,,,,,,,,,,,,,,,,,,,,,,,,,,,,,,,,,,,,,,,,,,,,,,,,,,,,,,,,,,,,,
DV_CPHL_a,,mass_concentration_of_HPLC_Divinyl_Chorophyll_a_in_sea_water,mg m-3,-999,,,,,,,,,,,,,,,,,,,,,,,,,,,,,,,,,,,,,,,,,,,,,,,,,,,,,,,,,,,,,,,,,,,,,,,,,
CPHL_a,mass_concentration_of_chlorophyll_a_in_sea_water,mass_concentration_of_HPLC_chlorophyll_a_in_sea_water,mg m-3,-999,,,,,,,,,,,,,,,,,,,,,,,,,,,,,,,,,,,,,,,,,,,,,,,,,,,,,,,,,,,,,,,,,,,,,,,,,
DV_CPHL_a_plus_CPHL_a,,mass_concentration_of_HPLC_Divinyl_Chorophyll_a_+_chlorophyll_a_in_sea_water,mg m-3,-999,"Samples analysed prior to August 2004, Wright et al (1991) method used -Divinyl_Chlorophyll_a_plus_HPLC_chlorophyll_a_coelute ",,,,,,,,,,,,,,,,,,,,,,,,,,,,,,,,,,,,,,,,,,,,,,,,,,,,,,,,,,,,,,,,,,,,,,,,
Echin,,mass_concentration_of_HPLC_Echinenone_in_sea_water,mg m-3,-999,,,,,,,,,,,,,,,,,,,,,,,,,,,,,,,,,,,,,,,,,,,,,,,,,,,,,,,,,,,,,,,,,,,,,,,,,
Phytin_b,,mass_concentration_of_HPLC_Pheophytin_b_in_sea_water,mg m-3,-999,,,,,,,,,,,,,,,,,,,,,,,,,,,,,,,,,,,,,,,,,,,,,,,,,,,,,,,,,,,,,,,,,,,,,,,,,
Phytin_a,,mass_concentration_of_HPLC_Pheophytin_a_in_sea_water,mg m-3,-999,,,,,,,,,,,,,,,,,,,,,,,,,,,,,,,,,,,,,,,,,,,,,,,,,,,,,,,,,,,,,,,,,,,,,,,,,
Lyco,,mass_concentration_of_HPLC_Lycopene_in_sea_water,mg m-3,-999,,,,,,,,,,,,,,,,,,,,,,,,,,,,,,,,,,,,,,,,,,,,,,,,,,,,,,,,,,,,,,,,,,,,,,,,,
beta_epi_Car,,mass_concentration_of_HPLC_Alpha-Carotene_(Beta_epsilon-Carotene)_in_sea_water,mg m-3,-999,,,,,,,,,,,,,,,,,,,,,,,,,,,,,,,,,,,,,,,,,,,,,,,,,,,,,,,,,,,,,,,,,,,,,,,,,
beta_beta_Car,,mass_concentration_of_HPLC_Beta-Carotene_(Beta_beta-Carotene)_in_sea_water,mg m-3,-999,,,,,,,,,,,,,,,,,,,,,,,,,,,,,,,,,,,,,,,,,,,,,,,,,,,,,,,,,,,,,,,,,,,,,,,,,
alpha_beta_Car,,mass_concentration_of_HPLC_Alpha_(Beta_epsilon)_+_Beta_(Beta_beta)_Carotenes_in_sea_water,mg m-3,-999,"Samples analysed after August 2004, Heukelem and Thomas (2001) method used - Aalpha-Carotene_plus_Beta-Carotene_coelute  ",,,,,,,,,,,,,,,,,,,,,,,,,,,,,,,,,,,,,,,,,,,,,,,,,,,,,,,,,,,,,,,,,,,,,,,,
Pyrophytin_a,,mass_concentration_of_HPLC_Pyropheophytin_a_in_sea_water,mg m-3,-999,,,,,,,,,,,,,,,,,,,,,,,,,,,,,,,,,,,,,,,,,,,,,,,,,,,,,,,,,,,,,,,,,,,,,,,,,
Tot_CPHL_a,,mass_concentration_of_HPLC_DV_CPHL_a_+_MV_CPHL_a_+_Chlide_a_+_CPHL_a_allom_+_CPHL_a_prime_in_sea_water,mg m-3,-999,Data products computed from pigment concentration data,,,,,,,,,,,,,,,,,,,,,,,,,,,,,,,,,,,,,,,,,,,,,,,,,,,,,,,,,,,,,,,,,,,,,,,,
Tot_CPHL_b,,mass_concentration_of_HPLC_DV_CPHL_b_+_MV_CPHL_b_in_sea_water,mg m-3,-999,Data products computed from pigment concentration data,,,,,,,,,,,,,,,,,,,,,,,,,,,,,,,,,,,,,,,,,,,,,,,,,,,,,,,,,,,,,,,,,,,,,,,,
Tot_CPHL_c,,mass_concentration_of_HPLC_CPHL_c1_+_CPHL_c2_(CPHL_c1c2)_+_CPHL_c3_in_sea_water,mg m-3,-999,Data products computed from pigment concentration data,,,,,,,,,,,,,,,,,,,,,,,,,,,,,,,,,,,,,,,,,,,,,,,,,,,,,,,,,,,,,,,,,,,,,,,,
Tot_CPHL,,mass_concentration_of_Tot_CPHL_a_+_Tot_CPHL_b_+_Tot_CPHL_c_in_sea_water,mg m-3,-999,Data products computed from pigment concentration data,,,,,,,,,,,,,,,,,,,,,,,,,,,,,,,,,,,,,,,,,,,,,,,,,,,,,,,,,,,,,,,,,,,,,,,,
PPC,,mass_concentration_of_Photoprotective_carotenoids_(Allo_+_Diadino_+_Diato_+_Zeo_+_alpha-beta-Car)_in_sea_water,mg m-3,-999,Data products computed from pigment concentration data,,,,,,,,,,,,,,,,,,,,,,,,,,,,,,,,,,,,,,,,,,,,,,,,,,,,,,,,,,,,,,,,,,,,,,,,
PSC,,mass_concentration_of_Photosynthetic_carotenoids_(But-fuco_+_Fuco_+_Hex-fuco_+_Perid)_in_sea_water,mg m-3,-999,Data products computed from pigment concentration data,,,,,,,,,,,,,,,,,,,,,,,,,,,,,,,,,,,,,,,,,,,,,,,,,,,,,,,,,,,,,,,,,,,,,,,,
PSP,,mass_concentration_of_Photosynthetic_pigments_(PSC_+_Tchl)_in_sea_water,mg m-3,-999,Data products computed from pigment concentration data,,,,,,,,,,,,,,,,,,,,,,,,,,,,,,,,,,,,,,,,,,,,,,,,,,,,,,,,,,,,,,,,,,,,,,,,
Tacc,,mass_concentration_of_Total_accessory_pigments_(PPC_+_PSC_+_Tot_CPHL_b_+_Tot_CPHL_c)_in_sea_water,mg m-3,-999,Data products computed from pigment concentration data,,,,,,,,,,,,,,,,,,,,,,,,,,,,,,,,,,,,,,,,,,,,,,,,,,,,,,,,,,,,,,,,,,,,,,,,
Tpg,,mass_concentration_of_total_pigment_in_sea_water,mg m-3,-999,Data products computed from pigment concentration data,,,,,,,,,,,,,,,,,,,,,,,,,,,,,,,,,,,,,,,,,,,,,,,,,,,,,,,,,,,,,,,,,,,,,,,,
DP,,mass_concentration_of_Total_diagnostic_pigments_(PSC_+_Allo_+_Zea_+_Tot_CPHL_b)_in_sea_water,mg m-3,-999,Data products computed from pigment concentration data,,,,,,,,,,,,,,,,,,,,,,,,,,,,,,,,,,,,,,,,,,,,,,,,,,,,,,,,,,,,,,,,,,,,,,,,
,,,,,,,,,,,,,,,,,,,,,,,,,,,,,,,,,,,,,,,,,,,,,,,,,,,,,,,,,,,,,,,,,,,,,,,,,,,,,
,,,,,,,,,,,,,,,,,,,,,,,,,,,,,,,,,,,,,,,,,,,,,,,,,,,,,,,,,,,,,,,,,,,,,,,,,,,,,
DATA,,,,,,,,,,,,,,,,,,,,,,,,,,,,,,,,,,,,,,,,,,,,,,,,,,,,,,,,,,,,,,,,,,,,,,,,,,,,,
Time,Station_Code,Latitude,Longitude,Depth,CPHL_c3,Mg_DVP,CPHL_c2,CPHL_c1,CPHL_c1c2,CPHLIDE_a,Phide_a,Perid,Pyrophide_a,But_fuco,Fuco,Neo,Keto_Hex_fuco,Pras,Viola,Hex_fuco,Asta,Diadchr,Diadino,Dino,Anth,Allo,Diato,Zea,Lut,Cantha,Gyro,DV_CPHL_b,CPHL_b,DV_CPHL_b_plus_CPHL_b,DV_CPHL_a,CPHL_a,DV_CPHL_a_plus_CPHL_a,Echin,Phytin_b,Phytin_a,Lyco,beta_epi_Car,beta_beta_Car,alpha_beta_Car,Pyrophytin_a,Tot_CPHL_a,Tot_CPHL_b,Tot_CPHL_c,Tot_CPHL,PPC,PSC,PSP,Tacc,Tpg,DP,,,,,,,,,,,,,,,,,,,,,,
2004-08-15T01:20:00Z,FK2-02,-23.3061,150.85238333333334,0,0,0,0.012882722513089005,0,-999,0,0,0,0,0.006477732793522268,0.0347323568575233,0,0,0,0.0031436507936507935,0.009488664987405542,0,-999,0.013928318584070795,-999,0,0,0.010265714285714288,0.043803295571575696,0,0,0,0,0,-999,0,0.1907154696132597,-999,0,0,0,0,-999,-999,0.011196296296296296,0,0.1907154696132597,0,0.012882722513089005,0.2035981921263487,0.07919362473765708,0.05069875463845111,0.2542969467647998,0.1427751018891972,0.33349057150245687,0.0945020502100268,,,,,,,,,,,,,,,,,,,,,,
2004-08-15T03:30:00Z,FK2-04,-23.3061,150.85238333333334,0,0,0,0.01180086096567772,0,-999,0,0,0,0,0.004661718398560504,0.031889599053114365,0,0,0.004522622756267617,0.0025526984126984127,0.00847122865938987,0,-999,0.00692904621435595,-999,0,0,0.005381142857142858,0.038328504405538394,0,0,0,0,0.01815555555555556,-999,0,0.17325911602209948,-999,0,0,0,0,-999,-999,0.00849471193415638,0,0.17325911602209948,0.01815555555555556,0.01180086096567772,0.20321553254333277,0.05913340541119358,0.04502254611106474,0.2482380786543975,0.1341123680434916,0.3073714840655911,0.1015066060721587,,,,,,,,,,,,,,,,,,,,,,
2004-08-15T05:35:00Z,FK2-06,-23.3061,150.85238333333334,0,0,0,0.014657452006980803,0,-999,0,0,0,0,0.005716239316239315,0.036145228584110074,0.0017401129943502825,0,0.0049411066607328285,0.0034672310405643738,0.009469913238175202,0,-999,0.007460530973451327,-999,0,0,0.005880634920634921,0.04069509097150704,0,0,0,0,0.019306222222222225,-999,0,0.18542394106814,-999,0,0,0,0,-999,-999,0.009681810699588478,0,0.18542394106814,0.019306222222222225,0.014657452006980803,0.21938761529734302,0.06371806756518177,0.05133138113852459,0.2707189964358676,0.1490131229329094,0.3344370640010494,0.11133269433225385,,,,,,,,,,,,,,,,,,,,,,
2004-08-15T07:35:00Z,FK2-08,-23.3061,150.85238333333334,0,0,0,0.016292402559627692,0,-999,0.00549769696969697,0,0,0,0.0005614634877792773,0.04455854416333778,0,0,0.0032495475448746478,0.004668959435626103,0.010818303946263647,0,-999,0.013117010816125861,-999,0,0,0,0.04234905595605905,0,0,0,0,0.014806888888888892,-999,0,0.197492203806016,-999,0,0,0,0,-999,-999,0.011659012345679013,0,0.20298990077571297,0.014806888888888892,0.016292402559627692,0.23408919222422955,0.06712507911786392,0.055938311597380705,0.29002750382161024,0.1541626821637612,0.35715258293947416,0.11309425644232865,,,,,,,,,,,,,,,,,,,,,,
2004-08-15T09:35:00Z,FK2-10,-23.3061,150.85238333333334,0,0,0,0.013329563699825481,0,-999,0,0,0,0,0.005816044384465438,0.038813138038171324,0,0,0,0.004342010582010582,0.009758746151693256,0,-999,0.012590521140609637,-999,0,0,0,0.03966559102872183,0,0,0,0,0.016698,-999,0,0.17877593615715168,-999,0,0,0,0,-999,-999,0.011686460905349796,0,0.17877593615715168,0.016698,0.013329563699825481,0.20880349985697716,0.06394257307468126,0.054387928574330016,0.26319142843130716,0.14835806534883678,0.3271340015059885,0.11075151960305185,,,,,,,,,,,,,,,,,,,,,,
2004-08-15T23:35:00Z,FK2-13,-23.41685,150.8419,0,0,0,0.009892006980802793,0,-999,0,0,0,0,0.007445254161043633,0.035368752774079006,0,0,0,0.004686402116402116,0.010603946263643995,0,-999,0.014330560471976402,-999,0,0,0,0.06127648472365259,0,0,0,0,0,-999,0,0.20232799263351753,-999,0,0,0,0,-999,-999,0.015303518518518518,0,0.20232799263351753,0,0.009892006980802793,0.2122199996143203,0.09091056371414752,0.05341795319876663,0.26563795281308694,0.15422052389371693,0.35654851652723446,0.11469443792241922,,,,,,,,,,,,,,,,,,,,,,
2004-08-16T01:15:00Z,FK2-15,-23.41685,150.8419,0,0,0,0.009964397905759162,0,-999,0,0,0,0,0.008068825910931174,0.02999201065246338,0,0,0,0.004974603174603175,0.009036523929471033,0,-999,0.016342477876106196,-999,0,0,0.006822857142857143,0.06242430484037075,0,0,0,0,0,-999,0,0.1841022099447514,-999,0,0,0,0,-999,-999,0.01341574074074074,0,0.1841022099447514,0,0.009964397905759162,0.19406660785051055,0.09900538060007484,0.047097360492865586,0.24116396834337614,0.15606713899869956,0.34016934894345097,0.10952166533323635,,,,,,,,,,,,,,,,,,,,,,
2004-08-16T03:30:00Z,FK2-17,-23.41685,150.8419,0,0,0,0.009816684118673646,0,-999,0,0,0,0,0.004933753186384765,0.027834768456872314,0,0,0,0.004640564373897707,0.008978561432969493,0,-999,0.01000015732546706,-999,0,0,0,0.04573704085135599,0,0,0,0,0.015908444444444444,-999,0,0.17315039901780235,-999,0,0,0,0,-999,-999,0.010725679012345678,0,0.17315039901780235,0.015908444444444444,0.009816684118673646,0.19887552758092045,0.06646287718916873,0.04174708307622657,0.24062261065714702,0.1339350888285134,0.30708548784631573,0.10339256837202701,,,,,,,,,,,,,,,,,,,,,,
2004-08-16T05:15:00Z,FK2-19,-23.41685,150.8419,0,0,0,0.01393089005235602,0,-999,0,0,0,0,0.005134952766531715,0.03838215712383489,0,0,0.0042403204272363154,0.005217460317460318,0.011245591939546601,0,-999,0.011850442477876108,-999,0,0,0,0.049478887744593206,0,0,0,0,0.016165000000000002,-999,0,0.2072237569060774,-999,0,0,0,0,-999,-999,0.012092592592592594,0,0.2072237569060774,0.016165000000000002,0.01393089005235602,0.2373196469584334,0.07342192281506191,0.0547627018299132,0.2920823487883466,0.15828051469733112,0.3655042716034085,0.12040658957450641,,,,,,,,,,,,,,,,,,,,,,
2004-08-16T07:10:00Z,FK2-21,-23.41685,150.8419,0,0,0,0.021797905759162305,0,-999,0.03132818181818182,0,0,0,0.011374493927125508,0.08351864181091877,0,0,0,0.006577380952380953,0.012942695214105794,0,-999,0.01874203539823009,-999,0,0,0,0.05010247167868177,0,0,0,0,0,-999,0,0.27529558011049726,-999,0,0,0,0,-999,-999,0.016075,0,0.3066237619286791,0,0.021797905759162305,0.32842166768784137,0.08491950707691187,0.10783583095215007,0.4362574986399914,0.21455324378822424,0.5211770057169033,0.15793830263083186,,,,,,,,,,,,,,,,,,,,,,
2004-08-16T09:10:00Z,FK2-23,-23.41685,150.8419,0,0,0,0.011382152414194298,0,-999,0,0,0,0,0.005659499175288649,0.035947329486610446,0,0,0,0.004496225749559083,0.009548726560313461,0,-999,0.011426155358898722,-999,0,0,0,0.05020601899530839,0,0,0,0,0.013219555555555557,-999,0,0.17639435236341316,-999,0,0,0,0,-999,-999,0.012941975308641974,0,0.17639435236341316,0.013219555555555557,0.011382152414194298,0.20099606033316303,0.07457414966284909,0.05115555522221256,0.2521516155553756,0.1503314128548115,0.32672576521822466,0.1145811297730765,,,,,,,,,,,,,,,,,,,,,,
2004-08-16T11:10:00Z,FK2-25,-23.41685,150.8419,0,0,0,0.01052607329842932,0,-999,0,0,0,0,0.008539271255060729,0.035635685752330226,0,0,0,0.005000952380952382,0.009055919395465996,0,-999,0.0117270796460177,-999,0,0,0,0.06852729145211124,0,0,0,0,0,-999,0,0.1808651933701658,-999,0,0,0,0,-999,-999,0.014484444444444442,0,0.1808651933701658,0,0.01052607329842932,0.19139126666859513,0.09473881554257338,0.05323087640285695,0.24462214307145208,0.15849576524385967,0.3393609586140255,0.1217581678549682,,,,,,,,,,,,,,,,,,,,,,
2004-08-16T23:20:00Z,FK2-26,-23.417866666666665,151.0126,0,0.022766907630522092,0,0.04826945898778359,0.016928865619546252,-999,0,0,0,0,0.014019433198380567,0.15287509986684422,0,0,0.012215042278593683,0.00739851851851852,0.03053954659949622,0,-999,0.031428200589970506,-999,0,0.009843843843843847,0.009284698412698415,0.045481771369721945,0,0,0,0,0.04541533333333334,-999,0,0.5730209944751382,-999,0,0,0,0,-999,-999,0.02620308641975309,0,0.5730209944751382,0.04541533333333334,0.08796523223785194,0.7064015600463235,0.12224160063598781,0.197434079664721,0.9038356397110445,0.4530562458718941,1.0260772403470324,0.2981750282116201,,,,,,,,,,,,,,,,,,,,,,
2004-08-17T01:10:00Z,FK2-28,-23.417866666666665,151.0126,0,0.029396947791164665,0,0.045521954624781855,0.014740383944153581,-999,0,0,0,0,0.014636977058029691,0.13657185974256547,0,0,0.010965732087227415,0.0056129100529100535,0.02788698572628044,0,-999,0.03297144542772862,-999,0,0.012099339339339342,0.020578031746031747,0.050768417439066266,0,0,0,0,0.043648000000000006,-999,0,0.5589255985267036,-999,0,0,0,0,-999,-999,0.02810567901234568,0,0.5589255985267036,0.043648000000000006,0.08965928636010011,0.6922328848868038,0.14452291296451164,0.17909582252687561,0.8713287074136794,0.4569260218514874,1.015851620378191,0.28561157930528125,,,,,,,,,,,,,,,,,,,,,,
2004-08-17T03:10:00Z,FK2-30,-23.417866666666665,151.0126,0,0.015093975903614457,0,0.060251308900523555,0.02016753926701571,-999,0,0,0,0,0.009894736842105263,0.20990412782956058,0,0,0.017871829105473965,0.008847619047619049,0.02062972292191436,0,-999,0.03678318584070797,-999,0,0.020316216216216217,0.019114285714285716,0.041956745623069,0,0,0,0,0.06624000000000001,-999,0,0.6817127071823205,-999,0,0,0,0,-999,-999,0.030152777777777782,0,0.6817127071823205,0.06624000000000001,0.09551282407115373,0.8434655312534741,0.14832321117205668,0.2404285875935802,1.0838941188470543,0.5505046228367907,1.232217330019111,0.36894154943286545,,,,,,,,,,,,,,,,,,,,,,
2004-08-17T05:10:00Z,FK2-32,-23.417866666666665,151.0126,0,0.018503453815261042,0,0.06321828970331586,0.02637975567190227,-999,0,0,0,0,0.014340080971659919,0.2396042609853528,0,0,0.025106542056074765,0.009341164021164021,0.02649151973131822,0,-999,0.037855693215339235,-999,0,0.015394114114114114,0,0.05140061791967044,0,0,0,0,0.061456,-999,0,0.7406338858195212,-999,0,0,0,0,-999,-999,0.029227037037037037,0,0.7406338858195212,0.061456,0.10810149919047918,0.9101913850100003,0.13387746228616082,0.2804358616883309,1.1906272466983312,0.583870823164971,1.3245047089844921,0.40868659372211547,,,,,,,,,,,,,,,,,,,,,,
2004-08-17T07:10:00Z,FK2-34,-23.417866666666665,151.0126,0,0.033957590361445786,0,0.06752251308900525,0.018752670157068062,-999,0,0,0,0,0.02138731443994602,0.22660985352862847,0,0,0.024265420560747666,0.009851111111111113,0.0320624685138539,0,-999,0.036335575221238946,-999,0,0.02059891891891892,0,0.04386858908341916,0,0,0,0,0.07056000000000001,-999,0,0.7414817679558013,-999,0,0,0,0,-999,-999,0.03546148148148148,0,0.7414817679558013,0.07056000000000001,0.1202327736075191,0.9322745415633205,0.13626456470505852,0.2800596364824284,1.2123341780457488,0.607116974795006,1.3485987427508075,0.41508714448476647,,,,,,,,,,,,,,,,,,,,,,
2004-08-17T09:00:00Z,FK2-36,-23.417866666666665,151.0126,0,0.019561445783132528,0,0.05280628272251309,0.017506806282722512,-999,0,0,0,0,0.013599190283400809,0.17268175765645805,0,0,0.02128437917222964,0.009761904761904763,0.02594962216624685,0,-999,0.03012477876106195,-999,0,0.019845945945945947,0,0.0445427394438723,0,0,0,0,0.051914999999999996,-999,0,0.6410801104972376,-999,0,0,0,0,-999,-999,0.030880555555555557,0,0.6410801104972376,0.051914999999999996,0.08987453478836813,0.7828696452856058,0.12539401970643574,0.21223057010610571,0.9951002153917115,0.4794141246009096,1.120494235098147,0.32853425549592397,,,,,,,,,,,,,,,,,,,,,,
2004-08-17T11:07:00Z,FK2-38,-23.417866666666665,151.0126,0,0.017969477911646586,0,0.0400607329842932,0,-999,0,0,0,0,0.016284030589293747,0.1423976919662672,0,0,0.015206497552291946,0.00760952380952381,0.035291435768261964,0,-999,0.027218407079646022,-999,0,0,0,0.04573504977686235,0,0,0,0,0.03598633333333334,-999,0,0.49880589318600377,-999,0,0,0,0,-999,-999,0.026607222222222223,0,0.49880589318600377,0.03598633333333334,0.05803021089593978,0.5928224374152768,0.0995606790787306,0.19397315832382292,0.7867955957390997,0.38755038163182665,0.8863562748178304,0.2756945414340186,,,,,,,,,,,,,,,,,,,,,,
2004-08-19T00:10:00Z,FK2-43,-23.300216666666667,150.8884,0,0.005799196787148594,0,0.014473531122745784,0,-999,0,0,0,0,0.008541010646273805,0.039107856191744346,0,0,0,0,0.01580324657150854,0,-999,0.011852507374631269,-999,0,0.0033183183183183185,0.015702645502645503,0.04242705115001717,0,0,0,0,0,-999,0,0.19894413750767345,-999,0,0,0,0,-999,-999,0.010954732510288067,0,0.19894413750767345,0,0.02027272790989438,0.21921686541756782,0.08425525485590034,0.0634521134095267,0.2826689788270945,0.1679800961753214,0.36692423368299487,0.10919748287786218,,,,,,,,,,,,,,,,,,,,,,
,,,,,,,,,,,,,,,,,,,,,,,,,,,,,,,,,,,,,,,,,,,,,,,,,,,,,,,,,,,,,,,,,,,,,,,,,,,,,
,,,,,,,,,,,,,,,,,,,,,,,,,,,,,,,,,,,,,,,,,,,,,,,,,,,,,,,,,,,,,,,,,,,,,,,,,,,,,
,,,,,,,,,,,,,,,,,,,,,,,,,,,,,,,,,,,,,,,,,,,,,,,,,,,,,,,,,,,,,,,,,,,,,,,,,,,,,
,,,,,,,,,,,,,,,,,,,,,,,,,,,,,,,,,,,,,,,,,,,,,,,,,,,,,,,,,,,,,,,,,,,,,,,,,,,,,
,,,,,,,,,,,,,,,,,,,,,,,,,,,,,,,,,,,,,,,,,,,,,,,,,,,,,,,,,,,,,,,,,,,,,,,,,,,,,
,,,,,,,,,,,,,,,,,,,,,,,,,,,,,,,,,,,,,,,,,,,,,,,,,,,,,,,,,,,,,,,,,,,,,,,,,,,,,
,,,,,,,,,,,,,,,,,,,,,,,,,,,,,,,,,,,,,,,,,,,,,,,,,,,,,,,,,,,,,,,,,,,,,,,,,,,,,
,,,,,,,,,,,,,,,,,,,,,,,,,,,,,,,,,,,,,,,,,,,,,,,,,,,,,,,,,,,,,,,,,,,,,,,,,,,,,
,,,,,,,,,,,,,,,,,,,,,,,,,,,,,,,,,,,,,,,,,,,,,,,,,,,,,,,,,,,,,,,,,,,,,,,,,,,,,
,,,,,,,,,,,,,,,,,,,,,,,,,,,,,,,,,,,,,,,,,,,,,,,,,,,,,,,,,,,,,,,,,,,,,,,,,,,,,
,,,,,,,,,,,,,,,,,,,,,,,,,,,,,,,,,,,,,,,,,,,,,,,,,,,,,,,,,,,,,,,,,,,,,,,,,,,,,
,,,,,,,,,,,,,,,,,,,,,,,,,,,,,,,,,,,,,,,,,,,,,,,,,,,,,,,,,,,,,,,,,,,,,,,,,,,,,
,,,,,,,,,,,,,,,,,,,,,,,,,,,,,,,,,,,,,,,,,,,,,,,,,,,,,,,,,,,,,,,,,,,,,,,,,,,,,
,,,,,,,,,,,,,,,,,,,,,,,,,,,,,,,,,,,,,,,,,,,,,,,,,,,,,,,,,,,,,,,,,,,,,,,,,,,,,
,,,,,,,,,,,,,,,,,,,,,,,,,,,,,,,,,,,,,,,,,,,,,,,,,,,,,,,,,,,,,,,,,,,,,,,,,,,,,
,,,,,,,,,,,,,,,,,,,,,,,,,,,,,,,,,,,,,,,,,,,,,,,,,,,,,,,,,,,,,,,,,,,,,,,,,,,,,
,,,,,,,,,,,,,,,,,,,,,,,,,,,,,,,,,,,,,,,,,,,,,,,,,,,,,,,,,,,,,,,,,,,,,,,,,,,,,
,,,,,,,,,,,,,,,,,,,,,,,,,,,,,,,,,,,,,,,,,,,,,,,,,,,,,,,,,,,,,,,,,,,,,,,,,,,,,
,,,,,,,,,,,,,,,,,,,,,,,,,,,,,,,,,,,,,,,,,,,,,,,,,,,,,,,,,,,,,,,,,,,,,,,,,,,,,
,,,,,,,,,,,,,,,,,,,,,,,,,,,,,,,,,,,,,,,,,,,,,,,,,,,,,,,,,,,,,,,,,,,,,,,,,,,,,
,,,,,,,,,,,,,,,,,,,,,,,,,,,,,,,,,,,,,,,,,,,,,,,,,,,,,,,,,,,,,,,,,,,,,,,,,,,,,
,,,,,,,,,,,,,,,,,,,,,,,,,,,,,,,,,,,,,,,,,,,,,,,,,,,,,,,,,,,,,,,,,,,,,,,,,,,,,
,,,,,,,,,,,,,,,,,,,,,,,,,,,,,,,,,,,,,,,,,,,,,,,,,,,,,,,,,,,,,,,,,,,,,,,,,,,,,
,,,,,,,,,,,,,,,,,,,,,,,,,,,,,,,,,,,,,,,,,,,,,,,,,,,,,,,,,,,,,,,,,,,,,,,,,,,,,
,,,,,,,,,,,,,,,,,,,,,,,,,,,,,,,,,,,,,,,,,,,,,,,,,,,,,,,,,,,,,,,,,,,,,,,,,,,,,
,,,,,,,,,,,,,,,,,,,,,,,,,,,,,,,,,,,,,,,,,,,,,,,,,,,,,,,,,,,,,,,,,,,,,,,,,,,,,
,,,,,,,,,,,,,,,,,,,,,,,,,,,,,,,,,,,,,,,,,,,,,,,,,,,,,,,,,,,,,,,,,,,,,,,,,,,,,
,,,,,,,,,,,,,,,,,,,,,,,,,,,,,,,,,,,,,,,,,,,,,,,,,,,,,,,,,,,,,,,,,,,,,,,,,,,,,
,,,,,,,,,,,,,,,,,,,,,,,,,,,,,,,,,,,,,,,,,,,,,,,,,,,,,,,,,,,,,,,,,,,,,,,,,,,,,
,,,,,,,,,,,,,,,,,,,,,,,,,,,,,,,,,,,,,,,,,,,,,,,,,,,,,,,,,,,,,,,,,,,,,,,,,,,,,
,,,,,,,,,,,,,,,,,,,,,,,,,,,,,,,,,,,,,,,,,,,,,,,,,,,,,,,,,,,,,,,,,,,,,,,,,,,,,
,,,,,,,,,,,,,,,,,,,,,,,,,,,,,,,,,,,,,,,,,,,,,,,,,,,,,,,,,,,,,,,,,,,,,,,,,,,,,
,,,,,,,,,,,,,,,,,,,,,,,,,,,,,,,,,,,,,,,,,,,,,,,,,,,,,,,,,,,,,,,,,,,,,,,,,,,,,
,,,,,,,,,,,,,,,,,,,,,,,,,,,,,,,,,,,,,,,,,,,,,,,,,,,,,,,,,,,,,,,,,,,,,,,,,,,,,
,,,,,,,,,,,,,,,,,,,,,,,,,,,,,,,,,,,,,,,,,,,,,,,,,,,,,,,,,,,,,,,,,,,,,,,,,,,,,
,,,,,,,,,,,,,,,,,,,,,,,,,,,,,,,,,,,,,,,,,,,,,,,,,,,,,,,,,,,,,,,,,,,,,,,,,,,,,
,,,,,,,,,,,,,,,,,,,,,,,,,,,,,,,,,,,,,,,,,,,,,,,,,,,,,,,,,,,,,,,,,,,,,,,,,,,,,
,,,,,,,,,,,,,,,,,,,,,,,,,,,,,,,,,,,,,,,,,,,,,,,,,,,,,,,,,,,,,,,,,,,,,,,,,,,,,
,,,,,,,,,,,,,,,,,,,,,,,,,,,,,,,,,,,,,,,,,,,,,,,,,,,,,,,,,,,,,,,,,,,,,,,,,,,,,
,,,,,,,,,,,,,,,,,,,,,,,,,,,,,,,,,,,,,,,,,,,,,,,,,,,,,,,,,,,,,,,,,,,,,,,,,,,,,
,,,,,,,,,,,,,,,,,,,,,,,,,,,,,,,,,,,,,,,,,,,,,,,,,,,,,,,,,,,,,,,,,,,,,,,,,,,,,
,,,,,,,,,,,,,,,,,,,,,,,,,,,,,,,,,,,,,,,,,,,,,,,,,,,,,,,,,,,,,,,,,,,,,,,,,,,,,
,,,,,,,,,,,,,,,,,,,,,,,,,,,,,,,,,,,,,,,,,,,,,,,,,,,,,,,,,,,,,,,,,,,,,,,,,,,,,
,,,,,,,,,,,,,,,,,,,,,,,,,,,,,,,,,,,,,,,,,,,,,,,,,,,,,,,,,,,,,,,,,,,,,,,,,,,,,
,,,,,,,,,,,,,,,,,,,,,,,,,,,,,,,,,,,,,,,,,,,,,,,,,,,,,,,,,,,,,,,,,,,,,,,,,,,,,
,,,,,,,,,,,,,,,,,,,,,,,,,,,,,,,,,,,,,,,,,,,,,,,,,,,,,,,,,,,,,,,,,,,,,,,,,,,,,
,,,,,,,,,,,,,,,,,,,,,,,,,,,,,,,,,,,,,,,,,,,,,,,,,,,,,,,,,,,,,,,,,,,,,,,,,,,,,
,,,,,,,,,,,,,,,,,,,,,,,,,,,,,,,,,,,,,,,,,,,,,,,,,,,,,,,,,,,,,,,,,,,,,,,,,,,,,
,,,,,,,,,,,,,,,,,,,,,,,,,,,,,,,,,,,,,,,,,,,,,,,,,,,,,,,,,,,,,,,,,,,,,,,,,,,,,
,,,,,,,,,,,,,,,,,,,,,,,,,,,,,,,,,,,,,,,,,,,,,,,,,,,,,,,,,,,,,,,,,,,,,,,,,,,,,
,,,,,,,,,,,,,,,,,,,,,,,,,,,,,,,,,,,,,,,,,,,,,,,,,,,,,,,,,,,,,,,,,,,,,,,,,,,,,
,,,,,,,,,,,,,,,,,,,,,,,,,,,,,,,,,,,,,,,,,,,,,,,,,,,,,,,,,,,,,,,,,,,,,,,,,,,,,
,,,,,,,,,,,,,,,,,,,,,,,,,,,,,,,,,,,,,,,,,,,,,,,,,,,,,,,,,,,,,,,,,,,,,,,,,,,,,
,,,,,,,,,,,,,,,,,,,,,,,,,,,,,,,,,,,,,,,,,,,,,,,,,,,,,,,,,,,,,,,,,,,,,,,,,,,,,
,,,,,,,,,,,,,,,,,,,,,,,,,,,,,,,,,,,,,,,,,,,,,,,,,,,,,,,,,,,,,,,,,,,,,,,,,,,,,
,,,,,,,,,,,,,,,,,,,,,,,,,,,,,,,,,,,,,,,,,,,,,,,,,,,,,,,,,,,,,,,,,,,,,,,,,,,,,
,,,,,,,,,,,,,,,,,,,,,,,,,,,,,,,,,,,,,,,,,,,,,,,,,,,,,,,,,,,,,,,,,,,,,,,,,,,,,
,,,,,,,,,,,,,,,,,,,,,,,,,,,,,,,,,,,,,,,,,,,,,,,,,,,,,,,,,,,,,,,,,,,,,,,,,,,,,
,,,,,,,,,,,,,,,,,,,,,,,,,,,,,,,,,,,,,,,,,,,,,,,,,,,,,,,,,,,,,,,,,,,,,,,,,,,,,
,,,,,,,,,,,,,,,,,,,,,,,,,,,,,,,,,,,,,,,,,,,,,,,,,,,,,,,,,,,,,,,,,,,,,,,,,,,,,
,,,,,,,,,,,,,,,,,,,,,,,,,,,,,,,,,,,,,,,,,,,,,,,,,,,,,,,,,,,,,,,,,,,,,,,,,,,,,
,,,,,,,,,,,,,,,,,,,,,,,,,,,,,,,,,,,,,,,,,,,,,,,,,,,,,,,,,,,,,,,,,,,,,,,,,,,,,
,,,,,,,,,,,,,,,,,,,,,,,,,,,,,,,,,,,,,,,,,,,,,,,,,,,,,,,,,,,,,,,,,,,,,,,,,,,,,
,,,,,,,,,,,,,,,,,,,,,,,,,,,,,,,,,,,,,,,,,,,,,,,,,,,,,,,,,,,,,,,,,,,,,,,,,,,,,
,,,,,,,,,,,,,,,,,,,,,,,,,,,,,,,,,,,,,,,,,,,,,,,,,,,,,,,,,,,,,,,,,,,,,,,,,,,,,
,,,,,,,,,,,,,,,,,,,,,,,,,,,,,,,,,,,,,,,,,,,,,,,,,,,,,,,,,,,,,,,,,,,,,,,,,,,,,
,,,,,,,,,,,,,,,,,,,,,,,,,,,,,,,,,,,,,,,,,,,,,,,,,,,,,,,,,,,,,,,,,,,,,,,,,,,,,
,,,,,,,,,,,,,,,,,,,,,,,,,,,,,,,,,,,,,,,,,,,,,,,,,,,,,,,,,,,,,,,,,,,,,,,,,,,,,
,,,,,,,,,,,,,,,,,,,,,,,,,,,,,,,,,,,,,,,,,,,,,,,,,,,,,,,,,,,,,,,,,,,,,,,,,,,,,
,,,,,,,,,,,,,,,,,,,,,,,,,,,,,,,,,,,,,,,,,,,,,,,,,,,,,,,,,,,,,,,,,,,,,,,,,,,,,
,,,,,,,,,,,,,,,,,,,,,,,,,,,,,,,,,,,,,,,,,,,,,,,,,,,,,,,,,,,,,,,,,,,,,,,,,,,,,
,,,,,,,,,,,,,,,,,,,,,,,,,,,,,,,,,,,,,,,,,,,,,,,,,,,,,,,,,,,,,,,,,,,,,,,,,,,,,
