GLOBAL ATTRIBUTES,,,,,,,,,,,,,,,,,
title,,,,,,,,,,,,,,,,,
project,Integrated Marine Observing System (IMOS),,,,,,,,,,,,,,,,
original_project_name,MERIS validation,,,,,,,,,,,,,,,,
original_institution,CSIRO Land and Water,,,,,,,,,,,,,,,,
abstract,This record contains in situ water optical property data collected in the South Great Barrier Reef| Australia on the RSV Lady Basten between 23-28 Aug 2005. A total of 22 stations were sampled during the field campaign AA05. The data can be used for Ocean Colour sensor validation| optical water quality monitoring and modelling. CLW deployed the optical instruments TriOS RAMSES (hyperspectral irradiance)| WETLabs AC-9 (absorption and attenuation coefficicents)| HOBILabs Hydroscat-6 (backscattering coefficient) during this cruise.This data was part of the dataset described in Blondeau-Patissier et al. 2009| JGR| VOL. 114| C05003| doi:10.1029/2008JC005039. Funding for this study was provided by CSIRO Earth Observation Centre| CSIRO Land and Water| CSIRO Marine Research and the Australian Institute of Marine Sciences. We also thank the captains and crews of the RSV Lady Basten.,,,,,,,,,,,,,,,,
conventions,IMOS biological data format (v1.0),,,,,,,,,,,,,,,,
date_created,2005-08-26T06:05:17Z,,,,,,,,,,,,,,,,
date_modified,2006-02-06T22:27:00Z,,,,,,,,,,,,,,,,
history,Data has been quality controlled by in-house procedures. HS-6 data were corrected for temperature using CTD data and the Sigma correction method| recommended by the manufacturer| was applied using absorption and attenuation data from the AC-9. The Sigma correction is an adjustment to improve the accuracy of backscattering measurements| in particular in highly-attenuating water. The correction is detailed in HOBI-labs Inc.| 2003. The backscattering coefficient bb is estimated using the method described in Maffione and Dana| 1997| Applied Optics| 36(24)| pp.6057-6067.,,,,,,,,,,,,,,,,
comment,The HydroScat-6 (HS-6) is a self-contained instrument for measuring optical backscattering at six different wavelengths in natural waters. The particulate backscattering coefficient| bbp (lambda)| is a measure of light scattering by particles at angles between 90 and 180 degrees. bbp was estimated by subtracting bbw (lambda)| the backscattering coefficient of pure sea-water| from bb (lambda). The pure seawater backscattering coefficient was calculated using a backscattering ratio of 0.5 (Gordon et al.| 1988| Journal of Geophysical Research) and the seawater scattering coefficients| bw(lambda)| of Morel (1974| Optical properties of pure water and pure seawater| p. 1-24| in Optical Aspects of Oceanography).,,,,,,,,,,,,,,,,
source,Particulate Scattering coefficients determined using an HS-6 (www.hobilabs.com),,,,,,,,,,,,,,,,
keywords,Oceans>Ocean Optics > Scattering ;Oceans>Ocean Optics>Ocean Colour;,,,,,,,,,,,,,,,,
cruise_id,LB4083,,,,,,,,,,,,,,,,
vessel_name,RSV Lady Basten,,,,,,,,,,,,,,,,
platform_code,VLAB_450301529,,,,,,,,,,,,,,,,
references,https://marlin.csiro.au/geonetwork/srv/eng/catalog.search#/metadata/d3c5d7ba-b861-72d5-e043-08114f8c2cf2,,,,,,,,,,,,,,,,
naming_authority,CSIRO Land and Water (CLW),,,,,,,,,,,,,,,,
cdm_data_type,profile,,,,,,,,,,,,,,,,
geospatial_lat_min,-20.33,,,,,,,,,,,,,,,,
geospatial_lat_max,-20.33,,,,,,,,,,,,,,,,
geospatial_lon_min,148.84,,,,,,,,,,,,,,,,
geospatial_lon_max,148.84,,,,,,,,,,,,,,,,
geospatial_vertical_min,0,,,,,,,,,,,,,,,,
geospatial_vertical_max,100,,,,,,,,,,,,,,,,
local_time_zone,10,,,,,,,,,,,,,,,,
data_centre,eMarine Information Infrastructure (eMII),,,,,,,,,,,,,,,,
data_centre_email,info@emii.org.au,,,,,,,,,,,,,,,,
author,Brando Vittorio,,,,,,,,,,,,,,,,
author_email,vittorio.brando@csiro.au,,,,,,,,,,,,,,,,
principal_investigator,Furnas Miles,,,,,,,,,,,,,,,,
principal_investigator_email,m.furnas@aims.gov.au,,,,,,,,,,,,,,,,
institution,IMOS Satellite Remote Sensing - Ocean Colour Sub-facility - Bio-Optical database of Australian Waters,,,,,,,,,,,,,,,,
institution_principal_investigator,"Schroeder, Thomas",,,,,,,,,,,,,,,,
institution_principal_investigator_email,Thomas.Schroeder@csiro.au,,,,,,,,,,,,,,,,
publisher,Australian Ocean Data Network,,,,,,,,,,,,,,,,
publisher_email,info@aodn.org.au,,,,,,,,,,,,,,,,
citation,To cite this data set in a publication use the format <<IMOS [year-of-data-downloaded] [Title] [data-access-url] accessed [date-of-access]>>,,,,,,,,,,,,,,,,
acknowledgement,Data was sourced from the Commonwealth Scientific and Industrial Research Organisation (CSIRO),,,,,,,,,,,,,,,,
distribution_statement,"Any users of IMOS data are required to clearly acknowledge the source of the material- Data or products or services from IMOS are provided ""as is"" without any warranty as to fitness for a particular purpose.",,,,,,,,,,,,,,,,
,,,,,,,,,,,,,,,,,
TABLE ROWS,,,,,,,,,,,,,,,,,
Row name,CF standard_name,IMOS long_name,Units,Fill value,Comments,,,,,,,,,,,,
Wavelength,radiation_wavelength,Wavelength of measurement,nm,-999,,,,,,,,,,,,,
,,,,,,,,,,,,,,,,,
TABLE COLUMNS,,,,,,,,,,,,,,,,,
Column name,CF standard_name,IMOS long_name,Units,Fill value,Comments,,,,,,,,,,,,
Time,time,analysis_time,YYYY-MM-DDThh:mm:ssZ,,UTC date and time,,,,,,,,,,,,
Station_Code,,,,,National Reference Station code (6 letters),,,,,,,,,,,,
Latitude,latitude,latitude,degrees_north,-999,North positive,,,,,,,,,,,,
Longitude,longitude,longitude,degrees_east,-999,East positive,,,,,,,,,,,,
Depth,depth,depth,m ,-999,positive down,,,,,,,,,,,,
bb_corr,,corrected_volume_total_backwards_scattering_coefficient_of_(bbw_+_bbp)_in_sea_water,m-1,-999,bbw:volume_backwards_scattering_coefficient_of_radiative_flux_in_sea_water ; bbp=volume_backwards_scattering_coefficient_of_particules_in_sea_water,,,,,,,,,,,,
bb_uncorr,,volume_total_backwards_scattering_coefficient_of_(bbw_+_bbp)_in_sea_water,m-1,-999,bbw:volume_backwards_scattering_coefficient_of_radiative_flux_in_sea_water ; bbp=volume_backwards_scattering_coefficient_of_particules_in_sea_water,,,,,,,,,,,,
,,,,,,,,,,,,,,,,,
,,,,,,,,,,,,,,,,,
DATA,,,,,,,,,,,,,,,,,
,Time,Station_Code,Latitude,Longitude,Depth,bb_corr,bb_corr,bb_corr,bb_corr,bb_corr,bb_corr,bb_uncorr,bb_uncorr,bb_uncorr,bb_uncorr,bb_uncorr,bb_uncorr
Wavelength,,,,,,442,448,555,589,676,852,442,448,555,589,676,852
,2005-08-26T06:07:29Z,WQS012,-20.33,148.84,0,0.026473,0.023789,0.020255,0.0195,0.017627,0.015675,0.024532,0.022345,0.019163,0.018504,0.016799,0.01244
,2005-08-26T06:07:11Z,WQS012,-20.33,148.84,0.2,0.026139,0.02411,0.020554,0.020072,0.017483,0.015776,0.024224,0.022644,0.019446,0.019047,0.016661,0.01252
,2005-08-26T06:07:51Z,WQS012,-20.33,148.84,0.4,0.026748,0.024172,0.021138,0.019811,0.017605,0.016561,0.024805,0.022682,0.019995,0.018795,0.016769,0.013136
,2005-08-26T06:06:53Z,WQS012,-20.33,148.84,0.6,0.02669,0.02393,0.020722,0.019462,0.017733,0.016897,0.024762,0.022442,0.019599,0.018462,0.016885,0.013398
,2005-08-26T06:07:55Z,WQS012,-20.33,148.84,0.8,0.026955,0.024179,0.020951,0.019688,0.018058,0.016508,0.024993,0.022674,0.019809,0.018671,0.017196,0.01309
,2005-08-26T06:06:51Z,WQS012,-20.33,148.84,1,0.027355,0.023774,0.019816,0.019517,0.01778,0.016696,0.025343,0.022277,0.01872,0.018493,0.016915,0.013227
,2005-08-26T06:05:17Z,WQS012,-20.33,148.84,1.2,0.027048,0.02393,0.020954,0.019694,0.018798,0.016859,0.025036,0.022414,0.019793,0.018657,0.01788,0.013345
,2005-08-26T06:07:59Z,WQS012,-20.33,148.84,1.4,0.026644,0.024369,0.020687,0.019779,0.017778,0.016536,0.02466,0.022826,0.019543,0.018738,0.016911,0.01309
,2005-08-26T06:05:21Z,WQS012,-20.33,148.84,1.6,-999,-999,-999,-999,-999,-999,-999,-999,-999,-999,-999,-999
,2005-08-26T06:06:49Z,WQS012,-20.33,148.84,1.8,0.027719,0.024478,0.020874,0.019737,0.018369,0.016845,0.025659,0.022927,0.019712,0.018696,0.017459,0.013329
,2005-08-26T06:08:05Z,WQS012,-20.33,148.84,2,0.02707,0.024734,0.021227,0.020173,0.018643,0.017049,0.025053,0.023172,0.020059,0.019118,0.017731,0.0135
,2005-08-26T06:08:07Z,WQS012,-20.33,148.84,2.2,0.026555,0.024772,0.021746,0.019528,0.018352,0.01694,0.024566,0.023181,0.020536,0.018493,0.017437,0.013409
,2005-08-26T06:05:19Z,WQS012,-20.33,148.84,2.4,0.027609,0.024091,0.021034,0.019797,0.017866,0.016206,0.02554,0.022556,0.019858,0.018742,0.016967,0.012816
,2005-08-26T06:08:11Z,WQS012,-20.33,148.84,2.6,0.026574,0.023584,0.020708,0.020003,0.017939,0.017475,0.024609,0.022091,0.019551,0.01894,0.017049,0.013831
,2005-08-26T06:08:13Z,WQS012,-20.33,148.84,2.8,0.027302,0.024548,0.021357,0.020282,0.018059,0.016572,0.025266,0.022986,0.020156,0.019199,0.017161,0.013124
,2005-08-26T06:08:15Z,WQS012,-20.33,148.84,3,0.027616,0.024317,0.020687,0.020876,0.018142,0.016771,0.025574,0.022788,0.019559,0.019788,0.017252,0.013284
,2005-08-26T06:08:17Z,WQS012,-20.33,148.84,3.2,0.026992,0.024179,0.020855,0.019929,0.018604,0.017003,0.024993,0.022657,0.019696,0.01888,0.017692,0.013466
,2005-08-26T06:08:19Z,WQS012,-20.33,148.84,3.4,0.028254,0.023919,0.019859,0.019756,0.019644,0.016859,0.026172,0.022404,0.018752,0.018713,0.018679,0.013352
,2005-08-26T06:08:21Z,WQS012,-20.33,148.84,3.6,0.027966,0.023587,0.020223,0.019985,0.02058,0.017947,0.025882,0.022079,0.019099,0.018926,0.019564,0.014207
,2005-08-26T06:08:23Z,WQS012,-20.33,148.84,3.8,0.026905,0.024484,0.020833,0.020437,0.01783,0.01668,0.024916,0.022931,0.01968,0.019363,0.016954,0.013204
,2005-08-26T06:05:23Z,WQS012,-20.33,148.84,4,0.027297,0.024191,0.020988,0.020084,0.018801,0.016614,0.025258,0.022649,0.019833,0.019029,0.017877,0.013147
,2005-08-26T06:05:27Z,WQS012,-20.33,148.84,4.2,0.026661,0.023996,0.021216,0.02027,0.017795,0.016446,0.024668,0.02245,0.020011,0.019175,0.016902,0.012999
,2005-08-26T06:06:21Z,WQS012,-20.33,148.84,4.4,0.027164,0.024301,0.021453,0.020086,0.018635,0.016483,0.025138,0.022741,0.020237,0.019004,0.017705,0.013033
,2005-08-26T06:08:31Z,WQS012,-20.33,148.84,4.6,0.02666,0.024525,0.021648,0.020072,0.0179,0.017387,0.024685,0.022974,0.020439,0.019008,0.017019,0.013762
,2005-08-26T06:08:33Z,WQS012,-20.33,148.84,4.8,0.026958,0.024036,0.020737,0.019956,0.017762,0.018003,0.024976,0.022526,0.019599,0.018916,0.016894,0.014264
,2005-08-26T06:08:35Z,WQS012,-20.33,148.84,5,0.02772,0.024965,0.022278,0.020203,0.019559,0.01735,0.025642,0.023354,0.021028,0.019129,0.018567,0.013728
,2005-08-26T06:08:37Z,WQS012,-20.33,148.84,5.2,0.028084,0.025572,0.021268,0.020573,0.019003,0.016866,0.025976,0.023915,0.020067,0.019473,0.018045,0.013341
,2005-08-26T06:08:39Z,WQS012,-20.33,148.84,5.4,0.02734,0.024661,0.020795,0.020569,0.018643,0.017343,0.025335,0.023113,0.019664,0.019505,0.017743,0.01374
,2005-08-26T06:08:41Z,WQS012,-20.33,148.84,5.6,0.029352,0.025097,0.022223,0.020036,0.021433,0.016978,0.027155,0.023484,0.020988,0.018972,0.020374,0.013432
,2005-08-26T06:08:43Z,WQS012,-20.33,148.84,5.8,0.028312,0.025292,0.020255,0.019917,0.017515,0.018694,0.026215,0.023696,0.019139,0.018873,0.016657,0.0148
,2005-08-26T06:08:45Z,WQS012,-20.33,148.84,6,0.028144,0.023825,0.020703,0.022269,0.018213,0.017237,0.026087,0.022349,0.019583,0.021126,0.017338,0.01366
,2005-08-26T06:08:47Z,WQS012,-20.33,148.84,6.2,0.02847,0.024551,0.021542,0.021159,0.017875,0.016919,0.026292,0.022969,0.020342,0.020037,0.01698,0.013386
,2005-08-26T06:08:49Z,WQS012,-20.33,148.84,6.4,0.029454,0.025188,0.02186,0.022165,0.019918,0.017096,0.027223,0.023556,0.020616,0.020966,0.018904,0.013512
,2005-08-26T06:08:51Z,WQS012,-20.33,148.84,6.6,0.027522,0.025722,0.022724,0.021735,0.018795,0.01844,0.02548,0.024084,0.02144,0.020569,0.017864,0.014583
,2005-08-26T06:08:53Z,WQS012,-20.33,148.84,6.8,0.027546,0.024584,0.022607,0.019641,0.018239,0.017138,0.025531,0.023037,0.021375,0.018621,0.017351,0.013569
,2005-08-26T06:08:55Z,WQS012,-20.33,148.84,7,0.026955,0.025435,0.022518,0.021111,0.0187,0.017062,0.024933,0.02381,0.02127,0.020001,0.017778,0.0135
,2005-08-26T06:08:57Z,WQS012,-20.33,148.84,7.2,0.026242,0.025255,0.020937,0.021453,0.018883,0.018363,0.024241,0.023594,0.019704,0.02026,0.01792,0.014492
,2005-08-26T06:08:59Z,WQS012,-20.33,148.84,7.4,0.027587,0.024066,0.019498,0.020963,0.017339,0.01711,0.025506,0.022522,0.018405,0.019845,0.016475,0.013534
,2005-08-26T06:09:01Z,WQS012,-20.33,148.84,7.6,0.026468,0.025194,0.022307,0.020244,0.018123,0.016787,0.024515,0.023607,0.021085,0.019189,0.017235,0.013295
,2005-08-26T06:09:03Z,WQS012,-20.33,148.84,7.8,0.029101,0.026136,0.021487,0.019972,0.019616,0.015973,0.026967,0.02451,0.020302,0.018926,0.018658,0.012645
,2005-08-26T06:09:05Z,WQS012,-20.33,148.84,8,0.028977,0.024865,0.022695,0.022867,0.019032,0.017503,0.026839,0.023295,0.021432,0.021662,0.01811,0.013865
,2005-08-26T06:09:07Z,WQS012,-20.33,148.84,8.2,0.026902,0.022655,0.018337,0.01949,0.017993,0.015993,0.024899,0.021222,0.017323,0.018472,0.017114,0.012668
,2005-08-26T06:09:09Z,WQS012,-20.33,148.84,8.4,0.027048,0.026134,0.022848,0.020205,0.018308,0.017184,0.025061,0.024485,0.021577,0.019146,0.017416,0.013614
,2005-08-26T06:09:11Z,WQS012,-20.33,148.84,8.6,0.026395,0.024656,0.023327,0.020916,0.0173,0.018186,0.024421,0.023092,0.022005,0.019799,0.016454,0.014389
,2005-08-26T06:09:13Z,WQS012,-20.33,148.84,8.8,0.028108,0.02644,0.022696,0.020239,0.019169,0.017913,0.026035,0.024768,0.021464,0.019196,0.018248,0.014196
,2005-08-26T06:09:15Z,WQS012,-20.33,148.84,9,0.027518,0.024589,0.020882,0.020714,0.017817,0.016995,0.025437,0.022995,0.019704,0.0196,0.016907,0.01342
,2005-08-26T06:05:37Z,WQS012,-20.33,148.84,9.2,-999,-999,-999,-999,-999,-999,-999,-999,-999,-999,-999,-999
,2005-08-26T06:09:17Z,WQS012,-20.33,148.84,9.4,0.027309,0.024274,0.020673,0.020103,0.018426,0.01853,0.025224,0.022687,0.019478,0.019001,0.01748,0.014629
,2005-08-26T06:09:19Z,WQS012,-20.33,148.84,9.6,0.026846,0.024624,0.022781,0.020354,0.019041,0.017366,0.024856,0.023075,0.021504,0.01927,0.018089,0.01374
,2005-08-26T06:09:21Z,WQS012,-20.33,148.84,9.8,0.027181,0.024748,0.022231,0.01976,0.017405,0.01837,0.025164,0.023176,0.020988,0.018703,0.016531,0.014515
,2005-08-26T06:09:23Z,WQS012,-20.33,148.84,10,0.028237,0.024529,0.021007,0.019929,0.019714,0.017082,0.026087,0.02291,0.019809,0.018834,0.018679,0.013477
,2005-08-26T06:09:27Z,WQS012,-20.33,148.84,10.2,0.028654,0.027712,0.025415,0.021325,0.020311,0.018569,0.026454,0.025912,0.023974,0.020175,0.019288,0.014686
,2005-08-26T06:05:39Z,WQS012,-20.33,148.84,10.4,-999,-999,-999,-999,-999,-999,-999,-999,-999,-999,-999,-999
,2005-08-26T06:09:29Z,WQS012,-20.33,148.84,10.6,0.028553,0.025704,0.020666,0.021471,0.019316,0.018591,0.026352,0.024012,0.019462,0.020278,0.018317,0.014674
,2005-08-26T06:09:33Z,WQS012,-20.33,148.84,10.8,0.029395,0.026773,0.025956,0.021831,0.020656,0.018182,0.027189,0.025051,0.024499,0.020672,0.019633,0.014389
,2005-08-26T06:05:39Z,WQS012,-20.33,148.84,11,-999,-999,-999,-999,-999,-999,-999,-999,-999,-999,-999,-999
,2005-08-26T06:05:41Z,WQS012,-20.33,148.84,11.2,-999,-999,-999,-999,-999,-999,-999,-999,-999,-999,-999,-999
,2005-08-26T06:05:41Z,WQS012,-20.33,148.84,11.4,-999,-999,-999,-999,-999,-999,-999,-999,-999,-999,-999,-999
,2005-08-26T06:05:41Z,WQS012,-20.33,148.84,11.6,-999,-999,-999,-999,-999,-999,-999,-999,-999,-999,-999,-999
,2005-08-26T06:05:41Z,WQS012,-20.33,148.84,11.8,-999,-999,-999,-999,-999,-999,-999,-999,-999,-999,-999,-999
,2005-08-26T06:05:43Z,WQS012,-20.33,148.84,12,-999,-999,-999,-999,-999,-999,-999,-999,-999,-999,-999,-999
,2005-08-26T06:05:43Z,WQS012,-20.33,148.84,12.2,-999,-999,-999,-999,-999,-999,-999,-999,-999,-999,-999,-999
,2005-08-26T06:05:43Z,WQS012,-20.33,148.84,12.4,-999,-999,-999,-999,-999,-999,-999,-999,-999,-999,-999,-999
,2005-08-26T06:05:43Z,WQS012,-20.33,148.84,12.6,-999,-999,-999,-999,-999,-999,-999,-999,-999,-999,-999,-999
,2005-08-26T06:05:43Z,WQS012,-20.33,148.84,12.8,-999,-999,-999,-999,-999,-999,-999,-999,-999,-999,-999,-999
,2005-08-26T06:05:45Z,WQS012,-20.33,148.84,13,-999,-999,-999,-999,-999,-999,-999,-999,-999,-999,-999,-999
,2005-08-26T06:05:45Z,WQS012,-20.33,148.84,13.2,-999,-999,-999,-999,-999,-999,-999,-999,-999,-999,-999,-999
,2005-08-26T06:05:45Z,WQS012,-20.33,148.84,13.4,-999,-999,-999,-999,-999,-999,-999,-999,-999,-999,-999,-999
,2005-08-26T06:05:45Z,WQS012,-20.33,148.84,13.6,-999,-999,-999,-999,-999,-999,-999,-999,-999,-999,-999,-999
,2005-08-26T06:05:45Z,WQS012,-20.33,148.84,13.8,-999,-999,-999,-999,-999,-999,-999,-999,-999,-999,-999,-999
,2005-08-26T06:05:47Z,WQS012,-20.33,148.84,14,-999,-999,-999,-999,-999,-999,-999,-999,-999,-999,-999,-999
,2005-08-26T06:05:47Z,WQS012,-20.33,148.84,14.2,-999,-999,-999,-999,-999,-999,-999,-999,-999,-999,-999,-999
,2005-08-26T06:05:47Z,WQS012,-20.33,148.84,14.4,-999,-999,-999,-999,-999,-999,-999,-999,-999,-999,-999,-999
,2005-08-26T06:05:47Z,WQS012,-20.33,148.84,14.6,-999,-999,-999,-999,-999,-999,-999,-999,-999,-999,-999,-999
,2005-08-26T06:05:47Z,WQS012,-20.33,148.84,14.8,-999,-999,-999,-999,-999,-999,-999,-999,-999,-999,-999,-999
,2005-08-26T06:05:49Z,WQS012,-20.33,148.84,15,-999,-999,-999,-999,-999,-999,-999,-999,-999,-999,-999,-999
,2005-08-26T06:05:49Z,WQS012,-20.33,148.84,15.2,-999,-999,-999,-999,-999,-999,-999,-999,-999,-999,-999,-999
,2005-08-26T06:05:49Z,WQS012,-20.33,148.84,15.4,-999,-999,-999,-999,-999,-999,-999,-999,-999,-999,-999,-999
,2005-08-26T06:05:49Z,WQS012,-20.33,148.84,15.6,-999,-999,-999,-999,-999,-999,-999,-999,-999,-999,-999,-999
,2005-08-26T06:05:49Z,WQS012,-20.33,148.84,15.8,-999,-999,-999,-999,-999,-999,-999,-999,-999,-999,-999,-999
,2005-08-26T06:05:51Z,WQS012,-20.33,148.84,16,-999,-999,-999,-999,-999,-999,-999,-999,-999,-999,-999,-999
,2005-08-26T06:05:51Z,WQS012,-20.33,148.84,16.2,-999,-999,-999,-999,-999,-999,-999,-999,-999,-999,-999,-999
,2005-08-26T06:05:51Z,WQS012,-20.33,148.84,16.4,-999,-999,-999,-999,-999,-999,-999,-999,-999,-999,-999,-999
,2005-08-26T06:05:51Z,WQS012,-20.33,148.84,16.6,-999,-999,-999,-999,-999,-999,-999,-999,-999,-999,-999,-999
,2005-08-26T06:05:53Z,WQS012,-20.33,148.84,16.8,-999,-999,-999,-999,-999,-999,-999,-999,-999,-999,-999,-999
,2005-08-26T06:05:53Z,WQS012,-20.33,148.84,17,-999,-999,-999,-999,-999,-999,-999,-999,-999,-999,-999,-999
,2005-08-26T06:05:53Z,WQS012,-20.33,148.84,17.2,-999,-999,-999,-999,-999,-999,-999,-999,-999,-999,-999,-999
,2005-08-26T06:05:53Z,WQS012,-20.33,148.84,17.4,-999,-999,-999,-999,-999,-999,-999,-999,-999,-999,-999,-999
,2005-08-26T06:05:53Z,WQS012,-20.33,148.84,17.6,-999,-999,-999,-999,-999,-999,-999,-999,-999,-999,-999,-999
,2005-08-26T06:05:55Z,WQS012,-20.33,148.84,17.8,-999,-999,-999,-999,-999,-999,-999,-999,-999,-999,-999,-999
,2005-08-26T06:05:55Z,WQS012,-20.33,148.84,18,-999,-999,-999,-999,-999,-999,-999,-999,-999,-999,-999,-999
,2005-08-26T06:05:55Z,WQS012,-20.33,148.84,18.2,-999,-999,-999,-999,-999,-999,-999,-999,-999,-999,-999,-999
,2005-08-26T06:05:55Z,WQS012,-20.33,148.84,18.4,-999,-999,-999,-999,-999,-999,-999,-999,-999,-999,-999,-999
,2005-08-26T06:05:55Z,WQS012,-20.33,148.84,18.6,-999,-999,-999,-999,-999,-999,-999,-999,-999,-999,-999,-999
,2005-08-26T06:05:57Z,WQS012,-20.33,148.84,18.8,-999,-999,-999,-999,-999,-999,-999,-999,-999,-999,-999,-999
,2005-08-26T06:05:57Z,WQS012,-20.33,148.84,19,-999,-999,-999,-999,-999,-999,-999,-999,-999,-999,-999,-999
,2005-08-26T06:05:57Z,WQS012,-20.33,148.84,19.2,-999,-999,-999,-999,-999,-999,-999,-999,-999,-999,-999,-999
,2005-08-26T06:05:57Z,WQS012,-20.33,148.84,19.4,-999,-999,-999,-999,-999,-999,-999,-999,-999,-999,-999,-999
,2005-08-26T06:05:57Z,WQS012,-20.33,148.84,19.6,-999,-999,-999,-999,-999,-999,-999,-999,-999,-999,-999,-999
,2005-08-26T06:05:59Z,WQS012,-20.33,148.84,19.8,-999,-999,-999,-999,-999,-999,-999,-999,-999,-999,-999,-999
,2005-08-26T06:05:59Z,WQS012,-20.33,148.84,20,-999,-999,-999,-999,-999,-999,-999,-999,-999,-999,-999,-999
,2005-08-26T06:05:59Z,WQS012,-20.33,148.84,20.2,-999,-999,-999,-999,-999,-999,-999,-999,-999,-999,-999,-999
,2005-08-26T06:05:59Z,WQS012,-20.33,148.84,20.4,-999,-999,-999,-999,-999,-999,-999,-999,-999,-999,-999,-999
,2005-08-26T06:05:59Z,WQS012,-20.33,148.84,20.6,-999,-999,-999,-999,-999,-999,-999,-999,-999,-999,-999,-999
,2005-08-26T06:06:01Z,WQS012,-20.33,148.84,20.8,-999,-999,-999,-999,-999,-999,-999,-999,-999,-999,-999,-999
,2005-08-26T06:06:01Z,WQS012,-20.33,148.84,21,-999,-999,-999,-999,-999,-999,-999,-999,-999,-999,-999,-999
,2005-08-26T06:06:01Z,WQS012,-20.33,148.84,21.2,-999,-999,-999,-999,-999,-999,-999,-999,-999,-999,-999,-999
,2005-08-26T06:06:01Z,WQS012,-20.33,148.84,21.4,-999,-999,-999,-999,-999,-999,-999,-999,-999,-999,-999,-999
,2005-08-26T06:06:03Z,WQS012,-20.33,148.84,21.6,-999,-999,-999,-999,-999,-999,-999,-999,-999,-999,-999,-999
,2005-08-26T06:06:03Z,WQS012,-20.33,148.84,21.8,-999,-999,-999,-999,-999,-999,-999,-999,-999,-999,-999,-999
,2005-08-26T06:06:03Z,WQS012,-20.33,148.84,22,-999,-999,-999,-999,-999,-999,-999,-999,-999,-999,-999,-999
,2005-08-26T06:06:03Z,WQS012,-20.33,148.84,22.2,-999,-999,-999,-999,-999,-999,-999,-999,-999,-999,-999,-999
,2005-08-26T06:06:03Z,WQS012,-20.33,148.84,22.4,-999,-999,-999,-999,-999,-999,-999,-999,-999,-999,-999,-999
,2005-08-26T06:06:05Z,WQS012,-20.33,148.84,22.6,-999,-999,-999,-999,-999,-999,-999,-999,-999,-999,-999,-999
,2005-08-26T06:06:05Z,WQS012,-20.33,148.84,22.8,-999,-999,-999,-999,-999,-999,-999,-999,-999,-999,-999,-999
,2005-08-26T06:06:05Z,WQS012,-20.33,148.84,23,-999,-999,-999,-999,-999,-999,-999,-999,-999,-999,-999,-999
,2005-08-26T06:06:05Z,WQS012,-20.33,148.84,23.2,-999,-999,-999,-999,-999,-999,-999,-999,-999,-999,-999,-999
,2005-08-26T06:06:05Z,WQS012,-20.33,148.84,23.4,-999,-999,-999,-999,-999,-999,-999,-999,-999,-999,-999,-999
,2005-08-26T06:06:07Z,WQS012,-20.33,148.84,23.6,-999,-999,-999,-999,-999,-999,-999,-999,-999,-999,-999,-999
,2005-08-26T06:06:07Z,WQS012,-20.33,148.84,23.8,-999,-999,-999,-999,-999,-999,-999,-999,-999,-999,-999,-999
,2005-08-26T06:06:07Z,WQS012,-20.33,148.84,24,-999,-999,-999,-999,-999,-999,-999,-999,-999,-999,-999,-999
,2005-08-26T06:06:07Z,WQS012,-20.33,148.84,24.2,-999,-999,-999,-999,-999,-999,-999,-999,-999,-999,-999,-999
,2005-08-26T06:06:07Z,WQS012,-20.33,148.84,24.4,-999,-999,-999,-999,-999,-999,-999,-999,-999,-999,-999,-999
,2005-08-26T06:06:09Z,WQS012,-20.33,148.84,24.6,-999,-999,-999,-999,-999,-999,-999,-999,-999,-999,-999,-999
,2005-08-26T06:06:09Z,WQS012,-20.33,148.84,24.8,-999,-999,-999,-999,-999,-999,-999,-999,-999,-999,-999,-999
,2005-08-26T06:06:09Z,WQS012,-20.33,148.84,25,-999,-999,-999,-999,-999,-999,-999,-999,-999,-999,-999,-999
,2005-08-26T06:06:09Z,WQS012,-20.33,148.84,25.2,-999,-999,-999,-999,-999,-999,-999,-999,-999,-999,-999,-999
,2005-08-26T06:06:09Z,WQS012,-20.33,148.84,25.4,-999,-999,-999,-999,-999,-999,-999,-999,-999,-999,-999,-999
,2005-08-26T06:06:11Z,WQS012,-20.33,148.84,25.6,-999,-999,-999,-999,-999,-999,-999,-999,-999,-999,-999,-999
,2005-08-26T06:06:11Z,WQS012,-20.33,148.84,25.8,-999,-999,-999,-999,-999,-999,-999,-999,-999,-999,-999,-999
,2005-08-26T06:06:11Z,WQS012,-20.33,148.84,26,-999,-999,-999,-999,-999,-999,-999,-999,-999,-999,-999,-999
,2005-08-26T06:06:11Z,WQS012,-20.33,148.84,26.2,-999,-999,-999,-999,-999,-999,-999,-999,-999,-999,-999,-999
,2005-08-26T06:06:13Z,WQS012,-20.33,148.84,26.4,-999,-999,-999,-999,-999,-999,-999,-999,-999,-999,-999,-999
,2005-08-26T06:06:13Z,WQS012,-20.33,148.84,26.6,-999,-999,-999,-999,-999,-999,-999,-999,-999,-999,-999,-999
,2005-08-26T06:06:13Z,WQS012,-20.33,148.84,26.8,-999,-999,-999,-999,-999,-999,-999,-999,-999,-999,-999,-999
,2005-08-26T06:06:13Z,WQS012,-20.33,148.84,27,-999,-999,-999,-999,-999,-999,-999,-999,-999,-999,-999,-999
,2005-08-26T06:06:13Z,WQS012,-20.33,148.84,27.2,-999,-999,-999,-999,-999,-999,-999,-999,-999,-999,-999,-999
,2005-08-26T06:06:15Z,WQS012,-20.33,148.84,27.4,-999,-999,-999,-999,-999,-999,-999,-999,-999,-999,-999,-999
,2005-08-26T06:06:15Z,WQS012,-20.33,148.84,27.6,-999,-999,-999,-999,-999,-999,-999,-999,-999,-999,-999,-999
,2005-08-26T06:06:15Z,WQS012,-20.33,148.84,27.8,-999,-999,-999,-999,-999,-999,-999,-999,-999,-999,-999,-999
,2005-08-26T06:06:15Z,WQS012,-20.33,148.84,28,-999,-999,-999,-999,-999,-999,-999,-999,-999,-999,-999,-999
,2005-08-26T06:06:15Z,WQS012,-20.33,148.84,28.2,-999,-999,-999,-999,-999,-999,-999,-999,-999,-999,-999,-999
,2005-08-26T06:06:17Z,WQS012,-20.33,148.84,28.4,-999,-999,-999,-999,-999,-999,-999,-999,-999,-999,-999,-999
,2005-08-26T06:06:17Z,WQS012,-20.33,148.84,28.6,-999,-999,-999,-999,-999,-999,-999,-999,-999,-999,-999,-999
,2005-08-26T06:06:17Z,WQS012,-20.33,148.84,28.8,-999,-999,-999,-999,-999,-999,-999,-999,-999,-999,-999,-999
,2005-08-26T06:06:17Z,WQS012,-20.33,148.84,29,-999,-999,-999,-999,-999,-999,-999,-999,-999,-999,-999,-999
,2005-08-26T06:06:17Z,WQS012,-20.33,148.84,29.2,-999,-999,-999,-999,-999,-999,-999,-999,-999,-999,-999,-999
,2005-08-26T06:06:19Z,WQS012,-20.33,148.84,29.4,-999,-999,-999,-999,-999,-999,-999,-999,-999,-999,-999,-999
,2005-08-26T06:06:19Z,WQS012,-20.33,148.84,29.6,-999,-999,-999,-999,-999,-999,-999,-999,-999,-999,-999,-999
,2005-08-26T06:06:19Z,WQS012,-20.33,148.84,29.8,-999,-999,-999,-999,-999,-999,-999,-999,-999,-999,-999,-999
,2005-08-26T06:06:19Z,WQS012,-20.33,148.84,30,-999,-999,-999,-999,-999,-999,-999,-999,-999,-999,-999,-999
,2005-08-26T06:06:19Z,WQS012,-20.33,148.84,30.2,-999,-999,-999,-999,-999,-999,-999,-999,-999,-999,-999,-999
,2005-08-26T06:06:21Z,WQS012,-20.33,148.84,30.4,-999,-999,-999,-999,-999,-999,-999,-999,-999,-999,-999,-999
,2005-08-26T06:06:21Z,WQS012,-20.33,148.84,30.6,-999,-999,-999,-999,-999,-999,-999,-999,-999,-999,-999,-999
,2005-08-26T06:06:21Z,WQS012,-20.33,148.84,30.8,-999,-999,-999,-999,-999,-999,-999,-999,-999,-999,-999,-999
,2005-08-26T06:06:21Z,WQS012,-20.33,148.84,31,-999,-999,-999,-999,-999,-999,-999,-999,-999,-999,-999,-999
,2005-08-26T06:06:23Z,WQS012,-20.33,148.84,31.2,-999,-999,-999,-999,-999,-999,-999,-999,-999,-999,-999,-999
,2005-08-26T06:06:23Z,WQS012,-20.33,148.84,31.4,-999,-999,-999,-999,-999,-999,-999,-999,-999,-999,-999,-999
,2005-08-26T06:06:23Z,WQS012,-20.33,148.84,31.6,-999,-999,-999,-999,-999,-999,-999,-999,-999,-999,-999,-999
,2005-08-26T06:06:23Z,WQS012,-20.33,148.84,31.8,-999,-999,-999,-999,-999,-999,-999,-999,-999,-999,-999,-999
,2005-08-26T06:06:23Z,WQS012,-20.33,148.84,32,-999,-999,-999,-999,-999,-999,-999,-999,-999,-999,-999,-999
,2005-08-26T06:06:25Z,WQS012,-20.33,148.84,32.2,-999,-999,-999,-999,-999,-999,-999,-999,-999,-999,-999,-999
,2005-08-26T06:06:25Z,WQS012,-20.33,148.84,32.4,-999,-999,-999,-999,-999,-999,-999,-999,-999,-999,-999,-999
,2005-08-26T06:06:25Z,WQS012,-20.33,148.84,32.6,-999,-999,-999,-999,-999,-999,-999,-999,-999,-999,-999,-999
,2005-08-26T06:06:25Z,WQS012,-20.33,148.84,32.8,-999,-999,-999,-999,-999,-999,-999,-999,-999,-999,-999,-999
,2005-08-26T06:06:25Z,WQS012,-20.33,148.84,33,-999,-999,-999,-999,-999,-999,-999,-999,-999,-999,-999,-999
,2005-08-26T06:06:27Z,WQS012,-20.33,148.84,33.2,-999,-999,-999,-999,-999,-999,-999,-999,-999,-999,-999,-999
,2005-08-26T06:06:27Z,WQS012,-20.33,148.84,33.4,-999,-999,-999,-999,-999,-999,-999,-999,-999,-999,-999,-999
,2005-08-26T06:06:27Z,WQS012,-20.33,148.84,33.6,-999,-999,-999,-999,-999,-999,-999,-999,-999,-999,-999,-999
,2005-08-26T06:06:27Z,WQS012,-20.33,148.84,33.8,-999,-999,-999,-999,-999,-999,-999,-999,-999,-999,-999,-999
,2005-08-26T06:06:27Z,WQS012,-20.33,148.84,34,-999,-999,-999,-999,-999,-999,-999,-999,-999,-999,-999,-999
,2005-08-26T06:06:29Z,WQS012,-20.33,148.84,34.2,-999,-999,-999,-999,-999,-999,-999,-999,-999,-999,-999,-999
,2005-08-26T06:06:29Z,WQS012,-20.33,148.84,34.4,-999,-999,-999,-999,-999,-999,-999,-999,-999,-999,-999,-999
,2005-08-26T06:06:29Z,WQS012,-20.33,148.84,34.6,-999,-999,-999,-999,-999,-999,-999,-999,-999,-999,-999,-999
,2005-08-26T06:06:29Z,WQS012,-20.33,148.84,34.8,-999,-999,-999,-999,-999,-999,-999,-999,-999,-999,-999,-999
,2005-08-26T06:06:31Z,WQS012,-20.33,148.84,35,-999,-999,-999,-999,-999,-999,-999,-999,-999,-999,-999,-999
,2005-08-26T06:06:31Z,WQS012,-20.33,148.84,35.2,-999,-999,-999,-999,-999,-999,-999,-999,-999,-999,-999,-999
,2005-08-26T06:06:31Z,WQS012,-20.33,148.84,35.4,-999,-999,-999,-999,-999,-999,-999,-999,-999,-999,-999,-999
,2005-08-26T06:06:31Z,WQS012,-20.33,148.84,35.6,-999,-999,-999,-999,-999,-999,-999,-999,-999,-999,-999,-999
,2005-08-26T06:06:31Z,WQS012,-20.33,148.84,35.8,-999,-999,-999,-999,-999,-999,-999,-999,-999,-999,-999,-999
,2005-08-26T06:06:33Z,WQS012,-20.33,148.84,36,-999,-999,-999,-999,-999,-999,-999,-999,-999,-999,-999,-999
,2005-08-26T06:06:33Z,WQS012,-20.33,148.84,36.2,-999,-999,-999,-999,-999,-999,-999,-999,-999,-999,-999,-999
,2005-08-26T06:06:33Z,WQS012,-20.33,148.84,36.4,-999,-999,-999,-999,-999,-999,-999,-999,-999,-999,-999,-999
,2005-08-26T06:06:33Z,WQS012,-20.33,148.84,36.6,-999,-999,-999,-999,-999,-999,-999,-999,-999,-999,-999,-999
,2005-08-26T06:06:33Z,WQS012,-20.33,148.84,36.8,-999,-999,-999,-999,-999,-999,-999,-999,-999,-999,-999,-999
,2005-08-26T06:06:35Z,WQS012,-20.33,148.84,37,-999,-999,-999,-999,-999,-999,-999,-999,-999,-999,-999,-999
,2005-08-26T06:06:35Z,WQS012,-20.33,148.84,37.2,-999,-999,-999,-999,-999,-999,-999,-999,-999,-999,-999,-999
,2005-08-26T06:06:35Z,WQS012,-20.33,148.84,37.4,-999,-999,-999,-999,-999,-999,-999,-999,-999,-999,-999,-999
,2005-08-26T06:06:35Z,WQS012,-20.33,148.84,37.6,-999,-999,-999,-999,-999,-999,-999,-999,-999,-999,-999,-999
,2005-08-26T06:06:35Z,WQS012,-20.33,148.84,37.8,-999,-999,-999,-999,-999,-999,-999,-999,-999,-999,-999,-999
,2005-08-26T06:06:37Z,WQS012,-20.33,148.84,38,-999,-999,-999,-999,-999,-999,-999,-999,-999,-999,-999,-999
,2005-08-26T06:06:37Z,WQS012,-20.33,148.84,38.2,-999,-999,-999,-999,-999,-999,-999,-999,-999,-999,-999,-999
,2005-08-26T06:06:37Z,WQS012,-20.33,148.84,38.4,-999,-999,-999,-999,-999,-999,-999,-999,-999,-999,-999,-999
,2005-08-26T06:06:37Z,WQS012,-20.33,148.84,38.6,-999,-999,-999,-999,-999,-999,-999,-999,-999,-999,-999,-999
,2005-08-26T06:06:37Z,WQS012,-20.33,148.84,38.8,-999,-999,-999,-999,-999,-999,-999,-999,-999,-999,-999,-999
,2005-08-26T06:06:39Z,WQS012,-20.33,148.84,39,-999,-999,-999,-999,-999,-999,-999,-999,-999,-999,-999,-999
,2005-08-26T06:06:39Z,WQS012,-20.33,148.84,39.2,-999,-999,-999,-999,-999,-999,-999,-999,-999,-999,-999,-999
,2005-08-26T06:06:39Z,WQS012,-20.33,148.84,39.4,-999,-999,-999,-999,-999,-999,-999,-999,-999,-999,-999,-999
,2005-08-26T06:06:39Z,WQS012,-20.33,148.84,39.6,-999,-999,-999,-999,-999,-999,-999,-999,-999,-999,-999,-999
,2005-08-26T06:06:41Z,WQS012,-20.33,148.84,39.8,-999,-999,-999,-999,-999,-999,-999,-999,-999,-999,-999,-999
,2005-08-26T06:06:41Z,WQS012,-20.33,148.84,40,-999,-999,-999,-999,-999,-999,-999,-999,-999,-999,-999,-999
,2005-08-26T06:06:41Z,WQS012,-20.33,148.84,40.2,-999,-999,-999,-999,-999,-999,-999,-999,-999,-999,-999,-999
,2005-08-26T06:06:41Z,WQS012,-20.33,148.84,40.4,-999,-999,-999,-999,-999,-999,-999,-999,-999,-999,-999,-999
,2005-08-26T06:06:41Z,WQS012,-20.33,148.84,40.6,-999,-999,-999,-999,-999,-999,-999,-999,-999,-999,-999,-999
,2005-08-26T06:06:43Z,WQS012,-20.33,148.84,40.8,-999,-999,-999,-999,-999,-999,-999,-999,-999,-999,-999,-999
,2005-08-26T06:06:43Z,WQS012,-20.33,148.84,41,-999,-999,-999,-999,-999,-999,-999,-999,-999,-999,-999,-999
,2005-08-26T06:06:43Z,WQS012,-20.33,148.84,41.2,-999,-999,-999,-999,-999,-999,-999,-999,-999,-999,-999,-999
,2005-08-26T06:06:43Z,WQS012,-20.33,148.84,41.4,-999,-999,-999,-999,-999,-999,-999,-999,-999,-999,-999,-999
,2005-08-26T06:06:43Z,WQS012,-20.33,148.84,41.6,-999,-999,-999,-999,-999,-999,-999,-999,-999,-999,-999,-999
,2005-08-26T06:06:45Z,WQS012,-20.33,148.84,41.8,-999,-999,-999,-999,-999,-999,-999,-999,-999,-999,-999,-999
,2005-08-26T06:06:45Z,WQS012,-20.33,148.84,42,-999,-999,-999,-999,-999,-999,-999,-999,-999,-999,-999,-999
,2005-08-26T06:06:45Z,WQS012,-20.33,148.84,42.2,-999,-999,-999,-999,-999,-999,-999,-999,-999,-999,-999,-999
,2005-08-26T06:06:45Z,WQS012,-20.33,148.84,42.4,-999,-999,-999,-999,-999,-999,-999,-999,-999,-999,-999,-999
,2005-08-26T06:06:45Z,WQS012,-20.33,148.84,42.6,-999,-999,-999,-999,-999,-999,-999,-999,-999,-999,-999,-999
,2005-08-26T06:06:47Z,WQS012,-20.33,148.84,42.8,-999,-999,-999,-999,-999,-999,-999,-999,-999,-999,-999,-999
,2005-08-26T06:06:47Z,WQS012,-20.33,148.84,43,-999,-999,-999,-999,-999,-999,-999,-999,-999,-999,-999,-999
,2005-08-26T06:06:47Z,WQS012,-20.33,148.84,43.2,-999,-999,-999,-999,-999,-999,-999,-999,-999,-999,-999,-999
,2005-08-26T06:06:47Z,WQS012,-20.33,148.84,43.4,-999,-999,-999,-999,-999,-999,-999,-999,-999,-999,-999,-999
,2005-08-26T06:06:47Z,WQS012,-20.33,148.84,43.6,-999,-999,-999,-999,-999,-999,-999,-999,-999,-999,-999,-999
,2005-08-26T06:06:49Z,WQS012,-20.33,148.84,43.8,-999,-999,-999,-999,-999,-999,-999,-999,-999,-999,-999,-999
,2005-08-26T06:06:49Z,WQS012,-20.33,148.84,44,-999,-999,-999,-999,-999,-999,-999,-999,-999,-999,-999,-999
,2005-08-26T06:06:49Z,WQS012,-20.33,148.84,44.2,-999,-999,-999,-999,-999,-999,-999,-999,-999,-999,-999,-999
,2005-08-26T06:06:49Z,WQS012,-20.33,148.84,44.4,-999,-999,-999,-999,-999,-999,-999,-999,-999,-999,-999,-999
,2005-08-26T06:06:51Z,WQS012,-20.33,148.84,44.6,-999,-999,-999,-999,-999,-999,-999,-999,-999,-999,-999,-999
,2005-08-26T06:06:51Z,WQS012,-20.33,148.84,44.8,-999,-999,-999,-999,-999,-999,-999,-999,-999,-999,-999,-999
,2005-08-26T06:06:51Z,WQS012,-20.33,148.84,45,-999,-999,-999,-999,-999,-999,-999,-999,-999,-999,-999,-999
,2005-08-26T06:06:51Z,WQS012,-20.33,148.84,45.2,-999,-999,-999,-999,-999,-999,-999,-999,-999,-999,-999,-999
,2005-08-26T06:06:51Z,WQS012,-20.33,148.84,45.4,-999,-999,-999,-999,-999,-999,-999,-999,-999,-999,-999,-999
,2005-08-26T06:06:53Z,WQS012,-20.33,148.84,45.6,-999,-999,-999,-999,-999,-999,-999,-999,-999,-999,-999,-999
,2005-08-26T06:06:53Z,WQS012,-20.33,148.84,45.8,-999,-999,-999,-999,-999,-999,-999,-999,-999,-999,-999,-999
,2005-08-26T06:06:53Z,WQS012,-20.33,148.84,46,-999,-999,-999,-999,-999,-999,-999,-999,-999,-999,-999,-999
,2005-08-26T06:06:53Z,WQS012,-20.33,148.84,46.2,-999,-999,-999,-999,-999,-999,-999,-999,-999,-999,-999,-999
,2005-08-26T06:06:53Z,WQS012,-20.33,148.84,46.4,-999,-999,-999,-999,-999,-999,-999,-999,-999,-999,-999,-999
,2005-08-26T06:06:55Z,WQS012,-20.33,148.84,46.6,-999,-999,-999,-999,-999,-999,-999,-999,-999,-999,-999,-999
,2005-08-26T06:06:55Z,WQS012,-20.33,148.84,46.8,-999,-999,-999,-999,-999,-999,-999,-999,-999,-999,-999,-999
,2005-08-26T06:06:55Z,WQS012,-20.33,148.84,47,-999,-999,-999,-999,-999,-999,-999,-999,-999,-999,-999,-999
,2005-08-26T06:06:55Z,WQS012,-20.33,148.84,47.2,-999,-999,-999,-999,-999,-999,-999,-999,-999,-999,-999,-999
,2005-08-26T06:06:55Z,WQS012,-20.33,148.84,47.4,-999,-999,-999,-999,-999,-999,-999,-999,-999,-999,-999,-999
,2005-08-26T06:06:57Z,WQS012,-20.33,148.84,47.6,-999,-999,-999,-999,-999,-999,-999,-999,-999,-999,-999,-999
,2005-08-26T06:06:57Z,WQS012,-20.33,148.84,47.8,-999,-999,-999,-999,-999,-999,-999,-999,-999,-999,-999,-999
,2005-08-26T06:06:57Z,WQS012,-20.33,148.84,48,-999,-999,-999,-999,-999,-999,-999,-999,-999,-999,-999,-999
,2005-08-26T06:06:57Z,WQS012,-20.33,148.84,48.2,-999,-999,-999,-999,-999,-999,-999,-999,-999,-999,-999,-999
,2005-08-26T06:06:57Z,WQS012,-20.33,148.84,48.4,-999,-999,-999,-999,-999,-999,-999,-999,-999,-999,-999,-999
,2005-08-26T06:06:59Z,WQS012,-20.33,148.84,48.6,-999,-999,-999,-999,-999,-999,-999,-999,-999,-999,-999,-999
,2005-08-26T06:06:59Z,WQS012,-20.33,148.84,48.8,-999,-999,-999,-999,-999,-999,-999,-999,-999,-999,-999,-999
,2005-08-26T06:06:59Z,WQS012,-20.33,148.84,49,-999,-999,-999,-999,-999,-999,-999,-999,-999,-999,-999,-999
,2005-08-26T06:06:59Z,WQS012,-20.33,148.84,49.2,-999,-999,-999,-999,-999,-999,-999,-999,-999,-999,-999,-999
,2005-08-26T06:07:01Z,WQS012,-20.33,148.84,49.4,-999,-999,-999,-999,-999,-999,-999,-999,-999,-999,-999,-999
,2005-08-26T06:07:01Z,WQS012,-20.33,148.84,49.6,-999,-999,-999,-999,-999,-999,-999,-999,-999,-999,-999,-999
,2005-08-26T06:07:01Z,WQS012,-20.33,148.84,49.8,-999,-999,-999,-999,-999,-999,-999,-999,-999,-999,-999,-999
,2005-08-26T06:07:01Z,WQS012,-20.33,148.84,50,-999,-999,-999,-999,-999,-999,-999,-999,-999,-999,-999,-999
,2005-08-26T06:07:01Z,WQS012,-20.33,148.84,50.2,-999,-999,-999,-999,-999,-999,-999,-999,-999,-999,-999,-999
,2005-08-26T06:07:03Z,WQS012,-20.33,148.84,50.4,-999,-999,-999,-999,-999,-999,-999,-999,-999,-999,-999,-999
,2005-08-26T06:07:03Z,WQS012,-20.33,148.84,50.6,-999,-999,-999,-999,-999,-999,-999,-999,-999,-999,-999,-999
,2005-08-26T06:07:03Z,WQS012,-20.33,148.84,50.8,-999,-999,-999,-999,-999,-999,-999,-999,-999,-999,-999,-999
,2005-08-26T06:07:03Z,WQS012,-20.33,148.84,51,-999,-999,-999,-999,-999,-999,-999,-999,-999,-999,-999,-999
,2005-08-26T06:07:03Z,WQS012,-20.33,148.84,51.2,-999,-999,-999,-999,-999,-999,-999,-999,-999,-999,-999,-999
,2005-08-26T06:07:05Z,WQS012,-20.33,148.84,51.4,-999,-999,-999,-999,-999,-999,-999,-999,-999,-999,-999,-999
,2005-08-26T06:07:05Z,WQS012,-20.33,148.84,51.6,-999,-999,-999,-999,-999,-999,-999,-999,-999,-999,-999,-999
,2005-08-26T06:07:05Z,WQS012,-20.33,148.84,51.8,-999,-999,-999,-999,-999,-999,-999,-999,-999,-999,-999,-999
,2005-08-26T06:07:05Z,WQS012,-20.33,148.84,52,-999,-999,-999,-999,-999,-999,-999,-999,-999,-999,-999,-999
,2005-08-26T06:07:05Z,WQS012,-20.33,148.84,52.2,-999,-999,-999,-999,-999,-999,-999,-999,-999,-999,-999,-999
,2005-08-26T06:07:07Z,WQS012,-20.33,148.84,52.4,-999,-999,-999,-999,-999,-999,-999,-999,-999,-999,-999,-999
,2005-08-26T06:07:07Z,WQS012,-20.33,148.84,52.6,-999,-999,-999,-999,-999,-999,-999,-999,-999,-999,-999,-999
,2005-08-26T06:07:07Z,WQS012,-20.33,148.84,52.8,-999,-999,-999,-999,-999,-999,-999,-999,-999,-999,-999,-999
,2005-08-26T06:07:07Z,WQS012,-20.33,148.84,53,-999,-999,-999,-999,-999,-999,-999,-999,-999,-999,-999,-999
,2005-08-26T06:07:07Z,WQS012,-20.33,148.84,53.2,-999,-999,-999,-999,-999,-999,-999,-999,-999,-999,-999,-999
,2005-08-26T06:07:09Z,WQS012,-20.33,148.84,53.4,-999,-999,-999,-999,-999,-999,-999,-999,-999,-999,-999,-999
,2005-08-26T06:07:09Z,WQS012,-20.33,148.84,53.6,-999,-999,-999,-999,-999,-999,-999,-999,-999,-999,-999,-999
,2005-08-26T06:07:09Z,WQS012,-20.33,148.84,53.8,-999,-999,-999,-999,-999,-999,-999,-999,-999,-999,-999,-999
,2005-08-26T06:07:09Z,WQS012,-20.33,148.84,54,-999,-999,-999,-999,-999,-999,-999,-999,-999,-999,-999,-999
,2005-08-26T06:07:11Z,WQS012,-20.33,148.84,54.2,-999,-999,-999,-999,-999,-999,-999,-999,-999,-999,-999,-999
,2005-08-26T06:07:11Z,WQS012,-20.33,148.84,54.4,-999,-999,-999,-999,-999,-999,-999,-999,-999,-999,-999,-999
,2005-08-26T06:07:11Z,WQS012,-20.33,148.84,54.6,-999,-999,-999,-999,-999,-999,-999,-999,-999,-999,-999,-999
,2005-08-26T06:07:11Z,WQS012,-20.33,148.84,54.8,-999,-999,-999,-999,-999,-999,-999,-999,-999,-999,-999,-999
,2005-08-26T06:07:11Z,WQS012,-20.33,148.84,55,-999,-999,-999,-999,-999,-999,-999,-999,-999,-999,-999,-999
,2005-08-26T06:07:13Z,WQS012,-20.33,148.84,55.2,-999,-999,-999,-999,-999,-999,-999,-999,-999,-999,-999,-999
,2005-08-26T06:07:13Z,WQS012,-20.33,148.84,55.4,-999,-999,-999,-999,-999,-999,-999,-999,-999,-999,-999,-999
,2005-08-26T06:07:13Z,WQS012,-20.33,148.84,55.6,-999,-999,-999,-999,-999,-999,-999,-999,-999,-999,-999,-999
,2005-08-26T06:07:13Z,WQS012,-20.33,148.84,55.8,-999,-999,-999,-999,-999,-999,-999,-999,-999,-999,-999,-999
,2005-08-26T06:07:13Z,WQS012,-20.33,148.84,56,-999,-999,-999,-999,-999,-999,-999,-999,-999,-999,-999,-999
,2005-08-26T06:07:15Z,WQS012,-20.33,148.84,56.2,-999,-999,-999,-999,-999,-999,-999,-999,-999,-999,-999,-999
,2005-08-26T06:07:15Z,WQS012,-20.33,148.84,56.4,-999,-999,-999,-999,-999,-999,-999,-999,-999,-999,-999,-999
,2005-08-26T06:07:15Z,WQS012,-20.33,148.84,56.6,-999,-999,-999,-999,-999,-999,-999,-999,-999,-999,-999,-999
,2005-08-26T06:07:15Z,WQS012,-20.33,148.84,56.8,-999,-999,-999,-999,-999,-999,-999,-999,-999,-999,-999,-999
,2005-08-26T06:07:15Z,WQS012,-20.33,148.84,57,-999,-999,-999,-999,-999,-999,-999,-999,-999,-999,-999,-999
,2005-08-26T06:07:17Z,WQS012,-20.33,148.84,57.2,-999,-999,-999,-999,-999,-999,-999,-999,-999,-999,-999,-999
,2005-08-26T06:07:17Z,WQS012,-20.33,148.84,57.4,-999,-999,-999,-999,-999,-999,-999,-999,-999,-999,-999,-999
,2005-08-26T06:07:17Z,WQS012,-20.33,148.84,57.6,-999,-999,-999,-999,-999,-999,-999,-999,-999,-999,-999,-999
,2005-08-26T06:07:17Z,WQS012,-20.33,148.84,57.8,-999,-999,-999,-999,-999,-999,-999,-999,-999,-999,-999,-999
,2005-08-26T06:07:17Z,WQS012,-20.33,148.84,58,-999,-999,-999,-999,-999,-999,-999,-999,-999,-999,-999,-999
,2005-08-26T06:07:19Z,WQS012,-20.33,148.84,58.2,-999,-999,-999,-999,-999,-999,-999,-999,-999,-999,-999,-999
,2005-08-26T06:07:19Z,WQS012,-20.33,148.84,58.4,-999,-999,-999,-999,-999,-999,-999,-999,-999,-999,-999,-999
,2005-08-26T06:07:19Z,WQS012,-20.33,148.84,58.6,-999,-999,-999,-999,-999,-999,-999,-999,-999,-999,-999,-999
,2005-08-26T06:07:19Z,WQS012,-20.33,148.84,58.8,-999,-999,-999,-999,-999,-999,-999,-999,-999,-999,-999,-999
,2005-08-26T06:07:21Z,WQS012,-20.33,148.84,59,-999,-999,-999,-999,-999,-999,-999,-999,-999,-999,-999,-999
,2005-08-26T06:07:21Z,WQS012,-20.33,148.84,59.2,-999,-999,-999,-999,-999,-999,-999,-999,-999,-999,-999,-999
,2005-08-26T06:07:21Z,WQS012,-20.33,148.84,59.4,-999,-999,-999,-999,-999,-999,-999,-999,-999,-999,-999,-999
,2005-08-26T06:07:21Z,WQS012,-20.33,148.84,59.6,-999,-999,-999,-999,-999,-999,-999,-999,-999,-999,-999,-999
,2005-08-26T06:07:21Z,WQS012,-20.33,148.84,59.8,-999,-999,-999,-999,-999,-999,-999,-999,-999,-999,-999,-999
,2005-08-26T06:07:23Z,WQS012,-20.33,148.84,60,-999,-999,-999,-999,-999,-999,-999,-999,-999,-999,-999,-999
,2005-08-26T06:07:23Z,WQS012,-20.33,148.84,60.2,-999,-999,-999,-999,-999,-999,-999,-999,-999,-999,-999,-999
,2005-08-26T06:07:23Z,WQS012,-20.33,148.84,60.4,-999,-999,-999,-999,-999,-999,-999,-999,-999,-999,-999,-999
,2005-08-26T06:07:23Z,WQS012,-20.33,148.84,60.6,-999,-999,-999,-999,-999,-999,-999,-999,-999,-999,-999,-999
,2005-08-26T06:07:23Z,WQS012,-20.33,148.84,60.8,-999,-999,-999,-999,-999,-999,-999,-999,-999,-999,-999,-999
,2005-08-26T06:07:25Z,WQS012,-20.33,148.84,61,-999,-999,-999,-999,-999,-999,-999,-999,-999,-999,-999,-999
,2005-08-26T06:07:25Z,WQS012,-20.33,148.84,61.2,-999,-999,-999,-999,-999,-999,-999,-999,-999,-999,-999,-999
,2005-08-26T06:07:25Z,WQS012,-20.33,148.84,61.4,-999,-999,-999,-999,-999,-999,-999,-999,-999,-999,-999,-999
,2005-08-26T06:07:25Z,WQS012,-20.33,148.84,61.6,-999,-999,-999,-999,-999,-999,-999,-999,-999,-999,-999,-999
,2005-08-26T06:07:25Z,WQS012,-20.33,148.84,61.8,-999,-999,-999,-999,-999,-999,-999,-999,-999,-999,-999,-999
,2005-08-26T06:07:27Z,WQS012,-20.33,148.84,62,-999,-999,-999,-999,-999,-999,-999,-999,-999,-999,-999,-999
,2005-08-26T06:07:27Z,WQS012,-20.33,148.84,62.2,-999,-999,-999,-999,-999,-999,-999,-999,-999,-999,-999,-999
,2005-08-26T06:07:27Z,WQS012,-20.33,148.84,62.4,-999,-999,-999,-999,-999,-999,-999,-999,-999,-999,-999,-999
,2005-08-26T06:07:27Z,WQS012,-20.33,148.84,62.6,-999,-999,-999,-999,-999,-999,-999,-999,-999,-999,-999,-999
,2005-08-26T06:07:27Z,WQS012,-20.33,148.84,62.8,-999,-999,-999,-999,-999,-999,-999,-999,-999,-999,-999,-999
,2005-08-26T06:07:29Z,WQS012,-20.33,148.84,63,-999,-999,-999,-999,-999,-999,-999,-999,-999,-999,-999,-999
,2005-08-26T06:07:29Z,WQS012,-20.33,148.84,63.2,-999,-999,-999,-999,-999,-999,-999,-999,-999,-999,-999,-999
,2005-08-26T06:07:29Z,WQS012,-20.33,148.84,63.4,-999,-999,-999,-999,-999,-999,-999,-999,-999,-999,-999,-999
,2005-08-26T06:07:29Z,WQS012,-20.33,148.84,63.6,-999,-999,-999,-999,-999,-999,-999,-999,-999,-999,-999,-999
,2005-08-26T06:07:31Z,WQS012,-20.33,148.84,63.8,-999,-999,-999,-999,-999,-999,-999,-999,-999,-999,-999,-999
,2005-08-26T06:07:31Z,WQS012,-20.33,148.84,64,-999,-999,-999,-999,-999,-999,-999,-999,-999,-999,-999,-999
,2005-08-26T06:07:31Z,WQS012,-20.33,148.84,64.2,-999,-999,-999,-999,-999,-999,-999,-999,-999,-999,-999,-999
,2005-08-26T06:07:31Z,WQS012,-20.33,148.84,64.4,-999,-999,-999,-999,-999,-999,-999,-999,-999,-999,-999,-999
,2005-08-26T06:07:31Z,WQS012,-20.33,148.84,64.6,-999,-999,-999,-999,-999,-999,-999,-999,-999,-999,-999,-999
,2005-08-26T06:07:33Z,WQS012,-20.33,148.84,64.8,-999,-999,-999,-999,-999,-999,-999,-999,-999,-999,-999,-999
,2005-08-26T06:07:33Z,WQS012,-20.33,148.84,65,-999,-999,-999,-999,-999,-999,-999,-999,-999,-999,-999,-999
,2005-08-26T06:07:33Z,WQS012,-20.33,148.84,65.2,-999,-999,-999,-999,-999,-999,-999,-999,-999,-999,-999,-999
,2005-08-26T06:07:33Z,WQS012,-20.33,148.84,65.4,-999,-999,-999,-999,-999,-999,-999,-999,-999,-999,-999,-999
,2005-08-26T06:07:33Z,WQS012,-20.33,148.84,65.6,-999,-999,-999,-999,-999,-999,-999,-999,-999,-999,-999,-999
,2005-08-26T06:07:35Z,WQS012,-20.33,148.84,65.8,-999,-999,-999,-999,-999,-999,-999,-999,-999,-999,-999,-999
,2005-08-26T06:07:35Z,WQS012,-20.33,148.84,66,-999,-999,-999,-999,-999,-999,-999,-999,-999,-999,-999,-999
,2005-08-26T06:07:35Z,WQS012,-20.33,148.84,66.2,-999,-999,-999,-999,-999,-999,-999,-999,-999,-999,-999,-999
,2005-08-26T06:07:35Z,WQS012,-20.33,148.84,66.4,-999,-999,-999,-999,-999,-999,-999,-999,-999,-999,-999,-999
,2005-08-26T06:07:35Z,WQS012,-20.33,148.84,66.6,-999,-999,-999,-999,-999,-999,-999,-999,-999,-999,-999,-999
,2005-08-26T06:07:37Z,WQS012,-20.33,148.84,66.8,-999,-999,-999,-999,-999,-999,-999,-999,-999,-999,-999,-999
,2005-08-26T06:07:37Z,WQS012,-20.33,148.84,67,-999,-999,-999,-999,-999,-999,-999,-999,-999,-999,-999,-999
,2005-08-26T06:07:37Z,WQS012,-20.33,148.84,67.2,-999,-999,-999,-999,-999,-999,-999,-999,-999,-999,-999,-999
,2005-08-26T06:07:37Z,WQS012,-20.33,148.84,67.4,-999,-999,-999,-999,-999,-999,-999,-999,-999,-999,-999,-999
,2005-08-26T06:07:39Z,WQS012,-20.33,148.84,67.6,-999,-999,-999,-999,-999,-999,-999,-999,-999,-999,-999,-999
,2005-08-26T06:07:39Z,WQS012,-20.33,148.84,67.8,-999,-999,-999,-999,-999,-999,-999,-999,-999,-999,-999,-999
,2005-08-26T06:07:39Z,WQS012,-20.33,148.84,68,-999,-999,-999,-999,-999,-999,-999,-999,-999,-999,-999,-999
,2005-08-26T06:07:39Z,WQS012,-20.33,148.84,68.2,-999,-999,-999,-999,-999,-999,-999,-999,-999,-999,-999,-999
,2005-08-26T06:07:39Z,WQS012,-20.33,148.84,68.4,-999,-999,-999,-999,-999,-999,-999,-999,-999,-999,-999,-999
,2005-08-26T06:07:41Z,WQS012,-20.33,148.84,68.6,-999,-999,-999,-999,-999,-999,-999,-999,-999,-999,-999,-999
,2005-08-26T06:07:41Z,WQS012,-20.33,148.84,68.8,-999,-999,-999,-999,-999,-999,-999,-999,-999,-999,-999,-999
,2005-08-26T06:07:41Z,WQS012,-20.33,148.84,69,-999,-999,-999,-999,-999,-999,-999,-999,-999,-999,-999,-999
,2005-08-26T06:07:41Z,WQS012,-20.33,148.84,69.2,-999,-999,-999,-999,-999,-999,-999,-999,-999,-999,-999,-999
,2005-08-26T06:07:41Z,WQS012,-20.33,148.84,69.4,-999,-999,-999,-999,-999,-999,-999,-999,-999,-999,-999,-999
,2005-08-26T06:07:43Z,WQS012,-20.33,148.84,69.6,-999,-999,-999,-999,-999,-999,-999,-999,-999,-999,-999,-999
,2005-08-26T06:07:43Z,WQS012,-20.33,148.84,69.8,-999,-999,-999,-999,-999,-999,-999,-999,-999,-999,-999,-999
,2005-08-26T06:07:43Z,WQS012,-20.33,148.84,70,-999,-999,-999,-999,-999,-999,-999,-999,-999,-999,-999,-999
,2005-08-26T06:07:43Z,WQS012,-20.33,148.84,70.2,-999,-999,-999,-999,-999,-999,-999,-999,-999,-999,-999,-999
,2005-08-26T06:07:43Z,WQS012,-20.33,148.84,70.4,-999,-999,-999,-999,-999,-999,-999,-999,-999,-999,-999,-999
,2005-08-26T06:07:45Z,WQS012,-20.33,148.84,70.6,-999,-999,-999,-999,-999,-999,-999,-999,-999,-999,-999,-999
,2005-08-26T06:07:45Z,WQS012,-20.33,148.84,70.8,-999,-999,-999,-999,-999,-999,-999,-999,-999,-999,-999,-999
,2005-08-26T06:07:45Z,WQS012,-20.33,148.84,71,-999,-999,-999,-999,-999,-999,-999,-999,-999,-999,-999,-999
,2005-08-26T06:07:45Z,WQS012,-20.33,148.84,71.2,-999,-999,-999,-999,-999,-999,-999,-999,-999,-999,-999,-999
,2005-08-26T06:07:45Z,WQS012,-20.33,148.84,71.4,-999,-999,-999,-999,-999,-999,-999,-999,-999,-999,-999,-999
,2005-08-26T06:07:47Z,WQS012,-20.33,148.84,71.6,-999,-999,-999,-999,-999,-999,-999,-999,-999,-999,-999,-999
,2005-08-26T06:07:47Z,WQS012,-20.33,148.84,71.8,-999,-999,-999,-999,-999,-999,-999,-999,-999,-999,-999,-999
,2005-08-26T06:07:47Z,WQS012,-20.33,148.84,72,-999,-999,-999,-999,-999,-999,-999,-999,-999,-999,-999,-999
,2005-08-26T06:07:47Z,WQS012,-20.33,148.84,72.2,-999,-999,-999,-999,-999,-999,-999,-999,-999,-999,-999,-999
,2005-08-26T06:07:49Z,WQS012,-20.33,148.84,72.4,-999,-999,-999,-999,-999,-999,-999,-999,-999,-999,-999,-999
,2005-08-26T06:07:49Z,WQS012,-20.33,148.84,72.6,-999,-999,-999,-999,-999,-999,-999,-999,-999,-999,-999,-999
,2005-08-26T06:07:49Z,WQS012,-20.33,148.84,72.8,-999,-999,-999,-999,-999,-999,-999,-999,-999,-999,-999,-999
,2005-08-26T06:07:49Z,WQS012,-20.33,148.84,73,-999,-999,-999,-999,-999,-999,-999,-999,-999,-999,-999,-999
,2005-08-26T06:07:49Z,WQS012,-20.33,148.84,73.2,-999,-999,-999,-999,-999,-999,-999,-999,-999,-999,-999,-999
,2005-08-26T06:07:51Z,WQS012,-20.33,148.84,73.4,-999,-999,-999,-999,-999,-999,-999,-999,-999,-999,-999,-999
,2005-08-26T06:07:51Z,WQS012,-20.33,148.84,73.6,-999,-999,-999,-999,-999,-999,-999,-999,-999,-999,-999,-999
,2005-08-26T06:07:51Z,WQS012,-20.33,148.84,73.8,-999,-999,-999,-999,-999,-999,-999,-999,-999,-999,-999,-999
,2005-08-26T06:07:51Z,WQS012,-20.33,148.84,74,-999,-999,-999,-999,-999,-999,-999,-999,-999,-999,-999,-999
,2005-08-26T06:07:51Z,WQS012,-20.33,148.84,74.2,-999,-999,-999,-999,-999,-999,-999,-999,-999,-999,-999,-999
,2005-08-26T06:07:53Z,WQS012,-20.33,148.84,74.4,-999,-999,-999,-999,-999,-999,-999,-999,-999,-999,-999,-999
,2005-08-26T06:07:53Z,WQS012,-20.33,148.84,74.6,-999,-999,-999,-999,-999,-999,-999,-999,-999,-999,-999,-999
,2005-08-26T06:07:53Z,WQS012,-20.33,148.84,74.8,-999,-999,-999,-999,-999,-999,-999,-999,-999,-999,-999,-999
,2005-08-26T06:07:53Z,WQS012,-20.33,148.84,75,-999,-999,-999,-999,-999,-999,-999,-999,-999,-999,-999,-999
,2005-08-26T06:07:53Z,WQS012,-20.33,148.84,75.2,-999,-999,-999,-999,-999,-999,-999,-999,-999,-999,-999,-999
,2005-08-26T06:07:55Z,WQS012,-20.33,148.84,75.4,-999,-999,-999,-999,-999,-999,-999,-999,-999,-999,-999,-999
,2005-08-26T06:07:55Z,WQS012,-20.33,148.84,75.6,-999,-999,-999,-999,-999,-999,-999,-999,-999,-999,-999,-999
,2005-08-26T06:07:55Z,WQS012,-20.33,148.84,75.8,-999,-999,-999,-999,-999,-999,-999,-999,-999,-999,-999,-999
,2005-08-26T06:07:55Z,WQS012,-20.33,148.84,76,-999,-999,-999,-999,-999,-999,-999,-999,-999,-999,-999,-999
,2005-08-26T06:07:55Z,WQS012,-20.33,148.84,76.2,-999,-999,-999,-999,-999,-999,-999,-999,-999,-999,-999,-999
,2005-08-26T06:07:57Z,WQS012,-20.33,148.84,76.4,-999,-999,-999,-999,-999,-999,-999,-999,-999,-999,-999,-999
,2005-08-26T06:07:57Z,WQS012,-20.33,148.84,76.6,-999,-999,-999,-999,-999,-999,-999,-999,-999,-999,-999,-999
,2005-08-26T06:07:57Z,WQS012,-20.33,148.84,76.8,-999,-999,-999,-999,-999,-999,-999,-999,-999,-999,-999,-999
,2005-08-26T06:07:57Z,WQS012,-20.33,148.84,77,-999,-999,-999,-999,-999,-999,-999,-999,-999,-999,-999,-999
,2005-08-26T06:07:59Z,WQS012,-20.33,148.84,77.2,-999,-999,-999,-999,-999,-999,-999,-999,-999,-999,-999,-999
,2005-08-26T06:07:59Z,WQS012,-20.33,148.84,77.4,-999,-999,-999,-999,-999,-999,-999,-999,-999,-999,-999,-999
,2005-08-26T06:07:59Z,WQS012,-20.33,148.84,77.6,-999,-999,-999,-999,-999,-999,-999,-999,-999,-999,-999,-999
,2005-08-26T06:07:59Z,WQS012,-20.33,148.84,77.8,-999,-999,-999,-999,-999,-999,-999,-999,-999,-999,-999,-999
,2005-08-26T06:07:59Z,WQS012,-20.33,148.84,78,-999,-999,-999,-999,-999,-999,-999,-999,-999,-999,-999,-999
,2005-08-26T06:08:01Z,WQS012,-20.33,148.84,78.2,-999,-999,-999,-999,-999,-999,-999,-999,-999,-999,-999,-999
,2005-08-26T06:08:01Z,WQS012,-20.33,148.84,78.4,-999,-999,-999,-999,-999,-999,-999,-999,-999,-999,-999,-999
,2005-08-26T06:08:01Z,WQS012,-20.33,148.84,78.6,-999,-999,-999,-999,-999,-999,-999,-999,-999,-999,-999,-999
,2005-08-26T06:08:01Z,WQS012,-20.33,148.84,78.8,-999,-999,-999,-999,-999,-999,-999,-999,-999,-999,-999,-999
,2005-08-26T06:08:01Z,WQS012,-20.33,148.84,79,-999,-999,-999,-999,-999,-999,-999,-999,-999,-999,-999,-999
,2005-08-26T06:08:03Z,WQS012,-20.33,148.84,79.2,-999,-999,-999,-999,-999,-999,-999,-999,-999,-999,-999,-999
,2005-08-26T06:08:03Z,WQS012,-20.33,148.84,79.4,-999,-999,-999,-999,-999,-999,-999,-999,-999,-999,-999,-999
,2005-08-26T06:08:03Z,WQS012,-20.33,148.84,79.6,-999,-999,-999,-999,-999,-999,-999,-999,-999,-999,-999,-999
,2005-08-26T06:08:03Z,WQS012,-20.33,148.84,79.8,-999,-999,-999,-999,-999,-999,-999,-999,-999,-999,-999,-999
,2005-08-26T06:08:03Z,WQS012,-20.33,148.84,80,-999,-999,-999,-999,-999,-999,-999,-999,-999,-999,-999,-999
,2005-08-26T06:08:05Z,WQS012,-20.33,148.84,80.2,-999,-999,-999,-999,-999,-999,-999,-999,-999,-999,-999,-999
,2005-08-26T06:08:05Z,WQS012,-20.33,148.84,80.4,-999,-999,-999,-999,-999,-999,-999,-999,-999,-999,-999,-999
,2005-08-26T06:08:05Z,WQS012,-20.33,148.84,80.6,-999,-999,-999,-999,-999,-999,-999,-999,-999,-999,-999,-999
,2005-08-26T06:08:05Z,WQS012,-20.33,148.84,80.8,-999,-999,-999,-999,-999,-999,-999,-999,-999,-999,-999,-999
,2005-08-26T06:08:05Z,WQS012,-20.33,148.84,81,-999,-999,-999,-999,-999,-999,-999,-999,-999,-999,-999,-999
,2005-08-26T06:08:07Z,WQS012,-20.33,148.84,81.2,-999,-999,-999,-999,-999,-999,-999,-999,-999,-999,-999,-999
,2005-08-26T06:08:07Z,WQS012,-20.33,148.84,81.4,-999,-999,-999,-999,-999,-999,-999,-999,-999,-999,-999,-999
,2005-08-26T06:08:07Z,WQS012,-20.33,148.84,81.6,-999,-999,-999,-999,-999,-999,-999,-999,-999,-999,-999,-999
,2005-08-26T06:08:07Z,WQS012,-20.33,148.84,81.8,-999,-999,-999,-999,-999,-999,-999,-999,-999,-999,-999,-999
,2005-08-26T06:08:09Z,WQS012,-20.33,148.84,82,-999,-999,-999,-999,-999,-999,-999,-999,-999,-999,-999,-999
,2005-08-26T06:08:09Z,WQS012,-20.33,148.84,82.2,-999,-999,-999,-999,-999,-999,-999,-999,-999,-999,-999,-999
,2005-08-26T06:08:09Z,WQS012,-20.33,148.84,82.4,-999,-999,-999,-999,-999,-999,-999,-999,-999,-999,-999,-999
,2005-08-26T06:08:09Z,WQS012,-20.33,148.84,82.6,-999,-999,-999,-999,-999,-999,-999,-999,-999,-999,-999,-999
,2005-08-26T06:08:09Z,WQS012,-20.33,148.84,82.8,-999,-999,-999,-999,-999,-999,-999,-999,-999,-999,-999,-999
,2005-08-26T06:08:11Z,WQS012,-20.33,148.84,83,-999,-999,-999,-999,-999,-999,-999,-999,-999,-999,-999,-999
,2005-08-26T06:08:11Z,WQS012,-20.33,148.84,83.2,-999,-999,-999,-999,-999,-999,-999,-999,-999,-999,-999,-999
,2005-08-26T06:08:11Z,WQS012,-20.33,148.84,83.4,-999,-999,-999,-999,-999,-999,-999,-999,-999,-999,-999,-999
,2005-08-26T06:08:11Z,WQS012,-20.33,148.84,83.6,-999,-999,-999,-999,-999,-999,-999,-999,-999,-999,-999,-999
,2005-08-26T06:08:11Z,WQS012,-20.33,148.84,83.8,-999,-999,-999,-999,-999,-999,-999,-999,-999,-999,-999,-999
,2005-08-26T06:08:13Z,WQS012,-20.33,148.84,84,-999,-999,-999,-999,-999,-999,-999,-999,-999,-999,-999,-999
,2005-08-26T06:08:13Z,WQS012,-20.33,148.84,84.2,-999,-999,-999,-999,-999,-999,-999,-999,-999,-999,-999,-999
,2005-08-26T06:08:13Z,WQS012,-20.33,148.84,84.4,-999,-999,-999,-999,-999,-999,-999,-999,-999,-999,-999,-999
,2005-08-26T06:08:13Z,WQS012,-20.33,148.84,84.6,-999,-999,-999,-999,-999,-999,-999,-999,-999,-999,-999,-999
,2005-08-26T06:08:13Z,WQS012,-20.33,148.84,84.8,-999,-999,-999,-999,-999,-999,-999,-999,-999,-999,-999,-999
,2005-08-26T06:08:15Z,WQS012,-20.33,148.84,85,-999,-999,-999,-999,-999,-999,-999,-999,-999,-999,-999,-999
,2005-08-26T06:08:15Z,WQS012,-20.33,148.84,85.2,-999,-999,-999,-999,-999,-999,-999,-999,-999,-999,-999,-999
,2005-08-26T06:08:15Z,WQS012,-20.33,148.84,85.4,-999,-999,-999,-999,-999,-999,-999,-999,-999,-999,-999,-999
,2005-08-26T06:08:15Z,WQS012,-20.33,148.84,85.6,-999,-999,-999,-999,-999,-999,-999,-999,-999,-999,-999,-999
,2005-08-26T06:08:15Z,WQS012,-20.33,148.84,85.8,-999,-999,-999,-999,-999,-999,-999,-999,-999,-999,-999,-999
,2005-08-26T06:08:17Z,WQS012,-20.33,148.84,86,-999,-999,-999,-999,-999,-999,-999,-999,-999,-999,-999,-999
,2005-08-26T06:08:17Z,WQS012,-20.33,148.84,86.2,-999,-999,-999,-999,-999,-999,-999,-999,-999,-999,-999,-999
,2005-08-26T06:08:17Z,WQS012,-20.33,148.84,86.4,-999,-999,-999,-999,-999,-999,-999,-999,-999,-999,-999,-999
,2005-08-26T06:08:17Z,WQS012,-20.33,148.84,86.6,-999,-999,-999,-999,-999,-999,-999,-999,-999,-999,-999,-999
,2005-08-26T06:08:19Z,WQS012,-20.33,148.84,86.8,-999,-999,-999,-999,-999,-999,-999,-999,-999,-999,-999,-999
,2005-08-26T06:08:19Z,WQS012,-20.33,148.84,87,-999,-999,-999,-999,-999,-999,-999,-999,-999,-999,-999,-999
,2005-08-26T06:08:19Z,WQS012,-20.33,148.84,87.2,-999,-999,-999,-999,-999,-999,-999,-999,-999,-999,-999,-999
,2005-08-26T06:08:19Z,WQS012,-20.33,148.84,87.4,-999,-999,-999,-999,-999,-999,-999,-999,-999,-999,-999,-999
,2005-08-26T06:08:19Z,WQS012,-20.33,148.84,87.6,-999,-999,-999,-999,-999,-999,-999,-999,-999,-999,-999,-999
,2005-08-26T06:08:21Z,WQS012,-20.33,148.84,87.8,-999,-999,-999,-999,-999,-999,-999,-999,-999,-999,-999,-999
,2005-08-26T06:08:21Z,WQS012,-20.33,148.84,88,-999,-999,-999,-999,-999,-999,-999,-999,-999,-999,-999,-999
,2005-08-26T06:08:21Z,WQS012,-20.33,148.84,88.2,-999,-999,-999,-999,-999,-999,-999,-999,-999,-999,-999,-999
,2005-08-26T06:08:21Z,WQS012,-20.33,148.84,88.4,-999,-999,-999,-999,-999,-999,-999,-999,-999,-999,-999,-999
,2005-08-26T06:08:21Z,WQS012,-20.33,148.84,88.6,-999,-999,-999,-999,-999,-999,-999,-999,-999,-999,-999,-999
,2005-08-26T06:08:23Z,WQS012,-20.33,148.84,88.8,-999,-999,-999,-999,-999,-999,-999,-999,-999,-999,-999,-999
,2005-08-26T06:08:23Z,WQS012,-20.33,148.84,89,-999,-999,-999,-999,-999,-999,-999,-999,-999,-999,-999,-999
,2005-08-26T06:08:23Z,WQS012,-20.33,148.84,89.2,-999,-999,-999,-999,-999,-999,-999,-999,-999,-999,-999,-999
,2005-08-26T06:08:23Z,WQS012,-20.33,148.84,89.4,-999,-999,-999,-999,-999,-999,-999,-999,-999,-999,-999,-999
,2005-08-26T06:08:23Z,WQS012,-20.33,148.84,89.6,-999,-999,-999,-999,-999,-999,-999,-999,-999,-999,-999,-999
,2005-08-26T06:08:25Z,WQS012,-20.33,148.84,89.8,-999,-999,-999,-999,-999,-999,-999,-999,-999,-999,-999,-999
,2005-08-26T06:08:25Z,WQS012,-20.33,148.84,90,-999,-999,-999,-999,-999,-999,-999,-999,-999,-999,-999,-999
,2005-08-26T06:08:25Z,WQS012,-20.33,148.84,90.2,-999,-999,-999,-999,-999,-999,-999,-999,-999,-999,-999,-999
,2005-08-26T06:08:25Z,WQS012,-20.33,148.84,90.4,-999,-999,-999,-999,-999,-999,-999,-999,-999,-999,-999,-999
,2005-08-26T06:08:25Z,WQS012,-20.33,148.84,90.6,-999,-999,-999,-999,-999,-999,-999,-999,-999,-999,-999,-999
,2005-08-26T06:08:27Z,WQS012,-20.33,148.84,90.8,-999,-999,-999,-999,-999,-999,-999,-999,-999,-999,-999,-999
,2005-08-26T06:08:27Z,WQS012,-20.33,148.84,91,-999,-999,-999,-999,-999,-999,-999,-999,-999,-999,-999,-999
,2005-08-26T06:08:27Z,WQS012,-20.33,148.84,91.2,-999,-999,-999,-999,-999,-999,-999,-999,-999,-999,-999,-999
,2005-08-26T06:08:27Z,WQS012,-20.33,148.84,91.4,-999,-999,-999,-999,-999,-999,-999,-999,-999,-999,-999,-999
,2005-08-26T06:08:29Z,WQS012,-20.33,148.84,91.6,-999,-999,-999,-999,-999,-999,-999,-999,-999,-999,-999,-999
,2005-08-26T06:08:29Z,WQS012,-20.33,148.84,91.8,-999,-999,-999,-999,-999,-999,-999,-999,-999,-999,-999,-999
,2005-08-26T06:08:29Z,WQS012,-20.33,148.84,92,-999,-999,-999,-999,-999,-999,-999,-999,-999,-999,-999,-999
,2005-08-26T06:08:29Z,WQS012,-20.33,148.84,92.2,-999,-999,-999,-999,-999,-999,-999,-999,-999,-999,-999,-999
,2005-08-26T06:08:29Z,WQS012,-20.33,148.84,92.4,-999,-999,-999,-999,-999,-999,-999,-999,-999,-999,-999,-999
,2005-08-26T06:08:31Z,WQS012,-20.33,148.84,92.6,-999,-999,-999,-999,-999,-999,-999,-999,-999,-999,-999,-999
,2005-08-26T06:08:31Z,WQS012,-20.33,148.84,92.8,-999,-999,-999,-999,-999,-999,-999,-999,-999,-999,-999,-999
,2005-08-26T06:08:31Z,WQS012,-20.33,148.84,93,-999,-999,-999,-999,-999,-999,-999,-999,-999,-999,-999,-999
,2005-08-26T06:08:31Z,WQS012,-20.33,148.84,93.2,-999,-999,-999,-999,-999,-999,-999,-999,-999,-999,-999,-999
,2005-08-26T06:08:31Z,WQS012,-20.33,148.84,93.4,-999,-999,-999,-999,-999,-999,-999,-999,-999,-999,-999,-999
,2005-08-26T06:08:33Z,WQS012,-20.33,148.84,93.6,-999,-999,-999,-999,-999,-999,-999,-999,-999,-999,-999,-999
,2005-08-26T06:08:33Z,WQS012,-20.33,148.84,93.8,-999,-999,-999,-999,-999,-999,-999,-999,-999,-999,-999,-999
,2005-08-26T06:08:33Z,WQS012,-20.33,148.84,94,-999,-999,-999,-999,-999,-999,-999,-999,-999,-999,-999,-999
,2005-08-26T06:08:33Z,WQS012,-20.33,148.84,94.2,-999,-999,-999,-999,-999,-999,-999,-999,-999,-999,-999,-999
,2005-08-26T06:08:33Z,WQS012,-20.33,148.84,94.4,-999,-999,-999,-999,-999,-999,-999,-999,-999,-999,-999,-999
,2005-08-26T06:08:35Z,WQS012,-20.33,148.84,94.6,-999,-999,-999,-999,-999,-999,-999,-999,-999,-999,-999,-999
,2005-08-26T06:08:35Z,WQS012,-20.33,148.84,94.8,-999,-999,-999,-999,-999,-999,-999,-999,-999,-999,-999,-999
,2005-08-26T06:08:35Z,WQS012,-20.33,148.84,95,-999,-999,-999,-999,-999,-999,-999,-999,-999,-999,-999,-999
,2005-08-26T06:08:35Z,WQS012,-20.33,148.84,95.2,-999,-999,-999,-999,-999,-999,-999,-999,-999,-999,-999,-999
,2005-08-26T06:08:35Z,WQS012,-20.33,148.84,95.4,-999,-999,-999,-999,-999,-999,-999,-999,-999,-999,-999,-999
,2005-08-26T06:08:37Z,WQS012,-20.33,148.84,95.6,-999,-999,-999,-999,-999,-999,-999,-999,-999,-999,-999,-999
,2005-08-26T06:08:37Z,WQS012,-20.33,148.84,95.8,-999,-999,-999,-999,-999,-999,-999,-999,-999,-999,-999,-999
,2005-08-26T06:08:37Z,WQS012,-20.33,148.84,96,-999,-999,-999,-999,-999,-999,-999,-999,-999,-999,-999,-999
,2005-08-26T06:08:37Z,WQS012,-20.33,148.84,96.2,-999,-999,-999,-999,-999,-999,-999,-999,-999,-999,-999,-999
,2005-08-26T06:08:39Z,WQS012,-20.33,148.84,96.4,-999,-999,-999,-999,-999,-999,-999,-999,-999,-999,-999,-999
,2005-08-26T06:08:39Z,WQS012,-20.33,148.84,96.6,-999,-999,-999,-999,-999,-999,-999,-999,-999,-999,-999,-999
,2005-08-26T06:08:39Z,WQS012,-20.33,148.84,96.8,-999,-999,-999,-999,-999,-999,-999,-999,-999,-999,-999,-999
,2005-08-26T06:08:39Z,WQS012,-20.33,148.84,97,-999,-999,-999,-999,-999,-999,-999,-999,-999,-999,-999,-999
,2005-08-26T06:08:39Z,WQS012,-20.33,148.84,97.2,-999,-999,-999,-999,-999,-999,-999,-999,-999,-999,-999,-999
,2005-08-26T06:08:41Z,WQS012,-20.33,148.84,97.4,-999,-999,-999,-999,-999,-999,-999,-999,-999,-999,-999,-999
,2005-08-26T06:08:41Z,WQS012,-20.33,148.84,97.6,-999,-999,-999,-999,-999,-999,-999,-999,-999,-999,-999,-999
,2005-08-26T06:08:41Z,WQS012,-20.33,148.84,97.8,-999,-999,-999,-999,-999,-999,-999,-999,-999,-999,-999,-999
,2005-08-26T06:08:41Z,WQS012,-20.33,148.84,98,-999,-999,-999,-999,-999,-999,-999,-999,-999,-999,-999,-999
,2005-08-26T06:08:41Z,WQS012,-20.33,148.84,98.2,-999,-999,-999,-999,-999,-999,-999,-999,-999,-999,-999,-999
,2005-08-26T06:08:43Z,WQS012,-20.33,148.84,98.4,-999,-999,-999,-999,-999,-999,-999,-999,-999,-999,-999,-999
,2005-08-26T06:08:43Z,WQS012,-20.33,148.84,98.6,-999,-999,-999,-999,-999,-999,-999,-999,-999,-999,-999,-999
,2005-08-26T06:08:43Z,WQS012,-20.33,148.84,98.8,-999,-999,-999,-999,-999,-999,-999,-999,-999,-999,-999,-999
,2005-08-26T06:08:43Z,WQS012,-20.33,148.84,99,-999,-999,-999,-999,-999,-999,-999,-999,-999,-999,-999,-999
,2005-08-26T06:08:43Z,WQS012,-20.33,148.84,99.2,-999,-999,-999,-999,-999,-999,-999,-999,-999,-999,-999,-999
,2005-08-26T06:08:45Z,WQS012,-20.33,148.84,99.4,-999,-999,-999,-999,-999,-999,-999,-999,-999,-999,-999,-999
,2005-08-26T06:08:45Z,WQS012,-20.33,148.84,99.6,-999,-999,-999,-999,-999,-999,-999,-999,-999,-999,-999,-999
,2005-08-26T06:08:45Z,WQS012,-20.33,148.84,99.8,-999,-999,-999,-999,-999,-999,-999,-999,-999,-999,-999,-999
,2005-08-26T06:08:45Z,WQS012,-20.33,148.84,100,-999,-999,-999,-999,-999,-999,-999,-999,-999,-999,-999,-999
