GLOBAL ATTRIBUTES,,,,,,,,,,,,,,,,,
title,,,,,,,,,,,,,,,,,
project,Integrated Marine Observing System (IMOS),,,,,,,,,,,,,,,,
original_project_name,MERIS validation,,,,,,,,,,,,,,,,
institution,CSIRO Land and Water,,,,,,,,,,,,,,,,
abstract,This record contains in situ water optical property data collected in the Fitzroy (Great Barrier Reef| Australia) on the vessel MV Rum Rambler between 04-12 Sept 2003. A total of 52 stations were sampled during the field campaign FK03. The data can be used for Ocean Colour sensor validation| optical water quality monitoring and modelling. CLW deployed the optical instruments RAMSES (hyperspectral scalar irradiance)| AC-9 (absorption| attenuation)| HS-6 (backscattering) during this cruise. This data pool was part of the dataset described in Oubelkheir et al. 2006| VOL 111| C07021| doi:10.1029/2005JC003113 and Blondeau-Patissier et al. 2009| JGR| VOL. 114| C05003| doi:10.1029/2008JC005039. Funding for this study was provided by CSIRO Earth Observation Centre| CSIRO Land and Water| CSIRO Marine Research and the Cooperative Research Centre for Coastal Zone| Estuary and Waterway Management (Fitzroy Agricultural Contaminants project). We also thank the captains and crews of the MV Rum Rambler.,,,,,,,,,,,,,,,,
conventions,IMOS biological data format (v1.0),,,,,,,,,,,,,,,,
date_created,2003-09-08T00:12:01Z,,,,,,,,,,,,,,,,
date_modified,2006-02-06T02:06:02Z,,,,,,,,,,,,,,,,
history,Data has been quality controlled by in-house procedures. HS-6 data were corrected for temperature using CTD data and the Sigma correction method| recommended by the manufacturer| was applied using absorption and attenuation data from the AC-9. The Sigma correction is an adjustment to improve the accuracy of backscattering measurements| in particular in highly-attenuating water. The correction is detailed in HOBI-labs Inc.| 2003. The backscattering coefficient bb is estimated using the method described in Maffione and Dana| 1997| Applied Optics| 36(24)| pp.6057-6067.,,,,,,,,,,,,,,,,
comment,The HydroScat-6 (HS-6) is a self-contained instrument for measuring optical backscattering at six different wavelengths in natural waters. The particulate backscattering coefficient| bbp (lambda)| is a measure of light scattering by particles at angles between 90 and 180 degrees. bbp was estimated by subtracting bbw (lambda)| the backscattering coefficient of pure sea-water| from bb (lambda). The pure seawater backscattering coefficient was calculated using a backscattering ratio of 0.5 (Gordon et al.| 1988| Journal of Geophysical Research) and the seawater scattering coefficients| bw(lambda)| of Morel (1974| Optical properties of pure water and pure seawater| p. 1-24| in Optical Aspects of Oceanography).,,,,,,,,,,,,,,,,
source,Particulate Scattering coefficients determined using an HS-6 (www.hobilabs.com),,,,,,,,,,,,,,,,
keywords,Oceans>Ocean Optics > Scattering ;Oceans>Ocean Optics>Ocean Colour;,,,,,,,,,,,,,,,,
cruise_id,FK03,,,,,,,,,,,,,,,,
vessel_name,Rum Rambler,,,,,,,,,,,,,,,,
platform_code,VL8621,,,,,,,,,,,,,,,,
references,http://www.marine.csiro.au/marq/edd_search.Browse_Citation?txtSession=8997,,,,,,,,,,,,,,,,
naming_authority,CSIRO Land and Water (CLW),,,,,,,,,,,,,,,,
cdm_data_type,profile,,,,,,,,,,,,,,,,
geospatial_lat_min,-23.6,,,,,,,,,,,,,,,,
geospatial_lat_max,-23.6,,,,,,,,,,,,,,,,
geospatial_lon_min,150.79,,,,,,,,,,,,,,,,
geospatial_lon_max,150.79,,,,,,,,,,,,,,,,
geospatial_vertical_min,5.6,,,,,,,,,,,,,,,,
geospatial_vertical_max,100,,,,,,,,,,,,,,,,
local_time_zone,10,,,,,,,,,,,,,,,,
data_centre,eMarine Information Infrastructure (eMII),,,,,,,,,,,,,,,,
data_centre_email,info@emii.org.au,,,,,,,,,,,,,,,,
author,"Vittorio,Brando ",,,,,,,,,,,,,,,,
author_email,vittorio.brando@csiro.au,,,,,,,,,,,,,,,,
principal_investigator,"Webster, Ian",,,,,,,,,,,,,,,,
principal_investigator_email,Ian.Webster@csiro.au,,,,,,,,,,,,,,,,
publisher,Australian Ocean Data Network,,,,,,,,,,,,,,,,
publisher_email,info@aodn.org.au,,,,,,,,,,,,,,,,
institution,IMOS Satellite Remote Sensing - Ocean Colour Sub-facility - Bio-Optical Database of Australian Waters,,,,,,,,,,,,,,,,
institution_principal_investigator,"Schroeder, Thomas",,,,,,,,,,,,,,,,
institution_principal_investigator_email,Thomas.Schroeder@csiro.au,,,,,,,,,,,,,,,,
citation,To cite this data set in a publication use the format <<IMOS [year-of-data-downloaded] [Title] [data-access-url] accessed [date-of-access]>>,,,,,,,,,,,,,,,,
acknowledgement,Data was sourced from the Commonwealth Scientific and Industrial Research Organisation (CSIRO),,,,,,,,,,,,,,,,
distribution_statement,"Any users of IMOS data are required to clearly acknowledge the source of the material- Data or products or services from IMOS are provided ""as is"" without any warranty as to fitness for a particular purpose.",,,,,,,,,,,,,,,,
,,,,,,,,,,,,,,,,,
TABLE ROWS,,,,,,,,,,,,,,,,,
Row name,CF standard_name,IMOS long_name,Units,Fill value,Comments,,,,,,,,,,,,
Wavelength,radiation_wavelength,Wavelength of measurement,nm,-999,,,,,,,,,,,,,
,,,,,,,,,,,,,,,,,
TABLE COLUMNS,,,,,,,,,,,,,,,,,
Column name,CF standard_name,IMOS long_name,Units,Fill value,Comments,,,,,,,,,,,,
Time,time,analysis_time,YYYY-MM-DDThh:mm:ssZ,,UTC date and time,,,,,,,,,,,,
Station_Code,,,,,National Reference Station code (6 letters),,,,,,,,,,,,
Latitude,latitude,latitude,degrees_north,-999,North positive,,,,,,,,,,,,
Longitude,longitude,longitude,degrees_east,-999,East positive,,,,,,,,,,,,
Depth,depth,depth,m ,-999,positive down,,,,,,,,,,,,
bb_corr,,corrected_volume_total_backwards_scattering_coefficient_of_(bbw_+_bbp)_in_sea_water,m-1,-999,bbw:volume_backwards_scattering_coefficient_of_radiative_flux_in_sea_water ; bbp=volume_backwards_scattering_coefficient_of_particules_in_sea_water,,,,,,,,,,,,
bb_uncorr,,volume_total_backwards_scattering_coefficient_of_(bbw_+_bbp)_in_sea_water,m-1,-999,bbw:volume_backwards_scattering_coefficient_of_radiative_flux_in_sea_water ; bbp=volume_backwards_scattering_coefficient_of_particules_in_sea_water,,,,,,,,,,,,
,,,,,,,,,,,,,,,,,
,,,,,,,,,,,,,,,,,
DATA,,,,,,,,,,,,,,,,,
,Time,Station_Code,Latitude,Longitude,Depth,bb_corr,bb_corr,bb_corr,bb_corr,bb_corr,bb_corr,bb_uncorr,bb_uncorr,bb_uncorr,bb_uncorr,bb_uncorr,bb_uncorr
Wavelength,,,,,,442,448,555,589,676,852,442,448,555,589,676,852
,2003-09-08T00:12:03Z,FK23,-23.6,150.79,0,1.329464,1.007449,0.914105,0.890048,0.742152,0.656117,0.242135,0.228377,0.241318,0.246219,0.247644,0.199462
,2003-09-08T00:12:08Z,FK23,-23.6,150.79,0.2,1.328408,1.019896,0.931554,0.916534,0.785566,0.725948,0.241943,0.231198,0.245924,0.253546,0.26213,0.220692
,2003-09-08T00:12:10Z,FK23,-23.6,150.79,0.4,1.295678,1.020905,0.943614,0.902443,0.789616,0.745784,0.235982,0.231427,0.249108,0.249648,0.263482,0.226722
,2003-09-08T00:12:17Z,FK23,-23.6,150.79,0.6,1.34926,1.053368,0.988777,0.941854,0.863827,0.780397,0.245741,0.238786,0.261031,0.26055,0.288245,0.237244
,2003-09-08T00:12:21Z,FK23,-23.6,150.79,0.8,1.390437,1.07658,1.01957,0.996521,0.887699,0.816425,0.25324,0.244048,0.26916,0.275673,0.29621,0.248197
,2003-09-08T00:12:25Z,FK23,-23.6,150.79,1,1.448771,1.114425,1.077306,1.047056,0.998211,0.922893,0.263865,0.252627,0.284402,0.289653,0.333086,0.280564
,2003-09-08T00:12:29Z,FK23,-23.6,150.79,1.2,1.377767,1.110724,1.099888,1.032542,0.967444,0.956088,0.250933,0.251788,0.290363,0.285638,0.32282,0.290655
,2003-09-08T00:12:34Z,FK23,-23.6,150.79,1.4,1.3519,1.089026,1.085774,1.038899,0.966331,0.962768,0.246222,0.246869,0.286637,0.287396,0.322449,0.292686
,2003-09-08T00:12:37Z,FK23,-23.6,150.79,1.6,1.368529,1.114425,1.121186,1.057545,1.004704,0.994951,0.24925,0.252627,0.295986,0.292554,0.335253,0.302469
,2003-09-08T00:12:01Z,FK23,-23.6,150.79,1.8,-999,-999,-999,-999,-999,-999,-999,-999,-999,-999,-999,-999
,2003-09-08T00:12:01Z,FK23,-23.6,150.79,2,-999,-999,-999,-999,-999,-999,-999,-999,-999,-999,-999,-999
,2003-09-08T00:12:01Z,FK23,-23.6,150.79,2.2,-999,-999,-999,-999,-999,-999,-999,-999,-999,-999,-999,-999
,2003-09-08T00:12:01Z,FK23,-23.6,150.79,2.4,-999,-999,-999,-999,-999,-999,-999,-999,-999,-999,-999,-999
,2003-09-08T00:12:02Z,FK23,-23.6,150.79,2.6,-999,-999,-999,-999,-999,-999,-999,-999,-999,-999,-999,-999
,2003-09-08T00:12:02Z,FK23,-23.6,150.79,2.8,-999,-999,-999,-999,-999,-999,-999,-999,-999,-999,-999,-999
,2003-09-08T00:12:02Z,FK23,-23.6,150.79,3,-999,-999,-999,-999,-999,-999,-999,-999,-999,-999,-999,-999
,2003-09-08T00:12:02Z,FK23,-23.6,150.79,3.2,-999,-999,-999,-999,-999,-999,-999,-999,-999,-999,-999,-999
,2003-09-08T00:12:02Z,FK23,-23.6,150.79,3.4,-999,-999,-999,-999,-999,-999,-999,-999,-999,-999,-999,-999
,2003-09-08T00:12:02Z,FK23,-23.6,150.79,3.6,-999,-999,-999,-999,-999,-999,-999,-999,-999,-999,-999,-999
,2003-09-08T00:12:02Z,FK23,-23.6,150.79,3.8,-999,-999,-999,-999,-999,-999,-999,-999,-999,-999,-999,-999
,2003-09-08T00:12:02Z,FK23,-23.6,150.79,4,-999,-999,-999,-999,-999,-999,-999,-999,-999,-999,-999,-999
,2003-09-08T00:12:02Z,FK23,-23.6,150.79,4.2,-999,-999,-999,-999,-999,-999,-999,-999,-999,-999,-999,-999
,2003-09-08T00:12:02Z,FK23,-23.6,150.79,4.4,-999,-999,-999,-999,-999,-999,-999,-999,-999,-999,-999,-999
,2003-09-08T00:12:02Z,FK23,-23.6,150.79,4.6,-999,-999,-999,-999,-999,-999,-999,-999,-999,-999,-999,-999
,2003-09-08T00:12:02Z,FK23,-23.6,150.79,4.8,-999,-999,-999,-999,-999,-999,-999,-999,-999,-999,-999,-999
,2003-09-08T00:12:02Z,FK23,-23.6,150.79,5,-999,-999,-999,-999,-999,-999,-999,-999,-999,-999,-999,-999
,2003-09-08T00:12:02Z,FK23,-23.6,150.79,5.2,-999,-999,-999,-999,-999,-999,-999,-999,-999,-999,-999,-999
,2003-09-08T00:12:02Z,FK23,-23.6,150.79,5.4,-999,-999,-999,-999,-999,-999,-999,-999,-999,-999,-999,-999
,2003-09-08T00:12:02Z,FK23,-23.6,150.79,5.6,-999,-999,-999,-999,-999,-999,-999,-999,-999,-999,-999,-999
,2003-09-08T00:12:02Z,FK23,-23.6,150.79,5.8,-999,-999,-999,-999,-999,-999,-999,-999,-999,-999,-999,-999
,2003-09-08T00:12:02Z,FK23,-23.6,150.79,6,-999,-999,-999,-999,-999,-999,-999,-999,-999,-999,-999,-999
,2003-09-08T00:12:02Z,FK23,-23.6,150.79,6.2,-999,-999,-999,-999,-999,-999,-999,-999,-999,-999,-999,-999
,2003-09-08T00:12:02Z,FK23,-23.6,150.79,6.4,-999,-999,-999,-999,-999,-999,-999,-999,-999,-999,-999,-999
,2003-09-08T00:12:02Z,FK23,-23.6,150.79,6.6,-999,-999,-999,-999,-999,-999,-999,-999,-999,-999,-999,-999
,2003-09-08T00:12:02Z,FK23,-23.6,150.79,6.8,-999,-999,-999,-999,-999,-999,-999,-999,-999,-999,-999,-999
,2003-09-08T00:12:02Z,FK23,-23.6,150.79,7,-999,-999,-999,-999,-999,-999,-999,-999,-999,-999,-999,-999
,2003-09-08T00:12:02Z,FK23,-23.6,150.79,7.2,-999,-999,-999,-999,-999,-999,-999,-999,-999,-999,-999,-999
,2003-09-08T00:12:02Z,FK23,-23.6,150.79,7.4,-999,-999,-999,-999,-999,-999,-999,-999,-999,-999,-999,-999
,2003-09-08T00:12:02Z,FK23,-23.6,150.79,7.6,-999,-999,-999,-999,-999,-999,-999,-999,-999,-999,-999,-999
,2003-09-08T00:12:03Z,FK23,-23.6,150.79,7.8,-999,-999,-999,-999,-999,-999,-999,-999,-999,-999,-999,-999
,2003-09-08T00:12:03Z,FK23,-23.6,150.79,8,-999,-999,-999,-999,-999,-999,-999,-999,-999,-999,-999,-999
,2003-09-08T00:12:03Z,FK23,-23.6,150.79,8.2,-999,-999,-999,-999,-999,-999,-999,-999,-999,-999,-999,-999
,2003-09-08T00:12:03Z,FK23,-23.6,150.79,8.4,-999,-999,-999,-999,-999,-999,-999,-999,-999,-999,-999,-999
,2003-09-08T00:12:03Z,FK23,-23.6,150.79,8.6,-999,-999,-999,-999,-999,-999,-999,-999,-999,-999,-999,-999
,2003-09-08T00:12:03Z,FK23,-23.6,150.79,8.8,-999,-999,-999,-999,-999,-999,-999,-999,-999,-999,-999,-999
,2003-09-08T00:12:03Z,FK23,-23.6,150.79,9,-999,-999,-999,-999,-999,-999,-999,-999,-999,-999,-999,-999
,2003-09-08T00:12:03Z,FK23,-23.6,150.79,9.2,-999,-999,-999,-999,-999,-999,-999,-999,-999,-999,-999,-999
,2003-09-08T00:12:03Z,FK23,-23.6,150.79,9.4,-999,-999,-999,-999,-999,-999,-999,-999,-999,-999,-999,-999
,2003-09-08T00:12:03Z,FK23,-23.6,150.79,9.6,-999,-999,-999,-999,-999,-999,-999,-999,-999,-999,-999,-999
,2003-09-08T00:12:03Z,FK23,-23.6,150.79,9.8,-999,-999,-999,-999,-999,-999,-999,-999,-999,-999,-999,-999
,2003-09-08T00:12:03Z,FK23,-23.6,150.79,10,-999,-999,-999,-999,-999,-999,-999,-999,-999,-999,-999,-999
,2003-09-08T00:12:03Z,FK23,-23.6,150.79,10.2,-999,-999,-999,-999,-999,-999,-999,-999,-999,-999,-999,-999
,2003-09-08T00:12:03Z,FK23,-23.6,150.79,10.4,-999,-999,-999,-999,-999,-999,-999,-999,-999,-999,-999,-999
,2003-09-08T00:12:03Z,FK23,-23.6,150.79,10.6,-999,-999,-999,-999,-999,-999,-999,-999,-999,-999,-999,-999
,2003-09-08T00:12:03Z,FK23,-23.6,150.79,10.8,-999,-999,-999,-999,-999,-999,-999,-999,-999,-999,-999,-999
,2003-09-08T00:12:03Z,FK23,-23.6,150.79,11,-999,-999,-999,-999,-999,-999,-999,-999,-999,-999,-999,-999
,2003-09-08T00:12:03Z,FK23,-23.6,150.79,11.2,-999,-999,-999,-999,-999,-999,-999,-999,-999,-999,-999,-999
,2003-09-08T00:12:03Z,FK23,-23.6,150.79,11.4,-999,-999,-999,-999,-999,-999,-999,-999,-999,-999,-999,-999
,2003-09-08T00:12:03Z,FK23,-23.6,150.79,11.6,-999,-999,-999,-999,-999,-999,-999,-999,-999,-999,-999,-999
,2003-09-08T00:12:03Z,FK23,-23.6,150.79,11.8,-999,-999,-999,-999,-999,-999,-999,-999,-999,-999,-999,-999
,2003-09-08T00:12:03Z,FK23,-23.6,150.79,12,-999,-999,-999,-999,-999,-999,-999,-999,-999,-999,-999,-999
,2003-09-08T00:12:03Z,FK23,-23.6,150.79,12.2,-999,-999,-999,-999,-999,-999,-999,-999,-999,-999,-999,-999
,2003-09-08T00:12:03Z,FK23,-23.6,150.79,12.4,-999,-999,-999,-999,-999,-999,-999,-999,-999,-999,-999,-999
,2003-09-08T00:12:03Z,FK23,-23.6,150.79,12.6,-999,-999,-999,-999,-999,-999,-999,-999,-999,-999,-999,-999
,2003-09-08T00:12:03Z,FK23,-23.6,150.79,12.8,-999,-999,-999,-999,-999,-999,-999,-999,-999,-999,-999,-999
,2003-09-08T00:12:04Z,FK23,-23.6,150.79,13,-999,-999,-999,-999,-999,-999,-999,-999,-999,-999,-999,-999
,2003-09-08T00:12:04Z,FK23,-23.6,150.79,13.2,-999,-999,-999,-999,-999,-999,-999,-999,-999,-999,-999,-999
,2003-09-08T00:12:04Z,FK23,-23.6,150.79,13.4,-999,-999,-999,-999,-999,-999,-999,-999,-999,-999,-999,-999
,2003-09-08T00:12:04Z,FK23,-23.6,150.79,13.6,-999,-999,-999,-999,-999,-999,-999,-999,-999,-999,-999,-999
,2003-09-08T00:12:04Z,FK23,-23.6,150.79,13.8,-999,-999,-999,-999,-999,-999,-999,-999,-999,-999,-999,-999
,2003-09-08T00:12:04Z,FK23,-23.6,150.79,14,-999,-999,-999,-999,-999,-999,-999,-999,-999,-999,-999,-999
,2003-09-08T00:12:04Z,FK23,-23.6,150.79,14.2,-999,-999,-999,-999,-999,-999,-999,-999,-999,-999,-999,-999
,2003-09-08T00:12:04Z,FK23,-23.6,150.79,14.4,-999,-999,-999,-999,-999,-999,-999,-999,-999,-999,-999,-999
,2003-09-08T00:12:04Z,FK23,-23.6,150.79,14.6,-999,-999,-999,-999,-999,-999,-999,-999,-999,-999,-999,-999
,2003-09-08T00:12:04Z,FK23,-23.6,150.79,14.8,-999,-999,-999,-999,-999,-999,-999,-999,-999,-999,-999,-999
,2003-09-08T00:12:04Z,FK23,-23.6,150.79,15,-999,-999,-999,-999,-999,-999,-999,-999,-999,-999,-999,-999
,2003-09-08T00:12:04Z,FK23,-23.6,150.79,15.2,-999,-999,-999,-999,-999,-999,-999,-999,-999,-999,-999,-999
,2003-09-08T00:12:04Z,FK23,-23.6,150.79,15.4,-999,-999,-999,-999,-999,-999,-999,-999,-999,-999,-999,-999
,2003-09-08T00:12:04Z,FK23,-23.6,150.79,15.6,-999,-999,-999,-999,-999,-999,-999,-999,-999,-999,-999,-999
,2003-09-08T00:12:04Z,FK23,-23.6,150.79,15.8,-999,-999,-999,-999,-999,-999,-999,-999,-999,-999,-999,-999
,2003-09-08T00:12:04Z,FK23,-23.6,150.79,16,-999,-999,-999,-999,-999,-999,-999,-999,-999,-999,-999,-999
,2003-09-08T00:12:04Z,FK23,-23.6,150.79,16.2,-999,-999,-999,-999,-999,-999,-999,-999,-999,-999,-999,-999
,2003-09-08T00:12:04Z,FK23,-23.6,150.79,16.4,-999,-999,-999,-999,-999,-999,-999,-999,-999,-999,-999,-999
,2003-09-08T00:12:04Z,FK23,-23.6,150.79,16.6,-999,-999,-999,-999,-999,-999,-999,-999,-999,-999,-999,-999
,2003-09-08T00:12:04Z,FK23,-23.6,150.79,16.8,-999,-999,-999,-999,-999,-999,-999,-999,-999,-999,-999,-999
,2003-09-08T00:12:04Z,FK23,-23.6,150.79,17,-999,-999,-999,-999,-999,-999,-999,-999,-999,-999,-999,-999
,2003-09-08T00:12:04Z,FK23,-23.6,150.79,17.2,-999,-999,-999,-999,-999,-999,-999,-999,-999,-999,-999,-999
,2003-09-08T00:12:04Z,FK23,-23.6,150.79,17.4,-999,-999,-999,-999,-999,-999,-999,-999,-999,-999,-999,-999
,2003-09-08T00:12:04Z,FK23,-23.6,150.79,17.6,-999,-999,-999,-999,-999,-999,-999,-999,-999,-999,-999,-999
,2003-09-08T00:12:04Z,FK23,-23.6,150.79,17.8,-999,-999,-999,-999,-999,-999,-999,-999,-999,-999,-999,-999
,2003-09-08T00:12:05Z,FK23,-23.6,150.79,18,-999,-999,-999,-999,-999,-999,-999,-999,-999,-999,-999,-999
,2003-09-08T00:12:05Z,FK23,-23.6,150.79,18.2,-999,-999,-999,-999,-999,-999,-999,-999,-999,-999,-999,-999
,2003-09-08T00:12:05Z,FK23,-23.6,150.79,18.4,-999,-999,-999,-999,-999,-999,-999,-999,-999,-999,-999,-999
,2003-09-08T00:12:05Z,FK23,-23.6,150.79,18.6,-999,-999,-999,-999,-999,-999,-999,-999,-999,-999,-999,-999
,2003-09-08T00:12:05Z,FK23,-23.6,150.79,18.8,-999,-999,-999,-999,-999,-999,-999,-999,-999,-999,-999,-999
,2003-09-08T00:12:05Z,FK23,-23.6,150.79,19,-999,-999,-999,-999,-999,-999,-999,-999,-999,-999,-999,-999
,2003-09-08T00:12:05Z,FK23,-23.6,150.79,19.2,-999,-999,-999,-999,-999,-999,-999,-999,-999,-999,-999,-999
,2003-09-08T00:12:05Z,FK23,-23.6,150.79,19.4,-999,-999,-999,-999,-999,-999,-999,-999,-999,-999,-999,-999
,2003-09-08T00:12:05Z,FK23,-23.6,150.79,19.6,-999,-999,-999,-999,-999,-999,-999,-999,-999,-999,-999,-999
,2003-09-08T00:12:05Z,FK23,-23.6,150.79,19.8,-999,-999,-999,-999,-999,-999,-999,-999,-999,-999,-999,-999
,2003-09-08T00:12:05Z,FK23,-23.6,150.79,20,-999,-999,-999,-999,-999,-999,-999,-999,-999,-999,-999,-999
,2003-09-08T00:12:05Z,FK23,-23.6,150.79,20.2,-999,-999,-999,-999,-999,-999,-999,-999,-999,-999,-999,-999
,2003-09-08T00:12:05Z,FK23,-23.6,150.79,20.4,-999,-999,-999,-999,-999,-999,-999,-999,-999,-999,-999,-999
,2003-09-08T00:12:05Z,FK23,-23.6,150.79,20.6,-999,-999,-999,-999,-999,-999,-999,-999,-999,-999,-999,-999
,2003-09-08T00:12:05Z,FK23,-23.6,150.79,20.8,-999,-999,-999,-999,-999,-999,-999,-999,-999,-999,-999,-999
,2003-09-08T00:12:05Z,FK23,-23.6,150.79,21,-999,-999,-999,-999,-999,-999,-999,-999,-999,-999,-999,-999
,2003-09-08T00:12:05Z,FK23,-23.6,150.79,21.2,-999,-999,-999,-999,-999,-999,-999,-999,-999,-999,-999,-999
,2003-09-08T00:12:05Z,FK23,-23.6,150.79,21.4,-999,-999,-999,-999,-999,-999,-999,-999,-999,-999,-999,-999
,2003-09-08T00:12:05Z,FK23,-23.6,150.79,21.6,-999,-999,-999,-999,-999,-999,-999,-999,-999,-999,-999,-999
,2003-09-08T00:12:05Z,FK23,-23.6,150.79,21.8,-999,-999,-999,-999,-999,-999,-999,-999,-999,-999,-999,-999
,2003-09-08T00:12:05Z,FK23,-23.6,150.79,22,-999,-999,-999,-999,-999,-999,-999,-999,-999,-999,-999,-999
,2003-09-08T00:12:05Z,FK23,-23.6,150.79,22.2,-999,-999,-999,-999,-999,-999,-999,-999,-999,-999,-999,-999
,2003-09-08T00:12:05Z,FK23,-23.6,150.79,22.4,-999,-999,-999,-999,-999,-999,-999,-999,-999,-999,-999,-999
,2003-09-08T00:12:05Z,FK23,-23.6,150.79,22.6,-999,-999,-999,-999,-999,-999,-999,-999,-999,-999,-999,-999
,2003-09-08T00:12:05Z,FK23,-23.6,150.79,22.8,-999,-999,-999,-999,-999,-999,-999,-999,-999,-999,-999,-999
,2003-09-08T00:12:05Z,FK23,-23.6,150.79,23,-999,-999,-999,-999,-999,-999,-999,-999,-999,-999,-999,-999
,2003-09-08T00:12:06Z,FK23,-23.6,150.79,23.2,-999,-999,-999,-999,-999,-999,-999,-999,-999,-999,-999,-999
,2003-09-08T00:12:06Z,FK23,-23.6,150.79,23.4,-999,-999,-999,-999,-999,-999,-999,-999,-999,-999,-999,-999
,2003-09-08T00:12:06Z,FK23,-23.6,150.79,23.6,-999,-999,-999,-999,-999,-999,-999,-999,-999,-999,-999,-999
,2003-09-08T00:12:06Z,FK23,-23.6,150.79,23.8,-999,-999,-999,-999,-999,-999,-999,-999,-999,-999,-999,-999
,2003-09-08T00:12:06Z,FK23,-23.6,150.79,24,-999,-999,-999,-999,-999,-999,-999,-999,-999,-999,-999,-999
,2003-09-08T00:12:06Z,FK23,-23.6,150.79,24.2,-999,-999,-999,-999,-999,-999,-999,-999,-999,-999,-999,-999
,2003-09-08T00:12:06Z,FK23,-23.6,150.79,24.4,-999,-999,-999,-999,-999,-999,-999,-999,-999,-999,-999,-999
,2003-09-08T00:12:06Z,FK23,-23.6,150.79,24.6,-999,-999,-999,-999,-999,-999,-999,-999,-999,-999,-999,-999
,2003-09-08T00:12:06Z,FK23,-23.6,150.79,24.8,-999,-999,-999,-999,-999,-999,-999,-999,-999,-999,-999,-999
,2003-09-08T00:12:06Z,FK23,-23.6,150.79,25,-999,-999,-999,-999,-999,-999,-999,-999,-999,-999,-999,-999
,2003-09-08T00:12:06Z,FK23,-23.6,150.79,25.2,-999,-999,-999,-999,-999,-999,-999,-999,-999,-999,-999,-999
,2003-09-08T00:12:06Z,FK23,-23.6,150.79,25.4,-999,-999,-999,-999,-999,-999,-999,-999,-999,-999,-999,-999
,2003-09-08T00:12:06Z,FK23,-23.6,150.79,25.6,-999,-999,-999,-999,-999,-999,-999,-999,-999,-999,-999,-999
,2003-09-08T00:12:06Z,FK23,-23.6,150.79,25.8,-999,-999,-999,-999,-999,-999,-999,-999,-999,-999,-999,-999
,2003-09-08T00:12:06Z,FK23,-23.6,150.79,26,-999,-999,-999,-999,-999,-999,-999,-999,-999,-999,-999,-999
,2003-09-08T00:12:06Z,FK23,-23.6,150.79,26.2,-999,-999,-999,-999,-999,-999,-999,-999,-999,-999,-999,-999
,2003-09-08T00:12:06Z,FK23,-23.6,150.79,26.4,-999,-999,-999,-999,-999,-999,-999,-999,-999,-999,-999,-999
,2003-09-08T00:12:06Z,FK23,-23.6,150.79,26.6,-999,-999,-999,-999,-999,-999,-999,-999,-999,-999,-999,-999
,2003-09-08T00:12:06Z,FK23,-23.6,150.79,26.8,-999,-999,-999,-999,-999,-999,-999,-999,-999,-999,-999,-999
,2003-09-08T00:12:06Z,FK23,-23.6,150.79,27,-999,-999,-999,-999,-999,-999,-999,-999,-999,-999,-999,-999
,2003-09-08T00:12:06Z,FK23,-23.6,150.79,27.2,-999,-999,-999,-999,-999,-999,-999,-999,-999,-999,-999,-999
,2003-09-08T00:12:06Z,FK23,-23.6,150.79,27.4,-999,-999,-999,-999,-999,-999,-999,-999,-999,-999,-999,-999
,2003-09-08T00:12:06Z,FK23,-23.6,150.79,27.6,-999,-999,-999,-999,-999,-999,-999,-999,-999,-999,-999,-999
,2003-09-08T00:12:06Z,FK23,-23.6,150.79,27.8,-999,-999,-999,-999,-999,-999,-999,-999,-999,-999,-999,-999
,2003-09-08T00:12:06Z,FK23,-23.6,150.79,28,-999,-999,-999,-999,-999,-999,-999,-999,-999,-999,-999,-999
,2003-09-08T00:12:06Z,FK23,-23.6,150.79,28.2,-999,-999,-999,-999,-999,-999,-999,-999,-999,-999,-999,-999
,2003-09-08T00:12:07Z,FK23,-23.6,150.79,28.4,-999,-999,-999,-999,-999,-999,-999,-999,-999,-999,-999,-999
,2003-09-08T00:12:07Z,FK23,-23.6,150.79,28.6,-999,-999,-999,-999,-999,-999,-999,-999,-999,-999,-999,-999
,2003-09-08T00:12:07Z,FK23,-23.6,150.79,28.8,-999,-999,-999,-999,-999,-999,-999,-999,-999,-999,-999,-999
,2003-09-08T00:12:07Z,FK23,-23.6,150.79,29,-999,-999,-999,-999,-999,-999,-999,-999,-999,-999,-999,-999
,2003-09-08T00:12:07Z,FK23,-23.6,150.79,29.2,-999,-999,-999,-999,-999,-999,-999,-999,-999,-999,-999,-999
,2003-09-08T00:12:07Z,FK23,-23.6,150.79,29.4,-999,-999,-999,-999,-999,-999,-999,-999,-999,-999,-999,-999
,2003-09-08T00:12:07Z,FK23,-23.6,150.79,29.6,-999,-999,-999,-999,-999,-999,-999,-999,-999,-999,-999,-999
,2003-09-08T00:12:07Z,FK23,-23.6,150.79,29.8,-999,-999,-999,-999,-999,-999,-999,-999,-999,-999,-999,-999
,2003-09-08T00:12:07Z,FK23,-23.6,150.79,30,-999,-999,-999,-999,-999,-999,-999,-999,-999,-999,-999,-999
,2003-09-08T00:12:07Z,FK23,-23.6,150.79,30.2,-999,-999,-999,-999,-999,-999,-999,-999,-999,-999,-999,-999
,2003-09-08T00:12:07Z,FK23,-23.6,150.79,30.4,-999,-999,-999,-999,-999,-999,-999,-999,-999,-999,-999,-999
,2003-09-08T00:12:07Z,FK23,-23.6,150.79,30.6,-999,-999,-999,-999,-999,-999,-999,-999,-999,-999,-999,-999
,2003-09-08T00:12:07Z,FK23,-23.6,150.79,30.8,-999,-999,-999,-999,-999,-999,-999,-999,-999,-999,-999,-999
,2003-09-08T00:12:07Z,FK23,-23.6,150.79,31,-999,-999,-999,-999,-999,-999,-999,-999,-999,-999,-999,-999
,2003-09-08T00:12:07Z,FK23,-23.6,150.79,31.2,-999,-999,-999,-999,-999,-999,-999,-999,-999,-999,-999,-999
,2003-09-08T00:12:07Z,FK23,-23.6,150.79,31.4,-999,-999,-999,-999,-999,-999,-999,-999,-999,-999,-999,-999
,2003-09-08T00:12:07Z,FK23,-23.6,150.79,31.6,-999,-999,-999,-999,-999,-999,-999,-999,-999,-999,-999,-999
,2003-09-08T00:12:07Z,FK23,-23.6,150.79,31.8,-999,-999,-999,-999,-999,-999,-999,-999,-999,-999,-999,-999
,2003-09-08T00:12:07Z,FK23,-23.6,150.79,32,-999,-999,-999,-999,-999,-999,-999,-999,-999,-999,-999,-999
,2003-09-08T00:12:07Z,FK23,-23.6,150.79,32.2,-999,-999,-999,-999,-999,-999,-999,-999,-999,-999,-999,-999
,2003-09-08T00:12:07Z,FK23,-23.6,150.79,32.4,-999,-999,-999,-999,-999,-999,-999,-999,-999,-999,-999,-999
,2003-09-08T00:12:07Z,FK23,-23.6,150.79,32.6,-999,-999,-999,-999,-999,-999,-999,-999,-999,-999,-999,-999
,2003-09-08T00:12:07Z,FK23,-23.6,150.79,32.8,-999,-999,-999,-999,-999,-999,-999,-999,-999,-999,-999,-999
,2003-09-08T00:12:07Z,FK23,-23.6,150.79,33,-999,-999,-999,-999,-999,-999,-999,-999,-999,-999,-999,-999
,2003-09-08T00:12:07Z,FK23,-23.6,150.79,33.2,-999,-999,-999,-999,-999,-999,-999,-999,-999,-999,-999,-999
,2003-09-08T00:12:08Z,FK23,-23.6,150.79,33.4,-999,-999,-999,-999,-999,-999,-999,-999,-999,-999,-999,-999
,2003-09-08T00:12:08Z,FK23,-23.6,150.79,33.6,-999,-999,-999,-999,-999,-999,-999,-999,-999,-999,-999,-999
,2003-09-08T00:12:08Z,FK23,-23.6,150.79,33.8,-999,-999,-999,-999,-999,-999,-999,-999,-999,-999,-999,-999
,2003-09-08T00:12:08Z,FK23,-23.6,150.79,34,-999,-999,-999,-999,-999,-999,-999,-999,-999,-999,-999,-999
,2003-09-08T00:12:08Z,FK23,-23.6,150.79,34.2,-999,-999,-999,-999,-999,-999,-999,-999,-999,-999,-999,-999
,2003-09-08T00:12:08Z,FK23,-23.6,150.79,34.4,-999,-999,-999,-999,-999,-999,-999,-999,-999,-999,-999,-999
,2003-09-08T00:12:08Z,FK23,-23.6,150.79,34.6,-999,-999,-999,-999,-999,-999,-999,-999,-999,-999,-999,-999
,2003-09-08T00:12:08Z,FK23,-23.6,150.79,34.8,-999,-999,-999,-999,-999,-999,-999,-999,-999,-999,-999,-999
,2003-09-08T00:12:08Z,FK23,-23.6,150.79,35,-999,-999,-999,-999,-999,-999,-999,-999,-999,-999,-999,-999
,2003-09-08T00:12:08Z,FK23,-23.6,150.79,35.2,-999,-999,-999,-999,-999,-999,-999,-999,-999,-999,-999,-999
,2003-09-08T00:12:08Z,FK23,-23.6,150.79,35.4,-999,-999,-999,-999,-999,-999,-999,-999,-999,-999,-999,-999
,2003-09-08T00:12:08Z,FK23,-23.6,150.79,35.6,-999,-999,-999,-999,-999,-999,-999,-999,-999,-999,-999,-999
,2003-09-08T00:12:08Z,FK23,-23.6,150.79,35.8,-999,-999,-999,-999,-999,-999,-999,-999,-999,-999,-999,-999
,2003-09-08T00:12:08Z,FK23,-23.6,150.79,36,-999,-999,-999,-999,-999,-999,-999,-999,-999,-999,-999,-999
,2003-09-08T00:12:08Z,FK23,-23.6,150.79,36.2,-999,-999,-999,-999,-999,-999,-999,-999,-999,-999,-999,-999
,2003-09-08T00:12:08Z,FK23,-23.6,150.79,36.4,-999,-999,-999,-999,-999,-999,-999,-999,-999,-999,-999,-999
,2003-09-08T00:12:08Z,FK23,-23.6,150.79,36.6,-999,-999,-999,-999,-999,-999,-999,-999,-999,-999,-999,-999
,2003-09-08T00:12:08Z,FK23,-23.6,150.79,36.8,-999,-999,-999,-999,-999,-999,-999,-999,-999,-999,-999,-999
,2003-09-08T00:12:08Z,FK23,-23.6,150.79,37,-999,-999,-999,-999,-999,-999,-999,-999,-999,-999,-999,-999
,2003-09-08T00:12:08Z,FK23,-23.6,150.79,37.2,-999,-999,-999,-999,-999,-999,-999,-999,-999,-999,-999,-999
,2003-09-08T00:12:08Z,FK23,-23.6,150.79,37.4,-999,-999,-999,-999,-999,-999,-999,-999,-999,-999,-999,-999
,2003-09-08T00:12:08Z,FK23,-23.6,150.79,37.6,-999,-999,-999,-999,-999,-999,-999,-999,-999,-999,-999,-999
,2003-09-08T00:12:08Z,FK23,-23.6,150.79,37.8,-999,-999,-999,-999,-999,-999,-999,-999,-999,-999,-999,-999
,2003-09-08T00:12:08Z,FK23,-23.6,150.79,38,-999,-999,-999,-999,-999,-999,-999,-999,-999,-999,-999,-999
,2003-09-08T00:12:08Z,FK23,-23.6,150.79,38.2,-999,-999,-999,-999,-999,-999,-999,-999,-999,-999,-999,-999
,2003-09-08T00:12:08Z,FK23,-23.6,150.79,38.4,-999,-999,-999,-999,-999,-999,-999,-999,-999,-999,-999,-999
,2003-09-08T00:12:09Z,FK23,-23.6,150.79,38.6,-999,-999,-999,-999,-999,-999,-999,-999,-999,-999,-999,-999
,2003-09-08T00:12:09Z,FK23,-23.6,150.79,38.8,-999,-999,-999,-999,-999,-999,-999,-999,-999,-999,-999,-999
,2003-09-08T00:12:09Z,FK23,-23.6,150.79,39,-999,-999,-999,-999,-999,-999,-999,-999,-999,-999,-999,-999
,2003-09-08T00:12:09Z,FK23,-23.6,150.79,39.2,-999,-999,-999,-999,-999,-999,-999,-999,-999,-999,-999,-999
,2003-09-08T00:12:09Z,FK23,-23.6,150.79,39.4,-999,-999,-999,-999,-999,-999,-999,-999,-999,-999,-999,-999
,2003-09-08T00:12:09Z,FK23,-23.6,150.79,39.6,-999,-999,-999,-999,-999,-999,-999,-999,-999,-999,-999,-999
,2003-09-08T00:12:09Z,FK23,-23.6,150.79,39.8,-999,-999,-999,-999,-999,-999,-999,-999,-999,-999,-999,-999
,2003-09-08T00:12:09Z,FK23,-23.6,150.79,40,-999,-999,-999,-999,-999,-999,-999,-999,-999,-999,-999,-999
,2003-09-08T00:12:09Z,FK23,-23.6,150.79,40.2,-999,-999,-999,-999,-999,-999,-999,-999,-999,-999,-999,-999
,2003-09-08T00:12:09Z,FK23,-23.6,150.79,40.4,-999,-999,-999,-999,-999,-999,-999,-999,-999,-999,-999,-999
,2003-09-08T00:12:09Z,FK23,-23.6,150.79,40.6,-999,-999,-999,-999,-999,-999,-999,-999,-999,-999,-999,-999
,2003-09-08T00:12:09Z,FK23,-23.6,150.79,40.8,-999,-999,-999,-999,-999,-999,-999,-999,-999,-999,-999,-999
,2003-09-08T00:12:09Z,FK23,-23.6,150.79,41,-999,-999,-999,-999,-999,-999,-999,-999,-999,-999,-999,-999
,2003-09-08T00:12:09Z,FK23,-23.6,150.79,41.2,-999,-999,-999,-999,-999,-999,-999,-999,-999,-999,-999,-999
,2003-09-08T00:12:09Z,FK23,-23.6,150.79,41.4,-999,-999,-999,-999,-999,-999,-999,-999,-999,-999,-999,-999
,2003-09-08T00:12:09Z,FK23,-23.6,150.79,41.6,-999,-999,-999,-999,-999,-999,-999,-999,-999,-999,-999,-999
,2003-09-08T00:12:09Z,FK23,-23.6,150.79,41.8,-999,-999,-999,-999,-999,-999,-999,-999,-999,-999,-999,-999
,2003-09-08T00:12:09Z,FK23,-23.6,150.79,42,-999,-999,-999,-999,-999,-999,-999,-999,-999,-999,-999,-999
,2003-09-08T00:12:09Z,FK23,-23.6,150.79,42.2,-999,-999,-999,-999,-999,-999,-999,-999,-999,-999,-999,-999
,2003-09-08T00:12:09Z,FK23,-23.6,150.79,42.4,-999,-999,-999,-999,-999,-999,-999,-999,-999,-999,-999,-999
,2003-09-08T00:12:09Z,FK23,-23.6,150.79,42.6,-999,-999,-999,-999,-999,-999,-999,-999,-999,-999,-999,-999
,2003-09-08T00:12:09Z,FK23,-23.6,150.79,42.8,-999,-999,-999,-999,-999,-999,-999,-999,-999,-999,-999,-999
,2003-09-08T00:12:09Z,FK23,-23.6,150.79,43,-999,-999,-999,-999,-999,-999,-999,-999,-999,-999,-999,-999
,2003-09-08T00:12:09Z,FK23,-23.6,150.79,43.2,-999,-999,-999,-999,-999,-999,-999,-999,-999,-999,-999,-999
,2003-09-08T00:12:09Z,FK23,-23.6,150.79,43.4,-999,-999,-999,-999,-999,-999,-999,-999,-999,-999,-999,-999
,2003-09-08T00:12:09Z,FK23,-23.6,150.79,43.6,-999,-999,-999,-999,-999,-999,-999,-999,-999,-999,-999,-999
,2003-09-08T00:12:10Z,FK23,-23.6,150.79,43.8,-999,-999,-999,-999,-999,-999,-999,-999,-999,-999,-999,-999
,2003-09-08T00:12:10Z,FK23,-23.6,150.79,44,-999,-999,-999,-999,-999,-999,-999,-999,-999,-999,-999,-999
,2003-09-08T00:12:10Z,FK23,-23.6,150.79,44.2,-999,-999,-999,-999,-999,-999,-999,-999,-999,-999,-999,-999
,2003-09-08T00:12:10Z,FK23,-23.6,150.79,44.4,-999,-999,-999,-999,-999,-999,-999,-999,-999,-999,-999,-999
,2003-09-08T00:12:10Z,FK23,-23.6,150.79,44.6,-999,-999,-999,-999,-999,-999,-999,-999,-999,-999,-999,-999
,2003-09-08T00:12:10Z,FK23,-23.6,150.79,44.8,-999,-999,-999,-999,-999,-999,-999,-999,-999,-999,-999,-999
,2003-09-08T00:12:10Z,FK23,-23.6,150.79,45,-999,-999,-999,-999,-999,-999,-999,-999,-999,-999,-999,-999
,2003-09-08T00:12:10Z,FK23,-23.6,150.79,45.2,-999,-999,-999,-999,-999,-999,-999,-999,-999,-999,-999,-999
,2003-09-08T00:12:10Z,FK23,-23.6,150.79,45.4,-999,-999,-999,-999,-999,-999,-999,-999,-999,-999,-999,-999
,2003-09-08T00:12:10Z,FK23,-23.6,150.79,45.6,-999,-999,-999,-999,-999,-999,-999,-999,-999,-999,-999,-999
,2003-09-08T00:12:10Z,FK23,-23.6,150.79,45.8,-999,-999,-999,-999,-999,-999,-999,-999,-999,-999,-999,-999
,2003-09-08T00:12:10Z,FK23,-23.6,150.79,46,-999,-999,-999,-999,-999,-999,-999,-999,-999,-999,-999,-999
,2003-09-08T00:12:10Z,FK23,-23.6,150.79,46.2,-999,-999,-999,-999,-999,-999,-999,-999,-999,-999,-999,-999
,2003-09-08T00:12:10Z,FK23,-23.6,150.79,46.4,-999,-999,-999,-999,-999,-999,-999,-999,-999,-999,-999,-999
,2003-09-08T00:12:10Z,FK23,-23.6,150.79,46.6,-999,-999,-999,-999,-999,-999,-999,-999,-999,-999,-999,-999
,2003-09-08T00:12:10Z,FK23,-23.6,150.79,46.8,-999,-999,-999,-999,-999,-999,-999,-999,-999,-999,-999,-999
,2003-09-08T00:12:10Z,FK23,-23.6,150.79,47,-999,-999,-999,-999,-999,-999,-999,-999,-999,-999,-999,-999
,2003-09-08T00:12:10Z,FK23,-23.6,150.79,47.2,-999,-999,-999,-999,-999,-999,-999,-999,-999,-999,-999,-999
,2003-09-08T00:12:10Z,FK23,-23.6,150.79,47.4,-999,-999,-999,-999,-999,-999,-999,-999,-999,-999,-999,-999
,2003-09-08T00:12:10Z,FK23,-23.6,150.79,47.6,-999,-999,-999,-999,-999,-999,-999,-999,-999,-999,-999,-999
,2003-09-08T00:12:10Z,FK23,-23.6,150.79,47.8,-999,-999,-999,-999,-999,-999,-999,-999,-999,-999,-999,-999
,2003-09-08T00:12:10Z,FK23,-23.6,150.79,48,-999,-999,-999,-999,-999,-999,-999,-999,-999,-999,-999,-999
,2003-09-08T00:12:10Z,FK23,-23.6,150.79,48.2,-999,-999,-999,-999,-999,-999,-999,-999,-999,-999,-999,-999
,2003-09-08T00:12:10Z,FK23,-23.6,150.79,48.4,-999,-999,-999,-999,-999,-999,-999,-999,-999,-999,-999,-999
,2003-09-08T00:12:10Z,FK23,-23.6,150.79,48.6,-999,-999,-999,-999,-999,-999,-999,-999,-999,-999,-999,-999
,2003-09-08T00:12:10Z,FK23,-23.6,150.79,48.8,-999,-999,-999,-999,-999,-999,-999,-999,-999,-999,-999,-999
,2003-09-08T00:12:11Z,FK23,-23.6,150.79,49,-999,-999,-999,-999,-999,-999,-999,-999,-999,-999,-999,-999
,2003-09-08T00:12:11Z,FK23,-23.6,150.79,49.2,-999,-999,-999,-999,-999,-999,-999,-999,-999,-999,-999,-999
,2003-09-08T00:12:11Z,FK23,-23.6,150.79,49.4,-999,-999,-999,-999,-999,-999,-999,-999,-999,-999,-999,-999
,2003-09-08T00:12:11Z,FK23,-23.6,150.79,49.6,-999,-999,-999,-999,-999,-999,-999,-999,-999,-999,-999,-999
,2003-09-08T00:12:11Z,FK23,-23.6,150.79,49.8,-999,-999,-999,-999,-999,-999,-999,-999,-999,-999,-999,-999
,2003-09-08T00:12:11Z,FK23,-23.6,150.79,50,-999,-999,-999,-999,-999,-999,-999,-999,-999,-999,-999,-999
,2003-09-08T00:12:11Z,FK23,-23.6,150.79,50.2,-999,-999,-999,-999,-999,-999,-999,-999,-999,-999,-999,-999
,2003-09-08T00:12:11Z,FK23,-23.6,150.79,50.4,-999,-999,-999,-999,-999,-999,-999,-999,-999,-999,-999,-999
,2003-09-08T00:12:11Z,FK23,-23.6,150.79,50.6,-999,-999,-999,-999,-999,-999,-999,-999,-999,-999,-999,-999
,2003-09-08T00:12:11Z,FK23,-23.6,150.79,50.8,-999,-999,-999,-999,-999,-999,-999,-999,-999,-999,-999,-999
,2003-09-08T00:12:11Z,FK23,-23.6,150.79,51,-999,-999,-999,-999,-999,-999,-999,-999,-999,-999,-999,-999
,2003-09-08T00:12:11Z,FK23,-23.6,150.79,51.2,-999,-999,-999,-999,-999,-999,-999,-999,-999,-999,-999,-999
,2003-09-08T00:12:11Z,FK23,-23.6,150.79,51.4,-999,-999,-999,-999,-999,-999,-999,-999,-999,-999,-999,-999
,2003-09-08T00:12:11Z,FK23,-23.6,150.79,51.6,-999,-999,-999,-999,-999,-999,-999,-999,-999,-999,-999,-999
,2003-09-08T00:12:11Z,FK23,-23.6,150.79,51.8,-999,-999,-999,-999,-999,-999,-999,-999,-999,-999,-999,-999
,2003-09-08T00:12:11Z,FK23,-23.6,150.79,52,-999,-999,-999,-999,-999,-999,-999,-999,-999,-999,-999,-999
,2003-09-08T00:12:11Z,FK23,-23.6,150.79,52.2,-999,-999,-999,-999,-999,-999,-999,-999,-999,-999,-999,-999
,2003-09-08T00:12:11Z,FK23,-23.6,150.79,52.4,-999,-999,-999,-999,-999,-999,-999,-999,-999,-999,-999,-999
,2003-09-08T00:12:11Z,FK23,-23.6,150.79,52.6,-999,-999,-999,-999,-999,-999,-999,-999,-999,-999,-999,-999
,2003-09-08T00:12:11Z,FK23,-23.6,150.79,52.8,-999,-999,-999,-999,-999,-999,-999,-999,-999,-999,-999,-999
,2003-09-08T00:12:11Z,FK23,-23.6,150.79,53,-999,-999,-999,-999,-999,-999,-999,-999,-999,-999,-999,-999
,2003-09-08T00:12:11Z,FK23,-23.6,150.79,53.2,-999,-999,-999,-999,-999,-999,-999,-999,-999,-999,-999,-999
,2003-09-08T00:12:11Z,FK23,-23.6,150.79,53.4,-999,-999,-999,-999,-999,-999,-999,-999,-999,-999,-999,-999
,2003-09-08T00:12:11Z,FK23,-23.6,150.79,53.6,-999,-999,-999,-999,-999,-999,-999,-999,-999,-999,-999,-999
,2003-09-08T00:12:11Z,FK23,-23.6,150.79,53.8,-999,-999,-999,-999,-999,-999,-999,-999,-999,-999,-999,-999
,2003-09-08T00:12:12Z,FK23,-23.6,150.79,54,-999,-999,-999,-999,-999,-999,-999,-999,-999,-999,-999,-999
,2003-09-08T00:12:12Z,FK23,-23.6,150.79,54.2,-999,-999,-999,-999,-999,-999,-999,-999,-999,-999,-999,-999
,2003-09-08T00:12:12Z,FK23,-23.6,150.79,54.4,-999,-999,-999,-999,-999,-999,-999,-999,-999,-999,-999,-999
,2003-09-08T00:12:12Z,FK23,-23.6,150.79,54.6,-999,-999,-999,-999,-999,-999,-999,-999,-999,-999,-999,-999
,2003-09-08T00:12:12Z,FK23,-23.6,150.79,54.8,-999,-999,-999,-999,-999,-999,-999,-999,-999,-999,-999,-999
,2003-09-08T00:12:12Z,FK23,-23.6,150.79,55,-999,-999,-999,-999,-999,-999,-999,-999,-999,-999,-999,-999
,2003-09-08T00:12:12Z,FK23,-23.6,150.79,55.2,-999,-999,-999,-999,-999,-999,-999,-999,-999,-999,-999,-999
,2003-09-08T00:12:12Z,FK23,-23.6,150.79,55.4,-999,-999,-999,-999,-999,-999,-999,-999,-999,-999,-999,-999
,2003-09-08T00:12:12Z,FK23,-23.6,150.79,55.6,-999,-999,-999,-999,-999,-999,-999,-999,-999,-999,-999,-999
,2003-09-08T00:12:12Z,FK23,-23.6,150.79,55.8,-999,-999,-999,-999,-999,-999,-999,-999,-999,-999,-999,-999
,2003-09-08T00:12:12Z,FK23,-23.6,150.79,56,-999,-999,-999,-999,-999,-999,-999,-999,-999,-999,-999,-999
,2003-09-08T00:12:12Z,FK23,-23.6,150.79,56.2,-999,-999,-999,-999,-999,-999,-999,-999,-999,-999,-999,-999
,2003-09-08T00:12:12Z,FK23,-23.6,150.79,56.4,-999,-999,-999,-999,-999,-999,-999,-999,-999,-999,-999,-999
,2003-09-08T00:12:12Z,FK23,-23.6,150.79,56.6,-999,-999,-999,-999,-999,-999,-999,-999,-999,-999,-999,-999
,2003-09-08T00:12:12Z,FK23,-23.6,150.79,56.8,-999,-999,-999,-999,-999,-999,-999,-999,-999,-999,-999,-999
,2003-09-08T00:12:12Z,FK23,-23.6,150.79,57,-999,-999,-999,-999,-999,-999,-999,-999,-999,-999,-999,-999
,2003-09-08T00:12:12Z,FK23,-23.6,150.79,57.2,-999,-999,-999,-999,-999,-999,-999,-999,-999,-999,-999,-999
,2003-09-08T00:12:12Z,FK23,-23.6,150.79,57.4,-999,-999,-999,-999,-999,-999,-999,-999,-999,-999,-999,-999
,2003-09-08T00:12:12Z,FK23,-23.6,150.79,57.6,-999,-999,-999,-999,-999,-999,-999,-999,-999,-999,-999,-999
,2003-09-08T00:12:12Z,FK23,-23.6,150.79,57.8,-999,-999,-999,-999,-999,-999,-999,-999,-999,-999,-999,-999
,2003-09-08T00:12:12Z,FK23,-23.6,150.79,58,-999,-999,-999,-999,-999,-999,-999,-999,-999,-999,-999,-999
,2003-09-08T00:12:12Z,FK23,-23.6,150.79,58.2,-999,-999,-999,-999,-999,-999,-999,-999,-999,-999,-999,-999
,2003-09-08T00:12:12Z,FK23,-23.6,150.79,58.4,-999,-999,-999,-999,-999,-999,-999,-999,-999,-999,-999,-999
,2003-09-08T00:12:12Z,FK23,-23.6,150.79,58.6,-999,-999,-999,-999,-999,-999,-999,-999,-999,-999,-999,-999
,2003-09-08T00:12:12Z,FK23,-23.6,150.79,58.8,-999,-999,-999,-999,-999,-999,-999,-999,-999,-999,-999,-999
,2003-09-08T00:12:12Z,FK23,-23.6,150.79,59,-999,-999,-999,-999,-999,-999,-999,-999,-999,-999,-999,-999
,2003-09-08T00:12:13Z,FK23,-23.6,150.79,59.2,-999,-999,-999,-999,-999,-999,-999,-999,-999,-999,-999,-999
,2003-09-08T00:12:13Z,FK23,-23.6,150.79,59.4,-999,-999,-999,-999,-999,-999,-999,-999,-999,-999,-999,-999
,2003-09-08T00:12:13Z,FK23,-23.6,150.79,59.6,-999,-999,-999,-999,-999,-999,-999,-999,-999,-999,-999,-999
,2003-09-08T00:12:13Z,FK23,-23.6,150.79,59.8,-999,-999,-999,-999,-999,-999,-999,-999,-999,-999,-999,-999
,2003-09-08T00:12:13Z,FK23,-23.6,150.79,60,-999,-999,-999,-999,-999,-999,-999,-999,-999,-999,-999,-999
,2003-09-08T00:12:13Z,FK23,-23.6,150.79,60.2,-999,-999,-999,-999,-999,-999,-999,-999,-999,-999,-999,-999
,2003-09-08T00:12:13Z,FK23,-23.6,150.79,60.4,-999,-999,-999,-999,-999,-999,-999,-999,-999,-999,-999,-999
,2003-09-08T00:12:13Z,FK23,-23.6,150.79,60.6,-999,-999,-999,-999,-999,-999,-999,-999,-999,-999,-999,-999
,2003-09-08T00:12:13Z,FK23,-23.6,150.79,60.8,-999,-999,-999,-999,-999,-999,-999,-999,-999,-999,-999,-999
,2003-09-08T00:12:13Z,FK23,-23.6,150.79,61,-999,-999,-999,-999,-999,-999,-999,-999,-999,-999,-999,-999
,2003-09-08T00:12:13Z,FK23,-23.6,150.79,61.2,-999,-999,-999,-999,-999,-999,-999,-999,-999,-999,-999,-999
,2003-09-08T00:12:13Z,FK23,-23.6,150.79,61.4,-999,-999,-999,-999,-999,-999,-999,-999,-999,-999,-999,-999
,2003-09-08T00:12:13Z,FK23,-23.6,150.79,61.6,-999,-999,-999,-999,-999,-999,-999,-999,-999,-999,-999,-999
,2003-09-08T00:12:13Z,FK23,-23.6,150.79,61.8,-999,-999,-999,-999,-999,-999,-999,-999,-999,-999,-999,-999
,2003-09-08T00:12:13Z,FK23,-23.6,150.79,62,-999,-999,-999,-999,-999,-999,-999,-999,-999,-999,-999,-999
,2003-09-08T00:12:13Z,FK23,-23.6,150.79,62.2,-999,-999,-999,-999,-999,-999,-999,-999,-999,-999,-999,-999
,2003-09-08T00:12:13Z,FK23,-23.6,150.79,62.4,-999,-999,-999,-999,-999,-999,-999,-999,-999,-999,-999,-999
,2003-09-08T00:12:13Z,FK23,-23.6,150.79,62.6,-999,-999,-999,-999,-999,-999,-999,-999,-999,-999,-999,-999
,2003-09-08T00:12:13Z,FK23,-23.6,150.79,62.8,-999,-999,-999,-999,-999,-999,-999,-999,-999,-999,-999,-999
,2003-09-08T00:12:13Z,FK23,-23.6,150.79,63,-999,-999,-999,-999,-999,-999,-999,-999,-999,-999,-999,-999
,2003-09-08T00:12:13Z,FK23,-23.6,150.79,63.2,-999,-999,-999,-999,-999,-999,-999,-999,-999,-999,-999,-999
,2003-09-08T00:12:13Z,FK23,-23.6,150.79,63.4,-999,-999,-999,-999,-999,-999,-999,-999,-999,-999,-999,-999
,2003-09-08T00:12:13Z,FK23,-23.6,150.79,63.6,-999,-999,-999,-999,-999,-999,-999,-999,-999,-999,-999,-999
,2003-09-08T00:12:13Z,FK23,-23.6,150.79,63.8,-999,-999,-999,-999,-999,-999,-999,-999,-999,-999,-999,-999
,2003-09-08T00:12:13Z,FK23,-23.6,150.79,64,-999,-999,-999,-999,-999,-999,-999,-999,-999,-999,-999,-999
,2003-09-08T00:12:13Z,FK23,-23.6,150.79,64.2,-999,-999,-999,-999,-999,-999,-999,-999,-999,-999,-999,-999
,2003-09-08T00:12:14Z,FK23,-23.6,150.79,64.4,-999,-999,-999,-999,-999,-999,-999,-999,-999,-999,-999,-999
,2003-09-08T00:12:14Z,FK23,-23.6,150.79,64.6,-999,-999,-999,-999,-999,-999,-999,-999,-999,-999,-999,-999
,2003-09-08T00:12:14Z,FK23,-23.6,150.79,64.8,-999,-999,-999,-999,-999,-999,-999,-999,-999,-999,-999,-999
,2003-09-08T00:12:14Z,FK23,-23.6,150.79,65,-999,-999,-999,-999,-999,-999,-999,-999,-999,-999,-999,-999
,2003-09-08T00:12:14Z,FK23,-23.6,150.79,65.2,-999,-999,-999,-999,-999,-999,-999,-999,-999,-999,-999,-999
,2003-09-08T00:12:14Z,FK23,-23.6,150.79,65.4,-999,-999,-999,-999,-999,-999,-999,-999,-999,-999,-999,-999
,2003-09-08T00:12:14Z,FK23,-23.6,150.79,65.6,-999,-999,-999,-999,-999,-999,-999,-999,-999,-999,-999,-999
,2003-09-08T00:12:14Z,FK23,-23.6,150.79,65.8,-999,-999,-999,-999,-999,-999,-999,-999,-999,-999,-999,-999
,2003-09-08T00:12:14Z,FK23,-23.6,150.79,66,-999,-999,-999,-999,-999,-999,-999,-999,-999,-999,-999,-999
,2003-09-08T00:12:14Z,FK23,-23.6,150.79,66.2,-999,-999,-999,-999,-999,-999,-999,-999,-999,-999,-999,-999
,2003-09-08T00:12:14Z,FK23,-23.6,150.79,66.4,-999,-999,-999,-999,-999,-999,-999,-999,-999,-999,-999,-999
,2003-09-08T00:12:14Z,FK23,-23.6,150.79,66.6,-999,-999,-999,-999,-999,-999,-999,-999,-999,-999,-999,-999
,2003-09-08T00:12:14Z,FK23,-23.6,150.79,66.8,-999,-999,-999,-999,-999,-999,-999,-999,-999,-999,-999,-999
,2003-09-08T00:12:14Z,FK23,-23.6,150.79,67,-999,-999,-999,-999,-999,-999,-999,-999,-999,-999,-999,-999
,2003-09-08T00:12:14Z,FK23,-23.6,150.79,67.2,-999,-999,-999,-999,-999,-999,-999,-999,-999,-999,-999,-999
,2003-09-08T00:12:14Z,FK23,-23.6,150.79,67.4,-999,-999,-999,-999,-999,-999,-999,-999,-999,-999,-999,-999
,2003-09-08T00:12:14Z,FK23,-23.6,150.79,67.6,-999,-999,-999,-999,-999,-999,-999,-999,-999,-999,-999,-999
,2003-09-08T00:12:14Z,FK23,-23.6,150.79,67.8,-999,-999,-999,-999,-999,-999,-999,-999,-999,-999,-999,-999
,2003-09-08T00:12:14Z,FK23,-23.6,150.79,68,-999,-999,-999,-999,-999,-999,-999,-999,-999,-999,-999,-999
,2003-09-08T00:12:14Z,FK23,-23.6,150.79,68.2,-999,-999,-999,-999,-999,-999,-999,-999,-999,-999,-999,-999
,2003-09-08T00:12:14Z,FK23,-23.6,150.79,68.4,-999,-999,-999,-999,-999,-999,-999,-999,-999,-999,-999,-999
,2003-09-08T00:12:14Z,FK23,-23.6,150.79,68.6,-999,-999,-999,-999,-999,-999,-999,-999,-999,-999,-999,-999
,2003-09-08T00:12:14Z,FK23,-23.6,150.79,68.8,-999,-999,-999,-999,-999,-999,-999,-999,-999,-999,-999,-999
,2003-09-08T00:12:14Z,FK23,-23.6,150.79,69,-999,-999,-999,-999,-999,-999,-999,-999,-999,-999,-999,-999
,2003-09-08T00:12:14Z,FK23,-23.6,150.79,69.2,-999,-999,-999,-999,-999,-999,-999,-999,-999,-999,-999,-999
,2003-09-08T00:12:15Z,FK23,-23.6,150.79,69.4,-999,-999,-999,-999,-999,-999,-999,-999,-999,-999,-999,-999
,2003-09-08T00:12:15Z,FK23,-23.6,150.79,69.6,-999,-999,-999,-999,-999,-999,-999,-999,-999,-999,-999,-999
,2003-09-08T00:12:15Z,FK23,-23.6,150.79,69.8,-999,-999,-999,-999,-999,-999,-999,-999,-999,-999,-999,-999
,2003-09-08T00:12:15Z,FK23,-23.6,150.79,70,-999,-999,-999,-999,-999,-999,-999,-999,-999,-999,-999,-999
,2003-09-08T00:12:15Z,FK23,-23.6,150.79,70.2,-999,-999,-999,-999,-999,-999,-999,-999,-999,-999,-999,-999
,2003-09-08T00:12:15Z,FK23,-23.6,150.79,70.4,-999,-999,-999,-999,-999,-999,-999,-999,-999,-999,-999,-999
,2003-09-08T00:12:15Z,FK23,-23.6,150.79,70.6,-999,-999,-999,-999,-999,-999,-999,-999,-999,-999,-999,-999
,2003-09-08T00:12:15Z,FK23,-23.6,150.79,70.8,-999,-999,-999,-999,-999,-999,-999,-999,-999,-999,-999,-999
,2003-09-08T00:12:15Z,FK23,-23.6,150.79,71,-999,-999,-999,-999,-999,-999,-999,-999,-999,-999,-999,-999
,2003-09-08T00:12:15Z,FK23,-23.6,150.79,71.2,-999,-999,-999,-999,-999,-999,-999,-999,-999,-999,-999,-999
,2003-09-08T00:12:15Z,FK23,-23.6,150.79,71.4,-999,-999,-999,-999,-999,-999,-999,-999,-999,-999,-999,-999
,2003-09-08T00:12:15Z,FK23,-23.6,150.79,71.6,-999,-999,-999,-999,-999,-999,-999,-999,-999,-999,-999,-999
,2003-09-08T00:12:15Z,FK23,-23.6,150.79,71.8,-999,-999,-999,-999,-999,-999,-999,-999,-999,-999,-999,-999
,2003-09-08T00:12:15Z,FK23,-23.6,150.79,72,-999,-999,-999,-999,-999,-999,-999,-999,-999,-999,-999,-999
,2003-09-08T00:12:15Z,FK23,-23.6,150.79,72.2,-999,-999,-999,-999,-999,-999,-999,-999,-999,-999,-999,-999
,2003-09-08T00:12:15Z,FK23,-23.6,150.79,72.4,-999,-999,-999,-999,-999,-999,-999,-999,-999,-999,-999,-999
,2003-09-08T00:12:15Z,FK23,-23.6,150.79,72.6,-999,-999,-999,-999,-999,-999,-999,-999,-999,-999,-999,-999
,2003-09-08T00:12:15Z,FK23,-23.6,150.79,72.8,-999,-999,-999,-999,-999,-999,-999,-999,-999,-999,-999,-999
,2003-09-08T00:12:15Z,FK23,-23.6,150.79,73,-999,-999,-999,-999,-999,-999,-999,-999,-999,-999,-999,-999
,2003-09-08T00:12:15Z,FK23,-23.6,150.79,73.2,-999,-999,-999,-999,-999,-999,-999,-999,-999,-999,-999,-999
,2003-09-08T00:12:15Z,FK23,-23.6,150.79,73.4,-999,-999,-999,-999,-999,-999,-999,-999,-999,-999,-999,-999
,2003-09-08T00:12:15Z,FK23,-23.6,150.79,73.6,-999,-999,-999,-999,-999,-999,-999,-999,-999,-999,-999,-999
,2003-09-08T00:12:15Z,FK23,-23.6,150.79,73.8,-999,-999,-999,-999,-999,-999,-999,-999,-999,-999,-999,-999
,2003-09-08T00:12:15Z,FK23,-23.6,150.79,74,-999,-999,-999,-999,-999,-999,-999,-999,-999,-999,-999,-999
,2003-09-08T00:12:15Z,FK23,-23.6,150.79,74.2,-999,-999,-999,-999,-999,-999,-999,-999,-999,-999,-999,-999
,2003-09-08T00:12:15Z,FK23,-23.6,150.79,74.4,-999,-999,-999,-999,-999,-999,-999,-999,-999,-999,-999,-999
,2003-09-08T00:12:16Z,FK23,-23.6,150.79,74.6,-999,-999,-999,-999,-999,-999,-999,-999,-999,-999,-999,-999
,2003-09-08T00:12:16Z,FK23,-23.6,150.79,74.8,-999,-999,-999,-999,-999,-999,-999,-999,-999,-999,-999,-999
,2003-09-08T00:12:16Z,FK23,-23.6,150.79,75,-999,-999,-999,-999,-999,-999,-999,-999,-999,-999,-999,-999
,2003-09-08T00:12:16Z,FK23,-23.6,150.79,75.2,-999,-999,-999,-999,-999,-999,-999,-999,-999,-999,-999,-999
,2003-09-08T00:12:16Z,FK23,-23.6,150.79,75.4,-999,-999,-999,-999,-999,-999,-999,-999,-999,-999,-999,-999
,2003-09-08T00:12:16Z,FK23,-23.6,150.79,75.6,-999,-999,-999,-999,-999,-999,-999,-999,-999,-999,-999,-999
,2003-09-08T00:12:16Z,FK23,-23.6,150.79,75.8,-999,-999,-999,-999,-999,-999,-999,-999,-999,-999,-999,-999
,2003-09-08T00:12:16Z,FK23,-23.6,150.79,76,-999,-999,-999,-999,-999,-999,-999,-999,-999,-999,-999,-999
,2003-09-08T00:12:16Z,FK23,-23.6,150.79,76.2,-999,-999,-999,-999,-999,-999,-999,-999,-999,-999,-999,-999
,2003-09-08T00:12:16Z,FK23,-23.6,150.79,76.4,-999,-999,-999,-999,-999,-999,-999,-999,-999,-999,-999,-999
,2003-09-08T00:12:16Z,FK23,-23.6,150.79,76.6,-999,-999,-999,-999,-999,-999,-999,-999,-999,-999,-999,-999
,2003-09-08T00:12:16Z,FK23,-23.6,150.79,76.8,-999,-999,-999,-999,-999,-999,-999,-999,-999,-999,-999,-999
,2003-09-08T00:12:16Z,FK23,-23.6,150.79,77,-999,-999,-999,-999,-999,-999,-999,-999,-999,-999,-999,-999
,2003-09-08T00:12:16Z,FK23,-23.6,150.79,77.2,-999,-999,-999,-999,-999,-999,-999,-999,-999,-999,-999,-999
,2003-09-08T00:12:16Z,FK23,-23.6,150.79,77.4,-999,-999,-999,-999,-999,-999,-999,-999,-999,-999,-999,-999
,2003-09-08T00:12:16Z,FK23,-23.6,150.79,77.6,-999,-999,-999,-999,-999,-999,-999,-999,-999,-999,-999,-999
,2003-09-08T00:12:16Z,FK23,-23.6,150.79,77.8,-999,-999,-999,-999,-999,-999,-999,-999,-999,-999,-999,-999
,2003-09-08T00:12:16Z,FK23,-23.6,150.79,78,-999,-999,-999,-999,-999,-999,-999,-999,-999,-999,-999,-999
,2003-09-08T00:12:16Z,FK23,-23.6,150.79,78.2,-999,-999,-999,-999,-999,-999,-999,-999,-999,-999,-999,-999
,2003-09-08T00:12:16Z,FK23,-23.6,150.79,78.4,-999,-999,-999,-999,-999,-999,-999,-999,-999,-999,-999,-999
,2003-09-08T00:12:16Z,FK23,-23.6,150.79,78.6,-999,-999,-999,-999,-999,-999,-999,-999,-999,-999,-999,-999
,2003-09-08T00:12:16Z,FK23,-23.6,150.79,78.8,-999,-999,-999,-999,-999,-999,-999,-999,-999,-999,-999,-999
,2003-09-08T00:12:16Z,FK23,-23.6,150.79,79,-999,-999,-999,-999,-999,-999,-999,-999,-999,-999,-999,-999
,2003-09-08T00:12:16Z,FK23,-23.6,150.79,79.2,-999,-999,-999,-999,-999,-999,-999,-999,-999,-999,-999,-999
,2003-09-08T00:12:16Z,FK23,-23.6,150.79,79.4,-999,-999,-999,-999,-999,-999,-999,-999,-999,-999,-999,-999
,2003-09-08T00:12:16Z,FK23,-23.6,150.79,79.6,-999,-999,-999,-999,-999,-999,-999,-999,-999,-999,-999,-999
,2003-09-08T00:12:17Z,FK23,-23.6,150.79,79.8,-999,-999,-999,-999,-999,-999,-999,-999,-999,-999,-999,-999
,2003-09-08T00:12:17Z,FK23,-23.6,150.79,80,-999,-999,-999,-999,-999,-999,-999,-999,-999,-999,-999,-999
,2003-09-08T00:12:17Z,FK23,-23.6,150.79,80.2,-999,-999,-999,-999,-999,-999,-999,-999,-999,-999,-999,-999
,2003-09-08T00:12:17Z,FK23,-23.6,150.79,80.4,-999,-999,-999,-999,-999,-999,-999,-999,-999,-999,-999,-999
,2003-09-08T00:12:17Z,FK23,-23.6,150.79,80.6,-999,-999,-999,-999,-999,-999,-999,-999,-999,-999,-999,-999
,2003-09-08T00:12:17Z,FK23,-23.6,150.79,80.8,-999,-999,-999,-999,-999,-999,-999,-999,-999,-999,-999,-999
,2003-09-08T00:12:17Z,FK23,-23.6,150.79,81,-999,-999,-999,-999,-999,-999,-999,-999,-999,-999,-999,-999
,2003-09-08T00:12:17Z,FK23,-23.6,150.79,81.2,-999,-999,-999,-999,-999,-999,-999,-999,-999,-999,-999,-999
,2003-09-08T00:12:17Z,FK23,-23.6,150.79,81.4,-999,-999,-999,-999,-999,-999,-999,-999,-999,-999,-999,-999
,2003-09-08T00:12:17Z,FK23,-23.6,150.79,81.6,-999,-999,-999,-999,-999,-999,-999,-999,-999,-999,-999,-999
,2003-09-08T00:12:17Z,FK23,-23.6,150.79,81.8,-999,-999,-999,-999,-999,-999,-999,-999,-999,-999,-999,-999
,2003-09-08T00:12:17Z,FK23,-23.6,150.79,82,-999,-999,-999,-999,-999,-999,-999,-999,-999,-999,-999,-999
,2003-09-08T00:12:17Z,FK23,-23.6,150.79,82.2,-999,-999,-999,-999,-999,-999,-999,-999,-999,-999,-999,-999
,2003-09-08T00:12:17Z,FK23,-23.6,150.79,82.4,-999,-999,-999,-999,-999,-999,-999,-999,-999,-999,-999,-999
,2003-09-08T00:12:17Z,FK23,-23.6,150.79,82.6,-999,-999,-999,-999,-999,-999,-999,-999,-999,-999,-999,-999
,2003-09-08T00:12:17Z,FK23,-23.6,150.79,82.8,-999,-999,-999,-999,-999,-999,-999,-999,-999,-999,-999,-999
,2003-09-08T00:12:17Z,FK23,-23.6,150.79,83,-999,-999,-999,-999,-999,-999,-999,-999,-999,-999,-999,-999
,2003-09-08T00:12:17Z,FK23,-23.6,150.79,83.2,-999,-999,-999,-999,-999,-999,-999,-999,-999,-999,-999,-999
,2003-09-08T00:12:17Z,FK23,-23.6,150.79,83.4,-999,-999,-999,-999,-999,-999,-999,-999,-999,-999,-999,-999
,2003-09-08T00:12:17Z,FK23,-23.6,150.79,83.6,-999,-999,-999,-999,-999,-999,-999,-999,-999,-999,-999,-999
,2003-09-08T00:12:17Z,FK23,-23.6,150.79,83.8,-999,-999,-999,-999,-999,-999,-999,-999,-999,-999,-999,-999
,2003-09-08T00:12:17Z,FK23,-23.6,150.79,84,-999,-999,-999,-999,-999,-999,-999,-999,-999,-999,-999,-999
,2003-09-08T00:12:17Z,FK23,-23.6,150.79,84.2,-999,-999,-999,-999,-999,-999,-999,-999,-999,-999,-999,-999
,2003-09-08T00:12:17Z,FK23,-23.6,150.79,84.4,-999,-999,-999,-999,-999,-999,-999,-999,-999,-999,-999,-999
,2003-09-08T00:12:17Z,FK23,-23.6,150.79,84.6,-999,-999,-999,-999,-999,-999,-999,-999,-999,-999,-999,-999
,2003-09-08T00:12:18Z,FK23,-23.6,150.79,84.8,-999,-999,-999,-999,-999,-999,-999,-999,-999,-999,-999,-999
,2003-09-08T00:12:18Z,FK23,-23.6,150.79,85,-999,-999,-999,-999,-999,-999,-999,-999,-999,-999,-999,-999
,2003-09-08T00:12:18Z,FK23,-23.6,150.79,85.2,-999,-999,-999,-999,-999,-999,-999,-999,-999,-999,-999,-999
,2003-09-08T00:12:18Z,FK23,-23.6,150.79,85.4,-999,-999,-999,-999,-999,-999,-999,-999,-999,-999,-999,-999
,2003-09-08T00:12:18Z,FK23,-23.6,150.79,85.6,-999,-999,-999,-999,-999,-999,-999,-999,-999,-999,-999,-999
,2003-09-08T00:12:18Z,FK23,-23.6,150.79,85.8,-999,-999,-999,-999,-999,-999,-999,-999,-999,-999,-999,-999
,2003-09-08T00:12:18Z,FK23,-23.6,150.79,86,-999,-999,-999,-999,-999,-999,-999,-999,-999,-999,-999,-999
,2003-09-08T00:12:18Z,FK23,-23.6,150.79,86.2,-999,-999,-999,-999,-999,-999,-999,-999,-999,-999,-999,-999
,2003-09-08T00:12:18Z,FK23,-23.6,150.79,86.4,-999,-999,-999,-999,-999,-999,-999,-999,-999,-999,-999,-999
,2003-09-08T00:12:18Z,FK23,-23.6,150.79,86.6,-999,-999,-999,-999,-999,-999,-999,-999,-999,-999,-999,-999
,2003-09-08T00:12:18Z,FK23,-23.6,150.79,86.8,-999,-999,-999,-999,-999,-999,-999,-999,-999,-999,-999,-999
,2003-09-08T00:12:18Z,FK23,-23.6,150.79,87,-999,-999,-999,-999,-999,-999,-999,-999,-999,-999,-999,-999
,2003-09-08T00:12:18Z,FK23,-23.6,150.79,87.2,-999,-999,-999,-999,-999,-999,-999,-999,-999,-999,-999,-999
,2003-09-08T00:12:18Z,FK23,-23.6,150.79,87.4,-999,-999,-999,-999,-999,-999,-999,-999,-999,-999,-999,-999
,2003-09-08T00:12:18Z,FK23,-23.6,150.79,87.6,-999,-999,-999,-999,-999,-999,-999,-999,-999,-999,-999,-999
,2003-09-08T00:12:18Z,FK23,-23.6,150.79,87.8,-999,-999,-999,-999,-999,-999,-999,-999,-999,-999,-999,-999
,2003-09-08T00:12:18Z,FK23,-23.6,150.79,88,-999,-999,-999,-999,-999,-999,-999,-999,-999,-999,-999,-999
,2003-09-08T00:12:18Z,FK23,-23.6,150.79,88.2,-999,-999,-999,-999,-999,-999,-999,-999,-999,-999,-999,-999
,2003-09-08T00:12:18Z,FK23,-23.6,150.79,88.4,-999,-999,-999,-999,-999,-999,-999,-999,-999,-999,-999,-999
,2003-09-08T00:12:18Z,FK23,-23.6,150.79,88.6,-999,-999,-999,-999,-999,-999,-999,-999,-999,-999,-999,-999
,2003-09-08T00:12:18Z,FK23,-23.6,150.79,88.8,-999,-999,-999,-999,-999,-999,-999,-999,-999,-999,-999,-999
,2003-09-08T00:12:18Z,FK23,-23.6,150.79,89,-999,-999,-999,-999,-999,-999,-999,-999,-999,-999,-999,-999
,2003-09-08T00:12:18Z,FK23,-23.6,150.79,89.2,-999,-999,-999,-999,-999,-999,-999,-999,-999,-999,-999,-999
,2003-09-08T00:12:18Z,FK23,-23.6,150.79,89.4,-999,-999,-999,-999,-999,-999,-999,-999,-999,-999,-999,-999
,2003-09-08T00:12:18Z,FK23,-23.6,150.79,89.6,-999,-999,-999,-999,-999,-999,-999,-999,-999,-999,-999,-999
,2003-09-08T00:12:18Z,FK23,-23.6,150.79,89.8,-999,-999,-999,-999,-999,-999,-999,-999,-999,-999,-999,-999
,2003-09-08T00:12:19Z,FK23,-23.6,150.79,90,-999,-999,-999,-999,-999,-999,-999,-999,-999,-999,-999,-999
,2003-09-08T00:12:19Z,FK23,-23.6,150.79,90.2,-999,-999,-999,-999,-999,-999,-999,-999,-999,-999,-999,-999
,2003-09-08T00:12:19Z,FK23,-23.6,150.79,90.4,-999,-999,-999,-999,-999,-999,-999,-999,-999,-999,-999,-999
,2003-09-08T00:12:19Z,FK23,-23.6,150.79,90.6,-999,-999,-999,-999,-999,-999,-999,-999,-999,-999,-999,-999
,2003-09-08T00:12:19Z,FK23,-23.6,150.79,90.8,-999,-999,-999,-999,-999,-999,-999,-999,-999,-999,-999,-999
,2003-09-08T00:12:19Z,FK23,-23.6,150.79,91,-999,-999,-999,-999,-999,-999,-999,-999,-999,-999,-999,-999
,2003-09-08T00:12:19Z,FK23,-23.6,150.79,91.2,-999,-999,-999,-999,-999,-999,-999,-999,-999,-999,-999,-999
,2003-09-08T00:12:19Z,FK23,-23.6,150.79,91.4,-999,-999,-999,-999,-999,-999,-999,-999,-999,-999,-999,-999
,2003-09-08T00:12:19Z,FK23,-23.6,150.79,91.6,-999,-999,-999,-999,-999,-999,-999,-999,-999,-999,-999,-999
,2003-09-08T00:12:19Z,FK23,-23.6,150.79,91.8,-999,-999,-999,-999,-999,-999,-999,-999,-999,-999,-999,-999
,2003-09-08T00:12:19Z,FK23,-23.6,150.79,92,-999,-999,-999,-999,-999,-999,-999,-999,-999,-999,-999,-999
,2003-09-08T00:12:19Z,FK23,-23.6,150.79,92.2,-999,-999,-999,-999,-999,-999,-999,-999,-999,-999,-999,-999
,2003-09-08T00:12:19Z,FK23,-23.6,150.79,92.4,-999,-999,-999,-999,-999,-999,-999,-999,-999,-999,-999,-999
,2003-09-08T00:12:19Z,FK23,-23.6,150.79,92.6,-999,-999,-999,-999,-999,-999,-999,-999,-999,-999,-999,-999
,2003-09-08T00:12:19Z,FK23,-23.6,150.79,92.8,-999,-999,-999,-999,-999,-999,-999,-999,-999,-999,-999,-999
,2003-09-08T00:12:19Z,FK23,-23.6,150.79,93,-999,-999,-999,-999,-999,-999,-999,-999,-999,-999,-999,-999
,2003-09-08T00:12:19Z,FK23,-23.6,150.79,93.2,-999,-999,-999,-999,-999,-999,-999,-999,-999,-999,-999,-999
,2003-09-08T00:12:19Z,FK23,-23.6,150.79,93.4,-999,-999,-999,-999,-999,-999,-999,-999,-999,-999,-999,-999
,2003-09-08T00:12:19Z,FK23,-23.6,150.79,93.6,-999,-999,-999,-999,-999,-999,-999,-999,-999,-999,-999,-999
,2003-09-08T00:12:19Z,FK23,-23.6,150.79,93.8,-999,-999,-999,-999,-999,-999,-999,-999,-999,-999,-999,-999
,2003-09-08T00:12:19Z,FK23,-23.6,150.79,94,-999,-999,-999,-999,-999,-999,-999,-999,-999,-999,-999,-999
,2003-09-08T00:12:19Z,FK23,-23.6,150.79,94.2,-999,-999,-999,-999,-999,-999,-999,-999,-999,-999,-999,-999
,2003-09-08T00:12:19Z,FK23,-23.6,150.79,94.4,-999,-999,-999,-999,-999,-999,-999,-999,-999,-999,-999,-999
,2003-09-08T00:12:19Z,FK23,-23.6,150.79,94.6,-999,-999,-999,-999,-999,-999,-999,-999,-999,-999,-999,-999
,2003-09-08T00:12:19Z,FK23,-23.6,150.79,94.8,-999,-999,-999,-999,-999,-999,-999,-999,-999,-999,-999,-999
,2003-09-08T00:12:19Z,FK23,-23.6,150.79,95,-999,-999,-999,-999,-999,-999,-999,-999,-999,-999,-999,-999
,2003-09-08T00:12:20Z,FK23,-23.6,150.79,95.2,-999,-999,-999,-999,-999,-999,-999,-999,-999,-999,-999,-999
,2003-09-08T00:12:20Z,FK23,-23.6,150.79,95.4,-999,-999,-999,-999,-999,-999,-999,-999,-999,-999,-999,-999
,2003-09-08T00:12:20Z,FK23,-23.6,150.79,95.6,-999,-999,-999,-999,-999,-999,-999,-999,-999,-999,-999,-999
,2003-09-08T00:12:20Z,FK23,-23.6,150.79,95.8,-999,-999,-999,-999,-999,-999,-999,-999,-999,-999,-999,-999
,2003-09-08T00:12:20Z,FK23,-23.6,150.79,96,-999,-999,-999,-999,-999,-999,-999,-999,-999,-999,-999,-999
,2003-09-08T00:12:20Z,FK23,-23.6,150.79,96.2,-999,-999,-999,-999,-999,-999,-999,-999,-999,-999,-999,-999
,2003-09-08T00:12:20Z,FK23,-23.6,150.79,96.4,-999,-999,-999,-999,-999,-999,-999,-999,-999,-999,-999,-999
,2003-09-08T00:12:20Z,FK23,-23.6,150.79,96.6,-999,-999,-999,-999,-999,-999,-999,-999,-999,-999,-999,-999
,2003-09-08T00:12:20Z,FK23,-23.6,150.79,96.8,-999,-999,-999,-999,-999,-999,-999,-999,-999,-999,-999,-999
,2003-09-08T00:12:20Z,FK23,-23.6,150.79,97,-999,-999,-999,-999,-999,-999,-999,-999,-999,-999,-999,-999
,2003-09-08T00:12:20Z,FK23,-23.6,150.79,97.2,-999,-999,-999,-999,-999,-999,-999,-999,-999,-999,-999,-999
,2003-09-08T00:12:20Z,FK23,-23.6,150.79,97.4,-999,-999,-999,-999,-999,-999,-999,-999,-999,-999,-999,-999
,2003-09-08T00:12:20Z,FK23,-23.6,150.79,97.6,-999,-999,-999,-999,-999,-999,-999,-999,-999,-999,-999,-999
,2003-09-08T00:12:20Z,FK23,-23.6,150.79,97.8,-999,-999,-999,-999,-999,-999,-999,-999,-999,-999,-999,-999
,2003-09-08T00:12:20Z,FK23,-23.6,150.79,98,-999,-999,-999,-999,-999,-999,-999,-999,-999,-999,-999,-999
,2003-09-08T00:12:20Z,FK23,-23.6,150.79,98.2,-999,-999,-999,-999,-999,-999,-999,-999,-999,-999,-999,-999
,2003-09-08T00:12:20Z,FK23,-23.6,150.79,98.4,-999,-999,-999,-999,-999,-999,-999,-999,-999,-999,-999,-999
,2003-09-08T00:12:20Z,FK23,-23.6,150.79,98.6,-999,-999,-999,-999,-999,-999,-999,-999,-999,-999,-999,-999
,2003-09-08T00:12:20Z,FK23,-23.6,150.79,98.8,-999,-999,-999,-999,-999,-999,-999,-999,-999,-999,-999,-999
,2003-09-08T00:12:20Z,FK23,-23.6,150.79,99,-999,-999,-999,-999,-999,-999,-999,-999,-999,-999,-999,-999
,2003-09-08T00:12:20Z,FK23,-23.6,150.79,99.2,-999,-999,-999,-999,-999,-999,-999,-999,-999,-999,-999,-999
,2003-09-08T00:12:20Z,FK23,-23.6,150.79,99.4,-999,-999,-999,-999,-999,-999,-999,-999,-999,-999,-999,-999
,2003-09-08T00:12:20Z,FK23,-23.6,150.79,99.6,-999,-999,-999,-999,-999,-999,-999,-999,-999,-999,-999,-999
,2003-09-08T00:12:20Z,FK23,-23.6,150.79,99.8,-999,-999,-999,-999,-999,-999,-999,-999,-999,-999,-999,-999
,2003-09-08T00:12:20Z,FK23,-23.6,150.79,100,-999,-999,-999,-999,-999,-999,-999,-999,-999,-999,-999,-999
