GLOBAL ATTRIBUTES,,,,,,,,,,,,,,,,,
title,,,,,,,,,,,,,,,,,
project,Integrated Marine Observing System (IMOS),,,,,,,,,,,,,,,,
original_project_name,MERIS validation,,,,,,,,,,,,,,,,
abstract,This record contains in situ water optical property data collected in the South Great Barrier Reef| Australia on the RSV Lady Basten between 23-28 Aug 2005. A total of 22 stations were sampled during the field campaign AA05. The data can be used for Ocean Colour sensor validation| optical water quality monitoring and modelling. CLW deployed the optical instruments TriOS RAMSES (hyperspectral irradiance)| WETLabs AC-9 (absorption and attenuation coefficicents)| HOBILabs Hydroscat-6 (backscattering coefficient) during this cruise.This data was part of the dataset described in Blondeau-Patissier et al. 2009| JGR| VOL. 114| C05003| doi:10.1029/2008JC005039. Funding for this study was provided by CSIRO Earth Observation Centre| CSIRO Land and Water| CSIRO Marine Research and the Australian Institute of Marine Sciences. We also thank the captains and crews of the RSV Lady Basten.,,,,,,,,,,,,,,,,
conventions,IMOS biological data format (v1.0),,,,,,,,,,,,,,,,
date_created,2005-08-23T21:44:49Z,,,,,,,,,,,,,,,,
date_modified,2006-02-06T22:26:59Z,,,,,,,,,,,,,,,,
history,Data has been quality controlled by in-house procedures. HS-6 data were corrected for temperature using CTD data and the Sigma correction method| recommended by the manufacturer| was applied using absorption and attenuation data from the AC-9. The Sigma correction is an adjustment to improve the accuracy of backscattering measurements| in particular in highly-attenuating water. The correction is detailed in HOBI-labs Inc.| 2003. The backscattering coefficient bb is estimated using the method described in Maffione and Dana| 1997| Applied Optics| 36(24)| pp.6057-6067.,,,,,,,,,,,,,,,,
comment,The HydroScat-6 (HS-6) is a self-contained instrument for measuring optical backscattering at six different wavelengths in natural waters. The particulate backscattering coefficient| bbp (lambda)| is a measure of light scattering by particles at angles between 90 and 180 degrees. bbp was estimated by subtracting bbw (lambda)| the backscattering coefficient of pure sea-water| from bb (lambda). The pure seawater backscattering coefficient was calculated using a backscattering ratio of 0.5 (Gordon et al.| 1988| Journal of Geophysical Research) and the seawater scattering coefficients| bw(lambda)| of Morel (1974| Optical properties of pure water and pure seawater| p. 1-24| in Optical Aspects of Oceanography).,,,,,,,,,,,,,,,,
source,Particulate Scattering coefficients determined using an HS-6 (www.hobilabs.com),,,,,,,,,,,,,,,,
keywords,Oceans>Ocean Optics > Scattering ;Oceans>Ocean Optics>Ocean Colour;,,,,,,,,,,,,,,,,
cruise_id,LB4083,,,,,,,,,,,,,,,,
vessel_name,RSV Lady Basten,,,,,,,,,,,,,,,,
platform_code,VLAB_450301529,,,,,,,,,,,,,,,,
references,https://marlin.csiro.au/geonetwork/srv/eng/catalog.search#/metadata/d3c5d7ba-b861-72d5-e043-08114f8c2cf2,,,,,,,,,,,,,,,,
naming_authority,CSIRO Land and Water (CLW),,,,,,,,,,,,,,,,
cdm_data_type,profile,,,,,,,,,,,,,,,,
geospatial_lat_min,-23.22,,,,,,,,,,,,,,,,
geospatial_lat_max,-23.22,,,,,,,,,,,,,,,,
geospatial_lon_min,150.98,,,,,,,,,,,,,,,,
geospatial_lon_max,150.98,,,,,,,,,,,,,,,,
geospatial_vertical_min,0,,,,,,,,,,,,,,,,
geospatial_vertical_max,100,,,,,,,,,,,,,,,,
local_time_zone,10,,,,,,,,,,,,,,,,
data_centre,eMarine Information Infrastructure (eMII),,,,,,,,,,,,,,,,
data_centre_email,info@emii.org.au,,,,,,,,,,,,,,,,
author,Brando Vittorio,,,,,,,,,,,,,,,,
author_email,vittorio.brando@csiro.au,,,,,,,,,,,,,,,,
principal_investigator,Furnas Miles,,,,,,,,,,,,,,,,
principal_investigator_email,m.furnas@aims.gov.au,,,,,,,,,,,,,,,,
institution,IMOS Satellite Remote Sensing - Ocean Colour Sub-facility - Bio-Optical database of Australian Waters,,,,,,,,,,,,,,,,
institution_principal_investigator,"Schroeder, Thomas",,,,,,,,,,,,,,,,
institution_principal_investigator_email,Thomas.Schroeder@csiro.au,,,,,,,,,,,,,,,,
publisher,Australian Ocean Data Network,,,,,,,,,,,,,,,,
publisher_email,info@aodn.org.au,,,,,,,,,,,,,,,,
original_institution,CSIRO Land and Water,,,,,,,,,,,,,,,,
citation,To cite this data set in a publication use the format <<IMOS [year-of-data-downloaded] [Title] [data-access-url] accessed [date-of-access]>>,,,,,,,,,,,,,,,,
acknowledgement,Data was sourced from the Commonwealth Scientific and Industrial Research Organisation (CSIRO),,,,,,,,,,,,,,,,
distribution_statement,"Any users of IMOS data are required to clearly acknowledge the source of the material- Data or products or services from IMOS are provided ""as is"" without any warranty as to fitness for a particular purpose.",,,,,,,,,,,,,,,,
,,,,,,,,,,,,,,,,,
TABLE ROWS,,,,,,,,,,,,,,,,,
Row name,CF standard_name,IMOS long_name,Units,Fill value,Comments,,,,,,,,,,,,
Wavelength,radiation_wavelength,Wavelength of measurement,nm,-999,,,,,,,,,,,,,
,,,,,,,,,,,,,,,,,
TABLE COLUMNS,,,,,,,,,,,,,,,,,
Column name,CF standard_name,IMOS long_name,Units,Fill value,Comments,,,,,,,,,,,,
Time,time,analysis_time,YYYY-MM-DDThh:mm:ssZ,,UTC date and time,,,,,,,,,,,,
Station_Code,,,,,National Reference Station code (6 letters),,,,,,,,,,,,
Latitude,latitude,latitude,degrees_north,-999,North positive,,,,,,,,,,,,
Longitude,longitude,longitude,degrees_east,-999,East positive,,,,,,,,,,,,
Depth,depth,depth,m ,-999,positive down,,,,,,,,,,,,
bb_corr,,corrected_volume_total_backwards_scattering_coefficient_of_(bbw_+_bbp)_in_sea_water,m-1,-999,bbw:volume_backwards_scattering_coefficient_of_radiative_flux_in_sea_water ; bbp=volume_backwards_scattering_coefficient_of_particules_in_sea_water,,,,,,,,,,,,
bb_uncorr,,volume_total_backwards_scattering_coefficient_of_(bbw_+_bbp)_in_sea_water,m-1,-999,bbw:volume_backwards_scattering_coefficient_of_radiative_flux_in_sea_water ; bbp=volume_backwards_scattering_coefficient_of_particules_in_sea_water,,,,,,,,,,,,
,,,,,,,,,,,,,,,,,
,,,,,,,,,,,,,,,,,
DATA,,,,,,,,,,,,,,,,,
,Time,Station_Code,Latitude,Longitude,Depth,bb_corr,bb_corr,bb_corr,bb_corr,bb_corr,bb_corr,bb_uncorr,bb_uncorr,bb_uncorr,bb_uncorr,bb_uncorr,bb_uncorr
Wavelength,,,,,,442,448,555,589,676,852,442,448,555,589,676,852
,2005-08-23T21:46:37Z,WQS004,-23.22,150.98,0,0.00576,0.00488,0.004168,0.003707,0.003583,0.002656,0.005676,0.004812,0.004134,0.003682,0.00357,0.002205
,2005-08-23T21:46:19Z,WQS004,-23.22,150.98,0.2,0.006596,0.005044,0.004089,0.003892,0.003005,0.003003,0.006496,0.004973,0.004053,0.003863,0.002992,0.00249
,2005-08-23T21:46:17Z,WQS004,-23.22,150.98,0.4,0.005962,0.005277,0.004039,0.003822,0.002864,0.002789,0.005864,0.005201,0.003997,0.003788,0.002846,0.002308
,2005-08-23T21:46:45Z,WQS004,-23.22,150.98,0.6,0.006078,0.005154,0.004327,0.003792,0.003262,0.002888,0.005975,0.005078,0.004279,0.003756,0.003238,0.002387
,2005-08-23T21:46:47Z,WQS004,-23.22,150.98,0.8,0.006029,0.004992,0.003832,0.00368,0.002804,0.002905,0.005924,0.004918,0.003787,0.003643,0.002781,0.002399
,2005-08-23T21:44:56Z,WQS004,-23.22,150.98,1,-999,-999,-999,-999,-999,-999,-999,-999,-999,-999,-999,-999
,2005-08-23T21:45:57Z,WQS004,-23.22,150.98,1.2,0.006059,0.004872,0.004313,0.003805,0.003458,0.002646,0.005949,0.004795,0.004263,0.003767,0.003428,0.002182
,2005-08-23T21:46:51Z,WQS004,-23.22,150.98,1.4,0.005827,0.005376,0.004099,0.00379,0.0032,0.002893,0.005719,0.005289,0.004053,0.003753,0.003169,0.002387
,2005-08-23T21:46:53Z,WQS004,-23.22,150.98,1.6,0.00576,0.004917,0.00408,0.003791,0.003151,0.00296,0.005659,0.004842,0.004037,0.003756,0.003126,0.002444
,2005-08-23T21:44:58Z,WQS004,-23.22,150.98,1.8,0.005609,0.004991,0.003868,0.00377,0.003234,0.003057,0.005514,0.004918,0.003827,0.003735,0.003208,0.002524
,2005-08-23T21:45:21Z,WQS004,-23.22,150.98,2,0.00581,0.005115,0.003993,0.003811,0.003332,0.002768,0.00571,0.00504,0.003948,0.003774,0.003303,0.002285
,2005-08-23T21:45:41Z,WQS004,-23.22,150.98,2.2,0.006057,0.005035,0.004272,0.003892,0.002907,0.002699,0.005949,0.00496,0.004223,0.003852,0.00288,0.002228
,2005-08-23T21:46:57Z,WQS004,-23.22,150.98,2.4,0.006081,0.005163,0.003698,0.003843,0.003234,0.003046,0.005966,0.005087,0.003658,0.003806,0.003204,0.002513
,2005-08-23T21:46:59Z,WQS004,-23.22,150.98,2.6,0.005835,0.004702,0.003697,0.00379,0.003208,0.002808,0.005736,0.004635,0.003658,0.003753,0.003178,0.002319
,2005-08-23T21:45:09Z,WQS004,-23.22,150.98,2.8,-999,-999,-999,-999,-999,-999,-999,-999,-999,-999,-999,-999
,2005-08-23T21:47:01Z,WQS004,-23.22,150.98,3,0.006085,0.005155,0.003785,0.003844,0.003121,0.003251,0.005983,0.005087,0.003747,0.00381,0.003092,0.002684
,2005-08-23T21:45:12Z,WQS004,-23.22,150.98,3.2,-999,-999,-999,-999,-999,-999,-999,-999,-999,-999,-999,-999
,2005-08-23T21:45:15Z,WQS004,-23.22,150.98,3.4,-999,-999,-999,-999,-999,-999,-999,-999,-999,-999,-999,-999
,2005-08-23T21:47:07Z,WQS004,-23.22,150.98,3.6,0.005704,0.005014,0.003813,0.003907,0.003031,0.002974,0.005599,0.004943,0.003771,0.00387,0.003005,0.002456
,2005-08-23T21:45:17Z,WQS004,-23.22,150.98,3.8,-999,-999,-999,-999,-999,-999,-999,-999,-999,-999,-999,-999
,2005-08-23T21:47:09Z,WQS004,-23.22,150.98,4,0.005842,0.005142,0.004072,0.003792,0.003329,0.002602,0.005736,0.00507,0.004021,0.003753,0.003299,0.002148
,2005-08-23T21:47:11Z,WQS004,-23.22,150.98,4.2,0.005832,0.005303,0.003948,0.003931,0.00323,0.002769,0.005727,0.005226,0.0039,0.003891,0.003199,0.002285
,2005-08-23T21:45:21Z,WQS004,-23.22,150.98,4.4,-999,-999,-999,-999,-999,-999,-999,-999,-999,-999,-999,-999
,2005-08-23T21:47:13Z,WQS004,-23.22,150.98,4.6,0.005681,0.005376,0.004225,0.003899,0.003182,0.002768,0.005582,0.005298,0.004174,0.003859,0.003152,0.002285
,2005-08-23T21:47:15Z,WQS004,-23.22,150.98,4.8,0.005624,0.005171,0.003851,0.003782,0.003256,0.002826,0.005522,0.005095,0.003803,0.003742,0.003225,0.00233
,2005-08-23T21:47:17Z,WQS004,-23.22,150.98,5,0.005528,0.004867,0.003826,0.003914,0.002924,0.002712,0.005428,0.004795,0.003779,0.003873,0.002898,0.002239
,2005-08-23T21:45:27Z,WQS004,-23.22,150.98,5.2,-999,-999,-999,-999,-999,-999,-999,-999,-999,-999,-999,-999
,2005-08-23T21:47:19Z,WQS004,-23.22,150.98,5.4,0.005871,0.005128,0.004009,0.004125,0.003234,0.002933,0.00577,0.005057,0.003965,0.004086,0.003208,0.002422
,2005-08-23T21:45:29Z,WQS004,-23.22,150.98,5.6,-999,-999,-999,-999,-999,-999,-999,-999,-999,-999,-999,-999
,2005-08-23T21:47:21Z,WQS004,-23.22,150.98,5.8,0.005896,0.005045,0.004288,0.003543,0.003175,0.002755,0.005795,0.004973,0.004239,0.003508,0.003148,0.002273
,2005-08-23T21:47:23Z,WQS004,-23.22,150.98,6,0.00588,0.004585,0.003749,0.003969,0.003288,0.002698,0.005778,0.004521,0.003706,0.00393,0.00326,0.002228
,2005-08-23T21:47:25Z,WQS004,-23.22,150.98,6.2,0.006159,0.005382,0.003916,0.003851,0.003282,0.003085,0.006052,0.005302,0.003868,0.00381,0.003251,0.002547
,2005-08-23T21:45:33Z,WQS004,-23.22,150.98,6.4,-999,-999,-999,-999,-999,-999,-999,-999,-999,-999,-999,-999
,2005-08-23T21:47:27Z,WQS004,-23.22,150.98,6.6,0.005673,0.005551,0.004315,0.004119,0.0031,0.003224,0.005573,0.005471,0.004263,0.004076,0.00307,0.002661
,2005-08-23T21:47:29Z,WQS004,-23.22,150.98,6.8,0.006401,0.005879,0.004892,0.004185,0.004062,0.002948,0.006291,0.005792,0.004836,0.004143,0.004023,0.002433
,2005-08-23T21:47:31Z,WQS004,-23.22,150.98,7,0.006455,0.005796,0.004813,0.004301,0.004958,0.003127,0.006342,0.005711,0.004756,0.004257,0.004912,0.002581
,2005-08-23T21:45:39Z,WQS004,-23.22,150.98,7.2,-999,-999,-999,-999,-999,-999,-999,-999,-999,-999,-999,-999
,2005-08-23T21:47:33Z,WQS004,-23.22,150.98,7.4,0.006484,0.005313,0.003859,0.004077,0.003041,0.004027,0.006359,0.00523,0.003811,0.004033,0.00301,0.003322
,2005-08-23T21:47:35Z,WQS004,-23.22,150.98,7.6,0.007033,0.005381,0.003985,0.003934,0.004009,0.002881,0.006898,0.005298,0.00394,0.003895,0.003971,0.002376
,2005-08-23T21:45:43Z,WQS004,-23.22,150.98,7.8,-999,-999,-999,-999,-999,-999,-999,-999,-999,-999,-999,-999
,2005-08-23T21:47:37Z,WQS004,-23.22,150.98,8,0.00633,0.005042,0.004284,0.003858,0.003557,0.003475,0.006206,0.004964,0.004231,0.003817,0.003523,0.002866
,2005-08-23T21:47:39Z,WQS004,-23.22,150.98,8.2,0.00669,0.00512,0.00471,0.004521,0.003329,0.003115,0.006564,0.005044,0.004651,0.004473,0.003299,0.00257
,2005-08-23T21:45:47Z,WQS004,-23.22,150.98,8.4,-999,-999,-999,-999,-999,-999,-999,-999,-999,-999,-999,-999
,2005-08-23T21:47:41Z,WQS004,-23.22,150.98,8.6,0.00672,0.005122,0.004188,0.003978,0.003511,0.0031,0.00659,0.005049,0.004142,0.003941,0.00348,0.002558
,2005-08-23T21:47:43Z,WQS004,-23.22,150.98,8.8,0.00623,0.004826,0.004098,0.003866,0.003197,0.003169,0.006112,0.004757,0.004053,0.003831,0.003169,0.002615
,2005-08-23T21:47:45Z,WQS004,-23.22,150.98,9,0.006145,0.00522,0.004141,0.004198,0.003191,0.003145,0.006035,0.005137,0.004094,0.004157,0.003165,0.002593
,2005-08-23T21:45:51Z,WQS004,-23.22,150.98,9.2,-999,-999,-999,-999,-999,-999,-999,-999,-999,-999,-999,-999
,2005-08-23T21:47:47Z,WQS004,-23.22,150.98,9.4,0.006206,0.005748,0.004781,0.004129,0.00331,0.003403,0.006095,0.005665,0.004723,0.004086,0.003281,0.002809
,2005-08-23T21:47:49Z,WQS004,-23.22,150.98,9.6,0.005764,0.005074,0.004289,0.003964,0.003358,0.003334,0.005659,0.005002,0.004239,0.003923,0.003329,0.002752
,2005-08-23T21:47:51Z,WQS004,-23.22,150.98,9.8,0.006078,0.005354,0.004287,0.004678,0.003436,0.003377,0.005975,0.005281,0.004239,0.004633,0.003406,0.002786
,2005-08-23T21:45:57Z,WQS004,-23.22,150.98,10,-999,-999,-999,-999,-999,-999,-999,-999,-999,-999,-999,-999
,2005-08-23T21:47:53Z,WQS004,-23.22,150.98,10.2,0.006255,0.005558,0.004859,0.004624,0.003235,0.003015,0.006146,0.005479,0.004804,0.004579,0.003208,0.00249
,2005-08-23T21:47:55Z,WQS004,-23.22,150.98,10.4,0.006792,0.005917,0.005524,0.004099,0.004582,0.003223,0.006675,0.005834,0.005458,0.004058,0.004541,0.002661
,2005-08-23T21:46:01Z,WQS004,-23.22,150.98,10.6,-999,-999,-999,-999,-999,-999,-999,-999,-999,-999,-999,-999
,2005-08-23T21:47:57Z,WQS004,-23.22,150.98,10.8,0.007185,0.005398,0.004543,0.00407,0.005789,0.002866,0.00706,0.005323,0.004489,0.00403,0.00574,0.002365
,2005-08-23T21:47:59Z,WQS004,-23.22,150.98,11,0.005692,0.004983,0.004505,0.004352,0.003164,0.002686,0.00559,0.004914,0.004457,0.004313,0.003139,0.002216
,2005-08-23T21:46:05Z,WQS004,-23.22,150.98,11.2,-999,-999,-999,-999,-999,-999,-999,-999,-999,-999,-999,-999
,2005-08-23T21:48:01Z,WQS004,-23.22,150.98,11.4,0.005906,0.005502,0.004375,0.004079,0.003379,0.002755,0.005795,0.00542,0.00432,0.004037,0.00335,0.002273
,2005-08-23T21:48:03Z,WQS004,-23.22,150.98,11.6,0.006247,0.005554,0.005232,0.004405,0.003706,0.003293,0.006137,0.005475,0.005167,0.004359,0.003674,0.002718
,2005-08-23T21:46:09Z,WQS004,-23.22,150.98,11.8,-999,-999,-999,-999,-999,-999,-999,-999,-999,-999,-999,-999
,2005-08-23T21:48:05Z,WQS004,-23.22,150.98,12,0.006575,0.005474,0.004497,0.003704,0.003282,0.00327,0.006445,0.005386,0.004433,0.003661,0.003247,0.002695
,2005-08-23T21:48:07Z,WQS004,-23.22,150.98,12.2,0.005929,0.004876,0.004392,0.004233,0.003084,0.002867,0.005813,0.004804,0.004336,0.004189,0.003053,0.002365
,2005-08-23T21:48:09Z,WQS004,-23.22,150.98,12.4,0.006112,0.005027,0.004105,0.004041,0.003502,0.003045,0.006001,0.004952,0.004061,0.004005,0.003471,0.002513
,2005-08-23T21:46:13Z,WQS004,-23.22,150.98,12.6,-999,-999,-999,-999,-999,-999,-999,-999,-999,-999,-999,-999
,2005-08-23T21:46:15Z,WQS004,-23.22,150.98,12.8,-999,-999,-999,-999,-999,-999,-999,-999,-999,-999,-999,-999
,2005-08-23T21:46:15Z,WQS004,-23.22,150.98,13,-999,-999,-999,-999,-999,-999,-999,-999,-999,-999,-999,-999
,2005-08-23T21:46:17Z,WQS004,-23.22,150.98,13.2,-999,-999,-999,-999,-999,-999,-999,-999,-999,-999,-999,-999
,2005-08-23T21:46:19Z,WQS004,-23.22,150.98,13.4,-999,-999,-999,-999,-999,-999,-999,-999,-999,-999,-999,-999
,2005-08-23T21:46:19Z,WQS004,-23.22,150.98,13.6,-999,-999,-999,-999,-999,-999,-999,-999,-999,-999,-999,-999
,2005-08-23T21:46:21Z,WQS004,-23.22,150.98,13.8,-999,-999,-999,-999,-999,-999,-999,-999,-999,-999,-999,-999
,2005-08-23T21:46:23Z,WQS004,-23.22,150.98,14,-999,-999,-999,-999,-999,-999,-999,-999,-999,-999,-999,-999
,2005-08-23T21:46:23Z,WQS004,-23.22,150.98,14.2,-999,-999,-999,-999,-999,-999,-999,-999,-999,-999,-999,-999
,2005-08-23T21:46:25Z,WQS004,-23.22,150.98,14.4,-999,-999,-999,-999,-999,-999,-999,-999,-999,-999,-999,-999
,2005-08-23T21:46:27Z,WQS004,-23.22,150.98,14.6,-999,-999,-999,-999,-999,-999,-999,-999,-999,-999,-999,-999
,2005-08-23T21:46:27Z,WQS004,-23.22,150.98,14.8,-999,-999,-999,-999,-999,-999,-999,-999,-999,-999,-999,-999
,2005-08-23T21:46:29Z,WQS004,-23.22,150.98,15,-999,-999,-999,-999,-999,-999,-999,-999,-999,-999,-999,-999
,2005-08-23T21:46:29Z,WQS004,-23.22,150.98,15.2,-999,-999,-999,-999,-999,-999,-999,-999,-999,-999,-999,-999
,2005-08-23T21:46:31Z,WQS004,-23.22,150.98,15.4,-999,-999,-999,-999,-999,-999,-999,-999,-999,-999,-999,-999
,2005-08-23T21:46:33Z,WQS004,-23.22,150.98,15.6,-999,-999,-999,-999,-999,-999,-999,-999,-999,-999,-999,-999
,2005-08-23T21:46:33Z,WQS004,-23.22,150.98,15.8,-999,-999,-999,-999,-999,-999,-999,-999,-999,-999,-999,-999
,2005-08-23T21:46:35Z,WQS004,-23.22,150.98,16,-999,-999,-999,-999,-999,-999,-999,-999,-999,-999,-999,-999
,2005-08-23T21:46:37Z,WQS004,-23.22,150.98,16.2,-999,-999,-999,-999,-999,-999,-999,-999,-999,-999,-999,-999
,2005-08-23T21:46:37Z,WQS004,-23.22,150.98,16.4,-999,-999,-999,-999,-999,-999,-999,-999,-999,-999,-999,-999
,2005-08-23T21:46:39Z,WQS004,-23.22,150.98,16.6,-999,-999,-999,-999,-999,-999,-999,-999,-999,-999,-999,-999
,2005-08-23T21:46:41Z,WQS004,-23.22,150.98,16.8,-999,-999,-999,-999,-999,-999,-999,-999,-999,-999,-999,-999
,2005-08-23T21:46:41Z,WQS004,-23.22,150.98,17,-999,-999,-999,-999,-999,-999,-999,-999,-999,-999,-999,-999
,2005-08-23T21:46:43Z,WQS004,-23.22,150.98,17.2,-999,-999,-999,-999,-999,-999,-999,-999,-999,-999,-999,-999
,2005-08-23T21:46:43Z,WQS004,-23.22,150.98,17.4,-999,-999,-999,-999,-999,-999,-999,-999,-999,-999,-999,-999
,2005-08-23T21:46:45Z,WQS004,-23.22,150.98,17.6,-999,-999,-999,-999,-999,-999,-999,-999,-999,-999,-999,-999
,2005-08-23T21:46:47Z,WQS004,-23.22,150.98,17.8,-999,-999,-999,-999,-999,-999,-999,-999,-999,-999,-999,-999
,2005-08-23T21:46:47Z,WQS004,-23.22,150.98,18,-999,-999,-999,-999,-999,-999,-999,-999,-999,-999,-999,-999
,2005-08-23T21:46:49Z,WQS004,-23.22,150.98,18.2,-999,-999,-999,-999,-999,-999,-999,-999,-999,-999,-999,-999
,2005-08-23T21:46:51Z,WQS004,-23.22,150.98,18.4,-999,-999,-999,-999,-999,-999,-999,-999,-999,-999,-999,-999
,2005-08-23T21:46:51Z,WQS004,-23.22,150.98,18.6,-999,-999,-999,-999,-999,-999,-999,-999,-999,-999,-999,-999
,2005-08-23T21:46:53Z,WQS004,-23.22,150.98,18.8,-999,-999,-999,-999,-999,-999,-999,-999,-999,-999,-999,-999
,2005-08-23T21:46:55Z,WQS004,-23.22,150.98,19,-999,-999,-999,-999,-999,-999,-999,-999,-999,-999,-999,-999
,2005-08-23T21:46:55Z,WQS004,-23.22,150.98,19.2,-999,-999,-999,-999,-999,-999,-999,-999,-999,-999,-999,-999
,2005-08-23T21:46:57Z,WQS004,-23.22,150.98,19.4,-999,-999,-999,-999,-999,-999,-999,-999,-999,-999,-999,-999
,2005-08-23T21:46:57Z,WQS004,-23.22,150.98,19.6,-999,-999,-999,-999,-999,-999,-999,-999,-999,-999,-999,-999
,2005-08-23T21:46:59Z,WQS004,-23.22,150.98,19.8,-999,-999,-999,-999,-999,-999,-999,-999,-999,-999,-999,-999
,2005-08-23T21:47:01Z,WQS004,-23.22,150.98,20,-999,-999,-999,-999,-999,-999,-999,-999,-999,-999,-999,-999
,2005-08-23T21:47:01Z,WQS004,-23.22,150.98,20.2,-999,-999,-999,-999,-999,-999,-999,-999,-999,-999,-999,-999
,2005-08-23T21:47:03Z,WQS004,-23.22,150.98,20.4,-999,-999,-999,-999,-999,-999,-999,-999,-999,-999,-999,-999
,2005-08-23T21:47:05Z,WQS004,-23.22,150.98,20.6,-999,-999,-999,-999,-999,-999,-999,-999,-999,-999,-999,-999
,2005-08-23T21:47:05Z,WQS004,-23.22,150.98,20.8,-999,-999,-999,-999,-999,-999,-999,-999,-999,-999,-999,-999
,2005-08-23T21:47:07Z,WQS004,-23.22,150.98,21,-999,-999,-999,-999,-999,-999,-999,-999,-999,-999,-999,-999
,2005-08-23T21:47:09Z,WQS004,-23.22,150.98,21.2,-999,-999,-999,-999,-999,-999,-999,-999,-999,-999,-999,-999
,2005-08-23T21:47:09Z,WQS004,-23.22,150.98,21.4,-999,-999,-999,-999,-999,-999,-999,-999,-999,-999,-999,-999
,2005-08-23T21:47:11Z,WQS004,-23.22,150.98,21.6,-999,-999,-999,-999,-999,-999,-999,-999,-999,-999,-999,-999
,2005-08-23T21:47:13Z,WQS004,-23.22,150.98,21.8,-999,-999,-999,-999,-999,-999,-999,-999,-999,-999,-999,-999
,2005-08-23T21:47:13Z,WQS004,-23.22,150.98,22,-999,-999,-999,-999,-999,-999,-999,-999,-999,-999,-999,-999
,2005-08-23T21:47:15Z,WQS004,-23.22,150.98,22.2,-999,-999,-999,-999,-999,-999,-999,-999,-999,-999,-999,-999
,2005-08-23T21:47:15Z,WQS004,-23.22,150.98,22.4,-999,-999,-999,-999,-999,-999,-999,-999,-999,-999,-999,-999
,2005-08-23T21:47:17Z,WQS004,-23.22,150.98,22.6,-999,-999,-999,-999,-999,-999,-999,-999,-999,-999,-999,-999
,2005-08-23T21:47:19Z,WQS004,-23.22,150.98,22.8,-999,-999,-999,-999,-999,-999,-999,-999,-999,-999,-999,-999
,2005-08-23T21:47:19Z,WQS004,-23.22,150.98,23,-999,-999,-999,-999,-999,-999,-999,-999,-999,-999,-999,-999
,2005-08-23T21:47:21Z,WQS004,-23.22,150.98,23.2,-999,-999,-999,-999,-999,-999,-999,-999,-999,-999,-999,-999
,2005-08-23T21:47:23Z,WQS004,-23.22,150.98,23.4,-999,-999,-999,-999,-999,-999,-999,-999,-999,-999,-999,-999
,2005-08-23T21:47:23Z,WQS004,-23.22,150.98,23.6,-999,-999,-999,-999,-999,-999,-999,-999,-999,-999,-999,-999
,2005-08-23T21:47:25Z,WQS004,-23.22,150.98,23.8,-999,-999,-999,-999,-999,-999,-999,-999,-999,-999,-999,-999
,2005-08-23T21:47:27Z,WQS004,-23.22,150.98,24,-999,-999,-999,-999,-999,-999,-999,-999,-999,-999,-999,-999
,2005-08-23T21:47:27Z,WQS004,-23.22,150.98,24.2,-999,-999,-999,-999,-999,-999,-999,-999,-999,-999,-999,-999
,2005-08-23T21:47:29Z,WQS004,-23.22,150.98,24.4,-999,-999,-999,-999,-999,-999,-999,-999,-999,-999,-999,-999
,2005-08-23T21:47:29Z,WQS004,-23.22,150.98,24.6,-999,-999,-999,-999,-999,-999,-999,-999,-999,-999,-999,-999
,2005-08-23T21:47:31Z,WQS004,-23.22,150.98,24.8,-999,-999,-999,-999,-999,-999,-999,-999,-999,-999,-999,-999
,2005-08-23T21:47:33Z,WQS004,-23.22,150.98,25,-999,-999,-999,-999,-999,-999,-999,-999,-999,-999,-999,-999
,2005-08-23T21:47:33Z,WQS004,-23.22,150.98,25.2,-999,-999,-999,-999,-999,-999,-999,-999,-999,-999,-999,-999
,2005-08-23T21:47:35Z,WQS004,-23.22,150.98,25.4,-999,-999,-999,-999,-999,-999,-999,-999,-999,-999,-999,-999
,2005-08-23T21:47:37Z,WQS004,-23.22,150.98,25.6,-999,-999,-999,-999,-999,-999,-999,-999,-999,-999,-999,-999
,2005-08-23T21:47:37Z,WQS004,-23.22,150.98,25.8,-999,-999,-999,-999,-999,-999,-999,-999,-999,-999,-999,-999
,2005-08-23T21:47:39Z,WQS004,-23.22,150.98,26,-999,-999,-999,-999,-999,-999,-999,-999,-999,-999,-999,-999
,2005-08-23T21:47:41Z,WQS004,-23.22,150.98,26.2,-999,-999,-999,-999,-999,-999,-999,-999,-999,-999,-999,-999
,2005-08-23T21:47:41Z,WQS004,-23.22,150.98,26.4,-999,-999,-999,-999,-999,-999,-999,-999,-999,-999,-999,-999
,2005-08-23T21:47:43Z,WQS004,-23.22,150.98,26.6,-999,-999,-999,-999,-999,-999,-999,-999,-999,-999,-999,-999
,2005-08-23T21:47:43Z,WQS004,-23.22,150.98,26.8,-999,-999,-999,-999,-999,-999,-999,-999,-999,-999,-999,-999
,2005-08-23T21:47:45Z,WQS004,-23.22,150.98,27,-999,-999,-999,-999,-999,-999,-999,-999,-999,-999,-999,-999
,2005-08-23T21:47:47Z,WQS004,-23.22,150.98,27.2,-999,-999,-999,-999,-999,-999,-999,-999,-999,-999,-999,-999
,2005-08-23T21:47:47Z,WQS004,-23.22,150.98,27.4,-999,-999,-999,-999,-999,-999,-999,-999,-999,-999,-999,-999
,2005-08-23T21:47:49Z,WQS004,-23.22,150.98,27.6,-999,-999,-999,-999,-999,-999,-999,-999,-999,-999,-999,-999
,2005-08-23T21:47:51Z,WQS004,-23.22,150.98,27.8,-999,-999,-999,-999,-999,-999,-999,-999,-999,-999,-999,-999
,2005-08-23T21:47:51Z,WQS004,-23.22,150.98,28,-999,-999,-999,-999,-999,-999,-999,-999,-999,-999,-999,-999
,2005-08-23T21:47:53Z,WQS004,-23.22,150.98,28.2,-999,-999,-999,-999,-999,-999,-999,-999,-999,-999,-999,-999
,2005-08-23T21:47:55Z,WQS004,-23.22,150.98,28.4,-999,-999,-999,-999,-999,-999,-999,-999,-999,-999,-999,-999
,2005-08-23T21:47:55Z,WQS004,-23.22,150.98,28.6,-999,-999,-999,-999,-999,-999,-999,-999,-999,-999,-999,-999
,2005-08-23T21:47:57Z,WQS004,-23.22,150.98,28.8,-999,-999,-999,-999,-999,-999,-999,-999,-999,-999,-999,-999
,2005-08-23T21:47:57Z,WQS004,-23.22,150.98,29,-999,-999,-999,-999,-999,-999,-999,-999,-999,-999,-999,-999
,2005-08-23T21:47:59Z,WQS004,-23.22,150.98,29.2,-999,-999,-999,-999,-999,-999,-999,-999,-999,-999,-999,-999
,2005-08-23T21:48:01Z,WQS004,-23.22,150.98,29.4,-999,-999,-999,-999,-999,-999,-999,-999,-999,-999,-999,-999
,2005-08-23T21:48:01Z,WQS004,-23.22,150.98,29.6,-999,-999,-999,-999,-999,-999,-999,-999,-999,-999,-999,-999
,2005-08-23T21:48:03Z,WQS004,-23.22,150.98,29.8,-999,-999,-999,-999,-999,-999,-999,-999,-999,-999,-999,-999
,2005-08-23T21:48:05Z,WQS004,-23.22,150.98,30,-999,-999,-999,-999,-999,-999,-999,-999,-999,-999,-999,-999
,2005-08-23T21:48:05Z,WQS004,-23.22,150.98,30.2,-999,-999,-999,-999,-999,-999,-999,-999,-999,-999,-999,-999
,2005-08-23T21:48:07Z,WQS004,-23.22,150.98,30.4,-999,-999,-999,-999,-999,-999,-999,-999,-999,-999,-999,-999
,2005-08-23T21:48:09Z,WQS004,-23.22,150.98,30.6,-999,-999,-999,-999,-999,-999,-999,-999,-999,-999,-999,-999
,2005-08-23T21:48:09Z,WQS004,-23.22,150.98,30.8,-999,-999,-999,-999,-999,-999,-999,-999,-999,-999,-999,-999
,2005-08-23T21:48:11Z,WQS004,-23.22,150.98,31,-999,-999,-999,-999,-999,-999,-999,-999,-999,-999,-999,-999
,2005-08-23T21:48:11Z,WQS004,-23.22,150.98,31.2,-999,-999,-999,-999,-999,-999,-999,-999,-999,-999,-999,-999
,2005-08-23T21:48:13Z,WQS004,-23.22,150.98,31.4,-999,-999,-999,-999,-999,-999,-999,-999,-999,-999,-999,-999
,2005-08-23T21:48:15Z,WQS004,-23.22,150.98,31.6,-999,-999,-999,-999,-999,-999,-999,-999,-999,-999,-999,-999
,2005-08-23T21:48:15Z,WQS004,-23.22,150.98,31.8,-999,-999,-999,-999,-999,-999,-999,-999,-999,-999,-999,-999
,2005-08-23T21:48:17Z,WQS004,-23.22,150.98,32,-999,-999,-999,-999,-999,-999,-999,-999,-999,-999,-999,-999
,2005-08-23T21:48:19Z,WQS004,-23.22,150.98,32.2,-999,-999,-999,-999,-999,-999,-999,-999,-999,-999,-999,-999
,2005-08-23T21:48:19Z,WQS004,-23.22,150.98,32.4,-999,-999,-999,-999,-999,-999,-999,-999,-999,-999,-999,-999
,2005-08-23T21:48:21Z,WQS004,-23.22,150.98,32.6,-999,-999,-999,-999,-999,-999,-999,-999,-999,-999,-999,-999
,2005-08-23T21:48:23Z,WQS004,-23.22,150.98,32.8,-999,-999,-999,-999,-999,-999,-999,-999,-999,-999,-999,-999
,2005-08-23T21:48:23Z,WQS004,-23.22,150.98,33,-999,-999,-999,-999,-999,-999,-999,-999,-999,-999,-999,-999
,2005-08-23T21:48:25Z,WQS004,-23.22,150.98,33.2,-999,-999,-999,-999,-999,-999,-999,-999,-999,-999,-999,-999
,2005-08-23T21:48:27Z,WQS004,-23.22,150.98,33.4,-999,-999,-999,-999,-999,-999,-999,-999,-999,-999,-999,-999
,2005-08-23T21:48:27Z,WQS004,-23.22,150.98,33.6,-999,-999,-999,-999,-999,-999,-999,-999,-999,-999,-999,-999
,2005-08-23T21:48:29Z,WQS004,-23.22,150.98,33.8,-999,-999,-999,-999,-999,-999,-999,-999,-999,-999,-999,-999
,2005-08-23T21:48:29Z,WQS004,-23.22,150.98,34,-999,-999,-999,-999,-999,-999,-999,-999,-999,-999,-999,-999
,2005-08-23T21:48:31Z,WQS004,-23.22,150.98,34.2,-999,-999,-999,-999,-999,-999,-999,-999,-999,-999,-999,-999
,2005-08-23T21:48:33Z,WQS004,-23.22,150.98,34.4,-999,-999,-999,-999,-999,-999,-999,-999,-999,-999,-999,-999
,2005-08-23T21:48:33Z,WQS004,-23.22,150.98,34.6,-999,-999,-999,-999,-999,-999,-999,-999,-999,-999,-999,-999
,2005-08-23T21:48:35Z,WQS004,-23.22,150.98,34.8,-999,-999,-999,-999,-999,-999,-999,-999,-999,-999,-999,-999
,2005-08-23T21:48:37Z,WQS004,-23.22,150.98,35,-999,-999,-999,-999,-999,-999,-999,-999,-999,-999,-999,-999
,2005-08-23T21:48:37Z,WQS004,-23.22,150.98,35.2,-999,-999,-999,-999,-999,-999,-999,-999,-999,-999,-999,-999
,2005-08-23T21:48:39Z,WQS004,-23.22,150.98,35.4,-999,-999,-999,-999,-999,-999,-999,-999,-999,-999,-999,-999
,2005-08-23T21:48:41Z,WQS004,-23.22,150.98,35.6,-999,-999,-999,-999,-999,-999,-999,-999,-999,-999,-999,-999
,2005-08-23T21:48:41Z,WQS004,-23.22,150.98,35.8,-999,-999,-999,-999,-999,-999,-999,-999,-999,-999,-999,-999
,2005-08-23T21:48:43Z,WQS004,-23.22,150.98,36,-999,-999,-999,-999,-999,-999,-999,-999,-999,-999,-999,-999
,2005-08-23T21:48:43Z,WQS004,-23.22,150.98,36.2,-999,-999,-999,-999,-999,-999,-999,-999,-999,-999,-999,-999
,2005-08-23T21:48:45Z,WQS004,-23.22,150.98,36.4,-999,-999,-999,-999,-999,-999,-999,-999,-999,-999,-999,-999
,2005-08-23T21:48:47Z,WQS004,-23.22,150.98,36.6,-999,-999,-999,-999,-999,-999,-999,-999,-999,-999,-999,-999
,2005-08-23T21:48:47Z,WQS004,-23.22,150.98,36.8,-999,-999,-999,-999,-999,-999,-999,-999,-999,-999,-999,-999
,2005-08-23T21:48:49Z,WQS004,-23.22,150.98,37,-999,-999,-999,-999,-999,-999,-999,-999,-999,-999,-999,-999
,2005-08-23T21:48:51Z,WQS004,-23.22,150.98,37.2,-999,-999,-999,-999,-999,-999,-999,-999,-999,-999,-999,-999
,2005-08-23T21:48:51Z,WQS004,-23.22,150.98,37.4,-999,-999,-999,-999,-999,-999,-999,-999,-999,-999,-999,-999
,2005-08-23T21:48:53Z,WQS004,-23.22,150.98,37.6,-999,-999,-999,-999,-999,-999,-999,-999,-999,-999,-999,-999
,2005-08-23T21:48:55Z,WQS004,-23.22,150.98,37.8,-999,-999,-999,-999,-999,-999,-999,-999,-999,-999,-999,-999
,2005-08-23T21:48:55Z,WQS004,-23.22,150.98,38,-999,-999,-999,-999,-999,-999,-999,-999,-999,-999,-999,-999
,2005-08-23T21:48:57Z,WQS004,-23.22,150.98,38.2,-999,-999,-999,-999,-999,-999,-999,-999,-999,-999,-999,-999
,2005-08-23T21:48:57Z,WQS004,-23.22,150.98,38.4,-999,-999,-999,-999,-999,-999,-999,-999,-999,-999,-999,-999
,2005-08-23T21:48:59Z,WQS004,-23.22,150.98,38.6,-999,-999,-999,-999,-999,-999,-999,-999,-999,-999,-999,-999
,2005-08-23T21:49:01Z,WQS004,-23.22,150.98,38.8,-999,-999,-999,-999,-999,-999,-999,-999,-999,-999,-999,-999
,2005-08-23T21:49:01Z,WQS004,-23.22,150.98,39,-999,-999,-999,-999,-999,-999,-999,-999,-999,-999,-999,-999
,2005-08-23T21:49:03Z,WQS004,-23.22,150.98,39.2,-999,-999,-999,-999,-999,-999,-999,-999,-999,-999,-999,-999
,2005-08-23T21:49:05Z,WQS004,-23.22,150.98,39.4,-999,-999,-999,-999,-999,-999,-999,-999,-999,-999,-999,-999
,2005-08-23T21:49:05Z,WQS004,-23.22,150.98,39.6,-999,-999,-999,-999,-999,-999,-999,-999,-999,-999,-999,-999
,2005-08-23T21:49:07Z,WQS004,-23.22,150.98,39.8,-999,-999,-999,-999,-999,-999,-999,-999,-999,-999,-999,-999
,2005-08-23T21:49:09Z,WQS004,-23.22,150.98,40,-999,-999,-999,-999,-999,-999,-999,-999,-999,-999,-999,-999
,2005-08-23T21:49:09Z,WQS004,-23.22,150.98,40.2,-999,-999,-999,-999,-999,-999,-999,-999,-999,-999,-999,-999
,2005-08-23T21:49:11Z,WQS004,-23.22,150.98,40.4,-999,-999,-999,-999,-999,-999,-999,-999,-999,-999,-999,-999
,2005-08-23T21:49:11Z,WQS004,-23.22,150.98,40.6,-999,-999,-999,-999,-999,-999,-999,-999,-999,-999,-999,-999
,2005-08-23T21:49:13Z,WQS004,-23.22,150.98,40.8,-999,-999,-999,-999,-999,-999,-999,-999,-999,-999,-999,-999
,2005-08-23T21:49:15Z,WQS004,-23.22,150.98,41,-999,-999,-999,-999,-999,-999,-999,-999,-999,-999,-999,-999
,2005-08-23T21:49:15Z,WQS004,-23.22,150.98,41.2,-999,-999,-999,-999,-999,-999,-999,-999,-999,-999,-999,-999
,2005-08-23T21:49:17Z,WQS004,-23.22,150.98,41.4,-999,-999,-999,-999,-999,-999,-999,-999,-999,-999,-999,-999
,2005-08-23T21:49:19Z,WQS004,-23.22,150.98,41.6,-999,-999,-999,-999,-999,-999,-999,-999,-999,-999,-999,-999
,2005-08-23T21:49:19Z,WQS004,-23.22,150.98,41.8,-999,-999,-999,-999,-999,-999,-999,-999,-999,-999,-999,-999
,2005-08-23T21:49:21Z,WQS004,-23.22,150.98,42,-999,-999,-999,-999,-999,-999,-999,-999,-999,-999,-999,-999
,2005-08-23T21:49:23Z,WQS004,-23.22,150.98,42.2,-999,-999,-999,-999,-999,-999,-999,-999,-999,-999,-999,-999
,2005-08-23T21:49:23Z,WQS004,-23.22,150.98,42.4,-999,-999,-999,-999,-999,-999,-999,-999,-999,-999,-999,-999
,2005-08-23T21:49:25Z,WQS004,-23.22,150.98,42.6,-999,-999,-999,-999,-999,-999,-999,-999,-999,-999,-999,-999
,2005-08-23T21:49:25Z,WQS004,-23.22,150.98,42.8,-999,-999,-999,-999,-999,-999,-999,-999,-999,-999,-999,-999
,2005-08-23T21:49:27Z,WQS004,-23.22,150.98,43,-999,-999,-999,-999,-999,-999,-999,-999,-999,-999,-999,-999
,2005-08-23T21:49:29Z,WQS004,-23.22,150.98,43.2,-999,-999,-999,-999,-999,-999,-999,-999,-999,-999,-999,-999
,2005-08-23T21:49:29Z,WQS004,-23.22,150.98,43.4,-999,-999,-999,-999,-999,-999,-999,-999,-999,-999,-999,-999
,2005-08-23T21:49:31Z,WQS004,-23.22,150.98,43.6,-999,-999,-999,-999,-999,-999,-999,-999,-999,-999,-999,-999
,2005-08-23T21:49:33Z,WQS004,-23.22,150.98,43.8,-999,-999,-999,-999,-999,-999,-999,-999,-999,-999,-999,-999
,2005-08-23T21:49:33Z,WQS004,-23.22,150.98,44,-999,-999,-999,-999,-999,-999,-999,-999,-999,-999,-999,-999
,2005-08-23T21:49:35Z,WQS004,-23.22,150.98,44.2,-999,-999,-999,-999,-999,-999,-999,-999,-999,-999,-999,-999
,2005-08-23T21:49:37Z,WQS004,-23.22,150.98,44.4,-999,-999,-999,-999,-999,-999,-999,-999,-999,-999,-999,-999
,2005-08-23T21:49:37Z,WQS004,-23.22,150.98,44.6,-999,-999,-999,-999,-999,-999,-999,-999,-999,-999,-999,-999
,2005-08-23T21:49:39Z,WQS004,-23.22,150.98,44.8,-999,-999,-999,-999,-999,-999,-999,-999,-999,-999,-999,-999
,2005-08-23T21:49:39Z,WQS004,-23.22,150.98,45,-999,-999,-999,-999,-999,-999,-999,-999,-999,-999,-999,-999
,2005-08-23T21:49:41Z,WQS004,-23.22,150.98,45.2,-999,-999,-999,-999,-999,-999,-999,-999,-999,-999,-999,-999
,2005-08-23T21:49:43Z,WQS004,-23.22,150.98,45.4,-999,-999,-999,-999,-999,-999,-999,-999,-999,-999,-999,-999
,2005-08-23T21:49:43Z,WQS004,-23.22,150.98,45.6,-999,-999,-999,-999,-999,-999,-999,-999,-999,-999,-999,-999
,2005-08-23T21:49:45Z,WQS004,-23.22,150.98,45.8,-999,-999,-999,-999,-999,-999,-999,-999,-999,-999,-999,-999
,2005-08-23T21:49:47Z,WQS004,-23.22,150.98,46,-999,-999,-999,-999,-999,-999,-999,-999,-999,-999,-999,-999
,2005-08-23T21:49:47Z,WQS004,-23.22,150.98,46.2,-999,-999,-999,-999,-999,-999,-999,-999,-999,-999,-999,-999
,2005-08-23T21:49:49Z,WQS004,-23.22,150.98,46.4,-999,-999,-999,-999,-999,-999,-999,-999,-999,-999,-999,-999
,2005-08-23T21:49:51Z,WQS004,-23.22,150.98,46.6,-999,-999,-999,-999,-999,-999,-999,-999,-999,-999,-999,-999
,2005-08-23T21:49:51Z,WQS004,-23.22,150.98,46.8,-999,-999,-999,-999,-999,-999,-999,-999,-999,-999,-999,-999
,2005-08-23T21:49:53Z,WQS004,-23.22,150.98,47,-999,-999,-999,-999,-999,-999,-999,-999,-999,-999,-999,-999
,2005-08-23T21:49:55Z,WQS004,-23.22,150.98,47.2,-999,-999,-999,-999,-999,-999,-999,-999,-999,-999,-999,-999
,2005-08-23T21:49:55Z,WQS004,-23.22,150.98,47.4,-999,-999,-999,-999,-999,-999,-999,-999,-999,-999,-999,-999
,2005-08-23T21:49:57Z,WQS004,-23.22,150.98,47.6,-999,-999,-999,-999,-999,-999,-999,-999,-999,-999,-999,-999
,2005-08-23T21:49:57Z,WQS004,-23.22,150.98,47.8,-999,-999,-999,-999,-999,-999,-999,-999,-999,-999,-999,-999
,2005-08-23T21:49:59Z,WQS004,-23.22,150.98,48,-999,-999,-999,-999,-999,-999,-999,-999,-999,-999,-999,-999
,2005-08-23T21:50:01Z,WQS004,-23.22,150.98,48.2,-999,-999,-999,-999,-999,-999,-999,-999,-999,-999,-999,-999
,2005-08-23T21:50:01Z,WQS004,-23.22,150.98,48.4,-999,-999,-999,-999,-999,-999,-999,-999,-999,-999,-999,-999
,2005-08-23T21:50:03Z,WQS004,-23.22,150.98,48.6,-999,-999,-999,-999,-999,-999,-999,-999,-999,-999,-999,-999
,2005-08-23T21:50:05Z,WQS004,-23.22,150.98,48.8,-999,-999,-999,-999,-999,-999,-999,-999,-999,-999,-999,-999
,2005-08-23T21:50:05Z,WQS004,-23.22,150.98,49,-999,-999,-999,-999,-999,-999,-999,-999,-999,-999,-999,-999
,2005-08-23T21:50:07Z,WQS004,-23.22,150.98,49.2,-999,-999,-999,-999,-999,-999,-999,-999,-999,-999,-999,-999
,2005-08-23T21:50:09Z,WQS004,-23.22,150.98,49.4,-999,-999,-999,-999,-999,-999,-999,-999,-999,-999,-999,-999
,2005-08-23T21:50:09Z,WQS004,-23.22,150.98,49.6,-999,-999,-999,-999,-999,-999,-999,-999,-999,-999,-999,-999
,2005-08-23T21:50:11Z,WQS004,-23.22,150.98,49.8,-999,-999,-999,-999,-999,-999,-999,-999,-999,-999,-999,-999
,2005-08-23T21:50:11Z,WQS004,-23.22,150.98,50,-999,-999,-999,-999,-999,-999,-999,-999,-999,-999,-999,-999
,2005-08-23T21:50:13Z,WQS004,-23.22,150.98,50.2,-999,-999,-999,-999,-999,-999,-999,-999,-999,-999,-999,-999
,2005-08-23T21:50:15Z,WQS004,-23.22,150.98,50.4,-999,-999,-999,-999,-999,-999,-999,-999,-999,-999,-999,-999
,2005-08-23T21:50:15Z,WQS004,-23.22,150.98,50.6,-999,-999,-999,-999,-999,-999,-999,-999,-999,-999,-999,-999
,2005-08-23T21:50:17Z,WQS004,-23.22,150.98,50.8,-999,-999,-999,-999,-999,-999,-999,-999,-999,-999,-999,-999
,2005-08-23T21:50:19Z,WQS004,-23.22,150.98,51,-999,-999,-999,-999,-999,-999,-999,-999,-999,-999,-999,-999
,2005-08-23T21:50:19Z,WQS004,-23.22,150.98,51.2,-999,-999,-999,-999,-999,-999,-999,-999,-999,-999,-999,-999
,2005-08-23T21:50:21Z,WQS004,-23.22,150.98,51.4,-999,-999,-999,-999,-999,-999,-999,-999,-999,-999,-999,-999
,2005-08-23T21:50:23Z,WQS004,-23.22,150.98,51.6,-999,-999,-999,-999,-999,-999,-999,-999,-999,-999,-999,-999
,2005-08-23T21:50:23Z,WQS004,-23.22,150.98,51.8,-999,-999,-999,-999,-999,-999,-999,-999,-999,-999,-999,-999
,2005-08-23T21:50:25Z,WQS004,-23.22,150.98,52,-999,-999,-999,-999,-999,-999,-999,-999,-999,-999,-999,-999
,2005-08-23T21:50:25Z,WQS004,-23.22,150.98,52.2,-999,-999,-999,-999,-999,-999,-999,-999,-999,-999,-999,-999
,2005-08-23T21:50:27Z,WQS004,-23.22,150.98,52.4,-999,-999,-999,-999,-999,-999,-999,-999,-999,-999,-999,-999
,2005-08-23T21:50:29Z,WQS004,-23.22,150.98,52.6,-999,-999,-999,-999,-999,-999,-999,-999,-999,-999,-999,-999
,2005-08-23T21:50:29Z,WQS004,-23.22,150.98,52.8,-999,-999,-999,-999,-999,-999,-999,-999,-999,-999,-999,-999
,2005-08-23T21:50:31Z,WQS004,-23.22,150.98,53,-999,-999,-999,-999,-999,-999,-999,-999,-999,-999,-999,-999
,2005-08-23T21:50:33Z,WQS004,-23.22,150.98,53.2,-999,-999,-999,-999,-999,-999,-999,-999,-999,-999,-999,-999
,2005-08-23T21:50:33Z,WQS004,-23.22,150.98,53.4,-999,-999,-999,-999,-999,-999,-999,-999,-999,-999,-999,-999
,2005-08-23T21:50:35Z,WQS004,-23.22,150.98,53.6,-999,-999,-999,-999,-999,-999,-999,-999,-999,-999,-999,-999
,2005-08-23T21:50:37Z,WQS004,-23.22,150.98,53.8,-999,-999,-999,-999,-999,-999,-999,-999,-999,-999,-999,-999
,2005-08-23T21:50:37Z,WQS004,-23.22,150.98,54,-999,-999,-999,-999,-999,-999,-999,-999,-999,-999,-999,-999
,2005-08-23T21:50:39Z,WQS004,-23.22,150.98,54.2,-999,-999,-999,-999,-999,-999,-999,-999,-999,-999,-999,-999
,2005-08-23T21:50:39Z,WQS004,-23.22,150.98,54.4,-999,-999,-999,-999,-999,-999,-999,-999,-999,-999,-999,-999
,2005-08-23T21:50:41Z,WQS004,-23.22,150.98,54.6,-999,-999,-999,-999,-999,-999,-999,-999,-999,-999,-999,-999
,2005-08-23T21:50:43Z,WQS004,-23.22,150.98,54.8,-999,-999,-999,-999,-999,-999,-999,-999,-999,-999,-999,-999
,2005-08-23T21:50:43Z,WQS004,-23.22,150.98,55,-999,-999,-999,-999,-999,-999,-999,-999,-999,-999,-999,-999
,2005-08-23T21:50:45Z,WQS004,-23.22,150.98,55.2,-999,-999,-999,-999,-999,-999,-999,-999,-999,-999,-999,-999
,2005-08-23T21:50:47Z,WQS004,-23.22,150.98,55.4,-999,-999,-999,-999,-999,-999,-999,-999,-999,-999,-999,-999
,2005-08-23T21:50:47Z,WQS004,-23.22,150.98,55.6,-999,-999,-999,-999,-999,-999,-999,-999,-999,-999,-999,-999
,2005-08-23T21:50:49Z,WQS004,-23.22,150.98,55.8,-999,-999,-999,-999,-999,-999,-999,-999,-999,-999,-999,-999
,2005-08-23T21:50:51Z,WQS004,-23.22,150.98,56,-999,-999,-999,-999,-999,-999,-999,-999,-999,-999,-999,-999
,2005-08-23T21:50:51Z,WQS004,-23.22,150.98,56.2,-999,-999,-999,-999,-999,-999,-999,-999,-999,-999,-999,-999
,2005-08-23T21:50:53Z,WQS004,-23.22,150.98,56.4,-999,-999,-999,-999,-999,-999,-999,-999,-999,-999,-999,-999
,2005-08-23T21:50:53Z,WQS004,-23.22,150.98,56.6,-999,-999,-999,-999,-999,-999,-999,-999,-999,-999,-999,-999
,2005-08-23T21:50:55Z,WQS004,-23.22,150.98,56.8,-999,-999,-999,-999,-999,-999,-999,-999,-999,-999,-999,-999
,2005-08-23T21:56:41Z,WQS004,-23.22,150.98,57,-999,-999,-999,-999,-999,-999,-999,-999,-999,-999,-999,-999
,2005-08-23T21:56:41Z,WQS004,-23.22,150.98,57.2,-999,-999,-999,-999,-999,-999,-999,-999,-999,-999,-999,-999
,2005-08-23T21:56:43Z,WQS004,-23.22,150.98,57.4,-999,-999,-999,-999,-999,-999,-999,-999,-999,-999,-999,-999
,2005-08-23T21:56:45Z,WQS004,-23.22,150.98,57.6,-999,-999,-999,-999,-999,-999,-999,-999,-999,-999,-999,-999
,2005-08-23T21:56:45Z,WQS004,-23.22,150.98,57.8,-999,-999,-999,-999,-999,-999,-999,-999,-999,-999,-999,-999
,2005-08-23T21:56:47Z,WQS004,-23.22,150.98,58,-999,-999,-999,-999,-999,-999,-999,-999,-999,-999,-999,-999
,2005-08-23T21:56:49Z,WQS004,-23.22,150.98,58.2,-999,-999,-999,-999,-999,-999,-999,-999,-999,-999,-999,-999
,2005-08-23T21:56:49Z,WQS004,-23.22,150.98,58.4,-999,-999,-999,-999,-999,-999,-999,-999,-999,-999,-999,-999
,2005-08-23T21:56:51Z,WQS004,-23.22,150.98,58.6,-999,-999,-999,-999,-999,-999,-999,-999,-999,-999,-999,-999
,2005-08-23T21:56:51Z,WQS004,-23.22,150.98,58.8,-999,-999,-999,-999,-999,-999,-999,-999,-999,-999,-999,-999
,2005-08-23T21:56:53Z,WQS004,-23.22,150.98,59,-999,-999,-999,-999,-999,-999,-999,-999,-999,-999,-999,-999
,2005-08-23T21:56:55Z,WQS004,-23.22,150.98,59.2,-999,-999,-999,-999,-999,-999,-999,-999,-999,-999,-999,-999
,2005-08-23T21:56:55Z,WQS004,-23.22,150.98,59.4,-999,-999,-999,-999,-999,-999,-999,-999,-999,-999,-999,-999
,2005-08-23T21:56:57Z,WQS004,-23.22,150.98,59.6,-999,-999,-999,-999,-999,-999,-999,-999,-999,-999,-999,-999
,2005-08-23T21:56:59Z,WQS004,-23.22,150.98,59.8,-999,-999,-999,-999,-999,-999,-999,-999,-999,-999,-999,-999
,2005-08-23T21:56:59Z,WQS004,-23.22,150.98,60,-999,-999,-999,-999,-999,-999,-999,-999,-999,-999,-999,-999
,2005-08-23T21:57:01Z,WQS004,-23.22,150.98,60.2,-999,-999,-999,-999,-999,-999,-999,-999,-999,-999,-999,-999
,2005-08-23T21:57:03Z,WQS004,-23.22,150.98,60.4,-999,-999,-999,-999,-999,-999,-999,-999,-999,-999,-999,-999
,2005-08-23T21:57:03Z,WQS004,-23.22,150.98,60.6,-999,-999,-999,-999,-999,-999,-999,-999,-999,-999,-999,-999
,2005-08-23T21:57:05Z,WQS004,-23.22,150.98,60.8,-999,-999,-999,-999,-999,-999,-999,-999,-999,-999,-999,-999
,2005-08-23T21:57:07Z,WQS004,-23.22,150.98,61,-999,-999,-999,-999,-999,-999,-999,-999,-999,-999,-999,-999
,2005-08-23T21:57:07Z,WQS004,-23.22,150.98,61.2,-999,-999,-999,-999,-999,-999,-999,-999,-999,-999,-999,-999
,2005-08-23T21:57:09Z,WQS004,-23.22,150.98,61.4,-999,-999,-999,-999,-999,-999,-999,-999,-999,-999,-999,-999
,2005-08-23T21:57:09Z,WQS004,-23.22,150.98,61.6,-999,-999,-999,-999,-999,-999,-999,-999,-999,-999,-999,-999
,2005-08-23T21:57:11Z,WQS004,-23.22,150.98,61.8,-999,-999,-999,-999,-999,-999,-999,-999,-999,-999,-999,-999
,2005-08-23T21:57:13Z,WQS004,-23.22,150.98,62,-999,-999,-999,-999,-999,-999,-999,-999,-999,-999,-999,-999
,2005-08-23T21:57:13Z,WQS004,-23.22,150.98,62.2,-999,-999,-999,-999,-999,-999,-999,-999,-999,-999,-999,-999
,2005-08-23T21:57:15Z,WQS004,-23.22,150.98,62.4,-999,-999,-999,-999,-999,-999,-999,-999,-999,-999,-999,-999
,2005-08-23T21:57:17Z,WQS004,-23.22,150.98,62.6,-999,-999,-999,-999,-999,-999,-999,-999,-999,-999,-999,-999
,2005-08-23T21:57:17Z,WQS004,-23.22,150.98,62.8,-999,-999,-999,-999,-999,-999,-999,-999,-999,-999,-999,-999
,2005-08-23T21:57:19Z,WQS004,-23.22,150.98,63,-999,-999,-999,-999,-999,-999,-999,-999,-999,-999,-999,-999
,2005-08-23T21:57:21Z,WQS004,-23.22,150.98,63.2,-999,-999,-999,-999,-999,-999,-999,-999,-999,-999,-999,-999
,2005-08-23T21:57:21Z,WQS004,-23.22,150.98,63.4,-999,-999,-999,-999,-999,-999,-999,-999,-999,-999,-999,-999
,2005-08-23T21:57:23Z,WQS004,-23.22,150.98,63.6,-999,-999,-999,-999,-999,-999,-999,-999,-999,-999,-999,-999
,2005-08-23T21:57:23Z,WQS004,-23.22,150.98,63.8,-999,-999,-999,-999,-999,-999,-999,-999,-999,-999,-999,-999
,2005-08-23T21:57:25Z,WQS004,-23.22,150.98,64,-999,-999,-999,-999,-999,-999,-999,-999,-999,-999,-999,-999
,2005-08-23T21:57:27Z,WQS004,-23.22,150.98,64.2,-999,-999,-999,-999,-999,-999,-999,-999,-999,-999,-999,-999
,2005-08-23T21:57:27Z,WQS004,-23.22,150.98,64.4,-999,-999,-999,-999,-999,-999,-999,-999,-999,-999,-999,-999
,2005-08-23T21:57:29Z,WQS004,-23.22,150.98,64.6,-999,-999,-999,-999,-999,-999,-999,-999,-999,-999,-999,-999
,2005-08-23T21:57:31Z,WQS004,-23.22,150.98,64.8,-999,-999,-999,-999,-999,-999,-999,-999,-999,-999,-999,-999
,2005-08-23T21:57:31Z,WQS004,-23.22,150.98,65,-999,-999,-999,-999,-999,-999,-999,-999,-999,-999,-999,-999
,2005-08-23T21:57:33Z,WQS004,-23.22,150.98,65.2,-999,-999,-999,-999,-999,-999,-999,-999,-999,-999,-999,-999
,2005-08-23T21:57:35Z,WQS004,-23.22,150.98,65.4,-999,-999,-999,-999,-999,-999,-999,-999,-999,-999,-999,-999
,2005-08-23T21:57:35Z,WQS004,-23.22,150.98,65.6,-999,-999,-999,-999,-999,-999,-999,-999,-999,-999,-999,-999
,2005-08-23T21:57:37Z,WQS004,-23.22,150.98,65.8,-999,-999,-999,-999,-999,-999,-999,-999,-999,-999,-999,-999
,2005-08-23T21:57:37Z,WQS004,-23.22,150.98,66,-999,-999,-999,-999,-999,-999,-999,-999,-999,-999,-999,-999
,2005-08-23T21:58:45Z,WQS004,-23.22,150.98,66.2,-999,-999,-999,-999,-999,-999,-999,-999,-999,-999,-999,-999
,2005-08-23T21:58:47Z,WQS004,-23.22,150.98,66.4,-999,-999,-999,-999,-999,-999,-999,-999,-999,-999,-999,-999
,2005-08-23T21:58:47Z,WQS004,-23.22,150.98,66.6,-999,-999,-999,-999,-999,-999,-999,-999,-999,-999,-999,-999
,2005-08-23T21:58:49Z,WQS004,-23.22,150.98,66.8,-999,-999,-999,-999,-999,-999,-999,-999,-999,-999,-999,-999
,2005-08-23T21:58:51Z,WQS004,-23.22,150.98,67,-999,-999,-999,-999,-999,-999,-999,-999,-999,-999,-999,-999
,2005-08-23T21:58:51Z,WQS004,-23.22,150.98,67.2,-999,-999,-999,-999,-999,-999,-999,-999,-999,-999,-999,-999
,2005-08-23T21:58:53Z,WQS004,-23.22,150.98,67.4,-999,-999,-999,-999,-999,-999,-999,-999,-999,-999,-999,-999
,2005-08-23T21:58:55Z,WQS004,-23.22,150.98,67.6,-999,-999,-999,-999,-999,-999,-999,-999,-999,-999,-999,-999
,2005-08-23T21:58:55Z,WQS004,-23.22,150.98,67.8,-999,-999,-999,-999,-999,-999,-999,-999,-999,-999,-999,-999
,2005-08-23T21:58:57Z,WQS004,-23.22,150.98,68,-999,-999,-999,-999,-999,-999,-999,-999,-999,-999,-999,-999
,2005-08-23T21:58:57Z,WQS004,-23.22,150.98,68.2,-999,-999,-999,-999,-999,-999,-999,-999,-999,-999,-999,-999
,2005-08-23T21:59:01Z,WQS004,-23.22,150.98,68.4,-999,-999,-999,-999,-999,-999,-999,-999,-999,-999,-999,-999
,2005-08-23T21:59:03Z,WQS004,-23.22,150.98,68.6,-999,-999,-999,-999,-999,-999,-999,-999,-999,-999,-999,-999
,2005-08-23T21:59:03Z,WQS004,-23.22,150.98,68.8,-999,-999,-999,-999,-999,-999,-999,-999,-999,-999,-999,-999
,2005-08-23T21:59:05Z,WQS004,-23.22,150.98,69,-999,-999,-999,-999,-999,-999,-999,-999,-999,-999,-999,-999
,2005-08-23T21:59:07Z,WQS004,-23.22,150.98,69.2,-999,-999,-999,-999,-999,-999,-999,-999,-999,-999,-999,-999
,2005-08-23T21:59:07Z,WQS004,-23.22,150.98,69.4,-999,-999,-999,-999,-999,-999,-999,-999,-999,-999,-999,-999
,2005-08-23T21:59:09Z,WQS004,-23.22,150.98,69.6,-999,-999,-999,-999,-999,-999,-999,-999,-999,-999,-999,-999
,2005-08-23T21:59:11Z,WQS004,-23.22,150.98,69.8,-999,-999,-999,-999,-999,-999,-999,-999,-999,-999,-999,-999
,2005-08-23T21:59:11Z,WQS004,-23.22,150.98,70,-999,-999,-999,-999,-999,-999,-999,-999,-999,-999,-999,-999
,2005-08-23T21:59:13Z,WQS004,-23.22,150.98,70.2,-999,-999,-999,-999,-999,-999,-999,-999,-999,-999,-999,-999
,2005-08-23T21:59:13Z,WQS004,-23.22,150.98,70.4,-999,-999,-999,-999,-999,-999,-999,-999,-999,-999,-999,-999
,2005-08-23T21:59:15Z,WQS004,-23.22,150.98,70.6,-999,-999,-999,-999,-999,-999,-999,-999,-999,-999,-999,-999
,2005-08-23T21:59:17Z,WQS004,-23.22,150.98,70.8,-999,-999,-999,-999,-999,-999,-999,-999,-999,-999,-999,-999
,2005-08-23T21:59:17Z,WQS004,-23.22,150.98,71,-999,-999,-999,-999,-999,-999,-999,-999,-999,-999,-999,-999
,2005-08-23T21:59:19Z,WQS004,-23.22,150.98,71.2,-999,-999,-999,-999,-999,-999,-999,-999,-999,-999,-999,-999
,2005-08-23T21:59:21Z,WQS004,-23.22,150.98,71.4,-999,-999,-999,-999,-999,-999,-999,-999,-999,-999,-999,-999
,2005-08-23T21:59:21Z,WQS004,-23.22,150.98,71.6,-999,-999,-999,-999,-999,-999,-999,-999,-999,-999,-999,-999
,2005-08-23T21:59:23Z,WQS004,-23.22,150.98,71.8,-999,-999,-999,-999,-999,-999,-999,-999,-999,-999,-999,-999
,2005-08-23T21:59:25Z,WQS004,-23.22,150.98,72,-999,-999,-999,-999,-999,-999,-999,-999,-999,-999,-999,-999
,2005-08-23T21:59:25Z,WQS004,-23.22,150.98,72.2,-999,-999,-999,-999,-999,-999,-999,-999,-999,-999,-999,-999
,2005-08-23T21:59:27Z,WQS004,-23.22,150.98,72.4,-999,-999,-999,-999,-999,-999,-999,-999,-999,-999,-999,-999
,2005-08-23T21:59:27Z,WQS004,-23.22,150.98,72.6,-999,-999,-999,-999,-999,-999,-999,-999,-999,-999,-999,-999
,2005-08-23T21:59:29Z,WQS004,-23.22,150.98,72.8,-999,-999,-999,-999,-999,-999,-999,-999,-999,-999,-999,-999
,2005-08-23T21:59:31Z,WQS004,-23.22,150.98,73,-999,-999,-999,-999,-999,-999,-999,-999,-999,-999,-999,-999
,2005-08-23T21:59:31Z,WQS004,-23.22,150.98,73.2,-999,-999,-999,-999,-999,-999,-999,-999,-999,-999,-999,-999
,2005-08-23T21:59:33Z,WQS004,-23.22,150.98,73.4,-999,-999,-999,-999,-999,-999,-999,-999,-999,-999,-999,-999
,2005-08-23T21:59:35Z,WQS004,-23.22,150.98,73.6,-999,-999,-999,-999,-999,-999,-999,-999,-999,-999,-999,-999
,2005-08-23T21:59:35Z,WQS004,-23.22,150.98,73.8,-999,-999,-999,-999,-999,-999,-999,-999,-999,-999,-999,-999
,2005-08-23T21:59:37Z,WQS004,-23.22,150.98,74,-999,-999,-999,-999,-999,-999,-999,-999,-999,-999,-999,-999
,2005-08-23T22:07:19Z,WQS004,-23.22,150.98,74.2,-999,-999,-999,-999,-999,-999,-999,-999,-999,-999,-999,-999
,2005-08-23T22:07:19Z,WQS004,-23.22,150.98,74.4,-999,-999,-999,-999,-999,-999,-999,-999,-999,-999,-999,-999
,2005-08-23T22:07:21Z,WQS004,-23.22,150.98,74.6,-999,-999,-999,-999,-999,-999,-999,-999,-999,-999,-999,-999
,2005-08-23T22:07:23Z,WQS004,-23.22,150.98,74.8,-999,-999,-999,-999,-999,-999,-999,-999,-999,-999,-999,-999
,2005-08-23T22:07:23Z,WQS004,-23.22,150.98,75,-999,-999,-999,-999,-999,-999,-999,-999,-999,-999,-999,-999
,2005-08-23T22:07:25Z,WQS004,-23.22,150.98,75.2,-999,-999,-999,-999,-999,-999,-999,-999,-999,-999,-999,-999
,2005-08-23T22:07:25Z,WQS004,-23.22,150.98,75.4,-999,-999,-999,-999,-999,-999,-999,-999,-999,-999,-999,-999
,2005-08-23T22:07:27Z,WQS004,-23.22,150.98,75.6,-999,-999,-999,-999,-999,-999,-999,-999,-999,-999,-999,-999
,2005-08-23T22:07:29Z,WQS004,-23.22,150.98,75.8,-999,-999,-999,-999,-999,-999,-999,-999,-999,-999,-999,-999
,2005-08-23T22:07:29Z,WQS004,-23.22,150.98,76,-999,-999,-999,-999,-999,-999,-999,-999,-999,-999,-999,-999
,2005-08-23T22:07:31Z,WQS004,-23.22,150.98,76.2,-999,-999,-999,-999,-999,-999,-999,-999,-999,-999,-999,-999
,2005-08-23T22:07:33Z,WQS004,-23.22,150.98,76.4,-999,-999,-999,-999,-999,-999,-999,-999,-999,-999,-999,-999
,2005-08-23T22:07:33Z,WQS004,-23.22,150.98,76.6,-999,-999,-999,-999,-999,-999,-999,-999,-999,-999,-999,-999
,2005-08-23T22:07:35Z,WQS004,-23.22,150.98,76.8,-999,-999,-999,-999,-999,-999,-999,-999,-999,-999,-999,-999
,2005-08-23T22:07:37Z,WQS004,-23.22,150.98,77,-999,-999,-999,-999,-999,-999,-999,-999,-999,-999,-999,-999
,2005-08-23T22:07:37Z,WQS004,-23.22,150.98,77.2,-999,-999,-999,-999,-999,-999,-999,-999,-999,-999,-999,-999
,2005-08-23T22:07:39Z,WQS004,-23.22,150.98,77.4,-999,-999,-999,-999,-999,-999,-999,-999,-999,-999,-999,-999
,2005-08-23T22:07:39Z,WQS004,-23.22,150.98,77.6,-999,-999,-999,-999,-999,-999,-999,-999,-999,-999,-999,-999
,2005-08-23T22:07:41Z,WQS004,-23.22,150.98,77.8,-999,-999,-999,-999,-999,-999,-999,-999,-999,-999,-999,-999
,2005-08-23T22:07:43Z,WQS004,-23.22,150.98,78,-999,-999,-999,-999,-999,-999,-999,-999,-999,-999,-999,-999
,2005-08-23T22:07:43Z,WQS004,-23.22,150.98,78.2,-999,-999,-999,-999,-999,-999,-999,-999,-999,-999,-999,-999
,2005-08-23T22:07:45Z,WQS004,-23.22,150.98,78.4,-999,-999,-999,-999,-999,-999,-999,-999,-999,-999,-999,-999
,2005-08-23T22:07:47Z,WQS004,-23.22,150.98,78.6,-999,-999,-999,-999,-999,-999,-999,-999,-999,-999,-999,-999
,2005-08-23T22:07:47Z,WQS004,-23.22,150.98,78.8,-999,-999,-999,-999,-999,-999,-999,-999,-999,-999,-999,-999
,2005-08-23T22:07:49Z,WQS004,-23.22,150.98,79,-999,-999,-999,-999,-999,-999,-999,-999,-999,-999,-999,-999
,2005-08-23T22:07:51Z,WQS004,-23.22,150.98,79.2,-999,-999,-999,-999,-999,-999,-999,-999,-999,-999,-999,-999
,2005-08-23T22:07:51Z,WQS004,-23.22,150.98,79.4,-999,-999,-999,-999,-999,-999,-999,-999,-999,-999,-999,-999
,2005-08-23T22:07:53Z,WQS004,-23.22,150.98,79.6,-999,-999,-999,-999,-999,-999,-999,-999,-999,-999,-999,-999
,2005-08-23T22:07:53Z,WQS004,-23.22,150.98,79.8,-999,-999,-999,-999,-999,-999,-999,-999,-999,-999,-999,-999
,2005-08-23T22:07:55Z,WQS004,-23.22,150.98,80,-999,-999,-999,-999,-999,-999,-999,-999,-999,-999,-999,-999
,2005-08-23T22:07:57Z,WQS004,-23.22,150.98,80.2,-999,-999,-999,-999,-999,-999,-999,-999,-999,-999,-999,-999
,2005-08-23T22:07:57Z,WQS004,-23.22,150.98,80.4,-999,-999,-999,-999,-999,-999,-999,-999,-999,-999,-999,-999
,2005-08-23T22:07:59Z,WQS004,-23.22,150.98,80.6,-999,-999,-999,-999,-999,-999,-999,-999,-999,-999,-999,-999
,2005-08-23T22:08:01Z,WQS004,-23.22,150.98,80.8,-999,-999,-999,-999,-999,-999,-999,-999,-999,-999,-999,-999
,2005-08-23T22:08:01Z,WQS004,-23.22,150.98,81,-999,-999,-999,-999,-999,-999,-999,-999,-999,-999,-999,-999
,2005-08-23T22:08:03Z,WQS004,-23.22,150.98,81.2,-999,-999,-999,-999,-999,-999,-999,-999,-999,-999,-999,-999
,2005-08-23T22:08:05Z,WQS004,-23.22,150.98,81.4,-999,-999,-999,-999,-999,-999,-999,-999,-999,-999,-999,-999
,2005-08-23T22:08:05Z,WQS004,-23.22,150.98,81.6,-999,-999,-999,-999,-999,-999,-999,-999,-999,-999,-999,-999
,2005-08-23T22:08:07Z,WQS004,-23.22,150.98,81.8,-999,-999,-999,-999,-999,-999,-999,-999,-999,-999,-999,-999
,2005-08-23T22:08:07Z,WQS004,-23.22,150.98,82,-999,-999,-999,-999,-999,-999,-999,-999,-999,-999,-999,-999
,2005-08-23T22:08:09Z,WQS004,-23.22,150.98,82.2,-999,-999,-999,-999,-999,-999,-999,-999,-999,-999,-999,-999
,2005-08-23T22:08:11Z,WQS004,-23.22,150.98,82.4,-999,-999,-999,-999,-999,-999,-999,-999,-999,-999,-999,-999
,2005-08-23T22:08:11Z,WQS004,-23.22,150.98,82.6,-999,-999,-999,-999,-999,-999,-999,-999,-999,-999,-999,-999
,2005-08-23T22:08:13Z,WQS004,-23.22,150.98,82.8,-999,-999,-999,-999,-999,-999,-999,-999,-999,-999,-999,-999
,2005-08-23T22:08:15Z,WQS004,-23.22,150.98,83,-999,-999,-999,-999,-999,-999,-999,-999,-999,-999,-999,-999
,2005-08-23T22:08:15Z,WQS004,-23.22,150.98,83.2,-999,-999,-999,-999,-999,-999,-999,-999,-999,-999,-999,-999
,2005-08-23T22:08:17Z,WQS004,-23.22,150.98,83.4,-999,-999,-999,-999,-999,-999,-999,-999,-999,-999,-999,-999
,2005-08-23T22:08:19Z,WQS004,-23.22,150.98,83.6,-999,-999,-999,-999,-999,-999,-999,-999,-999,-999,-999,-999
,2005-08-23T22:08:19Z,WQS004,-23.22,150.98,83.8,-999,-999,-999,-999,-999,-999,-999,-999,-999,-999,-999,-999
,2005-08-23T22:08:21Z,WQS004,-23.22,150.98,84,-999,-999,-999,-999,-999,-999,-999,-999,-999,-999,-999,-999
,2005-08-23T22:08:21Z,WQS004,-23.22,150.98,84.2,-999,-999,-999,-999,-999,-999,-999,-999,-999,-999,-999,-999
,2005-08-23T22:08:23Z,WQS004,-23.22,150.98,84.4,-999,-999,-999,-999,-999,-999,-999,-999,-999,-999,-999,-999
,2005-08-23T22:08:25Z,WQS004,-23.22,150.98,84.6,-999,-999,-999,-999,-999,-999,-999,-999,-999,-999,-999,-999
,2005-08-23T22:08:25Z,WQS004,-23.22,150.98,84.8,-999,-999,-999,-999,-999,-999,-999,-999,-999,-999,-999,-999
,2005-08-23T22:08:27Z,WQS004,-23.22,150.98,85,-999,-999,-999,-999,-999,-999,-999,-999,-999,-999,-999,-999
,2005-08-23T22:08:29Z,WQS004,-23.22,150.98,85.2,-999,-999,-999,-999,-999,-999,-999,-999,-999,-999,-999,-999
,2005-08-23T22:08:29Z,WQS004,-23.22,150.98,85.4,-999,-999,-999,-999,-999,-999,-999,-999,-999,-999,-999,-999
,2005-08-23T22:08:31Z,WQS004,-23.22,150.98,85.6,-999,-999,-999,-999,-999,-999,-999,-999,-999,-999,-999,-999
,2005-08-23T22:08:33Z,WQS004,-23.22,150.98,85.8,-999,-999,-999,-999,-999,-999,-999,-999,-999,-999,-999,-999
,2005-08-23T22:08:33Z,WQS004,-23.22,150.98,86,-999,-999,-999,-999,-999,-999,-999,-999,-999,-999,-999,-999
,2005-08-23T22:08:35Z,WQS004,-23.22,150.98,86.2,-999,-999,-999,-999,-999,-999,-999,-999,-999,-999,-999,-999
,2005-08-23T22:08:35Z,WQS004,-23.22,150.98,86.4,-999,-999,-999,-999,-999,-999,-999,-999,-999,-999,-999,-999
,2005-08-23T22:08:37Z,WQS004,-23.22,150.98,86.6,-999,-999,-999,-999,-999,-999,-999,-999,-999,-999,-999,-999
,2005-08-23T22:08:39Z,WQS004,-23.22,150.98,86.8,-999,-999,-999,-999,-999,-999,-999,-999,-999,-999,-999,-999
,2005-08-23T22:08:39Z,WQS004,-23.22,150.98,87,-999,-999,-999,-999,-999,-999,-999,-999,-999,-999,-999,-999
,2005-08-23T22:08:41Z,WQS004,-23.22,150.98,87.2,-999,-999,-999,-999,-999,-999,-999,-999,-999,-999,-999,-999
,2005-08-23T22:08:43Z,WQS004,-23.22,150.98,87.4,-999,-999,-999,-999,-999,-999,-999,-999,-999,-999,-999,-999
,2005-08-23T22:08:43Z,WQS004,-23.22,150.98,87.6,-999,-999,-999,-999,-999,-999,-999,-999,-999,-999,-999,-999
,2005-08-23T22:08:45Z,WQS004,-23.22,150.98,87.8,-999,-999,-999,-999,-999,-999,-999,-999,-999,-999,-999,-999
,2005-08-23T22:08:47Z,WQS004,-23.22,150.98,88,-999,-999,-999,-999,-999,-999,-999,-999,-999,-999,-999,-999
,2005-08-23T22:08:47Z,WQS004,-23.22,150.98,88.2,-999,-999,-999,-999,-999,-999,-999,-999,-999,-999,-999,-999
,2005-08-23T22:08:49Z,WQS004,-23.22,150.98,88.4,-999,-999,-999,-999,-999,-999,-999,-999,-999,-999,-999,-999
,2005-08-23T22:08:51Z,WQS004,-23.22,150.98,88.6,-999,-999,-999,-999,-999,-999,-999,-999,-999,-999,-999,-999
,2005-08-23T22:08:51Z,WQS004,-23.22,150.98,88.8,-999,-999,-999,-999,-999,-999,-999,-999,-999,-999,-999,-999
,2005-08-23T22:08:53Z,WQS004,-23.22,150.98,89,-999,-999,-999,-999,-999,-999,-999,-999,-999,-999,-999,-999
,2005-08-23T22:08:53Z,WQS004,-23.22,150.98,89.2,-999,-999,-999,-999,-999,-999,-999,-999,-999,-999,-999,-999
,2005-08-23T22:08:55Z,WQS004,-23.22,150.98,89.4,-999,-999,-999,-999,-999,-999,-999,-999,-999,-999,-999,-999
,2005-08-23T22:08:57Z,WQS004,-23.22,150.98,89.6,-999,-999,-999,-999,-999,-999,-999,-999,-999,-999,-999,-999
,2005-08-23T22:08:57Z,WQS004,-23.22,150.98,89.8,-999,-999,-999,-999,-999,-999,-999,-999,-999,-999,-999,-999
,2005-08-23T22:08:59Z,WQS004,-23.22,150.98,90,-999,-999,-999,-999,-999,-999,-999,-999,-999,-999,-999,-999
,2005-08-23T22:09:01Z,WQS004,-23.22,150.98,90.2,-999,-999,-999,-999,-999,-999,-999,-999,-999,-999,-999,-999
,2005-08-23T22:09:01Z,WQS004,-23.22,150.98,90.4,-999,-999,-999,-999,-999,-999,-999,-999,-999,-999,-999,-999
,2005-08-23T22:09:03Z,WQS004,-23.22,150.98,90.6,-999,-999,-999,-999,-999,-999,-999,-999,-999,-999,-999,-999
,2005-08-23T22:09:05Z,WQS004,-23.22,150.98,90.8,-999,-999,-999,-999,-999,-999,-999,-999,-999,-999,-999,-999
,2005-08-23T22:09:05Z,WQS004,-23.22,150.98,91,-999,-999,-999,-999,-999,-999,-999,-999,-999,-999,-999,-999
,2005-08-23T22:09:07Z,WQS004,-23.22,150.98,91.2,-999,-999,-999,-999,-999,-999,-999,-999,-999,-999,-999,-999
,2005-08-23T22:09:07Z,WQS004,-23.22,150.98,91.4,-999,-999,-999,-999,-999,-999,-999,-999,-999,-999,-999,-999
,2005-08-23T22:09:09Z,WQS004,-23.22,150.98,91.6,-999,-999,-999,-999,-999,-999,-999,-999,-999,-999,-999,-999
,2005-08-23T22:09:11Z,WQS004,-23.22,150.98,91.8,-999,-999,-999,-999,-999,-999,-999,-999,-999,-999,-999,-999
,2005-08-23T22:09:11Z,WQS004,-23.22,150.98,92,-999,-999,-999,-999,-999,-999,-999,-999,-999,-999,-999,-999
,2005-08-23T22:09:13Z,WQS004,-23.22,150.98,92.2,-999,-999,-999,-999,-999,-999,-999,-999,-999,-999,-999,-999
,2005-08-23T22:09:15Z,WQS004,-23.22,150.98,92.4,-999,-999,-999,-999,-999,-999,-999,-999,-999,-999,-999,-999
,2005-08-23T22:09:15Z,WQS004,-23.22,150.98,92.6,-999,-999,-999,-999,-999,-999,-999,-999,-999,-999,-999,-999
,2005-08-23T22:09:17Z,WQS004,-23.22,150.98,92.8,-999,-999,-999,-999,-999,-999,-999,-999,-999,-999,-999,-999
,2005-08-23T22:09:19Z,WQS004,-23.22,150.98,93,-999,-999,-999,-999,-999,-999,-999,-999,-999,-999,-999,-999
,2005-08-23T22:09:19Z,WQS004,-23.22,150.98,93.2,-999,-999,-999,-999,-999,-999,-999,-999,-999,-999,-999,-999
,2005-08-23T22:09:21Z,WQS004,-23.22,150.98,93.4,-999,-999,-999,-999,-999,-999,-999,-999,-999,-999,-999,-999
,2005-08-23T22:09:21Z,WQS004,-23.22,150.98,93.6,-999,-999,-999,-999,-999,-999,-999,-999,-999,-999,-999,-999
,2005-08-23T22:09:23Z,WQS004,-23.22,150.98,93.8,-999,-999,-999,-999,-999,-999,-999,-999,-999,-999,-999,-999
,2005-08-23T22:09:25Z,WQS004,-23.22,150.98,94,-999,-999,-999,-999,-999,-999,-999,-999,-999,-999,-999,-999
,2005-08-23T22:09:25Z,WQS004,-23.22,150.98,94.2,-999,-999,-999,-999,-999,-999,-999,-999,-999,-999,-999,-999
,2005-08-23T22:09:27Z,WQS004,-23.22,150.98,94.4,-999,-999,-999,-999,-999,-999,-999,-999,-999,-999,-999,-999
,2005-08-23T22:09:33Z,WQS004,-23.22,150.98,94.6,-999,-999,-999,-999,-999,-999,-999,-999,-999,-999,-999,-999
,2005-08-23T22:09:33Z,WQS004,-23.22,150.98,94.8,-999,-999,-999,-999,-999,-999,-999,-999,-999,-999,-999,-999
,2005-08-23T22:09:35Z,WQS004,-23.22,150.98,95,-999,-999,-999,-999,-999,-999,-999,-999,-999,-999,-999,-999
,2005-08-23T22:09:37Z,WQS004,-23.22,150.98,95.2,-999,-999,-999,-999,-999,-999,-999,-999,-999,-999,-999,-999
,2005-08-23T22:09:37Z,WQS004,-23.22,150.98,95.4,-999,-999,-999,-999,-999,-999,-999,-999,-999,-999,-999,-999
,2005-08-23T22:09:39Z,WQS004,-23.22,150.98,95.6,-999,-999,-999,-999,-999,-999,-999,-999,-999,-999,-999,-999
,2005-08-23T22:09:39Z,WQS004,-23.22,150.98,95.8,-999,-999,-999,-999,-999,-999,-999,-999,-999,-999,-999,-999
,2005-08-23T22:09:41Z,WQS004,-23.22,150.98,96,-999,-999,-999,-999,-999,-999,-999,-999,-999,-999,-999,-999
,2005-08-23T22:09:43Z,WQS004,-23.22,150.98,96.2,-999,-999,-999,-999,-999,-999,-999,-999,-999,-999,-999,-999
,2005-08-23T22:09:43Z,WQS004,-23.22,150.98,96.4,-999,-999,-999,-999,-999,-999,-999,-999,-999,-999,-999,-999
,2005-08-23T22:09:45Z,WQS004,-23.22,150.98,96.6,-999,-999,-999,-999,-999,-999,-999,-999,-999,-999,-999,-999
,2005-08-23T22:09:47Z,WQS004,-23.22,150.98,96.8,-999,-999,-999,-999,-999,-999,-999,-999,-999,-999,-999,-999
,2005-08-23T22:09:47Z,WQS004,-23.22,150.98,97,-999,-999,-999,-999,-999,-999,-999,-999,-999,-999,-999,-999
,2005-08-23T22:09:49Z,WQS004,-23.22,150.98,97.2,-999,-999,-999,-999,-999,-999,-999,-999,-999,-999,-999,-999
,2005-08-23T22:09:51Z,WQS004,-23.22,150.98,97.4,-999,-999,-999,-999,-999,-999,-999,-999,-999,-999,-999,-999
,2005-08-23T22:09:51Z,WQS004,-23.22,150.98,97.6,-999,-999,-999,-999,-999,-999,-999,-999,-999,-999,-999,-999
,2005-08-23T22:09:53Z,WQS004,-23.22,150.98,97.8,-999,-999,-999,-999,-999,-999,-999,-999,-999,-999,-999,-999
,2005-08-23T22:09:53Z,WQS004,-23.22,150.98,98,-999,-999,-999,-999,-999,-999,-999,-999,-999,-999,-999,-999
,2005-08-23T22:09:55Z,WQS004,-23.22,150.98,98.2,-999,-999,-999,-999,-999,-999,-999,-999,-999,-999,-999,-999
,2005-08-23T22:09:57Z,WQS004,-23.22,150.98,98.4,-999,-999,-999,-999,-999,-999,-999,-999,-999,-999,-999,-999
,2005-08-23T22:09:57Z,WQS004,-23.22,150.98,98.6,-999,-999,-999,-999,-999,-999,-999,-999,-999,-999,-999,-999
,2005-08-23T22:09:59Z,WQS004,-23.22,150.98,98.8,-999,-999,-999,-999,-999,-999,-999,-999,-999,-999,-999,-999
,2005-08-23T22:10:01Z,WQS004,-23.22,150.98,99,-999,-999,-999,-999,-999,-999,-999,-999,-999,-999,-999,-999
,2005-08-23T22:10:01Z,WQS004,-23.22,150.98,99.2,-999,-999,-999,-999,-999,-999,-999,-999,-999,-999,-999,-999
,2005-08-23T22:10:03Z,WQS004,-23.22,150.98,99.4,-999,-999,-999,-999,-999,-999,-999,-999,-999,-999,-999,-999
,2005-08-23T22:10:05Z,WQS004,-23.22,150.98,99.6,-999,-999,-999,-999,-999,-999,-999,-999,-999,-999,-999,-999
,2005-08-23T22:10:05Z,WQS004,-23.22,150.98,99.8,-999,-999,-999,-999,-999,-999,-999,-999,-999,-999,-999,-999
,2005-08-23T22:10:07Z,WQS004,-23.22,150.98,100,-999,-999,-999,-999,-999,-999,-999,-999,-999,-999,-999,-999
