GLOBAL ATTRIBUTES,,Comments,,,,,,,,,,,,,,,,,,,,,,,,,,,,,,,,,,,,,,,,,,,,,,,,,,,,,
title,,,,,,,,,,,,,,,,,,,,,,,,,,,,,,,,,,,,,,,,,,,,,,,,,,,,,,,
project,Integrated Marine Observing System (IMOS),,,,,,,,,,,,,,,,,,,,,,,,,,,,,,,,,,,,,,,,,,,,,,,,,,,,,,
original_project_name,Remote Sensing 2008-2011,,,,,,,,,,,,,,,,,,,,,,,,,,,,,,,,,,,,,,,,,,,,,,,,,,,,,,
institution,CMAR,,,,,,,,,,,,,,,,,,,,,,,,,,,,,,,,,,,,,,,,,,,,,,,,,,,,,,
abstract,"The data were collected at a total of 13 stations on the charter vessel Kenomie Spirit. These samples were taken along the Great Barrier Reef Central Section transects. The data were collected to determine the bio-optical charateristics of this region. The data can be used for Ocean Colour sensor validation. Parameters measured are pigments, and the absorption coefficient for dissolved (CDOM), particulate (a/p) and detrital or non-algal (a/d) components of the water column.CLW deployed instruments RAMSES, ac-9, and Hydroscat. ",,,,,,,,,,,,,,,,,,,,,,,,,,,,,,,,,,,,,,,,,,,,,,,,,,,,,,
conventions,IMOS biological data format (v1.0),,,,,,,,,,,,,,,,,,,,,,,,,,,,,,,,,,,,,,,,,,,,,,,,,,,,,,
date_created,,,,,,,,,,,,,,,,,,,,,,,,,,,,,,,,,,,,,,,,,,,,,,,,,,,,,,,
date_modified,,,,,,,,,,,,,,,,,,,,,,,,,,,,,,,,,,,,,,,,,,,,,,,,,,,,,,,
history,data has been quality controlled by in-house procedures,,,,,,,,,,,,,,,,,,,,,,,,,,,,,,,,,,,,,,,,,,,,,,,,,,,,,,
comment,"A value of -999 means the pigment was not measured, while 0.000 means it was measured but below the detection limit.",,,,,,,,,,,,,,,,,,,,,,,,,,,,,,,,,,,,,,,,,,,,,,,,,,,,,,
source,High Performance Liquid Chromatography of pigments in discrete sea-water samples,,,,,,,,,,,,,,,,,,,,,,,,,,,,,,,,,,,,,,,,,,,,,,,,,,,,,,
keywords,Oceans>Ocean Chemistry>Pigments;Oceans>ocean Chemistry>Ocean Colour;Oceans>Ocean Chemistry>Chlorophyll a,,,,,,,,,,,,,,,,,,,,,,,,,,,,,,,,,,,,,,,,,,,,,,,,,,,,,,
vessel_name,Kenomie Spirit,,,,,,,,,,,,,,,,,,,,,,,,,,,,,,,,,,,,,,,,,,,,,,,,,,,,,,
platform_code,,,,,,,,,,,,,,,,,,,,,,,,,,,,,,,,,,,,,,,,,,,,,,,,,,,,,,,
cruise_id,KS022008,,,,,,,,,,,,,,,,,,,,,,,,,,,,,,,,,,,,,,,,,,,,,,,,,,,,,,
references,https://marlin.csiro.au/geonetwork/srv/eng/catalog.search#/metadata/dc570b6f-639c-6d44-e043-08114f8c18bc,,,,,,,,,,,,,,,,,,,,,,,,,,,,,,,,,,,,,,,,,,,,,,,,,,,,,,
naming_authority,CSIRO Marine and Atmospheric Research (CMAR),,,,,,,,,,,,,,,,,,,,,,,,,,,,,,,,,,,,,,,,,,,,,,,,,,,,,,
cdm_data_type,Point,,,,,,,,,,,,,,,,,,,,,,,,,,,,,,,,,,,,,,,,,,,,,,,,,,,,,,
geospatial_lat_min,-23.418,calculated automatically from table,,,,,,,,,,,,,,,,,,,,,,,,,,,,,,,,,,,,,,,,,,,,,,,,,,,,,
geospatial_lat_max,-23.207233333333335,calculated automatically from table,,,,,,,,,,,,,,,,,,,,,,,,,,,,,,,,,,,,,,,,,,,,,,,,,,,,,
geospatial_lon_min,150.88628333333332,calculated automatically from table,,,,,,,,,,,,,,,,,,,,,,,,,,,,,,,,,,,,,,,,,,,,,,,,,,,,,
geospatial_lon_max,151.10948333333334,calculated automatically from table,,,,,,,,,,,,,,,,,,,,,,,,,,,,,,,,,,,,,,,,,,,,,,,,,,,,,
geospatial_vertical_min,0,calculated automatically from table,,,,,,,,,,,,,,,,,,,,,,,,,,,,,,,,,,,,,,,,,,,,,,,,,,,,,
geospatial_vertical_max,6,calculated automatically from table,,,,,,,,,,,,,,,,,,,,,,,,,,,,,,,,,,,,,,,,,,,,,,,,,,,,,
local_time_zone,+10,,,,,,,,,,,,,,,,,,,,,,,,,,,,,,,,,,,,,,,,,,,,,,,,,,,,,,
data_centre,eMarine Information Infrastructure (eMII),,,,,,,,,,,,,,,,,,,,,,,,,,,,,,,,,,,,,,,,,,,,,,,,,,,,,,
data_centre_email,info@emii.org.au,,,,,,,,,,,,,,,,,,,,,,,,,,,,,,,,,,,,,,,,,,,,,,,,,,,,,,
author,"Clementson, Lesley",,,,,,,,,,,,,,,,,,,,,,,,,,,,,,,,,,,,,,,,,,,,,,,,,,,,,,
author_email,Lesley.Clementson@csiro.au,,,,,,,,,,,,,,,,,,,,,,,,,,,,,,,,,,,,,,,,,,,,,,,,,,,,,,
principal_investigator,"Dekker, Arnold",,,,,,,,,,,,,,,,,,,,,,,,,,,,,,,,,,,,,,,,,,,,,,,,,,,,,,
principal_investigator_email,Arnold.Dekker@csiro.au,,,,,,,,,,,,,,,,,,,,,,,,,,,,,,,,,,,,,,,,,,,,,,,,,,,,,,
publisher,Australian Ocean Data Network,,,,,,,,,,,,,,,,,,,,,,,,,,,,,,,,,,,,,,,,,,,,,,,,,,,,,,
publisher_email,info@aodn.org.au,,,,,,,,,,,,,,,,,,,,,,,,,,,,,,,,,,,,,,,,,,,,,,,,,,,,,,
institution,IMOS Satellite Remote Sensing - Ocean Colour Sub-facility - Bio-Optical Database of Australian Waters,,,,,,,,,,,,,,,,,,,,,,,,,,,,,,,,,,,,,,,,,,,,,,,,,,,,,,
institution_principal_investigator,"Schroeder, Thomas",,,,,,,,,,,,,,,,,,,,,,,,,,,,,,,,,,,,,,,,,,,,,,,,,,,,,,
institution_principal_investigator_email,Thomas.Schroeder@csiro.au,,,,,,,,,,,,,,,,,,,,,,,,,,,,,,,,,,,,,,,,,,,,,,,,,,,,,,
citation,"To cite this data set in a publication, use the format ""IMOS [year-of-data-downloaded], [Title], [data-access-url], accessed [date-of-access]""",,,,,,,,,,,,,,,,,,,,,,,,,,,,,,,,,,,,,,,,,,,,,,,,,,,,,,
acknowledgement,Data was sourced from the Commonwealth Scientific and Industrial Research Organisation (CSIRO),,,,,,,,,,,,,,,,,,,,,,,,,,,,,,,,,,,,,,,,,,,,,,,,,,,,,,
distribution_statement,"Any users of IMOS data are required to clearly acknowledge the source of the material. Data, products and services from IMOS are provided ""as is"" without any warranty as to fitness for a particular purpose.",,,,,,,,,,,,,,,,,,,,,,,,,,,,,,,,,,,,,,,,,,,,,,,,,,,,,,
,,,,,,,,,,,,,,,,,,,,,,,,,,,,,,,,,,,,,,,,,,,,,,,,,,,,,,,
,,,,,,,,,,,,,,,,,,,,,,,,,,,,,,,,,,,,,,,,,,,,,,,,,,,,,,,
TABLE COLUMNS,,,,,,,,,,,,,,,,,,,,,,,,,,,,,,,,,,,,,,,,,,,,,,,,,,,,,,,
Column name,CF standard_name,IMOS long_name,Units,Fill value,Comments,,,,,,,,,,,,,,,,,,,,,,,,,,,,,,,,,,,,,,,,,,,,,,,,,,
Time,time,analysis_time,YYYY-MM-DDThh:mm:ssZ,,UTC date and time,,,,,,,,,,,,,,,,,,,,,,,,,,,,,,,,,,,,,,,,,,,,,,,,,,
Station_Code,,,,,National Reference Station code (6 letters),,,,,,,,,,,,,,,,,,,,,,,,,,,,,,,,,,,,,,,,,,,,,,,,,,
Latitude,latitude,latitude,degrees_north,,North positive,,,,,,,,,,,,,,,,,,,,,,,,,,,,,,,,,,,,,,,,,,,,,,,,,,
Longitude,longitude,longitude,degrees_east,,East positive,,,,,,,,,,,,,,,,,,,,,,,,,,,,,,,,,,,,,,,,,,,,,,,,,,
Depth,depth,depth,m ,,positive down,,,,,,,,,,,,,,,,,,,,,,,,,,,,,,,,,,,,,,,,,,,,,,,,,,
CPHL_c3,,mass_concentration_of_HPLC_chlorophyll_c3_in_sea_water,mg m-3,-999,,,,,,,,,,,,,,,,,,,,,,,,,,,,,,,,,,,,,,,,,,,,,,,,,,,
Mg_DVP,,mass_concentration_of_HPLC_Mg_2_4_divinyl_pheoporphyrin_a5_monomethyl_ester_in_sea_water,mg m-3,-999,,,,,,,,,,,,,,,,,,,,,,,,,,,,,,,,,,,,,,,,,,,,,,,,,,,
CPHL_c2,,mass_concentration_of_HPLC_chlorophyll_c2_in_sea_water,mg m-3,-999,,,,,,,,,,,,,,,,,,,,,,,,,,,,,,,,,,,,,,,,,,,,,,,,,,,
CPHL_c1,,mass_concentration_of_HPLC_chlorophyll_c1_in_sea_water,mg m-3,-999,,,,,,,,,,,,,,,,,,,,,,,,,,,,,,,,,,,,,,,,,,,,,,,,,,,
CPHL_c1c2,,mass_concentration_of_HPLC_chlorophyll_c1_c2_in_sea_water,mg m-3,-999,"Samples analysed prior to August 2004, Wright et al (1991) method used -chlorophyll_c1_plus_chlorophyll_c2_coelute",,,,,,,,,,,,,,,,,,,,,,,,,,,,,,,,,,,,,,,,,,,,,,,,,,
CPHLIDE_a,,mass_concentration_of_HPLC_chlorophyllide_a_in_sea_water,mg m-3,-999,,,,,,,,,,,,,,,,,,,,,,,,,,,,,,,,,,,,,,,,,,,,,,,,,,,
Phide_a,,mass_concentration_of_HPLC_Pheophorbide_a_in_sea_water,mg m-3,-999,,,,,,,,,,,,,,,,,,,,,,,,,,,,,,,,,,,,,,,,,,,,,,,,,,,
Perid,,mass_concentration_of_HPLC_Peridinin_in_sea_water,mg m-3,-999,,,,,,,,,,,,,,,,,,,,,,,,,,,,,,,,,,,,,,,,,,,,,,,,,,,
Pyrophide_a,,mass_concentration_of_HPLC_Pyropheophorbide_a_in_sea_water,mg m-3,-999,,,,,,,,,,,,,,,,,,,,,,,,,,,,,,,,,,,,,,,,,,,,,,,,,,,
But_fuco,,mass_concentration_of_HPLC_19-Butanoyloxyfucoxanthin_in_sea_water,mg m-3,-999,,,,,,,,,,,,,,,,,,,,,,,,,,,,,,,,,,,,,,,,,,,,,,,,,,,
Fuco,,mass_concentration_of_HPLC_Fucoxanthin_in_sea_water,mg m-3,-999,,,,,,,,,,,,,,,,,,,,,,,,,,,,,,,,,,,,,,,,,,,,,,,,,,,
Neo,,mass_concentration_of_HPLC_Neoxanthin_in_sea_water,mg m-3,-999,,,,,,,,,,,,,,,,,,,,,,,,,,,,,,,,,,,,,,,,,,,,,,,,,,,
Keto_Hex_fuco,,mass_concentration_of_HPLC_4- keto-19'-Hexanoyloxyfucoxanthin_in_sea_water,mg m-3,-999,,,,,,,,,,,,,,,,,,,,,,,,,,,,,,,,,,,,,,,,,,,,,,,,,,,
Pras,,mass_concentration_of_HPLC_Prasinoxanthin_in_sea_water,mg m-3,-999,,,,,,,,,,,,,,,,,,,,,,,,,,,,,,,,,,,,,,,,,,,,,,,,,,,
Viola,,mass_concentration_of_HPLC_Violaxanthin_in_sea_water,mg m-3,-999,,,,,,,,,,,,,,,,,,,,,,,,,,,,,,,,,,,,,,,,,,,,,,,,,,,
Hex_fuco,,mass_concentration_of_HPLC_19-Hexanoyloxyfucoxanthin_in_sea_water,mg m-3,-999,,,,,,,,,,,,,,,,,,,,,,,,,,,,,,,,,,,,,,,,,,,,,,,,,,,
Asta,,mass_concentration_of_HPLC_Astaxanthin_in_sea_water,mg m-3,-999,,,,,,,,,,,,,,,,,,,,,,,,,,,,,,,,,,,,,,,,,,,,,,,,,,,
Diadchr,,mass_concentration_of_HPLC_Diadinochrome_in_sea_water,mg m-3,-999,,,,,,,,,,,,,,,,,,,,,,,,,,,,,,,,,,,,,,,,,,,,,,,,,,,
Diadino,,mass_concentration_of_HPLC_Diadinoxanthin_in_sea_water,mg m-3,-999,,,,,,,,,,,,,,,,,,,,,,,,,,,,,,,,,,,,,,,,,,,,,,,,,,,
Dino,,mass_concentration_of_HPLC_Dinoxanthin_in_sea_water,mg m-3,-999,,,,,,,,,,,,,,,,,,,,,,,,,,,,,,,,,,,,,,,,,,,,,,,,,,,
Anth,,mass_concentration_of_HPLC_Antheraxanthin_in_sea_water,mg m-3,-999,,,,,,,,,,,,,,,,,,,,,,,,,,,,,,,,,,,,,,,,,,,,,,,,,,,
Allo,,mass_concentration_of_HPLC_Alloxanthin_in_sea_water,mg m-3,-999,,,,,,,,,,,,,,,,,,,,,,,,,,,,,,,,,,,,,,,,,,,,,,,,,,,
Diato,,mass_concentration_of_HPLC_Diatoxanthin_in_sea_water,mg m-3,-999,,,,,,,,,,,,,,,,,,,,,,,,,,,,,,,,,,,,,,,,,,,,,,,,,,,
Zea,,mass_concentration_of_HPLC_Zeaxanthin_in_sea_water,mg m-3,-999,,,,,,,,,,,,,,,,,,,,,,,,,,,,,,,,,,,,,,,,,,,,,,,,,,,
Lut,,mass_concentration_of_HPLC_Lutein_in_sea_water,mg m-3,-999,,,,,,,,,,,,,,,,,,,,,,,,,,,,,,,,,,,,,,,,,,,,,,,,,,,
Cantha,,mass_concentration_of_HPLC_canthaxanthin_in_sea_water,mg m-3,-999,,,,,,,,,,,,,,,,,,,,,,,,,,,,,,,,,,,,,,,,,,,,,,,,,,,
Gyro,,mass_concentration_of_HPLC_Gyroxanthin-Diester_in_sea_water,mg m-3,-999,,,,,,,,,,,,,,,,,,,,,,,,,,,,,,,,,,,,,,,,,,,,,,,,,,,
DV_CPHL_b,,mass_concentration_of_HPLC_Divinyl_Chorophyll_b_in_sea_water,mg m-3,-999,,,,,,,,,,,,,,,,,,,,,,,,,,,,,,,,,,,,,,,,,,,,,,,,,,,
CPHL_b,,mass_concentration_of_HPLC_chlorophyll_b_in_sea_water,mg m-3,-999,,,,,,,,,,,,,,,,,,,,,,,,,,,,,,,,,,,,,,,,,,,,,,,,,,,
DV_CPHL_b_plus_CPHL_b,,mass_concentration_of_HPLC_Divinyl_Chorophyll_b_+_chlorophyll_b_in_sea_water,mg m-3,-999,"Samples analysed prior to August 2004, Wright et al (1991) method used -Divinyl_Chlorophyll_b_plus_chlorophyll_b_coelute ",,,,,,,,,,,,,,,,,,,,,,,,,,,,,,,,,,,,,,,,,,,,,,,,,,
DV_CPHL_a,,mass_concentration_of_HPLC_Divinyl_Chorophyll_a_in_sea_water,mg m-3,-999,,,,,,,,,,,,,,,,,,,,,,,,,,,,,,,,,,,,,,,,,,,,,,,,,,,
CPHL_a,mass_concentration_of_chlorophyll_a_in_sea_water,mass_concentration_of_chlorophyll_a_in_sea_water,mg m-3,-999,,,,,,,,,,,,,,,,,,,,,,,,,,,,,,,,,,,,,,,,,,,,,,,,,,,
DV_CPHL_a_plus_CPHL_a,,mass_concentration_of_HPLC_Divinyl_Chorophyll_a_+_chlorophyll_a_in_sea_water,mg m-3,-999,"Samples analysed prior to August 2004, Wright et al (1991) method used -Divinyl_Chlorophyll_a_plus_HPLC_chlorophyll_a_coelute ",,,,,,,,,,,,,,,,,,,,,,,,,,,,,,,,,,,,,,,,,,,,,,,,,,
Echin,,mass_concentration_of_HPLC_Echinenone_in_sea_water,mg m-3,-999,,,,,,,,,,,,,,,,,,,,,,,,,,,,,,,,,,,,,,,,,,,,,,,,,,,
Phytin_b,,mass_concentration_of_HPLC_Pheophytin_b_in_sea_water,mg m-3,-999,,,,,,,,,,,,,,,,,,,,,,,,,,,,,,,,,,,,,,,,,,,,,,,,,,,
Phytin_a,,mass_concentration_of_HPLC_Pheophytin_a_in_sea_water,mg m-3,-999,,,,,,,,,,,,,,,,,,,,,,,,,,,,,,,,,,,,,,,,,,,,,,,,,,,
Lyco,,mass_concentration_of_HPLC_Lycopene_in_sea_water,mg m-3,-999,,,,,,,,,,,,,,,,,,,,,,,,,,,,,,,,,,,,,,,,,,,,,,,,,,,
beta_epi_Car,,mass_concentration_of_HPLC_Alpha-Carotene_(Beta_epsilon-Carotene)_in_sea_water,mg m-3,-999,,,,,,,,,,,,,,,,,,,,,,,,,,,,,,,,,,,,,,,,,,,,,,,,,,,
beta_beta_Car,,mass_concentration_of_HPLC_Beta-Carotene_(Beta_beta-Carotene)_in_sea_water,mg m-3,-999,,,,,,,,,,,,,,,,,,,,,,,,,,,,,,,,,,,,,,,,,,,,,,,,,,,
alpha_beta_Car,,mass_concentration_of_HPLC_Alpha_(Beta_epsilon)_+_Beta_(Beta_beta)_Carotenes_in_sea_water,mg m-3,-999,"Samples analysed after August 2004, Heukelem and Thomas (2001) method used - Aalpha-Carotene_plus_Beta-Carotene_coelute  ",,,,,,,,,,,,,,,,,,,,,,,,,,,,,,,,,,,,,,,,,,,,,,,,,,
Pyrophytin_a,,mass_concentration_of_HPLC_Pyropheophytin_a_in_sea_water,mg m-3,-999,,,,,,,,,,,,,,,,,,,,,,,,,,,,,,,,,,,,,,,,,,,,,,,,,,,
Tot_CPHL_a,,mass_concentration_of_HPLC_DV_CPHL_a_+_MV_CPHL_a_+_Chlide_a_+_CPHL_a_allom_+_CPHL_a_prime_in_sea_water,mg m-3,-999,Data products computed from pigment concentration data,,,,,,,,,,,,,,,,,,,,,,,,,,,,,,,,,,,,,,,,,,,,,,,,,,
Tot_CPHL_b,,mass_concentration_of_HPLC_DV_CPHL_b_+_MV_CPHL_b_in_sea_water,mg m-3,-999,Data products computed from pigment concentration data,,,,,,,,,,,,,,,,,,,,,,,,,,,,,,,,,,,,,,,,,,,,,,,,,,
Tot_CPHL_c,,mass_concentration_of_HPLC_CPHL_c1_+_CPHL_c2_(CPHL_c1c2)_+_CPHL_c3_in_sea_water,mg m-3,-999,Data products computed from pigment concentration data,,,,,,,,,,,,,,,,,,,,,,,,,,,,,,,,,,,,,,,,,,,,,,,,,,
Tot_CPHL,,mass_concentration_of_Tot_CPHL_a_+_Tot_CPHL_b_+_Tot_CPHL_c_in_sea_water,mg m-3,-999,Data products computed from pigment concentration data,,,,,,,,,,,,,,,,,,,,,,,,,,,,,,,,,,,,,,,,,,,,,,,,,,
PPC,,mass_concentration_of_Photoprotective_carotenoids_(Allo_+_Diadino_+_Diato_+_Zeo_+_alpha-beta-Car)_in_sea_water,mg m-3,-999,Data products computed from pigment concentration data,,,,,,,,,,,,,,,,,,,,,,,,,,,,,,,,,,,,,,,,,,,,,,,,,,
PSC,,mass_concentration_of_Photosynthetic_carotenoids_(But-fuco_+_Fuco_+_Hex-fuco_+_Perid)_in_sea_water,mg m-3,-999,Data products computed from pigment concentration data,,,,,,,,,,,,,,,,,,,,,,,,,,,,,,,,,,,,,,,,,,,,,,,,,,
PSP,,mass_concentration_of_Photosynthetic_pigments_(PSC_+_Tchl)_in_sea_water,mg m-3,-999,Data products computed from pigment concentration data,,,,,,,,,,,,,,,,,,,,,,,,,,,,,,,,,,,,,,,,,,,,,,,,,,
Tacc,,mass_concentration_of_Total_accessory_pigments_(PPC_+_PSC_+_Tot_CPHL_b_+_Tot_CPHL_c)_in_sea_water,mg m-3,-999,Data products computed from pigment concentration data,,,,,,,,,,,,,,,,,,,,,,,,,,,,,,,,,,,,,,,,,,,,,,,,,,
Tpg,,mass_concentration_of_total_pigment_in_sea_water,mg m-3,-999,Data products computed from pigment concentration data,,,,,,,,,,,,,,,,,,,,,,,,,,,,,,,,,,,,,,,,,,,,,,,,,,
DP,,mass_concentration_of_Total_diagnostic_pigments_(PSC_+_Allo_+_Zea_+_Tot_CPHL_b)_in_sea_water,mg m-3,-999,Data products computed from pigment concentration data,,,,,,,,,,,,,,,,,,,,,,,,,,,,,,,,,,,,,,,,,,,,,,,,,,
,,,,,,,,,,,,,,,,,,,,,,,,,,,,,,,,,,,,,,,,,,,,,,,,,,,,,,,
,,,,,,,,,,,,,,,,,,,,,,,,,,,,,,,,,,,,,,,,,,,,,,,,,,,,,,,
DATA,,,,,,,,,,,,,,,,,,,,,,,,,,,,,,,,,,,,,,,,,,,,,,,,,,,,,,,
Time,Station_Code,Latitude,Longitude,Depth,CPHL_c3,Mg_DVP,CPHL_c2,CPHL_c1,CPHL_c1c2,CPHLIDE_a,Phide_a,Perid,Pyrophide_a,But_fuco,Fuco,Neo,Keto_Hex_fuco,Pras,Viola,Hex_fuco,Asta,Diadchr,Diadino,Dino,Anth,Allo,Diato,Zea,Lut,Cantha,Gyro,DV_CPHL_b,CPHL_b,DV_CPHL_b_plus_CPHL_b,DV_CPHL_a,CPHL_a,DV_CPHL_a_plus_CPHL_a,Echin,Phytin_b,Phytin_a,Lyco,beta_epi_Car,beta_beta_Car,alpha_beta_Car,Pyrophytin_a,Tot_CPHL_a,Tot_CPHL_b,Tot_CPHL_c,Tot_CPHL,PPC,PSC,PSP,Tacc,Tpg,DP
2008-02-06T00:00:00Z,1,-23.207233333333335,150.88628333333332,0,0,0,0.6247841768470042,0.90351832460733,-999,0,0.30923976608187137,0,0.2673015873015873,0,4.210797455244859,0,0,0.014882064975522922,0.010950617283950618,0,0.01205064134599367,-999,0.6403834808259589,-999,0,0.03900300300300301,0.26173544973544977,0.042215356448106194,0,0,0,0,0.0639888888888889,-999,0,9.340527931246164,-999,-999,0,0,0,-999,-999,0.2972139917695474,0,9.340527931246164,0.0639888888888889,1.528302501454334,10.932819321589388,1.2805512817820652,4.210797455244859,15.143616776834246,7.083640127370147,16.42416805861631,4.3560047035848575
2008-02-06T04:00:00Z,2,-23.252283333333335,150.904,0,0.02013413654618474,0,0.18262547993019196,0.19332216404886565,-999,0,0,0,0,0,0.9574496227252554,0,0,0.01180373831775701,0.006922222222222223,0,0.010886556721639181,-999,0.12576666666666667,-999,0,0.037642342342342344,0.06327111111111111,0.0395200823892894,0,0,0,0,0.03004166666666667,-999,0,2.343388581952118,-999,-999,0,0,0,-999,-999,0.08276635802469136,0,2.343388581952118,0.03004166666666667,0.39608178052524234,2.769512029144027,0.34896656053410086,0.9574496227252554,3.7269616518692823,1.7325396304512652,4.075928212403383,1.0646537141235537
2008-02-06T05:11:00Z,3,-23.283166666666666,150.9111,0,0,0,0.7785315183246073,0.978848167539267,-999,0,0.2107669172932331,0,0,0,4.661394407456725,0,0,0,0.00956952380952381,0,0,-999,0.5691015929203539,-999,0,0.017536576576576576,0.11618438095238096,0.02306900102986612,0,0,0,0,0.020512000000000002,-999,0,10.508437569060774,-999,-999,0,0,0,-999,-999,0.25952592592592594,0,10.508437569060774,0.020512000000000002,1.7573796858638744,12.286329254924649,0.9854174774051034,4.661394407456725,16.947723662381375,7.424703570725702,17.93314113978648,4.722511985063168
2008-02-06T23:00:00Z, 4b,-23.324783333333333,150.91058333333334,0,0,0,1.0431664921465966,1.1797042931937172,-999,0,0,0.04123607843137255,0,0,5.488345139813582,0,0,0,0.023073015873015874,0,0,-999,0.5330803539823009,-999,0,0.03350198198198198,0.009968761904761906,0.010839134912461381,0,0,0,0,0.166128,-999,0,13.319001104972376,-999,-999,0,0,0,-999,-999,0.3131851851851852,0,13.319001104972376,0.166128,2.222870785340314,15.70799989031269,0.9005754179666914,5.529581218244954,21.237581108557645,8.819155421551958,22.138156526524334,5.740050335139397
2008-02-07T00:45:00Z, 5a,-23.373416666666667,150.93718333333334,0,0,0,0.5792111692844677,0.9145061082024433,-999,0,0,0,0,0,3.9265690190856635,0,0,0,0,0,0,-999,1.22094395280236,-999,0,0,0.07320634920634922,0,0,0,0,0,0,-999,0,9.345856353591161,-999,-999,0,0,0,-999,-999,0.22722839506172843,0,9.345856353591161,0,1.493717277486911,10.839573631078071,1.5213786970704377,3.9265690190856635,14.766142650163735,6.941664993643012,16.287521347234172,3.9265690190856635
2008-02-07T03:00:00Z, 5b,-23.373416666666667,150.93718333333334,0,0,0,1.2138059336823734,1.6432977312390926,-999,0,0,0,0,0,8.129169107856193,0,0,0,0.0408,0,0,-999,2.1803828908554577,-999,0,0.08453033033033035,0.1432425396825397,0,0,0,0,0,0,-999,0,19.665650092081034,-999,-999,0,0,0,-999,-999,0.5334956790123457,0,19.665650092081034,0,2.857103664921466,22.522753757002498,2.9416514398806735,8.129169107856193,30.65192286485869,13.927924212658331,33.59357430473936,8.213699438186524
2008-02-07T05:00:00Z, 5c,-23.373416666666667,150.93718333333334,0,0,0,0.37861959611069557,0.4519347793567688,-999,0,0,0,0,0,2.117709720372836,0,0,0,0.01700136054421769,0,0,-999,0.22564247787610617,-999,0,0.02608597168597169,0.028987210884353742,0,0,0,0,0,0,-999,0,5.567646408839779,-999,-999,0,0,0,-999,-999,0.1649354497354497,0,5.567646408839779,0,0.8305543754674644,6.398200784307243,0.4456511101818813,2.117709720372836,8.515910504680079,3.3939152060221818,8.96156161486196,2.143795692058808
2008-02-08T00:35:00Z,6,-23.210516666666667,151.03705,0,0,0,0.10542956868611318,0.11127389678384442,-999,0,0,0,0,0,0.5466419377338152,0,0,0,0.005637868480725623,0.013678061652872735,0,-999,0.1343265908133165,-999,0,0,0.020158639455782314,0.05274287675935462,0,0,0,0,0,-999,0,1.426695869508024,-999,-999,0,0,0,-999,-999,0.0362462962962963,0,1.426695869508024,0,0.2167034654699576,1.6433993349779816,0.24347440332474973,0.560319999386688,2.2037193343646697,1.0204978681813952,2.4471937376894193,0.6130628761460426
2008-02-08T03:00:00Z,7,-23.3035,151.0299,0,0,0,0.911908272251309,1.2401569284467715,-999,0,0,0,0,0,4.934595295162007,0,0,0,0.030259047619047623,0,0,-999,1.2742240707964603,-999,0,0.06064552552552554,0.10527403174603177,0.03091383453484381,0,0,0,0,0.112706,-999,0,11.828714180478823,-999,-999,0,0,0,-999,-999,0.26715728395061733,0,11.828714180478823,0.112706,2.1520652006980807,14.093485381176903,1.7382147465534787,4.934595295162007,19.02808067633891,8.937581242413566,20.76629542289239,5.138860655222376
2008-02-08T05:00:00Z,8,-23.418,151.0106,0,0,0,0.5294850494473531,0.5284360674810936,-999,0,0,0,0,0,2.7385483059624205,0,0,0,0.01474320987654321,0,0,-999,0.40798643067846607,-999,0,0.04478178178178178,0.043856296296296296,0.036703741846893234,0,0,0,0,0,-999,0,6.808744014732965,-999,-999,0,0,0,-999,-999,0.190737037037037,0,6.808744014732965,0,1.0579211169284468,7.866665131661412,0.7240652876404744,2.7385483059624205,10.605213437623831,4.520534710531342,11.329278725264306,2.820033829591096
2008-02-08T06:00:00Z,9,-23.3735,150.93633333333332,0,0,0,0.6269270506108203,0.6454178010471204,-999,0,0,0,0,0,3.437175321793165,0,0,0,0.02847195767195767,0,0,-999,0.3599109144542773,-999,0,0.028606606606606612,0,0,0,0,0,0,0,-999,0,8.667088397790057,-999,-999,0,0,0,-999,-999,0.22827716049382718,0,8.667088397790057,0,1.2723448516579408,9.939433249447998,0.6167946815547112,3.437175321793165,13.376608571241162,5.326314855005817,13.993403252795874,3.4657819283997715
2008-02-08T21:45:00Z,10,-23.21015,151.03685,0,0,0,0.033679162303664925,0.03406055846422339,-999,0,0,0,0,0,0.16856173990235246,0,0,0,0.002986666666666667,0.015101133501259448,0,-999,0.041846578171091456,-999,0,0,0.008149555555555557,0.05038606247854446,0,0,0,0,0.013034000000000002,-999,0,0.45660239410681414,-999,-999,0,0,0,-999,-999,0.02157814814814815,0,0.45660239410681414,0.013034000000000002,0.06773972076788831,0.5373761148747025,0.12196034435333963,0.1836628734036119,0.7210389882783144,0.38639693852483986,0.842999332631654,0.24708293588215635
2008-02-08T21:45:00Z,10,-23.21015,151.03685,6,0.03418192771084338,0,0.09171294938917976,0.07413623036649215,-999,0,0,0,0,0,0.3974785175321794,0.001965536723163842,0,0,0.0035064814814814815,0.0329711167086482,0,-999,0.05952415929203541,-999,0,0.003975915915915917,0.00815577777777778,0.04236405767250258,0,0,0,0,0.032095000000000005,-999,0.012152159739201304,1.0105731123388584,-999,-999,0,0,0,-999,-999,0.03898222222222223,0,1.0227252720780597,0.032095000000000005,0.2000311074665153,1.254851379544575,0.15300213288045392,0.4304496342408276,1.6853010137854025,0.8155778745877968,1.8383031466658566,0.508884607829246
2008-02-09T00:00:00Z,11,-23.391583333333333,151.10948333333334,0,0,0,0.04676802792321117,0.08248516579406633,-999,0,0,0,0,0,0.3003596981802042,0,0,0,0.004144761904761905,0.011851553316540723,0,-999,0.06352613569321534,-999,0,0,0.0165384126984127,0.038813044970820464,0,0,0,0,0,-999,0,0.67047955801105,-999,-999,0,0,0,-999,-999,0.026945185185185187,0,0.67047955801105,0,0.1292531937172775,0.7997327517283275,0.1458227785476337,0.3122112514967449,1.1119440032250725,0.5872872237616561,1.257766781772706,0.35102429646756533
2008-02-09T02:25:00Z,12,-23.373283333333333,150.93631666666667,0,0,0,0.35807497382198955,0.3449030366492147,-999,0,0,0.040577254901960784,0,0,1.793644740346205,0,0,0,0.02073904761904762,0,0,-999,0.4615476106194691,-999,0,0.0574990990990991,0.03886019047619048,0.025425334706488157,0,0,0,0,0.060736000000000005,-999,0,4.941816574585635,-999,-999,0,0,0,-999,-999,0.15675259259259258,0,4.941816574585635,0.060736000000000005,0.7029780104712042,5.70553058505684,0.7400848274938393,1.8342219952481658,7.539752580305006,3.3380208332132093,8.279837407798844,1.9778824290537529
2008-02-09T03:55:00Z,13,-23.373283333333333,150.93631666666667,0,0,0,0.6728058949001358,0.7839441535776615,-999,0,0,0.05412490922294845,0,0,3.679809636534004,0.023188951663527937,0,0,0.022087007642563196,0,0,-999,0.6902753195673549,-999,0,0.044748081414748085,0.07808818342151676,0.019140252507914714,0.036640445755490005,0,0,0,0.20225925925925928,-999,0,9.347227337835074,-999,-999,0,0,0,-999,-999,0.2426611796982167,0,9.347227337835074,0.20225925925925928,1.4567500484777973,11.00623664557213,1.0749130166097511,3.733934545756952,14.740171191329082,6.46785687010376,15.815084207938835,4.000082138938874
2008-02-09T03:55:00Z, 13b,-23.373283333333333,150.93631666666667,0,0,0,0.5329467042556049,0.6098644113303799,-999,0,0,0.04592257415786828,0,0,2.9702550445559766,0,0,0,0.014961334961334963,0,0,-999,0.49624234172906745,-999,0,0.022873642873642876,0.056561660561660565,0.03254376930998971,0.023222146584978447,0,0,0,0.09020512820512822,-999,0,7.357019407848139,-999,-999,0,0,0,-999,-999,0.20250712250712252,0,7.357019407848139,0.09020512820512822,1.1428111155859848,8.590035651639251,0.8107285369814832,3.016177618713845,11.606213270353097,5.059922399486441,12.41694180733458,3.161800159102606
,,,,,,,,,,,,,,,,,,,,,,,,,,,,,,,,,,,,,,,,,,,,,,,,,,,,,,,
,,,,,,,,,,,,,,,,,,,,,,,,,,,,,,,,,,,,,,,,,,,,,,,,,,,,,,,
,,,,,,,,,,,,,,,,,,,,,,,,,,,,,,,,,,,,,,,,,,,,,,,,,,,,,,,
,,,,,,,,,,,,,,,,,,,,,,,,,,,,,,,,,,,,,,,,,,,,,,,,,,,,,,,
