GLOBAL ATTRIBUTES,,,,,,,,,,,,,,,,,
title,,,,,,,,,,,,,,,,,
project,Integrated Marine Observing System (IMOS),,,,,,,,,,,,,,,,
original_project_name,MERIS validation,,,,,,,,,,,,,,,,
original_institution,CSIRO Land and Water,,,,,,,,,,,,,,,,
abstract,This record contains in situ water optical property data collected in the North Great Barrier Reef| Australia on the RSV Lady Basten between 17-21 Sept 2005. A total of 34 stations were sampled during the field campaign AS05. The data can be used for Ocean Colour sensor validation| optical water quality monitoring and modelling. CLW deployed the optical instruments TriOS RAMSES (hyperspectral irradiance)| WETLabs AC-9 (absorption and attenuation coefficicents)| HOBILabs Hydroscat-6 (backscattering coefficient) during this cruise.This data was part of the dataset described in Blondeau-Patissier et al. 2009| JGR| VOL. 114| C05003| doi:10.1029/2008JC005039. Funding for this study was provided by CSIRO Earth Observation Centre| CSIRO Land and Water| CSIRO Marine Research and the Australian Institute of Marine Sciences. We also thank the captains and crews of the RSV Lady Basten.,,,,,,,,,,,,,,,,
conventions,IMOS biological data format (v1.0),,,,,,,,,,,,,,,,
date_created,2005-09-17T21:27:44Z,,,,,,,,,,,,,,,,
date_modified,2006-02-06T22:55:43Z,,,,,,,,,,,,,,,,
history,Data has been quality controlled by in-house procedures. HS-6 data were corrected for temperature using CTD data and the Sigma correction method| recommended by the manufacturer| was applied using absorption and attenuation data from the AC-9. The Sigma correction is an adjustment to improve the accuracy of backscattering measurements| in particular in highly-attenuating water. The correction is detailed in HOBI-labs Inc.| 2003. The backscattering coefficient bb is estimated using the method described in Maffione and Dana| 1997| Applied Optics| 36(24)| pp.6057-6067.,,,,,,,,,,,,,,,,
comment,The HydroScat-6 (HS-6) is a self-contained instrument for measuring optical backscattering at six different wavelengths in natural waters. The particulate backscattering coefficient| bbp (lambda)| is a measure of light scattering by particles at angles between 90 and 180 degrees. bbp was estimated by subtracting bbw (lambda)| the backscattering coefficient of pure sea-water| from bb (lambda). The pure seawater backscattering coefficient was calculated using a backscattering ratio of 0.5 (Gordon et al.| 1988| Journal of Geophysical Research) and the seawater scattering coefficients| bw(lambda)| of Morel (1974| Optical properties of pure water and pure seawater| p. 1-24| in Optical Aspects of Oceanography).,,,,,,,,,,,,,,,,
source,Particulate Scattering coefficients determined using an HS-6 (www.hobilabs.com),,,,,,,,,,,,,,,,
keywords,Oceans>Ocean Optics > Scattering ;Oceans>Ocean Optics>Ocean Colour;,,,,,,,,,,,,,,,,
cruise_id,LB4083,,,,,,,,,,,,,,,,
vessel_name,RSV Lady Basten,,,,,,,,,,,,,,,,
platform_code,VLAB_450301529,,,,,,,,,,,,,,,,
references,https://marlin.csiro.au/geonetwork/srv/eng/catalog.search#/metadata/d3c5d7ba-b861-72d5-e043-08114f8c2cf2,,,,,,,,,,,,,,,,
naming_authority,CSIRO Land and Water (CLW),,,,,,,,,,,,,,,,
cdm_data_type,profile,,,,,,,,,,,,,,,,
geospatial_lat_min,-16.86,,,,,,,,,,,,,,,,
geospatial_lat_max,-16.86,,,,,,,,,,,,,,,,
geospatial_lon_min,145.84,,,,,,,,,,,,,,,,
geospatial_lon_max,145.84,,,,,,,,,,,,,,,,
geospatial_vertical_min,0,,,,,,,,,,,,,,,,
geospatial_vertical_max,0,,,,,,,,,,,,,,,,
local_time_zone,10,,,,,,,,,,,,,,,,
data_centre,eMarine Information Infrastructure (eMII),,,,,,,,,,,,,,,,
data_centre_email,info@emii.org.au,,,,,,,,,,,,,,,,
author,Brando Vittorio,,,,,,,,,,,,,,,,
author_email,vittorio.brando@csiro.au,,,,,,,,,,,,,,,,
principal_investigator,Furnas Miles,,,,,,,,,,,,,,,,
principal_investigator_email,m.furnas@aims.gov.au,,,,,,,,,,,,,,,,
institution,IMOS Satellite Remote Sensing - Ocean Colour Sub-facility - Bio-Optical database of Australian Waters,,,,,,,,,,,,,,,,
institution_principal_investigator,"Schroeder, Thomas",,,,,,,,,,,,,,,,
institution_principal_investigator_email,Thomas.Schroeder@csiro.au,,,,,,,,,,,,,,,,
publisher,Australian Ocean Data Network,,,,,,,,,,,,,,,,
publisher_email,info@aodn.org.au,,,,,,,,,,,,,,,,
citation,To cite this data set in a publication use the format <<IMOS [year-of-data-downloaded] [Title] [data-access-url] accessed [date-of-access]>>,,,,,,,,,,,,,,,,
acknowledgement,Data was sourced from the Commonwealth Scientific and Industrial Research Organisation (CSIRO),,,,,,,,,,,,,,,,
distribution_statement,"Any users of IMOS data are required to clearly acknowledge the source of the material- Data or products or services from IMOS are provided ""as is"" without any warranty as to fitness for a particular purpose.",,,,,,,,,,,,,,,,
,,,,,,,,,,,,,,,,,
TABLE ROWS,,,,,,,,,,,,,,,,,
Row name,CF standard_name,IMOS long_name,Units,Fill value,Comments,,,,,,,,,,,,
Wavelength,radiation_wavelength,Wavelength of measurement,nm,-999,,,,,,,,,,,,,
,,,,,,,,,,,,,,,,,
TABLE COLUMNS,,,,,,,,,,,,,,,,,
Column name,CF standard_name,IMOS long_name,Units,Fill value,Comments,,,,,,,,,,,,
Time,time,analysis_time,YYYY-MM-DDThh:mm:ssZ,,UTC date and time,,,,,,,,,,,,
Station_Code,,,,,National Reference Station code (6 letters),,,,,,,,,,,,
Latitude,latitude,latitude,degrees_north,-999,North positive,,,,,,,,,,,,
Longitude,longitude,longitude,degrees_east,-999,East positive,,,,,,,,,,,,
Depth,depth,depth,m ,-999,positive down,,,,,,,,,,,,
bb_corr,,corrected_volume_total_backwards_scattering_coefficient_of_(bbw_+_bbp)_in_sea_water,m-1,-999,bbw:volume_backwards_scattering_coefficient_of_radiative_flux_in_sea_water ; bbp=volume_backwards_scattering_coefficient_of_particules_in_sea_water,,,,,,,,,,,,
bb_uncorr,,volume_total_backwards_scattering_coefficient_of_(bbw_+_bbp)_in_sea_water,m-1,-999,bbw:volume_backwards_scattering_coefficient_of_radiative_flux_in_sea_water ; bbp=volume_backwards_scattering_coefficient_of_particules_in_sea_water,,,,,,,,,,,,
,,,,,,,,,,,,,,,,,
,,,,,,,,,,,,,,,,,
DATA,,,,,,,,,,,,,,,,,
,Time,Station_Code,Latitude,Longitude,Depth,bb_corr,bb_corr,bb_corr,bb_corr,bb_corr,bb_corr,bb_uncorr,bb_uncorr,bb_uncorr,bb_uncorr,bb_uncorr,bb_uncorr
Wavelength,,,,,,442,448,555,589,676,852,442,448,555,589,676,852
,2005-09-17T21:31:07Z,WQN009,-16.86,145.84,0,0.03558,0.032134,0.028268,0.027107,0.024079,0.021642,0.032423,0.029744,0.026377,0.025418,0.022819,0.017145
,2005-09-17T21:37:04Z,WQN009,-16.86,145.84,0.2,0.034641,0.030949,0.027748,0.026422,0.024066,0.021735,0.031501,0.028583,0.025853,0.024734,0.022734,0.017168
,2005-09-17T21:37:09Z,WQN009,-16.86,145.84,0.4,0.033988,0.029967,0.026224,0.025531,0.022829,0.021278,0.030856,0.027628,0.024405,0.023869,0.021513,0.016769
,2005-09-17T21:36:32Z,WQN009,-16.86,145.84,0.6,0.034661,0.03067,0.026923,0.025877,0.022883,0.020461,0.031431,0.02824,0.025035,0.024169,0.021526,0.0161
,2005-09-17T21:30:37Z,WQN009,-16.86,145.84,0.8,0.03644,0.032971,0.0278,0.026588,0.024407,0.022932,0.033007,0.030331,0.02582,0.024812,0.022935,0.018037
,2005-09-17T21:27:44Z,WQN009,-16.86,145.84,1,0.033592,0.030118,0.026761,0.025044,0.022635,0.020816,0.030447,0.027718,0.024879,0.023391,0.021288,0.016382
,2005-09-17T21:36:31Z,WQN009,-16.86,145.84,1.2,0.035338,0.030469,0.027376,0.026096,0.023481,0.020856,0.03204,0.028052,0.02546,0.024379,0.022088,0.016417
,2005-09-17T21:37:23Z,WQN009,-16.86,145.84,1.4,0.034426,0.030167,0.026512,0.025443,0.022768,0.020975,0.031239,0.027812,0.024683,0.023785,0.021428,0.016523
,2005-09-17T21:37:29Z,WQN009,-16.86,145.84,1.6,0.033999,0.02964,0.026738,0.025168,0.02298,0.021024,0.03083,0.027311,0.024871,0.023521,0.021629,0.01657
,2005-09-17T21:37:27Z,WQN009,-16.86,145.84,1.8,0.033804,0.029992,0.026682,0.024859,0.022902,0.021276,0.030665,0.027641,0.024822,0.023235,0.021557,0.016769
,2005-09-17T21:36:29Z,WQN009,-16.86,145.84,2,0.034013,0.029887,0.026622,0.025095,0.022493,0.020603,0.030848,0.027516,0.024756,0.023445,0.021169,0.016229
,2005-09-17T21:37:36Z,WQN009,-16.86,145.84,2.2,0.032701,0.029054,0.025767,0.024551,0.021835,0.020544,0.029638,0.026732,0.02393,0.022913,0.020541,0.01617
,2005-09-17T21:37:41Z,WQN009,-16.86,145.84,2.4,0.033418,0.029974,0.026533,0.024675,0.022504,0.020862,0.030317,0.027598,0.024658,0.023043,0.021178,0.016429
,2005-09-17T21:37:45Z,WQN009,-16.86,145.84,2.6,0.033783,0.029459,0.02595,0.025525,0.022622,0.020503,0.030726,0.027191,0.024176,0.02389,0.021325,0.016182
,2005-09-17T21:36:27Z,WQN009,-16.86,145.84,2.8,0.034103,0.030705,0.027093,0.024989,0.022499,0.020764,0.031013,0.028348,0.025239,0.023391,0.021218,0.016393
,2005-09-17T21:37:49Z,WQN009,-16.86,145.84,3,0.035042,0.031119,0.027634,0.02595,0.02351,0.02161,0.031849,0.028712,0.025722,0.024274,0.022164,0.017051
,2005-09-17T21:29:31Z,WQN009,-16.86,145.84,3.2,0.033323,0.030138,0.026111,0.024673,0.022312,0.019688,0.030247,0.027791,0.024298,0.023072,0.021022,0.015525
,2005-09-17T21:28:21Z,WQN009,-16.86,145.84,3.4,0.033562,0.029683,0.026396,0.024812,0.02287,0.020274,0.030482,0.027384,0.024576,0.02321,0.021544,0.015983
,2005-09-17T21:36:24Z,WQN009,-16.86,145.84,3.6,0.03485,0.030712,0.027109,0.02568,0.023533,0.021128,0.031718,0.028373,0.025264,0.02405,0.02219,0.016675
,2005-09-17T21:35:59Z,WQN009,-16.86,145.84,3.8,0.034088,0.029823,0.026822,0.025184,0.022824,0.020944,0.031004,0.027542,0.024994,0.023579,0.021517,0.016523
,2005-09-17T21:38:06Z,WQN009,-16.86,145.84,4,0.035634,0.032033,0.027701,0.026761,0.024158,0.022407,0.032223,0.02944,0.025706,0.024951,0.022672,0.017603
,2005-09-17T21:38:11Z,WQN009,-16.86,145.84,4.2,0.036618,0.032532,0.028458,0.02708,0.024782,0.023294,0.033059,0.029851,0.026385,0.02523,0.023251,0.018295
,2005-09-17T21:38:15Z,WQN009,-16.86,145.84,4.4,0.036899,0.033366,0.029337,0.027879,0.025005,0.023501,0.03332,0.030609,0.027138,0.025925,0.023443,0.018436
,2005-09-17T21:38:16Z,WQN009,-16.86,145.84,4.6,0.036947,0.033882,0.030314,0.02839,0.025296,0.024046,0.033346,0.031068,0.02803,0.026388,0.023711,0.018859
,2005-09-17T21:27:59Z,WQN009,-16.86,145.84,4.8,-999,-999,-999,-999,-999,-999,-999,-999,-999,-999,-999,-999
,2005-09-17T21:38:23Z,WQN009,-16.86,145.84,5,0.036174,0.032138,0.028401,0.027387,0.024876,0.022639,0.032606,0.029436,0.026262,0.025454,0.023318,0.017743
,2005-09-17T21:38:27Z,WQN009,-16.86,145.84,5.2,0.035958,0.032776,0.028526,0.0281,0.024298,0.022701,0.032388,0.030027,0.026401,0.026131,0.022765,0.01779
,2005-09-17T21:38:25Z,WQN009,-16.86,145.84,5.4,0.035782,0.031451,0.0281,0.026857,0.02433,0.022705,0.032249,0.028823,0.026008,0.024976,0.022792,0.01779
,2005-09-17T21:28:00Z,WQN009,-16.86,145.84,5.6,-999,-999,-999,-999,-999,-999,-999,-999,-999,-999,-999,-999
,2005-09-17T21:28:02Z,WQN009,-16.86,145.84,5.8,-999,-999,-999,-999,-999,-999,-999,-999,-999,-999,-999,-999
,2005-09-17T21:28:02Z,WQN009,-16.86,145.84,6,-999,-999,-999,-999,-999,-999,-999,-999,-999,-999,-999,-999
,2005-09-17T21:28:02Z,WQN009,-16.86,145.84,6.2,-999,-999,-999,-999,-999,-999,-999,-999,-999,-999,-999,-999
,2005-09-17T21:28:05Z,WQN009,-16.86,145.84,6.4,-999,-999,-999,-999,-999,-999,-999,-999,-999,-999,-999,-999
,2005-09-17T21:28:05Z,WQN009,-16.86,145.84,6.6,-999,-999,-999,-999,-999,-999,-999,-999,-999,-999,-999,-999
,2005-09-17T21:28:05Z,WQN009,-16.86,145.84,6.8,-999,-999,-999,-999,-999,-999,-999,-999,-999,-999,-999,-999
,2005-09-17T21:28:07Z,WQN009,-16.86,145.84,7,-999,-999,-999,-999,-999,-999,-999,-999,-999,-999,-999,-999
,2005-09-17T21:28:07Z,WQN009,-16.86,145.84,7.2,-999,-999,-999,-999,-999,-999,-999,-999,-999,-999,-999,-999
,2005-09-17T21:28:07Z,WQN009,-16.86,145.84,7.4,-999,-999,-999,-999,-999,-999,-999,-999,-999,-999,-999,-999
,2005-09-17T21:28:08Z,WQN009,-16.86,145.84,7.6,-999,-999,-999,-999,-999,-999,-999,-999,-999,-999,-999,-999
,2005-09-17T21:28:08Z,WQN009,-16.86,145.84,7.8,-999,-999,-999,-999,-999,-999,-999,-999,-999,-999,-999,-999
,2005-09-17T21:28:08Z,WQN009,-16.86,145.84,8,-999,-999,-999,-999,-999,-999,-999,-999,-999,-999,-999,-999
,2005-09-17T21:28:08Z,WQN009,-16.86,145.84,8.2,-999,-999,-999,-999,-999,-999,-999,-999,-999,-999,-999,-999
,2005-09-17T21:28:11Z,WQN009,-16.86,145.84,8.4,-999,-999,-999,-999,-999,-999,-999,-999,-999,-999,-999,-999
,2005-09-17T21:28:11Z,WQN009,-16.86,145.84,8.6,-999,-999,-999,-999,-999,-999,-999,-999,-999,-999,-999,-999
,2005-09-17T21:28:11Z,WQN009,-16.86,145.84,8.8,-999,-999,-999,-999,-999,-999,-999,-999,-999,-999,-999,-999
,2005-09-17T21:28:13Z,WQN009,-16.86,145.84,9,-999,-999,-999,-999,-999,-999,-999,-999,-999,-999,-999,-999
,2005-09-17T21:28:13Z,WQN009,-16.86,145.84,9.2,-999,-999,-999,-999,-999,-999,-999,-999,-999,-999,-999,-999
,2005-09-17T21:28:13Z,WQN009,-16.86,145.84,9.4,-999,-999,-999,-999,-999,-999,-999,-999,-999,-999,-999,-999
,2005-09-17T21:28:15Z,WQN009,-16.86,145.84,9.6,-999,-999,-999,-999,-999,-999,-999,-999,-999,-999,-999,-999
,2005-09-17T21:28:15Z,WQN009,-16.86,145.84,9.8,-999,-999,-999,-999,-999,-999,-999,-999,-999,-999,-999,-999
,2005-09-17T21:28:15Z,WQN009,-16.86,145.84,10,-999,-999,-999,-999,-999,-999,-999,-999,-999,-999,-999,-999
,2005-09-17T21:28:15Z,WQN009,-16.86,145.84,10.2,-999,-999,-999,-999,-999,-999,-999,-999,-999,-999,-999,-999
,2005-09-17T21:28:17Z,WQN009,-16.86,145.84,10.4,-999,-999,-999,-999,-999,-999,-999,-999,-999,-999,-999,-999
,2005-09-17T21:28:17Z,WQN009,-16.86,145.84,10.6,-999,-999,-999,-999,-999,-999,-999,-999,-999,-999,-999,-999
,2005-09-17T21:28:17Z,WQN009,-16.86,145.84,10.8,-999,-999,-999,-999,-999,-999,-999,-999,-999,-999,-999,-999
,2005-09-17T21:28:19Z,WQN009,-16.86,145.84,11,-999,-999,-999,-999,-999,-999,-999,-999,-999,-999,-999,-999
,2005-09-17T21:28:19Z,WQN009,-16.86,145.84,11.2,-999,-999,-999,-999,-999,-999,-999,-999,-999,-999,-999,-999
,2005-09-17T21:28:19Z,WQN009,-16.86,145.84,11.4,-999,-999,-999,-999,-999,-999,-999,-999,-999,-999,-999,-999
,2005-09-17T21:28:21Z,WQN009,-16.86,145.84,11.6,-999,-999,-999,-999,-999,-999,-999,-999,-999,-999,-999,-999
,2005-09-17T21:28:21Z,WQN009,-16.86,145.84,11.8,-999,-999,-999,-999,-999,-999,-999,-999,-999,-999,-999,-999
,2005-09-17T21:28:21Z,WQN009,-16.86,145.84,12,-999,-999,-999,-999,-999,-999,-999,-999,-999,-999,-999,-999
,2005-09-17T21:28:22Z,WQN009,-16.86,145.84,12.2,-999,-999,-999,-999,-999,-999,-999,-999,-999,-999,-999,-999
,2005-09-17T21:28:22Z,WQN009,-16.86,145.84,12.4,-999,-999,-999,-999,-999,-999,-999,-999,-999,-999,-999,-999
,2005-09-17T21:28:22Z,WQN009,-16.86,145.84,12.6,-999,-999,-999,-999,-999,-999,-999,-999,-999,-999,-999,-999
,2005-09-17T21:28:22Z,WQN009,-16.86,145.84,12.8,-999,-999,-999,-999,-999,-999,-999,-999,-999,-999,-999,-999
,2005-09-17T21:28:24Z,WQN009,-16.86,145.84,13,-999,-999,-999,-999,-999,-999,-999,-999,-999,-999,-999,-999
,2005-09-17T21:28:24Z,WQN009,-16.86,145.84,13.2,-999,-999,-999,-999,-999,-999,-999,-999,-999,-999,-999,-999
,2005-09-17T21:28:24Z,WQN009,-16.86,145.84,13.4,-999,-999,-999,-999,-999,-999,-999,-999,-999,-999,-999,-999
,2005-09-17T21:28:27Z,WQN009,-16.86,145.84,13.6,-999,-999,-999,-999,-999,-999,-999,-999,-999,-999,-999,-999
,2005-09-17T21:28:27Z,WQN009,-16.86,145.84,13.8,-999,-999,-999,-999,-999,-999,-999,-999,-999,-999,-999,-999
,2005-09-17T21:28:27Z,WQN009,-16.86,145.84,14,-999,-999,-999,-999,-999,-999,-999,-999,-999,-999,-999,-999
,2005-09-17T21:28:29Z,WQN009,-16.86,145.84,14.2,-999,-999,-999,-999,-999,-999,-999,-999,-999,-999,-999,-999
,2005-09-17T21:28:29Z,WQN009,-16.86,145.84,14.4,-999,-999,-999,-999,-999,-999,-999,-999,-999,-999,-999,-999
,2005-09-17T21:28:29Z,WQN009,-16.86,145.84,14.6,-999,-999,-999,-999,-999,-999,-999,-999,-999,-999,-999,-999
,2005-09-17T21:28:29Z,WQN009,-16.86,145.84,14.8,-999,-999,-999,-999,-999,-999,-999,-999,-999,-999,-999,-999
,2005-09-17T21:28:30Z,WQN009,-16.86,145.84,15,-999,-999,-999,-999,-999,-999,-999,-999,-999,-999,-999,-999
,2005-09-17T21:28:30Z,WQN009,-16.86,145.84,15.2,-999,-999,-999,-999,-999,-999,-999,-999,-999,-999,-999,-999
,2005-09-17T21:28:30Z,WQN009,-16.86,145.84,15.4,-999,-999,-999,-999,-999,-999,-999,-999,-999,-999,-999,-999
,2005-09-17T21:28:33Z,WQN009,-16.86,145.84,15.6,-999,-999,-999,-999,-999,-999,-999,-999,-999,-999,-999,-999
,2005-09-17T21:28:33Z,WQN009,-16.86,145.84,15.8,-999,-999,-999,-999,-999,-999,-999,-999,-999,-999,-999,-999
,2005-09-17T21:28:33Z,WQN009,-16.86,145.84,16,-999,-999,-999,-999,-999,-999,-999,-999,-999,-999,-999,-999
,2005-09-17T21:28:35Z,WQN009,-16.86,145.84,16.2,-999,-999,-999,-999,-999,-999,-999,-999,-999,-999,-999,-999
,2005-09-17T21:28:35Z,WQN009,-16.86,145.84,16.4,-999,-999,-999,-999,-999,-999,-999,-999,-999,-999,-999,-999
,2005-09-17T21:28:35Z,WQN009,-16.86,145.84,16.6,-999,-999,-999,-999,-999,-999,-999,-999,-999,-999,-999,-999
,2005-09-17T21:28:35Z,WQN009,-16.86,145.84,16.8,-999,-999,-999,-999,-999,-999,-999,-999,-999,-999,-999,-999
,2005-09-17T21:28:37Z,WQN009,-16.86,145.84,17,-999,-999,-999,-999,-999,-999,-999,-999,-999,-999,-999,-999
,2005-09-17T21:28:37Z,WQN009,-16.86,145.84,17.2,-999,-999,-999,-999,-999,-999,-999,-999,-999,-999,-999,-999
,2005-09-17T21:28:37Z,WQN009,-16.86,145.84,17.4,-999,-999,-999,-999,-999,-999,-999,-999,-999,-999,-999,-999
,2005-09-17T21:28:38Z,WQN009,-16.86,145.84,17.6,-999,-999,-999,-999,-999,-999,-999,-999,-999,-999,-999,-999
,2005-09-17T21:28:38Z,WQN009,-16.86,145.84,17.8,-999,-999,-999,-999,-999,-999,-999,-999,-999,-999,-999,-999
,2005-09-17T21:28:38Z,WQN009,-16.86,145.84,18,-999,-999,-999,-999,-999,-999,-999,-999,-999,-999,-999,-999
,2005-09-17T21:28:41Z,WQN009,-16.86,145.84,18.2,-999,-999,-999,-999,-999,-999,-999,-999,-999,-999,-999,-999
,2005-09-17T21:28:41Z,WQN009,-16.86,145.84,18.4,-999,-999,-999,-999,-999,-999,-999,-999,-999,-999,-999,-999
,2005-09-17T21:28:41Z,WQN009,-16.86,145.84,18.6,-999,-999,-999,-999,-999,-999,-999,-999,-999,-999,-999,-999
,2005-09-17T21:28:42Z,WQN009,-16.86,145.84,18.8,-999,-999,-999,-999,-999,-999,-999,-999,-999,-999,-999,-999
,2005-09-17T21:28:42Z,WQN009,-16.86,145.84,19,-999,-999,-999,-999,-999,-999,-999,-999,-999,-999,-999,-999
,2005-09-17T21:28:42Z,WQN009,-16.86,145.84,19.2,-999,-999,-999,-999,-999,-999,-999,-999,-999,-999,-999,-999
,2005-09-17T21:28:42Z,WQN009,-16.86,145.84,19.4,-999,-999,-999,-999,-999,-999,-999,-999,-999,-999,-999,-999
,2005-09-17T21:28:45Z,WQN009,-16.86,145.84,19.6,-999,-999,-999,-999,-999,-999,-999,-999,-999,-999,-999,-999
,2005-09-17T21:28:45Z,WQN009,-16.86,145.84,19.8,-999,-999,-999,-999,-999,-999,-999,-999,-999,-999,-999,-999
,2005-09-17T21:28:45Z,WQN009,-16.86,145.84,20,-999,-999,-999,-999,-999,-999,-999,-999,-999,-999,-999,-999
,2005-09-17T21:28:47Z,WQN009,-16.86,145.84,20.2,-999,-999,-999,-999,-999,-999,-999,-999,-999,-999,-999,-999
,2005-09-17T21:28:47Z,WQN009,-16.86,145.84,20.4,-999,-999,-999,-999,-999,-999,-999,-999,-999,-999,-999,-999
,2005-09-17T21:28:47Z,WQN009,-16.86,145.84,20.6,-999,-999,-999,-999,-999,-999,-999,-999,-999,-999,-999,-999
,2005-09-17T21:28:48Z,WQN009,-16.86,145.84,20.8,-999,-999,-999,-999,-999,-999,-999,-999,-999,-999,-999,-999
,2005-09-17T21:28:48Z,WQN009,-16.86,145.84,21,-999,-999,-999,-999,-999,-999,-999,-999,-999,-999,-999,-999
,2005-09-17T21:28:48Z,WQN009,-16.86,145.84,21.2,-999,-999,-999,-999,-999,-999,-999,-999,-999,-999,-999,-999
,2005-09-17T21:28:48Z,WQN009,-16.86,145.84,21.4,-999,-999,-999,-999,-999,-999,-999,-999,-999,-999,-999,-999
,2005-09-17T21:28:51Z,WQN009,-16.86,145.84,21.6,-999,-999,-999,-999,-999,-999,-999,-999,-999,-999,-999,-999
,2005-09-17T21:28:51Z,WQN009,-16.86,145.84,21.8,-999,-999,-999,-999,-999,-999,-999,-999,-999,-999,-999,-999
,2005-09-17T21:28:51Z,WQN009,-16.86,145.84,22,-999,-999,-999,-999,-999,-999,-999,-999,-999,-999,-999,-999
,2005-09-17T21:28:53Z,WQN009,-16.86,145.84,22.2,-999,-999,-999,-999,-999,-999,-999,-999,-999,-999,-999,-999
,2005-09-17T21:28:53Z,WQN009,-16.86,145.84,22.4,-999,-999,-999,-999,-999,-999,-999,-999,-999,-999,-999,-999
,2005-09-17T21:28:53Z,WQN009,-16.86,145.84,22.6,-999,-999,-999,-999,-999,-999,-999,-999,-999,-999,-999,-999
,2005-09-17T21:28:55Z,WQN009,-16.86,145.84,22.8,-999,-999,-999,-999,-999,-999,-999,-999,-999,-999,-999,-999
,2005-09-17T21:28:55Z,WQN009,-16.86,145.84,23,-999,-999,-999,-999,-999,-999,-999,-999,-999,-999,-999,-999
,2005-09-17T21:28:55Z,WQN009,-16.86,145.84,23.2,-999,-999,-999,-999,-999,-999,-999,-999,-999,-999,-999,-999
,2005-09-17T21:28:55Z,WQN009,-16.86,145.84,23.4,-999,-999,-999,-999,-999,-999,-999,-999,-999,-999,-999,-999
,2005-09-17T21:28:56Z,WQN009,-16.86,145.84,23.6,-999,-999,-999,-999,-999,-999,-999,-999,-999,-999,-999,-999
,2005-09-17T21:28:56Z,WQN009,-16.86,145.84,23.8,-999,-999,-999,-999,-999,-999,-999,-999,-999,-999,-999,-999
,2005-09-17T21:28:56Z,WQN009,-16.86,145.84,24,-999,-999,-999,-999,-999,-999,-999,-999,-999,-999,-999,-999
,2005-09-17T21:28:59Z,WQN009,-16.86,145.84,24.2,-999,-999,-999,-999,-999,-999,-999,-999,-999,-999,-999,-999
,2005-09-17T21:28:59Z,WQN009,-16.86,145.84,24.4,-999,-999,-999,-999,-999,-999,-999,-999,-999,-999,-999,-999
,2005-09-17T21:28:59Z,WQN009,-16.86,145.84,24.6,-999,-999,-999,-999,-999,-999,-999,-999,-999,-999,-999,-999
,2005-09-17T21:29:01Z,WQN009,-16.86,145.84,24.8,-999,-999,-999,-999,-999,-999,-999,-999,-999,-999,-999,-999
,2005-09-17T21:29:01Z,WQN009,-16.86,145.84,25,-999,-999,-999,-999,-999,-999,-999,-999,-999,-999,-999,-999
,2005-09-17T21:29:01Z,WQN009,-16.86,145.84,25.2,-999,-999,-999,-999,-999,-999,-999,-999,-999,-999,-999,-999
,2005-09-17T21:29:02Z,WQN009,-16.86,145.84,25.4,-999,-999,-999,-999,-999,-999,-999,-999,-999,-999,-999,-999
,2005-09-17T21:29:02Z,WQN009,-16.86,145.84,25.6,-999,-999,-999,-999,-999,-999,-999,-999,-999,-999,-999,-999
,2005-09-17T21:29:02Z,WQN009,-16.86,145.84,25.8,-999,-999,-999,-999,-999,-999,-999,-999,-999,-999,-999,-999
,2005-09-17T21:29:02Z,WQN009,-16.86,145.84,26,-999,-999,-999,-999,-999,-999,-999,-999,-999,-999,-999,-999
,2005-09-17T21:29:05Z,WQN009,-16.86,145.84,26.2,-999,-999,-999,-999,-999,-999,-999,-999,-999,-999,-999,-999
,2005-09-17T21:29:05Z,WQN009,-16.86,145.84,26.4,-999,-999,-999,-999,-999,-999,-999,-999,-999,-999,-999,-999
,2005-09-17T21:29:05Z,WQN009,-16.86,145.84,26.6,-999,-999,-999,-999,-999,-999,-999,-999,-999,-999,-999,-999
,2005-09-17T21:29:07Z,WQN009,-16.86,145.84,26.8,-999,-999,-999,-999,-999,-999,-999,-999,-999,-999,-999,-999
,2005-09-17T21:29:07Z,WQN009,-16.86,145.84,27,-999,-999,-999,-999,-999,-999,-999,-999,-999,-999,-999,-999
,2005-09-17T21:29:07Z,WQN009,-16.86,145.84,27.2,-999,-999,-999,-999,-999,-999,-999,-999,-999,-999,-999,-999
,2005-09-17T21:29:09Z,WQN009,-16.86,145.84,27.4,-999,-999,-999,-999,-999,-999,-999,-999,-999,-999,-999,-999
,2005-09-17T21:29:09Z,WQN009,-16.86,145.84,27.6,-999,-999,-999,-999,-999,-999,-999,-999,-999,-999,-999,-999
,2005-09-17T21:29:09Z,WQN009,-16.86,145.84,27.8,-999,-999,-999,-999,-999,-999,-999,-999,-999,-999,-999,-999
,2005-09-17T21:29:09Z,WQN009,-16.86,145.84,28,-999,-999,-999,-999,-999,-999,-999,-999,-999,-999,-999,-999
,2005-09-17T21:29:10Z,WQN009,-16.86,145.84,28.2,-999,-999,-999,-999,-999,-999,-999,-999,-999,-999,-999,-999
,2005-09-17T21:29:10Z,WQN009,-16.86,145.84,28.4,-999,-999,-999,-999,-999,-999,-999,-999,-999,-999,-999,-999
,2005-09-17T21:29:10Z,WQN009,-16.86,145.84,28.6,-999,-999,-999,-999,-999,-999,-999,-999,-999,-999,-999,-999
,2005-09-17T21:29:13Z,WQN009,-16.86,145.84,28.8,-999,-999,-999,-999,-999,-999,-999,-999,-999,-999,-999,-999
,2005-09-17T21:29:13Z,WQN009,-16.86,145.84,29,-999,-999,-999,-999,-999,-999,-999,-999,-999,-999,-999,-999
,2005-09-17T21:29:13Z,WQN009,-16.86,145.84,29.2,-999,-999,-999,-999,-999,-999,-999,-999,-999,-999,-999,-999
,2005-09-17T21:29:15Z,WQN009,-16.86,145.84,29.4,-999,-999,-999,-999,-999,-999,-999,-999,-999,-999,-999,-999
,2005-09-17T21:29:15Z,WQN009,-16.86,145.84,29.6,-999,-999,-999,-999,-999,-999,-999,-999,-999,-999,-999,-999
,2005-09-17T21:29:15Z,WQN009,-16.86,145.84,29.8,-999,-999,-999,-999,-999,-999,-999,-999,-999,-999,-999,-999
,2005-09-17T21:29:17Z,WQN009,-16.86,145.84,30,-999,-999,-999,-999,-999,-999,-999,-999,-999,-999,-999,-999
,2005-09-17T21:29:17Z,WQN009,-16.86,145.84,30.2,-999,-999,-999,-999,-999,-999,-999,-999,-999,-999,-999,-999
,2005-09-17T21:29:17Z,WQN009,-16.86,145.84,30.4,-999,-999,-999,-999,-999,-999,-999,-999,-999,-999,-999,-999
,2005-09-17T21:29:17Z,WQN009,-16.86,145.84,30.6,-999,-999,-999,-999,-999,-999,-999,-999,-999,-999,-999,-999
,2005-09-17T21:29:19Z,WQN009,-16.86,145.84,30.8,-999,-999,-999,-999,-999,-999,-999,-999,-999,-999,-999,-999
,2005-09-17T21:29:19Z,WQN009,-16.86,145.84,31,-999,-999,-999,-999,-999,-999,-999,-999,-999,-999,-999,-999
,2005-09-17T21:29:19Z,WQN009,-16.86,145.84,31.2,-999,-999,-999,-999,-999,-999,-999,-999,-999,-999,-999,-999
,2005-09-17T21:29:21Z,WQN009,-16.86,145.84,31.4,-999,-999,-999,-999,-999,-999,-999,-999,-999,-999,-999,-999
,2005-09-17T21:29:21Z,WQN009,-16.86,145.84,31.6,-999,-999,-999,-999,-999,-999,-999,-999,-999,-999,-999,-999
,2005-09-17T21:29:21Z,WQN009,-16.86,145.84,31.8,-999,-999,-999,-999,-999,-999,-999,-999,-999,-999,-999,-999
,2005-09-17T21:29:23Z,WQN009,-16.86,145.84,32,-999,-999,-999,-999,-999,-999,-999,-999,-999,-999,-999,-999
,2005-09-17T21:29:23Z,WQN009,-16.86,145.84,32.2,-999,-999,-999,-999,-999,-999,-999,-999,-999,-999,-999,-999
,2005-09-17T21:29:23Z,WQN009,-16.86,145.84,32.4,-999,-999,-999,-999,-999,-999,-999,-999,-999,-999,-999,-999
,2005-09-17T21:29:23Z,WQN009,-16.86,145.84,32.6,-999,-999,-999,-999,-999,-999,-999,-999,-999,-999,-999,-999
,2005-09-17T21:29:25Z,WQN009,-16.86,145.84,32.8,-999,-999,-999,-999,-999,-999,-999,-999,-999,-999,-999,-999
,2005-09-17T21:29:25Z,WQN009,-16.86,145.84,33,-999,-999,-999,-999,-999,-999,-999,-999,-999,-999,-999,-999
,2005-09-17T21:29:25Z,WQN009,-16.86,145.84,33.2,-999,-999,-999,-999,-999,-999,-999,-999,-999,-999,-999,-999
,2005-09-17T21:29:27Z,WQN009,-16.86,145.84,33.4,-999,-999,-999,-999,-999,-999,-999,-999,-999,-999,-999,-999
,2005-09-17T21:29:27Z,WQN009,-16.86,145.84,33.6,-999,-999,-999,-999,-999,-999,-999,-999,-999,-999,-999,-999
,2005-09-17T21:29:27Z,WQN009,-16.86,145.84,33.8,-999,-999,-999,-999,-999,-999,-999,-999,-999,-999,-999,-999
,2005-09-17T21:29:28Z,WQN009,-16.86,145.84,34,-999,-999,-999,-999,-999,-999,-999,-999,-999,-999,-999,-999
,2005-09-17T21:29:28Z,WQN009,-16.86,145.84,34.2,-999,-999,-999,-999,-999,-999,-999,-999,-999,-999,-999,-999
,2005-09-17T21:29:28Z,WQN009,-16.86,145.84,34.4,-999,-999,-999,-999,-999,-999,-999,-999,-999,-999,-999,-999
,2005-09-17T21:29:28Z,WQN009,-16.86,145.84,34.6,-999,-999,-999,-999,-999,-999,-999,-999,-999,-999,-999,-999
,2005-09-17T21:29:31Z,WQN009,-16.86,145.84,34.8,-999,-999,-999,-999,-999,-999,-999,-999,-999,-999,-999,-999
,2005-09-17T21:29:31Z,WQN009,-16.86,145.84,35,-999,-999,-999,-999,-999,-999,-999,-999,-999,-999,-999,-999
,2005-09-17T21:29:31Z,WQN009,-16.86,145.84,35.2,-999,-999,-999,-999,-999,-999,-999,-999,-999,-999,-999,-999
,2005-09-17T21:29:33Z,WQN009,-16.86,145.84,35.4,-999,-999,-999,-999,-999,-999,-999,-999,-999,-999,-999,-999
,2005-09-17T21:29:33Z,WQN009,-16.86,145.84,35.6,-999,-999,-999,-999,-999,-999,-999,-999,-999,-999,-999,-999
,2005-09-17T21:29:33Z,WQN009,-16.86,145.84,35.8,-999,-999,-999,-999,-999,-999,-999,-999,-999,-999,-999,-999
,2005-09-17T21:29:35Z,WQN009,-16.86,145.84,36,-999,-999,-999,-999,-999,-999,-999,-999,-999,-999,-999,-999
,2005-09-17T21:29:35Z,WQN009,-16.86,145.84,36.2,-999,-999,-999,-999,-999,-999,-999,-999,-999,-999,-999,-999
,2005-09-17T21:29:35Z,WQN009,-16.86,145.84,36.4,-999,-999,-999,-999,-999,-999,-999,-999,-999,-999,-999,-999
,2005-09-17T21:29:36Z,WQN009,-16.86,145.84,36.6,-999,-999,-999,-999,-999,-999,-999,-999,-999,-999,-999,-999
,2005-09-17T21:29:36Z,WQN009,-16.86,145.84,36.8,-999,-999,-999,-999,-999,-999,-999,-999,-999,-999,-999,-999
,2005-09-17T21:29:36Z,WQN009,-16.86,145.84,37,-999,-999,-999,-999,-999,-999,-999,-999,-999,-999,-999,-999
,2005-09-17T21:29:36Z,WQN009,-16.86,145.84,37.2,-999,-999,-999,-999,-999,-999,-999,-999,-999,-999,-999,-999
,2005-09-17T21:29:39Z,WQN009,-16.86,145.84,37.4,-999,-999,-999,-999,-999,-999,-999,-999,-999,-999,-999,-999
,2005-09-17T21:29:39Z,WQN009,-16.86,145.84,37.6,-999,-999,-999,-999,-999,-999,-999,-999,-999,-999,-999,-999
,2005-09-17T21:29:39Z,WQN009,-16.86,145.84,37.8,-999,-999,-999,-999,-999,-999,-999,-999,-999,-999,-999,-999
,2005-09-17T21:29:41Z,WQN009,-16.86,145.84,38,-999,-999,-999,-999,-999,-999,-999,-999,-999,-999,-999,-999
,2005-09-17T21:29:41Z,WQN009,-16.86,145.84,38.2,-999,-999,-999,-999,-999,-999,-999,-999,-999,-999,-999,-999
,2005-09-17T21:29:41Z,WQN009,-16.86,145.84,38.4,-999,-999,-999,-999,-999,-999,-999,-999,-999,-999,-999,-999
,2005-09-17T21:29:43Z,WQN009,-16.86,145.84,38.6,-999,-999,-999,-999,-999,-999,-999,-999,-999,-999,-999,-999
,2005-09-17T21:29:43Z,WQN009,-16.86,145.84,38.8,-999,-999,-999,-999,-999,-999,-999,-999,-999,-999,-999,-999
,2005-09-17T21:29:43Z,WQN009,-16.86,145.84,39,-999,-999,-999,-999,-999,-999,-999,-999,-999,-999,-999,-999
,2005-09-17T21:29:43Z,WQN009,-16.86,145.84,39.2,-999,-999,-999,-999,-999,-999,-999,-999,-999,-999,-999,-999
,2005-09-17T21:29:45Z,WQN009,-16.86,145.84,39.4,-999,-999,-999,-999,-999,-999,-999,-999,-999,-999,-999,-999
,2005-09-17T21:29:45Z,WQN009,-16.86,145.84,39.6,-999,-999,-999,-999,-999,-999,-999,-999,-999,-999,-999,-999
,2005-09-17T21:29:45Z,WQN009,-16.86,145.84,39.8,-999,-999,-999,-999,-999,-999,-999,-999,-999,-999,-999,-999
,2005-09-17T21:29:46Z,WQN009,-16.86,145.84,40,-999,-999,-999,-999,-999,-999,-999,-999,-999,-999,-999,-999
,2005-09-17T21:29:46Z,WQN009,-16.86,145.84,40.2,-999,-999,-999,-999,-999,-999,-999,-999,-999,-999,-999,-999
,2005-09-17T21:29:46Z,WQN009,-16.86,145.84,40.4,-999,-999,-999,-999,-999,-999,-999,-999,-999,-999,-999,-999
,2005-09-17T21:29:48Z,WQN009,-16.86,145.84,40.6,-999,-999,-999,-999,-999,-999,-999,-999,-999,-999,-999,-999
,2005-09-17T21:29:48Z,WQN009,-16.86,145.84,40.8,-999,-999,-999,-999,-999,-999,-999,-999,-999,-999,-999,-999
,2005-09-17T21:29:48Z,WQN009,-16.86,145.84,41,-999,-999,-999,-999,-999,-999,-999,-999,-999,-999,-999,-999
,2005-09-17T21:29:48Z,WQN009,-16.86,145.84,41.2,-999,-999,-999,-999,-999,-999,-999,-999,-999,-999,-999,-999
,2005-09-17T21:29:51Z,WQN009,-16.86,145.84,41.4,-999,-999,-999,-999,-999,-999,-999,-999,-999,-999,-999,-999
,2005-09-17T21:29:51Z,WQN009,-16.86,145.84,41.6,-999,-999,-999,-999,-999,-999,-999,-999,-999,-999,-999,-999
,2005-09-17T21:29:51Z,WQN009,-16.86,145.84,41.8,-999,-999,-999,-999,-999,-999,-999,-999,-999,-999,-999,-999
,2005-09-17T21:29:53Z,WQN009,-16.86,145.84,42,-999,-999,-999,-999,-999,-999,-999,-999,-999,-999,-999,-999
,2005-09-17T21:29:53Z,WQN009,-16.86,145.84,42.2,-999,-999,-999,-999,-999,-999,-999,-999,-999,-999,-999,-999
,2005-09-17T21:29:53Z,WQN009,-16.86,145.84,42.4,-999,-999,-999,-999,-999,-999,-999,-999,-999,-999,-999,-999
,2005-09-17T21:29:55Z,WQN009,-16.86,145.84,42.6,-999,-999,-999,-999,-999,-999,-999,-999,-999,-999,-999,-999
,2005-09-17T21:29:55Z,WQN009,-16.86,145.84,42.8,-999,-999,-999,-999,-999,-999,-999,-999,-999,-999,-999,-999
,2005-09-17T21:29:55Z,WQN009,-16.86,145.84,43,-999,-999,-999,-999,-999,-999,-999,-999,-999,-999,-999,-999
,2005-09-17T21:29:57Z,WQN009,-16.86,145.84,43.2,-999,-999,-999,-999,-999,-999,-999,-999,-999,-999,-999,-999
,2005-09-17T21:29:57Z,WQN009,-16.86,145.84,43.4,-999,-999,-999,-999,-999,-999,-999,-999,-999,-999,-999,-999
,2005-09-17T21:29:57Z,WQN009,-16.86,145.84,43.6,-999,-999,-999,-999,-999,-999,-999,-999,-999,-999,-999,-999
,2005-09-17T21:29:57Z,WQN009,-16.86,145.84,43.8,-999,-999,-999,-999,-999,-999,-999,-999,-999,-999,-999,-999
,2005-09-17T21:29:58Z,WQN009,-16.86,145.84,44,-999,-999,-999,-999,-999,-999,-999,-999,-999,-999,-999,-999
,2005-09-17T21:29:58Z,WQN009,-16.86,145.84,44.2,-999,-999,-999,-999,-999,-999,-999,-999,-999,-999,-999,-999
,2005-09-17T21:29:58Z,WQN009,-16.86,145.84,44.4,-999,-999,-999,-999,-999,-999,-999,-999,-999,-999,-999,-999
,2005-09-17T21:30:01Z,WQN009,-16.86,145.84,44.6,-999,-999,-999,-999,-999,-999,-999,-999,-999,-999,-999,-999
,2005-09-17T21:30:01Z,WQN009,-16.86,145.84,44.8,-999,-999,-999,-999,-999,-999,-999,-999,-999,-999,-999,-999
,2005-09-17T21:30:01Z,WQN009,-16.86,145.84,45,-999,-999,-999,-999,-999,-999,-999,-999,-999,-999,-999,-999
,2005-09-17T21:30:02Z,WQN009,-16.86,145.84,45.2,-999,-999,-999,-999,-999,-999,-999,-999,-999,-999,-999,-999
,2005-09-17T21:30:02Z,WQN009,-16.86,145.84,45.4,-999,-999,-999,-999,-999,-999,-999,-999,-999,-999,-999,-999
,2005-09-17T21:30:02Z,WQN009,-16.86,145.84,45.6,-999,-999,-999,-999,-999,-999,-999,-999,-999,-999,-999,-999
,2005-09-17T21:30:02Z,WQN009,-16.86,145.84,45.8,-999,-999,-999,-999,-999,-999,-999,-999,-999,-999,-999,-999
,2005-09-17T21:30:05Z,WQN009,-16.86,145.84,46,-999,-999,-999,-999,-999,-999,-999,-999,-999,-999,-999,-999
,2005-09-17T21:30:05Z,WQN009,-16.86,145.84,46.2,-999,-999,-999,-999,-999,-999,-999,-999,-999,-999,-999,-999
,2005-09-17T21:30:05Z,WQN009,-16.86,145.84,46.4,-999,-999,-999,-999,-999,-999,-999,-999,-999,-999,-999,-999
,2005-09-17T21:30:06Z,WQN009,-16.86,145.84,46.6,-999,-999,-999,-999,-999,-999,-999,-999,-999,-999,-999,-999
,2005-09-17T21:30:06Z,WQN009,-16.86,145.84,46.8,-999,-999,-999,-999,-999,-999,-999,-999,-999,-999,-999,-999
,2005-09-17T21:30:06Z,WQN009,-16.86,145.84,47,-999,-999,-999,-999,-999,-999,-999,-999,-999,-999,-999,-999
,2005-09-17T21:30:09Z,WQN009,-16.86,145.84,47.2,-999,-999,-999,-999,-999,-999,-999,-999,-999,-999,-999,-999
,2005-09-17T21:30:09Z,WQN009,-16.86,145.84,47.4,-999,-999,-999,-999,-999,-999,-999,-999,-999,-999,-999,-999
,2005-09-17T21:30:09Z,WQN009,-16.86,145.84,47.6,-999,-999,-999,-999,-999,-999,-999,-999,-999,-999,-999,-999
,2005-09-17T21:30:10Z,WQN009,-16.86,145.84,47.8,-999,-999,-999,-999,-999,-999,-999,-999,-999,-999,-999,-999
,2005-09-17T21:30:10Z,WQN009,-16.86,145.84,48,-999,-999,-999,-999,-999,-999,-999,-999,-999,-999,-999,-999
,2005-09-17T21:30:10Z,WQN009,-16.86,145.84,48.2,-999,-999,-999,-999,-999,-999,-999,-999,-999,-999,-999,-999
,2005-09-17T21:30:10Z,WQN009,-16.86,145.84,48.4,-999,-999,-999,-999,-999,-999,-999,-999,-999,-999,-999,-999
,2005-09-17T21:30:13Z,WQN009,-16.86,145.84,48.6,-999,-999,-999,-999,-999,-999,-999,-999,-999,-999,-999,-999
,2005-09-17T21:30:13Z,WQN009,-16.86,145.84,48.8,-999,-999,-999,-999,-999,-999,-999,-999,-999,-999,-999,-999
,2005-09-17T21:30:13Z,WQN009,-16.86,145.84,49,-999,-999,-999,-999,-999,-999,-999,-999,-999,-999,-999,-999
,2005-09-17T21:30:15Z,WQN009,-16.86,145.84,49.2,-999,-999,-999,-999,-999,-999,-999,-999,-999,-999,-999,-999
,2005-09-17T21:30:15Z,WQN009,-16.86,145.84,49.4,-999,-999,-999,-999,-999,-999,-999,-999,-999,-999,-999,-999
,2005-09-17T21:30:15Z,WQN009,-16.86,145.84,49.6,-999,-999,-999,-999,-999,-999,-999,-999,-999,-999,-999,-999
,2005-09-17T21:30:17Z,WQN009,-16.86,145.84,49.8,-999,-999,-999,-999,-999,-999,-999,-999,-999,-999,-999,-999
,2005-09-17T21:30:17Z,WQN009,-16.86,145.84,50,-999,-999,-999,-999,-999,-999,-999,-999,-999,-999,-999,-999
,2005-09-17T21:30:17Z,WQN009,-16.86,145.84,50.2,-999,-999,-999,-999,-999,-999,-999,-999,-999,-999,-999,-999
,2005-09-17T21:30:17Z,WQN009,-16.86,145.84,50.4,-999,-999,-999,-999,-999,-999,-999,-999,-999,-999,-999,-999
,2005-09-17T21:30:19Z,WQN009,-16.86,145.84,50.6,-999,-999,-999,-999,-999,-999,-999,-999,-999,-999,-999,-999
,2005-09-17T21:30:19Z,WQN009,-16.86,145.84,50.8,-999,-999,-999,-999,-999,-999,-999,-999,-999,-999,-999,-999
,2005-09-17T21:30:19Z,WQN009,-16.86,145.84,51,-999,-999,-999,-999,-999,-999,-999,-999,-999,-999,-999,-999
,2005-09-17T21:30:21Z,WQN009,-16.86,145.84,51.2,-999,-999,-999,-999,-999,-999,-999,-999,-999,-999,-999,-999
,2005-09-17T21:30:21Z,WQN009,-16.86,145.84,51.4,-999,-999,-999,-999,-999,-999,-999,-999,-999,-999,-999,-999
,2005-09-17T21:30:21Z,WQN009,-16.86,145.84,51.6,-999,-999,-999,-999,-999,-999,-999,-999,-999,-999,-999,-999
,2005-09-17T21:30:23Z,WQN009,-16.86,145.84,51.8,-999,-999,-999,-999,-999,-999,-999,-999,-999,-999,-999,-999
,2005-09-17T21:30:23Z,WQN009,-16.86,145.84,52,-999,-999,-999,-999,-999,-999,-999,-999,-999,-999,-999,-999
,2005-09-17T21:30:23Z,WQN009,-16.86,145.84,52.2,-999,-999,-999,-999,-999,-999,-999,-999,-999,-999,-999,-999
,2005-09-17T21:30:23Z,WQN009,-16.86,145.84,52.4,-999,-999,-999,-999,-999,-999,-999,-999,-999,-999,-999,-999
,2005-09-17T21:30:24Z,WQN009,-16.86,145.84,52.6,-999,-999,-999,-999,-999,-999,-999,-999,-999,-999,-999,-999
,2005-09-17T21:30:24Z,WQN009,-16.86,145.84,52.8,-999,-999,-999,-999,-999,-999,-999,-999,-999,-999,-999,-999
,2005-09-17T21:30:24Z,WQN009,-16.86,145.84,53,-999,-999,-999,-999,-999,-999,-999,-999,-999,-999,-999,-999
,2005-09-17T21:30:27Z,WQN009,-16.86,145.84,53.2,-999,-999,-999,-999,-999,-999,-999,-999,-999,-999,-999,-999
,2005-09-17T21:30:27Z,WQN009,-16.86,145.84,53.4,-999,-999,-999,-999,-999,-999,-999,-999,-999,-999,-999,-999
,2005-09-17T21:30:27Z,WQN009,-16.86,145.84,53.6,-999,-999,-999,-999,-999,-999,-999,-999,-999,-999,-999,-999
,2005-09-17T21:30:29Z,WQN009,-16.86,145.84,53.8,-999,-999,-999,-999,-999,-999,-999,-999,-999,-999,-999,-999
,2005-09-17T21:30:29Z,WQN009,-16.86,145.84,54,-999,-999,-999,-999,-999,-999,-999,-999,-999,-999,-999,-999
,2005-09-17T21:30:29Z,WQN009,-16.86,145.84,54.2,-999,-999,-999,-999,-999,-999,-999,-999,-999,-999,-999,-999
,2005-09-17T21:30:31Z,WQN009,-16.86,145.84,54.4,-999,-999,-999,-999,-999,-999,-999,-999,-999,-999,-999,-999
,2005-09-17T21:30:31Z,WQN009,-16.86,145.84,54.6,-999,-999,-999,-999,-999,-999,-999,-999,-999,-999,-999,-999
,2005-09-17T21:30:31Z,WQN009,-16.86,145.84,54.8,-999,-999,-999,-999,-999,-999,-999,-999,-999,-999,-999,-999
,2005-09-17T21:30:31Z,WQN009,-16.86,145.84,55,-999,-999,-999,-999,-999,-999,-999,-999,-999,-999,-999,-999
,2005-09-17T21:30:33Z,WQN009,-16.86,145.84,55.2,-999,-999,-999,-999,-999,-999,-999,-999,-999,-999,-999,-999
,2005-09-17T21:30:33Z,WQN009,-16.86,145.84,55.4,-999,-999,-999,-999,-999,-999,-999,-999,-999,-999,-999,-999
,2005-09-17T21:30:33Z,WQN009,-16.86,145.84,55.6,-999,-999,-999,-999,-999,-999,-999,-999,-999,-999,-999,-999
,2005-09-17T21:30:34Z,WQN009,-16.86,145.84,55.8,-999,-999,-999,-999,-999,-999,-999,-999,-999,-999,-999,-999
,2005-09-17T21:30:34Z,WQN009,-16.86,145.84,56,-999,-999,-999,-999,-999,-999,-999,-999,-999,-999,-999,-999
,2005-09-17T21:30:34Z,WQN009,-16.86,145.84,56.2,-999,-999,-999,-999,-999,-999,-999,-999,-999,-999,-999,-999
,2005-09-17T21:30:37Z,WQN009,-16.86,145.84,56.4,-999,-999,-999,-999,-999,-999,-999,-999,-999,-999,-999,-999
,2005-09-17T21:30:37Z,WQN009,-16.86,145.84,56.6,-999,-999,-999,-999,-999,-999,-999,-999,-999,-999,-999,-999
,2005-09-17T21:30:37Z,WQN009,-16.86,145.84,56.8,-999,-999,-999,-999,-999,-999,-999,-999,-999,-999,-999,-999
,2005-09-17T21:30:37Z,WQN009,-16.86,145.84,57,-999,-999,-999,-999,-999,-999,-999,-999,-999,-999,-999,-999
,2005-09-17T21:30:39Z,WQN009,-16.86,145.84,57.2,-999,-999,-999,-999,-999,-999,-999,-999,-999,-999,-999,-999
,2005-09-17T21:30:39Z,WQN009,-16.86,145.84,57.4,-999,-999,-999,-999,-999,-999,-999,-999,-999,-999,-999,-999
,2005-09-17T21:30:39Z,WQN009,-16.86,145.84,57.6,-999,-999,-999,-999,-999,-999,-999,-999,-999,-999,-999,-999
,2005-09-17T21:30:41Z,WQN009,-16.86,145.84,57.8,-999,-999,-999,-999,-999,-999,-999,-999,-999,-999,-999,-999
,2005-09-17T21:30:41Z,WQN009,-16.86,145.84,58,-999,-999,-999,-999,-999,-999,-999,-999,-999,-999,-999,-999
,2005-09-17T21:30:41Z,WQN009,-16.86,145.84,58.2,-999,-999,-999,-999,-999,-999,-999,-999,-999,-999,-999,-999
,2005-09-17T21:30:42Z,WQN009,-16.86,145.84,58.4,-999,-999,-999,-999,-999,-999,-999,-999,-999,-999,-999,-999
,2005-09-17T21:30:42Z,WQN009,-16.86,145.84,58.6,-999,-999,-999,-999,-999,-999,-999,-999,-999,-999,-999,-999
,2005-09-17T21:30:42Z,WQN009,-16.86,145.84,58.8,-999,-999,-999,-999,-999,-999,-999,-999,-999,-999,-999,-999
,2005-09-17T21:30:45Z,WQN009,-16.86,145.84,59,-999,-999,-999,-999,-999,-999,-999,-999,-999,-999,-999,-999
,2005-09-17T21:30:45Z,WQN009,-16.86,145.84,59.2,-999,-999,-999,-999,-999,-999,-999,-999,-999,-999,-999,-999
,2005-09-17T21:30:45Z,WQN009,-16.86,145.84,59.4,-999,-999,-999,-999,-999,-999,-999,-999,-999,-999,-999,-999
,2005-09-17T21:30:45Z,WQN009,-16.86,145.84,59.6,-999,-999,-999,-999,-999,-999,-999,-999,-999,-999,-999,-999
,2005-09-17T21:30:47Z,WQN009,-16.86,145.84,59.8,-999,-999,-999,-999,-999,-999,-999,-999,-999,-999,-999,-999
,2005-09-17T21:30:47Z,WQN009,-16.86,145.84,60,-999,-999,-999,-999,-999,-999,-999,-999,-999,-999,-999,-999
,2005-09-17T21:30:47Z,WQN009,-16.86,145.84,60.2,-999,-999,-999,-999,-999,-999,-999,-999,-999,-999,-999,-999
,2005-09-17T21:30:49Z,WQN009,-16.86,145.84,60.4,-999,-999,-999,-999,-999,-999,-999,-999,-999,-999,-999,-999
,2005-09-17T21:30:49Z,WQN009,-16.86,145.84,60.6,-999,-999,-999,-999,-999,-999,-999,-999,-999,-999,-999,-999
,2005-09-17T21:30:49Z,WQN009,-16.86,145.84,60.8,-999,-999,-999,-999,-999,-999,-999,-999,-999,-999,-999,-999
,2005-09-17T21:30:50Z,WQN009,-16.86,145.84,61,-999,-999,-999,-999,-999,-999,-999,-999,-999,-999,-999,-999
,2005-09-17T21:30:50Z,WQN009,-16.86,145.84,61.2,-999,-999,-999,-999,-999,-999,-999,-999,-999,-999,-999,-999
,2005-09-17T21:30:50Z,WQN009,-16.86,145.84,61.4,-999,-999,-999,-999,-999,-999,-999,-999,-999,-999,-999,-999
,2005-09-17T21:30:50Z,WQN009,-16.86,145.84,61.6,-999,-999,-999,-999,-999,-999,-999,-999,-999,-999,-999,-999
,2005-09-17T21:30:52Z,WQN009,-16.86,145.84,61.8,-999,-999,-999,-999,-999,-999,-999,-999,-999,-999,-999,-999
,2005-09-17T21:30:52Z,WQN009,-16.86,145.84,62,-999,-999,-999,-999,-999,-999,-999,-999,-999,-999,-999,-999
,2005-09-17T21:30:52Z,WQN009,-16.86,145.84,62.2,-999,-999,-999,-999,-999,-999,-999,-999,-999,-999,-999,-999
,2005-09-17T21:30:55Z,WQN009,-16.86,145.84,62.4,-999,-999,-999,-999,-999,-999,-999,-999,-999,-999,-999,-999
,2005-09-17T21:30:55Z,WQN009,-16.86,145.84,62.6,-999,-999,-999,-999,-999,-999,-999,-999,-999,-999,-999,-999
,2005-09-17T21:30:55Z,WQN009,-16.86,145.84,62.8,-999,-999,-999,-999,-999,-999,-999,-999,-999,-999,-999,-999
,2005-09-17T21:30:57Z,WQN009,-16.86,145.84,63,-999,-999,-999,-999,-999,-999,-999,-999,-999,-999,-999,-999
,2005-09-17T21:30:57Z,WQN009,-16.86,145.84,63.2,-999,-999,-999,-999,-999,-999,-999,-999,-999,-999,-999,-999
,2005-09-17T21:30:57Z,WQN009,-16.86,145.84,63.4,-999,-999,-999,-999,-999,-999,-999,-999,-999,-999,-999,-999
,2005-09-17T21:30:57Z,WQN009,-16.86,145.84,63.6,-999,-999,-999,-999,-999,-999,-999,-999,-999,-999,-999,-999
,2005-09-17T21:30:59Z,WQN009,-16.86,145.84,63.8,-999,-999,-999,-999,-999,-999,-999,-999,-999,-999,-999,-999
,2005-09-17T21:30:59Z,WQN009,-16.86,145.84,64,-999,-999,-999,-999,-999,-999,-999,-999,-999,-999,-999,-999
,2005-09-17T21:30:59Z,WQN009,-16.86,145.84,64.2,-999,-999,-999,-999,-999,-999,-999,-999,-999,-999,-999,-999
,2005-09-17T21:31:01Z,WQN009,-16.86,145.84,64.4,-999,-999,-999,-999,-999,-999,-999,-999,-999,-999,-999,-999
,2005-09-17T21:31:01Z,WQN009,-16.86,145.84,64.6,-999,-999,-999,-999,-999,-999,-999,-999,-999,-999,-999,-999
,2005-09-17T21:31:01Z,WQN009,-16.86,145.84,64.8,-999,-999,-999,-999,-999,-999,-999,-999,-999,-999,-999,-999
,2005-09-17T21:31:03Z,WQN009,-16.86,145.84,65,-999,-999,-999,-999,-999,-999,-999,-999,-999,-999,-999,-999
,2005-09-17T21:31:03Z,WQN009,-16.86,145.84,65.2,-999,-999,-999,-999,-999,-999,-999,-999,-999,-999,-999,-999
,2005-09-17T21:31:03Z,WQN009,-16.86,145.84,65.4,-999,-999,-999,-999,-999,-999,-999,-999,-999,-999,-999,-999
,2005-09-17T21:31:05Z,WQN009,-16.86,145.84,65.6,-999,-999,-999,-999,-999,-999,-999,-999,-999,-999,-999,-999
,2005-09-17T21:31:05Z,WQN009,-16.86,145.84,65.8,-999,-999,-999,-999,-999,-999,-999,-999,-999,-999,-999,-999
,2005-09-17T21:31:05Z,WQN009,-16.86,145.84,66,-999,-999,-999,-999,-999,-999,-999,-999,-999,-999,-999,-999
,2005-09-17T21:31:05Z,WQN009,-16.86,145.84,66.2,-999,-999,-999,-999,-999,-999,-999,-999,-999,-999,-999,-999
,2005-09-17T21:31:07Z,WQN009,-16.86,145.84,66.4,-999,-999,-999,-999,-999,-999,-999,-999,-999,-999,-999,-999
,2005-09-17T21:31:07Z,WQN009,-16.86,145.84,66.6,-999,-999,-999,-999,-999,-999,-999,-999,-999,-999,-999,-999
,2005-09-17T21:31:07Z,WQN009,-16.86,145.84,66.8,-999,-999,-999,-999,-999,-999,-999,-999,-999,-999,-999,-999
,2005-09-17T21:31:09Z,WQN009,-16.86,145.84,67,-999,-999,-999,-999,-999,-999,-999,-999,-999,-999,-999,-999
,2005-09-17T21:31:09Z,WQN009,-16.86,145.84,67.2,-999,-999,-999,-999,-999,-999,-999,-999,-999,-999,-999,-999
,2005-09-17T21:31:09Z,WQN009,-16.86,145.84,67.4,-999,-999,-999,-999,-999,-999,-999,-999,-999,-999,-999,-999
,2005-09-17T21:31:11Z,WQN009,-16.86,145.84,67.6,-999,-999,-999,-999,-999,-999,-999,-999,-999,-999,-999,-999
,2005-09-17T21:31:11Z,WQN009,-16.86,145.84,67.8,-999,-999,-999,-999,-999,-999,-999,-999,-999,-999,-999,-999
,2005-09-17T21:31:11Z,WQN009,-16.86,145.84,68,-999,-999,-999,-999,-999,-999,-999,-999,-999,-999,-999,-999
,2005-09-17T21:31:11Z,WQN009,-16.86,145.84,68.2,-999,-999,-999,-999,-999,-999,-999,-999,-999,-999,-999,-999
,2005-09-17T21:31:15Z,WQN009,-16.86,145.84,68.4,-999,-999,-999,-999,-999,-999,-999,-999,-999,-999,-999,-999
,2005-09-17T21:31:15Z,WQN009,-16.86,145.84,68.6,-999,-999,-999,-999,-999,-999,-999,-999,-999,-999,-999,-999
,2005-09-17T21:31:15Z,WQN009,-16.86,145.84,68.8,-999,-999,-999,-999,-999,-999,-999,-999,-999,-999,-999,-999
,2005-09-17T21:31:17Z,WQN009,-16.86,145.84,69,-999,-999,-999,-999,-999,-999,-999,-999,-999,-999,-999,-999
,2005-09-17T21:31:17Z,WQN009,-16.86,145.84,69.2,-999,-999,-999,-999,-999,-999,-999,-999,-999,-999,-999,-999
,2005-09-17T21:31:17Z,WQN009,-16.86,145.84,69.4,-999,-999,-999,-999,-999,-999,-999,-999,-999,-999,-999,-999
,2005-09-17T21:31:20Z,WQN009,-16.86,145.84,69.6,-999,-999,-999,-999,-999,-999,-999,-999,-999,-999,-999,-999
,2005-09-17T21:31:20Z,WQN009,-16.86,145.84,69.8,-999,-999,-999,-999,-999,-999,-999,-999,-999,-999,-999,-999
,2005-09-17T21:31:20Z,WQN009,-16.86,145.84,70,-999,-999,-999,-999,-999,-999,-999,-999,-999,-999,-999,-999
,2005-09-17T21:31:20Z,WQN009,-16.86,145.84,70.2,-999,-999,-999,-999,-999,-999,-999,-999,-999,-999,-999,-999
,2005-09-17T21:31:23Z,WQN009,-16.86,145.84,70.4,-999,-999,-999,-999,-999,-999,-999,-999,-999,-999,-999,-999
,2005-09-17T21:31:23Z,WQN009,-16.86,145.84,70.6,-999,-999,-999,-999,-999,-999,-999,-999,-999,-999,-999,-999
,2005-09-17T21:31:23Z,WQN009,-16.86,145.84,70.8,-999,-999,-999,-999,-999,-999,-999,-999,-999,-999,-999,-999
,2005-09-17T21:31:25Z,WQN009,-16.86,145.84,71,-999,-999,-999,-999,-999,-999,-999,-999,-999,-999,-999,-999
,2005-09-17T21:31:25Z,WQN009,-16.86,145.84,71.2,-999,-999,-999,-999,-999,-999,-999,-999,-999,-999,-999,-999
,2005-09-17T21:31:25Z,WQN009,-16.86,145.84,71.4,-999,-999,-999,-999,-999,-999,-999,-999,-999,-999,-999,-999
,2005-09-17T21:31:26Z,WQN009,-16.86,145.84,71.6,-999,-999,-999,-999,-999,-999,-999,-999,-999,-999,-999,-999
,2005-09-17T21:31:26Z,WQN009,-16.86,145.84,71.8,-999,-999,-999,-999,-999,-999,-999,-999,-999,-999,-999,-999
,2005-09-17T21:31:26Z,WQN009,-16.86,145.84,72,-999,-999,-999,-999,-999,-999,-999,-999,-999,-999,-999,-999
,2005-09-17T21:31:29Z,WQN009,-16.86,145.84,72.2,-999,-999,-999,-999,-999,-999,-999,-999,-999,-999,-999,-999
,2005-09-17T21:31:29Z,WQN009,-16.86,145.84,72.4,-999,-999,-999,-999,-999,-999,-999,-999,-999,-999,-999,-999
,2005-09-17T21:31:29Z,WQN009,-16.86,145.84,72.6,-999,-999,-999,-999,-999,-999,-999,-999,-999,-999,-999,-999
,2005-09-17T21:31:29Z,WQN009,-16.86,145.84,72.8,-999,-999,-999,-999,-999,-999,-999,-999,-999,-999,-999,-999
,2005-09-17T21:31:33Z,WQN009,-16.86,145.84,73,-999,-999,-999,-999,-999,-999,-999,-999,-999,-999,-999,-999
,2005-09-17T21:31:33Z,WQN009,-16.86,145.84,73.2,-999,-999,-999,-999,-999,-999,-999,-999,-999,-999,-999,-999
,2005-09-17T21:31:33Z,WQN009,-16.86,145.84,73.4,-999,-999,-999,-999,-999,-999,-999,-999,-999,-999,-999,-999
,2005-09-17T21:31:35Z,WQN009,-16.86,145.84,73.6,-999,-999,-999,-999,-999,-999,-999,-999,-999,-999,-999,-999
,2005-09-17T21:31:35Z,WQN009,-16.86,145.84,73.8,-999,-999,-999,-999,-999,-999,-999,-999,-999,-999,-999,-999
,2005-09-17T21:31:35Z,WQN009,-16.86,145.84,74,-999,-999,-999,-999,-999,-999,-999,-999,-999,-999,-999,-999
,2005-09-17T21:31:39Z,WQN009,-16.86,145.84,74.2,-999,-999,-999,-999,-999,-999,-999,-999,-999,-999,-999,-999
,2005-09-17T21:31:39Z,WQN009,-16.86,145.84,74.4,-999,-999,-999,-999,-999,-999,-999,-999,-999,-999,-999,-999
,2005-09-17T21:31:39Z,WQN009,-16.86,145.84,74.6,-999,-999,-999,-999,-999,-999,-999,-999,-999,-999,-999,-999
,2005-09-17T21:31:39Z,WQN009,-16.86,145.84,74.8,-999,-999,-999,-999,-999,-999,-999,-999,-999,-999,-999,-999
,2005-09-17T21:31:41Z,WQN009,-16.86,145.84,75,-999,-999,-999,-999,-999,-999,-999,-999,-999,-999,-999,-999
,2005-09-17T21:31:41Z,WQN009,-16.86,145.84,75.2,-999,-999,-999,-999,-999,-999,-999,-999,-999,-999,-999,-999
,2005-09-17T21:31:41Z,WQN009,-16.86,145.84,75.4,-999,-999,-999,-999,-999,-999,-999,-999,-999,-999,-999,-999
,2005-09-17T21:31:45Z,WQN009,-16.86,145.84,75.6,-999,-999,-999,-999,-999,-999,-999,-999,-999,-999,-999,-999
,2005-09-17T21:31:45Z,WQN009,-16.86,145.84,75.8,-999,-999,-999,-999,-999,-999,-999,-999,-999,-999,-999,-999
,2005-09-17T21:31:45Z,WQN009,-16.86,145.84,76,-999,-999,-999,-999,-999,-999,-999,-999,-999,-999,-999,-999
,2005-09-17T21:31:47Z,WQN009,-16.86,145.84,76.2,-999,-999,-999,-999,-999,-999,-999,-999,-999,-999,-999,-999
,2005-09-17T21:31:47Z,WQN009,-16.86,145.84,76.4,-999,-999,-999,-999,-999,-999,-999,-999,-999,-999,-999,-999
,2005-09-17T21:31:47Z,WQN009,-16.86,145.84,76.6,-999,-999,-999,-999,-999,-999,-999,-999,-999,-999,-999,-999
,2005-09-17T21:31:51Z,WQN009,-16.86,145.84,76.8,-999,-999,-999,-999,-999,-999,-999,-999,-999,-999,-999,-999
,2005-09-17T21:31:51Z,WQN009,-16.86,145.84,77,-999,-999,-999,-999,-999,-999,-999,-999,-999,-999,-999,-999
,2005-09-17T21:31:51Z,WQN009,-16.86,145.84,77.2,-999,-999,-999,-999,-999,-999,-999,-999,-999,-999,-999,-999
,2005-09-17T21:31:51Z,WQN009,-16.86,145.84,77.4,-999,-999,-999,-999,-999,-999,-999,-999,-999,-999,-999,-999
,2005-09-17T21:31:53Z,WQN009,-16.86,145.84,77.6,-999,-999,-999,-999,-999,-999,-999,-999,-999,-999,-999,-999
,2005-09-17T21:31:53Z,WQN009,-16.86,145.84,77.8,-999,-999,-999,-999,-999,-999,-999,-999,-999,-999,-999,-999
,2005-09-17T21:31:53Z,WQN009,-16.86,145.84,78,-999,-999,-999,-999,-999,-999,-999,-999,-999,-999,-999,-999
,2005-09-17T21:31:57Z,WQN009,-16.86,145.84,78.2,-999,-999,-999,-999,-999,-999,-999,-999,-999,-999,-999,-999
,2005-09-17T21:31:57Z,WQN009,-16.86,145.84,78.4,-999,-999,-999,-999,-999,-999,-999,-999,-999,-999,-999,-999
,2005-09-17T21:31:57Z,WQN009,-16.86,145.84,78.6,-999,-999,-999,-999,-999,-999,-999,-999,-999,-999,-999,-999
,2005-09-17T21:31:59Z,WQN009,-16.86,145.84,78.8,-999,-999,-999,-999,-999,-999,-999,-999,-999,-999,-999,-999
,2005-09-17T21:31:59Z,WQN009,-16.86,145.84,79,-999,-999,-999,-999,-999,-999,-999,-999,-999,-999,-999,-999
,2005-09-17T21:31:59Z,WQN009,-16.86,145.84,79.2,-999,-999,-999,-999,-999,-999,-999,-999,-999,-999,-999,-999
,2005-09-17T21:31:59Z,WQN009,-16.86,145.84,79.4,-999,-999,-999,-999,-999,-999,-999,-999,-999,-999,-999,-999
,2005-09-17T21:32:03Z,WQN009,-16.86,145.84,79.6,-999,-999,-999,-999,-999,-999,-999,-999,-999,-999,-999,-999
,2005-09-17T21:32:03Z,WQN009,-16.86,145.84,79.8,-999,-999,-999,-999,-999,-999,-999,-999,-999,-999,-999,-999
,2005-09-17T21:32:03Z,WQN009,-16.86,145.84,80,-999,-999,-999,-999,-999,-999,-999,-999,-999,-999,-999,-999
,2005-09-17T21:32:05Z,WQN009,-16.86,145.84,80.2,-999,-999,-999,-999,-999,-999,-999,-999,-999,-999,-999,-999
,2005-09-17T21:32:05Z,WQN009,-16.86,145.84,80.4,-999,-999,-999,-999,-999,-999,-999,-999,-999,-999,-999,-999
,2005-09-17T21:32:05Z,WQN009,-16.86,145.84,80.6,-999,-999,-999,-999,-999,-999,-999,-999,-999,-999,-999,-999
,2005-09-17T21:32:09Z,WQN009,-16.86,145.84,80.8,-999,-999,-999,-999,-999,-999,-999,-999,-999,-999,-999,-999
,2005-09-17T21:32:09Z,WQN009,-16.86,145.84,81,-999,-999,-999,-999,-999,-999,-999,-999,-999,-999,-999,-999
,2005-09-17T21:32:09Z,WQN009,-16.86,145.84,81.2,-999,-999,-999,-999,-999,-999,-999,-999,-999,-999,-999,-999
,2005-09-17T21:32:09Z,WQN009,-16.86,145.84,81.4,-999,-999,-999,-999,-999,-999,-999,-999,-999,-999,-999,-999
,2005-09-17T21:32:10Z,WQN009,-16.86,145.84,81.6,-999,-999,-999,-999,-999,-999,-999,-999,-999,-999,-999,-999
,2005-09-17T21:32:10Z,WQN009,-16.86,145.84,81.8,-999,-999,-999,-999,-999,-999,-999,-999,-999,-999,-999,-999
,2005-09-17T21:32:10Z,WQN009,-16.86,145.84,82,-999,-999,-999,-999,-999,-999,-999,-999,-999,-999,-999,-999
,2005-09-17T21:32:13Z,WQN009,-16.86,145.84,82.2,-999,-999,-999,-999,-999,-999,-999,-999,-999,-999,-999,-999
,2005-09-17T21:32:13Z,WQN009,-16.86,145.84,82.4,-999,-999,-999,-999,-999,-999,-999,-999,-999,-999,-999,-999
,2005-09-17T21:32:13Z,WQN009,-16.86,145.84,82.6,-999,-999,-999,-999,-999,-999,-999,-999,-999,-999,-999,-999
,2005-09-17T21:32:15Z,WQN009,-16.86,145.84,82.8,-999,-999,-999,-999,-999,-999,-999,-999,-999,-999,-999,-999
,2005-09-17T21:32:15Z,WQN009,-16.86,145.84,83,-999,-999,-999,-999,-999,-999,-999,-999,-999,-999,-999,-999
,2005-09-17T21:32:15Z,WQN009,-16.86,145.84,83.2,-999,-999,-999,-999,-999,-999,-999,-999,-999,-999,-999,-999
,2005-09-17T21:32:17Z,WQN009,-16.86,145.84,83.4,-999,-999,-999,-999,-999,-999,-999,-999,-999,-999,-999,-999
,2005-09-17T21:32:17Z,WQN009,-16.86,145.84,83.6,-999,-999,-999,-999,-999,-999,-999,-999,-999,-999,-999,-999
,2005-09-17T21:32:17Z,WQN009,-16.86,145.84,83.8,-999,-999,-999,-999,-999,-999,-999,-999,-999,-999,-999,-999
,2005-09-17T21:32:17Z,WQN009,-16.86,145.84,84,-999,-999,-999,-999,-999,-999,-999,-999,-999,-999,-999,-999
,2005-09-17T21:32:18Z,WQN009,-16.86,145.84,84.2,-999,-999,-999,-999,-999,-999,-999,-999,-999,-999,-999,-999
,2005-09-17T21:32:18Z,WQN009,-16.86,145.84,84.4,-999,-999,-999,-999,-999,-999,-999,-999,-999,-999,-999,-999
,2005-09-17T21:32:18Z,WQN009,-16.86,145.84,84.6,-999,-999,-999,-999,-999,-999,-999,-999,-999,-999,-999,-999
,2005-09-17T21:32:21Z,WQN009,-16.86,145.84,84.8,-999,-999,-999,-999,-999,-999,-999,-999,-999,-999,-999,-999
,2005-09-17T21:32:21Z,WQN009,-16.86,145.84,85,-999,-999,-999,-999,-999,-999,-999,-999,-999,-999,-999,-999
,2005-09-17T21:32:21Z,WQN009,-16.86,145.84,85.2,-999,-999,-999,-999,-999,-999,-999,-999,-999,-999,-999,-999
,2005-09-17T21:32:23Z,WQN009,-16.86,145.84,85.4,-999,-999,-999,-999,-999,-999,-999,-999,-999,-999,-999,-999
,2005-09-17T21:32:23Z,WQN009,-16.86,145.84,85.6,-999,-999,-999,-999,-999,-999,-999,-999,-999,-999,-999,-999
,2005-09-17T21:32:23Z,WQN009,-16.86,145.84,85.8,-999,-999,-999,-999,-999,-999,-999,-999,-999,-999,-999,-999
,2005-09-17T21:32:23Z,WQN009,-16.86,145.84,86,-999,-999,-999,-999,-999,-999,-999,-999,-999,-999,-999,-999
,2005-09-17T21:32:27Z,WQN009,-16.86,145.84,86.2,-999,-999,-999,-999,-999,-999,-999,-999,-999,-999,-999,-999
,2005-09-17T21:32:27Z,WQN009,-16.86,145.84,86.4,-999,-999,-999,-999,-999,-999,-999,-999,-999,-999,-999,-999
,2005-09-17T21:32:27Z,WQN009,-16.86,145.84,86.6,-999,-999,-999,-999,-999,-999,-999,-999,-999,-999,-999,-999
,2005-09-17T21:32:29Z,WQN009,-16.86,145.84,86.8,-999,-999,-999,-999,-999,-999,-999,-999,-999,-999,-999,-999
,2005-09-17T21:32:29Z,WQN009,-16.86,145.84,87,-999,-999,-999,-999,-999,-999,-999,-999,-999,-999,-999,-999
,2005-09-17T21:32:29Z,WQN009,-16.86,145.84,87.2,-999,-999,-999,-999,-999,-999,-999,-999,-999,-999,-999,-999
,2005-09-17T21:32:33Z,WQN009,-16.86,145.84,87.4,-999,-999,-999,-999,-999,-999,-999,-999,-999,-999,-999,-999
,2005-09-17T21:32:33Z,WQN009,-16.86,145.84,87.6,-999,-999,-999,-999,-999,-999,-999,-999,-999,-999,-999,-999
,2005-09-17T21:32:33Z,WQN009,-16.86,145.84,87.8,-999,-999,-999,-999,-999,-999,-999,-999,-999,-999,-999,-999
,2005-09-17T21:32:33Z,WQN009,-16.86,145.84,88,-999,-999,-999,-999,-999,-999,-999,-999,-999,-999,-999,-999
,2005-09-17T21:32:35Z,WQN009,-16.86,145.84,88.2,-999,-999,-999,-999,-999,-999,-999,-999,-999,-999,-999,-999
,2005-09-17T21:32:35Z,WQN009,-16.86,145.84,88.4,-999,-999,-999,-999,-999,-999,-999,-999,-999,-999,-999,-999
,2005-09-17T21:32:35Z,WQN009,-16.86,145.84,88.6,-999,-999,-999,-999,-999,-999,-999,-999,-999,-999,-999,-999
,2005-09-17T21:32:37Z,WQN009,-16.86,145.84,88.8,-999,-999,-999,-999,-999,-999,-999,-999,-999,-999,-999,-999
,2005-09-17T21:32:37Z,WQN009,-16.86,145.84,89,-999,-999,-999,-999,-999,-999,-999,-999,-999,-999,-999,-999
,2005-09-17T21:32:37Z,WQN009,-16.86,145.84,89.2,-999,-999,-999,-999,-999,-999,-999,-999,-999,-999,-999,-999
,2005-09-17T21:32:38Z,WQN009,-16.86,145.84,89.4,-999,-999,-999,-999,-999,-999,-999,-999,-999,-999,-999,-999
,2005-09-17T21:32:38Z,WQN009,-16.86,145.84,89.6,-999,-999,-999,-999,-999,-999,-999,-999,-999,-999,-999,-999
,2005-09-17T21:32:38Z,WQN009,-16.86,145.84,89.8,-999,-999,-999,-999,-999,-999,-999,-999,-999,-999,-999,-999
,2005-09-17T21:32:40Z,WQN009,-16.86,145.84,90,-999,-999,-999,-999,-999,-999,-999,-999,-999,-999,-999,-999
,2005-09-17T21:32:40Z,WQN009,-16.86,145.84,90.2,-999,-999,-999,-999,-999,-999,-999,-999,-999,-999,-999,-999
,2005-09-17T21:32:40Z,WQN009,-16.86,145.84,90.4,-999,-999,-999,-999,-999,-999,-999,-999,-999,-999,-999,-999
,2005-09-17T21:32:40Z,WQN009,-16.86,145.84,90.6,-999,-999,-999,-999,-999,-999,-999,-999,-999,-999,-999,-999
,2005-09-17T21:32:42Z,WQN009,-16.86,145.84,90.8,-999,-999,-999,-999,-999,-999,-999,-999,-999,-999,-999,-999
,2005-09-17T21:32:42Z,WQN009,-16.86,145.84,91,-999,-999,-999,-999,-999,-999,-999,-999,-999,-999,-999,-999
,2005-09-17T21:32:42Z,WQN009,-16.86,145.84,91.2,-999,-999,-999,-999,-999,-999,-999,-999,-999,-999,-999,-999
,2005-09-17T21:32:45Z,WQN009,-16.86,145.84,91.4,-999,-999,-999,-999,-999,-999,-999,-999,-999,-999,-999,-999
,2005-09-17T21:32:45Z,WQN009,-16.86,145.84,91.6,-999,-999,-999,-999,-999,-999,-999,-999,-999,-999,-999,-999
,2005-09-17T21:32:45Z,WQN009,-16.86,145.84,91.8,-999,-999,-999,-999,-999,-999,-999,-999,-999,-999,-999,-999
,2005-09-17T21:35:13Z,WQN009,-16.86,145.84,92,-999,-999,-999,-999,-999,-999,-999,-999,-999,-999,-999,-999
,2005-09-17T21:35:13Z,WQN009,-16.86,145.84,92.2,-999,-999,-999,-999,-999,-999,-999,-999,-999,-999,-999,-999
,2005-09-17T21:35:13Z,WQN009,-16.86,145.84,92.4,-999,-999,-999,-999,-999,-999,-999,-999,-999,-999,-999,-999
,2005-09-17T21:35:13Z,WQN009,-16.86,145.84,92.6,-999,-999,-999,-999,-999,-999,-999,-999,-999,-999,-999,-999
,2005-09-17T21:35:15Z,WQN009,-16.86,145.84,92.8,-999,-999,-999,-999,-999,-999,-999,-999,-999,-999,-999,-999
,2005-09-17T21:35:15Z,WQN009,-16.86,145.84,93,-999,-999,-999,-999,-999,-999,-999,-999,-999,-999,-999,-999
,2005-09-17T21:35:15Z,WQN009,-16.86,145.84,93.2,-999,-999,-999,-999,-999,-999,-999,-999,-999,-999,-999,-999
,2005-09-17T21:35:16Z,WQN009,-16.86,145.84,93.4,-999,-999,-999,-999,-999,-999,-999,-999,-999,-999,-999,-999
,2005-09-17T21:35:16Z,WQN009,-16.86,145.84,93.6,-999,-999,-999,-999,-999,-999,-999,-999,-999,-999,-999,-999
,2005-09-17T21:35:16Z,WQN009,-16.86,145.84,93.8,-999,-999,-999,-999,-999,-999,-999,-999,-999,-999,-999,-999
,2005-09-17T21:35:19Z,WQN009,-16.86,145.84,94,-999,-999,-999,-999,-999,-999,-999,-999,-999,-999,-999,-999
,2005-09-17T21:35:19Z,WQN009,-16.86,145.84,94.2,-999,-999,-999,-999,-999,-999,-999,-999,-999,-999,-999,-999
,2005-09-17T21:35:19Z,WQN009,-16.86,145.84,94.4,-999,-999,-999,-999,-999,-999,-999,-999,-999,-999,-999,-999
,2005-09-17T21:35:20Z,WQN009,-16.86,145.84,94.6,-999,-999,-999,-999,-999,-999,-999,-999,-999,-999,-999,-999
,2005-09-17T21:35:20Z,WQN009,-16.86,145.84,94.8,-999,-999,-999,-999,-999,-999,-999,-999,-999,-999,-999,-999
,2005-09-17T21:35:20Z,WQN009,-16.86,145.84,95,-999,-999,-999,-999,-999,-999,-999,-999,-999,-999,-999,-999
,2005-09-17T21:35:20Z,WQN009,-16.86,145.84,95.2,-999,-999,-999,-999,-999,-999,-999,-999,-999,-999,-999,-999
,2005-09-17T21:35:23Z,WQN009,-16.86,145.84,95.4,-999,-999,-999,-999,-999,-999,-999,-999,-999,-999,-999,-999
,2005-09-17T21:35:23Z,WQN009,-16.86,145.84,95.6,-999,-999,-999,-999,-999,-999,-999,-999,-999,-999,-999,-999
,2005-09-17T21:35:23Z,WQN009,-16.86,145.84,95.8,-999,-999,-999,-999,-999,-999,-999,-999,-999,-999,-999,-999
,2005-09-17T21:35:24Z,WQN009,-16.86,145.84,96,-999,-999,-999,-999,-999,-999,-999,-999,-999,-999,-999,-999
,2005-09-17T21:35:24Z,WQN009,-16.86,145.84,96.2,-999,-999,-999,-999,-999,-999,-999,-999,-999,-999,-999,-999
,2005-09-17T21:35:24Z,WQN009,-16.86,145.84,96.4,-999,-999,-999,-999,-999,-999,-999,-999,-999,-999,-999,-999
,2005-09-17T21:35:27Z,WQN009,-16.86,145.84,96.6,-999,-999,-999,-999,-999,-999,-999,-999,-999,-999,-999,-999
,2005-09-17T21:35:27Z,WQN009,-16.86,145.84,96.8,-999,-999,-999,-999,-999,-999,-999,-999,-999,-999,-999,-999
,2005-09-17T21:35:27Z,WQN009,-16.86,145.84,97,-999,-999,-999,-999,-999,-999,-999,-999,-999,-999,-999,-999
,2005-09-17T21:35:27Z,WQN009,-16.86,145.84,97.2,-999,-999,-999,-999,-999,-999,-999,-999,-999,-999,-999,-999
,2005-09-17T21:35:29Z,WQN009,-16.86,145.84,97.4,-999,-999,-999,-999,-999,-999,-999,-999,-999,-999,-999,-999
,2005-09-17T21:35:29Z,WQN009,-16.86,145.84,97.6,-999,-999,-999,-999,-999,-999,-999,-999,-999,-999,-999,-999
,2005-09-17T21:35:29Z,WQN009,-16.86,145.84,97.8,-999,-999,-999,-999,-999,-999,-999,-999,-999,-999,-999,-999
,2005-09-17T21:35:31Z,WQN009,-16.86,145.84,98,-999,-999,-999,-999,-999,-999,-999,-999,-999,-999,-999,-999
,2005-09-17T21:35:31Z,WQN009,-16.86,145.84,98.2,-999,-999,-999,-999,-999,-999,-999,-999,-999,-999,-999,-999
,2005-09-17T21:35:31Z,WQN009,-16.86,145.84,98.4,-999,-999,-999,-999,-999,-999,-999,-999,-999,-999,-999,-999
,2005-09-17T21:35:32Z,WQN009,-16.86,145.84,98.6,-999,-999,-999,-999,-999,-999,-999,-999,-999,-999,-999,-999
,2005-09-17T21:35:32Z,WQN009,-16.86,145.84,98.8,-999,-999,-999,-999,-999,-999,-999,-999,-999,-999,-999,-999
,2005-09-17T21:35:32Z,WQN009,-16.86,145.84,99,-999,-999,-999,-999,-999,-999,-999,-999,-999,-999,-999,-999
,2005-09-17T21:35:32Z,WQN009,-16.86,145.84,99.2,-999,-999,-999,-999,-999,-999,-999,-999,-999,-999,-999,-999
,2005-09-17T21:35:35Z,WQN009,-16.86,145.84,99.4,-999,-999,-999,-999,-999,-999,-999,-999,-999,-999,-999,-999
,2005-09-17T21:35:35Z,WQN009,-16.86,145.84,99.6,-999,-999,-999,-999,-999,-999,-999,-999,-999,-999,-999,-999
,2005-09-17T21:35:35Z,WQN009,-16.86,145.84,99.8,-999,-999,-999,-999,-999,-999,-999,-999,-999,-999,-999,-999
,2005-09-17T21:35:37Z,WQN009,-16.86,145.84,100,-999,-999,-999,-999,-999,-999,-999,-999,-999,-999,-999,-999
