GLOBAL ATTRIBUTES,,,,,,,,,,,,,,,,,
title,,,,,,,,,,,,,,,,,
project,Integrated Marine Observing System (IMOS),,,,,,,,,,,,,,,,
original_project_name,MERIS validation,,,,,,,,,,,,,,,,
institution,CSIRO Land and Water,,,,,,,,,,,,,,,,
abstract,This record contains in situ water optical property data collected in the Fitzroy (Great Barrier Reef| Australia) on the vessel MV Rum Rambler between 04-12 Sept 2003. A total of 52 stations were sampled during the field campaign FK03. The data can be used for Ocean Colour sensor validation| optical water quality monitoring and modelling. CLW deployed the optical instruments RAMSES (hyperspectral scalar irradiance)| AC-9 (absorption| attenuation)| HS-6 (backscattering) during this cruise. This data pool was part of the dataset described in Oubelkheir et al. 2006| VOL 111| C07021| doi:10.1029/2005JC003113 and Blondeau-Patissier et al. 2009| JGR| VOL. 114| C05003| doi:10.1029/2008JC005039. Funding for this study was provided by CSIRO Earth Observation Centre| CSIRO Land and Water| CSIRO Marine Research and the Cooperative Research Centre for Coastal Zone| Estuary and Waterway Management (Fitzroy Agricultural Contaminants project). We also thank the captains and crews of the MV Rum Rambler.,,,,,,,,,,,,,,,,
conventions,IMOS biological data format (v1.0),,,,,,,,,,,,,,,,
date_created,2003-09-06T02:52:20Z,,,,,,,,,,,,,,,,
date_modified,2006-02-06T02:06:01Z,,,,,,,,,,,,,,,,
history,Data has been quality controlled by in-house procedures. HS-6 data were corrected for temperature using CTD data and the Sigma correction method| recommended by the manufacturer| was applied using absorption and attenuation data from the AC-9. The Sigma correction is an adjustment to improve the accuracy of backscattering measurements| in particular in highly-attenuating water. The correction is detailed in HOBI-labs Inc.| 2003. The backscattering coefficient bb is estimated using the method described in Maffione and Dana| 1997| Applied Optics| 36(24)| pp.6057-6067.,,,,,,,,,,,,,,,,
comment,The HydroScat-6 (HS-6) is a self-contained instrument for measuring optical backscattering at six different wavelengths in natural waters. The particulate backscattering coefficient| bbp (lambda)| is a measure of light scattering by particles at angles between 90 and 180 degrees. bbp was estimated by subtracting bbw (lambda)| the backscattering coefficient of pure sea-water| from bb (lambda). The pure seawater backscattering coefficient was calculated using a backscattering ratio of 0.5 (Gordon et al.| 1988| Journal of Geophysical Research) and the seawater scattering coefficients| bw(lambda)| of Morel (1974| Optical properties of pure water and pure seawater| p. 1-24| in Optical Aspects of Oceanography).,,,,,,,,,,,,,,,,
source,Particulate Scattering coefficients determined using an HS-6 (www.hobilabs.com),,,,,,,,,,,,,,,,
keywords,Oceans>Ocean Optics > Scattering ;Oceans>Ocean Optics>Ocean Colour;,,,,,,,,,,,,,,,,
cruise_id,FK03,,,,,,,,,,,,,,,,
vessel_name,Rum Rambler,,,,,,,,,,,,,,,,
platform_code,VL8621,,,,,,,,,,,,,,,,
references,https://marlin.csiro.au/geonetwork/srv/eng/catalog.search#/metadata/bf302407-d407-2744-e044-00144f7bc0f4,,,,,,,,,,,,,,,,
naming_authority,CSIRO Land and Water (CLW),,,,,,,,,,,,,,,,
cdm_data_type,profile,,,,,,,,,,,,,,,,
geospatial_lat_min,-23.4,,,,,,,,,,,,,,,,
geospatial_lat_max,-23.4,,,,,,,,,,,,,,,,
geospatial_lon_min,151.05,,,,,,,,,,,,,,,,
geospatial_lon_max,151.05,,,,,,,,,,,,,,,,
geospatial_vertical_min,9.8,,,,,,,,,,,,,,,,
geospatial_vertical_max,100,,,,,,,,,,,,,,,,
local_time_zone,10,,,,,,,,,,,,,,,,
data_centre,eMarine Information Infrastructure (eMII),,,,,,,,,,,,,,,,
data_centre_email,info@emii.org.au,,,,,,,,,,,,,,,,
author,"Vittorio,Brando ",,,,,,,,,,,,,,,,
author_email,vittorio.brando@csiro.au,,,,,,,,,,,,,,,,
principal_investigator,"Webster, Ian",,,,,,,,,,,,,,,,
principal_investigator_email,Ian.Webster@csiro.au,,,,,,,,,,,,,,,,
publisher,Australian Ocean Data Network,,,,,,,,,,,,,,,,
publisher_email,info@aodn.org.au,,,,,,,,,,,,,,,,
institution,IMOS Satellite Remote Sensing - Ocean Colour Sub-facility - Bio-Optical Database of Australian Waters,,,,,,,,,,,,,,,,
institution_principal_investigator,"Schroeder, Thomas",,,,,,,,,,,,,,,,
institution_principal_investigator_email,Thomas.Schroeder@csiro.au,,,,,,,,,,,,,,,,
citation,To cite this data set in a publication use the format <<IMOS [year-of-data-downloaded] [Title] [data-access-url] accessed [date-of-access]>>,,,,,,,,,,,,,,,,
acknowledgement,Data was sourced from the Commonwealth Scientific and Industrial Research Organisation (CSIRO),IMOS long_name,Units,Fill value,Comments,,,,,,,,,,,,
distribution_statement,"Any users of IMOS data are required to clearly acknowledge the source of the material- Data or products or services from IMOS are provided ""as is"" without any warranty as to fitness for a particular purpose.",Wavelength of measurement,nm,-999,,,,,,,,,,,,,
,,,,,,,,,,,,,,,,,
TABLE ROWS,,,,,,,,,,,,,,,,,
Row name,CF standard_name,IMOS long_name,Units,Fill value,Comments,,,,,,,,,,,,
Wavelength,radiation_wavelength,Wavelength of measurement,nm,-999,,,,,,,,,,,,,
,,,,,,,,,,,,,,,,,
TABLE COLUMNS,,,,,,,,,,,,,,,,,
Column name,CF standard_name,IMOS long_name,Units,Fill value,Comments,,,,,,,,,,,,
Time,time,analysis_time,YYYY-MM-DDThh:mm:ssZ,,UTC date and time,,,,,,,,,,,,
Station_Code,,,,,National Reference Station code (6 letters),,,,,,,,,,,,
Latitude,latitude,latitude,degrees_north,-999,North positive,,,,,,,,,,,,
Longitude,longitude,longitude,degrees_east,-999,East positive,,,,,,,,,,,,
Depth,depth,depth,m ,-999,positive down,,,,,,,,,,,,
bb_corr,,corrected_volume_total_backwards_scattering_coefficient_of_(bbw_+_bbp)_in_sea_water,m-1,-999,bbw:volume_backwards_scattering_coefficient_of_radiative_flux_in_sea_water ; bbp=volume_backwards_scattering_coefficient_of_particules_in_sea_water,,,,,,,,,,,,
bb_uncorr,,volume_total_backwards_scattering_coefficient_of_(bbw_+_bbp)_in_sea_water,m-1,-999,bbw:volume_backwards_scattering_coefficient_of_radiative_flux_in_sea_water ; bbp=volume_backwards_scattering_coefficient_of_particules_in_sea_water,,,,,,,,,,,,
,,,,,,,,,,,,,,,,,
,,,,,,,,,,,,,,,,,
DATA,,,,,,,,,,,,,,,,,
,Time,Station_Code,Latitude,Longitude,Depth,bb_corr,bb_corr,bb_corr,bb_corr,bb_corr,bb_corr,bb_uncorr,bb_uncorr,bb_uncorr,bb_uncorr,bb_uncorr,bb_uncorr
Wavelength,,,,,,442,448,555,589,676,852,442,448,555,589,676,852
,2003-09-06T02:52:20Z,FK10,-23.4,151.05,0,0.030275,0.025608,0.021071,0.018347,0.017796,0.017634,0.026621,0.023052,0.019258,0.017178,0.016595,0.012032
,2003-09-06T02:52:43Z,FK10,-23.4,151.05,0.2,0.030057,0.026201,0.022627,0.020225,0.018534,0.019653,0.026429,0.023586,0.02068,0.018937,0.017284,0.01341
,2003-09-06T02:52:50Z,FK10,-23.4,151.05,0.4,0.032681,0.028573,0.024036,0.022291,0.020496,0.020586,0.028736,0.025721,0.021968,0.020871,0.019113,0.014046
,2003-09-06T02:52:53Z,FK10,-23.4,151.05,0.6,0.033009,0.028573,0.025296,0.022854,0.021037,0.021898,0.029025,0.025721,0.023119,0.021399,0.019618,0.014941
,2003-09-06T02:53:03Z,FK10,-23.4,151.05,0.8,0.030002,0.027387,0.024554,0.021258,0.019322,0.020679,0.026381,0.024653,0.022442,0.019904,0.018018,0.014109
,2003-09-06T02:53:09Z,FK10,-23.4,151.05,1,0.032845,0.028403,0.025815,0.023292,0.022574,0.022209,0.02888,0.025568,0.023593,0.021809,0.021051,0.015153
,2003-09-06T02:53:14Z,FK10,-23.4,151.05,1.2,0.034376,0.030055,0.025889,0.024576,0.022115,0.022604,0.030226,0.027055,0.023661,0.023011,0.020623,0.015423
,2003-09-06T02:53:16Z,FK10,-23.4,151.05,1.4,0.03372,0.031411,0.028853,0.024826,0.022679,0.023713,0.02965,0.028276,0.026371,0.023245,0.021149,0.01618
,2003-09-06T02:53:19Z,FK10,-23.4,151.05,1.6,0.034977,0.030903,0.030039,0.025577,0.024904,0.024596,0.030755,0.027818,0.027455,0.023948,0.023224,0.016782
,2003-09-06T02:53:22Z,FK10,-23.4,151.05,1.8,0.035524,0.03302,0.030262,0.028019,0.024087,0.026067,0.031236,0.029724,0.027658,0.026234,0.022462,0.017786
,2003-09-06T02:53:29Z,FK10,-23.4,151.05,2,0.037219,0.033656,0.031151,0.027268,0.02589,0.026916,0.032726,0.030296,0.028471,0.025531,0.024143,0.018365
,2003-09-06T02:53:31Z,FK10,-23.4,151.05,2.2,0.038586,0.032512,0.030188,0.027017,0.026184,0.028085,0.033928,0.029267,0.02759,0.025297,0.024417,0.019162
,2003-09-06T02:53:34Z,FK10,-23.4,151.05,2.4,0.035748,0.033402,0.030706,0.028739,0.026592,0.027715,0.031433,0.030068,0.028064,0.026909,0.024798,0.01891
,2003-09-06T02:53:37Z,FK10,-23.4,151.05,2.6,0.038708,0.033105,0.032263,0.02877,0.028253,0.028665,0.034035,0.029801,0.029487,0.026938,0.026347,0.019558
,2003-09-06T02:53:42Z,FK10,-23.4,151.05,2.8,0.038676,0.033656,0.028705,0.028927,0.028747,0.028883,0.034008,0.030296,0.026235,0.027084,0.026808,0.019707
,2003-09-06T02:53:41Z,FK10,-23.4,151.05,3,0.039594,0.034884,0.034338,0.029459,0.028864,0.028648,0.034815,0.031402,0.031384,0.027583,0.026917,0.019547
,2003-09-06T02:53:48Z,FK10,-23.4,151.05,3.2,0.038734,0.032936,0.029298,0.028708,0.025554,0.028648,0.034059,0.029648,0.026777,0.026879,0.02383,0.019547
,2003-09-06T02:53:50Z,FK10,-23.4,151.05,3.4,0.040312,0.03302,0.029224,0.028676,0.027363,0.02848,0.035446,0.029724,0.02671,0.02685,0.025517,0.019432
,2003-09-06T02:53:54Z,FK10,-23.4,151.05,3.6,0.039721,0.03679,0.034042,0.029396,0.027577,0.028757,0.034926,0.033118,0.031113,0.027524,0.025716,0.019621
,2003-09-06T02:53:55Z,FK10,-23.4,151.05,3.8,0.040929,0.038061,0.034487,0.03046,0.028625,0.029051,0.035989,0.034262,0.031519,0.028521,0.026694,0.019822
,2003-09-06T02:53:58Z,FK10,-23.4,151.05,4,0.042016,0.036621,0.032485,0.029647,0.028708,0.029732,0.036944,0.032965,0.02969,0.027758,0.026771,0.020287
,2003-09-06T02:54:06Z,FK10,-23.4,151.05,4.2,0.041309,0.035053,0.032411,0.029396,0.029274,0.030573,0.036323,0.031555,0.029622,0.027524,0.027299,0.02086
,2003-09-06T02:54:11Z,FK10,-23.4,151.05,4.4,0.042496,0.037002,0.033152,0.031118,0.028297,0.029732,0.037367,0.033309,0.0303,0.029136,0.026388,0.020287
,2003-09-06T02:54:10Z,FK10,-23.4,151.05,4.6,0.041077,0.036832,0.032041,0.030492,0.02937,0.030438,0.036119,0.033156,0.029284,0.02855,0.027388,0.020768
,2003-09-06T02:54:13Z,FK10,-23.4,151.05,4.8,0.040343,0.037553,0.033597,0.030617,0.028149,0.029917,0.035474,0.033804,0.030706,0.028667,0.02625,0.020413
,2003-09-06T02:54:19Z,FK10,-23.4,151.05,5,0.041441,0.036494,0.033671,0.030648,0.029989,0.031153,0.036439,0.032851,0.030774,0.028696,0.027966,0.021256
,2003-09-06T02:54:21Z,FK10,-23.4,151.05,5.2,0.039921,0.03607,0.033894,0.030867,0.028092,0.030732,0.035102,0.03247,0.030977,0.028902,0.026197,0.020969
,2003-09-06T02:54:23Z,FK10,-23.4,151.05,5.4,0.040212,0.040687,0.037967,0.032245,0.029843,0.032178,0.035358,0.036626,0.0347,0.030191,0.027829,0.021956
,2003-09-06T02:54:30Z,FK10,-23.4,151.05,5.6,0.044259,0.037256,0.034366,0.033027,0.03183,0.03333,0.038916,0.033537,0.031409,0.030924,0.029683,0.022741
,2003-09-06T02:54:33Z,FK10,-23.4,151.05,5.8,0.044517,0.040179,0.035909,0.032558,0.029485,0.03201,0.039144,0.036168,0.032819,0.030484,0.027495,0.021841
,2003-09-06T02:54:36Z,FK10,-23.4,151.05,6,0.042227,0.038611,0.034563,0.032119,0.029215,0.032271,0.03713,0.034757,0.031589,0.030074,0.027244,0.022019
,2003-09-06T02:54:39Z,FK10,-23.4,151.05,6.2,0.041299,0.038739,0.033337,0.032839,0.028847,0.031287,0.036313,0.034872,0.030469,0.030748,0.026901,0.021348
,2003-09-06T02:54:40Z,FK10,-23.4,151.05,6.4,0.043203,0.039628,0.03419,0.031775,0.030449,0.03117,0.037988,0.035673,0.031248,0.029751,0.028395,0.021267
,2003-09-06T02:54:47Z,FK10,-23.4,151.05,6.6,0.041831,0.039543,0.035007,0.032276,0.028303,0.031422,0.036782,0.035596,0.031995,0.03022,0.026393,0.021439
,2003-09-06T02:54:56Z,FK10,-23.4,151.05,6.8,0.050184,0.036917,0.032457,0.031963,0.029528,0.031993,0.044126,0.033232,0.029664,0.029927,0.027535,0.021829
,2003-09-06T02:55:02Z,FK10,-23.4,151.05,7,0.046185,0.039247,0.033802,0.031462,0.031056,0.033044,0.04061,0.035329,0.030894,0.029458,0.028961,0.022546
,2003-09-06T02:55:07Z,FK10,-23.4,151.05,7.2,0.040845,0.037171,0.032295,0.032276,0.029405,0.031531,0.035914,0.033461,0.029516,0.03022,0.027422,0.021514
,2003-09-06T02:55:08Z,FK10,-23.4,151.05,7.4,0.042196,0.03895,0.034176,0.033622,0.030889,0.032288,0.037102,0.035063,0.031235,0.031481,0.028805,0.02203
,2003-09-06T02:55:12Z,FK10,-23.4,151.05,7.6,0.042317,0.038103,0.033528,0.030867,0.03181,0.031447,0.037209,0.0343,0.030643,0.028902,0.029664,0.021457
,2003-09-06T02:55:15Z,FK10,-23.4,151.05,7.8,0.043024,0.041915,0.036839,0.033998,0.032126,0.033918,0.037831,0.037732,0.033669,0.031832,0.029959,0.023143
,2003-09-06T02:55:21Z,FK10,-23.4,151.05,8,0.043103,0.041322,0.034986,0.031994,0.031083,0.034784,0.0379,0.037198,0.031976,0.029957,0.028985,0.023734
,2003-09-06T02:55:25Z,FK10,-23.4,151.05,8.2,0.041483,0.038484,0.035958,0.03165,0.03038,0.03217,0.036476,0.034643,0.032864,0.029634,0.02833,0.02195
,2003-09-06T02:55:27Z,FK10,-23.4,151.05,8.4,0.046332,0.038866,0.033253,0.032526,0.032483,0.032389,0.04074,0.034986,0.030392,0.030455,0.030291,0.022099
,2003-09-06T02:55:35Z,FK10,-23.4,151.05,8.6,0.044396,0.041746,0.038107,0.037785,0.030229,0.036306,0.039037,0.037579,0.034829,0.035379,0.02819,0.024772
,2003-09-06T02:55:36Z,FK10,-23.4,151.05,8.8,0.044428,0.039204,0.034775,0.036439,0.032807,0.036625,0.039065,0.035291,0.031783,0.034118,0.030594,0.02499
,2003-09-06T02:55:42Z,FK10,-23.4,151.05,9,0.044987,0.043864,0.038192,0.035281,0.032666,0.034835,0.039556,0.039485,0.034906,0.033034,0.030462,0.023768
,2003-09-06T02:55:52Z,FK10,-23.4,151.05,9.2,0.04648,0.043398,0.041546,0.035844,0.03201,0.036508,0.040869,0.039066,0.037971,0.033561,0.02985,0.024909
,2003-09-06T02:52:32Z,FK10,-23.4,151.05,9.4,-999,-999,-999,-999,-999,-999,-999,-999,-999,-999,-999,-999
,2003-09-06T02:55:53Z,FK10,-23.4,151.05,9.6,0.044565,0.041449,0.036839,0.035437,0.032448,0.036079,0.039185,0.037312,0.033669,0.03318,0.030259,0.024617
,2003-09-06T02:55:59Z,FK10,-23.4,151.05,9.8,0.043757,0.040856,0.035367,0.035187,0.030229,0.034793,0.038475,0.036778,0.032324,0.032946,0.02819,0.023739
,2003-09-06T02:56:04Z,FK10,-23.4,151.05,10,0.045931,0.040136,0.038298,0.039162,0.031865,0.035709,0.040387,0.03613,0.035002,0.036668,0.029715,0.024365
,2003-09-06T02:56:03Z,FK10,-23.4,151.05,10.2,0.043045,0.043482,0.040933,0.037222,0.032826,0.033902,0.037849,0.039142,0.037411,0.034851,0.030611,0.023131
,2003-09-06T02:56:07Z,FK10,-23.4,151.05,10.4,0.04534,0.041407,0.037107,0.037973,0.03315,0.037062,0.039867,0.037274,0.033914,0.035554,0.030914,0.025288
,2003-09-06T02:56:09Z,FK10,-23.4,151.05,10.6,0.044924,0.044796,0.0402,0.036627,0.032236,0.036844,0.039501,0.040324,0.036741,0.034294,0.030061,0.025139
,2003-09-06T02:56:12Z,FK10,-23.4,151.05,10.8,0.044037,0.042042,0.039432,0.0355,0.032285,0.035936,0.038721,0.037846,0.036039,0.033239,0.030106,0.024519
,2003-09-06T02:56:15Z,FK10,-23.4,151.05,11,0.044211,0.042212,0.039369,0.033403,0.03299,0.041568,0.038874,0.037998,0.035981,0.031275,0.030765,0.028362
,2003-09-06T02:56:20Z,FK10,-23.4,151.05,11.2,0.046232,0.042,0.037361,0.037691,0.031323,0.038559,0.040651,0.037808,0.034146,0.035291,0.029209,0.026309
,2003-09-06T02:56:22Z,FK10,-23.4,151.05,11.4,0.04533,0.040983,0.036571,0.038567,0.032945,0.038416,0.039858,0.036893,0.033425,0.036111,0.030722,0.026211
,2003-09-06T02:56:26Z,FK10,-23.4,151.05,11.6,0.043483,0.040433,0.035268,0.037722,0.0331,0.040416,0.038234,0.036397,0.032233,0.03532,0.030867,0.027576
,2003-09-06T02:52:35Z,FK10,-23.4,151.05,11.8,-999,-999,-999,-999,-999,-999,-999,-999,-999,-999,-999,-999
,2003-09-06T02:56:33Z,FK10,-23.4,151.05,12,0.046311,0.043652,0.03946,0.034968,0.031934,0.035768,0.040721,0.039295,0.036065,0.032741,0.029779,0.024405
,2003-09-06T02:56:32Z,FK10,-23.4,151.05,12.2,0.044902,0.040475,0.038326,0.036126,0.033026,0.035684,0.039482,0.036435,0.035028,0.033825,0.030798,0.024347
,2003-09-06T02:56:34Z,FK10,-23.4,151.05,12.4,0.043905,0.039797,0.036578,0.037159,0.030053,0.035381,0.038605,0.035825,0.033431,0.034792,0.028026,0.024141
,2003-09-06T02:56:37Z,FK10,-23.4,151.05,12.6,0.044897,0.048947,0.04323,0.035844,0.032795,0.048856,0.039478,0.044061,0.03951,0.033561,0.030583,0.033335
,2003-09-06T02:52:37Z,FK10,-23.4,151.05,12.8,-999,-999,-999,-999,-999,-999,-999,-999,-999,-999,-999,-999
,2003-09-06T02:52:37Z,FK10,-23.4,151.05,13,-999,-999,-999,-999,-999,-999,-999,-999,-999,-999,-999,-999
,2003-09-06T02:56:46Z,FK10,-23.4,151.05,13.2,0.044871,0.042508,0.039228,0.037002,0.033198,0.038088,0.039454,0.038265,0.035853,0.034646,0.030958,0.025988
,2003-09-06T02:56:50Z,FK10,-23.4,151.05,13.4,0.044665,0.04361,0.040531,0.036314,0.032476,0.037449,0.039273,0.039257,0.037044,0.034001,0.030285,0.025552
,2003-09-06T02:56:53Z,FK10,-23.4,151.05,13.6,0.045203,0.041322,0.039362,0.036783,0.0325,0.037651,0.039747,0.037198,0.035975,0.034441,0.030308,0.025689
,2003-09-06T02:52:38Z,FK10,-23.4,151.05,13.8,-999,-999,-999,-999,-999,-999,-999,-999,-999,-999,-999,-999
,2003-09-06T02:52:38Z,FK10,-23.4,151.05,14,-999,-999,-999,-999,-999,-999,-999,-999,-999,-999,-999,-999
,2003-09-06T02:52:38Z,FK10,-23.4,151.05,14.2,-999,-999,-999,-999,-999,-999,-999,-999,-999,-999,-999,-999
,2003-09-06T02:52:39Z,FK10,-23.4,151.05,14.4,-999,-999,-999,-999,-999,-999,-999,-999,-999,-999,-999,-999
,2003-09-06T02:52:39Z,FK10,-23.4,151.05,14.6,-999,-999,-999,-999,-999,-999,-999,-999,-999,-999,-999,-999
,2003-09-06T02:52:39Z,FK10,-23.4,151.05,14.8,-999,-999,-999,-999,-999,-999,-999,-999,-999,-999,-999,-999
,2003-09-06T02:52:39Z,FK10,-23.4,151.05,15,-999,-999,-999,-999,-999,-999,-999,-999,-999,-999,-999,-999
,2003-09-06T02:52:40Z,FK10,-23.4,151.05,15.2,-999,-999,-999,-999,-999,-999,-999,-999,-999,-999,-999,-999
,2003-09-06T02:52:40Z,FK10,-23.4,151.05,15.4,-999,-999,-999,-999,-999,-999,-999,-999,-999,-999,-999,-999
,2003-09-06T02:52:40Z,FK10,-23.4,151.05,15.6,-999,-999,-999,-999,-999,-999,-999,-999,-999,-999,-999,-999
,2003-09-06T02:52:40Z,FK10,-23.4,151.05,15.8,-999,-999,-999,-999,-999,-999,-999,-999,-999,-999,-999,-999
,2003-09-06T02:52:41Z,FK10,-23.4,151.05,16,-999,-999,-999,-999,-999,-999,-999,-999,-999,-999,-999,-999
,2003-09-06T02:52:41Z,FK10,-23.4,151.05,16.2,-999,-999,-999,-999,-999,-999,-999,-999,-999,-999,-999,-999
,2003-09-06T02:52:41Z,FK10,-23.4,151.05,16.4,-999,-999,-999,-999,-999,-999,-999,-999,-999,-999,-999,-999
,2003-09-06T02:52:42Z,FK10,-23.4,151.05,16.6,-999,-999,-999,-999,-999,-999,-999,-999,-999,-999,-999,-999
,2003-09-06T02:52:42Z,FK10,-23.4,151.05,16.8,-999,-999,-999,-999,-999,-999,-999,-999,-999,-999,-999,-999
,2003-09-06T02:52:42Z,FK10,-23.4,151.05,17,-999,-999,-999,-999,-999,-999,-999,-999,-999,-999,-999,-999
,2003-09-06T02:52:42Z,FK10,-23.4,151.05,17.2,-999,-999,-999,-999,-999,-999,-999,-999,-999,-999,-999,-999
,2003-09-06T02:52:43Z,FK10,-23.4,151.05,17.4,-999,-999,-999,-999,-999,-999,-999,-999,-999,-999,-999,-999
,2003-09-06T02:52:43Z,FK10,-23.4,151.05,17.6,-999,-999,-999,-999,-999,-999,-999,-999,-999,-999,-999,-999
,2003-09-06T02:52:43Z,FK10,-23.4,151.05,17.8,-999,-999,-999,-999,-999,-999,-999,-999,-999,-999,-999,-999
,2003-09-06T02:52:43Z,FK10,-23.4,151.05,18,-999,-999,-999,-999,-999,-999,-999,-999,-999,-999,-999,-999
,2003-09-06T02:52:44Z,FK10,-23.4,151.05,18.2,-999,-999,-999,-999,-999,-999,-999,-999,-999,-999,-999,-999
,2003-09-06T02:52:44Z,FK10,-23.4,151.05,18.4,-999,-999,-999,-999,-999,-999,-999,-999,-999,-999,-999,-999
,2003-09-06T02:52:44Z,FK10,-23.4,151.05,18.6,-999,-999,-999,-999,-999,-999,-999,-999,-999,-999,-999,-999
,2003-09-06T02:52:44Z,FK10,-23.4,151.05,18.8,-999,-999,-999,-999,-999,-999,-999,-999,-999,-999,-999,-999
,2003-09-06T02:52:45Z,FK10,-23.4,151.05,19,-999,-999,-999,-999,-999,-999,-999,-999,-999,-999,-999,-999
,2003-09-06T02:52:45Z,FK10,-23.4,151.05,19.2,-999,-999,-999,-999,-999,-999,-999,-999,-999,-999,-999,-999
,2003-09-06T02:52:45Z,FK10,-23.4,151.05,19.4,-999,-999,-999,-999,-999,-999,-999,-999,-999,-999,-999,-999
,2003-09-06T02:52:45Z,FK10,-23.4,151.05,19.6,-999,-999,-999,-999,-999,-999,-999,-999,-999,-999,-999,-999
,2003-09-06T02:52:46Z,FK10,-23.4,151.05,19.8,-999,-999,-999,-999,-999,-999,-999,-999,-999,-999,-999,-999
,2003-09-06T02:52:46Z,FK10,-23.4,151.05,20,-999,-999,-999,-999,-999,-999,-999,-999,-999,-999,-999,-999
,2003-09-06T02:52:46Z,FK10,-23.4,151.05,20.2,-999,-999,-999,-999,-999,-999,-999,-999,-999,-999,-999,-999
,2003-09-06T02:52:46Z,FK10,-23.4,151.05,20.4,-999,-999,-999,-999,-999,-999,-999,-999,-999,-999,-999,-999
,2003-09-06T02:52:47Z,FK10,-23.4,151.05,20.6,-999,-999,-999,-999,-999,-999,-999,-999,-999,-999,-999,-999
,2003-09-06T02:52:47Z,FK10,-23.4,151.05,20.8,-999,-999,-999,-999,-999,-999,-999,-999,-999,-999,-999,-999
,2003-09-06T02:52:47Z,FK10,-23.4,151.05,21,-999,-999,-999,-999,-999,-999,-999,-999,-999,-999,-999,-999
,2003-09-06T02:52:48Z,FK10,-23.4,151.05,21.2,-999,-999,-999,-999,-999,-999,-999,-999,-999,-999,-999,-999
,2003-09-06T02:52:48Z,FK10,-23.4,151.05,21.4,-999,-999,-999,-999,-999,-999,-999,-999,-999,-999,-999,-999
,2003-09-06T02:52:48Z,FK10,-23.4,151.05,21.6,-999,-999,-999,-999,-999,-999,-999,-999,-999,-999,-999,-999
,2003-09-06T02:52:48Z,FK10,-23.4,151.05,21.8,-999,-999,-999,-999,-999,-999,-999,-999,-999,-999,-999,-999
,2003-09-06T02:52:49Z,FK10,-23.4,151.05,22,-999,-999,-999,-999,-999,-999,-999,-999,-999,-999,-999,-999
,2003-09-06T02:52:49Z,FK10,-23.4,151.05,22.2,-999,-999,-999,-999,-999,-999,-999,-999,-999,-999,-999,-999
,2003-09-06T02:52:49Z,FK10,-23.4,151.05,22.4,-999,-999,-999,-999,-999,-999,-999,-999,-999,-999,-999,-999
,2003-09-06T02:52:49Z,FK10,-23.4,151.05,22.6,-999,-999,-999,-999,-999,-999,-999,-999,-999,-999,-999,-999
,2003-09-06T02:52:50Z,FK10,-23.4,151.05,22.8,-999,-999,-999,-999,-999,-999,-999,-999,-999,-999,-999,-999
,2003-09-06T02:52:50Z,FK10,-23.4,151.05,23,-999,-999,-999,-999,-999,-999,-999,-999,-999,-999,-999,-999
,2003-09-06T02:52:50Z,FK10,-23.4,151.05,23.2,-999,-999,-999,-999,-999,-999,-999,-999,-999,-999,-999,-999
,2003-09-06T02:52:50Z,FK10,-23.4,151.05,23.4,-999,-999,-999,-999,-999,-999,-999,-999,-999,-999,-999,-999
,2003-09-06T02:52:51Z,FK10,-23.4,151.05,23.6,-999,-999,-999,-999,-999,-999,-999,-999,-999,-999,-999,-999
,2003-09-06T02:52:51Z,FK10,-23.4,151.05,23.8,-999,-999,-999,-999,-999,-999,-999,-999,-999,-999,-999,-999
,2003-09-06T02:52:51Z,FK10,-23.4,151.05,24,-999,-999,-999,-999,-999,-999,-999,-999,-999,-999,-999,-999
,2003-09-06T02:52:51Z,FK10,-23.4,151.05,24.2,-999,-999,-999,-999,-999,-999,-999,-999,-999,-999,-999,-999
,2003-09-06T02:52:52Z,FK10,-23.4,151.05,24.4,-999,-999,-999,-999,-999,-999,-999,-999,-999,-999,-999,-999
,2003-09-06T02:52:52Z,FK10,-23.4,151.05,24.6,-999,-999,-999,-999,-999,-999,-999,-999,-999,-999,-999,-999
,2003-09-06T02:52:52Z,FK10,-23.4,151.05,24.8,-999,-999,-999,-999,-999,-999,-999,-999,-999,-999,-999,-999
,2003-09-06T02:52:52Z,FK10,-23.4,151.05,25,-999,-999,-999,-999,-999,-999,-999,-999,-999,-999,-999,-999
,2003-09-06T02:52:53Z,FK10,-23.4,151.05,25.2,-999,-999,-999,-999,-999,-999,-999,-999,-999,-999,-999,-999
,2003-09-06T02:52:53Z,FK10,-23.4,151.05,25.4,-999,-999,-999,-999,-999,-999,-999,-999,-999,-999,-999,-999
,2003-09-06T02:52:53Z,FK10,-23.4,151.05,25.6,-999,-999,-999,-999,-999,-999,-999,-999,-999,-999,-999,-999
,2003-09-06T02:52:53Z,FK10,-23.4,151.05,25.8,-999,-999,-999,-999,-999,-999,-999,-999,-999,-999,-999,-999
,2003-09-06T02:52:54Z,FK10,-23.4,151.05,26,-999,-999,-999,-999,-999,-999,-999,-999,-999,-999,-999,-999
,2003-09-06T02:52:54Z,FK10,-23.4,151.05,26.2,-999,-999,-999,-999,-999,-999,-999,-999,-999,-999,-999,-999
,2003-09-06T02:52:54Z,FK10,-23.4,151.05,26.4,-999,-999,-999,-999,-999,-999,-999,-999,-999,-999,-999,-999
,2003-09-06T02:52:55Z,FK10,-23.4,151.05,26.6,-999,-999,-999,-999,-999,-999,-999,-999,-999,-999,-999,-999
,2003-09-06T02:52:55Z,FK10,-23.4,151.05,26.8,-999,-999,-999,-999,-999,-999,-999,-999,-999,-999,-999,-999
,2003-09-06T02:52:55Z,FK10,-23.4,151.05,27,-999,-999,-999,-999,-999,-999,-999,-999,-999,-999,-999,-999
,2003-09-06T02:52:55Z,FK10,-23.4,151.05,27.2,-999,-999,-999,-999,-999,-999,-999,-999,-999,-999,-999,-999
,2003-09-06T02:52:56Z,FK10,-23.4,151.05,27.4,-999,-999,-999,-999,-999,-999,-999,-999,-999,-999,-999,-999
,2003-09-06T02:52:56Z,FK10,-23.4,151.05,27.6,-999,-999,-999,-999,-999,-999,-999,-999,-999,-999,-999,-999
,2003-09-06T02:52:56Z,FK10,-23.4,151.05,27.8,-999,-999,-999,-999,-999,-999,-999,-999,-999,-999,-999,-999
,2003-09-06T02:52:56Z,FK10,-23.4,151.05,28,-999,-999,-999,-999,-999,-999,-999,-999,-999,-999,-999,-999
,2003-09-06T02:52:57Z,FK10,-23.4,151.05,28.2,-999,-999,-999,-999,-999,-999,-999,-999,-999,-999,-999,-999
,2003-09-06T02:52:57Z,FK10,-23.4,151.05,28.4,-999,-999,-999,-999,-999,-999,-999,-999,-999,-999,-999,-999
,2003-09-06T02:52:57Z,FK10,-23.4,151.05,28.6,-999,-999,-999,-999,-999,-999,-999,-999,-999,-999,-999,-999
,2003-09-06T02:52:57Z,FK10,-23.4,151.05,28.8,-999,-999,-999,-999,-999,-999,-999,-999,-999,-999,-999,-999
,2003-09-06T02:52:58Z,FK10,-23.4,151.05,29,-999,-999,-999,-999,-999,-999,-999,-999,-999,-999,-999,-999
,2003-09-06T02:52:58Z,FK10,-23.4,151.05,29.2,-999,-999,-999,-999,-999,-999,-999,-999,-999,-999,-999,-999
,2003-09-06T02:52:58Z,FK10,-23.4,151.05,29.4,-999,-999,-999,-999,-999,-999,-999,-999,-999,-999,-999,-999
,2003-09-06T02:52:58Z,FK10,-23.4,151.05,29.6,-999,-999,-999,-999,-999,-999,-999,-999,-999,-999,-999,-999
,2003-09-06T02:52:59Z,FK10,-23.4,151.05,29.8,-999,-999,-999,-999,-999,-999,-999,-999,-999,-999,-999,-999
,2003-09-06T02:52:59Z,FK10,-23.4,151.05,30,-999,-999,-999,-999,-999,-999,-999,-999,-999,-999,-999,-999
,2003-09-06T02:52:59Z,FK10,-23.4,151.05,30.2,-999,-999,-999,-999,-999,-999,-999,-999,-999,-999,-999,-999
,2003-09-06T02:52:59Z,FK10,-23.4,151.05,30.4,-999,-999,-999,-999,-999,-999,-999,-999,-999,-999,-999,-999
,2003-09-06T02:53:00Z,FK10,-23.4,151.05,30.6,-999,-999,-999,-999,-999,-999,-999,-999,-999,-999,-999,-999
,2003-09-06T02:53:00Z,FK10,-23.4,151.05,30.8,-999,-999,-999,-999,-999,-999,-999,-999,-999,-999,-999,-999
,2003-09-06T02:53:00Z,FK10,-23.4,151.05,31,-999,-999,-999,-999,-999,-999,-999,-999,-999,-999,-999,-999
,2003-09-06T02:53:00Z,FK10,-23.4,151.05,31.2,-999,-999,-999,-999,-999,-999,-999,-999,-999,-999,-999,-999
,2003-09-06T02:53:01Z,FK10,-23.4,151.05,31.4,-999,-999,-999,-999,-999,-999,-999,-999,-999,-999,-999,-999
,2003-09-06T02:53:01Z,FK10,-23.4,151.05,31.6,-999,-999,-999,-999,-999,-999,-999,-999,-999,-999,-999,-999
,2003-09-06T02:53:01Z,FK10,-23.4,151.05,31.8,-999,-999,-999,-999,-999,-999,-999,-999,-999,-999,-999,-999
,2003-09-06T02:53:02Z,FK10,-23.4,151.05,32,-999,-999,-999,-999,-999,-999,-999,-999,-999,-999,-999,-999
,2003-09-06T02:53:02Z,FK10,-23.4,151.05,32.2,-999,-999,-999,-999,-999,-999,-999,-999,-999,-999,-999,-999
,2003-09-06T02:53:02Z,FK10,-23.4,151.05,32.4,-999,-999,-999,-999,-999,-999,-999,-999,-999,-999,-999,-999
,2003-09-06T02:53:02Z,FK10,-23.4,151.05,32.6,-999,-999,-999,-999,-999,-999,-999,-999,-999,-999,-999,-999
,2003-09-06T02:53:03Z,FK10,-23.4,151.05,32.8,-999,-999,-999,-999,-999,-999,-999,-999,-999,-999,-999,-999
,2003-09-06T02:53:03Z,FK10,-23.4,151.05,33,-999,-999,-999,-999,-999,-999,-999,-999,-999,-999,-999,-999
,2003-09-06T02:53:03Z,FK10,-23.4,151.05,33.2,-999,-999,-999,-999,-999,-999,-999,-999,-999,-999,-999,-999
,2003-09-06T02:53:03Z,FK10,-23.4,151.05,33.4,-999,-999,-999,-999,-999,-999,-999,-999,-999,-999,-999,-999
,2003-09-06T02:53:04Z,FK10,-23.4,151.05,33.6,-999,-999,-999,-999,-999,-999,-999,-999,-999,-999,-999,-999
,2003-09-06T02:53:04Z,FK10,-23.4,151.05,33.8,-999,-999,-999,-999,-999,-999,-999,-999,-999,-999,-999,-999
,2003-09-06T02:53:04Z,FK10,-23.4,151.05,34,-999,-999,-999,-999,-999,-999,-999,-999,-999,-999,-999,-999
,2003-09-06T02:53:04Z,FK10,-23.4,151.05,34.2,-999,-999,-999,-999,-999,-999,-999,-999,-999,-999,-999,-999
,2003-09-06T02:53:05Z,FK10,-23.4,151.05,34.4,-999,-999,-999,-999,-999,-999,-999,-999,-999,-999,-999,-999
,2003-09-06T02:53:05Z,FK10,-23.4,151.05,34.6,-999,-999,-999,-999,-999,-999,-999,-999,-999,-999,-999,-999
,2003-09-06T02:53:05Z,FK10,-23.4,151.05,34.8,-999,-999,-999,-999,-999,-999,-999,-999,-999,-999,-999,-999
,2003-09-06T02:53:05Z,FK10,-23.4,151.05,35,-999,-999,-999,-999,-999,-999,-999,-999,-999,-999,-999,-999
,2003-09-06T02:53:06Z,FK10,-23.4,151.05,35.2,-999,-999,-999,-999,-999,-999,-999,-999,-999,-999,-999,-999
,2003-09-06T02:53:06Z,FK10,-23.4,151.05,35.4,-999,-999,-999,-999,-999,-999,-999,-999,-999,-999,-999,-999
,2003-09-06T02:53:06Z,FK10,-23.4,151.05,35.6,-999,-999,-999,-999,-999,-999,-999,-999,-999,-999,-999,-999
,2003-09-06T02:53:06Z,FK10,-23.4,151.05,35.8,-999,-999,-999,-999,-999,-999,-999,-999,-999,-999,-999,-999
,2003-09-06T02:53:07Z,FK10,-23.4,151.05,36,-999,-999,-999,-999,-999,-999,-999,-999,-999,-999,-999,-999
,2003-09-06T02:53:07Z,FK10,-23.4,151.05,36.2,-999,-999,-999,-999,-999,-999,-999,-999,-999,-999,-999,-999
,2003-09-06T02:53:07Z,FK10,-23.4,151.05,36.4,-999,-999,-999,-999,-999,-999,-999,-999,-999,-999,-999,-999
,2003-09-06T02:53:07Z,FK10,-23.4,151.05,36.6,-999,-999,-999,-999,-999,-999,-999,-999,-999,-999,-999,-999
,2003-09-06T02:53:08Z,FK10,-23.4,151.05,36.8,-999,-999,-999,-999,-999,-999,-999,-999,-999,-999,-999,-999
,2003-09-06T02:53:08Z,FK10,-23.4,151.05,37,-999,-999,-999,-999,-999,-999,-999,-999,-999,-999,-999,-999
,2003-09-06T02:53:08Z,FK10,-23.4,151.05,37.2,-999,-999,-999,-999,-999,-999,-999,-999,-999,-999,-999,-999
,2003-09-06T02:53:09Z,FK10,-23.4,151.05,37.4,-999,-999,-999,-999,-999,-999,-999,-999,-999,-999,-999,-999
,2003-09-06T02:53:09Z,FK10,-23.4,151.05,37.6,-999,-999,-999,-999,-999,-999,-999,-999,-999,-999,-999,-999
,2003-09-06T02:53:09Z,FK10,-23.4,151.05,37.8,-999,-999,-999,-999,-999,-999,-999,-999,-999,-999,-999,-999
,2003-09-06T02:53:09Z,FK10,-23.4,151.05,38,-999,-999,-999,-999,-999,-999,-999,-999,-999,-999,-999,-999
,2003-09-06T02:53:10Z,FK10,-23.4,151.05,38.2,-999,-999,-999,-999,-999,-999,-999,-999,-999,-999,-999,-999
,2003-09-06T02:53:10Z,FK10,-23.4,151.05,38.4,-999,-999,-999,-999,-999,-999,-999,-999,-999,-999,-999,-999
,2003-09-06T02:53:10Z,FK10,-23.4,151.05,38.6,-999,-999,-999,-999,-999,-999,-999,-999,-999,-999,-999,-999
,2003-09-06T02:53:10Z,FK10,-23.4,151.05,38.8,-999,-999,-999,-999,-999,-999,-999,-999,-999,-999,-999,-999
,2003-09-06T02:53:11Z,FK10,-23.4,151.05,39,-999,-999,-999,-999,-999,-999,-999,-999,-999,-999,-999,-999
,2003-09-06T02:53:11Z,FK10,-23.4,151.05,39.2,-999,-999,-999,-999,-999,-999,-999,-999,-999,-999,-999,-999
,2003-09-06T02:53:11Z,FK10,-23.4,151.05,39.4,-999,-999,-999,-999,-999,-999,-999,-999,-999,-999,-999,-999
,2003-09-06T02:53:11Z,FK10,-23.4,151.05,39.6,-999,-999,-999,-999,-999,-999,-999,-999,-999,-999,-999,-999
,2003-09-06T02:53:12Z,FK10,-23.4,151.05,39.8,-999,-999,-999,-999,-999,-999,-999,-999,-999,-999,-999,-999
,2003-09-06T02:53:12Z,FK10,-23.4,151.05,40,-999,-999,-999,-999,-999,-999,-999,-999,-999,-999,-999,-999
,2003-09-06T02:53:12Z,FK10,-23.4,151.05,40.2,-999,-999,-999,-999,-999,-999,-999,-999,-999,-999,-999,-999
,2003-09-06T02:53:12Z,FK10,-23.4,151.05,40.4,-999,-999,-999,-999,-999,-999,-999,-999,-999,-999,-999,-999
,2003-09-06T02:53:13Z,FK10,-23.4,151.05,40.6,-999,-999,-999,-999,-999,-999,-999,-999,-999,-999,-999,-999
,2003-09-06T02:53:13Z,FK10,-23.4,151.05,40.8,-999,-999,-999,-999,-999,-999,-999,-999,-999,-999,-999,-999
,2003-09-06T02:53:13Z,FK10,-23.4,151.05,41,-999,-999,-999,-999,-999,-999,-999,-999,-999,-999,-999,-999
,2003-09-06T02:53:13Z,FK10,-23.4,151.05,41.2,-999,-999,-999,-999,-999,-999,-999,-999,-999,-999,-999,-999
,2003-09-06T02:53:14Z,FK10,-23.4,151.05,41.4,-999,-999,-999,-999,-999,-999,-999,-999,-999,-999,-999,-999
,2003-09-06T02:53:14Z,FK10,-23.4,151.05,41.6,-999,-999,-999,-999,-999,-999,-999,-999,-999,-999,-999,-999
,2003-09-06T02:53:14Z,FK10,-23.4,151.05,41.8,-999,-999,-999,-999,-999,-999,-999,-999,-999,-999,-999,-999
,2003-09-06T02:53:14Z,FK10,-23.4,151.05,42,-999,-999,-999,-999,-999,-999,-999,-999,-999,-999,-999,-999
,2003-09-06T02:53:15Z,FK10,-23.4,151.05,42.2,-999,-999,-999,-999,-999,-999,-999,-999,-999,-999,-999,-999
,2003-09-06T02:53:15Z,FK10,-23.4,151.05,42.4,-999,-999,-999,-999,-999,-999,-999,-999,-999,-999,-999,-999
,2003-09-06T02:53:15Z,FK10,-23.4,151.05,42.6,-999,-999,-999,-999,-999,-999,-999,-999,-999,-999,-999,-999
,2003-09-06T02:53:16Z,FK10,-23.4,151.05,42.8,-999,-999,-999,-999,-999,-999,-999,-999,-999,-999,-999,-999
,2003-09-06T02:53:16Z,FK10,-23.4,151.05,43,-999,-999,-999,-999,-999,-999,-999,-999,-999,-999,-999,-999
,2003-09-06T02:53:16Z,FK10,-23.4,151.05,43.2,-999,-999,-999,-999,-999,-999,-999,-999,-999,-999,-999,-999
,2003-09-06T02:53:16Z,FK10,-23.4,151.05,43.4,-999,-999,-999,-999,-999,-999,-999,-999,-999,-999,-999,-999
,2003-09-06T02:53:17Z,FK10,-23.4,151.05,43.6,-999,-999,-999,-999,-999,-999,-999,-999,-999,-999,-999,-999
,2003-09-06T02:53:17Z,FK10,-23.4,151.05,43.8,-999,-999,-999,-999,-999,-999,-999,-999,-999,-999,-999,-999
,2003-09-06T02:53:17Z,FK10,-23.4,151.05,44,-999,-999,-999,-999,-999,-999,-999,-999,-999,-999,-999,-999
,2003-09-06T02:53:17Z,FK10,-23.4,151.05,44.2,-999,-999,-999,-999,-999,-999,-999,-999,-999,-999,-999,-999
,2003-09-06T02:53:18Z,FK10,-23.4,151.05,44.4,-999,-999,-999,-999,-999,-999,-999,-999,-999,-999,-999,-999
,2003-09-06T02:53:18Z,FK10,-23.4,151.05,44.6,-999,-999,-999,-999,-999,-999,-999,-999,-999,-999,-999,-999
,2003-09-06T02:53:18Z,FK10,-23.4,151.05,44.8,-999,-999,-999,-999,-999,-999,-999,-999,-999,-999,-999,-999
,2003-09-06T02:53:18Z,FK10,-23.4,151.05,45,-999,-999,-999,-999,-999,-999,-999,-999,-999,-999,-999,-999
,2003-09-06T02:53:19Z,FK10,-23.4,151.05,45.2,-999,-999,-999,-999,-999,-999,-999,-999,-999,-999,-999,-999
,2003-09-06T02:53:19Z,FK10,-23.4,151.05,45.4,-999,-999,-999,-999,-999,-999,-999,-999,-999,-999,-999,-999
,2003-09-06T02:53:19Z,FK10,-23.4,151.05,45.6,-999,-999,-999,-999,-999,-999,-999,-999,-999,-999,-999,-999
,2003-09-06T02:53:19Z,FK10,-23.4,151.05,45.8,-999,-999,-999,-999,-999,-999,-999,-999,-999,-999,-999,-999
,2003-09-06T02:53:20Z,FK10,-23.4,151.05,46,-999,-999,-999,-999,-999,-999,-999,-999,-999,-999,-999,-999
,2003-09-06T02:53:20Z,FK10,-23.4,151.05,46.2,-999,-999,-999,-999,-999,-999,-999,-999,-999,-999,-999,-999
,2003-09-06T02:53:20Z,FK10,-23.4,151.05,46.4,-999,-999,-999,-999,-999,-999,-999,-999,-999,-999,-999,-999
,2003-09-06T02:53:20Z,FK10,-23.4,151.05,46.6,-999,-999,-999,-999,-999,-999,-999,-999,-999,-999,-999,-999
,2003-09-06T02:53:21Z,FK10,-23.4,151.05,46.8,-999,-999,-999,-999,-999,-999,-999,-999,-999,-999,-999,-999
,2003-09-06T02:53:21Z,FK10,-23.4,151.05,47,-999,-999,-999,-999,-999,-999,-999,-999,-999,-999,-999,-999
,2003-09-06T02:53:21Z,FK10,-23.4,151.05,47.2,-999,-999,-999,-999,-999,-999,-999,-999,-999,-999,-999,-999
,2003-09-06T02:53:21Z,FK10,-23.4,151.05,47.4,-999,-999,-999,-999,-999,-999,-999,-999,-999,-999,-999,-999
,2003-09-06T02:53:22Z,FK10,-23.4,151.05,47.6,-999,-999,-999,-999,-999,-999,-999,-999,-999,-999,-999,-999
,2003-09-06T02:53:22Z,FK10,-23.4,151.05,47.8,-999,-999,-999,-999,-999,-999,-999,-999,-999,-999,-999,-999
,2003-09-06T02:53:22Z,FK10,-23.4,151.05,48,-999,-999,-999,-999,-999,-999,-999,-999,-999,-999,-999,-999
,2003-09-06T02:53:23Z,FK10,-23.4,151.05,48.2,-999,-999,-999,-999,-999,-999,-999,-999,-999,-999,-999,-999
,2003-09-06T02:53:23Z,FK10,-23.4,151.05,48.4,-999,-999,-999,-999,-999,-999,-999,-999,-999,-999,-999,-999
,2003-09-06T02:53:23Z,FK10,-23.4,151.05,48.6,-999,-999,-999,-999,-999,-999,-999,-999,-999,-999,-999,-999
,2003-09-06T02:53:23Z,FK10,-23.4,151.05,48.8,-999,-999,-999,-999,-999,-999,-999,-999,-999,-999,-999,-999
,2003-09-06T02:53:24Z,FK10,-23.4,151.05,49,-999,-999,-999,-999,-999,-999,-999,-999,-999,-999,-999,-999
,2003-09-06T02:53:24Z,FK10,-23.4,151.05,49.2,-999,-999,-999,-999,-999,-999,-999,-999,-999,-999,-999,-999
,2003-09-06T02:53:24Z,FK10,-23.4,151.05,49.4,-999,-999,-999,-999,-999,-999,-999,-999,-999,-999,-999,-999
,2003-09-06T02:53:24Z,FK10,-23.4,151.05,49.6,-999,-999,-999,-999,-999,-999,-999,-999,-999,-999,-999,-999
,2003-09-06T02:53:25Z,FK10,-23.4,151.05,49.8,-999,-999,-999,-999,-999,-999,-999,-999,-999,-999,-999,-999
,2003-09-06T02:53:25Z,FK10,-23.4,151.05,50,-999,-999,-999,-999,-999,-999,-999,-999,-999,-999,-999,-999
,2003-09-06T02:53:25Z,FK10,-23.4,151.05,50.2,-999,-999,-999,-999,-999,-999,-999,-999,-999,-999,-999,-999
,2003-09-06T02:53:25Z,FK10,-23.4,151.05,50.4,-999,-999,-999,-999,-999,-999,-999,-999,-999,-999,-999,-999
,2003-09-06T02:53:26Z,FK10,-23.4,151.05,50.6,-999,-999,-999,-999,-999,-999,-999,-999,-999,-999,-999,-999
,2003-09-06T02:53:26Z,FK10,-23.4,151.05,50.8,-999,-999,-999,-999,-999,-999,-999,-999,-999,-999,-999,-999
,2003-09-06T02:53:26Z,FK10,-23.4,151.05,51,-999,-999,-999,-999,-999,-999,-999,-999,-999,-999,-999,-999
,2003-09-06T02:53:26Z,FK10,-23.4,151.05,51.2,-999,-999,-999,-999,-999,-999,-999,-999,-999,-999,-999,-999
,2003-09-06T02:53:27Z,FK10,-23.4,151.05,51.4,-999,-999,-999,-999,-999,-999,-999,-999,-999,-999,-999,-999
,2003-09-06T02:53:27Z,FK10,-23.4,151.05,51.6,-999,-999,-999,-999,-999,-999,-999,-999,-999,-999,-999,-999
,2003-09-06T02:53:27Z,FK10,-23.4,151.05,51.8,-999,-999,-999,-999,-999,-999,-999,-999,-999,-999,-999,-999
,2003-09-06T02:53:27Z,FK10,-23.4,151.05,52,-999,-999,-999,-999,-999,-999,-999,-999,-999,-999,-999,-999
,2003-09-06T02:53:28Z,FK10,-23.4,151.05,52.2,-999,-999,-999,-999,-999,-999,-999,-999,-999,-999,-999,-999
,2003-09-06T02:53:28Z,FK10,-23.4,151.05,52.4,-999,-999,-999,-999,-999,-999,-999,-999,-999,-999,-999,-999
,2003-09-06T02:53:28Z,FK10,-23.4,151.05,52.6,-999,-999,-999,-999,-999,-999,-999,-999,-999,-999,-999,-999
,2003-09-06T02:53:29Z,FK10,-23.4,151.05,52.8,-999,-999,-999,-999,-999,-999,-999,-999,-999,-999,-999,-999
,2003-09-06T02:53:29Z,FK10,-23.4,151.05,53,-999,-999,-999,-999,-999,-999,-999,-999,-999,-999,-999,-999
,2003-09-06T02:53:29Z,FK10,-23.4,151.05,53.2,-999,-999,-999,-999,-999,-999,-999,-999,-999,-999,-999,-999
,2003-09-06T02:53:29Z,FK10,-23.4,151.05,53.4,-999,-999,-999,-999,-999,-999,-999,-999,-999,-999,-999,-999
,2003-09-06T02:53:30Z,FK10,-23.4,151.05,53.6,-999,-999,-999,-999,-999,-999,-999,-999,-999,-999,-999,-999
,2003-09-06T02:53:30Z,FK10,-23.4,151.05,53.8,-999,-999,-999,-999,-999,-999,-999,-999,-999,-999,-999,-999
,2003-09-06T02:53:30Z,FK10,-23.4,151.05,54,-999,-999,-999,-999,-999,-999,-999,-999,-999,-999,-999,-999
,2003-09-06T02:53:30Z,FK10,-23.4,151.05,54.2,-999,-999,-999,-999,-999,-999,-999,-999,-999,-999,-999,-999
,2003-09-06T02:53:31Z,FK10,-23.4,151.05,54.4,-999,-999,-999,-999,-999,-999,-999,-999,-999,-999,-999,-999
,2003-09-06T02:53:31Z,FK10,-23.4,151.05,54.6,-999,-999,-999,-999,-999,-999,-999,-999,-999,-999,-999,-999
,2003-09-06T02:53:31Z,FK10,-23.4,151.05,54.8,-999,-999,-999,-999,-999,-999,-999,-999,-999,-999,-999,-999
,2003-09-06T02:53:31Z,FK10,-23.4,151.05,55,-999,-999,-999,-999,-999,-999,-999,-999,-999,-999,-999,-999
,2003-09-06T02:53:32Z,FK10,-23.4,151.05,55.2,-999,-999,-999,-999,-999,-999,-999,-999,-999,-999,-999,-999
,2003-09-06T02:53:32Z,FK10,-23.4,151.05,55.4,-999,-999,-999,-999,-999,-999,-999,-999,-999,-999,-999,-999
,2003-09-06T02:53:32Z,FK10,-23.4,151.05,55.6,-999,-999,-999,-999,-999,-999,-999,-999,-999,-999,-999,-999
,2003-09-06T02:53:32Z,FK10,-23.4,151.05,55.8,-999,-999,-999,-999,-999,-999,-999,-999,-999,-999,-999,-999
,2003-09-06T02:53:33Z,FK10,-23.4,151.05,56,-999,-999,-999,-999,-999,-999,-999,-999,-999,-999,-999,-999
,2003-09-06T02:53:33Z,FK10,-23.4,151.05,56.2,-999,-999,-999,-999,-999,-999,-999,-999,-999,-999,-999,-999
,2003-09-06T02:53:33Z,FK10,-23.4,151.05,56.4,-999,-999,-999,-999,-999,-999,-999,-999,-999,-999,-999,-999
,2003-09-06T02:53:33Z,FK10,-23.4,151.05,56.6,-999,-999,-999,-999,-999,-999,-999,-999,-999,-999,-999,-999
,2003-09-06T02:53:34Z,FK10,-23.4,151.05,56.8,-999,-999,-999,-999,-999,-999,-999,-999,-999,-999,-999,-999
,2003-09-06T02:53:34Z,FK10,-23.4,151.05,57,-999,-999,-999,-999,-999,-999,-999,-999,-999,-999,-999,-999
,2003-09-06T02:53:34Z,FK10,-23.4,151.05,57.2,-999,-999,-999,-999,-999,-999,-999,-999,-999,-999,-999,-999
,2003-09-06T02:53:34Z,FK10,-23.4,151.05,57.4,-999,-999,-999,-999,-999,-999,-999,-999,-999,-999,-999,-999
,2003-09-06T02:53:35Z,FK10,-23.4,151.05,57.6,-999,-999,-999,-999,-999,-999,-999,-999,-999,-999,-999,-999
,2003-09-06T02:53:35Z,FK10,-23.4,151.05,57.8,-999,-999,-999,-999,-999,-999,-999,-999,-999,-999,-999,-999
,2003-09-06T02:53:35Z,FK10,-23.4,151.05,58,-999,-999,-999,-999,-999,-999,-999,-999,-999,-999,-999,-999
,2003-09-06T02:53:36Z,FK10,-23.4,151.05,58.2,-999,-999,-999,-999,-999,-999,-999,-999,-999,-999,-999,-999
,2003-09-06T02:53:36Z,FK10,-23.4,151.05,58.4,-999,-999,-999,-999,-999,-999,-999,-999,-999,-999,-999,-999
,2003-09-06T02:53:36Z,FK10,-23.4,151.05,58.6,-999,-999,-999,-999,-999,-999,-999,-999,-999,-999,-999,-999
,2003-09-06T02:53:36Z,FK10,-23.4,151.05,58.8,-999,-999,-999,-999,-999,-999,-999,-999,-999,-999,-999,-999
,2003-09-06T02:53:37Z,FK10,-23.4,151.05,59,-999,-999,-999,-999,-999,-999,-999,-999,-999,-999,-999,-999
,2003-09-06T02:53:37Z,FK10,-23.4,151.05,59.2,-999,-999,-999,-999,-999,-999,-999,-999,-999,-999,-999,-999
,2003-09-06T02:53:37Z,FK10,-23.4,151.05,59.4,-999,-999,-999,-999,-999,-999,-999,-999,-999,-999,-999,-999
,2003-09-06T02:53:37Z,FK10,-23.4,151.05,59.6,-999,-999,-999,-999,-999,-999,-999,-999,-999,-999,-999,-999
,2003-09-06T02:53:38Z,FK10,-23.4,151.05,59.8,-999,-999,-999,-999,-999,-999,-999,-999,-999,-999,-999,-999
,2003-09-06T02:53:38Z,FK10,-23.4,151.05,60,-999,-999,-999,-999,-999,-999,-999,-999,-999,-999,-999,-999
,2003-09-06T02:53:38Z,FK10,-23.4,151.05,60.2,-999,-999,-999,-999,-999,-999,-999,-999,-999,-999,-999,-999
,2003-09-06T02:53:38Z,FK10,-23.4,151.05,60.4,-999,-999,-999,-999,-999,-999,-999,-999,-999,-999,-999,-999
,2003-09-06T02:53:39Z,FK10,-23.4,151.05,60.6,-999,-999,-999,-999,-999,-999,-999,-999,-999,-999,-999,-999
,2003-09-06T02:53:39Z,FK10,-23.4,151.05,60.8,-999,-999,-999,-999,-999,-999,-999,-999,-999,-999,-999,-999
,2003-09-06T02:53:39Z,FK10,-23.4,151.05,61,-999,-999,-999,-999,-999,-999,-999,-999,-999,-999,-999,-999
,2003-09-06T02:53:39Z,FK10,-23.4,151.05,61.2,-999,-999,-999,-999,-999,-999,-999,-999,-999,-999,-999,-999
,2003-09-06T02:53:40Z,FK10,-23.4,151.05,61.4,-999,-999,-999,-999,-999,-999,-999,-999,-999,-999,-999,-999
,2003-09-06T02:53:40Z,FK10,-23.4,151.05,61.6,-999,-999,-999,-999,-999,-999,-999,-999,-999,-999,-999,-999
,2003-09-06T02:53:40Z,FK10,-23.4,151.05,61.8,-999,-999,-999,-999,-999,-999,-999,-999,-999,-999,-999,-999
,2003-09-06T02:53:40Z,FK10,-23.4,151.05,62,-999,-999,-999,-999,-999,-999,-999,-999,-999,-999,-999,-999
,2003-09-06T02:53:41Z,FK10,-23.4,151.05,62.2,-999,-999,-999,-999,-999,-999,-999,-999,-999,-999,-999,-999
,2003-09-06T02:53:41Z,FK10,-23.4,151.05,62.4,-999,-999,-999,-999,-999,-999,-999,-999,-999,-999,-999,-999
,2003-09-06T02:53:41Z,FK10,-23.4,151.05,62.6,-999,-999,-999,-999,-999,-999,-999,-999,-999,-999,-999,-999
,2003-09-06T02:53:41Z,FK10,-23.4,151.05,62.8,-999,-999,-999,-999,-999,-999,-999,-999,-999,-999,-999,-999
,2003-09-06T02:53:42Z,FK10,-23.4,151.05,63,-999,-999,-999,-999,-999,-999,-999,-999,-999,-999,-999,-999
,2003-09-06T02:53:42Z,FK10,-23.4,151.05,63.2,-999,-999,-999,-999,-999,-999,-999,-999,-999,-999,-999,-999
,2003-09-06T02:53:42Z,FK10,-23.4,151.05,63.4,-999,-999,-999,-999,-999,-999,-999,-999,-999,-999,-999,-999
,2003-09-06T02:53:43Z,FK10,-23.4,151.05,63.6,-999,-999,-999,-999,-999,-999,-999,-999,-999,-999,-999,-999
,2003-09-06T02:53:43Z,FK10,-23.4,151.05,63.8,-999,-999,-999,-999,-999,-999,-999,-999,-999,-999,-999,-999
,2003-09-06T02:53:43Z,FK10,-23.4,151.05,64,-999,-999,-999,-999,-999,-999,-999,-999,-999,-999,-999,-999
,2003-09-06T02:53:43Z,FK10,-23.4,151.05,64.2,-999,-999,-999,-999,-999,-999,-999,-999,-999,-999,-999,-999
,2003-09-06T02:53:44Z,FK10,-23.4,151.05,64.4,-999,-999,-999,-999,-999,-999,-999,-999,-999,-999,-999,-999
,2003-09-06T02:53:44Z,FK10,-23.4,151.05,64.6,-999,-999,-999,-999,-999,-999,-999,-999,-999,-999,-999,-999
,2003-09-06T02:53:44Z,FK10,-23.4,151.05,64.8,-999,-999,-999,-999,-999,-999,-999,-999,-999,-999,-999,-999
,2003-09-06T02:53:44Z,FK10,-23.4,151.05,65,-999,-999,-999,-999,-999,-999,-999,-999,-999,-999,-999,-999
,2003-09-06T02:53:45Z,FK10,-23.4,151.05,65.2,-999,-999,-999,-999,-999,-999,-999,-999,-999,-999,-999,-999
,2003-09-06T02:53:45Z,FK10,-23.4,151.05,65.4,-999,-999,-999,-999,-999,-999,-999,-999,-999,-999,-999,-999
,2003-09-06T02:53:45Z,FK10,-23.4,151.05,65.6,-999,-999,-999,-999,-999,-999,-999,-999,-999,-999,-999,-999
,2003-09-06T02:53:45Z,FK10,-23.4,151.05,65.8,-999,-999,-999,-999,-999,-999,-999,-999,-999,-999,-999,-999
,2003-09-06T02:53:46Z,FK10,-23.4,151.05,66,-999,-999,-999,-999,-999,-999,-999,-999,-999,-999,-999,-999
,2003-09-06T02:53:46Z,FK10,-23.4,151.05,66.2,-999,-999,-999,-999,-999,-999,-999,-999,-999,-999,-999,-999
,2003-09-06T02:53:46Z,FK10,-23.4,151.05,66.4,-999,-999,-999,-999,-999,-999,-999,-999,-999,-999,-999,-999
,2003-09-06T02:53:46Z,FK10,-23.4,151.05,66.6,-999,-999,-999,-999,-999,-999,-999,-999,-999,-999,-999,-999
,2003-09-06T02:53:47Z,FK10,-23.4,151.05,66.8,-999,-999,-999,-999,-999,-999,-999,-999,-999,-999,-999,-999
,2003-09-06T02:53:47Z,FK10,-23.4,151.05,67,-999,-999,-999,-999,-999,-999,-999,-999,-999,-999,-999,-999
,2003-09-06T02:53:47Z,FK10,-23.4,151.05,67.2,-999,-999,-999,-999,-999,-999,-999,-999,-999,-999,-999,-999
,2003-09-06T02:53:47Z,FK10,-23.4,151.05,67.4,-999,-999,-999,-999,-999,-999,-999,-999,-999,-999,-999,-999
,2003-09-06T02:53:48Z,FK10,-23.4,151.05,67.6,-999,-999,-999,-999,-999,-999,-999,-999,-999,-999,-999,-999
,2003-09-06T02:53:48Z,FK10,-23.4,151.05,67.8,-999,-999,-999,-999,-999,-999,-999,-999,-999,-999,-999,-999
,2003-09-06T02:53:48Z,FK10,-23.4,151.05,68,-999,-999,-999,-999,-999,-999,-999,-999,-999,-999,-999,-999
,2003-09-06T02:53:48Z,FK10,-23.4,151.05,68.2,-999,-999,-999,-999,-999,-999,-999,-999,-999,-999,-999,-999
,2003-09-06T02:53:49Z,FK10,-23.4,151.05,68.4,-999,-999,-999,-999,-999,-999,-999,-999,-999,-999,-999,-999
,2003-09-06T02:53:49Z,FK10,-23.4,151.05,68.6,-999,-999,-999,-999,-999,-999,-999,-999,-999,-999,-999,-999
,2003-09-06T02:53:49Z,FK10,-23.4,151.05,68.8,-999,-999,-999,-999,-999,-999,-999,-999,-999,-999,-999,-999
,2003-09-06T02:53:50Z,FK10,-23.4,151.05,69,-999,-999,-999,-999,-999,-999,-999,-999,-999,-999,-999,-999
,2003-09-06T02:53:50Z,FK10,-23.4,151.05,69.2,-999,-999,-999,-999,-999,-999,-999,-999,-999,-999,-999,-999
,2003-09-06T02:53:50Z,FK10,-23.4,151.05,69.4,-999,-999,-999,-999,-999,-999,-999,-999,-999,-999,-999,-999
,2003-09-06T02:53:50Z,FK10,-23.4,151.05,69.6,-999,-999,-999,-999,-999,-999,-999,-999,-999,-999,-999,-999
,2003-09-06T02:53:51Z,FK10,-23.4,151.05,69.8,-999,-999,-999,-999,-999,-999,-999,-999,-999,-999,-999,-999
,2003-09-06T02:53:51Z,FK10,-23.4,151.05,70,-999,-999,-999,-999,-999,-999,-999,-999,-999,-999,-999,-999
,2003-09-06T02:53:51Z,FK10,-23.4,151.05,70.2,-999,-999,-999,-999,-999,-999,-999,-999,-999,-999,-999,-999
,2003-09-06T02:53:51Z,FK10,-23.4,151.05,70.4,-999,-999,-999,-999,-999,-999,-999,-999,-999,-999,-999,-999
,2003-09-06T02:53:52Z,FK10,-23.4,151.05,70.6,-999,-999,-999,-999,-999,-999,-999,-999,-999,-999,-999,-999
,2003-09-06T02:53:52Z,FK10,-23.4,151.05,70.8,-999,-999,-999,-999,-999,-999,-999,-999,-999,-999,-999,-999
,2003-09-06T02:53:52Z,FK10,-23.4,151.05,71,-999,-999,-999,-999,-999,-999,-999,-999,-999,-999,-999,-999
,2003-09-06T02:53:52Z,FK10,-23.4,151.05,71.2,-999,-999,-999,-999,-999,-999,-999,-999,-999,-999,-999,-999
,2003-09-06T02:53:53Z,FK10,-23.4,151.05,71.4,-999,-999,-999,-999,-999,-999,-999,-999,-999,-999,-999,-999
,2003-09-06T02:53:53Z,FK10,-23.4,151.05,71.6,-999,-999,-999,-999,-999,-999,-999,-999,-999,-999,-999,-999
,2003-09-06T02:53:53Z,FK10,-23.4,151.05,71.8,-999,-999,-999,-999,-999,-999,-999,-999,-999,-999,-999,-999
,2003-09-06T02:53:53Z,FK10,-23.4,151.05,72,-999,-999,-999,-999,-999,-999,-999,-999,-999,-999,-999,-999
,2003-09-06T02:53:54Z,FK10,-23.4,151.05,72.2,-999,-999,-999,-999,-999,-999,-999,-999,-999,-999,-999,-999
,2003-09-06T02:53:54Z,FK10,-23.4,151.05,72.4,-999,-999,-999,-999,-999,-999,-999,-999,-999,-999,-999,-999
,2003-09-06T02:53:54Z,FK10,-23.4,151.05,72.6,-999,-999,-999,-999,-999,-999,-999,-999,-999,-999,-999,-999
,2003-09-06T02:53:54Z,FK10,-23.4,151.05,72.8,-999,-999,-999,-999,-999,-999,-999,-999,-999,-999,-999,-999
,2003-09-06T02:53:55Z,FK10,-23.4,151.05,73,-999,-999,-999,-999,-999,-999,-999,-999,-999,-999,-999,-999
,2003-09-06T02:53:55Z,FK10,-23.4,151.05,73.2,-999,-999,-999,-999,-999,-999,-999,-999,-999,-999,-999,-999
,2003-09-06T02:53:55Z,FK10,-23.4,151.05,73.4,-999,-999,-999,-999,-999,-999,-999,-999,-999,-999,-999,-999
,2003-09-06T02:53:55Z,FK10,-23.4,151.05,73.6,-999,-999,-999,-999,-999,-999,-999,-999,-999,-999,-999,-999
,2003-09-06T02:53:56Z,FK10,-23.4,151.05,73.8,-999,-999,-999,-999,-999,-999,-999,-999,-999,-999,-999,-999
,2003-09-06T02:53:56Z,FK10,-23.4,151.05,74,-999,-999,-999,-999,-999,-999,-999,-999,-999,-999,-999,-999
,2003-09-06T02:53:56Z,FK10,-23.4,151.05,74.2,-999,-999,-999,-999,-999,-999,-999,-999,-999,-999,-999,-999
,2003-09-06T02:53:57Z,FK10,-23.4,151.05,74.4,-999,-999,-999,-999,-999,-999,-999,-999,-999,-999,-999,-999
,2003-09-06T02:53:57Z,FK10,-23.4,151.05,74.6,-999,-999,-999,-999,-999,-999,-999,-999,-999,-999,-999,-999
,2003-09-06T02:53:57Z,FK10,-23.4,151.05,74.8,-999,-999,-999,-999,-999,-999,-999,-999,-999,-999,-999,-999
,2003-09-06T02:53:57Z,FK10,-23.4,151.05,75,-999,-999,-999,-999,-999,-999,-999,-999,-999,-999,-999,-999
,2003-09-06T02:53:58Z,FK10,-23.4,151.05,75.2,-999,-999,-999,-999,-999,-999,-999,-999,-999,-999,-999,-999
,2003-09-06T02:53:58Z,FK10,-23.4,151.05,75.4,-999,-999,-999,-999,-999,-999,-999,-999,-999,-999,-999,-999
,2003-09-06T02:53:58Z,FK10,-23.4,151.05,75.6,-999,-999,-999,-999,-999,-999,-999,-999,-999,-999,-999,-999
,2003-09-06T02:53:58Z,FK10,-23.4,151.05,75.8,-999,-999,-999,-999,-999,-999,-999,-999,-999,-999,-999,-999
,2003-09-06T02:53:59Z,FK10,-23.4,151.05,76,-999,-999,-999,-999,-999,-999,-999,-999,-999,-999,-999,-999
,2003-09-06T02:53:59Z,FK10,-23.4,151.05,76.2,-999,-999,-999,-999,-999,-999,-999,-999,-999,-999,-999,-999
,2003-09-06T02:53:59Z,FK10,-23.4,151.05,76.4,-999,-999,-999,-999,-999,-999,-999,-999,-999,-999,-999,-999
,2003-09-06T02:53:59Z,FK10,-23.4,151.05,76.6,-999,-999,-999,-999,-999,-999,-999,-999,-999,-999,-999,-999
,2003-09-06T02:54:00Z,FK10,-23.4,151.05,76.8,-999,-999,-999,-999,-999,-999,-999,-999,-999,-999,-999,-999
,2003-09-06T02:54:00Z,FK10,-23.4,151.05,77,-999,-999,-999,-999,-999,-999,-999,-999,-999,-999,-999,-999
,2003-09-06T02:54:00Z,FK10,-23.4,151.05,77.2,-999,-999,-999,-999,-999,-999,-999,-999,-999,-999,-999,-999
,2003-09-06T02:54:00Z,FK10,-23.4,151.05,77.4,-999,-999,-999,-999,-999,-999,-999,-999,-999,-999,-999,-999
,2003-09-06T02:54:01Z,FK10,-23.4,151.05,77.6,-999,-999,-999,-999,-999,-999,-999,-999,-999,-999,-999,-999
,2003-09-06T02:54:01Z,FK10,-23.4,151.05,77.8,-999,-999,-999,-999,-999,-999,-999,-999,-999,-999,-999,-999
,2003-09-06T02:54:01Z,FK10,-23.4,151.05,78,-999,-999,-999,-999,-999,-999,-999,-999,-999,-999,-999,-999
,2003-09-06T02:54:01Z,FK10,-23.4,151.05,78.2,-999,-999,-999,-999,-999,-999,-999,-999,-999,-999,-999,-999
,2003-09-06T02:54:02Z,FK10,-23.4,151.05,78.4,-999,-999,-999,-999,-999,-999,-999,-999,-999,-999,-999,-999
,2003-09-06T02:54:02Z,FK10,-23.4,151.05,78.6,-999,-999,-999,-999,-999,-999,-999,-999,-999,-999,-999,-999
,2003-09-06T02:54:02Z,FK10,-23.4,151.05,78.8,-999,-999,-999,-999,-999,-999,-999,-999,-999,-999,-999,-999
,2003-09-06T02:54:02Z,FK10,-23.4,151.05,79,-999,-999,-999,-999,-999,-999,-999,-999,-999,-999,-999,-999
,2003-09-06T02:54:03Z,FK10,-23.4,151.05,79.2,-999,-999,-999,-999,-999,-999,-999,-999,-999,-999,-999,-999
,2003-09-06T02:54:03Z,FK10,-23.4,151.05,79.4,-999,-999,-999,-999,-999,-999,-999,-999,-999,-999,-999,-999
,2003-09-06T02:54:03Z,FK10,-23.4,151.05,79.6,-999,-999,-999,-999,-999,-999,-999,-999,-999,-999,-999,-999
,2003-09-06T02:54:04Z,FK10,-23.4,151.05,79.8,-999,-999,-999,-999,-999,-999,-999,-999,-999,-999,-999,-999
,2003-09-06T02:54:04Z,FK10,-23.4,151.05,80,-999,-999,-999,-999,-999,-999,-999,-999,-999,-999,-999,-999
,2003-09-06T02:54:04Z,FK10,-23.4,151.05,80.2,-999,-999,-999,-999,-999,-999,-999,-999,-999,-999,-999,-999
,2003-09-06T02:54:04Z,FK10,-23.4,151.05,80.4,-999,-999,-999,-999,-999,-999,-999,-999,-999,-999,-999,-999
,2003-09-06T02:54:05Z,FK10,-23.4,151.05,80.6,-999,-999,-999,-999,-999,-999,-999,-999,-999,-999,-999,-999
,2003-09-06T02:54:05Z,FK10,-23.4,151.05,80.8,-999,-999,-999,-999,-999,-999,-999,-999,-999,-999,-999,-999
,2003-09-06T02:54:05Z,FK10,-23.4,151.05,81,-999,-999,-999,-999,-999,-999,-999,-999,-999,-999,-999,-999
,2003-09-06T02:54:05Z,FK10,-23.4,151.05,81.2,-999,-999,-999,-999,-999,-999,-999,-999,-999,-999,-999,-999
,2003-09-06T02:54:06Z,FK10,-23.4,151.05,81.4,-999,-999,-999,-999,-999,-999,-999,-999,-999,-999,-999,-999
,2003-09-06T02:54:06Z,FK10,-23.4,151.05,81.6,-999,-999,-999,-999,-999,-999,-999,-999,-999,-999,-999,-999
,2003-09-06T02:54:06Z,FK10,-23.4,151.05,81.8,-999,-999,-999,-999,-999,-999,-999,-999,-999,-999,-999,-999
,2003-09-06T02:54:06Z,FK10,-23.4,151.05,82,-999,-999,-999,-999,-999,-999,-999,-999,-999,-999,-999,-999
,2003-09-06T02:54:07Z,FK10,-23.4,151.05,82.2,-999,-999,-999,-999,-999,-999,-999,-999,-999,-999,-999,-999
,2003-09-06T02:54:07Z,FK10,-23.4,151.05,82.4,-999,-999,-999,-999,-999,-999,-999,-999,-999,-999,-999,-999
,2003-09-06T02:54:07Z,FK10,-23.4,151.05,82.6,-999,-999,-999,-999,-999,-999,-999,-999,-999,-999,-999,-999
,2003-09-06T02:54:07Z,FK10,-23.4,151.05,82.8,-999,-999,-999,-999,-999,-999,-999,-999,-999,-999,-999,-999
,2003-09-06T02:54:08Z,FK10,-23.4,151.05,83,-999,-999,-999,-999,-999,-999,-999,-999,-999,-999,-999,-999
,2003-09-06T02:54:08Z,FK10,-23.4,151.05,83.2,-999,-999,-999,-999,-999,-999,-999,-999,-999,-999,-999,-999
,2003-09-06T02:54:08Z,FK10,-23.4,151.05,83.4,-999,-999,-999,-999,-999,-999,-999,-999,-999,-999,-999,-999
,2003-09-06T02:54:08Z,FK10,-23.4,151.05,83.6,-999,-999,-999,-999,-999,-999,-999,-999,-999,-999,-999,-999
,2003-09-06T02:54:09Z,FK10,-23.4,151.05,83.8,-999,-999,-999,-999,-999,-999,-999,-999,-999,-999,-999,-999
,2003-09-06T02:54:09Z,FK10,-23.4,151.05,84,-999,-999,-999,-999,-999,-999,-999,-999,-999,-999,-999,-999
,2003-09-06T02:54:09Z,FK10,-23.4,151.05,84.2,-999,-999,-999,-999,-999,-999,-999,-999,-999,-999,-999,-999
,2003-09-06T02:54:10Z,FK10,-23.4,151.05,84.4,-999,-999,-999,-999,-999,-999,-999,-999,-999,-999,-999,-999
,2003-09-06T02:54:10Z,FK10,-23.4,151.05,84.6,-999,-999,-999,-999,-999,-999,-999,-999,-999,-999,-999,-999
,2003-09-06T02:54:10Z,FK10,-23.4,151.05,84.8,-999,-999,-999,-999,-999,-999,-999,-999,-999,-999,-999,-999
,2003-09-06T02:54:10Z,FK10,-23.4,151.05,85,-999,-999,-999,-999,-999,-999,-999,-999,-999,-999,-999,-999
,2003-09-06T02:54:11Z,FK10,-23.4,151.05,85.2,-999,-999,-999,-999,-999,-999,-999,-999,-999,-999,-999,-999
,2003-09-06T02:54:11Z,FK10,-23.4,151.05,85.4,-999,-999,-999,-999,-999,-999,-999,-999,-999,-999,-999,-999
,2003-09-06T02:54:11Z,FK10,-23.4,151.05,85.6,-999,-999,-999,-999,-999,-999,-999,-999,-999,-999,-999,-999
,2003-09-06T02:54:11Z,FK10,-23.4,151.05,85.8,-999,-999,-999,-999,-999,-999,-999,-999,-999,-999,-999,-999
,2003-09-06T02:54:12Z,FK10,-23.4,151.05,86,-999,-999,-999,-999,-999,-999,-999,-999,-999,-999,-999,-999
,2003-09-06T02:54:12Z,FK10,-23.4,151.05,86.2,-999,-999,-999,-999,-999,-999,-999,-999,-999,-999,-999,-999
,2003-09-06T02:54:12Z,FK10,-23.4,151.05,86.4,-999,-999,-999,-999,-999,-999,-999,-999,-999,-999,-999,-999
,2003-09-06T02:54:12Z,FK10,-23.4,151.05,86.6,-999,-999,-999,-999,-999,-999,-999,-999,-999,-999,-999,-999
,2003-09-06T02:54:13Z,FK10,-23.4,151.05,86.8,-999,-999,-999,-999,-999,-999,-999,-999,-999,-999,-999,-999
,2003-09-06T02:54:13Z,FK10,-23.4,151.05,87,-999,-999,-999,-999,-999,-999,-999,-999,-999,-999,-999,-999
,2003-09-06T02:54:13Z,FK10,-23.4,151.05,87.2,-999,-999,-999,-999,-999,-999,-999,-999,-999,-999,-999,-999
,2003-09-06T02:54:13Z,FK10,-23.4,151.05,87.4,-999,-999,-999,-999,-999,-999,-999,-999,-999,-999,-999,-999
,2003-09-06T02:54:14Z,FK10,-23.4,151.05,87.6,-999,-999,-999,-999,-999,-999,-999,-999,-999,-999,-999,-999
,2003-09-06T02:54:14Z,FK10,-23.4,151.05,87.8,-999,-999,-999,-999,-999,-999,-999,-999,-999,-999,-999,-999
,2003-09-06T02:54:14Z,FK10,-23.4,151.05,88,-999,-999,-999,-999,-999,-999,-999,-999,-999,-999,-999,-999
,2003-09-06T02:54:14Z,FK10,-23.4,151.05,88.2,-999,-999,-999,-999,-999,-999,-999,-999,-999,-999,-999,-999
,2003-09-06T02:54:15Z,FK10,-23.4,151.05,88.4,-999,-999,-999,-999,-999,-999,-999,-999,-999,-999,-999,-999
,2003-09-06T02:54:15Z,FK10,-23.4,151.05,88.6,-999,-999,-999,-999,-999,-999,-999,-999,-999,-999,-999,-999
,2003-09-06T02:54:15Z,FK10,-23.4,151.05,88.8,-999,-999,-999,-999,-999,-999,-999,-999,-999,-999,-999,-999
,2003-09-06T02:54:15Z,FK10,-23.4,151.05,89,-999,-999,-999,-999,-999,-999,-999,-999,-999,-999,-999,-999
,2003-09-06T02:54:16Z,FK10,-23.4,151.05,89.2,-999,-999,-999,-999,-999,-999,-999,-999,-999,-999,-999,-999
,2003-09-06T02:54:16Z,FK10,-23.4,151.05,89.4,-999,-999,-999,-999,-999,-999,-999,-999,-999,-999,-999,-999
,2003-09-06T02:54:16Z,FK10,-23.4,151.05,89.6,-999,-999,-999,-999,-999,-999,-999,-999,-999,-999,-999,-999
,2003-09-06T02:54:17Z,FK10,-23.4,151.05,89.8,-999,-999,-999,-999,-999,-999,-999,-999,-999,-999,-999,-999
,2003-09-06T02:54:17Z,FK10,-23.4,151.05,90,-999,-999,-999,-999,-999,-999,-999,-999,-999,-999,-999,-999
,2003-09-06T02:54:17Z,FK10,-23.4,151.05,90.2,-999,-999,-999,-999,-999,-999,-999,-999,-999,-999,-999,-999
,2003-09-06T02:54:17Z,FK10,-23.4,151.05,90.4,-999,-999,-999,-999,-999,-999,-999,-999,-999,-999,-999,-999
,2003-09-06T02:54:18Z,FK10,-23.4,151.05,90.6,-999,-999,-999,-999,-999,-999,-999,-999,-999,-999,-999,-999
,2003-09-06T02:54:18Z,FK10,-23.4,151.05,90.8,-999,-999,-999,-999,-999,-999,-999,-999,-999,-999,-999,-999
,2003-09-06T02:54:18Z,FK10,-23.4,151.05,91,-999,-999,-999,-999,-999,-999,-999,-999,-999,-999,-999,-999
,2003-09-06T02:54:18Z,FK10,-23.4,151.05,91.2,-999,-999,-999,-999,-999,-999,-999,-999,-999,-999,-999,-999
,2003-09-06T02:54:19Z,FK10,-23.4,151.05,91.4,-999,-999,-999,-999,-999,-999,-999,-999,-999,-999,-999,-999
,2003-09-06T02:54:19Z,FK10,-23.4,151.05,91.6,-999,-999,-999,-999,-999,-999,-999,-999,-999,-999,-999,-999
,2003-09-06T02:54:19Z,FK10,-23.4,151.05,91.8,-999,-999,-999,-999,-999,-999,-999,-999,-999,-999,-999,-999
,2003-09-06T02:54:19Z,FK10,-23.4,151.05,92,-999,-999,-999,-999,-999,-999,-999,-999,-999,-999,-999,-999
,2003-09-06T02:54:20Z,FK10,-23.4,151.05,92.2,-999,-999,-999,-999,-999,-999,-999,-999,-999,-999,-999,-999
,2003-09-06T02:54:20Z,FK10,-23.4,151.05,92.4,-999,-999,-999,-999,-999,-999,-999,-999,-999,-999,-999,-999
,2003-09-06T02:54:20Z,FK10,-23.4,151.05,92.6,-999,-999,-999,-999,-999,-999,-999,-999,-999,-999,-999,-999
,2003-09-06T02:54:20Z,FK10,-23.4,151.05,92.8,-999,-999,-999,-999,-999,-999,-999,-999,-999,-999,-999,-999
,2003-09-06T02:54:21Z,FK10,-23.4,151.05,93,-999,-999,-999,-999,-999,-999,-999,-999,-999,-999,-999,-999
,2003-09-06T02:54:21Z,FK10,-23.4,151.05,93.2,-999,-999,-999,-999,-999,-999,-999,-999,-999,-999,-999,-999
,2003-09-06T02:54:21Z,FK10,-23.4,151.05,93.4,-999,-999,-999,-999,-999,-999,-999,-999,-999,-999,-999,-999
,2003-09-06T02:54:21Z,FK10,-23.4,151.05,93.6,-999,-999,-999,-999,-999,-999,-999,-999,-999,-999,-999,-999
,2003-09-06T02:54:22Z,FK10,-23.4,151.05,93.8,-999,-999,-999,-999,-999,-999,-999,-999,-999,-999,-999,-999
,2003-09-06T02:54:22Z,FK10,-23.4,151.05,94,-999,-999,-999,-999,-999,-999,-999,-999,-999,-999,-999,-999
,2003-09-06T02:54:22Z,FK10,-23.4,151.05,94.2,-999,-999,-999,-999,-999,-999,-999,-999,-999,-999,-999,-999
,2003-09-06T02:54:22Z,FK10,-23.4,151.05,94.4,-999,-999,-999,-999,-999,-999,-999,-999,-999,-999,-999,-999
,2003-09-06T02:54:23Z,FK10,-23.4,151.05,94.6,-999,-999,-999,-999,-999,-999,-999,-999,-999,-999,-999,-999
,2003-09-06T02:54:23Z,FK10,-23.4,151.05,94.8,-999,-999,-999,-999,-999,-999,-999,-999,-999,-999,-999,-999
,2003-09-06T02:54:23Z,FK10,-23.4,151.05,95,-999,-999,-999,-999,-999,-999,-999,-999,-999,-999,-999,-999
,2003-09-06T02:54:24Z,FK10,-23.4,151.05,95.2,-999,-999,-999,-999,-999,-999,-999,-999,-999,-999,-999,-999
,2003-09-06T02:54:24Z,FK10,-23.4,151.05,95.4,-999,-999,-999,-999,-999,-999,-999,-999,-999,-999,-999,-999
,2003-09-06T02:54:24Z,FK10,-23.4,151.05,95.6,-999,-999,-999,-999,-999,-999,-999,-999,-999,-999,-999,-999
,2003-09-06T02:54:24Z,FK10,-23.4,151.05,95.8,-999,-999,-999,-999,-999,-999,-999,-999,-999,-999,-999,-999
,2003-09-06T02:54:25Z,FK10,-23.4,151.05,96,-999,-999,-999,-999,-999,-999,-999,-999,-999,-999,-999,-999
,2003-09-06T02:54:25Z,FK10,-23.4,151.05,96.2,-999,-999,-999,-999,-999,-999,-999,-999,-999,-999,-999,-999
,2003-09-06T02:54:25Z,FK10,-23.4,151.05,96.4,-999,-999,-999,-999,-999,-999,-999,-999,-999,-999,-999,-999
,2003-09-06T02:54:25Z,FK10,-23.4,151.05,96.6,-999,-999,-999,-999,-999,-999,-999,-999,-999,-999,-999,-999
,2003-09-06T02:54:27Z,FK10,-23.4,151.05,96.8,-999,-999,-999,-999,-999,-999,-999,-999,-999,-999,-999,-999
,2003-09-06T02:54:27Z,FK10,-23.4,151.05,97,-999,-999,-999,-999,-999,-999,-999,-999,-999,-999,-999,-999
,2003-09-06T02:54:27Z,FK10,-23.4,151.05,97.2,-999,-999,-999,-999,-999,-999,-999,-999,-999,-999,-999,-999
,2003-09-06T02:54:27Z,FK10,-23.4,151.05,97.4,-999,-999,-999,-999,-999,-999,-999,-999,-999,-999,-999,-999
,2003-09-06T02:54:28Z,FK10,-23.4,151.05,97.6,-999,-999,-999,-999,-999,-999,-999,-999,-999,-999,-999,-999
,2003-09-06T02:54:28Z,FK10,-23.4,151.05,97.8,-999,-999,-999,-999,-999,-999,-999,-999,-999,-999,-999,-999
,2003-09-06T02:54:28Z,FK10,-23.4,151.05,98,-999,-999,-999,-999,-999,-999,-999,-999,-999,-999,-999,-999
,2003-09-06T02:54:28Z,FK10,-23.4,151.05,98.2,-999,-999,-999,-999,-999,-999,-999,-999,-999,-999,-999,-999
,2003-09-06T02:54:29Z,FK10,-23.4,151.05,98.4,-999,-999,-999,-999,-999,-999,-999,-999,-999,-999,-999,-999
,2003-09-06T02:54:29Z,FK10,-23.4,151.05,98.6,-999,-999,-999,-999,-999,-999,-999,-999,-999,-999,-999,-999
,2003-09-06T02:54:29Z,FK10,-23.4,151.05,98.8,-999,-999,-999,-999,-999,-999,-999,-999,-999,-999,-999,-999
,2003-09-06T02:54:29Z,FK10,-23.4,151.05,99,-999,-999,-999,-999,-999,-999,-999,-999,-999,-999,-999,-999
,2003-09-06T02:54:30Z,FK10,-23.4,151.05,99.2,-999,-999,-999,-999,-999,-999,-999,-999,-999,-999,-999,-999
,2003-09-06T02:54:30Z,FK10,-23.4,151.05,99.4,-999,-999,-999,-999,-999,-999,-999,-999,-999,-999,-999,-999
,2003-09-06T02:54:30Z,FK10,-23.4,151.05,99.6,-999,-999,-999,-999,-999,-999,-999,-999,-999,-999,-999,-999
,2003-09-06T02:54:30Z,FK10,-23.4,151.05,99.8,-999,-999,-999,-999,-999,-999,-999,-999,-999,-999,-999,-999
,2003-09-06T02:54:32Z,FK10,-23.4,151.05,100,-999,-999,-999,-999,-999,-999,-999,-999,-999,-999,-999,-999
