GLOBAL ATTRIBUTES,,Comments,,,,,,,,,,,,,,,,,,,,,,,,,,,,,,,,,,,,,,,,,,,,,,,,,,,,,
title,GBR Marine Monitorin Program-Inshore Water Quality,,,,,,,,,,,,,,,,,,,,,,,,,,,,,,,,,,,,,,,,,,,,,,,,,,,,,,
project,Integrated Marine Observing System (IMOS),,,,,,,,,,,,,,,,,,,,,,,,,,,,,,,,,,,,,,,,,,,,,,,,,,,,,,
original_project_name, ,,,,,,,,,,,,,,,,,,,,,,,,,,,,,,,,,,,,,,,,,,,,,,,,,,,,,,
institution,AIMS (Australian Institute of Marine Science); JCU (James Cook University);  Cape York Water Monitoring Partnership,,,,,,,,,,,,,,,,,,,,,,,,,,,,,,,,,,,,,,,,,,,,,,,,,,,,,,
abstract,"The data were collected from 2020-2021, at a total of 378 stations, on multiple vessels. These samples were taken as part of the Marine Monitoring Program – Inshore Water Quality, which is a partnership between the Great Barrier Reef Marine Park Authority, the Australian Government, AIMS, JCU, and the Cape York Water Monitoring Partnership.  The data were collected to determine the bio-optical charateristics of this region. The data can be used for Ocean Colour sensor validation. Parameters measured are chlorophyll-a, total suspended solids of the water column, and the absorption coefficients of the dissolved components.  ",,,,,,,,,,,,,,,,,,,,,,,,,,,,,,,,,,,,,,,,,,,,,,,,,,,,,,
conventions,IMOS biological data format (v1.0),,,,,,,,,,,,,,,,,,,,,,,,,,,,,,,,,,,,,,,,,,,,,,,,,,,,,,
date_created,,,,,,,,,,,,,,,,,,,,,,,,,,,,,,,,,,,,,,,,,,,,,,,,,,,,,,,
date_modified,,,,,,,,,,,,,,,,,,,,,,,,,,,,,,,,,,,,,,,,,,,,,,,,,,,,,,,
history,data has been quality controlled by in-house procedures,,,,,,,,,,,,,,,,,,,,,,,,,,,,,,,,,,,,,,,,,,,,,,,,,,,,,,
comment,"Total Suspended Solids (TSS) were collected on pre-weighed 0.4 Î¼m polycarbonate filters (47 mm diameter, GE Water & Process Technologies) after the method in Parsons et al (1984). Filters were dried at 60Â°C and the SPM determined gravimetrically from the difference in weight between loaded and unloaded filters ",,,,,,,,,,,,,,,,,,,,,,,,,,,,,,,,,,,,,,,,,,,,,,,,,,,,,,
source,Total suspended particulate matter in discrete sea-water samples determined using a 4 figure laboratory balance,,,,,,,,,,,,,,,,,,,,,,,,,,,,,,,,,,,,,,,,,,,,,,,,,,,,,,
keywords,Oceans>ocean Chemistry>Ocean Colour;Oceans>Ocean Chemistry>Suspended solids,,,,,,,,,,,,,,,,,,,,,,,,,,,,,,,,,,,,,,,,,,,,,,,,,,,,,,
vessel_name, ,,,,,,,,,,,,,,,,,,,,,,,,,,,,,,,,,,,,,,,,,,,,,,,,,,,,,,
platform_code,,,,,,,,,,,,,,,,,,,,,,,,,,,,,,,,,,,,,,,,,,,,,,,,,,,,,,,
cruise_id,GBR_WQP_2020_2021,,,,,,,,,,,,,,,,,,,,,,,,,,,,,,,,,,,,,,,,,,,,,,,,,,,,,,
references,"Waterhouse, J., Gruber, R., Logan, M., Petus, C., Howley, C., Lewis, S., Tracey, D., James, C., Mellors, J., Tonin, H., Skuza, M., Costello, P., Davidson, J., Gunn, K., Lefevre, C., Moran, D., Robson, B., Shanahan, M., Zagorskis, I., Shellberg, J., 2021. Marine Monitoring Program: Annual Report for Inshore Water Quality Monitoring 2019–20. Report for the Great Barrier Reef Marine Park Authority, Great Barrier Reef Marine Park Authority, Townsville;  Great Barrier Reef Marine Park Authority (2021). Great Barrier Reef Marine Monitoring Program Quality Assurance and Quality Control Manual 2019-20. Great Barrier Reef Marine Park Authority, Townsville, 310pp.",,,,,,,,,,,,,,,,,,,,,,,,,,,,,,,,,,,,,,,,,,,,,,,,,,,,,,
naming_authority,CSIRO Oceans and Atmosphere (O&A),,,,,,,,,,,,,,,,,,,,,,,,,,,,,,,,,,,,,,,,,,,,,,,,,,,,,,
cdm_data_type,Point,,,,,,,,,,,,,,,,,,,,,,,,,,,,,,,,,,,,,,,,,,,,,,,,,,,,,,
geospatial_lat_min,-23.4795333,calculated automatically from table,,,,,,,,,,,,,,,,,,,,,,,,,,,,,,,,,,,,,,,,,,,,,,,,,,,,,
geospatial_lat_max,-12.4088167,calculated automatically from table,,,,,,,,,,,,,,,,,,,,,,,,,,,,,,,,,,,,,,,,,,,,,,,,,,,,,
geospatial_lon_min,143.2797167,calculated automatically from table,,,,,,,,,,,,,,,,,,,,,,,,,,,,,,,,,,,,,,,,,,,,,,,,,,,,,
geospatial_lon_max,151.07,calculated automatically from table,,,,,,,,,,,,,,,,,,,,,,,,,,,,,,,,,,,,,,,,,,,,,,,,,,,,,
geospatial_vertical_min,0,calculated automatically from table,,,,,,,,,,,,,,,,,,,,,,,,,,,,,,,,,,,,,,,,,,,,,,,,,,,,,
geospatial_vertical_max,0,calculated automatically from table,,,,,,,,,,,,,,,,,,,,,,,,,,,,,,,,,,,,,,,,,,,,,,,,,,,,,
local_time_zone,10,AEST (UTC +10),,,,,,,,,,,,,,,,,,,,,,,,,,,,,,,,,,,,,,,,,,,,,,,,,,,,,
data_centre,eMarine Information Infrastructure (eMII),,,,,,,,,,,,,,,,,,,,,,,,,,,,,,,,,,,,,,,,,,,,,,,,,,,,,,
data_centre_email,info@emii.org.au,,,,,,,,,,,,,,,,,,,,,,,,,,,,,,,,,,,,,,,,,,,,,,,,,,,,,,
author,"Brewer,Elizabeth",,,,,,,,,,,,,,,,,,,,,,,,,,,,,,,,,,,,,,,,,,,,,,,,,,,,,,
author_email,Elizabeth.Brewer@csiro.au,,,,,,,,,,,,,,,,,,,,,,,,,,,,,,,,,,,,,,,,,,,,,,,,,,,,,,
principal_investigator,"Gruber, Renee;  Waterhouse, Jane; Howley, Christina",,,,,,,,,,,,,,,,,,,,,,,,,,,,,,,,,,,,,,,,,,,,,,,,,,,,,,
principal_investigator_email,R.Gruber@aims.gov.au; Jane.Waterhouse@jcu.edu.au; christina@capeyorkwaterpartnership.org ,,,,,,,,,,,,,,,,,,,,,,,,,,,,,,,,,,,,,,,,,,,,,,,,,,,,,,
publisher,Australian Ocean Data Network,,,,,,,,,,,,,,,,,,,,,,,,,,,,,,,,,,,,,,,,,,,,,,,,,,,,,,
publisher_email,info@aodn.org.au,,,,,,,,,,,,,,,,,,,,,,,,,,,,,,,,,,,,,,,,,,,,,,,,,,,,,,
institution,IMOS Satellite Remote Sensing - Ocean Colour Sub-facility - Bio-Optical Database of Australian Waters,,,,,,,,,,,,,,,,,,,,,,,,,,,,,,,,,,,,,,,,,,,,,,,,,,,,,,
institution_principal_investigator,"Schroeder, Thomas",,,,,,,,,,,,,,,,,,,,,,,,,,,,,,,,,,,,,,,,,,,,,,,,,,,,,,
institution_principal_investigator_email,Thomas.Schroeder@csiro.au,,,,,,,,,,,,,,,,,,,,,,,,,,,,,,,,,,,,,,,,,,,,,,,,,,,,,,
citation,"To cite this data set in a publication, use the format ""IMOS [year-of-data-downloaded], [Title], [data-access-url], accessed [date-of-access]""",,,,,,,,,,,,,,,,,,,,,,,,,,,,,,,,,,,,,,,,,,,,,,,,,,,,,,
acknowledgement,"Data were collected as part of the Marine Monitoring Program – Inshore Water Quality, which is a partnership between the Great Barrier Reef Marine Park Authority, the Australian Government, AIMS, JCU, and the Cape York Water Monitoring Partnership",,,,,,,,,,,,,,,,,,,,,,,,,,,,,,,,,,,,,,,,,,,,,,,,,,,,,,
distribution_statement,"Any users of IMOS data are required to clearly acknowledge the source of the material. Data, products and services from IMOS are provided ""as is"" without any warranty as to fitness for a particular purpose.",,,,,,,,,,,,,,,,,,,,,,,,,,,,,,,,,,,,,,,,,,,,,,,,,,,,,,
,,,,,,,,,,,,,,,,,,,,,,,,,,,,,,,,,,,,,,,,,,,,,,,,,,,,,,,
,,,,,,,,,,,,,,,,,,,,,,,,,,,,,,,,,,,,,,,,,,,,,,,,,,,,,,,
TABLE COLUMNS,,,,,,,,,,,,,,,,,,,,,,,,,,,,,,,,,,,,,,,,,,,,,,,,,,,,,,,
Column name,CF standard_name,IMOS long_name,Units,Fill value,Comments,,,,,,,,,,,,,,,,,,,,,,,,,,,,,,,,,,,,,,,,,,,,,,,,,,
Time,time,analysis_time,YYYY-MM-DDThh:mm:ssZ,,UTC date and time,,,,,,,,,,,,,,,,,,,,,,,,,,,,,,,,,,,,,,,,,,,,,,,,,,
Station_Code,,,,,National Reference Station code (6 letters),,,,,,,,,,,,,,,,,,,,,,,,,,,,,,,,,,,,,,,,,,,,,,,,,,
Latitude,latitude,latitude,degrees_north,,North positive,,,,,,,,,,,,,,,,,,,,,,,,,,,,,,,,,,,,,,,,,,,,,,,,,,
Longitude,longitude,longitude,degrees_east,,East positive,,,,,,,,,,,,,,,,,,,,,,,,,,,,,,,,,,,,,,,,,,,,,,,,,,
Depth,depth,depth,m ,,positive down,,,,,,,,,,,,,,,,,,,,,,,,,,,,,,,,,,,,,,,,,,,,,,,,,,
SPM,SPM,Total_suspended_particulate_material_density,mg L-1,-999,, , ,,,,,,,,,,,,,,,,,,,,,,,,,,,,,,,,,,,,,,,,,,,,,,,,
SPM_inorg,,Total_suspended_particulate_material_density_inorganic fraction,mg L-1,-999,,,,,,,,,,,,,,,,,,,,,,,,,,,,,,,,,,,,,,,,,,,,,,,,,,,
SPM_org,,Total_suspended_particulate_material_density_organic fraction,mg L-1,-999,,,,,,,,,,,,,,,,,,,,,,,,,,,,,,,,,,,,,,,,,,,,,,,,,,,
,,,,,,,,,,,,,,,,,,,,,,,,,,,,,,,,,,,,,,,,,,,,,,,,,,,,,,,
DATA,,,,,,,,,,,,,,,,,,,,,,,,,,,,,,,,,,,,,,,,,,,,,,,,,,,,,,,
Time,Station_Code,Latitude,Longitude,Depth,SPM,,,,,,,,,,,,,,,,,,,,,,,,,,,,,,,,,,,,,,,,,,,,,,,,,,
2020-09-04T01:14:00Z,WQQ200,-19.3073333,147.6216667,0,0.234,,,,,,,,,,,,,,,,,,,,,,,,,,,,,,,,,,,,,,,,,,,,,,,,,,
2020-09-04T05:27:00Z,WQQ201,-19.282,147.175,0,2.069,,,,,,,,,,,,,,,,,,,,,,,,,,,,,,,,,,,,,,,,,,,,,,,,,,
2020-09-20T23:45:00Z,WQQ203,-18.8177833,146.4383167,0,0.499,,,,,,,,,,,,,,,,,,,,,,,,,,,,,,,,,,,,,,,,,,,,,,,,,,
2020-09-21T03:17:00Z,WQQ204,-18.5405833,146.48855,0,0.274,,,,,,,,,,,,,,,,,,,,,,,,,,,,,,,,,,,,,,,,,,,,,,,,,,
2020-09-22T00:28:00Z,WQQ202,-19.1575667,146.8685167,0,2.094,,,,,,,,,,,,,,,,,,,,,,,,,,,,,,,,,,,,,,,,,,,,,,,,,,
2020-09-23T02:51:00Z,WQQ205,-19.5878333,147.5828167,0,1.354,,,,,,,,,,,,,,,,,,,,,,,,,,,,,,,,,,,,,,,,,,,,,,,,,,
2020-09-28T22:16:00Z,WQQ239,-16.7766667,145.9583333,0,0.884,,,,,,,,,,,,,,,,,,,,,,,,,,,,,,,,,,,,,,,,,,,,,,,,,,
2020-09-28T23:58:00Z,WQQ241,-16.7883333,145.7483333,0,4.619,,,,,,,,,,,,,,,,,,,,,,,,,,,,,,,,,,,,,,,,,,,,,,,,,,
2020-09-29T02:50:00Z,WQQ243,-16.4116667,145.5116667,0,1.374,,,,,,,,,,,,,,,,,,,,,,,,,,,,,,,,,,,,,,,,,,,,,,,,,,
2020-09-29T05:17:00Z,WQQ244,-16.1133333,145.4833333,0,0.774,,,,,,,,,,,,,,,,,,,,,,,,,,,,,,,,,,,,,,,,,,,,,,,,,,
2020-09-29T23:23:00Z,WQQ242,-16.6633333,145.7066667,0,2.204,,,,,,,,,,,,,,,,,,,,,,,,,,,,,,,,,,,,,,,,,,,,,,,,,,
2020-09-30T01:19:00Z,WQQ240,-16.8483333,145.8383333,0,4.879,,,,,,,,,,,,,,,,,,,,,,,,,,,,,,,,,,,,,,,,,,,,,,,,,,
2020-10-07T23:36:00Z,WQQ213,-20.5764167,148.8587167,0,3.144,,,,,,,,,,,,,,,,,,,,,,,,,,,,,,,,,,,,,,,,,,,,,,,,,,
2020-10-08T01:04:00Z,WQQ214,-20.5781667,148.7098333,0,9.059,,,,,,,,,,,,,,,,,,,,,,,,,,,,,,,,,,,,,,,,,,,,,,,,,,
2020-10-08T03:03:00Z,WQQ212,-20.46825,149.0392333,0,1.644,,,,,,,,,,,,,,,,,,,,,,,,,,,,,,,,,,,,,,,,,,,,,,,,,,
2020-10-08T05:12:00Z,WQQ211,-20.3802833,148.8875333,0,1.259,,,,,,,,,,,,,,,,,,,,,,,,,,,,,,,,,,,,,,,,,,,,,,,,,,
2020-10-08T22:15:00Z,WQQ210,-20.1061833,148.7217167,0,0.614,,,,,,,,,,,,,,,,,,,,,,,,,,,,,,,,,,,,,,,,,,,,,,,,,,
2020-10-19T22:42:00Z,WQQ220,-17.2032,145.979,0,1.829,,,,,,,,,,,,,,,,,,,,,,,,,,,,,,,,,,,,,,,,,,,,,,,,,,
2020-10-19T23:37:00Z,WQQ223,-17.06915,145.9945167,0,0.344,,,,,,,,,,,,,,,,,,,,,,,,,,,,,,,,,,,,,,,,,,,,,,,,,,
2020-10-20T00:36:00Z,WQQ224,-16.9204,145.9972,0,0.539,,,,,,,,,,,,,,,,,,,,,,,,,,,,,,,,,,,,,,,,,,,,,,,,,,
2020-10-20T02:40:00Z,WQQ222,-17.1630167,146.0045,0,0.859,,,,,,,,,,,,,,,,,,,,,,,,,,,,,,,,,,,,,,,,,,,,,,,,,,
2020-10-20T04:17:00Z,WQQ221,-17.2268333,146.0873667,0,0.704,,,,,,,,,,,,,,,,,,,,,,,,,,,,,,,,,,,,,,,,,,,,,,,,,,
2020-10-20T22:42:00Z,WQQ230,-17.8905,146.2602,0,0.664,,,,,,,,,,,,,,,,,,,,,,,,,,,,,,,,,,,,,,,,,,,,,,,,,,
2020-10-20T23:39:00Z,WQQ231,-17.9605833,146.1907833,0,1.404,,,,,,,,,,,,,,,,,,,,,,,,,,,,,,,,,,,,,,,,,,,,,,,,,,
2020-10-21T00:37:00Z,WQQ232,-18.0147167,146.1337333,0,1.184,,,,,,,,,,,,,,,,,,,,,,,,,,,,,,,,,,,,,,,,,,,,,,,,,,
2020-10-21T01:25:00Z,WQQ229,-18.0225,146.0745833,0,1.839,,,,,,,,,,,,,,,,,,,,,,,,,,,,,,,,,,,,,,,,,,,,,,,,,,
2020-10-21T02:07:00Z,WQQ233,-17.9757,146.1166167,0,1.394,,,,,,,,,,,,,,,,,,,,,,,,,,,,,,,,,,,,,,,,,,,,,,,,,,
2020-10-21T02:57:00Z,WQQ234,-17.9247667,146.14325,0,0.314,,,,,,,,,,,,,,,,,,,,,,,,,,,,,,,,,,,,,,,,,,,,,,,,,,
2020-11-29T22:33:00Z,FTZ006,-23.4751833,150.9382,0,10.948,,,,,,,,,,,,,,,,,,,,,,,,,,,,,,,,,,,,,,,,,,,,,,,,,,
2020-11-30T00:20:00Z,FTZ005,-23.3410167,150.905,0,8.478,,,,,,,,,,,,,,,,,,,,,,,,,,,,,,,,,,,,,,,,,,,,,,,,,,
2020-11-30T01:30:00Z,FTZ003,-23.2327,150.873,0,0.329,,,,,,,,,,,,,,,,,,,,,,,,,,,,,,,,,,,,,,,,,,,,,,,,,,
2020-11-30T02:31:00Z,FTZ002,-23.2167,150.96,0,0.469,,,,,,,,,,,,,,,,,,,,,,,,,,,,,,,,,,,,,,,,,,,,,,,,,,
2020-11-30T03:48:00Z,FTZ004,-23.0922,150.9132667,0,4.649,,,,,,,,,,,,,,,,,,,,,,,,,,,,,,,,,,,,,,,,,,,,,,,,,,
2020-11-30T05:03:00Z,FTZ001,-23.1515,151.069,0,0.199,,,,,,,,,,,,,,,,,,,,,,,,,,,,,,,,,,,,,,,,,,,,,,,,,,
2020-12-04T22:50:00Z,JCD005,-19.5880167,147.5822333,0,8.768,,,,,,,,,,,,,,,,,,,,,,,,,,,,,,,,,,,,,,,,,,,,,,,,,,
2020-12-05T01:25:00Z,JCD001,-19.28235,147.418,0,2.054,,,,,,,,,,,,,,,,,,,,,,,,,,,,,,,,,,,,,,,,,,,,,,,,,,
2020-12-05T02:35:00Z,JCD002,-19.1573,146.86882,0,1.514,,,,,,,,,,,,,,,,,,,,,,,,,,,,,,,,,,,,,,,,,,,,,,,,,,
2020-12-05T21:35:00Z,JCD004,-18.5421667,146.4345667,0,1.489,,,,,,,,,,,,,,,,,,,,,,,,,,,,,,,,,,,,,,,,,,,,,,,,,,
2020-12-05T22:55:00Z,JCD003,-18.8176333,146.4380167,0,1.914,,,,,,,,,,,,,,,,,,,,,,,,,,,,,,,,,,,,,,,,,,,,,,,,,,
2020-12-07T02:58:00Z,JCZ022,-14.0441667,143.6990333,0,2.454,,,,,,,,,,,,,,,,,,,,,,,,,,,,,,,,,,,,,,,,,,,,,,,,,,
2020-12-07T05:15:00Z,JCZ023,-13.9865833,143.7163167,0,0.264,,,,,,,,,,,,,,,,,,,,,,,,,,,,,,,,,,,,,,,,,,,,,,,,,,
2020-12-07T22:38:00Z,WQQ249,-16.9206333,145.99705,0,0.659,,,,,,,,,,,,,,,,,,,,,,,,,,,,,,,,,,,,,,,,,,,,,,,,,,
2020-12-08T00:27:00Z,WQQ248,-17.0699333,146.00115,0,0.459,,,,,,,,,,,,,,,,,,,,,,,,,,,,,,,,,,,,,,,,,,,,,,,,,,
2020-12-08T01:40:00Z,WQQ250,-17.16265,146.0047,0,0.794,,,,,,,,,,,,,,,,,,,,,,,,,,,,,,,,,,,,,,,,,,,,,,,,,,
2020-12-08T02:54:00Z,WQQ251,-17.2269333,146.0875,0,0.594,,,,,,,,,,,,,,,,,,,,,,,,,,,,,,,,,,,,,,,,,,,,,,,,,,
2020-12-08T04:13:00Z,WQQ247,-17.2030333,145.97885,0,0.739,,,,,,,,,,,,,,,,,,,,,,,,,,,,,,,,,,,,,,,,,,,,,,,,,,
2020-12-08T04:50:00Z,JCZ025,-13.8820667,143.72285,0,0.849,,,,,,,,,,,,,,,,,,,,,,,,,,,,,,,,,,,,,,,,,,,,,,,,,,
2020-12-08T05:50:00Z,JCZ024,-13.9266333,143.7305667,0,0.644,,,,,,,,,,,,,,,,,,,,,,,,,,,,,,,,,,,,,,,,,,,,,,,,,,
2020-12-08T21:55:00Z,JCZ003,-15.4305667,145.2682667,0,0.454,,,,,,,,,,,,,,,,,,,,,,,,,,,,,,,,,,,,,,,,,,,,,,,,,,
2020-12-08T22:45:00Z,JCZ004,-15.4145833,145.31635,0,0.694,,,,,,,,,,,,,,,,,,,,,,,,,,,,,,,,,,,,,,,,,,,,,,,,,,
2020-12-08T23:43:00Z,WQQ253,-17.8905333,146.2603333,0,0.554,,,,,,,,,,,,,,,,,,,,,,,,,,,,,,,,,,,,,,,,,,,,,,,,,,
2020-12-08T23:45:00Z,JCZ005,-15.4425167,145.3999167,0,0.314,,,,,,,,,,,,,,,,,,,,,,,,,,,,,,,,,,,,,,,,,,,,,,,,,,
2020-12-09T01:09:00Z,WQQ254,-17.9599833,146.1900333,0,0.834,,,,,,,,,,,,,,,,,,,,,,,,,,,,,,,,,,,,,,,,,,,,,,,,,,
2020-12-09T01:30:00Z,JCZ002,-15.4830167,145.32505,0,0.594,,,,,,,,,,,,,,,,,,,,,,,,,,,,,,,,,,,,,,,,,,,,,,,,,,
2020-12-09T02:15:00Z,JCZ001,-15.50515,145.2922667,0,0.898,,,,,,,,,,,,,,,,,,,,,,,,,,,,,,,,,,,,,,,,,,,,,,,,,,
2020-12-09T02:52:00Z,WQQ255,-18.0147833,146.13355,0,0.534,,,,,,,,,,,,,,,,,,,,,,,,,,,,,,,,,,,,,,,,,,,,,,,,,,
2020-12-09T04:02:00Z,WQQ256,-18.0228333,146.0735,0,0.899,,,,,,,,,,,,,,,,,,,,,,,,,,,,,,,,,,,,,,,,,,,,,,,,,,
2020-12-09T05:23:00Z,WQQ257,-17.9756167,146.11675,0,1.234,,,,,,,,,,,,,,,,,,,,,,,,,,,,,,,,,,,,,,,,,,,,,,,,,,
2020-12-09T06:10:00Z,WQQ258,-17.9247,146.1435167,0,1.099,,,,,,,,,,,,,,,,,,,,,,,,,,,,,,,,,,,,,,,,,,,,,,,,,,
2020-12-11T23:10:00Z,JCZ011,-12.4088167,143.3563667,0,0.669,,,,,,,,,,,,,,,,,,,,,,,,,,,,,,,,,,,,,,,,,,,,,,,,,,
2020-12-12T01:45:00Z,JCZ010,-12.4621833,143.2833167,0,0.814,,,,,,,,,,,,,,,,,,,,,,,,,,,,,,,,,,,,,,,,,,,,,,,,,,
2020-12-12T22:45:00Z,JCZ012,-12.5087833,143.3007333,0,0.994,,,,,,,,,,,,,,,,,,,,,,,,,,,,,,,,,,,,,,,,,,,,,,,,,,
2020-12-13T00:50:00Z,JCZ013,-12.5113667,143.3709667,0,0.574,,,,,,,,,,,,,,,,,,,,,,,,,,,,,,,,,,,,,,,,,,,,,,,,,,
2020-12-13T02:10:00Z,JCZ014,-12.5070167,143.4417333,0,0.294,,,,,,,,,,,,,,,,,,,,,,,,,,,,,,,,,,,,,,,,,,,,,,,,,,
2020-12-13T04:20:00Z,JCZ009,-12.4997167,143.2803333,0,3.064,,,,,,,,,,,,,,,,,,,,,,,,,,,,,,,,,,,,,,,,,,,,,,,,,,
2020-12-14T23:25:00Z,JCZ026,-14.2436167,143.7864167,0,2.954,,,,,,,,,,,,,,,,,,,,,,,,,,,,,,,,,,,,,,,,,,,,,,,,,,
2020-12-16T00:08:00Z,JCZ020,-14.0945667,144.0487167,0,1.039,,,,,,,,,,,,,,,,,,,,,,,,,,,,,,,,,,,,,,,,,,,,,,,,,,
2020-12-16T01:35:00Z,JCZ019,-14.16915,144.0487167,0,1.474,,,,,,,,,,,,,,,,,,,,,,,,,,,,,,,,,,,,,,,,,,,,,,,,,,
2020-12-16T02:15:00Z,JCZ018,-14.2398333,144.0685833,0,2.574,,,,,,,,,,,,,,,,,,,,,,,,,,,,,,,,,,,,,,,,,,,,,,,,,,
2020-12-16T03:05:00Z,JCZ017,-14.3073667,144.0900167,0,3.719,,,,,,,,,,,,,,,,,,,,,,,,,,,,,,,,,,,,,,,,,,,,,,,,,,
2020-12-16T03:55:00Z,JCZ016,-14.3755833,144.1159167,0,3.988,,,,,,,,,,,,,,,,,,,,,,,,,,,,,,,,,,,,,,,,,,,,,,,,,,
2021-01-01T22:10:00Z,JCD023,-19.5885833,147.5819667,0,3.339,,,,,,,,,,,,,,,,,,,,,,,,,,,,,,,,,,,,,,,,,,,,,,,,,,
2021-01-02T00:50:00Z,JCD019,-19.2828167,147.1740167,0,0.364,,,,,,,,,,,,,,,,,,,,,,,,,,,,,,,,,,,,,,,,,,,,,,,,,,
2021-01-02T02:15:00Z,JCD020,-19.1549833,146.8686,0,3.854,,,,,,,,,,,,,,,,,,,,,,,,,,,,,,,,,,,,,,,,,,,,,,,,,,
2021-01-02T21:20:00Z,JCD022,-18.543,146.4690333,0,4.889,,,,,,,,,,,,,,,,,,,,,,,,,,,,,,,,,,,,,,,,,,,,,,,,,,
2021-01-02T23:00:00Z,JCD021,-18.8200333,146.43505,0,0.684,,,,,,,,,,,,,,,,,,,,,,,,,,,,,,,,,,,,,,,,,,,,,,,,,,
2021-01-07T22:35:00Z,JCZ032,-15.4425,145.4001,0,0.669,,,,,,,,,,,,,,,,,,,,,,,,,,,,,,,,,,,,,,,,,,,,,,,,,,
2021-01-08T00:20:00Z,JCZ029,-15.48301,145.32498,0,1.724,,,,,,,,,,,,,,,,,,,,,,,,,,,,,,,,,,,,,,,,,,,,,,,,,,
2021-01-08T01:25:00Z,JCZ028,-15.50526,145.29223,0,1.004,,,,,,,,,,,,,,,,,,,,,,,,,,,,,,,,,,,,,,,,,,,,,,,,,,
2021-01-08T02:25:00Z,JCZ031,-15.41452,145.3163,0,2.154,,,,,,,,,,,,,,,,,,,,,,,,,,,,,,,,,,,,,,,,,,,,,,,,,,
2021-01-08T03:25:00Z,JCZ030,-15.4317,145.2687,0,5.944,,,,,,,,,,,,,,,,,,,,,,,,,,,,,,,,,,,,,,,,,,,,,,,,,,
2021-01-09T00:56:00Z,JCD010,-17.069,145.9939333,0,0.479,,,,,,,,,,,,,,,,,,,,,,,,,,,,,,,,,,,,,,,,,,,,,,,,,,
2021-01-09T01:50:00Z,JCD009,-17.1632333,146.0048333,0,2.274,,,,,,,,,,,,,,,,,,,,,,,,,,,,,,,,,,,,,,,,,,,,,,,,,,
2021-01-09T03:00:00Z,JCD008,-17.2265167,146.0873667,0,0.654,,,,,,,,,,,,,,,,,,,,,,,,,,,,,,,,,,,,,,,,,,,,,,,,,,
2021-01-09T03:43:00Z,JCD007,-17.20292,145.97865,0,9.945,,,,,,,,,,,,,,,,,,,,,,,,,,,,,,,,,,,,,,,,,,,,,,,,,,
2021-01-10T00:12:00Z,JCD013,-17.8903833,146.2602333,0,0.704,,,,,,,,,,,,,,,,,,,,,,,,,,,,,,,,,,,,,,,,,,,,,,,,,,
2021-01-11T00:46:00Z,JCD014,-17.96,146.1906167,0,1.034,,,,,,,,,,,,,,,,,,,,,,,,,,,,,,,,,,,,,,,,,,,,,,,,,,
2021-01-11T01:41:00Z,JCD015,-18.0138333,146.1337667,0,2.954,,,,,,,,,,,,,,,,,,,,,,,,,,,,,,,,,,,,,,,,,,,,,,,,,,
2021-01-11T02:19:00Z,JCD012,-18.02235,146.0748167,0,9.838,,,,,,,,,,,,,,,,,,,,,,,,,,,,,,,,,,,,,,,,,,,,,,,,,,
2021-01-11T02:53:00Z,JCD016,-17.9751,146.1169167,0,2.594,,,,,,,,,,,,,,,,,,,,,,,,,,,,,,,,,,,,,,,,,,,,,,,,,,
2021-01-11T03:20:00Z,JCD017,-17.9244833,146.1431667,0,2.234,,,,,,,,,,,,,,,,,,,,,,,,,,,,,,,,,,,,,,,,,,,,,,,,,,
2021-01-20T06:30:00Z,JCE022,-15.461372,145.249192,0,37.74,,,,,,,,,,,,,,,,,,,,,,,,,,,,,,,,,,,,,,,,,,,,,,,,,,
2021-01-25T21:52:00Z,WQQ263,-19.1569833,146.8695833,0,0.629,,,,,,,,,,,,,,,,,,,,,,,,,,,,,,,,,,,,,,,,,,,,,,,,,,
2021-01-26T00:07:00Z,WQQ264,-18.8174833,146.4384167,0,0.154,,,,,,,,,,,,,,,,,,,,,,,,,,,,,,,,,,,,,,,,,,,,,,,,,,
2021-01-26T00:37:00Z,JCD028,-17.0694667,145.9940167,0,0.804,,,,,,,,,,,,,,,,,,,,,,,,,,,,,,,,,,,,,,,,,,,,,,,,,,
2021-01-26T01:26:00Z,JCD027,-17.1633,146.0048833,0,0.634,,,,,,,,,,,,,,,,,,,,,,,,,,,,,,,,,,,,,,,,,,,,,,,,,,
2021-01-26T01:43:00Z,WQQ265,-18.543,146.4871833,0,0.274,,,,,,,,,,,,,,,,,,,,,,,,,,,,,,,,,,,,,,,,,,,,,,,,,,
2021-01-26T02:08:00Z,JCD026,-17.2266833,146.0876833,0,0.214,,,,,,,,,,,,,,,,,,,,,,,,,,,,,,,,,,,,,,,,,,,,,,,,,,
2021-01-26T03:09:00Z,JCD025,-17.2032833,145.9783333,0,2.359,,,,,,,,,,,,,,,,,,,,,,,,,,,,,,,,,,,,,,,,,,,,,,,,,,
2021-01-26T23:31:00Z,JCD031,-17.89004,146.26025,0,0.914,,,,,,,,,,,,,,,,,,,,,,,,,,,,,,,,,,,,,,,,,,,,,,,,,,
2021-01-27T00:14:00Z,JCD032,-17.96006,146.19076,0,0.144,,,,,,,,,,,,,,,,,,,,,,,,,,,,,,,,,,,,,,,,,,,,,,,,,,
2021-01-27T00:46:00Z,WQQ261,-19.2996,147.62165,0,0.05,,,,,,,,,,,,,,,,,,,,,,,,,,,,,,,,,,,,,,,,,,,,,,,,,,
2021-01-27T00:47:00Z,JCD033,-18.01393,146.13335,0,0.474,,,,,,,,,,,,,,,,,,,,,,,,,,,,,,,,,,,,,,,,,,,,,,,,,,
2021-01-27T01:20:00Z,JCD030,-18.02246,146.0745,0,2.414,,,,,,,,,,,,,,,,,,,,,,,,,,,,,,,,,,,,,,,,,,,,,,,,,,
2021-01-27T02:17:00Z,JCD034,-17.97522,146.1166,0,0.234,,,,,,,,,,,,,,,,,,,,,,,,,,,,,,,,,,,,,,,,,,,,,,,,,,
2021-01-27T02:48:00Z,JCD035,-17.92475,146.14306,0,1.494,,,,,,,,,,,,,,,,,,,,,,,,,,,,,,,,,,,,,,,,,,,,,,,,,,
2021-01-27T04:09:00Z,WQQ262,-19.2815333,147.1720167,0,0.274,,,,,,,,,,,,,,,,,,,,,,,,,,,,,,,,,,,,,,,,,,,,,,,,,,
2021-01-27T22:02:00Z,WQQ260,-19.5883333,147.5827833,0,23.458,,,,,,,,,,,,,,,,,,,,,,,,,,,,,,,,,,,,,,,,,,,,,,,,,,
2021-01-31T01:35:00Z,JCZ037,-12.4627833,143.28365,0,2.504,,,,,,,,,,,,,,,,,,,,,,,,,,,,,,,,,,,,,,,,,,,,,,,,,,
2021-01-31T03:10:00Z,JCZ038,-12.4120833,143.3585167,0,2.339,,,,,,,,,,,,,,,,,,,,,,,,,,,,,,,,,,,,,,,,,,,,,,,,,,
2021-02-01T00:37:00Z,JCZ041,-12.5067667,143.4407,0,0.39368,,,,,,,,,,,,,,,,,,,,,,,,,,,,,,,,,,,,,,,,,,,,,,,,,,
2021-02-01T02:13:00Z,JCZ040,-12.5113167,143.3712833,0,0.792,,,,,,,,,,,,,,,,,,,,,,,,,,,,,,,,,,,,,,,,,,,,,,,,,,
2021-02-01T03:07:00Z,JCZ039,-12.50885,143.3008667,0,1.12,,,,,,,,,,,,,,,,,,,,,,,,,,,,,,,,,,,,,,,,,,,,,,,,,,
2021-02-01T03:53:00Z,JCZ036,-12.4995167,143.2803333,0,14.776,,,,,,,,,,,,,,,,,,,,,,,,,,,,,,,,,,,,,,,,,,,,,,,,,,
2021-02-02T22:42:00Z,FTZ024,-23.2316667,150.8733333,0,9.648,,,,,,,,,,,,,,,,,,,,,,,,,,,,,,,,,,,,,,,,,,,,,,,,,,
2021-02-03T00:15:00Z,FTZ023,-23.34,150.905,0,14.068,,,,,,,,,,,,,,,,,,,,,,,,,,,,,,,,,,,,,,,,,,,,,,,,,,
2021-02-03T03:23:00Z,FTZ022,-23.4683333,150.9383333,0,30.236,,,,,,,,,,,,,,,,,,,,,,,,,,,,,,,,,,,,,,,,,,,,,,,,,,
2021-02-03T05:31:00Z,FTZ025,-23.2166667,150.96,0,1.244,,,,,,,,,,,,,,,,,,,,,,,,,,,,,,,,,,,,,,,,,,,,,,,,,,
2021-02-03T22:58:00Z,FTZ027,-23.0933333,150.9133333,0,1.269,,,,,,,,,,,,,,,,,,,,,,,,,,,,,,,,,,,,,,,,,,,,,,,,,,
2021-02-03T23:10:00Z,JCZ045,-14.23984,144.06859,0,0.304,,,,,,,,,,,,,,,,,,,,,,,,,,,,,,,,,,,,,,,,,,,,,,,,,,
2021-02-04T00:16:00Z,FTZ026,-23.1516667,151.07,0,0.214,,,,,,,,,,,,,,,,,,,,,,,,,,,,,,,,,,,,,,,,,,,,,,,,,,
2021-02-04T01:15:00Z,JCZ043,-14.375583,144.115917,0,2.934,,,,,,,,,,,,,,,,,,,,,,,,,,,,,,,,,,,,,,,,,,,,,,,,,,
2021-02-04T03:00:00Z,JCE002,-14.47245,143.972517,0,5.424,,,,,,,,,,,,,,,,,,,,,,,,,,,,,,,,,,,,,,,,,,,,,,,,,,
2021-02-04T03:45:00Z,JCE003,-14.424446,143.951246,0,1.534,,,,,,,,,,,,,,,,,,,,,,,,,,,,,,,,,,,,,,,,,,,,,,,,,,
2021-02-04T05:00:00Z,JCZ053,-14.24359,143.786414,0,0.754,,,,,,,,,,,,,,,,,,,,,,,,,,,,,,,,,,,,,,,,,,,,,,,,,,
2021-02-04T22:20:00Z,JCZ052,-13.882,143.72287,0,0.479,,,,,,,,,,,,,,,,,,,,,,,,,,,,,,,,,,,,,,,,,,,,,,,,,,
2021-02-04T23:10:00Z,JCZ051,-13.9265,143.73053,0,0.444,,,,,,,,,,,,,,,,,,,,,,,,,,,,,,,,,,,,,,,,,,,,,,,,,,
2021-02-05T00:00:00Z,JCZ050,-13.98672,143.71665,0,1.114,,,,,,,,,,,,,,,,,,,,,,,,,,,,,,,,,,,,,,,,,,,,,,,,,,
2021-02-05T00:45:00Z,JCZ049,-14.04495,143.6995,0,4.669,,,,,,,,,,,,,,,,,,,,,,,,,,,,,,,,,,,,,,,,,,,,,,,,,,
2021-02-05T03:00:00Z,JCZ047,-14.094567,144.02425,0,0.934,,,,,,,,,,,,,,,,,,,,,,,,,,,,,,,,,,,,,,,,,,,,,,,,,,
2021-02-05T03:55:00Z,JCZ046,-14.16915,144.04871,0,0.344,,,,,,,,,,,,,,,,,,,,,,,,,,,,,,,,,,,,,,,,,,,,,,,,,,
2021-02-06T21:50:00Z,JCZ058,-15.4145833,145.3163667,0,2.004,,,,,,,,,,,,,,,,,,,,,,,,,,,,,,,,,,,,,,,,,,,,,,,,,,
2021-02-06T22:07:00Z,WQQ275,-20.4683333,149.0383333,0,0.814,,,,,,,,,,,,,,,,,,,,,,,,,,,,,,,,,,,,,,,,,,,,,,,,,,
2021-02-06T23:19:00Z,JCZ059,-15.4425167,145.3999833,0,1.879,,,,,,,,,,,,,,,,,,,,,,,,,,,,,,,,,,,,,,,,,,,,,,,,,,
2021-02-07T00:45:00Z,JCZ056,-15.483,145.3251,0,2.244,,,,,,,,,,,,,,,,,,,,,,,,,,,,,,,,,,,,,,,,,,,,,,,,,,
2021-02-07T01:19:00Z,WQQ274,-20.5766667,148.7083333,0,0.569,,,,,,,,,,,,,,,,,,,,,,,,,,,,,,,,,,,,,,,,,,,,,,,,,,
2021-02-07T01:45:00Z,JCZ055,-15.5051833,145.2923667,0,1.494,,,,,,,,,,,,,,,,,,,,,,,,,,,,,,,,,,,,,,,,,,,,,,,,,,
2021-02-07T03:15:00Z,JCZ057,-15.4459667,145.2529333,0,2.394,,,,,,,,,,,,,,,,,,,,,,,,,,,,,,,,,,,,,,,,,,,,,,,,,,
2021-02-07T03:50:00Z,WQQ273,-20.5766667,148.8583333,0,0.994,,,,,,,,,,,,,,,,,,,,,,,,,,,,,,,,,,,,,,,,,,,,,,,,,,
2021-02-07T06:05:00Z,WQQ276,-20.3783333,148.8866667,0,1.009,,,,,,,,,,,,,,,,,,,,,,,,,,,,,,,,,,,,,,,,,,,,,,,,,,
2021-02-07T23:33:00Z,WQQ277,-20.105,148.72,0,1.249,,,,,,,,,,,,,,,,,,,,,,,,,,,,,,,,,,,,,,,,,,,,,,,,,,
2021-02-08T22:33:00Z,WQQ284,-19.5883333,147.5833333,0,2.459,,,,,,,,,,,,,,,,,,,,,,,,,,,,,,,,,,,,,,,,,,,,,,,,,,
2021-02-09T01:46:00Z,WQQ286,-19.3016667,147.6183333,0,0.784,,,,,,,,,,,,,,,,,,,,,,,,,,,,,,,,,,,,,,,,,,,,,,,,,,
2021-02-09T06:07:00Z,WQQ287,-19.2833333,147.1733333,0,0.117,,,,,,,,,,,,,,,,,,,,,,,,,,,,,,,,,,,,,,,,,,,,,,,,,,
2021-02-10T01:30:00Z,WQQ288,-19.1566667,146.8683333,0,0.914,,,,,,,,,,,,,,,,,,,,,,,,,,,,,,,,,,,,,,,,,,,,,,,,,,
2021-02-10T05:07:00Z,WQQ289,-18.8166667,146.4383333,0,0.05,,,,,,,,,,,,,,,,,,,,,,,,,,,,,,,,,,,,,,,,,,,,,,,,,,
2021-02-10T22:04:00Z,WQQ290,-18.5416667,146.4866667,0,0.534,,,,,,,,,,,,,,,,,,,,,,,,,,,,,,,,,,,,,,,,,,,,,,,,,,
2021-02-11T02:52:00Z,WQQ295,-18.0216667,146.075,0,5.939,,,,,,,,,,,,,,,,,,,,,,,,,,,,,,,,,,,,,,,,,,,,,,,,,,
2021-02-11T22:53:00Z,WQQ297,-17.89,146.26,0,0.092,,,,,,,,,,,,,,,,,,,,,,,,,,,,,,,,,,,,,,,,,,,,,,,,,,
2021-02-11T23:58:00Z,WQQ298,-17.9583333,146.19,0,0.369,,,,,,,,,,,,,,,,,,,,,,,,,,,,,,,,,,,,,,,,,,,,,,,,,,
2021-02-12T00:47:00Z,WQQ299,-18.0133333,146.1333333,0,1.039,,,,,,,,,,,,,,,,,,,,,,,,,,,,,,,,,,,,,,,,,,,,,,,,,,
2021-02-12T02:03:00Z,WQQ300,-17.9733333,146.115,0,3.149,,,,,,,,,,,,,,,,,,,,,,,,,,,,,,,,,,,,,,,,,,,,,,,,,,
2021-02-12T03:40:00Z,WQQ301,-17.9233333,146.1416667,0,1.629,,,,,,,,,,,,,,,,,,,,,,,,,,,,,,,,,,,,,,,,,,,,,,,,,,
2021-02-13T03:12:00Z,WQQ306,-17.225,146.0866667,0,0.199,,,,,,,,,,,,,,,,,,,,,,,,,,,,,,,,,,,,,,,,,,,,,,,,,,
2021-02-13T04:08:00Z,WQQ304,-17.2016667,145.99,0,2.234,,,,,,,,,,,,,,,,,,,,,,,,,,,,,,,,,,,,,,,,,,,,,,,,,,
2021-02-13T22:00:00Z,WQQ307,-17.1616667,146.005,0,0.529,,,,,,,,,,,,,,,,,,,,,,,,,,,,,,,,,,,,,,,,,,,,,,,,,,
2021-02-13T22:56:00Z,WQQ308,-17.0683333,145.9933333,0,0.194,,,,,,,,,,,,,,,,,,,,,,,,,,,,,,,,,,,,,,,,,,,,,,,,,,
2021-02-14T00:57:00Z,WQQ309,-16.92,145.995,0,0.082,,,,,,,,,,,,,,,,,,,,,,,,,,,,,,,,,,,,,,,,,,,,,,,,,,
2021-02-14T02:32:00Z,WQQ314,-16.7716667,145.955,0,0.05,,,,,,,,,,,,,,,,,,,,,,,,,,,,,,,,,,,,,,,,,,,,,,,,,,
2021-02-14T04:17:00Z,WQQ316,-16.7866667,145.7466667,0,0.704,,,,,,,,,,,,,,,,,,,,,,,,,,,,,,,,,,,,,,,,,,,,,,,,,,
2021-02-14T23:30:00Z,WQQ319,-16.1116667,145.4816667,0,0.129,,,,,,,,,,,,,,,,,,,,,,,,,,,,,,,,,,,,,,,,,,,,,,,,,,
2021-02-15T02:01:00Z,WQQ318,-16.4083333,145.5066667,0,0.269,,,,,,,,,,,,,,,,,,,,,,,,,,,,,,,,,,,,,,,,,,,,,,,,,,
2021-02-15T04:50:00Z,WQQ317,-16.6616667,145.705,0,0.05,,,,,,,,,,,,,,,,,,,,,,,,,,,,,,,,,,,,,,,,,,,,,,,,,,
2021-02-15T06:35:00Z,WQQ315,-16.8466667,145.8366667,0,0.959,,,,,,,,,,,,,,,,,,,,,,,,,,,,,,,,,,,,,,,,,,,,,,,,,,
2021-02-19T22:42:00Z,JCF001,-17.7936333,146.1445,0,3.708,,,,,,,,,,,,,,,,,,,,,,,,,,,,,,,,,,,,,,,,,,,,,,,,,,
2021-02-19T23:30:00Z,JCF002,-17.9259333,146.1462167,0,4.468,,,,,,,,,,,,,,,,,,,,,,,,,,,,,,,,,,,,,,,,,,,,,,,,,,
2021-02-20T00:06:00Z,JCF004,-17.9750667,146.1159167,0,11.976,,,,,,,,,,,,,,,,,,,,,,,,,,,,,,,,,,,,,,,,,,,,,,,,,,
2021-02-20T00:35:00Z,JCF006,-17.99715,146.0794167,0,31.62,,,,,,,,,,,,,,,,,,,,,,,,,,,,,,,,,,,,,,,,,,,,,,,,,,
2021-02-20T00:58:00Z,JCF007,-18.0225667,146.0744333,0,18.616,,,,,,,,,,,,,,,,,,,,,,,,,,,,,,,,,,,,,,,,,,,,,,,,,,
2021-02-20T01:36:00Z,JCF009,-18.03375,146.0558833,0,45.76,,,,,,,,,,,,,,,,,,,,,,,,,,,,,,,,,,,,,,,,,,,,,,,,,,
2021-02-20T02:13:00Z,JCF010,-18.014,146.1331333,0,11.936,,,,,,,,,,,,,,,,,,,,,,,,,,,,,,,,,,,,,,,,,,,,,,,,,,
2021-02-20T03:03:00Z,JCF013,-18.0559833,146.1875333,0,1.328,,,,,,,,,,,,,,,,,,,,,,,,,,,,,,,,,,,,,,,,,,,,,,,,,,
2021-02-20T03:42:00Z,JCF014,-17.95995,146.1910333,0,6.468,,,,,,,,,,,,,,,,,,,,,,,,,,,,,,,,,,,,,,,,,,,,,,,,,,
2021-02-20T04:13:00Z,JCF016,-17.8899667,146.2600833,0,4.948,,,,,,,,,,,,,,,,,,,,,,,,,,,,,,,,,,,,,,,,,,,,,,,,,,
2021-02-20T05:01:00Z,JCF018,-17.9312833,146.1041667,0,6.89714,,,,,,,,,,,,,,,,,,,,,,,,,,,,,,,,,,,,,,,,,,,,,,,,,,
2021-02-22T22:10:00Z,JCE004,-15.4301,145.2690167,0,5.974,,,,,,,,,,,,,,,,,,,,,,,,,,,,,,,,,,,,,,,,,,,,,,,,,,
2021-02-22T22:15:00Z,WQQ271,-20.5778833,148.7097333,0,2.659,,,,,,,,,,,,,,,,,,,,,,,,,,,,,,,,,,,,,,,,,,,,,,,,,,
2021-02-22T22:45:00Z,JCE005,-15.4145167,145.3164167,0,4.644,,,,,,,,,,,,,,,,,,,,,,,,,,,,,,,,,,,,,,,,,,,,,,,,,,
2021-02-22T23:28:00Z,WQQ270,-20.57675,148.86025,0,3.174,,,,,,,,,,,,,,,,,,,,,,,,,,,,,,,,,,,,,,,,,,,,,,,,,,
2021-02-22T23:40:00Z,JCE006,-15.4425333,145.4000333,0,5.504,,,,,,,,,,,,,,,,,,,,,,,,,,,,,,,,,,,,,,,,,,,,,,,,,,
2021-02-23T00:25:00Z,JCE007,-15.4829667,145.3251,0,4.794,,,,,,,,,,,,,,,,,,,,,,,,,,,,,,,,,,,,,,,,,,,,,,,,,,
2021-02-23T01:01:00Z,WQQ269,-20.46825,149.0395,0,1.089,,,,,,,,,,,,,,,,,,,,,,,,,,,,,,,,,,,,,,,,,,,,,,,,,,
2021-02-23T01:45:00Z,JCE008,-15.5047,145.2920833,0,11.228,,,,,,,,,,,,,,,,,,,,,,,,,,,,,,,,,,,,,,,,,,,,,,,,,,
2021-02-23T02:24:00Z,WQQ268,-20.3800833,148.8876667,0,0.909,,,,,,,,,,,,,,,,,,,,,,,,,,,,,,,,,,,,,,,,,,,,,,,,,,
2021-02-23T02:30:00Z,JCE009,-15.5245333,145.2775333,0,18.468,,,,,,,,,,,,,,,,,,,,,,,,,,,,,,,,,,,,,,,,,,,,,,,,,,
2021-02-23T03:20:00Z,JCE010,-15.4574,145.25027,0,17.576,,,,,,,,,,,,,,,,,,,,,,,,,,,,,,,,,,,,,,,,,,,,,,,,,,
2021-02-23T04:08:00Z,WQQ267,-20.1060667,148.7219667,0,1.069,,,,,,,,,,,,,,,,,,,,,,,,,,,,,,,,,,,,,,,,,,,,,,,,,,
2021-02-23T21:08:00Z,JCD053,-19.5886167,147.5821833,0,4.236,,,,,,,,,,,,,,,,,,,,,,,,,,,,,,,,,,,,,,,,,,,,,,,,,,
2021-02-23T23:35:00Z,JCD049,-19.2831,147.1741,0,2.668,,,,,,,,,,,,,,,,,,,,,,,,,,,,,,,,,,,,,,,,,,,,,,,,,,
2021-02-24T00:50:00Z,JCD050,-19.1568833,146.8685,0,2.828,,,,,,,,,,,,,,,,,,,,,,,,,,,,,,,,,,,,,,,,,,,,,,,,,,
2021-02-24T21:05:00Z,JCD051,-18.819929,146.435223,0,0.984,,,,,,,,,,,,,,,,,,,,,,,,,,,,,,,,,,,,,,,,,,,,,,,,,,
2021-02-24T22:08:00Z,JCD052,-18.5427833,146.4790167,0,1.854,,,,,,,,,,,,,,,,,,,,,,,,,,,,,,,,,,,,,,,,,,,,,,,,,,
2021-02-25T20:30:00Z,JCE011,-14.375583,144.115917,0,7.034,,,,,,,,,,,,,,,,,,,,,,,,,,,,,,,,,,,,,,,,,,,,,,,,,,
2021-02-26T01:00:00Z,JCZ065,-12.41165,143.35845,0,0.294,,,,,,,,,,,,,,,,,,,,,,,,,,,,,,,,,,,,,,,,,,,,,,,,,,
2021-02-26T01:30:00Z,JCZ064,-12.4628667,143.2838333,0,0.26353,,,,,,,,,,,,,,,,,,,,,,,,,,,,,,,,,,,,,,,,,,,,,,,,,,
2021-02-26T23:17:00Z,JCD046,-17.97486,146.11579,0,2.224,,,,,,,,,,,,,,,,,,,,,,,,,,,,,,,,,,,,,,,,,,,,,,,,,,
2021-02-26T23:55:00Z,JCD047,-18.02214,146.074,0,7.148,,,,,,,,,,,,,,,,,,,,,,,,,,,,,,,,,,,,,,,,,,,,,,,,,,
2021-02-27T00:38:00Z,JCD045,-18.01401,146.13325,0,1.088,,,,,,,,,,,,,,,,,,,,,,,,,,,,,,,,,,,,,,,,,,,,,,,,,,
2021-02-27T01:42:00Z,JCD044,-17.96005,146.19122,0,1.174,,,,,,,,,,,,,,,,,,,,,,,,,,,,,,,,,,,,,,,,,,,,,,,,,,
2021-02-27T02:24:00Z,JCD043,-17.88877,146.25971,0,0.164,,,,,,,,,,,,,,,,,,,,,,,,,,,,,,,,,,,,,,,,,,,,,,,,,,
2021-02-27T03:14:00Z,JCD042,-17.92564,146.14633,0,2.624,,,,,,,,,,,,,,,,,,,,,,,,,,,,,,,,,,,,,,,,,,,,,,,,,,
2021-02-28T00:23:00Z,JCZ068,-12.5062833,143.4407,0,0.474,,,,,,,,,,,,,,,,,,,,,,,,,,,,,,,,,,,,,,,,,,,,,,,,,,
2021-02-28T00:55:00Z,JCE013,-14.47245,143.972517,0,41.456,,,,,,,,,,,,,,,,,,,,,,,,,,,,,,,,,,,,,,,,,,,,,,,,,,
2021-02-28T01:00:00Z,JCZ067,-12.5111167,143.3711167,0,0.37778,,,,,,,,,,,,,,,,,,,,,,,,,,,,,,,,,,,,,,,,,,,,,,,,,,
2021-02-28T01:30:00Z,JCE012,-14.3971667,144.1451667,0,12.914,,,,,,,,,,,,,,,,,,,,,,,,,,,,,,,,,,,,,,,,,,,,,,,,,,
2021-02-28T01:57:00Z,JCZ070,-14.375583,144.115917,0,4.614,,,,,,,,,,,,,,,,,,,,,,,,,,,,,,,,,,,,,,,,,,,,,,,,,,
2021-02-28T02:05:00Z,JCZ066,-12.5085333,143.3010167,0,0.429,,,,,,,,,,,,,,,,,,,,,,,,,,,,,,,,,,,,,,,,,,,,,,,,,,
2021-02-28T02:52:00Z,JCZ071,-14.307367,144.090017,0,2.884,,,,,,,,,,,,,,,,,,,,,,,,,,,,,,,,,,,,,,,,,,,,,,,,,,
2021-02-28T03:00:00Z,JCZ063,-12.4996,143.2797167,0,4.588,,,,,,,,,,,,,,,,,,,,,,,,,,,,,,,,,,,,,,,,,,,,,,,,,,
2021-02-28T04:50:00Z,JCZ072,-14.23984,144.06859,0,1.814,,,,,,,,,,,,,,,,,,,,,,,,,,,,,,,,,,,,,,,,,,,,,,,,,,
2021-02-28T05:40:00Z,JCZ073,-14.16915,144.04871,0,1.204,,,,,,,,,,,,,,,,,,,,,,,,,,,,,,,,,,,,,,,,,,,,,,,,,,
2021-02-28T06:30:00Z,JCZ074,-14.094567,144.02425,0,0.494,,,,,,,,,,,,,,,,,,,,,,,,,,,,,,,,,,,,,,,,,,,,,,,,,,
2021-02-28T22:00:00Z,JCE014,-14.47245,143.972517,0,54.136,,,,,,,,,,,,,,,,,,,,,,,,,,,,,,,,,,,,,,,,,,,,,,,,,,
2021-03-01T00:00:00Z,JCE015,-14.424446,143.951246,0,2.914,,,,,,,,,,,,,,,,,,,,,,,,,,,,,,,,,,,,,,,,,,,,,,,,,,
2021-03-01T03:00:00Z,JCZ080,-14.24359,143.786414,0,1.054,,,,,,,,,,,,,,,,,,,,,,,,,,,,,,,,,,,,,,,,,,,,,,,,,,
2021-03-01T04:20:00Z,JCZ076,-14.04495,143.6995,0,18.496,,,,,,,,,,,,,,,,,,,,,,,,,,,,,,,,,,,,,,,,,,,,,,,,,,
2021-03-01T05:20:00Z,JCZ077,-13.98672,143.71665,0,1.924,,,,,,,,,,,,,,,,,,,,,,,,,,,,,,,,,,,,,,,,,,,,,,,,,,
2021-03-01T06:11:00Z,JCZ079,-13.882,143.72287,0,0.754,,,,,,,,,,,,,,,,,,,,,,,,,,,,,,,,,,,,,,,,,,,,,,,,,,
2021-03-09T21:32:00Z,FTZ008,-23.4707333,150.9397333,0,12.296,,,,,,,,,,,,,,,,,,,,,,,,,,,,,,,,,,,,,,,,,,,,,,,,,,
2021-03-09T23:08:00Z,FTZ013,-23.15155,151.0691667,0,0.368,,,,,,,,,,,,,,,,,,,,,,,,,,,,,,,,,,,,,,,,,,,,,,,,,,
2021-03-09T23:57:00Z,FTZ011,-23.09215,150.9131667,0,0.719,,,,,,,,,,,,,,,,,,,,,,,,,,,,,,,,,,,,,,,,,,,,,,,,,,
2021-03-10T00:43:00Z,FTZ009,-23.2167667,150.9600167,0,1.088,,,,,,,,,,,,,,,,,,,,,,,,,,,,,,,,,,,,,,,,,,,,,,,,,,
2021-03-10T01:15:00Z,FTZ010,-23.2327,150.873,0,1.876,,,,,,,,,,,,,,,,,,,,,,,,,,,,,,,,,,,,,,,,,,,,,,,,,,
2021-03-10T01:57:00Z,FTZ012,-23.3409667,150.9050333,0,1.814,,,,,,,,,,,,,,,,,,,,,,,,,,,,,,,,,,,,,,,,,,,,,,,,,,
2021-03-15T00:33:00Z,JCD040,-17.0690833,145.994,0,0.509,,,,,,,,,,,,,,,,,,,,,,,,,,,,,,,,,,,,,,,,,,,,,,,,,,
2021-03-15T01:20:00Z,JCD039,-17.1634167,146.0048333,0,0.824,,,,,,,,,,,,,,,,,,,,,,,,,,,,,,,,,,,,,,,,,,,,,,,,,,
2021-03-15T02:15:00Z,JCD038,-17.2265667,146.0875,0,0.364,,,,,,,,,,,,,,,,,,,,,,,,,,,,,,,,,,,,,,,,,,,,,,,,,,
2021-03-15T02:51:00Z,WQQ334,-20.10585,148.7221333,0,1.509,,,,,,,,,,,,,,,,,,,,,,,,,,,,,,,,,,,,,,,,,,,,,,,,,,
2021-03-15T03:06:00Z,JCD037,-17.2030167,145.9783667,0,1.809,,,,,,,,,,,,,,,,,,,,,,,,,,,,,,,,,,,,,,,,,,,,,,,,,,
2021-03-15T04:45:00Z,WQQ335,-20.3798833,148.8875667,0,1.959,,,,,,,,,,,,,,,,,,,,,,,,,,,,,,,,,,,,,,,,,,,,,,,,,,
2021-03-15T22:15:00Z,WQQ337,-20.5765833,148.8599167,0,6.524,,,,,,,,,,,,,,,,,,,,,,,,,,,,,,,,,,,,,,,,,,,,,,,,,,
2021-03-15T23:28:00Z,WQQ338,-20.5782333,148.7095167,0,1.734,,,,,,,,,,,,,,,,,,,,,,,,,,,,,,,,,,,,,,,,,,,,,,,,,,
2021-03-16T01:16:00Z,WQQ336,-20.4680167,149.0394333,0,2.619,,,,,,,,,,,,,,,,,,,,,,,,,,,,,,,,,,,,,,,,,,,,,,,,,,
2021-03-20T23:57:00Z,JCZ094,-12.5064167,143.4403833,0,0.204,,,,,,,,,,,,,,,,,,,,,,,,,,,,,,,,,,,,,,,,,,,,,,,,,,
2021-03-21T01:16:00Z,JCZ093,-12.5111167,143.3707167,0,0.674,,,,,,,,,,,,,,,,,,,,,,,,,,,,,,,,,,,,,,,,,,,,,,,,,,
2021-03-21T01:56:00Z,JCZ092,-12.50855,143.3006,0,0.994,,,,,,,,,,,,,,,,,,,,,,,,,,,,,,,,,,,,,,,,,,,,,,,,,,
2021-03-21T02:46:00Z,JCZ089,-12.4996833,143.2803333,0,31.335,,,,,,,,,,,,,,,,,,,,,,,,,,,,,,,,,,,,,,,,,,,,,,,,,,
2021-03-21T23:20:00Z,JCZ082,-15.5051,145.2923,0,4.124,,,,,,,,,,,,,,,,,,,,,,,,,,,,,,,,,,,,,,,,,,,,,,,,,,
2021-03-22T00:35:00Z,JCZ083,-15.483,145.3251,0,5.994,,,,,,,,,,,,,,,,,,,,,,,,,,,,,,,,,,,,,,,,,,,,,,,,,,
2021-03-22T02:20:00Z,JCZ084,-15.4425,145.3999,0,3.844,,,,,,,,,,,,,,,,,,,,,,,,,,,,,,,,,,,,,,,,,,,,,,,,,,
2021-03-22T03:15:00Z,JCZ085,-15.4146167,145.3163667,0,3.844,,,,,,,,,,,,,,,,,,,,,,,,,,,,,,,,,,,,,,,,,,,,,,,,,,
2021-03-22T04:15:00Z,JCZ086,-15.4303,145.2689,0,2.474,,,,,,,,,,,,,,,,,,,,,,,,,,,,,,,,,,,,,,,,,,,,,,,,,,
2021-03-22T23:08:00Z,JCZ090,-12.4624167,143.2837333,0,1.564,,,,,,,,,,,,,,,,,,,,,,,,,,,,,,,,,,,,,,,,,,,,,,,,,,
2021-03-22T23:53:00Z,JCZ091,-12.4118167,143.35855,0,0.234,,,,,,,,,,,,,,,,,,,,,,,,,,,,,,,,,,,,,,,,,,,,,,,,,,
2021-03-23T21:11:00Z,JCD059,-19.5901333,147.5809,0,2.384,,,,,,,,,,,,,,,,,,,,,,,,,,,,,,,,,,,,,,,,,,,,,,,,,,
2021-03-24T00:00:00Z,JCD055,-19.2844167,147.173,0,0.894,,,,,,,,,,,,,,,,,,,,,,,,,,,,,,,,,,,,,,,,,,,,,,,,,,
2021-03-24T00:35:00Z,JCZ100,-14.0945333,144.0240833,0,1.71657,,,,,,,,,,,,,,,,,,,,,,,,,,,,,,,,,,,,,,,,,,,,,,,,,,
2021-03-24T01:15:00Z,JCD056,-19.1565833,146.868,0,1.184,,,,,,,,,,,,,,,,,,,,,,,,,,,,,,,,,,,,,,,,,,,,,,,,,,
2021-03-24T01:30:00Z,JCZ099,-14.1690833,144.0488333,0,1.95208,,,,,,,,,,,,,,,,,,,,,,,,,,,,,,,,,,,,,,,,,,,,,,,,,,
2021-03-24T02:25:00Z,JCZ098,-14.23965,144.0686833,0,2.204,,,,,,,,,,,,,,,,,,,,,,,,,,,,,,,,,,,,,,,,,,,,,,,,,,
2021-03-24T03:20:00Z,JCZ097,-14.3074667,144.0899667,0,2.334,,,,,,,,,,,,,,,,,,,,,,,,,,,,,,,,,,,,,,,,,,,,,,,,,,
2021-03-24T04:10:00Z,JCZ096,-14.37315,144.1157167,0,3.192,,,,,,,,,,,,,,,,,,,,,,,,,,,,,,,,,,,,,,,,,,,,,,,,,,
2021-03-24T05:10:00Z,JCD058,-18.54455,146.468,0,0.809,,,,,,,,,,,,,,,,,,,,,,,,,,,,,,,,,,,,,,,,,,,,,,,,,,
2021-03-24T06:15:00Z,JCD057,-18.8216833,146.4339833,0,1.354,,,,,,,,,,,,,,,,,,,,,,,,,,,,,,,,,,,,,,,,,,,,,,,,,,
2021-03-24T06:15:00Z,JCZ106,-14.2434333,144.78625,0,1.42083,,,,,,,,,,,,,,,,,,,,,,,,,,,,,,,,,,,,,,,,,,,,,,,,,,
2021-03-24T21:40:00Z,JCZ103,-13.9863,143.7163,0,1.634,,,,,,,,,,,,,,,,,,,,,,,,,,,,,,,,,,,,,,,,,,,,,,,,,,
2021-03-24T22:20:00Z,JCZ102,-14.0445833,143.7003,0,5.314,,,,,,,,,,,,,,,,,,,,,,,,,,,,,,,,,,,,,,,,,,,,,,,,,,
2021-03-25T22:00:00Z,JCZ105,-13.8817167,143.7237167,0,2.224,,,,,,,,,,,,,,,,,,,,,,,,,,,,,,,,,,,,,,,,,,,,,,,,,,
2021-03-25T22:55:00Z,JCZ104,-13.9261667,143.73055,0,4.024,,,,,,,,,,,,,,,,,,,,,,,,,,,,,,,,,,,,,,,,,,,,,,,,,,
2021-04-06T22:02:00Z,WQQ321,-17.20285,145.97885,0,1.434,,,,,,,,,,,,,,,,,,,,,,,,,,,,,,,,,,,,,,,,,,,,,,,,,,
2021-04-06T23:08:00Z,WQQ322,-17.0689,145.9941,0,1.014,,,,,,,,,,,,,,,,,,,,,,,,,,,,,,,,,,,,,,,,,,,,,,,,,,
2021-04-07T00:25:00Z,WQQ323,-16.92005,145.9972333,0,0.804,,,,,,,,,,,,,,,,,,,,,,,,,,,,,,,,,,,,,,,,,,,,,,,,,,
2021-04-07T02:02:00Z,WQQ324,-17.1627333,146.0043167,0,1.334,,,,,,,,,,,,,,,,,,,,,,,,,,,,,,,,,,,,,,,,,,,,,,,,,,
2021-04-07T03:16:00Z,WQQ325,-17.2266,146.0873667,0,0.664,,,,,,,,,,,,,,,,,,,,,,,,,,,,,,,,,,,,,,,,,,,,,,,,,,
2021-04-07T20:54:00Z,JCD077,-19.5898167,147.5804833,0,8.538,,,,,,,,,,,,,,,,,,,,,,,,,,,,,,,,,,,,,,,,,,,,,,,,,,
2021-04-07T22:17:00Z,WQQ327,-17.8898167,146.2605333,0,0.05,,,,,,,,,,,,,,,,,,,,,,,,,,,,,,,,,,,,,,,,,,,,,,,,,,
2021-04-07T23:32:00Z,WQQ328,-17.9602833,146.1906167,0,0.214,,,,,,,,,,,,,,,,,,,,,,,,,,,,,,,,,,,,,,,,,,,,,,,,,,
2021-04-07T23:42:00Z,JCD073,-19.2835,147.1730667,0,2.004,,,,,,,,,,,,,,,,,,,,,,,,,,,,,,,,,,,,,,,,,,,,,,,,,,
2021-04-08T00:37:00Z,WQQ329,-18.01415,146.1339667,0,0.499,,,,,,,,,,,,,,,,,,,,,,,,,,,,,,,,,,,,,,,,,,,,,,,,,,
2021-04-08T00:55:00Z,JCD074,-19.1565,146.86765,0,1.094,,,,,,,,,,,,,,,,,,,,,,,,,,,,,,,,,,,,,,,,,,,,,,,,,,
2021-04-08T01:31:00Z,WQQ330,-18.0222833,146.0742333,0,2.458,,,,,,,,,,,,,,,,,,,,,,,,,,,,,,,,,,,,,,,,,,,,,,,,,,
2021-04-08T02:29:00Z,JCD075,-18.8154,146.4335833,0,0.734,,,,,,,,,,,,,,,,,,,,,,,,,,,,,,,,,,,,,,,,,,,,,,,,,,
2021-04-08T02:30:00Z,WQQ331,-17.97535,146.1166333,0,0.659,,,,,,,,,,,,,,,,,,,,,,,,,,,,,,,,,,,,,,,,,,,,,,,,,,
2021-04-08T03:26:00Z,WQQ332,-17.92475,146.1431333,0,0.329,,,,,,,,,,,,,,,,,,,,,,,,,,,,,,,,,,,,,,,,,,,,,,,,,,
2021-04-08T03:33:00Z,JCD076,-18.5449833,146.4677,0,0.664,,,,,,,,,,,,,,,,,,,,,,,,,,,,,,,,,,,,,,,,,,,,,,,,,,
2021-04-08T21:48:00Z,FTZ015,-23.4705833,150.9395833,0,6.018,,,,,,,,,,,,,,,,,,,,,,,,,,,,,,,,,,,,,,,,,,,,,,,,,,
2021-04-08T22:20:00Z,JCZ117,-12.4625167,143.2840667,0,0.384,,,,,,,,,,,,,,,,,,,,,,,,,,,,,,,,,,,,,,,,,,,,,,,,,,
2021-04-08T22:53:00Z,FTZ019,-23.1514667,151.0689833,0,0.539,,,,,,,,,,,,,,,,,,,,,,,,,,,,,,,,,,,,,,,,,,,,,,,,,,
2021-04-08T23:45:00Z,JCZ118,-12.4117,143.3586167,0,0.674,,,,,,,,,,,,,,,,,,,,,,,,,,,,,,,,,,,,,,,,,,,,,,,,,,
2021-04-08T23:48:00Z,FTZ020,-23.0922,150.9132667,0,1.049,,,,,,,,,,,,,,,,,,,,,,,,,,,,,,,,,,,,,,,,,,,,,,,,,,
2021-04-09T00:42:00Z,FTZ018,-23.2167167,150.96,0,0.794,,,,,,,,,,,,,,,,,,,,,,,,,,,,,,,,,,,,,,,,,,,,,,,,,,
2021-04-09T01:20:00Z,FTZ017,-23.2327167,150.8730167,0,1.654,,,,,,,,,,,,,,,,,,,,,,,,,,,,,,,,,,,,,,,,,,,,,,,,,,
2021-04-09T02:03:00Z,FTZ016,-23.3410333,150.9049833,0,2.488,,,,,,,,,,,,,,,,,,,,,,,,,,,,,,,,,,,,,,,,,,,,,,,,,,
2021-04-10T23:17:00Z,JCZ121,-12.50665,143.4409333,0,0.174,,,,,,,,,,,,,,,,,,,,,,,,,,,,,,,,,,,,,,,,,,,,,,,,,,
2021-04-11T00:45:00Z,JCZ120,-12.511,143.3707667,0,0.194,,,,,,,,,,,,,,,,,,,,,,,,,,,,,,,,,,,,,,,,,,,,,,,,,,
2021-04-11T01:40:00Z,JCZ119,-12.5087333,143.3005833,0,0.429,,,,,,,,,,,,,,,,,,,,,,,,,,,,,,,,,,,,,,,,,,,,,,,,,,
2021-04-11T02:20:00Z,JCZ116,-12.4996167,143.28015,0,4.04667,,,,,,,,,,,,,,,,,,,,,,,,,,,,,,,,,,,,,,,,,,,,,,,,,,
2021-04-20T23:17:00Z,JCD071,-17.9251167,146.1470167,0,3.024,,,,,,,,,,,,,,,,,,,,,,,,,,,,,,,,,,,,,,,,,,,,,,,,,,
2021-04-21T00:02:00Z,JCD070,-17.97455,146.1156333,0,2.274,,,,,,,,,,,,,,,,,,,,,,,,,,,,,,,,,,,,,,,,,,,,,,,,,,
2021-04-21T00:38:00Z,JCD066,-18.0216333,146.0741,0,28.076,,,,,,,,,,,,,,,,,,,,,,,,,,,,,,,,,,,,,,,,,,,,,,,,,,
2021-04-21T00:55:00Z,JCE016,-15.48533,145.3089,0,1.764,,,,,,,,,,,,,,,,,,,,,,,,,,,,,,,,,,,,,,,,,,,,,,,,,,
2021-04-21T01:31:00Z,JCD069,-18.0143667,146.1328,0,4.334,,,,,,,,,,,,,,,,,,,,,,,,,,,,,,,,,,,,,,,,,,,,,,,,,,
2021-04-21T01:35:00Z,JCE017,-15.5044,145.2924167,0,18.016,,,,,,,,,,,,,,,,,,,,,,,,,,,,,,,,,,,,,,,,,,,,,,,,,,
2021-04-21T02:15:00Z,JCE018,-15.5243833,145.2780167,0,117.4,,,,,,,,,,,,,,,,,,,,,,,,,,,,,,,,,,,,,,,,,,,,,,,,,,
2021-04-21T02:43:00Z,JCD068,-17.9601333,146.1912333,0,5.324,,,,,,,,,,,,,,,,,,,,,,,,,,,,,,,,,,,,,,,,,,,,,,,,,,
2021-04-21T03:10:00Z,JCE019,-15.4141333,145.3156833,0,3.38,,,,,,,,,,,,,,,,,,,,,,,,,,,,,,,,,,,,,,,,,,,,,,,,,,
2021-04-21T03:31:00Z,JCD067,-17.8899167,146.2598833,0,0.964,,,,,,,,,,,,,,,,,,,,,,,,,,,,,,,,,,,,,,,,,,,,,,,,,,
2021-04-21T04:10:00Z,JCE020,-15.43155,145.2684833,0,5.088,,,,,,,,,,,,,,,,,,,,,,,,,,,,,,,,,,,,,,,,,,,,,,,,,,
2021-04-21T04:40:00Z,JCE021,-15.4574167,145.2502667,0,16.24,,,,,,,,,,,,,,,,,,,,,,,,,,,,,,,,,,,,,,,,,,,,,,,,,,
2021-05-06T00:10:00Z,JCD064,-17.0689667,145.9939333,0,1.689,,,,,,,,,,,,,,,,,,,,,,,,,,,,,,,,,,,,,,,,,,,,,,,,,,
2021-05-06T01:13:00Z,JCD063,-17.1636667,146.0047167,0,1.784,,,,,,,,,,,,,,,,,,,,,,,,,,,,,,,,,,,,,,,,,,,,,,,,,,
2021-05-06T02:09:00Z,JCD062,-17.2269,146.08775,0,0.474,,,,,,,,,,,,,,,,,,,,,,,,,,,,,,,,,,,,,,,,,,,,,,,,,,
2021-05-06T02:49:00Z,JCD061,-17.2027833,145.97835,0,3.438,,,,,,,,,,,,,,,,,,,,,,,,,,,,,,,,,,,,,,,,,,,,,,,,,,
2021-05-06T22:00:00Z,FTZ032,-23.4795333,150.9394833,0,8.458,,,,,,,,,,,,,,,,,,,,,,,,,,,,,,,,,,,,,,,,,,,,,,,,,,
2021-05-06T23:10:00Z,FTZ036,-23.1515333,151.0689833,0,0.324,,,,,,,,,,,,,,,,,,,,,,,,,,,,,,,,,,,,,,,,,,,,,,,,,,
2021-05-07T00:00:00Z,FTZ037,-23.0922,150.9132833,0,0.739,,,,,,,,,,,,,,,,,,,,,,,,,,,,,,,,,,,,,,,,,,,,,,,,,,
2021-05-07T00:40:00Z,FTZ035,-23.2167333,150.95995,0,0.519,,,,,,,,,,,,,,,,,,,,,,,,,,,,,,,,,,,,,,,,,,,,,,,,,,
2021-05-07T01:00:00Z,FTZ034,-23.2326833,150.8730167,0,3.258,,,,,,,,,,,,,,,,,,,,,,,,,,,,,,,,,,,,,,,,,,,,,,,,,,
2021-05-07T01:50:00Z,FTZ033,-23.3410167,150.9050167,0,2.418,,,,,,,,,,,,,,,,,,,,,,,,,,,,,,,,,,,,,,,,,,,,,,,,,,
2021-05-31T23:53:00Z,FTZ053,-23.4705,150.9386667,0,30.856,,,,,,,,,,,,,,,,,,,,,,,,,,,,,,,,,,,,,,,,,,,,,,,,,,
2021-06-01T02:00:00Z,FTZ055,-23.3411667,150.904,0,6.618,,,,,,,,,,,,,,,,,,,,,,,,,,,,,,,,,,,,,,,,,,,,,,,,,,
2021-06-01T03:00:00Z,FTZ056,-23.2325,150.8733333,0,2.728,,,,,,,,,,,,,,,,,,,,,,,,,,,,,,,,,,,,,,,,,,,,,,,,,,
2021-06-01T22:05:00Z,FTZ057,-23.2173333,150.961,0,0.474,,,,,,,,,,,,,,,,,,,,,,,,,,,,,,,,,,,,,,,,,,,,,,,,,,
2021-06-02T02:58:00Z,FTZ058,-23.1511667,151.0685,0,0.369,,,,,,,,,,,,,,,,,,,,,,,,,,,,,,,,,,,,,,,,,,,,,,,,,,
2021-06-02T04:15:00Z,FTZ059,-23.0925,150.9121667,0,0.254,,,,,,,,,,,,,,,,,,,,,,,,,,,,,,,,,,,,,,,,,,,,,,,,,,
2021-06-03T21:00:00Z,JCZ108,-15.50526,145.29223,0,1.364,,,,,,,,,,,,,,,,,,,,,,,,,,,,,,,,,,,,,,,,,,,,,,,,,,
2021-06-03T22:10:00Z,JCZ109,-15.48301,145.32498,0,3.574,,,,,,,,,,,,,,,,,,,,,,,,,,,,,,,,,,,,,,,,,,,,,,,,,,
2021-06-03T22:50:00Z,JCZ112,-15.4425,145.4001,0,0.514,,,,,,,,,,,,,,,,,,,,,,,,,,,,,,,,,,,,,,,,,,,,,,,,,,
2021-06-04T00:15:00Z,JCZ111,-15.41452,145.3163,0,0.75779,,,,,,,,,,,,,,,,,,,,,,,,,,,,,,,,,,,,,,,,,,,,,,,,,,
2021-06-04T00:35:00Z,JCZ110,-15.4317,145.2687,0,0.914,,,,,,,,,,,,,,,,,,,,,,,,,,,,,,,,,,,,,,,,,,,,,,,,,,
2021-06-04T02:04:00Z,WQQ341,-20.5778333,148.7103333,0,2.508,,,,,,,,,,,,,,,,,,,,,,,,,,,,,,,,,,,,,,,,,,,,,,,,,,
2021-06-04T03:46:00Z,WQQ340,-20.577,148.8605,0,0.984,,,,,,,,,,,,,,,,,,,,,,,,,,,,,,,,,,,,,,,,,,,,,,,,,,
2021-06-04T05:43:00Z,WQQ343,-20.4684333,149.0407,0,1.254,,,,,,,,,,,,,,,,,,,,,,,,,,,,,,,,,,,,,,,,,,,,,,,,,,
2021-06-04T22:50:00Z,WQQ344,-20.3796833,148.8873833,0,1.004,,,,,,,,,,,,,,,,,,,,,,,,,,,,,,,,,,,,,,,,,,,,,,,,,,
2021-06-05T01:02:00Z,WQQ345,-20.1082,148.7275833,0,1.279,,,,,,,,,,,,,,,,,,,,,,,,,,,,,,,,,,,,,,,,,,,,,,,,,,
2021-06-05T22:36:00Z,WQQ350,-19.5873333,147.58245,0,11.288,,,,,,,,,,,,,,,,,,,,,,,,,,,,,,,,,,,,,,,,,,,,,,,,,,
2021-06-06T01:51:00Z,WQQ352,-19.2992667,147.6215667,0,0.149,,,,,,,,,,,,,,,,,,,,,,,,,,,,,,,,,,,,,,,,,,,,,,,,,,
2021-06-06T23:06:00Z,WQQ353,-19.28225,147.1741,0,1.669,,,,,,,,,,,,,,,,,,,,,,,,,,,,,,,,,,,,,,,,,,,,,,,,,,
2021-06-07T04:05:00Z,WQQ354,-19.15755,146.8694167,0,2.439,,,,,,,,,,,,,,,,,,,,,,,,,,,,,,,,,,,,,,,,,,,,,,,,,,
2021-06-08T00:44:00Z,WQQ355,-18.81735,146.4392167,0,1.729,,,,,,,,,,,,,,,,,,,,,,,,,,,,,,,,,,,,,,,,,,,,,,,,,,
2021-06-08T03:04:00Z,WQQ356,-18.5422167,146.4870667,0,1.484,,,,,,,,,,,,,,,,,,,,,,,,,,,,,,,,,,,,,,,,,,,,,,,,,,
2021-06-08T23:27:00Z,WQQ361,-18.0226833,146.0743167,0,2.209,,,,,,,,,,,,,,,,,,,,,,,,,,,,,,,,,,,,,,,,,,,,,,,,,,
2021-06-09T22:01:00Z,WQQ363,-17.8898667,146.2611333,0,0.524,,,,,,,,,,,,,,,,,,,,,,,,,,,,,,,,,,,,,,,,,,,,,,,,,,
2021-06-09T23:03:00Z,WQQ364,-17.9604333,146.1904167,0,0.834,,,,,,,,,,,,,,,,,,,,,,,,,,,,,,,,,,,,,,,,,,,,,,,,,,
2021-06-10T00:00:00Z,WQQ365,-18.0138833,146.1341,0,0.919,,,,,,,,,,,,,,,,,,,,,,,,,,,,,,,,,,,,,,,,,,,,,,,,,,
2021-06-10T00:45:00Z,WQQ366,-17.9744667,146.1187333,0,1.304,,,,,,,,,,,,,,,,,,,,,,,,,,,,,,,,,,,,,,,,,,,,,,,,,,
2021-06-10T01:42:00Z,WQQ367,-17.9239667,146.1437667,0,1.434,,,,,,,,,,,,,,,,,,,,,,,,,,,,,,,,,,,,,,,,,,,,,,,,,,
2021-06-11T00:21:00Z,WQQ372,-17.2268667,146.0878833,0,0.509,,,,,,,,,,,,,,,,,,,,,,,,,,,,,,,,,,,,,,,,,,,,,,,,,,
2021-06-11T01:15:00Z,WQQ370,-17.2034667,145.9793667,0,1.964,,,,,,,,,,,,,,,,,,,,,,,,,,,,,,,,,,,,,,,,,,,,,,,,,,
2021-06-11T04:18:00Z,WQQ373,-17.1629667,146.0051667,0,1.094,,,,,,,,,,,,,,,,,,,,,,,,,,,,,,,,,,,,,,,,,,,,,,,,,,
2021-06-11T05:11:00Z,WQQ374,-17.0701,145.9941333,0,0.969,,,,,,,,,,,,,,,,,,,,,,,,,,,,,,,,,,,,,,,,,,,,,,,,,,
2021-06-11T22:24:00Z,WQQ375,-16.9211667,145.9967,0,0.884,,,,,,,,,,,,,,,,,,,,,,,,,,,,,,,,,,,,,,,,,,,,,,,,,,
2021-06-11T23:31:00Z,WQQ380,-16.7737167,145.95505,0,0.087,,,,,,,,,,,,,,,,,,,,,,,,,,,,,,,,,,,,,,,,,,,,,,,,,,
2021-06-12T00:44:00Z,WQQ381,-16.8488333,145.8356333,0,1.394,,,,,,,,,,,,,,,,,,,,,,,,,,,,,,,,,,,,,,,,,,,,,,,,,,
2021-06-12T01:34:00Z,WQQ382,-16.7867,145.74675,0,1.919,,,,,,,,,,,,,,,,,,,,,,,,,,,,,,,,,,,,,,,,,,,,,,,,,,
2021-06-12T02:32:00Z,WQQ383,-16.6626,145.7051833,0,0.839,,,,,,,,,,,,,,,,,,,,,,,,,,,,,,,,,,,,,,,,,,,,,,,,,,
2021-06-12T04:39:00Z,WQQ384,-16.4100833,145.5081333,0,0.759,,,,,,,,,,,,,,,,,,,,,,,,,,,,,,,,,,,,,,,,,,,,,,,,,,
2021-06-12T21:56:00Z,WQQ385,-16.1134833,145.4839,0,0.434,,,,,,,,,,,,,,,,,,,,,,,,,,,,,,,,,,,,,,,,,,,,,,,,,,
2021-06-14T23:24:00Z,FTZ039,-23.4705167,150.9395167,0,10.328,,,,,,,,,,,,,,,,,,,,,,,,,,,,,,,,,,,,,,,,,,,,,,,,,,
2021-06-15T00:59:00Z,FTZ043,-23.1515,151.0690333,0,0.664,,,,,,,,,,,,,,,,,,,,,,,,,,,,,,,,,,,,,,,,,,,,,,,,,,
2021-06-15T01:55:00Z,FTZ044,-23.0922,150.9132167,0,0.199,,,,,,,,,,,,,,,,,,,,,,,,,,,,,,,,,,,,,,,,,,,,,,,,,,
2021-06-15T02:51:00Z,FTZ042,-23.2167,150.9600167,0,0.849,,,,,,,,,,,,,,,,,,,,,,,,,,,,,,,,,,,,,,,,,,,,,,,,,,
2021-06-15T03:13:00Z,FTZ041,-23.23275,150.87305,0,1.029,,,,,,,,,,,,,,,,,,,,,,,,,,,,,,,,,,,,,,,,,,,,,,,,,,
2021-06-15T04:12:00Z,FTZ040,-23.3410167,150.9050167,0,1.189,,,,,,,,,,,,,,,,,,,,,,,,,,,,,,,,,,,,,,,,,,,,,,,,,,
2021-07-14T00:28:00Z,JCD089,-17.92615,146.1460833,0,3.214,,,,,,,,,,,,,,,,,,,,,,,,,,,,,,,,,,,,,,,,,,,,,,,,,,
2021-07-14T01:06:00Z,JCD088,-17.9753333,146.1159667,0,1.894,,,,,,,,,,,,,,,,,,,,,,,,,,,,,,,,,,,,,,,,,,,,,,,,,,
2021-07-14T01:40:00Z,JCD084,-18.0223667,146.0747333,0,8.545335,,,,,,,,,,,,,,,,,,,,,,,,,,,,,,,,,,,,,,,,,,,,,,,,,,
2021-07-14T02:22:00Z,JCD087,-18.01395,146.1331833,0,2.828,,,,,,,,,,,,,,,,,,,,,,,,,,,,,,,,,,,,,,,,,,,,,,,,,,
2021-07-14T02:53:00Z,JCD086,-17.96,146.1912,0,0.964,,,,,,,,,,,,,,,,,,,,,,,,,,,,,,,,,,,,,,,,,,,,,,,,,,
2021-07-14T03:35:00Z,JCD085,-17.8901333,146.2600167,0,0.704,,,,,,,,,,,,,,,,,,,,,,,,,,,,,,,,,,,,,,,,,,,,,,,,,,
2021-07-16T02:38:00Z,JCD082,-17.0703667,145.9938833,0,0.634,,,,,,,,,,,,,,,,,,,,,,,,,,,,,,,,,,,,,,,,,,,,,,,,,,
2021-07-16T03:22:00Z,JCD081,-17.1632167,146.0054167,0,0.964,,,,,,,,,,,,,,,,,,,,,,,,,,,,,,,,,,,,,,,,,,,,,,,,,,
2021-07-16T04:14:00Z,JCD080,-17.2272167,146.08985,0,2.324,,,,,,,,,,,,,,,,,,,,,,,,,,,,,,,,,,,,,,,,,,,,,,,,,,
2021-07-16T04:55:00Z,JCD079,-17.2030333,145.9788833,0,1.848,,,,,,,,,,,,,,,,,,,,,,,,,,,,,,,,,,,,,,,,,,,,,,,,,,
2021-07-18T21:52:00Z,FTZ046,-23.4705667,150.9395,0,28.688,,,,,,,,,,,,,,,,,,,,,,,,,,,,,,,,,,,,,,,,,,,,,,,,,,
2021-07-18T22:36:00Z,FTZ047,-23.341,150.9050333,0,1.124,,,,,,,,,,,,,,,,,,,,,,,,,,,,,,,,,,,,,,,,,,,,,,,,,,
2021-07-18T23:15:00Z,FTZ048,-23.2326667,150.8731333,0,0.714,,,,,,,,,,,,,,,,,,,,,,,,,,,,,,,,,,,,,,,,,,,,,,,,,,
2021-07-18T23:53:00Z,FTZ049,-23.2166833,150.9600167,0,0.354,,,,,,,,,,,,,,,,,,,,,,,,,,,,,,,,,,,,,,,,,,,,,,,,,,
2021-07-19T00:37:00Z,FTZ051,-23.0921667,150.9131667,0,0.374,,,,,,,,,,,,,,,,,,,,,,,,,,,,,,,,,,,,,,,,,,,,,,,,,,
2021-07-19T01:32:00Z,FTZ050,-23.1515167,151.0690667,0,0.244,,,,,,,,,,,,,,,,,,,,,,,,,,,,,,,,,,,,,,,,,,,,,,,,,,
2021-07-27T21:34:00Z,FTZ063,-23.4708167,150.9399667,0,24.792,,,,,,,,,,,,,,,,,,,,,,,,,,,,,,,,,,,,,,,,,,,,,,,,,,
2021-07-27T22:25:00Z,FTZ064,-23.3409333,150.9049,0,5.034,,,,,,,,,,,,,,,,,,,,,,,,,,,,,,,,,,,,,,,,,,,,,,,,,,
2021-07-27T23:50:00Z,FTZ066,-23.2165167,150.9600333,0,3.114,,,,,,,,,,,,,,,,,,,,,,,,,,,,,,,,,,,,,,,,,,,,,,,,,,
2021-07-28T00:38:00Z,FTZ068,-23.0920833,150.9131333,0,0.344,,,,,,,,,,,,,,,,,,,,,,,,,,,,,,,,,,,,,,,,,,,,,,,,,,
