GLOBAL ATTRIBUTES,,Comments,,,,,,,,,,,,,,,,,,,,,,,,,,,,,,,,,,,,,,,,,
title,,,,,,,,,,,,,,,,,,,,,,,,,,,,,,,,,,,,,,,,,,,
project,Integrated Marine Observing System (IMOS),,,,,,,,,,,,,,,,,,,,,,,,,,,,,,,,,,,,,,,,,,
original_project_name,MERIS validation,,,,,,,,,,,,,,,,,,,,,,,,,,,,,,,,,,,,,,,,,,
institution,CSIRO Land and Water,,,,,,,,,,,,,,,,,,,,,,,,,,,,,,,,,,,,,,,,,,
abstract,This record contains in situ water optical property data collected in the Swain reef (Great Barrier Reef| Australia) on the SV Pelican between 07-12 Mar 2006. A total of 11 stations were sampled during the field campaign SWAIN. The data can be used for Ocean Colour sensor validation| optical water quality monitoring and modelling. CLW deployed the optical instruments TriOS RAMSES (hyperspectral irradiance)| WETLabs AC-9 (absorption and attenuation coefficicents)| HOBILabs Hydroscat-6 (backscattering coefficient) during this cruise. Funding for this study was provided by CSIRO Wealth from Oceans Flagship. We also thank the captains and crews of the SV Pelican.,,,,,,,,,,,,,,,,,,,,,,,,,,,,,,,,,,,,,,,,,,
conventions,IMOS biological data format (v1.0),,,,,,,,,,,,,,,,,,,,,,,,,,,,,,,,,,,,,,,,,,
date_created,2006-03-11T03:18:41Z,,,,,,,,,,,,,,,,,,,,,,,,,,,,,,,,,,,,,,,,,,
date_modified,2006-03-21T23:51:00Z,,,,,,,,,,,,,,,,,,,,,,,,,,,,,,,,,,,,,,,,,,
history,Data has been quality controlled by in-house procedures. AC-9 data were corrected for temperature using CTD profiles following Pegau et al.| 1997| Applied Optics| 36(24)| pp.6035-6046. The absorption coefficient was corrected for scattering using the proportional method described in Zaneveld et al.| 1992| Ocean Optics XI| vol.1750| pp.187-199| San Diego| CA,,,,,,,,,,,,,,,,,,,,,,,,,,,,,,,,,,,,,,,,,,
comment,The AC-9 measures the spectral absorption| A| and spectral attenuation| C| over nine wavelengths via a dual-path measurement. An AC-9 is used to measure the total absorption and attenuation of water (the signal includes both dissolved and particulate absorption). The AC-9 measurements were referenced to optically clean water| and resulting values thus represent the absorption and attenuation of the sample water minus the calibration water values. If the ocean water is very clear| it may be assumed that the measured absorption and attenuation represent everything in the water except pure water itself. To derive total absorption and total attenuation| it was therefore necessary to add in the absorption and attenuation| respectively| of pure water. Currently| the most accurate pure water absorption values are considered to be those presented by Pope and Fry (1997| Applied Optics| 36(33)| pp.8710-8723).,,,,,,,,,,,,,,,,,,,,,,,,,,,,,,,,,,,,,,,,,,
source,Total Absorption coefficients determined using an AC-9 (www.wetlabs.com),,,,,,,,,,,,,,,,,,,,,,,,,,,,,,,,,,,,,,,,,,
keywords,Oceans>Ocean Optics > Absorption ;Oceans>Ocean Optics>Ocean Colour;,,,,,,,,,,,,,,,,,,,,,,,,,,,,,,,,,,,,,,,,,,
cruise_id,SWAIN,,,,,,,,,,,,,,,,,,,,,,,,,,,,,,,,,,,,,,,,,,
vessel_name,SV Pelican,,,,,,,,,,,,,,,,,,,,,,,,,,,,,,,,,,,,,,,,,,
platform_code,VKV7208,,,,,,,,,,,,,,,,,,,,,,,,,,,,,,,,,,,,,,,,,,
references,,,,,,,,,,,,,,,,,,,,,,,,,,,,,,,,,,,,,,,,,,,
naming_authority,CSIRO Land and Water (CLW),,,,,,,,,,,,,,,,,,,,,,,,,,,,,,,,,,,,,,,,,,
cdm_data_type,profile,,,,,,,,,,,,,,,,,,,,,,,,,,,,,,,,,,,,,,,,,,
geospatial_lat_min,-21.87,calculated automatically from table,,,,,,,,,,,,,,,,,,,,,,,,,,,,,,,,,,,,,,,,,
geospatial_lat_max,-21.87,calculated automatically from table,,,,,,,,,,,,,,,,,,,,,,,,,,,,,,,,,,,,,,,,,
geospatial_lon_min,152.19,calculated automatically from table,,,,,,,,,,,,,,,,,,,,,,,,,,,,,,,,,,,,,,,,,
geospatial_lon_max,152.19,calculated automatically from table,,,,,,,,,,,,,,,,,,,,,,,,,,,,,,,,,,,,,,,,,
geospatial_vertical_min,1,calculated automatically from table,,,,,,,,,,,,,,,,,,,,,,,,,,,,,,,,,,,,,,,,,
geospatial_vertical_max,10.2,calculated automatically from table,,,,,,,,,,,,,,,,,,,,,,,,,,,,,,,,,,,,,,,,,
local_time_zone,10,,,,,,,,,,,,,,,,,,,,,,,,,,,,,,,,,,,,,,,,,,
data_centre,eMarine Information Infrastructure (eMII),,,,,,,,,,,,,,,,,,,,,,,,,,,,,,,,,,,,,,,,,,
data_centre_email,info@emii.org.au,,,,,,,,,,,,,,,,,,,,,,,,,,,,,,,,,,,,,,,,,,
author,"Brando, Vittorio",,,,,,,,,,,,,,,,,,,,,,,,,,,,,,,,,,,,,,,,,,
author_email,vittorio.brando@csiro.au,,,,,,,,,,,,,,,,,,,,,,,,,,,,,,,,,,,,,,,,,,
principal_investigator,"Beeden, Roger",,,,,,,,,,,,,,,,,,,,,,,,,,,,,,,,,,,,,,,,,,
principal_investigator_email,roger.beeden@gbrmpa.gov.au,,,,,,,,,,,,,,,,,,,,,,,,,,,,,,,,,,,,,,,,,,
publisher,Australian Ocean Data Network,,,,,,,,,,,,,,,,,,,,,,,,,,,,,,,,,,,,,,,,,,
publisher_email,info@aodn.org.au,,,,,,,,,,,,,,,,,,,,,,,,,,,,,,,,,,,,,,,,,,
institution,IMOS Satellite Remote Sensing - Ocean Colour Sub-facility - Bio-Optical Database of Australian Waters,,,,,,,,,,,,,,,,,,,,,,,,,,,,,,,,,,,,,,,,,,
institution_principal_investigator,"Schroeder, Thomas",,,,,,,,,,,,,,,,,,,,,,,,,,,,,,,,,,,,,,,,,,
institution_principal_investigator_email,Thomas.Schroeder@csiro.au,,,,,,,,,,,,,,,,,,,,,,,,,,,,,,,,,,,,,,,,,,
citation,"To cite this data set in a publication, use the format ""IMOS [year-of-data-downloaded], [Title], [data-access-url], accessed [date-of-access]""",,,,,,,,,,,,,,,,,,,,,,,,,,,,,,,,,,,,,,,,,,
acknowledgement,Data was sourced from the Commonwealth Scientific and Industrial Research Organisation (CSIRO),,,,,,,,,,,,,,,,,,,,,,,,,,,,,,,,,,,,,,,,,,
distribution_statement,"Any users of IMOS data are required to clearly acknowledge the source of the material. Data, products and services from IMOS are provided ""as is"" without any warranty as to fitness for a particular purpose.",,,,,,,,,,,,,,,,,,,,,,,,,,,,,,,,,,,,,,,,,,
,,,,,,,,,,,,,,,,,,,,,,,,,,,,,,,,,,,,,,,,,,,
,,,,,,,,,,,,,,,,,,,,,,,,,,,,,,,,,,,,,,,,,,,
TABLE ROWS,,,,,,,,,,,,,,,,,,,,,,,,,,,,,,,,,,,,,,,,,,,
Row name,CF standard_name,IMOS long_name,Units,Fill value,Comments,,,,,,,,,,,,,,,,,,,,,,,,,,,,,,,,,,,,,,
Wavelength,radiation_wavelength,Wavelength of measuement,nm,-999,,,,,,,,,,,,,,,,,,,,,,,,,,,,,,,,,,,,,,,
,,,,,,,,,,,,,,,,,,,,,,,,,,,,,,,,,,,,,,,,,,,
TABLE COLUMNS,,,,,,,,,,,,,,,,,,,,,,,,,,,,,,,,,,,,,,,,,,,
Column name,CF standard_name,IMOS long_name,Units,Fill value,Comments,,,,,,,,,,,,,,,,,,,,,,,,,,,,,,,,,,,,,,
Time,time,analysis_time,YYYY-MM-DDThh:mm:ssZ,,UTC date and time,,,,,,,,,,,,,,,,,,,,,,,,,,,,,,,,,,,,,,
Station_Code,,,,,National Reference Station code (6 letters),,,,,,,,,,,,,,,,,,,,,,,,,,,,,,,,,,,,,,
Latitude,latitude,latitude,degrees_north,-999,North positive,,,,,,,,,,,,,,,,,,,,,,,,,,,,,,,,,,,,,,
Longitude,longitude,longitude,degrees_east,-999,East positive,,,,,,,,,,,,,,,,,,,,,,,,,,,,,,,,,,,,,,
Depth,depth,depth,m,-999,positive down,,,,,,,,,,,,,,,,,,,,,,,,,,,,,,,,,,,,,,
ac9_a_corr,,corrected_volume_total_absorption_coefficient_in_sea_water,m-1,-999,,,,,,,,,,,,,,,,,,,,,,,,,,,,,,,,,,,,,,,
ac9_c_corr,,corrected_volume_total_attenuation_coefficient_in_sea_water,m-1,-999,,,,,,,,,,,,,,,,,,,,,,,,,,,,,,,,,,,,,,,
,,,,,,,,,,,,,,,,,,,,,,,,,,,,,,,,,,,,,,,,,,,
,,,,,,,,,,,,,,,,,,,,,,,,,,,,,,,,,,,,,,,,,,,
DATA,,,,,,,,,,,,,,,,,,,,,,,,,,,,,,,,,,,,,,,,,,,
,Time,Station_Code,Latitude,Longitude,Depth,ac9_a_corr,ac9_a_corr,ac9_a_corr,ac9_a_corr,ac9_a_corr,ac9_a_corr,ac9_a_corr,ac9_a_corr,ac9_a_corr,ac9_c_corr,ac9_c_corr,ac9_c_corr,ac9_c_corr,ac9_c_corr,ac9_c_corr,ac9_c_corr,ac9_c_corr,ac9_c_corr,,,,,,,,,,,,,,,,,,,,
Wavelength,,,,,,412,440,488,510,532,555,650,676,715,412,440,488,510,532,555,650,676,715,,,,,,,,,,,,,,,,,,,,
,2006-03-11T03:18:41Z,GBR080306_10,-21.87,152.19,1,0.3683,0.2509,0.1402,0.0986,0.0648,0.0429,0.0364,0.0349,0,0.4999,0.4542,0.3966,0.3615,0.3623,0.3381,0.3047,0.2759,0.2835,,,,,,,,,,,,,,,,,,,,
,2006-03-11T03:18:41Z,GBR080306_10,-21.87,152.19,1.2,0.3732,0.2553,0.1446,0.1018,0.0627,0.0466,0.0327,0.03,0,0.4915,0.4388,0.4019,0.366,0.3348,0.3217,0.2932,0.2646,0.2663,,,,,,,,,,,,,,,,,,,,
,2006-03-11T03:18:41Z,GBR080306_10,-21.87,152.19,1.4,0.3745,0.259,0.1512,0.106,0.0677,0.0493,0.0402,0.0337,0,0.4978,0.4493,0.3939,0.3629,0.3711,0.3505,0.3045,0.2758,0.2836,,,,,,,,,,,,,,,,,,,,
,2006-03-11T03:18:41Z,GBR080306_10,-21.87,152.19,1.6,0.3712,0.2492,0.1411,0.1015,0.0643,0.0452,0.036,0.0332,0,0.4972,0.4561,0.398,0.3452,0.3347,0.3329,0.3021,0.2736,0.2909,,,,,,,,,,,,,,,,,,,,
,2006-03-11T03:18:41Z,GBR080306_10,-21.87,152.19,1.8,0.3695,0.2523,0.1399,0.1009,0.0619,0.0466,0.0346,0.0348,0,0.5085,0.4674,0.4163,0.3645,0.3491,0.3444,0.3052,0.2662,0.2871,,,,,,,,,,,,,,,,,,,,
,2006-03-11T03:18:41Z,GBR080306_10,-21.87,152.19,2,0.3617,0.2493,0.1391,0.0976,0.0656,0.0454,0.0328,0.0334,0,0.4969,0.4456,0.3895,0.3583,0.35,0.3287,0.3022,0.2821,0.2917,,,,,,,,,,,,,,,,,,,,
,2006-03-11T03:18:41Z,GBR080306_10,-21.87,152.19,2.2,0.3804,0.2603,0.1482,0.113,0.0685,0.048,0.0385,0.0361,0,0.5101,0.4519,0.4168,0.3773,0.3553,0.3524,0.3171,0.2764,0.2968,,,,,,,,,,,,,,,,,,,,
,2006-03-11T03:18:41Z,GBR080306_10,-21.87,152.19,2.4,0.3689,0.2518,0.146,0.1011,0.0663,0.0472,0.0351,0.0332,0,0.4968,0.4455,0.421,0.3531,0.3529,0.3587,0.3078,0.2761,0.2795,,,,,,,,,,,,,,,,,,,,
,2006-03-11T03:18:41Z,GBR080306_10,-21.87,152.19,2.6,0.3673,0.2516,0.1476,0.1016,0.0677,0.0473,0.0336,0.0368,0,0.4932,0.4526,0.4073,0.3497,0.3562,0.3586,0.2931,0.2865,0.2931,,,,,,,,,,,,,,,,,,,,
,2006-03-11T03:18:41Z,GBR080306_10,-21.87,152.19,2.8,0.3694,0.2524,0.1481,0.1054,0.0696,0.0478,0.0366,0.0344,0,0.5111,0.4475,0.3985,0.3517,0.3541,0.3494,0.3065,0.2757,0.2991,,,,,,,,,,,,,,,,,,,,
,2006-03-11T03:18:41Z,GBR080306_10,-21.87,152.19,3,0.3713,0.253,0.145,0.1023,0.0698,0.0488,0.0352,0.0333,0,0.5044,0.467,0.4221,0.3668,0.3688,0.3463,0.2962,0.2845,0.2927,,,,,,,,,,,,,,,,,,,,
,2006-03-11T03:18:41Z,GBR080306_10,-21.87,152.19,3.2,0.377,0.2615,0.1475,0.107,0.0684,0.047,0.0346,0.0342,0,0.5113,0.4649,0.4126,0.3756,0.3681,0.3548,0.3015,0.2833,0.2934,,,,,,,,,,,,,,,,,,,,
,2006-03-11T03:18:41Z,GBR080306_10,-21.87,152.19,3.4,0.3745,0.2538,0.1487,0.103,0.0667,0.0473,0.0358,0.0335,0,0.4979,0.4547,0.4065,0.3599,0.3558,0.3446,0.3195,0.2785,0.2919,,,,,,,,,,,,,,,,,,,,
,2006-03-11T03:18:41Z,GBR080306_10,-21.87,152.19,3.6,0.3739,0.2516,0.1428,0.1045,0.0683,0.0508,0.0349,0.0339,0,0.4833,0.451,0.3929,0.3451,0.3603,0.3368,0.2951,0.2524,0.2847,,,,,,,,,,,,,,,,,,,,
,2006-03-11T03:18:41Z,GBR080306_10,-21.87,152.19,3.8,0.3781,0.2586,0.1475,0.1043,0.0708,0.0466,0.0388,0.0343,0,0.5146,0.4474,0.4096,0.3628,0.3644,0.3476,0.3252,0.2931,0.2925,,,,,,,,,,,,,,,,,,,,
,2006-03-11T03:18:41Z,GBR080306_10,-21.87,152.19,4,0.3741,0.2571,0.148,0.1046,0.0661,0.049,0.0329,0.0324,0,0.5169,0.4521,0.3921,0.3661,0.352,0.3484,0.2867,0.2643,0.2894,,,,,,,,,,,,,,,,,,,,
,2006-03-11T03:18:41Z,GBR080306_10,-21.87,152.19,4.2,0.3754,0.256,0.1453,0.1046,0.0677,0.0484,0.0361,0.0364,0,0.5196,0.4619,0.3955,0.3484,0.3616,0.3436,0.311,0.2797,0.2869,,,,,,,,,,,,,,,,,,,,
,2006-03-11T03:18:41Z,GBR080306_10,-21.87,152.19,4.4,0.368,0.2602,0.1427,0.0994,0.0632,0.0477,0.037,0.0427,0,0.4966,0.4573,0.4318,0.3763,0.3556,0.3452,0.3294,0.2988,0.2777,,,,,,,,,,,,,,,,,,,,
,2006-03-11T03:18:41Z,GBR080306_10,-21.87,152.19,4.6,0.3767,0.2525,0.1454,0.1024,0.063,0.0459,0.0359,0.0328,0,0.5005,0.4434,0.4045,0.347,0.3413,0.3339,0.2978,0.2869,0.3046,,,,,,,,,,,,,,,,,,,,
,2006-03-11T03:18:41Z,GBR080306_10,-21.87,152.19,4.8,0.3704,0.2541,0.1459,0.0999,0.0649,0.0435,0.0351,0.0345,0,0.5054,0.4615,0.4105,0.3664,0.3537,0.3518,0.3025,0.268,0.2851,,,,,,,,,,,,,,,,,,,,
,2006-03-11T03:18:41Z,GBR080306_10,-21.87,152.19,5,0.3696,0.2542,0.1478,0.1028,0.0682,0.0495,0.0364,0.0339,0,0.5062,0.4604,0.4102,0.3672,0.3441,0.3431,0.3126,0.2806,0.296,,,,,,,,,,,,,,,,,,,,
,2006-03-11T03:18:41Z,GBR080306_10,-21.87,152.19,5.2,0.3737,0.2443,0.1453,0.0965,0.0585,0.0447,0.0348,0.0381,0,0.5229,0.463,0.3944,0.3492,0.3495,0.3362,0.3142,0.2706,0.2754,,,,,,,,,,,,,,,,,,,,
,2006-03-11T03:18:41Z,GBR080306_10,-21.87,152.19,5.4,0.3743,0.2522,0.1435,0.1001,0.0672,0.0473,0.0376,0.0375,0,0.5006,0.4637,0.4027,0.3576,0.3592,0.3401,0.3091,0.2802,0.2956,,,,,,,,,,,,,,,,,,,,
,2006-03-11T03:18:41Z,GBR080306_10,-21.87,152.19,5.6,0.3706,0.2513,0.1445,0.1045,0.0671,0.0464,0.0368,0.036,0,0.5103,0.4443,0.3995,0.3624,0.3641,0.3491,0.2954,0.2755,0.2911,,,,,,,,,,,,,,,,,,,,
,2006-03-11T03:18:41Z,GBR080306_10,-21.87,152.19,5.8,0.3716,0.2549,0.1443,0.1037,0.071,0.048,0.0344,0.0327,0,0.5194,0.46,0.4159,0.3731,0.368,0.3591,0.3024,0.2697,0.288,,,,,,,,,,,,,,,,,,,,
,2006-03-11T03:18:41Z,GBR080306_10,-21.87,152.19,6,0.3671,0.2504,0.1476,0.1058,0.0679,0.047,0.0344,0.0363,0,0.4995,0.4433,0.4028,0.354,0.3468,0.338,0.2993,0.2912,0.2898,,,,,,,,,,,,,,,,,,,,
,2006-03-11T03:18:41Z,GBR080306_10,-21.87,152.19,6.2,0.3667,0.2504,0.1446,0.1001,0.0677,0.0477,0.0365,0.0347,0,0.5054,0.4546,0.3916,0.3639,0.3488,0.3554,0.2992,0.2654,0.2821,,,,,,,,,,,,,,,,,,,,
,2006-03-11T03:18:41Z,GBR080306_10,-21.87,152.19,6.4,0.3662,0.2477,0.1418,0.1036,0.0666,0.0478,0.0351,0.0305,0,0.5052,0.4532,0.3978,0.364,0.3463,0.3368,0.298,0.2664,0.286,,,,,,,,,,,,,,,,,,,,
,2006-03-11T03:18:41Z,GBR080306_10,-21.87,152.19,6.6,0.3654,0.2546,0.1471,0.1014,0.068,0.0512,0.0368,0.0389,0,0.4959,0.4668,0.4037,0.3718,0.3526,0.3277,0.2933,0.2803,0.2814,,,,,,,,,,,,,,,,,,,,
,2006-03-11T03:18:41Z,GBR080306_10,-21.87,152.19,6.8,0.3758,0.2491,0.1453,0.1009,0.0656,0.0497,0.0353,0.0367,0,0.4906,0.4672,0.4097,0.3544,0.3546,0.3352,0.3013,0.2717,0.2771,,,,,,,,,,,,,,,,,,,,
,2006-03-11T03:18:41Z,GBR080306_10,-21.87,152.19,7,0.3692,0.2539,0.1458,0.1049,0.0668,0.0502,0.0362,0.0345,0,0.4949,0.4482,0.3958,0.3587,0.3703,0.3625,0.302,0.2787,0.2921,,,,,,,,,,,,,,,,,,,,
,2006-03-11T03:18:41Z,GBR080306_10,-21.87,152.19,7.2,0.3675,0.2495,0.1432,0.1036,0.0687,0.0453,0.0343,0.0334,0,0.4916,0.457,0.4005,0.3569,0.3544,0.3411,0.3023,0.2658,0.2879,,,,,,,,,,,,,,,,,,,,
,2006-03-11T03:18:41Z,GBR080306_10,-21.87,152.19,7.4,0.374,0.251,0.1409,0.1006,0.0671,0.0436,0.034,0.035,0,0.4879,0.4444,0.3888,0.3482,0.3293,0.3323,0.2987,0.2589,0.2758,,,,,,,,,,,,,,,,,,,,
,2006-03-11T03:18:41Z,GBR080306_10,-21.87,152.19,7.6,0.366,0.2491,0.1499,0.1051,0.0668,0.0481,0.0368,0.0345,0,0.4919,0.4462,0.416,0.3532,0.3362,0.3354,0.2906,0.2635,0.2813,,,,,,,,,,,,,,,,,,,,
,2006-03-11T03:18:41Z,GBR080306_10,-21.87,152.19,7.8,0.3782,0.2553,0.1498,0.1049,0.0716,0.0542,0.0402,0.0358,0,0.5105,0.4528,0.4025,0.3544,0.3477,0.3423,0.2851,0.2582,0.2821,,,,,,,,,,,,,,,,,,,,
,2006-03-11T03:18:41Z,GBR080306_10,-21.87,152.19,8,0.3719,0.2542,0.1478,0.0998,0.0661,0.0499,0.0369,0.0334,0,0.5109,0.4677,0.4151,0.3543,0.3661,0.3482,0.2996,0.2864,0.3004,,,,,,,,,,,,,,,,,,,,
,2006-03-11T03:18:41Z,GBR080306_10,-21.87,152.19,8.2,0.3729,0.2574,0.141,0.1021,0.0639,0.0484,0.0379,0.0387,0,0.4982,0.446,0.387,0.3513,0.3429,0.3286,0.3028,0.2866,0.2803,,,,,,,,,,,,,,,,,,,,
,2006-03-11T03:18:41Z,GBR080306_10,-21.87,152.19,8.4,0.3683,0.2524,0.1433,0.1006,0.0651,0.0467,0.0347,0.0339,0,0.5043,0.4433,0.4033,0.3517,0.3504,0.3428,0.2861,0.2744,0.2861,,,,,,,,,,,,,,,,,,,,
,2006-03-11T03:18:41Z,GBR080306_10,-21.87,152.19,8.6,0.3695,0.2561,0.1476,0.1026,0.0695,0.0477,0.0343,0.0372,0,0.508,0.4529,0.403,0.3516,0.3414,0.33,0.2872,0.2749,0.2827,,,,,,,,,,,,,,,,,,,,
,2006-03-11T03:18:41Z,GBR080306_10,-21.87,152.19,8.8,0.3697,0.2506,0.1437,0.1006,0.0681,0.047,0.035,0.0312,0,0.5022,0.4557,0.401,0.3599,0.3575,0.3368,0.3019,0.2881,0.2928,,,,,,,,,,,,,,,,,,,,
,2006-03-11T03:18:41Z,GBR080306_10,-21.87,152.19,9,0.3678,0.2542,0.1454,0.1033,0.0674,0.0495,0.0412,0.0415,0,0.5119,0.458,0.3878,0.365,0.3512,0.3459,0.311,0.2797,0.3005,,,,,,,,,,,,,,,,,,,,
,2006-03-11T03:18:41Z,GBR080306_10,-21.87,152.19,9.2,0.3704,0.2547,0.1491,0.1029,0.0675,0.0482,0.0351,0.0343,0,0.5076,0.4568,0.4098,0.3701,0.3561,0.3439,0.3021,0.2686,0.2864,,,,,,,,,,,,,,,,,,,,
,2006-03-11T03:18:41Z,GBR080306_10,-21.87,152.19,9.4,0.3726,0.2516,0.1434,0.1053,0.066,0.0487,0.033,0.0321,0,0.4975,0.4514,0.4145,0.358,0.3607,0.3472,0.304,0.2766,0.2847,,,,,,,,,,,,,,,,,,,,
,2006-03-11T03:18:41Z,GBR080306_10,-21.87,152.19,9.6,0.3655,0.2522,0.1452,0.1019,0.0662,0.0456,0.0342,0.0352,0,0.4991,0.4559,0.4014,0.3588,0.3463,0.3423,0.3084,0.2757,0.2917,,,,,,,,,,,,,,,,,,,,
,2006-03-11T03:18:41Z,GBR080306_10,-21.87,152.19,9.8,0.3698,0.2507,0.1443,0.1019,0.0649,0.0461,0.0341,0.0348,0,0.4947,0.451,0.4051,0.3559,0.3541,0.3398,0.2991,0.2748,0.2893,,,,,,,,,,,,,,,,,,,,
,2006-03-11T03:18:41Z,GBR080306_10,-21.87,152.19,10,0.3701,0.2547,0.1437,0.1036,0.0645,0.0443,0.0349,0.034,0,0.501,0.4517,0.4025,0.3519,0.3542,0.3387,0.3038,0.2768,0.2925,,,,,,,,,,,,,,,,,,,,
,2006-03-11T03:18:41Z,GBR080306_10,-21.87,152.19,10.2,0.3649,0.2497,0.1495,0.1026,0.0683,0.0495,0.0358,0.0385,0,0.5092,0.4353,0.4016,0.3563,0.3416,0.3346,0.2991,0.2851,0.2869,,,,,,,,,,,,,,,,,,,,
,2006-03-11T03:18:41Z,GBR080306_10,-21.87,152.19,10.2,0.3609,0.2569,0.1472,0.0995,0.0665,0.049,0.0363,0.0373,0,0.5049,0.433,0.4294,0.3397,0.336,0.3354,0.2882,0.2904,0.2831,,,,,,,,,,,,,,,,,,,,
,2006-03-11T03:18:41Z,GBR080306_10,-21.87,152.19,10,0.3749,0.253,0.1419,0.1031,0.0703,0.0476,0.0361,0.0353,0,0.5117,0.4491,0.4138,0.3947,0.3715,0.3433,0.2956,0.2694,0.2831,,,,,,,,,,,,,,,,,,,,
