GLOBAL ATTRIBUTES,,Comments,,,,,,,,,,,,,,,,,,,,,,,,,,,,,,,,,,,,,,,,,,,,,,,,,,,,,
title,,,,,,,,,,,,,,,,,,,,,,,,,,,,,,,,,,,,,,,,,,,,,,,,,,,,,,,
project,Integrated Marine Observing System (IMOS),,,,,,,,,,,,,,,,,,,,,,,,,,,,,,,,,,,,,,,,,,,,,,,,,,,,,,
original_project_name,Lucinda,,,,,,,,,,,,,,,,,,,,,,,,,,,,,,,,,,,,,,,,,,,,,,,,,,,,,,
institution,CSIRO Oceans and Atmosphere (O&A),,,,,,,,,,,,,,,,,,,,,,,,,,,,,,,,,,,,,,,,,,,,,,,,,,,,,,
abstract,"The data were collected at a total of 18 stations in Hinchinbrook Channel. The samples collected were used to determine the bio-optical characteristics of this region. The data can be used for Ocean Colour sensor validation. Parameters measured include Total Suspended Particulate Matter (TSM), including the organic and inorganic fractions; the absorption coefficients of the particulate and dissolved components of the water column and the phytoplankton pigment concentration and composition.",,,,,,,,,,,,,,,,,,,,,,,,,,,,,,,,,,,,,,,,,,,,,,,,,,,,,,
conventions,IMOS biological data format (v1.0),,,,,,,,,,,,,,,,,,,,,,,,,,,,,,,,,,,,,,,,,,,,,,,,,,,,,,
date_created,,,,,,,,,,,,,,,,,,,,,,,,,,,,,,,,,,,,,,,,,,,,,,,,,,,,,,,
date_modified,,,,,,,,,,,,,,,,,,,,,,,,,,,,,,,,,,,,,,,,,,,,,,,,,,,,,,,
history,data has been quality controlled by in-house procedures,,,,,,,,,,,,,,,,,,,,,,,,,,,,,,,,,,,,,,,,,,,,,,,,,,,,,,
comment,"A value of -999 means the pigment was not measured, while 0.000 means it was measured but below the detection limit.",,,,,,,,,,,,,,,,,,,,,,,,,,,,,,,,,,,,,,,,,,,,,,,,,,,,,,
source,High Performance Liquid Chromatography of pigments in discrete sea-water samples,,,,,,,,,,,,,,,,,,,,,,,,,,,,,,,,,,,,,,,,,,,,,,,,,,,,,,
keywords,Oceans>Ocean Chemistry>Pigments;Oceans>ocean Chemistry>Ocean Colour;Oceans>Ocean Chemistry>Chlorophyll a,,,,,,,,,,,,,,,,,,,,,,,,,,,,,,,,,,,,,,,,,,,,,,,,,,,,,,
vessel_name,Unknown vessel,,,,,,,,,,,,,,,,,,,,,,,,,,,,,,,,,,,,,,,,,,,,,,,,,,,,,,
platform_code,,,,,,,,,,,,,,,,,,,,,,,,,,,,,,,,,,,,,,,,,,,,,,,,,,,,,,,
cruise_id,HinchinbrookChannelNov2010,,,,,,,,,,,,,,,,,,,,,,,,,,,,,,,,,,,,,,,,,,,,,,,,,,,,,,
references,https://marlin.csiro.au/geonetwork/srv/eng/catalog.search;jsessionid=node0alhl0puhfdhl3mejksj4czqy1279031.node0#/metadata/1fff161f-bc06-5ec1-e053-08114f8c50c7,,,,,,,,,,,,,,,,,,,,,,,,,,,,,,,,,,,,,,,,,,,,,,,,,,,,,,
naming_authority,CSIRO Oceans and Atmosphere (O&A),,,,,,,,,,,,,,,,,,,,,,,,,,,,,,,,,,,,,,,,,,,,,,,,,,,,,,
cdm_data_type,Point,,,,,,,,,,,,,,,,,,,,,,,,,,,,,,,,,,,,,,,,,,,,,,,,,,,,,,
geospatial_lat_min,-18.4917,calculated automatically from table,,,,,,,,,,,,,,,,,,,,,,,,,,,,,,,,,,,,,,,,,,,,,,,,,,,,,
geospatial_lat_max,-18.3024,calculated automatically from table,,,,,,,,,,,,,,,,,,,,,,,,,,,,,,,,,,,,,,,,,,,,,,,,,,,,,
geospatial_lon_min,146.1131,calculated automatically from table,,,,,,,,,,,,,,,,,,,,,,,,,,,,,,,,,,,,,,,,,,,,,,,,,,,,,
geospatial_lon_max,146.2878,calculated automatically from table,,,,,,,,,,,,,,,,,,,,,,,,,,,,,,,,,,,,,,,,,,,,,,,,,,,,,
geospatial_vertical_min,0,calculated automatically from table,,,,,,,,,,,,,,,,,,,,,,,,,,,,,,,,,,,,,,,,,,,,,,,,,,,,,
geospatial_vertical_max,0,calculated automatically from table,,,,,,,,,,,,,,,,,,,,,,,,,,,,,,,,,,,,,,,,,,,,,,,,,,,,,
local_time_zone,10,,,,,,,,,,,,,,,,,,,,,,,,,,,,,,,,,,,,,,,,,,,,,,,,,,,,,,
data_centre,eMarine Information Infrastructure (eMII),,,,,,,,,,,,,,,,,,,,,,,,,,,,,,,,,,,,,,,,,,,,,,,,,,,,,,
data_centre_email,info@emii.org.au,,,,,,,,,,,,,,,,,,,,,,,,,,,,,,,,,,,,,,,,,,,,,,,,,,,,,,
author,"Clementson, Lesley",,,,,,,,,,,,,,,,,,,,,,,,,,,,,,,,,,,,,,,,,,,,,,,,,,,,,,
author_email,Lesley.Clementson@csiro.au,,,,,,,,,,,,,,,,,,,,,,,,,,,,,,,,,,,,,,,,,,,,,,,,,,,,,,
principal_investigator,"Schroeder, Thomas",,,,,,,,,,,,,,,,,,,,,,,,,,,,,,,,,,,,,,,,,,,,,,,,,,,,,,
principal_investigator_email,Thomas.Schroeder@csiro.au,,,,,,,,,,,,,,,,,,,,,,,,,,,,,,,,,,,,,,,,,,,,,,,,,,,,,,
institution_references,http://www.csiro.au/en/Research/OandA,,,,,,,,,,,,,,,,,,,,,,,,,,,,,,,,,,,,,,,,,,,,,,,,,,,,,,
citation,"To cite this data set in a publication, use the format ""IMOS [year-of-data-downloaded], [Title], [data-access-url], accessed [date-of-access]""",,,,,,,,,,,,,,,,,,,,,,,,,,,,,,,,,,,,,,,,,,,,,,,,,,,,,,
acknowledgement,Data was sourced from the Commonwealth Scientific and Industrial Research Organisation (CSIRO),,,,,,,,,,,,,,,,,,,,,,,,,,,,,,,,,,,,,,,,,,,,,,,,,,,,,,
distribution_statement,"Any users of IMOS data are required to clearly acknowledge the source of the material. Data, products and services from IMOS are provided ""as is"" without any warranty as to fitness for a particular purpose.",,,,,,,,,,,,,,,,,,,,,,,,,,,,,,,,,,,,,,,,,,,,,,,,,,,,,,
,,,,,,,,,,,,,,,,,,,,,,,,,,,,,,,,,,,,,,,,,,,,,,,,,,,,,,,
,,,,,,,,,,,,,,,,,,,,,,,,,,,,,,,,,,,,,,,,,,,,,,,,,,,,,,,
TABLE COLUMNS,,,,,,,,,,,,,,,,,,,,,,,,,,,,,,,,,,,,,,,,,,,,,,,,,,,,,,,
Column name,CF standard_name,IMOS long_name,Units,Fill value,Comments,,,,,,,,,,,,,,,,,,,,,,,,,,,,,,,,,,,,,,,,,,,,,,,,,,
Time,time,analysis_time,YYYY-MM-DDThh:mm:ssZ,,UTC date and time,,,,,,,,,,,,,,,,,,,,,,,,,,,,,,,,,,,,,,,,,,,,,,,,,,
Station_Code,,,,,National Reference Station code (6 letters),,,,,,,,,,,,,,,,,,,,,,,,,,,,,,,,,,,,,,,,,,,,,,,,,,
Latitude,latitude,latitude,degrees_north,,North positive,,,,,,,,,,,,,,,,,,,,,,,,,,,,,,,,,,,,,,,,,,,,,,,,,,
Longitude,longitude,longitude,degrees_east,,East positive,,,,,,,,,,,,,,,,,,,,,,,,,,,,,,,,,,,,,,,,,,,,,,,,,,
Depth,depth,depth,m ,,positive down,,,,,,,,,,,,,,,,,,,,,,,,,,,,,,,,,,,,,,,,,,,,,,,,,,
CPHL_c3,,mass_concentration_of_HPLC_chlorophyll_c3_in_sea_water,mg m-3,-999,,,,,,,,,,,,,,,,,,,,,,,,,,,,,,,,,,,,,,,,,,,,,,,,,,,
Mg_DVP,,mass_concentration_of_HPLC_Mg_2_4_divinyl_pheoporphyrin_a5_monomethyl_ester_in_sea_water,mg m-3,-999,,,,,,,,,,,,,,,,,,,,,,,,,,,,,,,,,,,,,,,,,,,,,,,,,,,
CPHL_c2,,mass_concentration_of_HPLC_chlorophyll_c2_in_sea_water,mg m-3,-999,,,,,,,,,,,,,,,,,,,,,,,,,,,,,,,,,,,,,,,,,,,,,,,,,,,
CPHL_c1,,mass_concentration_of_HPLC_chlorophyll_c1_in_sea_water,mg m-3,-999,,,,,,,,,,,,,,,,,,,,,,,,,,,,,,,,,,,,,,,,,,,,,,,,,,,
CPHL_c1c2,,mass_concentration_of_HPLC_chlorophyll_c1_c2_in_sea_water,mg m-3,-999,"Samples analysed prior to August 2004, Wright et al (1991) method used -chlorophyll_c1_plus_chlorophyll_c2_coelute",,,,,,,,,,,,,,,,,,,,,,,,,,,,,,,,,,,,,,,,,,,,,,,,,,
CPHLIDE_a,,mass_concentration_of_HPLC_chlorophyllide_a_in_sea_water,mg m-3,-999,,,,,,,,,,,,,,,,,,,,,,,,,,,,,,,,,,,,,,,,,,,,,,,,,,,
Phide_a,,mass_concentration_of_HPLC_Pheophorbide_a_in_sea_water,mg m-3,-999,,,,,,,,,,,,,,,,,,,,,,,,,,,,,,,,,,,,,,,,,,,,,,,,,,,
Perid,,mass_concentration_of_HPLC_Peridinin_in_sea_water,mg m-3,-999,,,,,,,,,,,,,,,,,,,,,,,,,,,,,,,,,,,,,,,,,,,,,,,,,,,
Pyrophide_a,,mass_concentration_of_HPLC_Pyropheophorbide_a_in_sea_water,mg m-3,-999,,,,,,,,,,,,,,,,,,,,,,,,,,,,,,,,,,,,,,,,,,,,,,,,,,,
But_fuco,,mass_concentration_of_HPLC_19-Butanoyloxyfucoxanthin_in_sea_water,mg m-3,-999,,,,,,,,,,,,,,,,,,,,,,,,,,,,,,,,,,,,,,,,,,,,,,,,,,,
Fuco,,mass_concentration_of_HPLC_Fucoxanthin_in_sea_water,mg m-3,-999,,,,,,,,,,,,,,,,,,,,,,,,,,,,,,,,,,,,,,,,,,,,,,,,,,,
Neo,,mass_concentration_of_HPLC_Neoxanthin_in_sea_water,mg m-3,-999,,,,,,,,,,,,,,,,,,,,,,,,,,,,,,,,,,,,,,,,,,,,,,,,,,,
Keto_Hex_fuco,,mass_concentration_of_HPLC_4- keto-19'-Hexanoyloxyfucoxanthin_in_sea_water,mg m-3,-999,,,,,,,,,,,,,,,,,,,,,,,,,,,,,,,,,,,,,,,,,,,,,,,,,,,
Pras,,mass_concentration_of_HPLC_Prasinoxanthin_in_sea_water,mg m-3,-999,,,,,,,,,,,,,,,,,,,,,,,,,,,,,,,,,,,,,,,,,,,,,,,,,,,
Viola,,mass_concentration_of_HPLC_Violaxanthin_in_sea_water,mg m-3,-999,,,,,,,,,,,,,,,,,,,,,,,,,,,,,,,,,,,,,,,,,,,,,,,,,,,
Hex_fuco,,mass_concentration_of_HPLC_19-Hexanoyloxyfucoxanthin_in_sea_water,mg m-3,-999,,,,,,,,,,,,,,,,,,,,,,,,,,,,,,,,,,,,,,,,,,,,,,,,,,,
Asta,,mass_concentration_of_HPLC_Astaxanthin_in_sea_water,mg m-3,-999,,,,,,,,,,,,,,,,,,,,,,,,,,,,,,,,,,,,,,,,,,,,,,,,,,,
Diadchr,,mass_concentration_of_HPLC_Diadinochrome_in_sea_water,mg m-3,-999,,,,,,,,,,,,,,,,,,,,,,,,,,,,,,,,,,,,,,,,,,,,,,,,,,,
Diadino,,mass_concentration_of_HPLC_Diadinoxanthin_in_sea_water,mg m-3,-999,,,,,,,,,,,,,,,,,,,,,,,,,,,,,,,,,,,,,,,,,,,,,,,,,,,
Dino,,mass_concentration_of_HPLC_Dinoxanthin_in_sea_water,mg m-3,-999,,,,,,,,,,,,,,,,,,,,,,,,,,,,,,,,,,,,,,,,,,,,,,,,,,,
Anth,,mass_concentration_of_HPLC_Antheraxanthin_in_sea_water,mg m-3,-999,,,,,,,,,,,,,,,,,,,,,,,,,,,,,,,,,,,,,,,,,,,,,,,,,,,
Allo,,mass_concentration_of_HPLC_Alloxanthin_in_sea_water,mg m-3,-999,,,,,,,,,,,,,,,,,,,,,,,,,,,,,,,,,,,,,,,,,,,,,,,,,,,
Diato,,mass_concentration_of_HPLC_Diatoxanthin_in_sea_water,mg m-3,-999,,,,,,,,,,,,,,,,,,,,,,,,,,,,,,,,,,,,,,,,,,,,,,,,,,,
Zea,,mass_concentration_of_HPLC_Zeaxanthin_in_sea_water,mg m-3,-999,,,,,,,,,,,,,,,,,,,,,,,,,,,,,,,,,,,,,,,,,,,,,,,,,,,
Lut,,mass_concentration_of_HPLC_Lutein_in_sea_water,mg m-3,-999,,,,,,,,,,,,,,,,,,,,,,,,,,,,,,,,,,,,,,,,,,,,,,,,,,,
Cantha,,mass_concentration_of_HPLC_canthaxanthin_in_sea_water,mg m-3,-999,,,,,,,,,,,,,,,,,,,,,,,,,,,,,,,,,,,,,,,,,,,,,,,,,,,
Gyro,,mass_concentration_of_HPLC_Gyroxanthin-Diester_in_sea_water,mg m-3,-999,,,,,,,,,,,,,,,,,,,,,,,,,,,,,,,,,,,,,,,,,,,,,,,,,,,
DV_CPHL_b,,mass_concentration_of_HPLC_Divinyl_Chorophyll_b_in_sea_water,mg m-3,-999,,,,,,,,,,,,,,,,,,,,,,,,,,,,,,,,,,,,,,,,,,,,,,,,,,,
CPHL_b,,mass_concentration_of_HPLC_chlorophyll_b_in_sea_water,mg m-3,-999,,,,,,,,,,,,,,,,,,,,,,,,,,,,,,,,,,,,,,,,,,,,,,,,,,,
DV_CPHL_b_plus_CPHL_b,,mass_concentration_of_HPLC_Divinyl_Chorophyll_b_+_chlorophyll_b_in_sea_water,mg m-3,-999,"Samples analysed prior to August 2004, Wright et al (1991) method used -Divinyl_Chlorophyll_b_plus_chlorophyll_b_coelute ",,,,,,,,,,,,,,,,,,,,,,,,,,,,,,,,,,,,,,,,,,,,,,,,,,
DV_CPHL_a,,mass_concentration_of_HPLC_Divinyl_Chorophyll_a_in_sea_water,mg m-3,-999,,,,,,,,,,,,,,,,,,,,,,,,,,,,,,,,,,,,,,,,,,,,,,,,,,,
CPHL_a,mass_concentration_of_chlorophyll_a_in_sea_water,mass_concentration_of_chlorophyll_a_in_sea_water,mg m-3,-999,,,,,,,,,,,,,,,,,,,,,,,,,,,,,,,,,,,,,,,,,,,,,,,,,,,
DV_CPHL_a_plus_CPHL_a,,mass_concentration_of_HPLC_Divinyl_Chorophyll_a_+_chlorophyll_a_in_sea_water,mg m-3,-999,"Samples analysed prior to August 2004, Wright et al (1991) method used -Divinyl_Chlorophyll_a_plus_HPLC_chlorophyll_a_coelute ",,,,,,,,,,,,,,,,,,,,,,,,,,,,,,,,,,,,,,,,,,,,,,,,,,
Echin,,mass_concentration_of_HPLC_Echinenone_in_sea_water,mg m-3,-999,,,,,,,,,,,,,,,,,,,,,,,,,,,,,,,,,,,,,,,,,,,,,,,,,,,
Phytin_b,,mass_concentration_of_HPLC_Pheophytin_b_in_sea_water,mg m-3,-999,,,,,,,,,,,,,,,,,,,,,,,,,,,,,,,,,,,,,,,,,,,,,,,,,,,
Phytin_a,,mass_concentration_of_HPLC_Pheophytin_a_in_sea_water,mg m-3,-999,,,,,,,,,,,,,,,,,,,,,,,,,,,,,,,,,,,,,,,,,,,,,,,,,,,
Lyco,,mass_concentration_of_HPLC_Lycopene_in_sea_water,mg m-3,-999,,,,,,,,,,,,,,,,,,,,,,,,,,,,,,,,,,,,,,,,,,,,,,,,,,,
beta_epi_Car,,mass_concentration_of_HPLC_Alpha-Carotene_(Beta_epsilon-Carotene)_in_sea_water,mg m-3,-999,,,,,,,,,,,,,,,,,,,,,,,,,,,,,,,,,,,,,,,,,,,,,,,,,,,
beta_beta_Car,,mass_concentration_of_HPLC_Beta-Carotene_(Beta_beta-Carotene)_in_sea_water,mg m-3,-999,,,,,,,,,,,,,,,,,,,,,,,,,,,,,,,,,,,,,,,,,,,,,,,,,,,
alpha_beta_Car,,mass_concentration_of_HPLC_Alpha_(Beta_epsilon)_+_Beta_(Beta_beta)_Carotenes_in_sea_water,mg m-3,-999,"Samples analysed after August 2004, Heukelem and Thomas (2001) method used - Aalpha-Carotene_plus_Beta-Carotene_coelute  ",,,,,,,,,,,,,,,,,,,,,,,,,,,,,,,,,,,,,,,,,,,,,,,,,,
Pyrophytin_a,,mass_concentration_of_HPLC_Pyropheophytin_a_in_sea_water,mg m-3,-999,,,,,,,,,,,,,,,,,,,,,,,,,,,,,,,,,,,,,,,,,,,,,,,,,,,
Tot_CPHL_a,,mass_concentration_of_HPLC_DV_CPHL_a_+_MV_CPHL_a_+_Chlide_a_+_CPHL_a_allom_+_CPHL_a_prime_in_sea_water,mg m-3,-999,Data products computed from pigment concentration data,,,,,,,,,,,,,,,,,,,,,,,,,,,,,,,,,,,,,,,,,,,,,,,,,,
Tot_CPHL_b,,mass_concentration_of_HPLC_DV_CPHL_b_+_MV_CPHL_b_in_sea_water,mg m-3,-999,Data products computed from pigment concentration data,,,,,,,,,,,,,,,,,,,,,,,,,,,,,,,,,,,,,,,,,,,,,,,,,,
Tot_CPHL_c,,mass_concentration_of_HPLC_CPHL_c1_+_CPHL_c2_(CPHL_c1c2)_+_CPHL_c3_in_sea_water,mg m-3,-999,Data products computed from pigment concentration data,,,,,,,,,,,,,,,,,,,,,,,,,,,,,,,,,,,,,,,,,,,,,,,,,,
Tot_CPHL,,mass_concentration_of_Tot_CPHL_a_+_Tot_CPHL_b_+_Tot_CPHL_c_in_sea_water,mg m-3,-999,Data products computed from pigment concentration data,,,,,,,,,,,,,,,,,,,,,,,,,,,,,,,,,,,,,,,,,,,,,,,,,,
PPC,,mass_concentration_of_Photoprotective_carotenoids_(Allo_+_Diadino_+_Diato_+_Zeo_+_alpha-beta-Car)_in_sea_water,mg m-3,-999,Data products computed from pigment concentration data,,,,,,,,,,,,,,,,,,,,,,,,,,,,,,,,,,,,,,,,,,,,,,,,,,
PSC,,mass_concentration_of_Photosynthetic_carotenoids_(But-fuco_+_Fuco_+_Hex-fuco_+_Perid)_in_sea_water,mg m-3,-999,Data products computed from pigment concentration data,,,,,,,,,,,,,,,,,,,,,,,,,,,,,,,,,,,,,,,,,,,,,,,,,,
PSP,,mass_concentration_of_Photosynthetic_pigments_(PSC_+_Tchl)_in_sea_water,mg m-3,-999,Data products computed from pigment concentration data,,,,,,,,,,,,,,,,,,,,,,,,,,,,,,,,,,,,,,,,,,,,,,,,,,
Tacc,,mass_concentration_of_Total_accessory_pigments_(PPC_+_PSC_+_Tot_CPHL_b_+_Tot_CPHL_c)_in_sea_water,mg m-3,-999,Data products computed from pigment concentration data,,,,,,,,,,,,,,,,,,,,,,,,,,,,,,,,,,,,,,,,,,,,,,,,,,
Tpg,,mass_concentration_of_total_pigment_in_sea_water,mg m-3,-999,Data products computed from pigment concentration data,,,,,,,,,,,,,,,,,,,,,,,,,,,,,,,,,,,,,,,,,,,,,,,,,,
DP,,mass_concentration_of_Total_diagnostic_pigments_(PSC_+_Allo_+_Zea_+_Tot_CPHL_b)_in_sea_water,mg m-3,-999,Data products computed from pigment concentration data,,,,,,,,,,,,,,,,,,,,,,,,,,,,,,,,,,,,,,,,,,,,,,,,,,
,,,,,,,,,,,,,,,,,,,,,,,,,,,,,,,,,,,,,,,,,,,,,,,,,,,,,,,
,,,,,,,,,,,,,,,,,,,,,,,,,,,,,,,,,,,,,,,,,,,,,,,,,,,,,,,
DATA,,,,,,,,,,,,,,,,,,,,,,,,,,,,,,,,,,,,,,,,,,,,,,,,,,,,,,,
Time,Station_Code,Latitude,Longitude,Depth,CPHL_c3,Mg_DVP,CPHL_c2,CPHL_c1,CPHL_c1c2,CPHLIDE_a,Phide_a,Perid,Pyrophide_a,But_fuco,Fuco,Neo,Keto_Hex_fuco,Pras,Viola,Hex_fuco,Asta,Diadchr,Diadino,Dino,Anth,Allo,Diato,Zea,Lut,Cantha,Gyro,DV_CPHL_b,CPHL_b,DV_CPHL_b_plus_CPHL_b,DV_CPHL_a,CPHL_a,DV_CPHL_a_plus_CPHL_a,Echin,Phytin_b,Phytin_a,Lyco,beta_epi_Car,beta_beta_Car,alpha_beta_Car,Pyrophytin_a,Tot_CPHL_a,Tot_CPHL_b,Tot_CPHL_c,Tot_CPHL,PPC,PSC,PSP,Tacc,Tpg,DP
2010-11-15T22:10:00Z,HC01,-18.3024,146.1131,0,0.035,0,0.519,0.395,-999,0,0,0.546,0,0,0.864,0.093,0,0.224,0.058,0.022,0,-999,0.188,-999,0.01,0.055,0.006,0.114,0.031,0,0,0,0.853,-999,0,4.075,-999,0,0,0,-999,-999,-999,0.13,0,4.075,0.853,0.948,5.876,0.494,1.432,7.308,3.727,7.802,2.453
2010-11-16T01:14:00Z,HC02,-18.3599,146.1411,0,0.039,0,0.752,0.447,-999,0,0.153,0.786,0,0,0.798,0.106,0,0.224,0.071,0.059,0,-999,0.287,-999,0.011,0.333,0.043,0.112,0.021,0,0,0,0.927,-999,0,5.846,-999,0,0,0,-999,-999,-999,0.246,0,5.846,0.927,1.238,8.011,1.02,1.643,9.654,4.828,10.674,3.014
2010-11-16T02:31:00Z,HC03,-18.4079,146.1641,0,0.013,0,0.252,0.201,-999,0,0.033,0.157,0,0,0.353,0.043,0,0.099,0.032,0.009,0,-999,0.072,-999,0,0.17,0.017,0.032,0.011,0,0,0,0.416,-999,0,2.425,-999,0,0,0,-999,-999,-999,0.09,0,2.425,0.416,0.466,3.307,0.38,0.519,3.826,1.782,4.206,1.136
2010-11-16T04:15:00Z,HC04,-18.4368,146.1777,0,0.01,0,0.311,0.22,-999,0,0,0.202,0,0,0.495,0.045,0,0.089,0.039,0,0,-999,0.103,-999,0.004,0.273,0.023,0.037,0.012,0,0,0,0.415,-999,0,3.262,-999,0,0,0,-999,-999,-999,0.122,0,3.262,0.415,0.541,4.218,0.558,0.696,4.915,2.21,5.473,1.422
2010-11-16T04:47:00Z,HC05,-18.4438,146.1996,0,0,0,0.17,0.153,-999,0,0,0.122,0,0,0.3,0.017,0,0.034,0.019,0,0,-999,0.204,-999,0,0.212,0.018,0.031,0.014,0,0,0,0.168,-999,0,1.996,-999,0,0,0,-999,-999,-999,0.085,0,1.996,0.168,0.323,2.487,0.55,0.422,2.909,1.463,3.4589999999999996,0.833
2010-11-16T06:07:00Z,HC06,-18.4897,146.2351,0,0,0,0.024,0.023,-999,0,0.093,0.033,0,0,0.094,0.008,0,0,0.012,0,0,-999,0.02,-999,0,0.042,0,0.031,0.032,0,0,0,0.068,-999,0,0.613,-999,0,0,0,-999,-999,-999,0.039,0,0.613,0.068,0.048,0.729,0.131,0.126,0.855,0.374,0.986,0.267
2010-11-16T08:00:00Z,HC08,-18.4917,146.2872,0,0.023,0,0.21,0.285,-999,0,0.107,0.01,0,0,0.891,0.014,0,0.037,0.01,0.01,0,-999,0.076,-999,0,0.018,0,0.039,0.004,0,0,0,0.123,-999,0,2.172,-999,0,0,0,-999,-999,-999,0.077,0,2.172,0.123,0.518,2.814,0.211,0.911,3.725,1.763,3.936,1.092
2010-11-17T00:15:00Z,HC09,-18.4917,146.2878,0,0,0,0.176,0.174,-999,0,0.14,0.048,0,0,0.679,0.02,0,0.03,0.022,0,0,-999,0.076,-999,0,0.163,0,0.031,0.016,0,0,0,0.182,-999,0,2.578,-999,0,0,0,-999,-999,-999,0.085,0,2.578,0.182,0.35,3.111,0.355,0.727,3.838,1.614,4.193,1.103
2010-11-17T01:45:00Z,HC10,-18.4897,146.2371,0,0,0,0.198,0.235,-999,0,0.089,0.041,0,0,0.608,0.016,0,0.032,0.014,0,0,-999,0.062,-999,0,0.162,0.026,0.018,0.006,0,0,0,0.153,-999,0,2.331,-999,0,0,0,-999,-999,-999,0.083,0,2.331,0.153,0.433,2.917,0.35,0.649,3.565,1.585,3.915,0.982
2010-11-17T03:00:00Z,HC11,-18.4434,146.1998,0,0,0,0.248,0.221,-999,0,0.118,0.075,0,0,0.393,0.022,0,0.041,0.02,0,0,-999,0.055,-999,0.006,0.299,0.029,0.027,0.007,0,0,0,0.213,-999,0,2.716,-999,0,0,0,-999,-999,-999,0.105,0,2.716,0.213,0.469,3.399,0.514,0.468,3.867,1.664,4.381,1.007
2010-11-17T04:00:00Z,HC12,-18.3842,146.196,0,0,0,0.344,0.389,-999,0,0.107,0.214,0,0,0.382,0.043,0,0.088,0.031,0,0,-999,0.096,-999,0.007,0.329,0.038,0.013,0.008,0,0,0,0.359,-999,0,2.763,-999,0,0,0,-999,-999,-999,0.105,0,2.763,0.359,0.733,3.854,0.581,0.596,4.451,2.269,5.032,1.297
2010-11-17T05:30:00Z,HC13,-18.3335,146.1389,0,0.019,0,0.147,0.115,-999,0,0.043,0.068,0,0.007,0.315,0.036,0,0.086,0.04,0.021,0,-999,0.076,-999,0.009,0.032,0.007,0.262,0.015,0,0,0,0.308,-999,0,1.777,-999,0,0,0,-999,-999,-999,0.102,0,1.777,0.308,0.282,2.367,0.479,0.41,2.777,1.479,3.2560000000000002,1.013
2010-11-17T06:30:00Z,HC14,-18.3032,146.114,0,0.027,0,0.071,0.042,-999,0,0.025,0.025,0,0.008,0.162,0.016,0,0.043,0.019,0.033,0,-999,0.045,-999,0.004,0.017,0.005,0.179,0.008,0,0,0,0.152,-999,0,0.914,-999,0,0,0,-999,-999,-999,0.058,0,0.914,0.152,0.139,1.205,0.302,0.227,1.433,0.821,1.735,0.575
2010-11-18T00:15:00Z,HC15,-18.3038,146.114,0,0.018,0,0.257,0.247,-999,0,0.06,0.03,0,0,0.811,0.069,0,0.178,0.039,0.023,0,-999,0.088,-999,0.006,0.058,0,0.098,0.015,0,0,0,0.655,-999,0,3.298,-999,0,0,0,-999,-999,-999,0.137,0,3.298,0.655,0.523,4.475,0.382,0.865,5.34,2.424,5.7219999999999995,1.676
2010-11-18T02:00:00Z,HC16,-18.3624,146.1424,0,0.028,0,0.191,0.118,-999,0,0.034,0.11,0,0,0.385,0.039,0,0.088,0.042,0.035,0,-999,0.085,-999,0.007,0.095,0,0.143,0.013,0,0,0,0.35,-999,0,2.138,-999,0,0,0,-999,-999,-999,0.096,0,2.138,0.35,0.337,2.825,0.42,0.531,3.356,1.637,3.776,1.119
2010-11-18T03:28:00Z,HC17,-18.4085,146.1643,0,0.036,0,0.638,0.246,-999,0,0.157,0.243,0,0,0.564,0.039,0,0.088,0.038,0.018,0,-999,0.145,-999,0.005,0.738,0.047,0.058,0.012,0,0,0,0.398,-999,0,5.78,-999,0,0,0,-999,-999,-999,0.255,0,5.78,0.398,0.921,7.099,1.243,0.825,7.924,3.387,9.167,2.02
2010-11-18T04:44:00Z,HC18,-18.4363,146.1772,0,0.018,0,0.522,0.317,-999,0,0.128,0.255,0,0,0.708,0.042,0,0.095,0.04,0.013,0,-999,0.155,-999,0.006,0.432,0.041,0.06,0.012,0,0,0,0.486,-999,0,4.921,-999,0,0,0,-999,-999,-999,0.208,0,4.921,0.486,0.858,6.265,0.896,0.976,7.241,3.217,8.137,1.955
2010-11-18T06:16:00Z,HC19,-18.4182,146.1999,0,0.021,0,0.356,0.292,-999,0,0.101,0.094,0,0,0.911,0.044,0,0.116,0.035,0.013,0,-999,0.11,-999,0.003,0.165,0.008,0.078,0.01,0,0,0,0.465,-999,0,3.9,-999,0,0,0,-999,-999,-999,0.153,0,3.9,0.465,0.668,5.033,0.515,1.018,6.051,2.666,6.566,1.727
