GLOBAL ATTRIBUTES,,,,,,,,,,,,,,,,,
title,,,,,,,,,,,,,,,,,
project,Integrated Marine Observing System (IMOS),,,,,,,,,,,,,,,,
original_project_name,MERIS validation,,,,,,,,,,,,,,,,
institution,CSIRO Land and Water,,,,,,,,,,,,,,,,
abstract,This record contains in situ water optical property data collected in the Great Barrier Reef (Australia) on the RSV Lady Basten between 21-29 Oct 2002. A total of 28 stations were sampled during the field campaign AO02. The data can be used for Ocean Colour sensor validation| optical water quality monitoring and modelling. CLW deployed the optical instruments TriOS RAMSES (hyperspectral irradiance)| WETLabs AC-9 (absorption and attenuation coefficicents)| HOBILabs Hydroscat-6 (backscattering coefficient) during this cruise.This data was part of the dataset described in Oubelkheir et al. 2004| Bio-optical characterisation of Australian ocean| coastal and estuarine waters In SPIE| Ocean Optics XVII| Fremantle (Aus.) and Blondeau-Patissier et al. 2009| JGR| VOL. 114| C05003| doi:10.1029/2008JC005039. Funding for this study was provided by CSIRO Earth Observation Centre| CSIRO Land and Water| CSIRO Marine Research and the Australian Institute of Marine Sciences. We also thank the captains and crews of the RSV Lady Basten.,,,,,,,,,,,,,,,,
conventions,IMOS biological data format (v1.0),,,,,,,,,,,,,,,,
date_created,2002-10-25T00:35:50Z,,,,,,,,,,,,,,,,
date_modified,2002-10-25T01:48:08Z,,,,,,,,,,,,,,,,
history,Data has been quality controlled by in-house procedures. HS-6 data were corrected for temperature using CTD data and the Sigma correction method| recommended by the manufacturer| was applied using absorption and attenuation data from the AC-9. The Sigma correction is an adjustment to improve the accuracy of backscattering measurements| in particular in highly-attenuating water. The correction is detailed in HOBI-labs Inc.| 2003. The backscattering coefficient bb is estimated using the method described in Maffione and Dana| 1997| Applied Optics| 36(24)| pp.6057-6067.,,,,,,,,,,,,,,,,
comment,The HydroScat-6 (HS-6) is a self-contained instrument for measuring optical backscattering at six different wavelengths in natural waters. The particulate backscattering coefficient| bbp (lambda)| is a measure of light scattering by particles at angles between 90 and 180 degrees. bbp was estimated by subtracting bbw (lambda)| the backscattering coefficient of pure sea-water| from bb (lambda). The pure seawater backscattering coefficient was calculated using a backscattering ratio of 0.5 (Gordon et al.| 1988| Journal of Geophysical Research) and the seawater scattering coefficients| bw(lambda)| of Morel (1974| Optical properties of pure water and pure seawater| p. 1-24| in Optical Aspects of Oceanography).,,,,,,,,,,,,,,,,
source,Particulate Scattering coefficients determined using an HS-6 (www.hobilabs.com),,,,,,,,,,,,,,,,
keywords,Oceans>Ocean Optics > Scattering ;Oceans>Ocean Optics>Ocean Colour;,,,,,,,,,,,,,,,,
cruise_id,LB3172,,,,,,,,,,,,,,,,
vessel_name,RSV Lady Basten,,,,,,,,,,,,,,,,
platform_code,VLAB_450301529,,,,,,,,,,,,,,,,
references,https://marlin.csiro.au/geonetwork/srv/eng/catalog.search#/metadata/de47e8c0-5315-446e-b637-cf2630ea5f61,,,,,,,,,,,,,,,,
naming_authority,CSIRO Land and Water (CLW),,,,,,,,,,,,,,,,
cdm_data_type,profile,,,,,,,,,,,,,,,,
geospatial_lat_min,,,,,,,,,,,,,,,,,
geospatial_lat_max,,,,,,,,,,,,,,,,,
geospatial_lon_min,,,,,,,,,,,,,,,,,
geospatial_lon_max,,,,,,,,,,,,,,,,,
geospatial_vertical_min,0,,,,,,,,,,,,,,,,
geospatial_vertical_max,0,,,,,,,,,,,,,,,,
local_time_zone,10,,,,,,,,,,,,,,,,
data_centre,eMarine Information Infrastructure (eMII),,,,,,,,,,,,,,,,
data_centre_email,info@emii.org.au,,,,,,,,,,,,,,,,
author,Brando Vittorio,,,,,,,,,,,,,,,,
author_email,vittorio.brando@csiro.au,,,,,,,,,,,,,,,,
principal_investigator,Furnas Miles,,,,,,,,,,,,,,,,
principal_investigator_email,m.furnas@aims.gov.au,,,,,,,,,,,,,,,,
publisher,Australian Ocean Data Network,,,,,,,,,,,,,,,,
publisher_email,info@aodn.org.au,,,,,,,,,,,,,,,,
institution,IMOS Satellite Remote Sensing - Ocean Colour Sub-facility - Bio-Optical Database of Australian Waters,,,,,,,,,,,,,,,,
institution_principal_investigator,"Schroeder, Thomas",,,,,,,,,,,,,,,,
institution_principal_investigator_email,Thomas.Schroeder@csiro.au, ,,,,,,,,,,,,,,,
citation,To cite this data set in a publication use the format <<IMOS [year-of-data-downloaded] [Title] [data-access-url] accessed [date-of-access]>>,,,,,,,,,,,,,,,,
acknowledgement,Data was sourced from the Commonwealth Scientific and Industrial Research Organisation (CSIRO),,,,,,,,,,,,,,,,
distribution_statement,"Any users of IMOS data are required to clearly acknowledge the source of the material- Data or products or services from IMOS are provided ""as is"" without any warranty as to fitness for a particular purpose.",,,,,,,,,,,,,,,,
,,,,,,,,,,,,,,,,,
TABLE ROWS,,,,,,,,,,,,,,,,,
Row name,CF standard_name,IMOS long_name,Units,Fill value,Comments,,,,,,,,,,,,
Wavelength,radiation_wavelength,Wavelength of measurement,nm,-999,,,,,,,,,,,,,
,,,,,,,,,,,,,,,,,
TABLE COLUMNS,,,,,,,,,,,,,,,,,
Column name,CF standard_name,IMOS long_name,Units,Fill value,Comments,,,,,,,,,,,,
Time,time,analysis_time,YYYY-MM-DDThh:mm:ssZ,,UTC date and time,,,,,,,,,,,,
Station_Code,,,,,National Reference Station code (6 letters),,,,,,,,,,,,
Latitude,latitude,latitude,degrees_north,-999,North positive,,,,,,,,,,,,
Longitude,longitude,longitude,degrees_east,-999,East positive,,,,,,,,,,,,
Depth,depth,depth,m ,-999,positive down,,,,,,,,,,,,
bb_corr,,corrected_volume_total_backwards_scattering_coefficient_of_(bbw_+_bbp)_in_sea_water,m-1,-999,bbw:volume_backwards_scattering_coefficient_of_radiative_flux_in_sea_water ; bbp=volume_backwards_scattering_coefficient_of_particules_in_sea_water,,,,,,,,,,,,
bb_uncorr,,volume_total_backwards_scattering_coefficient_of_(bbw_+_bbp)_in_sea_water,m-1,-999,bbw:volume_backwards_scattering_coefficient_of_radiative_flux_in_sea_water ; bbp=volume_backwards_scattering_coefficient_of_particules_in_sea_water,,,,,,,,,,,,
,,,,,,,,,,,,,,,,,
,,,,,,,,,,,,,,,,,
DATA,,,,,,,,,,,,,,,,,
,Time,Station_Code,Latitude,Longitude,Depth,bb_corr,bb_corr,bb_corr,bb_corr,bb_corr,bb_corr,bb_uncorr,bb_uncorr,bb_uncorr,bb_uncorr,bb_uncorr,bb_uncorr
Wavelength,,,,,,442,448,555,589,676,852,442,448,555,589,676,852
,2002-10-25T00:35:50Z,SAT011,-20.01,149.15,0,0.005134,0.00342,0.001956,0.002302,0.002116,0.001085,0.005111,0.003402,0.001951,0.002343,0.002125,0.000782
,2002-10-25T00:39:45Z,SAT011,-20.01,149.15,0.2,0.004593,0.002956,0.001817,0.001482,0.002045,0.000654,0.00457,0.00294,0.001811,0.001508,0.002052,0.000472
,2002-10-25T00:39:41Z,SAT011,-20.01,149.15,0.4,0.005262,0.003522,0.001846,0.001307,0.002007,0.000559,0.005231,0.003502,0.001839,0.001328,0.002011,0.000404
,2002-10-25T00:36:02Z,SAT011,-20.01,149.15,0.6,0.005022,0.003622,0.00243,0.001556,0.002402,0.00105,0.00499,0.003601,0.002421,0.001582,0.002406,0.000758
,2002-10-25T00:39:32Z,SAT011,-20.01,149.15,0.8,0.005632,0.002726,0.002219,0.00136,0.001754,0.000688,0.005592,0.002709,0.002208,0.001381,0.001755,0.000497
,2002-10-25T00:51:34Z,SAT011,-20.01,149.15,1,0.005452,0.003059,0.002315,0.001489,0.002467,0.000981,0.005411,0.003039,0.002303,0.001511,0.002467,0.000708
,2002-10-25T00:40:00Z,SAT011,-20.01,149.15,1.2,0.005335,0.003127,0.00225,0.001232,0.002008,0.001006,0.005291,0.003105,0.002236,0.00125,0.002006,0.000727
,2002-10-25T00:53:31Z,SAT011,-20.01,149.15,1.4,0.00552,0.002662,0.001654,0.001319,0.002263,0.001015,0.005471,0.002643,0.001644,0.001338,0.002258,0.000733
,2002-10-25T00:51:37Z,SAT011,-20.01,149.15,1.6,0.005759,0.00306,0.00203,0.00161,0.002437,0.001084,0.005712,0.003039,0.002018,0.001634,0.002434,0.000782
,2002-10-25T00:48:52Z,SAT011,-20.01,149.15,1.8,0.004624,0.003025,0.002327,0.001477,0.002126,0.001221,0.004588,0.003006,0.002314,0.0015,0.002125,0.000882
,2002-10-25T00:39:23Z,SAT011,-20.01,149.15,2,0.005875,0.003157,0.002275,0.00185,0.002331,0.00098,0.005832,0.003138,0.002264,0.00188,0.002331,0.000708
,2002-10-25T00:40:06Z,SAT011,-20.01,149.15,2.2,0.004481,0.002791,0.001528,0.001226,0.001871,0.000722,0.004449,0.002775,0.001521,0.001245,0.00187,0.000522
,2002-10-25T00:51:40Z,SAT011,-20.01,149.15,2.4,0.006177,0.002626,0.001687,0.001526,0.002075,0.001359,0.006133,0.00261,0.001677,0.001548,0.002073,0.000981
,2002-10-25T00:39:22Z,SAT011,-20.01,149.15,2.6,0.005753,0.003023,0.001736,0.00157,0.002667,0.000963,0.005712,0.003006,0.001727,0.001595,0.002668,0.000696
,2002-10-25T00:40:08Z,SAT011,-20.01,149.15,2.8,0.004483,0.002891,0.00177,0.001364,0.001976,0.000852,0.004449,0.002874,0.001761,0.001385,0.001975,0.000615
,2002-10-25T00:48:42Z,SAT011,-20.01,149.15,3,0.005189,0.002693,0.001855,0.001404,0.002066,0.000989,0.005148,0.002676,0.001845,0.001426,0.002064,0.000714
,2002-10-25T00:40:11Z,SAT011,-20.01,149.15,3.2,0.00497,0.003059,0.001682,0.001364,0.002241,0.000981,0.00493,0.003039,0.001672,0.001385,0.002239,0.000708
,2002-10-25T00:36:40Z,SAT011,-20.01,149.15,3.4,0.005335,0.002993,0.001816,0.001303,0.002103,0.000869,0.005291,0.002973,0.001806,0.001323,0.0021,0.000627
,2002-10-25T00:48:38Z,SAT011,-20.01,149.15,3.6,0.00508,0.002728,0.001884,0.001478,0.002153,0.000921,0.005037,0.002709,0.001873,0.0015,0.00215,0.000664
,2002-10-25T00:48:36Z,SAT011,-20.01,149.15,3.8,0.004958,0.002861,0.002357,0.001541,0.002155,0.001067,0.004915,0.002841,0.002342,0.001564,0.002152,0.00077
,2002-10-25T00:40:17Z,SAT011,-20.01,149.15,4,0.00467,0.002895,0.001952,0.001411,0.002184,0.000757,0.00463,0.002874,0.00194,0.001432,0.00218,0.000546
,2002-10-25T00:48:33Z,SAT011,-20.01,149.15,4.2,0.0056,0.002529,0.002121,0.001496,0.002497,0.001007,0.00555,0.002511,0.002108,0.001517,0.002491,0.000727
,2002-10-25T00:39:16Z,SAT011,-20.01,149.15,4.4,0.006431,0.002929,0.002065,0.002087,0.002582,0.001488,0.006373,0.002907,0.002052,0.002117,0.002577,0.001074
,2002-10-25T00:48:29Z,SAT011,-20.01,149.15,4.6,0.005012,0.003328,0.002358,0.001502,0.00235,0.001187,0.004967,0.003303,0.002342,0.001523,0.002346,0.000857
,2002-10-25T00:51:47Z,SAT011,-20.01,149.15,4.8,0.006187,0.002828,0.001941,0.001484,0.002434,0.001239,0.006133,0.002808,0.001929,0.001506,0.002429,0.000894
,2002-10-25T00:39:15Z,SAT011,-20.01,149.15,5,0.005763,0.003461,0.002493,0.00203,0.002728,0.001333,0.005712,0.003436,0.002477,0.002059,0.002723,0.000963
,2002-10-25T00:40:25Z,SAT011,-20.01,149.15,5.2,0.005097,0.002995,0.001609,0.001533,0.002241,0.000972,0.005051,0.002973,0.001599,0.001554,0.002237,0.000702
,2002-10-25T00:39:14Z,SAT011,-20.01,149.15,5.4,0.006007,0.003495,0.002369,0.002038,0.00286,0.00142,0.005952,0.003469,0.002354,0.002067,0.002854,0.001025
,2002-10-25T00:39:13Z,SAT011,-20.01,149.15,5.6,0.006735,0.003828,0.002684,0.00207,0.003457,0.00198,0.006674,0.003799,0.002667,0.0021,0.003451,0.001428
,2002-10-25T00:39:12Z,SAT011,-20.01,149.15,5.8,0.007583,0.004026,0.002897,0.002636,0.003624,0.002005,0.007516,0.003997,0.002879,0.002674,0.00362,0.001447
,2002-10-25T00:40:29Z,SAT011,-20.01,149.15,6,0.005521,0.003128,0.001817,0.001552,0.002688,0.001041,0.005471,0.003105,0.001806,0.001574,0.002684,0.000751
,2002-10-25T00:51:52Z,SAT011,-20.01,149.15,6.2,0.006856,0.003128,0.00215,0.001477,0.002473,0.001248,0.006794,0.003105,0.002136,0.001498,0.002468,0.0009
,2002-10-25T00:48:15Z,SAT011,-20.01,149.15,6.4,0.005753,0.003194,0.002087,0.001636,0.002304,0.001076,0.005702,0.003171,0.002074,0.001659,0.002301,0.000776
,2002-10-25T00:40:33Z,SAT011,-20.01,149.15,6.6,0.005278,0.003361,0.001992,0.001601,0.002336,0.001205,0.005231,0.003336,0.001979,0.001624,0.002333,0.000869
,2002-10-25T00:48:12Z,SAT011,-20.01,149.15,6.8,0.0057,0.003294,0.00229,0.001605,0.002598,0.001266,0.00565,0.00327,0.002275,0.001628,0.002595,0.000913
,2002-10-25T00:53:57Z,SAT011,-20.01,149.15,7,0.004731,0.003427,0.00225,0.001601,0.002315,0.001119,0.00469,0.003402,0.002236,0.001624,0.002312,0.000807
,2002-10-25T00:36:57Z,SAT011,-20.01,149.15,7.2,0.00546,0.003128,0.00229,0.001674,0.002407,0.001179,0.005411,0.003105,0.002275,0.001698,0.002402,0.000851
,2002-10-25T00:40:37Z,SAT011,-20.01,149.15,7.4,0.00534,0.003662,0.002437,0.002032,0.003385,0.001162,0.005291,0.003634,0.002421,0.002061,0.003378,0.000838
,2002-10-25T00:53:59Z,SAT011,-20.01,149.15,7.6,0.00522,0.003296,0.001992,0.001642,0.002339,0.001068,0.005171,0.00327,0.001979,0.001665,0.002333,0.00077
,2002-10-25T00:37:00Z,SAT011,-20.01,149.15,7.8,0.005646,0.003197,0.002066,0.001729,0.002589,0.001265,0.005592,0.003171,0.002052,0.001753,0.002582,0.000913
,2002-10-25T00:52:33Z,SAT011,-20.01,149.15,8,0.006377,0.003065,0.002584,0.001773,0.002441,0.001377,0.006313,0.003039,0.002566,0.001798,0.002434,0.000994
,2002-10-25T00:39:06Z,SAT011,-20.01,149.15,8.2,0.007899,0.004299,0.002501,0.003669,0.003944,0.001671,0.007816,0.004261,0.002482,0.003718,0.003931,0.001205
,2002-10-25T00:52:31Z,SAT011,-20.01,149.15,8.4,0.006685,0.003133,0.002062,0.001744,0.002836,0.001154,0.006614,0.003105,0.002046,0.001767,0.002826,0.000832
,2002-10-25T00:40:46Z,SAT011,-20.01,149.15,8.6,0.005288,0.003533,0.002372,0.001742,0.002681,0.001222,0.005231,0.003502,0.002354,0.001765,0.002671,0.000882
,2002-10-25T00:51:59Z,SAT011,-20.01,149.15,8.8,0.007173,0.0033,0.002124,0.001721,0.002536,0.001524,0.007095,0.00327,0.002108,0.001743,0.002527,0.001099
,2002-10-25T00:52:00Z,SAT011,-20.01,149.15,9,0.00681,0.003467,0.002305,0.001858,0.003016,0.00167,0.006734,0.003436,0.002286,0.001882,0.003004,0.001205
,2002-10-25T00:47:52Z,SAT011,-20.01,149.15,9.2,0.005909,0.004035,0.00301,0.002078,0.002789,0.001533,0.005842,0.003997,0.002985,0.002104,0.002778,0.001105
,2002-10-25T00:37:07Z,SAT011,-20.01,149.15,9.4,0.006325,0.003535,0.002351,0.001864,0.003156,0.001472,0.006253,0.003502,0.002331,0.001887,0.003143,0.001062
,2002-10-25T00:52:03Z,SAT011,-20.01,149.15,9.6,0.006508,0.003235,0.002289,0.001853,0.002664,0.001403,0.006433,0.003204,0.00227,0.001876,0.002653,0.001012
,2002-10-25T00:37:09Z,SAT011,-20.01,149.15,9.8,0.005717,0.003335,0.002328,0.001812,0.002768,0.001197,0.005652,0.003303,0.002309,0.001835,0.002757,0.000863
,2002-10-25T00:47:44Z,SAT011,-20.01,149.15,10,0.006463,0.003368,0.002903,0.00187,0.002977,0.001369,0.00639,0.003336,0.002879,0.001893,0.002965,0.000987
,2002-10-25T00:40:58Z,SAT011,-20.01,149.15,10.2,0.00596,0.004336,0.002599,0.001813,0.003121,0.001145,0.005892,0.004294,0.002577,0.001835,0.003109,0.000826
,2002-10-25T00:40:57Z,SAT011,-20.01,149.15,10.4,0.004744,0.003769,0.002616,0.00194,0.002696,0.001275,0.00469,0.003733,0.002594,0.001963,0.002685,0.000919
,2002-10-25T00:38:20Z,SAT011,-20.01,149.15,10.6,0.005778,0.00457,0.004195,0.00234,0.003091,0.00174,0.005712,0.004526,0.004159,0.002368,0.003079,0.001254
,2002-10-25T00:38:56Z,SAT011,-20.01,149.15,10.8,0.007786,0.005003,0.004139,0.002196,0.003538,0.001981,0.007696,0.004955,0.004103,0.002222,0.003524,0.001428
,2002-10-25T00:47:37Z,SAT011,-20.01,149.15,11,0.006318,0.003903,0.003057,0.001905,0.003069,0.001395,0.006244,0.003865,0.00303,0.001928,0.003057,0.001006
,2002-10-25T00:47:35Z,SAT011,-20.01,149.15,11.2,0.006547,0.003235,0.002803,0.001932,0.002915,0.001464,0.006472,0.003204,0.002778,0.001956,0.002904,0.001056
,2002-10-25T00:47:33Z,SAT011,-20.01,149.15,11.4,0.006009,0.004135,0.003051,0.001994,0.003128,0.001214,0.005941,0.004096,0.003024,0.002018,0.003116,0.000876
,2002-10-25T00:41:05Z,SAT011,-20.01,149.15,11.6,0.006933,0.004369,0.00313,0.002398,0.003701,0.001792,0.006854,0.004327,0.003103,0.002427,0.003687,0.001292
,2002-10-25T00:54:21Z,SAT011,-20.01,149.15,11.8,0.005716,0.003268,0.001979,0.001707,0.002577,0.001188,0.005652,0.003237,0.001962,0.001728,0.002568,0.000857
,2002-10-25T00:47:29Z,SAT011,-20.01,149.15,12,0.006079,0.003635,0.003061,0.00181,0.002725,0.001318,0.006011,0.003601,0.003036,0.001833,0.002716,0.00095
,2002-10-25T00:47:26Z,SAT011,-20.01,149.15,12.2,0.006201,0.003534,0.002914,0.001872,0.002788,0.001568,0.006133,0.003502,0.00289,0.001895,0.00278,0.00113
,2002-10-25T00:54:23Z,SAT011,-20.01,149.15,12.4,0.006018,0.002933,0.002609,0.001719,0.002668,0.00112,0.005952,0.002907,0.002588,0.001741,0.002661,0.000807
,2002-10-25T00:47:21Z,SAT011,-20.01,149.15,12.6,0.006455,0.003634,0.00239,0.002035,0.002977,0.001516,0.006384,0.003601,0.00237,0.002061,0.002968,0.001093
,2002-10-25T00:47:20Z,SAT011,-20.01,149.15,12.8,0.006815,0.004067,0.004238,0.00181,0.00325,0.001405,0.00674,0.00403,0.004204,0.001833,0.003241,0.001012
,2002-10-25T00:41:15Z,SAT011,-20.01,149.15,13,0.006189,0.004133,0.002665,0.001964,0.003599,0.001783,0.006122,0.004096,0.002644,0.001989,0.003589,0.001285
,2002-10-25T00:54:27Z,SAT011,-20.01,149.15,13.2,0.00702,0.0033,0.002226,0.001742,0.002996,0.001068,0.006944,0.00327,0.002208,0.001765,0.002988,0.00077
,2002-10-25T00:47:16Z,SAT011,-20.01,149.15,13.4,0.00616,0.003767,0.002959,0.001715,0.00294,0.001508,0.006093,0.003733,0.002935,0.001737,0.002933,0.001087
,2002-10-25T00:54:30Z,SAT011,-20.01,149.15,13.6,0.005971,0.0037,0.002536,0.001758,0.002621,0.001284,0.005906,0.003667,0.002516,0.00178,0.002614,0.000925
,2002-10-25T00:47:12Z,SAT011,-20.01,149.15,13.8,0.00559,0.003669,0.002706,0.001826,0.002781,0.001561,0.005527,0.003634,0.002683,0.001848,0.002773,0.001124
,2002-10-25T00:47:11Z,SAT011,-20.01,149.15,14,0.005542,0.003867,0.003308,0.001823,0.002721,0.001698,0.00548,0.003832,0.003282,0.001846,0.002714,0.001223
,2002-10-25T00:47:10Z,SAT011,-20.01,149.15,14.2,0.006733,0.003634,0.002474,0.001783,0.002869,0.001508,0.006658,0.003601,0.002454,0.001806,0.002862,0.001087
,2002-10-25T00:41:24Z,SAT011,-20.01,149.15,14.4,0.007354,0.004202,0.004172,0.002634,0.003183,0.001785,0.00727,0.004162,0.004137,0.002666,0.003173,0.001285
,2002-10-25T00:54:35Z,SAT011,-20.01,149.15,14.6,0.006422,0.004136,0.002863,0.002062,0.003272,0.00163,0.006349,0.004096,0.00284,0.002088,0.003262,0.001174
,2002-10-25T00:41:26Z,SAT011,-20.01,149.15,14.8,0.006339,0.004002,0.002666,0.002297,0.003271,0.001741,0.006268,0.003964,0.002644,0.002326,0.003262,0.001254
,2002-10-25T00:54:36Z,SAT011,-20.01,149.15,15,0.007171,0.003635,0.002891,0.002079,0.003185,0.001776,0.00709,0.003601,0.002868,0.002106,0.003177,0.001279
,2002-10-25T00:41:29Z,SAT011,-20.01,149.15,15.2,0.007082,0.004301,0.003325,0.002323,0.003642,0.00213,0.007002,0.004261,0.003298,0.002353,0.003632,0.001534
,2002-10-25T00:54:38Z,SAT011,-20.01,149.15,15.4,0.006891,0.0039,0.003049,0.002109,0.003491,0.001802,0.006816,0.003865,0.003024,0.002137,0.003483,0.001298
,2002-10-25T00:41:31Z,SAT011,-20.01,149.15,15.6,0.007231,0.004136,0.00301,0.002053,0.00341,0.001872,0.007148,0.004096,0.002985,0.002078,0.003399,0.001348
,2002-10-25T00:54:40Z,SAT011,-20.01,149.15,15.8,0.006452,0.004135,0.002982,0.002274,0.003142,0.002217,0.006378,0.004096,0.002957,0.002302,0.003132,0.001596
,2002-10-25T00:54:42Z,SAT011,-20.01,149.15,16,0.006726,0.004135,0.003561,0.002042,0.003299,0.001595,0.006652,0.004096,0.003533,0.002069,0.00329,0.001149
,2002-10-25T00:46:52Z,SAT011,-20.01,149.15,16.2,0.006312,0.003399,0.002778,0.001979,0.003027,0.001569,0.006244,0.003368,0.002756,0.002004,0.00302,0.00113
,2002-10-25T00:41:36Z,SAT011,-20.01,149.15,16.4,0.006601,0.005033,0.002868,0.002444,0.003695,0.002018,0.00653,0.004988,0.002846,0.002476,0.003686,0.001453
,2002-10-25T00:46:49Z,SAT011,-20.01,149.15,16.6,0.005778,0.003861,0.003223,0.001946,0.002971,0.001397,0.005714,0.003826,0.003198,0.001971,0.002963,0.001006
,2002-10-25T00:41:37Z,SAT011,-20.01,149.15,16.8,0.006528,0.004434,0.002727,0.002488,0.003342,0.002389,0.006454,0.004393,0.002706,0.00252,0.003333,0.00172
,2002-10-25T00:46:45Z,SAT011,-20.01,149.15,17,0.006637,0.003792,0.00275,0.002069,0.003367,0.001458,0.006565,0.003758,0.002728,0.002096,0.003358,0.001049
,2002-10-25T00:54:48Z,SAT011,-20.01,149.15,17.2,0.006861,0.003966,0.002834,0.002494,0.003613,0.00226,0.006786,0.003931,0.002812,0.002526,0.003604,0.001627
,2002-10-25T00:41:42Z,SAT011,-20.01,149.15,17.4,0.006438,0.003933,0.003211,0.002094,0.003372,0.001897,0.006367,0.003898,0.003187,0.002121,0.003363,0.001366
,2002-10-25T00:41:46Z,SAT011,-20.01,149.15,17.6,0.006496,0.0049,0.003622,0.002165,0.003256,0.001854,0.006425,0.004856,0.003595,0.002193,0.003248,0.001335
,2002-10-25T00:54:50Z,SAT011,-20.01,149.15,17.8,0.007116,0.004234,0.003533,0.002107,0.003788,0.001837,0.007037,0.004195,0.003505,0.002135,0.003778,0.001323
,2002-10-25T00:54:51Z,SAT011,-20.01,149.15,18,0.006633,0.003831,0.002777,0.002177,0.003355,0.00169,0.006565,0.003799,0.002756,0.002207,0.003347,0.001217
,2002-10-25T00:41:48Z,SAT011,-20.01,149.15,18.2,0.006191,0.004331,0.003294,0.002342,0.003189,0.002104,0.006128,0.004294,0.00327,0.002374,0.003182,0.001515
,2002-10-25T00:41:49Z,SAT011,-20.01,149.15,18.4,0.006577,0.004699,0.002973,0.00216,0.003281,0.00232,0.006507,0.004658,0.002952,0.002189,0.003273,0.00167
,2002-10-25T00:41:52Z,SAT011,-20.01,149.15,18.6,0.00909,0.004167,0.002602,0.002255,0.00331,0.002217,0.00899,0.004129,0.002583,0.002285,0.003301,0.001596
,2002-10-25T00:41:53Z,SAT011,-20.01,149.15,18.8,0.006348,0.004667,0.00461,0.002105,0.003644,0.002027,0.006279,0.004625,0.004573,0.002133,0.003634,0.001459
,2002-10-25T00:46:28Z,SAT011,-20.01,149.15,19,0.006107,0.003721,0.003167,0.00213,0.003632,0.001673,0.00604,0.003687,0.003142,0.002158,0.003621,0.001205
,2002-10-25T00:41:56Z,SAT011,-20.01,149.15,19.2,0.006295,0.004068,0.002485,0.003205,0.003093,0.002106,0.006227,0.00403,0.002465,0.003247,0.003082,0.001515
,2002-10-25T00:46:26Z,SAT011,-20.01,149.15,19.4,0.006396,0.003305,0.003071,0.002407,0.002788,0.001501,0.006326,0.003275,0.003047,0.002439,0.00278,0.001081
,2002-10-25T00:46:25Z,SAT011,-20.01,149.15,19.6,0.006224,0.003548,0.003391,0.002036,0.003067,0.001621,0.006157,0.003516,0.003365,0.002063,0.003059,0.001167
,2002-10-25T00:55:00Z,SAT011,-20.01,149.15,19.8,0.00644,0.0037,0.003007,0.001893,0.003172,0.001457,0.006373,0.003667,0.002985,0.001919,0.003164,0.001049
,2002-10-25T00:42:01Z,SAT011,-20.01,149.15,20,0.006371,0.003634,0.002856,0.002116,0.003401,0.001811,0.006303,0.003601,0.002834,0.002144,0.003392,0.001304
,2002-10-25T00:46:20Z,SAT011,-20.01,149.15,20.2,0.008765,0.003386,0.002918,0.001951,0.003105,0.001845,0.00867,0.003355,0.002896,0.001977,0.003097,0.001329
,2002-10-25T00:42:03Z,SAT011,-20.01,149.15,20.4,0.007056,0.004567,0.003521,0.002326,0.00315,0.001854,0.006979,0.004526,0.003494,0.002357,0.003141,0.001335
,2002-10-25T00:42:05Z,SAT011,-20.01,149.15,20.6,0.006023,0.005,0.002783,0.002147,0.003469,0.001983,0.005959,0.004955,0.002762,0.002176,0.00346,0.001428
,2002-10-25T00:42:06Z,SAT011,-20.01,149.15,20.8,0.007245,0.0042,0.002908,0.002315,0.003786,0.002156,0.007165,0.004162,0.002885,0.002345,0.003775,0.001552
,2002-10-25T00:55:07Z,SAT011,-20.01,149.15,21,0.005676,0.003866,0.002766,0.002112,0.003048,0.001552,0.005615,0.003832,0.002745,0.002141,0.00304,0.001118
,2002-10-25T00:46:13Z,SAT011,-20.01,149.15,21.2,0.007318,0.004012,0.003215,0.002258,0.003383,0.001664,0.007241,0.003977,0.003192,0.002289,0.003374,0.001199
,2002-10-25T00:46:09Z,SAT011,-20.01,149.15,21.4,0.006881,0.003252,0.002529,0.002121,0.003336,0.001785,0.00681,0.003223,0.00251,0.00215,0.003328,0.001285
,2002-10-25T00:42:11Z,SAT011,-20.01,149.15,21.6,0.006157,0.004399,0.003791,0.00226,0.003704,0.002017,0.006093,0.00436,0.003762,0.002291,0.003694,0.001453
,2002-10-25T00:42:13Z,SAT011,-20.01,149.15,21.8,0.006613,0.005366,0.006574,0.00198,0.003532,0.001958,0.006542,0.005318,0.006524,0.002006,0.003522,0.00141
,2002-10-25T00:42:14Z,SAT011,-20.01,149.15,22,0.007008,0.004132,0.002585,0.002316,0.003796,0.00169,0.006932,0.004096,0.002566,0.002347,0.003785,0.001217
,2002-10-25T00:55:13Z,SAT011,-20.01,149.15,22.2,0.005764,0.003333,0.003172,0.002118,0.003041,0.001578,0.005702,0.003303,0.003147,0.002146,0.003032,0.001136
,2002-10-25T00:42:16Z,SAT011,-20.01,149.15,22.4,0.006348,0.003734,0.002614,0.002205,0.003488,0.001871,0.006279,0.0037,0.002594,0.002234,0.003477,0.001348
,2002-10-25T00:55:14Z,SAT011,-20.01,149.15,22.6,0.005828,0.003699,0.00307,0.002097,0.003035,0.001819,0.005766,0.003667,0.003047,0.002125,0.003027,0.00131
,2002-10-25T00:55:16Z,SAT011,-20.01,149.15,22.8,0.006057,0.003569,0.002576,0.002049,0.003205,0.001501,0.005988,0.003535,0.002555,0.002074,0.003194,0.001081
,2002-10-25T00:45:53Z,SAT011,-20.01,149.15,23,0.006713,0.003889,0.002875,0.002189,0.003525,0.001803,0.006635,0.003851,0.002851,0.002217,0.003513,0.001298
,2002-10-25T00:45:55Z,SAT011,-20.01,149.15,23.2,0.006268,0.004206,0.003267,0.002255,0.003151,0.001906,0.006198,0.004167,0.003242,0.002285,0.003141,0.001372
,2002-10-25T00:42:23Z,SAT011,-20.01,149.15,23.4,0.008557,0.003924,0.003414,0.002374,0.004241,0.002337,0.00846,0.003887,0.003388,0.002405,0.004228,0.001683
,2002-10-25T00:42:26Z,SAT011,-20.01,149.15,23.6,0.006744,0.004915,0.003296,0.002623,0.003541,0.001802,0.00667,0.004869,0.00327,0.002657,0.003531,0.001298
,2002-10-25T00:55:20Z,SAT011,-20.01,149.15,23.8,0.006463,0.004069,0.003594,0.002228,0.003651,0.001837,0.00639,0.00403,0.003567,0.002257,0.003639,0.001323
,2002-10-25T00:45:46Z,SAT011,-20.01,149.15,24,0.006713,0.003812,0.002863,0.002289,0.004229,0.001958,0.006635,0.003774,0.00284,0.002318,0.004214,0.00141
,2002-10-25T00:45:43Z,SAT011,-20.01,149.15,24.2,0.006381,0.004389,0.003275,0.002929,0.003143,0.002078,0.006308,0.004347,0.003248,0.002966,0.003132,0.001497
,2002-10-25T00:45:45Z,SAT011,-20.01,149.15,24.4,0.007019,0.004795,0.003275,0.002408,0.004216,0.002001,0.006938,0.00475,0.003248,0.002439,0.004202,0.001441
,2002-10-25T00:42:32Z,SAT011,-20.01,149.15,24.6,0.006401,0.004133,0.004206,0.002572,0.003553,0.001837,0.006326,0.004093,0.00417,0.002604,0.00354,0.001323
,2002-10-25T00:55:27Z,SAT011,-20.01,149.15,24.8,0.006229,0.003674,0.002971,0.002185,0.003056,0.001768,0.006157,0.003639,0.002946,0.002213,0.003045,0.001273
,2002-10-25T00:45:38Z,SAT011,-20.01,149.15,25,0.007084,0.004883,0.004802,0.002084,0.003764,0.002345,0.007002,0.004837,0.004763,0.002111,0.003751,0.001689
,2002-10-25T00:45:34Z,SAT011,-20.01,149.15,25.2,0.007069,0.003969,0.003409,0.002524,0.003474,0.002077,0.006991,0.003932,0.003382,0.002557,0.003463,0.001497
,2002-10-25T00:42:37Z,SAT011,-20.01,149.15,25.4,0.006841,0.003983,0.00279,0.002473,0.004056,0.002534,0.006763,0.003945,0.002767,0.002505,0.004041,0.001826
,2002-10-25T00:42:38Z,SAT011,-20.01,149.15,25.6,0.007342,0.003891,0.003218,0.002123,0.003541,0.002095,0.007259,0.003855,0.003192,0.00215,0.003529,0.001509
,2002-10-25T00:55:31Z,SAT011,-20.01,149.15,25.8,0.006409,0.003715,0.002919,0.00284,0.00313,0.001922,0.006338,0.003681,0.002896,0.0028770000000000002,0.00312,0.001385
,2002-10-25T00:42:41Z,SAT011,-20.01,149.15,26,0.006717,0.004304,0.003128,0.002389,0.0037,0.002043,0.006641,0.004264,0.003103,0.002419,0.003687,0.001472
,2002-10-25T00:42:42Z,SAT011,-20.01,149.15,26.2,0.006607,0.004051,0.002819,0.002285,0.003615,0.001854,0.00653,0.004012,0.002795,0.002314,0.003602,0.001335
,2002-10-25T00:42:45Z,SAT011,-20.01,149.15,26.4,0.006553,0.004142,0.002972,0.00236,0.003419,0.001742,0.006477,0.004103,0.002946,0.00239,0.003406,0.001254
,2002-10-25T00:45:26Z,SAT011,-20.01,149.15,26.6,0.006564,0.004009,0.00328,0.002456,0.00344,0.001879,0.006489,0.003971,0.003254,0.002487,0.003428,0.001354
,2002-10-25T00:55:36Z,SAT011,-20.01,149.15,26.8,0.006352,0.004231,0.002818,0.002439,0.003041,0.002069,0.006279,0.00419,0.002795,0.00247,0.003029,0.00149
,2002-10-25T00:45:21Z,SAT011,-20.01,149.15,27,0.007173,0.004159,0.004127,0.002355,0.003092,0.002141,0.007084,0.004115,0.004087,0.002382,0.003079,0.00154
,2002-10-25T00:42:48Z,SAT011,-20.01,149.15,27.2,0.007257,0.003747,0.002617,0.002194,0.003665,0.001872,0.007171,0.00371,0.002594,0.00222,0.00365,0.001348
,2002-10-25T00:45:15Z,SAT011,-20.01,149.15,27.4,0.007237,0.004298,0.002864,0.002404,0.003739,0.001681,0.007154,0.004257,0.00284,0.002435,0.003725,0.001211
,2002-10-25T00:45:14Z,SAT011,-20.01,149.15,27.6,0.00668,0.00386,0.003032,0.002381,0.003402,0.001905,0.0066,0.003822,0.003008,0.002411,0.00339,0.001372
,2002-10-25T00:42:52Z,SAT011,-20.01,149.15,27.8,0.006961,0.004173,0.003045,0.002239,0.004036,0.001897,0.00688,0.004132,0.003019,0.002267,0.00402,0.001366
,2002-10-25T00:45:11Z,SAT011,-20.01,149.15,28,0.006578,0.004886,0.003531,0.002497,0.0031,0.001716,0.006501,0.004837,0.0035,0.002528,0.003088,0.001236
,2002-10-25T00:45:09Z,SAT011,-20.01,149.15,28.2,0.007429,0.004251,0.003524,0.002484,0.003656,0.001707,0.00734,0.004209,0.003494,0.002515,0.003641,0.00123
,2002-10-25T00:55:44Z,SAT011,-20.01,149.15,28.4,0.006843,0.003567,0.002999,0.002149,0.003875,0.002017,0.006763,0.003533,0.002974,0.002176,0.00386,0.001453
,2002-10-25T00:42:59Z,SAT011,-20.01,149.15,28.6,0.007193,0.004234,0.003265,0.003861,0.003336,0.001759,0.007107,0.004193,0.003237,0.003909,0.003323,0.001267
,2002-10-25T00:45:04Z,SAT011,-20.01,149.15,28.8,0.006385,0.004111,0.00327,0.002642,0.003169,0.001811,0.006308,0.00407,0.003242,0.002674,0.003155,0.001304
,2002-10-25T00:45:03Z,SAT011,-20.01,149.15,29,0.006703,0.004065,0.003456,0.002439,0.003474,0.001802,0.006623,0.004025,0.003427,0.00247,0.00346,0.001298
,2002-10-25T00:45:01Z,SAT011,-20.01,149.15,29.2,0.006638,0.004189,0.00291,0.002626,0.003538,0.001768,0.006559,0.004148,0.002885,0.002659,0.003524,0.001273
,2002-10-25T00:55:49Z,SAT011,-20.01,149.15,29.4,0.00638,0.003928,0.002967,0.002294,0.00334,0.002043,0.006303,0.00389,0.002941,0.002322,0.003326,0.001472
,2002-10-25T00:44:59Z,SAT011,-20.01,149.15,29.6,0.006168,0.003913,0.002927,0.002147,0.003261,0.001595,0.006093,0.003874,0.002901,0.002174,0.003248,0.001149
,2002-10-25T00:44:57Z,SAT011,-20.01,149.15,29.8,0.006283,0.004768,0.004391,0.002445,0.003286,0.001673,0.006209,0.004721,0.004355,0.002476,0.003273,0.001205
,2002-10-25T00:44:55Z,SAT011,-20.01,149.15,30,0.006748,0.004094,0.003466,0.002918,0.003775,0.001888,0.00667,0.004054,0.003438,0.002955,0.00376,0.00136
,2002-10-25T00:44:52Z,SAT011,-20.01,149.15,30.2,0.006788,0.003968,0.002926,0.002205,0.003375,0.00193,0.006705,0.003929,0.002901,0.002232,0.003362,0.001391
,2002-10-25T00:55:54Z,SAT011,-20.01,149.15,30.4,0.007024,0.003998,0.002995,0.002252,0.003517,0.001802,0.006938,0.003958,0.002969,0.002279,0.003502,0.001298
,2002-10-25T00:44:50Z,SAT011,-20.01,149.15,30.6,0.006203,0.003925,0.003137,0.002333,0.003811,0.002234,0.006128,0.003884,0.003108,0.002361,0.003794,0.001608
,2002-10-25T00:44:48Z,SAT011,-20.01,149.15,30.8,0.006589,0.003834,0.002532,0.002757,0.003631,0.001966,0.006512,0.003797,0.00251,0.002791,0.003616,0.001416
,2002-10-25T00:44:46Z,SAT011,-20.01,149.15,31,0.006452,0.004083,0.003383,0.002239,0.003411,0.002112,0.006378,0.004045,0.003354,0.002267,0.003397,0.001521
,2002-10-25T00:44:44Z,SAT011,-20.01,149.15,31.2,0.006129,0.004118,0.003305,0.002473,0.003644,0.001871,0.006058,0.004077,0.003276,0.002503,0.003629,0.001348
,2002-10-25T00:43:18Z,SAT011,-20.01,149.15,31.4,0.006402,0.004417,0.003947,0.002409,0.003256,0.002215,0.006326,0.004373,0.003913,0.002439,0.003242,0.001596
,2002-10-25T00:44:41Z,SAT011,-20.01,149.15,31.6,0.005882,0.005525,0.003619,0.002503,0.003242,0.002431,0.005813,0.005471,0.003589,0.002534,0.003228,0.001751
,2002-10-25T00:44:38Z,SAT011,-20.01,149.15,31.8,0.006611,0.004413,0.003628,0.002489,0.003625,0.002294,0.00653,0.004367,0.003595,0.002518,0.003609,0.001652
,2002-10-25T00:43:20Z,SAT011,-20.01,149.15,32,0.006488,0.003879,0.00321,0.002224,0.003026,0.001759,0.006407,0.003839,0.003181,0.00225,0.003013,0.001267
,2002-10-25T00:43:21Z,SAT011,-20.01,149.15,32.2,0.007208,0.003684,0.002736,0.002657,0.003325,0.001984,0.007119,0.003645,0.002711,0.002688,0.00331,0.001428
,2002-10-25T00:44:33Z,SAT011,-20.01,149.15,32.4,0.006798,0.009599,0.003345,0.002369,0.004417,0.001845,0.006716,0.0095,0.003315,0.002398,0.004397,0.001329
,2002-10-25T00:44:34Z,SAT011,-20.01,149.15,32.6,0.006631,0.003783,0.003107,0.002634,0.003361,0.002216,0.006553,0.003745,0.00308,0.002666,0.003346,0.001596
,2002-10-25T00:56:05Z,SAT011,-20.01,149.15,32.8,0.006423,0.004147,0.003298,0.003276,0.003683,0.002276,0.006349,0.004106,0.00327,0.003317,0.003668,0.001639
,2002-10-25T00:56:07Z,SAT011,-20.01,149.15,33,0.007658,0.004512,0.003418,0.00264,0.004678,0.001888,0.007568,0.004466,0.003388,0.002672,0.004659,0.00136
,2002-10-25T00:43:28Z,SAT011,-20.01,149.15,33.2,0.006799,0.003915,0.002973,0.002083,0.003189,0.001949,0.006716,0.003874,0.002946,0.002107,0.003175,0.001403
,2002-10-25T00:43:29Z,SAT011,-20.01,149.15,33.4,0.00728,0.004013,0.003131,0.002225,0.003411,0.002078,0.007189,0.003971,0.003103,0.002252,0.003395,0.001497
,2002-10-25T00:56:10Z,SAT011,-20.01,149.15,33.6,0.006622,0.003924,0.002972,0.004212,0.004426,0.00206,0.006542,0.003884,0.002946,0.004264,0.004408,0.001484
,2002-10-25T00:43:32Z,SAT011,-20.01,149.15,33.8,0.005979,0.003885,0.003344,0.002517,0.002997,0.001655,0.005906,0.003845,0.003315,0.002548,0.002984,0.001192
,2002-10-25T00:43:33Z,SAT011,-20.01,149.15,34,0.006688,0.003869,0.003677,0.002321,0.003359,0.001793,0.006606,0.003829,0.003645,0.002349,0.003344,0.001292
,2002-10-25T00:44:20Z,SAT011,-20.01,149.15,34.2,0.005971,0.004369,0.003282,0.00249,0.003486,0.001949,0.0059,0.004325,0.003254,0.00252,0.00347,0.001403
,2002-10-25T00:56:14Z,SAT011,-20.01,149.15,34.4,0.007635,0.004236,0.003423,0.002363,0.003872,0.002199,0.007544,0.004193,0.003393,0.002392,0.003855,0.001584
,2002-10-25T00:44:16Z,SAT011,-20.01,149.15,34.6,0.006092,0.003875,0.003131,0.002141,0.003153,0.00195,0.006017,0.003835,0.003103,0.002166,0.003137,0.001403
,2002-10-25T00:56:17Z,SAT011,-20.01,149.15,34.8,0.00664,0.004254,0.002719,0.002963,0.003336,0.002027,0.006559,0.004209,0.002695,0.002998,0.003321,0.001459
,2002-10-25T00:44:13Z,SAT011,-20.01,149.15,35,0.006138,0.004032,0.002922,0.002456,0.003173,0.002147,0.006064,0.00399,0.002896,0.002485,0.003159,0.001546
,2002-10-25T00:56:30Z,SAT011,-20.01,149.15,35.2,0.006487,0.004444,0.003767,0.002704,0.003575,0.001914,0.006407,0.004399,0.003734,0.002737,0.003559,0.001379
,2002-10-25T00:56:31Z,SAT011,-20.01,149.15,35.4,0.030989,0.015206,0.00804,0.006509,0.00616,0.003184,0.006559,0.004157,0.00327,0.002513,0.002954,0.001403
,2002-10-25T00:41:43Z,SAT011,-20.01,149.15,35.6,-999,-999,-999,-999,-999,-999,-999,-999,-999,-999,-999,-999
,2002-10-25T00:41:45Z,SAT011,-20.01,149.15,35.8,-999,-999,-999,-999,-999,-999,-999,-999,-999,-999,-999,-999
,2002-10-25T00:41:46Z,SAT011,-20.01,149.15,36,-999,-999,-999,-999,-999,-999,-999,-999,-999,-999,-999,-999
,2002-10-25T00:41:48Z,SAT011,-20.01,149.15,36.2,-999,-999,-999,-999,-999,-999,-999,-999,-999,-999,-999,-999
,2002-10-25T00:41:50Z,SAT011,-20.01,149.15,36.4,-999,-999,-999,-999,-999,-999,-999,-999,-999,-999,-999,-999
,2002-10-25T00:41:52Z,SAT011,-20.01,149.15,36.6,-999,-999,-999,-999,-999,-999,-999,-999,-999,-999,-999,-999
,2002-10-25T00:41:54Z,SAT011,-20.01,149.15,36.8,-999,-999,-999,-999,-999,-999,-999,-999,-999,-999,-999,-999
,2002-10-25T00:41:56Z,SAT011,-20.01,149.15,37,-999,-999,-999,-999,-999,-999,-999,-999,-999,-999,-999,-999
,2002-10-25T00:41:58Z,SAT011,-20.01,149.15,37.2,-999,-999,-999,-999,-999,-999,-999,-999,-999,-999,-999,-999
,2002-10-25T00:42:00Z,SAT011,-20.01,149.15,37.4,-999,-999,-999,-999,-999,-999,-999,-999,-999,-999,-999,-999
,2002-10-25T00:42:02Z,SAT011,-20.01,149.15,37.6,-999,-999,-999,-999,-999,-999,-999,-999,-999,-999,-999,-999
,2002-10-25T00:42:04Z,SAT011,-20.01,149.15,37.8,-999,-999,-999,-999,-999,-999,-999,-999,-999,-999,-999,-999
,2002-10-25T00:42:06Z,SAT011,-20.01,149.15,38,-999,-999,-999,-999,-999,-999,-999,-999,-999,-999,-999,-999
,2002-10-25T00:42:07Z,SAT011,-20.01,149.15,38.2,-999,-999,-999,-999,-999,-999,-999,-999,-999,-999,-999,-999
,2002-10-25T00:42:11Z,SAT011,-20.01,149.15,38.4,-999,-999,-999,-999,-999,-999,-999,-999,-999,-999,-999,-999
,2002-10-25T00:42:13Z,SAT011,-20.01,149.15,38.6,-999,-999,-999,-999,-999,-999,-999,-999,-999,-999,-999,-999
,2002-10-25T00:42:15Z,SAT011,-20.01,149.15,38.8,-999,-999,-999,-999,-999,-999,-999,-999,-999,-999,-999,-999
,2002-10-25T00:42:17Z,SAT011,-20.01,149.15,39,-999,-999,-999,-999,-999,-999,-999,-999,-999,-999,-999,-999
,2002-10-25T00:42:19Z,SAT011,-20.01,149.15,39.2,-999,-999,-999,-999,-999,-999,-999,-999,-999,-999,-999,-999
,2002-10-25T00:42:21Z,SAT011,-20.01,149.15,39.4,-999,-999,-999,-999,-999,-999,-999,-999,-999,-999,-999,-999
,2002-10-25T00:42:23Z,SAT011,-20.01,149.15,39.6,-999,-999,-999,-999,-999,-999,-999,-999,-999,-999,-999,-999
,2002-10-25T00:42:25Z,SAT011,-20.01,149.15,39.8,-999,-999,-999,-999,-999,-999,-999,-999,-999,-999,-999,-999
,2002-10-25T00:42:27Z,SAT011,-20.01,149.15,40,-999,-999,-999,-999,-999,-999,-999,-999,-999,-999,-999,-999
,2002-10-25T00:42:29Z,SAT011,-20.01,149.15,40.2,-999,-999,-999,-999,-999,-999,-999,-999,-999,-999,-999,-999
,2002-10-25T00:42:30Z,SAT011,-20.01,149.15,40.4,-999,-999,-999,-999,-999,-999,-999,-999,-999,-999,-999,-999
,2002-10-25T00:42:32Z,SAT011,-20.01,149.15,40.6,-999,-999,-999,-999,-999,-999,-999,-999,-999,-999,-999,-999
,2002-10-25T00:42:35Z,SAT011,-20.01,149.15,40.8,-999,-999,-999,-999,-999,-999,-999,-999,-999,-999,-999,-999
,2002-10-25T00:42:37Z,SAT011,-20.01,149.15,41,-999,-999,-999,-999,-999,-999,-999,-999,-999,-999,-999,-999
,2002-10-25T00:42:39Z,SAT011,-20.01,149.15,41.2,-999,-999,-999,-999,-999,-999,-999,-999,-999,-999,-999,-999
,2002-10-25T00:42:41Z,SAT011,-20.01,149.15,41.4,-999,-999,-999,-999,-999,-999,-999,-999,-999,-999,-999,-999
,2002-10-25T00:42:43Z,SAT011,-20.01,149.15,41.6,-999,-999,-999,-999,-999,-999,-999,-999,-999,-999,-999,-999
,2002-10-25T00:42:45Z,SAT011,-20.01,149.15,41.8,-999,-999,-999,-999,-999,-999,-999,-999,-999,-999,-999,-999
,2002-10-25T00:42:47Z,SAT011,-20.01,149.15,42,-999,-999,-999,-999,-999,-999,-999,-999,-999,-999,-999,-999
,2002-10-25T00:42:49Z,SAT011,-20.01,149.15,42.2,-999,-999,-999,-999,-999,-999,-999,-999,-999,-999,-999,-999
,2002-10-25T00:42:51Z,SAT011,-20.01,149.15,42.4,-999,-999,-999,-999,-999,-999,-999,-999,-999,-999,-999,-999
,2002-10-25T00:42:52Z,SAT011,-20.01,149.15,42.6,-999,-999,-999,-999,-999,-999,-999,-999,-999,-999,-999,-999
,2002-10-25T00:42:54Z,SAT011,-20.01,149.15,42.8,-999,-999,-999,-999,-999,-999,-999,-999,-999,-999,-999,-999
,2002-10-25T00:42:56Z,SAT011,-20.01,149.15,43,-999,-999,-999,-999,-999,-999,-999,-999,-999,-999,-999,-999
,2002-10-25T00:42:58Z,SAT011,-20.01,149.15,43.2,-999,-999,-999,-999,-999,-999,-999,-999,-999,-999,-999,-999
,2002-10-25T00:43:00Z,SAT011,-20.01,149.15,43.4,-999,-999,-999,-999,-999,-999,-999,-999,-999,-999,-999,-999
,2002-10-25T00:43:02Z,SAT011,-20.01,149.15,43.6,-999,-999,-999,-999,-999,-999,-999,-999,-999,-999,-999,-999
,2002-10-25T00:43:04Z,SAT011,-20.01,149.15,43.8,-999,-999,-999,-999,-999,-999,-999,-999,-999,-999,-999,-999
,2002-10-25T00:43:07Z,SAT011,-20.01,149.15,44,-999,-999,-999,-999,-999,-999,-999,-999,-999,-999,-999,-999
,2002-10-25T00:43:09Z,SAT011,-20.01,149.15,44.2,-999,-999,-999,-999,-999,-999,-999,-999,-999,-999,-999,-999
,2002-10-25T00:43:11Z,SAT011,-20.01,149.15,44.4,-999,-999,-999,-999,-999,-999,-999,-999,-999,-999,-999,-999
,2002-10-25T00:43:13Z,SAT011,-20.01,149.15,44.6,-999,-999,-999,-999,-999,-999,-999,-999,-999,-999,-999,-999
,2002-10-25T00:43:14Z,SAT011,-20.01,149.15,44.8,-999,-999,-999,-999,-999,-999,-999,-999,-999,-999,-999,-999
,2002-10-25T00:43:16Z,SAT011,-20.01,149.15,45,-999,-999,-999,-999,-999,-999,-999,-999,-999,-999,-999,-999
,2002-10-25T00:43:18Z,SAT011,-20.01,149.15,45.2,-999,-999,-999,-999,-999,-999,-999,-999,-999,-999,-999,-999
,2002-10-25T00:43:20Z,SAT011,-20.01,149.15,45.4,-999,-999,-999,-999,-999,-999,-999,-999,-999,-999,-999,-999
,2002-10-25T00:43:22Z,SAT011,-20.01,149.15,45.6,-999,-999,-999,-999,-999,-999,-999,-999,-999,-999,-999,-999
,2002-10-25T00:43:24Z,SAT011,-20.01,149.15,45.8,-999,-999,-999,-999,-999,-999,-999,-999,-999,-999,-999,-999
,2002-10-25T00:43:26Z,SAT011,-20.01,149.15,46,-999,-999,-999,-999,-999,-999,-999,-999,-999,-999,-999,-999
,2002-10-25T00:43:28Z,SAT011,-20.01,149.15,46.2,-999,-999,-999,-999,-999,-999,-999,-999,-999,-999,-999,-999
,2002-10-25T00:43:30Z,SAT011,-20.01,149.15,46.4,-999,-999,-999,-999,-999,-999,-999,-999,-999,-999,-999,-999
,2002-10-25T00:43:32Z,SAT011,-20.01,149.15,46.6,-999,-999,-999,-999,-999,-999,-999,-999,-999,-999,-999,-999
,2002-10-25T00:43:34Z,SAT011,-20.01,149.15,46.8,-999,-999,-999,-999,-999,-999,-999,-999,-999,-999,-999,-999
,2002-10-25T00:43:35Z,SAT011,-20.01,149.15,47,-999,-999,-999,-999,-999,-999,-999,-999,-999,-999,-999,-999
,2002-10-25T00:43:37Z,SAT011,-20.01,149.15,47.2,-999,-999,-999,-999,-999,-999,-999,-999,-999,-999,-999,-999
,2002-10-25T00:43:39Z,SAT011,-20.01,149.15,47.4,-999,-999,-999,-999,-999,-999,-999,-999,-999,-999,-999,-999
,2002-10-25T00:43:41Z,SAT011,-20.01,149.15,47.6,-999,-999,-999,-999,-999,-999,-999,-999,-999,-999,-999,-999
,2002-10-25T00:43:43Z,SAT011,-20.01,149.15,47.8,-999,-999,-999,-999,-999,-999,-999,-999,-999,-999,-999,-999
,2002-10-25T00:44:10Z,SAT011,-20.01,149.15,48,-999,-999,-999,-999,-999,-999,-999,-999,-999,-999,-999,-999
,2002-10-25T00:44:12Z,SAT011,-20.01,149.15,48.2,-999,-999,-999,-999,-999,-999,-999,-999,-999,-999,-999,-999
,2002-10-25T00:44:14Z,SAT011,-20.01,149.15,48.4,-999,-999,-999,-999,-999,-999,-999,-999,-999,-999,-999,-999
,2002-10-25T00:44:16Z,SAT011,-20.01,149.15,48.6,-999,-999,-999,-999,-999,-999,-999,-999,-999,-999,-999,-999
,2002-10-25T00:44:18Z,SAT011,-20.01,149.15,48.8,-999,-999,-999,-999,-999,-999,-999,-999,-999,-999,-999,-999
,2002-10-25T00:44:20Z,SAT011,-20.01,149.15,49,-999,-999,-999,-999,-999,-999,-999,-999,-999,-999,-999,-999
,2002-10-25T00:44:21Z,SAT011,-20.01,149.15,49.2,-999,-999,-999,-999,-999,-999,-999,-999,-999,-999,-999,-999
,2002-10-25T00:44:23Z,SAT011,-20.01,149.15,49.4,-999,-999,-999,-999,-999,-999,-999,-999,-999,-999,-999,-999
,2002-10-25T00:44:25Z,SAT011,-20.01,149.15,49.6,-999,-999,-999,-999,-999,-999,-999,-999,-999,-999,-999,-999
,2002-10-25T00:44:27Z,SAT011,-20.01,149.15,49.8,-999,-999,-999,-999,-999,-999,-999,-999,-999,-999,-999,-999
,2002-10-25T00:44:29Z,SAT011,-20.01,149.15,50,-999,-999,-999,-999,-999,-999,-999,-999,-999,-999,-999,-999
,2002-10-25T00:44:31Z,SAT011,-20.01,149.15,50.2,-999,-999,-999,-999,-999,-999,-999,-999,-999,-999,-999,-999
,2002-10-25T00:44:33Z,SAT011,-20.01,149.15,50.4,-999,-999,-999,-999,-999,-999,-999,-999,-999,-999,-999,-999
,2002-10-25T00:44:35Z,SAT011,-20.01,149.15,50.6,-999,-999,-999,-999,-999,-999,-999,-999,-999,-999,-999,-999
,2002-10-25T00:44:37Z,SAT011,-20.01,149.15,50.8,-999,-999,-999,-999,-999,-999,-999,-999,-999,-999,-999,-999
,2002-10-25T00:44:39Z,SAT011,-20.01,149.15,51,-999,-999,-999,-999,-999,-999,-999,-999,-999,-999,-999,-999
,2002-10-25T00:44:40Z,SAT011,-20.01,149.15,51.2,-999,-999,-999,-999,-999,-999,-999,-999,-999,-999,-999,-999
,2002-10-25T00:44:42Z,SAT011,-20.01,149.15,51.4,-999,-999,-999,-999,-999,-999,-999,-999,-999,-999,-999,-999
,2002-10-25T00:44:44Z,SAT011,-20.01,149.15,51.6,-999,-999,-999,-999,-999,-999,-999,-999,-999,-999,-999,-999
,2002-10-25T00:44:46Z,SAT011,-20.01,149.15,51.8,-999,-999,-999,-999,-999,-999,-999,-999,-999,-999,-999,-999
,2002-10-25T00:44:48Z,SAT011,-20.01,149.15,52,-999,-999,-999,-999,-999,-999,-999,-999,-999,-999,-999,-999
,2002-10-25T00:44:50Z,SAT011,-20.01,149.15,52.2,-999,-999,-999,-999,-999,-999,-999,-999,-999,-999,-999,-999
,2002-10-25T00:44:52Z,SAT011,-20.01,149.15,52.4,-999,-999,-999,-999,-999,-999,-999,-999,-999,-999,-999,-999
,2002-10-25T00:44:54Z,SAT011,-20.01,149.15,52.6,-999,-999,-999,-999,-999,-999,-999,-999,-999,-999,-999,-999
,2002-10-25T00:44:56Z,SAT011,-20.01,149.15,52.8,-999,-999,-999,-999,-999,-999,-999,-999,-999,-999,-999,-999
,2002-10-25T00:44:58Z,SAT011,-20.01,149.15,53,-999,-999,-999,-999,-999,-999,-999,-999,-999,-999,-999,-999
,2002-10-25T00:45:00Z,SAT011,-20.01,149.15,53.2,-999,-999,-999,-999,-999,-999,-999,-999,-999,-999,-999,-999
,2002-10-25T00:45:01Z,SAT011,-20.01,149.15,53.4,-999,-999,-999,-999,-999,-999,-999,-999,-999,-999,-999,-999
,2002-10-25T00:45:03Z,SAT011,-20.01,149.15,53.6,-999,-999,-999,-999,-999,-999,-999,-999,-999,-999,-999,-999
,2002-10-25T00:45:05Z,SAT011,-20.01,149.15,53.8,-999,-999,-999,-999,-999,-999,-999,-999,-999,-999,-999,-999
,2002-10-25T00:45:07Z,SAT011,-20.01,149.15,54,-999,-999,-999,-999,-999,-999,-999,-999,-999,-999,-999,-999
,2002-10-25T00:45:09Z,SAT011,-20.01,149.15,54.2,-999,-999,-999,-999,-999,-999,-999,-999,-999,-999,-999,-999
,2002-10-25T00:45:11Z,SAT011,-20.01,149.15,54.4,-999,-999,-999,-999,-999,-999,-999,-999,-999,-999,-999,-999
,2002-10-25T00:45:13Z,SAT011,-20.01,149.15,54.6,-999,-999,-999,-999,-999,-999,-999,-999,-999,-999,-999,-999
,2002-10-25T00:45:15Z,SAT011,-20.01,149.15,54.8,-999,-999,-999,-999,-999,-999,-999,-999,-999,-999,-999,-999
,2002-10-25T00:45:17Z,SAT011,-20.01,149.15,55,-999,-999,-999,-999,-999,-999,-999,-999,-999,-999,-999,-999
,2002-10-25T00:45:19Z,SAT011,-20.01,149.15,55.2,-999,-999,-999,-999,-999,-999,-999,-999,-999,-999,-999,-999
,2002-10-25T00:45:21Z,SAT011,-20.01,149.15,55.4,-999,-999,-999,-999,-999,-999,-999,-999,-999,-999,-999,-999
,2002-10-25T00:45:22Z,SAT011,-20.01,149.15,55.6,-999,-999,-999,-999,-999,-999,-999,-999,-999,-999,-999,-999
,2002-10-25T00:45:24Z,SAT011,-20.01,149.15,55.8,-999,-999,-999,-999,-999,-999,-999,-999,-999,-999,-999,-999
,2002-10-25T00:45:26Z,SAT011,-20.01,149.15,56,-999,-999,-999,-999,-999,-999,-999,-999,-999,-999,-999,-999
,2002-10-25T00:45:28Z,SAT011,-20.01,149.15,56.2,-999,-999,-999,-999,-999,-999,-999,-999,-999,-999,-999,-999
,2002-10-25T00:45:30Z,SAT011,-20.01,149.15,56.4,-999,-999,-999,-999,-999,-999,-999,-999,-999,-999,-999,-999
,2002-10-25T00:45:32Z,SAT011,-20.01,149.15,56.6,-999,-999,-999,-999,-999,-999,-999,-999,-999,-999,-999,-999
,2002-10-25T00:45:34Z,SAT011,-20.01,149.15,56.8,-999,-999,-999,-999,-999,-999,-999,-999,-999,-999,-999,-999
,2002-10-25T00:45:36Z,SAT011,-20.01,149.15,57,-999,-999,-999,-999,-999,-999,-999,-999,-999,-999,-999,-999
,2002-10-25T00:45:38Z,SAT011,-20.01,149.15,57.2,-999,-999,-999,-999,-999,-999,-999,-999,-999,-999,-999,-999
,2002-10-25T00:45:40Z,SAT011,-20.01,149.15,57.4,-999,-999,-999,-999,-999,-999,-999,-999,-999,-999,-999,-999
,2002-10-25T00:45:42Z,SAT011,-20.01,149.15,57.6,-999,-999,-999,-999,-999,-999,-999,-999,-999,-999,-999,-999
,2002-10-25T00:45:43Z,SAT011,-20.01,149.15,57.8,-999,-999,-999,-999,-999,-999,-999,-999,-999,-999,-999,-999
,2002-10-25T00:45:45Z,SAT011,-20.01,149.15,58,-999,-999,-999,-999,-999,-999,-999,-999,-999,-999,-999,-999
,2002-10-25T00:45:47Z,SAT011,-20.01,149.15,58.2,-999,-999,-999,-999,-999,-999,-999,-999,-999,-999,-999,-999
,2002-10-25T00:45:49Z,SAT011,-20.01,149.15,58.4,-999,-999,-999,-999,-999,-999,-999,-999,-999,-999,-999,-999
,2002-10-25T00:45:51Z,SAT011,-20.01,149.15,58.6,-999,-999,-999,-999,-999,-999,-999,-999,-999,-999,-999,-999
,2002-10-25T00:45:53Z,SAT011,-20.01,149.15,58.8,-999,-999,-999,-999,-999,-999,-999,-999,-999,-999,-999,-999
,2002-10-25T00:45:55Z,SAT011,-20.01,149.15,59,-999,-999,-999,-999,-999,-999,-999,-999,-999,-999,-999,-999
,2002-10-25T00:45:57Z,SAT011,-20.01,149.15,59.2,-999,-999,-999,-999,-999,-999,-999,-999,-999,-999,-999,-999
,2002-10-25T00:45:59Z,SAT011,-20.01,149.15,59.4,-999,-999,-999,-999,-999,-999,-999,-999,-999,-999,-999,-999
,2002-10-25T00:46:01Z,SAT011,-20.01,149.15,59.6,-999,-999,-999,-999,-999,-999,-999,-999,-999,-999,-999,-999
,2002-10-25T00:46:03Z,SAT011,-20.01,149.15,59.8,-999,-999,-999,-999,-999,-999,-999,-999,-999,-999,-999,-999
,2002-10-25T00:46:04Z,SAT011,-20.01,149.15,60,-999,-999,-999,-999,-999,-999,-999,-999,-999,-999,-999,-999
,2002-10-25T00:46:06Z,SAT011,-20.01,149.15,60.2,-999,-999,-999,-999,-999,-999,-999,-999,-999,-999,-999,-999
,2002-10-25T00:46:08Z,SAT011,-20.01,149.15,60.4,-999,-999,-999,-999,-999,-999,-999,-999,-999,-999,-999,-999
,2002-10-25T00:46:10Z,SAT011,-20.01,149.15,60.6,-999,-999,-999,-999,-999,-999,-999,-999,-999,-999,-999,-999
,2002-10-25T00:46:12Z,SAT011,-20.01,149.15,60.8,-999,-999,-999,-999,-999,-999,-999,-999,-999,-999,-999,-999
,2002-10-25T00:46:14Z,SAT011,-20.01,149.15,61,-999,-999,-999,-999,-999,-999,-999,-999,-999,-999,-999,-999
,2002-10-25T00:46:16Z,SAT011,-20.01,149.15,61.2,-999,-999,-999,-999,-999,-999,-999,-999,-999,-999,-999,-999
,2002-10-25T00:46:18Z,SAT011,-20.01,149.15,61.4,-999,-999,-999,-999,-999,-999,-999,-999,-999,-999,-999,-999
,2002-10-25T00:46:20Z,SAT011,-20.01,149.15,61.6,-999,-999,-999,-999,-999,-999,-999,-999,-999,-999,-999,-999
,2002-10-25T00:46:22Z,SAT011,-20.01,149.15,61.8,-999,-999,-999,-999,-999,-999,-999,-999,-999,-999,-999,-999
,2002-10-25T00:46:24Z,SAT011,-20.01,149.15,62,-999,-999,-999,-999,-999,-999,-999,-999,-999,-999,-999,-999
,2002-10-25T00:46:25Z,SAT011,-20.01,149.15,62.2,-999,-999,-999,-999,-999,-999,-999,-999,-999,-999,-999,-999
,2002-10-25T00:46:27Z,SAT011,-20.01,149.15,62.4,-999,-999,-999,-999,-999,-999,-999,-999,-999,-999,-999,-999
,2002-10-25T00:46:29Z,SAT011,-20.01,149.15,62.6,-999,-999,-999,-999,-999,-999,-999,-999,-999,-999,-999,-999
,2002-10-25T00:46:32Z,SAT011,-20.01,149.15,62.8,-999,-999,-999,-999,-999,-999,-999,-999,-999,-999,-999,-999
,2002-10-25T00:46:34Z,SAT011,-20.01,149.15,63,-999,-999,-999,-999,-999,-999,-999,-999,-999,-999,-999,-999
,2002-10-25T00:46:36Z,SAT011,-20.01,149.15,63.2,-999,-999,-999,-999,-999,-999,-999,-999,-999,-999,-999,-999
,2002-10-25T00:46:38Z,SAT011,-20.01,149.15,63.4,-999,-999,-999,-999,-999,-999,-999,-999,-999,-999,-999,-999
,2002-10-25T00:46:40Z,SAT011,-20.01,149.15,63.6,-999,-999,-999,-999,-999,-999,-999,-999,-999,-999,-999,-999
,2002-10-25T00:46:42Z,SAT011,-20.01,149.15,63.8,-999,-999,-999,-999,-999,-999,-999,-999,-999,-999,-999,-999
,2002-10-25T00:46:44Z,SAT011,-20.01,149.15,64,-999,-999,-999,-999,-999,-999,-999,-999,-999,-999,-999,-999
,2002-10-25T00:46:46Z,SAT011,-20.01,149.15,64.2,-999,-999,-999,-999,-999,-999,-999,-999,-999,-999,-999,-999
,2002-10-25T00:46:47Z,SAT011,-20.01,149.15,64.4,-999,-999,-999,-999,-999,-999,-999,-999,-999,-999,-999,-999
,2002-10-25T00:46:49Z,SAT011,-20.01,149.15,64.6,-999,-999,-999,-999,-999,-999,-999,-999,-999,-999,-999,-999
,2002-10-25T00:46:51Z,SAT011,-20.01,149.15,64.8,-999,-999,-999,-999,-999,-999,-999,-999,-999,-999,-999,-999
,2002-10-25T00:46:53Z,SAT011,-20.01,149.15,65,-999,-999,-999,-999,-999,-999,-999,-999,-999,-999,-999,-999
,2002-10-25T00:46:55Z,SAT011,-20.01,149.15,65.2,-999,-999,-999,-999,-999,-999,-999,-999,-999,-999,-999,-999
,2002-10-25T00:46:57Z,SAT011,-20.01,149.15,65.4,-999,-999,-999,-999,-999,-999,-999,-999,-999,-999,-999,-999
,2002-10-25T00:46:59Z,SAT011,-20.01,149.15,65.6,-999,-999,-999,-999,-999,-999,-999,-999,-999,-999,-999,-999
,2002-10-25T00:47:01Z,SAT011,-20.01,149.15,65.8,-999,-999,-999,-999,-999,-999,-999,-999,-999,-999,-999,-999
,2002-10-25T00:47:03Z,SAT011,-20.01,149.15,66,-999,-999,-999,-999,-999,-999,-999,-999,-999,-999,-999,-999
,2002-10-25T00:47:05Z,SAT011,-20.01,149.15,66.2,-999,-999,-999,-999,-999,-999,-999,-999,-999,-999,-999,-999
,2002-10-25T00:47:07Z,SAT011,-20.01,149.15,66.4,-999,-999,-999,-999,-999,-999,-999,-999,-999,-999,-999,-999
,2002-10-25T00:47:08Z,SAT011,-20.01,149.15,66.6,-999,-999,-999,-999,-999,-999,-999,-999,-999,-999,-999,-999
,2002-10-25T00:47:10Z,SAT011,-20.01,149.15,66.8,-999,-999,-999,-999,-999,-999,-999,-999,-999,-999,-999,-999
,2002-10-25T00:47:12Z,SAT011,-20.01,149.15,67,-999,-999,-999,-999,-999,-999,-999,-999,-999,-999,-999,-999
,2002-10-25T00:47:14Z,SAT011,-20.01,149.15,67.2,-999,-999,-999,-999,-999,-999,-999,-999,-999,-999,-999,-999
,2002-10-25T00:47:16Z,SAT011,-20.01,149.15,67.4,-999,-999,-999,-999,-999,-999,-999,-999,-999,-999,-999,-999
,2002-10-25T00:47:18Z,SAT011,-20.01,149.15,67.6,-999,-999,-999,-999,-999,-999,-999,-999,-999,-999,-999,-999
,2002-10-25T00:47:20Z,SAT011,-20.01,149.15,67.8,-999,-999,-999,-999,-999,-999,-999,-999,-999,-999,-999,-999
,2002-10-25T00:47:22Z,SAT011,-20.01,149.15,68,-999,-999,-999,-999,-999,-999,-999,-999,-999,-999,-999,-999
,2002-10-25T00:47:24Z,SAT011,-20.01,149.15,68.2,-999,-999,-999,-999,-999,-999,-999,-999,-999,-999,-999,-999
,2002-10-25T00:47:26Z,SAT011,-20.01,149.15,68.4,-999,-999,-999,-999,-999,-999,-999,-999,-999,-999,-999,-999
,2002-10-25T00:47:28Z,SAT011,-20.01,149.15,68.6,-999,-999,-999,-999,-999,-999,-999,-999,-999,-999,-999,-999
,2002-10-25T00:47:29Z,SAT011,-20.01,149.15,68.8,-999,-999,-999,-999,-999,-999,-999,-999,-999,-999,-999,-999
,2002-10-25T00:47:31Z,SAT011,-20.01,149.15,69,-999,-999,-999,-999,-999,-999,-999,-999,-999,-999,-999,-999
,2002-10-25T00:47:33Z,SAT011,-20.01,149.15,69.2,-999,-999,-999,-999,-999,-999,-999,-999,-999,-999,-999,-999
,2002-10-25T00:47:35Z,SAT011,-20.01,149.15,69.4,-999,-999,-999,-999,-999,-999,-999,-999,-999,-999,-999,-999
,2002-10-25T00:47:37Z,SAT011,-20.01,149.15,69.6,-999,-999,-999,-999,-999,-999,-999,-999,-999,-999,-999,-999
,2002-10-25T00:47:39Z,SAT011,-20.01,149.15,69.8,-999,-999,-999,-999,-999,-999,-999,-999,-999,-999,-999,-999
,2002-10-25T00:47:41Z,SAT011,-20.01,149.15,70,-999,-999,-999,-999,-999,-999,-999,-999,-999,-999,-999,-999
,2002-10-25T00:47:43Z,SAT011,-20.01,149.15,70.2,-999,-999,-999,-999,-999,-999,-999,-999,-999,-999,-999,-999
,2002-10-25T00:47:45Z,SAT011,-20.01,149.15,70.4,-999,-999,-999,-999,-999,-999,-999,-999,-999,-999,-999,-999
,2002-10-25T00:47:47Z,SAT011,-20.01,149.15,70.6,-999,-999,-999,-999,-999,-999,-999,-999,-999,-999,-999,-999
,2002-10-25T00:47:48Z,SAT011,-20.01,149.15,70.8,-999,-999,-999,-999,-999,-999,-999,-999,-999,-999,-999,-999
,2002-10-25T00:47:51Z,SAT011,-20.01,149.15,71,-999,-999,-999,-999,-999,-999,-999,-999,-999,-999,-999,-999
,2002-10-25T00:47:53Z,SAT011,-20.01,149.15,71.2,-999,-999,-999,-999,-999,-999,-999,-999,-999,-999,-999,-999
,2002-10-25T00:47:55Z,SAT011,-20.01,149.15,71.4,-999,-999,-999,-999,-999,-999,-999,-999,-999,-999,-999,-999
,2002-10-25T00:47:57Z,SAT011,-20.01,149.15,71.6,-999,-999,-999,-999,-999,-999,-999,-999,-999,-999,-999,-999
,2002-10-25T00:47:59Z,SAT011,-20.01,149.15,71.8,-999,-999,-999,-999,-999,-999,-999,-999,-999,-999,-999,-999
,2002-10-25T00:48:01Z,SAT011,-20.01,149.15,72,-999,-999,-999,-999,-999,-999,-999,-999,-999,-999,-999,-999
,2002-10-25T00:48:03Z,SAT011,-20.01,149.15,72.2,-999,-999,-999,-999,-999,-999,-999,-999,-999,-999,-999,-999
,2002-10-25T00:48:05Z,SAT011,-20.01,149.15,72.4,-999,-999,-999,-999,-999,-999,-999,-999,-999,-999,-999,-999
,2002-10-25T00:48:07Z,SAT011,-20.01,149.15,72.6,-999,-999,-999,-999,-999,-999,-999,-999,-999,-999,-999,-999
,2002-10-25T00:48:09Z,SAT011,-20.01,149.15,72.8,-999,-999,-999,-999,-999,-999,-999,-999,-999,-999,-999,-999
,2002-10-25T00:48:10Z,SAT011,-20.01,149.15,73,-999,-999,-999,-999,-999,-999,-999,-999,-999,-999,-999,-999
,2002-10-25T00:48:12Z,SAT011,-20.01,149.15,73.2,-999,-999,-999,-999,-999,-999,-999,-999,-999,-999,-999,-999
,2002-10-25T00:48:14Z,SAT011,-20.01,149.15,73.4,-999,-999,-999,-999,-999,-999,-999,-999,-999,-999,-999,-999
,2002-10-25T00:48:16Z,SAT011,-20.01,149.15,73.6,-999,-999,-999,-999,-999,-999,-999,-999,-999,-999,-999,-999
,2002-10-25T00:48:18Z,SAT011,-20.01,149.15,73.8,-999,-999,-999,-999,-999,-999,-999,-999,-999,-999,-999,-999
,2002-10-25T00:48:20Z,SAT011,-20.01,149.15,74,-999,-999,-999,-999,-999,-999,-999,-999,-999,-999,-999,-999
,2002-10-25T00:48:22Z,SAT011,-20.01,149.15,74.2,-999,-999,-999,-999,-999,-999,-999,-999,-999,-999,-999,-999
,2002-10-25T00:48:24Z,SAT011,-20.01,149.15,74.4,-999,-999,-999,-999,-999,-999,-999,-999,-999,-999,-999,-999
,2002-10-25T00:48:26Z,SAT011,-20.01,149.15,74.6,-999,-999,-999,-999,-999,-999,-999,-999,-999,-999,-999,-999
,2002-10-25T00:48:28Z,SAT011,-20.01,149.15,74.8,-999,-999,-999,-999,-999,-999,-999,-999,-999,-999,-999,-999
,2002-10-25T00:48:30Z,SAT011,-20.01,149.15,75,-999,-999,-999,-999,-999,-999,-999,-999,-999,-999,-999,-999
,2002-10-25T00:48:31Z,SAT011,-20.01,149.15,75.2,-999,-999,-999,-999,-999,-999,-999,-999,-999,-999,-999,-999
,2002-10-25T00:48:33Z,SAT011,-20.01,149.15,75.4,-999,-999,-999,-999,-999,-999,-999,-999,-999,-999,-999,-999
,2002-10-25T00:48:35Z,SAT011,-20.01,149.15,75.6,-999,-999,-999,-999,-999,-999,-999,-999,-999,-999,-999,-999
,2002-10-25T00:48:37Z,SAT011,-20.01,149.15,75.8,-999,-999,-999,-999,-999,-999,-999,-999,-999,-999,-999,-999
,2002-10-25T00:48:39Z,SAT011,-20.01,149.15,76,-999,-999,-999,-999,-999,-999,-999,-999,-999,-999,-999,-999
,2002-10-25T00:48:41Z,SAT011,-20.01,149.15,76.2,-999,-999,-999,-999,-999,-999,-999,-999,-999,-999,-999,-999
,2002-10-25T00:48:43Z,SAT011,-20.01,149.15,76.4,-999,-999,-999,-999,-999,-999,-999,-999,-999,-999,-999,-999
,2002-10-25T00:48:45Z,SAT011,-20.01,149.15,76.6,-999,-999,-999,-999,-999,-999,-999,-999,-999,-999,-999,-999
,2002-10-25T00:48:48Z,SAT011,-20.01,149.15,76.8,-999,-999,-999,-999,-999,-999,-999,-999,-999,-999,-999,-999
,2002-10-25T00:48:50Z,SAT011,-20.01,149.15,77,-999,-999,-999,-999,-999,-999,-999,-999,-999,-999,-999,-999
,2002-10-25T00:48:52Z,SAT011,-20.01,149.15,77.2,-999,-999,-999,-999,-999,-999,-999,-999,-999,-999,-999,-999
,2002-10-25T00:48:53Z,SAT011,-20.01,149.15,77.4,-999,-999,-999,-999,-999,-999,-999,-999,-999,-999,-999,-999
,2002-10-25T00:48:55Z,SAT011,-20.01,149.15,77.6,-999,-999,-999,-999,-999,-999,-999,-999,-999,-999,-999,-999
,2002-10-25T00:48:58Z,SAT011,-20.01,149.15,77.8,-999,-999,-999,-999,-999,-999,-999,-999,-999,-999,-999,-999
,2002-10-25T00:49:00Z,SAT011,-20.01,149.15,78,-999,-999,-999,-999,-999,-999,-999,-999,-999,-999,-999,-999
,2002-10-25T00:49:03Z,SAT011,-20.01,149.15,78.2,-999,-999,-999,-999,-999,-999,-999,-999,-999,-999,-999,-999
,2002-10-25T00:49:05Z,SAT011,-20.01,149.15,78.4,-999,-999,-999,-999,-999,-999,-999,-999,-999,-999,-999,-999
,2002-10-25T00:49:07Z,SAT011,-20.01,149.15,78.6,-999,-999,-999,-999,-999,-999,-999,-999,-999,-999,-999,-999
,2002-10-25T00:49:09Z,SAT011,-20.01,149.15,78.8,-999,-999,-999,-999,-999,-999,-999,-999,-999,-999,-999,-999
,2002-10-25T00:49:11Z,SAT011,-20.01,149.15,79,-999,-999,-999,-999,-999,-999,-999,-999,-999,-999,-999,-999
,2002-10-25T00:49:13Z,SAT011,-20.01,149.15,79.2,-999,-999,-999,-999,-999,-999,-999,-999,-999,-999,-999,-999
,2002-10-25T00:49:15Z,SAT011,-20.01,149.15,79.4,-999,-999,-999,-999,-999,-999,-999,-999,-999,-999,-999,-999
,2002-10-25T00:49:16Z,SAT011,-20.01,149.15,79.6,-999,-999,-999,-999,-999,-999,-999,-999,-999,-999,-999,-999
,2002-10-25T00:49:19Z,SAT011,-20.01,149.15,79.8,-999,-999,-999,-999,-999,-999,-999,-999,-999,-999,-999,-999
,2002-10-25T00:49:21Z,SAT011,-20.01,149.15,80,-999,-999,-999,-999,-999,-999,-999,-999,-999,-999,-999,-999
,2002-10-25T00:49:24Z,SAT011,-20.01,149.15,80.2,-999,-999,-999,-999,-999,-999,-999,-999,-999,-999,-999,-999
,2002-10-25T00:49:26Z,SAT011,-20.01,149.15,80.4,-999,-999,-999,-999,-999,-999,-999,-999,-999,-999,-999,-999
,2002-10-25T00:49:29Z,SAT011,-20.01,149.15,80.6,-999,-999,-999,-999,-999,-999,-999,-999,-999,-999,-999,-999
,2002-10-25T00:51:09Z,SAT011,-20.01,149.15,80.8,-999,-999,-999,-999,-999,-999,-999,-999,-999,-999,-999,-999
,2002-10-25T00:51:11Z,SAT011,-20.01,149.15,81,-999,-999,-999,-999,-999,-999,-999,-999,-999,-999,-999,-999
,2002-10-25T00:51:13Z,SAT011,-20.01,149.15,81.2,-999,-999,-999,-999,-999,-999,-999,-999,-999,-999,-999,-999
,2002-10-25T00:51:15Z,SAT011,-20.01,149.15,81.4,-999,-999,-999,-999,-999,-999,-999,-999,-999,-999,-999,-999
,2002-10-25T00:51:17Z,SAT011,-20.01,149.15,81.6,-999,-999,-999,-999,-999,-999,-999,-999,-999,-999,-999,-999
,2002-10-25T00:51:18Z,SAT011,-20.01,149.15,81.8,-999,-999,-999,-999,-999,-999,-999,-999,-999,-999,-999,-999
,2002-10-25T00:51:20Z,SAT011,-20.01,149.15,82,-999,-999,-999,-999,-999,-999,-999,-999,-999,-999,-999,-999
,2002-10-25T00:51:22Z,SAT011,-20.01,149.15,82.2,-999,-999,-999,-999,-999,-999,-999,-999,-999,-999,-999,-999
,2002-10-25T00:51:24Z,SAT011,-20.01,149.15,82.4,-999,-999,-999,-999,-999,-999,-999,-999,-999,-999,-999,-999
,2002-10-25T00:51:26Z,SAT011,-20.01,149.15,82.6,-999,-999,-999,-999,-999,-999,-999,-999,-999,-999,-999,-999
,2002-10-25T00:51:28Z,SAT011,-20.01,149.15,82.8,-999,-999,-999,-999,-999,-999,-999,-999,-999,-999,-999,-999
,2002-10-25T00:51:30Z,SAT011,-20.01,149.15,83,-999,-999,-999,-999,-999,-999,-999,-999,-999,-999,-999,-999
,2002-10-25T00:51:32Z,SAT011,-20.01,149.15,83.2,-999,-999,-999,-999,-999,-999,-999,-999,-999,-999,-999,-999
,2002-10-25T00:51:34Z,SAT011,-20.01,149.15,83.4,-999,-999,-999,-999,-999,-999,-999,-999,-999,-999,-999,-999
,2002-10-25T00:51:36Z,SAT011,-20.01,149.15,83.6,-999,-999,-999,-999,-999,-999,-999,-999,-999,-999,-999,-999
,2002-10-25T00:51:38Z,SAT011,-20.01,149.15,83.8,-999,-999,-999,-999,-999,-999,-999,-999,-999,-999,-999,-999
,2002-10-25T00:51:39Z,SAT011,-20.01,149.15,84,-999,-999,-999,-999,-999,-999,-999,-999,-999,-999,-999,-999
,2002-10-25T00:51:41Z,SAT011,-20.01,149.15,84.2,-999,-999,-999,-999,-999,-999,-999,-999,-999,-999,-999,-999
,2002-10-25T00:51:43Z,SAT011,-20.01,149.15,84.4,-999,-999,-999,-999,-999,-999,-999,-999,-999,-999,-999,-999
,2002-10-25T00:51:45Z,SAT011,-20.01,149.15,84.6,-999,-999,-999,-999,-999,-999,-999,-999,-999,-999,-999,-999
,2002-10-25T00:51:47Z,SAT011,-20.01,149.15,84.8,-999,-999,-999,-999,-999,-999,-999,-999,-999,-999,-999,-999
,2002-10-25T00:51:49Z,SAT011,-20.01,149.15,85,-999,-999,-999,-999,-999,-999,-999,-999,-999,-999,-999,-999
,2002-10-25T00:51:51Z,SAT011,-20.01,149.15,85.2,-999,-999,-999,-999,-999,-999,-999,-999,-999,-999,-999,-999
,2002-10-25T00:51:53Z,SAT011,-20.01,149.15,85.4,-999,-999,-999,-999,-999,-999,-999,-999,-999,-999,-999,-999
,2002-10-25T00:51:55Z,SAT011,-20.01,149.15,85.6,-999,-999,-999,-999,-999,-999,-999,-999,-999,-999,-999,-999
,2002-10-25T00:51:57Z,SAT011,-20.01,149.15,85.8,-999,-999,-999,-999,-999,-999,-999,-999,-999,-999,-999,-999
,2002-10-25T00:51:59Z,SAT011,-20.01,149.15,86,-999,-999,-999,-999,-999,-999,-999,-999,-999,-999,-999,-999
,2002-10-25T00:52:00Z,SAT011,-20.01,149.15,86.2,-999,-999,-999,-999,-999,-999,-999,-999,-999,-999,-999,-999
,2002-10-25T00:52:02Z,SAT011,-20.01,149.15,86.4,-999,-999,-999,-999,-999,-999,-999,-999,-999,-999,-999,-999
,2002-10-25T00:52:04Z,SAT011,-20.01,149.15,86.6,-999,-999,-999,-999,-999,-999,-999,-999,-999,-999,-999,-999
,2002-10-25T00:52:06Z,SAT011,-20.01,149.15,86.8,-999,-999,-999,-999,-999,-999,-999,-999,-999,-999,-999,-999
,2002-10-25T00:52:08Z,SAT011,-20.01,149.15,87,-999,-999,-999,-999,-999,-999,-999,-999,-999,-999,-999,-999
,2002-10-25T00:52:10Z,SAT011,-20.01,149.15,87.2,-999,-999,-999,-999,-999,-999,-999,-999,-999,-999,-999,-999
,2002-10-25T00:52:12Z,SAT011,-20.01,149.15,87.4,-999,-999,-999,-999,-999,-999,-999,-999,-999,-999,-999,-999
,2002-10-25T00:52:14Z,SAT011,-20.01,149.15,87.6,-999,-999,-999,-999,-999,-999,-999,-999,-999,-999,-999,-999
,2002-10-25T00:52:16Z,SAT011,-20.01,149.15,87.8,-999,-999,-999,-999,-999,-999,-999,-999,-999,-999,-999,-999
,2002-10-25T00:52:18Z,SAT011,-20.01,149.15,88,-999,-999,-999,-999,-999,-999,-999,-999,-999,-999,-999,-999
,2002-10-25T00:52:20Z,SAT011,-20.01,149.15,88.2,-999,-999,-999,-999,-999,-999,-999,-999,-999,-999,-999,-999
,2002-10-25T00:52:21Z,SAT011,-20.01,149.15,88.4,-999,-999,-999,-999,-999,-999,-999,-999,-999,-999,-999,-999
,2002-10-25T00:52:23Z,SAT011,-20.01,149.15,88.6,-999,-999,-999,-999,-999,-999,-999,-999,-999,-999,-999,-999
,2002-10-25T00:52:25Z,SAT011,-20.01,149.15,88.8,-999,-999,-999,-999,-999,-999,-999,-999,-999,-999,-999,-999
,2002-10-25T00:52:27Z,SAT011,-20.01,149.15,89,-999,-999,-999,-999,-999,-999,-999,-999,-999,-999,-999,-999
,2002-10-25T00:52:29Z,SAT011,-20.01,149.15,89.2,-999,-999,-999,-999,-999,-999,-999,-999,-999,-999,-999,-999
,2002-10-25T00:52:31Z,SAT011,-20.01,149.15,89.4,-999,-999,-999,-999,-999,-999,-999,-999,-999,-999,-999,-999
,2002-10-25T00:52:33Z,SAT011,-20.01,149.15,89.6,-999,-999,-999,-999,-999,-999,-999,-999,-999,-999,-999,-999
,2002-10-25T00:52:35Z,SAT011,-20.01,149.15,89.8,-999,-999,-999,-999,-999,-999,-999,-999,-999,-999,-999,-999
,2002-10-25T00:52:37Z,SAT011,-20.01,149.15,90,-999,-999,-999,-999,-999,-999,-999,-999,-999,-999,-999,-999
,2002-10-25T00:52:39Z,SAT011,-20.01,149.15,90.2,-999,-999,-999,-999,-999,-999,-999,-999,-999,-999,-999,-999
,2002-10-25T00:52:40Z,SAT011,-20.01,149.15,90.4,-999,-999,-999,-999,-999,-999,-999,-999,-999,-999,-999,-999
,2002-10-25T00:52:42Z,SAT011,-20.01,149.15,90.6,-999,-999,-999,-999,-999,-999,-999,-999,-999,-999,-999,-999
,2002-10-25T00:52:44Z,SAT011,-20.01,149.15,90.8,-999,-999,-999,-999,-999,-999,-999,-999,-999,-999,-999,-999
,2002-10-25T00:52:46Z,SAT011,-20.01,149.15,91,-999,-999,-999,-999,-999,-999,-999,-999,-999,-999,-999,-999
,2002-10-25T00:52:48Z,SAT011,-20.01,149.15,91.2,-999,-999,-999,-999,-999,-999,-999,-999,-999,-999,-999,-999
,2002-10-25T00:52:50Z,SAT011,-20.01,149.15,91.4,-999,-999,-999,-999,-999,-999,-999,-999,-999,-999,-999,-999
,2002-10-25T00:52:52Z,SAT011,-20.01,149.15,91.6,-999,-999,-999,-999,-999,-999,-999,-999,-999,-999,-999,-999
,2002-10-25T00:52:54Z,SAT011,-20.01,149.15,91.8,-999,-999,-999,-999,-999,-999,-999,-999,-999,-999,-999,-999
,2002-10-25T00:52:57Z,SAT011,-20.01,149.15,92,-999,-999,-999,-999,-999,-999,-999,-999,-999,-999,-999,-999
,2002-10-25T00:53:01Z,SAT011,-20.01,149.15,92.2,-999,-999,-999,-999,-999,-999,-999,-999,-999,-999,-999,-999
,2002-10-25T00:53:03Z,SAT011,-20.01,149.15,92.4,-999,-999,-999,-999,-999,-999,-999,-999,-999,-999,-999,-999
,2002-10-25T00:53:04Z,SAT011,-20.01,149.15,92.6,-999,-999,-999,-999,-999,-999,-999,-999,-999,-999,-999,-999
,2002-10-25T00:53:06Z,SAT011,-20.01,149.15,92.8,-999,-999,-999,-999,-999,-999,-999,-999,-999,-999,-999,-999
,2002-10-25T00:53:08Z,SAT011,-20.01,149.15,93,-999,-999,-999,-999,-999,-999,-999,-999,-999,-999,-999,-999
,2002-10-25T00:53:10Z,SAT011,-20.01,149.15,93.2,-999,-999,-999,-999,-999,-999,-999,-999,-999,-999,-999,-999
,2002-10-25T00:53:12Z,SAT011,-20.01,149.15,93.4,-999,-999,-999,-999,-999,-999,-999,-999,-999,-999,-999,-999
,2002-10-25T00:53:15Z,SAT011,-20.01,149.15,93.6,-999,-999,-999,-999,-999,-999,-999,-999,-999,-999,-999,-999
,2002-10-25T00:53:17Z,SAT011,-20.01,149.15,93.8,-999,-999,-999,-999,-999,-999,-999,-999,-999,-999,-999,-999
,2002-10-25T00:53:19Z,SAT011,-20.01,149.15,94,-999,-999,-999,-999,-999,-999,-999,-999,-999,-999,-999,-999
,2002-10-25T00:53:21Z,SAT011,-20.01,149.15,94.2,-999,-999,-999,-999,-999,-999,-999,-999,-999,-999,-999,-999
,2002-10-25T00:53:23Z,SAT011,-20.01,149.15,94.4,-999,-999,-999,-999,-999,-999,-999,-999,-999,-999,-999,-999
,2002-10-25T00:53:26Z,SAT011,-20.01,149.15,94.6,-999,-999,-999,-999,-999,-999,-999,-999,-999,-999,-999,-999
,2002-10-25T00:53:27Z,SAT011,-20.01,149.15,94.8,-999,-999,-999,-999,-999,-999,-999,-999,-999,-999,-999,-999
,2002-10-25T00:53:29Z,SAT011,-20.01,149.15,95,-999,-999,-999,-999,-999,-999,-999,-999,-999,-999,-999,-999
,2002-10-25T00:53:31Z,SAT011,-20.01,149.15,95.2,-999,-999,-999,-999,-999,-999,-999,-999,-999,-999,-999,-999
,2002-10-25T00:53:34Z,SAT011,-20.01,149.15,95.4,-999,-999,-999,-999,-999,-999,-999,-999,-999,-999,-999,-999
,2002-10-25T00:53:37Z,SAT011,-20.01,149.15,95.6,-999,-999,-999,-999,-999,-999,-999,-999,-999,-999,-999,-999
,2002-10-25T00:53:39Z,SAT011,-20.01,149.15,95.8,-999,-999,-999,-999,-999,-999,-999,-999,-999,-999,-999,-999
,2002-10-25T00:53:41Z,SAT011,-20.01,149.15,96,-999,-999,-999,-999,-999,-999,-999,-999,-999,-999,-999,-999
,2002-10-25T00:53:44Z,SAT011,-20.01,149.15,96.2,-999,-999,-999,-999,-999,-999,-999,-999,-999,-999,-999,-999
,2002-10-25T00:53:46Z,SAT011,-20.01,149.15,96.4,-999,-999,-999,-999,-999,-999,-999,-999,-999,-999,-999,-999
,2002-10-25T00:53:48Z,SAT011,-20.01,149.15,96.6,-999,-999,-999,-999,-999,-999,-999,-999,-999,-999,-999,-999
,2002-10-25T00:53:50Z,SAT011,-20.01,149.15,96.8,-999,-999,-999,-999,-999,-999,-999,-999,-999,-999,-999,-999
,2002-10-25T00:53:51Z,SAT011,-20.01,149.15,97,-999,-999,-999,-999,-999,-999,-999,-999,-999,-999,-999,-999
,2002-10-25T00:53:53Z,SAT011,-20.01,149.15,97.2,-999,-999,-999,-999,-999,-999,-999,-999,-999,-999,-999,-999
,2002-10-25T00:53:55Z,SAT011,-20.01,149.15,97.4,-999,-999,-999,-999,-999,-999,-999,-999,-999,-999,-999,-999
,2002-10-25T00:53:57Z,SAT011,-20.01,149.15,97.6,-999,-999,-999,-999,-999,-999,-999,-999,-999,-999,-999,-999
,2002-10-25T00:53:59Z,SAT011,-20.01,149.15,97.8,-999,-999,-999,-999,-999,-999,-999,-999,-999,-999,-999,-999
,2002-10-25T00:54:01Z,SAT011,-20.01,149.15,98,-999,-999,-999,-999,-999,-999,-999,-999,-999,-999,-999,-999
,2002-10-25T00:54:03Z,SAT011,-20.01,149.15,98.2,-999,-999,-999,-999,-999,-999,-999,-999,-999,-999,-999,-999
,2002-10-25T00:54:05Z,SAT011,-20.01,149.15,98.4,-999,-999,-999,-999,-999,-999,-999,-999,-999,-999,-999,-999
,2002-10-25T00:54:07Z,SAT011,-20.01,149.15,98.6,-999,-999,-999,-999,-999,-999,-999,-999,-999,-999,-999,-999
,2002-10-25T00:54:09Z,SAT011,-20.01,149.15,98.8,-999,-999,-999,-999,-999,-999,-999,-999,-999,-999,-999,-999
,2002-10-25T00:54:11Z,SAT011,-20.01,149.15,99,-999,-999,-999,-999,-999,-999,-999,-999,-999,-999,-999,-999
,2002-10-25T00:54:12Z,SAT011,-20.01,149.15,99.2,-999,-999,-999,-999,-999,-999,-999,-999,-999,-999,-999,-999
,2002-10-25T00:54:14Z,SAT011,-20.01,149.15,99.4,-999,-999,-999,-999,-999,-999,-999,-999,-999,-999,-999,-999
,2002-10-25T00:54:16Z,SAT011,-20.01,149.15,99.6,-999,-999,-999,-999,-999,-999,-999,-999,-999,-999,-999,-999
,2002-10-25T00:54:18Z,SAT011,-20.01,149.15,99.8,-999,-999,-999,-999,-999,-999,-999,-999,-999,-999,-999,-999
,2002-10-25T00:54:20Z,SAT011,-20.01,149.15,100,-999,-999,-999,-999,-999,-999,-999,-999,-999,-999,-999,-999
