GLOBAL ATTRIBUTES,,,,,,,,,,,,,,,,,
title,,,,,,,,,,,,,,,,,
project,Integrated Marine Observing System (IMOS),,,,,,,,,,,,,,,,
original_project_name,MERIS validation,,,,,,,,,,,,,,,,
original_institution,CSIRO Land and Water,,,,,,,,,,,,,,,,
abstract,This record contains in situ water optical property data collected in the North Great Barrier Reef| Australia on the RSV Lady Basten between 17-21 Sept 2005. A total of 34 stations were sampled during the field campaign AS05. The data can be used for Ocean Colour sensor validation| optical water quality monitoring and modelling. CLW deployed the optical instruments TriOS RAMSES (hyperspectral irradiance)| WETLabs AC-9 (absorption and attenuation coefficicents)| HOBILabs Hydroscat-6 (backscattering coefficient) during this cruise.This data was part of the dataset described in Blondeau-Patissier et al. 2009| JGR| VOL. 114| C05003| doi:10.1029/2008JC005039. Funding for this study was provided by CSIRO Earth Observation Centre| CSIRO Land and Water| CSIRO Marine Research and the Australian Institute of Marine Sciences. We also thank the captains and crews of the RSV Lady Basten.,,,,,,,,,,,,,,,,
conventions,IMOS biological data format (v1.0),,,,,,,,,,,,,,,,
date_created,2005-09-20T00:03:36Z,,,,,,,,,,,,,,,,
date_modified,2006-02-06T22:55:44Z,,,,,,,,,,,,,,,,
history,Data has been quality controlled by in-house procedures. HS-6 data were corrected for temperature using CTD data and the Sigma correction method| recommended by the manufacturer| was applied using absorption and attenuation data from the AC-9. The Sigma correction is an adjustment to improve the accuracy of backscattering measurements| in particular in highly-attenuating water. The correction is detailed in HOBI-labs Inc.| 2003. The backscattering coefficient bb is estimated using the method described in Maffione and Dana| 1997| Applied Optics| 36(24)| pp.6057-6067.,,,,,,,,,,,,,,,,
comment,The HydroScat-6 (HS-6) is a self-contained instrument for measuring optical backscattering at six different wavelengths in natural waters. The particulate backscattering coefficient| bbp (lambda)| is a measure of light scattering by particles at angles between 90 and 180 degrees. bbp was estimated by subtracting bbw (lambda)| the backscattering coefficient of pure sea-water| from bb (lambda). The pure seawater backscattering coefficient was calculated using a backscattering ratio of 0.5 (Gordon et al.| 1988| Journal of Geophysical Research) and the seawater scattering coefficients| bw(lambda)| of Morel (1974| Optical properties of pure water and pure seawater| p. 1-24| in Optical Aspects of Oceanography).,,,,,,,,,,,,,,,,
source,Particulate Scattering coefficients determined using an HS-6 (www.hobilabs.com),,,,,,,,,,,,,,,,
keywords,Oceans>Ocean Optics > Scattering ;Oceans>Ocean Optics>Ocean Colour;,,,,,,,,,,,,,,,,
cruise_id,LB4083,,,,,,,,,,,,,,,,
vessel_name,RSV Lady Basten,,,,,,,,,,,,,,,,
platform_code,VLAB_450301529,,,,,,,,,,,,,,,,
references,https://marlin.csiro.au/geonetwork/srv/eng/catalog.search#/metadata/d3c5d7ba-b861-72d5-e043-08114f8c2cf2,,,,,,,,,,,,,,,,
naming_authority,CSIRO Land and Water (CLW),,,,,,,,,,,,,,,,
cdm_data_type,profile,,,,,,,,,,,,,,,,
geospatial_lat_min,-17.19,,,,,,,,,,,,,,,,
geospatial_lat_max,-17.19,,,,,,,,,,,,,,,,
geospatial_lon_min,146.44,,,,,,,,,,,,,,,,
geospatial_lon_max,146.44,,,,,,,,,,,,,,,,
geospatial_vertical_min,0,,,,,,,,,,,,,,,,
geospatial_vertical_max,100,,,,,,,,,,,,,,,,
local_time_zone,10,,,,,,,,,,,,,,,,
data_centre,eMarine Information Infrastructure (eMII),,,,,,,,,,,,,,,,
data_centre_email,info@emii.org.au,,,,,,,,,,,,,,,,
author,Brando Vittorio,,,,,,,,,,,,,,,,
author_email,vittorio.brando@csiro.au,,,,,,,,,,,,,,,,
principal_investigator,Furnas Miles,,,,,,,,,,,,,,,,
principal_investigator_email,m.furnas@aims.gov.au,,,,,,,,,,,,,,,,
institution,IMOS Satellite Remote Sensing - Ocean Colour Sub-facility - Bio-Optical database of Australian Waters,,,,,,,,,,,,,,,,
institution_principal_investigator,"Schroeder, Thomas",,,,,,,,,,,,,,,,
institution_principal_investigator_email,Thomas.Schroeder@csiro.au,,,,,,,,,,,,,,,,
publisher,Australian Ocean Data Network,,,,,,,,,,,,,,,,
publisher_email,info@aodn.org.au,,,,,,,,,,,,,,,,
citation,To cite this data set in a publication use the format <<IMOS [year-of-data-downloaded] [Title] [data-access-url] accessed [date-of-access]>>,,,,,,,,,,,,,,,,
acknowledgement,Data was sourced from the Commonwealth Scientific and Industrial Research Organisation (CSIRO),,,,,,,,,,,,,,,,
distribution_statement,"Any users of IMOS data are required to clearly acknowledge the source of the material- Data or products or services from IMOS are provided ""as is"" without any warranty as to fitness for a particular purpose.",,,,,,,,,,,,,,,,
,,,,,,,,,,,,,,,,,
TABLE ROWS,,,,,,,,,,,,,,,,,
Row name,CF standard_name,IMOS long_name,Units,Fill value,Comments,,,,,,,,,,,,
Wavelength,radiation_wavelength,Wavelength of measurement,nm,-999,,,,,,,,,,,,,
,,,,,,,,,,,,,,,,,
TABLE COLUMNS,,,,,,,,,,,,,,,,,
Column name,CF standard_name,IMOS long_name,Units,Fill value,Comments,,,,,,,,,,,,
Time,time,analysis_time,YYYY-MM-DDThh:mm:ssZ,,UTC date and time,,,,,,,,,,,,
Station_Code,,,,,National Reference Station code (6 letters),,,,,,,,,,,,
Latitude,latitude,latitude,degrees_north,-999,North positive,,,,,,,,,,,,
Longitude,longitude,longitude,degrees_east,-999,East positive,,,,,,,,,,,,
Depth,depth,depth,m ,-999,positive down,,,,,,,,,,,,
bb_corr,,corrected_volume_total_backwards_scattering_coefficient_of_(bbw_+_bbp)_in_sea_water,m-1,-999,bbw:volume_backwards_scattering_coefficient_of_radiative_flux_in_sea_water ; bbp=volume_backwards_scattering_coefficient_of_particules_in_sea_water,,,,,,,,,,,,
bb_uncorr,,volume_total_backwards_scattering_coefficient_of_(bbw_+_bbp)_in_sea_water,m-1,-999,bbw:volume_backwards_scattering_coefficient_of_radiative_flux_in_sea_water ; bbp=volume_backwards_scattering_coefficient_of_particules_in_sea_water,,,,,,,,,,,,
,,,,,,,,,,,,,,,,,
,,,,,,,,,,,,,,,,,
DATA,,,,,,,,,,,,,,,,,
,Time,Station_Code,Latitude,Longitude,Depth,bb_corr,bb_corr,bb_corr,bb_corr,bb_corr,bb_corr,bb_uncorr,bb_uncorr,bb_uncorr,bb_uncorr,bb_uncorr,bb_uncorr
Wavelength,,,,,,442,448,555,589,676,852,442,448,555,589,676,852
,2005-09-20T00:05:10Z,WQN026,-17.19,146.44,0,0.023612,0.020756,0.017781,0.017315,0.015318,0.013718,0.021942,0.01953,0.016819,0.016455,0.014678,0.010982
,2005-09-20T00:04:54Z,WQN026,-17.19,146.44,0.2,0.02465,0.020985,0.01885,0.018487,0.016215,0.014741,0.022917,0.019751,0.017842,0.017577,0.015539,0.011804
,2005-09-20T00:05:48Z,WQN026,-17.19,146.44,0.4,0.023923,0.02167,0.017433,0.018075,0.015756,0.014158,0.022273,0.020412,0.016533,0.017211,0.015102,0.011346
,2005-09-20T00:05:50Z,WQN026,-17.19,146.44,0.6,0.024149,0.021053,0.01696,0.017576,0.015689,0.014285,0.022499,0.019839,0.016099,0.016748,0.015039,0.011452
,2005-09-20T00:05:52Z,WQN026,-17.19,146.44,0.8,0.023704,0.021839,0.017734,0.017997,0.015809,0.013944,0.022098,0.020589,0.016844,0.017157,0.015155,0.011182
,2005-09-20T00:03:38Z,WQN026,-17.19,146.44,1,-999,-999,-999,-999,-999,-999,-999,-999,-999,-999,-999,-999
,2005-09-20T00:05:56Z,WQN026,-17.19,146.44,1.2,0.024781,0.02208,0.018365,0.018267,0.016472,0.014706,0.023091,0.020809,0.017441,0.017414,0.015788,0.011792
,2005-09-20T00:06:00Z,WQN026,-17.19,146.44,1.4,0.025209,0.022856,0.019094,0.018383,0.016836,0.014919,0.023509,0.021559,0.018153,0.017541,0.016145,0.011968
,2005-09-20T00:06:02Z,WQN026,-17.19,146.44,1.6,0.02487,0.021379,0.0179,0.018576,0.016728,0.015073,0.023169,0.020148,0.016991,0.017704,0.016029,0.012085
,2005-09-20T00:06:04Z,WQN026,-17.19,146.44,1.8,0.024452,0.022965,0.019197,0.018564,0.016051,0.015451,0.022786,0.021648,0.018227,0.017693,0.015387,0.012391
,2005-09-20T00:06:06Z,WQN026,-17.19,146.44,2,0.024527,0.02226,0.01835,0.01857,0.016686,0.015249,0.022856,0.020986,0.017425,0.0177,0.015989,0.012226
,2005-09-20T00:03:40Z,WQN026,-17.19,146.44,2.2,-999,-999,-999,-999,-999,-999,-999,-999,-999,-999,-999,-999
,2005-09-20T00:06:10Z,WQN026,-17.19,146.44,2.4,0.025317,0.021927,0.018335,0.018253,0.017157,0.014573,0.023552,0.020633,0.017384,0.017371,0.016421,0.011663
,2005-09-20T00:03:42Z,WQN026,-17.19,146.44,2.6,-999,-999,-999,-999,-999,-999,-999,-999,-999,-999,-999,-999
,2005-09-20T00:04:46Z,WQN026,-17.19,146.44,2.8,0.024519,0.021472,0.019022,0.017995,0.016257,0.014491,0.022838,0.020236,0.018055,0.017143,0.015561,0.011604
,2005-09-20T00:04:42Z,WQN026,-17.19,146.44,3,0.024878,0.021859,0.019166,0.017954,0.016296,0.014294,0.023152,0.020589,0.018194,0.017107,0.01561,0.011452
,2005-09-20T00:06:18Z,WQN026,-17.19,146.44,3.2,0.024171,0.023524,0.019509,0.019153,0.016251,0.014708,0.022464,0.022133,0.018505,0.018232,0.015548,0.01178
,2005-09-20T00:04:22Z,WQN026,-17.19,146.44,3.4,0.024223,0.020926,0.018853,0.018092,0.015718,0.014061,0.022542,0.019707,0.017883,0.017226,0.015048,0.011264
,2005-09-20T00:06:22Z,WQN026,-17.19,146.44,3.6,0.023997,0.021672,0.018333,0.018468,0.016243,0.015223,0.022351,0.020412,0.0174,0.017595,0.015561,0.012203
,2005-09-20T00:03:44Z,WQN026,-17.19,146.44,3.8,-999,-999,-999,-999,-999,-999,-999,-999,-999,-999,-999,-999
,2005-09-20T00:06:26Z,WQN026,-17.19,146.44,4,0.024634,0.021498,0.018749,0.018613,0.016553,0.014742,0.022943,0.020236,0.017793,0.017729,0.015851,0.011815
,2005-09-20T00:06:28Z,WQN026,-17.19,146.44,4.2,0.02512,0.0214,0.018025,0.018452,0.016674,0.014856,0.023369,0.020131,0.017098,0.017566,0.015953,0.011898
,2005-09-20T00:03:46Z,WQN026,-17.19,146.44,4.4,-999,-999,-999,-999,-999,-999,-999,-999,-999,-999,-999,-999
,2005-09-20T00:06:30Z,WQN026,-17.19,146.44,4.6,0.024548,0.021741,0.018504,0.018148,0.016605,0.01539,0.022812,0.020452,0.017531,0.017262,0.015886,0.01232
,2005-09-20T00:06:34Z,WQN026,-17.19,146.44,4.8,0.024732,0.022288,0.018501,0.018197,0.016363,0.014705,0.023004,0.020953,0.017548,0.01732,0.015659,0.011768
,2005-09-20T00:06:36Z,WQN026,-17.19,146.44,5,0.025193,0.022307,0.018405,0.018326,0.017077,0.015502,0.023474,0.020996,0.017474,0.017461,0.016355,0.012414
,2005-09-20T00:06:38Z,WQN026,-17.19,146.44,5.2,0.023697,0.021655,0.018607,0.017314,0.015951,0.014398,0.022081,0.020392,0.017662,0.016495,0.01528,0.011534
,2005-09-20T00:06:40Z,WQN026,-17.19,146.44,5.4,0.0237,0.022182,0.018827,0.018067,0.015998,0.014846,0.022055,0.02088,0.01785,0.017193,0.015307,0.011886
,2005-09-20T00:06:42Z,WQN026,-17.19,146.44,5.6,0.025032,0.022711,0.019253,0.018416,0.01708,0.01441,0.023326,0.021399,0.018276,0.017545,0.016355,0.011545
,2005-09-20T00:06:44Z,WQN026,-17.19,146.44,5.8,0.025202,0.022198,0.018802,0.017817,0.016886,0.014991,0.0235,0.020928,0.017859,0.016983,0.016176,0.012015
,2005-09-20T00:06:46Z,WQN026,-17.19,146.44,6,0.023549,0.021664,0.018814,0.018115,0.016031,0.014836,0.021933,0.020409,0.01785,0.017251,0.015342,0.011874
,2005-09-20T00:06:48Z,WQN026,-17.19,146.44,6.2,0.025113,0.021002,0.018466,0.017139,0.016436,0.015542,0.023404,0.019797,0.017531,0.016332,0.015744,0.012449
,2005-09-20T00:06:50Z,WQN026,-17.19,146.44,6.4,0.02419,0.021236,0.018354,0.017965,0.01632,0.015692,0.022551,0.020019,0.017433,0.017128,0.015641,0.012578
,2005-09-20T00:06:52Z,WQN026,-17.19,146.44,6.6,0.0245,0.021125,0.0185,0.017753,0.016971,0.015453,0.022812,0.019899,0.017548,0.016907,0.016248,0.012379
,2005-09-20T00:06:54Z,WQN026,-17.19,146.44,6.8,0.023942,0.021058,0.018283,0.017816,0.016185,0.014543,0.022325,0.019861,0.017368,0.016987,0.015512,0.011663
,2005-09-20T00:06:56Z,WQN026,-17.19,146.44,7,0.024882,0.021262,0.01851,0.01827,0.017105,0.014664,0.023187,0.020054,0.01758,0.017418,0.01639,0.011757
,2005-09-20T00:06:58Z,WQN026,-17.19,146.44,7.2,0.024039,0.021318,0.018394,0.018271,0.016164,0.01471,0.022368,0.020096,0.017458,0.017407,0.015485,0.011792
,2005-09-20T00:07:00Z,WQN026,-17.19,146.44,7.4,0.023222,0.021259,0.019025,0.018085,0.016006,0.014043,0.021628,0.020037,0.018063,0.017233,0.015329,0.011252
,2005-09-20T00:07:02Z,WQN026,-17.19,146.44,7.6,0.02553,0.021073,0.01836,0.017582,0.01755,0.014459,0.023813,0.019869,0.017441,0.016763,0.016818,0.011592
,2005-09-20T00:07:06Z,WQN026,-17.19,146.44,7.8,0.02398,0.020788,0.018239,0.018056,0.016696,0.014557,0.022316,0.019578,0.01731,0.017197,0.015989,0.011663
,2005-09-20T00:07:08Z,WQN026,-17.19,146.44,8,0.023105,0.02157,0.019417,0.018322,0.015658,0.014807,0.021559,0.020354,0.018456,0.017476,0.015017,0.011874
,2005-09-20T00:07:10Z,WQN026,-17.19,146.44,8.2,0.023972,0.021991,0.01863,0.018501,0.016327,0.014751,0.022368,0.020739,0.017703,0.017646,0.015655,0.011827
,2005-09-20T00:07:12Z,WQN026,-17.19,146.44,8.4,0.024112,0.021531,0.018516,0.018444,0.016604,0.015113,0.022438,0.020285,0.01758,0.017566,0.015886,0.012097
,2005-09-20T00:07:14Z,WQN026,-17.19,146.44,8.6,0.024044,0.022058,0.019049,0.018117,0.016887,0.015694,0.022377,0.020782,0.018088,0.017262,0.016167,0.012567
,2005-09-20T00:07:16Z,WQN026,-17.19,146.44,8.8,0.023565,0.021549,0.019169,0.019146,0.01603,0.015025,0.021942,0.020315,0.01821,0.018254,0.01536,0.012038
,2005-09-20T00:07:18Z,WQN026,-17.19,146.44,9,0.023726,0.021849,0.019397,0.019053,0.016576,0.015303,0.022151,0.020623,0.018431,0.018178,0.015909,0.012285
,2005-09-20T00:07:20Z,WQN026,-17.19,146.44,9.2,0.024148,0.022814,0.020412,0.018086,0.01676,0.014691,0.022516,0.02151,0.01938,0.017237,0.016065,0.011768
,2005-09-20T00:07:22Z,WQN026,-17.19,146.44,9.4,0.025014,0.022434,0.019348,0.018534,0.016293,0.015725,0.023326,0.02115,0.018382,0.017671,0.015614,0.012602
,2005-09-20T00:07:24Z,WQN026,-17.19,146.44,9.6,0.024128,0.021425,0.019237,0.018261,0.016576,0.014913,0.022499,0.020199,0.018276,0.017411,0.015891,0.011956
,2005-09-20T00:07:26Z,WQN026,-17.19,146.44,9.8,0.02382,0.021616,0.019347,0.018574,0.016177,0.014999,0.022203,0.020379,0.018349,0.017693,0.015499,0.012015
,2005-09-20T00:07:28Z,WQN026,-17.19,146.44,10,0.024443,0.021939,0.019263,0.018077,0.016904,0.014296,0.02276,0.020671,0.018259,0.017208,0.016176,0.01144
,2005-09-20T00:07:30Z,WQN026,-17.19,146.44,10.2,0.024835,0.021776,0.019193,0.018649,0.016895,0.014912,0.023126,0.020512,0.01821,0.017758,0.016176,0.011933
,2005-09-20T00:07:32Z,WQN026,-17.19,146.44,10.4,0.024541,0.021891,0.019084,0.018777,0.016441,0.015054,0.022847,0.020619,0.018112,0.017885,0.015748,0.01205
,2005-09-20T00:07:34Z,WQN026,-17.19,146.44,10.6,0.025127,0.021154,0.018173,0.018874,0.016971,0.015593,0.023369,0.019921,0.017245,0.017975,0.016248,0.012485
,2005-09-20T00:07:36Z,WQN026,-17.19,146.44,10.8,0.024906,0.0218,0.01854,0.018225,0.016964,0.014201,0.023195,0.020546,0.017605,0.017371,0.016256,0.011381
,2005-09-20T00:07:38Z,WQN026,-17.19,146.44,11,0.024136,0.021109,0.018445,0.018274,0.016498,0.0165,0.02249,0.019895,0.017515,0.017418,0.015815,0.013224
,2005-09-20T00:07:40Z,WQN026,-17.19,146.44,11.2,0.023789,0.021337,0.018694,0.017889,0.016017,0.015724,0.022168,0.020105,0.017752,0.017052,0.015351,0.012602
,2005-09-20T00:07:42Z,WQN026,-17.19,146.44,11.4,0.023807,0.024038,0.020582,0.018233,0.015959,0.014879,0.022185,0.02265,0.019536,0.017374,0.015289,0.011921
,2005-09-20T00:07:44Z,WQN026,-17.19,146.44,11.6,0.025115,0.022195,0.019266,0.017761,0.017253,0.015249,0.023361,0.020898,0.018268,0.016904,0.016515,0.012215
,2005-09-20T00:07:48Z,WQN026,-17.19,146.44,11.8,0.024481,0.022125,0.018649,0.01864,0.016681,0.01498,0.022804,0.020855,0.017695,0.017754,0.015976,0.012003
,2005-09-20T00:07:50Z,WQN026,-17.19,146.44,12,0.026009,0.021249,0.018124,0.018275,0.01915,0.015152,0.024196,0.020002,0.017188,0.017396,0.018312,0.012132
,2005-09-20T00:04:04Z,WQN026,-17.19,146.44,12.2,-999,-999,-999,-999,-999,-999,-999,-999,-999,-999,-999,-999
,2005-09-20T00:07:52Z,WQN026,-17.19,146.44,12.4,0.026402,0.023316,0.019982,0.019421,0.017089,0.015086,0.024571,0.021947,0.018955,0.018489,0.016359,0.012074
,2005-09-20T00:07:56Z,WQN026,-17.19,146.44,12.6,0.025345,0.024774,0.02203,0.020214,0.016911,0.015878,0.023596,0.023322,0.020927,0.019264,0.016194,0.012719
,2005-09-20T00:07:58Z,WQN026,-17.19,146.44,12.8,0.027149,0.02227,0.01863,0.021183,0.019602,0.017548,0.025259,0.020932,0.017662,0.020147,0.018744,0.014034
,2005-09-20T00:08:00Z,WQN026,-17.19,146.44,13,0.027017,0.024762,0.021996,0.02123,0.018811,0.016675,0.025128,0.023271,0.020837,0.020183,0.017991,0.01333
,2005-09-20T00:04:06Z,WQN026,-17.19,146.44,13.2,-999,-999,-999,-999,-999,-999,-999,-999,-999,-999,-999,-999
,2005-09-20T00:04:06Z,WQN026,-17.19,146.44,13.4,-999,-999,-999,-999,-999,-999,-999,-999,-999,-999,-999,-999
,2005-09-20T00:04:06Z,WQN026,-17.19,146.44,13.6,-999,-999,-999,-999,-999,-999,-999,-999,-999,-999,-999,-999
,2005-09-20T00:04:08Z,WQN026,-17.19,146.44,13.8,-999,-999,-999,-999,-999,-999,-999,-999,-999,-999,-999,-999
,2005-09-20T00:04:08Z,WQN026,-17.19,146.44,14,-999,-999,-999,-999,-999,-999,-999,-999,-999,-999,-999,-999
,2005-09-20T00:04:08Z,WQN026,-17.19,146.44,14.2,-999,-999,-999,-999,-999,-999,-999,-999,-999,-999,-999,-999
,2005-09-20T00:04:08Z,WQN026,-17.19,146.44,14.4,-999,-999,-999,-999,-999,-999,-999,-999,-999,-999,-999,-999
,2005-09-20T00:04:08Z,WQN026,-17.19,146.44,14.6,-999,-999,-999,-999,-999,-999,-999,-999,-999,-999,-999,-999
,2005-09-20T00:04:10Z,WQN026,-17.19,146.44,14.8,-999,-999,-999,-999,-999,-999,-999,-999,-999,-999,-999,-999
,2005-09-20T00:04:10Z,WQN026,-17.19,146.44,15,-999,-999,-999,-999,-999,-999,-999,-999,-999,-999,-999,-999
,2005-09-20T00:04:10Z,WQN026,-17.19,146.44,15.2,-999,-999,-999,-999,-999,-999,-999,-999,-999,-999,-999,-999
,2005-09-20T00:04:10Z,WQN026,-17.19,146.44,15.4,-999,-999,-999,-999,-999,-999,-999,-999,-999,-999,-999,-999
,2005-09-20T00:04:12Z,WQN026,-17.19,146.44,15.6,-999,-999,-999,-999,-999,-999,-999,-999,-999,-999,-999,-999
,2005-09-20T00:04:12Z,WQN026,-17.19,146.44,15.8,-999,-999,-999,-999,-999,-999,-999,-999,-999,-999,-999,-999
,2005-09-20T00:04:12Z,WQN026,-17.19,146.44,16,-999,-999,-999,-999,-999,-999,-999,-999,-999,-999,-999,-999
,2005-09-20T00:04:12Z,WQN026,-17.19,146.44,16.2,-999,-999,-999,-999,-999,-999,-999,-999,-999,-999,-999,-999
,2005-09-20T00:04:12Z,WQN026,-17.19,146.44,16.4,-999,-999,-999,-999,-999,-999,-999,-999,-999,-999,-999,-999
,2005-09-20T00:04:14Z,WQN026,-17.19,146.44,16.6,-999,-999,-999,-999,-999,-999,-999,-999,-999,-999,-999,-999
,2005-09-20T00:04:14Z,WQN026,-17.19,146.44,16.8,-999,-999,-999,-999,-999,-999,-999,-999,-999,-999,-999,-999
,2005-09-20T00:04:14Z,WQN026,-17.19,146.44,17,-999,-999,-999,-999,-999,-999,-999,-999,-999,-999,-999,-999
,2005-09-20T00:04:14Z,WQN026,-17.19,146.44,17.2,-999,-999,-999,-999,-999,-999,-999,-999,-999,-999,-999,-999
,2005-09-20T00:04:16Z,WQN026,-17.19,146.44,17.4,-999,-999,-999,-999,-999,-999,-999,-999,-999,-999,-999,-999
,2005-09-20T00:04:16Z,WQN026,-17.19,146.44,17.6,-999,-999,-999,-999,-999,-999,-999,-999,-999,-999,-999,-999
,2005-09-20T00:04:16Z,WQN026,-17.19,146.44,17.8,-999,-999,-999,-999,-999,-999,-999,-999,-999,-999,-999,-999
,2005-09-20T00:04:16Z,WQN026,-17.19,146.44,18,-999,-999,-999,-999,-999,-999,-999,-999,-999,-999,-999,-999
,2005-09-20T00:04:18Z,WQN026,-17.19,146.44,18.2,-999,-999,-999,-999,-999,-999,-999,-999,-999,-999,-999,-999
,2005-09-20T00:04:18Z,WQN026,-17.19,146.44,18.4,-999,-999,-999,-999,-999,-999,-999,-999,-999,-999,-999,-999
,2005-09-20T00:04:18Z,WQN026,-17.19,146.44,18.6,-999,-999,-999,-999,-999,-999,-999,-999,-999,-999,-999,-999
,2005-09-20T00:04:18Z,WQN026,-17.19,146.44,18.8,-999,-999,-999,-999,-999,-999,-999,-999,-999,-999,-999,-999
,2005-09-20T00:04:18Z,WQN026,-17.19,146.44,19,-999,-999,-999,-999,-999,-999,-999,-999,-999,-999,-999,-999
,2005-09-20T00:04:20Z,WQN026,-17.19,146.44,19.2,-999,-999,-999,-999,-999,-999,-999,-999,-999,-999,-999,-999
,2005-09-20T00:04:20Z,WQN026,-17.19,146.44,19.4,-999,-999,-999,-999,-999,-999,-999,-999,-999,-999,-999,-999
,2005-09-20T00:04:20Z,WQN026,-17.19,146.44,19.6,-999,-999,-999,-999,-999,-999,-999,-999,-999,-999,-999,-999
,2005-09-20T00:04:20Z,WQN026,-17.19,146.44,19.8,-999,-999,-999,-999,-999,-999,-999,-999,-999,-999,-999,-999
,2005-09-20T00:04:22Z,WQN026,-17.19,146.44,20,-999,-999,-999,-999,-999,-999,-999,-999,-999,-999,-999,-999
,2005-09-20T00:04:22Z,WQN026,-17.19,146.44,20.2,-999,-999,-999,-999,-999,-999,-999,-999,-999,-999,-999,-999
,2005-09-20T00:04:22Z,WQN026,-17.19,146.44,20.4,-999,-999,-999,-999,-999,-999,-999,-999,-999,-999,-999,-999
,2005-09-20T00:04:22Z,WQN026,-17.19,146.44,20.6,-999,-999,-999,-999,-999,-999,-999,-999,-999,-999,-999,-999
,2005-09-20T00:04:22Z,WQN026,-17.19,146.44,20.8,-999,-999,-999,-999,-999,-999,-999,-999,-999,-999,-999,-999
,2005-09-20T00:04:24Z,WQN026,-17.19,146.44,21,-999,-999,-999,-999,-999,-999,-999,-999,-999,-999,-999,-999
,2005-09-20T00:04:24Z,WQN026,-17.19,146.44,21.2,-999,-999,-999,-999,-999,-999,-999,-999,-999,-999,-999,-999
,2005-09-20T00:04:24Z,WQN026,-17.19,146.44,21.4,-999,-999,-999,-999,-999,-999,-999,-999,-999,-999,-999,-999
,2005-09-20T00:04:24Z,WQN026,-17.19,146.44,21.6,-999,-999,-999,-999,-999,-999,-999,-999,-999,-999,-999,-999
,2005-09-20T00:04:26Z,WQN026,-17.19,146.44,21.8,-999,-999,-999,-999,-999,-999,-999,-999,-999,-999,-999,-999
,2005-09-20T00:04:26Z,WQN026,-17.19,146.44,22,-999,-999,-999,-999,-999,-999,-999,-999,-999,-999,-999,-999
,2005-09-20T00:04:26Z,WQN026,-17.19,146.44,22.2,-999,-999,-999,-999,-999,-999,-999,-999,-999,-999,-999,-999
,2005-09-20T00:04:26Z,WQN026,-17.19,146.44,22.4,-999,-999,-999,-999,-999,-999,-999,-999,-999,-999,-999,-999
,2005-09-20T00:04:26Z,WQN026,-17.19,146.44,22.6,-999,-999,-999,-999,-999,-999,-999,-999,-999,-999,-999,-999
,2005-09-20T00:04:28Z,WQN026,-17.19,146.44,22.8,-999,-999,-999,-999,-999,-999,-999,-999,-999,-999,-999,-999
,2005-09-20T00:04:28Z,WQN026,-17.19,146.44,23,-999,-999,-999,-999,-999,-999,-999,-999,-999,-999,-999,-999
,2005-09-20T00:04:28Z,WQN026,-17.19,146.44,23.2,-999,-999,-999,-999,-999,-999,-999,-999,-999,-999,-999,-999
,2005-09-20T00:04:28Z,WQN026,-17.19,146.44,23.4,-999,-999,-999,-999,-999,-999,-999,-999,-999,-999,-999,-999
,2005-09-20T00:04:30Z,WQN026,-17.19,146.44,23.6,-999,-999,-999,-999,-999,-999,-999,-999,-999,-999,-999,-999
,2005-09-20T00:04:30Z,WQN026,-17.19,146.44,23.8,-999,-999,-999,-999,-999,-999,-999,-999,-999,-999,-999,-999
,2005-09-20T00:04:30Z,WQN026,-17.19,146.44,24,-999,-999,-999,-999,-999,-999,-999,-999,-999,-999,-999,-999
,2005-09-20T00:04:30Z,WQN026,-17.19,146.44,24.2,-999,-999,-999,-999,-999,-999,-999,-999,-999,-999,-999,-999
,2005-09-20T00:04:32Z,WQN026,-17.19,146.44,24.4,-999,-999,-999,-999,-999,-999,-999,-999,-999,-999,-999,-999
,2005-09-20T00:04:32Z,WQN026,-17.19,146.44,24.6,-999,-999,-999,-999,-999,-999,-999,-999,-999,-999,-999,-999
,2005-09-20T00:04:32Z,WQN026,-17.19,146.44,24.8,-999,-999,-999,-999,-999,-999,-999,-999,-999,-999,-999,-999
,2005-09-20T00:04:32Z,WQN026,-17.19,146.44,25,-999,-999,-999,-999,-999,-999,-999,-999,-999,-999,-999,-999
,2005-09-20T00:04:32Z,WQN026,-17.19,146.44,25.2,-999,-999,-999,-999,-999,-999,-999,-999,-999,-999,-999,-999
,2005-09-20T00:04:34Z,WQN026,-17.19,146.44,25.4,-999,-999,-999,-999,-999,-999,-999,-999,-999,-999,-999,-999
,2005-09-20T00:04:34Z,WQN026,-17.19,146.44,25.6,-999,-999,-999,-999,-999,-999,-999,-999,-999,-999,-999,-999
,2005-09-20T00:04:34Z,WQN026,-17.19,146.44,25.8,-999,-999,-999,-999,-999,-999,-999,-999,-999,-999,-999,-999
,2005-09-20T00:04:34Z,WQN026,-17.19,146.44,26,-999,-999,-999,-999,-999,-999,-999,-999,-999,-999,-999,-999
,2005-09-20T00:04:36Z,WQN026,-17.19,146.44,26.2,-999,-999,-999,-999,-999,-999,-999,-999,-999,-999,-999,-999
,2005-09-20T00:04:36Z,WQN026,-17.19,146.44,26.4,-999,-999,-999,-999,-999,-999,-999,-999,-999,-999,-999,-999
,2005-09-20T00:04:36Z,WQN026,-17.19,146.44,26.6,-999,-999,-999,-999,-999,-999,-999,-999,-999,-999,-999,-999
,2005-09-20T00:04:36Z,WQN026,-17.19,146.44,26.8,-999,-999,-999,-999,-999,-999,-999,-999,-999,-999,-999,-999
,2005-09-20T00:04:36Z,WQN026,-17.19,146.44,27,-999,-999,-999,-999,-999,-999,-999,-999,-999,-999,-999,-999
,2005-09-20T00:04:38Z,WQN026,-17.19,146.44,27.2,-999,-999,-999,-999,-999,-999,-999,-999,-999,-999,-999,-999
,2005-09-20T00:04:38Z,WQN026,-17.19,146.44,27.4,-999,-999,-999,-999,-999,-999,-999,-999,-999,-999,-999,-999
,2005-09-20T00:04:38Z,WQN026,-17.19,146.44,27.6,-999,-999,-999,-999,-999,-999,-999,-999,-999,-999,-999,-999
,2005-09-20T00:04:38Z,WQN026,-17.19,146.44,27.8,-999,-999,-999,-999,-999,-999,-999,-999,-999,-999,-999,-999
,2005-09-20T00:04:40Z,WQN026,-17.19,146.44,28,-999,-999,-999,-999,-999,-999,-999,-999,-999,-999,-999,-999
,2005-09-20T00:04:40Z,WQN026,-17.19,146.44,28.2,-999,-999,-999,-999,-999,-999,-999,-999,-999,-999,-999,-999
,2005-09-20T00:04:40Z,WQN026,-17.19,146.44,28.4,-999,-999,-999,-999,-999,-999,-999,-999,-999,-999,-999,-999
,2005-09-20T00:04:40Z,WQN026,-17.19,146.44,28.6,-999,-999,-999,-999,-999,-999,-999,-999,-999,-999,-999,-999
,2005-09-20T00:04:40Z,WQN026,-17.19,146.44,28.8,-999,-999,-999,-999,-999,-999,-999,-999,-999,-999,-999,-999
,2005-09-20T00:04:42Z,WQN026,-17.19,146.44,29,-999,-999,-999,-999,-999,-999,-999,-999,-999,-999,-999,-999
,2005-09-20T00:04:42Z,WQN026,-17.19,146.44,29.2,-999,-999,-999,-999,-999,-999,-999,-999,-999,-999,-999,-999
,2005-09-20T00:04:42Z,WQN026,-17.19,146.44,29.4,-999,-999,-999,-999,-999,-999,-999,-999,-999,-999,-999,-999
,2005-09-20T00:04:42Z,WQN026,-17.19,146.44,29.6,-999,-999,-999,-999,-999,-999,-999,-999,-999,-999,-999,-999
,2005-09-20T00:04:44Z,WQN026,-17.19,146.44,29.8,-999,-999,-999,-999,-999,-999,-999,-999,-999,-999,-999,-999
,2005-09-20T00:04:44Z,WQN026,-17.19,146.44,30,-999,-999,-999,-999,-999,-999,-999,-999,-999,-999,-999,-999
,2005-09-20T00:04:44Z,WQN026,-17.19,146.44,30.2,-999,-999,-999,-999,-999,-999,-999,-999,-999,-999,-999,-999
,2005-09-20T00:04:44Z,WQN026,-17.19,146.44,30.4,-999,-999,-999,-999,-999,-999,-999,-999,-999,-999,-999,-999
,2005-09-20T00:04:46Z,WQN026,-17.19,146.44,30.6,-999,-999,-999,-999,-999,-999,-999,-999,-999,-999,-999,-999
,2005-09-20T00:04:46Z,WQN026,-17.19,146.44,30.8,-999,-999,-999,-999,-999,-999,-999,-999,-999,-999,-999,-999
,2005-09-20T00:04:46Z,WQN026,-17.19,146.44,31,-999,-999,-999,-999,-999,-999,-999,-999,-999,-999,-999,-999
,2005-09-20T00:04:46Z,WQN026,-17.19,146.44,31.2,-999,-999,-999,-999,-999,-999,-999,-999,-999,-999,-999,-999
,2005-09-20T00:04:46Z,WQN026,-17.19,146.44,31.4,-999,-999,-999,-999,-999,-999,-999,-999,-999,-999,-999,-999
,2005-09-20T00:04:48Z,WQN026,-17.19,146.44,31.6,-999,-999,-999,-999,-999,-999,-999,-999,-999,-999,-999,-999
,2005-09-20T00:04:48Z,WQN026,-17.19,146.44,31.8,-999,-999,-999,-999,-999,-999,-999,-999,-999,-999,-999,-999
,2005-09-20T00:04:48Z,WQN026,-17.19,146.44,32,-999,-999,-999,-999,-999,-999,-999,-999,-999,-999,-999,-999
,2005-09-20T00:04:48Z,WQN026,-17.19,146.44,32.2,-999,-999,-999,-999,-999,-999,-999,-999,-999,-999,-999,-999
,2005-09-20T00:04:50Z,WQN026,-17.19,146.44,32.4,-999,-999,-999,-999,-999,-999,-999,-999,-999,-999,-999,-999
,2005-09-20T00:04:50Z,WQN026,-17.19,146.44,32.6,-999,-999,-999,-999,-999,-999,-999,-999,-999,-999,-999,-999
,2005-09-20T00:04:50Z,WQN026,-17.19,146.44,32.8,-999,-999,-999,-999,-999,-999,-999,-999,-999,-999,-999,-999
,2005-09-20T00:04:50Z,WQN026,-17.19,146.44,33,-999,-999,-999,-999,-999,-999,-999,-999,-999,-999,-999,-999
,2005-09-20T00:04:50Z,WQN026,-17.19,146.44,33.2,-999,-999,-999,-999,-999,-999,-999,-999,-999,-999,-999,-999
,2005-09-20T00:04:52Z,WQN026,-17.19,146.44,33.4,-999,-999,-999,-999,-999,-999,-999,-999,-999,-999,-999,-999
,2005-09-20T00:04:52Z,WQN026,-17.19,146.44,33.6,-999,-999,-999,-999,-999,-999,-999,-999,-999,-999,-999,-999
,2005-09-20T00:04:52Z,WQN026,-17.19,146.44,33.8,-999,-999,-999,-999,-999,-999,-999,-999,-999,-999,-999,-999
,2005-09-20T00:04:52Z,WQN026,-17.19,146.44,34,-999,-999,-999,-999,-999,-999,-999,-999,-999,-999,-999,-999
,2005-09-20T00:04:54Z,WQN026,-17.19,146.44,34.2,-999,-999,-999,-999,-999,-999,-999,-999,-999,-999,-999,-999
,2005-09-20T00:04:54Z,WQN026,-17.19,146.44,34.4,-999,-999,-999,-999,-999,-999,-999,-999,-999,-999,-999,-999
,2005-09-20T00:04:54Z,WQN026,-17.19,146.44,34.6,-999,-999,-999,-999,-999,-999,-999,-999,-999,-999,-999,-999
,2005-09-20T00:04:54Z,WQN026,-17.19,146.44,34.8,-999,-999,-999,-999,-999,-999,-999,-999,-999,-999,-999,-999
,2005-09-20T00:04:54Z,WQN026,-17.19,146.44,35,-999,-999,-999,-999,-999,-999,-999,-999,-999,-999,-999,-999
,2005-09-20T00:04:56Z,WQN026,-17.19,146.44,35.2,-999,-999,-999,-999,-999,-999,-999,-999,-999,-999,-999,-999
,2005-09-20T00:04:56Z,WQN026,-17.19,146.44,35.4,-999,-999,-999,-999,-999,-999,-999,-999,-999,-999,-999,-999
,2005-09-20T00:04:56Z,WQN026,-17.19,146.44,35.6,-999,-999,-999,-999,-999,-999,-999,-999,-999,-999,-999,-999
,2005-09-20T00:04:56Z,WQN026,-17.19,146.44,35.8,-999,-999,-999,-999,-999,-999,-999,-999,-999,-999,-999,-999
,2005-09-20T00:04:58Z,WQN026,-17.19,146.44,36,-999,-999,-999,-999,-999,-999,-999,-999,-999,-999,-999,-999
,2005-09-20T00:04:58Z,WQN026,-17.19,146.44,36.2,-999,-999,-999,-999,-999,-999,-999,-999,-999,-999,-999,-999
,2005-09-20T00:04:58Z,WQN026,-17.19,146.44,36.4,-999,-999,-999,-999,-999,-999,-999,-999,-999,-999,-999,-999
,2005-09-20T00:04:58Z,WQN026,-17.19,146.44,36.6,-999,-999,-999,-999,-999,-999,-999,-999,-999,-999,-999,-999
,2005-09-20T00:05:00Z,WQN026,-17.19,146.44,36.8,-999,-999,-999,-999,-999,-999,-999,-999,-999,-999,-999,-999
,2005-09-20T00:05:00Z,WQN026,-17.19,146.44,37,-999,-999,-999,-999,-999,-999,-999,-999,-999,-999,-999,-999
,2005-09-20T00:05:00Z,WQN026,-17.19,146.44,37.2,-999,-999,-999,-999,-999,-999,-999,-999,-999,-999,-999,-999
,2005-09-20T00:05:00Z,WQN026,-17.19,146.44,37.4,-999,-999,-999,-999,-999,-999,-999,-999,-999,-999,-999,-999
,2005-09-20T00:05:00Z,WQN026,-17.19,146.44,37.6,-999,-999,-999,-999,-999,-999,-999,-999,-999,-999,-999,-999
,2005-09-20T00:05:02Z,WQN026,-17.19,146.44,37.8,-999,-999,-999,-999,-999,-999,-999,-999,-999,-999,-999,-999
,2005-09-20T00:05:02Z,WQN026,-17.19,146.44,38,-999,-999,-999,-999,-999,-999,-999,-999,-999,-999,-999,-999
,2005-09-20T00:05:02Z,WQN026,-17.19,146.44,38.2,-999,-999,-999,-999,-999,-999,-999,-999,-999,-999,-999,-999
,2005-09-20T00:05:02Z,WQN026,-17.19,146.44,38.4,-999,-999,-999,-999,-999,-999,-999,-999,-999,-999,-999,-999
,2005-09-20T00:05:04Z,WQN026,-17.19,146.44,38.6,-999,-999,-999,-999,-999,-999,-999,-999,-999,-999,-999,-999
,2005-09-20T00:05:04Z,WQN026,-17.19,146.44,38.8,-999,-999,-999,-999,-999,-999,-999,-999,-999,-999,-999,-999
,2005-09-20T00:05:04Z,WQN026,-17.19,146.44,39,-999,-999,-999,-999,-999,-999,-999,-999,-999,-999,-999,-999
,2005-09-20T00:05:04Z,WQN026,-17.19,146.44,39.2,-999,-999,-999,-999,-999,-999,-999,-999,-999,-999,-999,-999
,2005-09-20T00:05:04Z,WQN026,-17.19,146.44,39.4,-999,-999,-999,-999,-999,-999,-999,-999,-999,-999,-999,-999
,2005-09-20T00:05:06Z,WQN026,-17.19,146.44,39.6,-999,-999,-999,-999,-999,-999,-999,-999,-999,-999,-999,-999
,2005-09-20T00:05:06Z,WQN026,-17.19,146.44,39.8,-999,-999,-999,-999,-999,-999,-999,-999,-999,-999,-999,-999
,2005-09-20T00:05:06Z,WQN026,-17.19,146.44,40,-999,-999,-999,-999,-999,-999,-999,-999,-999,-999,-999,-999
,2005-09-20T00:05:06Z,WQN026,-17.19,146.44,40.2,-999,-999,-999,-999,-999,-999,-999,-999,-999,-999,-999,-999
,2005-09-20T00:05:08Z,WQN026,-17.19,146.44,40.4,-999,-999,-999,-999,-999,-999,-999,-999,-999,-999,-999,-999
,2005-09-20T00:05:08Z,WQN026,-17.19,146.44,40.6,-999,-999,-999,-999,-999,-999,-999,-999,-999,-999,-999,-999
,2005-09-20T00:05:08Z,WQN026,-17.19,146.44,40.8,-999,-999,-999,-999,-999,-999,-999,-999,-999,-999,-999,-999
,2005-09-20T00:05:08Z,WQN026,-17.19,146.44,41,-999,-999,-999,-999,-999,-999,-999,-999,-999,-999,-999,-999
,2005-09-20T00:05:08Z,WQN026,-17.19,146.44,41.2,-999,-999,-999,-999,-999,-999,-999,-999,-999,-999,-999,-999
,2005-09-20T00:05:10Z,WQN026,-17.19,146.44,41.4,-999,-999,-999,-999,-999,-999,-999,-999,-999,-999,-999,-999
,2005-09-20T00:05:10Z,WQN026,-17.19,146.44,41.6,-999,-999,-999,-999,-999,-999,-999,-999,-999,-999,-999,-999
,2005-09-20T00:05:10Z,WQN026,-17.19,146.44,41.8,-999,-999,-999,-999,-999,-999,-999,-999,-999,-999,-999,-999
,2005-09-20T00:05:10Z,WQN026,-17.19,146.44,42,-999,-999,-999,-999,-999,-999,-999,-999,-999,-999,-999,-999
,2005-09-20T00:05:12Z,WQN026,-17.19,146.44,42.2,-999,-999,-999,-999,-999,-999,-999,-999,-999,-999,-999,-999
,2005-09-20T00:05:12Z,WQN026,-17.19,146.44,42.4,-999,-999,-999,-999,-999,-999,-999,-999,-999,-999,-999,-999
,2005-09-20T00:05:12Z,WQN026,-17.19,146.44,42.6,-999,-999,-999,-999,-999,-999,-999,-999,-999,-999,-999,-999
,2005-09-20T00:05:12Z,WQN026,-17.19,146.44,42.8,-999,-999,-999,-999,-999,-999,-999,-999,-999,-999,-999,-999
,2005-09-20T00:05:12Z,WQN026,-17.19,146.44,43,-999,-999,-999,-999,-999,-999,-999,-999,-999,-999,-999,-999
,2005-09-20T00:05:14Z,WQN026,-17.19,146.44,43.2,-999,-999,-999,-999,-999,-999,-999,-999,-999,-999,-999,-999
,2005-09-20T00:05:14Z,WQN026,-17.19,146.44,43.4,-999,-999,-999,-999,-999,-999,-999,-999,-999,-999,-999,-999
,2005-09-20T00:05:14Z,WQN026,-17.19,146.44,43.6,-999,-999,-999,-999,-999,-999,-999,-999,-999,-999,-999,-999
,2005-09-20T00:05:14Z,WQN026,-17.19,146.44,43.8,-999,-999,-999,-999,-999,-999,-999,-999,-999,-999,-999,-999
,2005-09-20T00:05:16Z,WQN026,-17.19,146.44,44,-999,-999,-999,-999,-999,-999,-999,-999,-999,-999,-999,-999
,2005-09-20T00:05:16Z,WQN026,-17.19,146.44,44.2,-999,-999,-999,-999,-999,-999,-999,-999,-999,-999,-999,-999
,2005-09-20T00:05:16Z,WQN026,-17.19,146.44,44.4,-999,-999,-999,-999,-999,-999,-999,-999,-999,-999,-999,-999
,2005-09-20T00:05:16Z,WQN026,-17.19,146.44,44.6,-999,-999,-999,-999,-999,-999,-999,-999,-999,-999,-999,-999
,2005-09-20T00:05:18Z,WQN026,-17.19,146.44,44.8,-999,-999,-999,-999,-999,-999,-999,-999,-999,-999,-999,-999
,2005-09-20T00:05:18Z,WQN026,-17.19,146.44,45,-999,-999,-999,-999,-999,-999,-999,-999,-999,-999,-999,-999
,2005-09-20T00:05:18Z,WQN026,-17.19,146.44,45.2,-999,-999,-999,-999,-999,-999,-999,-999,-999,-999,-999,-999
,2005-09-20T00:05:18Z,WQN026,-17.19,146.44,45.4,-999,-999,-999,-999,-999,-999,-999,-999,-999,-999,-999,-999
,2005-09-20T00:05:18Z,WQN026,-17.19,146.44,45.6,-999,-999,-999,-999,-999,-999,-999,-999,-999,-999,-999,-999
,2005-09-20T00:05:20Z,WQN026,-17.19,146.44,45.8,-999,-999,-999,-999,-999,-999,-999,-999,-999,-999,-999,-999
,2005-09-20T00:05:20Z,WQN026,-17.19,146.44,46,-999,-999,-999,-999,-999,-999,-999,-999,-999,-999,-999,-999
,2005-09-20T00:05:20Z,WQN026,-17.19,146.44,46.2,-999,-999,-999,-999,-999,-999,-999,-999,-999,-999,-999,-999
,2005-09-20T00:05:20Z,WQN026,-17.19,146.44,46.4,-999,-999,-999,-999,-999,-999,-999,-999,-999,-999,-999,-999
,2005-09-20T00:05:22Z,WQN026,-17.19,146.44,46.6,-999,-999,-999,-999,-999,-999,-999,-999,-999,-999,-999,-999
,2005-09-20T00:05:22Z,WQN026,-17.19,146.44,46.8,-999,-999,-999,-999,-999,-999,-999,-999,-999,-999,-999,-999
,2005-09-20T00:05:22Z,WQN026,-17.19,146.44,47,-999,-999,-999,-999,-999,-999,-999,-999,-999,-999,-999,-999
,2005-09-20T00:05:22Z,WQN026,-17.19,146.44,47.2,-999,-999,-999,-999,-999,-999,-999,-999,-999,-999,-999,-999
,2005-09-20T00:05:22Z,WQN026,-17.19,146.44,47.4,-999,-999,-999,-999,-999,-999,-999,-999,-999,-999,-999,-999
,2005-09-20T00:05:24Z,WQN026,-17.19,146.44,47.6,-999,-999,-999,-999,-999,-999,-999,-999,-999,-999,-999,-999
,2005-09-20T00:05:24Z,WQN026,-17.19,146.44,47.8,-999,-999,-999,-999,-999,-999,-999,-999,-999,-999,-999,-999
,2005-09-20T00:05:24Z,WQN026,-17.19,146.44,48,-999,-999,-999,-999,-999,-999,-999,-999,-999,-999,-999,-999
,2005-09-20T00:05:24Z,WQN026,-17.19,146.44,48.2,-999,-999,-999,-999,-999,-999,-999,-999,-999,-999,-999,-999
,2005-09-20T00:05:26Z,WQN026,-17.19,146.44,48.4,-999,-999,-999,-999,-999,-999,-999,-999,-999,-999,-999,-999
,2005-09-20T00:05:26Z,WQN026,-17.19,146.44,48.6,-999,-999,-999,-999,-999,-999,-999,-999,-999,-999,-999,-999
,2005-09-20T00:05:26Z,WQN026,-17.19,146.44,48.8,-999,-999,-999,-999,-999,-999,-999,-999,-999,-999,-999,-999
,2005-09-20T00:05:26Z,WQN026,-17.19,146.44,49,-999,-999,-999,-999,-999,-999,-999,-999,-999,-999,-999,-999
,2005-09-20T00:05:26Z,WQN026,-17.19,146.44,49.2,-999,-999,-999,-999,-999,-999,-999,-999,-999,-999,-999,-999
,2005-09-20T00:05:28Z,WQN026,-17.19,146.44,49.4,-999,-999,-999,-999,-999,-999,-999,-999,-999,-999,-999,-999
,2005-09-20T00:05:28Z,WQN026,-17.19,146.44,49.6,-999,-999,-999,-999,-999,-999,-999,-999,-999,-999,-999,-999
,2005-09-20T00:05:28Z,WQN026,-17.19,146.44,49.8,-999,-999,-999,-999,-999,-999,-999,-999,-999,-999,-999,-999
,2005-09-20T00:05:28Z,WQN026,-17.19,146.44,50,-999,-999,-999,-999,-999,-999,-999,-999,-999,-999,-999,-999
,2005-09-20T00:05:30Z,WQN026,-17.19,146.44,50.2,-999,-999,-999,-999,-999,-999,-999,-999,-999,-999,-999,-999
,2005-09-20T00:05:30Z,WQN026,-17.19,146.44,50.4,-999,-999,-999,-999,-999,-999,-999,-999,-999,-999,-999,-999
,2005-09-20T00:05:30Z,WQN026,-17.19,146.44,50.6,-999,-999,-999,-999,-999,-999,-999,-999,-999,-999,-999,-999
,2005-09-20T00:05:30Z,WQN026,-17.19,146.44,50.8,-999,-999,-999,-999,-999,-999,-999,-999,-999,-999,-999,-999
,2005-09-20T00:05:32Z,WQN026,-17.19,146.44,51,-999,-999,-999,-999,-999,-999,-999,-999,-999,-999,-999,-999
,2005-09-20T00:05:32Z,WQN026,-17.19,146.44,51.2,-999,-999,-999,-999,-999,-999,-999,-999,-999,-999,-999,-999
,2005-09-20T00:05:32Z,WQN026,-17.19,146.44,51.4,-999,-999,-999,-999,-999,-999,-999,-999,-999,-999,-999,-999
,2005-09-20T00:05:32Z,WQN026,-17.19,146.44,51.6,-999,-999,-999,-999,-999,-999,-999,-999,-999,-999,-999,-999
,2005-09-20T00:05:32Z,WQN026,-17.19,146.44,51.8,-999,-999,-999,-999,-999,-999,-999,-999,-999,-999,-999,-999
,2005-09-20T00:05:34Z,WQN026,-17.19,146.44,52,-999,-999,-999,-999,-999,-999,-999,-999,-999,-999,-999,-999
,2005-09-20T00:05:34Z,WQN026,-17.19,146.44,52.2,-999,-999,-999,-999,-999,-999,-999,-999,-999,-999,-999,-999
,2005-09-20T00:05:34Z,WQN026,-17.19,146.44,52.4,-999,-999,-999,-999,-999,-999,-999,-999,-999,-999,-999,-999
,2005-09-20T00:05:34Z,WQN026,-17.19,146.44,52.6,-999,-999,-999,-999,-999,-999,-999,-999,-999,-999,-999,-999
,2005-09-20T00:05:36Z,WQN026,-17.19,146.44,52.8,-999,-999,-999,-999,-999,-999,-999,-999,-999,-999,-999,-999
,2005-09-20T00:05:36Z,WQN026,-17.19,146.44,53,-999,-999,-999,-999,-999,-999,-999,-999,-999,-999,-999,-999
,2005-09-20T00:05:36Z,WQN026,-17.19,146.44,53.2,-999,-999,-999,-999,-999,-999,-999,-999,-999,-999,-999,-999
,2005-09-20T00:05:36Z,WQN026,-17.19,146.44,53.4,-999,-999,-999,-999,-999,-999,-999,-999,-999,-999,-999,-999
,2005-09-20T00:05:36Z,WQN026,-17.19,146.44,53.6,-999,-999,-999,-999,-999,-999,-999,-999,-999,-999,-999,-999
,2005-09-20T00:05:38Z,WQN026,-17.19,146.44,53.8,-999,-999,-999,-999,-999,-999,-999,-999,-999,-999,-999,-999
,2005-09-20T00:05:38Z,WQN026,-17.19,146.44,54,-999,-999,-999,-999,-999,-999,-999,-999,-999,-999,-999,-999
,2005-09-20T00:05:38Z,WQN026,-17.19,146.44,54.2,-999,-999,-999,-999,-999,-999,-999,-999,-999,-999,-999,-999
,2005-09-20T00:05:38Z,WQN026,-17.19,146.44,54.4,-999,-999,-999,-999,-999,-999,-999,-999,-999,-999,-999,-999
,2005-09-20T00:05:40Z,WQN026,-17.19,146.44,54.6,-999,-999,-999,-999,-999,-999,-999,-999,-999,-999,-999,-999
,2005-09-20T00:05:40Z,WQN026,-17.19,146.44,54.8,-999,-999,-999,-999,-999,-999,-999,-999,-999,-999,-999,-999
,2005-09-20T00:05:40Z,WQN026,-17.19,146.44,55,-999,-999,-999,-999,-999,-999,-999,-999,-999,-999,-999,-999
,2005-09-20T00:05:40Z,WQN026,-17.19,146.44,55.2,-999,-999,-999,-999,-999,-999,-999,-999,-999,-999,-999,-999
,2005-09-20T00:05:40Z,WQN026,-17.19,146.44,55.4,-999,-999,-999,-999,-999,-999,-999,-999,-999,-999,-999,-999
,2005-09-20T00:05:42Z,WQN026,-17.19,146.44,55.6,-999,-999,-999,-999,-999,-999,-999,-999,-999,-999,-999,-999
,2005-09-20T00:05:42Z,WQN026,-17.19,146.44,55.8,-999,-999,-999,-999,-999,-999,-999,-999,-999,-999,-999,-999
,2005-09-20T00:05:42Z,WQN026,-17.19,146.44,56,-999,-999,-999,-999,-999,-999,-999,-999,-999,-999,-999,-999
,2005-09-20T00:05:42Z,WQN026,-17.19,146.44,56.2,-999,-999,-999,-999,-999,-999,-999,-999,-999,-999,-999,-999
,2005-09-20T00:05:44Z,WQN026,-17.19,146.44,56.4,-999,-999,-999,-999,-999,-999,-999,-999,-999,-999,-999,-999
,2005-09-20T00:05:44Z,WQN026,-17.19,146.44,56.6,-999,-999,-999,-999,-999,-999,-999,-999,-999,-999,-999,-999
,2005-09-20T00:05:44Z,WQN026,-17.19,146.44,56.8,-999,-999,-999,-999,-999,-999,-999,-999,-999,-999,-999,-999
,2005-09-20T00:05:44Z,WQN026,-17.19,146.44,57,-999,-999,-999,-999,-999,-999,-999,-999,-999,-999,-999,-999
,2005-09-20T00:05:46Z,WQN026,-17.19,146.44,57.2,-999,-999,-999,-999,-999,-999,-999,-999,-999,-999,-999,-999
,2005-09-20T00:05:46Z,WQN026,-17.19,146.44,57.4,-999,-999,-999,-999,-999,-999,-999,-999,-999,-999,-999,-999
,2005-09-20T00:05:46Z,WQN026,-17.19,146.44,57.6,-999,-999,-999,-999,-999,-999,-999,-999,-999,-999,-999,-999
,2005-09-20T00:05:46Z,WQN026,-17.19,146.44,57.8,-999,-999,-999,-999,-999,-999,-999,-999,-999,-999,-999,-999
,2005-09-20T00:05:46Z,WQN026,-17.19,146.44,58,-999,-999,-999,-999,-999,-999,-999,-999,-999,-999,-999,-999
,2005-09-20T00:05:48Z,WQN026,-17.19,146.44,58.2,-999,-999,-999,-999,-999,-999,-999,-999,-999,-999,-999,-999
,2005-09-20T00:05:48Z,WQN026,-17.19,146.44,58.4,-999,-999,-999,-999,-999,-999,-999,-999,-999,-999,-999,-999
,2005-09-20T00:05:48Z,WQN026,-17.19,146.44,58.6,-999,-999,-999,-999,-999,-999,-999,-999,-999,-999,-999,-999
,2005-09-20T00:05:48Z,WQN026,-17.19,146.44,58.8,-999,-999,-999,-999,-999,-999,-999,-999,-999,-999,-999,-999
,2005-09-20T00:05:50Z,WQN026,-17.19,146.44,59,-999,-999,-999,-999,-999,-999,-999,-999,-999,-999,-999,-999
,2005-09-20T00:05:50Z,WQN026,-17.19,146.44,59.2,-999,-999,-999,-999,-999,-999,-999,-999,-999,-999,-999,-999
,2005-09-20T00:05:50Z,WQN026,-17.19,146.44,59.4,-999,-999,-999,-999,-999,-999,-999,-999,-999,-999,-999,-999
,2005-09-20T00:05:50Z,WQN026,-17.19,146.44,59.6,-999,-999,-999,-999,-999,-999,-999,-999,-999,-999,-999,-999
,2005-09-20T00:05:50Z,WQN026,-17.19,146.44,59.8,-999,-999,-999,-999,-999,-999,-999,-999,-999,-999,-999,-999
,2005-09-20T00:05:52Z,WQN026,-17.19,146.44,60,-999,-999,-999,-999,-999,-999,-999,-999,-999,-999,-999,-999
,2005-09-20T00:05:52Z,WQN026,-17.19,146.44,60.2,-999,-999,-999,-999,-999,-999,-999,-999,-999,-999,-999,-999
,2005-09-20T00:05:52Z,WQN026,-17.19,146.44,60.4,-999,-999,-999,-999,-999,-999,-999,-999,-999,-999,-999,-999
,2005-09-20T00:05:52Z,WQN026,-17.19,146.44,60.6,-999,-999,-999,-999,-999,-999,-999,-999,-999,-999,-999,-999
,2005-09-20T00:05:54Z,WQN026,-17.19,146.44,60.8,-999,-999,-999,-999,-999,-999,-999,-999,-999,-999,-999,-999
,2005-09-20T00:05:54Z,WQN026,-17.19,146.44,61,-999,-999,-999,-999,-999,-999,-999,-999,-999,-999,-999,-999
,2005-09-20T00:05:54Z,WQN026,-17.19,146.44,61.2,-999,-999,-999,-999,-999,-999,-999,-999,-999,-999,-999,-999
,2005-09-20T00:05:54Z,WQN026,-17.19,146.44,61.4,-999,-999,-999,-999,-999,-999,-999,-999,-999,-999,-999,-999
,2005-09-20T00:05:54Z,WQN026,-17.19,146.44,61.6,-999,-999,-999,-999,-999,-999,-999,-999,-999,-999,-999,-999
,2005-09-20T00:05:56Z,WQN026,-17.19,146.44,61.8,-999,-999,-999,-999,-999,-999,-999,-999,-999,-999,-999,-999
,2005-09-20T00:05:56Z,WQN026,-17.19,146.44,62,-999,-999,-999,-999,-999,-999,-999,-999,-999,-999,-999,-999
,2005-09-20T00:05:56Z,WQN026,-17.19,146.44,62.2,-999,-999,-999,-999,-999,-999,-999,-999,-999,-999,-999,-999
,2005-09-20T00:05:56Z,WQN026,-17.19,146.44,62.4,-999,-999,-999,-999,-999,-999,-999,-999,-999,-999,-999,-999
,2005-09-20T00:05:58Z,WQN026,-17.19,146.44,62.6,-999,-999,-999,-999,-999,-999,-999,-999,-999,-999,-999,-999
,2005-09-20T00:05:58Z,WQN026,-17.19,146.44,62.8,-999,-999,-999,-999,-999,-999,-999,-999,-999,-999,-999,-999
,2005-09-20T00:05:58Z,WQN026,-17.19,146.44,63,-999,-999,-999,-999,-999,-999,-999,-999,-999,-999,-999,-999
,2005-09-20T00:05:58Z,WQN026,-17.19,146.44,63.2,-999,-999,-999,-999,-999,-999,-999,-999,-999,-999,-999,-999
,2005-09-20T00:05:58Z,WQN026,-17.19,146.44,63.4,-999,-999,-999,-999,-999,-999,-999,-999,-999,-999,-999,-999
,2005-09-20T00:06:00Z,WQN026,-17.19,146.44,63.6,-999,-999,-999,-999,-999,-999,-999,-999,-999,-999,-999,-999
,2005-09-20T00:06:00Z,WQN026,-17.19,146.44,63.8,-999,-999,-999,-999,-999,-999,-999,-999,-999,-999,-999,-999
,2005-09-20T00:06:00Z,WQN026,-17.19,146.44,64,-999,-999,-999,-999,-999,-999,-999,-999,-999,-999,-999,-999
,2005-09-20T00:06:00Z,WQN026,-17.19,146.44,64.2,-999,-999,-999,-999,-999,-999,-999,-999,-999,-999,-999,-999
,2005-09-20T00:06:02Z,WQN026,-17.19,146.44,64.4,-999,-999,-999,-999,-999,-999,-999,-999,-999,-999,-999,-999
,2005-09-20T00:06:02Z,WQN026,-17.19,146.44,64.6,-999,-999,-999,-999,-999,-999,-999,-999,-999,-999,-999,-999
,2005-09-20T00:06:02Z,WQN026,-17.19,146.44,64.8,-999,-999,-999,-999,-999,-999,-999,-999,-999,-999,-999,-999
,2005-09-20T00:06:02Z,WQN026,-17.19,146.44,65,-999,-999,-999,-999,-999,-999,-999,-999,-999,-999,-999,-999
,2005-09-20T00:06:04Z,WQN026,-17.19,146.44,65.2,-999,-999,-999,-999,-999,-999,-999,-999,-999,-999,-999,-999
,2005-09-20T00:06:04Z,WQN026,-17.19,146.44,65.4,-999,-999,-999,-999,-999,-999,-999,-999,-999,-999,-999,-999
,2005-09-20T00:06:04Z,WQN026,-17.19,146.44,65.6,-999,-999,-999,-999,-999,-999,-999,-999,-999,-999,-999,-999
,2005-09-20T00:06:04Z,WQN026,-17.19,146.44,65.8,-999,-999,-999,-999,-999,-999,-999,-999,-999,-999,-999,-999
,2005-09-20T00:06:04Z,WQN026,-17.19,146.44,66,-999,-999,-999,-999,-999,-999,-999,-999,-999,-999,-999,-999
,2005-09-20T00:06:06Z,WQN026,-17.19,146.44,66.2,-999,-999,-999,-999,-999,-999,-999,-999,-999,-999,-999,-999
,2005-09-20T00:06:06Z,WQN026,-17.19,146.44,66.4,-999,-999,-999,-999,-999,-999,-999,-999,-999,-999,-999,-999
,2005-09-20T00:06:06Z,WQN026,-17.19,146.44,66.6,-999,-999,-999,-999,-999,-999,-999,-999,-999,-999,-999,-999
,2005-09-20T00:06:06Z,WQN026,-17.19,146.44,66.8,-999,-999,-999,-999,-999,-999,-999,-999,-999,-999,-999,-999
,2005-09-20T00:06:08Z,WQN026,-17.19,146.44,67,-999,-999,-999,-999,-999,-999,-999,-999,-999,-999,-999,-999
,2005-09-20T00:06:08Z,WQN026,-17.19,146.44,67.2,-999,-999,-999,-999,-999,-999,-999,-999,-999,-999,-999,-999
,2005-09-20T00:06:08Z,WQN026,-17.19,146.44,67.4,-999,-999,-999,-999,-999,-999,-999,-999,-999,-999,-999,-999
,2005-09-20T00:06:08Z,WQN026,-17.19,146.44,67.6,-999,-999,-999,-999,-999,-999,-999,-999,-999,-999,-999,-999
,2005-09-20T00:06:08Z,WQN026,-17.19,146.44,67.8,-999,-999,-999,-999,-999,-999,-999,-999,-999,-999,-999,-999
,2005-09-20T00:06:10Z,WQN026,-17.19,146.44,68,-999,-999,-999,-999,-999,-999,-999,-999,-999,-999,-999,-999
,2005-09-20T00:06:10Z,WQN026,-17.19,146.44,68.2,-999,-999,-999,-999,-999,-999,-999,-999,-999,-999,-999,-999
,2005-09-20T00:06:10Z,WQN026,-17.19,146.44,68.4,-999,-999,-999,-999,-999,-999,-999,-999,-999,-999,-999,-999
,2005-09-20T00:06:10Z,WQN026,-17.19,146.44,68.6,-999,-999,-999,-999,-999,-999,-999,-999,-999,-999,-999,-999
,2005-09-20T00:06:12Z,WQN026,-17.19,146.44,68.8,-999,-999,-999,-999,-999,-999,-999,-999,-999,-999,-999,-999
,2005-09-20T00:06:12Z,WQN026,-17.19,146.44,69,-999,-999,-999,-999,-999,-999,-999,-999,-999,-999,-999,-999
,2005-09-20T00:06:12Z,WQN026,-17.19,146.44,69.2,-999,-999,-999,-999,-999,-999,-999,-999,-999,-999,-999,-999
,2005-09-20T00:06:12Z,WQN026,-17.19,146.44,69.4,-999,-999,-999,-999,-999,-999,-999,-999,-999,-999,-999,-999
,2005-09-20T00:06:12Z,WQN026,-17.19,146.44,69.6,-999,-999,-999,-999,-999,-999,-999,-999,-999,-999,-999,-999
,2005-09-20T00:06:14Z,WQN026,-17.19,146.44,69.8,-999,-999,-999,-999,-999,-999,-999,-999,-999,-999,-999,-999
,2005-09-20T00:06:14Z,WQN026,-17.19,146.44,70,-999,-999,-999,-999,-999,-999,-999,-999,-999,-999,-999,-999
,2005-09-20T00:06:14Z,WQN026,-17.19,146.44,70.2,-999,-999,-999,-999,-999,-999,-999,-999,-999,-999,-999,-999
,2005-09-20T00:06:14Z,WQN026,-17.19,146.44,70.4,-999,-999,-999,-999,-999,-999,-999,-999,-999,-999,-999,-999
,2005-09-20T00:06:16Z,WQN026,-17.19,146.44,70.6,-999,-999,-999,-999,-999,-999,-999,-999,-999,-999,-999,-999
,2005-09-20T00:06:16Z,WQN026,-17.19,146.44,70.8,-999,-999,-999,-999,-999,-999,-999,-999,-999,-999,-999,-999
,2005-09-20T00:06:16Z,WQN026,-17.19,146.44,71,-999,-999,-999,-999,-999,-999,-999,-999,-999,-999,-999,-999
,2005-09-20T00:06:16Z,WQN026,-17.19,146.44,71.2,-999,-999,-999,-999,-999,-999,-999,-999,-999,-999,-999,-999
,2005-09-20T00:06:18Z,WQN026,-17.19,146.44,71.4,-999,-999,-999,-999,-999,-999,-999,-999,-999,-999,-999,-999
,2005-09-20T00:06:18Z,WQN026,-17.19,146.44,71.6,-999,-999,-999,-999,-999,-999,-999,-999,-999,-999,-999,-999
,2005-09-20T00:06:18Z,WQN026,-17.19,146.44,71.8,-999,-999,-999,-999,-999,-999,-999,-999,-999,-999,-999,-999
,2005-09-20T00:06:18Z,WQN026,-17.19,146.44,72,-999,-999,-999,-999,-999,-999,-999,-999,-999,-999,-999,-999
,2005-09-20T00:06:18Z,WQN026,-17.19,146.44,72.2,-999,-999,-999,-999,-999,-999,-999,-999,-999,-999,-999,-999
,2005-09-20T00:06:20Z,WQN026,-17.19,146.44,72.4,-999,-999,-999,-999,-999,-999,-999,-999,-999,-999,-999,-999
,2005-09-20T00:06:20Z,WQN026,-17.19,146.44,72.6,-999,-999,-999,-999,-999,-999,-999,-999,-999,-999,-999,-999
,2005-09-20T00:06:20Z,WQN026,-17.19,146.44,72.8,-999,-999,-999,-999,-999,-999,-999,-999,-999,-999,-999,-999
,2005-09-20T00:06:20Z,WQN026,-17.19,146.44,73,-999,-999,-999,-999,-999,-999,-999,-999,-999,-999,-999,-999
,2005-09-20T00:06:22Z,WQN026,-17.19,146.44,73.2,-999,-999,-999,-999,-999,-999,-999,-999,-999,-999,-999,-999
,2005-09-20T00:06:22Z,WQN026,-17.19,146.44,73.4,-999,-999,-999,-999,-999,-999,-999,-999,-999,-999,-999,-999
,2005-09-20T00:06:22Z,WQN026,-17.19,146.44,73.6,-999,-999,-999,-999,-999,-999,-999,-999,-999,-999,-999,-999
,2005-09-20T00:06:22Z,WQN026,-17.19,146.44,73.8,-999,-999,-999,-999,-999,-999,-999,-999,-999,-999,-999,-999
,2005-09-20T00:06:22Z,WQN026,-17.19,146.44,74,-999,-999,-999,-999,-999,-999,-999,-999,-999,-999,-999,-999
,2005-09-20T00:06:24Z,WQN026,-17.19,146.44,74.2,-999,-999,-999,-999,-999,-999,-999,-999,-999,-999,-999,-999
,2005-09-20T00:06:24Z,WQN026,-17.19,146.44,74.4,-999,-999,-999,-999,-999,-999,-999,-999,-999,-999,-999,-999
,2005-09-20T00:06:24Z,WQN026,-17.19,146.44,74.6,-999,-999,-999,-999,-999,-999,-999,-999,-999,-999,-999,-999
,2005-09-20T00:06:24Z,WQN026,-17.19,146.44,74.8,-999,-999,-999,-999,-999,-999,-999,-999,-999,-999,-999,-999
,2005-09-20T00:06:26Z,WQN026,-17.19,146.44,75,-999,-999,-999,-999,-999,-999,-999,-999,-999,-999,-999,-999
,2005-09-20T00:06:26Z,WQN026,-17.19,146.44,75.2,-999,-999,-999,-999,-999,-999,-999,-999,-999,-999,-999,-999
,2005-09-20T00:06:26Z,WQN026,-17.19,146.44,75.4,-999,-999,-999,-999,-999,-999,-999,-999,-999,-999,-999,-999
,2005-09-20T00:06:26Z,WQN026,-17.19,146.44,75.6,-999,-999,-999,-999,-999,-999,-999,-999,-999,-999,-999,-999
,2005-09-20T00:06:26Z,WQN026,-17.19,146.44,75.8,-999,-999,-999,-999,-999,-999,-999,-999,-999,-999,-999,-999
,2005-09-20T00:06:28Z,WQN026,-17.19,146.44,76,-999,-999,-999,-999,-999,-999,-999,-999,-999,-999,-999,-999
,2005-09-20T00:06:28Z,WQN026,-17.19,146.44,76.2,-999,-999,-999,-999,-999,-999,-999,-999,-999,-999,-999,-999
,2005-09-20T00:06:28Z,WQN026,-17.19,146.44,76.4,-999,-999,-999,-999,-999,-999,-999,-999,-999,-999,-999,-999
,2005-09-20T00:06:28Z,WQN026,-17.19,146.44,76.6,-999,-999,-999,-999,-999,-999,-999,-999,-999,-999,-999,-999
,2005-09-20T00:06:30Z,WQN026,-17.19,146.44,76.8,-999,-999,-999,-999,-999,-999,-999,-999,-999,-999,-999,-999
,2005-09-20T00:06:30Z,WQN026,-17.19,146.44,77,-999,-999,-999,-999,-999,-999,-999,-999,-999,-999,-999,-999
,2005-09-20T00:06:30Z,WQN026,-17.19,146.44,77.2,-999,-999,-999,-999,-999,-999,-999,-999,-999,-999,-999,-999
,2005-09-20T00:06:30Z,WQN026,-17.19,146.44,77.4,-999,-999,-999,-999,-999,-999,-999,-999,-999,-999,-999,-999
,2005-09-20T00:06:32Z,WQN026,-17.19,146.44,77.6,-999,-999,-999,-999,-999,-999,-999,-999,-999,-999,-999,-999
,2005-09-20T00:06:32Z,WQN026,-17.19,146.44,77.8,-999,-999,-999,-999,-999,-999,-999,-999,-999,-999,-999,-999
,2005-09-20T00:06:32Z,WQN026,-17.19,146.44,78,-999,-999,-999,-999,-999,-999,-999,-999,-999,-999,-999,-999
,2005-09-20T00:06:32Z,WQN026,-17.19,146.44,78.2,-999,-999,-999,-999,-999,-999,-999,-999,-999,-999,-999,-999
,2005-09-20T00:06:32Z,WQN026,-17.19,146.44,78.4,-999,-999,-999,-999,-999,-999,-999,-999,-999,-999,-999,-999
,2005-09-20T00:06:34Z,WQN026,-17.19,146.44,78.6,-999,-999,-999,-999,-999,-999,-999,-999,-999,-999,-999,-999
,2005-09-20T00:06:34Z,WQN026,-17.19,146.44,78.8,-999,-999,-999,-999,-999,-999,-999,-999,-999,-999,-999,-999
,2005-09-20T00:06:34Z,WQN026,-17.19,146.44,79,-999,-999,-999,-999,-999,-999,-999,-999,-999,-999,-999,-999
,2005-09-20T00:06:34Z,WQN026,-17.19,146.44,79.2,-999,-999,-999,-999,-999,-999,-999,-999,-999,-999,-999,-999
,2005-09-20T00:06:36Z,WQN026,-17.19,146.44,79.4,-999,-999,-999,-999,-999,-999,-999,-999,-999,-999,-999,-999
,2005-09-20T00:06:36Z,WQN026,-17.19,146.44,79.6,-999,-999,-999,-999,-999,-999,-999,-999,-999,-999,-999,-999
,2005-09-20T00:06:36Z,WQN026,-17.19,146.44,79.8,-999,-999,-999,-999,-999,-999,-999,-999,-999,-999,-999,-999
,2005-09-20T00:06:36Z,WQN026,-17.19,146.44,80,-999,-999,-999,-999,-999,-999,-999,-999,-999,-999,-999,-999
,2005-09-20T00:06:36Z,WQN026,-17.19,146.44,80.2,-999,-999,-999,-999,-999,-999,-999,-999,-999,-999,-999,-999
,2005-09-20T00:06:38Z,WQN026,-17.19,146.44,80.4,-999,-999,-999,-999,-999,-999,-999,-999,-999,-999,-999,-999
,2005-09-20T00:06:38Z,WQN026,-17.19,146.44,80.6,-999,-999,-999,-999,-999,-999,-999,-999,-999,-999,-999,-999
,2005-09-20T00:06:38Z,WQN026,-17.19,146.44,80.8,-999,-999,-999,-999,-999,-999,-999,-999,-999,-999,-999,-999
,2005-09-20T00:06:38Z,WQN026,-17.19,146.44,81,-999,-999,-999,-999,-999,-999,-999,-999,-999,-999,-999,-999
,2005-09-20T00:06:40Z,WQN026,-17.19,146.44,81.2,-999,-999,-999,-999,-999,-999,-999,-999,-999,-999,-999,-999
,2005-09-20T00:06:40Z,WQN026,-17.19,146.44,81.4,-999,-999,-999,-999,-999,-999,-999,-999,-999,-999,-999,-999
,2005-09-20T00:06:40Z,WQN026,-17.19,146.44,81.6,-999,-999,-999,-999,-999,-999,-999,-999,-999,-999,-999,-999
,2005-09-20T00:06:40Z,WQN026,-17.19,146.44,81.8,-999,-999,-999,-999,-999,-999,-999,-999,-999,-999,-999,-999
,2005-09-20T00:06:40Z,WQN026,-17.19,146.44,82,-999,-999,-999,-999,-999,-999,-999,-999,-999,-999,-999,-999
,2005-09-20T00:06:42Z,WQN026,-17.19,146.44,82.2,-999,-999,-999,-999,-999,-999,-999,-999,-999,-999,-999,-999
,2005-09-20T00:06:42Z,WQN026,-17.19,146.44,82.4,-999,-999,-999,-999,-999,-999,-999,-999,-999,-999,-999,-999
,2005-09-20T00:06:42Z,WQN026,-17.19,146.44,82.6,-999,-999,-999,-999,-999,-999,-999,-999,-999,-999,-999,-999
,2005-09-20T00:06:42Z,WQN026,-17.19,146.44,82.8,-999,-999,-999,-999,-999,-999,-999,-999,-999,-999,-999,-999
,2005-09-20T00:06:44Z,WQN026,-17.19,146.44,83,-999,-999,-999,-999,-999,-999,-999,-999,-999,-999,-999,-999
,2005-09-20T00:06:44Z,WQN026,-17.19,146.44,83.2,-999,-999,-999,-999,-999,-999,-999,-999,-999,-999,-999,-999
,2005-09-20T00:06:44Z,WQN026,-17.19,146.44,83.4,-999,-999,-999,-999,-999,-999,-999,-999,-999,-999,-999,-999
,2005-09-20T00:06:44Z,WQN026,-17.19,146.44,83.6,-999,-999,-999,-999,-999,-999,-999,-999,-999,-999,-999,-999
,2005-09-20T00:06:46Z,WQN026,-17.19,146.44,83.8,-999,-999,-999,-999,-999,-999,-999,-999,-999,-999,-999,-999
,2005-09-20T00:06:46Z,WQN026,-17.19,146.44,84,-999,-999,-999,-999,-999,-999,-999,-999,-999,-999,-999,-999
,2005-09-20T00:06:46Z,WQN026,-17.19,146.44,84.2,-999,-999,-999,-999,-999,-999,-999,-999,-999,-999,-999,-999
,2005-09-20T00:06:46Z,WQN026,-17.19,146.44,84.4,-999,-999,-999,-999,-999,-999,-999,-999,-999,-999,-999,-999
,2005-09-20T00:06:46Z,WQN026,-17.19,146.44,84.6,-999,-999,-999,-999,-999,-999,-999,-999,-999,-999,-999,-999
,2005-09-20T00:06:48Z,WQN026,-17.19,146.44,84.8,-999,-999,-999,-999,-999,-999,-999,-999,-999,-999,-999,-999
,2005-09-20T00:06:48Z,WQN026,-17.19,146.44,85,-999,-999,-999,-999,-999,-999,-999,-999,-999,-999,-999,-999
,2005-09-20T00:06:48Z,WQN026,-17.19,146.44,85.2,-999,-999,-999,-999,-999,-999,-999,-999,-999,-999,-999,-999
,2005-09-20T00:06:48Z,WQN026,-17.19,146.44,85.4,-999,-999,-999,-999,-999,-999,-999,-999,-999,-999,-999,-999
,2005-09-20T00:06:50Z,WQN026,-17.19,146.44,85.6,-999,-999,-999,-999,-999,-999,-999,-999,-999,-999,-999,-999
,2005-09-20T00:06:50Z,WQN026,-17.19,146.44,85.8,-999,-999,-999,-999,-999,-999,-999,-999,-999,-999,-999,-999
,2005-09-20T00:06:50Z,WQN026,-17.19,146.44,86,-999,-999,-999,-999,-999,-999,-999,-999,-999,-999,-999,-999
,2005-09-20T00:06:50Z,WQN026,-17.19,146.44,86.2,-999,-999,-999,-999,-999,-999,-999,-999,-999,-999,-999,-999
,2005-09-20T00:06:50Z,WQN026,-17.19,146.44,86.4,-999,-999,-999,-999,-999,-999,-999,-999,-999,-999,-999,-999
,2005-09-20T00:06:52Z,WQN026,-17.19,146.44,86.6,-999,-999,-999,-999,-999,-999,-999,-999,-999,-999,-999,-999
,2005-09-20T00:06:52Z,WQN026,-17.19,146.44,86.8,-999,-999,-999,-999,-999,-999,-999,-999,-999,-999,-999,-999
,2005-09-20T00:06:52Z,WQN026,-17.19,146.44,87,-999,-999,-999,-999,-999,-999,-999,-999,-999,-999,-999,-999
,2005-09-20T00:06:52Z,WQN026,-17.19,146.44,87.2,-999,-999,-999,-999,-999,-999,-999,-999,-999,-999,-999,-999
,2005-09-20T00:06:54Z,WQN026,-17.19,146.44,87.4,-999,-999,-999,-999,-999,-999,-999,-999,-999,-999,-999,-999
,2005-09-20T00:06:54Z,WQN026,-17.19,146.44,87.6,-999,-999,-999,-999,-999,-999,-999,-999,-999,-999,-999,-999
,2005-09-20T00:06:54Z,WQN026,-17.19,146.44,87.8,-999,-999,-999,-999,-999,-999,-999,-999,-999,-999,-999,-999
,2005-09-20T00:06:54Z,WQN026,-17.19,146.44,88,-999,-999,-999,-999,-999,-999,-999,-999,-999,-999,-999,-999
,2005-09-20T00:06:54Z,WQN026,-17.19,146.44,88.2,-999,-999,-999,-999,-999,-999,-999,-999,-999,-999,-999,-999
,2005-09-20T00:06:56Z,WQN026,-17.19,146.44,88.4,-999,-999,-999,-999,-999,-999,-999,-999,-999,-999,-999,-999
,2005-09-20T00:06:56Z,WQN026,-17.19,146.44,88.6,-999,-999,-999,-999,-999,-999,-999,-999,-999,-999,-999,-999
,2005-09-20T00:06:56Z,WQN026,-17.19,146.44,88.8,-999,-999,-999,-999,-999,-999,-999,-999,-999,-999,-999,-999
,2005-09-20T00:06:56Z,WQN026,-17.19,146.44,89,-999,-999,-999,-999,-999,-999,-999,-999,-999,-999,-999,-999
,2005-09-20T00:06:58Z,WQN026,-17.19,146.44,89.2,-999,-999,-999,-999,-999,-999,-999,-999,-999,-999,-999,-999
,2005-09-20T00:06:58Z,WQN026,-17.19,146.44,89.4,-999,-999,-999,-999,-999,-999,-999,-999,-999,-999,-999,-999
,2005-09-20T00:06:58Z,WQN026,-17.19,146.44,89.6,-999,-999,-999,-999,-999,-999,-999,-999,-999,-999,-999,-999
,2005-09-20T00:06:58Z,WQN026,-17.19,146.44,89.8,-999,-999,-999,-999,-999,-999,-999,-999,-999,-999,-999,-999
,2005-09-20T00:06:58Z,WQN026,-17.19,146.44,90,-999,-999,-999,-999,-999,-999,-999,-999,-999,-999,-999,-999
,2005-09-20T00:07:00Z,WQN026,-17.19,146.44,90.2,-999,-999,-999,-999,-999,-999,-999,-999,-999,-999,-999,-999
,2005-09-20T00:07:00Z,WQN026,-17.19,146.44,90.4,-999,-999,-999,-999,-999,-999,-999,-999,-999,-999,-999,-999
,2005-09-20T00:07:00Z,WQN026,-17.19,146.44,90.6,-999,-999,-999,-999,-999,-999,-999,-999,-999,-999,-999,-999
,2005-09-20T00:07:00Z,WQN026,-17.19,146.44,90.8,-999,-999,-999,-999,-999,-999,-999,-999,-999,-999,-999,-999
,2005-09-20T00:07:02Z,WQN026,-17.19,146.44,91,-999,-999,-999,-999,-999,-999,-999,-999,-999,-999,-999,-999
,2005-09-20T00:07:02Z,WQN026,-17.19,146.44,91.2,-999,-999,-999,-999,-999,-999,-999,-999,-999,-999,-999,-999
,2005-09-20T00:07:02Z,WQN026,-17.19,146.44,91.4,-999,-999,-999,-999,-999,-999,-999,-999,-999,-999,-999,-999
,2005-09-20T00:07:02Z,WQN026,-17.19,146.44,91.6,-999,-999,-999,-999,-999,-999,-999,-999,-999,-999,-999,-999
,2005-09-20T00:07:04Z,WQN026,-17.19,146.44,91.8,-999,-999,-999,-999,-999,-999,-999,-999,-999,-999,-999,-999
,2005-09-20T00:07:04Z,WQN026,-17.19,146.44,92,-999,-999,-999,-999,-999,-999,-999,-999,-999,-999,-999,-999
,2005-09-20T00:07:04Z,WQN026,-17.19,146.44,92.2,-999,-999,-999,-999,-999,-999,-999,-999,-999,-999,-999,-999
,2005-09-20T00:07:04Z,WQN026,-17.19,146.44,92.4,-999,-999,-999,-999,-999,-999,-999,-999,-999,-999,-999,-999
,2005-09-20T00:07:04Z,WQN026,-17.19,146.44,92.6,-999,-999,-999,-999,-999,-999,-999,-999,-999,-999,-999,-999
,2005-09-20T00:07:06Z,WQN026,-17.19,146.44,92.8,-999,-999,-999,-999,-999,-999,-999,-999,-999,-999,-999,-999
,2005-09-20T00:07:06Z,WQN026,-17.19,146.44,93,-999,-999,-999,-999,-999,-999,-999,-999,-999,-999,-999,-999
,2005-09-20T00:07:06Z,WQN026,-17.19,146.44,93.2,-999,-999,-999,-999,-999,-999,-999,-999,-999,-999,-999,-999
,2005-09-20T00:07:06Z,WQN026,-17.19,146.44,93.4,-999,-999,-999,-999,-999,-999,-999,-999,-999,-999,-999,-999
,2005-09-20T00:07:08Z,WQN026,-17.19,146.44,93.6,-999,-999,-999,-999,-999,-999,-999,-999,-999,-999,-999,-999
,2005-09-20T00:07:08Z,WQN026,-17.19,146.44,93.8,-999,-999,-999,-999,-999,-999,-999,-999,-999,-999,-999,-999
,2005-09-20T00:07:08Z,WQN026,-17.19,146.44,94,-999,-999,-999,-999,-999,-999,-999,-999,-999,-999,-999,-999
,2005-09-20T00:07:08Z,WQN026,-17.19,146.44,94.2,-999,-999,-999,-999,-999,-999,-999,-999,-999,-999,-999,-999
,2005-09-20T00:07:08Z,WQN026,-17.19,146.44,94.4,-999,-999,-999,-999,-999,-999,-999,-999,-999,-999,-999,-999
,2005-09-20T00:07:10Z,WQN026,-17.19,146.44,94.6,-999,-999,-999,-999,-999,-999,-999,-999,-999,-999,-999,-999
,2005-09-20T00:07:10Z,WQN026,-17.19,146.44,94.8,-999,-999,-999,-999,-999,-999,-999,-999,-999,-999,-999,-999
,2005-09-20T00:07:10Z,WQN026,-17.19,146.44,95,-999,-999,-999,-999,-999,-999,-999,-999,-999,-999,-999,-999
,2005-09-20T00:07:10Z,WQN026,-17.19,146.44,95.2,-999,-999,-999,-999,-999,-999,-999,-999,-999,-999,-999,-999
,2005-09-20T00:07:12Z,WQN026,-17.19,146.44,95.4,-999,-999,-999,-999,-999,-999,-999,-999,-999,-999,-999,-999
,2005-09-20T00:07:12Z,WQN026,-17.19,146.44,95.6,-999,-999,-999,-999,-999,-999,-999,-999,-999,-999,-999,-999
,2005-09-20T00:07:12Z,WQN026,-17.19,146.44,95.8,-999,-999,-999,-999,-999,-999,-999,-999,-999,-999,-999,-999
,2005-09-20T00:07:12Z,WQN026,-17.19,146.44,96,-999,-999,-999,-999,-999,-999,-999,-999,-999,-999,-999,-999
,2005-09-20T00:07:12Z,WQN026,-17.19,146.44,96.2,-999,-999,-999,-999,-999,-999,-999,-999,-999,-999,-999,-999
,2005-09-20T00:07:14Z,WQN026,-17.19,146.44,96.4,-999,-999,-999,-999,-999,-999,-999,-999,-999,-999,-999,-999
,2005-09-20T00:07:14Z,WQN026,-17.19,146.44,96.6,-999,-999,-999,-999,-999,-999,-999,-999,-999,-999,-999,-999
,2005-09-20T00:07:14Z,WQN026,-17.19,146.44,96.8,-999,-999,-999,-999,-999,-999,-999,-999,-999,-999,-999,-999
,2005-09-20T00:07:14Z,WQN026,-17.19,146.44,97,-999,-999,-999,-999,-999,-999,-999,-999,-999,-999,-999,-999
,2005-09-20T00:07:16Z,WQN026,-17.19,146.44,97.2,-999,-999,-999,-999,-999,-999,-999,-999,-999,-999,-999,-999
,2005-09-20T00:07:16Z,WQN026,-17.19,146.44,97.4,-999,-999,-999,-999,-999,-999,-999,-999,-999,-999,-999,-999
,2005-09-20T00:07:16Z,WQN026,-17.19,146.44,97.6,-999,-999,-999,-999,-999,-999,-999,-999,-999,-999,-999,-999
,2005-09-20T00:07:16Z,WQN026,-17.19,146.44,97.8,-999,-999,-999,-999,-999,-999,-999,-999,-999,-999,-999,-999
,2005-09-20T00:07:18Z,WQN026,-17.19,146.44,98,-999,-999,-999,-999,-999,-999,-999,-999,-999,-999,-999,-999
,2005-09-20T00:07:18Z,WQN026,-17.19,146.44,98.2,-999,-999,-999,-999,-999,-999,-999,-999,-999,-999,-999,-999
,2005-09-20T00:07:18Z,WQN026,-17.19,146.44,98.4,-999,-999,-999,-999,-999,-999,-999,-999,-999,-999,-999,-999
,2005-09-20T00:07:18Z,WQN026,-17.19,146.44,98.6,-999,-999,-999,-999,-999,-999,-999,-999,-999,-999,-999,-999
,2005-09-20T00:07:18Z,WQN026,-17.19,146.44,98.8,-999,-999,-999,-999,-999,-999,-999,-999,-999,-999,-999,-999
,2005-09-20T00:07:20Z,WQN026,-17.19,146.44,99,-999,-999,-999,-999,-999,-999,-999,-999,-999,-999,-999,-999
,2005-09-20T00:07:20Z,WQN026,-17.19,146.44,99.2,-999,-999,-999,-999,-999,-999,-999,-999,-999,-999,-999,-999
,2005-09-20T00:07:20Z,WQN026,-17.19,146.44,99.4,-999,-999,-999,-999,-999,-999,-999,-999,-999,-999,-999,-999
,2005-09-20T00:07:20Z,WQN026,-17.19,146.44,99.6,-999,-999,-999,-999,-999,-999,-999,-999,-999,-999,-999,-999
,2005-09-20T00:07:22Z,WQN026,-17.19,146.44,99.8,-999,-999,-999,-999,-999,-999,-999,-999,-999,-999,-999,-999
,2005-09-20T00:07:22Z,WQN026,-17.19,146.44,100,-999,-999,-999,-999,-999,-999,-999,-999,-999,-999,-999,-999
