GLOBAL ATTRIBUTES,,,,,,,,,,,,,,,,,
title,,,,,,,,,,,,,,,,,
project,Integrated Marine Observing System (IMOS),,,,,,,,,,,,,,,,
original_project_name,MERIS validation,,,,,,,,,,,,,,,,
institution,CSIRO Land and Water,,,,,,,,,,,,,,,,
abstract,This record contains in situ water optical property data collected in the Great Barrier Reef (Australia) on the RSV Lady Basten between 21-29 Oct 2002. A total of 28 stations were sampled during the field campaign AO02. The data can be used for Ocean Colour sensor validation| optical water quality monitoring and modelling. CLW deployed the optical instruments TriOS RAMSES (hyperspectral irradiance)| WETLabs AC-9 (absorption and attenuation coefficicents)| HOBILabs Hydroscat-6 (backscattering coefficient) during this cruise.This data was part of the dataset described in Oubelkheir et al. 2004| Bio-optical characterisation of Australian ocean| coastal and estuarine waters In SPIE| Ocean Optics XVII| Fremantle (Aus.) and Blondeau-Patissier et al. 2009| JGR| VOL. 114| C05003| doi:10.1029/2008JC005039. Funding for this study was provided by CSIRO Earth Observation Centre| CSIRO Land and Water| CSIRO Marine Research and the Australian Institute of Marine Sciences. We also thank the captains and crews of the RSV Lady Basten.,,,,,,,,,,,,,,,,
conventions,IMOS biological data format (v1.0),,,,,,,,,,,,,,,,
date_created,2002-10-25T12:24:38Z,,,,,,,,,,,,,,,,
date_modified,2002-10-26T07:34:52Z,,,,,,,,,,,,,,,,
history,Data has been quality controlled by in-house procedures. HS-6 data were corrected for temperature using CTD data and the Sigma correction method| recommended by the manufacturer| was applied using absorption and attenuation data from the AC-9. The Sigma correction is an adjustment to improve the accuracy of backscattering measurements| in particular in highly-attenuating water. The correction is detailed in HOBI-labs Inc.| 2003. The backscattering coefficient bb is estimated using the method described in Maffione and Dana| 1997| Applied Optics| 36(24)| pp.6057-6067.,,,,,,,,,,,,,,,,
comment,The HydroScat-6 (HS-6) is a self-contained instrument for measuring optical backscattering at six different wavelengths in natural waters. The particulate backscattering coefficient| bbp (lambda)| is a measure of light scattering by particles at angles between 90 and 180 degrees. bbp was estimated by subtracting bbw (lambda)| the backscattering coefficient of pure sea-water| from bb (lambda). The pure seawater backscattering coefficient was calculated using a backscattering ratio of 0.5 (Gordon et al.| 1988| Journal of Geophysical Research) and the seawater scattering coefficients| bw(lambda)| of Morel (1974| Optical properties of pure water and pure seawater| p. 1-24| in Optical Aspects of Oceanography).,,,,,,,,,,,,,,,,
source,Particulate Scattering coefficients determined using an HS-6 (www.hobilabs.com),,,,,,,,,,,,,,,,
keywords,Oceans>Ocean Optics > Scattering ;Oceans>Ocean Optics>Ocean Colour;,,,,,,,,,,,,,,,,
cruise_id,LB3172,,,,,,,,,,,,,,,,
vessel_name,RSV Lady Basten,,,,,,,,,,,,,,,,
platform_code,VLAB_450301529,,,,,,,,,,,,,,,,
references,https://marlin.csiro.au/geonetwork/srv/eng/catalog.search#/metadata/de47e8c0-5315-446e-b637-cf2630ea5f61,,,,,,,,,,,,,,,,
naming_authority,CSIRO Land and Water (CLW),,,,,,,,,,,,,,,,
cdm_data_type,profile,,,,,,,,,,,,,,,,
geospatial_lat_min,,,,,,,,,,,,,,,,,
geospatial_lat_max,,,,,,,,,,,,,,,,,
geospatial_lon_min,,,,,,,,,,,,,,,,,
geospatial_lon_max,,,,,,,,,,,,,,,,,
geospatial_vertical_min,0,,,,,,,,,,,,,,,,
geospatial_vertical_max,0,,,,,,,,,,,,,,,,
local_time_zone,10,,,,,,,,,,,,,,,,
data_centre,eMarine Information Infrastructure (eMII),,,,,,,,,,,,,,,,
data_centre_email,info@emii.org.au,,,,,,,,,,,,,,,,
author,Brando Vittorio,,,,,,,,,,,,,,,,
author_email,vittorio.brando@csiro.au,,,,,,,,,,,,,,,,
principal_investigator,Furnas Miles,,,,,,,,,,,,,,,,
principal_investigator_email,m.furnas@aims.gov.au,,,,,,,,,,,,,,,,
publisher,Australian Ocean Data Network,,,,,,,,,,,,,,,,
publisher_email,info@aodn.org.au,,,,,,,,,,,,,,,,
institution,IMOS Satellite Remote Sensing - Ocean Colour Sub-facility - Bio-Optical Database of Australian Waters,,,,,,,,,,,,,,,,
institution_principal_investigator,"Schroeder, Thomas",,,,,,,,,,,,,,,,
institution_principal_investigator_email,Thomas.Schroeder@csiro.au, ,,,,,,,,,,,,,,,
citation,To cite this data set in a publication use the format <<IMOS [year-of-data-downloaded] [Title] [data-access-url] accessed [date-of-access]>>,,,,,,,,,,,,,,,,
acknowledgement,Data was sourced from the Commonwealth Scientific and Industrial Research Organisation (CSIRO),,,,,,,,,,,,,,,,
distribution_statement,"Any users of IMOS data are required to clearly acknowledge the source of the material- Data or products or services from IMOS are provided ""as is"" without any warranty as to fitness for a particular purpose.",,,,,,,,,,,,,,,,
,,,,,,,,,,,,,,,,,
TABLE ROWS,,,,,,,,,,,,,,,,,
Row name,CF standard_name,IMOS long_name,Units,Fill value,Comments,,,,,,,,,,,,
Wavelength,radiation_wavelength,Wavelength of measurement,nm,-999,,,,,,,,,,,,,
,,,,,,,,,,,,,,,,,
TABLE COLUMNS,,,,,,,,,,,,,,,,,
Column name,CF standard_name,IMOS long_name,Units,Fill value,Comments,,,,,,,,,,,,
Time,time,analysis_time,YYYY-MM-DDThh:mm:ssZ,,UTC date and time,,,,,,,,,,,,
Station_Code,,,,,National Reference Station code (6 letters),,,,,,,,,,,,
Latitude,latitude,latitude,degrees_north,-999,North positive,,,,,,,,,,,,
Longitude,longitude,longitude,degrees_east,-999,East positive,,,,,,,,,,,,
Depth,depth,depth,m ,-999,positive down,,,,,,,,,,,,
bb_corr,,corrected_volume_total_backwards_scattering_coefficient_of_(bbw_+_bbp)_in_sea_water,m-1,-999,bbw:volume_backwards_scattering_coefficient_of_radiative_flux_in_sea_water ; bbp=volume_backwards_scattering_coefficient_of_particules_in_sea_water,,,,,,,,,,,,
bb_uncorr,,volume_total_backwards_scattering_coefficient_of_(bbw_+_bbp)_in_sea_water,m-1,-999,bbw:volume_backwards_scattering_coefficient_of_radiative_flux_in_sea_water ; bbp=volume_backwards_scattering_coefficient_of_particules_in_sea_water,,,,,,,,,,,,
,,,,,,,,,,,,,,,,,
,,,,,,,,,,,,,,,,,
DATA,,,,,,,,,,,,,,,,,
,Time,Station_Code,Latitude,Longitude,Depth,bb_corr,bb_corr,bb_corr,bb_corr,bb_corr,bb_corr,bb_uncorr,bb_uncorr,bb_uncorr,bb_uncorr,bb_uncorr,bb_uncorr
Wavelength,,,,,,442,448,555,589,676,852,442,448,555,589,676,852
,2002-10-25T12:24:38Z,SAT013,-20.09,149.54,0,0.004889,0.003945,0.005423,0.001295,0.001914,0.000749,0.004851,0.003916,0.005389,0.001313,0.00191,0.00054
,2002-10-25T12:30:12Z,SAT013,-20.09,149.54,0.2,0.00453,0.002397,0.001811,0.001946,0.001836,0.00068,0.004495,0.00238,0.0018,0.001973,0.001831,0.000491
,2002-10-25T12:24:45Z,SAT013,-20.09,149.54,0.4,0.004325,0.002543,0.001772,0.001279,0.001811,0.000723,0.004291,0.002525,0.001761,0.001297,0.001806,0.000522
,2002-10-25T12:30:36Z,SAT013,-20.09,149.54,0.6,0.004354,0.003344,0.001913,0.001212,0.00182,0.000792,0.00432,0.00332,0.001901,0.001229,0.001815,0.000571
,2002-10-25T12:25:11Z,SAT013,-20.09,149.54,0.8,0.00453,0.002426,0.001772,0.001308,0.001747,0.000757,0.004495,0.002409,0.001761,0.001326,0.001742,0.000546
,2002-10-25T12:30:03Z,SAT013,-20.09,149.54,1,0.004766,0.002426,0.001671,0.0012,0.001865,0.000912,0.004728,0.002409,0.00166,0.001217,0.00186,0.000658
,2002-10-25T12:25:17Z,SAT013,-20.09,149.54,1.2,0.004607,0.00251,0.001632,0.001283,0.001762,0.000843,0.004571,0.002492,0.001621,0.001301,0.001756,0.000609
,2002-10-25T12:30:38Z,SAT013,-20.09,149.54,1.4,0.004496,0.002458,0.002279,0.001237,0.00199,0.000826,0.00446,0.002441,0.002264,0.001254,0.001984,0.000596
,2002-10-25T12:25:19Z,SAT013,-20.09,149.54,1.6,0.004519,0.002458,0.001671,0.001337,0.001706,0.000783,0.004483,0.002441,0.00166,0.001356,0.001701,0.000565
,2002-10-25T12:25:21Z,SAT013,-20.09,149.54,1.8,0.004553,0.002415,0.001733,0.001273,0.001808,0.000792,0.004518,0.002399,0.001722,0.001291,0.001803,0.000571
,2002-10-25T12:25:22Z,SAT013,-20.09,149.54,2,0.004794,0.002451,0.001626,0.00126,0.00177,0.000792,0.004758,0.002434,0.001616,0.001278,0.001765,0.000571
,2002-10-25T12:30:40Z,SAT013,-20.09,149.54,2.2,0.004683,0.002403,0.001693,0.001233,0.001942,0.00074,0.004647,0.002386,0.001683,0.00125,0.001936,0.000534
,2002-10-25T12:25:24Z,SAT013,-20.09,149.54,2.4,0.004671,0.00238,0.001701,0.001236,0.001755,0.000826,0.004629,0.00236,0.001688,0.001252,0.001749,0.000596
,2002-10-25T12:30:41Z,SAT013,-20.09,149.54,2.6,0.004588,0.002399,0.001784,0.001231,0.002047,0.00068,0.004553,0.002383,0.001772,0.001249,0.002041,0.000491
,2002-10-25T12:30:42Z,SAT013,-20.09,149.54,2.8,0.004472,0.002367,0.001519,0.001187,0.001667,0.000645,0.004437,0.002351,0.001509,0.001204,0.001662,0.000466
,2002-10-25T12:30:43Z,SAT013,-20.09,149.54,3,0.004561,0.002403,0.001908,0.001193,0.001905,0.00068,0.004524,0.002386,0.001895,0.00121,0.001899,0.000491
,2002-10-25T12:25:30Z,SAT013,-20.09,149.54,3.2,0.004685,0.002884,0.002905,0.001322,0.001723,0.000895,0.004647,0.002863,0.002885,0.00134,0.001717,0.000646
,2002-10-25T12:25:32Z,SAT013,-20.09,149.54,3.4,0.004668,0.002488,0.001937,0.001249,0.001874,0.000903,0.004629,0.00247,0.001923,0.001266,0.001867,0.000652
,2002-10-25T12:29:43Z,SAT013,-20.09,149.54,3.6,0.004598,0.002541,0.001655,0.001299,0.001894,0.000749,0.004559,0.002521,0.001644,0.001317,0.001886,0.00054
,2002-10-25T12:30:45Z,SAT013,-20.09,149.54,3.8,0.004792,0.002596,0.002061,0.001278,0.00213,0.000706,0.004752,0.002576,0.002046,0.001295,0.002121,0.000509
,2002-10-25T12:25:36Z,SAT013,-20.09,149.54,4,0.004568,0.002456,0.001801,0.001303,0.001716,0.000843,0.00453,0.002438,0.001789,0.001321,0.00171,0.000609
,2002-10-25T12:29:40Z,SAT013,-20.09,149.54,4.2,0.00485,0.002563,0.001824,0.001326,0.001761,0.000852,0.00481,0.002544,0.001811,0.001344,0.001755,0.000615
,2002-10-25T12:30:47Z,SAT013,-20.09,149.54,4.4,0.004634,0.002528,0.001768,0.001259,0.001866,0.00086,0.004594,0.002509,0.001755,0.001276,0.00186,0.000621
,2002-10-25T12:25:42Z,SAT013,-20.09,149.54,4.6,0.004587,0.002473,0.001656,0.001413,0.001702,0.000921,0.004548,0.002454,0.001644,0.001432,0.001696,0.000664
,2002-10-25T12:29:35Z,SAT013,-20.09,149.54,4.8,0.004634,0.002628,0.001948,0.001388,0.001905,0.001015,0.004594,0.002608,0.001934,0.001406,0.001899,0.000733
,2002-10-25T12:30:49Z,SAT013,-20.09,149.54,5,0.00485,0.002524,0.00166,0.001276,0.00196,0.000697,0.00481,0.002505,0.001649,0.001293,0.001954,0.000503
,2002-10-25T12:29:33Z,SAT013,-20.09,149.54,5.2,0.004597,0.002511,0.001784,0.00132,0.001851,0.000912,0.004559,0.002492,0.001772,0.001338,0.001845,0.000658
,2002-10-25T12:25:46Z,SAT013,-20.09,149.54,5.4,0.004739,0.002515,0.001801,0.001282,0.001953,0.000749,0.004699,0.002496,0.001789,0.001299,0.001947,0.00054
,2002-10-25T12:25:49Z,SAT013,-20.09,149.54,5.6,0.00478,0.002514,0.001835,0.001291,0.001867,0.000877,0.00474,0.002496,0.001822,0.001309,0.001861,0.000633
,2002-10-25T12:30:51Z,SAT013,-20.09,149.54,5.8,0.004451,0.00254,0.001705,0.00129,0.001929,0.001006,0.004414,0.002521,0.001694,0.001309,0.001924,0.000727
,2002-10-25T12:29:27Z,SAT013,-20.09,149.54,6,0.004784,0.002497,0.001874,0.001325,0.001936,0.001015,0.004746,0.00248,0.001862,0.001344,0.001931,0.000733
,2002-10-25T12:29:25Z,SAT013,-20.09,149.54,6.2,0.004673,0.002579,0.001767,0.001285,0.002062,0.000981,0.004635,0.00256,0.001755,0.001303,0.002055,0.000708
,2002-10-25T12:25:54Z,SAT013,-20.09,149.54,6.4,0.004709,0.002456,0.001762,0.001327,0.001801,0.000998,0.00467,0.002438,0.00175,0.001346,0.001796,0.00072
,2002-10-25T12:29:22Z,SAT013,-20.09,149.54,6.6,0.004634,0.002657,0.002156,0.001283,0.001835,0.000981,0.004594,0.002637,0.002141,0.001301,0.001829,0.000708
,2002-10-25T12:29:21Z,SAT013,-20.09,149.54,6.8,0.004551,0.002732,0.00224,0.001349,0.001845,0.000972,0.004513,0.002711,0.002225,0.001367,0.001838,0.000702
,2002-10-25T12:30:55Z,SAT013,-20.09,149.54,7,0.004575,0.002605,0.001863,0.00131,0.001913,0.000817,0.004536,0.002586,0.00185,0.001328,0.001906,0.00059
,2002-10-25T12:29:18Z,SAT013,-20.09,149.54,7.2,0.004823,0.002525,0.001582,0.001347,0.002072,0.000955,0.004781,0.002505,0.001571,0.001365,0.002064,0.000689
,2002-10-25T12:30:56Z,SAT013,-20.09,149.54,7.4,0.004682,0.002545,0.001824,0.001308,0.002022,0.000826,0.004641,0.002525,0.001811,0.001326,0.002015,0.000596
,2002-10-25T12:30:57Z,SAT013,-20.09,149.54,7.6,0.004586,0.002556,0.001831,0.00129,0.001744,0.000894,0.004542,0.002534,0.001817,0.001307,0.001737,0.000646
,2002-10-25T12:26:03Z,SAT013,-20.09,149.54,7.8,0.004692,0.002624,0.001848,0.001336,0.001696,0.000963,0.004647,0.002602,0.001834,0.001354,0.001689,0.000696
,2002-10-25T12:29:11Z,SAT013,-20.09,149.54,8,0.004766,0.002571,0.001841,0.001382,0.001989,0.000963,0.004723,0.00255,0.001828,0.0014,0.001981,0.000696
,2002-10-25T12:26:05Z,SAT013,-20.09,149.54,8.2,0.004655,0.002494,0.001802,0.001407,0.001824,0.000739,0.004612,0.002473,0.001789,0.001426,0.001817,0.000534
,2002-10-25T12:26:19Z,SAT013,-20.09,149.54,8.4,0.004638,0.00263,0.001808,0.001376,0.001923,0.000843,0.004594,0.002608,0.001795,0.001395,0.001915,0.000609
,2002-10-25T12:26:49Z,SAT013,-20.09,149.54,8.6,0.00472,0.002592,0.001892,0.001353,0.001912,0.000843,0.004676,0.00257,0.001878,0.001371,0.001904,0.000609
,2002-10-25T12:27:49Z,SAT013,-20.09,149.54,8.8,0.004849,0.002539,0.001853,0.001378,0.001949,0.000705,0.004804,0.002518,0.001839,0.001397,0.001942,0.000509
,2002-10-25T12:28:05Z,SAT013,-20.09,149.54,9,0.004631,0.002688,0.00205,0.001353,0.001824,0.000963,0.004588,0.002666,0.002035,0.001371,0.001817,0.000696
,2002-10-25T12:28:32Z,SAT013,-20.09,149.54,9.2,0.004696,0.002734,0.001892,0.001409,0.001996,0.000843,0.004653,0.002711,0.001878,0.001428,0.001988,0.000609
,2002-10-25T12:25:08Z,SAT013,-20.09,149.54,9.4,-999,-999,-999,-999,-999,-999,-999,-999,-999,-999,-999,-999
,2002-10-25T12:31:03Z,SAT013,-20.09,149.54,9.6,0.004467,0.002695,0.002106,0.00129,0.001974,0.001075,0.004425,0.002673,0.002091,0.001307,0.001966,0.000776
,2002-10-25T12:25:09Z,SAT013,-20.09,149.54,9.8,-999,-999,-999,-999,-999,-999,-999,-999,-999,-999,-999,-999
,2002-10-25T12:31:04Z,SAT013,-20.09,149.54,10,0.004503,0.002614,0.00165,0.001371,0.002056,0.00092,0.00446,0.002592,0.001638,0.001389,0.002048,0.000664
,2002-10-25T12:31:05Z,SAT013,-20.09,149.54,10.2,0.004737,0.002585,0.001915,0.001432,0.002328,0.000963,0.004693,0.002563,0.001901,0.001451,0.002319,0.000696
,2002-10-25T12:31:06Z,SAT013,-20.09,149.54,10.4,0.004521,0.002689,0.002027,0.001363,0.002126,0.001033,0.004478,0.002666,0.002013,0.001381,0.002116,0.000745
,2002-10-25T12:25:11Z,SAT013,-20.09,149.54,10.6,-999,-999,-999,-999,-999,-999,-999,-999,-999,-999,-999,-999
,2002-10-25T12:25:12Z,SAT013,-20.09,149.54,10.8,-999,-999,-999,-999,-999,-999,-999,-999,-999,-999,-999,-999
,2002-10-25T12:31:07Z,SAT013,-20.09,149.54,11,0.004682,0.002582,0.001915,0.001309,0.001974,0.001144,0.004635,0.00256,0.001901,0.001326,0.001966,0.000826
,2002-10-25T12:31:08Z,SAT013,-20.09,149.54,11.2,0.004669,0.002557,0.001842,0.001388,0.001995,0.001006,0.004623,0.002534,0.001828,0.001406,0.001988,0.000727
,2002-10-25T12:31:09Z,SAT013,-20.09,149.54,11.4,0.004627,0.002511,0.001577,0.0014,0.001958,0.000834,0.004583,0.002489,0.001565,0.001418,0.00195,0.000602
,2002-10-25T12:25:14Z,SAT013,-20.09,149.54,11.6,-999,-999,-999,-999,-999,-999,-999,-999,-999,-999,-999,-999
,2002-10-25T12:31:10Z,SAT013,-20.09,149.54,11.8,0.004705,0.002589,0.001572,0.001298,0.001924,0.000998,0.004658,0.002567,0.00156,0.001315,0.001917,0.00072
,2002-10-25T12:25:15Z,SAT013,-20.09,149.54,12,-999,-999,-999,-999,-999,-999,-999,-999,-999,-999,-999,-999
,2002-10-25T12:31:11Z,SAT013,-20.09,149.54,12.2,0.004788,0.002703,0.001931,0.001326,0.002085,0.00104,0.004746,0.002682,0.001918,0.001344,0.002079,0.000751
,2002-10-25T12:25:16Z,SAT013,-20.09,149.54,12.4,-999,-999,-999,-999,-999,-999,-999,-999,-999,-999,-999,-999
,2002-10-25T12:31:12Z,SAT013,-20.09,149.54,12.6,0.004723,0.002616,0.001897,0.001404,0.002053,0.000929,0.004682,0.002596,0.001884,0.001424,0.002047,0.000671
,2002-10-25T12:31:13Z,SAT013,-20.09,149.54,12.8,0.004735,0.002557,0.001807,0.001299,0.001981,0.000971,0.004693,0.002538,0.001795,0.001317,0.001975,0.000702
,2002-10-25T12:31:14Z,SAT013,-20.09,149.54,13,0.004721,0.002602,0.001841,0.001305,0.002054,0.001109,0.004682,0.002583,0.001828,0.001323,0.002048,0.000801
,2002-10-25T12:25:19Z,SAT013,-20.09,149.54,13.2,-999,-999,-999,-999,-999,-999,-999,-999,-999,-999,-999,-999
,2002-10-25T12:31:15Z,SAT013,-20.09,149.54,13.4,0.004764,0.002667,0.001914,0.001333,0.002229,0.000843,0.004723,0.002647,0.001901,0.001352,0.002223,0.000609
,2002-10-25T12:25:20Z,SAT013,-20.09,149.54,13.6,-999,-999,-999,-999,-999,-999,-999,-999,-999,-999,-999,-999
,2002-10-25T12:31:16Z,SAT013,-20.09,149.54,13.8,0.004656,0.002673,0.002104,0.001289,0.001907,0.001032,0.004618,0.002653,0.002091,0.001307,0.001902,0.000745
,2002-10-25T12:25:21Z,SAT013,-20.09,149.54,14,-999,-999,-999,-999,-999,-999,-999,-999,-999,-999,-999,-999
,2002-10-25T12:31:17Z,SAT013,-20.09,149.54,14.2,0.004791,0.002588,0.001716,0.001726,0.002069,0.000929,0.004752,0.00257,0.001705,0.001751,0.002064,0.000671
,2002-10-25T12:25:22Z,SAT013,-20.09,149.54,14.4,-999,-999,-999,-999,-999,-999,-999,-999,-999,-999,-999,-999
,2002-10-25T12:31:18Z,SAT013,-20.09,149.54,14.6,0.004556,0.002761,0.002414,0.003163,0.001829,0.001049,0.004518,0.00274,0.002398,0.003208,0.001824,0.000758
,2002-10-25T12:25:23Z,SAT013,-20.09,149.54,14.8,-999,-999,-999,-999,-999,-999,-999,-999,-999,-999,-999,-999
,2002-10-25T12:31:20Z,SAT013,-20.09,149.54,15,0.004585,0.002543,0.001913,0.001337,0.002025,0.000886,0.004548,0.002525,0.001901,0.001356,0.00202,0.00064
,2002-10-25T12:25:25Z,SAT013,-20.09,149.54,15.2,-999,-999,-999,-999,-999,-999,-999,-999,-999,-999,-999,-999
,2002-10-25T12:31:21Z,SAT013,-20.09,149.54,15.4,0.004919,0.002617,0.001963,0.001352,0.002116,0.001152,0.00488,0.002599,0.001951,0.001371,0.002111,0.000832
,2002-10-25T12:25:26Z,SAT013,-20.09,149.54,15.6,-999,-999,-999,-999,-999,-999,-999,-999,-999,-999,-999,-999
,2002-10-25T12:31:22Z,SAT013,-20.09,149.54,15.8,0.004631,0.002633,0.002053,0.001357,0.002119,0.001015,0.004594,0.002615,0.002041,0.001377,0.002114,0.000733
,2002-10-25T12:25:27Z,SAT013,-20.09,149.54,16,-999,-999,-999,-999,-999,-999,-999,-999,-999,-999,-999,-999
,2002-10-25T12:31:23Z,SAT013,-20.09,149.54,16.2,0.004919,0.002597,0.001694,0.001317,0.001985,0.001075,0.00488,0.002579,0.001683,0.001336,0.001981,0.000776
,2002-10-25T12:31:24Z,SAT013,-20.09,149.54,16.4,0.004883,0.002493,0.001749,0.00134,0.002094,0.000981,0.004845,0.002476,0.001739,0.00136,0.002089,0.000708
,2002-10-25T12:31:25Z,SAT013,-20.09,149.54,16.6,0.004748,0.002523,0.001625,0.001319,0.002094,0.001041,0.004711,0.002505,0.001616,0.001338,0.002089,0.000751
,2002-10-25T12:25:29Z,SAT013,-20.09,149.54,16.8,-999,-999,-999,-999,-999,-999,-999,-999,-999,-999,-999,-999
,2002-10-25T12:31:26Z,SAT013,-20.09,149.54,17,0.004949,0.002521,0.00175,0.001332,0.002241,0.001025,0.004909,0.002502,0.001733,0.001348,0.002235,0.000739
,2002-10-25T12:25:31Z,SAT013,-20.09,149.54,17.2,-999,-999,-999,-999,-999,-999,-999,-999,-999,-999,-999,-999
,2002-10-25T12:31:27Z,SAT013,-20.09,149.54,17.4,0.004689,0.002775,0.001794,0.001338,0.002074,0.001273,0.004653,0.002757,0.001783,0.001358,0.00207,0.000919
,2002-10-25T12:25:32Z,SAT013,-20.09,149.54,17.6,-999,-999,-999,-999,-999,-999,-999,-999,-999,-999,-999,-999
,2002-10-25T12:31:28Z,SAT013,-20.09,149.54,17.8,0.004572,0.002526,0.001716,0.001398,0.001997,0.000981,0.004536,0.002509,0.001705,0.001418,0.001993,0.000708
,2002-10-25T12:31:29Z,SAT013,-20.09,149.54,18,0.004725,0.002642,0.00167,0.001317,0.002836,0.001127,0.004688,0.002624,0.00166,0.001336,0.00283,0.000814
,2002-10-25T12:31:30Z,SAT013,-20.09,149.54,18.2,0.004725,0.002584,0.001834,0.001353,0.002069,0.000981,0.004688,0.002567,0.001822,0.001373,0.002064,0.000708
,2002-10-25T12:25:34Z,SAT013,-20.09,149.54,18.4,-999,-999,-999,-999,-999,-999,-999,-999,-999,-999,-999,-999
,2002-10-25T12:31:31Z,SAT013,-20.09,149.54,18.6,0.004912,0.002604,0.001799,0.001269,0.00245,0.001161,0.004874,0.002586,0.001789,0.001287,0.002445,0.000838
,2002-10-25T12:31:32Z,SAT013,-20.09,149.54,18.8,0.004375,0.002592,0.001731,0.00131,0.001852,0.001006,0.004344,0.002576,0.001722,0.00133,0.001849,0.000727
,2002-10-25T12:25:36Z,SAT013,-20.09,149.54,19,-999,-999,-999,-999,-999,-999,-999,-999,-999,-999,-999,-999
,2002-10-25T12:25:36Z,SAT013,-20.09,149.54,19.2,-999,-999,-999,-999,-999,-999,-999,-999,-999,-999,-999,-999
,2002-10-25T12:31:33Z,SAT013,-20.09,149.54,19.4,0.004646,0.00245,0.001658,0.001222,0.001904,0.001066,0.004612,0.002434,0.001649,0.001241,0.001901,0.00077
,2002-10-25T12:31:34Z,SAT013,-20.09,149.54,19.6,0.004675,0.00247,0.001873,0.001292,0.001849,0.000946,0.004641,0.002454,0.001862,0.001311,0.001845,0.000683
,2002-10-25T12:31:35Z,SAT013,-20.09,149.54,19.8,0.004593,0.002434,0.0018,0.001297,0.001944,0.000972,0.004559,0.002418,0.001789,0.001317,0.00194,0.000702
,2002-10-25T12:31:36Z,SAT013,-20.09,149.54,20,0.004353,0.002451,0.001569,0.001261,0.001819,0.001152,0.00432,0.002434,0.00156,0.00128,0.001815,0.000832
,2002-10-25T12:25:39Z,SAT013,-20.09,149.54,20.2,-999,-999,-999,-999,-999,-999,-999,-999,-999,-999,-999,-999
,2002-10-25T12:31:37Z,SAT013,-20.09,149.54,20.4,0.004587,0.002472,0.001585,0.001282,0.001952,0.00098,0.004553,0.002457,0.001577,0.001301,0.001949,0.000708
,2002-10-25T12:25:41Z,SAT013,-20.09,149.54,20.6,-999,-999,-999,-999,-999,-999,-999,-999,-999,-999,-999,-999
,2002-10-25T12:31:38Z,SAT013,-20.09,149.54,20.8,0.005475,0.002525,0.001794,0.001286,0.004703,0.000877,0.005434,0.002509,0.001783,0.001305,0.004693,0.000633
,2002-10-25T12:25:42Z,SAT013,-20.09,149.54,21,-999,-999,-999,-999,-999,-999,-999,-999,-999,-999,-999,-999
,2002-10-25T12:31:39Z,SAT013,-20.09,149.54,21.2,0.00468,0.002462,0.001692,0.001598,0.001961,0.001118,0.004647,0.002447,0.001683,0.001622,0.001958,0.000807
,2002-10-25T12:31:40Z,SAT013,-20.09,149.54,21.4,0.004729,0.002522,0.001659,0.001282,0.00194,0.000963,0.004693,0.002505,0.001649,0.001301,0.001936,0.000696
,2002-10-25T12:25:43Z,SAT013,-20.09,149.54,21.6,-999,-999,-999,-999,-999,-999,-999,-999,-999,-999,-999,-999
,2002-10-25T12:31:41Z,SAT013,-20.09,149.54,21.8,0.004729,0.00257,0.001614,0.001236,0.001892,0.001006,0.004693,0.002554,0.001604,0.001254,0.001888,0.000727
,2002-10-25T12:31:42Z,SAT013,-20.09,149.54,22,0.004723,0.002561,0.00176,0.001372,0.002114,0.000843,0.004688,0.002544,0.00175,0.001393,0.002109,0.000609
,2002-10-25T12:25:45Z,SAT013,-20.09,149.54,22.2,-999,-999,-999,-999,-999,-999,-999,-999,-999,-999,-999,-999
,2002-10-25T12:31:43Z,SAT013,-20.09,149.54,22.4,0.004846,0.002596,0.001721,0.001374,0.00209,0.001221,0.00481,0.002579,0.001711,0.001395,0.002086,0.000882
,2002-10-25T12:31:44Z,SAT013,-20.09,149.54,22.6,0.004817,0.002518,0.001558,0.001284,0.00193,0.001066,0.004781,0.002502,0.001549,0.001303,0.001926,0.00077
,2002-10-25T12:25:47Z,SAT013,-20.09,149.54,22.8,-999,-999,-999,-999,-999,-999,-999,-999,-999,-999,-999,-999
,2002-10-25T12:31:45Z,SAT013,-20.09,149.54,23,0.004818,0.002516,0.001749,0.001317,0.002046,0.001015,0.004781,0.002499,0.001739,0.001336,0.002041,0.000733
,2002-10-25T12:25:48Z,SAT013,-20.09,149.54,23.2,-999,-999,-999,-999,-999,-999,-999,-999,-999,-999,-999,-999
,2002-10-25T12:31:46Z,SAT013,-20.09,149.54,23.4,0.004729,0.002564,0.001768,0.001266,0.001975,0.001163,0.004688,0.002544,0.001755,0.001284,0.001968,0.000838
,2002-10-25T12:31:47Z,SAT013,-20.09,149.54,23.6,0.004847,0.003077,0.002519,0.001332,0.002347,0.001127,0.00481,0.003056,0.002505,0.001352,0.002342,0.000814
,2002-10-25T12:31:48Z,SAT013,-20.09,149.54,23.8,0.004517,0.002499,0.001692,0.001326,0.002,0.00117,0.004483,0.002483,0.001683,0.001346,0.001995,0.000845
,2002-10-25T12:25:51Z,SAT013,-20.09,149.54,24,-999,-999,-999,-999,-999,-999,-999,-999,-999,-999,-999,-999
,2002-10-25T12:31:49Z,SAT013,-20.09,149.54,24.2,0.00466,0.002817,0.002137,0.001269,0.002013,0.001067,0.004623,0.002798,0.002124,0.001287,0.002007,0.00077
,2002-10-25T12:25:52Z,SAT013,-20.09,149.54,24.4,-999,-999,-999,-999,-999,-999,-999,-999,-999,-999,-999,-999
,2002-10-25T12:31:50Z,SAT013,-20.09,149.54,24.6,0.004671,0.002555,0.001777,0.001338,0.002075,0.001161,0.004635,0.002538,0.001767,0.001358,0.00207,0.000838
,2002-10-25T12:25:53Z,SAT013,-20.09,149.54,24.8,-999,-999,-999,-999,-999,-999,-999,-999,-999,-999,-999,-999
,2002-10-25T12:31:51Z,SAT013,-20.09,149.54,25,0.004801,0.002513,0.001822,0.001321,0.002013,0.000912,0.004763,0.002496,0.001811,0.00134,0.002007,0.000658
,2002-10-25T12:31:52Z,SAT013,-20.09,149.54,25.2,0.004884,0.002552,0.001659,0.001325,0.001888,0.001032,0.004845,0.002534,0.001649,0.001344,0.001883,0.000745
,2002-10-25T12:25:55Z,SAT013,-20.09,149.54,25.4,-999,-999,-999,-999,-999,-999,-999,-999,-999,-999,-999,-999
,2002-10-25T12:31:53Z,SAT013,-20.09,149.54,25.6,0.004883,0.002526,0.001693,0.001275,0.001832,0.000911,0.004845,0.002509,0.001683,0.001293,0.001828,0.000658
,2002-10-25T12:25:56Z,SAT013,-20.09,149.54,25.8,-999,-999,-999,-999,-999,-999,-999,-999,-999,-999,-999,-999
,2002-10-25T12:31:55Z,SAT013,-20.09,149.54,26,0.004661,0.002555,0.001868,0.001325,0.002038,0.001006,0.004623,0.002538,0.001856,0.001344,0.002032,0.000727
,2002-10-25T12:25:57Z,SAT013,-20.09,149.54,26.2,-999,-999,-999,-999,-999,-999,-999,-999,-999,-999,-999,-999
,2002-10-25T12:31:56Z,SAT013,-20.09,149.54,26.4,0.004861,0.002514,0.001857,0.001463,0.002061,0.00092,0.004822,0.002496,0.001845,0.001484,0.002055,0.000664
,2002-10-25T12:25:58Z,SAT013,-20.09,149.54,26.6,-999,-999,-999,-999,-999,-999,-999,-999,-999,-999,-999,-999
,2002-10-25T12:31:57Z,SAT013,-20.09,149.54,26.8,0.004797,0.002578,0.001738,0.00138,0.002302,0.000886,0.004758,0.00256,0.001727,0.0014,0.002296,0.00064
,2002-10-25T12:25:59Z,SAT013,-20.09,149.54,27,-999,-999,-999,-999,-999,-999,-999,-999,-999,-999,-999,-999
,2002-10-25T12:31:58Z,SAT013,-20.09,149.54,27.2,0.005086,0.002634,0.001604,0.001421,0.002133,0.001006,0.005043,0.002615,0.001593,0.001441,0.002127,0.000727
,2002-10-25T12:31:59Z,SAT013,-20.09,149.54,27.4,0.00492,0.002779,0.001919,0.00145,0.002288,0.001135,0.00488,0.00276,0.001906,0.001471,0.002281,0.00082
,2002-10-25T12:32:00Z,SAT013,-20.09,149.54,27.6,0.00487,0.002816,0.002307,0.00139,0.002135,0.001368,0.004827,0.002795,0.002292,0.00141,0.002128,0.000987
,2002-10-25T12:26:02Z,SAT013,-20.09,149.54,27.8,-999,-999,-999,-999,-999,-999,-999,-999,-999,-999,-999,-999
,2002-10-25T12:32:01Z,SAT013,-20.09,149.54,28,0.004687,0.002696,0.001694,0.001406,0.002132,0.001076,0.004647,0.002676,0.001683,0.001426,0.002125,0.000776
,2002-10-25T12:26:03Z,SAT013,-20.09,149.54,28.2,-999,-999,-999,-999,-999,-999,-999,-999,-999,-999,-999,-999
,2002-10-25T12:32:02Z,SAT013,-20.09,149.54,28.4,0.005562,0.002754,0.002245,0.00144,0.007384,0.001041,0.005515,0.002734,0.002231,0.001461,0.007362,0.000751
,2002-10-25T12:32:03Z,SAT013,-20.09,149.54,28.6,0.004869,0.002631,0.001699,0.001427,0.002031,0.001195,0.004827,0.002612,0.001688,0.001447,0.002025,0.000863
,2002-10-25T12:32:04Z,SAT013,-20.09,149.54,28.8,0.004815,0.002728,0.001896,0.001438,0.002045,0.001101,0.004775,0.002708,0.001884,0.001459,0.002039,0.000795
,2002-10-25T12:26:05Z,SAT013,-20.09,149.54,29,-999,-999,-999,-999,-999,-999,-999,-999,-999,-999,-999,-999
,2002-10-25T12:32:05Z,SAT013,-20.09,149.54,29.2,0.00494,0.00268,0.001823,0.001486,0.002192,0.001195,0.004897,0.00266,0.001811,0.001508,0.002185,0.000863
,2002-10-25T12:26:06Z,SAT013,-20.09,149.54,29.4,-999,-999,-999,-999,-999,-999,-999,-999,-999,-999,-999,-999
,2002-10-25T12:32:06Z,SAT013,-20.09,149.54,29.6,0.004835,0.002648,0.001835,0.001571,0.00228,0.001127,0.004793,0.002628,0.001822,0.001593,0.002273,0.000814
,2002-10-25T12:32:07Z,SAT013,-20.09,149.54,29.8,0.004948,0.002639,0.001874,0.001435,0.00205,0.001007,0.004903,0.002618,0.001862,0.001455,0.002043,0.000727
,2002-10-25T12:26:08Z,SAT013,-20.09,149.54,30,-999,-999,-999,-999,-999,-999,-999,-999,-999,-999,-999,-999
,2002-10-25T12:32:08Z,SAT013,-20.09,149.54,30.2,0.005104,0.002809,0.001975,0.001481,0.002226,0.001032,0.005061,0.002789,0.001962,0.001502,0.002219,0.000745
,2002-10-25T12:26:09Z,SAT013,-20.09,149.54,30.4,-999,-999,-999,-999,-999,-999,-999,-999,-999,-999,-999,-999
,2002-10-25T12:32:09Z,SAT013,-20.09,149.54,30.6,0.005393,0.002693,0.001818,0.001395,0.002697,0.00111,0.005346,0.002673,0.001806,0.001414,0.002687,0.000801
,2002-10-25T12:32:10Z,SAT013,-20.09,149.54,30.8,0.004936,0.002768,0.001869,0.001466,0.002087,0.001127,0.004892,0.002747,0.001856,0.001486,0.002079,0.000814
,2002-10-25T12:32:11Z,SAT013,-20.09,149.54,31,0.004941,0.002742,0.001813,0.001581,0.002366,0.001187,0.004897,0.002721,0.0018,0.001603,0.002358,0.000857
,2002-10-25T12:26:13Z,SAT013,-20.09,149.54,31.2,-999,-999,-999,-999,-999,-999,-999,-999,-999,-999,-999,-999
,2002-10-25T12:32:12Z,SAT013,-20.09,149.54,31.4,0.005106,0.002759,0.002111,0.001504,0.002395,0.000972,0.005061,0.002737,0.002096,0.001525,0.002386,0.000702
,2002-10-25T12:26:14Z,SAT013,-20.09,149.54,31.6,-999,-999,-999,-999,-999,-999,-999,-999,-999,-999,-999,-999
,2002-10-25T12:32:13Z,SAT013,-20.09,149.54,31.8,0.005644,0.002906,0.002123,0.001516,0.003019,0.001377,0.005591,0.002882,0.002108,0.001537,0.003008,0.000994
,2002-10-25T12:26:15Z,SAT013,-20.09,149.54,32,-999,-999,-999,-999,-999,-999,-999,-999,-999,-999,-999,-999
,2002-10-25T12:32:14Z,SAT013,-20.09,149.54,32.2,0.005259,0.002858,0.001928,0.001627,0.002521,0.001283,0.005206,0.002834,0.001912,0.001648,0.002511,0.000925
,2002-10-25T12:26:16Z,SAT013,-20.09,149.54,32.4,-999,-999,-999,-999,-999,-999,-999,-999,-999,-999,-999,-999
,2002-10-25T12:32:15Z,SAT013,-20.09,149.54,32.6,0.005394,0.003063,0.00227,0.001648,0.002534,0.001343,0.005341,0.003037,0.002253,0.001669,0.002523,0.000969
,2002-10-25T12:26:17Z,SAT013,-20.09,149.54,32.8,-999,-999,-999,-999,-999,-999,-999,-999,-999,-999,-999,-999
,2002-10-25T12:32:17Z,SAT013,-20.09,149.54,33,0.005424,0.003131,0.002277,0.001823,0.002797,0.001619,0.00537,0.003104,0.002259,0.001846,0.002785,0.001167
,2002-10-25T12:26:19Z,SAT013,-20.09,149.54,33.2,-999,-999,-999,-999,-999,-999,-999,-999,-999,-999,-999,-999
,2002-10-25T12:32:18Z,SAT013,-20.09,149.54,33.4,0.005657,0.003104,0.002254,0.001824,0.002741,0.001387,0.005597,0.003075,0.002236,0.001846,0.002726,0.001
,2002-10-25T12:26:20Z,SAT013,-20.09,149.54,33.6,-999,-999,-999,-999,-999,-999,-999,-999,-999,-999,-999,-999
,2002-10-25T12:32:19Z,SAT013,-20.09,149.54,33.8,0.005814,0.003307,0.002773,0.001767,0.004652,0.00161,0.005755,0.003278,0.00275,0.00179,0.004631,0.001161
,2002-10-25T12:26:21Z,SAT013,-20.09,149.54,34,-999,-999,-999,-999,-999,-999,-999,-999,-999,-999,-999,-999
,2002-10-25T12:32:20Z,SAT013,-20.09,149.54,34.2,0.006184,0.003324,0.002665,0.001962,0.003456,0.001731,0.006122,0.003294,0.002644,0.001987,0.00344,0.001248
,2002-10-25T12:26:22Z,SAT013,-20.09,149.54,34.4,-999,-999,-999,-999,-999,-999,-999,-999,-999,-999,-999,-999
,2002-10-25T12:26:23Z,SAT013,-20.09,149.54,34.6,-999,-999,-999,-999,-999,-999,-999,-999,-999,-999,-999,-999
,2002-10-25T12:26:23Z,SAT013,-20.09,149.54,34.8,-999,-999,-999,-999,-999,-999,-999,-999,-999,-999,-999,-999
,2002-10-25T12:26:24Z,SAT013,-20.09,149.54,35,-999,-999,-999,-999,-999,-999,-999,-999,-999,-999,-999,-999
,2002-10-25T12:26:24Z,SAT013,-20.09,149.54,35.2,-999,-999,-999,-999,-999,-999,-999,-999,-999,-999,-999,-999
,2002-10-25T12:26:25Z,SAT013,-20.09,149.54,35.4,-999,-999,-999,-999,-999,-999,-999,-999,-999,-999,-999,-999
,2002-10-25T12:26:26Z,SAT013,-20.09,149.54,35.6,-999,-999,-999,-999,-999,-999,-999,-999,-999,-999,-999,-999
,2002-10-25T12:26:26Z,SAT013,-20.09,149.54,35.8,-999,-999,-999,-999,-999,-999,-999,-999,-999,-999,-999,-999
,2002-10-25T12:26:27Z,SAT013,-20.09,149.54,36,-999,-999,-999,-999,-999,-999,-999,-999,-999,-999,-999,-999
,2002-10-25T12:26:27Z,SAT013,-20.09,149.54,36.2,-999,-999,-999,-999,-999,-999,-999,-999,-999,-999,-999,-999
,2002-10-25T12:26:28Z,SAT013,-20.09,149.54,36.4,-999,-999,-999,-999,-999,-999,-999,-999,-999,-999,-999,-999
,2002-10-25T12:26:29Z,SAT013,-20.09,149.54,36.6,-999,-999,-999,-999,-999,-999,-999,-999,-999,-999,-999,-999
,2002-10-25T12:26:29Z,SAT013,-20.09,149.54,36.8,-999,-999,-999,-999,-999,-999,-999,-999,-999,-999,-999,-999
,2002-10-25T12:26:30Z,SAT013,-20.09,149.54,37,-999,-999,-999,-999,-999,-999,-999,-999,-999,-999,-999,-999
,2002-10-25T12:26:30Z,SAT013,-20.09,149.54,37.2,-999,-999,-999,-999,-999,-999,-999,-999,-999,-999,-999,-999
,2002-10-25T12:26:31Z,SAT013,-20.09,149.54,37.4,-999,-999,-999,-999,-999,-999,-999,-999,-999,-999,-999,-999
,2002-10-25T12:26:32Z,SAT013,-20.09,149.54,37.6,-999,-999,-999,-999,-999,-999,-999,-999,-999,-999,-999,-999
,2002-10-25T12:26:32Z,SAT013,-20.09,149.54,37.8,-999,-999,-999,-999,-999,-999,-999,-999,-999,-999,-999,-999
,2002-10-25T12:26:33Z,SAT013,-20.09,149.54,38,-999,-999,-999,-999,-999,-999,-999,-999,-999,-999,-999,-999
,2002-10-25T12:26:33Z,SAT013,-20.09,149.54,38.2,-999,-999,-999,-999,-999,-999,-999,-999,-999,-999,-999,-999
,2002-10-25T12:26:34Z,SAT013,-20.09,149.54,38.4,-999,-999,-999,-999,-999,-999,-999,-999,-999,-999,-999,-999
,2002-10-25T12:26:34Z,SAT013,-20.09,149.54,38.6,-999,-999,-999,-999,-999,-999,-999,-999,-999,-999,-999,-999
,2002-10-25T12:26:35Z,SAT013,-20.09,149.54,38.8,-999,-999,-999,-999,-999,-999,-999,-999,-999,-999,-999,-999
,2002-10-25T12:26:36Z,SAT013,-20.09,149.54,39,-999,-999,-999,-999,-999,-999,-999,-999,-999,-999,-999,-999
,2002-10-25T12:26:36Z,SAT013,-20.09,149.54,39.2,-999,-999,-999,-999,-999,-999,-999,-999,-999,-999,-999,-999
,2002-10-25T12:26:37Z,SAT013,-20.09,149.54,39.4,-999,-999,-999,-999,-999,-999,-999,-999,-999,-999,-999,-999
,2002-10-25T12:26:37Z,SAT013,-20.09,149.54,39.6,-999,-999,-999,-999,-999,-999,-999,-999,-999,-999,-999,-999
,2002-10-25T12:26:38Z,SAT013,-20.09,149.54,39.8,-999,-999,-999,-999,-999,-999,-999,-999,-999,-999,-999,-999
,2002-10-25T12:26:39Z,SAT013,-20.09,149.54,40,-999,-999,-999,-999,-999,-999,-999,-999,-999,-999,-999,-999
,2002-10-25T12:26:39Z,SAT013,-20.09,149.54,40.2,-999,-999,-999,-999,-999,-999,-999,-999,-999,-999,-999,-999
,2002-10-25T12:26:40Z,SAT013,-20.09,149.54,40.4,-999,-999,-999,-999,-999,-999,-999,-999,-999,-999,-999,-999
,2002-10-25T12:26:40Z,SAT013,-20.09,149.54,40.6,-999,-999,-999,-999,-999,-999,-999,-999,-999,-999,-999,-999
,2002-10-25T12:26:41Z,SAT013,-20.09,149.54,40.8,-999,-999,-999,-999,-999,-999,-999,-999,-999,-999,-999,-999
,2002-10-25T12:26:42Z,SAT013,-20.09,149.54,41,-999,-999,-999,-999,-999,-999,-999,-999,-999,-999,-999,-999
,2002-10-25T12:26:42Z,SAT013,-20.09,149.54,41.2,-999,-999,-999,-999,-999,-999,-999,-999,-999,-999,-999,-999
,2002-10-25T12:26:43Z,SAT013,-20.09,149.54,41.4,-999,-999,-999,-999,-999,-999,-999,-999,-999,-999,-999,-999
,2002-10-25T12:26:43Z,SAT013,-20.09,149.54,41.6,-999,-999,-999,-999,-999,-999,-999,-999,-999,-999,-999,-999
,2002-10-25T12:26:44Z,SAT013,-20.09,149.54,41.8,-999,-999,-999,-999,-999,-999,-999,-999,-999,-999,-999,-999
,2002-10-25T12:26:44Z,SAT013,-20.09,149.54,42,-999,-999,-999,-999,-999,-999,-999,-999,-999,-999,-999,-999
,2002-10-25T12:26:45Z,SAT013,-20.09,149.54,42.2,-999,-999,-999,-999,-999,-999,-999,-999,-999,-999,-999,-999
,2002-10-25T12:26:46Z,SAT013,-20.09,149.54,42.4,-999,-999,-999,-999,-999,-999,-999,-999,-999,-999,-999,-999
,2002-10-25T12:26:46Z,SAT013,-20.09,149.54,42.6,-999,-999,-999,-999,-999,-999,-999,-999,-999,-999,-999,-999
,2002-10-25T12:26:47Z,SAT013,-20.09,149.54,42.8,-999,-999,-999,-999,-999,-999,-999,-999,-999,-999,-999,-999
,2002-10-25T12:26:47Z,SAT013,-20.09,149.54,43,-999,-999,-999,-999,-999,-999,-999,-999,-999,-999,-999,-999
,2002-10-25T12:26:48Z,SAT013,-20.09,149.54,43.2,-999,-999,-999,-999,-999,-999,-999,-999,-999,-999,-999,-999
,2002-10-25T12:26:49Z,SAT013,-20.09,149.54,43.4,-999,-999,-999,-999,-999,-999,-999,-999,-999,-999,-999,-999
,2002-10-25T12:26:49Z,SAT013,-20.09,149.54,43.6,-999,-999,-999,-999,-999,-999,-999,-999,-999,-999,-999,-999
,2002-10-25T12:26:50Z,SAT013,-20.09,149.54,43.8,-999,-999,-999,-999,-999,-999,-999,-999,-999,-999,-999,-999
,2002-10-25T12:26:50Z,SAT013,-20.09,149.54,44,-999,-999,-999,-999,-999,-999,-999,-999,-999,-999,-999,-999
,2002-10-25T12:26:51Z,SAT013,-20.09,149.54,44.2,-999,-999,-999,-999,-999,-999,-999,-999,-999,-999,-999,-999
,2002-10-25T12:26:51Z,SAT013,-20.09,149.54,44.4,-999,-999,-999,-999,-999,-999,-999,-999,-999,-999,-999,-999
,2002-10-25T12:26:52Z,SAT013,-20.09,149.54,44.6,-999,-999,-999,-999,-999,-999,-999,-999,-999,-999,-999,-999
,2002-10-25T12:26:53Z,SAT013,-20.09,149.54,44.8,-999,-999,-999,-999,-999,-999,-999,-999,-999,-999,-999,-999
,2002-10-25T12:26:53Z,SAT013,-20.09,149.54,45,-999,-999,-999,-999,-999,-999,-999,-999,-999,-999,-999,-999
,2002-10-25T12:26:54Z,SAT013,-20.09,149.54,45.2,-999,-999,-999,-999,-999,-999,-999,-999,-999,-999,-999,-999
,2002-10-25T12:26:54Z,SAT013,-20.09,149.54,45.4,-999,-999,-999,-999,-999,-999,-999,-999,-999,-999,-999,-999
,2002-10-25T12:26:55Z,SAT013,-20.09,149.54,45.6,-999,-999,-999,-999,-999,-999,-999,-999,-999,-999,-999,-999
,2002-10-25T12:26:56Z,SAT013,-20.09,149.54,45.8,-999,-999,-999,-999,-999,-999,-999,-999,-999,-999,-999,-999
,2002-10-25T12:26:56Z,SAT013,-20.09,149.54,46,-999,-999,-999,-999,-999,-999,-999,-999,-999,-999,-999,-999
,2002-10-25T12:26:57Z,SAT013,-20.09,149.54,46.2,-999,-999,-999,-999,-999,-999,-999,-999,-999,-999,-999,-999
,2002-10-25T12:26:57Z,SAT013,-20.09,149.54,46.4,-999,-999,-999,-999,-999,-999,-999,-999,-999,-999,-999,-999
,2002-10-25T12:26:58Z,SAT013,-20.09,149.54,46.6,-999,-999,-999,-999,-999,-999,-999,-999,-999,-999,-999,-999
,2002-10-25T12:26:59Z,SAT013,-20.09,149.54,46.8,-999,-999,-999,-999,-999,-999,-999,-999,-999,-999,-999,-999
,2002-10-25T12:26:59Z,SAT013,-20.09,149.54,47,-999,-999,-999,-999,-999,-999,-999,-999,-999,-999,-999,-999
,2002-10-25T12:27:00Z,SAT013,-20.09,149.54,47.2,-999,-999,-999,-999,-999,-999,-999,-999,-999,-999,-999,-999
,2002-10-25T12:27:00Z,SAT013,-20.09,149.54,47.4,-999,-999,-999,-999,-999,-999,-999,-999,-999,-999,-999,-999
,2002-10-25T12:27:01Z,SAT013,-20.09,149.54,47.6,-999,-999,-999,-999,-999,-999,-999,-999,-999,-999,-999,-999
,2002-10-25T12:27:01Z,SAT013,-20.09,149.54,47.8,-999,-999,-999,-999,-999,-999,-999,-999,-999,-999,-999,-999
,2002-10-25T12:27:02Z,SAT013,-20.09,149.54,48,-999,-999,-999,-999,-999,-999,-999,-999,-999,-999,-999,-999
,2002-10-25T12:27:03Z,SAT013,-20.09,149.54,48.2,-999,-999,-999,-999,-999,-999,-999,-999,-999,-999,-999,-999
,2002-10-25T12:27:03Z,SAT013,-20.09,149.54,48.4,-999,-999,-999,-999,-999,-999,-999,-999,-999,-999,-999,-999
,2002-10-25T12:27:04Z,SAT013,-20.09,149.54,48.6,-999,-999,-999,-999,-999,-999,-999,-999,-999,-999,-999,-999
,2002-10-25T12:27:04Z,SAT013,-20.09,149.54,48.8,-999,-999,-999,-999,-999,-999,-999,-999,-999,-999,-999,-999
,2002-10-25T12:27:05Z,SAT013,-20.09,149.54,49,-999,-999,-999,-999,-999,-999,-999,-999,-999,-999,-999,-999
,2002-10-25T12:27:06Z,SAT013,-20.09,149.54,49.2,-999,-999,-999,-999,-999,-999,-999,-999,-999,-999,-999,-999
,2002-10-25T12:27:06Z,SAT013,-20.09,149.54,49.4,-999,-999,-999,-999,-999,-999,-999,-999,-999,-999,-999,-999
,2002-10-25T12:27:07Z,SAT013,-20.09,149.54,49.6,-999,-999,-999,-999,-999,-999,-999,-999,-999,-999,-999,-999
,2002-10-25T12:27:07Z,SAT013,-20.09,149.54,49.8,-999,-999,-999,-999,-999,-999,-999,-999,-999,-999,-999,-999
,2002-10-25T12:27:08Z,SAT013,-20.09,149.54,50,-999,-999,-999,-999,-999,-999,-999,-999,-999,-999,-999,-999
,2002-10-25T12:27:09Z,SAT013,-20.09,149.54,50.2,-999,-999,-999,-999,-999,-999,-999,-999,-999,-999,-999,-999
,2002-10-25T12:27:09Z,SAT013,-20.09,149.54,50.4,-999,-999,-999,-999,-999,-999,-999,-999,-999,-999,-999,-999
,2002-10-25T12:27:10Z,SAT013,-20.09,149.54,50.6,-999,-999,-999,-999,-999,-999,-999,-999,-999,-999,-999,-999
,2002-10-25T12:27:10Z,SAT013,-20.09,149.54,50.8,-999,-999,-999,-999,-999,-999,-999,-999,-999,-999,-999,-999
,2002-10-25T12:27:11Z,SAT013,-20.09,149.54,51,-999,-999,-999,-999,-999,-999,-999,-999,-999,-999,-999,-999
,2002-10-25T12:27:11Z,SAT013,-20.09,149.54,51.2,-999,-999,-999,-999,-999,-999,-999,-999,-999,-999,-999,-999
,2002-10-25T12:27:12Z,SAT013,-20.09,149.54,51.4,-999,-999,-999,-999,-999,-999,-999,-999,-999,-999,-999,-999
,2002-10-25T12:27:13Z,SAT013,-20.09,149.54,51.6,-999,-999,-999,-999,-999,-999,-999,-999,-999,-999,-999,-999
,2002-10-25T12:27:13Z,SAT013,-20.09,149.54,51.8,-999,-999,-999,-999,-999,-999,-999,-999,-999,-999,-999,-999
,2002-10-25T12:27:14Z,SAT013,-20.09,149.54,52,-999,-999,-999,-999,-999,-999,-999,-999,-999,-999,-999,-999
,2002-10-25T12:27:14Z,SAT013,-20.09,149.54,52.2,-999,-999,-999,-999,-999,-999,-999,-999,-999,-999,-999,-999
,2002-10-25T12:27:15Z,SAT013,-20.09,149.54,52.4,-999,-999,-999,-999,-999,-999,-999,-999,-999,-999,-999,-999
,2002-10-25T12:27:16Z,SAT013,-20.09,149.54,52.6,-999,-999,-999,-999,-999,-999,-999,-999,-999,-999,-999,-999
,2002-10-25T12:27:16Z,SAT013,-20.09,149.54,52.8,-999,-999,-999,-999,-999,-999,-999,-999,-999,-999,-999,-999
,2002-10-25T12:27:17Z,SAT013,-20.09,149.54,53,-999,-999,-999,-999,-999,-999,-999,-999,-999,-999,-999,-999
,2002-10-25T12:27:17Z,SAT013,-20.09,149.54,53.2,-999,-999,-999,-999,-999,-999,-999,-999,-999,-999,-999,-999
,2002-10-25T12:27:18Z,SAT013,-20.09,149.54,53.4,-999,-999,-999,-999,-999,-999,-999,-999,-999,-999,-999,-999
,2002-10-25T12:27:19Z,SAT013,-20.09,149.54,53.6,-999,-999,-999,-999,-999,-999,-999,-999,-999,-999,-999,-999
,2002-10-25T12:27:19Z,SAT013,-20.09,149.54,53.8,-999,-999,-999,-999,-999,-999,-999,-999,-999,-999,-999,-999
,2002-10-25T12:27:20Z,SAT013,-20.09,149.54,54,-999,-999,-999,-999,-999,-999,-999,-999,-999,-999,-999,-999
,2002-10-25T12:27:20Z,SAT013,-20.09,149.54,54.2,-999,-999,-999,-999,-999,-999,-999,-999,-999,-999,-999,-999
,2002-10-25T12:27:21Z,SAT013,-20.09,149.54,54.4,-999,-999,-999,-999,-999,-999,-999,-999,-999,-999,-999,-999
,2002-10-25T12:27:21Z,SAT013,-20.09,149.54,54.6,-999,-999,-999,-999,-999,-999,-999,-999,-999,-999,-999,-999
,2002-10-25T12:27:22Z,SAT013,-20.09,149.54,54.8,-999,-999,-999,-999,-999,-999,-999,-999,-999,-999,-999,-999
,2002-10-25T12:27:23Z,SAT013,-20.09,149.54,55,-999,-999,-999,-999,-999,-999,-999,-999,-999,-999,-999,-999
,2002-10-25T12:27:23Z,SAT013,-20.09,149.54,55.2,-999,-999,-999,-999,-999,-999,-999,-999,-999,-999,-999,-999
,2002-10-25T12:27:24Z,SAT013,-20.09,149.54,55.4,-999,-999,-999,-999,-999,-999,-999,-999,-999,-999,-999,-999
,2002-10-25T12:27:24Z,SAT013,-20.09,149.54,55.6,-999,-999,-999,-999,-999,-999,-999,-999,-999,-999,-999,-999
,2002-10-25T12:27:25Z,SAT013,-20.09,149.54,55.8,-999,-999,-999,-999,-999,-999,-999,-999,-999,-999,-999,-999
,2002-10-25T12:27:26Z,SAT013,-20.09,149.54,56,-999,-999,-999,-999,-999,-999,-999,-999,-999,-999,-999,-999
,2002-10-25T12:27:26Z,SAT013,-20.09,149.54,56.2,-999,-999,-999,-999,-999,-999,-999,-999,-999,-999,-999,-999
,2002-10-25T12:27:27Z,SAT013,-20.09,149.54,56.4,-999,-999,-999,-999,-999,-999,-999,-999,-999,-999,-999,-999
,2002-10-25T12:27:27Z,SAT013,-20.09,149.54,56.6,-999,-999,-999,-999,-999,-999,-999,-999,-999,-999,-999,-999
,2002-10-25T12:27:28Z,SAT013,-20.09,149.54,56.8,-999,-999,-999,-999,-999,-999,-999,-999,-999,-999,-999,-999
,2002-10-25T12:27:29Z,SAT013,-20.09,149.54,57,-999,-999,-999,-999,-999,-999,-999,-999,-999,-999,-999,-999
,2002-10-25T12:27:29Z,SAT013,-20.09,149.54,57.2,-999,-999,-999,-999,-999,-999,-999,-999,-999,-999,-999,-999
,2002-10-25T12:27:30Z,SAT013,-20.09,149.54,57.4,-999,-999,-999,-999,-999,-999,-999,-999,-999,-999,-999,-999
,2002-10-25T12:27:30Z,SAT013,-20.09,149.54,57.6,-999,-999,-999,-999,-999,-999,-999,-999,-999,-999,-999,-999
,2002-10-25T12:27:31Z,SAT013,-20.09,149.54,57.8,-999,-999,-999,-999,-999,-999,-999,-999,-999,-999,-999,-999
,2002-10-25T12:27:31Z,SAT013,-20.09,149.54,58,-999,-999,-999,-999,-999,-999,-999,-999,-999,-999,-999,-999
,2002-10-25T12:27:32Z,SAT013,-20.09,149.54,58.2,-999,-999,-999,-999,-999,-999,-999,-999,-999,-999,-999,-999
,2002-10-25T12:27:33Z,SAT013,-20.09,149.54,58.4,-999,-999,-999,-999,-999,-999,-999,-999,-999,-999,-999,-999
,2002-10-25T12:27:33Z,SAT013,-20.09,149.54,58.6,-999,-999,-999,-999,-999,-999,-999,-999,-999,-999,-999,-999
,2002-10-25T12:27:34Z,SAT013,-20.09,149.54,58.8,-999,-999,-999,-999,-999,-999,-999,-999,-999,-999,-999,-999
,2002-10-25T12:27:34Z,SAT013,-20.09,149.54,59,-999,-999,-999,-999,-999,-999,-999,-999,-999,-999,-999,-999
,2002-10-25T12:27:35Z,SAT013,-20.09,149.54,59.2,-999,-999,-999,-999,-999,-999,-999,-999,-999,-999,-999,-999
,2002-10-25T12:27:36Z,SAT013,-20.09,149.54,59.4,-999,-999,-999,-999,-999,-999,-999,-999,-999,-999,-999,-999
,2002-10-25T12:27:36Z,SAT013,-20.09,149.54,59.6,-999,-999,-999,-999,-999,-999,-999,-999,-999,-999,-999,-999
,2002-10-25T12:27:37Z,SAT013,-20.09,149.54,59.8,-999,-999,-999,-999,-999,-999,-999,-999,-999,-999,-999,-999
,2002-10-25T12:27:37Z,SAT013,-20.09,149.54,60,-999,-999,-999,-999,-999,-999,-999,-999,-999,-999,-999,-999
,2002-10-25T12:27:38Z,SAT013,-20.09,149.54,60.2,-999,-999,-999,-999,-999,-999,-999,-999,-999,-999,-999,-999
,2002-10-25T12:27:39Z,SAT013,-20.09,149.54,60.4,-999,-999,-999,-999,-999,-999,-999,-999,-999,-999,-999,-999
,2002-10-25T12:27:39Z,SAT013,-20.09,149.54,60.6,-999,-999,-999,-999,-999,-999,-999,-999,-999,-999,-999,-999
,2002-10-25T12:27:40Z,SAT013,-20.09,149.54,60.8,-999,-999,-999,-999,-999,-999,-999,-999,-999,-999,-999,-999
,2002-10-25T12:27:40Z,SAT013,-20.09,149.54,61,-999,-999,-999,-999,-999,-999,-999,-999,-999,-999,-999,-999
,2002-10-25T12:27:41Z,SAT013,-20.09,149.54,61.2,-999,-999,-999,-999,-999,-999,-999,-999,-999,-999,-999,-999
,2002-10-25T12:27:41Z,SAT013,-20.09,149.54,61.4,-999,-999,-999,-999,-999,-999,-999,-999,-999,-999,-999,-999
,2002-10-25T12:27:42Z,SAT013,-20.09,149.54,61.6,-999,-999,-999,-999,-999,-999,-999,-999,-999,-999,-999,-999
,2002-10-25T12:27:43Z,SAT013,-20.09,149.54,61.8,-999,-999,-999,-999,-999,-999,-999,-999,-999,-999,-999,-999
,2002-10-25T12:27:43Z,SAT013,-20.09,149.54,62,-999,-999,-999,-999,-999,-999,-999,-999,-999,-999,-999,-999
,2002-10-25T12:27:44Z,SAT013,-20.09,149.54,62.2,-999,-999,-999,-999,-999,-999,-999,-999,-999,-999,-999,-999
,2002-10-25T12:27:44Z,SAT013,-20.09,149.54,62.4,-999,-999,-999,-999,-999,-999,-999,-999,-999,-999,-999,-999
,2002-10-25T12:27:45Z,SAT013,-20.09,149.54,62.6,-999,-999,-999,-999,-999,-999,-999,-999,-999,-999,-999,-999
,2002-10-25T12:27:46Z,SAT013,-20.09,149.54,62.8,-999,-999,-999,-999,-999,-999,-999,-999,-999,-999,-999,-999
,2002-10-25T12:27:46Z,SAT013,-20.09,149.54,63,-999,-999,-999,-999,-999,-999,-999,-999,-999,-999,-999,-999
,2002-10-25T12:27:47Z,SAT013,-20.09,149.54,63.2,-999,-999,-999,-999,-999,-999,-999,-999,-999,-999,-999,-999
,2002-10-25T12:27:47Z,SAT013,-20.09,149.54,63.4,-999,-999,-999,-999,-999,-999,-999,-999,-999,-999,-999,-999
,2002-10-25T12:27:48Z,SAT013,-20.09,149.54,63.6,-999,-999,-999,-999,-999,-999,-999,-999,-999,-999,-999,-999
,2002-10-25T12:27:49Z,SAT013,-20.09,149.54,63.8,-999,-999,-999,-999,-999,-999,-999,-999,-999,-999,-999,-999
,2002-10-25T12:27:49Z,SAT013,-20.09,149.54,64,-999,-999,-999,-999,-999,-999,-999,-999,-999,-999,-999,-999
,2002-10-25T12:27:50Z,SAT013,-20.09,149.54,64.2,-999,-999,-999,-999,-999,-999,-999,-999,-999,-999,-999,-999
,2002-10-25T12:27:50Z,SAT013,-20.09,149.54,64.4,-999,-999,-999,-999,-999,-999,-999,-999,-999,-999,-999,-999
,2002-10-25T12:27:51Z,SAT013,-20.09,149.54,64.6,-999,-999,-999,-999,-999,-999,-999,-999,-999,-999,-999,-999
,2002-10-25T12:27:51Z,SAT013,-20.09,149.54,64.8,-999,-999,-999,-999,-999,-999,-999,-999,-999,-999,-999,-999
,2002-10-25T12:27:52Z,SAT013,-20.09,149.54,65,-999,-999,-999,-999,-999,-999,-999,-999,-999,-999,-999,-999
,2002-10-25T12:27:53Z,SAT013,-20.09,149.54,65.2,-999,-999,-999,-999,-999,-999,-999,-999,-999,-999,-999,-999
,2002-10-25T12:27:53Z,SAT013,-20.09,149.54,65.4,-999,-999,-999,-999,-999,-999,-999,-999,-999,-999,-999,-999
,2002-10-25T12:27:54Z,SAT013,-20.09,149.54,65.6,-999,-999,-999,-999,-999,-999,-999,-999,-999,-999,-999,-999
,2002-10-25T12:27:54Z,SAT013,-20.09,149.54,65.8,-999,-999,-999,-999,-999,-999,-999,-999,-999,-999,-999,-999
,2002-10-25T12:27:55Z,SAT013,-20.09,149.54,66,-999,-999,-999,-999,-999,-999,-999,-999,-999,-999,-999,-999
,2002-10-25T12:27:56Z,SAT013,-20.09,149.54,66.2,-999,-999,-999,-999,-999,-999,-999,-999,-999,-999,-999,-999
,2002-10-25T12:27:56Z,SAT013,-20.09,149.54,66.4,-999,-999,-999,-999,-999,-999,-999,-999,-999,-999,-999,-999
,2002-10-25T12:27:57Z,SAT013,-20.09,149.54,66.6,-999,-999,-999,-999,-999,-999,-999,-999,-999,-999,-999,-999
,2002-10-25T12:27:57Z,SAT013,-20.09,149.54,66.8,-999,-999,-999,-999,-999,-999,-999,-999,-999,-999,-999,-999
,2002-10-25T12:27:58Z,SAT013,-20.09,149.54,67,-999,-999,-999,-999,-999,-999,-999,-999,-999,-999,-999,-999
,2002-10-25T12:27:59Z,SAT013,-20.09,149.54,67.2,-999,-999,-999,-999,-999,-999,-999,-999,-999,-999,-999,-999
,2002-10-25T12:27:59Z,SAT013,-20.09,149.54,67.4,-999,-999,-999,-999,-999,-999,-999,-999,-999,-999,-999,-999
,2002-10-25T12:28:00Z,SAT013,-20.09,149.54,67.6,-999,-999,-999,-999,-999,-999,-999,-999,-999,-999,-999,-999
,2002-10-25T12:28:00Z,SAT013,-20.09,149.54,67.8,-999,-999,-999,-999,-999,-999,-999,-999,-999,-999,-999,-999
,2002-10-25T12:28:01Z,SAT013,-20.09,149.54,68,-999,-999,-999,-999,-999,-999,-999,-999,-999,-999,-999,-999
,2002-10-25T12:28:01Z,SAT013,-20.09,149.54,68.2,-999,-999,-999,-999,-999,-999,-999,-999,-999,-999,-999,-999
,2002-10-25T12:28:02Z,SAT013,-20.09,149.54,68.4,-999,-999,-999,-999,-999,-999,-999,-999,-999,-999,-999,-999
,2002-10-25T12:28:03Z,SAT013,-20.09,149.54,68.6,-999,-999,-999,-999,-999,-999,-999,-999,-999,-999,-999,-999
,2002-10-25T12:28:03Z,SAT013,-20.09,149.54,68.8,-999,-999,-999,-999,-999,-999,-999,-999,-999,-999,-999,-999
,2002-10-25T12:28:04Z,SAT013,-20.09,149.54,69,-999,-999,-999,-999,-999,-999,-999,-999,-999,-999,-999,-999
,2002-10-25T12:28:04Z,SAT013,-20.09,149.54,69.2,-999,-999,-999,-999,-999,-999,-999,-999,-999,-999,-999,-999
,2002-10-25T12:28:05Z,SAT013,-20.09,149.54,69.4,-999,-999,-999,-999,-999,-999,-999,-999,-999,-999,-999,-999
,2002-10-25T12:28:06Z,SAT013,-20.09,149.54,69.6,-999,-999,-999,-999,-999,-999,-999,-999,-999,-999,-999,-999
,2002-10-25T12:28:06Z,SAT013,-20.09,149.54,69.8,-999,-999,-999,-999,-999,-999,-999,-999,-999,-999,-999,-999
,2002-10-25T12:28:07Z,SAT013,-20.09,149.54,70,-999,-999,-999,-999,-999,-999,-999,-999,-999,-999,-999,-999
,2002-10-25T12:28:07Z,SAT013,-20.09,149.54,70.2,-999,-999,-999,-999,-999,-999,-999,-999,-999,-999,-999,-999
,2002-10-25T12:28:08Z,SAT013,-20.09,149.54,70.4,-999,-999,-999,-999,-999,-999,-999,-999,-999,-999,-999,-999
,2002-10-25T12:28:09Z,SAT013,-20.09,149.54,70.6,-999,-999,-999,-999,-999,-999,-999,-999,-999,-999,-999,-999
,2002-10-25T12:28:09Z,SAT013,-20.09,149.54,70.8,-999,-999,-999,-999,-999,-999,-999,-999,-999,-999,-999,-999
,2002-10-25T12:28:10Z,SAT013,-20.09,149.54,71,-999,-999,-999,-999,-999,-999,-999,-999,-999,-999,-999,-999
,2002-10-25T12:28:10Z,SAT013,-20.09,149.54,71.2,-999,-999,-999,-999,-999,-999,-999,-999,-999,-999,-999,-999
,2002-10-25T12:28:11Z,SAT013,-20.09,149.54,71.4,-999,-999,-999,-999,-999,-999,-999,-999,-999,-999,-999,-999
,2002-10-25T12:28:11Z,SAT013,-20.09,149.54,71.6,-999,-999,-999,-999,-999,-999,-999,-999,-999,-999,-999,-999
,2002-10-25T12:28:12Z,SAT013,-20.09,149.54,71.8,-999,-999,-999,-999,-999,-999,-999,-999,-999,-999,-999,-999
,2002-10-25T12:28:13Z,SAT013,-20.09,149.54,72,-999,-999,-999,-999,-999,-999,-999,-999,-999,-999,-999,-999
,2002-10-25T12:28:13Z,SAT013,-20.09,149.54,72.2,-999,-999,-999,-999,-999,-999,-999,-999,-999,-999,-999,-999
,2002-10-25T12:28:14Z,SAT013,-20.09,149.54,72.4,-999,-999,-999,-999,-999,-999,-999,-999,-999,-999,-999,-999
,2002-10-25T12:28:14Z,SAT013,-20.09,149.54,72.6,-999,-999,-999,-999,-999,-999,-999,-999,-999,-999,-999,-999
,2002-10-25T12:28:15Z,SAT013,-20.09,149.54,72.8,-999,-999,-999,-999,-999,-999,-999,-999,-999,-999,-999,-999
,2002-10-25T12:28:16Z,SAT013,-20.09,149.54,73,-999,-999,-999,-999,-999,-999,-999,-999,-999,-999,-999,-999
,2002-10-25T12:28:16Z,SAT013,-20.09,149.54,73.2,-999,-999,-999,-999,-999,-999,-999,-999,-999,-999,-999,-999
,2002-10-25T12:28:17Z,SAT013,-20.09,149.54,73.4,-999,-999,-999,-999,-999,-999,-999,-999,-999,-999,-999,-999
,2002-10-25T12:28:17Z,SAT013,-20.09,149.54,73.6,-999,-999,-999,-999,-999,-999,-999,-999,-999,-999,-999,-999
,2002-10-25T12:28:18Z,SAT013,-20.09,149.54,73.8,-999,-999,-999,-999,-999,-999,-999,-999,-999,-999,-999,-999
,2002-10-25T12:28:18Z,SAT013,-20.09,149.54,74,-999,-999,-999,-999,-999,-999,-999,-999,-999,-999,-999,-999
,2002-10-25T12:28:19Z,SAT013,-20.09,149.54,74.2,-999,-999,-999,-999,-999,-999,-999,-999,-999,-999,-999,-999
,2002-10-25T12:28:20Z,SAT013,-20.09,149.54,74.4,-999,-999,-999,-999,-999,-999,-999,-999,-999,-999,-999,-999
,2002-10-25T12:28:20Z,SAT013,-20.09,149.54,74.6,-999,-999,-999,-999,-999,-999,-999,-999,-999,-999,-999,-999
,2002-10-25T12:28:21Z,SAT013,-20.09,149.54,74.8,-999,-999,-999,-999,-999,-999,-999,-999,-999,-999,-999,-999
,2002-10-25T12:28:21Z,SAT013,-20.09,149.54,75,-999,-999,-999,-999,-999,-999,-999,-999,-999,-999,-999,-999
,2002-10-25T12:28:22Z,SAT013,-20.09,149.54,75.2,-999,-999,-999,-999,-999,-999,-999,-999,-999,-999,-999,-999
,2002-10-25T12:28:23Z,SAT013,-20.09,149.54,75.4,-999,-999,-999,-999,-999,-999,-999,-999,-999,-999,-999,-999
,2002-10-25T12:28:23Z,SAT013,-20.09,149.54,75.6,-999,-999,-999,-999,-999,-999,-999,-999,-999,-999,-999,-999
,2002-10-25T12:28:24Z,SAT013,-20.09,149.54,75.8,-999,-999,-999,-999,-999,-999,-999,-999,-999,-999,-999,-999
,2002-10-25T12:28:24Z,SAT013,-20.09,149.54,76,-999,-999,-999,-999,-999,-999,-999,-999,-999,-999,-999,-999
,2002-10-25T12:28:25Z,SAT013,-20.09,149.54,76.2,-999,-999,-999,-999,-999,-999,-999,-999,-999,-999,-999,-999
,2002-10-25T12:28:26Z,SAT013,-20.09,149.54,76.4,-999,-999,-999,-999,-999,-999,-999,-999,-999,-999,-999,-999
,2002-10-25T12:28:26Z,SAT013,-20.09,149.54,76.6,-999,-999,-999,-999,-999,-999,-999,-999,-999,-999,-999,-999
,2002-10-25T12:28:27Z,SAT013,-20.09,149.54,76.8,-999,-999,-999,-999,-999,-999,-999,-999,-999,-999,-999,-999
,2002-10-25T12:28:27Z,SAT013,-20.09,149.54,77,-999,-999,-999,-999,-999,-999,-999,-999,-999,-999,-999,-999
,2002-10-25T12:28:28Z,SAT013,-20.09,149.54,77.2,-999,-999,-999,-999,-999,-999,-999,-999,-999,-999,-999,-999
,2002-10-25T12:28:28Z,SAT013,-20.09,149.54,77.4,-999,-999,-999,-999,-999,-999,-999,-999,-999,-999,-999,-999
,2002-10-25T12:28:29Z,SAT013,-20.09,149.54,77.6,-999,-999,-999,-999,-999,-999,-999,-999,-999,-999,-999,-999
,2002-10-25T12:28:30Z,SAT013,-20.09,149.54,77.8,-999,-999,-999,-999,-999,-999,-999,-999,-999,-999,-999,-999
,2002-10-25T12:28:30Z,SAT013,-20.09,149.54,78,-999,-999,-999,-999,-999,-999,-999,-999,-999,-999,-999,-999
,2002-10-25T12:28:31Z,SAT013,-20.09,149.54,78.2,-999,-999,-999,-999,-999,-999,-999,-999,-999,-999,-999,-999
,2002-10-25T12:28:31Z,SAT013,-20.09,149.54,78.4,-999,-999,-999,-999,-999,-999,-999,-999,-999,-999,-999,-999
,2002-10-25T12:28:32Z,SAT013,-20.09,149.54,78.6,-999,-999,-999,-999,-999,-999,-999,-999,-999,-999,-999,-999
,2002-10-25T12:28:33Z,SAT013,-20.09,149.54,78.8,-999,-999,-999,-999,-999,-999,-999,-999,-999,-999,-999,-999
,2002-10-25T12:28:33Z,SAT013,-20.09,149.54,79,-999,-999,-999,-999,-999,-999,-999,-999,-999,-999,-999,-999
,2002-10-25T12:28:34Z,SAT013,-20.09,149.54,79.2,-999,-999,-999,-999,-999,-999,-999,-999,-999,-999,-999,-999
,2002-10-25T12:28:34Z,SAT013,-20.09,149.54,79.4,-999,-999,-999,-999,-999,-999,-999,-999,-999,-999,-999,-999
,2002-10-25T12:28:35Z,SAT013,-20.09,149.54,79.6,-999,-999,-999,-999,-999,-999,-999,-999,-999,-999,-999,-999
,2002-10-25T12:28:36Z,SAT013,-20.09,149.54,79.8,-999,-999,-999,-999,-999,-999,-999,-999,-999,-999,-999,-999
,2002-10-25T12:28:36Z,SAT013,-20.09,149.54,80,-999,-999,-999,-999,-999,-999,-999,-999,-999,-999,-999,-999
,2002-10-25T12:28:37Z,SAT013,-20.09,149.54,80.2,-999,-999,-999,-999,-999,-999,-999,-999,-999,-999,-999,-999
,2002-10-25T12:28:37Z,SAT013,-20.09,149.54,80.4,-999,-999,-999,-999,-999,-999,-999,-999,-999,-999,-999,-999
,2002-10-25T12:28:38Z,SAT013,-20.09,149.54,80.6,-999,-999,-999,-999,-999,-999,-999,-999,-999,-999,-999,-999
,2002-10-25T12:28:38Z,SAT013,-20.09,149.54,80.8,-999,-999,-999,-999,-999,-999,-999,-999,-999,-999,-999,-999
,2002-10-25T12:28:39Z,SAT013,-20.09,149.54,81,-999,-999,-999,-999,-999,-999,-999,-999,-999,-999,-999,-999
,2002-10-25T12:28:40Z,SAT013,-20.09,149.54,81.2,-999,-999,-999,-999,-999,-999,-999,-999,-999,-999,-999,-999
,2002-10-25T12:28:40Z,SAT013,-20.09,149.54,81.4,-999,-999,-999,-999,-999,-999,-999,-999,-999,-999,-999,-999
,2002-10-25T12:28:41Z,SAT013,-20.09,149.54,81.6,-999,-999,-999,-999,-999,-999,-999,-999,-999,-999,-999,-999
,2002-10-25T12:28:41Z,SAT013,-20.09,149.54,81.8,-999,-999,-999,-999,-999,-999,-999,-999,-999,-999,-999,-999
,2002-10-25T12:28:42Z,SAT013,-20.09,149.54,82,-999,-999,-999,-999,-999,-999,-999,-999,-999,-999,-999,-999
,2002-10-25T12:28:43Z,SAT013,-20.09,149.54,82.2,-999,-999,-999,-999,-999,-999,-999,-999,-999,-999,-999,-999
,2002-10-25T12:28:43Z,SAT013,-20.09,149.54,82.4,-999,-999,-999,-999,-999,-999,-999,-999,-999,-999,-999,-999
,2002-10-25T12:28:44Z,SAT013,-20.09,149.54,82.6,-999,-999,-999,-999,-999,-999,-999,-999,-999,-999,-999,-999
,2002-10-25T12:28:44Z,SAT013,-20.09,149.54,82.8,-999,-999,-999,-999,-999,-999,-999,-999,-999,-999,-999,-999
,2002-10-25T12:28:45Z,SAT013,-20.09,149.54,83,-999,-999,-999,-999,-999,-999,-999,-999,-999,-999,-999,-999
,2002-10-25T12:28:46Z,SAT013,-20.09,149.54,83.2,-999,-999,-999,-999,-999,-999,-999,-999,-999,-999,-999,-999
,2002-10-25T12:28:46Z,SAT013,-20.09,149.54,83.4,-999,-999,-999,-999,-999,-999,-999,-999,-999,-999,-999,-999
,2002-10-25T12:28:47Z,SAT013,-20.09,149.54,83.6,-999,-999,-999,-999,-999,-999,-999,-999,-999,-999,-999,-999
,2002-10-25T12:28:47Z,SAT013,-20.09,149.54,83.8,-999,-999,-999,-999,-999,-999,-999,-999,-999,-999,-999,-999
,2002-10-25T12:28:48Z,SAT013,-20.09,149.54,84,-999,-999,-999,-999,-999,-999,-999,-999,-999,-999,-999,-999
,2002-10-25T12:28:48Z,SAT013,-20.09,149.54,84.2,-999,-999,-999,-999,-999,-999,-999,-999,-999,-999,-999,-999
,2002-10-25T12:28:49Z,SAT013,-20.09,149.54,84.4,-999,-999,-999,-999,-999,-999,-999,-999,-999,-999,-999,-999
,2002-10-25T12:28:50Z,SAT013,-20.09,149.54,84.6,-999,-999,-999,-999,-999,-999,-999,-999,-999,-999,-999,-999
,2002-10-25T12:28:50Z,SAT013,-20.09,149.54,84.8,-999,-999,-999,-999,-999,-999,-999,-999,-999,-999,-999,-999
,2002-10-25T12:28:51Z,SAT013,-20.09,149.54,85,-999,-999,-999,-999,-999,-999,-999,-999,-999,-999,-999,-999
,2002-10-25T12:28:51Z,SAT013,-20.09,149.54,85.2,-999,-999,-999,-999,-999,-999,-999,-999,-999,-999,-999,-999
,2002-10-25T12:28:52Z,SAT013,-20.09,149.54,85.4,-999,-999,-999,-999,-999,-999,-999,-999,-999,-999,-999,-999
,2002-10-25T12:28:53Z,SAT013,-20.09,149.54,85.6,-999,-999,-999,-999,-999,-999,-999,-999,-999,-999,-999,-999
,2002-10-25T12:28:53Z,SAT013,-20.09,149.54,85.8,-999,-999,-999,-999,-999,-999,-999,-999,-999,-999,-999,-999
,2002-10-25T12:28:54Z,SAT013,-20.09,149.54,86,-999,-999,-999,-999,-999,-999,-999,-999,-999,-999,-999,-999
,2002-10-25T12:28:54Z,SAT013,-20.09,149.54,86.2,-999,-999,-999,-999,-999,-999,-999,-999,-999,-999,-999,-999
,2002-10-25T12:28:55Z,SAT013,-20.09,149.54,86.4,-999,-999,-999,-999,-999,-999,-999,-999,-999,-999,-999,-999
,2002-10-25T12:28:56Z,SAT013,-20.09,149.54,86.6,-999,-999,-999,-999,-999,-999,-999,-999,-999,-999,-999,-999
,2002-10-25T12:28:56Z,SAT013,-20.09,149.54,86.8,-999,-999,-999,-999,-999,-999,-999,-999,-999,-999,-999,-999
,2002-10-25T12:28:57Z,SAT013,-20.09,149.54,87,-999,-999,-999,-999,-999,-999,-999,-999,-999,-999,-999,-999
,2002-10-25T12:28:57Z,SAT013,-20.09,149.54,87.2,-999,-999,-999,-999,-999,-999,-999,-999,-999,-999,-999,-999
,2002-10-25T12:28:58Z,SAT013,-20.09,149.54,87.4,-999,-999,-999,-999,-999,-999,-999,-999,-999,-999,-999,-999
,2002-10-25T12:28:58Z,SAT013,-20.09,149.54,87.6,-999,-999,-999,-999,-999,-999,-999,-999,-999,-999,-999,-999
,2002-10-25T12:28:59Z,SAT013,-20.09,149.54,87.8,-999,-999,-999,-999,-999,-999,-999,-999,-999,-999,-999,-999
,2002-10-25T12:29:00Z,SAT013,-20.09,149.54,88,-999,-999,-999,-999,-999,-999,-999,-999,-999,-999,-999,-999
,2002-10-25T12:29:00Z,SAT013,-20.09,149.54,88.2,-999,-999,-999,-999,-999,-999,-999,-999,-999,-999,-999,-999
,2002-10-25T12:29:01Z,SAT013,-20.09,149.54,88.4,-999,-999,-999,-999,-999,-999,-999,-999,-999,-999,-999,-999
,2002-10-25T12:29:01Z,SAT013,-20.09,149.54,88.6,-999,-999,-999,-999,-999,-999,-999,-999,-999,-999,-999,-999
,2002-10-25T12:29:02Z,SAT013,-20.09,149.54,88.8,-999,-999,-999,-999,-999,-999,-999,-999,-999,-999,-999,-999
,2002-10-25T12:29:03Z,SAT013,-20.09,149.54,89,-999,-999,-999,-999,-999,-999,-999,-999,-999,-999,-999,-999
,2002-10-25T12:29:03Z,SAT013,-20.09,149.54,89.2,-999,-999,-999,-999,-999,-999,-999,-999,-999,-999,-999,-999
,2002-10-25T12:29:04Z,SAT013,-20.09,149.54,89.4,-999,-999,-999,-999,-999,-999,-999,-999,-999,-999,-999,-999
,2002-10-25T12:29:04Z,SAT013,-20.09,149.54,89.6,-999,-999,-999,-999,-999,-999,-999,-999,-999,-999,-999,-999
,2002-10-25T12:29:05Z,SAT013,-20.09,149.54,89.8,-999,-999,-999,-999,-999,-999,-999,-999,-999,-999,-999,-999
,2002-10-25T12:29:06Z,SAT013,-20.09,149.54,90,-999,-999,-999,-999,-999,-999,-999,-999,-999,-999,-999,-999
,2002-10-25T12:29:06Z,SAT013,-20.09,149.54,90.2,-999,-999,-999,-999,-999,-999,-999,-999,-999,-999,-999,-999
,2002-10-25T12:29:07Z,SAT013,-20.09,149.54,90.4,-999,-999,-999,-999,-999,-999,-999,-999,-999,-999,-999,-999
,2002-10-25T12:29:07Z,SAT013,-20.09,149.54,90.6,-999,-999,-999,-999,-999,-999,-999,-999,-999,-999,-999,-999
,2002-10-25T12:29:08Z,SAT013,-20.09,149.54,90.8,-999,-999,-999,-999,-999,-999,-999,-999,-999,-999,-999,-999
,2002-10-25T12:29:08Z,SAT013,-20.09,149.54,91,-999,-999,-999,-999,-999,-999,-999,-999,-999,-999,-999,-999
,2002-10-25T12:29:09Z,SAT013,-20.09,149.54,91.2,-999,-999,-999,-999,-999,-999,-999,-999,-999,-999,-999,-999
,2002-10-25T12:29:10Z,SAT013,-20.09,149.54,91.4,-999,-999,-999,-999,-999,-999,-999,-999,-999,-999,-999,-999
,2002-10-25T12:29:10Z,SAT013,-20.09,149.54,91.6,-999,-999,-999,-999,-999,-999,-999,-999,-999,-999,-999,-999
,2002-10-25T12:29:11Z,SAT013,-20.09,149.54,91.8,-999,-999,-999,-999,-999,-999,-999,-999,-999,-999,-999,-999
,2002-10-25T12:29:11Z,SAT013,-20.09,149.54,92,-999,-999,-999,-999,-999,-999,-999,-999,-999,-999,-999,-999
,2002-10-25T12:29:12Z,SAT013,-20.09,149.54,92.2,-999,-999,-999,-999,-999,-999,-999,-999,-999,-999,-999,-999
,2002-10-25T12:29:13Z,SAT013,-20.09,149.54,92.4,-999,-999,-999,-999,-999,-999,-999,-999,-999,-999,-999,-999
,2002-10-25T12:29:13Z,SAT013,-20.09,149.54,92.6,-999,-999,-999,-999,-999,-999,-999,-999,-999,-999,-999,-999
,2002-10-25T12:29:14Z,SAT013,-20.09,149.54,92.8,-999,-999,-999,-999,-999,-999,-999,-999,-999,-999,-999,-999
,2002-10-25T12:29:14Z,SAT013,-20.09,149.54,93,-999,-999,-999,-999,-999,-999,-999,-999,-999,-999,-999,-999
,2002-10-25T12:29:15Z,SAT013,-20.09,149.54,93.2,-999,-999,-999,-999,-999,-999,-999,-999,-999,-999,-999,-999
,2002-10-25T12:29:16Z,SAT013,-20.09,149.54,93.4,-999,-999,-999,-999,-999,-999,-999,-999,-999,-999,-999,-999
,2002-10-25T12:29:16Z,SAT013,-20.09,149.54,93.6,-999,-999,-999,-999,-999,-999,-999,-999,-999,-999,-999,-999
,2002-10-25T12:29:17Z,SAT013,-20.09,149.54,93.8,-999,-999,-999,-999,-999,-999,-999,-999,-999,-999,-999,-999
,2002-10-25T12:29:17Z,SAT013,-20.09,149.54,94,-999,-999,-999,-999,-999,-999,-999,-999,-999,-999,-999,-999
,2002-10-25T12:29:18Z,SAT013,-20.09,149.54,94.2,-999,-999,-999,-999,-999,-999,-999,-999,-999,-999,-999,-999
,2002-10-25T12:29:18Z,SAT013,-20.09,149.54,94.4,-999,-999,-999,-999,-999,-999,-999,-999,-999,-999,-999,-999
,2002-10-25T12:29:19Z,SAT013,-20.09,149.54,94.6,-999,-999,-999,-999,-999,-999,-999,-999,-999,-999,-999,-999
,2002-10-25T12:29:20Z,SAT013,-20.09,149.54,94.8,-999,-999,-999,-999,-999,-999,-999,-999,-999,-999,-999,-999
,2002-10-25T12:29:20Z,SAT013,-20.09,149.54,95,-999,-999,-999,-999,-999,-999,-999,-999,-999,-999,-999,-999
,2002-10-25T12:29:21Z,SAT013,-20.09,149.54,95.2,-999,-999,-999,-999,-999,-999,-999,-999,-999,-999,-999,-999
,2002-10-25T12:29:21Z,SAT013,-20.09,149.54,95.4,-999,-999,-999,-999,-999,-999,-999,-999,-999,-999,-999,-999
,2002-10-25T12:29:22Z,SAT013,-20.09,149.54,95.6,-999,-999,-999,-999,-999,-999,-999,-999,-999,-999,-999,-999
,2002-10-25T12:29:23Z,SAT013,-20.09,149.54,95.8,-999,-999,-999,-999,-999,-999,-999,-999,-999,-999,-999,-999
,2002-10-25T12:29:23Z,SAT013,-20.09,149.54,96,-999,-999,-999,-999,-999,-999,-999,-999,-999,-999,-999,-999
,2002-10-25T12:29:24Z,SAT013,-20.09,149.54,96.2,-999,-999,-999,-999,-999,-999,-999,-999,-999,-999,-999,-999
,2002-10-25T12:29:24Z,SAT013,-20.09,149.54,96.4,-999,-999,-999,-999,-999,-999,-999,-999,-999,-999,-999,-999
,2002-10-25T12:29:25Z,SAT013,-20.09,149.54,96.6,-999,-999,-999,-999,-999,-999,-999,-999,-999,-999,-999,-999
,2002-10-25T12:29:26Z,SAT013,-20.09,149.54,96.8,-999,-999,-999,-999,-999,-999,-999,-999,-999,-999,-999,-999
,2002-10-25T12:29:26Z,SAT013,-20.09,149.54,97,-999,-999,-999,-999,-999,-999,-999,-999,-999,-999,-999,-999
,2002-10-25T12:29:27Z,SAT013,-20.09,149.54,97.2,-999,-999,-999,-999,-999,-999,-999,-999,-999,-999,-999,-999
,2002-10-25T12:29:27Z,SAT013,-20.09,149.54,97.4,-999,-999,-999,-999,-999,-999,-999,-999,-999,-999,-999,-999
,2002-10-25T12:29:28Z,SAT013,-20.09,149.54,97.6,-999,-999,-999,-999,-999,-999,-999,-999,-999,-999,-999,-999
,2002-10-25T12:29:28Z,SAT013,-20.09,149.54,97.8,-999,-999,-999,-999,-999,-999,-999,-999,-999,-999,-999,-999
,2002-10-25T12:29:29Z,SAT013,-20.09,149.54,98,-999,-999,-999,-999,-999,-999,-999,-999,-999,-999,-999,-999
,2002-10-25T12:29:30Z,SAT013,-20.09,149.54,98.2,-999,-999,-999,-999,-999,-999,-999,-999,-999,-999,-999,-999
,2002-10-25T12:29:30Z,SAT013,-20.09,149.54,98.4,-999,-999,-999,-999,-999,-999,-999,-999,-999,-999,-999,-999
,2002-10-25T12:29:31Z,SAT013,-20.09,149.54,98.6,-999,-999,-999,-999,-999,-999,-999,-999,-999,-999,-999,-999
,2002-10-25T12:29:31Z,SAT013,-20.09,149.54,98.8,-999,-999,-999,-999,-999,-999,-999,-999,-999,-999,-999,-999
,2002-10-25T12:29:32Z,SAT013,-20.09,149.54,99,-999,-999,-999,-999,-999,-999,-999,-999,-999,-999,-999,-999
,2002-10-25T12:29:33Z,SAT013,-20.09,149.54,99.2,-999,-999,-999,-999,-999,-999,-999,-999,-999,-999,-999,-999
,2002-10-25T12:29:33Z,SAT013,-20.09,149.54,99.4,-999,-999,-999,-999,-999,-999,-999,-999,-999,-999,-999,-999
,2002-10-25T12:29:34Z,SAT013,-20.09,149.54,99.6,-999,-999,-999,-999,-999,-999,-999,-999,-999,-999,-999,-999
,2002-10-25T12:29:34Z,SAT013,-20.09,149.54,99.8,-999,-999,-999,-999,-999,-999,-999,-999,-999,-999,-999,-999
,2002-10-25T12:29:35Z,SAT013,-20.09,149.54,100,-999,-999,-999,-999,-999,-999,-999,-999,-999,-999,-999,-999
