﻿ID,IWCID,Year,EvidenceDate,Source,LargeArea,SmallArea,ScientificName,CommonName,EvidenceType,CollisionEvidence,StrikeResult,OtherInfo,VesselType,Vessel Name
A1,NA,1872,15-Dec-1872,Newspaper,Pacific Ocean - South,"30 miles East of Cape Howe, NSW",Physeter macrocephalus ,Sperm whale,Collision,Whale swam with barque King Oscar for 4 days and then rammed the vessel,Unknown,A whale 'attacking' boat,Barque,King Oscar
A2,NA,1882,4-Mar-1882,Newspaper,Indian Ocean - South,"50 miles south of Cape Leeuwin, WA",Physeter macrocephalus ,Sperm whale,Collision,Whale struck schooner Pet. Captain killed,Unknown,A whale 'attacking' boat,Schooner,Pet
A3,NA,1888,1888,Newspaper,,Australian waters,Unidentified cetacean,Unidentified cetacean,Collision,Propeller struck whale with force,Whale almost cut in half,Propeller hit ,Military ,HMS Myrmidon
A4,NA,1889,1889,Newspaper,Pacific Ocean - South,"Between Cape Jarvis and Yankalilla, SA",Unidentified cetacean,Unidentified large whale,Collision,Collision and 2x propeller strikes,Badly injured,,Passenger steamer,James Comrie
A5,NA,1891,Dec-1891,Newspaper,Pacific Ocean - South,"10 miles North of Wollongong, NSW",Unidentified cetacean,Unidentified large whale,Collision,Crew/captain saw,Believed dead,,Steamer,Titus
A6,NA,1894,1894,Newspaper,Pacific Ocean - South,"Two fold Bay, Sydney, NSW",Unidentified cetacean,Unidentified cetacean,Collision,Witnessed,unknown,whale hitting boat.Whale swam into stationary boat and then jetty,yatcht,Tea Tephi
A7,NA,1897,Sep-1897,Newspaper,Indian Ocean,"Outside the heads, Perth, WA",Unidentified cetacean,Unidentified cetacean,Collision,crew,unknown ,Tug hit whale,tug,Stormcock
A8,NA,1900,1-Dec-00,Newspaper,Pacific Ocean - South,"Off Maria Island, TAS",Unidentified cetacean,Unidentified cetacean,Collision,crew/damage ship,unknown ,whale damaged keel,Passenger/cargo steamer,Warrentinna
A9,NA,1903,Jan-03,Newspaper,Pacific Ocean - South,"Lord Horne Island, (NSW?)",Unidentified cetacean,Unidentified cetacean,Collision,crew,Animal cut in two,"Lord Horne Is may be Lord Howe, voyage was from Eureka (US?) to sydney",Passenger/cargo barque,Barossa
A10,NA,1903,17-Sep-03,Newspaper,Indian Ocean,"Geraldton, WA",Unidentified cetacean,Unidentified cetacean,Collision,crew/damage ship,unknown ,Ship damaged bobstay and keel,Pearling Lugger,Viking
A11,NA,1904,Jul-04,Newspaper,Pacific Ocean - South,"8 miles North East of Smoky Cape, NSW",Physeter macrocephalus ,Sperm whale,Collision,crew,A dead whale with a broken back washed up later,Ship going at 12 knots shuddered and whale surfaced near ship,passenger steamer,Kyogle
A12,NA,1904,3-Aug-04,Newspaper,Pacific Ocean - South,"Wollongong, NSW",Megaptera novaeangliae ,Humpback whale,Shore,Propeller marks on body,dead,60ft length,unknown,0
A13,NA,1905,Jan-05,Newspaper,Indian Ocean,"17 miles off Dongarra, WA",Unidentified cetacean,Unidentified cetacean,Collision,Hit whale boat sank,unknown ,,Fishing boat,0
A14,NA,1905,Jan-05,Newspaper,Pacific Ocean - South,"West of Olive Island, and off Streaky Bay, SA",Grampus griseus,Risso's dolphin?,Collision,captain crew,jammed between the propeller and the rudder post and killed,Species uncertain ,Passenger steamer,Governor Musgrave
A15,NA,1905,26-Oct-05,Newspaper,Pacific Ocean - South,"Off Southport Island, TAS",Unidentified cetacean,Unidentified cetacean,Collision,crew,unknown ,,yatcht,Houn Pine
A16,NA,1907,Oct-07,Newspaper,Pacific Ocean - South,"South Solitary Island, NSW",Unidentified cetacean,Unidentified large whale,Collision,crew/passengers,unknown,Ship going at 15kts,Passenger steamer,Yongala
A17,NA,1911,Jun-11,Newspaper,Pacific Ocean - South,"Between Gabo Island and Wilson Prom (off 90 mile beach), VIC",Unidentified cetacean,Unidentified large whale,Collision,crew/passengers,"Glancing blow, whale swam away",,Passenger steamer,Grantala
A18,NA,1913,Nov-13,Newspaper,Pacific Ocean - South,"Between Sydney and Byron Bay, NSW",Unidentified cetacean,Unidentified cetacean,Collision,screw hit whale,Likely dead,"considerable force impact, sea stained red, whale was seen to rise afterwards",Passenger,s.s. Wollongbar
A19,NA,1915,14-Jan-15,Newspaper,Pacific Ocean - South,"Cape Bridgewater-Point Danger, VIC",Unidentified cetacean,Unidentified cetacean,Collision,small boat hit whale,unknown,boat lifted out of water from bow,Fishing boat,Nancy
A20,NA,1923,1923,Newspaper,Pacific Ocean - South,"Few miles from Port Adelaide, SA",Unidentified cetacean,Unidentified cetacean,Collision,crew,dead,"3 whales, 2 darted away, 3rd struck by ship/propeller cut to pieces and then sharks attacked carcass",Steam merchant,Treverbyn
A21,NA,1926,1926,Newspaper,Indian Ocean,"500 miles from WA coast, WA",Unidentified cetacean,Unidentified cetacean,Collision,Captain,unknown-blood in water,"Female with calf, femake struck midship, and went under ship, blood in water, captain circled but did not see whale again",Steamer,Nardana
A22,NA,1927,1927,Newspaper,Pacific Ocean - South,"50miles South of Gabo Island, VIC",Unidentified cetacean,Unidentified cetacean,Collision,likely fatal,"Caught by ship propeller, whale seen half submerged in pool of blood",,Passenger liner,Zealandia
A23,NA,1927,1927,Newspaper,,30 miles at sea ,Unidentified cetacean,Unidentified cetacean,Collision,Unknown,whale 'attacked' destroyer,,Military,Lamson
A24,NA,1928,Aug-28,Newspaper,Pacific Ocean - South,"A mile from Quoin Island, North of Yeppoon, QLD",Unidentified cetacean,Unidentified cetacean,Collision,Launch hit whale one crew died later from injuries,unknown,,launch,Nellie
A25,NA,1928,Aug-28,Newspaper,Pacific Ocean - South,"Between Fremantle and Adelaide, WA/SA",Unidentified cetacean,Unidentified cetacean,Collision,crew/passengers,unknown,,steam liner,Ozarda
A26,NA,1929,Jul-29,Newspaper,Pacific Ocean - South,"150 miles west Neptune Is Lighthouse, SA",Unidentified cetacean,Unidentified cetacean,Collision,,"Fatal, whale cut in half, no really felt on ship, bow covered in blood",,freighter ,Kooliga
A27,NA,1930,Jun-30,Newspaper,Pacific Ocean - South,"Off Qld coast, QLD",Unidentified cetacean,Unidentified cetacean,Collision,"severe bump, whale left trail of blood",unknown,,liner,SS Taiping
A28,NA,1934,28-Aug-34,Newspaper,Pacific Ocean - South,"Sydney Harbour, NSW",Megaptera novaeangliae ,Humpback whale,Collision,witness and body,"Fatal, body washed up repeatedly",,Ferry,Baragoola
A29,NA,1934,Nov-34,Newspaper,Pacific Ocean - South,"300 miles off Sydney Heads, NSW",Unidentified cetacean,Unidentified cetacean,Collision,"Whale struck in middle and bled profusely from the mouth, wedged on bow",Fatal,"ship going at 20 knots,",liner,Mariposa
A30,NA,1934,Nov-34,Newspaper,Pacific Ocean - South,"Near Montague Island, NSW",Unidentified cetacean,Unidentified cetacean,Collision,,Fatal,,liner,Wanganella
A31,NA,1935,Oct-35,Newspaper,Pacific Ocean - South,"Off Coffs Harbour, NSW",Unidentified cetacean,Unidentified cetacean,Collision,crew,unknown,whales traveled with ship for a while then one was involved in collision,mail steamer,Ormonde
A32,NA,1936,May-36,Newspaper,Indian Ocean - South,"Off Albany, WA",Unidentified cetacean,Unidentified cetacean,Collision,"captain, whale seen to hit bow and slip to the port",whale spurting blood as slipped by port bow,Not felt on ship,liner,Imperial Star
A33,NA,1936,Nov-36,Newspaper,Pacific Ocean - South,"Mouth of Moyne river, VIC",Unidentified cetacean,Unidentified cetacean,Collision,crew and damage to boat,unknown,"whales congregating at river mouth one fishing boat collided, radio'd warning but another also hit and damaged keel",Fishing boat,Seaflower
A34,NA,1936,Nov-36,Newspaper,Pacific Ocean - South,"Mouth of Moyne river, VIC",Unidentified cetacean,Unidentified cetacean,Collision,crew and damage to keel,unknown,"whales congregating at river mouth one fishing boat collided, radio'd warning but another also hit and damaged keel",Fishing boat,Victory
A35,NA,1937,Apr-37,Newspaper,Pacific Ocean - South,"Mooloolaba, QLD",Unidentified cetacean,Unidentified cetacean,Collision,crew,unknown,,launch,0
A36,NA,1937,Aug-37,Newspaper,Indian Ocean - South,"Bight, about 350 miles east of Eclipse Island, WA",Unidentified cetacean,Unidentified cetacean,Collision,"jar felt on ship, engine making an unusual noise, then whale surfaced","Fatal, animal almost cut in two",,Motorship,Almkerk
A37,NA,1938,Dec-38,Newspaper,Pacific Ocean - South,"200 miles off Aus Coast Brisbane to Auckland, QLD",Unidentified cetacean,Unidentified cetacean,Collision,passengers,"Fatal, struck by propeller","ship at 16.5 kts, 3 whales sighted, 1 rose under ship and struck by propeller",liner,Orford
A38,NA,1940,1940,Newspaper,Pacific Ocean - South,"A mile off Currumbin Beach, QLD",Unidentified cetacean,Unidentified cetacean,Collision,crew,unknwon,,Fishing boat,Wonderbelle
A39,NA,1946,Sep-46,Newspaper,Pacific Ocean - South,"30 miles west of Lady Hamiliton Island, QLD",Unidentified cetacean,Unidentified cetacean,Collision,crew,whale left trail of blood as it moved away and also appeared to be withering in pain,,Military- Naval lauch,0
A40,NA,1948,Nov-48,Newspaper,Pacific Ocean - South,"Sydney to Broken Bay, NSW",Unidentified cetacean,Unidentified cetacean,Collision,crew of another yatcht saw,unknown,Thud and yatcht stopped dead,yatcht,Aloha
A41,NA,1952,Jun-52,Newspaper,Pacific Ocean - South,"Great Australian Bight, WA/SA",Unidentified cetacean,Unidentified cetacean,Collision,Captain tried to avoid,"likely, whale hit by propeller",,Frieghter,La Estancia 
A42,NA,1952,Aug-52,Newspaper,Pacific Ocean - South,"2 miles to sea off Cape Moreton, QLD",Unidentified cetacean,Unidentified cetacean,Collision,Captain witnesed,"whale dived, bearing a deep cut on the blubber across its back. ",,launch,Omar
A43,NA,1953,29-Jan-53,Newspaper,Pacific Ocean - South,"Cape Douglas, SA",Unidentified cetacean,Unidentified cetacean,Stranded,Appeared to have ship damage,Fatal,,unknown,0
A45,NA,1954,27-Sep-54,Newspaper,Pacific Ocean - South,"Woolgoolga, NSW",Unidentified cetacean,Unidentified cetacean,Collision,Tail of whale hit boat injured crewman,unknown,The skin from the whale's tail was adhering to parts of the boat when it reached Coffs Harbour.,Fishing boat,0
A44,NA,1954,28-Sep-54,Newspaper,Pacific Ocean - South,"Coffs Harbour, NSW",Unidentified cetacean,Unidentified cetacean,Collision,Crew,unknown,The whale surfaced 10 feet ahead of the boat and it was impossible to alter course.     Slight damage was done to the boat as it passed over the whale   between the hump and tail. ,Fishing boat,0
A46,271,1958,31-Dec-58,IWC,Pacific Ocean - South,"Tasmania, Frederick Henry Bay-Slopen Island; ca 1nm off Cremorne, TAS",Unidentified cetacean,Unidentified large whale,Collision,boat was completely lifted out of the water,Not known,"A whale struck a dinghy with three fishermen. They were positive that it was a whale, described as 'grey'. Gill Slocum and Phillip Tracey, Gov. Australia",Not known,0
A47,NA,1963,1963,Newspaper,Pacific Ocean - South,"Whitsunday Islands, Close off South Molle Island, QLD",Megaptera novaeangliae ,Humpback whale,Collision,,No minor,Anecdotal approx year and only minor nudge,yatcht,?
A48,NA,1964,25-Jan-64,Newspaper,Indian Ocean - South,"180 miles NW of Freemantle, WA",Unidentified cetacean,Unidentified cetacean,Collision,Visual by crew,Likely Fatal,,liner,Iberia
A49,NA,1970,8-Aug-70,Shipwreck database,Indian Ocean - South,"off the WA coast,WA ",Unidentified cetacean,Unidentified cetacean,Collision,Small craft sank after hitting whale,unknown,,small craft,Alma Mary
A129,NA,1971,1-Sep-71,Website,Pacific Ocean - South,"Off Sydney,NSW",Unidentified cetacean,Unidentified cetacean,Collision,Sub periscope mast hit whale,unknown,,Submarine,Otway
A50,NA,1974,Aug-74,Newspaper,Pacific Ocean - South,"2 miles SW of West Island,Near Waitpinga coastline, SA",Unidentified cetacean,Unidentified cetacean,Collision,boat stopped dead and saw whale,whale swam away,,33ft boat,0
A51,NA,1986,Dec-86,Newspaper,Pacific Ocean - South,"Bass Strait, Syd to Hobart race, NSW/TAS",Unidentified cetacean,Unidentified cetacean,Collision,yatcht hit an object described as a whale or rock,unknown,,racing yatcht,Amaroo III
A52,544,1988,3-Oct-88,IWC,Pacific Ocean - South,"Saunders beach, Qld",Sousa chinensis ,Indo-Pacific humpback dolphin,Shore,,,"Gill Slocum and Phillip Tracey, Gov. Australia",Not known,0
A53,82,1992,15-May-92,IWC,Pacific Ocean - South,"Bass Strait, TAS",Balaenoptera omurai,Omura’s whale,Collision,A dead 12m whale was found draped over the ship’s bulbous bow.,Death,"Bryde´s whale struck and stuck on bow in Tasmania. Laist et al. (2001). Event occurred at night. Approximate position. See Whale Stuck on Bow form. See Laist et al, (2001)",Container ship,0
A54,NA,1993,Dec-93,Newspaper,Pacific Ocean - South,"Syd to Hobart race, NSW/TAS",Unidentified cetacean,Unidentified whale or Sunfish,Collision,Bow damage to yatcht,unknown,,racing yatcht,Brindabella
A55,NA,1994,Dec-94,Newspaper,Pacific Ocean - South,"Bass Strait Sydney to Hobart race, NSW/TAS",Unidentified cetacean,Unidentified cetacean,Collision,Whale sliced,unknown,,racing yatcht,Tasmania
A56,NA,1995,Dec-95,Newspaper,Pacific Ocean - South,"Off Eden NSW -  off Montague Island on the south coast of New South , 70 feet of water close to Victor harbour, NSW",Globicephala,Pilot whale?,Collision,bent rudder and damaged hull,unknown,,racing yatcht,Future Shock
A57,NA,1995,Dec-95,Newspaper,Pacific Ocean - South,"Syd to Hobart race, NSW/TAS",Unidentified cetacean,Unidentified cetacean,Collision,,unknown,2 more yatchts hit unknown objects,racing yatcht,King Billy
A58,7,1995,16-Feb-95,IWC,Pacific Ocean - South,"Tweed River, NSW",Tursiops truncatus ,Common bottlenose dolphin,Collision,Direct observation,Severe external visible injury,"T. truncatus (adult female) hit by propeller
Gill Slocum and Phillip Tracey, Gov. Australia",Open fishing boat,0
A59,P,1999,27-Aug-99,ProgRepAustralia,Pacific Ocean - South,"Off Keppel Ilsands, Qld",Unidentified cetacean,Unidentified large whale,Collision,Struck by HMAS Sydney. ,Not known,SC/52/ProgRepAustralia,Military,HMAS Sydney
A60,282,2000,22-Jun-00,IWC,Pacific Ocean - Coral Sea,"Magnetic Island, Qld",Unidentified cetacean,Unidentified small whale,Collision,struck and presumed injured by a jet ski.,Not Known Presumed injured,"Dolphin struck by jet ski, Magnetic Island, Australia. Tentative location. Date not indicated. Field number W1225, Research Coordination Unit, Parks and Wildlife Strategy Division, Queensland Parks and Wildlife Service",Small Rec,NA
A61,P,2001,2001,ProgRepAustralia,Pacific Ocean - South,NSW,Megaptera novaeangliae ,Humpback whale,Collision,,Not known,SC/54/ProgRepAustralia,Unknown,0
A62,9,2001,22-Jun-01,IWC,Pacific Ocean - South,"Lower Hawesbury R., NSW",Megaptera novaeangliae ,Humpback whale,Collision,Direct observation,Not known,"Seriously wounded humpback whale in Australia. Gill Slocum and Phillip Tracey, Gov. of Australia",Open fishing boat,0
A63,189,2001,21-Jul-01,IWC,Indian Ocean,"Cape Jervis, SA",Eubalaena australis ,Southern right whale,Collision,,Death,Southern right whale hit by ferry in Southern Australia. Kemper et al. 2008,Ferry,0
A64,281,2001,2001,IWC,Pacific Ocean - Coral Sea,"Whitsunday Island, QLD",Unidentified cetacean,Unidentified cetacean,Collision,,Not known,,Not known,0
A65,P,2001,2001,ProgRepAustralia,Indian Ocean - South,WA,Balaenoptera musculus brevicauda,pygmy blue whale,Collision,,Not known,,Yatcht,0
A66,269,2002,31-Aug-02,IWC,Pacific Ocean - South,"Prosser Bay-Orford (Shelly Point), TAS",Eubalaena australis ,Southern right whale,Collision,Collision left skin samples on the vessel. See Kemper et al 2008,Indeterminate visible injury,"Whales were sighted at Prosser Bay between 4-5 pm. Whales approached a boat and when the outboard was started were startled and accidentally came into contact. Gill Slocum and Phillip Tracey, Gov. Australia",Small,0
A67,296,2002,3-Oct-02,IWC,Indian Ocean,"Exmouth Gulf, WA",Megaptera novaeangliae ,Humpback whale,Collision,Direct observation,Not known,Direct observation. Fate of whale unknown. Source: Gill Slocum and Phillip Tracey (Gov. Australia),Not known,0
A68,268,2002,3-Nov-02,IWC,Pacific Ocean - South,"Tasman Peninsula, TAS",Eubalaena australis ,Southern right whale,Collision,whale lifted/rolled the boat,Indeterminate visible injury,"Fishing charter operator reported whale strike to his vessel from below that lifted/rolled the boat. Collision stalled the boat, broke the props and the bottom of the boat. Near Tasman Peninsula. See Kemper et al 2008
Source: Gill Slocum and Phillip Tracey, Gov. Australia",Fishing Charter,0
A69,P,2003,2003,ProgRepAustralia,Pacific Ocean - South,Area V,Megaptera novaeangliae ,Humpback whale,Post mortem,Necropsy SC/56/ProgRepAustralia,Death,Postmortem results: found dead possible cause of death boat or propeller strike,Not known,0
A156,P,2003,2003,ProgRepAustralia,Pacific Ocean - South,SA,Kogia breviceps,Pygmy sperm whale,Shore,,Death,SC/56/ProgRepAustralia,Unknown,0
A157,P,2003,2003,ProgRepAustralia,Pacific Ocean - South,SA coastline,Unidentified dolphin,Indo-Pacific bottlenose dolphin,0,,Death,SC/56/ProgRepAustralia,0,Canon Leopard
A70,354,2003,27-May-03,IWC,Pacific Ocean - South,"Station Creek, NSW",Balaenoptera acutorostrata ssp.,Dwarf minke whale,Shore,,,Newborn or very young,yatcht,Sting
A71,NA,2003,1-Aug-03,Newspaper,Pacific Ocean - South,"Hook Island, Whitsundays, QLD",Unidentified cetacean,Unidentified cetacean,Collision,Damage to the yacht,Not known,Newspaper report http://www.abc.net.au/news/2003-08-01/yacht-damaged-after-collision-with-whale/1458190,Trimaran,0
A72,280,2003,16-Aug-03,IWC DATA,Pacific Ocean - South,"Townsville, QLD",Megaptera novaeangliae ,Humpback whale,Collision,Crew observed colliding with Migaloo and photos of Migaloo were taken later,Whale swam away,Newspaper report,PC,0
A131,NA,2003,8-Oct-03,Newspaper,Pacific Ocean - South,"Seven Mile Beach, Shoalhaven Heads, NSW",Megaptera novaeangliae ,Humpback whale,Shore,Observation of injuries possible from ship,Death,Newspaper,Unknown,0
A73,P,2004,5-Aug-04,ProgRepAustralia,Pacific Ocean - South,"Port Douglas, QLD",Megaptera novaeangliae ,Humpback whale,Collision,Reported by dive boat,Whale swam away,Port Douglas dive boat,Unknown,0
A74,P,2004,2-Aug-04,ProgRepAustralia,Pacific Ocean - South,"Cleveland Bay Townsville, Qld",Unidentified cetacean,Unidentified large whale,Not known,Public report,Not known,Public report-unconfirmed,Aluminium dinghy 6m,0
A75,10,2004,12-Nov-04,IWC,Pacific Ocean - South,"East coast Bruny Island, TAS",Unidentified cetacean,Unidentified cetacean,Collision,Passengers reported,Whale swam away and unlikely to have been killed,"Animal not sighted again after strike, strike unlikely to have killed animal",Not known,0
A155,P,2004,2004,ProgRepAustralia,Pacific Ocean - South,"Fraser Island, Australia, QLD",Unidentified dolphin,Bottlenose dolphin,0,,Death,SC/57/ProgRepAustralia,0,0
A153,P,2005,5-Feb-05,ProgRepAustralia,Pacific Ocean - South,"10km south of Brown’s Creek, near Yarrabah, north Queensland",Unidentified dolphin,Unidentified dolphin,0,,Death,,0,0
A154,P,2005,29-Dec-05,ProgRepAustralia,Pacific Ocean - South,"Bongaree, Bribie Island, Queensland",Unidentified dolphin,Unidentified dolphin,0,,Death,,0,0
A152,P,2006,12-Mar-06,ProgRepAustralia,Pacific Ocean - South,Pacific Palms,Unidentified dolphin,Bottlenose dolphin,Washed up,,Death,"The animal had suffered many lacerations that were consistent with both a shark attack & a boat strike, suggesting one followed the other",0, Volvo 60 Andrew Short Marine 
A76,313,2006,15-Jul-06,IWC,Pacific Ocean - South,"Nata Inlet, Whitsundays, QLD",Megaptera novaeangliae ,Humpback whale,Collision,Direct observation by member of the public,Not known,SC/59/ProgRepAustralia Humpback whale struck by 50ft yacht reversing in Nara Inlet. Passenger-carrying excursion vessel (whale-watching). Whale struck with hull not propeller,Whale Watching,0
A77,314,2006,25-Aug-06,IWC,Pacific Ocean - South,"Whitsundays, QLD",Megaptera novaeangliae ,Humpback whale,Collision,"""minor damage to the animal's rear quarters reported"" (see BCWP10)",Indeterminate visible injury,SC/59/ProgRepAustralia Humpback whale struck by trimaran (in IWC : BCWP10). Passenger-carrying excursion vessel (whale-watching) . Whale swam away with minor damage to the animals rear quarters reported,Whale Watching,0
A78,315,2006,1-Dec-06,IWC,Indian Ocean - South,"Gage Roads Fremantle, WA",Balaenoptera musculus brevicauda,Pygmy blue whale,Collision,"Post mortem and collision with an Australian navy frigate (HMAS Ballarat) reported by the navy, the whale washed up dead on 5th Dec",Death,"SC/59/ProgRepAustralia The whale washed up dead on Capricorn Beach, north of Perth on 5th Dec after HMAS Ballarat struck th ewhale on Gage Roads near Fremantle on 1st Dec. The navy reported the strike on 2nd Dec and a skin and blubber sample was collected on 6th Dec",Military,0
A151,P,2006,2006,ProgRepAustralia,Pacific Ocean - South,"Found dead 200m east of Kirribilli Point, Sydney Harbour",Unidentified dolphin,Common dolphin,Washed up,Post mortem,Death,SC/59/ProgRepAustralia,0,0
A79,260,2007,1-Aug-07,IWC,Pacific Ocean - Coral Sea,"Hook Island, east of Airlie Beach, QLD",Unidentified cetacean,Unidentified large whale,Collision,"The whale surfaced on the yatch's bow. "" the yacht didn't hit the whale, the whale surfaced and hit the yacht - it is very, very unusual,""",Not known,"Yacht damaged after collision with whale, Hook Island, Australia. ABC News (August 1, 2003)",Yatcht,0
A80,787,2007,2007,IWC,Pacific Ocean - Tasman Sea,"East Tasmania, TAS",Megaptera novaeangliae ,Humpback whale,At Sea,,,"Boat owners have been urged to take care after whales were spotted off Tasmania's East Coast with extreme propeller injuries. (The Mercury). http://www.marineconnection.org/archives/marine_impacts_2007.html

",Not known,0
A81,961,2007,12-Aug-07,IWC,Pacific Ocean - South,"Off south coast of Australia, SA",Physeter macrocephalus ,Sperm whale,Found at Sea,Photos. The large gash on the back of this animal strongly suggested that it had been involved in a ship collision,Death,SC/60/ProgRepAustralia,Not known,Racing Yatcht
A82,958,2007,2007,IWC,Pacific Ocean - South,"East Coast Tasmania, SA",Megaptera novaeangliae ,Humpback whale,Collision,"Animal observed to have severe trauma from propeller strike. Unique markings, photos taken housed with R. Gales/DPIW-TAS",Whale swam away,SC/60/ProgRepAustralia,Not known,0
A83,959,2007,29-Aug-07,IWC,Pacific Ocean - Coral Sea,"Whitsundays, QLD",Megaptera novaeangliae ,Humpback whale,Collision,Observed by tourism operator. Vessel operator collided with whale then spent ten minutes observing the animal. No visible injuries or changes in behaviour. Contact Col Limpus/EPA-QLD,Whale swam away,SC/60/ProgRepAustralia,Other,0
A84,960,2007,17-Sep-07,IWC,Pacific Ocean - Coral Sea,"Near Dunk Island, QLD",Megaptera novaeangliae ,Humpback whale,Collision,Both mother and calf observed by tourism operator with propellor cuts. Contact Col Limpus/EPA-QLD,Whale swam away,SC/60/ProgRepAustralia,Not known,HMAS Ballarat
A85,783,2007,1-Dec-07,IWC,Pacific Ocean - Tasman Sea,"Tasmania's East Coast, TAS",Megaptera novaeangliae ,Humpback whale,At Sea,Newspaper report,Whale swam away,"Humpback whale with healed propeller scars spotted off Tasmania
Source: Marineconnection.com.  Approximate location
",Not known,0
A86,780,2007,17-Dec-07,IWC,Pacific Ocean - Tasman Sea,"Tasmanian's East Coast, TAS",Megaptera novaeangliae ,Humpback whale,At Sea,Newspaper report,Whale swam away,"Humpback whale spotted with massive propeller scars, Tasmania
Source:  Marine Connection Web Page,  - Marine Impacts News.htm. Tentative geographic position",Not known,0
A87,984,2008,12-Jan-08,IWC,Pacific Ocean - South,"Lincoln National Park, SA",Caperea marginata ,Pygmy right whale,Found on Shore,,,SC/61/ProgRepAustralia,Not known,0
A88,NA,2008,14-Aug-08,Newspaper,Pacific Ocean - South,"Stradbroke Island, QLD",Megaptera novaeangliae ,Humpback whale,Collision,Newspaper report  http://www.seabreeze.com.au/News/Sailing/Another-Whale-Collision-and-Likely-to-Increase_1771385.aspx,,Overdrive skipper Andrew Johnson and navigator Peter Steindl,Yacht 11.5m,0
A89,989,2008,16-Aug-08,IWC,Pacific Ocean - South,"Between Hayman Island and mainland Australia, QLD",Unidentified cetacean,Unidentified large whale,Collision,Reported by public. Whale struck by large commerical vessel. Contact DERM Whitsundays office 07 4967 7355 Case #W2054. Another whale was seen nudging the injured whale shortly after strike. A lot of blood in the water,Not known,SC/61/ProgRepAustralia,Other,0
A90,NA,2008,17-Aug-08,Newspaper,Pacific Ocean - South,"Bundaberg, QLD",Megaptera novaeangliae ,Humpback whale,Collision,Newspaper report  http://www.news-mail.com.au/news/apn-whale-of-a-time-at/95994/,,Overdrive skipper Andrew Johnson and navigator Peter Steindl,Yacht 11.5m,0
A91,990,2008,17-Aug-08,IWC,Pacific Ocean - South,"Fraser Island, Australia, QLD",Unidentified cetacean,Unidentified large whale,Collision,"Observed by crew on yacht. An 11.5m yacht hit a mother and calf, the whales were reported to have swam away. Contact Col Limpus, Jenny Greenland, EPA-QLD",Not known,SC/61/ProgRepAustralia,Sailing yacht (<25m),0
A92,982,2008,21-Aug-08,IWC,Pacific Ocean - South,"Off south west Australia, QLD",Eubalaena australis ,Southern right whale,Collision,"Contact D. Coughran, DEC-WA",Not known,SC/61/ProgRepAustralia,Not known,0
A93,992,2008,8-Sep-08,IWC,Pacific Ocean - South,"Clump Point, Mission Beach, QLD",Megaptera novaeangliae ,Humpback whale,Collision,Vessel's bow struck glancing blow to whale while vessel was coming down the face of a wave. Contact DERM Townsville Office 07 47225224 Case # W2067,Whale swam away,SC/61/ProgRepAustralia,Small vessel (9m),0
A94,985,2008,20-Sep-08,IWC,Pacific Ocean - South,"20nm East Coffs Harbour, NSW",Megaptera novaeangliae ,Humpback whale,Collision,Contact Geoffrey Ross,Death,SC/61/ProgRepAustralia,Not known,0
A95,P,2008,6-Oct-08,ProgRepAustralia,Pacific Ocean - South,"Twelve Apostles, VIC",Physeter macrocephalus ,Sperm whale,Photo,Beached whale,Death,SC/61/ProgRepAustralia,Not known,0
A96,991,2008,7-Oct-08,IWC,Pacific Ocean - South,"Off Gladstone, QLD",Unidentified cetacean,Unidentified large whale,Collision,"Collision observed by crew of MSQ pilot boat which struck it. Contact Col Limpus, Jenny Greeland, EPA-QLD. Whale was not seen after collision",Not known,SC/61/ProgRepAustralia,Other,0
A97,986,2008,26-Oct-08,IWC,Pacific Ocean - South,"Byron Coast, NSW",Megaptera novaeangliae ,Humpback whale,Collision,Contact Geoffrey Ross,Death,SC/61/ProgRepAustralia,Not known,0
A98,987,2008,26-Oct-08,IWC,Pacific Ocean - South,"Richard River, NSW",Megaptera novaeangliae ,Humpback whale,Collision,Contact Geoffrey Ross,Death,SC/61/ProgRepAustralia,Not known,0
A150,P,2009,30-Oct-09,ProgRepAustralia,Indian Ocean - South,"Bunbury, WA",Tursiops truncatus,Bottlenose dolphin,Collision,Boat survey during line transect survey,Death,SC/61/ProgRepAustralia,small runabout outboard motor,0
A99,P,2009,8-Apr-09,ProgRepAustralia,Pacific Ocean - South,"Rye Ocean Beach, VIC",Balaenoptera musculus,Blue whale,Washed up,Contact Dave Donnelly/DRI ,Death,SC/62/ProgRepAustralia,Not known,0
A100,1060,2009,28-Jul-09,ProgRepAustralia,Pacific Ocean - South,"Hervey Bay, QLD",Megaptera novaeangliae ,Humpback whale,Collision,Whale swam away bleeding heavily,Not known,SC/62/ProgRepAustralia,Fishing Vessel,0
A149,P,2009,25-Aug-09,ProgRepAustralia,Pacific Ocean - South,8 km NNW Port Adelaide (PO),Tursiops aduncus,Indo-Pacific bottlenose dolphin,Washed up,"Post mortem, possible boat strike",Death,SC/62/ProgRepAustralia,0,0
A101,1061,2009,2-Sep-09,ProgRepAustralia,Pacific Ocean - South,"Exmouth Gulf, WA",Megaptera novaeangliae ,Humpback whale,Collision,Private fishing recreational vessel struck the whale,Not known,SC/62/ProgRepAustralia,Fishing Vessel,0
A102,P,2009,12-Sep-09,ProgRepAustralia,Pacific Ocean - South,"Uladulla, NSW",Eubalaena australis ,Southern right whale,Post mortem,Post mortem showed severely impacted upper jaw and cranium. Contact Geoff Ross/DECCW event #896,Death,SC/62/ProgRepAustralia,Passenger Carrying,0
A103,1063,2009,12-Sep-09,Newspaper,Pacific Ocean - South,"Batemans Bay, NSW",Eubalaena australis ,Southern right whale,Post mortem,Newspaper report ,Death,"The 6½-metre long calf, estimated to be less than one year old, was severely injured in the accident. It was dead when it washed up and there are clear signs of propeller damage to the head of the mammal",Not known,0
A104,1058,2009,2-Oct-09,ProgRepAustralia,Pacific Ocean - South,NSW,Balaenoptera physalus,Fin whale,Post mortem,Post mortem indicated possible vessel collision. Contact Cath Kemper SAM,Death,SC/62/ProgRepAustralia,Not known,0
A105,1062,2009,26-Oct-09,ProgRepAustralia,Pacific Ocean - South,"Fremantle, WA",Megaptera novaeangliae ,Humpback whale,Collision,Struck by HMAS Perth. Observed floating with blood with no movement afterwards. Presumed dead,Death,SC/62/ProgRepAustralia,Military,0
A148,P,2009,27-Dec-09,ProgRepAustralia,Pacific Ocean - South,"Old bar beach, NSW",Unbidentified Tursiops ,Unidentified Bottlenose dolphin,Washed up,Gross examination,Death,SC/62/ProgRepAustralia,Unknown,0
A147,P,2010,23-Jan-10,ProgRepAustralia,Indian Ocean - South,Bunbury Surf Club,Tursiops truncatus,Bottlenose dolphin,Washed up,Post mortem,Death,SC/63/ProgRepAustralia,Small watercraft,0
A132,P,2010,5-Apr-10,ProgRepAustralia,Pacific Ocean - South,"Cyrlis Beach, Flinders, VIC",Balaenoptera musculus,Blue whale,Washed up,"Observed possible large impact to head region, thought that death cause by ship impact (unconfirmed)",Death,SC/63/ProgRepAustralia,0,0
A133,P,2010,17-Jul-10,ProgRepAustralia,Indian Ocean - South,"Broome, WA",Megaptera novaeangliae ,Humpback whale,Collision,Crew observed the collision,,SC/63/ProgRepAustralia,Fishing Vessel,0
A134,P,2010,22-Sep-10,ProgRepAustralia,Pacific Ocean - South,"Sandon Point, Illawara, NSW",Megaptera novaeangliae ,Humpback whale,Washed up,,Death,SC/63/ProgRepAustralia,0,0
A135,NA,2010,5-Oct-10,Newspaper,Indian Ocean - South,"Exmouth, WA",Unidentified cetacean,Unidentified large whale,Collision,Ship struck object and abandoned thought to be whale,Unknown,Newspaper report,Recreational vessel (46ft),0
A136,P,2010,22-Nov-10,ProgRepAustralia,Pacific Ocean - South,"Port Wakefield, SA",Megaptera novaeangliae ,Humpback whale,Washed up,Post mortem,Death,SC/63/ProgRepAustralia,unknown,0
A146,P,2010,13-Dec-10,ProgRepAustralia,Pacific Ocean - South,"0.6 km NNW St Kilda (jetty), SA",Tursiops aduncus,Indo-Pacific bottlenose dolphin,Washed up,Post mortem,Death,SC/63/ProgRepAustralia,Unknown,HMAS Perth
A145,P,2010,2010,ProgRepAustralia,Pacific Ocean - South,"Darwin, NT",Sousa chinensis,Indo-Pacific humpback dolphin,Washed up,observed body,Death,SC/63/ProgRepAustralia,unknown,0
A141,P,2011,6-Jan-11,ProgRepAustralia,Pacific Ocean - South,"Tomaree NP One mile beach northern end, NSW",Tursiops truncatus,Bottlenose dolphin,Washed up,Monitored on site,Death,SC/64/ProgRepAustralia,0,0
A142,P,2011,7-Jan-11,ProgRepAustralia,Pacific Ocean - South,"Portsea back beach, Mornington Peninsular",Delphinus delphis,Common dolphin,Washed up,Post mortem,Death,SC/64/ProgRepAustralia,Jetski or small vessel,0
A143,P,2011,16-Jan-11,ProgRepAustralia,Pacific Ocean - South,Point Lonsdale,Delphinus delphis,Common dolphin,Washed up,Post mortem,Death,SC/64/ProgRepAustralia,Large Vessel,0
A144,P,2011,17-Apr-11,ProgRepAustralia,Pacific Ocean - South,4.3km WSW Port Adelaide (PO),Tursiops truncatus,Bottlenose dolphin,Washed up,Post -mortem by Byard et al.,Death,SC/64/ProgRepAustralia,unknown,0
A106,P,2011,19-Jun-11,ProgRepAustralia,Pacific Ocean - South,"Moreton Bay, QLD",Megaptera novaeangliae ,Humpback whale,Collision,From vessel,"Whale appeared seriously injured. Vessel damaged, blubber and skin removed from vessel. ",Volunteer Marine Rescue,Catamaran 10m Volunteer Marine Rescue VMR,0
A108,NA,2011,24-Jun-11,Newspaper,Pacific Ocean - South,"Sydney Harbour, NSW",Unidentified cetacean,Unidentified large whale,Collision,Newspaper report,Whale was sighted in the area to where the vessel sank,Whale watching boat Ocean Dreaming 2 master John Kerr witnessed the incident near North Head near the entrance to Sydney Harbour,Wooden boat 10m,0
A109,NA,2011,26-Jun-11,Newspaper,Pacific Ocean - South,"Red Cliff, Brooms Head NSW",Megaptera novaeangliae ,Humpback whale,Collision,Newspaper report ,Not known,"But neither saw the 12 to 13 metre humpback as it approached their vessel, striking Drew with its tail and smashing the windscreen and shade cover on the boat",Small vessel (6m),0
A110,P,2011,28-Jun-11,ProgRepAustralia,Pacific Ocean - South,"Blue Pearl Bay, Hayman Island, Whitsundays, QLD",Megaptera novaeangliae ,Humpback whale,At Sea,From research vessel,Not known,"Dave Paton, BPM",Unknown,0
A111,NA,2011,5-Jul-11,Newspaper,Pacific Ocean - South,"Hervey Bay bar, QLD",Megaptera novaeangliae ,Humpback whale,Collision,Skipper and passengers,Whale swam away and the collision resulted in a large crack to the boat's bow,Newspaper report   Ally Jay's Fishing Charters Jason Hall (0427 133 474),Commercial fishing charter,0
A112,P,2011,27-Aug-11,ProgRepAustralia,Pacific Ocean - South,"10km ESE Border Village, SA",Eubalaena australis ,Southern right whale,Photo,Probable vessel collision,,"Cath Kemper, SA Museum",Unknown,0
A113,P,2011,9-Oct-11,ProgRepAustralia,Pacific Ocean - South,"Moreton Bay, QLD",Megaptera novaeangliae ,Humpback whale,Collision,Passengers,Whale swam away and appeared seriously injured. Blood observed in water but whale never found. Case #W228136,"Natalie Reed, QPWS",High speed ferry,0
A114,P,2011,10-Nov-11,ProgRepAustralia,Indian Ocean - South,"Fremantle, WA",Megaptera novaeangliae ,Humpback whale,Collision,Public/photos/Fremantle Volunteer Sea Rescue Group investigated the whales injuries,Whale swam away and appeared seriously injured,"Doug Cough,ran, DEC WA",Recreational vessel (47ft),0
A130,NA,2012,24-Jul-12,Newspaper,Pacific Ocean - South,"Hungry Beach, NSW",Unidentified cetacean,Unidentified large whale,Washed up,Public/photos,Death,,unknown,0
A116,P,2012,25-Jul-12,ProgRepAustralia,Pacific Ocean - South,"Brisbane/Moreton Bay, QLD",Unidentified cetacean,Unidentified cetacean,Collision,,Unknown serioulsy injured,SC/65/ProgRepAustralia,unknown,0
A117,NA,2012,6-Aug-12,Newspaper,Pacific Ocean - South,"Sydney Harbour, NSW",Megaptera novaeangliae ,Humpback whale,Collision,Public/photos,Whale swam away,"Newspaper Aerial footage later identified a female humpback whale with a wound near its dorsal fin, and its calf with an 80-centimetre gash",Ferry,0
A118,NA,2012,20-Aug-12,Newspaper,Pacific Ocean - South,"Bribie Island, 25 nm NE, QLD",Unidentified cetacean,Unidentified cetacean,Collision,Witness,,Newspaper report,Catamaran (10m),0
A119,NA,2012,25-Sep-12,Newspaper,Pacific Ocean - South,"Yamba, NSW",Unidentified cetacean,Unidentified cetacean,Collision,Passengers,Whale swam away but was not again sighted and so uncertain of its injuries,Newspaper report http://www.cqnews.com.au/news/whale-versus-catamaran-yamba-mark-patricia-meulman/1560327/#comments,Catamaran (10m),0
A139,P,2012,15-Oct-12,ProgRepAustralia,Southern Ocean,"32 km north of Streaky Bay, SA",Kogia breviceps,Pygmy sperm whale,Washed up,,Death,SC/65/ProgRepAustralia,unknown,0
A140,P,2012,12-Nov-12,ProgRepAustralia,Southern Ocean," Laura Bay, Great Australian Bight, SA.",Balaenoptera bonaerensis,Antarctic Minke whale,Washed up,photos,Death,SC/65/ProgRepAustralia,unknown,0
A120,NA,2013,3-Aug-13,Newspaper,Pacific Ocean - South,"Hervey Bay, QLD",Megaptera novaeangliae ,Humpback whale,Collision,Passengers,Whale breached onto a boat and swam away,Newspaper report http://www.cqnews.com.au/news/owners-great-escape/1978695/,Catamaran,0
A137,P,2013,2013,ProgRepAustralia,Pacific Ocean - South,"2.7km NNE Point Bolingbroke, SA",Eubalaena australis ,Southern right whale,Washed up,post-mortem,Death,SC/66/ProgRepAustralia,unknown,0
A121,NA,2014,14-Aug-14,Newspaper,Pacific Ocean - South,"Gladstone, Lady Musgrave Island, QLD",Unidentified cetacean,Unidentified cetacean,Probable collision,Crew,Not known,Newspaper report http://www.themorningbulletin.com.au/news/No-damage-to-boat-after-heavy-shudder/2349226/                                                                                                                               It felt to us like we ran aground - in a pretty sudden manner. An inspection of the yacht after the crash had not revealed any damage.,Yacht,0
A122,P,2014,15-Aug-14,ProgRepAustralia,Pacific Ocean - South,"Moreton Bay, QLD",Eubalaena australis ,Southern right whale,Collision,Passengers and skipper,Not known,SC/67/ProgRepAustralia,Ferry Stradbroke Ferries,0
A123,P,2014,16-Aug-14,ProgRepAustralia,Pacific Ocean - South,"Moreton Bay, QLD",Eubalaena australis ,Southern right whale,Washed UP,Photos of dead whale with massive propeller cuts,Death,SC/67/ProgRepAustralia,Unknown,0
A124,NA,2014,8-Dec-14,Newspaper,Pacific Ocean - South,"Ardrossan, SA",Physeter macrocephalus ,Sperm whale,Washed up,Newspaper report  ,Death,Newspaper report,Not known,0
A138,P,2014,2014,ProgRepAustralia,Pacific Ocean - South,"Off Cape Moreton, QLD",Megaptera novaeangliae ,Humpback whale,Shore,,Unknown,SC/67/ProgRepAustralia,unknown,0
A125,NA,2015,28-Jul-15,Newspaper,Indian Ocean - South,"Broome, WA",Megaptera novaeangliae ,Humpback whale,Collision,Crew were injured,Not known,Newspaper report,Small vessel (6m),0
A126,NA,2015,14-Aug-15,Newspaper,Pacific Ocean - South,"Stradbroke Island, QLD",Balaenoptera acutorostrata,Dwarf Minke whale,"Post mortem, seen floating in ferry route",Newspaper report ,Death,Newspaper report,Not known,0
A127,NA,2015,21-Aug-15,Facebook,Pacific Ocean - South,"Port Hedland, WA",Megaptera novaeangliae ,Humpback whale,"Post mortem, washed up",Facebook page ,Death,,Not known,0
A128,NA,2015,8-Sep-15,Newspaper,Pacific Ocean - South,"Hay Point, QLD",Megaptera novaeangliae ,Humpback whale,Collision,Dead whale stuck in prop,,Newspaper report,Tug boat,0
