GLOBAL ATTRIBUTES,,,,,,,,,,,,,,,,,
title,,,,,,,,,,,,,,,,,
project,Integrated Marine Observing System (IMOS),,,,,,,,,,,,,,,,
original_project_name,MERIS validation,,,,,,,,,,,,,,,,
original_institution,CSIRO Land and Water,,,,,,,,,,,,,,,,
abstract,This record contains in situ water optical property data collected in the South Great Barrier Reef| Australia on the RSV Lady Basten between 23-28 Aug 2005. A total of 22 stations were sampled during the field campaign AA05. The data can be used for Ocean Colour sensor validation| optical water quality monitoring and modelling. CLW deployed the optical instruments TriOS RAMSES (hyperspectral irradiance)| WETLabs AC-9 (absorption and attenuation coefficicents)| HOBILabs Hydroscat-6 (backscattering coefficient) during this cruise.This data was part of the dataset described in Blondeau-Patissier et al. 2009| JGR| VOL. 114| C05003| doi:10.1029/2008JC005039. Funding for this study was provided by CSIRO Earth Observation Centre| CSIRO Land and Water| CSIRO Marine Research and the Australian Institute of Marine Sciences. We also thank the captains and crews of the RSV Lady Basten.,,,,,,,,,,,,,,,,
conventions,IMOS biological data format (v1.0),,,,,,,,,,,,,,,,
date_created,2005-08-27T03:53:36Z,,,,,,,,,,,,,,,,
date_modified,2006-02-06T22:27:01Z,,,,,,,,,,,,,,,,
history,Data has been quality controlled by in-house procedures. HS-6 data were corrected for temperature using CTD data and the Sigma correction method| recommended by the manufacturer| was applied using absorption and attenuation data from the AC-9. The Sigma correction is an adjustment to improve the accuracy of backscattering measurements| in particular in highly-attenuating water. The correction is detailed in HOBI-labs Inc.| 2003. The backscattering coefficient bb is estimated using the method described in Maffione and Dana| 1997| Applied Optics| 36(24)| pp.6057-6067.,,,,,,,,,,,,,,,,
comment,The HydroScat-6 (HS-6) is a self-contained instrument for measuring optical backscattering at six different wavelengths in natural waters. The particulate backscattering coefficient| bbp (lambda)| is a measure of light scattering by particles at angles between 90 and 180 degrees. bbp was estimated by subtracting bbw (lambda)| the backscattering coefficient of pure sea-water| from bb (lambda). The pure seawater backscattering coefficient was calculated using a backscattering ratio of 0.5 (Gordon et al.| 1988| Journal of Geophysical Research) and the seawater scattering coefficients| bw(lambda)| of Morel (1974| Optical properties of pure water and pure seawater| p. 1-24| in Optical Aspects of Oceanography).,,,,,,,,,,,,,,,,
source,Particulate Scattering coefficients determined using an HS-6 (www.hobilabs.com),,,,,,,,,,,,,,,,
keywords,Oceans>Ocean Optics > Scattering ;Oceans>Ocean Optics>Ocean Colour;,,,,,,,,,,,,,,,,
cruise_id,LB4083,,,,,,,,,,,,,,,,
vessel_name,RSV Lady Basten,,,,,,,,,,,,,,,,
platform_code,VLAB_450301529,,,,,,,,,,,,,,,,
references,https://marlin.csiro.au/geonetwork/srv/eng/catalog.search#/metadata/d3c5d7ba-b861-72d5-e043-08114f8c2cf2,,,,,,,,,,,,,,,,
naming_authority,CSIRO Land and Water (CLW),,,,,,,,,,,,,,,,
cdm_data_type,profile,,,,,,,,,,,,,,,,
geospatial_lat_min,-20.15,,,,,,,,,,,,,,,,
geospatial_lat_max,-20.15,,,,,,,,,,,,,,,,
geospatial_lon_min,148.88,,,,,,,,,,,,,,,,
geospatial_lon_max,148.88,,,,,,,,,,,,,,,,
geospatial_vertical_min,0,,,,,,,,,,,,,,,,
geospatial_vertical_max,100,,,,,,,,,,,,,,,,
local_time_zone,10,,,,,,,,,,,,,,,,
data_centre,eMarine Information Infrastructure (eMII),,,,,,,,,,,,,,,,
data_centre_email,info@emii.org.au,,,,,,,,,,,,,,,,
author,Brando Vittorio,,,,,,,,,,,,,,,,
author_email,vittorio.brando@csiro.au,,,,,,,,,,,,,,,,
principal_investigator,Furnas Miles,,,,,,,,,,,,,,,,
principal_investigator_email,m.furnas@aims.gov.au,,,,,,,,,,,,,,,,
institution,IMOS Satellite Remote Sensing - Ocean Colour Sub-facility - Bio-Optical database of Australian Waters,,,,,,,,,,,,,,,,
institution_principal_investigator,"Schroeder, Thomas",,,,,,,,,,,,,,,,
institution_principal_investigator_email,Thomas.Schroeder@csiro.au,,,,,,,,,,,,,,,,
publisher,Australian Ocean Data Network,,,,,,,,,,,,,,,,
publisher_email,info@aodn.org.au,,,,,,,,,,,,,,,,
citation,To cite this data set in a publication use the format <<IMOS [year-of-data-downloaded] [Title] [data-access-url] accessed [date-of-access]>>,,,,,,,,,,,,,,,,
acknowledgement,Data was sourced from the Commonwealth Scientific and Industrial Research Organisation (CSIRO),,,,,,,,,,,,,,,,
distribution_statement,"Any users of IMOS data are required to clearly acknowledge the source of the material- Data or products or services from IMOS are provided ""as is"" without any warranty as to fitness for a particular purpose.",,,,,,,,,,,,,,,,
,,,,,,,,,,,,,,,,,
TABLE ROWS,,,,,,,,,,,,,,,,,
Row name,CF standard_name,IMOS long_name,Units,Fill value,Comments,,,,,,,,,,,,
Wavelength,radiation_wavelength,Wavelength of measurement,nm,-999,,,,,,,,,,,,,
,,,,,,,,,,,,,,,,,
TABLE COLUMNS,,,,,,,,,,,,,,,,,
Column name,CF standard_name,IMOS long_name,Units,Fill value,Comments,,,,,,,,,,,,
Time,time,analysis_time,YYYY-MM-DDThh:mm:ssZ,,UTC date and time,,,,,,,,,,,,
Station_Code,,,,,National Reference Station code (6 letters),,,,,,,,,,,,
Latitude,latitude,latitude,degrees_north,-999,North positive,,,,,,,,,,,,
Longitude,longitude,longitude,degrees_east,-999,East positive,,,,,,,,,,,,
Depth,depth,depth,m ,-999,positive down,,,,,,,,,,,,
bb_corr,,corrected_volume_total_backwards_scattering_coefficient_of_(bbw_+_bbp)_in_sea_water,m-1,-999,bbw:volume_backwards_scattering_coefficient_of_radiative_flux_in_sea_water ; bbp=volume_backwards_scattering_coefficient_of_particules_in_sea_water,,,,,,,,,,,,
bb_uncorr,,volume_total_backwards_scattering_coefficient_of_(bbw_+_bbp)_in_sea_water,m-1,-999,bbw:volume_backwards_scattering_coefficient_of_radiative_flux_in_sea_water ; bbp=volume_backwards_scattering_coefficient_of_particules_in_sea_water,,,,,,,,,,,,
,,,,,,,,,,,,,,,,,
,,,,,,,,,,,,,,,,,
DATA,,,,,,,,,,,,,,,,,
,Time,Station_Code,Latitude,Longitude,Depth,bb_corr,bb_corr,bb_corr,bb_corr,bb_corr,bb_corr,bb_uncorr,bb_uncorr,bb_uncorr,bb_uncorr,bb_uncorr,bb_uncorr
Wavelength,,,,,,442,448,555,589,676,852,442,448,555,589,676,852
,2005-08-27T03:56:02Z,WQS016,-20.15,148.88,0,0.024517,0.022865,0.01926,0.018761,0.016713,0.015596,0.022874,0.021545,0.018268,0.017848,0.015958,0.012406
,2005-08-27T03:55:58Z,WQS016,-20.15,148.88,0.2,0.024427,0.022773,0.019334,0.018941,0.016689,0.015266,0.022789,0.021458,0.01834,0.018022,0.015936,0.012144
,2005-08-27T03:56:09Z,WQS016,-20.15,148.88,0.4,0.024531,0.023328,0.020417,0.018919,0.0168,0.015395,0.022883,0.02198,0.019373,0.018004,0.016044,0.012246
,2005-08-27T03:56:24Z,WQS016,-20.15,148.88,0.6,0.024508,0.022498,0.018736,0.018884,0.016067,0.015666,0.022857,0.021197,0.017783,0.017975,0.015345,0.012463
,2005-08-27T03:56:26Z,WQS016,-20.15,148.88,0.8,0.025561,0.023145,0.019446,0.018938,0.017056,0.016181,0.023831,0.021806,0.018469,0.018036,0.016294,0.012873
,2005-08-27T03:55:12Z,WQS016,-20.15,148.88,1,0.025876,0.022504,0.019297,0.018517,0.016353,0.015194,0.024122,0.021197,0.018324,0.017631,0.015621,0.012087
,2005-08-27T03:56:30Z,WQS016,-20.15,148.88,1.2,0.026065,0.02261,0.01824,0.018754,0.01719,0.015906,0.02431,0.021284,0.017323,0.017851,0.016419,0.012645
,2005-08-27T03:56:32Z,WQS016,-20.15,148.88,1.4,0.025054,0.02251,0.019013,0.018831,0.01674,0.015377,0.023319,0.021197,0.018033,0.017908,0.015975,0.012224
,2005-08-27T03:56:33Z,WQS016,-20.15,148.88,1.6,0.02537,0.023627,0.020153,0.018849,0.017093,0.015917,0.023626,0.02224,0.019123,0.017936,0.016329,0.012657
,2005-08-27T03:53:36Z,WQS016,-20.15,148.88,1.8,0.024024,0.022671,0.018298,0.01829,0.016838,0.016642,0.022366,0.021328,0.017358,0.017396,0.016056,0.013223
,2005-08-27T03:56:36Z,WQS016,-20.15,148.88,2,0.025662,0.022636,0.019649,0.018684,0.016893,0.015735,0.023882,0.021284,0.018631,0.017763,0.016104,0.012497
,2005-08-27T03:55:08Z,WQS016,-20.15,148.88,2.2,0.026118,0.022929,0.019008,0.0185,0.016838,0.015586,0.024292,0.021545,0.018009,0.017575,0.016048,0.012372
,2005-08-27T03:56:42Z,WQS016,-20.15,148.88,2.4,0.025398,0.023133,0.019522,0.018835,0.016943,0.015495,0.023635,0.021762,0.018518,0.017915,0.016165,0.012315
,2005-08-27T03:55:00Z,WQS016,-20.15,148.88,2.6,0.026095,0.023158,0.019182,0.019155,0.017334,0.015732,0.024241,0.021762,0.018163,0.018188,0.016506,0.012486
,2005-08-27T03:53:52Z,WQS016,-20.15,148.88,2.8,0.024829,0.023205,0.019968,0.01926,0.017408,0.01569,0.023064,0.021806,0.018906,0.018288,0.016575,0.012452
,2005-08-27T03:56:48Z,WQS016,-20.15,148.88,3,0.026401,0.023723,0.01947,0.019044,0.017163,0.015941,0.0246,0.022327,0.018461,0.01811,0.016376,0.012668
,2005-08-27T03:53:44Z,WQS016,-20.15,148.88,3.2,-999,-999,-999,-999,-999,-999,-999,-999,-999,-999,-999,-999
,2005-08-27T03:56:50Z,WQS016,-20.15,148.88,3.4,0.02593,0.023068,0.01842,0.018756,0.017085,0.015838,0.024111,0.021675,0.017444,0.017816,0.01629,0.012577
,2005-08-27T03:56:52Z,WQS016,-20.15,148.88,3.6,0.027236,0.023344,0.018324,0.01893,0.016838,0.015381,0.025333,0.021936,0.017358,0.017979,0.016048,0.012201
,2005-08-27T03:56:54Z,WQS016,-20.15,148.88,3.8,0.026844,0.022753,0.018484,0.018631,0.017431,0.016019,0.024984,0.021414,0.01753,0.01772,0.016631,0.012737
,2005-08-27T03:56:57Z,WQS016,-20.15,148.88,4,0.027337,0.022964,0.019408,0.018951,0.017227,0.015286,0.02542,0.021588,0.01839,0.018007,0.016424,0.012132
,2005-08-27T03:53:46Z,WQS016,-20.15,148.88,4.2,-999,-999,-999,-999,-999,-999,-999,-999,-999,-999,-999,-999
,2005-08-27T03:57:00Z,WQS016,-20.15,148.88,4.4,0.026922,0.023695,0.02057,0.019178,0.017024,0.015317,0.025071,0.022284,0.019508,0.018245,0.016255,0.012189
,2005-08-27T03:53:48Z,WQS016,-20.15,148.88,4.6,-999,-999,-999,-999,-999,-999,-999,-999,-999,-999,-999,-999
,2005-08-27T03:57:03Z,WQS016,-20.15,148.88,4.8,0.025668,0.023204,0.020491,0.019144,0.017518,0.015998,0.023874,0.021806,0.019422,0.018199,0.016713,0.012714
,2005-08-27T03:57:06Z,WQS016,-20.15,148.88,5,0.026672,0.023236,0.021482,0.019042,0.01732,0.016711,0.024814,0.021849,0.020368,0.018107,0.016531,0.013284
,2005-08-27T03:57:08Z,WQS016,-20.15,148.88,5.2,0.025358,0.022803,0.019932,0.019222,0.017054,0.016858,0.023592,0.021458,0.018906,0.018288,0.016277,0.013409
,2005-08-27T03:57:10Z,WQS016,-20.15,148.88,5.4,0.026027,0.022832,0.020859,0.019107,0.017571,0.016433,0.024173,0.021458,0.019766,0.01816,0.016756,0.013056
,2005-08-27T03:57:12Z,WQS016,-20.15,148.88,5.6,0.026425,0.023303,0.022478,0.018774,0.017025,0.015725,0.024583,0.021893,0.021311,0.017851,0.016234,0.012497
,2005-08-27T03:57:13Z,WQS016,-20.15,148.88,5.8,0.026721,0.023426,0.022018,0.019446,0.017892,0.016001,0.024822,0.02198,0.02085,0.018469,0.017045,0.012702
,2005-08-27T03:57:16Z,WQS016,-20.15,148.88,6,0.025804,0.02313,0.020464,0.018826,0.017322,0.016728,0.023925,0.021675,0.019349,0.017851,0.016484,0.013261
,2005-08-27T03:57:20Z,WQS016,-20.15,148.88,6.2,0.027023,0.024086,0.020607,0.019468,0.017771,0.016382,0.025121,0.022632,0.019527,0.018501,0.016946,0.01301
,2005-08-27T03:57:18Z,WQS016,-20.15,148.88,6.4,0.025747,0.023375,0.021361,0.0187,0.017162,0.015616,0.023951,0.02198,0.020253,0.01778,0.016372,0.012406
,2005-08-27T03:57:24Z,WQS016,-20.15,148.88,6.6,0.026734,0.024329,0.020709,0.019644,0.017945,0.01643,0.024831,0.022849,0.019624,0.018667,0.017114,0.013056
,2005-08-27T03:57:22Z,WQS016,-20.15,148.88,6.8,0.025694,0.02358,0.020655,0.019868,0.018567,0.01678,0.023882,0.022153,0.019575,0.01888,0.017705,0.013329
,2005-08-27T03:57:26Z,WQS016,-20.15,148.88,7,0.026453,0.024077,0.019952,0.019617,0.018044,0.016422,0.024634,0.022675,0.018929,0.01866,0.01723,0.013056
,2005-08-27T03:57:27Z,WQS016,-20.15,148.88,7.2,0.027036,0.025,0.020612,0.020219,0.018448,0.016432,0.025172,0.023545,0.019559,0.019238,0.017618,0.013067
,2005-08-27T03:57:30Z,WQS016,-20.15,148.88,7.4,0.026269,0.024007,0.020256,0.018899,0.017883,0.01742,0.024455,0.022588,0.01922,0.017983,0.017075,0.013854
,2005-08-27T03:57:32Z,WQS016,-20.15,148.88,7.6,0.026622,0.023793,0.019806,0.019581,0.017593,0.017174,0.024814,0.022414,0.018808,0.018646,0.016808,0.013671
,2005-08-27T03:57:34Z,WQS016,-20.15,148.88,7.8,0.02592,0.023357,0.019822,0.019147,0.017286,0.016009,0.02413,0.02198,0.0188,0.01821,0.016501,0.012725
,2005-08-27T03:57:36Z,WQS016,-20.15,148.88,8,0.026831,0.02441,0.020266,0.019362,0.017761,0.016086,0.02495,0.022936,0.019188,0.018376,0.016946,0.012771
,2005-08-27T03:57:37Z,WQS016,-20.15,148.88,8.2,0.026267,0.023379,0.019204,0.019102,0.018237,0.015841,0.024438,0.02198,0.018195,0.018146,0.017407,0.012588
,2005-08-27T03:57:40Z,WQS016,-20.15,148.88,8.4,0.025249,0.023433,0.01988,0.019687,0.017339,0.015875,0.023506,0.022067,0.018873,0.018745,0.01657,0.012634
,2005-08-27T03:57:42Z,WQS016,-20.15,148.88,8.6,0.026341,0.024043,0.018946,0.019334,0.018158,0.016168,0.024523,0.022632,0.017985,0.018405,0.017342,0.012862
,2005-08-27T03:57:44Z,WQS016,-20.15,148.88,8.8,0.024907,0.023852,0.018744,0.019466,0.016864,0.016082,0.023207,0.022458,0.017791,0.018532,0.016104,0.012794
,2005-08-27T03:57:46Z,WQS016,-20.15,148.88,9,0.026588,0.0239,0.020379,0.020213,0.018061,0.017229,0.024771,0.022501,0.019341,0.019242,0.017247,0.013705
,2005-08-27T03:54:00Z,WQS016,-20.15,148.88,9.2,-999,-999,-999,-999,-999,-999,-999,-999,-999,-999,-999,-999
,2005-08-27T03:57:50Z,WQS016,-20.15,148.88,9.4,0.026358,0.024698,0.02112,0.020007,0.017598,0.016964,0.0246,0.023311,0.020092,0.019086,0.016842,0.013523
,2005-08-27T03:57:52Z,WQS016,-20.15,148.88,9.6,0.025951,0.024683,0.020185,0.018916,0.017712,0.016841,0.02413,0.023235,0.019123,0.017975,0.016907,0.013386
,2005-08-27T03:57:54Z,WQS016,-20.15,148.88,9.8,0.025494,0.023713,0.020233,0.018982,0.016874,0.01638,0.023763,0.022349,0.019204,0.018071,0.016122,0.013044
,2005-08-27T03:57:56Z,WQS016,-20.15,148.88,10,0.025155,0.02317,0.020643,0.020227,0.016793,0.016111,0.023412,0.021813,0.019575,0.019238,0.016031,0.012816
,2005-08-27T03:54:02Z,WQS016,-20.15,148.88,10.2,-999,-999,-999,-999,-999,-999,-999,-999,-999,-999,-999,-999
,2005-08-27T03:57:59Z,WQS016,-20.15,148.88,10.4,0.02593,0.02428,0.021,0.019918,0.017966,0.016265,0.024147,0.022847,0.019922,0.018948,0.017148,0.01293
,2005-08-27T03:54:02Z,WQS016,-20.15,148.88,10.6,-999,-999,-999,-999,-999,-999,-999,-999,-999,-999,-999,-999
,2005-08-27T03:58:04Z,WQS016,-20.15,148.88,10.8,0.026371,0.023055,0.021287,0.020021,0.017391,0.017011,0.024592,0.021716,0.020237,0.019086,0.016631,0.013546
,2005-08-27T03:54:04Z,WQS016,-20.15,148.88,11,-999,-999,-999,-999,-999,-999,-999,-999,-999,-999,-999,-999
,2005-08-27T03:58:06Z,WQS016,-20.15,148.88,11.2,0.027104,0.024243,0.021238,0.020406,0.018198,0.016673,0.025198,0.022775,0.020108,0.01938,0.017351,0.013238
,2005-08-27T03:54:04Z,WQS016,-20.15,148.88,11.4,-999,-999,-999,-999,-999,-999,-999,-999,-999,-999,-999,-999
,2005-08-27T03:58:12Z,WQS016,-20.15,148.88,11.6,0.026657,0.024036,0.022044,0.019959,0.018574,0.01726,0.024771,0.022585,0.020875,0.018958,0.017709,0.013705
,2005-08-27T03:54:06Z,WQS016,-20.15,148.88,11.8,-999,-999,-999,-999,-999,-999,-999,-999,-999,-999,-999,-999
,2005-08-27T03:58:14Z,WQS016,-20.15,148.88,12,0.026314,0.024009,0.021116,0.019745,0.018245,0.017235,0.024523,0.022611,0.020051,0.018799,0.017433,0.013717
,2005-08-27T03:58:16Z,WQS016,-20.15,148.88,12.2,0.026399,0.023091,0.019124,0.019671,0.017752,0.016672,0.024549,0.02172,0.018122,0.018696,0.016941,0.013249
,2005-08-27T03:58:18Z,WQS016,-20.15,148.88,12.4,0.02591,0.023692,0.020016,0.019258,0.01737,0.016137,0.024053,0.022273,0.01897,0.018302,0.016566,0.012816
,2005-08-27T03:58:20Z,WQS016,-20.15,148.88,12.6,0.026846,0.023063,0.020459,0.019608,0.018549,0.01681,0.024985,0.021699,0.019398,0.018646,0.017709,0.013363
,2005-08-27T03:58:22Z,WQS016,-20.15,148.88,12.8,0.026196,0.024133,0.020387,0.019482,0.017611,0.016671,0.024395,0.022708,0.019341,0.018536,0.016816,0.013261
,2005-08-27T03:58:24Z,WQS016,-20.15,148.88,13,0.026633,0.022939,0.020249,0.018562,0.017677,0.016041,0.024788,0.021572,0.019204,0.017656,0.016872,0.012759
,2005-08-27T03:54:10Z,WQS016,-20.15,148.88,13.2,-999,-999,-999,-999,-999,-999,-999,-999,-999,-999,-999,-999
,2005-08-27T03:58:28Z,WQS016,-20.15,148.88,13.4,0.026975,0.023519,0.020329,0.019586,0.018646,0.016592,0.025096,0.022129,0.019268,0.018614,0.017782,0.013181
,2005-08-27T03:54:10Z,WQS016,-20.15,148.88,13.6,-999,-999,-999,-999,-999,-999,-999,-999,-999,-999,-999,-999
,2005-08-27T03:58:30Z,WQS016,-20.15,148.88,13.8,0.027968,0.023813,0.02091,0.019381,0.017985,0.01679,0.025976,0.022366,0.019801,0.018401,0.017131,0.013318
,2005-08-27T03:58:33Z,WQS016,-20.15,148.88,14,0.027141,0.024375,0.021233,0.019932,0.01866,0.016505,0.025258,0.02294,0.020132,0.018958,0.017817,0.013124
,2005-08-27T03:58:36Z,WQS016,-20.15,148.88,14.2,0.026315,0.024396,0.021422,0.01973,0.017907,0.017661,0.024498,0.022965,0.02031,0.01876,0.017092,0.014036
,2005-08-27T03:58:38Z,WQS016,-20.15,148.88,14.4,0.026425,0.024737,0.020789,0.019706,0.017993,0.017188,0.024574,0.023252,0.019696,0.018728,0.017174,0.01366
,2005-08-27T03:58:40Z,WQS016,-20.15,148.88,14.6,0.027824,0.025148,0.022401,0.019971,0.018659,0.017141,0.025856,0.023645,0.02123,0.01898,0.017795,0.013603
,2005-08-27T03:54:14Z,WQS016,-20.15,148.88,14.8,-999,-999,-999,-999,-999,-999,-999,-999,-999,-999,-999,-999
,2005-08-27T03:58:42Z,WQS016,-20.15,148.88,15,0.026561,0.024368,0.020797,0.01959,0.018,0.016322,0.024668,0.022881,0.019672,0.018586,0.017157,0.012953
,2005-08-27T03:58:46Z,WQS016,-20.15,148.88,15.2,0.029419,0.025377,0.022229,0.020608,0.020406,0.018571,0.027334,0.023843,0.021036,0.019558,0.019421,0.014731
,2005-08-27T03:54:16Z,WQS016,-20.15,148.88,15.4,-999,-999,-999,-999,-999,-999,-999,-999,-999,-999,-999,-999
,2005-08-27T03:54:16Z,WQS016,-20.15,148.88,15.6,-999,-999,-999,-999,-999,-999,-999,-999,-999,-999,-999,-999
,2005-08-27T03:54:16Z,WQS016,-20.15,148.88,15.8,-999,-999,-999,-999,-999,-999,-999,-999,-999,-999,-999,-999
,2005-08-27T03:54:16Z,WQS016,-20.15,148.88,16,-999,-999,-999,-999,-999,-999,-999,-999,-999,-999,-999,-999
,2005-08-27T03:54:18Z,WQS016,-20.15,148.88,16.2,-999,-999,-999,-999,-999,-999,-999,-999,-999,-999,-999,-999
,2005-08-27T03:54:18Z,WQS016,-20.15,148.88,16.4,-999,-999,-999,-999,-999,-999,-999,-999,-999,-999,-999,-999
,2005-08-27T03:54:18Z,WQS016,-20.15,148.88,16.6,-999,-999,-999,-999,-999,-999,-999,-999,-999,-999,-999,-999
,2005-08-27T03:54:18Z,WQS016,-20.15,148.88,16.8,-999,-999,-999,-999,-999,-999,-999,-999,-999,-999,-999,-999
,2005-08-27T03:54:20Z,WQS016,-20.15,148.88,17,-999,-999,-999,-999,-999,-999,-999,-999,-999,-999,-999,-999
,2005-08-27T03:54:20Z,WQS016,-20.15,148.88,17.2,-999,-999,-999,-999,-999,-999,-999,-999,-999,-999,-999,-999
,2005-08-27T03:54:20Z,WQS016,-20.15,148.88,17.4,-999,-999,-999,-999,-999,-999,-999,-999,-999,-999,-999,-999
,2005-08-27T03:54:20Z,WQS016,-20.15,148.88,17.6,-999,-999,-999,-999,-999,-999,-999,-999,-999,-999,-999,-999
,2005-08-27T03:54:22Z,WQS016,-20.15,148.88,17.8,-999,-999,-999,-999,-999,-999,-999,-999,-999,-999,-999,-999
,2005-08-27T03:54:22Z,WQS016,-20.15,148.88,18,-999,-999,-999,-999,-999,-999,-999,-999,-999,-999,-999,-999
,2005-08-27T03:54:22Z,WQS016,-20.15,148.88,18.2,-999,-999,-999,-999,-999,-999,-999,-999,-999,-999,-999,-999
,2005-08-27T03:54:22Z,WQS016,-20.15,148.88,18.4,-999,-999,-999,-999,-999,-999,-999,-999,-999,-999,-999,-999
,2005-08-27T03:54:24Z,WQS016,-20.15,148.88,18.6,-999,-999,-999,-999,-999,-999,-999,-999,-999,-999,-999,-999
,2005-08-27T03:54:24Z,WQS016,-20.15,148.88,18.8,-999,-999,-999,-999,-999,-999,-999,-999,-999,-999,-999,-999
,2005-08-27T03:54:24Z,WQS016,-20.15,148.88,19,-999,-999,-999,-999,-999,-999,-999,-999,-999,-999,-999,-999
,2005-08-27T03:54:24Z,WQS016,-20.15,148.88,19.2,-999,-999,-999,-999,-999,-999,-999,-999,-999,-999,-999,-999
,2005-08-27T03:54:26Z,WQS016,-20.15,148.88,19.4,-999,-999,-999,-999,-999,-999,-999,-999,-999,-999,-999,-999
,2005-08-27T03:54:26Z,WQS016,-20.15,148.88,19.6,-999,-999,-999,-999,-999,-999,-999,-999,-999,-999,-999,-999
,2005-08-27T03:54:26Z,WQS016,-20.15,148.88,19.8,-999,-999,-999,-999,-999,-999,-999,-999,-999,-999,-999,-999
,2005-08-27T03:54:26Z,WQS016,-20.15,148.88,20,-999,-999,-999,-999,-999,-999,-999,-999,-999,-999,-999,-999
,2005-08-27T03:54:28Z,WQS016,-20.15,148.88,20.2,-999,-999,-999,-999,-999,-999,-999,-999,-999,-999,-999,-999
,2005-08-27T03:54:28Z,WQS016,-20.15,148.88,20.4,-999,-999,-999,-999,-999,-999,-999,-999,-999,-999,-999,-999
,2005-08-27T03:54:28Z,WQS016,-20.15,148.88,20.6,-999,-999,-999,-999,-999,-999,-999,-999,-999,-999,-999,-999
,2005-08-27T03:54:28Z,WQS016,-20.15,148.88,20.8,-999,-999,-999,-999,-999,-999,-999,-999,-999,-999,-999,-999
,2005-08-27T03:54:30Z,WQS016,-20.15,148.88,21,-999,-999,-999,-999,-999,-999,-999,-999,-999,-999,-999,-999
,2005-08-27T03:54:30Z,WQS016,-20.15,148.88,21.2,-999,-999,-999,-999,-999,-999,-999,-999,-999,-999,-999,-999
,2005-08-27T03:54:30Z,WQS016,-20.15,148.88,21.4,-999,-999,-999,-999,-999,-999,-999,-999,-999,-999,-999,-999
,2005-08-27T03:54:30Z,WQS016,-20.15,148.88,21.6,-999,-999,-999,-999,-999,-999,-999,-999,-999,-999,-999,-999
,2005-08-27T03:54:32Z,WQS016,-20.15,148.88,21.8,-999,-999,-999,-999,-999,-999,-999,-999,-999,-999,-999,-999
,2005-08-27T03:54:32Z,WQS016,-20.15,148.88,22,-999,-999,-999,-999,-999,-999,-999,-999,-999,-999,-999,-999
,2005-08-27T03:54:32Z,WQS016,-20.15,148.88,22.2,-999,-999,-999,-999,-999,-999,-999,-999,-999,-999,-999,-999
,2005-08-27T03:54:32Z,WQS016,-20.15,148.88,22.4,-999,-999,-999,-999,-999,-999,-999,-999,-999,-999,-999,-999
,2005-08-27T03:54:34Z,WQS016,-20.15,148.88,22.6,-999,-999,-999,-999,-999,-999,-999,-999,-999,-999,-999,-999
,2005-08-27T03:54:34Z,WQS016,-20.15,148.88,22.8,-999,-999,-999,-999,-999,-999,-999,-999,-999,-999,-999,-999
,2005-08-27T03:54:34Z,WQS016,-20.15,148.88,23,-999,-999,-999,-999,-999,-999,-999,-999,-999,-999,-999,-999
,2005-08-27T03:54:34Z,WQS016,-20.15,148.88,23.2,-999,-999,-999,-999,-999,-999,-999,-999,-999,-999,-999,-999
,2005-08-27T03:54:36Z,WQS016,-20.15,148.88,23.4,-999,-999,-999,-999,-999,-999,-999,-999,-999,-999,-999,-999
,2005-08-27T03:54:36Z,WQS016,-20.15,148.88,23.6,-999,-999,-999,-999,-999,-999,-999,-999,-999,-999,-999,-999
,2005-08-27T03:54:36Z,WQS016,-20.15,148.88,23.8,-999,-999,-999,-999,-999,-999,-999,-999,-999,-999,-999,-999
,2005-08-27T03:54:36Z,WQS016,-20.15,148.88,24,-999,-999,-999,-999,-999,-999,-999,-999,-999,-999,-999,-999
,2005-08-27T03:54:38Z,WQS016,-20.15,148.88,24.2,-999,-999,-999,-999,-999,-999,-999,-999,-999,-999,-999,-999
,2005-08-27T03:54:38Z,WQS016,-20.15,148.88,24.4,-999,-999,-999,-999,-999,-999,-999,-999,-999,-999,-999,-999
,2005-08-27T03:54:38Z,WQS016,-20.15,148.88,24.6,-999,-999,-999,-999,-999,-999,-999,-999,-999,-999,-999,-999
,2005-08-27T03:54:38Z,WQS016,-20.15,148.88,24.8,-999,-999,-999,-999,-999,-999,-999,-999,-999,-999,-999,-999
,2005-08-27T03:54:40Z,WQS016,-20.15,148.88,25,-999,-999,-999,-999,-999,-999,-999,-999,-999,-999,-999,-999
,2005-08-27T03:54:40Z,WQS016,-20.15,148.88,25.2,-999,-999,-999,-999,-999,-999,-999,-999,-999,-999,-999,-999
,2005-08-27T03:54:40Z,WQS016,-20.15,148.88,25.4,-999,-999,-999,-999,-999,-999,-999,-999,-999,-999,-999,-999
,2005-08-27T03:54:40Z,WQS016,-20.15,148.88,25.6,-999,-999,-999,-999,-999,-999,-999,-999,-999,-999,-999,-999
,2005-08-27T03:54:42Z,WQS016,-20.15,148.88,25.8,-999,-999,-999,-999,-999,-999,-999,-999,-999,-999,-999,-999
,2005-08-27T03:54:42Z,WQS016,-20.15,148.88,26,-999,-999,-999,-999,-999,-999,-999,-999,-999,-999,-999,-999
,2005-08-27T03:54:42Z,WQS016,-20.15,148.88,26.2,-999,-999,-999,-999,-999,-999,-999,-999,-999,-999,-999,-999
,2005-08-27T03:54:42Z,WQS016,-20.15,148.88,26.4,-999,-999,-999,-999,-999,-999,-999,-999,-999,-999,-999,-999
,2005-08-27T03:54:44Z,WQS016,-20.15,148.88,26.6,-999,-999,-999,-999,-999,-999,-999,-999,-999,-999,-999,-999
,2005-08-27T03:54:44Z,WQS016,-20.15,148.88,26.8,-999,-999,-999,-999,-999,-999,-999,-999,-999,-999,-999,-999
,2005-08-27T03:54:44Z,WQS016,-20.15,148.88,27,-999,-999,-999,-999,-999,-999,-999,-999,-999,-999,-999,-999
,2005-08-27T03:54:44Z,WQS016,-20.15,148.88,27.2,-999,-999,-999,-999,-999,-999,-999,-999,-999,-999,-999,-999
,2005-08-27T03:54:46Z,WQS016,-20.15,148.88,27.4,-999,-999,-999,-999,-999,-999,-999,-999,-999,-999,-999,-999
,2005-08-27T03:54:46Z,WQS016,-20.15,148.88,27.6,-999,-999,-999,-999,-999,-999,-999,-999,-999,-999,-999,-999
,2005-08-27T03:54:46Z,WQS016,-20.15,148.88,27.8,-999,-999,-999,-999,-999,-999,-999,-999,-999,-999,-999,-999
,2005-08-27T03:54:46Z,WQS016,-20.15,148.88,28,-999,-999,-999,-999,-999,-999,-999,-999,-999,-999,-999,-999
,2005-08-27T03:54:48Z,WQS016,-20.15,148.88,28.2,-999,-999,-999,-999,-999,-999,-999,-999,-999,-999,-999,-999
,2005-08-27T03:54:48Z,WQS016,-20.15,148.88,28.4,-999,-999,-999,-999,-999,-999,-999,-999,-999,-999,-999,-999
,2005-08-27T03:54:48Z,WQS016,-20.15,148.88,28.6,-999,-999,-999,-999,-999,-999,-999,-999,-999,-999,-999,-999
,2005-08-27T03:54:50Z,WQS016,-20.15,148.88,28.8,-999,-999,-999,-999,-999,-999,-999,-999,-999,-999,-999,-999
,2005-08-27T03:54:50Z,WQS016,-20.15,148.88,29,-999,-999,-999,-999,-999,-999,-999,-999,-999,-999,-999,-999
,2005-08-27T03:54:50Z,WQS016,-20.15,148.88,29.2,-999,-999,-999,-999,-999,-999,-999,-999,-999,-999,-999,-999
,2005-08-27T03:54:50Z,WQS016,-20.15,148.88,29.4,-999,-999,-999,-999,-999,-999,-999,-999,-999,-999,-999,-999
,2005-08-27T03:54:52Z,WQS016,-20.15,148.88,29.6,-999,-999,-999,-999,-999,-999,-999,-999,-999,-999,-999,-999
,2005-08-27T03:54:52Z,WQS016,-20.15,148.88,29.8,-999,-999,-999,-999,-999,-999,-999,-999,-999,-999,-999,-999
,2005-08-27T03:54:52Z,WQS016,-20.15,148.88,30,-999,-999,-999,-999,-999,-999,-999,-999,-999,-999,-999,-999
,2005-08-27T03:54:52Z,WQS016,-20.15,148.88,30.2,-999,-999,-999,-999,-999,-999,-999,-999,-999,-999,-999,-999
,2005-08-27T03:54:54Z,WQS016,-20.15,148.88,30.4,-999,-999,-999,-999,-999,-999,-999,-999,-999,-999,-999,-999
,2005-08-27T03:54:54Z,WQS016,-20.15,148.88,30.6,-999,-999,-999,-999,-999,-999,-999,-999,-999,-999,-999,-999
,2005-08-27T03:54:54Z,WQS016,-20.15,148.88,30.8,-999,-999,-999,-999,-999,-999,-999,-999,-999,-999,-999,-999
,2005-08-27T03:54:54Z,WQS016,-20.15,148.88,31,-999,-999,-999,-999,-999,-999,-999,-999,-999,-999,-999,-999
,2005-08-27T03:54:56Z,WQS016,-20.15,148.88,31.2,-999,-999,-999,-999,-999,-999,-999,-999,-999,-999,-999,-999
,2005-08-27T03:54:56Z,WQS016,-20.15,148.88,31.4,-999,-999,-999,-999,-999,-999,-999,-999,-999,-999,-999,-999
,2005-08-27T03:54:56Z,WQS016,-20.15,148.88,31.6,-999,-999,-999,-999,-999,-999,-999,-999,-999,-999,-999,-999
,2005-08-27T03:54:56Z,WQS016,-20.15,148.88,31.8,-999,-999,-999,-999,-999,-999,-999,-999,-999,-999,-999,-999
,2005-08-27T03:54:58Z,WQS016,-20.15,148.88,32,-999,-999,-999,-999,-999,-999,-999,-999,-999,-999,-999,-999
,2005-08-27T03:54:58Z,WQS016,-20.15,148.88,32.2,-999,-999,-999,-999,-999,-999,-999,-999,-999,-999,-999,-999
,2005-08-27T03:54:58Z,WQS016,-20.15,148.88,32.4,-999,-999,-999,-999,-999,-999,-999,-999,-999,-999,-999,-999
,2005-08-27T03:54:58Z,WQS016,-20.15,148.88,32.6,-999,-999,-999,-999,-999,-999,-999,-999,-999,-999,-999,-999
,2005-08-27T03:55:00Z,WQS016,-20.15,148.88,32.8,-999,-999,-999,-999,-999,-999,-999,-999,-999,-999,-999,-999
,2005-08-27T03:55:00Z,WQS016,-20.15,148.88,33,-999,-999,-999,-999,-999,-999,-999,-999,-999,-999,-999,-999
,2005-08-27T03:55:00Z,WQS016,-20.15,148.88,33.2,-999,-999,-999,-999,-999,-999,-999,-999,-999,-999,-999,-999
,2005-08-27T03:55:00Z,WQS016,-20.15,148.88,33.4,-999,-999,-999,-999,-999,-999,-999,-999,-999,-999,-999,-999
,2005-08-27T03:55:02Z,WQS016,-20.15,148.88,33.6,-999,-999,-999,-999,-999,-999,-999,-999,-999,-999,-999,-999
,2005-08-27T03:55:02Z,WQS016,-20.15,148.88,33.8,-999,-999,-999,-999,-999,-999,-999,-999,-999,-999,-999,-999
,2005-08-27T03:55:02Z,WQS016,-20.15,148.88,34,-999,-999,-999,-999,-999,-999,-999,-999,-999,-999,-999,-999
,2005-08-27T03:55:02Z,WQS016,-20.15,148.88,34.2,-999,-999,-999,-999,-999,-999,-999,-999,-999,-999,-999,-999
,2005-08-27T03:55:04Z,WQS016,-20.15,148.88,34.4,-999,-999,-999,-999,-999,-999,-999,-999,-999,-999,-999,-999
,2005-08-27T03:55:04Z,WQS016,-20.15,148.88,34.6,-999,-999,-999,-999,-999,-999,-999,-999,-999,-999,-999,-999
,2005-08-27T03:55:04Z,WQS016,-20.15,148.88,34.8,-999,-999,-999,-999,-999,-999,-999,-999,-999,-999,-999,-999
,2005-08-27T03:55:04Z,WQS016,-20.15,148.88,35,-999,-999,-999,-999,-999,-999,-999,-999,-999,-999,-999,-999
,2005-08-27T03:55:06Z,WQS016,-20.15,148.88,35.2,-999,-999,-999,-999,-999,-999,-999,-999,-999,-999,-999,-999
,2005-08-27T03:55:06Z,WQS016,-20.15,148.88,35.4,-999,-999,-999,-999,-999,-999,-999,-999,-999,-999,-999,-999
,2005-08-27T03:55:06Z,WQS016,-20.15,148.88,35.6,-999,-999,-999,-999,-999,-999,-999,-999,-999,-999,-999,-999
,2005-08-27T03:55:06Z,WQS016,-20.15,148.88,35.8,-999,-999,-999,-999,-999,-999,-999,-999,-999,-999,-999,-999
,2005-08-27T03:55:08Z,WQS016,-20.15,148.88,36,-999,-999,-999,-999,-999,-999,-999,-999,-999,-999,-999,-999
,2005-08-27T03:55:08Z,WQS016,-20.15,148.88,36.2,-999,-999,-999,-999,-999,-999,-999,-999,-999,-999,-999,-999
,2005-08-27T03:55:08Z,WQS016,-20.15,148.88,36.4,-999,-999,-999,-999,-999,-999,-999,-999,-999,-999,-999,-999
,2005-08-27T03:55:08Z,WQS016,-20.15,148.88,36.6,-999,-999,-999,-999,-999,-999,-999,-999,-999,-999,-999,-999
,2005-08-27T03:55:10Z,WQS016,-20.15,148.88,36.8,-999,-999,-999,-999,-999,-999,-999,-999,-999,-999,-999,-999
,2005-08-27T03:55:10Z,WQS016,-20.15,148.88,37,-999,-999,-999,-999,-999,-999,-999,-999,-999,-999,-999,-999
,2005-08-27T03:55:10Z,WQS016,-20.15,148.88,37.2,-999,-999,-999,-999,-999,-999,-999,-999,-999,-999,-999,-999
,2005-08-27T03:55:10Z,WQS016,-20.15,148.88,37.4,-999,-999,-999,-999,-999,-999,-999,-999,-999,-999,-999,-999
,2005-08-27T03:55:12Z,WQS016,-20.15,148.88,37.6,-999,-999,-999,-999,-999,-999,-999,-999,-999,-999,-999,-999
,2005-08-27T03:55:12Z,WQS016,-20.15,148.88,37.8,-999,-999,-999,-999,-999,-999,-999,-999,-999,-999,-999,-999
,2005-08-27T03:55:12Z,WQS016,-20.15,148.88,38,-999,-999,-999,-999,-999,-999,-999,-999,-999,-999,-999,-999
,2005-08-27T03:55:12Z,WQS016,-20.15,148.88,38.2,-999,-999,-999,-999,-999,-999,-999,-999,-999,-999,-999,-999
,2005-08-27T03:55:14Z,WQS016,-20.15,148.88,38.4,-999,-999,-999,-999,-999,-999,-999,-999,-999,-999,-999,-999
,2005-08-27T03:55:14Z,WQS016,-20.15,148.88,38.6,-999,-999,-999,-999,-999,-999,-999,-999,-999,-999,-999,-999
,2005-08-27T03:55:14Z,WQS016,-20.15,148.88,38.8,-999,-999,-999,-999,-999,-999,-999,-999,-999,-999,-999,-999
,2005-08-27T03:55:14Z,WQS016,-20.15,148.88,39,-999,-999,-999,-999,-999,-999,-999,-999,-999,-999,-999,-999
,2005-08-27T03:55:16Z,WQS016,-20.15,148.88,39.2,-999,-999,-999,-999,-999,-999,-999,-999,-999,-999,-999,-999
,2005-08-27T03:55:16Z,WQS016,-20.15,148.88,39.4,-999,-999,-999,-999,-999,-999,-999,-999,-999,-999,-999,-999
,2005-08-27T03:55:16Z,WQS016,-20.15,148.88,39.6,-999,-999,-999,-999,-999,-999,-999,-999,-999,-999,-999,-999
,2005-08-27T03:55:16Z,WQS016,-20.15,148.88,39.8,-999,-999,-999,-999,-999,-999,-999,-999,-999,-999,-999,-999
,2005-08-27T03:55:18Z,WQS016,-20.15,148.88,40,-999,-999,-999,-999,-999,-999,-999,-999,-999,-999,-999,-999
,2005-08-27T03:55:18Z,WQS016,-20.15,148.88,40.2,-999,-999,-999,-999,-999,-999,-999,-999,-999,-999,-999,-999
,2005-08-27T03:55:18Z,WQS016,-20.15,148.88,40.4,-999,-999,-999,-999,-999,-999,-999,-999,-999,-999,-999,-999
,2005-08-27T03:55:18Z,WQS016,-20.15,148.88,40.6,-999,-999,-999,-999,-999,-999,-999,-999,-999,-999,-999,-999
,2005-08-27T03:55:20Z,WQS016,-20.15,148.88,40.8,-999,-999,-999,-999,-999,-999,-999,-999,-999,-999,-999,-999
,2005-08-27T03:55:20Z,WQS016,-20.15,148.88,41,-999,-999,-999,-999,-999,-999,-999,-999,-999,-999,-999,-999
,2005-08-27T03:55:20Z,WQS016,-20.15,148.88,41.2,-999,-999,-999,-999,-999,-999,-999,-999,-999,-999,-999,-999
,2005-08-27T03:55:20Z,WQS016,-20.15,148.88,41.4,-999,-999,-999,-999,-999,-999,-999,-999,-999,-999,-999,-999
,2005-08-27T03:55:22Z,WQS016,-20.15,148.88,41.6,-999,-999,-999,-999,-999,-999,-999,-999,-999,-999,-999,-999
,2005-08-27T03:55:22Z,WQS016,-20.15,148.88,41.8,-999,-999,-999,-999,-999,-999,-999,-999,-999,-999,-999,-999
,2005-08-27T03:55:22Z,WQS016,-20.15,148.88,42,-999,-999,-999,-999,-999,-999,-999,-999,-999,-999,-999,-999
,2005-08-27T03:55:22Z,WQS016,-20.15,148.88,42.2,-999,-999,-999,-999,-999,-999,-999,-999,-999,-999,-999,-999
,2005-08-27T03:55:24Z,WQS016,-20.15,148.88,42.4,-999,-999,-999,-999,-999,-999,-999,-999,-999,-999,-999,-999
,2005-08-27T03:55:24Z,WQS016,-20.15,148.88,42.6,-999,-999,-999,-999,-999,-999,-999,-999,-999,-999,-999,-999
,2005-08-27T03:55:24Z,WQS016,-20.15,148.88,42.8,-999,-999,-999,-999,-999,-999,-999,-999,-999,-999,-999,-999
,2005-08-27T03:55:26Z,WQS016,-20.15,148.88,43,-999,-999,-999,-999,-999,-999,-999,-999,-999,-999,-999,-999
,2005-08-27T03:55:26Z,WQS016,-20.15,148.88,43.2,-999,-999,-999,-999,-999,-999,-999,-999,-999,-999,-999,-999
,2005-08-27T03:55:26Z,WQS016,-20.15,148.88,43.4,-999,-999,-999,-999,-999,-999,-999,-999,-999,-999,-999,-999
,2005-08-27T03:55:26Z,WQS016,-20.15,148.88,43.6,-999,-999,-999,-999,-999,-999,-999,-999,-999,-999,-999,-999
,2005-08-27T03:55:28Z,WQS016,-20.15,148.88,43.8,-999,-999,-999,-999,-999,-999,-999,-999,-999,-999,-999,-999
,2005-08-27T03:55:28Z,WQS016,-20.15,148.88,44,-999,-999,-999,-999,-999,-999,-999,-999,-999,-999,-999,-999
,2005-08-27T03:55:28Z,WQS016,-20.15,148.88,44.2,-999,-999,-999,-999,-999,-999,-999,-999,-999,-999,-999,-999
,2005-08-27T03:55:28Z,WQS016,-20.15,148.88,44.4,-999,-999,-999,-999,-999,-999,-999,-999,-999,-999,-999,-999
,2005-08-27T03:55:30Z,WQS016,-20.15,148.88,44.6,-999,-999,-999,-999,-999,-999,-999,-999,-999,-999,-999,-999
,2005-08-27T03:55:30Z,WQS016,-20.15,148.88,44.8,-999,-999,-999,-999,-999,-999,-999,-999,-999,-999,-999,-999
,2005-08-27T03:55:30Z,WQS016,-20.15,148.88,45,-999,-999,-999,-999,-999,-999,-999,-999,-999,-999,-999,-999
,2005-08-27T03:55:30Z,WQS016,-20.15,148.88,45.2,-999,-999,-999,-999,-999,-999,-999,-999,-999,-999,-999,-999
,2005-08-27T03:55:32Z,WQS016,-20.15,148.88,45.4,-999,-999,-999,-999,-999,-999,-999,-999,-999,-999,-999,-999
,2005-08-27T03:55:32Z,WQS016,-20.15,148.88,45.6,-999,-999,-999,-999,-999,-999,-999,-999,-999,-999,-999,-999
,2005-08-27T03:55:32Z,WQS016,-20.15,148.88,45.8,-999,-999,-999,-999,-999,-999,-999,-999,-999,-999,-999,-999
,2005-08-27T03:55:32Z,WQS016,-20.15,148.88,46,-999,-999,-999,-999,-999,-999,-999,-999,-999,-999,-999,-999
,2005-08-27T03:55:34Z,WQS016,-20.15,148.88,46.2,-999,-999,-999,-999,-999,-999,-999,-999,-999,-999,-999,-999
,2005-08-27T03:55:34Z,WQS016,-20.15,148.88,46.4,-999,-999,-999,-999,-999,-999,-999,-999,-999,-999,-999,-999
,2005-08-27T03:55:34Z,WQS016,-20.15,148.88,46.6,-999,-999,-999,-999,-999,-999,-999,-999,-999,-999,-999,-999
,2005-08-27T03:55:34Z,WQS016,-20.15,148.88,46.8,-999,-999,-999,-999,-999,-999,-999,-999,-999,-999,-999,-999
,2005-08-27T03:55:36Z,WQS016,-20.15,148.88,47,-999,-999,-999,-999,-999,-999,-999,-999,-999,-999,-999,-999
,2005-08-27T03:55:36Z,WQS016,-20.15,148.88,47.2,-999,-999,-999,-999,-999,-999,-999,-999,-999,-999,-999,-999
,2005-08-27T03:55:36Z,WQS016,-20.15,148.88,47.4,-999,-999,-999,-999,-999,-999,-999,-999,-999,-999,-999,-999
,2005-08-27T03:55:36Z,WQS016,-20.15,148.88,47.6,-999,-999,-999,-999,-999,-999,-999,-999,-999,-999,-999,-999
,2005-08-27T03:55:38Z,WQS016,-20.15,148.88,47.8,-999,-999,-999,-999,-999,-999,-999,-999,-999,-999,-999,-999
,2005-08-27T03:55:38Z,WQS016,-20.15,148.88,48,-999,-999,-999,-999,-999,-999,-999,-999,-999,-999,-999,-999
,2005-08-27T03:55:38Z,WQS016,-20.15,148.88,48.2,-999,-999,-999,-999,-999,-999,-999,-999,-999,-999,-999,-999
,2005-08-27T03:55:38Z,WQS016,-20.15,148.88,48.4,-999,-999,-999,-999,-999,-999,-999,-999,-999,-999,-999,-999
,2005-08-27T03:55:40Z,WQS016,-20.15,148.88,48.6,-999,-999,-999,-999,-999,-999,-999,-999,-999,-999,-999,-999
,2005-08-27T03:55:40Z,WQS016,-20.15,148.88,48.8,-999,-999,-999,-999,-999,-999,-999,-999,-999,-999,-999,-999
,2005-08-27T03:55:40Z,WQS016,-20.15,148.88,49,-999,-999,-999,-999,-999,-999,-999,-999,-999,-999,-999,-999
,2005-08-27T03:55:40Z,WQS016,-20.15,148.88,49.2,-999,-999,-999,-999,-999,-999,-999,-999,-999,-999,-999,-999
,2005-08-27T03:55:42Z,WQS016,-20.15,148.88,49.4,-999,-999,-999,-999,-999,-999,-999,-999,-999,-999,-999,-999
,2005-08-27T03:55:42Z,WQS016,-20.15,148.88,49.6,-999,-999,-999,-999,-999,-999,-999,-999,-999,-999,-999,-999
,2005-08-27T03:55:42Z,WQS016,-20.15,148.88,49.8,-999,-999,-999,-999,-999,-999,-999,-999,-999,-999,-999,-999
,2005-08-27T03:55:42Z,WQS016,-20.15,148.88,50,-999,-999,-999,-999,-999,-999,-999,-999,-999,-999,-999,-999
,2005-08-27T03:55:44Z,WQS016,-20.15,148.88,50.2,-999,-999,-999,-999,-999,-999,-999,-999,-999,-999,-999,-999
,2005-08-27T03:55:44Z,WQS016,-20.15,148.88,50.4,-999,-999,-999,-999,-999,-999,-999,-999,-999,-999,-999,-999
,2005-08-27T03:55:44Z,WQS016,-20.15,148.88,50.6,-999,-999,-999,-999,-999,-999,-999,-999,-999,-999,-999,-999
,2005-08-27T03:55:44Z,WQS016,-20.15,148.88,50.8,-999,-999,-999,-999,-999,-999,-999,-999,-999,-999,-999,-999
,2005-08-27T03:55:45Z,WQS016,-20.15,148.88,51,-999,-999,-999,-999,-999,-999,-999,-999,-999,-999,-999,-999
,2005-08-27T03:55:45Z,WQS016,-20.15,148.88,51.2,-999,-999,-999,-999,-999,-999,-999,-999,-999,-999,-999,-999
,2005-08-27T03:55:45Z,WQS016,-20.15,148.88,51.4,-999,-999,-999,-999,-999,-999,-999,-999,-999,-999,-999,-999
,2005-08-27T03:55:45Z,WQS016,-20.15,148.88,51.6,-999,-999,-999,-999,-999,-999,-999,-999,-999,-999,-999,-999
,2005-08-27T03:55:48Z,WQS016,-20.15,148.88,51.8,-999,-999,-999,-999,-999,-999,-999,-999,-999,-999,-999,-999
,2005-08-27T03:55:48Z,WQS016,-20.15,148.88,52,-999,-999,-999,-999,-999,-999,-999,-999,-999,-999,-999,-999
,2005-08-27T03:55:48Z,WQS016,-20.15,148.88,52.2,-999,-999,-999,-999,-999,-999,-999,-999,-999,-999,-999,-999
,2005-08-27T03:55:48Z,WQS016,-20.15,148.88,52.4,-999,-999,-999,-999,-999,-999,-999,-999,-999,-999,-999,-999
,2005-08-27T03:55:50Z,WQS016,-20.15,148.88,52.6,-999,-999,-999,-999,-999,-999,-999,-999,-999,-999,-999,-999
,2005-08-27T03:55:50Z,WQS016,-20.15,148.88,52.8,-999,-999,-999,-999,-999,-999,-999,-999,-999,-999,-999,-999
,2005-08-27T03:55:50Z,WQS016,-20.15,148.88,53,-999,-999,-999,-999,-999,-999,-999,-999,-999,-999,-999,-999
,2005-08-27T03:55:50Z,WQS016,-20.15,148.88,53.2,-999,-999,-999,-999,-999,-999,-999,-999,-999,-999,-999,-999
,2005-08-27T03:55:52Z,WQS016,-20.15,148.88,53.4,-999,-999,-999,-999,-999,-999,-999,-999,-999,-999,-999,-999
,2005-08-27T03:55:52Z,WQS016,-20.15,148.88,53.6,-999,-999,-999,-999,-999,-999,-999,-999,-999,-999,-999,-999
,2005-08-27T03:55:52Z,WQS016,-20.15,148.88,53.8,-999,-999,-999,-999,-999,-999,-999,-999,-999,-999,-999,-999
,2005-08-27T03:55:52Z,WQS016,-20.15,148.88,54,-999,-999,-999,-999,-999,-999,-999,-999,-999,-999,-999,-999
,2005-08-27T03:55:53Z,WQS016,-20.15,148.88,54.2,-999,-999,-999,-999,-999,-999,-999,-999,-999,-999,-999,-999
,2005-08-27T03:55:53Z,WQS016,-20.15,148.88,54.4,-999,-999,-999,-999,-999,-999,-999,-999,-999,-999,-999,-999
,2005-08-27T03:55:53Z,WQS016,-20.15,148.88,54.6,-999,-999,-999,-999,-999,-999,-999,-999,-999,-999,-999,-999
,2005-08-27T03:55:53Z,WQS016,-20.15,148.88,54.8,-999,-999,-999,-999,-999,-999,-999,-999,-999,-999,-999,-999
,2005-08-27T03:55:56Z,WQS016,-20.15,148.88,55,-999,-999,-999,-999,-999,-999,-999,-999,-999,-999,-999,-999
,2005-08-27T03:55:56Z,WQS016,-20.15,148.88,55.2,-999,-999,-999,-999,-999,-999,-999,-999,-999,-999,-999,-999
,2005-08-27T03:55:56Z,WQS016,-20.15,148.88,55.4,-999,-999,-999,-999,-999,-999,-999,-999,-999,-999,-999,-999
,2005-08-27T03:55:56Z,WQS016,-20.15,148.88,55.6,-999,-999,-999,-999,-999,-999,-999,-999,-999,-999,-999,-999
,2005-08-27T03:55:58Z,WQS016,-20.15,148.88,55.8,-999,-999,-999,-999,-999,-999,-999,-999,-999,-999,-999,-999
,2005-08-27T03:55:58Z,WQS016,-20.15,148.88,56,-999,-999,-999,-999,-999,-999,-999,-999,-999,-999,-999,-999
,2005-08-27T03:55:58Z,WQS016,-20.15,148.88,56.2,-999,-999,-999,-999,-999,-999,-999,-999,-999,-999,-999,-999
,2005-08-27T03:55:58Z,WQS016,-20.15,148.88,56.4,-999,-999,-999,-999,-999,-999,-999,-999,-999,-999,-999,-999
,2005-08-27T03:56:00Z,WQS016,-20.15,148.88,56.6,-999,-999,-999,-999,-999,-999,-999,-999,-999,-999,-999,-999
,2005-08-27T03:56:00Z,WQS016,-20.15,148.88,56.8,-999,-999,-999,-999,-999,-999,-999,-999,-999,-999,-999,-999
,2005-08-27T03:56:00Z,WQS016,-20.15,148.88,57,-999,-999,-999,-999,-999,-999,-999,-999,-999,-999,-999,-999
,2005-08-27T03:56:00Z,WQS016,-20.15,148.88,57.2,-999,-999,-999,-999,-999,-999,-999,-999,-999,-999,-999,-999
,2005-08-27T03:56:02Z,WQS016,-20.15,148.88,57.4,-999,-999,-999,-999,-999,-999,-999,-999,-999,-999,-999,-999
,2005-08-27T03:56:02Z,WQS016,-20.15,148.88,57.6,-999,-999,-999,-999,-999,-999,-999,-999,-999,-999,-999,-999
,2005-08-27T03:56:02Z,WQS016,-20.15,148.88,57.8,-999,-999,-999,-999,-999,-999,-999,-999,-999,-999,-999,-999
,2005-08-27T03:56:04Z,WQS016,-20.15,148.88,58,-999,-999,-999,-999,-999,-999,-999,-999,-999,-999,-999,-999
,2005-08-27T03:56:04Z,WQS016,-20.15,148.88,58.2,-999,-999,-999,-999,-999,-999,-999,-999,-999,-999,-999,-999
,2005-08-27T03:56:04Z,WQS016,-20.15,148.88,58.4,-999,-999,-999,-999,-999,-999,-999,-999,-999,-999,-999,-999
,2005-08-27T03:56:04Z,WQS016,-20.15,148.88,58.6,-999,-999,-999,-999,-999,-999,-999,-999,-999,-999,-999,-999
,2005-08-27T03:56:06Z,WQS016,-20.15,148.88,58.8,-999,-999,-999,-999,-999,-999,-999,-999,-999,-999,-999,-999
,2005-08-27T03:56:06Z,WQS016,-20.15,148.88,59,-999,-999,-999,-999,-999,-999,-999,-999,-999,-999,-999,-999
,2005-08-27T03:56:06Z,WQS016,-20.15,148.88,59.2,-999,-999,-999,-999,-999,-999,-999,-999,-999,-999,-999,-999
,2005-08-27T03:56:06Z,WQS016,-20.15,148.88,59.4,-999,-999,-999,-999,-999,-999,-999,-999,-999,-999,-999,-999
,2005-08-27T03:56:08Z,WQS016,-20.15,148.88,59.6,-999,-999,-999,-999,-999,-999,-999,-999,-999,-999,-999,-999
,2005-08-27T03:56:08Z,WQS016,-20.15,148.88,59.8,-999,-999,-999,-999,-999,-999,-999,-999,-999,-999,-999,-999
,2005-08-27T03:56:08Z,WQS016,-20.15,148.88,60,-999,-999,-999,-999,-999,-999,-999,-999,-999,-999,-999,-999
,2005-08-27T03:56:08Z,WQS016,-20.15,148.88,60.2,-999,-999,-999,-999,-999,-999,-999,-999,-999,-999,-999,-999
,2005-08-27T03:56:09Z,WQS016,-20.15,148.88,60.4,-999,-999,-999,-999,-999,-999,-999,-999,-999,-999,-999,-999
,2005-08-27T03:56:09Z,WQS016,-20.15,148.88,60.6,-999,-999,-999,-999,-999,-999,-999,-999,-999,-999,-999,-999
,2005-08-27T03:56:09Z,WQS016,-20.15,148.88,60.8,-999,-999,-999,-999,-999,-999,-999,-999,-999,-999,-999,-999
,2005-08-27T03:56:09Z,WQS016,-20.15,148.88,61,-999,-999,-999,-999,-999,-999,-999,-999,-999,-999,-999,-999
,2005-08-27T03:56:12Z,WQS016,-20.15,148.88,61.2,-999,-999,-999,-999,-999,-999,-999,-999,-999,-999,-999,-999
,2005-08-27T03:56:12Z,WQS016,-20.15,148.88,61.4,-999,-999,-999,-999,-999,-999,-999,-999,-999,-999,-999,-999
,2005-08-27T03:56:12Z,WQS016,-20.15,148.88,61.6,-999,-999,-999,-999,-999,-999,-999,-999,-999,-999,-999,-999
,2005-08-27T03:56:12Z,WQS016,-20.15,148.88,61.8,-999,-999,-999,-999,-999,-999,-999,-999,-999,-999,-999,-999
,2005-08-27T03:56:14Z,WQS016,-20.15,148.88,62,-999,-999,-999,-999,-999,-999,-999,-999,-999,-999,-999,-999
,2005-08-27T03:56:14Z,WQS016,-20.15,148.88,62.2,-999,-999,-999,-999,-999,-999,-999,-999,-999,-999,-999,-999
,2005-08-27T03:56:14Z,WQS016,-20.15,148.88,62.4,-999,-999,-999,-999,-999,-999,-999,-999,-999,-999,-999,-999
,2005-08-27T03:56:14Z,WQS016,-20.15,148.88,62.6,-999,-999,-999,-999,-999,-999,-999,-999,-999,-999,-999,-999
,2005-08-27T03:56:16Z,WQS016,-20.15,148.88,62.8,-999,-999,-999,-999,-999,-999,-999,-999,-999,-999,-999,-999
,2005-08-27T03:56:16Z,WQS016,-20.15,148.88,63,-999,-999,-999,-999,-999,-999,-999,-999,-999,-999,-999,-999
,2005-08-27T03:56:16Z,WQS016,-20.15,148.88,63.2,-999,-999,-999,-999,-999,-999,-999,-999,-999,-999,-999,-999
,2005-08-27T03:56:16Z,WQS016,-20.15,148.88,63.4,-999,-999,-999,-999,-999,-999,-999,-999,-999,-999,-999,-999
,2005-08-27T03:56:18Z,WQS016,-20.15,148.88,63.6,-999,-999,-999,-999,-999,-999,-999,-999,-999,-999,-999,-999
,2005-08-27T03:56:18Z,WQS016,-20.15,148.88,63.8,-999,-999,-999,-999,-999,-999,-999,-999,-999,-999,-999,-999
,2005-08-27T03:56:18Z,WQS016,-20.15,148.88,64,-999,-999,-999,-999,-999,-999,-999,-999,-999,-999,-999,-999
,2005-08-27T03:56:18Z,WQS016,-20.15,148.88,64.2,-999,-999,-999,-999,-999,-999,-999,-999,-999,-999,-999,-999
,2005-08-27T03:56:20Z,WQS016,-20.15,148.88,64.4,-999,-999,-999,-999,-999,-999,-999,-999,-999,-999,-999,-999
,2005-08-27T03:56:20Z,WQS016,-20.15,148.88,64.6,-999,-999,-999,-999,-999,-999,-999,-999,-999,-999,-999,-999
,2005-08-27T03:56:20Z,WQS016,-20.15,148.88,64.8,-999,-999,-999,-999,-999,-999,-999,-999,-999,-999,-999,-999
,2005-08-27T03:56:20Z,WQS016,-20.15,148.88,65,-999,-999,-999,-999,-999,-999,-999,-999,-999,-999,-999,-999
,2005-08-27T03:56:22Z,WQS016,-20.15,148.88,65.2,-999,-999,-999,-999,-999,-999,-999,-999,-999,-999,-999,-999
,2005-08-27T03:56:22Z,WQS016,-20.15,148.88,65.4,-999,-999,-999,-999,-999,-999,-999,-999,-999,-999,-999,-999
,2005-08-27T03:56:22Z,WQS016,-20.15,148.88,65.6,-999,-999,-999,-999,-999,-999,-999,-999,-999,-999,-999,-999
,2005-08-27T03:56:22Z,WQS016,-20.15,148.88,65.8,-999,-999,-999,-999,-999,-999,-999,-999,-999,-999,-999,-999
,2005-08-27T03:56:24Z,WQS016,-20.15,148.88,66,-999,-999,-999,-999,-999,-999,-999,-999,-999,-999,-999,-999
,2005-08-27T03:56:24Z,WQS016,-20.15,148.88,66.2,-999,-999,-999,-999,-999,-999,-999,-999,-999,-999,-999,-999
,2005-08-27T03:56:24Z,WQS016,-20.15,148.88,66.4,-999,-999,-999,-999,-999,-999,-999,-999,-999,-999,-999,-999
,2005-08-27T03:56:24Z,WQS016,-20.15,148.88,66.6,-999,-999,-999,-999,-999,-999,-999,-999,-999,-999,-999,-999
,2005-08-27T03:56:26Z,WQS016,-20.15,148.88,66.8,-999,-999,-999,-999,-999,-999,-999,-999,-999,-999,-999,-999
,2005-08-27T03:56:26Z,WQS016,-20.15,148.88,67,-999,-999,-999,-999,-999,-999,-999,-999,-999,-999,-999,-999
,2005-08-27T03:56:26Z,WQS016,-20.15,148.88,67.2,-999,-999,-999,-999,-999,-999,-999,-999,-999,-999,-999,-999
,2005-08-27T03:56:26Z,WQS016,-20.15,148.88,67.4,-999,-999,-999,-999,-999,-999,-999,-999,-999,-999,-999,-999
,2005-08-27T03:56:28Z,WQS016,-20.15,148.88,67.6,-999,-999,-999,-999,-999,-999,-999,-999,-999,-999,-999,-999
,2005-08-27T03:56:28Z,WQS016,-20.15,148.88,67.8,-999,-999,-999,-999,-999,-999,-999,-999,-999,-999,-999,-999
,2005-08-27T03:56:28Z,WQS016,-20.15,148.88,68,-999,-999,-999,-999,-999,-999,-999,-999,-999,-999,-999,-999
,2005-08-27T03:56:28Z,WQS016,-20.15,148.88,68.2,-999,-999,-999,-999,-999,-999,-999,-999,-999,-999,-999,-999
,2005-08-27T03:56:30Z,WQS016,-20.15,148.88,68.4,-999,-999,-999,-999,-999,-999,-999,-999,-999,-999,-999,-999
,2005-08-27T03:56:30Z,WQS016,-20.15,148.88,68.6,-999,-999,-999,-999,-999,-999,-999,-999,-999,-999,-999,-999
,2005-08-27T03:56:30Z,WQS016,-20.15,148.88,68.8,-999,-999,-999,-999,-999,-999,-999,-999,-999,-999,-999,-999
,2005-08-27T03:56:30Z,WQS016,-20.15,148.88,69,-999,-999,-999,-999,-999,-999,-999,-999,-999,-999,-999,-999
,2005-08-27T03:56:32Z,WQS016,-20.15,148.88,69.2,-999,-999,-999,-999,-999,-999,-999,-999,-999,-999,-999,-999
,2005-08-27T03:56:32Z,WQS016,-20.15,148.88,69.4,-999,-999,-999,-999,-999,-999,-999,-999,-999,-999,-999,-999
,2005-08-27T03:56:32Z,WQS016,-20.15,148.88,69.6,-999,-999,-999,-999,-999,-999,-999,-999,-999,-999,-999,-999
,2005-08-27T03:56:32Z,WQS016,-20.15,148.88,69.8,-999,-999,-999,-999,-999,-999,-999,-999,-999,-999,-999,-999
,2005-08-27T03:56:33Z,WQS016,-20.15,148.88,70,-999,-999,-999,-999,-999,-999,-999,-999,-999,-999,-999,-999
,2005-08-27T03:56:33Z,WQS016,-20.15,148.88,70.2,-999,-999,-999,-999,-999,-999,-999,-999,-999,-999,-999,-999
,2005-08-27T03:56:33Z,WQS016,-20.15,148.88,70.4,-999,-999,-999,-999,-999,-999,-999,-999,-999,-999,-999,-999
,2005-08-27T03:56:33Z,WQS016,-20.15,148.88,70.6,-999,-999,-999,-999,-999,-999,-999,-999,-999,-999,-999,-999
,2005-08-27T03:56:36Z,WQS016,-20.15,148.88,70.8,-999,-999,-999,-999,-999,-999,-999,-999,-999,-999,-999,-999
,2005-08-27T03:56:36Z,WQS016,-20.15,148.88,71,-999,-999,-999,-999,-999,-999,-999,-999,-999,-999,-999,-999
,2005-08-27T03:56:36Z,WQS016,-20.15,148.88,71.2,-999,-999,-999,-999,-999,-999,-999,-999,-999,-999,-999,-999
,2005-08-27T03:56:36Z,WQS016,-20.15,148.88,71.4,-999,-999,-999,-999,-999,-999,-999,-999,-999,-999,-999,-999
,2005-08-27T03:56:38Z,WQS016,-20.15,148.88,71.6,-999,-999,-999,-999,-999,-999,-999,-999,-999,-999,-999,-999
,2005-08-27T03:56:38Z,WQS016,-20.15,148.88,71.8,-999,-999,-999,-999,-999,-999,-999,-999,-999,-999,-999,-999
,2005-08-27T03:56:38Z,WQS016,-20.15,148.88,72,-999,-999,-999,-999,-999,-999,-999,-999,-999,-999,-999,-999
,2005-08-27T03:56:40Z,WQS016,-20.15,148.88,72.2,-999,-999,-999,-999,-999,-999,-999,-999,-999,-999,-999,-999
,2005-08-27T03:56:40Z,WQS016,-20.15,148.88,72.4,-999,-999,-999,-999,-999,-999,-999,-999,-999,-999,-999,-999
,2005-08-27T03:56:40Z,WQS016,-20.15,148.88,72.6,-999,-999,-999,-999,-999,-999,-999,-999,-999,-999,-999,-999
,2005-08-27T03:56:40Z,WQS016,-20.15,148.88,72.8,-999,-999,-999,-999,-999,-999,-999,-999,-999,-999,-999,-999
,2005-08-27T03:56:42Z,WQS016,-20.15,148.88,73,-999,-999,-999,-999,-999,-999,-999,-999,-999,-999,-999,-999
,2005-08-27T03:56:42Z,WQS016,-20.15,148.88,73.2,-999,-999,-999,-999,-999,-999,-999,-999,-999,-999,-999,-999
,2005-08-27T03:56:42Z,WQS016,-20.15,148.88,73.4,-999,-999,-999,-999,-999,-999,-999,-999,-999,-999,-999,-999
,2005-08-27T03:56:42Z,WQS016,-20.15,148.88,73.6,-999,-999,-999,-999,-999,-999,-999,-999,-999,-999,-999,-999
,2005-08-27T03:56:44Z,WQS016,-20.15,148.88,73.8,-999,-999,-999,-999,-999,-999,-999,-999,-999,-999,-999,-999
,2005-08-27T03:56:44Z,WQS016,-20.15,148.88,74,-999,-999,-999,-999,-999,-999,-999,-999,-999,-999,-999,-999
,2005-08-27T03:56:44Z,WQS016,-20.15,148.88,74.2,-999,-999,-999,-999,-999,-999,-999,-999,-999,-999,-999,-999
,2005-08-27T03:56:44Z,WQS016,-20.15,148.88,74.4,-999,-999,-999,-999,-999,-999,-999,-999,-999,-999,-999,-999
,2005-08-27T03:56:46Z,WQS016,-20.15,148.88,74.6,-999,-999,-999,-999,-999,-999,-999,-999,-999,-999,-999,-999
,2005-08-27T03:56:46Z,WQS016,-20.15,148.88,74.8,-999,-999,-999,-999,-999,-999,-999,-999,-999,-999,-999,-999
,2005-08-27T03:56:46Z,WQS016,-20.15,148.88,75,-999,-999,-999,-999,-999,-999,-999,-999,-999,-999,-999,-999
,2005-08-27T03:56:46Z,WQS016,-20.15,148.88,75.2,-999,-999,-999,-999,-999,-999,-999,-999,-999,-999,-999,-999
,2005-08-27T03:56:48Z,WQS016,-20.15,148.88,75.4,-999,-999,-999,-999,-999,-999,-999,-999,-999,-999,-999,-999
,2005-08-27T03:56:48Z,WQS016,-20.15,148.88,75.6,-999,-999,-999,-999,-999,-999,-999,-999,-999,-999,-999,-999
,2005-08-27T03:56:48Z,WQS016,-20.15,148.88,75.8,-999,-999,-999,-999,-999,-999,-999,-999,-999,-999,-999,-999
,2005-08-27T03:56:48Z,WQS016,-20.15,148.88,76,-999,-999,-999,-999,-999,-999,-999,-999,-999,-999,-999,-999
,2005-08-27T03:56:50Z,WQS016,-20.15,148.88,76.2,-999,-999,-999,-999,-999,-999,-999,-999,-999,-999,-999,-999
,2005-08-27T03:56:50Z,WQS016,-20.15,148.88,76.4,-999,-999,-999,-999,-999,-999,-999,-999,-999,-999,-999,-999
,2005-08-27T03:56:50Z,WQS016,-20.15,148.88,76.6,-999,-999,-999,-999,-999,-999,-999,-999,-999,-999,-999,-999
,2005-08-27T03:56:50Z,WQS016,-20.15,148.88,76.8,-999,-999,-999,-999,-999,-999,-999,-999,-999,-999,-999,-999
,2005-08-27T03:56:52Z,WQS016,-20.15,148.88,77,-999,-999,-999,-999,-999,-999,-999,-999,-999,-999,-999,-999
,2005-08-27T03:56:52Z,WQS016,-20.15,148.88,77.2,-999,-999,-999,-999,-999,-999,-999,-999,-999,-999,-999,-999
,2005-08-27T03:56:52Z,WQS016,-20.15,148.88,77.4,-999,-999,-999,-999,-999,-999,-999,-999,-999,-999,-999,-999
,2005-08-27T03:56:52Z,WQS016,-20.15,148.88,77.6,-999,-999,-999,-999,-999,-999,-999,-999,-999,-999,-999,-999
,2005-08-27T03:56:54Z,WQS016,-20.15,148.88,77.8,-999,-999,-999,-999,-999,-999,-999,-999,-999,-999,-999,-999
,2005-08-27T03:56:54Z,WQS016,-20.15,148.88,78,-999,-999,-999,-999,-999,-999,-999,-999,-999,-999,-999,-999
,2005-08-27T03:56:54Z,WQS016,-20.15,148.88,78.2,-999,-999,-999,-999,-999,-999,-999,-999,-999,-999,-999,-999
,2005-08-27T03:56:54Z,WQS016,-20.15,148.88,78.4,-999,-999,-999,-999,-999,-999,-999,-999,-999,-999,-999,-999
,2005-08-27T03:56:56Z,WQS016,-20.15,148.88,78.6,-999,-999,-999,-999,-999,-999,-999,-999,-999,-999,-999,-999
,2005-08-27T03:56:56Z,WQS016,-20.15,148.88,78.8,-999,-999,-999,-999,-999,-999,-999,-999,-999,-999,-999,-999
,2005-08-27T03:56:56Z,WQS016,-20.15,148.88,79,-999,-999,-999,-999,-999,-999,-999,-999,-999,-999,-999,-999
,2005-08-27T03:56:56Z,WQS016,-20.15,148.88,79.2,-999,-999,-999,-999,-999,-999,-999,-999,-999,-999,-999,-999
,2005-08-27T03:56:57Z,WQS016,-20.15,148.88,79.4,-999,-999,-999,-999,-999,-999,-999,-999,-999,-999,-999,-999
,2005-08-27T03:56:57Z,WQS016,-20.15,148.88,79.6,-999,-999,-999,-999,-999,-999,-999,-999,-999,-999,-999,-999
,2005-08-27T03:56:57Z,WQS016,-20.15,148.88,79.8,-999,-999,-999,-999,-999,-999,-999,-999,-999,-999,-999,-999
,2005-08-27T03:56:57Z,WQS016,-20.15,148.88,80,-999,-999,-999,-999,-999,-999,-999,-999,-999,-999,-999,-999
,2005-08-27T03:57:00Z,WQS016,-20.15,148.88,80.2,-999,-999,-999,-999,-999,-999,-999,-999,-999,-999,-999,-999
,2005-08-27T03:57:00Z,WQS016,-20.15,148.88,80.4,-999,-999,-999,-999,-999,-999,-999,-999,-999,-999,-999,-999
,2005-08-27T03:57:00Z,WQS016,-20.15,148.88,80.6,-999,-999,-999,-999,-999,-999,-999,-999,-999,-999,-999,-999
,2005-08-27T03:57:00Z,WQS016,-20.15,148.88,80.8,-999,-999,-999,-999,-999,-999,-999,-999,-999,-999,-999,-999
,2005-08-27T03:57:02Z,WQS016,-20.15,148.88,81,-999,-999,-999,-999,-999,-999,-999,-999,-999,-999,-999,-999
,2005-08-27T03:57:02Z,WQS016,-20.15,148.88,81.2,-999,-999,-999,-999,-999,-999,-999,-999,-999,-999,-999,-999
,2005-08-27T03:57:02Z,WQS016,-20.15,148.88,81.4,-999,-999,-999,-999,-999,-999,-999,-999,-999,-999,-999,-999
,2005-08-27T03:57:02Z,WQS016,-20.15,148.88,81.6,-999,-999,-999,-999,-999,-999,-999,-999,-999,-999,-999,-999
,2005-08-27T03:57:03Z,WQS016,-20.15,148.88,81.8,-999,-999,-999,-999,-999,-999,-999,-999,-999,-999,-999,-999
,2005-08-27T03:57:03Z,WQS016,-20.15,148.88,82,-999,-999,-999,-999,-999,-999,-999,-999,-999,-999,-999,-999
,2005-08-27T03:57:03Z,WQS016,-20.15,148.88,82.2,-999,-999,-999,-999,-999,-999,-999,-999,-999,-999,-999,-999
,2005-08-27T03:57:03Z,WQS016,-20.15,148.88,82.4,-999,-999,-999,-999,-999,-999,-999,-999,-999,-999,-999,-999
,2005-08-27T03:57:06Z,WQS016,-20.15,148.88,82.6,-999,-999,-999,-999,-999,-999,-999,-999,-999,-999,-999,-999
,2005-08-27T03:57:06Z,WQS016,-20.15,148.88,82.8,-999,-999,-999,-999,-999,-999,-999,-999,-999,-999,-999,-999
,2005-08-27T03:57:06Z,WQS016,-20.15,148.88,83,-999,-999,-999,-999,-999,-999,-999,-999,-999,-999,-999,-999
,2005-08-27T03:57:06Z,WQS016,-20.15,148.88,83.2,-999,-999,-999,-999,-999,-999,-999,-999,-999,-999,-999,-999
,2005-08-27T03:57:08Z,WQS016,-20.15,148.88,83.4,-999,-999,-999,-999,-999,-999,-999,-999,-999,-999,-999,-999
,2005-08-27T03:57:08Z,WQS016,-20.15,148.88,83.6,-999,-999,-999,-999,-999,-999,-999,-999,-999,-999,-999,-999
,2005-08-27T03:57:08Z,WQS016,-20.15,148.88,83.8,-999,-999,-999,-999,-999,-999,-999,-999,-999,-999,-999,-999
,2005-08-27T03:57:08Z,WQS016,-20.15,148.88,84,-999,-999,-999,-999,-999,-999,-999,-999,-999,-999,-999,-999
,2005-08-27T03:57:10Z,WQS016,-20.15,148.88,84.2,-999,-999,-999,-999,-999,-999,-999,-999,-999,-999,-999,-999
,2005-08-27T03:57:10Z,WQS016,-20.15,148.88,84.4,-999,-999,-999,-999,-999,-999,-999,-999,-999,-999,-999,-999
,2005-08-27T03:57:10Z,WQS016,-20.15,148.88,84.6,-999,-999,-999,-999,-999,-999,-999,-999,-999,-999,-999,-999
,2005-08-27T03:57:10Z,WQS016,-20.15,148.88,84.8,-999,-999,-999,-999,-999,-999,-999,-999,-999,-999,-999,-999
,2005-08-27T03:57:12Z,WQS016,-20.15,148.88,85,-999,-999,-999,-999,-999,-999,-999,-999,-999,-999,-999,-999
,2005-08-27T03:57:12Z,WQS016,-20.15,148.88,85.2,-999,-999,-999,-999,-999,-999,-999,-999,-999,-999,-999,-999
,2005-08-27T03:57:12Z,WQS016,-20.15,148.88,85.4,-999,-999,-999,-999,-999,-999,-999,-999,-999,-999,-999,-999
,2005-08-27T03:57:12Z,WQS016,-20.15,148.88,85.6,-999,-999,-999,-999,-999,-999,-999,-999,-999,-999,-999,-999
,2005-08-27T03:57:13Z,WQS016,-20.15,148.88,85.8,-999,-999,-999,-999,-999,-999,-999,-999,-999,-999,-999,-999
,2005-08-27T03:57:13Z,WQS016,-20.15,148.88,86,-999,-999,-999,-999,-999,-999,-999,-999,-999,-999,-999,-999
,2005-08-27T03:57:13Z,WQS016,-20.15,148.88,86.2,-999,-999,-999,-999,-999,-999,-999,-999,-999,-999,-999,-999
,2005-08-27T03:57:16Z,WQS016,-20.15,148.88,86.4,-999,-999,-999,-999,-999,-999,-999,-999,-999,-999,-999,-999
,2005-08-27T03:57:16Z,WQS016,-20.15,148.88,86.6,-999,-999,-999,-999,-999,-999,-999,-999,-999,-999,-999,-999
,2005-08-27T03:57:16Z,WQS016,-20.15,148.88,86.8,-999,-999,-999,-999,-999,-999,-999,-999,-999,-999,-999,-999
,2005-08-27T03:57:16Z,WQS016,-20.15,148.88,87,-999,-999,-999,-999,-999,-999,-999,-999,-999,-999,-999,-999
,2005-08-27T03:57:18Z,WQS016,-20.15,148.88,87.2,-999,-999,-999,-999,-999,-999,-999,-999,-999,-999,-999,-999
,2005-08-27T03:57:18Z,WQS016,-20.15,148.88,87.4,-999,-999,-999,-999,-999,-999,-999,-999,-999,-999,-999,-999
,2005-08-27T03:57:18Z,WQS016,-20.15,148.88,87.6,-999,-999,-999,-999,-999,-999,-999,-999,-999,-999,-999,-999
,2005-08-27T03:57:18Z,WQS016,-20.15,148.88,87.8,-999,-999,-999,-999,-999,-999,-999,-999,-999,-999,-999,-999
,2005-08-27T03:57:20Z,WQS016,-20.15,148.88,88,-999,-999,-999,-999,-999,-999,-999,-999,-999,-999,-999,-999
,2005-08-27T03:57:20Z,WQS016,-20.15,148.88,88.2,-999,-999,-999,-999,-999,-999,-999,-999,-999,-999,-999,-999
,2005-08-27T03:57:20Z,WQS016,-20.15,148.88,88.4,-999,-999,-999,-999,-999,-999,-999,-999,-999,-999,-999,-999
,2005-08-27T03:57:20Z,WQS016,-20.15,148.88,88.6,-999,-999,-999,-999,-999,-999,-999,-999,-999,-999,-999,-999
,2005-08-27T03:57:22Z,WQS016,-20.15,148.88,88.8,-999,-999,-999,-999,-999,-999,-999,-999,-999,-999,-999,-999
,2005-08-27T03:57:22Z,WQS016,-20.15,148.88,89,-999,-999,-999,-999,-999,-999,-999,-999,-999,-999,-999,-999
,2005-08-27T03:57:22Z,WQS016,-20.15,148.88,89.2,-999,-999,-999,-999,-999,-999,-999,-999,-999,-999,-999,-999
,2005-08-27T03:57:22Z,WQS016,-20.15,148.88,89.4,-999,-999,-999,-999,-999,-999,-999,-999,-999,-999,-999,-999
,2005-08-27T03:57:24Z,WQS016,-20.15,148.88,89.6,-999,-999,-999,-999,-999,-999,-999,-999,-999,-999,-999,-999
,2005-08-27T03:57:24Z,WQS016,-20.15,148.88,89.8,-999,-999,-999,-999,-999,-999,-999,-999,-999,-999,-999,-999
,2005-08-27T03:57:24Z,WQS016,-20.15,148.88,90,-999,-999,-999,-999,-999,-999,-999,-999,-999,-999,-999,-999
,2005-08-27T03:57:24Z,WQS016,-20.15,148.88,90.2,-999,-999,-999,-999,-999,-999,-999,-999,-999,-999,-999,-999
,2005-08-27T03:57:26Z,WQS016,-20.15,148.88,90.4,-999,-999,-999,-999,-999,-999,-999,-999,-999,-999,-999,-999
,2005-08-27T03:57:26Z,WQS016,-20.15,148.88,90.6,-999,-999,-999,-999,-999,-999,-999,-999,-999,-999,-999,-999
,2005-08-27T03:57:26Z,WQS016,-20.15,148.88,90.8,-999,-999,-999,-999,-999,-999,-999,-999,-999,-999,-999,-999
,2005-08-27T03:57:26Z,WQS016,-20.15,148.88,91,-999,-999,-999,-999,-999,-999,-999,-999,-999,-999,-999,-999
,2005-08-27T03:57:27Z,WQS016,-20.15,148.88,91.2,-999,-999,-999,-999,-999,-999,-999,-999,-999,-999,-999,-999
,2005-08-27T03:57:27Z,WQS016,-20.15,148.88,91.4,-999,-999,-999,-999,-999,-999,-999,-999,-999,-999,-999,-999
,2005-08-27T03:57:27Z,WQS016,-20.15,148.88,91.6,-999,-999,-999,-999,-999,-999,-999,-999,-999,-999,-999,-999
,2005-08-27T03:57:27Z,WQS016,-20.15,148.88,91.8,-999,-999,-999,-999,-999,-999,-999,-999,-999,-999,-999,-999
,2005-08-27T03:57:30Z,WQS016,-20.15,148.88,92,-999,-999,-999,-999,-999,-999,-999,-999,-999,-999,-999,-999
,2005-08-27T03:57:30Z,WQS016,-20.15,148.88,92.2,-999,-999,-999,-999,-999,-999,-999,-999,-999,-999,-999,-999
,2005-08-27T03:57:30Z,WQS016,-20.15,148.88,92.4,-999,-999,-999,-999,-999,-999,-999,-999,-999,-999,-999,-999
,2005-08-27T03:57:30Z,WQS016,-20.15,148.88,92.6,-999,-999,-999,-999,-999,-999,-999,-999,-999,-999,-999,-999
,2005-08-27T03:57:32Z,WQS016,-20.15,148.88,92.8,-999,-999,-999,-999,-999,-999,-999,-999,-999,-999,-999,-999
,2005-08-27T03:57:32Z,WQS016,-20.15,148.88,93,-999,-999,-999,-999,-999,-999,-999,-999,-999,-999,-999,-999
,2005-08-27T03:57:32Z,WQS016,-20.15,148.88,93.2,-999,-999,-999,-999,-999,-999,-999,-999,-999,-999,-999,-999
,2005-08-27T03:57:32Z,WQS016,-20.15,148.88,93.4,-999,-999,-999,-999,-999,-999,-999,-999,-999,-999,-999,-999
,2005-08-27T03:57:34Z,WQS016,-20.15,148.88,93.6,-999,-999,-999,-999,-999,-999,-999,-999,-999,-999,-999,-999
,2005-08-27T03:57:34Z,WQS016,-20.15,148.88,93.8,-999,-999,-999,-999,-999,-999,-999,-999,-999,-999,-999,-999
,2005-08-27T03:57:34Z,WQS016,-20.15,148.88,94,-999,-999,-999,-999,-999,-999,-999,-999,-999,-999,-999,-999
,2005-08-27T03:57:34Z,WQS016,-20.15,148.88,94.2,-999,-999,-999,-999,-999,-999,-999,-999,-999,-999,-999,-999
,2005-08-27T03:57:36Z,WQS016,-20.15,148.88,94.4,-999,-999,-999,-999,-999,-999,-999,-999,-999,-999,-999,-999
,2005-08-27T03:57:36Z,WQS016,-20.15,148.88,94.6,-999,-999,-999,-999,-999,-999,-999,-999,-999,-999,-999,-999
,2005-08-27T03:57:36Z,WQS016,-20.15,148.88,94.8,-999,-999,-999,-999,-999,-999,-999,-999,-999,-999,-999,-999
,2005-08-27T03:57:36Z,WQS016,-20.15,148.88,95,-999,-999,-999,-999,-999,-999,-999,-999,-999,-999,-999,-999
,2005-08-27T03:57:37Z,WQS016,-20.15,148.88,95.2,-999,-999,-999,-999,-999,-999,-999,-999,-999,-999,-999,-999
,2005-08-27T03:57:37Z,WQS016,-20.15,148.88,95.4,-999,-999,-999,-999,-999,-999,-999,-999,-999,-999,-999,-999
,2005-08-27T03:57:37Z,WQS016,-20.15,148.88,95.6,-999,-999,-999,-999,-999,-999,-999,-999,-999,-999,-999,-999
,2005-08-27T03:57:37Z,WQS016,-20.15,148.88,95.8,-999,-999,-999,-999,-999,-999,-999,-999,-999,-999,-999,-999
,2005-08-27T03:57:40Z,WQS016,-20.15,148.88,96,-999,-999,-999,-999,-999,-999,-999,-999,-999,-999,-999,-999
,2005-08-27T03:57:40Z,WQS016,-20.15,148.88,96.2,-999,-999,-999,-999,-999,-999,-999,-999,-999,-999,-999,-999
,2005-08-27T03:57:40Z,WQS016,-20.15,148.88,96.4,-999,-999,-999,-999,-999,-999,-999,-999,-999,-999,-999,-999
,2005-08-27T03:57:40Z,WQS016,-20.15,148.88,96.6,-999,-999,-999,-999,-999,-999,-999,-999,-999,-999,-999,-999
,2005-08-27T03:57:42Z,WQS016,-20.15,148.88,96.8,-999,-999,-999,-999,-999,-999,-999,-999,-999,-999,-999,-999
,2005-08-27T03:57:42Z,WQS016,-20.15,148.88,97,-999,-999,-999,-999,-999,-999,-999,-999,-999,-999,-999,-999
,2005-08-27T03:57:42Z,WQS016,-20.15,148.88,97.2,-999,-999,-999,-999,-999,-999,-999,-999,-999,-999,-999,-999
,2005-08-27T03:57:42Z,WQS016,-20.15,148.88,97.4,-999,-999,-999,-999,-999,-999,-999,-999,-999,-999,-999,-999
,2005-08-27T03:57:44Z,WQS016,-20.15,148.88,97.6,-999,-999,-999,-999,-999,-999,-999,-999,-999,-999,-999,-999
,2005-08-27T03:57:44Z,WQS016,-20.15,148.88,97.8,-999,-999,-999,-999,-999,-999,-999,-999,-999,-999,-999,-999
,2005-08-27T03:57:44Z,WQS016,-20.15,148.88,98,-999,-999,-999,-999,-999,-999,-999,-999,-999,-999,-999,-999
,2005-08-27T03:57:44Z,WQS016,-20.15,148.88,98.2,-999,-999,-999,-999,-999,-999,-999,-999,-999,-999,-999,-999
,2005-08-27T03:57:46Z,WQS016,-20.15,148.88,98.4,-999,-999,-999,-999,-999,-999,-999,-999,-999,-999,-999,-999
,2005-08-27T03:57:46Z,WQS016,-20.15,148.88,98.6,-999,-999,-999,-999,-999,-999,-999,-999,-999,-999,-999,-999
,2005-08-27T03:57:46Z,WQS016,-20.15,148.88,98.8,-999,-999,-999,-999,-999,-999,-999,-999,-999,-999,-999,-999
,2005-08-27T03:57:46Z,WQS016,-20.15,148.88,99,-999,-999,-999,-999,-999,-999,-999,-999,-999,-999,-999,-999
,2005-08-27T03:57:48Z,WQS016,-20.15,148.88,99.2,-999,-999,-999,-999,-999,-999,-999,-999,-999,-999,-999,-999
,2005-08-27T03:57:48Z,WQS016,-20.15,148.88,99.4,-999,-999,-999,-999,-999,-999,-999,-999,-999,-999,-999,-999
,2005-08-27T03:57:48Z,WQS016,-20.15,148.88,99.6,-999,-999,-999,-999,-999,-999,-999,-999,-999,-999,-999,-999
,2005-08-27T03:57:48Z,WQS016,-20.15,148.88,99.8,-999,-999,-999,-999,-999,-999,-999,-999,-999,-999,-999,-999
,2005-08-27T03:57:50Z,WQS016,-20.15,148.88,100,-999,-999,-999,-999,-999,-999,-999,-999,-999,-999,-999,-999
