GLOBAL ATTRIBUTES,,Comments,,,,,,,,,,,,,,,,,,,,,,,,,,,,,,,,,,,,,,,,,,,,,,,,,,,,,
title,GBR Marine Monitorin Program-Inshore Water Quality,,,,,,,,,,,,,,,,,,,,,,,,,,,,,,,,,,,,,,,,,,,,,,,,,,,,,,
project,Integrated Marine Observing System (IMOS),,,,,,,,,,,,,,,,,,,,,,,,,,,,,,,,,,,,,,,,,,,,,,,,,,,,,,
original_project_name, ,,,,,,,,,,,,,,,,,,,,,,,,,,,,,,,,,,,,,,,,,,,,,,,,,,,,,,
institution,AIMS (Australian Institute of Marine Science); JCU (James Cook University);  Cape York Water Monitoring Partnership,,,,,,,,,,,,,,,,,,,,,,,,,,,,,,,,,,,,,,,,,,,,,,,,,,,,,,
abstract,"The data were collected from 2018-2019, at stations in the Great Barrier Reef on multiple vessels. These samples were taken as part of the Marine Monitoring Program – Inshore Water Quality, which is a partnership between the Great Barrier Reef Marine Park Authority, the Australian Government, AIMS, JCU, and the Cape York Water Monitoring Partnership.  The data were collected to determine the bio-optical charateristics of this region. The data can be used for Ocean Colour sensor validation. Parameters measured are chlorophyll-a, total suspended solids of the water column, and the absorption coefficients of the dissolved components.  ",,,,,,,,,,,,,,,,,,,,,,,,,,,,,,,,,,,,,,,,,,,,,,,,,,,,,,
conventions,,,,,,,,,,,,,,,,,,,,,,,,,,,,,,,,,,,,,,,,,,,,,,,,,,,,,,,
date_created,,,,,,,,,,,,,,,,,,,,,,,,,,,,,,,,,,,,,,,,,,,,,,,,,,,,,,,
date_modified,,,,,,,,,,,,,,,,,,,,,,,,,,,,,,,,,,,,,,,,,,,,,,,,,,,,,,,
history,data has been quality controlled by in-house procedures,,,,,,,,,,,,,,,,,,,,,,,,,,,,,,,,,,,,,,,,,,,,,,,,,,,,,,
comment,"A value of -999 means the pigment was not measured, while 0.000 means it was measured but below the detection limit.",,,,,,,,,,,,,,,,,,,,,,,,,,,,,,,,,,,,,,,,,,,,,,,,,,,,,,
source,"Chlorophyll-a concentrations were measured fluorometrically using a Turner Designs 10AU fluorometer, after grinding the filters in 90% acetone, using the basic fluorometric method with acidification set out in Parsons et al (1984). The extract chlorophyll concentrations were determined spectrophotometrically using the wavelengths and equations specified by Jeffrey and Humphrey (1975).",,,,,,,,,,,,,,,,,,,,,,,,,,,,,,,,,,,,,,,,,,,,,,,,,,,,,,
keywords,Oceans>Ocean Chemistry>Pigments;Oceans>ocean Chemistry>Ocean Colour;Oceans>Ocean Chemistry>Chlorophyll a,,,,,,,,,,,,,,,,,,,,,,,,,,,,,,,,,,,,,,,,,,,,,,,,,,,,,,
vessel_name, ,,,,,,,,,,,,,,,,,,,,,,,,,,,,,,,,,,,,,,,,,,,,,,,,,,,,,,
platform_code, ,,,,,,,,,,,,,,,,,,,,,,,,,,,,,,,,,,,,,,,,,,,,,,,,,,,,,,
cruise_id,GBR_WQP_2018_2019,,,,,,,,,,,,,,,,,,,,,,,,,,,,,,,,,,,,,,,,,,,,,,,,,,,,,,
references,"Waterhouse, J., Gruber, R., Logan, M., Petus, C., Howley, C., Lewis, S., Tracey, D., James, C., Mellors, J., Tonin, H., Skuza, M., Costello, P., Davidson, J., Gunn, K., Lefevre, C., Moran, D., Robson, B., Shanahan, M., Zagorskis, I., Shellberg, J., 2021. Marine Monitoring Program: Annual Report for Inshore Water Quality Monitoring 2019–20. Report for the Great Barrier Reef Marine Park Authority, Great Barrier Reef Marine Park Authority, Townsville;  Great Barrier Reef Marine Park Authority (2021). Great Barrier Reef Marine Monitoring Program Quality Assurance and Quality Control Manual 2019-20. Great Barrier Reef Marine Park Authority, Townsville, 310pp.",, ,,,,,,,,,,,,,,,,,,,,,,,,,,,,,,,,,,,,,,,,,,,,,,,,,,,,
naming_authority,CSIRO Oceans and Atmosphere (O&A),,,,,,,,,,,,,,,,,,,,,,,,,,,,,,,,,,,,,,,,,,,,,,,,,,,,,,
cdm_data_type,Point,,,,,,,,,,,,,,,,,,,,,,,,,,,,,,,,,,,,,,,,,,,,,,,,,,,,,,
geospatial_lat_min,-20.5781667,calculated automatically from table,,,,,,,,,,,,,,,,,,,,,,,,,,,,,,,,,,,,,,,,,,,,,,,,,,,,,
geospatial_lat_max,-16.1116667,calculated automatically from table,,,,,,,,,,,,,,,,,,,,,,,,,,,,,,,,,,,,,,,,,,,,,,,,,,,,,
geospatial_lon_min,145.2607,calculated automatically from table,,,,,,,,,,,,,,,,,,,,,,,,,,,,,,,,,,,,,,,,,,,,,,,,,,,,,
geospatial_lon_max,149.03975,calculated automatically from table,,,,,,,,,,,,,,,,,,,,,,,,,,,,,,,,,,,,,,,,,,,,,,,,,,,,,
geospatial_vertical_min,0,calculated automatically from table,,,,,,,,,,,,,,,,,,,,,,,,,,,,,,,,,,,,,,,,,,,,,,,,,,,,,
geospatial_vertical_max,36,calculated automatically from table,,,,,,,,,,,,,,,,,,,,,,,,,,,,,,,,,,,,,,,,,,,,,,,,,,,,,
local_time_zone,10,AEST (UTC +10),,,,,,,,,,,,,,,,,,,,,,,,,,,,,,,,,,,,,,,,,,,,,,,,,,,,,
data_centre,eMarine Information Infrastructure (eMII),,,,,,,,,,,,,,,,,,,,,,,,,,,,,,,,,,,,,,,,,,,,,,,,,,,,,,
data_centre_email,info@emii.org.au,,,,,,,,,,,,,,,,,,,,,,,,,,,,,,,,,,,,,,,,,,,,,,,,,,,,,,
author," Zagorskis, Irena; Gruber, Renee",,,,,,,,,,,,,,,,,,,,,,,,,,,,,,,,,,,,,,,,,,,,,,,,,,,,,,
author_email, R. Gruber@aims.gov.au,,,,,,,,,,,,,,,,,,,,,,,,,,,,,,,,,,,,,,,,,,,,,,,,,,,,,,
principal_investigator,"Gruber, Renee;  Waterhouse, Jane; Howley, Christina",,,,,,,,,,,,,,,,,,,,,,,,,,,,,,,,,,,,,,,,,,,,,,,,,,,,,,
principal_investigator_email,R.Gruber@aims.gov.au; Jane.Waterhouse@jcu.edu.au; christina@capeyorkwaterpartnership.org ,,,,,,,,,,,,,,,,,,,,,,,,,,,,,,,,,,,,,,,,,,,,,,,,,,,,,,
publisher,Australian Ocean Data Network,,,,,,,,,,,,,,,,,,,,,,,,,,,,,,,,,,,,,,,,,,,,,,,,,,,,,,
publisher_email,info@aodn.org.au,,,,,,,,,,,,,,,,,,,,,,,,,,,,,,,,,,,,,,,,,,,,,,,,,,,,,,
institution,IMOS Satellite Remote Sensing - Ocean Colour Sub-facility - Bio-Optical Database of Australian Waters,,,,,,,,,,,,,,,,,,,,,,,,,,,,,,,,,,,,,,,,,,,,,,,,,,,,,,
institution_principal_investigator,"Schroeder, Thomas",,,,,,,,,,,,,,,,,,,,,,,,,,,,,,,,,,,,,,,,,,,,,,,,,,,,,,
institution_principal_investigator_email,Thomas.Schroeder@csiro.au,,,,,,,,,,,,,,,,,,,,,,,,,,,,,,,,,,,,,,,,,,,,,,,,,,,,,,
institution_references,http://www.csiro.au/en/Research/OandA,,,,,,,,,,,,,,,,,,,,,,,,,,,,,,,,,,,,,,,,,,,,,,,,,,,,,,
citation,"To cite this data set in a publication, use the format ""IMOS [year-of-data-downloaded], [Title], [data-access-url], accessed [date-of-access]""",,,,,,,,,,,,,,,,,,,,,,,,,,,,,,,,,,,,,,,,,,,,,,,,,,,,,,
acknowledgement,"Data were collected as part of the Marine Monitoring Program – Inshore Water Quality, which is a partnership between the Great Barrier Reef Marine Park Authority, the Australian Government, AIMS, JCU, and the Cape York Water Monitoring Partnership",,,,,,,,,,,,,,,,,,,,,,,,,,,,,,,,,,,,,,,,,,,,,,,,,,,,,,
distribution_statement,"Any users of IMOS data are required to clearly acknowledge the source of the material. Data, products and services from IMOS are provided ""as is"" without any warranty as to fitness for a particular purpose.",,,,,,,,,,,,,,,,,,,,,,,,,,,,,,,,,,,,,,,,,,,,,,,,,,,,,,
,,,,,,,,,,,,,,,,,,,,,,,,,,,,,,,,,,,,,,,,,,,,,,,,,,,,,,,
,,,,,,,,,,,,,,,,,,,,,,,,,,,,,,,,,,,,,,,,,,,,,,,,,,,,,,,
TABLE COLUMNS,,,,,,,,,,,,,,,,,,,,,,,,,,,,,,,,,,,,,,,,,,,,,,,,,,,,,,,
Column name,CF standard_name,IMOS long_name,Units,Fill value,Comments,,,,,,,,,,,,,,,,,,,,,,,,,,,,,,,,,,,,,,,,,,,,,,,,,,
Time,time,analysis_time,YYYY-MM-DDThh:mm:ssZ,,UTC date and time,,,,,,,,,,,,,,,,,,,,,,,,,,,,,,,,,,,,,,,,,,,,,,,,,,
Station_Code,,,,,National Reference Station code (6 letters),,,,,,,,,,,,,,,,,,,,,,,,,,,,,,,,,,,,,,,,,,,,,,,,,,
Latitude,latitude,latitude,degrees_north,,North positive,,,,,,,,,,,,,,,,,,,,,,,,,,,,,,,,,,,,,,,,,,,,,,,,,,
Longitude,longitude,longitude,degrees_east,,East positive,,,,,,,,,,,,,,,,,,,,,,,,,,,,,,,,,,,,,,,,,,,,,,,,,,
Depth,depth,depth,m ,,positive down,,,,,,,,,,,,,,,,,,,,,,,,,,,,,,,,,,,,,,,,,,,,,,,,,,
CPHL_c3,,mass_concentration_of_HPLC_chlorophyll_c3_in_sea_water,mg m-3,-999,,,,,,,,,,,,,,,,,,,,,,,,,,,,,,,,,,,,,,,,,,,,,,,,,,,
Mg_DVP,,mass_concentration_of_HPLC_Mg_2_4_divinyl_pheoporphyrin_a5_monomethyl_ester_in_sea_water,mg m-3,-999,,,,,,,,,,,,,,,,,,,,,,,,,,,,,,,,,,,,,,,,,,,,,,,,,,,
CPHL_c2,,mass_concentration_of_HPLC_chlorophyll_c2_in_sea_water,mg m-3,-999,,,,,,,,,,,,,,,,,,,,,,,,,,,,,,,,,,,,,,,,,,,,,,,,,,,
CPHL_c1,,mass_concentration_of_HPLC_chlorophyll_c1_in_sea_water,mg m-3,-999,,,,,,,,,,,,,,,,,,,,,,,,,,,,,,,,,,,,,,,,,,,,,,,,,,,
CPHL_c1c2,,mass_concentration_of_HPLC_chlorophyll_c1_c2_in_sea_water,mg m-3,-999,"Samples analysed prior to August 2004, Wright et al (1991) method used -chlorophyll_c1_plus_chlorophyll_c2_coelute",,,,,,,,,,,,,,,,,,,,,,,,,,,,,,,,,,,,,,,,,,,,,,,,,,
CPHLIDE_a,,mass_concentration_of_HPLC_chlorophyllide_a_in_sea_water,mg m-3,-999,,,,,,,,,,,,,,,,,,,,,,,,,,,,,,,,,,,,,,,,,,,,,,,,,,,
Phide_a,,mass_concentration_of_HPLC_Pheophorbide_a_in_sea_water,mg m-3,-999,,,,,,,,,,,,,,,,,,,,,,,,,,,,,,,,,,,,,,,,,,,,,,,,,,,
Perid,,mass_concentration_of_HPLC_Peridinin_in_sea_water,mg m-3,-999,,,,,,,,,,,,,,,,,,,,,,,,,,,,,,,,,,,,,,,,,,,,,,,,,,,
Pyrophide_a,,mass_concentration_of_HPLC_Pyropheophorbide_a_in_sea_water,mg m-3,-999,,,,,,,,,,,,,,,,,,,,,,,,,,,,,,,,,,,,,,,,,,,,,,,,,,,
But_fuco,,mass_concentration_of_HPLC_19-Butanoyloxyfucoxanthin_in_sea_water,mg m-3,-999,,,,,,,,,,,,,,,,,,,,,,,,,,,,,,,,,,,,,,,,,,,,,,,,,,,
Fuco,,mass_concentration_of_HPLC_Fucoxanthin_in_sea_water,mg m-3,-999,,,,,,,,,,,,,,,,,,,,,,,,,,,,,,,,,,,,,,,,,,,,,,,,,,,
Neo,,mass_concentration_of_HPLC_Neoxanthin_in_sea_water,mg m-3,-999,,,,,,,,,,,,,,,,,,,,,,,,,,,,,,,,,,,,,,,,,,,,,,,,,,,
Keto_Hex_fuco,,mass_concentration_of_HPLC_4- keto-19'-Hexanoyloxyfucoxanthin_in_sea_water,mg m-3,-999,,,,,,,,,,,,,,,,,,,,,,,,,,,,,,,,,,,,,,,,,,,,,,,,,,,
Pras,,mass_concentration_of_HPLC_Prasinoxanthin_in_sea_water,mg m-3,-999,,,,,,,,,,,,,,,,,,,,,,,,,,,,,,,,,,,,,,,,,,,,,,,,,,,
Viola,,mass_concentration_of_HPLC_Violaxanthin_in_sea_water,mg m-3,-999,,,,,,,,,,,,,,,,,,,,,,,,,,,,,,,,,,,,,,,,,,,,,,,,,,,
Hex_fuco,,mass_concentration_of_HPLC_19-Hexanoyloxyfucoxanthin_in_sea_water,mg m-3,-999,,,,,,,,,,,,,,,,,,,,,,,,,,,,,,,,,,,,,,,,,,,,,,,,,,,
Asta,,mass_concentration_of_HPLC_Astaxanthin_in_sea_water,mg m-3,-999,,,,,,,,,,,,,,,,,,,,,,,,,,,,,,,,,,,,,,,,,,,,,,,,,,,
Diadchr,,mass_concentration_of_HPLC_Diadinochrome_in_sea_water,mg m-3,-999,,,,,,,,,,,,,,,,,,,,,,,,,,,,,,,,,,,,,,,,,,,,,,,,,,,
Diadino,,mass_concentration_of_HPLC_Diadinoxanthin_in_sea_water,mg m-3,-999,,,,,,,,,,,,,,,,,,,,,,,,,,,,,,,,,,,,,,,,,,,,,,,,,,,
Dino,,mass_concentration_of_HPLC_Dinoxanthin_in_sea_water,mg m-3,-999,,,,,,,,,,,,,,,,,,,,,,,,,,,,,,,,,,,,,,,,,,,,,,,,,,,
Anth,,mass_concentration_of_HPLC_Antheraxanthin_in_sea_water,mg m-3,-999,,,,,,,,,,,,,,,,,,,,,,,,,,,,,,,,,,,,,,,,,,,,,,,,,,,
Allo,,mass_concentration_of_HPLC_Alloxanthin_in_sea_water,mg m-3,-999,,,,,,,,,,,,,,,,,,,,,,,,,,,,,,,,,,,,,,,,,,,,,,,,,,,
Diato,,mass_concentration_of_HPLC_Diatoxanthin_in_sea_water,mg m-3,-999,,,,,,,,,,,,,,,,,,,,,,,,,,,,,,,,,,,,,,,,,,,,,,,,,,,
Zea,,mass_concentration_of_HPLC_Zeaxanthin_in_sea_water,mg m-3,-999,,,,,,,,,,,,,,,,,,,,,,,,,,,,,,,,,,,,,,,,,,,,,,,,,,,
Lut,,mass_concentration_of_HPLC_Lutein_in_sea_water,mg m-3,-999,,,,,,,,,,,,,,,,,,,,,,,,,,,,,,,,,,,,,,,,,,,,,,,,,,,
Cantha,,mass_concentration_of_HPLC_canthaxanthin_in_sea_water,mg m-3,-999,,,,,,,,,,,,,,,,,,,,,,,,,,,,,,,,,,,,,,,,,,,,,,,,,,,
Gyro,,mass_concentration_of_HPLC_Gyroxanthin-Diester_in_sea_water,mg m-3,-999,,,,,,,,,,,,,,,,,,,,,,,,,,,,,,,,,,,,,,,,,,,,,,,,,,,
DV_CPHL_b,,mass_concentration_of_HPLC_Divinyl_Chorophyll_b_in_sea_water,mg m-3,-999,,,,,,,,,,,,,,,,,,,,,,,,,,,,,,,,,,,,,,,,,,,,,,,,,,,
CPHL_b,,mass_concentration_of_HPLC_chlorophyll_b_in_sea_water,mg m-3,-999,,,,,,,,,,,,,,,,,,,,,,,,,,,,,,,,,,,,,,,,,,,,,,,,,,,
DV_CPHL_b_plus_CPHL_b,,mass_concentration_of_HPLC_Divinyl_Chorophyll_b_+_chlorophyll_b_in_sea_water,mg m-3,-999,"Samples analysed prior to August 2004, Wright et al (1991) method used -Divinyl_Chlorophyll_b_plus_chlorophyll_b_coelute ",,,,,,,,,,,,,,,,,,,,,,,,,,,,,,,,,,,,,,,,,,,,,,,,,,
DV_CPHL_a,,mass_concentration_of_HPLC_Divinyl_Chorophyll_a_in_sea_water,mg m-3,-999,,,,,,,,,,,,,,,,,,,,,,,,,,,,,,,,,,,,,,,,,,,,,,,,,,,
CPHL_a,mass_concentration_of_chlorophyll_a_in_sea_water,mass_concentration_of_chlorophyll_a_in_sea_water,mg m-3,-999,,,,,,,,,,,,,,,,,,,,,,,,,,,,,,,,,,,,,,,,,,,,,,,,,,,
DV_CPHL_a_plus_CPHL_a,,mass_concentration_of_HPLC_Divinyl_Chorophyll_a_+_chlorophyll_a_in_sea_water,mg m-3,-999,"Samples analysed prior to August 2004, Wright et al (1991) method used -Divinyl_Chlorophyll_a_plus_HPLC_chlorophyll_a_coelute ",,,,,,,,,,,,,,,,,,,,,,,,,,,,,,,,,,,,,,,,,,,,,,,,,,
Echin,,mass_concentration_of_HPLC_Echinenone_in_sea_water,mg m-3,-999,,,,,,,,,,,,,,,,,,,,,,,,,,,,,,,,,,,,,,,,,,,,,,,,,,,
Phytin_b,,mass_concentration_of_HPLC_Pheophytin_b_in_sea_water,mg m-3,-999,,,,,,,,,,,,,,,,,,,,,,,,,,,,,,,,,,,,,,,,,,,,,,,,,,,
Phytin_a,,mass_concentration_of_HPLC_Pheophytin_a_in_sea_water,mg m-3,-999,,,,,,,,,,,,,,,,,,,,,,,,,,,,,,,,,,,,,,,,,,,,,,,,,,,
Lyco,,mass_concentration_of_HPLC_Lycopene_in_sea_water,mg m-3,-999,,,,,,,,,,,,,,,,,,,,,,,,,,,,,,,,,,,,,,,,,,,,,,,,,,,
beta_epi_Car,,mass_concentration_of_HPLC_Alpha-Carotene_(Beta_epsilon-Carotene)_in_sea_water,mg m-3,-999,,,,,,,,,,,,,,,,,,,,,,,,,,,,,,,,,,,,,,,,,,,,,,,,,,,
beta_beta_Car,,mass_concentration_of_HPLC_Beta-Carotene_(Beta_beta-Carotene)_in_sea_water,mg m-3,-999,,,,,,,,,,,,,,,,,,,,,,,,,,,,,,,,,,,,,,,,,,,,,,,,,,,
alpha_beta_Car,,mass_concentration_of_HPLC_Alpha_(Beta_epsilon)_+_Beta_(Beta_beta)_Carotenes_in_sea_water,mg m-3,-999,"Samples analysed after August 2004, Heukelem and Thomas (2001) method used - Aalpha-Carotene_plus_Beta-Carotene_coelute  ",,,,,,,,,,,,,,,,,,,,,,,,,,,,,,,,,,,,,,,,,,,,,,,,,,
Pyrophytin_a,,mass_concentration_of_HPLC_Pyropheophytin_a_in_sea_water,mg m-3,-999,,,,,,,,,,,,,,,,,,,,,,,,,,,,,,,,,,,,,,,,,,,,,,,,,,,
Tot_CPHL_a,,mass_concentration_of_HPLC_DV_CPHL_a_+_MV_CPHL_a_+_Chlide_a_+_CPHL_a_allom_+_CPHL_a_prime_in_sea_water,mg m-3,-999,Data products computed from pigment concentration data,,,,,,,,,,,,,,,,,,,,,,,,,,,,,,,,,,,,,,,,,,,,,,,,,,
Tot_CPHL_b,,mass_concentration_of_HPLC_DV_CPHL_b_+_MV_CPHL_b_in_sea_water,mg m-3,-999,Data products computed from pigment concentration data,,,,,,,,,,,,,,,,,,,,,,,,,,,,,,,,,,,,,,,,,,,,,,,,,,
Tot_CPHL_c,,mass_concentration_of_HPLC_CPHL_c1_+_CPHL_c2_(CPHL_c1c2)_+_CPHL_c3_in_sea_water,mg m-3,-999,Data products computed from pigment concentration data,,,,,,,,,,,,,,,,,,,,,,,,,,,,,,,,,,,,,,,,,,,,,,,,,,
Tot_CPHL,,mass_concentration_of_Tot_CPHL_a_+_Tot_CPHL_b_+_Tot_CPHL_c_in_sea_water,mg m-3,-999,Data products computed from pigment concentration data,,,,,,,,,,,,,,,,,,,,,,,,,,,,,,,,,,,,,,,,,,,,,,,,,,
PPC,,mass_concentration_of_Photoprotective_carotenoids_(Allo_+_Diadino_+_Diato_+_Zeo_+_alpha-beta-Car)_in_sea_water,mg m-3,-999,Data products computed from pigment concentration data,,,,,,,,,,,,,,,,,,,,,,,,,,,,,,,,,,,,,,,,,,,,,,,,,,
PSC,,mass_concentration_of_Photosynthetic_carotenoids_(But-fuco_+_Fuco_+_Hex-fuco_+_Perid)_in_sea_water,mg m-3,-999,Data products computed from pigment concentration data,,,,,,,,,,,,,,,,,,,,,,,,,,,,,,,,,,,,,,,,,,,,,,,,,,
PSP,,mass_concentration_of_Photosynthetic_pigments_(PSC_+_Tchl)_in_sea_water,mg m-3,-999,Data products computed from pigment concentration data,,,,,,,,,,,,,,,,,,,,,,,,,,,,,,,,,,,,,,,,,,,,,,,,,,
Tacc,,mass_concentration_of_Total_accessory_pigments_(PPC_+_PSC_+_Tot_CPHL_b_+_Tot_CPHL_c)_in_sea_water,mg m-3,-999,Data products computed from pigment concentration data,,,,,,,,,,,,,,,,,,,,,,,,,,,,,,,,,,,,,,,,,,,,,,,,,,
Tpg,,mass_concentration_of_total_pigment_in_sea_water,mg m-3,-999,Data products computed from pigment concentration data,,,,,,,,,,,,,,,,,,,,,,,,,,,,,,,,,,,,,,,,,,,,,,,,,,
DP,,mass_concentration_of_Total_diagnostic_pigments_(PSC_+_Allo_+_Zea_+_Tot_CPHL_b)_in_sea_water,mg m-3,-999,Data products computed from pigment concentration data,,,,,,,,,,,,,,,,,,,,,,,,,,,,,,,,,,,,,,,,,,,,,,,,,,
,,,,,,,,,,,,,,,,,,,,,,,,,,,,,,,,,,,,,,,,,,,,,,,,,,,,,,,
,,,,,,,,,,,,,,,,,,,,,,,,,,,,,,,,,,,,,,,,,,,,,,,,,,,,,,,
DATA,,,,,,,,,,,,,,,,,,,,,,,,,,,,,,,,,,,,,,,,,,,,,,,,,,,,,,,
Time,Station_Code,Latitude,Longitude,Depth,CPHL_a, ,,,,,,,,,,,,,,,,,,,,,,,,,,,,,,,,,,,,,,,,,,,,,,,,,
2018-07-20T01:11:00Z,WQP738,-19.3151167,147.6179333,0,0.06006,,,,,,,,,,,,,,,,,,,,,,,,,,,,,,,,,,,,,,,,,,,,,,,,,,
2018-07-20T01:11:00Z,WQP738,-19.3151167,147.6179333,26,0.09152,,,,,,,,,,,,,,,,,,,,,,,,,,,,,,,,,,,,,,,,,,,,,,,,,,
2018-08-17T00:37:00Z,WQP739,-19.305,147.622,0,0.10439,,,,,,,,,,,,,,,,,,,,,,,,,,,,,,,,,,,,,,,,,,,,,,,,,,
2018-08-17T00:37:00Z,WQP739,-19.305,147.622,26,0.11583,,,,,,,,,,,,,,,,,,,,,,,,,,,,,,,,,,,,,,,,,,,,,,,,,,
2018-09-04T21:50:00Z,WQP741,-19.1571833,146.8691167,0,0.32461,,,,,,,,,,,,,,,,,,,,,,,,,,,,,,,,,,,,,,,,,,,,,,,,,,
2018-09-04T21:50:00Z,WQP741,-19.1571833,146.8691167,9,0.36608,,,,,,,,,,,,,,,,,,,,,,,,,,,,,,,,,,,,,,,,,,,,,,,,,,
2018-09-04T23:40:00Z,WQP746,-19.15495,146.8684833,5.2,0.19162,,,,,,,,,,,,,,,,,,,,,,,,,,,,,,,,,,,,,,,,,,,,,,,,,,
2018-09-05T01:16:00Z,WQP742,-18.8007333,146.4375,0,0.19019,,,,,,,,,,,,,,,,,,,,,,,,,,,,,,,,,,,,,,,,,,,,,,,,,,
2018-09-05T01:16:00Z,WQP742,-18.8007333,146.4375,11,0.24882,,,,,,,,,,,,,,,,,,,,,,,,,,,,,,,,,,,,,,,,,,,,,,,,,,
2018-09-05T02:00:00Z,WQP747,-18.8168,146.4345667,6.4,0.20163,,,,,,,,,,,,,,,,,,,,,,,,,,,,,,,,,,,,,,,,,,,,,,,,,,
2018-09-05T03:03:00Z,WQP743,-18.5435167,146.4873667,0,0.1573,,,,,,,,,,,,,,,,,,,,,,,,,,,,,,,,,,,,,,,,,,,,,,,,,,
2018-09-05T03:03:00Z,WQP743,-18.5435167,146.4873667,22,0.25025,,,,,,,,,,,,,,,,,,,,,,,,,,,,,,,,,,,,,,,,,,,,,,,,,,
2018-09-05T03:55:00Z,WQP748,-18.5405833,146.48855,4.9,0.19448,,,,,,,,,,,,,,,,,,,,,,,,,,,,,,,,,,,,,,,,,,,,,,,,,,
2018-09-07T01:36:00Z,WQP751,-20.10625,148.7221,0,0.14872,,,,,,,,,,,,,,,,,,,,,,,,,,,,,,,,,,,,,,,,,,,,,,,,,,
2018-09-07T01:36:00Z,WQP751,-20.10625,148.7221,18,0.23023,,,,,,,,,,,,,,,,,,,,,,,,,,,,,,,,,,,,,,,,,,,,,,,,,,
2018-09-07T02:30:00Z,WQP756,-20.1049167,148.72175,4.8,0.13871,,,,,,,,,,,,,,,,,,,,,,,,,,,,,,,,,,,,,,,,,,,,,,,,,,
2018-09-07T03:50:00Z,WQP757,-20.3779833,148.8883667,4.5,0.29458,,,,,,,,,,,,,,,,,,,,,,,,,,,,,,,,,,,,,,,,,,,,,,,,,,
2018-09-07T04:13:00Z,WQP752,-20.38005,148.8876167,0,0.21021,,,,,,,,,,,,,,,,,,,,,,,,,,,,,,,,,,,,,,,,,,,,,,,,,,
2018-09-07T04:13:00Z,WQP752,-20.38005,148.8876167,18,0.28743,,,,,,,,,,,,,,,,,,,,,,,,,,,,,,,,,,,,,,,,,,,,,,,,,,
2018-09-07T23:28:00Z,WQP754,-20.5767833,148.8628333,0,0.3861,,,,,,,,,,,,,,,,,,,,,,,,,,,,,,,,,,,,,,,,,,,,,,,,,,
2018-09-07T23:28:00Z,WQP754,-20.5767833,148.8628333,16,0.43472,,,,,,,,,,,,,,,,,,,,,,,,,,,,,,,,,,,,,,,,,,,,,,,,,,
2018-09-08T00:20:00Z,WQP759,-20.57784,148.86125,7.1,0.35464,,,,,,,,,,,,,,,,,,,,,,,,,,,,,,,,,,,,,,,,,,,,,,,,,,
2018-09-08T00:55:00Z,WQP755,-20.57795,148.7097,0,0.39039,,,,,,,,,,,,,,,,,,,,,,,,,,,,,,,,,,,,,,,,,,,,,,,,,,
2018-09-08T00:55:00Z,WQP755,-20.57795,148.7097,7,0.71786,,,,,,,,,,,,,,,,,,,,,,,,,,,,,,,,,,,,,,,,,,,,,,,,,,
2018-09-08T02:26:00Z,WQP753,-20.4678,149.03935,0,0.26169,,,,,,,,,,,,,,,,,,,,,,,,,,,,,,,,,,,,,,,,,,,,,,,,,,
2018-09-08T02:26:00Z,WQP753,-20.4678,149.03935,14,0.31174,,,,,,,,,,,,,,,,,,,,,,,,,,,,,,,,,,,,,,,,,,,,,,,,,,
2018-09-08T03:10:00Z,WQP758,-20.46845,149.03895,6.9,0.28743,,,,,,,,,,,,,,,,,,,,,,,,,,,,,,,,,,,,,,,,,,,,,,,,,,
2018-09-19T21:52:00Z,WQP744,-19.5875,147.5829833,0,1.24982,,,,,,,,,,,,,,,,,,,,,,,,,,,,,,,,,,,,,,,,,,,,,,,,,,
2018-09-19T21:52:00Z,WQP744,-19.5875,147.5829833,6,0.84656,,,,,,,,,,,,,,,,,,,,,,,,,,,,,,,,,,,,,,,,,,,,,,,,,,
2018-09-27T01:07:00Z,WQP740,-19.3018333,147.62,0,0.139565,,,,,,,,,,,,,,,,,,,,,,,,,,,,,,,,,,,,,,,,,,,,,,,,,,
2018-09-27T01:07:00Z,WQP740,-19.3018333,147.62,26,0.19591,,,,,,,,,,,,,,,,,,,,,,,,,,,,,,,,,,,,,,,,,,,,,,,,,,
2018-09-27T04:43:00Z,WQP745,-19.2827,147.1739667,0,0.19019,,,,,,,,,,,,,,,,,,,,,,,,,,,,,,,,,,,,,,,,,,,,,,,,,,
2018-09-27T04:43:00Z,WQP745,-19.2827,147.1739667,12,0.53339,,,,,,,,,,,,,,,,,,,,,,,,,,,,,,,,,,,,,,,,,,,,,,,,,,
2018-10-08T23:27:00Z,WQP768,-17.16215,146.0069867,5.8,0.22594,,,,,,,,,,,,,,,,,,,,,,,,,,,,,,,,,,,,,,,,,,,,,,,,,,
2018-10-09T00:21:00Z,WQP763,-17.1629167,146.0047333,0,0.15158,,,,,,,,,,,,,,,,,,,,,,,,,,,,,,,,,,,,,,,,,,,,,,,,,,
2018-10-09T00:21:00Z,WQP763,-17.1629167,146.0047333,22,0.21593,,,,,,,,,,,,,,,,,,,,,,,,,,,,,,,,,,,,,,,,,,,,,,,,,,
2018-10-09T01:28:00Z,WQP764,-17.0702,145.9939167,0,0.26026,,,,,,,,,,,,,,,,,,,,,,,,,,,,,,,,,,,,,,,,,,,,,,,,,,
2018-10-09T01:28:00Z,WQP764,-17.0702,145.9939167,18,0.37895,,,,,,,,,,,,,,,,,,,,,,,,,,,,,,,,,,,,,,,,,,,,,,,,,,
2018-10-09T02:51:00Z,WQP765,-16.9202167,145.9968833,0,0.10725,,,,,,,,,,,,,,,,,,,,,,,,,,,,,,,,,,,,,,,,,,,,,,,,,,
2018-10-09T02:51:00Z,WQP765,-16.9202167,145.9968833,13,0.26884,,,,,,,,,,,,,,,,,,,,,,,,,,,,,,,,,,,,,,,,,,,,,,,,,,
2018-10-09T05:29:00Z,WQP769,-16.92315,145.99625,5.3,0.17732,,,,,,,,,,,,,,,,,,,,,,,,,,,,,,,,,,,,,,,,,,,,,,,,,,
2018-10-09T22:44:00Z,WQP761,-17.2033333,145.97835,0,0.23309,,,,,,,,,,,,,,,,,,,,,,,,,,,,,,,,,,,,,,,,,,,,,,,,,,
2018-10-09T22:44:00Z,WQP761,-17.2033333,145.97835,6,0.65208,,,,,,,,,,,,,,,,,,,,,,,,,,,,,,,,,,,,,,,,,,,,,,,,,,
2018-10-09T23:48:00Z,WQP762,-17.22675,146.0877,0,0.22022,,,,,,,,,,,,,,,,,,,,,,,,,,,,,,,,,,,,,,,,,,,,,,,,,,
2018-10-09T23:48:00Z,WQP762,-17.22675,146.0877,22,0.2288,,,,,,,,,,,,,,,,,,,,,,,,,,,,,,,,,,,,,,,,,,,,,,,,,,
2018-10-10T01:38:00Z,WQP767,-17.2269667,146.0903667,7,0.25168,,,,,,,,,,,,,,,,,,,,,,,,,,,,,,,,,,,,,,,,,,,,,,,,,,
2018-10-10T22:16:00Z,WQP772,-17.8905,145.2607,0,0.15873,,,,,,,,,,,,,,,,,,,,,,,,,,,,,,,,,,,,,,,,,,,,,,,,,,
2018-10-10T22:16:00Z,WQP772,-17.8905,145.2607,23,0.2002,,,,,,,,,,,,,,,,,,,,,,,,,,,,,,,,,,,,,,,,,,,,,,,,,,
2018-10-10T22:46:00Z,WQP773,-17.9604833,148.1905833,0,0.28028,,,,,,,,,,,,,,,,,,,,,,,,,,,,,,,,,,,,,,,,,,,,,,,,,,
2018-10-10T22:46:00Z,WQP773,-17.9604833,148.1905833,23,0.35464,,,,,,,,,,,,,,,,,,,,,,,,,,,,,,,,,,,,,,,,,,,,,,,,,,
2018-10-10T23:38:00Z,WQP774,-18.01445,146.1341667,0,0.27885,,,,,,,,,,,,,,,,,,,,,,,,,,,,,,,,,,,,,,,,,,,,,,,,,,
2018-10-10T23:38:00Z,WQP774,-18.01445,146.1341667,9,0.40755,,,,,,,,,,,,,,,,,,,,,,,,,,,,,,,,,,,,,,,,,,,,,,,,,,
2018-10-11T00:54:00Z,WQP786,-19.3046833,147.6268,0,0.11726,,,,,,,,,,,,,,,,,,,,,,,,,,,,,,,,,,,,,,,,,,,,,,,,,,
2018-10-11T00:54:00Z,WQP786,-19.3046833,147.6268,26,0.13299,,,,,,,,,,,,,,,,,,,,,,,,,,,,,,,,,,,,,,,,,,,,,,,,,,
2018-10-11T01:08:00Z,WQP771,-18.02265,146.0746667,0,0.26455,,,,,,,,,,,,,,,,,,,,,,,,,,,,,,,,,,,,,,,,,,,,,,,,,,
2018-10-11T01:08:00Z,WQP771,-18.02265,146.0746667,6,0.54197,,,,,,,,,,,,,,,,,,,,,,,,,,,,,,,,,,,,,,,,,,,,,,,,,,
2018-10-11T02:05:00Z,WQP775,-17.9753,146.11665,0,0.24596,,,,,,,,,,,,,,,,,,,,,,,,,,,,,,,,,,,,,,,,,,,,,,,,,,
2018-10-11T02:05:00Z,WQP775,-17.9753,146.11665,7,0.37466,,,,,,,,,,,,,,,,,,,,,,,,,,,,,,,,,,,,,,,,,,,,,,,,,,
2018-10-11T03:35:00Z,WQP778,-17.9262833,146.1461333,5.3,0.21879,,,,,,,,,,,,,,,,,,,,,,,,,,,,,,,,,,,,,,,,,,,,,,,,,,
2018-10-11T04:26:00Z,WQP776,-17.9248333,146.14305,0,0.38324,,,,,,,,,,,,,,,,,,,,,,,,,,,,,,,,,,,,,,,,,,,,,,,,,,
2018-10-11T04:26:00Z,WQP776,-17.9248333,146.14305,7,0.33033,,,,,,,,,,,,,,,,,,,,,,,,,,,,,,,,,,,,,,,,,,,,,,,,,,
2018-10-14T03:08:00Z,WQP749,,,0,0.29601,,,,,,,,,,,,,,,,,,,,,,,,,,,,,,,,,,,,,,,,,,,,,,,,,,
2018-10-14T03:08:00Z,WQP749,,,2.5,,,,,,,,,,,,,,,,,,,,,,,,,,,,,,,,,,,,,,,,,,,,,,,,,,,
2018-10-30T06:33:00Z,WQP777,-18.0233333,146.075,2,0.20592,,,,,,,,,,,,,,,,,,,,,,,,,,,,,,,,,,,,,,,,,,,,,,,,,,
2018-10-30T23:12:00Z,UWF407,-17.7116,146.18616,2,0.23166,,,,,,,,,,,,,,,,,,,,,,,,,,,,,,,,,,,,,,,,,,,,,,,,,,
2018-10-31T00:02:00Z,UWF408,-17.57344,146.17728,2,0.18876,,,,,,,,,,,,,,,,,,,,,,,,,,,,,,,,,,,,,,,,,,,,,,,,,,
2018-10-31T02:56:00Z,WQP766,-17.2033333,145.9795,2,0.15015,,,,,,,,,,,,,,,,,,,,,,,,,,,,,,,,,,,,,,,,,,,,,,,,,,
2018-10-31T05:42:00Z,UWF409,-16.94874,145.9781,2,0.1144,,,,,,,,,,,,,,,,,,,,,,,,,,,,,,,,,,,,,,,,,,,,,,,,,,
2018-10-31T22:10:00Z,WQP780,-16.7733333,145.9566667,0,0.07722,,,,,,,,,,,,,,,,,,,,,,,,,,,,,,,,,,,,,,,,,,,,,,,,,,
2018-10-31T22:10:00Z,WQP780,-16.7733333,145.9566667,36,0.15158,,,,,,,,,,,,,,,,,,,,,,,,,,,,,,,,,,,,,,,,,,,,,,,,,,
2018-10-31T23:15:00Z,WQP781,-16.8493333,145.8383333,0,0.2288,,,,,,,,,,,,,,,,,,,,,,,,,,,,,,,,,,,,,,,,,,,,,,,,,,
2018-10-31T23:15:00Z,WQP781,-16.8493333,145.8383333,5,0.25168,,,,,,,,,,,,,,,,,,,,,,,,,,,,,,,,,,,,,,,,,,,,,,,,,,
2018-11-01T00:09:00Z,WQP782,-16.7878333,145.7466667,0,0.29887,,,,,,,,,,,,,,,,,,,,,,,,,,,,,,,,,,,,,,,,,,,,,,,,,,
2018-11-01T00:09:00Z,WQP782,-16.7878333,145.7466667,7,0.37037,,,,,,,,,,,,,,,,,,,,,,,,,,,,,,,,,,,,,,,,,,,,,,,,,,
2018-11-01T01:05:00Z,WQP783,-16.6633333,145.705,0,0.09009,,,,,,,,,,,,,,,,,,,,,,,,,,,,,,,,,,,,,,,,,,,,,,,,,,
2018-11-01T01:05:00Z,WQP783,-16.6633333,145.705,17,0.29458,,,,,,,,,,,,,,,,,,,,,,,,,,,,,,,,,,,,,,,,,,,,,,,,,,
2018-11-01T03:17:00Z,WQP784,-16.41,145.5083333,0,0.13013,,,,,,,,,,,,,,,,,,,,,,,,,,,,,,,,,,,,,,,,,,,,,,,,,,
2018-11-01T03:17:00Z,WQP784,-16.41,145.5083333,14,0.28743,,,,,,,,,,,,,,,,,,,,,,,,,,,,,,,,,,,,,,,,,,,,,,,,,,
2018-11-01T05:44:00Z,WQP785,-16.1145,145.4833333,0,0.07865,,,,,,,,,,,,,,,,,,,,,,,,,,,,,,,,,,,,,,,,,,,,,,,,,,
2018-11-01T05:44:00Z,WQP785,-16.1145,145.4833333,16,0.23881,,,,,,,,,,,,,,,,,,,,,,,,,,,,,,,,,,,,,,,,,,,,,,,,,,
2018-11-01T22:08:00Z,UWF410,-16.63232,145.7445,2,0.12012,,,,,,,,,,,,,,,,,,,,,,,,,,,,,,,,,,,,,,,,,,,,,,,,,,
2018-11-01T23:21:00Z,UWF411,-16.78364,145.87542,2,0.08294,,,,,,,,,,,,,,,,,,,,,,,,,,,,,,,,,,,,,,,,,,,,,,,,,,
2018-11-02T00:14:00Z,UWF412,-16.8927,145.96764,2,0.19448,,,,,,,,,,,,,,,,,,,,,,,,,,,,,,,,,,,,,,,,,,,,,,,,,,
2018-11-02T01:16:00Z,UWF413,-17.0516,146.01368,2,0.08151,,,,,,,,,,,,,,,,,,,,,,,,,,,,,,,,,,,,,,,,,,,,,,,,,,
2018-11-02T03:23:00Z,UWF414,-17.37202,146.11868,2,0.10296,,,,,,,,,,,,,,,,,,,,,,,,,,,,,,,,,,,,,,,,,,,,,,,,,,
2018-11-02T04:38:00Z,UWF415,-17.5602,146.18166,2,0.1144,,,,,,,,,,,,,,,,,,,,,,,,,,,,,,,,,,,,,,,,,,,,,,,,,,
2018-11-02T06:07:00Z,UWF416,-17.78822,146.25124,2,0.10868,,,,,,,,,,,,,,,,,,,,,,,,,,,,,,,,,,,,,,,,,,,,,,,,,,
2018-11-23T00:17:00Z,WQP788,-19.3021667,147.621,0,0.22022,,,,,,,,,,,,,,,,,,,,,,,,,,,,,,,,,,,,,,,,,,,,,,,,,,
2018-11-23T00:17:00Z,WQP788,-19.3021667,147.621,26,0.23595,,,,,,,,,,,,,,,,,,,,,,,,,,,,,,,,,,,,,,,,,,,,,,,,,,
2018-12-03T22:27:00Z,WQP791,-17.2035667,145.9783833,0,0.20735,,,,,,,,,,,,,,,,,,,,,,,,,,,,,,,,,,,,,,,,,,,,,,,,,,
2018-12-03T22:27:00Z,WQP791,-17.2035667,145.9783833,6,0.32747,,,,,,,,,,,,,,,,,,,,,,,,,,,,,,,,,,,,,,,,,,,,,,,,,,
2018-12-03T23:21:00Z,WQP794,-17.069,145.9941833,0,0.20306,,,,,,,,,,,,,,,,,,,,,,,,,,,,,,,,,,,,,,,,,,,,,,,,,,
2018-12-03T23:21:00Z,WQP794,-17.069,145.9941833,19,1.05105,,,,,,,,,,,,,,,,,,,,,,,,,,,,,,,,,,,,,,,,,,,,,,,,,,
2018-12-04T00:38:00Z,WQP795,-16.9207167,145.9968667,0,0.20306,,,,,,,,,,,,,,,,,,,,,,,,,,,,,,,,,,,,,,,,,,,,,,,,,,
2018-12-04T00:38:00Z,WQP795,-16.9207167,145.9968667,14,0.28171,,,,,,,,,,,,,,,,,,,,,,,,,,,,,,,,,,,,,,,,,,,,,,,,,,
2018-12-04T03:55:00Z,WQP793,-17.1640167,146.005,0,0.09724,,,,,,,,,,,,,,,,,,,,,,,,,,,,,,,,,,,,,,,,,,,,,,,,,,
2018-12-04T03:55:00Z,WQP793,-17.1640167,146.005,21,0.3289,,,,,,,,,,,,,,,,,,,,,,,,,,,,,,,,,,,,,,,,,,,,,,,,,,
2018-12-04T04:51:00Z,WQP792,-17.2270833,146.0874667,0,0.11583,,,,,,,,,,,,,,,,,,,,,,,,,,,,,,,,,,,,,,,,,,,,,,,,,,
2018-12-04T04:51:00Z,WQP792,-17.2270833,146.0874667,21,0.24596,,,,,,,,,,,,,,,,,,,,,,,,,,,,,,,,,,,,,,,,,,,,,,,,,,
2018-12-04T22:28:00Z,WQP798,-17.8897667,146.2608167,0,0.11583,,,,,,,,,,,,,,,,,,,,,,,,,,,,,,,,,,,,,,,,,,,,,,,,,,
2018-12-04T22:28:00Z,WQP798,-17.8897667,146.2608167,24,0.32461,,,,,,,,,,,,,,,,,,,,,,,,,,,,,,,,,,,,,,,,,,,,,,,,,,
2018-12-04T23:33:00Z,WQP799,-17.9601667,146.1902167,0,0.14872,,,,,,,,,,,,,,,,,,,,,,,,,,,,,,,,,,,,,,,,,,,,,,,,,,
2018-12-04T23:33:00Z,WQP799,-17.9601667,146.1902167,23,0.31031,,,,,,,,,,,,,,,,,,,,,,,,,,,,,,,,,,,,,,,,,,,,,,,,,,
2018-12-05T00:24:00Z,WQP800,-18.0142833,146.134,0,0.26455,,,,,,,,,,,,,,,,,,,,,,,,,,,,,,,,,,,,,,,,,,,,,,,,,,
2018-12-05T00:24:00Z,WQP800,-18.0142833,146.134,9,0.32747,,,,,,,,,,,,,,,,,,,,,,,,,,,,,,,,,,,,,,,,,,,,,,,,,,
2018-12-05T01:08:00Z,WQP797,-18.0221833,146.0746,0,0.21021,,,,,,,,,,,,,,,,,,,,,,,,,,,,,,,,,,,,,,,,,,,,,,,,,,
2018-12-05T01:08:00Z,WQP797,-18.0221833,146.0746,6,0.29601,,,,,,,,,,,,,,,,,,,,,,,,,,,,,,,,,,,,,,,,,,,,,,,,,,
2018-12-05T02:02:00Z,WQP801,-17.9750833,146.1163833,0,0.30459,,,,,,,,,,,,,,,,,,,,,,,,,,,,,,,,,,,,,,,,,,,,,,,,,,
2018-12-05T02:02:00Z,WQP801,-17.9750833,146.1163833,6,0.3718,,,,,,,,,,,,,,,,,,,,,,,,,,,,,,,,,,,,,,,,,,,,,,,,,,
2018-12-05T03:03:00Z,WQP802,-17.9248333,146.14305,0,0.26026,,,,,,,,,,,,,,,,,,,,,,,,,,,,,,,,,,,,,,,,,,,,,,,,,,
2018-12-05T03:03:00Z,WQP802,-17.9248333,146.14305,7,0.29887,,,,,,,,,,,,,,,,,,,,,,,,,,,,,,,,,,,,,,,,,,,,,,,,,,
2018-12-13T00:45:00Z,WQP789,-19.3004667,147.6216667,0,0.36179,,,,,,,,,,,,,,,,,,,,,,,,,,,,,,,,,,,,,,,,,,,,,,,,,,
2018-12-13T00:45:00Z,WQP789,-19.3004667,147.6216667,26,0.51337,,,,,,,,,,,,,,,,,,,,,,,,,,,,,,,,,,,,,,,,,,,,,,,,,,
2019-01-22T21:55:00Z,WQP805,-19.1581,146.8691833,0,0.81224,,,,,,,,,,,,,,,,,,,,,,,,,,,,,,,,,,,,,,,,,,,,,,,,,,
2019-01-22T21:55:00Z,WQP805,-19.1581,146.8691833,9,0.80223,,,,,,,,,,,,,,,,,,,,,,,,,,,,,,,,,,,,,,,,,,,,,,,,,,
2019-01-23T01:27:00Z,WQP806,-18.8173667,146.43735,0,0.63063,,,,,,,,,,,,,,,,,,,,,,,,,,,,,,,,,,,,,,,,,,,,,,,,,,
2019-01-23T01:27:00Z,WQP806,-18.8173667,146.43735,14,0.60775,,,,,,,,,,,,,,,,,,,,,,,,,,,,,,,,,,,,,,,,,,,,,,,,,,
2019-01-23T03:51:00Z,WQP807,-18.5401167,146.4880333,0,0.9152,,,,,,,,,,,,,,,,,,,,,,,,,,,,,,,,,,,,,,,,,,,,,,,,,,
2019-01-23T03:51:00Z,WQP807,-18.5401167,146.4880333,22,0.858,,,,,,,,,,,,,,,,,,,,,,,,,,,,,,,,,,,,,,,,,,,,,,,,,,
2019-01-24T00:18:00Z,WQP808,-19.58775,147.5828,0,2.5883,,,,,,,,,,,,,,,,,,,,,,,,,,,,,,,,,,,,,,,,,,,,,,,,,,
2019-01-24T00:18:00Z,WQP808,-19.58775,147.5828,7,1.6588,,,,,,,,,,,,,,,,,,,,,,,,,,,,,,,,,,,,,,,,,,,,,,,,,,
2019-01-24T01:12:00Z,WQP804,-19.2928833,147.66405,0,0.15587,,,,,,,,,,,,,,,,,,,,,,,,,,,,,,,,,,,,,,,,,,,,,,,,,,
2019-01-24T01:12:00Z,WQP804,-19.2928833,147.66405,26,0.15301,,,,,,,,,,,,,,,,,,,,,,,,,,,,,,,,,,,,,,,,,,,,,,,,,,
2019-01-24T04:33:00Z,WQP809,-19.2827167,147.1739333,0,0.98384,,,,,,,,,,,,,,,,,,,,,,,,,,,,,,,,,,,,,,,,,,,,,,,,,,
2019-01-24T04:33:00Z,WQP809,-19.2827167,147.1739333,10,0.89232,,,,,,,,,,,,,,,,,,,,,,,,,,,,,,,,,,,,,,,,,,,,,,,,,,
2019-01-31T22:53:00Z,WQP822,-20.57784,148.86125,7.6,0.74217,,,,,,,,,,,,,,,,,,,,,,,,,,,,,,,,,,,,,,,,,,,,,,,,,,
2019-01-31T23:45:00Z,WQP817,-20.57745,148.8613167,0,0.73216,,,,,,,,,,,,,,,,,,,,,,,,,,,,,,,,,,,,,,,,,,,,,,,,,,
2019-01-31T23:45:00Z,WQP817,-20.57745,148.8613167,14,0.73788,,,,,,,,,,,,,,,,,,,,,,,,,,,,,,,,,,,,,,,,,,,,,,,,,,
2019-02-01T01:00:00Z,WQP818,-20.5775,148.7104,0,0.54769,,,,,,,,,,,,,,,,,,,,,,,,,,,,,,,,,,,,,,,,,,,,,,,,,,
2019-02-01T01:00:00Z,WQP818,-20.5775,148.7104,6,0.31031,,,,,,,,,,,,,,,,,,,,,,,,,,,,,,,,,,,,,,,,,,,,,,,,,,
2019-02-01T03:22:00Z,WQP821,-20.46845,149.03895,7.2,0.59345,,,,,,,,,,,,,,,,,,,,,,,,,,,,,,,,,,,,,,,,,,,,,,,,,,
2019-02-01T03:56:00Z,WQP816,-20.47005,149.03975,0,1.0153,,,,,,,,,,,,,,,,,,,,,,,,,,,,,,,,,,,,,,,,,,,,,,,,,,
2019-02-01T03:56:00Z,WQP816,-20.47005,149.03975,14,1.00672,,,,,,,,,,,,,,,,,,,,,,,,,,,,,,,,,,,,,,,,,,,,,,,,,,
2019-02-01T05:43:00Z,WQP815,-20.3799667,148.8884,0,0.73073,,,,,,,,,,,,,,,,,,,,,,,,,,,,,,,,,,,,,,,,,,,,,,,,,,
2019-02-01T05:43:00Z,WQP815,-20.3799667,148.8884,15,0.67639,,,,,,,,,,,,,,,,,,,,,,,,,,,,,,,,,,,,,,,,,,,,,,,,,,
2019-02-01T06:42:00Z,WQP820,-20.3779833,148.8883667,5.7,0.48334,,,,,,,,,,,,,,,,,,,,,,,,,,,,,,,,,,,,,,,,,,,,,,,,,,
2019-02-02T01:17:00Z,WQP814,-20.1062667,148.7222833,0,0.73502,,,,,,,,,,,,,,,,,,,,,,,,,,,,,,,,,,,,,,,,,,,,,,,,,,
2019-02-02T01:17:00Z,WQP814,-20.1062667,148.7222833,20,0.64064,,,,,,,,,,,,,,,,,,,,,,,,,,,,,,,,,,,,,,,,,,,,,,,,,,
2019-02-02T02:35:00Z,WQP819,-20.1049167,148.72175,6.5,0.61204,,,,,,,,,,,,,,,,,,,,,,,,,,,,,,,,,,,,,,,,,,,,,,,,,,
2019-02-06T23:33:00Z,WQP835,-17.2268333,146.087,0,0.73359,,,,,,,,,,,,,,,,,,,,,,,,,,,,,,,,,,,,,,,,,,,,,,,,,,
2019-02-06T23:33:00Z,WQP835,-17.2268333,146.087,20,0.67639,,,,,,,,,,,,,,,,,,,,,,,,,,,,,,,,,,,,,,,,,,,,,,,,,,
2019-02-07T00:26:00Z,WQP834,-17.2028333,145.9865,0,0.55055,,,,,,,,,,,,,,,,,,,,,,,,,,,,,,,,,,,,,,,,,,,,,,,,,,
2019-02-07T00:26:00Z,WQP834,-17.2028333,145.9865,12,1.12541,,,,,,,,,,,,,,,,,,,,,,,,,,,,,,,,,,,,,,,,,,,,,,,,,,
2019-02-07T01:12:00Z,WQP836,-17.1633333,146.0033333,0,0.66495,,,,,,,,,,,,,,,,,,,,,,,,,,,,,,,,,,,,,,,,,,,,,,,,,,
2019-02-07T01:12:00Z,WQP836,-17.1633333,146.0033333,21,0.67067,,,,,,,,,,,,,,,,,,,,,,,,,,,,,,,,,,,,,,,,,,,,,,,,,,
2019-02-07T02:36:00Z,WQP837,-17.0698333,145.9933333,0,0.70642,,,,,,,,,,,,,,,,,,,,,,,,,,,,,,,,,,,,,,,,,,,,,,,,,,
2019-02-07T02:36:00Z,WQP837,-17.0698333,145.9933333,16,0.82797,,,,,,,,,,,,,,,,,,,,,,,,,,,,,,,,,,,,,,,,,,,,,,,,,,
2019-02-07T03:46:00Z,WQP838,-16.9193333,145.9966667,0,0.13213,,,,,,,,,,,,,,,,,,,,,,,,,,,,,,,,,,,,,,,,,,,,,,,,,,
2019-02-07T03:46:00Z,WQP838,-16.9193333,145.9966667,13,0.81081,,,,,,,,,,,,,,,,,,,,,,,,,,,,,,,,,,,,,,,,,,,,,,,,,,
2019-02-07T22:00:00Z,WQP824,-16.7716667,145.9533333,0,0.43615,,,,,,,,,,,,,,,,,,,,,,,,,,,,,,,,,,,,,,,,,,,,,,,,,,
2019-02-07T22:00:00Z,WQP824,-16.7716667,145.9533333,36,0.52767,,,,,,,,,,,,,,,,,,,,,,,,,,,,,,,,,,,,,,,,,,,,,,,,,,
2019-02-07T23:11:00Z,WQP825,-16.8481667,145.8366667,0,0.79365,,,,,,,,,,,,,,,,,,,,,,,,,,,,,,,,,,,,,,,,,,,,,,,,,,
2019-02-07T23:11:00Z,WQP825,-16.8481667,145.8366667,6.5,0.3003,,,,,,,,,,,,,,,,,,,,,,,,,,,,,,,,,,,,,,,,,,,,,,,,,,
2019-02-08T00:04:00Z,WQP826,-16.7866667,145.7463333,0,0.93951,,,,,,,,,,,,,,,,,,,,,,,,,,,,,,,,,,,,,,,,,,,,,,,,,,
2019-02-08T00:04:00Z,WQP826,-16.7866667,145.7463333,9,0.29029,,,,,,,,,,,,,,,,,,,,,,,,,,,,,,,,,,,,,,,,,,,,,,,,,,
2019-02-08T01:06:00Z,WQP827,-16.6616667,145.7033333,0,0.15444,,,,,,,,,,,,,,,,,,,,,,,,,,,,,,,,,,,,,,,,,,,,,,,,,,
2019-02-08T01:06:00Z,WQP827,-16.6616667,145.7033333,18,0.41613,,,,,,,,,,,,,,,,,,,,,,,,,,,,,,,,,,,,,,,,,,,,,,,,,,
2019-02-08T03:09:00Z,WQP828,-16.4083333,145.5066667,0,0.18361,,,,,,,,,,,,,,,,,,,,,,,,,,,,,,,,,,,,,,,,,,,,,,,,,,
2019-02-08T03:09:00Z,WQP828,-16.4083333,145.5066667,14,0.36036,,,,,,,,,,,,,,,,,,,,,,,,,,,,,,,,,,,,,,,,,,,,,,,,,,
2019-02-08T05:03:00Z,WQP829,-16.1116667,145.4816667,0,0.3718,,,,,,,,,,,,,,,,,,,,,,,,,,,,,,,,,,,,,,,,,,,,,,,,,,
2019-02-08T05:03:00Z,WQP829,-16.1116667,145.4816667,15,0.56199,,,,,,,,,,,,,,,,,,,,,,,,,,,,,,,,,,,,,,,,,,,,,,,,,,
2019-02-09T22:04:00Z,WQP844,-17.8883333,146.2596667,0,2.86,,,,,,,,,,,,,,,,,,,,,,,,,,,,,,,,,,,,,,,,,,,,,,,,,,
2019-02-09T22:04:00Z,WQP844,-17.8883333,146.2596667,22,0.68068,,,,,,,,,,,,,,,,,,,,,,,,,,,,,,,,,,,,,,,,,,,,,,,,,,
2019-02-09T23:06:00Z,WQP848,-17.9233333,146.1426667,0,0.77649,,,,,,,,,,,,,,,,,,,,,,,,,,,,,,,,,,,,,,,,,,,,,,,,,,
2019-02-09T23:06:00Z,WQP848,-17.9233333,146.1426667,7,0.78078,,,,,,,,,,,,,,,,,,,,,,,,,,,,,,,,,,,,,,,,,,,,,,,,,,
2019-02-09T23:57:00Z,WQP845,-17.96,146.19,0,2.2737,,,,,,,,,,,,,,,,,,,,,,,,,,,,,,,,,,,,,,,,,,,,,,,,,,
2019-02-09T23:57:00Z,WQP845,-17.96,146.19,22,0.85085,,,,,,,,,,,,,,,,,,,,,,,,,,,,,,,,,,,,,,,,,,,,,,,,,,
2019-02-10T00:47:00Z,WQP847,-17.975,146.115,0,2.5311,,,,,,,,,,,,,,,,,,,,,,,,,,,,,,,,,,,,,,,,,,,,,,,,,,
2019-02-10T00:47:00Z,WQP847,-17.975,146.115,7,0.83083,,,,,,,,,,,,,,,,,,,,,,,,,,,,,,,,,,,,,,,,,,,,,,,,,,
2019-02-10T01:19:00Z,WQP846,-18.0133333,146.1331667,0,2.8171,,,,,,,,,,,,,,,,,,,,,,,,,,,,,,,,,,,,,,,,,,,,,,,,,,
2019-02-10T01:19:00Z,WQP846,-18.0133333,146.1331667,8,1.50579,,,,,,,,,,,,,,,,,,,,,,,,,,,,,,,,,,,,,,,,,,,,,,,,,,
2019-02-10T01:53:00Z,WQP843,-18.0223333,146.0766667,0,2.8314,,,,,,,,,,,,,,,,,,,,,,,,,,,,,,,,,,,,,,,,,,,,,,,,,,
2019-02-10T01:53:00Z,WQP843,-18.0223333,146.0766667,6,3.27756,,,,,,,,,,,,,,,,,,,,,,,,,,,,,,,,,,,,,,,,,,,,,,,,,,
2019-02-10T06:00:00Z,UWF417,-18.56398,146.44092,2,2.6884,,,,,,,,,,,,,,,,,,,,,,,,,,,,,,,,,,,,,,,,,,,,,,,,,,
2019-02-10T06:28:00Z,UWF418,-18.63644,146.4684,2,2.7456,,,,,,,,,,,,,,,,,,,,,,,,,,,,,,,,,,,,,,,,,,,,,,,,,,
2019-02-10T06:48:00Z,UWF419,-18.69078,146.48736,2,1.50007,,,,,,,,,,,,,,,,,,,,,,,,,,,,,,,,,,,,,,,,,,,,,,,,,,
2019-02-10T07:55:00Z,UWF420,-18.77424,146.52894,2,1.61447,,,,,,,,,,,,,,,,,,,,,,,,,,,,,,,,,,,,,,,,,,,,,,,,,,
2019-02-10T22:22:00Z,UWF421,-18.8887,146.60146,2,1.45574,,,,,,,,,,,,,,,,,,,,,,,,,,,,,,,,,,,,,,,,,,,,,,,,,,
2019-02-10T22:46:00Z,UWF422,-18.94206,146.63834,2,0.99671,,,,,,,,,,,,,,,,,,,,,,,,,,,,,,,,,,,,,,,,,,,,,,,,,,
2019-02-10T23:12:00Z,UWF423,-19.00204,146.67408,2,1.14543,,,,,,,,,,,,,,,,,,,,,,,,,,,,,,,,,,,,,,,,,,,,,,,,,,
2019-02-10T23:40:00Z,UWF424,-19.06616,146.71492,2,1.18547,,,,,,,,,,,,,,,,,,,,,,,,,,,,,,,,,,,,,,,,,,,,,,,,,,
2019-02-11T00:05:00Z,UWF425,-19.12564,146.75092,2,1.69598,,,,,,,,,,,,,,,,,,,,,,,,,,,,,,,,,,,,,,,,,,,,,,,,,,
2019-02-13T00:28:00Z,WQP833,-19.305,147.622,0,0.76791,,,,,,,,,,,,,,,,,,,,,,,,,,,,,,,,,,,,,,,,,,,,,,,,,,
2019-02-13T00:28:00Z,WQP833,-19.305,147.622,26,0.73073,,,,,,,,,,,,,,,,,,,,,,,,,,,,,,,,,,,,,,,,,,,,,,,,,,
2019-02-19T04:12:00Z,WQP851,-20.1068833,148.7222667,0,0.74646,,,,,,,,,,,,,,,,,,,,,,,,,,,,,,,,,,,,,,,,,,,,,,,,,,
2019-02-19T04:12:00Z,WQP851,-20.1068833,148.7222667,19,0.83369,,,,,,,,,,,,,,,,,,,,,,,,,,,,,,,,,,,,,,,,,,,,,,,,,,
2019-02-19T06:10:00Z,WQP852,-20.3801,148.8876167,0,0.85228,,,,,,,,,,,,,,,,,,,,,,,,,,,,,,,,,,,,,,,,,,,,,,,,,,
2019-02-19T06:10:00Z,WQP852,-20.3801,148.8876167,21,0.98384,,,,,,,,,,,,,,,,,,,,,,,,,,,,,,,,,,,,,,,,,,,,,,,,,,
2019-02-19T23:02:00Z,WQP855,-20.5779667,148.7095667,0,1.47433,,,,,,,,,,,,,,,,,,,,,,,,,,,,,,,,,,,,,,,,,,,,,,,,,,
2019-02-19T23:02:00Z,WQP855,-20.5779667,148.7095667,6,1.52438,,,,,,,,,,,,,,,,,,,,,,,,,,,,,,,,,,,,,,,,,,,,,,,,,,
2019-02-20T00:37:00Z,WQP854,-20.5767,148.8606667,0,0.81367,,,,,,,,,,,,,,,,,,,,,,,,,,,,,,,,,,,,,,,,,,,,,,,,,,
2019-02-20T00:37:00Z,WQP854,-20.5767,148.8606667,17,1.17832,,,,,,,,,,,,,,,,,,,,,,,,,,,,,,,,,,,,,,,,,,,,,,,,,,
2019-02-20T02:19:00Z,WQP853,-20.4680167,149.0393,0,0.60203,,,,,,,,,,,,,,,,,,,,,,,,,,,,,,,,,,,,,,,,,,,,,,,,,,
2019-02-20T02:19:00Z,WQP853,-20.4680167,149.0393,17,0.81653,,,,,,,,,,,,,,,,,,,,,,,,,,,,,,,,,,,,,,,,,,,,,,,,,,
2019-03-06T22:30:00Z,WQP865,-17.2030833,145.9786167,0,0.52481,,,,,,,,,,,,,,,,,,,,,,,,,,,,,,,,,,,,,,,,,,,,,,,,,,
2019-03-06T22:30:00Z,WQP865,-17.2030833,145.9786167,7,0.69927,,,,,,,,,,,,,,,,,,,,,,,,,,,,,,,,,,,,,,,,,,,,,,,,,,
2019-03-06T23:32:00Z,WQP868,-17.06775,145.9942333,0,0.33462,,,,,,,,,,,,,,,,,,,,,,,,,,,,,,,,,,,,,,,,,,,,,,,,,,
2019-03-06T23:32:00Z,WQP868,-17.06775,145.9942333,18,0.58487,,,,,,,,,,,,,,,,,,,,,,,,,,,,,,,,,,,,,,,,,,,,,,,,,,
2019-03-07T00:38:00Z,WQP869,-16.9202833,145.99695,0,0.38753,,,,,,,,,,,,,,,,,,,,,,,,,,,,,,,,,,,,,,,,,,,,,,,,,,
2019-03-07T00:38:00Z,WQP869,-16.9202833,145.99695,15,0.60489,,,,,,,,,,,,,,,,,,,,,,,,,,,,,,,,,,,,,,,,,,,,,,,,,,
2019-03-07T01:16:00Z,WQF001,-19.5881167,147.5819,0,1.26269,,,,,,,,,,,,,,,,,,,,,,,,,,,,,,,,,,,,,,,,,,,,,,,,,,
2019-03-07T01:16:00Z,WQF001,-19.5881167,147.5819,7,0.73931,,,,,,,,,,,,,,,,,,,,,,,,,,,,,,,,,,,,,,,,,,,,,,,,,,
2019-03-07T01:39:00Z,WQP841,-16.92315,145.99625,6.6,0.32032,,,,,,,,,,,,,,,,,,,,,,,,,,,,,,,,,,,,,,,,,,,,,,,,,,
2019-03-07T02:51:00Z,WQP867,-17.1621833,146.0042167,0,0.28314,,,,,,,,,,,,,,,,,,,,,,,,,,,,,,,,,,,,,,,,,,,,,,,,,,
2019-03-07T02:51:00Z,WQP867,-17.1621833,146.0042167,21,0.73502,,,,,,,,,,,,,,,,,,,,,,,,,,,,,,,,,,,,,,,,,,,,,,,,,,
2019-03-07T03:59:00Z,WQP840,-17.16215,146.0069867,6.2,0.20163,,,,,,,,,,,,,,,,,,,,,,,,,,,,,,,,,,,,,,,,,,,,,,,,,,
2019-03-07T04:59:00Z,WQP866,-17.2261167,146.0870833,0,0.29744,,,,,,,,,,,,,,,,,,,,,,,,,,,,,,,,,,,,,,,,,,,,,,,,,,
2019-03-07T04:59:00Z,WQP866,-17.2261167,146.0870833,20,0.53482,,,,,,,,,,,,,,,,,,,,,,,,,,,,,,,,,,,,,,,,,,,,,,,,,,
2019-03-07T05:08:00Z,WQF002,-19.3653667,147.48685,0,1.02531,,,,,,,,,,,,,,,,,,,,,,,,,,,,,,,,,,,,,,,,,,,,,,,,,,
2019-03-07T05:08:00Z,WQF002,-19.3653667,147.48685,8,0.82368,,,,,,,,,,,,,,,,,,,,,,,,,,,,,,,,,,,,,,,,,,,,,,,,,,
2019-03-07T05:52:00Z,WQP839,-17.2269667,146.0903667,6.6,0.24453,,,,,,,,,,,,,,,,,,,,,,,,,,,,,,,,,,,,,,,,,,,,,,,,,,
2019-03-07T23:38:00Z,WQP872,-17.8900833,146.2605667,0,0.22451,,,,,,,,,,,,,,,,,,,,,,,,,,,,,,,,,,,,,,,,,,,,,,,,,,
2019-03-07T23:38:00Z,WQP872,-17.8900833,146.2605667,24,0.46046,,,,,,,,,,,,,,,,,,,,,,,,,,,,,,,,,,,,,,,,,,,,,,,,,,
2019-03-07T23:50:00Z,WQF004,-18.8171667,146.4708333,0,0.2145,,,,,,,,,,,,,,,,,,,,,,,,,,,,,,,,,,,,,,,,,,,,,,,,,,
2019-03-07T23:50:00Z,WQF004,-18.8171667,146.4708333,14,0.26884,,,,,,,,,,,,,,,,,,,,,,,,,,,,,,,,,,,,,,,,,,,,,,,,,,
2019-03-08T00:45:00Z,WQP873,-17.96025,146.1903333,0,0.2288,,,,,,,,,,,,,,,,,,,,,,,,,,,,,,,,,,,,,,,,,,,,,,,,,,
2019-03-08T00:45:00Z,WQP873,-17.96025,146.1903333,23,0.68783,,,,,,,,,,,,,,,,,,,,,,,,,,,,,,,,,,,,,,,,,,,,,,,,,,
2019-03-08T01:42:00Z,WQP874,-18.0142833,146.1340333,0,0.31603,,,,,,,,,,,,,,,,,,,,,,,,,,,,,,,,,,,,,,,,,,,,,,,,,,
2019-03-08T01:42:00Z,WQP874,-18.0142833,146.1340333,9,1.05248,,,,,,,,,,,,,,,,,,,,,,,,,,,,,,,,,,,,,,,,,,,,,,,,,,
2019-03-08T02:42:00Z,WQP871,-18.0226333,146.0747333,0,2.6026,,,,,,,,,,,,,,,,,,,,,,,,,,,,,,,,,,,,,,,,,,,,,,,,,,
2019-03-08T02:42:00Z,WQP871,-18.0226333,146.0747333,6,1.05105,,,,,,,,,,,,,,,,,,,,,,,,,,,,,,,,,,,,,,,,,,,,,,,,,,
2019-03-08T03:14:00Z,WQF003,-18.9981667,146.70795,0,0.37037,,,,,,,,,,,,,,,,,,,,,,,,,,,,,,,,,,,,,,,,,,,,,,,,,,
2019-03-08T03:14:00Z,WQF003,-18.9981667,146.70795,17,0.71157,,,,,,,,,,,,,,,,,,,,,,,,,,,,,,,,,,,,,,,,,,,,,,,,,,
2019-03-08T03:58:00Z,WQP875,-17.9754833,146.1167667,0,0.89661,,,,,,,,,,,,,,,,,,,,,,,,,,,,,,,,,,,,,,,,,,,,,,,,,,
2019-03-08T03:58:00Z,WQP875,-17.9754833,146.1167667,6,0.90805,,,,,,,,,,,,,,,,,,,,,,,,,,,,,,,,,,,,,,,,,,,,,,,,,,
2019-03-08T04:50:00Z,WQP876,-17.9250333,146.1427833,0,0.2288,,,,,,,,,,,,,,,,,,,,,,,,,,,,,,,,,,,,,,,,,,,,,,,,,,
2019-03-08T04:50:00Z,WQP876,-17.9250333,146.1427833,7,0.38753,,,,,,,,,,,,,,,,,,,,,,,,,,,,,,,,,,,,,,,,,,,,,,,,,,
2019-03-08T05:45:00Z,WQP849,-17.9262833,146.1461333,6.5,0.21021,,,,,,,,,,,,,,,,,,,,,,,,,,,,,,,,,,,,,,,,,,,,,,,,,,
2019-03-12T00:43:00Z,WQP861,-19.5874833,147.58255,0,0.68068,,,,,,,,,,,,,,,,,,,,,,,,,,,,,,,,,,,,,,,,,,,,,,,,,,
2019-03-12T00:43:00Z,WQP861,-19.5874833,147.58255,6,1.84899,,,,,,,,,,,,,,,,,,,,,,,,,,,,,,,,,,,,,,,,,,,,,,,,,,
2019-03-12T22:32:00Z,WQP858,-19.1572667,146.8690667,0,0.25597,,,,,,,,,,,,,,,,,,,,,,,,,,,,,,,,,,,,,,,,,,,,,,,,,,
2019-03-12T22:32:00Z,WQP858,-19.1572667,146.8690667,8,0.75647,,,,,,,,,,,,,,,,,,,,,,,,,,,,,,,,,,,,,,,,,,,,,,,,,,
2019-03-13T00:10:00Z,WQP857,-19.29995,147.6206833,0,0.165305,,,,,,,,,,,,,,,,,,,,,,,,,,,,,,,,,,,,,,,,,,,,,,,,,,
2019-03-13T00:10:00Z,WQP857,-19.29995,147.6206833,26,0.295725,,,,,,,,,,,,,,,,,,,,,,,,,,,,,,,,,,,,,,,,,,,,,,,,,,
2019-03-13T00:25:00Z,WQP859,-18.8176333,146.4378833,0,0.164735,,,,,,,,,,,,,,,,,,,,,,,,,,,,,,,,,,,,,,,,,,,,,,,,,,
2019-03-13T00:25:00Z,WQP859,-18.8176333,146.4378833,11,0.53053,,,,,,,,,,,,,,,,,,,,,,,,,,,,,,,,,,,,,,,,,,,,,,,,,,
2019-03-13T02:11:00Z,WQP860,-18.5432,146.4871,0,0.11726,,,,,,,,,,,,,,,,,,,,,,,,,,,,,,,,,,,,,,,,,,,,,,,,,,
2019-03-13T02:11:00Z,WQP860,-18.5432,146.4871,25,0.34177,,,,,,,,,,,,,,,,,,,,,,,,,,,,,,,,,,,,,,,,,,,,,,,,,,
2019-03-13T04:40:00Z,WQP862,-19.2828667,147.1726,0,0.22594,,,,,,,,,,,,,,,,,,,,,,,,,,,,,,,,,,,,,,,,,,,,,,,,,,
2019-03-13T04:40:00Z,WQP862,-19.2828667,147.1726,10,0.47476,,,,,,,,,,,,,,,,,,,,,,,,,,,,,,,,,,,,,,,,,,,,,,,,,,
2019-03-19T02:28:00Z,WQP878,-20.1057667,148.7220167,0,0.5291,,,,,,,,,,,,,,,,,,,,,,,,,,,,,,,,,,,,,,,,,,,,,,,,,,
2019-03-19T02:28:00Z,WQP878,-20.1057667,148.7220167,14,0.69069,,,,,,,,,,,,,,,,,,,,,,,,,,,,,,,,,,,,,,,,,,,,,,,,,,
2019-03-19T03:59:00Z,WQP879,-20.3801667,148.8877667,0,0.55913,,,,,,,,,,,,,,,,,,,,,,,,,,,,,,,,,,,,,,,,,,,,,,,,,,
2019-03-19T03:59:00Z,WQP879,-20.3801667,148.8877667,20,0.64064,,,,,,,,,,,,,,,,,,,,,,,,,,,,,,,,,,,,,,,,,,,,,,,,,,
2019-03-19T05:12:00Z,WQP880,-20.4685,149.0391667,0,0.69212,,,,,,,,,,,,,,,,,,,,,,,,,,,,,,,,,,,,,,,,,,,,,,,,,,
2019-03-19T05:12:00Z,WQP880,-20.4685,149.0391667,12,0.66924,,,,,,,,,,,,,,,,,,,,,,,,,,,,,,,,,,,,,,,,,,,,,,,,,,
2019-03-20T00:19:00Z,WQP882,-20.5781667,148.7094833,0,0.40326,,,,,,,,,,,,,,,,,,,,,,,,,,,,,,,,,,,,,,,,,,,,,,,,,,
2019-03-20T00:19:00Z,WQP882,-20.5781667,148.7094833,8,0.41041,,,,,,,,,,,,,,,,,,,,,,,,,,,,,,,,,,,,,,,,,,,,,,,,,,
2019-03-20T01:38:00Z,WQP881,-20.57665,148.8602167,0,0.91806,,,,,,,,,,,,,,,,,,,,,,,,,,,,,,,,,,,,,,,,,,,,,,,,,,
2019-03-20T01:38:00Z,WQP881,-20.57665,148.8602167,12,1.32275,,,,,,,,,,,,,,,,,,,,,,,,,,,,,,,,,,,,,,,,,,,,,,,,,,
2019-03-28T00:10:00Z,WQP863,-19.5877167,147.5826833,2,1.02674,,,,,,,,,,,,,,,,,,,,,,,,,,,,,,,,,,,,,,,,,,,,,,,,,,
2019-04-26T05:35:00Z,WQP830,-17.2030167,145.9787833,2,0.25311,,,,,,,,,,,,,,,,,,,,,,,,,,,,,,,,,,,,,,,,,,,,,,,,,,
2019-04-27T00:27:00Z,WQP831,-18.0220833,146.07435,2,0.3861,,,,,,,,,,,,,,,,,,,,,,,,,,,,,,,,,,,,,,,,,,,,,,,,,,
2019-05-07T01:21:00Z,WQP915,-19.15739,146.8688617,7,0.37895,,,,,,,,,,,,,,,,,,,,,,,,,,,,,,,,,,,,,,,,,,,,,,,,,,
2019-05-07T02:18:00Z,WQP884,-19.305,147.622,0,0.21736,,,,,,,,,,,,,,,,,,,,,,,,,,,,,,,,,,,,,,,,,,,,,,,,,,
2019-05-07T02:18:00Z,WQP884,-19.305,147.622,26,0.29029,,,,,,,,,,,,,,,,,,,,,,,,,,,,,,,,,,,,,,,,,,,,,,,,,,
2019-05-09T01:28:00Z,WQP917,-18.5405833,146.48855,6,0.32747,,,,,,,,,,,,,,,,,,,,,,,,,,,,,,,,,,,,,,,,,,,,,,,,,,
2019-05-25T22:24:00Z,WQP895,-17.9755083,146.1167167,0,0.57486,,,,,,,,,,,,,,,,,,,,,,,,,,,,,,,,,,,,,,,,,,,,,,,,,,
2019-05-25T22:24:00Z,WQP895,-17.9755083,146.1167167,7,0.65351,,,,,,,,,,,,,,,,,,,,,,,,,,,,,,,,,,,,,,,,,,,,,,,,,,
2019-05-25T23:40:00Z,WQP891,-18.0223333,146.0746833,0,1.18118,,,,,,,,,,,,,,,,,,,,,,,,,,,,,,,,,,,,,,,,,,,,,,,,,,
2019-05-25T23:40:00Z,WQP891,-18.0223333,146.0746833,5,1.03103,,,,,,,,,,,,,,,,,,,,,,,,,,,,,,,,,,,,,,,,,,,,,,,,,,
2019-05-26T00:29:00Z,WQP894,-18.0141333,146.1330833,0,0.39897,,,,,,,,,,,,,,,,,,,,,,,,,,,,,,,,,,,,,,,,,,,,,,,,,,
2019-05-26T00:29:00Z,WQP894,-18.0141333,146.1330833,8,0.61633,,,,,,,,,,,,,,,,,,,,,,,,,,,,,,,,,,,,,,,,,,,,,,,,,,
2019-05-26T01:43:00Z,WQP893,-17.9599417,146.1908,0,0.77649,,,,,,,,,,,,,,,,,,,,,,,,,,,,,,,,,,,,,,,,,,,,,,,,,,
2019-05-26T01:43:00Z,WQP893,-17.9599417,146.1908,22,0.59488,,,,,,,,,,,,,,,,,,,,,,,,,,,,,,,,,,,,,,,,,,,,,,,,,,
2019-05-26T02:46:00Z,WQP892,-17.8903667,146.25995,0,1.00958,,,,,,,,,,,,,,,,,,,,,,,,,,,,,,,,,,,,,,,,,,,,,,,,,,
2019-05-26T02:46:00Z,WQP892,-17.8903667,146.25995,23,0.94094,,,,,,,,,,,,,,,,,,,,,,,,,,,,,,,,,,,,,,,,,,,,,,,,,,
2019-05-26T04:48:00Z,WQP896,-17.9248333,146.1431333,0,0.9152,,,,,,,,,,,,,,,,,,,,,,,,,,,,,,,,,,,,,,,,,,,,,,,,,,
2019-05-26T04:48:00Z,WQP896,-17.9248333,146.1431333,8,0.9295,,,,,,,,,,,,,,,,,,,,,,,,,,,,,,,,,,,,,,,,,,,,,,,,,,
2019-05-26T23:34:00Z,WQP885,-17.203175,145.9785167,0,0.36322,,,,,,,,,,,,,,,,,,,,,,,,,,,,,,,,,,,,,,,,,,,,,,,,,,
2019-05-26T23:34:00Z,WQP885,-17.203175,145.9785167,5,0.46046,,,,,,,,,,,,,,,,,,,,,,,,,,,,,,,,,,,,,,,,,,,,,,,,,,
2019-05-27T00:38:00Z,WQP886,-17.2264667,146.0874,0,0.79508,,,,,,,,,,,,,,,,,,,,,,,,,,,,,,,,,,,,,,,,,,,,,,,,,,
2019-05-27T00:38:00Z,WQP886,-17.2264667,146.0874,20,0.4576,,,,,,,,,,,,,,,,,,,,,,,,,,,,,,,,,,,,,,,,,,,,,,,,,,
2019-05-27T01:40:00Z,WQP887,-17.163275,146.00475,0,0.29887,,,,,,,,,,,,,,,,,,,,,,,,,,,,,,,,,,,,,,,,,,,,,,,,,,
2019-05-27T01:40:00Z,WQP887,-17.163275,146.00475,21,0.4147,,,,,,,,,,,,,,,,,,,,,,,,,,,,,,,,,,,,,,,,,,,,,,,,,,
2019-05-27T02:48:00Z,WQP888,-17.06905,145.9938333,0,0.37752,,,,,,,,,,,,,,,,,,,,,,,,,,,,,,,,,,,,,,,,,,,,,,,,,,
2019-05-27T02:48:00Z,WQP888,-17.06905,145.9938333,18,0.82082,,,,,,,,,,,,,,,,,,,,,,,,,,,,,,,,,,,,,,,,,,,,,,,,,,
2019-05-27T04:06:00Z,WQP889,-16.5873833,145.9967333,0,0.33748,,,,,,,,,,,,,,,,,,,,,,,,,,,,,,,,,,,,,,,,,,,,,,,,,,
2019-05-27T04:06:00Z,WQP889,-16.5873833,145.9967333,15,0.40898,,,,,,,,,,,,,,,,,,,,,,,,,,,,,,,,,,,,,,,,,,,,,,,,,,
2019-05-28T00:34:00Z,WQP898,-19.305,147.622,0,0.28457,,,,,,,,,,,,,,,,,,,,,,,,,,,,,,,,,,,,,,,,,,,,,,,,,,
2019-05-28T00:34:00Z,WQP898,-19.305,147.622,26,0.36608,,,,,,,,,,,,,,,,,,,,,,,,,,,,,,,,,,,,,,,,,,,,,,,,,,
2019-05-28T23:30:00Z,WQP906,-20.46845,149.03895,7.7,0.3146,,,,,,,,,,,,,,,,,,,,,,,,,,,,,,,,,,,,,,,,,,,,,,,,,,
2019-05-29T02:05:00Z,WQP907,-20.57784,148.86125,4.5,0.46189,,,,,,,,,,,,,,,,,,,,,,,,,,,,,,,,,,,,,,,,,,,,,,,,,,
2019-05-29T22:30:00Z,WQP902,-20.5768,148.8601,0,0.40183,,,,,,,,,,,,,,,,,,,,,,,,,,,,,,,,,,,,,,,,,,,,,,,,,,
2019-05-29T22:30:00Z,WQP902,-20.5768,148.8601,17,0.43186,,,,,,,,,,,,,,,,,,,,,,,,,,,,,,,,,,,,,,,,,,,,,,,,,,
2019-05-29T23:38:00Z,WQP903,-20.5781,148.7096667,0,0.54769,,,,,,,,,,,,,,,,,,,,,,,,,,,,,,,,,,,,,,,,,,,,,,,,,,
2019-05-29T23:38:00Z,WQP903,-20.5781,148.7096667,7,0.59202,,,,,,,,,,,,,,,,,,,,,,,,,,,,,,,,,,,,,,,,,,,,,,,,,,
2019-05-30T01:05:00Z,WQP901,-20.4679333,149.0393667,0,0.46332,,,,,,,,,,,,,,,,,,,,,,,,,,,,,,,,,,,,,,,,,,,,,,,,,,
2019-05-30T01:05:00Z,WQP901,-20.4679333,149.0393667,15,0.43329,,,,,,,,,,,,,,,,,,,,,,,,,,,,,,,,,,,,,,,,,,,,,,,,,,
2019-05-30T02:15:00Z,WQP900,-20.3799333,148.8874333,0,0.44473,,,,,,,,,,,,,,,,,,,,,,,,,,,,,,,,,,,,,,,,,,,,,,,,,,
2019-05-30T02:15:00Z,WQP900,-20.3799333,148.8874333,20,0.38753,,,,,,,,,,,,,,,,,,,,,,,,,,,,,,,,,,,,,,,,,,,,,,,,,,
2019-05-30T03:41:00Z,WQP899,-20.1063167,148.72165,0,0.45903,,,,,,,,,,,,,,,,,,,,,,,,,,,,,,,,,,,,,,,,,,,,,,,,,,
2019-05-30T03:41:00Z,WQP899,-20.1063167,148.72165,15,0.52052,,,,,,,,,,,,,,,,,,,,,,,,,,,,,,,,,,,,,,,,,,,,,,,,,,
2019-06-13T23:40:00Z,WQP910,-19.1574667,146.8689167,0,0.43472,,,,,,,,,,,,,,,,,,,,,,,,,,,,,,,,,,,,,,,,,,,,,,,,,,
2019-06-13T23:40:00Z,WQP910,-19.1574667,146.8689167,8,0.45617,,,,,,,,,,,,,,,,,,,,,,,,,,,,,,,,,,,,,,,,,,,,,,,,,,
2019-06-14T02:03:00Z,WQP911,-18.8177,146.438,0,0.25883,,,,,,,,,,,,,,,,,,,,,,,,,,,,,,,,,,,,,,,,,,,,,,,,,,
2019-06-14T02:03:00Z,WQP911,-18.8177,146.438,10,0.2431,,,,,,,,,,,,,,,,,,,,,,,,,,,,,,,,,,,,,,,,,,,,,,,,,,
2019-06-14T03:39:00Z,WQP912,-18.5432,146.4868833,0,0.45331,,,,,,,,,,,,,,,,,,,,,,,,,,,,,,,,,,,,,,,,,,,,,,,,,,
2019-06-14T03:39:00Z,WQP912,-18.5432,146.4868833,25,0.56771,,,,,,,,,,,,,,,,,,,,,,,,,,,,,,,,,,,,,,,,,,,,,,,,,,
2019-06-14T22:04:00Z,WQP913,-19.5874167,147.5829,0,1.04533,,,,,,,,,,,,,,,,,,,,,,,,,,,,,,,,,,,,,,,,,,,,,,,,,,
2019-06-14T22:04:00Z,WQP913,-19.5874167,147.5829,6,1.04819,,,,,,,,,,,,,,,,,,,,,,,,,,,,,,,,,,,,,,,,,,,,,,,,,,
2019-06-17T06:14:00Z,WQP927,-18.0246667,146.0766667,2,0.69212,,,,,,,,,,,,,,,,,,,,,,,,,,,,,,,,,,,,,,,,,,,,,,,,,,
2019-06-18T02:58:00Z,WQP926,-17.2033333,145.9833333,2,0.58201,,,,,,,,,,,,,,,,,,,,,,,,,,,,,,,,,,,,,,,,,,,,,,,,,,
2019-06-18T04:34:00Z,WQP932,-17.9262833,146.1461333,4.8,0.23738,,,,,,,,,,,,,,,,,,,,,,,,,,,,,,,,,,,,,,,,,,,,,,,,,,
2019-06-18T22:01:00Z,WQP920,-16.7716667,145.955,0,0.25311,,,,,,,,,,,,,,,,,,,,,,,,,,,,,,,,,,,,,,,,,,,,,,,,,,
2019-06-18T22:01:00Z,WQP920,-16.7716667,145.955,35,0.32747,,,,,,,,,,,,,,,,,,,,,,,,,,,,,,,,,,,,,,,,,,,,,,,,,,
2019-06-18T23:03:00Z,WQP921,-16.8466667,145.8383333,0,0.2431,,,,,,,,,,,,,,,,,,,,,,,,,,,,,,,,,,,,,,,,,,,,,,,,,,
2019-06-18T23:03:00Z,WQP921,-16.8466667,145.8383333,6,0.3003,,,,,,,,,,,,,,,,,,,,,,,,,,,,,,,,,,,,,,,,,,,,,,,,,,
2019-06-19T00:55:00Z,WQP922,-16.7866667,145.7466667,0,0.54197,,,,,,,,,,,,,,,,,,,,,,,,,,,,,,,,,,,,,,,,,,,,,,,,,,
2019-06-19T00:55:00Z,WQP922,-16.7866667,145.7466667,8,0.53625,,,,,,,,,,,,,,,,,,,,,,,,,,,,,,,,,,,,,,,,,,,,,,,,,,
2019-06-19T01:30:00Z,WQP923,-16.6633333,145.705,0,0.29172,,,,,,,,,,,,,,,,,,,,,,,,,,,,,,,,,,,,,,,,,,,,,,,,,,
2019-06-19T01:30:00Z,WQP923,-16.6633333,145.705,17,0.42757,,,,,,,,,,,,,,,,,,,,,,,,,,,,,,,,,,,,,,,,,,,,,,,,,,
2019-06-19T03:39:00Z,WQP924,-16.41,145.5066667,0,0.23881,,,,,,,,,,,,,,,,,,,,,,,,,,,,,,,,,,,,,,,,,,,,,,,,,,
2019-06-19T03:39:00Z,WQP924,-16.41,145.5066667,13,0.69927,,,,,,,,,,,,,,,,,,,,,,,,,,,,,,,,,,,,,,,,,,,,,,,,,,
2019-06-19T05:59:00Z,WQP925,-16.1133333,145.4816667,0,0.286,,,,,,,,,,,,,,,,,,,,,,,,,,,,,,,,,,,,,,,,,,,,,,,,,,
2019-06-19T05:59:00Z,WQP925,-16.1133333,145.4816667,13,0.6006,,,,,,,,,,,,,,,,,,,,,,,,,,,,,,,,,,,,,,,,,,,,,,,,,,
2019-06-20T23:00:00Z,WQP916,-18.8168,146.4345667,7.4,0.17875,,,,,,,,,,,,,,,,,,,,,,,,,,,,,,,,,,,,,,,,,,,,,,,,,,
2019-07-03T01:05:00Z,WQP909,-19.2953167,147.6166333,0,0.19877,,,,,,,,,,,,,,,,,,,,,,,,,,,,,,,,,,,,,,,,,,,,,,,,,,
2019-07-03T01:05:00Z,WQP909,-19.2953167,147.6166333,26,0.24596,,,,,,,,,,,,,,,,,,,,,,,,,,,,,,,,,,,,,,,,,,,,,,,,,,
2019-07-03T04:20:00Z,WQP914,-19.2810333,147.1715,0,0.21593,,,,,,,,,,,,,,,,,,,,,,,,,,,,,,,,,,,,,,,,,,,,,,,,,,
2019-07-03T04:20:00Z,WQP914,-19.2810333,147.1715,10,0.23595,,,,,,,,,,,,,,,,,,,,,,,,,,,,,,,,,,,,,,,,,,,,,,,,,,
2019-07-09T23:36:00Z,WQF008,-18.81695,146.4387167,0,0.24739,,,,,,,,,,,,,,,,,,,,,,,,,,,,,,,,,,,,,,,,,,,,,,,,,,
2019-07-09T23:36:00Z,WQF008,-18.81695,146.4387167,15,0.24596,,,,,,,,,,,,,,,,,,,,,,,,,,,,,,,,,,,,,,,,,,,,,,,,,,
2019-07-10T03:25:00Z,WQF007,-18.9980333,146.7078333,0,0.30316,,,,,,,,,,,,,,,,,,,,,,,,,,,,,,,,,,,,,,,,,,,,,,,,,,
2019-07-10T03:25:00Z,WQF007,-18.9980333,146.7078333,17,0.28457,,,,,,,,,,,,,,,,,,,,,,,,,,,,,,,,,,,,,,,,,,,,,,,,,,
2019-07-10T03:55:00Z,WQP905,-20.3779833,148.8883667,5.9,0.49907,,,,,,,,,,,,,,,,,,,,,,,,,,,,,,,,,,,,,,,,,,,,,,,,,,
2019-07-10T23:40:00Z,WQP904,-20.1049167,148.72175,5.5,0.26455,,,,,,,,,,,,,,,,,,,,,,,,,,,,,,,,,,,,,,,,,,,,,,,,,,
2019-07-11T00:30:00Z,WQF009,-19.3001833,147.5375667,0,0.143,,,,,,,,,,,,,,,,,,,,,,,,,,,,,,,,,,,,,,,,,,,,,,,,,,
2019-07-11T00:30:00Z,WQF009,-19.3001833,147.5375667,26,0.2431,,,,,,,,,,,,,,,,,,,,,,,,,,,,,,,,,,,,,,,,,,,,,,,,,,
2019-07-11T02:56:00Z,WQF006,-19.3668167,147.4874333,0,0.56914,,,,,,,,,,,,,,,,,,,,,,,,,,,,,,,,,,,,,,,,,,,,,,,,,,
2019-07-11T02:56:00Z,WQF006,-19.3668167,147.4874333,8,0.4576,,,,,,,,,,,,,,,,,,,,,,,,,,,,,,,,,,,,,,,,,,,,,,,,,,
2019-07-12T00:32:00Z,WQF005,-19.58795,147.58225,0,0.80366,,,,,,,,,,,,,,,,,,,,,,,,,,,,,,,,,,,,,,,,,,,,,,,,,,
2019-07-12T00:32:00Z,WQF005,-19.58795,147.58225,5,0.88803,,,,,,,,,,,,,,,,,,,,,,,,,,,,,,,,,,,,,,,,,,,,,,,,,,
2019-07-20T02:02:00Z,WQP929,-17.2269667,146.0903667,6.5,0.16588,,,,,,,,,,,,,,,,,,,,,,,,,,,,,,,,,,,,,,,,,,,,,,,,,,
2019-07-20T05:09:00Z,WQP930,-17.16215,146.0069867,5.9,0.15873,,,,,,,,,,,,,,,,,,,,,,,,,,,,,,,,,,,,,,,,,,,,,,,,,,
2019-07-22T01:17:00Z,WQP931,-16.92315,145.99625,6.1,0.19877,,,,,,,,,,,,,,,,,,,,,,,,,,,,,,,,,,,,,,,,,,,,,,,,,,
,,, ,,,,,,,,,,,,,,,,,,,,,,,,,,,,,,,,,,,,,,,,,,,,,,,,,,,,
,,,,,,,,,,,,,,,,,,,,,,,,,,,,,,,,,,,,,,,,,,,,,,,,,,,,,,,
,,,,,,,,,,,,,,,,,,,,,,,,,,,,,,,,,,,,,,,,,,,,,,,,,,,,,,,
,,,,,,,,,,,,,,,,,,,,,,,,,,,,,,,,,,,,,,,,,,,,,,,,,,,,,,,
,,,,,,,,,,,,,,,,,,,,,,,,,,,,,,,,,,,,,,,,,,,,,,,,,,,,,,,
,,,,,,,,,,,,,,,,,,,,,,,,,,,,,,,,,,,,,,,,,,,,,,,,,,,,,,,
,,,,,,,,,,,,,,,,,,,,,,,,,,,,,,,,,,,,,,,,,,,,,,,,,,,,,,,
,,,,,,,,,,,,,,,,,,,,,,,,,,,,,,,,,,,,,,,,,,,,,,,,,,,,,,,
,,,,,,,,,,,,,,,,,,,,,,,,,,,,,,,,,,,,,,,,,,,,,,,,,,,,,,,
,,,,,,,,,,,,,,,,,,,,,,,,,,,,,,,,,,,,,,,,,,,,,,,,,,,,,,,
,,,,,,,,,,,,,,,,,,,,,,,,,,,,,,,,,,,,,,,,,,,,,,,,,,,,,,,
,,,,,,,,,,,,,,,,,,,,,,,,,,,,,,,,,,,,,,,,,,,,,,,,,,,,,,,
,,,,,,,,,,,,,,,,,,,,,,,,,,,,,,,,,,,,,,,,,,,,,,,,,,,,,,,
,,,,,,,,,,,,,,,,,,,,,,,,,,,,,,,,,,,,,,,,,,,,,,,,,,,,,,,
,,,,,,,,,,,,,,,,,,,,,,,,,,,,,,,,,,,,,,,,,,,,,,,,,,,,,,,
,,,,,,,,,,,,,,,,,,,,,,,,,,,,,,,,,,,,,,,,,,,,,,,,,,,,,,,
,,,,,,,,,,,,,,,,,,,,,,,,,,,,,,,,,,,,,,,,,,,,,,,,,,,,,,,
,,,,,,,,,,,,,,,,,,,,,,,,,,,,,,,,,,,,,,,,,,,,,,,,,,,,,,,
,,,,,,,,,,,,,,,,,,,,,,,,,,,,,,,,,,,,,,,,,,,,,,,,,,,,,,,
,,,,,,,,,,,,,,,,,,,,,,,,,,,,,,,,,,,,,,,,,,,,,,,,,,,,,,,
,,,,,,,,,,,,,,,,,,,,,,,,,,,,,,,,,,,,,,,,,,,,,,,,,,,,,,,
,,,,,,,,,,,,,,,,,,,,,,,,,,,,,,,,,,,,,,,,,,,,,,,,,,,,,,,
,,,,,,,,,,,,,,,,,,,,,,,,,,,,,,,,,,,,,,,,,,,,,,,,,,,,,,,
,,,,,,,,,,,,,,,,,,,,,,,,,,,,,,,,,,,,,,,,,,,,,,,,,,,,,,,
,,,,,,,,,,,,,,,,,,,,,,,,,,,,,,,,,,,,,,,,,,,,,,,,,,,,,,,
,,,,,,,,,,,,,,,,,,,,,,,,,,,,,,,,,,,,,,,,,,,,,,,,,,,,,,,
