Prompt,No.,Form,Colour,Relation,Correct number of objects
behind,0,1,1,0,0
behind,1,1,1,0,0
behind,2,1,1,0,0
behind,3,1,1,0,0
behind,4,1,1,0,0
behind,5,1,1,0,0
behind,6,1,1,0,1
behind,7,1,1,0,1
behind,8,1,1,0,0
behind,9,0,0,0,0
behind,10,1,1,0,0
behind,11,1,1,0,0
behind,12,1,1,0,0
behind,13,1,1,0,0
behind,14,1,1,0,0
behind,15,1,0,0,0
behind,16,1,1,0,0
behind,17,1,0,0,1
behind,18,0,0,0,0
behind,19,1,1,0,0
behind,20,1,1,0,0
behind,21,1,0,0,0
behind,22,1,0,0,0
behind,23,1,1,0,0
behind,24,1,1,0,0
behind,25,0,1,1,1
behind,26,0,1,1,1
behind,27,0,1,0,1
behind,28,1,1,0,0
behind,29,1,1,0,0
behind,30,1,1,0,0
behind,31,1,1,0,0
behind,32,0,1,1,1
behind,33,1,1,0,0
behind,34,1,0,0,1
behind,35,0,1,1,1
behind,36,1,1,0,0
behind,37,1,1,0,0
behind,38,1,1,0,1
behind,39,1,1,0,0
behind,40,1,1,0,0
behind,41,1,1,0,0
behind,42,1,0,0,0
behind,43,1,1,0,1
behind,44,1,1,0,0
behind,45,1,0,0,0
behind,46,1,0,0,0
behind,47,1,0,0,0
behind,48,1,1,0,0
behind,49,1,1,0,1
behind,50,0,0,0,0
behind,51,1,1,0,0
behind,52,1,1,0,1
behind,53,0,0,0,1
behind,54,1,1,0,0
behind,55,0,1,1,0
behind,56,1,1,0,1
behind,57,1,1,0,0
behind,58,1,1,0,0
behind,59,1,1,0,0
behind,60,1,1,0,1
behind,61,0,0,0,1
behind,62,1,1,0,0
behind,63,1,1,0,0
behind,64,0,1,0,1
behind,65,1,1,0,0
behind,66,1,1,0,0
behind,67,0,1,1,1
behind,68,0,0,0,1
behind,69,1,1,0,0
behind,70,1,0,0,0
behind,71,1,0,0,0
behind,72,0,0,0,0
behind,73,0,0,0,0
behind,74,1,0,0,0
behind,75,1,1,0,0
behind,76,1,1,0,0
behind,77,1,1,0,0
behind,78,1,1,0,0
behind,79,1,1,0,0
behind,80,1,1,0,0
behind,81,1,1,0,0
behind,82,1,1,0,0
behind,83,1,1,0,0
behind,84,0,1,1,1
behind,85,0,1,0,1
behind,86,1,1,0,0
behind,87,1,1,0,1
behind,88,1,1,0,0
behind,89,1,1,0,0
behind,90,0,1,0,1
behind,91,0,0,0,1
behind,92,1,1,0,1
behind,93,0,1,0,1
behind,94,1,0,0,0
behind,95,1,1,0,0
behind,96,1,1,0,0
behind,97,1,1,0,0
behind,98,0,1,1,1
behind,99,0,0,0,1
left of,0,0,1,0,0
left of,1,1,1,0,0
left of,2,1,1,0,0
left of,3,1,0,0,0
left of,4,1,1,0,0
left of,5,1,1,0,0
left of,6,1,0,0,0
left of,7,1,0,0,0
left of,8,0,0,0,1
left of,9,1,1,0,0
left of,10,1,0,0,0
left of,11,1,1,0,0
left of,12,1,0,0,0
left of,13,1,0,0,0
left of,14,1,1,0,0
left of,15,1,1,0,0
left of,16,1,1,0,0
left of,17,1,0,0,0
left of,18,1,0,0,0
left of,19,1,1,0,0
left of,20,1,1,0,0
left of,21,0,1,0,0
left of,22,1,1,0,0
left of,23,0,1,0,0
left of,24,1,1,0,0
left of,25,1,1,0,0
left of,26,1,0,0,0
left of,27,0,0,0,0
left of,28,1,1,0,0
left of,29,1,1,0,0
left of,30,1,1,0,0
left of,31,1,1,0,0
left of,32,1,1,0,0
left of,33,1,1,0,0
left of,34,1,1,0,0
left of,35,1,0,0,0
left of,36,0,1,0,0
left of,37,1,1,0,0
left of,38,1,1,0,0
left of,39,0,1,1,0
left of,40,1,1,0,0
left of,41,1,0,0,0
left of,42,1,0,0,0
left of,43,1,0,0,0
left of,44,1,0,0,0
left of,45,0,1,1,1
left of,46,0,0,0,0
left of,47,0,0,0,0
left of,48,1,1,0,0
left of,49,1,0,0,0
left of,50,0,0,0,0
left of,51,1,0,0,0
left of,52,1,0,0,0
left of,53,0,0,0,0
left of,54,1,1,0,0
left of,55,1,1,0,0
left of,56,1,1,0,0
left of,57,0,1,1,1
left of,58,0,1,1,1
left of,59,1,1,0,0
left of,60,1,1,0,0
left of,61,1,0,0,0
left of,62,0,1,0,0
left of,63,1,0,0,0
left of,64,0,1,0,1
left of,65,1,1,0,0
left of,66,1,1,0,0
left of,67,1,1,0,0
left of,68,1,1,0,0
left of,69,0,0,0,0
left of,70,1,1,0,0
left of,71,1,0,0,0
left of,72,0,0,0,0
left of,73,1,0,0,0
left of,74,1,0,0,0
left of,75,1,0,0,0
left of,76,1,1,0,0
left of,77,0,1,0,1
left of,78,0,1,0,1
left of,79,1,1,0,0
left of,80,1,1,0,1
left of,81,1,1,0,0
left of,82,1,1,0,0
left of,83,1,1,0,0
left of,84,0,1,0,1
left of,85,1,1,0,0
left of,86,1,0,0,0
left of,87,1,1,0,0
left of,88,0,0,0,0
left of,89,1,1,0,0
left of,90,0,1,0,0
left of,91,1,1,0,0
left of,92,1,0,0,0
left of,93,1,0,0,0
left of,94,0,0,0,0
left of,95,1,0,0,0
left of,96,1,1,0,0
left of,97,0,1,1,1
left of,98,1,1,0,0
left of,99,0,0,0,1
on the left and on the right ,0,0,0,1,1
on the left and on the right ,1,0,0,1,1
on the left and on the right ,2,0,1,0,1
on the left and on the right ,3,0,0,0,1
on the left and on the right ,4,1,0,1,0
on the left and on the right ,5,0,0,1,1
on the left and on the right ,6,0,0,1,1
on the left and on the right ,7,0,0,1,0
on the left and on the right ,8,1,0,1,1
on the left and on the right ,9,0,0,1,1
on the left and on the right ,10,0,0,1,1
on the left and on the right ,11,0,0,1,1
on the left and on the right ,12,0,1,0,0
on the left and on the right ,13,1,1,0,1
on the left and on the right ,14,0,0,1,1
on the left and on the right ,15,1,1,1,1
on the left and on the right ,16,0,0,1,1
on the left and on the right ,17,1,0,1,1
on the left and on the right ,18,0,1,0,1
on the left and on the right ,19,1,1,0,0
on the left and on the right ,20,0,1,0,1
on the left and on the right ,21,0,0,1,1
on the left and on the right ,22,0,0,1,0
on the left and on the right ,23,0,0,1,0
on the left and on the right ,24,1,1,0,1
on the left and on the right ,25,0,1,0,0
on the left and on the right ,26,0,0,1,1
on the left and on the right ,27,0,1,0,1
on the left and on the right ,28,0,0,1,1
on the left and on the right ,29,0,0,1,1
on the left and on the right ,30,1,0,1,1
on the left and on the right ,31,1,0,0,1
on the left and on the right ,32,0,1,0,0
on the left and on the right ,33,1,1,1,1
on the left and on the right ,34,0,0,0,1
on the left and on the right ,35,0,1,0,0
on the left and on the right ,36,0,0,1,1
on the left and on the right ,37,0,0,1,1
on the left and on the right ,38,0,1,0,1
on the left and on the right ,39,1,0,1,1
on the left and on the right ,40,0,0,1,1
on the left and on the right ,41,1,1,0,1
on the left and on the right ,42,0,1,0,1
on the left and on the right ,43,0,1,0,0
on the left and on the right ,44,1,1,0,0
on the left and on the right ,45,0,0,0,1
on the left and on the right ,46,0,0,1,1
on the left and on the right ,47,0,1,0,1
on the left and on the right ,48,0,0,1,1
on the left and on the right ,49,0,1,0,1
on the left and on the right ,50,0,1,0,1
on the left and on the right ,51,0,1,1,1
on the left and on the right ,52,0,0,1,1
on the left and on the right ,53,0,0,1,1
on the left and on the right ,54,0,1,1,1
on the left and on the right ,55,0,0,1,1
on the left and on the right ,56,1,0,1,1
on the left and on the right ,57,0,1,0,0
on the left and on the right ,58,0,0,1,1
on the left and on the right ,59,1,1,0,1
on the left and on the right ,60,0,0,1,1
on the left and on the right ,61,0,1,1,1
on the left and on the right ,62,0,0,1,1
on the left and on the right ,63,0,0,1,1
on the left and on the right ,64,0,0,0,1
on the left and on the right ,65,0,1,0,1
on the left and on the right ,66,0,0,1,1
on the left and on the right ,67,0,0,1,1
on the left and on the right ,68,0,0,1,1
on the left and on the right ,69,0,0,1,1
on the left and on the right ,70,0,1,0,1
on the left and on the right ,71,0,0,1,1
on the left and on the right ,72,1,1,1,1
on the left and on the right ,73,0,1,0,1
on the left and on the right ,74,0,0,1,1
on the left and on the right ,75,0,0,1,1
on the left and on the right ,76,0,1,0,0
on the left and on the right ,77,0,0,1,1
on the left and on the right ,78,0,0,1,1
on the left and on the right ,79,0,0,0,0
on the left and on the right ,80,0,0,1,1
on the left and on the right ,81,0,0,1,1
on the left and on the right ,82,1,0,1,1
on the left and on the right ,83,0,0,1,1
on the left and on the right ,84,0,0,1,1
on the left and on the right ,85,0,0,0,1
on the left and on the right ,86,0,1,0,1
on the left and on the right ,87,0,1,0,1
on the left and on the right ,88,1,0,1,1
on the left and on the right ,89,0,0,1,1
on the left and on the right ,90,0,0,0,1
on the left and on the right ,91,0,0,0,0
on the left and on the right ,92,0,0,1,1
on the left and on the right ,93,0,0,1,1
on the left and on the right ,94,0,0,1,1
on the left and on the right ,95,0,0,1,1
on the left and on the right ,96,0,0,0,1
on the left and on the right ,97,0,1,0,1
on the left and on the right ,98,0,0,1,1
on the left and on the right ,99,0,0,1,1
on top of,0,1,1,1,0
on top of,1,1,1,1,1
on top of,2,0,1,0,0
on top of,3,0,0,0,1
on top of,4,1,1,1,1
on top of,5,1,1,1,1
on top of,6,1,1,1,1
on top of,7,1,1,0,0
on top of,8,1,1,1,0
on top of,9,1,0,0,0
on top of,10,1,1,1,1
on top of,11,1,1,1,1
on top of,12,1,1,1,0
on top of,13,0,0,0,0
on top of,14,0,1,0,1
on top of,15,1,0,0,0
on top of,16,0,1,1,1
on top of,17,0,1,1,1
on top of,18,0,1,1,1
on top of,19,0,1,1,1
on top of,20,1,1,1,1
on top of,21,1,1,0,0
on top of,22,0,1,1,1
on top of,23,0,1,1,0
on top of,24,1,0,1,1
on top of,25,0,1,1,1
on top of,26,1,0,1,1
on top of,27,0,1,0,1
on top of,28,0,1,0,1
on top of,29,1,0,1,1
on top of,30,0,0,1,1
on top of,31,0,1,1,1
on top of,32,1,1,0,0
on top of,33,0,0,0,0
on top of,34,0,0,0,0
on top of,35,0,0,0,0
on top of,36,1,1,1,1
on top of,37,1,1,0,0
on top of,38,1,1,1,1
on top of,39,1,1,1,1
on top of,40,0,1,1,1
on top of,41,1,1,1,1
on top of,42,1,1,1,0
on top of,43,1,0,0,0
on top of,44,1,1,1,1
on top of,45,1,1,1,1
on top of,46,0,1,1,0
on top of,47,1,0,0,0
on top of,48,1,1,0,0
on top of,49,0,0,0,0
on top of,50,1,1,1,1
on top of,51,1,1,1,1
on top of,52,1,1,1,0
on top of,53,1,1,1,1
on top of,54,1,0,0,0
on top of,55,1,1,1,0
on top of,56,0,1,1,1
on top of,57,1,0,0,0
on top of,58,1,1,0,0
on top of,59,1,1,0,0
on top of,60,0,1,1,1
on top of,61,1,1,1,1
on top of,62,1,1,1,1
on top of,63,1,1,1,1
on top of,64,1,0,1,1
on top of,65,1,1,1,1
on top of,66,0,1,1,1
on top of,67,0,1,1,1
on top of,68,1,0,1,1
on top of,69,0,1,0,1
on top of,70,1,1,1,1
on top of,71,1,1,1,1
on top of,72,0,1,0,0
on top of,73,0,1,1,1
on top of,74,1,1,1,1
on top of,75,1,1,1,1
on top of,76,0,1,0,0
on top of,77,1,1,1,1
on top of,78,0,1,1,1
on top of,79,1,1,0,0
on top of,80,1,1,0,1
on top of,81,1,0,1,1
on top of,82,0,1,0,0
on top of,83,0,1,1,1
on top of,84,1,1,1,1
on top of,85,0,0,0,0
on top of,86,0,0,1,1
on top of,87,1,1,1,0
on top of,88,1,1,1,0
on top of,89,1,1,1,1
on top of,90,1,0,1,1
on top of,91,1,1,1,1
on top of,92,0,0,0,1
on top of,93,0,0,0,0
on top of,94,0,1,1,1
on top of,95,0,1,0,0
on top of,96,1,0,0,0
on top of,97,1,1,1,1
on top of,98,1,1,1,1
on top of,99,0,1,0,0
right of,0,1,0,0,0
right of,1,1,1,0,0
right of,2,0,1,0,0
right of,3,0,0,0,0
right of,4,1,0,0,0
right of,5,1,1,0,1
right of,6,0,1,0,0
right of,7,1,0,0,0
right of,8,0,1,0,0
right of,9,0,0,0,0
right of,10,0,1,0,1
right of,11,0,0,0,0
right of,12,1,1,0,0
right of,13,0,0,0,0
right of,14,1,1,0,0
right of,15,1,0,0,0
right of,16,1,0,0,0
right of,17,0,1,0,0
right of,18,0,0,0,0
right of,19,1,1,0,0
right of,20,1,0,0,0
right of,21,0,0,0,0
right of,22,1,0,0,0
right of,23,0,0,0,0
right of,24,1,1,0,0
right of,25,0,0,0,0
right of,26,1,1,0,0
right of,27,1,0,0,0
right of,28,1,1,0,0
right of,29,1,1,0,0
right of,30,1,1,0,0
right of,31,0,1,0,0
right of,32,0,1,0,0
right of,33,0,1,0,0
right of,34,1,0,0,0
right of,35,1,0,0,0
right of,36,1,0,0,0
right of,37,1,1,0,0
right of,38,1,0,0,0
right of,39,0,0,0,0
right of,40,1,0,0,0
right of,41,0,0,0,0
right of,42,1,1,0,0
right of,43,1,0,0,0
right of,44,1,0,0,0
right of,45,1,0,0,0
right of,46,1,0,0,0
right of,47,1,0,0,0
right of,48,0,1,1,0
right of,49,1,0,0,0
right of,50,1,1,0,0
right of,51,0,0,0,0
right of,52,1,0,0,0
right of,53,1,0,0,0
right of,54,1,0,0,0
right of,55,0,0,0,0
right of,56,1,0,0,0
right of,57,1,0,0,0
right of,58,1,0,0,0
right of,59,1,0,0,0
right of,60,1,0,0,0
right of,61,1,1,0,0
right of,62,1,1,0,0
right of,63,1,0,0,0
right of,64,0,0,0,0
right of,65,0,0,0,0
right of,66,1,0,0,0
right of,67,0,1,0,1
right of,68,1,1,0,0
right of,69,0,0,0,0
right of,70,1,0,0,0
right of,71,1,1,0,0
right of,72,0,0,0,0
right of,73,1,0,0,0
right of,74,0,0,0,0
right of,75,1,1,0,0
right of,76,1,1,0,0
right of,77,0,1,0,1
right of,78,1,1,0,0
right of,79,1,1,0,0
right of,80,1,0,0,0
right of,81,1,0,0,0
right of,82,1,0,0,0
right of,83,0,0,0,0
right of,84,0,1,0,1
right of,85,0,1,1,0
right of,86,0,1,0,1
right of,87,0,0,0,0
right of,88,1,0,0,0
right of,89,0,1,0,1
right of,90,1,1,0,0
right of,91,1,1,0,0
right of,92,0,1,0,0
right of,93,1,1,0,0
right of,94,1,1,0,0
right of,95,1,0,0,0
right of,96,1,1,0,0
right of,97,1,0,0,0
right of,98,0,1,0,0
right of,99,0,0,0,1
AND,0,1,1,0,0
AND,1,0,1,1,1
AND,2,1,0,1,1
AND,3,0,0,0,0
AND,4,0,1,1,1
AND,5,0,0,0,0
AND,6,1,1,0,0
AND,7,1,0,1,1
AND,8,0,1,0,0
AND,9,1,1,0,0
AND,10,1,1,0,0
AND,11,1,0,1,1
AND,12,1,0,1,1
AND,13,1,1,1,1
AND,14,1,0,1,1
AND,15,1,1,0,0
AND,16,0,1,1,1
AND,17,0,1,1,1
AND,18,1,1,0,0
AND,19,0,0,0,0
AND,20,1,1,0,0
AND,21,0,0,1,1
AND,22,1,0,0,0
AND,23,1,0,0,0
AND,24,0,0,1,0
AND,25,1,1,1,1
AND,26,1,1,0,0
AND,27,0,1,1,1
AND,28,1,0,1,1
AND,29,0,1,0,0
AND,30,1,1,1,1
AND,31,0,1,1,1
AND,32,1,0,1,1
AND,33,0,0,0,0
AND,34,1,1,1,1
AND,35,1,1,0,0
AND,36,1,1,1,0
AND,37,1,1,1,1
AND,38,0,0,1,1
AND,39,0,1,1,1
AND,40,1,1,1,0
AND,41,1,1,1,1
AND,42,1,0,1,1
AND,43,0,0,1,1
AND,44,0,1,1,1
AND,45,1,1,1,1
AND,46,1,0,0,0
AND,47,1,1,0,0
AND,48,0,1,0,0
AND,49,0,0,1,1
AND,50,1,1,0,0
AND,51,1,0,0,0
AND,52,0,0,1,1
AND,53,1,1,1,1
AND,54,1,1,0,0
AND,55,0,0,1,1
AND,56,0,1,1,1
AND,57,1,1,1,1
AND,58,0,1,1,0
AND,59,0,0,1,1
AND,60,1,1,1,1
AND,61,1,0,1,1
AND,62,0,1,1,0
AND,63,1,1,0,0
AND,64,1,0,1,1
AND,65,1,1,0,0
AND,66,0,0,1,1
AND,67,1,0,0,0
AND,68,0,1,1,1
AND,69,1,0,1,1
AND,70,0,1,1,0
AND,71,1,1,0,0
AND,72,1,1,1,1
AND,73,0,1,1,1
AND,74,0,0,1,1
AND,75,1,1,0,0
AND,76,1,1,0,0
AND,77,1,1,0,0
AND,78,0,0,1,1
AND,79,1,1,0,0
AND,80,1,0,0,0
AND,81,1,1,0,0
AND,82,0,1,1,1
AND,83,1,0,0,0
AND,84,0,0,1,1
AND,85,1,1,0,0
AND,86,0,1,1,0
AND,87,1,1,0,0
AND,88,0,0,0,0
AND,89,1,1,0,0
AND,90,0,0,0,0
AND,91,1,0,0,0
AND,92,1,0,0,0
AND,93,1,0,0,0
AND,94,1,0,0,0
AND,95,1,1,0,0
AND,96,1,1,0,0
AND,97,1,1,1,1
AND,98,1,1,0,0
AND,99,1,1,1,1
