[
  0.323875,
  0.45305,
  0.52275,
  0.572525,
  0.608275,
  0.642,
  0.667375,
  0.695125,
  0.7111,
  0.731775,
  0.74825,
  0.764475,
  0.78015,
  0.791275,
  0.8028,
  0.815575,
  0.824875,
  0.838825,
  0.84335,
  0.856925,
  0.866175,
  0.873,
  0.88385,
  0.8899,
  0.901025,
  0.904375,
  0.912175,
  0.915225,
  0.916775,
  0.91915
]