[
  1.8202703530621376,
  1.5180859877045747,
  1.3917135000228882,
  1.2997534320612623,
  1.2202698865513892,
  1.1588748636519073,
  1.100634459097674,
  1.0511646733921804,
  1.0085790882444685,
  0.9802610107288239,
  0.9354885330625401,
  0.913246873078073,
  0.8813050210855569,
  0.8581627132786307,
  0.8319647706997623,
  0.8112013328606915,
  0.7889034975865844,
  0.7698185345169845,
  0.755650773169888,
  0.7319803173374978,
  0.7192873149920421,
  0.702231999415501,
  0.687808922901275,
  0.6766670896748829,
  0.6583031780400853,
  0.6481561415894016,
  0.6317413426508569,
  0.6208596510492312,
  0.6199215041224364,
  0.6011248352421317
]