<?xml version='1.0' encoding='utf-8'?>
<gexf version="1.2" xmlns="http://www.gexf.net/1.2draft" xmlns:xsi="http://www.w3.org/2001/XMLSchema-instance" xsi:schemaLocation="http://www.gexf.net/1.2draft http://www.gexf.net/1.2draft/gexf.xsd">
  <meta lastmodifieddate="2021-02-15">
    <creator>NetworkX 2.4</creator>
  </meta>
  <graph defaultedgetype="undirected" mode="static" name="">
    <nodes>
      <node id="8069352" label="url" />
      <node id="7860002" label="handle" />
      <node id="2927892" label="url" />
      <node id="4246375" label="handle" />
      <node id="9143270" label="handle" />
      <node id="10549565" label="url" />
      <node id="3552231" label="title" />
      <node id="5909096" label="checksum" />
      <node id="7868445" label="handle" />
      <node id="11993730" label="handle" />
      <node id="3372127" label="title" />
      <node id="4505861" label="url" />
      <node id="10554124" label="url" />
      <node id="74841" label="url" />
      <node id="10443091" label="handle" />
      <node id="1318104" label="handle" />
      <node id="6751902" label="url" />
      <node id="10751513" label="handle" />
      <node id="7468688" label="handle" />
      <node id="8463174" label="handle" />
      <node id="8638641" label="handle" />
      <node id="8858075" label="handle" />
      <node id="7078978" label="url" />
      <node id="1802180" label="handle" />
      <node id="11312615" label="handle" />
      <node id="1891333" label="handle" />
      <node id="4411283" label="url" />
      <node id="5894780" label="checksum" />
      <node id="5322894" label="metadata_url" />
      <node id="3822083" label="handle" />
      <node id="5926925" label="metadata_url" />
      <node id="10187103" label="handle" />
      <node id="5245782" label="metadata_url" />
      <node id="1677021" label="handle" />
      <node id="5974502" label="metadata_url" />
      <node id="9875656" label="url" />
      <node id="7365849" label="handle" />
      <node id="5145688" label="url" />
      <node id="376209" label="handle" />
      <node id="7861064" label="url" />
      <node id="11912200" label="url" />
      <node id="4169867" label="url" />
      <node id="1794149" label="handle" />
      <node id="1405968" label="handle" />
      <node id="6599803" label="checksum" />
      <node id="1431858" label="handle" />
      <node id="3719150" label="url" />
      <node id="7666160" label="url" />
      <node id="9762373" label="handle" />
      <node id="899524" label="handle" />
      <node id="3289348" label="title" />
      <node id="10216236" label="url" />
      <node id="11969239" label="handle" />
      <node id="9184431" label="handle" />
      <node id="1546207" label="handle" />
      <node id="10211058" label="handle" />
      <node id="7679403" label="url" />
      <node id="8188197" label="url" />
      <node id="7610661" label="handle" />
      <node id="10789721" label="url" />
    </nodes>
    <edges />
  </graph>
</gexf>
