<?xml version='1.0' encoding='utf-8'?>
<gexf version="1.2" xmlns="http://www.gexf.net/1.2draft" xmlns:xsi="http://www.w3.org/2001/XMLSchema-instance" xsi:schemaLocation="http://www.gexf.net/1.2draft http://www.gexf.net/1.2draft/gexf.xsd">
  <meta lastmodifieddate="2021-02-15">
    <creator>NetworkX 2.4</creator>
  </meta>
  <graph defaultedgetype="undirected" mode="static" name="">
    <nodes>
      <node id="7361424" label="url" />
      <node id="7361423" label="7361423" />
      <node id="6620800" label="6620800" />
      <node id="8748016" label="8748016" />
      <node id="8748017" label="8748017" />
      <node id="8503051" label="8503051" />
      <node id="7851090" label="7851090" />
      <node id="6930752" label="6930752" />
      <node id="7158852" label="7158852" />
      <node id="6780828" label="6780828" />
      <node id="6780829" label="6780829" />
      <node id="7212148" label="7212148" />
      <node id="6780626" label="6780626" />
      <node id="6780627" label="6780627" />
      <node id="7387877" label="7387877" />
      <node id="7387878" label="7387878" />
      <node id="6848022" label="6848022" />
      <node id="8819042" label="8819042" />
      <node id="8819043" label="8819043" />
      <node id="8025263" label="8025263" />
      <node id="7774340" label="7774340" />
      <node id="6964202" label="6964202" />
      <node id="6964203" label="6964203" />
      <node id="8085843" label="8085843" />
      <node id="8085844" label="8085844" />
      <node id="8169309" label="8169309" />
      <node id="8532929" label="8532929" />
      <node id="8532930" label="8532930" />
      <node id="6772744" label="6772744" />
      <node id="6772749" label="6772749" />
      <node id="9042185" label="9042185" />
      <node id="9042186" label="9042186" />
      <node id="6835839" label="6835839" />
      <node id="6835840" label="6835840" />
      <node id="6684605" label="6684605" />
      <node id="6684606" label="6684606" />
      <node id="7102420" label="7102420" />
      <node id="6716688" label="6716688" />
      <node id="9033847" label="9033847" />
      <node id="7108589" label="7108589" />
      <node id="7108670" label="7108670" />
      <node id="8851708" label="8851708" />
      <node id="7928301" label="7928301" />
      <node id="7280492" label="7280492" />
      <node id="8803106" label="8803106" />
      <node id="6701724" label="6701724" />
      <node id="6680762" label="6680762" />
      <node id="8353073" label="8353073" />
      <node id="8714710" label="8714710" />
      <node id="8714711" label="8714711" />
      <node id="7792252" label="7792252" />
      <node id="8096558" label="8096558" />
      <node id="7647566" label="7647566" />
      <node id="8215600" label="8215600" />
      <node id="8604264" label="8604264" />
      <node id="9007752" label="9007752" />
      <node id="6814473" label="6814473" />
      <node id="7804546" label="7804546" />
      <node id="8668917" label="8668917" />
      <node id="8668918" label="8668918" />
    </nodes>
    <edges>
      <edge id="0" source="7361424" target="7361423" />
      <edge id="1" source="7361423" target="6620800" />
      <edge id="2" source="6620800" target="8748016" />
      <edge id="3" source="6620800" target="8503051" />
      <edge id="4" source="6620800" target="7851090" />
      <edge id="5" source="6620800" target="6930752" />
      <edge id="6" source="6620800" target="7158852" />
      <edge id="7" source="6620800" target="6780828" />
      <edge id="8" source="6620800" target="7212148" />
      <edge id="9" source="6620800" target="6780626" />
      <edge id="10" source="6620800" target="7387877" />
      <edge id="11" source="6620800" target="6848022" />
      <edge id="12" source="6620800" target="8819042" />
      <edge id="13" source="6620800" target="8025263" />
      <edge id="14" source="6620800" target="7774340" />
      <edge id="15" source="6620800" target="6964202" />
      <edge id="16" source="6620800" target="8085843" />
      <edge id="17" source="6620800" target="8169309" />
      <edge id="18" source="6620800" target="8532929" />
      <edge id="19" source="6620800" target="6772744" />
      <edge id="20" source="6620800" target="9042185" />
      <edge id="21" source="6620800" target="6835839" />
      <edge id="22" source="6620800" target="6684605" />
      <edge id="23" source="6620800" target="7102420" />
      <edge id="24" source="6620800" target="6716688" />
      <edge id="25" source="6620800" target="9033847" />
      <edge id="26" source="6620800" target="7108589" />
      <edge id="27" source="6620800" target="8851708" />
      <edge id="28" source="6620800" target="7928301" />
      <edge id="29" source="6620800" target="7280492" />
      <edge id="30" source="6620800" target="8803106" />
      <edge id="31" source="6620800" target="6701724" />
      <edge id="32" source="6620800" target="6680762" />
      <edge id="33" source="6620800" target="8353073" />
      <edge id="34" source="6620800" target="8714710" />
      <edge id="35" source="6620800" target="7792252" />
      <edge id="36" source="6620800" target="8096558" />
      <edge id="37" source="6620800" target="7647566" />
      <edge id="38" source="6620800" target="8215600" />
      <edge id="39" source="6620800" target="8604264" />
      <edge id="40" source="6620800" target="9007752" />
      <edge id="41" source="6620800" target="6814473" />
      <edge id="42" source="6620800" target="7804546" />
      <edge id="43" source="6620800" target="8668917" />
      <edge id="44" source="8748016" target="8748017" />
      <edge id="45" source="6780828" target="6780829" />
      <edge id="46" source="6780626" target="6780627" />
      <edge id="47" source="7387877" target="7387878" />
      <edge id="48" source="8819042" target="8819043" />
      <edge id="49" source="6964202" target="6964203" />
      <edge id="50" source="8085843" target="8085844" />
      <edge id="51" source="8532929" target="8532930" />
      <edge id="52" source="6772744" target="6772749" />
      <edge id="53" source="9042185" target="9042186" />
      <edge id="54" source="6835839" target="6835840" />
      <edge id="55" source="6684605" target="6684606" />
      <edge id="56" source="7108589" target="7108670" />
      <edge id="57" source="8714710" target="8714711" />
      <edge id="58" source="8668917" target="8668918" />
    </edges>
  </graph>
</gexf>
