<?xml version='1.0' encoding='utf-8'?>
<gexf version="1.2" xmlns="http://www.gexf.net/1.2draft" xmlns:xsi="http://www.w3.org/2001/XMLSchema-instance" xsi:schemaLocation="http://www.gexf.net/1.2draft http://www.gexf.net/1.2draft/gexf.xsd">
  <meta lastmodifieddate="2021-02-15">
    <creator>NetworkX 2.4</creator>
  </meta>
  <graph defaultedgetype="undirected" mode="static" name="">
    <nodes>
      <node id="7792329" label="handle" />
      <node id="660374" label="handle" />
      <node id="10201070" label="url" />
      <node id="9281416" label="url" />
      <node id="7008241" label="handle" />
      <node id="620165" label="handle" />
      <node id="4013147" label="title" />
      <node id="6471477" label="filesize" />
      <node id="12058042" label="handle" />
      <node id="10516575" label="handle" />
      <node id="10848824" label="url" />
      <node id="10172242" label="url" />
      <node id="6798936" label="url" />
      <node id="6013689" label="url" />
      <node id="7772600" label="handle" />
      <node id="6596929" label="metadata_url" />
      <node id="6146388" label="checksum" />
      <node id="11698755" label="url" />
      <node id="7501824" label="handle" />
      <node id="12028867" label="handle" />
      <node id="7519481" label="handle" />
      <node id="9509482" label="url" />
      <node id="10937712" label="handle" />
      <node id="10355003" label="handle" />
      <node id="4119007" label="title" />
      <node id="573825" label="handle" />
      <node id="2608997" label="url" />
      <node id="7162768" label="handle" />
      <node id="4150415" label="title" />
      <node id="5219238" label="metadata_url" />
      <node id="2081665" label="handle" />
      <node id="7136728" label="url" />
      <node id="3254099" label="title" />
      <node id="6450507" label="url" />
      <node id="2025796" label="handle" />
      <node id="9391614" label="url" />
      <node id="2998567" label="handle" />
      <node id="1181027" label="handle" />
      <node id="4479866" label="handle" />
      <node id="4969502" label="filesize" />
      <node id="8302905" label="handle" />
      <node id="1579154" label="handle" />
      <node id="5282791" label="url" />
      <node id="8521479" label="url" />
      <node id="2109627" label="handle" />
      <node id="1495902" label="handle" />
      <node id="5103094" label="url" />
      <node id="5748217" label="checksum" />
      <node id="4447412" label="handle" />
      <node id="8057472" label="url" />
      <node id="332709" label="handle" />
      <node id="11586943" label="url" />
      <node id="8481316" label="url" />
      <node id="9223308" label="url" />
      <node id="5680725" label="metadata_url" />
      <node id="946177" label="handle" />
      <node id="6401429" label="checksum" />
      <node id="6050744" label="url" />
      <node id="8281021" label="url" />
      <node id="10846666" label="url" />
    </nodes>
    <edges />
  </graph>
</gexf>
