<?xml version='1.0' encoding='utf-8'?>
<gexf version="1.2" xmlns="http://www.gexf.net/1.2draft" xmlns:xsi="http://www.w3.org/2001/XMLSchema-instance" xsi:schemaLocation="http://www.gexf.net/1.2draft http://www.gexf.net/1.2draft/gexf.xsd">
  <meta lastmodifieddate="2021-02-15">
    <creator>NetworkX 2.4</creator>
  </meta>
  <graph defaultedgetype="undirected" mode="static" name="">
    <nodes>
      <node id="1316476" label="handle" />
      <node id="8825640" label="handle" />
      <node id="11341363" label="handle" />
      <node id="8564407" label="handle" />
      <node id="8782925" label="url" />
      <node id="10620937" label="handle" />
      <node id="5896637" label="metadata_url" />
      <node id="9753005" label="handle" />
      <node id="11328412" label="handle" />
      <node id="2398791" label="handle" />
      <node id="2988331" label="url" />
      <node id="7258408" label="url" />
      <node id="446313" label="handle" />
      <node id="9307473" label="url" />
      <node id="11483424" label="title" />
      <node id="6230611" label="checksum" />
      <node id="3200727" label="handle" />
      <node id="2674671" label="handle" />
      <node id="5265663" label="metadata_url" />
      <node id="2867811" label="title" />
      <node id="11982539" label="handle" />
      <node id="10950188" label="url" />
      <node id="7040934" label="url" />
      <node id="8631331" label="url" />
      <node id="6156029" label="checksum" />
      <node id="9787009" label="url" />
      <node id="7836150" label="url" />
      <node id="1494440" label="handle" />
      <node id="11953088" label="handle" />
      <node id="11532108" label="handle" />
      <node id="8638151" label="handle" />
      <node id="3612778" label="title" />
      <node id="8047040" label="handle" />
      <node id="6636237" label="url" />
      <node id="6889489" label="handle" />
      <node id="11330054" label="url" />
      <node id="6663413" label="url" />
      <node id="9669965" label="handle" />
      <node id="5745197" label="url" />
      <node id="8162176" label="url" />
      <node id="11267073" label="url" />
      <node id="10626868" label="handle" />
      <node id="3030443" label="url" />
      <node id="531486" label="handle" />
      <node id="7438986" label="handle" />
      <node id="3513209" label="handle" />
      <node id="3713631" label="title" />
      <node id="3580371" label="url" />
      <node id="3867785" label="title" />
      <node id="11995221" label="handle" />
      <node id="11636908" label="handle" />
      <node id="1125552" label="handle" />
      <node id="6719901" label="url" />
      <node id="9295823" label="handle" />
      <node id="5271202" label="filesize" />
      <node id="795340" label="handle" />
      <node id="11742274" label="handle" />
      <node id="7291096" label="handle" />
      <node id="1124683" label="handle" />
      <node id="7838868" label="url" />
    </nodes>
    <edges />
  </graph>
</gexf>
