<?xml version='1.0' encoding='utf-8'?>
<gexf version="1.2" xmlns="http://www.gexf.net/1.2draft" xmlns:xsi="http://www.w3.org/2001/XMLSchema-instance" xsi:schemaLocation="http://www.gexf.net/1.2draft http://www.gexf.net/1.2draft/gexf.xsd">
  <meta lastmodifieddate="2021-02-15">
    <creator>NetworkX 2.4</creator>
  </meta>
  <graph defaultedgetype="undirected" mode="static" name="">
    <nodes>
      <node id="2239061" label="handle" />
      <node id="498639" label="498639" />
      <node id="2234891" label="2234891" />
      <node id="6301396" label="6301396" />
      <node id="6301394" label="6301394" />
      <node id="2234890" label="2234890" />
      <node id="6301395" label="6301395" />
      <node id="261398" label="261398" />
      <node id="2422242" label="2422242" />
      <node id="567918" label="567918" />
      <node id="2418662" label="2418662" />
      <node id="2414937" label="2414937" />
      <node id="2239833" label="2239833" />
      <node id="1899189" label="1899189" />
      <node id="5850606" label="5850606" />
      <node id="5850607" label="5850607" />
      <node id="2240580" label="2240580" />
      <node id="2240579" label="2240579" />
      <node id="6309530" label="6309530" />
      <node id="6307617" label="6307617" />
      <node id="2236328" label="2236328" />
      <node id="2017740" label="2017740" />
      <node id="5475021" label="5475021" />
      <node id="499504" label="499504" />
      <node id="2237100" label="2237100" />
      <node id="2237099" label="2237099" />
      <node id="1978532" label="1978532" />
      <node id="17202" label="17202" />
      <node id="1481880" label="1481880" />
      <node id="5509615" label="5509615" />
      <node id="2171814" label="2171814" />
      <node id="2171813" label="2171813" />
      <node id="4866022" label="4866022" />
      <node id="1034721" label="1034721" />
      <node id="15060" label="15060" />
      <node id="3779160" label="3779160" />
      <node id="4281794" label="4281794" />
      <node id="4278124" label="4278124" />
      <node id="4298374" label="4298374" />
      <node id="2449048" label="2449048" />
      <node id="3742728" label="3742728" />
      <node id="3742729" label="3742729" />
      <node id="6307616" label="6307616" />
      <node id="4866021" label="4866021" />
      <node id="2201157" label="2201157" />
      <node id="2211549" label="2211549" />
      <node id="484819" label="484819" />
      <node id="2214012" label="2214012" />
      <node id="5055972" label="5055972" />
      <node id="1146491" label="1146491" />
      <node id="1146490" label="1146490" />
      <node id="5055971" label="5055971" />
      <node id="5055970" label="5055970" />
      <node id="2236949" label="2236949" />
      <node id="6303849" label="6303849" />
      <node id="6304164" label="6304164" />
      <node id="2236948" label="2236948" />
      <node id="2239060" label="2239060" />
      <node id="2414683" label="2414683" />
      <node id="6561863" label="6561863" />
    </nodes>
    <edges>
      <edge id="0" source="2239061" target="498639" />
      <edge id="1" source="2239061" target="6307617" />
      <edge id="2" source="2239061" target="4866022" />
      <edge id="3" source="2239061" target="6307616" />
      <edge id="4" source="2239061" target="4866021" />
      <edge id="5" source="2239061" target="261398" />
      <edge id="6" source="2239061" target="2239060" />
      <edge id="7" source="498639" target="2234891" />
      <edge id="8" source="498639" target="2239833" />
      <edge id="9" source="498639" target="2240580" />
      <edge id="10" source="498639" target="2236328" />
      <edge id="11" source="498639" target="499504" />
      <edge id="12" source="498639" target="2237100" />
      <edge id="13" source="498639" target="2236949" />
      <edge id="14" source="2234891" target="6301396" />
      <edge id="15" source="2234891" target="6301394" />
      <edge id="16" source="2234891" target="2234890" />
      <edge id="17" source="2234891" target="6301395" />
      <edge id="18" source="2234891" target="261398" />
      <edge id="19" source="261398" target="2422242" />
      <edge id="20" source="261398" target="2239833" />
      <edge id="21" source="261398" target="1899189" />
      <edge id="22" source="261398" target="2236328" />
      <edge id="23" source="261398" target="2017740" />
      <edge id="24" source="261398" target="2237100" />
      <edge id="25" source="261398" target="1978532" />
      <edge id="26" source="261398" target="2201157" />
      <edge id="27" source="261398" target="2211549" />
      <edge id="28" source="261398" target="2414683" />
      <edge id="29" source="2422242" target="567918" />
      <edge id="30" source="567918" target="2418662" />
      <edge id="31" source="567918" target="2414937" />
      <edge id="32" source="1899189" target="5850606" />
      <edge id="33" source="1899189" target="5850607" />
      <edge id="34" source="2240580" target="2240579" />
      <edge id="35" source="2240580" target="6309530" />
      <edge id="36" source="2017740" target="5475021" />
      <edge id="37" source="2237100" target="2237099" />
      <edge id="38" source="1978532" target="17202" />
      <edge id="39" source="17202" target="1481880" />
      <edge id="40" source="17202" target="2171814" />
      <edge id="41" source="1481880" target="5509615" />
      <edge id="42" source="2171814" target="2171813" />
      <edge id="43" source="4866022" target="1034721" />
      <edge id="44" source="1034721" target="15060" />
      <edge id="45" source="1034721" target="4866021" />
      <edge id="46" source="15060" target="3779160" />
      <edge id="47" source="15060" target="4281794" />
      <edge id="48" source="15060" target="3742728" />
      <edge id="49" source="4281794" target="4278124" />
      <edge id="50" source="4278124" target="4298374" />
      <edge id="51" source="4298374" target="2449048" />
      <edge id="52" source="2449048" target="3742728" />
      <edge id="53" source="3742728" target="3742729" />
      <edge id="54" source="2211549" target="484819" />
      <edge id="55" source="484819" target="2214012" />
      <edge id="56" source="2214012" target="5055972" />
      <edge id="57" source="5055972" target="1146491" />
      <edge id="58" source="1146491" target="1146490" />
      <edge id="59" source="1146491" target="5055971" />
      <edge id="60" source="1146491" target="5055970" />
      <edge id="61" source="2236949" target="6303849" />
      <edge id="62" source="2236949" target="6304164" />
      <edge id="63" source="2236949" target="2236948" />
      <edge id="64" source="2414683" target="6561863" />
    </edges>
  </graph>
</gexf>
