<?xml version='1.0' encoding='utf-8'?>
<gexf xmlns:viz="http://www.gexf.net/1.2draft/viz" version="1.2" xmlns="http://www.gexf.net/1.2draft" xmlns:xsi="http://www.w3.org/2001/XMLSchema-instance" xsi:schemaLocation="http://www.gexf.net/1.2draft http://www.gexf.net/1.2draft/gexf.xsd">
  <meta lastmodifieddate="2021-02-14">
    <creator>NetworkX 2.4</creator>
  </meta>
  <graph defaultedgetype="undirected" mode="static" name="">
    <attributes class="node" mode="static">
      <attribute id="0" title="neo_label" type="string" />
    </attributes>
    <nodes>
      <node id="6748553" label="">
        <viz:color a="1" b="40" g="39" r="235" />
        <attvalues>
          <attvalue for="0" value="handle" />
        </attvalues>
      </node>
      <node id="6691972" label="">
        <viz:color a="1" b="101" g="182" r="93" />
        <attvalues>
          <attvalue for="0" value="url" />
        </attvalues>
      </node>
      <node id="6691971" label="">
        <viz:color a="1" b="40" g="39" r="235" />
        <attvalues>
          <attvalue for="0" value="handle" />
        </attvalues>
      </node>
      <node id="6620800" label="creator001M">
        <viz:color a="1" b="182" g="223" r="242" />
        <attvalues>
          <attvalue for="0" value="creator" />
        </attvalues>
      </node>
      <node id="6718818" label="">
        <viz:color a="1" b="40" g="39" r="235" />
        <attvalues>
          <attvalue for="0" value="handle" />
        </attvalues>
      </node>
      <node id="6815967" label="">
        <viz:color a="1" b="40" g="39" r="235" />
        <attvalues>
          <attvalue for="0" value="handle" />
        </attvalues>
      </node>
      <node id="6707955" label="">
        <viz:color a="1" b="40" g="39" r="235" />
        <attvalues>
          <attvalue for="0" value="handle" />
        </attvalues>
      </node>
      <node id="6707956" label="">
        <viz:color a="1" b="101" g="182" r="93" />
        <attvalues>
          <attvalue for="0" value="url" />
        </attvalues>
      </node>
      <node id="6757864" label="">
        <viz:color a="1" b="40" g="39" r="235" />
        <attvalues>
          <attvalue for="0" value="handle" />
        </attvalues>
      </node>
      <node id="7887281" label="">
        <viz:color a="1" b="40" g="39" r="235" />
        <attvalues>
          <attvalue for="0" value="handle" />
        </attvalues>
      </node>
      <node id="6963076" label="">
        <viz:color a="1" b="40" g="39" r="235" />
        <attvalues>
          <attvalue for="0" value="handle" />
        </attvalues>
      </node>
      <node id="8222566" label="">
        <viz:color a="1" b="40" g="39" r="235" />
        <attvalues>
          <attvalue for="0" value="handle" />
        </attvalues>
      </node>
      <node id="7818211" label="">
        <viz:color a="1" b="40" g="39" r="235" />
        <attvalues>
          <attvalue for="0" value="handle" />
        </attvalues>
      </node>
      <node id="7818212" label="">
        <viz:color a="1" b="101" g="182" r="93" />
        <attvalues>
          <attvalue for="0" value="url" />
        </attvalues>
      </node>
      <node id="8101889" label="">
        <viz:color a="1" b="40" g="39" r="235" />
        <attvalues>
          <attvalue for="0" value="handle" />
        </attvalues>
      </node>
      <node id="8492225" label="">
        <viz:color a="1" b="40" g="39" r="235" />
        <attvalues>
          <attvalue for="0" value="handle" />
        </attvalues>
      </node>
      <node id="8492226" label="">
        <viz:color a="1" b="101" g="182" r="93" />
        <attvalues>
          <attvalue for="0" value="url" />
        </attvalues>
      </node>
      <node id="8128403" label="">
        <viz:color a="1" b="40" g="39" r="235" />
        <attvalues>
          <attvalue for="0" value="handle" />
        </attvalues>
      </node>
      <node id="7005961" label="">
        <viz:color a="1" b="40" g="39" r="235" />
        <attvalues>
          <attvalue for="0" value="handle" />
        </attvalues>
      </node>
      <node id="7005857" label="">
        <viz:color a="1" b="101" g="182" r="93" />
        <attvalues>
          <attvalue for="0" value="url" />
        </attvalues>
      </node>
      <node id="6823043" label="">
        <viz:color a="1" b="40" g="39" r="235" />
        <attvalues>
          <attvalue for="0" value="handle" />
        </attvalues>
      </node>
      <node id="6823044" label="">
        <viz:color a="1" b="101" g="182" r="93" />
        <attvalues>
          <attvalue for="0" value="url" />
        </attvalues>
      </node>
      <node id="7856215" label="">
        <viz:color a="1" b="40" g="39" r="235" />
        <attvalues>
          <attvalue for="0" value="handle" />
        </attvalues>
      </node>
      <node id="7222188" label="">
        <viz:color a="1" b="40" g="39" r="235" />
        <attvalues>
          <attvalue for="0" value="handle" />
        </attvalues>
      </node>
      <node id="8994156" label="">
        <viz:color a="1" b="40" g="39" r="235" />
        <attvalues>
          <attvalue for="0" value="handle" />
        </attvalues>
      </node>
      <node id="8994157" label="">
        <viz:color a="1" b="101" g="182" r="93" />
        <attvalues>
          <attvalue for="0" value="url" />
        </attvalues>
      </node>
      <node id="7812226" label="">
        <viz:color a="1" b="40" g="39" r="235" />
        <attvalues>
          <attvalue for="0" value="handle" />
        </attvalues>
      </node>
      <node id="7066576" label="">
        <viz:color a="1" b="40" g="39" r="235" />
        <attvalues>
          <attvalue for="0" value="handle" />
        </attvalues>
      </node>
      <node id="7066577" label="">
        <viz:color a="1" b="101" g="182" r="93" />
        <attvalues>
          <attvalue for="0" value="url" />
        </attvalues>
      </node>
      <node id="8018372" label="">
        <viz:color a="1" b="40" g="39" r="235" />
        <attvalues>
          <attvalue for="0" value="handle" />
        </attvalues>
      </node>
      <node id="8018373" label="">
        <viz:color a="1" b="101" g="182" r="93" />
        <attvalues>
          <attvalue for="0" value="url" />
        </attvalues>
      </node>
      <node id="6930012" label="">
        <viz:color a="1" b="40" g="39" r="235" />
        <attvalues>
          <attvalue for="0" value="handle" />
        </attvalues>
      </node>
      <node id="6930013" label="">
        <viz:color a="1" b="101" g="182" r="93" />
        <attvalues>
          <attvalue for="0" value="url" />
        </attvalues>
      </node>
      <node id="6813769" label="">
        <viz:color a="1" b="40" g="39" r="235" />
        <attvalues>
          <attvalue for="0" value="handle" />
        </attvalues>
      </node>
      <node id="7606341" label="">
        <viz:color a="1" b="40" g="39" r="235" />
        <attvalues>
          <attvalue for="0" value="handle" />
        </attvalues>
      </node>
      <node id="7606342" label="">
        <viz:color a="1" b="101" g="182" r="93" />
        <attvalues>
          <attvalue for="0" value="url" />
        </attvalues>
      </node>
      <node id="8632468" label="">
        <viz:color a="1" b="40" g="39" r="235" />
        <attvalues>
          <attvalue for="0" value="handle" />
        </attvalues>
      </node>
      <node id="8632469" label="">
        <viz:color a="1" b="101" g="182" r="93" />
        <attvalues>
          <attvalue for="0" value="url" />
        </attvalues>
      </node>
      <node id="8832142" label="">
        <viz:color a="1" b="40" g="39" r="235" />
        <attvalues>
          <attvalue for="0" value="handle" />
        </attvalues>
      </node>
      <node id="8026463" label="">
        <viz:color a="1" b="40" g="39" r="235" />
        <attvalues>
          <attvalue for="0" value="handle" />
        </attvalues>
      </node>
      <node id="7700599" label="">
        <viz:color a="1" b="40" g="39" r="235" />
        <attvalues>
          <attvalue for="0" value="handle" />
        </attvalues>
      </node>
      <node id="6840215" label="">
        <viz:color a="1" b="40" g="39" r="235" />
        <attvalues>
          <attvalue for="0" value="handle" />
        </attvalues>
      </node>
      <node id="7374196" label="">
        <viz:color a="1" b="40" g="39" r="235" />
        <attvalues>
          <attvalue for="0" value="handle" />
        </attvalues>
      </node>
      <node id="7648712" label="">
        <viz:color a="1" b="40" g="39" r="235" />
        <attvalues>
          <attvalue for="0" value="handle" />
        </attvalues>
      </node>
      <node id="8797540" label="">
        <viz:color a="1" b="40" g="39" r="235" />
        <attvalues>
          <attvalue for="0" value="handle" />
        </attvalues>
      </node>
      <node id="8797541" label="">
        <viz:color a="1" b="101" g="182" r="93" />
        <attvalues>
          <attvalue for="0" value="url" />
        </attvalues>
      </node>
      <node id="7093875" label="">
        <viz:color a="1" b="40" g="39" r="235" />
        <attvalues>
          <attvalue for="0" value="handle" />
        </attvalues>
      </node>
      <node id="6736147" label="">
        <viz:color a="1" b="40" g="39" r="235" />
        <attvalues>
          <attvalue for="0" value="handle" />
        </attvalues>
      </node>
      <node id="6818622" label="">
        <viz:color a="1" b="40" g="39" r="235" />
        <attvalues>
          <attvalue for="0" value="handle" />
        </attvalues>
      </node>
      <node id="7811279" label="">
        <viz:color a="1" b="40" g="39" r="235" />
        <attvalues>
          <attvalue for="0" value="handle" />
        </attvalues>
      </node>
      <node id="8073954" label="">
        <viz:color a="1" b="40" g="39" r="235" />
        <attvalues>
          <attvalue for="0" value="handle" />
        </attvalues>
      </node>
      <node id="8902830" label="">
        <viz:color a="1" b="40" g="39" r="235" />
        <attvalues>
          <attvalue for="0" value="handle" />
        </attvalues>
      </node>
      <node id="8033172" label="">
        <viz:color a="1" b="40" g="39" r="235" />
        <attvalues>
          <attvalue for="0" value="handle" />
        </attvalues>
      </node>
      <node id="7478917" label="">
        <viz:color a="1" b="40" g="39" r="235" />
        <attvalues>
          <attvalue for="0" value="handle" />
        </attvalues>
      </node>
      <node id="9089214" label="">
        <viz:color a="1" b="40" g="39" r="235" />
        <attvalues>
          <attvalue for="0" value="handle" />
        </attvalues>
      </node>
      <node id="7604672" label="">
        <viz:color a="1" b="40" g="39" r="235" />
        <attvalues>
          <attvalue for="0" value="handle" />
        </attvalues>
      </node>
      <node id="7604673" label="">
        <viz:color a="1" b="101" g="182" r="93" />
        <attvalues>
          <attvalue for="0" value="url" />
        </attvalues>
      </node>
      <node id="7793258" label="">
        <viz:color a="1" b="40" g="39" r="235" />
        <attvalues>
          <attvalue for="0" value="handle" />
        </attvalues>
      </node>
      <node id="7793259" label="">
        <viz:color a="1" b="101" g="182" r="93" />
        <attvalues>
          <attvalue for="0" value="url" />
        </attvalues>
      </node>
      <node id="8216668" label="">
        <viz:color a="1" b="40" g="39" r="235" />
        <attvalues>
          <attvalue for="0" value="handle" />
        </attvalues>
      </node>
      <node id="7748832" label="">
        <viz:color a="1" b="40" g="39" r="235" />
        <attvalues>
          <attvalue for="0" value="handle" />
        </attvalues>
      </node>
      <node id="7066073" label="">
        <viz:color a="1" b="40" g="39" r="235" />
        <attvalues>
          <attvalue for="0" value="handle" />
        </attvalues>
      </node>
      <node id="7066074" label="">
        <viz:color a="1" b="101" g="182" r="93" />
        <attvalues>
          <attvalue for="0" value="url" />
        </attvalues>
      </node>
      <node id="7066025" label="">
        <viz:color a="1" b="40" g="39" r="235" />
        <attvalues>
          <attvalue for="0" value="handle" />
        </attvalues>
      </node>
      <node id="7066026" label="">
        <viz:color a="1" b="101" g="182" r="93" />
        <attvalues>
          <attvalue for="0" value="url" />
        </attvalues>
      </node>
      <node id="7960079" label="">
        <viz:color a="1" b="40" g="39" r="235" />
        <attvalues>
          <attvalue for="0" value="handle" />
        </attvalues>
      </node>
      <node id="7960080" label="">
        <viz:color a="1" b="101" g="182" r="93" />
        <attvalues>
          <attvalue for="0" value="url" />
        </attvalues>
      </node>
      <node id="6835719" label="">
        <viz:color a="1" b="40" g="39" r="235" />
        <attvalues>
          <attvalue for="0" value="handle" />
        </attvalues>
      </node>
      <node id="7807793" label="">
        <viz:color a="1" b="40" g="39" r="235" />
        <attvalues>
          <attvalue for="0" value="handle" />
        </attvalues>
      </node>
      <node id="7807794" label="">
        <viz:color a="1" b="101" g="182" r="93" />
        <attvalues>
          <attvalue for="0" value="url" />
        </attvalues>
      </node>
      <node id="9159844" label="">
        <viz:color a="1" b="40" g="39" r="235" />
        <attvalues>
          <attvalue for="0" value="handle" />
        </attvalues>
      </node>
      <node id="9159845" label="">
        <viz:color a="1" b="101" g="182" r="93" />
        <attvalues>
          <attvalue for="0" value="url" />
        </attvalues>
      </node>
      <node id="6640390" label="">
        <viz:color a="1" b="40" g="39" r="235" />
        <attvalues>
          <attvalue for="0" value="handle" />
        </attvalues>
      </node>
      <node id="6640391" label="">
        <viz:color a="1" b="101" g="182" r="93" />
        <attvalues>
          <attvalue for="0" value="url" />
        </attvalues>
      </node>
      <node id="8858077" label="">
        <viz:color a="1" b="40" g="39" r="235" />
        <attvalues>
          <attvalue for="0" value="handle" />
        </attvalues>
      </node>
      <node id="7923598" label="">
        <viz:color a="1" b="40" g="39" r="235" />
        <attvalues>
          <attvalue for="0" value="handle" />
        </attvalues>
      </node>
      <node id="7616207" label="">
        <viz:color a="1" b="40" g="39" r="235" />
        <attvalues>
          <attvalue for="0" value="handle" />
        </attvalues>
      </node>
      <node id="7616208" label="">
        <viz:color a="1" b="101" g="182" r="93" />
        <attvalues>
          <attvalue for="0" value="url" />
        </attvalues>
      </node>
      <node id="7403379" label="">
        <viz:color a="1" b="40" g="39" r="235" />
        <attvalues>
          <attvalue for="0" value="handle" />
        </attvalues>
      </node>
      <node id="7403380" label="">
        <viz:color a="1" b="101" g="182" r="93" />
        <attvalues>
          <attvalue for="0" value="url" />
        </attvalues>
      </node>
      <node id="8887271" label="">
        <viz:color a="1" b="40" g="39" r="235" />
        <attvalues>
          <attvalue for="0" value="handle" />
        </attvalues>
      </node>
      <node id="7246151" label="">
        <viz:color a="1" b="40" g="39" r="235" />
        <attvalues>
          <attvalue for="0" value="handle" />
        </attvalues>
      </node>
      <node id="7246152" label="">
        <viz:color a="1" b="101" g="182" r="93" />
        <attvalues>
          <attvalue for="0" value="url" />
        </attvalues>
      </node>
      <node id="7068258" label="">
        <viz:color a="1" b="40" g="39" r="235" />
        <attvalues>
          <attvalue for="0" value="handle" />
        </attvalues>
      </node>
      <node id="7068259" label="">
        <viz:color a="1" b="101" g="182" r="93" />
        <attvalues>
          <attvalue for="0" value="url" />
        </attvalues>
      </node>
      <node id="7356964" label="">
        <viz:color a="1" b="40" g="39" r="235" />
        <attvalues>
          <attvalue for="0" value="handle" />
        </attvalues>
      </node>
      <node id="7356965" label="">
        <viz:color a="1" b="101" g="182" r="93" />
        <attvalues>
          <attvalue for="0" value="url" />
        </attvalues>
      </node>
      <node id="6726814" label="">
        <viz:color a="1" b="40" g="39" r="235" />
        <attvalues>
          <attvalue for="0" value="handle" />
        </attvalues>
      </node>
      <node id="8425288" label="">
        <viz:color a="1" b="40" g="39" r="235" />
        <attvalues>
          <attvalue for="0" value="handle" />
        </attvalues>
      </node>
      <node id="8425289" label="">
        <viz:color a="1" b="101" g="182" r="93" />
        <attvalues>
          <attvalue for="0" value="url" />
        </attvalues>
      </node>
      <node id="8831676" label="">
        <viz:color a="1" b="40" g="39" r="235" />
        <attvalues>
          <attvalue for="0" value="handle" />
        </attvalues>
      </node>
      <node id="7444141" label="">
        <viz:color a="1" b="40" g="39" r="235" />
        <attvalues>
          <attvalue for="0" value="handle" />
        </attvalues>
      </node>
      <node id="6878907" label="">
        <viz:color a="1" b="101" g="182" r="93" />
        <attvalues>
          <attvalue for="0" value="url" />
        </attvalues>
      </node>
      <node id="7426977" label="">
        <viz:color a="1" b="40" g="39" r="235" />
        <attvalues>
          <attvalue for="0" value="handle" />
        </attvalues>
      </node>
      <node id="7354944" label="">
        <viz:color a="1" b="40" g="39" r="235" />
        <attvalues>
          <attvalue for="0" value="handle" />
        </attvalues>
      </node>
      <node id="7354945" label="">
        <viz:color a="1" b="101" g="182" r="93" />
        <attvalues>
          <attvalue for="0" value="url" />
        </attvalues>
      </node>
      <node id="8293100" label="">
        <viz:color a="1" b="40" g="39" r="235" />
        <attvalues>
          <attvalue for="0" value="handle" />
        </attvalues>
      </node>
      <node id="8798316" label="">
        <viz:color a="1" b="40" g="39" r="235" />
        <attvalues>
          <attvalue for="0" value="handle" />
        </attvalues>
      </node>
      <node id="8582629" label="">
        <viz:color a="1" b="40" g="39" r="235" />
        <attvalues>
          <attvalue for="0" value="handle" />
        </attvalues>
      </node>
      <node id="7535251" label="">
        <viz:color a="1" b="40" g="39" r="235" />
        <attvalues>
          <attvalue for="0" value="handle" />
        </attvalues>
      </node>
    </nodes>
    <edges>
      <edge id="0" source="6748553" target="6691972" />
      <edge id="1" source="6748553" target="6620800" />
      <edge id="2" source="6691972" target="6691971" />
      <edge id="3" source="6691971" target="6620800" />
      <edge id="4" source="6620800" target="6718818" />
      <edge id="5" source="6620800" target="6815967" />
      <edge id="6" source="6620800" target="6707955" />
      <edge id="7" source="6620800" target="7887281" />
      <edge id="8" source="6620800" target="6963076" />
      <edge id="9" source="6620800" target="8222566" />
      <edge id="10" source="6620800" target="7818211" />
      <edge id="11" source="6620800" target="8101889" />
      <edge id="12" source="6620800" target="8492225" />
      <edge id="13" source="6620800" target="8128403" />
      <edge id="14" source="6620800" target="7005961" />
      <edge id="15" source="6620800" target="6823043" />
      <edge id="16" source="6620800" target="7856215" />
      <edge id="17" source="6620800" target="7222188" />
      <edge id="18" source="6620800" target="8994156" />
      <edge id="19" source="6620800" target="7812226" />
      <edge id="20" source="6620800" target="7066576" />
      <edge id="21" source="6620800" target="8018372" />
      <edge id="22" source="6620800" target="6930012" />
      <edge id="23" source="6620800" target="6813769" />
      <edge id="24" source="6620800" target="7606341" />
      <edge id="25" source="6620800" target="8632468" />
      <edge id="26" source="6620800" target="8832142" />
      <edge id="27" source="6620800" target="8026463" />
      <edge id="28" source="6620800" target="7700599" />
      <edge id="29" source="6620800" target="6840215" />
      <edge id="30" source="6620800" target="7374196" />
      <edge id="31" source="6620800" target="7648712" />
      <edge id="32" source="6620800" target="8797540" />
      <edge id="33" source="6620800" target="7093875" />
      <edge id="34" source="6620800" target="6736147" />
      <edge id="35" source="6620800" target="6818622" />
      <edge id="36" source="6620800" target="7811279" />
      <edge id="37" source="6620800" target="8073954" />
      <edge id="38" source="6620800" target="8902830" />
      <edge id="39" source="6620800" target="8033172" />
      <edge id="40" source="6620800" target="7478917" />
      <edge id="41" source="6620800" target="9089214" />
      <edge id="42" source="6620800" target="7604672" />
      <edge id="43" source="6620800" target="7793258" />
      <edge id="44" source="6620800" target="8216668" />
      <edge id="45" source="6620800" target="7748832" />
      <edge id="46" source="6620800" target="7066073" />
      <edge id="47" source="6620800" target="7066025" />
      <edge id="48" source="6620800" target="7960079" />
      <edge id="49" source="6620800" target="6835719" />
      <edge id="50" source="6620800" target="7807793" />
      <edge id="51" source="6620800" target="9159844" />
      <edge id="52" source="6620800" target="6640390" />
      <edge id="53" source="6620800" target="8858077" />
      <edge id="54" source="6620800" target="7923598" />
      <edge id="55" source="6620800" target="7616207" />
      <edge id="56" source="6620800" target="7403379" />
      <edge id="57" source="6620800" target="8887271" />
      <edge id="58" source="6620800" target="7246151" />
      <edge id="59" source="6620800" target="7068258" />
      <edge id="60" source="6620800" target="7356964" />
      <edge id="61" source="6620800" target="6726814" />
      <edge id="62" source="6620800" target="8425288" />
      <edge id="63" source="6620800" target="8831676" />
      <edge id="64" source="6620800" target="7444141" />
      <edge id="65" source="6620800" target="7354944" />
      <edge id="66" source="6620800" target="8293100" />
      <edge id="67" source="6620800" target="8798316" />
      <edge id="68" source="6620800" target="8582629" />
      <edge id="69" source="6620800" target="7535251" />
      <edge id="70" source="6707955" target="6707956" />
      <edge id="71" source="6707956" target="6757864" />
      <edge id="72" source="7818211" target="7818212" />
      <edge id="73" source="8492225" target="8492226" />
      <edge id="74" source="7005961" target="7005857" />
      <edge id="75" source="6823043" target="6823044" />
      <edge id="76" source="8994156" target="8994157" />
      <edge id="77" source="7066576" target="7066577" />
      <edge id="78" source="8018372" target="8018373" />
      <edge id="79" source="6930012" target="6930013" />
      <edge id="80" source="7606341" target="7606342" />
      <edge id="81" source="8632468" target="8632469" />
      <edge id="82" source="8797540" target="8797541" />
      <edge id="83" source="7604672" target="7604673" />
      <edge id="84" source="7793258" target="7793259" />
      <edge id="85" source="7066073" target="7066074" />
      <edge id="86" source="7066025" target="7066026" />
      <edge id="87" source="7960079" target="7960080" />
      <edge id="88" source="7807793" target="7807794" />
      <edge id="89" source="9159844" target="9159845" />
      <edge id="90" source="6640390" target="6640391" />
      <edge id="91" source="7616207" target="7616208" />
      <edge id="92" source="7403379" target="7403380" />
      <edge id="93" source="7246151" target="7246152" />
      <edge id="94" source="7068258" target="7068259" />
      <edge id="95" source="7356964" target="7356965" />
      <edge id="96" source="8425288" target="8425289" />
      <edge id="97" source="7444141" target="6878907" />
      <edge id="98" source="6878907" target="7426977" />
      <edge id="99" source="7354944" target="7354945" />
    </edges>
  </graph>
</gexf>
