\begin{thebibliography}{JS17}

% this bibliography is generated by alphadin.bst [8.2] from 2005-12-21

\providecommand{\url}[1]{\texttt{#1}}
\expandafter\ifx\csname urlstyle\endcsname\relax
  \providecommand{\doi}[1]{doi: #1}\else
  \providecommand{\doi}{doi: \begingroup \urlstyle{rm}\Url}\fi

\bibitem[JS17]{schoebel2017}
\textsc{Jäger}, Sven ; \textsc{Schöbel}, Anita:
\newblock \emph{The blockwise coordinate descent method for integer programs}.
\newblock Unpublished, 2017

\end{thebibliography}
