\relax 
\providecommand\hyper@newdestlabel[2]{}
\catcode `"\active 
\providecommand\HyperFirstAtBeginDocument{\AtBeginDocument}
\HyperFirstAtBeginDocument{\ifx\hyper@anchor\@undefined
\global\let\oldcontentsline\contentsline
\gdef\contentsline#1#2#3#4{\oldcontentsline{#1}{#2}{#3}}
\global\let\oldnewlabel\newlabel
\gdef\newlabel#1#2{\newlabelxx{#1}#2}
\gdef\newlabelxx#1#2#3#4#5#6{\oldnewlabel{#1}{{#2}{#3}}}
\AtEndDocument{\ifx\hyper@anchor\@undefined
\let\contentsline\oldcontentsline
\let\newlabel\oldnewlabel
\fi}
\fi}
\global\let\hyper@last\relax 
\gdef\HyperFirstAtBeginDocument#1{#1}
\providecommand\HyField@AuxAddToFields[1]{}
\providecommand\HyField@AuxAddToCoFields[2]{}
\select@language{ngerman}
\@writefile{toc}{\select@language{ngerman}}
\@writefile{lof}{\select@language{ngerman}}
\@writefile{lot}{\select@language{ngerman}}
\citation{benders1962partitioning}
\citation{boyd2007notes}
\citation{tseng2001convergence}
\citation{jaeger2016}
\citation{schoebel2017}
\@writefile{toc}{\contentsline {chapter}{\numberline {1}Einleitung}{2}{chapter.1}}
\@writefile{lof}{\addvspace {10\p@ }}
\@writefile{lot}{\addvspace {10\p@ }}
\@writefile{loa}{\addvspace {10\p@ }}
\citation{held1970traveling}
\citation{graham1985history}
\citation{schoebel2012}
\@writefile{toc}{\contentsline {chapter}{\numberline {2}Spannb\IeC {\"a}ume und Rucks\IeC {\"a}cke}{3}{chapter.2}}
\@writefile{lof}{\addvspace {10\p@ }}
\@writefile{lot}{\addvspace {10\p@ }}
\@writefile{loa}{\addvspace {10\p@ }}
\newlabel{ch:grundlagen}{{2}{3}{Spannbäume und Rucksäcke}{chapter.2}{}}
\@writefile{toc}{\contentsline {section}{\numberline {2.1}Problem des minimalen Spannbaums}{3}{section.2.1}}
\@writefile{toc}{\contentsline {subsection}{\numberline {2.1.1}Einf\IeC {\"u}hrung in die Graphentheorie}{3}{subsection.2.1.1}}
\@writefile{toc}{\contentsline {subsection}{\numberline {2.1.2}Problemformulierung}{4}{subsection.2.1.2}}
\newlabel{eq:mst_pur}{{2.1}{4}{Problemformulierung}{equation.2.1.1}{}}
\citation{schoebel2014}
\citation{schoebel2012}
\newlabel{guteFrage}{{2.8}{5}{Problemformulierung}{defi.2.8}{}}
\citation{kershenbaum1972computing}
\citation{skiena1999interested}
\citation{karp1972reducibility}
\@writefile{toc}{\contentsline {section}{\numberline {2.2}Rucksack-Problem}{7}{section.2.2}}
\@writefile{toc}{\contentsline {subsection}{\numberline {2.2.1}Problemformulierung}{7}{subsection.2.2.1}}
\citation{schoebel2017}
\@writefile{toc}{\contentsline {chapter}{\numberline {3}Blockkoordinaten"=Abstiegsverfahren}{8}{chapter.3}}
\@writefile{lof}{\addvspace {10\p@ }}
\@writefile{lot}{\addvspace {10\p@ }}
\@writefile{loa}{\addvspace {10\p@ }}
\newlabel{ch:verfahren}{{3}{8}{Blockkoordinaten"=Abstiegsverfahren}{chapter.3}{}}
\@writefile{toc}{\contentsline {section}{\numberline {3.1}Der Algorithmus}{10}{section.3.1}}
\@writefile{loa}{\contentsline {algocf}{\numberline {1}{\ignorespaces Blockkoordinaten"=Abstiegsverfahren\relax }}{10}{algocf.1}}
\providecommand*\caption@xref[2]{\@setref\relax\@undefined{#1}}
\newlabel{algo}{{1}{10}{Der Algorithmus}{algocf.1}{}}
\newlabel{verbesserung:allgemein}{{3.3}{10}{Der Algorithmus}{defi.3.3}{}}
\newlabel{notoptimal}{{3.4}{10}{Der Algorithmus}{defi.3.4}{}}
\@writefile{toc}{\contentsline {section}{\numberline {3.2}Problemformulierungen mit Bl\IeC {\"o}cken}{11}{section.3.2}}
\newlabel{block:formulierungen}{{3.2}{11}{Problemformulierungen mit Blöcken}{section.3.2}{}}
\@writefile{toc}{\contentsline {subsubsection}{\nonumberline Problem des minimalen Spannbaums}{11}{section*.4}}
\newlabel{mst:einfacher_Fall1}{{1}{12}{Problem des minimalen Spannbaums}{Item.1}{}}
\newlabel{mst:einfacher_Fall2}{{2}{12}{Problem des minimalen Spannbaums}{Item.2}{}}
\newlabel{fig:bsp:fv1_1}{{3.1a}{13}{Graph mit Kantengewichten \relax }{figure.caption.5}{}}
\newlabel{sub@fig:bsp:fv1_1}{{a}{13}{Graph mit Kantengewichten \relax }{figure.caption.5}{}}
\newlabel{fig:bsp:fv1_2}{{3.1b}{13}{Das dazugehörige Netzwerk mit Flussvariablen \relax }{figure.caption.5}{}}
\newlabel{sub@fig:bsp:fv1_2}{{b}{13}{Das dazugehörige Netzwerk mit Flussvariablen \relax }{figure.caption.5}{}}
\@writefile{lof}{\contentsline {figure}{\numberline {3.1}{\ignorespaces Beispiel: Flussvariablen vor der Optimierung \IeC {\"u}ber Block $I$\relax }}{13}{figure.caption.5}}
\newlabel{fig:bsp:fv1}{{3.1}{13}{Beispiel: Flussvariablen vor der Optimierung über Block $I$\relax }{figure.caption.5}{}}
\@writefile{lof}{\contentsline {figure}{\numberline {3.2}{\ignorespaces Beispiel: Flussvariablen nach der Optimierung \IeC {\"u}ber Block $I$\relax }}{14}{figure.caption.6}}
\newlabel{fig:bsp:fv2}{{3.2}{14}{Beispiel: Flussvariablen nach der Optimierung über Block $I$\relax }{figure.caption.6}{}}
\newlabel{mst:bem:kanten_weg}{{3.6}{15}{Problem des minimalen Spannbaums}{defi.3.6}{}}
\newlabel{bsp:no_mst_1}{{3.3a}{17}{Kanten im Block $I$ nicht zusammen\-hängend \relax }{figure.caption.7}{}}
\newlabel{sub@bsp:no_mst_1}{{a}{17}{Kanten im Block $I$ nicht zusammen\-hängend \relax }{figure.caption.7}{}}
\newlabel{bsp:no_mst_2}{{3.3b}{17}{Spannbaum im Block $I$ möglich \relax }{figure.caption.7}{}}
\newlabel{sub@bsp:no_mst_2}{{b}{17}{Spannbaum im Block $I$ möglich \relax }{figure.caption.7}{}}
\@writefile{lof}{\contentsline {figure}{\numberline {3.3}{\ignorespaces Beispiel: $(\mathcal  {MST}_j)$ ist kein Spannbaum-Problem\relax }}{17}{figure.caption.7}}
\newlabel{bsp:no_mst}{{3.3}{17}{Beispiel: $(\mathcal {MST}_j)$ ist kein Spannbaum-Problem\relax }{figure.caption.7}{}}
\@writefile{loa}{\contentsline {algocf}{\numberline {2}{\ignorespaces Verkleinern des Graphen f\IeC {\"u}r $(\mathcal  {MST}_j^\text  {multi})$ \relax }}{18}{algocf.2}}
\newlabel{mst:fuso_start}{{3}{18}{Problem des minimalen Spannbaums}{Item.7}{}}
\newlabel{mst:fuso_k}{{4}{18}{Problem des minimalen Spannbaums}{Item.8}{}}
\newlabel{mst:fuso_k1}{{{{(i)}}}{18}{Problem des minimalen Spannbaums}{Item.9}{}}
\newlabel{mst:fuso_k2}{{{{(ii)}}}{18}{Problem des minimalen Spannbaums}{Item.10}{}}
\newlabel{mst:fuso_k3}{{{{(iii)}}}{18}{Problem des minimalen Spannbaums}{Item.11}{}}
\newlabel{mst:fuso_k4}{{{{(iv)}}}{18}{Problem des minimalen Spannbaums}{Item.12}{}}
\newlabel{mst:fuso_schleife}{{5}{18}{Problem des minimalen Spannbaums}{Item.13}{}}
\newlabel{algo:fusion}{{2}{18}{Problem des minimalen Spannbaums}{Item.14}{}}
\@writefile{lof}{\contentsline {figure}{\numberline {3.4}{\ignorespaces Beispielhafte Anwendung von Algorithmus~\ref  {algo:fusion}\relax }}{19}{figure.caption.8}}
\newlabel{fig:fuso1}{{3.4}{19}{Beispielhafte Anwendung von Algorithmus~\ref {algo:fusion}\relax }{figure.caption.8}{}}
\@writefile{lof}{\contentsline {figure}{\numberline {3.5}{\ignorespaces Vergleich Graph vor und nach Algorithmus~\ref  {algo:fusion}\relax }}{20}{figure.caption.9}}
\newlabel{fig:fuso2}{{3.5}{20}{Vergleich Graph vor und nach Algorithmus~\ref {algo:fusion}\relax }{figure.caption.9}{}}
\newlabel{mst:multi_\IeC {\"a}quvi}{{3.13}{20}{Problem des minimalen Spannbaums}{defi.3.13}{}}
\newlabel{form:1_1}{{3.1}{21}{Problem des minimalen Spannbaums}{equation.3.2.1}{}}
\newlabel{form:1_2}{{3.2}{21}{Problem des minimalen Spannbaums}{equation.3.2.2}{}}
\newlabel{form:1_3}{{3.3}{21}{Problem des minimalen Spannbaums}{equation.3.2.3}{}}
\newlabel{form:1_4}{{3.4}{21}{Problem des minimalen Spannbaums}{equation.3.2.4}{}}
\newlabel{form:1_5}{{3.5}{21}{Problem des minimalen Spannbaums}{equation.3.2.5}{}}
\newlabel{form:1_6}{{3.6}{21}{Problem des minimalen Spannbaums}{equation.3.2.6}{}}
\newlabel{form:1_7}{{3.7}{21}{Problem des minimalen Spannbaums}{equation.3.2.7}{}}
\newlabel{form:1_8}{{3.8}{21}{Problem des minimalen Spannbaums}{equation.3.2.8}{}}
\newlabel{form:1_9}{{3.9}{21}{Problem des minimalen Spannbaums}{equation.3.2.9}{}}
\newlabel{form:2_1}{{3.10}{22}{Problem des minimalen Spannbaums}{equation.3.2.10}{}}
\newlabel{form:2_2}{{3.11}{22}{Problem des minimalen Spannbaums}{equation.3.2.11}{}}
\newlabel{form:2_3}{{3.12}{22}{Problem des minimalen Spannbaums}{equation.3.2.12}{}}
\newlabel{form:2_4}{{3.13}{22}{Problem des minimalen Spannbaums}{equation.3.2.13}{}}
\newlabel{form:2_5}{{3.14}{22}{Problem des minimalen Spannbaums}{equation.3.2.14}{}}
\newlabel{form:2_6}{{3.15}{22}{Problem des minimalen Spannbaums}{equation.3.2.15}{}}
\newlabel{form:2_7}{{3.16}{22}{Problem des minimalen Spannbaums}{equation.3.2.16}{}}
\newlabel{form:2_8}{{3.17}{22}{Problem des minimalen Spannbaums}{equation.3.2.17}{}}
\newlabel{form:2_9}{{3.18}{22}{Problem des minimalen Spannbaums}{equation.3.2.18}{}}
\@writefile{toc}{\contentsline {subsubsection}{\nonumberline Rucksack-Problem}{23}{section*.10}}
\newlabel{KSP:einfach}{{3.15}{23}{Rucksack-Problem}{defi.3.15}{}}
\@writefile{toc}{\contentsline {section}{\numberline {3.3}Wahl der Bl\IeC {\"o}cke}{25}{section.3.3}}
\newlabel{sec:wahl}{{3.3}{25}{Wahl der Blöcke}{section.3.3}{}}
\newlabel{vermutung:disjunkt}{{3.16}{25}{Wahl der Blöcke}{defi.3.16}{}}
\newlabel{vermutung:gross_klein}{{3.17}{25}{Wahl der Blöcke}{defi.3.17}{}}
\newlabel{vermutung:mehr_zeit}{{3.18}{25}{Wahl der Blöcke}{defi.3.18}{}}
\@writefile{toc}{\contentsline {subsection}{\numberline {3.3.1}Reihenfolge der Bl\IeC {\"o}cke}{26}{subsection.3.3.1}}
\newlabel{verbesserung:paar}{{3.19}{26}{Reihenfolge der Blöcke}{defi.3.19}{}}
\newlabel{b:1}{{3.19}{26}{Reihenfolge der Blöcke}{equation.3.3.19}{}}
\newlabel{b:2}{{3.20}{26}{Reihenfolge der Blöcke}{equation.3.3.20}{}}
\newlabel{b:3}{{3.21}{26}{Reihenfolge der Blöcke}{equation.3.3.21}{}}
\newlabel{verbesserung:folg}{{3.20}{27}{Reihenfolge der Blöcke}{defi.3.20}{}}
\newlabel{verbesserung:induktion}{{3.21}{27}{Reihenfolge der Blöcke}{defi.3.21}{}}
\@writefile{toc}{\contentsline {subsubsection}{\nonumberline Umgekehrte Reihenfolge}{27}{section*.11}}
\citation{oxley2006matroid}
\citation{matroids2004}
\@writefile{toc}{\contentsline {subsection}{\numberline {3.3.2}Alle k-elementigen Teilmengen}{28}{subsection.3.3.2}}
\newlabel{block:teilmengen}{{3.3.2}{28}{Alle k-elementigen Teilmengen}{subsection.3.3.2}{}}
\newlabel{kel:big}{{3.22}{28}{Alle k-elementigen Teilmengen}{defi.3.22}{}}
\@writefile{lof}{\contentsline {figure}{\numberline {3.6}{\ignorespaces Vergleich Anzahl aller k-elementigen Teilmengen einer $n$-elementigen Menge\relax }}{28}{figure.caption.12}}
\newlabel{fig:kel_big}{{3.6}{28}{Vergleich Anzahl aller k-elementigen Teilmengen einer $n$-elementigen Menge\relax }{figure.caption.12}{}}
\@writefile{toc}{\contentsline {subsubsection}{\nonumberline Problem des minimalen Spannbaums}{28}{section*.13}}
\citation{schoebel2017}
\newlabel{matroid:def}{{3.24}{29}{Matroid}{defi.3.24}{}}
\newlabel{matroid:2-el}{{3.25}{29}{\cite [Theorem 12]{schoebel2017}}{defi.3.25}{}}
\newlabel{matroid:mst}{{3.26}{30}{Problem des minimalen Spannbaums}{defi.3.26}{}}
\newlabel{MST:2-el}{{3.27}{30}{Problem des minimalen Spannbaums}{defi.3.27}{}}
\newlabel{MST:k-el}{{3.28}{30}{Problem des minimalen Spannbaums}{defi.3.28}{}}
\citation{bezdek1987local}
\@writefile{toc}{\contentsline {subsubsection}{\nonumberline Rucksack-Problem}{31}{section*.14}}
\@writefile{toc}{\contentsline {subsection}{\numberline {3.3.3}Disjunkte Bl\IeC {\"o}cke}{31}{subsection.3.3.3}}
\newlabel{block:disjunkt}{{3.3.3}{31}{Disjunkte Blöcke}{subsection.3.3.3}{}}
\newlabel{bsp:disjunkt_groesser2}{{3.33}{32}{Disjunkte Blöcke}{defi.3.33}{}}
\@writefile{lot}{\contentsline {table}{\numberline {3.1}{\ignorespaces Beispiel f\IeC {\"u}r mehr als zwei Runden bei disjunkter Blockwahl\relax }}{33}{table.caption.15}}
\@writefile{toc}{\contentsline {subsection}{\numberline {3.3.4}\IeC {\"U}berlappende Bl\IeC {\"o}cke}{33}{subsection.3.3.4}}
\newlabel{block:ueberlapp}{{3.3.4}{33}{Überlappende Blöcke}{subsection.3.3.4}{}}
\@writefile{toc}{\contentsline {subsection}{\numberline {3.3.5}Zuf\IeC {\"a}llige Bl\IeC {\"o}cke}{34}{subsection.3.3.5}}
\newlabel{block:zufall}{{3.3.5}{34}{Zufällige Blöcke}{subsection.3.3.5}{}}
\@writefile{loa}{\contentsline {algocf}{\numberline {3}{\ignorespaces Blockkoordinaten"=Abstiegsverfahren mit einer zuf\IeC {\"a}lligen Blockwahl\relax }}{35}{algocf.3}}
\@writefile{toc}{\contentsline {subsection}{\numberline {3.3.6}Weitere Wahlm\IeC {\"o}glichkeiten}{35}{subsection.3.3.6}}
\newlabel{block:ausblick}{{3.3.6}{35}{Weitere Wahlmöglichkeiten}{subsection.3.3.6}{}}
\@writefile{toc}{\contentsline {section}{\numberline {3.4}Abbruchbedingungen - Theoretischer Anriss}{37}{section.3.4}}
\newlabel{sec:abbruch}{{3.4}{37}{Abbruchbedingungen - Theoretischer Anriss}{section.3.4}{}}
\@writefile{loa}{\contentsline {algocf}{\numberline {4}{\ignorespaces Blockkoordinaten"=Abstiegsverfahren mit Abbruchbedingungen\relax }}{37}{algocf.4}}
\newlabel{algo_abbruch}{{4}{37}{Abbruchbedingungen - Theoretischer Anriss}{algocf.4}{}}
\newlabel{abbruch:x_vs_f(x)}{{3.42}{37}{Abbruchbedingungen - Theoretischer Anriss}{defi.3.42}{}}
\newlabel{bsp:x_vs_f(x)}{{3.43}{37}{Abbruchbedingungen - Theoretischer Anriss}{defi.3.43}{}}
\@writefile{lot}{\contentsline {table}{\numberline {3.2}{\ignorespaces Beispiel zu Bemerkung~\ref  {abbruch:x_vs_f(x)}\relax }}{38}{table.caption.17}}
\newlabel{bsp:x_vs_f(x)_tabelle}{{3.2}{38}{Beispiel zu Bemerkung~\ref {abbruch:x_vs_f(x)}\relax }{table.caption.17}{}}
\@writefile{toc}{\contentsline {section}{\numberline {3.5}Kommentar zur Programmierung}{39}{section.3.5}}
\newlabel{programm}{{3.5}{39}{Kommentar zur Programmierung}{section.3.5}{}}
\@writefile{toc}{\contentsline {chapter}{\numberline {4}Ergebnisse und Auswertung}{40}{chapter.4}}
\@writefile{lof}{\addvspace {10\p@ }}
\@writefile{lot}{\addvspace {10\p@ }}
\@writefile{loa}{\addvspace {10\p@ }}
\newlabel{ch:auswertung}{{4}{40}{Ergebnisse und Auswertung}{chapter.4}{}}
\newlabel{block:list}{{\caption@xref {block:list}{ on input line 1408}}{40}{Ergebnisse und Auswertung}{table.caption.18}{}}
\@writefile{lot}{\contentsline {table}{\numberline {4.1}{\ignorespaces \IeC {\"U}bersicht Blockwahlen\relax }}{40}{table.caption.18}}
\@writefile{toc}{\contentsline {section}{\numberline {4.1}Problem des minimalen Spannbaums}{41}{section.4.1}}
\newlabel{bad_gurobi}{{4.2}{41}{Problem des minimalen Spannbaums}{defi.4.2}{}}
\@writefile{toc}{\contentsline {subsection}{\numberline {4.1.1}Alle k-elementigen Teilmengen bei gleicher Problemgr\IeC {\"o}\IeC {\ss }e}{41}{subsection.4.1.1}}
\@writefile{lof}{\contentsline {figure}{\numberline {4.1}{\ignorespaces $(\mathcal  {MST})$ - teilmengen(k): Anzahl Runden\relax }}{42}{figure.caption.19}}
\newlabel{fig:mst:all-k_loops}{{4.1}{42}{$(\mathcal {MST})$ - teilmengen(k): Anzahl Runden\relax }{figure.caption.19}{}}
\@writefile{lof}{\contentsline {figure}{\numberline {4.2}{\ignorespaces $(\mathcal  {MST})$ - teilmengen(k): Zeit und Anzahl Bl\IeC {\"o}cke\relax }}{42}{figure.caption.20}}
\newlabel{fig:mst:all-k_time+nos}{{4.2}{42}{$(\mathcal {MST})$ - teilmengen(k): Zeit und Anzahl Blöcke\relax }{figure.caption.20}{}}
\@writefile{toc}{\contentsline {subsection}{\numberline {4.1.2}Alle k-elementige Teilmengen bei unterschiedlichen Problemgr\IeC {\"o}\IeC {\ss }en}{44}{subsection.4.1.2}}
\@writefile{toc}{\contentsline {subsubsection}{\nonumberline Alle 2-elementigen Teilmengen}{44}{section*.21}}
\@writefile{lof}{\contentsline {figure}{\numberline {4.3}{\ignorespaces $(\mathcal  {MST})$ - teilmengen(2): Anzahl Runden\relax }}{44}{figure.caption.22}}
\newlabel{fig:mst:t2_loops}{{4.3}{44}{$(\mathcal {MST})$ - teilmengen(2): Anzahl Runden\relax }{figure.caption.22}{}}
\@writefile{lof}{\contentsline {figure}{\numberline {4.4}{\ignorespaces $(\mathcal  {MST})$ - teilmengen(2): Zeit\relax }}{45}{figure.caption.23}}
\newlabel{fig:mst:t2_time}{{4.4}{45}{$(\mathcal {MST})$ - teilmengen(2): Zeit\relax }{figure.caption.23}{}}
\@writefile{toc}{\contentsline {subsubsection}{\nonumberline Alle 3-elementigen Teilmengen}{45}{section*.24}}
\@writefile{lof}{\contentsline {figure}{\numberline {4.5}{\ignorespaces $(\mathcal  {MST})$ - teilmengen(3): Anzahl Runden\relax }}{46}{figure.caption.25}}
\newlabel{fig:mst:t3_loops}{{4.5}{46}{$(\mathcal {MST})$ - teilmengen(3): Anzahl Runden\relax }{figure.caption.25}{}}
\@writefile{lof}{\contentsline {figure}{\numberline {4.6}{\ignorespaces $(\mathcal  {MST})$ - teilmengen(3): Zeit\relax }}{46}{figure.caption.26}}
\newlabel{fig:mst:t3_time}{{4.6}{46}{$(\mathcal {MST})$ - teilmengen(3): Zeit\relax }{figure.caption.26}{}}
\@writefile{toc}{\contentsline {subsubsection}{\nonumberline Alle 4-elementigen Teilmengen}{47}{section*.27}}
\@writefile{lof}{\contentsline {figure}{\numberline {4.7}{\ignorespaces $(\mathcal  {MST})$ - teilmengen(4): Anzahl Runden\relax }}{47}{figure.caption.28}}
\newlabel{fig:mst:t4_loops}{{4.7}{47}{$(\mathcal {MST})$ - teilmengen(4): Anzahl Runden\relax }{figure.caption.28}{}}
\@writefile{lof}{\contentsline {figure}{\numberline {4.8}{\ignorespaces $(\mathcal  {MST})$ - teilmengen(4): Zeit\relax }}{47}{figure.caption.29}}
\newlabel{fig:mst:t4_time}{{4.8}{47}{$(\mathcal {MST})$ - teilmengen(4): Zeit\relax }{figure.caption.29}{}}
\@writefile{toc}{\contentsline {subsection}{\numberline {4.1.3}Vergleich verschiedener Blockwahlen}{49}{subsection.4.1.3}}
\@writefile{toc}{\contentsline {subsubsection}{\nonumberline Vollst\IeC {\"a}ndige Graphen}{49}{section*.30}}
\@writefile{lof}{\contentsline {figure}{\numberline {4.9}{\ignorespaces $(\mathcal  {MST})$ vollst\IeC {\"a}ndiger Graph - Vergleich: L\IeC {\"o}sungsqualit\IeC {\"a}t\relax }}{49}{figure.caption.31}}
\newlabel{fig:mst:voll:v_sol}{{4.9}{49}{$(\mathcal {MST})$ vollständiger Graph - Vergleich: Lösungsqualität\relax }{figure.caption.31}{}}
\@writefile{lof}{\contentsline {figure}{\numberline {4.10}{\ignorespaces $(\mathcal  {MST})$ vollst\IeC {\"a}ndiger Graph - Vergleich: Runden und Zeit\relax }}{50}{figure.caption.32}}
\newlabel{fig:mst:voll:v_loops+time}{{4.10}{50}{$(\mathcal {MST})$ vollständiger Graph - Vergleich: Runden und Zeit\relax }{figure.caption.32}{}}
\@writefile{lof}{\contentsline {figure}{\numberline {4.11}{\ignorespaces $(\mathcal  {MST})$ vollst\IeC {\"a}ndiger Graph - Vergleich: Zeit und L\IeC {\"o}sungsqualit\IeC {\"a}t\relax }}{51}{figure.caption.33}}
\newlabel{fig:mst:voll:time_sol}{{4.11}{51}{$(\mathcal {MST})$ vollständiger Graph - Vergleich: Zeit und Lösungsqualität\relax }{figure.caption.33}{}}
\@writefile{lof}{\contentsline {figure}{\numberline {4.12}{\ignorespaces $(\mathcal  {MST})$ vollst\IeC {\"a}ndiger Graph - Vergleich: Anzahl Bl\IeC {\"o}cke und Zeit\relax }}{51}{figure.caption.34}}
\newlabel{fig:mst:voll:nos_time}{{4.12}{51}{$(\mathcal {MST})$ vollständiger Graph - Vergleich: Anzahl Blöcke und Zeit\relax }{figure.caption.34}{}}
\@writefile{lof}{\contentsline {figure}{\numberline {4.13}{\ignorespaces $(\mathcal  {MST})$ vollst\IeC {\"a}ndiger Graph - Vergleich: Anzahl Bl\IeC {\"o}cke und Anzahl Runden\relax }}{52}{figure.caption.35}}
\newlabel{fig:mst:voll:nos_loops}{{4.13}{52}{$(\mathcal {MST})$ vollständiger Graph - Vergleich: Anzahl Blöcke und Anzahl Runden\relax }{figure.caption.35}{}}
\@writefile{lof}{\contentsline {figure}{\numberline {4.14}{\ignorespaces $(\mathcal  {MST})$ vollst\IeC {\"a}ndiger Graph - Verlauf der Blockwahlen\relax }}{52}{figure.caption.36}}
\newlabel{fig:mst:voll:verlauf}{{4.14}{52}{$(\mathcal {MST})$ vollständiger Graph - Verlauf der Blockwahlen\relax }{figure.caption.36}{}}
\@writefile{lof}{\contentsline {figure}{\numberline {4.15}{\ignorespaces $(\mathcal  {MST})$ vollst\IeC {\"a}ndiger Graph - Verlauf bei zuf\IeC {\"a}lliger Blockwahl\relax }}{54}{figure.caption.37}}
\newlabel{fig:mst:voll:zufall}{{4.15}{54}{$(\mathcal {MST})$ vollständiger Graph - Verlauf bei zufälliger Blockwahl\relax }{figure.caption.37}{}}
\@writefile{toc}{\contentsline {subsubsection}{\nonumberline Karger Graph}{55}{section*.38}}
\newlabel{fig:mst:karg:v_sol_1}{{4.16a}{55}{Alle Blockwahlen\relax }{figure.caption.39}{}}
\newlabel{sub@fig:mst:karg:v_sol_1}{{a}{55}{Alle Blockwahlen\relax }{figure.caption.39}{}}
\@writefile{lof}{\contentsline {figure}{\numberline {4.16}{\ignorespaces $(\mathcal  {MST})$ karger Graph - Vergleich: L\IeC {\"o}sungsqualit\IeC {\"a}t\relax }}{55}{figure.caption.39}}
\newlabel{fig:mst:karg:v_sol}{{4.16}{55}{$(\mathcal {MST})$ karger Graph - Vergleich: Lösungsqualität\relax }{figure.caption.39}{}}
\@writefile{lof}{\contentsline {figure}{\numberline {4.17}{\ignorespaces $(\mathcal  {MST})$ karger Graph - Vergleich: Runden und Zeit\relax }}{56}{figure.caption.40}}
\newlabel{fig:mst:karg:v_loops+time}{{4.17}{56}{$(\mathcal {MST})$ karger Graph - Vergleich: Runden und Zeit\relax }{figure.caption.40}{}}
\@writefile{lof}{\contentsline {figure}{\numberline {4.18}{\ignorespaces $(\mathcal  {MST})$ karger Graph - Vergleich: Zeit und L\IeC {\"o}sungsqualit\IeC {\"a}t\relax }}{57}{figure.caption.41}}
\newlabel{fig:mst:karg:time_sol}{{4.18}{57}{$(\mathcal {MST})$ karger Graph - Vergleich: Zeit und Lösungsqualität\relax }{figure.caption.41}{}}
\@writefile{lof}{\contentsline {figure}{\numberline {4.19}{\ignorespaces $(\mathcal  {MST})$ karger Graph - Vergleich: Anzahl Bl\IeC {\"o}cke und Zeit\relax }}{57}{figure.caption.42}}
\newlabel{fig:mst:karg:nos_time}{{4.19}{57}{$(\mathcal {MST})$ karger Graph - Vergleich: Anzahl Blöcke und Zeit\relax }{figure.caption.42}{}}
\@writefile{lof}{\contentsline {figure}{\numberline {4.20}{\ignorespaces $(\mathcal  {MST})$ karger Graph - Vergleich: Anzahl Bl\IeC {\"o}cke und Anzahl Runden\relax }}{58}{figure.caption.43}}
\newlabel{fig:mst:karg:nos_loops}{{4.20}{58}{$(\mathcal {MST})$ karger Graph - Vergleich: Anzahl Blöcke und Anzahl Runden\relax }{figure.caption.43}{}}
\@writefile{lof}{\contentsline {figure}{\numberline {4.21}{\ignorespaces $(\mathcal  {MST})$ karger Graph - Verlauf der Blockwahlen\relax }}{58}{figure.caption.44}}
\newlabel{fig:mst:karg:verlauf}{{4.21}{58}{$(\mathcal {MST})$ karger Graph - Verlauf der Blockwahlen\relax }{figure.caption.44}{}}
\@writefile{lof}{\contentsline {figure}{\numberline {4.22}{\ignorespaces $(\mathcal  {MST})$ karger Graph - Verlauf ausgew\IeC {\"a}hlter Blockwahlen\relax }}{59}{figure.caption.45}}
\newlabel{fig:mst:karg:verlauf_auswahl}{{4.22}{59}{$(\mathcal {MST})$ karger Graph - Verlauf ausgewählter Blockwahlen\relax }{figure.caption.45}{}}
\@writefile{lof}{\contentsline {figure}{\numberline {4.23}{\ignorespaces $(\mathcal  {MST})$ karger Graph - Verlauf bei zuf\IeC {\"a}lliger Blockwahl\relax }}{60}{figure.caption.46}}
\newlabel{fig:mst:karg:zufall}{{4.23}{60}{$(\mathcal {MST})$ karger Graph - Verlauf bei zufälliger Blockwahl\relax }{figure.caption.46}{}}
\@writefile{toc}{\contentsline {section}{\numberline {4.2}Rucksack-Problem}{61}{section.4.2}}
\@writefile{toc}{\contentsline {subsection}{\numberline {4.2.1}Alle k-elementigen Teilmengen bei gleicher Problemgr\IeC {\"o}\IeC {\ss }e}{61}{subsection.4.2.1}}
\newlabel{fig:ksp:all-k_1_freq}{{4.24b}{61}{Relative Häufigkeit\relax }{figure.caption.47}{}}
\newlabel{sub@fig:ksp:all-k_1_freq}{{b}{61}{Relative Häufigkeit\relax }{figure.caption.47}{}}
\newlabel{fig:ksp:all-k_1_time}{{4.24c}{61}{Zeit und Anzahl der Blöcke\relax }{figure.caption.47}{}}
\newlabel{sub@fig:ksp:all-k_1_time}{{c}{61}{Zeit und Anzahl der Blöcke\relax }{figure.caption.47}{}}
\@writefile{lof}{\contentsline {figure}{\numberline {4.24}{\ignorespaces $(\mathcal  {KSP})$ - teilmengen(k): Anzahl Runden, relative H\IeC {\"a}ufigkeit, Zeit und Anzahl Bl\IeC {\"o}cke\relax }}{61}{figure.caption.47}}
\newlabel{fig:ksp:all-k_1}{{4.24}{61}{$(\mathcal {KSP})$ - teilmengen(k): Anzahl Runden, relative Häufigkeit, Zeit und Anzahl Blöcke\relax }{figure.caption.47}{}}
\@writefile{toc}{\contentsline {subsection}{\numberline {4.2.2}Alle k-elementige Teilmengen bei unterschiedlichen Problemgr\IeC {\"o}\IeC {\ss }en}{63}{subsection.4.2.2}}
\@writefile{toc}{\contentsline {subsubsection}{\nonumberline Alle 2-elementigen Teilmengen}{63}{section*.48}}
\@writefile{lof}{\contentsline {figure}{\numberline {4.25}{\ignorespaces $(\mathcal  {KSP})$ - teilmengen(2): Gap\relax }}{63}{figure.caption.49}}
\newlabel{fig:ksp:t2_gap}{{4.25}{63}{$(\mathcal {KSP})$ - teilmengen(2): Gap\relax }{figure.caption.49}{}}
\@writefile{lof}{\contentsline {figure}{\numberline {4.26}{\ignorespaces $(\mathcal  {KSP})$ - teilmengen(2): Relative H\IeC {\"a}ufigkeit\relax }}{64}{figure.caption.50}}
\newlabel{fig:ksp:t2_freq}{{4.26}{64}{$(\mathcal {KSP})$ - teilmengen(2): Relative Häufigkeit\relax }{figure.caption.50}{}}
\@writefile{lof}{\contentsline {figure}{\numberline {4.27}{\ignorespaces $(\mathcal  {KSP})$ - teilmengen(2): Anzahl Runden\relax }}{64}{figure.caption.51}}
\newlabel{fig:ksp:t2_loops}{{4.27}{64}{$(\mathcal {KSP})$ - teilmengen(2): Anzahl Runden\relax }{figure.caption.51}{}}
\@writefile{lof}{\contentsline {figure}{\numberline {4.28}{\ignorespaces $(\mathcal  {KSP})$ - teilmengen(2): Zeit\relax }}{65}{figure.caption.52}}
\newlabel{fig:ksp:t2_time}{{4.28}{65}{$(\mathcal {KSP})$ - teilmengen(2): Zeit\relax }{figure.caption.52}{}}
\@writefile{toc}{\contentsline {subsubsection}{\nonumberline Alle 3-elementigen Teilmengen}{65}{section*.53}}
\@writefile{lof}{\contentsline {figure}{\numberline {4.29}{\ignorespaces $(\mathcal  {KSP})$ - teilmengen(3): Anzahl Runden, relative H\IeC {\"a}ufigkeit und Zeit\relax }}{66}{figure.caption.54}}
\newlabel{fig:ksp:t3}{{4.29}{66}{$(\mathcal {KSP})$ - teilmengen(3): Anzahl Runden, relative Häufigkeit und Zeit\relax }{figure.caption.54}{}}
\@writefile{toc}{\contentsline {subsubsection}{\nonumberline Alle 4-elementigen Teilmengen}{66}{section*.55}}
\@writefile{lof}{\contentsline {figure}{\numberline {4.30}{\ignorespaces $(\mathcal  {KSP})$ - teilmengen(4): Anzahl Runden, relative H\IeC {\"a}ufigkeit und Zeit\relax }}{67}{figure.caption.56}}
\newlabel{fig:ksp:t4}{{4.30}{67}{$(\mathcal {KSP})$ - teilmengen(4): Anzahl Runden, relative Häufigkeit und Zeit\relax }{figure.caption.56}{}}
\@writefile{toc}{\contentsline {subsection}{\numberline {4.2.3}Vergleich verschiedener Blockwahlen}{68}{subsection.4.2.3}}
\newlabel{fig:ksp:v_sol}{{4.31a}{68}{Lösungsqualität\relax }{figure.caption.57}{}}
\newlabel{sub@fig:ksp:v_sol}{{a}{68}{Lösungsqualität\relax }{figure.caption.57}{}}
\@writefile{lof}{\contentsline {figure}{\numberline {4.31}{\ignorespaces $(\mathcal  {KSP})$ - Vergleich: L\IeC {\"o}sungsqualit\IeC {\"a}t und relative H\IeC {\"a}ufigkeit\relax }}{68}{figure.caption.57}}
\newlabel{fig:ksp:v_sol+freq}{{4.31}{68}{$(\mathcal {KSP})$ - Vergleich: Lösungsqualität und relative Häufigkeit\relax }{figure.caption.57}{}}
\@writefile{lof}{\contentsline {figure}{\numberline {4.32}{\ignorespaces $(\mathcal  {KSP})$ - Vergleich: Gap der \IeC {\"u}berlappenden Blockwahlen\relax }}{69}{figure.caption.58}}
\newlabel{fig:ksp:v_gap}{{4.32}{69}{$(\mathcal {KSP})$ - Vergleich: Gap der überlappenden Blockwahlen\relax }{figure.caption.58}{}}
\@writefile{lof}{\contentsline {figure}{\numberline {4.33}{\ignorespaces $(\mathcal  {KSP})$ - Vergleich: Anzahl Runden\relax }}{69}{figure.caption.59}}
\newlabel{fig:ksp:v_loops}{{4.33}{69}{$(\mathcal {KSP})$ - Vergleich: Anzahl Runden\relax }{figure.caption.59}{}}
\@writefile{lof}{\contentsline {figure}{\numberline {4.34}{\ignorespaces $(\mathcal  {KSP})$ - Vergleich: Zeit\relax }}{70}{figure.caption.60}}
\newlabel{fig:ksp:v_time}{{4.34}{70}{$(\mathcal {KSP})$ - Vergleich: Zeit\relax }{figure.caption.60}{}}
\@writefile{lof}{\contentsline {figure}{\numberline {4.35}{\ignorespaces $(\mathcal  {KSP})$ - Vergleich: Zeit und L\IeC {\"o}sungsqualit\IeC {\"a}t\relax }}{70}{figure.caption.61}}
\newlabel{fig:ksp:time_sol}{{4.35}{70}{$(\mathcal {KSP})$ - Vergleich: Zeit und Lösungsqualität\relax }{figure.caption.61}{}}
\@writefile{lof}{\contentsline {figure}{\numberline {4.36}{\ignorespaces $(\mathcal  {KSP})$ - Vergleich: Anzahl Bl\IeC {\"o}cke und Zeit\relax }}{71}{figure.caption.62}}
\newlabel{fig:ksp:nos_time}{{4.36}{71}{$(\mathcal {KSP})$ - Vergleich: Anzahl Blöcke und Zeit\relax }{figure.caption.62}{}}
\@writefile{lof}{\contentsline {figure}{\numberline {4.37}{\ignorespaces $(\mathcal  {KSP})$ - Vergleich: Anzahl Bl\IeC {\"o}cke und Anzahl Runden\relax }}{72}{figure.caption.63}}
\newlabel{fig:ksp:nos_loops}{{4.37}{72}{$(\mathcal {KSP})$ - Vergleich: Anzahl Blöcke und Anzahl Runden\relax }{figure.caption.63}{}}
\@writefile{lof}{\contentsline {figure}{\numberline {4.38}{\ignorespaces $(\mathcal  {KSP})$ - Verlauf der Blockwahlen\relax }}{72}{figure.caption.64}}
\newlabel{fig:ksp:verlauf}{{4.38}{72}{$(\mathcal {KSP})$ - Verlauf der Blockwahlen\relax }{figure.caption.64}{}}
\@writefile{lof}{\contentsline {figure}{\numberline {4.39}{\ignorespaces $(\mathcal  {KSP})$ - Verlauf bei zuf\IeC {\"a}lliger Blockwahl\relax }}{74}{figure.caption.65}}
\newlabel{fig:ksp:zufall}{{4.39}{74}{$(\mathcal {KSP})$ - Verlauf bei zufälliger Blockwahl\relax }{figure.caption.65}{}}
\@writefile{toc}{\contentsline {section}{\numberline {4.3}Gemeinsamkeiten und Unterschiede}{75}{section.4.3}}
\newlabel{sec:vergleich}{{4.3}{75}{Gemeinsamkeiten und Unterschiede}{section.4.3}{}}
\citation{schoebel2017}
\citation{schoebel2017}
\@writefile{toc}{\contentsline {chapter}{\numberline {5}Schluss}{77}{chapter.5}}
\@writefile{lof}{\addvspace {10\p@ }}
\@writefile{lot}{\addvspace {10\p@ }}
\@writefile{loa}{\addvspace {10\p@ }}
\bibdata{literatur}
\bibcite{benders1962partitioning}{Ben62}
\bibcite{bezdek1987local}{BHH{$^{+}$}87}
\bibcite{boyd2007notes}{BXMM07}
\bibcite{graham1985history}{GH85}
\bibcite{held1970traveling}{HK70}
\bibcite{schoebel2017}{JS17}
\bibcite{jaeger2016}{J\IeC {\"a}16}
\bibcite{karp1972reducibility}{Kar72}
\bibcite{kershenbaum1972computing}{KVS72}
\bibcite{matroids2004}{Ngo04}
\bibcite{oxley2006matroid}{Oxl06}
\bibcite{schoebel2012}{Sch12}
\bibcite{schoebel2014}{SH14}
\bibcite{skiena1999interested}{Ski99}
\bibcite{tseng2001convergence}{Tse01}
\bibstyle{alphadin}
