\select@language {ngerman}
\addvspace {10\p@ }
\addvspace {10\p@ }
\addvspace {10\p@ }
\addvspace {10\p@ }
\contentsline {table}{\numberline {4.1}{\ignorespaces \IeC {\"U}bersicht Blocknamen\relax }}{22}{table.caption.14}
\addvspace {10\p@ }
