{
  "time_pattern": "%Y-%m-%d %H:%M %z",
  "files": {
    "base_path": "sessions/$s/",
    "votes": "votes",
    "protocol": "protocol",
    "attendance": "attendance"
  },
  "gui": {
    "time_pattern": "%H:%M"
  },
  "hafee": {
    "host": "127.0.0.1",
    "port": 4321,
    "secret": "secret",
    "database": "data/hafee_lut.json"
  }
}
