\relax 
\catcode `"\active 
\citation{schoebel2017}
\bibdata{literatur}
\bibcite{schoebel2017}{JS17}
\bibstyle{alphadin}
\select@language{ngerman}
\@writefile{toc}{\select@language{ngerman}}
\@writefile{lof}{\select@language{ngerman}}
\@writefile{lot}{\select@language{ngerman}}
