\relax 
\providecommand\hyper@newdestlabel[2]{}
\providecommand\HyperFirstAtBeginDocument{\AtBeginDocument}
\HyperFirstAtBeginDocument{\ifx\hyper@anchor\@undefined
\global\let\oldcontentsline\contentsline
\gdef\contentsline#1#2#3#4{\oldcontentsline{#1}{#2}{#3}}
\global\let\oldnewlabel\newlabel
\gdef\newlabel#1#2{\newlabelxx{#1}#2}
\gdef\newlabelxx#1#2#3#4#5#6{\oldnewlabel{#1}{{#2}{#3}}}
\AtEndDocument{\ifx\hyper@anchor\@undefined
\let\contentsline\oldcontentsline
\let\newlabel\oldnewlabel
\fi}
\fi}
\global\let\hyper@last\relax 
\gdef\HyperFirstAtBeginDocument#1{#1}
\providecommand\HyField@AuxAddToFields[1]{}
\providecommand\HyField@AuxAddToCoFields[2]{}
\catcode `"\active 
\@writefile{toc}{\beamer@endinputifotherversion {3.36pt}}
\@writefile{nav}{\beamer@endinputifotherversion {3.36pt}}
\select@language{german}
\@writefile{toc}{\select@language{german}}
\@writefile{lof}{\select@language{german}}
\@writefile{lot}{\select@language{german}}
\@writefile{nav}{\headcommand {\slideentry {0}{0}{1}{1/1}{}{0}}}
\@writefile{nav}{\headcommand {\beamer@framepages {1}{1}}}
\@writefile{nav}{\headcommand {\slideentry {0}{0}{2}{2/2}{}{0}}}
\@writefile{nav}{\headcommand {\beamer@framepages {2}{2}}}
\@writefile{toc}{\beamer@sectionintoc {1}{Spannb\IeC {\"a}ume und Rucks\IeC {\"a}cke}{3}{0}{1}}
\@writefile{nav}{\headcommand {\sectionentry {1}{Spannb\IeC {\"a}ume und Rucks\IeC {\"a}cke}{3}{Spannb\IeC {\"a}ume und Rucks\IeC {\"a}cke}{0}}}
\@writefile{nav}{\headcommand {\beamer@sectionpages {1}{2}}}
\@writefile{nav}{\headcommand {\beamer@subsectionpages {1}{2}}}
\@writefile{nav}{\headcommand {\slideentry {1}{0}{1}{3/3}{}{0}}}
\@writefile{nav}{\headcommand {\beamer@framepages {3}{3}}}
\@writefile{toc}{\beamer@subsectionintoc {1}{1}{Problem des minimalen Spannbaums}{4}{0}{1}}
\@writefile{nav}{\headcommand {\beamer@subsectionentry {0}{1}{1}{4}{Problem des minimalen Spannbaums}}\headcommand {\beamer@subsectionpages {3}{3}}}
\@writefile{nav}{\headcommand {\slideentry {1}{1}{1}{4/5}{Problem des minimalen Spannbaums}{0}}}
\@writefile{nav}{\headcommand {\beamer@framepages {4}{5}}}
\@writefile{nav}{\headcommand {\slideentry {1}{1}{2}{6/6}{Problem des minimalen Spannbaums}{0}}}
\@writefile{nav}{\headcommand {\beamer@framepages {6}{6}}}
\@writefile{nav}{\headcommand {\slideentry {1}{1}{3}{7/8}{Problem des minimalen Spannbaums}{0}}}
\@writefile{nav}{\headcommand {\beamer@framepages {7}{8}}}
\@writefile{toc}{\beamer@subsectionintoc {1}{2}{Rucksack-Problem}{9}{0}{1}}
\@writefile{nav}{\headcommand {\beamer@subsectionentry {0}{1}{2}{9}{Rucksack-Problem}}\headcommand {\beamer@subsectionpages {4}{8}}}
\@writefile{nav}{\headcommand {\slideentry {1}{2}{1}{9/10}{Rucksack-Problem}{0}}}
\@writefile{nav}{\headcommand {\beamer@framepages {9}{10}}}
\@writefile{toc}{\beamer@sectionintoc {2}{Blockkoordinaten-Abstiegsverfahren}{11}{0}{2}}
\@writefile{nav}{\headcommand {\sectionentry {2}{Blockkoordinaten-Abstiegsverfahren}{11}{Blockkoordinaten-Abstiegsverfahren}{0}}}
\@writefile{nav}{\headcommand {\beamer@sectionpages {3}{10}}}
\@writefile{nav}{\headcommand {\beamer@subsectionpages {9}{10}}}
\@writefile{nav}{\headcommand {\slideentry {2}{0}{1}{11/11}{}{0}}}
\@writefile{nav}{\headcommand {\beamer@framepages {11}{11}}}
\@writefile{toc}{\beamer@subsectionintoc {2}{1}{Algorithmus}{12}{0}{2}}
\@writefile{nav}{\headcommand {\beamer@subsectionentry {0}{2}{1}{12}{Algorithmus}}\headcommand {\beamer@subsectionpages {11}{11}}}
\@writefile{nav}{\headcommand {\slideentry {2}{1}{1}{12/12}{Algorithmus}{0}}}
\@writefile{nav}{\headcommand {\beamer@framepages {12}{12}}}
\@writefile{nav}{\headcommand {\slideentry {2}{1}{2}{13/17}{Algorithmus}{0}}}
\@writefile{nav}{\headcommand {\beamer@framepages {13}{17}}}
\@writefile{nav}{\headcommand {\slideentry {2}{1}{3}{18/25}{Algorithmus}{0}}}
\@writefile{nav}{\headcommand {\beamer@framepages {18}{25}}}
\@writefile{loa}{\contentsline {algocf}{\numberline {1}{\ignorespaces Blockkoordinaten"=Abstiegsverfahren\relax }}}
\@writefile{loa}{\contentsline {algocf}{\numberline {1}{\ignorespaces Blockkoordinaten"=Abstiegsverfahren\relax }}}
\@writefile{nav}{\headcommand {\slideentry {2}{1}{4}{26/27}{Algorithmus}{0}}}
\@writefile{nav}{\headcommand {\beamer@framepages {26}{27}}}
\@writefile{nav}{\headcommand {\slideentry {2}{1}{5}{28/29}{Algorithmus}{0}}}
\@writefile{nav}{\headcommand {\beamer@framepages {28}{29}}}
\@writefile{toc}{\beamer@subsectionintoc {2}{2}{Formulierungen mit Bl\IeC {\"o}cken}{30}{0}{2}}
\@writefile{nav}{\headcommand {\beamer@subsectionentry {0}{2}{2}{30}{Formulierungen mit Bl\IeC {\"o}cken}}\headcommand {\beamer@subsectionpages {12}{29}}}
\@writefile{nav}{\headcommand {\slideentry {2}{2}{1}{30/30}{Formulierungen mit Bl\IeC {\"o}cken}{0}}}
\@writefile{nav}{\headcommand {\beamer@framepages {30}{30}}}
\@writefile{toc}{\beamer@subsubsectionintoc {2}{2}{1}{Problem des minimalen Spannbaums}{31}{0}{2}}
\@writefile{nav}{\headcommand {\beamer@subsubsectionentry {0}{2}{2}{1}{31}{Problem des minimalen Spannbaums}}}
\@writefile{nav}{\headcommand {\slideentry {2}{2}{2}{31/31}{Formulierungen mit Bl\IeC {\"o}cken}{0}}}
\@writefile{nav}{\headcommand {\beamer@framepages {31}{31}}}
\@writefile{nav}{\headcommand {\slideentry {2}{2}{3}{32/34}{Formulierungen mit Bl\IeC {\"o}cken}{0}}}
\@writefile{nav}{\headcommand {\beamer@framepages {32}{34}}}
\@writefile{nav}{\headcommand {\slideentry {2}{2}{4}{35/39}{Formulierungen mit Bl\IeC {\"o}cken}{0}}}
\@writefile{nav}{\headcommand {\beamer@framepages {35}{39}}}
\@writefile{nav}{\headcommand {\slideentry {2}{2}{5}{40/41}{Formulierungen mit Bl\IeC {\"o}cken}{0}}}
\@writefile{nav}{\headcommand {\beamer@framepages {40}{41}}}
\@writefile{nav}{\headcommand {\slideentry {2}{2}{6}{42/43}{Formulierungen mit Bl\IeC {\"o}cken}{0}}}
\@writefile{nav}{\headcommand {\beamer@framepages {42}{43}}}
\@writefile{nav}{\headcommand {\slideentry {2}{2}{7}{44/44}{Formulierungen mit Bl\IeC {\"o}cken}{0}}}
\@writefile{nav}{\headcommand {\beamer@framepages {44}{44}}}
\@writefile{nav}{\headcommand {\slideentry {2}{2}{8}{45/46}{Formulierungen mit Bl\IeC {\"o}cken}{0}}}
\@writefile{nav}{\headcommand {\beamer@framepages {45}{46}}}
\@writefile{nav}{\headcommand {\slideentry {2}{2}{9}{47/49}{Formulierungen mit Bl\IeC {\"o}cken}{0}}}
\@writefile{nav}{\headcommand {\beamer@framepages {47}{49}}}
\@writefile{loa}{\contentsline {algocf}{\numberline {2}{\ignorespaces \relax \fontsize  {10}{12}\selectfont  \abovedisplayskip 10\p@ plus2\p@ minus5\p@ \abovedisplayshortskip \z@ plus3\p@ \belowdisplayshortskip 6\p@ plus3\p@ minus3\p@ \def \leftmargin \leftmargini \topsep 4\p@ plus2\p@ minus2\p@ \parsep 2\p@ plus\p@ minus\p@ \itemsep \parsep {\leftmargin \leftmargini \topsep 6\p@ plus2\p@ minus2\p@ \parsep 3\p@ plus2\p@ minus\p@ \itemsep \parsep }\belowdisplayskip \abovedisplayskip Verkleinern des Graphen f\IeC {\"u}r $(\mathcal  {MST}_j^\text  {multi})$ \relax }}}
\newlabel{fuso_start}{{2}{50}{Problem des minimalen Spannbaums}{Doc-Start}{}}
\@writefile{snm}{\beamer@slide {fuso_start}{50}}
\newlabel{algo:mst_multi}{{2}{50}{Problem des minimalen Spannbaums}{Doc-Start}{}}
\@writefile{snm}{\beamer@slide {algo:mst_multi}{50}}
\@writefile{loa}{\contentsline {algocf}{\numberline {2}{\ignorespaces \relax \fontsize  {10}{12}\selectfont  \abovedisplayskip 10\p@ plus2\p@ minus5\p@ \abovedisplayshortskip \z@ plus3\p@ \belowdisplayshortskip 6\p@ plus3\p@ minus3\p@ \def \leftmargin \leftmargini \topsep 4\p@ plus2\p@ minus2\p@ \parsep 2\p@ plus\p@ minus\p@ \itemsep \parsep {\leftmargin \leftmargini \topsep 6\p@ plus2\p@ minus2\p@ \parsep 3\p@ plus2\p@ minus\p@ \itemsep \parsep }\belowdisplayskip \abovedisplayskip Verkleinern des Graphen f\IeC {\"u}r $(\mathcal  {MST}_j^\text  {multi})$ \relax }}}
\@writefile{loa}{\contentsline {algocf}{\numberline {2}{\ignorespaces \relax \fontsize  {10}{12}\selectfont  \abovedisplayskip 10\p@ plus2\p@ minus5\p@ \abovedisplayshortskip \z@ plus3\p@ \belowdisplayshortskip 6\p@ plus3\p@ minus3\p@ \def \leftmargin \leftmargini \topsep 4\p@ plus2\p@ minus2\p@ \parsep 2\p@ plus\p@ minus\p@ \itemsep \parsep {\leftmargin \leftmargini \topsep 6\p@ plus2\p@ minus2\p@ \parsep 3\p@ plus2\p@ minus\p@ \itemsep \parsep }\belowdisplayskip \abovedisplayskip Verkleinern des Graphen f\IeC {\"u}r $(\mathcal  {MST}_j^\text  {multi})$ \relax }}}
\@writefile{loa}{\contentsline {algocf}{\numberline {2}{\ignorespaces \relax \fontsize  {10}{12}\selectfont  \abovedisplayskip 10\p@ plus2\p@ minus5\p@ \abovedisplayshortskip \z@ plus3\p@ \belowdisplayshortskip 6\p@ plus3\p@ minus3\p@ \def \leftmargin \leftmargini \topsep 4\p@ plus2\p@ minus2\p@ \parsep 2\p@ plus\p@ minus\p@ \itemsep \parsep {\leftmargin \leftmargini \topsep 6\p@ plus2\p@ minus2\p@ \parsep 3\p@ plus2\p@ minus\p@ \itemsep \parsep }\belowdisplayskip \abovedisplayskip Verkleinern des Graphen f\IeC {\"u}r $(\mathcal  {MST}_j^\text  {multi})$ \relax }}}
\@writefile{loa}{\contentsline {algocf}{\numberline {2}{\ignorespaces \relax \fontsize  {10}{12}\selectfont  \abovedisplayskip 10\p@ plus2\p@ minus5\p@ \abovedisplayshortskip \z@ plus3\p@ \belowdisplayshortskip 6\p@ plus3\p@ minus3\p@ \def \leftmargin \leftmargini \topsep 4\p@ plus2\p@ minus2\p@ \parsep 2\p@ plus\p@ minus\p@ \itemsep \parsep {\leftmargin \leftmargini \topsep 6\p@ plus2\p@ minus2\p@ \parsep 3\p@ plus2\p@ minus\p@ \itemsep \parsep }\belowdisplayskip \abovedisplayskip Verkleinern des Graphen f\IeC {\"u}r $(\mathcal  {MST}_j^\text  {multi})$ \relax }}}
\@writefile{loa}{\contentsline {algocf}{\numberline {2}{\ignorespaces \relax \fontsize  {10}{12}\selectfont  \abovedisplayskip 10\p@ plus2\p@ minus5\p@ \abovedisplayshortskip \z@ plus3\p@ \belowdisplayshortskip 6\p@ plus3\p@ minus3\p@ \def \leftmargin \leftmargini \topsep 4\p@ plus2\p@ minus2\p@ \parsep 2\p@ plus\p@ minus\p@ \itemsep \parsep {\leftmargin \leftmargini \topsep 6\p@ plus2\p@ minus2\p@ \parsep 3\p@ plus2\p@ minus\p@ \itemsep \parsep }\belowdisplayskip \abovedisplayskip Verkleinern des Graphen f\IeC {\"u}r $(\mathcal  {MST}_j^\text  {multi})$ \relax }}}
\@writefile{loa}{\contentsline {algocf}{\numberline {2}{\ignorespaces \relax \fontsize  {10}{12}\selectfont  \abovedisplayskip 10\p@ plus2\p@ minus5\p@ \abovedisplayshortskip \z@ plus3\p@ \belowdisplayshortskip 6\p@ plus3\p@ minus3\p@ \def \leftmargin \leftmargini \topsep 4\p@ plus2\p@ minus2\p@ \parsep 2\p@ plus\p@ minus\p@ \itemsep \parsep {\leftmargin \leftmargini \topsep 6\p@ plus2\p@ minus2\p@ \parsep 3\p@ plus2\p@ minus\p@ \itemsep \parsep }\belowdisplayskip \abovedisplayskip Verkleinern des Graphen f\IeC {\"u}r $(\mathcal  {MST}_j^\text  {multi})$ \relax }}}
\@writefile{loa}{\contentsline {algocf}{\numberline {2}{\ignorespaces \relax \fontsize  {10}{12}\selectfont  \abovedisplayskip 10\p@ plus2\p@ minus5\p@ \abovedisplayshortskip \z@ plus3\p@ \belowdisplayshortskip 6\p@ plus3\p@ minus3\p@ \def \leftmargin \leftmargini \topsep 4\p@ plus2\p@ minus2\p@ \parsep 2\p@ plus\p@ minus\p@ \itemsep \parsep {\leftmargin \leftmargini \topsep 6\p@ plus2\p@ minus2\p@ \parsep 3\p@ plus2\p@ minus\p@ \itemsep \parsep }\belowdisplayskip \abovedisplayskip Verkleinern des Graphen f\IeC {\"u}r $(\mathcal  {MST}_j^\text  {multi})$ \relax }}}
\@writefile{nav}{\headcommand {\slideentry {2}{2}{10}{50/57}{Formulierungen mit Bl\IeC {\"o}cken}{0}}}
\@writefile{nav}{\headcommand {\beamer@framepages {50}{57}}}
\@writefile{nav}{\headcommand {\slideentry {2}{2}{11}{58/61}{Formulierungen mit Bl\IeC {\"o}cken}{0}}}
\@writefile{nav}{\headcommand {\beamer@framepages {58}{61}}}
\@writefile{nav}{\headcommand {\slideentry {2}{2}{12}{62/63}{Formulierungen mit Bl\IeC {\"o}cken}{0}}}
\@writefile{nav}{\headcommand {\beamer@framepages {62}{63}}}
\@writefile{nav}{\headcommand {\slideentry {2}{2}{13}{64/64}{Formulierungen mit Bl\IeC {\"o}cken}{0}}}
\@writefile{nav}{\headcommand {\beamer@framepages {64}{64}}}
\@writefile{nav}{\headcommand {\slideentry {2}{2}{14}{65/67}{Formulierungen mit Bl\IeC {\"o}cken}{0}}}
\@writefile{nav}{\headcommand {\beamer@framepages {65}{67}}}
\@writefile{toc}{\beamer@subsubsectionintoc {2}{2}{2}{Rucksack-Problem}{68}{0}{2}}
\@writefile{nav}{\headcommand {\beamer@subsubsectionentry {0}{2}{2}{2}{68}{Rucksack-Problem}}}
\@writefile{nav}{\headcommand {\slideentry {2}{2}{15}{68/69}{Formulierungen mit Bl\IeC {\"o}cken}{0}}}
\@writefile{nav}{\headcommand {\beamer@framepages {68}{69}}}
\@writefile{nav}{\headcommand {\slideentry {2}{2}{16}{70/71}{Formulierungen mit Bl\IeC {\"o}cken}{0}}}
\@writefile{nav}{\headcommand {\beamer@framepages {70}{71}}}
\@writefile{toc}{\beamer@subsectionintoc {2}{3}{Wahl der Bl\IeC {\"o}cke}{72}{0}{2}}
\@writefile{nav}{\headcommand {\beamer@subsectionentry {0}{2}{3}{72}{Wahl der Bl\IeC {\"o}cke}}\headcommand {\beamer@subsectionpages {30}{71}}}
\@writefile{nav}{\headcommand {\slideentry {2}{3}{1}{72/78}{Wahl der Bl\IeC {\"o}cke}{0}}}
\@writefile{nav}{\headcommand {\beamer@framepages {72}{78}}}
\@writefile{nav}{\headcommand {\slideentry {2}{3}{2}{79/80}{Wahl der Bl\IeC {\"o}cke}{0}}}
\@writefile{nav}{\headcommand {\beamer@framepages {79}{80}}}
\newlabel{verbesserung:induktion}{{6}{81}{}{Doc-Start}{}}
\@writefile{snm}{\beamer@slide {verbesserung:induktion}{81}}
\@writefile{nav}{\headcommand {\slideentry {2}{3}{3}{81/81}{Wahl der Bl\IeC {\"o}cke}{0}}}
\@writefile{nav}{\headcommand {\beamer@framepages {81}{81}}}
\@writefile{nav}{\headcommand {\slideentry {2}{3}{4}{82/84}{Wahl der Bl\IeC {\"o}cke}{0}}}
\@writefile{nav}{\headcommand {\beamer@framepages {82}{84}}}
\@writefile{nav}{\headcommand {\slideentry {2}{3}{5}{85/89}{Wahl der Bl\IeC {\"o}cke}{0}}}
\@writefile{nav}{\headcommand {\beamer@framepages {85}{89}}}
\@writefile{nav}{\headcommand {\slideentry {2}{3}{6}{90/95}{Wahl der Bl\IeC {\"o}cke}{0}}}
\@writefile{nav}{\headcommand {\beamer@framepages {90}{95}}}
\citation{schoebel2017}
\citation{schoebel2017}
\@writefile{nav}{\headcommand {\slideentry {2}{3}{7}{96/97}{Wahl der Bl\IeC {\"o}cke}{0}}}
\@writefile{nav}{\headcommand {\beamer@framepages {96}{97}}}
\@writefile{nav}{\headcommand {\slideentry {2}{3}{8}{98/100}{Wahl der Bl\IeC {\"o}cke}{0}}}
\@writefile{nav}{\headcommand {\beamer@framepages {98}{100}}}
\@writefile{nav}{\headcommand {\slideentry {2}{3}{9}{101/101}{Wahl der Bl\IeC {\"o}cke}{0}}}
\@writefile{nav}{\headcommand {\beamer@framepages {101}{101}}}
\@writefile{nav}{\headcommand {\slideentry {2}{3}{10}{102/105}{Wahl der Bl\IeC {\"o}cke}{0}}}
\@writefile{nav}{\headcommand {\beamer@framepages {102}{105}}}
\@writefile{nav}{\headcommand {\slideentry {2}{3}{11}{106/108}{Wahl der Bl\IeC {\"o}cke}{0}}}
\@writefile{nav}{\headcommand {\beamer@framepages {106}{108}}}
\@writefile{nav}{\headcommand {\slideentry {2}{3}{12}{109/111}{Wahl der Bl\IeC {\"o}cke}{0}}}
\@writefile{nav}{\headcommand {\beamer@framepages {109}{111}}}
\@writefile{loa}{\contentsline {algocf}{\numberline {3}{\ignorespaces Verfahren mit einer zuf\IeC {\"a}lligen Blockwahl\relax }}}
\@writefile{loa}{\contentsline {algocf}{\numberline {3}{\ignorespaces Verfahren mit einer zuf\IeC {\"a}lligen Blockwahl\relax }}}
\@writefile{loa}{\contentsline {algocf}{\numberline {3}{\ignorespaces Verfahren mit einer zuf\IeC {\"a}lligen Blockwahl\relax }}}
\@writefile{nav}{\headcommand {\slideentry {2}{3}{13}{112/114}{Wahl der Bl\IeC {\"o}cke}{0}}}
\@writefile{nav}{\headcommand {\beamer@framepages {112}{114}}}
\@writefile{nav}{\headcommand {\slideentry {2}{3}{14}{115/119}{Wahl der Bl\IeC {\"o}cke}{0}}}
\@writefile{nav}{\headcommand {\beamer@framepages {115}{119}}}
\@writefile{nav}{\headcommand {\slideentry {2}{3}{15}{120/124}{Wahl der Bl\IeC {\"o}cke}{0}}}
\@writefile{nav}{\headcommand {\beamer@framepages {120}{124}}}
\@writefile{nav}{\headcommand {\slideentry {2}{3}{16}{125/128}{Wahl der Bl\IeC {\"o}cke}{0}}}
\@writefile{nav}{\headcommand {\beamer@framepages {125}{128}}}
\@writefile{toc}{\beamer@sectionintoc {3}{Ergebnisse}{129}{0}{3}}
\@writefile{nav}{\headcommand {\sectionentry {3}{Ergebnisse}{129}{Ergebnisse}{0}}}
\@writefile{nav}{\headcommand {\beamer@sectionpages {11}{128}}}
\@writefile{nav}{\headcommand {\beamer@subsectionpages {72}{128}}}
\@writefile{nav}{\headcommand {\slideentry {3}{0}{1}{129/129}{}{0}}}
\@writefile{nav}{\headcommand {\beamer@framepages {129}{129}}}
\@writefile{nav}{\headcommand {\slideentry {3}{0}{2}{130/134}{}{0}}}
\@writefile{nav}{\headcommand {\beamer@framepages {130}{134}}}
\@writefile{nav}{\headcommand {\slideentry {3}{0}{3}{135/137}{}{0}}}
\@writefile{nav}{\headcommand {\beamer@framepages {135}{137}}}
\@writefile{nav}{\headcommand {\slideentry {3}{0}{4}{138/139}{}{0}}}
\@writefile{nav}{\headcommand {\beamer@framepages {138}{139}}}
\@writefile{nav}{\headcommand {\slideentry {3}{0}{5}{140/143}{}{0}}}
\@writefile{nav}{\headcommand {\beamer@framepages {140}{143}}}
\@writefile{nav}{\headcommand {\slideentry {3}{0}{6}{144/149}{}{0}}}
\@writefile{nav}{\headcommand {\beamer@framepages {144}{149}}}
\@writefile{nav}{\headcommand {\slideentry {3}{0}{7}{150/156}{}{0}}}
\@writefile{nav}{\headcommand {\beamer@framepages {150}{156}}}
\@writefile{nav}{\headcommand {\slideentry {3}{0}{8}{157/164}{}{0}}}
\@writefile{nav}{\headcommand {\beamer@framepages {157}{164}}}
\@writefile{nav}{\headcommand {\slideentry {3}{0}{9}{165/167}{}{0}}}
\@writefile{nav}{\headcommand {\beamer@framepages {165}{167}}}
\@writefile{toc}{\beamer@sectionintoc {4}{Schluss}{168}{0}{4}}
\@writefile{nav}{\headcommand {\sectionentry {4}{Schluss}{168}{Schluss}{0}}}
\@writefile{nav}{\headcommand {\beamer@sectionpages {129}{167}}}
\@writefile{nav}{\headcommand {\beamer@subsectionpages {129}{167}}}
\@writefile{nav}{\headcommand {\slideentry {4}{0}{1}{168/168}{}{0}}}
\@writefile{nav}{\headcommand {\beamer@framepages {168}{168}}}
\@writefile{nav}{\headcommand {\slideentry {4}{0}{2}{169/171}{}{0}}}
\@writefile{nav}{\headcommand {\beamer@framepages {169}{171}}}
\bibdata{literatur}
\bibcite{schoebel2017}{\hyperlink {beamerbibschoebel2017}{JS17}}
\bibstyle{alphadin}
\@writefile{nav}{\headcommand {\slideentry {4}{0}{3}{172/172}{}{0}}}
\@writefile{nav}{\headcommand {\beamer@framepages {172}{172}}}
\@writefile{nav}{\headcommand {\beamer@partpages {1}{172}}}
\@writefile{nav}{\headcommand {\beamer@subsectionpages {168}{172}}}
\@writefile{nav}{\headcommand {\beamer@sectionpages {168}{172}}}
\@writefile{nav}{\headcommand {\beamer@documentpages {172}}}
\@writefile{nav}{\headcommand {\def \inserttotalframenumber {57}}}
