"0",""
"0","riechen_df <- LC_df %>% select(SIC, contains(""RIECHEN"")) %>%"
"0","  mutate(riechen_score = LC_RIECHEN_F0030)"
"0",""
"0","LC_df <- LC_df %>% mutate(olfaction_score = riechen_df$riechen_score)"
"0",""
"0","ggplot(data = LC_df) + geom_freqpoly(aes(olfaction_score))"
