"0","for(index in seq_along(perplexities)){
  # euclid_dist <- dist(preprocessed_mix_samples[[sample]] %>% select(where(is.numeric)) %>% as_tibble(), method = ""euclidean"") %>%
  #   as.matrix(.)
  # dist_m <- hamming_dist + euclid_dist
 rtsne_vars[[sprintf(""%s_%d"", ""all_cat"",index)]] <- optiRtsne::Rtsne(cat_dist, perplexity = perplexities[[index]], eta = nrow(cat_dist)/12, stop_lying_iter = 200, mom_switch_iter = 200, max_iter = 2000, pca = FALSE, check_duplicates = FALSE, is_distance = TRUE)
 
 # rtsne_dist[[index]] <- optiRtsne::Rtsne(dist_m, perplexity = perplexities[[index]], eta = nrow(test_df)/12, stop_lying_iter = 200, mom_switch_iter = 200, max_iter = 2000, pca = FALSE, is_distance = TRUE)
 
 # print(fviz_nbclust(as_tibble(rtsne_dist[[index]]$Y), cluster::pam, method = ""silhouette"")+ theme_classic())
 # plot <- ggplot(rtsne_dist[[index]]$Y %>% as_tibble()) + geom_point(aes(V1, V2)) + theme_cowplot()
 # print(plot)
 
  print(fviz_nbclust(as_tibble(rtsne_vars[[sprintf(""%s_%d"", ""all_cat"",index)]]$Y), 
                     cluster::pam, method = ""silhouette"")+ theme_classic())
 plot <- ggplot(rtsne_vars[[sprintf(""%s_%d"", ""all_cat"",index)]]$Y %>% 
                  as_tibble()) + geom_point(aes(V1, V2)) + theme_cowplot() + 
   ggtitle(sprintf(""%s_%d"", ""all_cat"",index))
 print(plot)
 }
"
"1","Perplexity should be lower than K!
"
"1","got to max_iter with 22"
"1","got to max_iter with 22"
"1","got to max_iter with 24"
