"0","for(perplexity in of_interest){"
"0","  embedded_space <- as_tibble(rtsne_object[[perplexity]]$Y) %>%"
"0","    mutate(symptom_number = as.numeric(LC_df$`LC_#symptoms`))"
"0","  plot <- ggplot(data = embedded_space) + "
"0","    geom_point(aes(V1, V2, colour = symptom_number)) +"
"0","    theme_cowplot()"
"0","  print(plot) "
"0","}"
