"0","alk_df <- LC_df %>% select(contains(""ALK_F"")) %>% "
"0","  mutate(LC_ALK_F0009 = case_when(LC_ALK_F0009 == ""0"" ~ 0,"
"0","                                  LC_ALK_F0009 == ""1"" ~ 1,"
"0","                                  LC_ALK_F0009 == ""2"" ~ 2,"
"0","                                  LC_ALK_F0009 == ""3"" ~ 3,"
"0","                                  LC_ALK_F0009 == ""4"" ~ 4,"
"0","                                  TRUE ~ NA_integer_), "
"0","         LC_ALK_F0010 = case_when(LC_ALK_F0010 == ""0"" ~ 0,"
"0","                                  LC_ALK_F0010 == ""1"" ~ 1,"
"0","                                  LC_ALK_F0010 == ""2"" ~ 2,"
"0","                                  LC_ALK_F0010 == ""3"" ~ 3,"
"0","                                  LC_ALK_F0010 == ""4"" ~ 4,"
"0","                                  TRUE ~ NA_integer_),"
"0","         LC_ALK_F0011 = case_when(LC_ALK_F0011 == ""0"" ~ 0,"
"0","                                  LC_ALK_F0011 == ""1"" ~ 1,"
"0","                                  LC_ALK_F0011 == ""2"" ~ 2,"
"0","                                  LC_ALK_F0011 == ""3"" ~ 3,"
"0","                                  LC_ALK_F0011 == ""4"" ~ 4,"
"0","                                  TRUE ~ NA_integer_),"
"0","         LC_ALK_F0012 = case_when(LC_ALK_F0012 == ""0"" ~ 0,"
"0","                                  LC_ALK_F0012 == ""1"" ~ 1,"
"0","                                  LC_ALK_F0012 == ""2"" ~ 2,"
"0","                                  LC_ALK_F0012 == ""3"" ~ 3,"
"0","                                  LC_ALK_F0012 == ""4"" ~ 4,"
"0","                                  TRUE ~ NA_integer_),"
"0","         LC_ALK_F0013 = case_when(LC_ALK_F0013 == ""0"" ~ 0,"
"0","                                  LC_ALK_F0013 == ""1"" ~ 1,"
"0","                                  LC_ALK_F0013 == ""2"" ~ 2,"
"0","                                  LC_ALK_F0013 == ""3"" ~ 3,"
"0","                                  LC_ALK_F0013 == ""4"" ~ 4,"
"0","                                  TRUE ~ NA_integer_),"
"0","         LC_ALK_F0014 = case_when(LC_ALK_F0014 == ""0"" ~ 0,"
"0","                                  LC_ALK_F0014 == ""1"" ~ 1,"
"0","                                  LC_ALK_F0014 == ""2"" ~ 2,"
"0","                                  LC_ALK_F0014 == ""3"" ~ 3,"
"0","                                  LC_ALK_F0014 == ""4"" ~ 4,"
"0","                                  TRUE ~ NA_integer_),"
"0","         LC_ALK_F0015 = case_when(LC_ALK_F0015 == ""0"" ~ 0,"
"0","                                  LC_ALK_F0015 == ""1"" ~ 1,"
"0","                                  LC_ALK_F0015 == ""2"" ~ 2,"
"0","                                  LC_ALK_F0015 == ""3"" ~ 3,"
"0","                                  LC_ALK_F0015 == ""4"" ~ 4,"
"0","                                  TRUE ~ NA_integer_),"
"0","         LC_ALK_F0016 = case_when(LC_ALK_F0016 == ""0"" ~ 0,"
"0","                                  LC_ALK_F0016 == ""1"" ~ 1,"
"0","                                  LC_ALK_F0016 == ""2"" ~ 2,"
"0","                                  LC_ALK_F0016 == ""3"" ~ 3,"
"0","                                  LC_ALK_F0016 == ""4"" ~ 4,"
"0","                                  TRUE ~ NA_integer_),"
"0","         LC_ALK_F0017 = case_when(LC_ALK_F0017 == ""0"" ~ 0,"
"0","                                  LC_ALK_F0017 == ""1"" ~ 1,"
"0","                                  LC_ALK_F0017 == ""2"" ~ 2,"
"0","                                  LC_ALK_F0017 == ""3"" ~ 3,"
"0","                                  LC_ALK_F0017 == ""4"" ~ 4,"
"0","                                  TRUE ~ NA_integer_),"
"0","         LC_ALK_F0018 = case_when(LC_ALK_F0018 == ""0"" ~ 0,"
"0","                                  LC_ALK_F0018 == ""1"" ~ 1,"
"0","                                  LC_ALK_F0018 == ""2"" ~ 2,"
"0","                                  LC_ALK_F0018 == ""3"" ~ 3,"
"0","                                  LC_ALK_F0018 == ""4"" ~ 4,"
"0","                                  TRUE ~ NA_integer_),)"
"0","#TODO always check visually if applicable for current sample"
"0","alk_df[is.na(alk_df)] <- 0"
"0","alk_df <- alk_df %>% mutate(alc_score = rowSums(across(LC_ALK_F0009:LC_ALK_F0018)))"
"0",""
"0","LC_df <- LC_df %>% mutate(alc_score = alk_df$alc_score)"
"0",""
"0","ggplot(data = LC_df) + geom_freqpoly(aes(x = alc_score))"
