"0",""
"0","ess_df <- LC_df %>% select(SIC, contains(""ESS""))"
"0",""
"0","ess_score <- ess_df %>% select(LC_ESS_I01:LC_ESS_I08) %>%"
"0","  mutate(ess_score = rowSums(across(where(is.numeric)), na.rm = TRUE))"
"0",""
"0","LC_df <- LC_df %>% mutate(ess_score = ess_score$ess_score)"
"0",""
"0","ggplot(data=LC_df) + geom_freqpoly(aes(x = ess_score))"
