"0","# import data with dates - we know that scanner types changes after 05.12.2022"
"0","dates_df <- read.table(""/data/pt_02571/Data/preprocessed/fixel_analysis/PV712_ids_dates"", sep = "","", header = TRUE)"
"0","dates_df <- merge(LC_df, as_tibble(dates_df), by = ""LI_Nr"")"
"0",""
"0","# make a df for differentiating skyra vs. verio. "
"0","# We will also use this df to select suitable candidates for the FOD template."
"0","# for dates, > sign is translated into >= sign - don't know why..."
"0","select_df <- tibble(prolonged_symptoms = dates_df$LC_REHABNEQ_F0055.x,"
"0","       symptoms = dates_df$`LC_#symptoms`, cov_pos = dates_df$Cov_pos,"
"0","       duration = dates_df$LC_STATUS_DURATION, date = dates_df$Exp_Date.y, "
"0","       sex = dates_df$sex_score, "
"0","       age = dates_df$age_score,"
"0","       LI_Nr = dates_df$LI_Nr) %>% "
"0","  mutate(skyra = case_when(date > ""2022-12-06"" ~ 1, .default = 0))  %>%"
"0","  mutate(symptoms = as.character(symptoms)) %>% mutate(symptoms = as.numeric(symptoms)) %>%"
"0","  filter(LI_Nr != ""LI08862673"")"
"0",""
"0",""
"0",""
"0","#cut(LC_df$age_score, "
"0","                   #breaks=c(-Inf, 28, 38, 48, 58, 68, 78, Inf))"
"0",""
