"0","cmd_1 <- ""tcksift tracks_20_million.tck wmfod_template.mif tracks_2_million_sift.tck -term_number 2000000"""
"0","cmd_2 <- ""fixelconnectivity fixel_mask/ tracks_2_million_sift.tck matrix/"""
"0","mem_req <- 100000"
"0","tim_req <- ""1-20:00"""
"0","fn_sh <- file.path(slurm_dir, ""20_21_fixel_connectivity.sh"")"
"0","con <- file(fn_sh)"
"0","open(con, ""w"")"
"0","writeLines(c(sprintf(""#!/bin/bash\n#""),"
"0","                    sprintf(""#SBATCH -n 4""),"
"0","                    sprintf(""#SBATCH -N 1""),"
"0","                    sprintf(""#SBATCH --mem=%d"", mem_req),"
"0","                    sprintf(""#SBATCH --time=%s"", tim_req),"
"0","                    sprintf(""#SBATCH --job-name fod_temp""),"
"0","                    sprintf(""#SBATCH --mail-type=begin""),"
"0","                    sprintf(""#SBATCH --mail-type=end""),"
"0","                    sprintf(""#SBATCH --mail-type=fail""),"
"0","                    sprintf(""#SBATCH --mail-user=%s@cbs.mpg.de"", system(""echo $USER"", intern = TRUE)),"
"0","                    sprintf(""#SBATCH -o %s/sift.out"", "
"0","                             slurm_dir),"
"0","                    sprintf(""#SBATCH -e %s/sift.err\n"", "
"0","                             slurm_dir)"
"0","                     ), con)"
"0","        "
"0","        # write the film_gls command to the sbatch file "
"0","        writeLines(cmd_1, con, sep = ""\n"")"
"0","        writeLines(cmd_2, con, sep = ""\n\n"")"
"0","        "
"0","        # close connection and make sbatch file executable"
"0","        close(con)"
"0","        system(sprintf(""chmod +x %s"",fn_sh))"
"0","        "
"0","        # submit to slurm"
"0","        system(sprintf(""sbatch %s"",fn_sh))"
"1","Submitted batch job 167759
"
