"0","  LC_df <- LC_df %>% mutate(tmt_a_score = LC_TMT_F0011, "
"0","                            tmt_b_score = LC_TMT_F0014,"
"0","                            tmt_score = tmt_b_score/tmt_a_score)"
"0","plot = ggplot(data=LC_df) + geom_freqpoly(aes(x=tmt_score))"
"0","print(plot)"
