"0","library(PCAmixdata)"
"0","#library(tidyverse)"
"0","library(cowplot)"
"2","
Attaching package: ‘cowplot’

"
"2","The following object is masked from ‘package:lubridate’:

    stamp

"
"0","pca_mix_object <- list()"
"0",""
"0","for(quant_name in samples){"
"0","    tmp_df <-  preprocessed_mix_samples[[quant_name]]"
"0","    tmp_quanti_df <- preprocessed_mix_samples[[quant_name]] %>%"
"0","      select(where(is.numeric)) %>% as_tibble()"
"0","    tmp_quali_df <- preprocessed_mix_samples[[quant_name]] %>%"
"0","      select(where(is.factor))"
"0","    "
"0","    "
"0","    if(!(ncol(tmp_quanti_df) == 0) & ncol(tmp_quali_df) == 0){"
"0","      pca_mix_object[[quant_name]] <- PCAmix(tmp_quanti_df %>% as.matrix(.), ndim = 50)"
"0","      "
"0","    } else if((ncol(tmp_quanti_df) == 0) & !(ncol(tmp_quali_df) == 0)){"
"0","      tmp_quali_df <- tmp_quali_df %>% mutate(across(all_of(colnames(.)), as.factor))"
"0","      pca_mix_object[[quant_name]] <- PCAmix(X.quali = tmp_quali_df, rename.level = TRUE, "
"0","                                             ndim = 50)"
"0","    }"
"0","      else if(!(ncol(tmp_quanti_df) == 0) & !(ncol(tmp_quali_df) == 0)){"
"0","      tmp_quali_df <- tmp_quali_df %>% mutate(across(all_of(colnames(.)), as.factor))"
"0","      pca_mix_object[[quant_name]] <- PCAmix(X.quanti = tmp_quanti_df %>% as.matrix(.),"
"0","                                             X.quali = tmp_quali_df, rename.level = TRUE,"
"0","                                             ndim = 50)"
"0","    } else{"
"0","      print(""missed some constellation"")"
"0","    }"
"0","    "
"0","    if(!(ncol(tmp_quanti_df) == 0)){"
"0","      plot_df <- tibble(pc1 = pca_mix_object[[quant_name]]$coef$dim1, "
"0","                      pc2 = pca_mix_object[[quant_name]]$coef$dim2)"
"0","      plot <- ggplot(plot_df) +"
"0","        geom_point(aes(pc1, pc2), size = 1.5) +"
"0","        labs(title = sprintf(""%s coef plot"",quant_name)) +"
"0","        theme_half_open(12) + background_grid()"
"0","      print(plot)"
"0","      print(as_tibble(pca_mix_object[[quant_name]]$quanti$cos2)^(1/2))"
"0","    }"
"0","    "
"0","    #print(as_tibble(pca_mix_object[[quant_name]]$quanti$cos2)^(1/2))"
"0","    print(tmp_df)"
"0","}"
