"0",""
"0","mfi_df <- LC_df %>% select(SIC, contains(""MFI"")) %>%"
"0","  # preprocess inverted items"
"0","  mutate(LC_MFI20_I02 = abs(LC_MFI20_I02 - 6),"
"0","         LC_MFI20_I05 = abs(LC_MFI20_I05 - 6),"
"0","         LC_MFI20_I09 = abs(LC_MFI20_I09 - 6),"
"0","         LC_MFI20_I10 = abs(LC_MFI20_I10 - 6),"
"0","         LC_MFI20_I13 = abs(LC_MFI20_I13 - 6),"
"0","         LC_MFI20_I14 = abs(LC_MFI20_I14 - 6),"
"0","         LC_MFI20_I16 = abs(LC_MFI20_I16 - 6),"
"0","         LC_MFI20_I17 = abs(LC_MFI20_I17 - 6),"
"0","         LC_MFI20_I18 = abs(LC_MFI20_I18 - 6),"
"0","         LC_MFI20_I19 = abs(LC_MFI20_I19 - 6)) %>%"
"0","  # get scores for 5 subscales"
"0","  mutate(general_fatigue_score = LC_MFI20_I01 + LC_MFI20_I05 + LC_MFI20_I12 + LC_MFI20_I16,"
"0","         physical_fatigue_score = LC_MFI20_I02 + LC_MFI20_I08 + LC_MFI20_I14 + LC_MFI20_I20,"
"0","         reduced_motivation_score = LC_MFI20_I04 + LC_MFI20_I09 + LC_MFI20_I15 + LC_MFI20_I18,"
"0","         reduced_activity_score = LC_MFI20_I03 + LC_MFI20_I06 + LC_MFI20_I10 + LC_MFI20_I17,"
"0","         mental_fatigue_score = LC_MFI20_I07 + LC_MFI20_I11 + LC_MFI20_I13 + LC_MFI20_I19)"
"0","LC_df <- LC_df %>% mutate(general_fatigue_score = mfi_df$general_fatigue_score,"
"0","                          physical_fatigue_score = mfi_df$physical_fatigue_score,"
"0","                          reduced_motivation_score = mfi_df$reduced_motivation_score,"
"0","                          reduced_activity_score  = mfi_df$reduced_activity_score,"
"0","                          mental_fatigue_score = mfi_df$mental_fatigue_score)"
"0","for (fatigue in c(""general_fatigue_score"", "
"0","                  ""physical_fatigue_score"", "
"0","                  ""reduced_motivation_score"", "
"0","                  ""reduced_activity_score"", "
"0","                  ""mental_fatigue_score"")){"
"0","  plot = ggplot(data=LC_df) + geom_freqpoly(aes_string(x=fatigue))"
"0","  print(plot)"
"0","}"
