"0",""
"0","wl_df <- LC_df %>% select(SIC, contains(""WL"")) "
"0","wl_score <- wl_df %>% "
"0","  mutate(learning_score = rowSums(across(LC_WL_F0023:LC_WL_F0032)) + "
"0","           rowSums(across(LC_WL_F0040:LC_WL_F0049)) +"
"0","           rowSums(across(LC_WL_F0057:LC_WL_F0066)),"
"0","         recognition_score = rowSums(across(LC_WL_F0102:LC_WL_F0121)),"
"0","         recall_score = rowSums(across(LC_WL_F0085:LC_WL_F0094))) #%>%"
"0","  #select(-(LC_WL_F0102:LC_WL_F0121), LC_WL_F0085:LC_WL_F0094)"
"0",""
"0","LC_df <- LC_df %>% mutate(learning_score = wl_score$learning_score,"
"0","                          recognition_score = wl_score$recognition_score, "
"0","                          recall_score = wl_score$recall_score)"
"0",""
"0","for (cerad in c(""learning_score"", ""recognition_score"", ""recall_score"")){"
"0","  plot = ggplot(data=LC_df) + geom_freqpoly(aes_string(x=cerad))"
"0","  print(plot)"
"0","}"
