"0",""
"0","moca_df <- LC_df %>% select(SIC, contains(""MOCA2"")) %>%"
"0","  select(-contains(""F0032""), "
"0","         -contains(""F0033""), "
"0","         -contains(""F0034""), "
"0","         -contains(""F0035""), "
"0","         -contains(""F0036"")) "
"0","moca_score <- moca_df %>% select(LC_MOCA2_F0010:LC_MOCA2_F0053) %>% "
"0","  select(-(LC_MOCA2_F0019:LC_MOCA2_F0028)) %>%"
"0","  mutate(moca_score = rowSums(across(where(is.numeric)), na.rm = TRUE)) "
"0",""
"0","moca_score$moca_score[moca_score$moca_score == 0] <- NA"
"0",""
"0","ggplot(data = moca_score) + geom_freqpoly(aes(x = moca_score^2))"
