SNP	Effect_allele	Effect
rs6503417:43144218:T:C	C	0.052
rs12921170:87227397:G:A	A	0.05
rs17205972:82859065:G:T	T	0.049
rs62172472:188028317:G:A	G	0.047
rs2303655:121518378:T:C	T	0.048
rs1948948:51442679:C:T	C	0.037
rs1285847:91884655:T:C	T	0.036
rs73184312:8179639:G:A	G	0.038
rs71471298:105507145:C:T	T	0.053
rs6540873:215137222:A:C	A	0.027
rs5762197:27887471:A:C	C	0.039
rs12443113:65355468:G:A	G	0.031
rs11249945:9628753:G:A	A	0.034
rs72680374:52604843:T:A	T	0.032
rs7004825:11031472:T:C	T	0.031
rs786921:89286673:G:A	A	0.033
rs34974290:73888354:G:A	A	0.104
rs7596872:56128091:C:A	A	0.097
rs6940540:151018909:T:G	G	0.045
rs73923006:43132224:G:C	G	0.055
rs4630220:105459116:G:A	G	0.048
rs7603972:203780515:A:G	A	0.07
rs10786772:105610326:G:A	G	0.042
rs55940034:111043309:A:G	G	0.037
rs7157599:100625902:C:T	C	0.041
