{
    "groups": [
        {
            "name": "Group_00001",
            "procs": [
                0,
                1
            ],
            "total": 2
        }
    ],
    "links": [
        {
            "source": 0,
            "target": 1,
            "value": 1
        }
    ],
    "maxN": 2,
    "nodes": [
        {
            "group": 1,
            "name": "0_bet_inv2",
            "report": "/bet_inv2/_report/report.rst",
            "result": "/bet_inv2/result_bet_inv2.pklz"
        },
        {
            "group": 1,
            "name": "1_apply_inv2_mask",
            "report": "/apply_inv2_mask/_report/report.rst",
            "result": "/apply_inv2_mask/result_apply_inv2_mask.pklz"
        }
    ]
}