#Code #ROI
1 BG_h_1
2 BG_h_2
3 BG_h_3
4 BG_h_4
5 frontal_lh_1
6 frontal_lh_2
7 frontal_lh_3
8 frontal_lh_4
9 frontal_rh_1
10 frontal_rh_2
11 frontal_rh_3
12 frontal_rh_4
13 occipital_lh_1
14 occipital_lh_2
15 occipital_lh_3
16 occipital_lh_4
17 occipital_rh_1
18 occipital_rh_2
19 occipital_rh_3
20 occipital_rh_4
21 parietal_lh_1
22 parietal_lh_2
23 parietal_lh_3
24 parietal_lh_4
25 parietal_rh_1
26 parietal_rh_2
27 parietal_rh_3
28 parietal_rh_4
29 temporal_lh_1
30 temporal_lh_2
31 temporal_lh_3
32 temporal_lh_4
33 temporal_rh_1
34 temporal_rh_2
35 temporal_rh_3
36 temporal_rh_4
