<mxfile host="Electron" modified="2023-12-13T09:28:11.993Z" agent="Mozilla/5.0 (Windows NT 10.0; Win64; x64) AppleWebKit/537.36 (KHTML, like Gecko) draw.io/22.1.2 Chrome/114.0.5735.289 Electron/25.9.4 Safari/537.36" etag="1I-boy7y-_89K4UFxPe9" version="22.1.2" type="device">
  <diagram id="C5RBs43oDa-KdzZeNtuy" name="Page-1">
    <mxGraphModel dx="1958" dy="2339" grid="1" gridSize="10" guides="1" tooltips="1" connect="1" arrows="1" fold="1" page="1" pageScale="1" pageWidth="827" pageHeight="1169" background="#000000" math="0" shadow="0">
      <root>
        <mxCell id="WIyWlLk6GJQsqaUBKTNV-0" />
        <mxCell id="WIyWlLk6GJQsqaUBKTNV-1" parent="WIyWlLk6GJQsqaUBKTNV-0" />
        <mxCell id="QRIyFc3if9_uq3_3PtY6-41" value="" style="group;labelBackgroundColor=none;" parent="WIyWlLk6GJQsqaUBKTNV-1" vertex="1" connectable="0">
          <mxGeometry y="10" width="830" height="650" as="geometry" />
        </mxCell>
        <mxCell id="QRIyFc3if9_uq3_3PtY6-125" value="" style="rounded=1;whiteSpace=wrap;html=1;dashed=1;movable=1;resizable=1;rotatable=1;deletable=1;editable=1;locked=0;connectable=1;labelBackgroundColor=none;fillColor=none;" parent="QRIyFc3if9_uq3_3PtY6-41" vertex="1">
          <mxGeometry x="120" y="-10" width="610" height="660" as="geometry" />
        </mxCell>
        <mxCell id="QRIyFc3if9_uq3_3PtY6-3" value="" style="endArrow=none;html=1;rounded=1;entryX=0;entryY=1;entryDx=0;entryDy=-15;entryPerimeter=0;labelBackgroundColor=none;fontColor=default;" parent="QRIyFc3if9_uq3_3PtY6-41" target="QRIyFc3if9_uq3_3PtY6-0" edge="1">
          <mxGeometry width="50" height="50" relative="1" as="geometry">
            <mxPoint y="445" as="sourcePoint" />
            <mxPoint x="410" y="250" as="targetPoint" />
          </mxGeometry>
        </mxCell>
        <mxCell id="QRIyFc3if9_uq3_3PtY6-40" value="" style="group;labelBackgroundColor=none;" parent="QRIyFc3if9_uq3_3PtY6-41" vertex="1" connectable="0">
          <mxGeometry x="300" width="530" height="460" as="geometry" />
        </mxCell>
        <mxCell id="QRIyFc3if9_uq3_3PtY6-39" value="" style="group;labelBackgroundColor=none;" parent="QRIyFc3if9_uq3_3PtY6-40" vertex="1" connectable="0">
          <mxGeometry width="410" height="460" as="geometry" />
        </mxCell>
        <mxCell id="QRIyFc3if9_uq3_3PtY6-0" value="" style="shape=cylinder3;whiteSpace=wrap;html=1;boundedLbl=1;backgroundOutline=1;size=15;rounded=1;labelBackgroundColor=none;" parent="QRIyFc3if9_uq3_3PtY6-39" vertex="1">
          <mxGeometry x="190" y="150" width="60" height="310" as="geometry" />
        </mxCell>
        <mxCell id="QRIyFc3if9_uq3_3PtY6-4" value="" style="endArrow=none;html=1;rounded=1;entryX=1;entryY=1;entryDx=0;entryDy=-15;entryPerimeter=0;labelBackgroundColor=none;fontColor=default;" parent="QRIyFc3if9_uq3_3PtY6-40" target="QRIyFc3if9_uq3_3PtY6-0" edge="1">
          <mxGeometry width="50" height="50" relative="1" as="geometry">
            <mxPoint x="530" y="445" as="sourcePoint" />
            <mxPoint x="110" y="250" as="targetPoint" />
          </mxGeometry>
        </mxCell>
        <mxCell id="QRIyFc3if9_uq3_3PtY6-1" value="" style="ellipse;shape=cloud;whiteSpace=wrap;html=1;rounded=1;labelBackgroundColor=none;" parent="QRIyFc3if9_uq3_3PtY6-41" vertex="1">
          <mxGeometry x="300" width="410" height="190" as="geometry" />
        </mxCell>
        <mxCell id="QRIyFc3if9_uq3_3PtY6-139" value="Air&amp;nbsp; Temperature" style="rounded=1;whiteSpace=wrap;html=1;labelBackgroundColor=none;" parent="QRIyFc3if9_uq3_3PtY6-41" vertex="1">
          <mxGeometry x="170" y="410" width="80" height="30" as="geometry" />
        </mxCell>
        <mxCell id="QRIyFc3if9_uq3_3PtY6-141" value="&lt;div&gt;Soil Surface&lt;/div&gt;&lt;div&gt;Temperature&lt;/div&gt;" style="rounded=1;whiteSpace=wrap;html=1;labelBackgroundColor=none;" parent="QRIyFc3if9_uq3_3PtY6-41" vertex="1">
          <mxGeometry x="165" y="480" width="90" height="60" as="geometry" />
        </mxCell>
        <mxCell id="QRIyFc3if9_uq3_3PtY6-144" value="" style="endArrow=classic;startArrow=classic;html=1;rounded=0;exitX=0.5;exitY=0;exitDx=0;exitDy=0;entryX=0.5;entryY=1;entryDx=0;entryDy=0;labelBackgroundColor=none;fontColor=default;" parent="QRIyFc3if9_uq3_3PtY6-41" source="QRIyFc3if9_uq3_3PtY6-141" target="QRIyFc3if9_uq3_3PtY6-139" edge="1">
          <mxGeometry width="50" height="50" relative="1" as="geometry">
            <mxPoint x="290" y="310" as="sourcePoint" />
            <mxPoint x="340" y="260" as="targetPoint" />
          </mxGeometry>
        </mxCell>
        <mxCell id="QRIyFc3if9_uq3_3PtY6-145" value="&lt;div&gt;Conduction&lt;/div&gt;" style="edgeLabel;html=1;align=center;verticalAlign=middle;resizable=0;points=[];labelBackgroundColor=none;" parent="QRIyFc3if9_uq3_3PtY6-144" vertex="1" connectable="0">
          <mxGeometry x="0.1176" y="1" relative="1" as="geometry">
            <mxPoint as="offset" />
          </mxGeometry>
        </mxCell>
        <mxCell id="QRIyFc3if9_uq3_3PtY6-147" value="" style="endArrow=none;dashed=1;html=1;rounded=0;labelBackgroundColor=none;fontColor=default;" parent="QRIyFc3if9_uq3_3PtY6-41" edge="1">
          <mxGeometry width="50" height="50" relative="1" as="geometry">
            <mxPoint x="150" y="570" as="sourcePoint" />
            <mxPoint x="150" y="570" as="targetPoint" />
            <Array as="points">
              <mxPoint x="150" y="470" />
              <mxPoint x="340" y="470" />
              <mxPoint x="340" y="450" />
              <mxPoint x="420" y="450" />
              <mxPoint x="420" y="470" />
              <mxPoint x="420" y="570" />
            </Array>
          </mxGeometry>
        </mxCell>
        <mxCell id="QRIyFc3if9_uq3_3PtY6-9" value="" style="endArrow=classic;html=1;rounded=0;exitX=0.5;exitY=0;exitDx=0;exitDy=0;labelBackgroundColor=none;fontColor=default;" parent="QRIyFc3if9_uq3_3PtY6-41" edge="1">
          <mxGeometry width="50" height="50" relative="1" as="geometry">
            <mxPoint x="389.5" y="50" as="sourcePoint" />
            <mxPoint x="389.5" y="-50" as="targetPoint" />
          </mxGeometry>
        </mxCell>
        <mxCell id="QRIyFc3if9_uq3_3PtY6-10" value="Plant&lt;br&gt;&lt;div&gt;Evaporation&lt;/div&gt;" style="edgeLabel;html=1;align=center;verticalAlign=middle;resizable=0;points=[];labelBackgroundColor=none;" parent="QRIyFc3if9_uq3_3PtY6-9" vertex="1" connectable="0">
          <mxGeometry x="0.181" y="-1" relative="1" as="geometry">
            <mxPoint y="-1" as="offset" />
          </mxGeometry>
        </mxCell>
        <mxCell id="QRIyFc3if9_uq3_3PtY6-44" style="edgeStyle=orthogonalEdgeStyle;rounded=0;orthogonalLoop=1;jettySize=auto;html=1;exitX=0.5;exitY=1;exitDx=0;exitDy=0;entryX=0.5;entryY=0;entryDx=0;entryDy=0;labelBackgroundColor=none;fontColor=default;" parent="WIyWlLk6GJQsqaUBKTNV-1" source="WIyWlLk6GJQsqaUBKTNV-7" target="QRIyFc3if9_uq3_3PtY6-17" edge="1">
          <mxGeometry relative="1" as="geometry" />
        </mxCell>
        <mxCell id="QRIyFc3if9_uq3_3PtY6-45" value="Plant Evaporation" style="edgeLabel;html=1;align=center;verticalAlign=middle;resizable=0;points=[];labelBackgroundColor=none;" parent="QRIyFc3if9_uq3_3PtY6-44" vertex="1" connectable="0">
          <mxGeometry x="-0.0171" y="-1" relative="1" as="geometry">
            <mxPoint as="offset" />
          </mxGeometry>
        </mxCell>
        <mxCell id="QRIyFc3if9_uq3_3PtY6-131" style="edgeStyle=orthogonalEdgeStyle;rounded=0;orthogonalLoop=1;jettySize=auto;html=1;exitX=0.25;exitY=1;exitDx=0;exitDy=0;entryX=0.75;entryY=0;entryDx=0;entryDy=0;labelBackgroundColor=none;fontColor=default;" parent="WIyWlLk6GJQsqaUBKTNV-1" source="WIyWlLk6GJQsqaUBKTNV-7" target="QRIyFc3if9_uq3_3PtY6-13" edge="1">
          <mxGeometry relative="1" as="geometry" />
        </mxCell>
        <mxCell id="QRIyFc3if9_uq3_3PtY6-132" value="Infiltration" style="edgeLabel;html=1;align=center;verticalAlign=middle;resizable=0;points=[];labelBackgroundColor=none;" parent="QRIyFc3if9_uq3_3PtY6-131" vertex="1" connectable="0">
          <mxGeometry x="0.5044" y="4" relative="1" as="geometry">
            <mxPoint x="-4" y="79" as="offset" />
          </mxGeometry>
        </mxCell>
        <mxCell id="QRIyFc3if9_uq3_3PtY6-133" value="&lt;div&gt;Throughfall +&amp;nbsp;&lt;/div&gt;&lt;div&gt;Stemwaterflow&lt;br&gt;&lt;/div&gt;" style="edgeLabel;html=1;align=center;verticalAlign=middle;resizable=0;points=[];labelBackgroundColor=none;" parent="QRIyFc3if9_uq3_3PtY6-131" vertex="1" connectable="0">
          <mxGeometry x="-0.5221" y="-5" relative="1" as="geometry">
            <mxPoint x="5" y="65" as="offset" />
          </mxGeometry>
        </mxCell>
        <mxCell id="WIyWlLk6GJQsqaUBKTNV-7" value="Tree Water Layer" style="rounded=1;whiteSpace=wrap;html=1;fontSize=12;glass=0;strokeWidth=1;shadow=0;labelBackgroundColor=none;" parent="WIyWlLk6GJQsqaUBKTNV-1" vertex="1">
          <mxGeometry x="330" y="60" width="120" height="40" as="geometry" />
        </mxCell>
        <mxCell id="QRIyFc3if9_uq3_3PtY6-5" value="" style="endArrow=classic;html=1;rounded=1;entryX=0.25;entryY=0;entryDx=0;entryDy=0;labelBackgroundColor=none;fontColor=default;" parent="WIyWlLk6GJQsqaUBKTNV-1" target="WIyWlLk6GJQsqaUBKTNV-7" edge="1">
          <mxGeometry width="50" height="50" relative="1" as="geometry">
            <mxPoint x="360" y="-40" as="sourcePoint" />
            <mxPoint x="410" y="230" as="targetPoint" />
          </mxGeometry>
        </mxCell>
        <mxCell id="QRIyFc3if9_uq3_3PtY6-6" value="&lt;div&gt;Precipitation&lt;/div&gt;" style="edgeLabel;html=1;align=center;verticalAlign=middle;resizable=0;points=[];rounded=1;labelBackgroundColor=none;" parent="QRIyFc3if9_uq3_3PtY6-5" vertex="1" connectable="0">
          <mxGeometry x="-0.2286" y="1" relative="1" as="geometry">
            <mxPoint x="-11" y="31" as="offset" />
          </mxGeometry>
        </mxCell>
        <mxCell id="QRIyFc3if9_uq3_3PtY6-128" style="edgeStyle=orthogonalEdgeStyle;rounded=0;orthogonalLoop=1;jettySize=auto;html=1;exitX=1;exitY=0.75;exitDx=0;exitDy=0;labelBackgroundColor=none;fontColor=default;" parent="WIyWlLk6GJQsqaUBKTNV-1" source="QRIyFc3if9_uq3_3PtY6-13" edge="1">
          <mxGeometry relative="1" as="geometry">
            <mxPoint x="520" y="-40" as="targetPoint" />
          </mxGeometry>
        </mxCell>
        <mxCell id="QRIyFc3if9_uq3_3PtY6-129" value="Root Water Uptake" style="edgeLabel;html=1;align=center;verticalAlign=middle;resizable=0;points=[];labelBackgroundColor=none;" parent="QRIyFc3if9_uq3_3PtY6-128" vertex="1" connectable="0">
          <mxGeometry x="-0.8099" y="-1" relative="1" as="geometry">
            <mxPoint as="offset" />
          </mxGeometry>
        </mxCell>
        <mxCell id="QRIyFc3if9_uq3_3PtY6-130" value="Transpiration" style="edgeLabel;html=1;align=center;verticalAlign=middle;resizable=0;points=[];labelBackgroundColor=none;" parent="QRIyFc3if9_uq3_3PtY6-128" vertex="1" connectable="0">
          <mxGeometry x="0.1967" y="2" relative="1" as="geometry">
            <mxPoint x="2" y="-227" as="offset" />
          </mxGeometry>
        </mxCell>
        <mxCell id="QRIyFc3if9_uq3_3PtY6-13" value="&lt;div&gt;Soil Water Content&lt;/div&gt;" style="rounded=1;whiteSpace=wrap;html=1;labelBackgroundColor=none;" parent="WIyWlLk6GJQsqaUBKTNV-1" vertex="1">
          <mxGeometry x="280" y="490" width="120" height="60" as="geometry" />
        </mxCell>
        <mxCell id="QRIyFc3if9_uq3_3PtY6-16" value="" style="endArrow=classic;html=1;rounded=0;exitX=0.25;exitY=0;exitDx=0;exitDy=0;entryX=0.75;entryY=1;entryDx=0;entryDy=0;labelBackgroundColor=none;fontColor=default;" parent="WIyWlLk6GJQsqaUBKTNV-1" source="QRIyFc3if9_uq3_3PtY6-13" target="QRIyFc3if9_uq3_3PtY6-17" edge="1">
          <mxGeometry width="50" height="50" relative="1" as="geometry">
            <mxPoint x="350" y="310" as="sourcePoint" />
            <mxPoint x="310" y="350" as="targetPoint" />
          </mxGeometry>
        </mxCell>
        <mxCell id="QRIyFc3if9_uq3_3PtY6-124" value="&lt;div&gt;Soil Evaporation&lt;/div&gt;&lt;div&gt;&amp;amp; Latent Heat Flux&lt;br&gt;&lt;/div&gt;" style="edgeLabel;html=1;align=center;verticalAlign=middle;resizable=0;points=[];labelBackgroundColor=none;" parent="QRIyFc3if9_uq3_3PtY6-16" vertex="1" connectable="0">
          <mxGeometry x="-0.0472" relative="1" as="geometry">
            <mxPoint y="-22" as="offset" />
          </mxGeometry>
        </mxCell>
        <mxCell id="QRIyFc3if9_uq3_3PtY6-17" value="&lt;div&gt;Air Water Content&lt;/div&gt;&lt;div&gt;&amp;amp; Air Water Energy&lt;br&gt;&lt;/div&gt;" style="rounded=1;whiteSpace=wrap;html=1;labelBackgroundColor=none;" parent="WIyWlLk6GJQsqaUBKTNV-1" vertex="1">
          <mxGeometry x="220" y="310" width="120" height="60" as="geometry" />
        </mxCell>
        <mxCell id="QRIyFc3if9_uq3_3PtY6-30" value="Ground Water" style="rounded=1;whiteSpace=wrap;html=1;labelBackgroundColor=none;" parent="WIyWlLk6GJQsqaUBKTNV-1" vertex="1">
          <mxGeometry x="280" y="585" width="120" height="60" as="geometry" />
        </mxCell>
        <mxCell id="QRIyFc3if9_uq3_3PtY6-31" value="" style="endArrow=classic;html=1;rounded=0;exitX=0.25;exitY=0;exitDx=0;exitDy=0;entryX=0.25;entryY=1;entryDx=0;entryDy=0;labelBackgroundColor=none;fontColor=default;" parent="WIyWlLk6GJQsqaUBKTNV-1" source="QRIyFc3if9_uq3_3PtY6-30" target="QRIyFc3if9_uq3_3PtY6-13" edge="1">
          <mxGeometry width="50" height="50" relative="1" as="geometry">
            <mxPoint x="340" y="410" as="sourcePoint" />
            <mxPoint x="390" y="360" as="targetPoint" />
          </mxGeometry>
        </mxCell>
        <mxCell id="QRIyFc3if9_uq3_3PtY6-32" value="&lt;div&gt;Capillary Rise&lt;/div&gt;" style="edgeLabel;html=1;align=center;verticalAlign=middle;resizable=0;points=[];labelBackgroundColor=none;" parent="QRIyFc3if9_uq3_3PtY6-31" vertex="1" connectable="0">
          <mxGeometry x="-0.019" relative="1" as="geometry">
            <mxPoint as="offset" />
          </mxGeometry>
        </mxCell>
        <mxCell id="QRIyFc3if9_uq3_3PtY6-33" value="" style="endArrow=classic;html=1;rounded=0;entryX=0.75;entryY=0;entryDx=0;entryDy=0;exitX=0.75;exitY=1;exitDx=0;exitDy=0;labelBackgroundColor=none;fontColor=default;" parent="WIyWlLk6GJQsqaUBKTNV-1" source="QRIyFc3if9_uq3_3PtY6-13" target="QRIyFc3if9_uq3_3PtY6-30" edge="1">
          <mxGeometry width="50" height="50" relative="1" as="geometry">
            <mxPoint x="360" y="550" as="sourcePoint" />
            <mxPoint x="410" y="500" as="targetPoint" />
          </mxGeometry>
        </mxCell>
        <mxCell id="QRIyFc3if9_uq3_3PtY6-34" value="Drainage" style="edgeLabel;html=1;align=center;verticalAlign=middle;resizable=0;points=[];labelBackgroundColor=none;" parent="QRIyFc3if9_uq3_3PtY6-33" vertex="1" connectable="0">
          <mxGeometry x="-0.3619" y="1" relative="1" as="geometry">
            <mxPoint as="offset" />
          </mxGeometry>
        </mxCell>
        <mxCell id="QRIyFc3if9_uq3_3PtY6-135" value="" style="endArrow=classic;startArrow=classic;html=1;rounded=0;entryX=0.25;entryY=0;entryDx=0;entryDy=0;labelBackgroundColor=none;fontColor=default;" parent="WIyWlLk6GJQsqaUBKTNV-1" target="QRIyFc3if9_uq3_3PtY6-17" edge="1">
          <mxGeometry width="50" height="50" relative="1" as="geometry">
            <mxPoint x="250" y="-40" as="sourcePoint" />
            <mxPoint x="340" y="300" as="targetPoint" />
          </mxGeometry>
        </mxCell>
        <mxCell id="QRIyFc3if9_uq3_3PtY6-136" value="&lt;div&gt;Net Air&lt;/div&gt;&lt;div&gt;Humidity&lt;/div&gt;&lt;div&gt;Transport&lt;/div&gt;" style="edgeLabel;html=1;align=center;verticalAlign=middle;resizable=0;points=[];labelBackgroundColor=none;" parent="QRIyFc3if9_uq3_3PtY6-135" vertex="1" connectable="0">
          <mxGeometry x="0.0773" y="6" relative="1" as="geometry">
            <mxPoint x="-6" y="-28" as="offset" />
          </mxGeometry>
        </mxCell>
        <mxCell id="QRIyFc3if9_uq3_3PtY6-137" value="" style="endArrow=classic;startArrow=classic;html=1;rounded=0;exitX=1;exitY=0.5;exitDx=0;exitDy=0;labelBackgroundColor=none;fontColor=default;" parent="WIyWlLk6GJQsqaUBKTNV-1" source="QRIyFc3if9_uq3_3PtY6-30" edge="1">
          <mxGeometry width="50" height="50" relative="1" as="geometry">
            <mxPoint x="290" y="350" as="sourcePoint" />
            <mxPoint x="760" y="615" as="targetPoint" />
          </mxGeometry>
        </mxCell>
        <mxCell id="QRIyFc3if9_uq3_3PtY6-138" value="&lt;div&gt;Net Runoff&lt;/div&gt;" style="edgeLabel;html=1;align=center;verticalAlign=middle;resizable=0;points=[];labelBackgroundColor=none;" parent="QRIyFc3if9_uq3_3PtY6-137" vertex="1" connectable="0">
          <mxGeometry x="0.0055" y="-4" relative="1" as="geometry">
            <mxPoint x="-11" y="-9" as="offset" />
          </mxGeometry>
        </mxCell>
        <mxCell id="QRIyFc3if9_uq3_3PtY6-142" value="" style="endArrow=classic;startArrow=classic;html=1;rounded=0;exitX=0.25;exitY=0;exitDx=0;exitDy=0;labelBackgroundColor=none;fontColor=default;" parent="WIyWlLk6GJQsqaUBKTNV-1" source="QRIyFc3if9_uq3_3PtY6-139" edge="1">
          <mxGeometry width="50" height="50" relative="1" as="geometry">
            <mxPoint x="290" y="320" as="sourcePoint" />
            <mxPoint x="190" y="-40" as="targetPoint" />
          </mxGeometry>
        </mxCell>
        <mxCell id="QRIyFc3if9_uq3_3PtY6-143" value="Air Transport" style="edgeLabel;html=1;align=center;verticalAlign=middle;resizable=0;points=[];labelBackgroundColor=none;" parent="QRIyFc3if9_uq3_3PtY6-142" vertex="1" connectable="0">
          <mxGeometry x="-0.0141" y="1" relative="1" as="geometry">
            <mxPoint as="offset" />
          </mxGeometry>
        </mxCell>
        <mxCell id="QRIyFc3if9_uq3_3PtY6-228" value="" style="endArrow=classic;html=1;rounded=0;exitX=0.5;exitY=1;exitDx=0;exitDy=0;labelBackgroundColor=none;fontColor=default;" parent="WIyWlLk6GJQsqaUBKTNV-1" source="QRIyFc3if9_uq3_3PtY6-141" edge="1">
          <mxGeometry width="50" height="50" relative="1" as="geometry">
            <mxPoint x="580" y="450" as="sourcePoint" />
            <mxPoint x="210" y="680" as="targetPoint" />
          </mxGeometry>
        </mxCell>
        <mxCell id="QRIyFc3if9_uq3_3PtY6-229" value="&lt;div&gt;Ground&lt;/div&gt;&lt;div&gt;Heat Flux&lt;br&gt;&lt;/div&gt;" style="edgeLabel;html=1;align=center;verticalAlign=middle;resizable=0;points=[];labelBackgroundColor=none;" parent="QRIyFc3if9_uq3_3PtY6-228" vertex="1" connectable="0">
          <mxGeometry x="-0.1529" y="-2" relative="1" as="geometry">
            <mxPoint as="offset" />
          </mxGeometry>
        </mxCell>
      </root>
    </mxGraphModel>
  </diagram>
</mxfile>
