{
  "options": {
    "alignment_resolution": {
      "add_split_junction_sides": true,
      "junction_minimum_side_match": 1,
      "junction_pos_hash_neg_log10_p_value_cutoff": 3.0,
      "minimum_alignment_resolution_pos_hash_score": 3
    },
    "candidate_junction": {
      "highly_redundant_junction_ignore_passed_pair_limit": 200,
      "maximum_candidate_junction_length_factor": 0.1,
      "maximum_candidate_junctions": 5000,
      "maximum_junction_sequence_insertion_length": 0,
      "maximum_junction_sequence_negative_overlap_length_fraction": 0.4,
      "maximum_junction_sequence_negative_overlap_length_minimum": 12,
      "maximum_junction_sequence_overlap_length": 0,
      "maximum_junction_sequence_passed_alignment_pairs_to_consider": 100000,
      "maximum_junction_sequence_positive_overlap_length_fraction": 0.4,
      "maximum_junction_sequence_positive_overlap_length_minimum": 12,
      "minimum_candidate_junction_pos_hash_score": 2,
      "minimum_candidate_junctions": 100,
      "preprocess_junction_min_indel_split_length": 3,
      "required_both_unique_length_per_side": 1,
      "required_both_unique_length_per_side_fraction": 0.2,
      "required_one_unique_length_per_side": 0,
      "unmatched_end_length_factor": 0.1,
      "unmatched_end_minimum_read_length": 50
    },
    "mutation_identification": {
      "base_quality_cutoff": 3,
      "consensus_frequency_cutoff": 0.8,
      "consensus_minimum_total_coverage": 0,
      "consensus_minimum_total_coverage_each_strand": 0,
      "consensus_minimum_variant_coverage": 0,
      "consensus_minimum_variant_coverage_each_strand": 0,
      "deletion_coverage_propagation_cutoff": 0.0,
      "deletion_coverage_seed_cutoff": 0.0,
      "mixed_base_prediction": true,
      "mutation_log10_e_value_cutoff": 10.0,
      "no_indel_polymorphisms": false,
      "polymorphism_bias_p_value_cutoff": 0.0,
      "polymorphism_frequency_cutoff": 0.2,
      "polymorphism_log10_e_value_cutoff": 10.0,
      "polymorphism_minimum_total_coverage": 0,
      "polymorphism_minimum_total_coverage_each_strand": 0,
      "polymorphism_minimum_variant_coverage": 0,
      "polymorphism_minimum_variant_coverage_each_strand": 0,
      "polymorphism_prediction": false,
      "polymorphism_reject_indel_homopolymer_length": 0,
      "polymorphism_reject_surrounding_homopolymer_length": 0,
      "print_mutation_identification_per_position_file": false,
      "quality_score_trim": 0,
      "targeted_sequencing": false,
      "user_evidence_genome_diff_file_name": ""
    },
    "mutation_prediction": {
      "size_cutoff_AMP_becomes_INS_DEL_mutation": 50
    },
    "output": {
      "header_genome_diff_file_name": "",
      "hide_circular_genome_junctions": true,
      "max_displayed_reads": 100,
      "max_nucleotides_to_show_in_tables": 20,
      "max_rejected_junction_evidence_to_show": 10,
      "max_rejected_read_alignment_evidence_to_show": 20,
      "no_javascript": false
    },
    "read_alignment": {
      "bowtie2_genome_maximum_alignments_to_consider_per_read": 2000,
      "bowtie2_junction": "--local -i S,1,0.25 --score-min L,1,0.70 -k 2000",
      "bowtie2_junction_maximum_alignments_to_consider_per_read": 2000,
      "bowtie2_scoring": "--ma 1 --mp 3 --np 0 --rdg 2,3 --rfg 2,3 --ignore-quals",
      "bowtie2_stage1": "--local -i S,1,0.25 --score-min L,1,0.9 -k 2000",
      "bowtie2_stage2": "--local -i S,1,0.25 --score-min L,6,0.2 -k 2000",
      "maximum_read_mismatches": -1,
      "minimum_mapping_quality": 0,
      "require_match_fraction": 0.9,
      "require_match_length": 0
    },
    "read_file": {
      "aligned_sam_mode": false,
      "read_file_coverage_fold_limit": 0.0,
      "read_file_max_N_fraction": 0.5,
      "read_file_max_same_base_fraction": 0.9,
      "read_file_read_length_min": 18
    },
    "workflow": {
      "custom_run_name": "",
      "num_processors": 12,
      "skip_alignment_or_plot_generation": false,
      "skip_deletion_prediction": false,
      "skip_junction_prediction": false,
      "skip_mutation_prediction": false,
      "skip_read_filtering": false
    }
  },
  "reads": {
    "read_file": {
      "118_S22_L001_R1_001": {
        "fraction_aligned_bases": 0.975517647982632,
        "fraction_aligned_reads": 0.975346561261281,
        "max_quality_score": 36,
        "min_quality_score": 2,
        "num_aligned_bases": 126629949,
        "num_aligned_reads": 871043,
        "num_bases": 129807953,
        "num_filtered_same_base_reads": 90,
        "num_filtered_too_many_N_reads": 8,
        "num_filtered_too_short_reads": 0,
        "num_original_bases": 129821822,
        "num_original_reads": 893158,
        "num_reads": 893060,
        "quality_format": "SANGER",
        "quality_format_original": "SANGER",
        "read_length_avg": 145.351883412089,
        "read_length_max": 151,
        "read_length_min": 35
      },
      "118_S22_L001_R2_001": {
        "fraction_aligned_bases": 0.958494719934538,
        "fraction_aligned_reads": 0.958858161675688,
        "max_quality_score": 36,
        "min_quality_score": 2,
        "num_aligned_bases": 124483503,
        "num_aligned_reads": 856175,
        "num_bases": 129873958,
        "num_filtered_same_base_reads": 239,
        "num_filtered_too_many_N_reads": 8,
        "num_filtered_too_short_reads": 0,
        "num_original_bases": 129910319,
        "num_original_reads": 893158,
        "num_reads": 892911,
        "quality_format": "SANGER",
        "quality_format_original": "SANGER",
        "read_length_avg": 145.450059412416,
        "read_length_max": 151,
        "read_length_min": 35
      },
      "118_S22_L002_R1_001": {
        "fraction_aligned_bases": 0.975009986451365,
        "fraction_aligned_reads": 0.974795597056235,
        "max_quality_score": 36,
        "min_quality_score": 2,
        "num_aligned_bases": 125034058,
        "num_aligned_reads": 859372,
        "num_bases": 128238746,
        "num_filtered_same_base_reads": 119,
        "num_filtered_too_many_N_reads": 3,
        "num_filtered_too_short_reads": 0,
        "num_original_bases": 128256819,
        "num_original_reads": 881714,
        "num_reads": 881592,
        "quality_format": "SANGER",
        "quality_format_original": "SANGER",
        "read_length_avg": 145.462692492672,
        "read_length_max": 151,
        "read_length_min": 35
      },
      "118_S22_L002_R2_001": {
        "fraction_aligned_bases": 0.959234163693056,
        "fraction_aligned_reads": 0.959467648333791,
        "max_quality_score": 36,
        "min_quality_score": 2,
        "num_aligned_bases": 123054665,
        "num_aligned_reads": 845504,
        "num_bases": 128284281,
        "num_filtered_same_base_reads": 488,
        "num_filtered_too_many_N_reads": 4,
        "num_filtered_too_short_reads": 0,
        "num_original_bases": 128358096,
        "num_original_reads": 881714,
        "num_reads": 881222,
        "quality_format": "SANGER",
        "quality_format_original": "SANGER",
        "read_length_avg": 145.575440694853,
        "read_length_max": 151,
        "read_length_min": 35
      },
      "118_S22_L003_R1_001": {
        "fraction_aligned_bases": 0.9732661666644,
        "fraction_aligned_reads": 0.973194715952846,
        "max_quality_score": 36,
        "min_quality_score": 2,
        "num_aligned_bases": 119294510,
        "num_aligned_reads": 821425,
        "num_bases": 122571311,
        "num_filtered_same_base_reads": 93,
        "num_filtered_too_many_N_reads": 4,
        "num_filtered_too_short_reads": 0,
        "num_original_bases": 122585493,
        "num_original_reads": 844147,
        "num_reads": 844050,
        "quality_format": "SANGER",
        "quality_format_original": "SANGER",
        "read_length_avg": 145.218068834785,
        "read_length_max": 151,
        "read_length_min": 35
      },
      "118_S22_L003_R2_001": {
        "fraction_aligned_bases": 0.959761508585251,
        "fraction_aligned_reads": 0.960086928803935,
        "max_quality_score": 36,
        "min_quality_score": 2,
        "num_aligned_bases": 117706974,
        "num_aligned_reads": 810226,
        "num_bases": 122641899,
        "num_filtered_same_base_reads": 234,
        "num_filtered_too_many_N_reads": 4,
        "num_filtered_too_short_reads": 0,
        "num_original_bases": 122677361,
        "num_original_reads": 844147,
        "num_reads": 843909,
        "quality_format": "SANGER",
        "quality_format_original": "SANGER",
        "read_length_avg": 145.325975904985,
        "read_length_max": 151,
        "read_length_min": 35
      },
      "118_S22_L004_R1_001": {
        "fraction_aligned_bases": 0.971431769530517,
        "fraction_aligned_reads": 0.97135881546693,
        "max_quality_score": 36,
        "min_quality_score": 2,
        "num_aligned_bases": 114315120,
        "num_aligned_reads": 787365,
        "num_bases": 117676942,
        "num_filtered_same_base_reads": 107,
        "num_filtered_too_many_N_reads": 7,
        "num_filtered_too_short_reads": 0,
        "num_original_bases": 117693340,
        "num_original_reads": 810695,
        "num_reads": 810581,
        "quality_format": "SANGER",
        "quality_format_original": "SANGER",
        "read_length_avg": 145.176042863082,
        "read_length_max": 151,
        "read_length_min": 35
      },
      "118_S22_L004_R2_001": {
        "fraction_aligned_bases": 0.954600211595414,
        "fraction_aligned_reads": 0.955033245632654,
        "max_quality_score": 36,
        "min_quality_score": 2,
        "num_aligned_bases": 112421499,
        "num_aligned_reads": 773894,
        "num_bases": 117768148,
        "num_filtered_same_base_reads": 357,
        "num_filtered_too_many_N_reads": 6,
        "num_filtered_too_short_reads": 0,
        "num_original_bases": 117822256,
        "num_original_reads": 810695,
        "num_reads": 810332,
        "quality_format": "SANGER",
        "quality_format_original": "SANGER",
        "read_length_avg": 145.333206636292,
        "read_length_max": 151,
        "read_length_min": 35
      }
    },
    "total_aligned_bases": 962940278,
    "total_aligned_reads": 6625004,
    "total_bases": 996863238,
    "total_fraction_aligned_bases": 0.965970296920509,
    "total_fraction_aligned_reads": 0.966073981244615,
    "total_reads": 6857657
  },
  "references": {
    "reference": {
      "AM181176": {
        "coverage_average": 142.7101,
        "coverage_deletion_coverage_propagation_cutoff": 31.0,
        "coverage_deletion_coverage_seed_cutoff": 0.0,
        "coverage_dispersion": 12.78736,
        "coverage_group": 0,
        "coverage_nbinom_dispersion": 10.9770575171574,
        "coverage_nbinom_mean_parameter": 141.3336,
        "coverage_nbinom_prob_parameter": 0.0910990944920323,
        "coverage_nbinom_size_parameter": 14.16586,
        "coverage_nbinom_variance": 1551.42705630692,
        "coverage_variance": 1824.886,
        "junction_only": false,
        "length": 6722539,
        "num_bases_mapped_to_reference": 960518456.601135,
        "num_features": 12117,
        "num_genes": 6091,
        "num_reads_mapped_to_reference": 6621423.00001668,
        "num_repeats": 0
      }
    },
    "total_features": 12117,
    "total_genes": 6091,
    "total_length": 6722539,
    "total_repeats": 0
  }
}