{
  "options": {
    "alignment_resolution": {
      "add_split_junction_sides": true,
      "junction_minimum_side_match": 1,
      "junction_pos_hash_neg_log10_p_value_cutoff": 3.0,
      "minimum_alignment_resolution_pos_hash_score": 3
    },
    "candidate_junction": {
      "highly_redundant_junction_ignore_passed_pair_limit": 200,
      "maximum_candidate_junction_length_factor": 0.1,
      "maximum_candidate_junctions": 5000,
      "maximum_junction_sequence_insertion_length": 0,
      "maximum_junction_sequence_negative_overlap_length_fraction": 0.4,
      "maximum_junction_sequence_negative_overlap_length_minimum": 12,
      "maximum_junction_sequence_overlap_length": 0,
      "maximum_junction_sequence_passed_alignment_pairs_to_consider": 100000,
      "maximum_junction_sequence_positive_overlap_length_fraction": 0.4,
      "maximum_junction_sequence_positive_overlap_length_minimum": 12,
      "minimum_candidate_junction_pos_hash_score": 2,
      "minimum_candidate_junctions": 100,
      "preprocess_junction_min_indel_split_length": 3,
      "required_both_unique_length_per_side": 1,
      "required_both_unique_length_per_side_fraction": 0.2,
      "required_one_unique_length_per_side": 0,
      "unmatched_end_length_factor": 0.1,
      "unmatched_end_minimum_read_length": 50
    },
    "mutation_identification": {
      "base_quality_cutoff": 3,
      "consensus_frequency_cutoff": 0.8,
      "consensus_minimum_total_coverage": 0,
      "consensus_minimum_total_coverage_each_strand": 0,
      "consensus_minimum_variant_coverage": 0,
      "consensus_minimum_variant_coverage_each_strand": 0,
      "deletion_coverage_propagation_cutoff": 0.0,
      "deletion_coverage_seed_cutoff": 0.0,
      "mixed_base_prediction": true,
      "mutation_log10_e_value_cutoff": 10.0,
      "no_indel_polymorphisms": false,
      "polymorphism_bias_p_value_cutoff": 0.0,
      "polymorphism_frequency_cutoff": 0.2,
      "polymorphism_log10_e_value_cutoff": 10.0,
      "polymorphism_minimum_total_coverage": 0,
      "polymorphism_minimum_total_coverage_each_strand": 0,
      "polymorphism_minimum_variant_coverage": 0,
      "polymorphism_minimum_variant_coverage_each_strand": 0,
      "polymorphism_prediction": false,
      "polymorphism_reject_indel_homopolymer_length": 0,
      "polymorphism_reject_surrounding_homopolymer_length": 0,
      "print_mutation_identification_per_position_file": false,
      "quality_score_trim": 0,
      "targeted_sequencing": false,
      "user_evidence_genome_diff_file_name": ""
    },
    "mutation_prediction": {
      "size_cutoff_AMP_becomes_INS_DEL_mutation": 50
    },
    "output": {
      "header_genome_diff_file_name": "",
      "hide_circular_genome_junctions": true,
      "max_displayed_reads": 100,
      "max_nucleotides_to_show_in_tables": 20,
      "max_rejected_junction_evidence_to_show": 10,
      "max_rejected_read_alignment_evidence_to_show": 20,
      "no_javascript": false
    },
    "read_alignment": {
      "bowtie2_genome_maximum_alignments_to_consider_per_read": 2000,
      "bowtie2_junction": "--local -i S,1,0.25 --score-min L,1,0.70 -k 2000",
      "bowtie2_junction_maximum_alignments_to_consider_per_read": 2000,
      "bowtie2_scoring": "--ma 1 --mp 3 --np 0 --rdg 2,3 --rfg 2,3 --ignore-quals",
      "bowtie2_stage1": "--local -i S,1,0.25 --score-min L,1,0.9 -k 2000",
      "bowtie2_stage2": "--local -i S,1,0.25 --score-min L,6,0.2 -k 2000",
      "maximum_read_mismatches": -1,
      "minimum_mapping_quality": 0,
      "require_match_fraction": 0.9,
      "require_match_length": 0
    },
    "read_file": {
      "aligned_sam_mode": false,
      "read_file_coverage_fold_limit": 0.0,
      "read_file_max_N_fraction": 0.5,
      "read_file_max_same_base_fraction": 0.9,
      "read_file_read_length_min": 18
    },
    "workflow": {
      "custom_run_name": "",
      "num_processors": 12,
      "skip_alignment_or_plot_generation": false,
      "skip_deletion_prediction": false,
      "skip_junction_prediction": false,
      "skip_mutation_prediction": false,
      "skip_read_filtering": false
    }
  },
  "reads": {
    "read_file": {
      "23_S23_L001_R1_001": {
        "fraction_aligned_bases": 0.967350150551187,
        "fraction_aligned_reads": 0.9686158496491,
        "max_quality_score": 36,
        "min_quality_score": 2,
        "num_aligned_bases": 216511561,
        "num_aligned_reads": 1549673,
        "num_bases": 223819225,
        "num_filtered_same_base_reads": 23,
        "num_filtered_too_many_N_reads": 1,
        "num_filtered_too_short_reads": 0,
        "num_original_bases": 223822733,
        "num_original_reads": 1599908,
        "num_reads": 1599884,
        "quality_format": "SANGER",
        "quality_format_original": "SANGER",
        "read_length_avg": 139.897158168967,
        "read_length_max": 151,
        "read_length_min": 35
      },
      "23_S23_L001_R2_001": {
        "fraction_aligned_bases": 0.9438013827589,
        "fraction_aligned_reads": 0.946454297162237,
        "max_quality_score": 36,
        "min_quality_score": 2,
        "num_aligned_bases": 211651089,
        "num_aligned_reads": 1513653,
        "num_bases": 224253845,
        "num_filtered_same_base_reads": 614,
        "num_filtered_too_many_N_reads": 6,
        "num_filtered_too_short_reads": 0,
        "num_original_bases": 224346755,
        "num_original_reads": 1599908,
        "num_reads": 1599288,
        "quality_format": "SANGER",
        "quality_format_original": "SANGER",
        "read_length_avg": 140.221051492914,
        "read_length_max": 151,
        "read_length_min": 35
      },
      "23_S23_L002_R1_001": {
        "fraction_aligned_bases": 0.964000405939621,
        "fraction_aligned_reads": 0.96550411645308,
        "max_quality_score": 36,
        "min_quality_score": 2,
        "num_aligned_bases": 200237942,
        "num_aligned_reads": 1433203,
        "num_bases": 207715620,
        "num_filtered_same_base_reads": 66,
        "num_filtered_too_many_N_reads": 1,
        "num_filtered_too_short_reads": 0,
        "num_original_bases": 207725620,
        "num_original_reads": 1484476,
        "num_reads": 1484409,
        "quality_format": "SANGER",
        "quality_format_original": "SANGER",
        "read_length_avg": 139.931528305204,
        "read_length_max": 151,
        "read_length_min": 35
      },
      "23_S23_L002_R2_001": {
        "fraction_aligned_bases": 0.926228675381272,
        "fraction_aligned_reads": 0.929968920759733,
        "max_quality_score": 36,
        "min_quality_score": 2,
        "num_aligned_bases": 192978960,
        "num_aligned_reads": 1379727,
        "num_bases": 208349153,
        "num_filtered_same_base_reads": 840,
        "num_filtered_too_many_N_reads": 9,
        "num_filtered_too_short_reads": 0,
        "num_original_bases": 208476357,
        "num_original_reads": 1484476,
        "num_reads": 1483627,
        "quality_format": "SANGER",
        "quality_format_original": "SANGER",
        "read_length_avg": 140.43230070631,
        "read_length_max": 151,
        "read_length_min": 35
      },
      "23_S23_L003_R1_001": {
        "fraction_aligned_bases": 0.972731356640418,
        "fraction_aligned_reads": 0.973633037412357,
        "max_quality_score": 36,
        "min_quality_score": 2,
        "num_aligned_bases": 229979509,
        "num_aligned_reads": 1640264,
        "num_bases": 236426540,
        "num_filtered_same_base_reads": 35,
        "num_filtered_too_many_N_reads": 1,
        "num_filtered_too_short_reads": 0,
        "num_original_bases": 236431859,
        "num_original_reads": 1684720,
        "num_reads": 1684684,
        "quality_format": "SANGER",
        "quality_format_original": "SANGER",
        "read_length_avg": 140.338805378338,
        "read_length_max": 151,
        "read_length_min": 35
      },
      "23_S23_L003_R2_001": {
        "fraction_aligned_bases": 0.926917145046417,
        "fraction_aligned_reads": 0.930454122978154,
        "max_quality_score": 36,
        "min_quality_score": 2,
        "num_aligned_bases": 219999553,
        "num_aligned_reads": 1566694,
        "num_bases": 237345435,
        "num_filtered_same_base_reads": 775,
        "num_filtered_too_many_N_reads": 150,
        "num_filtered_too_short_reads": 0,
        "num_original_bases": 237484474,
        "num_original_reads": 1684720,
        "num_reads": 1683795,
        "quality_format": "SANGER",
        "quality_format_original": "SANGER",
        "read_length_avg": 140.95862916804,
        "read_length_max": 151,
        "read_length_min": 35
      },
      "23_S23_L004_R1_001": {
        "fraction_aligned_bases": 0.966312522858004,
        "fraction_aligned_reads": 0.967716393112573,
        "max_quality_score": 36,
        "min_quality_score": 2,
        "num_aligned_bases": 210033329,
        "num_aligned_reads": 1504469,
        "num_bases": 217355487,
        "num_filtered_same_base_reads": 49,
        "num_filtered_too_many_N_reads": 0,
        "num_filtered_too_short_reads": 0,
        "num_original_bases": 217362885,
        "num_original_reads": 1554708,
        "num_reads": 1554659,
        "quality_format": "SANGER",
        "quality_format_original": "SANGER",
        "read_length_avg": 139.809107334792,
        "read_length_max": 151,
        "read_length_min": 35
      },
      "23_S23_L004_R2_001": {
        "fraction_aligned_bases": 0.90569751390126,
        "fraction_aligned_reads": 0.910638853864359,
        "max_quality_score": 36,
        "min_quality_score": 2,
        "num_aligned_bases": 197952549,
        "num_aligned_reads": 1414835,
        "num_bases": 218563644,
        "num_filtered_same_base_reads": 909,
        "num_filtered_too_many_N_reads": 126,
        "num_filtered_too_short_reads": 0,
        "num_original_bases": 218719802,
        "num_original_reads": 1554708,
        "num_reads": 1553673,
        "quality_format": "SANGER",
        "quality_format_original": "SANGER",
        "read_length_avg": 140.675447150076,
        "read_length_max": 151,
        "read_length_min": 35
      }
    },
    "total_aligned_bases": 1679344492,
    "total_aligned_reads": 12002518,
    "total_bases": 1773828949,
    "total_fraction_aligned_bases": 0.946734178031503,
    "total_fraction_aligned_reads": 0.949264470418781,
    "total_reads": 12644019
  },
  "references": {
    "reference": {
      "AM181176": {
        "coverage_average": 249.1122,
        "coverage_deletion_coverage_propagation_cutoff": 57.0,
        "coverage_deletion_coverage_seed_cutoff": 0.0,
        "coverage_dispersion": 25.8439,
        "coverage_group": 0,
        "coverage_nbinom_dispersion": 18.744952407645,
        "coverage_nbinom_mean_parameter": 246.9219,
        "coverage_nbinom_prob_parameter": 0.0533476947955418,
        "coverage_nbinom_size_parameter": 13.91505,
        "coverage_nbinom_variance": 4628.53926390527,
        "coverage_variance": 6438.031,
        "junction_only": false,
        "length": 6722539,
        "num_bases_mapped_to_reference": 1673856958.64278,
        "num_features": 12117,
        "num_genes": 6091,
        "num_reads_mapped_to_reference": 12000944.9999677,
        "num_repeats": 0
      }
    },
    "total_features": 12117,
    "total_genes": 6091,
    "total_length": 6722539,
    "total_repeats": 0
  }
}