{
  "options": {
    "alignment_resolution": {
      "add_split_junction_sides": true,
      "junction_minimum_side_match": 1,
      "junction_pos_hash_neg_log10_p_value_cutoff": 3.0,
      "minimum_alignment_resolution_pos_hash_score": 3
    },
    "candidate_junction": {
      "highly_redundant_junction_ignore_passed_pair_limit": 200,
      "maximum_candidate_junction_length_factor": 0.1,
      "maximum_candidate_junctions": 5000,
      "maximum_junction_sequence_insertion_length": 0,
      "maximum_junction_sequence_negative_overlap_length_fraction": 0.4,
      "maximum_junction_sequence_negative_overlap_length_minimum": 12,
      "maximum_junction_sequence_overlap_length": 0,
      "maximum_junction_sequence_passed_alignment_pairs_to_consider": 100000,
      "maximum_junction_sequence_positive_overlap_length_fraction": 0.4,
      "maximum_junction_sequence_positive_overlap_length_minimum": 12,
      "minimum_candidate_junction_pos_hash_score": 2,
      "minimum_candidate_junctions": 100,
      "preprocess_junction_min_indel_split_length": 3,
      "required_both_unique_length_per_side": 1,
      "required_both_unique_length_per_side_fraction": 0.2,
      "required_one_unique_length_per_side": 0,
      "unmatched_end_length_factor": 0.1,
      "unmatched_end_minimum_read_length": 50
    },
    "mutation_identification": {
      "base_quality_cutoff": 3,
      "consensus_frequency_cutoff": 0.8,
      "consensus_minimum_total_coverage": 0,
      "consensus_minimum_total_coverage_each_strand": 0,
      "consensus_minimum_variant_coverage": 0,
      "consensus_minimum_variant_coverage_each_strand": 0,
      "deletion_coverage_propagation_cutoff": 0.0,
      "deletion_coverage_seed_cutoff": 0.0,
      "mixed_base_prediction": true,
      "mutation_log10_e_value_cutoff": 10.0,
      "no_indel_polymorphisms": false,
      "polymorphism_bias_p_value_cutoff": 0.0,
      "polymorphism_frequency_cutoff": 0.2,
      "polymorphism_log10_e_value_cutoff": 10.0,
      "polymorphism_minimum_total_coverage": 0,
      "polymorphism_minimum_total_coverage_each_strand": 0,
      "polymorphism_minimum_variant_coverage": 0,
      "polymorphism_minimum_variant_coverage_each_strand": 0,
      "polymorphism_prediction": false,
      "polymorphism_reject_indel_homopolymer_length": 0,
      "polymorphism_reject_surrounding_homopolymer_length": 0,
      "print_mutation_identification_per_position_file": false,
      "quality_score_trim": 0,
      "targeted_sequencing": false,
      "user_evidence_genome_diff_file_name": ""
    },
    "mutation_prediction": {
      "size_cutoff_AMP_becomes_INS_DEL_mutation": 50
    },
    "output": {
      "header_genome_diff_file_name": "",
      "hide_circular_genome_junctions": true,
      "max_displayed_reads": 100,
      "max_nucleotides_to_show_in_tables": 20,
      "max_rejected_junction_evidence_to_show": 10,
      "max_rejected_read_alignment_evidence_to_show": 20,
      "no_javascript": false
    },
    "read_alignment": {
      "bowtie2_genome_maximum_alignments_to_consider_per_read": 2000,
      "bowtie2_junction": "--local -i S,1,0.25 --score-min L,1,0.70 -k 2000",
      "bowtie2_junction_maximum_alignments_to_consider_per_read": 2000,
      "bowtie2_scoring": "--ma 1 --mp 3 --np 0 --rdg 2,3 --rfg 2,3 --ignore-quals",
      "bowtie2_stage1": "--local -i S,1,0.25 --score-min L,1,0.9 -k 2000",
      "bowtie2_stage2": "--local -i S,1,0.25 --score-min L,6,0.2 -k 2000",
      "maximum_read_mismatches": -1,
      "minimum_mapping_quality": 0,
      "require_match_fraction": 0.9,
      "require_match_length": 0
    },
    "read_file": {
      "aligned_sam_mode": false,
      "read_file_coverage_fold_limit": 0.0,
      "read_file_max_N_fraction": 0.5,
      "read_file_max_same_base_fraction": 0.9,
      "read_file_read_length_min": 18
    },
    "workflow": {
      "custom_run_name": "",
      "num_processors": 12,
      "skip_alignment_or_plot_generation": false,
      "skip_deletion_prediction": false,
      "skip_junction_prediction": false,
      "skip_mutation_prediction": false,
      "skip_read_filtering": false
    }
  },
  "reads": {
    "read_file": {
      "WT_D3_S61_L001_R1_001": {
        "fraction_aligned_bases": 0.977404887815438,
        "fraction_aligned_reads": 0.977703271206751,
        "max_quality_score": 36,
        "min_quality_score": 2,
        "num_aligned_bases": 132357657,
        "num_aligned_reads": 920316,
        "num_bases": 135417429,
        "num_filtered_same_base_reads": 169,
        "num_filtered_too_many_N_reads": 1,
        "num_filtered_too_short_reads": 0,
        "num_original_bases": 135442981,
        "num_original_reads": 941474,
        "num_reads": 941304,
        "quality_format": "SANGER",
        "quality_format_original": "SANGER",
        "read_length_avg": 143.861525075852,
        "read_length_max": 151,
        "read_length_min": 35
      },
      "WT_D3_S61_L001_R2_001": {
        "fraction_aligned_bases": 0.970177043445374,
        "fraction_aligned_reads": 0.970709483293526,
        "max_quality_score": 36,
        "min_quality_score": 2,
        "num_aligned_bases": 131341792,
        "num_aligned_reads": 913624,
        "num_bases": 135379200,
        "num_filtered_same_base_reads": 271,
        "num_filtered_too_many_N_reads": 11,
        "num_filtered_too_short_reads": 0,
        "num_original_bases": 135421546,
        "num_original_reads": 941474,
        "num_reads": 941192,
        "quality_format": "SANGER",
        "quality_format_original": "SANGER",
        "read_length_avg": 143.83802667256,
        "read_length_max": 151,
        "read_length_min": 35
      },
      "WT_D3_S61_L003_R1_001": {
        "fraction_aligned_bases": 0.968839845879893,
        "fraction_aligned_reads": 0.969504249528952,
        "max_quality_score": 36,
        "min_quality_score": 2,
        "num_aligned_bases": 142351718,
        "num_aligned_reads": 984327,
        "num_bases": 146930082,
        "num_filtered_same_base_reads": 599,
        "num_filtered_too_many_N_reads": 1,
        "num_filtered_too_short_reads": 0,
        "num_original_bases": 147020560,
        "num_original_reads": 1015889,
        "num_reads": 1015289,
        "quality_format": "SANGER",
        "quality_format_original": "SANGER",
        "read_length_avg": 144.717496200589,
        "read_length_max": 151,
        "read_length_min": 35
      },
      "WT_D3_S61_L003_R2_001": {
        "fraction_aligned_bases": 0.960506308273995,
        "fraction_aligned_reads": 0.961401017607745,
        "max_quality_score": 36,
        "min_quality_score": 2,
        "num_aligned_bases": 141162867,
        "num_aligned_reads": 976321,
        "num_bases": 146967142,
        "num_filtered_same_base_reads": 369,
        "num_filtered_too_many_N_reads": 1,
        "num_filtered_too_short_reads": 0,
        "num_original_bases": 147022884,
        "num_original_reads": 1015889,
        "num_reads": 1015519,
        "quality_format": "SANGER",
        "quality_format_original": "SANGER",
        "read_length_avg": 144.721213487882,
        "read_length_max": 151,
        "read_length_min": 35
      }
    },
    "total_aligned_bases": 547214034,
    "total_aligned_reads": 3794588,
    "total_bases": 564693853,
    "total_fraction_aligned_bases": 0.969045494461935,
    "total_fraction_aligned_reads": 0.969663486404327,
    "total_reads": 3913304
  },
  "references": {
    "reference": {
      "AM181176": {
        "coverage_average": 81.1112,
        "coverage_deletion_coverage_propagation_cutoff": 15.0,
        "coverage_deletion_coverage_seed_cutoff": 0.0,
        "coverage_dispersion": 7.304793,
        "coverage_group": 0,
        "coverage_nbinom_dispersion": 6.92518231949168,
        "coverage_nbinom_mean_parameter": 81.29599,
        "coverage_nbinom_prob_parameter": 0.144400530392592,
        "coverage_nbinom_size_parameter": 13.72042,
        "coverage_nbinom_variance": 562.989552593572,
        "coverage_variance": 592.5005,
        "junction_only": false,
        "length": 6722539,
        "num_bases_mapped_to_reference": 545907799.666387,
        "num_features": 12117,
        "num_genes": 6091,
        "num_reads_mapped_to_reference": 3792085.00000675,
        "num_repeats": 0
      }
    },
    "total_features": 12117,
    "total_genes": 6091,
    "total_length": 6722539,
    "total_repeats": 0
  }
}