{
  "options": {
    "alignment_resolution": {
      "add_split_junction_sides": true,
      "junction_minimum_side_match": 1,
      "junction_pos_hash_neg_log10_p_value_cutoff": 3.0,
      "minimum_alignment_resolution_pos_hash_score": 3
    },
    "candidate_junction": {
      "highly_redundant_junction_ignore_passed_pair_limit": 200,
      "maximum_candidate_junction_length_factor": 0.1,
      "maximum_candidate_junctions": 5000,
      "maximum_junction_sequence_insertion_length": 0,
      "maximum_junction_sequence_negative_overlap_length_fraction": 0.4,
      "maximum_junction_sequence_negative_overlap_length_minimum": 12,
      "maximum_junction_sequence_overlap_length": 0,
      "maximum_junction_sequence_passed_alignment_pairs_to_consider": 100000,
      "maximum_junction_sequence_positive_overlap_length_fraction": 0.4,
      "maximum_junction_sequence_positive_overlap_length_minimum": 12,
      "minimum_candidate_junction_pos_hash_score": 2,
      "minimum_candidate_junctions": 100,
      "preprocess_junction_min_indel_split_length": 3,
      "required_both_unique_length_per_side": 1,
      "required_both_unique_length_per_side_fraction": 0.2,
      "required_one_unique_length_per_side": 0,
      "unmatched_end_length_factor": 0.1,
      "unmatched_end_minimum_read_length": 50
    },
    "mutation_identification": {
      "base_quality_cutoff": 3,
      "consensus_frequency_cutoff": 0.8,
      "consensus_minimum_total_coverage": 0,
      "consensus_minimum_total_coverage_each_strand": 0,
      "consensus_minimum_variant_coverage": 0,
      "consensus_minimum_variant_coverage_each_strand": 0,
      "deletion_coverage_propagation_cutoff": 0.0,
      "deletion_coverage_seed_cutoff": 0.0,
      "mixed_base_prediction": true,
      "mutation_log10_e_value_cutoff": 10.0,
      "no_indel_polymorphisms": false,
      "polymorphism_bias_p_value_cutoff": 0.0,
      "polymorphism_frequency_cutoff": 0.2,
      "polymorphism_log10_e_value_cutoff": 10.0,
      "polymorphism_minimum_total_coverage": 0,
      "polymorphism_minimum_total_coverage_each_strand": 0,
      "polymorphism_minimum_variant_coverage": 0,
      "polymorphism_minimum_variant_coverage_each_strand": 0,
      "polymorphism_prediction": false,
      "polymorphism_reject_indel_homopolymer_length": 0,
      "polymorphism_reject_surrounding_homopolymer_length": 0,
      "print_mutation_identification_per_position_file": false,
      "quality_score_trim": 0,
      "targeted_sequencing": false,
      "user_evidence_genome_diff_file_name": ""
    },
    "mutation_prediction": {
      "size_cutoff_AMP_becomes_INS_DEL_mutation": 50
    },
    "output": {
      "header_genome_diff_file_name": "",
      "hide_circular_genome_junctions": true,
      "max_displayed_reads": 100,
      "max_nucleotides_to_show_in_tables": 20,
      "max_rejected_junction_evidence_to_show": 10,
      "max_rejected_read_alignment_evidence_to_show": 20,
      "no_javascript": false
    },
    "read_alignment": {
      "bowtie2_genome_maximum_alignments_to_consider_per_read": 2000,
      "bowtie2_junction": "--local -i S,1,0.25 --score-min L,1,0.70 -k 2000",
      "bowtie2_junction_maximum_alignments_to_consider_per_read": 2000,
      "bowtie2_scoring": "--ma 1 --mp 3 --np 0 --rdg 2,3 --rfg 2,3 --ignore-quals",
      "bowtie2_stage1": "--local -i S,1,0.25 --score-min L,1,0.9 -k 2000",
      "bowtie2_stage2": "--local -i S,1,0.25 --score-min L,6,0.2 -k 2000",
      "maximum_read_mismatches": -1,
      "minimum_mapping_quality": 0,
      "require_match_fraction": 0.9,
      "require_match_length": 0
    },
    "read_file": {
      "aligned_sam_mode": false,
      "read_file_coverage_fold_limit": 0.0,
      "read_file_max_N_fraction": 0.5,
      "read_file_max_same_base_fraction": 0.9,
      "read_file_read_length_min": 18
    },
    "workflow": {
      "custom_run_name": "",
      "num_processors": 12,
      "skip_alignment_or_plot_generation": false,
      "skip_deletion_prediction": false,
      "skip_junction_prediction": false,
      "skip_mutation_prediction": false,
      "skip_read_filtering": false
    }
  },
  "reads": {
    "read_file": {
      "17_B8_S143_L001_R1_001": {
        "fraction_aligned_bases": 0.97706978239119,
        "fraction_aligned_reads": 0.977290377338473,
        "max_quality_score": 36,
        "min_quality_score": 2,
        "num_aligned_bases": 100205630,
        "num_aligned_reads": 690871,
        "num_bases": 102557291,
        "num_filtered_same_base_reads": 127,
        "num_filtered_too_many_N_reads": 1,
        "num_filtered_too_short_reads": 0,
        "num_original_bases": 102576502,
        "num_original_reads": 707053,
        "num_reads": 706925,
        "quality_format": "SANGER",
        "quality_format_original": "SANGER",
        "read_length_avg": 145.075207412385,
        "read_length_max": 151,
        "read_length_min": 35
      },
      "17_B8_S143_L001_R2_001": {
        "fraction_aligned_bases": 0.967517964954485,
        "fraction_aligned_reads": 0.968050263925221,
        "max_quality_score": 36,
        "min_quality_score": 2,
        "num_aligned_bases": 99207330,
        "num_aligned_reads": 684246,
        "num_bases": 102537972,
        "num_filtered_same_base_reads": 220,
        "num_filtered_too_many_N_reads": 4,
        "num_filtered_too_short_reads": 0,
        "num_original_bases": 102571676,
        "num_original_reads": 707053,
        "num_reads": 706829,
        "quality_format": "SANGER",
        "quality_format_original": "SANGER",
        "read_length_avg": 145.067579287211,
        "read_length_max": 151,
        "read_length_min": 35
      },
      "17_B8_S143_L002_R2_001": {
        "fraction_aligned_bases": 0.96647179302118,
        "fraction_aligned_reads": 0.966989737822748,
        "max_quality_score": 36,
        "min_quality_score": 2,
        "num_aligned_bases": 99467315,
        "num_aligned_reads": 685324,
        "num_bases": 102917970,
        "num_filtered_same_base_reads": 485,
        "num_filtered_too_many_N_reads": 38,
        "num_filtered_too_short_reads": 0,
        "num_original_bases": 102996357,
        "num_original_reads": 709242,
        "num_reads": 708719,
        "quality_format": "SANGER",
        "quality_format_original": "SANGER",
        "read_length_avg": 145.21689132082,
        "read_length_max": 151,
        "read_length_min": 35
      },
      "17_B8_S143_L003_R1_001": {
        "fraction_aligned_bases": 0.969355273160989,
        "fraction_aligned_reads": 0.969833086283932,
        "max_quality_score": 36,
        "min_quality_score": 2,
        "num_aligned_bases": 106814129,
        "num_aligned_reads": 733445,
        "num_bases": 110190899,
        "num_filtered_same_base_reads": 478,
        "num_filtered_too_many_N_reads": 2,
        "num_filtered_too_short_reads": 0,
        "num_original_bases": 110263136,
        "num_original_reads": 756739,
        "num_reads": 756259,
        "quality_format": "SANGER",
        "quality_format_original": "SANGER",
        "read_length_avg": 145.705239871525,
        "read_length_max": 151,
        "read_length_min": 35
      },
      "17_B8_S143_L003_R2_001": {
        "fraction_aligned_bases": 0.959814478632586,
        "fraction_aligned_reads": 0.960527985784998,
        "max_quality_score": 36,
        "min_quality_score": 2,
        "num_aligned_bases": 105766099,
        "num_aligned_reads": 726528,
        "num_bases": 110194315,
        "num_filtered_same_base_reads": 352,
        "num_filtered_too_many_N_reads": 3,
        "num_filtered_too_short_reads": 0,
        "num_original_bases": 110247566,
        "num_original_reads": 756739,
        "num_reads": 756384,
        "quality_format": "SANGER",
        "quality_format_original": "SANGER",
        "read_length_avg": 145.685676851969,
        "read_length_max": 151,
        "read_length_min": 35
      },
      "17_B8_S143_L004_R1_001": {
        "fraction_aligned_bases": 0.969876952030364,
        "fraction_aligned_reads": 0.970341901657255,
        "max_quality_score": 36,
        "min_quality_score": 2,
        "num_aligned_bases": 94874054,
        "num_aligned_reads": 653665,
        "num_bases": 97820712,
        "num_filtered_same_base_reads": 135,
        "num_filtered_too_many_N_reads": 2,
        "num_filtered_too_short_reads": 0,
        "num_original_bases": 97841165,
        "num_original_reads": 673781,
        "num_reads": 673644,
        "quality_format": "SANGER",
        "quality_format_original": "SANGER",
        "read_length_avg": 145.211286673673,
        "read_length_max": 151,
        "read_length_min": 35
      },
      "17_B8_S143_L004_R2_001": {
        "fraction_aligned_bases": 0.959624195719163,
        "fraction_aligned_reads": 0.960423930669486,
        "max_quality_score": 36,
        "min_quality_score": 2,
        "num_aligned_bases": 93791242,
        "num_aligned_reads": 646761,
        "num_bases": 97737471,
        "num_filtered_same_base_reads": 367,
        "num_filtered_too_many_N_reads": 2,
        "num_filtered_too_short_reads": 0,
        "num_original_bases": 97792951,
        "num_original_reads": 673781,
        "num_reads": 673412,
        "quality_format": "SANGER",
        "quality_format_original": "SANGER",
        "read_length_avg": 145.137703218832,
        "read_length_max": 151,
        "read_length_min": 35
      }
    },
    "total_aligned_bases": 700125799,
    "total_aligned_reads": 4820840,
    "total_bases": 723956630,
    "total_fraction_aligned_bases": 0.967082515702633,
    "total_fraction_aligned_reads": 0.967618139237264,
    "total_reads": 4982172
  },
  "references": {
    "reference": {
      "AM181176": {
        "coverage_average": 103.7618,
        "coverage_deletion_coverage_propagation_cutoff": 25.0,
        "coverage_deletion_coverage_seed_cutoff": 0.0,
        "coverage_dispersion": 8.023938,
        "coverage_group": 0,
        "coverage_nbinom_dispersion": 6.98159847385084,
        "coverage_nbinom_mean_parameter": 103.6291,
        "coverage_nbinom_prob_parameter": 0.143233674028296,
        "coverage_nbinom_size_parameter": 17.32465,
        "coverage_nbinom_variance": 723.496766406536,
        "coverage_variance": 832.5779,
        "junction_only": false,
        "length": 6722539,
        "num_bases_mapped_to_reference": 698573991.574844,
        "num_features": 12117,
        "num_genes": 6091,
        "num_reads_mapped_to_reference": 4819281.0000109,
        "num_repeats": 0
      }
    },
    "total_features": 12117,
    "total_genes": 6091,
    "total_length": 6722539,
    "total_repeats": 0
  }
}