{
  "options": {
    "alignment_resolution": {
      "add_split_junction_sides": true,
      "junction_minimum_side_match": 1,
      "junction_pos_hash_neg_log10_p_value_cutoff": 3.0,
      "minimum_alignment_resolution_pos_hash_score": 3
    },
    "candidate_junction": {
      "highly_redundant_junction_ignore_passed_pair_limit": 200,
      "maximum_candidate_junction_length_factor": 0.1,
      "maximum_candidate_junctions": 5000,
      "maximum_junction_sequence_insertion_length": 0,
      "maximum_junction_sequence_negative_overlap_length_fraction": 0.4,
      "maximum_junction_sequence_negative_overlap_length_minimum": 12,
      "maximum_junction_sequence_overlap_length": 0,
      "maximum_junction_sequence_passed_alignment_pairs_to_consider": 100000,
      "maximum_junction_sequence_positive_overlap_length_fraction": 0.4,
      "maximum_junction_sequence_positive_overlap_length_minimum": 12,
      "minimum_candidate_junction_pos_hash_score": 2,
      "minimum_candidate_junctions": 100,
      "preprocess_junction_min_indel_split_length": 3,
      "required_both_unique_length_per_side": 1,
      "required_both_unique_length_per_side_fraction": 0.2,
      "required_one_unique_length_per_side": 0,
      "unmatched_end_length_factor": 0.1,
      "unmatched_end_minimum_read_length": 50
    },
    "mutation_identification": {
      "base_quality_cutoff": 3,
      "consensus_frequency_cutoff": 0.8,
      "consensus_minimum_total_coverage": 0,
      "consensus_minimum_total_coverage_each_strand": 0,
      "consensus_minimum_variant_coverage": 0,
      "consensus_minimum_variant_coverage_each_strand": 0,
      "deletion_coverage_propagation_cutoff": 0.0,
      "deletion_coverage_seed_cutoff": 0.0,
      "mixed_base_prediction": true,
      "mutation_log10_e_value_cutoff": 10.0,
      "no_indel_polymorphisms": false,
      "polymorphism_bias_p_value_cutoff": 0.0,
      "polymorphism_frequency_cutoff": 0.2,
      "polymorphism_log10_e_value_cutoff": 10.0,
      "polymorphism_minimum_total_coverage": 0,
      "polymorphism_minimum_total_coverage_each_strand": 0,
      "polymorphism_minimum_variant_coverage": 0,
      "polymorphism_minimum_variant_coverage_each_strand": 0,
      "polymorphism_prediction": false,
      "polymorphism_reject_indel_homopolymer_length": 0,
      "polymorphism_reject_surrounding_homopolymer_length": 0,
      "print_mutation_identification_per_position_file": false,
      "quality_score_trim": 0,
      "targeted_sequencing": false,
      "user_evidence_genome_diff_file_name": ""
    },
    "mutation_prediction": {
      "size_cutoff_AMP_becomes_INS_DEL_mutation": 50
    },
    "output": {
      "header_genome_diff_file_name": "",
      "hide_circular_genome_junctions": true,
      "max_displayed_reads": 100,
      "max_nucleotides_to_show_in_tables": 20,
      "max_rejected_junction_evidence_to_show": 10,
      "max_rejected_read_alignment_evidence_to_show": 20,
      "no_javascript": false
    },
    "read_alignment": {
      "bowtie2_genome_maximum_alignments_to_consider_per_read": 2000,
      "bowtie2_junction": "--local -i S,1,0.25 --score-min L,1,0.70 -k 2000",
      "bowtie2_junction_maximum_alignments_to_consider_per_read": 2000,
      "bowtie2_scoring": "--ma 1 --mp 3 --np 0 --rdg 2,3 --rfg 2,3 --ignore-quals",
      "bowtie2_stage1": "--local -i S,1,0.25 --score-min L,1,0.9 -k 2000",
      "bowtie2_stage2": "--local -i S,1,0.25 --score-min L,6,0.2 -k 2000",
      "maximum_read_mismatches": -1,
      "minimum_mapping_quality": 0,
      "require_match_fraction": 0.9,
      "require_match_length": 0
    },
    "read_file": {
      "aligned_sam_mode": false,
      "read_file_coverage_fold_limit": 0.0,
      "read_file_max_N_fraction": 0.5,
      "read_file_max_same_base_fraction": 0.9,
      "read_file_read_length_min": 18
    },
    "workflow": {
      "custom_run_name": "",
      "num_processors": 12,
      "skip_alignment_or_plot_generation": false,
      "skip_deletion_prediction": false,
      "skip_junction_prediction": false,
      "skip_mutation_prediction": false,
      "skip_read_filtering": false
    }
  },
  "reads": {
    "read_file": {
      "WT_B6_S50_L001_R1_001": {
        "fraction_aligned_bases": 0.976730031839545,
        "fraction_aligned_reads": 0.977131498539291,
        "max_quality_score": 36,
        "min_quality_score": 2,
        "num_aligned_bases": 112892769,
        "num_aligned_reads": 787012,
        "num_bases": 115582367,
        "num_filtered_same_base_reads": 124,
        "num_filtered_too_many_N_reads": 5,
        "num_filtered_too_short_reads": 0,
        "num_original_bases": 115601264,
        "num_original_reads": 805560,
        "num_reads": 805431,
        "quality_format": "SANGER",
        "quality_format_original": "SANGER",
        "read_length_avg": 143.503747682918,
        "read_length_max": 151,
        "read_length_min": 35
      },
      "WT_B6_S50_L001_R2_001": {
        "fraction_aligned_bases": 0.967985644522629,
        "fraction_aligned_reads": 0.968721363097914,
        "max_quality_score": 36,
        "min_quality_score": 2,
        "num_aligned_bases": 111868043,
        "num_aligned_reads": 780152,
        "num_bases": 115567874,
        "num_filtered_same_base_reads": 209,
        "num_filtered_too_many_N_reads": 9,
        "num_filtered_too_short_reads": 0,
        "num_original_bases": 115600205,
        "num_original_reads": 805560,
        "num_reads": 805342,
        "quality_format": "SANGER",
        "quality_format_original": "SANGER",
        "read_length_avg": 143.501610495914,
        "read_length_max": 151,
        "read_length_min": 35
      },
      "WT_B6_S50_L002_R2_001": {
        "fraction_aligned_bases": 0.967723342062166,
        "fraction_aligned_reads": 0.96839914658459,
        "max_quality_score": 36,
        "min_quality_score": 2,
        "num_aligned_bases": 111258722,
        "num_aligned_reads": 775250,
        "num_bases": 114969555,
        "num_filtered_same_base_reads": 473,
        "num_filtered_too_many_N_reads": 34,
        "num_filtered_too_short_reads": 0,
        "num_original_bases": 115045524,
        "num_original_reads": 801055,
        "num_reads": 800548,
        "quality_format": "SANGER",
        "quality_format_original": "SANGER",
        "read_length_avg": 143.613568455608,
        "read_length_max": 151,
        "read_length_min": 35
      },
      "WT_B6_S50_L003_R1_001": {
        "fraction_aligned_bases": 0.967144588340476,
        "fraction_aligned_reads": 0.967941810974484,
        "max_quality_score": 36,
        "min_quality_score": 2,
        "num_aligned_bases": 119467868,
        "num_aligned_reads": 828262,
        "num_bases": 123526378,
        "num_filtered_same_base_reads": 504,
        "num_filtered_too_many_N_reads": 1,
        "num_filtered_too_short_reads": 0,
        "num_original_bases": 123602511,
        "num_original_reads": 856199,
        "num_reads": 855694,
        "quality_format": "SANGER",
        "quality_format_original": "SANGER",
        "read_length_avg": 144.358121010548,
        "read_length_max": 151,
        "read_length_min": 35
      },
      "WT_B6_S50_L003_R2_001": {
        "fraction_aligned_bases": 0.958946901700506,
        "fraction_aligned_reads": 0.959991914253698,
        "max_quality_score": 36,
        "min_quality_score": 2,
        "num_aligned_bases": 118460247,
        "num_aligned_reads": 821587,
        "num_bases": 123531602,
        "num_filtered_same_base_reads": 371,
        "num_filtered_too_many_N_reads": 1,
        "num_filtered_too_short_reads": 0,
        "num_original_bases": 123587649,
        "num_original_reads": 856199,
        "num_reads": 855827,
        "quality_format": "SANGER",
        "quality_format_original": "SANGER",
        "read_length_avg": 144.341791039544,
        "read_length_max": 151,
        "read_length_min": 35
      },
      "WT_B6_S50_L004_R1_001": {
        "fraction_aligned_bases": 0.96774470634088,
        "fraction_aligned_reads": 0.968511738157345,
        "max_quality_score": 36,
        "min_quality_score": 2,
        "num_aligned_bases": 105092938,
        "num_aligned_reads": 732191,
        "num_bases": 108595725,
        "num_filtered_same_base_reads": 137,
        "num_filtered_too_many_N_reads": 1,
        "num_filtered_too_short_reads": 0,
        "num_original_bases": 108616444,
        "num_original_reads": 756134,
        "num_reads": 755996,
        "quality_format": "SANGER",
        "quality_format_original": "SANGER",
        "read_length_avg": 143.6458989201,
        "read_length_max": 151,
        "read_length_min": 35
      },
      "WT_B6_S50_L004_R2_001": {
        "fraction_aligned_bases": 0.960301455386931,
        "fraction_aligned_reads": 0.961304833918802,
        "max_quality_score": 36,
        "min_quality_score": 2,
        "num_aligned_bases": 104172991,
        "num_aligned_reads": 726559,
        "num_bases": 108479468,
        "num_filtered_same_base_reads": 328,
        "num_filtered_too_many_N_reads": 1,
        "num_filtered_too_short_reads": 0,
        "num_original_bases": 108529026,
        "num_original_reads": 756134,
        "num_reads": 755805,
        "quality_format": "SANGER",
        "quality_format_original": "SANGER",
        "read_length_avg": 143.528380997744,
        "read_length_max": 151,
        "read_length_min": 35
      }
    },
    "total_aligned_bases": 783213578,
    "total_aligned_reads": 5451013,
    "total_bases": 810252969,
    "total_fraction_aligned_bases": 0.966628457982238,
    "total_fraction_aligned_reads": 0.967410535148367,
    "total_reads": 5634643
  },
  "references": {
    "reference": {
      "AM181176": {
        "coverage_average": 116.0881,
        "coverage_deletion_coverage_propagation_cutoff": 29.0,
        "coverage_deletion_coverage_seed_cutoff": 0.0,
        "coverage_dispersion": 8.723755,
        "coverage_group": 0,
        "coverage_nbinom_dispersion": 7.73483194618293,
        "coverage_nbinom_mean_parameter": 116.2729,
        "coverage_nbinom_prob_parameter": 0.129285291129498,
        "coverage_nbinom_size_parameter": 17.26441,
        "coverage_nbinom_variance": 899.351341395333,
        "coverage_variance": 1012.724,
        "junction_only": false,
        "length": 6722539,
        "num_bases_mapped_to_reference": 781566699.590708,
        "num_features": 12117,
        "num_genes": 6091,
        "num_reads_mapped_to_reference": 5449564.00001355,
        "num_repeats": 0
      }
    },
    "total_features": 12117,
    "total_genes": 6091,
    "total_length": 6722539,
    "total_repeats": 0
  }
}