{
  "options": {
    "alignment_resolution": {
      "add_split_junction_sides": true,
      "junction_minimum_side_match": 1,
      "junction_pos_hash_neg_log10_p_value_cutoff": 3.0,
      "minimum_alignment_resolution_pos_hash_score": 3
    },
    "candidate_junction": {
      "highly_redundant_junction_ignore_passed_pair_limit": 200,
      "maximum_candidate_junction_length_factor": 0.1,
      "maximum_candidate_junctions": 5000,
      "maximum_junction_sequence_insertion_length": 0,
      "maximum_junction_sequence_negative_overlap_length_fraction": 0.4,
      "maximum_junction_sequence_negative_overlap_length_minimum": 12,
      "maximum_junction_sequence_overlap_length": 0,
      "maximum_junction_sequence_passed_alignment_pairs_to_consider": 100000,
      "maximum_junction_sequence_positive_overlap_length_fraction": 0.4,
      "maximum_junction_sequence_positive_overlap_length_minimum": 12,
      "minimum_candidate_junction_pos_hash_score": 2,
      "minimum_candidate_junctions": 100,
      "preprocess_junction_min_indel_split_length": 3,
      "required_both_unique_length_per_side": 1,
      "required_both_unique_length_per_side_fraction": 0.2,
      "required_one_unique_length_per_side": 0,
      "unmatched_end_length_factor": 0.1,
      "unmatched_end_minimum_read_length": 50
    },
    "mutation_identification": {
      "base_quality_cutoff": 3,
      "consensus_frequency_cutoff": 0.8,
      "consensus_minimum_total_coverage": 0,
      "consensus_minimum_total_coverage_each_strand": 0,
      "consensus_minimum_variant_coverage": 0,
      "consensus_minimum_variant_coverage_each_strand": 0,
      "deletion_coverage_propagation_cutoff": 0.0,
      "deletion_coverage_seed_cutoff": 0.0,
      "mixed_base_prediction": true,
      "mutation_log10_e_value_cutoff": 10.0,
      "no_indel_polymorphisms": false,
      "polymorphism_bias_p_value_cutoff": 0.0,
      "polymorphism_frequency_cutoff": 0.2,
      "polymorphism_log10_e_value_cutoff": 10.0,
      "polymorphism_minimum_total_coverage": 0,
      "polymorphism_minimum_total_coverage_each_strand": 0,
      "polymorphism_minimum_variant_coverage": 0,
      "polymorphism_minimum_variant_coverage_each_strand": 0,
      "polymorphism_prediction": false,
      "polymorphism_reject_indel_homopolymer_length": 0,
      "polymorphism_reject_surrounding_homopolymer_length": 0,
      "print_mutation_identification_per_position_file": false,
      "quality_score_trim": 0,
      "targeted_sequencing": false,
      "user_evidence_genome_diff_file_name": ""
    },
    "mutation_prediction": {
      "size_cutoff_AMP_becomes_INS_DEL_mutation": 50
    },
    "output": {
      "header_genome_diff_file_name": "",
      "hide_circular_genome_junctions": true,
      "max_displayed_reads": 100,
      "max_nucleotides_to_show_in_tables": 20,
      "max_rejected_junction_evidence_to_show": 10,
      "max_rejected_read_alignment_evidence_to_show": 20,
      "no_javascript": false
    },
    "read_alignment": {
      "bowtie2_genome_maximum_alignments_to_consider_per_read": 2000,
      "bowtie2_junction": "--local -i S,1,0.25 --score-min L,1,0.70 -k 2000",
      "bowtie2_junction_maximum_alignments_to_consider_per_read": 2000,
      "bowtie2_scoring": "--ma 1 --mp 3 --np 0 --rdg 2,3 --rfg 2,3 --ignore-quals",
      "bowtie2_stage1": "--local -i S,1,0.25 --score-min L,1,0.9 -k 2000",
      "bowtie2_stage2": "--local -i S,1,0.25 --score-min L,6,0.2 -k 2000",
      "maximum_read_mismatches": -1,
      "minimum_mapping_quality": 0,
      "require_match_fraction": 0.9,
      "require_match_length": 0
    },
    "read_file": {
      "aligned_sam_mode": false,
      "read_file_coverage_fold_limit": 0.0,
      "read_file_max_N_fraction": 0.5,
      "read_file_max_same_base_fraction": 0.9,
      "read_file_read_length_min": 18
    },
    "workflow": {
      "custom_run_name": "",
      "num_processors": 12,
      "skip_alignment_or_plot_generation": false,
      "skip_deletion_prediction": false,
      "skip_junction_prediction": false,
      "skip_mutation_prediction": false,
      "skip_read_filtering": false
    }
  },
  "reads": {
    "read_file": {
      "107_S11_L001_R1_001": {
        "fraction_aligned_bases": 0.978585636518557,
        "fraction_aligned_reads": 0.978614808933338,
        "max_quality_score": 36,
        "min_quality_score": 2,
        "num_aligned_bases": 67800978,
        "num_aligned_reads": 463425,
        "num_bases": 69284665,
        "num_filtered_same_base_reads": 45,
        "num_filtered_too_many_N_reads": 4,
        "num_filtered_too_short_reads": 0,
        "num_original_bases": 69291600,
        "num_original_reads": 473601,
        "num_reads": 473552,
        "quality_format": "SANGER",
        "quality_format_original": "SANGER",
        "read_length_avg": 146.308462428625,
        "read_length_max": 151,
        "read_length_min": 35
      },
      "107_S11_L001_R2_001": {
        "fraction_aligned_bases": 0.964117233990153,
        "fraction_aligned_reads": 0.964521211660394,
        "max_quality_score": 36,
        "min_quality_score": 2,
        "num_aligned_bases": 66812473,
        "num_aligned_reads": 456668,
        "num_bases": 69299117,
        "num_filtered_same_base_reads": 131,
        "num_filtered_too_many_N_reads": 4,
        "num_filtered_too_short_reads": 0,
        "num_original_bases": 69319034,
        "num_original_reads": 473601,
        "num_reads": 473466,
        "quality_format": "SANGER",
        "quality_format_original": "SANGER",
        "read_length_avg": 146.365561624277,
        "read_length_max": 151,
        "read_length_min": 35
      },
      "107_S11_L002_R1_001": {
        "fraction_aligned_bases": 0.978154229431537,
        "fraction_aligned_reads": 0.978204432656178,
        "max_quality_score": 36,
        "min_quality_score": 2,
        "num_aligned_bases": 71202952,
        "num_aligned_reads": 486823,
        "num_bases": 72793175,
        "num_filtered_same_base_reads": 61,
        "num_filtered_too_many_N_reads": 1,
        "num_filtered_too_short_reads": 0,
        "num_original_bases": 72802420,
        "num_original_reads": 497732,
        "num_reads": 497670,
        "quality_format": "SANGER",
        "quality_format_original": "SANGER",
        "read_length_avg": 146.267958687484,
        "read_length_max": 151,
        "read_length_min": 35
      },
      "107_S11_L002_R2_001": {
        "fraction_aligned_bases": 0.964177711616657,
        "fraction_aligned_reads": 0.964559308031093,
        "max_quality_score": 36,
        "min_quality_score": 2,
        "num_aligned_bases": 70196078,
        "num_aligned_reads": 479848,
        "num_bases": 72804087,
        "num_filtered_same_base_reads": 252,
        "num_filtered_too_many_N_reads": 1,
        "num_filtered_too_short_reads": 0,
        "num_original_bases": 72842168,
        "num_original_reads": 497732,
        "num_reads": 497479,
        "quality_format": "SANGER",
        "quality_format_original": "SANGER",
        "read_length_avg": 146.346050788073,
        "read_length_max": 151,
        "read_length_min": 35
      },
      "107_S11_L003_R1_001": {
        "fraction_aligned_bases": 0.97708688885617,
        "fraction_aligned_reads": 0.977163087019038,
        "max_quality_score": 36,
        "min_quality_score": 2,
        "num_aligned_bases": 76090960,
        "num_aligned_reads": 520568,
        "num_bases": 77875326,
        "num_filtered_same_base_reads": 51,
        "num_filtered_too_many_N_reads": 3,
        "num_filtered_too_short_reads": 0,
        "num_original_bases": 77883131,
        "num_original_reads": 532788,
        "num_reads": 532734,
        "quality_format": "SANGER",
        "quality_format_original": "SANGER",
        "read_length_avg": 146.180506594285,
        "read_length_max": 151,
        "read_length_min": 35
      },
      "107_S11_L003_R2_001": {
        "fraction_aligned_bases": 0.965269417537517,
        "fraction_aligned_reads": 0.96564018414353,
        "max_quality_score": 36,
        "min_quality_score": 2,
        "num_aligned_bases": 75190614,
        "num_aligned_reads": 514327,
        "num_bases": 77895987,
        "num_filtered_same_base_reads": 157,
        "num_filtered_too_many_N_reads": 3,
        "num_filtered_too_short_reads": 0,
        "num_original_bases": 77919790,
        "num_original_reads": 532788,
        "num_reads": 532628,
        "quality_format": "SANGER",
        "quality_format_original": "SANGER",
        "read_length_avg": 146.248389119611,
        "read_length_max": 151,
        "read_length_min": 35
      },
      "107_S11_L004_R1_001": {
        "fraction_aligned_bases": 0.975496808223909,
        "fraction_aligned_reads": 0.975638166342664,
        "max_quality_score": 36,
        "min_quality_score": 2,
        "num_aligned_bases": 71705879,
        "num_aligned_reads": 490826,
        "num_bases": 73507036,
        "num_filtered_same_base_reads": 61,
        "num_filtered_too_many_N_reads": 0,
        "num_filtered_too_short_reads": 0,
        "num_original_bases": 73516247,
        "num_original_reads": 503143,
        "num_reads": 503082,
        "quality_format": "SANGER",
        "quality_format_original": "SANGER",
        "read_length_avg": 146.113428824724,
        "read_length_max": 151,
        "read_length_min": 35
      },
      "107_S11_L004_R2_001": {
        "fraction_aligned_bases": 0.961100261715997,
        "fraction_aligned_reads": 0.961623581016995,
        "max_quality_score": 36,
        "min_quality_score": 2,
        "num_aligned_bases": 70670153,
        "num_aligned_reads": 483613,
        "num_bases": 73530469,
        "num_filtered_same_base_reads": 230,
        "num_filtered_too_many_N_reads": 0,
        "num_filtered_too_short_reads": 0,
        "num_original_bases": 73565197,
        "num_original_reads": 503143,
        "num_reads": 502913,
        "quality_format": "SANGER",
        "quality_format_original": "SANGER",
        "read_length_avg": 146.20912364564,
        "read_length_max": 151,
        "read_length_min": 35
      }
    },
    "total_aligned_bases": 569670087,
    "total_aligned_reads": 3896098,
    "total_bases": 586989862,
    "total_fraction_aligned_bases": 0.970493911187856,
    "total_fraction_aligned_reads": 0.970742419878391,
    "total_reads": 4013524
  },
  "references": {
    "reference": {
      "AM181176": {
        "coverage_average": 84.37873,
        "coverage_deletion_coverage_propagation_cutoff": 17.0,
        "coverage_deletion_coverage_seed_cutoff": 0.0,
        "coverage_dispersion": 7.937606,
        "coverage_group": 0,
        "coverage_nbinom_dispersion": 6.82727858925507,
        "coverage_nbinom_mean_parameter": 83.68345,
        "coverage_nbinom_prob_parameter": 0.146471245742604,
        "coverage_nbinom_size_parameter": 14.36064,
        "coverage_nbinom_variance": 571.330226459997,
        "coverage_variance": 669.7651,
        "junction_only": false,
        "length": 6722539,
        "num_bases_mapped_to_reference": 567968393.899772,
        "num_features": 12117,
        "num_genes": 6091,
        "num_reads_mapped_to_reference": 3891793.00000659,
        "num_repeats": 0
      }
    },
    "total_features": 12117,
    "total_genes": 6091,
    "total_length": 6722539,
    "total_repeats": 0
  }
}