{
  "options": {
    "alignment_resolution": {
      "add_split_junction_sides": true,
      "junction_minimum_side_match": 1,
      "junction_pos_hash_neg_log10_p_value_cutoff": 3.0,
      "minimum_alignment_resolution_pos_hash_score": 3
    },
    "candidate_junction": {
      "highly_redundant_junction_ignore_passed_pair_limit": 200,
      "maximum_candidate_junction_length_factor": 0.1,
      "maximum_candidate_junctions": 5000,
      "maximum_junction_sequence_insertion_length": 0,
      "maximum_junction_sequence_negative_overlap_length_fraction": 0.4,
      "maximum_junction_sequence_negative_overlap_length_minimum": 12,
      "maximum_junction_sequence_overlap_length": 0,
      "maximum_junction_sequence_passed_alignment_pairs_to_consider": 100000,
      "maximum_junction_sequence_positive_overlap_length_fraction": 0.4,
      "maximum_junction_sequence_positive_overlap_length_minimum": 12,
      "minimum_candidate_junction_pos_hash_score": 2,
      "minimum_candidate_junctions": 100,
      "preprocess_junction_min_indel_split_length": 3,
      "required_both_unique_length_per_side": 1,
      "required_both_unique_length_per_side_fraction": 0.2,
      "required_one_unique_length_per_side": 0,
      "unmatched_end_length_factor": 0.1,
      "unmatched_end_minimum_read_length": 50
    },
    "mutation_identification": {
      "base_quality_cutoff": 3,
      "consensus_frequency_cutoff": 0.8,
      "consensus_minimum_total_coverage": 0,
      "consensus_minimum_total_coverage_each_strand": 0,
      "consensus_minimum_variant_coverage": 0,
      "consensus_minimum_variant_coverage_each_strand": 0,
      "deletion_coverage_propagation_cutoff": 0.0,
      "deletion_coverage_seed_cutoff": 0.0,
      "mixed_base_prediction": true,
      "mutation_log10_e_value_cutoff": 10.0,
      "no_indel_polymorphisms": false,
      "polymorphism_bias_p_value_cutoff": 0.0,
      "polymorphism_frequency_cutoff": 0.2,
      "polymorphism_log10_e_value_cutoff": 10.0,
      "polymorphism_minimum_total_coverage": 0,
      "polymorphism_minimum_total_coverage_each_strand": 0,
      "polymorphism_minimum_variant_coverage": 0,
      "polymorphism_minimum_variant_coverage_each_strand": 0,
      "polymorphism_prediction": false,
      "polymorphism_reject_indel_homopolymer_length": 0,
      "polymorphism_reject_surrounding_homopolymer_length": 0,
      "print_mutation_identification_per_position_file": false,
      "quality_score_trim": 0,
      "targeted_sequencing": false,
      "user_evidence_genome_diff_file_name": ""
    },
    "mutation_prediction": {
      "size_cutoff_AMP_becomes_INS_DEL_mutation": 50
    },
    "output": {
      "header_genome_diff_file_name": "",
      "hide_circular_genome_junctions": true,
      "max_displayed_reads": 100,
      "max_nucleotides_to_show_in_tables": 20,
      "max_rejected_junction_evidence_to_show": 10,
      "max_rejected_read_alignment_evidence_to_show": 20,
      "no_javascript": false
    },
    "read_alignment": {
      "bowtie2_genome_maximum_alignments_to_consider_per_read": 2000,
      "bowtie2_junction": "--local -i S,1,0.25 --score-min L,1,0.70 -k 2000",
      "bowtie2_junction_maximum_alignments_to_consider_per_read": 2000,
      "bowtie2_scoring": "--ma 1 --mp 3 --np 0 --rdg 2,3 --rfg 2,3 --ignore-quals",
      "bowtie2_stage1": "--local -i S,1,0.25 --score-min L,1,0.9 -k 2000",
      "bowtie2_stage2": "--local -i S,1,0.25 --score-min L,6,0.2 -k 2000",
      "maximum_read_mismatches": -1,
      "minimum_mapping_quality": 0,
      "require_match_fraction": 0.9,
      "require_match_length": 0
    },
    "read_file": {
      "aligned_sam_mode": false,
      "read_file_coverage_fold_limit": 0.0,
      "read_file_max_N_fraction": 0.5,
      "read_file_max_same_base_fraction": 0.9,
      "read_file_read_length_min": 18
    },
    "workflow": {
      "custom_run_name": "",
      "num_processors": 12,
      "skip_alignment_or_plot_generation": false,
      "skip_deletion_prediction": false,
      "skip_junction_prediction": false,
      "skip_mutation_prediction": false,
      "skip_read_filtering": false
    }
  },
  "reads": {
    "read_file": {
      "20_S20_L001_R1_001": {
        "fraction_aligned_bases": 0.965176899462292,
        "fraction_aligned_reads": 0.966697416322251,
        "max_quality_score": 36,
        "min_quality_score": 2,
        "num_aligned_bases": 243773108,
        "num_aligned_reads": 1778324,
        "num_bases": 252568320,
        "num_filtered_same_base_reads": 50,
        "num_filtered_too_many_N_reads": 2,
        "num_filtered_too_short_reads": 0,
        "num_original_bases": 252575937,
        "num_original_reads": 1839639,
        "num_reads": 1839587,
        "quality_format": "SANGER",
        "quality_format_original": "SANGER",
        "read_length_avg": 137.296208333718,
        "read_length_max": 151,
        "read_length_min": 35
      },
      "20_S20_L001_R2_001": {
        "fraction_aligned_bases": 0.940394401643846,
        "fraction_aligned_reads": 0.943808316049469,
        "max_quality_score": 36,
        "min_quality_score": 2,
        "num_aligned_bases": 238200623,
        "num_aligned_reads": 1735571,
        "num_bases": 253298640,
        "num_filtered_same_base_reads": 726,
        "num_filtered_too_many_N_reads": 11,
        "num_filtered_too_short_reads": 0,
        "num_original_bases": 253408846,
        "num_original_reads": 1839639,
        "num_reads": 1838902,
        "quality_format": "SANGER",
        "quality_format_original": "SANGER",
        "read_length_avg": 137.744501882101,
        "read_length_max": 151,
        "read_length_min": 35
      },
      "20_S20_L002_R1_001": {
        "fraction_aligned_bases": 0.961907524055835,
        "fraction_aligned_reads": 0.963695545662759,
        "max_quality_score": 36,
        "min_quality_score": 2,
        "num_aligned_bases": 225527300,
        "num_aligned_reads": 1644346,
        "num_bases": 234458401,
        "num_filtered_same_base_reads": 84,
        "num_filtered_too_many_N_reads": 4,
        "num_filtered_too_short_reads": 0,
        "num_original_bases": 234471225,
        "num_original_reads": 1706380,
        "num_reads": 1706292,
        "quality_format": "SANGER",
        "quality_format_original": "SANGER",
        "read_length_avg": 137.408134715512,
        "read_length_max": 151,
        "read_length_min": 35
      },
      "20_S20_L002_R2_001": {
        "fraction_aligned_bases": 0.923002568369195,
        "fraction_aligned_reads": 0.927752130171651,
        "max_quality_score": 36,
        "min_quality_score": 2,
        "num_aligned_bases": 217311781,
        "num_aligned_reads": 1582169,
        "num_bases": 235440061,
        "num_filtered_same_base_reads": 989,
        "num_filtered_too_many_N_reads": 12,
        "num_filtered_too_short_reads": 0,
        "num_original_bases": 235589721,
        "num_original_reads": 1706380,
        "num_reads": 1705379,
        "quality_format": "SANGER",
        "quality_format_original": "SANGER",
        "read_length_avg": 138.057323914508,
        "read_length_max": 151,
        "read_length_min": 35
      },
      "20_S20_L003_R1_001": {
        "fraction_aligned_bases": 0.971346820588945,
        "fraction_aligned_reads": 0.972449790507733,
        "max_quality_score": 36,
        "min_quality_score": 2,
        "num_aligned_bases": 257258542,
        "num_aligned_reads": 1869772,
        "num_bases": 264847258,
        "num_filtered_same_base_reads": 32,
        "num_filtered_too_many_N_reads": 0,
        "num_filtered_too_short_reads": 0,
        "num_original_bases": 264852090,
        "num_original_reads": 1922776,
        "num_reads": 1922744,
        "quality_format": "SANGER",
        "quality_format_original": "SANGER",
        "read_length_avg": 137.744420474072,
        "read_length_max": 151,
        "read_length_min": 35
      },
      "20_S20_L003_R2_001": {
        "fraction_aligned_bases": 0.924342502771019,
        "fraction_aligned_reads": 0.928880201950502,
        "max_quality_score": 36,
        "min_quality_score": 2,
        "num_aligned_bases": 246065756,
        "num_aligned_reads": 1784991,
        "num_bases": 266206255,
        "num_filtered_same_base_reads": 947,
        "num_filtered_too_many_N_reads": 170,
        "num_filtered_too_short_reads": 0,
        "num_original_bases": 266374080,
        "num_original_reads": 1922776,
        "num_reads": 1921659,
        "quality_format": "SANGER",
        "quality_format_original": "SANGER",
        "read_length_avg": 138.529393092115,
        "read_length_max": 151,
        "read_length_min": 35
      },
      "20_S20_L004_R1_001": {
        "fraction_aligned_bases": 0.964285956535996,
        "fraction_aligned_reads": 0.966001579724578,
        "max_quality_score": 36,
        "min_quality_score": 2,
        "num_aligned_bases": 234851621,
        "num_aligned_reads": 1715869,
        "num_bases": 243549768,
        "num_filtered_same_base_reads": 56,
        "num_filtered_too_many_N_reads": 1,
        "num_filtered_too_short_reads": 0,
        "num_original_bases": 243558259,
        "num_original_reads": 1776316,
        "num_reads": 1776259,
        "quality_format": "SANGER",
        "quality_format_original": "SANGER",
        "read_length_avg": 137.113882603832,
        "read_length_max": 151,
        "read_length_min": 35
      },
      "20_S20_L004_R2_001": {
        "fraction_aligned_bases": 0.901772752657383,
        "fraction_aligned_reads": 0.908136179839588,
        "max_quality_score": 36,
        "min_quality_score": 2,
        "num_aligned_bases": 221277788,
        "num_aligned_reads": 1612107,
        "num_bases": 245380876,
        "num_filtered_same_base_reads": 1009,
        "num_filtered_too_many_N_reads": 125,
        "num_filtered_too_short_reads": 0,
        "num_original_bases": 245551976,
        "num_original_reads": 1776316,
        "num_reads": 1775182,
        "quality_format": "SANGER",
        "quality_format_original": "SANGER",
        "read_length_avg": 138.228573746241,
        "read_length_max": 151,
        "read_length_min": 35
      }
    },
    "total_aligned_bases": 1884266519,
    "total_aligned_reads": 13723149,
    "total_bases": 1995749579,
    "total_fraction_aligned_bases": 0.944139755221264,
    "total_fraction_aligned_reads": 0.947338479265918,
    "total_reads": 14486004
  },
  "references": {
    "reference": {
      "AM181176": {
        "coverage_average": 279.5309,
        "coverage_deletion_coverage_propagation_cutoff": 66.0,
        "coverage_deletion_coverage_seed_cutoff": 0.0,
        "coverage_dispersion": 26.17409,
        "coverage_group": 0,
        "coverage_nbinom_dispersion": 20.9290135726049,
        "coverage_nbinom_mean_parameter": 280.744,
        "coverage_nbinom_prob_parameter": 0.0477805605376907,
        "coverage_nbinom_size_parameter": 14.0872,
        "coverage_nbinom_variance": 5875.6949864274,
        "coverage_variance": 7316.467,
        "junction_only": false,
        "length": 6722539,
        "num_bases_mapped_to_reference": 1878113981.88792,
        "num_features": 12117,
        "num_genes": 6091,
        "num_reads_mapped_to_reference": 13721540.9999373,
        "num_repeats": 0
      }
    },
    "total_features": 12117,
    "total_genes": 6091,
    "total_length": 6722539,
    "total_repeats": 0
  }
}