{
  "options": {
    "alignment_resolution": {
      "add_split_junction_sides": true,
      "junction_minimum_side_match": 1,
      "junction_pos_hash_neg_log10_p_value_cutoff": 3.0,
      "minimum_alignment_resolution_pos_hash_score": 3
    },
    "candidate_junction": {
      "highly_redundant_junction_ignore_passed_pair_limit": 200,
      "maximum_candidate_junction_length_factor": 0.1,
      "maximum_candidate_junctions": 5000,
      "maximum_junction_sequence_insertion_length": 0,
      "maximum_junction_sequence_negative_overlap_length_fraction": 0.4,
      "maximum_junction_sequence_negative_overlap_length_minimum": 12,
      "maximum_junction_sequence_overlap_length": 0,
      "maximum_junction_sequence_passed_alignment_pairs_to_consider": 100000,
      "maximum_junction_sequence_positive_overlap_length_fraction": 0.4,
      "maximum_junction_sequence_positive_overlap_length_minimum": 12,
      "minimum_candidate_junction_pos_hash_score": 2,
      "minimum_candidate_junctions": 100,
      "preprocess_junction_min_indel_split_length": 3,
      "required_both_unique_length_per_side": 1,
      "required_both_unique_length_per_side_fraction": 0.2,
      "required_one_unique_length_per_side": 0,
      "unmatched_end_length_factor": 0.1,
      "unmatched_end_minimum_read_length": 50
    },
    "mutation_identification": {
      "base_quality_cutoff": 3,
      "consensus_frequency_cutoff": 0.8,
      "consensus_minimum_total_coverage": 0,
      "consensus_minimum_total_coverage_each_strand": 0,
      "consensus_minimum_variant_coverage": 0,
      "consensus_minimum_variant_coverage_each_strand": 0,
      "deletion_coverage_propagation_cutoff": 0.0,
      "deletion_coverage_seed_cutoff": 0.0,
      "mixed_base_prediction": true,
      "mutation_log10_e_value_cutoff": 10.0,
      "no_indel_polymorphisms": false,
      "polymorphism_bias_p_value_cutoff": 0.0,
      "polymorphism_frequency_cutoff": 0.2,
      "polymorphism_log10_e_value_cutoff": 10.0,
      "polymorphism_minimum_total_coverage": 0,
      "polymorphism_minimum_total_coverage_each_strand": 0,
      "polymorphism_minimum_variant_coverage": 0,
      "polymorphism_minimum_variant_coverage_each_strand": 0,
      "polymorphism_prediction": false,
      "polymorphism_reject_indel_homopolymer_length": 0,
      "polymorphism_reject_surrounding_homopolymer_length": 0,
      "print_mutation_identification_per_position_file": false,
      "quality_score_trim": 0,
      "targeted_sequencing": false,
      "user_evidence_genome_diff_file_name": ""
    },
    "mutation_prediction": {
      "size_cutoff_AMP_becomes_INS_DEL_mutation": 50
    },
    "output": {
      "header_genome_diff_file_name": "",
      "hide_circular_genome_junctions": true,
      "max_displayed_reads": 100,
      "max_nucleotides_to_show_in_tables": 20,
      "max_rejected_junction_evidence_to_show": 10,
      "max_rejected_read_alignment_evidence_to_show": 20,
      "no_javascript": false
    },
    "read_alignment": {
      "bowtie2_genome_maximum_alignments_to_consider_per_read": 2000,
      "bowtie2_junction": "--local -i S,1,0.25 --score-min L,1,0.70 -k 2000",
      "bowtie2_junction_maximum_alignments_to_consider_per_read": 2000,
      "bowtie2_scoring": "--ma 1 --mp 3 --np 0 --rdg 2,3 --rfg 2,3 --ignore-quals",
      "bowtie2_stage1": "--local -i S,1,0.25 --score-min L,1,0.9 -k 2000",
      "bowtie2_stage2": "--local -i S,1,0.25 --score-min L,6,0.2 -k 2000",
      "maximum_read_mismatches": -1,
      "minimum_mapping_quality": 0,
      "require_match_fraction": 0.9,
      "require_match_length": 0
    },
    "read_file": {
      "aligned_sam_mode": false,
      "read_file_coverage_fold_limit": 0.0,
      "read_file_max_N_fraction": 0.5,
      "read_file_max_same_base_fraction": 0.9,
      "read_file_read_length_min": 18
    },
    "workflow": {
      "custom_run_name": "",
      "num_processors": 12,
      "skip_alignment_or_plot_generation": false,
      "skip_deletion_prediction": false,
      "skip_junction_prediction": false,
      "skip_mutation_prediction": false,
      "skip_read_filtering": false
    }
  },
  "reads": {
    "read_file": {
      "4_S4_L001_R1_001": {
        "fraction_aligned_bases": 0.968388899155653,
        "fraction_aligned_reads": 0.968832543793787,
        "max_quality_score": 36,
        "min_quality_score": 2,
        "num_aligned_bases": 149202793,
        "num_aligned_reads": 1076154,
        "num_bases": 154073217,
        "num_filtered_same_base_reads": 30,
        "num_filtered_too_many_N_reads": 2,
        "num_filtered_too_short_reads": 0,
        "num_original_bases": 154077817,
        "num_original_reads": 1110806,
        "num_reads": 1110774,
        "quality_format": "SANGER",
        "quality_format_original": "SANGER",
        "read_length_avg": 138.70797930092,
        "read_length_max": 151,
        "read_length_min": 35
      },
      "4_S4_L001_R2_001": {
        "fraction_aligned_bases": 0.945201937258641,
        "fraction_aligned_reads": 0.947315520562861,
        "max_quality_score": 36,
        "min_quality_score": 2,
        "num_aligned_bases": 145874222,
        "num_aligned_reads": 1051830,
        "num_bases": 154331277,
        "num_filtered_same_base_reads": 475,
        "num_filtered_too_many_N_reads": 4,
        "num_filtered_too_short_reads": 0,
        "num_original_bases": 154403088,
        "num_original_reads": 1110806,
        "num_reads": 1110327,
        "quality_format": "SANGER",
        "quality_format_original": "SANGER",
        "read_length_avg": 138.996238945824,
        "read_length_max": 151,
        "read_length_min": 35
      },
      "4_S4_L002_R1_001": {
        "fraction_aligned_bases": 0.965480934999847,
        "fraction_aligned_reads": 0.966151038624975,
        "max_quality_score": 36,
        "min_quality_score": 2,
        "num_aligned_bases": 137944056,
        "num_aligned_reads": 994267,
        "num_bases": 142876002,
        "num_filtered_same_base_reads": 44,
        "num_filtered_too_many_N_reads": 3,
        "num_filtered_too_short_reads": 0,
        "num_original_bases": 142882751,
        "num_original_reads": 1029148,
        "num_reads": 1029101,
        "quality_format": "SANGER",
        "quality_format_original": "SANGER",
        "read_length_avg": 138.835743041742,
        "read_length_max": 151,
        "read_length_min": 35
      },
      "4_S4_L002_R2_001": {
        "fraction_aligned_bases": 0.928124192591427,
        "fraction_aligned_reads": 0.931429265921245,
        "max_quality_score": 36,
        "min_quality_score": 2,
        "num_aligned_bases": 132951603,
        "num_aligned_reads": 957975,
        "num_bases": 143247643,
        "num_filtered_same_base_reads": 643,
        "num_filtered_too_many_N_reads": 5,
        "num_filtered_too_short_reads": 0,
        "num_original_bases": 143344980,
        "num_original_reads": 1029148,
        "num_reads": 1028500,
        "quality_format": "SANGER",
        "quality_format_original": "SANGER",
        "read_length_avg": 139.278213903743,
        "read_length_max": 151,
        "read_length_min": 35
      },
      "4_S4_L003_R1_001": {
        "fraction_aligned_bases": 0.972578904261634,
        "fraction_aligned_reads": 0.972783755929037,
        "max_quality_score": 36,
        "min_quality_score": 2,
        "num_aligned_bases": 161318891,
        "num_aligned_reads": 1158137,
        "num_bases": 165867150,
        "num_filtered_same_base_reads": 40,
        "num_filtered_too_many_N_reads": 1,
        "num_filtered_too_short_reads": 0,
        "num_original_bases": 165873225,
        "num_original_reads": 1190580,
        "num_reads": 1190539,
        "quality_format": "SANGER",
        "quality_format_original": "SANGER",
        "read_length_avg": 139.321055421116,
        "read_length_max": 151,
        "read_length_min": 35
      },
      "4_S4_L003_R2_001": {
        "fraction_aligned_bases": 0.926546676816305,
        "fraction_aligned_reads": 0.929774251567464,
        "max_quality_score": 36,
        "min_quality_score": 2,
        "num_aligned_bases": 154255890,
        "num_aligned_reads": 1106264,
        "num_bases": 166484748,
        "num_filtered_same_base_reads": 651,
        "num_filtered_too_many_N_reads": 109,
        "num_filtered_too_short_reads": 0,
        "num_original_bases": 166598834,
        "num_original_reads": 1190580,
        "num_reads": 1189820,
        "quality_format": "SANGER",
        "quality_format_original": "SANGER",
        "read_length_avg": 139.924314602209,
        "read_length_max": 151,
        "read_length_min": 35
      },
      "4_S4_L004_R1_001": {
        "fraction_aligned_bases": 0.966820280159873,
        "fraction_aligned_reads": 0.96742282498453,
        "max_quality_score": 36,
        "min_quality_score": 2,
        "num_aligned_bases": 146478239,
        "num_aligned_reads": 1056863,
        "num_bases": 151505137,
        "num_filtered_same_base_reads": 27,
        "num_filtered_too_many_N_reads": 4,
        "num_filtered_too_short_reads": 0,
        "num_original_bases": 151509354,
        "num_original_reads": 1092483,
        "num_reads": 1092452,
        "quality_format": "SANGER",
        "quality_format_original": "SANGER",
        "read_length_avg": 138.683564129133,
        "read_length_max": 151,
        "read_length_min": 35
      },
      "4_S4_L004_R2_001": {
        "fraction_aligned_bases": 0.907176299196749,
        "fraction_aligned_reads": 0.911788575437979,
        "max_quality_score": 36,
        "min_quality_score": 2,
        "num_aligned_bases": 138201030,
        "num_aligned_reads": 995416,
        "num_bases": 152341976,
        "num_filtered_same_base_reads": 688,
        "num_filtered_too_many_N_reads": 77,
        "num_filtered_too_short_reads": 0,
        "num_original_bases": 152456891,
        "num_original_reads": 1092483,
        "num_reads": 1091718,
        "quality_format": "SANGER",
        "quality_format_original": "SANGER",
        "read_length_avg": 139.543339946763,
        "read_length_max": 151,
        "read_length_min": 35
      }
    },
    "total_aligned_bases": 1166226724,
    "total_aligned_reads": 8396906,
    "total_bases": 1230727150,
    "total_fraction_aligned_bases": 0.947591611999459,
    "total_fraction_aligned_reads": 0.949529193571897,
    "total_reads": 8843231
  },
  "references": {
    "reference": {
      "AM181176": {
        "coverage_average": 172.8608,
        "coverage_deletion_coverage_propagation_cutoff": 34.0,
        "coverage_deletion_coverage_seed_cutoff": 0.0,
        "coverage_dispersion": 18.07968,
        "coverage_group": 0,
        "coverage_nbinom_dispersion": 15.8024516674379,
        "coverage_nbinom_mean_parameter": 177.2188,
        "coverage_nbinom_prob_parameter": 0.0632813199524333,
        "coverage_nbinom_size_parameter": 11.97226,
        "coverage_nbinom_variance": 2800.49152156134,
        "coverage_variance": 3125.268,
        "junction_only": false,
        "length": 6722539,
        "num_bases_mapped_to_reference": 1162331591.79698,
        "num_features": 12117,
        "num_genes": 6091,
        "num_reads_mapped_to_reference": 8396174.00002373,
        "num_repeats": 0
      }
    },
    "total_features": 12117,
    "total_genes": 6091,
    "total_length": 6722539,
    "total_repeats": 0
  }
}