{
  "options": {
    "alignment_resolution": {
      "add_split_junction_sides": true,
      "junction_minimum_side_match": 1,
      "junction_pos_hash_neg_log10_p_value_cutoff": 3.0,
      "minimum_alignment_resolution_pos_hash_score": 3
    },
    "candidate_junction": {
      "highly_redundant_junction_ignore_passed_pair_limit": 200,
      "maximum_candidate_junction_length_factor": 0.1,
      "maximum_candidate_junctions": 5000,
      "maximum_junction_sequence_insertion_length": 0,
      "maximum_junction_sequence_negative_overlap_length_fraction": 0.4,
      "maximum_junction_sequence_negative_overlap_length_minimum": 12,
      "maximum_junction_sequence_overlap_length": 0,
      "maximum_junction_sequence_passed_alignment_pairs_to_consider": 100000,
      "maximum_junction_sequence_positive_overlap_length_fraction": 0.4,
      "maximum_junction_sequence_positive_overlap_length_minimum": 12,
      "minimum_candidate_junction_pos_hash_score": 2,
      "minimum_candidate_junctions": 100,
      "preprocess_junction_min_indel_split_length": 3,
      "required_both_unique_length_per_side": 1,
      "required_both_unique_length_per_side_fraction": 0.2,
      "required_one_unique_length_per_side": 0,
      "unmatched_end_length_factor": 0.1,
      "unmatched_end_minimum_read_length": 50
    },
    "mutation_identification": {
      "base_quality_cutoff": 3,
      "consensus_frequency_cutoff": 0.8,
      "consensus_minimum_total_coverage": 0,
      "consensus_minimum_total_coverage_each_strand": 0,
      "consensus_minimum_variant_coverage": 0,
      "consensus_minimum_variant_coverage_each_strand": 0,
      "deletion_coverage_propagation_cutoff": 0.0,
      "deletion_coverage_seed_cutoff": 0.0,
      "mixed_base_prediction": true,
      "mutation_log10_e_value_cutoff": 10.0,
      "no_indel_polymorphisms": false,
      "polymorphism_bias_p_value_cutoff": 0.0,
      "polymorphism_frequency_cutoff": 0.2,
      "polymorphism_log10_e_value_cutoff": 10.0,
      "polymorphism_minimum_total_coverage": 0,
      "polymorphism_minimum_total_coverage_each_strand": 0,
      "polymorphism_minimum_variant_coverage": 0,
      "polymorphism_minimum_variant_coverage_each_strand": 0,
      "polymorphism_prediction": false,
      "polymorphism_reject_indel_homopolymer_length": 0,
      "polymorphism_reject_surrounding_homopolymer_length": 0,
      "print_mutation_identification_per_position_file": false,
      "quality_score_trim": 0,
      "targeted_sequencing": false,
      "user_evidence_genome_diff_file_name": ""
    },
    "mutation_prediction": {
      "size_cutoff_AMP_becomes_INS_DEL_mutation": 50
    },
    "output": {
      "header_genome_diff_file_name": "",
      "hide_circular_genome_junctions": true,
      "max_displayed_reads": 100,
      "max_nucleotides_to_show_in_tables": 20,
      "max_rejected_junction_evidence_to_show": 10,
      "max_rejected_read_alignment_evidence_to_show": 20,
      "no_javascript": false
    },
    "read_alignment": {
      "bowtie2_genome_maximum_alignments_to_consider_per_read": 2000,
      "bowtie2_junction": "--local -i S,1,0.25 --score-min L,1,0.70 -k 2000",
      "bowtie2_junction_maximum_alignments_to_consider_per_read": 2000,
      "bowtie2_scoring": "--ma 1 --mp 3 --np 0 --rdg 2,3 --rfg 2,3 --ignore-quals",
      "bowtie2_stage1": "--local -i S,1,0.25 --score-min L,1,0.9 -k 2000",
      "bowtie2_stage2": "--local -i S,1,0.25 --score-min L,6,0.2 -k 2000",
      "maximum_read_mismatches": -1,
      "minimum_mapping_quality": 0,
      "require_match_fraction": 0.9,
      "require_match_length": 0
    },
    "read_file": {
      "aligned_sam_mode": false,
      "read_file_coverage_fold_limit": 0.0,
      "read_file_max_N_fraction": 0.5,
      "read_file_max_same_base_fraction": 0.9,
      "read_file_read_length_min": 18
    },
    "workflow": {
      "custom_run_name": "",
      "num_processors": 12,
      "skip_alignment_or_plot_generation": false,
      "skip_deletion_prediction": false,
      "skip_junction_prediction": false,
      "skip_mutation_prediction": false,
      "skip_read_filtering": false
    }
  },
  "reads": {
    "read_file": {
      "15_S15_L001_R1_001": {
        "fraction_aligned_bases": 0.964471403266162,
        "fraction_aligned_reads": 0.965420419097758,
        "max_quality_score": 36,
        "min_quality_score": 2,
        "num_aligned_bases": 204865319,
        "num_aligned_reads": 1490501,
        "num_bases": 212412020,
        "num_filtered_same_base_reads": 46,
        "num_filtered_too_many_N_reads": 8,
        "num_filtered_too_short_reads": 0,
        "num_original_bases": 212419245,
        "num_original_reads": 1543942,
        "num_reads": 1543888,
        "quality_format": "SANGER",
        "quality_format_original": "SANGER",
        "read_length_avg": 137.582531893505,
        "read_length_max": 151,
        "read_length_min": 35
      },
      "15_S15_L001_R2_001": {
        "fraction_aligned_bases": 0.943561780445354,
        "fraction_aligned_reads": 0.946156029324669,
        "max_quality_score": 36,
        "min_quality_score": 2,
        "num_aligned_bases": 200730310,
        "num_aligned_reads": 1460178,
        "num_bases": 212736796,
        "num_filtered_same_base_reads": 646,
        "num_filtered_too_many_N_reads": 22,
        "num_filtered_too_short_reads": 0,
        "num_original_bases": 212835436,
        "num_original_reads": 1543942,
        "num_reads": 1543274,
        "quality_format": "SANGER",
        "quality_format_original": "SANGER",
        "read_length_avg": 137.847715959706,
        "read_length_max": 151,
        "read_length_min": 35
      },
      "15_S15_L002_R1_001": {
        "fraction_aligned_bases": 0.961086970483114,
        "fraction_aligned_reads": 0.962261450682912,
        "max_quality_score": 36,
        "min_quality_score": 2,
        "num_aligned_bases": 188514079,
        "num_aligned_reads": 1371645,
        "num_bases": 196146743,
        "num_filtered_same_base_reads": 63,
        "num_filtered_too_many_N_reads": 4,
        "num_filtered_too_short_reads": 0,
        "num_original_bases": 196156396,
        "num_original_reads": 1425506,
        "num_reads": 1425439,
        "quality_format": "SANGER",
        "quality_format_original": "SANGER",
        "read_length_avg": 137.604445367357,
        "read_length_max": 151,
        "read_length_min": 35
      },
      "15_S15_L002_R2_001": {
        "fraction_aligned_bases": 0.926665243951643,
        "fraction_aligned_reads": 0.930524415292322,
        "max_quality_score": 36,
        "min_quality_score": 2,
        "num_aligned_bases": 182243760,
        "num_aligned_reads": 1325586,
        "num_bases": 196666230,
        "num_filtered_same_base_reads": 932,
        "num_filtered_too_many_N_reads": 16,
        "num_filtered_too_short_reads": 0,
        "num_original_bases": 196807685,
        "num_original_reads": 1425506,
        "num_reads": 1424558,
        "quality_format": "SANGER",
        "quality_format_original": "SANGER",
        "read_length_avg": 138.054210498976,
        "read_length_max": 151,
        "read_length_min": 35
      },
      "15_S15_L003_R1_001": {
        "fraction_aligned_bases": 0.968907913890093,
        "fraction_aligned_reads": 0.969623591301925,
        "max_quality_score": 36,
        "min_quality_score": 2,
        "num_aligned_bases": 216532868,
        "num_aligned_reads": 1569265,
        "num_bases": 223481370,
        "num_filtered_same_base_reads": 53,
        "num_filtered_too_many_N_reads": 4,
        "num_filtered_too_short_reads": 0,
        "num_original_bases": 223489510,
        "num_original_reads": 1618484,
        "num_reads": 1618427,
        "quality_format": "SANGER",
        "quality_format_original": "SANGER",
        "read_length_avg": 138.085542319796,
        "read_length_max": 151,
        "read_length_min": 35
      },
      "15_S15_L003_R2_001": {
        "fraction_aligned_bases": 0.925942822833157,
        "fraction_aligned_reads": 0.929738863135299,
        "max_quality_score": 36,
        "min_quality_score": 2,
        "num_aligned_bases": 207728837,
        "num_aligned_reads": 1503821,
        "num_bases": 224343050,
        "num_filtered_same_base_reads": 870,
        "num_filtered_too_many_N_reads": 148,
        "num_filtered_too_short_reads": 0,
        "num_original_bases": 224495923,
        "num_original_reads": 1618484,
        "num_reads": 1617466,
        "quality_format": "SANGER",
        "quality_format_original": "SANGER",
        "read_length_avg": 138.700318893875,
        "read_length_max": 151,
        "read_length_min": 35
      },
      "15_S15_L004_R1_001": {
        "fraction_aligned_bases": 0.962330555590418,
        "fraction_aligned_reads": 0.96359425826853,
        "max_quality_score": 36,
        "min_quality_score": 2,
        "num_aligned_bases": 198288236,
        "num_aligned_reads": 1444687,
        "num_bases": 206050026,
        "num_filtered_same_base_reads": 57,
        "num_filtered_too_many_N_reads": 7,
        "num_filtered_too_short_reads": 0,
        "num_original_bases": 206058877,
        "num_original_reads": 1499333,
        "num_reads": 1499269,
        "quality_format": "SANGER",
        "quality_format_original": "SANGER",
        "read_length_avg": 137.433660003642,
        "read_length_max": 151,
        "read_length_min": 35
      },
      "15_S15_L004_R2_001": {
        "fraction_aligned_bases": 0.90442417050452,
        "fraction_aligned_reads": 0.90998268628265,
        "max_quality_score": 36,
        "min_quality_score": 2,
        "num_aligned_bases": 187443067,
        "num_aligned_reads": 1363367,
        "num_bases": 207251280,
        "num_filtered_same_base_reads": 978,
        "num_filtered_too_many_N_reads": 121,
        "num_filtered_too_short_reads": 0,
        "num_original_bases": 207416308,
        "num_original_reads": 1499333,
        "num_reads": 1498234,
        "quality_format": "SANGER",
        "quality_format_original": "SANGER",
        "read_length_avg": 138.330380968527,
        "read_length_max": 151,
        "read_length_min": 35
      }
    },
    "total_aligned_bases": 1586346476,
    "total_aligned_reads": 11529050,
    "total_bases": 1679087515,
    "total_fraction_aligned_bases": 0.944767001021981,
    "total_fraction_aligned_reads": 0.947290407052102,
    "total_reads": 12170555
  },
  "references": {
    "reference": {
      "AM181176": {
        "coverage_average": 235.7692,
        "coverage_deletion_coverage_propagation_cutoff": 49.0,
        "coverage_deletion_coverage_seed_cutoff": 0.0,
        "coverage_dispersion": 20.84129,
        "coverage_group": 0,
        "coverage_nbinom_dispersion": 20.9852699843802,
        "coverage_nbinom_mean_parameter": 242.5908,
        "coverage_nbinom_prob_parameter": 0.0476524724601742,
        "coverage_nbinom_size_parameter": 12.13848,
        "coverage_nbinom_variance": 5090.83343372679,
        "coverage_variance": 4913.735,
        "junction_only": false,
        "length": 6722539,
        "num_bases_mapped_to_reference": 1581121530.48079,
        "num_features": 12117,
        "num_genes": 6091,
        "num_reads_mapped_to_reference": 11527561.9999832,
        "num_repeats": 0
      }
    },
    "total_features": 12117,
    "total_genes": 6091,
    "total_length": 6722539,
    "total_repeats": 0
  }
}