{
  "options": {
    "alignment_resolution": {
      "add_split_junction_sides": true,
      "junction_minimum_side_match": 1,
      "junction_pos_hash_neg_log10_p_value_cutoff": 3.0,
      "minimum_alignment_resolution_pos_hash_score": 3
    },
    "candidate_junction": {
      "highly_redundant_junction_ignore_passed_pair_limit": 200,
      "maximum_candidate_junction_length_factor": 0.1,
      "maximum_candidate_junctions": 5000,
      "maximum_junction_sequence_insertion_length": 0,
      "maximum_junction_sequence_negative_overlap_length_fraction": 0.4,
      "maximum_junction_sequence_negative_overlap_length_minimum": 12,
      "maximum_junction_sequence_overlap_length": 0,
      "maximum_junction_sequence_passed_alignment_pairs_to_consider": 100000,
      "maximum_junction_sequence_positive_overlap_length_fraction": 0.4,
      "maximum_junction_sequence_positive_overlap_length_minimum": 12,
      "minimum_candidate_junction_pos_hash_score": 2,
      "minimum_candidate_junctions": 100,
      "preprocess_junction_min_indel_split_length": 3,
      "required_both_unique_length_per_side": 1,
      "required_both_unique_length_per_side_fraction": 0.2,
      "required_one_unique_length_per_side": 0,
      "unmatched_end_length_factor": 0.1,
      "unmatched_end_minimum_read_length": 50
    },
    "mutation_identification": {
      "base_quality_cutoff": 3,
      "consensus_frequency_cutoff": 0.8,
      "consensus_minimum_total_coverage": 0,
      "consensus_minimum_total_coverage_each_strand": 0,
      "consensus_minimum_variant_coverage": 0,
      "consensus_minimum_variant_coverage_each_strand": 0,
      "deletion_coverage_propagation_cutoff": 0.0,
      "deletion_coverage_seed_cutoff": 0.0,
      "mixed_base_prediction": true,
      "mutation_log10_e_value_cutoff": 10.0,
      "no_indel_polymorphisms": false,
      "polymorphism_bias_p_value_cutoff": 0.0,
      "polymorphism_frequency_cutoff": 0.2,
      "polymorphism_log10_e_value_cutoff": 10.0,
      "polymorphism_minimum_total_coverage": 0,
      "polymorphism_minimum_total_coverage_each_strand": 0,
      "polymorphism_minimum_variant_coverage": 0,
      "polymorphism_minimum_variant_coverage_each_strand": 0,
      "polymorphism_prediction": false,
      "polymorphism_reject_indel_homopolymer_length": 0,
      "polymorphism_reject_surrounding_homopolymer_length": 0,
      "print_mutation_identification_per_position_file": false,
      "quality_score_trim": 0,
      "targeted_sequencing": false,
      "user_evidence_genome_diff_file_name": ""
    },
    "mutation_prediction": {
      "size_cutoff_AMP_becomes_INS_DEL_mutation": 50
    },
    "output": {
      "header_genome_diff_file_name": "",
      "hide_circular_genome_junctions": true,
      "max_displayed_reads": 100,
      "max_nucleotides_to_show_in_tables": 20,
      "max_rejected_junction_evidence_to_show": 10,
      "max_rejected_read_alignment_evidence_to_show": 20,
      "no_javascript": false
    },
    "read_alignment": {
      "bowtie2_genome_maximum_alignments_to_consider_per_read": 2000,
      "bowtie2_junction": "--local -i S,1,0.25 --score-min L,1,0.70 -k 2000",
      "bowtie2_junction_maximum_alignments_to_consider_per_read": 2000,
      "bowtie2_scoring": "--ma 1 --mp 3 --np 0 --rdg 2,3 --rfg 2,3 --ignore-quals",
      "bowtie2_stage1": "--local -i S,1,0.25 --score-min L,1,0.9 -k 2000",
      "bowtie2_stage2": "--local -i S,1,0.25 --score-min L,6,0.2 -k 2000",
      "maximum_read_mismatches": -1,
      "minimum_mapping_quality": 0,
      "require_match_fraction": 0.9,
      "require_match_length": 0
    },
    "read_file": {
      "aligned_sam_mode": false,
      "read_file_coverage_fold_limit": 0.0,
      "read_file_max_N_fraction": 0.5,
      "read_file_max_same_base_fraction": 0.9,
      "read_file_read_length_min": 18
    },
    "workflow": {
      "custom_run_name": "",
      "num_processors": 12,
      "skip_alignment_or_plot_generation": false,
      "skip_deletion_prediction": false,
      "skip_junction_prediction": false,
      "skip_mutation_prediction": false,
      "skip_read_filtering": false
    }
  },
  "reads": {
    "read_file": {
      "17_a7_S86_L001_R1_001": {
        "fraction_aligned_bases": 0.978445808154644,
        "fraction_aligned_reads": 0.978682290505251,
        "max_quality_score": 36,
        "min_quality_score": 2,
        "num_aligned_bases": 185237245,
        "num_aligned_reads": 1312273,
        "num_bases": 189317838,
        "num_filtered_same_base_reads": 213,
        "num_filtered_too_many_N_reads": 4,
        "num_filtered_too_short_reads": 0,
        "num_original_bases": 189350138,
        "num_original_reads": 1341074,
        "num_reads": 1340857,
        "quality_format": "SANGER",
        "quality_format_original": "SANGER",
        "read_length_avg": 141.191669208573,
        "read_length_max": 151,
        "read_length_min": 35
      },
      "17_a7_S86_L001_R2_001": {
        "fraction_aligned_bases": 0.970286583353263,
        "fraction_aligned_reads": 0.970914676037784,
        "max_quality_score": 36,
        "min_quality_score": 2,
        "num_aligned_bases": 183659714,
        "num_aligned_reads": 1301582,
        "num_bases": 189283988,
        "num_filtered_same_base_reads": 484,
        "num_filtered_too_many_N_reads": 17,
        "num_filtered_too_short_reads": 0,
        "num_original_bases": 189359166,
        "num_original_reads": 1341074,
        "num_reads": 1340573,
        "quality_format": "SANGER",
        "quality_format_original": "SANGER",
        "read_length_avg": 141.196330225956,
        "read_length_max": 151,
        "read_length_min": 35
      },
      "17_a7_S86_L002_R1_001": {
        "fraction_aligned_bases": 0.977852206829231,
        "fraction_aligned_reads": 0.978137494287787,
        "max_quality_score": 36,
        "min_quality_score": 2,
        "num_aligned_bases": 183268425,
        "num_aligned_reads": 1297114,
        "num_bases": 187419350,
        "num_filtered_same_base_reads": 206,
        "num_filtered_too_many_N_reads": 6,
        "num_filtered_too_short_reads": 0,
        "num_original_bases": 187450660,
        "num_original_reads": 1326318,
        "num_reads": 1326106,
        "quality_format": "SANGER",
        "quality_format_original": "SANGER",
        "read_length_avg": 141.330594990144,
        "read_length_max": 151,
        "read_length_min": 35
      },
      "17_a7_S86_L003_R1_001": {
        "fraction_aligned_bases": 0.967414808795912,
        "fraction_aligned_reads": 0.968327474334843,
        "max_quality_score": 36,
        "min_quality_score": 2,
        "num_aligned_bases": 190441754,
        "num_aligned_reads": 1341181,
        "num_bases": 196856356,
        "num_filtered_same_base_reads": 691,
        "num_filtered_too_many_N_reads": 7,
        "num_filtered_too_short_reads": 0,
        "num_original_bases": 196960923,
        "num_original_reads": 1385747,
        "num_reads": 1385049,
        "quality_format": "SANGER",
        "quality_format_original": "SANGER",
        "read_length_avg": 142.129524659416,
        "read_length_max": 151,
        "read_length_min": 35
      },
      "17_a7_S86_L003_R2_001": {
        "fraction_aligned_bases": 0.96065751727319,
        "fraction_aligned_reads": 0.961821842968422,
        "max_quality_score": 36,
        "min_quality_score": 2,
        "num_aligned_bases": 189077212,
        "num_aligned_reads": 1332180,
        "num_bases": 196820624,
        "num_filtered_same_base_reads": 682,
        "num_filtered_too_many_N_reads": 6,
        "num_filtered_too_short_reads": 0,
        "num_original_bases": 196923796,
        "num_original_reads": 1385747,
        "num_reads": 1385059,
        "quality_format": "SANGER",
        "quality_format_original": "SANGER",
        "read_length_avg": 142.102700318181,
        "read_length_max": 151,
        "read_length_min": 35
      },
      "17_a7_S86_L004_R1_001": {
        "fraction_aligned_bases": 0.968691418341236,
        "fraction_aligned_reads": 0.969553384694434,
        "max_quality_score": 36,
        "min_quality_score": 2,
        "num_aligned_bases": 174372540,
        "num_aligned_reads": 1234065,
        "num_bases": 180008346,
        "num_filtered_same_base_reads": 235,
        "num_filtered_too_many_N_reads": 6,
        "num_filtered_too_short_reads": 0,
        "num_original_bases": 180044039,
        "num_original_reads": 1273059,
        "num_reads": 1272818,
        "quality_format": "SANGER",
        "quality_format_original": "SANGER",
        "read_length_avg": 141.425047414477,
        "read_length_max": 151,
        "read_length_min": 35
      },
      "17_a7_S86_L004_R2_001": {
        "fraction_aligned_bases": 0.962060524041775,
        "fraction_aligned_reads": 0.963214856179804,
        "max_quality_score": 36,
        "min_quality_score": 2,
        "num_aligned_bases": 172951989,
        "num_aligned_reads": 1225348,
        "num_bases": 179772462,
        "num_filtered_same_base_reads": 909,
        "num_filtered_too_many_N_reads": 6,
        "num_filtered_too_short_reads": 0,
        "num_original_bases": 179909920,
        "num_original_reads": 1273059,
        "num_reads": 1272144,
        "quality_format": "SANGER",
        "quality_format_original": "SANGER",
        "read_length_avg": 141.314554012753,
        "read_length_max": 151,
        "read_length_min": 35
      }
    },
    "total_aligned_bases": 1279008879,
    "total_aligned_reads": 9043743,
    "total_bases": 1319478964,
    "total_fraction_aligned_bases": 0.969328738006315,
    "total_fraction_aligned_reads": 0.970087441215471,
    "total_reads": 9322606
  },
  "references": {
    "reference": {
      "AM181176": {
        "coverage_average": 189.8002,
        "coverage_deletion_coverage_propagation_cutoff": 32.0,
        "coverage_deletion_coverage_seed_cutoff": 0.0,
        "coverage_dispersion": 19.29985,
        "coverage_group": 0,
        "coverage_nbinom_dispersion": 18.5428199571049,
        "coverage_nbinom_mean_parameter": 186.8177,
        "coverage_nbinom_prob_parameter": 0.0539292298751376,
        "coverage_nbinom_size_parameter": 10.64924,
        "coverage_nbinom_variance": 3464.12697590044,
        "coverage_variance": 3663.116,
        "junction_only": false,
        "length": 6722539,
        "num_bases_mapped_to_reference": 1276426860.73065,
        "num_features": 12117,
        "num_genes": 6091,
        "num_reads_mapped_to_reference": 9040693.00001384,
        "num_repeats": 0
      }
    },
    "total_features": 12117,
    "total_genes": 6091,
    "total_length": 6722539,
    "total_repeats": 0
  }
}