{
  "options": {
    "alignment_resolution": {
      "add_split_junction_sides": true,
      "junction_minimum_side_match": 1,
      "junction_pos_hash_neg_log10_p_value_cutoff": 3.0,
      "minimum_alignment_resolution_pos_hash_score": 3
    },
    "candidate_junction": {
      "highly_redundant_junction_ignore_passed_pair_limit": 200,
      "maximum_candidate_junction_length_factor": 0.1,
      "maximum_candidate_junctions": 5000,
      "maximum_junction_sequence_insertion_length": 0,
      "maximum_junction_sequence_negative_overlap_length_fraction": 0.4,
      "maximum_junction_sequence_negative_overlap_length_minimum": 12,
      "maximum_junction_sequence_overlap_length": 0,
      "maximum_junction_sequence_passed_alignment_pairs_to_consider": 100000,
      "maximum_junction_sequence_positive_overlap_length_fraction": 0.4,
      "maximum_junction_sequence_positive_overlap_length_minimum": 12,
      "minimum_candidate_junction_pos_hash_score": 2,
      "minimum_candidate_junctions": 100,
      "preprocess_junction_min_indel_split_length": 3,
      "required_both_unique_length_per_side": 1,
      "required_both_unique_length_per_side_fraction": 0.2,
      "required_one_unique_length_per_side": 0,
      "unmatched_end_length_factor": 0.1,
      "unmatched_end_minimum_read_length": 50
    },
    "mutation_identification": {
      "base_quality_cutoff": 3,
      "consensus_frequency_cutoff": 0.8,
      "consensus_minimum_total_coverage": 0,
      "consensus_minimum_total_coverage_each_strand": 0,
      "consensus_minimum_variant_coverage": 0,
      "consensus_minimum_variant_coverage_each_strand": 0,
      "deletion_coverage_propagation_cutoff": 0.0,
      "deletion_coverage_seed_cutoff": 0.0,
      "mixed_base_prediction": true,
      "mutation_log10_e_value_cutoff": 10.0,
      "no_indel_polymorphisms": false,
      "polymorphism_bias_p_value_cutoff": 0.0,
      "polymorphism_frequency_cutoff": 0.2,
      "polymorphism_log10_e_value_cutoff": 10.0,
      "polymorphism_minimum_total_coverage": 0,
      "polymorphism_minimum_total_coverage_each_strand": 0,
      "polymorphism_minimum_variant_coverage": 0,
      "polymorphism_minimum_variant_coverage_each_strand": 0,
      "polymorphism_prediction": false,
      "polymorphism_reject_indel_homopolymer_length": 0,
      "polymorphism_reject_surrounding_homopolymer_length": 0,
      "print_mutation_identification_per_position_file": false,
      "quality_score_trim": 0,
      "targeted_sequencing": false,
      "user_evidence_genome_diff_file_name": ""
    },
    "mutation_prediction": {
      "size_cutoff_AMP_becomes_INS_DEL_mutation": 50
    },
    "output": {
      "header_genome_diff_file_name": "",
      "hide_circular_genome_junctions": true,
      "max_displayed_reads": 100,
      "max_nucleotides_to_show_in_tables": 20,
      "max_rejected_junction_evidence_to_show": 10,
      "max_rejected_read_alignment_evidence_to_show": 20,
      "no_javascript": false
    },
    "read_alignment": {
      "bowtie2_genome_maximum_alignments_to_consider_per_read": 2000,
      "bowtie2_junction": "--local -i S,1,0.25 --score-min L,1,0.70 -k 2000",
      "bowtie2_junction_maximum_alignments_to_consider_per_read": 2000,
      "bowtie2_scoring": "--ma 1 --mp 3 --np 0 --rdg 2,3 --rfg 2,3 --ignore-quals",
      "bowtie2_stage1": "--local -i S,1,0.25 --score-min L,1,0.9 -k 2000",
      "bowtie2_stage2": "--local -i S,1,0.25 --score-min L,6,0.2 -k 2000",
      "maximum_read_mismatches": -1,
      "minimum_mapping_quality": 0,
      "require_match_fraction": 0.9,
      "require_match_length": 0
    },
    "read_file": {
      "aligned_sam_mode": false,
      "read_file_coverage_fold_limit": 0.0,
      "read_file_max_N_fraction": 0.5,
      "read_file_max_same_base_fraction": 0.9,
      "read_file_read_length_min": 18
    },
    "workflow": {
      "custom_run_name": "",
      "num_processors": 12,
      "skip_alignment_or_plot_generation": false,
      "skip_deletion_prediction": false,
      "skip_junction_prediction": false,
      "skip_mutation_prediction": false,
      "skip_read_filtering": false
    }
  },
  "reads": {
    "read_file": {
      "WT_c5_S17_L001_R1_001": {
        "fraction_aligned_bases": 0.978510259129716,
        "fraction_aligned_reads": 0.978771159602829,
        "max_quality_score": 36,
        "min_quality_score": 2,
        "num_aligned_bases": 58903112,
        "num_aligned_reads": 406422,
        "num_bases": 60196724,
        "num_filtered_same_base_reads": 73,
        "num_filtered_too_many_N_reads": 1,
        "num_filtered_too_short_reads": 0,
        "num_original_bases": 60207782,
        "num_original_reads": 415311,
        "num_reads": 415237,
        "quality_format": "SANGER",
        "quality_format_original": "SANGER",
        "read_length_avg": 144.969557144474,
        "read_length_max": 151,
        "read_length_min": 35
      },
      "WT_c5_S17_L001_R2_001": {
        "fraction_aligned_bases": 0.969420068095682,
        "fraction_aligned_reads": 0.969924467951868,
        "max_quality_score": 36,
        "min_quality_score": 2,
        "num_aligned_bases": 58341719,
        "num_aligned_reads": 402701,
        "num_bases": 60182083,
        "num_filtered_same_base_reads": 118,
        "num_filtered_too_many_N_reads": 5,
        "num_filtered_too_short_reads": 0,
        "num_original_bases": 60200422,
        "num_original_reads": 415311,
        "num_reads": 415188,
        "quality_format": "SANGER",
        "quality_format_original": "SANGER",
        "read_length_avg": 144.951402738037,
        "read_length_max": 151,
        "read_length_min": 35
      },
      "WT_c5_S17_L002_R2_001": {
        "fraction_aligned_bases": 0.968363682869221,
        "fraction_aligned_reads": 0.968811700006742,
        "max_quality_score": 36,
        "min_quality_score": 2,
        "num_aligned_bases": 58348500,
        "num_aligned_reads": 402363,
        "num_bases": 60254738,
        "num_filtered_same_base_reads": 256,
        "num_filtered_too_many_N_reads": 24,
        "num_filtered_too_short_reads": 0,
        "num_original_bases": 60296667,
        "num_original_reads": 415596,
        "num_reads": 415316,
        "quality_format": "SANGER",
        "quality_format_original": "SANGER",
        "read_length_avg": 145.081667934777,
        "read_length_max": 151,
        "read_length_min": 35
      },
      "WT_c5_S17_L004_R1_001": {
        "fraction_aligned_bases": 0.971470836016754,
        "fraction_aligned_reads": 0.971939236920475,
        "max_quality_score": 36,
        "min_quality_score": 2,
        "num_aligned_bases": 55320739,
        "num_aligned_reads": 381526,
        "num_bases": 56945342,
        "num_filtered_same_base_reads": 81,
        "num_filtered_too_many_N_reads": 1,
        "num_filtered_too_short_reads": 0,
        "num_original_bases": 56957605,
        "num_original_reads": 392623,
        "num_reads": 392541,
        "quality_format": "SANGER",
        "quality_format_original": "SANGER",
        "read_length_avg": 145.068520231008,
        "read_length_max": 151,
        "read_length_min": 35
      },
      "WT_c5_S17_L004_R2_001": {
        "fraction_aligned_bases": 0.962459570687497,
        "fraction_aligned_reads": 0.963203424596451,
        "max_quality_score": 36,
        "min_quality_score": 2,
        "num_aligned_bases": 54765964,
        "num_aligned_reads": 378014,
        "num_bases": 56902093,
        "num_filtered_same_base_reads": 165,
        "num_filtered_too_many_N_reads": 3,
        "num_filtered_too_short_reads": 0,
        "num_original_bases": 56927113,
        "num_original_reads": 392623,
        "num_reads": 392455,
        "quality_format": "SANGER",
        "quality_format_original": "SANGER",
        "read_length_avg": 144.990108420074,
        "read_length_max": 151,
        "read_length_min": 35
      }
    },
    "total_aligned_bases": 285680034,
    "total_aligned_reads": 1971026,
    "total_bases": 294480980,
    "total_fraction_aligned_bases": 0.970113703098923,
    "total_fraction_aligned_reads": 0.970596389389665,
    "total_reads": 2030737
  },
  "references": {
    "reference": {
      "AM181176": {
        "coverage_average": 42.34815,
        "coverage_deletion_coverage_propagation_cutoff": 3.0,
        "coverage_deletion_coverage_seed_cutoff": 0.0,
        "coverage_dispersion": 6.67553,
        "coverage_group": 0,
        "coverage_nbinom_dispersion": 6.20177224360162,
        "coverage_nbinom_mean_parameter": 41.17171,
        "coverage_nbinom_prob_parameter": 0.161244231603587,
        "coverage_nbinom_size_parameter": 7.914939,
        "coverage_nbinom_variance": 255.337568299615,
        "coverage_variance": 282.6963,
        "junction_only": false,
        "length": 6722539,
        "num_bases_mapped_to_reference": 284912424.899901,
        "num_features": 12117,
        "num_genes": 6091,
        "num_reads_mapped_to_reference": 1969215.99999824,
        "num_repeats": 0
      }
    },
    "total_features": 12117,
    "total_genes": 6091,
    "total_length": 6722539,
    "total_repeats": 0
  }
}