{
  "options": {
    "alignment_resolution": {
      "add_split_junction_sides": true,
      "junction_minimum_side_match": 1,
      "junction_pos_hash_neg_log10_p_value_cutoff": 3.0,
      "minimum_alignment_resolution_pos_hash_score": 3
    },
    "candidate_junction": {
      "highly_redundant_junction_ignore_passed_pair_limit": 200,
      "maximum_candidate_junction_length_factor": 0.1,
      "maximum_candidate_junctions": 5000,
      "maximum_junction_sequence_insertion_length": 0,
      "maximum_junction_sequence_negative_overlap_length_fraction": 0.4,
      "maximum_junction_sequence_negative_overlap_length_minimum": 12,
      "maximum_junction_sequence_overlap_length": 0,
      "maximum_junction_sequence_passed_alignment_pairs_to_consider": 100000,
      "maximum_junction_sequence_positive_overlap_length_fraction": 0.4,
      "maximum_junction_sequence_positive_overlap_length_minimum": 12,
      "minimum_candidate_junction_pos_hash_score": 2,
      "minimum_candidate_junctions": 100,
      "preprocess_junction_min_indel_split_length": 3,
      "required_both_unique_length_per_side": 1,
      "required_both_unique_length_per_side_fraction": 0.2,
      "required_one_unique_length_per_side": 0,
      "unmatched_end_length_factor": 0.1,
      "unmatched_end_minimum_read_length": 50
    },
    "mutation_identification": {
      "base_quality_cutoff": 3,
      "consensus_frequency_cutoff": 0.8,
      "consensus_minimum_total_coverage": 0,
      "consensus_minimum_total_coverage_each_strand": 0,
      "consensus_minimum_variant_coverage": 0,
      "consensus_minimum_variant_coverage_each_strand": 0,
      "deletion_coverage_propagation_cutoff": 0.0,
      "deletion_coverage_seed_cutoff": 0.0,
      "mixed_base_prediction": true,
      "mutation_log10_e_value_cutoff": 10.0,
      "no_indel_polymorphisms": false,
      "polymorphism_bias_p_value_cutoff": 0.0,
      "polymorphism_frequency_cutoff": 0.2,
      "polymorphism_log10_e_value_cutoff": 10.0,
      "polymorphism_minimum_total_coverage": 0,
      "polymorphism_minimum_total_coverage_each_strand": 0,
      "polymorphism_minimum_variant_coverage": 0,
      "polymorphism_minimum_variant_coverage_each_strand": 0,
      "polymorphism_prediction": false,
      "polymorphism_reject_indel_homopolymer_length": 0,
      "polymorphism_reject_surrounding_homopolymer_length": 0,
      "print_mutation_identification_per_position_file": false,
      "quality_score_trim": 0,
      "targeted_sequencing": false,
      "user_evidence_genome_diff_file_name": ""
    },
    "mutation_prediction": {
      "size_cutoff_AMP_becomes_INS_DEL_mutation": 50
    },
    "output": {
      "header_genome_diff_file_name": "",
      "hide_circular_genome_junctions": true,
      "max_displayed_reads": 100,
      "max_nucleotides_to_show_in_tables": 20,
      "max_rejected_junction_evidence_to_show": 10,
      "max_rejected_read_alignment_evidence_to_show": 20,
      "no_javascript": false
    },
    "read_alignment": {
      "bowtie2_genome_maximum_alignments_to_consider_per_read": 2000,
      "bowtie2_junction": "--local -i S,1,0.25 --score-min L,1,0.70 -k 2000",
      "bowtie2_junction_maximum_alignments_to_consider_per_read": 2000,
      "bowtie2_scoring": "--ma 1 --mp 3 --np 0 --rdg 2,3 --rfg 2,3 --ignore-quals",
      "bowtie2_stage1": "--local -i S,1,0.25 --score-min L,1,0.9 -k 2000",
      "bowtie2_stage2": "--local -i S,1,0.25 --score-min L,6,0.2 -k 2000",
      "maximum_read_mismatches": -1,
      "minimum_mapping_quality": 0,
      "require_match_fraction": 0.9,
      "require_match_length": 0
    },
    "read_file": {
      "aligned_sam_mode": false,
      "read_file_coverage_fold_limit": 0.0,
      "read_file_max_N_fraction": 0.5,
      "read_file_max_same_base_fraction": 0.9,
      "read_file_read_length_min": 18
    },
    "workflow": {
      "custom_run_name": "",
      "num_processors": 12,
      "skip_alignment_or_plot_generation": false,
      "skip_deletion_prediction": false,
      "skip_junction_prediction": false,
      "skip_mutation_prediction": false,
      "skip_read_filtering": false
    }
  },
  "reads": {
    "read_file": {
      "113_S17_L001_R1_001": {
        "fraction_aligned_bases": 0.969087649003299,
        "fraction_aligned_reads": 0.968817627090155,
        "max_quality_score": 36,
        "min_quality_score": 2,
        "num_aligned_bases": 279285933,
        "num_aligned_reads": 1936680,
        "num_bases": 288194709,
        "num_filtered_same_base_reads": 207,
        "num_filtered_too_many_N_reads": 7,
        "num_filtered_too_short_reads": 0,
        "num_original_bases": 288226207,
        "num_original_reads": 1999228,
        "num_reads": 1999014,
        "quality_format": "SANGER",
        "quality_format_original": "SANGER",
        "read_length_avg": 144.168429535761,
        "read_length_max": 151,
        "read_length_min": 35
      },
      "113_S17_L001_R2_001": {
        "fraction_aligned_bases": 0.954911513129363,
        "fraction_aligned_reads": 0.955179576876394,
        "max_quality_score": 36,
        "min_quality_score": 2,
        "num_aligned_bases": 275396065,
        "num_aligned_reads": 1909169,
        "num_bases": 288399565,
        "num_filtered_same_base_reads": 466,
        "num_filtered_too_many_N_reads": 8,
        "num_filtered_too_short_reads": 0,
        "num_original_bases": 288470189,
        "num_original_reads": 1999228,
        "num_reads": 1998754,
        "quality_format": "SANGER",
        "quality_format_original": "SANGER",
        "read_length_avg": 144.289674967505,
        "read_length_max": 151,
        "read_length_min": 35
      },
      "113_S17_L002_R1_001": {
        "fraction_aligned_bases": 0.968754502453647,
        "fraction_aligned_reads": 0.96850608453396,
        "max_quality_score": 36,
        "min_quality_score": 2,
        "num_aligned_bases": 276637124,
        "num_aligned_reads": 1917582,
        "num_bases": 285559575,
        "num_filtered_same_base_reads": 236,
        "num_filtered_too_many_N_reads": 6,
        "num_filtered_too_short_reads": 0,
        "num_original_bases": 285595418,
        "num_original_reads": 1980180,
        "num_reads": 1979938,
        "quality_format": "SANGER",
        "quality_format_original": "SANGER",
        "read_length_avg": 144.226523759835,
        "read_length_max": 151,
        "read_length_min": 35
      },
      "113_S17_L002_R2_001": {
        "fraction_aligned_bases": 0.955652703671813,
        "fraction_aligned_reads": 0.955875212767516,
        "max_quality_score": 36,
        "min_quality_score": 2,
        "num_aligned_bases": 273025440,
        "num_aligned_reads": 1891938,
        "num_bases": 285695252,
        "num_filtered_same_base_reads": 902,
        "num_filtered_too_many_N_reads": 5,
        "num_filtered_too_short_reads": 0,
        "num_original_bases": 285831611,
        "num_original_reads": 1980180,
        "num_reads": 1979273,
        "quality_format": "SANGER",
        "quality_format_original": "SANGER",
        "read_length_avg": 144.343530174968,
        "read_length_max": 151,
        "read_length_min": 35
      },
      "113_S17_L003_R1_001": {
        "fraction_aligned_bases": 0.967146967865554,
        "fraction_aligned_reads": 0.96694920431448,
        "max_quality_score": 36,
        "min_quality_score": 2,
        "num_aligned_bases": 269189977,
        "num_aligned_reads": 1867703,
        "num_bases": 278334096,
        "num_filtered_same_base_reads": 146,
        "num_filtered_too_many_N_reads": 4,
        "num_filtered_too_short_reads": 0,
        "num_original_bases": 278356281,
        "num_original_reads": 1931692,
        "num_reads": 1931542,
        "quality_format": "SANGER",
        "quality_format_original": "SANGER",
        "read_length_avg": 144.099427296947,
        "read_length_max": 151,
        "read_length_min": 35
      },
      "113_S17_L003_R2_001": {
        "fraction_aligned_bases": 0.956254637267726,
        "fraction_aligned_reads": 0.956453617215169,
        "max_quality_score": 36,
        "min_quality_score": 2,
        "num_aligned_bases": 266322523,
        "num_aligned_reads": 1847218,
        "num_bases": 278505863,
        "num_filtered_same_base_reads": 368,
        "num_filtered_too_many_N_reads": 4,
        "num_filtered_too_short_reads": 0,
        "num_original_bases": 278561554,
        "num_original_reads": 1931692,
        "num_reads": 1931320,
        "quality_format": "SANGER",
        "quality_format_original": "SANGER",
        "read_length_avg": 144.204928753391,
        "read_length_max": 151,
        "read_length_min": 35
      },
      "113_S17_L004_R1_001": {
        "fraction_aligned_bases": 0.965145739599074,
        "fraction_aligned_reads": 0.965133649796082,
        "max_quality_score": 36,
        "min_quality_score": 2,
        "num_aligned_bases": 259897761,
        "num_aligned_reads": 1804438,
        "num_bases": 269283436,
        "num_filtered_same_base_reads": 257,
        "num_filtered_too_many_N_reads": 1,
        "num_filtered_too_short_reads": 0,
        "num_original_bases": 269322274,
        "num_original_reads": 1869883,
        "num_reads": 1869625,
        "quality_format": "SANGER",
        "quality_format_original": "SANGER",
        "read_length_avg": 144.030720599051,
        "read_length_max": 151,
        "read_length_min": 35
      },
      "113_S17_L004_R2_001": {
        "fraction_aligned_bases": 0.951067958227238,
        "fraction_aligned_reads": 0.95157601447054,
        "max_quality_score": 36,
        "min_quality_score": 2,
        "num_aligned_bases": 256346707,
        "num_aligned_reads": 1778664,
        "num_bases": 269535636,
        "num_filtered_same_base_reads": 705,
        "num_filtered_too_many_N_reads": 1,
        "num_filtered_too_short_reads": 0,
        "num_original_bases": 269642107,
        "num_original_reads": 1869883,
        "num_reads": 1869177,
        "quality_format": "SANGER",
        "quality_format_original": "SANGER",
        "read_length_avg": 144.200167239379,
        "read_length_max": 151,
        "read_length_min": 35
      }
    },
    "total_aligned_bases": 2156101530,
    "total_aligned_reads": 14953392,
    "total_bases": 2243508132,
    "total_fraction_aligned_bases": 0.961040211642968,
    "total_fraction_aligned_reads": 0.961098728211708,
    "total_reads": 15558643
  },
  "references": {
    "reference": {
      "AM181176": {
        "coverage_average": 319.5377,
        "coverage_deletion_coverage_propagation_cutoff": 92.0,
        "coverage_deletion_coverage_seed_cutoff": 0.0,
        "coverage_dispersion": 20.7247,
        "coverage_group": 0,
        "coverage_nbinom_dispersion": 19.0151385552231,
        "coverage_nbinom_mean_parameter": 321.3998,
        "coverage_nbinom_prob_parameter": 0.0525896772771776,
        "coverage_nbinom_size_parameter": 17.84054,
        "coverage_nbinom_variance": 6111.461728621,
        "coverage_variance": 6622.324,
        "junction_only": false,
        "length": 6722539,
        "num_bases_mapped_to_reference": 2151261523.07077,
        "num_features": 12117,
        "num_genes": 6091,
        "num_reads_mapped_to_reference": 14946279.9999146,
        "num_repeats": 0
      }
    },
    "total_features": 12117,
    "total_genes": 6091,
    "total_length": 6722539,
    "total_repeats": 0
  }
}