{
  "options": {
    "alignment_resolution": {
      "add_split_junction_sides": true,
      "junction_minimum_side_match": 1,
      "junction_pos_hash_neg_log10_p_value_cutoff": 3.0,
      "minimum_alignment_resolution_pos_hash_score": 3
    },
    "candidate_junction": {
      "highly_redundant_junction_ignore_passed_pair_limit": 200,
      "maximum_candidate_junction_length_factor": 0.1,
      "maximum_candidate_junctions": 5000,
      "maximum_junction_sequence_insertion_length": 0,
      "maximum_junction_sequence_negative_overlap_length_fraction": 0.4,
      "maximum_junction_sequence_negative_overlap_length_minimum": 12,
      "maximum_junction_sequence_overlap_length": 0,
      "maximum_junction_sequence_passed_alignment_pairs_to_consider": 100000,
      "maximum_junction_sequence_positive_overlap_length_fraction": 0.4,
      "maximum_junction_sequence_positive_overlap_length_minimum": 12,
      "minimum_candidate_junction_pos_hash_score": 2,
      "minimum_candidate_junctions": 100,
      "preprocess_junction_min_indel_split_length": 3,
      "required_both_unique_length_per_side": 1,
      "required_both_unique_length_per_side_fraction": 0.2,
      "required_one_unique_length_per_side": 0,
      "unmatched_end_length_factor": 0.1,
      "unmatched_end_minimum_read_length": 50
    },
    "mutation_identification": {
      "base_quality_cutoff": 3,
      "consensus_frequency_cutoff": 0.8,
      "consensus_minimum_total_coverage": 0,
      "consensus_minimum_total_coverage_each_strand": 0,
      "consensus_minimum_variant_coverage": 0,
      "consensus_minimum_variant_coverage_each_strand": 0,
      "deletion_coverage_propagation_cutoff": 0.0,
      "deletion_coverage_seed_cutoff": 0.0,
      "mixed_base_prediction": true,
      "mutation_log10_e_value_cutoff": 10.0,
      "no_indel_polymorphisms": false,
      "polymorphism_bias_p_value_cutoff": 0.0,
      "polymorphism_frequency_cutoff": 0.2,
      "polymorphism_log10_e_value_cutoff": 10.0,
      "polymorphism_minimum_total_coverage": 0,
      "polymorphism_minimum_total_coverage_each_strand": 0,
      "polymorphism_minimum_variant_coverage": 0,
      "polymorphism_minimum_variant_coverage_each_strand": 0,
      "polymorphism_prediction": false,
      "polymorphism_reject_indel_homopolymer_length": 0,
      "polymorphism_reject_surrounding_homopolymer_length": 0,
      "print_mutation_identification_per_position_file": false,
      "quality_score_trim": 0,
      "targeted_sequencing": false,
      "user_evidence_genome_diff_file_name": ""
    },
    "mutation_prediction": {
      "size_cutoff_AMP_becomes_INS_DEL_mutation": 50
    },
    "output": {
      "header_genome_diff_file_name": "",
      "hide_circular_genome_junctions": true,
      "max_displayed_reads": 100,
      "max_nucleotides_to_show_in_tables": 20,
      "max_rejected_junction_evidence_to_show": 10,
      "max_rejected_read_alignment_evidence_to_show": 20,
      "no_javascript": false
    },
    "read_alignment": {
      "bowtie2_genome_maximum_alignments_to_consider_per_read": 2000,
      "bowtie2_junction": "--local -i S,1,0.25 --score-min L,1,0.70 -k 2000",
      "bowtie2_junction_maximum_alignments_to_consider_per_read": 2000,
      "bowtie2_scoring": "--ma 1 --mp 3 --np 0 --rdg 2,3 --rfg 2,3 --ignore-quals",
      "bowtie2_stage1": "--local -i S,1,0.25 --score-min L,1,0.9 -k 2000",
      "bowtie2_stage2": "--local -i S,1,0.25 --score-min L,6,0.2 -k 2000",
      "maximum_read_mismatches": -1,
      "minimum_mapping_quality": 0,
      "require_match_fraction": 0.9,
      "require_match_length": 0
    },
    "read_file": {
      "aligned_sam_mode": false,
      "read_file_coverage_fold_limit": 0.0,
      "read_file_max_N_fraction": 0.5,
      "read_file_max_same_base_fraction": 0.9,
      "read_file_read_length_min": 18
    },
    "workflow": {
      "custom_run_name": "",
      "num_processors": 12,
      "skip_alignment_or_plot_generation": false,
      "skip_deletion_prediction": false,
      "skip_junction_prediction": false,
      "skip_mutation_prediction": false,
      "skip_read_filtering": false
    }
  },
  "reads": {
    "read_file": {
      "WT_B7_S51_L001_R1_001": {
        "fraction_aligned_bases": 0.977839956780218,
        "fraction_aligned_reads": 0.978095815027723,
        "max_quality_score": 36,
        "min_quality_score": 2,
        "num_aligned_bases": 121529693,
        "num_aligned_reads": 844440,
        "num_bases": 124283828,
        "num_filtered_same_base_reads": 140,
        "num_filtered_too_many_N_reads": 4,
        "num_filtered_too_short_reads": 0,
        "num_original_bases": 124305105,
        "num_original_reads": 863495,
        "num_reads": 863351,
        "quality_format": "SANGER",
        "quality_format_original": "SANGER",
        "read_length_avg": 143.95515613001,
        "read_length_max": 151,
        "read_length_min": 35
      },
      "WT_B7_S51_L001_R2_001": {
        "fraction_aligned_bases": 0.968856727988693,
        "fraction_aligned_reads": 0.969425343811395,
        "max_quality_score": 36,
        "min_quality_score": 2,
        "num_aligned_bases": 120403857,
        "num_aligned_reads": 836870,
        "num_bases": 124274161,
        "num_filtered_same_base_reads": 223,
        "num_filtered_too_many_N_reads": 8,
        "num_filtered_too_short_reads": 0,
        "num_original_bases": 124308690,
        "num_original_reads": 863495,
        "num_reads": 863264,
        "quality_format": "SANGER",
        "quality_format_original": "SANGER",
        "read_length_avg": 143.958465776402,
        "read_length_max": 151,
        "read_length_min": 35
      },
      "WT_B7_S51_L002_R1_001": {
        "fraction_aligned_bases": 0.977754708009984,
        "fraction_aligned_reads": 0.978064559450404,
        "max_quality_score": 36,
        "min_quality_score": 2,
        "num_aligned_bases": 121695261,
        "num_aligned_reads": 844815,
        "num_bases": 124463999,
        "num_filtered_same_base_reads": 121,
        "num_filtered_too_many_N_reads": 2,
        "num_filtered_too_short_reads": 0,
        "num_original_bases": 124482339,
        "num_original_reads": 863885,
        "num_reads": 863762,
        "quality_format": "SANGER",
        "quality_format_original": "SANGER",
        "read_length_avg": 144.095247301919,
        "read_length_max": 151,
        "read_length_min": 35
      },
      "WT_B7_S51_L002_R2_001": {
        "fraction_aligned_bases": 0.967991324847659,
        "fraction_aligned_reads": 0.968608276315729,
        "max_quality_score": 36,
        "min_quality_score": 2,
        "num_aligned_bases": 120447026,
        "num_aligned_reads": 836370,
        "num_bases": 124429861,
        "num_filtered_same_base_reads": 365,
        "num_filtered_too_many_N_reads": 44,
        "num_filtered_too_short_reads": 0,
        "num_original_bases": 124491496,
        "num_original_reads": 863885,
        "num_reads": 863476,
        "quality_format": "SANGER",
        "quality_format_original": "SANGER",
        "read_length_avg": 144.103438891179,
        "read_length_max": 151,
        "read_length_min": 35
      },
      "WT_B7_S51_L003_R1_001": {
        "fraction_aligned_bases": 0.968805744046691,
        "fraction_aligned_reads": 0.969474481355447,
        "max_quality_score": 36,
        "min_quality_score": 2,
        "num_aligned_bases": 129410751,
        "num_aligned_reads": 894855,
        "num_bases": 133577605,
        "num_filtered_same_base_reads": 523,
        "num_filtered_too_many_N_reads": 2,
        "num_filtered_too_short_reads": 0,
        "num_original_bases": 133656634,
        "num_original_reads": 923556,
        "num_reads": 923031,
        "quality_format": "SANGER",
        "quality_format_original": "SANGER",
        "read_length_avg": 144.716271717851,
        "read_length_max": 151,
        "read_length_min": 35
      },
      "WT_B7_S51_L003_R2_001": {
        "fraction_aligned_bases": 0.960029867848313,
        "fraction_aligned_reads": 0.960965079034964,
        "max_quality_score": 36,
        "min_quality_score": 2,
        "num_aligned_bases": 128245059,
        "num_aligned_reads": 887162,
        "num_bases": 133584447,
        "num_filtered_same_base_reads": 355,
        "num_filtered_too_many_N_reads": 2,
        "num_filtered_too_short_reads": 0,
        "num_original_bases": 133638117,
        "num_original_reads": 923556,
        "num_reads": 923199,
        "quality_format": "SANGER",
        "quality_format_original": "SANGER",
        "read_length_avg": 144.697348025724,
        "read_length_max": 151,
        "read_length_min": 35
      },
      "WT_B7_S51_L004_R1_001": {
        "fraction_aligned_bases": 0.96962755146321,
        "fraction_aligned_reads": 0.97026066120362,
        "max_quality_score": 36,
        "min_quality_score": 2,
        "num_aligned_bases": 114995676,
        "num_aligned_reads": 798509,
        "num_bases": 118597781,
        "num_filtered_same_base_reads": 153,
        "num_filtered_too_many_N_reads": 2,
        "num_filtered_too_short_reads": 0,
        "num_original_bases": 118620951,
        "num_original_reads": 823139,
        "num_reads": 822984,
        "quality_format": "SANGER",
        "quality_format_original": "SANGER",
        "read_length_avg": 144.107031242406,
        "read_length_max": 151,
        "read_length_min": 35
      },
      "WT_B7_S51_L004_R2_001": {
        "fraction_aligned_bases": 0.961543187066702,
        "fraction_aligned_reads": 0.962444840631809,
        "max_quality_score": 36,
        "min_quality_score": 2,
        "num_aligned_bases": 113947935,
        "num_aligned_reads": 791941,
        "num_bases": 118505270,
        "num_filtered_same_base_reads": 295,
        "num_filtered_too_many_N_reads": 1,
        "num_filtered_too_short_reads": 0,
        "num_original_bases": 118549842,
        "num_original_reads": 823139,
        "num_reads": 822843,
        "quality_format": "SANGER",
        "quality_format_original": "SANGER",
        "read_length_avg": 144.019296512214,
        "read_length_max": 151,
        "read_length_min": 35
      }
    },
    "total_aligned_bases": 970675258,
    "total_aligned_reads": 6734962,
    "total_bases": 1001716952,
    "total_fraction_aligned_bases": 0.969011511746883,
    "total_fraction_aligned_reads": 0.969629897306472,
    "total_reads": 6945910
  },
  "references": {
    "reference": {
      "AM181176": {
        "coverage_average": 143.8476,
        "coverage_deletion_coverage_propagation_cutoff": 38.0,
        "coverage_deletion_coverage_seed_cutoff": 0.0,
        "coverage_dispersion": 10.03596,
        "coverage_group": 0,
        "coverage_nbinom_dispersion": 9.11323007919266,
        "coverage_nbinom_mean_parameter": 144.7096,
        "coverage_nbinom_prob_parameter": 0.10973057755704,
        "coverage_nbinom_size_parameter": 17.83625,
        "coverage_nbinom_variance": 1318.77187946794,
        "coverage_variance": 1443.649,
        "junction_only": false,
        "length": 6722539,
        "num_bases_mapped_to_reference": 968741418.067909,
        "num_features": 12117,
        "num_genes": 6091,
        "num_reads_mapped_to_reference": 6733143.00001855,
        "num_repeats": 0
      }
    },
    "total_features": 12117,
    "total_genes": 6091,
    "total_length": 6722539,
    "total_repeats": 0
  }
}