{
  "options": {
    "alignment_resolution": {
      "add_split_junction_sides": true,
      "junction_minimum_side_match": 1,
      "junction_pos_hash_neg_log10_p_value_cutoff": 3.0,
      "minimum_alignment_resolution_pos_hash_score": 3
    },
    "candidate_junction": {
      "highly_redundant_junction_ignore_passed_pair_limit": 200,
      "maximum_candidate_junction_length_factor": 0.1,
      "maximum_candidate_junctions": 5000,
      "maximum_junction_sequence_insertion_length": 0,
      "maximum_junction_sequence_negative_overlap_length_fraction": 0.4,
      "maximum_junction_sequence_negative_overlap_length_minimum": 12,
      "maximum_junction_sequence_overlap_length": 0,
      "maximum_junction_sequence_passed_alignment_pairs_to_consider": 100000,
      "maximum_junction_sequence_positive_overlap_length_fraction": 0.4,
      "maximum_junction_sequence_positive_overlap_length_minimum": 12,
      "minimum_candidate_junction_pos_hash_score": 2,
      "minimum_candidate_junctions": 100,
      "preprocess_junction_min_indel_split_length": 3,
      "required_both_unique_length_per_side": 1,
      "required_both_unique_length_per_side_fraction": 0.2,
      "required_one_unique_length_per_side": 0,
      "unmatched_end_length_factor": 0.1,
      "unmatched_end_minimum_read_length": 50
    },
    "mutation_identification": {
      "base_quality_cutoff": 3,
      "consensus_frequency_cutoff": 0.8,
      "consensus_minimum_total_coverage": 0,
      "consensus_minimum_total_coverage_each_strand": 0,
      "consensus_minimum_variant_coverage": 0,
      "consensus_minimum_variant_coverage_each_strand": 0,
      "deletion_coverage_propagation_cutoff": 0.0,
      "deletion_coverage_seed_cutoff": 0.0,
      "mixed_base_prediction": true,
      "mutation_log10_e_value_cutoff": 10.0,
      "no_indel_polymorphisms": false,
      "polymorphism_bias_p_value_cutoff": 0.0,
      "polymorphism_frequency_cutoff": 0.2,
      "polymorphism_log10_e_value_cutoff": 10.0,
      "polymorphism_minimum_total_coverage": 0,
      "polymorphism_minimum_total_coverage_each_strand": 0,
      "polymorphism_minimum_variant_coverage": 0,
      "polymorphism_minimum_variant_coverage_each_strand": 0,
      "polymorphism_prediction": false,
      "polymorphism_reject_indel_homopolymer_length": 0,
      "polymorphism_reject_surrounding_homopolymer_length": 0,
      "print_mutation_identification_per_position_file": false,
      "quality_score_trim": 0,
      "targeted_sequencing": false,
      "user_evidence_genome_diff_file_name": ""
    },
    "mutation_prediction": {
      "size_cutoff_AMP_becomes_INS_DEL_mutation": 50
    },
    "output": {
      "header_genome_diff_file_name": "",
      "hide_circular_genome_junctions": true,
      "max_displayed_reads": 100,
      "max_nucleotides_to_show_in_tables": 20,
      "max_rejected_junction_evidence_to_show": 10,
      "max_rejected_read_alignment_evidence_to_show": 20,
      "no_javascript": false
    },
    "read_alignment": {
      "bowtie2_genome_maximum_alignments_to_consider_per_read": 2000,
      "bowtie2_junction": "--local -i S,1,0.25 --score-min L,1,0.70 -k 2000",
      "bowtie2_junction_maximum_alignments_to_consider_per_read": 2000,
      "bowtie2_scoring": "--ma 1 --mp 3 --np 0 --rdg 2,3 --rfg 2,3 --ignore-quals",
      "bowtie2_stage1": "--local -i S,1,0.25 --score-min L,1,0.9 -k 2000",
      "bowtie2_stage2": "--local -i S,1,0.25 --score-min L,6,0.2 -k 2000",
      "maximum_read_mismatches": -1,
      "minimum_mapping_quality": 0,
      "require_match_fraction": 0.9,
      "require_match_length": 0
    },
    "read_file": {
      "aligned_sam_mode": false,
      "read_file_coverage_fold_limit": 0.0,
      "read_file_max_N_fraction": 0.5,
      "read_file_max_same_base_fraction": 0.9,
      "read_file_read_length_min": 18
    },
    "workflow": {
      "custom_run_name": "",
      "num_processors": 12,
      "skip_alignment_or_plot_generation": false,
      "skip_deletion_prediction": false,
      "skip_junction_prediction": false,
      "skip_mutation_prediction": false,
      "skip_read_filtering": false
    }
  },
  "reads": {
    "read_file": {
      "WT_C8_S59_L001_R1_001": {
        "fraction_aligned_bases": 0.97770188827946,
        "fraction_aligned_reads": 0.978025862091536,
        "max_quality_score": 36,
        "min_quality_score": 2,
        "num_aligned_bases": 107998116,
        "num_aligned_reads": 747112,
        "num_bases": 110461192,
        "num_filtered_same_base_reads": 145,
        "num_filtered_too_many_N_reads": 1,
        "num_filtered_too_short_reads": 0,
        "num_original_bases": 110483122,
        "num_original_reads": 764044,
        "num_reads": 763898,
        "quality_format": "SANGER",
        "quality_format_original": "SANGER",
        "read_length_avg": 144.602017546845,
        "read_length_max": 151,
        "read_length_min": 35
      },
      "WT_C8_S59_L001_R2_001": {
        "fraction_aligned_bases": 0.968979952975889,
        "fraction_aligned_reads": 0.969561130414519,
        "max_quality_score": 36,
        "min_quality_score": 2,
        "num_aligned_bases": 107011616,
        "num_aligned_reads": 740576,
        "num_bases": 110437389,
        "num_filtered_same_base_reads": 212,
        "num_filtered_too_many_N_reads": 6,
        "num_filtered_too_short_reads": 0,
        "num_original_bases": 110469947,
        "num_original_reads": 764044,
        "num_reads": 763826,
        "quality_format": "SANGER",
        "quality_format_original": "SANGER",
        "read_length_avg": 144.584485209982,
        "read_length_max": 151,
        "read_length_min": 35
      },
      "WT_C8_S59_L003_R1_001": {
        "fraction_aligned_bases": 0.969486468518401,
        "fraction_aligned_reads": 0.970012829125267,
        "max_quality_score": 36,
        "min_quality_score": 2,
        "num_aligned_bases": 116225655,
        "num_aligned_reads": 799956,
        "num_bases": 119883731,
        "num_filtered_same_base_reads": 499,
        "num_filtered_too_many_N_reads": 2,
        "num_filtered_too_short_reads": 0,
        "num_original_bases": 119959143,
        "num_original_reads": 825187,
        "num_reads": 824686,
        "quality_format": "SANGER",
        "quality_format_original": "SANGER",
        "read_length_avg": 145.368941633543,
        "read_length_max": 151,
        "read_length_min": 35
      },
      "WT_C8_S59_L004_R1_001": {
        "fraction_aligned_bases": 0.970284490911442,
        "fraction_aligned_reads": 0.970803201766492,
        "max_quality_score": 36,
        "min_quality_score": 2,
        "num_aligned_bases": 101808707,
        "num_aligned_reads": 703444,
        "num_bases": 104926656,
        "num_filtered_same_base_reads": 161,
        "num_filtered_too_many_N_reads": 1,
        "num_filtered_too_short_reads": 0,
        "num_original_bases": 104950998,
        "num_original_reads": 724762,
        "num_reads": 724600,
        "quality_format": "SANGER",
        "quality_format_original": "SANGER",
        "read_length_avg": 144.806315208391,
        "read_length_max": 151,
        "read_length_min": 35
      }
    },
    "total_aligned_bases": 433044094,
    "total_aligned_reads": 2991088,
    "total_bases": 445708968,
    "total_fraction_aligned_bases": 0.971584879575499,
    "total_fraction_aligned_reads": 0.972076138849078,
    "total_reads": 3077010
  },
  "references": {
    "reference": {
      "AM181176": {
        "coverage_average": 64.10519,
        "coverage_deletion_coverage_propagation_cutoff": 8.0,
        "coverage_deletion_coverage_seed_cutoff": 0.0,
        "coverage_dispersion": 7.50795,
        "coverage_group": 0,
        "coverage_nbinom_dispersion": 7.14710496492201,
        "coverage_nbinom_mean_parameter": 63.51613,
        "coverage_nbinom_prob_parameter": 0.139916792170816,
        "coverage_nbinom_size_parameter": 10.33269,
        "coverage_nbinom_variance": 453.956448075632,
        "coverage_variance": 481.2986,
        "junction_only": false,
        "length": 6722539,
        "num_bases_mapped_to_reference": 431908015.233065,
        "num_features": 12117,
        "num_genes": 6091,
        "num_reads_mapped_to_reference": 2988453.00000286,
        "num_repeats": 0
      }
    },
    "total_features": 12117,
    "total_genes": 6091,
    "total_length": 6722539,
    "total_repeats": 0
  }
}