{
  "options": {
    "alignment_resolution": {
      "add_split_junction_sides": true,
      "junction_minimum_side_match": 1,
      "junction_pos_hash_neg_log10_p_value_cutoff": 3.0,
      "minimum_alignment_resolution_pos_hash_score": 3
    },
    "candidate_junction": {
      "highly_redundant_junction_ignore_passed_pair_limit": 200,
      "maximum_candidate_junction_length_factor": 0.1,
      "maximum_candidate_junctions": 5000,
      "maximum_junction_sequence_insertion_length": 0,
      "maximum_junction_sequence_negative_overlap_length_fraction": 0.4,
      "maximum_junction_sequence_negative_overlap_length_minimum": 12,
      "maximum_junction_sequence_overlap_length": 0,
      "maximum_junction_sequence_passed_alignment_pairs_to_consider": 100000,
      "maximum_junction_sequence_positive_overlap_length_fraction": 0.4,
      "maximum_junction_sequence_positive_overlap_length_minimum": 12,
      "minimum_candidate_junction_pos_hash_score": 2,
      "minimum_candidate_junctions": 100,
      "preprocess_junction_min_indel_split_length": 3,
      "required_both_unique_length_per_side": 1,
      "required_both_unique_length_per_side_fraction": 0.2,
      "required_one_unique_length_per_side": 0,
      "unmatched_end_length_factor": 0.1,
      "unmatched_end_minimum_read_length": 50
    },
    "mutation_identification": {
      "base_quality_cutoff": 3,
      "consensus_frequency_cutoff": 0.8,
      "consensus_minimum_total_coverage": 0,
      "consensus_minimum_total_coverage_each_strand": 0,
      "consensus_minimum_variant_coverage": 0,
      "consensus_minimum_variant_coverage_each_strand": 0,
      "deletion_coverage_propagation_cutoff": 0.0,
      "deletion_coverage_seed_cutoff": 0.0,
      "mixed_base_prediction": true,
      "mutation_log10_e_value_cutoff": 10.0,
      "no_indel_polymorphisms": false,
      "polymorphism_bias_p_value_cutoff": 0.0,
      "polymorphism_frequency_cutoff": 0.2,
      "polymorphism_log10_e_value_cutoff": 10.0,
      "polymorphism_minimum_total_coverage": 0,
      "polymorphism_minimum_total_coverage_each_strand": 0,
      "polymorphism_minimum_variant_coverage": 0,
      "polymorphism_minimum_variant_coverage_each_strand": 0,
      "polymorphism_prediction": false,
      "polymorphism_reject_indel_homopolymer_length": 0,
      "polymorphism_reject_surrounding_homopolymer_length": 0,
      "print_mutation_identification_per_position_file": false,
      "quality_score_trim": 0,
      "targeted_sequencing": false,
      "user_evidence_genome_diff_file_name": ""
    },
    "mutation_prediction": {
      "size_cutoff_AMP_becomes_INS_DEL_mutation": 50
    },
    "output": {
      "header_genome_diff_file_name": "",
      "hide_circular_genome_junctions": true,
      "max_displayed_reads": 100,
      "max_nucleotides_to_show_in_tables": 20,
      "max_rejected_junction_evidence_to_show": 10,
      "max_rejected_read_alignment_evidence_to_show": 20,
      "no_javascript": false
    },
    "read_alignment": {
      "bowtie2_genome_maximum_alignments_to_consider_per_read": 2000,
      "bowtie2_junction": "--local -i S,1,0.25 --score-min L,1,0.70 -k 2000",
      "bowtie2_junction_maximum_alignments_to_consider_per_read": 2000,
      "bowtie2_scoring": "--ma 1 --mp 3 --np 0 --rdg 2,3 --rfg 2,3 --ignore-quals",
      "bowtie2_stage1": "--local -i S,1,0.25 --score-min L,1,0.9 -k 2000",
      "bowtie2_stage2": "--local -i S,1,0.25 --score-min L,6,0.2 -k 2000",
      "maximum_read_mismatches": -1,
      "minimum_mapping_quality": 0,
      "require_match_fraction": 0.9,
      "require_match_length": 0
    },
    "read_file": {
      "aligned_sam_mode": false,
      "read_file_coverage_fold_limit": 0.0,
      "read_file_max_N_fraction": 0.5,
      "read_file_max_same_base_fraction": 0.9,
      "read_file_read_length_min": 18
    },
    "workflow": {
      "custom_run_name": "",
      "num_processors": 12,
      "skip_alignment_or_plot_generation": false,
      "skip_deletion_prediction": false,
      "skip_junction_prediction": false,
      "skip_mutation_prediction": false,
      "skip_read_filtering": false
    }
  },
  "reads": {
    "read_file": {
      "100_S4_L001_R1_001": {
        "fraction_aligned_bases": 0.970586476866798,
        "fraction_aligned_reads": 0.970156168332357,
        "max_quality_score": 36,
        "min_quality_score": 2,
        "num_aligned_bases": 248496902,
        "num_aligned_reads": 1715077,
        "num_bases": 256027575,
        "num_filtered_same_base_reads": 141,
        "num_filtered_too_many_N_reads": 5,
        "num_filtered_too_short_reads": 0,
        "num_original_bases": 256049041,
        "num_original_reads": 1767982,
        "num_reads": 1767836,
        "quality_format": "SANGER",
        "quality_format_original": "SANGER",
        "read_length_avg": 144.825410841277,
        "read_length_max": 151,
        "read_length_min": 35
      },
      "100_S4_L001_R2_001": {
        "fraction_aligned_bases": 0.957166700023639,
        "fraction_aligned_reads": 0.957218131853521,
        "max_quality_score": 36,
        "min_quality_score": 2,
        "num_aligned_bases": 245162322,
        "num_aligned_reads": 1691817,
        "num_bases": 256133359,
        "num_filtered_same_base_reads": 546,
        "num_filtered_too_many_N_reads": 5,
        "num_filtered_too_short_reads": 0,
        "num_original_bases": 256215960,
        "num_original_reads": 1767982,
        "num_reads": 1767431,
        "quality_format": "SANGER",
        "quality_format_original": "SANGER",
        "read_length_avg": 144.918448867311,
        "read_length_max": 151,
        "read_length_min": 35
      },
      "100_S4_L002_R1_001": {
        "fraction_aligned_bases": 0.970301665836414,
        "fraction_aligned_reads": 0.969884355359426,
        "max_quality_score": 36,
        "min_quality_score": 2,
        "num_aligned_bases": 238792905,
        "num_aligned_reads": 1647496,
        "num_bases": 246101716,
        "num_filtered_same_base_reads": 192,
        "num_filtered_too_many_N_reads": 5,
        "num_filtered_too_short_reads": 0,
        "num_original_bases": 246130882,
        "num_original_reads": 1698849,
        "num_reads": 1698652,
        "quality_format": "SANGER",
        "quality_format_original": "SANGER",
        "read_length_avg": 144.880597085218,
        "read_length_max": 151,
        "read_length_min": 35
      },
      "100_S4_L002_R2_001": {
        "fraction_aligned_bases": 0.957637370995833,
        "fraction_aligned_reads": 0.957666637804751,
        "max_quality_score": 36,
        "min_quality_score": 2,
        "num_aligned_bases": 235701277,
        "num_aligned_reads": 1625868,
        "num_bases": 246127902,
        "num_filtered_same_base_reads": 1105,
        "num_filtered_too_many_N_reads": 5,
        "num_filtered_too_short_reads": 0,
        "num_original_bases": 246294919,
        "num_original_reads": 1698849,
        "num_reads": 1697739,
        "quality_format": "SANGER",
        "quality_format_original": "SANGER",
        "read_length_avg": 144.973934155957,
        "read_length_max": 151,
        "read_length_min": 35
      },
      "100_S4_L003_R1_001": {
        "fraction_aligned_bases": 0.968923418300167,
        "fraction_aligned_reads": 0.968575032718719,
        "max_quality_score": 36,
        "min_quality_score": 2,
        "num_aligned_bases": 243209942,
        "num_aligned_reads": 1679235,
        "num_bases": 251010490,
        "num_filtered_same_base_reads": 149,
        "num_filtered_too_many_N_reads": 3,
        "num_filtered_too_short_reads": 0,
        "num_original_bases": 251033093,
        "num_original_reads": 1733869,
        "num_reads": 1733717,
        "quality_format": "SANGER",
        "quality_format_original": "SANGER",
        "read_length_avg": 144.781697358912,
        "read_length_max": 151,
        "read_length_min": 35
      },
      "100_S4_L003_R2_001": {
        "fraction_aligned_bases": 0.958513851578137,
        "fraction_aligned_reads": 0.958515952717901,
        "max_quality_score": 36,
        "min_quality_score": 2,
        "num_aligned_bases": 240697618,
        "num_aligned_reads": 1661435,
        "num_bases": 251115430,
        "num_filtered_same_base_reads": 525,
        "num_filtered_too_many_N_reads": 3,
        "num_filtered_too_short_reads": 0,
        "num_original_bases": 251194794,
        "num_original_reads": 1733869,
        "num_reads": 1733341,
        "quality_format": "SANGER",
        "quality_format_original": "SANGER",
        "read_length_avg": 144.873645751182,
        "read_length_max": 151,
        "read_length_min": 35
      },
      "100_S4_L004_R1_001": {
        "fraction_aligned_bases": 0.967418423693056,
        "fraction_aligned_reads": 0.967148854126213,
        "max_quality_score": 36,
        "min_quality_score": 2,
        "num_aligned_bases": 234687532,
        "num_aligned_reads": 1621250,
        "num_bases": 242591547,
        "num_filtered_same_base_reads": 226,
        "num_filtered_too_many_N_reads": 7,
        "num_filtered_too_short_reads": 0,
        "num_original_bases": 242625913,
        "num_original_reads": 1676552,
        "num_reads": 1676319,
        "quality_format": "SANGER",
        "quality_format_original": "SANGER",
        "read_length_avg": 144.716815236241,
        "read_length_max": 151,
        "read_length_min": 35
      },
      "100_S4_L004_R2_001": {
        "fraction_aligned_bases": 0.953668981655571,
        "fraction_aligned_reads": 0.953889571533348,
        "max_quality_score": 36,
        "min_quality_score": 2,
        "num_aligned_bases": 231485614,
        "num_aligned_reads": 1598407,
        "num_bases": 242731617,
        "num_filtered_same_base_reads": 872,
        "num_filtered_too_many_N_reads": 7,
        "num_filtered_too_short_reads": 0,
        "num_original_bases": 242863519,
        "num_original_reads": 1676552,
        "num_reads": 1675673,
        "quality_format": "SANGER",
        "quality_format_original": "SANGER",
        "read_length_avg": 144.856196286507,
        "read_length_max": 151,
        "read_length_min": 35
      }
    },
    "total_aligned_bases": 1918234112,
    "total_aligned_reads": 13240585,
    "total_bases": 1991839636,
    "total_fraction_aligned_bases": 0.963046460834661,
    "total_fraction_aligned_reads": 0.962902055661425,
    "total_reads": 13750708
  },
  "references": {
    "reference": {
      "AM181176": {
        "coverage_average": 284.3257,
        "coverage_deletion_coverage_propagation_cutoff": 82.0,
        "coverage_deletion_coverage_seed_cutoff": 0.0,
        "coverage_dispersion": 18.40182,
        "coverage_group": 0,
        "coverage_nbinom_dispersion": 16.6322418576299,
        "coverage_nbinom_mean_parameter": 286.1893,
        "coverage_nbinom_prob_parameter": 0.0601241858169145,
        "coverage_nbinom_size_parameter": 18.30763,
        "coverage_nbinom_variance": 4759.96965466579,
        "coverage_variance": 5232.109,
        "junction_only": false,
        "length": 6722539,
        "num_bases_mapped_to_reference": 1914202021.17021,
        "num_features": 12117,
        "num_genes": 6091,
        "num_reads_mapped_to_reference": 13235500.999944,
        "num_repeats": 0
      }
    },
    "total_features": 12117,
    "total_genes": 6091,
    "total_length": 6722539,
    "total_repeats": 0
  }
}