"subject";"session";"missed_items_total";"missed_items_F";"missed_items_NF";"items_rated_1_F";"items_rated_1_NF"
"sub-01";"ses-01";0;0;0;11;6
"sub-01";"ses-02";0;0;0;6;9
"sub-01";"ses-03";0;0;0;6;8
"sub-01";"ses-04";1;1;0;12;50
"sub-02";"ses-01";1;1;0;0;7
"sub-02";"ses-02";0;0;0;1;7
"sub-02";"ses-03";0;0;0;1;6
"sub-02";"ses-04";0;0;0;2;8
"sub-03";"ses-01";85;37;48;1;7
"sub-03";"ses-02";91;44;47;1;5
"sub-03";"ses-03";89;44;45;1;6
"sub-03";"ses-04";84;43;41;1;9
"sub-04";"ses-01";0;0;0;1;63
"sub-04";"ses-02";0;0;0;2;58
"sub-04";"ses-03";0;0;0;1;59
"sub-04";"ses-04";0;0;0;2;64
"sub-05";"ses-01";0;0;0;1;5
"sub-05";"ses-02";0;0;0;1;3
"sub-05";"ses-03";1;1;0;3;1
"sub-05";"ses-04";1;1;0;1;8
"sub-06";"ses-01";0;0;0;1;65
"sub-06";"ses-02";0;0;0;2;64
"sub-06";"ses-03";0;0;0;2;59
"sub-06";"ses-04";0;0;0;2;55
"sub-08";"ses-01";0;0;0;4;4
"sub-08";"ses-02";0;0;0;3;2
"sub-08";"ses-03";0;0;0;4;3
"sub-08";"ses-04";1;0;1;5;3
"sub-09";"ses-01";0;0;0;0;3
"sub-09";"ses-02";1;1;0;0;3
"sub-09";"ses-03";0;0;0;0;4
"sub-09";"ses-04";0;0;0;0;1
"sub-10";"ses-01";0;0;0;0;2
"sub-10";"ses-02";0;0;0;1;1
"sub-10";"ses-03";1;1;0;0;0
"sub-10";"ses-04";0;0;0;0;0
"sub-12";"ses-01";17;7;10;1;2
"sub-12";"ses-02";19;6;13;0;3
"sub-12";"ses-03";15;9;6;0;4
"sub-12";"ses-04";9;2;7;0;1
"sub-13";"ses-01";0;0;0;3;4
"sub-13";"ses-02";0;0;0;3;4
"sub-13";"ses-03";1;0;1;3;4
"sub-13";"ses-04";1;0;1;0;5
"sub-14";"ses-01";2;2;0;0;5
"sub-14";"ses-02";0;0;0;0;3
"sub-14";"ses-03";0;0;0;0;0
"sub-14";"ses-04";0;0;0;1;3
"sub-14";"ses-04";0;0;0;1;3
"sub-15";"ses-01";0;0;0;1;0
"sub-15";"ses-02";0;0;0;2;0
"sub-15";"ses-03";0;0;0;0;0
"sub-15";"ses-04";0;0;0;0;0
"sub-16";"ses-01";0;0;0;16;21
"sub-16";"ses-02";2;1;1;14;16
"sub-16";"ses-03";0;0;0;16;20
"sub-16";"ses-04";0;0;0;17;19
"sub-17";"ses-01";0;0;0;2;5
"sub-17";"ses-02";0;0;0;5;0
"sub-17";"ses-03";0;0;0;4;2
"sub-17";"ses-04";1;0;1;1;4
"sub-18";"ses-01";0;0;0;2;4
"sub-18";"ses-02";0;0;0;1;6
"sub-18";"ses-03";1;0;1;6;5
"sub-18";"ses-04";2;2;0;2;4
"sub-20";"ses-01";0;0;0;3;0
"sub-20";"ses-02";0;0;0;2;0
"sub-20";"ses-03";0;0;0;2;0
"sub-20";"ses-04";0;0;0;4;0
"sub-21";"ses-01";3;2;1;4;3
"sub-21";"ses-02";7;5;2;3;4
"sub-21";"ses-03";5;2;3;2;1
"sub-21";"ses-04";8;4;4;6;4
"sub-23";"ses-01";0;0;0;2;9
"sub-23";"ses-02";0;0;0;1;3
"sub-23";"ses-03";0;0;0;1;6
"sub-23";"ses-04";0;0;0;1;1
"sub-24";"ses-01";0;0;0;2;21
"sub-24";"ses-02";0;0;0;2;31
"sub-24";"ses-03";0;0;0;3;33
"sub-24";"ses-04";0;0;0;4;30
"sub-25";"ses-01";5;2;3;6;41
"sub-25";"ses-02";6;2;4;5;42
"sub-25";"ses-03";4;1;3;1;41
"sub-25";"ses-04";4;2;2;5;42
"sub-26";"ses-01";0;0;0;4;2
"sub-26";"ses-02";0;0;0;0;3
"sub-26";"ses-03";0;0;0;1;3
"sub-26";"ses-04";0;0;0;0;2
"sub-27";"ses-01";0;0;0;12;51
"sub-27";"ses-02";1;1;0;3;50
"sub-27";"ses-03";1;1;0;10;52
"sub-27";"ses-04";0;0;0;8;53
"sub-28";"ses-01";1;1;0;3;9
"sub-28";"ses-02";1;1;0;3;9
"sub-28";"ses-03";1;0;1;1;6
"sub-28";"ses-04";1;1;0;5;6
"sub-29";"ses-01";1;1;0;0;3
"sub-29";"ses-02";2;1;1;2;4
"sub-29";"ses-03";0;0;0;0;1
"sub-29";"ses-04";1;1;0;0;1
"sub-33";"ses-01";4;2;2;22;46
"sub-33";"ses-02";2;2;0;14;44
"sub-33";"ses-03";3;3;0;13;51
"sub-33";"ses-04";4;3;1;14;46
"sub-35";"ses-01";0;0;0;6;6
"sub-35";"ses-02";0;0;0;5;7
"sub-35";"ses-03";0;0;0;10;6
"sub-35";"ses-04";0;0;0;10;5
"sub-36";"ses-01";1;1;0;5;4
"sub-36";"ses-02";0;0;0;3;6
"sub-36";"ses-03";0;0;0;1;5
"sub-36";"ses-04";0;0;0;7;6
"sub-37";"ses-01";0;0;0;4;17
"sub-37";"ses-02";1;1;0;1;20
"sub-37";"ses-03";0;0;0;3;25
"sub-37";"ses-04";0;0;0;5;24
"sub-39";"ses-01";0;0;0;35;76
"sub-39";"ses-02";0;0;0;33;77
"sub-39";"ses-03";0;0;0;49;76
"sub-39";"ses-04";0;0;0;38;78
"sub-40";"ses-01";0;0;0;4;3
"sub-40";"ses-02";0;0;0;6;4
"sub-40";"ses-03";1;0;1;1;6
"sub-40";"ses-04";0;0;0;4;7
"sub-42";"ses-01";15;7;8;3;0
"sub-42";"ses-02";22;13;9;1;0
"sub-42";"ses-03";20;9;11;5;0
"sub-42";"ses-04";21;10;11;4;0
"sub-43";"ses-01";0;0;0;2;3
"sub-43";"ses-02";0;0;0;1;4
"sub-43";"ses-03";0;0;0;1;7
"sub-43";"ses-04";0;0;0;3;5
"sub-44";"ses-01";1;0;1;8;63
"sub-44";"ses-02";1;1;0;13;62
"sub-44";"ses-03";0;0;0;12;65
"sub-44";"ses-04";0;0;0;9;72
"sub-47";"ses-01";0;0;0;9;60
"sub-47";"ses-02";0;0;0;7;58
"sub-47";"ses-03";0;0;0;10;55
"sub-47";"ses-04";0;0;0;13;49
"sub-48";"ses-01";0;0;0;4;1
"sub-48";"ses-02";0;0;0;2;4
"sub-48";"ses-03";1;0;1;2;1
"sub-48";"ses-04";0;0;0;3;1
"sub-49";"ses-01";0;0;0;0;0
"sub-49";"ses-02";0;0;0;1;1
"sub-49";"ses-03";0;0;0;0;2
"sub-49";"ses-04";0;0;0;0;1
"sub-50";"ses-01";0;0;0;2;12
"sub-50";"ses-02";0;0;0;4;15
"sub-50";"ses-03";0;0;0;7;16
"sub-50";"ses-04";0;0;0;5;17
"sub-51";"ses-01";0;0;0;2;16
"sub-51";"ses-02";0;0;0;1;20
"sub-51";"ses-03";0;0;0;0;24
"sub-51";"ses-04";0;0;0;0;22
"sub-53";"ses-01";0;0;0;7;3
"sub-53";"ses-02";1;1;0;2;3
"sub-53";"ses-03";0;0;0;9;4
"sub-53";"ses-04";0;0;0;7;2
"sub-55";"ses-01";5;2;3;0;1
"sub-55";"ses-02";0;0;0;1;1
"sub-55";"ses-03";3;1;2;0;1
"sub-55";"ses-04";2;0;2;1;2
"sub-56";"ses-01";0;0;0;6;58
"sub-56";"ses-02";0;0;0;3;58
"sub-56";"ses-03";0;0;0;1;52
"sub-56";"ses-04";0;0;0;7;56
"sub-57";"ses-01";2;0;2;16;1
"sub-57";"ses-02";1;0;1;19;6
"sub-57";"ses-03";1;0;1;26;4
"sub-57";"ses-04";0;0;0;19;2
"sub-57";"ses-01";2;0;2;16;1
"sub-57";"ses-02";1;0;1;19;6
"sub-57";"ses-03";1;0;1;26;4
"sub-57";"ses-04";0;0;0;19;2
"sub-58";"ses-01";0;0;0;2;30
"sub-58";"ses-02";0;0;0;8;24
"sub-58";"ses-03";0;0;0;4;34
"sub-58";"ses-04";0;0;0;3;25
"sub-59";"ses-01";0;0;0;6;11
"sub-59";"ses-02";1;0;1;4;10
"sub-59";"ses-03";1;0;1;5;11
"sub-59";"ses-04";0;0;0;4;4
