%!PS-Adobe-2.0 EPSF-2.0
%%Title: /home/dirk/text/ipsec/Netzwerk1.dia
%%Creator: Dia v0.88.1
%%CreationDate: Fri Sep  6 23:23:01 2002
%%For: dirk
%%Magnification: 1.0000
%%Orientation: Portrait
%%BoundingBox: 0 0 955 466
%%Pages: 1
%%BeginSetup
%%EndSetup
%%EndComments
%%BeginProlog
[ /.notdef /.notdef /.notdef /.notdef /.notdef /.notdef /.notdef /.notdef /.notdef /.notdef
/.notdef /.notdef /.notdef /.notdef /.notdef /.notdef /.notdef /.notdef /.notdef /.notdef
/.notdef /.notdef /.notdef /.notdef /.notdef /.notdef /.notdef /.notdef /.notdef /.notdef
/.notdef /.notdef /space /exclam /quotedbl /numbersign /dollar /percent /ampersand /quoteright
/parenleft /parenright /asterisk /plus /comma /hyphen /period /slash /zero /one
/two /three /four /five /six /seven /eight /nine /colon /semicolon
/less /equal /greater /question /at /A /B /C /D /E
/F /G /H /I /J /K /L /M /N /O
/P /Q /R /S /T /U /V /W /X /Y
/Z /bracketleft /backslash /bracketright /asciicircum /underscore /quoteleft /a /b /c
/d /e /f /g /h /i /j /k /l /m
/n /o /p /q /r /s /t /u /v /w
/x /y /z /braceleft /bar /braceright /asciitilde /.notdef /.notdef /.notdef
/.notdef /.notdef /.notdef /.notdef /.notdef /.notdef /.notdef /.notdef /.notdef /.notdef
/.notdef /.notdef /.notdef /.notdef /.notdef /.notdef /.notdef /.notdef /.notdef /.notdef
/.notdef /.notdef /.notdef /.notdef /.notdef /.notdef /.notdef /.notdef /.notdef /.notdef
/space /exclamdown /cent /sterling /currency /yen /brokenbar /section /dieresis /copyright
/ordfeminine /guillemotleft /logicalnot /hyphen /registered /macron /degree /plusminus /twosuperior /threesuperior
/acute /mu /paragraph /periodcentered /cedilla /onesuperior /ordmasculine /guillemotright /onequarter /onehalf
/threequarters /questiondown /Agrave /Aacute /Acircumflex /Atilde /Adieresis /Aring /AE /Ccedilla
/Egrave /Eacute /Ecircumflex /Edieresis /Igrave /Iacute /Icircumflex /Idieresis /Eth /Ntilde
/Ograve /Oacute /Ocircumflex /Otilde /Odieresis /multiply /Oslash /Ugrave /Uacute /Ucircumflex
/Udieresis /Yacute /Thorn /germandbls /agrave /aacute /acircumflex /atilde /adieresis /aring
/ae /ccedilla /egrave /eacute /ecircumflex /edieresis /igrave /iacute /icircumflex /idieresis
/eth /ntilde /ograve /oacute /ocircumflex /otilde /odieresis /divide /oslash /ugrave
/uacute /ucircumflex /udieresis /yacute /thorn /ydieresis] /isolatin1encoding exch def
/Times-Roman-latin1
    /Times-Roman findfont
    dup length dict begin
	{1 index /FID ne {def} {pop pop} ifelse} forall
	/Encoding isolatin1encoding def
    currentdict end
definefont pop
/Times-Italic-latin1
    /Times-Italic findfont
    dup length dict begin
	{1 index /FID ne {def} {pop pop} ifelse} forall
	/Encoding isolatin1encoding def
    currentdict end
definefont pop
/Times-Bold-latin1
    /Times-Bold findfont
    dup length dict begin
	{1 index /FID ne {def} {pop pop} ifelse} forall
	/Encoding isolatin1encoding def
    currentdict end
definefont pop
/Times-BoldItalic-latin1
    /Times-BoldItalic findfont
    dup length dict begin
	{1 index /FID ne {def} {pop pop} ifelse} forall
	/Encoding isolatin1encoding def
    currentdict end
definefont pop
/AvantGarde-Book-latin1
    /AvantGarde-Book findfont
    dup length dict begin
	{1 index /FID ne {def} {pop pop} ifelse} forall
	/Encoding isolatin1encoding def
    currentdict end
definefont pop
/AvantGarde-BookOblique-latin1
    /AvantGarde-BookOblique findfont
    dup length dict begin
	{1 index /FID ne {def} {pop pop} ifelse} forall
	/Encoding isolatin1encoding def
    currentdict end
definefont pop
/AvantGarde-Demi-latin1
    /AvantGarde-Demi findfont
    dup length dict begin
	{1 index /FID ne {def} {pop pop} ifelse} forall
	/Encoding isolatin1encoding def
    currentdict end
definefont pop
/AvantGarde-DemiOblique-latin1
    /AvantGarde-DemiOblique findfont
    dup length dict begin
	{1 index /FID ne {def} {pop pop} ifelse} forall
	/Encoding isolatin1encoding def
    currentdict end
definefont pop
/Bookman-Light-latin1
    /Bookman-Light findfont
    dup length dict begin
	{1 index /FID ne {def} {pop pop} ifelse} forall
	/Encoding isolatin1encoding def
    currentdict end
definefont pop
/Bookman-LightItalic-latin1
    /Bookman-LightItalic findfont
    dup length dict begin
	{1 index /FID ne {def} {pop pop} ifelse} forall
	/Encoding isolatin1encoding def
    currentdict end
definefont pop
/Bookman-Demi-latin1
    /Bookman-Demi findfont
    dup length dict begin
	{1 index /FID ne {def} {pop pop} ifelse} forall
	/Encoding isolatin1encoding def
    currentdict end
definefont pop
/Bookman-DemiItalic-latin1
    /Bookman-DemiItalic findfont
    dup length dict begin
	{1 index /FID ne {def} {pop pop} ifelse} forall
	/Encoding isolatin1encoding def
    currentdict end
definefont pop
/Courier-latin1
    /Courier findfont
    dup length dict begin
	{1 index /FID ne {def} {pop pop} ifelse} forall
	/Encoding isolatin1encoding def
    currentdict end
definefont pop
/Courier-Oblique-latin1
    /Courier-Oblique findfont
    dup length dict begin
	{1 index /FID ne {def} {pop pop} ifelse} forall
	/Encoding isolatin1encoding def
    currentdict end
definefont pop
/Courier-Bold-latin1
    /Courier-Bold findfont
    dup length dict begin
	{1 index /FID ne {def} {pop pop} ifelse} forall
	/Encoding isolatin1encoding def
    currentdict end
definefont pop
/Courier-BoldOblique-latin1
    /Courier-BoldOblique findfont
    dup length dict begin
	{1 index /FID ne {def} {pop pop} ifelse} forall
	/Encoding isolatin1encoding def
    currentdict end
definefont pop
/Helvetica-latin1
    /Helvetica findfont
    dup length dict begin
	{1 index /FID ne {def} {pop pop} ifelse} forall
	/Encoding isolatin1encoding def
    currentdict end
definefont pop
/Helvetica-Oblique-latin1
    /Helvetica-Oblique findfont
    dup length dict begin
	{1 index /FID ne {def} {pop pop} ifelse} forall
	/Encoding isolatin1encoding def
    currentdict end
definefont pop
/Helvetica-Bold-latin1
    /Helvetica-Bold findfont
    dup length dict begin
	{1 index /FID ne {def} {pop pop} ifelse} forall
	/Encoding isolatin1encoding def
    currentdict end
definefont pop
/Helvetica-BoldOblique-latin1
    /Helvetica-BoldOblique findfont
    dup length dict begin
	{1 index /FID ne {def} {pop pop} ifelse} forall
	/Encoding isolatin1encoding def
    currentdict end
definefont pop
/Helvetica-Narrow-latin1
    /Helvetica-Narrow findfont
    dup length dict begin
	{1 index /FID ne {def} {pop pop} ifelse} forall
	/Encoding isolatin1encoding def
    currentdict end
definefont pop
/Helvetica-Narrow-Oblique-latin1
    /Helvetica-Narrow-Oblique findfont
    dup length dict begin
	{1 index /FID ne {def} {pop pop} ifelse} forall
	/Encoding isolatin1encoding def
    currentdict end
definefont pop
/Helvetica-Narrow-Bold-latin1
    /Helvetica-Narrow-Bold findfont
    dup length dict begin
	{1 index /FID ne {def} {pop pop} ifelse} forall
	/Encoding isolatin1encoding def
    currentdict end
definefont pop
/Helvetica-Narrow-BoldOblique-latin1
    /Helvetica-Narrow-BoldOblique findfont
    dup length dict begin
	{1 index /FID ne {def} {pop pop} ifelse} forall
	/Encoding isolatin1encoding def
    currentdict end
definefont pop
/NewCenturySchoolbook-Roman-latin1
    /NewCenturySchoolbook-Roman findfont
    dup length dict begin
	{1 index /FID ne {def} {pop pop} ifelse} forall
	/Encoding isolatin1encoding def
    currentdict end
definefont pop
/NewCenturySchoolbook-Italic-latin1
    /NewCenturySchoolbook-Italic findfont
    dup length dict begin
	{1 index /FID ne {def} {pop pop} ifelse} forall
	/Encoding isolatin1encoding def
    currentdict end
definefont pop
/NewCenturySchoolbook-Bold-latin1
    /NewCenturySchoolbook-Bold findfont
    dup length dict begin
	{1 index /FID ne {def} {pop pop} ifelse} forall
	/Encoding isolatin1encoding def
    currentdict end
definefont pop
/NewCenturySchoolbook-BoldItalic-latin1
    /NewCenturySchoolbook-BoldItalic findfont
    dup length dict begin
	{1 index /FID ne {def} {pop pop} ifelse} forall
	/Encoding isolatin1encoding def
    currentdict end
definefont pop
/Palatino-Roman-latin1
    /Palatino-Roman findfont
    dup length dict begin
	{1 index /FID ne {def} {pop pop} ifelse} forall
	/Encoding isolatin1encoding def
    currentdict end
definefont pop
/Palatino-Italic-latin1
    /Palatino-Italic findfont
    dup length dict begin
	{1 index /FID ne {def} {pop pop} ifelse} forall
	/Encoding isolatin1encoding def
    currentdict end
definefont pop
/Palatino-Bold-latin1
    /Palatino-Bold findfont
    dup length dict begin
	{1 index /FID ne {def} {pop pop} ifelse} forall
	/Encoding isolatin1encoding def
    currentdict end
definefont pop
/Palatino-BoldItalic-latin1
    /Palatino-BoldItalic findfont
    dup length dict begin
	{1 index /FID ne {def} {pop pop} ifelse} forall
	/Encoding isolatin1encoding def
    currentdict end
definefont pop
/Symbol-latin1
    /Symbol findfont
definefont pop
/ZapfChancery-MediumItalic-latin1
    /ZapfChancery-MediumItalic findfont
    dup length dict begin
	{1 index /FID ne {def} {pop pop} ifelse} forall
	/Encoding isolatin1encoding def
    currentdict end
definefont pop
/ZapfDingbats-latin1
    /ZapfDingbats findfont
    dup length dict begin
	{1 index /FID ne {def} {pop pop} ifelse} forall
	/Encoding isolatin1encoding def
    currentdict end
definefont pop
/cp {closepath} bind def
/c {curveto} bind def
/f {fill} bind def
/a {arc} bind def
/ef {eofill} bind def
/ex {exch} bind def
/gr {grestore} bind def
/gs {gsave} bind def
/sa {save} bind def
/rs {restore} bind def
/l {lineto} bind def
/m {moveto} bind def
/rm {rmoveto} bind def
/n {newpath} bind def
/s {stroke} bind def
/sh {show} bind def
/slc {setlinecap} bind def
/slj {setlinejoin} bind def
/slw {setlinewidth} bind def
/srgb {setrgbcolor} bind def
/rot {rotate} bind def
/sc {scale} bind def
/sd {setdash} bind def
/ff {findfont} bind def
/sf {setfont} bind def
/scf {scalefont} bind def
/sw {stringwidth pop} bind def
/tr {translate} bind def

/ellipsedict 8 dict def
ellipsedict /mtrx matrix put
/ellipse
{ ellipsedict begin
   /endangle exch def
   /startangle exch def
   /yrad exch def
   /xrad exch def
   /y exch def
   /x exch def   /savematrix mtrx currentmatrix def
   x y tr xrad yrad sc
   0 0 1 startangle endangle arc
   savematrix setmatrix
   end
} def

/mergeprocs {
dup length
3 -1 roll
dup
length
dup
5 1 roll
3 -1 roll
add
array cvx
dup
3 -1 roll
0 exch
putinterval
dup
4 2 roll
putinterval
} bind def
28.346000 -28.346000 scale
-0.626000 -19.199000 translate
%%EndProlog


0.080000 slw
0 slj
[] 0 sd
0.700000 0.700000 0.700000 srgb
n 11.200000 9.450000 m 11.200000 12.950000 l 12.700000 12.950000 l 12.700000 9.450000 l f
0.000000 0.000000 0.000000 srgb
n 11.200000 9.450000 m 11.200000 12.950000 l 12.700000 12.950000 l 12.700000 9.450000 l cp s
0.010000 slw
n 11.350000 9.660000 m 11.350000 10.060000 l 12.550000 10.060000 l 12.550000 9.660000 l cp s
n 11.350000 10.060000 m 11.350000 10.460000 l 12.550000 10.460000 l 12.550000 10.060000 l cp s
n 11.350000 10.460000 m 11.350000 10.860000 l 12.550000 10.860000 l 12.550000 10.460000 l cp s
n 11.350000 10.860000 m 11.350000 11.260000 l 12.550000 11.260000 l 12.550000 10.860000 l cp s
n 11.350000 11.340000 m 11.350000 11.580000 l 12.100000 11.580000 l 12.100000 11.340000 l cp s
0.000000 1.000000 0.000000 srgb
n 12.475000 11.380000 0.052500 0.052500 0 360 ellipse f
0.000000 0.000000 0.000000 srgb
n 12.475000 11.380000 0.052500 0.052500 0 360 ellipse cp s
1.000000 1.000000 0.000000 srgb
n 12.475000 11.540000 0.052500 0.052500 0 360 ellipse f
0.000000 0.000000 0.000000 srgb
n 12.475000 11.540000 0.052500 0.052500 0 360 ellipse cp s
1.000000 1.000000 1.000000 srgb
n 12.175000 11.420000 m 12.175000 11.580000 l 12.355000 11.580000 l 12.355000 11.420000 l f
0.000000 0.000000 0.000000 srgb
n 12.175000 11.420000 m 12.175000 11.580000 l 12.355000 11.580000 l 12.355000 11.420000 l cp s
0.080000 slw
0 slc
n 11.450000 11.900000 m 11.450000 12.775000 l s
n 11.700000 11.900000 m 11.700000 12.775000 l s
n 11.950000 11.900000 m 11.950000 12.775000 l s
n 12.200000 11.900000 m 12.200000 12.775000 l s
n 12.450000 11.900000 m 12.450000 12.775000 l s
0.600000 0.600000 0.600000 srgb
n 10.900000 13.250000 m 11.200000 12.650000 l 11.200000 12.950000 l 12.700000 12.950000 l 12.700000 12.650000 l 13.000000 13.250000 l f
0.000000 0.000000 0.000000 srgb
n 10.900000 13.250000 m 11.200000 12.650000 l 11.200000 12.950000 l 12.700000 12.950000 l 12.700000 12.650000 l 13.000000 13.250000 l cp s
0.080000 slw
0 slj
[] 0 sd
0.700000 0.700000 0.700000 srgb
n 24.000000 9.500000 m 24.000000 13.000000 l 25.500000 13.000000 l 25.500000 9.500000 l f
0.000000 0.000000 0.000000 srgb
n 24.000000 9.500000 m 24.000000 13.000000 l 25.500000 13.000000 l 25.500000 9.500000 l cp s
0.010000 slw
n 24.150000 9.710000 m 24.150000 10.110000 l 25.350000 10.110000 l 25.350000 9.710000 l cp s
n 24.150000 10.110000 m 24.150000 10.510000 l 25.350000 10.510000 l 25.350000 10.110000 l cp s
n 24.150000 10.510000 m 24.150000 10.910000 l 25.350000 10.910000 l 25.350000 10.510000 l cp s
n 24.150000 10.910000 m 24.150000 11.310000 l 25.350000 11.310000 l 25.350000 10.910000 l cp s
n 24.150000 11.390000 m 24.150000 11.630000 l 24.900000 11.630000 l 24.900000 11.390000 l cp s
0.000000 1.000000 0.000000 srgb
n 25.275000 11.430000 0.052500 0.052500 0 360 ellipse f
0.000000 0.000000 0.000000 srgb
n 25.275000 11.430000 0.052500 0.052500 0 360 ellipse cp s
1.000000 1.000000 0.000000 srgb
n 25.275000 11.590000 0.052500 0.052500 0 360 ellipse f
0.000000 0.000000 0.000000 srgb
n 25.275000 11.590000 0.052500 0.052500 0 360 ellipse cp s
1.000000 1.000000 1.000000 srgb
n 24.975000 11.470000 m 24.975000 11.630000 l 25.155000 11.630000 l 25.155000 11.470000 l f
0.000000 0.000000 0.000000 srgb
n 24.975000 11.470000 m 24.975000 11.630000 l 25.155000 11.630000 l 25.155000 11.470000 l cp s
0.080000 slw
0 slc
n 24.250000 11.950000 m 24.250000 12.825000 l s
n 24.500000 11.950000 m 24.500000 12.825000 l s
n 24.750000 11.950000 m 24.750000 12.825000 l s
n 25.000000 11.950000 m 25.000000 12.825000 l s
n 25.250000 11.950000 m 25.250000 12.825000 l s
0.600000 0.600000 0.600000 srgb
n 23.700000 13.300000 m 24.000000 12.700000 l 24.000000 13.000000 l 25.500000 13.000000 l 25.500000 12.700000 l 25.800000 13.300000 l f
0.000000 0.000000 0.000000 srgb
n 23.700000 13.300000 m 24.000000 12.700000 l 24.000000 13.000000 l 25.500000 13.000000 l 25.500000 12.700000 l 25.800000 13.300000 l cp s
0.100000 slw
[] 0 sd
[] 0 sd
0 slc
0 slj
0 slc
0 slj
[] 0 sd
0.850980 0.850980 0.803922 srgb
n 1.150000 8.925000 m 1.150000 10.175000 l 6.150000 10.175000 l 6.150000 8.925000 l f
0.000000 0.000000 0.000000 srgb
n 1.150000 8.925000 m 1.150000 10.175000 l 6.150000 10.175000 l 6.150000 8.925000 l cp s
0.010000 slw
0 slc
0 slj
[] 0 sd
n 1.150000 8.925000 m 1.150000 10.175000 l 6.150000 10.175000 l 6.150000 8.925000 l cp s
0 slc
0 slj
[] 0 sd
n 2.025000 9.425000 m 1.900000 9.550000 l s
0 slc
0 slj
[] 0 sd
n 1.900000 9.550000 m 2.025000 9.675000 l s
0 slc
0 slj
[] 0 sd
n 2.525000 9.425000 m 2.400000 9.550000 l s
0 slc
0 slj
[] 0 sd
n 2.400000 9.550000 m 2.525000 9.675000 l s
0 slc
0 slj
[] 0 sd
n 3.025000 9.425000 m 2.900000 9.550000 l s
0 slc
0 slj
[] 0 sd
n 2.900000 9.550000 m 3.025000 9.675000 l s
0 slc
0 slj
[] 0 sd
n 3.525000 9.425000 m 3.400000 9.550000 l s
0 slc
0 slj
[] 0 sd
n 3.400000 9.550000 m 3.525000 9.675000 l s
0 slc
0 slj
[] 0 sd
n 4.025000 9.425000 m 3.900000 9.550000 l s
0 slc
0 slj
[] 0 sd
n 3.900000 9.550000 m 4.025000 9.675000 l s
0 slc
0 slj
[] 0 sd
n 4.525000 9.425000 m 4.400000 9.550000 l s
0 slc
0 slj
[] 0 sd
n 4.400000 9.550000 m 4.525000 9.675000 l s
0 slc
0 slj
[] 0 sd
n 5.025000 9.425000 m 4.900000 9.550000 l s
0 slc
0 slj
[] 0 sd
n 4.900000 9.550000 m 5.025000 9.675000 l s
0 slc
0 slj
[] 0 sd
n 5.525000 9.425000 m 5.400000 9.550000 l s
0 slc
0 slj
[] 0 sd
n 5.400000 9.550000 m 5.525000 9.675000 l s
0 slc
0 slj
[] 0 sd
n 5.775000 9.800000 m 5.650000 9.925000 l s
0 slc
0 slj
[] 0 sd
n 5.650000 9.925000 m 5.775000 10.050000 l s
0 slc
0 slj
[] 0 sd
n 5.275000 9.800000 m 5.150000 9.925000 l s
0 slc
0 slj
[] 0 sd
n 5.150000 9.925000 m 5.275000 10.050000 l s
0 slc
0 slj
[] 0 sd
n 4.775000 9.800000 m 4.650000 9.925000 l s
0 slc
0 slj
[] 0 sd
n 4.650000 9.925000 m 4.775000 10.050000 l s
0 slc
0 slj
[] 0 sd
n 4.275000 9.800000 m 4.150000 9.925000 l s
0 slc
0 slj
[] 0 sd
n 4.150000 9.925000 m 4.275000 10.050000 l s
0 slc
0 slj
[] 0 sd
n 3.775000 9.800000 m 3.650000 9.925000 l s
0 slc
0 slj
[] 0 sd
n 3.650000 9.925000 m 3.775000 10.050000 l s
0 slc
0 slj
[] 0 sd
n 3.275000 9.800000 m 3.150000 9.925000 l s
0 slc
0 slj
[] 0 sd
n 3.150000 9.925000 m 3.275000 10.050000 l s
0 slc
0 slj
[] 0 sd
n 2.775000 9.800000 m 2.650000 9.925000 l s
0 slc
0 slj
[] 0 sd
n 2.650000 9.925000 m 2.775000 10.050000 l s
0.100000 slw
0 slc
0 slj
[] 0 sd
0.850980 0.850980 0.803922 srgb
n 2.025000 9.925000 m 2.025000 10.050000 l 2.525000 10.050000 l 2.525000 9.925000 l f
0.000000 0.000000 0.000000 srgb
n 2.025000 9.925000 m 2.025000 10.050000 l 2.525000 10.050000 l 2.525000 9.925000 l cp s
0.010000 slw
0 slc
0 slj
[] 0 sd
n 2.025000 9.925000 m 2.025000 10.050000 l 2.525000 10.050000 l 2.525000 9.925000 l cp s
0.100000 slw
0 slc
0 slj
[] 0 sd
0.803922 0.803922 0.803922 srgb
n 1.525000 9.550000 m 1.775000 9.800000 l 1.525000 10.050000 l 1.275000 9.800000 l f
0.000000 0.000000 0.000000 srgb
n 1.525000 9.550000 m 1.775000 9.800000 l 1.525000 10.050000 l 1.275000 9.800000 l cp s
0.010000 slw
0 slc
0 slj
[] 0 sd
n 1.525000 9.550000 m 1.775000 9.800000 l 1.525000 10.050000 l 1.275000 9.800000 l cp s
0.100000 slw
0 slc
0 slj
[] 0 sd
0.850980 0.850980 0.803922 srgb
n 1.150000 9.175000 m 1.150000 9.300000 l 6.150000 9.300000 l 6.150000 9.175000 l f
0.000000 0.000000 0.000000 srgb
n 1.150000 9.175000 m 1.150000 9.300000 l 6.150000 9.300000 l 6.150000 9.175000 l cp s
0.010000 slw
0 slc
0 slj
[] 0 sd
n 1.150000 9.175000 m 1.150000 9.300000 l 6.150000 9.300000 l 6.150000 9.175000 l cp s
0.100000 slw
0 slc
0 slj
[] 0 sd
0.803922 0.803922 0.803922 srgb
n 1.775000 9.175000 m 1.775000 9.300000 l 2.900000 9.300000 l 2.900000 9.175000 l f
0.000000 0.000000 0.000000 srgb
n 1.775000 9.175000 m 1.775000 9.300000 l 2.900000 9.300000 l 2.900000 9.175000 l cp s
0.010000 slw
0 slc
0 slj
[] 0 sd
n 1.775000 9.175000 m 1.775000 9.300000 l 2.900000 9.300000 l 2.900000 9.175000 l cp s
0.080000 slw
0 slj
[] 0 sd
0.700000 0.700000 0.700000 srgb
n 2.200000 5.850000 m 2.200000 8.100000 l 5.200000 8.100000 l 5.200000 5.850000 l f
0.000000 0.000000 0.000000 srgb
n 2.200000 5.850000 m 2.200000 8.100000 l 5.200000 8.100000 l 5.200000 5.850000 l cp s
n 2.525000 6.175000 m 2.525000 7.775000 l 4.875000 7.775000 l 4.875000 6.175000 l f
0.700000 0.700000 0.700000 srgb
n 2.606250 8.100000 m 4.150000 8.100000 l 4.150000 8.450000 l 2.687500 8.450000 l f
0.000000 0.000000 0.000000 srgb
n 2.606250 8.100000 m 4.150000 8.100000 l 4.150000 8.450000 l 2.687500 8.450000 l cp s
0.700000 0.700000 0.700000 srgb
n 4.150000 8.100000 m 4.793750 8.100000 l 4.712500 8.450000 l 4.150000 8.450000 l f
0.000000 0.000000 0.000000 srgb
n 4.150000 8.100000 m 4.793750 8.100000 l 4.712500 8.450000 l 4.150000 8.450000 l cp s
0.025000 slw
1.000000 1.000000 1.000000 srgb
n 4.255000 8.205000 m 4.255000 8.345000 l 4.395000 8.345000 l 4.395000 8.205000 l f
0.000000 0.000000 0.000000 srgb
n 4.255000 8.205000 m 4.255000 8.345000 l 4.395000 8.345000 l 4.395000 8.205000 l cp s
0.080000 slw
0.700000 0.700000 0.700000 srgb
n 3.400000 8.450000 m 4.000000 8.450000 l 4.000000 8.625000 l 4.300000 8.625000 l 4.300000 8.800000 l 3.100000 8.800000 l 3.100000 8.625000 l 3.400000 8.625000 l f
0.000000 0.000000 0.000000 srgb
n 3.400000 8.450000 m 4.000000 8.450000 l 4.000000 8.625000 l 4.300000 8.625000 l 4.300000 8.800000 l 3.100000 8.800000 l 3.100000 8.625000 l 3.400000 8.625000 l cp s
0.080000 slw
0 slj
[] 0 sd
0.700000 0.700000 0.700000 srgb
n 2.550000 14.400000 m 2.550000 16.650000 l 5.550000 16.650000 l 5.550000 14.400000 l f
0.000000 0.000000 0.000000 srgb
n 2.550000 14.400000 m 2.550000 16.650000 l 5.550000 16.650000 l 5.550000 14.400000 l cp s
n 2.875000 14.725000 m 2.875000 16.325000 l 5.225000 16.325000 l 5.225000 14.725000 l f
0.700000 0.700000 0.700000 srgb
n 2.956250 16.650000 m 4.500000 16.650000 l 4.500000 17.000000 l 3.037500 17.000000 l f
0.000000 0.000000 0.000000 srgb
n 2.956250 16.650000 m 4.500000 16.650000 l 4.500000 17.000000 l 3.037500 17.000000 l cp s
0.700000 0.700000 0.700000 srgb
n 4.500000 16.650000 m 5.143750 16.650000 l 5.062500 17.000000 l 4.500000 17.000000 l f
0.000000 0.000000 0.000000 srgb
n 4.500000 16.650000 m 5.143750 16.650000 l 5.062500 17.000000 l 4.500000 17.000000 l cp s
0.025000 slw
1.000000 1.000000 1.000000 srgb
n 4.605000 16.755000 m 4.605000 16.895000 l 4.745000 16.895000 l 4.745000 16.755000 l f
0.000000 0.000000 0.000000 srgb
n 4.605000 16.755000 m 4.605000 16.895000 l 4.745000 16.895000 l 4.745000 16.755000 l cp s
0.080000 slw
0.700000 0.700000 0.700000 srgb
n 3.750000 17.000000 m 4.350000 17.000000 l 4.350000 17.175000 l 4.650000 17.175000 l 4.650000 17.350000 l 3.450000 17.350000 l 3.450000 17.175000 l 3.750000 17.175000 l f
0.000000 0.000000 0.000000 srgb
n 3.750000 17.000000 m 4.350000 17.000000 l 4.350000 17.175000 l 4.650000 17.175000 l 4.650000 17.350000 l 3.450000 17.350000 l 3.450000 17.175000 l 3.750000 17.175000 l cp s
0.100000 slw
[] 0 sd
[] 0 sd
0 slc
0 slj
0 slc
0 slj
[] 0 sd
0.850980 0.850980 0.803922 srgb
n 28.550000 8.333333 m 28.550000 9.666667 l 32.550000 9.666667 l 32.550000 8.333333 l f
0.000000 0.000000 0.000000 srgb
n 28.550000 8.333333 m 28.550000 9.666667 l 32.550000 9.666667 l 32.550000 8.333333 l cp s
0.010000 slw
0 slc
0 slj
[] 0 sd
n 28.550000 8.333333 m 28.550000 9.666667 l 32.550000 9.666667 l 32.550000 8.333333 l cp s
0.100000 slw
0 slc
0 slj
[] 0 sd
0.850980 0.850980 0.803922 srgb
n 30.930952 8.714286 m 30.930952 9.476190 l 32.454762 9.476190 l 32.454762 8.714286 l f
0.000000 0.000000 0.000000 srgb
n 30.930952 8.714286 m 30.930952 9.476190 l 32.454762 9.476190 l 32.454762 8.714286 l cp s
0.010000 slw
0 slc
0 slj
[] 0 sd
n 30.930952 8.714286 m 30.930952 9.476190 l 32.454762 9.476190 l 32.454762 8.714286 l cp s
0 slc
0 slj
[] 0 sd
n 32.454762 9.095238 m 30.930952 9.095238 l s
0.100000 slw
0 slc
0 slj
[] 0 sd
0.850980 0.850980 0.803922 srgb
n 30.550000 8.428571 m 30.550000 9.476190 l 30.835714 9.476190 l 30.835714 8.428571 l f
0.000000 0.000000 0.000000 srgb
n 30.550000 8.428571 m 30.550000 9.476190 l 30.835714 9.476190 l 30.835714 8.428571 l cp s
0.010000 slw
0 slc
0 slj
[] 0 sd
n 30.550000 8.428571 m 30.550000 9.476190 l 30.835714 9.476190 l 30.835714 8.428571 l cp s
0.100000 slw
0 slc
0 slj
[] 0 sd
0.000000 0.803922 0.000000 srgb
n 29.502381 8.523810 m 29.502381 8.619048 l 29.597619 8.619048 l 29.597619 8.523810 l f
0.000000 0.000000 0.000000 srgb
n 29.502381 8.523810 m 29.502381 8.619048 l 29.597619 8.619048 l 29.597619 8.523810 l cp s
0.010000 slw
0 slc
0 slj
[] 0 sd
n 29.502381 8.523810 m 29.502381 8.619048 l 29.597619 8.619048 l 29.597619 8.523810 l cp s
0.100000 slw
0 slc
0 slj
[] 0 sd
0.803922 0.803922 0.000000 srgb
n 29.692857 8.523810 m 29.692857 8.619048 l 29.788095 8.619048 l 29.788095 8.523810 l f
0.000000 0.000000 0.000000 srgb
n 29.692857 8.523810 m 29.692857 8.619048 l 29.788095 8.619048 l 29.788095 8.523810 l cp s
0.010000 slw
0 slc
0 slj
[] 0 sd
n 29.692857 8.523810 m 29.692857 8.619048 l 29.788095 8.619048 l 29.788095 8.523810 l cp s
0.100000 slw
0 slc
0 slj
[] 0 sd
0.803922 0.000000 0.000000 srgb
n 29.883333 8.523810 m 29.883333 8.619048 l 29.978571 8.619048 l 29.978571 8.523810 l f
0.000000 0.000000 0.000000 srgb
n 29.883333 8.523810 m 29.883333 8.619048 l 29.978571 8.619048 l 29.978571 8.523810 l cp s
0.010000 slw
0 slc
0 slj
[] 0 sd
n 29.883333 8.523810 m 29.883333 8.619048 l 29.978571 8.619048 l 29.978571 8.523810 l cp s
0.100000 slw
0 slc
0 slj
[] 0 sd
0.803922 0.803922 0.741176 srgb
n 30.169048 8.428571 m 30.169048 8.619048 l 30.359524 8.619048 l 30.359524 8.428571 l f
0.000000 0.000000 0.000000 srgb
n 30.169048 8.428571 m 30.169048 8.619048 l 30.359524 8.619048 l 30.359524 8.428571 l cp s
0.010000 slw
0 slc
0 slj
[] 0 sd
n 30.169048 8.428571 m 30.169048 8.619048 l 30.359524 8.619048 l 30.359524 8.428571 l cp s
0.100000 slw
0 slc
0 slj
[] 0 sd
0.803922 0.803922 0.741176 srgb
n 28.740476 8.428571 m 28.740476 8.714286 l 29.026190 8.714286 l 29.026190 8.428571 l f
0.000000 0.000000 0.000000 srgb
n 28.740476 8.428571 m 28.740476 8.714286 l 29.026190 8.714286 l 29.026190 8.428571 l cp s
0.010000 slw
0 slc
0 slj
[] 0 sd
n 28.740476 8.428571 m 28.740476 8.714286 l 29.026190 8.714286 l 29.026190 8.428571 l cp s
0.100000 slw
0 slc
0 slj
[] 0 sd
0.803922 0.803922 0.756863 srgb
n 31.026190 9.190476 m 31.026190 9.285714 l 32.359524 9.285714 l 32.359524 9.190476 l f
0.000000 0.000000 0.000000 srgb
n 31.026190 9.190476 m 31.026190 9.285714 l 32.359524 9.285714 l 32.359524 9.190476 l cp s
0.010000 slw
0 slc
0 slj
[] 0 sd
n 31.026190 9.190476 m 31.026190 9.285714 l 32.359524 9.285714 l 32.359524 9.190476 l cp s
0 slc
0 slj
[] 0 sd
n 30.645238 8.523810 m 30.645238 9.380952 l s
0.100000 slw
0 slc
0 slj
[] 0 sd
0.803922 0.803922 0.756863 srgb
n 30.645238 8.714286 m 30.645238 9.190476 l 30.740476 9.190476 l 30.740476 8.714286 l f
0.000000 0.000000 0.000000 srgb
n 30.645238 8.714286 m 30.645238 9.190476 l 30.740476 9.190476 l 30.740476 8.714286 l cp s
0.010000 slw
0 slc
0 slj
[] 0 sd
n 30.645238 8.714286 m 30.645238 9.190476 l 30.740476 9.190476 l 30.740476 8.714286 l cp s
0 slc
0 slj
[] 0 sd
n 32.169048 9.380952 m 32.359524 9.380952 l s
0 slc
0 slj
[] 0 sd
n 28.645238 9.000000 m 30.359524 9.000000 l s
0 slc
0 slj
[] 0 sd
n 30.359524 9.095238 m 28.645238 9.095238 l s
0 slc
0 slj
[] 0 sd
n 28.645238 9.190476 m 30.359524 9.190476 l s
0 slc
0 slj
[] 0 sd
n 30.359524 9.476190 m 28.645238 9.476190 l s
0 slc
0 slj
[] 0 sd
n 28.645238 9.380952 m 30.359524 9.380952 l s
0 slc
0 slj
[] 0 sd
n 30.359524 9.285714 m 28.645238 9.285714 l s
0 slc
0 slj
[] 0 sd
n 31.026190 9.380952 m 31.121429 9.380952 l s
0 slc
0 slj
[] 0 sd
n 31.216667 9.380952 m 31.311905 9.380952 l s
0 slc
0 slj
[] 0 sd
n 30.740476 9.380952 m 30.740476 9.285714 l s
0 slc
0 slj
[] 0 sd
n 30.740476 8.619048 m 30.740476 8.523810 l s
0.100000 slw
[] 0 sd
[] 0 sd
0 slc
0 slj
0 slc
0 slj
[] 0 sd
0.850980 0.850980 0.803922 srgb
n 29.700000 6.250000 m 29.700000 7.916667 l 31.700000 7.916667 l 31.700000 6.250000 l f
0.000000 0.000000 0.000000 srgb
n 29.700000 6.250000 m 29.700000 7.916667 l 31.700000 7.916667 l 31.700000 6.250000 l cp s
0.010000 slw
0 slc
0 slj
[] 0 sd
n 29.700000 6.250000 m 29.700000 7.916667 l 31.700000 7.916667 l 31.700000 6.250000 l cp s
0.100000 slw
0 slc
0 slj
[] 0 sd
0.631373 0.631373 0.631373 srgb
n 29.811111 6.361111 m 29.811111 7.694444 l 31.588889 7.694444 l 31.588889 6.361111 l f
0.000000 0.000000 0.000000 srgb
n 29.811111 6.361111 m 29.811111 7.694444 l 31.588889 7.694444 l 31.588889 6.361111 l cp s
0.010000 slw
0 slc
0 slj
[] 0 sd
n 29.811111 6.361111 m 29.811111 7.694444 l 31.588889 7.694444 l 31.588889 6.361111 l cp s
0.100000 slw
0 slc
0 slj
[] 0 sd
0.850980 0.850980 0.803922 srgb
n 30.033333 7.916667 m 31.366667 7.916667 l 31.033333 8.027778 l 30.366667 8.027778 l f
0.000000 0.000000 0.000000 srgb
n 30.033333 7.916667 m 31.366667 7.916667 l 31.033333 8.027778 l 30.366667 8.027778 l cp s
0.010000 slw
0 slc
0 slj
[] 0 sd
n 30.033333 7.916667 m 31.366667 7.916667 l 31.033333 8.027778 l 30.366667 8.027778 l cp s
0.100000 slw
0 slc
0 slj
[] 0 sd
0.850980 0.850980 0.803922 srgb
n 30.366667 8.027778 m 30.366667 8.138889 l 31.033333 8.138889 l 31.033333 8.027778 l f
0.000000 0.000000 0.000000 srgb
n 30.366667 8.027778 m 30.366667 8.138889 l 31.033333 8.138889 l 31.033333 8.027778 l cp s
0.010000 slw
0 slc
0 slj
[] 0 sd
n 30.366667 8.027778 m 30.366667 8.138889 l 31.033333 8.138889 l 31.033333 8.027778 l cp s
0.100000 slw
0 slc
0 slj
[] 0 sd
0.850980 0.850980 0.803922 srgb
n 30.033333 8.138889 m 30.033333 8.250000 l 31.366667 8.250000 l 31.366667 8.138889 l f
0.000000 0.000000 0.000000 srgb
n 30.033333 8.138889 m 30.033333 8.250000 l 31.366667 8.250000 l 31.366667 8.138889 l cp s
0.010000 slw
0 slc
0 slj
[] 0 sd
n 30.033333 8.138889 m 30.033333 8.250000 l 31.366667 8.250000 l 31.366667 8.138889 l cp s
0.100000 slw
[] 0 sd
[] 0 sd
0 slc
0 slj
0 slc
0 slj
[] 0 sd
0.850980 0.850980 0.803922 srgb
n 28.400000 15.600000 m 28.400000 18.600000 l 29.900000 18.600000 l 29.900000 15.600000 l f
0.000000 0.000000 0.000000 srgb
n 28.400000 15.600000 m 28.400000 18.600000 l 29.900000 18.600000 l 29.900000 15.600000 l cp s
0.010000 slw
0 slc
0 slj
[] 0 sd
n 28.400000 15.600000 m 28.400000 18.600000 l 29.900000 18.600000 l 29.900000 15.600000 l cp s
0.100000 slw
0 slc
0 slj
[] 0 sd
0.850980 0.850980 0.803922 srgb
n 28.550000 15.750000 m 28.550000 16.950000 l 29.750000 16.950000 l 29.750000 15.750000 l f
0.000000 0.000000 0.000000 srgb
n 28.550000 15.750000 m 28.550000 16.950000 l 29.750000 16.950000 l 29.750000 15.750000 l cp s
0.010000 slw
0 slc
0 slj
[] 0 sd
n 28.550000 15.750000 m 28.550000 16.950000 l 29.750000 16.950000 l 29.750000 15.750000 l cp s
0 slc
0 slj
[] 0 sd
n 29.750000 16.050000 m 28.550000 16.050000 l s
0 slc
0 slj
[] 0 sd
n 28.550000 16.350000 m 29.750000 16.350000 l s
0 slc
0 slj
[] 0 sd
n 29.750000 16.575000 m 28.550000 16.575000 l s
0.100000 slw
0 slc
0 slj
[] 0 sd
0.850980 0.850980 0.803922 srgb
n 28.550000 17.100000 m 28.550000 17.550000 l 29.375000 17.550000 l 29.375000 17.100000 l f
0.000000 0.000000 0.000000 srgb
n 28.550000 17.100000 m 28.550000 17.550000 l 29.375000 17.550000 l 29.375000 17.100000 l cp s
0.010000 slw
0 slc
0 slj
[] 0 sd
n 28.550000 17.100000 m 28.550000 17.550000 l 29.375000 17.550000 l 29.375000 17.100000 l cp s
0 slc
0 slj
[] 0 sd
n 28.400000 17.625000 m 29.900000 17.625000 l s
0.100000 slw
0 slc
0 slj
[] 0 sd
0.000000 0.803922 0.000000 srgb
n 29.075000 17.775000 m 29.075000 17.850000 l 29.150000 17.850000 l 29.150000 17.775000 l f
0.000000 0.000000 0.000000 srgb
n 29.075000 17.775000 m 29.075000 17.850000 l 29.150000 17.850000 l 29.150000 17.775000 l cp s
0.010000 slw
0 slc
0 slj
[] 0 sd
n 29.075000 17.775000 m 29.075000 17.850000 l 29.150000 17.850000 l 29.150000 17.775000 l cp s
0.100000 slw
0 slc
0 slj
[] 0 sd
0.803922 0.803922 0.000000 srgb
n 29.375000 17.775000 m 29.375000 17.850000 l 29.450000 17.850000 l 29.450000 17.775000 l f
0.000000 0.000000 0.000000 srgb
n 29.375000 17.775000 m 29.375000 17.850000 l 29.450000 17.850000 l 29.450000 17.775000 l cp s
0.010000 slw
0 slc
0 slj
[] 0 sd
n 29.375000 17.775000 m 29.375000 17.850000 l 29.450000 17.850000 l 29.450000 17.775000 l cp s
0.100000 slw
0 slc
0 slj
[] 0 sd
0.803922 0.000000 0.000000 srgb
n 29.675000 17.775000 m 29.675000 17.850000 l 29.750000 17.850000 l 29.750000 17.775000 l f
0.000000 0.000000 0.000000 srgb
n 29.675000 17.775000 m 29.675000 17.850000 l 29.750000 17.850000 l 29.750000 17.775000 l cp s
0.010000 slw
0 slc
0 slj
[] 0 sd
n 29.675000 17.775000 m 29.675000 17.850000 l 29.750000 17.850000 l 29.750000 17.775000 l cp s
0.100000 slw
0 slc
0 slj
[] 0 sd
0.803922 0.803922 0.741176 srgb
n 29.600000 17.325000 m 29.600000 17.400000 l 29.750000 17.400000 l 29.750000 17.325000 l f
0.000000 0.000000 0.000000 srgb
n 29.600000 17.325000 m 29.600000 17.400000 l 29.750000 17.400000 l 29.750000 17.325000 l cp s
0.010000 slw
0 slc
0 slj
[] 0 sd
n 29.600000 17.325000 m 29.600000 17.400000 l 29.750000 17.400000 l 29.750000 17.325000 l cp s
0 slc
0 slj
[] 0 sd
n 28.550000 17.325000 m 29.375000 17.325000 l s
0.100000 slw
0 slc
0 slj
[] 0 sd
0.803922 0.803922 0.741176 srgb
n 28.550000 17.700000 m 28.550000 17.925000 l 28.775000 17.925000 l 28.775000 17.700000 l f
0.000000 0.000000 0.000000 srgb
n 28.550000 17.700000 m 28.550000 17.925000 l 28.775000 17.925000 l 28.775000 17.700000 l cp s
0.010000 slw
0 slc
0 slj
[] 0 sd
n 28.550000 17.700000 m 28.550000 17.925000 l 28.775000 17.925000 l 28.775000 17.700000 l cp s
0.100000 slw
0 slc
0 slj
[] 0 sd
0.803922 0.803922 0.756863 srgb
n 28.625000 16.650000 m 28.625000 16.725000 l 29.675000 16.725000 l 29.675000 16.650000 l f
0.000000 0.000000 0.000000 srgb
n 28.625000 16.650000 m 28.625000 16.725000 l 29.675000 16.725000 l 29.675000 16.650000 l cp s
0.010000 slw
0 slc
0 slj
[] 0 sd
n 28.625000 16.650000 m 28.625000 16.725000 l 29.675000 16.725000 l 29.675000 16.650000 l cp s
0 slc
0 slj
[] 0 sd
n 28.625000 17.175000 m 29.300000 17.175000 l s
0 slc
0 slj
[] 0 sd
n 29.300000 17.250000 m 29.225000 17.250000 l s
0 slc
0 slj
[] 0 sd
n 28.625000 17.250000 m 28.700000 17.250000 l s
0.100000 slw
0 slc
0 slj
[] 0 sd
0.803922 0.803922 0.756863 srgb
n 28.775000 17.175000 m 28.775000 17.250000 l 29.150000 17.250000 l 29.150000 17.175000 l f
0.000000 0.000000 0.000000 srgb
n 28.775000 17.175000 m 28.775000 17.250000 l 29.150000 17.250000 l 29.150000 17.175000 l cp s
0.010000 slw
0 slc
0 slj
[] 0 sd
n 28.775000 17.175000 m 28.775000 17.250000 l 29.150000 17.250000 l 29.150000 17.175000 l cp s
0 slc
0 slj
[] 0 sd
n 28.625000 16.800000 m 28.700000 16.800000 l s
0 slc
0 slj
[] 0 sd
n 28.775000 16.800000 m 28.850000 16.800000 l s
0 slc
0 slj
[] 0 sd
n 29.525000 16.800000 m 29.675000 16.800000 l s
0 slc
0 slj
[] 0 sd
n 29.825000 18.525000 m 28.475000 18.525000 l s
0 slc
0 slj
[] 0 sd
n 28.475000 18.450000 m 29.825000 18.450000 l s
0 slc
0 slj
[] 0 sd
n 29.825000 18.375000 m 28.475000 18.375000 l s
0 slc
0 slj
[] 0 sd
n 28.475000 18.300000 m 29.825000 18.300000 l s
0 slc
0 slj
[] 0 sd
n 29.825000 18.225000 m 28.475000 18.225000 l s
0 slc
0 slj
[] 0 sd
n 28.475000 18.150000 m 29.825000 18.150000 l s
0 slc
0 slj
[] 0 sd
n 29.825000 18.075000 m 28.475000 18.075000 l s
0.100000 slw
[] 0 sd
[] 0 sd
0 slc
0 slj
0 slc
0 slj
[] 0 sd
0.850980 0.850980 0.803922 srgb
n 25.700000 16.650000 m 25.700000 18.316667 l 27.700000 18.316667 l 27.700000 16.650000 l f
0.000000 0.000000 0.000000 srgb
n 25.700000 16.650000 m 25.700000 18.316667 l 27.700000 18.316667 l 27.700000 16.650000 l cp s
0.010000 slw
0 slc
0 slj
[] 0 sd
n 25.700000 16.650000 m 25.700000 18.316667 l 27.700000 18.316667 l 27.700000 16.650000 l cp s
0.100000 slw
0 slc
0 slj
[] 0 sd
0.631373 0.631373 0.631373 srgb
n 25.811111 16.761111 m 25.811111 18.094444 l 27.588889 18.094444 l 27.588889 16.761111 l f
0.000000 0.000000 0.000000 srgb
n 25.811111 16.761111 m 25.811111 18.094444 l 27.588889 18.094444 l 27.588889 16.761111 l cp s
0.010000 slw
0 slc
0 slj
[] 0 sd
n 25.811111 16.761111 m 25.811111 18.094444 l 27.588889 18.094444 l 27.588889 16.761111 l cp s
0.100000 slw
0 slc
0 slj
[] 0 sd
0.850980 0.850980 0.803922 srgb
n 26.033333 18.316667 m 27.366667 18.316667 l 27.033333 18.427778 l 26.366667 18.427778 l f
0.000000 0.000000 0.000000 srgb
n 26.033333 18.316667 m 27.366667 18.316667 l 27.033333 18.427778 l 26.366667 18.427778 l cp s
0.010000 slw
0 slc
0 slj
[] 0 sd
n 26.033333 18.316667 m 27.366667 18.316667 l 27.033333 18.427778 l 26.366667 18.427778 l cp s
0.100000 slw
0 slc
0 slj
[] 0 sd
0.850980 0.850980 0.803922 srgb
n 26.366667 18.427778 m 26.366667 18.538889 l 27.033333 18.538889 l 27.033333 18.427778 l f
0.000000 0.000000 0.000000 srgb
n 26.366667 18.427778 m 26.366667 18.538889 l 27.033333 18.538889 l 27.033333 18.427778 l cp s
0.010000 slw
0 slc
0 slj
[] 0 sd
n 26.366667 18.427778 m 26.366667 18.538889 l 27.033333 18.538889 l 27.033333 18.427778 l cp s
0.100000 slw
0 slc
0 slj
[] 0 sd
0.850980 0.850980 0.803922 srgb
n 26.033333 18.538889 m 26.033333 18.650000 l 27.366667 18.650000 l 27.366667 18.538889 l f
0.000000 0.000000 0.000000 srgb
n 26.033333 18.538889 m 26.033333 18.650000 l 27.366667 18.650000 l 27.366667 18.538889 l cp s
0.010000 slw
0 slc
0 slj
[] 0 sd
n 26.033333 18.538889 m 26.033333 18.650000 l 27.366667 18.650000 l 27.366667 18.538889 l cp s
0.100000 slw
[] 0 sd
[] 0 sd
0 slc
0 slj
0 slc
0 slj
[] 0 sd
1.000000 1.000000 1.000000 srgb
n 15.726060 10.043657 m 15.036489 10.021781 13.699141 10.481189 13.887206 11.465635 c 14.075269 12.450081 14.973801 12.668838 15.349931 12.384452 c 15.726060 12.100056 14.764840 13.762667 16.603696 14.200199 c 18.442536 14.637731 19.382860 13.937680 19.111211 13.434519 c 18.839562 12.931357 20.720210 14.615854 21.597846 13.653285 c 22.475482 12.690715 20.699314 11.771907 21.075444 11.903167 c 21.451573 12.034426 22.600859 11.859414 22.224729 10.218670 c 21.848599 8.577927 18.463432 9.846768 18.839562 9.606126 c 19.215691 9.365483 18.275367 8.162269 17.105203 8.402912 c 15.935021 8.643556 15.852022 9.080235 15.726645 10.042804 c 15.726060 10.043657 l f
0.000000 0.000000 0.000000 srgb
n 15.726060 10.043657 m 15.036489 10.021781 13.699141 10.481189 13.887206 11.465635 c 14.075269 12.450081 14.973801 12.668838 15.349931 12.384452 c 15.726060 12.100056 14.764840 13.762667 16.603696 14.200199 c 18.442536 14.637731 19.382860 13.937680 19.111211 13.434519 c 18.839562 12.931357 20.720210 14.615854 21.597846 13.653285 c 22.475482 12.690715 20.699314 11.771907 21.075444 11.903167 c 21.451573 12.034426 22.600859 11.859414 22.224729 10.218670 c 21.848599 8.577927 18.463432 9.846768 18.839562 9.606126 c 19.215691 9.365483 18.275367 8.162269 17.105203 8.402912 c 15.935021 8.643556 15.852022 9.080235 15.726645 10.042804 c 15.726060 10.043657 l s
/Courier-latin1 ff 0.800000 scf sf
() dup sw 2 div 18.388624 ex sub 10.948631 m gs 1 -1 sc sh gr
(Internet) dup sw 2 div 18.388624 ex sub 11.748631 m gs 1 -1 sc sh gr
() dup sw 2 div 18.388624 ex sub 12.548631 m gs 1 -1 sc sh gr
0.100000 slw
[] 0 sd
[] 0 sd
0 slc
0 slj
0 slc
0 slj
[] 0 sd
0.850980 0.850980 0.803922 srgb
n 1.550000 17.425000 m 1.550000 18.675000 l 6.550000 18.675000 l 6.550000 17.425000 l f
0.000000 0.000000 0.000000 srgb
n 1.550000 17.425000 m 1.550000 18.675000 l 6.550000 18.675000 l 6.550000 17.425000 l cp s
0.010000 slw
0 slc
0 slj
[] 0 sd
n 1.550000 17.425000 m 1.550000 18.675000 l 6.550000 18.675000 l 6.550000 17.425000 l cp s
0 slc
0 slj
[] 0 sd
n 2.425000 17.925000 m 2.300000 18.050000 l s
0 slc
0 slj
[] 0 sd
n 2.300000 18.050000 m 2.425000 18.175000 l s
0 slc
0 slj
[] 0 sd
n 2.925000 17.925000 m 2.800000 18.050000 l s
0 slc
0 slj
[] 0 sd
n 2.800000 18.050000 m 2.925000 18.175000 l s
0 slc
0 slj
[] 0 sd
n 3.425000 17.925000 m 3.300000 18.050000 l s
0 slc
0 slj
[] 0 sd
n 3.300000 18.050000 m 3.425000 18.175000 l s
0 slc
0 slj
[] 0 sd
n 3.925000 17.925000 m 3.800000 18.050000 l s
0 slc
0 slj
[] 0 sd
n 3.800000 18.050000 m 3.925000 18.175000 l s
0 slc
0 slj
[] 0 sd
n 4.425000 17.925000 m 4.300000 18.050000 l s
0 slc
0 slj
[] 0 sd
n 4.300000 18.050000 m 4.425000 18.175000 l s
0 slc
0 slj
[] 0 sd
n 4.925000 17.925000 m 4.800000 18.050000 l s
0 slc
0 slj
[] 0 sd
n 4.800000 18.050000 m 4.925000 18.175000 l s
0 slc
0 slj
[] 0 sd
n 5.425000 17.925000 m 5.300000 18.050000 l s
0 slc
0 slj
[] 0 sd
n 5.300000 18.050000 m 5.425000 18.175000 l s
0 slc
0 slj
[] 0 sd
n 5.925000 17.925000 m 5.800000 18.050000 l s
0 slc
0 slj
[] 0 sd
n 5.800000 18.050000 m 5.925000 18.175000 l s
0 slc
0 slj
[] 0 sd
n 6.175000 18.300000 m 6.050000 18.425000 l s
0 slc
0 slj
[] 0 sd
n 6.050000 18.425000 m 6.175000 18.550000 l s
0 slc
0 slj
[] 0 sd
n 5.675000 18.300000 m 5.550000 18.425000 l s
0 slc
0 slj
[] 0 sd
n 5.550000 18.425000 m 5.675000 18.550000 l s
0 slc
0 slj
[] 0 sd
n 5.175000 18.300000 m 5.050000 18.425000 l s
0 slc
0 slj
[] 0 sd
n 5.050000 18.425000 m 5.175000 18.550000 l s
0 slc
0 slj
[] 0 sd
n 4.675000 18.300000 m 4.550000 18.425000 l s
0 slc
0 slj
[] 0 sd
n 4.550000 18.425000 m 4.675000 18.550000 l s
0 slc
0 slj
[] 0 sd
n 4.175000 18.300000 m 4.050000 18.425000 l s
0 slc
0 slj
[] 0 sd
n 4.050000 18.425000 m 4.175000 18.550000 l s
0 slc
0 slj
[] 0 sd
n 3.675000 18.300000 m 3.550000 18.425000 l s
0 slc
0 slj
[] 0 sd
n 3.550000 18.425000 m 3.675000 18.550000 l s
0 slc
0 slj
[] 0 sd
n 3.175000 18.300000 m 3.050000 18.425000 l s
0 slc
0 slj
[] 0 sd
n 3.050000 18.425000 m 3.175000 18.550000 l s
0.100000 slw
0 slc
0 slj
[] 0 sd
0.850980 0.850980 0.803922 srgb
n 2.425000 18.425000 m 2.425000 18.550000 l 2.925000 18.550000 l 2.925000 18.425000 l f
0.000000 0.000000 0.000000 srgb
n 2.425000 18.425000 m 2.425000 18.550000 l 2.925000 18.550000 l 2.925000 18.425000 l cp s
0.010000 slw
0 slc
0 slj
[] 0 sd
n 2.425000 18.425000 m 2.425000 18.550000 l 2.925000 18.550000 l 2.925000 18.425000 l cp s
0.100000 slw
0 slc
0 slj
[] 0 sd
0.803922 0.803922 0.803922 srgb
n 1.925000 18.050000 m 2.175000 18.300000 l 1.925000 18.550000 l 1.675000 18.300000 l f
0.000000 0.000000 0.000000 srgb
n 1.925000 18.050000 m 2.175000 18.300000 l 1.925000 18.550000 l 1.675000 18.300000 l cp s
0.010000 slw
0 slc
0 slj
[] 0 sd
n 1.925000 18.050000 m 2.175000 18.300000 l 1.925000 18.550000 l 1.675000 18.300000 l cp s
0.100000 slw
0 slc
0 slj
[] 0 sd
0.850980 0.850980 0.803922 srgb
n 1.550000 17.675000 m 1.550000 17.800000 l 6.550000 17.800000 l 6.550000 17.675000 l f
0.000000 0.000000 0.000000 srgb
n 1.550000 17.675000 m 1.550000 17.800000 l 6.550000 17.800000 l 6.550000 17.675000 l cp s
0.010000 slw
0 slc
0 slj
[] 0 sd
n 1.550000 17.675000 m 1.550000 17.800000 l 6.550000 17.800000 l 6.550000 17.675000 l cp s
0.100000 slw
0 slc
0 slj
[] 0 sd
0.803922 0.803922 0.803922 srgb
n 2.175000 17.675000 m 2.175000 17.800000 l 3.300000 17.800000 l 3.300000 17.675000 l f
0.000000 0.000000 0.000000 srgb
n 2.175000 17.675000 m 2.175000 17.800000 l 3.300000 17.800000 l 3.300000 17.675000 l cp s
0.010000 slw
0 slc
0 slj
[] 0 sd
n 2.175000 17.675000 m 2.175000 17.800000 l 3.300000 17.800000 l 3.300000 17.675000 l cp s
0.080000 slw
0 slj
[] 0 sd
0.700000 0.700000 0.700000 srgb
n 5.650000 11.680000 m 5.650000 12.730000 l 9.150000 12.730000 l 9.150000 11.680000 l f
0.000000 0.000000 0.000000 srgb
n 5.650000 11.680000 m 5.650000 12.730000 l 9.150000 12.730000 l 9.150000 11.680000 l cp s
n 6.000000 12.205000 m 6.000000 12.373000 l 6.175000 12.373000 l 6.175000 12.205000 l f
n 6.000000 12.205000 m 6.000000 12.373000 l 6.175000 12.373000 l 6.175000 12.205000 l cp s
n 6.350000 12.205000 m 6.350000 12.373000 l 6.525000 12.373000 l 6.525000 12.205000 l f
n 6.350000 12.205000 m 6.350000 12.373000 l 6.525000 12.373000 l 6.525000 12.205000 l cp s
n 6.700000 12.205000 m 6.700000 12.373000 l 6.875000 12.373000 l 6.875000 12.205000 l f
n 6.700000 12.205000 m 6.700000 12.373000 l 6.875000 12.373000 l 6.875000 12.205000 l cp s
n 7.050000 12.205000 m 7.050000 12.373000 l 7.225000 12.373000 l 7.225000 12.205000 l f
n 7.050000 12.205000 m 7.050000 12.373000 l 7.225000 12.373000 l 7.225000 12.205000 l cp s
n 7.400000 12.205000 m 7.400000 12.373000 l 7.575000 12.373000 l 7.575000 12.205000 l f
n 7.400000 12.205000 m 7.400000 12.373000 l 7.575000 12.373000 l 7.575000 12.205000 l cp s
n 7.750000 12.205000 m 7.750000 12.373000 l 7.925000 12.373000 l 7.925000 12.205000 l f
n 7.750000 12.205000 m 7.750000 12.373000 l 7.925000 12.373000 l 7.925000 12.205000 l cp s
n 8.100000 12.205000 m 8.100000 12.373000 l 8.275000 12.373000 l 8.275000 12.205000 l f
n 8.100000 12.205000 m 8.100000 12.373000 l 8.275000 12.373000 l 8.275000 12.205000 l cp s
n 8.450000 12.205000 m 8.450000 12.373000 l 8.625000 12.373000 l 8.625000 12.205000 l f
n 8.450000 12.205000 m 8.450000 12.373000 l 8.625000 12.373000 l 8.625000 12.205000 l cp s
0.080000 slw
0 slj
[] 0 sd
0.700000 0.700000 0.700000 srgb
n 26.985000 11.525000 m 26.985000 12.575000 l 30.485000 12.575000 l 30.485000 11.525000 l f
0.000000 0.000000 0.000000 srgb
n 26.985000 11.525000 m 26.985000 12.575000 l 30.485000 12.575000 l 30.485000 11.525000 l cp s
n 27.335000 12.050000 m 27.335000 12.218000 l 27.510000 12.218000 l 27.510000 12.050000 l f
n 27.335000 12.050000 m 27.335000 12.218000 l 27.510000 12.218000 l 27.510000 12.050000 l cp s
n 27.685000 12.050000 m 27.685000 12.218000 l 27.860000 12.218000 l 27.860000 12.050000 l f
n 27.685000 12.050000 m 27.685000 12.218000 l 27.860000 12.218000 l 27.860000 12.050000 l cp s
n 28.035000 12.050000 m 28.035000 12.218000 l 28.210000 12.218000 l 28.210000 12.050000 l f
n 28.035000 12.050000 m 28.035000 12.218000 l 28.210000 12.218000 l 28.210000 12.050000 l cp s
n 28.385000 12.050000 m 28.385000 12.218000 l 28.560000 12.218000 l 28.560000 12.050000 l f
n 28.385000 12.050000 m 28.385000 12.218000 l 28.560000 12.218000 l 28.560000 12.050000 l cp s
n 28.735000 12.050000 m 28.735000 12.218000 l 28.910000 12.218000 l 28.910000 12.050000 l f
n 28.735000 12.050000 m 28.735000 12.218000 l 28.910000 12.218000 l 28.910000 12.050000 l cp s
n 29.085000 12.050000 m 29.085000 12.218000 l 29.260000 12.218000 l 29.260000 12.050000 l f
n 29.085000 12.050000 m 29.085000 12.218000 l 29.260000 12.218000 l 29.260000 12.050000 l cp s
n 29.435000 12.050000 m 29.435000 12.218000 l 29.610000 12.218000 l 29.610000 12.050000 l f
n 29.435000 12.050000 m 29.435000 12.218000 l 29.610000 12.218000 l 29.610000 12.050000 l cp s
n 29.785000 12.050000 m 29.785000 12.218000 l 29.960000 12.218000 l 29.960000 12.050000 l f
n 29.785000 12.050000 m 29.785000 12.218000 l 29.960000 12.218000 l 29.960000 12.050000 l cp s
0.100000 slw
[] 0 sd
[] 0 sd
0 slc
n 8.537500 12.289000 m 11.200000 12.300000 l s
0.100000 slw
[] 0 sd
[] 0 sd
0 slc
n 7.837500 12.289000 m 7.850000 18.100000 l s
0.100000 slw
[] 0 sd
[] 0 sd
0 slc
n 6.550000 18.050000 m 7.850000 18.050000 l s
0.100000 slw
[] 0 sd
[] 0 sd
0 slc
n 6.087500 12.289000 m 3.600000 12.300000 l s
0.100000 slw
[] 0 sd
[] 0 sd
0 slc
n 3.650000 10.175000 m 3.650000 12.300000 l s
0.100000 slw
[] 0 sd
[] 0 sd
0 slc
n 27.422500 12.134000 m 25.500000 12.150000 l s
0.100000 slw
[] 0 sd
[] 0 sd
0 slc
n 29.172500 12.134000 m 29.150000 15.600000 l s
0.080000 slw
0 slj
[] 0 sd
0.700000 0.700000 0.700000 srgb
n 7.332800 6.567000 m 7.229600 6.610000 l 6.920000 7.384000 l 6.920000 7.771000 l 7.074800 7.900000 l 9.345200 7.900000 l 9.500000 7.771000 l 9.500000 7.384000 l 9.190400 6.610000 l 9.087200 6.567000 l f
0.000000 0.000000 0.000000 srgb
n 7.332800 6.567000 m 7.229600 6.610000 l 6.920000 7.384000 l 6.920000 7.771000 l 7.074800 7.900000 l 9.345200 7.900000 l 9.500000 7.771000 l 9.500000 7.384000 l 9.190400 6.610000 l 9.087200 6.567000 l cp s
n 6.920000 7.384000 m 7.074800 7.298000 l s
n 6.971600 7.255000 m 7.074800 7.298000 l s
n 9.345200 7.298000 m 7.074800 7.298000 l s
n 9.345200 7.298000 m 9.448400 7.255000 l s
n 9.345200 7.298000 m 9.500000 7.384000 l s
1.000000 1.000000 1.000000 srgb
n 7.642400 5.750000 m 7.590800 6.782000 l 8.829200 6.782000 l 8.777600 5.750000 l f
0.000000 0.000000 0.000000 srgb
n 7.642400 5.750000 m 7.590800 6.782000 l 8.829200 6.782000 l 8.777600 5.750000 l cp s
n 7.436000 6.782000 m 7.332800 7.083000 l 9.087200 7.083000 l 8.984000 6.782000 l f
n 7.436000 6.782000 m 7.332800 7.083000 l 9.087200 7.083000 l 8.984000 6.782000 l cp s
0.020000 slw
0.000000 1.000000 0.000000 srgb
n 7.436000 7.448500 0.025800 0.025800 0 360 ellipse f
0.000000 0.000000 0.000000 srgb
n 7.436000 7.448500 0.025800 0.025800 0 360 ellipse cp s
0.000000 1.000000 0.000000 srgb
n 7.436000 7.556000 0.025800 0.025800 0 360 ellipse f
0.000000 0.000000 0.000000 srgb
n 7.436000 7.556000 0.025800 0.025800 0 360 ellipse cp s
0.000000 1.000000 0.000000 srgb
n 7.436000 7.663500 0.025800 0.025800 0 360 ellipse f
0.000000 0.000000 0.000000 srgb
n 7.436000 7.663500 0.025800 0.025800 0 360 ellipse cp s
0.000000 1.000000 0.000000 srgb
n 7.436000 7.771000 0.025800 0.025800 0 360 ellipse f
0.000000 0.000000 0.000000 srgb
n 7.436000 7.771000 0.025800 0.025800 0 360 ellipse cp s
0.000000 1.000000 0.000000 srgb
n 7.694000 7.448500 0.025800 0.025800 0 360 ellipse f
0.000000 0.000000 0.000000 srgb
n 7.694000 7.448500 0.025800 0.025800 0 360 ellipse cp s
0.000000 1.000000 0.000000 srgb
n 7.694000 7.556000 0.025800 0.025800 0 360 ellipse f
0.000000 0.000000 0.000000 srgb
n 7.694000 7.556000 0.025800 0.025800 0 360 ellipse cp s
0.000000 1.000000 0.000000 srgb
n 7.694000 7.663500 0.025800 0.025800 0 360 ellipse f
0.000000 0.000000 0.000000 srgb
n 7.694000 7.663500 0.025800 0.025800 0 360 ellipse cp s
0.000000 1.000000 0.000000 srgb
n 7.694000 7.771000 0.025800 0.025800 0 360 ellipse f
0.000000 0.000000 0.000000 srgb
n 7.694000 7.771000 0.025800 0.025800 0 360 ellipse cp s
0.560000 0.560000 0.560000 srgb
n 8.210000 7.470000 0.161250 0.051600 0 360 ellipse f
0.000000 0.000000 0.000000 srgb
n 8.210000 7.470000 0.161250 0.051600 0 360 ellipse cp s
0.560000 0.560000 0.560000 srgb
n 8.855000 7.470000 0.161250 0.051600 0 360 ellipse f
0.000000 0.000000 0.000000 srgb
n 8.855000 7.470000 0.161250 0.051600 0 360 ellipse cp s
0.100000 slw
[] 0 sd
[] 0 sd
0 slc
n 8.187500 12.289000 m 8.210000 7.900000 l s
0.100000 slw
[] 0 sd
[] 0 sd
0 slc
n 29.872500 12.134000 m 32.200000 12.150000 l s
/Courier-latin1 ff 0.600000 scf sf
(192.168.2.0/24) dup sw 2 div 6.900000 ex sub 11.400000 m gs 1 -1 sc sh gr
/Courier-latin1 ff 0.600000 scf sf
(192.168.4.0/24) dup sw 2 div 28.200000 ex sub 10.700000 m gs 1 -1 sc sh gr
0.100000 slw
[] 0 sd
[] 0 sd
0 slc
n 13.865325 11.304230 m 12.650000 11.300000 l s
0.100000 slw
[] 0 sd
[] 0 sd
0 slc
n 22.295441 10.833918 m 23.950000 10.850000 l s
/Courier-latin1 ff 0.600000 scf sf
(lisa.dyndns.org) dup sw 2 div 12.000000 ex sub 9.000000 m gs 1 -1 sc sh gr
/Courier-latin1 ff 0.600000 scf sf
(rainer.dyndns.org) dup sw 2 div 24.650000 ex sub 9.050000 m gs 1 -1 sc sh gr
/Courier-latin1 ff 0.600000 scf sf
(192.168.2.254) dup sw 2 div 10.350000 ex sub 13.950000 m gs 1 -1 sc sh gr
/Courier-latin1 ff 0.600000 scf sf
(192.168.4.254) dup sw 2 div 26.250000 ex sub 13.900000 m gs 1 -1 sc sh gr
/Courier-latin1 ff 0.700000 scf sf
(Left Subnet) dup sw 2 div 3.250000 ex sub 13.700000 m gs 1 -1 sc sh gr
/Courier-latin1 ff 0.700000 scf sf
(Right Subnet) dup sw 2 div 26.250000 ex sub 6.900000 m gs 1 -1 sc sh gr
0.100000 slw
[] 0 sd
[] 0 sd
0 slc
0 slj
0 slc
0 slj
[] 0 sd
0.850980 0.850980 0.803922 srgb
n 32.300000 11.150000 m 32.300000 13.150000 l 34.300000 13.150000 l 34.300000 11.150000 l f
0.000000 0.000000 0.000000 srgb
n 32.300000 11.150000 m 32.300000 13.150000 l 34.300000 13.150000 l 34.300000 11.150000 l cp s
0.100000 slw
0 slc
0 slj
[] 0 sd
n 32.300000 11.150000 m 32.300000 13.150000 l 34.300000 13.150000 l 34.300000 11.150000 l cp s
0.100000 slw
0 slc
0 slj
[] 0 sd
0.803922 0.803922 0.803922 srgb
n 32.433333 11.283333 m 32.433333 12.083333 l 34.166667 12.083333 l 34.166667 11.283333 l f
0.000000 0.000000 0.000000 srgb
n 32.433333 11.283333 m 32.433333 12.083333 l 34.166667 12.083333 l 34.166667 11.283333 l cp s
0.100000 slw
0 slc
0 slj
[] 0 sd
n 32.433333 11.283333 m 32.433333 12.083333 l 34.166667 12.083333 l 34.166667 11.283333 l cp s
0.100000 slw
0 slc
0 slj
[] 0 sd
0.701961 0.701961 0.701961 srgb
n 32.566667 11.416667 m 32.566667 11.683333 l 34.033333 11.683333 l 34.033333 11.416667 l f
0.000000 0.000000 0.000000 srgb
n 32.566667 11.416667 m 32.566667 11.683333 l 34.033333 11.683333 l 34.033333 11.416667 l cp s
0.100000 slw
0 slc
0 slj
[] 0 sd
n 32.566667 11.416667 m 32.566667 11.683333 l 34.033333 11.683333 l 34.033333 11.416667 l cp s
0.100000 slw
0 slc
0 slj
[] 0 sd
0.203922 1.000000 0.203922 srgb
n 33.966667 12.750000 m 33.966667 12.883333 l 34.166667 12.883333 l 34.166667 12.750000 l f
0.000000 0.000000 0.000000 srgb
n 33.966667 12.750000 m 33.966667 12.883333 l 34.166667 12.883333 l 34.166667 12.750000 l cp s
0.100000 slw
0 slc
0 slj
[] 0 sd
n 33.966667 12.750000 m 33.966667 12.883333 l 34.166667 12.883333 l 34.166667 12.750000 l cp s
0.100000 slw
0 slc
0 slj
[] 0 sd
0.203922 0.203922 0.203922 srgb
n 33.833333 11.883333 m 33.833333 11.950000 l 34.033333 11.950000 l 34.033333 11.883333 l f
0.000000 0.000000 0.000000 srgb
n 33.833333 11.883333 m 33.833333 11.950000 l 34.033333 11.950000 l 34.033333 11.883333 l cp s
0.100000 slw
0 slc
0 slj
[] 0 sd
n 33.833333 11.883333 m 33.833333 11.950000 l 34.033333 11.950000 l 34.033333 11.883333 l cp s
0.100000 slw
0 slc
0 slj
[] 0 sd
0.803922 0.803922 0.101961 srgb
n 32.566667 11.883333 m 32.566667 11.950000 l 32.700000 11.950000 l 32.700000 11.883333 l f
0.000000 0.000000 0.000000 srgb
n 32.566667 11.883333 m 32.566667 11.950000 l 32.700000 11.950000 l 32.700000 11.883333 l cp s
0.100000 slw
0 slc
0 slj
[] 0 sd
n 32.300000 12.216667 m 34.300000 12.216667 l s
0 slc
0 slj
[] 0 sd
n 32.500000 11.750000 m 34.100000 11.750000 l s
0 slc
0 slj
[] 0 sd
n 34.100000 11.816667 m 32.500000 11.816667 l s
0 slc
0 slj
[] 0 sd
n 32.500000 11.883333 m 34.100000 11.883333 l s
0 slc
0 slj
[] 0 sd
n 34.100000 11.950000 m 32.500000 11.950000 l s
0 slc
0 slj
[] 0 sd
n 32.500000 12.016667 m 34.100000 12.016667 l s
/Courier-latin1 ff 0.600000 scf sf
(202.38.21.24) dup sw 2 div 12.150000 ex sub 8.400000 m gs 1 -1 sc sh gr
/Courier-latin1 ff 0.600000 scf sf
(62.137.15.134) dup sw 2 div 24.600000 ex sub 8.500000 m gs 1 -1 sc sh gr
0.100000 slw
[] 0 sd
[] 0 sd
0 slc
n 29.522500 12.134000 m 29.500000 9.700000 l s
/Courier-latin1 ff 0.700000 scf sf
(Öffentliches) dup sw 2 div 18.100000 ex sub 5.250000 m gs 1 -1 sc sh gr
(unsicheres) dup sw 2 div 18.100000 ex sub 5.950000 m gs 1 -1 sc sh gr
(IP-Netzwerk) dup sw 2 div 18.100000 ex sub 6.650000 m gs 1 -1 sc sh gr
showpage
