%!PS-Adobe-2.0 EPSF-2.0
%%Title: /data/SharedFiles/skripten/linuxskript_module/tcp-ip/bilder/ARP-poison3.dia
%%Creator: Dia v0.94
%%CreationDate: Tue Apr 18 05:53:53 2006
%%For: dirk
%%Orientation: Portrait
%%Magnification: 1.0000
%%BoundingBox: 0 0 517 308
%%BeginSetup
%%EndSetup
%%EndComments
%%BeginProlog
[ /.notdef /.notdef /.notdef /.notdef /.notdef /.notdef /.notdef /.notdef /.notdef /.notdef
/.notdef /.notdef /.notdef /.notdef /.notdef /.notdef /.notdef /.notdef /.notdef /.notdef
/.notdef /.notdef /.notdef /.notdef /.notdef /.notdef /.notdef /.notdef /.notdef /.notdef
/.notdef /.notdef /space /exclam /quotedbl /numbersign /dollar /percent /ampersand /quoteright
/parenleft /parenright /asterisk /plus /comma /hyphen /period /slash /zero /one
/two /three /four /five /six /seven /eight /nine /colon /semicolon
/less /equal /greater /question /at /A /B /C /D /E
/F /G /H /I /J /K /L /M /N /O
/P /Q /R /S /T /U /V /W /X /Y
/Z /bracketleft /backslash /bracketright /asciicircum /underscore /quoteleft /a /b /c
/d /e /f /g /h /i /j /k /l /m
/n /o /p /q /r /s /t /u /v /w
/x /y /z /braceleft /bar /braceright /asciitilde /.notdef /.notdef /.notdef
/.notdef /.notdef /.notdef /.notdef /.notdef /.notdef /.notdef /.notdef /.notdef /.notdef
/.notdef /.notdef /.notdef /.notdef /.notdef /.notdef /.notdef /.notdef /.notdef /.notdef
/.notdef /.notdef /.notdef /.notdef /.notdef /.notdef /.notdef /.notdef /.notdef /.notdef
/space /exclamdown /cent /sterling /currency /yen /brokenbar /section /dieresis /copyright
/ordfeminine /guillemotleft /logicalnot /hyphen /registered /macron /degree /plusminus /twosuperior /threesuperior
/acute /mu /paragraph /periodcentered /cedilla /onesuperior /ordmasculine /guillemotright /onequarter /onehalf
/threequarters /questiondown /Agrave /Aacute /Acircumflex /Atilde /Adieresis /Aring /AE /Ccedilla
/Egrave /Eacute /Ecircumflex /Edieresis /Igrave /Iacute /Icircumflex /Idieresis /Eth /Ntilde
/Ograve /Oacute /Ocircumflex /Otilde /Odieresis /multiply /Oslash /Ugrave /Uacute /Ucircumflex
/Udieresis /Yacute /Thorn /germandbls /agrave /aacute /acircumflex /atilde /adieresis /aring
/ae /ccedilla /egrave /eacute /ecircumflex /edieresis /igrave /iacute /icircumflex /idieresis
/eth /ntilde /ograve /oacute /ocircumflex /otilde /odieresis /divide /oslash /ugrave
/uacute /ucircumflex /udieresis /yacute /thorn /ydieresis] /isolatin1encoding exch def
/cp {closepath} bind def
/c {curveto} bind def
/f {fill} bind def
/a {arc} bind def
/ef {eofill} bind def
/ex {exch} bind def
/gr {grestore} bind def
/gs {gsave} bind def
/sa {save} bind def
/rs {restore} bind def
/l {lineto} bind def
/m {moveto} bind def
/rm {rmoveto} bind def
/n {newpath} bind def
/s {stroke} bind def
/sh {show} bind def
/slc {setlinecap} bind def
/slj {setlinejoin} bind def
/slw {setlinewidth} bind def
/srgb {setrgbcolor} bind def
/rot {rotate} bind def
/sc {scale} bind def
/sd {setdash} bind def
/ff {findfont} bind def
/sf {setfont} bind def
/scf {scalefont} bind def
/sw {stringwidth pop} bind def
/tr {translate} bind def

/ellipsedict 8 dict def
ellipsedict /mtrx matrix put
/ellipse
{ ellipsedict begin
   /endangle exch def
   /startangle exch def
   /yrad exch def
   /xrad exch def
   /y exch def
   /x exch def   /savematrix mtrx currentmatrix def
   x y tr xrad yrad sc
   0 0 1 startangle endangle arc
   savematrix setmatrix
   end
} def

/mergeprocs {
dup length
3 -1 roll
dup
length
dup
5 1 roll
3 -1 roll
add
array cvx
dup
3 -1 roll
0 exch
putinterval
dup
4 2 roll
putinterval
} bind def
/Times-Roman-latin1
    /Times-Roman findfont
    dup length dict begin
	{1 index /FID ne {def} {pop pop} ifelse} forall
	/Encoding isolatin1encoding def
    currentdict end
definefont pop
/Times-Italic-latin1
    /Times-Italic findfont
    dup length dict begin
	{1 index /FID ne {def} {pop pop} ifelse} forall
	/Encoding isolatin1encoding def
    currentdict end
definefont pop
/Times-Bold-latin1
    /Times-Bold findfont
    dup length dict begin
	{1 index /FID ne {def} {pop pop} ifelse} forall
	/Encoding isolatin1encoding def
    currentdict end
definefont pop
/Times-BoldItalic-latin1
    /Times-BoldItalic findfont
    dup length dict begin
	{1 index /FID ne {def} {pop pop} ifelse} forall
	/Encoding isolatin1encoding def
    currentdict end
definefont pop
/AvantGarde-Book-latin1
    /AvantGarde-Book findfont
    dup length dict begin
	{1 index /FID ne {def} {pop pop} ifelse} forall
	/Encoding isolatin1encoding def
    currentdict end
definefont pop
/AvantGarde-BookOblique-latin1
    /AvantGarde-BookOblique findfont
    dup length dict begin
	{1 index /FID ne {def} {pop pop} ifelse} forall
	/Encoding isolatin1encoding def
    currentdict end
definefont pop
/AvantGarde-Demi-latin1
    /AvantGarde-Demi findfont
    dup length dict begin
	{1 index /FID ne {def} {pop pop} ifelse} forall
	/Encoding isolatin1encoding def
    currentdict end
definefont pop
/AvantGarde-DemiOblique-latin1
    /AvantGarde-DemiOblique findfont
    dup length dict begin
	{1 index /FID ne {def} {pop pop} ifelse} forall
	/Encoding isolatin1encoding def
    currentdict end
definefont pop
/Bookman-Light-latin1
    /Bookman-Light findfont
    dup length dict begin
	{1 index /FID ne {def} {pop pop} ifelse} forall
	/Encoding isolatin1encoding def
    currentdict end
definefont pop
/Bookman-LightItalic-latin1
    /Bookman-LightItalic findfont
    dup length dict begin
	{1 index /FID ne {def} {pop pop} ifelse} forall
	/Encoding isolatin1encoding def
    currentdict end
definefont pop
/Bookman-Demi-latin1
    /Bookman-Demi findfont
    dup length dict begin
	{1 index /FID ne {def} {pop pop} ifelse} forall
	/Encoding isolatin1encoding def
    currentdict end
definefont pop
/Bookman-DemiItalic-latin1
    /Bookman-DemiItalic findfont
    dup length dict begin
	{1 index /FID ne {def} {pop pop} ifelse} forall
	/Encoding isolatin1encoding def
    currentdict end
definefont pop
/Courier-latin1
    /Courier findfont
    dup length dict begin
	{1 index /FID ne {def} {pop pop} ifelse} forall
	/Encoding isolatin1encoding def
    currentdict end
definefont pop
/Courier-Oblique-latin1
    /Courier-Oblique findfont
    dup length dict begin
	{1 index /FID ne {def} {pop pop} ifelse} forall
	/Encoding isolatin1encoding def
    currentdict end
definefont pop
/Courier-Bold-latin1
    /Courier-Bold findfont
    dup length dict begin
	{1 index /FID ne {def} {pop pop} ifelse} forall
	/Encoding isolatin1encoding def
    currentdict end
definefont pop
/Courier-BoldOblique-latin1
    /Courier-BoldOblique findfont
    dup length dict begin
	{1 index /FID ne {def} {pop pop} ifelse} forall
	/Encoding isolatin1encoding def
    currentdict end
definefont pop
/Helvetica-latin1
    /Helvetica findfont
    dup length dict begin
	{1 index /FID ne {def} {pop pop} ifelse} forall
	/Encoding isolatin1encoding def
    currentdict end
definefont pop
/Helvetica-Oblique-latin1
    /Helvetica-Oblique findfont
    dup length dict begin
	{1 index /FID ne {def} {pop pop} ifelse} forall
	/Encoding isolatin1encoding def
    currentdict end
definefont pop
/Helvetica-Bold-latin1
    /Helvetica-Bold findfont
    dup length dict begin
	{1 index /FID ne {def} {pop pop} ifelse} forall
	/Encoding isolatin1encoding def
    currentdict end
definefont pop
/Helvetica-BoldOblique-latin1
    /Helvetica-BoldOblique findfont
    dup length dict begin
	{1 index /FID ne {def} {pop pop} ifelse} forall
	/Encoding isolatin1encoding def
    currentdict end
definefont pop
/Helvetica-Narrow-latin1
    /Helvetica-Narrow findfont
    dup length dict begin
	{1 index /FID ne {def} {pop pop} ifelse} forall
	/Encoding isolatin1encoding def
    currentdict end
definefont pop
/Helvetica-Narrow-Oblique-latin1
    /Helvetica-Narrow-Oblique findfont
    dup length dict begin
	{1 index /FID ne {def} {pop pop} ifelse} forall
	/Encoding isolatin1encoding def
    currentdict end
definefont pop
/Helvetica-Narrow-Bold-latin1
    /Helvetica-Narrow-Bold findfont
    dup length dict begin
	{1 index /FID ne {def} {pop pop} ifelse} forall
	/Encoding isolatin1encoding def
    currentdict end
definefont pop
/Helvetica-Narrow-BoldOblique-latin1
    /Helvetica-Narrow-BoldOblique findfont
    dup length dict begin
	{1 index /FID ne {def} {pop pop} ifelse} forall
	/Encoding isolatin1encoding def
    currentdict end
definefont pop
/NewCenturySchoolbook-Roman-latin1
    /NewCenturySchoolbook-Roman findfont
    dup length dict begin
	{1 index /FID ne {def} {pop pop} ifelse} forall
	/Encoding isolatin1encoding def
    currentdict end
definefont pop
/NewCenturySchoolbook-Italic-latin1
    /NewCenturySchoolbook-Italic findfont
    dup length dict begin
	{1 index /FID ne {def} {pop pop} ifelse} forall
	/Encoding isolatin1encoding def
    currentdict end
definefont pop
/NewCenturySchoolbook-Bold-latin1
    /NewCenturySchoolbook-Bold findfont
    dup length dict begin
	{1 index /FID ne {def} {pop pop} ifelse} forall
	/Encoding isolatin1encoding def
    currentdict end
definefont pop
/NewCenturySchoolbook-BoldItalic-latin1
    /NewCenturySchoolbook-BoldItalic findfont
    dup length dict begin
	{1 index /FID ne {def} {pop pop} ifelse} forall
	/Encoding isolatin1encoding def
    currentdict end
definefont pop
/Palatino-Roman-latin1
    /Palatino-Roman findfont
    dup length dict begin
	{1 index /FID ne {def} {pop pop} ifelse} forall
	/Encoding isolatin1encoding def
    currentdict end
definefont pop
/Palatino-Italic-latin1
    /Palatino-Italic findfont
    dup length dict begin
	{1 index /FID ne {def} {pop pop} ifelse} forall
	/Encoding isolatin1encoding def
    currentdict end
definefont pop
/Palatino-Bold-latin1
    /Palatino-Bold findfont
    dup length dict begin
	{1 index /FID ne {def} {pop pop} ifelse} forall
	/Encoding isolatin1encoding def
    currentdict end
definefont pop
/Palatino-BoldItalic-latin1
    /Palatino-BoldItalic findfont
    dup length dict begin
	{1 index /FID ne {def} {pop pop} ifelse} forall
	/Encoding isolatin1encoding def
    currentdict end
definefont pop
/Symbol-latin1
    /Symbol findfont
definefont pop
/ZapfChancery-MediumItalic-latin1
    /ZapfChancery-MediumItalic findfont
    dup length dict begin
	{1 index /FID ne {def} {pop pop} ifelse} forall
	/Encoding isolatin1encoding def
    currentdict end
definefont pop
/ZapfDingbats-latin1
    /ZapfDingbats findfont
    dup length dict begin
	{1 index /FID ne {def} {pop pop} ifelse} forall
	/Encoding isolatin1encoding def
    currentdict end
definefont pop
28.346000 -28.346000 scale
-8.950000 -16.805359 translate
%%EndProlog


0.150000 slw
[] 0 sd
[] 0 sd
0 slc
0 slj
0.120000 slw
0 slc
0 slj
[] 0 sd
0.701961 0.701961 0.701961 srgb
n 9.294258 6.000000 m 9.294258 9.433014 l 10.765550 9.433014 l 10.765550 6.000000 l f
0.000000 0.000000 0.000000 srgb
n 9.294258 6.000000 m 9.294258 9.433014 l 10.765550 9.433014 l 10.765550 6.000000 l cp s
0.015000 slw
0 slc
0 slj
[] 0 sd
n 9.441388 6.205981 m 9.441388 6.598325 l 10.618421 6.598325 l 10.618421 6.205981 l cp s
0 slc
0 slj
[] 0 sd
n 9.441388 6.598325 m 9.441388 6.990670 l 10.618421 6.990670 l 10.618421 6.598325 l cp s
0 slc
0 slj
[] 0 sd
n 9.441388 6.990670 m 9.441388 7.383014 l 10.618421 7.383014 l 10.618421 6.990670 l cp s
0 slc
0 slj
[] 0 sd
n 9.441388 7.383014 m 9.441388 7.775359 l 10.618421 7.775359 l 10.618421 7.383014 l cp s
0 slc
0 slj
[] 0 sd
n 9.441388 7.853828 m 9.441388 8.089234 l 10.177033 8.089234 l 10.177033 7.853828 l cp s
0 slc
0 slj
[] 0 sd
0.000000 1.000000 0.000000 srgb
n 10.544856 7.893062 0.051495 0.051495 0 360 ellipse f
0.000000 0.000000 0.000000 srgb
n 10.544856 7.893062 0.051495 0.051495 0 360 ellipse cp s
0 slc
0 slj
[] 0 sd
1.000000 1.000000 0.000000 srgb
n 10.544856 8.050000 0.051495 0.051495 0 360 ellipse f
0.000000 0.000000 0.000000 srgb
n 10.544856 8.050000 0.051495 0.051495 0 360 ellipse cp s
0 slc
0 slj
[] 0 sd
1.000000 1.000000 1.000000 srgb
n 10.250598 7.932297 m 10.250598 8.089234 l 10.427153 8.089234 l 10.427153 7.932297 l f
0.000000 0.000000 0.000000 srgb
n 10.250598 7.932297 m 10.250598 8.089234 l 10.427153 8.089234 l 10.427153 7.932297 l cp s
0 slc
0 slj
[] 0 sd
n 9.539474 8.403110 m 9.539474 9.261364 l s
0 slc
0 slj
[] 0 sd
n 9.784689 8.403110 m 9.784689 9.261364 l s
0 slc
0 slj
[] 0 sd
n 10.029904 8.403110 m 10.029904 9.261364 l s
0 slc
0 slj
[] 0 sd
n 10.275120 8.403110 m 10.275120 9.261364 l s
0 slc
0 slj
[] 0 sd
n 10.520335 8.403110 m 10.520335 9.261364 l s
0 slc
0 slj
[] 0 sd
n 10.765550 8.403110 m 10.765550 9.261364 l s
0 slc
0 slj
[] 0 sd
0.600000 0.600000 0.600000 srgb
n 9.000000 9.727273 m 9.294258 9.138756 l 9.294258 9.433014 l 10.765550 9.433014 l 10.765550 9.138756 l 11.157895 9.727273 l ef
0.000000 0.000000 0.000000 srgb
n 9.000000 9.727273 m 9.294258 9.138756 l 9.294258 9.433014 l 10.765550 9.433014 l 10.765550 9.138756 l 11.157895 9.727273 l cp s
/Helvetica-latin1 ff 0.560000 scf sf
0.150000 slw
[] 0 sd
[] 0 sd
0 slc
0 slj
0.120000 slw
0 slc
0 slj
[] 0 sd
0.701961 0.701961 0.701961 srgb
n 25.294258 6.000000 m 25.294258 9.433014 l 26.765550 9.433014 l 26.765550 6.000000 l f
0.000000 0.000000 0.000000 srgb
n 25.294258 6.000000 m 25.294258 9.433014 l 26.765550 9.433014 l 26.765550 6.000000 l cp s
0.015000 slw
0 slc
0 slj
[] 0 sd
n 25.441388 6.205981 m 25.441388 6.598325 l 26.618421 6.598325 l 26.618421 6.205981 l cp s
0 slc
0 slj
[] 0 sd
n 25.441388 6.598325 m 25.441388 6.990670 l 26.618421 6.990670 l 26.618421 6.598325 l cp s
0 slc
0 slj
[] 0 sd
n 25.441388 6.990670 m 25.441388 7.383014 l 26.618421 7.383014 l 26.618421 6.990670 l cp s
0 slc
0 slj
[] 0 sd
n 25.441388 7.383014 m 25.441388 7.775359 l 26.618421 7.775359 l 26.618421 7.383014 l cp s
0 slc
0 slj
[] 0 sd
n 25.441388 7.853828 m 25.441388 8.089234 l 26.177033 8.089234 l 26.177033 7.853828 l cp s
0 slc
0 slj
[] 0 sd
0.000000 1.000000 0.000000 srgb
n 26.544856 7.893062 0.051495 0.051495 0 360 ellipse f
0.000000 0.000000 0.000000 srgb
n 26.544856 7.893062 0.051495 0.051495 0 360 ellipse cp s
0 slc
0 slj
[] 0 sd
1.000000 1.000000 0.000000 srgb
n 26.544856 8.050000 0.051495 0.051495 0 360 ellipse f
0.000000 0.000000 0.000000 srgb
n 26.544856 8.050000 0.051495 0.051495 0 360 ellipse cp s
0 slc
0 slj
[] 0 sd
1.000000 1.000000 1.000000 srgb
n 26.250598 7.932297 m 26.250598 8.089234 l 26.427153 8.089234 l 26.427153 7.932297 l f
0.000000 0.000000 0.000000 srgb
n 26.250598 7.932297 m 26.250598 8.089234 l 26.427153 8.089234 l 26.427153 7.932297 l cp s
0 slc
0 slj
[] 0 sd
n 25.539474 8.403110 m 25.539474 9.261364 l s
0 slc
0 slj
[] 0 sd
n 25.784689 8.403110 m 25.784689 9.261364 l s
0 slc
0 slj
[] 0 sd
n 26.029904 8.403110 m 26.029904 9.261364 l s
0 slc
0 slj
[] 0 sd
n 26.275120 8.403110 m 26.275120 9.261364 l s
0 slc
0 slj
[] 0 sd
n 26.520335 8.403110 m 26.520335 9.261364 l s
0 slc
0 slj
[] 0 sd
n 26.765550 8.403110 m 26.765550 9.261364 l s
0 slc
0 slj
[] 0 sd
0.600000 0.600000 0.600000 srgb
n 25.000000 9.727273 m 25.294258 9.138756 l 25.294258 9.433014 l 26.765550 9.433014 l 26.765550 9.138756 l 27.157895 9.727273 l ef
0.000000 0.000000 0.000000 srgb
n 25.000000 9.727273 m 25.294258 9.138756 l 25.294258 9.433014 l 26.765550 9.433014 l 26.765550 9.138756 l 27.157895 9.727273 l cp s
/Helvetica-latin1 ff 0.560000 scf sf
0.100000 slw
[] 0 sd
0 slc
n 8.950000 11.000000 m 27.050000 11.000000 l s
n 11.571400 11.000000 m 11.571400 12.000000 l s
n 10.078900 11.000000 m 10.078900 9.727270 l s
n 16.714300 11.000000 m 16.714300 12.000000 l s
n 17.800000 11.000000 m 17.800000 10.490000 l s
n 21.857100 11.000000 m 21.857100 12.000000 l s
n 26.078900 11.000000 m 26.078900 9.727270 l s
/Helvetica-latin1 ff 0.840000 scf sf
(A) 11.500000 9.950000 m gs 1 -1 sc sh gr
/Helvetica-latin1 ff 0.840000 scf sf
(B) 24.100000 9.900000 m gs 1 -1 sc sh gr
/Helvetica-latin1 ff 0.630000 scf sf
(10.8.4.1) 11.000000 9.000000 m gs 1 -1 sc sh gr
/Helvetica-latin1 ff 0.630000 scf sf
(10.8.4.2) 22.100000 8.950000 m gs 1 -1 sc sh gr
0.150000 slw
[] 0 sd
[] 0 sd
0 slc
0 slj
0.120000 slw
0 slc
0 slj
[] 0 sd
0.701961 0.701961 0.701961 srgb
n 15.891358 12.030000 m 15.891358 15.463014 l 17.362650 15.463014 l 17.362650 12.030000 l f
0.000000 0.000000 0.000000 srgb
n 15.891358 12.030000 m 15.891358 15.463014 l 17.362650 15.463014 l 17.362650 12.030000 l cp s
0.015000 slw
0 slc
0 slj
[] 0 sd
n 16.038488 12.235981 m 16.038488 12.628325 l 17.215521 12.628325 l 17.215521 12.235981 l cp s
0 slc
0 slj
[] 0 sd
n 16.038488 12.628325 m 16.038488 13.020670 l 17.215521 13.020670 l 17.215521 12.628325 l cp s
0 slc
0 slj
[] 0 sd
n 16.038488 13.020670 m 16.038488 13.413014 l 17.215521 13.413014 l 17.215521 13.020670 l cp s
0 slc
0 slj
[] 0 sd
n 16.038488 13.413014 m 16.038488 13.805359 l 17.215521 13.805359 l 17.215521 13.413014 l cp s
0 slc
0 slj
[] 0 sd
n 16.038488 13.883828 m 16.038488 14.119234 l 16.774133 14.119234 l 16.774133 13.883828 l cp s
0 slc
0 slj
[] 0 sd
0.000000 1.000000 0.000000 srgb
n 17.141956 13.923062 0.051495 0.051495 0 360 ellipse f
0.000000 0.000000 0.000000 srgb
n 17.141956 13.923062 0.051495 0.051495 0 360 ellipse cp s
0 slc
0 slj
[] 0 sd
1.000000 1.000000 0.000000 srgb
n 17.141956 14.080000 0.051495 0.051495 0 360 ellipse f
0.000000 0.000000 0.000000 srgb
n 17.141956 14.080000 0.051495 0.051495 0 360 ellipse cp s
0 slc
0 slj
[] 0 sd
1.000000 1.000000 1.000000 srgb
n 16.847698 13.962297 m 16.847698 14.119234 l 17.024253 14.119234 l 17.024253 13.962297 l f
0.000000 0.000000 0.000000 srgb
n 16.847698 13.962297 m 16.847698 14.119234 l 17.024253 14.119234 l 17.024253 13.962297 l cp s
0 slc
0 slj
[] 0 sd
n 16.136574 14.433110 m 16.136574 15.291364 l s
0 slc
0 slj
[] 0 sd
n 16.381789 14.433110 m 16.381789 15.291364 l s
0 slc
0 slj
[] 0 sd
n 16.627004 14.433110 m 16.627004 15.291364 l s
0 slc
0 slj
[] 0 sd
n 16.872220 14.433110 m 16.872220 15.291364 l s
0 slc
0 slj
[] 0 sd
n 17.117435 14.433110 m 17.117435 15.291364 l s
0 slc
0 slj
[] 0 sd
n 17.362650 14.433110 m 17.362650 15.291364 l s
0 slc
0 slj
[] 0 sd
0.600000 0.600000 0.600000 srgb
n 15.597100 15.757273 m 15.891358 15.168756 l 15.891358 15.463014 l 17.362650 15.463014 l 17.362650 15.168756 l 17.754995 15.757273 l ef
0.000000 0.000000 0.000000 srgb
n 15.597100 15.757273 m 15.891358 15.168756 l 15.891358 15.463014 l 17.362650 15.463014 l 17.362650 15.168756 l 17.754995 15.757273 l cp s
/Helvetica-latin1 ff 0.560000 scf sf
/Helvetica-latin1 ff 0.840000 scf sf
(P) 18.235000 15.020000 m gs 1 -1 sc sh gr
/Helvetica-latin1 ff 0.630000 scf sf
(10.8.4.50) 17.485000 14.220000 m gs 1 -1 sc sh gr
0.150000 slw
[] 0 sd
[] 0 sd
0 slj
0 slc
n 17.850000 13.122295 m 17.850000 12.340000 l 26.600000 12.340000 l 26.600000 10.407705 l s
[] 0 sd
0 slj
0 slc
n 17.850000 13.422295 m 17.650000 13.022295 l 17.850000 13.122295 l 18.050000 13.022295 l ef
n 17.850000 13.422295 m 17.650000 13.022295 l 17.850000 13.122295 l 18.050000 13.022295 l cp s
[] 0 sd
0 slj
0 slc
n 26.600000 10.107705 m 26.800000 10.507705 l 26.600000 10.407705 l 26.400000 10.507705 l ef
n 26.600000 10.107705 m 26.800000 10.507705 l 26.600000 10.407705 l 26.400000 10.507705 l cp s
0.150000 slw
[] 0 sd
[] 0 sd
0 slj
0 slc
n 15.250000 13.122295 m 15.250000 12.340000 l 9.500000 12.340000 l 9.500000 10.457705 l s
[] 0 sd
0 slj
0 slc
n 15.250000 13.422295 m 15.050000 13.022295 l 15.250000 13.122295 l 15.450000 13.022295 l ef
n 15.250000 13.422295 m 15.050000 13.022295 l 15.250000 13.122295 l 15.450000 13.022295 l cp s
[] 0 sd
0 slj
0 slc
n 9.500000 10.157705 m 9.700000 10.557705 l 9.500000 10.457705 l 9.300000 10.557705 l ef
n 9.500000 10.157705 m 9.700000 10.557705 l 9.500000 10.457705 l 9.300000 10.557705 l cp s
/Helvetica-latin1 ff 0.560000 scf sf
(00:b0:11:11:11:11) 11.035000 8.070000 m gs 1 -1 sc sh gr
/Helvetica-latin1 ff 0.560000 scf sf
(00:b0:11:22:22:22) 19.500000 8.140000 m gs 1 -1 sc sh gr
/Helvetica-latin1 ff 0.560000 scf sf
(00:b0:11:33:33:33) 18.200000 15.640000 m gs 1 -1 sc sh gr
/Helvetica-latin1 ff 0.560000 scf sf
(IP-Kommunikation) 15.000000 9.490000 m gs 1 -1 sc sh gr
(10.8.4.1 <-> 10.8.4.2 ) 15.000000 10.290000 m gs 1 -1 sc sh gr
/Helvetica-latin1 ff 0.560000 scf sf
(Paketlaufzeit1) 9.950000 13.240000 m gs 1 -1 sc sh gr
/Helvetica-latin1 ff 0.560000 scf sf
(Paketlaufzeit2) 22.050000 13.140000 m gs 1 -1 sc sh gr
/Helvetica-latin1 ff 0.560000 scf sf
(Hop-Count: TTL-1) 9.800000 15.040000 m gs 1 -1 sc sh gr
showpage
