%!PS-Adobe-2.0 EPSF-2.0
%%Title: ARP-Broadcast.dia
%%Creator: Dia v0.94
%%CreationDate: Tue Mar  7 12:01:56 2006
%%For: dirk
%%Orientation: Portrait
%%Magnification: 1.0000
%%BoundingBox: 0 0 409 205
%%BeginSetup
%%EndSetup
%%EndComments
%%BeginProlog
[ /.notdef /.notdef /.notdef /.notdef /.notdef /.notdef /.notdef /.notdef /.notdef /.notdef
/.notdef /.notdef /.notdef /.notdef /.notdef /.notdef /.notdef /.notdef /.notdef /.notdef
/.notdef /.notdef /.notdef /.notdef /.notdef /.notdef /.notdef /.notdef /.notdef /.notdef
/.notdef /.notdef /space /exclam /quotedbl /numbersign /dollar /percent /ampersand /quoteright
/parenleft /parenright /asterisk /plus /comma /hyphen /period /slash /zero /one
/two /three /four /five /six /seven /eight /nine /colon /semicolon
/less /equal /greater /question /at /A /B /C /D /E
/F /G /H /I /J /K /L /M /N /O
/P /Q /R /S /T /U /V /W /X /Y
/Z /bracketleft /backslash /bracketright /asciicircum /underscore /quoteleft /a /b /c
/d /e /f /g /h /i /j /k /l /m
/n /o /p /q /r /s /t /u /v /w
/x /y /z /braceleft /bar /braceright /asciitilde /.notdef /.notdef /.notdef
/.notdef /.notdef /.notdef /.notdef /.notdef /.notdef /.notdef /.notdef /.notdef /.notdef
/.notdef /.notdef /.notdef /.notdef /.notdef /.notdef /.notdef /.notdef /.notdef /.notdef
/.notdef /.notdef /.notdef /.notdef /.notdef /.notdef /.notdef /.notdef /.notdef /.notdef
/space /exclamdown /cent /sterling /currency /yen /brokenbar /section /dieresis /copyright
/ordfeminine /guillemotleft /logicalnot /hyphen /registered /macron /degree /plusminus /twosuperior /threesuperior
/acute /mu /paragraph /periodcentered /cedilla /onesuperior /ordmasculine /guillemotright /onequarter /onehalf
/threequarters /questiondown /Agrave /Aacute /Acircumflex /Atilde /Adieresis /Aring /AE /Ccedilla
/Egrave /Eacute /Ecircumflex /Edieresis /Igrave /Iacute /Icircumflex /Idieresis /Eth /Ntilde
/Ograve /Oacute /Ocircumflex /Otilde /Odieresis /multiply /Oslash /Ugrave /Uacute /Ucircumflex
/Udieresis /Yacute /Thorn /germandbls /agrave /aacute /acircumflex /atilde /adieresis /aring
/ae /ccedilla /egrave /eacute /ecircumflex /edieresis /igrave /iacute /icircumflex /idieresis
/eth /ntilde /ograve /oacute /ocircumflex /otilde /odieresis /divide /oslash /ugrave
/uacute /ucircumflex /udieresis /yacute /thorn /ydieresis] /isolatin1encoding exch def
/cp {closepath} bind def
/c {curveto} bind def
/f {fill} bind def
/a {arc} bind def
/ef {eofill} bind def
/ex {exch} bind def
/gr {grestore} bind def
/gs {gsave} bind def
/sa {save} bind def
/rs {restore} bind def
/l {lineto} bind def
/m {moveto} bind def
/rm {rmoveto} bind def
/n {newpath} bind def
/s {stroke} bind def
/sh {show} bind def
/slc {setlinecap} bind def
/slj {setlinejoin} bind def
/slw {setlinewidth} bind def
/srgb {setrgbcolor} bind def
/rot {rotate} bind def
/sc {scale} bind def
/sd {setdash} bind def
/ff {findfont} bind def
/sf {setfont} bind def
/scf {scalefont} bind def
/sw {stringwidth pop} bind def
/tr {translate} bind def

/ellipsedict 8 dict def
ellipsedict /mtrx matrix put
/ellipse
{ ellipsedict begin
   /endangle exch def
   /startangle exch def
   /yrad exch def
   /xrad exch def
   /y exch def
   /x exch def   /savematrix mtrx currentmatrix def
   x y tr xrad yrad sc
   0 0 1 startangle endangle arc
   savematrix setmatrix
   end
} def

/mergeprocs {
dup length
3 -1 roll
dup
length
dup
5 1 roll
3 -1 roll
add
array cvx
dup
3 -1 roll
0 exch
putinterval
dup
4 2 roll
putinterval
} bind def
/dpi_x 300 def
/dpi_y 300 def
/conicto {
    /to_y exch def
    /to_x exch def
    /conic_cntrl_y exch def
    /conic_cntrl_x exch def
    currentpoint
    /p0_y exch def
    /p0_x exch def
    /p1_x p0_x conic_cntrl_x p0_x sub 2 3 div mul add def
    /p1_y p0_y conic_cntrl_y p0_y sub 2 3 div mul add def
    /p2_x p1_x to_x p0_x sub 1 3 div mul add def
    /p2_y p1_y to_y p0_y sub 1 3 div mul add def
    p1_x p1_y p2_x p2_y to_x to_y curveto
} bind def
/start_ol { gsave 1.1 dpi_x div dup scale} bind def
/end_ol { closepath fill grestore } bind def
28,346000 -28,346000 scale
-9,625000 -13,100000 translate
%%EndProlog


0,150000 slw
[] 0 sd
[] 0 sd
0 slc
0 slj
0,120000 slw
0 slc
0 slj
[] 0 sd
0,701961 0,701961 0,701961 srgb
n 19,294258 5,950000 m 19,294258 9,383014 l 20,765550 9,383014 l 20,765550 5,950000 l f
0,000000 0,000000 0,000000 srgb
n 19,294258 5,950000 m 19,294258 9,383014 l 20,765550 9,383014 l 20,765550 5,950000 l cp s
0,015000 slw
0 slc
0 slj
[] 0 sd
n 19,441388 6,155981 m 19,441388 6,548325 l 20,618421 6,548325 l 20,618421 6,155981 l cp s
0 slc
0 slj
[] 0 sd
n 19,441388 6,548325 m 19,441388 6,940670 l 20,618421 6,940670 l 20,618421 6,548325 l cp s
0 slc
0 slj
[] 0 sd
n 19,441388 6,940670 m 19,441388 7,333014 l 20,618421 7,333014 l 20,618421 6,940670 l cp s
0 slc
0 slj
[] 0 sd
n 19,441388 7,333014 m 19,441388 7,725359 l 20,618421 7,725359 l 20,618421 7,333014 l cp s
0 slc
0 slj
[] 0 sd
n 19,441388 7,803828 m 19,441388 8,039234 l 20,177033 8,039234 l 20,177033 7,803828 l cp s
0 slc
0 slj
[] 0 sd
0,000000 1,000000 0,000000 srgb
n 20,544856 7,843062 0,051495 0,051495 0 360 ellipse f
0,000000 0,000000 0,000000 srgb
n 20,544856 7,843062 0,051495 0,051495 0 360 ellipse cp s
0 slc
0 slj
[] 0 sd
1,000000 1,000000 0,000000 srgb
n 20,544856 8,000000 0,051495 0,051495 0 360 ellipse f
0,000000 0,000000 0,000000 srgb
n 20,544856 8,000000 0,051495 0,051495 0 360 ellipse cp s
0 slc
0 slj
[] 0 sd
1,000000 1,000000 1,000000 srgb
n 20,250598 7,882297 m 20,250598 8,039234 l 20,427153 8,039234 l 20,427153 7,882297 l f
0,000000 0,000000 0,000000 srgb
n 20,250598 7,882297 m 20,250598 8,039234 l 20,427153 8,039234 l 20,427153 7,882297 l cp s
0 slc
0 slj
[] 0 sd
n 19,539474 8,353110 m 19,539474 9,211364 l s
0 slc
0 slj
[] 0 sd
n 19,784689 8,353110 m 19,784689 9,211364 l s
0 slc
0 slj
[] 0 sd
n 20,029904 8,353110 m 20,029904 9,211364 l s
0 slc
0 slj
[] 0 sd
n 20,275120 8,353110 m 20,275120 9,211364 l s
0 slc
0 slj
[] 0 sd
n 20,520335 8,353110 m 20,520335 9,211364 l s
0 slc
0 slj
[] 0 sd
n 20,765550 8,353110 m 20,765550 9,211364 l s
0 slc
0 slj
[] 0 sd
0,600000 0,600000 0,600000 srgb
n 19,000000 9,677273 m 19,294258 9,088756 l 19,294258 9,383014 l 20,765550 9,383014 l 20,765550 9,088756 l 21,157895 9,677273 l ef
0,000000 0,000000 0,000000 srgb
n 19,000000 9,677273 m 19,294258 9,088756 l 19,294258 9,383014 l 20,765550 9,383014 l 20,765550 9,088756 l 21,157895 9,677273 l cp s
0,150000 slw
[] 0 sd
[] 0 sd
0 slc
0 slj
0,120000 slw
0 slc
0 slj
[] 0 sd
0,701961 0,701961 0,701961 srgb
n 10,294258 6,000000 m 10,294258 9,433014 l 11,765550 9,433014 l 11,765550 6,000000 l f
0,000000 0,000000 0,000000 srgb
n 10,294258 6,000000 m 10,294258 9,433014 l 11,765550 9,433014 l 11,765550 6,000000 l cp s
0,015000 slw
0 slc
0 slj
[] 0 sd
n 10,441388 6,205981 m 10,441388 6,598325 l 11,618421 6,598325 l 11,618421 6,205981 l cp s
0 slc
0 slj
[] 0 sd
n 10,441388 6,598325 m 10,441388 6,990670 l 11,618421 6,990670 l 11,618421 6,598325 l cp s
0 slc
0 slj
[] 0 sd
n 10,441388 6,990670 m 10,441388 7,383014 l 11,618421 7,383014 l 11,618421 6,990670 l cp s
0 slc
0 slj
[] 0 sd
n 10,441388 7,383014 m 10,441388 7,775359 l 11,618421 7,775359 l 11,618421 7,383014 l cp s
0 slc
0 slj
[] 0 sd
n 10,441388 7,853828 m 10,441388 8,089234 l 11,177033 8,089234 l 11,177033 7,853828 l cp s
0 slc
0 slj
[] 0 sd
0,000000 1,000000 0,000000 srgb
n 11,544856 7,893062 0,051495 0,051495 0 360 ellipse f
0,000000 0,000000 0,000000 srgb
n 11,544856 7,893062 0,051495 0,051495 0 360 ellipse cp s
0 slc
0 slj
[] 0 sd
1,000000 1,000000 0,000000 srgb
n 11,544856 8,050000 0,051495 0,051495 0 360 ellipse f
0,000000 0,000000 0,000000 srgb
n 11,544856 8,050000 0,051495 0,051495 0 360 ellipse cp s
0 slc
0 slj
[] 0 sd
1,000000 1,000000 1,000000 srgb
n 11,250598 7,932297 m 11,250598 8,089234 l 11,427153 8,089234 l 11,427153 7,932297 l f
0,000000 0,000000 0,000000 srgb
n 11,250598 7,932297 m 11,250598 8,089234 l 11,427153 8,089234 l 11,427153 7,932297 l cp s
0 slc
0 slj
[] 0 sd
n 10,539474 8,403110 m 10,539474 9,261364 l s
0 slc
0 slj
[] 0 sd
n 10,784689 8,403110 m 10,784689 9,261364 l s
0 slc
0 slj
[] 0 sd
n 11,029904 8,403110 m 11,029904 9,261364 l s
0 slc
0 slj
[] 0 sd
n 11,275120 8,403110 m 11,275120 9,261364 l s
0 slc
0 slj
[] 0 sd
n 11,520335 8,403110 m 11,520335 9,261364 l s
0 slc
0 slj
[] 0 sd
n 11,765550 8,403110 m 11,765550 9,261364 l s
0 slc
0 slj
[] 0 sd
0,600000 0,600000 0,600000 srgb
n 10,000000 9,727273 m 10,294258 9,138756 l 10,294258 9,433014 l 11,765550 9,433014 l 11,765550 9,138756 l 12,157895 9,727273 l ef
0,000000 0,000000 0,000000 srgb
n 10,000000 9,727273 m 10,294258 9,138756 l 10,294258 9,433014 l 11,765550 9,433014 l 11,765550 9,138756 l 12,157895 9,727273 l cp s
0,100000 slw
[] 0 sd
0 slc
n 9,950000 11,000000 m 22,050000 11,000000 l s
n 11,714300 11,000000 m 11,714300 12,000000 l s
n 11,078900 11,000000 m 11,078900 9,727270 l s
n 11,725000 11,000000 m 11,725000 12,040000 l s
n 20,078900 11,000000 m 20,078900 9,677270 l s
n 18,571400 11,000000 m 18,571400 12,000000 l s
n 21,000000 11,000000 m 21,000000 12,000000 l s
gsave 12,150000 7,800000 translate 0,035278 -0,035278 scale
start_ol
5261 0 moveto
3927 0 lineto
3581 1018 lineto
1727 1018 lineto
1381 0 lineto
81 0 lineto
1928 5037 lineto
3413 5037 lineto
5261 0 lineto
3269 1942 moveto
2654 3748 lineto
2039 1942 lineto
3269 1942 lineto
end_ol grestore 
gsave 21,350000 7,750000 translate 0,035278 -0,035278 scale
start_ol
4928 1540 moveto
4928 1174 4782 887 conicto
4637 601 4383 412 conicto
4089 189 3736 94 conicto
3383 0 2841 0 conicto
667 0 lineto
667 5026 lineto
2606 5026 lineto
3209 5026 3489 4985 conicto
3769 4945 4044 4806 conicto
4329 4662 4468 4417 conicto
4608 4172 4608 3859 conicto
4608 3493 4410 3215 conicto
4212 2937 3851 2781 conicto
3851 2754 lineto
4348 2656 4638 2349 conicto
4928 2043 4928 1540 conicto
3287 3592 moveto
3287 3719 3224 3847 conicto
3161 3975 3000 4037 conicto
2856 4092 2642 4097 conicto
2429 4102 2043 4102 conicto
1920 4102 lineto
1920 3015 lineto
2125 3015 lineto
2436 3015 2655 3025 conicto
2874 3035 3000 3094 conicto
3178 3173 3232 3299 conicto
3287 3425 3287 3592 conicto
3591 1564 moveto
3591 1804 3498 1934 conicto
3405 2064 3182 2129 conicto
3029 2173 2762 2176 conicto
2495 2180 2204 2180 conicto
1920 2180 lineto
1920 923 lineto
2015 923 lineto
2563 923 2799 926 conicto
3036 930 3235 1015 conicto
3439 1099 3515 1239 conicto
3591 1380 3591 1564 conicto
end_ol grestore 
gsave 12,100000 6,750000 translate 0,035278 -0,035278 scale
start_ol
2735 -13 moveto
704 -13 lineto
704 395 lineto
1500 395 lineto
1500 2880 lineto
704 2880 lineto
704 3223 lineto
866 3223 1050 3249 conicto
1235 3276 1330 3326 conicto
1448 3389 1516 3486 conicto
1584 3583 1594 3747 conicto
1984 3747 lineto
1984 395 lineto
2735 395 lineto
2735 -13 lineto
end_ol grestore 
gsave 12,531800 6,750000 translate 0,035278 -0,035278 scale
start_ol
2921 1886 moveto
2921 873 2607 399 conicto
2293 -74 1632 -74 conicto
962 -74 652 405 conicto
343 885 343 1880 conicto
343 2883 656 3361 conicto
969 3840 1632 3840 conicto
2303 3840 2612 3354 conicto
2921 2868 2921 1886 conicto
2278 732 moveto
2368 938 2400 1216 conicto
2432 1494 2432 1886 conicto
2432 2272 2400 2556 conicto
2368 2840 2275 3039 conicto
2186 3234 2030 3333 conicto
1875 3432 1632 3432 conicto
1391 3432 1233 3333 conicto
1075 3234 983 3034 conicto
896 2845 864 2543 conicto
832 2241 832 1880 conicto
832 1484 860 1217 conicto
888 951 981 740 conicto
1065 542 1220 438 conicto
1376 334 1632 334 conicto
1873 334 2032 433 conicto
2191 532 2278 732 conicto
end_ol grestore 
gsave 12,963600 6,750000 translate 0,035278 -0,035278 scale
start_ol
1240 0 moveto
637 0 lineto
637 718 lineto
1240 718 lineto
1240 0 lineto
end_ol grestore 
gsave 13,209133 6,750000 translate 0,035278 -0,035278 scale
start_ol
2944 1050 moveto
2944 560 2571 236 conicto
2198 -88 1632 -88 conicto
1032 -88 676 228 conicto
320 545 320 1040 conicto
320 1354 494 1608 conicto
668 1862 984 2012 conicto
984 2027 lineto
690 2189 548 2381 conicto
407 2574 407 2864 conicto
407 3289 756 3572 conicto
1106 3856 1644 3856 conicto
2208 3856 2544 3585 conicto
2880 3314 2880 2896 conicto
2880 2641 2723 2394 conicto
2566 2147 2260 2007 conicto
2260 1992 lineto
2593 1840 2768 1617 conicto
2944 1394 2944 1050 conicto
2391 2867 moveto
2391 3133 2178 3290 conicto
1965 3448 1636 3448 conicto
1310 3448 1103 3299 conicto
896 3151 896 2898 conicto
896 2719 1000 2589 conicto
1105 2459 1316 2356 conicto
1411 2312 1590 2240 conicto
1770 2168 1940 2121 conicto
2195 2284 2293 2460 conicto
2391 2637 2391 2867 conicto
2455 1017 moveto
2455 1246 2352 1383 conicto
2250 1521 1952 1660 conicto
1832 1715 1690 1761 conicto
1549 1808 1313 1893 conicto
1085 1772 947 1563 conicto
809 1354 809 1091 conicto
809 756 1044 538 conicto
1280 320 1642 320 conicto
2012 320 2233 506 conicto
2455 692 2455 1017 conicto
end_ol grestore 
gsave 13,640933 6,750000 translate 0,035278 -0,035278 scale
start_ol
1240 0 moveto
637 0 lineto
637 718 lineto
1240 718 lineto
1240 0 lineto
end_ol grestore 
gsave 13,886467 6,750000 translate 0,035278 -0,035278 scale
start_ol
3030 1064 moveto
2473 1064 lineto
2473 0 lineto
1984 0 lineto
1984 1064 lineto
188 1064 lineto
188 1641 lineto
2009 3752 lineto
2473 3752 lineto
2473 1472 lineto
3030 1472 lineto
3030 1064 lineto
1984 1472 moveto
1984 3156 lineto
531 1472 lineto
1984 1472 lineto
end_ol grestore 
gsave 14,318267 6,750000 translate 0,035278 -0,035278 scale
start_ol
1240 0 moveto
637 0 lineto
637 718 lineto
1240 718 lineto
1240 0 lineto
end_ol grestore 
gsave 14,563800 6,750000 translate 0,035278 -0,035278 scale
start_ol
2735 -13 moveto
704 -13 lineto
704 395 lineto
1500 395 lineto
1500 2880 lineto
704 2880 lineto
704 3223 lineto
866 3223 1050 3249 conicto
1235 3276 1330 3326 conicto
1448 3389 1516 3486 conicto
1584 3583 1594 3747 conicto
1984 3747 lineto
1984 395 lineto
2735 395 lineto
2735 -13 lineto
end_ol grestore 
gsave 21,100000 6,750000 translate 0,035278 -0,035278 scale
start_ol
2735 -13 moveto
704 -13 lineto
704 395 lineto
1500 395 lineto
1500 2880 lineto
704 2880 lineto
704 3223 lineto
866 3223 1050 3249 conicto
1235 3276 1330 3326 conicto
1448 3389 1516 3486 conicto
1584 3583 1594 3747 conicto
1984 3747 lineto
1984 395 lineto
2735 395 lineto
2735 -13 lineto
end_ol grestore 
gsave 21,531800 6,750000 translate 0,035278 -0,035278 scale
start_ol
2921 1886 moveto
2921 873 2607 399 conicto
2293 -74 1632 -74 conicto
962 -74 652 405 conicto
343 885 343 1880 conicto
343 2883 656 3361 conicto
969 3840 1632 3840 conicto
2303 3840 2612 3354 conicto
2921 2868 2921 1886 conicto
2278 732 moveto
2368 938 2400 1216 conicto
2432 1494 2432 1886 conicto
2432 2272 2400 2556 conicto
2368 2840 2275 3039 conicto
2186 3234 2030 3333 conicto
1875 3432 1632 3432 conicto
1391 3432 1233 3333 conicto
1075 3234 983 3034 conicto
896 2845 864 2543 conicto
832 2241 832 1880 conicto
832 1484 860 1217 conicto
888 951 981 740 conicto
1065 542 1220 438 conicto
1376 334 1632 334 conicto
1873 334 2032 433 conicto
2191 532 2278 732 conicto
end_ol grestore 
gsave 21,963600 6,750000 translate 0,035278 -0,035278 scale
start_ol
1240 0 moveto
637 0 lineto
637 718 lineto
1240 718 lineto
1240 0 lineto
end_ol grestore 
gsave 22,209133 6,750000 translate 0,035278 -0,035278 scale
start_ol
2944 1050 moveto
2944 560 2571 236 conicto
2198 -88 1632 -88 conicto
1032 -88 676 228 conicto
320 545 320 1040 conicto
320 1354 494 1608 conicto
668 1862 984 2012 conicto
984 2027 lineto
690 2189 548 2381 conicto
407 2574 407 2864 conicto
407 3289 756 3572 conicto
1106 3856 1644 3856 conicto
2208 3856 2544 3585 conicto
2880 3314 2880 2896 conicto
2880 2641 2723 2394 conicto
2566 2147 2260 2007 conicto
2260 1992 lineto
2593 1840 2768 1617 conicto
2944 1394 2944 1050 conicto
2391 2867 moveto
2391 3133 2178 3290 conicto
1965 3448 1636 3448 conicto
1310 3448 1103 3299 conicto
896 3151 896 2898 conicto
896 2719 1000 2589 conicto
1105 2459 1316 2356 conicto
1411 2312 1590 2240 conicto
1770 2168 1940 2121 conicto
2195 2284 2293 2460 conicto
2391 2637 2391 2867 conicto
2455 1017 moveto
2455 1246 2352 1383 conicto
2250 1521 1952 1660 conicto
1832 1715 1690 1761 conicto
1549 1808 1313 1893 conicto
1085 1772 947 1563 conicto
809 1354 809 1091 conicto
809 756 1044 538 conicto
1280 320 1642 320 conicto
2012 320 2233 506 conicto
2455 692 2455 1017 conicto
end_ol grestore 
gsave 22,640933 6,750000 translate 0,035278 -0,035278 scale
start_ol
1240 0 moveto
637 0 lineto
637 718 lineto
1240 718 lineto
1240 0 lineto
end_ol grestore 
gsave 22,886467 6,750000 translate 0,035278 -0,035278 scale
start_ol
3030 1064 moveto
2473 1064 lineto
2473 0 lineto
1984 0 lineto
1984 1064 lineto
188 1064 lineto
188 1641 lineto
2009 3752 lineto
2473 3752 lineto
2473 1472 lineto
3030 1472 lineto
3030 1064 lineto
1984 1472 moveto
1984 3156 lineto
531 1472 lineto
1984 1472 lineto
end_ol grestore 
gsave 23,318267 6,750000 translate 0,035278 -0,035278 scale
start_ol
1240 0 moveto
637 0 lineto
637 718 lineto
1240 718 lineto
1240 0 lineto
end_ol grestore 
gsave 23,563800 6,750000 translate 0,035278 -0,035278 scale
start_ol
2944 0 moveto
405 0 lineto
405 527 lineto
674 753 944 979 conicto
1215 1206 1448 1430 conicto
1940 1899 2122 2175 conicto
2304 2451 2304 2769 conicto
2304 3062 2107 3227 conicto
1911 3392 1561 3392 conicto
1328 3392 1056 3311 conicto
785 3230 525 3062 conicto
500 3062 lineto
500 3573 lineto
679 3659 978 3729 conicto
1278 3800 1558 3800 conicto
2137 3800 2465 3522 conicto
2793 3244 2793 2769 conicto
2793 2556 2738 2370 conicto
2684 2185 2578 2020 conicto
2481 1864 2349 1713 conicto
2217 1562 2028 1378 conicto
1759 1115 1472 867 conicto
1186 619 936 408 conicto
2944 408 lineto
2944 0 lineto
end_ol grestore 
0,150000 slw
[] 0 sd
[] 0 sd
0 slc
n 11,550000 10,450000 m 21,382295 10,450000 l s
[] 0 sd
0 slj
0 slc
n 21,682295 10,450000 m 21,282295 10,650000 l 21,382295 10,450000 l 21,282295 10,250000 l ef
n 21,682295 10,450000 m 21,282295 10,650000 l 21,382295 10,450000 l 21,282295 10,250000 l cp s
0,150000 slw
[] 0 sd
[] 0 sd
0 slc
n 10,700000 10,450000 m 10,167705 10,450000 l s
[] 0 sd
0 slj
0 slc
n 9,867705 10,450000 m 10,267705 10,250000 l 10,167705 10,450000 l 10,267705 10,650000 l ef
n 9,867705 10,450000 m 10,267705 10,250000 l 10,167705 10,450000 l 10,267705 10,650000 l cp s
0,150000 slw
[] 0 sd
[] 0 sd
0 slc
n 11,100000 11,350000 m 11,100000 11,882295 l s
[] 0 sd
0 slj
0 slc
n 11,100000 12,182295 m 10,900000 11,782295 l 11,100000 11,882295 l 11,300000 11,782295 l ef
n 11,100000 12,182295 m 10,900000 11,782295 l 11,100000 11,882295 l 11,300000 11,782295 l cp s
0,150000 slw
[] 0 sd
[] 0 sd
0 slc
n 20,500000 11,300000 m 20,500000 11,832295 l s
[] 0 sd
0 slj
0 slc
n 20,500000 12,132295 m 20,300000 11,732295 l 20,500000 11,832295 l 20,700000 11,732295 l ef
n 20,500000 12,132295 m 20,300000 11,732295 l 20,500000 11,832295 l 20,700000 11,732295 l cp s
0,150000 slw
[] 0 sd
[] 0 sd
0 slc
n 17,950000 11,350000 m 17,950000 11,882295 l s
[] 0 sd
0 slj
0 slc
n 17,950000 12,182295 m 17,750000 11,782295 l 17,950000 11,882295 l 18,150000 11,782295 l ef
n 17,950000 12,182295 m 17,750000 11,782295 l 17,950000 11,882295 l 18,150000 11,782295 l cp s
gsave 12,000000 11,950000 translate 0,035278 -0,035278 scale
start_ol
3077 -12 moveto
2605 -12 lineto
2278 917 lineto
835 917 lineto
508 -12 lineto
58 -12 lineto
1272 3305 lineto
1863 3305 lineto
3077 -12 lineto
2141 1280 moveto
1557 2917 lineto
970 1280 lineto
2141 1280 lineto
end_ol grestore 
gsave 12,414867 11,950000 translate 0,035278 -0,035278 scale
start_ol
3184 18 moveto
2613 18 lineto
1504 1344 lineto
883 1344 lineto
883 18 lineto
448 18 lineto
448 3328 lineto
1372 3328 lineto
1671 3328 1870 3289 conicto
2070 3251 2230 3150 conicto
2409 3037 2510 2864 conicto
2611 2692 2611 2428 conicto
2611 2070 2436 1828 conicto
2262 1587 1956 1465 conicto
3184 18 lineto
2176 2408 moveto
2176 2551 2125 2662 conicto
2075 2773 1957 2849 conicto
1860 2914 1726 2939 conicto
1592 2965 1411 2965 conicto
883 2965 lineto
883 1707 lineto
1336 1707 lineto
1549 1707 1707 1744 conicto
1866 1781 1977 1882 conicto
2079 1976 2127 2098 conicto
2176 2220 2176 2408 conicto
end_ol grestore 
gsave 12,838200 11,950000 translate 0,035278 -0,035278 scale
start_ol
2611 2320 moveto
2611 2099 2534 1910 conicto
2458 1721 2320 1582 conicto
2149 1410 1914 1323 conicto
1680 1237 1324 1237 conicto
883 1237 lineto
883 -6 lineto
448 -6 lineto
448 3328 lineto
1346 3328 lineto
1643 3328 1850 3277 conicto
2057 3227 2216 3120 conicto
2405 2992 2508 2801 conicto
2611 2611 2611 2320 conicto
2176 2311 moveto
2176 2487 2114 2618 conicto
2053 2750 1929 2832 conicto
1820 2904 1680 2934 conicto
1541 2965 1328 2965 conicto
883 2965 lineto
883 1600 lineto
1262 1600 lineto
1534 1600 1704 1649 conicto
1874 1698 1981 1806 conicto
2088 1917 2132 2038 conicto
2176 2160 2176 2311 conicto
end_ol grestore 
gsave 13,202267 11,950000 translate 0,035278 -0,035278 scale
start_ol
1728 1258 moveto
331 1258 lineto
331 1664 lineto
1728 1664 lineto
1728 1258 lineto
end_ol grestore 
gsave 13,473200 11,950000 translate 0,035278 -0,035278 scale
start_ol
3184 18 moveto
2613 18 lineto
1504 1344 lineto
883 1344 lineto
883 18 lineto
448 18 lineto
448 3328 lineto
1372 3328 lineto
1671 3328 1870 3289 conicto
2070 3251 2230 3150 conicto
2409 3037 2510 2864 conicto
2611 2692 2611 2428 conicto
2611 2070 2436 1828 conicto
2262 1587 1956 1465 conicto
3184 18 lineto
2176 2408 moveto
2176 2551 2125 2662 conicto
2075 2773 1957 2849 conicto
1860 2914 1726 2939 conicto
1592 2965 1411 2965 conicto
883 2965 lineto
883 1707 lineto
1336 1707 lineto
1549 1707 1707 1744 conicto
1866 1781 1977 1882 conicto
2079 1976 2127 2098 conicto
2176 2220 2176 2408 conicto
end_ol grestore 
gsave 13,879600 11,950000 translate 0,035278 -0,035278 scale
start_ol
2547 1213 moveto
691 1213 lineto
691 979 761 804 conicto
831 630 952 518 conicto
1069 409 1230 354 conicto
1392 299 1585 299 conicto
1842 299 2102 403 conicto
2362 507 2473 607 conicto
2495 607 lineto
2495 147 lineto
2280 57 2057 -3 conicto
1834 -64 1588 -64 conicto
960 -64 608 272 conicto
256 609 256 1228 conicto
256 1840 594 2200 conicto
932 2560 1483 2560 conicto
1993 2560 2270 2268 conicto
2547 1976 2547 1439 conicto
2547 1213 lineto
2115 1536 moveto
2112 1851 1948 2024 conicto
1785 2197 1452 2197 conicto
1116 2197 917 2007 conicto
718 1817 691 1536 conicto
2115 1536 lineto
end_ol grestore 
gsave 14,243667 11,950000 translate 0,035278 -0,035278 scale
start_ol
2483 -960 moveto
2048 -960 lineto
2048 257 lineto
1853 105 1658 31 conicto
1464 -43 1239 -43 conicto
791 -43 523 298 conicto
256 640 256 1241 conicto
256 1562 350 1807 conicto
444 2053 598 2220 conicto
748 2382 949 2471 conicto
1151 2560 1375 2560 conicto
1579 2560 1736 2512 conicto
1893 2465 2056 2372 conicto
2084 2465 lineto
2483 2465 lineto
2483 -960 lineto
2048 610 moveto
2048 2053 lineto
1873 2133 1737 2165 conicto
1601 2197 1443 2197 conicto
1075 2197 883 1944 conicto
691 1692 691 1249 conicto
691 801 846 560 conicto
1001 320 1332 320 conicto
1518 320 1703 401 conicto
1888 482 2048 610 conicto
end_ol grestore 
gsave 14,624667 11,950000 translate 0,035278 -0,035278 scale
start_ol
2483 0 moveto
2048 0 lineto
2048 268 lineto
1837 117 1643 37 conicto
1449 -43 1215 -43 conicto
821 -43 602 195 conicto
384 433 384 894 conicto
384 2502 lineto
819 2502 lineto
819 1070 lineto
819 879 836 742 conicto
853 606 911 510 conicto
971 410 1065 365 conicto
1160 320 1341 320 conicto
1502 320 1692 406 conicto
1883 492 2048 625 conicto
2048 2502 lineto
2483 2502 lineto
2483 0 lineto
end_ol grestore 
gsave 15,005667 11,950000 translate 0,035278 -0,035278 scale
start_ol
2547 1213 moveto
691 1213 lineto
691 979 761 804 conicto
831 630 952 518 conicto
1069 409 1230 354 conicto
1392 299 1585 299 conicto
1842 299 2102 403 conicto
2362 507 2473 607 conicto
2495 607 lineto
2495 147 lineto
2280 57 2057 -3 conicto
1834 -64 1588 -64 conicto
960 -64 608 272 conicto
256 609 256 1228 conicto
256 1840 594 2200 conicto
932 2560 1483 2560 conicto
1993 2560 2270 2268 conicto
2547 1976 2547 1439 conicto
2547 1213 lineto
2115 1536 moveto
2112 1851 1948 2024 conicto
1785 2197 1452 2197 conicto
1116 2197 917 2007 conicto
718 1817 691 1536 conicto
2115 1536 lineto
end_ol grestore 
gsave 15,369733 11,950000 translate 0,035278 -0,035278 scale
start_ol
2227 715 moveto
2227 374 1941 155 conicto
1656 -64 1162 -64 conicto
882 -64 648 2 conicto
414 69 256 148 conicto
256 624 lineto
279 624 lineto
479 475 725 387 conicto
971 299 1196 299 conicto
1476 299 1634 388 conicto
1792 478 1792 669 conicto
1792 817 1706 893 conicto
1620 970 1377 1022 conicto
1287 1042 1141 1069 conicto
996 1096 876 1128 conicto
545 1215 406 1383 conicto
268 1552 268 1799 conicto
268 1952 332 2088 conicto
396 2225 527 2333 conicto
654 2437 849 2498 conicto
1044 2560 1286 2560 conicto
1511 2560 1742 2505 conicto
1974 2450 2127 2371 conicto
2127 1917 lineto
2105 1917 lineto
1940 2035 1706 2116 conicto
1472 2197 1247 2197 conicto
1014 2197 852 2108 conicto
691 2020 691 1847 conicto
691 1692 788 1614 conicto
884 1535 1098 1487 conicto
1216 1460 1362 1433 conicto
1509 1406 1606 1384 conicto
1904 1317 2066 1153 conicto
2227 988 2227 715 conicto
end_ol grestore 
gsave 15,691467 11,950000 translate 0,035278 -0,035278 scale
start_ol
1702 27 moveto
1583 -4 1441 -23 conicto
1299 -43 1188 -43 conicto
801 -43 599 161 conicto
397 365 397 816 conicto
397 2133 lineto
128 2133 lineto
128 2496 lineto
397 2496 lineto
397 3215 lineto
832 3215 lineto
832 2496 lineto
1702 2496 lineto
1702 2133 lineto
832 2133 lineto
832 1002 lineto
832 807 841 697 conicto
850 587 904 492 conicto
953 402 1039 361 conicto
1126 320 1304 320 conicto
1407 320 1519 350 conicto
1631 380 1680 400 conicto
1702 400 lineto
1702 27 lineto
end_ol grestore 
gsave 15,928533 11,950000 translate 0,035278 -0,035278 scale
start_ol
1303 1857 moveto
768 1857 lineto
768 2496 lineto
1303 2496 lineto
1303 1857 lineto
1303 0 moveto
768 0 lineto
768 638 lineto
1303 638 lineto
1303 0 lineto
end_ol grestore 
gsave 12,000000 12,750000 translate 0,035278 -0,035278 scale
start_ol
end_ol grestore 
gsave 12,211667 12,750000 translate 0,035278 -0,035278 scale
start_ol
1721 3520 moveto
1625 2223 lineto
1329 2223 lineto
1233 3520 lineto
1721 3520 lineto
882 3520 moveto
785 2223 lineto
490 2223 lineto
393 3520 lineto
882 3520 lineto
end_ol grestore 
gsave 12,491067 12,750000 translate 0,035278 -0,035278 scale
start_ol
3561 2502 moveto
2909 0 lineto
2520 0 lineto
1877 1929 lineto
1239 0 lineto
851 0 lineto
193 2502 lineto
632 2502 lineto
1091 564 lineto
1716 2502 lineto
2063 2502 lineto
2703 564 lineto
3138 2502 lineto
3561 2502 lineto
end_ol grestore 
gsave 12,990600 12,750000 translate 0,035278 -0,035278 scale
start_ol
2496 35 moveto
2061 35 lineto
2061 1454 lineto
2061 1626 2041 1776 conicto
2022 1927 1969 2012 conicto
1914 2105 1810 2151 conicto
1707 2197 1542 2197 conicto
1372 2197 1187 2112 conicto
1002 2028 832 1896 conicto
832 35 lineto
397 35 lineto
397 3520 lineto
832 3520 lineto
832 2246 lineto
1029 2394 1238 2477 conicto
1448 2560 1668 2560 conicto
2073 2560 2284 2320 conicto
2496 2081 2496 1630 conicto
2496 35 lineto
end_ol grestore 
gsave 13,371600 12,750000 translate 0,035278 -0,035278 scale
start_ol
2560 1247 moveto
2560 639 2247 287 conicto
1934 -64 1409 -64 conicto
879 -64 567 287 conicto
256 639 256 1247 conicto
256 1854 567 2207 conicto
879 2560 1409 2560 conicto
1934 2560 2247 2207 conicto
2560 1854 2560 1247 conicto
2125 1248 moveto
2125 1729 1935 1963 conicto
1746 2197 1409 2197 conicto
1067 2197 879 1963 conicto
691 1729 691 1248 conicto
691 781 880 540 conicto
1070 299 1409 299 conicto
1744 299 1934 538 conicto
2125 777 2125 1248 conicto
end_ol grestore 
gsave 13,744133 12,750000 translate 0,035278 -0,035278 scale
start_ol
end_ol grestore 
gsave 13,955800 12,750000 translate 0,035278 -0,035278 scale
start_ol
2496 35 moveto
2061 35 lineto
2061 1454 lineto
2061 1626 2041 1776 conicto
2022 1927 1969 2012 conicto
1914 2105 1810 2151 conicto
1707 2197 1542 2197 conicto
1372 2197 1187 2112 conicto
1002 2028 832 1896 conicto
832 35 lineto
397 35 lineto
397 3520 lineto
832 3520 lineto
832 2246 lineto
1029 2394 1238 2477 conicto
1448 2560 1668 2560 conicto
2073 2560 2284 2320 conicto
2496 2081 2496 1630 conicto
2496 35 lineto
end_ol grestore 
gsave 14,336800 12,750000 translate 0,035278 -0,035278 scale
start_ol
2368 0 moveto
1933 0 lineto
1933 247 lineto
1878 211 1784 148 conicto
1690 85 1603 48 conicto
1499 0 1365 -32 conicto
1231 -64 1050 -64 conicto
718 -64 487 162 conicto
256 388 256 738 conicto
256 1024 376 1202 conicto
496 1380 718 1481 conicto
943 1582 1257 1618 conicto
1571 1655 1933 1673 conicto
1933 1736 lineto
1933 1876 1883 1967 conicto
1834 2059 1742 2112 conicto
1654 2163 1531 2180 conicto
1408 2197 1275 2197 conicto
1112 2197 912 2154 conicto
712 2112 500 2031 conicto
478 2031 lineto
478 2449 lineto
600 2482 831 2521 conicto
1063 2560 1287 2560 conicto
1550 2560 1744 2516 conicto
1939 2473 2082 2368 conicto
2222 2265 2295 2101 conicto
2368 1938 2368 1697 conicto
2368 0 lineto
1933 598 moveto
1933 1307 lineto
1745 1296 1490 1273 conicto
1235 1250 1087 1207 conicto
910 1154 800 1043 conicto
691 933 691 739 conicto
691 520 818 409 conicto
945 299 1205 299 conicto
1422 299 1601 386 conicto
1780 474 1933 598 conicto
end_ol grestore 
gsave 14,700867 12,750000 translate 0,035278 -0,035278 scale
start_ol
2227 715 moveto
2227 374 1941 155 conicto
1656 -64 1162 -64 conicto
882 -64 648 2 conicto
414 69 256 148 conicto
256 624 lineto
279 624 lineto
479 475 725 387 conicto
971 299 1196 299 conicto
1476 299 1634 388 conicto
1792 478 1792 669 conicto
1792 817 1706 893 conicto
1620 970 1377 1022 conicto
1287 1042 1141 1069 conicto
996 1096 876 1128 conicto
545 1215 406 1383 conicto
268 1552 268 1799 conicto
268 1952 332 2088 conicto
396 2225 527 2333 conicto
654 2437 849 2498 conicto
1044 2560 1286 2560 conicto
1511 2560 1742 2505 conicto
1974 2450 2127 2371 conicto
2127 1917 lineto
2105 1917 lineto
1940 2035 1706 2116 conicto
1472 2197 1247 2197 conicto
1014 2197 852 2108 conicto
691 2020 691 1847 conicto
691 1692 788 1614 conicto
884 1535 1098 1487 conicto
1216 1460 1362 1433 conicto
1509 1406 1606 1384 conicto
1904 1317 2066 1153 conicto
2227 988 2227 715 conicto
end_ol grestore 
gsave 15,022600 12,750000 translate 0,035278 -0,035278 scale
start_ol
end_ol grestore 
gsave 15,234267 12,750000 translate 0,035278 -0,035278 scale
start_ol
2432 0 moveto
627 0 lineto
627 363 lineto
1330 363 lineto
1330 2576 lineto
627 2576 lineto
627 2880 lineto
770 2880 932 2903 conicto
1095 2927 1179 2972 conicto
1284 3028 1344 3114 conicto
1404 3201 1413 3346 conicto
1760 3346 lineto
1760 363 lineto
2432 363 lineto
2432 0 lineto
end_ol grestore 
gsave 15,623733 12,750000 translate 0,035278 -0,035278 scale
start_ol
2611 1666 moveto
2611 771 2332 353 conicto
2053 -64 1465 -64 conicto
869 -64 594 359 conicto
320 783 320 1662 conicto
320 2547 598 2969 conicto
876 3392 1465 3392 conicto
2062 3392 2336 2963 conicto
2611 2534 2611 1666 conicto
2040 651 moveto
2119 831 2147 1076 conicto
2176 1322 2176 1666 conicto
2176 2006 2147 2257 conicto
2119 2508 2037 2681 conicto
1957 2854 1819 2941 conicto
1682 3029 1465 3029 conicto
1251 3029 1111 2941 conicto
971 2854 889 2677 conicto
812 2512 783 2245 conicto
755 1979 755 1662 conicto
755 1313 780 1077 conicto
805 842 886 657 conicto
961 483 1099 391 conicto
1237 299 1465 299 conicto
1680 299 1821 386 conicto
1962 474 2040 651 conicto
end_ol grestore 
gsave 16,013200 12,750000 translate 0,035278 -0,035278 scale
start_ol
1102 0 moveto
567 0 lineto
567 638 lineto
1102 638 lineto
1102 0 lineto
end_ol grestore 
gsave 16,233333 12,750000 translate 0,035278 -0,035278 scale
start_ol
2611 914 moveto
2611 475 2278 184 conicto
1945 -107 1440 -107 conicto
904 -107 586 177 conicto
269 462 269 906 conicto
269 1187 420 1415 conicto
572 1644 847 1779 conicto
847 1792 lineto
584 1938 458 2111 conicto
333 2284 333 2543 conicto
333 2925 645 3180 conicto
958 3435 1440 3435 conicto
1945 3435 2246 3191 conicto
2547 2948 2547 2573 conicto
2547 2343 2406 2121 conicto
2266 1899 1994 1774 conicto
1994 1761 lineto
2293 1624 2452 1424 conicto
2611 1224 2611 914 conicto
2112 2549 moveto
2112 2788 1921 2930 conicto
1730 3072 1433 3072 conicto
1142 3072 955 2938 conicto
768 2804 768 2576 conicto
768 2415 861 2297 conicto
955 2180 1146 2088 conicto
1232 2049 1392 1984 conicto
1553 1919 1706 1877 conicto
1936 2024 2024 2182 conicto
2112 2341 2112 2549 conicto
2176 883 moveto
2176 1089 2084 1213 conicto
1992 1337 1725 1462 conicto
1619 1510 1492 1552 conicto
1365 1595 1154 1672 conicto
951 1562 827 1374 conicto
704 1187 704 950 conicto
704 649 914 452 conicto
1125 256 1449 256 conicto
1780 256 1978 423 conicto
2176 591 2176 883 conicto
end_ol grestore 
gsave 16,614333 12,750000 translate 0,035278 -0,035278 scale
start_ol
1102 0 moveto
567 0 lineto
567 638 lineto
1102 638 lineto
1102 0 lineto
end_ol grestore 
gsave 16,834467 12,750000 translate 0,035278 -0,035278 scale
start_ol
2722 917 moveto
2227 917 lineto
2227 0 lineto
1792 0 lineto
1792 917 lineto
195 917 lineto
195 1438 lineto
1814 3335 lineto
2227 3335 lineto
2227 1280 lineto
2722 1280 lineto
2722 917 lineto
1792 1280 moveto
1792 2798 lineto
500 1280 lineto
1792 1280 lineto
end_ol grestore 
gsave 17,223933 12,750000 translate 0,035278 -0,035278 scale
start_ol
1102 0 moveto
567 0 lineto
567 638 lineto
1102 638 lineto
1102 0 lineto
end_ol grestore 
gsave 17,444067 12,750000 translate 0,035278 -0,035278 scale
start_ol
2624 0 moveto
367 0 lineto
367 470 lineto
605 673 844 875 conicto
1083 1077 1290 1277 conicto
1726 1696 1887 1942 conicto
2048 2188 2048 2474 conicto
2048 2735 1875 2882 conicto
1702 3029 1391 3029 conicto
1184 3029 943 2956 conicto
703 2884 474 2734 conicto
451 2734 lineto
451 3190 lineto
610 3267 875 3329 conicto
1140 3392 1389 3392 conicto
1902 3392 2192 3144 conicto
2483 2896 2483 2472 conicto
2483 2281 2435 2115 conicto
2387 1950 2294 1803 conicto
2206 1663 2089 1528 conicto
1972 1394 1805 1230 conicto
1567 994 1312 772 conicto
1058 551 837 363 conicto
2624 363 lineto
2624 0 lineto
end_ol grestore 
gsave 17,833533 12,750000 translate 0,035278 -0,035278 scale
start_ol
end_ol grestore 
gsave 18,045200 12,750000 translate 0,035278 -0,035278 scale
start_ol
1102 0 moveto
567 0 lineto
567 638 lineto
1102 638 lineto
1102 0 lineto
end_ol grestore 
gsave 18,265333 12,750000 translate 0,035278 -0,035278 scale
start_ol
1102 0 moveto
567 0 lineto
567 638 lineto
1102 638 lineto
1102 0 lineto
end_ol grestore 
gsave 18,485467 12,750000 translate 0,035278 -0,035278 scale
start_ol
1102 0 moveto
567 0 lineto
567 638 lineto
1102 638 lineto
1102 0 lineto
end_ol grestore 
gsave 18,705600 12,750000 translate 0,035278 -0,035278 scale
start_ol
2227 2545 moveto
2227 2327 2150 2156 conicto
2074 1986 1950 1854 conicto
1828 1727 1669 1615 conicto
1510 1504 1331 1400 conicto
1331 898 lineto
896 898 lineto
896 1584 lineto
1047 1667 1222 1766 conicto
1397 1865 1509 1966 conicto
1644 2082 1718 2207 conicto
1792 2332 1792 2525 conicto
1792 2780 1620 2904 conicto
1449 3029 1179 3029 conicto
937 3029 721 2952 conicto
506 2876 381 2797 conicto
358 2797 lineto
358 3240 lineto
513 3299 751 3345 conicto
989 3392 1201 3392 conicto
1676 3392 1951 3159 conicto
2227 2926 2227 2545 conicto
1344 0 moveto
909 0 lineto
909 473 lineto
1344 473 lineto
1344 0 lineto
end_ol grestore 
gsave 19,035800 12,750000 translate 0,035278 -0,035278 scale
start_ol
1721 3520 moveto
1625 2223 lineto
1329 2223 lineto
1233 3520 lineto
1721 3520 lineto
882 3520 moveto
785 2223 lineto
490 2223 lineto
393 3520 lineto
882 3520 lineto
end_ol grestore 
gsave 12,050000 8,550000 translate 0,035278 -0,035278 scale
start_ol
2611 1666 moveto
2611 771 2332 353 conicto
2053 -64 1465 -64 conicto
869 -64 594 359 conicto
320 783 320 1662 conicto
320 2547 598 2969 conicto
876 3392 1465 3392 conicto
2062 3392 2336 2963 conicto
2611 2534 2611 1666 conicto
2040 651 moveto
2119 831 2147 1076 conicto
2176 1322 2176 1666 conicto
2176 2006 2147 2257 conicto
2119 2508 2037 2681 conicto
1957 2854 1819 2941 conicto
1682 3029 1465 3029 conicto
1251 3029 1111 2941 conicto
971 2854 889 2677 conicto
812 2512 783 2245 conicto
755 1979 755 1662 conicto
755 1313 780 1077 conicto
805 842 886 657 conicto
961 483 1099 391 conicto
1237 299 1465 299 conicto
1680 299 1821 386 conicto
1962 474 2040 651 conicto
end_ol grestore 
gsave 12,439467 8,550000 translate 0,035278 -0,035278 scale
start_ol
2611 1666 moveto
2611 771 2332 353 conicto
2053 -64 1465 -64 conicto
869 -64 594 359 conicto
320 783 320 1662 conicto
320 2547 598 2969 conicto
876 3392 1465 3392 conicto
2062 3392 2336 2963 conicto
2611 2534 2611 1666 conicto
2040 651 moveto
2119 831 2147 1076 conicto
2176 1322 2176 1666 conicto
2176 2006 2147 2257 conicto
2119 2508 2037 2681 conicto
1957 2854 1819 2941 conicto
1682 3029 1465 3029 conicto
1251 3029 1111 2941 conicto
971 2854 889 2677 conicto
812 2512 783 2245 conicto
755 1979 755 1662 conicto
755 1313 780 1077 conicto
805 842 886 657 conicto
961 483 1099 391 conicto
1237 299 1465 299 conicto
1680 299 1821 386 conicto
1962 474 2040 651 conicto
end_ol grestore 
gsave 12,828933 8,550000 translate 0,035278 -0,035278 scale
start_ol
1303 1857 moveto
768 1857 lineto
768 2496 lineto
1303 2496 lineto
1303 1857 lineto
1303 0 moveto
768 0 lineto
768 638 lineto
1303 638 lineto
1303 0 lineto
end_ol grestore 
gsave 13,108333 8,550000 translate 0,035278 -0,035278 scale
start_ol
2611 1666 moveto
2611 771 2332 353 conicto
2053 -64 1465 -64 conicto
869 -64 594 359 conicto
320 783 320 1662 conicto
320 2547 598 2969 conicto
876 3392 1465 3392 conicto
2062 3392 2336 2963 conicto
2611 2534 2611 1666 conicto
2040 651 moveto
2119 831 2147 1076 conicto
2176 1322 2176 1666 conicto
2176 2006 2147 2257 conicto
2119 2508 2037 2681 conicto
1957 2854 1819 2941 conicto
1682 3029 1465 3029 conicto
1251 3029 1111 2941 conicto
971 2854 889 2677 conicto
812 2512 783 2245 conicto
755 1979 755 1662 conicto
755 1313 780 1077 conicto
805 842 886 657 conicto
961 483 1099 391 conicto
1237 299 1465 299 conicto
1680 299 1821 386 conicto
1962 474 2040 651 conicto
end_ol grestore 
gsave 13,497800 8,550000 translate 0,035278 -0,035278 scale
start_ol
2432 0 moveto
627 0 lineto
627 363 lineto
1330 363 lineto
1330 2576 lineto
627 2576 lineto
627 2880 lineto
770 2880 932 2903 conicto
1095 2927 1179 2972 conicto
1284 3028 1344 3114 conicto
1404 3201 1413 3346 conicto
1760 3346 lineto
1760 363 lineto
2432 363 lineto
2432 0 lineto
end_ol grestore 
gsave 13,887267 8,550000 translate 0,035278 -0,035278 scale
start_ol
1303 1857 moveto
768 1857 lineto
768 2496 lineto
1303 2496 lineto
1303 1857 lineto
1303 0 moveto
768 0 lineto
768 638 lineto
1303 638 lineto
1303 0 lineto
end_ol grestore 
gsave 14,166667 8,550000 translate 0,035278 -0,035278 scale
start_ol
3077 -12 moveto
2605 -12 lineto
2278 917 lineto
835 917 lineto
508 -12 lineto
58 -12 lineto
1272 3305 lineto
1863 3305 lineto
3077 -12 lineto
2141 1280 moveto
1557 2917 lineto
970 1280 lineto
2141 1280 lineto
end_ol grestore 
gsave 14,581533 8,550000 translate 0,035278 -0,035278 scale
start_ol
3077 -12 moveto
2605 -12 lineto
2278 917 lineto
835 917 lineto
508 -12 lineto
58 -12 lineto
1272 3305 lineto
1863 3305 lineto
3077 -12 lineto
2141 1280 moveto
1557 2917 lineto
970 1280 lineto
2141 1280 lineto
end_ol grestore 
gsave 21,200000 8,550000 translate 0,035278 -0,035278 scale
start_ol
2611 1666 moveto
2611 771 2332 353 conicto
2053 -64 1465 -64 conicto
869 -64 594 359 conicto
320 783 320 1662 conicto
320 2547 598 2969 conicto
876 3392 1465 3392 conicto
2062 3392 2336 2963 conicto
2611 2534 2611 1666 conicto
2040 651 moveto
2119 831 2147 1076 conicto
2176 1322 2176 1666 conicto
2176 2006 2147 2257 conicto
2119 2508 2037 2681 conicto
1957 2854 1819 2941 conicto
1682 3029 1465 3029 conicto
1251 3029 1111 2941 conicto
971 2854 889 2677 conicto
812 2512 783 2245 conicto
755 1979 755 1662 conicto
755 1313 780 1077 conicto
805 842 886 657 conicto
961 483 1099 391 conicto
1237 299 1465 299 conicto
1680 299 1821 386 conicto
1962 474 2040 651 conicto
end_ol grestore 
gsave 21,589467 8,550000 translate 0,035278 -0,035278 scale
start_ol
2611 1666 moveto
2611 771 2332 353 conicto
2053 -64 1465 -64 conicto
869 -64 594 359 conicto
320 783 320 1662 conicto
320 2547 598 2969 conicto
876 3392 1465 3392 conicto
2062 3392 2336 2963 conicto
2611 2534 2611 1666 conicto
2040 651 moveto
2119 831 2147 1076 conicto
2176 1322 2176 1666 conicto
2176 2006 2147 2257 conicto
2119 2508 2037 2681 conicto
1957 2854 1819 2941 conicto
1682 3029 1465 3029 conicto
1251 3029 1111 2941 conicto
971 2854 889 2677 conicto
812 2512 783 2245 conicto
755 1979 755 1662 conicto
755 1313 780 1077 conicto
805 842 886 657 conicto
961 483 1099 391 conicto
1237 299 1465 299 conicto
1680 299 1821 386 conicto
1962 474 2040 651 conicto
end_ol grestore 
gsave 21,978933 8,550000 translate 0,035278 -0,035278 scale
start_ol
1303 1857 moveto
768 1857 lineto
768 2496 lineto
1303 2496 lineto
1303 1857 lineto
1303 0 moveto
768 0 lineto
768 638 lineto
1303 638 lineto
1303 0 lineto
end_ol grestore 
gsave 22,258333 8,550000 translate 0,035278 -0,035278 scale
start_ol
2611 1666 moveto
2611 771 2332 353 conicto
2053 -64 1465 -64 conicto
869 -64 594 359 conicto
320 783 320 1662 conicto
320 2547 598 2969 conicto
876 3392 1465 3392 conicto
2062 3392 2336 2963 conicto
2611 2534 2611 1666 conicto
2040 651 moveto
2119 831 2147 1076 conicto
2176 1322 2176 1666 conicto
2176 2006 2147 2257 conicto
2119 2508 2037 2681 conicto
1957 2854 1819 2941 conicto
1682 3029 1465 3029 conicto
1251 3029 1111 2941 conicto
971 2854 889 2677 conicto
812 2512 783 2245 conicto
755 1979 755 1662 conicto
755 1313 780 1077 conicto
805 842 886 657 conicto
961 483 1099 391 conicto
1237 299 1465 299 conicto
1680 299 1821 386 conicto
1962 474 2040 651 conicto
end_ol grestore 
gsave 22,647800 8,550000 translate 0,035278 -0,035278 scale
start_ol
2432 0 moveto
627 0 lineto
627 363 lineto
1330 363 lineto
1330 2576 lineto
627 2576 lineto
627 2880 lineto
770 2880 932 2903 conicto
1095 2927 1179 2972 conicto
1284 3028 1344 3114 conicto
1404 3201 1413 3346 conicto
1760 3346 lineto
1760 363 lineto
2432 363 lineto
2432 0 lineto
end_ol grestore 
gsave 23,037267 8,550000 translate 0,035278 -0,035278 scale
start_ol
1303 1857 moveto
768 1857 lineto
768 2496 lineto
1303 2496 lineto
1303 1857 lineto
1303 0 moveto
768 0 lineto
768 638 lineto
1303 638 lineto
1303 0 lineto
end_ol grestore 
gsave 23,316667 8,550000 translate 0,035278 -0,035278 scale
start_ol
2944 1024 moveto
2944 775 2850 585 conicto
2757 395 2600 272 conicto
2413 125 2189 62 conicto
1966 0 1622 0 conicto
448 0 lineto
448 3328 lineto
1434 3328 lineto
1799 3328 1980 3301 conicto
2161 3274 2326 3189 conicto
2509 3093 2592 2942 conicto
2675 2791 2675 2582 conicto
2675 2344 2561 2178 conicto
2447 2012 2257 1911 conicto
2257 1893 lineto
2576 1824 2760 1597 conicto
2944 1370 2944 1024 conicto
2240 2530 moveto
2240 2653 2199 2737 conicto
2158 2821 2066 2874 conicto
1959 2935 1805 2950 conicto
1652 2965 1424 2965 conicto
883 2965 lineto
883 1984 lineto
1470 1984 lineto
1683 1984 1809 2006 conicto
1935 2028 2044 2096 conicto
2151 2164 2195 2272 conicto
2240 2381 2240 2530 conicto
2509 1001 moveto
2509 1205 2448 1326 conicto
2387 1447 2226 1531 conicto
2117 1588 1962 1604 conicto
1808 1621 1586 1621 conicto
883 1621 lineto
883 363 lineto
1475 363 lineto
1769 363 1957 393 conicto
2145 424 2265 506 conicto
2391 594 2450 708 conicto
2509 822 2509 1001 conicto
end_ol grestore 
gsave 23,731533 8,550000 translate 0,035278 -0,035278 scale
start_ol
2944 1024 moveto
2944 775 2850 585 conicto
2757 395 2600 272 conicto
2413 125 2189 62 conicto
1966 0 1622 0 conicto
448 0 lineto
448 3328 lineto
1434 3328 lineto
1799 3328 1980 3301 conicto
2161 3274 2326 3189 conicto
2509 3093 2592 2942 conicto
2675 2791 2675 2582 conicto
2675 2344 2561 2178 conicto
2447 2012 2257 1911 conicto
2257 1893 lineto
2576 1824 2760 1597 conicto
2944 1370 2944 1024 conicto
2240 2530 moveto
2240 2653 2199 2737 conicto
2158 2821 2066 2874 conicto
1959 2935 1805 2950 conicto
1652 2965 1424 2965 conicto
883 2965 lineto
883 1984 lineto
1470 1984 lineto
1683 1984 1809 2006 conicto
1935 2028 2044 2096 conicto
2151 2164 2195 2272 conicto
2240 2381 2240 2530 conicto
2509 1001 moveto
2509 1205 2448 1326 conicto
2387 1447 2226 1531 conicto
2117 1588 1962 1604 conicto
1808 1621 1586 1621 conicto
883 1621 lineto
883 363 lineto
1475 363 lineto
1769 363 1957 393 conicto
2145 424 2265 506 conicto
2391 594 2450 708 conicto
2509 822 2509 1001 conicto
end_ol grestore 
showpage
