#FIG 3.2
Landscape
Center
Metric
A4      
100.00
Single
-2
1200 2
6 2655 4230 8325 5850
2 1 0 1 0 7 50 -1 -1 0.000 0 0 -1 1 0 2
	1 1 1.00 60.00 120.00
	 5625 5805 8325 5805
2 1 0 1 0 7 50 -1 -1 0.000 0 0 -1 1 0 2
	1 1 1.00 60.00 120.00
	 2655 5445 8325 5445
2 1 0 1 0 7 50 -1 -1 0.000 0 0 -1 1 0 2
	1 1 1.00 60.00 120.00
	 4860 4950 8325 4950
2 1 0 1 0 7 50 -1 -1 0.000 0 0 -1 0 0 2
	 4860 4950 4860 5445
2 1 0 1 0 7 50 -1 -1 0.000 0 0 -1 1 0 2
	1 1 1.00 60.00 120.00
	 6525 4455 8325 4455
2 1 0 1 0 7 50 -1 -1 0.000 0 0 -1 0 0 2
	 6525 4455 6525 4905
2 1 0 1 0 7 50 -1 -1 0.000 0 0 -1 0 0 2
	 5625 5445 5625 5805
4 0 0 50 -1 16 12 0.0000 4 165 975 2925 5355 Hauptzweig\001
4 0 0 50 -1 16 12 0.0000 4 165 1275 4950 4860 1. Verzweigung\001
4 0 0 50 -1 16 12 0.0000 4 165 1275 6705 4365 3. Verzweigung\001
4 0 0 50 -1 16 12 0.0000 4 165 1275 5805 5715 2. Verzweigung\001
-6
