/work/mh1126/m300872/eureca_icon/EUREC4A/run/logs/les_test2-9163772.log,3258584,2024-03-05 19:18:12,4.682222222222222,120,7.008333333333334,
/work/mh1126/m300872/eureca_icon/EUREC4A/run/logs/les_4k-adiabat-3586227.log,144,2023-03-14 10:36:24,0.0019444444444444444,120,None,
/work/mh1126/m300872/eureca_icon/EUREC4A/run/logs/DEVtest-7939344.log,484,2023-12-04 17:57:31,0.0044444444444444444,8,None,
/work/mh1126/m300872/eureca_icon/EUREC4A/run/logs/les_eurec4a-2019279.log,892,2023-03-14 10:36:27,0.225,128,None,
/work/mh1126/m300872/eureca_icon/EUREC4A/run/logs/10198847-les+4k.log,768,2024-05-07 13:33:11,2.7580555555555555,240,None,
/work/mh1126/m300872/eureca_icon/EUREC4A/run/logs/10338325-les+4k.log,7162636,2024-05-17 04:58:46,8.006388888888889,280,4.363333333333333,
/work/mh1126/m300872/eureca_icon/EUREC4A/run/logs/les_eurec4a-2035438.log,4220,2023-03-14 10:36:27,7.133333333333334,128,7.008333333333334,
/work/mh1126/m300872/eureca_icon/EUREC4A/run/logs/DEVtest-7951878.log,228,2023-12-05 13:16:25,0.021944444444444444,8,None,
/work/mh1126/m300872/eureca_icon/EUREC4A/run/logs/jul_numu-2280346.log,208,2023-03-14 10:36:20,0.005,12,None,
/work/mh1126/m300872/eureca_icon/EUREC4A/run/logs/les_rerun-4279850.log,1676,2023-03-17 15:57:50,0.42194444444444446,120,0.265,
/work/mh1126/m300872/eureca_icon/EUREC4A/run/logs/les_4k-adiabat-3587818.log,824,2023-03-14 10:36:24,8.0075,120,None,
/work/mh1126/m300872/eureca_icon/EUREC4A/run/logs/les_eurec4a-2119508.log,7352,2023-03-14 10:36:27,0.23916666666666667,128,None,
/work/mh1126/m300872/eureca_icon/EUREC4A/run/logs/9789489-les+4k.log,2074776,2024-04-10 20:27:33,4.004444444444444,120,5.725,
/work/mh1126/m300872/eureca_icon/EUREC4A/run/logs/les_eurec4a-1998883.log,272,2023-03-14 10:36:27,0.0019444444444444444,12,None,
/work/mh1126/m300872/eureca_icon/EUREC4A/run/logs/les_rerun-5578066.log,464,2023-06-13 17:45:37,0.008333333333333333,120,None,
/work/mh1126/m300872/eureca_icon/EUREC4A/run/logs/les_rerun-4268246.log,2324,2023-03-16 14:51:15,0.38861111111111113,120,0.265,
/work/mh1126/m300872/eureca_icon/EUREC4A/run/logs/les_rerun-4028928.log,5932,2023-03-14 10:36:27,0.29527777777777775,120,None,
/work/mh1126/m300872/eureca_icon/EUREC4A/run/logs/les_rerun-6274859.log,35283864,2023-07-30 07:47:30,8.006666666666666,120,4.6,
/work/mh1126/m300872/eureca_icon/EUREC4A/run/logs/les_rerun-5501545.log,144,2023-06-04 22:00:41,0.0033333333333333335,120,None,
/work/mh1126/m300872/eureca_icon/EUREC4A/run/logs/10319720-les+4k.log,2433924,2024-05-15 17:29:12,8.004722222222222,240,3.7483333333333335,
/work/mh1126/m300872/eureca_icon/EUREC4A/run/logs/les_eurec4a-1970315.log,304,2023-03-14 10:36:27,0.04694444444444444,24,None,
/work/mh1126/m300872/eureca_icon/EUREC4A/run/logs/les_rerun-7471401.log,2624004,2023-10-27 19:11:00,1.6533333333333333,150,0.395,
/work/mh1126/m300872/eureca_icon/EUREC4A/run/logs/les_4k-adiabat-3114050.log,140,2023-03-14 10:36:22,0.0022222222222222222,120,None,
/work/mh1126/m300872/eureca_icon/EUREC4A/run/logs/13791903-les+4k_DOM01.log,10113808,2024-11-09 16:06:40,5.0761111111111115,120,7.008333333333334,
/work/mh1126/m300872/eureca_icon/EUREC4A/run/logs/14056369-les+4k_DOM01.log,1494252,2024-12-03 14:18:15,4.590277777777778,120,7.008333333333334,
/work/mh1126/m300872/eureca_icon/EUREC4A/run/logs/les_rerun-5625257.log,476,2023-06-17 13:00:09,0.049166666666666664,120,None,
/work/mh1126/m300872/eureca_icon/EUREC4A/run/logs/les_rerun-4234589.log,144,2023-03-14 13:34:25,0.0033333333333333335,120,None,
/work/mh1126/m300872/eureca_icon/EUREC4A/run/logs/les_rerun-4691965.log,2956,2023-04-11 16:14:40,2.8630555555555555,120,3.9983333333333335,
/work/mh1126/m300872/eureca_icon/EUREC4A/run/logs/les_rerun-4280111.log,1652,2023-03-17 19:53:05,0.49027777777777776,120,0.265,
/work/mh1126/m300872/eureca_icon/EUREC4A/run/logs/10294659-les+4k.log,110204,2024-05-13 19:26:50,2.1908333333333334,120,0.48833333333333334,
/work/mh1126/m300872/eureca_icon/EUREC4A/run/logs/10406968-les+4k.log,1312,2024-05-22 16:16:31,0.008333333333333333,440,None,
/work/mh1126/m300872/eureca_icon/EUREC4A/run/logs/les_rerun-6535632.log,17007728,2023-08-17 23:42:37,8.002777777777778,150,2.2533333333333334,
/work/mh1126/m300872/eureca_icon/EUREC4A/run/logs/les_rerun-5501546.log,5796,2023-06-04 22:00:58,0.008333333333333333,120,None,
/work/mh1126/m300872/eureca_icon/EUREC4A/run/logs/les_rerun-6597155.log,7280,2023-08-22 23:31:25,0.225,120,None,
/work/mh1126/m300872/eureca_icon/EUREC4A/run/logs/les_rerun-5597436.log,3148,2023-06-15 17:10:19,2.7105555555555556,120,3.9983333333333335,
/work/mh1126/m300872/eureca_icon/EUREC4A/run/logs/les_rerun-3829455.log,2380,2023-03-14 10:36:27,1.4047222222222222,120,1.9983333333333333,
/work/mh1126/m300872/eureca_icon/EUREC4A/run/logs/les_rerun-4562414.log,2964,2023-04-04 07:32:16,2.6330555555555555,120,3.9983333333333335,
/work/mh1126/m300872/eureca_icon/EUREC4A/run/logs/les_rerun-5639907.log,1451876,2023-06-19 20:12:28,8.003333333333334,120,1.985,
/work/mh1126/m300872/eureca_icon/EUREC4A/run/logs/les_eurec4a-2131348.log,7352,2023-03-14 10:36:27,0.2536111111111111,128,None,
/work/mh1126/m300872/eureca_icon/EUREC4A/run/logs/les_4k-adiabat-2905013.log,7980,2023-03-14 10:36:20,0.007222222222222222,120,None,
/work/mh1126/m300872/eureca_icon/EUREC4A/run/logs/10398207-les+4k.log,1484,2024-05-22 03:29:10,8.005833333333333,512,None,
/work/mh1126/m300872/eureca_icon/EUREC4A/run/logs/9711783-les+4k.log,816,2024-04-05 22:31:57,2.006388888888889,256,None,
/work/mh1126/m300872/eureca_icon/EUREC4A/run/logs/DEVtest-7939158.log,484,2023-12-04 17:30:51,0.0033333333333333335,8,None,
/work/mh1126/m300872/eureca_icon/EUREC4A/run/logs/DEVtest-7939118.log,180,2023-12-04 17:28:07,0.0038888888888888888,8,None,
/work/mh1126/m300872/eureca_icon/EUREC4A/run/logs/les_rerun-5658225.log,6748,2023-06-20 15:20:57,0.006388888888888889,120,None,
/work/mh1126/m300872/eureca_icon/EUREC4A/run/logs/les_rerun-5635759.log,2199240,2023-06-19 05:40:17,8.00388888888889,120,2.8133333333333335,
/work/mh1126/m300872/eureca_icon/EUREC4A/run/logs/les_rerun-4743138.log,2948,2023-04-15 00:54:58,2.641111111111111,120,3.9983333333333335,
/work/mh1126/m300872/eureca_icon/EUREC4A/run/logs/les_rerun-5782819.log,1451908,2023-06-28 19:12:48,8.005,120,1.9416666666666667,
/work/mh1126/m300872/eureca_icon/EUREC4A/run/logs/les_test2-9348976.log,822644,2024-03-16 23:30:47,5.015555555555555,120,7.008333333333334,
/work/mh1126/m300872/eureca_icon/EUREC4A/run/logs/les_4k-adiabat-2851466.log,212,2023-03-14 10:36:20,0.004722222222222222,12,None,
/work/mh1126/m300872/eureca_icon/EUREC4A/run/logs/14034424-les+4k_DOM01.log,2873828,2024-12-01 09:56:52,4.845833333333333,120,7.008333333333334,
/work/mh1126/m300872/eureca_icon/EUREC4A/run/logs/les_eurec4a-1970964.log,364,2023-03-14 10:36:27,0.1025,24,None,
/work/mh1126/m300872/eureca_icon/EUREC4A/run/logs/les_rerun-4171801.log,144,2023-03-09 19:13:11,0.0038888888888888888,120,None,
/work/mh1126/m300872/eureca_icon/EUREC4A/run/logs/les_rerun-5507808.log,512,2023-06-06 21:09:31,0.19611111111111112,120,None,
/work/mh1126/m300872/eureca_icon/EUREC4A/run/logs/les_eurec4a-2046226.log,1120,2023-03-14 10:36:27,0.5052777777777778,128,0.43833333333333335,
/work/mh1126/m300872/eureca_icon/EUREC4A/run/logs/les_eurec4a-1996329.log,212,2023-03-14 10:36:27,0.0019444444444444444,12,None,
/work/mh1126/m300872/eureca_icon/EUREC4A/run/logs/les_test2-9319415.log,1317448,2024-03-15 15:17:05,4.746666666666667,120,7.008333333333334,
/work/mh1126/m300872/eureca_icon/EUREC4A/run/logs/les_test2-9142846.log,18035980,2024-03-04 21:14:17,5.358888888888889,120,7.008333333333334,
/work/mh1126/m300872/eureca_icon/EUREC4A/run/logs/les_rerun-5634741.log,1496704,2023-06-18 21:24:13,4.002222222222223,120,1.7933333333333332,
/work/mh1126/m300872/eureca_icon/EUREC4A/run/logs/DEVtest-7939960.log,484,2023-12-04 19:02:37,0.004166666666666667,8,None,
/work/mh1126/m300872/eureca_icon/EUREC4A/run/logs/les_eurec4a-1999871.log,776,2023-03-14 10:36:27,0.04083333333333333,12,None,
/work/mh1126/m300872/eureca_icon/EUREC4A/run/logs/les_rerun-5829559.log,1298236,2023-07-01 22:13:00,8.004722222222222,120,1.8316666666666668,
/work/mh1126/m300872/eureca_icon/EUREC4A/run/logs/les_eurec4a-2119779.log,7344,2023-03-14 10:36:27,0.20805555555555555,128,None,
/work/mh1126/m300872/eureca_icon/EUREC4A/run/logs/10312096-les+4k.log,288660,2024-05-15 03:32:09,8.0075,220,3.4766666666666666,
/work/mh1126/m300872/eureca_icon/EUREC4A/run/logs/les_test-7782397.log,6832,2023-11-22 12:20:41,0.009722222222222222,150,None,
/work/mh1126/m300872/eureca_icon/EUREC4A/run/logs/les_rerun-6583579.log,14383100,2023-08-22 02:37:40,8.004722222222222,150,1.9866666666666666,
/work/mh1126/m300872/eureca_icon/EUREC4A/run/logs/jul_numu-2282972.log,980,2023-03-14 10:36:20,0.3288888888888889,128,0.14,
/work/mh1126/m300872/eureca_icon/EUREC4A/run/logs/les_rerun-7961821.log,588,2023-12-06 00:55:17,0.4419444444444444,150,None,
/work/mh1126/m300872/eureca_icon/EUREC4A/run/logs/jul_numu-2285951.log,36,2023-03-14 10:36:20,0.0008333333333333334,12,None,
/work/mh1126/m300872/eureca_icon/EUREC4A/run/logs/les_rerun-5577396.log,504,2023-06-13 16:47:55,0.225,120,None,
/work/mh1126/m300872/eureca_icon/EUREC4A/run/logs/les_rerun-5507330.log,508,2023-06-06 14:39:48,0.19694444444444445,120,None,
/work/mh1126/m300872/eureca_icon/EUREC4A/run/logs/9789099-les+4k.log,5400,2024-04-10 16:04:37,0.25222222222222224,120,None,
/work/mh1126/m300872/eureca_icon/EUREC4A/run/logs/les_eurec4a-1956146.log,864,2023-03-14 10:36:26,0.0075,128,None,
/work/mh1126/m300872/eureca_icon/EUREC4A/run/logs/les_rerun-5625189.log,2752,2023-06-17 12:37:36,0.006388888888888889,60,None,
/work/mh1126/m300872/eureca_icon/EUREC4A/run/logs/les_rerun-5818658.log,1451872,2023-07-01 00:42:39,8.001111111111111,120,1.8333333333333333,
/work/mh1126/m300872/eureca_icon/EUREC4A/run/logs/rs_test-5149998.log,144,2023-05-12 12:15:37,0.0030555555555555557,30,None,
/work/mh1126/m300872/eureca_icon/EUREC4A/run/logs/les_eurec4a-2052250.log,4224,2023-03-14 10:36:27,7.1386111111111115,128,7.008333333333334,
/work/mh1126/m300872/eureca_icon/EUREC4A/run/logs/les_eurec4a-1956846.log,864,2023-03-14 10:36:26,0.011111111111111112,128,None,
/work/mh1126/m300872/eureca_icon/EUREC4A/run/logs/10392265-les+4k.log,18632628,2024-05-21 17:20:01,7.148888888888889,440,6.081666666666667,
/work/mh1126/m300872/eureca_icon/EUREC4A/run/logs/10420821-les+4k.log,1296,2024-05-24 09:25:56,2.725,440,None,
/work/mh1126/m300872/eureca_icon/EUREC4A/run/logs/les_eurec4a-1970922.log,304,2023-03-14 10:36:27,0.04583333333333333,24,None,
/work/mh1126/m300872/eureca_icon/EUREC4A/run/logs/10369691-les+4k.log,892,2024-05-18 17:47:26,1.4744444444444444,280,None,
/work/mh1126/m300872/eureca_icon/EUREC4A/run/logs/10417135-les+4k.log,1300,2024-05-23 09:58:57,1.1819444444444445,440,None,
/work/mh1126/m300872/eureca_icon/EUREC4A/run/logs/les_4k-adiabat-2854002.log,6896,2023-03-14 10:36:20,0.23527777777777778,120,None,
/work/mh1126/m300872/eureca_icon/EUREC4A/run/logs/les+4k-9551857.log,380448,2024-03-26 20:29:09,8.005277777777778,120,1.8583333333333334,
/work/mh1126/m300872/eureca_icon/EUREC4A/run/logs/13869692-les+4k_DOM01.log,1999716,2024-11-20 05:10:04,4.813055555555556,120,7.008333333333334,
/work/mh1126/m300872/eureca_icon/EUREC4A/run/logs/les_test2-9178345.log,2619408,2024-03-06 16:16:57,4.844444444444444,120,7.008333333333334,
/work/mh1126/m300872/eureca_icon/EUREC4A/run/logs/les_rerun-5658280.log,6048,2023-06-20 15:25:15,0.006388888888888889,120,None,
/work/mh1126/m300872/eureca_icon/EUREC4A/run/logs/DEVtest-7938996.log,648,2023-12-04 17:14:14,0.006111111111111111,30,None,
/work/mh1126/m300872/eureca_icon/EUREC4A/run/logs/10417671-les+4k.log,7825600,2024-05-23 13:27:07,3.399722222222222,440,2.4983333333333335,
/work/mh1126/m300872/eureca_icon/EUREC4A/run/logs/les_test2-9527917.log,5492,2024-03-25 12:17:07,0.005555555555555556,120,None,
/work/mh1126/m300872/eureca_icon/EUREC4A/run/logs/10433553-les+4k.log,1296,2024-05-26 05:06:08,8.006944444444445,440,None,
/work/mh1126/m300872/eureca_icon/EUREC4A/run/logs/les_test2-9402024.log,1718576,2024-03-20 04:50:56,2.504722222222222,120,3.4983333333333335,
/work/mh1126/m300872/eureca_icon/EUREC4A/run/logs/les_test2-8056825.log,7501672,2023-12-13 19:16:28,2.533333333333333,240,7.008333333333334,
/work/mh1126/m300872/eureca_icon/EUREC4A/run/logs/13934547-les+4k_DOM01.log,7122088,2024-11-23 08:54:42,4.688055555555556,120,7.008333333333334,
/work/mh1126/m300872/eureca_icon/EUREC4A/run/logs/les_rerun-5633475.log,6429780,2023-06-18 17:15:31,4.001944444444445,120,5.711666666666667,
/work/mh1126/m300872/eureca_icon/EUREC4A/run/logs/les_eurec4a-1960689.log,140,2023-03-14 10:36:26,0.0019444444444444444,1,None,
/work/mh1126/m300872/eureca_icon/EUREC4A/run/logs/les_rerun-5614552.log,6604,2023-06-16 19:36:47,2.7358333333333333,120,3.9983333333333335,
/work/mh1126/m300872/eureca_icon/EUREC4A/run/logs/rs_test-5129947.log,144,2023-05-11 16:12:34,0.0033333333333333335,30,None,
/work/mh1126/m300872/eureca_icon/EUREC4A/run/logs/les_rerun-4562442.log,2964,2023-04-04 09:35:59,2.6191666666666666,120,3.9983333333333335,
/work/mh1126/m300872/eureca_icon/EUREC4A/run/logs/les_test2-9281831.log,1449052,2024-03-13 18:10:46,4.959722222222222,120,7.008333333333334,
/work/mh1126/m300872/eureca_icon/EUREC4A/run/logs/10412996-les+4k.log,1296,2024-05-23 05:44:47,8.001666666666667,440,None,
/work/mh1126/m300872/eureca_icon/EUREC4A/run/logs/les_rerun-5506978.log,464,2023-06-06 13:16:40,0.006388888888888889,120,None,
/work/mh1126/m300872/eureca_icon/EUREC4A/run/logs/DEVtest-7939314.log,484,2023-12-04 17:54:01,0.006111111111111111,8,None,
/work/mh1126/m300872/eureca_icon/EUREC4A/run/logs/jul_numu-2282053.log,912,2023-03-14 10:36:20,0.24222222222222223,128,None,
/work/mh1126/m300872/eureca_icon/EUREC4A/run/logs/les_rerun-5586648.log,1060,2023-06-14 14:04:21,0.4752777777777778,120,1.435,
/work/mh1126/m300872/eureca_icon/EUREC4A/run/logs/les_test2-9427879.log,540,2024-03-21 16:37:23,0.2561111111111111,120,0.0,
/work/mh1126/m300872/eureca_icon/EUREC4A/run/logs/les_test2-8133331.log,2006580,2023-12-19 20:06:54,4.725833333333333,120,7.008333333333334,
/work/mh1126/m300872/eureca_icon/EUREC4A/run/logs/les_eurec4a-2130943.log,140,2023-03-14 10:36:27,0.002777777777777778,128,None,
/work/mh1126/m300872/eureca_icon/EUREC4A/run/logs/9817379-les+4k.log,5492,2024-04-12 16:48:04,0.005555555555555556,120,None,
/work/mh1126/m300872/eureca_icon/EUREC4A/run/logs/DEVtest-7939807.log,484,2023-12-04 18:45:57,0.0033333333333333335,8,None,
/work/mh1126/m300872/eureca_icon/EUREC4A/run/logs/les_rerun-4239589.log,1620,2023-03-14 18:33:32,0.6680555555555555,120,0.265,
/work/mh1126/m300872/eureca_icon/EUREC4A/run/logs/9668978-les+4k.log,816,2024-04-03 23:44:05,8.004722222222222,256,None,
/work/mh1126/m300872/eureca_icon/EUREC4A/run/logs/les_eurec4a-2119420.log,6724,2023-03-14 10:36:27,0.008333333333333333,128,None,
/work/mh1126/m300872/eureca_icon/EUREC4A/run/logs/les_rerun-6239587.log,31451896,2023-07-28 00:40:22,3.8133333333333335,120,3.9983333333333335,
/work/mh1126/m300872/eureca_icon/EUREC4A/run/logs/les_4k-adiabat-3636980.log,860,2023-03-14 10:36:24,0.31777777777777777,120,None,
/work/mh1126/m300872/eureca_icon/EUREC4A/run/logs/les_rerun-5586325.log,1112,2023-06-14 13:57:22,0.505,120,1.565,
/work/mh1126/m300872/eureca_icon/EUREC4A/run/logs/les_eurec4a-1960775.log,136,2023-03-14 10:36:26,0.0016666666666666668,1,None,
/work/mh1126/m300872/eureca_icon/EUREC4A/run/logs/les_rerun-5625350.log,480,2023-06-17 13:25:17,0.0525,120,None,
/work/mh1126/m300872/eureca_icon/EUREC4A/run/logs/les_eurec4a-1956964.log,876,2023-03-14 10:36:26,0.04861111111111111,128,None,
/work/mh1126/m300872/eureca_icon/EUREC4A/run/logs/10185439-les+4k.log,2410172,2024-05-06 22:08:04,8.003055555555555,120,6.96,
/work/mh1126/m300872/eureca_icon/EUREC4A/run/logs/les_4k-adiabat-3639722.log,860,2023-03-14 10:36:24,0.2613888888888889,120,None,
/work/mh1126/m300872/eureca_icon/EUREC4A/run/logs/les_rerun-4743161.log,1656,2023-04-15 07:07:03,8.005555555555556,120,2.2933333333333334,
/work/mh1126/m300872/eureca_icon/EUREC4A/run/logs/rEUREC4A-2286228.log,36,2023-03-14 10:36:27,0.0011111111111111111,128,None,
/work/mh1126/m300872/eureca_icon/EUREC4A/run/logs/les_rerun-4562452.log,2964,2023-04-04 10:09:57,2.623611111111111,120,3.9983333333333335,
/work/mh1126/m300872/eureca_icon/EUREC4A/run/logs/les_4k-adiabat-2852509.log,828,2023-03-14 10:36:20,0.034722222222222224,12,None,
/work/mh1126/m300872/eureca_icon/EUREC4A/run/logs/les_test2-9206246.log,790240,2024-03-07 23:51:10,4.8308333333333335,120,7.008333333333334,
/work/mh1126/m300872/eureca_icon/EUREC4A/run/logs/les_eurec4a-1996202.log,248,2023-03-14 10:36:27,0.0033333333333333335,12,None,
/work/mh1126/m300872/eureca_icon/EUREC4A/run/logs/13740758-les+4k_12h.log,423208,2024-11-06 16:14:32,4.405833333333334,240,2.026666666666667,
/work/mh1126/m300872/eureca_icon/EUREC4A/run/logs/les_rerun-5504829.log,464,2023-06-06 09:52:47,0.008611111111111111,120,None,
/work/mh1126/m300872/eureca_icon/EUREC4A/run/logs/les_rerun-5844575.log,1451876,2023-07-03 06:50:39,8.002222222222223,120,1.8383333333333334,
/work/mh1126/m300872/eureca_icon/EUREC4A/run/logs/rs_test-5150033.log,144,2023-05-12 13:00:02,0.0022222222222222222,30,None,
/work/mh1126/m300872/eureca_icon/EUREC4A/run/logs/les_test2-8150488.log,21254984,2023-12-21 10:39:22,5.659166666666667,120,7.008333333333334,
/work/mh1126/m300872/eureca_icon/EUREC4A/run/logs/les_test2-9198662.log,354996,2024-03-07 16:43:36,4.610277777777778,120,7.008333333333334,
/work/mh1126/m300872/eureca_icon/EUREC4A/run/logs/les_4k-adiabat-3114772.log,801672,2023-03-14 10:36:24,2.7047222222222222,120,3.9983333333333335,
/work/mh1126/m300872/eureca_icon/EUREC4A/run/logs/les_rerun-5681734.log,524,2023-06-21 15:43:20,0.2752777777777778,120,None,
/work/mh1126/m300872/eureca_icon/EUREC4A/run/logs/les_4k-adiabat-2905673.log,64,2023-03-14 10:36:20,0.0011111111111111111,120,None,
/work/mh1126/m300872/eureca_icon/EUREC4A/run/logs/9593731-les+4k.log,11540,2024-03-28 19:21:21,0.0077777777777777776,256,None,
/work/mh1126/m300872/eureca_icon/EUREC4A/run/logs/jul_numu-2285782.log,36,2023-03-14 10:36:20,0.0008333333333333334,128,None,
/work/mh1126/m300872/eureca_icon/EUREC4A/run/logs/les_eurec4a-1971957.log,200,2023-03-14 10:36:27,0.07805555555555556,6,None,
/work/mh1126/m300872/eureca_icon/EUREC4A/run/logs/DEVtest-7939093.log,180,2023-12-04 17:25:56,0.005833333333333334,8,None,
/work/mh1126/m300872/eureca_icon/EUREC4A/run/logs/10330434-les+4k.log,4403724,2024-05-16 05:27:01,8.0025,240,3.745,
/work/mh1126/m300872/eureca_icon/EUREC4A/run/logs/les_4k-adiabat-2905769.log,72,2023-03-14 10:36:20,0.001388888888888889,120,None,
/work/mh1126/m300872/eureca_icon/EUREC4A/run/logs/les_rerun-5835298.log,1451912,2023-07-02 08:17:16,8.000555555555556,120,1.9433333333333334,
/work/mh1126/m300872/eureca_icon/EUREC4A/run/logs/les_test2-8150487.log,13771892,2023-12-21 02:14:48,5.203611111111111,120,7.008333333333334,
/work/mh1126/m300872/eureca_icon/EUREC4A/run/logs/les_rerun-4927042.log,6444,2023-05-01 00:49:54,0.009166666666666667,120,None,
/work/mh1126/m300872/eureca_icon/EUREC4A/run/logs/les_rerun-5614480.log,5192,2023-06-16 19:18:57,2.7352777777777777,120,3.9983333333333335,
/work/mh1126/m300872/eureca_icon/EUREC4A/run/logs/les_4k-adiabat-2904871.log,7672,2023-03-14 10:36:20,0.007222222222222222,120,None,
/work/mh1126/m300872/eureca_icon/EUREC4A/run/logs/les_test2-9266410.log,10865584,2024-03-12 18:01:33,5.138333333333334,120,7.008333333333334,
/work/mh1126/m300872/eureca_icon/EUREC4A/run/logs/les_rerun-6548813.log,17007724,2023-08-18 18:52:48,8.007777777777777,150,2.245,
/work/mh1126/m300872/eureca_icon/EUREC4A/run/logs/13923638-les+4k_DOM01.log,13471584,2024-11-23 04:09:21,5.1497222222222225,120,7.008333333333334,
/work/mh1126/m300872/eureca_icon/EUREC4A/run/logs/13955293-les+4k_DOM01.log,13773368,2024-11-28 23:31:48,4.955277777777778,120,7.008333333333334,
/work/mh1126/m300872/eureca_icon/EUREC4A/run/logs/les_test2-8140181.log,13260648,2023-12-20 11:21:41,5.081944444444445,120,7.008333333333334,
/work/mh1126/m300872/eureca_icon/EUREC4A/run/logs/les_eurec4a-1994946.log,1124,2023-03-14 10:36:27,0.5052777777777778,128,0.46,
/work/mh1126/m300872/eureca_icon/EUREC4A/run/logs/13902187-les+4k_DOM01.log,14001328,2024-11-21 11:38:39,4.9366666666666665,120,7.008333333333334,
/work/mh1126/m300872/eureca_icon/EUREC4A/run/logs/10406066-les+4k.log,1300,2024-05-22 14:55:22,1.2544444444444445,440,None,
/work/mh1126/m300872/eureca_icon/EUREC4A/run/logs/les_rerun-4030116.log,1704,2023-03-14 10:36:27,0.5161111111111111,120,0.265,
/work/mh1126/m300872/eureca_icon/EUREC4A/run/logs/9691619-les+4k.log,11540,2024-04-05 03:02:12,0.009166666666666667,256,None,
/work/mh1126/m300872/eureca_icon/EUREC4A/run/logs/jul_numu-2285934.log,36,2023-03-14 10:36:20,0.0008333333333333334,12,None,
/work/mh1126/m300872/eureca_icon/EUREC4A/run/logs/les_rerun-4266189.log,1624,2023-03-16 13:31:19,0.3972222222222222,120,0.265,
/work/mh1126/m300872/eureca_icon/EUREC4A/run/logs/jule_numu-2271546.log,144,2023-03-14 10:36:20,0.008888888888888889,12,None,
/work/mh1126/m300872/eureca_icon/EUREC4A/run/logs/les_rerun-4279795.log,1624,2023-03-17 14:58:35,0.5772222222222222,120,0.265,
/work/mh1126/m300872/eureca_icon/EUREC4A/run/logs/les_rerun-5826477.log,1298236,2023-07-01 11:47:55,8.000555555555556,120,1.8316666666666668,
/work/mh1126/m300872/eureca_icon/EUREC4A/run/logs/les_test-7962538.log,3038992,2023-12-06 02:52:56,1.3175,50,0.665,
/work/mh1126/m300872/eureca_icon/EUREC4A/run/logs/les_4k-adiabat-3369126.log,140,2023-03-14 10:36:24,0.006666666666666667,120,None,
/work/mh1126/m300872/eureca_icon/EUREC4A/run/logs/les_rerun-4165817.log,144,2023-03-09 11:24:25,0.0025,120,None,
/work/mh1126/m300872/eureca_icon/EUREC4A/run/logs/les_rerun-4150986.log,144,2023-03-08 14:15:56,0.0025,120,None,
/work/mh1126/m300872/eureca_icon/EUREC4A/run/logs/les_rerun-7937665.log,548,2023-12-04 16:25:02,0.009722222222222222,150,None,
/work/mh1126/m300872/eureca_icon/EUREC4A/run/logs/les_rerun-5719638.log,1451908,2023-06-23 20:37:59,8.000833333333333,120,1.9383333333333332,
/work/mh1126/m300872/eureca_icon/EUREC4A/run/logs/les_4k-adiabat-2853536.log,6896,2023-03-14 10:36:20,0.3211111111111111,120,None,
/work/mh1126/m300872/eureca_icon/EUREC4A/run/logs/les_rerun-4254816.log,1624,2023-03-15 21:06:41,0.5013888888888889,120,0.265,
/work/mh1126/m300872/eureca_icon/EUREC4A/run/logs/DEVtest-7939025.log,648,2023-12-04 17:18:54,0.01861111111111111,30,None,
/work/mh1126/m300872/eureca_icon/EUREC4A/run/logs/jule_numu-2271626.log,140,2023-03-14 10:36:20,0.01,12,None,
/work/mh1126/m300872/eureca_icon/EUREC4A/run/logs/les_rerun-5658383.log,7108,2023-06-20 15:34:00,0.006666666666666667,120,None,
/work/mh1126/m300872/eureca_icon/EUREC4A/run/logs/les_eurec4a-1960767.log,136,2023-03-14 10:36:26,0.0016666666666666668,1,None,
/work/mh1126/m300872/eureca_icon/EUREC4A/run/logs/les_eurec4a-2131112.log,7344,2023-03-14 10:36:27,0.21611111111111111,128,None,
/work/mh1126/m300872/eureca_icon/EUREC4A/run/logs/les_4k-adiabat-2905391.log,64,2023-03-14 10:36:20,0.0011111111111111111,120,None,
/work/mh1126/m300872/eureca_icon/EUREC4A/run/logs/les_rerun-3791382.log,3204,2023-03-14 10:36:27,8.001944444444444,120,5.975,
/work/mh1126/m300872/eureca_icon/EUREC4A/run/logs/10183518-les+4k.log,5488,2024-05-06 11:45:03,0.0038888888888888888,120,None,
/work/mh1126/m300872/eureca_icon/EUREC4A/run/logs/10319110-les+4k.log,22928,2024-05-15 09:22:42,0.015,512,None,
/work/mh1126/m300872/eureca_icon/EUREC4A/run/logs/les_4k-adiabat-2905809.log,72,2023-03-14 10:36:20,0.0011111111111111111,120,None,
/work/mh1126/m300872/eureca_icon/EUREC4A/run/logs/les_rerun-5678420.log,6616,2023-06-21 11:52:43,0.008333333333333333,120,None,
/work/mh1126/m300872/eureca_icon/EUREC4A/run/logs/les_test2-8189622.log,26643052,2023-12-23 06:54:21,4.778333333333333,120,5.9383333333333335,
/work/mh1126/m300872/eureca_icon/EUREC4A/run/logs/les_eurec4a-2120110.log,7348,2023-03-14 10:36:27,0.23916666666666667,128,None,
/work/mh1126/m300872/eureca_icon/EUREC4A/run/logs/les_4k-adiabat-2905450.log,72,2023-03-14 10:36:20,0.0011111111111111111,120,None,
/work/mh1126/m300872/eureca_icon/EUREC4A/run/logs/10369390-les+4k.log,896,2024-05-18 16:17:35,0.8088888888888889,290,None,
/work/mh1126/m300872/eureca_icon/EUREC4A/run/logs/les_rerun-5507041.log,508,2023-06-06 13:43:49,0.19194444444444445,120,None,
/work/mh1126/m300872/eureca_icon/EUREC4A/run/logs/9806743-les+4k.log,1534748,2024-04-11 22:45:50,4.007777777777778,120,5.905,
/work/mh1126/m300872/eureca_icon/EUREC4A/run/logs/les_eurec4a-1960761.log,140,2023-03-14 10:36:26,0.001388888888888889,1,None,
/work/mh1126/m300872/eureca_icon/EUREC4A/run/logs/les_DOM01-13814512.log,7272000,2024-11-15 16:25:57,4.793055555555555,120,7.008333333333334,
/work/mh1126/m300872/eureca_icon/EUREC4A/run/logs/les_eurec4a-1973077.log,200,2023-03-14 10:36:27,0.06472222222222222,6,None,
/work/mh1126/m300872/eureca_icon/EUREC4A/run/logs/les_test2-9372458.log,2034248,2024-03-18 12:11:22,4.641111111111111,120,7.008333333333334,
/work/mh1126/m300872/eureca_icon/EUREC4A/run/logs/13938532-les+4k_DOM01.log,14450920,2024-11-23 20:24:35,5.060555555555555,120,7.008333333333334,
/work/mh1126/m300872/eureca_icon/EUREC4A/run/logs/les_rerun-5504922.log,464,2023-06-06 10:10:38,0.01138888888888889,120,None,
/work/mh1126/m300872/eureca_icon/EUREC4A/run/logs/10351330-les+4k.log,1008,2024-05-18 06:57:00,8.0,330,None,
/work/mh1126/m300872/eureca_icon/EUREC4A/run/logs/10386115-les+4k.log,7162632,2024-05-20 22:50:32,8.004722222222222,280,4.351666666666667,
/work/mh1126/m300872/eureca_icon/EUREC4A/run/logs/les_eurec4a-1994810.log,880,2023-03-14 10:36:27,0.17083333333333334,128,None,
/work/mh1126/m300872/eureca_icon/EUREC4A/run/logs/DEVtest-7939081.log,180,2023-12-04 17:24:24,0.003611111111111111,8,None,
/work/mh1126/m300872/eureca_icon/EUREC4A/run/logs/les_test2-9157819.log,7660744,2024-03-05 14:20:56,4.775833333333333,120,7.008333333333334,
/work/mh1126/m300872/eureca_icon/EUREC4A/run/logs/les_4k-adiabat-3652904.log,1270892,2023-03-14 10:36:26,7.949722222222222,120,7.008333333333334,
/work/mh1126/m300872/eureca_icon/EUREC4A/run/logs/les_rerun-4881843.log,3324,2023-04-24 03:25:02,8.0025,120,6.941666666666666,
/work/mh1126/m300872/eureca_icon/EUREC4A/run/logs/les_rerun-4284537.log,1944,2023-03-18 02:00:03,2.004722222222222,120,3.0483333333333333,
/work/mh1126/m300872/eureca_icon/EUREC4A/run/logs/les_rerun-5658680.log,6052,2023-06-20 16:04:08,0.006666666666666667,120,None,
/work/mh1126/m300872/eureca_icon/EUREC4A/run/logs/les_4k-adiabat-2853187.log,868,2023-03-14 10:36:20,0.22305555555555556,120,None,
/work/mh1126/m300872/eureca_icon/EUREC4A/run/logs/les_test-7989658.log,2682700,2023-12-07 17:35:27,1.1405555555555555,60,0.665,
/work/mh1126/m300872/eureca_icon/EUREC4A/run/logs/les_4k-adiabat-2852667.log,828,2023-03-14 10:36:20,0.03361111111111111,12,None,
/work/mh1126/m300872/eureca_icon/EUREC4A/run/logs/13942180-les+4k_DOM01.log,7884560,2024-11-24 12:30:09,5.066388888888889,120,7.008333333333334,
/work/mh1126/m300872/eureca_icon/EUREC4A/run/logs/13946073-les+4k_DOM01.log,2405692,2024-11-25 08:09:31,4.671388888888889,120,7.008333333333334,
/work/mh1126/m300872/eureca_icon/EUREC4A/run/logs/les_test2-8041739.log,2460052,2023-12-12 17:36:51,2.2,240,7.008333333333334,
/work/mh1126/m300872/eureca_icon/EUREC4A/run/logs/10222281-les+4k.log,5584,2024-05-10 00:11:12,0.2361111111111111,120,None,
/work/mh1126/m300872/eureca_icon/EUREC4A/run/logs/DEVtest-7938907.log,1436,2023-12-04 17:04:28,0.005833333333333334,30,None,
/work/mh1126/m300872/eureca_icon/EUREC4A/run/logs/10252865-les+4k.log,758340,2024-05-10 20:20:24,8.00611111111111,120,2.7616666666666667,
/work/mh1126/m300872/eureca_icon/EUREC4A/run/logs/les_test2-9222000.log,2844336,2024-03-09 00:16:30,4.930833333333333,120,7.008333333333334,
/work/mh1126/m300872/eureca_icon/EUREC4A/run/logs/les_rerun-5504706.log,10124,2023-06-06 11:03:25,1.5941666666666667,120,2.506666666666667,
/work/mh1126/m300872/eureca_icon/EUREC4A/run/logs/les_rerun-4267878.log,1624,2023-03-16 14:11:05,0.4036111111111111,120,0.265,
/work/mh1126/m300872/eureca_icon/EUREC4A/run/logs/13782089-les+4k_DOM01.log,5883368,2024-11-09 02:05:16,8.006388888888889,120,1.8333333333333333,
/work/mh1126/m300872/eureca_icon/EUREC4A/run/logs/les_rerun-5124944.log,144,2023-05-12 00:48:02,0.0033333333333333335,120,None,
/work/mh1126/m300872/eureca_icon/EUREC4A/run/logs/les_test2-8179084.log,21992904,2023-12-23 00:02:58,5.215277777777778,120,7.008333333333334,
/work/mh1126/m300872/eureca_icon/EUREC4A/run/logs/rs_test-5151171.log,1696,2023-05-12 13:41:19,0.0044444444444444444,30,None,
/work/mh1126/m300872/eureca_icon/EUREC4A/run/logs/les_test2-9366854.log,444768,2024-03-18 06:17:11,4.961388888888889,120,7.008333333333334,
/work/mh1126/m300872/eureca_icon/EUREC4A/run/logs/les_4k-adiabat-2854424.log,6896,2023-03-14 10:36:20,0.22944444444444445,120,None,
/work/mh1126/m300872/eureca_icon/EUREC4A/run/logs/les_rerun-5633458.log,5496,2023-06-18 13:12:55,0.007222222222222222,120,None,
/work/mh1126/m300872/eureca_icon/EUREC4A/run/logs/les_test-7782572.log,5352,2023-11-22 12:39:53,0.009166666666666667,120,None,
/work/mh1126/m300872/eureca_icon/EUREC4A/run/logs/les_eurec4a-1970550.log,140,2023-03-14 10:36:27,0.04694444444444444,24,None,
/work/mh1126/m300872/eureca_icon/EUREC4A/run/logs/les_rerun-4743125.log,2948,2023-04-14 21:09:37,2.743611111111111,120,3.9983333333333335,
/work/mh1126/m300872/eureca_icon/EUREC4A/run/logs/les_4k-adiabat-3586394.log,144,2023-03-14 10:36:24,0.0016666666666666668,120,None,
/work/mh1126/m300872/eureca_icon/EUREC4A/run/logs/les_rerun-5191119.log,144,2023-05-17 04:09:14,0.003611111111111111,120,None,
/work/mh1126/m300872/eureca_icon/EUREC4A/run/logs/les_test2-8189619.log,16671260,2023-12-23 06:20:55,4.402222222222222,120,5.9383333333333335,
/work/mh1126/m300872/eureca_icon/EUREC4A/run/logs/les_test2-8166134.log,30004800,2023-12-22 06:20:50,6.0247222222222225,120,7.008333333333334,
/work/mh1126/m300872/eureca_icon/EUREC4A/run/logs/10402237-les+4k.log,1484,2024-05-22 13:39:25,1.4533333333333334,512,None,
/work/mh1126/m300872/eureca_icon/EUREC4A/run/logs/10183653-les+4k.log,5340,2024-05-06 13:00:27,0.0038888888888888888,120,None,
/work/mh1126/m300872/eureca_icon/EUREC4A/run/logs/13762403-les+4k_12h.log,5600,2024-11-07 17:38:23,0.23944444444444443,120,None,
/work/mh1126/m300872/eureca_icon/EUREC4A/run/logs/les+4k-9531753.log,407232,2024-03-25 23:15:29,8.008055555555556,120,1.8416666666666666,
/work/mh1126/m300872/eureca_icon/EUREC4A/run/logs/13764216-les+4k_12h.log,5600,2024-11-07 19:15:30,0.2225,120,None,
/work/mh1126/m300872/eureca_icon/EUREC4A/run/logs/9850727-les+4k.log,2072144,2024-04-15 16:07:06,4.006944444444445,120,5.778333333333333,
/work/mh1126/m300872/eureca_icon/EUREC4A/run/logs/9867995-les+4k.log,234872,2024-04-16 15:13:50,4.003888888888889,120,0.9233333333333333,
/work/mh1126/m300872/eureca_icon/EUREC4A/run/logs/13905387-les+4k_DOM01.log,9389312,2024-11-22 04:30:06,5.005277777777778,120,7.008333333333334,
/work/mh1126/m300872/eureca_icon/EUREC4A/run/logs/les_test2-8131186.log,772,2023-12-19 15:20:33,1.4325,240,None,
/work/mh1126/m300872/eureca_icon/EUREC4A/run/logs/les_rerun-5537558.log,2644,2023-06-09 13:38:53,0.9369444444444445,120,3.9983333333333335,
/work/mh1126/m300872/eureca_icon/EUREC4A/run/logs/les_rerun-4150207.log,144,2023-03-08 13:29:47,0.0025,120,None,
/work/mh1126/m300872/eureca_icon/EUREC4A/run/logs/9572882-les+4k.log,507668,2024-03-27 20:53:57,8.007777777777777,256,4.11,
/work/mh1126/m300872/eureca_icon/EUREC4A/run/logs/jul_numu-2281635.log,236,2023-03-14 10:36:20,0.05333333333333334,12,None,
/work/mh1126/m300872/eureca_icon/EUREC4A/run/logs/les_rerun-5625209.log,464,2023-06-17 12:48:21,0.006388888888888889,120,None,
/work/mh1126/m300872/eureca_icon/EUREC4A/run/logs/les_rerun-4043668.log,840,2023-03-14 10:36:27,None,120,None,
/work/mh1126/m300872/eureca_icon/EUREC4A/run/logs/10371509-les+4k.log,868,2024-05-19 03:29:54,8.004444444444445,280,None,
/work/mh1126/m300872/eureca_icon/EUREC4A/run/logs/les_test2-9115360.log,13707732,2024-03-01 22:24:49,5.223888888888889,120,7.008333333333334,
/work/mh1126/m300872/eureca_icon/EUREC4A/run/logs/DEVtest-7939058.log,648,2023-12-04 17:23:07,0.022222222222222223,8,None,
/work/mh1126/m300872/eureca_icon/EUREC4A/run/logs/les_eurec4a-1999892.log,1128,2023-03-14 10:36:27,0.5077777777777778,128,0.475,
/work/mh1126/m300872/eureca_icon/EUREC4A/run/logs/les_rerun-5839907.log,1451880,2023-07-02 21:19:37,8.008055555555556,120,1.85,
/work/mh1126/m300872/eureca_icon/EUREC4A/run/logs/les_eurec4a-1963582.log,772,2023-03-14 10:36:26,0.03861111111111111,12,None,
/work/mh1126/m300872/eureca_icon/EUREC4A/run/logs/les_rerun-5658335.log,6984,2023-06-20 15:29:55,0.006944444444444444,120,None,
/work/mh1126/m300872/eureca_icon/EUREC4A/run/logs/les_test-7994390.log,115496,2023-12-07 20:34:06,1.363611111111111,60,0.9983333333333333,
/work/mh1126/m300872/eureca_icon/EUREC4A/run/logs/13852473-les+4k_DOM01.log,12466716,2024-11-19 05:15:05,4.964166666666666,120,7.008333333333334,
/work/mh1126/m300872/eureca_icon/EUREC4A/run/logs/les_eurec4a-1969156.log,308,2023-03-14 10:36:26,0.06416666666666666,24,None,
/work/mh1126/m300872/eureca_icon/EUREC4A/run/logs/les_test-7847069.log,496,2023-11-27 12:49:05,0.17305555555555555,120,None,
/work/mh1126/m300872/eureca_icon/EUREC4A/run/logs/les_rerun-5681237.log,5404,2023-06-21 15:02:43,0.2788888888888889,120,None,
/work/mh1126/m300872/eureca_icon/EUREC4A/run/logs/les_eurec4a-1957312.log,896,2023-03-14 10:36:26,0.2061111111111111,128,None,
/work/mh1126/m300872/eureca_icon/EUREC4A/run/logs/les_eurec4a-1971905.log,140,2023-03-14 10:36:27,0.0019444444444444444,24,None,
/work/mh1126/m300872/eureca_icon/EUREC4A/run/logs/13886049-les+4k_DOM01.log,9741016,2024-11-21 01:48:26,4.905833333333334,120,7.008333333333334,
/work/mh1126/m300872/eureca_icon/EUREC4A/run/logs/les_test2-8140178.log,7881188,2023-12-20 05:36:05,4.825555555555556,120,7.008333333333334,
/work/mh1126/m300872/eureca_icon/EUREC4A/run/logs/les_test-7849200.log,15742240,2023-11-27 16:38:31,2.001388888888889,120,2.0,
/work/mh1126/m300872/eureca_icon/EUREC4A/run/logs/jule_numu-2271676.log,832,2023-03-14 10:36:20,0.03916666666666667,12,None,
/work/mh1126/m300872/eureca_icon/EUREC4A/run/logs/les_rerun-5625275.log,2644,2023-06-17 16:59:24,4.001111111111111,120,6.02,
/work/mh1126/m300872/eureca_icon/EUREC4A/run/logs/9855417-les+4k.log,1201928,2024-04-15 21:06:13,4.006111111111111,120,3.02,
/work/mh1126/m300872/eureca_icon/EUREC4A/run/logs/les_rerun-5658211.log,5496,2023-06-20 15:17:19,0.0075,120,None,
/work/mh1126/m300872/eureca_icon/EUREC4A/run/logs/les_rerun-4150108.log,144,2023-03-08 13:12:18,0.0022222222222222222,120,None,
/work/mh1126/m300872/eureca_icon/EUREC4A/run/logs/10247710-les+4k.log,2410256,2024-05-10 08:13:59,8.004722222222222,120,6.953333333333333,
/work/mh1126/m300872/eureca_icon/EUREC4A/run/logs/les_eurec4a-1963498.log,140,2023-03-14 10:36:26,0.0025,128,None,
/work/mh1126/m300872/eureca_icon/EUREC4A/run/logs/jul_numu-2280504.log,820,2023-03-14 10:36:20,0.03861111111111111,12,None,
/work/mh1126/m300872/eureca_icon/EUREC4A/run/logs/rEUREC4A-2286246.log,36,2023-03-14 10:36:27,0.001388888888888889,128,None,
/work/mh1126/m300872/eureca_icon/EUREC4A/run/logs/les_4k-adiabat-2907971.log,803364,2023-03-14 10:36:22,2.6944444444444446,120,3.9983333333333335,
/work/mh1126/m300872/eureca_icon/EUREC4A/run/logs/rEUREC4A-2286265.log,36,2023-03-14 10:36:27,0.0008333333333333334,128,None,
/work/mh1126/m300872/eureca_icon/EUREC4A/run/logs/les_4k-adiabat-2904984.log,7668,2023-03-14 10:36:20,0.006388888888888889,120,None,
/work/mh1126/m300872/eureca_icon/EUREC4A/run/logs/les_4k-adiabat-2904421.log,6896,2023-03-14 10:36:20,0.24833333333333332,120,None,
/work/mh1126/m300872/eureca_icon/EUREC4A/run/logs/les_test2-8179086.log,32039556,2023-12-23 01:18:35,6.44,120,7.008333333333334,
/work/mh1126/m300872/eureca_icon/EUREC4A/run/logs/les_rerun-4891214.log,144,2023-04-26 23:29:18,0.0019444444444444444,120,None,
/work/mh1126/m300872/eureca_icon/EUREC4A/run/logs/10370662-les+4k.log,892,2024-05-18 19:27:29,1.548888888888889,280,None,
/work/mh1126/m300872/eureca_icon/EUREC4A/run/logs/10202020-les+4k.log,768,2024-05-07 16:24:44,2.7533333333333334,240,None,
/work/mh1126/m300872/eureca_icon/EUREC4A/run/logs/les_rerun-6601306.log,4270292,2023-08-23 03:33:28,2.180277777777778,120,2.5183333333333335,
/work/mh1126/m300872/eureca_icon/EUREC4A/run/logs/les_rerun-6601978.log,33306472,2023-08-23 11:36:21,8.00611111111111,120,6.331666666666667,
/work/mh1126/m300872/eureca_icon/EUREC4A/run/logs/les_eurec4a-2134115.log,7348,2023-03-14 10:36:27,0.2563888888888889,128,None,
/work/mh1126/m300872/eureca_icon/EUREC4A/run/logs/les_rerun-5701383.log,1349908,2023-06-22 23:42:20,8.00361111111111,120,1.85,
/work/mh1126/m300872/eureca_icon/EUREC4A/run/logs/les_eurec4a-2019728.log,1128,2023-03-14 10:36:27,0.5044444444444445,128,0.5183333333333333,
/work/mh1126/m300872/eureca_icon/EUREC4A/run/logs/les_rerun-4148109.log,1700,2023-03-08 11:42:38,0.5472222222222223,120,0.265,
