name;alt 1;alt 2;alt 3;alt 4
[*]Möglichkeit;Möglichkeit;(.*)möglichkeit;;
[*]Wahrscheinlichkeit;Wahrscheinlichkeit;(.*)wahrscheinlichkeit;;
[dar]aus schließen;schließen + APPR[aus];schließen + daraus;;
[er]hoffen;hoffen;erhoffen;;
hin|deuten;deuten;hindeuten;;
/Meinung/ nach;Meinung + nach;Ansicht + nach;Auffassung + nach;
/nicht/ mit Gewissheit;PTKNEG[.*] + mit + Gewissheit;;;
/nicht/ sicher/mit Sicherheit;PTKNEG[.*] + mit + Sicherheit;PTKNEG[.*] + sicher;;
/nicht/ auf|klären;PTKNEG[.*] + aufklären;PTKNEG[.*] + klären ;;
/nicht/ aus|schließen;PTKNEG[.*] + schließen + PTKVZ[aus];PTKNEG[.*] + ausschließen;;
/nicht/ ausgeschloßen;PTKNEG[.*] + ausgeschloßen;;;
/nicht/ bekannt;PTKNEG[.*] + bekannt;;;
/nicht/ eindeutig;PTKNEG[.*] + eindeutig;;;
/nicht/ erforscht;PTKNEG[.*] + erforscht;;;
/nicht/ erwiesen ;PTKNEG[.*] + erwiesen ;;;
/nicht/ [auf|]geklärt;PTKNEG[.*] + geklärt;PTKNEG[.*] + aufgeklärt;;
/nicht/ klar;PTKNEG[.*] + klar;;;
[da]von aus|gehen;ausgehen + von;ausgehen + davon;gehen + davon + PTKVZ[aus];gehen + von + PTKVZ[aus]
ab|leiten;ableiten;leiten + PTKVZ[ab];;
abgeleitet;abgeleitet;;;
an|nehmen;annehmen;nehmen + PTKVZ[an];;
andeutend;andeutend;;;
angeblich;angeblich;;;
Annahme;Annahme;;;
anscheinend;anscheinend;;;
Anzeichen;Anzeichen;;;
argumentieren;argumentieren;;;
Auffassung;Auffassung;;;
begünstigen;begünstigen;;;
berücksichtigen;berücksichtigen;;;
bestärken;bestärken;;;
Betracht ziehen;zeihen|ziehen + Betracht;;;
betrachten;betrachten;;;
bevorzugt;bevorzugt;;;
denkbar;denkbar;;;
denken;denken;;;
dürfen;dürfen;;;
entweder;entweder;;;
erwarten;erwarten;;;
eventuell;eventuell;;;
folgern;folgern;;;
Folgerung;Folgerung;;;
Frage stellen/adressieren/mit befassen;Frage + adressieren;Frage + stellen;APPR[mit] + Frage + befassen;
fragen;fragen;;;
sprechen für;sprechen + für;;;
gegebenenfalls;gegebenenfalls;;;
geschätzt;geschätzt;;;
glauben;glauben;;;
glaubwürdig;glaubwürdig;;;
hergeleitet;hergeleitet;;;
hindeutend;hindeutend;;;
Hinweis;Hinweis;;;
hin|weisen;hinweisen;weisen + PTKVZ[hin];;
höchstwahrscheinlich;höchstwahrscheinlich;;;
Hypothese;Hypothese;;;
hypothetisch;hypothetisch;;;
Idee;Idee;;;
implizieren;implizieren;;;
Indiz;Indiz;;;
inwiefern;inwiefern;;;
inwieweit;inwieweit;;;
kein Beweis;keine + Beweis;;;
kein Nachweis;keine + Nachweis;;;
kein Beleg;keine + Beleg;;;
keine Garantie;keine + Garantie;;;
keine Sicherheit;keine + Sicherheit;;;
{könnten};{könnte};{könnten};;
meinen;meinen;;;
möglich;möglich;;;
möglicherweise;möglicherweise;;;
{müssten};{müsste};{müssten};;
mutmaßlich;mutmaßlich;;;
nahe|liegen;liegen + PTKVZ[nahe];naheliegen;;
noch [auf|]klären;noch + aufklären;klären + noch + PTKVZ[auf];noch + klären;
noch bestimmen;noch + bestimmen;;;
noch heraus|stellen;noch + herausstellen;stellen + noch + heraus;;
ob;ob;;;
oder;oder;;;
plausibel;plausibel;;;
postulieren;postulieren;;;
Potential;Potential;;;
potentiell;potentiell;;;
Prognose;Prognose;;;
prognostizieren;prognostizieren;;;
prüfen;prüfen;;;
schätzen;schätzen;;;
scheinbar;scheinbar;;;
scheinen;scheinen;erscheinen;;
schlussfolgern;schlussfolgern;;;
Schlussfolgerung;Schlussfolgerung;;;
{sollten};{sollte};{sollten};;
Spekulation;Spekulation;;;
spekulieren;spekulieren;;;
stützen;stützen;;;
tendenziell;tendenziell;;;
tendieren;tendieren;;;
testen;testen;;;
Theorie;Theorie;;;
These;These;;;
überlegen;überlegen;;;
überprüfen;überprüfen;;;
überzeugend;überzeugend;;;
um zu belegen;um + PTKZU[zu] + belegen;;;
um zu bestätigen;um + PTKZU[zu] + bestätigen;;;
unbekannt;unbekannt;;;
unbelegt;unbelegt;;;
unbestimmt;unbestimmt;;;
unbewiesen;unbewiesen;;;
und/oder;und/oder;;;
ungeklärt;ungeklärt;;;
unklar;unklar;;;
unsicher;unsicher;;;
ungewiss;ungewiss;;;
untermauern;untermauern;;;
unterstreichen;unterstreichen;;;
unterstützen;unterstützen;;;
Unterstützung /geben/;Unterstützung + geben;Unterstützung + bieten;;
untersuchen;untersuchen;;;
unwahrscheinlich;unwahrscheinlich;;;
vermuten;vermuten;;;
vermutet;vermutet;;;
vermutlich;vermutlich;;;
Vermutung;Vermutung;;;
versuchen;versuchen;;;
vielleicht;vielleicht;;;
vor|schlagen;vorschlagen;schlagen + PTKVZ[vor] ;;
vor|stellen;vorstellen;stellen + PTKVZ[vor];;
vorgeschlagen;vorgeschlagen;;;
vorher|sagen;vorhersagen;sagen + PTKVZ[vorher];;
Vorhersage;Vorhersage;;;
vorrangig;vorrangig;;;
Vorschlag;Vorschlag;;;
vorstellbar;vorstellbar;;;
Vorstellung;Vorstellung;;;
vorzugsweise;vorzugsweise;;;
wahrscheinlich;wahrscheinlich;;;
wenn /nicht/;wenn + PTKNEG[.*];;;
womöglich;womöglich;;;
{würden};{würde};{würden};;
zusammen|passen;zusammenpassen;passen + PTKVZ[zusammen];;
Zweifel;Zweifel;;;