================================================================================
JobID = 4734711
User = bzkurs43, Account = bzkurs43
Partition = grete:shared, Nodelist = ggpu127
================================================================================
Submitting job with sbatch from directory: /home/bzkurs43/nlp-project
Home directory: /home/bzkurs43
Working directory: /home/bzkurs43/nlp-project
Current node: ggpu127
Python 3.8.16
Collecting environment information...
PyTorch version: 1.9.0+cu111
Is debug build: False
CUDA used to build PyTorch: 11.1
ROCM used to build PyTorch: N/A

OS: Rocky Linux 8.7 (Green Obsidian) (x86_64)
GCC version: (GCC) 8.5.0 20210514 (Red Hat 8.5.0-16)
Clang version: Could not collect
CMake version: version 3.20.2
Libc version: glibc-2.28

Python version: 3.8 (64-bit runtime)
Python platform: Linux-4.18.0-425.19.2.el8_7.x86_64-x86_64-with-glibc2.17
Is CUDA available: True
CUDA runtime version: 12.0.140
GPU models and configuration: 
GPU 0: NVIDIA A100-SXM4-40GB
GPU 1: NVIDIA A100-SXM4-40GB
GPU 2: NVIDIA A100-SXM4-40GB
GPU 3: NVIDIA A100-SXM4-40GB

Nvidia driver version: 530.30.02
cuDNN version: Could not collect
HIP runtime version: N/A
MIOpen runtime version: N/A

Versions of relevant libraries:
[pip3] numpy==1.24.3
[pip3] torch==1.9.0+cu111
[pip3] torchaudio==0.8.0a0+a751e1d
[pip3] torchvision==0.9.0
[conda] blas                      1.0                         mkl  
[conda] cudatoolkit               10.1.243             h6bb024c_0  
[conda] ffmpeg                    4.3                  hf484d3e_0    pytorch
[conda] mkl                       2023.1.0         h6d00ec8_46342  
[conda] mkl-service               2.4.0            py38h5eee18b_1  
[conda] mkl_fft                   1.3.6            py38h417a72b_1  
[conda] mkl_random                1.2.2            py38h417a72b_1  
[conda] numpy                     1.24.3           py38hf6e8229_1  
[conda] numpy-base                1.24.3           py38h060ed82_1  
[conda] torch                     1.9.0+cu111              pypi_0    pypi
[conda] torchaudio                0.8.0                      py38    pytorch
[conda] torchvision               0.9.0                py38_cu101    pytorch
nvcc: NVIDIA (R) Cuda compiler driver
Copyright (c) 2005-2023 NVIDIA Corporation
Built on Fri_Jan__6_16:45:21_PST_2023
Cuda compilation tools, release 12.0, V12.0.140
Build cuda_12.0.r12.0/compiler.32267302_0
Training Sentiment Classifier on SST...
load 8544 data from data/ids-sst-train.csv
load 1101 data from data/ids-sst-dev.csv
save the model to sst-classifier.pt
Epoch 0: train loss :: 1.251, train acc :: 0.617, dev acc :: 0.501
Epoch 1: train loss :: 0.912, train acc :: 0.703, dev acc :: 0.491
Epoch 2: train loss :: 0.626, train acc :: 0.836, dev acc :: 0.488
save the model to sst-classifier.pt
Epoch 3: train loss :: 0.407, train acc :: 0.919, dev acc :: 0.507
Epoch 4: train loss :: 0.252, train acc :: 0.958, dev acc :: 0.500
save the model to sst-classifier.pt
Epoch 5: train loss :: 0.152, train acc :: 0.982, dev acc :: 0.516
Epoch 6: train loss :: 0.121, train acc :: 0.988, dev acc :: 0.502
Epoch 7: train loss :: 0.085, train acc :: 0.979, dev acc :: 0.469
Epoch 8: train loss :: 0.093, train acc :: 0.986, dev acc :: 0.495
Epoch 9: train loss :: 0.068, train acc :: 0.990, dev acc :: 0.486
Evaluating on SST...
load model from sst-classifier.pt
load 1101 data from data/ids-sst-dev.csv
DONE DEV
DONE Test
dev acc :: 0.516
============ Job Information ===================================================
Submitted: 2023-07-02T16:55:03
Started: 2023-07-02T16:55:21
Ended: 2023-07-02T17:07:00
Elapsed: 12 min, Limit: 630 min, Difference: 618 min
CPUs: 4, Nodes: 1
Estimated NPL: ================================================================================
