{
	"name": "poetry3-poetry-pyenv",
	"build": {
		"dockerfile": "Dockerfile"
	},
	"runArgs": [
		"--env-file",
		".devcontainer/profile.env"
	],
	// 👇 Features to add to the Dev Container. More info: https://containers.dev/implementors/features.
	// "features": {},
	// 👇 Use 'forwardPorts' to make a list of ports inside the container available locally.
	// "forwardPorts": [],
	// 👇 Use 'postCreateCommand' to run commands after the container is created.
	"postCreateCommand": "poetry install",
	// 👇 Configure tool-specific properties.
	"customizations": {
		"vscode": {
			"extensions": [
				"ms-python.python",
				"njpwerner.autodocstring"
			]
		}
	},
	"features": {
		"ghcr.io/devcontainers-contrib/features/mypy:2": {},
		"ghcr.io/devcontainers-contrib/features/ruff:1": {}
	},
	"mounts": [
		"source=${localEnv:KAFFEEKASSE_DATA_DIR},target=/kfks-data,type=bind,consistency=cached"
	]

	// 👇 Uncomment to connect as root instead. More info: https://aka.ms/dev-containers-non-root.
	// "remoteUser": "root"
}